-0.000137,-0.00017,-0.000246,-3.4e-05,-0.00022,-0.000311,-0.000153,-9.2e-05,-5.5e-05,-0.000231,-0.000206,-0.000174,-7.8e-05,-0.000212,-0.000158,-3e-05,-5.7e-05,-0.000187,-0.000249,-0.000161,-0.000264,-7.8e-05,-0.000167,-0.000123,-0.000147,-0.000133,-0.000261,-0.000166,-0.000189,-0.000476,-0.000263,-0.000253,4.1e-05,-0.000244,-0.000211,-0.000104,-0.000114,-0.00018,-0.000208,-0.000128,-0.000266,-7.6e-05,-0.000131,-0.00011,-0.000147,-0.00017,-9.7e-05,-0.000183,-0.000176,-0.000222,-0.000158,-0.00034,-0.000263,-0.000438,-0.000204,-1.6e-05,-4.2e-05,-8.7e-05,-0.000334,-0.000259,-6.1e-05,-0.000128,-1.7e-05,-6.7e-05,-0.000147,-0.000118,-0.000124,-9.8e-05,-0.000108,-0.000188,7.5e-05,-3e-05,-0.000165,-0.000192,-9.2e-05,-0.000126,-1.1e-05,-1e-05,-0.000102,-0.000187,-0.000212,-0.000132,-0.000121,-0.000125,-0.000126,-0.000161,-4.2e-05,-0.00016,-8.2e-05,1.2e-05,-1.8e-05,-6.4e-05,-0.000203,-0.000109,-0.000152,-5.9e-05,-0.000138,-0.000105,-0.000216,-0.000115,-0.000176,-0.00011,-8.3e-05,-0.000149,-6.3e-05,-0.000143,-0.000106,-5.4e-05,-8.9e-05,-0.000109,-8.4e-05,8e-06,-9e-05,-0.00018,-8.2e-05,-0.000117,-0.000187,4.3e-05,-0.00014,-7.2e-05,-7.6e-05
-7.8e-05,-0.000177,-1.5e-05,-0.000175,-0.000115,-0.000213,-0.000194,-8.6e-05,-0.000322,-0.000132,-0.000165,-0.000102,-0.000142,-8.7e-05,-0.000101,6.2e-05,-0.00014,-4.2e-05,1.1e-05,7.7e-05,-2.5e-05,-0.000222,-0.000137,-3.7e-05,-1.7e-05,-3.3e-05,-0.000262,-0.000133,-0.000303,-0.000226,-0.000106,-0.000117,-8.4e-05,-0.000107,-0.000133,-3.2e-05,-7.3e-05,-0.000211,-8.5e-05,-5.6e-05,2.3e-05,4.9e-05,-0.000141,-0.000161,-4.1e-05,-6.8e-05,-0.000156,-0.000172,-0.000134,-7e-05,-8.2e-05,-8.8e-05,-0.000243,-9.1e-05,-0.000242,-0.000149,-0.000184,-0.000141,6.3e-05,-5e-06,-0.000148,-0.000154,-3.8e-05,-5.1e-05,-2.2e-05,-0.000135,-3.6e-05,-5.9e-05,-0.00013,-0.000105,-7.3e-05,-0.000204,-5.3e-05,7e-06,-0.000144,-0.000201,-0.000193,-0.000162,-4.2e-05,-5.5e-05,2e-05,-0.000131,-0.00016,-8.1e-05,-6e-06,-0.000165,6e-06,-7.6e-05,-2.1e-05,-0.000198,-0.000113,-1e-05,-3e-06,-8e-06,-8.6e-05,6.3e-05,-6.3e-05,-2.3e-05,-2.6e-05,-9.2e-05,-0.00013,-0.00012,-0.000164,-6.8e-05,-3.2e-05,-9.7e-05,-0.000157,-1.4e-05,-6.6e-05,-9.7e-05,-9.7e-05,-0.000225,-0.000175,-7.2e-05,-3.8e-05,-2.9e-05,-8.2e-05,-2.5e-05,-8.4e-05,-0.000118,1.6e-05
5e-05,1.6e-05,4e-06,3.6e-05,-0.000202,0.000104,-8.8e-05,-8.8e-05,9.6e-05,-7.9e-05,0.000122,5.1e-05,1.9e-05,0.000177,-4e-06,-6.1e-05,-4.5e-05,-0.000138,-0.000185,-0.000173,-0.00011,-9.3e-05,-2.9e-05,-2.3e-05,5.1e-05,-0.000157,3.3e-05,7.1e-05,0.000204,0.000248,7.9e-05,-2.3e-05,-6.8e-05,-5.2e-05,-9e-05,-0.000137,-1e-04,2.6e-05,-2e-05,-0.000103,-0.000207,-0.000172,-0.000103,0.000141,-3.5e-05,4.5e-05,7.2e-05,-0.000125,-6.7e-05,3.4e-05,7.3e-05,3.1e-05,0.000187,0.000102,0.000155,-5.3e-05,4.4e-05,9.5e-05,-0.000142,3.7e-05,-7.2e-05,-8e-05,-0.000136,-0.000126,-1.5e-05,-0.000153,-0.000119,-3.2e-05,4.3e-05,-2.8e-05,-0.000128,-0.000136,-9.8e-05,-2.4e-05,7.4e-05,5.4e-05,-6.1e-05,-0.00012,-4e-05,1.1e-05,-8.3e-05,-6.2e-05,-1.4e-05,-7.1e-05,-0.000109,-2e-05,-4.1e-05,-5.1e-05,-0.000165,-0.000167,-0.000144,-8.9e-05,-7.7e-05,3.5e-05,1e-06,-8.2e-05,-3.5e-05,-0.000132,-0.000106,-1.5e-05,4.4e-05,-2.3e-05,-2.7e-05,-6.8e-05,-8.2e-05,-0.00014,-2.5e-05,-9.4e-05,-0.000182,-0.000296,-9.5e-05,-7.5e-05,-0.00013,-0.000135,-0.000159,-0.000135,-1e-04,-5.4e-05,-0.000192,-5.8e-05,-8.6e-05
-0.000113,-8e-05,1.9e-05,2.3e-05,3.7e-05,-0.000159,-1e-05,-2.9e-05,-5.5e-05,0.000132,-0.000123,-3.2e-05,-9.3e-05,-0.000105,-5.9e-05,4.4e-05,-0.000112,-5.1e-05,-7.8e-05,-6.2e-05,7.4e-05,0,0,-0.000178,-9.8e-05,-1.6e-05,0.000123,1.4e-05,-1.4e-05,-0.000116,-0.000351,-0.000145,-6.1e-05,-1.6e-05,-6e-05,6.7e-05,6.3e-05,5.5e-05,-1e-05,-2.1e-05,4.6e-05,-1.4e-05,5.2e-05,-2.8e-05,-8.2e-05,-8.7e-05,-0.000202,-1e-06,-8.9e-05,-9.3e-05,-0.000175,1.8e-05,-0.000151,-0.000103,-5.5e-05,-8.9e-05,-5.8e-05,1.1e-05,6.3e-05,-5.6e-05,-0.000112,-0.000139,-2e-06,-6e-05,-2.3e-05,7.8e-05,-3.7e-05,-5.6e-05,-4.3e-05,-6.1e-05,-5.6e-05,1e-05,3.3e-05,-7e-06,8.9e-05,-0.000132,-2.5e-05,-1.9e-05,-2.8e-05,-1.3e-05,3.8e-05,-0.000109,-9e-06,-4.8e-05,-0.000125,1.3e-05,-9.3e-05,-2.5e-05,-5e-06,-1.4e-05,3.5e-05,1.8e-05,-8e-06,-6e-05,-9e-06,-5.9e-05,-6.8e-05,3.2e-05,-5.4e-05,-6.5e-05,-5.7e-05,-2.3e-05,-0.000134,6.1e-05,-5.7e-05,-2.1e-05,-9e-05,2e-06,-5.3e-05,4.2e-05,2.1e-05,-5.8e-05,-2.1e-05,2e-06,5e-06,-0.000116,-4e-05,-0.000163,-5.1e-05,6.2e-05,4.8e-05
-4.7e-05,0.000114,0.000103,3.1e-05,2.5e-05,7e-06,6.7e-05,0.000181,0.000126,7.3e-05,0.000107,1.5e-05,5.2e-05,0.000178,8e-06,5e-05,3.4e-05,0.00012,9.4e-05,5.9e-05,8.9e-05,3.5e-05,9.1e-05,5.8e-05,0.00014,6.8e-05,3.7e-05,-8e-06,6.7e-05,9.6e-05,0.000213,0.000218,6.3e-05,1e-05,0.000128,5.8e-05,-2.5e-05,3.7e-05,-4e-06,5.8e-05,4.6e-05,-1e-05,-3e-06,0.000131,0.000137,4e-05,0.000123,3.8e-05,4.2e-05,4e-06,9.7e-05,4.9e-05,1.3e-05,0.000126,0.000164,0.000138,2.8e-05,-2.5e-05,-4.5e-05,3e-05,6.1e-05,0.000161,7.5e-05,7.4e-05,6.7e-05,6.3e-05,7.5e-05,9.9e-05,1.6e-05,0.000167,1.4e-05,0.000162,2.3e-05,1.4e-05,-0.000161,-2.5e-05,-3.2e-05,3e-06,0.000112,6.9e-05,7.9e-05,8.9e-05,5.5e-05,8.6e-05,0.000137,5.3e-05,-2.4e-05,4.2e-05,2.6e-05,0.000147,5.9e-05,8.4e-05,4e-05,2.7e-05,7.8e-05,-2.5e-05,7.3e-05,3.5e-05,6.8e-05,5.5e-05,3.8e-05,5.8e-05,1.9e-05,0.000124,8e-06,0.000123,4.6e-05,3.4e-05,4.6e-05,0.000103,3.6e-05,1e-06,9e-05,0.000106,0.000171,4.8e-05,5.5e-05,-4.2e-05,0.000177,6.9e-05,6.5e-05
5.1e-05,4.1e-05,-8.7e-05,-6.9e-05,4.6e-05,0.000104,2.2e-05,6.4e-05,4.3e-05,-5e-05,-1e-05,9.3e-05,5.4e-05,1.5e-05,0.000108,1.3e-05,3.2e-05,-1.1e-05,-3.6e-05,-2.5e-05,-2.6e-05,4.6e-05,4e-06,1e-05,-6.1e-05,-3.3e-05,-1e-06,8.7e-05,1e-05,3.2e-05,-2e-04,-9.2e-05,4.8e-05,0.000103,2.7e-05,4e-05,-6e-06,6e-05,0.000109,3.9e-05,-5e-05,8.4e-05,4.7e-05,-4.3e-05,-3.6e-05,8.4e-05,0.000151,1.7e-05,5.1e-05,4e-06,7e-06,-2.4e-05,7e-05,-9.9e-05,-7.4e-05,1.2e-05,1.3e-05,6.6e-05,-1.6e-05,3e-05,-3.4e-05,7.3e-05,2.7e-05,7.9e-05,4.3e-05,2.1e-05,2.2e-05,-2.9e-05,-5.3e-05,-8.2e-05,0,-3.9e-05,-1.8e-05,1.3e-05,2.8e-05,5.7e-05,1e-06,6.6e-05,4.7e-05,4.7e-05,3e-06,5.7e-05,-7.6e-05,-3.4e-05,-6e-06,-6.8e-05,5e-05,1.8e-05,2.9e-05,3e-05,0.000107,4.6e-05,-2.5e-05,-2.4e-05,-5e-06,4e-06,-4.2e-05,8e-06,5.8e-05,1.1e-05,2.6e-05,-3.1e-05,8.8e-05,-3.9e-05,1e-06,-4e-06,-1.6e-05,2.3e-05,2.7e-05,1.5e-05,-1.6e-05,-1.3e-05,1e-04,4.4e-05,6e-06,5e-06,1.7e-05,8.9e-05,-3.5e-05,7e-06,-1.4e-05
-2.3e-05,-0.000127,-2.6e-05,2.4e-05,-3.2e-05,5.5e-05,-2.8e-05,-7.1e-05,2.7e-05,4.8e-05,-7e-06,-4.2e-05,-5.6e-05,-7.5e-05,-2.8e-05,-5.2e-05,5.9e-05,-7.7e-05,3.9e-05,5.6e-05,-1.4e-05,3.5e-05,-1e-04,3e-05,1.2e-05,4.9e-05,-7.2e-05,-0.00015,-9.3e-05,-0.000123,6.7e-05,3.9e-05,2e-06,-9e-06,-5.5e-05,-1.5e-05,-3.4e-05,2e-05,-6e-05,-7.7e-05,-2.2e-05,-1.3e-05,6.1e-05,-3.8e-05,-1.2e-05,-2.7e-05,-5.8e-05,1e-06,-7e-06,2.8e-05,-4e-05,4.8e-05,-6.4e-05,-5e-06,-9e-06,-8.7e-05,-7.1e-05,-5.4e-05,4.7e-05,-1.7e-05,-5e-06,-4.8e-05,-7.7e-05,3.2e-05,-4.7e-05,-4.5e-05,-4e-05,1.4e-05,3.3e-05,4.4e-05,3.4e-05,-5.5e-05,4.3e-05,-6.3e-05,-5.1e-05,-2.4e-05,0.000103,-4.5e-05,-7.4e-05,-9.1e-05,-4.5e-05,-4.1e-05,3.1e-05,-2.8e-05,4.3e-05,2.2e-05,5.7e-05,6e-05,-5.7e-05,2.7e-05,-6.6e-05,-1.9e-05,-6.5e-05,6e-06,-5e-05,-6e-06,-1.6e-05,2e-06,4e-06,-2.4e-05,-6.7e-05,-5.8e-05,-1.3e-05,-1.5e-05,-5.8e-05,-3.3e-05,2.9e-05,-3.4e-05,4.8e-05,-8.2e-05,-3.6e-05,-9e-06,-0.000106,-4e-05,-8e-05,1.6e-05,-6.4e-05,-8.6e-05,-1.4e-05,-6.1e-05,-7e-05
2.3e-05,3.9e-05,2e-05,-6.2e-05,-8.1e-05,6e-06,4e-06,-3.9e-05,-3.4e-05,-5.5e-05,-7.5e-05,-6.8e-05,-5.3e-05,1.3e-05,-2e-05,-3.4e-05,-8e-06,-2.1e-05,-3.9e-05,-0.00012,-9.7e-05,-7.3e-05,3.3e-05,1e-05,-3.6e-05,-1e-05,2e-05,6e-06,5.3e-05,7.3e-05,1.2e-05,-1e-06,-9.6e-05,-7.5e-05,-4.7e-05,-4.1e-05,-2e-06,-6.1e-05,-4.5e-05,-2e-05,-1.3e-05,-6.5e-05,-6e-05,-3.5e-05,-0.000106,-2e-06,1.9e-05,-6.6e-05,-4.1e-05,-9.7e-05,-3e-06,-0.000121,-0.000105,9.3e-05,-2.6e-05,4e-05,-1e-06,1.3e-05,-4.1e-05,-5.1e-05,-3e-06,-1.1e-05,-3e-05,-2e-06,-5.5e-05,-1e-06,-2.4e-05,-2.2e-05,-2.5e-05,-2e-06,-6.4e-05,-4.3e-05,-3.4e-05,7e-06,1.8e-05,2.2e-05,-0.000126,-6.7e-05,-5.1e-05,2e-06,1.1e-05,-2.7e-05,-6.1e-05,-4.4e-05,-5.5e-05,-4.6e-05,-5.3e-05,-4.2e-05,-2e-06,-9e-05,-9.6e-05,-5.1e-05,1.1e-05,-2e-06,4e-06,-1.9e-05,-2.4e-05,-3.5e-05,-2.7e-05,1.6e-05,-4e-05,1.7e-05,-1.3e-05,2e-06,-4.2e-05,-7e-05,-3.3e-05,-2.6e-05,-5.6e-05,8e-06,-2e-05,1.7e-05,9e-06,-4.2e-05,-8e-06,-6e-05,-1.3e-05,-1e-05,-6.4e-05,-5.8e-05,-7.5e-05
-3.2e-05,-3e-05,5e-06,2.2e-05,6.3e-05,-3.3e-05,-6.4e-05,-4.2e-05,-1.1e-05,6e-06,3.9e-05,4.7e-05,1.5e-05,-5.4e-05,2.4e-05,1.2e-05,3.1e-05,-1.2e-05,9e-06,-6e-06,6.3e-05,2.5e-05,1e-06,-2.5e-05,3e-06,1.1e-05,2e-06,-1.3e-05,-3e-05,-3.4e-05,-7.3e-05,-3.1e-05,5e-05,2e-06,4.4e-05,2e-06,1.6e-05,-1.5e-05,2.9e-05,1.6e-05,1.7e-05,2e-06,1.1e-05,3.8e-05,1.8e-05,-4e-06,-2.4e-05,4.5e-05,1.8e-05,5.4e-05,-1e-05,4.3e-05,2.9e-05,-7.6e-05,-1.2e-05,2.7e-05,3e-06,6e-05,1.6e-05,1.3e-05,-2.2e-05,-7.1e-05,-1.8e-05,-4.7e-05,2.4e-05,-0.000101,2e-06,-3.7e-05,1.3e-05,3.6e-05,-3.1e-05,2.9e-05,4e-06,-1.6e-05,-1.6e-05,5e-06,1.2e-05,2.9e-05,-2.1e-05,0,-4e-05,1.6e-05,6e-06,5.4e-05,-1.9e-05,9.5e-05,9e-06,-3.5e-05,2.9e-05,-3e-06,4.5e-05,-1.2e-05,-4e-06,-4.9e-05,-3.5e-05,-1.8e-05,-1e-05,5.9e-05,-3.9e-05,-6e-06,-7e-06,-5.1e-05,4e-06,-3.1e-05,2.2e-05,2.4e-05,-2.7e-05,4e-06,3.4e-05,3.6e-05,1e-05,-8.5e-05,-3.8e-05,-2e-06,1.9e-05,8e-06,-9e-06,-3.6e-05,-2.8e-05,3.7e-05,2.6e-05
-2.5e-05,1.1e-05,4.9e-05,1e-06,-2.9e-05,-1.3e-05,4.5e-05,2.2e-05,3.7e-05,5e-05,2.2e-05,-9e-06,-5.3e-05,7e-06,-1.6e-05,0,1.4e-05,-4e-06,3.8e-05,1.9e-05,-3.4e-05,2.9e-05,2.9e-05,4.1e-05,1.8e-05,3.7e-05,6e-06,7.1e-05,-5.5e-05,-1.5e-05,1.6e-05,2.6e-05,-6e-06,1.2e-05,-5e-06,-1.7e-05,-8e-06,1e-05,1.4e-05,3.7e-05,2.6e-05,-2.9e-05,-1e-05,2e-06,1e-06,7.3e-05,4e-05,2.1e-05,3.1e-05,-6e-06,1.4e-05,1.5e-05,2.2e-05,5.1e-05,5.6e-05,7e-06,2.7e-05,-1.3e-05,2e-06,6e-06,1.6e-05,6e-05,-2e-06,6.8e-05,1.9e-05,8.5e-05,2e-06,-5e-06,2e-06,-1.3e-05,2.8e-05,-3e-05,5e-06,-8e-06,-2.2e-05,-6e-06,-3e-06,4e-06,1.6e-05,2.9e-05,2e-06,1.5e-05,6.6e-05,2e-06,1.1e-05,9e-06,1.1e-05,1.2e-05,1.1e-05,-2.3e-05,1.5e-05,2.4e-05,8e-06,-2.3e-05,2e-05,2e-06,1.4e-05,-3e-06,1.1e-05,1.8e-05,1.3e-05,4.8e-05,4.5e-05,6.2e-05,3.8e-05,-1.2e-05,3e-05,1.5e-05,2.9e-05,2.7e-05,1e-06,5e-05,-1.1e-05,1.3e-05,1e-05,6.7e-05,3.6e-05,3e-05,-3e-06,1.6e-05,7e-06
-1e-06,2.5e-05,-1.7e-05,-1.2e-05,-2.1e-05,3.6e-05,4.8e-05,-1e-06,4.5e-05,6e-06,-3.9e-05,3.2e-05,1.2e-05,3e-06,1.6e-05,-2.2e-05,6.8e-05,2.9e-05,-2.4e-05,1.2e-05,4.5e-05,1e-06,-2.3e-05,2.1e-05,2.5e-05,-1.8e-05,1.4e-05,-2.4e-05,4.1e-05,-1e-05,2.1e-05,-3.2e-05,-2.8e-05,1.4e-05,6.6e-05,2.5e-05,-1.4e-05,4e-06,1e-06,-3.5e-05,-2.5e-05,7e-06,1.5e-05,2.1e-05,-1.3e-05,-3.6e-05,7e-06,-4.7e-05,-1.4e-05,-2.1e-05,-1.6e-05,-2e-06,-2.9e-05,3e-06,-1.5e-05,5.4e-05,9e-06,4e-06,-1.3e-05,1.7e-05,2.3e-05,-1.5e-05,2.8e-05,5.7e-05,3.6e-05,-5.6e-05,2.2e-05,7e-06,2e-06,2.4e-05,2.2e-05,3.2e-05,5.4e-05,5.6e-05,7e-06,1.2e-05,-1.1e-05,1.4e-05,3.9e-05,-2.1e-05,2.5e-05,4.9e-05,-2.3e-05,1e-06,6e-06,-1e-06,2.2e-05,1.5e-05,-9e-06,9e-06,4e-06,2.6e-05,1.2e-05,3.3e-05,4e-05,1.3e-05,9e-06,-1e-05,-1e-06,2e-06,-1e-05,3e-06,0,-2.1e-05,-1.8e-05,-7e-06,3.8e-05,1.8e-05,0,1.7e-05,-1.6e-05,3.7e-05,-1.5e-05,4.1e-05,1.7e-05,-2.7e-05,2.4e-05,2.9e-05,1.1e-05,1.3e-05,-4e-06
-3e-06,1.4e-05,-8e-06,-5e-06,-1.9e-05,3.4e-05,2e-06,-4.4e-05,-3.1e-05,-2e-06,7e-06,-2.3e-05,2.3e-05,-2e-06,-5.2e-05,3.1e-05,-1.9e-05,4.3e-05,2.8e-05,4e-06,-5.2e-05,-3e-05,2.9e-05,4e-06,8e-06,-6e-06,-2e-06,1e-06,-3.1e-05,-1.2e-05,-5e-05,1.4e-05,2.4e-05,-1.8e-05,-2.1e-05,-2.1e-05,-8e-06,0,1e-06,4.6e-05,-1.4e-05,-2.4e-05,-2.2e-05,1.9e-05,-1.3e-05,5e-06,-1e-05,4.6e-05,5e-06,3.6e-05,-2e-06,-9e-06,7e-06,-6e-06,-1.9e-05,-3.3e-05,-5.8e-05,-5.7e-05,5e-06,4.9e-05,1e-06,-2.5e-05,-2e-05,-6.1e-05,-3e-06,-3.6e-05,-2.2e-05,-1.5e-05,-1.4e-05,-3e-06,-5e-06,1e-05,5e-06,-2e-05,0,1.7e-05,2.9e-05,6e-06,-4.2e-05,-1.2e-05,-5.2e-05,-3.5e-05,1e-05,4e-06,-5e-06,4e-06,-9e-06,-1.8e-05,3e-06,-1.1e-05,1.3e-05,0,7e-06,2e-06,-7e-06,-3e-06,-5e-06,1e-05,-3e-06,8e-06,7e-06,-4e-06,-1e-05,-1.8e-05,-1.5e-05,1.3e-05,-4e-06,-1e-06,-1.8e-05,-2.3e-05,-4e-06,-2.7e-05,5e-06,-5.1e-05,-3e-06,4.9e-05,0,-1e-06,-1.5e-05,-1.7e-05,-1e-06
-6e-06,-3e-06,-8e-06,-2.3e-05,1.1e-05,-4.6e-05,-2.5e-05,4e-05,-2.2e-05,1.3e-05,1.1e-05,-1.4e-05,-4.7e-05,-3.1e-05,-1.1e-05,-2.8e-05,-2e-06,4e-06,5e-06,-2e-05,1e-06,0,-2.8e-05,5e-06,-5e-06,-1.3e-05,1.7e-05,-9e-06,-2.1e-05,0,3.8e-05,-2.4e-05,-3.6e-05,1.6e-05,-1.3e-05,-2e-06,-5e-06,-3e-06,-7e-06,-2.7e-05,9e-06,-1.9e-05,-4e-06,-9e-06,-1e-05,-1.4e-05,8e-06,-3.2e-05,-1.2e-05,-1e-05,-3.1e-05,-1.9e-05,-1.9e-05,-4e-06,4e-06,2.5e-05,9e-06,-1.4e-05,-1.4e-05,-5.3e-05,-2.4e-05,2.4e-05,-1.5e-05,-2.8e-05,6e-06,0,1.3e-05,0,-1.7e-05,-1.2e-05,-2.1e-05,-2.6e-05,-1.2e-05,-2e-05,1.1e-05,-5e-06,-1.1e-05,-1e-05,-8e-06,-2.1e-05,8e-06,1.2e-05,-2.4e-05,-2.7e-05,-1.1e-05,-4.3e-05,-2.6e-05,1e-05,6e-06,-7e-06,-7e-06,-2.7e-05,-1.9e-05,0,-5e-06,-2e-06,1e-05,-9e-06,0,-2.1e-05,0,1.3e-05,0,-4e-06,0,-1.6e-05,-3e-05,0,2.8e-05,-1e-06,-2e-06,-2.6e-05,-5e-06,7e-06,-1.9e-05,-1.5e-05,-9e-06,-1.4e-05,1e-05,-9e-06,-1e-06
-4e-06,7e-06,-3e-06,1.6e-05,-1.3e-05,1e-06,-1.1e-05,5e-06,-1.9e-05,4e-06,-1.5e-05,-1e-06,-3e-06,2.5e-05,4e-06,-1.2e-05,-5e-06,-3e-06,-1e-05,2e-06,1.2e-05,7e-06,1.1e-05,0,-2.8e-05,4e-06,-1.8e-05,2e-06,2.8e-05,-1e-05,-3.3e-05,2.8e-05,1e-05,-1.4e-05,-2e-06,4e-06,4e-06,-4e-06,-7e-06,7e-06,-7e-06,1e-05,-1e-05,-1e-05,-4e-06,-3.2e-05,-1.1e-05,-1.4e-05,-5e-06,-1.1e-05,-6e-06,9e-06,4e-06,3.3e-05,-2e-06,-3.1e-05,-1.1e-05,6e-06,2e-06,2.8e-05,5e-06,1.2e-05,-9e-06,-6e-06,5e-06,-8e-06,-1.3e-05,6e-06,-3e-06,9e-06,-3e-06,2e-05,3e-06,-8e-06,-3e-06,1.6e-05,-2e-06,-7e-06,1.7e-05,1.2e-05,7e-06,6e-06,0,-3e-06,2e-06,1.9e-05,-8e-06,4e-06,-2.8e-05,3e-06,1e-06,0,2e-06,-8e-06,-7e-06,-1e-06,8e-06,-2e-06,-5e-06,-3e-06,3e-06,3e-06,-6e-06,3e-06,2e-06,1.3e-05,-4e-06,-1.3e-05,-2.1e-05,-1.3e-05,-4e-06,-1.3e-05,2e-06,-1.9e-05,-7e-06,1e-05,3e-06,-6e-06,-8e-06,-9e-06,-1.3e-05
-7e-06,-1e-06,-1.2e-05,-5e-06,2e-06,5e-06,1e-06,-2.7e-05,6e-06,-4e-06,0,1.3e-05,-3e-06,-7e-06,-5e-06,8e-06,0,1.9e-05,-6e-06,9e-06,0,-2e-06,5e-06,3e-06,-6e-06,6e-06,5e-06,-3e-06,6e-06,-1.3e-05,1.4e-05,-2.1e-05,-1e-05,2e-06,1e-05,-6e-06,2e-06,-5e-06,4e-06,2.4e-05,-1e-06,-4e-06,5e-06,-1.2e-05,7e-06,5e-06,1.7e-05,2e-05,5e-06,-9e-06,0,5e-06,-1.6e-05,-2.3e-05,-1.5e-05,3.2e-05,1e-06,1.4e-05,9e-06,5e-06,-5e-06,-1.8e-05,-1e-05,0,-1e-05,1.6e-05,3e-06,-2e-06,4e-06,2e-06,3e-06,-2e-06,-2e-06,1.1e-05,-2e-06,2e-06,1e-05,5e-06,-6e-06,0,-5e-06,1e-06,1e-06,3e-06,7e-06,-2e-06,1e-05,4e-06,1.2e-05,1.1e-05,-1.7e-05,2e-06,-7e-06,1.1e-05,1e-05,0,3e-06,-7e-06,6e-06,-1e-06,-1.1e-05,-1e-06,-2e-06,-3e-06,-7e-06,1.1e-05,-1.2e-05,4e-06,7e-06,3e-06,-5e-06,1.4e-05,0,-6e-06,5e-06,-1e-06,1e-06,-1e-06,1.9e-05,-1.5e-05,1.4e-05
1e-06,-2e-06,1.2e-05,-6e-06,1.8e-05,1.6e-05,3e-06,3.2e-05,2e-06,3e-06,3e-06,-2e-06,3e-06,-1e-06,1e-05,-1.5e-05,-1.7e-05,4e-06,4e-06,-6e-06,1.1e-05,1e-06,-8e-06,-1e-06,-3e-06,8e-06,-1e-06,-1.9e-05,-7e-06,2e-06,1.6e-05,1.9e-05,-1.2e-05,0,-1e-05,4e-06,-6e-06,-6e-06,4e-06,1e-06,1.3e-05,-3e-06,-7e-06,-3e-06,-1e-05,-1.5e-05,-3e-06,-1.5e-05,-7e-06,4e-06,0,-9e-06,1e-06,3e-06,8e-06,-2.2e-05,-1.2e-05,9e-06,-8e-06,-1e-06,4e-06,1.1e-05,-4e-06,-2e-06,4e-06,7e-06,1e-06,1e-06,6e-06,-8e-06,-1.1e-05,-4e-06,1e-06,-2e-06,-1.1e-05,-2e-06,4e-06,-1e-05,-1.5e-05,1.5e-05,-8e-06,-2e-06,-7e-06,2e-06,5e-06,6e-06,0,-7e-06,3e-06,-2e-06,-4e-06,0,4e-06,3e-06,7e-06,4e-06,7e-06,2e-06,3e-06,-1e-06,-2e-06,2e-06,-4e-06,5e-06,5e-06,-5e-06,0,1e-06,-6e-06,-3e-06,2e-06,4e-06,3e-06,-7e-06,-1e-06,8e-06,-3e-06,-7e-06,7e-06,1e-05,-2e-06
-1e-06,5e-06,1e-06,1e-06,-1e-05,-1.8e-05,7e-06,2e-06,-1.1e-05,-2e-06,-2e-06,-5e-06,-7e-06,1e-06,-2e-06,2e-06,0,-1e-06,-1e-06,0,2e-06,0,2e-06,-5e-06,6e-06,-1e-06,-4e-06,1.3e-05,-4e-06,-2e-06,0,-1.1e-05,1.1e-05,-1e-06,-2e-06,1.1e-05,1e-06,-5e-06,4e-06,7e-06,-3e-06,0,-5e-06,4e-06,-1e-06,1e-06,-6e-06,2e-06,7e-06,-3e-06,-5e-06,0,-2e-06,7e-06,1e-06,3e-06,4e-06,-5e-06,6e-06,-1.7e-05,0,7e-06,-1e-06,-9e-06,-4e-06,-1e-06,-1e-06,-1e-06,-1e-06,-5e-06,-5e-06,0,-1e-05,-3e-06,-6e-06,-2e-06,5e-06,3e-06,7e-06,0,8e-06,3e-06,-7e-06,2e-06,-4e-06,7e-06,-1e-06,-1e-06,2e-06,-1e-06,1e-05,2e-06,3e-06,2e-06,0,2e-06,-5e-06,3e-06,-8e-06,2e-06,2e-06,4e-06,-1e-06,2e-06,6e-06,-5e-06,-8e-06,-4e-06,0,-5e-06,2e-06,-2e-06,-2e-06,1e-06,0,-2e-06,-4e-06,4e-06,-1e-05,9e-06,-1e-06
-5e-06,6e-06,2e-06,-4e-06,2e-06,-3e-06,-6e-06,-2.1e-05,1e-06,3e-06,-3e-06,2e-06,-1e-06,3e-06,1e-05,-3e-06,-1.1e-05,4e-06,1e-06,1e-06,-5e-06,2e-06,3e-06,-1e-06,-9e-06,1e-06,-2e-06,4e-06,3e-06,-3e-06,-2.9e-05,9e-06,-5e-06,9e-06,1.3e-05,-5e-06,-2e-06,5e-06,-5e-06,-2e-06,-1e-06,-1e-06,4e-06,1e-06,-1e-06,-2e-06,-2e-06,4e-06,4e-06,-4e-06,4e-06,-1e-06,1e-06,-5e-06,-2e-06,1e-06,0,0,-4e-06,1.6e-05,-3e-06,-1.1e-05,5e-06,6e-06,-2e-06,-1.3e-05,-2e-06,-1e-06,1e-06,0,4e-06,1e-06,-1e-06,1e-06,6e-06,6e-06,-1e-06,0,5e-06,3e-06,-7e-06,-4e-06,4e-06,-1e-06,1e-06,-8e-06,0,0,-4e-06,0,-9e-06,7e-06,3e-06,-1.1e-05,-1e-06,-6e-06,2e-06,-3e-06,-5e-06,2e-06,-1e-05,-3e-06,1e-06,1e-06,-1e-06,4e-06,4e-06,2e-06,5e-06,4e-06,0,-5e-06,-5e-06,4e-06,3e-06,9e-06,5e-06,-2e-06,-1e-06,1e-06,5e-06
1e-06,-2e-06,1e-06,-3e-06,2e-06,0,2e-06,-3e-06,5e-06,-5e-06,0,4e-06,2e-06,-1e-06,-4e-06,1e-06,3e-06,2e-06,-3e-06,-3e-06,6e-06,4e-06,1e-06,1e-06,9e-06,-4e-06,1e-06,-3e-06,-2e-06,5e-06,1.9e-05,-1.1e-05,-2e-06,-7e-06,-1e-06,-4e-06,0,5e-06,1e-06,7e-06,3e-06,0,-5e-06,6e-06,-4e-06,8e-06,-3e-06,-8e-06,0,-1e-06,-1e-06,4e-06,-3e-06,-1e-06,1e-06,-1e-05,-5e-06,-5e-06,-1e-06,0,2e-06,4e-06,1e-06,9e-06,3e-06,1e-05,1e-06,0,-1e-06,1e-06,2e-06,-3e-06,2e-06,-5e-06,3e-06,1e-06,-5e-06,3e-06,-7e-06,-1e-06,1e-06,2e-06,-1e-06,1e-06,0,-3e-06,6e-06,0,2e-06,-3e-06,3e-06,0,-2e-06,7e-06,-3e-06,1e-06,-2e-06,0,4e-06,3e-06,-1e-06,3e-06,-3e-06,6e-06,-4e-06,0,1e-06,-1e-06,-6e-06,-1e-06,0,7e-06,-2e-06,4e-06,0,-9e-06,-5e-06,3e-06,3e-06,4e-06,-8e-06
0,2e-06,-3e-06,1e-06,-1e-06,1e-05,-4e-06,8e-06,-2e-06,0,7e-06,-3e-06,-8e-06,2e-06,2e-06,4e-06,-6e-06,0,0,3e-06,-1.1e-05,0,-6e-06,-3e-06,-4e-06,-1e-06,4e-06,-4e-06,3e-06,1e-06,-3e-06,1e-05,5e-06,7e-06,-1.2e-05,3e-06,0,3e-06,4e-06,-4e-06,-1e-06,-2e-06,7e-06,-1e-06,-2e-06,-2e-06,-1e-06,7e-06,-1e-06,3e-06,-3e-06,1e-06,2e-06,1e-06,-3e-06,2e-06,1e-06,1e-06,4e-06,5e-06,2e-06,-3e-06,-1e-06,-2e-06,-2e-06,-1.7e-05,0,-2e-06,-2e-06,-3e-06,0,-5e-06,2e-06,1e-06,2e-06,-5e-06,7e-06,0,2e-06,-6e-06,1e-06,-2e-06,1e-06,-2e-06,-2e-06,-1e-06,0,-5e-06,0,-1e-06,3e-06,-2e-06,-1e-06,3e-06,1e-06,4e-06,3e-06,2e-06,-6e-06,0,0,-1e-06,-3e-06,-6e-06,-1e-06,-7e-06,-2e-06,-3e-06,2e-06,-3e-06,-3e-06,0,-4e-06,3e-06,-3e-06,8e-06,-2e-06,-3e-06,-8e-06,-2e-06,-2e-06
-2e-06,2e-06,0,-5e-06,2e-06,-8e-06,2e-06,-1.3e-05,1e-06,-3e-06,-4e-06,-3e-06,-3e-06,0,2e-06,-4e-06,0,1e-06,-2e-06,-2e-06,1e-06,3e-06,8e-06,-6e-06,1e-06,1e-06,-3e-06,6e-06,2e-06,-4e-06,4e-06,-1.1e-05,-6e-06,-3e-06,-1e-06,-3e-06,-2e-06,0,-5e-06,-5e-06,-1e-06,-2e-06,-5e-06,-1e-06,1e-06,6e-06,-6e-06,-6e-06,1e-06,1e-06,0,-5e-06,-7e-06,-4e-06,2e-06,-7e-06,2e-06,4e-06,-4e-06,-1.3e-05,-4e-06,2e-06,-2e-06,-9e-06,0,5e-06,-2e-06,-1e-06,-1e-06,1e-06,-2e-06,3e-06,0,1e-06,-4e-06,0,-7e-06,-1e-06,-1e-06,-4e-06,-4e-06,-1e-06,4e-06,-2e-06,-3e-06,-3e-06,-4e-06,1e-06,-1e-06,-2e-06,-1e-06,0,-1e-06,-1e-06,2e-06,0,-1e-06,-1e-06,-4e-06,-2e-06,2e-06,0,1e-06,-3e-06,1e-06,-1e-06,1e-06,-1e-06,-1e-06,0,0,-1e-06,-6e-06,-3e-06,0,-2e-06,0,0,-2e-06,-2e-06,-2e-06
-4e-06,-1e-06,1e-06,2e-06,-3e-06,-2e-06,-5e-06,6e-06,1e-06,-3e-06,-3e-06,2e-06,0,-5e-06,-2e-06,1e-06,-4e-06,1e-06,1e-06,-1e-06,-1e-06,2e-06,-5e-06,-2e-06,-2e-06,1e-06,2e-06,-1e-06,-1e-06,-1e-06,-2e-06,7e-06,4e-06,0,0,3e-06,1e-06,0,-2e-06,4e-06,2e-06,1e-06,5e-06,-5e-06,-3e-06,-1e-06,3e-06,-3e-06,0,-6e-06,0,1e-06,2e-06,-1e-06,-3e-06,5e-06,-1e-06,1e-06,2e-06,9e-06,1e-06,0,-2e-06,3e-06,0,2e-06,1e-06,-2e-06,2e-06,-1e-06,-1e-06,1e-06,-2e-06,-3e-06,-2e-06,-1e-06,7e-06,1e-06,2e-06,-2e-06,1e-06,-2e-06,-3e-06,3e-06,2e-06,6e-06,-1e-06,2e-06,1e-06,1e-06,0,-2e-06,0,-6e-06,-2e-06,-3e-06,3e-06,0,4e-06,-4e-06,0,1e-06,-1e-06,1e-06,0,5e-06,1e-06,1e-06,1e-06,1e-06,0,-3e-06,-1e-06,1e-06,0,0,-3e-06,1e-06,6e-06,-4e-06,5e-06
-1e-06,-3e-06,-1e-06,-2e-06,2e-06,0,3e-06,4e-06,4e-06,1e-06,2e-06,1e-06,-1e-06,0,1e-06,1e-06,5e-06,0,-2e-06,3e-06,2e-06,1e-06,0,-1e-06,4e-06,-1e-06,-2e-06,-7e-06,-3e-06,-2e-06,2e-06,-6e-06,-1e-06,1e-06,-3e-06,3e-06,-2e-06,-1e-06,4e-06,0,0,0,-2e-06,1e-06,-3e-06,5e-06,-2e-06,7e-06,-2e-06,0,0,1e-06,-6e-06,0,1e-06,-7e-06,-1e-06,0,-1e-06,-1e-06,1e-06,-1e-06,-2e-06,8e-06,-2e-06,-4e-06,0,1e-06,0,0,0,-2e-06,0,0,-1e-06,-4e-06,0,-1e-06,0,5e-06,1e-06,1e-06,3e-06,1e-06,0,-2e-06,1e-06,3e-06,2e-06,-2e-06,-5e-06,0,0,2e-06,2e-06,1e-06,1e-06,0,1e-06,0,2e-06,-1e-06,-1e-06,-3e-06,-2e-06,-2e-06,1e-06,1e-06,-2e-06,-1e-06,0,2e-06,0,0,-3e-06,-1e-06,-1e-06,-2e-06,-2e-06,0,2e-06
2e-06,3e-06,1e-06,-1e-06,0,9e-06,-3e-06,0,1e-06,-1e-06,2e-06,-1e-06,-2e-06,2e-06,-5e-06,-3e-06,2e-06,0,2e-06,-3e-06,2e-06,1e-06,0,-2e-06,-2e-06,1e-06,0,1e-06,1e-06,0,-8e-06,3e-06,-3e-06,-2e-06,-1e-06,-1e-06,-1e-06,-1e-06,2e-06,-2e-06,0,-3e-06,1e-06,0,0,0,2e-06,-7e-06,0,1e-06,0,0,2e-06,-3e-06,-3e-06,6e-06,-1e-06,-5e-06,-3e-06,0,-1e-06,0,-1e-06,-3e-06,2e-06,5e-06,-2e-06,-1e-06,0,2e-06,1e-06,6e-06,1e-06,3e-06,2e-06,0,-1e-06,0,-4e-06,-1e-06,-2e-06,-1e-06,-4e-06,1e-06,-1e-06,1e-06,2e-06,0,0,1e-06,4e-06,-1e-06,2e-06,2e-06,-1e-06,0,0,2e-06,2e-06,2e-06,0,0,1e-06,-1e-06,2e-06,0,1e-06,1e-06,3e-06,0,-1e-06,0,0,-3e-06,3e-06,0,-1e-06,1e-06,0,2e-06,0
-1e-06,0,2e-06,0,-2e-06,-2e-06,4e-06,5e-06,-2e-06,-1e-06,-2e-06,0,-3e-06,-2e-06,1e-06,0,3e-06,-1e-06,0,-2e-06,-3e-06,-1e-06,3e-06,-1e-06,1e-06,-1e-06,0,3e-06,0,0,1e-05,-1e-06,4e-06,1e-06,3e-06,-1e-06,0,-2e-06,-5e-06,1e-06,-1e-06,0,-2e-06,1e-06,-1e-06,1e-06,-2e-06,2e-06,1e-06,-3e-06,-1e-06,0,-3e-06,1e-06,3e-06,-1e-06,0,-2e-06,2e-06,-8e-06,0,3e-06,1e-06,-3e-06,-1e-06,-1e-06,1e-06,1e-06,-1e-06,-1e-06,0,-2e-06,0,0,0,0,2e-06,0,0,3e-06,2e-06,1e-06,0,1e-06,1e-06,-2e-06,-2e-06,0,-2e-06,0,-1e-06,1e-06,0,2e-06,1e-06,0,0,-1e-06,-1e-06,2e-06,0,0,1e-06,3e-06,0,2e-06,-2e-06,0,-1e-06,2e-06,1e-06,-2e-06,1e-06,2e-06,1e-06,1e-06,1e-06,-2e-06,2e-06,1e-06,-1e-06
-2e-06,-2e-06,-3e-06,-2e-06,2e-06,-3e-06,0,-4e-06,-1e-06,3e-06,0,0,0,1e-06,-1e-06,0,2e-06,-3e-06,0,2e-06,-1e-06,0,-3e-06,0,-1e-06,0,0,-2e-06,3e-06,-1e-06,-7e-06,2e-06,-5e-06,-1e-06,0,1e-06,-1e-06,-1e-06,0,2e-06,0,1e-06,0,0,-3e-06,1e-06,2e-06,3e-06,1e-06,-1e-06,0,-2e-06,0,-1e-06,-1e-06,0,-1e-06,0,-2e-06,5e-06,0,-2e-06,1e-06,-1e-06,1e-06,-1e-06,1e-06,0,-1e-06,0,-1e-06,-2e-06,1e-06,-3e-06,-1e-06,-1e-06,-1e-06,0,3e-06,-1e-06,2e-06,-3e-06,1e-06,-1e-06,1e-06,0,-1e-06,-1e-06,0,1e-06,-3e-06,2e-06,0,-2e-06,0,0,0,0,-1e-06,0,-3e-06,1e-06,0,1e-06,-2e-06,-2e-06,-1e-06,-1e-06,0,0,-1e-06,1e-06,0,1e-06,-2e-06,-1e-06,0,1e-06,-2e-06,2e-06,-1e-06
-1e-06,2e-06,1e-06,1e-06,0,-1e-06,1e-06,0,0,-1e-06,0,0,0,-1e-06,-1e-06,-1e-06,4e-06,0,0,-1e-06,0,-1e-06,1e-06,1e-06,0,0,2e-06,-1e-06,-3e-06,0,2e-06,-2e-06,2e-06,0,-1e-06,-1e-06,0,0,2e-06,-2e-06,1e-06,-1e-06,-1e-06,1e-06,-2e-06,-2e-06,-1e-06,-5e-06,-1e-06,0,0,1e-06,-2e-06,0,0,3e-06,0,2e-06,1e-06,1e-06,0,0,0,4e-06,0,-2e-06,0,0,-1e-06,1e-06,1e-06,1e-06,0,0,-2e-06,-3e-06,0,0,-1e-06,2e-06,-2e-06,1e-06,-1e-06,-1e-06,-1e-06,0,2e-06,1e-06,1e-06,-1e-06,3e-06,0,0,0,-3e-06,0,1e-06,1e-06,2e-06,-1e-06,-2e-06,-1e-06,-1e-06,1e-06,-1e-06,-1e-06,0,0,1e-06,0,-1e-06,-1e-06,0,0,1e-06,0,0,-1e-06,-1e-06,-2e-06,-2e-06
-1e-06,-1e-06,0,-1e-06,0,5e-06,-2e-06,2e-06,-1e-06,0,1e-06,-1e-06,-2e-06,0,1e-06,2e-06,2e-06,1e-06,0,1e-06,-1e-06,-1e-06,1e-06,0,-1e-06,0,0,2e-06,0,-2e-06,3e-06,2e-06,1e-06,0,0,0,-1e-06,0,-1e-06,0,0,0,1e-06,0,0,-4e-06,2e-06,4e-06,0,1e-06,-1e-06,1e-06,1e-06,0,-1e-06,-2e-06,-1e-06,2e-06,1e-06,1e-06,1e-06,2e-06,0,0,-1e-06,2e-06,0,0,1e-06,1e-06,0,-1e-06,2e-06,0,0,0,3e-06,0,-2e-06,-3e-06,-1e-06,1e-06,0,-1e-06,1e-06,0,0,0,0,1e-06,-1e-06,-2e-06,0,0,1e-06,0,0,0,-2e-06,-1e-06,-1e-06,0,0,1e-06,2e-06,1e-06,0,0,-2e-06,0,0,1e-06,-2e-06,-1e-06,1e-06,-1e-06,1e-06,0,0,0,0
1e-06,-2e-06,-1e-06,0,0,1e-06,0,-6e-06,1e-06,2e-06,-1e-06,0,0,0,0,-1e-06,0,-1e-06,-1e-06,0,3e-06,0,-2e-06,0,2e-06,0,0,1e-06,-3e-06,0,2e-06,-1e-06,-3e-06,-1e-06,-1e-06,-1e-06,-1e-06,1e-06,-1e-06,-1e-06,-1e-06,-1e-06,0,-2e-06,0,-4e-06,-2e-06,-2e-06,1e-06,-1e-06,0,-1e-06,-3e-06,1e-06,0,3e-06,1e-06,0,-2e-06,-6e-06,0,-2e-06,-1e-06,-5e-06,1e-06,-6e-06,0,0,0,0,0,-1e-06,0,0,1e-06,0,-3e-06,0,2e-06,2e-06,0,0,-1e-06,0,-1e-06,1e-06,0,-1e-06,-1e-06,-1e-06,0,0,0,2e-06,-1e-06,1e-06,1e-06,0,-3e-06,-1e-06,-2e-06,0,1e-06,-2e-06,1e-06,0,0,0,2e-06,-1e-06,-1e-06,0,-1e-06,0,-1e-06,1e-06,-1e-06,0,-1e-06,-1e-06,2e-06
-1e-06,0,2e-06,0,0,-3e-06,0,-3e-06,0,-1e-06,1e-06,0,-3e-06,2e-06,2e-06,1e-06,0,-1e-06,1e-06,-1e-06,-2e-06,-1e-06,1e-06,2e-06,-1e-06,0,1e-06,-3e-06,2e-06,1e-06,-7e-06,0,3e-06,0,1e-06,0,0,1e-06,2e-06,1e-06,1e-06,1e-06,0,-1e-06,-4e-06,0,2e-06,-2e-06,0,-1e-06,0,0,2e-06,-1e-06,0,-1e-06,-1e-06,0,1e-06,2e-06,0,-1e-06,0,0,-1e-06,2e-06,0,-1e-06,0,0,0,1e-06,-1e-06,1e-06,0,-1e-06,1e-06,0,1e-06,-1e-06,-3e-06,-2e-06,-1e-06,0,0,0,-2e-06,-1e-06,1e-06,1e-06,-1e-06,0,0,-3e-06,1e-06,-1e-06,0,0,1e-06,0,0,0,0,1e-06,-1e-06,-2e-06,-1e-06,0,0,0,0,-1e-06,-2e-06,0,0,-2e-06,0,0,1e-06,-1e-06,0
-1e-06,0,0,0,0,-2e-06,1e-06,8e-06,0,1e-06,0,0,-1e-06,-1e-06,-1e-06,0,0,0,-1e-06,1e-06,2e-06,0,0,1e-06,2e-06,0,-1e-06,0,-1e-06,-1e-06,5e-06,1e-06,-3e-06,0,1e-06,0,-1e-06,0,1e-06,-1e-06,0,0,0,0,0,-1e-06,-2e-06,4e-06,0,-1e-06,0,0,-3e-06,2e-06,-1e-06,1e-06,-1e-06,-1e-06,-1e-06,2e-06,0,1e-06,0,3e-06,0,-2e-06,0,0,0,0,0,1e-06,0,0,0,1e-06,0,0,-2e-06,0,0,1e-06,-1e-06,0,0,0,0,1e-06,0,-1e-06,0,0,0,0,1e-06,-1e-06,1e-06,0,0,1e-06,0,-1e-06,-1e-06,0,0,1e-06,0,0,-1e-06,0,0,0,-2e-06,-1e-06,1e-06,3e-06,1e-06,0,0,1e-06,0
-1e-06,-1e-06,-1e-06,-1e-06,-1e-06,3e-06,1e-06,-2e-06,0,1e-06,-1e-06,0,-1e-06,1e-06,1e-06,-1e-06,-1e-06,0,0,-1e-06,0,0,0,1e-06,-1e-06,0,-1e-06,2e-06,3e-06,0,-5e-06,-2e-06,1e-06,0,2e-06,0,0,0,-2e-06,-1e-06,0,-1e-06,0,1e-06,1e-06,1e-06,2e-06,-3e-06,0,1e-06,0,1e-06,1e-06,0,0,0,0,0,0,-1e-06,0,0,0,1e-06,1e-06,-1e-06,0,-1e-06,-1e-06,0,0,0,0,-1e-06,-2e-06,0,0,0,0,-1e-06,1e-06,0,0,1e-06,0,0,1e-06,1e-06,0,0,2e-06,0,0,1e-06,-1e-06,1e-06,0,0,1e-06,1e-06,1e-06,0,0,-1e-06,0,1e-06,-1e-06,0,1e-06,0,0,0,-1e-06,0,0,-2e-06,0,-1e-06,0,1e-06,0
-1e-06,0,1e-06,0,0,2e-06,-1e-06,-3e-06,-1e-06,-1e-06,0,0,-1e-06,0,0,0,-2e-06,-1e-06,1e-06,0,-2e-06,0,-1e-06,1e-06,0,0,0,-2e-06,-1e-06,-1e-06,3e-06,2e-06,1e-06,0,0,0,0,0,0,1e-06,0,0,0,0,-2e-06,0,-2e-06,1e-06,1e-06,-1e-06,-1e-06,0,-2e-06,0,0,-2e-06,0,1e-06,1e-06,-3e-06,0,-1e-06,0,-3e-06,0,2e-06,0,0,0,0,0,0,0,1e-06,0,0,1e-06,0,1e-06,0,0,0,-1e-06,0,-1e-06,0,0,1e-06,0,0,-2e-06,0,0,2e-06,0,0,0,-1e-06,0,0,0,0,0,0,0,-1e-06,0,0,-1e-06,0,0,0,0,0,0,1e-06,1e-06,1e-06,1e-06,1e-06,-1e-06
0,1e-06,0,-1e-06,0,-3e-06,0,7e-06,0,1e-06,1e-06,0,0,0,0,-1e-06,-1e-06,0,0,1e-06,0,1e-06,2e-06,1e-06,-1e-06,0,0,0,1e-06,-1e-06,1e-06,-2e-06,-2e-06,0,2e-06,-1e-06,-1e-06,0,1e-06,-2e-06,0,0,0,0,-2e-06,1e-06,1e-06,2e-06,-1e-06,0,0,-1e-06,0,1e-06,1e-06,2e-06,0,1e-06,-1e-06,1e-06,0,1e-06,0,1e-06,1e-06,1e-06,0,-1e-06,1e-06,0,0,1e-06,0,0,0,0,-2e-06,0,0,-1e-06,1e-06,-1e-06,2e-06,0,1e-06,0,0,0,0,0,0,0,0,-2e-06,-1e-06,0,0,0,0,-1e-06,0,0,0,0,0,0,0,0,1e-06,0,0,-1e-06,0,1e-06,0,-1e-06,0,0,-1e-06,-1e-06,0
-1e-06,-1e-06,-1e-06,0,-1e-06,-2e-06,0,-1e-06,0,0,-1e-06,0,-2e-06,-1e-06,0,1e-06,-3e-06,0,0,-1e-06,-1e-06,0,-1e-06,1e-06,0,0,0,0,-2e-06,1e-06,1e-06,2e-06,2e-06,0,0,0,0,0,0,1e-06,0,0,0,0,-1e-06,0,-1e-06,-3e-06,0,-1e-06,1e-06,0,-1e-06,0,0,-3e-06,0,0,1e-06,3e-06,0,0,0,2e-06,0,1e-06,0,0,0,-1e-06,0,-2e-06,0,-1e-06,1e-06,1e-06,1e-06,0,-1e-06,0,1e-06,1e-06,0,0,0,0,0,0,0,0,1e-06,0,0,0,0,0,0,0,2e-06,-1e-06,0,0,0,0,1e-06,1e-06,0,0,-1e-06,0,0,0,0,0,0,1e-06,0,0,-1e-06,0,1e-06
0,0,1e-06,-1e-06,0,1e-06,1e-06,-4e-06,1e-06,0,-1e-06,0,-1e-06,0,-1e-06,0,0,0,0,0,1e-06,0,0,0,-1e-06,0,0,2e-06,1e-06,-1e-06,-4e-06,-2e-06,0,1e-06,0,0,0,0,-1e-06,0,0,0,0,-1e-06,0,2e-06,1e-06,2e-06,0,1e-06,-1e-06,0,0,-1e-06,1e-06,2e-06,0,-1e-06,0,-1e-06,0,0,0,0,0,0,0,0,0,0,0,-1e-06,0,1e-06,0,0,-1e-06,0,0,1e-06,-1e-06,0,1e-06,0,0,0,1e-06,-1e-06,-1e-06,0,0,0,0,0,0,-1e-06,0,0,-1e-06,0,-1e-06,0,0,0,1e-06,-1e-06,1e-06,0,0,0,0,0,0,0,0,-1e-06,0,-1e-06,1e-06,0,0
0,1e-06,0,0,0,3e-06,-1e-06,3e-06,0,0,0,0,0,0,0,0,-2e-06,0,0,0,2e-06,1e-06,0,0,2e-06,0,0,-2e-06,-1e-06,0,4e-06,2e-06,-1e-06,0,-1e-06,0,-1e-06,0,1e-06,1e-06,0,0,1e-06,-1e-06,-1e-06,2e-06,-1e-06,-1e-06,0,-1e-06,0,0,-2e-06,1e-06,0,-3e-06,0,-1e-06,-1e-06,-2e-06,0,0,0,-2e-06,0,0,0,0,0,0,0,1e-06,0,1e-06,-1e-06,0,0,0,0,0,0,1e-06,0,0,0,1e-06,-1e-06,0,1e-06,0,0,0,0,2e-06,0,0,0,0,-1e-06,0,-1e-06,0,0,0,-1e-06,-1e-06,0,0,-1e-06,0,0,0,-1e-06,0,0,0,0,0,-1e-06,-1e-06,0
-1e-06,-1e-06,0,0,0,-2e-06,0,0,0,0,1e-06,0,0,0,-1e-06,0,1e-06,1e-06,1e-06,0,-1e-06,0,0,0,-1e-06,0,0,0,2e-06,0,-3e-06,-2e-06,2e-06,0,2e-06,0,1e-06,-1e-06,1e-06,0,0,0,-1e-06,0,-2e-06,2e-06,1e-06,-2e-06,0,0,0,0,0,0,0,2e-06,0,0,1e-06,0,0,0,0,0,-1e-06,-2e-06,0,0,0,0,0,-1e-06,0,-1e-06,0,1e-06,1e-06,0,0,1e-06,0,0,-1e-06,0,0,-1e-06,0,0,0,0,-1e-06,0,0,-1e-06,1e-06,0,0,0,0,0,0,0,0,0,-1e-06,1e-06,0,0,1e-06,0,0,0,-1e-06,0,0,0,0,0,0,0,0
-1e-06,0,0,-1e-06,0,-2e-06,-1e-06,-4e-06,0,0,0,0,-1e-06,0,0,-1e-06,-1e-06,0,-1e-06,1e-06,0,0,0,0,1e-06,0,-1e-06,1e-06,-2e-06,-1e-06,2e-06,3e-06,-2e-06,0,-1e-06,0,-1e-06,0,-1e-06,0,0,0,1e-06,1e-06,0,0,-1e-06,3e-06,0,-1e-06,0,-1e-06,-2e-06,-1e-06,0,-1e-06,0,0,-1e-06,4e-06,0,0,0,2e-06,0,0,0,0,0,0,0,1e-06,0,0,0,0,-1e-06,0,-1e-06,0,-1e-06,0,0,0,0,1e-06,-1e-06,0,0,0,1e-06,0,0,-1e-06,0,0,0,0,0,0,-1e-06,0,0,1e-06,1e-06,-1e-06,0,0,-1e-06,0,0,0,-1e-06,0,0,0,0,0,1e-06,0,0
0,1e-06,-1e-06,0,0,0,1e-06,2e-06,-1e-06,0,0,0,-1e-06,0,0,0,2e-06,0,0,-1e-06,-1e-06,0,0,-1e-06,0,0,0,0,1e-06,0,1e-06,-2e-06,1e-06,0,0,0,0,0,0,1e-06,0,0,-1e-06,0,-1e-06,-1e-06,1e-06,-2e-06,0,0,0,0,0,1e-06,0,-1e-06,0,1e-06,1e-06,-1e-06,0,0,0,0,0,-1e-06,0,0,0,0,0,1e-06,0,0,1e-06,0,0,0,-1e-06,1e-06,0,-1e-06,-1e-06,0,1e-06,0,0,0,0,0,0,0,0,-1e-06,0,0,0,0,0,0,-1e-06,0,0,0,0,-1e-06,-1e-06,0,0,0,0,0,-1e-06,0,0,0,0,0,-1e-06,0,-1e-06
0,0,0,-1e-06,0,3e-06,0,1e-06,0,0,0,0,-1e-06,0,0,0,0,0,0,0,0,0,0,-1e-06,0,0,0,0,-2e-06,0,2e-06,3e-06,0,0,-1e-06,0,0,0,1e-06,-1e-06,0,0,0,0,-1e-06,-1e-06,-1e-06,0,0,-1e-06,-1e-06,0,-1e-06,-1e-06,1e-06,2e-06,0,0,0,-2e-06,0,0,0,-2e-06,0,0,0,0,0,0,0,0,0,0,0,1e-06,1e-06,0,1e-06,-1e-06,0,1e-06,0,0,0,-1e-06,1e-06,0,0,0,-1e-06,0,0,2e-06,0,1e-06,0,0,0,0,0,0,0,0,0,0,0,0,1e-06,0,0,0,-1e-06,0,0,0,0,0,0,0,0
0,0,0,0,0,-1e-06,0,-1e-06,0,0,0,0,0,0,1e-06,0,3e-06,0,0,1e-06,1e-06,-1e-06,-1e-06,-1e-06,-1e-06,0,0,-1e-06,2e-06,0,-4e-06,-3e-06,-2e-06,-1e-06,0,0,-1e-06,0,0,0,0,0,0,0,-1e-06,-2e-06,1e-06,2e-06,0,1e-06,0,0,0,0,0,-2e-06,0,0,-1e-06,-1e-06,0,0,0,0,0,0,0,0,0,0,0,-1e-06,0,0,0,0,-1e-06,0,0,0,0,-1e-06,0,0,0,1e-06,-1e-06,0,1e-06,0,1e-06,0,0,-1e-06,-1e-06,0,0,0,0,0,0,0,0,0,0,1e-06,0,0,-1e-06,0,0,0,0,0,0,1e-06,-1e-06,0,1e-06,0,0
