0.092091,0.098695,0.097278,0.103336,0.111539,0.10172,0.087094,0.087422,0.098615,0.098349,0.08401,0.07072,0.07092,0.072606,0.066341,0.062291,0.062519,0.069935,0.086161,0.094598,0.081846,0.071317,0.07521,0.072995,0.063572,0.058944,0.055654,0.047854
0.124347,0.132997,0.128961,0.13144,0.139182,0.133989,0.119053,0.119245,0.132987,0.130164,0.111154,0.095839,0.094436,0.091359,0.082252,0.078451,0.080746,0.091212,0.114159,0.129108,0.112589,0.095912,0.100027,0.097685,0.085166,0.079062,0.073908,0.062983
0.184566,0.196654,0.188441,0.184255,0.191573,0.196862,0.182467,0.181813,0.199327,0.190778,0.163219,0.144315,0.138447,0.125442,0.111876,0.109396,0.116167,0.13329,0.169159,0.197187,0.173757,0.143041,0.147042,0.145864,0.12743,0.118641,0.109283,0.092301
0.236802,0.252496,0.243556,0.235523,0.243141,0.258109,0.24461,0.242711,0.261916,0.244069,0.209063,0.189234,0.177668,0.155147,0.139975,0.141043,0.152328,0.17524,0.221924,0.26155,0.232544,0.185881,0.188916,0.191356,0.16776,0.156807,0.143787,0.121199
0.252485,0.269704,0.264837,0.25593,0.262745,0.281863,0.27188,0.269856,0.284601,0.257242,0.221717,0.206145,0.192344,0.16857,0.156182,0.164185,0.179241,0.200114,0.244248,0.283297,0.25459,0.202333,0.204022,0.209223,0.186138,0.17608,0.163635,0.139437
0.246648,0.267176,0.267038,0.250761,0.247034,0.261062,0.262117,0.264806,0.264302,0.231559,0.208619,0.200561,0.190874,0.180202,0.175602,0.190785,0.205157,0.214554,0.238575,0.257007,0.236335,0.199615,0.19498,0.193953,0.181732,0.177772,0.170589,0.147924
0.302506,0.338422,0.344034,0.310047,0.288622,0.298883,0.30842,0.308802,0.287915,0.253822,0.252619,0.251833,0.240043,0.240867,0.242015,0.254857,0.266172,0.27915,0.288089,0.271757,0.254942,0.244385,0.226083,0.206521,0.208258,0.210302,0.206389,0.18194
0.48608,0.536126,0.556332,0.507551,0.473312,0.48711,0.483249,0.461656,0.432813,0.398622,0.41366,0.413159,0.390035,0.401552,0.395024,0.382263,0.392895,0.438578,0.446757,0.410909,0.399544,0.393091,0.354299,0.305705,0.309346,0.311059,0.298154,0.265135
0.823947,0.873187,0.92264,0.859454,0.806107,0.826804,0.795975,0.732002,0.713034,0.688233,0.708407,0.690779,0.644487,0.679431,0.656532,0.598438,0.611096,0.715452,0.734206,0.68421,0.692533,0.684374,0.60189,0.49236,0.484892,0.488473,0.468501,0.408411
1.319304,1.34804,1.438219,1.363156,1.285365,1.307903,1.239555,1.10863,1.107611,1.112076,1.136401,1.075299,0.995119,1.079069,1.030408,0.903573,0.924746,1.125932,1.159659,1.078257,1.137856,1.148778,0.987984,0.755435,0.71574,0.751003,0.759636,0.646274
1.862486,1.832053,1.958077,1.894332,1.79769,1.809079,1.715161,1.51951,1.532978,1.572289,1.589002,1.460318,1.34833,1.505079,1.429014,1.234534,1.284245,1.587937,1.628813,1.503699,1.638106,1.700063,1.448532,1.048593,0.967294,1.072875,1.138937,0.964718
2.185503,2.059322,2.199696,2.181031,2.067085,2.045496,1.965571,1.744462,1.766991,1.837767,1.818932,1.612909,1.496249,1.738942,1.666002,1.437183,1.517784,1.868726,1.914013,1.755364,1.93921,2.073594,1.76603,1.231415,1.119892,1.303666,1.434761,1.230461
1.998106,1.788035,1.922029,1.9714,1.848147,1.79083,1.769225,1.587588,1.610231,1.682409,1.604434,1.364482,1.293349,1.595869,1.586524,1.392473,1.460836,1.734023,1.763131,1.602942,1.774083,1.960755,1.685501,1.170009,1.067057,1.269285,1.423498,1.246344
1.376764,1.176566,1.285766,1.382212,1.313762,1.248874,1.224467,1.126554,1.195442,1.236451,1.085115,0.89483,0.900884,1.16101,1.245252,1.153,1.158381,1.264529,1.250242,1.129729,1.233198,1.393307,1.226852,0.915208,0.865243,0.9878,1.073163,0.949236
0.841693,0.763154,0.909875,1.092917,1.172008,1.083455,0.877427,0.821703,1.071297,1.149022,0.882136,0.702819,0.793433,0.934112,1.075926,1.118909,1.064634,1.076181,0.988997,0.900064,0.902441,0.903177,0.839536,0.806615,0.898094,0.89601,0.749259,0.576497
0.910064,0.897555,1.17443,1.520321,1.703897,1.565598,1.124864,0.979211,1.448995,1.602969,1.135205,0.873751,1.067227,1.205232,1.420657,1.608361,1.531993,1.502206,1.327167,1.214774,1.222234,1.118545,1.00827,1.113638,1.341035,1.252962,0.884934,0.5602
1.235106,1.183898,1.574876,2.103314,2.373322,2.225769,1.625266,1.355853,1.945685,2.088879,1.399216,1.09334,1.408947,1.571834,1.829525,2.152788,2.116769,2.075051,1.808897,1.627864,1.653825,1.492429,1.323232,1.506513,1.79848,1.608801,1.112269,0.715719
1.593845,1.43593,1.795611,2.471904,2.820928,2.658373,1.993094,1.629238,2.171341,2.247796,1.511417,1.24125,1.576775,1.698648,1.935029,2.369295,2.431128,2.40673,2.085982,1.837057,1.853379,1.680843,1.53814,1.755626,1.980643,1.672322,1.149427,0.810885
1.903044,1.659531,1.82753,2.461273,2.814215,2.586102,1.971373,1.654377,1.986988,2.038572,1.573103,1.309067,1.439509,1.49522,1.663694,2.129082,2.302275,2.301858,2.050026,1.822147,1.775986,1.613105,1.578626,1.766796,1.812745,1.476841,1.056193,0.843323
2.12306,1.915395,1.797373,2.206281,2.508371,2.107724,1.567399,1.44522,1.579831,1.694291,1.636218,1.292219,1.08296,1.130413,1.277292,1.719866,1.953491,1.961273,1.886667,1.772715,1.678411,1.446136,1.424261,1.572367,1.521645,1.32386,1.055776,0.878996
2.056385,1.976622,1.753973,1.91496,2.135267,1.687039,1.209156,1.210665,1.292772,1.450122,1.581365,1.169899,0.758684,0.816836,0.956306,1.326649,1.540633,1.565402,1.618214,1.596398,1.55095,1.288769,1.146426,1.273574,1.230605,1.147013,1.053263,0.887036
1.621124,1.668859,1.520404,1.549286,1.62211,1.280121,0.960874,0.911334,0.93234,1.087,1.260084,0.954598,0.582516,0.590417,0.682817,0.937975,1.09365,1.085472,1.110569,1.125991,1.162759,1.02912,0.871018,0.945585,0.960688,0.952183,0.945997,0.788452
1.088668,1.168252,1.05813,1.067825,1.028564,0.812875,0.72135,0.64012,0.587017,0.671565,0.800274,0.695268,0.476943,0.438876,0.480301,0.625264,0.762152,0.716826,0.65619,0.683105,0.711168,0.704127,0.684489,0.707909,0.723433,0.714228,0.692766,0.591591
0.685326,0.719668,0.676443,0.686947,0.657808,0.610605,0.61424,0.496427,0.423693,0.440369,0.468439,0.469648,0.389182,0.391204,0.449642,0.496083,0.583102,0.589278,0.512495,0.520603,0.502396,0.501503,0.59748,0.598733,0.542223,0.461051,0.420443,0.419072
0.558191,0.510001,0.53776,0.540895,0.569652,0.631905,0.599955,0.439114,0.413541,0.445316,0.411235,0.449507,0.435975,0.46321,0.574797,0.545994,0.527689,0.567035,0.519814,0.52461,0.482218,0.452751,0.543699,0.543728,0.517237,0.377551,0.305998,0.387599
0.68807,0.603661,0.60641,0.548242,0.547079,0.638743,0.604076,0.459409,0.460006,0.533831,0.501163,0.557551,0.579238,0.595173,0.71874,0.64715,0.570621,0.612137,0.585101,0.589504,0.531864,0.475705,0.522414,0.537951,0.564366,0.402635,0.314574,0.408647
0.844686,0.796509,0.748393,0.632295,0.587019,0.698468,0.652109,0.49193,0.513135,0.642153,0.640281,0.677824,0.712291,0.736974,0.825403,0.688505,0.632416,0.752621,0.733836,0.662664,0.558482,0.492849,0.517862,0.557383,0.626119,0.452415,0.327688,0.413844
0.927549,0.932012,0.856186,0.745655,0.682208,0.798827,0.722618,0.523007,0.521226,0.673249,0.700409,0.68586,0.730813,0.7952,0.822533,0.625049,0.644099,0.92301,0.935022,0.779642,0.59547,0.469168,0.497637,0.552001,0.650911,0.491699,0.306097,0.375367
0.881086,0.889242,0.83914,0.771873,0.68377,0.780499,0.726471,0.54332,0.473865,0.582624,0.640922,0.595378,0.618999,0.689289,0.652162,0.4613,0.568692,0.980814,1.036641,0.849997,0.634788,0.438653,0.455963,0.497781,0.580336,0.472668,0.273818,0.329083
0.687485,0.679727,0.688438,0.653192,0.54342,0.629081,0.622764,0.484719,0.384876,0.438325,0.532905,0.501396,0.47207,0.488888,0.436672,0.351429,0.487105,0.869282,0.967475,0.804532,0.5964,0.410078,0.38878,0.378367,0.437578,0.420002,0.264177,0.290942
0.469985,0.520659,0.575113,0.514958,0.405957,0.472649,0.466701,0.338177,0.290779,0.381346,0.45724,0.3815,0.326363,0.311259,0.31605,0.342,0.440043,0.654342,0.75034,0.644745,0.456456,0.344401,0.292379,0.237116,0.318658,0.407168,0.292056,0.256733
0.361146,0.422986,0.448774,0.385019,0.340814,0.359545,0.29411,0.198685,0.253211,0.39881,0.409577,0.28904,0.242283,0.229999,0.272803,0.321735,0.393341,0.464333,0.48259,0.423437,0.314804,0.283506,0.230772,0.165578,0.254645,0.393113,0.323328,0.219318
0.294896,0.335971,0.304936,0.246346,0.255853,0.254291,0.176746,0.149502,0.253009,0.376578,0.347545,0.240991,0.220171,0.225517,0.247797,0.256406,0.32593,0.381039,0.354596,0.316094,0.257484,0.234709,0.202441,0.152505,0.213204,0.333348,0.31869,0.21677
0.208905,0.246805,0.209521,0.169729,0.187598,0.201406,0.148247,0.13752,0.218479,0.285815,0.271886,0.232563,0.23601,0.236478,0.223243,0.204411,0.25891,0.302973,0.278366,0.271659,0.244036,0.198211,0.1817,0.144337,0.154525,0.223371,0.258775,0.221396
0.13559,0.203937,0.171476,0.130192,0.144076,0.16895,0.14948,0.126703,0.147275,0.168932,0.201662,0.236654,0.24591,0.229882,0.216896,0.199156,0.19408,0.201293,0.203782,0.23143,0.232625,0.161576,0.149006,0.131251,0.104751,0.119958,0.166973,0.183803
0.114815,0.172613,0.142384,0.096086,0.09734,0.122601,0.136086,0.114349,0.093359,0.099951,0.152967,0.2094,0.208936,0.176143,0.178228,0.181981,0.16374,0.152243,0.153308,0.18437,0.189575,0.124394,0.113036,0.101681,0.066962,0.068256,0.099835,0.125189
0.097948,0.129683,0.10599,0.060451,0.066763,0.082777,0.104291,0.108713,0.087274,0.084457,0.119485,0.153719,0.139525,0.103313,0.116031,0.154914,0.166625,0.151971,0.133165,0.133852,0.130325,0.089612,0.078951,0.070217,0.06202,0.069602,0.085054,0.099501
0.075302,0.096379,0.089026,0.0494,0.05426,0.056057,0.069164,0.090539,0.079933,0.081031,0.109747,0.108391,0.082511,0.065043,0.078455,0.128281,0.152837,0.135119,0.113323,0.101115,0.08541,0.065361,0.055255,0.057249,0.06992,0.07095,0.070334,0.0896
0.071907,0.094323,0.087543,0.058906,0.059287,0.057022,0.059048,0.072905,0.070465,0.08048,0.104484,0.077141,0.052343,0.051792,0.06759,0.110962,0.114605,0.094407,0.079254,0.066941,0.05404,0.052804,0.05804,0.064294,0.073582,0.063156,0.053748,0.075967
0.072494,0.096759,0.085403,0.065527,0.076743,0.07463,0.072492,0.073092,0.067285,0.08072,0.085324,0.051461,0.03628,0.039215,0.061686,0.089601,0.069038,0.052172,0.050825,0.044547,0.041914,0.045201,0.059312,0.067119,0.065024,0.052887,0.051143,0.079049
