0.03346,0.033542,0.031638,0.029944,0.027777,0.025894,0.029106,0.03106,0.028963,0.02864,0.02582,0.024556,0.027463,0.0276,0.026874,0.026279,0.027846,0.029643,0.02827,0.026724,0.025538,0.024962,0.022619,0.022313,0.025613,0.027679,0.025879,0.02413
0.0437,0.042892,0.040286,0.037395,0.034456,0.032973,0.036891,0.038389,0.036309,0.036712,0.033514,0.032708,0.036299,0.035559,0.034238,0.034105,0.037901,0.041074,0.038087,0.034909,0.032587,0.031817,0.029203,0.02848,0.032516,0.034772,0.03308,0.032048
0.06507,0.061835,0.057583,0.052276,0.04791,0.048312,0.054265,0.053905,0.051044,0.052315,0.048825,0.050184,0.055672,0.053807,0.05082,0.051327,0.059872,0.065578,0.059468,0.05215,0.046414,0.045277,0.042726,0.041291,0.046698,0.049215,0.048032,0.049088
0.097684,0.089455,0.080633,0.073121,0.068001,0.072208,0.080169,0.074916,0.07046,0.072681,0.070761,0.076417,0.084223,0.083995,0.078975,0.078672,0.091288,0.098697,0.089715,0.076248,0.064873,0.063352,0.061818,0.059352,0.066073,0.068452,0.068048,0.073823
0.155511,0.138384,0.12014,0.113178,0.107413,0.114632,0.123694,0.108245,0.103187,0.110808,0.111981,0.119981,0.129959,0.136643,0.126927,0.123428,0.139075,0.146269,0.135635,0.115206,0.097161,0.094402,0.092582,0.086688,0.095903,0.10107,0.101756,0.114524
0.259049,0.229406,0.196027,0.189944,0.179072,0.186475,0.199413,0.169603,0.161821,0.179373,0.185583,0.194187,0.206952,0.223767,0.20573,0.198175,0.218339,0.225055,0.21177,0.179567,0.15056,0.145592,0.142186,0.131194,0.147681,0.160025,0.160242,0.180318
0.395019,0.35445,0.305893,0.299099,0.278804,0.284043,0.304802,0.260504,0.241814,0.267556,0.282697,0.292008,0.307232,0.335963,0.309853,0.297494,0.323283,0.331779,0.31335,0.263171,0.21935,0.212164,0.208811,0.194652,0.220597,0.241698,0.240023,0.266816
0.510892,0.467073,0.412102,0.403928,0.373298,0.372672,0.403894,0.357168,0.320132,0.343935,0.369232,0.377864,0.39161,0.429689,0.402095,0.383267,0.41265,0.425719,0.400258,0.33495,0.283934,0.276274,0.276647,0.261373,0.285732,0.314991,0.316324,0.343803
0.542046,0.50393,0.460263,0.454361,0.419582,0.407554,0.447282,0.420676,0.369327,0.383545,0.410603,0.406492,0.409686,0.444391,0.42611,0.405701,0.434025,0.451628,0.422532,0.361347,0.319505,0.312677,0.320419,0.305927,0.307567,0.338623,0.353081,0.373696
0.490818,0.463057,0.440848,0.445235,0.421563,0.392163,0.44055,0.450953,0.396838,0.408189,0.419063,0.377535,0.360142,0.373262,0.368392,0.368269,0.398943,0.408561,0.380099,0.351684,0.335888,0.32853,0.341498,0.33584,0.303128,0.317091,0.348968,0.367054
0.44905,0.424345,0.420963,0.454,0.452165,0.401665,0.462906,0.498476,0.427609,0.448519,0.451032,0.365879,0.322789,0.311044,0.312275,0.340219,0.380899,0.376336,0.352072,0.359328,0.360706,0.34293,0.352454,0.365768,0.309882,0.294022,0.342407,0.371614
0.400213,0.402545,0.421573,0.473524,0.492236,0.427613,0.467608,0.511436,0.444999,0.475997,0.479519,0.374095,0.315763,0.306507,0.314499,0.324762,0.35041,0.351848,0.340022,0.357429,0.362387,0.336027,0.335636,0.36491,0.30959,0.272067,0.330694,0.37364
0.331685,0.359009,0.387305,0.436179,0.473187,0.417587,0.415121,0.455981,0.421708,0.450419,0.450143,0.360822,0.300134,0.298833,0.320788,0.299732,0.310718,0.339546,0.328511,0.332864,0.333333,0.301172,0.29112,0.321693,0.289977,0.24814,0.294754,0.337929
0.289251,0.302499,0.314645,0.347771,0.395432,0.365857,0.343353,0.386101,0.390267,0.393979,0.385038,0.347013,0.298266,0.29705,0.319486,0.277075,0.287534,0.337229,0.308295,0.283417,0.279454,0.260541,0.249474,0.260486,0.26182,0.237407,0.256196,0.2843
0.323271,0.279613,0.269649,0.289106,0.318651,0.304387,0.300217,0.358345,0.387701,0.352085,0.326297,0.340737,0.333161,0.335014,0.33678,0.28613,0.286022,0.337668,0.329796,0.30124,0.265753,0.24319,0.238635,0.24462,0.277574,0.263263,0.252768,0.295689
0.470266,0.35052,0.317467,0.338405,0.362623,0.361409,0.373584,0.449206,0.492893,0.415264,0.346429,0.380113,0.446187,0.474184,0.446972,0.393604,0.348992,0.373674,0.429402,0.434322,0.356941,0.297424,0.285642,0.303496,0.382026,0.372301,0.309759,0.395599
0.696742,0.499365,0.449456,0.492865,0.536283,0.541525,0.545293,0.655759,0.727905,0.580339,0.448055,0.499284,0.654714,0.739722,0.672342,0.567933,0.473775,0.488275,0.593528,0.632767,0.536197,0.438041,0.394538,0.418935,0.557859,0.555216,0.440908,0.573475
0.877429,0.627107,0.576999,0.657374,0.720577,0.725114,0.719184,0.86474,0.952225,0.726068,0.556687,0.642886,0.878059,1.028573,0.925088,0.747515,0.619334,0.632532,0.736124,0.789556,0.707514,0.590869,0.512176,0.538121,0.735493,0.742957,0.58623,0.752169
0.904841,0.668292,0.629752,0.73277,0.797123,0.805524,0.81713,0.968436,1.024293,0.753291,0.583957,0.695632,0.964531,1.160305,1.05907,0.847042,0.714052,0.705389,0.744485,0.789979,0.761126,0.668737,0.594933,0.620425,0.812467,0.820537,0.6472,0.802536
0.810883,0.639002,0.588758,0.676316,0.733518,0.778428,0.81929,0.909032,0.906628,0.684281,0.537466,0.603091,0.809265,0.999143,0.954671,0.797599,0.714277,0.671528,0.61837,0.63526,0.656657,0.612257,0.587634,0.61359,0.722188,0.720817,0.582954,0.673372
0.658764,0.556286,0.499757,0.574957,0.623228,0.713084,0.777396,0.774562,0.735664,0.607982,0.504573,0.471241,0.512457,0.63891,0.679276,0.665751,0.67304,0.596487,0.501027,0.499794,0.525704,0.502232,0.50678,0.518493,0.533419,0.534353,0.451657,0.453806
0.527466,0.465555,0.437271,0.516494,0.5445,0.606438,0.650206,0.611112,0.590308,0.528384,0.471798,0.385354,0.307763,0.381747,0.476844,0.552117,0.57119,0.474531,0.425823,0.425096,0.453599,0.425331,0.389237,0.392427,0.391365,0.419803,0.37272,0.330711
0.415384,0.390825,0.388975,0.470956,0.482836,0.484817,0.472167,0.449915,0.472855,0.431819,0.4073,0.329586,0.238926,0.281274,0.353238,0.43331,0.408921,0.314105,0.339292,0.355541,0.392775,0.375106,0.324251,0.335569,0.319403,0.334205,0.334526,0.332482
0.310942,0.311693,0.298786,0.361116,0.383411,0.357396,0.313433,0.318679,0.382801,0.345549,0.298201,0.242619,0.198959,0.237795,0.268024,0.303718,0.257372,0.198922,0.250544,0.261547,0.291843,0.295234,0.270733,0.290139,0.271132,0.267097,0.284921,0.314722
0.214572,0.220452,0.192723,0.215379,0.239509,0.226073,0.199239,0.207755,0.272678,0.249337,0.179398,0.147903,0.15444,0.182219,0.178763,0.183411,0.163411,0.140043,0.160107,0.16441,0.181901,0.19215,0.194009,0.207494,0.201571,0.206017,0.219907,0.239468
0.129529,0.135819,0.127257,0.132575,0.138457,0.140339,0.141921,0.138358,0.164054,0.15338,0.102449,0.094318,0.128926,0.145789,0.127129,0.1218,0.122603,0.115411,0.104277,0.093116,0.100583,0.118408,0.131791,0.139193,0.141033,0.145443,0.151978,0.155551
0.094481,0.094592,0.102568,0.109046,0.104818,0.11225,0.124014,0.107697,0.101503,0.1003,0.080658,0.079599,0.109637,0.118094,0.099082,0.093143,0.099218,0.099949,0.084144,0.065856,0.070063,0.090792,0.104308,0.104841,0.100702,0.098401,0.094416,0.088423
0.086862,0.081118,0.085834,0.091477,0.092083,0.103515,0.106313,0.088388,0.082281,0.081387,0.074286,0.075648,0.098782,0.098421,0.071797,0.061381,0.070541,0.080024,0.077336,0.066702,0.062685,0.078515,0.094565,0.090706,0.078823,0.068207,0.060732,0.057057
0.079077,0.074228,0.068535,0.06537,0.072638,0.088381,0.085618,0.073841,0.072831,0.064605,0.061109,0.072743,0.089768,0.082976,0.062309,0.05307,0.057172,0.063672,0.070685,0.074338,0.06384,0.06238,0.078221,0.082418,0.070635,0.056708,0.052047,0.05205
0.07943,0.068719,0.051941,0.043779,0.052918,0.067493,0.074527,0.074004,0.074917,0.061615,0.054632,0.070872,0.077172,0.066859,0.060275,0.059115,0.060633,0.064034,0.068564,0.078794,0.069767,0.052795,0.060424,0.069139,0.064815,0.057403,0.051695,0.048107
0.082014,0.068676,0.039443,0.031006,0.04627,0.063693,0.08228,0.080055,0.079084,0.068648,0.053958,0.068114,0.076469,0.066247,0.06133,0.065516,0.06446,0.067868,0.069607,0.078027,0.074826,0.055007,0.055884,0.066376,0.068293,0.063979,0.05712,0.050877
0.073324,0.062521,0.032455,0.0305,0.050197,0.069905,0.091251,0.083249,0.081207,0.071252,0.046626,0.054956,0.072108,0.069959,0.065312,0.07213,0.071228,0.073132,0.070129,0.074773,0.078265,0.059407,0.059361,0.075614,0.078669,0.071142,0.064145,0.05552
0.059584,0.052953,0.029715,0.031879,0.050358,0.066292,0.083113,0.074501,0.075559,0.066324,0.035491,0.037422,0.057445,0.06154,0.059858,0.067231,0.067959,0.067268,0.062488,0.066739,0.071978,0.054013,0.054572,0.073953,0.075439,0.065397,0.06157,0.05286
0.048527,0.043399,0.028638,0.030015,0.046859,0.054574,0.058365,0.052191,0.06232,0.056094,0.025385,0.025111,0.038712,0.043664,0.045361,0.049006,0.050667,0.049248,0.046947,0.050395,0.053018,0.040082,0.041886,0.05655,0.055204,0.046236,0.047628,0.047603
0.040743,0.033486,0.026433,0.025868,0.040145,0.042108,0.034372,0.030755,0.050269,0.049713,0.025603,0.020303,0.022488,0.032539,0.038297,0.032666,0.032922,0.033072,0.036817,0.036275,0.034166,0.032322,0.034133,0.037046,0.031962,0.028372,0.033088,0.042905
0.036737,0.029442,0.023494,0.019845,0.029191,0.033721,0.027045,0.021906,0.037564,0.041826,0.030954,0.023799,0.017609,0.031663,0.039996,0.030272,0.032043,0.031544,0.035473,0.031312,0.027672,0.030209,0.029726,0.027689,0.02052,0.024625,0.032363,0.038491
0.033575,0.027314,0.023385,0.016305,0.021312,0.031449,0.029375,0.025206,0.029823,0.030889,0.034852,0.033128,0.021916,0.03311,0.04249,0.033357,0.032993,0.032968,0.036794,0.033903,0.028051,0.025549,0.022952,0.022224,0.01818,0.028922,0.035465,0.035005
0.034181,0.025548,0.026558,0.017462,0.019735,0.029553,0.029611,0.027555,0.026294,0.022125,0.035374,0.040963,0.024583,0.029707,0.03903,0.032465,0.030304,0.031063,0.033303,0.033574,0.027453,0.018967,0.017423,0.020482,0.022167,0.037088,0.037942,0.032437
0.034621,0.023645,0.028516,0.019239,0.018182,0.023776,0.025769,0.025911,0.026638,0.020936,0.035081,0.043005,0.02288,0.022384,0.030409,0.027725,0.032151,0.030544,0.024507,0.027412,0.024816,0.017049,0.016449,0.020305,0.026875,0.044157,0.040584,0.030918
0.033754,0.022432,0.027318,0.021167,0.017528,0.017856,0.022371,0.023739,0.025317,0.021107,0.033933,0.03799,0.018948,0.016824,0.022293,0.026393,0.037073,0.032494,0.016663,0.018403,0.021387,0.019382,0.017303,0.018307,0.028603,0.046259,0.039043,0.02806
