0.052692,0.04956,0.045728,0.045797,0.046561,0.048002,0.048823,0.047964,0.046571,0.04818,0.058726,0.065856,0.057043,0.052426,0.055772,0.057494,0.056739,0.052826,0.057744,0.064212,0.064358,0.063226,0.062316,0.061693,0.058618,0.057181,0.053157,0.048557
0.062538,0.060287,0.056411,0.056215,0.056246,0.057092,0.0584,0.059153,0.058833,0.05968,0.069829,0.078421,0.0695,0.064055,0.067665,0.069456,0.069833,0.066717,0.072882,0.080612,0.080557,0.076979,0.075183,0.076594,0.073404,0.071016,0.065833,0.059283
0.076563,0.07687,0.0737,0.073013,0.072504,0.072334,0.074028,0.077945,0.079903,0.07913,0.087514,0.098272,0.09093,0.084765,0.087868,0.089825,0.09312,0.093168,0.101273,0.10946,0.108403,0.099162,0.094319,0.099624,0.097295,0.093659,0.086347,0.076414
0.083038,0.087343,0.086771,0.085614,0.085685,0.085168,0.085972,0.091459,0.095718,0.094033,0.099302,0.110235,0.108087,0.103932,0.104699,0.105328,0.111191,0.117655,0.127285,0.133146,0.131241,0.115831,0.105971,0.113166,0.112196,0.108156,0.099919,0.088895
0.089362,0.096946,0.099817,0.098775,0.099409,0.098386,0.097626,0.100912,0.104748,0.104773,0.109194,0.116873,0.119589,0.118754,0.117642,0.118767,0.124284,0.13668,0.150682,0.155446,0.153841,0.136436,0.120809,0.121386,0.117226,0.113004,0.106376,0.097124
0.108247,0.118772,0.122309,0.119969,0.120835,0.116666,0.116267,0.116442,0.116171,0.121778,0.13056,0.131778,0.131718,0.130261,0.130499,0.140445,0.148538,0.162591,0.182064,0.186999,0.184185,0.169914,0.151039,0.140031,0.128865,0.122557,0.114724,0.107922
0.137952,0.14956,0.149968,0.145161,0.147069,0.141159,0.141473,0.139525,0.13806,0.147932,0.160214,0.156978,0.150179,0.146944,0.149334,0.170045,0.18517,0.197416,0.21687,0.217234,0.211647,0.205473,0.18623,0.168119,0.155124,0.145511,0.136063,0.129541
0.168254,0.176544,0.173929,0.16611,0.172161,0.169826,0.165263,0.161381,0.164318,0.177394,0.193928,0.190196,0.179347,0.172425,0.171226,0.20204,0.223807,0.223938,0.234731,0.22811,0.217997,0.226807,0.210983,0.190772,0.186781,0.176456,0.168394,0.160989
0.195916,0.20293,0.200339,0.187858,0.197927,0.204066,0.187364,0.178168,0.191199,0.209111,0.236262,0.240034,0.225716,0.21179,0.202693,0.238473,0.259192,0.236603,0.242181,0.241048,0.224145,0.242475,0.224351,0.206687,0.222707,0.209041,0.203933,0.200172
0.227476,0.234328,0.232847,0.217258,0.23082,0.246887,0.219248,0.201504,0.219652,0.241214,0.280725,0.294562,0.280405,0.262201,0.242442,0.267701,0.274992,0.231999,0.245806,0.269689,0.257241,0.275656,0.239772,0.217672,0.254131,0.235417,0.232753,0.236847
0.24654,0.248069,0.247098,0.235132,0.251429,0.273674,0.24278,0.218867,0.230543,0.248152,0.287846,0.3083,0.299614,0.282355,0.261991,0.271304,0.268434,0.227214,0.242915,0.277895,0.279199,0.294649,0.241534,0.209818,0.253109,0.234325,0.234914,0.245208
0.236278,0.224123,0.221753,0.219729,0.233863,0.259417,0.238248,0.209984,0.205815,0.215487,0.245101,0.264196,0.261061,0.247895,0.236017,0.24005,0.238232,0.2109,0.213102,0.240741,0.259074,0.262208,0.205271,0.181204,0.222372,0.204637,0.205403,0.218116
0.203412,0.184841,0.187377,0.192897,0.195114,0.211376,0.204664,0.179661,0.160128,0.16595,0.189632,0.199089,0.199215,0.191981,0.179405,0.181279,0.185436,0.181299,0.176063,0.181696,0.203012,0.193555,0.152886,0.16033,0.195985,0.170192,0.162716,0.172218
0.178734,0.157595,0.162176,0.172214,0.165356,0.165989,0.163577,0.149682,0.129003,0.129036,0.146134,0.150586,0.161736,0.167187,0.147629,0.143096,0.151521,0.165611,0.161956,0.146743,0.164201,0.154137,0.126333,0.150287,0.171297,0.139611,0.1329,0.146705
0.166597,0.143582,0.145785,0.153666,0.151048,0.149943,0.140972,0.133238,0.119618,0.11886,0.134018,0.14258,0.157428,0.164269,0.147009,0.142264,0.153297,0.164362,0.155026,0.144045,0.163165,0.147348,0.124226,0.146066,0.150906,0.122323,0.121645,0.140126
0.172419,0.155654,0.157936,0.15726,0.153769,0.163487,0.157804,0.151049,0.14007,0.155177,0.176718,0.175869,0.190919,0.202947,0.18479,0.174512,0.19744,0.195945,0.166277,0.176463,0.205087,0.172211,0.153846,0.16946,0.15853,0.140831,0.14476,0.164796
0.2183,0.211054,0.222442,0.21394,0.189646,0.203132,0.20814,0.212091,0.199532,0.227381,0.269184,0.261185,0.281439,0.305404,0.273564,0.253591,0.293194,0.280616,0.228501,0.255627,0.299369,0.242104,0.215877,0.229002,0.210242,0.204898,0.205469,0.224587
0.288772,0.301377,0.318352,0.296464,0.244835,0.250869,0.263346,0.287544,0.27596,0.314723,0.391224,0.389524,0.422816,0.458195,0.396123,0.361039,0.414096,0.390311,0.322802,0.355341,0.421111,0.343972,0.28537,0.295821,0.29067,0.30581,0.291437,0.289427
0.356749,0.397323,0.403417,0.369241,0.306288,0.303291,0.319332,0.360805,0.355678,0.414844,0.535466,0.559759,0.609241,0.628758,0.523783,0.485219,0.534228,0.483846,0.416712,0.445757,0.53417,0.446839,0.342451,0.361966,0.394164,0.42601,0.38278,0.335007
0.402855,0.461728,0.43638,0.403468,0.354496,0.350727,0.38429,0.433398,0.436195,0.526471,0.679779,0.741208,0.798966,0.766107,0.626774,0.614685,0.648655,0.560889,0.495016,0.503122,0.599008,0.516922,0.416879,0.477278,0.521634,0.531576,0.455504,0.362881
0.420898,0.475858,0.402014,0.384851,0.36825,0.382335,0.46792,0.501599,0.492104,0.598491,0.758433,0.895051,0.967674,0.881172,0.742875,0.762859,0.772817,0.638825,0.562733,0.54651,0.602286,0.534398,0.55803,0.692577,0.679949,0.626648,0.530992,0.425579
0.452948,0.458915,0.344854,0.35872,0.363055,0.384418,0.519702,0.541419,0.514737,0.593651,0.741703,0.971699,1.063813,0.965198,0.838364,0.848785,0.856029,0.699527,0.598944,0.565841,0.550126,0.514691,0.742756,0.977664,0.897311,0.797869,0.671833,0.546975
0.499781,0.449312,0.319204,0.35804,0.357316,0.345734,0.479935,0.50505,0.479581,0.5079,0.617432,0.867106,0.938993,0.861783,0.772016,0.765234,0.798915,0.674754,0.575911,0.543931,0.474705,0.471516,0.874482,1.206685,1.085526,0.949156,0.784435,0.646747
0.520606,0.450743,0.320897,0.35548,0.343661,0.296379,0.366995,0.38251,0.379407,0.376856,0.435473,0.609403,0.634912,0.604622,0.572517,0.582683,0.65654,0.568795,0.492099,0.492057,0.420024,0.414885,0.839474,1.203388,1.083038,0.9182,0.74359,0.6293
0.453769,0.395511,0.292805,0.322606,0.325608,0.27999,0.275804,0.279019,0.308627,0.28499,0.335105,0.483234,0.48581,0.46722,0.472608,0.484521,0.522477,0.455071,0.401813,0.409929,0.354181,0.329234,0.635701,0.941102,0.856732,0.682507,0.562866,0.511064
0.361357,0.335301,0.263299,0.290359,0.303186,0.289059,0.28326,0.300354,0.325168,0.270165,0.343682,0.534484,0.549624,0.488366,0.457035,0.452478,0.471314,0.449453,0.425529,0.378113,0.299087,0.297326,0.485934,0.622821,0.532664,0.419053,0.389167,0.413358
0.303114,0.310906,0.267817,0.286246,0.276014,0.293092,0.313176,0.334017,0.353352,0.299869,0.37558,0.543495,0.590165,0.56206,0.504369,0.45978,0.479584,0.496973,0.479163,0.397278,0.291544,0.316802,0.512649,0.537822,0.357692,0.272904,0.297263,0.399091
0.250324,0.274237,0.264021,0.283124,0.266743,0.294075,0.308082,0.310327,0.316087,0.296608,0.377848,0.459877,0.524959,0.564312,0.512969,0.425914,0.420395,0.47662,0.457519,0.377666,0.296345,0.327211,0.533205,0.552122,0.333056,0.229885,0.244462,0.36589
0.208781,0.228527,0.236917,0.243132,0.246642,0.30395,0.310534,0.278031,0.244724,0.270034,0.385185,0.364389,0.387822,0.464141,0.449742,0.361715,0.325084,0.413734,0.373055,0.291166,0.284958,0.31831,0.470114,0.485371,0.311913,0.235502,0.214381,0.289515
0.232974,0.243962,0.227348,0.206,0.216034,0.294278,0.336237,0.285967,0.204821,0.249123,0.366351,0.301428,0.277173,0.360768,0.403304,0.339963,0.266015,0.329387,0.269961,0.191589,0.25259,0.295252,0.390087,0.400042,0.278747,0.223242,0.185355,0.208759
0.27197,0.271429,0.222,0.182178,0.185537,0.26035,0.353796,0.312378,0.19101,0.213955,0.30263,0.253537,0.218897,0.323338,0.379316,0.318781,0.239497,0.260817,0.210288,0.147509,0.218365,0.278892,0.337628,0.311602,0.219978,0.193087,0.176444,0.154385
0.265077,0.25877,0.214795,0.167464,0.158709,0.217972,0.331522,0.316761,0.18277,0.162825,0.223474,0.198932,0.172286,0.281051,0.347989,0.296588,0.230136,0.208311,0.164213,0.12684,0.18323,0.264812,0.311995,0.244634,0.164907,0.158737,0.161981,0.119963
0.207125,0.192426,0.172924,0.137302,0.134815,0.173704,0.257664,0.266804,0.15698,0.115185,0.154517,0.143997,0.12835,0.216327,0.296657,0.26534,0.217429,0.202479,0.161406,0.14175,0.210674,0.277067,0.270723,0.184568,0.148923,0.167354,0.155086,0.116976
0.175464,0.125143,0.123318,0.113104,0.116234,0.152479,0.180973,0.180432,0.127176,0.103529,0.112432,0.114164,0.120663,0.161713,0.21095,0.202726,0.200121,0.238913,0.203472,0.195931,0.286304,0.283257,0.199362,0.142365,0.168556,0.198834,0.160437,0.134012
0.200189,0.108218,0.098322,0.103532,0.128589,0.162809,0.162353,0.146527,0.115733,0.120279,0.108116,0.114518,0.143387,0.136152,0.139315,0.159738,0.184027,0.254815,0.240942,0.252339,0.341263,0.266502,0.166858,0.155746,0.196596,0.209257,0.170804,0.181609
0.230011,0.127574,0.126053,0.129103,0.154571,0.175792,0.183327,0.181265,0.135266,0.133662,0.104915,0.111929,0.15683,0.125027,0.116383,0.145332,0.168749,0.234413,0.242307,0.273617,0.336278,0.228759,0.165849,0.182077,0.198357,0.184372,0.178582,0.239658
0.243427,0.162046,0.165167,0.161859,0.165087,0.169198,0.193012,0.210562,0.151471,0.130442,0.093768,0.096413,0.145377,0.118662,0.121285,0.143906,0.152279,0.187138,0.19779,0.236774,0.27064,0.185669,0.167922,0.182446,0.176218,0.159698,0.17642,0.266989
0.221099,0.180489,0.184263,0.173225,0.145642,0.150492,0.198463,0.207444,0.140925,0.106233,0.075783,0.076196,0.120213,0.123165,0.129223,0.131469,0.135971,0.157489,0.138838,0.155747,0.176261,0.134951,0.155351,0.162545,0.148176,0.157085,0.174299,0.242514
0.172529,0.169771,0.170334,0.158387,0.113008,0.118901,0.181452,0.168259,0.10598,0.075262,0.054633,0.069052,0.115828,0.130868,0.121637,0.116866,0.140157,0.158805,0.097719,0.077849,0.11005,0.118715,0.142715,0.151303,0.142298,0.170953,0.172188,0.175557
0.149155,0.160465,0.147668,0.140574,0.102735,0.091407,0.138369,0.11313,0.075351,0.066427,0.041871,0.077191,0.124633,0.128917,0.100909,0.098334,0.138925,0.170495,0.099417,0.053873,0.086603,0.133767,0.131695,0.134332,0.168621,0.200513,0.152936,0.10024
