-5.1e-05,-0.001012,9.4e-05,-6.6e-05,-0.000194,4.1e-05,-0.000366,-0.000152,-0.000782,-0.000114,-0.001182,-0.001764,-0.001075,-0.000163,0.000745,-0.000657,-0.000354,-0.000758,0.000314,4.6e-05,-0.000399,-0.000245,4.1e-05,-0.000204,-0.000257,-0.000242,-0.000713,-0.001218,-0.001152,-0.000964,-0.000592,-7.4e-05,-0.000138,-6.2e-05,-0.000479,-0.000266,5e-06,-0.000683,-0.000712,-0.000229,-0.000763,-0.000569,-0.000381,-0.000811,-0.00111,-0.000377,-0.000606,-0.000499,0.000289,-0.000181,-0.000166,-4e-06,1.9e-05,0.000226,-0.000615,-0.000895,-0.000215,-0.000214,-0.000434,-0.000224,8e-05,-0.000793,-0.000824,-0.000552,-0.000351,-7.3e-05,6.8e-05,-0.001395,-0.000111,-0.000183,-0.000816,-0.000967,-0.000597,-0.001274,-0.001039,-0.000885,-0.000331,0.000163,-0.000337,-3e-04,-0.000314,-0.000689,-0.000142,-0.000185,-0.000741,6.9e-05,-9.9e-05,-0.001218,-0.000623,-0.000631,-0.000147,0.00034,0.000292,0.000374,-0.000353,-0.00071,-0.000691,0.00012,0.000137,-0.001019,-0.000886,-0.000913,-0.000199,-0.001116,-0.000681,-0.000541,0.000132,-0.000358,-0.000787,0.000375,-0.000424,-0.000467,-2e-05,-0.000245,-0.000846,-0.000629,-0.000539,-0.000538,-0.000355,0.000645,0.000381
0.000547,0.000471,0.000213,-0.000254,0.000351,-0.000833,-0.000961,0.000181,-4.1e-05,-0.001179,-0.000276,0.001017,0.000498,-0.000998,-0.000711,-0.000348,0.000145,9.2e-05,-0.000685,-8e-05,-0.000189,-0.000239,-0.000209,-2.3e-05,-0.000612,-0.000329,-0.000194,-0.000231,0.000599,0.000356,-0.000785,-0.000599,-0.000817,-0.000969,-0.000364,-0.000134,-0.000651,-0.000189,-0.000745,-0.000231,-0.000159,0.000234,0.000353,0.000535,0.000153,0.000423,-9.8e-05,-0.000166,-0.000638,-0.000419,-0.00058,0.000143,-0.000587,-0.000644,-0.000686,2e-05,0.000109,0.000476,0.000582,-0.00036,-0.001206,-0.000656,-0.000218,-7.2e-05,-0.000364,-4.1e-05,-0.000179,0.000209,0.000518,-0.000626,8.2e-05,0.000659,-2.2e-05,0.000709,0.000102,-0.000421,-0.000622,-3.7e-05,0.000164,-0.000141,7.7e-05,-0.00035,0.000846,-0.000543,-0.000334,-0.000323,-0.000445,-0.000176,-4.9e-05,0.000888,3.2e-05,0.000215,0.000476,0.000197,0.000577,0.001409,0.000798,-0.000529,-0.000821,0.00049,-0.000175,0.000423,-0.001066,-0.000318,-5.6e-05,8.4e-05,-0.00037,-0.000561,-0.000535,-7.5e-05,-0.000266,0.000333,-0.000404,-0.000184,-0.000354,-0.000809,6.6e-05,0.000201,-0.000503,-0.000646,-0.00015
-0.000213,0.000201,0.000482,0.00029,6.3e-05,0.000367,0.000957,-1.3e-05,-0.000436,0.000504,1e-05,-0.000189,-0.000884,-0.000237,0.00013,-0.000227,-0.000311,0.000293,-0.000117,0.000176,3.4e-05,0.000124,0.000542,0.000625,0.000711,-0.001044,-0.000338,0.000466,-2.2e-05,-0.000313,-7.2e-05,-0.000311,0.000198,0.000657,-0.000218,-6e-05,0.00052,-0.000171,0.000316,0.00012,3.8e-05,-0.000585,-0.000511,-0.000874,-0.00046,-0.00013,0.000476,0.000179,-0.000376,-6.1e-05,-4.6e-05,-0.000319,-6.5e-05,-0.00016,0.000226,-0.000122,-0.000529,-0.000206,0.00049,-0.000523,-0.000647,-1.7e-05,-0.000784,-0.00036,-0.000788,-8.4e-05,2.6e-05,-0.000286,-0.000868,-0.001445,-0.000709,0.00017,-0.000133,-0.000412,6.3e-05,0.000296,0.000131,-0.000184,-0.000605,3.7e-05,9.6e-05,-0.000138,-0.000972,0.000218,1.7e-05,-0.000406,4.5e-05,-0.00019,-2.2e-05,-0.000308,0.000725,-4e-05,-0.00024,-7.1e-05,-0.000127,-0.000942,-0.000704,-5.1e-05,0.000165,-0.000469,-0.000187,-0.000603,-0.000496,-0.000117,6.1e-05,-0.000319,-7e-05,-0.000495,0.000169,-8e-05,-0.000229,-0.000648,1.6e-05,-0.000406,0.00023,-0.000186,-0.000263,0.000188,-0.000517,-0.000455,-3.4e-05
-0.000532,-0.000605,-0.000681,-0.00018,0.000181,-0.000237,-0.001383,-0.000642,0.00033,-0.000104,0.000134,0.000118,0.00063,0.000774,-0.000272,0.000223,-0.000125,-0.000233,-0.000769,-0.000458,-5.2e-05,-4.1e-05,-0.000504,-0.000251,-0.000132,0.000249,-8.3e-05,-0.000591,-0.000409,0.000271,-0.000356,-2.8e-05,-0.000147,8.9e-05,0.00013,-0.000176,0.000463,0.000734,-4.6e-05,-0.000152,6.2e-05,0.000412,-0.000459,-3e-05,-2e-06,-0.000652,-0.000272,0.000207,-0.000401,-0.000657,-0.000388,-3.7e-05,-6.5e-05,-0.000133,-0.000339,-0.000574,8.8e-05,-0.000421,-0.000215,0.00072,6e-04,4.5e-05,0.000673,-0.00047,0.000226,-0.000112,-3.9e-05,-0.000648,4.3e-05,0.000187,5.6e-05,-0.000458,-0.000652,-5.2e-05,-8.3e-05,-0.000271,4.4e-05,5e-06,0.000465,-3.4e-05,-0.000124,-0.000123,-0.000239,-6e-04,0.000275,0.000205,-0.000151,0.000312,-0.000408,-0.000116,-0.000471,-0.000747,-0.00044,-0.000641,-0.000323,-5.4e-05,-0.000382,-0.000257,0.000227,-0.000401,0.000554,0.000474,8e-06,0.000644,0.000389,0.000327,0.000155,0.00021,1.6e-05,-0.000421,-0.000668,-0.000387,-0.000178,-0.000443,-0.000128,0.000315,0.000293,0.000419,0.000496,-0.000359,-0.000205
-0.000513,-0.000165,-1.2e-05,-7e-06,0.00026,-0.000165,0.000622,0.000355,0.000142,-0.000204,0.000194,0.00041,-0.000956,-0.00057,-0.000991,-0.000528,-0.000278,-6.9e-05,0.000141,0.000435,0.000372,-4.7e-05,7.6e-05,-0.000356,-2e-04,-0.000769,-0.000347,0.000484,0.000576,-0.000234,0.000524,0.000422,0.000389,-0.000766,-0.000763,0.000212,-0.000473,-0.000667,-0.000413,-0.000581,-5.5e-05,-7.5e-05,0.000166,0.00025,0.000716,0.00051,-0.00062,-0.000665,-0.000179,-0.000368,1.2e-05,-0.000572,-0.000305,-0.000271,-0.000291,8.6e-05,0.000294,-0.000142,2.7e-05,-5e-05,8.9e-05,0.000248,0.000123,0.000719,-0.00041,-0.000104,0.000767,0.000216,0.000523,0.000229,0.00045,2.4e-05,0.000497,-0.000229,-0.000146,0.000213,-3e-05,-0.001032,-2e-06,0.000253,-0.000269,0.00026,9e-05,0.000121,-0.000651,-0.000314,-0.000196,-0.000149,-5.2e-05,-0.000294,-2.3e-05,-0.000283,0.000327,0.000221,0.000203,-0.000863,-0.00027,6.7e-05,-0.000581,-0.000183,3.4e-05,-0.000354,-0.000233,-0.000893,-0.000408,-0.000167,-0.000707,-0.000692,-0.000457,-0.000206,-0.000125,0.000239,-0.000741,7.9e-05,-0.000497,0.000113,-0.00037,-0.000335,-2.4e-05,-0.000138,-0.000623
5.8e-05,-0.00055,-0.000556,-0.000582,-0.000269,-9.6e-05,6.4e-05,-0.000118,-0.000531,0.000183,-0.000277,-0.000625,0.000168,0.000345,6.3e-05,-7.6e-05,-4.7e-05,-0.000166,-0.000447,0.000107,-0.000126,-0.000268,-0.000593,-0.000148,-0.000113,-0.000343,0.000269,-0.000451,-0.000506,-0.000142,0.000111,-0.000563,-0.000152,0.000153,0.000246,-8e-06,-0.000498,-0.000224,-0.000111,0.000501,-0.000266,6e-05,0.000307,0.000302,-0.000254,-0.000614,0.000144,-0.000336,-0.000179,-0.000246,0.000295,-0.000311,-0.000549,8.3e-05,-0.000515,-8.8e-05,-0.000151,0.000283,-0.000219,-1e-05,-0.00058,-0.000339,-7.5e-05,-0.000269,-4.8e-05,-0.000352,-0.000468,-0.000194,-0.000152,0.000253,8.6e-05,-0.000129,-0.000393,0.00013,-0.000596,-0.000257,-0.000523,0.000165,-0.000152,5.9e-05,-8.6e-05,6.4e-05,0.000295,-0.00034,0.000387,-0.000248,3e-06,-0.000382,-0.000464,1.2e-05,-0.00028,-0.000258,0.000189,-0.00013,0.000304,0.00042,-0.000386,-5e-05,-0.000671,-0.000133,-0.00027,-0.000117,0.000318,0.000194,0.000146,-3.3e-05,0.000261,-1.4e-05,-0.000135,0.000271,0.000298,0.000219,-9e-06,0.000447,3.7e-05,0.000149,5.3e-05,0.000191,-0.000134,0.000368,-0.000215
-0.000106,-1.1e-05,-0.000294,-0.000242,5.5e-05,-3.5e-05,-0.000203,-0.00036,2.1e-05,-5e-05,-0.000467,0.000399,-0.000127,0.00011,0.000609,-8.9e-05,-0.000273,-1.4e-05,-0.000408,-0.000391,-0.000394,-0.000389,5.2e-05,-0.000292,-0.000708,0.000104,-0.000141,0.000173,0,0.000255,-6e-06,-7.6e-05,-0.00025,0.000156,-0.000317,-0.000113,9.7e-05,0.000225,0.000297,0.000182,0.000225,-1e-05,-0.00025,0.000116,0.000101,0.000201,-0.000346,0.000163,0.000234,0.000621,0.000118,0.000167,9.9e-05,-7.5e-05,-0.000186,-0.000151,-2.9e-05,-8e-05,1.2e-05,4.1e-05,-0.000196,-0.00054,-0.000581,-0.000291,0.000231,0.000126,-0.000137,-0.000124,-1.6e-05,8.4e-05,-0.000381,-0.00048,2e-06,0.000265,0.000845,0.000227,9e-06,0.000254,0.000134,-0.000128,0.000269,5e-05,2.5e-05,0.000398,-0.000183,-1.8e-05,-0.000552,0.00021,0.000506,0.000193,-6.8e-05,2.8e-05,-0.000193,-4.3e-05,-0.000443,-0.000299,-3.2e-05,-0.000549,0.00015,-0.000121,-3e-05,3.8e-05,-0.000148,3e-05,0.00033,0.000133,-0.000201,0.000381,0.000566,-2.8e-05,0.000462,-2e-06,-0.000143,-5.3e-05,-0.000148,-0.000662,-0.000481,-0.000129,-9.4e-05,-0.000127,-0.000104
0.000212,4.9e-05,0.000287,5.8e-05,-6.2e-05,0.000186,0,4.7e-05,0.000118,-0.000218,0.000458,-1.2e-05,8.1e-05,-2.7e-05,-0.000125,-0.000337,3.5e-05,-0.000146,0.000518,5.3e-05,0.000461,0.000421,6.7e-05,0.000192,0.000557,0.000539,-3.5e-05,1e-04,0.000247,-0.000167,-0.000148,-1e-06,0.000141,-0.000284,0.000151,-0.000255,-0.000257,-0.000467,-0.000218,-6e-05,-0.000276,5.7e-05,6.4e-05,-1.5e-05,-0.000271,-4.2e-05,0.000356,-0.00015,-0.000367,4.8e-05,-0.000239,0.000108,0.000104,-0.00091,0.000193,-0.000265,-0.000488,-0.000243,-0.000395,-0.000456,0.000319,0.000165,0.000589,-9.3e-05,-0.000242,-0.000176,-5.3e-05,4.6e-05,-0.000102,-0.000447,-0.000297,0.000524,0.00046,-0.000107,-0.000218,-0.00021,0.000361,-5.8e-05,-0.000108,-0.000372,-0.000287,-7.8e-05,-0.000304,-0.000189,-0.000212,-6.4e-05,-0.000377,-0.000295,-0.000592,-0.00027,-0.000383,-0.000321,-7.7e-05,-0.000372,-0.000502,-0.000219,-5.2e-05,-3.1e-05,-4.8e-05,-1e-06,-7.2e-05,8.8e-05,2e-04,3.5e-05,-0.000365,-0.00017,0.000101,0.000107,8.7e-05,-2.8e-05,-0.000348,-0.000142,0.000332,5.7e-05,0.000356,0.000501,0.000106,0.000178,0.000309,-0.000394,0.000505
-0.000317,0.000171,-6e-06,-0.000231,-1e-04,0.000114,8.5e-05,0.000273,0.000157,-0.000211,-0.000325,-0.000252,4.1e-05,-0.000511,-0.000386,5.3e-05,0.00018,0.000252,-0.00042,-7.5e-05,-0.000193,-0.000138,-0.000141,-0.000104,-1e-04,0.000105,0.00024,-0.000142,-8e-05,0.000117,0.00012,0.000209,-0.000135,-9.6e-05,8.2e-05,-0.000105,0.000396,0.000103,-0.00021,-0.000225,3.1e-05,6.3e-05,-0.000123,-0.000252,1.1e-05,0.000218,0.000187,-5.1e-05,7.7e-05,0.000125,0.000252,-0.000166,7.1e-05,0.000281,4.1e-05,0.000416,0.000219,-4e-05,0.000211,0.000155,3.8e-05,0.000562,-0.000198,0.000266,0.000299,-0.000265,-0.000249,3.3e-05,-0.000304,0.00029,2.7e-05,-0.00063,-0.000255,0.000217,0.000175,-0.000218,-0.000249,-6.9e-05,-0.000216,-6e-05,-0.000141,-6.6e-05,8.8e-05,0.000147,0.000229,-0.000175,0.000385,0.000163,8.1e-05,0.000147,-1.3e-05,0.000273,-0.000472,-0.000128,-0.000151,-2.3e-05,0.000231,-0.000323,7e-06,0.00014,3.5e-05,8.5e-05,-0.000179,-0.000162,1.9e-05,-0.000152,-0.000142,-0.000259,-0.000283,4.5e-05,0.000154,-0.00026,5.1e-05,0.000136,5.7e-05,-0.000348,4e-05,-0.000342,-0.000469,-0.00012,-0.000255
0.000255,8.7e-05,-5.3e-05,0.000197,-5e-05,2.8e-05,-0.000283,7.4e-05,-1.2e-05,0.000169,8.1e-05,-5.8e-05,6.3e-05,6.3e-05,-8e-06,0.000297,-0.000282,-7.6e-05,0.000236,-9.1e-05,-0.000282,-0.000207,3.7e-05,3e-04,-5.3e-05,-2.6e-05,0.000131,9.4e-05,-5e-06,-0.000183,-4.2e-05,9e-05,5e-05,0,0.00019,-2.5e-05,-0.000131,-5.3e-05,0.000291,0.000211,0.000217,-9e-05,0.00015,-3.5e-05,-1.6e-05,0.000116,-0.000149,0.000192,0.000158,-0.000127,-0.000408,9e-05,-0.000145,0.000242,0,0.000143,-0.000159,8.3e-05,-0.000141,-0.000239,-1.3e-05,-0.000158,0.00014,0.000101,-4.4e-05,3e-04,-1.8e-05,0.000426,0.000104,-0.000201,4.8e-05,0.000462,0.000243,-0.000406,-0.000115,0.000331,-5.4e-05,-4.8e-05,-0.000109,9.3e-05,-0.000205,-6.8e-05,-0.000175,-8.9e-05,1.5e-05,0.000147,0.000174,6.1e-05,0.000126,-9e-05,-2.2e-05,-0.000151,0.000106,5.4e-05,-0.000152,-0.000148,-9.5e-05,0.000328,0.000219,0.000105,0.000102,6.9e-05,0.000116,0.000118,-1.7e-05,-2.3e-05,-8e-06,0.000296,-3.4e-05,9.5e-05,0.000129,-0.000178,-0.000202,-0.000256,-0.00017,-0.000116,5.2e-05,1.9e-05,0.000239,0.000251,0.000311
-0.00017,7.9e-05,0.000225,0.000114,-0.000155,5.2e-05,1e-05,2.9e-05,0.000103,0.000237,0.000151,0.000145,-6e-05,-5e-05,0.000298,0.000123,0.000367,8.3e-05,-2.9e-05,4.4e-05,-0.000152,-6.7e-05,0.000107,-3e-06,0.000192,1.5e-05,-0.000269,-0.000209,1.9e-05,9.5e-05,-7.9e-05,2.6e-05,-0.000245,0.000175,-0.000108,0.000342,-1e-06,0.000266,1.1e-05,-0.000147,-4.4e-05,-5.7e-05,2.4e-05,7.5e-05,8.4e-05,-0.000133,6.5e-05,-7.4e-05,0.000227,5e-05,-0.000233,-0.000348,9.9e-05,4.9e-05,0.000292,-3.5e-05,0.000236,2.4e-05,-0.000169,2.1e-05,0.000205,7e-06,-6.9e-05,-6.5e-05,-5.2e-05,0.00034,0.00011,-0.000136,2.1e-05,0.000299,0.000207,-0.000161,-1.7e-05,0.000208,0.000112,-6e-05,0.000194,0.000212,0.000205,-6.1e-05,0.000113,4.2e-05,0.00055,4.6e-05,0.000375,-0.000117,-7.1e-05,-9e-06,0.00021,3.9e-05,0.000103,7.5e-05,-0.000149,6.3e-05,0.000339,6.3e-05,8e-06,8.8e-05,-0.000236,-6.7e-05,-6.4e-05,-0.000166,5.2e-05,-2.8e-05,6.3e-05,9e-05,4.5e-05,-0.000119,-0.00012,-0.000229,-0.000171,0.000112,-4.1e-05,-0.000288,-0.000146,5.6e-05,-0.00018,3.7e-05,-3.8e-05,-9.1e-05,-0.000285
0.000169,-0.000131,0.000113,8.2e-05,2.4e-05,8.9e-05,3.4e-05,-0.000111,-0.000225,-3.7e-05,-0.000105,-7.7e-05,9e-05,0.000177,3.1e-05,-0.000135,7e-05,-0.000164,0.000121,4e-06,-7.7e-05,7e-06,9.8e-05,2.2e-05,-6e-05,2.4e-05,0.000115,-5.1e-05,5.5e-05,-2.1e-05,9.3e-05,-7.8e-05,0.000161,2.5e-05,3e-06,-0.000192,2e-06,7.7e-05,-1.7e-05,6e-06,-0.000161,-8.2e-05,-6.1e-05,-1.8e-05,-3e-05,-5.2e-05,-0.000175,0.000115,-0.000253,-9e-06,0.000159,1.5e-05,-9e-05,-7e-06,-0.000274,-0.00015,-9e-06,2.5e-05,5.9e-05,2.4e-05,-0.000138,-1e-06,-0.000149,-0.000145,4e-05,-0.000104,4.6e-05,-2e-06,-5.8e-05,-0.000224,-2.8e-05,2.3e-05,-5.3e-05,-0.000148,-0.000227,9.1e-05,-0.00024,-3e-06,-4e-06,-6.3e-05,9.4e-05,-2.6e-05,-0.000286,-5.5e-05,-0.000285,-2.5e-05,-3.2e-05,-0.000137,-6.8e-05,-2.8e-05,0.000135,3.5e-05,3.9e-05,0.000102,6.2e-05,0.000135,-3e-05,9.4e-05,0.000149,4.2e-05,-0.000264,0.000169,-0.000214,-7.3e-05,0.00011,-0.000109,-8.5e-05,-3e-06,5.1e-05,-9.5e-05,3.9e-05,0.000162,5.1e-05,1.4e-05,0,0.000122,-2.7e-05,-0.00016,-5.2e-05,-1.3e-05,8.2e-05
0.000248,5.6e-05,-5.6e-05,6.6e-05,2.9e-05,5.8e-05,-1.6e-05,-6.4e-05,0.000191,-5.7e-05,-8.7e-05,3.6e-05,1.5e-05,-5.9e-05,1.2e-05,-5.7e-05,-8e-05,5.2e-05,4e-06,-1e-05,7e-05,1e-06,4.3e-05,-4.2e-05,2.2e-05,1.5e-05,3.7e-05,6e-05,4.8e-05,1.3e-05,-4.4e-05,-4.3e-05,-5.4e-05,-0.000165,-3.9e-05,0.000103,-1e-05,-3.5e-05,0.000126,-0.000105,8.9e-05,2.4e-05,3e-05,-2.9e-05,8e-06,6.4e-05,0.000182,-8.2e-05,0.000153,4.7e-05,0.000104,0.000103,5e-05,4.5e-05,0.000158,-1e-06,-7.6e-05,-2.4e-05,0.00013,3.2e-05,2e-05,4.1e-05,0.000202,0.000197,-4.8e-05,-0.000158,1.1e-05,-5e-06,4.4e-05,0.000143,6.5e-05,-8e-05,-6.9e-05,-9.6e-05,0.000175,-6.8e-05,0.000209,-0.000128,-2.1e-05,0.000121,2.5e-05,-6e-06,8.1e-05,4.4e-05,4e-06,0.000126,9.5e-05,0.000154,-0.000112,8e-05,-2.1e-05,0.000106,0.000274,0.000104,1.4e-05,3e-06,-2.7e-05,0.000135,0.000137,1e-06,0.000143,6.3e-05,5.8e-05,8.3e-05,-0.000136,3.8e-05,5.7e-05,3.6e-05,-6.3e-05,0.000169,5.5e-05,-2.3e-05,5.5e-05,-4.7e-05,-1.6e-05,1e-05,-4.8e-05,-6.6e-05,6e-06,8.8e-05,0.000158
-0.00026,-1.3e-05,-1.6e-05,-0.000154,5e-06,-2.7e-05,2.8e-05,8e-05,-9.6e-05,-4.1e-05,9.4e-05,-6.2e-05,2.7e-05,0.000168,-3.1e-05,3e-06,-7e-06,0.000101,6e-06,6.3e-05,0.000105,4.9e-05,-0.000136,4.1e-05,-2.3e-05,2.6e-05,1.3e-05,0.000205,-0.000143,-2.1e-05,1.6e-05,5.2e-05,-7e-06,4.1e-05,-5.3e-05,0.000166,0.000149,-7.7e-05,-5.3e-05,4.1e-05,-5.6e-05,7e-06,7.9e-05,-3.4e-05,-8e-06,8.2e-05,-7.5e-05,-0.000146,8.5e-05,-9.4e-05,1e-05,7.2e-05,-1e-05,8.5e-05,0.000119,7.2e-05,0.000195,-8e-06,0.000121,-1.1e-05,5e-06,-0.000148,-4e-06,-0.000104,4.9e-05,-4.1e-05,-2.8e-05,4.7e-05,0.00012,-8.6e-05,-6.3e-05,0.000156,-1.8e-05,6.3e-05,-1.7e-05,-2.1e-05,3.7e-05,3.5e-05,5.1e-05,4e-06,-1.4e-05,-5.7e-05,9.2e-05,8e-06,-6.4e-05,-2.6e-05,-2.2e-05,-9e-05,3.5e-05,-9e-06,-8e-05,-6.1e-05,-9.8e-05,-1e-06,1.1e-05,4.1e-05,8.3e-05,6e-06,3.9e-05,3e-05,5e-06,-1.1e-05,5e-06,-4.5e-05,-1.2e-05,8.1e-05,-7e-06,-1.6e-05,0.000129,8.2e-05,-4.7e-05,-1.2e-05,0.000118,5.9e-05,4.1e-05,1.8e-05,5.9e-05,4.3e-05,2.6e-05,6.1e-05,7e-05
2.1e-05,0.000107,-3.5e-05,7.5e-05,0.000112,1.2e-05,1e-06,7.2e-05,-3.4e-05,8e-06,1.5e-05,3.9e-05,2.5e-05,-5.8e-05,-2.5e-05,6.6e-05,-1e-05,-1.9e-05,-5e-06,-4.3e-05,9.7e-05,-5e-06,3.6e-05,1.9e-05,-6e-06,-2.1e-05,-1e-04,-8.4e-05,7.5e-05,-6e-06,-2.7e-05,-4.8e-05,0.000101,2.3e-05,0.000102,-1.5e-05,2.2e-05,-3.3e-05,-1.7e-05,-1e-06,5.1e-05,5.9e-05,-4e-05,7.3e-05,7e-06,-2.9e-05,-3.2e-05,8.4e-05,-0.000132,-6.1e-05,-1e-06,-0.000102,1.2e-05,-0.000159,-6e-05,-3.7e-05,-4.6e-05,5.7e-05,-7e-05,0.000101,0,0.000102,-7.1e-05,-4.1e-05,-5.5e-05,1.9e-05,7.4e-05,-3.2e-05,2.1e-05,-7.2e-05,-4.4e-05,4.5e-05,3.5e-05,-5.4e-05,3.4e-05,-4.8e-05,-7.3e-05,6.6e-05,-4e-06,-5.1e-05,-6.8e-05,2.7e-05,-8e-05,-4.9e-05,1e-05,5.4e-05,-8.2e-05,2.7e-05,-2.8e-05,-5.5e-05,1.8e-05,3.8e-05,0.000145,1e-06,4.6e-05,-1.1e-05,1.4e-05,-4.1e-05,4.2e-05,-3e-06,-4e-06,-4.5e-05,1.1e-05,-1.3e-05,-2e-06,-1e-04,1.6e-05,-1.2e-05,-0.000101,-9e-06,5.1e-05,7.4e-05,8e-06,-3.1e-05,1e-05,2e-06,2.4e-05,8.3e-05,-3.9e-05,-3e-05,-4.8e-05
7.3e-05,-2.6e-05,-3.4e-05,-2.7e-05,-1.1e-05,-1e-05,4.2e-05,1.3e-05,7.9e-05,-1e-05,-4.5e-05,-9e-06,-6e-05,6.1e-05,6.9e-05,-3.4e-05,-1.8e-05,-3e-05,-7.2e-05,5.6e-05,-1.1e-05,4.4e-05,0.000108,-1.4e-05,5e-06,-2.8e-05,2.1e-05,9e-06,-1.2e-05,9.1e-05,2.1e-05,7.9e-05,-3e-05,8.5e-05,5e-06,-0.000113,-8e-05,2.9e-05,-1.5e-05,-8e-06,-5e-06,-8e-06,-4.6e-05,-5e-06,6e-06,1e-06,8e-06,6e-06,6e-05,-2.5e-05,5.8e-05,8.8e-05,-2.1e-05,-1.8e-05,-8e-06,2.6e-05,-4.2e-05,-6.8e-05,-5.7e-05,4.3e-05,1.9e-05,1e-05,8e-06,5.2e-05,-4e-06,8.6e-05,1.4e-05,1e-06,-1.2e-05,8.4e-05,4e-06,-7.2e-05,5e-06,4.2e-05,-2.9e-05,-2.6e-05,-2.2e-05,-3.1e-05,-1.3e-05,2.3e-05,7.2e-05,1.2e-05,-4.5e-05,1.7e-05,9.7e-05,-3.6e-05,0.000107,-1e-06,2.1e-05,-8e-06,-5e-06,-3.5e-05,-1.7e-05,-1.8e-05,-4.4e-05,-2e-05,-2.6e-05,-8.2e-05,-0.000109,1.1e-05,6.7e-05,-2.5e-05,1.1e-05,1.4e-05,-4e-06,3.7e-05,-1e-05,1.3e-05,1e-04,-5.8e-05,-1.4e-05,-5.6e-05,-7e-05,4.1e-05,-1.9e-05,-0.00011,2e-05,4.1e-05,3.8e-05,-2e-06,-6.6e-05
3.2e-05,-1.5e-05,3.7e-05,7e-06,0,-2.8e-05,1.8e-05,-1e-05,-5.5e-05,-1.4e-05,5.4e-05,2.6e-05,7.9e-05,-2.6e-05,-8.4e-05,3.3e-05,-3.4e-05,3e-06,6e-05,-2e-05,1.3e-05,-2.1e-05,1.8e-05,-3.5e-05,-2.8e-05,1e-05,3.5e-05,2.9e-05,9e-06,-9.8e-05,-1.3e-05,-8e-06,9e-06,-4.6e-05,5e-06,2.9e-05,-2.8e-05,3.1e-05,-7e-06,1.5e-05,9e-06,-2e-05,1.6e-05,1.4e-05,-1.4e-05,-3.6e-05,1.4e-05,2.9e-05,-3e-05,3e-05,-5e-06,-7.2e-05,3e-06,1.8e-05,-1.3e-05,5.8e-05,3e-06,3.9e-05,-1e-05,2.9e-05,1.7e-05,-3.9e-05,1e-05,-2.2e-05,4.3e-05,-3.9e-05,-7.8e-05,3.6e-05,-1e-06,-4.9e-05,8e-06,-2e-06,-3.8e-05,1.3e-05,-1.2e-05,2.9e-05,-1.8e-05,2.4e-05,-3e-06,1.2e-05,4.6e-05,-9e-06,1.9e-05,-2.5e-05,-5e-05,-3.4e-05,5.7e-05,1.8e-05,-7.7e-05,3e-05,-9e-06,2.6e-05,-7e-06,-1.6e-05,-3.3e-05,1e-05,-2.4e-05,2.8e-05,-2.3e-05,-3e-06,-4e-06,-4.4e-05,-3.8e-05,-1.9e-05,1.8e-05,1e-05,-1.3e-05,-3.3e-05,2.6e-05,5.4e-05,-2.8e-05,-3.9e-05,-1.2e-05,3.9e-05,-2e-06,2e-05,-7e-06,-4.6e-05,-8e-06,3.8e-05,2.5e-05
-5.8e-05,-4e-05,4.3e-05,1.6e-05,-1.6e-05,-3e-06,-1.8e-05,-1.2e-05,6e-06,1.1e-05,-5e-05,-3.4e-05,-4.1e-05,-4.8e-05,-1e-06,1.9e-05,0.000104,7e-06,-4.1e-05,-6e-06,-1.1e-05,1.7e-05,-1.1e-05,-9e-06,2.4e-05,1.2e-05,-3.7e-05,-2.6e-05,3.6e-05,6.1e-05,1.2e-05,-3e-05,-2.1e-05,-3.3e-05,-3.9e-05,-2.7e-05,-1.5e-05,6e-06,4e-05,0,1.3e-05,1.7e-05,3.5e-05,-1.2e-05,3e-06,-1.9e-05,-2.2e-05,-6e-06,3.5e-05,-3.5e-05,-5.2e-05,2.1e-05,0,6.6e-05,1e-06,-1.4e-05,-9e-06,-7e-06,3.3e-05,-3.2e-05,-3e-06,-2.7e-05,-7.6e-05,5e-06,-4.4e-05,3e-06,3.3e-05,9e-06,-1.7e-05,2e-05,2e-05,-4.6e-05,-1.9e-05,-7e-06,-3.5e-05,2e-06,3.4e-05,-6.8e-05,-2.4e-05,-9e-06,-2.4e-05,1e-05,3.8e-05,1.8e-05,5.2e-05,1.9e-05,-2.2e-05,-5e-06,1.2e-05,2.5e-05,1e-06,-3e-06,-4.2e-05,1.2e-05,4.9e-05,-1.1e-05,3.4e-05,-4e-06,2.7e-05,0,2e-05,2.5e-05,5.2e-05,-1.2e-05,-1.7e-05,-1e-06,2.8e-05,3.2e-05,1.9e-05,-1e-06,8e-06,7e-06,3.3e-05,7e-06,1.5e-05,-1e-05,-3.9e-05,-4.1e-05,-3.4e-05,1.4e-05,-3e-06
1e-06,5e-06,-2.5e-05,1.4e-05,-3.5e-05,-1.7e-05,2e-05,-1.6e-05,8e-06,2.7e-05,-1.5e-05,2e-06,2e-05,-1.7e-05,-8e-06,-1.6e-05,-3.9e-05,-1e-05,4.5e-05,1.2e-05,-8e-06,-2e-05,-2e-05,1.2e-05,-1.9e-05,-7e-06,-2.3e-05,1.8e-05,1e-05,-7e-06,-6e-06,1.3e-05,7e-06,3.6e-05,4e-06,-6e-06,2.4e-05,1.5e-05,6e-06,3.7e-05,-1e-06,-5e-06,-5.4e-05,1.5e-05,-1e-06,6e-06,2.4e-05,-7.7e-05,1e-06,-9e-06,1.2e-05,2.2e-05,1e-05,-6e-06,1.6e-05,-5.5e-05,1.1e-05,1.5e-05,2e-06,-2.5e-05,-1e-06,1.2e-05,4.6e-05,-2.7e-05,2.1e-05,1.1e-05,-2.4e-05,-5.4e-05,-1.7e-05,2.1e-05,2e-05,4.6e-05,4e-06,3.2e-05,6.1e-05,3.7e-05,-2.1e-05,3.1e-05,3e-06,-1.8e-05,-6e-06,-7e-06,-4.6e-05,-7e-06,-2.9e-05,-2e-06,-7e-06,2e-06,6e-06,-2.6e-05,4.9e-05,1.2e-05,-2e-06,1.7e-05,1.4e-05,2.1e-05,-2.4e-05,4.9e-05,1.1e-05,5e-06,-5.3e-05,1.2e-05,-1.6e-05,5e-06,2.1e-05,2e-06,-8e-06,-2.1e-05,1e-05,-3.4e-05,-8e-06,-1e-05,4.4e-05,1.1e-05,2.5e-05,-9e-06,-5e-06,-4e-06,3.5e-05,-1.2e-05,6.7e-05
2e-06,1.8e-05,-3.5e-05,-1.7e-05,-9e-06,-1.5e-05,-1.3e-05,-1e-06,-2e-06,2e-06,2.1e-05,3e-06,-5e-06,-2.5e-05,2.4e-05,-2.7e-05,-3.1e-05,1.5e-05,-3.3e-05,-1.2e-05,-2.6e-05,1.2e-05,0,6e-06,1e-05,-9e-06,3.6e-05,1e-06,-4.9e-05,-3.1e-05,-2e-06,-5e-06,-2.3e-05,1.5e-05,0,1.4e-05,3.3e-05,-1.4e-05,-1e-05,-1.7e-05,-3e-05,4e-06,1.6e-05,2e-06,7e-06,1.4e-05,-6e-06,1.6e-05,-9e-06,-3.6e-05,-4e-05,-2.2e-05,-5e-06,-3.5e-05,8e-06,1.5e-05,-1.8e-05,-1.4e-05,1.1e-05,-7e-06,9e-06,-1.2e-05,1.2e-05,4.8e-05,-3e-06,3.8e-05,7e-06,-8e-06,5e-06,-1.3e-05,8e-06,0,-4e-06,-1e-05,-3.7e-05,-2.2e-05,4.4e-05,2.8e-05,1.1e-05,1.1e-05,-6e-06,1e-06,1.9e-05,-4e-06,-3.1e-05,-6e-06,1.7e-05,-1e-05,3e-06,-1.3e-05,-1.9e-05,-7e-06,2e-06,3e-06,1.2e-05,-3e-06,1.4e-05,1.1e-05,2.8e-05,1e-06,1.6e-05,-3.6e-05,1.7e-05,-2e-06,2.5e-05,-7e-06,-3e-06,-6e-06,-3.9e-05,-1e-05,-1.4e-05,5e-06,-2.2e-05,1.5e-05,-1e-06,1.2e-05,-5e-06,2.8e-05,-8e-06,-3e-06,-6e-05
1.9e-05,2.9e-05,1.4e-05,-1.2e-05,6e-06,-9e-06,5e-06,2.2e-05,-9e-06,-1.9e-05,-1e-06,1.4e-05,-4e-06,3.4e-05,2e-06,-1.1e-05,2.8e-05,1e-05,1e-05,7e-06,-2.1e-05,-1.8e-05,2.6e-05,-2e-06,-2e-06,-8e-06,-9e-06,-2.3e-05,1e-06,3.5e-05,9e-06,-1.7e-05,1.8e-05,5e-06,1.4e-05,3e-06,-1.2e-05,-3e-06,-1.2e-05,7e-06,2.1e-05,-5e-06,6e-06,-1.6e-05,-5e-06,-3e-06,-1.9e-05,1.3e-05,-9e-06,2.4e-05,-4.4e-05,-2.2e-05,0,3.9e-05,-7e-06,3.3e-05,4.6e-05,4e-06,-1e-05,-5e-06,-2e-05,-2.2e-05,-3.1e-05,-3.6e-05,-1.5e-05,-8.8e-05,8e-06,2.4e-05,-4e-06,1.6e-05,-2e-06,4e-06,4e-06,9e-06,9e-06,-1.2e-05,-5.1e-05,-2.9e-05,-1e-06,1e-05,2.1e-05,4e-06,4e-06,-9e-06,-7e-06,1.6e-05,1.7e-05,1.3e-05,-3.4e-05,1.9e-05,-2e-06,1.1e-05,8e-06,1.3e-05,1.3e-05,5e-06,-3e-06,1.2e-05,-3.4e-05,1e-06,2e-06,2e-06,-6e-06,-1.3e-05,-2.1e-05,-1.9e-05,2e-06,-1e-06,2.5e-05,1.3e-05,1.1e-05,9e-06,-1.2e-05,-1.7e-05,-1.3e-05,2.2e-05,1.9e-05,-1.8e-05,-1.1e-05,2.1e-05,2e-06
8e-06,-1.6e-05,-3e-06,5e-06,4e-06,-7e-06,-7e-06,8e-06,1.1e-05,-1.4e-05,-4e-06,-6e-06,6e-06,-2e-06,-1.3e-05,1.8e-05,-2.1e-05,-4e-06,-5e-06,0,-8e-06,3e-06,1.2e-05,-7e-06,-6e-06,-8e-06,-1.9e-05,-1.3e-05,1.8e-05,-2.3e-05,-8e-06,3.7e-05,-9e-06,-2.4e-05,1.1e-05,3e-06,-2e-05,-1.9e-05,1.1e-05,-5e-06,5e-06,-6e-06,8e-06,-2e-06,6e-06,-2e-06,1.6e-05,-1.1e-05,1.3e-05,1e-06,6e-06,1e-06,0,-4e-06,-1.4e-05,4e-06,-1.5e-05,4e-06,4e-06,5e-06,1.8e-05,3.5e-05,1.1e-05,1.4e-05,2.1e-05,6e-06,2.3e-05,-1.6e-05,9e-06,-6e-06,-1.6e-05,-9e-06,1e-06,-9e-06,-4.4e-05,-8e-06,1.9e-05,0,1.2e-05,-4e-06,1.9e-05,-1e-05,-3e-05,1.3e-05,-5e-06,-7e-06,-1.4e-05,-3e-06,-2e-06,1e-05,-8e-06,-4e-06,2.1e-05,-4e-06,-3e-06,1.4e-05,9e-06,-1.7e-05,-1.2e-05,1e-06,-1e-06,-2.6e-05,3e-06,1.3e-05,-1.4e-05,2.2e-05,-3e-06,-5e-06,-1e-05,6e-06,-1.6e-05,1.9e-05,-1.6e-05,-3.2e-05,-1.2e-05,3e-06,4e-06,-1.1e-05,1.3e-05,2e-06,-1.5e-05
-2.5e-05,-2e-05,-9e-06,-2.8e-05,1.7e-05,-9e-06,1.2e-05,-1.3e-05,-2e-06,1e-06,1.8e-05,-7e-06,0,2.4e-05,-2.2e-05,1.7e-05,-6e-06,-1.2e-05,-7e-06,-1e-06,1e-06,1e-05,-1.9e-05,-2e-06,-2e-06,0,0,1.9e-05,-5e-06,5e-06,5e-06,-1.3e-05,9e-06,-2e-06,-8e-06,2e-05,-2e-05,-1.4e-05,0,1.1e-05,0,-8e-06,-1.8e-05,5e-06,-7e-06,-9e-06,-1.4e-05,2.2e-05,-8e-06,1.8e-05,2e-05,-2e-06,2e-06,-3.8e-05,2e-06,-1.8e-05,-1.5e-05,1e-06,-7e-06,2e-05,-2e-06,3e-06,7e-06,-1.3e-05,-2.1e-05,1.7e-05,-2.9e-05,-2.1e-05,1.3e-05,0,-1e-05,8e-06,-1e-06,-1.2e-05,3.2e-05,-1.8e-05,7e-06,-1.1e-05,-5e-06,-4e-06,-2.4e-05,-2e-06,3.8e-05,-6e-06,4.6e-05,-4e-06,2.9e-05,2e-06,0,-1.7e-05,-1e-05,1e-06,-1e-06,-1e-06,-1.1e-05,-1e-05,-2.8e-05,-1.7e-05,-3e-06,-2e-06,9e-06,5e-06,1.4e-05,-4e-06,-1.2e-05,-5e-06,6e-06,-1e-06,8e-06,-2.7e-05,-1e-06,-7e-06,1.9e-05,6e-06,2e-06,-1.1e-05,-1.6e-05,6e-06,-2e-06,-8e-06,2.2e-05
5e-06,-1.2e-05,1.6e-05,2.9e-05,8e-06,-6e-06,-5e-06,-5e-06,-9e-06,3e-06,-1.1e-05,2e-06,-5e-06,4e-06,2.7e-05,-9e-06,-4e-06,-2e-06,8e-06,7e-06,2.6e-05,-5e-06,-6e-06,-5e-06,7e-06,1e-06,2.5e-05,-3e-06,-2e-06,1e-06,0,-4e-06,-5e-06,2.7e-05,3e-06,-2.8e-05,3e-06,1.6e-05,-4e-06,-8e-06,7e-06,1e-06,0,-3e-06,2e-06,1e-06,2.5e-05,-2.2e-05,1e-06,-1.8e-05,1.1e-05,1.4e-05,-3e-06,2e-06,-6e-06,9e-06,2.5e-05,0,1.8e-05,5e-06,-6e-06,-3e-05,-2.1e-05,2.5e-05,1.4e-05,3.9e-05,2.1e-05,0,-5e-06,-4e-06,-5e-06,-8e-06,1e-06,7e-06,-1.7e-05,1.7e-05,-1.1e-05,2.6e-05,7e-06,8e-06,-2e-06,1e-06,-2.7e-05,4e-06,-4e-06,1e-05,2.8e-05,2e-06,5e-06,-3e-06,1.1e-05,2e-06,3.9e-05,0,-1.1e-05,4e-06,2.9e-05,-1.8e-05,2e-06,-1e-06,-9e-06,9e-06,-1.9e-05,-1e-05,1.9e-05,-7e-06,-6e-06,7e-06,-2e-05,7e-06,6e-06,2e-06,1.9e-05,-3e-06,1e-05,4e-06,-6e-06,8e-06,-8e-06,3e-06,3e-06
-8e-06,1e-05,-5e-06,-1.3e-05,3e-06,2e-06,1e-05,0,1.8e-05,3e-06,-2.1e-05,7e-06,0,1.5e-05,-1e-05,-5e-06,1.9e-05,4e-06,-1.4e-05,-6e-06,2.3e-05,1.1e-05,1e-05,3e-06,-3e-06,-5e-06,-8e-06,3.5e-05,4e-06,-1e-06,-2e-06,8e-06,5e-06,0,-1.1e-05,-1.2e-05,1.6e-05,1.2e-05,1e-06,-7e-06,-1.2e-05,4e-06,1e-05,-1e-06,-4e-06,6e-06,-1.7e-05,-6e-06,-4e-06,9e-06,-1e-05,1e-06,2e-06,1.9e-05,-4e-06,1.2e-05,-3.4e-05,-3e-06,2e-06,7e-06,7e-06,1e-06,1.4e-05,-2e-05,-2e-06,-8e-06,-7e-06,1e-05,-1e-06,1.4e-05,6e-06,-2e-06,5e-06,-1.3e-05,2.5e-05,-6e-06,1.3e-05,-8e-06,-8e-06,2e-06,9e-06,-4e-06,-1.3e-05,-3e-06,0,-1.1e-05,-1.1e-05,2e-06,-8e-06,1.1e-05,0,-3e-06,-3.5e-05,-5e-06,6e-06,-2e-06,-1.4e-05,2e-06,1.4e-05,-1e-06,1e-05,1e-06,1.4e-05,6e-06,8e-06,8e-06,2e-06,-1.2e-05,9e-06,1.8e-05,-7e-06,-1e-06,-3e-06,-7e-06,3e-06,-2.2e-05,-5e-06,4e-06,8e-06,9e-06,5e-06
1.2e-05,9e-06,-1.1e-05,1.5e-05,6e-06,-1e-06,-1e-06,-3e-06,-1.7e-05,1e-06,1.6e-05,-2e-06,3e-06,-1.8e-05,1.1e-05,-3e-06,-1.6e-05,1.3e-05,1.5e-05,2e-06,1.1e-05,-9e-06,9e-06,0,-3e-06,-5e-06,-1.7e-05,-1e-06,-1e-06,1e-06,1e-06,-1.3e-05,1e-06,-8e-06,7e-06,1.2e-05,1.1e-05,7e-06,-5e-06,2e-06,-1e-06,-1e-06,-2e-06,3e-06,3e-06,2e-06,1e-06,1.1e-05,5e-06,3e-06,1.4e-05,-2.6e-05,-1e-06,1.8e-05,1.1e-05,-2.3e-05,1.5e-05,5e-06,-1.5e-05,2e-06,-5e-06,8e-06,1e-05,4e-06,-1e-05,-1.9e-05,-1.7e-05,-2.1e-05,3e-06,-1.6e-05,1e-05,4e-06,-3e-06,6e-06,-2.2e-05,2.8e-05,-3e-06,-1.2e-05,-2e-06,-8e-06,5e-06,2e-06,3e-05,-1e-06,-2.1e-05,6e-06,-1.1e-05,-2e-06,-1e-05,6e-06,7e-06,3e-06,-1e-06,-3e-06,-6e-06,3e-06,5e-06,6e-06,-1.3e-05,0,-1.3e-05,-1.4e-05,-3e-06,-4e-06,-1.1e-05,-1e-06,5e-06,4e-06,9e-06,-6e-06,1e-06,-1e-05,-1.4e-05,-2e-06,-5e-06,-9e-06,1e-06,-8e-06,-1e-06,-4e-06,-2.3e-05
1.2e-05,9e-06,1e-05,-1.4e-05,-1e-05,1e-06,6e-06,4e-06,6e-06,3e-06,-5e-06,-2e-06,-1.2e-05,-1e-06,-2.8e-05,-3e-06,-3e-06,-5e-06,-1.5e-05,2e-06,-7e-06,1.3e-05,-5e-06,5e-06,3e-06,-2e-06,1.8e-05,-1.5e-05,-6e-06,-3e-06,1e-06,4e-06,-2e-06,-1e-05,0,-2e-06,-7e-06,-2e-06,1e-05,1e-06,1e-05,8e-06,-5e-06,-1e-06,-1e-06,-3e-06,1e-06,-2.6e-05,-8e-06,1.8e-05,9e-06,1.4e-05,-2e-06,-2e-05,-1.4e-05,-2e-06,2e-06,0,-1e-05,-5e-06,-4e-06,-5e-06,-2e-05,6e-06,1.4e-05,-2e-05,7e-06,-1e-05,-6e-06,1.5e-05,6e-06,9e-06,5e-06,-6e-06,1.3e-05,-1.6e-05,-8e-06,2e-06,-2e-06,-1e-06,5e-06,1e-06,-7e-06,0,-5e-06,2e-06,1.2e-05,2e-06,1.3e-05,-1.4e-05,-5e-06,-1e-06,1.3e-05,4e-06,7e-06,4e-06,-1.1e-05,1e-05,-1.4e-05,0,1.4e-05,4e-06,2e-06,-8e-06,6e-06,0,-8e-06,2e-06,1.7e-05,-1.2e-05,4e-06,-7e-06,-1.3e-05,1.6e-05,-8e-06,4e-06,5e-06,3e-06,-5e-06,-3e-06,-6e-06
-1.9e-05,-8e-06,-1e-06,4e-06,-7e-06,3e-06,-4e-06,3e-06,6e-06,1e-06,-1e-06,-3e-06,1e-05,-2.1e-05,1.6e-05,-2e-06,1.6e-05,-6e-06,1.2e-05,-8e-06,-6e-06,-1.4e-05,-1.3e-05,-4e-06,-3e-06,0,4e-06,0,3e-06,1.1e-05,-1e-06,7e-06,1e-06,8e-06,8e-06,-1e-05,-1e-05,-1.5e-05,-6e-06,3e-06,-7e-06,-2e-06,-3e-06,4e-06,3e-06,-2e-06,-6e-06,1e-05,5e-06,-8e-06,-2.4e-05,-1e-05,0,-1e-06,-5e-06,2.1e-05,-6e-06,2e-06,5e-06,-4e-06,-1e-06,1.3e-05,1.8e-05,-2e-06,-1.2e-05,3.1e-05,1e-05,9e-06,-4e-06,2e-06,-1e-06,-1.1e-05,2e-06,2e-06,-1.9e-05,5e-06,2e-06,6e-06,-1e-06,4e-06,-1e-05,0,-1.5e-05,2e-06,3e-06,-9e-06,1e-05,1e-06,-6e-06,-1e-06,7e-06,3e-06,-2.4e-05,1e-06,1.7e-05,-5e-06,1.6e-05,4e-06,3e-06,-2e-06,5e-06,8e-06,5e-06,5e-06,-1e-06,2e-06,8e-06,-6e-06,1e-06,2e-06,-1e-06,4e-06,1.2e-05,6e-06,0,3e-06,2e-06,6e-06,5e-06,4e-06,1.8e-05
-8e-06,-1.4e-05,-1e-05,-1.2e-05,-5e-06,2e-06,1e-06,-1e-06,-1.1e-05,-4e-06,1e-05,2e-06,-7e-06,4e-06,3e-06,1e-06,-2.2e-05,-3e-06,-6e-06,7e-06,-1.1e-05,1.1e-05,3e-06,-1e-06,-1e-06,0,-1e-05,3e-06,5e-06,-1.7e-05,-1e-06,-6e-06,-3e-06,1.2e-05,-2e-06,1.1e-05,-4e-06,-3e-06,-3e-06,-8e-06,8e-06,0,1e-05,-1e-06,-1e-06,-1e-06,1.3e-05,6e-06,1e-06,0,-8e-06,1.1e-05,2e-06,1.3e-05,2e-06,7e-06,5e-06,-5e-06,1.5e-05,-6e-06,2e-06,6e-06,-4e-06,-5e-06,7e-06,-1.1e-05,-1.5e-05,6e-06,1e-06,-1.6e-05,-5e-06,2e-06,-2e-06,6e-06,2.4e-05,-1.9e-05,7e-06,9e-06,2e-06,0,0,2e-06,1.2e-05,-1e-06,0,7e-06,-6e-06,2e-06,5e-06,9e-06,-1e-05,-2e-06,5e-06,2e-06,-4e-06,6e-06,-2e-05,-1e-06,0,-1e-06,-4e-06,4e-06,-1e-05,-3e-06,3e-06,-4e-06,-4e-06,7e-06,-4e-06,1.2e-05,4e-06,6e-06,5e-06,-3e-06,7e-06,3e-06,-3e-06,-1e-06,1e-06,2e-06,-6e-06
1.5e-05,-6e-06,5e-06,5e-06,-9e-06,3e-06,2e-06,-3e-06,7e-06,-3e-06,-3e-06,4e-06,4e-06,-7e-06,5e-06,5e-06,5e-06,3e-06,-2e-06,-5e-06,-7e-06,-5e-06,8e-06,-2e-06,3e-06,0,1e-06,-3e-06,-4e-06,1.8e-05,1e-06,3e-06,1e-06,-1e-05,-1e-06,3e-06,6e-06,0,3e-06,6e-06,2e-06,1e-06,0,-2e-06,1e-06,0,-6e-06,-7e-06,-4e-06,-8e-06,-3e-06,-7e-06,-1e-06,-1.3e-05,-7e-06,-1.9e-05,1e-06,4e-06,4e-06,-3e-06,-4e-06,-8e-06,-8e-06,1e-06,-1e-06,-2e-06,1.5e-05,-1.3e-05,0,2.4e-05,-5e-06,-7e-06,0,-2e-06,-1.6e-05,-2e-06,-2e-06,-1.9e-05,4e-06,-2e-06,6e-06,-2e-06,1.2e-05,1e-06,2.1e-05,0,6e-06,-2e-06,-1.6e-05,1e-06,2e-06,2e-06,3e-06,0,-9e-06,0,1.8e-05,-7e-06,9e-06,-1e-06,5e-06,9e-06,1.2e-05,-6e-06,-5e-06,-1e-06,0,-1e-06,3e-06,-5e-06,1e-06,-2e-06,5e-06,8e-06,6e-06,6e-06,-1e-05,-1.5e-05,-6e-06,-1e-06,1.2e-05
5e-06,1e-05,7e-06,-1e-06,5e-06,4e-06,-3e-06,-4e-06,-1e-06,0,-1.3e-05,0,-5e-06,1.2e-05,-1.5e-05,2e-06,3e-06,0,2e-06,2e-06,-3e-06,1e-06,3e-06,3e-06,-1e-06,0,7e-06,0,-2e-06,-1e-05,-2e-06,2e-06,-2e-06,-5e-06,-1e-06,-3e-06,7e-06,1e-06,-6e-06,1e-06,-8e-06,-2e-06,-9e-06,1e-06,-2e-06,4e-06,1e-06,1.1e-05,3e-06,1e-05,-1.3e-05,0,-1e-06,0,3e-06,-4e-06,3e-06,-1e-06,-9e-06,3e-06,1e-06,-9e-06,1.3e-05,8e-06,-6e-06,-9e-06,1e-06,-1e-06,1e-06,-2.4e-05,-3e-06,1e-05,-1e-06,4e-06,1.3e-05,3e-06,-4e-06,3e-06,-2e-06,2e-06,0,0,-2.5e-05,0,-8e-06,-3e-06,1.4e-05,1e-06,1.1e-05,-7e-06,0,-4e-06,9e-06,-1e-06,2e-06,-1e-06,-8e-06,-1e-05,2e-06,0,-1.3e-05,-8e-06,-4e-06,4e-06,-9e-06,4e-06,2e-06,-2e-06,0,-7e-06,2e-06,4e-06,-1.2e-05,5e-06,-2e-06,2e-06,-3e-06,-4e-06,5e-06,-3e-06,-2e-05
-8e-06,9e-06,-6e-06,3e-06,6e-06,3e-06,3e-06,0,-2e-06,3e-06,5e-06,-4e-06,1e-06,2e-06,3e-06,-7e-06,4e-06,4e-06,-4e-06,2e-06,-1e-06,0,-7e-06,1e-06,0,0,1e-06,0,6e-06,-4e-06,2e-06,-8e-06,3e-06,3e-06,-1e-06,-1e-06,0,8e-06,4e-06,2e-06,3e-06,0,5e-06,-1e-06,0,2e-06,-2e-06,-2e-05,-4e-06,-6e-06,-3e-06,-1e-05,1e-06,-7e-06,-2e-06,1.5e-05,-5e-06,0,-5e-06,0,0,-1e-06,-2e-06,-8e-06,9e-06,2.9e-05,-9e-06,1e-05,2e-06,1.3e-05,2e-06,2e-06,0,-2e-06,-1.5e-05,2e-06,3e-06,6e-06,6e-06,2e-06,0,-1e-06,1.3e-05,-3e-06,8e-06,5e-06,-6e-06,1e-06,-7e-06,0,-3e-06,4e-06,-1e-06,-2e-06,-2e-06,1e-06,6e-06,-2e-06,-1.4e-05,-1e-06,4e-06,2e-06,2e-06,-2e-06,1.1e-05,-3e-06,-5e-06,2e-06,6e-06,4e-06,1e-06,2e-06,-3e-06,-8e-06,-5e-06,-8e-06,2e-06,1e-05,-2e-06,2e-06,1e-05
-4e-06,2e-06,0,4e-06,4e-06,1e-06,-1e-06,3e-06,1e-06,3e-06,1e-06,0,2e-06,8e-06,4e-06,-4e-06,-5e-06,0,7e-06,-4e-06,4e-06,-2e-06,-6e-06,0,2e-06,1e-06,-8e-06,-9e-06,0,1.4e-05,-2e-06,5e-06,-2e-06,7e-06,5e-06,-2e-06,-6e-06,3e-06,-2e-06,-4e-06,-2e-06,-1e-06,4e-06,0,-1e-06,-3e-06,-2e-06,-6e-06,6e-06,-1e-06,8e-06,1e-05,0,1.7e-05,-4e-06,-5e-06,-4e-06,-2e-06,1e-06,3e-06,-2e-06,1e-05,-1e-05,2e-06,-8e-06,-1.3e-05,4e-06,1e-06,-1e-06,0,3e-06,-4e-06,0,1e-06,1.4e-05,1.4e-05,-5e-06,3e-06,-7e-06,-3e-06,-3e-06,0,6e-06,4e-06,-2.1e-05,-5e-06,-1e-05,-1e-06,5e-06,6e-06,9e-06,-4e-06,-3e-06,1e-06,-9e-06,-2e-06,-1.3e-05,-3e-06,-1e-06,0,-2e-06,4e-06,0,-4e-06,6e-06,1e-06,7e-06,0,-1.4e-05,5e-06,3e-06,-2e-06,0,-8e-06,-2e-06,-3e-06,3e-06,7e-06,0,1e-06,-7e-06
1e-06,-9e-06,5e-06,-6e-06,8e-06,3e-06,2e-06,2e-06,2e-06,0,-5e-06,4e-06,-4e-06,2e-06,4e-06,1e-06,0,-2e-06,-1e-05,4e-06,6e-06,7e-06,4e-06,-2e-06,-2e-06,2e-06,2e-06,1.3e-05,-4e-06,-1.3e-05,1e-06,1e-06,2e-06,0,-1e-06,-2e-06,-4e-06,0,1e-06,0,-2e-06,-1e-06,-3e-06,0,0,1e-06,4e-06,1.3e-05,-5e-06,-1.2e-05,7e-06,-7e-06,-1e-06,-2e-06,1e-06,-1e-05,1.3e-05,1e-06,0,4e-06,1e-06,4e-06,9e-06,0,5e-06,-5e-06,1e-06,-8e-06,1e-06,-9e-06,3e-06,0,0,0,-1.4e-05,-7e-06,5e-06,-2e-06,2e-06,-2e-06,-2e-06,0,-1.6e-05,-3e-06,-3e-06,0,3e-06,1e-06,-8e-06,-1e-06,-6e-06,3e-06,5e-06,0,5e-06,3e-06,1.5e-05,8e-06,2e-06,-1e-06,3e-06,3e-06,-2e-06,3e-06,-3e-06,0,-6e-06,-2e-06,0,-4e-06,-2e-06,-3e-06,8e-06,4e-06,3e-06,-3e-06,1e-06,-3e-06,1e-06,-2e-06,1.6e-05
5e-06,-8e-06,-8e-06,3e-06,-1e-06,2e-06,-2e-06,0,-2e-06,-1e-06,8e-06,0,3e-06,-3e-06,-4e-06,3e-06,8e-06,-4e-06,8e-06,-3e-06,8e-06,-7e-06,5e-06,-1e-06,1e-06,1e-06,9e-06,3e-06,0,4e-06,-1e-06,-2e-06,-1e-06,-1e-05,3e-06,3e-06,0,-4e-06,1e-06,3e-06,6e-06,-1e-06,-2e-06,-1e-06,1e-06,0,0,-8e-06,0,3e-06,-4e-06,3e-06,0,-1e-05,-2e-06,8e-06,-1.7e-05,0,7e-06,0,-2e-06,-1e-06,-2e-06,3e-06,-1e-06,-1.6e-05,-5e-06,5e-06,0,1.5e-05,1e-06,-3e-06,-2e-06,-3e-06,1.8e-05,4e-06,1e-06,-1.2e-05,-4e-06,1e-06,5e-06,-1e-06,1.3e-05,0,1e-05,4e-06,6e-06,2e-06,4e-06,-4e-06,2e-06,-2e-06,-4e-06,1e-06,7e-06,-2e-06,-1.4e-05,0,3e-06,0,4e-06,0,6e-06,-2e-06,-3e-06,-1e-06,2e-06,3e-06,-7e-06,-4e-06,2e-06,-1e-06,1e-06,-2e-06,4e-06,-6e-06,-5e-06,-5e-06,0,0,-1.1e-05
0,-1e-06,1e-06,-7e-06,-2e-06,-1e-06,1e-06,-3e-06,0,-2e-06,-2e-06,-2e-06,-2e-06,-1e-06,-4e-06,1e-06,-1.2e-05,1e-06,-6e-06,0,3e-06,8e-06,-2e-06,1e-06,2e-06,0,-8e-06,3e-06,2e-06,5e-06,0,1e-06,1e-06,2e-06,-3e-06,-2e-06,6e-06,-7e-06,-4e-06,-2e-06,-3e-06,2e-06,2e-06,1e-06,0,-1e-06,-1e-06,7e-06,1e-06,-4e-06,3e-06,-2e-06,1e-06,4e-06,1e-06,9e-06,1.2e-05,-1e-06,-3e-06,0,1e-06,2e-06,-1e-05,-6e-06,-3e-06,1.3e-05,0,9e-06,-2e-06,-1.1e-05,0,5e-06,0,1e-06,-1.3e-05,-1.5e-05,-5e-06,1.1e-05,-1e-06,1e-06,-1e-06,0,1e-06,1e-06,-5e-06,-5e-06,-3e-06,-1e-06,-1e-06,1e-06,-4e-06,3e-06,-7e-06,2e-06,-2e-06,0,1.1e-05,6e-06,7e-06,-1e-06,-5e-06,2e-06,-5e-06,-5e-06,-2e-06,0,3e-06,-2e-06,1e-05,5e-06,1e-06,0,-4e-06,-5e-06,0,2e-06,-3e-06,2e-06,0,1e-06,2e-06
-3e-06,1e-05,8e-06,4e-06,-4e-06,0,0,-2e-06,1e-06,-1e-06,-7e-06,0,0,-8e-06,5e-06,0,8e-06,3e-06,3e-06,2e-06,-3e-06,-5e-06,-3e-06,1e-06,-2e-06,1e-06,-1e-06,-3e-06,-1e-06,-7e-06,0,0,-1e-06,6e-06,1e-06,-1e-06,4e-06,-2e-06,2e-06,-3e-06,0,0,3e-06,1e-06,0,1e-06,0,-5e-06,1e-06,3e-06,-1e-06,-2e-06,0,0,-1e-06,-1e-05,-2e-06,-1e-06,-3e-06,-2e-06,0,-1e-05,1.2e-05,4e-06,6e-06,1.3e-05,8e-06,-4e-06,0,9e-06,-2e-06,-5e-06,0,-3e-06,9e-06,1e-06,5e-06,7e-06,1e-06,-1e-06,-1e-06,-1e-06,-1.1e-05,2e-06,2.3e-05,2e-06,-2e-06,1e-06,-1e-06,4e-06,4e-06,-3e-06,-2e-06,-2e-06,0,2e-06,-7e-06,-4e-06,-6e-06,0,4e-06,-5e-06,2e-06,2e-06,3e-06,1e-06,-5e-06,0,0,1e-06,-1e-06,-1e-06,-3e-06,2e-06,-3e-06,2e-06,-2e-06,5e-06,0,0,-4e-06
0,7e-06,-6e-06,-3e-06,-6e-06,1e-06,-1e-06,2e-06,-3e-06,0,2e-06,1e-06,0,1e-06,-3e-06,0,-1e-06,2e-06,-2e-06,-3e-06,-6e-06,4e-06,0,1e-06,1e-06,1e-06,6e-06,-6e-06,0,3e-06,0,-3e-06,0,-1e-06,-1e-06,3e-06,-1e-06,2e-06,-2e-06,-1e-06,3e-06,1e-06,-3e-06,-1e-06,0,0,-1e-06,-1.2e-05,-1e-06,-8e-06,-8e-06,0,0,2e-06,-1e-06,-1e-05,-2e-06,0,-2e-06,-3e-06,-1e-06,-6e-06,-3e-06,1e-06,-7e-06,-4e-06,-9e-06,-4e-06,0,-4e-06,-2e-06,5e-06,0,1e-06,-1.3e-05,-1e-06,-2e-06,-8e-06,1e-06,0,-1e-06,0,1e-05,-2e-06,-1.7e-05,2e-06,3e-06,1e-06,-1e-06,-2e-06,-3e-06,3e-06,1.1e-05,-1e-06,2e-06,-2e-06,7e-06,-1e-06,-5e-06,0,-6e-06,-1e-06,-1e-06,-3e-06,-1e-06,-1e-06,5e-06,0,-3e-06,-2e-06,0,2e-06,-1e-06,6e-06,-3e-06,1e-06,0,-3e-06,1e-06,-1e-06,1e-06
0,-3e-06,-1e-06,6e-06,-2e-06,-1e-06,2e-06,1e-06,3e-06,1e-06,2e-06,2e-06,1e-06,-6e-06,8e-06,0,-1e-06,-3e-06,0,3e-06,-5e-06,-2e-06,1e-06,-1e-06,1e-06,0,-4e-06,-5e-06,1e-06,3e-06,0,2e-06,0,-3e-06,1e-06,1e-06,-2e-06,5e-06,2e-06,3e-06,-4e-06,2e-06,1e-06,1e-06,0,-1e-06,1e-06,1.2e-05,-1e-06,2e-06,-5e-06,-1e-06,0,-8e-06,1e-06,1.2e-05,-2e-06,1e-06,0,-1e-06,0,9e-06,-7e-06,-1e-06,5e-06,-1.8e-05,7e-06,6e-06,-1e-06,-1e-06,0,-2e-06,0,-1e-06,1.3e-05,4e-06,0,-3e-06,2e-06,2e-06,0,0,4e-06,2e-06,5e-06,-3e-06,-5e-06,-1e-06,-5e-06,-4e-06,1e-06,-3e-06,-8e-06,0,-4e-06,1e-06,-1.2e-05,-5e-06,2e-06,0,4e-06,3e-06,1e-06,-3e-06,-2e-06,0,-5e-06,0,-1e-06,-2e-06,0,2e-06,4e-06,-2e-06,1e-06,1e-06,-1e-06,-6e-06,-1e-06,0,8e-06
0,-9e-06,5e-06,-3e-06,-2e-06,-2e-06,-1e-06,0,-1e-06,1e-06,-4e-06,0,0,5e-06,-9e-06,-3e-06,2e-06,-3e-06,3e-06,-1e-06,-3e-06,0,3e-06,0,-2e-06,0,-1e-06,3e-06,0,-4e-06,0,0,-1e-06,0,2e-06,-3e-06,-3e-06,4e-06,0,-1e-06,4e-06,-1e-06,0,0,-1e-06,1e-06,1e-06,-8e-06,-1e-06,-2e-06,-3e-06,2e-06,0,4e-06,-1e-06,6e-06,8e-06,-1e-06,5e-06,-2e-06,1e-06,5e-06,1e-05,-3e-06,-2e-06,1e-05,-2e-06,4e-06,1e-06,3e-06,1e-06,0,0,0,-1.2e-05,9e-06,1e-06,-1e-06,1e-06,1e-06,2e-06,0,-1.5e-05,-1e-06,-9e-06,3e-06,-7e-06,1e-06,4e-06,1e-06,4e-06,3e-06,-1e-06,0,-5e-06,-1e-06,1.2e-05,-2e-06,3e-06,0,2e-06,-3e-06,1e-06,2e-06,2e-06,0,2e-06,0,-1e-06,2e-06,-2e-06,1e-06,-1e-06,-2e-06,3e-06,2e-06,0,0,0,0,-1e-05
3e-06,-4e-06,-4e-06,3e-06,1e-06,0,2e-06,0,-1e-06,0,4e-06,-2e-06,1e-06,-3e-06,6e-06,-2e-06,-2e-06,0,-6e-06,-1e-06,1e-06,3e-06,-3e-06,-1e-06,1e-06,0,2e-06,4e-06,-2e-06,0,1e-06,0,1e-06,4e-06,-1e-06,2e-06,0,0,-1e-06,-2e-06,0,0,1e-06,0,0,-1e-06,-1e-06,-2e-06,3e-06,8e-06,-2e-06,-3e-06,-1e-06,5e-06,1e-06,-1.1e-05,-8e-06,0,2e-06,1e-06,0,2e-06,-4e-06,4e-06,-2e-06,2e-06,2e-06,-7e-06,0,-5e-06,1e-06,-2e-06,0,1e-06,1.4e-05,-5e-06,1e-06,9e-06,-2e-06,-2e-06,0,0,8e-06,1e-06,-1.2e-05,-1e-06,-2e-06,0,-6e-06,4e-06,-5e-06,-3e-06,9e-06,1e-06,3e-06,0,-1.1e-05,1e-06,4e-06,0,-2e-06,0,-3e-06,-2e-06,4e-06,-1e-06,1e-06,1e-06,7e-06,1e-06,0,-1e-06,2e-06,5e-06,2e-06,-3e-06,0,4e-06,0,-1e-06,8e-06
0,4e-06,-2e-06,-4e-06,5e-06,-1e-06,-3e-06,0,2e-06,0,1e-06,0,0,7e-06,-8e-06,1e-06,5e-06,2e-06,6e-06,3e-06,4e-06,-4e-06,-1e-06,1e-06,0,0,-1e-06,-6e-06,0,5e-06,-1e-06,0,-1e-06,0,2e-06,0,2e-06,-3e-06,3e-06,0,-3e-06,0,0,0,0,0,2e-06,6e-06,0,-3e-06,3e-06,3e-06,0,-4e-06,1e-06,-2e-06,4e-06,-1e-06,-4e-06,2e-06,-1e-06,-2e-06,-5e-06,0,5e-06,6e-06,-6e-06,-1e-06,0,7e-06,0,0,0,-1e-06,-1.2e-05,4e-06,-2e-06,2e-06,2e-06,0,-1e-06,-1e-06,9e-06,0,2e-05,-3e-06,0,0,6e-06,0,4e-06,3e-06,-6e-06,0,3e-06,1e-06,8e-06,2e-06,-1e-06,0,3e-06,-2e-06,3e-06,-2e-06,0,0,-4e-06,-1e-06,-9e-06,-2e-06,-2e-06,-1e-06,-3e-06,0,-1e-06,-3e-06,-3e-06,0,0,0,-1e-05
