-0.000296,0.000499,0.000553,-0.000486,-0.000352,0.000173,-0.00018,0.000462,-0.000265,-0.001139,-0.000345,-0.000172,0.000355,-0.000313,-0.000152,-0.000624,4.2e-05,-4.3e-05,0.000357,0.001262,0.000687,0.000513,0.000887,0.000436,0.000136,6.5e-05,0.000108,-0.000666,0.000491,0.000411,0.00087,0.000705,-0.000264,0.000291,0.000213,0.000228,-3.2e-05,0.000258,7.1e-05,-0.000343,-3e-04,-0.000509,8.9e-05,0.000618,0.000435,9.3e-05,0.00054,-0.00089,-0.001463,-0.000994,0.000333,-0.000112,-0.000143,-0.000175,0.000168,0.000345,0.000379,-0.000445,-0.000616,-0.001075,-0.001139,-0.000926,0.000574,8e-04,0.000394,0.000217,-5.2e-05,-0.000522,-0.000162,-0.000101,-0.000586,-0.000609,-0.000574,-0.000872,0.000329,0.000309,-0.000591,-0.00085,-6e-04,-0.000406,3.5e-05,-0.000832,-0.000563,-0.000604,-0.000534,-0.000965,-0.000416,-0.001253,9.2e-05,-0.000324,-0.000375,-0.00022,-0.001474,-0.000161,0.001548,0.000337,-3.3e-05,0.000906,-0.000113,-0.000284,0.000476,0.000881,0.000154,-0.000125,0.000284,0.00018,0.000848,0.000939,1e-05,0.000386,0.00022,0.000592,-0.000414,-0.000258,-0.000832,-0.000416,-5.2e-05,0.000123,0.000308,-0.000167,-0.00012
3e-04,-5.1e-05,0.000752,0.000598,1.4e-05,-0.000135,-0.000349,-0.000861,-0.000276,0.000522,-0.000171,-9.6e-05,-0.000138,-0.001009,-0.001036,-8.6e-05,0.000198,-0.000419,0.000166,0.000753,0.000136,3.6e-05,6.6e-05,0.000344,-0.000649,-0.000431,-0.00139,-0.000602,-0.00049,-0.000353,-0.000737,-0.000461,0.001243,0.000877,4.9e-05,0.000126,1.5e-05,-9.6e-05,-0.00047,-0.001169,0.000988,0.000684,7.3e-05,-0.001641,-0.000858,-0.000272,-0.000711,-0.000138,0.000559,0.000392,0.000447,0.000504,0.000863,-0.000385,-0.000272,-0.000894,0.000144,0.000999,0.000842,0.00038,0.000287,-0.000785,-0.00048,-0.000333,-0.000266,-0.000247,0.000234,-2.1e-05,-0.000159,-0.000643,-0.000864,-0.000669,5e-04,-1.4e-05,-0.000335,9.5e-05,0.00042,-0.000153,-0.000335,-0.000569,0.000303,-0.000409,-0.000478,-0.000234,-7e-05,6e-05,-0.000457,0.000646,0.000222,-0.001001,-0.000485,0.000117,0.000609,-0.000301,-0.000247,0.000833,-0.00043,-0.00038,0.000711,0.001251,0.000921,0.001041,0.000267,0.000601,-0.000105,0.001276,-9.9e-05,0.000519,0.000594,0.000275,-0.000243,-0.000205,0.001241,0.000788,0.000631,0.000364,-0.000399,-0.000186,0.000367,-0.000181,0.000107
-0.000334,-0.000474,4.2e-05,-0.000687,-0.000961,-0.000416,-0.000379,-0.000885,-0.001224,-0.000828,-6.5e-05,5.2e-05,-0.000834,-0.000108,0.000238,-0.000368,2.2e-05,0.000909,0.000289,4.5e-05,0.000379,-0.000509,-0.000523,-0.000768,-0.000424,-0.000184,-4.5e-05,-0.000673,-0.000112,-0.001184,-0.000381,2.1e-05,-0.000562,-0.000386,-0.000543,-0.000701,-0.000758,-5e-04,0.000141,-0.000409,-0.000235,-0.000506,-0.00068,-0.000408,-7.6e-05,0.000691,-0.00014,0.000554,-0.000449,0.000193,-0.000715,-0.000127,-0.000185,-4.5e-05,1.7e-05,-0.000237,0.000146,-0.001556,-0.001212,-0.000545,-0.000445,0.000591,-0.000415,-0.000343,-0.000218,0.000164,-0.000324,0.000261,1.5e-05,-4.6e-05,0.000623,-0.000353,-0.000144,-0.000184,-0.000171,0.00016,-0.001104,3.3e-05,-0.000118,-0.000128,-0.000267,0.000337,0.000784,-0.00037,-0.000707,-0.000272,0.000286,6e-06,-5.8e-05,-0.001129,-0.000717,2.9e-05,-5.6e-05,-0.000165,-0.000447,-0.000937,-0.000189,-0.000765,-0.000424,-9.6e-05,0.000442,-0.00015,-0.000315,-0.001033,-0.00066,-0.000259,0.000628,-0.00169,-0.001204,-0.000992,-6e-04,-5.5e-05,-0.000149,-0.000144,0.000373,0.000474,-0.000658,0.000154,-0.000561,0.000712,-0.000797
-0.000115,0.000201,0.000552,0.00044,0.000703,0.000339,-0.000417,0.000153,0.00035,0.000491,0.000162,0.000684,0.000107,-0.000399,0.000431,0.000238,-1.5e-05,3.4e-05,8e-05,-0.000348,-0.000191,9e-05,-0.000281,-0.000341,0.000361,0.000426,0.000232,0.000226,7e-05,3.4e-05,-0.000414,-1.7e-05,-0.000183,-0.000173,0.000255,-4.8e-05,0.000799,-4.7e-05,-0.000287,0.001174,0.00059,0.000109,0.000188,-0.000286,-0.000314,-0.000542,-0.000476,9.2e-05,0.000636,4.8e-05,0.000854,0.000106,-7.2e-05,3e-05,-0.000322,0.000826,1e-04,-0.00035,-0.000413,-0.000629,-3.6e-05,-0.000218,-0.000587,-6e-06,1.2e-05,-0.000506,-0.000122,-0.000497,-0.000168,5e-06,2.6e-05,0.001218,0.000391,-0.000873,0.000121,-0.000559,-0.000248,-0.000125,0.000304,0.000383,-0.000915,-0.000914,-0.001374,0.000107,0.000375,0.000208,-0.000506,0.000126,0.000105,0.000475,0.000324,-5.3e-05,0.00024,-0.000245,-0.00038,-0.000348,-5.9e-05,-0.000843,-0.000188,-0.000572,0.000205,-0.000456,-0.000627,-0.00013,0.000277,0.000227,0.000543,-0.000485,-0.000224,-0.000423,-0.000235,-0.000159,-0.000347,0.000331,-0.000538,-0.000364,0.000223,-0.000432,-0.001119,-0.000719,-0.000262
9.3e-05,-0.000501,-0.000915,-0.000308,-0.000834,-0.000171,-0.000253,-0.000223,0.000253,8.8e-05,0.000382,-0.000568,-5e-04,0.000387,-0.000563,-0.000264,-0.000109,-0.000395,-0.000559,-0.00062,-0.000777,-0.000792,-0.000538,0.000288,0.00068,0.000281,-0.000197,0.000256,-0.000408,0.000124,0.000322,-3.4e-05,-8.3e-05,-0.000541,0.000374,0.000407,-0.000204,7.7e-05,-0.000365,-0.000361,-0.001242,-0.001191,-2e-05,0.000712,-9.9e-05,-0.000601,-2.3e-05,-0.000415,-0.000434,-0.000872,-0.001205,-0.001043,-0.000686,0.000148,-0.000181,0.000226,0.000167,-0.000591,-0.000624,-0.000189,0.000687,-6.2e-05,-0.000213,-0.000332,-1.1e-05,-0.000504,-0.000372,6.3e-05,-0.000176,-7.8e-05,-0.00049,-0.001116,-0.000752,-8.2e-05,-0.000375,-0.000293,-9.6e-05,-2.6e-05,-0.000369,8.9e-05,-0.000126,4.9e-05,0.000208,0.000112,-0.000174,6.4e-05,-0.000119,-0.00027,9e-05,0.000755,0.00037,0.000132,0.000112,0.000218,0.000384,-0.000297,-0.000103,0.00034,0.000859,-7.9e-05,-0.000284,-0.000817,-0.00103,-0.000122,0.000552,-0.000124,-9.6e-05,-7e-05,-0.00063,-0.000236,-0.000639,0.000459,-0.000366,-0.000742,-0.000113,0.000402,0.000424,0.000673,0.000313,-0.000127,-0.00055
-0.000516,-0.000297,-0.000204,-9e-05,0.000112,0.00033,0.000263,-6.4e-05,-1.7e-05,6e-05,-0.000372,-0.000163,4e-05,2e-05,-1.8e-05,0.000415,0.000137,-0.000184,-0.000519,-0.000688,-0.000669,-0.000299,-0.000756,0.000382,-0.000189,-0.000446,0.000106,0.000153,-0.000315,4.3e-05,-0.000499,-0.000542,-1.2e-05,-6.6e-05,-0.000769,1.3e-05,-0.00035,-0.000638,-0.000489,-0.00044,0.00013,0.000214,0.000206,-0.000251,-2e-04,-0.000148,-0.000163,-0.000308,0.000199,6.8e-05,-0.000281,-0.000116,0.000252,-0.000148,-0.000235,-0.000644,-0.000763,0.000207,-0.000286,0.000595,5e-05,-3.5e-05,0.000541,-0.000598,-0.000678,-0.000239,-0.000422,-0.000118,9.2e-05,-0.000371,-1e-06,6.6e-05,7.7e-05,0.00015,-9e-06,0.000219,-0.000617,-0.000172,0.000453,-0.000482,0.000152,-1.4e-05,6e-06,0.000143,9.5e-05,-1.6e-05,0.000268,0.00033,-0.000296,-0.00045,0.000136,-6.2e-05,-0.000295,-0.000161,-0.000239,-0.000277,-0.000333,-5.5e-05,0.000308,0.000146,-0.000287,-0.000289,0.000262,0.000102,-0.000418,-7.4e-05,-0.000485,-0.000254,0.000344,0.00031,-8e-05,0.000197,0.000325,0.000155,-6.7e-05,-0.000234,-0.000247,-5.9e-05,-0.000421,-0.000785,0.000142
-3e-06,1.6e-05,-0.000344,-0.000437,-6e-04,-0.000445,0.000184,-3.2e-05,-0.000241,-0.000317,0.000132,-4.3e-05,-0.000178,0.000156,-0.000207,-5.3e-05,0.000211,-0.000193,0.000216,0.000174,-0.000155,-0.000154,-0.000499,-3e-04,-0.000587,-0.000245,-0.000256,-0.000376,1.8e-05,0.000287,-0.000619,0.000206,3.8e-05,-0.000949,-0.000614,-0.00021,-0.000275,-0.000257,-0.000322,-4.9e-05,-2.5e-05,-0.000597,2.8e-05,-2.6e-05,0.000261,-8.6e-05,-0.000667,-0.000106,-0.000383,0.000206,0.000251,-0.000252,-0.000628,-0.000387,-0.000335,0.000175,-0.000427,-0.000426,-0.000552,-0.000507,-0.000147,0.000278,-0.000315,-0.000487,-0.000599,2.2e-05,0.000124,-0.000294,-6.2e-05,-0.000247,0.000278,0.000157,-0.000249,0.000163,-0.000323,-0.000141,1.4e-05,0.000247,2.3e-05,4.9e-05,-0.000136,0.000296,4.7e-05,-0.000142,-0.00043,-0.000559,-0.000297,0.000102,8.5e-05,2.9e-05,-0.000248,0.000207,5.7e-05,-0.000208,-0.000572,-0.000241,-4.6e-05,-0.000242,-0.000243,-0.000343,-0.000693,-2.8e-05,9.9e-05,-0.000357,-0.000179,-0.000385,-0.000458,-0.000314,-6.9e-05,-0.000258,0.000144,-0.000633,-0.000207,-0.000304,-3e-04,3.2e-05,9.4e-05,-0.000519,0.000335,0.000242,-0.000166
0,-0.000112,-0.000193,-0.00011,0.000235,-0.000486,-0.000183,1.4e-05,7.6e-05,0.000213,-0.000196,3e-05,0.000294,-0.000313,-0.000131,-0.000251,-0.00035,-0.000189,-0.000138,9.7e-05,0.000108,-0.000369,-9e-06,8e-05,-0.000223,-8.9e-05,0.000474,0.000129,0.00017,-8.2e-05,-8.3e-05,0.000395,-5e-05,0.000661,-1.1e-05,-0.000526,-7e-06,-0.000226,-0.000179,-0.000159,0.000186,0.000467,0.000366,-3.6e-05,-5e-06,-0.000169,-0.000132,-0.000301,0.000267,-0.000106,-1.8e-05,0.000475,-8.5e-05,-0.000427,0.000213,-0.000505,0.000115,-0.000192,0.000649,0.000407,0.000115,1.2e-05,-5e-05,0.000334,4.8e-05,-1.6e-05,1.7e-05,-0.000183,-1.9e-05,0.000218,0.000127,-0.000105,-3.4e-05,-0.000225,-0.00011,-0.000394,0.000201,-9.4e-05,-0.000209,-7.7e-05,-5.7e-05,4.8e-05,0.000129,-0.000238,0.000541,0.000453,0.000173,-0.000192,-0.000522,0.00011,5.9e-05,-9.3e-05,-0.000147,-0.000251,-8.1e-05,-0.000112,5.6e-05,-0.000569,-0.000322,7.4e-05,-5.1e-05,-0.000409,0.00016,-0.000252,-0.000456,-0.000144,-0.000277,-0.000464,0.000169,0.000306,0.000235,-0.000248,-0.000491,-0.000263,-0.000337,9.5e-05,8.9e-05,-0.000437,-0.000387,-7.3e-05,-0.000641
0.000102,0.000192,1.4e-05,-0.000182,-6.1e-05,0.000146,1.8e-05,0.000345,0.000244,2e-04,0.000238,6.2e-05,0.00016,0.000267,0.00025,-0.000317,-0.000161,-5e-05,-0.00046,-0.000351,3.1e-05,-0.00022,0.000183,-6.1e-05,3.4e-05,1.4e-05,0.000148,-9.1e-05,0.000381,0.00035,0.000173,-0.000463,-0.000358,-0.000272,-0.000269,0.00028,0.000188,0.000335,0.000432,-0.000185,-0.000255,0,-2.9e-05,-1e-05,2.9e-05,-0.000229,0.000146,0.000247,-0.00054,-0.000167,-6.7e-05,-0.000506,-0.000226,-1.6e-05,6.3e-05,3.2e-05,3e-04,0.000574,0.000333,-0.000391,-0.000381,-0.000173,5.7e-05,0.00025,3.5e-05,-5.6e-05,3.5e-05,-2.8e-05,-0.000211,3.2e-05,-2.8e-05,5.8e-05,9.9e-05,0.000432,0.000388,0.000538,0.000162,-0.000304,-0.000188,-4.3e-05,-2.1e-05,3.6e-05,0.000127,0.000429,4.5e-05,-3.6e-05,-0.00031,-0.000112,0.000303,-1.5e-05,-0.000146,0.000116,-5e-05,0.000506,2.8e-05,0.000164,0.000309,0.00028,-0.000403,-0.000358,-0.000199,-0.000317,-6.3e-05,-0.000443,9.2e-05,-2.4e-05,-0.000186,0.000207,-0.000173,-0.000412,-0.00019,-0.00018,9e-06,2.7e-05,6.6e-05,-6e-05,-0.00032,0.000144,-3.5e-05,6.2e-05,0.000318
-9e-06,-0.000187,0.000194,0.000331,0.000356,0.000206,0.000255,0.00011,-0.000113,2.3e-05,-0.000207,-0.000298,7.1e-05,0.000122,9.1e-05,0.000284,5.6e-05,-6e-06,0.000139,0.000335,0.000261,0.000251,-0.000242,3.8e-05,1e-05,-8.5e-05,0.000115,-7.7e-05,-0.000237,-0.000156,4e-05,-0.000133,-0.000145,0.000188,0.000121,9.8e-05,3.4e-05,-0.000127,7.9e-05,0.00016,-0.000201,-0.00026,9.2e-05,2.6e-05,-7.7e-05,0.000331,6.7e-05,-5.1e-05,0.000145,-0.000288,8.2e-05,0.000331,-4.5e-05,3.4e-05,-0.000544,-0.000165,-0.000372,-0.000195,8.5e-05,0.000333,0.000297,-7.5e-05,-8.2e-05,-8e-05,-4.9e-05,5.4e-05,0.000342,0.000219,-8.3e-05,6.2e-05,1.7e-05,0.000113,-4.4e-05,-0.000124,4.1e-05,-0.000204,0.000239,-0.000221,0.000284,0.000135,0.000145,-0.000104,0.000141,-4.2e-05,-3.9e-05,0.000137,0.000122,-0.000135,9.3e-05,-0.000246,2e-05,-0.00023,3.5e-05,-0.000256,0.000176,8.2e-05,4.8e-05,-0.000154,4.4e-05,-0.00021,-0.000117,0.000376,0.000137,9e-05,9e-06,-2.3e-05,-1e-05,0.000265,-8.6e-05,-0.000207,1.2e-05,-7.7e-05,-8.8e-05,-0.000152,-0.000221,-9e-05,0.000129,6.9e-05,0.000104,-1.3e-05,2.7e-05
-1.1e-05,0.000141,7e-06,-4.4e-05,4e-05,-9e-05,5e-05,-0.000109,3.4e-05,-0.000108,-3e-05,0.000158,0.000116,-4.4e-05,6.7e-05,-0.000114,-9.8e-05,5.9e-05,8.3e-05,-1e-05,0.000121,0.000119,0.000238,-0.000141,0.000138,3e-06,-0.000321,-7.7e-05,-0.000365,-2e-05,7.8e-05,-7e-05,-0.00016,5.3e-05,2e-04,-4.6e-05,-0.000181,-8e-06,1.7e-05,-0.000141,-4.3e-05,0.000116,-0.000175,6.5e-05,-3e-06,0.000134,-6.2e-05,-7.4e-05,8.9e-05,0.000333,6.5e-05,-0.000104,0.00018,0.000118,0.000236,-3.7e-05,-0.000345,5.1e-05,-0.000172,-0.000341,-3e-05,-9.3e-05,5.1e-05,4.6e-05,5e-05,0.000141,3.4e-05,-7e-05,-7e-05,7.4e-05,0.00016,-3.9e-05,-0.000128,0.000134,7.9e-05,0.000144,1.1e-05,-4.7e-05,-8.7e-05,7e-06,-7e-06,0.000105,-4e-05,-0.000104,5.3e-05,-0.000111,0.000191,0.000171,-0.000172,3.5e-05,6.7e-05,-0.000206,9e-06,3.6e-05,-0.000132,-0.000115,-0.000241,-7.1e-05,-6.2e-05,0.000179,0.000235,-3e-06,2.8e-05,6.7e-05,3.6e-05,2.4e-05,1.5e-05,-0.000254,0.000141,-0.000337,-0.000115,7e-06,0.000133,-5.8e-05,2.9e-05,-7.7e-05,-0.000155,-0.000128,0.000212,8.1e-05,0.000106
-8e-05,9.5e-05,2.8e-05,-6e-05,-2.8e-05,7.2e-05,2.3e-05,-7.6e-05,9.2e-05,-0.000118,-4.8e-05,-9.1e-05,0.000127,-0.000145,-0.000166,-6.1e-05,7.2e-05,-1.8e-05,8e-06,8.7e-05,-0.000176,0.000103,2.2e-05,-0.000186,-0.000131,3.7e-05,0.000175,4e-06,0.000233,-0.000123,3.9e-05,0.000172,-9.4e-05,-0.000296,8.6e-05,1.9e-05,-2.4e-05,0.000158,-7.8e-05,0.000247,1.6e-05,7e-06,-0.000291,4.9e-05,5.8e-05,-0.000124,0.000112,0.000138,-0.000147,-0.000117,-2.4e-05,0.000196,0.000318,2e-06,-0.000159,0.000185,0.000244,-1.3e-05,-5.6e-05,3.5e-05,6.1e-05,4.3e-05,-0.000194,-0.000117,0.000143,0.000127,-0.000173,8.1e-05,0.000142,7.1e-05,0,-0.00013,0.000121,-1.1e-05,-1.1e-05,-6.7e-05,-0.000142,0.000132,2.6e-05,-0.000165,6.8e-05,1.5e-05,-0.000251,0.000123,-0.00034,7.9e-05,-7.1e-05,-0.000107,-9.8e-05,-2e-06,-2.3e-05,0.00023,7.5e-05,3.2e-05,0.000153,0.000131,-0.000138,0.000117,-8e-06,7.7e-05,0.000149,0.000232,-7e-06,0.000181,-6e-06,-9.1e-05,0.000112,0.000278,-1.8e-05,6e-05,1.4e-05,0.000265,0.000129,0.000196,0.000122,-0.000121,0.000182,0.000174,-0.00011,9.5e-05,4.9e-05
5e-06,-3.2e-05,1.7e-05,0.000127,2.7e-05,0.000117,-6.4e-05,1e-06,-0.000144,1.7e-05,0.000161,7.3e-05,-2.9e-05,0.000106,-1.3e-05,-0.000103,5.4e-05,3e-05,-1.1e-05,-2.5e-05,7.2e-05,2.7e-05,-8.6e-05,-4e-06,2e-06,-7.8e-05,6.6e-05,5.2e-05,0.00013,0.000121,-6e-06,4.8e-05,0.000165,0.00011,0.000137,0.000105,2.4e-05,-7e-06,0.000161,9.2e-05,0.000156,-0.000101,-7.6e-05,0.000124,-1.8e-05,5.6e-05,1.5e-05,-0.000111,-7.9e-05,9e-06,7.6e-05,-6.4e-05,-7.4e-05,2.8e-05,0.00026,8.7e-05,-3.9e-05,2.3e-05,0.000208,-0.000123,-0.000191,8.4e-05,0.000265,-0.000162,2e-04,-8e-06,7.5e-05,4.2e-05,3.7e-05,-8e-05,-0.00012,-3.8e-05,6.8e-05,-7.5e-05,-2.6e-05,2.2e-05,0,-9.8e-05,-0.000182,4.5e-05,-2.8e-05,0.000111,2.2e-05,-8.2e-05,0.000133,-0.000119,-1.2e-05,-4e-06,9.9e-05,-0.000231,2.2e-05,0.000115,-7.8e-05,-3.8e-05,-6.6e-05,3.9e-05,3.2e-05,0.000148,2.9e-05,-1e-06,3.2e-05,-0.000106,8.9e-05,0.000154,-3.1e-05,0.000123,0.000176,2.5e-05,8e-06,0.000128,-7e-06,0.000152,-0.000116,0.00013,5.8e-05,0.000108,-0.000189,5.7e-05,6.2e-05,-8.6e-05,0.00015
3.7e-05,-4e-05,-3.8e-05,9.6e-05,-5e-05,0.000103,-2.6e-05,5.3e-05,9.2e-05,-1e-06,-4.3e-05,-1.1e-05,-5.9e-05,-1.3e-05,-6.8e-05,0.000246,-0.000123,6e-06,5.5e-05,7.9e-05,1.5e-05,-3.7e-05,0.00016,2e-05,-5.3e-05,5.3e-05,-9e-06,0.000101,1.3e-05,-4.1e-05,-7.8e-05,-9e-05,5.4e-05,0.000106,-6.3e-05,-0.000113,5.1e-05,-2.4e-05,7.1e-05,3.4e-05,-4.2e-05,2.1e-05,-2e-05,3.5e-05,1e-05,-9e-05,-3.6e-05,6.2e-05,4.8e-05,5.7e-05,-3.4e-05,-4.9e-05,0.000109,2.2e-05,4.2e-05,-0.000123,0.000198,0.000108,-5.3e-05,0.000215,-5.9e-05,-6.8e-05,-0.000104,0.000212,-9.5e-05,2e-05,3.8e-05,-2.4e-05,3.7e-05,0.00015,-2e-05,3e-05,-7.8e-05,3.5e-05,-6e-06,3.5e-05,0.00013,0.000186,-6.8e-05,-1.4e-05,2.6e-05,-2.3e-05,-6e-06,-3.5e-05,7.2e-05,1.4e-05,-0.000108,1.9e-05,-3.9e-05,0.000294,2.9e-05,-1.9e-05,1.1e-05,3e-05,0.00011,-3.6e-05,0.000131,4.2e-05,0.000144,1.6e-05,-3.7e-05,0.000124,-7.4e-05,5.5e-05,-6.3e-05,-5.7e-05,2.2e-05,-3.8e-05,-0.000103,0.000164,5.7e-05,-8.5e-05,9.7e-05,-6e-06,9.8e-05,-1.1e-05,6.3e-05,-2.7e-05,1.3e-05,2.9e-05,6.5e-05
1.6e-05,2.7e-05,5.3e-05,-6.8e-05,2.3e-05,-5.8e-05,-2.6e-05,-2.6e-05,-3e-05,5.4e-05,2.3e-05,-2.2e-05,1.2e-05,-0.000119,2.1e-05,-5e-06,4.3e-05,-7.9e-05,6.2e-05,3e-05,6e-05,-4.6e-05,3.5e-05,-2.6e-05,-1.3e-05,4.9e-05,-0.000169,-1.3e-05,-1.9e-05,2e-06,4e-06,-0.000141,5.5e-05,6.8e-05,-2.7e-05,-2e-05,-7e-06,2.7e-05,-6.1e-05,-8.2e-05,2e-05,5.9e-05,-9.4e-05,4.5e-05,-3.6e-05,-3.2e-05,4e-06,2.7e-05,6.4e-05,-3e-06,3.9e-05,3.7e-05,-5.1e-05,-7e-06,-1e-06,6.5e-05,3.5e-05,-5e-06,3.2e-05,-8e-06,-7.4e-05,-2.1e-05,5.4e-05,1.5e-05,-5.4e-05,2.3e-05,1.2e-05,-1e-05,-1e-05,-3e-06,-1.1e-05,2e-05,-9e-06,6.7e-05,1e-05,-5.8e-05,-6.7e-05,5.7e-05,4.6e-05,6e-06,6e-06,-7.2e-05,-1.9e-05,-3.3e-05,5e-06,-4.6e-05,8.8e-05,1e-05,8.8e-05,-8.3e-05,-4.3e-05,-0.000188,-3e-06,-1.5e-05,-7e-05,2.3e-05,-1.2e-05,1.6e-05,-1.9e-05,1.2e-05,-0.000133,-2.5e-05,-4.9e-05,-1.9e-05,0.000106,5.7e-05,-0.000114,3.8e-05,4.7e-05,-1.7e-05,1.5e-05,-1.8e-05,5.2e-05,-5.3e-05,-3.8e-05,-3.3e-05,-3.8e-05,-7.2e-05,-3.2e-05,-1.9e-05,-0.000137
4e-05,-3.6e-05,2.1e-05,9e-06,7e-06,-3.7e-05,3.9e-05,-2.6e-05,-3.6e-05,5.9e-05,-5.4e-05,-5e-06,-9e-06,6e-06,5e-05,-1.9e-05,4.8e-05,3.1e-05,3.6e-05,4e-06,1.6e-05,-3e-05,-5.9e-05,2e-05,-1e-06,1.2e-05,-2.6e-05,2.8e-05,-6.1e-05,-2.1e-05,9e-06,0.000117,1.3e-05,-8e-06,-7.7e-05,-3.3e-05,1e-06,-2.2e-05,-2.8e-05,-3.1e-05,8e-06,1.8e-05,5.5e-05,-3.7e-05,1.1e-05,4e-06,3.5e-05,-3.3e-05,4e-06,7e-05,1.1e-05,-2.4e-05,-8.3e-05,-6.3e-05,-0.000103,-5.9e-05,3e-06,1.4e-05,-1.7e-05,1.4e-05,-3.8e-05,0,-3.5e-05,-3.7e-05,-1.2e-05,4.3e-05,-2.8e-05,-2.3e-05,3e-06,6.1e-05,-1.3e-05,-3.3e-05,1e-06,-6.5e-05,9e-06,-1.3e-05,5.5e-05,1.4e-05,-3.8e-05,-4e-06,4e-05,6e-06,7.2e-05,1e-05,2.8e-05,3.1e-05,-1.2e-05,1.5e-05,-3.6e-05,-4.5e-05,-5e-06,2.8e-05,3.5e-05,3.3e-05,2e-05,-3e-06,-8e-06,1.3e-05,-2.5e-05,1.4e-05,-6e-06,-7e-06,2.9e-05,-5.7e-05,-2e-06,-1.1e-05,-6.6e-05,-1.3e-05,5.3e-05,-1.6e-05,-2e-05,-3.5e-05,-2.6e-05,-3.6e-05,6e-06,-1.7e-05,-6e-06,2.9e-05,3.5e-05,2.8e-05,-3.4e-05
1e-06,5.3e-05,6e-06,1.6e-05,4.3e-05,2e-05,-8.3e-05,-6e-06,-5e-06,-3.6e-05,4.5e-05,6e-06,-1.1e-05,-1.1e-05,-1.6e-05,-2.6e-05,-2e-06,-1e-05,-4.4e-05,-1.4e-05,-3.2e-05,6e-06,-7e-06,6.6e-05,7.2e-05,3.2e-05,-2.2e-05,-3e-06,2e-06,-6e-06,-5e-06,5.1e-05,-3e-06,2.3e-05,1.9e-05,4.2e-05,-3e-06,-1.5e-05,3.3e-05,-5.2e-05,3e-05,-6.9e-05,5e-06,-2e-06,-1.4e-05,2.7e-05,-2.7e-05,5e-06,7e-05,2.1e-05,-2.8e-05,6.6e-05,-3.6e-05,7e-06,1.3e-05,-3.2e-05,-0.000113,-4e-06,-5.6e-05,-4.6e-05,2e-05,3.3e-05,1.2e-05,4e-05,-3.8e-05,-1.3e-05,-3e-05,-1.8e-05,-1.4e-05,5e-06,-4e-06,1.6e-05,-7e-06,-1e-04,-1.1e-05,3.8e-05,-5e-06,4.3e-05,8e-06,2.7e-05,-1.6e-05,7e-05,-4e-06,2.2e-05,-1.5e-05,-2e-05,-2.6e-05,3e-06,3.9e-05,0.000111,-1.2e-05,5.7e-05,-1.3e-05,-2.4e-05,-1.3e-05,5e-06,-4.5e-05,-2.3e-05,-7e-06,-1.6e-05,9.4e-05,-6.9e-05,-1.9e-05,-8e-06,2e-05,-1.6e-05,-1.1e-05,-2e-05,-7.8e-05,3.2e-05,1.1e-05,-5.8e-05,-1e-05,2.8e-05,-5e-05,1.6e-05,7e-06,2.2e-05,-3e-05,1.3e-05,2.8e-05
-2.2e-05,-1.2e-05,1e-06,-1.5e-05,-1.4e-05,-4.2e-05,1.2e-05,-2.4e-05,1.6e-05,-1.6e-05,-3.4e-05,2.3e-05,-1.6e-05,1e-06,3e-06,1.8e-05,-2.2e-05,4e-05,-1e-05,-9e-06,-1.8e-05,3.5e-05,2.8e-05,5e-06,4.1e-05,-4e-06,-3.4e-05,-5e-06,3e-05,4e-06,2.5e-05,3e-06,3e-06,8e-06,5.4e-05,2.5e-05,-3e-05,2.9e-05,-1.6e-05,3.1e-05,2.2e-05,0,5.6e-05,-3.8e-05,2e-06,3e-05,-2.1e-05,-8e-06,-9.4e-05,-2.3e-05,2.6e-05,-2.9e-05,7.2e-05,2.9e-05,5.4e-05,5.8e-05,4.2e-05,-7e-06,3.1e-05,6.2e-05,5.8e-05,2e-05,1.2e-05,-6.8e-05,5.5e-05,2.1e-05,-3e-06,-7e-06,-1.6e-05,-1.2e-05,-2.2e-05,-2.3e-05,8e-06,9.8e-05,8e-06,-3.3e-05,-2e-05,-0.000105,2.7e-05,-5.1e-05,8e-06,-2.4e-05,-1.2e-05,-1.1e-05,-9e-06,3.4e-05,2e-06,5e-06,-2.5e-05,-2.7e-05,-2.8e-05,1.1e-05,-6e-06,-3e-06,1.6e-05,1.3e-05,2e-06,-5e-05,-2.7e-05,-3e-06,6.6e-05,9.2e-05,2.6e-05,-7e-06,-6e-06,2.2e-05,6.9e-05,4.4e-05,5.4e-05,-2.3e-05,-7e-06,-3.1e-05,-1.9e-05,4.1e-05,2.9e-05,-5e-06,3.3e-05,-3e-05,2e-05,2e-05,1.1e-05
0,-1.3e-05,-1.2e-05,1.3e-05,1e-05,6e-06,-5e-06,3e-06,-1.6e-05,2.2e-05,3.6e-05,-6e-06,-1.8e-05,-4.1e-05,-3.8e-05,-1.7e-05,-1.9e-05,1.6e-05,7e-06,5.2e-05,-4e-06,1e-05,-2.8e-05,-1.1e-05,1.9e-05,0,3.7e-05,-3e-06,2.6e-05,1.1e-05,-6e-06,-2.4e-05,-1e-05,-3.4e-05,5.7e-05,-4.1e-05,2.4e-05,5e-06,-6e-06,3.2e-05,-3.2e-05,2.2e-05,3.9e-05,6e-06,-1.4e-05,1e-06,2.2e-05,1e-06,4.6e-05,-1.8e-05,-7e-06,-2.4e-05,1.7e-05,0,-2e-05,-2.1e-05,1.6e-05,2.4e-05,3e-05,-2.1e-05,8.9e-05,-9e-06,-2.2e-05,-6e-06,4.5e-05,-6e-06,1.3e-05,1.9e-05,-1.2e-05,-1.5e-05,-1.3e-05,6e-06,1.6e-05,-3e-05,-1.4e-05,2.5e-05,1e-05,-2e-06,3e-05,1e-05,1.8e-05,-3.2e-05,1.1e-05,1.5e-05,-3.6e-05,-7e-06,-9e-06,-7e-06,-2.8e-05,-2.7e-05,1.4e-05,5e-06,-9e-06,2.8e-05,0,-1e-05,-9e-06,4.7e-05,-3.3e-05,-1e-05,1.9e-05,-8e-06,-4.9e-05,2.3e-05,-1.1e-05,-2.1e-05,2.3e-05,-1.2e-05,-2.5e-05,-8e-06,2e-06,7e-05,4.8e-05,3e-06,-1.1e-05,2.4e-05,-2.1e-05,1.5e-05,1.7e-05,-3.7e-05,8e-06
6e-06,2e-05,-1.3e-05,5e-06,-1.5e-05,2e-05,-1.1e-05,7e-06,-1e-05,3e-06,-2.5e-05,-2e-05,-2.1e-05,1.6e-05,-1.5e-05,-4.5e-05,2.4e-05,-3e-06,1.9e-05,-2e-05,1.3e-05,-7e-06,2.4e-05,2.1e-05,-1.6e-05,-9e-06,-2.5e-05,-1e-05,-6e-06,-2e-06,-6e-06,-6.4e-05,-1.6e-05,5.2e-05,2.4e-05,4e-05,1.3e-05,0,1.3e-05,3.5e-05,-4e-06,-3e-06,2.7e-05,-1.6e-05,3e-06,-3.9e-05,7e-06,1.4e-05,-1.4e-05,2.5e-05,-1.2e-05,1.3e-05,-1e-05,8e-06,-3e-06,2.9e-05,5.3e-05,-1e-06,1.5e-05,-3.9e-05,7e-06,-2.4e-05,1.3e-05,3.9e-05,0,1.8e-05,-4.1e-05,1e-06,-3e-06,1.2e-05,3e-06,1.4e-05,1.1e-05,-2.4e-05,-3e-06,-3.6e-05,1.5e-05,-4.8e-05,-1.1e-05,1e-06,1e-06,-9e-06,2.1e-05,7e-06,6.2e-05,-1.3e-05,4.6e-05,-1.2e-05,2.2e-05,5.1e-05,3e-06,-7e-06,-4e-06,-2e-05,-6e-06,2.2e-05,5.4e-05,-1e-05,8e-06,1.8e-05,-2.5e-05,4.7e-05,1.1e-05,3.5e-05,-2e-05,2e-05,5.8e-05,1.7e-05,-6e-06,-4.6e-05,4e-06,3.8e-05,-2e-06,3e-06,2.5e-05,1.6e-05,9e-06,3.9e-05,-1e-05,1.6e-05,1e-06
5e-06,-9e-06,9e-06,7e-06,-1e-05,2.7e-05,-1.2e-05,1e-05,6e-06,-1e-06,1.8e-05,6e-06,-1.1e-05,-1e-06,1.4e-05,8e-06,1.5e-05,-1.9e-05,1.1e-05,7e-06,1.2e-05,-6e-06,3.2e-05,-5e-06,-2.4e-05,-5e-06,-4e-06,5e-06,-6.3e-05,9e-06,-8e-06,4.1e-05,-8e-06,7e-06,-1.3e-05,0,-1e-06,-1.3e-05,4e-06,2.4e-05,-1.1e-05,1.4e-05,2.5e-05,1.4e-05,-1e-05,-1e-05,-1e-05,-3e-06,1e-06,1.6e-05,1.8e-05,2e-06,3.1e-05,1.5e-05,-9e-06,2.7e-05,-4.5e-05,1.5e-05,-4e-05,1.7e-05,1.3e-05,0,1e-06,3.3e-05,-1.9e-05,-6e-06,2.5e-05,-4e-06,1.3e-05,1.7e-05,9e-06,-1.5e-05,-2.5e-05,-4.3e-05,-3e-06,3.2e-05,-1e-06,2.8e-05,2e-06,-1.1e-05,-5e-06,-1e-06,3e-06,-1e-05,-1.4e-05,1.1e-05,-4.2e-05,6e-06,1.7e-05,-4.5e-05,5e-06,-4.2e-05,2e-06,1e-06,1.3e-05,-1.2e-05,-6e-06,2.5e-05,2.3e-05,1e-05,-1.5e-05,-7.5e-05,9e-06,3.2e-05,3e-06,4e-06,-2.4e-05,1.1e-05,2.7e-05,-9e-06,-3e-06,-7e-06,-3e-05,0,1.4e-05,-4.6e-05,9e-06,-1e-05,-6e-06,-7e-06,1.7e-05
1.1e-05,4e-06,2e-06,9e-06,1.7e-05,-3e-06,-8e-06,-5e-06,1.9e-05,1.1e-05,-2.4e-05,5e-06,-8e-06,1.3e-05,1e-05,2.8e-05,-3.6e-05,-4e-06,-6e-06,-2.9e-05,5e-06,-1.3e-05,-3.6e-05,-6e-06,-2.5e-05,1.7e-05,-1.9e-05,0,1.1e-05,-9e-06,-3e-06,4.7e-05,1.3e-05,-1.3e-05,-2.8e-05,-1.9e-05,-2e-06,1.2e-05,-2.4e-05,-1.2e-05,3.5e-05,-2.1e-05,7e-06,-1.5e-05,4e-06,1.5e-05,-3e-06,5e-06,-1.9e-05,-6e-06,-1.5e-05,1.1e-05,-2.2e-05,-6e-06,-9e-06,-3.1e-05,1.7e-05,1e-06,1e-06,1e-06,-1.1e-05,1.1e-05,-1e-06,-2.6e-05,0,5e-06,2e-06,-1.1e-05,1e-05,-1.1e-05,0,1.3e-05,-4e-06,5.7e-05,3e-06,-1.6e-05,6e-06,-3e-06,-1.5e-05,2.1e-05,3e-06,1.4e-05,1.2e-05,1.3e-05,-1.8e-05,-1.2e-05,2e-06,-8e-06,-2e-05,-4e-06,9e-06,4.4e-05,4e-06,1.2e-05,-3e-06,1e-06,-2.1e-05,-2.2e-05,1.2e-05,0,-2.2e-05,4.8e-05,0,1.5e-05,-1e-06,-9e-06,-1.2e-05,-2.9e-05,-3.7e-05,-4e-06,-7e-06,3.2e-05,2.7e-05,-2e-06,1.4e-05,1.4e-05,-2e-05,-1.9e-05,1.4e-05,1.9e-05,-1.4e-05
-6e-06,2e-06,2e-06,-1.2e-05,-9e-06,-2.4e-05,2e-06,-5e-06,-3.9e-05,-1.6e-05,2.5e-05,-1e-06,-8e-06,-1.8e-05,1.4e-05,1.7e-05,1.6e-05,-1.7e-05,-6e-06,3e-05,-1.6e-05,-6e-06,-3e-06,-2e-05,-2e-06,6e-06,3.6e-05,1e-05,2.4e-05,7e-06,3e-06,-1.5e-05,7e-06,1.7e-05,-2.2e-05,-1.2e-05,-9e-06,-7e-06,-2e-05,-2.3e-05,6e-06,-2e-05,-2.6e-05,5e-06,-8e-06,-5e-06,8e-06,-1e-05,2.6e-05,-9e-06,7e-06,-4e-06,-1.5e-05,-1.6e-05,2.2e-05,1.4e-05,-3.6e-05,-1.2e-05,-2e-06,1e-05,-3e-05,0,-3e-06,-9e-06,-4e-06,-1.5e-05,-2.9e-05,-4e-06,6e-06,8e-06,-2e-06,-8e-06,1.4e-05,-2.8e-05,0,-4e-06,-4e-06,2.6e-05,7e-06,-1e-06,1e-05,-1.1e-05,-3e-06,-1e-06,1.8e-05,1.6e-05,1e-06,3e-06,1.9e-05,1.4e-05,7e-06,1.4e-05,5e-06,-9e-06,-8e-06,1.1e-05,-7e-06,3.6e-05,1.1e-05,-7e-06,-4e-06,-1e-06,-1e-05,-7e-06,1.8e-05,7e-06,-2.8e-05,3.5e-05,1.7e-05,1.8e-05,3e-06,-2.3e-05,1e-06,1.4e-05,-2e-06,-4e-06,1.4e-05,5e-06,-1.4e-05,-8e-06,-1.6e-05
-8e-06,-9e-06,-3e-06,-4e-06,1.4e-05,1e-05,7e-06,7e-06,3.5e-05,-1.8e-05,-1.7e-05,1e-06,-4e-06,2e-05,-4e-06,-2.5e-05,-2e-06,2.5e-05,1.4e-05,-3e-06,-1.4e-05,-1e-06,2e-05,5e-06,1.7e-05,5e-06,-5e-06,1.2e-05,7e-06,1e-06,-4e-06,-4.6e-05,1e-05,-2e-05,-1e-06,3.3e-05,0,-6e-06,9e-06,-2.1e-05,-1.6e-05,1.1e-05,-2.1e-05,-2.1e-05,2e-06,6e-06,-8e-06,-2e-06,6e-06,6e-06,6e-06,-2.2e-05,-1e-06,-5e-06,1.2e-05,-1.9e-05,3.2e-05,1.2e-05,3e-06,-4.5e-05,-1.4e-05,-8e-06,2e-06,1e-06,-2e-06,1.1e-05,9e-06,-1e-06,-3e-06,-1.1e-05,9e-06,-5e-06,-2e-06,-1e-06,0,1e-06,-1e-05,3e-05,2e-06,-1.4e-05,-4e-06,-2.3e-05,-5e-06,-1e-06,-3e-05,-7e-06,1.9e-05,1e-06,-2.3e-05,-1.9e-05,-4e-06,1e-06,0,6e-06,8e-06,-1.3e-05,-1e-05,-1.3e-05,7e-06,-1e-06,1.6e-05,-6e-06,-1.4e-05,-9e-06,-6e-06,-7e-06,-6e-06,-9e-06,2e-06,1.7e-05,5e-06,-2.4e-05,4e-06,-7e-06,-1.1e-05,3e-06,-1.1e-05,3e-06,1.2e-05,3e-06,1.1e-05
6e-06,1e-05,2e-06,8e-06,-1.1e-05,-1.6e-05,-2e-06,2e-06,-4e-06,3e-06,1.6e-05,1e-06,-1e-06,4e-06,-1.3e-05,1.2e-05,-3e-06,3e-06,2e-06,-4e-06,0,6e-06,-1.3e-05,7e-06,2.6e-05,7e-06,1.7e-05,4e-06,0,1e-06,6e-06,1.2e-05,8e-06,7e-06,1.9e-05,-1.8e-05,7e-06,1.1e-05,-2e-06,-7e-06,-9e-06,2e-05,-2.1e-05,2e-06,-3e-06,-1e-06,-1e-06,2e-06,-9e-06,1.3e-05,-1.5e-05,1.8e-05,-8e-06,-1e-06,-9e-06,-1.3e-05,1.5e-05,0,1.5e-05,4.9e-05,-9e-06,-9e-06,6e-06,-2.8e-05,9e-06,-1e-05,-2e-06,-5e-06,-1e-06,-1.2e-05,6e-06,4e-06,0,-1.4e-05,-2e-06,1.3e-05,7e-06,8e-06,-7e-06,3e-06,-1e-06,-1e-06,-5e-06,3e-06,1.3e-05,1.9e-05,-8e-06,1e-06,1.7e-05,9e-06,-8e-06,-4.2e-05,-1e-06,-8e-06,2e-06,8e-06,2e-05,-1e-06,-2e-06,9e-06,1.6e-05,-1.9e-05,2e-05,-9e-06,8e-06,6e-06,6e-06,-2e-05,-3e-06,0,-3e-06,-3.4e-05,-5e-06,-1.1e-05,4e-06,8e-06,2e-06,-1e-05,-9e-06,-7e-06,0
1e-06,-4e-06,-7e-06,-5e-06,2e-06,-6e-06,1e-06,-2e-06,-1.7e-05,3e-06,-1.9e-05,-8e-06,3e-06,1e-06,-8e-06,8e-06,1.1e-05,7e-06,-7e-06,-1e-05,1.1e-05,3e-06,3e-06,-1.2e-05,1.4e-05,-8e-06,-3e-06,6e-06,-1.7e-05,-2e-06,-2e-06,5e-06,-3e-06,1.3e-05,1.9e-05,5e-06,-2e-06,1e-06,-2e-06,-1e-06,7e-06,-1.3e-05,-2.2e-05,-1.3e-05,0,2e-06,3e-06,3e-06,1.2e-05,7e-06,1.2e-05,-5e-06,3e-06,3e-06,-1.8e-05,2.2e-05,1.4e-05,-2e-06,-1.4e-05,-1.9e-05,2e-06,6e-06,-8e-06,3.8e-05,6e-06,4e-06,-2e-06,6e-06,-5e-06,-1e-06,0,-7e-06,0,2.4e-05,-1e-06,-1.2e-05,-2e-06,1.7e-05,-2e-06,4e-06,0,7e-06,4e-06,-1e-06,1e-05,-2.2e-05,-1.2e-05,2e-06,-7e-06,8e-06,1e-06,-3e-06,-4e-06,9e-06,-1e-05,0,4e-06,-7e-06,-1.7e-05,-1e-06,1.7e-05,1.5e-05,4e-06,0,-5e-06,-3e-06,6e-06,2.9e-05,-2e-06,0,-1e-06,3.1e-05,-1e-05,7e-06,-1.2e-05,-6e-06,3e-06,2e-06,2e-06,8e-06,-4e-06
1e-06,-2e-06,3e-06,-3e-06,-1e-05,3e-06,1e-05,5e-06,2.3e-05,4e-06,1.5e-05,7e-06,-1e-06,-2e-06,-1e-06,4e-06,-8e-06,2e-06,-1e-06,6e-06,9e-06,0,1.1e-05,5e-06,-1e-06,2e-06,3e-06,0,-1.2e-05,-1e-06,-1e-06,4e-05,1e-06,-5e-06,1.2e-05,-1e-05,4e-06,-6e-06,-7e-06,2.6e-05,1.8e-05,-1.2e-05,-1.3e-05,6e-06,0,-1e-06,1e-06,3e-06,-2e-05,-1.6e-05,-3e-06,1.3e-05,1.2e-05,6e-06,5e-06,-5e-06,-3.2e-05,2e-06,3e-06,1.6e-05,6e-06,9e-06,3e-06,1.3e-05,3e-06,-1.1e-05,1.1e-05,2e-06,-1e-06,-6e-06,-1e-06,5e-06,-3e-06,-6e-06,-1e-06,0,-2e-06,-2.7e-05,1e-06,-1.6e-05,4e-06,3e-06,-3e-06,1e-06,0,1.2e-05,6e-06,-2e-06,-1e-06,6e-06,-7e-06,2.9e-05,-1e-06,-7e-06,8e-06,-5e-06,7e-06,1.7e-05,-1.2e-05,-5e-06,3e-06,1.1e-05,-1e-05,6e-06,-6e-06,0,2.6e-05,-6e-06,-6e-06,-2e-06,2e-06,-4e-06,1.6e-05,5e-06,1.2e-05,-1e-05,-2e-06,1.3e-05,7e-06,-6e-06,0
4e-06,6e-06,8e-06,6e-06,4e-06,1.2e-05,-2e-06,-1e-06,0,5e-06,-1.3e-05,-1e-06,7e-06,4e-06,1.1e-05,-2.9e-05,0,-1.7e-05,2e-06,6e-06,-1e-06,-3e-06,-8e-06,9e-06,-1.6e-05,-2e-06,4e-06,-4e-06,1.1e-05,0,1e-06,-2e-05,-2e-06,0,-3e-06,1.6e-05,0,9e-06,-4e-06,1.4e-05,-9e-06,-6e-06,-2e-06,-1e-05,0,-9e-06,-3e-06,-1e-06,2.3e-05,-5e-06,-5e-06,-1.6e-05,7e-06,7e-06,5e-06,8e-06,-3e-06,-2e-06,-1.7e-05,-3.8e-05,-3e-06,5e-06,1e-06,-2.4e-05,-2e-06,3e-06,-9e-06,-1e-06,-2e-06,-6e-06,-1e-06,3e-06,1e-06,2e-06,1e-06,-3e-06,1e-06,-6e-06,-4e-06,1.6e-05,-2e-06,-3e-06,4e-06,-6e-06,-4e-06,-1.3e-05,9e-06,2e-06,1e-05,-3e-06,-1e-06,3e-06,1e-06,2e-06,2e-06,6e-06,-2.2e-05,-1.8e-05,-4e-06,-3e-06,-1.4e-05,3e-06,-6e-06,9e-06,1e-06,2e-06,-4e-06,-1.2e-05,1.4e-05,-3e-06,-1e-06,1.2e-05,-3e-06,5e-06,-3e-06,4e-06,-2e-06,-1e-06,-1e-06,1.1e-05,5e-06
-3e-06,-3e-06,-8e-06,-1e-06,0,5e-06,9e-06,-1e-06,-1.1e-05,-3e-06,1.5e-05,0,1e-06,1e-06,4e-06,7e-06,5e-06,4e-06,6e-06,-6e-06,-1.5e-05,-4e-06,-8e-06,2e-06,-1.5e-05,1e-06,3e-06,-1e-06,1e-05,1e-06,-2e-06,-3.4e-05,-2e-06,-3e-06,-1.4e-05,-1.2e-05,-6e-06,-4e-06,-6e-06,6e-06,-7e-06,7e-06,9e-06,9e-06,0,0,0,-2e-06,-1.1e-05,1e-05,1e-05,-2e-06,-9e-06,-1e-06,3e-06,1.3e-05,0,2e-06,6e-06,3.7e-05,-4e-06,-7e-06,0,3e-06,1e-06,-7e-06,-4e-06,-3e-06,1e-06,-2e-06,1e-06,-7e-06,1e-06,-2e-06,1e-06,1e-05,-4e-06,-2.4e-05,-2e-06,-3e-06,-3e-06,-7e-06,-2e-06,1e-06,-1e-06,1e-05,-8e-06,-2e-06,-5e-06,1.2e-05,5e-06,-5e-06,2e-06,5e-06,-7e-06,-3e-06,5e-06,9e-06,6e-06,6e-06,-1.9e-05,-2.3e-05,5e-06,1e-05,4e-06,-2e-06,1e-05,1.6e-05,-1e-05,-3e-06,-1e-06,2e-05,-9e-06,0,9e-06,1.1e-05,7e-06,-8e-06,-1.2e-05,-1.3e-05,2e-06
-2e-06,-2e-06,8e-06,-3e-06,-1e-06,-9e-06,-3e-06,1e-06,9e-06,-2e-06,-1.1e-05,0,5e-06,-7e-06,2e-06,6e-06,-6e-06,-9e-06,-5e-06,0,-2e-06,-1e-06,1.3e-05,-7e-06,-6e-06,6e-06,-1e-06,-3e-06,4e-06,-1e-06,1e-06,8e-06,-2e-06,5e-06,-1.2e-05,0,5e-06,-4e-06,-4e-06,-6e-06,-4e-06,6e-06,1.1e-05,-7e-06,-2e-06,6e-06,3e-06,-1e-06,4e-06,1e-05,-9e-06,7e-06,-2e-06,-8e-06,4e-06,-1.6e-05,1.6e-05,-3e-06,1.6e-05,-1.5e-05,-1e-06,-2e-06,-3e-06,-2e-06,-4e-06,3e-06,1.2e-05,0,1e-06,-6e-06,0,3e-06,3e-06,7e-06,0,-9e-06,-6e-06,1e-06,3e-06,-6e-06,2e-06,2e-06,-2e-06,2e-06,1e-06,-7e-06,-1e-06,-1e-06,-6e-06,3e-06,3e-06,-1e-05,1e-06,-5e-06,3e-06,2e-06,-4e-06,-1e-06,5e-06,3e-06,-9e-06,5e-06,1.3e-05,4e-06,-4e-06,0,-2.2e-05,-8e-06,2e-06,-9e-06,2e-06,-3e-06,4e-06,-7e-06,0,-9e-06,-8e-06,4e-06,1.4e-05,1.1e-05,-9e-06
2e-06,2e-06,-5e-06,1e-06,5e-06,3e-06,4e-06,0,0,-1e-06,1.1e-05,-3e-06,4e-06,0,-7e-06,3e-06,7e-06,8e-06,-1e-06,-4e-06,3e-06,0,0,5e-06,8e-06,-5e-06,-6e-06,1e-06,-1.4e-05,0,-1e-06,2.6e-05,1e-06,-1e-05,-4e-06,2e-06,-1e-06,3e-06,2e-06,-1.6e-05,6e-06,-7e-06,1.7e-05,7e-06,1e-06,2e-06,-4e-06,0,-9e-06,-8e-06,4e-06,-1e-06,0,-5e-06,-1e-05,3e-06,3e-06,0,-1.2e-05,5e-06,0,-1e-06,3e-06,-8e-06,-3e-06,-8e-06,-8e-06,0,4e-06,-5e-06,-2e-06,-2e-06,-2e-06,9e-06,0,3e-06,3e-06,0,-1e-06,5e-06,0,9e-06,-1e-06,-2e-06,-6e-06,1e-05,-7e-06,1e-06,8e-06,-1.5e-05,1e-06,-5e-06,0,0,3e-06,1e-06,9e-06,1.1e-05,1e-05,-5e-06,1e-05,1.6e-05,-1e-05,-1e-06,8e-06,0,-3e-06,0,1e-06,-4e-06,-1e-06,-1.1e-05,-1e-06,-2e-06,0,8e-06,6e-06,1e-06,-3e-06,-9e-06,0
-1e-06,-3e-06,-5e-06,1e-06,-9e-06,0,3e-06,0,-5e-06,3e-06,-1.2e-05,4e-06,1e-06,-3e-06,-8e-06,-1.2e-05,-5e-06,4e-06,2e-06,7e-06,7e-06,1e-06,-9e-06,4e-06,1.5e-05,3e-06,0,1e-06,-6e-06,-2e-06,1e-06,3e-06,1e-06,1e-05,6e-06,1e-05,1e-06,3e-06,2e-06,-1.5e-05,6e-06,-3e-06,1.2e-05,-5e-06,-2e-06,-2e-06,-1e-06,2e-06,1.1e-05,-9e-06,5e-06,8e-06,-5e-06,0,0,-5e-06,-1e-06,2e-06,1e-06,-2e-05,1e-05,4e-06,-3e-06,1.6e-05,3e-06,3e-06,2e-06,-1e-06,1e-06,-1e-06,-2e-06,0,-3e-06,-4e-06,0,-1e-06,-2e-06,6e-06,6e-06,-1e-06,0,5e-06,4e-06,0,1.1e-05,-8e-06,1.6e-05,-1e-06,-8e-06,1e-05,3e-06,9e-06,-1e-06,2e-06,-6e-06,-4e-06,2e-06,-1.5e-05,8e-06,0,1.5e-05,-1e-05,-5e-06,-4e-06,-4e-06,2e-06,-1e-05,6e-06,-6e-06,4e-06,-1e-06,-2e-05,6e-06,4e-06,-3e-06,-7e-06,-1e-06,-6e-06,-9e-06,9e-06,3e-06
1e-06,2e-06,5e-06,0,4e-06,-6e-06,-1e-06,-1e-06,-2e-06,6e-06,1e-05,-4e-06,4e-06,1e-06,3e-06,9e-06,-2e-06,4e-06,2e-06,-3e-06,5e-06,1e-06,8e-06,-7e-06,1.2e-05,1e-06,-8e-06,2e-06,7e-06,1e-06,1e-06,-1e-05,2e-06,0,1e-05,-1.1e-05,1e-06,-3e-06,-5e-06,0,-2e-06,-9e-06,1.1e-05,9e-06,1e-06,-2e-06,1e-06,0,-5e-06,0,-8e-06,-1.4e-05,0,-2e-06,4e-06,-8e-06,-1.1e-05,-3e-06,-5e-06,1.7e-05,1.3e-05,-2e-06,3e-06,9e-06,3e-06,-4e-06,6e-06,1e-06,-1e-06,-1e-06,-1e-06,3e-06,2e-06,-2e-06,0,5e-06,-2e-06,1.8e-05,-2e-06,-7e-06,-3e-06,-2e-06,-1e-06,2e-06,-4e-06,1e-06,-9e-06,1e-06,6e-06,1e-06,-2e-06,6e-06,-1e-06,0,4e-06,3e-06,0,1.2e-05,-1e-06,2e-06,1e-05,-7e-06,1e-06,-4e-06,0,-1e-06,8e-06,-1e-05,8e-06,0,2e-06,1.4e-05,-6e-06,0,0,-8e-06,-2e-06,0,1.2e-05,-8e-06,0
2e-06,1e-06,-6e-06,-1e-06,-6e-06,-2e-06,-3e-06,0,1e-05,-3e-06,-9e-06,3e-06,0,-6e-06,1e-06,9e-06,5e-06,1e-06,0,0,-5e-06,0,-1e-06,-1e-06,0,-4e-06,3e-06,3e-06,6e-06,1e-06,-1e-06,-2.1e-05,1e-06,-9e-06,6e-06,3e-06,-3e-06,-1e-06,-4e-06,5e-06,-5e-06,7e-06,1e-06,-6e-06,-2e-06,-1e-06,1e-06,1e-06,-1e-06,1.2e-05,7e-06,5e-06,4e-06,5e-06,6e-06,1e-05,-6e-06,0,1e-06,0,6e-06,-3e-06,-2e-06,-1.9e-05,1e-06,3e-06,-5e-06,0,-2e-06,-2e-06,0,-6e-06,1e-06,2e-06,0,-8e-06,1e-06,6e-06,0,1e-05,1e-06,-3e-06,2e-06,-1e-06,-6e-06,-1e-06,0,0,-1e-06,-1.7e-05,-5e-06,2e-06,-1e-06,0,1e-06,-1e-06,-8e-06,-6e-06,-9e-06,1e-06,-1e-06,-3e-06,7e-06,-1e-06,0,-1e-06,6e-06,7e-06,-5e-06,6e-06,0,-1.6e-05,-3e-06,1e-06,-3e-06,1.2e-05,3e-06,6e-06,-4e-06,8e-06,-1e-06
-2e-06,-3e-06,5e-06,-1e-06,4e-06,5e-06,2e-06,-1e-06,-1e-05,-5e-06,9e-06,2e-06,2e-06,2e-06,5e-06,-4e-06,-3e-06,-4e-06,-2e-06,-3e-06,-7e-06,-2e-06,-6e-06,4e-06,-1.1e-05,4e-06,-4e-06,0,0,0,1e-06,2e-06,1e-06,8e-06,-1e-06,3e-06,1e-06,1e-06,-1e-06,1.3e-05,-4e-06,2e-06,-6e-06,8e-06,1e-06,1e-06,-2e-06,-1e-06,3e-06,1e-06,-2e-06,0,2e-06,6e-06,-6e-06,-1e-06,1.4e-05,0,5e-06,-1e-05,1e-06,-3e-06,-1e-06,2e-06,0,-4e-06,1e-06,1e-06,-1e-06,0,0,4e-06,0,1.1e-05,0,5e-06,-2e-06,1.2e-05,0,-3e-06,0,4e-06,-1e-06,-1e-06,4e-06,-1e-06,-1e-06,0,-3e-06,1.5e-05,-2e-06,-1e-05,0,-2e-06,-3e-06,-2e-06,-2e-06,5e-06,-6e-06,0,-1e-05,2e-05,2e-06,1e-06,0,1e-06,7e-06,1e-06,0,-2e-06,-2e-06,1.5e-05,8e-06,-2e-06,3e-06,-3e-06,-2e-06,0,-5e-06,-8e-06,1e-06
-1e-06,4e-06,2e-06,1e-06,-3e-06,4e-06,-2e-06,-1e-06,-4e-06,0,-1e-05,-5e-06,2e-06,-2e-06,0,-6e-06,0,-7e-06,0,1e-06,-1e-06,0,5e-06,-2e-06,-1.4e-05,-1e-06,0,1e-06,-4e-06,-1e-06,-2e-06,3.2e-05,0,-6e-06,-7e-06,-3e-06,-1e-06,0,3e-06,1.4e-05,7e-06,-5e-06,-9e-06,-5e-06,-1e-06,-1e-06,0,-1e-06,-2e-06,-9e-06,-3e-06,4e-06,-1e-06,0,-2e-06,3e-06,1e-06,-1e-06,-1e-06,2e-06,-7e-06,4e-06,4e-06,2e-06,0,2e-06,2e-06,-2e-06,0,-1e-06,-2e-06,-2e-06,-1e-06,-1e-05,0,0,-2e-06,-1.1e-05,0,-6e-06,0,6e-06,0,0,-4e-06,3e-06,3e-06,0,5e-06,1e-06,-1e-06,-8e-06,1e-06,2e-06,1e-06,2e-06,5e-06,-1e-05,-3e-06,-1e-06,-1.1e-05,-9e-06,-9e-06,2e-06,0,0,4e-06,-7e-06,0,-1e-06,1e-06,6e-06,-3e-06,-2e-06,0,0,0,-4e-06,9e-06,9e-06,3e-06
2e-06,-1e-06,-5e-06,0,3e-06,-1e-06,-1e-06,1e-06,1.3e-05,-2e-06,9e-06,2e-06,-2e-06,1e-06,-5e-06,2e-06,2e-06,1e-06,0,2e-06,5e-06,-1e-06,2e-06,-2e-06,-7e-06,0,-4e-06,-1e-06,-3e-06,2e-06,0,-5e-06,-1e-06,2e-06,-6e-06,-2e-06,0,-2e-06,-1e-06,-1e-06,2e-06,-3e-06,-1.2e-05,5e-06,1e-06,0,0,1e-06,5e-06,-5e-06,6e-06,1e-06,2e-06,-1e-06,0,5e-06,1e-06,0,1e-06,4e-06,-1e-05,2e-06,-5e-06,-4e-06,-2e-06,-3e-06,-2e-06,0,0,-1e-06,0,-3e-06,-1e-06,1e-06,0,2e-06,2e-06,-3e-06,-1e-06,7e-06,-2e-06,1e-06,-2e-06,1e-06,2e-06,0,0,-1e-06,-3e-06,-1.2e-05,1e-06,1.2e-05,1e-06,1e-06,2e-06,0,0,1.1e-05,0,-1e-06,-4e-06,-6e-06,1e-06,2e-06,1e-06,1e-06,-7e-06,7e-06,1e-06,-1e-06,1e-06,9e-06,-3e-06,3e-06,0,-1e-06,1e-06,2e-06,-6e-06,-9e-06,-2e-06
-1e-06,-2e-06,3e-06,-1e-06,-1e-06,-3e-06,-1e-06,0,-1.2e-05,-1e-06,-9e-06,1e-06,1e-06,-2e-06,-1e-06,4e-06,-3e-06,-2e-06,2e-06,0,5e-06,0,-5e-06,3e-06,4e-06,2e-06,3e-06,-2e-06,2e-06,-1e-06,0,-1.8e-05,-1e-06,1e-06,-2e-06,0,2e-06,4e-06,0,-7e-06,-1e-06,-2e-06,-1.1e-05,-5e-06,0,1e-06,0,1e-06,-4e-06,8e-06,-5e-06,-7e-06,-2e-06,0,1e-06,-7e-06,-1.2e-05,-1e-06,-9e-06,1.2e-05,-9e-06,1e-06,4e-06,9e-06,-1e-06,3e-06,3e-06,0,0,2e-06,1e-06,3e-06,0,-1e-06,0,-5e-06,0,-1.5e-05,0,-4e-06,0,-4e-06,1e-06,0,2e-06,4e-06,-3e-06,1e-06,-1e-06,1.6e-05,2e-06,3e-06,0,-2e-06,-3e-06,-1e-06,5e-06,-7e-06,4e-06,0,3e-06,-5e-06,3e-06,0,-2e-06,-1e-06,-1e-06,-2e-06,3e-06,-3e-06,-2e-06,-1.1e-05,0,0,3e-06,-2e-06,-1e-06,3e-06,-2e-06,8e-06,-2e-06
0,2e-06,-1e-06,1e-06,-2e-06,2e-06,-1e-06,0,1e-06,3e-06,8e-06,1e-06,-3e-06,2e-06,-1e-06,-8e-06,4e-06,7e-06,-2e-06,-4e-06,0,1e-06,1e-06,0,1.3e-05,-4e-06,-1e-06,-1e-06,1e-06,0,1e-06,-8e-06,0,1e-06,4e-06,5e-06,-1e-06,-1e-06,1e-06,-1.1e-05,-6e-06,2e-06,-5e-06,7e-06,0,0,0,-1e-06,2e-06,7e-06,1e-06,2e-06,-3e-06,-5e-06,2e-06,0,5e-06,1e-06,4e-06,-2.3e-05,-4e-06,-1e-06,-2e-06,4e-06,1e-06,-2e-06,0,0,0,2e-06,1e-06,-3e-06,0,6e-06,0,4e-06,-2e-06,-6e-06,0,-4e-06,1e-06,-3e-06,-1e-06,-2e-06,0,-7e-06,-1e-06,-1e-06,4e-06,0,3e-06,1e-06,-1e-06,1e-06,1e-06,2e-06,-4e-06,7e-06,6e-06,3e-06,9e-06,1.7e-05,4e-06,-1e-06,3e-06,1e-06,-7e-06,-5e-06,-7e-06,0,0,-6e-06,1e-06,-1e-06,-4e-06,-3e-06,0,-5e-06,8e-06,-9e-06,2e-06
1e-06,-2e-06,0,1e-06,2e-06,-1e-06,1e-06,0,7e-06,-1e-06,-8e-06,-2e-06,-1e-06,0,2e-06,1e-06,-3e-06,5e-06,-1e-06,1e-06,-6e-06,0,4e-06,0,1.1e-05,2e-06,1e-06,-2e-06,2e-06,1e-06,1e-06,9e-06,0,-4e-06,5e-06,-3e-06,0,-2e-06,-1e-06,-1.2e-05,2e-06,-2e-06,-1e-06,-5e-06,0,-1e-06,0,0,-3e-06,-5e-06,1e-06,1e-06,2e-06,-3e-06,0,-3e-06,-4e-06,-1e-06,3e-06,1.3e-05,2e-06,1e-06,0,-1.4e-05,1e-06,2e-06,-4e-06,0,1e-06,2e-06,0,2e-06,1e-06,-8e-06,0,-1e-06,2e-06,-3e-06,-1e-06,8e-06,-1e-06,2e-06,1e-06,1e-06,-3e-06,7e-06,4e-06,0,-3e-06,-8e-06,2e-06,-9e-06,0,-1e-06,1e-06,-1e-06,-2e-06,-9e-06,4e-06,-1e-06,9e-06,-8e-06,-3e-06,-2e-06,-4e-06,0,1e-06,8e-06,6e-06,-3e-06,1e-06,4e-06,2e-06,-1e-06,2e-06,7e-06,1e-06,-2e-06,-8e-06,1e-05,0
-1e-06,0,2e-06,-1e-06,-4e-06,-3e-06,-3e-06,0,-6e-06,0,8e-06,-1e-06,-1e-06,0,2e-06,1e-06,1e-06,-2e-06,1e-06,3e-06,-4e-06,0,-3e-06,0,2e-06,0,3e-06,0,-2e-06,-1e-06,0,1.8e-05,0,0,2e-06,3e-06,0,1e-06,-1e-06,-1e-06,7e-06,-2e-06,5e-06,6e-06,-1e-06,-1e-06,0,0,5e-06,-1e-05,-2e-06,3e-06,-1e-06,1e-06,-4e-06,-2e-06,1.3e-05,-1e-06,-1e-06,-8e-06,3e-06,0,1e-06,-1e-06,0,-1e-06,2e-06,-1e-06,0,3e-06,0,0,0,1e-06,0,1e-06,-1e-06,-2e-06,1e-06,-3e-06,0,3e-06,-1e-06,0,0,-8e-06,-4e-06,0,0,7e-06,-1e-06,-1e-06,0,2e-06,-1e-06,0,-4e-06,1.1e-05,-1e-06,-3e-06,2e-06,-4e-06,-5e-06,-1e-06,2e-06,-1e-06,-2e-06,-5e-06,-1e-06,-1e-06,-1e-06,-1.5e-05,-3e-06,-1e-06,-2e-06,2e-06,-2e-06,4e-06,3e-06,-9e-06,-1e-06
0,2e-06,-2e-06,0,5e-06,2e-06,0,-1e-06,-1e-06,1e-06,-8e-06,2e-06,-2e-06,0,-1e-06,5e-06,2e-06,1e-06,-1e-06,0,3e-06,-1e-06,-2e-06,0,-9e-06,-3e-06,0,1e-06,-1e-06,-1e-06,0,1e-06,1e-06,6e-06,-2e-06,-4e-06,-1e-06,2e-06,1e-06,1e-05,-3e-06,-2e-06,1e-05,-6e-06,1e-06,1e-06,-1e-06,0,-4e-06,3e-06,1e-06,0,0,2e-06,0,5e-06,-9e-06,0,3e-06,1.7e-05,5e-06,0,-3e-06,1e-05,-1e-06,3e-06,1e-06,1e-06,0,2e-06,0,-2e-06,0,-5e-06,0,-4e-06,0,1.6e-05,-1e-06,-4e-06,-1e-06,-3e-06,1e-06,1e-06,3e-06,7e-06,4e-06,0,3e-06,1e-06,-1e-06,2e-06,0,0,0,1e-06,5e-06,-9e-06,-4e-06,1e-06,-6e-06,-8e-06,3e-06,0,1e-06,0,6e-06,-4e-06,-6e-06,1e-06,-1e-06,1.3e-05,-1e-06,0,1e-06,-8e-06,3e-06,1e-06,3e-06,9e-06,0
