0.159644,0.151292,0.163505,0.166025,0.182376,0.19527,0.181187,0.171854,0.16704,0.154274,0.149907,0.140064,0.118206,0.11211,0.123656,0.132188,0.125445,0.133486,0.143026,0.135446,0.133174,0.132094,0.130473,0.123138,0.130903,0.137488,0.126369,0.118439
0.189517,0.178336,0.194051,0.202389,0.221841,0.238417,0.222604,0.2069,0.200062,0.189488,0.184077,0.170076,0.144475,0.136689,0.150264,0.158478,0.149366,0.160018,0.170421,0.162339,0.166253,0.166322,0.160228,0.149564,0.160667,0.172807,0.159181,0.144728
0.233122,0.218916,0.237678,0.255213,0.278413,0.300015,0.283614,0.257812,0.246985,0.241515,0.235301,0.214663,0.184285,0.175278,0.193293,0.20083,0.187595,0.202375,0.211764,0.201528,0.218136,0.221109,0.206251,0.191041,0.208783,0.230923,0.213345,0.186381
0.253433,0.240173,0.252907,0.27343,0.294448,0.314847,0.302378,0.273618,0.261376,0.261264,0.252871,0.22859,0.20234,0.198776,0.222412,0.229922,0.212078,0.222702,0.227481,0.216749,0.243684,0.248219,0.226555,0.213811,0.236966,0.264662,0.246563,0.212361
0.273017,0.260299,0.254716,0.267847,0.284477,0.293029,0.282738,0.261539,0.25543,0.258177,0.243392,0.22517,0.216288,0.222336,0.252314,0.258272,0.232361,0.224909,0.216255,0.210047,0.238491,0.244724,0.232651,0.232129,0.252432,0.272485,0.255189,0.226917
0.365529,0.344932,0.318704,0.322915,0.348883,0.353521,0.342666,0.313732,0.315788,0.335898,0.309459,0.299315,0.308273,0.318117,0.364365,0.363083,0.314303,0.286076,0.260703,0.259283,0.274341,0.277341,0.299053,0.320317,0.321463,0.320838,0.308366,0.300429
0.590507,0.566408,0.515231,0.506827,0.545988,0.564527,0.557745,0.500865,0.527613,0.584814,0.525805,0.499271,0.515878,0.531701,0.607628,0.609532,0.5286,0.473327,0.426562,0.424375,0.423959,0.422122,0.484562,0.53363,0.526409,0.515775,0.497855,0.498733
0.964904,0.95907,0.867725,0.80824,0.855558,0.913827,0.920128,0.830548,0.938717,1.04799,0.889851,0.801658,0.832339,0.877602,0.992054,1.009881,0.892192,0.802451,0.725193,0.692919,0.657684,0.650268,0.770802,0.873005,0.880747,0.860698,0.815683,0.830475
1.491018,1.548612,1.416936,1.238467,1.26962,1.389748,1.413789,1.303606,1.575499,1.743101,1.38539,1.173628,1.242263,1.380565,1.54532,1.565324,1.389455,1.275506,1.184503,1.065376,0.946513,0.92103,1.112145,1.297169,1.346537,1.31628,1.228448,1.288297
2.105297,2.27732,2.122812,1.798706,1.798915,1.956186,2.004547,1.902113,2.381719,2.602659,1.952717,1.553871,1.683884,1.992825,2.224834,2.218243,1.949459,1.831993,1.76862,1.501042,1.259272,1.196312,1.42509,1.713894,1.867289,1.852534,1.711293,1.832729
2.588432,2.864379,2.713598,2.269966,2.24475,2.394161,2.472172,2.426884,3.087599,3.341027,2.418268,1.841694,2.023378,2.50362,2.797076,2.762468,2.430334,2.330224,2.283588,1.84789,1.529219,1.439601,1.623662,1.983444,2.275791,2.321474,2.14111,2.290899
2.606316,2.902116,2.780619,2.298065,2.271358,2.365825,2.456901,2.510786,3.224218,3.484587,2.516359,1.899645,2.055631,2.558374,2.859115,2.813087,2.518895,2.483222,2.424402,1.903122,1.617089,1.547557,1.636238,1.976635,2.335294,2.421138,2.216788,2.349982
2.084295,2.292059,2.201262,1.798685,1.784337,1.80723,1.890929,2.017332,2.542903,2.739585,2.050665,1.591894,1.645127,1.980913,2.200747,2.177546,2.018237,2.074523,2.014862,1.540481,1.371563,1.391901,1.402498,1.615565,1.926767,1.99616,1.769255,1.831814
1.377967,1.439324,1.432078,1.24156,1.198647,1.198002,1.219811,1.289833,1.510913,1.587742,1.306002,1.109815,1.133049,1.23112,1.281153,1.284913,1.246775,1.327252,1.271448,0.975466,0.930032,1.029711,1.021201,1.098705,1.280546,1.281622,1.084748,1.08175
1.188779,1.067183,1.092762,1.172493,1.182268,1.213105,1.162777,1.145574,1.098512,1.028723,1.036981,1.05054,1.18868,1.11147,0.905271,0.831914,0.876643,0.954311,0.81957,0.761279,0.828726,0.826323,0.794993,0.826334,0.927983,0.915293,0.799337,0.749872
1.649312,1.346198,1.323941,1.607442,1.739528,1.759469,1.670026,1.649001,1.481545,1.32332,1.437781,1.551199,1.812752,1.646148,1.248097,1.082162,1.119743,1.208525,1.035926,1.110927,1.221468,1.073805,1.022942,1.061847,1.124536,1.14019,1.073578,1.005656
2.250843,1.775043,1.670647,2.102689,2.420863,2.467893,2.336682,2.326196,2.076857,1.839384,2.020124,2.23417,2.591804,2.324424,1.767161,1.553476,1.513304,1.607912,1.484929,1.638376,1.738858,1.466611,1.419817,1.472682,1.548828,1.620179,1.523318,1.415205
2.621455,2.14027,1.976451,2.384405,2.817296,2.918492,2.831574,2.889521,2.592288,2.303016,2.497999,2.74631,3.109563,2.782273,2.140361,1.938363,1.857652,1.990881,1.963995,2.098051,2.120119,1.772795,1.772089,1.820324,1.91312,2.080329,1.950874,1.782782
2.73983,2.433909,2.269418,2.464889,2.755969,2.939095,3.099955,3.287925,2.923075,2.653141,2.846496,2.948286,3.157827,2.893879,2.324207,2.165709,2.171378,2.378878,2.382739,2.372941,2.325535,2.016789,2.062008,2.072573,2.136416,2.433476,2.313922,2.104366
2.830533,2.668456,2.534961,2.538207,2.55024,2.790468,3.240219,3.484757,3.020696,2.844813,3.021681,2.841371,2.814391,2.754268,2.470501,2.340094,2.406862,2.633416,2.662259,2.519134,2.415366,2.338528,2.53572,2.409044,2.317955,2.765076,2.653931,2.337761
2.92372,2.702108,2.476756,2.43797,2.417605,2.697944,3.128148,3.124513,2.66809,2.804212,3.06741,2.662604,2.42608,2.521995,2.488654,2.409251,2.43908,2.560762,2.64607,2.507589,2.351093,2.518255,2.924056,2.650906,2.391504,2.888313,2.777543,2.350049
2.649217,2.489074,2.194852,2.071363,2.053099,2.269079,2.456302,2.177711,1.954736,2.469764,2.750966,2.207889,1.963547,2.191576,2.260634,2.134351,2.039922,2.093643,2.192954,2.051776,1.896707,2.205258,2.735883,2.469044,2.207859,2.642261,2.533834,2.042578
2.049805,2.066382,1.835961,1.625947,1.625322,1.728378,1.648841,1.369902,1.439126,1.96963,2.050466,1.516621,1.406376,1.724581,1.863445,1.670233,1.444167,1.530168,1.604041,1.393779,1.306691,1.561217,1.985613,1.912409,1.784226,2.071617,1.974269,1.526076
1.648536,1.730884,1.476774,1.205867,1.322553,1.435973,1.209723,1.090052,1.339622,1.526443,1.297969,0.953853,0.964266,1.21087,1.339228,1.185202,0.963069,1.107373,1.243792,1.00593,0.94301,1.101509,1.250469,1.243571,1.261196,1.368188,1.276786,1.047656
1.680874,1.662551,1.217658,0.991485,1.248605,1.382545,1.161571,1.209235,1.487134,1.481989,1.163102,0.886759,0.86924,1.025856,1.06546,0.922762,0.851052,1.144392,1.336991,1.059712,0.943025,1.07527,1.089068,1.00248,1.177788,1.214013,1.023948,0.904368
1.779348,1.757302,1.234326,1.057523,1.329112,1.383733,1.251362,1.458382,1.694497,1.597318,1.257494,0.931855,0.866297,1.074797,1.126785,0.931447,0.943659,1.41219,1.669373,1.26547,1.043685,1.184751,1.207596,1.080619,1.332472,1.326824,0.963577,0.917626
1.617738,1.690312,1.27148,1.11018,1.351632,1.469715,1.427539,1.605788,1.704282,1.460712,1.111283,0.858193,0.875036,1.194986,1.240575,0.955574,1.013603,1.558409,1.860017,1.35174,1.063795,1.27154,1.347734,1.221848,1.427683,1.343007,0.842956,0.881665
1.253024,1.35425,1.19637,1.067388,1.21026,1.376969,1.39374,1.480208,1.434068,1.133445,0.83815,0.764185,0.916386,1.234579,1.217923,0.883801,0.954752,1.412997,1.736207,1.307025,1.018423,1.24885,1.348553,1.26571,1.325909,1.193083,0.765068,0.831752
0.793345,0.852325,0.942631,0.88924,0.964706,1.123216,1.12012,1.164925,1.084644,0.837926,0.678387,0.802583,1.014658,1.124219,0.989167,0.714394,0.790562,1.083616,1.321908,1.102342,0.889039,1.016305,1.108155,1.097153,1.043148,0.947767,0.689697,0.741771
0.435344,0.495579,0.631101,0.580044,0.644874,0.79611,0.747647,0.764432,0.717717,0.597023,0.560099,0.778569,1.002558,0.880764,0.679083,0.564527,0.576535,0.679016,0.820978,0.771557,0.656778,0.652458,0.733647,0.802126,0.744367,0.759129,0.627677,0.60639
0.331002,0.379994,0.439065,0.338823,0.36964,0.471545,0.484399,0.523667,0.511968,0.491978,0.47907,0.631374,0.80686,0.681611,0.508905,0.498908,0.451186,0.396247,0.474463,0.481642,0.454331,0.417202,0.507406,0.605815,0.5557,0.646135,0.558632,0.416789
0.333268,0.384296,0.425104,0.293837,0.214129,0.267484,0.345424,0.371963,0.35654,0.405683,0.426576,0.438975,0.499616,0.503761,0.417779,0.43419,0.409888,0.281632,0.310432,0.369157,0.351953,0.332085,0.424294,0.439364,0.404098,0.510888,0.441511,0.273191
0.325851,0.354217,0.37462,0.283035,0.192647,0.187239,0.253785,0.268352,0.25352,0.352702,0.378748,0.285176,0.262937,0.33075,0.302894,0.33697,0.343876,0.244963,0.286215,0.348644,0.279084,0.258634,0.323169,0.279715,0.247726,0.327127,0.330252,0.237644
0.327518,0.29313,0.268271,0.248062,0.194866,0.171368,0.236386,0.259977,0.261721,0.336716,0.316922,0.228043,0.203644,0.23593,0.211479,0.252036,0.286279,0.203526,0.249947,0.328714,0.247513,0.209663,0.236028,0.219135,0.196517,0.20829,0.242105,0.221052
0.328967,0.219724,0.191006,0.233438,0.197789,0.170428,0.211792,0.241078,0.255196,0.268975,0.23063,0.191141,0.167671,0.174813,0.159045,0.190598,0.23131,0.152194,0.178697,0.274355,0.234618,0.169828,0.172787,0.187519,0.174573,0.159603,0.172073,0.172971
0.293824,0.153439,0.158036,0.218197,0.188564,0.152626,0.155321,0.181214,0.195213,0.165813,0.13551,0.139952,0.13177,0.132722,0.126101,0.142572,0.169583,0.128421,0.122833,0.191037,0.207211,0.150469,0.148586,0.155668,0.127903,0.107508,0.104453,0.103724
0.242217,0.120717,0.149649,0.185926,0.150323,0.126879,0.113578,0.115251,0.112835,0.088434,0.067652,0.086879,0.098202,0.093641,0.099052,0.100117,0.11089,0.114401,0.089971,0.119211,0.155913,0.125458,0.125761,0.116031,0.07727,0.069353,0.068627,0.054265
0.184031,0.103134,0.12916,0.139324,0.107989,0.107123,0.107967,0.07657,0.05434,0.052348,0.049474,0.071217,0.09098,0.086202,0.093529,0.088229,0.08009,0.101316,0.093885,0.089793,0.099177,0.084789,0.092119,0.096241,0.059813,0.048118,0.047064,0.038065
0.113699,0.073693,0.094191,0.09347,0.078984,0.085192,0.093136,0.049709,0.033401,0.046242,0.055022,0.073091,0.084241,0.084436,0.094464,0.105274,0.083538,0.088999,0.092509,0.074654,0.064627,0.06026,0.070687,0.080629,0.057131,0.040488,0.035099,0.033989
0.056945,0.044822,0.057404,0.055578,0.053671,0.064891,0.070457,0.038334,0.029791,0.049819,0.060879,0.074898,0.07994,0.084082,0.102526,0.118652,0.079522,0.066069,0.074908,0.068799,0.069678,0.0662,0.071851,0.064708,0.055847,0.049847,0.036076,0.039893
