0.166764,0.162109,0.148848,0.134189,0.131975,0.124621,0.120356,0.119421,0.122849,0.136318,0.134814,0.109959,0.086218,0.065678,0.06185,0.075614,0.080585,0.085534,0.089466,0.082423,0.068552,0.056579,0.050536,0.045117,0.042646,0.03894,0.039991,0.049846
0.212209,0.206533,0.188732,0.169918,0.1669,0.157445,0.152014,0.149916,0.156956,0.178393,0.175611,0.14135,0.112411,0.087072,0.081237,0.099689,0.107229,0.113699,0.1189,0.110523,0.090624,0.07299,0.064893,0.057315,0.053678,0.049595,0.051485,0.063537
0.282366,0.274973,0.250596,0.225907,0.221082,0.208244,0.20069,0.19716,0.211905,0.246145,0.240483,0.19203,0.156323,0.123457,0.113926,0.139691,0.151658,0.161,0.168838,0.158741,0.127895,0.100129,0.088618,0.077707,0.072188,0.068206,0.071967,0.086526
0.309201,0.301673,0.276999,0.251759,0.244767,0.229833,0.21804,0.213583,0.236356,0.277309,0.269517,0.217783,0.184172,0.148189,0.134284,0.162517,0.177565,0.189261,0.200327,0.190383,0.150474,0.116175,0.104393,0.092976,0.085427,0.082068,0.087386,0.100181
0.272575,0.264458,0.247183,0.230939,0.226395,0.212778,0.19275,0.186001,0.209995,0.243946,0.238571,0.202334,0.179573,0.146322,0.128802,0.15021,0.163985,0.175959,0.190179,0.182674,0.142515,0.112776,0.10562,0.096047,0.086345,0.084323,0.090428,0.097653
0.21063,0.203764,0.193062,0.187666,0.189817,0.184447,0.157908,0.143486,0.157952,0.176884,0.176462,0.160325,0.148129,0.126071,0.109611,0.115457,0.122397,0.129904,0.14537,0.145046,0.117734,0.100597,0.096844,0.088178,0.078075,0.078604,0.085533,0.08805
0.186287,0.185663,0.170395,0.162363,0.162937,0.16709,0.149495,0.13258,0.137388,0.141936,0.139609,0.13342,0.126918,0.119865,0.110577,0.099646,0.098346,0.101747,0.114116,0.121568,0.11003,0.097683,0.090811,0.084048,0.075985,0.079269,0.09081,0.093453
0.225215,0.22487,0.198812,0.177384,0.170059,0.181424,0.172725,0.158319,0.161897,0.15536,0.154142,0.16046,0.157554,0.153081,0.143503,0.118791,0.114689,0.118046,0.126542,0.140732,0.134988,0.11247,0.096769,0.096514,0.092279,0.09696,0.121134,0.128284
0.315359,0.306596,0.259391,0.225498,0.217064,0.237239,0.223474,0.204751,0.210063,0.197162,0.204741,0.229869,0.230606,0.218789,0.202734,0.165269,0.160226,0.161776,0.168168,0.190749,0.184206,0.148078,0.118201,0.121752,0.124982,0.135148,0.177188,0.186438
0.418556,0.397694,0.329825,0.292989,0.286031,0.310355,0.283509,0.260651,0.270999,0.252883,0.27389,0.320528,0.318327,0.291908,0.269838,0.220648,0.214218,0.21743,0.222502,0.251281,0.245238,0.199287,0.156534,0.158803,0.168779,0.185202,0.23969,0.246648
0.482942,0.449498,0.371115,0.342327,0.339621,0.362964,0.328227,0.306491,0.322215,0.305448,0.336477,0.389442,0.373438,0.329506,0.30362,0.25688,0.25303,0.257591,0.259376,0.289023,0.285824,0.236071,0.190803,0.190513,0.204866,0.226817,0.277979,0.278005
0.467008,0.433103,0.367396,0.355507,0.362979,0.380473,0.350688,0.33262,0.344127,0.338944,0.367614,0.393069,0.355347,0.304747,0.282594,0.257262,0.253488,0.250422,0.250044,0.275503,0.275647,0.236385,0.211441,0.214945,0.223184,0.241971,0.270688,0.264697
0.427585,0.403745,0.372033,0.36631,0.383491,0.409005,0.39287,0.36038,0.355694,0.374118,0.390783,0.358461,0.290553,0.248235,0.251312,0.259251,0.237942,0.213763,0.21649,0.24091,0.241632,0.218716,0.229367,0.242201,0.234147,0.251843,0.253814,0.239402
0.421728,0.397582,0.398583,0.387375,0.398184,0.440308,0.449072,0.400777,0.374188,0.406074,0.425576,0.36332,0.275992,0.236745,0.249698,0.276808,0.248185,0.208597,0.209003,0.236888,0.243314,0.227877,0.255419,0.270792,0.251449,0.278936,0.268301,0.241856
0.398173,0.38615,0.399296,0.377809,0.3718,0.418966,0.457878,0.421433,0.376758,0.398482,0.429826,0.369231,0.278054,0.249072,0.258731,0.27695,0.255816,0.217947,0.201496,0.218232,0.244349,0.251958,0.269216,0.270042,0.25362,0.285352,0.277221,0.252867
0.372046,0.345264,0.356056,0.335947,0.307461,0.350253,0.417472,0.4147,0.36133,0.372814,0.406577,0.345048,0.262166,0.249287,0.263872,0.272512,0.263332,0.23159,0.195673,0.185505,0.225937,0.268802,0.260017,0.231304,0.221565,0.244965,0.242166,0.236744
0.409477,0.322992,0.327546,0.319515,0.25947,0.290511,0.396881,0.43213,0.365437,0.371033,0.393726,0.317628,0.242961,0.244801,0.274429,0.284779,0.279728,0.246308,0.197234,0.167387,0.217334,0.285279,0.251569,0.196317,0.191166,0.202494,0.195155,0.207121
0.431246,0.31742,0.321641,0.321099,0.251199,0.269314,0.374484,0.418349,0.346169,0.351189,0.378053,0.296983,0.221947,0.233288,0.271456,0.27677,0.265448,0.239764,0.197052,0.166808,0.220504,0.290481,0.252001,0.186039,0.176864,0.181847,0.165981,0.183595
0.401012,0.307183,0.314876,0.312801,0.246813,0.24158,0.307609,0.341156,0.285925,0.286729,0.317194,0.253106,0.191899,0.206816,0.230524,0.218599,0.200185,0.199589,0.18569,0.158837,0.189544,0.240644,0.216097,0.162438,0.157711,0.165852,0.145295,0.152335
0.366909,0.291641,0.307555,0.308877,0.247332,0.207736,0.230062,0.244938,0.207882,0.214716,0.242044,0.197568,0.160056,0.17443,0.173891,0.148018,0.136606,0.156279,0.163044,0.142402,0.141003,0.162283,0.15859,0.131162,0.135594,0.147131,0.132856,0.130622
0.376816,0.303895,0.297142,0.291836,0.24318,0.190826,0.194779,0.204935,0.177732,0.184821,0.200679,0.163907,0.140068,0.146917,0.14234,0.126663,0.122312,0.140104,0.144388,0.132481,0.126624,0.132706,0.134053,0.117509,0.116095,0.123122,0.126762,0.1282
0.40856,0.342279,0.292315,0.258829,0.230451,0.205055,0.213439,0.229155,0.200737,0.190137,0.192181,0.158952,0.135721,0.129148,0.12818,0.133896,0.129807,0.138013,0.136604,0.133398,0.135546,0.12801,0.126552,0.115683,0.101153,0.099987,0.127097,0.136571
0.393906,0.362277,0.303154,0.261062,0.246598,0.234883,0.241966,0.269109,0.234828,0.199595,0.195898,0.170535,0.148293,0.137573,0.135158,0.141939,0.124378,0.128627,0.131302,0.136537,0.140829,0.116973,0.115741,0.109358,0.086918,0.086445,0.125885,0.132505
0.339929,0.34332,0.289415,0.258558,0.26425,0.243677,0.230362,0.266198,0.233787,0.189984,0.195968,0.174348,0.147699,0.139939,0.141041,0.136939,0.103516,0.101932,0.10639,0.123433,0.133635,0.101706,0.101032,0.096947,0.073445,0.074659,0.108632,0.111645
0.268726,0.282784,0.232939,0.210826,0.226434,0.206631,0.177436,0.202889,0.183144,0.1502,0.163631,0.1472,0.117871,0.113221,0.1211,0.112966,0.081504,0.076929,0.075252,0.093832,0.109666,0.086105,0.089113,0.090269,0.069695,0.063099,0.077197,0.07991
0.190935,0.204186,0.169421,0.146179,0.145283,0.138864,0.119585,0.123079,0.115225,0.102986,0.108872,0.093091,0.072002,0.074966,0.08197,0.073382,0.053875,0.052202,0.050659,0.060182,0.075677,0.073802,0.079954,0.081904,0.071527,0.061248,0.054883,0.053167
0.12054,0.126821,0.110722,0.09148,0.079186,0.084462,0.088003,0.083371,0.071701,0.065381,0.062928,0.048237,0.03704,0.047637,0.049686,0.037828,0.029177,0.033747,0.037187,0.036723,0.045009,0.060534,0.071041,0.071365,0.066004,0.054626,0.041395,0.040364
0.092467,0.094489,0.082224,0.070504,0.066894,0.077287,0.082637,0.070812,0.058317,0.052304,0.04007,0.02836,0.026103,0.039405,0.042701,0.027952,0.020823,0.027219,0.031569,0.028544,0.030495,0.044951,0.054017,0.053608,0.049851,0.039432,0.030197,0.035076
0.084903,0.0809,0.063549,0.057739,0.070571,0.080653,0.080497,0.073042,0.067094,0.062157,0.041673,0.027232,0.028314,0.039063,0.045922,0.034861,0.025105,0.030162,0.032209,0.02807,0.027878,0.036811,0.04725,0.047029,0.04132,0.03238,0.026493,0.03378
0.07692,0.070903,0.05508,0.049618,0.066776,0.072683,0.078515,0.085634,0.081622,0.076602,0.05512,0.038339,0.037593,0.04243,0.051393,0.045167,0.035132,0.037818,0.036814,0.033478,0.034953,0.040239,0.049912,0.051993,0.049158,0.041281,0.033407,0.042764
0.072242,0.071652,0.058863,0.049129,0.053385,0.05941,0.076369,0.094008,0.087777,0.079681,0.065495,0.05269,0.050157,0.048586,0.054122,0.050725,0.044703,0.043053,0.039809,0.042308,0.046232,0.045837,0.054405,0.061564,0.063517,0.054286,0.042279,0.057328
0.077413,0.082774,0.070573,0.051923,0.038469,0.048469,0.073042,0.094781,0.08429,0.067165,0.064624,0.061461,0.059616,0.054512,0.051692,0.048826,0.048804,0.043054,0.041701,0.049799,0.053457,0.05158,0.060496,0.068847,0.072367,0.060754,0.047728,0.067502
0.080672,0.088315,0.085898,0.066305,0.039741,0.049744,0.077836,0.093862,0.077398,0.052037,0.052684,0.057509,0.058004,0.051401,0.044592,0.045782,0.04618,0.039349,0.044787,0.051015,0.04985,0.049646,0.058003,0.063903,0.066274,0.053812,0.044409,0.064894
0.074374,0.082339,0.091944,0.07916,0.04829,0.05656,0.083666,0.090212,0.076859,0.053621,0.043681,0.044482,0.046426,0.039717,0.038095,0.043507,0.037306,0.035674,0.047279,0.044079,0.037556,0.039329,0.045035,0.048239,0.047823,0.036602,0.033597,0.04948
0.072479,0.076407,0.083847,0.077581,0.05365,0.06107,0.087037,0.092741,0.081988,0.066267,0.048312,0.037974,0.036024,0.030882,0.03586,0.039025,0.029256,0.035422,0.047057,0.036363,0.028755,0.030925,0.033955,0.037945,0.032551,0.022364,0.025468,0.032492
0.075217,0.074716,0.069164,0.060837,0.053607,0.060585,0.082252,0.09855,0.090072,0.082455,0.063252,0.036614,0.027873,0.030444,0.041884,0.037793,0.028391,0.038024,0.043791,0.032259,0.029038,0.028646,0.027478,0.029922,0.02568,0.021314,0.023855,0.024935
0.072045,0.064353,0.050359,0.042943,0.048365,0.053076,0.064493,0.089106,0.094299,0.101178,0.083015,0.0438,0.024987,0.032946,0.046635,0.036581,0.029574,0.039541,0.04464,0.035905,0.033922,0.030425,0.022417,0.021918,0.024119,0.026418,0.02648,0.024054
0.078449,0.061283,0.038949,0.031221,0.041133,0.042729,0.048026,0.073236,0.089263,0.109833,0.096356,0.05587,0.030596,0.036211,0.045365,0.032042,0.027811,0.03821,0.050164,0.04098,0.034488,0.031175,0.024117,0.020558,0.025219,0.03151,0.032367,0.030519
0.093137,0.068409,0.039372,0.027638,0.039757,0.037964,0.046365,0.07318,0.083481,0.101833,0.093688,0.062379,0.036626,0.035696,0.04126,0.033318,0.028615,0.038017,0.052832,0.039578,0.029056,0.027777,0.028455,0.024751,0.025767,0.031829,0.034768,0.035861
0.097958,0.069158,0.041263,0.028026,0.043848,0.038504,0.044195,0.07837,0.089439,0.084038,0.075333,0.059247,0.041667,0.035499,0.039825,0.040473,0.037932,0.045133,0.051613,0.032143,0.023644,0.025311,0.032099,0.030675,0.026739,0.026492,0.030779,0.035255
