-0.001892,-0.00278,-0.003875,-0.003089,-0.004498,-0.003922,-0.002868,-0.002403,-0.003278,-0.001293,-0.001748,-0.004537,-0.005592,-0.002784,-0.002564,-0.00205,-0.00331,-0.005958,-0.006075,-0.003273,-0.00484,-0.004206,-0.003851,-0.002486,-0.002146,-0.00332,-0.004071,-0.002857,-0.001501,-0.002667,-0.003769,-0.003796,-0.004386,-0.005498,-0.003925,-0.004857,-0.003067,-0.002833,-0.001505,-0.003273,-0.0026,-0.004161,-0.003482,-0.002085,-0.003002,-0.001927,-0.00424,-0.002672,-0.001971,-0.003316,-0.003896,-0.003081,-0.002694,-0.002717,-0.002712,-0.002122,-0.001806,-0.002256,-0.001655,-0.004348,-0.002333,-0.002764,-0.002152,-0.003383,-0.00569,-0.005295,-0.003296,-0.003601,-0.003344,-0.003117,-0.00316,-0.004253,-0.004921,-0.004481,-0.002199,-0.003369,-0.005308,-0.003348,-0.003446,-0.002984,-0.003689,-0.003133,-0.003843,-0.003125,-0.004492,-0.003572,-0.005766,-0.004219,-0.003348,-0.00199,-0.005309,-0.003942,-0.002782,-0.003003,-0.004204,-0.003349,-0.003092,-0.002713,-0.001901,-0.002696,-0.003156,-0.002311,-0.003359,-0.002686,-0.001413,-0.00176,-0.003008,-0.002937,-0.002789,-0.003413,-0.002716,-0.002348,-0.001798,-0.002496,-0.003705,-0.00274,-0.002584,-0.002677,-0.001497,-0.002461,-0.00162
0.000795,0.001864,0.002868,0.001271,0.000975,0.00179,0.000457,0.000296,0.001392,-5.1e-05,0.000168,0.002057,0.003393,0.001447,0.002111,0.000905,0.001072,0.003203,0.003367,0.002384,0.00254,0.002178,0.001702,0.000749,0.00051,0.001422,0.001773,0.00092,-0.000244,-0.000424,0.001593,0.00202,0.00232,0.002925,0.002984,0.002994,0.002565,0.000912,2.5e-05,0.000384,0.000374,0.002157,0.001879,0.000783,0.001253,-0.000402,0.002112,8e-04,0.000551,0.002086,0.001919,0.001715,0.000553,0.000762,0.001461,0.001038,0.000255,0.000419,0.000236,0.002784,0.001429,0.001481,0.000909,0.002648,0.003222,0.004171,0.002173,0.002199,0.001567,0.001442,0.001446,0.002405,0.002093,0.003025,0.001241,0.001773,0.00333,0.002009,0.000782,0.000722,0.00217,0.001286,0.001655,0.000929,0.003042,0.001883,0.003519,0.003372,0.001703,0.001412,0.002977,0.001978,0.001591,0.001042,0.002324,0.002481,0.001689,0.002392,0.001741,0.002115,0.002644,0.001259,0.001771,0.00159,-2.5e-05,0.000438,0.000569,0.001598,0.001266,0.002473,0.001585,0.001118,0.001143,0.001692,0.002176,0.002032,0.002078,0.001631,0.000775,0.00133,0.000623
-0.000233,-0.001098,-0.001411,-0.00058,-0.000893,-0.00135,0.000382,0.00013,-3e-06,0.000193,0.000233,0.000524,-0.001023,0.000139,-0.001687,-0.001329,-0.000719,-0.001234,-0.001544,-0.002232,-0.001123,-0.001091,-0.000601,-0.000385,-0.000272,-0.001396,-0.000223,-0.000217,0.000337,0.001496,4.5e-05,-0.000375,-0.000891,-0.001017,-0.002373,-0.001718,-0.001848,8.6e-05,0.000514,0.001059,9e-04,-0.000766,-0.001148,-0.000891,-0.000865,0.00095,-0.00076,0.00025,-7.8e-05,-0.001437,-0.000533,-0.000797,0.000264,-0.000274,-0.000276,-8e-05,0.000759,-0.000288,0.000279,-0.001312,-0.00036,-0.000515,-0.000707,-0.001706,-0.002261,-0.003661,-0.001596,-0.000803,-0.000137,-0.000285,-0.000286,-0.000646,-0.000742,-0.001018,-0.000763,-0.000322,-0.001429,-0.00115,-5e-05,0.000392,-0.001272,-0.000219,-6.6e-05,-3.7e-05,-0.002577,-0.001538,-0.002204,-0.002255,-0.001469,-0.000923,-0.000824,0.000367,-0.000403,0.000213,-0.001518,-0.001133,-0.000951,-0.001753,-0.001319,-0.001347,-0.002111,-0.001215,-0.00044,-0.000617,0.000249,-0.000104,0.000487,-0.000449,-0.000819,-0.001904,-0.001078,-0.000618,-0.000398,-0.00062,-0.001058,-0.001194,-0.001444,-0.001147,-0.000645,-0.000725,-0.000964
-0.000323,0.000632,0.001001,-0.000266,0.001274,0.000399,-0.00014,-0.000286,-0.000783,-0.000361,-0.000812,-0.001852,-0.001086,-0.000675,0.000555,0.00165,0.000262,-2.2e-05,0.000926,0.001294,0.000335,0.000312,-3e-05,0.000415,0.000273,0.000864,-0.000917,-4.8e-05,0.000213,-0.001355,-0.001018,-0.00091,3.4e-05,-0.000458,0.000981,0.000567,0.00055,-0.000619,-0.000351,-0.001594,-0.00145,-6.9e-05,0.000332,0.000631,-0.000249,-0.000652,0.000196,-0.000585,0.000377,0.001089,-0.000742,-1.9e-05,-0.000336,9.5e-05,-0.00055,-0.000603,-0.000823,0.000248,-9.4e-05,0.000393,-0.000213,0.000216,0.00037,0.00111,0.001274,0.002446,0.00124,0.000122,5e-06,-0.000944,-0.000748,-0.000339,0.000994,-0.00024,5.1e-05,8e-06,-0.000532,0.000254,0.000409,-0.000718,0.000591,-0.000579,-0.000738,-0.000366,0.001372,0.000978,0.000943,0.000704,0.001429,0.000585,0.000169,-0.001028,-0.000697,-0.000316,0.000989,-0.00013,-7.8e-05,0.00105,0.000653,0.000209,0.001518,0.000962,-0.000271,-0.000212,-0.000398,-2.2e-05,-0.000417,1.5e-05,0.000508,0.000978,0.000818,-0.000188,-9.1e-05,-0.000226,0.000125,0.000133,0.001015,0.000546,0.000357,0.000552,0.00058
0.000188,-0.000234,-0.001332,0.000551,-0.001485,-0.000586,-0.000361,0.000127,0.000689,0.000518,0.000849,0.001317,0.001075,9.9e-05,-0.000318,-0.001177,-0.000434,0.000545,-0.000418,2e-06,-0.000173,0.000648,0.000193,-0.000449,-0.000244,-0.000895,0.000928,0.000565,-0.000658,0.000456,5e-05,0.00047,0.000499,0.000696,0.000315,0.000262,9.9e-05,0.000399,0.000189,0.001081,0.001157,0.000624,0.000228,-0.000195,0.00065,0.000547,-0.000169,0.000438,-0.000301,-0.000622,0.000592,-0.00046,4.2e-05,9.6e-05,0.000466,0.000864,0.000357,-0.000297,-0.00011,-5.1e-05,0.000455,-0.000268,-0.000721,-0.000371,-0.000684,-0.001164,-0.000529,0.000367,-0.000117,0.001031,0.000644,-0.000226,-0.000881,0.000183,-0.000204,-0.000567,0.001107,6.3e-05,-0.001155,9.3e-05,-0.000168,0.00066,0.00032,0.000175,-0.000463,-0.001017,-0.000375,-8e-05,-0.001172,-0.000519,-0.000485,0.000164,0.000758,0.000101,-0.000661,0.00039,0.000537,-0.000973,-0.000858,0.000183,-0.000878,-0.000703,-6.8e-05,0.000646,0.000485,-0.000203,0.000101,-0.000163,-0.000301,-0.000429,-0.000766,0.000312,5.6e-05,0.000216,0.000267,0.000669,-0.000694,-0.000763,-0.000482,-0.000518,-5.1e-05
-3.3e-05,7.4e-05,0.001135,-0.000915,0.000889,0.000504,0.000103,-5e-06,-0.00052,-0.00031,-0.000254,-0.000333,-0.000393,0.000137,0.000121,0.000355,0.000532,-0.00018,0.000109,-0.000362,0.000476,-0.001134,-0.000529,0.000134,0.000142,0.000223,-0.000307,-0.000182,0.000593,-0.000193,8e-04,0.000352,-0.000256,-6.2e-05,-0.000849,-0.000803,-0.000352,6.4e-05,-0.000222,-0.000497,-0.000656,-0.000534,-0.00083,-0.000193,-0.000655,-0.000334,-0.000182,-0.000229,4.8e-05,0.000409,-0.00056,0.000734,0.000543,-9e-05,-0.00038,-0.001057,1.6e-05,0.000437,0.000287,-0.000249,-0.000504,-0.000196,0.000591,-1.2e-05,0.00073,0.000577,-0.000204,-0.000384,-0.00023,-0.000732,-0.00087,0.000433,0.000876,0.000107,0.000263,0.000277,-0.000461,-2.4e-05,0.000468,0.000324,7.4e-05,-0.000944,-0.000201,0.000124,0.000581,0.00058,0.000155,-0.000109,0.000792,0.000372,0.00045,0.000746,1e-05,0.000171,0.000535,-0.000491,-0.000614,0.000684,0.001121,-0.00026,0.000136,0.000656,0.000419,-0.000591,-0.000419,0.000112,2.5e-05,0.000504,0.000199,0.00022,0.00074,-0.000168,0.000155,-0.000143,-0.000395,-0.001079,0.000324,0.00091,0.000618,0.000464,6.6e-05
0.000103,2.7e-05,-0.000578,0.000942,-0.000309,-0.000291,0.000308,0.000374,0.000181,0.000179,-5.6e-05,-7.4e-05,0.000345,0.000187,-0.000142,-0.000305,-0.000229,-0.000201,-0.000351,-0.000184,-0.000811,0.001085,0.00057,0.000199,-8.7e-05,0.000191,0.000343,-0.000199,-0.000123,7.6e-05,-0.001026,-0.000477,0.000124,0.000538,0.000591,0.001053,0.000482,-0.00026,-1.2e-05,0.000185,5e-05,0.000549,0.001025,0.000507,0.000462,0.000482,0.000566,-0.000114,7.8e-05,-0.000118,0.000558,-0.000532,-0.001121,0.000179,0.000259,0.000719,7.9e-05,-0.000426,-0.000194,0.000238,-1.2e-05,0.00029,-0.000329,3e-04,-0.000559,-0.00029,0.000257,0.000338,0.000235,0.000585,0.000901,9e-05,-0.00043,-2.5e-05,-0.000108,2e-05,-0.000207,0.000385,-0.000214,-0.00072,0.000314,0.000975,0.000241,-2.9e-05,-0.000689,-0.000587,-0.000314,0.000336,-0.000719,-3e-05,-0.000487,-0.001437,-0.000509,-0.000713,-0.00046,0.000363,0.000774,-2.5e-05,-0.000504,0.000231,0.000425,-0.000371,-0.000261,0.000385,0.000227,-6e-06,8.6e-05,-0.000715,-1e-04,0.000236,-0.000661,2.3e-05,-8e-06,0.000319,0.000419,0.000934,-0.000361,-0.000994,-0.000592,-0.000134,-0.000102
-0.000167,-0.000232,0.00023,-0.000493,6.5e-05,0.000318,-0.000461,-6.7e-05,-0.000227,8.9e-05,0.00034,0.000138,-0.000299,-0.000365,0.000229,0.00032,0.000428,0.000163,0.000522,0.000435,0.000496,-0.00074,-0.000519,4e-05,3.6e-05,-0.000114,-0.000438,-0.000266,-0.000169,-6e-05,0.000575,0.000321,0.000173,-0.000733,-0.000174,-0.000794,-0.000133,3.4e-05,0.00038,-9.1e-05,0.000491,-0.000392,-0.000504,-0.000361,-0.000183,-0.000364,-0.000436,-4.6e-05,-0.000225,-0.000188,-0.000179,0.000266,0.001133,-0.000165,-9e-06,-0.000342,-0.000258,0.000155,-1.5e-05,-0.000427,0.00013,0.000149,0.000185,-0.00038,0.000426,-6.1e-05,-0.000585,-0.000619,-5.6e-05,-0.000172,-0.000493,6.2e-05,0.000168,1.4e-05,0.000537,-0.000169,-2e-06,-0.000625,9.7e-05,0.000431,-0.000363,-0.000739,-0.000291,-0.000547,0.000439,0.001024,0.000496,-0.000193,0.000747,-1.4e-05,0.000394,0.001185,0.000579,0.000649,0.000594,-0.000442,-0.000265,-0.000639,0.000171,-0.000267,-0.000402,0.000155,0.000462,-0.000202,-2.4e-05,-9.7e-05,7.2e-05,0.000497,-0.000104,-0.000416,0.000501,4.2e-05,-8.5e-05,-0.000318,-0.000234,-0.000505,0.000219,0.000699,0.00052,9.2e-05,5.7e-05
0.000254,0.000146,1e-04,0.000617,-0.00022,-0.000426,1.7e-05,-0.000399,7.8e-05,-0.000131,-0.00014,3.4e-05,0.000103,0.000541,0.000166,-0.000105,-0.000601,-0.000185,-0.000335,-0.00034,5e-06,0.000463,8.5e-05,-2e-05,-0.000167,0.000231,0.000463,0.00037,0.000194,0.000201,-0.000157,-0.000397,-0.00031,0.000678,-0.000208,0.000211,5.2e-05,-0.000164,-0.000468,-0.000128,-0.000427,0.00021,4.3e-05,0.000246,0.000288,-9.1e-05,0.000427,0.000427,0.000299,5.7e-05,-2.8e-05,0.000309,-0.000615,0.000166,0.000146,0.000127,0.00039,-2.4e-05,5.4e-05,0.000585,-4.6e-05,-0.000271,7.7e-05,0.000444,8.3e-05,0.000182,0.000873,0.000621,-0.000415,0.000165,-3.4e-05,-1.9e-05,-0.000217,-9.1e-05,-0.00053,-4e-05,0.00012,0.000146,9.7e-05,-0.00011,0.000102,0.000645,0.000329,0.00087,5e-06,-0.000709,-0.000407,0.000317,-0.000227,-5.3e-05,-0.000261,-0.000704,-0.000226,-0.000502,-0.000421,0.000303,-0.000229,0.000454,-7.2e-05,0.00017,0.000169,-0.000156,-0.000399,0.000253,-0.000135,2e-04,-4e-05,-0.000316,0.000363,0.000338,-5.6e-05,5.3e-05,-3.9e-05,0.000191,-0.000172,0.000112,5.9e-05,-0.000281,-0.000177,-5e-04,-0.000128
-0.000377,-0.000326,-0.000127,-0.000594,-0.000206,0.000443,0.000303,0.000534,0.000131,0.000133,-0.000193,-4.5e-05,1e-06,-0.000679,-0.000515,1e-04,0.000331,-1.8e-05,-4e-05,0.000319,-0.000181,-0.000401,0.000117,2.2e-05,0.000224,-0.000156,-0.000259,-0.000239,4.4e-05,-0.000125,2.6e-05,0.000136,3.6e-05,-0.000239,0.000234,-5.9e-05,-7e-06,0.000489,0.000355,0.000175,0.000181,-0.000135,0.00019,-0.000219,-0.000378,6.4e-05,-0.000416,-0.000294,1e-05,0.000153,0.000102,-0.000505,0.000251,-9.7e-05,-0.000376,4e-06,-0.000356,5e-05,5.2e-05,-0.000353,5.8e-05,0.000404,-0.00018,-0.000479,-0.000116,-0.000223,-0.000652,-0.000424,0.000481,7e-06,0.00021,-0.000128,0.000265,1.6e-05,0.000669,-6.7e-05,-3e-06,-4e-06,-0.00029,8.1e-05,0.000176,-0.000367,-8.5e-05,-0.000232,-0.000231,1.9e-05,0.000206,-0.000203,-0.00055,0.000202,0.000187,0.000132,1.8e-05,0.000229,9.8e-05,-9.1e-05,0.000271,-0.000263,-9e-06,-0.000332,-0.00022,9.5e-05,0.000315,-0.000331,0.000198,-0.000262,0.000235,0.000372,-0.000326,-0.000237,-0.000226,4.5e-05,8e-06,-0.000239,0.000364,-5.6e-05,-0.000252,0.000436,8.2e-05,0.000439,0.000323
0.000189,0.000312,4.8e-05,0.00046,0.000579,-9.7e-05,-0.000345,-0.00035,-4e-05,-3.7e-05,0.000289,-0.000207,-6.9e-05,0.000479,0.000211,0.00012,6.9e-05,-7e-05,0.000226,-0.00022,0.000213,0.000422,-7.3e-05,9.6e-05,-0.000199,1.3e-05,3.2e-05,5.6e-05,3.9e-05,0.000144,-3.7e-05,-0.000239,3.4e-05,-0.000184,0.00014,-5e-05,-0.000109,-0.000406,-3.6e-05,-0.000167,-8.4e-05,-1.7e-05,-8.9e-05,0.000398,0.000195,1.4e-05,0.000119,-6.2e-05,-0.000259,-0.000167,-0.00012,0.000299,-0.000145,-3e-05,0.00029,6.5e-05,0.000312,3e-05,-0.000132,0.00022,-1.5e-05,-0.000463,-0.000171,2.9e-05,0.000163,0.00013,0.000304,0.000216,-0.000316,1.1e-05,-8.2e-05,0.000134,-0.000521,-0.000102,-0.000528,6.7e-05,2.3e-05,-0.000144,0.000538,1e-04,-2e-04,0.00025,-6.1e-05,-9e-06,0.000127,0.000139,-0.000163,0.000216,0.000646,-1.2e-05,2.4e-05,2.1e-05,-4e-06,9.5e-05,0.000218,0.000166,-0.000174,0.00012,7.2e-05,0.000479,7.3e-05,1.9e-05,-0.000315,0.000262,-0.00014,-9.4e-05,-0.000258,-0.00022,0.000175,0.000132,0.000109,-0.000115,6.4e-05,0.00036,-8.6e-05,1.3e-05,0.000378,-0.000233,-4.5e-05,-0.000159,-0.000208
1.7e-05,-0.00015,5e-05,-0.000215,-0.000715,-0.000181,0.000251,0.000149,5.7e-05,-0.000115,-0.000244,0.000288,6e-05,-0.000239,0.000149,-0.000162,-0.000135,7.3e-05,-0.000174,0.000146,-0.000137,-0.000396,0.000164,-0.000114,0.000168,-8e-05,-9.8e-05,9e-06,-0.00024,-0.000205,-1.8e-05,0.000448,0.000125,7.6e-05,-0.000156,3.5e-05,0.000179,0.000236,-4.3e-05,0.000102,1.7e-05,9.3e-05,-1.5e-05,-0.000331,9.8e-05,7e-06,-8.3e-05,0.000159,0.000257,4.6e-05,0.000108,-0.000274,4.1e-05,0.000217,-2.8e-05,-0.000105,-0.000206,-2.8e-05,-7.7e-05,-0.000145,0.000163,0.000329,0.000296,-8.2e-05,1.6e-05,-0.000212,-0.00027,-0.000136,3.1e-05,-0.00011,3.3e-05,-0.000197,0.000357,9.4e-05,0.000238,0.000129,1.6e-05,0.000168,-0.000349,-0.000123,0.000212,-0.00026,-3.3e-05,-6.7e-05,-6.7e-05,-4.1e-05,0.000218,-0.00019,-0.00038,-7e-06,-0.000135,9.8e-05,4e-05,2.9e-05,-0.000203,-0.000258,7.6e-05,0.000144,-4.4e-05,-0.000246,1.2e-05,-5.5e-05,0.000292,-7.1e-05,-3.1e-05,0.000267,0.00012,7.2e-05,-1.4e-05,-8.8e-05,-0.000198,0.000166,-8.1e-05,-0.000216,-3.4e-05,0.000115,-0.00026,-5.8e-05,0.000104,3.3e-05,-4.1e-05
-5.3e-05,2.7e-05,-0.000121,4.2e-05,0.000435,0.000295,-6.1e-05,-0.000134,-6.1e-05,-6.4e-05,5.9e-05,-0.000104,5e-06,0.000186,-0.000149,0,5.3e-05,-8.5e-05,-1.4e-05,-0.000274,8.1e-05,7.4e-05,-0.000256,-1e-06,0.000102,7.7e-05,7.2e-05,-0.000144,0.000174,2.3e-05,5.3e-05,-0.000384,-0.000133,-0.000158,-1.8e-05,3.9e-05,-0.000156,-0.000143,-0.000242,-4.6e-05,5.6e-05,-0.000175,-4e-06,0.000186,-0.000211,8.1e-05,-2.2e-05,-6e-05,-0.00031,-2.3e-05,-0.00011,0.000148,3.7e-05,-0.000266,-0.000118,3.2e-05,1.3e-05,-3.1e-05,5.7e-05,-2.6e-05,-0.000176,-0.000198,-0.000226,0.000215,-2.7e-05,0.000174,5.8e-05,6.1e-05,9.7e-05,0.000148,4.9e-05,8.1e-05,-3e-06,-7.4e-05,6.8e-05,-3.9e-05,4.3e-05,-8.7e-05,0.000144,-4.8e-05,-0.000137,0.000135,4e-05,-7.2e-05,-1.3e-05,-1.5e-05,5.1e-05,0.00017,0.000127,-0.000152,1.1e-05,0.000143,-7.7e-05,-0.000113,-8.2e-05,0.000256,-0.000194,-0.000125,-3e-05,0.000176,0.000108,4e-05,-0.000118,9.5e-05,3.8e-05,-0.000158,-6e-05,7.3e-05,-1.5e-05,-3e-06,0.000152,-0.000162,1.7e-05,0.000136,4e-06,-9.4e-05,6.6e-05,9.7e-05,-0.000112,-7e-06,5.8e-05
-1e-06,2.6e-05,5.5e-05,3e-05,-0.000104,-6.3e-05,-4.9e-05,0.000325,-1e-06,3.4e-05,5.6e-05,-0.000104,2.5e-05,-0.000187,0.000113,-1.9e-05,-6.1e-05,0.000191,0.000117,0.000291,4.6e-05,0.000274,0.000286,4e-05,-0.000197,-8.9e-05,-3.2e-05,0.000181,-8.6e-05,1.8e-05,-3.7e-05,0.000201,2e-06,2e-06,0.000142,-0.000111,2.5e-05,1e-05,0.000341,4.4e-05,-7.2e-05,0.000165,0.00012,-0.000114,0.000109,-4.4e-05,0.000118,-7e-06,0.000199,6.5e-05,0.000163,-1.2e-05,-0.000123,0.000198,6.5e-05,-4.7e-05,0.000146,-4.1e-05,1e-05,1.4e-05,4e-05,3.6e-05,0.000155,-9.3e-05,2.1e-05,-4.2e-05,-3.9e-05,6e-06,0,-0.000187,1.5e-05,-2e-05,3.6e-05,6.2e-05,-0.000174,-2.6e-05,5.9e-05,3e-05,2.5e-05,4.1e-05,5e-05,-5.8e-05,-4.3e-05,2.9e-05,7.9e-05,1.3e-05,-0.000244,-0.000183,7.1e-05,0.000156,6e-06,-0.000134,5e-06,2.7e-05,0.00014,-0.00013,0.00015,0.000149,1.9e-05,-0.000124,-8.8e-05,-3e-06,-3e-05,-0.000128,2.1e-05,4.2e-05,-9.9e-05,-6.8e-05,-8.8e-05,2.5e-05,-1e-05,0.000167,2.4e-05,-0.000157,-1e-05,-2.6e-05,4.4e-05,-2.3e-05,-1.9e-05,6.8e-05,-5.4e-05
-9e-06,-3.3e-05,-1e-05,2.8e-05,4.3e-05,1e-05,6.1e-05,-0.000358,7.3e-05,2.2e-05,-0.000109,0.000138,-2.8e-05,3.8e-05,-0.000162,3.8e-05,0,-9.4e-05,-3.5e-05,-0.000181,-0.000151,-0.000276,-0.000279,-3.8e-05,0.000104,2.4e-05,1.4e-05,-0.000145,2.8e-05,7e-06,2.7e-05,4.8e-05,3.3e-05,0.000192,-8.4e-05,8.4e-05,5e-06,-3.1e-05,-2e-04,-5.4e-05,7.8e-05,1.1e-05,-8.7e-05,-9e-06,-4.7e-05,-1.5e-05,-4.7e-05,-1.7e-05,-3.5e-05,-1.5e-05,-0.000122,-8.7e-05,0.000105,-9.2e-05,-4e-05,3.8e-05,-0.000145,2.1e-05,2.2e-05,4.7e-05,1e-06,-1.9e-05,-2.6e-05,6.8e-05,-5.6e-05,-9.2e-05,7e-05,5.4e-05,-4.1e-05,9.8e-05,-1.9e-05,-0.000121,5.6e-05,-1.8e-05,5e-05,0.000177,-4.1e-05,2.9e-05,-0.000276,2.9e-05,6e-06,0.000113,-2.8e-05,7.7e-05,5.4e-05,-4e-06,3.5e-05,9.6e-05,-0.000112,-4.9e-05,-1.7e-05,7.9e-05,9.4e-05,-1e-06,-0.000126,6.5e-05,-7.8e-05,-0.000106,-8.5e-05,9.3e-05,-4e-05,2.1e-05,5.7e-05,8.5e-05,-2.4e-05,-1e-06,0.000155,9e-05,0.000145,-3.1e-05,-3e-05,-0.000119,3.5e-05,9.8e-05,-3e-06,2e-05,-7.8e-05,5e-05,-8.1e-05,-1.9e-05,-1.2e-05
4.4e-05,5.7e-05,3e-06,-2.5e-05,2.8e-05,2.5e-05,1.1e-05,0.000297,-6.7e-05,-2e-05,-1e-06,-3.6e-05,-4e-05,4.1e-05,7.4e-05,3.1e-05,4.6e-05,-2.8e-05,-2.3e-05,0.000107,0.000149,0.000129,0.000224,-4e-05,1.8e-05,2.7e-05,8e-06,0.000122,6.4e-05,-3.8e-05,-2.1e-05,-8e-05,-5.4e-05,-0.000131,-5.7e-05,1e-04,1.9e-05,-3e-05,6.6e-05,6.3e-05,-9.8e-05,-9.2e-05,4.8e-05,-1.8e-05,-3.1e-05,2.8e-05,-4.7e-05,7e-06,1e-05,-6.6e-05,7.9e-05,0.000142,-4.8e-05,-1.6e-05,8e-06,5e-06,9.3e-05,-9e-06,1e-06,-4.1e-05,-3e-06,2.1e-05,-4e-05,-1.6e-05,-2.8e-05,8e-05,-9.7e-05,-8e-05,-6.6e-05,-8.4e-05,3.2e-05,8.6e-05,-0.000107,4.4e-05,-6.3e-05,-0.000152,1.3e-05,5.4e-05,0.000231,-5.4e-05,-6.5e-05,-0.000113,7e-05,-2.5e-05,-3.9e-05,-2.2e-05,0.000101,-8.2e-05,0.000118,-3.7e-05,1.9e-05,-1e-04,-5e-06,-4e-06,4.3e-05,-1.9e-05,8.2e-05,-2.3e-05,0.000113,-8.6e-05,2.2e-05,-2e-06,-8.7e-05,-5e-05,-2.7e-05,-3.9e-05,-7.6e-05,-7e-05,-0.000124,-1.3e-05,5.4e-05,9.5e-05,-3.6e-05,-1.4e-05,2.2e-05,1.7e-05,8.8e-05,-5.1e-05,7.5e-05,2.1e-05,5.1e-05
-5.1e-05,-0.000104,1.5e-05,2.9e-05,-9.7e-05,-1e-06,-2.2e-05,-0.000149,3.4e-05,2.6e-05,7.8e-05,1.1e-05,3.9e-05,6e-06,2.2e-05,-1e-06,-3.4e-05,3.4e-05,3.7e-05,-4.2e-05,-0.000112,-9.1e-05,-0.000138,-4e-06,-5.1e-05,1.6e-05,3.1e-05,3.1e-05,-9.9e-05,5e-06,5.3e-05,5.2e-05,1.6e-05,5.1e-05,0.000104,-0.000144,-4.9e-05,9.3e-05,1.8e-05,-7.1e-05,4.1e-05,4.8e-05,-5e-05,-2e-05,-2.2e-05,-5.7e-05,5.2e-05,-2.8e-05,-5.3e-05,7e-05,-8e-05,-0.000123,7.4e-05,2e-06,9e-06,-1.2e-05,-7.5e-05,3.4e-05,9e-06,4.3e-05,2e-05,-1.3e-05,4.9e-05,-6.9e-05,0,-9e-06,0.000128,1.3e-05,0.000142,7e-05,-4.5e-05,-3.6e-05,1.2e-05,-2.8e-05,7.1e-05,4.2e-05,3.1e-05,-4.9e-05,-3.9e-05,5.3e-05,-1.5e-05,0.00013,-1.4e-05,2.3e-05,7e-06,2.5e-05,-8.8e-05,3.4e-05,-2.5e-05,5.3e-05,-2.2e-05,3.6e-05,-0.000106,3e-06,6e-06,4e-06,-4.8e-05,1.9e-05,-9.3e-05,6.8e-05,3.9e-05,1.2e-05,7.5e-05,3.1e-05,5.6e-05,1e-05,-1.9e-05,6.1e-05,4.9e-05,6.3e-05,-5.8e-05,-6.5e-05,0,-2e-05,-3e-05,-2.4e-05,-3.9e-05,4.3e-05,-8e-06,0,-2.4e-05
1.3e-05,9.3e-05,-5e-05,8e-06,9.2e-05,2.8e-05,1.9e-05,5.1e-05,8e-06,8e-06,-3.7e-05,-3.9e-05,-1.1e-05,-6e-05,-8e-06,-9e-06,-4e-06,3.7e-05,2e-06,3.6e-05,6.4e-05,6.6e-05,7.8e-05,3.9e-05,4e-06,3e-06,-1.9e-05,-5e-05,5.4e-05,-1.2e-05,-8.3e-05,-7e-05,9e-06,-2.6e-05,-7.6e-05,8.7e-05,8e-06,-0.000103,-5.8e-05,4.4e-05,-1.5e-05,2.2e-05,5e-06,2.7e-05,6.3e-05,2.4e-05,-4.4e-05,2.5e-05,5.1e-05,-2.4e-05,6.1e-05,4.8e-05,-6.5e-05,-1.1e-05,-1.5e-05,7e-06,2.7e-05,6e-06,-9e-06,-5.6e-05,-3.4e-05,6.8e-05,-4.5e-05,-9e-06,-6.6e-05,-8e-06,-8.3e-05,-2e-05,-0.000117,-6.4e-05,2.7e-05,6.1e-05,-4e-06,-1e-05,-0.000102,4.2e-05,1.3e-05,3.2e-05,-1.2e-05,-1.9e-05,3.9e-05,-0.000116,2.4e-05,-2.6e-05,-2.2e-05,6.4e-05,5e-05,-2.3e-05,-2.4e-05,-2.8e-05,2.8e-05,5.5e-05,7.9e-05,3.2e-05,3.2e-05,-3.1e-05,3.1e-05,1.2e-05,6.3e-05,-5.7e-05,-1.1e-05,-1.5e-05,-3.2e-05,-3.6e-05,-3.3e-05,7.1e-05,3e-06,-7e-05,9e-06,-4.2e-05,2.9e-05,4e-06,2.4e-05,-1.3e-05,-6e-06,3.8e-05,-3.9e-05,-3.9e-05,-2e-06,-3.8e-05,7e-06
3.4e-05,-6.7e-05,3.1e-05,-3.8e-05,-9.7e-05,3e-06,5e-06,-3.2e-05,-9e-06,-1.6e-05,3.5e-05,3.4e-05,-7e-06,3.3e-05,3.7e-05,-4.3e-05,3.8e-05,-1.8e-05,-2.9e-05,-4.7e-05,-6e-06,-7.2e-05,-4.6e-05,-4.3e-05,7e-06,-3e-05,-7e-06,1e-05,-3.1e-05,1.4e-05,2.8e-05,6e-05,-3.7e-05,-1.3e-05,7e-06,-5.6e-05,3.4e-05,6.8e-05,1.2e-05,-2.3e-05,2e-05,-4.6e-05,4e-06,5e-06,-3.9e-05,1e-06,4.5e-05,1.5e-05,2e-06,-1.2e-05,-2.2e-05,2.1e-05,4.9e-05,2.1e-05,7e-06,1.2e-05,3.6e-05,6e-06,-3.4e-05,9e-06,5.2e-05,-4.2e-05,3.2e-05,5.2e-05,1.7e-05,-1.3e-05,4.2e-05,-1e-05,9.6e-05,5.5e-05,-2e-06,-3.3e-05,0,-1.1e-05,1e-04,-5.7e-05,-6e-05,-9e-06,3.5e-05,-5e-06,8e-06,7e-05,-3.6e-05,4e-06,5e-06,-9.6e-05,-2.6e-05,1.8e-05,8.8e-05,2e-06,-2.4e-05,-8.3e-05,5e-06,-7e-06,-1.6e-05,4e-05,-1.2e-05,-4.1e-05,2.9e-05,4.7e-05,1.2e-05,4e-06,2.5e-05,4.4e-05,1.6e-05,-5.6e-05,-1.7e-05,2.5e-05,-2.9e-05,2.5e-05,2.9e-05,4e-06,-2.4e-05,9e-06,2.3e-05,-2.8e-05,6.5e-05,-2.2e-05,5e-06,2.1e-05,1.1e-05
-4.7e-05,3.2e-05,-1.3e-05,4.7e-05,4.8e-05,-3.1e-05,-1.3e-05,1e-06,4e-06,1.3e-05,-3.2e-05,-1.4e-05,1.2e-05,-3.3e-05,-5.2e-05,2.1e-05,-1.6e-05,-5e-06,-6e-06,4.2e-05,-1.1e-05,0.000116,3.4e-05,1.4e-05,2.9e-05,7e-06,3e-06,-8e-06,-3.4e-05,-7e-06,-1.4e-05,-1.1e-05,4.7e-05,1.7e-05,1.1e-05,5.8e-05,-4.3e-05,-2.4e-05,2.2e-05,2.4e-05,-2e-06,3.8e-05,3.8e-05,-2.1e-05,2.2e-05,-8e-06,-1.4e-05,-1.3e-05,-4.9e-05,1.7e-05,5e-06,-3.8e-05,-5e-06,2e-06,-9e-06,-2.6e-05,-4.3e-05,-8e-06,1.4e-05,-1.6e-05,-4.3e-05,1e-05,-1.3e-05,-2.3e-05,-2.3e-05,1.4e-05,-2e-06,3.1e-05,-5.6e-05,-3.8e-05,6e-06,-1.4e-05,-2.2e-05,2.1e-05,-6.7e-05,2.9e-05,2.8e-05,7e-06,-7.6e-05,8e-06,-3e-05,-3.2e-05,6e-06,2.7e-05,-2e-06,1e-05,4.7e-05,-1.6e-05,-0.000124,5e-06,1.2e-05,8.6e-05,-3.9e-05,-8e-06,-1.5e-05,-3.8e-05,2e-05,5.3e-05,-5.8e-05,-3.8e-05,-2.4e-05,-9e-06,-2.3e-05,-1.3e-05,-4e-06,-1.6e-05,2.2e-05,-3e-06,4.7e-05,3e-06,-3.3e-05,-1.3e-05,2.3e-05,4e-06,-2.1e-05,1.1e-05,-5.1e-05,2.8e-05,-7e-06,1e-05,-1.4e-05
2.8e-05,-1.7e-05,-1e-06,-5.7e-05,1.1e-05,2e-06,2.5e-05,-1.1e-05,6e-06,9e-06,3.2e-05,0,-2e-06,7.7e-05,1.8e-05,1.9e-05,-1.3e-05,6e-06,2.5e-05,-2.4e-05,1.7e-05,-0.000113,-3.2e-05,1.5e-05,-4.4e-05,6e-06,-5e-06,-4.6e-05,6.5e-05,5e-06,4e-05,-3.9e-05,-8e-06,9e-06,2.2e-05,-5.8e-05,2.4e-05,3.1e-05,-2.6e-05,-2.8e-05,-2.3e-05,-2.4e-05,-7.1e-05,1.1e-05,-1.3e-05,1e-05,-3.1e-05,-2.5e-05,7.1e-05,-2.3e-05,-1.6e-05,4.3e-05,-1.8e-05,0,1.8e-05,1.4e-05,4.1e-05,7e-06,1.5e-05,1.9e-05,1.9e-05,-1.1e-05,-1.9e-05,-1.2e-05,2.4e-05,2e-06,1e-05,-1.2e-05,5e-06,4.8e-05,-1.5e-05,4.5e-05,3.4e-05,-1.8e-05,2.3e-05,-3e-05,7e-06,-2.1e-05,5.9e-05,-1e-05,3.3e-05,3.8e-05,-6e-06,-3.8e-05,-6e-06,4.8e-05,-5.9e-05,1.1e-05,9e-05,-2.4e-05,-2.2e-05,-5.1e-05,9e-06,6e-06,3.7e-05,1.3e-05,-4e-06,-1.6e-05,5.2e-05,3.1e-05,9e-06,5e-06,9e-06,-2e-06,8e-06,2.7e-05,0,1.6e-05,-2.8e-05,0,2.4e-05,2.2e-05,-3.2e-05,9e-06,-5e-06,-1.1e-05,1.5e-05,6e-06,1.4e-05,-4.3e-05,1e-05
-1e-05,-6e-06,1e-05,4.5e-05,-6.1e-05,2e-05,-3.9e-05,2.3e-05,-5e-06,-1e-05,-3e-05,9e-06,2e-06,-7.2e-05,1.2e-05,-2.2e-05,1.1e-05,-1.2e-05,-7e-06,1.5e-05,-2.6e-05,8.3e-05,3.7e-05,5e-06,3.8e-05,-7e-06,-1.6e-05,5.8e-05,-3.6e-05,0,-3.2e-05,4.1e-05,3e-06,-2.1e-05,-4.8e-05,2.4e-05,7e-06,-3.9e-05,2.2e-05,2.3e-05,2.2e-05,7e-06,4.8e-05,-2.4e-05,9e-06,2e-06,2.3e-05,2.5e-05,-6.2e-05,1.9e-05,3e-06,-4.1e-05,2.2e-05,-3e-06,-7e-06,-6e-06,-3.8e-05,-9e-06,-9e-06,1.6e-05,-1.8e-05,3e-06,1.2e-05,1.4e-05,-1.4e-05,-1.2e-05,-1.6e-05,1.9e-05,1.2e-05,-3.7e-05,1.7e-05,-1.8e-05,-4.5e-05,6e-06,1.8e-05,3e-05,-9e-06,4e-06,-4.5e-05,1.7e-05,-1.1e-05,-4.9e-05,1e-06,2.9e-05,1.5e-05,-3.4e-05,3.8e-05,-1e-06,-1.6e-05,1.3e-05,2.3e-05,3.7e-05,5e-06,-9e-06,-2e-05,-1e-06,-1e-05,-3.9e-05,-2.7e-05,-2e-05,1.3e-05,2e-06,1.4e-05,-3e-06,-1.4e-05,-2.3e-05,0,-9e-06,-4e-06,-1e-06,-2.7e-05,-3.9e-05,2.4e-05,-3.9e-05,9e-06,9e-06,2.8e-05,-4e-06,-1.2e-05,2.5e-05,0
-2e-06,2.6e-05,-1.3e-05,-4.9e-05,7.9e-05,-2.8e-05,2.8e-05,-2.9e-05,1e-05,1e-06,2.5e-05,1e-05,-8e-06,4e-05,-2.8e-05,2.5e-05,2e-06,8e-06,-1.5e-05,-1.1e-05,1.1e-05,-7.1e-05,-4.6e-05,-1e-05,-7e-06,1.4e-05,0,-4.5e-05,9e-06,8e-06,-3e-06,2e-06,-2.5e-05,2.9e-05,2.4e-05,-1e-06,-2e-05,1.6e-05,-1e-05,-1.7e-05,-1.8e-05,6e-06,-2.3e-05,3.8e-05,1e-06,-5e-06,-1.3e-05,-4e-06,1.9e-05,3e-06,9e-06,2.5e-05,-2.8e-05,6e-06,-1e-05,9e-06,2.6e-05,0,3e-06,-2.1e-05,1.9e-05,4e-06,1e-05,1.5e-05,1.1e-05,4e-06,3.4e-05,-2.9e-05,-3e-06,2.6e-05,-6e-06,1.8e-05,4.8e-05,0,-4e-05,-1.7e-05,-1.4e-05,5e-06,1.5e-05,-2e-06,-2e-05,5.9e-05,-3e-06,-1.2e-05,-2.5e-05,1.5e-05,-2e-05,7e-06,-4.2e-05,8e-06,-5e-06,-3.7e-05,4e-06,4e-06,-6e-06,9e-06,-3e-06,4.8e-05,1.5e-05,2e-05,-8e-06,-1e-06,-1.3e-05,2e-06,1.6e-05,3.4e-05,-1e-06,-8e-06,2.6e-05,-1.6e-05,-5e-06,3.6e-05,-5e-06,4.2e-05,2e-06,-1.7e-05,-5.3e-05,-1.6e-05,1.8e-05,9e-06,-9e-06
1.8e-05,-1.8e-05,8e-06,5.2e-05,-5.4e-05,4e-06,3e-06,1.5e-05,-9e-06,6e-06,-5e-06,-1.8e-05,1e-06,-2.7e-05,2.1e-05,-8e-06,4e-06,1e-06,2.7e-05,1.2e-05,1.6e-05,7.1e-05,4.8e-05,1.4e-05,-3.7e-05,-8e-06,1.1e-05,3.3e-05,9e-06,2e-06,1.2e-05,-3.4e-05,1e-05,-2.2e-05,1.5e-05,1.3e-05,7e-06,1.7e-05,1.1e-05,1.4e-05,1.8e-05,-2.3e-05,1e-05,-2.1e-05,-7e-06,4e-06,1.6e-05,-2e-06,2.3e-05,-1.5e-05,-2.4e-05,3e-06,1.3e-05,-1.5e-05,7e-06,5e-06,-7e-06,1.3e-05,0,9e-06,-9e-06,3e-06,-2.6e-05,-2e-05,1.8e-05,-7e-06,-4.8e-05,2e-05,-8e-06,-1.6e-05,1e-06,-2e-05,-3.3e-05,4e-06,5e-05,9e-06,1.6e-05,8e-06,2.3e-05,9e-06,2.4e-05,-4.9e-05,6e-06,-6e-06,2.2e-05,-1.7e-05,-3e-06,-7e-06,7e-05,-1.4e-05,-1e-06,5e-06,-1.7e-05,0,6e-06,-2.2e-05,5e-06,-3.1e-05,-7e-06,-2.5e-05,-2e-06,3e-06,1e-05,-9e-06,-7e-06,-2.3e-05,2e-06,1.5e-05,-1.6e-05,2e-06,2.4e-05,-3.4e-05,2e-06,-2.8e-05,-3e-06,1.5e-05,4.2e-05,-2.1e-05,-1.1e-05,-1.3e-05,7e-06
-2.8e-05,1.8e-05,-6e-06,-4e-05,1e-05,5e-06,-1.1e-05,4e-06,-2e-06,-5e-06,-1.9e-05,4e-06,7e-06,3.1e-05,-7e-06,-2.3e-05,5e-06,-4e-06,-1.9e-05,-8e-06,-2.6e-05,-8.3e-05,-4.3e-05,2e-06,2.4e-05,0,0,1.8e-05,-2.4e-05,-8e-06,-7e-06,4e-05,3e-06,-1e-06,-2.6e-05,-1.7e-05,1.4e-05,-3.6e-05,-1.9e-05,-1.5e-05,-6e-06,1.9e-05,-1e-06,3.3e-05,5e-06,-7e-06,6e-06,5e-06,-4.7e-05,1.4e-05,1.3e-05,-2.5e-05,-1e-05,1.7e-05,2e-06,-8e-06,-2e-06,-7e-06,-4e-06,-5e-06,-3e-06,-1e-05,3.2e-05,5e-06,8e-06,1e-05,3.4e-05,-1.9e-05,-4e-06,2.2e-05,-1.1e-05,-6e-06,2.3e-05,-1e-06,-4.3e-05,-7e-06,2e-06,-1.2e-05,-4.3e-05,-1.3e-05,-8e-06,1.6e-05,8e-06,1e-05,-5e-06,1.9e-05,-2e-06,9e-06,-6.7e-05,7e-06,-2e-06,2.9e-05,4e-06,6e-06,2e-06,1.6e-05,3e-06,1.2e-05,-8e-06,9e-06,-1e-06,-2e-06,-1.8e-05,-6e-06,-6e-06,-1e-05,-5e-06,-1.9e-05,-1e-06,1e-06,-2.4e-05,3.1e-05,7e-06,2.3e-05,7e-06,2e-06,-1.1e-05,2.6e-05,6e-06,-4e-06,-2e-06
2.2e-05,-1.7e-05,2e-06,3.8e-05,1.8e-05,-1.7e-05,5e-06,-1.4e-05,6e-06,-6e-06,2.1e-05,1.2e-05,-7e-06,-1.3e-05,-3e-06,1.8e-05,-1.9e-05,-2e-06,-5e-06,-1e-06,2.3e-05,8.1e-05,3.5e-05,-8e-06,-6e-06,-3e-06,0,-3.7e-05,1.9e-05,-4e-06,6e-06,-1.9e-05,1e-06,1.1e-05,1e-06,-2e-06,-1.4e-05,2.4e-05,3e-06,1.1e-05,-4e-06,-9e-06,3e-06,-1.6e-05,2e-06,3e-06,-1.5e-05,2e-06,4.6e-05,3e-06,-1.4e-05,2.9e-05,3e-06,-9e-06,-5e-06,-2e-06,3e-06,3e-06,3e-06,-2.1e-05,8e-06,1.2e-05,-3.1e-05,8e-06,-4e-06,-3e-06,-1.9e-05,1.9e-05,3.7e-05,-2.8e-05,1.1e-05,2.3e-05,-1.5e-05,-4e-06,4.4e-05,1.3e-05,-1.1e-05,2e-06,4.6e-05,0,-1.7e-05,-1.2e-05,-2e-06,-1.2e-05,4e-06,-1.2e-05,1.4e-05,-4e-06,4.2e-05,-4e-06,-2e-06,-3e-05,1.4e-05,-2e-06,-1.4e-05,-3e-06,-7e-06,1.2e-05,9e-06,1e-06,0,2e-06,1.4e-05,1.2e-05,6e-06,2e-05,9e-06,8e-06,9e-06,-6e-06,1.7e-05,-2.8e-05,-1.5e-05,-1.6e-05,4e-06,-2e-06,-1.3e-05,-8e-06,-2e-06,1.4e-05,-3e-06
-6e-06,9e-06,4e-06,-3.2e-05,-3.1e-05,8e-06,0,1.8e-05,-4e-06,4e-06,-6e-06,-1.2e-05,-1e-06,-6e-06,1e-05,0,1e-05,4e-06,9e-06,1e-05,-2e-05,-4.4e-05,-2.4e-05,2e-06,6e-06,-2e-06,3e-06,1.3e-05,-2e-06,-2e-06,-1.5e-05,1e-06,-8e-06,-4e-06,1.9e-05,1.9e-05,-2e-06,-1.7e-05,1.1e-05,-6e-06,2e-06,-5e-06,-1.6e-05,5e-06,0,-1e-06,1.2e-05,-1.4e-05,-2.3e-05,-4e-06,1.8e-05,-2.4e-05,8e-06,7e-06,3e-06,1e-06,3e-06,-6e-06,-1e-06,2.7e-05,-7e-06,-5e-06,2.1e-05,-1.2e-05,9e-06,-1e-05,5e-06,-1.5e-05,-4.8e-05,2.1e-05,2e-06,-2.1e-05,1.3e-05,-3e-06,-2.5e-05,-1.1e-05,-2e-06,6e-06,-1.7e-05,1.3e-05,3.3e-05,2.4e-05,-3e-06,9e-06,2e-06,2e-06,1e-06,2e-06,-4e-06,4e-06,2e-06,3.1e-05,3e-06,-1e-06,3e-06,-1e-06,-3e-06,-3.7e-05,-3e-06,5e-06,5e-06,-3e-06,-6e-06,-2e-06,-1e-06,-1e-05,-3e-06,-1.2e-05,-1.1e-05,4e-06,-9e-06,1.8e-05,1e-05,3e-06,-1e-06,-1.3e-05,2.5e-05,-1e-06,0,-9e-06,4e-06
-1.3e-05,3e-06,-3e-06,2.6e-05,2.3e-05,-1.2e-05,8e-06,-1.2e-05,6e-06,2e-06,-7e-06,0,5e-06,-1e-06,-5e-06,-3e-06,1.3e-05,-3e-06,-5e-06,-1.3e-05,1.5e-05,9e-06,1.3e-05,4e-06,2e-06,2e-06,7e-06,1e-06,-2e-06,5e-06,2.3e-05,7e-06,5e-06,1e-06,-5e-06,-1.2e-05,9e-06,2.6e-05,-1.1e-05,1e-06,-1.3e-05,1.7e-05,2.2e-05,-3e-06,-3e-06,-1e-06,-7e-06,7e-06,-2e-06,1e-06,-2.2e-05,1.1e-05,-1e-05,-6e-06,-1e-06,-5e-06,-3e-06,-1e-06,4e-06,-4e-06,7e-06,0,-1e-05,-5e-06,7e-06,8e-06,4e-06,1.4e-05,2.7e-05,-1.7e-05,0,9e-06,-1.3e-05,6e-06,1.3e-05,8e-06,4e-06,1e-06,-1.4e-05,-5e-06,-8e-06,-2.7e-05,-1e-06,4e-06,-9e-06,1.8e-05,-5e-06,-3e-06,-3.3e-05,0,2e-06,-2.9e-05,-1.6e-05,-2e-06,1e-05,-2e-06,1e-06,4.2e-05,-2e-06,-9e-06,1e-06,0,4e-06,2e-06,-5e-06,5e-06,1e-06,1.8e-05,3e-06,-1e-06,-1e-05,-3e-06,-1e-06,8e-06,-1e-06,1.1e-05,-2.3e-05,1.1e-05,-3e-06,-3e-06,-1e-06
2.2e-05,-1.2e-05,2e-06,-2.3e-05,-2.6e-05,-4e-06,-7e-06,1.3e-05,-5e-06,-3e-06,8e-06,5e-06,3e-06,1e-05,0,7e-06,-1.7e-05,3e-06,6e-06,1.1e-05,-2e-06,1e-06,-4e-06,-9e-06,-5e-06,-1e-06,-7e-06,-1e-05,5e-06,3e-06,-1.9e-05,-1.7e-05,-1e-06,3e-06,-2.4e-05,-2e-06,-2e-06,-2.1e-05,0,0,1.5e-05,-1.7e-05,-2.2e-05,-5e-06,0,2e-06,2e-06,9e-06,1e-05,-8e-06,7e-06,4e-06,6e-06,-1e-06,-1e-06,1.1e-05,1e-05,1e-06,3e-06,-2e-06,-1.1e-05,4e-06,6e-06,8e-06,-3e-06,1e-06,0,-1.9e-05,0,1.6e-05,-1.2e-05,-7e-06,5e-06,0,-1.4e-05,-5e-06,-1e-06,-4e-06,2e-05,0,-2.1e-05,2.1e-05,-5e-06,-1.2e-05,1e-06,-3.1e-05,-5e-06,6e-06,5.6e-05,-1e-05,-2e-06,8e-06,6e-06,-1e-06,-1.2e-05,5e-06,4e-06,-1.5e-05,7e-06,3e-06,-4e-06,1e-06,-2e-06,-9e-06,-2e-06,5e-06,1e-06,-1.2e-05,3e-06,6e-06,2e-05,-6e-06,-6e-06,-6e-06,0,2e-06,1.1e-05,-1.3e-05,-1e-06,8e-06,0
-2e-05,8e-06,-2e-06,2.2e-05,1.4e-05,1e-05,0,-1.4e-05,-1e-06,0,0,-1e-06,-2e-06,2e-06,-4e-06,-4e-06,-1e-06,4e-06,-6e-06,-9e-06,-1.1e-05,6e-06,-2e-06,0,4e-06,2e-06,0,1.8e-05,-3e-06,2e-06,7e-06,2.6e-05,7e-06,-7e-06,3.5e-05,2e-06,-7e-06,9e-06,1.1e-05,-1e-06,-9e-06,7e-06,1.8e-05,6e-06,2e-06,2e-06,6e-06,-4e-06,-8e-06,5e-06,-1e-05,-1.2e-05,-2e-06,1e-06,2e-06,1e-06,-1.8e-05,2e-06,-9e-06,5e-06,1.1e-05,-1.2e-05,-1e-06,2e-06,-5e-06,-2e-06,-9e-06,1.7e-05,-7e-06,-1.9e-05,5e-06,-4e-06,2e-06,-6e-06,2e-06,1e-06,-6e-06,0,-2.3e-05,-1e-06,2.6e-05,-1.2e-05,2e-06,1e-05,-6e-06,1.1e-05,1e-06,-4e-06,-5.4e-05,1e-05,0,3e-06,6e-06,0,6e-06,-6e-06,3e-06,-1.4e-05,-9e-06,2e-06,-1e-06,-1e-06,-4e-06,1.5e-05,8e-06,-1.4e-05,-1e-05,5e-06,-3e-06,0,-1.5e-05,9e-06,4e-06,7e-06,5e-06,-4e-06,3e-06,-2e-06,1e-06,-9e-06,0
7e-06,-1.2e-05,0,-1.8e-05,1e-06,-8e-06,-3e-06,1.1e-05,2e-06,1e-06,-8e-06,-3e-06,-3e-06,2e-06,-1e-06,-6e-06,4e-06,-3e-06,7e-06,9e-06,1e-05,-1.6e-05,4e-06,1e-06,-3e-06,-2e-06,-2e-06,-1.1e-05,-3e-06,-3e-06,-1e-05,-2.5e-05,-4e-06,4e-06,-1.6e-05,2e-06,5e-06,4e-06,-1.2e-05,3e-06,8e-06,9e-06,-1e-05,-5e-06,-2e-06,-2e-06,-1.1e-05,-7e-06,2e-06,0,1.1e-05,1.5e-05,2e-06,-2e-06,-1e-06,-7e-06,1.4e-05,-1e-06,-1e-06,-1.2e-05,-7e-06,8e-06,-4e-06,-5e-06,0,-3e-06,1.7e-05,-8e-06,-2e-06,1.6e-05,3e-06,1.2e-05,-1e-06,0,1e-05,-4e-06,-2e-06,3e-06,1.4e-05,-1e-06,-1.1e-05,3e-06,0,-4e-06,6e-06,1.3e-05,2e-06,-1e-06,2.3e-05,-4e-06,1e-06,-9e-06,-9e-06,0,3e-06,3e-06,-5e-06,2.6e-05,1.5e-05,6e-06,3e-06,0,6e-06,-1.2e-05,-8e-06,2e-06,6e-06,0,2e-06,-1e-06,1.2e-05,-1.2e-05,-3e-06,-7e-06,-1e-06,2e-06,-9e-06,1e-06,1e-06,3e-06,-1e-06
6e-06,1.3e-05,1e-06,1.1e-05,-1.4e-05,-5e-06,8e-06,-1.1e-05,1e-06,-2e-06,1.4e-05,2e-06,1e-06,-1.6e-05,7e-06,1e-06,0,-2e-06,-6e-06,-8e-06,-6e-06,1.4e-05,-4e-06,-2e-06,-1e-06,2e-06,1e-06,4e-06,-4e-06,-2e-06,1.2e-05,9e-06,-5e-06,0,-8e-06,-2e-06,7e-06,-1.1e-05,2e-06,-4e-06,-7e-06,-1.1e-05,4e-06,-2e-06,-6e-06,1e-06,5e-06,6e-06,4e-06,-5e-06,-6e-06,-1.5e-05,4e-06,6e-06,0,2e-06,-1.2e-05,0,5e-06,0,3e-06,-2e-06,0,3e-06,1e-06,4e-06,-1.7e-05,1.1e-05,5e-06,-1.3e-05,3e-06,-1e-05,3e-06,3e-06,-1.7e-05,6e-06,3e-06,0,3e-06,1e-06,-1.3e-05,-1.2e-05,2e-06,0,1e-06,-9e-06,-1e-06,-1e-06,1.7e-05,0,-1e-06,1.6e-05,1e-06,1e-06,-3e-06,1e-06,-1e-06,-2.4e-05,-8e-06,-8e-06,0,1e-06,-5e-06,3e-06,3e-06,1.3e-05,0,0,1e-06,6e-06,-1e-06,1.9e-05,5e-06,3e-06,-5e-06,0,8e-06,1.9e-05,0,6e-06,3e-06
-1.3e-05,-3e-06,0,-8e-06,2.2e-05,7e-06,-4e-06,1.6e-05,-3e-06,2e-06,-1.2e-05,3e-06,-1e-06,1.1e-05,-7e-06,5e-06,5e-06,3e-06,-3e-06,7e-06,5e-06,2e-06,2e-06,-2e-06,-1e-06,-4e-06,-6e-06,0,9e-06,-3e-06,-6e-06,1.6e-05,2e-06,-4e-06,1e-05,-1e-06,-1.4e-05,5e-06,4e-06,4e-06,-1e-06,7e-06,-1e-06,1e-06,1e-05,0,-3e-06,1e-06,-5e-06,4e-06,0,1e-05,-5e-06,-5e-06,0,-4e-06,9e-06,2e-06,-4e-06,4e-06,-2e-06,4e-06,6e-06,6e-06,-7e-06,0,1.3e-05,-9e-06,5e-06,1.4e-05,-8e-06,8e-06,-7e-06,2e-06,2.2e-05,-9e-06,1e-06,-2e-06,-9e-06,0,1.7e-05,1.6e-05,3e-06,6e-06,0,-2e-06,2e-06,1e-06,-4.5e-05,4e-06,2e-06,-1.6e-05,2e-06,1e-06,0,-2e-06,3e-06,1.1e-05,-4e-06,1e-06,-1e-06,1e-06,4e-06,-7e-06,1e-06,-1e-05,0,0,-4e-06,-3e-06,-1.1e-05,-2e-05,0,4e-06,-2e-06,-4e-06,-6e-06,-5e-06,-1e-06,-6e-06,-2e-06
1.5e-05,-3e-06,1e-06,6e-06,-2.1e-05,-4e-06,-1e-06,-1.6e-05,2e-06,1e-06,8e-06,-5e-06,0,-2e-06,5e-06,0,-7e-06,0,7e-06,-6e-06,-1e-06,-1.7e-05,-1e-06,5e-06,3e-06,-1e-06,2e-06,-1.6e-05,-4e-06,0,-3e-06,-2.7e-05,4e-06,4e-06,1e-05,4e-06,7e-06,-1e-05,-6e-06,-5e-06,6e-06,-3e-06,1e-06,-7e-06,-2e-06,-1e-06,0,-2e-06,-1e-06,-2e-06,-3e-06,-2e-06,5e-06,3e-06,0,0,-3e-06,-1e-06,1e-06,6e-06,1e-06,0,-5e-06,-4e-06,-4e-06,-4e-06,-3e-06,4e-06,-1.5e-05,-1.6e-05,1e-06,-5e-06,7e-06,-1e-06,-2.4e-05,9e-06,-2e-06,-2e-06,1.2e-05,2e-06,-8e-06,-6e-06,-1e-06,-9e-06,-2e-06,-3e-06,-1e-06,-2e-06,4.7e-05,-5e-06,-1e-06,1e-05,0,-1e-06,2e-06,0,3e-06,4e-06,7e-06,-1e-06,0,0,-3e-06,1.5e-05,1e-06,2e-06,2e-06,-4e-06,6e-06,-2e-06,1.5e-05,1.6e-05,-5e-06,-9e-06,3e-06,3e-06,4e-06,-3e-06,1e-06,-3e-06,-1e-06
-1.1e-05,6e-06,1e-06,-3e-06,9e-06,-1e-06,3e-06,9e-06,-2e-06,-3e-06,-8e-06,0,0,7e-06,2e-06,-1e-06,-3e-06,-2e-06,-3e-06,5e-06,-5e-06,2.2e-05,2e-06,1e-06,-1e-06,1e-06,1e-06,1.3e-05,1e-06,2e-06,4e-06,2e-05,0,0,-2.4e-05,-2e-06,3e-06,1.7e-05,7e-06,7e-06,-5e-06,0,-1e-06,9e-06,-7e-06,-2e-06,6e-06,0,6e-06,2e-06,0,-5e-06,-6e-06,-6e-06,1e-06,7e-06,-3e-06,0,3e-06,0,1e-06,-3e-06,0,-7e-06,1e-06,1e-06,-2e-06,-1.1e-05,1.8e-05,1.4e-05,4e-06,-2e-06,-6e-06,-2e-06,1.8e-05,-8e-06,0,4e-06,-1.3e-05,-1e-06,-4e-06,2e-06,-1e-06,5e-06,0,8e-06,3e-06,0,-2.9e-05,3e-06,0,-7e-06,2e-06,0,2e-06,2e-06,-2e-06,-1.4e-05,-5e-06,5e-06,-1e-06,0,2e-06,-1e-05,-1e-06,5e-06,-3e-06,7e-06,-6e-06,0,-1.1e-05,-1.2e-05,4e-06,7e-06,-2e-06,5e-06,-2e-06,-1e-06,-1e-06,9e-06,2e-06
1e-06,-8e-06,-1e-06,-2e-06,4e-06,5e-06,-1e-06,-5e-06,2e-06,1e-06,1.2e-05,3e-06,2e-06,-8e-06,-4e-06,2e-06,8e-06,0,1e-06,-5e-06,7e-06,-1.7e-05,-4e-06,-2e-06,2e-06,-1e-06,2e-06,0,2e-06,3e-06,0,-4e-06,-3e-06,-2e-06,1.3e-05,-1e-06,-3e-06,-1.8e-05,-5e-06,-6e-06,8e-06,3e-06,6e-06,-9e-06,8e-06,1e-06,-4e-06,2e-06,-5e-06,-1e-06,4e-06,8e-06,0,3e-06,-2e-06,-2e-06,6e-06,-1e-06,-3e-06,-6e-06,-4e-06,-3e-06,4e-06,5e-06,-1e-06,-1e-06,2e-06,6e-06,-1.6e-05,-1.1e-05,1e-06,8e-06,3e-06,0,-1.4e-05,8e-06,3e-06,-1e-06,4e-06,1e-06,1.1e-05,-2e-06,-3e-06,-1e-06,0,-5e-06,-3e-06,0,2e-06,0,0,0,-9e-06,0,-6e-06,-1e-06,-3e-06,1.7e-05,5e-06,-3e-06,1e-06,0,-1e-06,7e-06,3e-06,-1.1e-05,2e-06,-6e-06,4e-06,-2e-06,5e-06,1.1e-05,-2e-06,-8e-06,-4e-06,-6e-06,0,1e-06,2e-06,-2e-06,-2e-06
9e-06,1.1e-05,2e-06,4e-06,-1.6e-05,-4e-06,1e-06,5e-06,-1e-06,2e-06,-1.4e-05,-1e-06,0,-3e-06,2e-06,-4e-06,-2e-06,-1e-06,1e-06,4e-06,-5e-06,1.3e-05,6e-06,2e-06,7e-06,3e-06,-1e-06,1e-06,-8e-06,1e-06,-3e-06,-8e-06,-1e-06,0,1.1e-05,3e-06,-4e-06,1.1e-05,4e-06,5e-06,-9e-06,-6e-06,-8e-06,7e-06,2e-06,0,1e-06,-4e-06,0,-4e-06,-2e-06,-7e-06,1e-06,1e-06,1e-06,-3e-06,-9e-06,0,0,3e-06,4e-06,2e-06,-6e-06,1e-06,-4e-06,2e-06,2e-06,0,9e-06,1.1e-05,-5e-06,-5e-06,-3e-06,3e-06,1.1e-05,-6e-06,-1e-06,-1e-06,5e-06,-1e-06,-5e-06,3e-06,0,-3e-06,1e-06,-1e-06,2e-06,0,2.4e-05,-5e-06,1e-06,1e-05,7e-06,-1e-06,2e-06,-1e-06,0,-8e-06,-6e-06,-3e-06,1e-06,1e-06,1e-06,-7e-06,-1e-06,7e-06,0,4e-06,-2e-06,0,3e-06,-7e-06,2e-06,1e-05,-1e-06,-1e-06,3e-06,6e-06,-1e-06,-6e-06,0
-1.3e-05,-1e-05,-2e-06,-4e-06,1.6e-05,3e-06,-2e-06,-8e-06,0,-2e-06,1.2e-05,-3e-06,-2e-06,7e-06,0,-2e-06,-2e-06,0,-1e-06,-3e-06,2e-06,-1.9e-05,-9e-06,3e-06,-7e-06,-2e-06,3e-06,6e-06,8e-06,-1e-06,-5e-06,1.4e-05,3e-06,-1e-06,-2e-05,-2e-06,5e-06,0,-4e-06,-6e-06,3e-06,3e-06,7e-06,-6e-06,-9e-06,0,0,1e-06,8e-06,3e-06,3e-06,4e-06,-1e-06,-1e-06,1e-06,1e-06,8e-06,1e-06,-1e-06,-6e-06,-2e-06,-2e-06,8e-06,-5e-06,-1e-06,0,-7e-06,4e-06,1e-06,-1.3e-05,0,3e-06,5e-06,-1e-06,-2e-06,6e-06,-3e-06,-2e-06,-1.2e-05,-2e-06,-4e-06,-7e-06,1e-06,5e-06,1e-06,7e-06,-4e-06,-1e-06,-4e-05,6e-06,0,-1e-05,4e-06,1e-06,1e-06,2e-06,1e-06,-5e-06,2e-06,2e-06,-1e-06,-1e-06,1e-06,1.1e-05,-1e-06,2e-06,1e-06,-2e-06,-1e-06,-2e-06,-1.2e-05,0,0,-6e-06,2e-06,3e-06,-6e-06,-3e-06,1e-06,6e-06,1e-06
1.2e-05,2e-06,2e-06,9e-06,-1.4e-05,3e-06,1e-06,1.3e-05,0,0,-7e-06,2e-06,0,1e-06,0,4e-06,2e-06,0,0,2e-06,-1e-06,3.1e-05,1.1e-05,-1e-06,-4e-06,0,1e-06,-9e-06,-3e-06,-3e-06,7e-06,-1.4e-05,1e-06,1e-06,7e-06,0,1e-06,-3e-06,0,7e-06,-2e-06,0,-6e-06,4e-06,4e-06,0,-2e-06,2e-06,-1e-05,-1e-06,-4e-06,-2e-06,2e-06,3e-06,-1e-06,-3e-06,-7e-06,0,0,0,1e-06,4e-06,-9e-06,4e-06,3e-06,1e-06,1e-05,-2e-06,-4e-06,1.2e-05,3e-06,-6e-06,-4e-06,-2e-06,-4e-06,-4e-06,2e-06,4e-06,1.4e-05,2e-06,3e-06,5e-06,4e-06,-4e-06,-2e-06,-9e-06,4e-06,1e-06,3.9e-05,-4e-06,1e-06,5e-06,-8e-06,0,-3e-06,-1e-06,3e-06,1.1e-05,5e-06,4e-06,0,0,-2e-06,-1.5e-05,3e-06,-7e-06,1e-06,3e-06,0,1e-06,1.1e-05,5e-06,-3e-06,2e-06,1e-06,0,8e-06,5e-06,-1e-06,1e-06,-1e-06
-6e-06,1e-06,0,-9e-06,4e-06,-3e-06,0,-1.3e-05,0,1e-06,5e-06,1e-06,1e-06,-1e-06,-1e-06,0,-3e-06,0,0,-2e-06,0,-3.8e-05,-1.2e-05,-1e-06,5e-06,-1e-06,1e-06,1e-06,0,-2e-06,-2e-06,9e-06,-3e-06,1e-06,9e-06,-2e-06,-9e-06,2e-06,2e-06,-6e-06,1e-06,-3e-06,4e-06,1e-06,5e-06,1e-06,3e-06,0,6e-06,0,4e-06,-1e-06,-3e-06,-3e-06,1e-06,3e-06,6e-06,-1e-06,4e-06,1.1e-05,-1e-06,-1e-06,9e-06,6e-06,0,1e-06,-9e-06,1e-06,2e-06,-1.1e-05,1e-06,2e-06,1e-06,1e-06,7e-06,3e-06,1e-06,-1e-06,-7e-06,2e-06,-1e-06,3e-06,1e-06,2e-06,-1e-06,2e-06,0,0,-2.2e-05,3e-06,-2e-06,-6e-06,5e-06,0,1e-06,0,-3e-06,-9e-06,-2e-06,-1e-06,1e-06,0,1e-06,7e-06,-2e-06,5e-06,-1e-06,-1e-06,2e-06,1e-06,-6e-06,-6e-06,2e-06,1e-06,-1e-06,-4e-06,-5e-06,-4e-06,1e-06,-5e-06,2e-06
-3e-06,-2e-06,0,1e-05,4e-06,4e-06,0,7e-06,0,0,-8e-06,-2e-06,0,-7e-06,1e-06,0,3e-06,-1e-06,1e-06,1e-06,3e-06,3.2e-05,1.3e-05,1e-06,-3e-06,-2e-06,-2e-06,-1e-06,4e-06,0,2e-06,2e-06,-3e-06,-2e-06,-7e-06,4e-06,7e-06,-5e-06,0,5e-06,5e-06,2e-06,-1e-06,0,-7e-06,-1e-06,-1e-06,-3e-06,2e-06,0,-3e-06,4e-06,1e-06,0,-1e-06,1e-06,-3e-06,-1e-06,-2e-06,-2e-06,1e-06,-1e-06,-8e-06,-7e-06,1e-06,-1e-06,5e-06,-3e-06,-3e-06,1e-05,-5e-06,6e-06,0,1e-06,-1.2e-05,-3e-06,-1e-06,1e-06,-2e-06,1e-06,-2e-06,0,-1e-06,1e-06,-2e-06,6e-06,2e-06,0,-7e-06,0,0,-1e-06,1e-06,0,1e-06,-1e-06,0,2e-06,-2e-06,-4e-06,0,0,-1e-06,-7e-06,0,-2e-06,-1e-06,-2e-06,-2e-06,-1e-06,0,7e-06,1e-06,-2e-06,-1e-06,5e-06,-1e-06,-9e-06,0,2e-06,-1e-06
1e-05,7e-06,1e-06,-1.2e-05,-1.2e-05,3e-06,-1e-06,-3e-06,1e-06,0,1.3e-05,0,1e-06,2e-06,1e-06,0,3e-06,0,-1e-06,0,-3e-06,-2e-05,-1.4e-05,-1e-06,0,2e-06,0,-6e-06,-5e-06,2e-06,-8e-06,-1.4e-05,1e-06,0,-1.1e-05,-2e-06,4e-06,1.2e-05,-5e-06,-6e-06,-7e-06,0,0,2e-06,-1e-06,0,-1e-06,2e-06,-1e-05,-1e-06,5e-06,-6e-06,1e-06,1e-06,0,-1e-06,2e-06,0,-2e-06,-5e-06,0,1e-06,5e-06,-2e-06,3e-06,-1e-06,0,0,9e-06,-1.1e-05,0,-5e-06,0,-1e-06,1.5e-05,2e-06,0,-2e-06,1e-05,0,1e-06,-3e-06,-1e-06,-3e-06,2e-06,-3e-06,-3e-06,0,3.4e-05,-3e-06,0,5e-06,-1e-06,0,0,1e-06,-2e-06,6e-06,0,-1e-06,0,0,1e-06,1e-05,-2e-06,-3e-06,0,2e-06,2e-06,1e-06,8e-06,-1.2e-05,-1e-06,4e-06,2e-06,0,6e-06,0,0,2e-06,-1e-06
