0.009324,0.010231,0.010254,0.009569,0.008628,0.008598,0.008664,0.008677,0.009126,0.009075,0.00805,0.007564,0.008642,0.009243,0.009484,0.009969,0.010733,0.010982,0.009325,0.008518,0.009317,0.009035,0.007775,0.008025,0.009016,0.008519,0.008023,0.008153
0.011352,0.012427,0.012599,0.011692,0.010449,0.010383,0.01033,0.010351,0.011118,0.011154,0.009903,0.009305,0.010539,0.011369,0.011916,0.012554,0.013139,0.013285,0.011464,0.010464,0.011216,0.010821,0.009317,0.009465,0.010717,0.010309,0.009663,0.009784
0.014673,0.015882,0.016225,0.015031,0.013358,0.013146,0.012865,0.01291,0.014192,0.014381,0.012837,0.012158,0.013644,0.014768,0.015877,0.016876,0.017079,0.0171,0.01513,0.013643,0.014084,0.013528,0.011802,0.011775,0.013414,0.013194,0.01234,0.012437
0.017148,0.017989,0.018233,0.017041,0.01532,0.014802,0.014296,0.014345,0.015938,0.016302,0.014675,0.014173,0.015695,0.016825,0.018514,0.019925,0.01983,0.019839,0.017916,0.015953,0.015873,0.015361,0.013944,0.013955,0.015572,0.0153,0.014689,0.01471
0.019244,0.019611,0.019709,0.018839,0.017291,0.016372,0.015529,0.015297,0.016629,0.017056,0.01589,0.015627,0.016817,0.018106,0.019902,0.021553,0.022344,0.022095,0.019546,0.017356,0.016971,0.016941,0.016388,0.01688,0.018115,0.017614,0.017981,0.017601
0.022162,0.022703,0.022781,0.022472,0.021765,0.020644,0.018733,0.017614,0.017976,0.018377,0.018545,0.018731,0.019681,0.021316,0.022298,0.023893,0.027106,0.026386,0.021655,0.019062,0.01916,0.01966,0.01962,0.021194,0.022462,0.021755,0.022988,0.022019
0.026151,0.026964,0.026224,0.026392,0.027692,0.02722,0.024474,0.022695,0.021686,0.021307,0.023052,0.024922,0.026062,0.027504,0.027753,0.029336,0.03463,0.032941,0.025536,0.022843,0.024067,0.024596,0.024331,0.026985,0.029053,0.028354,0.028595,0.026978
0.031842,0.031552,0.029589,0.031033,0.035672,0.036937,0.033039,0.030619,0.0288,0.026841,0.029369,0.033344,0.03505,0.036835,0.036928,0.038552,0.046283,0.043192,0.032224,0.029261,0.031528,0.031818,0.031122,0.035062,0.038565,0.037644,0.035003,0.032363
0.04029,0.037904,0.034288,0.037974,0.046099,0.049311,0.043233,0.040203,0.039196,0.034607,0.035518,0.040409,0.04364,0.04853,0.049996,0.051479,0.062059,0.057216,0.04138,0.037738,0.039979,0.038977,0.038747,0.045727,0.051091,0.048854,0.042884,0.039113
0.048781,0.045248,0.040615,0.04598,0.056363,0.060859,0.052009,0.048664,0.04917,0.04143,0.039465,0.044161,0.049111,0.057751,0.061659,0.064861,0.077494,0.069796,0.04952,0.044605,0.045272,0.042946,0.044509,0.054707,0.060946,0.056677,0.048864,0.044838
0.051504,0.049187,0.046253,0.050589,0.058504,0.062785,0.053505,0.051426,0.053906,0.044636,0.040268,0.0444,0.050097,0.059085,0.064331,0.071596,0.083751,0.073258,0.052571,0.046108,0.045323,0.04438,0.047625,0.056673,0.061396,0.05662,0.050229,0.047452
0.047098,0.047657,0.049046,0.049331,0.049161,0.052072,0.046588,0.046598,0.050168,0.042601,0.038871,0.042892,0.047019,0.052162,0.056644,0.0665,0.074913,0.064741,0.049608,0.043833,0.045271,0.049122,0.051303,0.052656,0.054946,0.053871,0.050795,0.04789
0.039249,0.043215,0.04804,0.043461,0.038408,0.041875,0.040125,0.039137,0.041336,0.039035,0.03911,0.042277,0.04312,0.044055,0.047585,0.055904,0.059846,0.053934,0.045573,0.041663,0.047636,0.056058,0.054651,0.048447,0.051443,0.055234,0.05434,0.050176
0.03305,0.038576,0.043631,0.038852,0.03785,0.041793,0.039347,0.036347,0.036571,0.037963,0.040206,0.041411,0.039921,0.038438,0.041705,0.048657,0.050757,0.047495,0.041613,0.039595,0.048197,0.056432,0.052659,0.046018,0.050089,0.055228,0.054689,0.048875
0.030288,0.036643,0.041293,0.038378,0.041442,0.044614,0.043386,0.04302,0.041811,0.043697,0.044133,0.042044,0.044004,0.042335,0.042325,0.048459,0.048268,0.042783,0.037881,0.03929,0.047318,0.05304,0.048291,0.042393,0.044832,0.048767,0.048874,0.042295
0.035726,0.044271,0.052479,0.049859,0.051078,0.054145,0.056307,0.060478,0.059266,0.062525,0.057766,0.050673,0.062559,0.062573,0.055686,0.059907,0.056472,0.046672,0.044135,0.050341,0.056458,0.063824,0.05831,0.049092,0.049719,0.052309,0.050681,0.039968
0.053349,0.062471,0.077729,0.075011,0.071377,0.07395,0.075872,0.082039,0.080814,0.086435,0.079058,0.069017,0.091679,0.095032,0.080228,0.079976,0.075064,0.062115,0.060447,0.070232,0.074788,0.085406,0.080661,0.07184,0.074876,0.074055,0.068094,0.053369
0.081145,0.087717,0.111219,0.106789,0.091975,0.093216,0.092631,0.09716,0.096817,0.104253,0.09869,0.090445,0.118675,0.126435,0.106913,0.098071,0.094102,0.08143,0.077523,0.089117,0.091496,0.102796,0.103539,0.102727,0.109882,0.101917,0.08912,0.075072
0.117465,0.119066,0.147448,0.137357,0.10513,0.105452,0.104578,0.104889,0.109504,0.118259,0.114634,0.109051,0.130451,0.146481,0.132545,0.110866,0.11226,0.102891,0.088817,0.099701,0.100367,0.108223,0.119061,0.133177,0.145925,0.131278,0.109561,0.098261
0.151654,0.149432,0.176795,0.155671,0.10909,0.115007,0.1209,0.113865,0.121638,0.137522,0.136852,0.125584,0.126392,0.150511,0.150502,0.12227,0.130865,0.11868,0.092638,0.102407,0.102711,0.109215,0.129865,0.157751,0.176039,0.158625,0.128608,0.117969
0.170096,0.161798,0.178157,0.146116,0.102074,0.118586,0.129504,0.119281,0.127958,0.150541,0.154996,0.134967,0.115803,0.141922,0.154697,0.128881,0.139466,0.122003,0.094882,0.107342,0.105673,0.112537,0.136943,0.169694,0.190398,0.16959,0.134962,0.126037
0.165837,0.151746,0.148406,0.114669,0.090636,0.113174,0.119356,0.112255,0.124404,0.147011,0.149143,0.124897,0.102753,0.126951,0.14803,0.128886,0.135278,0.123614,0.109136,0.123078,0.115026,0.109435,0.126297,0.157457,0.17508,0.15717,0.12826,0.117967
0.140992,0.134285,0.126701,0.100723,0.097225,0.121922,0.111907,0.098873,0.116029,0.131207,0.120984,0.104922,0.098317,0.118798,0.14491,0.130771,0.119481,0.117908,0.128017,0.15141,0.141645,0.109858,0.108164,0.138147,0.146867,0.129036,0.112129,0.100625
0.121978,0.125213,0.13033,0.111411,0.112624,0.136129,0.112602,0.087638,0.104605,0.114979,0.096192,0.087158,0.099114,0.118584,0.143351,0.138937,0.109483,0.106189,0.141866,0.180417,0.171217,0.123504,0.105929,0.12929,0.132337,0.107598,0.095566,0.096193
0.125905,0.134465,0.146338,0.129515,0.117771,0.128459,0.104233,0.083828,0.101593,0.108306,0.089437,0.087538,0.11243,0.121084,0.12821,0.142405,0.117989,0.100776,0.134831,0.179537,0.181995,0.154958,0.139941,0.141435,0.135376,0.106479,0.09154,0.106299
0.131329,0.143909,0.15884,0.151285,0.124089,0.110253,0.090579,0.08846,0.116284,0.114722,0.096229,0.117363,0.154904,0.137641,0.112888,0.1461,0.143082,0.106154,0.11094,0.147449,0.164406,0.17984,0.191624,0.18094,0.175928,0.138197,0.099722,0.122373
0.139519,0.156849,0.163441,0.164943,0.147103,0.122582,0.096009,0.096592,0.133177,0.130714,0.122165,0.164177,0.202478,0.163863,0.115453,0.157628,0.172454,0.118108,0.097049,0.12951,0.148422,0.189026,0.234134,0.226915,0.229877,0.17863,0.109261,0.136835
0.154978,0.171993,0.16243,0.170244,0.178852,0.149273,0.105336,0.108137,0.14638,0.15087,0.164,0.203932,0.224263,0.178687,0.113684,0.148283,0.179832,0.131732,0.103079,0.123546,0.136018,0.179935,0.245774,0.257787,0.270037,0.209445,0.117473,0.141678
0.158796,0.17462,0.16129,0.177001,0.198644,0.157074,0.103961,0.113506,0.148758,0.165312,0.194092,0.208018,0.195126,0.161038,0.103611,0.120909,0.155778,0.132774,0.108395,0.102924,0.109741,0.15501,0.219477,0.244766,0.26587,0.208415,0.113859,0.126925
0.146727,0.155531,0.143174,0.161586,0.186365,0.145299,0.100598,0.104331,0.126811,0.154622,0.186676,0.170794,0.130686,0.115395,0.089188,0.101253,0.126292,0.121672,0.103039,0.078279,0.080073,0.1225,0.176034,0.204127,0.229646,0.181573,0.096793,0.094903
0.119549,0.123122,0.119983,0.128853,0.141898,0.116119,0.09076,0.082612,0.095262,0.122554,0.142354,0.120976,0.082353,0.076901,0.070355,0.083527,0.110377,0.121812,0.100329,0.069971,0.064382,0.088202,0.125685,0.145689,0.166634,0.141156,0.080279,0.064358
0.101808,0.107923,0.115186,0.103411,0.096506,0.083321,0.070302,0.067957,0.079462,0.097089,0.099177,0.081194,0.061819,0.067487,0.060141,0.065292,0.105611,0.135007,0.11027,0.075374,0.065162,0.064279,0.07108,0.086678,0.114017,0.113492,0.072622,0.046981
0.090934,0.095199,0.103186,0.081667,0.07333,0.063169,0.049534,0.058839,0.069198,0.082107,0.081392,0.063544,0.055754,0.059808,0.047792,0.045176,0.096349,0.136143,0.109826,0.075696,0.063968,0.051462,0.039825,0.057114,0.096028,0.101367,0.064155,0.038233
0.065149,0.06653,0.074714,0.067352,0.0636,0.049407,0.036781,0.045715,0.052728,0.059834,0.064393,0.054527,0.047435,0.04568,0.03625,0.036243,0.087719,0.123479,0.097812,0.070036,0.05867,0.047094,0.03279,0.042682,0.072722,0.078424,0.051937,0.031064
0.035564,0.038271,0.049037,0.05268,0.051658,0.036094,0.028906,0.037659,0.044812,0.048341,0.05445,0.04965,0.040069,0.040004,0.035505,0.038458,0.078931,0.111054,0.085939,0.058424,0.053218,0.050902,0.039935,0.035931,0.051448,0.060593,0.049234,0.03714
0.024842,0.027158,0.036311,0.040236,0.04434,0.032752,0.02493,0.032764,0.038402,0.044609,0.053873,0.046129,0.038587,0.046342,0.044654,0.046675,0.074851,0.093922,0.065089,0.048872,0.058405,0.059671,0.050089,0.040199,0.050272,0.063085,0.056872,0.049032
0.027907,0.028001,0.032799,0.031983,0.037189,0.033749,0.025914,0.029739,0.02983,0.035099,0.045896,0.039159,0.035804,0.04775,0.051427,0.051172,0.065518,0.069694,0.043451,0.041174,0.062304,0.062743,0.053332,0.046484,0.051456,0.061183,0.059256,0.055916
0.033757,0.030281,0.028008,0.022492,0.027829,0.031964,0.025727,0.02841,0.026285,0.025318,0.032671,0.032944,0.033379,0.041196,0.05048,0.047709,0.048495,0.046699,0.036834,0.040398,0.05778,0.053947,0.045915,0.045256,0.045167,0.050966,0.054591,0.054203
0.041693,0.03129,0.021794,0.01636,0.023101,0.03294,0.02571,0.026779,0.028188,0.023523,0.026965,0.032253,0.031852,0.037623,0.044604,0.045165,0.036893,0.029156,0.036174,0.04757,0.053042,0.039878,0.032395,0.036572,0.036672,0.046035,0.059984,0.055242
0.045818,0.029503,0.017477,0.017334,0.025868,0.038294,0.027085,0.026309,0.033255,0.025261,0.027589,0.034565,0.032663,0.037971,0.036003,0.044208,0.036722,0.022005,0.037098,0.06044,0.061878,0.040415,0.024534,0.029622,0.035835,0.052504,0.07276,0.068099
