0.023752,0.025499,0.025196,0.019863,0.018236,0.021942,0.022975,0.020001,0.01826,0.018478,0.018945,0.019019,0.019043,0.021382,0.026559,0.027579,0.026049,0.025118,0.023154,0.022144,0.020456,0.019928,0.019494,0.018376,0.018664,0.021581,0.024554,0.021874
0.032322,0.036132,0.035693,0.027095,0.024519,0.030108,0.031335,0.026842,0.024542,0.024977,0.025602,0.026196,0.026466,0.029779,0.037486,0.038905,0.036488,0.035004,0.032363,0.030775,0.028062,0.027035,0.025887,0.024215,0.025191,0.030346,0.035033,0.03051
0.049952,0.057693,0.057027,0.041922,0.037033,0.045969,0.047832,0.040681,0.037518,0.038287,0.039011,0.040882,0.041587,0.046608,0.059679,0.061619,0.057026,0.054742,0.050966,0.048606,0.043822,0.041336,0.038563,0.035451,0.038288,0.048521,0.056222,0.047929
0.069027,0.080297,0.079098,0.057977,0.050386,0.062435,0.066413,0.057587,0.053771,0.054622,0.055,0.05893,0.059358,0.064444,0.082798,0.084401,0.077201,0.076033,0.07211,0.069916,0.063346,0.058147,0.053154,0.047565,0.053118,0.069967,0.07993,0.068449
0.084409,0.095104,0.092139,0.070888,0.062261,0.075051,0.085009,0.07915,0.07412,0.07387,0.074006,0.080237,0.07819,0.07953,0.100302,0.099929,0.090792,0.093823,0.092412,0.095239,0.090385,0.079906,0.06985,0.059643,0.06844,0.092661,0.10151,0.088909
0.103318,0.106998,0.099754,0.086502,0.078415,0.085793,0.106259,0.111499,0.105932,0.103761,0.104629,0.114701,0.108091,0.102011,0.122383,0.116675,0.105721,0.115867,0.121397,0.138335,0.138071,0.116613,0.097152,0.078846,0.090415,0.124757,0.130018,0.116716
0.136789,0.132332,0.120459,0.113383,0.103672,0.104603,0.137577,0.155251,0.149911,0.148234,0.149572,0.164624,0.155181,0.140934,0.162639,0.152589,0.140785,0.159001,0.172113,0.204426,0.207658,0.171954,0.138481,0.109942,0.127067,0.176536,0.179872,0.164002
0.173666,0.163288,0.147219,0.140387,0.128262,0.129495,0.170773,0.192928,0.187685,0.188736,0.189917,0.206829,0.19669,0.176511,0.19927,0.188994,0.177857,0.202939,0.222628,0.263411,0.268149,0.22139,0.174692,0.140768,0.165252,0.226142,0.229381,0.210689
0.190821,0.178102,0.158804,0.150305,0.136341,0.139673,0.177709,0.194531,0.18975,0.196417,0.200855,0.214353,0.206568,0.18881,0.206128,0.196659,0.186724,0.213926,0.237363,0.272021,0.276959,0.233026,0.18715,0.160746,0.1853,0.238844,0.242708,0.225942
0.189937,0.178414,0.157178,0.147202,0.129797,0.131562,0.160965,0.170434,0.161204,0.169171,0.186261,0.194655,0.186356,0.180008,0.189693,0.18104,0.168417,0.188858,0.209069,0.222759,0.229445,0.209775,0.181969,0.167402,0.180378,0.206983,0.214777,0.214084
0.186739,0.181035,0.164185,0.158737,0.136336,0.12861,0.159249,0.177248,0.158398,0.150649,0.179815,0.186704,0.17485,0.182088,0.18937,0.174534,0.154827,0.174192,0.186393,0.172288,0.182205,0.200715,0.193667,0.179072,0.181908,0.179297,0.183396,0.205968
0.178154,0.174957,0.17635,0.190247,0.163983,0.144068,0.177713,0.203431,0.185117,0.165226,0.187581,0.186735,0.172406,0.195452,0.207772,0.188493,0.169103,0.191549,0.189648,0.154868,0.173106,0.213075,0.210106,0.19639,0.20088,0.182591,0.172267,0.197873
0.168882,0.161659,0.180851,0.217716,0.195706,0.171251,0.1956,0.21219,0.208238,0.187565,0.186648,0.17949,0.172199,0.201564,0.21412,0.204879,0.194217,0.206427,0.192469,0.154217,0.174183,0.210517,0.205446,0.197015,0.207894,0.186956,0.161724,0.178294
0.172955,0.158268,0.18302,0.230823,0.217382,0.194626,0.200226,0.211955,0.233644,0.210629,0.175954,0.163403,0.169608,0.192173,0.199965,0.211555,0.209226,0.198536,0.181577,0.158536,0.172662,0.194682,0.18963,0.180261,0.190129,0.178591,0.150296,0.162348
0.182953,0.165588,0.190335,0.225422,0.216114,0.202305,0.192786,0.203052,0.2393,0.226535,0.184295,0.166564,0.177668,0.188394,0.192742,0.209781,0.20921,0.194108,0.18369,0.180838,0.18276,0.181352,0.175957,0.174534,0.184696,0.179957,0.159139,0.166197
0.224939,0.214738,0.241901,0.263381,0.248812,0.228911,0.21091,0.2097,0.240141,0.261749,0.229133,0.190527,0.196694,0.210506,0.225915,0.224977,0.219385,0.214338,0.210053,0.230165,0.210527,0.17806,0.182479,0.205074,0.21641,0.209642,0.200649,0.194859
0.316619,0.317855,0.363129,0.385835,0.358486,0.315825,0.292099,0.283911,0.304647,0.351586,0.310823,0.241151,0.24961,0.283246,0.324094,0.304657,0.291573,0.291105,0.282586,0.321315,0.285272,0.235082,0.251909,0.286293,0.286375,0.277532,0.285947,0.260198
0.423905,0.434231,0.508045,0.537124,0.495016,0.424202,0.393499,0.39595,0.400558,0.446679,0.401601,0.308437,0.317397,0.36733,0.432322,0.422948,0.407606,0.399134,0.374461,0.416243,0.376878,0.325774,0.352043,0.379592,0.364275,0.358054,0.385842,0.347775
0.518099,0.51758,0.615556,0.647512,0.596649,0.505852,0.468179,0.503387,0.483167,0.492421,0.465899,0.378265,0.371305,0.41585,0.487676,0.509847,0.495836,0.468196,0.43387,0.481598,0.460298,0.421486,0.448343,0.452412,0.418805,0.406944,0.447968,0.406937
0.581806,0.548429,0.637567,0.664121,0.620995,0.526103,0.483106,0.556246,0.51891,0.469298,0.46913,0.43241,0.40881,0.422437,0.47709,0.532912,0.52203,0.463928,0.440491,0.520116,0.532504,0.510633,0.528122,0.508854,0.470687,0.426869,0.44504,0.40503
0.560495,0.485445,0.533129,0.556653,0.5453,0.479934,0.458209,0.536208,0.483447,0.384733,0.401236,0.452019,0.436657,0.408726,0.430744,0.496334,0.495193,0.409649,0.392724,0.531892,0.58924,0.569602,0.561466,0.525648,0.499319,0.421265,0.394275,0.358482
0.453585,0.371289,0.383187,0.405053,0.421834,0.388729,0.39692,0.436905,0.382339,0.297649,0.316542,0.416585,0.421056,0.392343,0.3999,0.431737,0.425117,0.355432,0.354102,0.51074,0.570121,0.531148,0.505103,0.459675,0.447884,0.399643,0.381084,0.341268
0.336634,0.276085,0.277275,0.287645,0.293089,0.284633,0.316087,0.32574,0.291649,0.25589,0.270952,0.341078,0.3564,0.363026,0.369474,0.368945,0.349133,0.319023,0.343968,0.444393,0.448933,0.399059,0.407015,0.36667,0.344284,0.348889,0.365903,0.321809
0.229756,0.206133,0.192013,0.19698,0.209816,0.213377,0.236753,0.243854,0.237282,0.229174,0.227164,0.243259,0.252588,0.28535,0.306467,0.311569,0.287923,0.273487,0.30866,0.345784,0.300869,0.254771,0.298107,0.263565,0.224907,0.261018,0.292645,0.249671
0.156965,0.173484,0.143379,0.129579,0.155318,0.169903,0.185517,0.190845,0.196208,0.19413,0.164459,0.145165,0.141332,0.169656,0.197715,0.225117,0.212067,0.19909,0.234677,0.232404,0.176575,0.159309,0.197314,0.165192,0.134407,0.166764,0.192734,0.170603
0.115829,0.161193,0.13433,0.109747,0.143926,0.167688,0.179119,0.164737,0.153139,0.146907,0.127563,0.121826,0.098202,0.095412,0.1106,0.148133,0.158068,0.136988,0.158407,0.156426,0.114746,0.123933,0.140245,0.115759,0.102886,0.104296,0.119917,0.12705
0.096323,0.138504,0.131787,0.118294,0.152969,0.175524,0.169866,0.135552,0.110813,0.108512,0.109404,0.122437,0.097751,0.081094,0.081972,0.099114,0.114514,0.092853,0.09898,0.108422,0.082756,0.097064,0.108323,0.102885,0.109058,0.092053,0.102218,0.120864
0.07926,0.105957,0.121674,0.130651,0.151434,0.154296,0.13295,0.103,0.092781,0.084111,0.081903,0.106728,0.093633,0.071473,0.065126,0.074201,0.086413,0.064112,0.061779,0.079385,0.068302,0.075905,0.087519,0.097537,0.109428,0.089741,0.101069,0.115433
0.074542,0.088403,0.103484,0.120604,0.124044,0.115161,0.098516,0.081093,0.082286,0.070187,0.059894,0.085608,0.086678,0.060767,0.051547,0.067661,0.081782,0.065645,0.059111,0.0693,0.068464,0.071029,0.068657,0.078597,0.094366,0.078181,0.087491,0.097621
0.074583,0.074204,0.075775,0.088145,0.081442,0.075524,0.081749,0.073813,0.07073,0.066403,0.059495,0.079923,0.082107,0.057507,0.052011,0.063617,0.074969,0.070023,0.06074,0.064902,0.074524,0.075082,0.059889,0.058754,0.072661,0.065946,0.071491,0.07506
0.086051,0.076519,0.061118,0.061559,0.063808,0.066024,0.084433,0.075503,0.066362,0.076377,0.0729,0.078765,0.075056,0.061798,0.063219,0.061753,0.066649,0.06783,0.055448,0.063689,0.084147,0.076144,0.057094,0.051638,0.054559,0.057009,0.063466,0.062166
0.098825,0.084234,0.058718,0.050926,0.06485,0.076783,0.096007,0.07964,0.064258,0.082503,0.082447,0.08104,0.075141,0.069901,0.07366,0.0694,0.0722,0.066564,0.046912,0.065293,0.09551,0.0758,0.054523,0.052486,0.049441,0.054582,0.059406,0.057775
0.097573,0.082306,0.059543,0.050708,0.064324,0.078833,0.095917,0.077609,0.057018,0.073422,0.078143,0.075312,0.071104,0.072532,0.077155,0.07175,0.071658,0.062231,0.037871,0.060306,0.094809,0.073683,0.053496,0.049952,0.046611,0.05199,0.053687,0.055067
0.085389,0.074944,0.059946,0.049372,0.05598,0.077555,0.090994,0.064605,0.041105,0.054821,0.070201,0.065458,0.058776,0.067231,0.074662,0.0632,0.056419,0.051153,0.033144,0.051909,0.078784,0.065374,0.052843,0.043777,0.045318,0.051792,0.050856,0.058398
0.067239,0.067258,0.061299,0.048992,0.054435,0.078822,0.081472,0.04979,0.031523,0.04494,0.064534,0.059416,0.051961,0.058908,0.061159,0.048735,0.039141,0.039736,0.03464,0.046722,0.061603,0.058788,0.051743,0.040964,0.046,0.052317,0.050715,0.063497
0.049727,0.066035,0.063894,0.052665,0.058121,0.070095,0.064631,0.041519,0.028106,0.037617,0.057168,0.059467,0.052474,0.047487,0.040554,0.037661,0.036893,0.037086,0.033993,0.040794,0.052065,0.05439,0.045832,0.036322,0.040969,0.044471,0.043462,0.061035
0.041431,0.065715,0.062201,0.057594,0.058728,0.051663,0.04436,0.035436,0.024554,0.027899,0.047954,0.057034,0.050492,0.038833,0.025803,0.029083,0.038485,0.040659,0.030332,0.036471,0.051549,0.048059,0.033939,0.027203,0.029611,0.031682,0.03732,0.052205
0.03867,0.059797,0.050602,0.055164,0.053987,0.040694,0.037249,0.032756,0.023744,0.024913,0.044822,0.050331,0.042402,0.030983,0.020138,0.026702,0.03982,0.040982,0.025705,0.032154,0.045971,0.040434,0.025357,0.019941,0.020058,0.024774,0.037243,0.040465
0.032926,0.047941,0.039623,0.0456,0.048085,0.040265,0.042446,0.040081,0.027615,0.023941,0.038893,0.037215,0.028617,0.021173,0.017026,0.027512,0.043734,0.038544,0.02285,0.032315,0.042401,0.036906,0.02267,0.018816,0.018482,0.024188,0.039455,0.035301
0.028315,0.035061,0.033066,0.033146,0.037093,0.036176,0.049972,0.05113,0.034137,0.02594,0.031759,0.025543,0.017773,0.013901,0.016198,0.027956,0.044552,0.039189,0.024402,0.036482,0.047104,0.035625,0.021098,0.021489,0.021723,0.027182,0.039627,0.033337
