-0.010953,-0.014746,-0.018143,-0.011225,-0.012651,-0.016095,-0.015459,-0.013601,-0.015102,-0.012497,-0.011629,-0.012603,-0.014881,-0.018759,-0.020449,-0.018929,-0.018188,-0.013015,-0.016455,-0.014474,-0.013058,-0.012973,-0.016306,-0.014414,-0.01326,-0.01478,-0.011481,-0.011634
0.003655,-0.002915,-0.006406,-0.001812,-0.002416,-0.002314,-0.004851,-0.004631,-0.004427,-0.001417,-0.003675,-0.002165,0.002564,0.005638,-0.000505,-0.00131,0.000591,-0.003167,-0.007142,-0.006202,-0.006866,-0.002222,0.003976,0.001462,-0.000962,2.5e-05,-0.002104,-0.002297
0.000496,0.001785,0.003411,0.002039,6.1e-05,0.000141,0.000923,0.001214,0.002954,0.002309,0.00265,0.002542,0.003002,0.002771,0.002671,0.003622,0.004342,0.001798,0.002978,0.001408,0.001332,0.001891,0.00248,0.000997,0.000793,0.000777,0.000454,0.002548
-0.00439,0.002386,0.006579,0.001946,0.00107,0.001181,0.003764,0.003333,0.004585,0.00102,0.002887,0.001868,-0.002313,-0.005313,-0.001676,-0.000184,4e-04,0.002265,0.006527,0.005017,0.004975,0.001013,-0.003751,-0.003259,-0.000459,-0.001262,0.000494,0.002076
0.005948,0.007419,0.007797,0.00464,0.007674,0.009188,0.009233,0.007233,0.006054,0.004011,0.002503,0.004349,0.006171,0.009042,0.00599,0.004936,0.006949,0.003709,0.00561,0.007412,0.00481,0.003988,0.007417,0.006834,0.007119,0.008954,0.006735,0.004014
-0.001052,-0.004778,-0.007831,-0.003331,-0.002517,-0.004481,-0.003635,-0.003434,-0.006123,-0.003688,-0.004208,-0.003469,-0.002424,-0.002413,-0.006146,-0.005542,-0.00494,-0.006017,-0.007849,-0.004938,-0.005196,-0.004619,-0.002973,-0.001566,-0.002405,-0.00209,-0.001483,-0.003634
-0.008973,-0.012589,-0.013899,-0.006909,-0.009826,-0.011456,-0.012333,-0.010697,-0.010119,-0.005777,-0.004457,-0.006941,-0.010032,-0.013747,-0.011013,-0.009284,-0.011745,-0.006342,-0.010152,-0.011455,-0.007419,-0.007454,-0.011702,-0.010062,-0.010728,-0.013392,-0.009391,-0.006761
0.006417,0.006089,0.007318,0.004242,0.003936,0.007396,0.003284,0.003527,0.00699,0.006933,0.005862,0.005041,0.0079,0.010735,0.013802,0.011696,0.009397,0.009581,0.00816,0.004045,0.005062,0.007471,0.00998,0.007853,0.005354,0.005273,0.003128,0.005731
0.007083,0.011901,0.013033,0.00434,0.006476,0.007649,0.007955,0.008498,0.008785,0.00387,0.004077,0.00504,0.008051,0.010774,0.01258,0.009625,0.009134,0.007115,0.010369,0.009913,0.006927,0.007637,0.008992,0.008802,0.009026,0.010657,0.007021,0.005921
-0.006608,-0.003148,-0.002899,-0.003021,-0.002109,-0.004543,-0.001312,-0.001622,-0.004093,-0.00665,-0.004547,-0.004248,-0.009334,-0.01263,-0.01063,-0.010403,-0.009647,-0.006466,-0.004093,-0.000478,-0.001814,-0.005298,-0.011519,-0.008338,-0.004074,-0.004466,-0.003135,-0.005759
-0.000763,-0.004927,-0.005528,0.000543,0.000888,0.001348,0.00112,-0.001046,-0.002417,0.000267,-0.000692,0.000638,-0.001545,-0.002188,-0.004473,-0.003145,-0.001741,-0.003262,-0.004678,-0.002745,-0.001906,-0.002403,-0.000652,-0.001163,-0.000881,-0.001074,-0.000873,-0.002461
0.004387,-0.000421,-0.001622,0.001562,0.000346,0.000301,0.000521,0.000997,0.000708,0.004332,0.002484,0.003361,0.007513,0.009714,0.005418,0.006882,0.007171,0.001342,0.000532,-0.001073,0.000401,0.003256,0.009211,0.006243,0.002802,0.003382,0.002924,0.004085
-0.005072,-0.003506,-0.003308,-0.004345,-0.007309,-0.009566,-0.008467,-0.005758,-0.004824,-0.004362,-0.003396,-0.005621,-0.004588,-0.004971,-0.004805,-0.003884,-0.004866,-0.002319,-0.001678,-0.004727,-0.003525,-0.00308,-0.00633,-0.006936,-0.006677,-0.007287,-0.004076,-0.001164
-0.001397,0.002538,0.0036,-0.000723,-0.000498,0.000605,-0.001259,-0.001944,0.000253,-0.002362,-0.002121,-0.003594,-0.004224,-0.004373,-0.003565,-0.004998,-0.00383,0.000705,0.000332,-0.000323,-0.002382,-0.002762,-0.004452,-0.004372,-0.00255,-0.002346,-0.002229,-0.002076
0.005769,0.007536,0.007222,0.004118,0.007007,0.009051,0.008844,0.006092,0.006153,0.004075,0.003684,0.005336,0.00501,0.005142,0.004189,0.00326,0.005355,0.002393,0.002226,0.005925,0.003,0.00302,0.006203,0.007224,0.006639,0.007805,0.004107,0.001933
-0.002056,-0.003168,-0.003286,0.000561,0.000859,0.000306,0.002218,0.001511,-6.2e-05,0.001291,0.002292,0.003342,0.000147,-0.001909,-0.000219,0.001886,0.000622,-0.001081,-0.001081,0.001287,0.00322,0.001123,-0.001705,0.000661,0.000407,-0.000641,-0.00023,7.6e-05
-0.003179,-0.006519,-0.005581,-0.001224,-0.00221,-0.001784,-0.003406,-0.001914,-0.001727,9.3e-05,-0.000255,-0.000774,-0.000909,-0.001426,0.000451,0.001617,-0.001057,0.001977,0.001133,-0.002859,0.001538,0.000642,-0.000821,-0.001636,-0.002405,-0.003669,-0.001134,0.000348
0.003372,0.002313,0.001728,-0.000584,-0.000166,-0.000434,-0.002443,0.000191,0.000202,-0.000472,-0.001545,-0.002055,0.003372,0.00614,0.004412,0.002518,0.001861,0.002398,0.002751,-0.000522,-0.000282,0.001745,0.005899,0.003768,0.001931,0.003124,0.003015,0.002237
-0.000165,0.002812,0.00198,-0.001116,-0.001326,-0.003756,-0.002882,-0.002257,-0.003314,-0.004203,-0.00334,-0.004015,-0.003417,-0.001941,-0.001689,-0.003918,-0.003782,-0.004202,-0.003523,-0.000472,-0.004114,-0.003541,-0.005137,-0.003608,-0.001641,-0.000712,-0.001166,-0.00258
