1e-06,5e-06,1.4e-05,1e-05,4e-06,6e-06,7e-06,8e-06,9.1e-05,0.000152,0.000313,7.3e-05,0.00019,0.000109,1e-06,8.7e-05,0.000213,6.8e-05,1.9e-05,1.7e-05,0.000615,0.000977,0.000501,0.000256,0.001294,7.2e-05,0.000669,0.000793,0.000248,0.00099,2e-04,0.000306,6.2e-05,0.000215,0.000393,0.000187,0.000443,0.000515,1.4e-05,0.000809,0.000311,0.000112,0.000195,0.000623,0.000351,0.000214,0.000189,0.000299,1.5e-05,0.000426,0.000118,0.000542,3.4e-05,7.8e-05,0.000282,9.7e-05,6.2e-05,4.4e-05,2.6e-05,2.7e-05,6.1e-05,5.3e-05,2.7e-05,1.9e-05,0.000174,2.9e-05,5.4e-05,6.3e-05,2.3e-05,7.3e-05,1.9e-05,5.6e-05,7.5e-05,5.4e-05,5.9e-05,2.8e-05,3e-06,6.8e-05,6.1e-05,2.7e-05,4e-05,4.6e-05,3e-06,5.6e-05,1.2e-05,8e-06,1.9e-05,1e-06,1.7e-05,1.4e-05,7e-06,1e-05,1e-06,4.1e-05,1.2e-05,7e-06,1.8e-05,5e-06,5e-05,2e-06,1e-05,5e-06,2.4e-05,0,2.2e-05,4.9e-05,1e-06,0.000116,9.3e-05,6.5e-05,4.2e-05,1.1e-05,5.3e-05,5.8e-05,0.000122,5.8e-05,1.9e-05,0.000165,2.3e-05,4.9e-05,1.3e-05
1.7e-05,1.6e-05,2.2e-05,8e-06,3.3e-05,3.4e-05,1.5e-05,2.7e-05,0.000205,0.000349,0.000945,0.000703,0.000746,0.000584,0.000296,0.000205,0.000572,0.000128,0.00015,6.9e-05,0.001234,0.002702,0.002786,0.001807,0.00202,0.001679,0.002262,0.00289,0.001688,0.001633,0.001626,0.001301,0.00085,0.000793,0.001043,0.000755,0.000461,0.000429,0.000424,0.001352,0.000623,0.000998,0.00109,0.001208,0.001077,0.000233,0.000832,0.000194,0.000317,0.000878,0.000482,0.001333,0.000939,0.000714,0.000681,0.000452,0.000155,0.000145,0.000255,0.00014,0.000209,0.000165,2e-05,6.8e-05,0.000327,0.000157,0.000194,0.000152,2.5e-05,0.000144,3.6e-05,5.1e-05,2e-04,0.000135,0.000217,0.000129,8.7e-05,0.000111,0.000226,0.000177,0.000103,0.000188,9.5e-05,0.000138,0.000124,5.3e-05,4.2e-05,3.9e-05,5.5e-05,4.4e-05,3.3e-05,1.8e-05,1.8e-05,6.2e-05,5.4e-05,8.1e-05,9.9e-05,4.8e-05,0.000136,1.4e-05,1.9e-05,2.6e-05,4.6e-05,3.9e-05,1e-04,0.000143,9.7e-05,0.00019,0.000316,0.000255,0.000226,7.6e-05,0.00014,4.1e-05,0.000245,0.000367,9e-05,0.000375,9e-05,9.2e-05,0.000162
1.2e-05,2.5e-05,2.2e-05,1e-05,3.3e-05,3.2e-05,2.6e-05,2.6e-05,0.000212,0.000489,0.000861,0.00042,0.000289,0.000237,6.1e-05,0.000117,0.00028,0.000221,3e-05,5e-05,0.001184,0.003074,0.001776,0.000175,0.001212,0.001877,0.000842,0.000112,0.000833,0.00048,0.000115,0.001372,0.000728,0.000842,0.000148,0.000725,0.000699,8.6e-05,0.000525,0.000894,0.000481,0.000516,0.000363,0.000447,0.000539,0.000394,0.00115,0.001147,0.001004,0.000421,0.000731,0.000966,0.000943,0.000149,0.000644,0.000349,0.000487,6.2e-05,0.000379,0.000189,0.00033,7.4e-05,2.1e-05,6.8e-05,0.000475,0.000378,0.000157,0.000233,0.000176,0.000214,0.000105,0.000107,0.000165,0.000221,0.000313,0.000229,0.000135,8.4e-05,0.000391,0.000247,0.000233,0.000173,0.000224,0.000127,0.000232,0.00019,0.000117,9.1e-05,3.9e-05,5.7e-05,4.9e-05,6.8e-05,0.000129,6.4e-05,5.3e-05,7.4e-05,8e-05,3.6e-05,8.1e-05,9.7e-05,5.2e-05,5.3e-05,9.3e-05,4e-05,0.000132,4.2e-05,5.4e-05,0.000218,0.000565,0.000502,0.000185,0.000162,0.000115,0.000187,8.2e-05,0.000276,0.000222,0.000301,1.2e-05,9.4e-05,0.000286
4.1e-05,4.6e-05,3.9e-05,2.6e-05,3.6e-05,1.2e-05,1.8e-05,5.2e-05,0.000233,0.000759,0.000294,0.00027,0.000345,2.7e-05,9.6e-05,0.000151,0.000274,0.000194,2.3e-05,2.9e-05,0.001031,0.001556,0.001343,0.000469,0.0019,0.000388,0.000991,0.000864,0.000874,0.001062,0.000658,0.000834,0.000841,0.00076,0.001504,0.000839,0.001657,0.000942,0.000181,0.000833,0.001412,0.000806,0.000592,0.001071,0.000996,0.000545,0.001408,0.000915,0.001063,0.001031,0.000327,0.000218,0.000513,0.00105,0.001051,0.000627,0.000348,0.00029,0.000144,0.000301,0.000569,0.000406,0.000135,9.3e-05,0.000609,0.000804,0.000496,0.00026,0.00012,9.4e-05,0.000133,0.000305,0.000166,6.1e-05,0.000199,1.2e-05,0.000162,0.000254,0.000446,0.000305,0.000164,0.000148,0.000166,9.3e-05,9.1e-05,9.3e-05,5.4e-05,3.9e-05,4.6e-05,3.1e-05,6.1e-05,6.9e-05,0.000155,0.000152,5.1e-05,3.7e-05,2.4e-05,5.7e-05,9.3e-05,2.9e-05,4.6e-05,5.4e-05,0.000102,0.000111,0.000127,5e-05,4.3e-05,0.00023,0.000681,0.000416,0.000481,0.000286,0.000105,0.00024,0.000261,0.000257,0.000191,0.000769,0.000187,0.00013,0.000329
4.2e-05,2.8e-05,6e-06,1.4e-05,7e-06,2.7e-05,1.9e-05,3.4e-05,0.00032,0.00096,0.000582,0.000289,0.000144,0.000305,0.00021,0.000558,0.000293,0.000161,0.000134,6.4e-05,0.000868,0.000698,0.001104,0.000641,0.003168,0.001391,0.000729,0.001279,0.000428,0.000857,0.001152,0.000672,0.000572,0.001319,0.002286,0.001157,0.002756,0.002135,0.000777,0.000634,0.002093,0.001234,0.001302,0.00075,0.001146,7e-04,0.000363,0.00154,0.00106,0.001429,0.00095,0.000791,0.000408,0.000471,0.001175,0.000239,0.000334,0.000113,6.4e-05,0.000413,0.000843,0.000522,0.000447,0.000454,0.000774,0.000911,0.000238,0.000126,0.000156,0.000241,0.000168,0.000189,0.000112,0.000163,6.8e-05,0.000133,0.000258,0.000393,0.000346,0.000146,0.00012,0.000217,0.000226,0.000152,0.000191,0.000144,9.7e-05,7.1e-05,4.9e-05,6.4e-05,8.1e-05,0.000128,0.000229,2e-06,7e-05,7.6e-05,0.000111,3e-05,0.000162,3.4e-05,3.9e-05,3e-05,0.000156,0.000164,4e-05,3e-05,3.5e-05,0.000207,0.000468,0.000296,0.000121,0.000185,0.000106,0.000143,0.000812,0.000174,7.9e-05,0.00128,0.000605,0.000224,0.000418
8.3e-05,7.3e-05,3.8e-05,2.5e-05,1.3e-05,3.7e-05,8.6e-05,9.9e-05,0.000352,0.000754,0.000467,0.000705,0.000221,0.000294,0.000112,0.00063,0.00079,0.00021,3.8e-05,0.000107,0.000708,0.001816,0.001766,0.003514,0.00622,0.004959,0.001684,0.002187,0.001655,0.001078,0.001841,0.000326,0.001696,0.001154,0.0017,0.001562,0.001417,0.003379,0.002222,0.000204,0.001744,0.001874,0.000907,0.000503,7.4e-05,0.000252,0.000515,0.002398,0.000786,0.001982,0.002471,0.001861,0.001087,0.00093,0.00085,0.00155,0.001483,0.001081,0.000468,0.000213,0.00057,0.000407,0.000839,0.000478,0.000634,0.000222,0.000346,0.000161,0.000188,0.000124,0.000121,0.000249,0.000354,0.000375,0.000248,8.3e-05,0.000235,0.000524,0.000453,0.00038,0.000236,0.000263,0.000232,0.000209,0.000302,0.000261,0.000117,4.5e-05,4.8e-05,1.3e-05,6e-05,5.7e-05,0.000202,0.000209,0.000139,0.000152,9.7e-05,7.4e-05,0.000152,0.000128,5e-05,4.6e-05,0.000125,0.000108,7.2e-05,3.8e-05,3.6e-05,0.000223,0.000337,0.000203,0.000178,0.00032,0.000279,4.9e-05,0.001174,0.000805,0.000575,0.001418,0.000858,0.000349,0.000448
3.9e-05,5.2e-05,4.1e-05,2e-05,3.4e-05,3.8e-05,5.4e-05,8.6e-05,0.000155,0.000519,0.00068,0.000299,0.000288,0.000214,0.00062,0.00018,0.000918,2e-04,0.000106,0.000255,0.000452,0.001647,0.002377,0.002802,0.006397,0.001407,0.000636,0.002672,0.000946,0.001743,0.003553,0.002872,0.004669,0.001723,0.000511,0.000173,0.001148,0.001811,0.000587,0.000836,0.001674,0.004478,0.002085,0.000792,0.000468,0.000816,0.001103,0.001102,0.001526,0.001346,0.001477,0.000633,0.000941,0.001725,0.000611,0.001861,0.000986,0.000466,0.000565,0.00053,0.000753,0.000359,0.000661,0.000416,0.000522,0.000612,0.000666,0.000682,0.000645,0.000417,0.000213,0.000319,0.000223,1.5e-05,0.00016,7.6e-05,8.9e-05,0.000333,0.00027,7.9e-05,0.000166,0.000168,7.6e-05,0.000201,6.4e-05,0.000158,6.9e-05,4.6e-05,6.9e-05,4e-06,6.9e-05,0.000133,0.000206,6.7e-05,3.8e-05,6.5e-05,8.2e-05,5.3e-05,3.9e-05,0.000176,6.4e-05,4.4e-05,0.000105,0.000327,7.7e-05,6.8e-05,1.8e-05,0.000166,0.000996,0.000278,0.000301,0.000615,0.000158,0.000207,0.001181,0.001223,0.000249,0.001171,0.001605,0.000845,0.000587
1.9e-05,4e-05,2.2e-05,1.4e-05,3.9e-05,2.4e-05,5.2e-05,5.2e-05,0.000342,0.000445,0.001713,0.001422,0.000995,0.000765,0.000949,0.001092,0.000459,0.000669,0.000298,0.000252,0.000443,0.001236,0.002735,0.003025,0.010984,0.010647,0.004065,0.001393,0.001571,0.002113,0.003529,0.002338,0.004257,0.0018,0.00165,0.000831,0.00235,0.003547,0.002085,0.000569,0.002906,0.003173,0.002342,0.001051,0.001064,0.001115,0.000568,0.00213,0.002048,0.001728,0.002026,0.002738,0.001092,0.002954,0.003585,0.003932,0.001943,0.001159,0.000597,0.000207,0.000188,9.7e-05,0.000195,0.000493,0.000593,0.000276,0.000271,0.000574,0.000192,0.000143,0.000125,0.000102,0.000199,6.8e-05,0.000298,0.000167,7.4e-05,0.000401,0.000159,0.000145,7.2e-05,7.3e-05,0.000198,6.9e-05,4.3e-05,4.4e-05,4.1e-05,2.4e-05,0.00011,0.000139,7.9e-05,0.000225,6.5e-05,4e-05,4.2e-05,5.4e-05,8.8e-05,0.000113,6.9e-05,0.000224,0.000183,0.00012,2.5e-05,0.000339,0.000278,0.000203,0.000103,0.000197,0.00139,0.001038,0.000679,0.000458,0.000438,0.000443,0.000968,0.000806,0.000722,0.000907,0.00156,0.000798,0.000577
3.9e-05,1.6e-05,6.1e-05,6.6e-05,4.4e-05,5.3e-05,2.2e-05,3.8e-05,0.000527,0.001189,0.001832,0.000449,0.000414,0.000173,0.000382,0.000531,0.001239,0.001412,0.000437,0.000157,0.000521,0.001478,0.001623,0.000834,0.008888,0.010212,0.006745,0.002315,0.000616,0.000673,0.001935,0.000598,0.004314,0.005382,0.004894,0.002524,0.002402,0.006179,0.003809,0.001953,0.003021,0.005345,0.003465,0.001884,0.002254,0.001074,0.000477,0.003977,0.001904,0.001917,0.000182,0.000939,0.001666,0.002639,0.002377,0.000773,0.000977,6e-04,0.000547,0.000352,0.000292,0.000321,7.3e-05,0.000146,6.3e-05,0.000506,0.000657,0.000223,0.000268,0.00029,0.000182,9.4e-05,0.000151,0.000229,0.000159,0.000197,6.5e-05,0.000322,0.000263,9.5e-05,0.000156,6e-05,0.00018,0.000138,8.8e-05,8.9e-05,7.3e-05,4.8e-05,8.8e-05,8.1e-05,0.000134,0.000106,7.8e-05,3.9e-05,9.6e-05,7.5e-05,3.6e-05,2.5e-05,0.000146,0.000242,0.000107,5.4e-05,0.000137,0.000182,0.000267,8.7e-05,3.9e-05,0.000157,0.001117,0.000869,0.000204,0.000394,0.00036,0.00022,0.000159,0.000457,0.000202,0.000627,0.000833,0.000418,0.000306
1.3e-05,7e-06,5.4e-05,1.2e-05,2.2e-05,3.3e-05,4.3e-05,4.3e-05,0.000562,0.001395,0.000162,0.000934,0.000864,0.000746,0.00034,0.000552,0.001066,0.000444,0.00082,0.000722,0.000397,0.001076,0.000564,0.001424,0.005217,0.001396,0.002414,0.00225,0.001236,0.000919,0.00177,0.001724,0.003626,0.001671,0.001459,4.8e-05,0.002444,0.003943,0.001665,0.001173,0.001672,0.001496,0.001464,0.001833,0.000857,6.5e-05,0.000383,0.002872,0.002564,0.002937,0.002733,0.001475,0.00129,0.002527,0.001332,0.000363,0.001124,0.001269,0.000794,0.00027,0.000166,0.000223,0.00027,0.000175,0.000123,0.000468,0.000598,0.000426,0.000317,8.9e-05,3.8e-05,5.2e-05,9.3e-05,0.000189,0.000183,0.000111,8.7e-05,7.3e-05,0.000143,4e-06,0.000114,1.9e-05,0.000133,1.5e-05,6.1e-05,2.2e-05,4.5e-05,3.4e-05,1.8e-05,0.000118,6.2e-05,9.5e-05,3.8e-05,1.8e-05,4.4e-05,2.9e-05,3.8e-05,6.6e-05,0.000163,0.000126,5.2e-05,9.4e-05,4.7e-05,0.000145,9.8e-05,4.9e-05,1.7e-05,0.000154,0.000358,8.3e-05,0.000109,0.000184,3.7e-05,0.000446,0.000283,0.000163,0.000124,0.000611,0.000136,8.9e-05,0.00013
3e-06,2.8e-05,3.8e-05,4e-05,3.9e-05,9e-06,2.4e-05,5.1e-05,0.000538,0.002081,0.000994,0.000941,0.000608,0.000675,0.000492,0.001062,0.000361,0.000855,0.0012,0.000372,0.000287,0.000547,0.000369,0.00161,0.003185,0.003689,0.001261,0.00025,0.000533,0.000409,0.002075,0.000208,0.002846,0.003185,0.001796,0.00094,0.00272,0.000444,0.001527,0.001824,0.001662,0.001911,0.000826,0.001206,0.00097,4.8e-05,0.00079,0.000696,0.001645,0.000595,0.001259,0.000794,0.000656,0.001505,0.000653,0.000389,0.000775,8.6e-05,0.000147,0.000215,0.000222,0.00031,6.2e-05,0.00017,0.00017,0.000301,5.3e-05,0.000104,0.000137,0.000134,6.5e-05,4.5e-05,0.00018,7.1e-05,3e-06,8e-06,5.1e-05,0.000205,5.2e-05,4e-05,6.9e-05,6.9e-05,9.6e-05,7.5e-05,3.9e-05,2.2e-05,2.2e-05,2.3e-05,8e-06,6.3e-05,0.000128,4.8e-05,2.2e-05,1.5e-05,4.1e-05,3.1e-05,3.6e-05,4e-05,0.000135,0.000129,9.4e-05,7.7e-05,9.1e-05,9.7e-05,3.6e-05,4.5e-05,1.6e-05,0.000112,0.000437,0.000332,0.000302,0.000134,3.9e-05,0.000344,0.000841,0.000486,0.000195,0.000495,0.000202,0.000108,7.1e-05
1.7e-05,1.3e-05,2.3e-05,8e-06,1.9e-05,2.8e-05,2.1e-05,5.3e-05,0.000476,0.003377,0.002155,0.000398,0.000995,0.001639,0.001841,0.000259,0.00073,0.001656,0.001591,0.002168,0.000808,0.000188,0.000587,0.001401,0.002251,0.001783,0.001498,0.001379,0.000995,0.001163,0.002443,0.001578,0.002745,0.001874,0.001977,0.001156,0.001123,0.001424,0.000925,0.001417,0.002322,0.00101,0.002062,0.001277,0.000971,0.000443,0.000963,0.000932,0.000928,0.00034,0.000965,0.000747,0.001342,0.00043,0.001101,0.000754,0.000781,0.000272,0.000152,0.00015,0.000233,0.000237,0.000272,4.5e-05,8.7e-05,2.9e-05,7.8e-05,8.9e-05,0.000104,0.000102,3.1e-05,0.000129,0.000242,0.000204,4.1e-05,3.3e-05,2.8e-05,0.000183,1e-04,2.2e-05,9.7e-05,5.6e-05,9.6e-05,5.8e-05,4.6e-05,3.6e-05,3.1e-05,5e-05,6.3e-05,9.2e-05,6.3e-05,2.4e-05,1.9e-05,4.1e-05,2.8e-05,4e-05,2.9e-05,3.5e-05,0.000129,0.000116,5e-05,5.1e-05,8e-05,3.3e-05,3.1e-05,6.1e-05,2.3e-05,9.9e-05,0.000775,0.000464,0.000143,0.000157,0.000138,0.000173,0.000542,0.000306,0.000153,0.000452,0.000162,7.7e-05,0.000122
1e-05,1e-05,3.4e-05,1.6e-05,1e-05,1e-05,1.5e-05,2.5e-05,0.000554,0.003346,0.002,0.002018,0.001038,0.00073,0.000531,0.000778,0.000256,0.001037,0.000204,0.001314,0.001175,0.000457,0.000949,0.00231,0.00183,0.002652,0.001875,0.00046,0.000585,0.00103,0.002272,0.001092,0.000922,0.001231,0.002401,0.001633,0.00085,0.002059,0.000279,0.001725,0.002824,0.002974,0.001862,0.000713,0.000462,0.001162,0.000855,0.000353,0.000973,0.000968,0.001153,0.001623,0.002525,0.00112,0.000719,0.000501,0.000751,2.9e-05,0.000282,0.000276,0.000274,0.000199,0.000224,4.3e-05,6.3e-05,9.1e-05,6.1e-05,8.2e-05,0.000203,0.000153,3.5e-05,0.000141,0.000228,0.000225,4.6e-05,4.1e-05,7.9e-05,0.000194,0.000176,2.9e-05,0.000105,8.9e-05,9e-05,7e-05,5e-05,2.8e-05,1.5e-05,4.2e-05,4e-05,5.6e-05,7.6e-05,2.1e-05,3.8e-05,6.1e-05,6.1e-05,4.4e-05,1.5e-05,5.2e-05,8.7e-05,3e-05,4.7e-05,5.7e-05,0.000118,8.4e-05,1.9e-05,5e-05,6.2e-05,0.000175,0.000502,0.000177,0.000183,0.000245,0.000142,5.9e-05,0.00054,0.000171,0.000126,0.00029,2.3e-05,7.9e-05,5.2e-05
1.3e-05,2.8e-05,8e-06,1e-06,1.1e-05,2.6e-05,2e-05,2.4e-05,0.000573,0.002887,0.000864,0.000955,0.000163,0.000737,0.000121,0.000189,0.000375,0.000396,0.000236,0.000744,0.000344,0.000405,0.001594,0.000826,0.004279,0.00595,0.004801,0.003478,0.001997,0.0011,0.002668,0.000872,0.001293,0.004459,0.002401,0.001629,0.001809,0.000857,0.00252,0.000672,0.00121,0.000984,0.000496,0.002675,0.001234,0.000496,0.000156,0.001834,0.002462,0.002488,0.002533,0.000938,0.001011,0.00079,0.001111,0.001095,0.001267,0.000691,0.000235,0.000182,0.000532,0.000341,0.000473,4.6e-05,0.000129,0.000221,0.000187,8.8e-05,0.000237,0.00015,0.000146,0.000172,0.000282,0.000286,0.000192,8.6e-05,0.000164,0.000209,0.000181,9.2e-05,8.6e-05,0.000144,0.000168,0.000111,9.2e-05,5.6e-05,4.4e-05,4.1e-05,3.2e-05,0.000103,0.000109,6.7e-05,3.7e-05,7.2e-05,3.2e-05,2.8e-05,4.7e-05,5.9e-05,4.2e-05,6.4e-05,8.2e-05,7.4e-05,0.000151,2.9e-05,3.9e-05,5.1e-05,3.1e-05,0.000163,0.000156,0.000107,0.000243,5.2e-05,1.1e-05,7.7e-05,0.000482,0.000154,7.8e-05,0.000282,0.000104,8.3e-05,6.4e-05
1e-05,4e-05,2.7e-05,5e-06,1.1e-05,2.6e-05,4e-05,4.8e-05,0.000505,0.003208,0.003899,0.002396,0.000865,0.000483,0.001292,0.000737,0.000144,0.000169,0.000113,0.000323,0.000582,0.001441,0.002666,0.003819,0.004818,0.002236,0.006357,0.000945,0.001819,0.004757,0.004759,0.002838,0.001385,0.005059,0.001139,0.002361,0.004196,0.001179,0.001891,0.002799,0.00405,0.001887,0.001711,0.001617,0.00245,0.002244,0.000764,0.003145,0.000114,0.000629,0.005933,0.00343,0.001234,0.00043,0.001063,0.00096,0.000326,0.000332,0.000483,0.000538,0.00093,0.000575,0.000627,0.000305,9.3e-05,0.000552,0.000435,7.9e-05,9.8e-05,0.000442,0.00024,0.000385,3e-04,0.000332,0.000184,2.6e-05,0.00035,0.000326,5.3e-05,0.000121,0.000281,0.00018,0.000122,7e-05,8.2e-05,0.000156,9.3e-05,0.000138,7.6e-05,0.000239,9.7e-05,0.00011,0.000114,8.2e-05,7e-05,3.6e-05,2.9e-05,7.6e-05,7.7e-05,3.8e-05,9.4e-05,9e-06,0.000102,2.7e-05,2.2e-05,5.3e-05,5.3e-05,0.000189,0.000293,0.000175,0.000266,0.00022,0.000101,9.3e-05,0.000401,0.000163,5.9e-05,0.000307,0.000173,8e-05,5.2e-05
1.7e-05,5.8e-05,3.8e-05,2.7e-05,8e-06,9e-06,2.4e-05,8.4e-05,0.00047,0.002348,0.005246,0.001489,0.001112,0.001172,0.000981,0.000599,0.000352,0.000302,3.2e-05,0.000147,0.000764,0.0025,0.007053,0.001996,0.003528,0.003216,0.006571,0.009133,0.003174,0.007263,0.005317,0.001494,0.003867,0.006328,0.005803,0.003812,0.002515,0.004301,0.002489,0.005413,0.006634,0.006474,0.002724,0.002612,0.005295,0.005662,0.001216,0.002353,0.001706,0.000893,0.006054,0.004327,0.005797,0.003156,0.002125,0.002671,0.002206,0.00138,0.000694,0.000698,0.001645,0.001206,0.001725,0.001018,0.00052,0.001016,0.000332,0.000412,0.000492,0.000716,0.000422,0.000318,0.001328,0.000402,0.00031,8.7e-05,0.000514,0.000496,0.000203,0.000161,0.000193,0.000398,0.000302,0.000198,0.000129,1e-04,0.000206,8.4e-05,0.000164,0.000359,0.000311,7.8e-05,1.4e-05,0.000263,3.3e-05,0.000106,4.3e-05,0.000256,0.000101,5.3e-05,9.8e-05,0.00011,0.000205,0.000157,9.2e-05,6e-05,7.1e-05,0.000189,0.000267,0.000147,0.000128,0.000112,1.6e-05,0.000158,0.000431,9.9e-05,0.000128,0.000411,0.000133,0.000146,9.8e-05
2e-05,5e-05,3.1e-05,1.4e-05,1.6e-05,1.6e-05,2.1e-05,4.7e-05,0.000398,0.00201,0.004851,0.003934,0.002006,0.002504,0.00273,0.002051,0.001433,0.000466,0.000182,0.00011,0.000611,0.00432,0.005625,0.009913,0.007845,0.008466,0.005102,0.006101,0.002034,0.006969,0.01179,0.013278,0.011565,0.007157,0.001802,0.008353,0.01023,0.010736,0.010977,0.008884,0.005448,0.004895,0.008061,0.004155,0.005117,0.010538,0.008615,0.006584,0.005571,0.006289,0.007941,0.01015,0.012293,0.007452,0.001762,0.002355,0.004034,0.003113,0.000877,0.001424,0.001173,0.00064,0.002231,0.000986,0.001077,0.000889,0.001012,0.000792,0.000664,0.001014,0.001336,0.000919,0.001647,0.001965,0.00184,0.000945,0.000419,0.000983,0.001096,0.000528,0.000155,0.000568,0.000719,0.000589,0.000502,0.000321,0.000295,0.00029,0.000331,0.000564,0.000127,0.000391,0.000315,0.000472,0.000497,0.000309,0.000254,0.000466,0.000343,0.00025,0.00019,0.000275,0.000467,0.00051,0.000298,2.2e-05,0.000175,2e-04,0.000186,0.000199,0.000212,0.000205,0.000142,0.000159,0.000773,0.00052,0.00037,0.000229,6.8e-05,0.000151,7.9e-05
1.7e-05,3.7e-05,1.1e-05,5e-06,1.4e-05,1.2e-05,2.1e-05,6e-06,0.000409,0.00241,0.002555,0.000251,0.00268,0.00106,0.001167,0.002641,0.001191,0.000362,5.7e-05,0.00015,0.000403,0.004739,0.00901,0.008062,0.000959,0.004201,0.003437,0.00772,0.006862,0.002875,0.004973,0.00536,0.003489,0.004912,0.004152,0.00943,0.008855,0.002875,0.00908,0.004053,0.006314,0.005153,0.009216,0.011665,0.006226,0.008811,0.008455,0.002297,0.008874,0.006226,0.001012,0.004745,0.00379,0.007385,0.006622,0.005664,0.001659,0.000956,0.000676,0.001675,0.001219,0.000536,0.001985,0.001822,0.001446,0.000852,0.001446,0.000791,0.000719,0.000283,0.000719,0.000399,0.001694,0.000909,0.000966,0.00087,0.000601,0.000636,0.000557,0.000345,0.000213,0.000393,0.000291,0.000571,0.000199,7.6e-05,0.000123,0.000248,3.9e-05,0.000288,0.000396,0.000561,0.000142,0.000263,0.000418,0.000201,0.000166,0.000373,0.000245,6.2e-05,0.000352,0.000317,0.000157,0.000174,0.000207,0.000261,5.3e-05,0.000138,0.000454,0.000333,0.000154,0.000181,7.4e-05,0.000213,0.000891,0.000508,0.000137,0.00042,0.000256,3.1e-05,6.9e-05
2.1e-05,2.7e-05,1.7e-05,1.6e-05,1.8e-05,1.9e-05,2.4e-05,3.1e-05,0.000371,0.00155,0.002106,0.002012,0.003445,0.002358,0.001846,0.001874,0.001091,0.000433,0.000318,0.000136,0.000231,0.004004,0.003201,0.003685,0.000907,0.00338,0.003729,0.002965,0.007297,0.006024,0.001751,0.004303,0.003998,0.006342,0.009612,0.00369,0.003568,0.006017,0.002144,0.006776,0.004703,0.003251,0.003093,0.004335,0.008596,0.002677,0.005421,0.004958,0.004157,0.005154,0.005446,0.002962,0.002636,0.004942,0.001439,0.00334,0.001332,0.000351,0.000396,0.000841,0.00094,0.001497,0.002095,0.001723,0.000574,0.000957,0.000539,0.000165,0.000209,0.000291,0.000465,0.001005,6e-04,0.000499,0.000563,0.000171,0.000187,0.000391,0.000134,0.000236,0.000218,0.000306,0.000219,0.000305,0.000232,0.000187,0.000168,0.000169,8.5e-05,0.000169,0.000352,0.000149,0.000245,0.000142,0.000289,0.000176,5.8e-05,0.000271,0.000138,0.000103,0.000255,0.000213,0.000211,0.000218,0.000119,7.4e-05,0.000117,4.2e-05,0.000287,7.8e-05,0.000151,0.000107,0.000145,5.9e-05,0.000846,0.000566,0.00023,0.000407,0.000216,0.000124,0.000106
1.2e-05,1.5e-05,2.6e-05,2e-05,8e-06,2.5e-05,3.4e-05,3.3e-05,0.000281,0.000434,0.002318,0.001711,0.002437,0.003033,0.001543,0.001575,0.00065,0.000391,0.000129,0.000121,6e-05,0.002893,0.002571,0.002184,0.002066,0.003555,0.004477,0.003015,0.007323,0.004883,0.002832,0.00088,0.003777,0.003398,0.003072,0.002188,0.00175,0.003892,0.002382,0.004012,0.003155,0.001824,0.000703,0.002647,0.004159,0.003085,0.002436,0.002672,0.003554,0.006108,0.004379,0.003885,0.002266,0.002754,0.001243,0.003089,0.000915,0.000649,0.000392,0.000913,0.002004,0.002065,0.000825,0.000739,0.000461,0.000468,0.000717,0.000466,0.000324,0.000498,0.00034,0.000385,0.000389,0.000421,0.000272,6.3e-05,0.000408,0.000353,0.000286,8.1e-05,0.000226,0.000132,0.000216,0.000307,0.000263,2e-05,9.8e-05,0.000123,0.000138,0.000241,6.4e-05,0.000116,0.000116,8.7e-05,0.000137,7.9e-05,6.4e-05,9e-05,4.1e-05,8.5e-05,0.000181,8.5e-05,4.8e-05,9.7e-05,7.3e-05,8.7e-05,2.6e-05,2.4e-05,0.000154,2.3e-05,9.8e-05,3e-05,8.8e-05,0.000159,0.000805,0.000607,0.000197,0.000285,8.7e-05,0.000114,5.6e-05
1.3e-05,7e-06,1.5e-05,9e-06,1.2e-05,2.8e-05,2.5e-05,1.2e-05,0.000274,0.000374,0.002607,0.001542,0.001322,0.002045,0.000365,0.000786,0.000504,0.000122,0.000247,0.000201,0.000183,0.001363,0.00158,0.001133,0.001857,0.000696,0.003578,0.002677,0.001938,0.003484,0.000986,0.001869,0.003175,0.001433,0.001138,0.001934,0.002295,0.000616,0.001258,0.001577,0.001925,0.004535,0.003268,0.001676,0.002769,0.001901,0.001151,0.003188,0.003566,0.003592,0.001589,0.00224,0.001704,5e-05,0.00089,0.001654,0.001557,0.000311,0.000786,0.000341,0.001379,0.000578,0.000482,0.000514,0.000232,0.000512,3.6e-05,0.000535,0.000539,0.000533,0.00036,0.000327,0.000479,0.000117,0.000255,0.00013,0.000387,0.000156,9.9e-05,0.000199,6.5e-05,9.3e-05,0.000202,0.000117,6.4e-05,0.000104,5.7e-05,0.000179,9.8e-05,0.000119,0.000103,7.3e-05,3.7e-05,0.000177,0.000158,0.000158,0.000112,8.2e-05,5.7e-05,9.7e-05,1e-04,8.2e-05,4.2e-05,9.6e-05,4.8e-05,2.8e-05,5.1e-05,1.7e-05,0.000299,0.000151,0.000126,3e-05,8.6e-05,7.2e-05,0.000722,0.000363,0.000197,0.000249,6.3e-05,6.3e-05,2.3e-05
5e-06,8e-06,5e-06,1.3e-05,2e-05,6e-06,2.4e-05,4e-05,0.000305,0.000351,0.001856,0.000773,0.001549,0.000792,0.000984,0.000208,7.5e-05,0.000285,7.6e-05,0.000206,3.9e-05,0.000496,0.000783,0.001209,0.001561,0.00074,0.002456,0.000842,0.00122,0.000745,0.000179,0.001269,0.001889,0.001186,0.001642,0.001006,0.001391,0.001365,0.001166,0.001685,0.001543,0.001806,0.001115,0.00104,0.001242,0.00038,0.001018,0.002366,0.001325,0.001222,0.00188,0.001555,0.001211,0.000564,0.000722,0.000808,0.000467,0.000596,0.000797,0.000838,0.000441,0.000192,0.000238,0.000267,0.000568,0.000437,0.000352,0.000418,0.000257,0.000137,0.000176,0.000265,0.000278,0.000278,0.000175,8.7e-05,0.000309,0.000287,0.000149,3.3e-05,8e-05,0.000116,0.000106,0.000123,6.9e-05,2.9e-05,2.8e-05,0.000123,0.000124,0.000144,0.000125,4.4e-05,5e-05,6.1e-05,7.1e-05,8.2e-05,5.3e-05,5.2e-05,7e-05,9e-05,7.4e-05,9.3e-05,5.1e-05,8.4e-05,3.9e-05,5.2e-05,6.6e-05,7.8e-05,0.000244,7.5e-05,0.000109,6.9e-05,4.5e-05,0.000138,0.000409,8.8e-05,5.9e-05,0.00012,3.3e-05,2.5e-05,1.3e-05
6e-06,1e-06,2e-06,5e-06,2e-06,7e-06,6e-06,1.4e-05,0.000111,0.00026,0.000362,0.000213,0.000487,3.6e-05,0.000231,9e-05,3.4e-05,4.3e-05,6.9e-05,3.8e-05,2.7e-05,0.000287,0.00068,0.000981,0.000639,0.000421,0.001,0.000906,0.001167,0.001056,0.000293,0.000252,8.8e-05,0.001015,0.000222,0.000543,0.00041,0.000218,0.000195,0.001045,0.000712,0.000163,0.000502,0.000325,0.000856,0.000884,0.00042,0.000514,0.000525,0.000598,0.000469,0.000866,4e-04,0.000376,0.000327,9.8e-05,8.4e-05,0.000255,3e-05,0.000174,0.000252,8.6e-05,0.000158,1.8e-05,0.000181,6.5e-05,0.00011,4.7e-05,9.8e-05,4.2e-05,1.7e-05,5.3e-05,6.5e-05,0.000109,7.3e-05,1.6e-05,6.5e-05,8.5e-05,3.9e-05,1.4e-05,5e-05,5.7e-05,4.8e-05,2.7e-05,2.8e-05,2.8e-05,1.3e-05,3.5e-05,3.6e-05,5.1e-05,6.8e-05,4e-05,2.5e-05,3.2e-05,3.3e-05,5e-06,7e-06,2.4e-05,3.7e-05,1.7e-05,2e-05,1.6e-05,1.8e-05,2.3e-05,8e-06,1.4e-05,5e-06,2.8e-05,3.4e-05,5.7e-05,2.7e-05,2.5e-05,1.8e-05,4.8e-05,9.8e-05,3.5e-05,1.6e-05,2.9e-05,1.1e-05,2.3e-05,1.7e-05
3e-06,3e-06,4e-06,4e-06,8e-06,6e-06,5e-06,1.3e-05,9.3e-05,0.000132,0.000211,0.00015,0.000217,4.2e-05,0.000157,2.4e-05,4.9e-05,5.2e-05,3.1e-05,5.5e-05,4.7e-05,0.00031,0.000627,0.000119,0.000832,0.000573,0.001071,0.000337,0.000268,0.000605,0.000389,0.000507,0.000369,0.000191,0.000141,0.000428,0.000281,0.000419,0.00021,0.000546,0.000581,0.000839,0.00043,0.000475,0.000609,0.000353,0.000617,0.000424,0.000396,0.000173,0.00011,0.000697,0.000653,0.000333,0.00025,8.4e-05,7.1e-05,0.000189,0.000145,5e-05,0.000207,4.7e-05,0.000132,7e-05,0.00013,7.7e-05,6.8e-05,4.9e-05,6.1e-05,3e-05,1.5e-05,8.2e-05,0.000102,3.8e-05,3.9e-05,2.3e-05,4.8e-05,6.4e-05,2.1e-05,2.8e-05,3.2e-05,4.4e-05,1.8e-05,2.1e-05,2e-05,1.8e-05,1.6e-05,2e-05,1.1e-05,8.6e-05,3e-05,1.7e-05,2.1e-05,8e-06,1.1e-05,1.1e-05,1.6e-05,1.8e-05,1e-05,1e-05,1.6e-05,1.6e-05,6e-06,2.4e-05,8e-06,1e-06,7e-06,3.8e-05,5.5e-05,3.1e-05,2.7e-05,1.4e-05,4e-06,1.7e-05,6.5e-05,2.9e-05,1.1e-05,5.6e-05,2.9e-05,2.1e-05,9e-06
4e-06,6e-06,3e-06,3e-06,6e-06,4e-06,3e-06,3e-06,7.3e-05,7.6e-05,0.000289,0.000125,0.000213,0.000102,0.000107,5.2e-05,1.5e-05,3e-05,1.9e-05,3.3e-05,7.6e-05,0.000363,2.4e-05,0.000453,0.000455,0.000462,0.000778,0.000761,0.000657,0.000338,0.000393,5.2e-05,0.000415,0.00035,0.000498,0.000288,0.000429,0.000521,0.000292,0.000234,0.00039,0.000247,0.00031,0.000504,0.000517,0.000389,0.000615,0.00033,0.000459,0.000423,0.00057,0.000265,0.000498,0.000134,0.000161,0.000143,4.8e-05,0.000134,2.7e-05,3.1e-05,0.000136,5.5e-05,6.8e-05,3.9e-05,8e-05,6.5e-05,3e-05,2e-05,5.1e-05,2e-05,1.1e-05,8.4e-05,4.9e-05,4.6e-05,3.3e-05,1.5e-05,5e-05,4e-05,1.8e-05,1.6e-05,1.2e-05,1.4e-05,2.5e-05,2.3e-05,1.2e-05,6e-06,3e-06,1.6e-05,1.3e-05,9.5e-05,3.6e-05,2.1e-05,1.5e-05,1.1e-05,1.3e-05,6e-06,1.3e-05,1.6e-05,6e-06,1.8e-05,6e-06,1.2e-05,5e-06,1.6e-05,6e-06,8e-06,6e-06,3.7e-05,5.5e-05,4e-06,1.6e-05,1.7e-05,6e-06,2.6e-05,6e-05,3.1e-05,2.6e-05,5.6e-05,1e-05,1.5e-05,1.2e-05
4e-06,2e-06,4e-06,5e-06,1e-06,2e-06,2e-06,3e-06,6.1e-05,0.000147,0.000139,0.000211,0.000128,9.1e-05,7.7e-05,9.9e-05,2.5e-05,3.8e-05,6e-06,2e-05,5.2e-05,0.000422,0.000338,0.000756,0.000156,0.000513,0.000529,0.00045,0.000191,0.000664,0.00029,0.000341,0.000251,0.000744,0.000307,0.000336,0.000468,0.000406,0.000405,0.000784,0.000424,0.000221,0.000335,0.000127,4e-05,0.000612,0.000482,0.000325,9.4e-05,0.000299,0.000558,0.000221,0.000392,0.000397,0.000162,0.000118,4.2e-05,6.5e-05,5.5e-05,5.8e-05,0.000128,5.4e-05,5.1e-05,5.3e-05,8.6e-05,8e-05,4.6e-05,1e-05,2.7e-05,2.1e-05,1.9e-05,7.6e-05,4.1e-05,4.4e-05,2.6e-05,1.1e-05,3.9e-05,3.7e-05,1.5e-05,4e-06,1.4e-05,3.2e-05,3.7e-05,2.5e-05,4e-06,5e-06,1.1e-05,6e-06,1.5e-05,8.1e-05,5.8e-05,2.9e-05,1.5e-05,1.3e-05,7e-06,6e-06,8e-06,5e-06,1.2e-05,8e-06,1.7e-05,1.8e-05,6e-06,4e-06,9e-06,1e-05,6e-06,1.9e-05,1.8e-05,7e-06,1.3e-05,1.3e-05,5e-06,2.2e-05,8.3e-05,1.5e-05,1.4e-05,6.2e-05,1.6e-05,1e-05,1e-05
2e-06,3e-06,2e-06,4e-06,6e-06,3e-06,3e-06,7e-06,4.3e-05,0.000166,0.000158,8.8e-05,0.000126,9.3e-05,0.000114,5.3e-05,2.2e-05,5.5e-05,4.5e-05,2.6e-05,7.9e-05,0.00033,0.000425,0.000168,0.000386,0.000479,6e-04,0.000163,0.000287,0.000365,0.00059,5.5e-05,0.000561,0.000791,0.000273,0.000356,0.000374,0.000511,0.000255,0.000628,0.000289,0.000223,0.000172,0.000488,0.000499,0.000216,0.000549,0.000103,0.000257,0.00025,0.00028,0.000416,0.000341,0.000389,0.000104,0.000112,4.6e-05,7.2e-05,1.7e-05,6.4e-05,9.4e-05,5.5e-05,3.5e-05,2.1e-05,6.7e-05,9.4e-05,2.3e-05,1.8e-05,5.9e-05,3e-05,4e-06,5e-05,5.1e-05,4e-05,4.1e-05,6e-06,4e-05,3.7e-05,1.2e-05,5e-06,1.3e-05,2.3e-05,1.8e-05,1.4e-05,6e-06,6e-06,1.1e-05,7e-06,2e-06,5.7e-05,2.6e-05,2.8e-05,2.5e-05,1.2e-05,6e-06,7e-06,8e-06,7e-06,7e-06,6e-06,1.3e-05,1.9e-05,9e-06,1.2e-05,9e-06,3e-06,6e-06,2e-05,4e-05,1.2e-05,8e-06,1.8e-05,2e-06,9e-06,7.4e-05,7e-06,6e-06,5.6e-05,1e-05,1.2e-05,1.2e-05
1e-06,2e-06,1e-06,4e-06,4e-06,4e-06,5e-06,1e-05,4e-05,0.000165,0.000276,0.000143,6.8e-05,7.3e-05,7.6e-05,5.5e-05,3.3e-05,5.4e-05,2.9e-05,3.2e-05,4.5e-05,0.000308,3e-04,0.000307,0.000361,0.000511,0.000462,0.000324,0.000195,0.000225,0.000235,3.9e-05,0.000613,3.5e-05,0.000331,0.000213,0.000231,0.000565,0.000391,0.000384,0.00015,0.000212,0.000169,0.000406,0.000177,0.000298,0.000423,0.000286,8.8e-05,0.000139,0.000327,3.6e-05,0.000275,0.000328,0.000205,7.2e-05,9.7e-05,5.8e-05,4e-05,9.1e-05,0.000111,6.1e-05,6e-06,3.4e-05,5.9e-05,8e-05,2.3e-05,3.3e-05,6.7e-05,4e-06,4e-06,5.7e-05,1.5e-05,2.2e-05,4.1e-05,2e-05,2.8e-05,2.2e-05,2e-05,7e-06,1.8e-05,1.8e-05,1.1e-05,2.1e-05,1e-05,1.5e-05,5e-06,7e-06,1.2e-05,5.3e-05,5.6e-05,2.9e-05,1.2e-05,1.1e-05,2e-06,1.2e-05,8e-06,1.1e-05,1.5e-05,6e-06,8e-06,7e-06,6e-06,1.5e-05,2e-06,5e-06,9e-06,2.8e-05,2.5e-05,1.3e-05,1e-06,1.7e-05,1.2e-05,3e-06,6.7e-05,2.9e-05,2.3e-05,5.7e-05,5e-06,6e-06,1.7e-05
2e-06,3e-06,2e-06,0,3e-06,1e-06,5e-06,7e-06,2.7e-05,0.000184,0.000308,0.000128,3.7e-05,0.000184,2.3e-05,0.000116,0.00012,7.1e-05,3.2e-05,4e-05,8.1e-05,0.000254,0.000213,0.000595,4.6e-05,0.000518,0.000329,0.000104,0.000293,0.000377,0.000135,0.000295,0.000605,0.000497,0.000282,0.000393,0.00027,0.000149,0.000252,0.000104,0.000156,0.00036,0.000213,8.6e-05,0.000209,0.000305,0.000296,0.000128,0.000221,0.00014,0.00023,0.000218,0.000363,8.7e-05,3.6e-05,6.7e-05,4e-05,4.5e-05,1.2e-05,6.4e-05,7.5e-05,1e-04,3.3e-05,6e-06,4.2e-05,6.8e-05,1.5e-05,6.3e-05,4.9e-05,1.3e-05,2.7e-05,4.6e-05,4.1e-05,3.9e-05,2.3e-05,2.3e-05,1.6e-05,1.4e-05,1e-05,1e-05,1.5e-05,2.2e-05,1.3e-05,1.5e-05,5e-06,2.2e-05,2.7e-05,8e-06,1.6e-05,6.1e-05,6e-06,1e-06,2.7e-05,1.1e-05,3e-06,1.5e-05,6e-06,1e-05,6e-06,1e-05,6e-06,6e-06,4e-06,1.6e-05,1e-06,9e-06,5e-06,2.6e-05,4.1e-05,1.8e-05,1.7e-05,1.1e-05,4e-06,9e-06,7.3e-05,3.3e-05,1.8e-05,5.1e-05,9e-06,1.1e-05,1.9e-05
2e-06,4e-06,4e-06,0,3e-06,2e-06,5e-06,8e-06,2e-05,0.000129,9e-05,7.4e-05,0.000132,0.000186,0.000154,0.000133,0.000182,0.000101,0.000145,6.4e-05,0.000166,0.00028,0.000339,0.000483,0.000296,0.000319,9.9e-05,0.00031,0.000251,0.000137,0.000118,0.000164,0.000212,0.000403,0.000249,0.000345,0.000479,0.00056,0.000105,0.000403,0.000205,0.000271,0.000164,0.000182,0.000229,0.000206,0.000313,0.000328,9.8e-05,0.000111,0.00027,0.000369,0.000281,0.00018,0.000152,0.000171,9.1e-05,0.000116,0.000159,0.000114,8.2e-05,8.4e-05,5.1e-05,5e-06,8.7e-05,7.3e-05,1.2e-05,6.5e-05,7.1e-05,1.8e-05,2.9e-05,5.5e-05,4.4e-05,3e-05,3.8e-05,4.3e-05,6.1e-05,5.2e-05,6e-05,5.7e-05,4.6e-05,5.1e-05,1.4e-05,1e-05,8e-06,3.1e-05,2e-05,2.9e-05,2.1e-05,7.2e-05,5e-05,3.6e-05,3.5e-05,2.7e-05,1e-05,1.3e-05,2.1e-05,8e-06,5e-06,7e-06,1.3e-05,1.3e-05,2e-06,1.4e-05,2e-06,1.1e-05,1.2e-05,3.1e-05,6.7e-05,1.9e-05,1.9e-05,1.6e-05,1.4e-05,1e-05,8.1e-05,3.4e-05,2.7e-05,5.6e-05,6e-06,1.4e-05,1.1e-05
3e-06,3e-06,2e-06,3e-06,3e-06,1e-06,4e-06,6e-06,1.4e-05,0.000122,0.000137,8.5e-05,0.00027,0.000404,0.000448,0.000246,0.000152,0.000154,0.000114,9.5e-05,0.000159,0.000284,0.000116,0.000175,0.000246,0.00015,0.000204,8.5e-05,0.000176,0.000205,0.00017,8e-05,0.000292,0.000341,0.000149,0.000112,0.00025,0.000376,0.000154,0.000323,0.00031,1.2e-05,0.000267,0.000207,0.000333,0.00028,0.000192,6.7e-05,0.000131,0.000124,0.000215,0.000203,0.000202,0.000174,7.4e-05,3.2e-05,0.00014,8.1e-05,7.9e-05,0.000159,7.3e-05,6.7e-05,0.000115,0.000113,2.2e-05,7e-06,0.000109,3e-05,5.7e-05,7.7e-05,7.7e-05,3.6e-05,4.7e-05,3.9e-05,5.1e-05,5.8e-05,6.5e-05,6.5e-05,3.4e-05,3e-05,1.9e-05,3.3e-05,1.5e-05,1.4e-05,3e-05,1.2e-05,1.7e-05,3.5e-05,3.4e-05,6.1e-05,2.8e-05,2.4e-05,1.7e-05,1e-05,5e-06,5e-06,1.2e-05,6e-06,1.2e-05,1e-05,1e-05,1.5e-05,1e-05,7e-06,1.7e-05,4e-06,7e-06,2e-05,3.6e-05,2.3e-05,7e-06,1.5e-05,6e-06,6e-06,6.4e-05,2.2e-05,1.8e-05,5.3e-05,1.3e-05,9e-06,1.8e-05
2e-06,0,1e-06,3e-06,3e-06,6e-06,5e-06,8e-06,1.2e-05,0.000225,0.000287,8.6e-05,0.000143,0.000188,0.000107,0.000116,9.7e-05,0.000102,0.000227,9.4e-05,0.000148,7.1e-05,0.000321,0.000191,0.000205,0.000529,0.000156,0.000141,7.9e-05,0.00028,0.000242,0.000148,0.000297,0.000324,0.000242,0.00024,0.000123,7.3e-05,0.000298,7.2e-05,3.1e-05,0.000251,0.000116,0.000193,0.000119,0.000277,0.000111,0.000347,0.000254,4.9e-05,8.4e-05,0.000219,0.000322,1.9e-05,0.000103,3.5e-05,4.5e-05,0.000139,2e-04,6.4e-05,0.000128,8.5e-05,0.000117,0.000102,0.000105,7.5e-05,0.000101,9e-05,5.3e-05,0.000108,4.7e-05,7.9e-05,2.3e-05,2.4e-05,1.3e-05,3.3e-05,3.2e-05,4.9e-05,6.1e-05,4.8e-05,2.1e-05,3.4e-05,1.3e-05,2.4e-05,2.1e-05,3.3e-05,3.9e-05,6e-06,1.8e-05,7.4e-05,3.7e-05,5.5e-05,3.8e-05,2.9e-05,1.1e-05,1.3e-05,1.3e-05,2.4e-05,1.3e-05,1.2e-05,8e-06,1.9e-05,1.1e-05,5e-06,1.1e-05,1.2e-05,4e-06,2.8e-05,2.2e-05,1.6e-05,4e-06,2.9e-05,1.6e-05,1.5e-05,5.9e-05,2.1e-05,1.2e-05,4.9e-05,1.9e-05,9e-06,6e-06
3e-06,2e-06,3e-06,3e-06,2e-06,6e-06,4e-06,2e-06,2.2e-05,0.000184,0.000178,9.5e-05,5.9e-05,0.000102,0.000227,0.000106,2.2e-05,1.2e-05,0.000123,0.000122,0.000132,0.000182,0.000265,0.000423,0.000303,0.000465,0.000449,0.000105,9.6e-05,0.000188,0.000194,5.6e-05,0.000215,8.4e-05,0.000198,0.000272,0.000361,0.00062,0.000208,0.000194,0.000209,0.000411,0.000396,0.000276,0.000128,0.000184,0.00015,0.000435,0.000252,3.8e-05,0.00029,0.000123,0.000152,0.00023,0.000173,0.000165,6.7e-05,2e-04,0.000139,6.5e-05,0.000143,5.3e-05,9.2e-05,0.00016,3.5e-05,8.2e-05,9.2e-05,1.1e-05,3.9e-05,5e-05,3.5e-05,5.1e-05,1.8e-05,1.4e-05,3.8e-05,1.4e-05,9.4e-05,5.8e-05,3.8e-05,5.3e-05,4.6e-05,3.1e-05,1.7e-05,1.1e-05,1.4e-05,1.4e-05,1.9e-05,1.2e-05,5e-06,0.000102,3.4e-05,3.6e-05,3.4e-05,1.2e-05,9e-06,2.4e-05,2e-05,4e-06,4e-06,1.2e-05,1.3e-05,7e-06,9e-06,1e-05,8e-06,7e-06,4e-06,3e-05,7e-05,1.6e-05,1.5e-05,2.8e-05,1.8e-05,1.9e-05,4.5e-05,4.1e-05,2.2e-05,6.3e-05,9e-06,9e-06,1.9e-05
4e-06,4e-06,1e-06,1e-06,1e-06,5e-06,3e-06,6e-06,2.8e-05,0.000149,0.000259,0.000138,8.2e-05,4.7e-05,0.000167,3.2e-05,1.9e-05,3.5e-05,6.6e-05,8.1e-05,0.000119,5e-05,0.000244,0.00026,0.000233,0.000182,0.00023,0.000126,8.5e-05,0.000221,0.000211,0.000136,9.2e-05,0.000282,0.000128,0.000129,0.000374,0.000539,0.000158,0.000236,0.000246,0.000392,0.000121,0.000117,0.00027,0.000166,9e-05,0.000168,1.4e-05,8.5e-05,0.00023,0.000213,0.00027,0.000353,0.000184,0.000141,0.000126,0.000197,0.000136,0.000111,5.5e-05,4.7e-05,5.5e-05,4.9e-05,9.6e-05,5.7e-05,1.3e-05,3.9e-05,3.7e-05,3.1e-05,3.6e-05,6.4e-05,3e-05,3.5e-05,3.9e-05,4e-05,7.4e-05,3.1e-05,2.9e-05,4e-06,1.4e-05,5.4e-05,2e-05,3e-06,1.7e-05,3e-06,1.5e-05,1e-05,1.5e-05,0.00013,9.1e-05,3.4e-05,2.4e-05,2.7e-05,8e-06,1.5e-05,8e-06,5e-06,1.5e-05,1.7e-05,9e-06,2e-05,1e-06,8e-06,2.1e-05,1.9e-05,8e-06,2.4e-05,5.8e-05,4.8e-05,5.4e-05,2.3e-05,9e-06,1.7e-05,2.2e-05,5.3e-05,2.2e-05,5.6e-05,2.9e-05,2.4e-05,2.4e-05
1e-06,0,2e-06,1e-06,1e-06,1e-06,1e-06,5e-06,2.8e-05,0.000121,0.000201,0.000187,7.8e-05,2.3e-05,7.8e-05,7.1e-05,2.8e-05,7.4e-05,5e-06,0.000111,6.1e-05,0.00013,9.9e-05,9.1e-05,0.000214,0.000336,0.000229,6.3e-05,0.000121,0.000136,0.000298,1.6e-05,1e-04,0.000279,0.00017,0.000179,0.000275,0.000198,0.000263,7.8e-05,7.8e-05,0.000191,1e-04,0.000179,0.000261,0.00022,7.1e-05,0.000128,0.000139,9.1e-05,9.3e-05,0.000344,0.000287,0.000361,0.000215,0.000122,6.9e-05,7.2e-05,6.6e-05,6.7e-05,6.4e-05,2e-05,1.7e-05,2.5e-05,4e-05,1e-05,3.4e-05,1e-05,3.2e-05,1.5e-05,7e-06,6.3e-05,3.9e-05,2e-05,2.2e-05,3.2e-05,3.3e-05,1.6e-05,1.6e-05,9e-06,1.1e-05,3.3e-05,2.2e-05,1.9e-05,8e-06,2e-06,2e-06,1.2e-05,4e-06,0.000131,0.000108,4.1e-05,4e-06,6e-06,8e-06,9e-06,2e-06,6e-06,1.2e-05,9e-06,1.5e-05,7e-06,1.2e-05,2.2e-05,1.2e-05,7e-06,6e-06,2.3e-05,3e-05,1.5e-05,2.9e-05,1e-05,7e-06,2.2e-05,8.1e-05,1.1e-05,1.3e-05,6.2e-05,2.7e-05,2.2e-05,8e-06
2e-06,2e-06,3e-06,1e-06,3e-06,3e-06,2e-06,4e-06,2.3e-05,0.000111,0.000147,4.8e-05,0.000157,0.000205,3.3e-05,0.000303,0.000102,0.00013,8.9e-05,0.000172,0.000109,0.000186,0.00034,0.00045,0.000154,0.000178,0.000267,5.6e-05,0.000111,9.6e-05,0.000312,0.000136,4.9e-05,0.000226,0.000114,0.000177,6.4e-05,0.000299,0.000121,8.9e-05,2e-04,0.000595,0.000374,7.5e-05,0.00012,0.000156,7e-05,0.00024,0.000186,0.000166,4.2e-05,0.000105,0.000118,0.000271,0.000105,3.1e-05,0.000109,8e-05,6.5e-05,3.7e-05,3.5e-05,1.6e-05,2.6e-05,1.4e-05,4e-05,4e-05,3.6e-05,6e-06,2e-05,1.6e-05,4e-06,5.2e-05,3.2e-05,1.7e-05,1.5e-05,3.2e-05,2.8e-05,4e-06,2e-05,5e-06,6e-06,1.6e-05,1e-05,8e-06,7e-06,4e-06,3e-06,1.1e-05,6e-06,0.000129,8.3e-05,5.1e-05,1.8e-05,9e-06,9e-06,1.6e-05,8e-06,1e-05,4e-06,6e-06,1.4e-05,7e-06,7e-06,1.9e-05,3e-06,5e-06,6e-06,3e-05,3.3e-05,1e-05,1.1e-05,6e-06,9e-06,2.2e-05,9.7e-05,4e-05,2.3e-05,5.8e-05,3.1e-05,2.5e-05,6e-06
2e-06,2e-06,2e-06,1e-06,2e-06,1e-06,1e-06,7e-06,1.6e-05,0.000196,0.00027,0.000137,0.000288,0.00041,0.000285,0.000421,0.000246,0.000134,0.000111,0.000119,0.000209,0.000328,0.000234,0.000188,0.000126,0.000135,0.000179,2.6e-05,0.000142,0.000138,0.000335,2.3e-05,0.00012,0.000165,1e-04,9.2e-05,0.000243,0.000345,1.3e-05,0.000158,0.000167,0.000518,0.00018,7.1e-05,0.00014,0.000192,6.5e-05,0.000218,0.000232,0.000214,0.000231,3.7e-05,0.000233,7e-05,0.000118,0.000135,5.1e-05,0.000125,8.1e-05,8.9e-05,2.5e-05,6.3e-05,1.4e-05,4.1e-05,5.9e-05,7.6e-05,1.6e-05,1e-05,2.8e-05,2.9e-05,3.5e-05,2.8e-05,3.1e-05,2.9e-05,1.3e-05,1.3e-05,6.3e-05,1.9e-05,3.7e-05,3.3e-05,3.6e-05,2.3e-05,2.7e-05,1.9e-05,9e-06,6e-06,1.8e-05,2.1e-05,8e-06,0.000117,0.00011,5.4e-05,2.6e-05,6e-06,7e-06,1.5e-05,1.1e-05,1.4e-05,1.5e-05,1.2e-05,2.7e-05,2e-06,6e-06,9e-06,1e-05,7e-06,1.2e-05,2.9e-05,2.7e-05,1.4e-05,6e-06,2.6e-05,2.3e-05,2.1e-05,0.000118,0.000116,5.7e-05,6.1e-05,3.7e-05,1.9e-05,4e-06
1e-06,3e-06,2e-06,1e-06,1e-06,1e-06,2e-06,5e-06,2.3e-05,0.000229,0.000227,0.000252,0.000345,0.000182,0.000114,3e-04,0.000367,0.000273,0.00014,0.000108,0.000266,0.000232,8.4e-05,0.000113,0.000165,0.000144,0.000405,0.000209,0.000169,0.000155,0.000298,0.000157,0.000118,0.000122,0.000152,0.000153,0.000216,0.000133,0.000125,8.6e-05,3.4e-05,0.000185,0.000187,8.2e-05,0.000227,0.000215,2.8e-05,0.000209,5.5e-05,0.000144,0.000197,0.000268,0.000258,0.000138,0.000144,0.000192,7.9e-05,8.9e-05,0.000135,2.5e-05,6.1e-05,7.7e-05,0.000103,0.000121,3.8e-05,5.9e-05,7.7e-05,3.1e-05,5.1e-05,2e-05,2.7e-05,6.5e-05,5.4e-05,4.8e-05,3.1e-05,1.9e-05,4.9e-05,4.7e-05,5.6e-05,1.7e-05,2.3e-05,1.5e-05,3.1e-05,2e-06,1.2e-05,1.4e-05,2.7e-05,1.6e-05,1.1e-05,8.6e-05,6.8e-05,3.2e-05,2.7e-05,2e-05,6e-06,1.2e-05,1.5e-05,7e-06,9e-06,9e-06,2.1e-05,2e-05,7e-06,8e-06,1.2e-05,1.1e-05,1.7e-05,4e-05,2.1e-05,1.2e-05,3.1e-05,3.3e-05,9e-06,6e-06,0.000102,0.000153,7.5e-05,5.6e-05,2.5e-05,1.6e-05,2.4e-05
1e-06,2e-06,2e-06,1e-06,1e-06,3e-06,1e-06,3e-06,3e-05,0.000149,1e-04,0.000115,0.000139,0.000175,0.000136,0.000228,5.1e-05,3.2e-05,8.2e-05,4.1e-05,0.000222,0.000322,0.000277,0.000305,0.000494,0.000399,0.000275,0.000111,0.000106,0.000255,0.000287,1e-04,0.000124,0.000147,0.000172,0.000258,0.000276,0.000149,1.9e-05,9.7e-05,0.000187,0.000167,0.000174,2.5e-05,0.000196,0.00016,4.8e-05,4.5e-05,8.9e-05,8e-05,0.000119,0.000187,0.000145,0.000217,8.7e-05,9.1e-05,2.4e-05,6.4e-05,8.6e-05,6.4e-05,2.3e-05,4.1e-05,7.9e-05,8e-06,3.9e-05,3.4e-05,1.4e-05,9e-06,2.6e-05,1.7e-05,1.4e-05,2.7e-05,2.5e-05,3.3e-05,3.6e-05,1.8e-05,5.1e-05,3.9e-05,9e-06,1e-05,1.1e-05,1.8e-05,2.7e-05,2.8e-05,1.6e-05,1.6e-05,1.7e-05,1e-05,9e-06,6.4e-05,1.8e-05,1.2e-05,1.5e-05,1.1e-05,8e-06,1.1e-05,6e-06,4e-06,7e-06,6e-06,7e-06,5e-06,6e-06,1e-05,5e-06,1e-05,5e-06,3e-05,1e-05,1.3e-05,1.7e-05,2e-05,1.6e-05,1.1e-05,7.4e-05,9.1e-05,4.8e-05,6.2e-05,2e-06,1.7e-05,1.5e-05
2e-06,2e-06,2e-06,1e-06,1e-06,2e-06,1e-06,3e-06,3.5e-05,5.2e-05,0.000109,4.3e-05,0.000154,0.000107,4.1e-05,2.9e-05,7.7e-05,4.9e-05,3.4e-05,4.8e-05,0.000126,0.000176,0.000265,0.000387,0.00029,8.6e-05,0.000113,0.000164,3e-05,0.000284,2.9e-05,0.000151,8e-05,0.000129,6.1e-05,0.000147,0.00024,0.00022,6.7e-05,9.7e-05,0.000106,0.000201,8e-05,4e-05,0.000195,0.000137,5.3e-05,3.2e-05,0.000103,0.000126,0.00016,0.00013,0.000151,0.000183,9e-06,5.6e-05,2.9e-05,3.9e-05,1.8e-05,5e-06,3.9e-05,1.5e-05,5.7e-05,3.5e-05,5.8e-05,2.4e-05,2.7e-05,1.2e-05,2.8e-05,1e-05,1.3e-05,2.1e-05,4e-06,1.2e-05,1.9e-05,1.2e-05,3.4e-05,3.2e-05,5e-06,6e-06,1.3e-05,1.6e-05,6e-06,1.2e-05,3e-06,4e-06,1.1e-05,4e-06,3e-06,3.9e-05,1.2e-05,6e-06,6e-06,8e-06,2e-06,2e-06,7e-06,4e-06,6e-06,2e-06,7e-06,1e-06,2e-06,1.4e-05,1e-06,4e-06,4e-06,2.2e-05,2e-05,1.6e-05,2.3e-05,1.2e-05,9e-06,1.4e-05,3.5e-05,2e-05,9e-06,4.4e-05,3e-06,1.1e-05,6e-06
1e-06,1e-06,1e-06,1e-06,0,1e-06,0,2e-06,3.5e-05,3e-05,5.1e-05,4.9e-05,0.000119,2.8e-05,2.8e-05,2.9e-05,3.1e-05,4.1e-05,3.5e-05,2.3e-05,9.6e-05,0.00021,0.000138,0.00024,0.000189,0.000125,0.000203,9.8e-05,9.4e-05,0.000177,0.000111,9.3e-05,0.000134,0.000153,2.2e-05,0.000143,0.000109,0.000106,5.3e-05,9.3e-05,4.6e-05,0.000164,8.8e-05,2.3e-05,0.000164,0.000207,5.7e-05,3.8e-05,0.000153,8.8e-05,0.000137,0.00019,0.000255,0.000168,2.9e-05,6e-05,5e-06,2.2e-05,3.9e-05,9e-06,4.3e-05,1.6e-05,5.3e-05,2.5e-05,4.8e-05,2.2e-05,2.8e-05,6e-06,2.7e-05,5e-06,4e-06,2.9e-05,1.1e-05,1e-05,1.5e-05,1.3e-05,3.7e-05,3e-05,4e-06,8e-06,1.5e-05,1.4e-05,7e-06,8e-06,3e-06,3e-06,1e-05,5e-06,1e-06,3.3e-05,6e-06,3e-06,6e-06,7e-06,2e-06,2e-06,5e-06,1e-06,7e-06,3e-06,1e-05,4e-06,2e-06,1.2e-05,1e-06,1e-06,3e-06,2.2e-05,1.9e-05,1.4e-05,1.7e-05,1e-05,1e-06,1.2e-05,1.4e-05,5e-06,4e-06,4.2e-05,3e-06,5e-06,2e-06
2e-06,2e-06,2e-06,0,0,1e-06,1e-06,2e-06,3.3e-05,3.7e-05,9.6e-05,1.4e-05,0.000103,2e-05,3.5e-05,2.1e-05,2.6e-05,2.8e-05,2.6e-05,1.8e-05,8.3e-05,0.000206,0.000146,0.000282,7.7e-05,2e-05,0.000221,9e-05,5.5e-05,0.000184,0.000113,1.9e-05,9.4e-05,0.000213,4.2e-05,0.000181,0.000169,0.000195,7.9e-05,7.4e-05,9.5e-05,0.000216,9e-05,4.4e-05,0.000183,0.000176,6.3e-05,1.4e-05,0.000117,9.8e-05,8.6e-05,0.000125,0.000177,0.000203,2.5e-05,4.2e-05,2.7e-05,2e-05,3.8e-05,1.1e-05,5.1e-05,4e-06,4.6e-05,2.7e-05,4.9e-05,2e-05,2.6e-05,9e-06,2.5e-05,3e-06,5e-06,2.7e-05,1.1e-05,5e-06,2e-05,9e-06,3.6e-05,2.6e-05,7e-06,8e-06,1.4e-05,1.2e-05,5e-06,7e-06,4e-06,4e-06,8e-06,4e-06,1e-06,2.8e-05,6e-06,2e-06,7e-06,6e-06,0,2e-06,4e-06,2e-06,8e-06,4e-06,8e-06,4e-06,1e-06,1.2e-05,2e-06,3e-06,1e-06,2.3e-05,1.8e-05,1.1e-05,2.1e-05,7e-06,3e-06,1e-05,1e-06,2e-06,2e-06,3.8e-05,2e-06,6e-06,2e-06
