3.7e-05,3.4e-05,4e-05,3e-06,3.6e-05,2.2e-05,3.3e-05,8e-06,5.6e-05,7e-06,5e-05,4e-05,0.000115,0.000142,9.3e-05,9.5e-05,5.7e-05,0.000175,0.00011,8e-05,0.000219,0.00015,0.000216,0.000251,1e-04,0.000108,5.3e-05,4.1e-05,0.00017,5.3e-05,0.000306,0.000141,0.000194,8.7e-05,0.000149,0.000378,0.000338,0.000574,0.000409,0.00018,0.000318,0.000907,4.6e-05,0.001186,0.000468,0.000259,9.7e-05,0.000633,0.000174,0.000512,0.000155,3.8e-05,0.000105,0.000363,0.000209,0.000988,0.000477,5.4e-05,6.5e-05,0.000406,0.000484,0.001347,0.000127,0.000239,0.000199,0.000369,0.000245,0.000229,0.000834,0.000289,0.000174,0.00019,0.000496,0.000298,0.000637,0.000262,0.000947,0.000164,0.000793,0.000144,0.000642,0.000162,0.000328,0.000228,0.000565,0.001018,0.001474,0.00169,5.5e-05,0.00041,0.000465,0.000104,8.9e-05,0.000278,0.00038,0,2.6e-05,0.000492,0.000939,4.8e-05,9e-05,0.000964,0.000677,0.000512,0.000517,0.000593,1e-06,0.000277,0.000837,0.000803,0.00023,0.000528,0.000888,0.000422,0.000328,0.000621,0.000585,0.000512,0.000786,0.000415,0.000319
6.8e-05,0.000133,8.1e-05,0.000103,4.3e-05,8.7e-05,0.00011,2.9e-05,0.000119,8.5e-05,7.8e-05,0.000218,4.9e-05,0.00052,0.000395,0.000426,0.00022,0.000379,0.000167,0.000387,0.000542,0.00081,0.000547,0.000629,0.00026,0.000723,0.000299,5e-05,0.000461,0.000166,0.000637,0.000802,0.001051,0.000649,0.000999,0.000527,0.000543,0.000497,0.000656,0.000646,0.00046,0.00181,0.000813,0.00266,0.000886,0.000785,0.000715,0.001642,0.001366,0.001282,0.000464,0.000982,0.000631,0.000258,0.000335,0.002129,0.001599,0.001489,0.00077,0.001153,0.001867,0.003689,0.00023,0.000632,0.001115,0.000963,0.001426,0.000594,0.002359,0.000722,0.000999,0.001012,0.001501,0.000637,0.001167,0.000458,0.001989,0.000635,0.001175,0.001683,0.000478,0.000493,0.000321,0.000314,0.001945,0.001299,0.003351,0.003871,0.000771,0.001068,0.000867,0.000831,0.000368,0.000535,0.001394,0.000531,0.000403,0.001565,0.002663,0.000574,0.001267,0.002688,0.000598,0.001556,0.000443,0.001345,0.000543,0.00114,0.002477,0.0025,0.001252,0.001189,0.000989,0.001424,0.000607,0.001685,0.000779,0.0012,0.001836,0.000624,0.001337
8.7e-05,0.000167,0.000126,1.2e-05,4.5e-05,0.000126,0.000366,0.000288,8.2e-05,5.9e-05,6.2e-05,0.000255,0.000202,0.000573,0.000572,9.6e-05,0.000208,0.000114,0.000473,0.00049,0.000765,0.000547,0.000482,0.000325,8.9e-05,0.001101,0.000702,0.000404,0.000811,0.001026,0.001159,0.001067,0.00013,0.000475,0.000947,0.000586,0.000557,0.000567,0.001246,0.000719,0.00071,0.002959,0.001772,0.00048,0.002284,0.001911,0.000951,0.00111,0.002044,0.000968,0.000809,0.001215,0.001404,0.000726,0.000959,0.001751,0.001092,0.00124,0.000291,0.001266,0.001651,0.00229,0.001309,0.000744,0.000771,0.000602,0.000868,0.000729,0.001229,0.00044,0.002291,0.001351,0.001481,0.001002,0.000558,0.001044,0.001689,0.000831,0.000367,0.001643,0.001268,0.000517,0.001394,0.001272,0.001659,0.001605,0.002971,0.002527,0.002182,0.001878,0.001557,0.000865,0.000819,0.000903,0.001387,0.000198,0.00145,0.000624,0.001625,0.001387,0.002443,2e-04,0.00045,0.000518,0.000924,0.001317,0.001382,0.000755,0.001493,0.002249,0.001764,0.000294,0.001995,0.000789,0.001053,0.00255,0.002095,0.001489,0.001502,0.002712,0.00074
0.000193,8e-05,7.3e-05,5.3e-05,0.000116,0.000113,0.000321,0.000235,8.8e-05,0.000123,0.000151,0.000238,8.8e-05,0.000428,0.000189,0.000492,0.000229,0.000389,0.000636,0.000631,0.000389,0.000887,0.000658,0.000656,0.000131,0.001,0.000611,0.000146,0.000593,0.001085,0.000746,0.001011,0.000467,0.000859,0.000913,0.001225,9e-04,0.001057,0.001574,0.001368,0.001069,0.003572,0.002241,0.001397,0.001656,0.002063,0.002005,0.000998,0.002133,0.001657,0.001157,0.002026,0.001392,0.002938,0.001157,0.001245,0.000674,0.001497,0.002757,0.000635,0.000723,0.005396,0.002502,0.000565,0.001502,0.001518,0.000854,0.001166,0.001467,0.002136,0.002581,0.001333,0.001102,0.000612,0.000932,0.001255,0.001773,0.000549,0.001756,0.001525,0.001276,0.000894,0.001328,0.001823,0.003388,0.002388,0.001978,0.003665,0.0014,0.001431,0.001958,0.000825,0.001176,0.001637,0.001957,0.000253,0.001319,0.000471,0.002078,0.001696,0.001062,0.000648,0.001709,0.001068,0.000341,0.000796,0.00061,0.001007,0.001465,0.003222,0.000723,0.000235,0.00224,0.000411,0.002118,0.001165,0.001473,0.000943,0.000994,0.001706,0.000909
0.00026,0.000311,0.000261,0.000216,6.2e-05,3.2e-05,0.000203,0.000182,0.000196,0.00014,0.000204,0.000374,0.00035,7.2e-05,0.000388,0.000509,0.000431,0.000563,0.000244,0.000142,0.000354,0.00136,0.001787,0.002079,0.001427,0.001552,0.000724,0.000791,0.000455,0.000848,0.002303,0.001984,0.000315,0.00118,9.3e-05,0.001639,0.001501,0.001035,0.000678,0.00131,0.001467,0.005825,0.006501,0.004632,0.001766,0.003776,0.003022,0.001472,0.003569,0.003127,0.00288,0.004259,0.001894,0.002291,0.000464,0.000666,0.000726,0.001347,0.005367,0.003099,0.000845,0.005037,0.002871,0.002093,0.002428,0.000651,0.00427,0.001549,0.004152,0.002688,0.002178,0.002984,0.002742,0.000741,0.002825,0.000213,0.002586,0.003999,0.00026,0.001795,0.002579,7.2e-05,0.001669,0.002298,0.003245,0.004129,0.002668,0.00432,0.002247,0.002388,0.003613,0.00206,0.000831,0.001228,0.001383,0.001468,0.003323,0.003651,0.003195,0.000688,0.00179,0.001398,0.00157,0.001109,0.000848,0.002461,0.003933,0.002672,0.002189,0.003828,0.004285,0.001761,0.003365,0.001429,0.001044,0.000773,0.000284,0.003199,0.000432,0.002367,0.001583
0.000197,0.000332,0.000159,0.000189,0.000207,0.000178,0.000311,0.000358,0.000514,0.000293,0.00043,0.00038,0.000189,0.000476,0.000426,0.000258,0.000628,0.000222,0.000345,0.00037,0.000846,0.000746,0.000773,0.000547,0.001629,0.000486,0.000434,0.000934,0.001232,0.001442,0.002524,0.003839,0.003429,0.00232,0.003386,0.002784,0.001754,0.002969,0.002154,0.001631,0.002502,0.006859,0.006354,0.006554,0.007321,0.005324,0.006785,0.005673,0.002515,0.000984,0.005436,0.007564,0.004652,0.004273,0.000467,0.002185,0.002803,0.003103,0.004336,0.0046,0.004407,0.001432,0.0053,0.003263,0.004001,0.002047,0.007612,0.003952,0.006685,0.005113,0.003764,0.003814,0.004732,0.003254,0.004684,0.003096,0.004142,0.006975,0.005685,0.004908,0.004547,0.002021,0.005125,0.003082,0.003619,0.004868,0.00744,0.004726,0.005888,0.002322,0.002525,0.004916,0.004504,0.004335,0.003168,0.002211,0.004548,0.011316,0.007441,0.007844,0.007301,0.004055,0.001657,0.001814,0.001646,0.002601,0.008647,0.003158,0.003665,0.001784,0.005343,0.003323,0.005826,0.003508,0.003132,0.002505,0.000999,0.004301,0.003686,0.004616,0.003134
0.00024,4.1e-05,1e-04,8.2e-05,0.000201,9.1e-05,0.000352,0.000344,0.000276,0.00042,0.000427,0.000101,0.000154,0.000642,0.000472,0.000386,0.000728,0.000494,0.000449,0.000839,0.000354,0.000541,0.001225,0.001745,0.001685,0.001211,0.000548,0.001277,0.000773,0.002184,0.005099,0.003557,0.001114,0.001694,0.00544,0.002705,0.003692,0.00434,0.007771,0.004385,0.003039,0.003266,0.00095,0.001549,0.000985,0.005546,0.000427,0.002028,0.00731,0.003931,0.006208,0.003333,0.00151,0.006559,0.004545,0.001695,0.004429,0.002083,0.00471,0.005097,0.003773,0.004564,0.007006,0.004634,0.002489,0.002841,0.008746,0.003686,0.00763,0.001701,0.002396,0.003392,0.003109,0.001192,0.001766,0.004739,0.00303,0.007567,0.001441,0.005897,0.002379,0.001588,0.008506,0.005772,0.003735,0.004285,0.006509,0.003382,0.006158,0.004677,0.004513,0.003285,0.001963,0.003615,0.002185,0.004284,0.008917,0.008411,0.005982,0.008837,0.003848,0.004678,0.003222,0.00141,0.003653,0.002229,0.007303,0.006254,0.002219,0.00771,0.003138,0.005752,0.001723,0.003491,0.007625,0.004312,0.002037,0.004688,0.004213,0.00184,0.001584
7.4e-05,0.000154,0.000168,0.000112,0.000244,0.000318,0.000459,0.000303,0.000114,0.000604,5.1e-05,0.000384,0.000363,0.000863,0.000668,0.00031,0.000644,0.000386,0.000452,0.000778,0.001063,0.000739,0.000655,0.001634,0.000639,0.000191,0.00109,0.001879,0.003212,0.002629,0.003111,0.002695,0.00115,0.003817,0.003795,0.003066,0.006434,0.005374,0.010453,0.003403,0.002359,0.006875,0.006576,0.00623,0.003914,0.004214,0.0072,0.004289,0.00604,0.003354,0.002985,0.003979,0.008055,0.004474,0.004523,0.003648,0.008111,0.004305,0.001602,0.004372,0.011746,0.008553,0.010238,0.004138,0.002042,0.006666,0.004662,0.006833,0.006713,0.012319,0.011149,0.008496,0.011729,0.009858,0.003673,0.003746,0.004282,0.009203,0.012616,0.012335,0.012178,0.009301,0.014054,0.011934,0.010158,0.002885,0.009356,0.009153,0.011537,0.003131,0.006753,0.004722,0.003562,0.002254,0.005748,0.005565,0.004188,0.00929,0.007927,0.006426,0.012685,0.0154,0.005756,0.001864,0.006027,0.007017,0.009502,0.009288,0.005155,0.009355,0.015549,0.011307,0.005664,0.009323,0.011009,0.00777,0.007038,0.003266,0.005537,0.004181,0.007648
4.5e-05,0.000307,0.00025,0.000174,0.000114,0.000307,0.000147,0.000482,0.000468,0.000356,0.000851,0.000918,0.000646,0.000465,0.000721,0.001171,0.000953,0.00049,0.000497,0.000988,0.001035,0.001037,0.000833,0.001992,0.001233,0.001542,0.002409,0.000164,0.003448,0.001103,0.003102,0.001731,0.003419,0.002295,0.003716,0.001918,0.003286,0.006072,0.008022,0.008088,0.004492,0.003932,0.002518,0.004439,0.010507,0.007606,0.010248,0.012524,0.006047,0.003978,0.008867,0.010397,0.012516,0.013559,0.00594,0.006018,0.010265,0.00528,0.001911,0.003526,0.012095,0.014347,0.007617,0.00735,0.005852,0.007872,0.012166,0.009222,0.006689,0.01259,0.011506,0.012387,0.017259,0.016745,0.012469,0.006608,0.006723,0.01005,0.01511,0.011087,0.003756,0.006809,0.00654,0.004056,0.008401,0.014525,0.018304,0.010269,0.006156,0.005511,0.009472,0.012805,0.013296,0.0117,0.010536,0.003643,0.002592,0.007607,0.002216,0.006594,0.012263,0.015012,0.014107,0.006692,0.005327,0.007688,0.001837,0.00709,0.00307,0.005515,0.008686,0.005421,0.006621,0.011126,0.01402,0.007479,0.005931,0.004736,0.007336,0.005341,0.010661
0.000207,0.000231,0.00015,8e-05,0.000259,7.6e-05,0.000371,0.000424,0.000233,0.000513,0.000472,0.000369,0.000276,5.3e-05,0.000491,0.000706,0.000344,0.000319,0.000142,0.001195,0.000837,0.000496,0.000311,0.000908,0.000313,0.001259,0.001312,0.001976,0.001948,0.001357,0.001901,0.000723,0.002342,0.001668,0.002911,0.005603,0.003869,0.003536,0.003882,0.00235,0.001483,0.001316,0.002002,0.002659,0.006147,0.002221,0.005767,0.006054,0.004341,0.007681,0.006421,0.003349,0.003889,0.003594,0.002211,0.005681,0.004478,0.004767,0.00751,0.005818,0.007662,2.2e-05,0.004297,0.004404,0.003318,0.005357,0.005875,0.000659,0.003513,0.005837,0.004173,0.006687,0.005966,0.004625,0.002976,0.001951,0.002921,0.001821,0.006992,0.003104,0.004568,0.001891,0.005086,0.003175,0.004701,0.006465,0.003939,0.002546,0.002068,0.002323,0.004015,0.007444,0.003605,0.003095,0.001489,0.001516,0.001559,0.001392,0.001503,0.005533,0.002712,0.00501,0.003488,0.002178,0.004404,0.002838,0.001131,0.005902,0.004516,0.002251,0.006182,0.000143,0.005091,0.004926,0.003909,0.005777,0.001748,0.001559,0.004632,0.005631,0.006159
0.000185,9.7e-05,0.000102,0.000119,0.000146,0.000157,0.000449,0.000604,0.000711,0.000512,0.000617,0.000324,0.000262,0.000215,0.00035,0.00029,0.00036,0.000248,0.000249,0.000922,0.000503,0.000353,0.000156,0.000208,0.000316,0.000871,0.001554,0.001776,0.002217,0.0017,0.002399,0.00157,0.000172,0.001519,0.002075,0.002677,0.002478,0.00228,0.001677,0.003064,0.000279,0.001642,0.002258,0.001562,0.003153,0.002799,0.002851,0.002873,0.001143,0.004627,0.003047,0.00419,0.003031,0.000988,0.001595,0.002249,0.001388,0.001683,0.003481,0.0037,0.005053,0.003407,0.003805,0.002777,0.001422,0.002435,0.000946,0.001752,0.002298,0.000908,0.003328,0.005094,0.002303,0.003887,0.004122,0.001534,0.002126,0.004189,0.000674,0.004007,0.001712,0.001542,0.00013,0.000608,0.001689,0.003749,0.002239,0.003167,0.003498,0.00032,0.004469,0.002375,0.005345,0.005232,0.003195,0.002539,0.002106,0.002131,0.002962,0.002796,0.003769,0.000692,0.002168,0.000807,0.003686,0.005604,0.003768,0.001156,0.000632,0.00221,0.001473,0.001381,0.005249,0.002154,0.002232,0.002497,0.001882,0.000949,0.002681,0.001166,0.003115
7.3e-05,0.000108,5.7e-05,4.2e-05,7.8e-05,7.4e-05,0.000215,0.00037,0.000349,0.000113,0.000141,0.00022,6.5e-05,0.000295,0.000351,0.000457,9.8e-05,0.000133,0.000293,0.000355,0.000314,0.000362,0.000263,0.00028,0.000531,0.00056,0.00139,0.000271,0.000356,0.000116,0.001357,0.000442,0.000451,0.001394,0.000521,0.001383,0.000613,0.001039,0.001284,0.001276,0.001128,0.000748,0.000683,0.002134,0.002477,0.00238,0.003315,0.003119,0.00169,0.002634,0.002532,0.003676,0.001866,0.001069,0.001324,0.001147,0.001156,0.001477,0.002224,0.001709,0.001247,0.001309,0.003608,0.003896,0.001551,0.001583,0.002938,0.002197,0.001637,0.00173,0.000271,0.003362,0.001697,0.002067,0.002095,0.001533,0.001202,0.004137,0.002202,0.002444,0.000734,0.000811,0.001588,0.000609,0.001714,0.001919,0.00165,0.001392,0.001529,0.001701,0.002902,0.002197,0.001342,0.001619,0.001951,0.001093,0.001494,0.002444,0.000885,0.001341,0.004349,0.001332,0.000183,0.000404,0.001904,0.001665,0.000957,0.001992,0.00286,0.001981,0.001682,0.001387,0.002842,0.00057,0.001005,0.001756,0.000734,0.001661,0.002255,0.000766,0.000302
6.8e-05,9.4e-05,8e-06,7.8e-05,3.5e-05,4.5e-05,0.000116,0.000146,0.00023,0.000115,0.000115,0.000143,0.000111,0.000175,6.8e-05,0.000282,0.000135,9.3e-05,0.000149,0.000213,4.7e-05,0.000139,9.2e-05,0.000202,0.000462,0.001022,0.000477,0.000431,0.001007,0.000817,0.000794,0.001176,0.000686,0.000685,0.000792,0.000711,0.001432,0.000374,0.00201,0.001128,0.000663,0.00108,0.00137,0.002062,0.000666,0.001843,0.000777,0.000535,0.001867,0.003077,0.001041,0.00081,0.001493,0.001646,0.000898,0.00118,0.000754,0.000844,0.001256,0.001815,0.001749,0.000876,0.002049,0.001065,0.000584,0.001881,0.002212,0.00064,0.002171,0.001413,0.001422,0.002348,0.002291,0.001634,0.000493,0.000867,0.001967,0.002302,0.001687,0.000398,0.001312,0.000983,0.000587,0.00017,0.00197,0.001219,0.000327,0.000514,1e-04,0.000258,0.000712,0.000387,0.00127,0.001951,0.000499,0.001107,0.001519,0.000962,0.001197,0.000448,0.002614,0.001597,0.000737,0.000545,0.000766,0.001628,0.00058,0.002043,0.001664,0.000402,0.001498,0.001158,0.002548,0.001027,0.001365,0.000472,0.001347,0.002559,0.001603,0.000752,0.000976
6.4e-05,3.7e-05,5.5e-05,4.5e-05,8.8e-05,7.1e-05,0.000108,9.5e-05,0.00021,0.000127,0.000181,2.6e-05,0.000114,0.000146,0.000192,0.000259,0.000135,7.3e-05,7.7e-05,5.5e-05,6.3e-05,9.1e-05,0.000235,9.3e-05,0.000248,0.000463,0.000874,0.00051,0.000312,0.000685,0.000451,0.000434,0.001138,0.001726,0.002575,0.000629,0.001466,0.000725,0.001812,0.002349,0.000836,0.001512,0.001341,0.001555,0.002018,0.00163,0.002185,0.002703,0.000452,0.002099,0.001876,0.00084,0.00088,0.001545,0.001238,0.00167,0.002122,0.002306,0.001528,0.002766,0.002498,0.001161,0.000153,0.001567,0.000575,0.002017,0.001569,0.001134,0.001293,0.001352,0.001807,0.001649,0.002031,0.001477,0.000627,0.000448,0.001009,0.003651,0.002905,0.000884,0.001593,0.001233,0.000521,0.000445,0.00058,0.001102,0.00069,0.001736,0.001429,0.000575,0.001101,0.000387,0.000924,0.00134,0.001098,0.00172,0.00172,0.000311,0.00065,0.001251,0.001003,0.000865,0.000318,0.00081,0.000681,0.001294,0.00084,0.001327,0.001248,0.00063,0.001001,0.000756,0.002123,0.001745,0.000593,0.001577,0.001875,0.001078,0.002259,0.001604,0.000853
8.5e-05,0.000158,0.000113,6.2e-05,0.000112,0.00018,6.9e-05,5.8e-05,0.000328,0.000135,0.000171,9.3e-05,0.000201,1.4e-05,0.000191,0.000344,0.000137,8e-05,9.5e-05,0.000204,0.000196,3.3e-05,0.000185,0.000351,0.000248,0.000495,0.000781,5.8e-05,0.000736,0.000555,0.000505,0.001674,0.00068,0.002911,0.003245,0.003592,0.001923,0.002315,0.002818,0.001096,0.002074,0.001384,0.002647,0.002063,0.002215,0.002411,0.003257,0.005184,0.001943,0.001742,0.000462,0.000926,0.002122,0.002199,0.001549,0.001068,0.001128,0.002806,0.000499,0.00178,0.001939,0.000457,0.002318,0.002306,0.002353,0.003234,0.000569,0.001428,0.002016,0.000495,0.001545,0.001683,0.001393,0.000563,0.001342,0.002284,0.001592,0.002471,0.000604,0.001569,0.002036,0.002192,0.000982,0.001336,0.001269,0.00048,0.001041,0.000785,0.000896,0.000463,0.000684,0.000789,0.003259,0.001717,0.002915,0.002109,0.001076,0.001217,0.001072,0.00394,0.004305,0.000808,0.000608,0.001446,0.001119,0.002934,0.00232,0.003451,0.003305,0.001553,0.001644,0.00113,0.002256,0.003126,0.001708,0.000814,0.002332,0.003331,0.002614,0.001741,0.002679
6.2e-05,6.8e-05,4.1e-05,9.9e-05,0.000249,0.000103,9.1e-05,0.000195,0.000247,0.000127,0.000318,2e-04,6.1e-05,9.6e-05,0.000235,0.000129,0.000183,0.000161,0.000221,0.000291,8.2e-05,5.7e-05,0.000151,0.000298,0.000364,0.001178,0.000368,0.000598,0.000735,0.001438,0.000432,0.001811,0.002192,0.002716,0.002602,0.005324,0.005015,0.00291,0.00122,0.002063,0.002748,0.002143,0.001297,0.005338,0.002348,0.003927,0.002376,0.00258,0.005001,0.003663,0.001942,0.002092,0.00107,0.000717,0.001655,0.00169,0.002315,0.004796,0.003756,0.003723,0.004813,0.003007,0.003728,0.003193,0.004029,0.000718,0.00063,0.002284,0.000423,0.002019,0.000107,0.001219,0.001133,0.002121,0.002703,0.002335,0.001347,0.00136,0.001437,0.002213,0.000934,0.001237,0.000419,0.001866,0.003447,0.004075,0.002416,0.001488,0.001335,0.001622,0.001077,0.002012,0.005025,0.003092,0.002331,0.004131,0.004302,0.003579,0.001523,0.005662,0.001418,0.001205,0.001031,0.002949,0.00215,0.004333,0.005514,0.003168,0.000586,0.001014,0.000517,0.001911,0.00133,0.003908,0.002905,0.003971,0.002777,0.003534,0.001693,0.000734,0.002359
7.9e-05,4.1e-05,6.4e-05,0.000137,0.000323,0.000185,1.6e-05,0.000331,0.000476,0.000287,0.000414,0.00023,0.000186,0.000144,7.1e-05,0.000189,0.000147,0.000156,0.000287,0.000125,0.00016,5.4e-05,0.000209,0.000174,0.000369,0.001551,0.001405,0.00116,0.002102,0.001563,0.001143,0.001284,0.001324,0.00079,0.003784,0.001726,0.002783,0.001783,0.003334,0.00394,0.004053,0.002539,0.001369,0.006277,0.004892,0.004333,0.005773,0.00281,0.004868,0.001666,0.00189,0.004531,0.00327,0.001181,0.001656,0.001692,0.001118,0.001762,0.00025,0.00246,0.002252,0.000355,0.001625,0.003865,0.003415,0.003845,0.001353,0.00323,0.002941,0.002277,0.002923,0.003087,0.000558,0.000527,0.003385,0.004254,0.005669,0.004749,0.003922,0.005066,0.002611,0.002304,0.003539,0.002393,0.001352,0.003815,0.001526,0.000645,0.001629,0.002514,0.003723,0.005415,0.001051,0.001955,0.001556,0.003526,0.004381,0.001659,0.002167,0.002022,0.00035,0.000379,0.000594,0.001838,0.001531,0.001793,0.00272,0.001317,0.00043,0.001925,0.003332,0.00085,0.002651,0.001504,0.00024,0.003426,0.004213,0.002624,0.001369,0.001436,0.003886
2.8e-05,5.3e-05,0.000119,0.000215,1.7e-05,0.000199,0.000112,0.000374,0.000266,7.1e-05,0.000281,0.000115,0.000135,0.000233,7.2e-05,0.000301,5.8e-05,0.000326,5.3e-05,0.000156,0.000174,0.000242,6.1e-05,0.000208,3.3e-05,0.001035,0.00051,0.000246,0.002295,0.001448,0.000971,0.001287,0.001666,0.00345,0.00337,0.005138,0.000657,0.002326,0.003168,0.001025,0.001531,0.000539,0.00306,0.003866,0.001372,0.0035,0.001212,0.000997,0.001807,0.002385,0.002107,0.001619,0.001561,0.00148,0.001467,0.00475,0.002186,0.002547,0.002357,0.002656,0.002995,0.000557,0.000689,0.003185,0.00179,0.002839,0.003372,0.001791,0.003588,0.00561,0.001523,0.002375,0.003766,0.002498,0.004275,0.001475,0.003874,0.002528,0.001551,0.001685,0.001131,0.003778,0.005846,0.00324,0.002697,0.001741,0.000866,0.001577,0.000745,0.001907,0.001131,0.004334,0.002896,0.001871,0.001448,0.001129,0.000685,0.002152,0.002555,0.001643,0.00174,8.1e-05,0.001156,0.001246,0.001112,0.00058,0.004068,0.001714,0.001127,0.002794,0.001503,0.001644,0.001955,0.003187,0.00096,0.002778,0.001789,0.002763,0.002461,0.001035,0.002692
0.000378,0.000194,0.000115,0.000121,0.000301,0.000348,0.000144,0.000453,0.000116,0.000244,0.000195,0.000354,8.3e-05,0.000313,0.000387,0.000277,0.000188,0.000556,0.00042,0.000345,0.000551,0.000446,0.000372,0.000513,0.000647,0.000665,0.001908,0.001516,0.001749,0.002181,0.001444,0.001103,0.000875,0.004094,0.001919,0.003916,0.002872,0.004185,0.0019,0.002806,0.002959,0.004103,0.004152,0.002774,0.002689,0.004476,0.00274,0.004017,0.001148,0.003324,0.002294,0.001733,0.003943,0.003952,0.002078,0.005953,0.005035,0.003767,0.003943,0.002354,0.001251,0.002087,0.00189,0.005183,0.003231,0.004869,0.002279,0.001791,0.004376,0.001769,0.001949,0.003415,0.000372,0.001121,0.002984,0.001855,0.003292,0.002784,0.00146,0.000701,0.000657,0.003444,0.001246,0.000599,0.003753,0.004184,0.001658,0.002966,0.002018,0.000918,0.001636,0.001572,0.001584,0.000234,0.001609,0.002548,0.003446,0.002706,0.001754,0.002659,0.001985,0.001282,0.00174,0.002327,0.001926,0.000393,0.002927,0.001419,0.001234,0.001917,0.001141,0.000742,0.002882,0.001338,0.001446,0.002919,0.003959,0.001425,0.003348,0.00324,0.000489
0.000439,0.000216,0.000115,0.000121,0.000409,0.000244,0.000423,0.000896,0.000749,0.000672,0.000536,0.000338,0.000291,0.000413,0.000652,0.000617,0.000339,0.000374,0.000282,0.000508,0.00071,0.000288,0.00031,0.00037,0.000603,0.00122,0.002063,0.001715,0.002552,0.001275,0.001349,0.002116,0.00084,0.002753,0.000789,0.001621,0.00124,0.0056,0.005505,0.006521,0.002922,0.005135,0.004228,0.00272,0.002089,0.00322,0.003688,0.002399,0.002822,0.00291,0.001718,0.000883,0.003606,0.004181,0.003093,0.006153,0.006048,0.006131,0.004609,0.004741,0.003899,0.003751,0.001628,0.004041,0.003202,0.002968,0.002714,0.002809,0.002272,0.001849,0.002724,0.002781,0.002502,0.00141,0.001519,0.002894,0.000329,0.002472,0.001781,0.000295,0.001622,0.004663,0.003706,0.00073,0.002975,0.001846,0.002784,0.001387,0.004751,0.003423,0.001299,0.00136,0.00194,0.002064,0.003125,0.0044,0.003019,0.002388,0.000325,0.001639,0.001803,0.001248,0.001398,0.002394,0.00067,0.001439,0.002011,0.001375,0.00108,0.001581,0.000383,0.000939,0.004032,0.005241,0.002408,0.001878,0.001844,0.003445,0.004546,0.002412,0.000802
0.000168,0.000117,0.000151,0.000234,0.000321,0.00024,0.000607,0.000558,0.000191,0.000456,0.000191,6.8e-05,0.000173,0.000158,0.000262,8.8e-05,0.00012,0.000248,0.000126,0.000601,0.000208,5.4e-05,0.000162,0.00045,0.000562,0.000427,0.000985,0.000377,0.001226,0.00166,0.001252,0.000445,0.001038,0.000831,0.002114,0.001928,0.002059,0.00428,0.000827,0.003719,0.005517,0.00168,0.001854,0.000957,0.0013,0.001333,0.001303,0.002626,0.002406,0.001901,0.000561,0.000766,0.002396,0.002632,0.003525,0.001247,0.002185,0.003901,0.001036,0.001932,0.000229,0.001422,0.001194,0.001859,0.002966,0.00302,0.002562,0.000264,0.001344,0.002559,0.001261,0.002221,0.00084,0.000324,0.001196,0.002771,0.003596,0.001703,0.003038,0.002033,0.002565,0.003935,0.000575,0.000483,0.001479,0.001176,0.002945,0.00388,0.003028,0.001723,0.002027,0.000515,0.001039,0.001299,0.002733,0.001821,0.000553,0.002469,0.001594,0.001133,0.001288,0.001235,0.00083,0.002083,0.002731,0.002846,0.001739,0.000667,0.000883,0.001027,0.001012,0.000948,0.00315,0.001556,0.001455,0.00094,0.000981,0.003703,0.001229,0.001129,0.001787
5.4e-05,6.8e-05,8.2e-05,0.000136,5.5e-05,8.7e-05,0.000405,0.000112,0.00023,0.00015,7.2e-05,6.8e-05,0.000167,0.000169,9e-05,6.7e-05,0.000126,0.000119,0.000105,0.000393,0.000187,3.4e-05,6.6e-05,0.000277,0.000609,0.000474,0.000226,0.000523,0.000588,0.000954,0.000588,0.000453,0.000519,0.00054,0.00203,0.002106,0.000657,0.000869,0.002099,0.001245,0.001515,0.000618,0.001062,0.000219,0.000988,0.001877,0.000939,0.000704,0.00048,0.000474,0.000344,0.000801,0.000879,0.001763,0.001296,0.001516,0.001209,0.001353,0.001164,0.000509,0.000642,0.000918,0.001046,0.001954,0.001493,0.000865,0.001299,0.0021,0.001402,0.000744,0.000975,0.001534,0.001939,0.001707,0.001177,0.001618,0.002015,0.001032,0.001494,0.001287,0.002169,0.00037,0.0017,3e-04,0.000824,0.000219,0.001703,0.002016,0.001819,0.00219,0.002575,0.001681,0.001108,0.001871,0.000689,0.001848,0.001996,0.002633,0.001884,0.00159,0.001654,0.000744,0.000664,0.000862,0.00167,0.00093,0.001546,0.002061,0.002573,0.001832,0.000524,0.000569,0.002498,0.001952,0.00175,0.000825,0.00073,0.002308,0.001899,0.001751,0.001777
3.7e-05,1.9e-05,3e-05,6e-05,1.4e-05,3.7e-05,0.000121,5.1e-05,6.5e-05,5.1e-05,1.1e-05,3.8e-05,9e-06,4e-05,4.5e-05,1.3e-05,3e-06,3e-05,1.5e-05,8.7e-05,5.1e-05,6.6e-05,3.7e-05,8.9e-05,0.000169,0.000151,0.000133,0.000188,0.000103,0.000281,0.000251,1e-04,8.3e-05,0.000274,0.000409,0.000483,0.000637,0.000595,0.000739,0.000312,0.000616,0.000499,0.000772,0.000277,0.000223,0.000863,0.000356,0.000134,0.000203,0.000241,0.000228,0.000349,0.000321,0.00018,0.000474,0.000371,0.000497,0.000176,0.000598,0.000159,0.000523,0.000309,0.000422,0.001016,0.000314,0.000553,0.000287,0.000976,0.000408,0.000279,0.000188,0.000114,0.000152,0.000434,0.000209,0.000704,0.000293,0.000695,0.001063,0.000231,0.000559,0.000547,0.000769,0.000422,0.000461,0.000351,0.000126,0.000587,0.000549,0.000484,0.000593,0.000465,0.000519,0.000224,0.000221,0.000371,0.00078,0.000556,5.1e-05,0.000261,0.000346,0.00016,0.000729,0.000402,0.000555,0.000977,0.000447,0.000376,0.000781,0.000177,0.000549,0.000317,0.000605,0.000245,0.000368,0.000558,0.000198,0.000645,0.000386,0.000209,0.000439
1.9e-05,3.4e-05,3.2e-05,4e-05,2.9e-05,4e-05,8.9e-05,4.1e-05,5e-05,2.6e-05,8e-06,1.3e-05,9e-06,4.2e-05,1e-05,1.8e-05,2e-06,1.3e-05,4.6e-05,9.3e-05,8.2e-05,5.6e-05,5.7e-05,0.000103,0.000124,9.2e-05,0.000116,0.000151,0.000164,0.000243,0.000178,0.000178,0.000127,0.000101,0.000376,0.000151,0.000103,0.000449,0.00031,0.000194,0.000766,0.000543,0.000542,0.000271,0.00038,0.000344,0.000375,0.000137,0.000302,0.000336,0.000203,5.4e-05,0.000165,0.000454,0.000493,0.000865,0.000289,0.000388,0.000821,0.000487,0.00093,0.000594,0.000192,0.000677,0.000192,0.00021,0.000425,0.000648,0.000446,0.000554,0.000226,0.000271,0.000125,0.00059,0.000384,0.000383,0.000481,0.000678,0.000463,0.000328,0.00055,0.000502,0.000318,2e-04,0.000145,0.00018,0.000319,0.000316,0.000359,0.000364,0.00084,0.000729,0.000358,0.000414,0.00021,0.000228,0.000341,0.000206,0.000107,0.00053,0.000441,0.000192,0.000934,0.000498,0.00022,0.000678,0.000371,0.000349,0.000207,4.7e-05,0.000608,0.000379,0.000286,0.000234,0.000385,0.000819,0.00052,0.000201,0.000684,0.000668,0.000351
2.2e-05,2.4e-05,1.3e-05,2e-05,1.9e-05,1.4e-05,6.4e-05,3.1e-05,3.5e-05,2e-05,1.7e-05,2.4e-05,2.8e-05,5.2e-05,3.2e-05,1.3e-05,9e-06,1.6e-05,2.1e-05,3.8e-05,4.5e-05,3e-05,5.2e-05,9.4e-05,0.000135,0.000123,2.5e-05,8e-05,6.6e-05,0.000251,0.000137,0.000107,4.9e-05,0.000103,0.000576,0.000182,0.000343,0.000387,0.000296,0.000666,0.000624,0.000256,0.000383,0.000352,0.000338,0.000534,0.00039,0.000163,0.000309,0.000436,0.000589,0.000379,0.000368,0.000296,0.000275,0.00045,0.000549,0.000621,0.000323,0.000285,0.000435,0.000137,0.000599,0.000662,0.000167,3e-04,0.000401,0.000426,0.000244,0.000278,0.000265,0.000423,0.00051,0.000342,0.000287,0.000657,0.000268,0.000407,0.000559,0.000147,0.00064,0.000601,0.00056,0.000241,0.000124,0.000175,0.000299,0.000558,2.4e-05,0.000243,0.000339,0.000645,0.000481,0.000386,0.000235,0.00061,0.000707,0.000351,0.000165,0.000867,0.000756,0.000377,0.000406,0.000229,0.000263,0.000811,0.000369,0.000466,0.000103,0.000164,0.00062,0.000296,0.000329,0.000186,0.000444,0.000679,0.000668,0.000522,0.000674,0.000149,0.00046
5e-06,1.6e-05,1.1e-05,7e-06,7e-06,2.2e-05,5.6e-05,2e-05,3e-05,1.1e-05,1e-05,1.3e-05,7e-06,2.1e-05,2.5e-05,3e-05,1.1e-05,1.4e-05,2.1e-05,6e-05,2.5e-05,1.8e-05,5.3e-05,5.2e-05,0.000117,0.000127,4.9e-05,3.9e-05,0.000103,0.000124,0.000188,9.3e-05,7.6e-05,0.000169,0.000442,0.000224,0.000152,0.000367,0.000361,0.000272,4.4e-05,0.000577,0.000183,8.2e-05,0.000275,0.000473,0.000176,0.000332,0.000518,0.000299,0.000284,2.5e-05,0.000262,0.000308,0.000124,4e-04,0.000553,0.000842,6e-04,0.00043,0.000134,0.000302,0.000675,0.000602,0.000558,0.000157,0.000454,0.000128,0.000309,0.000255,0.000404,0.000239,0.000527,0.000399,0.000286,0.000477,0.00034,0.000687,0.000691,0.000449,0.000514,0.000556,0.000483,0.000338,0.000185,0.000328,0.000187,0.000537,0.000388,0.000363,0.000337,0.000446,0.000318,0.000623,0.000116,0.000728,0.000395,0.000307,0.00042,0.000237,0.000348,0.000233,0.000148,0.000343,0.00016,0.000582,0.000596,0.000612,0.000765,0.000268,0.000466,0.000324,0.00031,0.000246,0.000164,0.000481,9.5e-05,0.000234,0.000454,0.000272,0.000374
9e-06,1e-05,2e-05,1.7e-05,7e-06,2.9e-05,5.4e-05,2.3e-05,3.5e-05,1.8e-05,2e-06,7e-06,5e-06,2e-05,1.7e-05,1.8e-05,8e-06,1.1e-05,7e-06,6.4e-05,1.5e-05,2.2e-05,3.1e-05,7.8e-05,6.8e-05,0.000109,4.3e-05,1.7e-05,4.9e-05,0.000161,0.000222,0.000101,0.000101,0.000119,0.000477,0.000345,0.000165,0.000164,0.000408,9.1e-05,0.000298,0.000429,0.000143,0.000204,0.000358,0.000542,0.000379,0.000163,0.000248,0.000184,0.000235,0.000312,0.000411,0.000137,2e-04,0.000386,0.000639,0.000396,0.00028,0.000484,0.000599,0.000333,9.6e-05,0.000726,0.000549,0.001046,0.000316,0.000108,0.000375,6.6e-05,0.000644,0.000472,0.000491,0.000111,0.000322,6.5e-05,0.000288,0.000265,0.000336,9e-05,0.000569,0.00044,0.000441,3.3e-05,0.000195,0.000665,0.000613,0.000518,0.000335,0.00011,0.000513,0.000195,7.5e-05,0.000421,0.000429,0.000198,0.000208,0.000185,0.000398,0.000258,0.000283,0.000517,0.000351,0.000445,0.000448,0.000159,5.5e-05,0.000371,0.000323,0.000545,0.000615,0.000183,0.000487,0.000332,0.000143,0.000242,0.000298,0.000241,0.000628,0.000308,0.000394
2.2e-05,2.4e-05,1e-05,1.9e-05,1.2e-05,1.4e-05,4.4e-05,2.1e-05,3.2e-05,1.9e-05,1e-05,1.3e-05,1e-06,2.2e-05,9e-06,1.9e-05,7e-06,1.9e-05,6e-06,3.1e-05,1.2e-05,1.1e-05,4.7e-05,6.6e-05,8.8e-05,9.1e-05,5e-05,2.8e-05,3.9e-05,0.00019,0.000162,0.000115,0.000153,0.000182,0.000412,0.000268,0.000282,0.000193,3e-05,0.000236,0.000408,0.000377,0.000496,0.000549,0.000578,0.000893,0.000598,0.000104,0.000479,0.000152,0.000331,0.000132,0.000275,5e-05,0.000338,0.000762,0.000622,0.000443,0.000254,0.000529,0.00059,0.001012,0.000344,6e-04,0.000199,0.00095,5e-04,0.000397,0.000255,9e-05,0.000258,0.000483,0.000448,0.000304,0.000495,0.000564,0.000623,0.000761,0.000398,0.000172,0.000363,0.000356,0.000428,0.000485,0.000241,0.000513,0.000206,0.000432,0.000131,0.000142,0.000355,0.000256,2.9e-05,0.000185,0.000263,0.000816,0.000733,0.000217,0.000316,9.9e-05,0.000184,0.000173,0.000356,0.000222,0.000264,0.000273,0.000115,0.000378,0.000415,0.000354,0.000434,0.000322,0.000238,0.000162,0.000147,0.000587,0.000523,0.000588,0.000233,0.000731,0.000573
1.6e-05,1.8e-05,2.2e-05,2.2e-05,6e-06,2.2e-05,4.5e-05,3.4e-05,2.8e-05,2.1e-05,8e-06,7e-06,3e-06,2.7e-05,8e-06,2.1e-05,8e-06,1e-05,3e-06,4.5e-05,4e-05,2.2e-05,2.2e-05,4.5e-05,0.000105,8.8e-05,7.2e-05,2.4e-05,5.6e-05,0.000192,0.000151,2.6e-05,7.9e-05,5e-05,0.000528,0.000385,0.000358,0.000246,3e-04,0.000128,0.000669,0.000464,0.000463,0.000386,0.000245,0.000349,0.000401,0.000521,0.000577,0.000425,0.000361,0.000147,0.00015,0.000408,0.000404,0.00033,0.000501,0.000249,0.000463,0.000217,0.000281,0.000512,0.000671,0.000552,0.000295,0.000487,0.000731,0.000416,0.000302,0.000222,0.000305,0.000303,0.000142,0.000119,0.000195,0.000279,0.000276,0.00056,0.000286,8.4e-05,0.000328,0.00015,0.000105,0.000272,0.000303,0.000589,0.000393,0.00044,0.000378,0.000521,0.000613,0.000151,0.000405,0.000419,0.000219,0.001076,0.000266,0.000125,0.000297,8.4e-05,0.000615,0.00042,0.000586,0.000322,0.00012,0.000458,0.000314,0.000124,0.000244,0.000134,0.000439,0.000274,0.00053,0.000532,0.000639,0.000834,0.000196,0.000187,0.000475,0.000559,0.00025
1.1e-05,2.4e-05,1.4e-05,7e-06,1.1e-05,1.3e-05,3.8e-05,3e-05,3.6e-05,3e-06,2.3e-05,1e-05,1.1e-05,1.7e-05,1e-05,3.3e-05,1.9e-05,1.7e-05,1.6e-05,3.4e-05,4.2e-05,3e-05,1.1e-05,5.1e-05,6e-05,0.000124,4.6e-05,4.7e-05,2.9e-05,0.00015,0.000101,0.000166,0.000247,0.000349,0.000654,2.8e-05,1.8e-05,1e-04,0.00022,7.7e-05,0.000946,0.00048,0.000425,0.000353,0.000246,0.000412,0.000375,0.000489,0.000328,0.000521,0.000616,0.000718,0.000367,0.000615,0.000692,5e-04,0.000905,0.00071,0.000182,0.000238,0.000715,0.000405,0.000643,0.000828,0.000464,0.00011,0.000641,0.000959,0.000209,0.000411,0.000278,0.000275,0.00048,0.000547,0.00032,0.000124,0.000384,0.000204,0.000454,0.000321,0.000319,0.000106,0.000291,0.000968,0.000544,0.000565,0.000546,0.000464,0.000725,0.000366,0.000391,0.000133,0.000511,0.000987,0.001028,0.000856,0.000675,0.000608,0.000688,0.000474,0.000627,0.000392,0.000869,0.000714,0.000403,0.000289,0.000304,0.000174,0.000324,0.000102,0.000437,0.000177,0.00102,0.000662,7.2e-05,0.000355,0.000815,0.000103,0.000327,0.001139,0.001288
1.7e-05,2.8e-05,2e-05,6e-06,6e-06,1.3e-05,4.2e-05,1.9e-05,1.1e-05,1.1e-05,2.2e-05,1e-05,7e-06,1.3e-05,1.9e-05,3.3e-05,6e-06,1.8e-05,1.8e-05,5.8e-05,4.1e-05,3.6e-05,5.4e-05,2.6e-05,9.9e-05,0.00015,7.9e-05,9.3e-05,4.5e-05,0.000125,0.00021,0.000194,0.000176,0.000366,0.000217,0.00043,0.000272,0.000343,0.000338,0.000293,0.000899,0.000331,0.000255,8.2e-05,0.000213,0.000618,0.000476,0.000458,0.000325,0.000607,0.000121,0.000649,0.000483,0.000575,0.000674,0.000266,0.000409,0.000415,0.000353,0.000668,0.000769,0.000992,0.000801,0.000517,0.000145,0.000567,0.000411,0.000387,0.001034,0.000582,0.000301,0.000826,0.000899,0.000134,0.000278,0.000155,0.000687,0.000899,0.000809,0.000678,0.000285,0.000121,0.000517,0.001345,0.000952,0.000503,0.00096,0.000828,0.000728,0.001257,0.001163,0.000757,0.000453,0.000658,0.000549,0.000737,0.000981,0.000551,0.001147,0.000889,0.000562,0.000467,0.001193,0.000767,0.000216,0.00052,0.000436,0.000358,0.000301,0.000584,0.00013,0.000453,0.000683,0.000761,0.000426,0.000532,0.000939,0.00114,0.000737,0.00054,0.000454
1.8e-05,1.9e-05,2e-05,1.5e-05,9e-06,9e-06,4.1e-05,1.4e-05,2e-05,1.7e-05,1.9e-05,1.4e-05,7e-06,2e-05,2e-05,3.3e-05,2.7e-05,1e-05,3.1e-05,0.000109,4e-05,6.5e-05,2.3e-05,4e-05,8.3e-05,7.8e-05,8.3e-05,5.1e-05,0.000107,3.8e-05,0.000288,7.6e-05,8.5e-05,0.000387,0.000248,0.000109,0.000208,0.000346,0.000329,0.000242,5e-04,0.000352,0.000365,0.000227,0.000589,0.000652,0.000474,0.000408,0.000256,0.00026,0.000377,0.00044,0.000337,0.000198,0.000667,0.000464,0.000224,0.000389,0.000243,0.000807,0.000309,0.000757,0.000201,0.000494,0.000137,0.000457,0.000493,8.3e-05,0.000594,0.000382,0.000315,0.000602,0.000537,0.000618,0.000624,0.000612,0.000444,0.000575,0.000439,0.000156,0.000861,0.000344,0.000767,0.001176,0.00085,0.000817,0.000883,0.000855,0.00097,0.001128,0.000511,0.000444,0.000386,0.000833,0.000755,0.00016,0.00073,0.000785,0.001194,0.000304,0.000404,0.000527,0.000639,0.001387,0.001181,0.000892,0.000626,0.00025,0.000422,0.000479,0.000244,0.000861,0.000787,0.00055,0.000566,0.000641,0.000532,0.000774,0.000677,0.000591,0.000855
1.3e-05,2e-05,9e-06,1.1e-05,8e-06,1.7e-05,3.2e-05,1.4e-05,1.9e-05,1.6e-05,8e-06,1.3e-05,1.1e-05,2.7e-05,2.8e-05,1.7e-05,3e-05,3.5e-05,2.4e-05,8.7e-05,1.9e-05,5.4e-05,6.9e-05,4.8e-05,6.8e-05,2.3e-05,3.7e-05,8.7e-05,6.2e-05,8.5e-05,0.000258,2.6e-05,5.2e-05,0.000176,3.4e-05,0.000295,0.000239,0.000545,0.000359,0.000218,0.000565,0.000107,0.000218,0.00028,0.000835,0.000423,0.000168,0.000355,0.000504,0.000375,0.000142,0.000304,0.000493,0.000411,0.000835,0.000316,0.000382,0.000521,0.000376,0.00062,0.000252,0.000431,0.000628,0.000453,0.000518,0.000272,0.000409,5.1e-05,0.000444,0.00031,5e-04,0.000479,0.000137,5e-04,7.8e-05,0.000306,0.000244,0.000526,0.000388,0.000864,0.00165,0.000683,0.000745,0.001099,0.000416,0.000817,0.000238,0.000895,0.000948,0.000559,0.000984,0.000867,0.000362,0.000788,0.000526,0.00045,0.000918,0.000411,0.000505,0.000416,0.000791,0.000157,0.00044,0.001351,0.000736,0.000336,0.000123,0.000377,0.000299,0.000724,0.000737,8e-04,0.00074,0.000803,0.000363,0.000959,0.000899,0.000712,0.000491,0.000432,0.00056
1e-05,1.3e-05,1.8e-05,1.6e-05,5e-06,5e-06,2.6e-05,1.8e-05,2.7e-05,1.6e-05,1.5e-05,9e-06,1.9e-05,1.2e-05,2.5e-05,4.1e-05,3.9e-05,5.7e-05,4.7e-05,7.7e-05,2.3e-05,3.7e-05,6.2e-05,0.000116,9.4e-05,3.7e-05,7e-06,1.6e-05,0.000105,0.000122,0.000132,0.000151,0.000135,0.000144,0.000108,9.7e-05,0.000277,0.000187,0.000189,0.000499,0.000617,0.000862,0.000513,0.000427,0.000487,0.000583,0.000958,0.000636,0.000246,0.000134,0.000282,0.000184,0.000499,0.000503,0.000716,0.000525,0.000339,0.000207,0.000621,0.000422,0.000268,0.000351,0.000566,0.000374,0.000441,0.000314,0.000456,0.000578,0.000229,0.000601,0.00034,0.00066,0.00022,0.00017,0.000335,0.000306,0.000249,0.00044,0.00047,0.000509,0.00074,0.000735,0.000444,0.000769,0.000819,0.000285,0.000449,0.000596,0.000291,0.000713,0.001107,0.000301,0.000677,0.000158,0.000193,0.000561,0.001064,0.000574,0.000254,0.000331,0.000702,0.000489,0.00078,0.000467,0.000255,0.000549,0.000207,0.000391,0.000855,0.001228,0.000848,0.000231,0.000306,0.000308,0.000453,0.001087,0.001105,0.000403,0.000533,3e-04,0.000423
1.7e-05,3e-06,2.2e-05,1.2e-05,9e-06,8e-06,3e-05,1.9e-05,1.7e-05,9e-06,2e-06,1.5e-05,1.1e-05,1.7e-05,3e-05,4.2e-05,3e-06,4.8e-05,5.5e-05,2.4e-05,5e-05,3.9e-05,4.4e-05,0.000108,2e-05,5.4e-05,2.3e-05,2.2e-05,0.000107,6.2e-05,0.000122,0.000129,1e-04,1e-04,0.000156,0.000178,0.000154,0.00013,0.000133,0.000321,0.000262,0.000258,0.000255,0.000104,0.000284,0.00035,0.000517,0.000277,0.000246,0.00023,0.00043,0.000322,0.00039,0.000161,0.000454,0.000101,0.000102,0.000224,4e-04,0.000373,0.000218,6e-04,6.9e-05,0.000208,9e-05,4e-05,0.000405,0.000195,0.000188,0.000425,0.000387,0.000173,0.000148,8.4e-05,0.000229,0.000402,0.000777,0.000302,0.000113,0.000135,0.000452,0.000349,0.000255,0.00049,0.000137,0.000311,0.00025,0.000456,6.6e-05,0.000428,0.000148,0.000625,0.000245,0.000227,0.000159,0.000393,0.000584,0.000181,0.000436,0.00041,0.000194,0.000239,0.000342,0.000403,0.000401,0.000692,0.000521,0.000146,0.000669,0.000527,0.000377,0.000515,6.6e-05,0.000198,0.000245,0.000373,0.00021,0.000161,0.000254,0.000141,0.000225
1.6e-05,1.1e-05,1.3e-05,1.2e-05,1.1e-05,8e-06,2.9e-05,1.3e-05,9e-06,1.3e-05,2.3e-05,9e-06,1.8e-05,1.5e-05,2.7e-05,2.4e-05,1.9e-05,3.5e-05,2.9e-05,3.6e-05,3.8e-05,4.3e-05,5.7e-05,9.2e-05,1.8e-05,3.1e-05,1.4e-05,3.8e-05,3.9e-05,6.6e-05,0.00016,9.4e-05,0.000189,9.6e-05,0.000209,0.000222,0.000226,0.000332,0.000144,0.000258,5.5e-05,0.000144,0.000179,2.5e-05,0.000252,0.00024,0.000403,0.000356,0.000246,0.000229,0.000318,1.2e-05,7.8e-05,0.000122,0.000306,0.000455,0.000381,0.000317,0.000322,0.000249,0.000397,0.000503,0.000272,0.000222,0.000104,0.00016,0.000598,0.000423,0.000181,0.000416,0.00023,0.000376,0.000309,0.000123,0.000297,0.000158,0.000484,0.000384,0.000233,0.000335,0.000208,0.000102,0.000304,0.00014,0.000222,0.00031,0.000534,0.00039,0.000377,0.000407,0.000327,9.2e-05,0.000447,0.000222,1.9e-05,0.000413,0.000568,7.6e-05,0.000359,0.000342,0.000511,9.5e-05,0.00023,0.000213,0.000142,0.000213,8e-05,0.000221,0.000322,1.6e-05,0.00019,0.000505,0.000159,0.000136,8.6e-05,0.00011,0.000342,0.00032,0.000381,4.2e-05,0.000201
1.2e-05,2e-05,9e-06,1.3e-05,8e-06,2e-05,4.2e-05,7e-06,2.3e-05,1e-06,1.8e-05,2.7e-05,2.1e-05,3e-05,1.4e-05,2.8e-05,1.9e-05,4.8e-05,1.7e-05,4.6e-05,5.1e-05,3.2e-05,9e-06,4.3e-05,6.4e-05,7.3e-05,2.9e-05,3.7e-05,6.2e-05,6.9e-05,0.000167,4e-05,6e-05,3.8e-05,0.000106,0.000244,0.000278,0.000171,0.00021,0.000224,0.000204,0.000193,0.00029,6e-05,0.000226,0.00056,0.000254,0.000197,0.000168,0.000127,0.000356,0.000379,0.000217,0.000278,0.000396,0.000353,0.000123,0.000144,0.000211,0.000145,0.000398,0.000186,0.000279,0.000393,0.000388,0.000171,0.000502,0.000432,0.000328,0.000438,0.000374,0.000529,9.2e-05,9.8e-05,0.000228,0.000679,0.000577,0.000258,0.000296,0.000512,5.7e-05,0.00031,0.000393,0.000316,0.000144,0.000331,0.00015,0.000264,0.000377,0.000269,0.000561,3.8e-05,0.000105,0.000339,0.000342,0.000407,0.000315,0.00031,0.000548,0.00072,0.000172,0.000379,0.000302,0.000277,0.000148,0.000206,0.000389,0.000539,0.000636,0.000363,0.000555,0.000262,0.000232,0.000513,0.000325,0.000281,0.000672,0.000545,0.000428,0.000339,1e-04
6e-06,8e-06,1.5e-05,1.8e-05,6e-06,2.2e-05,3.7e-05,3.1e-05,1.7e-05,2.5e-05,2e-05,3.4e-05,2.3e-05,2e-06,5e-06,3.6e-05,1.9e-05,4.4e-05,4.8e-05,4.2e-05,8e-05,7.7e-05,3.1e-05,6.8e-05,1e-04,8.2e-05,4.8e-05,3.3e-05,0.000113,0.000115,0.000159,6.2e-05,5e-05,0.000116,0.000183,0.00026,5.2e-05,0.000183,0.000203,0.00014,0.000367,0.000347,0.000222,0.000154,0.000196,0.000291,0.000358,0.00012,0.000122,0.000191,0.000575,0.000423,0.000573,0.000535,0.000416,0.000287,9.3e-05,0.00011,0.000446,0.000339,0.000369,0.00033,0.000314,0.000281,0.000237,4e-05,0.000152,0.000471,0.000312,0.000438,0.000659,0.000821,0.000659,0.000423,0.000189,0.00065,0.000538,0.000723,0.000517,0.000509,0.000485,0.000502,0.000282,0.000448,0.000328,0.000571,0.000209,0.000281,0.000309,0.000561,0.000791,0.000563,0.000258,0.000278,0.000584,0.000596,0.000696,0.000691,0.000184,0.000506,0.000392,0.00034,0.000148,0.000193,0.000279,9.7e-05,0.000456,0.00026,0.000859,0.000281,0.000996,0.000891,0.000377,0.000563,0.000409,0.000101,0.000456,0.000663,0.000701,0.000996,0.000701
1.3e-05,1.5e-05,7e-06,1.2e-05,6e-06,2.7e-05,3.4e-05,4.1e-05,2.9e-05,4e-06,1.2e-05,1.4e-05,9e-06,1.5e-05,9e-06,1.9e-05,3.3e-05,5e-06,1.9e-05,2.8e-05,4.8e-05,7.8e-05,4.8e-05,8.6e-05,0.000134,0.000128,4.2e-05,1.2e-05,5.6e-05,7.8e-05,9.1e-05,4.1e-05,0.000131,0.000177,0.000253,0.000106,0.00027,0.000188,2.5e-05,0.00013,0.000225,0.00028,0.000304,0.000225,0.000303,0.000446,8.6e-05,0.00011,0.000194,0.000346,0.000633,0.000265,0.000334,0.000144,0.000304,0.000152,0.000102,0.000133,0.000217,4.9e-05,0.000168,0.000382,0.000137,0.000203,0.000244,0.000387,0.000445,0.000302,0.000245,0.000167,0.000143,0.000407,0.000418,7.2e-05,0.000119,0.000509,0.000351,0.000368,0.00015,0.000474,0.000266,5.6e-05,6.3e-05,0.000199,0.000256,0.000185,0.000419,0.000199,0.00039,0.000719,0.000312,0.000365,6.3e-05,0.000269,0.000584,0.000511,0.00011,0.000285,0.000298,0.000502,0.000313,0.000396,3e-05,0.000232,0.000324,0.000306,0.000181,0.000439,0.001037,0.000754,0.000565,0.000585,0.000442,0.000302,0.000194,0.000242,0.000439,0.000305,0.000332,0.000591,0.00042
1e-05,1.7e-05,1.4e-05,9e-06,2e-06,1.8e-05,3.4e-05,2.7e-05,2e-05,3e-06,9e-06,8e-06,6e-06,1.8e-05,7e-06,1e-05,2.2e-05,2e-05,1.6e-05,2e-05,1.9e-05,3.5e-05,1.5e-05,6.6e-05,0.000113,5.7e-05,1.9e-05,5e-06,3.2e-05,0.000127,0.000148,5.9e-05,5.3e-05,8e-05,0.00021,0.000134,0.000201,0.00019,0.000101,0.000103,0.000178,0.000245,0.000276,4.4e-05,0.000248,0.000138,0.000301,7.8e-05,0.000132,0.000219,0.000298,0.000119,0.000115,0.000196,0.000178,0.000137,8.3e-05,0.000166,0.000182,0.00021,9.9e-05,0.000128,2.6e-05,0.000359,9.3e-05,0.000258,0.000268,7.5e-05,0.000128,0.000356,0.000192,0.000406,0.000117,0.000184,0.000152,3e-04,0.000155,0.000116,0.000318,0.000264,0.000159,5.9e-05,0.00021,0.000105,0.00023,3.3e-05,0.000306,5.9e-05,0.000203,0.000234,0.000371,0.000234,0.00017,0.000288,0.000196,0.000276,0.000147,7.8e-05,0.000108,0.000255,0.000335,0.000179,0.000232,0.000187,0.000227,1.8e-05,0.000152,0.000245,0.000213,0.000144,0.000468,0.000217,8.7e-05,0.000198,0.000171,9.2e-05,0.000207,0.000197,6.1e-05,0.000389,0.000187
1.2e-05,1.4e-05,8e-06,8e-06,2e-06,1.3e-05,3.2e-05,2.1e-05,1.5e-05,6e-06,5e-06,9e-06,7e-06,1.3e-05,1e-05,1.3e-05,1.5e-05,1.8e-05,5e-06,2.8e-05,1.6e-05,2.7e-05,2.7e-05,6.3e-05,9.8e-05,4.1e-05,6e-06,5e-06,2e-05,8.9e-05,0.000147,2.3e-05,5.6e-05,6.8e-05,0.000174,0.000154,6.7e-05,0.00016,6.9e-05,7.9e-05,0.000176,0.000106,0.000223,3e-05,9e-05,0.000132,0.000223,7.3e-05,8.8e-05,0.000203,0.000158,2.4e-05,6.6e-05,0.000255,5.4e-05,0.000132,2.4e-05,0.000101,5.6e-05,0.000115,2.3e-05,0.000141,4.6e-05,0.000212,6.5e-05,0.000148,0.000177,8.4e-05,0.000137,0.000284,0.00021,0.000265,0.00011,0.000134,9.5e-05,0.000144,0.000106,0.000216,0.000258,0.000145,2.8e-05,4.3e-05,0.000195,0.000116,0.00019,6.6e-05,0.000244,3.6e-05,0.000134,2.5e-05,0.000299,0.000184,0.000236,0.000112,0.000134,0.000116,0.000151,3.3e-05,1.3e-05,9.2e-05,0.000239,0.000188,9.8e-05,0.000114,0.000114,0.000101,0.000203,7.6e-05,8e-05,2e-04,0.000251,0.00023,0.000164,0.000249,7.5e-05,6.4e-05,0.000219,0.00015,5.1e-05,0.000184,0.00018
1.4e-05,1.4e-05,9e-06,9e-06,0,1.2e-05,3.1e-05,2.3e-05,1.8e-05,5e-06,3e-06,1e-05,2e-06,1.4e-05,9e-06,1.2e-05,1.3e-05,1.5e-05,4e-06,3.1e-05,1.1e-05,1.9e-05,2.3e-05,6.7e-05,9.2e-05,4.5e-05,2e-05,1e-05,3.4e-05,9.2e-05,0.000142,2.4e-05,4.3e-05,5.7e-05,0.000188,0.000129,8.9e-05,0.000137,8.4e-05,6.2e-05,0.000156,0.000104,0.000209,1.6e-05,0.000127,0.000166,0.000147,6.1e-05,8.8e-05,0.000154,0.000101,3.2e-05,9.2e-05,0.000103,9.6e-05,9e-05,1.3e-05,6.2e-05,0.000117,9.7e-05,6.7e-05,0.000174,0.000134,0.000167,7.2e-05,0.000195,0.000268,0.000151,0.000129,0.000246,0.00017,0.000292,0.000181,9.4e-05,0.000156,5.8e-05,8.7e-05,0.000195,0.000309,7.5e-05,9.4e-05,5.6e-05,8.3e-05,1.6e-05,0.000177,5.1e-05,0.000238,4e-05,0.000124,4.9e-05,0.000361,0.000215,2e-04,0.000131,0.000198,0.000201,0.000153,5.3e-05,6.5e-05,7.3e-05,0.000193,0.000106,4.5e-05,9e-05,7.6e-05,4.7e-05,8.7e-05,3.9e-05,0.000132,0.000168,0.000354,0.000134,0.000135,0.00024,0.000115,6.9e-05,0.000189,8.6e-05,6.8e-05,0.000196,0.000145
