0.009653,0.012766,0.017803,0.020126,0.047258,0.079871,0.087185,0.105367,0.168936,0.44698,0.959,1.13337,0.803893,0.61914,0.692754,0.658405,0.528126,0.448345,0.410022,0.285964,0.151252,0.11241,0.081781,0.045311,0.030206,0.027233,0.078001,0.205561
0.011562,0.015314,0.02154,0.024331,0.056398,0.095033,0.104294,0.12491,0.194298,0.501663,1.065754,1.253038,0.892353,0.698574,0.780213,0.747263,0.609211,0.510627,0.460175,0.321196,0.170898,0.128676,0.094449,0.053138,0.035383,0.031887,0.087757,0.227901
0.014866,0.019526,0.02705,0.03034,0.068814,0.116031,0.128739,0.153682,0.234087,0.579184,1.209747,1.422618,1.042907,0.847298,0.932579,0.902435,0.752039,0.608503,0.525563,0.363371,0.194497,0.151281,0.113181,0.065098,0.043015,0.03882,0.098591,0.247095
0.018294,0.023501,0.0297,0.032229,0.070251,0.120328,0.136838,0.166333,0.265478,0.624942,1.279258,1.522015,1.19659,1.061868,1.132748,1.081829,0.917435,0.71101,0.566409,0.377844,0.204153,0.163656,0.123511,0.071735,0.047063,0.043023,0.097946,0.22851
0.023217,0.029341,0.031584,0.031687,0.062113,0.115775,0.146441,0.188252,0.338401,0.722422,1.369651,1.689838,1.490197,1.409151,1.467202,1.431768,1.246548,0.947846,0.703376,0.439383,0.23676,0.181118,0.130754,0.076813,0.051709,0.049422,0.105813,0.22065
0.030637,0.038702,0.040518,0.038055,0.058269,0.129139,0.193288,0.261301,0.49895,0.95358,1.644548,2.151446,2.110501,2.012602,2.049351,2.091238,1.888059,1.453603,1.074914,0.649862,0.342893,0.230876,0.146579,0.091612,0.068837,0.066641,0.150433,0.306569
0.039464,0.050201,0.057271,0.054001,0.071121,0.179688,0.291228,0.388952,0.740391,1.366522,2.213563,2.882713,3.001225,3.033195,3.164243,3.269363,2.961171,2.30505,1.689871,0.997478,0.523442,0.321417,0.179396,0.119911,0.100279,0.094939,0.221447,0.45455
0.047434,0.060471,0.078304,0.077244,0.090467,0.246336,0.419821,0.54191,1.007362,1.912743,3.094453,3.934018,4.310488,4.731539,4.994488,4.999168,4.50569,3.607795,2.555233,1.423429,0.754271,0.453887,0.237302,0.161086,0.138791,0.129269,0.297529,0.607311
0.052284,0.065803,0.09493,0.097756,0.105834,0.302345,0.532415,0.672408,1.230468,2.539579,4.496915,5.856492,6.620385,7.465181,7.688751,7.257458,6.511651,5.545282,3.806283,1.903084,0.986852,0.594688,0.305043,0.201939,0.169277,0.156186,0.340529,0.682924
0.052019,0.064413,0.097973,0.103811,0.112046,0.318835,0.56144,0.729933,1.386967,3.286419,6.562573,8.874642,10.147147,11.219533,11.19932,10.17145,9.095816,8.200286,5.508746,2.463877,1.209797,0.71181,0.352983,0.219846,0.175824,0.161484,0.323486,0.629907
0.047985,0.057472,0.08469,0.091797,0.107735,0.284321,0.481016,0.677718,1.403859,4.119858,9.134172,12.607155,14.303843,15.173639,14.610193,13.19081,11.965784,11.039932,7.428057,3.206769,1.415687,0.763831,0.372171,0.212334,0.15403,0.142855,0.275428,0.524526
0.041554,0.048198,0.064038,0.070089,0.104166,0.238561,0.356962,0.549669,1.270893,4.685998,11.090274,15.269755,16.824475,16.929775,15.740786,14.329694,13.181101,12.249639,8.435953,3.738064,1.498658,0.720645,0.359999,0.194123,0.120841,0.111935,0.215201,0.4033
0.033713,0.037856,0.049397,0.057034,0.110841,0.227553,0.296601,0.458547,1.078427,4.528277,10.975948,14.791091,15.445693,14.648929,13.367057,12.362122,11.263527,10.351105,7.416325,3.500703,1.343441,0.59571,0.299175,0.163547,0.095622,0.086956,0.181557,0.346954
0.032745,0.036657,0.051899,0.063319,0.134419,0.26138,0.308817,0.443243,0.947008,3.582077,8.339737,10.906092,10.679222,9.649535,8.848805,8.090353,6.985612,6.203194,4.685581,2.425808,0.972778,0.45496,0.227504,0.126891,0.080975,0.077771,0.205781,0.415338
0.036506,0.045395,0.073633,0.091446,0.181524,0.339279,0.378964,0.518562,1.006841,2.582301,5.221423,6.441433,5.763624,5.174487,4.934783,4.300533,3.401953,2.719975,2.074146,1.245575,0.719203,0.481073,0.247157,0.12137,0.07488,0.084069,0.280423,0.61038
0.045721,0.062737,0.109166,0.137468,0.254233,0.475009,0.532874,0.690175,1.251129,2.244303,3.637275,4.267794,3.907478,3.711828,3.480189,2.888659,2.173368,1.503711,0.987635,0.706031,0.754156,0.66406,0.344978,0.151699,0.082528,0.104173,0.389108,0.907293
0.061895,0.085504,0.150436,0.189453,0.335611,0.645554,0.748906,0.89375,1.51598,2.493824,3.908083,4.981209,4.780878,3.943327,3.216372,2.71443,2.176062,1.582232,1.039975,0.753504,0.931079,0.884935,0.470946,0.193329,0.096125,0.127757,0.504724,1.263462
0.077907,0.106206,0.185553,0.227464,0.386594,0.778636,0.942637,1.043357,1.636896,2.966032,5.23475,6.995732,6.579689,4.875666,3.506765,2.922834,2.499983,1.932489,1.272271,0.8392,1.021741,1.017386,0.562014,0.21723,0.103203,0.143547,0.599758,1.581815
0.08402,0.110331,0.192048,0.230058,0.3767,0.800526,1.018153,1.061823,1.484584,3.199415,6.824367,9.273995,8.211447,5.857457,4.095887,3.261399,2.815445,2.200645,1.391638,0.845163,0.958025,0.958055,0.550106,0.20378,0.092504,0.138273,0.647574,1.747115
0.080376,0.095677,0.159032,0.189643,0.308146,0.678449,0.906932,0.916274,1.111797,3.041828,7.863724,10.734223,8.71008,6.078362,4.474903,3.431944,2.912335,2.238584,1.36498,0.794344,0.810972,0.77214,0.436658,0.160005,0.07092,0.112282,0.637027,1.73399
0.079679,0.079398,0.103914,0.124036,0.21085,0.477046,0.674289,0.695803,0.803185,2.554314,7.518261,10.564074,7.99604,5.522128,4.606143,3.552844,2.862776,2.125947,1.349853,0.76415,0.680756,0.61513,0.306237,0.107236,0.055741,0.090329,0.573047,1.567423
0.078027,0.069342,0.060044,0.066452,0.124179,0.302888,0.479178,0.547604,0.657023,1.87493,5.749935,8.482629,6.419482,4.629309,4.531797,3.79912,2.792105,1.934445,1.310704,0.710709,0.631408,0.555633,0.221347,0.075677,0.0534,0.07687,0.482537,1.335962
0.073492,0.066776,0.046673,0.041848,0.073475,0.187832,0.351108,0.485389,0.614247,1.34307,3.836918,5.666232,4.433745,3.535521,3.96696,3.690702,2.480744,1.590942,1.172733,0.654811,0.631533,0.537311,0.191369,0.069843,0.050574,0.062342,0.376655,1.025969
0.064941,0.061709,0.050168,0.042958,0.055387,0.126713,0.255288,0.413197,0.561231,1.030667,2.495072,3.560555,2.961462,2.562882,3.045199,3.080334,2.094075,1.34058,1.008029,0.585483,0.580325,0.467859,0.16899,0.069173,0.048224,0.053254,0.26759,0.680328
0.053106,0.050808,0.046228,0.041189,0.047664,0.091634,0.187838,0.333859,0.473531,0.917275,2.08066,2.781666,2.25242,1.832778,2.096504,2.160532,1.565851,1.11032,0.801244,0.487069,0.481875,0.356028,0.133951,0.06338,0.046668,0.047568,0.186173,0.437393
0.038144,0.0343,0.033159,0.031907,0.040961,0.071446,0.152511,0.279588,0.407944,0.95426,2.252675,2.697362,1.832927,1.335398,1.467903,1.431015,1.13372,0.94473,0.653962,0.419376,0.413276,0.27994,0.10087,0.052324,0.040919,0.038891,0.137704,0.330596
0.027245,0.023187,0.026325,0.028268,0.03606,0.068883,0.150465,0.258314,0.379662,1.000406,2.295657,2.519432,1.553882,1.166599,1.252325,1.208595,1.122414,0.955376,0.611969,0.420347,0.384666,0.232151,0.084792,0.044443,0.03306,0.03203,0.104275,0.256854
0.024057,0.023125,0.030527,0.032994,0.034571,0.073551,0.160153,0.237081,0.343868,0.962957,2.061762,2.302478,1.567406,1.245239,1.177682,1.142278,1.325482,1.083368,0.63196,0.451936,0.399144,0.24544,0.086814,0.041207,0.032045,0.034373,0.088708,0.216568
0.030856,0.031673,0.039549,0.039523,0.037437,0.084875,0.167307,0.206076,0.338329,0.917227,1.656439,1.968344,1.682491,1.53647,1.386349,1.265303,1.48575,1.087127,0.576526,0.426824,0.376081,0.258551,0.0902,0.041872,0.034795,0.039483,0.09117,0.227895
0.048135,0.049361,0.052824,0.046922,0.045238,0.099175,0.176628,0.178971,0.321092,0.897018,1.533617,1.884705,1.77956,1.855514,1.734446,1.372987,1.404186,0.922755,0.477605,0.374072,0.309531,0.232563,0.083361,0.045709,0.041687,0.045917,0.091976,0.221156
0.068375,0.070343,0.070678,0.059462,0.057412,0.107865,0.177932,0.159673,0.281002,0.954966,1.638687,1.861395,1.710906,1.886193,1.888984,1.338819,1.119288,0.70298,0.392587,0.359315,0.287777,0.207345,0.086356,0.058519,0.054591,0.059295,0.097593,0.19679
0.080627,0.083523,0.083555,0.069586,0.065593,0.112035,0.184974,0.169818,0.272314,0.977943,1.525437,1.525383,1.389571,1.559596,1.679927,1.119166,0.783394,0.566601,0.360768,0.34141,0.267219,0.184052,0.100681,0.071723,0.062987,0.068447,0.102387,0.182838
0.074323,0.077665,0.078979,0.06563,0.060543,0.099984,0.178253,0.179261,0.264481,0.91785,1.248342,1.080784,1.041473,1.156436,1.360321,0.97985,0.58625,0.464528,0.344737,0.333301,0.248778,0.168743,0.113338,0.072984,0.058065,0.063074,0.097181,0.162474
0.050794,0.053851,0.056767,0.047541,0.042541,0.070083,0.149921,0.185802,0.266423,0.84716,1.116535,0.926235,0.81758,0.882771,1.26386,1.058076,0.566448,0.393669,0.320937,0.313017,0.239963,0.167544,0.11283,0.062222,0.042402,0.044153,0.07402,0.119624
0.025639,0.029004,0.034242,0.033184,0.027061,0.047311,0.138368,0.194001,0.299972,0.886683,1.133565,0.97503,0.845403,0.713278,1.085394,1.038382,0.499731,0.311824,0.285255,0.278587,0.235203,0.159344,0.104161,0.056734,0.031984,0.027669,0.045553,0.070218
0.0165,0.022747,0.031812,0.035492,0.027511,0.048415,0.142215,0.18286,0.328536,0.96466,1.145173,0.96915,0.900741,0.595566,0.791474,0.83588,0.417072,0.26134,0.231504,0.233639,0.227241,0.158033,0.104614,0.059031,0.032049,0.025133,0.028378,0.03989
0.015323,0.022758,0.032144,0.037005,0.031157,0.050096,0.134354,0.14793,0.3083,0.950756,1.052727,0.845143,0.87869,0.587164,0.590831,0.610511,0.368134,0.231226,0.207135,0.215758,0.211475,0.156025,0.100509,0.054077,0.028996,0.023443,0.025295,0.031595
0.014959,0.02512,0.031841,0.033111,0.030255,0.044771,0.122816,0.13305,0.263209,0.836144,0.962637,0.767552,0.751143,0.661347,0.675064,0.613705,0.37326,0.229842,0.208173,0.239769,0.220044,0.136681,0.081999,0.045292,0.024129,0.020631,0.027065,0.03718
0.01706,0.029088,0.037528,0.031658,0.025226,0.041348,0.119633,0.143248,0.21526,0.774942,1.080445,0.776848,0.56479,0.746511,0.872506,0.728891,0.381314,0.210852,0.185866,0.259329,0.268643,0.133573,0.060556,0.045416,0.028684,0.021243,0.029782,0.051096
0.019868,0.03028,0.044147,0.032555,0.021369,0.04063,0.114647,0.142672,0.208581,0.837049,1.360806,0.923071,0.521751,0.821247,0.985159,0.758716,0.385668,0.187769,0.145434,0.262752,0.318425,0.147294,0.05817,0.051574,0.037494,0.031294,0.038186,0.065494
