-0.000302,3.5e-05,-0.000291,-0.000388,-0.003371,0.003874,-0.02249,-0.018785,-0.013579,-0.006427,-0.002045,-0.01939,-0.027258,-0.020718,-0.007216,-0.002115,-0.011374,0.006281,-0.006001,-0.012227,-0.010466,-0.008123,-0.006631,-0.006533,-0.014977,-0.021549,-0.01393,-0.010522,-0.007981,-0.009695,-0.009145,-0.011649,-0.01227,-0.013265,-0.010878,-0.013185,-0.014349,-0.011768,-0.014772,-0.010136,-0.005085,-0.005812,-0.005536,-0.007382,-0.008574,-0.006306,-0.005135,-0.003023,-0.003315,-0.003722,-0.003222,-0.003012,-0.004045,-0.003102,-0.002245,-0.001373,-0.001096,-0.000351,-0.000869,-0.000617,-0.000216,-0.001332,-0.000537,-0.000541,-0.000706,0.000459,2.9e-05,-1.5e-05,-0.001101,-0.000799,0.000527,-0.006688,-0.003785,-0.001672,-0.000715,-0.00169,-0.008172,-0.008542,-0.004645,-0.001484,-0.00507,-0.005104,-0.001794,-0.000691,-0.00155,-0.003125,-0.00167,-0.000359,6.8e-05,-0.002156,-0.000871,-0.000666,-0.000144,-0.000119,-5.7e-05,-0.000527,-0.00031,9.3e-05,3.9e-05,-2e-04,-0.000132,-4.5e-05,8.6e-05,-0.000324,-5.4e-05,-0.000272,0.000111,0.000107,-0.000203,0.000224,-0.004016,-0.002369,-0.00074,3e-06,-4.3e-05,-0.00018,-0.000221,-7.5e-05,-0.000236,0.000194,0.000336
0.000165,1.1e-05,-0.000118,-0.00017,0.001529,0.001634,0.009854,0.009037,0.010541,0.005724,0.001803,0.001424,0.022167,0.011506,-0.000626,0.003369,0.005963,-0.01038,-0.003863,-0.002315,-0.008819,-0.007425,-0.007168,-0.003282,-0.011575,0.000222,-0.00012,-0.002217,-0.002752,-0.000784,-0.003809,-0.005707,-0.001996,0.004788,0.002559,0.000906,0.002243,-0.00333,-0.001836,-0.007799,-0.002188,-0.003683,-0.002718,-0.004767,0.000111,0.000376,0.000312,-0.001469,-0.003325,-0.002178,-0.002425,-0.000422,-0.002027,-0.00122,-0.000904,-0.001251,-0.000681,-0.000197,0.000135,-0.000476,-0.000673,-0.001058,-0.000335,0.000311,-3e-05,1.2e-05,-0.000229,-0.000178,0.000119,-0.000408,-0.002806,0.001439,0.00312,0.001689,0.00112,0.000481,-0.001126,0.008372,0.00482,0.001645,0.000443,0.003488,0.00193,0.000827,0.001414,0.002386,0.001216,-0.000117,-0.00046,0.000906,7.7e-05,8e-05,6.6e-05,-0.000331,-0.000372,-0.000225,-0.000122,0.000739,0.00071,0.000525,0.000479,-0.000137,-5.8e-05,-0.000173,0.000154,0.000192,-0.000239,-0.000698,-0.000213,-0.00011,0.001173,-0.000905,-0.000875,-0.000259,-6e-06,-8.2e-05,0.000323,0.00044,0.000101,7.3e-05,-0.000178
5.4e-05,-8.3e-05,-7e-06,0.000157,-0.000942,-0.001883,0.002084,0.004287,-0.000628,-0.000648,-0.000687,0.005319,-0.012627,-0.008144,-0.002621,-0.003599,-0.003941,-0.011309,-0.006211,-0.001702,-0.007827,-0.005917,-0.002763,-0.00328,0.002411,-0.007062,-0.00464,-0.002798,-0.002364,-0.001341,0.002373,-0.001132,-0.000648,-0.006269,-0.012558,-0.005089,-0.004972,0.003129,-0.000447,-0.003171,-0.004986,0.001541,-0.001127,-0.000642,0.000396,-0.002474,-0.002024,-0.002179,-0.001296,-0.00089,-0.001142,0.000327,-0.001828,-0.001244,-0.00081,-0.000356,-0.000488,-6.8e-05,-0.00033,-0.000321,-3.4e-05,0.000679,0.000406,0.000532,0.000151,0.000182,0.000171,-3.3e-05,-0.000584,-0.000278,-0.000774,0.000484,-0.000738,-0.000668,1.3e-05,-4.5e-05,0.000709,-0.005072,-0.003302,-0.00116,-0.002046,-0.001949,-0.001234,0.000208,-0.000508,-0.001561,-0.000902,-0.000188,-0.000188,0.000521,0.000606,0.000174,-3.8e-05,-3.3e-05,0.000346,-0.000112,6.7e-05,-0.000138,-0.000294,-0.000202,0.000109,7.7e-05,-1.9e-05,-0.000104,-0.00029,-0.000232,-7.4e-05,9.4e-05,0.000251,4.6e-05,-0.000376,9.5e-05,0.000788,0.000454,-0.000102,0.000142,-0.000276,-0.000145,-0.000343,8.6e-05,0.000126
0.00037,0.000403,0.000141,0.00049,0.000325,0.001659,-0.005391,-0.006751,-0.00116,-0.000105,0.000471,0.001194,0.00628,0.005156,0.00211,-0.002134,-0.002119,0.002364,-0.000776,-0.002398,0.00705,0.002086,0.001499,0.000214,0.00141,0.003529,-0.000599,-0.002823,0.001236,-0.000131,-0.001975,-0.001848,0.002091,0.006086,0.004241,-0.004551,-0.003486,-0.00173,0.002862,0.002229,-0.002503,-0.002913,0.001156,0.000197,0.003077,0.003386,0.001073,-0.000404,0.000714,2.3e-05,0.000914,-0.001347,0.001629,-4e-06,-0.000376,0.000953,0.000671,0.000591,0.000249,-0.000187,0.000429,0.000192,0.000637,0.000132,-1.7e-05,-0.001506,-0.000776,-1.2e-05,0.000377,0.00032,0.000195,-0.000657,0.000805,0.00089,0.000557,-0.000272,-0.000574,0.000223,0.000396,0.000599,0.001505,0.001447,0.000132,0.000445,0.000965,0.000688,0.00036,0.000288,0.000352,-0.000182,-0.000184,-0.000134,0.000168,4.5e-05,-6.8e-05,0.000233,-8.5e-05,0.000397,-0.000262,0.00015,-8.5e-05,-0.000109,0.000393,0.000125,3.1e-05,0.000121,0.000164,1e-06,-0.000141,0.000186,-0.00014,2.9e-05,0.000166,-0.000125,-8e-06,0.000339,0.000243,0.000185,0.000158,-4.9e-05,-8.3e-05
-0.000207,-6.9e-05,-0.000323,-6.5e-05,-0.000521,-0.00161,-0.000526,0.002333,0.001873,0.000147,-0.00073,0.002085,-0.003543,-0.004588,-0.000705,2.7e-05,-0.002729,-0.003058,-0.009175,-0.003137,0.000213,-0.001267,-0.002035,-2e-05,-0.002241,-0.000295,0.000173,0.002073,0.003171,0.002544,-0.001869,-0.000554,0.00239,0.000512,-0.001564,0.003358,0.000952,0.000201,-0.002187,0.003589,0.000588,-0.001143,-0.000283,0.001132,-0.000312,-0.001369,-0.001162,0.001522,0.001686,0.000836,-9.7e-05,0.001127,-0.00019,0.000146,0.000772,-0.000156,-0.000726,-0.000286,-0.000373,-0.000185,0.000474,0.000145,4.8e-05,0.000308,5.6e-05,0.000685,4e-04,0.000509,0.000521,0.00018,-0.000705,-0.00081,-0.001345,-0.000613,0.000347,-0.00025,0.000547,-0.001385,-0.00159,-0.000799,0.000625,-0.001388,-0.00059,-0.000406,-0.000243,-0.001019,-0.000272,-0.000518,-0.000374,-0.000302,-0.000216,-8e-06,-0.000347,-0.000465,-0.000197,2.9e-05,0.000219,-0.000313,-0.000516,-0.000503,0.000368,-0.000213,1.4e-05,8.6e-05,-0.00018,-4.4e-05,-2.6e-05,-0.000111,-0.000143,7.5e-05,-0.000275,-0.000179,-0.001001,-0.000845,-0.000298,-0.000172,-0.000469,0.000189,-0.000104,0.000114,-0.000256
0.000105,-5e-06,3.8e-05,-7.3e-05,0.00029,0.001394,0.001213,-0.003516,-8.6e-05,0.000701,8.5e-05,1.3e-05,0.003891,0.003786,0.002918,-0.000894,-0.00179,0.003911,0.001708,0.001621,-0.000233,0.004985,0.001931,-7e-05,-0.000735,-0.001086,0.001373,0.000866,0.000217,-0.000157,-0.000146,-0.001671,-2.1e-05,-0.000857,0.004369,-0.001467,-0.001674,-0.004999,-0.000671,0.000383,0.000291,0.000654,0.001714,-0.002028,-0.000872,-0.00076,0.000796,0.000694,0.000377,0.000165,0.001187,-9.8e-05,0.00057,0.00044,-3.4e-05,0.00049,0.00028,0.000275,-0.000107,0.000343,0.000126,-0.000288,-7.9e-05,-0.000261,-0.000557,-0.000165,-0.000539,0.000115,-3.2e-05,-0.000255,-0.000164,-0.001718,0.000241,-0.000189,0.000155,-0.000173,-0.001731,0.000509,0.000506,9.1e-05,-0.000619,0.000325,0.000312,0.000366,-0.000255,0.000554,-0.000191,-0.000182,-0.00035,-0.000146,0.000142,0.000142,0.000406,-0.000109,0.000106,-1e-04,0.000112,-8e-05,-2e-05,3.2e-05,-1.2e-05,-2e-06,1.7e-05,-0.000114,0.000235,1e-04,3.8e-05,-1e-04,3.2e-05,3.9e-05,-0.00013,0.000489,0.000822,0.000525,0.000198,-6e-05,5.2e-05,-0.000185,0.000114,-1e-06,9.6e-05
-0.000157,-0.000134,1e-06,-0.000101,-0.000505,-0.000293,-0.001219,-0.001962,-0.003394,-0.002288,-0.001411,-0.000122,-0.000911,-0.004692,-0.00154,0.003725,-0.002415,-0.00178,0.002063,0.001806,0.001704,-0.003803,-0.002757,-0.002456,0.000604,0.002957,0.002208,0.000986,-0.000285,-0.000758,-6e-04,0.001709,0.000233,-0.000803,0.000329,-0.000352,0.000892,0.002409,0.003026,0.000764,0.001564,0.003306,-0.002098,-0.000153,-0.001718,-0.002721,-0.001327,-0.000163,-0.000593,-4.7e-05,-0.000864,-0.000491,-0.000823,-0.001255,0.000253,0.000375,-0.000261,-0.000641,0.000132,-0.000356,-3.9e-05,-0.000463,-0.000442,-0.000302,9.4e-05,8.5e-05,-0.000658,-0.000173,0.000162,0.000149,0.000107,-0.000611,-0.001411,-0.000567,-0.000303,-0.00027,0.000569,-0.000443,-0.001758,-0.001028,0.000338,-0.00054,-0.000506,-0.000304,-0.000275,-0.000182,4.2e-05,7e-05,0.000153,-9.9e-05,-0.000613,-6.8e-05,-0.000285,0.000321,6.5e-05,-0.000108,-0.000156,-2e-05,-5e-05,-0.000511,8.7e-05,-1e-06,0.000263,5.7e-05,-0.000301,-0.000116,-6.7e-05,0.00018,-7.2e-05,-6.4e-05,-0.000126,-0.00021,-0.000181,-0.000125,2.8e-05,0.000134,-6e-06,3e-05,-0.000254,-2.2e-05,-0.000335
2.1e-05,6.2e-05,-1e-04,0.000211,-5.6e-05,-0.000383,-0.000713,-0.001635,0.00092,0.000808,0.000446,-0.000945,-0.002725,0.001173,0.001478,-0.002426,0.000218,-0.000765,0.001818,-0.003302,0.00037,-0.001444,0.000251,-0.002207,2e-06,-0.001098,0.000564,0.001942,0.000327,-0.000127,-0.000752,0.001103,-0.002701,-0.002817,0.00026,-0.005468,0.000175,-7.2e-05,-0.002496,-0.003029,-0.000284,0.000604,0.001838,0.000817,-0.000473,0.001342,0.000635,-0.001052,-7.1e-05,-3e-05,0.000242,0.000784,0.000682,0.001032,-0.00048,-0.000643,0.000125,-0.000147,-3.5e-05,-0.000164,-0.000173,-5.7e-05,0.000394,-0.000492,-0.000249,-4.7e-05,-0.000367,-0.000218,-0.000214,0.000128,-2.8e-05,0.001294,-0.000338,-4.7e-05,8.4e-05,-0.000167,8.8e-05,-0.000958,0.000181,0.000484,-0.000104,0.000148,-0.000333,-5.7e-05,-6e-06,8.9e-05,8.3e-05,-0.000236,-0.000119,6.1e-05,7.1e-05,-4.2e-05,5.2e-05,-0.000141,-9e-05,0.000153,-3.8e-05,6e-05,-4.7e-05,-0.000126,5.4e-05,4.8e-05,9.9e-05,-8.3e-05,-2.8e-05,-0.000102,6.5e-05,5.8e-05,-6.9e-05,-8.7e-05,4.3e-05,2.4e-05,-0.000521,-0.000295,2.8e-05,-4.2e-05,7.9e-05,-0.000175,0.000148,4.7e-05,-0.000129
-5.3e-05,-0.000273,-0.000149,-0.000373,0.000101,0.000345,-0.000414,-0.000802,-0.00021,-0.001388,-0.001149,7.9e-05,0.000886,-0.000711,-0.001669,-0.000445,0.000187,-0.000352,-0.003135,-0.002044,-0.000123,-0.000138,0.001113,0.002566,0.001315,-0.000913,-0.001225,-0.000115,0.001123,-0.000731,0.000369,0.000203,-0.000173,-1e-04,-0.002001,0.00483,-0.001629,0.001594,0.001375,0.001514,-0.000386,0.001396,-0.00059,0.000641,0.001545,-0.000227,0.000829,0.001202,-0.000126,0.000833,-0.000234,-0.000522,-0.000161,2e-05,0.000545,0.00012,-1.8e-05,0.000175,-0.000368,-0.000138,-0.000317,4.8e-05,-0.000216,-0.000287,-0.000138,-0.000131,0.000154,0.00036,2.2e-05,-8.6e-05,-5.5e-05,8e-06,0.000349,-0.000608,-0.000321,-0.000331,-2e-06,0.000795,0.000218,-0.00025,-0.000132,-6e-05,-0.000337,-5.9e-05,-0.000442,0.000153,-4.9e-05,0.000232,-3.4e-05,-9.7e-05,6.9e-05,2.6e-05,-0.000169,-4.2e-05,0.000101,-0.000199,-1.3e-05,-0.000333,1.6e-05,6.3e-05,-6.4e-05,-0.000156,-0.000166,-5.6e-05,-2e-06,-5.7e-05,2e-06,-0.000146,3.7e-05,-5.2e-05,-0.000104,-0.000101,0.000378,0.000327,0.000287,6.3e-05,-0.000206,-7.3e-05,7.2e-05,-8.3e-05,-2.7e-05
-8.8e-05,9.4e-05,3.2e-05,0.000161,-3.9e-05,-1e-05,0.000746,0.003171,-0.000204,0.000211,0.000581,5.2e-05,-0.001416,0.000392,0.003272,0.001476,0.001909,-0.00185,-5e-05,0.002267,0.001116,0.002579,-0.001047,0.000317,0.000839,0.000219,-0.001046,-0.002297,-0.001338,-0.00162,0.000439,-0.003132,0.000488,0.001265,3.3e-05,-0.000334,-2e-06,0.000551,-0.000434,0.000332,-0.001188,-0.000342,0.000251,-0.001578,-0.000948,0.000425,0.000787,-0.000478,8.6e-05,-0.000373,0.000279,0.000384,0.000515,0.000111,-0.000258,-0.000218,0.000193,9.3e-05,0.000175,4.1e-05,0.000156,3.8e-05,-0.000124,7.7e-05,-0.000229,-6.5e-05,0.000248,-0.000366,-3.7e-05,-0.000166,2.9e-05,-0.000342,0.000201,0.000267,-0.000133,0.000159,-0.000148,0.000294,0.000492,0.000113,-2.3e-05,-0.00017,-4.5e-05,-0.000305,0.000136,0.000119,0.000191,-0.00019,2.2e-05,1.9e-05,-3.6e-05,0.000225,4e-05,8.1e-05,0.000146,-3e-06,3e-05,0.000197,4.4e-05,-5.7e-05,-0.000134,-6.5e-05,0.000123,-7.5e-05,-0.000178,0.000113,1e-05,-1.4e-05,9.1e-05,9e-06,-0.000129,-2.3e-05,-0.000104,-7e-06,8.3e-05,-8e-06,0.00017,-7.9e-05,3e-06,-8.2e-05,6e-05
-8.7e-05,-6e-06,-1.4e-05,-2.7e-05,-0.000143,-0.000114,-0.00023,-0.002189,0.000118,-0.001036,-0.000531,0.000306,0.001021,-0.000692,-0.002156,-0.000907,-0.001535,-0.000484,-0.000745,-0.001373,-0.000902,-0.001833,-0.002042,-0.000347,-0.0011,0.000101,0.000476,0.001977,-0.000339,0.00089,0.000375,0.000648,-0.000874,-0.000533,0.001002,0.001002,0.001706,1e-04,0.001241,-0.001434,0.000109,-0.00065,0.000429,-0.000702,0.000352,-0.000567,-0.001105,0.000426,-8e-05,-0.000196,-0.000105,-0.000126,-0.000201,-0.000421,0.000167,0.000386,-0.000239,-0.000291,-8.5e-05,-0.000138,-0.000116,-0.000142,-0.000105,0.00012,-9.3e-05,-0.000212,-0.000241,-0.000332,-4.2e-05,-7.6e-05,3.5e-05,8e-06,-0.000269,-0.000881,-0.000398,-0.000322,9.3e-05,-0.000108,-3.4e-05,-0.000102,-0.000175,0.000266,-0.000318,-2.7e-05,-0.000254,-0.000144,4.7e-05,0.000163,3.7e-05,2.4e-05,-9e-06,7.5e-05,-2.4e-05,-4.7e-05,0,8.6e-05,-3.7e-05,-0.000168,-9.5e-05,0.00013,2e-06,3e-06,-0.000202,-1.4e-05,0.00012,-3.3e-05,-4.5e-05,2.1e-05,1.5e-05,-3.2e-05,-2.1e-05,-0.000208,0.000545,-0.000129,-8.3e-05,-0.000191,-0.000112,0.000136,0.000113,-1.3e-05,-1e-05
3e-05,-4.6e-05,2e-06,-8.3e-05,-1e-05,0.000132,-5.2e-05,0.000926,-0.00034,-0.000243,3e-04,0.000295,-3e-05,-5e-05,0.000593,0.000258,0.00043,-0.00057,0.002047,0.00143,-0.00176,0.00078,0.000468,0.000242,3.2e-05,0.00025,0.000847,-0.001515,0.000104,0.000171,1.3e-05,0.001553,0.00144,0.000305,-0.000714,-0.001364,0.00021,-0.000764,-8e-04,0.000346,0.000548,-0.000191,-0.000603,0.00031,-0.000506,1.8e-05,6e-04,1e-05,0.000131,-0.000277,-0.000342,-8.8e-05,-0.000164,6e-06,7.7e-05,-0.000234,9.1e-05,0.000198,0.000132,4.7e-05,1.1e-05,-0.000115,4e-05,-0.000255,-2.1e-05,-3.9e-05,-3.8e-05,-0.000171,-3e-06,5.3e-05,6.3e-05,-7.1e-05,-0.000112,0.000702,0.00016,-9e-06,-9.3e-05,-0.000259,-5.9e-05,0.00048,-0.000273,-0.000172,0.000281,0.000104,-0.000125,0.00011,-0.000119,4.1e-05,3.9e-05,2.1e-05,3.1e-05,-4.1e-05,-0.000133,4.2e-05,-8.4e-05,-0.000105,-3e-05,0.000122,4e-05,4e-06,-0.000118,-8.8e-05,-1.9e-05,-1.5e-05,-1.1e-05,3e-05,-4.3e-05,-3.5e-05,-6e-06,-7.2e-05,3.4e-05,0.000173,-0.000164,8.5e-05,-3e-06,-5.6e-05,-3e-06,-1e-05,-3.8e-05,-6.1e-05,-7.5e-05
6.8e-05,9.1e-05,-2e-06,1.5e-05,6.8e-05,-0.000251,-0.000586,-0.000887,-9.9e-05,-0.00045,0.00014,0.000209,-0.000231,-0.000245,-0.000421,-0.00061,-0.000791,0.000221,-0.00024,0.00259,0.000273,0.000695,-0.000422,0.000279,0.000236,7e-06,0.000123,0.001621,-0.000481,0.00041,0.000232,-0.001218,-0.001387,0.000349,0.000885,0.001545,0.000201,0.00028,-0.000843,0.000685,-0.000226,0.000673,-0.000431,0.000381,0.000147,0.000129,-0.000198,-7.2e-05,-0.000181,0.00013,0.000268,0.000112,0.000344,-0.000257,-2e-04,0.000139,-0.00014,7.2e-05,5.5e-05,0.000119,3.4e-05,-3.1e-05,-1e-05,0.000104,0.000134,-0.000177,5.8e-05,-0.000248,-1.6e-05,2.7e-05,-0.000185,-2.2e-05,0.000156,-0.000482,-0.000246,6e-06,0.000173,0.00026,-0.000212,-0.000178,0.000259,0.000102,0.000161,-0.000234,4.3e-05,-8e-06,-8e-06,-0.000161,9e-06,1.8e-05,4.6e-05,-6.9e-05,1.9e-05,2.1e-05,-2e-06,5.1e-05,6.3e-05,-6e-06,9.9e-05,6e-06,-0.000144,5e-05,-0.000102,1e-06,-3.3e-05,-1.5e-05,-1.4e-05,2.9e-05,1.7e-05,4.7e-05,-3e-05,-8.5e-05,0.000126,5.5e-05,-1.3e-05,-2.4e-05,1.5e-05,6.9e-05,4e-06,1.2e-05,-4.7e-05
3.1e-05,-2.8e-05,2.8e-05,-4e-06,-4.6e-05,6.9e-05,0.000652,0.000164,-5.6e-05,0.000285,-8.1e-05,-6e-06,0.00057,-0.000214,-0.00026,0.000536,0.000544,8.2e-05,-0.000893,0.000232,0.001542,-0.000451,0.000295,-0.000112,8.9e-05,-0.000484,-9e-04,-0.001052,-0.000253,-0.000625,-0.000159,0.000482,0.000833,0.000154,-0.000259,-0.00131,-0.000772,7.2e-05,-0.000394,-0.000535,9e-06,-5.8e-05,-0.000725,-9e-04,-0.000284,4.6e-05,-0.00048,0.000245,0.000225,0.000218,4e-06,-5.5e-05,-0.000131,6.9e-05,3.7e-05,-0.000108,7.6e-05,-1.8e-05,-0.000129,-1.1e-05,2.7e-05,1e-06,-1.4e-05,-7.6e-05,7.2e-05,-3.1e-05,-0.000162,0.000155,-1.3e-05,6.4e-05,8.9e-05,0.000201,-1e-04,0.000362,5.5e-05,-1.5e-05,1.5e-05,8.5e-05,4.9e-05,-5.6e-05,-0.000205,-6e-06,0.00015,0.000283,-8e-06,-4e-06,-3.3e-05,0.000141,-7e-06,-2.7e-05,-3.1e-05,-7e-05,-1.1e-05,-3.8e-05,-6.6e-05,6.7e-05,-3.7e-05,-4.5e-05,-3.8e-05,-8.4e-05,1.8e-05,6e-06,-2e-05,-1e-05,-2.8e-05,-3.4e-05,-3e-06,-6.8e-05,-1.4e-05,5.9e-05,6e-06,5.2e-05,-0.00011,-3.7e-05,-7.4e-05,-6.2e-05,1.4e-05,-5.7e-05,-6.3e-05,-1.5e-05,1.5e-05
-3.1e-05,1.1e-05,-2.6e-05,-1e-06,-6.6e-05,-1.9e-05,-0.000379,-0.000374,0.000229,5.2e-05,-6e-06,8e-05,-0.000669,0.000376,-0.000819,-0.000205,-5.3e-05,0.000254,0.000392,-0.00103,0.000276,5.9e-05,-4e-05,0.000263,0.000141,0.000171,-6e-06,0.000643,0.000391,-0.000435,0.000139,-0.000395,-0.001101,-0.000176,-0.000169,1.6e-05,0.000743,5e-04,0.000131,-0.000206,-0.000321,-0.000496,-5.8e-05,0.000477,-0.000216,-0.000343,-5.5e-05,0.000103,-0.000226,-3.2e-05,0.000238,-5.4e-05,-5.5e-05,0.000296,0.000121,-3e-06,-1e-05,-9.9e-05,-4.9e-05,-2e-05,-2.9e-05,0.000112,-7e-06,-2.1e-05,4e-06,-3.6e-05,1.9e-05,0.000166,-7e-06,-2.7e-05,-2e-05,-1.9e-05,-9.1e-05,7.6e-05,-9.8e-05,-2e-06,9e-05,-0.000194,3.4e-05,-0.000291,5.5e-05,-5.9e-05,-0.000178,-2e-04,0.000123,-3.9e-05,-9.1e-05,-0.000134,-3.2e-05,2.2e-05,1.8e-05,-1.4e-05,5e-06,6.6e-05,-3.5e-05,-5.4e-05,-5e-06,-9e-06,-9e-06,-9e-06,-4.2e-05,-3e-05,1.7e-05,3.3e-05,1e-05,5.9e-05,3e-06,3.9e-05,-8e-06,9e-06,-8e-06,-4.5e-05,2e-06,-0.000119,-2e-06,3.8e-05,3e-05,5.7e-05,2.9e-05,-4e-06,2e-06
2e-05,5.5e-05,3e-06,1.1e-05,9.6e-05,-3e-06,6e-05,-0.000114,-0.000181,2.3e-05,0.000129,-3.6e-05,0.000253,-0.000348,8e-06,0.000241,0.000336,0.000229,0.000447,-4.9e-05,0.000533,-0.000741,0.000435,-0.000305,-6e-06,0.000501,0.000517,-0.000306,-0.000311,9.4e-05,0.000104,-0.000211,0.00023,0.000447,0.000497,-0.00029,5.8e-05,-0.000257,0.000258,0.000284,0.000518,-0.00034,-0.000255,-0.000354,0.00013,0.000116,-0.000132,-6.5e-05,2.7e-05,-0.00018,-0.000173,-0.000113,9.1e-05,-0.000158,3e-06,3.3e-05,-2e-05,5.3e-05,0.000115,2.3e-05,3.8e-05,-4.3e-05,-4.3e-05,-3.2e-05,-5.5e-05,7e-06,8.3e-05,-3.6e-05,3.1e-05,-6.7e-05,3.5e-05,-0.000146,0.00011,-0.000311,-5e-05,-1e-05,-2.3e-05,-4e-06,1.1e-05,9e-05,4.2e-05,4.8e-05,-0.000166,5.4e-05,8.1e-05,-4.1e-05,3.2e-05,-4e-06,2.1e-05,1.8e-05,5e-06,-1e-05,3.2e-05,-3.7e-05,-1e-05,-4.8e-05,3.1e-05,2.1e-05,-2e-05,2.8e-05,0.000105,2.7e-05,-7e-06,-2.3e-05,2.8e-05,-2.5e-05,-2e-06,-2.8e-05,1e-06,2.4e-05,-1.4e-05,2.4e-05,-1.5e-05,-3e-05,9.2e-05,2e-05,-1.1e-05,-4e-05,-2e-05,2.2e-05,0
-1.3e-05,-2.7e-05,-1.1e-05,-9e-06,-5.2e-05,-5e-06,-0.000227,0.000325,1e-05,4.1e-05,1.9e-05,-5.4e-05,-0.000231,0.000232,-0.00057,-0.000721,-9.9e-05,-0.000538,0.000305,9.1e-05,0.000302,3e-04,-0.000498,0.000436,-8.4e-05,-0.000106,-0.000105,1.2e-05,0.000406,-4e-06,0.000124,-4.7e-05,-9e-05,-0.000283,-0.00021,0.000705,0.000171,-0.000281,0.000164,-7.3e-05,0.000178,-0.000425,0.00033,-0.000325,1e-04,0.000157,0.000142,-0.000188,-4e-05,2.3e-05,6.3e-05,0.000208,-0.000113,-2.6e-05,-2.8e-05,-3.8e-05,3.3e-05,-1.2e-05,-1.2e-05,2.5e-05,-4.6e-05,-7.3e-05,5e-05,1.8e-05,-5.6e-05,-9e-06,3.2e-05,7e-05,-4.4e-05,3.7e-05,-3.9e-05,-4.5e-05,7.4e-05,0.000287,6.7e-05,-2e-06,4.7e-05,0.000138,3.2e-05,-0.000126,6.3e-05,-1.7e-05,8.7e-05,1.1e-05,-8.7e-05,-2.1e-05,-1.2e-05,3.9e-05,-1.7e-05,-1.3e-05,3e-06,-1.9e-05,1.1e-05,8e-06,3e-06,-3e-06,-1.4e-05,9e-06,2.3e-05,-1e-06,2.3e-05,-8e-06,2e-06,4e-06,-4.9e-05,-2e-05,-3e-06,2.6e-05,1.4e-05,-1.9e-05,1.5e-05,-2.6e-05,-5.4e-05,6.9e-05,-0.000117,1.4e-05,7e-06,-1e-05,1.2e-05,3e-06,2e-06
4e-06,-1.3e-05,-7e-06,0,-2.3e-05,3e-06,0.000515,0.000179,5.8e-05,-0.000149,3.5e-05,-2.3e-05,-6.7e-05,-0.000312,0.000308,0.000559,-3.8e-05,0.000462,-0.000466,0.000308,-0.000611,-0.000267,-9.5e-05,0.000252,-4.6e-05,-0.000379,-0.000335,-7.7e-05,-0.000155,0.000382,-4.1e-05,3e-04,0.000347,-1.9e-05,2.2e-05,-5e-05,-0.000101,-0.000217,-0.000263,-0.000116,-0.00052,0.000235,0.000154,8.3e-05,-3.3e-05,-1e-04,-0.000163,0.000208,6.2e-05,1.9e-05,-7.4e-05,-8.3e-05,-4e-05,1.8e-05,-1e-06,2.8e-05,-5.7e-05,-4.1e-05,-1.4e-05,-1.3e-05,-1e-06,-1.7e-05,1.2e-05,1.9e-05,1e-05,5e-06,-5.4e-05,-1.8e-05,-1.4e-05,1.7e-05,-1e-06,6.8e-05,-0.000107,-0.000131,8.5e-05,2.8e-05,-7e-06,-8e-06,-1.8e-05,0.000296,-9.4e-05,2.9e-05,-3.7e-05,-1e-06,-1.9e-05,-2.6e-05,-3.5e-05,-3.6e-05,1.9e-05,4e-06,-1e-06,3.1e-05,-2e-05,1.3e-05,5e-06,-3.8e-05,-1.4e-05,-1e-06,2.3e-05,1.7e-05,4.8e-05,5e-06,3.2e-05,-8e-06,4.2e-05,2.8e-05,-1e-06,-2.8e-05,2e-06,-1.3e-05,-1e-06,6.1e-05,6.2e-05,-1e-06,-2.2e-05,1.8e-05,-2.3e-05,-2e-06,-6e-06,-5e-06,5e-06
-1.1e-05,9e-06,-1e-06,7e-06,-3e-06,-3e-06,-0.000257,-7.8e-05,-8.9e-05,-5.5e-05,3e-05,-3.2e-05,0.00028,-1.7e-05,-0.000413,-0.000201,-3e-05,-0.000323,-0.000196,-0.000379,-0.000318,3e-06,0.000282,-9e-05,-1.9e-05,-0.000222,-3.8e-05,0.000106,8.9e-05,-0.000132,3.7e-05,-0.000263,-0.000379,4.3e-05,0.000111,0.000151,2.5e-05,-0.00013,0.000251,-0.000365,0.000216,3.8e-05,0.000102,0.000126,-4.9e-05,5.5e-05,-2.4e-05,-0.000259,-2.6e-05,-1e-06,1e-05,2.7e-05,8.1e-05,6.2e-05,-3.9e-05,-1.1e-05,5.9e-05,3e-05,7e-06,-1.5e-05,5e-06,-1e-06,2.2e-05,1.3e-05,2.8e-05,0,-4.6e-05,-1.5e-05,4e-06,-2e-06,-1.2e-05,4.1e-05,-4.9e-05,-8e-06,-5.6e-05,-3.1e-05,1.8e-05,-0.000115,-4e-05,-3.2e-05,0.000102,-1.7e-05,-3.5e-05,-1.2e-05,-4e-06,-1.9e-05,-1.3e-05,4.1e-05,-3e-06,-8e-06,-6e-06,-8e-06,-7e-06,-1.1e-05,-2.1e-05,-4e-06,6e-06,-4e-06,-2.2e-05,3e-06,-2.5e-05,-4e-06,3e-06,-3e-06,2e-06,0,4e-06,1.3e-05,-3e-06,-1.3e-05,-9e-06,-5.9e-05,-8e-06,-4.1e-05,1.2e-05,-2e-06,3.3e-05,2.2e-05,2e-06,0,-1.7e-05
5e-06,-9e-06,-5e-06,-9e-06,1.1e-05,5e-06,6.2e-05,-0.000169,-4.3e-05,-0.000187,7.1e-05,3e-06,-0.000282,-1.1e-05,0.000655,-1e-06,8.2e-05,-2e-05,0.000177,-0.000135,-0.00042,0.000346,2e-06,6.8e-05,-5.1e-05,0.000106,0.000109,0.000103,6.4e-05,0.00011,0.000102,0.000137,0.000739,-0.000195,-0.000118,-0.000185,0.000156,0.000251,7e-06,0.000234,-2e-06,-7.2e-05,-6e-06,-0.000189,-2.7e-05,-4.5e-05,0.00021,2e-05,-1e-05,-3e-06,2.2e-05,-1.9e-05,-2.4e-05,-6e-06,8.6e-05,-1.5e-05,-2.7e-05,2.9e-05,-1.9e-05,1.3e-05,-2.3e-05,2.2e-05,-2.7e-05,-4.3e-05,-1.1e-05,0,2.6e-05,-1.8e-05,9e-06,2e-06,-6e-06,2.4e-05,6.3e-05,-6.1e-05,2.4e-05,1.6e-05,1.3e-05,2.6e-05,-3.8e-05,-9.4e-05,-3.8e-05,2.2e-05,2.2e-05,1.4e-05,-1.7e-05,-8e-06,-1.5e-05,-2.3e-05,-2e-06,9e-06,5e-06,-1.7e-05,0,1e-05,-1.4e-05,2.8e-05,7e-06,-1e-05,0,-1.8e-05,2.6e-05,-1.4e-05,1.3e-05,-9e-06,-2.4e-05,-1e-05,0,-1.1e-05,-4e-06,-1.3e-05,-7e-06,2.4e-05,7e-06,-5e-06,1.8e-05,3e-06,-1.8e-05,-7e-06,-1e-05,-2e-06,-7e-06
-1.2e-05,1e-06,-1e-06,2e-06,-7e-06,-6e-06,-0.000116,-0.000127,4.1e-05,1e-05,-4.5e-05,2.5e-05,0.000242,-9.2e-05,-0.000289,7.4e-05,0.00016,3e-06,0.000166,0.000647,-0.00026,0.000172,5e-05,-2e-05,0.000127,0.000181,5.6e-05,-0.00019,-0.000181,-2.8e-05,-0.000113,-9.9e-05,-0.000312,0.00011,-7.9e-05,-9.5e-05,-3.8e-05,-7.3e-05,-1.3e-05,4.4e-05,5.1e-05,-9.3e-05,-5.7e-05,3.5e-05,-2.9e-05,2.6e-05,-0.000237,-5.9e-05,3.7e-05,-2e-06,-6.1e-05,-1.3e-05,-2.1e-05,5e-05,-4.1e-05,2.2e-05,4.4e-05,-1e-06,3.4e-05,1.7e-05,2e-05,1.1e-05,7e-06,-1.1e-05,1e-05,-6e-06,-3e-05,-2.9e-05,3e-06,-2e-05,1e-06,-3e-05,3e-06,8.5e-05,-5.8e-05,-1.4e-05,8e-06,8.3e-05,2.2e-05,-5.3e-05,-3.5e-05,1.2e-05,1e-05,-2.9e-05,2e-05,-1e-05,5e-06,-2.1e-05,4e-06,6e-06,-5e-06,2e-06,-1.3e-05,7e-06,1.7e-05,-1e-05,0,1.9e-05,3e-06,-2e-05,-3.4e-05,0,9e-06,1e-06,1.6e-05,0,1e-06,6e-06,2e-06,1.4e-05,0,-1.3e-05,-1.9e-05,6e-06,1e-05,2e-06,1e-05,1.9e-05,-5e-06,-7e-06,-8e-06
9e-06,2.2e-05,-1e-06,-3e-06,-3.2e-05,5e-06,0.000275,4.3e-05,7e-05,-7.6e-05,0.000103,1.4e-05,-8.9e-05,0.000196,0.00036,-8.2e-05,6e-06,-0.000167,-3e-05,-7.8e-05,-0.000121,-0.000145,-0.000209,2.1e-05,-0.000126,-0.000209,-9.7e-05,0.000175,0.000183,-3e-05,-0.000146,1.9e-05,0.000469,-3.1e-05,0.000121,-0.00024,9e-06,1.6e-05,2.2e-05,-0.000132,3.7e-05,-6.2e-05,7e-05,-9.1e-05,-7.2e-05,-0.000125,7.7e-05,1.2e-05,-3.5e-05,-2.3e-05,3.3e-05,1.7e-05,-2e-06,-1.4e-05,6.5e-05,-3.8e-05,-4e-05,-2e-05,0,-6e-06,1e-05,-1.9e-05,-1.7e-05,1.4e-05,-2e-06,-5e-06,-3.4e-05,-3.6e-05,3e-06,-7e-06,-4e-06,-5.8e-05,-4.1e-05,-1.6e-05,-4.5e-05,2e-06,-6e-06,-4.8e-05,2.7e-05,1.4e-05,3.8e-05,-1.8e-05,1.1e-05,3.7e-05,6e-06,-1e-05,1.4e-05,3.1e-05,-5e-06,-6e-06,1.6e-05,-6e-06,1e-05,-1.4e-05,9e-06,6e-06,-9e-06,-1.2e-05,8e-06,4e-06,-1.9e-05,-1e-06,-1.7e-05,-3e-06,-9e-06,-2e-06,0,-3e-06,-1e-06,1e-06,0,-9e-06,-4.5e-05,1.3e-05,-1.2e-05,-1.2e-05,-8e-06,-9e-06,8e-06,3e-06,1e-05
1.5e-05,-1.7e-05,0,3e-06,2.7e-05,-1e-06,-0.000205,-6.8e-05,-6.4e-05,-2.1e-05,-4.8e-05,-4e-06,-2.3e-05,-0.000145,-1.4e-05,1.9e-05,5.3e-05,0.000127,-0.000302,-3.2e-05,-6.3e-05,-0.00015,3.5e-05,3.7e-05,3.7e-05,-0.000173,4.2e-05,-0.00012,-4.7e-05,-7.5e-05,6e-06,6.8e-05,-0.000393,-0.000104,-5.4e-05,0.000102,-0.000101,-0.000239,1.5e-05,3e-05,-9.5e-05,0.000109,-5e-06,-3.1e-05,0.000113,4.6e-05,2.2e-05,-2.3e-05,-1.6e-05,3.1e-05,-5e-05,1e-06,-3.6e-05,-6e-05,-4.3e-05,3.8e-05,1.7e-05,5e-06,-2.2e-05,-7e-06,-2e-06,-2.5e-05,1.8e-05,-2.8e-05,-1e-06,-7e-06,5e-05,-6.6e-05,-6e-06,1.1e-05,-2e-06,1e-05,2.2e-05,3e-05,-1.1e-05,-8e-06,2e-06,-5.8e-05,-6e-06,-2.1e-05,-2.5e-05,3.3e-05,-2.1e-05,-3e-05,-1e-06,-3e-06,-1.3e-05,-3.4e-05,-2e-06,1e-06,-2e-06,1.5e-05,-9e-06,1e-05,9e-06,9e-06,7e-06,8e-06,-7e-06,5e-06,-1.2e-05,-1e-06,-1e-06,2e-06,7e-06,6e-06,-3e-06,-2e-06,-1e-06,8e-06,-2e-06,1.2e-05,1.2e-05,-2.6e-05,1.7e-05,-1e-05,4e-06,-2e-06,-7e-06,-3e-06,-5e-06
8e-06,1.2e-05,-5e-06,-6e-06,-1.2e-05,-3e-06,5e-06,0.000127,-5e-06,-7.2e-05,0.000107,-5e-06,8.3e-05,1.2e-05,6.3e-05,8.3e-05,-3.5e-05,-0.000117,-3.7e-05,1.6e-05,0.000148,6.9e-05,9e-06,1.5e-05,-2.2e-05,0.000118,-1.1e-05,0.000142,4.3e-05,-0.000164,8.5e-05,-0.000168,-5.2e-05,0.000162,-5.8e-05,0.000205,-4.1e-05,-7.8e-05,0.000158,0.000127,-3.7e-05,0.000155,0.00012,-5.8e-05,3.6e-05,2.8e-05,-3e-06,2.6e-05,3.5e-05,-2.6e-05,5.5e-05,-9e-06,6.2e-05,7e-06,-2e-06,-2.6e-05,-2.2e-05,1e-05,2e-06,1e-05,7e-06,-1.1e-05,-1e-05,-1e-06,1.1e-05,-6e-06,9e-06,-1.3e-05,7e-06,1.2e-05,3e-06,4.2e-05,3.3e-05,-2e-05,8e-06,-1e-06,-5e-06,5e-05,-1.6e-05,1.4e-05,-2.1e-05,-3.3e-05,7e-06,-2e-06,1.3e-05,5e-06,-2e-06,2.9e-05,5e-06,-2e-06,-5e-06,1.1e-05,1.2e-05,-1e-06,0,-1.7e-05,2e-06,-1e-05,9e-06,9e-06,-1.3e-05,0,-2e-05,-2e-06,-1e-05,-1e-06,-2e-06,-1e-06,1e-06,1e-06,-1e-06,6e-06,-1.6e-05,1.7e-05,6e-06,-7e-06,2e-06,-6e-06,1e-05,2e-06,1e-06
-9e-06,3e-06,0,7e-06,-1.3e-05,3e-06,-2.6e-05,-9.9e-05,-2.6e-05,1.9e-05,-2.8e-05,-9e-06,-0.000192,-5.1e-05,0.000118,-0.000101,4.3e-05,0.000132,0.000233,-0.000134,3.6e-05,-0.000113,-0.000101,8.1e-05,-5.5e-05,0.00014,-2.9e-05,-0.000208,0,9.5e-05,2.7e-05,1e-04,-2.1e-05,-4.2e-05,0.000102,1.9e-05,0.000187,4.3e-05,8e-06,-0.000101,-1.2e-05,9.9e-05,-1.1e-05,1.2e-05,-2e-05,6.6e-05,2e-06,-8e-06,-1e-05,2.5e-05,-9e-06,-4e-05,-4e-05,3.4e-05,-4e-06,-8e-06,1.5e-05,-2.5e-05,3e-06,7e-06,-1e-06,1e-05,-2e-06,2.6e-05,-1.8e-05,-6e-06,-3.2e-05,2.8e-05,1e-06,2e-06,-3e-06,1.7e-05,-3.8e-05,3.8e-05,-9e-06,3e-06,7e-06,4.2e-05,-5e-06,1.9e-05,3.6e-05,9e-06,-2.6e-05,2.9e-05,-8e-06,6e-06,7e-06,-1.3e-05,-3e-06,5e-06,4e-06,-7e-06,-1.1e-05,-1e-06,6e-06,-9e-06,-5e-06,4e-06,-9e-06,1e-06,2e-06,-4e-06,-9e-06,3e-06,8e-06,-8e-06,-1e-06,0,0,3e-06,-2e-06,-1.7e-05,2.8e-05,3e-06,-1.3e-05,-9e-06,-3e-06,3e-06,-4e-06,-1e-06,-6e-06
-5e-06,-1.6e-05,-3e-06,-4e-06,0,0,0.00014,0.000168,-4e-06,3.9e-05,1.6e-05,-1e-06,0.000152,-6.5e-05,-0.000172,-5.1e-05,2.1e-05,-7e-05,-1e-05,-0.000191,0.00016,0.000109,0.000179,-6.8e-05,7.8e-05,-2.8e-05,1.1e-05,0.000177,-5.2e-05,3.4e-05,6.9e-05,-0.000102,9e-06,-3.8e-05,-9.2e-05,6.7e-05,-0.000155,9.5e-05,-0.000172,6.3e-05,0.000163,3.9e-05,-4.4e-05,-4.1e-05,-2.4e-05,-5e-05,-2.9e-05,9e-06,-1.4e-05,2.4e-05,2.5e-05,6.2e-05,1.9e-05,1.1e-05,-3e-06,3.3e-05,-1e-06,8e-06,2e-06,-1e-05,-1.5e-05,1.6e-05,-7e-06,3e-06,-4e-06,-1e-06,-2e-05,2.6e-05,-4e-06,-1.3e-05,4e-06,-1.7e-05,-2.9e-05,-8.5e-05,1.9e-05,-4e-06,-2e-06,-5.2e-05,-4e-06,5e-06,-2.3e-05,5e-06,-1.2e-05,-5.4e-05,-7e-06,1e-06,-7e-06,-3e-06,1e-06,-1e-06,0,3e-06,1e-05,5e-06,4e-06,-1e-06,2e-06,3e-06,6e-06,-4e-06,1e-06,4e-06,-3e-06,-2e-06,5e-06,1.1e-05,1e-06,-1e-06,-1e-06,0,-1e-06,1.4e-05,-5e-06,-1.5e-05,1e-05,4e-06,6e-06,-7e-06,2e-06,1e-06,0
-6e-06,1e-05,-1e-06,-2e-06,4e-06,-2e-06,-0.000112,-0.000171,1.1e-05,-1.2e-05,4.1e-05,-4e-06,-6.5e-05,6.7e-05,0.000177,0.000238,8.2e-05,1.7e-05,-4.2e-05,-2.4e-05,0.000225,4.2e-05,-0.000123,-4e-05,-2.3e-05,-0.000126,2.8e-05,-0.000114,2.1e-05,5.9e-05,2.7e-05,4.4e-05,-1.3e-05,4.9e-05,2.8e-05,-8.9e-05,3.1e-05,8.4e-05,-0.000101,-0.00013,-0.000145,4e-06,-0.000128,-3.1e-05,-3.5e-05,-2.8e-05,5.6e-05,-2.4e-05,2.4e-05,-3e-05,-4e-06,-2.7e-05,1.2e-05,-1.8e-05,-1.5e-05,-1.9e-05,0,1.6e-05,8e-06,-3e-06,6e-06,5e-06,-2e-06,-1.5e-05,6e-06,-2e-06,3e-05,4.2e-05,-1e-05,-1e-06,-4e-06,-3.1e-05,3.7e-05,2.7e-05,1.1e-05,3e-06,-1e-06,-2.5e-05,-9e-06,-1.2e-05,3e-06,-1.4e-05,-1.3e-05,6.2e-05,1.5e-05,2e-06,2e-06,3e-06,0,-3e-06,-1e-06,4e-06,-3e-06,-5e-06,-1.2e-05,-1.1e-05,1e-06,0,-3e-06,-7e-06,2e-05,-4e-06,-4e-06,-1e-06,-1.7e-05,-2e-06,0,1e-06,-1e-06,-7e-06,0,-7e-06,1e-05,3e-06,1.6e-05,7e-06,-6e-06,9e-06,-2e-06,1e-06,-2e-06
0,-5e-06,-2e-06,6e-06,-3e-06,0,-2.1e-05,5.1e-05,3.9e-05,-6e-05,-3.5e-05,3e-06,2.3e-05,-1.8e-05,-0.000285,-0.000193,1.5e-05,-1.8e-05,-0.000135,0.000137,-4.2e-05,7.7e-05,-9e-05,3.9e-05,-5e-06,9e-06,-5.3e-05,2.4e-05,-3.8e-05,-3e-06,-5.8e-05,-1.2e-05,8.4e-05,-5.4e-05,5.5e-05,-1e-04,-0.000108,-4.8e-05,-1.7e-05,0.000115,5.5e-05,2.2e-05,-6.5e-05,-1.9e-05,-4e-06,4e-06,-6.4e-05,-2.4e-05,-1.6e-05,1.2e-05,0,5e-06,-3.1e-05,1.9e-05,1.2e-05,1.5e-05,2e-06,-1.6e-05,-6e-06,1e-05,-9e-06,-1e-05,9e-06,-1e-05,-6e-06,0,-8e-06,9e-06,-5e-06,4e-06,0,-5e-06,1.1e-05,3.2e-05,1.9e-05,-2e-06,-3e-06,5.1e-05,9e-06,1e-06,2e-05,1.7e-05,1.7e-05,-3.1e-05,-7e-06,5e-06,9e-06,-6e-06,-1e-06,1e-06,-4e-06,-6e-06,-6e-06,0,0,-2e-06,-1e-06,-6e-06,4e-06,-1e-05,-7e-06,2e-06,4e-06,-1e-06,1.7e-05,-5e-06,-1e-06,-3e-06,0,1e-06,0,-2e-06,-1e-06,1e-05,-1.2e-05,2e-06,4e-06,0,0,-1e-06,0
4e-06,-3e-06,-2e-06,-7e-06,-1.8e-05,1e-06,3e-05,-6.3e-05,-6e-06,-7.4e-05,6e-05,2e-06,4.8e-05,7e-06,0.000116,9.9e-05,1.8e-05,-5.2e-05,9.7e-05,3.6e-05,-5.6e-05,2.4e-05,1.7e-05,-3e-06,-1e-06,0.000143,-3.5e-05,9e-06,5.1e-05,-8.6e-05,-5.2e-05,-3.2e-05,-0.000154,0,-8.5e-05,-0.000169,0.000114,-5.4e-05,8e-05,-8.6e-05,-1.1e-05,7e-05,-2.5e-05,1.3e-05,1.3e-05,-5e-06,-1.3e-05,5e-06,3e-06,-7e-06,8e-06,0,2.4e-05,-2.7e-05,-2e-05,-1.2e-05,-1.2e-05,1e-06,-3e-06,0,2e-06,-1.7e-05,-4e-06,0,9e-06,-1e-06,-2.1e-05,6e-06,6e-06,1e-06,0,2.1e-05,-2.5e-05,-0.000109,-1.6e-05,0,-1e-06,9e-06,5e-06,-1.4e-05,-1.2e-05,-9e-06,9e-06,-3e-06,-7e-06,4e-06,-7e-06,-3e-06,1e-06,1e-06,2e-06,-7e-06,6e-06,3e-06,1e-06,8e-06,-3e-06,4e-06,-2e-06,6e-06,2.9e-05,0,8e-06,0,-6e-06,4e-06,0,1e-06,0,-8e-06,-2e-06,1.3e-05,-1.5e-05,7e-06,-1e-06,5e-06,-4e-06,4e-06,3e-06,1e-06,2e-06
2e-06,7e-06,-1e-06,4e-06,1.1e-05,0,4.1e-05,4e-05,-2.5e-05,1.6e-05,-3.5e-05,3e-06,-9.2e-05,-4.9e-05,-0.000216,-8.3e-05,2e-06,8.9e-05,0.000134,-0.000132,-4e-06,-0.000111,-2.7e-05,-1.1e-05,-2.5e-05,3.8e-05,5.8e-05,1.2e-05,-1e-05,4e-06,-3.8e-05,-1.8e-05,0.000125,1e-06,4.7e-05,0.000192,-4.1e-05,1.3e-05,2.5e-05,-1.6e-05,-3.5e-05,2.4e-05,-2e-06,-4.3e-05,3.4e-05,4e-06,6e-06,-2.9e-05,-4e-06,4e-06,-2.5e-05,-5e-06,3e-06,-6e-06,0,5e-06,1.5e-05,3e-06,7e-06,-7e-06,6e-06,-8e-06,4e-06,5e-06,-1e-06,-1e-06,9e-06,-9e-06,7e-06,7e-06,-2e-06,2.2e-05,1e-06,0.000121,-4e-06,-1e-06,1e-06,-4.9e-05,-3e-06,-5e-05,-1e-06,1.2e-05,-1.9e-05,1.4e-05,3e-06,1e-06,-3e-06,6e-06,-1e-06,2e-06,5e-06,7e-06,-5e-06,-5e-06,2e-06,-2e-06,3e-06,-2e-06,-1e-06,5e-06,-1e-05,-4e-06,4e-06,-2e-06,-6e-06,-3e-06,0,-2e-06,0,5e-06,-1e-06,-1.2e-05,1.1e-05,-2.2e-05,-2e-06,1e-06,4e-06,-4e-06,-2e-06,0,-2e-06
0,1e-06,-1e-06,-1e-06,-3e-06,0,-4.9e-05,2.3e-05,6e-06,-5e-05,5e-05,1e-06,9.3e-05,-4.4e-05,3e-05,3.6e-05,2.1e-05,-0.000121,-6.5e-05,-1.1e-05,-0.000102,2.3e-05,7.4e-05,1e-05,-1.3e-05,-7.8e-05,4e-05,-9e-06,7e-06,-2.6e-05,-1.8e-05,4.8e-05,-0.00015,-4e-05,1.2e-05,7.7e-05,-2.8e-05,6.4e-05,-7.4e-05,2e-06,9.6e-05,-3.4e-05,7.7e-05,-1.4e-05,2.3e-05,-7e-06,-1.7e-05,4.2e-05,4e-06,2.6e-05,1.1e-05,9e-06,-1e-06,2.6e-05,-6e-06,3e-06,-1.6e-05,1e-05,1e-06,2e-06,3e-06,7e-06,-9e-06,-2e-06,-5e-06,-1e-06,1.4e-05,-1.8e-05,-6e-06,-5e-06,2e-06,-1e-06,1.7e-05,-4.9e-05,-1.1e-05,-2e-06,-1e-06,4e-06,-9e-06,2.1e-05,1.4e-05,-6e-06,-2e-06,-6e-06,-2e-06,0,-1e-06,-1.2e-05,0,-1e-06,-6e-06,2e-06,3e-06,2e-06,-7e-06,1e-06,1e-06,0,-2e-06,2e-06,4e-06,2e-06,9e-06,1e-06,6e-06,3e-06,0,1e-06,0,-1e-06,0,2e-06,-1.6e-05,2e-06,0,-1e-06,-4e-06,1e-06,4e-06,-1e-06,1e-06
1e-06,-5e-06,-2e-06,-1e-06,-1e-05,-1e-06,-4.3e-05,-1.9e-05,-2.6e-05,-2.2e-05,-1.6e-05,-1e-06,-7.4e-05,2.2e-05,-6.3e-05,9e-06,2.7e-05,8.6e-05,-7.7e-05,0.000178,-5.9e-05,-1.8e-05,-8.4e-05,-6e-06,2.2e-05,-3.1e-05,-5.4e-05,1.8e-05,-3.9e-05,3.1e-05,2.3e-05,-8.1e-05,-7.3e-05,3.7e-05,-4.7e-05,6.1e-05,-1.6e-05,1e-04,-1.8e-05,6.2e-05,-8.7e-05,-7.6e-05,4e-06,-3e-06,-2.6e-05,3.9e-05,-7e-06,-1.7e-05,-4e-06,-3.2e-05,-2.2e-05,-6e-06,-7e-06,1.6e-05,-7e-06,-5e-06,1.9e-05,-1.5e-05,-3e-06,7e-06,0,1e-05,8e-06,1e-06,9e-06,0,-2.5e-05,-1.8e-05,-1e-06,-7e-06,-2e-06,-2.6e-05,-1.1e-05,-7e-06,-1.1e-05,1e-06,-1e-06,4.4e-05,-6e-06,1.8e-05,-1.5e-05,3e-06,3e-06,-6e-06,1e-06,1e-06,-1.1e-05,1.4e-05,1e-06,-2e-06,3e-06,-2e-06,0,-1e-06,-4e-06,2e-06,-4e-06,4e-06,5e-06,1e-06,-1.4e-05,-2e-06,4e-06,0,-3e-06,2e-06,0,-2e-06,0,2e-06,0,2e-06,2.2e-05,1.3e-05,-1e-06,1e-06,5e-06,-4e-06,-3e-06,0,-4e-06
3e-06,7e-06,-1e-06,2e-06,-1e-06,1e-06,6.9e-05,4.4e-05,1.1e-05,-2.3e-05,2.3e-05,-1e-06,2.5e-05,-3.5e-05,2.2e-05,1.4e-05,2.3e-05,-3.9e-05,-4.1e-05,-6.8e-05,2.3e-05,1.8e-05,4.2e-05,-9e-06,-1.6e-05,5.7e-05,-2.6e-05,-4e-05,3e-06,-2e-06,4.6e-05,4.5e-05,7.1e-05,1.5e-05,3.7e-05,-0.000143,-2e-05,-2e-06,2.9e-05,-9.3e-05,1e-06,-6.3e-05,2e-06,-4e-05,-2.5e-05,-2.3e-05,-3e-06,3.2e-05,-2e-06,1e-06,1.2e-05,8e-06,1.3e-05,-1.5e-05,8e-06,6e-06,-1.8e-05,5e-06,-1e-06,-2e-06,3e-06,0,-3e-06,6e-06,-5e-06,-1e-06,-1.3e-05,-2.1e-05,5e-06,2e-06,1e-06,-1.3e-05,-1.5e-05,2.9e-05,-3e-06,-1e-06,-1e-06,-1.2e-05,5e-06,2.9e-05,2e-06,-1e-06,-3e-06,1.2e-05,4e-06,-1e-06,1e-06,-1.4e-05,-1e-06,1e-06,0,-3e-06,-2e-06,-2e-06,1e-06,-9e-06,2e-06,-6e-06,-1e-06,-6e-06,2e-06,0,-1e-06,0,4e-06,-4e-06,0,1e-06,0,5e-06,0,-4e-06,-4e-06,-3e-06,-3e-06,-2e-06,-3e-06,1e-06,2e-06,0,3e-06
-2e-06,-3e-06,-1e-06,-2e-06,1e-06,0,0,-4.6e-05,1.8e-05,1.5e-05,0,-1e-06,1.4e-05,-5e-06,1.4e-05,-5.3e-05,2.1e-05,-3.3e-05,0.000111,-0.000138,-1.8e-05,-5e-06,-4.4e-05,-2.6e-05,4e-06,5.7e-05,5.4e-05,3.2e-05,8e-06,3e-06,2.7e-05,-2e-06,-0.000102,-2.3e-05,1e-06,7.7e-05,1.5e-05,-5e-05,3.8e-05,9.3e-05,4.6e-05,-3.4e-05,-7e-06,-2.2e-05,-2.8e-05,-5e-06,2.6e-05,-7e-06,6e-06,1.4e-05,-1.1e-05,-1.8e-05,-1.1e-05,-1e-05,-1.9e-05,-1.3e-05,1.2e-05,1.1e-05,0,-6e-06,-6e-06,-9e-06,8e-06,-2e-06,-5e-06,0,1.7e-05,-1.2e-05,3e-06,3e-06,0,1.2e-05,1.8e-05,-1.8e-05,5e-06,1e-06,0,-3.7e-05,1e-06,-2.6e-05,7e-06,-9e-06,-1.8e-05,-1.7e-05,-1e-06,-2e-06,0,6e-06,0,1e-06,1e-06,-2e-06,0,1e-06,1e-06,-6e-06,2e-06,3e-06,-1e-06,-5e-06,-1.6e-05,1e-06,0,0,-6e-06,2e-06,0,0,0,-3e-06,0,2e-06,8e-06,-6e-06,3e-06,-2e-06,0,-2e-06,-2e-06,0,-2e-06
-2e-06,-5e-06,-2e-06,1e-06,-1e-06,-1e-06,-1e-06,2.7e-05,1.4e-05,-2.2e-05,-1.7e-05,0,-3.9e-05,6e-06,6.9e-05,6.1e-05,1e-05,6e-05,1e-06,1.1e-05,3.9e-05,6e-05,-3.5e-05,5e-06,1.4e-05,-1.9e-05,1.3e-05,-4.4e-05,-1.5e-05,3.6e-05,4e-06,-7.5e-05,0.000214,7e-06,-2.9e-05,-0.000112,-1e-05,-7.1e-05,1.5e-05,-0.000103,1.5e-05,-5e-06,6e-06,3e-06,2e-05,-7e-06,-1.7e-05,1.9e-05,-6e-06,-1.7e-05,9e-06,2.3e-05,6e-06,1e-06,8e-06,4e-06,-1e-05,-1.1e-05,1e-06,4e-06,-2e-06,-8e-06,-5e-06,-6e-06,0,0,-1e-06,-6e-06,-2e-06,4e-06,-1e-06,1.6e-05,1e-05,5e-06,-3e-06,0,1e-06,2.1e-05,-2e-06,1.1e-05,-9e-06,9e-06,1.1e-05,1.8e-05,1e-06,-1e-06,-3e-06,-4e-06,1e-06,0,0,5e-06,-1e-06,-1e-06,-2e-06,-3e-06,-1e-06,0,-1e-06,-2e-06,4e-06,-2e-06,-6e-06,0,6e-06,2e-06,-1e-06,-1e-06,0,3e-06,0,5e-06,-3e-06,-1e-06,-3e-06,-2e-06,1e-06,4e-06,1e-06,0,2e-06
-4e-06,9e-06,-1e-06,0,-1.1e-05,0,-5.5e-05,-4.6e-05,-6e-06,-2.3e-05,4.2e-05,1e-06,5.7e-05,-3.1e-05,2.7e-05,-3.2e-05,7e-06,-6.1e-05,-7.6e-05,5.2e-05,4.7e-05,-1.4e-05,6.5e-05,1e-05,-3.9e-05,-5.3e-05,-2.9e-05,3.1e-05,4.5e-05,-1.6e-05,-1.2e-05,5.6e-05,-4.2e-05,-1.1e-05,2.9e-05,1.8e-05,-2.1e-05,5e-06,-1.2e-05,0.000102,-6.2e-05,-2.7e-05,1.3e-05,-3.7e-05,6e-06,1.6e-05,8e-06,-1e-05,4e-06,1.5e-05,3e-06,-1.3e-05,-1e-06,-5e-06,-9e-06,2e-06,6e-06,-1e-06,-2e-06,4e-06,0,0,1e-06,0,-3e-06,0,-1.8e-05,8e-06,-4e-06,-1e-06,1e-06,8e-06,-1.8e-05,-5e-06,-2e-06,0,-1e-06,2.9e-05,-1e-06,-4.9e-05,2e-06,-1e-05,-1e-06,-1e-05,-1e-06,-1e-06,0,-2e-06,-1e-06,-1e-06,-3e-06,-2e-06,2e-06,-1e-06,4e-06,-4e-06,-1e-06,-1e-06,1e-06,4e-06,1e-06,1e-06,-4e-06,0,-1e-06,-3e-06,0,0,0,-3e-06,0,-9e-06,-7e-06,1e-05,-5e-06,-2e-06,-1e-06,-1e-06,-1e-06,0,-2e-06
-1e-06,-8e-06,-1e-06,-1e-06,3e-06,0,8.9e-05,2.7e-05,-2.8e-05,1e-06,-4.5e-05,0,-5.2e-05,-9e-06,7.8e-05,-1.1e-05,8e-06,5.9e-05,-4.7e-05,-9e-06,5.6e-05,-1.1e-05,-5.3e-05,-3e-06,1.7e-05,3e-06,-1.4e-05,-2.2e-05,-4.5e-05,1e-05,-2.2e-05,-2.7e-05,8.3e-05,-4e-06,-6e-06,-1.9e-05,-4e-06,5.3e-05,2.9e-05,-9.3e-05,3.3e-05,-4.5e-05,3.5e-05,-2.2e-05,3.2e-05,-1.4e-05,8e-06,3e-06,-3e-06,-1e-05,4e-06,1e-06,-3e-06,1.2e-05,3e-06,-8e-06,-1e-06,0,0,-4e-06,-3e-06,8e-06,-1e-06,0,5e-06,-1e-06,9e-06,2.9e-05,-3e-06,-2e-06,-2e-06,-1.3e-05,-1e-06,-6e-06,1e-05,0,0,-2.7e-05,-1e-06,-7e-06,5e-06,8e-06,-4e-06,-7e-06,-3e-06,-3e-06,-5e-06,3e-06,0,0,4e-06,-2e-06,-1e-06,2e-06,2e-06,0,0,0,0,4e-06,0,0,-4e-06,0,-7e-06,0,0,-1e-06,0,0,0,6e-06,-2e-06,-9e-06,4e-06,0,1e-06,2e-06,1e-06,0,0
3e-06,2e-06,-1e-06,0,1e-06,0,-3.6e-05,-2.1e-05,9e-06,-1.7e-05,3.2e-05,0,3.7e-05,-3.4e-05,0,3.8e-05,2.1e-05,-5.5e-05,4e-05,-2.6e-05,0,9e-06,5e-05,4e-06,2e-06,3.8e-05,3.5e-05,1.3e-05,2.5e-05,-4.4e-05,-1.4e-05,-1.4e-05,-5.5e-05,1.5e-05,-1.6e-05,0.000156,6e-06,3.9e-05,5.1e-05,4.9e-05,-8e-06,-2.5e-05,1.1e-05,-6e-06,-1e-06,-6e-06,-3e-06,-2e-06,3e-06,-9e-06,8e-06,2e-06,2e-06,1.4e-05,5e-06,7e-06,-1e-06,1.1e-05,-1e-06,-3e-06,3e-06,6e-06,0,1e-06,2e-06,-1e-06,1.3e-05,1.8e-05,2e-06,-2e-06,1e-06,-1.8e-05,1.2e-05,1.8e-05,0,-1e-06,-1e-06,-2.1e-05,-4e-06,2.9e-05,-5e-06,-1e-06,-5e-06,2.1e-05,2e-06,-2e-06,-3e-06,-6e-06,0,1e-06,-4e-06,3e-06,0,-2e-06,4e-06,3e-06,2e-06,1e-06,0,0,1.2e-05,0,-4e-06,-1e-06,1e-05,1e-06,0,1e-06,0,-2e-06,0,-1e-06,2e-06,-3e-06,2e-06,2e-06,0,-2e-06,0,0,0
4e-06,5e-06,-1e-06,0,-6e-06,0,9e-06,2.1e-05,-4e-06,-3.3e-05,-3e-06,0,-1.3e-05,-5e-06,4.2e-05,-6.7e-05,8e-06,2.4e-05,7.2e-05,4.9e-05,1.7e-05,-1e-05,-6.3e-05,-1e-06,-1.7e-05,9e-06,-8e-06,6e-06,-2.1e-05,1e-06,-9e-06,2.2e-05,-1.4e-05,-4e-06,2.6e-05,-9.5e-05,1.6e-05,-1.8e-05,-7e-06,-4.1e-05,-1.6e-05,-1e-06,-1.5e-05,-2.3e-05,-1.9e-05,1.5e-05,4e-06,-7e-06,-4e-06,1.8e-05,-5e-06,1e-06,-3e-06,-7e-06,6e-06,-6e-06,4e-06,-1e-05,-1e-06,5e-06,4e-06,-4e-06,3e-06,2e-06,-3e-06,-1e-06,-1.7e-05,1.3e-05,3e-06,-1e-06,-1e-06,3e-06,-6e-06,-1.1e-05,7e-06,0,0,3.2e-05,0,9e-06,2e-06,1e-06,7e-06,-2.6e-05,0,1e-06,2e-06,4e-06,0,0,0,-1e-06,1e-06,1e-06,-6e-06,1e-06,-2e-06,-2e-06,-1e-06,-2e-06,0,0,0,0,-5e-06,0,0,-1e-06,0,1e-06,0,-2e-06,0,9e-06,-2e-06,1e-06,0,0,-1e-06,0,-1e-06
0,-7e-06,-1e-06,0,-3e-06,0,-6.4e-05,0,1.2e-05,-3.8e-05,-1e-05,0,-1.1e-05,5e-06,-2.8e-05,8.5e-05,1.6e-05,2e-06,-3.8e-05,4.9e-05,2e-06,3.7e-05,7e-06,-1.3e-05,2.1e-05,-3.2e-05,-1e-06,-9e-06,9e-06,1.2e-05,4e-06,-2.5e-05,-1e-04,6e-06,-2e-05,1.1e-05,-1.7e-05,-7.5e-05,-4.7e-05,5.4e-05,4.5e-05,4.4e-05,-5e-06,-2.2e-05,-2.7e-05,5e-06,-6e-06,1.1e-05,3e-06,-1.3e-05,7e-06,2e-06,3e-06,-1.8e-05,0,3e-06,-8e-06,-7e-06,2e-06,2e-06,0,-1e-05,-3e-06,1e-06,2e-06,0,-1.2e-05,1e-06,-1e-06,4e-06,0,1.5e-05,-7e-06,1.6e-05,-3e-06,-1e-06,0,1.3e-05,0,-9e-06,3e-06,3e-06,0,2.2e-05,-2e-06,0,-2e-06,-5e-06,1e-06,0,0,4e-06,0,0,1e-06,0,0,2e-06,1e-06,-4e-06,6e-06,-1e-06,0,0,-2e-06,1e-06,0,0,0,0,0,4e-06,1e-05,0,0,1e-06,-1e-06,-3e-06,1e-06,0,1e-06
0,4e-06,-1e-06,0,1e-06,0,9.4e-05,-1.3e-05,1.1e-05,1e-05,1.8e-05,0,1.9e-05,3e-06,-2.3e-05,-5.5e-05,5e-06,-3.6e-05,-6.1e-05,-5.4e-05,-4.2e-05,-1.5e-05,1.4e-05,-1e-05,-6e-06,-3.8e-05,3e-06,1e-05,2.5e-05,3e-06,1e-05,-1.9e-05,0.000116,6e-06,3e-06,-5.4e-05,-1.6e-05,-4.4e-05,-5.1e-05,-8.2e-05,-3e-05,4.6e-05,-2.2e-05,-6e-06,-3e-06,0,9e-06,-9e-06,-1e-06,1e-06,-9e-06,-9e-06,-2e-06,4e-06,1e-05,2e-06,1e-05,1.3e-05,-1e-06,-5e-06,0,-5e-06,3e-06,0,-1e-06,0,1.7e-05,-1e-05,-5e-06,1e-06,1e-06,1.1e-05,1.2e-05,0,1e-06,0,0,-3.4e-05,2e-06,6e-06,-3e-06,-5e-06,-8e-06,-7e-06,2e-06,-1e-06,1e-06,2e-06,0,-1e-06,-1e-06,-5e-06,-1e-06,0,2e-06,-2e-06,1e-06,0,0,-2e-06,-9e-06,0,3e-06,0,4e-06,-1e-06,0,0,0,-1e-06,0,0,-1e-05,-8e-06,1e-06,0,1e-06,2e-06,-1e-06,0,-1e-06
-2e-06,1e-06,-1e-06,0,0,0,-5.5e-05,1.1e-05,-1.3e-05,-2.3e-05,-1.9e-05,0,-3.2e-05,-2e-06,-3.2e-05,1.3e-05,1.2e-05,4.9e-05,1.4e-05,-2.8e-05,-3.6e-05,2.3e-05,-6.5e-05,5e-06,-1.2e-05,-2e-06,1.2e-05,-7e-06,-4.1e-05,1.7e-05,5e-06,2.7e-05,-0.000157,-5e-06,1.9e-05,8.6e-05,2.7e-05,1.8e-05,4e-06,9.1e-05,-1.2e-05,2.8e-05,-6e-06,-1.8e-05,1.2e-05,-1.3e-05,-7e-06,9e-06,-1e-06,1.2e-05,4e-06,1.4e-05,4e-06,7e-06,-4e-06,-2e-06,-1.1e-05,-2e-06,-1e-06,-1e-06,1e-06,4e-06,-5e-06,-1e-06,-2e-06,0,1e-06,-1.4e-05,1e-06,-2e-06,-1e-06,-5e-06,3e-06,-4.5e-05,-8e-06,0,0,-5e-06,-1e-06,-9e-06,-1e-06,4e-06,-3e-06,-8e-06,1e-06,0,0,-2e-06,0,0,3e-06,-3e-06,2e-06,1e-06,0,-4e-06,-1e-06,-1e-06,0,1e-06,8e-06,0,4e-06,0,-3e-06,-1e-06,0,0,0,4e-06,0,-6e-06,9e-06,-3e-06,2e-06,0,-1e-06,-1e-06,2e-06,0,1e-06
