9e-06,1.6e-05,3.6e-05,2e-06,2.9e-05,2.5e-05,2.7e-05,0.000268,5.1e-05,5.8e-05,7.7e-05,1.4e-05,7.2e-05,1.3e-05,2.6e-05,1.5e-05,1.7e-05,6.2e-05,0.000147,0.000131,0.000413,0.00026,0.00022,0.00092,0.000677,0.000726,0.000566,0.000324,0.00047,7.9e-05,9.8e-05,0.000353,0.00024,0.000238,0.00065,0.000218,0.00011,0.000792,0.000124,0.000226,0.000754,4e-05,0.000444,7.8e-05,0.000162,0.000422,0.000144,0.000145,0.000155,0.000345,0.000167,0.00024,0.000441,0.000306,0.000272,3.1e-05,4.5e-05,6.8e-05,7.4e-05,0.000123,0.000157,3.2e-05,9.9e-05,1e-05,2.9e-05,6.3e-05,1.2e-05,3.8e-05,0.000105,2e-05,0.00015,0.000391,2e-06,5.1e-05,6.9e-05,0.000242,7.9e-05,2.9e-05,6.8e-05,3e-06,3.1e-05,1.9e-05,1.8e-05,1.1e-05,0.000428,8.5e-05,8e-05,7.5e-05,0.000147,1.6e-05,8.8e-05,4.1e-05,4.2e-05,3.8e-05,5.3e-05,2.6e-05,1.5e-05,3e-06,7.1e-05,4.3e-05,4.3e-05,8.5e-05,1.7e-05,1.4e-05,3e-06,1.9e-05,1.3e-05,5.1e-05,4.7e-05,0.000146,8e-06,7e-05,1.4e-05,2.3e-05,5e-06,7.4e-05,1.6e-05,7e-05,1.9e-05,4.7e-05,1e-05
4.5e-05,4.7e-05,5.9e-05,5.5e-05,5.1e-05,2.8e-05,7e-05,0.000489,0.000135,0.000198,5.6e-05,0.000135,0.00011,0.000137,0.000115,0.000147,7.9e-05,0.00013,0.000199,0.000951,0.001762,0.001839,0.00095,0.002808,0.00305,0.001175,0.000539,0.00096,6e-04,0.000976,0.000887,0.001244,0.001116,0.000292,0.001982,0.000805,0.000665,0.00156,0.000582,0.000275,0.00116,0.000152,0.001364,0.000882,0.00077,0.001061,0.000528,0.000438,0.000455,0.000631,0.000402,0.000832,0.000988,0.001148,0.00034,0.00038,0.000338,0.000246,0.000335,0.000202,0.000387,0.000276,0.000238,0.000236,0.000338,0.000226,0.000205,0.000248,0.000338,9e-05,0.000426,0.000589,0.000338,0.000107,0.000119,0.00064,0.000184,0.000122,0.000173,0.000117,2.9e-05,5.4e-05,6.9e-05,0.000352,0.000729,0.000719,0.000485,0.000294,0.000225,0.000187,0.000207,0.000234,0.000146,0.000124,8.3e-05,0.000141,0.000127,9.1e-05,0.000145,0.000205,0.000155,0.000209,0.000175,0.000141,8.5e-05,6.3e-05,5.6e-05,9.6e-05,0.000131,0.000328,0.000324,0.000248,0.000208,0.000171,0.000138,0.000168,0.000191,0.000142,9.4e-05,4.9e-05,6.9e-05
4e-05,4.9e-05,2.4e-05,2.4e-05,9e-06,4.1e-05,8.8e-05,0.000705,0.000208,0.00011,1.5e-05,0.000106,2e-05,0.000115,9.1e-05,0.000175,0.000104,6.1e-05,0.000327,0.001258,0.002004,0.00162,0.000623,0.004351,0.00274,0.002047,0.001848,0.000601,0.001437,0.001356,0.002911,0.000824,0.000965,0.001518,0.002142,0.001342,0.000444,0.001708,0.001401,0.000951,0.001113,0.000562,0.001073,0.000385,0.000405,0.000111,0.000968,0.000416,0.000344,0.000954,0.000269,0.001212,0.000313,0.000458,0.000475,0.000618,0.000386,0.000303,5e-04,0.000276,0.000271,0.00022,0.000114,0.000144,0.000155,2.1e-05,0.000177,0.000175,8.1e-05,0.000819,0.000287,0.001129,0.000945,0.00055,0.000258,0.000697,9.8e-05,0.00011,9.4e-05,4.6e-05,7.1e-05,0.000152,8.2e-05,0.000478,0.000766,0.000742,0.000257,0.000187,0.000567,0.000233,0.00011,7.3e-05,8e-06,6.8e-05,2.3e-05,7e-05,1.2e-05,4.4e-05,3.6e-05,7.9e-05,4.9e-05,8.9e-05,8.2e-05,3.8e-05,1.2e-05,9e-06,3.8e-05,1e-05,0.000138,7.3e-05,0.000102,5.3e-05,8.7e-05,8.1e-05,5.2e-05,5.4e-05,7.3e-05,2.4e-05,3e-05,3.4e-05,3.7e-05
3.1e-05,5.4e-05,4.1e-05,2.3e-05,5e-05,8.2e-05,5.4e-05,0.000655,0.000132,0.000174,0.000125,4.2e-05,3.7e-05,0.000112,3.2e-05,0.000173,0.000152,5e-05,0.00049,0.001801,0.000846,0.000648,0.000597,0.005454,0.004408,0.00139,0.002722,0.001039,0.001556,0.002848,0.00253,0.001375,0.000944,0.001064,0.000885,0.000646,0.000183,0.000924,0.000425,0.000112,0.001018,0.00058,0.00109,0.0012,0.000577,0.000345,0.000985,0.00056,0.000458,0.001346,0.001033,0.001082,0.000243,0.001346,0.000246,0.000266,0.00012,0.00043,0.000738,0.000383,0.000556,0.000177,7.5e-05,8.7e-05,7.1e-05,5.1e-05,0.000141,0.000152,0.000171,0.001246,0.000738,0.001284,0.000869,0.000335,0.000133,0.000654,0.000618,0.000482,0.000192,4.4e-05,1.3e-05,0.000195,0.00018,0.000399,0.001232,0.000642,0.000397,0.000127,0.000581,0.000269,0.000103,6.5e-05,3.5e-05,6e-05,3.5e-05,3e-05,2e-05,5.4e-05,3.1e-05,3.1e-05,5.2e-05,8.5e-05,2.5e-05,4e-05,4.8e-05,6.6e-05,2.3e-05,5.1e-05,0.000114,8.9e-05,6e-05,4.5e-05,8.3e-05,5.5e-05,8e-06,3.8e-05,8.1e-05,4.1e-05,4.7e-05,4.6e-05,4e-05
1.3e-05,2.6e-05,2.2e-05,1.5e-05,0.000102,4e-05,5.1e-05,7e-04,4.1e-05,0.000126,0.000131,4.3e-05,9e-06,6.4e-05,0.000129,6.2e-05,4.3e-05,0.000185,0.000809,0.002421,0.000152,0.000496,0.000419,0.005124,0.002233,0.002048,0.003088,0.002142,0.001029,0.002661,0.00085,0.000309,0.000245,0.000904,0.002254,0.001441,0.000685,0.000326,0.001506,0.000989,0.001207,0.001354,0.001001,0.000472,0.000929,0.001002,0.001032,0.001038,0.001175,0.001014,0.001062,0.001076,0.001104,0.001776,0.000572,0.000543,0.000567,0.000294,0.00064,0.00042,0.000437,0.000286,0.000136,0.000297,0.000329,0.000285,0.000215,0.000203,0.00032,0.000829,0.000541,0.000536,0.000399,6.4e-05,2.3e-05,0.00048,0.001253,0.000511,0.000169,6.5e-05,6.9e-05,0.00013,0.000167,0.00011,0.001109,0.000863,0.000256,7.6e-05,0.00056,0.000214,0.000109,8.9e-05,5.3e-05,6.9e-05,6.2e-05,5.5e-05,2.2e-05,4.2e-05,2.6e-05,2.9e-05,3.7e-05,3.3e-05,3.2e-05,7e-06,2.6e-05,4.3e-05,4.1e-05,7.8e-05,2.1e-05,3.9e-05,9.9e-05,3.2e-05,1e-06,2.2e-05,2.8e-05,2.7e-05,6.2e-05,3.4e-05,1.5e-05,3.2e-05,1e-05
7e-06,1.8e-05,1.7e-05,3.3e-05,0.000162,0.000113,2.8e-05,0.001472,0.000472,0.000268,0.000132,7.1e-05,5e-05,1.4e-05,0.000122,0.000225,0.000147,0.000139,0.001288,0.003646,0.001124,0.000248,0.000276,0.005119,0.003831,0.002131,0.000737,0.001006,0.001894,0.001642,0.001111,0.001328,0.000849,0.000886,0.001758,0.001002,0.000648,0.001631,0.000293,0.000432,0.001908,0.003322,0.002105,0.001285,0.000677,0.001405,0.001203,0.001055,0.00068,0.000104,0.002759,0.001183,0.000521,0.000982,0.000564,0.00045,0.000461,0.000374,0.000365,0.000439,6.6e-05,0.000262,0.000175,0.000616,0.000207,0.000211,0.000101,0.00031,7.9e-05,0.000645,0.000338,0.000693,0.000672,0.000322,0.000133,0.000237,0.001248,0.00062,0.000266,8.6e-05,0.00015,2.9e-05,0.000137,0.00021,0.000779,0.000249,0.000164,0.000124,0.000519,0.000309,0.000164,5.1e-05,5.1e-05,3e-05,5.6e-05,2.2e-05,3e-05,3.6e-05,5.2e-05,9e-06,3.3e-05,3.1e-05,1.6e-05,3.7e-05,1.2e-05,5e-05,4e-06,0.000119,7.5e-05,7.5e-05,6.9e-05,6.4e-05,1.2e-05,1.8e-05,5e-05,1.6e-05,5.8e-05,2.4e-05,1.5e-05,2.4e-05,2.6e-05
2.4e-05,8e-06,2e-06,1.7e-05,0.000269,3.2e-05,5.3e-05,0.00251,0.000471,0.000397,0.000287,0.000127,9e-05,8.3e-05,0.000204,0.000171,9.3e-05,0.000108,0.001556,0.003124,0.001192,0.000403,0.000759,0.004282,0.0019,0.001428,0.003878,0.003483,0.001273,0.005216,0.002316,0.002058,0.000356,0.00043,0.001147,0.001746,0.002345,0.005159,0.000426,0.000477,0.002044,0.004871,0.00361,0.001443,0.001516,0.002665,0.000506,0.000283,0.001121,0.00148,0.003481,0.003046,0.001607,0.001508,0.000629,0.000954,0.001056,0.000841,0.000602,0.000279,0.000711,0.000515,0.00024,0.000946,0.000567,0.000393,0.000323,0.000418,0.000354,0.001213,0.000379,0.000617,0.000408,0.000284,0.000173,0.000155,0.000849,0.000525,0.000324,0.000277,0.000206,0.000129,6.5e-05,0.000146,0.000833,0.000999,0.000349,0.000172,0.000573,0.000523,0.000306,5.6e-05,7e-05,5.7e-05,5.3e-05,4.6e-05,2.2e-05,1.7e-05,1.1e-05,4.3e-05,5.3e-05,3.7e-05,4.3e-05,3.4e-05,3e-05,5.1e-05,3.2e-05,0.000106,8.6e-05,4.3e-05,4.7e-05,5.9e-05,5.2e-05,4.6e-05,3.1e-05,2.6e-05,6.8e-05,5e-05,4.1e-05,4.5e-05,3.9e-05
2.4e-05,1.6e-05,1.2e-05,3.1e-05,0.000303,4e-04,0.000246,0.003437,0.002341,0.001208,0.001013,0.000337,3e-06,9.4e-05,0.00019,0.000301,0.000265,0.000291,0.001638,0.003745,0.006573,0.004514,0.003475,0.005191,0.003536,0.002251,0.004593,0.002936,0.002327,0.006741,0.005759,0.004617,0.002517,0.002179,0.002348,0.001126,0.001516,0.004728,0.006888,0.004068,0.001906,0.002569,0.002727,0.000837,0.003974,0.00279,0.002201,0.001305,0.000841,0.001244,0.003096,0.001087,0.001372,0.000736,0.000969,0.001282,0.001584,0.001826,0.001291,0.000813,0.000504,0.000267,0.000124,0.000927,0.00056,0.00029,0.000229,0.000242,5.2e-05,0.001481,0.001135,0.00022,0.000598,0.000217,0.000196,0.000351,0.000398,0.000326,0.000326,0.000304,0.000357,3e-04,0.000162,0.000108,0.000726,0.001303,0.00078,7.5e-05,0.000556,0.001259,0.000429,0.000113,3.2e-05,2.8e-05,4.9e-05,3.1e-05,4.3e-05,4.1e-05,8e-06,2.9e-05,5.5e-05,3.3e-05,4.8e-05,2e-06,3.6e-05,5.4e-05,2.4e-05,7.3e-05,7.6e-05,5.3e-05,5.9e-05,4.5e-05,2.6e-05,5e-06,5.1e-05,4e-05,3e-05,3.3e-05,1.4e-05,2.5e-05,1.2e-05
1.3e-05,1.4e-05,2.1e-05,4.6e-05,0.000257,0.000244,0.000175,0.003685,0.004128,0.001831,0.000962,0.000569,0.000308,0.00011,0.000307,3.1e-05,0.00032,0.000514,0.002183,0.006429,0.014711,0.006975,0.002912,0.003774,0.002353,0.003887,0.006299,0.005094,0.001973,0.003723,0.002552,0.001358,0.000642,0.001495,0.003112,0.00247,0.001775,0.005085,0.009005,0.004318,0.001406,0.00113,0.001683,0.001595,0.004583,0.003198,0.001247,0.000927,0.001336,0.000777,0.001939,0.000885,0.001618,0.001383,0.000496,0.00068,0.000445,0.000414,0.000663,0.000845,0.000324,0.000112,0.000269,0.000827,0.00099,0.000446,0.000199,0.000406,0.000454,0.00126,0.001492,0.001233,0.001054,0.000613,0.000221,0.000215,0.000747,0.000627,0.000139,0.000104,0.000161,1e-05,5.8e-05,0.000161,0.000647,0.000547,0.000627,0.000551,0.000109,0.000792,7e-04,0.000401,0.000214,7.9e-05,4.9e-05,1.7e-05,2.2e-05,1e-05,4.9e-05,4.2e-05,7.7e-05,0.000105,4.5e-05,4.3e-05,5.3e-05,6.2e-05,3.5e-05,5.1e-05,4.5e-05,5.1e-05,6e-05,0.000147,0.000106,3.7e-05,6.6e-05,2.6e-05,3.8e-05,2.2e-05,2.2e-05,5.5e-05,2.7e-05
2.2e-05,8e-06,1.2e-05,5e-05,0.000167,0.000277,7.7e-05,0.003475,0.003728,0.001951,0.001043,0.000683,0.000385,0.00017,0.000313,0.000417,0.00038,0.00031,0.001682,0.003358,0.01166,0.007204,0.002789,0.002285,0.00189,0.003469,0.00568,0.00243,0.00072,0.001467,0.001568,0.001474,0.001545,0.000452,0.002465,0.001104,0.001294,0.00254,0.004295,0.003396,0.001679,0.002283,0.003372,0.00151,0.003945,0.001317,0.001121,0.00034,0.00099,0.000167,0.00144,0.000525,0.00063,0.001742,0.001134,0.000899,0.000549,0.000428,0.000533,0.000336,9.7e-05,0.000139,0.000193,0.000737,0.000544,0.000409,0.000243,0.000558,0.000397,0.001149,0.000293,0.000242,0.000318,0.000295,0.000114,0.000175,0.000936,0.000813,0.000477,0.000213,3.5e-05,4.4e-05,6.1e-05,0.000343,0.000103,0.00067,0.000493,0.000399,0.000303,6.1e-05,0.000321,0.000175,0.000142,5.4e-05,1.9e-05,1.2e-05,2.2e-05,2.4e-05,6.7e-05,7.2e-05,8.8e-05,3e-05,1.3e-05,2.4e-05,5.2e-05,2.1e-05,2.2e-05,6.1e-05,5e-06,5.4e-05,2.8e-05,9.6e-05,1e-04,6.1e-05,4e-05,3.2e-05,4.5e-05,3e-05,1.6e-05,6e-05,4.4e-05
5e-06,1e-05,1.1e-05,6.5e-05,0.000105,0.000107,8.3e-05,0.002841,0.001597,0.000715,0.00025,0.000135,7.1e-05,4.7e-05,0.000188,0.000174,4.3e-05,0.000336,0.001576,0.003129,0.005875,0.001946,0.000361,0.002695,0.002294,0.000434,0.003014,0.001298,0.000749,0.002925,0.00098,0.000652,0.001295,0.000954,0.003044,0.001264,7e-04,0.002011,0.001477,0.001785,0.000716,0.00142,0.001983,0.000834,0.002461,0.001748,0.001269,0.001535,0.000887,0.000925,0.001831,0.001181,0.000495,0.000432,0.000656,0.00034,0.000342,0.000362,0.00028,0.000251,0.000171,8.1e-05,0.000224,0.000273,0.000105,9.3e-05,0.000163,0.00028,0.000213,0.000792,0.000613,0.000347,0.000271,6.9e-05,8.1e-05,0.000202,0.000685,0.000335,0.000159,6.2e-05,6.1e-05,2.1e-05,3e-05,0.000474,0.000356,0.000493,0.000352,4.3e-05,5.5e-05,0.000534,4e-04,0.000141,5.3e-05,3.9e-05,4.1e-05,1.1e-05,3.1e-05,3.7e-05,6.5e-05,3.7e-05,1.8e-05,1.9e-05,6e-06,1.5e-05,2.8e-05,1.2e-05,3.4e-05,2.1e-05,2.8e-05,6.8e-05,2e-05,7e-05,1.2e-05,2.6e-05,1.9e-05,1.4e-05,1e-05,1.9e-05,2.3e-05,3.3e-05,2e-05
7e-06,1.4e-05,3e-06,6.5e-05,6.4e-05,3.7e-05,5.3e-05,0.002061,0.00018,0.000152,0.000202,6.1e-05,7e-05,3.3e-05,3.5e-05,0.000203,4.9e-05,0.000191,0.001052,0.003228,0.001308,0.000758,0.000492,0.001465,0.001183,0.000458,0.001753,0.001264,0.000588,0.002121,0.002203,0.001246,0.002104,0.000327,0.002813,0.001586,0.000423,0.000656,0.001765,0.002082,0.000721,0.001567,0.000407,0.001091,0.00152,0.000967,0.00092,0.000696,0.000953,0.000899,0.001357,0.000888,0.000889,0.00074,0.000893,0.000595,3.1e-05,0.000229,0.000105,0.000311,0.000483,0.000187,0.000192,0.000344,7.6e-05,0.000133,0.000166,6e-05,9.8e-05,0.000785,0.000578,0.000183,0.000272,0.000203,6.9e-05,0.000161,0.000458,0.000179,7.5e-05,4.5e-05,3.7e-05,1.6e-05,4.2e-05,0.000405,0.000165,4e-04,0.000171,0.000117,3.2e-05,0.000726,0.000287,2e-05,5.7e-05,5e-05,6e-05,3.8e-05,3.9e-05,3e-06,5e-05,1.2e-05,2e-05,2.7e-05,2.6e-05,2e-05,2.4e-05,1.9e-05,1.6e-05,1.7e-05,9e-06,4.2e-05,8e-06,3.9e-05,2.5e-05,2.5e-05,2.1e-05,7e-06,1.9e-05,1.5e-05,1.8e-05,2e-05,3e-06
4e-06,8e-06,1e-05,5.6e-05,0.000156,7.1e-05,5.5e-05,0.00129,0.000364,0.00021,6.4e-05,5.4e-05,4.4e-05,5.2e-05,6.4e-05,0.000137,0.000114,0.000142,0.00057,0.003289,0.002245,0.001427,0.000995,0.002842,0.004039,0.000759,6e-04,0.001046,0.001634,0.002118,0.001371,0.000237,0.002421,0.00152,0.001353,0.000498,0.000633,0.001491,0.002329,0.003014,0.000434,0.001568,0.002719,0.001429,0.00171,0.001167,0.001789,0.001103,0.001278,6e-04,0.000292,0.000564,0.00075,0.001198,0.000689,0.000292,0.000253,0.000137,0.000298,0.000244,0.000538,0.000202,3.9e-05,0.00023,4.4e-05,0.000155,8.8e-05,2.6e-05,6.1e-05,0.000701,0.000215,5.5e-05,0.000279,4.7e-05,7.4e-05,9.5e-05,0.000451,0.000185,0.000102,3.8e-05,2.2e-05,2.5e-05,9e-06,0.000301,0.000129,0.000159,9.3e-05,3.9e-05,9.9e-05,0.00045,0.000253,6.9e-05,4.5e-05,4.3e-05,2.1e-05,9e-06,1.8e-05,1.9e-05,4.7e-05,1.1e-05,2.8e-05,1.1e-05,2.1e-05,8e-06,4e-06,2.4e-05,2.6e-05,3.4e-05,3.7e-05,5.3e-05,3.8e-05,3.4e-05,1.7e-05,1.6e-05,1.6e-05,2.3e-05,3e-06,7e-06,1.5e-05,1.4e-05,8e-06
3e-06,1.2e-05,8e-06,4.9e-05,0.000147,8e-05,3.3e-05,0.00089,0.000337,0.000142,9.5e-05,0.000108,7.1e-05,4.5e-05,6.5e-05,6.1e-05,9.9e-05,6.9e-05,0.000438,0.003145,0.000837,0.000604,0.000366,0.003287,0.001711,0.002765,0.001728,0.000627,0.002186,0.00123,0.001527,0.000992,0.002952,0.000733,0.001354,0.001783,0.002037,0.001526,0.00397,0.003921,0.002335,0.001342,0.004285,0.002233,0.002109,0.002503,0.00219,0.000823,0.000977,0.002031,0.001007,0.001206,0.000452,0.001837,0.00145,0.000215,4.3e-05,0.000307,0.000533,0.000584,0.000712,0.000627,0.000398,0.000133,0.000111,0.00019,8e-05,6e-06,5.8e-05,0.000181,0.000322,0.000532,9.8e-05,0.000165,8.1e-05,0.000211,0.000375,1e-04,5.8e-05,6.9e-05,1.8e-05,3.3e-05,4.1e-05,0.000409,0.000237,8e-05,0.000103,0.000103,3.4e-05,0.000289,0.000163,6.1e-05,4e-05,4.9e-05,3.7e-05,1.2e-05,3e-06,1.4e-05,4e-05,1.8e-05,1.4e-05,2.3e-05,1.1e-05,8e-06,1.5e-05,3e-05,1.4e-05,5.9e-05,5.5e-05,3.7e-05,3.5e-05,5.7e-05,1.4e-05,2.4e-05,1.3e-05,2.1e-05,1.8e-05,1.3e-05,2.9e-05,9e-06,1.4e-05
6e-06,1e-05,9e-06,4.7e-05,3.4e-05,3.8e-05,2.9e-05,0.000988,0.000362,0.000204,4.4e-05,0.000132,8.5e-05,4.4e-05,8.2e-05,8.2e-05,2.4e-05,9.4e-05,0.000512,0.002889,0.000766,0.00061,0.000164,0.003304,0.005914,0.003574,0.002263,0.003179,0.004112,0.003554,0.003523,0.00142,0.002985,0.003583,0.0029,0.000768,0.00468,0.002528,0.005085,0.003186,0.001787,0.001495,0.00165,0.002357,0.001888,0.002261,0.004004,0.002402,0.001738,0.003891,0.003939,0.003672,0.00264,0.003393,0.000268,0.001294,0.000865,0.000762,0.000436,0.000167,0.000842,0.000542,0.000232,0.000124,4e-05,0.000291,7.4e-05,5e-05,0.000142,0.000651,0.00071,0.001135,0.000597,0.000245,0.00016,0.000129,0.000233,0.000253,0.000172,8.7e-05,0.000117,5.7e-05,2.7e-05,0.000506,0.000311,2.9e-05,6.5e-05,0.000188,0.000177,0.000336,0.000147,3.2e-05,0.000108,6.4e-05,5.3e-05,2.5e-05,3e-05,1e-05,6.8e-05,2.7e-05,4.2e-05,6.2e-05,5.1e-05,2.7e-05,7e-06,5.6e-05,5.5e-05,0.000104,2.9e-05,7.8e-05,7.2e-05,0.000103,9.3e-05,9.6e-05,6e-05,3.6e-05,8e-06,1.9e-05,2.4e-05,1.6e-05,1.8e-05
5e-06,5e-06,2e-06,5.4e-05,0.000129,1.9e-05,3.3e-05,0.001131,0.00053,0.000213,6.4e-05,0.000136,8.4e-05,8e-05,3.6e-05,6.4e-05,0.000122,0.000108,0.00054,0.002798,0.001083,0.000221,7.8e-05,0.002001,0.008702,0.005272,0.003422,0.004299,0.003692,0.002992,0.003694,0.004683,0.001103,0.003235,0.007151,0.002111,0.007118,0.007918,0.003295,0.007939,0.010012,0.001045,0.003851,0.000563,0.001518,0.005001,0.0039,0.003986,0.004461,0.004043,0.005966,0.004278,0.00253,0.001919,0.003539,0.003124,0.00108,0.000315,0.000447,0.000748,0.001221,0.000781,5.7e-05,0.000108,0.000205,0.000225,0.000384,0.000257,7.9e-05,0.001024,0.000644,0.00124,0.000792,0.000206,6.2e-05,0.000178,0.000216,0.000205,2.9e-05,7.5e-05,8.2e-05,0.000107,2.9e-05,0.000627,0.000137,0.000174,0.000104,0.000317,0.00027,0.000668,0.000465,0.00027,9.5e-05,0.00013,5.6e-05,0.00011,4.5e-05,3.3e-05,9.3e-05,7.4e-05,2.4e-05,8.7e-05,3.1e-05,3.8e-05,2.5e-05,5.8e-05,3e-05,0.000143,0.00017,9e-05,1.7e-05,9.6e-05,0.000148,5.2e-05,2.8e-05,2.9e-05,4.6e-05,1.4e-05,3.1e-05,1.3e-05,9e-06
6e-06,7e-06,3e-06,6e-05,0.000204,0.00012,4.7e-05,0.001057,0.000778,0.000323,4.9e-05,1.1e-05,0.000113,0.000131,0.000116,0.000115,7.2e-05,4.5e-05,0.00051,0.001575,0.001102,0.000771,0.000462,0.00048,0.008153,0.010523,0.011064,0.012893,0.012618,0.011967,0.007877,0.004525,0.007759,0.004661,0.006577,0.009917,0.011653,0.011487,0.009289,0.005716,0.007564,0.010791,0.011448,0.01043,0.003747,0.008669,0.009002,0.011866,0.012837,0.012665,0.001753,0.007524,0.00999,0.00598,0.004646,0.005651,0.003081,0.000728,0.000239,0.000772,0.002162,0.002479,0.001434,0.000732,0.000544,0.000168,0.000593,0.000652,0.000581,0.000869,0.000306,0.001336,0.001767,0.001188,0.000521,0.000195,0.000289,0.000159,0.000116,0.000161,7.2e-05,5.1e-05,0.000147,0.000895,0.000766,0.00065,0.000479,0.000418,0.000242,0.001371,0.000675,0.000284,0.000309,0.000181,1e-04,0.000181,0.000115,4.3e-05,4.2e-05,7.6e-05,5.3e-05,2.9e-05,5.8e-05,6e-05,8.5e-05,7.4e-05,6e-05,0.00015,0.000155,0.000124,2.3e-05,3e-05,7.6e-05,3.3e-05,3.6e-05,3.1e-05,1.8e-05,1.4e-05,4.2e-05,3.4e-05,2e-05
1.2e-05,1.1e-05,1.1e-05,5.5e-05,0.000192,0.000152,0.000132,0.000808,0.000903,0.000483,0.000119,4.7e-05,0.000134,6e-05,6e-05,7.3e-05,3.8e-05,1.3e-05,0.000938,0.002131,0.000215,0.000395,0.000424,0.001543,0.00411,0.005088,0.001353,0.00565,0.005334,0.005335,0.008985,0.008684,0.010528,0.012994,0.005922,0.010129,0.004885,0.002505,0.001176,0.001782,0.006315,0.007061,0.004617,0.009214,0.009143,0.010877,0.010662,0.005823,0.006298,0.004783,0.009441,0.007873,0.008242,0.005585,0.003036,0.003503,0.002028,0.001008,0.000323,0.001058,0.001725,0.000803,0.000783,0.000651,0.000546,0.000781,0.000497,0.000814,0.000385,0.000813,0.000531,0.001001,0.000941,0.000268,9.2e-05,6.2e-05,0.000166,0.000115,4.5e-05,0.000107,9.4e-05,4.8e-05,0.000201,0.00083,0.000309,0.000326,0.000716,0.000398,0.00064,0.001653,0.000924,0.000262,5.6e-05,0.000193,3.9e-05,0.000127,0.000153,8.6e-05,6.8e-05,5.2e-05,3.8e-05,5.3e-05,3.7e-05,4.9e-05,3.7e-05,3e-06,3.8e-05,9e-05,3.5e-05,6.7e-05,3.9e-05,6.3e-05,6.1e-05,1.9e-05,2.6e-05,3.6e-05,2.2e-05,2e-05,2.4e-05,2.9e-05,4e-06
8e-06,8e-06,1e-06,5.1e-05,0.000161,4.3e-05,5.8e-05,0.000336,0.000942,0.000422,1.1e-05,6.4e-05,0.000156,0.000226,0.000144,2.1e-05,0.000111,7.7e-05,0.001217,0.000292,0.0013,0.00067,0.000603,0.001703,0.000735,0.005013,0.005339,0.001161,0.001117,0.002214,0.00315,0.007023,0.005097,0.002744,0.005421,0.002506,0.002472,0.002201,0.002863,0.003802,2e-04,0.003441,0.006042,0.003372,0.008289,0.001838,0.002787,0.00413,0.001507,0.000763,0.005429,0.003383,0.00311,0.002436,0.003696,0.002166,0.000622,0.000415,0.000298,0.000495,0.000221,0.000882,0.000129,0.000384,0.000292,0.000497,0.000404,0.000556,0.000536,0.000877,0.000386,0.00057,0.000135,0.000164,0.000195,6.6e-05,5.2e-05,8e-05,3.6e-05,0.000121,3.5e-05,7.1e-05,0.000127,0.000377,0.000336,0.000629,0.000499,0.000435,0.00049,0.001368,0.000686,0.000212,1.5e-05,0.000158,0.000241,0.00017,5.9e-05,1.9e-05,0.000116,1.4e-05,4.3e-05,2.8e-05,5.9e-05,6.7e-05,5e-05,2.4e-05,2.9e-05,5.6e-05,8.9e-05,0.000124,0.000102,3.6e-05,0.000134,0.00014,6.8e-05,4.8e-05,5e-05,2.1e-05,6e-06,1.4e-05,2.1e-05
3e-06,8e-06,7e-06,3.8e-05,0.000147,9e-05,1.7e-05,0.000191,0.000947,0.00059,0.000213,9.8e-05,9.8e-05,0.000156,0.000206,0.000146,8.5e-05,2.3e-05,0.001308,0.000773,0.000514,0.000145,0.00091,0.001536,0.00075,0.002326,0.002358,0.002482,0.002745,0.002187,0.000723,0.005639,0.001844,0.000784,0.003938,0.004212,0.002256,0.001882,0.00274,0.003457,0.003122,0.00146,0.00214,0.004115,0.002569,0.001912,0.001172,0.001055,0.001502,0.002061,0.001869,0.001627,0.001386,0.002104,0.002578,0.000828,0.000509,0.000373,0.000396,0.000712,0.000484,0.000191,0.000453,0.000412,0.000159,0.000298,0.000285,5.8e-05,0.000357,0.000759,0.000442,0.000269,0.000129,0.000163,0.000262,0.000207,0.000135,8.5e-05,3.7e-05,6.7e-05,9e-05,6.4e-05,8.7e-05,8.7e-05,0.000122,0.00048,0.000193,0.000368,0.000233,0.001232,0.001035,0.000634,0.000201,0.000195,0.000211,0.000105,8.1e-05,3.9e-05,0.000171,0.000217,7.2e-05,6.2e-05,8.8e-05,2.6e-05,3.8e-05,3.8e-05,3e-05,5.8e-05,9.4e-05,0.000125,0.000214,0.000134,0.000109,0.000174,0.000103,4e-05,2.9e-05,2.8e-05,2.1e-05,1.5e-05,6e-06
6e-06,3e-06,2e-06,3.7e-05,0.000117,6.7e-05,6.3e-05,3e-04,0.000812,0.000406,0.000202,1.5e-05,8.4e-05,4.7e-05,0.000177,0.000227,0.000233,0.000155,0.001258,0.001008,0.000656,0.000266,0.000521,0.000638,0.000589,0.001161,0.001692,0.001197,0.002008,0.00116,0.000944,0.002516,0.001352,0.001793,0.001905,0.00094,0.001792,0.000509,0.000645,0.003336,0.000577,0.000793,0.000438,0.001133,0.001243,0.000828,0.00231,0.001423,0.000789,0.001703,0.001475,0.00147,0.001024,0.001002,0.000925,0.000493,0.000356,0.000255,6.3e-05,0.000487,4.3e-05,8.8e-05,0.000325,0.000215,7.6e-05,4.8e-05,0.000259,0.000178,0.000216,0.000995,0.000468,0.00031,0.000371,0.000146,0.000215,0.00023,0.000154,9.1e-05,6.7e-05,2.3e-05,7.4e-05,4.4e-05,0.000161,0.000273,0.000199,0.000275,0.000235,0.000273,0.000273,0.001186,0.000564,0.00034,9.5e-05,0.000281,0.000292,0.000105,0.000182,0.000146,0.000149,0.000134,0.00017,0.000176,5.6e-05,6.3e-05,8.2e-05,9.5e-05,3.3e-05,0.00012,0.00018,0.000165,0.000198,6e-05,8.6e-05,2.2e-05,1.5e-05,1.6e-05,3.4e-05,2.4e-05,3.5e-05,4e-06,2.2e-05
3e-06,1.2e-05,6e-06,3.8e-05,7.8e-05,5.1e-05,2.4e-05,0.000389,0.00045,0.000145,9.1e-05,7.1e-05,4.1e-05,3.9e-05,0.000186,6e-05,9e-06,2.6e-05,0.000992,0.001005,0.000338,0.000509,0.000584,0.001166,0.000786,0.000826,0.000618,0.001042,0.00167,0.000228,0.001265,0.000682,0.00087,0.001822,0.000323,0.0017,0.001739,0.000859,0.001502,0.002467,0.001996,0.001346,0.001124,0.000908,0.000156,0.001069,0.001441,0.001061,0.000743,0.000617,0.001871,0.001524,0.000563,0.000991,0.000549,0.000197,3.2e-05,0.000133,0.000205,0.000205,0.000171,3.9e-05,0.00038,0.000145,9.6e-05,0.000105,0.000219,4e-05,5.9e-05,0.000781,0.000529,0.000481,8.9e-05,0.000167,0.000105,0.000181,0.000144,0.000109,2.9e-05,1.2e-05,3.8e-05,1e-05,0.000161,0.000339,0.000168,7.2e-05,5.1e-05,0.000259,0.000473,0.00086,0.000407,0.000259,0.000152,0.000283,0.000327,0.00026,4.4e-05,7e-05,0.000126,5.7e-05,9e-05,5.5e-05,5.3e-05,0.000121,0.000107,1.1e-05,4.1e-05,0.000142,1e-04,0.000153,4.3e-05,3.8e-05,5.1e-05,3.4e-05,7e-06,9e-06,1.6e-05,7e-06,2e-05,1.7e-05,1.6e-05
3e-06,5e-06,3e-06,2.2e-05,2.1e-05,1.7e-05,2e-06,0.000216,0.000115,7.5e-05,2.7e-05,2.7e-05,3.3e-05,1.7e-05,4.2e-05,4.9e-05,5.1e-05,1.6e-05,0.000377,0.000612,0.000188,0.000112,0.000166,0.000718,0.000157,0.000204,0.000708,0.00068,0.000789,0.000183,0.000112,0.000484,0.00055,0.000232,0.000662,0.000654,0.000596,0.000202,0.000534,0.000608,0.000199,0.000782,0.000463,0.000499,0.000249,0.000237,0.000479,0.000356,0.000292,0.000229,0.000549,0.00054,0.000384,0.000388,0.000334,0.000214,5.1e-05,8e-05,3e-05,7.7e-05,7.3e-05,4.4e-05,0.000158,7.4e-05,6.1e-05,1.4e-05,5.1e-05,1.1e-05,1e-05,0.000224,0.00012,9.3e-05,2.5e-05,8.3e-05,6.2e-05,7.8e-05,3.6e-05,7e-06,1e-05,1.4e-05,1e-05,2.1e-05,3.2e-05,0.000145,7.6e-05,9.3e-05,7.6e-05,7.4e-05,8.7e-05,0.000215,0.000165,2.1e-05,6.4e-05,0.000138,3.9e-05,4e-05,5.3e-05,2.1e-05,3.3e-05,4.9e-05,2.2e-05,3.1e-05,1.4e-05,4.3e-05,1.4e-05,2.4e-05,1.6e-05,2.9e-05,3e-06,5e-05,4.1e-05,3.4e-05,3.8e-05,2.6e-05,2e-06,3e-06,3e-06,6e-06,7e-06,2e-06,1.1e-05
3e-06,3e-06,1e-06,2.1e-05,2.1e-05,1e-05,6e-06,0.000194,4.5e-05,2.4e-05,2.9e-05,2.2e-05,2.8e-05,1.3e-05,3.8e-05,2.3e-05,4.8e-05,3.4e-05,0.000306,0.000777,0.000259,0.000114,0.00018,0.000254,0.000127,0.000554,0.000897,0.000216,0.000632,0.000159,0.000588,0.000821,0.000391,0.000472,0.000446,0.000335,0.000382,0.000314,0.000148,0.000806,0.000807,0.00072,0.000343,0.000405,0.000185,0.000316,0.000411,0.000315,0.000206,0.000477,0.000162,0.000361,0.00022,0.000154,0.000318,6.7e-05,5.4e-05,4.1e-05,5e-05,7.1e-05,6.7e-05,3.2e-05,0.000109,5.6e-05,4.7e-05,4.9e-05,2.7e-05,2.5e-05,2e-05,8.7e-05,6.3e-05,4.3e-05,4.5e-05,3.6e-05,2.5e-05,3.8e-05,1.7e-05,2.1e-05,1.3e-05,1.1e-05,1.7e-05,4e-06,2e-05,0.000137,7.3e-05,8.8e-05,4.1e-05,3.2e-05,0.000127,0.000108,2.7e-05,1e-06,4.9e-05,3.5e-05,1e-05,8e-06,1.5e-05,6e-06,2.3e-05,1.6e-05,2.1e-05,2e-05,1.2e-05,1.7e-05,1e-06,1.1e-05,1.4e-05,2.8e-05,1.2e-05,8e-06,2.7e-05,2e-06,2.9e-05,5e-06,5e-06,3e-06,2e-06,7e-06,1.6e-05,1.1e-05,1.2e-05
2e-06,1e-06,1e-06,1.9e-05,2.2e-05,5e-06,5e-06,0.000126,4.9e-05,3e-05,2.9e-05,2.2e-05,3e-06,2.6e-05,2.6e-05,6.2e-05,5.6e-05,4.3e-05,0.000245,0.000533,0.000361,0.000232,0.000178,0.000446,9.4e-05,0.000586,0.000544,0.000737,0.000801,0.000306,0.00042,0.000618,0.000502,0.000272,0.000177,0.000354,0.000181,0.000346,0.000596,0.000262,0.000154,0.00065,0.000307,0.000392,0.000204,0.000146,0.000208,0.000211,0.000139,0.000373,4.2e-05,0.000326,0.000121,0.000196,0.000261,3.9e-05,3.6e-05,1.7e-05,1.8e-05,5.7e-05,4.8e-05,4.7e-05,5.1e-05,4e-06,4e-05,3.5e-05,5e-05,1.5e-05,8e-06,2.3e-05,1.6e-05,3.9e-05,1.6e-05,1.3e-05,2.4e-05,2.7e-05,2e-05,9e-06,4e-06,9e-06,9e-06,1e-05,2.4e-05,9.8e-05,3.8e-05,6.8e-05,2e-05,2.5e-05,9.5e-05,6.3e-05,3.7e-05,2.1e-05,2e-05,3.3e-05,1e-06,5e-06,1e-06,1.3e-05,4e-06,1.7e-05,2e-06,4e-06,6e-06,3e-06,1.1e-05,1e-06,6e-06,3e-05,1e-05,1.7e-05,1.9e-05,2.4e-05,1.1e-05,7e-06,4e-06,4e-06,3e-06,4e-06,7e-06,3e-06,8e-06
1e-06,4e-06,1e-06,1.9e-05,2.7e-05,1.9e-05,6e-06,9.1e-05,4.8e-05,2.2e-05,5.4e-05,4.6e-05,2.2e-05,3.6e-05,3.3e-05,8.3e-05,2.4e-05,2.9e-05,0.000168,4e-04,0.000633,0.000297,0.000163,0.000708,0.000243,0.000243,0.000501,0.000371,0.000422,0.00021,0.000209,0.00039,0.000272,0.000344,0.000512,0.000467,0.000427,0.000374,0.000396,0.000416,0.000574,4e-04,0.000239,0.00037,0.000231,0.000276,0.000506,0.000254,0.000129,0.000264,0.000175,0.000348,6.4e-05,0.000224,0.000115,8.9e-05,1.6e-05,6.7e-05,3.7e-05,5.2e-05,5e-05,4.1e-05,5e-06,5.2e-05,4.2e-05,6e-06,5.8e-05,1e-06,1e-05,2.4e-05,1.4e-05,4.2e-05,2.1e-05,1.2e-05,1.3e-05,3.3e-05,1.4e-05,1.1e-05,2e-06,1.2e-05,1.1e-05,1.4e-05,1.3e-05,7e-06,1.5e-05,3.7e-05,1.3e-05,1.9e-05,9.5e-05,0.000116,5.2e-05,4e-05,1.8e-05,2.7e-05,1e-05,4e-06,7e-06,6e-06,3e-06,5e-06,4e-06,2e-06,1.1e-05,2e-06,4e-06,2e-06,2e-06,3.1e-05,1.4e-05,1.9e-05,1.4e-05,1e-05,1.1e-05,7e-06,9e-06,8e-06,2e-06,3e-06,1e-06,1e-05,4e-06
0,3e-06,3e-06,1.8e-05,2.9e-05,2.2e-05,8e-06,0.000104,2.1e-05,1.8e-05,2.8e-05,2e-05,1.7e-05,2.6e-05,2e-05,3e-05,1.8e-05,4.2e-05,8.1e-05,0.000216,0.000649,0.000285,4.2e-05,0.000617,0.000111,0.000397,0.000195,0.000113,0.000579,0.000687,0.000892,0.000568,0.000175,0.000176,0.000375,0.000294,0.000354,0.000254,0.000354,0.000518,0.000278,0.000939,0.000599,0.000107,0.00014,0.000267,0.000577,0.000218,0.000108,0.000141,0.000294,0.000485,0.000322,0.000116,0.000177,4.6e-05,7.4e-05,7.4e-05,2.5e-05,6.5e-05,2e-05,5.3e-05,1.5e-05,1.8e-05,3.2e-05,2.7e-05,4.4e-05,1.1e-05,1e-06,2.2e-05,1.9e-05,2.8e-05,3.7e-05,2.5e-05,6e-06,2.5e-05,1.9e-05,1.1e-05,8e-06,1.4e-05,2e-06,1.5e-05,2.4e-05,7.4e-05,5.1e-05,6e-06,4.2e-05,1e-05,9.9e-05,0.000131,7.3e-05,2.3e-05,1.4e-05,2e-05,9e-06,8e-06,6e-06,1.2e-05,7e-06,8e-06,1e-06,4e-06,1e-05,8e-06,8e-06,3e-06,5e-06,2e-05,9e-06,2e-06,2e-06,1e-05,1.1e-05,4e-06,3e-06,4e-06,5e-06,2e-06,3e-06,7e-06,4e-06
1e-06,1e-06,1e-06,1.9e-05,1.8e-05,6e-06,1e-06,0.000108,5e-05,1.8e-05,3.3e-05,7e-06,2e-05,1e-05,2.8e-05,2.3e-05,1e-05,5.3e-05,7.4e-05,0.000194,0.000424,0.000279,0.000119,0.000359,0.000451,0.000358,0.000346,7.3e-05,0.000445,0.000515,2e-04,0.00059,0.000313,0.000299,0.000492,0.000469,0.000163,9.7e-05,0.000213,0.00061,0.000256,0.000612,0.000206,0.000196,0.000321,0.000217,0.00017,0.000134,0.000167,9.1e-05,0.00025,0.000118,5.7e-05,0.000166,0.000155,2.2e-05,5.4e-05,2.8e-05,2.3e-05,5.2e-05,1.9e-05,2e-05,6.3e-05,4.1e-05,5.3e-05,9e-06,2.7e-05,8e-06,1.1e-05,8.7e-05,4.7e-05,4.9e-05,1.2e-05,3.4e-05,1.3e-05,3.4e-05,4.8e-05,1.6e-05,9e-06,4e-06,8e-06,4e-06,2.8e-05,9.7e-05,7.2e-05,8.6e-05,2.2e-05,1.9e-05,9.8e-05,0.00013,6.7e-05,2.9e-05,1.6e-05,1.1e-05,2e-06,5e-06,5e-06,6e-06,5e-06,3e-06,6e-06,1e-06,2e-06,5e-06,8e-06,5e-06,7e-06,1.2e-05,1.2e-05,6e-06,1e-06,7e-06,8e-06,7e-06,6e-06,3e-06,6e-06,2e-06,2e-06,3e-06,7e-06
1e-06,1e-06,1e-06,1.8e-05,1e-05,1.2e-05,4e-06,9.6e-05,4.2e-05,3.5e-05,1.5e-05,8e-06,5e-06,1.1e-05,2.6e-05,2.6e-05,1.9e-05,4.5e-05,4.2e-05,0.000232,0.000221,0.000229,0.000142,0.000146,9.4e-05,0.000171,8.6e-05,0.00025,0.00047,0.00024,0.000218,0.000433,0.000168,0.000281,0.00035,0.000147,0.000345,0.000364,0.000178,0.000488,0.000166,0.000233,0.00022,0.000281,0.000571,0.000344,0.00022,0.000193,0.000149,2.3e-05,0.000271,0.000384,8.2e-05,0.000323,0.000193,0.000121,5.6e-05,5.9e-05,4.3e-05,8.7e-05,4.3e-05,2.9e-05,2.9e-05,3.4e-05,6.1e-05,3.4e-05,4.9e-05,1e-05,2.4e-05,0.00017,4.7e-05,5.9e-05,2.6e-05,3.2e-05,3.2e-05,1.3e-05,4e-05,3.4e-05,1.7e-05,1.9e-05,1.3e-05,1.7e-05,1.6e-05,4.2e-05,3.4e-05,4.1e-05,2.3e-05,1.3e-05,0.000103,9.7e-05,4.7e-05,2.7e-05,8e-06,2.1e-05,2e-06,7e-06,6e-06,1.6e-05,3e-06,1.6e-05,8e-06,9e-06,5e-06,3e-06,5e-06,4e-06,4e-06,1.3e-05,7e-06,1e-05,4e-06,1e-05,9e-06,2e-06,3e-06,1e-06,4e-06,7e-06,3e-06,9e-06,8e-06
2e-06,1e-06,2e-06,1.7e-05,1.4e-05,1.2e-05,3e-06,6e-05,2.2e-05,1.5e-05,5e-06,9e-06,4e-06,2.6e-05,2.4e-05,4.5e-05,4e-05,4.4e-05,6.4e-05,5.2e-05,0.000257,6e-05,4.9e-05,0.000398,0.000312,0.000165,9.6e-05,9.3e-05,0.000407,0.000415,0.000222,0.000416,0.000333,8.4e-05,0.000285,0.000289,0.000273,0.000402,0.000633,0.000549,0.000249,0.000334,0.000195,0.000277,0.000511,0.000176,2e-04,0.000206,0.000174,0.000155,0.000171,6.1e-05,0.000203,0.000173,0.000148,0.000139,5.6e-05,2.4e-05,1.4e-05,0.000111,0.000129,5.2e-05,3.1e-05,1.2e-05,1.9e-05,2.1e-05,6.7e-05,4.4e-05,4.4e-05,0.000211,0.000202,0.000169,3e-05,1.6e-05,6.5e-05,5.7e-05,6e-06,9e-06,1.5e-05,1.2e-05,8e-06,1.1e-05,1.1e-05,4e-05,5.6e-05,5.3e-05,1e-05,1.1e-05,7.5e-05,9.3e-05,7.5e-05,3.4e-05,1.4e-05,3.9e-05,1.6e-05,8e-06,1.8e-05,3.1e-05,3.1e-05,6e-06,1e-05,1.3e-05,1.6e-05,1.2e-05,8e-06,1.2e-05,8e-06,1.9e-05,8e-06,3e-06,2e-06,1.1e-05,1.7e-05,9e-06,5e-06,5e-06,3e-06,5e-06,8e-06,2e-06,2e-06
2e-06,1e-06,2e-06,1.5e-05,1e-05,4e-06,4e-06,4.4e-05,3e-05,3.9e-05,6.1e-05,2.7e-05,5e-06,2.9e-05,3.3e-05,2e-06,3.5e-05,2.6e-05,0.000107,0.000165,8.1e-05,6e-05,4e-05,0.000534,9.1e-05,0.00019,7.4e-05,0.000196,0.000389,0.000322,0.000217,2.3e-05,5e-05,0.00018,0.000311,0.00029,0.000238,0.000322,0.000456,9.7e-05,4.1e-05,0.000293,0.000148,0.000227,0.000215,0.000189,0.000184,0.000167,0.000127,0.000199,0.000129,0.000186,0.000107,5.9e-05,0.000218,5.4e-05,2.2e-05,1.9e-05,1e-05,9.6e-05,0.000116,8.8e-05,0.000108,7.1e-05,6.1e-05,3.2e-05,7e-05,4e-05,1.6e-05,0.000181,0.000139,3.3e-05,3.1e-05,4.3e-05,7.5e-05,2.9e-05,1.1e-05,1.3e-05,5e-06,7e-06,9e-06,1.8e-05,2e-05,8.1e-05,1.7e-05,2.8e-05,5e-06,7e-06,7e-05,8.3e-05,4.6e-05,1e-05,1.6e-05,2.3e-05,2.7e-05,1.1e-05,1.8e-05,1.8e-05,1.1e-05,1.6e-05,1.4e-05,1.2e-05,4e-06,4e-06,9e-06,2e-06,7e-06,1.4e-05,5e-06,1.1e-05,7e-06,5e-06,1.1e-05,1e-06,6e-06,3e-06,3e-06,2e-06,4e-06,4e-06,4e-06
1e-06,1e-06,2e-06,1.5e-05,2e-06,1e-05,2e-06,5.7e-05,2.9e-05,1.9e-05,4.2e-05,4e-06,1.5e-05,1.6e-05,1.1e-05,2.1e-05,7e-05,4.2e-05,0.000103,0.00012,2.5e-05,6.8e-05,2.5e-05,0.000469,0.000226,0.000116,0.000226,7.1e-05,0.000318,0.00022,3.9e-05,0.000184,0.000274,0.000204,0.000265,0.000225,0.000213,0.000136,0.000277,0.000368,0.000185,0.000223,0.000296,0.000165,6.5e-05,0.000122,0.000308,9.5e-05,1e-04,0.000129,0.000154,0.000271,9.7e-05,0.000154,0.000197,1.3e-05,4.2e-05,6.5e-05,1.4e-05,4.2e-05,4.5e-05,4.6e-05,0.000134,2.5e-05,4.9e-05,3.9e-05,3e-05,8e-06,1.7e-05,0.00012,4.6e-05,3.7e-05,4.2e-05,3.4e-05,2.3e-05,1.9e-05,1.6e-05,1.7e-05,7e-06,1e-05,1.3e-05,1e-05,1.1e-05,7.9e-05,4.3e-05,5e-05,1.1e-05,1.7e-05,9.8e-05,9.8e-05,6e-05,7e-06,1.1e-05,1.7e-05,1.7e-05,1.3e-05,1.5e-05,4e-06,6e-06,6e-06,1.4e-05,3e-06,3e-06,4e-06,7e-06,2e-06,5e-06,1.2e-05,9e-06,1.4e-05,4e-06,7e-06,5e-06,5e-06,3e-06,4e-06,2e-06,2e-06,3e-06,2e-06,1e-06
2e-06,2e-06,1e-06,1.5e-05,3e-06,3e-06,4e-06,6.8e-05,2.8e-05,1.1e-05,1.8e-05,2.8e-05,3e-05,1.9e-05,2e-05,2.4e-05,3.8e-05,2.4e-05,7.6e-05,8.4e-05,0.000105,0.000157,7.2e-05,0.000223,0.000174,0.000175,0.000204,0.000138,0.000307,6.3e-05,0.000248,0.000309,4.3e-05,0.000286,0.000119,0.000199,0.000174,0.000279,0.000716,0.000268,4.1e-05,0.000105,7.8e-05,0.000232,5.5e-05,0.000142,0.000233,0.000116,8.3e-05,3.3e-05,0.000224,9.7e-05,6.8e-05,0.00015,2e-04,0.000135,6e-05,2.5e-05,7.7e-05,1.9e-05,3.7e-05,1.4e-05,9.6e-05,8.3e-05,6.1e-05,4.6e-05,5.2e-05,2.5e-05,1.7e-05,0.000102,4.2e-05,2.7e-05,2.8e-05,2.7e-05,2.2e-05,3.8e-05,1.1e-05,1.9e-05,1.3e-05,1.1e-05,7e-06,1.3e-05,2.2e-05,4.4e-05,1.1e-05,5.1e-05,3.3e-05,2.4e-05,0.000107,7.8e-05,2.4e-05,2.1e-05,1.8e-05,4e-06,8e-06,1.3e-05,2e-05,1.3e-05,7e-06,1.1e-05,6e-06,5e-06,7e-06,3e-06,4e-06,4e-06,4e-06,1e-05,1e-05,9e-06,6e-06,4e-06,8e-06,7e-06,1e-06,2e-06,1e-06,2e-06,2e-06,2e-06,3e-06
1e-06,1e-06,1e-06,1.5e-05,1e-05,5e-06,7e-06,5.2e-05,3.5e-05,4.9e-05,3.5e-05,2.6e-05,1.8e-05,1e-06,9e-06,3.7e-05,4.8e-05,4.4e-05,6.3e-05,0.000144,0.000192,0.000128,2e-05,0.000202,0.000125,0.000268,0.000206,0.000225,0.000294,0.000202,0.000123,0.000439,0.000163,0.000217,0.000196,0.000338,0.000185,0.000447,0.00056,0.00025,0.000201,8.7e-05,0.000115,0.000197,0.000123,9.8e-05,0.000184,0.00012,9.8e-05,8.8e-05,0.000111,0.000196,7e-05,8.7e-05,4.3e-05,8.2e-05,0.00012,3.2e-05,7e-05,7.2e-05,4.6e-05,2.1e-05,6e-05,3.2e-05,5e-06,1.4e-05,2e-05,1.1e-05,2.8e-05,5.2e-05,5.5e-05,2.5e-05,4e-05,2.5e-05,1e-05,3.4e-05,2.7e-05,2.2e-05,1.3e-05,4e-06,7e-06,1e-05,1.8e-05,3.1e-05,4e-05,2.8e-05,1.9e-05,2.9e-05,9.5e-05,6.6e-05,4.4e-05,1.8e-05,1.7e-05,1.3e-05,2e-06,1.1e-05,9e-06,1e-05,5e-06,9e-06,5e-06,7e-06,5e-06,5e-06,3e-06,2e-06,2e-06,1.1e-05,1.2e-05,1.1e-05,3e-06,6e-06,8e-06,3e-06,5e-06,2e-06,3e-06,5e-06,5e-06,3e-06,3e-06
1e-06,3e-06,2e-06,1.3e-05,1.5e-05,1.3e-05,8e-06,2.8e-05,2.9e-05,3.2e-05,2.1e-05,5e-06,1.8e-05,1.8e-05,1.5e-05,2.9e-05,2.1e-05,6.8e-05,9.6e-05,9.4e-05,0.000135,0.00014,8.8e-05,0.000328,0.000163,0.000131,7e-05,0.000116,0.00023,0.000173,3.4e-05,0.000213,9.2e-05,0.000206,0.000233,0.000138,0.000219,0.000408,0.000161,8.6e-05,6.7e-05,0.000232,0.000151,0.000151,0.000239,0.000206,0.000202,8.2e-05,7.7e-05,0.000122,8.7e-05,0.000147,1e-04,9.1e-05,9.9e-05,4.9e-05,8.1e-05,4.7e-05,3.5e-05,4.1e-05,4.2e-05,3.1e-05,5.2e-05,2.9e-05,2.4e-05,1.7e-05,2.8e-05,2.3e-05,3.5e-05,4.8e-05,5.8e-05,3.7e-05,3.7e-05,3e-05,1.3e-05,2.4e-05,1.5e-05,2e-05,2.3e-05,1.1e-05,1.5e-05,1.6e-05,1.3e-05,6.9e-05,5.2e-05,3.6e-05,6e-06,5.1e-05,4.2e-05,7.7e-05,2.4e-05,3e-06,2.3e-05,3.2e-05,1.6e-05,9e-06,1.1e-05,3e-06,3e-06,6e-06,8e-06,8e-06,8e-06,6e-06,4e-06,5e-06,1e-06,6e-06,1e-05,6e-06,5e-06,5e-06,5e-06,4e-06,6e-06,7e-06,2e-06,6e-06,3e-06,5e-06,2e-06
1e-06,1e-06,1e-06,1.2e-05,1.7e-05,8e-06,6e-06,7e-06,5.8e-05,3.9e-05,2.5e-05,1.8e-05,3.2e-05,1.1e-05,2.3e-05,5e-06,3.3e-05,2.6e-05,0.000127,0.00037,0.00037,0.000102,3.9e-05,0.000311,0.000223,0.000181,7.2e-05,0.000166,0.000292,1.2e-05,0.00011,0.000114,0.000105,0.000212,0.000235,0.000301,0.000204,0.000178,0.000251,0.000332,0.000231,0.000326,0.00017,0.000193,0.000321,4.2e-05,0.000141,0.000117,5.3e-05,9.3e-05,5.5e-05,7.5e-05,1.8e-05,0.000127,0.000236,8.7e-05,0.000138,7.1e-05,7.3e-05,2.8e-05,6.3e-05,2.4e-05,3.8e-05,4.7e-05,6e-06,3.3e-05,2.5e-05,1.9e-05,3e-06,7.6e-05,1.5e-05,3.2e-05,5e-05,3e-05,1.7e-05,2e-06,5.7e-05,3.9e-05,1.7e-05,1e-05,6e-06,1.1e-05,1.2e-05,8.2e-05,3.1e-05,3.2e-05,1.5e-05,3.4e-05,8e-05,0.000107,6.5e-05,2.1e-05,2.2e-05,2.2e-05,1.8e-05,2.4e-05,2.6e-05,5e-06,8e-06,1.1e-05,6e-06,5e-06,5e-06,6e-06,8e-06,3e-06,2e-06,1.9e-05,5e-06,1e-05,2e-06,6e-06,3e-06,3e-06,3e-06,5e-06,4e-06,5e-06,5e-06,2e-06,4e-06
1e-06,1e-06,2e-06,1.1e-05,1.1e-05,1.1e-05,7e-06,4.5e-05,2e-05,2.7e-05,9e-06,1.5e-05,1.1e-05,1.2e-05,1.7e-05,1.9e-05,3.2e-05,2.8e-05,0.000176,0.000302,9.6e-05,2.3e-05,3.5e-05,0.000238,0.00025,0.000188,0.000185,0.000223,0.000149,0.000244,0.000183,0.00027,8.4e-05,0.000197,0.000172,0.00019,8.1e-05,8.7e-05,0.000386,0.000226,0.000143,0.000215,0.000101,0.000187,0.000264,0.000123,0.000159,0.000164,3e-05,6.8e-05,8.1e-05,0.00018,5.9e-05,0.000214,2.4e-05,5.3e-05,0.000104,0.000109,9.1e-05,0.000102,0.000115,8e-05,6.5e-05,8.4e-05,7.6e-05,8.2e-05,7.8e-05,5e-05,1.6e-05,9.3e-05,6.2e-05,5e-05,7.7e-05,6.1e-05,1.2e-05,3.9e-05,7.1e-05,6.3e-05,3.7e-05,2.4e-05,1.9e-05,1.9e-05,6e-06,9.2e-05,0.000111,4.6e-05,1.9e-05,3.3e-05,5.6e-05,9.2e-05,0.000122,7e-05,1e-05,1.1e-05,1.2e-05,1.5e-05,2e-06,5e-06,6e-06,3e-06,2e-06,6e-06,8e-06,5e-06,4e-06,5e-06,5e-06,3.1e-05,2.1e-05,3e-06,4e-06,4e-06,3e-06,5e-06,2e-06,3e-06,2e-06,1e-06,5e-06,3e-06,1e-06
2e-06,2e-06,1e-06,1.3e-05,2e-06,5e-06,1.1e-05,5e-05,4.1e-05,2e-05,1.1e-05,2.4e-05,1e-05,1.1e-05,2.4e-05,2.7e-05,6.2e-05,5.6e-05,0.000165,0.000345,0.000228,6.4e-05,5.8e-05,3.6e-05,0.000122,6.8e-05,6.9e-05,0.000102,0.000258,0.000329,0.000114,0.000234,6e-06,0.000257,0.000102,0.000132,0.000123,0.000336,0.000661,0.000314,0.000221,0.000262,0.000215,0.000225,0.000234,2.1e-05,0.000207,5.6e-05,4.1e-05,1.7e-05,0.000165,0.000215,0.000149,0.000153,0.000149,0.000118,0.000152,2.2e-05,6.5e-05,3.8e-05,2e-05,1.1e-05,2.2e-05,6.4e-05,3.8e-05,4.6e-05,4.3e-05,8.5e-05,6.6e-05,6.6e-05,2.5e-05,2.8e-05,5.7e-05,4.6e-05,4.4e-05,5e-05,3.5e-05,1.8e-05,1.6e-05,2e-05,1.2e-05,3e-06,2.7e-05,4.4e-05,0.000148,0.000128,2.2e-05,3.9e-05,6.4e-05,5.6e-05,9.8e-05,5.5e-05,1.3e-05,2.4e-05,2.4e-05,2.1e-05,1.1e-05,5e-06,4e-06,6e-06,6e-06,5e-06,7e-06,7e-06,6e-06,9e-06,2e-06,2.4e-05,6e-06,1e-06,0,4e-06,7e-06,5e-06,3e-06,1e-06,1e-06,3e-06,1e-06,1e-06,3e-06
1e-06,0,1e-06,1.4e-05,2e-06,6e-06,8e-06,4.2e-05,1.2e-05,2.1e-05,1.6e-05,1.6e-05,1.3e-05,3e-06,2.1e-05,2.8e-05,2.3e-05,3.6e-05,0.000126,0.000299,2e-04,0.000111,1.9e-05,0.000149,0.000156,0.00029,6.4e-05,8.6e-05,0.000168,0.000337,0.00015,0.000175,5.3e-05,0.000241,0.00024,0.000277,0.000262,0.000234,0.000437,0.000114,0.000177,0.00044,0.000218,8e-05,0.000278,0.000152,0.000291,1e-04,3.5e-05,7.4e-05,0.00023,0.000177,0.000114,5e-05,0.000108,8.7e-05,5.8e-05,8.4e-05,3.7e-05,1.5e-05,2.5e-05,2.8e-05,1.1e-05,4e-05,1.8e-05,2.5e-05,1.9e-05,4.7e-05,1.4e-05,1.3e-05,1.6e-05,3.3e-05,3.1e-05,1.1e-05,1.4e-05,2e-05,2.3e-05,2e-06,1.4e-05,6e-06,1.8e-05,3e-06,2.2e-05,2.2e-05,9.6e-05,8.8e-05,6.5e-05,1.7e-05,2.9e-05,6.3e-05,6.2e-05,1.9e-05,7e-06,2e-05,9e-06,5e-06,7e-06,2e-06,1e-06,5e-06,6e-06,3e-06,6e-06,3e-06,8e-06,2e-06,3e-06,7e-06,1.1e-05,2e-06,2e-06,4e-06,6e-06,3e-06,3e-06,2e-06,0,4e-06,3e-06,1e-06,2e-06
1e-06,0,0,1.3e-05,3e-06,5e-06,4e-06,2.4e-05,3.2e-05,8e-06,2.7e-05,9e-06,1.1e-05,4e-06,1.2e-05,1.6e-05,1.6e-05,1e-05,7.7e-05,0.000256,9.8e-05,5.8e-05,4.5e-05,0.000156,1.4e-05,0.000138,0.000141,8.3e-05,0.000157,0.000327,8.8e-05,0.000154,2.1e-05,0.000232,0.000224,0.000166,0.000263,0.000237,0.000228,9.3e-05,0.000189,0.000143,1e-04,0.00011,0.000199,0.000123,0.000195,7.1e-05,7.6e-05,0.000129,0.000137,0.00015,0.000159,8.5e-05,7.7e-05,4.7e-05,3.2e-05,1.9e-05,9e-06,5e-06,1.1e-05,1.6e-05,1.2e-05,1.4e-05,2.5e-05,1.5e-05,1.3e-05,1.7e-05,1.2e-05,3.8e-05,3e-05,2.1e-05,9e-06,9e-06,2e-05,6e-06,1.2e-05,1.1e-05,7e-06,4e-06,1.1e-05,5e-06,1.1e-05,2.6e-05,9.4e-05,3.4e-05,2.1e-05,1.2e-05,4.3e-05,6.8e-05,1.5e-05,1.1e-05,3e-06,1.4e-05,4e-06,4e-06,6e-06,1e-06,2e-06,3e-06,3e-06,2e-06,4e-06,2e-06,7e-06,1e-06,1e-06,5e-06,5e-06,4e-06,1e-06,5e-06,1e-06,5e-06,0,0,0,2e-06,2e-06,1e-06,2e-06
1e-06,1e-06,1e-06,1.4e-05,3e-06,6e-06,4e-06,8e-06,4e-06,1.3e-05,2e-05,7e-06,4e-06,6e-06,1e-05,1.8e-05,9e-06,5e-06,7.4e-05,0.000195,0.000127,2.4e-05,4.7e-05,0.00018,0.000108,7.3e-05,0.000123,0.000204,0.000236,0.000108,0.000191,0.000109,7.6e-05,0.000268,0.000126,0.000244,0.000141,6.4e-05,0.000232,7.5e-05,9.2e-05,0.000118,6.6e-05,0.000149,0.000172,7.8e-05,0.000212,7.2e-05,6.9e-05,9.3e-05,8.8e-05,0.000107,0.000137,6.1e-05,8.5e-05,3.8e-05,2.2e-05,1.4e-05,1e-05,1.1e-05,8e-06,1.3e-05,1.4e-05,2.5e-05,2e-05,8e-06,5e-06,1e-05,1.5e-05,4.6e-05,1.3e-05,2.1e-05,3e-06,9e-06,1.9e-05,3e-06,8e-06,6e-06,8e-06,1e-06,7e-06,3e-06,1.1e-05,3.3e-05,3.9e-05,7e-06,1.2e-05,5e-06,4.1e-05,4e-05,1e-05,1e-05,7e-06,1.2e-05,6e-06,2e-06,8e-06,1e-06,2e-06,5e-06,5e-06,3e-06,5e-06,0,6e-06,0,1e-06,8e-06,5e-06,5e-06,1e-06,4e-06,4e-06,3e-06,0,1e-06,1e-06,3e-06,2e-06,1e-06,2e-06
1e-06,1e-06,0,1.4e-05,2e-06,5e-06,3e-06,1.5e-05,1.5e-05,1.3e-05,1.4e-05,3e-06,1e-05,4e-06,7e-06,1.6e-05,6e-06,3e-06,8.8e-05,0.000221,0.000122,5.7e-05,4.5e-05,0.000236,2.7e-05,0.000153,6.9e-05,9.3e-05,0.000174,8.1e-05,0.000113,0.000266,2.2e-05,0.000287,0.000116,0.000202,0.000153,7.5e-05,0.00029,5.2e-05,0.000119,0.000146,1.8e-05,0.000116,0.000173,6.2e-05,0.000217,9e-05,6.4e-05,6.7e-05,3.8e-05,0.000114,9e-05,1.5e-05,6.9e-05,2.4e-05,2e-05,3e-06,1.6e-05,9e-06,7e-06,1.4e-05,5e-06,2.1e-05,1.9e-05,7e-06,7e-06,9e-06,1.3e-05,2.8e-05,9e-06,2.5e-05,1e-06,4e-06,1e-05,6e-06,5e-06,1e-06,2e-06,4e-06,7e-06,4e-06,1.1e-05,2.4e-05,3.8e-05,1.4e-05,7e-06,4e-06,4.1e-05,1.8e-05,7e-06,3e-06,2e-06,1.1e-05,3e-06,3e-06,7e-06,0,1e-06,4e-06,5e-06,1e-06,4e-06,0,5e-06,1e-06,1e-06,7e-06,3e-06,5e-06,1e-06,4e-06,4e-06,3e-06,1e-06,0,1e-06,3e-06,2e-06,1e-06,2e-06
