2.1e-05,1.2e-05,1e-05,1.2e-05,0.000107,0.000199,6.3e-05,5e-06,6e-06,5.5e-05,8e-05,3.5e-05,2.1e-05,0.00094,3e-04,0.000202,0.000191,0.000731,0.000476,0.000275,5.4e-05,0.000243,0.000282,8.4e-05,0.000379,0.000604,0.000268,0.000178,0.000499,0.000324,0.000841,0.000757,0.000529,0.001099,0.00059,0.000429,0.000145,0.000313,0.000609,0.000138,1e-05,0.000456,7.3e-05,9.9e-05,0.000214,3.8e-05,0.00044,0.00017,1.6e-05,0.000168,4e-06,0.000336,4.5e-05,0.000364,9.6e-05,8.1e-05,8.2e-05,3.7e-05,8.5e-05,4.7e-05,5.6e-05,2.5e-05,1.1e-05,0.000104,6e-06,5.1e-05,3.8e-05,0.000142,2e-05,7e-05,9.9e-05,5.7e-05,2.7e-05,2.6e-05,1.5e-05,2.6e-05,1.6e-05,0,3.5e-05,2e-06,4e-06,1.2e-05,0,7e-06,3.1e-05,3.1e-05,4.3e-05,4e-06,5e-06,3.5e-05,2.9e-05,4e-06,3e-05,1.4e-05,2e-05,3e-06,1.3e-05,4e-06,7e-06,1e-05,2e-06,2e-06,6e-06,1.9e-05,1.7e-05,1.8e-05,1.2e-05,2.1e-05,4e-06,1e-06,1e-05,4.4e-05,9e-06,5e-06,1.8e-05,2e-06,9e-06,4e-06,1.6e-05,1.7e-05,4e-06
3.5e-05,2.5e-05,5.1e-05,1.9e-05,0.000333,0.000233,0.000268,5.1e-05,7.4e-05,0.00013,0.000128,9.5e-05,0.000129,0.002543,0.000919,0.000965,0.000355,0.001571,0.00161,0.001744,0.001573,0.00079,0.000414,0.000784,0.000991,0.001227,0.000405,0.000198,0.000639,0.000496,0.000975,0.003167,0.001295,0.003403,0.002699,0.002058,0.001089,0.000153,0.000508,0.000798,0.001001,0.001018,0.000374,0.000198,0.000791,0.000666,0.000653,0.000574,0.000675,0.000623,0.000504,0.000708,0.000488,0.000808,0.000437,0.000112,0.000213,0.000355,0.000281,0.000339,0.000168,0.000161,9.7e-05,0.000232,7.5e-05,0.000148,0.000171,0.000387,0.000291,0.000213,0.000214,7.1e-05,0.000113,3.9e-05,3.7e-05,3.6e-05,8.6e-05,6.5e-05,8.4e-05,2.8e-05,3.7e-05,2.6e-05,3.1e-05,0.000106,6.5e-05,4.3e-05,6.8e-05,5e-06,5.1e-05,7.3e-05,2.8e-05,5e-06,5.4e-05,2.7e-05,2e-05,4.1e-05,1.1e-05,2.5e-05,2.1e-05,2.8e-05,3e-05,2.5e-05,1e-06,4.1e-05,3.9e-05,3.5e-05,1.2e-05,2.6e-05,3.5e-05,3.2e-05,4e-05,6.1e-05,3.6e-05,1.6e-05,4.6e-05,1.6e-05,2.9e-05,2.3e-05,5.2e-05,2.2e-05,2.3e-05
7.8e-05,2.8e-05,4.9e-05,8.7e-05,0.000299,0.000641,0.000131,2.2e-05,9.9e-05,0.000169,0.000163,5.6e-05,4e-05,0.003029,0.001288,0.000495,0.000155,0.00123,0.002147,0.000193,0.001842,0.001806,0.000269,0.000742,0.000897,0.000823,0.001252,0.00107,7.6e-05,0.00108,0.000342,0.001796,0.001247,0.003332,0.004136,0.003572,0.001691,0.00074,0.00029,0.000243,0.000768,0.001727,0.001143,0.001085,0.001611,0.000562,0.000921,0.001127,0.000351,0.000315,0.000917,0.000759,0.00057,0.001265,0.000618,0.000384,0.000644,0.000676,0.000437,0.000284,8.3e-05,6.1e-05,0.000109,0.00021,0.000185,0.00015,0.000202,0.000522,0.000395,0.000323,0.000194,5e-05,9.1e-05,0.000113,0.000146,6.4e-05,0.000123,5.8e-05,3.4e-05,3.4e-05,7.4e-05,8.1e-05,8.7e-05,0.000127,0.00016,5.4e-05,7.7e-05,7e-06,5.1e-05,0.000127,7.9e-05,4.3e-05,5.1e-05,6e-05,7.2e-05,2.4e-05,3.9e-05,2.7e-05,2.4e-05,4.1e-05,1.2e-05,4e-05,2.8e-05,5.2e-05,1.4e-05,2.7e-05,4.2e-05,2.2e-05,1.3e-05,2.8e-05,1.3e-05,8.5e-05,4.5e-05,2.6e-05,7.5e-05,6e-06,2.6e-05,3.1e-05,2.8e-05,1.5e-05,2.4e-05
6.1e-05,7.5e-05,7.5e-05,9.1e-05,6.1e-05,0.000407,0.000124,5e-06,8.2e-05,3.6e-05,0.000108,0.000121,5.7e-05,0.002887,0.00065,0.000259,0.000102,0.000814,0.00221,0.002261,0.002989,0.001443,0.001709,0.000749,0.000876,0.001176,0.001253,0.00051,0.000415,0.001758,0.001979,0.001181,0.00243,0.003474,0.002968,0.001606,0.001293,0.000128,0.000539,0.000841,0.00035,0.001083,0.000985,0.000903,0.001209,0.000701,0.000639,0.000582,0.000173,0.000239,0.000368,0.001254,0.000346,0.001202,0.000477,0.000223,0.001135,0.000573,0.000536,0.000225,0.000303,0.000308,0.000382,0.000148,0.000119,0.000172,0.000162,0.000707,0.000402,0.000373,0.000326,9.6e-05,8.2e-05,3.5e-05,0.000164,0.000231,0.000108,2e-04,0.000187,0.000142,0.000147,6.2e-05,4.9e-05,2.8e-05,5e-05,4.5e-05,4.1e-05,5e-05,5.5e-05,0.000154,0.000127,5.9e-05,7e-05,4.5e-05,5.3e-05,2.3e-05,0.000101,8.7e-05,8.7e-05,2.7e-05,2e-05,4.7e-05,5.1e-05,0.00012,8.7e-05,2.1e-05,7e-05,2.3e-05,3.9e-05,7.1e-05,3.6e-05,0.00012,7.7e-05,5.7e-05,0.000129,7.6e-05,3e-05,4.2e-05,6.4e-05,4.8e-05,2.5e-05
3.4e-05,7.7e-05,2.3e-05,0.000212,0.000104,0.000526,0.000208,8.7e-05,0.000104,0.000109,0.000196,0.000179,0.000147,0.003152,0.000338,0.000243,0.000127,0.000347,0.001605,0.002898,0.001413,0.002477,0.001926,0.00135,0.000187,0.000929,0.001658,0.001547,0.001004,0.000866,0.001303,0.001615,0.001723,0.004024,0.002873,0.000638,0.000345,0.000459,0.000422,0.001246,0.000461,0.001342,0.000903,0.000696,0.001426,0.001535,0.001097,0.000308,0.000916,0.000643,0.00035,0.001572,0.001168,0.001618,0.001301,0.000855,0.001219,0.001673,0.000791,0.000304,0.000449,0.000216,0.000312,0.000503,0.000517,6e-05,0.000295,0.000702,0.000504,0.000268,0.000296,9.8e-05,0.000102,7.8e-05,0.00018,0.000116,0.000107,0.00015,9e-05,0.000109,8.7e-05,9.5e-05,0.000118,3.3e-05,0.000128,0.000136,0.000183,7.9e-05,0.000105,0.000195,0.000103,0.00012,8.6e-05,5.5e-05,0.000154,3.9e-05,0.000168,6.7e-05,8.8e-05,4.7e-05,5.7e-05,4.7e-05,3.2e-05,0.000134,6.1e-05,8e-05,0.000126,0.000112,9.6e-05,0.00013,0.000123,8.3e-05,9.6e-05,0.000114,7.9e-05,3.4e-05,6.7e-05,3.1e-05,4.5e-05,3.3e-05,6.6e-05
7.7e-05,6e-05,0.000157,0.000493,0.000368,0.000625,0.000155,0.000168,0.000132,0.00016,0.00017,6.6e-05,7.3e-05,0.004917,0.001361,0.000461,0.000143,0.000314,0.001108,0.001642,0.002821,0.003092,0.002352,0.000679,0.001453,0.000484,0.000835,0.001028,0.000937,0.000447,0.003208,0.003126,0.001736,0.0036,0.003916,0.001991,0.001565,0.000574,0.000755,0.00075,0.000347,0.00111,0.002092,0.002478,0.001113,0.000672,0.001068,0.001002,0.001459,0.000856,0.000918,0.001036,0.001466,0.000881,0.000316,0.000763,0.000135,0.000882,0.000389,0.000298,0.000608,0.000168,0.000426,0.000153,0.000532,0.000592,0.000381,0.000997,0.000622,0.000362,0.000379,0.000468,0.000165,0.000109,0.000175,0.000363,0.000203,0.000226,0.000304,0.000283,0.000145,0.000126,0.000107,0.000191,0.000359,0.000356,0.00059,0.000315,0.000227,0.000412,0.000443,0.000154,0.000205,8.6e-05,0.000117,0.00023,0.000322,0.000296,0.000278,0.00015,0.000119,7.4e-05,3.5e-05,0.00016,0.000182,2.8e-05,0.000275,0.000223,0.000104,0.000148,0.000285,0.000237,0.000283,2.4e-05,0.000122,2e-04,0.000141,6.3e-05,0.000109,0.000113,0.000174
0.000112,0.000147,0.000203,0.000358,9.8e-05,0.000891,0.000329,4.3e-05,0.000148,0.00025,9.8e-05,0.000192,0.000115,0.006649,0.00226,0.00115,0.000111,0.000206,0.001204,0.003891,0.004194,0.000816,0.001601,0.000818,0.002471,0.001499,0.00106,0.001826,0.000912,0.001932,0.00491,0.004083,0.002792,0.002851,0.002665,0.001139,0.001396,0.002085,0.001275,0.000197,0.000378,0.001291,0.002124,0.001349,0.001421,0.002175,0.001399,0.002031,0.001052,0.001947,0.001351,0.001529,0.000572,0.001434,0.001918,0.000877,0.001066,6.2e-05,0.000453,0.000668,0.000358,0.000612,8e-06,0.000514,0.000378,0.000174,0.00046,0.000431,5e-05,0.000228,0.000175,0.000617,0.000437,0.000181,8.6e-05,0.000297,0.000123,9.3e-05,0.000175,0.000395,0.000211,0.000172,5.6e-05,0.00016,0.000307,0.000173,0.000554,0.000448,0.000217,0.00015,0.000346,0.00043,0.000347,0.000263,0.000189,0.000201,5e-05,0.000166,0.000214,0.000264,0.000226,0.000274,0.000125,0.000152,8.7e-05,0.000136,0.000288,0.000129,5.2e-05,0.000106,0.000202,5.8e-05,0.000305,0.000349,0.000204,0.000148,0.000257,0.000179,0.000171,0.000181,8.5e-05
7.4e-05,4.9e-05,0.000185,0.000558,0.000961,0.001321,0.001378,0.000551,0.000216,0.000297,0.000295,0.000133,8.9e-05,0.007743,0.008767,0.004625,0.001511,0.000504,0.001802,0.005234,0.001956,0.002562,0.00191,0.002039,0.003334,0.002165,0.002475,0.000626,0.001148,0.003135,0.002497,0.004835,0.00488,0.003199,0.003785,0.001405,0.001472,0.001613,0.001181,0.000652,0.001052,0.001109,0.000812,0.001224,0.000622,0.001873,0.004176,0.002872,0.001354,0.003063,0.001169,0.002056,0.001634,0.002081,0.003141,0.002539,0.001951,0.000907,0.000476,0.000296,0.000592,0.000752,0.000471,0.000364,0.000354,0.000304,0.000222,0.000488,0.000413,0.000412,0.000131,0.000548,0.000267,5.9e-05,8.9e-05,0.000213,0.000228,0.000167,0.000101,0.000283,0.000109,5.7e-05,3.1e-05,0.000131,7.8e-05,0.000135,0.00048,0.000204,0.000158,0.000186,0.000163,8.7e-05,0.000166,0.000212,0.000119,6.2e-05,7.3e-05,7.7e-05,0.000241,0.000127,1.4e-05,0.000231,0.000155,9.3e-05,4.8e-05,5.9e-05,0.000166,7.3e-05,4.2e-05,6.2e-05,0.000114,0.000134,0.000164,0.00016,9.8e-05,9.4e-05,9.3e-05,1.4e-05,0.000107,1.9e-05,0.000106
3.5e-05,5.7e-05,0.000138,0.000681,0.001165,0.002884,0.0038,0.001913,0.000536,0.00026,0.000383,0.00044,0.000348,0.007615,0.009889,0.005251,0.001643,0.000881,0.001861,0.005528,0.003456,0.003475,0.002016,0.001194,0.00227,0.001742,0.001184,0.00108,0.000287,0.003341,0.00573,0.005897,0.002567,0.001036,0.002402,0.005014,0.002247,0.001364,0.00128,0.001755,0.000733,0.000704,0.002476,0.001487,0.001712,0.001972,0.001729,0.000333,0.000866,0.003511,0.002423,0.001919,0.000796,0.000755,0.00162,0.001626,0.000348,0.000155,0.000373,0.000203,8.3e-05,0.00051,0.000615,0.000341,0.000376,0.000202,0.000214,0.000365,0.000546,0.000261,0.000538,0.000333,0.000155,7.5e-05,0.000148,0.000203,0.000108,2.2e-05,0.000104,0.000143,0.000138,7.3e-05,6.3e-05,0.000126,0.000132,0.000245,9e-05,6e-05,1.6e-05,0.000118,7.9e-05,7e-05,0.00012,6.8e-05,8.8e-05,4.4e-05,6e-05,6e-06,0.000112,0.000106,0.000111,0.000126,5.9e-05,3.6e-05,4e-05,1.5e-05,8e-05,4.8e-05,6.4e-05,6.3e-05,3.3e-05,6.5e-05,1.1e-05,7.9e-05,4.6e-05,7.6e-05,1.1e-05,5e-05,4.5e-05,6.6e-05,9e-05
7.7e-05,0.000114,0.000168,0.000624,0.000414,0.002354,0.002814,0.00185,0.000469,0.000258,0.000352,9.6e-05,0.000105,0.006876,0.004575,0.001816,0.000171,0.000762,0.000489,0.004049,0.002192,0.003914,0.001109,0.001358,0.00184,0.002904,0.002397,0.00207,0.000429,0.002638,0.004595,0.001476,0.000539,6e-05,0.002171,0.002196,0.000789,0.000392,0.001357,0.001838,0.001112,0.000503,0.001346,0.00074,0.000944,0.001089,0.001899,0.000845,0.000791,0.002021,0.001252,0.000737,0.00028,8.9e-05,0.000886,0.000475,0.000287,0.000238,0.000128,0.00025,0.000226,0.000328,0.000337,0.000246,0.000126,0.000206,0.000232,0.000165,0.000233,0.00019,0.000423,0.000147,1.2e-05,4.7e-05,7.1e-05,8.5e-05,5.2e-05,8e-06,0.000126,4.3e-05,6.8e-05,5.6e-05,2e-05,0.000114,4.7e-05,0.000173,5.2e-05,2.2e-05,3.8e-05,7.7e-05,5e-06,2.4e-05,7.2e-05,2e-05,2e-05,4.3e-05,1.6e-05,3.5e-05,2.3e-05,4.6e-05,4.3e-05,4.3e-05,3e-05,2.6e-05,6.4e-05,3.2e-05,3.7e-05,1.8e-05,2.6e-05,3.5e-05,4.6e-05,8.8e-05,3.2e-05,3.8e-05,2.4e-05,5.2e-05,4.7e-05,4.9e-05,4.7e-05,2.4e-05,4.8e-05
8.9e-05,9.8e-05,0.000191,0.000553,0.001083,0.000842,0.001392,0.000168,0.000647,0.000361,0.000213,0.000159,0.000165,0.005107,0.003646,0.001982,0.000511,0.000487,0.000234,0.004167,0.00311,0.001555,0.000748,0.001709,0.002498,0.000575,0.001249,0.000678,0.001504,0.001267,0.001671,0.000775,0.000834,0.000812,0.002531,0.001855,0.001715,0.00064,0.000827,0.002119,0.000877,0.000402,0.000488,0.000822,0.001044,0.00061,0.001946,0.000781,0.000996,0.00092,0.000425,0.000292,0.000975,0.000377,0.000778,0.000388,0.000221,0.000257,8.7e-05,0.000192,0.00013,0.000178,0.000112,0.000142,5.1e-05,6.6e-05,0.000249,0.000141,0.000117,0.000172,9e-05,4.8e-05,3e-05,4.6e-05,8.2e-05,4.1e-05,2.2e-05,3.3e-05,0.000108,2.3e-05,0.000112,3.1e-05,5.5e-05,5.3e-05,4e-05,0.000143,3.3e-05,4.7e-05,4.2e-05,7.3e-05,5.4e-05,4e-05,6e-05,2.2e-05,4.6e-05,4.6e-05,1.5e-05,3.4e-05,3.4e-05,2e-05,3e-05,5.1e-05,2.2e-05,4.7e-05,5.1e-05,4.4e-05,4e-05,1.1e-05,8e-06,5e-05,1.3e-05,6.5e-05,3.4e-05,3e-05,3.1e-05,7e-06,2.6e-05,1.7e-05,9e-06,1.3e-05,6.4e-05
4.8e-05,2.7e-05,0.000213,0.000521,0.000832,0.000702,0.000545,0.000666,0.000796,0.000817,0.000347,0.00011,0.000149,0.003459,0.002257,0.000785,0.000243,0.000297,0.000317,0.003132,0.001591,0.003039,0.001639,0.001173,0.001366,0.000739,0.000405,0.001493,0.000729,0.001073,0.002587,0.00066,0.002154,0.001749,0.002131,0.002963,0.001216,0.00114,0.00095,0.001572,0.000591,0.000486,0.000955,0.000294,0.00175,0.001561,0.001752,0.000944,0.000408,0.001661,0.000806,7e-05,0.00069,0.000264,0.000377,0.000202,0.000218,6.9e-05,0.000231,0.000195,0.000123,0.000132,0.000196,0.000185,7.7e-05,7.2e-05,0.00016,0.000137,0.000134,0.000137,8.5e-05,2.3e-05,4.1e-05,5.8e-05,5.3e-05,6.7e-05,2.5e-05,0.000101,0.000113,6.1e-05,8.6e-05,6.1e-05,5.5e-05,9.5e-05,6.1e-05,9.3e-05,5.8e-05,1.3e-05,3e-05,4.3e-05,7.2e-05,2.1e-05,6.8e-05,3.5e-05,6.4e-05,4.8e-05,6.3e-05,5.9e-05,2.3e-05,7.3e-05,7e-05,7.2e-05,2.7e-05,5.7e-05,1.9e-05,3.2e-05,5.7e-05,1.7e-05,2.1e-05,3.4e-05,4.6e-05,6.7e-05,3.9e-05,4.2e-05,4.5e-05,1.5e-05,2.6e-05,1.6e-05,1.6e-05,7e-06,6.7e-05
3.5e-05,2.6e-05,0.000212,0.000282,0.001129,0.000105,0.000305,4.6e-05,0.00036,0.000363,0.000298,4e-05,9.5e-05,0.001809,0.000838,0.000358,0.000172,0.00019,0.00038,0.002239,0.0041,0.002491,0.001064,8.8e-05,0.00166,6.6e-05,0.002047,0.001293,0.002454,0.000806,0.001905,0.001463,0.002707,0.001164,0.003058,6e-04,0.000691,0.000929,0.001049,0.000663,0.002106,0.000391,0.00206,0.000827,0.001756,0.001087,0.001547,0.002992,0.002027,0.000872,0.000134,0.000244,0.000756,8.5e-05,0.000454,0.000333,0.000213,0.000267,2e-04,7.1e-05,0.00016,0.000286,0.000229,0.000138,0.000193,0.000154,0.000262,0.000108,0.000165,0.000147,0.00011,6.9e-05,0.000103,5e-05,8.7e-05,6e-05,2.2e-05,0.000157,8.8e-05,7.5e-05,0.000107,4.5e-05,4.6e-05,0.000121,4.9e-05,0.000119,5.3e-05,4.5e-05,5e-06,4.3e-05,8.4e-05,6.9e-05,0.000111,6.4e-05,7.2e-05,7.1e-05,5.4e-05,0.000158,0.000126,4.2e-05,1.7e-05,5.7e-05,4.1e-05,8.3e-05,0.000103,8e-06,5.1e-05,3.6e-05,5.2e-05,4.5e-05,5.9e-05,2.7e-05,2.6e-05,5.8e-05,6.4e-05,3e-05,3e-05,1e-05,1.3e-05,9e-06,4.9e-05
7.7e-05,9e-05,0.000316,0.000145,0.000677,0.00062,0.000311,0.000209,0.000118,0.000412,0.000182,0.000155,0.000218,0.001006,8.9e-05,0.000106,1e-04,5.9e-05,0.000554,0.003247,0.004735,0.004685,0.002296,0.000143,0.0029,0.00113,0.001825,0.003241,0.001674,0.002303,0.001294,0.002836,0.003194,0.002344,0.005804,0.002,0.00168,0.001353,0.001245,0.001705,0.002542,0.000582,0.003499,0.001342,0.002605,0.00203,0.001465,0.002973,0.001222,0.000435,0.000774,0.000714,0.000921,0.000362,0.000812,0.000685,0.000454,0.00028,0.000159,0.000225,0.000104,0.000272,0.000405,0.00028,0.000136,0.000354,0.000421,0.000172,0.000367,0.000231,7.7e-05,0.000183,0.000184,0.000166,0.000156,0.000103,5.2e-05,0.000143,0.000207,0.000103,5.3e-05,0.000129,0.000148,0.000243,6.1e-05,0.000104,7.2e-05,6e-06,7.8e-05,6.4e-05,0.000179,0.000131,0.000224,0.000187,0.000235,0.000116,9.4e-05,0.000262,0.000221,0.000137,7.7e-05,6e-05,8.5e-05,0.000144,0.000192,7.8e-05,5.6e-05,7.6e-05,2.4e-05,5.1e-05,7.3e-05,0.000121,3.6e-05,0.000134,5e-05,0.000107,0.000127,5.6e-05,1.8e-05,5.2e-05,2.9e-05
0.000117,7.9e-05,0.000355,0.000524,0.000328,0.000256,0.000324,0.00043,0.000297,0.000527,0.000388,3.8e-05,0.000282,0.001123,0.000538,0.000272,0.000141,0.000255,0.001327,0.00203,0.00638,0.005156,0.001841,0.002054,0.00283,0.002756,0.000926,0.004127,0.003721,0.003599,0.004705,0.002184,0.002385,0.000782,0.005559,0.004793,0.00494,0.003616,0.003651,0.002885,0.001624,0.004166,0.002269,0.002084,0.00347,0.005244,0.004298,0.001711,0.000772,0.002889,0.000766,0.001764,0.001827,0.000606,0.00074,0.000106,7e-05,0.001176,0.00052,0.000317,0.000276,0.000305,0.00028,0.000248,0.000394,0.000482,0.000753,0.000612,0.000287,0.00035,0.000143,0.000397,0.000349,0.000294,0.000388,7.3e-05,0.000115,9e-05,0.000132,0.000253,0.000188,0.000179,0.000204,0.000122,0.000132,0.000329,7.5e-05,9.3e-05,0.000123,1.9e-05,0.000383,0.00023,6.3e-05,2.8e-05,0.000261,9.1e-05,0.000169,0.000336,0.000133,2.2e-05,4.4e-05,9.2e-05,9.8e-05,7.5e-05,4.6e-05,0.000116,0.000151,0.000154,5.6e-05,4.9e-05,0.000109,0.000114,0.000157,0.000208,8.9e-05,0.000184,0.000174,0.000112,9e-06,5.5e-05,0.000109
1.1e-05,1.6e-05,0.000389,0.000428,0.000611,0.000835,0.000388,0.00048,0.000202,0.000501,0.00024,0.000226,2e-04,0.001441,0.000296,0.000466,6.8e-05,0.000331,0.001749,0.002993,0.008152,0.004969,0.00428,0.003874,0.003438,0.003383,0.004986,0.004847,0.003572,0.006406,0.003571,0.00289,0.004574,0.005274,0.006212,0.003774,0.004022,0.003687,0.006537,0.00543,0.001892,0.006947,0.005021,0.002047,0.004185,0.002072,0.003657,0.005496,0.001016,0.004568,0.002583,0.003173,0.002833,0.001827,0.001861,0.001066,0.000664,0.001367,0.000909,0.000666,0.000138,0.000414,0.000287,0.001014,9e-04,0.000482,0.000455,0.000732,0.000788,0.000407,0.000656,0.000425,0.000225,0.000336,0.000177,0.000473,0.000301,0.000437,0.000445,0.000392,0.000208,0.00024,0.000137,0.000309,0.000104,0.000382,0.000284,0.000307,4.6e-05,0.000115,0.000477,0.000268,0.000185,7.9e-05,0.000354,0.000188,8.3e-05,0.000328,0.000447,0.000302,0.000251,8.8e-05,0.000102,0.000122,0.000214,0.000187,8.5e-05,0.000121,0.000176,8.4e-05,0.00016,0.000119,0.000117,8.5e-05,0.000125,0.000182,1e-04,2.4e-05,4.2e-05,8.4e-05,7.5e-05
3e-05,3.3e-05,0.000372,0.000626,0.001066,0.00112,0.000709,0.000451,0.000727,0.00037,0.000314,0.000217,0.000117,0.001041,0.000395,0.000331,0.000572,0.000539,0.002184,0.004423,0.007881,0.009946,0.012703,0.013471,0.002832,0.002822,0.006855,0.009907,0.008877,0.008673,0.007535,0.003646,0.005689,0.007413,0.005576,0.00332,0.004293,0.00703,0.010968,0.013292,0.012142,0.013081,0.009297,0.003532,0.002865,0.006355,0.009706,0.011046,0.009708,0.006042,0.004013,0.001894,0.006919,0.006043,0.003397,0.000771,0.000449,0.001656,0.001408,0.001205,0.00085,0.001061,0.00106,0.001885,0.002306,0.001563,0.000677,0.000796,0.000379,0.000801,0.000923,0.000563,0.000394,0.000309,0.000381,0.00047,0.000492,0.000217,0.000444,0.000516,0.000402,0.000309,0.000146,0.000189,0.000401,0.000374,0.000362,0.000516,0.000381,0.00011,0.000688,0.000352,0.000164,0.000263,0.000496,0.000507,0.000315,0.00043,0.000598,0.000249,0.000223,0.000108,5e-05,0.000105,0.000282,0.000266,0.000243,9.1e-05,0.000257,0.00023,0.000201,7.2e-05,0.000114,0.000177,0.000128,0.00022,0.000114,0.000101,5.7e-05,7.4e-05,0.000159
5.7e-05,7.3e-05,0.000353,0.000821,0.00044,0.000477,0.000149,0.000465,0.00048,0.000324,4.3e-05,0.000281,0.000337,0.000558,0.00025,0.000324,0.000507,0.000467,0.00202,0.004185,0.001309,0.006435,0.004099,0.004775,0.009239,0.010486,0.006828,0.004596,0.008173,0.002653,0.005777,0.007001,0.003683,0.004828,0.006049,0.007093,0.007931,0.011244,0.006621,0.00172,0.006886,0.003148,0.004828,0.006745,0.003343,0.006419,0.009076,0.001252,0.005413,0.004868,0.002437,0.003432,0.005263,0.002928,0.001773,0.001962,0.000889,0.00077,0.000331,0.000689,0.001075,0.000601,0.001095,0.000548,0.000746,0.000182,0.000574,0.000205,0.000339,0.000861,0.000374,6.6e-05,3.3e-05,0.000113,0.000369,9.7e-05,0.000278,0.000426,0.000112,0.000336,0.000459,7e-04,0.000615,0.000493,0.000762,0.000657,0.00036,0.000549,0.000406,0.000243,0.000604,0.000457,0.000241,0.000286,0.000238,0.000604,0.000317,0.000366,0.000315,0.000163,0.000212,0.000274,0.000177,2.9e-05,0.000125,7.7e-05,8.1e-05,7.7e-05,0.000273,0.000269,6.4e-05,0.000158,0.000207,9.7e-05,2.2e-05,0.000202,0.000169,0.000154,0.000166,7.3e-05,0.000137
6.9e-05,4.4e-05,0.000421,0.000651,0.001349,0.000675,0.000873,0.000642,0.000336,0.000586,0.000527,0.000638,0.000118,0.000324,0.00019,9.4e-05,0.000265,0.000586,0.001777,0.004971,0.000757,0.004353,0.004631,0.00316,0.007293,0.003414,0.005431,0.003302,0.006053,0.00491,0.005211,0.002574,0.00158,0.00153,0.003211,0.005151,0.001957,0.004298,0.002819,0.001415,0.00341,0.002517,0.004407,0.008295,0.004332,0.006327,0.00214,0.000876,0.004204,0.001027,0.002346,0.004216,0.002081,0.000429,0.001916,0.000249,0.000398,0.001433,0.00074,0.000562,0.001239,0.000714,0.000335,0.000664,0.000673,0.000338,0.00038,0.000541,0.00083,0.000784,0.000461,0.000148,0.000208,0.000338,0.00038,0.000134,0.00015,3.4e-05,4.2e-05,0.00037,0.000251,0.000366,5.8e-05,0.000229,0.000523,0.000409,0.000149,0.000219,8.7e-05,0.000131,0.000462,0.000251,0.000273,0.000107,0.000239,0.000327,0.00026,0.000513,8.9e-05,4e-05,0.000108,0.000141,9.8e-05,4e-05,6.3e-05,4.5e-05,4.6e-05,1.9e-05,0.000271,0.000132,8e-05,0.000107,9.1e-05,0.000153,8.1e-05,0.000155,6.8e-05,6.2e-05,0.000163,0.000165,4.6e-05
8.1e-05,9.2e-05,0.000274,0.001306,0.002734,0.002299,0.001059,0.001372,0.000799,0.000884,0.000296,0.000398,0.000482,0.000301,0.000814,0.000263,0.00021,0.000661,0.003026,0.005518,0.005203,0.000285,0.000702,0.002146,0.002554,0.006007,0.005827,0.001042,0.000543,0.002825,0.003049,0.005949,0.004472,0.00344,0.000982,0.00539,0.006271,0.002298,0.001973,0.00303,0.003307,0.002468,0.003688,0.004327,0.006846,0.003194,0.001717,0.00356,0.000766,0.001306,0.002968,0.003428,0.003119,0.001684,0.001387,0.001352,0.000514,0.000838,0.000964,0.000877,0.000572,0.000795,0.000667,0.000563,0.000431,0.000413,0.000184,0.00055,0.000352,0.000275,0.000208,0.00015,0.000374,0.000417,0.00014,0.000143,0.000106,0.000111,2.8e-05,0.000298,0.000209,0.000199,0.000286,0.000382,8.6e-05,6.3e-05,5.6e-05,0.000111,0.000134,0.00026,0.000152,0.000125,6.6e-05,8.5e-05,0.000193,0.000257,9.4e-05,0.000269,0.000146,0.000116,0.000109,0.000133,5.2e-05,8.8e-05,0.000119,9.8e-05,5.7e-05,2.6e-05,0.000167,7.5e-05,3.9e-05,5.7e-05,1.4e-05,0.000128,0.000134,2.8e-05,2e-05,7.6e-05,0.000105,3.4e-05,0.00012
4.2e-05,3.7e-05,0.000295,0.00154,0.001741,0.000493,0.000671,0.001158,0.000564,0.000756,0.000564,9.8e-05,0.000165,0.000803,0.000449,0.000425,0.000307,0.000422,0.003184,0.002319,0.00014,0.001306,0.002317,0.001276,0.000163,0.002672,0.001849,0.00367,0.001708,0.003249,0.003932,0.004694,0.006468,0.001537,0.00078,0.003473,0.004131,0.001384,0.001072,0.002198,0.002568,0.001768,0.00334,0.00111,0.00308,0.001855,0.000811,0.003601,0.002792,0.002535,0.002432,0.001567,0.000268,0.000342,0.000506,0.00051,0.000546,0.000127,0.000507,0.000395,0.000486,0.000862,0.000222,0.000518,0.000204,0.000461,0.000612,0.000271,0.000107,0.000272,0.000132,8.6e-05,0.000398,0.000102,0.000134,7.1e-05,8.3e-05,0.000212,0.000201,7.4e-05,0.000115,5e-05,0.000139,0.000232,0.000137,0.000112,7.7e-05,0.000217,0.000263,0.000155,0.000102,7.6e-05,0.000145,6.5e-05,4e-06,6.3e-05,7.1e-05,8.6e-05,2.1e-05,2.2e-05,1.9e-05,4e-05,7.5e-05,6.3e-05,4.7e-05,3.3e-05,8.4e-05,5.7e-05,4e-05,0.000104,7e-05,3.7e-05,1.9e-05,8.7e-05,1e-04,2.7e-05,2.4e-05,6.4e-05,7.5e-05,7.5e-05,8.3e-05
2.6e-05,3.5e-05,0.000313,0.000976,0.001774,0.001146,0.000894,0.000111,0.000991,0.000179,0.00031,0.000439,0.000268,0.000713,0.000403,0.000379,0.000242,0.000329,0.002522,0.001594,0.001288,0.001186,0.000377,0.001654,0.000847,0.002162,0.002433,0.002011,0.000529,0.002744,0.001735,0.001659,0.00173,0.001964,0.001293,0.000937,0.00232,0.00179,0.000943,0.001616,0.000451,0.000574,0.002483,0.001601,0.001854,0.002041,0.000614,0.001993,0.000723,0.001266,0.000352,0.000259,0.000777,0.00061,0.000261,0.000303,0.000725,0.000604,0.000165,0.000331,0.000327,0.000294,8.7e-05,0.000162,0.00023,0.000309,0.000186,0.00021,0.000152,0.000162,6.6e-05,9.3e-05,0.000231,0.000119,0.000173,0.000179,7.5e-05,8.9e-05,1e-04,0.00012,5.8e-05,3.2e-05,8e-06,6.3e-05,9.2e-05,0.000145,9.8e-05,0.000123,0.000118,0.00017,4.1e-05,8.3e-05,2.6e-05,2.3e-05,5.5e-05,7.1e-05,1.3e-05,6.6e-05,6e-05,4.2e-05,1.6e-05,7.6e-05,1e-04,8.4e-05,6.9e-05,6.6e-05,2.2e-05,2.6e-05,2.9e-05,4e-05,2.4e-05,3.8e-05,1.9e-05,2.7e-05,4.4e-05,4.2e-05,5.3e-05,3.1e-05,2.1e-05,2.9e-05,3.7e-05
2e-06,2e-05,0.000154,0.00031,0.00088,0.000567,0.000453,0.000343,0.000626,0.000467,0.000338,0.000228,3.1e-05,0.000409,0.000293,4.1e-05,4e-05,0.000102,0.000896,0.000935,0.000489,0.000368,0.000562,0.00094,0.000979,0.000502,0.000637,0.000377,0.000442,0.001087,0.000135,0.000773,0.000244,0.000379,0.000426,0.000581,0.000413,9.1e-05,0.000315,0.000473,0.000507,0.000431,0.000845,0.00022,0.00064,0.000806,8.6e-05,0.000523,0.00043,0.00023,6.8e-05,0.000217,0.000287,0.000141,6.6e-05,7.7e-05,0.00026,0.000101,6.7e-05,1.6e-05,0.000125,7.7e-05,4.2e-05,6e-05,4.9e-05,7.1e-05,6.9e-05,4.5e-05,5.9e-05,5.9e-05,1.9e-05,4.5e-05,4.5e-05,4e-05,4.3e-05,5.2e-05,4.1e-05,3.9e-05,5.3e-05,4.8e-05,3.2e-05,2.1e-05,2.2e-05,3.9e-05,3.2e-05,4.2e-05,4.2e-05,7e-05,2.1e-05,5.8e-05,2.8e-05,3.7e-05,5.6e-05,3.5e-05,2.7e-05,1.5e-05,2.8e-05,1e-05,1.6e-05,1.3e-05,2.4e-05,4e-05,1.9e-05,1.7e-05,1.8e-05,3e-06,1.5e-05,3e-06,8e-06,2e-05,9e-06,1.5e-05,2.4e-05,2e-06,5e-06,1e-05,1.7e-05,9e-06,1.9e-05,1.3e-05,6e-06
7e-06,1.7e-05,0.000152,0.000493,0.000929,0.000904,0.000307,0.00036,0.000246,0.000349,0.000129,0.00014,0.000176,0.000659,0.000121,0.000162,7.2e-05,0.000225,0.000828,0.000134,5.6e-05,0.000383,0.000222,0.000855,0.000983,0.000804,0.000363,0.000379,0.000523,0.001122,0.000639,0.001161,0.000978,0.000238,0.000463,0.000704,0.00056,0.000554,0.00015,0.000259,0.000525,0.000494,0.000554,0.000604,0.000215,0.000325,0.000271,2e-04,0.000121,0.000241,6.9e-05,9.4e-05,0.000253,4.2e-05,2.2e-05,7.9e-05,0.000188,8.6e-05,3.2e-05,4.3e-05,0.000101,7.1e-05,4e-05,6.6e-05,4.9e-05,7e-05,6.3e-05,7e-05,2e-05,2.8e-05,2.2e-05,1.1e-05,3.4e-05,1e-05,1.7e-05,4.3e-05,3.5e-05,7e-06,1.1e-05,2.7e-05,2.3e-05,1.2e-05,1.5e-05,3.6e-05,3e-05,1.7e-05,2e-05,5.1e-05,2e-05,3.4e-05,6e-06,3.2e-05,3.4e-05,2e-06,3e-05,1.5e-05,1.9e-05,4.9e-05,3.2e-05,7e-06,2.2e-05,2e-06,1.6e-05,4e-06,1e-05,1.2e-05,4e-06,9e-06,1.5e-05,1.6e-05,6e-06,1.3e-05,2e-05,1.2e-05,2.2e-05,1.8e-05,7e-06,1.5e-05,8e-06,8e-06,7e-06
5e-06,1.5e-05,0.000118,0.000368,0.000265,0.000149,9.9e-05,0.000208,0.00021,0.00025,0.000124,8.7e-05,9.8e-05,0.000554,0.000281,0.000149,5.6e-05,0.00018,0.000741,0.000426,0.000401,0.000359,0.000343,0.000476,0.000595,0.000321,0.000633,0.000362,0.000351,0.000828,0.00039,0.000111,7.4e-05,0.000249,0.000807,0.000207,0.000763,0.000283,0.000178,0.000115,0.000278,0.000396,0.000174,9.7e-05,0.000217,0.000664,0.000487,0.000443,0.000275,0.000246,7.9e-05,5.6e-05,0.000218,9.2e-05,7.2e-05,2.6e-05,0.000114,5.8e-05,3.5e-05,2.9e-05,7.4e-05,9.6e-05,6.7e-05,5.7e-05,6.1e-05,6.3e-05,4.1e-05,5.5e-05,2.6e-05,3.3e-05,2.2e-05,1.8e-05,1.7e-05,1.2e-05,1.8e-05,3.4e-05,2.2e-05,1.7e-05,3.9e-05,2.3e-05,2.7e-05,6e-06,1.4e-05,2.3e-05,2.8e-05,7e-06,1.2e-05,4.3e-05,2.8e-05,3.7e-05,1.7e-05,1.4e-05,2.8e-05,1.8e-05,2.7e-05,1.8e-05,1.8e-05,3.7e-05,1.3e-05,6e-06,1.4e-05,8e-06,1.6e-05,9e-06,1.7e-05,8e-06,9e-06,4e-06,2.8e-05,1.9e-05,1e-05,1.2e-05,1.4e-05,1.1e-05,1e-05,2.5e-05,6e-06,1e-05,9e-06,1e-05,7e-06
7e-06,1.3e-05,0.000108,0.000153,0.000267,6.4e-05,0.000124,0.000139,0.000182,3.2e-05,4.3e-05,5.9e-05,6.2e-05,0.000551,0.000285,0.000152,7.6e-05,8.5e-05,0.000717,0.000194,0.000242,0.000286,0.000533,0.000347,0.000588,0.00075,0.000171,0.000265,0.000348,0.000465,0.000731,0.00039,0.000329,0.000221,0.000442,0.000435,0.000721,0.000378,0.000231,0.000274,0.00041,0.000249,6.7e-05,0.000171,0.000439,0.000663,0.000212,0.000524,0.000148,0.000146,0.000193,5.8e-05,0.000124,8.8e-05,7.5e-05,2.8e-05,0.000109,6.5e-05,4.5e-05,6e-05,4.5e-05,6.7e-05,3.8e-05,3.8e-05,5.2e-05,6.3e-05,4.4e-05,4.5e-05,1.6e-05,2e-05,1.9e-05,7e-06,1.6e-05,6e-06,9e-06,3e-05,2.4e-05,2.5e-05,7e-06,3.4e-05,2.9e-05,1e-05,2.2e-05,2.8e-05,2.3e-05,3e-06,6e-06,2.4e-05,2.3e-05,1.9e-05,6e-06,1.3e-05,2.2e-05,1e-05,2.1e-05,1.2e-05,1.3e-05,2.3e-05,1.3e-05,5e-06,1.3e-05,1e-05,3e-06,1.4e-05,1.6e-05,1.4e-05,1.6e-05,1.1e-05,2.4e-05,1e-05,8e-06,8e-06,1.2e-05,1.2e-05,5e-06,2e-05,9e-06,7e-06,7e-06,1.2e-05,6e-06
6e-06,1.2e-05,0.000102,8.9e-05,0.000213,3.6e-05,7.1e-05,8.9e-05,7.9e-05,4.7e-05,7.9e-05,2.3e-05,9e-06,0.000406,0.00034,0.00013,4.7e-05,4.1e-05,0.000487,0.000255,0.000236,0.000179,0.000261,0.000314,0.000142,0.000341,0.000158,0.000235,0.000136,0.000335,0.000363,0.000572,0.000234,0.000147,0.000501,5.6e-05,0.000377,0.000214,0.00014,0.000143,0.000385,0.000289,0.00021,7.5e-05,0.000379,0.000339,0.000669,0.000428,0.000253,9.4e-05,6e-05,7e-05,0.000112,9.8e-05,8.5e-05,6e-05,9.9e-05,9e-06,1.3e-05,2.3e-05,5.3e-05,4.3e-05,4.8e-05,3.7e-05,3.8e-05,4.1e-05,3.2e-05,2.9e-05,2.7e-05,1.9e-05,2.1e-05,3.5e-05,2.2e-05,1.5e-05,8e-06,2.5e-05,2e-05,2.1e-05,2.1e-05,2.2e-05,1e-05,3e-06,1.6e-05,2.6e-05,1.3e-05,1.4e-05,1.9e-05,2e-05,8e-06,2.6e-05,1.2e-05,1.8e-05,5e-06,1.4e-05,5e-06,1.5e-05,2.1e-05,3.1e-05,8e-06,1.1e-05,1.9e-05,3e-06,5e-06,1.5e-05,1.5e-05,4e-06,9e-06,4e-06,7e-06,1.7e-05,8e-06,5e-06,1.3e-05,8e-06,5e-06,1.9e-05,4e-06,6e-06,8e-06,4e-06,7e-06
4e-06,2e-06,9.5e-05,7.5e-05,4.6e-05,5.9e-05,9.6e-05,0.000105,6.7e-05,4.3e-05,8.8e-05,5.6e-05,2.7e-05,0.000221,9.8e-05,9.7e-05,1.4e-05,2.4e-05,0.000396,0.000328,0.000366,0.000208,0.000257,0.000267,0.000173,0.000406,0.000313,0.000473,0.000448,0.000352,0.000286,0.000557,0.000635,0.000507,0.000292,0.000425,0.000104,0.000163,0.000262,0.000228,0.000231,0.000148,0.000371,0.000132,0.000274,0.000387,0.000547,0.000473,2.8e-05,8.2e-05,3.3e-05,8.5e-05,0.000126,9.2e-05,3.4e-05,3.2e-05,0.000129,5.1e-05,1.2e-05,3.1e-05,5.5e-05,4.1e-05,2.3e-05,4e-05,1.7e-05,5e-05,1.4e-05,2.9e-05,2.6e-05,2.4e-05,1.8e-05,2.5e-05,1.2e-05,1e-05,4e-06,1.3e-05,1.9e-05,1.4e-05,1.9e-05,2.7e-05,1.3e-05,6e-06,9e-06,2.1e-05,1.7e-05,1.2e-05,1.7e-05,2.5e-05,7e-06,1.9e-05,1.2e-05,1.2e-05,6e-06,1.3e-05,1e-05,1.4e-05,1.6e-05,2.4e-05,1e-05,8e-06,1e-05,6e-06,3e-06,8e-06,3e-06,7e-06,4e-06,3e-06,1.6e-05,2.2e-05,4e-06,7e-06,1.6e-05,6e-06,8e-06,1.2e-05,3e-06,9e-06,4e-06,6e-06,6e-06
1.1e-05,1.1e-05,8e-05,2.9e-05,0.000131,0.000202,7.8e-05,0.000137,5.8e-05,8e-06,3e-05,2.9e-05,7.1e-05,0.000106,5.5e-05,4.7e-05,3e-05,2.6e-05,0.00047,0.000524,0.000242,0.000202,0.000293,0.00015,0.000132,0.000191,0.000373,0.000193,0.000297,0.000535,0.000333,0.000333,0.000549,9.2e-05,0.000358,0.000121,0.000317,0.000501,7e-05,0.000184,0.000242,0.000129,0.000251,0.00021,0.000267,0.000194,0.000374,0.000293,7.9e-05,9.3e-05,7.1e-05,3.2e-05,8.4e-05,8e-05,3.6e-05,7.6e-05,8.7e-05,5.5e-05,3.9e-05,4.3e-05,3.7e-05,3.9e-05,1.5e-05,6.6e-05,5.6e-05,6.5e-05,4.6e-05,5.2e-05,1.4e-05,3.6e-05,6e-06,1.2e-05,1.2e-05,2e-05,2.3e-05,9e-06,2.8e-05,1e-06,1.3e-05,2.1e-05,8e-06,1.6e-05,1.3e-05,3e-05,2.1e-05,4e-06,1.3e-05,2.1e-05,8e-06,2.3e-05,1.3e-05,8e-06,6e-06,7e-06,1.2e-05,1.7e-05,8e-06,2.5e-05,8e-06,1.7e-05,1.6e-05,4e-06,5e-06,5e-06,8e-06,1.2e-05,6e-06,8e-06,1.7e-05,1.2e-05,5e-06,5e-06,1.5e-05,3e-06,1.4e-05,1.7e-05,5e-06,1.1e-05,5e-06,4e-06,4e-06
3e-06,1.5e-05,7.7e-05,3.7e-05,0.000238,1.4e-05,0.000121,2.6e-05,3.7e-05,5e-05,4.2e-05,4.2e-05,4.4e-05,0.000161,0.000133,8.3e-05,4.7e-05,5.7e-05,0.000453,0.000845,0.000564,0.000196,0.000204,0.000247,0.000336,0.000179,1.8e-05,0.000237,0.000307,0.000576,0.000593,0.000368,0.000258,0.000154,0.00049,0.000473,0.000486,5.5e-05,0.00013,0.000211,0.000239,8.4e-05,0.000186,0.000281,0.00017,0.000423,0.000274,0.000251,0.000227,0.000409,0.00027,0.000116,6.9e-05,7.2e-05,0.000119,6.5e-05,0.000129,8e-05,6.3e-05,4.3e-05,1.8e-05,9.9e-05,0.000106,5.4e-05,0.000124,8.6e-05,5.3e-05,4.7e-05,5.8e-05,1.2e-05,4.1e-05,1.9e-05,2.2e-05,8e-06,2.7e-05,5e-05,3.3e-05,3e-05,2.5e-05,1.3e-05,1.9e-05,3.4e-05,3.8e-05,5.5e-05,7e-06,2.2e-05,1e-05,2.7e-05,4e-06,1.7e-05,1.4e-05,1e-05,2.1e-05,7e-06,5e-06,2.2e-05,2.9e-05,1.7e-05,5e-06,1.2e-05,9e-06,1.5e-05,1.2e-05,1.3e-05,4e-06,1e-05,1.2e-05,9e-06,2.6e-05,1.9e-05,4e-06,4e-06,1.8e-05,1.1e-05,1.5e-05,1.1e-05,1.3e-05,3e-06,7e-06,1e-06,1.1e-05
9e-06,1.2e-05,5.6e-05,2.7e-05,0.000199,0.000113,9.3e-05,7e-06,4.6e-05,4.8e-05,8.3e-05,9e-06,2.7e-05,0.000177,5.6e-05,3.9e-05,4.7e-05,3.1e-05,0.000312,0.000562,0.000253,0.000248,0.000138,0.000173,0.00033,0.000231,0.000329,0.000327,0.000155,0.000539,0.000171,0.000304,0.000722,0.000231,0.000451,0.000339,0.000408,0.000173,0.000142,0.000168,0.00029,4.4e-05,0.000105,0.000146,0.000401,0.000215,0.000196,0.00012,8.1e-05,0.000278,8.2e-05,0.000171,0.000234,5.3e-05,6.5e-05,7.4e-05,0.000185,9.5e-05,4.6e-05,5.6e-05,9.1e-05,0.000126,0.000142,3e-05,0.000106,9.2e-05,5.9e-05,5.6e-05,0.000102,4.8e-05,1.1e-05,6.8e-05,5.2e-05,2.8e-05,1.5e-05,3.2e-05,2.7e-05,1.8e-05,5e-06,3.3e-05,2.6e-05,2.2e-05,1e-05,1.8e-05,4.5e-05,5.1e-05,4.2e-05,3.2e-05,7e-06,1.9e-05,1.7e-05,1.4e-05,1.9e-05,2.8e-05,1.3e-05,2.1e-05,2e-05,2.9e-05,2.4e-05,1.6e-05,2.2e-05,7e-06,7e-06,1e-05,2e-05,1.5e-05,5e-06,1.4e-05,1.3e-05,1e-05,4e-06,9e-06,8e-06,1.2e-05,1e-05,8e-06,1.1e-05,1e-05,8e-06,7e-06,1.4e-05
1e-05,1.2e-05,4.9e-05,6.1e-05,7.5e-05,3.7e-05,3.6e-05,6.6e-05,8.3e-05,4.6e-05,3.2e-05,1.5e-05,2.3e-05,0.000162,0.000126,2.6e-05,4.1e-05,4.7e-05,0.000294,0.000447,0.000296,9.6e-05,0.000258,0.000208,0.000104,9.9e-05,0.000241,5.9e-05,0.000304,0.00038,0.000538,0.000122,0.000518,0.000383,9.3e-05,0.000134,0.000178,0.000193,4.7e-05,0.000113,0.00015,0.000137,4.2e-05,9.8e-05,0.000343,0.00033,0.000216,0.000337,0.00022,7.2e-05,0.000107,0.000144,0.000118,0.000144,8.5e-05,0.000165,7.8e-05,5.2e-05,6.5e-05,8.6e-05,5e-05,8.2e-05,3.1e-05,7.7e-05,3.7e-05,7.7e-05,0.000111,9.8e-05,6e-05,9.7e-05,6.5e-05,9.1e-05,3.9e-05,1.1e-05,1.5e-05,9e-06,7e-06,2.3e-05,1.8e-05,2.4e-05,1e-05,1.4e-05,2.2e-05,2.3e-05,4.1e-05,1.6e-05,2.2e-05,1.2e-05,6e-06,2e-05,1.8e-05,1.9e-05,2.8e-05,1e-05,1e-05,9e-06,2.1e-05,1.6e-05,1.3e-05,4e-06,1.5e-05,1.2e-05,4e-06,1.1e-05,4e-06,1e-05,3e-06,8e-06,1.5e-05,1.6e-05,9e-06,5e-06,6e-06,7e-06,4e-06,1.2e-05,7e-06,8e-06,1e-05,1.4e-05,1.4e-05
7e-06,1.4e-05,3.8e-05,0.000114,8.2e-05,3.4e-05,5.7e-05,7.4e-05,4.7e-05,7.3e-05,0.000108,4.4e-05,7.2e-05,0.000103,0.000113,5.8e-05,5.7e-05,4.9e-05,0.000356,0.000529,2.8e-05,0.000189,5.2e-05,0.000182,9.9e-05,0.000297,6.3e-05,0.000127,0.000132,0.000368,0.000496,0.000361,0.000197,6.1e-05,0.000174,0.000158,8.7e-05,0.000164,0.000121,0.000155,0.000195,7.8e-05,0.000131,5.1e-05,0.000285,0.000302,0.000224,0.00034,0.000128,3.5e-05,6.6e-05,0.000108,6.7e-05,5.7e-05,1.9e-05,8.9e-05,0.00016,3.7e-05,1.6e-05,3.6e-05,5.6e-05,4.1e-05,3.1e-05,2.4e-05,3.1e-05,5.8e-05,5.1e-05,3.7e-05,5.6e-05,3.2e-05,2.9e-05,3.3e-05,8e-06,4.2e-05,3e-05,2.3e-05,2.4e-05,1.1e-05,3e-05,2e-05,2.4e-05,1.9e-05,2.1e-05,7e-06,2.9e-05,2.9e-05,1.4e-05,1.3e-05,1.3e-05,2.1e-05,1.4e-05,3e-06,1.4e-05,9e-06,8e-06,1.6e-05,1.7e-05,1.7e-05,8e-06,8e-06,3e-06,1e-05,5e-06,1.2e-05,1.1e-05,4e-06,6e-06,6e-06,2e-05,2e-05,2e-06,6e-06,1.1e-05,5e-06,6e-06,6e-06,6e-06,7e-06,6e-06,6e-06,3e-06
1.4e-05,2.1e-05,4.3e-05,8.7e-05,0.000161,0.000117,7.2e-05,4e-05,7.1e-05,0.00016,5.1e-05,1.5e-05,4.1e-05,0.000103,8.3e-05,1.8e-05,4.6e-05,6.6e-05,0.000336,0.00025,0.000262,0.000183,0.00027,0.000178,0.000233,4.2e-05,0.000347,8.7e-05,0.000282,0.000244,0.000114,0.000161,0.000165,0.000236,0.000152,0.000187,0.000239,0.000167,1.1e-05,0.000172,0.000266,3.9e-05,0.000145,6.7e-05,0.000464,0.000333,0.000161,0.000315,0.000195,0.000123,0.00011,0.000138,4.9e-05,4.6e-05,4.3e-05,0.000101,7.3e-05,7.5e-05,4.5e-05,1.4e-05,3.8e-05,4.5e-05,5.4e-05,5e-05,3.2e-05,4.3e-05,3.1e-05,6.5e-05,1.1e-05,8e-06,1.8e-05,2.1e-05,2.9e-05,2.9e-05,1.5e-05,1.8e-05,1e-06,2e-05,1e-05,7e-06,8e-06,1.5e-05,1.2e-05,3e-06,1.9e-05,2.1e-05,1.3e-05,1.7e-05,9e-06,1.4e-05,3e-06,4e-06,4e-06,4e-06,3e-06,1e-05,5e-06,1.7e-05,6e-06,2e-06,1.1e-05,7e-06,4e-06,7e-06,1.1e-05,6e-06,5e-06,6e-06,7e-06,1.2e-05,2e-06,5e-06,2e-06,6e-06,8e-06,1.2e-05,3e-06,5e-06,8e-06,4e-06,4e-06
1e-05,4e-06,3.5e-05,2.3e-05,0.000158,2.3e-05,1.8e-05,8.8e-05,6.1e-05,0.000182,0.00013,7.1e-05,4.7e-05,7.7e-05,3.5e-05,5.4e-05,2.2e-05,4.3e-05,0.000162,0.000202,8.5e-05,0.000206,0.000103,0.000245,0.000284,0.000197,0.000137,0.000257,0.000145,2.2e-05,0.000291,0.000163,0.000118,0.000126,0.000148,0.000177,0.000305,1.1e-05,8.7e-05,0.000164,0.000164,6.1e-05,0.000216,7.1e-05,0.000387,0.000208,0.000257,0.000224,6.9e-05,0.000105,8.1e-05,4.2e-05,9.9e-05,6.3e-05,6.2e-05,6.6e-05,0.000109,5.3e-05,3.1e-05,2e-05,3.1e-05,4.4e-05,3.7e-05,3.6e-05,3.2e-05,4.4e-05,3.7e-05,6.3e-05,1.2e-05,1.7e-05,9e-06,2.4e-05,1.5e-05,1.4e-05,3e-06,2.2e-05,1e-05,2.6e-05,1.6e-05,1e-05,1.3e-05,6e-06,4e-06,1.4e-05,7e-06,5e-06,1.1e-05,1.4e-05,3e-06,1.2e-05,7e-06,2e-06,5e-06,2e-06,1e-06,9e-06,8e-06,1.8e-05,6e-06,1e-05,6e-06,6e-06,5e-06,8e-06,7e-06,5e-06,7e-06,6e-06,5e-06,1.2e-05,4e-06,2e-06,9e-06,3e-06,8e-06,5e-06,5e-06,5e-06,3e-06,1e-06,5e-06
5e-06,1.1e-05,2.4e-05,8.9e-05,0.000101,5.6e-05,3.1e-05,1.5e-05,0.000118,0.000226,7.3e-05,7.3e-05,3.2e-05,0.000174,0.000159,0.000116,5.2e-05,0.000105,0.000278,0.00013,0.000138,0.000217,0.000256,0.000236,0.000304,0.000181,0.000128,0.000234,0.000252,0.00011,9.5e-05,0.000182,9.4e-05,0.000291,0.000174,0.000208,0.000179,2.9e-05,6.1e-05,0.00012,0.000169,9.6e-05,0.000178,8.5e-05,0.000166,0.000168,0.000111,8.8e-05,0.00018,5.4e-05,2.8e-05,0.000102,8.1e-05,4.8e-05,0.000103,7.9e-05,0.000108,3.1e-05,5e-06,3.2e-05,4.8e-05,4.9e-05,2.2e-05,2.1e-05,1.8e-05,3.2e-05,3.9e-05,8.3e-05,3.2e-05,2.2e-05,2.3e-05,2.5e-05,2e-05,1.5e-05,3e-06,2e-05,1.6e-05,2.8e-05,2.7e-05,7e-06,1.7e-05,1e-06,5e-06,1.6e-05,9e-06,4e-06,1.3e-05,1.5e-05,7e-06,2.4e-05,3e-06,8e-06,3e-06,1e-06,4e-06,7e-06,1.2e-05,1.1e-05,9e-06,2e-06,7e-06,6e-06,3e-06,5e-06,4e-06,1e-06,3e-06,1e-06,8e-06,1.3e-05,4e-06,6e-06,6e-06,6e-06,9e-06,5e-06,4e-06,4e-06,3e-06,1e-06,5e-06
6e-06,1.1e-05,2.9e-05,7.5e-05,0.00053,0.000298,9.6e-05,0.000112,8.5e-05,0.000326,0.000248,9.2e-05,9.2e-05,0.00018,4.7e-05,0.000119,0.000122,9.9e-05,0.000155,0.000147,7.7e-05,0.000178,0.000262,0.000154,0.000229,0.000187,0.000229,0.000137,0.000194,3.2e-05,0.000172,0.000185,0.000307,0.000219,2.5e-05,0.000193,0.000134,4.1e-05,0.000108,6.4e-05,0.000269,7.2e-05,0.000133,5.1e-05,0.000218,0.000164,0.000222,0.000138,0.000162,0.000134,0.000107,0.000172,8.5e-05,8e-05,0.000122,4.8e-05,0.000179,6.7e-05,4.2e-05,6e-06,2e-05,4.6e-05,6.4e-05,2.4e-05,5.6e-05,3.5e-05,4.4e-05,2.2e-05,3.4e-05,1.1e-05,1.3e-05,3.1e-05,1.7e-05,5e-06,1.2e-05,1.6e-05,1.1e-05,1.5e-05,2.6e-05,3.3e-05,2.7e-05,2.2e-05,1.8e-05,2.4e-05,9e-06,1.9e-05,1.7e-05,1.9e-05,1.5e-05,2.4e-05,1.8e-05,7e-06,1.1e-05,8e-06,4e-06,8e-06,2.1e-05,1.9e-05,5e-06,3e-06,1.1e-05,6e-06,5e-06,8e-06,8e-06,5e-06,7e-06,6e-06,1.2e-05,1.3e-05,4e-06,7e-06,8e-06,2e-06,2e-06,1.1e-05,9e-06,4e-06,4e-06,5e-06,5e-06
1e-05,9e-06,2.1e-05,3.8e-05,0.000735,0.000692,0.000381,0.000291,0.000237,0.000128,0.000244,0.000251,0.000115,0.000131,0.000167,0.000119,0.000129,0.000153,0.00023,2e-04,6.5e-05,0.000222,9.4e-05,0.000146,0.000246,0.000121,0.000109,0.000163,0.000263,0.000134,0.000165,0.000132,0.000321,0.000242,9.7e-05,3.9e-05,0.000209,2.2e-05,9.2e-05,0.000113,0.000155,0.000126,0.000127,0.00013,0.000121,0.000114,0.000114,0.000166,0.000178,0.000158,9.4e-05,7e-05,0.000144,9.2e-05,0.000124,9.8e-05,0.000168,9.8e-05,8.1e-05,3.6e-05,7e-06,0.000106,4.3e-05,3.9e-05,4.2e-05,3.3e-05,1.5e-05,4.7e-05,2.3e-05,3e-05,1.2e-05,4.2e-05,2.4e-05,1.6e-05,1.5e-05,5e-06,1.8e-05,3e-06,1.5e-05,3.8e-05,4e-05,4.6e-05,2e-05,1.3e-05,1.1e-05,3.9e-05,1.7e-05,3.8e-05,2.5e-05,3.2e-05,2.9e-05,1.4e-05,1.6e-05,1.2e-05,1.2e-05,1.3e-05,1.9e-05,1.6e-05,1.5e-05,3e-06,6e-06,8e-06,4e-06,6e-06,4e-06,4e-06,1.1e-05,1.4e-05,1.6e-05,1.6e-05,7e-06,7e-06,1.2e-05,4e-06,4e-06,1.2e-05,1.3e-05,1.3e-05,6e-06,8e-06,5e-06
1e-05,1e-05,2.1e-05,7.9e-05,0.000598,0.000387,0.00014,0.000217,0.000153,0.000207,0.000102,2.5e-05,8.1e-05,0.000128,1e-04,2e-05,8.8e-05,3.6e-05,0.000156,7.2e-05,9.5e-05,0.000151,0.000247,0.000139,0.000265,0.000302,6.5e-05,5.4e-05,0.000218,0.000249,0.000362,6.7e-05,0.000299,0.000216,0.000194,0.00017,0.000222,5.3e-05,1e-05,9.4e-05,0.00017,0.000154,4.2e-05,1.8e-05,0.000204,0.000196,0.000208,0.000218,6.8e-05,5.6e-05,5.6e-05,1.7e-05,5.5e-05,0.000114,0.000104,4.6e-05,0.000103,4.3e-05,2.6e-05,1.4e-05,1.9e-05,7e-05,2.1e-05,4.3e-05,5.1e-05,6.8e-05,2.5e-05,3.7e-05,2.6e-05,5e-05,3.6e-05,2.9e-05,1.5e-05,5e-06,5e-06,1e-05,9e-06,2e-06,1.8e-05,2.7e-05,1.3e-05,8e-06,6e-06,9e-06,1.5e-05,3.3e-05,2.2e-05,3.1e-05,1.3e-05,1e-05,1.1e-05,1.8e-05,7e-06,1.6e-05,1.2e-05,9e-06,7e-06,1.2e-05,9e-06,7e-06,6e-06,4e-06,4e-06,1e-06,6e-06,1.1e-05,4e-06,5e-06,1.1e-05,7e-06,8e-06,3e-06,5e-06,6e-06,4e-06,1.6e-05,2e-06,5e-06,4e-06,7e-06,5e-06
6e-06,5e-06,1.6e-05,5.7e-05,0.000349,1.1e-05,2.8e-05,0.000134,4.1e-05,5.7e-05,2e-05,5e-06,4.8e-05,0.000133,5.4e-05,1.8e-05,2.6e-05,8e-06,0.000117,0.00012,0.00012,0.00013,9.3e-05,0.000198,0.000171,0.00015,0.000172,0.000155,0.000166,0.000237,0.000238,7.5e-05,0.000291,0.000118,2.4e-05,0.000118,0.000138,5.4e-05,6e-06,0.000133,0.000131,0.000162,4.4e-05,6.4e-05,0.000204,0.000262,4.6e-05,0.000263,3.9e-05,4.1e-05,9e-05,3.2e-05,3.7e-05,6.4e-05,4e-05,2.7e-05,7.3e-05,2.6e-05,1.7e-05,1.2e-05,2.2e-05,5e-05,2.3e-05,3.2e-05,5e-06,2.7e-05,2e-05,1.5e-05,2.9e-05,1.9e-05,1.2e-05,1.6e-05,8e-06,1.1e-05,3e-06,1.2e-05,8e-06,5e-06,1.1e-05,2.3e-05,9e-06,6e-06,5e-06,1.4e-05,1e-05,9e-06,9e-06,1.7e-05,9e-06,1e-05,2e-06,1.2e-05,7e-06,9e-06,4e-06,7e-06,2e-06,1.4e-05,7e-06,3e-06,6e-06,4e-06,1e-06,1e-06,3e-06,6e-06,2e-06,4e-06,7e-06,6e-06,5e-06,3e-06,3e-06,3e-06,7e-06,1.3e-05,4e-06,1e-06,2e-06,2e-06,2e-06
3e-06,6e-06,1.2e-05,2.9e-05,0.000254,6.3e-05,1.2e-05,7.6e-05,1e-06,2.8e-05,1.7e-05,1.7e-05,2.3e-05,7.2e-05,3.8e-05,2.4e-05,2.3e-05,1.4e-05,0.000135,6e-05,0.000159,4e-05,7.5e-05,0.000184,0.00014,0.000189,6.3e-05,0.000142,0.000232,0.000167,0.000181,0.000129,0.000132,9.1e-05,0.000142,0.000116,0.000205,0.000117,7.9e-05,0.000102,0.000206,0.00013,7.5e-05,8.9e-05,0.000177,0.000291,0.000226,0.000164,0.000111,4.8e-05,6.8e-05,4e-06,3.8e-05,3.7e-05,3.7e-05,2e-05,5.5e-05,1.1e-05,1.9e-05,1.2e-05,2e-05,5.5e-05,3.2e-05,2.8e-05,2.2e-05,4e-05,1.2e-05,2.1e-05,1.7e-05,1.4e-05,1.1e-05,1.8e-05,1e-06,4e-06,4e-06,1.3e-05,1.2e-05,6e-06,8e-06,1.5e-05,1e-05,6e-06,4e-06,1.3e-05,3e-06,7e-06,4e-06,1.6e-05,6e-06,7e-06,1e-06,6e-06,6e-06,7e-06,5e-06,6e-06,1e-06,1.5e-05,3e-06,5e-06,7e-06,4e-06,2e-06,1e-06,2e-06,3e-06,3e-06,5e-06,5e-06,8e-06,4e-06,4e-06,3e-06,2e-06,6e-06,1.3e-05,2e-06,1e-06,0,2e-06,0
3e-06,6e-06,9e-06,2.3e-05,0.000204,3.3e-05,1e-05,5.6e-05,1e-06,1.7e-05,2.3e-05,1.3e-05,1.5e-05,6.4e-05,4.9e-05,2.8e-05,1.7e-05,1.2e-05,0.000141,6.7e-05,9e-05,9e-05,0.000118,0.000202,0.000134,0.00018,5.1e-05,0.000178,0.000209,0.000203,0.000191,7.2e-05,0.000133,0.000129,0.000108,0.000132,0.000197,9.5e-05,2.6e-05,4.4e-05,0.000157,9.7e-05,8.2e-05,8.6e-05,0.000191,0.00026,0.000218,0.000156,7.8e-05,2.8e-05,5.4e-05,1.2e-05,4.5e-05,5.2e-05,4.4e-05,3.4e-05,6.2e-05,6e-06,1.4e-05,8e-06,2.3e-05,4.9e-05,2.7e-05,2.8e-05,2.4e-05,4e-05,1e-05,2.4e-05,1.5e-05,1.2e-05,9e-06,2e-05,1e-06,4e-06,5e-06,1.2e-05,1e-05,6e-06,9e-06,1.5e-05,8e-06,5e-06,1e-06,1.1e-05,2e-06,7e-06,5e-06,1.5e-05,6e-06,8e-06,0,7e-06,5e-06,7e-06,5e-06,5e-06,2e-06,1.4e-05,4e-06,2e-06,5e-06,3e-06,1e-06,3e-06,1e-06,5e-06,1e-06,5e-06,6e-06,9e-06,2e-06,3e-06,4e-06,1e-06,5e-06,1.1e-05,3e-06,1e-06,0,0,1e-06
