3e-06,4.7e-05,1e-05,6.1e-05,5.1e-05,1.4e-05,1.3e-05,3.2e-05,3.4e-05,0,6e-05,2.6e-05,6.7e-05,0.000107,6.8e-05,6e-06,1.7e-05,2.9e-05,4.7e-05,2.3e-05,9e-06,5.6e-05,0.000121,7.3e-05,6e-05,3e-05,0.000121,0.000222,7.9e-05,1.4e-05,0.000137,9e-05,5.5e-05,5.2e-05,0.000136,0.000112,0.000329,0.000154,0.000133,5.3e-05,0.000275,7.8e-05,1.7e-05,9.2e-05,0.000127,4.7e-05,0.000136,0.000227,7.8e-05,0.000111,0.000364,1.3e-05,0.000103,2e-04,6e-06,5e-06,4e-05,0.000185,8.6e-05,0.000261,5.9e-05,0.000122,3.1e-05,9.7e-05,0.000127,0.000142,4.5e-05,0.000138,2.6e-05,0.000108,0.000138,2.3e-05,2.9e-05,0.000236,6.6e-05,7.1e-05,0.000209,0.000223,8.9e-05,0.00011,9e-06,8.6e-05,0.000251,0.000274,6e-05,0.000281,5.7e-05,8e-06,0.000135,4.9e-05,0.000126,3.6e-05,0.000147,0.000123,6.6e-05,1e-05,9e-06,0.000169,9e-05,4e-05,9.8e-05,4.9e-05,6.1e-05,9.8e-05,0.000368,6.4e-05,9.8e-05,0.000151,0.000262,0.000262,7.3e-05,0.000142,0.000103,0.000123,0.000263,6e-06,0.000231,4.7e-05,0.000163,0.00011,0.000377
5.7e-05,3.9e-05,5.6e-05,8.3e-05,8.5e-05,5e-05,1.8e-05,4.8e-05,7.2e-05,1.9e-05,0.000125,8.6e-05,0.000107,0.000256,0.000216,8.2e-05,8.5e-05,5.1e-05,0.000216,0.000139,0.00016,2.1e-05,0.000207,0.000195,0.000135,7.5e-05,0.000305,0.000544,0.000348,3.5e-05,0.000329,0.000132,0.000261,0.000209,0.000298,0.00014,0.000806,0.000248,0.000358,0.000109,0.000633,0.000329,0.000252,0.000185,0.000469,0.000155,0.000257,0.000416,0.000194,8.1e-05,0.000658,0.000197,0.000481,0.000522,1.2e-05,8.4e-05,5e-05,0.000377,0.000153,0.000842,0.000505,0.000167,0.000146,0.000111,0.000191,0.000386,1e-05,0.000354,3.5e-05,0.000271,0.000469,0.000333,0.000145,0.00065,8.5e-05,0.000126,0.000404,0.000581,3.6e-05,9.9e-05,0.000169,7.3e-05,0.000544,0.000566,0.000128,0.000592,0.000108,0.000118,0.000223,3.8e-05,0.000443,9.9e-05,7.5e-05,0.000453,4e-05,0.000244,0.00016,0.000449,0.000421,0.000263,4.6e-05,0.000198,8.5e-05,0.000223,0.000824,0.000109,0.000219,0.000475,0.000361,0.000643,0.000227,0.000382,0.000366,0.000306,0.000634,0.000193,0.00043,0.000235,4e-04,0.000279,0.000883
7e-06,4.8e-05,3.6e-05,9e-05,8.9e-05,5.5e-05,0.000126,5.3e-05,0.000125,1.2e-05,0.000141,3.8e-05,0.000132,0.000106,0.00013,1e-04,0.000135,9.7e-05,0.000359,0.000166,0.000219,0.000205,0.000399,0.000132,0.000341,0.000282,0.00045,0.000409,0.000364,0.000209,0.000344,0.000334,0.000432,0.000199,0.000563,0.000492,0.000623,0.000485,0.000518,0.000359,0.001047,0.000485,0.000152,0.000266,0.000469,0.000234,9.2e-05,0.000621,0.000655,0.000286,0.000568,0.000181,0.000426,0.000471,0.000169,0.000107,0.000145,0.000531,3.1e-05,0.000471,4.5e-05,0.000374,0.000215,0.000233,0.000119,0.000498,0.000262,0.000594,0.000177,0.000211,0.000228,0.000413,3.6e-05,0.000582,0.00027,0.000261,0.000745,0.000507,0.000344,0.000351,0.000179,0.000408,0.000759,0.000744,0.000162,0.000465,0.000106,0.000198,0.000334,0.000113,0.00047,6e-05,0.000344,0.000257,0.000151,0.000411,0.000159,0.000528,0.000539,0.000222,0.000195,0.000372,0.00022,0.000221,0.00074,0.000197,0.000462,0.000884,0.00037,0.000461,0.000571,0.000616,0.000404,0.000467,0.000248,0.000146,0.000713,0.000514,0.000208,0.000208,0.000984
6.2e-05,8e-05,4.2e-05,0.00017,0.000141,5.3e-05,8.3e-05,8.2e-05,0.000122,8.4e-05,0.000138,0.000175,9.4e-05,0.000287,3.1e-05,0.000153,0.000126,0.000223,0.000701,0.000578,0.00027,0.00028,0.000479,6.7e-05,0.00038,0.000287,0.00057,0.000768,0.000614,0.000543,0.000907,0.000186,0.00051,0.000537,0.00067,0.000287,0.000616,0.000672,0.000656,0.000562,0.000933,0.000402,0.000224,0.000136,0.000736,9.3e-05,0.000449,0.000626,0.000519,0.000381,5e-04,0.000296,0.000326,0.000796,4.3e-05,0.000203,0.000404,0.000301,0.000207,0.000352,0.000316,0.000568,0.000571,0.000448,0.000458,0.000561,0.000453,0.000481,0.000151,5.9e-05,4.5e-05,0.000313,0.000829,0.000167,0.000108,0.000465,0.000856,0.000425,0.000273,0.000287,0.000472,6e-04,0.000862,0.000692,0.000758,0.000883,0.000731,0.000192,0.000488,0.000649,0.00069,0.000196,0.000694,0.000825,0.000508,6.4e-05,0.000158,0.000444,0.000509,0.000645,0.000476,0.000655,0.000424,0.001011,0.000646,0.000456,0.000428,0.000358,0.000971,0.000649,0.000409,8e-05,0.000696,0.000516,0.001145,0.000829,0.00078,0.001572,0.001011,0.000351,0.000776
6.2e-05,9.5e-05,4e-05,0.000171,0.000223,0.000176,0.000214,0.000197,0.000102,7.9e-05,0.000125,7.5e-05,0.000236,0.000326,0.00023,0.000165,8.8e-05,0.000272,0.001113,0.000335,0.000456,0.000478,0.00083,0.000749,0.000455,0.000658,0.001322,0.000611,0.00129,0.001084,0.001894,0.001474,0.001262,0.000288,7e-04,0.001512,0.000506,0.001764,0.001432,0.000785,0.0011,0.001346,0.000742,0.000409,0.001328,0.000936,0.00092,0.000382,0.000296,0.000623,0.001187,0.000765,0.000572,0.000871,0.000972,0.000645,5.4e-05,0.000502,0.000378,0.000927,0.000663,0.000215,0.00048,0.000901,0.001301,0.001439,0.001715,0.001706,0.001133,5e-04,0.000901,0.000902,0.00064,0.001562,0.000369,0.000849,0.001342,0.001257,0.000992,0.000707,0.000803,0.00137,0.002338,0.002234,0.00211,0.001673,0.001343,0.001079,0.001044,0.001104,0.000856,0.000491,0.000687,0.001307,0.000897,0.000516,0.000551,0.000367,0.000477,0.001061,0.00197,0.002342,0.001257,0.000938,0.00236,0.001463,0.001682,0.001307,0.001709,0.000268,0.000538,0.001073,0.000775,0.000115,0.001479,0.000632,0.000949,0.000826,0.000551,0.001123,0.002164
5.6e-05,6e-05,0.000133,4e-05,0.000181,0.00016,0.000455,0.000183,3e-04,0.000297,0.000173,0.00011,0.000311,0.000558,0.000631,0.000631,0.000571,0.000357,0.001137,0.000936,0.000762,0.000732,0.000498,0.000661,0.000308,0.000173,0.000477,0.00145,0.001287,0.000841,0.001478,0.001271,0.000423,0.000486,0.000833,0.000884,0.000731,0.001227,0.002014,0.001752,0.001163,0.00108,0.000444,0.000242,0.001165,0.001372,0.000421,0.000662,0.000472,0.001259,0.001448,0.001034,0.000817,0.000469,0.000881,0.000171,0.000644,0.000429,0.000193,0.000576,0.000266,0.000365,0.000809,0.000408,0.001094,0.000847,0.00117,0.000611,0.000781,0.000192,0.001376,0.00135,0.001579,0.000784,0.000935,0.000958,0.000863,0.001225,0.001078,0.000197,0.001378,0.00105,0.000995,0.001185,0.001814,0.001765,0.001176,0.000737,0.002088,0.000693,0.001742,0.001053,0.000145,0.001751,0.00082,0.000469,0.001277,0.002175,0.000616,0.000845,0.001704,0.00136,0.000885,0.00071,0.001811,0.001609,0.001013,0.001396,0.000687,0.001344,0.000842,0.00052,0.000148,0.000504,0.001976,0.001397,0.0015,0.001756,0.001387,0.001287,0.001608
2.9e-05,0.000101,0.000241,0.000107,2.6e-05,0.000156,0.000542,0.000568,0.000659,0.000486,0.000177,3e-04,0.00039,0.000327,0.000847,8.5e-05,0.000497,0.000436,0.000178,0.000108,0.000472,0.000702,0.00023,0.000408,0.000185,0.000366,0.000464,0.000291,0.000749,0.000517,0.001716,0.000781,0.000263,0.000677,0.000873,0.001287,0.000848,0.001074,0.001666,0.000726,0.000878,0.000297,0.000617,0.00108,0.001655,5.5e-05,0.000637,0.000969,0.000806,0.00102,0.001793,0.000139,0.000816,0.000329,0.000679,0.001224,0.000876,0.001359,0.000544,0.000479,0.000352,0.000368,0.000959,0.001567,0.000501,0.001078,0.000716,0.000708,0.000292,0.000884,0.000989,0.000666,0.000778,0.000982,0.000125,0.000332,0.00107,0.000623,0.000787,0.000447,0.001297,0.001505,0.00163,0.001141,0.000949,0.002065,0.000959,0.000982,0.001748,0.001081,0.001364,0.000253,0.000447,0.001503,0.000689,0.001427,0.001413,0.002181,0.000731,0.000862,0.001989,0.000619,0.000989,0.000217,0.002407,0.000448,0.001442,0.000199,0.001806,0.001062,0.001832,0.000585,0.000875,0.001425,0.002623,0.000422,0.002249,0.001456,0.000325,0.00139,0.000749
0.000137,6.2e-05,0.000275,0.000511,0.000332,0.00024,0.000319,0.000336,0.000269,0.000257,5e-05,0.000603,0.000645,0.00064,0.000266,0.000677,0.000955,0.001107,0.00167,0.0013,0.001351,0.001756,0.001009,0.001594,0.000599,0.000905,0.001695,0.000737,0.000805,0.001196,0.00116,0.001571,0.000799,0.000469,0.001812,0.000675,0.003069,0.001533,0.001228,0.001834,0.002403,0.001494,0.001534,0.001138,0.000371,0.001258,0.000835,0.002278,0.002173,0.001369,0.002549,0.001911,5e-04,0.001035,0.000659,0.001583,0.0019,0.002328,0.002164,0.00246,0.001059,0.001469,0.001404,0.00139,0.001841,0.002538,0.00163,0.001099,0.000349,0.001916,0.001681,0.00191,0.002175,0.000344,0.001722,0.000794,0.001568,0.001122,0.001054,0.000963,0.001188,0.002095,0.000932,0.001966,0.002429,0.002349,0.004114,0.003431,0.001659,0.00208,0.001561,0.002472,0.001918,0.002899,0.002456,0.003558,0.003856,0.004687,0.002869,0.002033,0.002203,0.001449,0.001944,0.00218,0.002438,0.002991,0.002329,0.001451,0.001989,0.002723,0.003552,0.002368,0.001161,0.003118,0.005616,0.003645,0.003809,0.004682,0.004013,0.001885,0.002106
0.000361,0.000152,0.000241,0.000449,0.000559,0.000443,0.000521,0.000133,0.000455,0.000749,0.000385,0.00082,0.001402,0.001227,0.00152,0.000838,0.002092,0.000813,0.004435,0.00265,0.003649,0.00386,0.002525,0.002764,0.001403,0.001178,0.001012,0.002633,0.002687,0.001845,0.003372,0.001709,0.001644,0.001051,0.002717,0.003974,0.005563,0.005406,0.005619,0.005415,0.00441,0.002444,0.000563,0.002933,0.001725,0.002015,0.000868,0.002425,0.003502,0.002465,0.00272,0.002259,0.002571,0.002605,0.002525,0.001512,0.001773,0.002852,0.003001,0.000208,0.001559,0.00039,0.000393,0.000907,0.001665,0.001009,0.001709,0.00195,0.002012,0.002967,0.002602,0.00047,0.001829,0.002186,0.004135,0.003457,0.003222,0.001531,0.002335,0.003606,0.00083,0.001162,0.003255,0.001488,0.002055,0.004652,0.004192,0.002292,0.000908,0.002779,0.002843,0.003042,0.000682,0.001849,0.001901,0.001574,0.001513,0.003168,0.003292,0.001972,0.001453,0.002915,0.000259,0.00259,0.003918,0.003567,0.002402,0.001062,0.000614,0.003114,0.004528,0.003133,0.001096,0.002285,0.004727,0.003261,0.001012,0.002661,0.002022,0.001869,0.002613
0.000134,0.000342,0.000525,0.00062,0.000178,0.000144,0.000358,0.000437,0.000261,0.0012,0.001074,0.000994,0.001322,0.000543,0.001701,0.001058,0.001864,0.001171,0.005107,0.002416,0.003305,0.001991,0.00101,0.001702,0.002659,0.001441,0.000833,0.002224,0.001607,0.000534,0.00339,0.002381,0.001675,0.000206,0.002154,0.001717,0.002211,0.002772,0.002869,0.002238,0.000927,0.001193,0.002272,0.001775,0.001136,0.001203,0.00133,0.002368,0.000935,0.003228,0.002596,0.002373,0.001179,0.001811,0.001536,0.002234,0.00149,0.00359,0.001034,0.001119,0.00236,0.002018,0.002227,0.000622,0.001234,0.001106,0.001104,0.001072,0.001326,0.002451,0.001391,0.001444,0.00244,0.001052,0.004075,0.000791,0.002256,0.00222,0.001142,0.002813,0.002769,0.001703,0.003041,0.002793,0.00121,0.001631,0.000708,0.001544,0.002948,0.000715,0.002895,0.002959,0.002487,0.001158,0.001369,0.001806,0.001408,0.002105,0.001306,0.000322,0.000426,0.00289,0.00362,9.1e-05,0.001042,0.001412,0.001105,0.002581,0.001436,0.001568,0.001668,0.001588,0.001045,0.002243,0.000359,0.001116,0.001328,0.000337,0.002288,0.001219,0.003202
0.000324,0.000422,0.00012,0.000496,4e-04,0.000494,0.000263,0.00018,0.000678,0.00115,0.000247,0.000538,0.000792,0.000878,0.001064,0.001597,0.00169,0.000797,0.003603,0.001667,0.001656,0.001313,0.001812,0.000849,0.002438,0.001701,0.00061,0.000757,0.001117,0.000128,0.002068,0.000584,0.001816,0.001936,0.001219,0.002007,0.002833,0.001302,0.001945,0.001285,0.000586,0.00109,0.00144,0.003015,0.002379,0.001141,0.000772,0.00174,0.001775,0.002224,0.002879,0.000686,0.001347,0.001373,0.002411,0.000964,0.000794,0.002321,0.001738,0.001408,0.001689,0.001013,0.002617,0.003114,0.002743,0.001141,0.001148,0.000783,0.000655,0.002577,0.001732,0.001325,0.003154,0.003463,0.002388,0.002252,0.002564,0.002619,0.002227,0.00313,0.001874,0.000669,0.000585,0.001749,0.001924,0.001156,0.00197,0.002392,0.000704,0.002187,0.000722,0.000403,0.000532,0.001035,0.001569,0.001219,0.001836,0.002524,0.000823,0.000684,0.000375,0.002718,0.003,0.003294,0.002214,0.002893,0.003098,0.001999,0.001447,0.001543,0.001876,0.002348,0.001569,0.00372,0.00342,0.003335,0.002389,0.001613,0.002058,0.001127,0.001687
0.000235,0.000145,0.000282,0.000133,0.000168,0.000372,0.000455,0.000202,0.000511,0.000285,0.000384,0.000338,0.000488,0.000341,0.000438,0.000943,0.000222,0.000755,0.001091,0.001087,0.000588,0.000795,0.000993,0.001065,0.00096,0.000156,3e-04,0.000812,0.000625,0.000939,0.000321,0.000802,0.000998,0.000297,0.000268,0.000416,0.001217,2.9e-05,0.000896,0.000553,9.9e-05,0.000976,0.000546,0.000948,0.000289,0.000139,0.00052,0.000295,0.000548,0.000958,0.000714,0.001121,0.000684,0.001169,0.000446,0.000208,0.00073,0.00043,6e-05,0.00127,0.000534,0.000731,0.001623,0.001669,0.000967,0.00065,0.000446,0.00026,0.000555,0.001232,0.000776,0.000711,0.001124,0.001067,0.000701,0.000487,0.00075,0.001047,0.001176,0.000328,6e-04,0.000704,0.000519,0.000918,0.00084,0.00127,0.001003,0.000738,0.001181,0.000976,0.001409,0.000635,0.000254,0.000325,0.001654,0.001785,0.000469,0.000832,0.000609,0.000894,0.000965,0.001316,0.001043,0.001213,0.001067,0.001076,0.000217,0.001309,0.000394,0.000757,0.00044,0.000733,0.000591,0.002361,0.001452,0.000661,0.000714,0.000494,0.001085,0.001131,0.00122
0.000107,7.5e-05,0.000113,3.6e-05,9.7e-05,0.000228,0.000275,7.8e-05,0.000375,0.000127,0.000106,1.7e-05,0.000153,0.000481,0.000495,0.000451,0.000138,0.000554,8.7e-05,0.000402,0.000229,0.000288,0.00049,0.000787,0.000509,0.000178,0.000493,0.000393,0.000123,0.000452,0.000149,0.000501,0.000125,0.000479,0.000347,0.000398,0.000343,0.000435,0.000445,0.000362,0.000235,0.000408,0.000296,0.000487,0.000331,0.000112,0.00037,0.000413,0.000205,0.00052,0.000129,0.00039,0.000193,0.000364,0.000229,0.000274,0.000331,0.000108,0.000117,0.000758,5.3e-05,0.000519,0.000539,0.000542,0.000152,3.8e-05,0.00018,0.000342,0.000224,0.000824,3e-04,0.000468,0.000675,0.000825,0.000378,0.000144,0.000738,0.000257,0.000536,0.000358,0.000168,0.000669,0.000214,0.000236,0.000511,0.000753,0.000873,0.00029,0.000173,0.000637,0.000667,0.000204,0.000224,0.000234,0.000658,0.000687,0.000452,0.000473,0.000277,0.000324,0.000399,0.000755,0.000728,0.001008,0.000669,0.000557,0.000813,0.00039,0.000134,0.000351,0.000436,0.00026,0.000328,0.001062,0.000432,0.000381,0.000481,0.000235,0.000198,0.00017,0.00084
0.00013,5.2e-05,0.000118,5.2e-05,0.000101,0.000229,0.000102,6e-05,0.000185,9.2e-05,0.000137,0.000104,0.000175,0.000267,0.000462,0.000362,2.1e-05,0.000228,0.00026,0.000487,0.000414,0.000211,0.000208,0.000692,0.000369,3.6e-05,0.000273,0.000164,0.000247,0.000365,0.000104,0.000344,0.000175,0.000281,0.000275,0.000323,0.000106,0.000168,0.000367,0.000524,0.000389,0.000467,0.000167,0.00037,0.000332,0.000216,0.000321,0.000385,0.00019,0.000375,0.000207,0.000325,0.000191,0.000249,0.000215,0.00015,0.00031,0.000129,5e-05,0.000445,7.4e-05,0.000367,0.000433,0.000329,0.000167,0.000188,0.000146,0.00026,0.000261,0.000561,0.000313,0.000246,0.000704,0.000743,0.00032,0.000202,0.000562,0.000231,0.000494,0.000136,0.000243,0.000539,0.00016,0.000269,0.000372,0.000596,0.000653,0.000128,0.000123,0.000415,0.000422,0.000138,0.000414,0.000426,0.000418,0.000489,0.000524,0.000381,0.000388,0.000365,0.000405,0.00101,0.000753,0.000631,0.000655,0.000452,0.000624,0.000133,0.000343,0.000271,0.000159,0.000442,0.000504,0.000888,0.000251,0.000187,0.000385,0.000339,0.000196,0.000255,0.000832
0.000106,2.2e-05,0.00017,7.4e-05,0.000108,0.000175,0.000209,0.000104,0.000156,0.000158,0.000173,2e-04,0.000149,0.000194,0.000177,0.000556,0.000307,0.000157,0.000483,0.00016,0.000512,0.000499,0.000147,0.000663,0.00017,0.000273,0.000287,0.000182,0.000416,0.00022,0.000289,0.000262,0.000315,0.000207,0.000348,0.000144,0.000377,0.00023,0.000166,0.000485,0.00032,0.000502,0.000345,0.000148,0.000409,0.000401,0.000332,0.000175,0.000275,0.000121,0.000446,5e-04,0.000446,3e-04,0.000247,0.000101,0.000437,7.2e-05,0.000201,0.000279,3e-05,0.000288,0.000401,0.000128,4.7e-05,0.000291,3e-05,0.000281,0.000248,0.000721,0.000115,0.000172,0.000804,0.000667,0.000288,0.000254,0.000304,0.000304,0.000788,0.000378,0.000337,0.000409,1.6e-05,0.000224,0.000583,0.000732,0.000456,3.6e-05,0.000558,0.000497,0.000498,0.00057,0.000567,0.000459,0.000402,0.000804,0.000382,0.000216,0.000457,0.000225,0.000388,0.000997,0.000695,0.000633,0.00091,0.000222,0.000759,0.000522,0.000773,0.00011,0.000654,0.000561,0.000517,0.000458,0.000175,0.000269,0.000514,0.000569,0.000183,0.000202,0.000723
8.4e-05,3.6e-05,0.000113,4.2e-05,7.3e-05,0.000299,0.000232,8.2e-05,0.000215,8.1e-05,0.000187,0.000316,0.000247,0.000289,0.00032,0.000544,0.00011,0.000288,0.00056,0.000398,0.000283,0.000112,0.000197,0.000461,0.000448,0.000352,0.000153,0.000478,0.000501,0.000679,0.000148,0.000415,0.000393,0.000353,0.00044,0.000202,0.000273,0.000137,0.000201,5.3e-05,0.000386,0.000409,0.000191,0.000142,0.000214,0.000488,0.000729,0.000307,1e-04,0.000248,0.000122,0.000147,0.000344,0.000526,0.000452,9.2e-05,0.000351,0.000458,0.000539,0.000279,0.000143,0.000223,0.000234,0.000194,0.00012,0.000111,0.000127,0.000439,0.000219,0.000597,0.000432,0.000157,0.000565,0.000588,0.000383,0.000299,0.000287,0.000346,0.000382,0.000428,0.000306,0.000669,0.000228,0.000491,0.000698,7e-04,0.000592,0.000136,0.000492,0.000448,0.000323,0.000965,0.000859,0.000899,0.000423,0.000978,0.000838,0.000254,0.000262,0.000322,0.000178,0.000974,0.00091,0.000959,0.000902,6.4e-05,0.000693,0.000525,0.00068,0.00041,0.000881,0.001075,0.000398,0.000339,0.000382,0.000756,0.000179,0.000596,0.000498,0.000522,0.000982
0.000158,0.00017,4.8e-05,0.000148,2.6e-05,0.000297,0.000473,0.000548,0.00026,0.000113,0.000135,0.000363,0.000475,0.00031,0.000289,0.000269,0.000248,0.000451,0.000279,0.00039,0.000177,0.00051,0.000473,0.000956,0.000759,0.000675,0.000207,4e-04,0.000567,0.001328,0.000158,0.000659,0.000545,0.000443,0.001041,0.000472,0.000656,0.000311,0.000392,0.000881,0.00087,5.8e-05,0.00034,0.000234,0.000551,0.00032,0.000431,0.000181,0.000512,0.000745,0.000245,0.000198,0.000704,0.000482,0.000578,0.001038,0.000711,0.000847,0.000634,0.00048,0.000146,0.000865,0.000769,0.000405,0.00016,0.000346,0.000137,0.001197,0.000346,0.000587,0.001169,0.000669,0.001588,0.000523,0.000789,0.00046,0.000405,0.001219,0.000501,0.000193,0.000275,0.000564,0.000986,0.000978,0.001114,0.001142,0.000869,0.000484,0.00041,0.000572,0.000351,0.001221,0.000279,0.001246,0.000313,0.001608,0.000723,0.000575,0.000932,9.2e-05,0.001146,0.001956,0.000642,0.000904,0.001195,0.001258,0.000518,0.000832,0.001357,0.000463,0.000783,0.001763,0.000732,0.001154,0.001044,0.001192,0.001466,0.000229,0.000566,0.001514,0.000478
0.000136,0.000379,0.000343,0.000153,0.000166,0.000221,0.000144,0.000383,0.000485,0.000437,0.000289,0.000267,0.000213,0.000329,0.000263,0.000768,0.000464,0.001029,0.001113,0.000958,0.000725,0.001224,0.000698,0.001102,0.001441,0.000399,0.001482,0.001012,0.00143,0.00178,0.001686,0.001644,0.001354,0.000457,0.001719,0.000586,0.001496,0.000863,0.001017,0.001335,0.000837,0.000904,0.000453,0.001086,0.000434,0.00054,0.000877,0.001027,0.001,0.000909,0.001807,0.000894,0.00148,0.001369,0.00023,0.0012,0.000466,0.00051,0.000785,0.001007,0.00101,0.001111,0.000209,0.001303,0.001469,0.001306,0.000826,0.001179,0.001162,0.000871,0.00246,0.001242,0.001499,0.002944,0.002653,0.001493,0.001145,0.000783,0.001685,0.000704,0.001151,0.000532,0.002161,0.001854,0.002383,0.000549,0.002012,0.00179,0.001959,0.000151,0.000381,0.001787,0.002637,0.001694,0.002207,0.001432,0.002321,0.002617,0.001585,0.001419,0.00265,0.003195,0.003029,0.002816,0.001772,0.002174,0.001752,0.001241,0.002715,0.002394,0.001391,0.002986,0.00251,0.000813,0.000647,0.001004,0.001378,0.001651,0.001912,0.002464,0.003313
0.000125,0.000392,0.000341,0.000356,0.000393,0.000419,0.000444,9.5e-05,0.000133,0.000661,0.000937,0.000761,9.3e-05,0.000891,0.000761,0.001014,0.000494,0.000759,0.000612,0.001374,0.001165,0.001456,0.001039,0.001219,0.002046,0.002433,0.003229,0.001985,0.002186,0.003257,0.003101,0.002334,0.001589,0.001168,0.001964,0.002632,0.002059,0.002097,0.000821,0.00085,0.001179,0.002226,0.001738,0.001073,0.001717,0.001601,0.00111,0.001231,0.000863,0.000402,0.001918,0.001633,0.001513,0.003003,0.002554,0.002058,0.00136,0.000617,0.001061,0.000916,0.000511,0.001454,0.000927,0.001575,0.001585,0.000173,0.000923,0.001591,0.001679,0.00147,0.002256,0.004101,0.003883,0.003294,0.002489,0.002662,0.001729,0.002293,0.001916,0.001866,0.001837,0.001626,0.002539,0.003201,0.001116,0.001047,0.002327,0.000591,0.001334,0.001669,0.000712,0.001758,0.003797,0.005692,0.005302,0.004517,0.003869,0.002004,0.002887,0.001464,0.001379,0.004361,0.00513,0.002858,0.002286,0.001953,0.000865,0.000929,0.001613,0.002825,0.001891,0.002865,0.002214,0.00288,0.001315,0.001988,0.002044,0.000902,0.001801,0.000613,0.002014
0.000146,0.000164,3.7e-05,0.000117,0.00021,0.000257,9.2e-05,0.000195,8.7e-05,0.000526,0.000209,0.000636,0.000771,0.000828,0.00043,0.000611,0.000247,0.00038,0.000831,0.000413,0.001505,0.000367,0.000504,0.000592,0.001268,0.000642,0.00124,0.00075,0.000679,0.001418,0.000155,0.001448,0.001046,0.00081,0.001999,0.001805,0.001393,0.000413,0.000594,0.000229,0.000647,0.001324,0.000865,0.001021,0.001261,0.001064,0.000595,0.000155,0.000521,0.000692,0.001197,0.000911,0.000403,0.001881,0.001818,0.000702,0.000502,0.000476,0.000704,0.000751,0.000412,0.000632,0.000727,0.001341,0.000379,0.000874,0.000842,0.000438,0.000562,0.00042,0.001612,0.002783,0.001414,0.001474,0.001198,0.000653,0.000416,0.00179,0.00074,0.001302,0.001412,0.000158,0.001233,0.00086,0.00047,0.000426,0.001258,0.001,0.000855,0.000405,0.000672,0.001775,0.001382,0.002518,0.001035,0.000454,0.001124,0.00129,0.00176,0.001163,0.00071,0.001947,0.000912,0.000543,0.00174,0.001058,0.000958,0.000651,0.001367,0.001275,0.001394,0.001508,0.000755,0.001626,0.000377,0.002066,0.00055,7.7e-05,0.001465,0.000764,0.001088
8.4e-05,0.000107,2.9e-05,1.3e-05,0.000188,4.2e-05,0.000148,0.00011,4.9e-05,0.000243,0.000372,0.000351,0.000112,0.000315,0.000113,0.000337,0.000423,0.000648,0.000313,0.000482,0.000606,0.000743,0.000652,0.00076,0.000243,0.000218,0.000442,0.000687,0.000688,0.000413,0.000623,0.000632,0.000269,0.000847,0.000368,0.001035,0.000646,0.00059,0.000664,0.000329,0.000175,0.00084,0.000384,0.000585,0.000618,1e-04,0.000518,0.000302,0.000601,0.000602,0.001091,0.000214,0.000369,0.000833,0.000206,0.000496,0.000614,0.000164,0.000196,0.000368,0.000597,0.000364,0.000578,0.000132,0.000659,0.000264,0.000216,0.000231,0.000202,0.000601,0.000638,0.001125,0.000422,5.3e-05,0.001022,0.000467,0.000241,0.001161,0.000568,0.00077,0.000126,0.000214,0.000459,0.000251,6.3e-05,9.2e-05,0.000593,0.000381,0.000502,0.000244,0.000205,0.000387,0.000827,0.000811,0.000978,0.00047,0.000349,0.001271,0.000205,0.000374,0.000768,0.000645,0.000524,0.000292,0.001115,0.000231,0.000273,0.000266,0.000759,0.00051,0.000323,0.000878,0.000164,0.000431,0.000325,0.001189,0.000435,0.000418,0.000402,0.000426,0.000266
2.4e-05,6.1e-05,2.7e-05,5.1e-05,7.6e-05,6.2e-05,8.5e-05,1e-05,3e-05,3.6e-05,0.000155,0.000129,0.000187,0.000185,6.8e-05,0.000204,0.000142,0.000495,0.000593,0.000302,0.00013,0.000108,0.000405,0.000407,0.000322,0.000785,0.000565,0.000401,0.000392,0.000347,0.00058,0.000211,0.000141,0.000438,0.00045,0.000668,0.00031,0.000366,0.000655,7.3e-05,0.000365,0.000374,0.000385,0.000352,0.000281,0.000169,0.000378,0.000299,0.000304,0.000152,0.000523,0.00025,0.000652,0.000694,0.000286,9e-05,0.000186,0.000235,0.00019,0.000267,0.000279,0.000291,0.000135,0.000217,0.000144,0.000419,0.000149,0.000224,0.000374,0.000596,0.00065,0.000468,0.000416,0.000382,0.000592,0.000162,0.000325,0.000394,0.00022,0.000508,0.000268,5.6e-05,0.000521,0.000544,0.000104,0.000329,0.000263,0.000397,0.00019,0.000132,4.6e-05,0.000332,0.00063,0.000713,0.00048,0.000383,0.000541,0.000762,0.00037,0.000562,0.000606,0.000385,0.000363,6.4e-05,0.000522,0.000299,9.9e-05,0.000253,0.000777,0.000584,0.000384,0.000296,0.000296,0.000413,0.000459,0.000581,6.7e-05,0.000401,0.000223,0.000408,0.000148
1.2e-05,1.7e-05,2.1e-05,9e-06,1.1e-05,1.7e-05,3.7e-05,3.6e-05,3.4e-05,5.1e-05,5.4e-05,3.3e-05,8.5e-05,5.2e-05,4.4e-05,4.2e-05,4.9e-05,0.000112,0.000306,0.000191,0.000162,0.000121,0.000127,0.00014,0.00014,0.000299,0.000119,4.4e-05,2e-04,0.000132,0.000222,0.000106,0.000142,0.000224,7e-05,5e-05,0.000247,0.000163,0.000253,9.6e-05,0.00029,0.000214,0.000152,0.000113,7.2e-05,0.000175,9e-05,0.000109,0.000208,0.000152,0.000131,4.5e-05,0.000222,0.000239,0.000102,9.1e-05,5e-05,9e-05,9.9e-05,0.000124,2.1e-05,8.1e-05,4.1e-05,9.2e-05,4.7e-05,0.000153,3.2e-05,0.000103,0.000184,0.000116,0.000242,0.000167,0.000219,0.000297,0.000206,0.000135,6.8e-05,0.000217,6e-05,6.7e-05,1.8e-05,8.6e-05,0.000188,0.000221,3.1e-05,0.000174,0.000222,0.000152,0.000109,6e-05,0.000118,0.000364,2e-04,0.000214,0.000232,0.000272,5e-05,0.00022,0.000141,0.000104,0.00012,0.000207,0.000126,3.1e-05,3.9e-05,0.000141,0.000117,0.000181,0.000211,0.000114,9.3e-05,0.000172,0.000126,0.000185,0.000221,0.000238,0.000181,5.1e-05,0.000155,5e-05,5.3e-05
2.2e-05,1.7e-05,1e-05,6e-06,2.2e-05,9e-06,1.9e-05,6.3e-05,4.6e-05,6.8e-05,6e-05,5.1e-05,2.8e-05,3.1e-05,5.1e-05,0.000108,0.000112,0.000152,0.000126,8.8e-05,4.9e-05,3.5e-05,0.000105,2.7e-05,0.00013,0.000175,0.000144,0.000101,5.6e-05,0.000161,0.000264,6.3e-05,7.4e-05,0.000129,5.2e-05,6.7e-05,8.4e-05,0.000167,0.00023,0.000112,0.000177,4.1e-05,0.000153,0.00011,4.8e-05,0.000108,0.000108,7.8e-05,0.000144,0.000162,0.00022,0.000145,7.3e-05,0.000204,0.000147,3.3e-05,4.6e-05,8.6e-05,9.8e-05,0.000133,0.000106,7.8e-05,0.000135,0.000135,0.000103,4.6e-05,6e-05,6.6e-05,0.000243,9.9e-05,0.000282,3.9e-05,4.8e-05,0.000116,0.000219,8.6e-05,2.4e-05,0.000187,8.4e-05,2e-04,7.3e-05,5.7e-05,4.5e-05,6.5e-05,8e-05,0.000105,0.00017,0.000104,0.000186,0.000131,0.000169,0.000196,0.000204,3.9e-05,0.000208,0.000165,0.000118,0.00026,0.000162,0.000153,0.000122,0.000156,0.000135,4.2e-05,9e-05,0.000135,0.000237,0.000253,0.000273,0.000194,2.9e-05,0.000145,0.000103,0.000162,9.7e-05,0.000176,8.2e-05,1e-05,9.9e-05,0.000102,6.4e-05
1.1e-05,1.4e-05,1e-05,1.3e-05,3.1e-05,1.9e-05,1.1e-05,5.6e-05,7.2e-05,4.9e-05,2.1e-05,5.7e-05,9.1e-05,6.3e-05,5.5e-05,0.000118,1.3e-05,0.000138,0.000124,0.000126,0.000122,6.2e-05,2.8e-05,0.000106,0.000124,0.000132,0.000125,0.000125,6.9e-05,4.9e-05,0.000207,6.5e-05,7.2e-05,8.7e-05,8e-05,7.2e-05,0.000108,7.8e-05,0.000129,8.9e-05,0.000111,6.8e-05,6.3e-05,9.5e-05,9.9e-05,2.6e-05,3.6e-05,8.1e-05,0.000142,6.4e-05,9.4e-05,5e-05,0.000102,6.1e-05,0.000106,2e-05,5e-06,3.7e-05,6e-05,0.000146,7.3e-05,2.4e-05,9.2e-05,0.000152,5.6e-05,6e-05,5.4e-05,3.8e-05,0.000174,7.6e-05,0.000176,9.7e-05,0.000116,0.000112,7.8e-05,9.2e-05,7.4e-05,9.5e-05,4.2e-05,0.000102,5.3e-05,3.2e-05,0.00014,0.000131,6.6e-05,2.9e-05,0.000134,7.1e-05,4.4e-05,0.000105,4.1e-05,0.000196,0.00015,0.000164,0.000128,0.000124,0.000119,0.00022,2.1e-05,0.000125,0.000109,0.000122,0.000119,7.7e-05,9.1e-05,0.000151,0.000133,8e-05,0.000134,9.6e-05,2.1e-05,0.000177,3e-05,0.000182,0.000177,0.000202,6.1e-05,1.9e-05,0.00016,0.000133,3.4e-05
4e-06,1.7e-05,2e-06,1.2e-05,2.4e-05,2.3e-05,1.4e-05,5.5e-05,2.1e-05,4.1e-05,2.7e-05,2.3e-05,5e-05,3e-05,4.8e-05,5.4e-05,5.5e-05,5e-05,6.1e-05,2.1e-05,0.000129,5.1e-05,4.9e-05,5e-06,0.000101,0.00012,9.5e-05,9.5e-05,2.2e-05,9.2e-05,0.000156,3.9e-05,2.3e-05,6.5e-05,7.2e-05,2e-05,9.8e-05,3.1e-05,0.000138,0.000147,0.000105,3.7e-05,6.1e-05,3e-05,1e-04,7.3e-05,4.2e-05,1.2e-05,0.00013,2.3e-05,7.2e-05,8.2e-05,8.8e-05,8.9e-05,0.000104,3.4e-05,2e-05,2e-05,8.9e-05,0.000124,4e-05,5e-06,4.6e-05,0.000162,1.6e-05,7.2e-05,6.2e-05,5.2e-05,0.000145,5.2e-05,0.000174,6.9e-05,4.2e-05,0.000147,1.6e-05,5.5e-05,0.000112,0.000121,4.7e-05,8.3e-05,5.2e-05,8.9e-05,0.000173,0.000136,9.4e-05,4.7e-05,8.2e-05,0.000122,1.4e-05,3.7e-05,3.7e-05,0.000175,4.6e-05,0.000203,7.9e-05,6.3e-05,0.000166,0.000145,5.7e-05,0.000122,0,0.000163,9.9e-05,3.3e-05,7e-05,6.9e-05,9.8e-05,0.000108,0.000116,6e-05,2.4e-05,0.000126,9.7e-05,0.000194,0.000134,2.3e-05,2.7e-05,7e-06,0.000173,9.6e-05,5.9e-05
1.5e-05,1.3e-05,7e-06,5e-06,1.4e-05,2.1e-05,1.2e-05,4.9e-05,4.1e-05,4.3e-05,1.2e-05,7e-06,3.5e-05,5.3e-05,4e-05,7.3e-05,7.2e-05,5.1e-05,4.2e-05,3.8e-05,9e-05,7.6e-05,5.5e-05,2e-05,8.9e-05,0.000146,9.5e-05,0.000125,6.6e-05,0.000107,0.000156,1.2e-05,3.9e-05,5.8e-05,2.9e-05,3.5e-05,6.8e-05,7.2e-05,0.000122,8.4e-05,9.5e-05,3.8e-05,8.1e-05,5.3e-05,5.6e-05,4.6e-05,5.6e-05,4.6e-05,0.000143,9e-06,2.2e-05,4e-05,1e-04,0.000107,0.000119,2e-05,1.2e-05,1.1e-05,4.7e-05,8.7e-05,4.5e-05,1.1e-05,1.6e-05,9.7e-05,2.3e-05,6.9e-05,2.6e-05,3.3e-05,0.000121,5.6e-05,0.000102,0.000101,7.2e-05,0.000134,5.1e-05,8.3e-05,0.000113,0.000118,2e-05,4.5e-05,3.9e-05,1.6e-05,3.6e-05,8.3e-05,9e-05,0.000139,0.000158,0.000113,4e-05,6.9e-05,6.7e-05,0.000137,0.000107,0.000149,7.8e-05,4.1e-05,0.000133,0.000115,3.9e-05,7e-05,6.6e-05,4.9e-05,6.8e-05,6.4e-05,6.3e-05,9.1e-05,4.2e-05,3.2e-05,6.8e-05,6.6e-05,3.9e-05,0.000123,0.000106,0.000209,0.000105,0.000125,5.9e-05,1.8e-05,4.9e-05,0.00013,3.7e-05
9e-06,8e-06,6e-06,8e-06,1.2e-05,1.3e-05,9e-06,2.7e-05,3.4e-05,2e-05,2.7e-05,1.8e-05,4.1e-05,3.9e-05,1.9e-05,8.4e-05,5.3e-05,7e-06,5.7e-05,5.8e-05,6.8e-05,3.5e-05,8.8e-05,5e-05,5.9e-05,0.000116,0.000117,9.4e-05,3.5e-05,8e-05,0.00017,2.2e-05,4.4e-05,6.7e-05,6.2e-05,5.6e-05,8.6e-05,7.4e-05,0.000154,7.5e-05,7.5e-05,3.1e-05,7.1e-05,4.3e-05,6.2e-05,1.5e-05,5.6e-05,1.8e-05,0.000127,3.4e-05,4.2e-05,3e-06,9.9e-05,7.1e-05,6.5e-05,9e-06,1e-05,1.5e-05,7.4e-05,0.000107,4.6e-05,2.2e-05,1.1e-05,9.9e-05,8e-06,5.3e-05,3e-06,1.6e-05,1e-04,2.9e-05,8.5e-05,0.000106,7.5e-05,8.4e-05,6.6e-05,5.9e-05,0.000105,6.5e-05,1.4e-05,1.9e-05,5e-05,3.1e-05,0.000113,8.6e-05,4.1e-05,7.5e-05,0.000131,5.5e-05,2e-05,7.3e-05,1.7e-05,9.9e-05,8.4e-05,0.000123,0.000123,2.3e-05,0.000107,0.000122,1.6e-05,7.7e-05,7.4e-05,0.000102,4.8e-05,6e-05,1.9e-05,5.5e-05,3.3e-05,6e-05,3.4e-05,4.8e-05,5.7e-05,0.000118,1.6e-05,0.000178,5.2e-05,0.000125,8e-06,1.7e-05,0.000114,3.7e-05,2.2e-05
5e-06,1.1e-05,7e-06,6e-06,1.4e-05,2.2e-05,6e-06,9e-06,4.2e-05,2.8e-05,1.3e-05,2.9e-05,1.5e-05,3.9e-05,5e-06,7.5e-05,5e-05,4.3e-05,6.2e-05,6.6e-05,2.1e-05,6e-05,3.6e-05,8e-06,1.6e-05,0.000102,0.000121,4.7e-05,8e-06,6.2e-05,0.000174,5.4e-05,5.2e-05,5.3e-05,3.8e-05,1.3e-05,7e-05,6.6e-05,0.000113,7.4e-05,7.5e-05,2.4e-05,8.1e-05,5.7e-05,5.8e-05,4e-05,2.3e-05,2.1e-05,9.9e-05,3.1e-05,1.9e-05,1.4e-05,9.2e-05,6.3e-05,6.7e-05,4.4e-05,3.3e-05,4.9e-05,2.1e-05,8.5e-05,4.1e-05,1.4e-05,1e-05,7.8e-05,2.3e-05,5.1e-05,1.5e-05,3.3e-05,7.4e-05,4.9e-05,7.6e-05,0.000122,1e-04,0.000134,4.7e-05,2.9e-05,9.4e-05,7.2e-05,2.7e-05,4.7e-05,1.4e-05,3.7e-05,0.000107,0.000138,1.2e-05,5.7e-05,0.000129,0.000109,1.6e-05,4e-05,4.9e-05,0.000133,6.2e-05,0.000123,0.000101,4.8e-05,5.4e-05,8.7e-05,2.7e-05,8.9e-05,2.9e-05,0.000134,1e-04,4.4e-05,1.8e-05,3.8e-05,2e-05,2e-05,3.5e-05,5.8e-05,4.1e-05,0.000132,0.000137,0.000209,3.2e-05,9.4e-05,1.1e-05,2.3e-05,0.000142,1.2e-05,2e-05
1.3e-05,1.5e-05,6e-06,3e-06,2.7e-05,1.9e-05,1.1e-05,2.5e-05,2.3e-05,5e-06,3.9e-05,2.1e-05,2.7e-05,2.9e-05,1.2e-05,5.1e-05,2.4e-05,5.6e-05,2.6e-05,3.8e-05,9.5e-05,1.5e-05,4.7e-05,1.9e-05,4.8e-05,9.2e-05,4.4e-05,6.8e-05,4.3e-05,4e-05,0.000203,4.7e-05,4e-06,9.1e-05,2.5e-05,3.7e-05,2.1e-05,6e-06,7e-05,5.4e-05,6.9e-05,1.4e-05,1.2e-05,6.6e-05,8.6e-05,1.9e-05,2.3e-05,5e-06,9.8e-05,2.9e-05,4e-05,2.7e-05,5.9e-05,6.3e-05,9.9e-05,2.1e-05,9e-06,3.4e-05,7.6e-05,9.4e-05,1.9e-05,3e-05,9e-06,9.2e-05,4.4e-05,7e-05,2.5e-05,3.1e-05,7.7e-05,2.9e-05,6.7e-05,9.1e-05,4.7e-05,9.9e-05,4.5e-05,4.7e-05,7.1e-05,4.9e-05,1.8e-05,6e-05,3.4e-05,3.5e-05,6.6e-05,0.000101,4.6e-05,5.9e-05,0.000103,0.00011,3.8e-05,8.8e-05,4.2e-05,8.4e-05,4.2e-05,0.000135,8e-05,1.5e-05,3.5e-05,0.000127,4.6e-05,6.5e-05,4.9e-05,7.8e-05,3.3e-05,5.6e-05,4.1e-05,3.7e-05,9.1e-05,8.5e-05,4.7e-05,7.1e-05,5.3e-05,0.000103,0.000127,0.000149,3.5e-05,0.000122,1.6e-05,2e-05,7.6e-05,7.3e-05,2.6e-05
1.4e-05,6e-06,6e-06,1e-05,2.1e-05,1.8e-05,5e-06,1.6e-05,2.5e-05,1.9e-05,2.3e-05,3.5e-05,6e-06,4.3e-05,1.9e-05,5.5e-05,4.1e-05,3.4e-05,6.5e-05,4.5e-05,7.8e-05,1.8e-05,4.9e-05,2.5e-05,4.6e-05,9e-05,5.8e-05,6.7e-05,3e-05,1.2e-05,0.000141,3.7e-05,4.6e-05,5.7e-05,2.2e-05,2.5e-05,3.5e-05,5.2e-05,0.000132,5.4e-05,0.000108,2.3e-05,5.1e-05,3.9e-05,0.000102,5.2e-05,3.2e-05,2.5e-05,0.000118,2.8e-05,7.7e-05,8e-06,5.7e-05,4.3e-05,7.9e-05,3.5e-05,7e-06,2.6e-05,6.7e-05,9e-05,6.8e-05,5.4e-05,5.5e-05,0.000108,6e-06,9.7e-05,1.8e-05,2.2e-05,8.2e-05,3.8e-05,6.7e-05,0.000114,5.3e-05,5.5e-05,0.000104,2.9e-05,4.3e-05,0.000102,7.1e-05,8.4e-05,8.6e-05,6.3e-05,9.1e-05,7.4e-05,2.5e-05,3.3e-05,0.000144,9.7e-05,3.7e-05,3.8e-05,5.1e-05,8.8e-05,4.2e-05,0.000111,9.5e-05,2.7e-05,4.1e-05,9.2e-05,4.3e-05,0.000119,5e-05,5.8e-05,5.5e-05,6.5e-05,6.6e-05,4.1e-05,0.000115,2.5e-05,9.1e-05,3.8e-05,2.4e-05,0.000119,2.3e-05,0.000235,1.5e-05,0.000108,6.1e-05,5.9e-05,2.7e-05,5e-05,7e-06
8e-06,1.4e-05,6e-06,2e-06,2.2e-05,1.4e-05,1e-06,2.4e-05,1.2e-05,2.8e-05,9e-06,1.7e-05,1e-05,3.4e-05,1.1e-05,5.9e-05,5.9e-05,6.3e-05,4.4e-05,2.8e-05,7.2e-05,5.4e-05,4.7e-05,5.3e-05,3.8e-05,6.5e-05,6.9e-05,7.8e-05,4.8e-05,5.3e-05,0.000147,5.4e-05,3.3e-05,6.6e-05,6.2e-05,1.6e-05,1.6e-05,5.6e-05,0.000131,2.9e-05,0.000108,4.3e-05,6.2e-05,6.7e-05,6.6e-05,2.9e-05,5e-05,4.2e-05,8.1e-05,3.2e-05,4.8e-05,5.1e-05,5e-05,2e-05,4.5e-05,1.9e-05,1.9e-05,4.3e-05,3.2e-05,3.1e-05,5.1e-05,2.2e-05,3.7e-05,4.6e-05,2.3e-05,6.1e-05,2.7e-05,4.7e-05,8.3e-05,9e-06,8.7e-05,0.000106,8.7e-05,0.00011,8.1e-05,8.7e-05,8.9e-05,0.000103,2.9e-05,0.000101,6.1e-05,5.6e-05,7.4e-05,9.1e-05,5e-05,2.2e-05,7.7e-05,6.7e-05,3.1e-05,5.6e-05,5.4e-05,5.2e-05,2.9e-05,6.5e-05,0.000133,2.9e-05,4.8e-05,8.3e-05,2.6e-05,0.000115,9e-05,2.9e-05,4e-05,6.4e-05,8.5e-05,7.9e-05,6.7e-05,2.5e-05,7e-05,6.1e-05,1.6e-05,8.9e-05,3.5e-05,0.000195,8.3e-05,5.8e-05,3e-05,5.8e-05,9e-05,5.9e-05,5.2e-05
8e-06,8e-06,7e-06,3e-06,2.4e-05,2.1e-05,2e-06,2.2e-05,2.6e-05,4e-05,1.7e-05,3.1e-05,2.6e-05,1.6e-05,2e-05,6.7e-05,4.3e-05,3.5e-05,2.4e-05,2.4e-05,4.3e-05,4.6e-05,8.1e-05,6.7e-05,2.1e-05,0.000112,8.5e-05,8.5e-05,1.6e-05,1.2e-05,0.000171,6.3e-05,6.4e-05,7.3e-05,3e-05,5.4e-05,1.8e-05,7.6e-05,0.000117,5.9e-05,3.3e-05,3.4e-05,5.7e-05,9e-05,8.8e-05,6.3e-05,3.3e-05,3.8e-05,6.4e-05,2.2e-05,4.8e-05,4.1e-05,6.9e-05,0.000101,9.2e-05,3.6e-05,7e-06,3.6e-05,3.3e-05,8.3e-05,1.2e-05,4.4e-05,2.7e-05,6.4e-05,3.8e-05,6.1e-05,2.3e-05,4e-05,0.000114,5.1e-05,7.1e-05,8.6e-05,7.3e-05,7.8e-05,4e-05,7.4e-05,3.3e-05,4e-05,3.2e-05,6.2e-05,8e-05,3.3e-05,0.000106,4.7e-05,2.1e-05,1.8e-05,0.000119,7.7e-05,6.8e-05,5.9e-05,6e-05,7.2e-05,3.9e-05,0.00011,0.000113,3.1e-05,7e-05,6.6e-05,4.3e-05,7.4e-05,5.5e-05,4.3e-05,6e-05,4.7e-05,6.1e-05,7.7e-05,4.7e-05,7.9e-05,6e-05,5.4e-05,2.5e-05,9.6e-05,5.6e-05,0.000156,2e-05,0.000104,5e-05,6.9e-05,0.000156,6.4e-05,6.9e-05
4e-06,6e-06,6e-06,4e-06,1.7e-05,1.2e-05,1e-05,1e-05,2.8e-05,4.4e-05,3.8e-05,1.2e-05,4.1e-05,5.3e-05,8e-05,4.4e-05,2.6e-05,4.8e-05,5.2e-05,2.3e-05,9.3e-05,6e-06,9.7e-05,6.5e-05,7.4e-05,0.000147,0.000114,4.7e-05,4.3e-05,3.9e-05,8.1e-05,8.2e-05,4.2e-05,9.5e-05,7.6e-05,9.1e-05,7.4e-05,4.3e-05,0.000126,0.000103,7.6e-05,7e-05,4.2e-05,7.2e-05,7.4e-05,2.2e-05,5.3e-05,5e-05,3.3e-05,6.3e-05,8.9e-05,5.7e-05,0.000103,7.1e-05,0.000142,6.4e-05,4e-05,4.7e-05,1.9e-05,6e-05,5.2e-05,6.1e-05,4.7e-05,6.9e-05,6.2e-05,6.1e-05,1.3e-05,6.4e-05,7.7e-05,6.8e-05,6.8e-05,4.1e-05,6.4e-05,9.7e-05,6e-05,2e-05,2.6e-05,5.1e-05,4.3e-05,3.2e-05,6.6e-05,4.4e-05,2.5e-05,4.8e-05,1.4e-05,5.2e-05,0.000112,0.000118,6.9e-05,7.2e-05,4.9e-05,2.1e-05,7.7e-05,7.2e-05,9.6e-05,5.7e-05,0.000103,0.000162,5.7e-05,0.000107,7.8e-05,3.5e-05,6.7e-05,7.8e-05,0.000104,0.000178,8.6e-05,7.7e-05,4.7e-05,0.000101,0.000108,0.000131,6.1e-05,0.000137,5.4e-05,9.3e-05,7.5e-05,7.2e-05,0.000124,1.8e-05,5.1e-05
1e-05,1.6e-05,1.4e-05,9e-06,1.5e-05,1.5e-05,1.4e-05,2.8e-05,9e-06,1.7e-05,4.5e-05,2.2e-05,3.8e-05,2.6e-05,7.6e-05,9e-05,1.9e-05,1e-05,7.8e-05,8.4e-05,8.7e-05,5.3e-05,5.5e-05,4.1e-05,7e-05,7.7e-05,5.8e-05,9.6e-05,7.4e-05,8.3e-05,0.000179,0.000115,0.000162,0.000165,0.000121,6.7e-05,4.6e-05,4e-05,0.00016,7e-06,0.000115,3.2e-05,5.1e-05,8e-05,5e-05,8.1e-05,8.3e-05,3.9e-05,8.8e-05,5.3e-05,0.000127,0.000122,0.000125,3.5e-05,9.5e-05,9e-06,1.7e-05,5.5e-05,6.7e-05,2.8e-05,7.6e-05,8.5e-05,6.9e-05,0.000117,4.8e-05,8.9e-05,5.4e-05,5.5e-05,7.7e-05,5.9e-05,6.8e-05,6.8e-05,9.9e-05,0.000118,0.000117,5.2e-05,6e-05,4e-05,6.4e-05,3.7e-05,7e-05,6e-05,5.4e-05,9.4e-05,2.5e-05,5.1e-05,9.8e-05,1e-04,0.000122,0.000143,0.000162,2e-04,0.000104,0.000114,3.3e-05,8.7e-05,7.9e-05,0.000153,5.1e-05,8e-05,9.1e-05,5.5e-05,6.3e-05,4.3e-05,8.5e-05,6.6e-05,8e-05,0.000117,8.6e-05,2.7e-05,3.7e-05,0.000153,0.000127,2.5e-05,2.8e-05,7.2e-05,9.3e-05,0.000121,0.000128,3e-05,2.9e-05
1.5e-05,2e-05,5e-06,3e-06,2e-05,1.8e-05,1.3e-05,3.1e-05,1.9e-05,2.2e-05,4.4e-05,3.8e-05,3.2e-05,6.3e-05,3.6e-05,7e-06,5.5e-05,2.3e-05,4.8e-05,5.4e-05,7.1e-05,3.3e-05,2e-05,2e-05,6.8e-05,0.000108,6.6e-05,8.8e-05,4.9e-05,3.1e-05,0.000156,3.8e-05,8.2e-05,8.5e-05,6.3e-05,1.6e-05,4.2e-05,4.5e-05,0.000137,2.1e-05,7.7e-05,1.5e-05,3.4e-05,6.9e-05,6.1e-05,4.2e-05,8e-06,3.5e-05,5.1e-05,1.7e-05,9e-05,3.9e-05,6e-05,5.3e-05,6.2e-05,2.4e-05,2.2e-05,3.8e-05,4.5e-05,2.6e-05,4.8e-05,2.6e-05,4.4e-05,8.3e-05,4.4e-05,6.8e-05,3.3e-05,3.5e-05,5.8e-05,2.2e-05,5.2e-05,9.9e-05,4.9e-05,6.5e-05,8.8e-05,1.8e-05,0.000102,6.8e-05,4.5e-05,1.4e-05,7.2e-05,4.7e-05,3.5e-05,7.9e-05,1e-05,2.2e-05,0.000116,5e-05,5.8e-05,7.6e-05,4.2e-05,0.000152,4.8e-05,9.7e-05,5.3e-05,6.3e-05,6e-05,9.2e-05,1.9e-05,8e-05,7.8e-05,1.7e-05,6.7e-05,6.4e-05,6.5e-05,2.7e-05,6.8e-05,5.9e-05,4.9e-05,1.4e-05,5.9e-05,0.000118,5.3e-05,0.000153,5.1e-05,3.8e-05,3.9e-05,1.4e-05,0.000107,4.8e-05,2.5e-05
7e-06,1.9e-05,1e-05,8e-06,1.6e-05,8e-06,1.4e-05,3.3e-05,1.5e-05,2e-05,2.2e-05,1.7e-05,1e-05,4.8e-05,2.6e-05,6e-05,2.3e-05,1.5e-05,4.5e-05,2.5e-05,2.9e-05,7.8e-05,4e-05,6.2e-05,3e-05,4.2e-05,4.4e-05,7.4e-05,2.3e-05,5.5e-05,0.00012,4.7e-05,3.9e-05,0.000116,4.7e-05,3.8e-05,3.7e-05,8.5e-05,9e-05,4.7e-05,7.8e-05,2.7e-05,5.8e-05,7.1e-05,3.5e-05,4.2e-05,2.9e-05,2.4e-05,1e-04,3.9e-05,7.1e-05,2.2e-05,4.7e-05,6.9e-05,8.2e-05,1.8e-05,2e-05,5.6e-05,7.8e-05,8.1e-05,4.3e-05,4.7e-05,2e-06,0.000104,7e-06,5.2e-05,3.4e-05,2.6e-05,6e-05,5.8e-05,3.3e-05,9.7e-05,7.3e-05,7.8e-05,8.8e-05,4.4e-05,7.4e-05,8.6e-05,3.3e-05,4.5e-05,7.5e-05,2.5e-05,3e-05,5.1e-05,2.9e-05,3.6e-05,0.000124,7.7e-05,2.3e-05,3.6e-05,2.4e-05,9.9e-05,7.3e-05,0.000135,3.3e-05,4.3e-05,6.8e-05,9.6e-05,1.8e-05,0.000115,6.7e-05,5.6e-05,3.2e-05,5.7e-05,5.4e-05,3.9e-05,7.7e-05,1e-04,7e-05,7.4e-05,0.000103,0.000143,5.7e-05,0.000173,8e-06,2.6e-05,5.4e-05,4.3e-05,0.000129,3e-06,1.9e-05
1.2e-05,7e-06,7e-06,5e-06,1.5e-05,1.3e-05,1.1e-05,1.3e-05,1.7e-05,2.6e-05,1.2e-05,1.3e-05,1.8e-05,5e-05,1.6e-05,4.5e-05,1.3e-05,2.1e-05,4.8e-05,2e-05,3.4e-05,1.3e-05,8.2e-05,1.4e-05,5.7e-05,6.1e-05,9e-06,5.1e-05,4.1e-05,4.3e-05,0.000143,4.3e-05,8e-05,8.6e-05,3.4e-05,3.4e-05,4.1e-05,4.7e-05,0.000139,4.3e-05,6.5e-05,1.6e-05,3.8e-05,3.4e-05,4.1e-05,3.6e-05,6e-05,6e-06,8.6e-05,1.9e-05,4.4e-05,1e-05,6.1e-05,2.6e-05,2.2e-05,4.4e-05,1.7e-05,6.6e-05,4.1e-05,6.4e-05,3.6e-05,2.4e-05,3.5e-05,1e-04,4.6e-05,4.9e-05,3.4e-05,2e-05,3.1e-05,5.4e-05,9.2e-05,6.1e-05,7.2e-05,0.000121,6.9e-05,3.5e-05,2.9e-05,3.5e-05,7e-05,1.5e-05,4.5e-05,3.4e-05,3.7e-05,0.000104,7.6e-05,4.8e-05,0.000108,8.4e-05,3.9e-05,8.4e-05,5.9e-05,9e-05,7.5e-05,0.000156,0.000109,4.3e-05,2.6e-05,0.000106,2.8e-05,0.000123,4.8e-05,2.4e-05,4.3e-05,3.9e-05,5.4e-05,5.9e-05,5.6e-05,7.1e-05,5.1e-05,4.6e-05,1.3e-05,7.2e-05,4.1e-05,0.000181,4.1e-05,0.000107,2.2e-05,2.6e-05,0.000124,8.6e-05,1.4e-05
1e-05,6e-06,4e-06,7e-06,1.3e-05,1.5e-05,3e-06,9e-06,2.3e-05,1.4e-05,1.6e-05,7e-06,2.6e-05,4.4e-05,1.2e-05,3.7e-05,1.5e-05,3.7e-05,8e-06,1.1e-05,7.4e-05,3.2e-05,5.9e-05,1.5e-05,3e-05,8.5e-05,5.5e-05,8.1e-05,3.6e-05,3.4e-05,0.00013,4.3e-05,6.5e-05,7e-05,3.7e-05,8e-06,3e-05,4.9e-05,0.000108,2.1e-05,5.7e-05,2.3e-05,3.3e-05,4.1e-05,4.8e-05,2.6e-05,1.7e-05,3e-05,6e-05,1.7e-05,5.3e-05,6e-06,8.9e-05,4.2e-05,7.1e-05,9e-06,2.2e-05,1.8e-05,6.9e-05,6.6e-05,1.4e-05,3e-05,1.8e-05,0.000105,3e-05,3.2e-05,3.6e-05,3.2e-05,2.6e-05,1.5e-05,5.9e-05,6e-05,6.6e-05,0.000121,7.5e-05,2.8e-05,6.3e-05,3.3e-05,2.3e-05,1.7e-05,5.5e-05,2.8e-05,1.3e-05,0.000109,5.5e-05,3.2e-05,7.1e-05,8.7e-05,6e-05,3.4e-05,5.3e-05,6.8e-05,6.2e-05,0.000114,8.1e-05,3.2e-05,5.4e-05,4.1e-05,6.8e-05,6.1e-05,2.6e-05,4.3e-05,5.5e-05,9.1e-05,6e-06,2.6e-05,7.1e-05,4.9e-05,2.3e-05,4.5e-05,3.6e-05,4.6e-05,4.2e-05,0.00012,6.3e-05,5.9e-05,1.3e-05,1.6e-05,7.5e-05,3.4e-05,6e-05
5e-06,1.2e-05,4e-06,2e-06,1.2e-05,1.6e-05,1e-06,1.7e-05,1.8e-05,2.1e-05,1.9e-05,7e-06,1.4e-05,4.7e-05,1e-05,4.7e-05,5e-06,2.5e-05,1e-05,1.6e-05,6.9e-05,5e-06,5.5e-05,8e-06,1.2e-05,5.3e-05,4.3e-05,5.7e-05,1e-05,3.1e-05,9.4e-05,3.5e-05,3.4e-05,6e-05,2.6e-05,5e-06,8e-06,3.8e-05,0.000109,4.2e-05,5.2e-05,9e-06,3.8e-05,5.1e-05,2.5e-05,9e-06,2e-06,1.2e-05,8.5e-05,9e-06,4.3e-05,1.1e-05,8.5e-05,2.2e-05,6.8e-05,1.6e-05,2.3e-05,1.8e-05,6.5e-05,7.9e-05,2.2e-05,2e-05,1.2e-05,8e-05,1.5e-05,4e-05,2.9e-05,2.2e-05,4.6e-05,2.3e-05,5e-05,6.8e-05,6.5e-05,0.000107,4.9e-05,1.2e-05,5.5e-05,4.5e-05,3e-06,1.3e-05,3.8e-05,2.2e-05,4.2e-05,8.7e-05,2.3e-05,3.8e-05,9.5e-05,5.9e-05,1.8e-05,6.4e-05,1.5e-05,8.1e-05,3.9e-05,0.000111,4.6e-05,1.7e-05,6.6e-05,7.5e-05,4.1e-05,7.3e-05,3.5e-05,2.3e-05,4e-05,6.6e-05,1.2e-05,2.5e-05,4.6e-05,4.6e-05,2.9e-05,3.3e-05,1.3e-05,2.7e-05,2.9e-05,0.000147,3.8e-05,8.3e-05,1.9e-05,1.5e-05,5.6e-05,2.6e-05,4.3e-05
1e-06,1e-05,4e-06,3e-06,1.3e-05,1.5e-05,2e-06,1.7e-05,2.2e-05,1.3e-05,1.8e-05,5e-06,8e-06,4.1e-05,6e-06,4.8e-05,1e-05,2.4e-05,1.5e-05,9e-06,6e-05,1.5e-05,5.3e-05,9e-06,1.6e-05,4.5e-05,4.7e-05,4.4e-05,7e-06,3.3e-05,1e-04,1.8e-05,2.3e-05,6.3e-05,2.6e-05,9e-06,1.8e-05,3.4e-05,0.00011,3.8e-05,5e-05,1.3e-05,2.9e-05,4.5e-05,3.2e-05,9e-06,1.3e-05,9e-06,8e-05,8e-06,2.7e-05,1.6e-05,6.4e-05,2.7e-05,6.2e-05,1.6e-05,7e-06,1.5e-05,4.6e-05,7.4e-05,2.1e-05,1.4e-05,8e-06,8e-05,2.3e-05,5.8e-05,1.5e-05,2.5e-05,5.7e-05,2.2e-05,5.2e-05,6e-05,6e-05,9.8e-05,5.7e-05,1.3e-05,5.9e-05,3.4e-05,1.5e-05,1.3e-05,4e-05,2.6e-05,3.9e-05,7.8e-05,2.9e-05,4.5e-05,8.2e-05,6.8e-05,1e-05,6.8e-05,9e-06,7.4e-05,3.8e-05,9.5e-05,5.9e-05,1e-05,4.9e-05,6.9e-05,2.9e-05,6.6e-05,3.3e-05,1.6e-05,5e-05,5.7e-05,2.6e-05,3.8e-05,4.6e-05,4e-05,3.4e-05,2.9e-05,2.7e-05,3.7e-05,3.7e-05,0.000144,3.5e-05,6.9e-05,8e-06,1.4e-05,6.1e-05,1.8e-05,3.7e-05
3e-06,9e-06,4e-06,1e-06,1.4e-05,1.5e-05,2e-06,1.3e-05,1.6e-05,1.2e-05,1.8e-05,7e-06,1.1e-05,3.7e-05,8e-06,4.5e-05,1e-05,2.6e-05,7e-06,2e-05,5.4e-05,5e-06,5e-05,8e-06,1.5e-05,6e-05,4e-05,4.8e-05,4e-06,2.4e-05,0.000108,3e-06,3e-05,6.5e-05,1.7e-05,1.7e-05,3e-06,3.2e-05,0.000105,3.3e-05,5.7e-05,8e-06,3.1e-05,4.5e-05,4.2e-05,1.5e-05,8e-06,8e-06,7.7e-05,4e-06,3.7e-05,1.1e-05,6.5e-05,2.9e-05,6.3e-05,1e-05,1.2e-05,1.5e-05,4.7e-05,7.1e-05,2.1e-05,5e-06,7e-06,7.4e-05,1e-05,5.3e-05,1.2e-05,2.4e-05,5.1e-05,2.7e-05,4.9e-05,6.8e-05,6.4e-05,8.5e-05,5.1e-05,2e-05,5.9e-05,4.1e-05,2.1e-05,1.8e-05,4e-05,2.2e-05,4e-05,7.8e-05,3.5e-05,3.6e-05,8.6e-05,6.7e-05,1.5e-05,6.2e-05,7e-06,7.5e-05,3.4e-05,8.8e-05,6.7e-05,1e-05,4.1e-05,6.6e-05,2.7e-05,6.7e-05,3.6e-05,2.1e-05,4.5e-05,5.5e-05,2.4e-05,3.9e-05,5.8e-05,3.8e-05,3e-05,3.3e-05,2.1e-05,3e-05,3.2e-05,0.000149,3e-05,6.1e-05,9e-06,1.3e-05,6.1e-05,8e-06,3.2e-05
