-0.020926,-0.013707,-0.01278,-0.018118,-0.017281,-0.010794,-0.010804,-0.013901,-0.018669,-0.016956,-0.015044,-0.013524,-0.012238,-0.014926,-0.017835,-0.009644,-0.017103,-0.012493,-0.009462,-0.008193,-0.013427,-0.010928,-0.016103,-0.009763,-0.012521,-0.012888,-0.015314,-0.017567,-0.023033,-0.019491,-0.015519,-0.018283,-0.011837,-0.017432,-0.009942,-0.014543,-0.010381,-0.019312,-0.017367,-0.017624,-0.011188,-0.005867,-0.006926,-0.01616,-0.019247,-0.012872,-0.011992,-0.012511,-0.013875,-0.023499,-0.021569,-0.023268,-0.013051,-0.015305,-0.003994,-0.015261,-0.021159,-0.012805,-0.01934,-0.018994,-0.020634,-0.020526,-0.017935,-0.029841,-0.028017,-0.028401,-0.015863,-0.021329,-0.015695,-0.01401,-0.01677,-0.016366,-0.016295,-0.013422,-0.005608,-0.013192,-0.011493,-0.00927,-0.014552,-0.016325,-0.017863,-0.028074,-0.01653,-0.009513,-0.011038,-0.015372,-0.008697,-0.009936,-0.004856,-0.01356,-0.008879,-0.01257,-0.012219,-0.01416,-0.009294,-0.011601,-0.008139,-0.017171,-0.011839,-0.011464,-0.008393,-0.011996,-0.012818,-0.005089,-0.007047,-0.017101,-0.018219,-0.01324,-0.014547,-0.006025,-0.007954,-0.01304,-0.007371,-0.013048,-0.012675,-0.011241,-0.012711,-0.008394,-0.009027,-0.015947,-0.009552
0.007605,0.001776,0.003883,0.011057,0.006168,0.001983,0.005013,0.000888,0.006178,0.005622,0.000157,0.005605,0.006149,0.005449,0.007736,0.002983,0.007641,0.004885,0.000423,-0.000775,0.001375,0.00338,0.001247,-0.002568,0.001235,0.003252,0.004824,0.004469,0.007844,0.006618,0.009894,0.009563,0.006266,0.011252,0.003068,0.003436,0.00347,0.001593,0.007136,0.006931,0.000524,0.001033,0.002451,0.006034,0.006914,0.005196,0.000755,0.001145,-0.001605,0.003106,0.010896,0.008929,0.003304,0.006164,-0.001146,-0.000247,0.009137,0.005018,0.009585,0.007764,0.012466,0.007324,0.005266,0.014508,0.009069,0.013389,0.006465,0.004913,0.003536,-0.00064,-0.001716,0.002344,0.00803,0.004858,-0.007126,-0.002848,-0.000766,0.000558,-0.001394,0.001737,0.005975,0.010977,0.00585,0.000988,0.00132,0.003258,0.001936,-0.000397,-0.005958,-0.001035,-0.002775,0.002669,0.00633,0.002774,0.003811,0.001604,-0.000723,0.00803,0.000708,0.003741,0.002255,0.003718,0.00268,0.00174,-0.000359,0.009312,0.005675,0.005872,0.000717,0.000937,0.001038,-0.005155,-0.004698,-0.000676,0.00127,0.000902,0.003796,0.002529,0.001448,0.007452,-0.000247
-0.001375,-0.000282,-0.000276,-0.010582,-0.001792,-0.001856,-0.003582,0.000911,-0.004407,-0.002569,0.004213,-0.006576,-0.005308,-0.001797,-0.00496,-0.000761,-0.002652,-0.000351,0.000632,-0.000491,-0.002454,-0.003096,0.002882,0.008394,0.005683,0.00016,-0.001936,-0.002527,-0.001608,-0.003306,-0.004648,-0.003881,-0.007101,-0.007092,-0.002719,0.001234,-0.002218,-0.001769,-0.008632,-0.007896,-0.002389,0.002069,-0.001905,-0.003815,-0.001208,-0.004116,0.001745,-1e-04,-0.000202,-0.000605,-0.006422,-0.000351,0.001902,-0.00536,0.002388,0.003787,-0.007633,-0.007076,-0.005764,-0.005975,-0.005778,-0.005864,-0.009952,-0.01223,-0.002681,-0.005635,-0.001736,-0.000747,-0.005178,0.004776,0.001811,-0.001926,-0.001237,-0.001079,0.001645,0.002548,-0.002498,0.001644,0.002673,0.003261,-0.001264,-0.001159,-0.004976,-0.00027,-0.001159,-0.004053,-0.006346,-0.004698,0.005479,0.002624,0.002433,0.005085,-0.003359,-0.002591,-0.001463,-0.00012,0.003347,-0.004624,0.001964,0.001078,-0.002068,-0.005688,-2e-04,-0.000436,-0.001021,-0.007072,-0.002407,-0.004368,0.002081,0.000432,-0.003588,0.001533,0.003641,0.002127,0.00077,-0.000471,0.000167,-0.000671,0.001049,-0.002676,0.00098
0.00321,0.001948,-0.002646,0.001984,0.00066,0.001713,0.001457,-0.000163,0.005033,0.001372,0.000167,0.004467,0.004088,7e-05,0.004504,0.002955,-0.000537,7e-06,0.000715,0.000799,0.005095,0.001057,-0.000865,-0.007775,-0.006507,8.8e-05,-0.002364,0.000329,0.000493,0.003625,0.000356,0.00109,0.00428,0.004994,0.004503,-0.002765,0.00099,0.003158,0.006826,0.00733,0.006086,0.001485,0.001428,0.00662,0.002574,0.001717,-0.000548,-0.000239,0.001741,0.002107,0.007338,0.000248,-0.001821,0.00402,-0.002941,-0.00595,0.002723,0.004164,0.007369,0.003161,0.003524,0.006925,0.00719,0.010048,-0.000831,0.00617,0.00722,0.005594,0.005919,-0.004726,0.003335,0.007083,-0.000725,-0.00029,-0.001777,0.001519,0.003899,-0.001775,-0.000607,-0.00231,7.6e-05,-0.00256,0.00142,0.003221,-0.000274,0.004779,0.008166,0.00946,0.001016,0.002752,-0.001061,-0.006527,0.001814,-0.000628,0.001007,-8.2e-05,-0.002781,0.001257,-0.00446,-0.000321,0.000491,0.005176,-0.000957,-0.00149,-0.004251,0.001208,0.003423,0.004701,-0.003241,0.000106,0.005276,0.00281,0.004396,0.004829,0.001406,-0.000695,0.001194,-0.001305,4e-05,0.001413,0.000414
-0.00648,-0.004615,0.002881,-0.000946,-0.000212,5.2e-05,-0.001453,-0.000225,-0.005067,0.002163,0.00088,-0.002925,-0.003051,0.003731,-0.002017,-0.002704,0.000379,-0.003418,-0.002151,-0.001107,-0.005644,-0.001936,-0.001736,0.005539,0.001461,-7.1e-05,0.00406,0.001324,-0.000969,-0.001156,0.000633,-0.000431,-0.000705,-0.003472,-0.004706,0.000303,0.003363,-0.001267,-0.006377,-0.006029,-0.004985,-0.005243,-0.000617,-0.005804,-0.002739,0.000446,-0.000552,0.000888,-0.000887,0.000524,-0.005152,-0.000853,0.001858,-0.000504,0.000448,0.002749,-0.000688,-0.003509,0.000354,-0.004203,-0.000826,-0.005353,-0.003863,-0.005662,-0.002051,-0.00776,-0.009013,-0.008819,-0.005065,0.002295,-0.004518,-0.006801,-0.004557,-0.002004,-0.0024,-0.005291,-0.00499,-0.002312,-0.003099,-0.001312,-0.002023,-0.000543,-0.001574,-0.000466,0.00192,-0.003027,-0.006844,-0.005941,-0.005749,-0.006326,-0.001801,0.001649,-0.001926,0.003888,0.000472,0.001619,0.002228,0.000612,0.002254,-0.000765,0.000694,-0.003039,-0.001867,0.000101,0.00508,0.002682,-0.002304,-0.005354,-0.001369,-0.001135,-0.003462,-0.004689,-0.005615,-0.007804,-0.003345,0.001185,-0.002408,0.000526,0.000391,-0.002337,-0.001261
0.005703,0.00798,-0.003174,0.000614,-0.003371,-0.002849,-0.000797,-0.001137,9.7e-05,-0.003048,-0.002492,0.002476,0.003134,-0.002615,-0.001835,0.00158,-0.001147,0.004179,0.003441,0.000766,0.002507,0.000649,0.000162,-0.002309,9.4e-05,-0.000784,-0.003541,-0.002015,0.001128,-4.7e-05,0.000182,-0.000842,0.001939,0.002211,0.004014,0.001312,-0.005135,-6.5e-05,0.006697,0.004552,0.002373,0.0034,0.001897,0.000243,0.000169,-0.000366,0.00118,0.00031,0.000589,-0.000866,0.001416,0.001217,-0.00117,-0.002723,6.2e-05,0.001083,-0.00134,0.002022,-0.002849,0.001141,0.00162,-0.000166,0.001609,0.001455,-0.001389,0.005779,0.003072,0.003482,0.003974,0.00148,0.003688,0.001983,0.002948,0.001078,0.000827,0.004239,0.003502,0.001414,0.001432,0.000951,0.001852,0.000506,-0.001653,-0.003225,-0.002773,-0.000736,0.004651,0.002059,0.001539,0.004065,0.002219,0.001771,0.001194,-0.003173,-0.004424,-0.000478,-0.00125,-0.002898,-0.001697,2.7e-05,0.000952,0.001686,0.000428,0.001797,-0.000731,-0.005377,0.000906,0.003649,0.001608,0.000495,0.001488,0.001754,-0.000564,0.004109,0.002304,-0.000202,-0.001172,2e-06,0.000788,0.001587,-0.002285
-0.002902,-0.00445,0.001772,0.001476,0.004736,0.005965,0.003048,0.001244,0.001049,0.001162,0.000942,-9.4e-05,-0.003172,-0.001228,0.000848,-0.00083,0.002105,-0.003069,-0.003725,-0.00254,-0.001178,-0.000755,-0.000638,0.001501,0.000252,-0.001333,0.002608,0.001137,-0.000689,0.001505,-0.000179,0.001785,-0.001176,-0.001528,-0.003204,-0.001103,0.002184,-0.000696,-0.0023,-0.001013,0.000169,-0.000919,-0.001902,0.000972,0.000719,0.00018,0.000429,-0.001774,-0.00261,-0.006775,-0.001072,-0.001572,0.003423,0.000859,0.000406,-0.000321,-0.001042,0.000705,0.001541,-0.001469,-0.000803,-0.001654,-0.001674,0.003162,0.00214,0.002621,0.000342,0.001997,-0.00205,-0.001378,-0.001144,0.001976,-0.000488,-0.00038,-0.000751,0.001279,-0.000331,-0.001041,-0.001074,0.003564,0.000529,0.000502,0.005492,0.002919,-0.000353,0.000701,-0.001046,-0.001528,0.000336,-0.000146,-0.002591,-0.002067,0.00061,0.002844,0.002695,-0.000586,-0.000261,0.0024,0.004403,-0.000269,-0.001402,-0.001577,0.001302,-0.002465,-0.001493,0.003651,-0.000259,-0.002166,0.001063,-0.000223,-0.000727,-0.000198,0.003343,0.000468,-0.001748,0.001066,0.001312,-0.000668,-0.001709,-0.001154,0.001627
-0.001016,0.003706,-0.000963,-0.001658,-0.004284,-0.004683,-0.002271,-0.002107,-0.001328,0.000223,0.000359,-0.00158,0.004665,-0.000829,0.000186,0.001417,-0.000744,0.00149,0.001742,0.000622,0.002311,0.001569,0.001228,0.000501,-0.000845,0.002004,-0.001336,-0.000251,0.000159,0.000319,0.001167,-0.001297,0.002028,0.002282,0.002969,0.000515,-0.000302,0.002659,0.000626,-0.000967,-0.000104,-0.001524,0.00142,0.000123,-7e-04,-0.000442,0.000261,0.001788,0.001375,0.005937,-0.000412,-8e-06,-0.002136,-0.000648,-0.001388,0.000472,0.0011,-0.000697,0.002238,0.001202,0.002316,0.003345,0.000408,-0.002644,-0.002796,-0.006038,-0.00175,0.000209,-5e-04,-0.000705,-0.001407,-0.000897,0.00041,-0.001462,0.00046,-0.002251,-0.003195,0.00039,0.000815,-0.002923,-0.003037,0.000201,-0.00377,-0.000881,-0.000284,0.000693,0.001315,0.002981,0.000178,-0.002919,-0.000499,-0.000772,-0.001827,-0.001861,-0.000324,-0.00034,-0.000698,-0.002195,-0.004104,-0.001059,0.000731,0.004053,-0.000436,0.000909,0.000761,-0.000393,-0.001385,0.001765,-0.003474,0.000129,0.00136,0.00166,-0.002071,-0.00189,0.001568,9.6e-05,-0.000782,-0.001994,-0.001007,-0.000223,-0.002495
0.001148,-0.002919,0.000407,0.000343,0.002117,0.00111,0.001256,0.002979,0.000766,-0.000449,-0.000825,0.003297,-0.002477,0.002234,0.000544,-0.002526,-0.000202,-0.000736,-0.000542,0.002131,-0.001027,-0.003146,-0.00263,-0.000318,-0.000675,-0.002591,0.00147,0.00073,0.000566,-0.002825,-0.000991,0.000909,-0.003335,-0.001868,-0.003826,-0.001709,0.000478,-0.003204,-0.000506,-0.000411,-0.000363,0.000925,-8.4e-05,0.000558,-0.000121,0.000212,-0.002157,-0.000991,0.000771,-0.001951,0.000573,-0.001401,-0.000434,-0.000176,0.001979,-0.000979,0.000422,0.000564,-0.003453,-0.001656,-0.001839,-0.003393,-0.000526,0.001874,0.003724,0.004329,0.000659,-0.001679,-6.8e-05,0.000748,0.002963,-0.00176,-0.001004,2e-05,0.000678,-0.001807,0.001748,0.000916,0.002191,0.001543,0.00134,0.000289,0.001213,0.000803,0.000631,0.001029,-0.001526,-0.002858,-0.002001,0.000979,0.001256,0.001003,0.001006,0.000189,-0.000791,-0.0012,0.000549,0.001845,0.002576,0.001482,-0.001867,-0.002642,9e-06,-0.000582,-0.000989,0.001239,0.000365,-0.002403,0.001893,0.002271,-0.002378,-0.002173,-0.001072,0.001385,-0.000348,-0.000298,0.000102,0.002031,0.001466,0.000355,0.003193
-0.001067,0.001715,-6.1e-05,-0.000314,-0.003132,-0.000751,-0.000996,-0.001925,-0.000365,-0.001368,0.000741,-0.000955,0.001127,-0.001038,-0.000802,0.000928,0.000299,0.000419,0.000278,-0.002454,-0.00058,0.003427,0.001159,-0.000888,-0.000362,0.003541,-0.001419,0.000168,-0.001487,0.003192,0.000156,0.000373,0.001912,0.000339,0.001159,0.000512,-0.000782,0.000887,0.000709,0.000291,0.00127,0.000755,-0.001287,-0.000904,0.000109,6.2e-05,0.001433,0.000224,-0.000314,0.000401,-0.000719,-0.000273,0.000222,0.000237,-0.002543,7e-04,-0.00063,2e-05,0.001943,0.002601,0.000656,0.001835,0.000904,-0.000645,-0.003514,-0.002396,0.001078,0.00174,0.00218,-0.000698,-0.004575,0.000473,0.001771,0.000585,-6.2e-05,-0.00022,8.4e-05,3.5e-05,-0.002604,0.000175,0.000205,-0.000478,5.3e-05,4e-04,0.000607,-0.000614,0.000414,0.000832,0.001853,0.000821,-0.001095,0.000151,-0.000247,0.001209,0.001213,0.001536,0.001043,-0.00071,-0.001336,-0.000803,0.001933,1.7e-05,-1.8e-05,0.000151,0.000854,-0.00112,-0.000331,0.001661,0.000885,-0.002511,0.001227,0.000704,0.001488,-3e-06,-0.000543,-0.000104,-0.000938,-0.000448,-0.001866,-0.000609,-0.002091
0.000996,-0.002129,0.002247,5.1e-05,0.002036,0.000726,0.00028,0.001147,0.000493,0.000689,0.000564,1.2e-05,-0.002076,0.000719,0.000269,0.000257,6.6e-05,0.000195,-5.1e-05,0.002303,0.00059,-0.001452,-0.001217,0.001739,0.001302,-0.00154,-0.000661,-0.001133,0.00149,-0.00163,-0.000677,-0.00195,-0.002112,0.000453,0.000168,-0.000271,0.001556,0.000448,-0.00068,-0.00101,-0.002268,-0.001549,0.001018,2e-05,-0.000752,-0.000662,-0.002696,7.2e-05,0.000321,2.2e-05,-0.0011,-0.000638,0.000524,-0.00036,-8e-06,-0.00078,0.001941,5.5e-05,-0.001065,-0.001924,0.000164,0.000438,-0.001945,-0.000255,0.000237,0.000246,-0.002891,-0.000918,-0.001413,0.000291,0.004438,4.5e-05,-0.001404,0.000553,0.001309,0.001147,-0.002452,-0.00037,0.002389,-0.000494,-0.00039,0.000554,0.00092,-0.000231,-0.001611,0.000481,0.000222,0.00044,0.000399,-0.000507,9e-06,-0.000149,0.000392,-0.001071,0.000436,-0.000388,-0.000589,0.000127,0.000418,0.00067,-0.000844,0.000563,0.000928,-0.00095,-0.000249,-0.000927,-0.00019,-0.000799,-0.000941,0.000702,-0.000351,0.000569,-0.001783,5.1e-05,-0.000481,-0.000717,0.001066,-0.000416,0.001706,-0.000148,0.001567
0.000329,0.00199,-0.002161,-0.000335,-0.000867,4.6e-05,-0.000213,-0.000671,2.1e-05,0.000109,-0.000711,0.000631,0.000832,-0.001132,0.000292,0.00028,-0.000197,-0.000583,8.5e-05,-0.000956,-0.000676,-0.000738,0.001091,-0.001141,-0.000449,6.2e-05,0.000329,0.001356,-0.000837,0.000192,0.000224,0.001622,0.001407,-0.000783,-0.000413,-0.000228,-0.001115,3.5e-05,-0.000268,0.001371,0.001211,0.001856,-0.000487,0.000768,0.000643,0.000591,0.003537,0.000907,-0.000748,0.000255,0.002209,0.00226,-0.001338,-0.000419,0.000996,0.00139,-0.001942,-0.000126,-0.000933,0.001624,-0.000577,-0.000808,0.000888,0.000664,0.001142,-0.001007,-0.000442,0.000366,-0.000685,0.000775,-0.002191,-0.000473,0.001072,0.000138,-0.001196,-0.001552,0.000737,-4.5e-05,-0.000752,0.000466,0.000194,0.000107,-0.001144,-0.002104,0.00084,-0.000171,-0.000385,-0.001158,-0.000601,-8.6e-05,0.001199,-0.000742,-0.001233,6.8e-05,5e-06,6.7e-05,0.000108,0.000348,6.5e-05,0.000349,0.000166,-0.000127,-0.001148,0.001263,-0.000807,0.001088,-0.000645,0.000472,3.7e-05,6.3e-05,-0.00056,-0.000567,0.001469,-0.000985,0.001196,0.00053,9e-05,0.000331,-0.001028,-8.3e-05,-0.001347
-0.001094,-0.001249,0.001918,-5.7e-05,0.000629,-0.000647,8.9e-05,-0.000679,0.000197,-0.000538,0.000102,-0.000895,0.000741,0.001032,-9.3e-05,-2.9e-05,5.3e-05,0.000345,0.000487,4.4e-05,0.000323,0.001136,8.2e-05,-2.9e-05,0.000386,0.000229,0.000834,-0.000923,-0.000638,-0.00059,-0.000698,-0.001315,-0.001442,0.000491,0.000438,0.000347,0.000441,-0.000243,0.001196,-0.000302,-0.000176,-0.001375,-0.000378,-0.000217,-6e-06,-5e-04,-0.00285,-8.8e-05,-0.000332,-0.000663,-0.00143,-0.001654,0.000662,8e-04,-0.000477,-0.00107,0.000632,-9.1e-05,0.001573,0.000832,-0.000287,0.001214,-0.00096,-0.000583,8.8e-05,-0.000742,0.001394,-0.000283,7.5e-05,-0.000623,0.001754,0.001247,0.000142,-2.7e-05,0.001459,0.000583,0.000566,0.000237,-0.000312,-0.001332,-7.4e-05,0.000176,0.000123,0.002221,-0.000217,0.000453,-0.000437,0.000396,1.7e-05,-0.000243,-0.001262,0.00071,0.000287,0.000337,-0.000983,5.7e-05,-0.000562,-0.000605,-0.000453,-0.000176,0.00062,-9e-05,0.000184,0.000158,0.000582,0.000738,0.000571,0.000388,0.000196,0.000542,0.000799,-0.000183,-0.001001,0.000516,-0.000613,0.000416,-0.000376,0.000391,0.000507,0.000251,0.00112
0.000983,-0.000656,-0.00102,-0.00021,-0.000448,-0.000366,7.2e-05,-0.000246,-0.000816,0.000411,-0.000319,0.000337,-0.002026,-0.001618,-0.000134,-0.00023,-0.000115,0.000183,-0.000545,0.00075,-0.000274,-0.000534,-0.000586,-0.000841,0.000149,-0.000253,-0.001302,-0.00034,0.001077,0.000775,0.001022,0.001049,0.001374,0.000421,6.5e-05,-0.000233,4e-06,-0.000349,-0.000845,0.000287,0.000264,0.000948,-0.000232,2.9e-05,-0.000472,7.7e-05,0.001346,-0.000548,0.000336,0.00011,0.000366,0.000799,-0.000661,-0.000459,0.000506,0.000924,-0.000694,-0.000503,0.00016,-0.000208,-0.000516,0.000501,0.000682,-0.000323,-0.000424,0.000855,-0.000232,0.00043,-0.000198,-0.000209,-0.001201,-0.001423,-0.000854,-0.000337,-0.000124,0.000165,0.000702,4.7e-05,0.000243,0.000392,3.8e-05,-0.000298,0.000204,-0.001424,-0.000592,-0.000307,-0.000668,0.000146,0.000355,0.000894,0.000415,6.8e-05,0.00078,-0.00035,0.000371,0.000298,-9.8e-05,-0.000583,0.000602,-0.000328,-0.000454,-0.000182,7e-05,-0.000409,0.000264,-0.000659,8.5e-05,-0.000594,-0.00017,-0.001251,-0.001489,0.000598,0.000702,0.00018,-0.000243,-0.000488,0.00037,0.000117,-0.000268,-0.000105,-0.000608
-0.000775,0.000556,0.000146,4e-04,0.000215,0.000278,0.000265,0.000681,1e-04,-4.2e-05,0.000317,-0.000229,0.001345,0.000835,0.000197,0.000431,-8.2e-05,-0.000615,-5.8e-05,-0.000408,0.000418,-0.000185,0.000145,0.000205,-0.000304,0.000429,0.00113,0.000925,-0.000613,-0.000867,-0.000949,-0.000625,-0.000486,-0.001053,0.000118,0.000317,-0.00034,0.00045,1.6e-05,4.6e-05,0.000298,-0.001013,0.001025,2.6e-05,0.000152,3.5e-05,0.000155,0.000148,0.000149,0.000639,0.000171,-0.001237,9.2e-05,0.000208,-0.000381,-0.000827,0.000502,0.000407,-0.000596,-0.000172,4.4e-05,-0.000129,-0.000784,0.000798,-0.000263,0.000682,0.000424,-0.000556,-0.00063,0.000766,0.00025,0.001082,0.000458,0.000202,-0.000375,0.00059,-0.000298,0.000139,-0.000107,0.000582,-0.000127,9e-05,9.6e-05,0.00064,0.000637,-0.000801,0.000556,-0.000252,-0.000295,-0.000784,0.000576,0.000175,-0.00089,-0.00013,-1.6e-05,0.000172,0.000266,0.000815,-9.2e-05,0.000109,0.000394,0.000233,0.000217,3.4e-05,-0.000265,0.000461,0.000251,0.000795,0.000532,0.000715,0.000966,-0.000648,-0.000129,-0.000448,1e-04,0.000158,-0.000649,-0.000143,0.000393,7.1e-05,0.000597
9.7e-05,-9.8e-05,-0.00037,0.000211,-0.000594,2.2e-05,-0.000385,-6.3e-05,0.00018,-7.9e-05,-0.000696,-7e-05,-0.000443,-0.000628,-7.1e-05,-0.000291,0.000131,0.000185,0.000147,-0.000103,-0.000562,0.000104,0.000252,-0.000319,0.000247,-0.000225,-0.000365,-0.000495,0.000462,0.000545,0.000388,4.4e-05,-0.000138,0.000752,-0.000559,-7.3e-05,0.000246,-0.000204,0,0.000113,-0.000252,0.000373,-0.001069,-0.000169,0.000294,5e-06,-0.000176,-0.000616,0.000163,-0.000928,-0.000521,0.000915,-0.000227,-0.000211,0.000504,0.000507,2.3e-05,-8.2e-05,0.000694,0.000266,0.000268,0.000261,0.001402,-0.00057,-6.7e-05,-0.000768,-0.000258,-0.000129,-0.000143,-0.000373,0.000171,-0.00021,-3e-05,-0.000459,0.00028,4e-06,-0.000278,-2.9e-05,0.000139,-0.000448,0.00011,-0.000256,-3.7e-05,5.9e-05,0.000116,0.000301,-0.000389,0.000206,9.1e-05,-0.000113,-0.000287,-0.000595,0.000485,0.000727,0.00018,-0.000665,-5.2e-05,-4.4e-05,9.5e-05,1.8e-05,-0.000433,-0.000444,-0.000308,5.6e-05,0.000254,-0.000368,-0.000199,-0.000505,-0.000428,-8.1e-05,-0.000117,0.000459,-0.000287,0.00024,0.000545,0.000248,0.000634,-0.000246,8e-06,1e-05,-0.000276
0.000131,0.000387,0.00075,-8.2e-05,0.000749,0.000151,0.000184,-0.00021,0.000193,0.000166,0.000367,0.000242,-3e-05,0.000891,6.2e-05,9.5e-05,-6e-06,0.000275,-0.000205,8.9e-05,0.000388,-6.1e-05,-0.000257,0.000479,0.000241,-0.000178,-0.00016,0.000339,-0.000207,-0.000189,0.000188,0.000316,0.000498,-0.000274,1e-04,0.000209,0.000109,5.8e-05,9e-06,-9.7e-05,0,0.000138,0.00086,0.000214,-0.000214,-6.2e-05,-0.000217,0.00046,0.000109,0.000369,0.000647,-0.000736,0.00069,5.4e-05,-0.000209,-0.000239,-0.000116,-6.2e-05,-0.00047,8e-06,-0.000429,0.000162,-0.001402,-6.9e-05,0.000385,0.000402,0.000248,0.000277,0.000591,-0.000283,-0.000388,-0.000503,-0.000156,0.000158,-0.000288,-1.1e-05,0.000634,0.000101,-0.000302,0.00023,-0.000217,-2.6e-05,0.000494,-1.7e-05,-9.8e-05,-0.00016,0.000282,-5.5e-05,-0.00039,0.000377,-0.000349,0.000732,-0.000179,-0.000841,-0.000131,-0.000107,5.1e-05,-8.4e-05,-9.7e-05,-4.5e-05,-1.4e-05,0.000199,-0.00016,9.4e-05,0.000119,-0.000196,-7.6e-05,0.000509,0.000302,-0.000286,-6.9e-05,-0.000146,0.000353,-0.000563,-0.00052,5e-06,-0.000153,0.000304,-0.000319,-1.4e-05,0.000271
-0.000306,-0.00038,-0.000669,7.7e-05,-0.000665,-6.1e-05,6.1e-05,4e-05,0.000186,6.4e-05,-0.000216,-0.000451,0.000239,-0.000369,-7.7e-05,-0.000284,5.4e-05,-0.000246,0.000154,-5e-06,-0.000138,0.000141,6.1e-05,-0.000298,-0.000275,-3.2e-05,0.000179,-0.000271,-0.000123,0.000388,-1.8e-05,-0.000394,-0.000449,-0.000138,4.8e-05,-0.000136,-2.3e-05,-9e-05,0.000398,-0.000216,-0.000337,-9.9e-05,-0.000423,1.2e-05,8.6e-05,3.2e-05,0.000154,-0.000222,0.000116,0.000172,-0.000379,0.000839,-0.000676,1.3e-05,0.000109,0.000205,0.00028,7.8e-05,0.000167,7.2e-05,0.000323,3.9e-05,0.001242,0.000208,4.6e-05,-7.2e-05,0.000104,-0.000533,-8.8e-05,-5e-06,0.000594,0.00044,0.000182,7.6e-05,0.000128,-0.000143,-0.000224,0.00012,0.000277,2e-06,8.7e-05,0.000373,-0.000607,-8.8e-05,-0.000297,-3.1e-05,-0.000107,-9.2e-05,0.000257,-0.000199,0.000292,-0.000432,7.1e-05,0.000431,-3.8e-05,0.000367,-0.000104,-8.6e-05,-9.8e-05,0.000204,8e-05,6e-06,0.000104,-0.000408,-0.000184,0.000503,-6.5e-05,-0.00038,0.000132,0.000143,0.000111,1.7e-05,-0.000522,0.000716,-6.6e-05,-0.000208,-4e-06,-1.2e-05,0.000173,5.2e-05,-0.00026
0.000719,0.000604,0.000315,0.000119,0.00042,-0.000132,3.7e-05,-0.000311,-0.000218,-0.000292,0.000415,0.000166,2.7e-05,0.000174,0.000103,0.000213,-0.000109,0.000169,-0.000134,-1.1e-05,3e-06,-5.8e-05,-0.000241,5.9e-05,7.4e-05,0.000123,0.000218,0.000101,0.000346,-0.000355,-0.000309,0.000494,0.000239,3.9e-05,-0.000152,-8.3e-05,-6.3e-05,-7.2e-05,-0.00054,0.00017,0.000264,3e-05,0.000258,-4e-05,-3.4e-05,1.6e-05,-0.000104,0.000222,-8.4e-05,-0.000131,0.000147,-0.00085,0.00067,-7.2e-05,2.3e-05,-0.000165,-0.000449,-1.3e-05,1.9e-05,0.000283,-0.000122,0.000104,-0.000799,-0.000274,-0.000133,0.000419,-0.000244,9.5e-05,-4.5e-05,0.000198,-4e-04,-0.000219,-0.000285,7e-05,6.8e-05,0.000179,7.4e-05,-0.000166,-0.000357,5.8e-05,6.2e-05,-0.000222,0.000296,0.000139,0.000296,5.3e-05,0,0.000214,-0.000158,0.000232,4e-05,9.1e-05,3.8e-05,-8.6e-05,-0.000129,-0.000236,5.7e-05,8.3e-05,3.1e-05,-0.000153,-6e-06,-5.5e-05,0.000129,0.000141,-1.5e-05,-0.000109,-8.2e-05,0.000165,-0.000157,9.5e-05,-3.8e-05,1.1e-05,0.000511,-0.000313,0.000329,0.000168,-7e-06,-0.000204,7.6e-05,-4.1e-05,0.000158
-0.000496,-0.00032,-0.000188,-9.2e-05,-0.000419,0.000135,-8.9e-05,6.9e-05,-0.000124,3.5e-05,-0.000441,0.000135,-0.000111,-0.000283,2.4e-05,1.3e-05,8.2e-05,-0.000146,-5e-06,-0.000163,0.000184,-2.7e-05,0.000167,0.00013,2.1e-05,-0.000333,-0.000411,8.6e-05,-0.000333,0.000213,0.000434,-0.000375,-0.000245,2.4e-05,0.000113,4.1e-05,0.000115,9.2e-05,0.000245,-5.6e-05,-0.000224,8.3e-05,-0.000281,-7.6e-05,2.4e-05,5e-06,0.000169,-6.7e-05,-0.000164,4e-05,2.1e-05,8e-04,-0.000436,0.000111,3.1e-05,3.8e-05,0.000144,7.6e-05,-0.000276,-0.000143,0.000173,-1.6e-05,0.000678,0.000312,-7.9e-05,-3.8e-05,3.2e-05,6.9e-05,3.1e-05,-0.000151,0.000101,-1.3e-05,0.000255,-7.8e-05,-2e-05,-9.6e-05,5.4e-05,-6e-06,0.000116,0.00018,-3.4e-05,-0.000184,0.000188,-6.3e-05,-0.000257,-0.000168,0.000249,1e-06,0.000207,-0.000283,-0.000322,-0.000147,-6.3e-05,5.2e-05,0.000187,0.000146,-3.4e-05,-5.2e-05,8.2e-05,1.2e-05,6e-06,0.000117,-2.5e-05,0.000142,9e-05,-0.000129,0.000164,-4.3e-05,0.00016,-0.000109,6.2e-05,5.2e-05,-0.000241,6.2e-05,-0.000102,-0.00022,-3e-06,0.000182,-7.7e-05,-2.2e-05,-0.000258
2e-05,0.000118,9e-05,5.6e-05,0.000377,-0.000116,1.5e-05,0.000141,0.000202,0.000143,0.000273,-0.000213,5.9e-05,0.000247,3.1e-05,3.1e-05,-3.9e-05,8.5e-05,0.000142,0.000281,-0.000192,3e-05,-8.9e-05,6.8e-05,1e-06,0.000379,0.000346,-0.000226,0.000196,-1.3e-05,-0.000239,0.000204,0.000269,7.1e-05,-5e-06,-2.9e-05,-0.000287,5.3e-05,2.6e-05,-9.7e-05,0.000136,-0.000144,0.000209,-6.4e-05,-4e-06,2e-06,-8.4e-05,3.7e-05,8.3e-05,0.00012,-0.00036,-0.000575,0.000248,-0.000185,-6e-05,7e-05,-0.000137,-1.5e-05,-0.00015,0.000285,3.9e-05,0.000153,-0.000499,-6.9e-05,-0.000253,-0.000444,0.000122,-2.8e-05,0.000101,-5.2e-05,0.000227,0.000169,-9e-05,0.000192,-4.8e-05,-0.000272,-0.000246,5e-05,4e-05,-0.00028,-2.7e-05,1.1e-05,-0.000154,2.4e-05,0.00011,-1.4e-05,-0.000165,-0.000114,-0.000389,0.000125,0.000109,0.000381,0.000131,-2.7e-05,-2.1e-05,-3.5e-05,-1.7e-05,1.4e-05,-0.000171,-5.9e-05,2e-05,-7.3e-05,-0.000129,-0.000151,-0.000115,2e-05,-7.3e-05,-4.4e-05,-0.000127,-5e-05,-4.2e-05,-6.6e-05,-2.2e-05,8.5e-05,-0.000123,0.000199,-5e-05,5.6e-05,5.6e-05,-1.2e-05,0.00028
0.000199,-0.000112,-0.00015,2.3e-05,-0.000248,-0.000101,2.5e-05,4.8e-05,-9e-06,-8.4e-05,-0.000138,0.00013,-1.3e-05,-0.000263,-9e-06,2e-06,0.000122,4.4e-05,-0.000152,-0.00027,0.000133,-3.4e-05,6.7e-05,-5.2e-05,9e-05,-0.000154,-6.8e-05,0.000228,-0.000112,-8.9e-05,-4.5e-05,-0.000151,-0.000455,-3.4e-05,2.2e-05,7.6e-05,0.000243,-0.000148,3e-06,7.6e-05,9e-06,0.000129,-0.000113,7.3e-05,1.3e-05,1e-05,-0.000203,-0.000118,3.2e-05,-0.000152,0.000567,0.000499,-0.000173,6e-06,2e-05,-6.1e-05,0.000163,-6.7e-05,0.000357,-0.000289,-9.1e-05,-0.000186,0.00033,-0.000123,0.000427,8.2e-05,-0.000139,-1.2e-05,-8.9e-05,7.3e-05,-0.000442,-0.000193,-7.6e-05,-0.000245,-1e-05,2.4e-05,0.000127,-2.1e-05,2.7e-05,6.3e-05,3.5e-05,9.3e-05,-5.2e-05,0.000164,8.1e-05,6.1e-05,0.000114,0.000107,0.000254,0.000146,0.000253,-0.000253,-0.000217,-1.7e-05,-6.7e-05,9.5e-05,7.5e-05,1.3e-05,0.000183,0.000127,-1.6e-05,0.000121,5.5e-05,0.000164,1.9e-05,-9.5e-05,0.000176,0.000137,0.000181,2e-05,8e-05,2.3e-05,7.3e-05,-0.000144,0.000155,-0.000152,2.8e-05,-9.8e-05,-8.7e-05,3.9e-05,-0.000165
-0.000229,0.00022,0.000218,-4.2e-05,0.000223,1.4e-05,3.4e-05,-5.4e-05,-5.4e-05,-9.1e-05,-1e-06,4.9e-05,9.8e-05,0.000226,-9e-06,-5.8e-05,-0.000103,-0.000106,0.000107,9.1e-05,-0.000167,5e-06,-0.000113,-4.6e-05,-6.5e-05,-6.4e-05,-0.000112,-0.00016,-2.4e-05,-4e-05,-1e-06,7e-05,0.000503,5.8e-05,3.6e-05,-3.3e-05,-0.000158,0.000139,-0.000127,0.000113,-0.000121,-0.00018,-4.5e-05,3.8e-05,2e-06,0,0.000212,-3.7e-05,-0.000109,-4.2e-05,-0.000227,-0.000508,0.000121,0.000153,0.000181,2.6e-05,5.6e-05,8e-06,-0.000178,0.000122,9.9e-05,6.6e-05,-0.000231,0.000222,-0.000167,0.000124,-5.9e-05,6.1e-05,-2.2e-05,-1.7e-05,0.000552,1.9e-05,0.000114,-8e-06,4.2e-05,0.000196,8.7e-05,4.2e-05,-5.5e-05,0.000145,2.8e-05,-3e-05,0.000165,-0.000308,-2.6e-05,0.000118,-6.6e-05,-9.8e-05,-5.9e-05,-0.000254,-0.000279,1.6e-05,0.000184,-2.1e-05,3.4e-05,-6e-05,-3.6e-05,5.3e-05,-0.000132,-7.7e-05,3.7e-05,-8.8e-05,1e-04,-0.000169,7.1e-05,0.000114,-0.000166,-0.000168,-0.000119,0.000195,-0.000242,-1.5e-05,-4.9e-05,0.000209,9.6e-05,0.000105,-3e-06,7e-06,0.000162,-1.9e-05,0.000141
0.000234,-0.000434,-0.000191,1.4e-05,-0.000252,-5e-06,-0.000114,-6e-05,-1.8e-05,0.000194,1.8e-05,-3e-05,-0.000112,-0.000119,-7e-06,3.2e-05,5.8e-05,4.7e-05,-4.4e-05,7.8e-05,0.000129,-1.4e-05,5.1e-05,8.7e-05,-3e-06,8.3e-05,8.3e-05,6.6e-05,0.000248,5.1e-05,0.000108,4.3e-05,-0.000369,-0.000121,-9.3e-05,2.7e-05,9e-06,-7.4e-05,8.6e-05,8e-06,0.000167,0.00021,0.000137,-3e-05,1.4e-05,-9e-06,3e-05,-2.3e-05,5.1e-05,0.000157,-0.000203,0.000372,-0.000293,-0.000223,-0.000201,-8.1e-05,-0.000153,5e-05,0.000119,-2.3e-05,-9.1e-05,-5.9e-05,0.000197,-8.7e-05,8.5e-05,-0.000291,0.000112,-3.1e-05,5.7e-05,-1.3e-05,-0.000603,0.000199,-7.1e-05,0.000144,-4.8e-05,-4.6e-05,-0.000103,-7.9e-05,9.1e-05,-0.000137,-1.1e-05,-1.1e-05,-0.000201,0.000193,-5.7e-05,-2.4e-05,3.6e-05,-7.3e-05,2.7e-05,0.000127,1e-04,6.7e-05,-6.6e-05,6.6e-05,4e-06,-2.3e-05,4.1e-05,-8.4e-05,5.4e-05,2.4e-05,-2.4e-05,5.9e-05,-3.8e-05,0.000185,-4.2e-05,0.000107,9e-06,0.000188,0.000128,-0.000225,0.000186,1.8e-05,4.4e-05,-0.000223,-0.000295,-5.9e-05,-6.7e-05,3e-06,-0.000114,2e-05,-9.7e-05
-0.000301,0.000177,0.000129,-1.7e-05,0.000166,3.8e-05,6.4e-05,-5.2e-05,3e-05,-0.000114,-3.8e-05,9.1e-05,-8.5e-05,0.000164,-4e-06,-4.6e-05,-5.4e-05,3.4e-05,-6.9e-05,-0.000155,-6e-05,4.5e-05,-5.9e-05,-9e-05,4e-05,-6.5e-05,9.8e-05,2e-06,-0.000268,-3.6e-05,-0.000164,-7.6e-05,0.000191,4e-05,3.1e-05,1.1e-05,2.2e-05,6e-05,0.000135,1.2e-05,-0.000108,-0.000117,-0.000123,-5.9e-05,-5.9e-05,-4e-06,-1.3e-05,3.6e-05,1.7e-05,-5.6e-05,0.000268,-0.000319,0.000326,0.000132,4.2e-05,0.00012,0.000163,-4e-05,0.000149,-2.2e-05,3e-05,2.9e-05,-0.000128,3.8e-05,-0.000346,0.000124,-2.6e-05,6.5e-05,-8e-05,1e-06,0.000499,-0.000204,1e-05,-0.000117,-1e-06,1.7e-05,0.000121,-1.3e-05,-2.3e-05,5.5e-05,-5e-06,-1.2e-05,5.1e-05,-9.3e-05,-4.9e-05,2e-05,-3.1e-05,7e-05,-2.1e-05,-4.4e-05,7.6e-05,3.2e-05,-5.7e-05,-8e-06,-3.7e-05,-2.7e-05,-4.4e-05,2.1e-05,-4.2e-05,1.6e-05,-1.9e-05,1.7e-05,-7.3e-05,-0.000207,-2.4e-05,-0.000157,5.2e-05,-0.000174,-0.000123,8.3e-05,-0.000103,-9e-06,-1.1e-05,0.000152,0.000115,7.3e-05,5.8e-05,6.3e-05,-1.8e-05,6e-06,8.3e-05
9.2e-05,-1.2e-05,-6.1e-05,-8e-06,-0.000185,9.8e-05,3.4e-05,-9e-06,9.1e-05,-1.2e-05,0.000137,-4.1e-05,0.000139,-0.000196,5e-05,2.7e-05,4.1e-05,-3.1e-05,8.3e-05,0.000127,-2e-06,-5.8e-05,1.7e-05,7.4e-05,6e-06,-3.3e-05,-0.000161,-3.9e-05,9.7e-05,-9e-06,9e-05,-1.4e-05,-5e-05,0.00012,-1.5e-05,-1.8e-05,0.000129,-2.3e-05,-0.000237,-9.6e-05,8.1e-05,2.3e-05,7.1e-05,-2.5e-05,3.5e-05,2e-05,-3.8e-05,0.000108,-8.1e-05,-8.1e-05,-0.000173,0.000243,-0.000217,3e-06,4.7e-05,-0.000117,-0.000185,1.2e-05,-0.000209,-0.000103,-1e-06,-0.000104,0.000141,8.6e-05,0.000278,-5.2e-05,8.4e-05,9.1e-05,0,3.8e-05,-3e-04,8.1e-05,6e-05,1.1e-05,1e-05,4.2e-05,-0.000113,1e-05,-7.3e-05,-0.000137,2e-06,-3.7e-05,0.000122,-2.1e-05,0.000117,6.6e-05,-1.8e-05,-7.5e-05,1.9e-05,6.8e-05,-7.1e-05,-3.7e-05,0.000125,-0.000135,9e-06,1.5e-05,1.9e-05,1.4e-05,4.2e-05,2.3e-05,-1.7e-05,-1.5e-05,1.9e-05,0.000136,4.3e-05,-1.7e-05,-0.000105,0.000142,0.000166,4.8e-05,2.9e-05,1.1e-05,2.2e-05,-6.2e-05,0.000182,-5.6e-05,5.8e-05,-2.1e-05,3.1e-05,-1.4e-05,-8.7e-05
0.000186,-5.8e-05,2.8e-05,5e-05,0.000221,-7e-05,-3e-05,3.2e-05,-4.3e-05,7e-05,-0.000221,1.6e-05,-0.000108,0.000118,-2e-05,-6e-05,-2.2e-05,8e-06,-4.8e-05,-5.4e-05,2.9e-05,5.1e-05,6e-06,-0.000117,-2.2e-05,0.000113,2.9e-05,3.7e-05,3.8e-05,7.6e-05,5.2e-05,3e-06,1.5e-05,-0.000173,-8e-06,4.3e-05,-0.000216,-4.2e-05,0.000144,3.6e-05,-4.1e-05,3.1e-05,-1.5e-05,3.9e-05,2.8e-05,-1e-06,-4.3e-05,-1.6e-05,2.1e-05,0.000103,0.000114,-0.000131,6.9e-05,-0.000138,-5.1e-05,8.6e-05,4.9e-05,-2.9e-05,5.4e-05,2.7e-05,-8.6e-05,-0.00014,-0.000135,-0.000122,-0.000162,0.000131,-8.8e-05,-2.9e-05,2.9e-05,-3.8e-05,0.000108,4e-05,-4.9e-05,0.00012,-2.2e-05,5.6e-05,0.000108,-4e-06,3.7e-05,8.2e-05,1.2e-05,6.6e-05,-6.2e-05,6.4e-05,-8e-05,6e-06,-1.6e-05,-2e-05,-3.9e-05,-3.6e-05,-7.2e-05,-6.2e-05,-0.000131,0.000178,2.1e-05,8.6e-05,-6e-06,-6e-05,3e-06,-5.7e-05,2.3e-05,6e-06,7.1e-05,-2.9e-05,-1.1e-05,1.5e-05,0.000103,-0.000122,-0.00012,-8.4e-05,2.7e-05,0,-0.000145,-4.3e-05,-0.000135,2.7e-05,-3.9e-05,-6.2e-05,4e-06,1.1e-05,6.5e-05
-0.000259,2.2e-05,-5.3e-05,-2.7e-05,-0.000201,5.2e-05,2.6e-05,5.1e-05,-7.5e-05,2e-06,0.000291,2.7e-05,4e-05,-0.000101,1.3e-05,7.7e-05,1.2e-05,-1.6e-05,6e-05,0,-8e-05,-6.1e-05,-4.8e-05,8e-05,-7e-06,-4.1e-05,9.2e-05,-3.3e-05,-9.9e-05,-6.1e-05,-4.9e-05,8.3e-05,-2.4e-05,0.000126,3e-05,-4.6e-05,0.000168,5.5e-05,-5.4e-05,-2e-06,2.8e-05,-3.9e-05,3e-05,2.1e-05,-2.7e-05,-7e-06,6.6e-05,3.8e-05,7.9e-05,-1.8e-05,-2e-05,0.000143,4.3e-05,9.8e-05,1.1e-05,-8.6e-05,-9e-06,1.1e-05,5.6e-05,-5.9e-05,4.6e-05,4.7e-05,0.000123,9.2e-05,0.000278,7.5e-05,1.6e-05,-6.9e-05,-1.5e-05,-9e-06,0.000101,-0.000157,-4e-06,-9.7e-05,3.8e-05,-3.3e-05,2.8e-05,2.5e-05,4.1e-05,7.7e-05,-6e-06,3.8e-05,-0.000153,-2.8e-05,3.6e-05,6.9e-05,-2.1e-05,8.4e-05,0.000101,-6.7e-05,0.000114,0.000128,0.00011,-0.000146,2.5e-05,-0.000103,9e-06,-3.1e-05,0,-2.3e-05,1.1e-05,-4e-05,3e-06,-3.8e-05,-7e-06,-1.8e-05,-0.000141,4.9e-05,8.5e-05,5.6e-05,-0.000101,-1.5e-05,0.000201,4.2e-05,-7.5e-05,-2e-05,1e-06,8.2e-05,1.2e-05,-9e-06,-4.2e-05
0.000155,-1.4e-05,9e-05,-6e-06,0.000155,2e-06,-1.7e-05,-1.1e-05,9e-06,-0.000121,-0.000225,-5.6e-05,-9e-06,0.000106,-1.9e-05,-3.1e-05,-1.3e-05,9e-06,-9e-06,-7e-06,7.9e-05,2.4e-05,-1.8e-05,-8.7e-05,-2e-06,-3.2e-05,-6.3e-05,2.6e-05,0.000144,4.1e-05,-2e-06,-7.8e-05,1e-06,-8e-06,-2.9e-05,1.1e-05,-4.2e-05,-5.4e-05,4.1e-05,-5e-05,-3.6e-05,4.5e-05,-4.1e-05,-1.8e-05,-1.6e-05,2e-06,4.4e-05,-7.9e-05,-2.2e-05,-9.9e-05,-0.000122,-8.1e-05,-5.7e-05,-4.4e-05,-4e-06,7e-05,8.1e-05,1.9e-05,-0.000179,-5.1e-05,-2.8e-05,-0.000246,-5.6e-05,8e-06,-0.000349,-0.000141,5.4e-05,8.1e-05,-2.7e-05,1.4e-05,-0.000252,0.000174,2e-06,1.7e-05,-1.4e-05,-3.9e-05,-0.000121,-2.8e-05,-1.3e-05,-0.000103,-1e-05,-2.4e-05,0.000195,3.3e-05,1.4e-05,1.8e-05,5.5e-05,-4.8e-05,-9.3e-05,0.000111,2.9e-05,-7.1e-05,-4.7e-05,7.6e-05,2.6e-05,4.8e-05,2.9e-05,7.6e-05,-2.8e-05,2.2e-05,-2.3e-05,4.1e-05,-7.4e-05,6.4e-05,-1e-06,8.2e-05,5.2e-05,-1.9e-05,-5.3e-05,-4.5e-05,0.000111,1.4e-05,-0.000128,-6.2e-05,0.000169,-6e-06,-1.5e-05,8e-06,-2.9e-05,1.1e-05,2.8e-05
-8.2e-05,0.000217,-7.9e-05,4.2e-05,-0.000158,-2.3e-05,4e-06,-1.4e-05,4.7e-05,0.000115,0.000171,2.8e-05,4.9e-05,-9.6e-05,9e-06,1.6e-05,-2e-06,3.4e-05,-2.1e-05,6e-06,-5.1e-05,4.7e-05,2.2e-05,0.000115,1.2e-05,8.5e-05,-4.2e-05,-2.8e-05,-0.00015,-3.7e-05,4.3e-05,4.7e-05,4.6e-05,-0.000109,4.1e-05,-1.2e-05,-5.6e-05,3.3e-05,-2.5e-05,-2.2e-05,2e-06,-5e-05,2e-05,-2.1e-05,1.9e-05,-5e-06,-0.000192,1.6e-05,-6.3e-05,8.5e-05,0.00015,1.5e-05,2e-06,-2.2e-05,-1.7e-05,-7e-05,-5e-06,-1.5e-05,0.000108,-1.2e-05,4e-06,0.000147,-9e-06,-8.2e-05,0.000235,0.000104,-6.9e-05,0,1.5e-05,2.6e-05,0.000319,-6.9e-05,1.6e-05,6.5e-05,-5e-06,-7.5e-05,9e-05,-1.6e-05,1.2e-05,6e-05,-1.3e-05,-7e-06,-5.7e-05,-2.2e-05,-3e-06,-4.4e-05,-6.3e-05,3.6e-05,5.4e-05,-4.5e-05,-0.000129,1.9e-05,-2.1e-05,-5e-05,-3.9e-05,2.2e-05,-2.4e-05,1.2e-05,1.1e-05,1.7e-05,2.7e-05,-3.2e-05,1.3e-05,-6.2e-05,0,-1.4e-05,9e-06,-4.1e-05,5e-05,5.5e-05,-4.2e-05,-2e-06,4.1e-05,9.2e-05,-7.3e-05,1.6e-05,-5e-06,-7.1e-05,3.1e-05,-5e-06,-2e-05
4.7e-05,-0.000255,4.7e-05,-1.6e-05,0.000142,5e-06,-4e-06,-6e-05,2e-05,-2e-06,-0.000196,-1.2e-05,-6.5e-05,0.000112,8e-06,-9e-06,1.1e-05,-6.2e-05,4e-05,4e-05,6e-05,-0.000105,-1.9e-05,-0.000103,-1.7e-05,-0.000101,5.2e-05,1.4e-05,4.2e-05,2.8e-05,-3.9e-05,-6.7e-05,-0.000132,0.000103,-1.9e-05,7e-06,2.2e-05,-3.4e-05,-4.1e-05,1.3e-05,2.9e-05,3.2e-05,2e-05,-1.8e-05,1.3e-05,2e-06,0.000143,-5e-05,6.4e-05,2.6e-05,-0.000113,9e-06,7.2e-05,3.8e-05,6.4e-05,4.9e-05,-4.1e-05,-1.3e-05,-1.2e-05,-7.7e-05,2.5e-05,-0.000171,5.4e-05,5.6e-05,-0.000286,9.4e-05,2.8e-05,-6.8e-05,7e-06,-5e-06,-0.000305,-5.2e-05,9e-06,-0.000124,1.2e-05,4.8e-05,-6e-06,1.2e-05,4e-06,-3.1e-05,2.7e-05,1.8e-05,-7.9e-05,-3.7e-05,-5.8e-05,-2.2e-05,4.9e-05,5e-05,-2e-05,-2.1e-05,8.3e-05,-7.3e-05,4.2e-05,3.9e-05,-3.3e-05,-4.6e-05,1.9e-05,-2.3e-05,-3e-06,2.1e-05,-3.5e-05,1.6e-05,4.2e-05,7.5e-05,1e-06,-4.1e-05,-4.4e-05,6e-05,-2.3e-05,-6e-05,4.2e-05,3e-06,3.2e-05,-9.4e-05,-9.4e-05,-4.1e-05,4.2e-05,3.4e-05,1.3e-05,4e-06,8e-06
8.9e-05,0.000226,-1.6e-05,-6e-06,-0.000116,0,-2.1e-05,-1.5e-05,-2e-05,-7.6e-05,0.000216,-4.2e-05,7.3e-05,-8.3e-05,-1e-05,-1.7e-05,-8e-06,2.9e-05,-2.8e-05,-7.9e-05,-3.1e-05,9.3e-05,-2e-05,9.3e-05,5e-06,5e-05,8e-06,-3e-06,8.1e-05,-5.4e-05,-7e-06,8.8e-05,0.000165,-5.8e-05,9e-06,1.7e-05,3.7e-05,1.8e-05,7.6e-05,4.4e-05,-5.3e-05,-2e-05,-6.9e-05,2.6e-05,-6e-06,2e-06,-5.8e-05,5.1e-05,3.8e-05,-7.7e-05,7.4e-05,-8.6e-05,-4.8e-05,-5.4e-05,-5.2e-05,-3e-05,6.2e-05,1.1e-05,-8.2e-05,2e-05,-1.4e-05,-4.4e-05,-6.7e-05,-3.8e-05,0.000359,-0.000135,-2.8e-05,3.8e-05,-2e-05,-2.9e-05,0.000213,0.000109,-1.8e-05,3.7e-05,-2e-06,3.8e-05,-2.9e-05,-3e-06,-2e-05,4e-05,-8e-06,2.6e-05,0.00011,8.1e-05,4e-05,-1.2e-05,-1.4e-05,-3.1e-05,3.9e-05,7e-06,4.7e-05,0.000123,-5.1e-05,-5.8e-05,5e-06,2.3e-05,-1.8e-05,1e-06,2e-06,-2e-06,4.4e-05,-6e-06,0,-8.3e-05,8e-06,2.6e-05,0.000132,-8.2e-05,-5e-06,4e-06,-2.7e-05,0,-6.7e-05,4.6e-05,0.000118,4.2e-05,-2.3e-05,2.1e-05,-4.3e-05,-7e-06,-1.7e-05
-0.000214,-7.6e-05,5e-06,1.6e-05,0.000107,-4.2e-05,1.8e-05,1.6e-05,-2.9e-05,3.6e-05,-0.000193,3e-05,-1.8e-05,7.4e-05,1.1e-05,1.8e-05,9e-06,1.8e-05,3.4e-05,6.8e-05,8e-06,-2.6e-05,-2e-05,-7.3e-05,-1.2e-05,1e-05,-4.9e-05,5e-06,-9.9e-05,5.4e-05,2.8e-05,-5.1e-05,-0.000147,1.4e-05,-1e-06,6e-06,-6.2e-05,-9e-06,-5.3e-05,3.6e-05,7.8e-05,7e-06,7.2e-05,2.9e-05,-1.2e-05,-3e-06,0.000118,-6e-06,-7.5e-05,3.7e-05,3.7e-05,9.4e-05,-5e-06,1e-05,2.3e-05,3.1e-05,-8.7e-05,-1.6e-05,0.000161,-8.4e-05,3.5e-05,4.3e-05,0.000116,-2e-05,-0.000301,-1.7e-05,3.5e-05,-4.9e-05,0,9e-06,-8.9e-05,-9.4e-05,-1.2e-05,5.9e-05,0,-3.2e-05,4e-06,1.4e-05,7e-06,-1e-06,-2.4e-05,3e-06,-4e-05,-8.4e-05,4.4e-05,-2.9e-05,-1e-06,1.2e-05,-5.8e-05,8e-06,-0.00012,-7.8e-05,7.5e-05,5.6e-05,1.5e-05,-3.6e-05,1.1e-05,2.4e-05,-5e-06,-1.9e-05,-2.8e-05,-5e-06,-5.7e-05,4.4e-05,-1.5e-05,-2.1e-05,-0.000106,9.5e-05,1e-05,7.2e-05,1.1e-05,4e-06,7.4e-05,-1.9e-05,3.4e-05,-3.9e-05,-1.4e-05,-2.2e-05,1.9e-05,4e-06,1.2e-05
0.00018,2.9e-05,-8e-06,-1.7e-05,-0.000119,2.1e-05,3e-06,4.8e-05,2.2e-05,5.8e-05,0.000116,-5e-06,-3.6e-05,-9.9e-05,-2e-05,-1e-05,-1.2e-05,-2.9e-05,-2.2e-05,-1.5e-05,2e-06,-4.4e-05,5e-06,7.9e-05,-6e-06,-1e-06,7e-06,-8e-06,8.9e-05,-1.3e-05,-1.8e-05,-8e-06,0.000123,2.3e-05,-2.3e-05,8e-06,6.7e-05,-1e-06,1.6e-05,-3.3e-05,-4.9e-05,-7e-06,-6.5e-05,0,5e-06,-2e-06,-0.000139,2.8e-05,1.3e-05,4.5e-05,-0.00017,-0.000113,5.3e-05,8e-06,2.1e-05,-2.4e-05,4.1e-05,1.9e-05,-4.6e-05,2.1e-05,-1.4e-05,-0.000109,-0.000164,3e-05,0.000256,-3.8e-05,-1.4e-05,-4.6e-05,1.5e-05,6e-06,-5.9e-05,2e-05,2.5e-05,-4.4e-05,7e-06,1.5e-05,-2.1e-05,-9e-06,-2e-05,-4.8e-05,1.2e-05,-9e-06,-9.8e-05,8.5e-05,-7.6e-05,-2.2e-05,2.5e-05,1e-05,4.1e-05,3.2e-05,4.5e-05,1.1e-05,-7.2e-05,-4.2e-05,1.1e-05,3e-05,-5e-06,-2.1e-05,6e-06,-1.4e-05,-8e-06,0,1.3e-05,4e-06,6e-06,3.3e-05,3.7e-05,-7.8e-05,-1.2e-05,-6.7e-05,-9e-06,-2e-06,-7.5e-05,4e-06,-0.000122,4e-05,-8e-06,-1.2e-05,-2e-06,-1e-06,-7e-06
-3.9e-05,-0.000125,6e-06,1e-06,9.9e-05,-2.1e-05,-7e-06,2.1e-05,1.3e-05,-8.5e-05,-5.9e-05,-2.7e-05,5e-05,7e-05,1.3e-05,4e-06,1.2e-05,2.3e-05,-3e-06,-3.1e-05,-2.4e-05,6.2e-05,-1.6e-05,-7.7e-05,5e-06,4e-06,5.3e-05,-6e-06,-9.3e-05,1.1e-05,0,3.2e-05,-9.2e-05,-9e-06,2.7e-05,-3e-06,-9e-06,1.5e-05,-3e-05,-1.8e-05,1.8e-05,2.1e-05,5.8e-05,-2e-05,0,1e-06,9.4e-05,-8e-06,3.9e-05,-7.2e-05,0.000174,0.000196,-9.6e-05,-3.2e-05,-6.3e-05,1.7e-05,2e-06,-8e-06,-5.8e-05,-2.2e-05,6e-06,8.9e-05,0.000184,-6.5e-05,-0.000337,4e-05,-1.8e-05,6e-05,1.7e-05,4e-06,0.000186,6.4e-05,-1.4e-05,1.2e-05,-6e-06,6.5e-05,4.5e-05,1e-06,2.2e-05,2.4e-05,0,-1.5e-05,0.000132,-8.4e-05,4.4e-05,-2e-05,-2.4e-05,-3.6e-05,8e-06,-4.3e-05,6.5e-05,-2.6e-05,1.5e-05,2.7e-05,0,6e-06,-2e-06,-1.8e-05,1e-05,1.8e-05,1.1e-05,-1.3e-05,3.5e-05,-3.3e-05,8e-06,1.3e-05,-3.8e-05,7.4e-05,8e-06,1.6e-05,1e-05,5e-06,8.8e-05,4.3e-05,2.7e-05,-3.2e-05,5e-06,6e-06,7e-06,6e-06,5e-06
-3.5e-05,1e-04,4e-06,4e-06,-9.3e-05,1.8e-05,1.3e-05,-2.7e-05,-1.2e-05,2.5e-05,7.3e-05,1.7e-05,-5.8e-05,-4e-05,-8e-06,-2e-06,-1e-05,-2e-05,1.5e-05,5.5e-05,3.2e-05,-3.6e-05,-7e-06,7.1e-05,-5e-06,-1.5e-05,-2.2e-05,2.2e-05,3e-05,-1.3e-05,0,-2.3e-05,7.2e-05,-1.4e-05,-1.9e-05,5e-06,-6.7e-05,-1.6e-05,6.6e-05,1.4e-05,2e-06,-2.5e-05,-5.8e-05,-2.1e-05,3e-06,-1e-06,-8.2e-05,-1.2e-05,-4.3e-05,1.8e-05,-4.3e-05,-0.000192,7.3e-05,8e-06,5e-05,1e-06,2.2e-05,-6e-06,1e-04,1.5e-05,7e-06,-0.000117,-0.000172,2.8e-05,0.000325,3.2e-05,2.3e-05,-6e-06,0,-1.1e-05,-0.000253,-8.3e-05,2e-06,1.9e-05,1e-05,-4e-06,-3e-06,-3e-06,-1.2e-05,1.9e-05,-1.1e-05,3e-06,-2.3e-05,8.5e-05,1e-06,-2.6e-05,9e-06,5e-06,-3.9e-05,-2e-06,-5.4e-05,7.5e-05,3.7e-05,-1e-05,-2e-06,-8e-06,1.2e-05,1.5e-05,-2.2e-05,-8e-06,-8e-06,1.1e-05,9e-06,4.5e-05,-6e-06,-6.6e-05,-5.2e-05,-3.8e-05,-3.1e-05,3e-06,-1.2e-05,0,-0.000125,-7.6e-05,5.7e-05,3.3e-05,1.1e-05,3.1e-05,-1.8e-05,-3e-06,9e-06
7.2e-05,-3.7e-05,-1.4e-05,-1.2e-05,0.000103,4e-06,-8e-06,-4.7e-05,-1.4e-05,5.1e-05,-5.9e-05,-4e-06,5.2e-05,5.4e-05,1.3e-05,1.2e-05,1.1e-05,9e-06,-2.2e-05,-5.9e-05,-2.8e-05,6e-06,-5e-06,-6.8e-05,1e-06,-1.8e-05,-4.7e-05,-2.8e-05,8.4e-05,3.7e-05,1e-06,2.8e-05,-5.7e-05,2e-06,1.1e-05,-4e-06,9e-05,6e-06,-4.6e-05,1.6e-05,-2.1e-05,2.8e-05,6.8e-05,1e-05,-3e-06,-3e-06,0.00011,-1.2e-05,-7e-06,5.2e-05,-6.6e-05,0.000213,-3.4e-05,1e-06,-2.1e-05,1e-06,6e-06,5e-06,-8.6e-05,-2.3e-05,-2.9e-05,0.000143,0.000173,5e-06,-0.000292,-8.8e-05,-9e-06,-5.7e-05,-7e-06,3e-06,0.000265,3.6e-05,4e-06,-5.2e-05,-5e-06,-5.3e-05,-5.2e-05,-2e-06,-4e-06,-2.3e-05,2e-06,1.4e-05,-9.4e-05,-8.7e-05,-2.7e-05,-8e-06,-2e-06,-1e-06,3.7e-05,3.1e-05,-2.2e-05,-6.2e-05,-4.7e-05,-1.3e-05,-2e-06,4e-06,-1.4e-05,4e-06,1.2e-05,-2e-06,1.4e-05,-1.1e-05,-4.5e-05,-4.5e-05,-5e-06,1.6e-05,8.5e-05,2.7e-05,2.4e-05,-1e-05,-2.4e-05,3e-06,0.000113,7.9e-05,-5.4e-05,-2.8e-05,8e-06,-1.7e-05,1e-05,0,-5e-06
-0.000133,-0.000102,2.3e-05,7e-06,-0.000105,1e-05,-1e-06,-2.4e-05,3e-06,-5.4e-05,6e-06,-5e-06,-4e-05,-6.6e-05,-7e-06,-1.1e-05,-8e-06,2.2e-05,3.9e-05,4.5e-05,2.5e-05,4e-06,-1.2e-05,6.1e-05,-3e-06,2.5e-05,5.6e-05,2e-05,-0.000127,-4.2e-05,1e-06,-4.9e-05,3.1e-05,2.8e-05,1e-06,-6e-06,-4.8e-05,1e-06,-1.5e-05,-3.1e-05,2e-06,-3.6e-05,-4.5e-05,2.4e-05,-1e-06,1e-06,-5.8e-05,-1.1e-05,3.4e-05,-6.2e-05,0.000117,-0.000232,1.9e-05,-2.3e-05,-2.2e-05,-1e-06,-1.7e-05,6e-06,-2.5e-05,2.6e-05,2.2e-05,-9.5e-05,-0.000189,-3.5e-05,0.000309,3.2e-05,1.5e-05,4.2e-05,-5e-06,1e-06,-0.000211,2.7e-05,-1.3e-05,2.6e-05,9e-06,-1.6e-05,4e-05,1.6e-05,-1.1e-05,1.3e-05,-1e-06,-2e-06,6.7e-05,8.4e-05,8e-06,1.2e-05,5e-06,-1.5e-05,-3.1e-05,-1.1e-05,7.1e-05,-5e-06,4.6e-05,4.1e-05,-7e-06,-1e-05,7e-06,-1.7e-05,-9e-06,1.1e-05,-1.3e-05,1.9e-05,4e-06,4.3e-05,6e-06,3.2e-05,-5.3e-05,3e-06,-3.1e-05,2.4e-05,2.8e-05,-2e-06,-4.3e-05,-7.2e-05,6e-06,1.3e-05,-8e-06,-2.5e-05,1.8e-05,-3e-06,7e-06
0.000164,8.4e-05,-3e-05,-1e-06,9.1e-05,7e-06,7e-06,2.2e-05,1.8e-05,-2.1e-05,3.4e-05,2.3e-05,1.1e-05,6.7e-05,-4e-06,7e-06,6e-06,-4.1e-05,-3e-05,-2.6e-05,-1.7e-05,3e-06,-2e-06,-5.6e-05,-9e-06,6e-06,1e-06,-9e-06,8.7e-05,-6e-06,1.1e-05,3.4e-05,1.3e-05,-5.5e-05,-3e-06,-1e-06,-1.3e-05,2e-06,4.3e-05,-3.4e-05,7e-06,3.7e-05,2e-05,4e-06,-3e-06,0,-6.6e-05,1.3e-05,-2.7e-05,-1e-06,-0.000128,0.000223,-2e-05,1e-06,4.6e-05,-1e-06,6e-06,-1e-06,8.5e-05,1.1e-05,-1.9e-05,5.9e-05,0.000198,3.8e-05,-0.000342,9.3e-05,-2.2e-05,8e-06,-2e-06,0,0.000104,-7.4e-05,1.3e-05,2.8e-05,-1e-05,-2e-06,-6e-06,-1.4e-05,1e-06,-2.5e-05,3e-06,-9e-06,4e-05,-8.3e-05,2.8e-05,2e-06,-1.6e-05,1.1e-05,0,-1e-05,-2.3e-05,1.8e-05,-4.4e-05,-3.8e-05,-5e-06,1.4e-05,-7e-06,1.9e-05,1.4e-05,4e-06,2e-06,-1e-06,3e-05,-2.7e-05,-1e-06,-2.4e-05,5.3e-05,-2e-05,1.2e-05,-2.4e-05,-3e-05,6e-06,-3.4e-05,4.2e-05,4.3e-05,-9e-06,-7e-06,3.5e-05,-2.2e-05,1e-06,-1.3e-05
-6.1e-05,-2.3e-05,3.3e-05,-1.3e-05,-9.1e-05,1.3e-05,-6e-06,4.2e-05,-3e-06,8.2e-05,-6.8e-05,-1.4e-05,1.2e-05,-5.9e-05,0,-8e-06,-4e-06,1.8e-05,5e-06,9e-06,-2e-06,-6e-06,-1.2e-05,5.1e-05,4e-06,-1.6e-05,-4.7e-05,0,-4.1e-05,2.2e-05,-1.5e-05,-2e-06,-5.5e-05,5.7e-05,3e-06,-5e-06,2.9e-05,-8e-06,-2.5e-05,1.8e-05,-2e-06,-2.6e-05,1.1e-05,-1.1e-05,1e-06,5e-06,7.2e-05,3e-06,-3.2e-05,5.9e-05,7.5e-05,-0.000267,3.5e-05,2e-06,-3.1e-05,8e-06,-2.5e-05,-2e-06,-9.4e-05,1.1e-05,1e-06,7.4e-05,-0.000178,-1.7e-05,0.000312,-2.7e-05,7e-06,-2.4e-05,-6e-06,3e-06,2e-05,7.2e-05,-5e-06,-3.9e-05,9e-06,-2e-05,5e-06,7e-06,1.1e-05,1.1e-05,1.3e-05,-1e-05,-0.000118,7.7e-05,-2.7e-05,-3e-06,1.1e-05,2e-06,2.5e-05,-4e-06,-6.1e-05,2.9e-05,2.5e-05,3.5e-05,4e-06,-1.5e-05,2e-06,1.4e-05,-8e-06,-1e-05,-1e-06,-9e-06,6e-06,4e-06,-3e-06,1.4e-05,-2.5e-05,3.3e-05,-3.4e-05,2.1e-05,2.3e-05,-2e-06,9.1e-05,-5e-06,-3e-05,2e-06,1.6e-05,1e-06,-8e-06,5e-06,8e-06
-7.2e-05,3.4e-05,-3.4e-05,1.4e-05,9e-05,-1e-05,0,2.3e-05,-8e-06,-6.4e-05,6.7e-05,4e-06,-2.1e-05,4e-05,-1.2e-05,-1e-06,2e-06,1.3e-05,6e-06,8e-06,7e-06,-2e-06,-3e-06,-5.4e-05,1e-06,9e-06,3.1e-05,1e-05,-1e-06,-1.7e-05,1.6e-05,-8e-06,6.6e-05,-2e-06,-5e-06,6e-06,2e-05,6e-06,9e-06,3.1e-05,-7e-06,1e-05,-2.7e-05,-1.1e-05,9e-06,-4e-06,-3e-05,9e-06,5.6e-05,-4.5e-05,2.6e-05,0.000265,-5.2e-05,-1.8e-05,-5e-06,-1.1e-05,5e-06,-2e-06,1.9e-05,4.2e-05,1.2e-05,-3.7e-05,0.00017,8e-06,-0.000317,-4.5e-05,1e-05,3.5e-05,-9e-06,-4e-06,-0.000141,-1.1e-05,-3e-06,8e-06,-1e-06,0,-1e-05,1e-06,-9e-06,2.3e-05,-1e-05,-5e-06,7.4e-05,-5.2e-05,-5e-06,1.5e-05,0,1e-06,-2.4e-05,1.6e-05,5.7e-05,-5.1e-05,1.4e-05,-3.1e-05,7e-06,-5e-06,0,-2.1e-05,5e-06,-4e-06,3e-06,-4e-06,-4.2e-05,2.1e-05,2e-06,1e-06,-3.1e-05,-5e-05,2.1e-05,-2.2e-05,-7e-06,2e-06,-9.3e-05,-3.6e-05,-2.5e-05,1e-06,2e-06,-2.9e-05,2.2e-05,-2e-06,-1.3e-05
0.000106,-9.4e-05,3.3e-05,6e-06,-8.9e-05,-1e-06,4e-06,-2.3e-05,-3e-06,-6e-06,-7.9e-05,1.6e-05,2.2e-05,-4.7e-05,1.6e-05,1.1e-05,-2e-06,-2e-05,-3.3e-05,-2.9e-05,-1.3e-05,1.9e-05,-2e-05,5e-05,-1.1e-05,-1.8e-05,3.5e-05,-2.1e-05,8.4e-05,-1e-05,-2e-06,8e-06,-6.7e-05,-5.9e-05,8e-06,-1e-06,-7.6e-05,8e-06,-1.8e-05,-1e-06,2.6e-05,2e-06,2.4e-05,3e-06,-4e-06,2e-06,6.3e-05,-4e-06,2e-05,-2.6e-05,-9.7e-05,-0.000265,5.8e-05,-9e-06,2.8e-05,8e-06,2e-06,-2e-06,7.1e-05,2e-06,-1.7e-05,0.000167,-0.00018,3.5e-05,0.000318,1e-06,-1.4e-05,1e-05,5e-06,4e-06,0.000227,-5.5e-05,7e-06,2.1e-05,-3e-06,1.9e-05,-2.8e-05,-1e-05,-6e-06,-3.4e-05,-4e-06,1e-06,4.6e-05,1.6e-05,3e-05,2.2e-05,-1.2e-05,6e-06,0,8e-06,1.9e-05,4e-06,-4.4e-05,5.3e-05,1e-06,1.1e-05,-6e-06,-8e-06,-1.2e-05,-2e-06,2e-06,-2e-06,8e-06,-3.8e-05,0,-1.6e-05,4.1e-05,5e-05,-3.5e-05,-8e-06,-1.2e-05,2e-06,6.2e-05,6.8e-05,1.8e-05,-2e-06,-1e-05,3e-06,-5e-06,4e-06,1.4e-05
