0.024271,0.021095,0.019758,0.019598,0.017332,0.015698,0.015519,0.016594,0.017755,0.01689,0.015766,0.020752,0.031302,0.034122,0.029347,0.030297,0.028591,0.027224,0.033442,0.032654,0.025961,0.021803,0.023477,0.023618,0.017878,0.015404,0.015308,0.016557
0.031511,0.027069,0.025747,0.025336,0.021695,0.019433,0.019042,0.020972,0.023364,0.022419,0.020871,0.027649,0.041662,0.044467,0.037798,0.039498,0.036906,0.035052,0.043172,0.040867,0.031188,0.026913,0.030133,0.03008,0.022621,0.019337,0.018954,0.020191
0.044658,0.037811,0.036277,0.035078,0.029037,0.026223,0.025469,0.028645,0.033357,0.03243,0.030125,0.040148,0.060145,0.062719,0.052844,0.055999,0.052003,0.049448,0.060509,0.055032,0.039842,0.035434,0.041337,0.040747,0.030424,0.025776,0.024795,0.025958
0.054414,0.046245,0.044241,0.041507,0.03396,0.031946,0.03113,0.03464,0.04074,0.039851,0.037283,0.049454,0.073634,0.076897,0.065242,0.068627,0.063648,0.061247,0.073097,0.065097,0.047273,0.042348,0.048895,0.047563,0.035551,0.029988,0.028715,0.029774
0.055209,0.047491,0.045124,0.04206,0.036084,0.035633,0.034181,0.035639,0.040586,0.040199,0.0391,0.05072,0.0736,0.078823,0.06865,0.069883,0.065319,0.065003,0.074588,0.067382,0.054472,0.048412,0.050241,0.047378,0.036062,0.030611,0.030019,0.031829
0.050727,0.044129,0.042398,0.042376,0.040496,0.039844,0.036043,0.033452,0.034806,0.035047,0.037923,0.04879,0.064601,0.069956,0.062326,0.060232,0.058793,0.062862,0.068746,0.063181,0.058829,0.052606,0.047339,0.042612,0.034016,0.030037,0.03107,0.034465
0.05175,0.046989,0.047422,0.050175,0.050352,0.04756,0.041092,0.035347,0.033885,0.03433,0.040424,0.053302,0.062921,0.064044,0.057149,0.053024,0.053323,0.059728,0.063684,0.059274,0.05917,0.054554,0.047054,0.04084,0.033868,0.031426,0.032492,0.035659
0.063873,0.060703,0.0629,0.064657,0.063697,0.058189,0.051216,0.045614,0.04144,0.041361,0.050601,0.067989,0.0764,0.074402,0.068882,0.06522,0.064592,0.069669,0.072911,0.070542,0.068486,0.059893,0.05342,0.047622,0.04116,0.040775,0.03884,0.03816
0.097861,0.089452,0.092769,0.092961,0.089599,0.080194,0.072555,0.069298,0.063026,0.06108,0.076256,0.101745,0.113491,0.111483,0.108891,0.108554,0.105831,0.114104,0.12072,0.121413,0.114781,0.089511,0.079962,0.074953,0.066118,0.068553,0.062218,0.055066
0.167002,0.144079,0.148888,0.148771,0.144402,0.131764,0.118374,0.115598,0.1067,0.098759,0.127442,0.174642,0.194244,0.190321,0.190345,0.196887,0.192049,0.210219,0.225309,0.229701,0.216493,0.161597,0.143499,0.135692,0.118675,0.123172,0.111236,0.096145
0.283305,0.231362,0.237435,0.237464,0.234114,0.220296,0.19274,0.188249,0.177061,0.162111,0.214598,0.29787,0.330798,0.320523,0.322271,0.341504,0.332938,0.36981,0.400633,0.409098,0.387297,0.284092,0.249717,0.236765,0.204092,0.209486,0.192322,0.166911
0.437486,0.340829,0.353699,0.349524,0.342227,0.332728,0.284722,0.278113,0.268163,0.250391,0.332093,0.454021,0.506975,0.494227,0.504207,0.544724,0.525092,0.586523,0.643267,0.654576,0.623713,0.452844,0.386705,0.36725,0.313038,0.31642,0.299394,0.266709
0.578516,0.438249,0.470503,0.455839,0.429033,0.427753,0.362649,0.354387,0.347343,0.334946,0.44006,0.582626,0.657497,0.654785,0.685906,0.751356,0.71069,0.79744,0.885557,0.891683,0.858546,0.625381,0.510349,0.483074,0.410471,0.408365,0.401739,0.37169
0.622797,0.470179,0.524574,0.499987,0.443277,0.445424,0.377812,0.368925,0.362813,0.363628,0.471584,0.596947,0.68724,0.703444,0.757114,0.839966,0.78635,0.900417,1.003004,0.978966,0.954612,0.709746,0.549033,0.514509,0.440981,0.43461,0.444785,0.425742
0.511062,0.398612,0.462403,0.43878,0.365329,0.359085,0.312761,0.308766,0.293544,0.301549,0.387457,0.46398,0.547548,0.5763,0.635066,0.713167,0.672851,0.805564,0.893068,0.824044,0.806576,0.625849,0.465221,0.423643,0.366462,0.359119,0.381153,0.376501
0.302718,0.257422,0.309366,0.30369,0.248801,0.227152,0.207032,0.207959,0.181693,0.186075,0.241542,0.270509,0.321069,0.349128,0.389139,0.436578,0.431327,0.546589,0.604422,0.525178,0.497515,0.415722,0.313049,0.264605,0.223782,0.21647,0.235778,0.241154
0.158898,0.165008,0.19239,0.216026,0.1974,0.148707,0.131873,0.127023,0.097029,0.110533,0.148596,0.151169,0.163625,0.178011,0.194055,0.212673,0.242454,0.3107,0.343456,0.302517,0.266875,0.26856,0.237922,0.172058,0.129126,0.114129,0.113912,0.114437
0.155452,0.185014,0.191903,0.219236,0.199256,0.140157,0.136892,0.129645,0.097356,0.115591,0.141033,0.137184,0.141832,0.150761,0.161927,0.189657,0.233625,0.257051,0.267494,0.265645,0.247783,0.272409,0.265288,0.184842,0.128654,0.107077,0.099895,0.087612
0.192167,0.226406,0.210914,0.215707,0.190086,0.152381,0.172179,0.167052,0.128548,0.131299,0.150718,0.153463,0.16183,0.187453,0.228563,0.27724,0.29618,0.303237,0.316484,0.308127,0.281242,0.287229,0.276952,0.196635,0.13361,0.11243,0.12213,0.113002
0.209945,0.244517,0.213044,0.198551,0.179019,0.168781,0.205393,0.200934,0.157807,0.137346,0.153082,0.177752,0.19227,0.258415,0.355685,0.423836,0.399824,0.379632,0.397529,0.361167,0.304588,0.293996,0.2861,0.20616,0.143686,0.132725,0.15614,0.145195
0.206992,0.239012,0.215136,0.200264,0.181919,0.180744,0.218773,0.209722,0.174329,0.141349,0.157547,0.223264,0.261189,0.384259,0.555504,0.65716,0.583151,0.493531,0.501531,0.430596,0.341388,0.329035,0.311248,0.21728,0.164839,0.171213,0.193862,0.167487
0.204635,0.217458,0.207902,0.201274,0.17641,0.175349,0.202928,0.192758,0.180321,0.157981,0.180958,0.276392,0.350938,0.537087,0.777762,0.927924,0.813597,0.656872,0.647884,0.519871,0.400181,0.384734,0.34519,0.237936,0.190248,0.209314,0.220951,0.172829
0.213901,0.198803,0.193661,0.185329,0.152196,0.151984,0.1677,0.160412,0.165127,0.162565,0.195648,0.300838,0.404885,0.623232,0.892841,1.087996,0.979697,0.808534,0.797295,0.626137,0.469603,0.427071,0.369927,0.258895,0.206007,0.22712,0.23114,0.170558
0.22367,0.193001,0.189698,0.181736,0.146408,0.137191,0.140558,0.135485,0.133747,0.142327,0.192793,0.289283,0.380179,0.557107,0.780455,0.98093,0.938377,0.842635,0.843374,0.660472,0.495258,0.426928,0.3574,0.250656,0.195291,0.219457,0.227529,0.165243
0.218686,0.186395,0.190349,0.191862,0.160042,0.152179,0.141123,0.132742,0.126155,0.131078,0.190074,0.27021,0.31494,0.389147,0.497805,0.641672,0.677002,0.695558,0.718108,0.576185,0.451532,0.389175,0.320692,0.2155,0.163728,0.195322,0.201801,0.155958
0.212198,0.181181,0.183371,0.196427,0.185701,0.186332,0.158419,0.144539,0.138312,0.152824,0.239606,0.34358,0.383141,0.366481,0.337887,0.381776,0.457809,0.502803,0.499929,0.427909,0.364264,0.352569,0.303557,0.18396,0.131435,0.161317,0.170654,0.166145
0.232559,0.189951,0.1697,0.200918,0.222163,0.226203,0.195041,0.182096,0.164005,0.187161,0.313694,0.463352,0.525172,0.471362,0.393561,0.42555,0.531078,0.479525,0.38728,0.359925,0.303454,0.321745,0.334765,0.221075,0.14612,0.162747,0.179753,0.208697
0.287907,0.217159,0.188837,0.22671,0.243619,0.264577,0.256035,0.239609,0.208377,0.227212,0.353794,0.521172,0.601691,0.522842,0.438481,0.485872,0.61742,0.545629,0.419072,0.370607,0.291277,0.346061,0.43384,0.31873,0.199275,0.2037,0.209747,0.249174
0.367228,0.281768,0.253448,0.264277,0.228216,0.282112,0.334928,0.322367,0.280864,0.281667,0.353494,0.471959,0.550428,0.506303,0.449531,0.482346,0.62631,0.611552,0.486647,0.401573,0.305413,0.381206,0.554441,0.444161,0.261638,0.253249,0.242512,0.264394
0.42176,0.342484,0.31494,0.28392,0.194878,0.27923,0.404446,0.422417,0.366284,0.323983,0.340361,0.384472,0.426087,0.464161,0.466513,0.468375,0.603581,0.671399,0.571407,0.423561,0.315819,0.437398,0.690072,0.574546,0.311939,0.274786,0.261182,0.246446
0.410614,0.356865,0.334956,0.276559,0.169304,0.260649,0.424012,0.480804,0.409031,0.318336,0.337308,0.36584,0.372449,0.488649,0.549524,0.525428,0.613684,0.690768,0.589656,0.401559,0.297251,0.44272,0.730301,0.633633,0.323641,0.243262,0.240793,0.209776
0.362842,0.320227,0.301731,0.231489,0.143713,0.225339,0.385474,0.451774,0.36491,0.260807,0.29924,0.358736,0.369557,0.491885,0.563607,0.516347,0.529465,0.581796,0.507226,0.34119,0.258104,0.368831,0.607238,0.56208,0.293879,0.187998,0.193961,0.177203
0.321488,0.259872,0.247677,0.180517,0.138493,0.221722,0.346866,0.358798,0.268969,0.211115,0.249335,0.303134,0.313493,0.397973,0.453103,0.408631,0.399397,0.410425,0.389766,0.290098,0.251249,0.29447,0.388129,0.39255,0.258796,0.18686,0.183627,0.176012
0.24361,0.174575,0.167744,0.125219,0.134316,0.223101,0.282258,0.242023,0.206973,0.200346,0.216094,0.247743,0.239457,0.267859,0.279125,0.273268,0.296168,0.263279,0.272993,0.264592,0.260842,0.252867,0.232374,0.249019,0.213803,0.178425,0.170208,0.173821
0.172406,0.117057,0.091597,0.086233,0.121852,0.185482,0.185001,0.135723,0.15254,0.200063,0.21531,0.212064,0.211938,0.205855,0.168477,0.208638,0.271969,0.220397,0.217034,0.233266,0.243239,0.248286,0.220445,0.220761,0.198052,0.147378,0.124784,0.138005
0.124396,0.093533,0.052599,0.062471,0.093119,0.122147,0.101751,0.079104,0.112179,0.184701,0.217063,0.185621,0.179942,0.157919,0.117955,0.179758,0.250289,0.213407,0.198717,0.191589,0.186747,0.206904,0.192091,0.187861,0.175624,0.106915,0.075671,0.092042
0.105852,0.075547,0.035427,0.052263,0.074687,0.081996,0.069245,0.063054,0.082657,0.155362,0.196343,0.148578,0.126295,0.112938,0.093756,0.142075,0.192037,0.177035,0.162784,0.152661,0.135548,0.140337,0.145373,0.159948,0.150988,0.090382,0.066842,0.078978
0.096842,0.063924,0.031373,0.049885,0.068815,0.076121,0.060188,0.054797,0.071035,0.128138,0.148775,0.097199,0.074018,0.081408,0.076073,0.089303,0.113552,0.126067,0.140816,0.119833,0.101934,0.101801,0.115349,0.130372,0.116836,0.082549,0.074416,0.071016
0.078475,0.050894,0.026187,0.042951,0.057323,0.066089,0.055747,0.049329,0.058539,0.09575,0.102086,0.068143,0.057304,0.066264,0.053404,0.044915,0.052353,0.08532,0.117237,0.088798,0.087504,0.089684,0.089253,0.089708,0.073767,0.066212,0.073692,0.060086
0.062475,0.045245,0.025877,0.035164,0.040926,0.049658,0.046938,0.041133,0.050286,0.075394,0.075622,0.060773,0.064049,0.058224,0.040019,0.02958,0.03539,0.070548,0.087105,0.072729,0.082475,0.069603,0.056722,0.054981,0.039893,0.044198,0.060792,0.044212
