4e-05,1.1e-05,3e-06,3.6e-05,3.5e-05,3e-05,1e-05,6.1e-05,1.1e-05,2.7e-05,3.2e-05,6.6e-05,3.9e-05,5e-06,4e-06,7e-06,2.9e-05,0.000185,2.5e-05,2.9e-05,9.8e-05,1.2e-05,5.7e-05,9.7e-05,3.8e-05,7.8e-05,4.3e-05,0.000139,0.000124,5e-05,0.000143,7.7e-05,1.7e-05,7e-06,6.9e-05,5.7e-05,9.7e-05,0.000158,5.9e-05,3.5e-05,6.8e-05,4.6e-05,7.8e-05,6.8e-05,1.5e-05,0,6.5e-05,7.7e-05,3.2e-05,8.1e-05,0.000132,9e-05,0.000137,0.000161,0.000106,3.8e-05,6.7e-05,7.7e-05,9.8e-05,5.1e-05,0.000194,0.000158,5.1e-05,1.6e-05,5.8e-05,4.5e-05,6.3e-05,0.000154,5.5e-05,7.2e-05,6.9e-05,1e-06,4e-05,3.8e-05,9.3e-05,4.5e-05,1e-05,9e-05,2.8e-05,8.3e-05,2.9e-05,5.7e-05,7.1e-05,0.000176,9e-05,5e-05,3e-05,4.9e-05,8.2e-05,6.2e-05,7.3e-05,8e-06,4.4e-05,1.3e-05,6.6e-05,7.5e-05,2.5e-05,0.000106,8.8e-05,1.2e-05,8.6e-05,0.000129,7.3e-05,3e-05,4.5e-05,1e-04,9.5e-05,1e-05,3.4e-05,8.9e-05,1.4e-05,3.2e-05,0.000122,6.4e-05,0,6e-06,5e-06,5e-05,5.9e-05,6.8e-05,3.8e-05
9.3e-05,6e-05,4.9e-05,0.000104,9.7e-05,8.3e-05,2.5e-05,0.000176,9.9e-05,5.5e-05,0.00011,0.000163,8.3e-05,4.9e-05,3.6e-05,8.5e-05,5.1e-05,0.000396,7.5e-05,6.8e-05,0.00017,2e-05,0.000119,0.000214,4.7e-05,0.000192,0.00011,0.000313,0.000172,2.6e-05,0.000311,0.000161,3.7e-05,1e-04,0.000145,9e-05,0.000171,0.000319,0.000205,6.3e-05,0.000109,7.5e-05,0.00018,0.000167,6.9e-05,9.7e-05,0.000102,0.00018,8.4e-05,8.9e-05,0.000276,0.000184,0.000194,0.000382,0.000326,6.8e-05,0.000106,0.000147,0.000304,0.00017,4e-04,0.000299,6.2e-05,7.1e-05,0.000126,1e-04,9.8e-05,0.000343,0.000149,0.000157,0.000205,0.000135,0.000115,0.000104,2e-04,0.000111,0.000131,0.00025,7.1e-05,2e-04,6.2e-05,0.000164,0.000144,0.000398,0.000229,0.000182,3.9e-05,0.000129,0.000134,0.00013,0.000193,5.5e-05,0.000127,5.6e-05,0.00021,0.000121,9.1e-05,0.000251,0.000184,6e-05,0.000187,0.000277,0.000182,8.5e-05,9.6e-05,0.000212,2e-04,5.1e-05,0.000113,0.000191,0.000124,1.4e-05,0.00034,0.000188,4.5e-05,7e-05,4.5e-05,9e-05,0.000159,0.000212,9.1e-05
0.000151,0.000264,9.2e-05,0.000209,9.7e-05,7.2e-05,4.3e-05,0.000209,4.8e-05,0.000203,0.000331,0.000192,0.000216,0.000103,0.00016,0.000126,0.000186,0.000647,9.9e-05,0.000212,0.000308,8.9e-05,0.000172,0.000305,0.000111,0.000313,0.000214,0.000318,0.000435,0.000173,0.000515,0.000182,0.000148,0.000187,0.000213,0.000178,0.000188,0.000435,0.000107,0.000112,0.000226,0.000116,0.000156,0.000147,0.000167,0.000201,0.00023,0.000203,0.000134,0.000329,0.000278,0.000553,0.000439,0.00038,0.00021,8.6e-05,0.000185,0.000191,0.000187,0.000544,0.000665,0.000232,0.000393,1.1e-05,0.000126,0.000422,0.000287,0.000474,0.00012,0.000122,1.7e-05,9.8e-05,0.000159,7.3e-05,9e-05,0.000526,5e-05,0.000328,0.000312,0.00036,2e-04,0.000257,0.000174,0.000367,0.000118,0.000307,0.000101,3e-04,0.000268,0.000244,0.000173,8e-05,0.000124,3.1e-05,0.000209,0.000119,0.000276,0.000428,0.000251,6.1e-05,0.000215,0.000304,0.000245,8.4e-05,0.000164,7.3e-05,0.000302,5.7e-05,0.000188,0.000496,0.000181,7.9e-05,0.000393,3.1e-05,0.000166,0.000166,8.8e-05,7.3e-05,1.9e-05,0.000319,7.7e-05
0.000451,7.6e-05,0.00037,0.000488,0.000559,0.000255,0.000286,0.000312,0.000429,0.000521,0.000322,0.000256,0.000602,0.00063,0.000275,0.000383,0.000343,0.000728,0.000542,0.000497,0.000505,0.000217,0.000383,0.000397,0.000607,0.000695,3.4e-05,0.000391,0.00021,0.000579,0.00047,0.000184,0.000312,0.000569,0.000788,0.00065,0.000508,0.00079,0.000765,0.000597,0.000367,0.000357,0.000137,0.000291,0.000473,0.000413,0.000182,0.000687,0.000494,0.000293,0.000355,0.000775,0.000515,0.000429,0.000662,0.000252,0.000375,0.000633,0.000539,0.000796,0.000482,0.000776,0.000549,0.000485,0.000355,0.0012,0.000576,0.000358,0.000301,0.000108,0.000478,0.000204,0.000433,0.000282,0.000321,0.00076,0.000555,2e-04,0.000243,0.000535,0.00027,0.000314,0.000369,0.000403,0.00029,0.000655,0.000402,0.000472,0.000728,0.000158,0.000511,0.000307,0.000224,0.000199,0.000204,0.000415,0.000362,0.00083,0.000598,0.000346,0.000264,0.000358,0.000349,0.000285,0.000258,0.000418,0.000274,0.000137,9e-05,0.000508,0.000851,0.000555,0.000366,0.000289,7e-05,0.000223,0.000532,0.000249,0.000287,0.000392,0.000369
0.001149,0.000829,0.000204,2e-04,0.00068,0.000662,0.000558,4e-04,0.000773,0.000539,0.000914,0.001108,0.001099,0.001088,0.00129,0.000597,0.000508,0.001277,0.001242,0.000513,0.00053,0.000291,0.000273,0.000178,0.000492,0.000619,0.000886,0.000676,0.000664,0.000694,0.001121,8e-04,0.00066,0.00036,0.000908,0.00084,0.000736,0.000344,0.000837,0.000511,0.000308,0.000152,0.000407,0.000156,0.000258,0.000953,0.000732,0.001019,0.000924,0.000848,0.000868,0.000171,0.000779,0.00021,0.001147,0.001265,0.000409,0.00053,0.000764,0.001548,0.002105,0.002283,0.001932,0.000877,0.000685,0.001707,0.001694,0.001016,0.00058,0.000315,0.000752,0.000467,0.000797,9e-04,0.00106,0.001518,0.001298,0.000987,0.000901,0.000117,0.000834,0.001041,0.000565,0.000599,0.000656,0.00108,0.00113,0.001271,0.000776,0.000686,0.000403,0.000336,0.000113,0.000446,0.00037,0.00022,4.6e-05,0.000504,0.000412,0.000223,0.000622,0.000818,0.000711,0.000759,0.000655,0.00085,0.000306,0.000434,0.000282,0.000706,0.001039,0.001301,0.000696,0.000343,0.000194,0.000378,0.000548,0.000743,0.000322,0.00064,0.000884
0.000805,0.000745,0.000463,0.000275,0.000551,0.000395,0.000219,0.000822,0.00033,4e-05,0.00083,0.000523,0.000481,0.000529,0.000711,0.000192,0.000187,0.000851,0.000522,0.000335,0.000307,0.000433,0.000582,0.000393,0.000302,0.000355,0.000311,0.000187,7.4e-05,0.000268,0.00028,0.000358,0.000158,0.000398,0.000625,0.000258,0.000589,0.000775,0.00061,0.000473,0.000724,0.000254,0.000295,6.3e-05,0.000111,0.000755,0.000273,0.000659,0.000473,0.00022,0.00044,0.000747,0.000614,0.000568,0.000991,0.000586,0.000448,9e-05,0.00084,0.000619,0.001117,0.00085,0.000586,0.00033,0.000506,0.00124,0.000361,0.000489,0.000648,0.000248,0.000312,0.000241,0.000556,0.000913,0.000392,0.000924,0.000685,0.000844,0.000372,0.00036,0.000938,0.000618,0.000155,0.000914,0.000207,3e-04,0.000822,0.000431,0.000112,0.000437,0.000484,0.000426,0.000204,0.000387,0.000172,0.000175,0.000585,0.000301,0.000403,0.000636,0.000398,0.000386,0.000293,0.000413,0.000346,0.000457,0.000495,4.7e-05,4.1e-05,0.000763,0.000185,0.000553,0.000374,0.000353,0.000204,0.000261,0.000872,0.000728,0.000394,0.000402,0.000634
0.000672,6.6e-05,0.000228,0.000268,0.000416,0.000218,0.000354,0.000611,0.000595,4.2e-05,0.000845,0.000356,0.000582,0.000531,0.000176,0.000576,1.7e-05,0.000485,0.000234,0.000531,0.000404,0.000765,9.9e-05,8.2e-05,0.000174,0.000535,0.000394,0.000469,0.000599,0.000409,0.000142,0.000271,0.000191,0.000314,0.000355,0.000256,0.000666,0.000674,0.00048,0.000374,0.000789,0.000618,0.000132,0.000275,0.000385,0.000662,0.000638,0.000325,0.000609,0.000339,0.000368,0.000534,0.001139,0.001079,0.000799,0.00058,0.000229,0.000164,7e-04,0.000941,0.000356,0.000573,0.000362,0.000469,0.000436,0.001104,0.000548,0.000933,0.000619,0.000215,0.000223,0.000395,0.000111,0.001139,0.000807,0.00047,0.001054,0.000324,0.000268,0.000344,0.000273,0.000648,0.000444,0.000812,0.000942,0.000637,0.000781,0.000469,0.000245,0.000511,6.7e-05,0.000624,0.00026,0.000191,0.000501,0.000408,0.000652,0.000433,0.000657,0.000507,0.000423,0.000327,0.000455,0.000395,0.000187,0.000801,0.000533,0.000327,0.000105,0.000704,0.000714,0.000282,0.00027,0.000486,0.000482,0.00028,0.000546,0.000564,0.000164,0.000313,0.000567
0.000359,0.000438,0.000378,0.000688,0.000458,0.000697,0.000464,0.000312,0.000242,0.000504,0.001175,0.000323,0.000913,0.000618,0.000355,0.000857,0.000805,0.000367,0.000314,0.000823,0.000598,0.000638,0.000636,9.5e-05,0.000719,0.000669,0.000733,0.000648,0.001354,0.000757,0.000988,0.001136,0.000903,0.000242,0.000218,0.000261,0.000518,0.001038,0.000416,0.000387,0.001022,0.00028,0.000581,0.00044,0.000303,0.000642,0.000824,0.000837,0.001113,0.000706,0.000295,0.000377,0.000815,0.001253,0.000752,0.000368,0.00101,0.000802,0.000669,0.000404,0.000127,0.000433,0.000477,0.000594,0.000155,0.000727,0.000515,0.001061,0.001485,0.001034,0.000107,0.00061,0.000803,0.00092,0.000642,0.000452,0.00161,0.001392,0.000685,0.00016,0.000715,0.000894,0.001171,0.001546,0.001446,0.000267,0.000786,0.000603,0.000526,0.000123,0.000521,0.001191,0.000819,0.000328,0.000546,0.00056,0.000719,0.000385,0.000354,0.001142,0.000632,0.000654,0.001119,0.000621,0.000284,0.001394,0.001326,0.001013,0.000667,0.000671,0.000712,0.000294,0.000613,8.7e-05,0.00031,0.000428,0.000316,0.000573,0.000649,0.000416,0.000529
0.00064,0.000394,0.000283,0.000682,0.000585,0.001048,0.001493,0.001014,0.000538,0.000387,0.000758,0.001035,0.001336,0.001681,0.000664,0.001147,0.001596,0.00067,0.000235,0.000518,0.00056,0.000929,0.000546,0.000895,0.001392,0.000734,5.9e-05,0.000475,0.001279,0.00066,0.001023,0.000419,8.8e-05,0.000476,0.000243,0.000339,0.000596,0.000702,0.000378,0.000455,0.000746,0.000808,0.000575,0.000409,0.000544,0.001176,0.00025,0.00085,0.000565,3.7e-05,0.000445,0.000226,0.000209,0.00072,0.000234,0.000583,0.001212,0.000573,0.00032,0.000963,0.00049,0.00053,0.000859,0.000842,0.000841,0.00093,0.00064,0.000765,0.000984,0.001276,0.000812,0.001272,0.001357,0.001284,0.001537,0.001217,0.001842,0.001452,0.00122,0.001043,0.001328,0.000683,0.000861,0.001113,0.000984,0.000947,0.001002,0.001095,0.000628,0.000368,0.000659,0.000841,0.000311,0.000184,0.000589,0.001011,0.001598,0.002008,0.001263,0.001394,0.001154,0.000909,0.00095,0.000705,0.000855,0.001073,0.001451,0.001272,0.000558,0.000391,0.000409,0.000614,0.001246,0.001254,0.000697,0.000254,0.000662,0.001045,0.000659,0.000262,0.000773
0.001136,0.000713,0.000592,0.000848,0.000831,0.000401,0.000717,0.000433,0.000304,0.000491,0.000504,0.00052,0.000323,0.000936,0.000922,0.000782,6e-04,0.000755,0.000251,0.000261,0.000866,0.000603,0.000509,0.000646,0.000557,0.000644,0.00039,0.000207,0.000483,0.000648,0.000206,0.000559,0.000385,0.000582,0.000521,8e-04,0.000607,0.000671,0.000847,0.000185,0.000173,0.000333,0.000332,0.000417,0.000855,0.001035,0.001099,0.000424,0.000496,0.000486,0.000723,0.000529,0.000748,0.000257,0.000493,0.000627,0.000302,0.000368,0.00042,0.001248,0.000916,0.000887,0.00106,0.00086,0.000583,0.000337,0.000117,0.000744,0.000442,0.001188,0.000562,0.001129,0.000151,7.2e-05,0.000685,0.00056,0.000613,0.000218,0.000475,0.000253,0.000678,0.000482,0.000374,0.000894,0.001356,0.000557,0.000743,0.000648,0.000245,0.000683,0.000109,0.001006,0.000819,0.000248,0.000182,0.00065,0.000768,0.001156,0.000886,0.000513,8.7e-05,0.000515,0.00042,0.000583,7.3e-05,0.000119,0.000419,0.000195,0.000317,0.000846,0.000294,0.000336,0.000744,0.000512,0.000635,0.000733,0.000582,0.000256,0.000139,0.000114,0.000464
0.000766,0.000395,0.000743,3.9e-05,0.000459,0.000831,0.001121,0.000558,0.000477,3e-04,0.000534,0.000384,0.000329,0.000791,0.000563,0.000224,0.000315,0.000514,0.000624,0.000243,0.000701,0.000323,8.7e-05,0.00058,0.000803,0.000874,0.000699,0.000677,0.000415,0.00026,0.000351,0.000209,0.000378,0.000152,0.000388,0.000407,0.000385,0.001134,0.001131,0.001164,0.000541,0.000139,0.000545,0.000682,0.000341,0.000407,0.000372,0.000816,0.000682,9.4e-05,0.000678,0.000206,0.000378,0.000662,9e-04,0.000477,0.000193,0.000248,0.000399,6e-04,0.000583,0.000476,0.000459,0.000773,0.000493,0.000232,0.000164,0.000445,0.000709,0.000867,0.000336,0.000619,0.00081,0.000761,0.000763,0.000645,0.000295,0.000346,0.000728,0.000521,0.00044,0.00028,0.000322,0.000689,0.001118,0.000867,8e-04,0.000243,0.000308,0.000716,0.000487,0.000546,0.000605,0.000717,0.000492,0.000296,0.000882,0.000436,0.000164,0.000445,0.000746,0.000538,0.000271,0.000349,0.000551,0.000841,0.000653,0.000328,0.000122,0.000675,0.000718,0.000814,0.000867,0.000557,4e-04,0.000208,0.00045,0.000543,0.000472,0.000476,0.000407
0.000658,0.000345,0.000393,0.000291,0.000308,0.000284,0.000326,0.000367,0.00038,4e-04,0.000755,0.000608,0.000502,0.000525,0.000689,0.000169,0.000331,0.000247,0.000153,0.000224,0.000327,0.000163,0.000133,0.000143,0.000605,0.000296,0.000767,0.000662,0.000687,0.000546,0.000655,0.000504,0.000188,0.000161,1.7e-05,0.000319,0.000571,0.000679,0.000153,0.000417,0.000177,0.000258,0.000457,0.000671,0.000768,0.000705,0.000202,0.000361,0.000144,0.000303,0.000757,0.000392,9.8e-05,0.000524,0.000459,0.000338,0.000214,0.000236,0.000498,0.000506,0.000151,0.000283,0.00038,0.000232,0.000262,0.00022,0.000102,0.000147,0.000555,0.000156,0.000194,4e-04,0.00077,0.000486,0.000254,0.000634,0.000662,0.000123,0.000583,0.000388,0.000367,0.000349,3.5e-05,0.000636,0.000336,0.000231,0.000143,3.9e-05,0.000158,0.000332,0.000406,0.000609,0.000545,0.000782,0.000537,0.000556,0.00021,0.000183,0.000133,0.000264,0.000423,0.000439,0.000339,8.9e-05,0.00037,0.000508,0.000466,0.000147,0.000109,0.000351,0.000386,0.00046,0.000294,0.000226,3.2e-05,2e-04,0.000258,0.000356,0.000196,0.000111,0.000146
0.000264,9e-05,0.000218,0.000411,0.000356,0.000301,0.000476,0.000238,0.000107,0.000235,0.00028,0.000206,0.000189,0.000399,7.3e-05,0.000234,0.000606,0.000251,6.9e-05,0.000276,0.000352,0.000179,0.000149,0.000164,0.000561,0.000108,0.000631,0.000119,0.000177,0.000197,0.000293,0.000287,8.7e-05,0.000206,0.000244,0.000117,0.000232,0.000562,3.5e-05,0.000399,0.000153,0.000245,0.000294,0.000398,0.000107,0.000332,8.3e-05,0.000258,6.3e-05,0.00016,0.000528,0.000497,0.000239,0.000247,0.000125,0.000174,0.000166,0.000323,0.000341,0.000498,0.000166,0.000223,0.000177,0.000323,0.000359,0.000163,0.000225,8.1e-05,0.000436,7e-05,8.8e-05,0.000332,0.000477,0.000194,0.000418,0.000465,7.9e-05,0.000402,0.000244,0.000273,0.000175,7.6e-05,0.000153,0.000555,8.1e-05,0.000249,0.000236,0.000123,0.000217,0.000176,0.000201,0.00012,0.000415,0.000418,0.000196,0.000164,0.000162,0.000117,0.00015,0.000142,0.000202,9.1e-05,9.3e-05,0.000145,0.00024,0.000178,0.000142,2.1e-05,9.9e-05,0.00017,0.000178,0.000264,0.000323,0.000107,8.7e-05,9.5e-05,0.00018,0.000132,0.000175,3.9e-05,0.00018
0.00039,0.000287,0.000182,0.000319,0.000232,5e-05,0.000282,0.000315,0.000163,0.000228,0.000227,0.000318,0.000161,0.000259,9.2e-05,0.000222,0.000474,8.6e-05,0.000105,0.000187,0.000242,5.2e-05,2e-04,0.000437,0.000417,0.000135,0.00045,1e-04,0.000269,0.000174,0.000205,0.000236,0.000178,0.000173,0.00038,0.000362,0.000112,0.000483,0.000256,0.000525,0.000267,0.000141,0.000349,0.00029,0.000179,0.000446,0.000264,0.000199,9.8e-05,0.000286,0.000202,0.000263,0.000356,0.00057,0.000173,0.000221,8.9e-05,0.000213,0.000378,0.000505,3.4e-05,0.000159,8.3e-05,0.000235,0.000212,0.000242,0.000301,0.000193,0.000491,0.000151,7e-05,5e-05,0.000261,0.000227,0.000294,0.000263,0.000133,0.000126,0.000204,0.000366,0.000242,0.000159,0.000279,0.000538,0.000272,0.000411,0.00043,8.7e-05,0.000134,0.000157,5.2e-05,0.000269,0.000265,0.000381,0.000317,0.000198,0.000187,0.000292,0.00034,0.000192,5.7e-05,0.000162,0.000187,4e-05,4.7e-05,0.000147,0.000246,0.000259,0.000194,0.000205,8.9e-05,0.000124,0.000476,0.000111,0.000227,9.4e-05,0.000126,0.000192,0.000156,0.000106,0.000166
0.000637,0.000366,0.000395,0.000211,0.00027,0.000249,0.000537,0.00062,0.00027,0.000425,0.000291,0.000107,0.000187,0.000592,7.3e-05,0.000371,0.000595,0.000197,0.000313,7.3e-05,0.000407,0.000112,8.6e-05,0.000521,0.000515,0.000104,0.001032,0.000207,0.00041,7.3e-05,0.000318,0.000717,0.000517,0.000309,0.000323,0.000314,9.3e-05,0.000293,0.000155,0.000683,7.1e-05,0.000551,0.000617,0.000522,0.000463,0.000621,0.000343,0.000281,0.000103,0.000529,0.000448,0.000231,0.000275,0.000252,0.000348,0.000444,0.000225,0.000641,0.000173,0.000459,0.000351,0.000533,0.000367,0.000525,0.000263,0.000258,0.000232,0.000366,0.000519,0.000411,0.000148,0.000356,0.000384,0.000456,0.00053,0.000148,0.000309,0.000199,0.000175,0.000366,0.000318,0.000193,0.000131,0.000316,0.00047,0.000467,0.000484,0.000545,0.000774,0.000407,0.000164,0.000689,0.000617,0.000223,0.000313,9.5e-05,0.000207,0.000311,0.000179,0.000373,0.00037,0.000344,0.00014,0.000329,0.00029,0.000304,0.000303,0.000255,0.000376,0.000232,0.000404,0.000424,0.000536,0.000299,0.000234,0.000185,0.000181,0.000464,0.000409,4.9e-05,0.00027
0.000908,0.000374,0.000557,0.000156,0.00053,0.000465,0.001351,0.000273,0.000308,0.000438,0.000175,0.000382,0.00014,0.000684,0.000762,0.000273,0.001193,0.000552,0.000406,0.000573,0.000831,0.000646,0.000367,0.000616,0.001257,0.000241,0.001771,0.001484,0.00022,0.000106,0.000678,0.001211,0.001193,0.000857,6.8e-05,0.000582,0.000261,0.000861,0.000553,0.000791,0.00109,0.000746,0.000218,0.001576,0.001281,0.000367,0.001305,0.000459,0.000477,0.000526,0.000311,0.000549,0.000604,0.000639,0.000798,0.000173,5e-05,0.000926,0.000959,0.000159,7.6e-05,0.000774,4.9e-05,0.000552,0.000459,0.000216,0.000453,0.000666,0.000297,0.000228,0.000285,0.000721,0.000276,0.000783,0.001076,0.000149,0.000518,0.000861,0.000786,0.000427,0.00013,0.000409,0.000297,0.000661,0.000625,0.000825,0.000262,0.000507,0.000638,0.000677,0.000671,0.000762,0.001298,0.001129,0.00061,0.000229,0.000171,0.000173,0.00057,0.000483,0.000507,0.000341,0.000465,0.000456,0.000537,0.000335,0.000434,0.000522,0.000228,0.000223,0.000416,0.00057,0.000575,0.000443,0.000677,0.000348,0.000269,0.000376,0.000195,0.000621,0.000476
0.001989,0.001792,0.001132,0.000553,0.000616,0.000313,0.001391,0.001732,0.001475,0.000535,0.000727,0.001293,0.000844,0.00061,0.00065,0.000821,0.00141,0.001916,0.000662,0.000135,0.001128,0.001082,0.001044,0.001229,0.002075,0.001911,0.002768,0.002968,0.002362,0.00147,0.00144,0.001621,6e-04,0.000658,0.001347,0.001824,0.001604,0.001959,0.002192,0.001131,0.001422,0.001772,0.001043,0.001741,0.00225,0.002492,0.003178,0.002039,0.001209,0.000882,0.001161,0.001293,0.001366,0.000316,0.000635,0.000848,0.000637,0.000787,0.000797,0.001202,0.001066,0.001214,0.001154,0.000745,0.001265,0.000962,0.000291,5.6e-05,0.000171,0.000282,0.000509,0.001072,0.001193,0.001258,0.002537,0.001854,0.000378,0.001027,0.001056,0.00146,0.000961,0.000896,0.000856,0.000473,0.001139,0.000765,0.000624,0.000566,0.001034,0.001852,0.001298,0.001259,0.002252,0.002263,0.001796,0.000759,0.000749,0.000897,0.00133,0.001553,0.001745,0.000813,0.000725,0.000672,0.000336,0.000421,0.000917,0.000951,0.000983,0.000863,0.000741,9.7e-05,0.000877,0.000808,0.000334,0.000168,0.00048,0.000959,0.000563,0.000988,0.001155
0.000174,0.000727,0.00091,0.000901,0.000565,0.000385,0.000817,0.001187,0.00034,0.000524,0.001332,0.001245,0.000625,0.000347,0.000108,0.00066,0.000453,0.001204,0.001157,0.000599,0.001042,0.000124,0.000561,0.000824,0.00051,0.001103,0.001218,0.000664,0.00029,0.000583,0.000495,0.000364,0.000606,0.000869,0.000714,0.001336,0.001346,0.000912,0.001436,0.001259,0.000413,0.000771,0.000579,0.001354,0.000705,0.000805,0.00159,0.000562,0.00052,0.000316,0.000502,0.000563,0.00044,0.000933,0.000162,0.000375,0.000474,0.001072,0.000518,0.000849,0.001412,0.000352,0.000639,0.000707,0.000769,0.000434,0.000284,0.000491,0.00043,0.000586,0.000289,0.000617,0.000502,0.000176,0.001644,0.002215,0.001648,0.000237,0.000769,0.00087,0.001095,0.000614,0.000488,0.000646,0.000602,0.000277,0.000508,0.000601,0.00052,0.001193,0.001688,0.001582,0.000449,0.000721,0.001596,0.001145,0.001026,0.000685,0.000523,0.001094,0.000747,0.000992,0.00064,0.000129,0.000254,0.000384,0.000463,0.000134,0.000602,0.000742,0.000245,0.000284,0.000447,0.000643,0.000678,0.000562,0.000576,0.000617,0.000839,0.000294,0.000216
0.000348,0.000332,0.000203,0.000312,0.000713,0.000615,0.000973,0.000296,0.000332,0.000518,0.000463,0.000486,0.000488,0.000382,0.000465,0.000294,0.000329,0.000373,0.000672,0.000727,0.00026,9.8e-05,0.000311,0.000552,0.000611,0.000299,0.000539,0.000461,0.000465,0.000195,0.000536,0.000725,0.000917,0.00033,0.000461,0.000497,0.000402,0.000412,0.000629,0.000592,0.000375,0.00057,0.000312,0.000268,0.000664,0.000836,0.000717,0.000562,0.000565,0.000385,0.000218,0.000127,0.000548,0.000404,0.000275,0.000133,0.000302,0.000383,0.000127,0.000258,0.000724,0.000319,0.000285,0.000147,0.000771,0.000745,0.000838,0.000727,0.000311,0.000383,0.000372,0.000408,5.1e-05,0.00028,0.000805,0.000774,0.00014,8.1e-05,0.000493,0.00033,0.000611,0.00089,0.000586,0.000598,0.000532,0.000338,0.000504,0.000205,0.000391,0.000592,0.000629,0.000669,0.000279,0.000494,0.000828,0.000209,0.000628,0.000756,0.000187,0.000581,0.000579,0.000503,0.000212,0.000293,0.00056,0.000201,0.00023,0.000397,0.000236,0.000207,0.000295,0.000375,0.000217,0.000457,0.000107,0.000195,0.000364,0.000338,0.000377,0.000519,0.000385
5e-06,7.5e-05,0.000276,0.000158,0.000386,0.000111,0.000435,7.4e-05,0.000142,0.000429,0.000571,0.000552,8e-05,9.8e-05,0.000208,0.000165,0.000317,3.3e-05,0.000539,0.000412,0.000489,0.000145,0.000209,0.00017,0.000148,0.000135,0.000282,0.000237,0.000381,0.000223,0.000362,0.000411,0.000269,7.5e-05,0.000338,0.000305,0.000326,0.000415,0.000176,0.000407,0.000329,0.000392,0.000208,0.000219,0.000217,0.000244,0.000383,0.000169,0.000212,0.000141,0.000195,0.000404,8.6e-05,8e-05,0.000201,0.000168,0.000326,0.000183,0.000221,0.000358,0.000178,0.000354,0.000352,0.000159,0.000384,0.000325,0.000295,0.000188,0.000146,0.000233,0.000401,0.000219,0.000208,0.000416,0.000461,0.000178,0.000114,5.2e-05,0.000251,0.00029,0.000626,0.000146,0.000246,0.000162,0.000118,0.000177,0.000201,0.000251,0.00054,0.000484,9.9e-05,0.000217,2.7e-05,0.000302,0.000352,0.000294,0.000225,0.00039,0.000172,0.000169,0.000212,0.00025,5.9e-05,0.000154,0.00032,8.6e-05,5e-05,0.000142,0.000367,0.000348,0.000174,0.000199,0.000249,6.4e-05,8.3e-05,0.000108,0.000138,0.000201,0.000267,0.000284,0.000193
0.000145,0.000277,7.6e-05,0.000179,4.1e-05,8.6e-05,0.000239,0.000101,0.000258,0.000345,0.000257,7.2e-05,0.000198,0.000244,7.8e-05,0.000257,6e-05,0.000325,0.000181,0.000228,0.00014,0.000415,0.000337,0.000242,0.000378,0.000315,0.000234,0.000154,0.000386,0.000186,0.000182,0.000312,9e-05,0.000233,0.000254,0.000279,0.000336,0.000183,6e-05,0.000246,4e-05,0.000158,0.000306,0.000123,8.6e-05,0.000238,3.8e-05,2e-04,9.8e-05,6.8e-05,0.000313,0.000266,0.000251,0.000124,0.000286,0.000199,0.000148,0.000163,0.000255,0.000244,0.000149,0.000305,0.000173,0.000178,1e-04,0.000128,0.000214,0.000166,8.9e-05,0.000328,5.6e-05,0.000173,0.000209,0.000334,0.000313,0.00022,0.000212,0.000123,0.000169,8.8e-05,0.000235,0.000122,0.000147,0.000131,0.000108,0.000152,0.000144,0.000102,0.000195,0.000258,7.2e-05,0.000199,5.3e-05,0.000266,0.000218,0.000196,0.000143,0.000163,0.000166,0.000167,0.000136,0.000124,0.000257,0.000156,0.00019,5.4e-05,8e-05,6e-05,0.000165,4.6e-05,0.000131,9e-05,0.000147,0.000156,8e-05,3.7e-05,0.000175,0.000173,0.000185,0.000105,0.000149
0.00018,0.000148,7.1e-05,0.000163,0.000188,0.000114,0.000254,0.000204,4.1e-05,9.9e-05,0.000149,0.000201,0.000199,0.000164,0.00016,0.000127,3.3e-05,0.000272,2.2e-05,0.000228,3e-05,0.000145,0.000243,9.3e-05,0.000218,0.000195,0.000216,7.9e-05,0.000124,8.6e-05,6.7e-05,0.00013,5.5e-05,0.000206,0.000226,0.000378,6e-05,0.000121,7e-06,0.000241,0.000214,9.2e-05,0.000188,0.000242,0.000209,0.000207,0.000124,0.000121,1.5e-05,9.1e-05,0.000142,0.000201,7.1e-05,2.1e-05,0.000166,6e-05,0.000235,9.6e-05,0.000263,0.000101,4.2e-05,0.000144,0.000106,5.1e-05,0.000152,0.000105,0.000101,0.000207,0.000119,0.000143,0.000138,0.000123,3.7e-05,0.000136,3e-04,0.000183,0.000119,0.000115,0.000104,0.000133,0.00021,0.000153,0.000102,0.000201,0.000182,5.8e-05,0.000125,5.3e-05,0.000178,0.000254,4.7e-05,0.000267,0.000168,0.000175,4.1e-05,8e-05,0.000226,0.000242,0.000157,8e-05,0.000193,9.6e-05,8.5e-05,8.3e-05,0.000169,4.2e-05,3.8e-05,7.5e-05,8.2e-05,7.9e-05,0.000106,7.4e-05,7.6e-05,0.00012,3.2e-05,1.5e-05,0.000166,0.000112,7.4e-05,9.7e-05,0.000107
7.9e-05,9e-06,5.5e-05,9.3e-05,4e-05,3.2e-05,6.7e-05,7.8e-05,4.8e-05,6.6e-05,3.8e-05,7.9e-05,4.9e-05,9.5e-05,3.5e-05,8.2e-05,5.9e-05,9.5e-05,6.7e-05,8.5e-05,3.4e-05,3.6e-05,4.1e-05,2.1e-05,0.000114,0.00013,5.4e-05,6e-05,4.2e-05,4.9e-05,4e-05,9.8e-05,4e-05,4.1e-05,6e-05,0.000114,9.1e-05,9.7e-05,5.2e-05,3.5e-05,4.6e-05,3.2e-05,8.6e-05,5.8e-05,6.2e-05,0.000108,4.5e-05,9.6e-05,7.2e-05,4.2e-05,8.6e-05,9.4e-05,5.1e-05,3.6e-05,5.3e-05,0.000116,7.8e-05,9.8e-05,9.6e-05,0.000109,4e-06,3.4e-05,6.9e-05,8.3e-05,6.4e-05,8.9e-05,3.1e-05,0.000107,1e-05,5e-05,0.000105,0.000106,3.4e-05,5.7e-05,0.000121,0.000104,1.4e-05,5.5e-05,7.2e-05,8.6e-05,7.9e-05,0.000103,4.3e-05,7.3e-05,8e-05,2.7e-05,1.7e-05,1e-05,6.3e-05,0.000123,2e-05,9.6e-05,5e-05,6.2e-05,5.4e-05,1.2e-05,0.000115,0.000128,9.5e-05,3.4e-05,4.4e-05,3.8e-05,6.9e-05,1.8e-05,0.000103,8e-06,2.6e-05,1.7e-05,2.9e-05,1.1e-05,7.5e-05,5.2e-05,1.2e-05,1.9e-05,1.8e-05,0,5.4e-05,4.4e-05,5.5e-05,4.2e-05,5.4e-05
8.9e-05,2.4e-05,1.2e-05,0.000123,0.000123,3e-05,9.2e-05,1.2e-05,1.1e-05,8e-05,3.4e-05,0.000112,9.2e-05,0.000107,9.8e-05,2.9e-05,7.2e-05,6.2e-05,5.7e-05,5.2e-05,9.7e-05,6.8e-05,3.7e-05,5.2e-05,6e-05,6.6e-05,9e-05,4.4e-05,1e-04,4.6e-05,9.4e-05,4.1e-05,2.9e-05,5.4e-05,7.5e-05,7e-05,2.5e-05,0.000146,4.8e-05,0.000124,7e-05,8.4e-05,3.1e-05,0.000104,8.2e-05,6.6e-05,0.000121,4.7e-05,1.2e-05,5.3e-05,5.4e-05,5.3e-05,3.7e-05,9.1e-05,7.2e-05,0.000103,0.000106,6e-05,0.00012,0.000101,0.000142,0.000113,0.000106,2.4e-05,7.3e-05,8.2e-05,7.3e-05,1e-04,5.1e-05,6.4e-05,5.6e-05,3.6e-05,5.6e-05,5.8e-05,6e-05,7.5e-05,2.5e-05,4.6e-05,0.000121,5.6e-05,3.5e-05,8.8e-05,0.000111,6.6e-05,0.000111,6.4e-05,6e-05,2.6e-05,8.6e-05,0.000118,3.2e-05,0.000101,4.9e-05,3.9e-05,9e-06,3.3e-05,0.000115,9.3e-05,4.5e-05,8.9e-05,1.6e-05,5.9e-05,8.4e-05,6.9e-05,0.000104,4.4e-05,3.8e-05,4.6e-05,6.4e-05,5.6e-05,6.5e-05,2.3e-05,3.2e-05,6.8e-05,4.9e-05,5.7e-05,5.9e-05,3e-05,3.2e-05,8e-05,6.9e-05
3e-05,7.1e-05,6e-05,8.3e-05,3.5e-05,7.2e-05,0.000104,5.5e-05,3.8e-05,0.000104,6.4e-05,5.8e-05,5.3e-05,4.9e-05,2.5e-05,3.7e-05,2.7e-05,4.9e-05,1.8e-05,6.5e-05,6.6e-05,6.5e-05,2.1e-05,3.2e-05,4.3e-05,7.2e-05,4.6e-05,3.1e-05,2.2e-05,1.4e-05,4.5e-05,7e-06,3.3e-05,7.2e-05,3.4e-05,3.2e-05,5.4e-05,8.5e-05,2.6e-05,9.4e-05,7.5e-05,2.4e-05,3.1e-05,5.4e-05,9.9e-05,5.2e-05,5e-05,5.7e-05,7.9e-05,4.6e-05,4e-05,2.9e-05,3e-05,7.7e-05,7e-05,1.8e-05,6.9e-05,4.3e-05,5e-05,4.9e-05,3.8e-05,7.3e-05,1.7e-05,2.7e-05,2.6e-05,4e-05,1.7e-05,7.5e-05,3e-05,4.9e-05,3.8e-05,8.7e-05,1.7e-05,5.3e-05,2.3e-05,0.000103,4.1e-05,4.5e-05,2.9e-05,1.7e-05,4.3e-05,3.3e-05,3.8e-05,3.9e-05,9.2e-05,8e-05,1.3e-05,4e-05,8.9e-05,5.5e-05,2.5e-05,6.1e-05,3.2e-05,2.1e-05,4.2e-05,2e-05,5.3e-05,0.000111,6.9e-05,2.1e-05,4.3e-05,3.8e-05,9.7e-05,4e-06,4e-05,4.3e-05,3.5e-05,2.2e-05,2e-05,1e-05,6.8e-05,3.1e-05,6.6e-05,2.9e-05,1.5e-05,2.9e-05,1e-04,7e-05,3.1e-05,1.7e-05,6.6e-05
2.7e-05,3.1e-05,2e-05,5.1e-05,3e-05,5.3e-05,6.7e-05,3.5e-05,4.2e-05,5.9e-05,4.1e-05,3.1e-05,5.2e-05,4.4e-05,3.2e-05,5.5e-05,1.2e-05,2.9e-05,2.6e-05,4.5e-05,4e-05,1.6e-05,1.3e-05,1.5e-05,3.5e-05,1.9e-05,6.1e-05,2.8e-05,5.4e-05,1.2e-05,2.9e-05,2.4e-05,2.2e-05,3.9e-05,3.9e-05,4.9e-05,5.5e-05,4.8e-05,4.5e-05,4.6e-05,4.5e-05,1.9e-05,2.7e-05,5.9e-05,5.4e-05,5.9e-05,2.6e-05,4e-06,4.7e-05,3.4e-05,3.3e-05,2e-05,1.5e-05,2.5e-05,3.4e-05,5e-06,3.2e-05,1.6e-05,2.1e-05,2e-05,3.5e-05,5.2e-05,3.9e-05,4e-05,2.6e-05,4.3e-05,3.6e-05,5.4e-05,3e-05,5.8e-05,9e-06,7.2e-05,9e-06,4.8e-05,2.2e-05,6.8e-05,1.6e-05,4.3e-05,1.4e-05,1.2e-05,5.6e-05,4e-06,3.4e-05,6.1e-05,2.5e-05,6.3e-05,1.4e-05,1.8e-05,9.5e-05,4.9e-05,1.2e-05,6.7e-05,2.6e-05,2.4e-05,3.4e-05,1.9e-05,6.5e-05,0.000112,3.4e-05,2.2e-05,3.9e-05,2.4e-05,7.1e-05,3.8e-05,3.3e-05,2.3e-05,1.3e-05,8e-06,1.7e-05,4.3e-05,7.9e-05,3e-05,5.8e-05,4.5e-05,9e-06,1.6e-05,7.5e-05,7e-06,2.2e-05,2.6e-05,5.9e-05
3.8e-05,3.4e-05,1e-05,7e-06,1.2e-05,2.4e-05,6.9e-05,4.4e-05,2.7e-05,5.7e-05,2.4e-05,1.8e-05,2.9e-05,9e-06,3.1e-05,5e-05,4e-06,3.1e-05,2.5e-05,5.2e-05,3.5e-05,7e-06,1.9e-05,1e-05,2.7e-05,2.2e-05,3.1e-05,4.1e-05,2.8e-05,1.2e-05,1.9e-05,1.1e-05,1e-05,3.7e-05,4.4e-05,7.3e-05,3.6e-05,2.5e-05,4e-05,4.5e-05,4.3e-05,2.4e-05,2e-05,4.8e-05,8.7e-05,4e-05,2.4e-05,4e-06,3.2e-05,1.8e-05,5.4e-05,1.6e-05,2.2e-05,3.7e-05,2.3e-05,6e-06,1.3e-05,8e-06,1.5e-05,2.6e-05,5.5e-05,4e-05,7e-06,3.3e-05,3.1e-05,1.7e-05,2.3e-05,4.1e-05,3.1e-05,3.4e-05,1.2e-05,7.1e-05,2.1e-05,4e-06,4.4e-05,7e-05,2.8e-05,3e-05,1.5e-05,1.2e-05,5.2e-05,2.3e-05,2.3e-05,5e-05,1.9e-05,3.1e-05,1.3e-05,1.5e-05,8.4e-05,4.2e-05,3e-05,6.2e-05,2.1e-05,1.7e-05,1.5e-05,1.2e-05,5.3e-05,8e-05,4.2e-05,2.7e-05,2e-05,3.4e-05,5.8e-05,2.4e-05,5.5e-05,1.3e-05,1.6e-05,1.5e-05,2.1e-05,2.6e-05,8e-05,3.8e-05,3.1e-05,2e-05,1.6e-05,2.7e-05,2.2e-05,3.5e-05,2.7e-05,3.9e-05,3.6e-05
5e-05,1.9e-05,2.8e-05,1.8e-05,2.8e-05,2.5e-05,6e-05,3.2e-05,2.4e-05,5.5e-05,4.7e-05,3.1e-05,2.2e-05,3.1e-05,5e-06,2.6e-05,2.6e-05,2.1e-05,3.8e-05,3.8e-05,3.8e-05,1.8e-05,1.8e-05,2.2e-05,4.4e-05,4.1e-05,3.5e-05,3e-05,3.7e-05,2.5e-05,3.4e-05,3.9e-05,1e-05,2.9e-05,3.6e-05,6.1e-05,4.8e-05,2.8e-05,3.8e-05,4.6e-05,1.3e-05,2.7e-05,3e-06,2.4e-05,7.3e-05,3.5e-05,3.7e-05,2.7e-05,1.6e-05,1.9e-05,3.6e-05,2.1e-05,6e-06,3.9e-05,2.7e-05,9e-06,2.4e-05,3.2e-05,3e-05,2e-05,4.4e-05,3e-06,1.7e-05,3.4e-05,3.7e-05,3.2e-05,3.1e-05,3.7e-05,2.2e-05,4.9e-05,9e-06,5.8e-05,3.1e-05,2.4e-05,4.3e-05,7.7e-05,2.8e-05,2.5e-05,1.8e-05,4e-06,4.7e-05,2.2e-05,2.6e-05,2.7e-05,5.3e-05,5.1e-05,1.4e-05,1.6e-05,7.4e-05,5.1e-05,2.9e-05,6.4e-05,1.2e-05,1.5e-05,1.4e-05,5e-06,3.5e-05,5.9e-05,3.8e-05,3.1e-05,3.2e-05,3.8e-05,3.1e-05,3e-05,5.3e-05,1.9e-05,1.8e-05,2e-06,1.3e-05,2.1e-05,6e-05,1.8e-05,9e-06,1.6e-05,1.6e-05,1.8e-05,3.5e-05,1.3e-05,3.3e-05,3.2e-05,3.4e-05
3e-05,2.2e-05,1.7e-05,3.2e-05,2.1e-05,3.6e-05,3.1e-05,5.5e-05,1.6e-05,4.1e-05,3.8e-05,9e-06,2.5e-05,4.6e-05,2.7e-05,2.2e-05,1.9e-05,2.8e-05,4.5e-05,3.8e-05,5e-05,1.2e-05,1.5e-05,1.7e-05,2.8e-05,2.3e-05,2.7e-05,5e-05,2.7e-05,2.1e-05,3.2e-05,2.9e-05,4e-06,2.4e-05,2.6e-05,5.5e-05,3.9e-05,2.3e-05,3.5e-05,3.6e-05,5.3e-05,3.8e-05,2.1e-05,2.7e-05,5.2e-05,5.5e-05,3.9e-05,2e-05,3e-06,6e-06,2.7e-05,2.3e-05,2.4e-05,9e-06,3e-05,1e-05,2.9e-05,2.2e-05,8e-06,8e-06,5e-06,2.2e-05,5e-06,3e-05,2.6e-05,4e-05,2.3e-05,3.4e-05,2.5e-05,4.5e-05,1.7e-05,7.3e-05,3.2e-05,2.3e-05,2.2e-05,5.3e-05,1.8e-05,2e-05,1.6e-05,1.2e-05,3e-05,2.8e-05,3.3e-05,3e-05,3.3e-05,4e-05,3.2e-05,2.1e-05,6.1e-05,4.9e-05,3e-05,5e-05,1.5e-05,1.6e-05,1.1e-05,1.8e-05,5.8e-05,7e-05,2.5e-05,2e-05,4.4e-05,1.8e-05,5.1e-05,1.7e-05,5.4e-05,9e-06,1.5e-05,3e-06,9e-06,2.4e-05,5.6e-05,4e-06,2.4e-05,2.6e-05,2e-05,2.2e-05,3.6e-05,2.5e-05,1.4e-05,2.9e-05,3.4e-05
3.3e-05,1.2e-05,1.3e-05,1.3e-05,2.2e-05,3.1e-05,3.8e-05,4.2e-05,4.7e-05,4.5e-05,2.1e-05,8e-06,1.9e-05,4.9e-05,2.7e-05,2.9e-05,1.3e-05,1e-05,4.4e-05,3.7e-05,5e-05,4.3e-05,2.7e-05,3.3e-05,2.9e-05,3.3e-05,1.8e-05,2.7e-05,3.3e-05,4.7e-05,4.1e-05,2.8e-05,1.2e-05,1.4e-05,2.6e-05,5.8e-05,2.6e-05,2.9e-05,1.7e-05,1.7e-05,3.2e-05,2.6e-05,1e-06,2.2e-05,3.9e-05,3.4e-05,2.2e-05,1.7e-05,9e-06,1.9e-05,5.6e-05,1.2e-05,2.9e-05,3.3e-05,6e-06,4.2e-05,2.6e-05,1.8e-05,6e-06,3e-05,2.1e-05,3.1e-05,2.2e-05,5.6e-05,1.5e-05,3.6e-05,4.5e-05,4.2e-05,2.5e-05,5.9e-05,2.8e-05,5.1e-05,4e-05,9e-06,2.5e-05,4.2e-05,1.5e-05,3.3e-05,2.1e-05,2.1e-05,9e-06,2.6e-05,3.2e-05,2.6e-05,3.1e-05,5.9e-05,3.8e-05,3.8e-05,5.9e-05,5.5e-05,3.8e-05,7.4e-05,1e-05,5e-06,2.3e-05,4.3e-05,8e-05,6.9e-05,2.5e-05,1e-05,5.7e-05,2.1e-05,3e-05,9e-06,7.4e-05,7e-06,3.7e-05,1.7e-05,7e-06,1.6e-05,8.1e-05,2.5e-05,3.5e-05,1e-05,2.3e-05,2.6e-05,3.1e-05,2.9e-05,1.5e-05,1.9e-05,3.3e-05
1.3e-05,1.8e-05,2.8e-05,1e-05,2.7e-05,2.4e-05,9e-06,5.8e-05,3.5e-05,8.3e-05,3.8e-05,9e-06,8e-05,3.6e-05,2.6e-05,1.9e-05,2.7e-05,4.6e-05,3e-05,2.5e-05,6.4e-05,4.2e-05,4e-06,1.4e-05,2.6e-05,4.1e-05,5.2e-05,2.7e-05,1.2e-05,2.8e-05,3.6e-05,3.6e-05,2.8e-05,5.5e-05,6.1e-05,7.1e-05,5.9e-05,3.2e-05,3.8e-05,4.3e-05,1.6e-05,5e-06,2.3e-05,2.5e-05,5.5e-05,6e-05,2.9e-05,6.9e-05,4.7e-05,1.4e-05,6.5e-05,5.1e-05,4.4e-05,8.3e-05,4e-05,6.8e-05,1.2e-05,2.4e-05,3.6e-05,1.3e-05,7.1e-05,1.7e-05,6.1e-05,4.8e-05,5.2e-05,2.5e-05,5e-05,8.9e-05,4.3e-05,5.6e-05,4.9e-05,4.4e-05,5.4e-05,7.8e-05,8.6e-05,0.000116,3e-05,4.6e-05,2.7e-05,4.4e-05,2.3e-05,5.5e-05,4.8e-05,1.7e-05,1.2e-05,6.6e-05,4.4e-05,1.1e-05,4.7e-05,2.5e-05,3.6e-05,9.2e-05,5.9e-05,3.1e-05,2.7e-05,7.1e-05,3e-05,6.1e-05,6.1e-05,3.2e-05,6.2e-05,3.8e-05,3e-05,1e-05,5e-05,5.7e-05,6.3e-05,2.6e-05,3.9e-05,3.2e-05,7.7e-05,1.2e-05,4e-05,1.8e-05,3.1e-05,3.6e-05,1.9e-05,3.7e-05,1.6e-05,4.4e-05,3.6e-05
1.5e-05,2.2e-05,4.5e-05,4.5e-05,5.6e-05,5.9e-05,6.7e-05,8.7e-05,6.8e-05,7e-05,1.6e-05,3e-05,8.7e-05,5.2e-05,3.4e-05,3.4e-05,3.3e-05,3.4e-05,3.9e-05,2e-05,7.9e-05,4.2e-05,1.4e-05,2.2e-05,1e-05,7e-05,3e-05,3.5e-05,2.9e-05,1.3e-05,3.1e-05,3.6e-05,4e-05,2.6e-05,7e-05,4.1e-05,1.6e-05,3.7e-05,2.9e-05,3.6e-05,5e-05,3.2e-05,8.2e-05,6.6e-05,8.8e-05,9.9e-05,0.000106,8.6e-05,2.1e-05,2.1e-05,7.7e-05,2.1e-05,3.4e-05,3.6e-05,6.3e-05,2.9e-05,3.8e-05,4.2e-05,8.4e-05,8.5e-05,0.000109,7.7e-05,8.2e-05,0.000122,5.6e-05,6.5e-05,5.4e-05,6.2e-05,5.7e-05,1.2e-05,3.1e-05,6.8e-05,3.8e-05,8.1e-05,1e-05,9e-05,6.4e-05,4.2e-05,1.9e-05,2.7e-05,4.3e-05,5.8e-05,8.7e-05,0.000127,0.000133,7.2e-05,6.1e-05,3.2e-05,2.7e-05,7e-05,5.6e-05,2.1e-05,3.8e-05,2.9e-05,4.2e-05,6.7e-05,0.000136,3.2e-05,0.000102,5.9e-05,5.1e-05,3.8e-05,5.9e-05,4e-05,5.3e-05,5.2e-05,3.7e-05,4.4e-05,7.5e-05,6.8e-05,3.3e-05,8e-06,3e-05,1.3e-05,5.5e-05,2.6e-05,4e-05,4.1e-05,2.7e-05,3e-05,4.9e-05
5e-06,3.1e-05,5.4e-05,6.3e-05,3e-05,1.3e-05,6.8e-05,1.7e-05,4.3e-05,4.3e-05,3.4e-05,3.6e-05,8.9e-05,6.4e-05,2.5e-05,7e-06,3e-05,2.5e-05,2.1e-05,2.9e-05,4.1e-05,3.6e-05,2.9e-05,3e-06,4e-06,7.5e-05,2.2e-05,1.6e-05,8e-06,2e-05,2.7e-05,5e-06,2.9e-05,1.8e-05,4.9e-05,7.8e-05,5.8e-05,5.1e-05,2.1e-05,3.2e-05,1.9e-05,7.1e-05,4.7e-05,6.3e-05,3.7e-05,3e-05,9.6e-05,2.8e-05,1.4e-05,1.8e-05,3.4e-05,2.9e-05,1.9e-05,1e-05,2.3e-05,3.3e-05,4e-05,7e-06,4.7e-05,6.4e-05,6e-06,2.4e-05,2.1e-05,3.9e-05,2e-05,1.4e-05,3.2e-05,1.3e-05,3.6e-05,3.9e-05,3.8e-05,3.4e-05,4.2e-05,5e-06,1e-05,6e-05,5.5e-05,4.5e-05,3.3e-05,2.8e-05,5.1e-05,1.6e-05,3.5e-05,7.2e-05,6.5e-05,3.1e-05,2.7e-05,1.2e-05,4.6e-05,3.3e-05,3e-05,2.2e-05,1.8e-05,3.8e-05,1.5e-05,2.8e-05,9.6e-05,8.3e-05,1.3e-05,3.2e-05,1.9e-05,1.9e-05,4.1e-05,3.2e-05,4.1e-05,3.4e-05,3.7e-05,3.2e-05,3.7e-05,5.6e-05,7.9e-05,2.4e-05,2.7e-05,5.2e-05,4.3e-05,3.8e-05,5.7e-05,4.5e-05,5e-06,1.4e-05,2.5e-05
7e-06,1.3e-05,3.6e-05,1.9e-05,2.8e-05,1.2e-05,5.8e-05,2.4e-05,2.8e-05,3e-05,2e-05,1.6e-05,4.7e-05,2.2e-05,2.9e-05,2.6e-05,2.7e-05,1.6e-05,3.6e-05,2.6e-05,5.1e-05,3.1e-05,1.1e-05,1.5e-05,1.5e-05,4.7e-05,3.1e-05,2.3e-05,1.3e-05,2.8e-05,2e-05,2.1e-05,1.4e-05,1.5e-05,1.8e-05,1e-05,2.8e-05,4.3e-05,2e-05,2.3e-05,2.5e-05,5.2e-05,4.1e-05,3.7e-05,3.5e-05,2.9e-05,5.3e-05,8e-06,1.5e-05,1.2e-05,3.5e-05,2.5e-05,1.7e-05,8e-06,1.7e-05,2.1e-05,1.6e-05,8e-06,2.6e-05,3.4e-05,2e-05,1.4e-05,7e-06,2.7e-05,2.4e-05,2.7e-05,2.2e-05,1.1e-05,2.6e-05,3.4e-05,1.5e-05,6.7e-05,9e-06,1.2e-05,2e-05,4.4e-05,4.3e-05,2.7e-05,1.9e-05,8e-06,5.2e-05,2e-06,4e-06,6.3e-05,4.8e-05,2.2e-05,2.3e-05,1.6e-05,4.3e-05,3.6e-05,1.1e-05,2.7e-05,3.2e-05,2.1e-05,2.6e-05,1.2e-05,5.9e-05,6.6e-05,2e-05,2.9e-05,2.6e-05,8e-06,4.8e-05,3.7e-05,4.6e-05,1.3e-05,7e-06,2.3e-05,1.9e-05,2.4e-05,4.4e-05,6e-06,1.8e-05,4e-05,8e-06,1.4e-05,3.8e-05,1.6e-05,0,1.9e-05,2.3e-05
1e-05,1.2e-05,1.5e-05,1.9e-05,2.1e-05,1e-05,4.4e-05,1e-05,3.2e-05,2.9e-05,1.3e-05,1.9e-05,3.6e-05,2e-05,1.6e-05,3.7e-05,2.2e-05,1.7e-05,2.2e-05,1.8e-05,3.7e-05,3.2e-05,1.3e-05,1e-05,6e-06,5.6e-05,3.5e-05,2.2e-05,1.1e-05,2.5e-05,1.8e-05,1.5e-05,1.1e-05,2.3e-05,1.5e-05,2e-05,3.6e-05,3.7e-05,7e-06,2.1e-05,3.2e-05,3.7e-05,2.3e-05,3.1e-05,3.1e-05,3.9e-05,2.4e-05,1.1e-05,9e-06,1.8e-05,2.4e-05,1.8e-05,9e-06,1.4e-05,2.5e-05,4e-06,1.3e-05,1.6e-05,2.4e-05,1.4e-05,2.3e-05,3e-06,4e-06,2.9e-05,1.9e-05,3.3e-05,2e-05,2e-05,2.7e-05,3.1e-05,2.3e-05,5.2e-05,1.2e-05,2e-05,1.1e-05,4.6e-05,2.6e-05,2.8e-05,1.4e-05,1.1e-05,4e-05,1e-05,4e-06,4.9e-05,4.3e-05,1.8e-05,6e-06,1e-05,4.4e-05,4.7e-05,9e-06,3.6e-05,8e-06,8e-06,2e-05,1.4e-05,5.6e-05,6.7e-05,1e-05,2.7e-05,6e-06,5e-06,3.8e-05,1.9e-05,3.6e-05,3e-06,5e-06,1.5e-05,1.5e-05,2.1e-05,5.7e-05,1.2e-05,1e-06,3.1e-05,1e-05,2.1e-05,2.4e-05,2e-05,1.7e-05,1.1e-05,2.5e-05
1e-05,1.6e-05,1.7e-05,1.9e-05,1.5e-05,2.1e-05,7.1e-05,3.5e-05,3.1e-05,3.5e-05,2e-05,2.4e-05,3.6e-05,2.5e-05,1.3e-05,3.2e-05,1.1e-05,6e-06,1.7e-05,2.7e-05,3.5e-05,2.5e-05,9e-06,6e-06,2.1e-05,3.3e-05,1.4e-05,2.6e-05,1.2e-05,1.9e-05,1.3e-05,1.8e-05,1e-05,2.4e-05,2.9e-05,2.9e-05,3.4e-05,5.1e-05,2.3e-05,1.1e-05,2.3e-05,3.5e-05,2.1e-05,3.5e-05,3.5e-05,3.5e-05,3.2e-05,7e-06,1.4e-05,7e-06,2.3e-05,2.1e-05,6e-06,1e-06,2.5e-05,1.7e-05,1.3e-05,1e-05,3.1e-05,1.8e-05,3.6e-05,1e-05,7e-06,4e-05,2.8e-05,2e-05,1.7e-05,9e-06,1.5e-05,2e-05,2.2e-05,5.6e-05,1.6e-05,1.4e-05,2.5e-05,5e-05,2.3e-05,2.7e-05,1.7e-05,8e-06,4.5e-05,2e-06,9e-06,5e-05,2.8e-05,2.1e-05,5e-06,1.3e-05,4.1e-05,3.4e-05,1.8e-05,3.9e-05,1.3e-05,9e-06,2.5e-05,1.1e-05,5.6e-05,6.3e-05,1.7e-05,2.8e-05,1.5e-05,2.1e-05,1.6e-05,3e-05,4.9e-05,7e-06,8e-06,1.2e-05,7e-06,1.4e-05,4.6e-05,6e-06,4e-06,2.7e-05,1.1e-05,2.1e-05,3.4e-05,2.4e-05,1.6e-05,1.3e-05,2.6e-05
8e-06,1.8e-05,1e-05,2.2e-05,2.2e-05,2.7e-05,5.2e-05,1.7e-05,2.8e-05,4.1e-05,2.1e-05,2e-05,2.8e-05,1.8e-05,7e-06,2.7e-05,6e-06,1.3e-05,3.3e-05,3.9e-05,3e-05,3.6e-05,1e-05,9e-06,1.1e-05,3.7e-05,1.7e-05,2.4e-05,1.7e-05,2.8e-05,1.3e-05,9e-06,2e-05,1.2e-05,2.4e-05,6e-06,1.4e-05,5.4e-05,2.2e-05,1.5e-05,1.4e-05,2.4e-05,1.6e-05,2.9e-05,3.9e-05,2.4e-05,3.5e-05,1.8e-05,2.1e-05,1.3e-05,1.5e-05,6e-06,5e-06,4e-06,2.9e-05,9e-06,7e-06,6e-06,2.1e-05,7e-06,1.5e-05,8e-06,9e-06,3.1e-05,1.5e-05,3.5e-05,1.2e-05,2e-06,2.7e-05,2.6e-05,1.4e-05,5e-05,1.1e-05,2e-05,1.6e-05,4.5e-05,1.7e-05,3.5e-05,1.1e-05,1.1e-05,4e-05,1e-05,1.9e-05,4.5e-05,3.3e-05,2.3e-05,4e-06,9e-06,3.9e-05,3e-05,8e-06,2.6e-05,2.2e-05,1.2e-05,1.2e-05,7e-06,4.8e-05,5.9e-05,1.9e-05,2.4e-05,1.9e-05,1.5e-05,3.8e-05,1.6e-05,4.3e-05,8e-06,1.1e-05,6e-06,0,1e-05,5.3e-05,5e-06,1.2e-05,3.2e-05,1.7e-05,1e-05,3.9e-05,2e-05,1.4e-05,1.6e-05,2.4e-05
9e-06,1.6e-05,1.2e-05,7e-06,2.5e-05,2.1e-05,6.2e-05,1e-05,2.4e-05,4e-05,2.7e-05,1.9e-05,3.8e-05,1e-05,2.1e-05,3.8e-05,2.2e-05,1.5e-05,2.7e-05,3.2e-05,3.4e-05,2.3e-05,2.6e-05,1.7e-05,2e-05,5e-05,2.7e-05,3e-06,7e-06,1.9e-05,2.1e-05,1.4e-05,1.7e-05,2.6e-05,2.9e-05,2.5e-05,3.5e-05,1.2e-05,1.8e-05,1.3e-05,1.2e-05,3.1e-05,1.6e-05,2.1e-05,4e-05,2.3e-05,2.9e-05,1.1e-05,1.5e-05,1.3e-05,2.7e-05,8e-06,5e-06,1.2e-05,1.5e-05,1.6e-05,7e-06,9e-06,1.4e-05,7e-06,1.6e-05,5e-06,9e-06,3.5e-05,1.7e-05,4.3e-05,9e-06,1e-05,2.1e-05,3.5e-05,1.6e-05,5.5e-05,5e-06,1e-05,1.6e-05,4.9e-05,1.9e-05,1.9e-05,1.5e-05,8e-06,4.1e-05,1.6e-05,1e-05,5.6e-05,4e-05,1.8e-05,1.3e-05,1.2e-05,3.8e-05,3.3e-05,8e-06,3.6e-05,6e-06,1.2e-05,1.7e-05,8e-06,5.2e-05,5.8e-05,1.7e-05,2.1e-05,2.3e-05,1.2e-05,2.5e-05,2e-05,3.9e-05,5e-06,1.2e-05,9e-06,2e-06,2e-05,5.3e-05,5e-06,5e-06,1.5e-05,3e-06,1.4e-05,3.5e-05,3.3e-05,6e-06,1.9e-05,2.7e-05
1.2e-05,1.1e-05,2.1e-05,1.1e-05,1.5e-05,2.1e-05,5.7e-05,1e-05,2.5e-05,3.9e-05,1.8e-05,1.7e-05,3.9e-05,1.3e-05,1.8e-05,4.1e-05,1e-05,7e-06,1.7e-05,3.2e-05,3.6e-05,1.1e-05,4e-06,1.3e-05,9e-06,4.2e-05,1.6e-05,1.9e-05,1.1e-05,2.4e-05,2.1e-05,8e-06,4e-06,1.2e-05,1.7e-05,2.4e-05,3.2e-05,3.3e-05,2.2e-05,8e-06,2.2e-05,2.2e-05,2e-05,3e-05,4.3e-05,3.8e-05,4e-05,1.6e-05,2.4e-05,1.6e-05,3e-05,1.2e-05,8e-06,1.6e-05,1.6e-05,1e-05,1.8e-05,1.7e-05,2.1e-05,1e-05,1.6e-05,7e-06,1e-06,2.9e-05,1e-05,2.8e-05,2e-05,3e-06,1.9e-05,2.4e-05,5e-06,4.2e-05,9e-06,9e-06,1.2e-05,3.9e-05,1.7e-05,2.6e-05,1.3e-05,4e-06,3.8e-05,1.5e-05,1.7e-05,4.2e-05,3.7e-05,2.4e-05,6e-06,6e-06,3.9e-05,3.6e-05,1.4e-05,4.6e-05,1e-05,1.4e-05,1.1e-05,7e-06,4.9e-05,5.8e-05,1.9e-05,1.9e-05,1.8e-05,9e-06,4.4e-05,8e-06,4.3e-05,3e-06,3e-06,0,3e-06,1.8e-05,5e-05,5e-06,1.3e-05,2.4e-05,1.2e-05,1e-05,3.2e-05,2.4e-05,1.9e-05,2.1e-05,1.8e-05
1e-05,1e-05,1e-05,2.3e-05,2.1e-05,2.2e-05,4.6e-05,1.2e-05,2.1e-05,3.3e-05,2.1e-05,1.7e-05,3.1e-05,1.4e-05,1.5e-05,3.2e-05,1.2e-05,1e-06,1.6e-05,3.1e-05,3.4e-05,9e-06,8e-06,5e-06,1e-05,3e-05,2.8e-05,1.3e-05,6e-06,1.9e-05,2.3e-05,1.1e-05,7e-06,8e-06,1.6e-05,2.9e-05,3.3e-05,2.7e-05,2.4e-05,1.2e-05,2.7e-05,2.6e-05,1.8e-05,2.4e-05,4.7e-05,2.1e-05,3.8e-05,6e-06,4e-06,5e-06,2.4e-05,1.1e-05,4e-06,9e-06,1.3e-05,6e-06,1.1e-05,7e-06,2.1e-05,5e-06,1.3e-05,5e-06,6e-06,2.3e-05,1e-05,3e-05,1.3e-05,4e-06,1.9e-05,1.9e-05,1e-05,3.6e-05,1.1e-05,8e-06,7e-06,4.8e-05,1.9e-05,2.5e-05,9e-06,3e-06,3.7e-05,6e-06,9e-06,4.4e-05,3e-05,2.3e-05,8e-06,1.3e-05,4.3e-05,3.6e-05,1.6e-05,3.5e-05,1e-05,1.1e-05,1.8e-05,1.6e-05,4.9e-05,5.8e-05,1.7e-05,1.9e-05,1.2e-05,4e-06,3.8e-05,1.5e-05,4.2e-05,2e-06,3e-06,2e-06,1e-06,1.5e-05,4.7e-05,3e-06,1.2e-05,2.1e-05,7e-06,1.8e-05,2.5e-05,2.6e-05,1.9e-05,1.1e-05,2.1e-05
1.2e-05,1.3e-05,1.3e-05,1.9e-05,2e-05,1.5e-05,4.5e-05,1e-05,2.2e-05,3.1e-05,2.3e-05,1.9e-05,2.9e-05,1.5e-05,9e-06,2.7e-05,5e-06,3e-06,2.5e-05,3e-05,3.6e-05,1.3e-05,1e-06,5e-06,1.5e-05,3.5e-05,2e-05,1.1e-05,8e-06,1.6e-05,2e-05,1e-05,7e-06,1.6e-05,1.7e-05,2.2e-05,3.1e-05,1.9e-05,1.6e-05,1.5e-05,2e-05,2.5e-05,2.2e-05,2.5e-05,4.9e-05,3e-05,3.1e-05,5e-06,1e-05,7e-06,2.6e-05,2e-06,7e-06,1e-05,1.3e-05,5e-06,8e-06,9e-06,2.3e-05,3e-06,1.6e-05,4e-06,4e-06,2.4e-05,7e-06,2.4e-05,1.4e-05,9e-06,1.9e-05,2.1e-05,6e-06,4.2e-05,2e-06,2e-06,7e-06,3.9e-05,2.1e-05,2.5e-05,9e-06,3e-06,3.7e-05,9e-06,9e-06,4.5e-05,3.5e-05,2.3e-05,8e-06,1e-05,4.2e-05,3.4e-05,1e-05,3.5e-05,1e-05,1.4e-05,1.9e-05,8e-06,4.4e-05,5e-05,1.2e-05,1.8e-05,1.2e-05,7e-06,3.8e-05,1.5e-05,3.7e-05,1e-06,4e-06,1e-06,3e-06,1.3e-05,4.4e-05,4e-06,6e-06,2.3e-05,6e-06,1.5e-05,2.8e-05,2.2e-05,1.2e-05,1.3e-05,2.3e-05
6e-06,1.3e-05,1.3e-05,1.7e-05,1.9e-05,1.4e-05,4.5e-05,1.1e-05,2e-05,2.9e-05,2.3e-05,1.8e-05,2.7e-05,1.6e-05,1.1e-05,3.1e-05,2e-06,1e-06,2.6e-05,2.8e-05,3.6e-05,1.8e-05,4e-06,8e-06,1.3e-05,3.7e-05,2e-05,1.5e-05,1e-05,1.6e-05,2.4e-05,3e-06,6e-06,1.7e-05,1.9e-05,2.6e-05,3e-05,2.4e-05,2.1e-05,1.2e-05,2e-05,2.6e-05,1.6e-05,2.5e-05,4.9e-05,2.9e-05,2.8e-05,5e-06,1.3e-05,7e-06,2.6e-05,6e-06,3e-06,1e-05,1.2e-05,2e-06,1e-05,8e-06,2e-05,6e-06,1.3e-05,2e-06,3e-06,3.1e-05,1e-05,2.7e-05,1e-05,1e-05,1.7e-05,1.6e-05,4e-06,4.5e-05,2e-06,4e-06,8e-06,4.7e-05,2.3e-05,2.2e-05,4e-06,4e-06,3.6e-05,8e-06,9e-06,4.2e-05,3e-05,2.7e-05,5e-06,1.1e-05,3.9e-05,2.8e-05,1e-05,3.6e-05,9e-06,1.4e-05,1.3e-05,8e-06,4.9e-05,5.6e-05,1.7e-05,2.2e-05,1.2e-05,3e-06,3.4e-05,1.5e-05,3.8e-05,4e-06,1e-06,0,2e-06,1.7e-05,4.2e-05,4e-06,8e-06,2e-05,3e-06,1.3e-05,2.8e-05,1.9e-05,1.2e-05,1.4e-05,2.2e-05
