0.027073,0.028545,0.029861,0.029134,0.026571,0.025696,0.030328,0.036766,0.032601,0.027026,0.028131,0.029185,0.027579,0.029485,0.031916,0.025959,0.02034,0.021333,0.024262,0.024791,0.025451,0.026161,0.027102,0.027567,0.026125,0.026039,0.023117,0.019998
0.034112,0.03553,0.037075,0.037185,0.034906,0.034024,0.038152,0.043326,0.039008,0.034429,0.036405,0.03709,0.034698,0.036173,0.038159,0.032128,0.026005,0.026463,0.029928,0.031381,0.032715,0.033216,0.03419,0.03467,0.032527,0.031942,0.028649,0.025661
0.048395,0.049318,0.051019,0.054209,0.053484,0.052129,0.053241,0.054084,0.050412,0.049002,0.052746,0.052547,0.048296,0.048118,0.048872,0.043752,0.036933,0.035865,0.040414,0.044074,0.047025,0.046966,0.047866,0.048136,0.044738,0.043323,0.039403,0.036593
0.066311,0.066289,0.067699,0.07719,0.080486,0.077541,0.071487,0.065738,0.064731,0.067468,0.072568,0.070802,0.063381,0.060368,0.059685,0.056751,0.049755,0.045978,0.050864,0.057823,0.063509,0.063199,0.063965,0.063961,0.059914,0.056606,0.051076,0.047689
0.088722,0.087526,0.088026,0.106697,0.115653,0.109269,0.092988,0.080608,0.083499,0.089129,0.093302,0.088755,0.077982,0.074238,0.073908,0.071157,0.063707,0.057112,0.060911,0.072698,0.082708,0.081358,0.080866,0.081057,0.077719,0.070807,0.062187,0.05721
0.109841,0.106278,0.10542,0.133442,0.148318,0.138172,0.111929,0.093825,0.099628,0.106196,0.107763,0.10174,0.089732,0.086443,0.088998,0.084879,0.076019,0.068992,0.071683,0.087116,0.100909,0.097322,0.093628,0.093476,0.092028,0.082804,0.071469,0.065548
0.11833,0.113094,0.11099,0.141296,0.159405,0.149122,0.120982,0.101096,0.105899,0.111961,0.110147,0.102908,0.091921,0.09069,0.098418,0.094524,0.084677,0.079985,0.082695,0.097261,0.110517,0.104655,0.097861,0.095668,0.095676,0.087438,0.078458,0.078491
0.118506,0.114694,0.113374,0.130141,0.140202,0.133024,0.115184,0.103898,0.11175,0.119599,0.11581,0.105935,0.092979,0.095038,0.108659,0.107215,0.095021,0.089825,0.094562,0.106071,0.113438,0.109493,0.106539,0.099934,0.098595,0.094043,0.090867,0.102824
0.134767,0.133199,0.138694,0.136646,0.129763,0.126019,0.119932,0.123671,0.14668,0.157508,0.150908,0.138161,0.116138,0.119516,0.140655,0.138812,0.116704,0.108615,0.118238,0.125464,0.124703,0.130924,0.144208,0.131926,0.124276,0.122333,0.120754,0.141816
0.172308,0.177114,0.187866,0.169632,0.152877,0.153974,0.150267,0.165047,0.205841,0.216774,0.201493,0.185737,0.153001,0.155722,0.189962,0.183806,0.145735,0.138334,0.15622,0.160777,0.15625,0.170831,0.196138,0.179552,0.165298,0.166296,0.165224,0.190609
0.207458,0.226059,0.235638,0.194087,0.167904,0.180738,0.184753,0.205624,0.255973,0.26575,0.236455,0.216767,0.177683,0.177938,0.227755,0.217326,0.166974,0.167857,0.193216,0.194024,0.186728,0.200318,0.227636,0.214605,0.19697,0.197932,0.202743,0.233292
0.223551,0.248985,0.249853,0.192954,0.161837,0.181448,0.194787,0.222767,0.27004,0.271441,0.231294,0.213659,0.181323,0.176889,0.229871,0.216994,0.168582,0.181585,0.205031,0.202933,0.198975,0.201401,0.21517,0.213206,0.199703,0.19601,0.207688,0.241033
0.205964,0.229647,0.225941,0.176599,0.147981,0.15942,0.173572,0.204142,0.233825,0.224628,0.189434,0.181892,0.169814,0.164489,0.201336,0.188238,0.154201,0.167106,0.178575,0.182548,0.186545,0.174233,0.172216,0.180153,0.173797,0.166486,0.180717,0.204584
0.171265,0.191041,0.193185,0.160795,0.138197,0.136756,0.14278,0.165644,0.170026,0.155222,0.146195,0.155599,0.15841,0.156459,0.172817,0.158884,0.141033,0.143719,0.141166,0.151402,0.154586,0.138609,0.14093,0.150212,0.149365,0.14789,0.155593,0.158291
0.146316,0.159692,0.166257,0.145016,0.138949,0.139937,0.139194,0.151204,0.136026,0.11734,0.12634,0.144405,0.149655,0.147783,0.147588,0.135942,0.137293,0.1338,0.127179,0.139471,0.130234,0.119884,0.139523,0.150128,0.152468,0.150336,0.142771,0.132363
0.141317,0.158156,0.170721,0.15616,0.165739,0.162774,0.145589,0.155499,0.149689,0.137456,0.147053,0.157929,0.148199,0.139048,0.130162,0.122526,0.139937,0.136863,0.134279,0.149814,0.134358,0.12968,0.162508,0.176183,0.169367,0.156595,0.153048,0.151584
0.151502,0.183206,0.204966,0.200583,0.217317,0.198394,0.158583,0.166166,0.174155,0.175118,0.19164,0.194126,0.15834,0.145182,0.144305,0.134719,0.149026,0.145699,0.148,0.169884,0.158744,0.155621,0.198305,0.217622,0.192328,0.167037,0.180108,0.188101
0.180568,0.222426,0.241301,0.245376,0.26483,0.233601,0.176262,0.180259,0.197378,0.20651,0.230281,0.232903,0.185762,0.166912,0.168695,0.155102,0.159378,0.155859,0.160062,0.191913,0.189905,0.184596,0.240262,0.26573,0.227778,0.197872,0.213496,0.216019
0.207362,0.242487,0.253881,0.262305,0.275108,0.242222,0.186422,0.193515,0.206036,0.209015,0.238672,0.258733,0.223348,0.195149,0.190761,0.176436,0.170849,0.160937,0.164842,0.207236,0.214645,0.210732,0.276022,0.303172,0.264596,0.240714,0.244409,0.22622
0.202244,0.223126,0.231838,0.238727,0.23948,0.217997,0.186658,0.207695,0.202669,0.188949,0.224202,0.262254,0.247271,0.216427,0.207108,0.188616,0.169045,0.152088,0.161725,0.214071,0.228336,0.226177,0.280501,0.295607,0.269757,0.261027,0.250216,0.210011
0.174776,0.18319,0.191015,0.200693,0.190367,0.173985,0.181571,0.228278,0.201989,0.171917,0.211983,0.250119,0.248354,0.227838,0.221403,0.197368,0.163097,0.144533,0.16214,0.213299,0.234696,0.236274,0.259814,0.258317,0.247782,0.244747,0.218131,0.166723
0.165985,0.172736,0.17875,0.190043,0.163435,0.138537,0.171876,0.242591,0.211147,0.167073,0.203333,0.235792,0.237814,0.230532,0.227818,0.197469,0.155669,0.139455,0.161626,0.206406,0.23513,0.237329,0.25047,0.249332,0.217903,0.200621,0.169322,0.117877
0.161423,0.165067,0.17218,0.170594,0.12895,0.10961,0.153615,0.230844,0.213208,0.165076,0.183389,0.208569,0.217691,0.215335,0.210698,0.181259,0.144471,0.138498,0.157116,0.183551,0.211707,0.210887,0.223485,0.236761,0.18952,0.16061,0.142039,0.102263
0.149174,0.14965,0.165142,0.149831,0.099979,0.098942,0.146464,0.200835,0.191662,0.155775,0.152405,0.170041,0.190201,0.189276,0.178193,0.15282,0.127172,0.132556,0.139854,0.139933,0.163936,0.166285,0.173116,0.197395,0.164603,0.144431,0.143858,0.116368
0.141092,0.135027,0.152219,0.137141,0.092397,0.105884,0.145129,0.158951,0.148494,0.132185,0.11749,0.124206,0.143963,0.149844,0.139461,0.119297,0.108075,0.11653,0.115179,0.105072,0.115209,0.11957,0.126705,0.143783,0.130169,0.130102,0.143431,0.128323
0.131915,0.11961,0.133057,0.126834,0.093038,0.111462,0.14446,0.137629,0.118771,0.107686,0.09061,0.092511,0.110444,0.123003,0.11014,0.085659,0.089312,0.102692,0.103496,0.098964,0.093812,0.085889,0.091001,0.10003,0.101341,0.111903,0.127299,0.131306
0.127756,0.11868,0.117921,0.112195,0.088952,0.103829,0.135056,0.133497,0.113904,0.098158,0.079329,0.080501,0.099558,0.105832,0.083992,0.05918,0.073683,0.093101,0.102363,0.104463,0.093545,0.075175,0.074158,0.080003,0.085213,0.09969,0.10754,0.120563
0.10948,0.109745,0.103887,0.097144,0.082027,0.08934,0.123385,0.134142,0.119203,0.107033,0.091476,0.086,0.093988,0.08847,0.066696,0.05244,0.071933,0.096258,0.110296,0.107179,0.093266,0.069566,0.067482,0.08152,0.082806,0.08694,0.084582,0.094521
0.081016,0.090571,0.093911,0.089717,0.079759,0.079211,0.102796,0.128867,0.131121,0.119402,0.102064,0.088919,0.08981,0.079478,0.063838,0.067183,0.083923,0.105514,0.115954,0.104379,0.094234,0.06877,0.065168,0.084687,0.085801,0.087394,0.08599,0.083256
0.070182,0.080756,0.08615,0.089055,0.082611,0.070328,0.07657,0.108653,0.136834,0.126506,0.099506,0.087701,0.08928,0.076701,0.066896,0.09067,0.101976,0.112603,0.117905,0.102534,0.104186,0.080393,0.070236,0.091356,0.0971,0.100303,0.101209,0.091322
0.066623,0.075743,0.076771,0.086231,0.082594,0.059549,0.062318,0.093591,0.134779,0.120717,0.079,0.073612,0.081495,0.08117,0.081528,0.115233,0.122233,0.116625,0.115825,0.10368,0.115099,0.091151,0.070801,0.089403,0.102936,0.108386,0.105452,0.09357
0.071345,0.079659,0.073839,0.081313,0.078592,0.055387,0.062989,0.100404,0.142956,0.112374,0.055919,0.05276,0.070339,0.085351,0.094234,0.124356,0.131405,0.114386,0.10245,0.106922,0.127993,0.097419,0.067978,0.080678,0.095207,0.10094,0.091712,0.087155
0.071225,0.07699,0.064668,0.067226,0.063998,0.049118,0.060661,0.100059,0.139206,0.105452,0.049662,0.051402,0.069471,0.081668,0.091699,0.107366,0.116742,0.09941,0.08142,0.102014,0.120976,0.088654,0.060731,0.065422,0.076538,0.086413,0.071062,0.069439
0.063599,0.065425,0.04633,0.04482,0.041936,0.039343,0.050076,0.081623,0.112237,0.083966,0.046694,0.059026,0.067016,0.064684,0.073235,0.077241,0.081737,0.073404,0.062295,0.081991,0.089433,0.063854,0.047156,0.048408,0.061554,0.069258,0.047177,0.049194
0.062001,0.060985,0.035913,0.030376,0.026004,0.030011,0.039607,0.065725,0.080449,0.055392,0.04133,0.060165,0.0629,0.048837,0.050977,0.05481,0.048073,0.044304,0.042745,0.051897,0.051623,0.038237,0.035393,0.04012,0.052269,0.052147,0.028273,0.038266
0.061487,0.061008,0.03329,0.024073,0.021857,0.02536,0.036019,0.056966,0.060871,0.042928,0.041258,0.052379,0.05266,0.041613,0.03623,0.038366,0.030741,0.02423,0.023036,0.025429,0.032524,0.030321,0.025831,0.030886,0.044007,0.042135,0.020045,0.035068
0.051698,0.0526,0.031185,0.022738,0.020353,0.02304,0.031854,0.04814,0.054066,0.039889,0.036921,0.039628,0.038234,0.038606,0.031893,0.027202,0.025456,0.020067,0.014108,0.015262,0.025694,0.026548,0.018282,0.020634,0.033129,0.032791,0.017994,0.034187
0.034794,0.036779,0.026237,0.021872,0.018148,0.022291,0.029436,0.034784,0.040759,0.032195,0.029375,0.033784,0.03167,0.032953,0.026973,0.017851,0.017854,0.015477,0.010945,0.01159,0.018912,0.023304,0.016116,0.018067,0.024357,0.022187,0.016562,0.031464
0.021493,0.022702,0.019829,0.020447,0.016956,0.021388,0.02557,0.021066,0.024639,0.023273,0.025032,0.029799,0.031822,0.02825,0.021589,0.013391,0.010156,0.010482,0.010437,0.009505,0.01335,0.019511,0.015679,0.018619,0.01822,0.013359,0.013048,0.025751
0.019389,0.018343,0.016345,0.019096,0.015915,0.01897,0.020283,0.013436,0.014913,0.019292,0.021155,0.023805,0.028829,0.02139,0.014198,0.009119,0.005591,0.006985,0.011489,0.010759,0.012944,0.01728,0.013961,0.017522,0.015666,0.009503,0.00982,0.021076
