-0.000162,-0.000136,-0.000577,-0.000352,-0.000676,-0.000292,0.00012,-0.000216,-9.9e-05,-3.5e-05,-0.000375,-0.000138,-0.000173,-0.000299,-0.000308,-0.000303,-0.000188,-0.000232,-0.00019,-0.000259,-0.000419,-6e-05,-0.000479,-0.000324,-0.000136,-0.000182,-3.8e-05,-0.000163,-0.000279,-0.00018,-0.000159,-0.000391,-0.000369,-0.000506,-0.000234,-0.000118,-0.000322,-0.000151,2.2e-05,-0.000199,-0.00028,-0.00024,4.1e-05,-0.000388,-0.000611,-0.000304,-0.000179,-5.5e-05,-0.000142,-0.000114,-0.000319,-0.000288,-0.000134,0.000204,-0.000184,-0.000259,-0.000176,-0.000128,-0.000209,-0.000193,-0.000298,-0.000171,-0.000196,-0.000256,-0.000138,-0.000134,5.2e-05,-6.1e-05,1.4e-05,-0.000144,-0.000211,-0.000277,-0.000163,-0.000228,-0.000205,-0.000121,-7.5e-05,-0.000138,-0.000297,-0.000254,-0.000111,-4.4e-05,-0.000112,-0.000283,-0.000335,-0.000189,-0.000191,-1e-04,-7.6e-05,-9.2e-05,-0.000184,-0.000106,-0.000207,-0.000237,-0.000259,-0.000279,-0.000147,-7.6e-05,-7.8e-05,-0.000159,-0.000254,-0.000395,-0.000107,-2.3e-05,8.1e-05,-7.1e-05,-0.000136,-0.000278,-0.000333,-0.000168,-0.000122,-0.000124,9.2e-05,-0.000201,0.000121,-0.000173,-0.000173,-2e-04,-0.000111,3.6e-05,-0.000209
6.6e-05,-7.3e-05,-7e-05,-1.5e-05,0.000189,-8.7e-05,2e-06,7e-05,-9.9e-05,-9.6e-05,0.000202,-0.00012,-6.5e-05,-0.000346,-0.000115,5e-06,3.8e-05,-0.000105,-0.000101,9.8e-05,0.000224,0.000133,2.6e-05,-0.000285,-0.000382,-0.000123,-0.000228,-0.000123,4.1e-05,-0.000303,-0.000225,9.6e-05,-0.000277,-9.7e-05,-9.4e-05,5.6e-05,-1.9e-05,-0.000129,-0.000172,6.2e-05,-0.000129,-7.4e-05,-0.000327,-0.000142,1.8e-05,6e-06,-0.000168,-5.6e-05,-0.000217,-0.000126,0.000108,6.6e-05,3.8e-05,6e-06,-0.00015,3.4e-05,-7.2e-05,-8.3e-05,-3e-05,-0.000208,5.6e-05,-2.6e-05,1.8e-05,5.6e-05,-0.000312,-3.3e-05,-7.2e-05,-0.000148,-0.000188,-0.00015,5.2e-05,0.000121,4.1e-05,3.5e-05,8.1e-05,-2.2e-05,-2.8e-05,-8.9e-05,-6e-05,-3.2e-05,-5.2e-05,1e-06,6.3e-05,1.8e-05,3.4e-05,3.8e-05,-0.000129,-5.9e-05,-2e-05,-0.00018,-0.000239,-0.00017,-0.000164,4e-05,5.6e-05,5.7e-05,4.2e-05,-1.4e-05,-5.5e-05,2.6e-05,8.4e-05,0.000123,-3.3e-05,-9.5e-05,-0.000155,-0.000111,6.5e-05,6e-06,6.4e-05,1.4e-05,-1.4e-05,-4.7e-05,-0.000203,-6.4e-05,-2.4e-05,-0.000234,-4.5e-05,-6e-06,-5.5e-05,8.1e-05,2e-05
6e-05,-0.000259,4.3e-05,0.000145,0.000129,7.9e-05,-0.000321,-0.000139,-0.000219,-0.00012,8e-06,-0.00012,-0.000201,0.000353,0.000168,4.2e-05,4.5e-05,0.000126,1.9e-05,-0.000126,-0.000169,-0.000359,-0.000111,0.000111,0.000128,4.4e-05,6.5e-05,0.000129,9e-05,0.000102,0.000157,4.7e-05,0.00025,0.000358,2.7e-05,-1.6e-05,6e-06,-0.000178,-1e-06,6.8e-05,1.3e-05,0.000433,0.000287,8.6e-05,0.000208,0.000151,4e-06,1.8e-05,-8.8e-05,-0.000167,-2.6e-05,-1.9e-05,-6.1e-05,-6.1e-05,-4.4e-05,7e-05,4.5e-05,6.4e-05,5e-05,4e-05,-0.000162,-7.6e-05,2.4e-05,3.1e-05,0.000162,4.8e-05,2.2e-05,0.000122,0.000128,0.00023,-1.2e-05,-1.6e-05,-3.4e-05,1.8e-05,-1.2e-05,-3.3e-05,-2.9e-05,9.4e-05,5.4e-05,1e-04,-8.8e-05,1e-05,-0.000159,-5.3e-05,-9.2e-05,6.1e-05,0.000138,-7e-06,-4.3e-05,4.8e-05,0.000176,0.000124,0.000172,2.8e-05,4.6e-05,0.000161,5.6e-05,-1.8e-05,7.2e-05,2.1e-05,-0.000113,-5.4e-05,-7.7e-05,3.5e-05,-7.7e-05,1.5e-05,-0.000315,-0.000143,-0.000199,-0.000216,-0.000123,-0.000178,-0.000146,-2e-06,1.4e-05,-1.2e-05,-7.1e-05,-2.3e-05,-1.4e-05,-6.5e-05,7e-06
-0.000129,0.000137,-6.2e-05,-0.000127,-8e-05,-0.000122,-9.7e-05,7.3e-05,2.4e-05,-0.000129,-0.000136,-0.000226,-0.000179,-0.000201,-0.000122,-7.9e-05,-1.7e-05,1.4e-05,0.000112,-4.1e-05,-0.000201,2.5e-05,-3.4e-05,9.6e-05,0.000112,-4e-06,-3.8e-05,-0.000109,-0.000197,0.000117,-0.000198,-0.00021,-0.000187,-0.000174,-0.000161,-6.4e-05,-0.000104,0.000156,-9e-06,-8.5e-05,-4e-05,-0.000307,-3.7e-05,-0.000271,-0.000275,-0.000373,-0.000103,-8.4e-05,0.000144,0.000166,-7.4e-05,-5.5e-05,-0.000238,-0.000201,-9.2e-05,-0.000263,-0.000159,-0.00011,-0.000158,5.8e-05,9.2e-05,3e-06,-9.6e-05,-6e-05,2.5e-05,-9.3e-05,4.3e-05,-0.000119,9e-05,-0.000123,-8e-06,-4.4e-05,3.3e-05,0.000133,-3.5e-05,-0.000129,-5.9e-05,-3.7e-05,-0.000123,-9.9e-05,-8.9e-05,-0.000111,-0.000164,-0.000187,2.2e-05,7.2e-05,3e-06,-0.000109,-0.000134,-6.5e-05,-1e-04,-0.000151,-0.000176,-6.4e-05,-0.000158,-0.000192,-9.4e-05,-0.000157,-0.000169,-9.4e-05,-1.7e-05,-4e-06,-0.000204,-1e-04,-4.6e-05,-7.3e-05,3.8e-05,-4e-05,6e-06,-0.000105,-0.000132,-3.2e-05,3.8e-05,-2.7e-05,1.2e-05,-3.2e-05,-0.000153,-0.000219,-5.6e-05,-4e-05,-9.9e-05
0.000119,6.5e-05,3.7e-05,-8.4e-05,2.8e-05,-1e-05,0.000274,-4.2e-05,7.3e-05,-8.8e-05,0.000117,0.000149,0.000304,4.4e-05,7.6e-05,6.7e-05,-2.6e-05,6e-05,-0.000193,2.4e-05,7.3e-05,1e-05,0.00019,-0.000185,-0.000166,-0.000122,-2.8e-05,8.9e-05,0.000109,-5.4e-05,-0.000141,0.000151,0.000165,3e-05,9.6e-05,0.000144,2.9e-05,-6e-05,7.8e-05,0.000147,4.7e-05,4e-05,-0.000189,0.000196,0.000217,0.000149,4e-05,1.1e-05,1.6e-05,-0.000117,-6.6e-05,0.000173,0.000248,0.000162,9.1e-05,0.000191,0.00027,-4e-05,-3e-05,-3.1e-05,4.3e-05,3.4e-05,1.6e-05,-3.1e-05,-5.4e-05,2e-06,2.9e-05,-1.4e-05,-5.9e-05,-8e-06,-2e-06,0.00012,3.7e-05,-9.8e-05,-8e-05,3.2e-05,6e-06,-3.7e-05,7.9e-05,0.000102,5.1e-05,0.000131,7.5e-05,0.00028,-3.9e-05,-7.8e-05,-0.000114,4.4e-05,4.6e-05,3.1e-05,5.8e-05,5.9e-05,5e-05,9.1e-05,7.4e-05,6.6e-05,7.9e-05,4.3e-05,-5e-06,3.7e-05,9e-05,3.2e-05,0.000184,9.6e-05,-7e-06,7.5e-05,5.4e-05,0.000109,0.000181,9.3e-05,0.000245,2.3e-05,9.5e-05,5e-05,-0.000118,6.1e-05,7.2e-05,1e-04,3.8e-05,6.2e-05,0.000158
2e-06,-0.000117,-0.000127,0.000159,1e-06,0.000146,-1.4e-05,0.000175,4.1e-05,1.6e-05,-6e-06,4.8e-05,-7e-05,1.6e-05,-3.1e-05,-6e-05,-3.7e-05,-5.9e-05,0.000122,-5e-06,-8.2e-05,-0.00024,-0.000145,9.4e-05,-6.8e-05,-2.9e-05,3.8e-05,-3.3e-05,-6.5e-05,7.2e-05,0.000168,2e-06,-5.6e-05,6e-06,-0.000123,5.5e-05,5.1e-05,9.4e-05,9.1e-05,-0.000136,1.1e-05,8.2e-05,-8e-05,-3.5e-05,-7.3e-05,0.000124,0.000107,4.8e-05,-3.2e-05,-1.6e-05,-4.7e-05,-6.8e-05,-9.6e-05,3.6e-05,8.7e-05,0.000106,-0.000116,5.4e-05,9.4e-05,7.7e-05,6.9e-05,-5.8e-05,3e-06,1.2e-05,6.5e-05,5e-05,2.1e-05,9e-05,-6e-06,5.6e-05,-1.1e-05,-3.1e-05,7.4e-05,0.000165,3.2e-05,4.8e-05,4.9e-05,5e-06,4.1e-05,-6.2e-05,-4.8e-05,5.2e-05,0.000176,9e-06,7e-05,0.000135,0.000113,4.3e-05,6.7e-05,6.2e-05,8.3e-05,0.00012,8.4e-05,-5.2e-05,5e-06,5.8e-05,-1.1e-05,3.7e-05,3e-05,-7.1e-05,-5.7e-05,1e-05,-2.5e-05,0,2.8e-05,7.5e-05,0,-3.9e-05,-0.000156,4.6e-05,-5.8e-05,1.2e-05,-4e-05,-0.000132,-9.2e-05,6.5e-05,0.000205,0.00011,2.8e-05,8.7e-05,-7.1e-05
0.000134,1.7e-05,5.1e-05,-1.1e-05,-0.00011,-0.000165,-4.9e-05,-9.1e-05,3.5e-05,0.000207,1.7e-05,-0.00017,-3.4e-05,4.6e-05,-4.7e-05,-1.6e-05,2e-06,-9e-06,3.5e-05,3.3e-05,9.4e-05,0.00022,-8.5e-05,-6.6e-05,0.000144,0.000172,-1.9e-05,5.2e-05,-3.1e-05,-7.8e-05,-8.2e-05,-8.5e-05,-4.7e-05,-2.1e-05,-3.8e-05,-0.000175,2.5e-05,-1.5e-05,-0.000112,-9.7e-05,-5.3e-05,-0.000122,-2.4e-05,-5.4e-05,-2.8e-05,-0.00019,1.8e-05,-0.000104,-0.000121,-6e-06,8.8e-05,4.3e-05,-8e-06,-6.5e-05,-3.7e-05,-7.6e-05,1e-06,2.1e-05,4.4e-05,-4e-05,-0.000107,-2.1e-05,3e-05,7.6e-05,-8.6e-05,-4.6e-05,-9.5e-05,9e-06,5e-06,1.9e-05,-6.1e-05,4e-05,-0.000162,-4.2e-05,1.5e-05,-8.1e-05,-4.8e-05,0,-3.6e-05,-6.4e-05,5.3e-05,-5.3e-05,-0.00011,-6.3e-05,1.9e-05,-5.2e-05,-0.000103,2.8e-05,-1e-05,3e-06,-0.000162,-0.00013,-3.1e-05,2.4e-05,-5.1e-05,-7.2e-05,-2.3e-05,-9e-06,1.5e-05,1.5e-05,-4.1e-05,3.4e-05,-1.1e-05,-9.9e-05,-3.8e-05,1.7e-05,-5e-05,6.5e-05,4.7e-05,1.4e-05,-7.2e-05,5.2e-05,-6.7e-05,-4.9e-05,3.6e-05,1.7e-05,-0.000165,-7.8e-05,-9.3e-05,-6.4e-05,-6.1e-05
4.7e-05,3e-06,4.2e-05,1.3e-05,0.000161,1e-04,-1e-05,2.9e-05,-6e-06,-5.1e-05,-0.000135,0.000172,-7.7e-05,2.1e-05,5.1e-05,6e-05,3.4e-05,-1.9e-05,1.9e-05,-8.5e-05,4e-05,-7e-05,4e-05,7.6e-05,-7.6e-05,-7.3e-05,0,5.6e-05,1e-05,1.1e-05,4.8e-05,1.3e-05,0.000155,1.9e-05,0.000145,0.000103,2.9e-05,-2.7e-05,-1.3e-05,7e-06,-4.7e-05,-1.3e-05,-7.3e-05,-4.4e-05,0.000166,0.00014,-7.9e-05,-5e-05,-4e-06,2e-05,6e-06,0.000113,-2.6e-05,1.9e-05,1.3e-05,5.5e-05,-1.1e-05,-5.1e-05,-7.2e-05,-7.1e-05,3.1e-05,2.4e-05,-3e-06,1.7e-05,2.3e-05,3.6e-05,2e-06,-1.6e-05,-7.7e-05,0,-6e-06,-6e-05,3.8e-05,1.3e-05,1e-06,4.3e-05,2.5e-05,2e-05,2.3e-05,0.000101,5.1e-05,-6.5e-05,1.5e-05,-3.7e-05,-3.4e-05,-6e-05,-1.3e-05,-5.9e-05,-7e-06,-3.2e-05,1.9e-05,2e-06,-4.1e-05,1.2e-05,3.9e-05,0,-3e-06,-3e-06,3.8e-05,-6.5e-05,-3e-06,-6.1e-05,5e-06,-8e-06,9e-06,-1e-05,1.1e-05,-0.00017,-4.6e-05,-1e-05,-3.9e-05,2e-06,-2e-05,3.7e-05,-2.7e-05,-5.6e-05,-1e-06,2e-05,3.4e-05,-3.4e-05,-9e-06
-0.000185,-4.5e-05,0.000121,5.4e-05,-0.000102,-0.000103,4e-06,-9.1e-05,-0.000131,-0.000102,-6e-06,-0.000104,-7.7e-05,-0.000168,-0.000124,3e-06,-1.5e-05,-1.2e-05,-6e-06,-8e-06,-6.3e-05,8.9e-05,7.4e-05,-1e-06,7e-06,3.9e-05,-8.6e-05,-6.5e-05,-1.2e-05,5e-06,-2.7e-05,-0.000113,-4e-05,-2.4e-05,-0.000112,-8.4e-05,-3.6e-05,-9e-06,4.1e-05,-3e-06,-5.5e-05,-2e-06,4.5e-05,4.6e-05,-4.5e-05,-5.5e-05,0.000109,9.2e-05,1.5e-05,4.2e-05,-6.7e-05,-7.1e-05,-2.1e-05,-0.000156,-1.8e-05,-5.3e-05,1.1e-05,4e-06,7e-05,2.6e-05,2.7e-05,8.1e-05,5e-06,-7.9e-05,-1.8e-05,-3e-05,-1.2e-05,4.6e-05,9.2e-05,1.2e-05,5.9e-05,4.9e-05,-2e-05,-3.6e-05,-7e-06,-5.2e-05,1e-06,-1.9e-05,2.4e-05,-5.4e-05,-8e-05,-1.9e-05,6e-05,1.2e-05,-7.5e-05,-2.6e-05,5e-05,1.5e-05,-5.1e-05,2.2e-05,4.8e-05,6.4e-05,-2e-05,-5e-05,-1.3e-05,2.1e-05,-8e-06,5e-06,-3.3e-05,5.1e-05,-4.3e-05,-1e-06,-2.7e-05,2e-05,4e-06,-7.9e-05,-3.3e-05,4.6e-05,5e-05,-5.7e-05,-3e-06,-6.9e-05,-2e-05,2.4e-05,1.5e-05,2e-05,1e-06,-2.6e-05,5.4e-05,2.2e-05,2e-05
-1.8e-05,5.1e-05,-0.000158,-1.8e-05,2e-06,3.9e-05,0,5.8e-05,0.000165,-1.3e-05,1.1e-05,1e-04,0.000123,7e-06,7.2e-05,-2e-05,-5e-06,-4.5e-05,5e-06,1.5e-05,-8e-06,4.8e-05,-4.1e-05,-0.000105,-2e-05,-1.6e-05,1.7e-05,-5e-05,5.9e-05,-3.2e-05,-5e-06,-1.4e-05,4e-06,-7e-06,-2.4e-05,-4.3e-05,-7e-06,-2.5e-05,1.2e-05,3e-06,-3.4e-05,-7e-06,-1.1e-05,-0.000138,-5.8e-05,-4e-05,-5.8e-05,3e-05,-4e-05,8e-06,8.8e-05,2.9e-05,-2.4e-05,1e-06,-4e-06,-3.6e-05,2.8e-05,9e-06,-2.7e-05,2e-06,-1.6e-05,-1.6e-05,1.4e-05,5.6e-05,4e-05,2.1e-05,-2e-06,1e-06,1.3e-05,1e-06,-3.7e-05,-5.4e-05,-2.5e-05,1e-05,-2e-06,-1.4e-05,-2.3e-05,3e-06,-1.1e-05,2.9e-05,-3e-06,2.4e-05,0,4.6e-05,5.7e-05,-1e-06,-4.6e-05,3.8e-05,3.3e-05,-2.1e-05,-2e-06,-1.3e-05,9e-06,3.6e-05,-8e-06,-3e-05,-9e-06,1.9e-05,1.6e-05,5.1e-05,7e-06,1.9e-05,7e-06,0.000104,1.3e-05,-3.1e-05,3.1e-05,7.2e-05,6.8e-05,5.2e-05,-1.3e-05,1e-06,3.2e-05,5e-06,7e-06,-4.6e-05,2.3e-05,1e-06,-1.7e-05,1.3e-05,-1.6e-05
1.9e-05,4.2e-05,-2.2e-05,2.5e-05,8.9e-05,5e-06,-4.1e-05,-3e-05,-2e-05,7.1e-05,5.3e-05,-3.1e-05,3.4e-05,1.3e-05,-2.4e-05,-6.8e-05,1.7e-05,3e-06,3.9e-05,5.4e-05,1.2e-05,-5.6e-05,5.1e-05,3.3e-05,4.5e-05,3.9e-05,0,2e-05,9e-06,2.8e-05,2.3e-05,8.7e-05,-4.4e-05,5.9e-05,7.1e-05,4.7e-05,0.000125,4.7e-05,-5.2e-05,7e-06,1e-05,-7e-06,-2.8e-05,-7e-06,2.7e-05,9.1e-05,-1.7e-05,-1.2e-05,7.5e-05,3.5e-05,-4.8e-05,2.6e-05,2e-05,3.5e-05,4.4e-05,3.4e-05,-2.5e-05,-8e-06,-2e-05,0,-1e-05,0,1.1e-05,-3e-05,0,2.5e-05,7.3e-05,2.6e-05,-4.6e-05,-4.4e-05,-2.4e-05,1.9e-05,2.3e-05,-2e-06,-1.9e-05,-3e-06,-4e-06,-2.9e-05,-1.2e-05,-8e-06,2.3e-05,-1.3e-05,2.4e-05,-5e-05,7e-06,-1e-05,2.2e-05,9e-06,4e-06,2.4e-05,1.1e-05,-2e-06,5.5e-05,-1e-06,-1e-06,-8e-06,0,-1.1e-05,-1.3e-05,-2.8e-05,-6e-06,8e-06,8e-06,3e-06,2e-06,5.8e-05,5.3e-05,-2.1e-05,-3.8e-05,2.7e-05,7.1e-05,7.6e-05,3.9e-05,4e-06,6.5e-05,5e-06,-2.2e-05,1e-05,5.1e-05,-4e-05,7e-06
2.5e-05,1.1e-05,4e-06,-4.5e-05,-6.7e-05,-1.5e-05,2.9e-05,5.9e-05,1.4e-05,-2e-05,-7e-06,4e-06,-6e-05,3.6e-05,1.4e-05,6.4e-05,-1.2e-05,2.5e-05,-3e-06,-3.2e-05,2e-05,2e-05,2e-05,7.5e-05,-2.8e-05,-9e-06,3.1e-05,-6e-06,2.3e-05,-2.7e-05,1.6e-05,-3e-05,5e-06,-2e-05,-8e-06,-4.3e-05,-5e-05,2e-05,5.4e-05,-3.4e-05,-7e-06,0,1e-05,0.000108,3.8e-05,-1.2e-05,7e-05,-2.5e-05,-6.9e-05,3e-06,9e-06,-5.7e-05,-2.8e-05,9e-06,-2.3e-05,3e-05,2e-06,2e-06,1.3e-05,2.1e-05,1.8e-05,-4.7e-05,-1.9e-05,-2e-06,-1.8e-05,-2.2e-05,-1.5e-05,-2e-05,-1.3e-05,3.7e-05,3e-05,-1.8e-05,-1.9e-05,2.5e-05,8e-06,-7e-06,6e-06,1.1e-05,-7e-06,-3.2e-05,5e-06,2e-05,1e-05,2e-06,1.2e-05,4.8e-05,-3e-05,-3.1e-05,-2.7e-05,-2.3e-05,-1.2e-05,-1.6e-05,-1.5e-05,-2e-06,1.9e-05,1.2e-05,-6e-06,1e-05,0,-1e-05,2.8e-05,-1.5e-05,7e-06,-9e-06,-5.5e-05,-3.3e-05,6e-06,-3.2e-05,-2.6e-05,-3.7e-05,-1.7e-05,-1.8e-05,1.7e-05,-1.7e-05,1.8e-05,-4e-06,3.8e-05,8e-06,-6e-05,2.6e-05,4e-06
-3e-05,-4.4e-05,2e-05,-1.3e-05,-4e-05,6e-06,-1.6e-05,-3.4e-05,-3.9e-05,6e-06,1.1e-05,-4.3e-05,8.5e-05,0,-2e-06,-1.6e-05,4e-06,2e-06,-1.7e-05,1.3e-05,-3.3e-05,-4e-05,-5e-06,2.5e-05,4e-06,-1e-06,-3.1e-05,6e-06,6e-06,2.1e-05,-2e-06,2.3e-05,2.2e-05,1.5e-05,-4.5e-05,5.5e-05,-6e-06,-1.6e-05,-1.1e-05,-2e-06,-4.7e-05,-2.9e-05,2.1e-05,-4.4e-05,-3.4e-05,8e-06,-6.2e-05,-2.9e-05,2.3e-05,7e-06,-1.4e-05,-5e-05,2.3e-05,-3e-06,-1.3e-05,-6e-06,-5e-05,-4e-06,-1.7e-05,-7e-06,-2e-05,3.3e-05,-7e-06,1.5e-05,5e-06,7e-06,-4e-05,-2.4e-05,-2e-05,-1.5e-05,-2.9e-05,-1.8e-05,5e-06,-4.1e-05,3e-06,5e-06,-3e-06,-5.5e-05,5e-06,2e-05,-6.8e-05,1.5e-05,-2.9e-05,1.6e-05,1.3e-05,-1e-05,1.1e-05,3e-05,6e-06,1.2e-05,-1.4e-05,0,-3.4e-05,1.8e-05,-1.3e-05,1.5e-05,-2e-06,5e-06,-9e-06,-5e-06,-1.5e-05,-1e-05,-2.3e-05,0,2e-06,-8e-06,-1.7e-05,4.7e-05,-3.2e-05,-9e-06,8e-06,-1.3e-05,-1.3e-05,2.5e-05,-3.4e-05,-3.3e-05,8e-06,-7e-06,-3.1e-05,-1.4e-05,-2.2e-05
9e-06,1.5e-05,-2.7e-05,1.2e-05,2e-06,8e-06,-2.1e-05,-2.1e-05,-1.1e-05,6e-06,-2.4e-05,2.3e-05,-4.3e-05,-4.4e-05,1.7e-05,-2.4e-05,-1.6e-05,-7e-06,-3e-06,1.7e-05,6e-06,1.6e-05,-2.1e-05,-3.2e-05,-1.1e-05,-1.1e-05,2.3e-05,-2.3e-05,-2.2e-05,-4e-06,5e-06,-5e-06,-5e-06,-2e-06,3.3e-05,-3e-06,-1.2e-05,1.1e-05,-3.4e-05,4e-06,4e-05,-2.5e-05,-1.2e-05,1.5e-05,1.2e-05,-2.7e-05,1.5e-05,-1.4e-05,3.2e-05,5e-06,-5e-06,4e-06,-9e-06,-1.3e-05,-1.6e-05,-1.1e-05,-7e-06,-9e-06,1.5e-05,0,-8e-06,2.5e-05,-2.6e-05,3e-06,-1.2e-05,-1e-05,2.1e-05,7e-06,1.1e-05,1.2e-05,-7e-06,3.6e-05,-1.5e-05,-1.3e-05,5e-06,4e-06,-5e-06,3.5e-05,-8e-06,-3e-06,3.4e-05,-1.2e-05,-1e-06,-1.7e-05,-5.9e-05,2e-06,1e-06,2e-06,3e-06,-4e-06,-1.1e-05,-1e-06,1.8e-05,-2.5e-05,3e-06,-1e-06,1e-05,-1.5e-05,1e-05,-1.4e-05,2.3e-05,-9e-06,1e-06,-9e-06,1.4e-05,1.8e-05,-2e-05,-1.1e-05,1.4e-05,1.9e-05,-9e-06,-8e-06,-2.2e-05,-1.1e-05,-2e-05,1.4e-05,-1.6e-05,5e-06,2e-06,1.6e-05,1e-05
3e-06,-2.5e-05,1.6e-05,3e-05,2.3e-05,-6e-06,2.7e-05,2.8e-05,3.1e-05,-3.4e-05,-2e-06,-1.7e-05,1.2e-05,1.5e-05,-4e-06,1.6e-05,2e-06,7e-06,-1.4e-05,0,1e-06,2.3e-05,7e-06,-1.3e-05,1e-05,5e-06,1e-06,1.4e-05,-1.4e-05,9e-06,-5e-06,1e-06,-4.8e-05,4e-06,-1e-05,-1.3e-05,-1e-05,1.2e-05,2.2e-05,-3e-06,1e-05,-6e-06,1e-06,2.3e-05,-2e-06,2.9e-05,4e-06,7e-06,-2.2e-05,-2e-06,5e-06,1.7e-05,1.3e-05,8e-06,-1.1e-05,1.2e-05,5.1e-05,1.9e-05,-1.1e-05,2e-06,1.2e-05,-1e-05,2.4e-05,-3e-06,-2e-06,9e-06,-6e-06,-3e-06,4e-06,-1.3e-05,7e-06,-7e-06,9e-06,2e-06,2e-06,-1e-06,-2e-06,6e-06,3e-06,1e-06,-1.9e-05,-7e-06,-8e-06,-8e-06,2.2e-05,-2.3e-05,-2e-06,-1.9e-05,-1e-05,-6e-06,1.1e-05,1e-06,7e-06,3e-06,3e-06,-1.5e-05,8e-06,1.4e-05,-1.1e-05,2.2e-05,2e-06,7e-06,6e-06,-2.5e-05,-6e-06,6e-06,6e-06,-9e-06,-6e-06,1.5e-05,-1e-06,3e-06,9e-06,8e-06,3e-06,2.2e-05,2e-06,-6e-06,1.9e-05,6e-06,2e-06
2.1e-05,1.1e-05,-3e-05,-8e-06,-1.7e-05,-1.7e-05,-1.1e-05,-2e-05,-1.2e-05,4.2e-05,-7e-06,1.5e-05,-1.2e-05,1.9e-05,1e-06,-1.7e-05,1.5e-05,-5e-06,-1e-06,3e-06,-1.2e-05,-9e-06,-2e-05,-1.6e-05,2.1e-05,-9e-06,-8e-06,-1.3e-05,1.7e-05,1.3e-05,1.3e-05,-1.6e-05,2e-06,-1.1e-05,-1.7e-05,2e-05,8e-06,1e-06,2e-06,-2e-06,1.3e-05,7e-06,-4e-06,1e-05,-2.4e-05,-7e-06,-1.5e-05,1.2e-05,-1.4e-05,1e-06,-6e-06,-7e-06,-6e-06,1.7e-05,-9e-06,1e-06,-3e-06,-1e-06,-3e-06,-8e-06,-7e-06,5e-06,-6e-06,0,4e-06,-1e-06,-7e-06,-3e-06,-8e-06,1e-06,8e-06,-7e-06,-9e-06,9e-06,-4e-06,-4e-06,1e-06,1.3e-05,-2e-06,3e-06,3e-06,-5e-06,-3e-06,1.1e-05,1.5e-05,8e-06,5e-06,0,9e-06,4e-06,5e-06,6e-06,2e-06,1.3e-05,-1e-06,1e-06,7e-06,-1.1e-05,2e-06,-7e-06,-1.9e-05,-7e-06,-3e-06,2.3e-05,1.5e-05,7e-06,4e-06,1e-06,1.2e-05,-5e-06,-6e-06,2e-06,0,-4e-06,2.1e-05,4e-06,-1e-06,4e-06,8e-06,0,-3e-06
-1.2e-05,1e-05,-4e-06,-1.7e-05,6e-06,5e-06,-1.7e-05,4e-06,-9e-06,-2e-06,-3e-06,-9e-06,-4e-06,3e-06,-9e-06,-8e-06,-5e-06,-9e-06,-6e-06,-7e-06,-4e-06,-1.1e-05,2e-06,1e-06,-8e-06,1.2e-05,6e-06,1.6e-05,2e-06,-9e-06,-2e-06,1e-05,-1.1e-05,-1e-06,1.7e-05,-1.8e-05,-3e-05,4e-06,-1.6e-05,1.8e-05,-1.1e-05,4e-06,0,-1.3e-05,-1e-05,-2e-06,1.8e-05,8e-06,0,-3e-06,-9e-06,1.6e-05,-1e-06,-8e-06,-3e-06,-6e-06,-1.6e-05,-5e-06,3e-06,3e-06,-3e-06,-7e-06,1e-06,7e-06,8e-06,-1e-06,5e-06,1e-06,9e-06,0,-8e-06,9e-06,3e-06,-6e-06,-3e-06,2e-06,-3e-06,-9e-06,2e-06,-1e-06,4e-06,8e-06,0,-6e-06,-1.9e-05,-4e-06,-1e-05,-1.3e-05,-3e-06,-6e-06,4e-06,-2e-06,-1.8e-05,-1.1e-05,-7e-06,7e-06,-3e-06,1e-06,5e-06,7e-06,0,0,-5e-06,6e-06,2e-06,-4e-06,-1e-06,0,0,4e-06,-5e-06,-2e-06,-2e-06,-6e-06,-2e-06,2e-06,0,-4e-06,-7e-06,-6e-06,-3e-06
-1.5e-05,-8e-06,1.9e-05,2e-06,5e-06,5e-06,2.8e-05,-6e-06,3e-06,-1.3e-05,7e-06,7e-06,-1e-06,-1.9e-05,0,1e-05,-1e-06,4e-06,-1.2e-05,1e-05,1.2e-05,1e-05,1.6e-05,6e-06,-1e-05,-2e-05,-9e-06,1e-06,-6e-06,1e-06,3e-06,-9e-06,1e-06,2e-06,0,-6e-06,6e-06,-8e-06,8e-06,-1.4e-05,-1.3e-05,-4e-06,3e-06,2e-06,8e-06,-3e-06,-2.1e-05,-8e-06,1e-06,-3e-06,2e-06,2e-06,-3e-06,-1.1e-05,-1e-06,-5e-06,6e-06,6e-06,1e-06,-7e-06,7e-06,-2e-06,-6e-06,0,0,4e-06,5e-06,-1e-06,-6e-06,4e-06,-3e-06,-3e-06,2e-06,9e-06,4e-06,-3e-06,-1e-06,-4e-06,-3e-06,-6e-06,3e-06,-2e-05,-1e-06,-4e-06,0,2e-06,-1e-06,6e-06,1e-06,5e-06,0,0,3e-06,5e-06,5e-06,-1e-06,-1e-06,-1e-06,-4e-06,-3e-06,1e-06,6e-06,2e-06,1e-06,-1e-06,-1e-05,-3e-06,0,-1e-06,0,1.3e-05,-5e-06,9e-06,0,-1e-05,-1e-06,-1.3e-05,5e-06,5e-06,2e-06,4e-06
-8e-06,8e-06,1.4e-05,9e-06,-9e-06,-1e-06,-1.4e-05,1e-05,1.1e-05,3e-06,1.3e-05,-1.1e-05,1.7e-05,-3e-06,5e-06,7e-06,-1e-05,-1e-06,5e-06,-1e-06,-9e-06,-7e-06,-4e-06,-7e-06,2e-06,3e-06,1e-06,-5e-06,-1e-06,-2e-06,-6e-06,-1e-06,1e-05,4e-06,-1.6e-05,-2e-06,-2e-06,5e-06,-1e-06,-4e-06,5e-06,1e-06,7e-06,3e-06,-6e-06,0,1.2e-05,-9e-06,-5e-06,-1e-06,0,-2e-06,1e-06,1.7e-05,3e-06,1e-06,-8e-06,-3e-06,-1e-06,7e-06,-2e-06,-8e-06,1e-06,-6e-06,-3e-06,-4e-06,-1e-06,3e-06,-3e-06,-4e-06,1e-06,-1e-06,0,-2e-06,0,-3e-06,-1e-06,1e-06,1e-06,2e-06,-2e-06,4e-06,3e-06,5e-06,9e-06,-2e-06,3e-06,-8e-06,2e-06,-5e-06,-3e-06,-3e-06,9e-06,0,-1e-06,-3e-06,-4e-06,-3e-06,0,-9e-06,-2e-06,4e-06,1e-06,-5e-06,1e-06,-1e-06,2e-06,-5e-06,-1.3e-05,5e-06,-3e-06,3e-06,-1e-06,4e-06,-5e-06,2e-06,6e-06,-1e-06,-9e-06,-1e-05,1e-06
8e-06,-1e-06,0,0,6e-06,1e-06,1e-06,-9e-06,-9e-06,1.4e-05,2e-06,1e-06,-1.5e-05,7e-06,2e-06,0,9e-06,-3e-06,-2e-06,5e-06,-2e-06,3e-06,-1.4e-05,-5e-06,0,-1e-06,0,0,2e-06,4e-06,7e-06,1.2e-05,4e-06,0,1.1e-05,1e-05,1.1e-05,-3e-06,6e-06,0,-1e-05,1e-06,-1e-06,-1e-05,-3e-06,8e-06,7e-06,-1e-06,1.1e-05,-4e-06,-3e-06,9e-06,-1e-06,-7e-06,3e-06,-1e-06,-3e-06,1e-06,-2e-06,1e-06,-1e-06,1.6e-05,7e-06,1e-06,-1e-06,5e-06,-4e-06,-4e-06,5e-06,0,-3e-06,-3e-06,-2e-06,0,0,2e-06,-1e-06,4e-06,0,5e-06,7e-06,8e-06,-4e-06,2e-06,1e-06,6e-06,-3e-06,-4e-06,-3e-06,5e-06,-5e-06,2e-06,-2e-06,0,-1e-06,1e-06,0,1e-06,0,1e-06,0,-4e-06,-1e-06,-1.2e-05,3e-06,1e-06,-2e-06,1e-06,7e-06,-9e-06,4e-06,5e-06,-1e-06,-2e-06,2e-06,-2e-06,2e-06,-1e-06,-3e-06,5e-06,-2e-06
-2e-06,-6e-06,-1e-05,-5e-06,1e-06,-2e-06,3e-06,1.1e-05,0,-9e-06,-4e-06,5e-06,1.1e-05,6e-06,5e-06,-9e-06,1e-06,4e-06,0,-7e-06,5e-06,6e-06,1e-05,2e-06,3e-06,-1e-06,2e-06,5e-06,-4e-06,-5e-06,1e-06,4e-06,-3e-06,-2e-06,4e-06,0,-7e-06,-4e-06,-1e-05,-1e-06,0,-4e-06,-1e-06,8e-06,4e-06,-7e-06,-1.2e-05,3e-06,-1e-06,-1e-06,3e-06,4e-06,-1e-06,4e-06,1e-06,1e-06,2e-06,-1e-06,3e-06,1e-06,5e-06,-5e-06,-6e-06,-1e-06,-4e-06,-4e-06,1e-06,2e-06,-1e-06,-2e-06,-2e-06,1e-06,0,4e-06,-2e-06,-3e-06,0,3e-06,0,-5e-06,-6e-06,3e-06,1e-06,1e-06,-2e-06,6e-06,2e-06,-1e-06,2e-06,-3e-06,-2e-06,-1e-06,-4e-06,-1e-06,2e-06,3e-06,1e-06,-1e-06,2e-06,4e-06,7e-06,-1e-06,2e-06,-1e-06,1e-06,-5e-06,0,3e-06,1e-06,-3e-06,-1e-06,-3e-06,-4e-06,1e-06,4e-06,-7e-06,-3e-06,1e-06,5e-06,-2e-06,-1e-06
-3e-06,0,-1e-06,0,-3e-06,1e-06,-2e-06,-1e-05,-1e-06,6e-06,-4e-06,-1e-05,0,-3e-06,1e-06,3e-06,0,1e-06,3e-06,9e-06,-1e-06,-8e-06,-8e-06,8e-06,1e-06,0,-4e-06,-4e-06,-5e-06,1e-06,-2e-06,-7e-06,1e-06,-6e-06,-1.1e-05,-4e-06,-1e-06,4e-06,6e-06,-3e-06,-2e-06,-1e-06,0,8e-06,2e-06,3e-06,1.2e-05,3e-06,0,-2e-06,-6e-06,1e-06,2e-06,-6e-06,4e-06,-1e-06,2e-06,0,1e-06,1e-06,-3e-06,-3e-06,2e-06,1e-06,1e-06,3e-06,-5e-06,3e-06,5e-06,4e-06,4e-06,0,-1e-06,-8e-06,0,1e-06,-2e-06,-4e-06,0,4e-06,0,-7e-06,2e-06,-5e-06,2e-06,-4e-06,-2e-06,7e-06,0,2e-06,3e-06,-1e-06,-1e-06,2e-06,1e-06,0,1e-06,0,-3e-06,0,-1e-06,2e-06,-2e-06,-2e-06,-1e-06,-5e-06,-2e-06,-1e-06,1.3e-05,7e-06,2e-06,-4e-06,-2e-06,-1e-06,-3e-06,-2e-06,-2e-06,0,2e-06,1e-06,2e-06
-1e-06,0,3e-06,3e-06,2e-06,1e-06,5e-06,6e-06,3e-06,-8e-06,-3e-06,1e-05,-7e-06,-1e-05,2e-06,6e-06,-1e-06,-3e-06,-1e-06,-1e-06,-4e-06,1e-06,-6e-06,-1e-06,-3e-06,-4e-06,8e-06,-1e-06,2e-06,3e-06,0,4e-06,8e-06,3e-06,7e-06,1.1e-05,5e-06,-2e-06,-3e-06,9e-06,2e-06,1e-06,1e-06,-5e-06,-1e-06,-6e-06,-4e-06,3e-06,-1e-06,-2e-06,4e-06,-7e-06,-2e-06,5e-06,0,-1e-06,4e-06,1e-06,-2e-06,-4e-06,-4e-06,-4e-06,-2e-06,1e-06,0,-3e-06,2e-06,1e-06,-3e-06,0,-1e-06,-2e-06,-2e-06,4e-06,1e-06,-2e-06,0,-2e-06,0,-3e-06,4e-06,3e-06,0,2e-06,-7e-06,-3e-06,-3e-06,-7e-06,-1e-06,-1e-06,4e-06,1e-06,5e-06,-3e-06,-2e-06,0,0,0,2e-06,6e-06,0,0,0,3e-06,3e-06,6e-06,-2e-06,-7e-06,-1e-06,-7e-06,-6e-06,1e-06,-1e-06,-2e-06,-2e-06,0,2e-06,1e-06,4e-06,0,-1e-06
8e-06,-2e-06,4e-06,-1e-06,6e-06,0,-8e-06,-2e-06,3e-06,1e-06,-1e-06,-9e-06,0,5e-06,-3e-06,-6e-06,-2e-06,3e-06,5e-06,1e-06,2e-06,2e-06,1.4e-05,-6e-06,1e-06,-1e-06,-5e-06,-1e-06,4e-06,-1e-06,-1e-06,-2e-06,1e-06,0,2e-06,-8e-06,3e-06,0,1e-06,-4e-06,5e-06,1e-06,1e-06,5e-06,7e-06,4e-06,-1e-06,0,-3e-06,-1e-06,0,0,1e-06,0,2e-06,1e-06,-5e-06,-1e-06,0,2e-06,4e-06,0,5e-06,-3e-06,4e-06,2e-06,5e-06,1e-06,-3e-06,1e-06,-3e-06,2e-06,2e-06,-1e-06,0,0,0,-3e-06,0,-3e-06,-5e-06,1e-06,0,4e-06,5e-06,-3e-06,3e-06,3e-06,0,0,1e-06,-1e-06,-1e-06,4e-06,0,0,1e-06,1e-06,0,-7e-06,-2e-06,-1e-06,0,6e-06,-2e-06,5e-06,1e-06,3e-06,-1e-06,2e-06,2e-06,3e-06,1e-06,0,1e-06,-1e-06,2e-06,-3e-06,-4e-06,0,0
2e-06,6e-06,1e-06,-3e-06,-5e-06,-1e-06,5e-06,0,-7e-06,9e-06,1e-06,7e-06,3e-06,4e-06,1e-06,2e-06,3e-06,-2e-06,2e-06,-2e-06,-1e-06,-2e-06,-4e-06,-3e-06,0,8e-06,1e-06,-3e-06,-2e-06,2e-06,3e-06,-4e-06,3e-06,1e-06,-8e-06,-2e-06,1e-06,-1e-06,-1e-06,-2e-06,-5e-06,-1e-06,2e-06,4e-06,1e-06,1e-06,8e-06,-5e-06,1e-06,-1e-06,-3e-06,-4e-06,0,0,0,3e-06,0,0,-1e-06,-5e-06,1e-06,-1e-06,-2e-06,0,-1e-06,-1e-06,-4e-06,-1e-06,2e-06,-2e-06,2e-06,0,-2e-06,-1e-06,0,-1e-06,-1e-06,3e-06,0,3e-06,5e-06,-3e-06,2e-06,-6e-06,4e-06,1e-06,-4e-06,1e-06,1e-06,0,0,0,-1e-06,-2e-06,1e-06,-1e-06,1e-06,-2e-06,-1e-06,1e-06,-1e-06,-1e-06,1e-06,2e-06,-1e-06,1e-06,1e-06,2e-06,-5e-06,-5e-06,-1e-06,0,3e-06,2e-06,2e-06,2e-06,-4e-06,2e-06,-4e-06,0,1e-06
-1e-06,0,-6e-06,1e-06,-6e-06,-1e-06,4e-06,1e-06,3e-06,-4e-06,3e-06,-9e-06,-4e-06,2e-06,-3e-06,2e-06,-2e-06,-2e-06,0,0,-2e-06,1e-06,-1e-06,0,1e-06,-4e-06,-1e-06,2e-06,-2e-06,-1e-06,-2e-06,2e-06,-6e-06,-3e-06,4e-06,5e-06,-2e-06,0,2e-06,-1e-06,2e-06,-2e-06,-1e-06,0,-1e-06,-2e-06,-1e-05,-4e-06,-1e-06,0,2e-06,-6e-06,1e-06,-1e-06,-1e-06,-3e-06,2e-06,0,2e-06,3e-06,-3e-06,3e-06,-2e-06,3e-06,0,0,3e-06,1e-06,-3e-06,1e-06,0,1e-06,3e-06,0,0,-1e-06,0,0,0,-1e-06,-6e-06,-4e-06,0,-1e-06,-8e-06,-1e-06,3e-06,4e-06,-2e-06,0,-3e-06,0,-2e-06,0,-1e-06,0,0,2e-06,1e-06,0,-3e-06,0,-2e-06,-5e-06,3e-06,-1e-06,1e-06,-2e-06,2e-06,3e-06,1e-06,-2e-06,-2e-06,-1e-06,0,2e-06,2e-06,-2e-06,-1e-06,0,0
-4e-06,-4e-06,-5e-06,2e-06,4e-06,2e-06,-9e-06,-3e-06,1e-06,-4e-06,3e-06,9e-06,3e-06,-5e-06,3e-06,-6e-06,3e-06,2e-06,3e-06,1e-06,1e-06,2e-06,1e-06,5e-06,-2e-06,2e-06,2e-06,2e-06,3e-06,0,-1e-06,1e-06,0,2e-06,4e-06,-4e-06,2e-06,1e-06,1e-06,-2e-06,-2e-06,-1e-06,0,-2e-06,0,-1e-06,6e-06,2e-06,2e-06,0,-2e-06,0,-3e-06,-2e-06,-1e-06,-2e-06,-2e-06,1e-06,-2e-06,1e-06,2e-06,1e-06,-1e-06,-1e-06,-2e-06,-1e-06,0,0,3e-06,0,-2e-06,0,-3e-06,0,0,0,-1e-06,4e-06,0,1e-06,3e-06,4e-06,0,5e-06,2e-06,4e-06,-2e-06,-3e-06,1e-06,0,-2e-06,1e-06,3e-06,1e-06,0,1e-06,0,-2e-06,-1e-06,-1e-06,1e-06,1e-06,1e-06,-2e-06,-1e-06,-1e-06,-1e-06,-2e-06,-5e-06,-2e-06,0,0,2e-06,1e-06,-3e-06,1e-06,1e-06,1e-06,0,0,0
1e-06,2e-06,1e-06,1e-06,1e-06,-1e-06,7e-06,5e-06,-2e-06,0,1e-06,-7e-06,1e-06,-4e-06,0,1e-06,-3e-06,0,-1e-06,-1e-06,0,-3e-06,2e-06,1e-06,1e-06,-2e-06,-2e-06,-2e-06,0,-1e-06,-1e-06,-3e-06,-3e-06,1e-06,-7e-06,2e-06,2e-06,-2e-06,-4e-06,0,-1e-06,0,1e-06,2e-06,1e-06,0,-1e-06,4e-06,-1e-06,0,1e-06,2e-06,1e-06,6e-06,-2e-06,1e-06,2e-06,-1e-06,1e-06,0,2e-06,-3e-06,2e-06,-3e-06,-1e-06,1e-06,-2e-06,-1e-06,1e-06,1e-06,1e-06,-1e-06,2e-06,0,0,-2e-06,0,-1e-06,0,-1e-06,-2e-06,0,0,-2e-06,2e-06,0,0,2e-06,0,0,0,0,1e-06,0,1e-06,1e-06,0,1e-06,0,3e-06,1e-06,-1e-06,0,-2e-06,0,0,0,4e-06,6e-06,-3e-06,3e-06,2e-06,-3e-06,-1e-06,0,2e-06,0,-1e-06,3e-06,0,0
0,0,4e-06,-2e-06,-1e-06,1e-06,0,-5e-06,1e-06,7e-06,-2e-06,4e-06,-2e-06,5e-06,2e-06,3e-06,1e-06,-1e-06,1e-06,-2e-06,-2e-06,1e-06,-6e-06,-1e-06,1e-06,2e-06,2e-06,0,-4e-06,0,0,4e-06,1e-06,0,2e-06,0,0,0,3e-06,3e-06,-1e-06,1e-06,1e-06,0,-1e-06,3e-06,-4e-06,0,1e-06,0,1e-06,1e-06,0,-5e-06,-2e-06,1e-06,1e-06,0,0,2e-06,-2e-06,-1e-06,0,2e-06,1e-06,-1e-06,0,0,-2e-06,-1e-06,1e-06,0,-1e-06,1e-06,0,1e-06,-1e-06,0,0,0,3e-06,-2e-06,0,-3e-06,-1e-06,2e-06,0,1e-06,0,-1e-06,1e-06,0,-1e-06,-2e-06,0,-1e-06,-1e-06,1e-06,-1e-06,1e-06,0,-1e-06,0,2e-06,1e-06,0,0,-1e-06,-1e-06,3e-06,-3e-06,0,1e-06,-1e-06,2e-06,0,-1e-06,1e-06,0,1e-06,0
-1e-06,-3e-06,2e-06,-1e-06,1e-06,-1e-06,-7e-06,5e-06,-1e-06,-6e-06,-2e-06,-3e-06,3e-06,2e-06,0,-1e-06,0,2e-06,0,0,0,0,3e-06,-2e-06,-1e-06,4e-06,-2e-06,2e-06,2e-06,0,0,1e-06,-3e-06,-2e-06,3e-06,2e-06,-2e-06,0,1e-06,1e-06,-3e-06,0,0,-1e-06,-1e-06,-3e-06,5e-06,-1e-06,1e-06,1e-06,-2e-06,0,0,2e-06,-2e-06,-1e-06,-2e-06,0,0,-2e-06,0,0,-2e-06,1e-06,0,1e-06,0,0,1e-06,0,-2e-06,-1e-06,-1e-06,-1e-06,0,-1e-06,0,-2e-06,0,-1e-06,-2e-06,1e-06,0,3e-06,-1e-06,-2e-06,-1e-06,3e-06,0,1e-06,2e-06,0,-1e-06,2e-06,-1e-06,0,0,-1e-06,2e-06,-3e-06,1e-06,1e-06,0,3e-06,0,-4e-06,1e-06,-2e-06,-2e-06,-3e-06,1e-06,-1e-06,-1e-06,0,1e-06,-1e-06,1e-06,0,0,-1e-06,-1e-06
-3e-06,2e-06,-2e-06,1e-06,-1e-06,0,7e-06,-6e-06,0,4e-06,-1e-06,3e-06,-3e-06,-1e-06,1e-06,-2e-06,0,-1e-06,-2e-06,0,0,-2e-06,4e-06,1e-06,1e-06,-2e-06,1e-06,-1e-06,4e-06,-1e-06,-1e-06,-3e-06,-1e-06,0,-4e-06,-1e-06,-1e-06,-1e-06,-3e-06,-3e-06,2e-06,0,1e-06,3e-06,0,0,-6e-06,-1e-06,-1e-06,0,0,4e-06,-1e-06,-2e-06,-1e-06,0,0,0,0,1e-06,2e-06,1e-06,-1e-06,-1e-06,1e-06,-1e-06,2e-06,0,-2e-06,0,-1e-06,-1e-06,2e-06,0,0,0,0,1e-06,0,1e-06,1e-06,2e-06,0,1e-06,0,-1e-06,0,-2e-06,1e-06,-1e-06,0,0,2e-06,-2e-06,1e-06,1e-06,0,0,-1e-06,2e-06,0,1e-06,0,3e-06,-1e-06,-2e-06,0,1e-06,-4e-06,3e-06,-2e-06,0,1e-06,0,-1e-06,-1e-06,1e-06,-1e-06,-2e-06,1e-06,0
1e-06,1e-06,-2e-06,1e-06,-1e-06,1e-06,-2e-06,5e-06,1e-06,-4e-06,0,-4e-06,-2e-06,-4e-06,-1e-06,0,0,-1e-06,0,0,-1e-06,1e-06,-6e-06,2e-06,-1e-06,-1e-06,1e-06,1e-06,-2e-06,0,-1e-06,0,-2e-06,1e-06,2e-06,-1e-06,1e-06,1e-06,2e-06,1e-06,-1e-06,-1e-06,-1e-06,2e-06,-2e-06,0,2e-06,-2e-06,1e-06,0,0,2e-06,2e-06,3e-06,0,1e-06,0,0,0,-3e-06,0,1e-06,1e-06,1e-06,-1e-06,1e-06,-1e-06,-1e-06,1e-06,1e-06,1e-06,0,-2e-06,1e-06,0,0,0,1e-06,0,1e-06,-1e-06,-2e-06,1e-06,-2e-06,-1e-06,-2e-06,1e-06,-1e-06,0,0,-1e-06,0,0,1e-06,0,0,0,0,0,-3e-06,-1e-06,-1e-06,0,-1e-06,1e-06,3e-06,0,2e-06,1e-06,-2e-06,0,1e-06,1e-06,-1e-06,-1e-06,-1e-06,-2e-06,1e-06,-1e-06,-1e-06,0
3e-06,-2e-06,-1e-06,-1e-06,2e-06,-1e-06,-2e-06,-4e-06,-1e-06,0,1e-06,3e-06,3e-06,1e-06,0,3e-06,-1e-06,1e-06,-2e-06,-1e-06,0,1e-06,4e-06,-1e-06,0,1e-06,-1e-06,-1e-06,-2e-06,0,0,1e-06,1e-06,1e-06,2e-06,3e-06,0,0,0,-2e-06,1e-06,0,0,-2e-06,-1e-06,1e-06,3e-06,-1e-06,-1e-06,0,-1e-06,-1e-06,-2e-06,-2e-06,1e-06,0,0,0,0,0,-1e-06,1e-06,1e-06,0,0,-1e-06,1e-06,-1e-06,1e-06,0,0,0,2e-06,0,0,-1e-06,0,1e-06,0,-1e-06,1e-06,-2e-06,0,-1e-06,1e-06,0,-2e-06,1e-06,0,0,-2e-06,0,-2e-06,0,-1e-06,0,0,0,0,2e-06,-1e-06,0,0,-3e-06,0,3e-06,0,-1e-06,0,0,-1e-06,0,-1e-06,1e-06,0,0,1e-06,-1e-06,1e-06,1e-06,0
1e-06,3e-06,3e-06,-1e-06,0,0,2e-06,3e-06,-1e-06,4e-06,1e-06,-2e-06,-2e-06,4e-06,0,-1e-06,2e-06,-1e-06,-1e-06,0,0,-1e-06,1e-06,-1e-06,1e-06,0,0,-1e-06,3e-06,1e-06,0,-2e-06,2e-06,-1e-06,-4e-06,-3e-06,-1e-06,0,0,1e-06,0,0,1e-06,1e-06,0,0,-5e-06,2e-06,0,0,1e-06,1e-06,1e-06,2e-06,1e-06,-1e-06,1e-06,0,0,1e-06,0,-1e-06,-1e-06,-1e-06,-1e-06,1e-06,-1e-06,1e-06,-1e-06,-1e-06,-1e-06,0,-2e-06,-1e-06,0,0,-1e-06,-1e-06,0,1e-06,-1e-06,2e-06,0,2e-06,1e-06,0,2e-06,-1e-06,0,0,-1e-06,0,0,0,0,0,0,0,0,2e-06,0,0,0,-2e-06,-1e-06,0,0,-1e-06,5e-06,2e-06,1e-06,0,1e-06,0,1e-06,-1e-06,1e-06,0,1e-06,-1e-06,0
-1e-06,-2e-06,1e-06,1e-06,-1e-06,-1e-06,0,-2e-06,1e-06,-2e-06,1e-06,-1e-06,-1e-06,0,0,-1e-06,-1e-06,0,0,0,-1e-06,0,-3e-06,-1e-06,-1e-06,2e-06,0,0,0,0,0,1e-06,1e-06,0,1e-06,0,-1e-06,0,0,0,-1e-06,0,0,2e-06,0,-1e-06,5e-06,2e-06,0,0,0,0,0,-2e-06,1e-06,0,0,0,-1e-06,0,0,0,-1e-06,1e-06,0,-1e-06,-1e-06,0,1e-06,0,0,0,1e-06,0,0,-1e-06,0,-1e-06,0,-1e-06,2e-06,1e-06,0,0,-3e-06,3e-06,-2e-06,-2e-06,0,0,0,0,1e-06,0,0,0,0,0,0,-1e-06,-1e-06,0,-1e-06,0,1e-06,0,0,0,0,-2e-06,0,-1e-06,-2e-06,0,0,0,0,-1e-06,1e-06,1e-06,0
-1e-06,-2e-06,0,1e-06,1e-06,1e-06,0,1e-06,-1e-06,-3e-06,0,1e-06,3e-06,-2e-06,0,2e-06,0,1e-06,-1e-06,0,0,0,0,1e-06,0,-3e-06,0,1e-06,-4e-06,-1e-06,-1e-06,1e-06,1e-06,0,3e-06,1e-06,0,0,0,3e-06,0,0,0,-1e-06,0,0,-2e-06,-1e-06,0,0,0,-3e-06,0,2e-06,1e-06,-1e-06,0,0,1e-06,2e-06,0,0,1e-06,0,0,1e-06,1e-06,0,-1e-06,0,0,0,-1e-06,-1e-06,0,0,0,0,0,0,0,-2e-06,0,-3e-06,2e-06,1e-06,1e-06,-1e-06,0,0,1e-06,0,0,1e-06,-1e-06,0,0,-1e-06,0,0,0,0,0,2e-06,0,1e-06,0,1e-06,0,2e-06,0,0,1e-06,0,-1e-06,1e-06,-1e-06,1e-06,0,-1e-06,0
1e-06,3e-06,-2e-06,-1e-06,1e-06,0,-2e-06,0,0,3e-06,-1e-06,-1e-06,-2e-06,-2e-06,0,-1e-06,-1e-06,-1e-06,0,0,1e-06,-1e-06,3e-06,1e-06,0,-1e-06,0,-1e-06,1e-06,0,0,-1e-06,0,1e-06,-3e-06,-2e-06,1e-06,1e-06,0,-3e-06,-2e-06,0,0,-1e-06,1e-06,0,-1e-06,-1e-06,1e-06,0,1e-06,-3e-06,-1e-06,0,1e-06,0,0,0,0,-1e-06,0,1e-06,1e-06,-1e-06,1e-06,-1e-06,-1e-06,0,-1e-06,1e-06,-1e-06,0,-1e-06,0,0,-1e-06,-1e-06,1e-06,0,1e-06,-1e-06,1e-06,0,1e-06,1e-06,-1e-06,0,1e-06,0,0,1e-06,0,-1e-06,-1e-06,0,0,0,0,0,-1e-06,0,0,0,2e-06,-1e-06,1e-06,0,0,0,-2e-06,1e-06,1e-06,-1e-06,0,0,1e-06,1e-06,-1e-06,-1e-06,1e-06,0
0,-1e-06,-1e-06,0,-2e-06,0,1e-06,-1e-06,1e-06,0,-1e-06,1e-06,0,3e-06,1e-06,-1e-06,0,0,0,0,-1e-06,1e-06,-3e-06,0,0,2e-06,1e-06,0,3e-06,0,0,0,1e-06,-1e-06,0,1e-06,-1e-06,0,-1e-06,2e-06,-1e-06,0,0,1e-06,0,1e-06,4e-06,0,0,0,-1e-06,1e-06,1e-06,-1e-06,0,0,-1e-06,0,0,0,0,0,-1e-06,1e-06,0,0,1e-06,0,1e-06,0,-1e-06,0,1e-06,1e-06,0,0,0,1e-06,0,0,2e-06,2e-06,0,2e-06,-1e-06,-1e-06,-1e-06,-1e-06,0,-1e-06,0,0,0,1e-06,0,1e-06,0,0,-1e-06,-2e-06,0,0,0,1e-06,0,-2e-06,0,-1e-06,0,2e-06,-1e-06,0,1e-06,0,1e-06,1e-06,1e-06,0,0,-1e-06,0
0,-1e-06,0,1e-06,-1e-06,0,2e-06,2e-06,-1e-06,-1e-06,0,-3e-06,1e-06,2e-06,0,2e-06,0,1e-06,0,0,0,0,-1e-06,-1e-06,0,0,-1e-06,0,-2e-06,0,0,1e-06,0,0,1e-06,0,0,0,1e-06,-2e-06,-1e-06,0,0,-1e-06,0,-1e-06,-4e-06,0,0,0,0,-2e-06,-1e-06,1e-06,0,0,1e-06,0,0,-1e-06,0,0,-1e-06,0,0,0,0,0,-1e-06,0,0,0,-1e-06,-1e-06,0,-1e-06,0,-1e-06,0,0,-2e-06,-1e-06,0,-2e-06,0,-2e-06,0,0,0,1e-06,-1e-06,0,1e-06,0,0,0,0,0,0,2e-06,0,0,0,-2e-06,0,-3e-06,0,1e-06,-1e-06,0,0,-1e-06,0,0,0,1e-06,-1e-06,0,0,1e-06,0
-2e-06,3e-06,1e-06,0,2e-06,0,-4e-06,-3e-06,1e-06,2e-06,0,4e-06,-2e-06,-2e-06,0,0,0,-1e-06,1e-06,0,0,-1e-06,5e-06,0,0,0,1e-06,0,-2e-06,-1e-06,0,-2e-06,1e-06,0,-2e-06,1e-06,0,0,0,0,-1e-06,0,0,-1e-06,1e-06,0,3e-06,0,0,0,0,-1e-06,0,-2e-06,0,-1e-06,0,0,0,-1e-06,0,-2e-06,0,-1e-06,0,0,0,0,1e-06,-1e-06,0,0,1e-06,1e-06,0,-1e-06,0,-1e-06,0,0,2e-06,-1e-06,0,-1e-06,0,0,0,-1e-06,0,0,-1e-06,0,0,0,0,0,0,0,0,-1e-06,0,0,0,-2e-06,-1e-06,0,0,1e-06,3e-06,0,-1e-06,0,0,0,0,0,0,0,1e-06,0,0
0,0,1e-06,-1e-06,-1e-06,1e-06,2e-06,3e-06,-1e-06,-4e-06,0,-5e-06,0,-2e-06,-1e-06,-2e-06,0,1e-06,1e-06,0,0,0,-3e-06,1e-06,0,-1e-06,-1e-06,0,3e-06,0,0,0,-1e-06,1e-06,1e-06,0,1e-06,0,0,-1e-06,0,0,0,1e-06,0,1e-06,0,1e-06,0,0,0,3e-06,0,3e-06,-1e-06,1e-06,0,0,0,0,-1e-06,0,1e-06,1e-06,-1e-06,0,0,0,0,1e-06,-1e-06,0,0,0,0,0,0,-1e-06,0,0,-1e-06,2e-06,0,2e-06,1e-06,-1e-06,-1e-06,3e-06,0,0,0,0,-1e-06,0,0,0,0,0,0,0,0,0,0,-1e-06,0,2e-06,0,-1e-06,0,1e-06,1e-06,1e-06,1e-06,0,-1e-06,0,1e-06,0,0,0,0
0,-1e-06,-1e-06,0,-1e-06,-1e-06,3e-06,-3e-06,-1e-06,2e-06,0,4e-06,2e-06,0,0,0,0,0,0,0,0,0,-1e-06,0,0,-1e-06,1e-06,0,1e-06,0,0,1e-06,0,0,1e-06,-2e-06,0,0,-1e-06,3e-06,-1e-06,0,0,0,0,0,-3e-06,0,0,0,0,2e-06,1e-06,-3e-06,-1e-06,0,0,0,0,0,0,0,-1e-06,0,1e-06,0,-1e-06,0,-1e-06,0,0,0,0,0,0,-1e-06,0,1e-06,0,0,1e-06,0,0,0,0,2e-06,1e-06,0,0,0,1e-06,0,0,0,0,0,0,0,0,1e-06,0,0,0,1e-06,0,1e-06,0,0,-2e-06,-1e-06,-1e-06,0,-1e-06,0,0,-1e-06,0,-1e-06,0,0,0
