8e-06,1.7e-05,3e-06,1.9e-05,1.3e-05,3e-06,1.8e-05,1.1e-05,1e-05,1.2e-05,7e-06,1e-06,8e-06,4e-06,2.6e-05,1.4e-05,1.4e-05,1.4e-05,8e-06,2e-06,1.2e-05,5e-06,4e-06,1.5e-05,2.8e-05,8e-06,5e-06,1.8e-05,7e-06,1.7e-05,1e-06,1.1e-05,7e-06,1.2e-05,3e-06,1e-06,1e-06,5e-06,7e-06,2.2e-05,5e-06,1.6e-05,1.5e-05,1.2e-05,1.5e-05,4e-06,4e-06,1.7e-05,1e-06,6e-06,1e-05,3.1e-05,3e-06,5e-06,0,1e-05,1.4e-05,1.2e-05,1.2e-05,9e-06,8e-06,3.1e-05,1.3e-05,2e-05,6e-06,2e-06,8e-06,1.6e-05,1.7e-05,8e-06,8e-06,1.5e-05,4e-06,1e-06,4e-06,2e-06,1.1e-05,7e-06,5e-06,1e-05,4e-06,2.1e-05,1.3e-05,1.8e-05,2e-06,2e-06,2.6e-05,3e-06,1.4e-05,5e-06,8e-06,2.2e-05,1.5e-05,6e-06,3e-06,1e-05,7e-06,1.7e-05,2.1e-05,9e-06,1.7e-05,2.1e-05,5e-06,6e-06,3e-06,2e-06,1.2e-05,1e-06,1.8e-05,1.6e-05,8e-06,1.5e-05,2.4e-05,1.4e-05,1e-06,5e-06,1.3e-05,1.5e-05,1e-06,2e-06,7e-06
2.3e-05,3.5e-05,1.7e-05,4.2e-05,3e-05,2.4e-05,5.1e-05,5.2e-05,2.4e-05,4.6e-05,2e-05,2.3e-05,4.1e-05,2.6e-05,4e-05,3.7e-05,1.6e-05,2.6e-05,1.3e-05,2e-05,2.5e-05,2.4e-05,2.4e-05,3.6e-05,4e-05,1.5e-05,2e-05,5.7e-05,1.4e-05,3.2e-05,2e-05,2.3e-05,7e-06,2e-05,2.1e-05,9e-06,1.4e-05,1.9e-05,5.4e-05,3.3e-05,3.5e-05,4.3e-05,5.6e-05,2.4e-05,4.1e-05,2e-06,1.8e-05,3.4e-05,4e-06,1.4e-05,1.8e-05,5.9e-05,4.2e-05,2.5e-05,2.4e-05,3.1e-05,3.6e-05,4.6e-05,3.1e-05,2.4e-05,1.4e-05,6.2e-05,2e-05,5.5e-05,2.5e-05,2.1e-05,4e-06,1.9e-05,4.2e-05,6e-06,2.9e-05,2e-05,1.9e-05,1.3e-05,1.2e-05,2.1e-05,1e-06,6e-06,1.3e-05,4.8e-05,1.8e-05,1.2e-05,4e-05,1.8e-05,1.9e-05,3.1e-05,4.2e-05,5e-06,2.4e-05,1e-05,2e-05,3.4e-05,2.3e-05,1.8e-05,3.2e-05,2.1e-05,1e-05,4e-05,3.8e-05,3.4e-05,3.3e-05,4.4e-05,2.8e-05,2.7e-05,1.3e-05,3.4e-05,3.5e-05,9e-06,2e-05,5.4e-05,1.8e-05,9e-06,3.3e-05,2.3e-05,1.8e-05,3.1e-05,2.4e-05,3.9e-05,2.2e-05,1.6e-05,2.1e-05
1.9e-05,5e-05,3.9e-05,2.6e-05,5e-05,5.8e-05,2e-05,4.9e-05,2.2e-05,5.6e-05,1.6e-05,4.2e-05,4.7e-05,4e-05,5.7e-05,1.9e-05,5.3e-05,3.3e-05,2.6e-05,1.7e-05,5e-06,3.5e-05,2.9e-05,4.6e-05,0.000101,2.1e-05,3.7e-05,6.1e-05,1.2e-05,3.8e-05,2.3e-05,5.1e-05,2.2e-05,2.7e-05,2.7e-05,2.7e-05,1e-06,1.6e-05,4.4e-05,4.9e-05,3e-05,6.6e-05,1.7e-05,2.1e-05,8e-05,1.9e-05,1.7e-05,5.1e-05,1.8e-05,1.6e-05,2.2e-05,4.8e-05,2.5e-05,5.6e-05,6.2e-05,3e-05,2.7e-05,3.5e-05,5.4e-05,2.2e-05,5.5e-05,9e-05,3e-06,9.2e-05,2e-05,3.2e-05,3.8e-05,5.2e-05,2.9e-05,2.4e-05,4.6e-05,3.6e-05,4.6e-05,5.8e-05,3.6e-05,3e-05,3.5e-05,4.4e-05,8e-06,6.3e-05,4.9e-05,6.7e-05,5.7e-05,4e-05,2.2e-05,2e-05,4.1e-05,7.3e-05,4.3e-05,6e-05,7.2e-05,7.5e-05,2e-05,2.6e-05,2.9e-05,1.1e-05,5.1e-05,8e-06,7e-05,9e-06,3.3e-05,2.4e-05,2e-05,4e-06,3.3e-05,2e-05,4e-05,4.4e-05,3.1e-05,5.5e-05,5.5e-05,4.4e-05,4e-05,5e-05,3.1e-05,3.7e-05,3.4e-05,5.7e-05,5.5e-05,3.4e-05,8.2e-05
4e-05,2e-05,6.9e-05,9.5e-05,3.1e-05,7.4e-05,3.6e-05,7.2e-05,7.8e-05,6.2e-05,1e-05,3.8e-05,9.5e-05,9e-05,1.2e-05,6e-05,9.1e-05,4.9e-05,8e-06,1.5e-05,2.9e-05,1.1e-05,7e-06,5.4e-05,0.000104,0.000101,1.1e-05,0.000118,5e-05,9.5e-05,4.9e-05,6.9e-05,5.4e-05,5.5e-05,3.5e-05,5.6e-05,4.1e-05,7e-06,6.7e-05,8e-05,5.2e-05,3.9e-05,9.2e-05,6.1e-05,4.9e-05,7.4e-05,4.6e-05,6e-06,5.6e-05,3.9e-05,8.9e-05,3.8e-05,4.8e-05,7.4e-05,9.1e-05,7.7e-05,1.9e-05,5.7e-05,1.1e-05,3e-05,6.6e-05,3.8e-05,7.6e-05,8.1e-05,6.4e-05,8.8e-05,6.1e-05,0.000112,6.1e-05,8.4e-05,1.4e-05,5.5e-05,5.7e-05,2.4e-05,3.3e-05,3.2e-05,7.2e-05,0.000151,0.000129,4.7e-05,6.8e-05,6.2e-05,2.7e-05,1.8e-05,3.8e-05,1.8e-05,1.7e-05,0.000117,4.2e-05,8.3e-05,9.4e-05,1.7e-05,9.4e-05,3.3e-05,3e-06,1e-05,8.7e-05,0.000103,6.7e-05,8.4e-05,6e-06,4.7e-05,3e-05,5.8e-05,7.3e-05,1.8e-05,2.3e-05,3.4e-05,8.7e-05,6e-05,7.9e-05,0.000137,7e-05,5.2e-05,4.2e-05,2.1e-05,0.000102,3.7e-05,8.8e-05,4.7e-05,0.000112
7e-05,5.3e-05,3e-05,9e-05,8.8e-05,5.2e-05,0.000117,7.5e-05,8.3e-05,0.000121,8.5e-05,6.4e-05,5.3e-05,9.4e-05,7.3e-05,0.000108,7.6e-05,6.6e-05,1.6e-05,2.3e-05,4.7e-05,9e-05,1.7e-05,5.4e-05,5.3e-05,5.4e-05,8.3e-05,7.4e-05,8.9e-05,5.7e-05,4.1e-05,0.000113,1.6e-05,9.9e-05,8.3e-05,4.9e-05,6.3e-05,2.1e-05,6.7e-05,2e-05,5.1e-05,7.4e-05,0.000133,9.8e-05,0.000113,0.00014,8.2e-05,1e-05,0.000107,4e-05,0.000107,0.000151,0.00012,6.7e-05,6.3e-05,7.9e-05,7.8e-05,8.8e-05,0.000131,6.6e-05,6.3e-05,0.000107,0.000123,0.000117,6.7e-05,4.5e-05,5e-05,7.6e-05,0.000112,8.9e-05,0.000102,0.00014,2.4e-05,3.7e-05,2.8e-05,3.6e-05,5.5e-05,0.000178,0.000117,0.000149,0.000108,5.4e-05,3.4e-05,9.9e-05,0.000106,0.000122,6.6e-05,9.9e-05,7.9e-05,0.000121,0.000108,7.6e-05,0.000111,0.000107,5.5e-05,5.3e-05,0.00012,7.3e-05,2.2e-05,5.9e-05,3.3e-05,6.7e-05,5e-06,9.4e-05,6.1e-05,0.000111,8.4e-05,3.6e-05,5.2e-05,7.8e-05,9.6e-05,0.000105,2.5e-05,5.7e-05,2.1e-05,1.1e-05,0.000147,0.000133,0.000111,6.4e-05,5.8e-05
0.00012,5.6e-05,6.1e-05,0.00016,9.3e-05,9.5e-05,9.3e-05,6e-05,7.4e-05,7.2e-05,0.000128,8e-05,3.7e-05,2.2e-05,3.4e-05,3.4e-05,0.000107,0.000143,0.00013,3.4e-05,3.4e-05,9.8e-05,0.000118,4.4e-05,0.000182,5.3e-05,7.3e-05,9e-05,8.3e-05,4.7e-05,2.7e-05,9.4e-05,4.7e-05,0.000156,6.8e-05,0.000108,0.000129,8.5e-05,7.2e-05,7.4e-05,4.6e-05,0.000131,0.000135,0.000105,0.000123,7.6e-05,2.9e-05,3.5e-05,0.000121,7e-05,5e-05,2.9e-05,6.7e-05,7.1e-05,0.000147,9.5e-05,0.000129,4.8e-05,7.6e-05,5.7e-05,9.6e-05,0.000111,0.000157,0.000149,2.1e-05,4.8e-05,2.3e-05,9.2e-05,0.00011,0.000107,3.8e-05,9.9e-05,4.2e-05,9.2e-05,5.1e-05,9.3e-05,2.2e-05,0.000144,2.3e-05,6.2e-05,6e-05,9.2e-05,5.3e-05,0.000135,2.9e-05,9.7e-05,8.6e-05,8.3e-05,0.000123,0.000138,5.8e-05,2.6e-05,1e-05,8.4e-05,5.1e-05,4.9e-05,8.6e-05,0.000112,7.8e-05,5.9e-05,9.4e-05,0.00015,8.3e-05,0.000135,5.5e-05,0.000128,3.2e-05,3.5e-05,3.5e-05,0.000129,7.9e-05,8.1e-05,9.9e-05,9.7e-05,9.2e-05,8.8e-05,0.00015,2.4e-05,1.7e-05,7.2e-05,8.2e-05
0.000244,0.000141,0.000192,0.000307,0.00032,0.000202,0.000226,0.000245,7.7e-05,0.000179,0.000226,0.000141,0.000122,0.00015,8.4e-05,8.1e-05,9.1e-05,4.5e-05,0.000128,0.000113,6.1e-05,0.000112,5e-05,0.000136,0.000222,0.000208,8.7e-05,0.000101,3.4e-05,0.000136,5e-06,0.000145,0.000139,0.000148,3.8e-05,0.000177,0.000197,2.8e-05,0.000192,0.000114,8.6e-05,0.000161,0.00028,0.000276,0.000251,0.000259,0.000181,7.9e-05,5.5e-05,8.6e-05,0.000106,2.7e-05,5.4e-05,8.6e-05,0.000163,0.000109,0.000124,0.000198,0.00015,6.2e-05,3.4e-05,0.000136,0.000186,0.000155,0.000197,4.6e-05,4.4e-05,0.00013,0.000218,0.000163,0.000127,0.000104,4e-05,0.000147,7.3e-05,0.000163,6.2e-05,0.000143,9e-05,8.9e-05,0.000125,0.000164,0.000253,0.000277,0.000181,0.000137,2.3e-05,8e-05,0.000129,0.000237,0.000155,0.000108,2.9e-05,0.000126,0.000108,8.9e-05,0.000185,0.000191,0.000157,0.000143,0.000193,0.000127,0.00012,3.2e-05,3.6e-05,7.8e-05,0.00015,0.000112,0.000132,0.000161,0.000146,0.000265,0.000264,0.00018,7e-06,8.3e-05,0.000246,0.000162,8e-05,7.2e-05,3.8e-05
0.000262,0.000188,0.000196,0.000124,0.00027,0.000144,0.000153,0.000139,0.000115,0.00022,0.000334,0.000141,0.000256,0.000246,0.000176,0.000123,8.3e-05,9e-05,0.000206,0.00011,3.5e-05,1e-04,0.000101,0.000216,9.4e-05,8.2e-05,0.000234,0.000146,0.000108,0.000295,0.000244,0.000115,0.000241,0.000139,7.6e-05,0.000205,0.000366,0.00032,0.000335,0.000205,0.000112,0.000126,0.000115,8.6e-05,0.000244,0.000391,0.000312,0.000235,0.000175,0.000184,6.3e-05,0.000179,0.000114,0.000178,0.000104,6.6e-05,0.000195,9.5e-05,0.000207,7.2e-05,7.1e-05,0.000104,6.4e-05,0.000264,0.00029,0.000227,0.000106,0.000141,7.6e-05,0.000298,0.000379,0.000271,0.000256,0.000213,0.000125,0.000151,0.000207,0.000354,0.000257,0.000153,8.7e-05,3.3e-05,0.000169,0.000196,9.2e-05,0.00012,0.000182,0.000101,6.8e-05,0.000174,0.000121,8.5e-05,9.5e-05,0.00014,0.000216,0.000124,0.000147,7.9e-05,7.7e-05,0.00011,4.8e-05,0.000168,6e-05,5.6e-05,9.6e-05,5.2e-05,0.000211,0.000151,9.9e-05,4.3e-05,8.8e-05,0.000231,0.000184,8.3e-05,7.1e-05,0.000145,0.00021,0.000113,1.4e-05,0.000125,0.000167
0.000123,0.000156,2.8e-05,5.1e-05,0.000115,6.1e-05,8.2e-05,0.000136,4e-05,0.000205,0.000272,0.000344,0.000134,6.9e-05,0.000202,0.000307,0.000187,0.000139,7.2e-05,8.7e-05,0.00011,4.8e-05,0.000139,0.000182,0.000241,6e-05,0.000214,0.000169,0.000106,0.000208,0.000244,0.000335,0.000231,0.000109,5.9e-05,0.000132,0.000133,8.6e-05,0.000198,0.000196,0.000148,0.000103,7.3e-05,0.000126,0.00028,0.000207,7.7e-05,0.000139,0.000305,5.8e-05,5.4e-05,0.000137,6.2e-05,0.000169,0.000132,0.000105,0.00012,0.000197,0.000138,0.000135,0.00012,0.000176,9.9e-05,0.000173,0.000153,6e-05,4.6e-05,0.000121,0.000107,0.000217,0.000103,0.000109,0.000163,0.000111,9.1e-05,0.000115,0.000124,0.000185,0.000149,0.000107,0.000132,7e-05,8.9e-05,4e-05,0.000119,0.000207,7.6e-05,0.000119,0.000108,0.000167,0.000131,0.000197,0.00021,0.000121,3.6e-05,2.9e-05,0.00012,0.000108,9.2e-05,0.000105,6.4e-05,4.5e-05,6.3e-05,4.8e-05,0.000118,0.000115,0.000235,8.8e-05,5e-05,0.000132,0.00013,0.000118,0.00015,0.000125,7.2e-05,0.000178,0.000123,0.000105,0.000145,4.4e-05,5.7e-05
1.3e-05,0.000135,0.000132,1.4e-05,6.7e-05,8e-05,8.8e-05,0.000133,0.000146,0.000193,9.5e-05,0.00014,0.000125,6.6e-05,0.000225,4.8e-05,2.9e-05,0.00024,0.000278,2e-04,0.000183,0.000172,8.1e-05,4.8e-05,0.000259,0.000208,0.000217,0.000198,7.4e-05,0.000177,2.9e-05,0.000102,0.000101,8.8e-05,7.5e-05,7.7e-05,9.3e-05,0.000163,0.000126,0.000193,0.000246,0.00024,0.000157,0.000232,0.000174,0.000259,8.6e-05,0.000108,0.000186,0.000179,2.4e-05,7.1e-05,0.000117,5.3e-05,0.000115,0.000114,0.000125,0.000104,9.5e-05,9.2e-05,0.000184,0.000179,0.000201,9.3e-05,7.7e-05,0.000153,0.000202,0.000113,5.3e-05,0.000186,0.000243,0.000155,3.3e-05,1.1e-05,6.7e-05,1.9e-05,6.4e-05,0.000173,9.6e-05,4.6e-05,3.8e-05,4.8e-05,3.8e-05,8.5e-05,0.000211,6.6e-05,0.000201,2e-05,0.000103,0.000211,4.3e-05,7.9e-05,9.4e-05,0.000149,0.00012,9.3e-05,9.2e-05,8.5e-05,5.3e-05,2.3e-05,8.5e-05,8.5e-05,7.2e-05,3e-05,0.00012,5e-05,0.000151,0.000107,7.6e-05,0.000152,0.000224,0.000215,3.2e-05,9.7e-05,0.00019,6.5e-05,9.6e-05,4.3e-05,9.1e-05,0.000123,0.000176
0.000122,6.2e-05,8.3e-05,0.000188,0.000143,4.8e-05,5.1e-05,2.3e-05,0.000121,1.2e-05,7.3e-05,0.000118,8.9e-05,3e-05,0.000171,0.000121,5.6e-05,0.00014,9.6e-05,1.5e-05,0.000112,9.5e-05,0.000115,0.000141,0.000102,7e-05,4e-05,0.000159,0.000135,0.000138,0.000108,5e-05,6.8e-05,5.8e-05,2e-06,4.7e-05,7.8e-05,9.1e-05,0.000137,2.7e-05,0.000199,6.2e-05,5.1e-05,0.000156,9.5e-05,0.000112,0.000128,7.3e-05,0.00013,0.00011,0.000254,0.00016,0.000142,0.000123,7.4e-05,0.000107,9.1e-05,0.000152,0.000113,5.4e-05,0.000119,0.000104,0.000146,0.000173,9.4e-05,0.000178,0.000154,9.6e-05,4.7e-05,0.000112,8.4e-05,0.000114,0.000106,0.000113,5.5e-05,4.5e-05,0.000118,0.000111,5.6e-05,5e-06,4.9e-05,8.1e-05,9.1e-05,3.9e-05,0.000141,0.000237,0.000196,0.000102,8.5e-05,0.000163,0.000154,0.000115,1.7e-05,0.000109,8.9e-05,6.6e-05,7.8e-05,0.000102,7.7e-05,4.2e-05,0.000113,5.7e-05,4.3e-05,5.3e-05,6.8e-05,5.2e-05,9.8e-05,3.5e-05,9.3e-05,3.7e-05,7.7e-05,1.6e-05,9.3e-05,3e-05,0.000153,9.7e-05,7.1e-05,4.8e-05,7.8e-05,4.6e-05,0.000116
0.000113,0.000148,4.5e-05,0.000182,7.2e-05,0.00016,0.000106,9.7e-05,0.00013,0.000131,4.5e-05,0.000125,0.000134,5.9e-05,6.7e-05,6.5e-05,4.3e-05,7.6e-05,9.5e-05,5.7e-05,9.8e-05,7.9e-05,9.2e-05,0.000112,0.000106,8.5e-05,5.2e-05,0.000136,8.9e-05,0.000104,9.7e-05,4e-05,4e-05,0.000111,0.000111,6e-05,8.3e-05,8.1e-05,6.2e-05,9.2e-05,0.000114,9.5e-05,0.000138,1.9e-05,3.7e-05,0.000141,0.000102,6.2e-05,4.2e-05,4.7e-05,0.000182,6.4e-05,3e-05,1.6e-05,9.7e-05,2e-05,5.5e-05,7.6e-05,2.6e-05,3.9e-05,6.6e-05,0.000133,2.6e-05,0.000116,2.4e-05,9.8e-05,0.000206,0.000129,7.5e-05,4.8e-05,3.1e-05,0.000123,6.9e-05,3.2e-05,7.2e-05,2.7e-05,0.00011,1.5e-05,4.6e-05,1.7e-05,6.4e-05,0.00011,4.3e-05,2.4e-05,6.7e-05,0.000124,7.8e-05,4.9e-05,2.2e-05,8.4e-05,3.7e-05,0.000122,6.7e-05,3.4e-05,5.9e-05,7.9e-05,5e-05,8.5e-05,6.6e-05,6.5e-05,4.4e-05,0.000105,2.9e-05,3.8e-05,6.5e-05,3.6e-05,8.8e-05,4.8e-05,7e-05,4.8e-05,3e-05,8e-06,3.7e-05,4.5e-05,0.000119,8.5e-05,1e-04,7.7e-05,2.9e-05,2.6e-05,8.7e-05
4.9e-05,4.9e-05,6.8e-05,0.000155,2.7e-05,0.00016,0.000149,0.000138,7.3e-05,7.8e-05,0.000113,0.00016,0.000159,0.000135,6.3e-05,0.000162,8.6e-05,5.1e-05,7.1e-05,1.7e-05,9.3e-05,7e-05,8.9e-05,8.6e-05,5.6e-05,9.5e-05,8e-05,5.7e-05,0.000116,2.2e-05,4.6e-05,0.000103,3.4e-05,7.1e-05,4.1e-05,2.4e-05,1.9e-05,7.2e-05,4.2e-05,2.8e-05,8.3e-05,4.6e-05,8.2e-05,0.000156,2.1e-05,0.000132,4.5e-05,2.7e-05,6.4e-05,3.3e-05,0.000145,6.5e-05,6e-06,4.4e-05,6.7e-05,7.6e-05,1.1e-05,1e-05,5.8e-05,8.7e-05,7.1e-05,2.9e-05,4.5e-05,6.5e-05,0.000128,5.3e-05,0.000173,7.7e-05,4.8e-05,8.1e-05,2.9e-05,8.6e-05,4.8e-05,5.1e-05,7.1e-05,6.7e-05,0.000107,6.8e-05,6.7e-05,5.8e-05,7e-05,4.2e-05,2.6e-05,5.4e-05,2.1e-05,9.5e-05,8.3e-05,9.2e-05,9e-05,4.5e-05,2.2e-05,0.000125,6.1e-05,3.2e-05,5.7e-05,0.000116,8.3e-05,5e-05,5e-05,3e-05,5.5e-05,0.00011,6.9e-05,3.9e-05,5.7e-05,3.6e-05,6.1e-05,5e-05,4.1e-05,0.000104,9.7e-05,6.2e-05,1.8e-05,1.2e-05,6e-05,1.2e-05,7e-05,6.3e-05,3.1e-05,6.4e-05,4.9e-05
0.000104,8.3e-05,4.9e-05,0.000121,0.000183,0.000198,1.9e-05,0.000139,0.000134,8.8e-05,2.1e-05,0.000177,3.2e-05,0.000121,8e-05,0.000307,0.000149,0.000128,6.4e-05,6.4e-05,9.3e-05,0.00017,0.000178,0.000146,3.7e-05,7.6e-05,3.9e-05,2e-05,0.000223,0.000166,7.7e-05,6.1e-05,4.6e-05,5.8e-05,4e-05,5.5e-05,0.000109,3.8e-05,7.1e-05,9.6e-05,5.1e-05,3.6e-05,4.1e-05,0.000132,0.000161,7.7e-05,0.000112,5.9e-05,8.1e-05,8.8e-05,7.1e-05,6.6e-05,2.9e-05,7.5e-05,0.000104,8.4e-05,1.2e-05,7.4e-05,0.000102,3.9e-05,1.6e-05,8.5e-05,8.7e-05,4.8e-05,5.5e-05,8.4e-05,0.000142,9.2e-05,1.4e-05,7.7e-05,4.2e-05,0.000104,0.000107,8.7e-05,4.9e-05,8.3e-05,0.000177,3.2e-05,7.4e-05,8.1e-05,5.2e-05,2.3e-05,5.6e-05,5.2e-05,2.6e-05,6.5e-05,8.5e-05,4.7e-05,5.4e-05,7.6e-05,3e-05,0.000122,4.5e-05,4.4e-05,5.8e-05,2.2e-05,3.8e-05,4.5e-05,5.9e-05,3.1e-05,1.9e-05,5e-05,8.7e-05,6.8e-05,5.8e-05,5.6e-05,4.1e-05,2.8e-05,3.6e-05,5.1e-05,4.2e-05,8e-06,3.5e-05,4.5e-05,3.5e-05,5e-05,3.5e-05,5.5e-05,4.6e-05,0.000119,4.7e-05
5.3e-05,0.000161,0.000161,5.5e-05,0.000162,0.000122,0.000178,0.000118,0.000207,0.000204,0.00014,0.000203,0.00016,0.000204,0.000191,0.00026,0.000142,7.6e-05,7.8e-05,9.3e-05,0.000103,9.9e-05,0.000125,1.3e-05,5.1e-05,2.2e-05,7.7e-05,6.4e-05,0.000244,0.000111,5.9e-05,2.9e-05,3.6e-05,9.5e-05,7.5e-05,8.2e-05,7.5e-05,0.000112,4.7e-05,0.000195,0.000129,5.7e-05,6.9e-05,0.00014,7.9e-05,9.5e-05,0.000183,3.9e-05,8.6e-05,0.000156,9.6e-05,1e-04,0.000131,0.000135,4.9e-05,2.5e-05,8.9e-05,0.00014,0.000178,0.000211,0.000149,0.000196,6.5e-05,7.2e-05,5.7e-05,1.1e-05,9.2e-05,4.6e-05,4e-06,8.4e-05,7.8e-05,0.000138,1.4e-05,5.1e-05,8.2e-05,0.000159,9.9e-05,0.000156,0.000141,5.1e-05,6.1e-05,4.5e-05,2.3e-05,2.1e-05,7.6e-05,9.9e-05,7.6e-05,0.000189,0.000133,0.000117,9.4e-05,5.2e-05,6.2e-05,2.1e-05,6.4e-05,7.3e-05,7e-05,8.2e-05,6.7e-05,6.8e-05,7.9e-05,4.2e-05,9.3e-05,0.000114,7.2e-05,4.9e-05,7.5e-05,7e-05,1.2e-05,2.7e-05,4.1e-05,3.5e-05,4.2e-05,0.000114,3.7e-05,7e-05,4.4e-05,8.7e-05,8.8e-05,7.6e-05,8.4e-05
0.000146,7.1e-05,7.2e-05,6.9e-05,0.000187,0.000101,0.000191,0.00021,0.000172,0.000133,8e-05,0.000131,6.9e-05,0.000166,9.4e-05,0.000343,0.00027,0.000124,0.000116,9.2e-05,0.000154,0.000122,0.000231,0.000106,8.9e-05,3.7e-05,6.8e-05,3.5e-05,0.00023,0.000143,4.7e-05,2.4e-05,6.3e-05,0.000162,0.00013,8.5e-05,3.5e-05,0.000192,0.000243,0.000116,9.1e-05,4.2e-05,0.000102,0.000136,0.000147,7.1e-05,9.5e-05,0.000124,0.000136,0.000144,8.5e-05,5.4e-05,0.00012,4e-05,8.9e-05,3.1e-05,9.3e-05,7.6e-05,0.000104,0.000124,0.000199,5.8e-05,8.8e-05,8.5e-05,0.00012,6.6e-05,1.8e-05,5.8e-05,4e-06,0.000104,6.4e-05,9.6e-05,0.000106,6.4e-05,7.4e-05,0.00017,0.000153,0.000187,6.9e-05,4e-05,2.2e-05,2.4e-05,4e-05,5.5e-05,7.6e-05,7.6e-05,0.000194,0.000164,0.000144,0.00017,1e-04,9.7e-05,0.000141,0.00011,8.4e-05,6.8e-05,2.4e-05,4.5e-05,0.000105,2.3e-05,6.7e-05,7.7e-05,0.000131,6.9e-05,2.9e-05,9e-06,6.3e-05,5.5e-05,5.8e-05,0.000102,0.00011,4.3e-05,4.9e-05,9.4e-05,8.6e-05,0.000101,0.000148,5.9e-05,5.1e-05,0.000142,6.8e-05
6.8e-05,3.1e-05,4.9e-05,2.6e-05,0.00015,5.3e-05,0.000107,7.5e-05,0.000117,8.6e-05,0.000135,0.000202,0.000198,2.5e-05,4e-05,0.000258,0.000129,0.000108,4.2e-05,0.000121,9.3e-05,8.3e-05,0.000156,0.000158,0.000124,0.000122,7.3e-05,7.9e-05,9.6e-05,9.9e-05,5.7e-05,2.4e-05,3.6e-05,8.4e-05,0.000168,6.8e-05,5.8e-05,0.000163,7.5e-05,7.9e-05,7e-06,4.1e-05,0.000122,0.000107,2.7e-05,0.000112,9.2e-05,5.7e-05,6.8e-05,4.5e-05,0.000115,8.4e-05,5.1e-05,5.3e-05,9.8e-05,5e-05,7.6e-05,4.1e-05,6.5e-05,4.4e-05,8.1e-05,0.000113,3.2e-05,9.7e-05,5.8e-05,4e-05,5.3e-05,4.7e-05,7.4e-05,8.5e-05,9.6e-05,3.5e-05,4.7e-05,3.8e-05,9.1e-05,8.9e-05,9.5e-05,5.9e-05,3.1e-05,2.4e-05,2.8e-05,3.7e-05,4.9e-05,1.9e-05,9.4e-05,0.00013,0.000177,0.000203,5.1e-05,6.2e-05,2.6e-05,3.2e-05,0.000132,4.9e-05,0.000141,3.9e-05,3.9e-05,3.2e-05,9.6e-05,8.1e-05,9e-05,3.8e-05,7.8e-05,6e-05,3.5e-05,3e-05,9.7e-05,8.8e-05,7e-06,8.4e-05,1.6e-05,8e-06,9.5e-05,8.5e-05,8.2e-05,5.6e-05,0.000137,0.000107,3.4e-05,7.9e-05,7.7e-05
7e-05,0.000108,0.000125,7.7e-05,0.000135,8.2e-05,4e-05,0.000163,0.000187,0.00016,0.000241,3.1e-05,3.5e-05,8.2e-05,5e-05,0.000125,0.000121,0.000212,0.000145,0.000152,0.000106,0.000146,0.000207,0.000196,0.000141,7e-05,5.4e-05,3.5e-05,0.000141,0.000204,0.000167,0.000107,3.2e-05,0.000106,0.000173,8.8e-05,7.9e-05,0.000148,0.000153,8.6e-05,5.7e-05,5.6e-05,6.4e-05,9.4e-05,8.6e-05,9.4e-05,0.000115,0.000108,9.5e-05,0.000108,0.000105,0.000104,6.8e-05,1.2e-05,6.6e-05,0.000169,9.2e-05,6.3e-05,9.6e-05,7e-05,1.9e-05,4.9e-05,0.000114,4.1e-05,7.1e-05,8e-05,8.8e-05,3.1e-05,8.7e-05,0.000148,0.000133,4.1e-05,5.5e-05,7.8e-05,2.5e-05,6e-05,2.7e-05,4.9e-05,8.3e-05,3.7e-05,5.3e-05,3.7e-05,6.7e-05,3.5e-05,9.2e-05,8.7e-05,4.4e-05,0.000153,0.000193,0.000134,6.9e-05,7.2e-05,0.000164,0.000158,0.000203,0.000168,0.000143,0.000128,5.2e-05,3e-05,4.7e-05,0.000115,7.1e-05,9.9e-05,9.2e-05,7.7e-05,8.9e-05,6.7e-05,8.9e-05,7.4e-05,5.6e-05,4e-05,0.000139,7.9e-05,2.7e-05,3.8e-05,0.000151,8.4e-05,9.3e-05,0.00011,5.1e-05
6.6e-05,8.8e-05,6e-05,2e-05,6.4e-05,2.7e-05,1.7e-05,0.000143,7.9e-05,0.00014,7.5e-05,0.000102,6.1e-05,8.3e-05,4.7e-05,6.6e-05,6.6e-05,8e-05,5e-05,7.5e-05,9.7e-05,0.000112,2.9e-05,8.6e-05,8.2e-05,0.000103,0.000105,0.000116,0.000132,3.9e-05,5.5e-05,2.6e-05,4.7e-05,0.000131,7.8e-05,5.6e-05,5.9e-05,1.4e-05,8e-06,3.1e-05,1e-05,3.6e-05,2e-05,4.2e-05,1.4e-05,8.4e-05,6.2e-05,3e-05,6.7e-05,7.5e-05,0.000105,0.000134,4.9e-05,3.3e-05,7.1e-05,0.000153,0.000108,5.4e-05,6.9e-05,2.7e-05,1.1e-05,3.8e-05,5.2e-05,6.8e-05,6.3e-05,5.9e-05,4.4e-05,5.4e-05,8.6e-05,6.8e-05,7e-06,1.9e-05,5.1e-05,5e-05,2.9e-05,4e-05,3e-05,3.6e-05,5.7e-05,4.7e-05,6.5e-05,8.6e-05,4.6e-05,1.8e-05,5.8e-05,0.00014,6.9e-05,0.000101,9.4e-05,3.6e-05,2.3e-05,5.9e-05,0.000168,5.5e-05,0.00011,0.000117,6e-05,3.2e-05,5.2e-05,3.8e-05,3.6e-05,5.2e-05,1.8e-05,8.2e-05,5.4e-05,1.2e-05,7.3e-05,3.1e-05,5.7e-05,4e-05,4.7e-05,7.7e-05,9.3e-05,2.9e-05,1.1e-05,4.9e-05,7.2e-05,4.3e-05,2.3e-05,6.2e-05,2.3e-05
4.6e-05,0.00011,6.5e-05,5.8e-05,3.9e-05,4.5e-05,4.2e-05,2.2e-05,9.4e-05,4.7e-05,6.2e-05,4.7e-05,9e-06,5.4e-05,5.5e-05,4.5e-05,3.7e-05,6e-05,3.4e-05,3.8e-05,9.5e-05,3.9e-05,2.2e-05,7e-05,3.8e-05,2e-05,9.6e-05,2.4e-05,8.2e-05,4.5e-05,6.3e-05,5.2e-05,6.7e-05,0.000103,2.4e-05,1.8e-05,3e-05,3e-05,2.9e-05,4.9e-05,2.7e-05,2.1e-05,2.5e-05,5.7e-05,5.1e-05,7.9e-05,4.8e-05,3.4e-05,2.6e-05,2.4e-05,8.5e-05,3.9e-05,6.5e-05,3.1e-05,6.5e-05,5.1e-05,1.3e-05,1.5e-05,5e-06,2e-05,2.9e-05,2.2e-05,3.2e-05,4.1e-05,9e-05,2.4e-05,5e-06,3e-05,1.5e-05,3.7e-05,1.1e-05,2.5e-05,4.2e-05,1.5e-05,5.9e-05,8.1e-05,3.1e-05,4.5e-05,4.9e-05,2e-05,2.4e-05,1.8e-05,4.2e-05,3.7e-05,4.4e-05,5.8e-05,4.9e-05,3.4e-05,7.7e-05,3.6e-05,5e-06,3.6e-05,6.2e-05,2.3e-05,4.9e-05,5.5e-05,4.6e-05,8e-06,3.9e-05,2.8e-05,4.6e-05,5.3e-05,4.6e-05,3e-05,1.9e-05,9e-06,3.6e-05,5.7e-05,1e-05,2.1e-05,4.4e-05,5.2e-05,5.9e-05,9e-05,7.1e-05,1e-06,3.8e-05,1.8e-05,1.8e-05,2.5e-05,1.8e-05
5.7e-05,7.6e-05,1.5e-05,3.6e-05,4.2e-05,6.7e-05,5e-05,6.6e-05,6.9e-05,2.4e-05,3.2e-05,2.6e-05,2.1e-05,2.4e-05,2.6e-05,4.4e-05,2e-05,1.4e-05,8e-06,2e-05,7.2e-05,2.4e-05,2.4e-05,3e-05,1.5e-05,6e-06,5.7e-05,2.8e-05,1.2e-05,2.3e-05,3e-05,1.8e-05,5.7e-05,7.3e-05,7e-05,3.2e-05,3.9e-05,1.4e-05,3.7e-05,4.9e-05,3.4e-05,3e-05,2.1e-05,3.7e-05,5.7e-05,7.3e-05,6.4e-05,2.8e-05,1.4e-05,1.2e-05,4.9e-05,1.6e-05,5.8e-05,3.2e-05,8.8e-05,7.4e-05,4.9e-05,1.3e-05,2.9e-05,3.1e-05,2.9e-05,1.3e-05,1.1e-05,1.5e-05,4.2e-05,4.3e-05,2.4e-05,5e-06,3e-05,4.5e-05,1.7e-05,5.2e-05,1e-05,2.2e-05,5.4e-05,2.4e-05,4e-05,1.1e-05,4.9e-05,6.1e-05,2.5e-05,1.7e-05,1.5e-05,1.7e-05,4e-05,4e-06,3.2e-05,4.5e-05,6.7e-05,4.8e-05,4.9e-05,3.4e-05,2.2e-05,4.1e-05,2.3e-05,6.4e-05,8.1e-05,2.1e-05,3.2e-05,1.7e-05,4.8e-05,6e-06,4.8e-05,4.7e-05,2.6e-05,3.1e-05,6e-06,2.7e-05,3.1e-05,9e-06,5.2e-05,3.1e-05,6.3e-05,9.6e-05,2.7e-05,9e-06,1.5e-05,1.5e-05,8e-06,1.9e-05,3.2e-05
4.9e-05,1.8e-05,3.8e-05,1.3e-05,2.8e-05,3.9e-05,5.7e-05,3.1e-05,7.3e-05,4.9e-05,1.7e-05,3e-05,2.2e-05,2.4e-05,2.7e-05,4.5e-05,1.9e-05,3e-06,1.8e-05,3e-06,1.2e-05,3.6e-05,3e-05,3.3e-05,1.4e-05,4.3e-05,8e-06,3.2e-05,1.4e-05,2.3e-05,4.8e-05,7.1e-05,4e-06,1.8e-05,1.6e-05,1.9e-05,1.2e-05,1.9e-05,6.8e-05,1.7e-05,2.1e-05,2.5e-05,1.2e-05,2.9e-05,7.8e-05,2e-05,2.2e-05,2.3e-05,3.6e-05,2.8e-05,3.1e-05,2.4e-05,4e-05,3.5e-05,5.7e-05,2.1e-05,2.6e-05,3.7e-05,9e-06,6e-06,2.1e-05,3.2e-05,1.1e-05,3.1e-05,2.7e-05,1.6e-05,3.2e-05,4.6e-05,2.3e-05,4.6e-05,4.6e-05,6e-06,1.4e-05,3.9e-05,1.8e-05,5e-05,2.8e-05,5e-06,2.6e-05,3.4e-05,3.6e-05,2.4e-05,1.2e-05,1.8e-05,3.1e-05,3.2e-05,4.6e-05,4e-05,5.2e-05,2.7e-05,1e-05,3.4e-05,1.8e-05,2.2e-05,1.6e-05,6.5e-05,1.4e-05,3.4e-05,2.4e-05,1.8e-05,3.4e-05,4.8e-05,3.3e-05,2.4e-05,1.4e-05,2.3e-05,3e-05,3.6e-05,1.6e-05,1.8e-05,2.9e-05,3.6e-05,7.8e-05,3.4e-05,3.2e-05,2.3e-05,8e-06,1.7e-05,1.8e-05,1.8e-05,3.6e-05
1e-05,1.5e-05,1.3e-05,1.1e-05,2.4e-05,2e-05,1.3e-05,3.5e-05,1.5e-05,4e-05,2.9e-05,1.9e-05,7e-06,1e-05,1.2e-05,7e-06,1e-06,1e-05,1.7e-05,1.4e-05,8e-06,9e-06,1.6e-05,2.2e-05,1.4e-05,1.3e-05,1.4e-05,1.9e-05,1.3e-05,1.9e-05,1.3e-05,2.1e-05,2.1e-05,1.7e-05,1.4e-05,5e-06,6e-06,7e-06,3.2e-05,2.3e-05,9e-06,3e-06,4e-06,5e-06,2.7e-05,1.9e-05,2.3e-05,1.8e-05,1.5e-05,2.2e-05,3e-05,1.6e-05,3.2e-05,1.5e-05,1.8e-05,1.4e-05,1.3e-05,1e-05,3e-06,9e-06,1.2e-05,5e-06,3e-06,1.7e-05,8e-06,1.2e-05,2.8e-05,2.5e-05,2e-05,6e-06,2e-06,5e-06,9e-06,2.1e-05,1.5e-05,1.2e-05,1.1e-05,1e-05,5e-06,1.1e-05,3e-06,1.4e-05,1.8e-05,2e-06,8e-06,1.3e-05,2.5e-05,3.1e-05,1.6e-05,2.2e-05,3.1e-05,3e-06,1.5e-05,3e-06,1.2e-05,3e-05,1.9e-05,1.4e-05,1.6e-05,7e-06,1.7e-05,1.5e-05,2e-06,7e-06,4e-06,7e-06,2.1e-05,1.8e-05,8e-06,1e-05,1.7e-05,6e-06,1e-05,1.1e-05,1.6e-05,1.1e-05,8e-06,1.6e-05,1.6e-05,2e-05,7e-06
1e-05,1.1e-05,2.1e-05,1.6e-05,2e-05,6e-06,5e-06,2.6e-05,1.6e-05,1.4e-05,8e-06,3.4e-05,2e-05,1.5e-05,1.7e-05,2.5e-05,1.3e-05,1.8e-05,2.9e-05,2.4e-05,8e-06,2.2e-05,1.4e-05,1.4e-05,8e-06,2.5e-05,1.3e-05,5e-06,2.2e-05,1.5e-05,1.8e-05,1.6e-05,1.5e-05,2e-05,1e-05,1.1e-05,1.3e-05,9e-06,1.9e-05,9e-06,1.3e-05,8e-06,3e-06,1.5e-05,2.6e-05,1.5e-05,1.3e-05,9e-06,2.1e-05,1.6e-05,2.1e-05,3.5e-05,3e-05,1.8e-05,1.7e-05,1.2e-05,4e-06,8e-06,1.3e-05,1e-05,1.6e-05,2.7e-05,1.5e-05,1.5e-05,1.2e-05,1.9e-05,1.2e-05,1.6e-05,1.1e-05,5e-06,4e-06,4e-06,1.3e-05,1.4e-05,1e-05,1.9e-05,1.6e-05,1.6e-05,1.8e-05,2e-05,1.7e-05,2.1e-05,3.2e-05,2e-05,1.9e-05,2.6e-05,1.1e-05,9e-06,6e-06,8e-06,2.6e-05,1.3e-05,2.1e-05,7e-06,1.5e-05,3e-06,5e-06,4e-06,1e-06,1e-05,1.1e-05,9e-06,2.1e-05,1.5e-05,7e-06,1.3e-05,9e-06,1.8e-05,1.3e-05,1.5e-05,1.8e-05,2e-05,2.7e-05,5e-06,1.4e-05,3e-06,1.1e-05,6e-06,7e-06,1e-05,8e-06
6e-06,1.6e-05,2.5e-05,1.9e-05,1.2e-05,1e-05,6e-06,1.2e-05,8e-06,3e-05,1e-05,1.7e-05,1e-05,1.2e-05,1.4e-05,9e-06,5e-06,1.7e-05,1.2e-05,2e-06,1.3e-05,1.9e-05,6e-06,1.6e-05,1e-06,2.5e-05,8e-06,2.4e-05,2.4e-05,1.4e-05,9e-06,1.6e-05,1.4e-05,8e-06,6e-06,1e-05,2.2e-05,1.6e-05,2.7e-05,1.4e-05,6e-06,3e-06,3e-06,2.2e-05,6e-06,1.1e-05,1.1e-05,1e-05,7e-06,1.2e-05,5e-06,1.4e-05,3e-06,5e-06,2.2e-05,6e-06,6e-06,9e-06,5e-06,1.3e-05,9e-06,2.4e-05,3e-06,1.5e-05,2e-06,6e-06,1.2e-05,1.6e-05,9e-06,9e-06,7e-06,5e-06,5e-06,2.1e-05,4e-06,5e-06,4e-06,2e-06,1e-05,1.5e-05,1.7e-05,1.7e-05,9e-06,1e-06,5e-06,2e-05,1.4e-05,1.4e-05,9e-06,8e-06,1.7e-05,3e-06,1.2e-05,6e-06,9e-06,1.7e-05,1.5e-05,7e-06,8e-06,6e-06,6e-06,1.3e-05,4e-06,7e-06,4e-06,1.3e-05,8e-06,1.4e-05,7e-06,6e-06,1e-05,1.3e-05,2e-05,1.5e-05,1.2e-05,8e-06,5e-06,1e-05,3e-06,9e-06,5e-06
8e-06,5e-06,1.3e-05,9e-06,3e-06,1e-05,5e-06,1e-05,1e-05,1e-05,1.5e-05,2.6e-05,6e-06,5e-06,8e-06,1.5e-05,4e-06,1e-05,5e-06,4e-06,1e-05,1.1e-05,5e-06,9e-06,2e-06,9e-06,5e-06,1.8e-05,6e-06,1.6e-05,5e-06,1e-05,4e-06,1e-05,6e-06,1.3e-05,8e-06,1.2e-05,2.4e-05,8e-06,2e-06,5e-06,9e-06,1.2e-05,1e-05,1.5e-05,1e-05,1e-05,3e-06,8e-06,4e-06,6e-06,8e-06,2e-06,2.4e-05,1.4e-05,2e-06,1e-05,7e-06,5e-06,3e-06,1.3e-05,3e-06,1.2e-05,5e-06,7e-06,1.3e-05,1.2e-05,9e-06,1e-05,3e-06,9e-06,8e-06,1.6e-05,1e-05,9e-06,9e-06,3e-06,1.3e-05,8e-06,9e-06,9e-06,1.3e-05,7e-06,5e-06,2e-05,9e-06,1.5e-05,1.1e-05,1e-05,1.9e-05,1.1e-05,5e-06,6e-06,6e-06,1.1e-05,1.8e-05,1e-05,5e-06,2e-06,5e-06,2.1e-05,1.4e-05,1.6e-05,1.3e-05,4e-06,8e-06,1.8e-05,9e-06,8e-06,1e-06,5e-06,9e-06,1.9e-05,8e-06,1.1e-05,7e-06,1.3e-05,2e-06,1.1e-05,5e-06
6e-06,1.2e-05,4e-06,5e-06,8e-06,2.6e-05,1.5e-05,1.4e-05,1.5e-05,3e-06,2.5e-05,3.2e-05,1.3e-05,3e-06,1.1e-05,8e-06,9e-06,1.3e-05,6e-06,1e-05,1.3e-05,1.1e-05,5e-06,5e-06,9e-06,1.8e-05,4e-06,2e-05,1.2e-05,1.9e-05,1e-05,3e-06,3e-06,9e-06,1.7e-05,5e-06,1.2e-05,1.3e-05,9e-06,1.5e-05,1.4e-05,8e-06,1.4e-05,1.8e-05,5e-06,1.8e-05,2.4e-05,1.6e-05,9e-06,1.5e-05,1.2e-05,4e-06,2.4e-05,2.2e-05,1.5e-05,7e-06,6e-06,1.2e-05,4e-06,9e-06,1.3e-05,2.1e-05,3e-06,1.4e-05,1.8e-05,1.5e-05,1.2e-05,2.4e-05,1.7e-05,8e-06,3e-06,2e-05,1.2e-05,8e-06,4e-06,9e-06,8e-06,2e-06,1.2e-05,1.2e-05,1.4e-05,9e-06,2.7e-05,5e-06,4e-06,2.4e-05,2e-06,2.2e-05,1e-05,7e-06,4.1e-05,2.3e-05,1.1e-05,1e-05,1.2e-05,1.1e-05,4.4e-05,1.2e-05,2e-06,1.4e-05,1.3e-05,2.5e-05,2e-05,1.2e-05,8e-06,9e-06,2e-05,1.6e-05,2.3e-05,2e-06,6e-06,9e-06,1.2e-05,3.2e-05,3.9e-05,1.7e-05,8e-06,5e-06,6e-06,1.4e-05,1e-05
1.2e-05,1.5e-05,1.4e-05,2e-06,3e-06,2.2e-05,1.6e-05,1.2e-05,2e-05,3.2e-05,2.6e-05,2.4e-05,2e-06,1.5e-05,2.4e-05,1.8e-05,2.3e-05,8e-06,1.1e-05,1.6e-05,2.1e-05,3.7e-05,2.6e-05,1.4e-05,1.6e-05,2.9e-05,3e-05,3.3e-05,2.2e-05,1.5e-05,1.1e-05,4e-06,8e-06,2.4e-05,2e-05,7e-06,1.5e-05,1.3e-05,3.2e-05,1.7e-05,2.2e-05,2.3e-05,6e-06,1.6e-05,2.3e-05,3e-05,1.7e-05,9e-06,5e-06,6e-06,1.1e-05,6e-06,3.4e-05,2e-05,2.2e-05,2.4e-05,1.7e-05,2.2e-05,1.3e-05,1.7e-05,2.1e-05,7e-06,1.9e-05,3e-05,4.8e-05,2.3e-05,5e-06,9e-06,2.1e-05,1.2e-05,1e-05,2.8e-05,1.3e-05,1.4e-05,7e-06,1.1e-05,2.2e-05,1.9e-05,1.2e-05,1.4e-05,1.6e-05,1.9e-05,2e-05,3.3e-05,2.3e-05,1e-05,1.9e-05,3e-06,1.6e-05,1.3e-05,4.7e-05,3.3e-05,4e-06,1.9e-05,1.3e-05,2e-05,5.4e-05,4e-05,2.7e-05,7e-06,3.2e-05,4.8e-05,5.1e-05,4e-05,1.4e-05,7e-06,1.4e-05,3e-05,3.2e-05,2.9e-05,9e-06,7e-06,2.2e-05,2e-05,2.6e-05,2.6e-05,2e-05,8e-06,1e-05,5e-06,1.9e-05
2e-05,1.7e-05,1e-05,1.7e-05,1.7e-05,1.2e-05,2.7e-05,2.4e-05,5e-06,2e-05,1.6e-05,1.6e-05,2.2e-05,1.8e-05,2.7e-05,1.1e-05,1.4e-05,2e-06,1.8e-05,1.9e-05,1.3e-05,2.4e-05,2.5e-05,2.2e-05,1.4e-05,1.5e-05,2.6e-05,4.5e-05,2.6e-05,3e-05,1.4e-05,6e-06,1e-05,1.9e-05,3e-06,9e-06,1e-05,1.5e-05,1.7e-05,4e-06,1.5e-05,1.7e-05,1.2e-05,1.2e-05,1.1e-05,1.3e-05,1.4e-05,6e-06,1.5e-05,2e-05,1.6e-05,6e-06,2.6e-05,1.6e-05,1.7e-05,4e-06,8e-06,1.6e-05,1.4e-05,5e-06,2e-05,2e-05,2.3e-05,2.3e-05,4.1e-05,2.7e-05,1.7e-05,1.1e-05,1.6e-05,1.8e-05,6e-06,2.2e-05,2e-05,2e-06,6e-06,2.1e-05,1.3e-05,9e-06,1.5e-05,1.2e-05,6e-06,6e-06,2.8e-05,3.2e-05,1.2e-05,3e-06,1.6e-05,1.9e-05,1.4e-05,1.5e-05,1.5e-05,1e-05,1.5e-05,2.5e-05,1.7e-05,1.5e-05,2.5e-05,1.4e-05,5e-06,1.4e-05,1.7e-05,1.8e-05,5e-06,1.3e-05,1e-05,1e-05,1.5e-05,1.7e-05,1.8e-05,1.3e-05,1.3e-05,1.6e-05,2.4e-05,2.7e-05,8e-06,1.2e-05,8e-06,9e-06,1e-05,8e-06,1.2e-05
1.5e-05,1.5e-05,1e-05,1.1e-05,2e-05,1.6e-05,2e-05,2.1e-05,1.2e-05,1.1e-05,5e-06,1e-05,1.9e-05,1e-05,1.9e-05,8e-06,1.1e-05,1.5e-05,1.9e-05,1.7e-05,2.4e-05,1.1e-05,2.1e-05,2.3e-05,1.7e-05,2.2e-05,9e-06,2.3e-05,4e-06,2.3e-05,2.2e-05,1e-05,8e-06,1.5e-05,4e-06,1.2e-05,1.1e-05,5e-06,9e-06,1e-05,8e-06,8e-06,5e-06,1.4e-05,1.7e-05,8e-06,1.3e-05,1.2e-05,2.2e-05,1.1e-05,1e-05,7e-06,1.7e-05,1.4e-05,4e-06,6e-06,1.3e-05,1e-05,7e-06,4e-06,1.4e-05,6e-06,8e-06,1.5e-05,7e-06,1.1e-05,1e-05,3e-06,1e-05,4e-06,7e-06,1.6e-05,1.6e-05,1.7e-05,1.3e-05,3e-06,1.7e-05,7e-06,1.4e-05,6e-06,4e-06,8e-06,1.7e-05,8e-06,1e-05,8e-06,1e-05,1e-05,1.5e-05,7e-06,3e-06,6e-06,1.2e-05,1.2e-05,5e-06,7e-06,7e-06,5e-06,6e-06,6e-06,1.7e-05,1e-05,8e-06,6e-06,4e-06,1.1e-05,4e-06,1.3e-05,8e-06,1.4e-05,1.1e-05,9e-06,1.3e-05,1.9e-05,1e-05,5e-06,1.4e-05,8e-06,6e-06,5e-06,3e-06
4e-06,1.2e-05,1e-06,7e-06,1.4e-05,6e-06,3e-06,1.4e-05,1e-05,1.3e-05,1.1e-05,1.8e-05,1.4e-05,3e-06,3e-06,5e-06,7e-06,2e-06,9e-06,4e-06,1e-05,8e-06,9e-06,1.3e-05,5e-06,1.2e-05,9e-06,1.8e-05,6e-06,9e-06,8e-06,9e-06,7e-06,1.1e-05,1.3e-05,4e-06,0,6e-06,8e-06,7e-06,1.1e-05,9e-06,2e-06,1.1e-05,6e-06,1.1e-05,1.3e-05,1e-06,1.4e-05,1.4e-05,1.8e-05,4e-06,8e-06,1e-05,1.1e-05,2e-06,1.7e-05,9e-06,1.1e-05,6e-06,6e-06,5e-06,1e-06,1.1e-05,1e-05,8e-06,4e-06,4e-06,7e-06,1.2e-05,4e-06,1.5e-05,3e-06,1.3e-05,3e-06,1e-06,1e-05,5e-06,1.2e-05,8e-06,9e-06,1.1e-05,5e-06,1.3e-05,5e-06,1.1e-05,8e-06,1.5e-05,1.3e-05,5e-06,5e-06,6e-06,1.6e-05,1.1e-05,4e-06,2e-06,1.5e-05,9e-06,9e-06,9e-06,8e-06,9e-06,4e-06,9e-06,5e-06,9e-06,3e-06,1.1e-05,8e-06,4e-06,4e-06,9e-06,1.5e-05,7e-06,1e-06,4e-06,1.4e-05,2e-06,6e-06,6e-06,3e-06
1.3e-05,1e-05,1e-05,2e-06,1e-05,1.4e-05,7e-06,2.2e-05,9e-06,1.3e-05,2e-06,1.5e-05,6e-06,3e-06,2e-06,8e-06,4e-06,8e-06,5e-06,5e-06,5e-06,1.3e-05,9e-06,1.1e-05,6e-06,1.7e-05,1e-05,1.9e-05,6e-06,1e-06,5e-06,4e-06,8e-06,1.5e-05,6e-06,8e-06,2e-06,8e-06,4e-06,2e-06,4e-06,6e-06,1.2e-05,2e-05,1e-05,1e-05,1.3e-05,1.1e-05,1.7e-05,1.5e-05,4e-06,7e-06,7e-06,5e-06,1.3e-05,5e-06,1.5e-05,1.4e-05,6e-06,2e-06,2e-06,1.1e-05,1.1e-05,8e-06,1.2e-05,1.7e-05,9e-06,6e-06,5e-06,2e-06,1e-05,3e-06,9e-06,1.6e-05,9e-06,5e-06,4e-06,5e-06,1e-05,7e-06,5e-06,9e-06,7e-06,5e-06,8e-06,6e-06,6e-06,6e-06,7e-06,8e-06,3e-06,4e-06,9e-06,1e-06,4e-06,7e-06,1e-05,5e-06,8e-06,2e-06,9e-06,1e-06,8e-06,3e-06,3e-06,3e-06,3e-06,7e-06,1e-06,2e-06,6e-06,7e-06,7e-06,4e-06,5e-06,9e-06,1e-05,1.6e-05,6e-06,3e-06,4e-06
3e-06,4e-06,1e-05,1e-05,1e-06,4e-06,5e-06,1.8e-05,9e-06,1.3e-05,7e-06,1.3e-05,8e-06,5e-06,5e-06,5e-06,5e-06,6e-06,2e-06,3e-06,7e-06,1.4e-05,5e-06,2e-05,1.9e-05,2.4e-05,7e-06,1.6e-05,5e-06,4e-06,5e-06,3e-06,8e-06,1.7e-05,6e-06,5e-06,3e-06,7e-06,9e-06,3e-06,4e-06,8e-06,1.3e-05,1.3e-05,1e-06,1.4e-05,3e-06,4e-06,1.5e-05,2e-06,4e-06,6e-06,6e-06,3e-06,2e-06,1.2e-05,3e-06,4e-06,7e-06,3e-06,7e-06,1.3e-05,4e-06,5e-06,1.8e-05,1.2e-05,6e-06,5e-06,3e-06,8e-06,9e-06,7e-06,7e-06,8e-06,6e-06,6e-06,3e-06,2e-06,6e-06,5e-06,3e-06,1e-05,7e-06,3e-06,7e-06,7e-06,9e-06,1e-05,1.7e-05,2e-06,4e-06,3e-06,7e-06,1.5e-05,9e-06,1e-06,7e-06,1e-05,8e-06,4e-06,1.2e-05,8e-06,5e-06,4e-06,4e-06,2e-06,3e-06,3e-06,8e-06,5e-06,3e-06,7e-06,1.3e-05,5e-06,5e-06,3e-06,6e-06,1.5e-05,7e-06,5e-06,9e-06
8e-06,6e-06,5e-06,9e-06,9e-06,5e-06,8e-06,1.1e-05,7e-06,8e-06,1.1e-05,1.2e-05,6e-06,3e-06,1.5e-05,9e-06,5e-06,1.1e-05,7e-06,9e-06,3e-06,6e-06,7e-06,2e-05,1e-05,1e-05,1.1e-05,1.5e-05,1.1e-05,6e-06,6e-06,7e-06,4e-06,4e-06,8e-06,2e-06,7e-06,2e-06,8e-06,6e-06,8e-06,9e-06,4e-06,1e-05,1e-05,1.5e-05,1e-05,1e-06,1.3e-05,6e-06,3e-06,6e-06,5e-06,5e-06,1.1e-05,5e-06,2e-06,7e-06,4e-06,2e-06,9e-06,6e-06,2e-06,9e-06,1.4e-05,7e-06,4e-06,5e-06,9e-06,6e-06,2e-06,1.2e-05,3e-06,1.2e-05,8e-06,7e-06,8e-06,4e-06,7e-06,8e-06,5e-06,8e-06,4e-06,6e-06,1e-06,6e-06,9e-06,1.3e-05,1.2e-05,3e-06,5e-06,5e-06,8e-06,1.2e-05,5e-06,1e-06,2e-06,2e-06,3e-06,5e-06,7e-06,2e-06,2e-06,3e-06,6e-06,5e-06,4e-06,4e-06,3e-06,4e-06,8e-06,7e-06,8e-06,8e-06,6e-06,6e-06,7e-06,4e-06,1e-06,8e-06,2e-06
1e-05,1.2e-05,8e-06,8e-06,1.5e-05,8e-06,6e-06,2.4e-05,1.4e-05,1.1e-05,4e-06,6e-06,1.6e-05,4e-06,1.3e-05,9e-06,7e-06,1.3e-05,3e-06,7e-06,1.5e-05,6e-06,6e-06,1.3e-05,2e-05,8e-06,4e-06,1.4e-05,6e-06,1.2e-05,7e-06,2e-06,7e-06,5e-06,5e-06,2e-06,1e-05,5e-06,9e-06,1e-05,2e-06,1e-05,8e-06,5e-06,6e-06,7e-06,5e-06,5e-06,9e-06,1.4e-05,8e-06,1.1e-05,1e-05,7e-06,2e-05,7e-06,1.1e-05,1e-05,1e-06,7e-06,9e-06,6e-06,8e-06,1.6e-05,7e-06,1e-06,5e-06,8e-06,9e-06,7e-06,6e-06,1.1e-05,1.2e-05,1e-05,1e-05,5e-06,4e-06,3e-06,2e-06,5e-06,0,6e-06,9e-06,9e-06,8e-06,1.8e-05,6e-06,8e-06,2e-06,1.2e-05,1.1e-05,7e-06,1e-05,5e-06,8e-06,6e-06,1e-06,9e-06,7e-06,7e-06,3e-06,3e-06,5e-06,8e-06,8e-06,6e-06,4e-06,4e-06,4e-06,5e-06,2e-06,1e-06,8e-06,1.1e-05,4e-06,3e-06,4e-06,1.2e-05,0,1.1e-05,9e-06
1.7e-05,1.1e-05,1.4e-05,5e-06,5e-06,1e-05,6e-06,2.1e-05,8e-06,2.6e-05,8e-06,1.4e-05,9e-06,1.2e-05,1.4e-05,1e-05,7e-06,2e-05,2.2e-05,5e-06,1.8e-05,6e-06,1.2e-05,1.1e-05,1.9e-05,7e-06,5e-06,8e-06,7e-06,1.8e-05,1.2e-05,1.2e-05,1e-05,1.7e-05,1e-05,5e-06,7e-06,9e-06,1.2e-05,8e-06,3e-06,9e-06,1.1e-05,4e-06,6e-06,1.2e-05,5e-06,2e-06,1e-05,2.5e-05,1e-05,8e-06,7e-06,1.3e-05,1e-05,1.4e-05,5e-06,1.4e-05,1e-05,1.1e-05,3e-06,1.3e-05,1e-05,1e-05,1.5e-05,2e-06,1.4e-05,1.8e-05,4e-06,7e-06,1e-05,3e-06,1e-05,1.1e-05,2e-06,4e-06,3e-06,4e-06,1e-06,3e-06,1.4e-05,1.7e-05,2.2e-05,6e-06,9e-06,2.4e-05,8e-06,8e-06,1.1e-05,6e-06,3e-06,4e-06,1.3e-05,1.5e-05,1.3e-05,2e-06,5e-06,1e-05,1.2e-05,1.4e-05,7e-06,7e-06,2e-06,1.4e-05,1.5e-05,1.7e-05,6e-06,1e-05,7e-06,6e-06,2e-06,6e-06,9e-06,7e-06,5e-06,5e-06,8e-06,1.5e-05,6e-06,1e-05,7e-06
1.2e-05,1.3e-05,1.5e-05,9e-06,6e-06,1.4e-05,7e-06,1e-05,9e-06,2e-05,1.9e-05,2.1e-05,1.9e-05,2.3e-05,1.4e-05,1.2e-05,1.1e-05,1.9e-05,1e-05,1.9e-05,1.6e-05,1.8e-05,2.2e-05,2.4e-05,7e-06,1.6e-05,1.4e-05,9e-06,1e-06,1.6e-05,1.2e-05,9e-06,1.7e-05,8e-06,6e-06,6e-06,1.2e-05,9e-06,1.4e-05,1.2e-05,1.6e-05,1.5e-05,1.6e-05,9e-06,3e-06,6e-06,6e-06,7e-06,9e-06,1e-05,1.3e-05,1.2e-05,1.4e-05,8e-06,1.2e-05,1.3e-05,1.4e-05,1.1e-05,9e-06,2.3e-05,1.7e-05,6e-06,1.1e-05,8e-06,1.5e-05,1.1e-05,1.5e-05,1.1e-05,1.1e-05,1.3e-05,2.2e-05,1.7e-05,3e-06,1.3e-05,1.3e-05,7e-06,6e-06,3e-06,6e-06,7e-06,1.5e-05,6e-06,1.9e-05,1.9e-05,6e-06,1.6e-05,1.8e-05,1.5e-05,1.3e-05,7e-06,4e-06,8e-06,3e-06,1.2e-05,1.3e-05,1.4e-05,6e-06,1.1e-05,9e-06,1e-05,1.3e-05,1.7e-05,1.4e-05,2.2e-05,3e-06,7e-06,1.5e-05,1.6e-05,1.5e-05,1.4e-05,1.1e-05,1.3e-05,1e-05,5e-06,1.1e-05,5e-06,9e-06,5e-06,4e-06,2e-06,8e-06
8e-06,8e-06,8e-06,9e-06,1.2e-05,1.1e-05,3e-06,1.4e-05,3e-06,5e-06,1e-05,8e-06,1e-05,1.2e-05,7e-06,8e-06,9e-06,4e-06,1.6e-05,1e-05,6e-06,1.5e-05,8e-06,1.8e-05,5e-06,3e-06,7e-06,1.2e-05,8e-06,6e-06,2e-06,4e-06,1e-05,1.2e-05,2e-06,1e-05,9e-06,5e-06,1.6e-05,9e-06,1.6e-05,9e-06,4e-06,8e-06,1.6e-05,6e-06,8e-06,6e-06,7e-06,8e-06,9e-06,8e-06,3e-06,1e-05,7e-06,2e-06,4e-06,5e-06,5e-06,1.1e-05,2e-06,6e-06,7e-06,1.3e-05,1e-06,2e-06,1.5e-05,5e-06,6e-06,7e-06,1.4e-05,5e-06,8e-06,2e-06,7e-06,6e-06,3e-06,7e-06,4e-06,1e-05,3e-06,1e-05,1e-05,7e-06,5e-06,6e-06,7e-06,8e-06,1e-05,3e-06,2e-06,1.1e-05,7e-06,7e-06,4e-06,8e-06,1.1e-05,9e-06,8e-06,8e-06,8e-06,6e-06,1.1e-05,6e-06,8e-06,2e-06,7e-06,3e-06,1.1e-05,9e-06,1e-06,5e-06,1.1e-05,2e-06,7e-06,5e-06,5e-06,8e-06,3e-06,4e-06,8e-06
7e-06,5e-06,7e-06,8e-06,5e-06,3e-06,1e-06,1.2e-05,3e-06,6e-06,1e-05,1.1e-05,9e-06,4e-06,2e-06,6e-06,6e-06,4e-06,1.2e-05,1e-05,2e-06,1.1e-05,3e-06,1.2e-05,4e-06,4e-06,3e-06,9e-06,9e-06,3e-06,0,3e-06,6e-06,9e-06,3e-06,5e-06,4e-06,6e-06,9e-06,6e-06,9e-06,3e-06,1e-06,6e-06,8e-06,3e-06,5e-06,1e-06,8e-06,2e-06,6e-06,6e-06,5e-06,3e-06,4e-06,0,0,4e-06,2e-06,2e-06,2e-06,9e-06,6e-06,3e-06,3e-06,5e-06,1.3e-05,6e-06,3e-06,3e-06,7e-06,1e-06,3e-06,2e-06,2e-06,4e-06,3e-06,3e-06,5e-06,4e-06,3e-06,6e-06,8e-06,3e-06,5e-06,1e-06,7e-06,1.1e-05,9e-06,3e-06,4e-06,5e-06,5e-06,6e-06,3e-06,4e-06,8e-06,6e-06,3e-06,3e-06,4e-06,6e-06,6e-06,5e-06,1e-06,3e-06,3e-06,5e-06,7e-06,6e-06,2e-06,1e-06,6e-06,3e-06,3e-06,1e-06,3e-06,6e-06,1e-06,3e-06,5e-06
6e-06,4e-06,6e-06,3e-06,4e-06,5e-06,3e-06,1.2e-05,1e-06,7e-06,8e-06,8e-06,9e-06,4e-06,2e-06,7e-06,4e-06,2e-06,9e-06,9e-06,1e-06,7e-06,1e-06,1.1e-05,4e-06,3e-06,1e-06,8e-06,5e-06,1e-06,1e-06,2e-06,3e-06,9e-06,3e-06,4e-06,4e-06,7e-06,9e-06,6e-06,1e-05,1e-06,3e-06,5e-06,6e-06,1e-06,5e-06,1e-06,7e-06,6e-06,6e-06,3e-06,5e-06,4e-06,3e-06,1e-06,1e-06,3e-06,3e-06,3e-06,3e-06,5e-06,2e-06,3e-06,2e-06,4e-06,1e-05,2e-06,2e-06,1e-06,3e-06,4e-06,1e-06,4e-06,4e-06,2e-06,2e-06,2e-06,5e-06,5e-06,4e-06,4e-06,6e-06,5e-06,3e-06,3e-06,6e-06,8e-06,9e-06,3e-06,3e-06,2e-06,3e-06,5e-06,3e-06,2e-06,8e-06,2e-06,3e-06,2e-06,1e-06,3e-06,5e-06,3e-06,1e-06,3e-06,2e-06,3e-06,6e-06,5e-06,0,1e-06,8e-06,1e-06,1e-06,1e-06,5e-06,5e-06,1e-06,3e-06,5e-06
7e-06,4e-06,5e-06,2e-06,4e-06,4e-06,2e-06,1.2e-05,2e-06,9e-06,6e-06,8e-06,8e-06,3e-06,3e-06,6e-06,2e-06,1e-06,6e-06,6e-06,2e-06,7e-06,1e-06,1e-05,5e-06,1e-06,2e-06,8e-06,5e-06,2e-06,1e-06,3e-06,2e-06,9e-06,4e-06,4e-06,3e-06,6e-06,9e-06,3e-06,8e-06,1e-06,3e-06,5e-06,4e-06,2e-06,4e-06,1e-06,6e-06,3e-06,6e-06,2e-06,5e-06,2e-06,4e-06,1e-06,0,2e-06,2e-06,1e-06,3e-06,6e-06,0,0,2e-06,4e-06,1e-05,2e-06,3e-06,1e-06,5e-06,3e-06,0,4e-06,4e-06,2e-06,4e-06,3e-06,4e-06,6e-06,3e-06,4e-06,5e-06,5e-06,4e-06,5e-06,5e-06,1e-05,9e-06,3e-06,3e-06,3e-06,3e-06,5e-06,3e-06,1e-06,6e-06,2e-06,3e-06,2e-06,2e-06,1e-06,3e-06,4e-06,1e-06,4e-06,3e-06,4e-06,6e-06,3e-06,0,1e-06,9e-06,2e-06,1e-06,1e-06,4e-06,6e-06,1e-06,3e-06,5e-06
7e-06,4e-06,4e-06,1e-06,4e-06,4e-06,2e-06,1.1e-05,3e-06,9e-06,5e-06,9e-06,8e-06,2e-06,3e-06,6e-06,0,2e-06,4e-06,6e-06,1e-06,6e-06,0,1e-05,6e-06,1e-06,1e-06,8e-06,6e-06,2e-06,1e-06,2e-06,3e-06,9e-06,3e-06,3e-06,3e-06,5e-06,9e-06,2e-06,8e-06,1e-06,3e-06,5e-06,5e-06,1e-06,4e-06,1e-06,5e-06,4e-06,7e-06,2e-06,5e-06,1e-06,4e-06,2e-06,0,3e-06,1e-06,1e-06,2e-06,7e-06,1e-06,1e-06,4e-06,4e-06,9e-06,2e-06,2e-06,1e-06,4e-06,3e-06,1e-06,4e-06,3e-06,2e-06,4e-06,3e-06,5e-06,6e-06,3e-06,4e-06,4e-06,4e-06,4e-06,5e-06,4e-06,9e-06,1e-05,2e-06,4e-06,2e-06,3e-06,4e-06,3e-06,1e-06,7e-06,2e-06,4e-06,2e-06,1e-06,2e-06,2e-06,3e-06,1e-06,3e-06,2e-06,4e-06,6e-06,4e-06,1e-06,1e-06,8e-06,3e-06,1e-06,1e-06,3e-06,6e-06,1e-06,2e-06,4e-06
