0.075982,0.079487,0.102999,0.146468,0.223224,0.392765,0.54884,0.624802,0.717283,0.783176,0.811356,0.834539,0.908135,1.005418,1.032574,1.021945,1.028212,1.074596,1.059823,1.054003,1.057979,1.043793,1.09808,1.135527,1.252426,1.288417,1.10649,1.015414
0.088897,0.090567,0.11768,0.172165,0.259598,0.443247,0.613486,0.693289,0.806196,0.900288,0.929007,0.960375,1.086479,1.197859,1.208712,1.207553,1.209598,1.232529,1.207377,1.219187,1.239599,1.239006,1.302925,1.348738,1.476809,1.491777,1.294165,1.200372
0.104843,0.10451,0.137542,0.209053,0.310179,0.501436,0.683415,0.772507,0.917754,1.064898,1.111722,1.159502,1.370592,1.500781,1.469341,1.474882,1.479501,1.454704,1.414477,1.471547,1.505762,1.528806,1.623872,1.688691,1.825844,1.778272,1.567907,1.498575
0.102137,0.103046,0.139313,0.219836,0.32405,0.486607,0.656544,0.774727,0.940589,1.125625,1.229138,1.299107,1.52524,1.634915,1.558778,1.563598,1.610326,1.55264,1.505025,1.610127,1.602529,1.63458,1.778049,1.866068,1.999718,1.866718,1.690861,1.71215
0.082885,0.088123,0.1221,0.19788,0.294442,0.416966,0.57401,0.738934,0.910854,1.103967,1.261425,1.33646,1.497085,1.571145,1.478597,1.490141,1.596925,1.523233,1.484388,1.60378,1.520823,1.543284,1.711595,1.810022,1.954945,1.801997,1.721473,1.904469
0.066627,0.077612,0.106632,0.165589,0.247551,0.348868,0.492953,0.696435,0.876943,1.039464,1.215014,1.285207,1.360887,1.470868,1.454453,1.518506,1.585779,1.436493,1.460773,1.578357,1.495735,1.525533,1.637035,1.661216,1.797622,1.772425,1.841641,2.159467
0.070335,0.082129,0.110342,0.162735,0.235682,0.346442,0.495832,0.733948,0.940248,1.044974,1.213052,1.310934,1.334469,1.519624,1.680319,1.847075,1.716372,1.443379,1.61282,1.730701,1.691845,1.735066,1.802566,1.732698,1.811274,1.975335,2.118349,2.392507
0.089601,0.100243,0.138657,0.215657,0.313861,0.4647,0.654549,0.928959,1.137717,1.202415,1.38144,1.553777,1.618545,1.834691,2.209201,2.478318,2.066323,1.73538,2.083819,2.236037,2.202548,2.170285,2.23698,2.205228,2.268806,2.514949,2.534596,2.615375
0.11579,0.128214,0.18726,0.321925,0.479957,0.694251,0.983773,1.302641,1.484577,1.545043,1.712627,1.979006,2.164695,2.388861,2.957851,3.192599,2.54106,2.262788,2.662557,2.850534,2.771942,2.557541,2.65028,2.789855,2.898228,3.091169,2.935808,2.833736
0.151907,0.173063,0.263109,0.47366,0.69939,0.986603,1.411961,1.76447,1.900556,1.971599,2.113535,2.454642,2.813958,3.162714,3.813664,3.784548,3.047386,2.883838,3.109633,3.276965,3.141868,2.77549,2.933415,3.248028,3.383727,3.415034,3.186533,3.11124
0.194622,0.231197,0.349926,0.62678,0.900162,1.252022,1.859116,2.261851,2.267325,2.330866,2.51762,2.903198,3.415052,3.919809,4.425932,3.9732,3.401974,3.476874,3.44832,3.522512,3.315008,2.889683,3.146861,3.509634,3.5525,3.449123,3.228444,3.350471
0.221633,0.276254,0.421563,0.741895,1.010212,1.387957,2.164897,2.648993,2.528477,2.611594,2.897868,3.235459,3.768565,4.291647,4.43474,3.668164,3.572281,3.860912,3.473046,3.506867,3.379906,3.046118,3.435409,3.728345,3.574641,3.370088,3.088593,3.408756
0.226633,0.309933,0.490278,0.822274,1.043287,1.41136,2.217641,2.772923,2.720469,2.837124,3.203488,3.449994,3.801545,4.159853,3.985984,3.174499,3.535575,3.949769,3.257863,3.334518,3.456772,3.338721,3.700959,3.74081,3.546945,3.379537,3.011441,3.391878
0.219007,0.378902,0.627397,0.894869,1.03992,1.400238,2.019194,2.526962,2.687484,2.868007,3.297517,3.470313,3.510487,3.704136,3.432325,2.700163,3.270696,3.867529,3.19356,3.198092,3.458725,3.533378,3.671326,3.413818,3.379325,3.328659,3.028206,3.453967
0.242942,0.556337,0.927091,1.028213,1.104061,1.637117,2.093324,2.452554,2.795819,2.985226,3.523596,3.749344,3.366909,3.411769,3.233395,2.688204,3.198624,3.891602,3.576525,3.396182,3.786083,4.087476,3.752119,3.196783,3.293385,3.382118,3.437664,3.933966
0.341209,0.890729,1.48234,1.480986,1.569448,2.382091,2.866228,3.263103,3.748916,3.769281,4.446394,4.937828,4.29374,4.428316,4.401216,3.836117,4.155511,4.915031,5.003801,4.602464,5.037597,5.480802,4.662014,3.951602,4.219122,4.442936,4.850431,5.422498
0.512416,1.339684,2.189882,2.196528,2.425481,3.560527,4.133177,4.665659,5.317899,5.131263,5.981699,6.962803,6.372381,6.728368,6.747335,6.153026,6.409538,7.178543,7.538265,6.809115,7.094067,7.731112,6.742527,5.881916,6.395195,7.102476,7.814257,8.332986
0.7121,1.750878,2.824665,3.02488,3.593298,5.026626,5.723464,6.525016,7.383904,6.955919,7.785671,9.173694,8.798088,9.284372,9.456619,9.381684,9.411804,9.82478,10.729859,9.808266,9.7045,10.621825,9.913282,8.684529,9.189925,11.026191,12.479227,12.895344
0.901941,1.983141,3.261984,3.922831,5.002991,6.859102,7.991452,9.182566,10.236712,9.522299,9.832276,11.19494,11.018188,11.390091,11.953754,13.251584,12.946718,12.762191,14.76149,13.636077,12.856556,14.316108,14.186943,12.137723,12.133258,15.642508,18.47253,18.857123
1.012835,2.020367,3.608434,4.895594,6.306108,8.484021,10.564011,12.657497,13.859247,13.234806,13.077414,13.625674,13.311434,13.179178,14.114943,17.611722,17.247639,16.315686,19.688358,18.297143,16.834382,19.001457,19.11792,15.820451,14.695843,19.554223,24.169591,24.643581
0.999008,1.896586,3.769512,5.646291,6.941974,8.928343,12.545671,16.195116,17.451734,17.422791,16.531399,15.567376,15.344032,14.912249,16.254024,21.500539,21.210571,19.291861,23.094636,21.928093,20.261505,22.705838,22.830651,19.109909,16.960683,21.434261,27.159156,27.994508
0.838696,1.598804,3.52118,5.751987,6.889509,8.212032,12.764333,18.154805,19.895066,21.071666,19.581366,16.490788,16.328919,17.169982,18.97859,23.240812,22.728995,19.781227,22.229444,22.422845,21.876955,23.386847,23.121457,21.127792,19.495048,21.314048,25.3373,26.104701
0.660928,1.439443,3.305457,5.44166,6.50873,7.359411,11.384157,17.534183,19.868237,22.340567,21.229065,16.680493,16.652085,18.800089,19.853208,21.156259,21.008943,17.902862,17.905368,20.130505,21.461342,21.16499,20.548857,21.528764,21.108612,18.836566,19.451803,20.534138
0.708307,1.474355,3.187321,5.32524,6.324198,6.952304,9.786593,14.779441,17.645907,21.364942,20.635011,17.122918,17.902978,18.768948,17.803695,16.032273,16.210324,14.141851,13.006738,17.27948,19.191682,17.581771,18.365501,20.633414,19.797346,15.402805,13.976008,15.641882
0.903684,1.683371,3.21695,5.072498,5.867524,7.053073,8.887843,11.293037,14.359848,17.956493,16.636174,15.530667,18.256833,17.891841,15.422919,12.325962,12.037057,10.510597,9.299964,14.67406,16.630788,15.645182,17.839426,18.299077,15.938758,12.326006,10.99423,13.051923
1.16686,2.039696,3.242723,4.393837,4.724922,6.377212,8.074766,8.964739,11.197062,13.051063,11.660597,12.045842,15.455105,14.864569,12.50825,10.315245,8.818911,7.445971,7.208536,12.206558,14.520498,14.200755,15.625916,14.015166,11.091757,9.799422,10.787732,13.498886
1.280091,2.198452,3.235655,4.017704,3.969641,5.165365,7.236781,8.040986,8.917167,9.623495,8.599627,8.227551,10.304651,9.976507,8.972754,8.432537,6.113077,4.950464,5.593593,9.73406,12.330504,12.259652,12.753582,11.051415,9.334731,9.077627,10.468427,12.796317
1.100546,1.852484,2.698211,3.317227,3.367758,4.12757,5.864317,6.298693,6.488649,7.242584,6.600594,6.100635,7.358906,6.995863,6.606443,6.586946,4.596831,3.745847,4.500364,7.788027,9.870522,9.074892,9.470821,9.668387,9.070034,8.62668,8.876633,9.489489
0.752347,1.16732,1.711625,2.270064,2.673339,3.268974,4.112818,4.17337,4.401043,4.822755,4.197098,4.527916,5.52939,5.184575,5.252898,4.837873,3.312404,3.10042,3.514902,5.414048,6.616731,5.530223,5.70363,7.032035,7.365313,7.439647,6.839832,5.467893
0.585058,0.724854,1.050816,1.646012,2.026909,2.220465,2.55934,2.796668,3.049136,2.919982,2.362291,3.022009,3.841774,3.673545,3.926901,3.497588,2.394946,2.431713,2.558323,3.461651,4.162494,3.392347,3.230587,4.206872,4.968373,5.605615,4.914891,3.365459
0.540375,0.64364,0.945597,1.50791,1.707983,1.572721,1.824562,1.95343,2.144849,2.263193,2.046793,2.47739,3.138896,2.959338,2.706076,2.480183,2.027167,2.064797,1.950201,2.347458,3.061306,2.688778,2.479335,2.870089,3.455949,4.339701,3.876498,3.224749
0.482125,0.551994,0.829584,1.519601,1.683559,1.27162,1.404813,1.524558,1.707889,2.085433,2.156413,2.490977,3.056658,2.610849,1.781258,1.719273,2.056398,2.282425,1.920892,1.85744,2.506158,2.533416,2.492394,2.921232,3.282306,3.876352,3.400864,3.339573
0.430792,0.477272,0.684489,1.379568,1.501666,1.033475,1.209573,1.465673,1.574447,2.000742,2.374492,2.944711,3.499646,2.689366,1.496399,1.389902,2.125993,2.578564,2.033561,1.870603,2.594472,2.478288,2.349747,2.922464,2.942185,3.300858,3.234873,3.384998
0.391239,0.472827,0.660283,1.18119,1.147721,0.772604,1.055949,1.365837,1.543017,2.054414,2.794125,3.445692,3.641986,2.665592,1.436622,1.397794,2.120476,2.451768,2.04147,1.999253,2.667835,2.166917,1.736749,2.352316,2.243163,2.70759,3.155278,3.145849
0.306965,0.436405,0.698907,1.027987,0.880997,0.725182,1.195081,1.402391,1.457173,1.986618,3.033604,3.432128,3.049068,2.185372,1.333608,1.511655,2.073023,2.044477,1.757386,1.864658,2.548989,1.98063,1.182113,1.538789,1.759336,2.646835,3.078562,2.794821
0.20757,0.350927,0.670522,0.841432,0.736921,0.892388,1.482725,1.560705,1.343722,1.857556,2.916037,2.791887,2.004776,1.458167,1.239304,1.776272,2.397303,2.024868,1.478034,1.673282,2.311196,2.016214,1.221596,1.389637,1.884039,2.814484,2.808589,2.374416
0.165932,0.304199,0.581668,0.589104,0.630391,1.092886,1.641756,1.49583,1.102944,1.674724,2.40596,1.991012,1.425744,1.084326,1.296329,2.096443,2.697426,2.266581,1.560802,1.610134,1.988658,2.166656,1.571244,1.71715,2.306508,2.835169,2.581428,2.146838
0.163006,0.313399,0.518048,0.38187,0.525339,1.16581,1.518962,1.181882,0.848081,1.301001,1.627026,1.313403,1.28,1.18018,1.414781,2.167747,2.574493,2.511371,2.216125,1.968543,2.032337,2.449858,1.882777,2.03276,2.55054,2.523793,2.33324,1.876619
0.157727,0.309529,0.492498,0.310292,0.431018,1.029895,1.151612,0.918025,0.785244,0.885896,0.982846,0.945733,1.064132,1.230847,1.411402,1.846779,2.013209,2.549041,2.982386,2.696115,2.418409,2.527544,2.133159,2.534616,2.759686,2.298193,2.104746,1.622771
0.160287,0.296419,0.427745,0.293741,0.372322,0.755693,0.730153,0.81794,0.814803,0.573876,0.609704,0.65516,0.766147,1.085716,1.185877,1.319088,1.541434,2.421172,3.474503,3.361595,2.758827,2.18429,2.151378,3.004751,3.244394,2.753023,2.419843,1.766336
