-0.001595,-0.001134,-0.001701,-0.001124,-0.001737,-0.001663,-0.002248,-0.001541,-0.003424,-0.00394,-0.004535,-0.006399,-0.003989,-0.007643,-0.006789,-0.007324,-0.005948,-0.006056,-0.00812,-0.009042,-0.007415,-0.007155,-0.002218,-0.005711,-0.008091,-0.011696,-0.011977,-0.008446,-0.010916,-0.006739,-0.013143,-0.012491,-0.011083,-0.005859,-0.012214,-0.008421,-0.005937,-0.006409,-0.010679,-0.008619,-0.009012,-0.005623,-0.009406,-0.007778,-0.010424,-0.0096,-0.010058,-0.008862,-0.011902,-0.008624,-0.005003,-0.00978,-0.011833,-0.007772,-0.002131,-0.009354,-0.00697,-0.008062,-0.007725,-0.007693,-0.005479,-0.00839,-0.00983,-0.004963,-0.005994,-0.004795,-0.005991,-0.006327,-0.003423,-0.003076,-0.003203,-0.005064,-0.004073,-0.004438,-0.002988,-0.00291,-0.003587,-0.002853,-0.002755,-0.003528,-0.003174,-0.00328,-0.003357,-0.003027,-0.00325,-0.003239,-0.002654,-0.003285,-0.002873,-0.001972,-0.001611,-0.002575,-0.002047,-0.001162,-0.001938,-0.001387,-0.001034,-0.001692,-0.001565,-0.001108,-0.001629,-0.001057,-0.001369,-0.001193,-0.001083,-0.001157,-0.000912,-0.001174,-0.001012,-0.001266,-0.000738,-0.00075,-0.000568,-0.000773,-0.000555,-0.000532,-0.000565,-0.000551,-0.000466,-0.00078,-0.000594
0.000603,0.000535,0.000655,0.000309,5.9e-05,5e-06,0.000756,-0.000197,4.9e-05,0.001799,0.001219,0.000502,-0.000357,-0.001496,-0.00057,0.000614,0.001854,0.00136,-0.0018,-0.000814,-0.001187,-0.004718,-0.003961,0.000112,0.003069,-0.003463,0.003792,-0.001986,-0.002377,-0.001816,-0.00078,-0.004389,-0.003746,-0.00375,-0.002696,-0.001908,-0.00183,-0.004878,-0.000333,-0.00116,-0.001213,-0.002003,0.000434,-0.000766,-0.001226,-0.002391,-0.003936,-0.002271,0.000486,-0.00039,-0.000749,-0.004954,-0.000796,0.00015,-0.001836,-0.00228,-0.001283,0.000206,-0.001004,-0.002536,0.000435,-0.00029,0.000569,-0.000407,-0.002345,-0.002539,-0.001432,-0.000942,-0.002043,-0.0017,-0.00096,-0.000458,-0.000435,-0.000259,0.000291,-0.00031,-0.000292,-9.9e-05,0.000576,-0.000931,-0.000557,-0.000453,-6.7e-05,-0.00171,-0.000247,-0.000596,-0.000458,-5.3e-05,-7.9e-05,-0.000115,-5.2e-05,0.00049,0.000338,-0.000469,-5.7e-05,-4.1e-05,9.3e-05,-8.6e-05,-0.000629,-0.000411,-4.9e-05,-0.000161,-0.000153,8.4e-05,-0.000171,5e-05,-0.000221,-0.000462,1.1e-05,0.000217,-3e-05,3e-06,2e-05,-7.7e-05,-1.9e-05,-0.000153,-0.000157,-0.000237,0.000114,0.000418,0.000327
-0.000547,-0.000224,-4.7e-05,7.2e-05,-0.000314,-9.2e-05,-0.000247,-5.8e-05,1.9e-05,-0.000813,0.000167,0.001056,0.000614,0.002271,0.001702,-0.00065,-0.001108,-0.001098,0.000101,-0.002165,-8.3e-05,-0.000516,0.00282,0.00039,0.000422,0.001243,-0.001147,0.000197,0.003776,0.0013,0.003089,0.003048,0.002088,0.001333,0.003854,0.002789,-0.001318,0.002277,0.000358,0.001139,2e-04,-0.001319,0.000111,-0.001252,-0.000502,0.000136,0.00528,0.00079,0.000378,0.001023,0.000777,0.005997,0.004653,0.003205,0.000778,0.001502,0.000807,0.000403,0.001694,0.004429,-0.001645,0.00154,-0.000422,-0.001612,0.00038,0.001438,-4.5e-05,-0.000345,0.001027,0.001505,9.6e-05,0.00039,-0.000369,0.000596,0.00028,0.000681,0.000159,0.000224,0.000308,0.001138,0.001242,0.000683,0.000585,-0.000201,8e-04,9.6e-05,0.000246,-0.000307,-0.000106,-0.000468,0.000272,-0.000264,-0.000311,-0.000264,3e-06,-0.000432,-0.000279,-0.000357,0.000426,-0.000105,-3.9e-05,-0.000218,-1.6e-05,4e-06,4e-05,0.000214,-3.8e-05,5.3e-05,-0.000331,-2e-04,-0.000369,-0.000209,-0.000107,5.4e-05,9e-05,-9.7e-05,0.000337,0.000223,-4.3e-05,-0.00018,-6e-06
-0.000123,-7.7e-05,-0.000137,3.5e-05,-0.000461,-0.000236,0.00012,-8.6e-05,-0.00021,0.000389,-0.000885,-0.001007,-0.00047,-0.002023,-0.001235,-0.000164,3e-05,-0.000463,-5e-05,-0.000823,-0.002649,0.000248,-0.003184,-0.000896,0.000199,0.001801,-0.001152,-0.001612,-0.002175,-0.001649,-0.002875,0.000713,-0.002419,-0.001498,-0.004151,-0.000544,0.003045,-0.001609,-0.00101,-0.000996,-0.000876,0.00187,0.001773,-0.001794,-0.001136,-0.001258,-0.004695,-0.000632,-0.001725,-0.001309,-0.001713,-0.003055,-0.005407,-0.00128,0.001339,-0.000421,-0.000419,-0.001326,-0.001416,-0.002357,0.001799,-0.001424,-0.002477,0.001152,-0.000946,-0.001104,0.000738,-0.000281,-0.000608,-0.00201,0.000958,0.000225,0.001194,-0.000612,0.000171,-8.5e-05,0.000236,0.000317,-0.000242,-0.001408,-0.000198,-0.001254,-0.001311,-8e-04,-0.001604,-0.000747,-0.00095,-0.000993,-0.000225,0.000466,-0.000315,0.000297,-4.6e-05,-0.000324,-0.000346,-0.000308,0.000312,0.000209,-0.000299,-0.000145,-0.000634,-4e-04,-0.000502,-0.000497,-0.000655,-0.000517,-6e-05,-4.9e-05,-9.7e-05,3.2e-05,0.000169,2.9e-05,-9.9e-05,-4.3e-05,-0.000423,-0.000285,-0.000205,-7.5e-05,4.8e-05,-0.000141,-0.000245
0.00033,0.000557,4e-06,0.000172,0.000361,1e-05,-5.9e-05,-0.000316,-0.00091,-0.001767,-1.2e-05,-0.001249,-0.0012,-0.002073,-0.00242,0.000193,0.00069,-0.00138,-0.002148,-0.00014,0.001302,0.002212,0.002292,0.001369,-0.001174,4.7e-05,0.000638,-0.001084,-0.002182,-0.002082,-0.002022,-0.004257,0.000262,-0.002076,-0.001456,-0.002156,-0.002469,-2.7e-05,0.001463,-0.003077,-0.001873,-0.003517,-0.002552,-0.000654,0.000441,-0.00045,-0.000433,-0.002712,0.001478,-0.001522,-0.002675,-0.000868,0.000102,-0.000746,-0.001263,-0.000264,-0.001023,-0.001368,-0.00071,0.000524,-0.000587,-0.000346,0.001927,-0.000757,0.000543,0.00083,-0.000725,0.000201,-0.000805,0.000678,-0.00031,0.000456,-0.000753,0.00039,0.000119,-6e-06,-0.001077,-0.000898,-0.000172,0.000203,-0.000584,0.000483,0.000699,7.4e-05,-0.00044,0.000742,0.000833,0.000431,-0.000522,-0.000357,-9e-05,-0.000339,-0.000127,0.000255,0.000142,8.5e-05,-0.000231,-0.000193,-0.000315,-5.6e-05,0.000141,-0.000423,-0.000131,-6.3e-05,0.00019,0.000333,-0.000105,-0.000181,8.6e-05,-0.000177,-0.00029,-0.00017,0.000123,4.7e-05,-0.000135,0.000184,2.8e-05,-0.000129,-0.000112,5.9e-05,0.000149
-6.3e-05,-0.000511,-0.000214,-0.000204,-0.000302,0.000102,-0.000256,0.000435,0.000605,0.000653,-0.000499,0.000884,0.000482,0.001114,-0.000827,-0.001819,-0.00016,0.001252,5.8e-05,0.001008,-0.001663,-0.001711,0.000367,-0.002965,-0.002582,-7e-05,0.000372,-0.001178,0.001066,0.004053,0.002149,0.002647,-0.001633,-0.000349,0.00069,-0.000481,0.000757,0.001271,-0.000614,0.002551,0.004055,0.00084,-0.002489,-0.000594,-0.001584,0.000335,0.002207,0.003085,-0.001679,0.000946,0.002032,-0.000534,0.002457,6.5e-05,0.00013,0.000808,0.000219,0.000286,0.001146,-0.000974,-0.001427,0.000731,-0.000122,0.000504,-0.000968,-0.000942,-4.2e-05,-0.000314,-0.000259,-0.000165,-0.001118,-0.000597,0.000301,-0.000384,-0.000532,-0.00047,-5.7e-05,-9.6e-05,-0.000505,0.000124,-0.000425,0.000602,-2.5e-05,6e-06,0.000133,-7e-05,7.8e-05,-0.000542,-3.7e-05,-0.000104,-8.2e-05,0.000167,-0.000427,-0.000499,-0.000311,0.000252,-0.000417,-0.000169,0.000215,-0.000102,9.1e-05,1.6e-05,7.3e-05,0.000175,-4.4e-05,-7.8e-05,0.000289,0.000235,0.000289,0.000258,0.000233,0.000192,3.3e-05,4.1e-05,5.7e-05,0.000112,0.000228,0.000153,0.000221,-1e-04,-0.00041
0.000113,-0.000128,-6.2e-05,8.6e-05,-6.4e-05,-0.000316,0.000202,-0.000275,-1.5e-05,-0.000349,0.000245,6.6e-05,0.000648,-0.000135,0.000383,0.000659,0.001507,-0.000294,0.000555,-2.1e-05,0.000655,0.000735,-0.003474,-0.000771,-0.000768,0.000568,-0.001977,-0.001051,-0.000224,-0.002616,-0.002826,0.000202,-0.000459,-0.000956,-0.000153,0.000551,0.001086,-0.000314,0.000396,-0.001536,-0.00142,-0.002462,-0.001315,-0.001593,0.000856,0.001626,-0.000451,-0.002511,-1.3e-05,-0.000933,-0.000743,0.000847,-0.00096,0.000996,-0.00056,-0.001211,0.000841,-0.000111,0.000397,-0.000831,-0.001352,-0.000662,-0.00152,-0.000231,0.00022,-0.000726,0.000143,-0.000157,-7e-06,-2e-05,0.001344,0.00041,3e-05,0.000474,0.000714,5.4e-05,1.3e-05,-8.5e-05,0.000306,0.000242,-0.000146,-0.001112,-0.000314,0.000379,-3.4e-05,-0.000183,-3.6e-05,1e-04,-0.000216,-0.000229,-0.00023,-0.000223,2.4e-05,0.000365,1.5e-05,-7.8e-05,0.000121,6.5e-05,7.1e-05,-1.7e-05,-2.4e-05,-2.9e-05,-0.000243,3.8e-05,-5.3e-05,-9.8e-05,5.6e-05,0.000112,-0.00019,-0.000266,-0.000177,-8e-06,-3.2e-05,3e-05,-7.5e-05,-2.3e-05,-9.1e-05,-7.2e-05,-9.2e-05,5.5e-05,0.000144
-8e-06,0.000309,0.000155,-5.1e-05,-6e-06,0.000116,-0.000212,-0.00072,-0.000766,-2.2e-05,7.4e-05,-0.000466,-0.000744,-5e-06,-0.000936,-0.000489,-0.00155,0.000465,-0.00203,-0.000376,0.000769,0.000961,-0.000339,-0.000645,-9e-06,0.000461,-0.000344,0.002449,-0.00033,-0.001233,0.001035,-0.001318,0.001116,-0.000319,-0.001061,-0.002512,0.00018,-0.001045,-0.000663,0.001819,-0.00088,0.001081,-0.000313,0.000496,-2.7e-05,-0.000338,-1.4e-05,0.00019,-0.001181,-0.000816,-0.000489,-0.000148,0.000744,-0.000205,0.000193,0.000895,-1.3e-05,0.001805,-0.001464,0.000952,0.002572,2.9e-05,0.001153,0.001276,-8e-06,0.000629,-0.000913,-0.001244,-0.000628,0.000748,-0.000311,-0.000762,-0.001103,-0.000231,-0.000407,-0.000514,0.000234,0.000424,-0.00032,-0.000268,0.000464,0.00035,0.00027,-0.000495,-8.6e-05,0.000127,-0.000273,0.000218,0.000334,0.000165,-1.4e-05,0.00017,7.5e-05,-6.4e-05,4.6e-05,-0.000165,-7e-05,-0.000117,-7.5e-05,-2.9e-05,1.8e-05,9.3e-05,0.000262,0.000326,0.000123,-8.2e-05,4.7e-05,-0.000116,7.7e-05,9.6e-05,6.4e-05,-9.5e-05,-9e-06,2.2e-05,2.7e-05,-0.000124,0.000229,-0.000138,-2e-05,-5.6e-05,-0.00023
-4.7e-05,-7.7e-05,-0.000314,-0.000368,3.5e-05,0.00019,0.000189,0.000165,0.000181,-0.000168,0.000198,0.000149,0.000184,-0.000164,0.001152,8.3e-05,-0.000527,-0.001084,0.000777,-0.000135,0.001002,-0.001268,0.000318,-6.8e-05,-0.000451,0.000758,0.000721,0.000877,0.000317,0.001946,-0.000828,0.000477,0.000551,-0.000296,0.000861,0.001607,-0.000572,0.001123,0.000141,-0.00012,0.000263,-0.001774,0.000499,0.000825,-0.000783,0.000256,0.000572,0.000226,0.0012,0.00098,0.000754,-0.001645,-0.000722,-0.000979,0.000419,0.000205,-0.000314,-0.000266,0.00105,-0.00012,-0.001021,-0.000448,-0.00055,-0.0014,-0.000203,-0.000267,-0.000527,0.001152,0.00047,-0.000635,-0.000612,0.000992,0.000927,0.000102,0.000178,0.000217,0.000274,-0.000342,-7.2e-05,0.000192,-0.000135,-0.000553,-0.000279,0.000462,0.000231,0.000248,0.000307,-0.000231,0.000232,2e-04,0.000171,1.1e-05,4.3e-05,-0.000107,9.7e-05,0.000283,5.1e-05,0.000137,3.9e-05,0.000186,-8.6e-05,0.00015,5.3e-05,-0.000247,-7.2e-05,-0.000101,-5.6e-05,7.2e-05,-4.2e-05,0.000148,-3.9e-05,-9.4e-05,-3.9e-05,-0.00014,-3.4e-05,8.3e-05,5.7e-05,0.000124,6e-05,-5.5e-05,3.5e-05
4.2e-05,-2.2e-05,0.000144,0.000294,7.7e-05,-8.6e-05,-0.000165,-3.9e-05,3.2e-05,4e-05,0.000271,0.000164,0.000473,0.000409,-0.000881,0.000627,0.000479,-0.000246,-0.001007,0.000496,-0.000139,0.001055,0.001196,-0.000115,0.000408,0.000317,0.000251,-0.000746,0.000135,-0.000336,0.000877,-0.000657,-0.001615,-0.000216,-0.000848,-0.000543,-0.000414,-0.000449,-0.000314,0.000182,0.000127,0.002318,-0.000373,-0.000281,0.000669,-0.000457,0.00116,0.000656,-0.000462,-8e-04,0.000404,0.000495,-0.000128,0.001179,-0.001,-4.1e-05,1e-05,-0.000881,-0.000746,-0.000392,0.000375,0.001598,0.000155,-2.2e-05,0.000896,0.000115,0.000905,-0.000248,-0.000217,-7.5e-05,0.000233,-0.000859,-6.8e-05,-0.000114,-0.000849,-0.000427,-0.000225,1e-05,0.000336,0.000291,-0.000385,-0.000101,8.1e-05,6.2e-05,-0.000191,-0.000137,-5.6e-05,0.000182,-0.000328,-0.000217,-0.000248,-0.000237,0.000115,9.2e-05,-0.000284,1.7e-05,4.3e-05,0.000145,2e-05,1e-06,-1.4e-05,-0.000137,8e-06,5e-05,-2e-06,8.4e-05,-9e-05,-0.000107,7e-06,-6.7e-05,-5e-05,7.2e-05,7.3e-05,7.5e-05,1.8e-05,-8.8e-05,-0.000174,-0.000121,-4.4e-05,-7.9e-05,5e-06
1.1e-05,1.3e-05,7.7e-05,-0.000161,-9.5e-05,-7.4e-05,1.2e-05,4.2e-05,0.000201,0.000248,0.00036,-0.000169,-0.000453,-0.000396,0.000263,-0.000211,-2e-05,0.000318,0.001154,-0.000303,-0.000151,-0.000838,-0.000278,-0.000692,-0.000839,-0.000763,-0.000401,-0.000743,-0.000289,-0.000514,-0.000696,-0.000179,0.000852,0.000899,0.000879,-1.7e-05,0.000532,2.9e-05,-6e-04,0.000697,-0.000448,0.000139,0.000605,0.001168,-0.000791,-0.000137,-0.000926,-0.000434,0.000388,1.6e-05,-0.000727,0.000156,0.000274,-0.001022,6.9e-05,0.000202,-0.000348,0.000501,0.000427,-0.000166,-1.7e-05,-0.000356,0.00028,-0.000154,-0.000426,-5.4e-05,-0.000259,0.000313,-0.000311,0.000459,7.2e-05,0.000424,0.000116,0.000295,0.000232,0.000343,6e-06,-8.3e-05,7.7e-05,-0.000306,-3.5e-05,0.000143,0.000318,0.000137,0.000297,2.4e-05,-4e-06,0.000133,0.000238,4.9e-05,9.7e-05,4.6e-05,-0.000172,-1.1e-05,9.9e-05,-0.000108,-7.7e-05,-9.9e-05,5.4e-05,-4.6e-05,0.00017,0.000116,5.1e-05,6.6e-05,7.5e-05,7.3e-05,0.000192,1.4e-05,-5.3e-05,1.6e-05,8.9e-05,-2.4e-05,2.5e-05,2.8e-05,2e-06,3.3e-05,2.6e-05,1.3e-05,2e-06,6.1e-05,0
7e-06,-6.7e-05,-4e-06,3e-06,-1.2e-05,-3.6e-05,0.000108,2.2e-05,-0.000214,-0.000182,-7.5e-05,0.000339,-1e-05,0.000267,0.000446,4e-04,-8e-06,-0.000298,-0.00027,3.5e-05,0.000263,-0.000678,-0.000233,0.000302,0.000524,-0.000555,-0.000421,6.6e-05,0.000581,0.000379,0.000601,3e-04,-0.000389,4.2e-05,-0.000281,-0.000121,-0.000559,-0.000566,0.000619,-0.001455,0.000108,-8e-04,-0.000373,0.000656,0.000781,-0.000785,7e-06,-0.000124,-0.000208,-1.8e-05,0.000363,-0.000318,6e-05,0.000621,-0.000403,-0.000125,-1e-04,0.000421,-8.1e-05,-5.2e-05,-0.000593,-0.000763,-0.000284,0.000316,0.00053,8.1e-05,-0.000363,-1.1e-05,2.5e-05,-0.000239,-0.000113,-0.000257,-0.000326,-0.000334,8.3e-05,5.9e-05,-0.000172,6.3e-05,-0.000309,-2e-05,0.000134,-0.000346,-0.000146,-0.000239,-0.000363,4.4e-05,0.000197,-0.000251,-3.5e-05,0.000111,-1.7e-05,-1.1e-05,0.000105,0.000177,-2.9e-05,-4.9e-05,-8.6e-05,-6e-05,6.3e-05,1.9e-05,-8.7e-05,-6e-05,-5.9e-05,-0.000143,5.8e-05,-9e-06,-0.00016,-1e-06,5.8e-05,1.7e-05,1.9e-05,8.3e-05,-3e-05,-0.000117,-2.1e-05,-4.8e-05,3.5e-05,1e-06,-2.2e-05,-3.6e-05,-7e-06
-5.8e-05,-0.000121,-1.8e-05,-7e-06,0.000169,3.8e-05,-0.000106,-6e-06,0.000109,2.2e-05,0.000114,-0.000269,-6.6e-05,-0.000163,-0.000226,-0.000266,-0.000442,0.000447,0.000601,8.3e-05,-0.000101,-0.000453,0.000757,0.000686,-0.000242,1.7e-05,0.000243,-3e-06,-0.000542,-6.1e-05,-0.000355,-0.000442,-0.000389,-0.000551,0.001017,0.000503,0.000926,0.000715,-0.000132,0.000504,6.9e-05,8.4e-05,0.000398,-0.000423,0.000688,3.4e-05,-0.000758,0.000549,0.000262,0.000137,-0.000113,0.000407,7.1e-05,-4.5e-05,0.000618,7.4e-05,3e-06,-0.000207,-0.000227,-0.000346,-0.000186,0.000387,0.000372,0.00058,-0.000749,1.3e-05,0.000131,-0.000134,0.000151,-6.8e-05,7.3e-05,1.4e-05,0.000222,0.000194,8.9e-05,-0.000183,-2.9e-05,-8.4e-05,0.000174,-3e-06,-1e-06,0.000209,5e-06,0.000255,0.000222,8.8e-05,-0.000312,-1.1e-05,-8.2e-05,-1.1e-05,5.2e-05,2e-06,3e-06,3.1e-05,9.3e-05,-0.000114,1.7e-05,6e-06,-0.000147,-9.1e-05,-0.000148,-5e-05,2.8e-05,-2.6e-05,-2.3e-05,4.1e-05,8e-06,4.4e-05,8e-06,-6.6e-05,2.9e-05,0,-2.1e-05,2.7e-05,-5.1e-05,1.4e-05,-2.5e-05,-8.1e-05,0,-2.8e-05,-1.2e-05
-2.4e-05,0.000117,-4.4e-05,5.1e-05,-0.000101,-1e-06,1.8e-05,1.6e-05,-0.000164,6.4e-05,-9.5e-05,0.000218,6.2e-05,0.00014,0.000221,1.7e-05,0.000189,-7.2e-05,-0.000256,-6.4e-05,0.00028,0.000178,-0.00067,-0.000422,0.000558,-0.00057,-7.7e-05,0.000264,0.000154,0.000105,0.000184,0.000242,0.000555,-0.000427,0.00022,-0.000173,-0.00109,-1.8e-05,-0.000243,-2.7e-05,0.000428,-0.000448,-0.000326,-6.9e-05,-0.000472,7.5e-05,0.000268,-0.000372,-0.000487,0.000204,0.000268,-3.8e-05,-0.000279,-0.000336,-0.000255,-0.00017,0.000724,4.9e-05,0.000368,0.000125,0.000275,0.000285,-0.000308,-0.000742,0.000138,-2.9e-05,0.000188,9.3e-05,0.000281,0.000108,0.000174,3.7e-05,7e-05,5.6e-05,-1.4e-05,0.000132,-5.3e-05,1.3e-05,-1.9e-05,-1.4e-05,7.2e-05,4.1e-05,-3.1e-05,8.7e-05,4.9e-05,-6e-05,0.000162,0.000151,9.4e-05,3.1e-05,-4.8e-05,8.9e-05,-5.9e-05,-4.3e-05,3.4e-05,-1.7e-05,4.1e-05,-2.7e-05,5.2e-05,8.3e-05,8.1e-05,5.6e-05,-4.9e-05,-4.6e-05,-6.6e-05,-2.1e-05,-3.7e-05,-4e-06,-2.1e-05,7e-06,-2e-06,4.6e-05,-2e-06,-2.4e-05,8e-06,-1.4e-05,1.5e-05,1.9e-05,-1.1e-05,7e-06,-1.5e-05
1.3e-05,-4.6e-05,-2e-06,-4.2e-05,2.7e-05,2e-06,9.1e-05,-7.8e-05,0.00012,-2.6e-05,3e-05,-0.000126,-7.4e-05,-5.3e-05,2.1e-05,1.9e-05,0.000261,-0.000166,-0.000105,0.000121,-7e-06,9.2e-05,-0.000339,0.000107,-0.000551,0.000274,-0.000191,-9.7e-05,-6e-05,-2.5e-05,0.000434,-0.000195,0.000187,0.000488,0.000378,0.000228,2.1e-05,-8.3e-05,5e-06,0.000184,9.4e-05,0.00045,-7.8e-05,0.000427,-9.4e-05,0.000196,-4.5e-05,0.000148,0.000638,-9.7e-05,0.000384,-0.000303,-0.000168,6.4e-05,-7.5e-05,5.6e-05,-0.000171,-0.000101,2.5e-05,0.000529,4.2e-05,5.9e-05,0.00011,0.000364,0.000291,0.000143,-1.2e-05,-0.000142,-0.000257,-7.2e-05,-0.000167,1.4e-05,-4.5e-05,-9.8e-05,6.5e-05,-4.5e-05,0.000137,-5.5e-05,4.8e-05,-7e-06,2.3e-05,7.5e-05,-2.7e-05,-2e-04,-0.000103,1.2e-05,-2.3e-05,-0.000104,-4.3e-05,2.3e-05,7.2e-05,-5.9e-05,1e-06,2.9e-05,-6e-06,4.6e-05,2.7e-05,4.5e-05,-4.2e-05,-2.9e-05,2.7e-05,-5.9e-05,3.6e-05,-6e-06,5.7e-05,-2.9e-05,-3.3e-05,5.1e-05,-6e-06,9e-06,-1e-05,0,-5e-06,2.7e-05,-2e-06,1.5e-05,-2.8e-05,5e-06,1.4e-05,5e-06,9e-06
-5e-06,1.6e-05,1.4e-05,2.7e-05,2e-05,1.8e-05,-5e-05,2e-06,-2e-05,-2.2e-05,-5.6e-05,8.4e-05,1.5e-05,0.000113,-8.5e-05,1.5e-05,3e-05,1.6e-05,-5e-05,-0.00016,1.4e-05,0,0.00014,2.2e-05,0.000251,-0.000451,-1e-06,9.9e-05,-7.7e-05,0.00039,-0.000348,5.1e-05,-0.000348,-7e-05,0.000152,-7.8e-05,0.000288,0.000114,0.000104,-0.000111,-5.7e-05,0.000219,0.000384,-0.000247,1.6e-05,0.000119,3.8e-05,-0.000242,-0.000368,-0.000142,-0.000275,2e-05,0.000108,-4.6e-05,0.000702,-0.000259,-0.000443,-5.5e-05,2.6e-05,-0.000474,-0.000148,-0.000126,0.000105,-0.000144,-0.000168,-8.7e-05,-8.3e-05,9.3e-05,7.1e-05,-7e-06,-0.00018,2.6e-05,-0.000126,1.1e-05,-0.00016,2e-06,7e-06,6.6e-05,4e-05,-4.5e-05,-2.3e-05,-6.4e-05,-3.4e-05,-4.5e-05,3.5e-05,-4.9e-05,1.5e-05,0.000104,-4.1e-05,1.3e-05,-1.9e-05,3.6e-05,4.1e-05,-4.5e-05,-1e-06,-3.3e-05,-1.4e-05,-3.7e-05,6.9e-05,3.8e-05,-7.7e-05,2.2e-05,7e-06,6.4e-05,-3.6e-05,-1.2e-05,3.7e-05,-6.3e-05,1.5e-05,-1e-06,3e-06,-2.8e-05,-3e-06,-9e-06,4e-06,-1.1e-05,-4.3e-05,-8e-06,0,-9e-06,2.3e-05
-7e-06,-1.7e-05,2.3e-05,1.2e-05,4e-06,0,1.2e-05,5e-06,-3.3e-05,-1.5e-05,-3.7e-05,6.8e-05,-6.9e-05,-9.3e-05,0.000178,-4e-05,-0.000219,-9e-06,9e-05,3.2e-05,-0.000154,2.8e-05,-3.2e-05,-0.000204,-7.3e-05,0.00024,0.000189,-0.000105,2.7e-05,0.000142,5.6e-05,0.00025,5.1e-05,-5.4e-05,-0.000209,0.000229,-0.000352,0.000109,-0.000167,-0.000164,7.8e-05,-0.00015,0.000162,0.000183,-0.000151,-0.000122,0.000177,0.000193,0.000165,0.000115,0.000215,0.00013,0.000107,-3.1e-05,-0.00052,-0.000119,6e-06,0.000128,-0.000121,7.2e-05,0.000225,-0.000133,-7.8e-05,-4e-06,-6.1e-05,-4.7e-05,-0.000136,-3.8e-05,-1.5e-05,0.00011,0.000101,8.1e-05,1.1e-05,-2.4e-05,0.000122,-2.1e-05,-2.7e-05,-6.2e-05,-4.9e-05,5.8e-05,-1e-05,2e-06,6.7e-05,1.7e-05,-4.5e-05,-4.4e-05,1.2e-05,1.1e-05,-4e-06,7e-06,3.6e-05,-3e-06,-7e-06,7.3e-05,2e-05,3.3e-05,2e-06,1.9e-05,-1.2e-05,-3.3e-05,6.1e-05,-2.6e-05,-3e-06,-1e-06,3e-06,1.1e-05,-2.1e-05,3.5e-05,4e-06,-1.6e-05,2e-06,8e-06,1.3e-05,-1e-06,2e-06,5e-06,3.4e-05,0,-2e-06,-1e-05,-6e-06
6e-06,-1.3e-05,-1.5e-05,-3.9e-05,5e-06,-9e-06,5e-06,1.3e-05,2.2e-05,9e-06,-9.9e-05,-4.8e-05,-1.6e-05,-1.2e-05,-0.000112,3.8e-05,-6e-05,0.00013,3e-06,5.4e-05,-1e-05,2e-04,-3.1e-05,0.000152,-5.1e-05,-0.000192,4.8e-05,0.000141,-5.4e-05,-0.00028,-3.4e-05,-0.000133,0.000314,0.000285,2.4e-05,-0.000249,0.000321,2.5e-05,0.000372,0.000165,-6.3e-05,8.8e-05,7.6e-05,1e-05,5.4e-05,1.2e-05,-0.000145,-9.1e-05,-0.000172,-0.000102,-8.8e-05,2.3e-05,-0.000187,-0.000209,5.3e-05,4.6e-05,0.000102,0.000129,0.000156,-0.000123,-0.000229,4.1e-05,6.8e-05,9.8e-05,0.000112,-1e-04,0.00015,8.7e-05,0.000105,-0.000152,-9.6e-05,-0.00015,-1.2e-05,2.2e-05,2e-05,-6.7e-05,2.6e-05,2.5e-05,4.4e-05,-2.5e-05,1e-05,-3.8e-05,-3e-05,4.3e-05,5.5e-05,1.6e-05,-7.5e-05,-6e-05,4.2e-05,-1.7e-05,-7e-06,7e-06,7e-06,-3.5e-05,4e-06,2.8e-05,-3.7e-05,-1.1e-05,-8e-06,2.1e-05,-1.2e-05,2.3e-05,1.5e-05,-1.9e-05,5e-06,8e-06,2.6e-05,-4e-06,-3.4e-05,2e-06,6e-06,0,7e-06,4e-06,-1.1e-05,-6e-06,-4e-06,-1.7e-05,-7e-06,-8e-06,6e-06
1.1e-05,0,-1e-06,2.8e-05,-1.2e-05,8e-06,-4.4e-05,-1.4e-05,7e-06,2e-06,1.9e-05,3.6e-05,8.1e-05,3.7e-05,6.5e-05,-9.8e-05,0.000156,-7.8e-05,8.1e-05,-4.4e-05,-4e-06,-1.5e-05,0.000156,-1e-06,-6.6e-05,0.00011,-0.000144,-0.000258,2.4e-05,-3e-06,0.000317,0.000157,-0.000231,-0.000112,4.1e-05,7e-06,-9.4e-05,-3e-05,5.4e-05,-0.000243,-6.4e-05,-9.4e-05,5e-06,-0.000149,0.000248,5e-06,8.9e-05,-5.7e-05,-4.4e-05,-1.5e-05,3e-06,-0.000125,-2.9e-05,0.000174,-6e-06,-4.7e-05,3e-05,5.5e-05,-0.000182,0.000156,6.4e-05,-1.4e-05,-9.4e-05,0.000127,-0.000148,-2.6e-05,2.3e-05,-2.1e-05,-9.4e-05,-0.000107,-2e-06,0.00015,3.4e-05,5e-06,3.3e-05,5.3e-05,-5.7e-05,2.9e-05,3.5e-05,2e-06,7e-06,-1.7e-05,3.6e-05,-3e-05,7e-06,-1.7e-05,4e-05,-4.3e-05,-1.5e-05,9e-06,6e-06,1e-06,-3e-06,1.9e-05,-1e-06,9e-06,5e-06,-8e-06,-1e-06,2e-06,-3.5e-05,3e-06,-1.6e-05,4e-06,4e-06,-1e-06,-1.4e-05,-1e-05,3e-06,-4e-06,-1.1e-05,5e-06,-5e-06,3e-06,3e-06,1.4e-05,7e-06,8e-06,-5e-06,-3e-06,-1.3e-05
-2e-06,-1.4e-05,4e-06,-1.4e-05,2.2e-05,1.2e-05,2.1e-05,-6e-06,7e-06,1.2e-05,-2.2e-05,-1.1e-05,-5.1e-05,-4e-05,-5e-06,8.1e-05,-3.3e-05,2.4e-05,-2.2e-05,-3.7e-05,2.3e-05,4.3e-05,0.000149,0.000242,0.000281,0.000129,2.4e-05,-6.7e-05,1.2e-05,0.000165,-0.000377,-0.000259,-6.1e-05,2.1e-05,9.3e-05,-0.000132,-7.5e-05,-0.000146,-0.000172,0.000243,-8e-06,-3e-06,-0.000185,0.000179,2.5e-05,7.9e-05,-3e-06,0.000124,5.8e-05,0.000126,3e-05,0.000107,-4.1e-05,-8.1e-05,-2.5e-05,-4.3e-05,3e-06,-0.000182,9.1e-05,-6.5e-05,3.6e-05,-7.9e-05,0.000114,-0.000146,3.2e-05,8.5e-05,-7.4e-05,0,7e-05,8e-05,9.1e-05,-0.000121,6e-06,5e-06,-7.1e-05,9e-06,-8e-06,-9e-06,-1.8e-05,-1.1e-05,8e-06,5.7e-05,3.7e-05,-4.8e-05,-2.9e-05,1.7e-05,-3e-06,6.1e-05,-2.5e-05,2e-06,0,-2e-06,4e-06,-1.4e-05,-8e-06,-5e-06,6e-06,-3e-06,2e-05,-2.6e-05,2.7e-05,-3.2e-05,1.3e-05,-1.4e-05,-1.1e-05,1.1e-05,2.1e-05,4e-06,6e-06,3e-06,4e-06,-5e-06,2e-06,4e-06,-1.8e-05,-1.7e-05,-2.6e-05,-1.1e-05,4e-06,0,-3e-06
2e-06,4.7e-05,-1e-06,0,-1.2e-05,-1e-06,-2e-06,-2e-06,-1.9e-05,-3e-06,-3.4e-05,9e-06,5e-06,3.7e-05,-5.4e-05,-2.6e-05,-0.000165,-9e-06,1.4e-05,2e-05,-1e-04,0.000112,-9.4e-05,-7.3e-05,-0.000179,6.6e-05,4.6e-05,-0.000123,7.8e-05,-2.1e-05,9.8e-05,8.7e-05,0.000214,1.8e-05,3.9e-05,0.000155,8.4e-05,0.000114,5.7e-05,-0.000142,-5.7e-05,0.000165,-0.000152,1.5e-05,-0.000278,9.7e-05,2.4e-05,-0.000116,4.2e-05,-9e-05,-0.000105,-1.1e-05,0.000137,-1.7e-05,-5.4e-05,6e-06,6.2e-05,2e-05,-8.8e-05,7.6e-05,7e-06,-4.1e-05,-4.7e-05,-7.2e-05,5.2e-05,2e-06,1.5e-05,-4.8e-05,-4.8e-05,-2.6e-05,-4.9e-05,4.6e-05,-2.5e-05,-1.3e-05,3.6e-05,-1.6e-05,2e-05,2.1e-05,-2.6e-05,3.4e-05,-4.9e-05,-5.9e-05,-4.5e-05,6.5e-05,1e-05,1e-05,-2.4e-05,-2.8e-05,1.4e-05,4e-06,-2.4e-05,-1.1e-05,-7e-06,1.1e-05,-1.6e-05,-4.8e-05,1.3e-05,6e-06,-1e-05,3.5e-05,-4e-06,1.9e-05,-4e-06,-1.4e-05,2e-06,5e-06,7e-06,-1.7e-05,1e-05,2e-06,3e-06,6e-06,4e-06,-5e-06,1e-06,9e-06,1.1e-05,-5e-06,-2e-06,3e-06,-2e-06
5e-06,-4e-05,-4e-06,-1.4e-05,1e-05,-1.4e-05,-1.1e-05,0,-1.2e-05,-2e-05,-2e-06,1.4e-05,5e-06,-4.7e-05,1.1e-05,-7.6e-05,3e-06,-2.9e-05,1.5e-05,-2.8e-05,2.1e-05,2.7e-05,-0.000162,-0.000146,0.000201,-0.000122,3.9e-05,0.000236,-7.3e-05,-8.9e-05,-6.1e-05,-2e-06,-0.000146,-7.7e-05,2.6e-05,-0.000111,-5.1e-05,-2.1e-05,5e-05,7e-05,-3.5e-05,-0.000115,5.1e-05,-0.00015,-8e-05,-6.7e-05,-3e-05,9e-05,-2e-05,2.5e-05,6e-06,0.000102,-9.4e-05,-6.1e-05,-5.5e-05,1e-05,3.9e-05,9.4e-05,1e-05,4.3e-05,-8.7e-05,7.7e-05,-7e-06,5.1e-05,-8.8e-05,6.8e-05,-4.4e-05,2.1e-05,3.2e-05,1e-05,9e-06,-4.7e-05,-4e-06,-8e-06,-1.8e-05,1.5e-05,-1e-06,-1e-05,1e-05,-1.3e-05,1.6e-05,3.3e-05,-1.9e-05,-4.5e-05,-2.5e-05,-2.8e-05,3e-06,-7e-06,-2e-05,2.1e-05,-3e-06,-2e-06,-1e-06,-2e-06,3e-06,-1.7e-05,-6e-06,2e-06,4e-06,0,-1.4e-05,-1.6e-05,7e-06,1e-05,0,-5e-06,-1.9e-05,-4e-06,-2.4e-05,2e-06,3e-06,6e-06,2e-06,3e-06,-1e-06,-1.1e-05,2e-06,9e-06,-2e-06,-5e-06,5e-06
-1e-06,2.1e-05,-4e-06,2.9e-05,-7e-06,-2e-06,1.7e-05,-1.2e-05,1.8e-05,2e-05,-1.3e-05,7e-06,1e-06,4.3e-05,-3.4e-05,4.3e-05,7.7e-05,3.4e-05,-4.2e-05,8.2e-05,-2.9e-05,-3.8e-05,0.000135,0.000136,-0.000131,-3e-06,-4.6e-05,7.9e-05,-2.9e-05,1.2e-05,6.5e-05,-3.6e-05,-7.6e-05,8.6e-05,2.9e-05,0.000104,2.2e-05,-1.5e-05,-0.000131,-2e-05,1.6e-05,-7.8e-05,-1.2e-05,7e-06,-6.7e-05,-4e-06,7.4e-05,-0.000109,5e-05,-4.2e-05,0.000122,2e-06,7.3e-05,9.9e-05,6.4e-05,6e-06,-0.000125,-2.2e-05,-3.8e-05,-5.9e-05,8.3e-05,-3.7e-05,5e-06,-8.4e-05,8.4e-05,-5.7e-05,-1e-06,-2.1e-05,-4.4e-05,3.3e-05,4.5e-05,2.3e-05,2.8e-05,1.3e-05,1e-06,2.3e-05,2.2e-05,9e-06,-5e-06,3e-06,-5e-06,4e-06,6e-06,3e-05,1.7e-05,-1.6e-05,-5e-06,4.7e-05,2.6e-05,1.2e-05,7e-06,-8e-06,7e-06,4e-06,-2e-06,3.3e-05,6e-06,-2e-06,-1.6e-05,-1.2e-05,2e-06,7e-06,1e-06,-1.6e-05,-1e-05,-8e-06,2.3e-05,5e-06,2.3e-05,-1e-06,-2e-06,1e-06,-3e-06,5e-06,2e-06,7e-06,1e-05,-1e-05,0,-1e-06,-4e-06
-1e-06,-1.5e-05,4e-06,-1.9e-05,5e-06,7e-06,-6e-06,5e-06,-8e-06,-5e-06,-8e-06,-6e-06,1.1e-05,-4e-06,-5e-06,-3e-06,2.8e-05,4.8e-05,9e-06,-0.000108,-9e-06,-2e-06,-0.000113,-0.000135,-6.2e-05,-0.00015,-5.2e-05,4.1e-05,-3e-05,5e-05,-1.5e-05,8.5e-05,0.000156,1.5e-05,-1.8e-05,-1.4e-05,2.4e-05,-4.3e-05,4.8e-05,-7.1e-05,3.2e-05,0.000109,7.2e-05,6.1e-05,0.000138,-2.5e-05,2.9e-05,6.9e-05,-2.7e-05,5.7e-05,-9.2e-05,-2.8e-05,-6.6e-05,-5.8e-05,1e-05,3.7e-05,-2e-06,3.4e-05,6.9e-05,-2.2e-05,-7.9e-05,-3.9e-05,1e-06,9.2e-05,-4e-06,4.3e-05,1.3e-05,-3.6e-05,6.1e-05,-3.1e-05,-4.4e-05,-1.1e-05,1.6e-05,-4e-06,-1e-06,-2.4e-05,-6e-06,-3.2e-05,4e-05,-3e-06,-2.7e-05,2.5e-05,-1.1e-05,-5.8e-05,-5e-06,5e-06,3.2e-05,-2.6e-05,-8e-06,-9e-06,1.7e-05,4e-06,-6e-06,1e-05,1e-05,2e-06,6e-06,-8e-06,7e-06,1.1e-05,1e-05,7e-06,0,9e-06,8e-06,-3e-06,-1.3e-05,0,-7e-06,-3e-06,4e-06,2e-06,2e-06,-4e-06,-2e-06,-5e-06,-7e-06,1e-06,1e-06,5e-06,7e-06
-3e-06,-9e-06,6e-06,-5e-06,0,0,-6e-06,-1e-06,6e-06,-1.2e-05,-2.7e-05,1.2e-05,1.2e-05,-6e-06,1.6e-05,-1.3e-05,3e-05,-1.3e-05,-1.6e-05,1.6e-05,8e-06,-4.5e-05,-2.9e-05,-0.000101,0.00013,-6.5e-05,3.6e-05,-0.000188,4.8e-05,-1e-06,9e-06,-5.9e-05,-3.2e-05,-1.4e-05,2.9e-05,0.000107,-3.8e-05,4.3e-05,4.9e-05,9.3e-05,3.9e-05,-8.7e-05,1.1e-05,6e-06,7.9e-05,-5.5e-05,-3.5e-05,0,-2.1e-05,-2.7e-05,-7.5e-05,-1.2e-05,3.5e-05,2e-05,-1e-05,-4e-06,4.1e-05,-3.9e-05,-1.4e-05,5e-05,4.2e-05,-1.5e-05,-1e-05,-0.000105,-5.1e-05,-2.7e-05,-4.8e-05,-1e-06,-2e-05,-5.5e-05,-1.2e-05,3e-06,-2.2e-05,-3e-06,3e-06,1.2e-05,-1.5e-05,2.4e-05,-3.4e-05,1.1e-05,9e-06,-2.1e-05,-6e-06,1.5e-05,-1e-06,-6e-06,-3e-05,-1.7e-05,1.7e-05,6e-06,-1.8e-05,-4e-06,-5e-06,-1.5e-05,-1.3e-05,-1e-06,-2.1e-05,-4e-06,5e-06,-1.6e-05,-1.3e-05,-1.2e-05,4e-06,-1e-06,-9e-06,3e-06,6e-06,1e-06,-2e-06,0,-3e-06,-7e-06,-1e-06,-3e-06,-7e-06,4e-06,-5e-06,-8e-06,2e-06,-4e-06,-2e-06
-2e-06,1.6e-05,1e-06,8e-06,-1e-06,-2e-06,1e-05,1e-06,-6e-06,2e-06,1.2e-05,-1e-05,-2.3e-05,-9e-06,8e-06,6e-06,-6.5e-05,0,9e-06,2.8e-05,2.6e-05,-4.6e-05,0.000106,8.6e-05,-8.5e-05,-2.8e-05,2.4e-05,-3.4e-05,5e-05,-2.1e-05,4e-06,1.4e-05,-9.2e-05,-2.3e-05,-1.3e-05,-0.000142,-4.8e-05,1.6e-05,-6e-05,-0.000101,-7e-06,1.8e-05,2.1e-05,-4e-05,4.2e-05,8e-06,-2e-05,7e-06,-4.4e-05,-1.3e-05,4.8e-05,5.1e-05,-4e-06,6.4e-05,-1.8e-05,1.4e-05,5.7e-05,-4.4e-05,8.9e-05,2.1e-05,5.8e-05,2.3e-05,1.7e-05,2.2e-05,1.6e-05,4.8e-05,2.9e-05,2.2e-05,1.7e-05,5.2e-05,1.7e-05,0,-2.9e-05,3e-06,-4.4e-05,-7e-06,-3e-06,-3e-05,1.1e-05,-5e-06,2.5e-05,-1e-05,1.8e-05,2e-05,1.9e-05,-2.3e-05,9e-06,2e-05,-4e-06,1e-06,1.7e-05,-2e-06,5e-06,9e-06,-1e-06,6e-06,9e-06,2e-06,-9e-06,2e-05,7e-06,1.4e-05,-2e-06,5e-06,5e-06,0,-6e-06,-2e-06,-1e-06,1e-06,-4e-06,1e-06,-2e-06,-2e-06,0,-3e-06,-4e-06,-2e-06,-2e-06,-6e-06,-2e-06
-1e-06,-3e-06,-5e-06,-8e-06,1e-06,4e-06,-7e-06,-4e-06,4e-06,1e-05,1.6e-05,8e-06,2.5e-05,-4e-06,3.6e-05,-2.2e-05,-7e-06,-3.4e-05,7e-06,-3.5e-05,3.8e-05,-9e-06,2.6e-05,9.1e-05,7.7e-05,-2.4e-05,-2.8e-05,-3e-05,-1.6e-05,5e-06,1.8e-05,4.2e-05,8.9e-05,-3e-05,1.5e-05,5.4e-05,9.7e-05,-1.7e-05,-2.6e-05,0.000114,2.1e-05,8.5e-05,-2.7e-05,7e-06,-9.3e-05,2.5e-05,-9e-06,1.1e-05,1e-05,-2.2e-05,1.1e-05,3e-06,6.8e-05,-5.7e-05,3.9e-05,2.8e-05,9e-06,4e-06,-4.8e-05,-2.9e-05,-5.5e-05,0,-6e-06,-5.6e-05,-4e-06,-1.1e-05,1.2e-05,0,-2.6e-05,-1.3e-05,-1.7e-05,2.8e-05,3.1e-05,-9e-06,3.4e-05,0,2e-06,1.5e-05,2e-06,-6e-06,1e-05,1.4e-05,1e-06,-1.5e-05,-1.4e-05,2.6e-05,4e-06,-1.3e-05,-6e-06,-1.1e-05,-4e-06,6e-06,1e-06,-2e-06,8e-06,-2e-06,3e-06,-1e-06,2e-06,-2.2e-05,1e-05,-1.4e-05,4e-06,1e-06,-4e-06,2e-06,-5e-06,-5e-06,5e-06,1e-06,2e-06,-4e-06,-1e-06,4e-06,-7e-06,6e-06,5e-06,6e-06,0,0,0
-1e-06,3e-06,-4e-06,1e-06,3e-06,2e-06,3e-06,0,3e-06,3e-06,1.7e-05,1e-05,-1.3e-05,1.5e-05,-1.4e-05,-1e-06,8.7e-05,-1.2e-05,1.5e-05,2.7e-05,-9e-06,-1.1e-05,-2.1e-05,-2.7e-05,1e-05,1.7e-05,-2.6e-05,0.000138,-7e-06,-1e-06,5.5e-05,-4.2e-05,4.2e-05,-3.1e-05,-2.2e-05,-3.4e-05,-9.4e-05,-4.4e-05,2.7e-05,-8.8e-05,1.3e-05,-8.7e-05,1.8e-05,6.2e-05,-3e-05,-1.6e-05,1.1e-05,-3.6e-05,6.5e-05,3.5e-05,5.6e-05,-4.1e-05,-5e-05,5.7e-05,3e-06,3e-06,-9.5e-05,3.9e-05,5.4e-05,-1.8e-05,1.7e-05,-2e-05,9e-06,1.8e-05,-9e-06,-2.5e-05,-1.1e-05,-1e-05,4e-06,9e-06,-2e-06,-3.5e-05,-1e-06,8e-06,1e-05,1.4e-05,-2e-06,-1.5e-05,1.1e-05,7e-06,-1.1e-05,-3e-06,-2e-05,-1.4e-05,6e-06,1.4e-05,-3e-06,-1.1e-05,8e-06,3e-06,-1e-06,-2e-06,0,0,4e-06,7e-06,-1e-05,3e-06,-3e-06,2.3e-05,-1.2e-05,1e-05,-2e-06,3e-06,1e-06,3e-06,5e-06,1.4e-05,-4e-06,-1e-06,-2e-06,5e-06,0,-2e-06,2e-06,-6e-06,3e-06,-3e-06,0,3e-06,1e-06
-1e-06,-7e-06,1e-06,6e-06,-4e-06,-2e-06,5e-06,-5e-06,-4e-06,-1.1e-05,-8e-06,-1.8e-05,1.1e-05,6e-06,-3e-06,1.1e-05,-1e-06,3.9e-05,-1e-06,-2.7e-05,6e-06,-1.1e-05,-3.5e-05,1.9e-05,-8.5e-05,6e-06,5e-05,1e-05,-2.9e-05,-1.3e-05,-9.9e-05,2.9e-05,-0.000131,1.5e-05,-7e-05,6.6e-05,5.1e-05,4.2e-05,5e-06,4.4e-05,-1.4e-05,7.5e-05,-2.5e-05,-5.4e-05,-5.6e-05,1.1e-05,-5e-06,3.5e-05,-4.7e-05,-3.4e-05,-8e-05,-2.9e-05,-1e-06,-3e-05,-4e-05,3e-06,1.7e-05,-5e-06,-2.3e-05,2.3e-05,-1.8e-05,-6e-06,-2.9e-05,4.5e-05,3.6e-05,-3.6e-05,9e-06,7e-06,5e-06,3.9e-05,2.6e-05,3.5e-05,-2.7e-05,-3e-06,-5e-06,-1.2e-05,1e-05,2.2e-05,-1.4e-05,-2e-06,1.7e-05,-6e-06,1.2e-05,1e-06,-1.3e-05,-1.1e-05,-4e-06,2.7e-05,-1.6e-05,7e-06,-9e-06,4e-06,2e-06,6e-06,4e-06,-1.1e-05,7e-06,1e-06,6e-06,-1.1e-05,-3e-06,1e-06,2e-06,-2e-06,-1e-06,0,-8e-06,-5e-06,-1e-05,2e-06,-6e-06,-1e-06,0,-2e-06,-3e-06,5e-06,-3e-06,4e-06,0,-6e-06,0
2e-06,3e-06,3e-06,3e-06,1e-06,-2e-06,-7e-06,-1e-06,-1e-06,3e-06,1.3e-05,1.4e-05,-5e-06,-1.8e-05,3e-06,-4e-06,-5.8e-05,9e-06,4e-06,-8e-06,1.6e-05,-1.2e-05,6.6e-05,3.7e-05,4.6e-05,1.1e-05,3.4e-05,1.2e-05,9e-06,2.1e-05,5.3e-05,-5.2e-05,9e-05,2e-06,2.4e-05,-9.7e-05,3.4e-05,-4e-06,-3.3e-05,-8e-06,-2.9e-05,-2e-06,5.1e-05,1.4e-05,3.6e-05,-8e-06,1.1e-05,-3.4e-05,3e-06,1.3e-05,-4.5e-05,2e-05,-7e-06,6e-06,5.3e-05,3e-06,1.9e-05,-2.9e-05,-4e-06,-4.4e-05,-1.7e-05,7e-06,3.2e-05,1.7e-05,-1.8e-05,1e-05,-3e-06,-2e-06,1.8e-05,1e-06,-3e-06,-3.2e-05,1.5e-05,-1e-06,8e-06,-3e-06,6e-06,-1.2e-05,8e-06,-1e-06,-9e-06,-1.5e-05,-1.7e-05,1.3e-05,-1e-06,1e-06,1.5e-05,-1e-06,1.8e-05,0,5e-06,-2e-06,-4e-06,-8e-06,-1e-06,-1.3e-05,6e-06,-5e-06,0,2e-06,1.1e-05,-5e-06,-1e-06,1e-06,0,-3e-06,7e-06,4e-06,1.2e-05,-1e-06,2e-06,1e-06,0,2e-06,2e-06,-5e-06,-4e-06,-4e-06,0,-2e-06,0
0,-6e-06,1e-06,-1.2e-05,-3e-06,2e-06,1e-06,-2e-06,-4e-06,0,4e-06,-1.4e-05,-1.4e-05,7e-06,-2.3e-05,9e-06,-1.4e-05,-3e-06,-1.4e-05,2.7e-05,7e-06,8e-06,-5.9e-05,-9.3e-05,-5e-06,8.7e-05,-5.1e-05,-0.000103,3e-06,8e-06,-2.3e-05,1.4e-05,2.9e-05,-1.7e-05,-2.8e-05,6.6e-05,-9.3e-05,-6e-06,2.3e-05,-3.1e-05,-5e-06,-6.5e-05,1e-05,3.2e-05,5.4e-05,-3e-06,-2e-05,1e-06,8e-06,-2.2e-05,7.6e-05,0,4.7e-05,2.3e-05,-1.9e-05,-4e-06,0,-2.3e-05,-3e-05,1.1e-05,7e-06,4e-06,-1.5e-05,-2e-05,-6e-06,-8e-06,1.7e-05,9e-06,-1.6e-05,-2.1e-05,-5e-06,9e-06,-2e-06,0,2e-06,-3e-06,-1e-05,1.8e-05,-1.3e-05,-5e-06,-1.7e-05,1.3e-05,-1.2e-05,-1.9e-05,1.5e-05,1.2e-05,-1.2e-05,-2.1e-05,-1.1e-05,3e-06,-2e-06,2e-06,0,7e-06,-9e-06,1.3e-05,-8e-06,-2e-06,-4e-06,0,-3e-06,8e-06,0,7e-06,-2e-06,-1e-06,-6e-06,-5e-06,-3e-06,3e-06,0,-3e-06,1e-06,1e-06,-2e-06,4e-06,3e-06,-3e-06,-1e-06,0,0
1e-06,4e-06,0,1.9e-05,4e-06,1e-06,-2e-06,-1e-06,5e-06,-1e-06,0,5e-06,2.2e-05,-1e-06,-8e-06,-1.8e-05,5e-05,-3.6e-05,6e-06,-2.2e-05,-3e-06,1e-06,-5.9e-05,-2e-05,-1e-05,2.9e-05,-6e-06,1e-05,1.7e-05,-2.7e-05,3.6e-05,1.7e-05,-9.6e-05,5.6e-05,3.2e-05,-3.1e-05,8.4e-05,-3.2e-05,3.3e-05,5.9e-05,8e-06,2.8e-05,-9e-06,-8.1e-05,4.1e-05,1.2e-05,-8e-06,-1e-06,-2.6e-05,1.4e-05,-2e-05,2e-05,-2.7e-05,-1.8e-05,-1.2e-05,-3e-06,-1e-05,0,-2.5e-05,1.2e-05,5.8e-05,0,2e-06,-4.1e-05,2.3e-05,4.1e-05,6e-06,-1.3e-05,-4e-06,2e-05,1.5e-05,-4e-06,1.1e-05,-1e-06,-7e-06,0,1e-06,-7e-06,1.7e-05,2e-06,1.8e-05,7e-06,1.4e-05,7e-06,-5e-06,1e-06,3e-06,1.9e-05,6e-06,4e-06,7e-06,0,-2e-06,-2e-06,6e-06,1e-05,7e-06,1e-06,-3e-06,-5e-06,-4e-06,-9e-06,1e-06,-6e-06,0,2e-06,4e-06,0,0,1e-06,-3e-06,1e-06,1e-06,0,-4e-06,-5e-06,3e-06,2e-06,1e-06,-2e-06,-1e-06
1e-06,4e-06,0,-9e-06,-2e-06,-3e-06,-5e-06,4e-06,-1e-06,2e-06,-1e-06,6e-06,-2.9e-05,2e-06,3e-06,6e-06,2.3e-05,-1.3e-05,-1.3e-05,9e-06,2.3e-05,1.1e-05,5.9e-05,1.2e-05,6.3e-05,2.8e-05,3.2e-05,-9e-06,-4e-06,3e-06,-6.2e-05,-2.7e-05,4.4e-05,-2.6e-05,-2.9e-05,4e-05,-2.3e-05,1.9e-05,-2.6e-05,-5.5e-05,-1.1e-05,-1e-05,1e-06,7.2e-05,-3.2e-05,2.1e-05,1e-06,1.7e-05,7e-06,-1e-05,1e-06,-2.1e-05,-3e-06,1.4e-05,1e-06,-4e-06,2.5e-05,1.6e-05,-8e-06,0,-5.6e-05,-7e-06,-9e-06,6e-05,-3.4e-05,-2.1e-05,-1.7e-05,1e-06,-1e-06,-2e-06,-1.3e-05,-5e-06,4e-06,3e-06,6e-06,1.2e-05,-6e-06,0,-4e-06,2e-06,2e-06,-2e-06,2e-06,-1e-06,4e-06,-5e-06,-9e-06,-3e-06,5e-06,0,-7e-06,-2e-06,1e-06,3e-06,-2e-06,3e-06,2e-06,1e-06,2e-06,6e-06,4e-06,9e-06,-1e-06,5e-06,0,-1e-06,1e-06,4e-06,-7e-06,-3e-06,3e-06,1e-06,1e-06,0,-2e-06,4e-06,0,-4e-06,0,-1e-06,1e-06
0,-2e-06,1e-06,-8e-06,1e-06,0,4e-06,-5e-06,1e-06,-1e-06,9e-06,-9e-06,2.6e-05,-1e-06,1e-06,1.8e-05,-4e-05,3.3e-05,1.2e-05,4e-06,-6e-06,1.5e-05,3.3e-05,5.2e-05,-9.1e-05,1.9e-05,-1.2e-05,1.6e-05,-3e-06,2.8e-05,2.3e-05,4.8e-05,3.7e-05,-6e-06,8e-06,-8.1e-05,-2.3e-05,4e-06,-6e-06,4.9e-05,-7e-06,-1e-05,-2.6e-05,3e-05,-1.1e-05,-1e-05,-2.3e-05,2e-06,3e-05,-9e-06,-1e-06,-1.7e-05,-1.6e-05,2.4e-05,-6e-06,-5e-06,1.7e-05,0,-1.1e-05,-1e-05,3e-05,3e-06,1.7e-05,-4.3e-05,1.5e-05,1.8e-05,1.1e-05,1.3e-05,1.1e-05,-6e-06,-1.2e-05,7e-06,-1.6e-05,-5e-06,1.1e-05,-5e-06,-2e-06,-1e-06,-9e-06,-3e-06,-2e-05,0,-7e-06,-2e-06,-1.1e-05,8e-06,1.1e-05,-2e-05,-8e-06,0,8e-06,1e-06,3e-06,-1e-06,3e-06,-4e-06,-1.1e-05,3e-06,-1e-06,-3e-06,-2e-06,-3e-06,1e-06,-7e-06,-2e-06,-1e-06,-3e-06,2e-06,1e-05,-1e-06,0,1e-06,0,-1e-06,-4e-06,-4e-06,-1e-06,3e-06,0,0,-2e-06
0,-6e-06,-1e-06,4e-06,-1e-06,1e-06,1e-06,1e-06,-1e-06,3e-06,-9e-06,5e-06,-2.5e-05,-7e-06,2e-06,-1e-05,-2.1e-05,7e-06,-8e-06,-2e-05,5e-06,2e-05,-2.6e-05,-2e-06,5e-05,-2.7e-05,-1.4e-05,-3.2e-05,-1e-06,4e-06,5e-06,-4.1e-05,-5.8e-05,3.6e-05,6e-06,8.2e-05,3.1e-05,-5e-06,4.9e-05,-4.2e-05,1e-05,3.9e-05,-3.2e-05,-8.1e-05,-4.9e-05,1e-05,6e-06,1e-06,-1.1e-05,-1e-06,-4.2e-05,2.4e-05,1.7e-05,7e-06,2.3e-05,-3e-06,-6.3e-05,1e-05,2.1e-05,2e-06,-9e-06,5e-06,-8e-06,4.8e-05,6e-06,-3.8e-05,7e-06,1e-06,-4e-06,2.4e-05,1e-05,-6e-06,1e-05,3e-06,-2.1e-05,-1e-06,8e-06,-4e-06,1e-06,0,7e-06,-5e-06,6e-06,8e-06,-4e-06,7e-06,-6e-06,2e-05,0,2e-06,-6e-06,-3e-06,0,2e-06,-6e-06,-1.2e-05,4e-06,1e-06,0,2e-06,-1e-06,-2e-06,-2e-06,2e-06,3e-06,0,5e-06,-4e-06,-5e-06,-2e-06,-2e-06,0,0,3e-06,2e-06,5e-06,-2e-06,-2e-06,1e-06,-3e-06,1e-06
0,9e-06,-2e-06,2e-06,-1e-06,0,0,1e-06,0,-1e-06,-7e-06,-7e-06,1e-05,1.3e-05,-1e-06,-2e-06,3.1e-05,2e-06,1e-05,2.2e-05,-8e-06,2e-06,-1e-05,-1.1e-05,-4.1e-05,-2.1e-05,-5e-06,1.7e-05,-6e-06,-2.3e-05,1.6e-05,1.1e-05,1.1e-05,-2.8e-05,-2.2e-05,-2.5e-05,-3.5e-05,-1.5e-05,-3.4e-05,2.4e-05,1.8e-05,-2e-05,2e-06,5.3e-05,2.8e-05,-4e-06,-4e-06,-5e-06,-6e-06,-7e-06,6.9e-05,4e-06,-2e-06,-2.3e-05,-4e-05,-5e-06,-9e-06,-2.2e-05,-4e-06,1.6e-05,-2.7e-05,-3e-06,-2e-06,-2.2e-05,-8e-06,3.7e-05,-8e-06,5e-06,3e-06,0,-7e-06,2e-06,2e-06,0,0,3e-06,0,0,7e-06,0,1e-06,1.1e-05,1e-06,-9e-06,1.4e-05,2e-06,-8e-06,2e-06,-9e-06,1e-06,-1e-06,1e-06,-2e-06,-4e-06,-4e-06,4e-06,2e-06,-1e-06,-3e-06,1e-06,5e-06,7e-06,0,0,0,1e-06,-5e-06,-1e-06,-1e-06,2e-06,1e-06,-1e-06,0,-1e-06,-2e-06,-4e-06,1e-06,-2e-06,0,-2e-06,0
-1e-06,-1.1e-05,-1e-06,-8e-06,0,-1e-06,3e-06,-4e-06,0,-3e-06,2e-06,-2e-06,0,-8e-06,5e-06,2e-06,2.7e-05,-2.3e-05,-4e-06,-1.4e-05,2e-06,6e-06,3.5e-05,5.3e-05,3.3e-05,-2.6e-05,1.5e-05,2.1e-05,1.4e-05,-7e-06,-2e-05,1.8e-05,4.7e-05,3.5e-05,2.9e-05,2.6e-05,8e-06,2e-05,-2.6e-05,-4e-06,-6e-06,-1.2e-05,-1e-06,2.2e-05,5e-06,-1.1e-05,-3e-06,8e-06,-2.2e-05,6e-06,3e-06,0,2e-06,3.2e-05,2.2e-05,-3e-06,5.5e-05,-6e-06,3.7e-05,-1e-05,8e-06,9e-06,1e-06,-1.1e-05,1.3e-05,-2.1e-05,0,-5e-06,-4e-06,-1.4e-05,-1e-06,1.1e-05,-3e-06,0,2e-06,-2e-06,6e-06,-3e-06,-2e-06,0,-7e-06,-7e-06,-1.5e-05,2e-06,-5e-06,2e-06,1e-05,-1.6e-05,5e-06,-2e-06,-3e-06,-1e-06,-1e-06,3e-06,4e-06,2e-06,-4e-06,-2e-06,0,-7e-06,-1e-06,-9e-06,-1e-06,2e-06,0,-1e-06,5e-06,-1e-06,1e-06,2e-06,1e-06,1e-06,0,-2e-06,1e-06,3e-06,2e-06,2e-06,0,1e-06,0
0,8e-06,2e-06,6e-06,-1e-06,1e-06,-2e-06,4e-06,-1e-06,-2e-06,1.1e-05,7e-06,-5e-06,3e-06,3e-06,1e-06,-2.1e-05,-1.1e-05,2e-06,1e-05,-2e-06,6e-06,2.1e-05,-7.8e-05,3e-05,-2.3e-05,9e-06,5e-05,-2e-06,1.8e-05,-2e-06,-1.8e-05,-4.8e-05,4e-06,-2e-05,-7.1e-05,3e-06,-2e-06,4.7e-05,-7e-06,-2e-06,3.8e-05,2.3e-05,-5.7e-05,2e-05,1.1e-05,-1e-06,-1.4e-05,1.9e-05,-1.7e-05,-4.9e-05,-1.7e-05,-7e-06,-3.1e-05,1.4e-05,1e-06,2.2e-05,1.6e-05,1e-06,5e-06,2.4e-05,-1e-06,6e-06,-1.9e-05,0,3.6e-05,1e-06,-1e-06,-1e-06,4e-06,1.3e-05,-1.4e-05,-3e-06,0,2e-06,1e-06,-3e-06,7e-06,-2e-06,-1e-06,9e-06,1e-06,7e-06,7e-06,6e-06,-2e-06,-5e-06,1.2e-05,-5e-06,1e-06,5e-06,0,-1e-06,0,2e-06,-6e-06,4e-06,0,1e-06,7e-06,-5e-06,8e-06,0,-1e-06,0,-1e-06,-3e-06,3e-06,1e-06,0,-2e-06,1e-06,-1e-06,0,-2e-06,-4e-06,-1e-06,-2e-06,-1e-06,-3e-06,-1e-06
0,0,2e-06,3e-06,1e-06,1e-06,-1e-06,-3e-06,0,4e-06,-4e-06,-6e-06,9e-06,-4e-06,2e-06,9e-06,-4.5e-05,1.6e-05,-4e-06,4e-06,-8e-06,-4e-06,-7.4e-05,2e-06,-4e-05,-6e-06,-9e-06,-2.2e-05,-1e-06,4e-06,3.1e-05,1e-05,-1.7e-05,-2.4e-05,1.4e-05,7e-05,-1.7e-05,0,-1.2e-05,1.6e-05,1e-05,-4.4e-05,1.8e-05,3.2e-05,-8e-06,-3e-06,-3e-06,-5e-06,-4e-06,7e-06,2.1e-05,-1e-06,-6e-06,-1.6e-05,-1.2e-05,-1e-06,-3.7e-05,1e-06,2.9e-05,3e-06,-9e-06,5e-06,-8e-06,3e-06,-1.8e-05,-2.9e-05,-3e-06,1e-06,-6e-06,1e-06,-1e-06,1.4e-05,-1e-05,0,-1.1e-05,-4e-06,-6e-06,-1.1e-05,1e-06,0,5e-06,-5e-06,4e-06,-5e-06,-1.1e-05,-2e-06,5e-06,5e-06,5e-06,1e-06,-1e-06,0,0,0,4e-06,4e-06,3e-06,1e-06,-2e-06,-5e-06,3e-06,-5e-06,0,0,0,2e-06,1e-06,1e-06,-2e-06,0,0,0,0,1e-06,-2e-06,3e-06,1e-06,3e-06,0,-2e-06,1e-06
0,-6e-06,0,-9e-06,-1e-06,-1e-06,1e-06,0,0,3e-06,-4e-06,0,-1e-05,0,-1e-06,-6e-06,1e-05,7e-06,0,-7e-06,-1e-06,-4e-06,-6e-06,1.2e-05,1e-06,-8e-06,-8e-06,-5.3e-05,-5e-06,-1.1e-05,-1.7e-05,-9e-06,6.6e-05,1.9e-05,0,-4.3e-05,1.9e-05,-1.2e-05,-3.5e-05,-2.2e-05,3e-06,3e-05,2e-06,1e-05,1e-05,2e-06,-5e-06,8e-06,0,-1.7e-05,-9e-06,4e-06,2e-06,1.5e-05,-2e-06,-2e-06,-2.1e-05,6e-06,-1.7e-05,-3e-06,-8e-06,-4e-06,3e-06,3.8e-05,1.2e-05,6e-06,-2e-06,-2e-06,9e-06,-1.8e-05,-1e-06,-5e-06,1e-05,-2e-06,1.5e-05,0,0,1.3e-05,-6e-06,1e-06,-6e-06,2e-06,-7e-06,0,4e-06,-3e-06,-7e-06,-1.8e-05,7e-06,-1e-06,3e-06,0,1e-06,1e-06,-3e-06,4e-06,-6e-06,1e-06,-1e-06,1e-06,1e-06,1e-06,0,2e-06,-2e-06,1e-06,0,-3e-06,-3e-06,-3e-06,2e-06,1e-06,0,0,-2e-06,-4e-06,-2e-06,-1e-06,0,2e-06,-1e-06
0,8e-06,-1e-06,1e-05,0,-1e-06,-1e-06,1e-06,1e-06,-4e-06,1e-06,0,1e-05,5e-06,1e-06,-7e-06,4.8e-05,3e-06,-3e-06,-1e-06,-3e-06,-3e-06,4.8e-05,-3.4e-05,3e-06,6e-06,1.7e-05,-4.6e-05,-1e-06,-3e-06,1e-06,-1.2e-05,-3.3e-05,-1.6e-05,-8e-06,2e-05,-5e-06,1.5e-05,3.2e-05,2e-05,-1e-05,0,5e-06,-3.1e-05,-2.1e-05,3e-06,-5e-06,-8e-06,7e-06,1.6e-05,2.9e-05,1.8e-05,1.2e-05,-2.3e-05,5e-06,3e-06,2.5e-05,0,1.1e-05,-4e-06,2e-05,4e-06,-2e-06,-1.6e-05,0,-2.2e-05,1e-06,-8e-06,0,9e-06,3e-06,-5e-06,2e-06,4e-06,-1.6e-05,3e-06,-2e-06,-1.2e-05,9e-06,1e-06,1e-06,5e-06,9e-06,3e-06,5e-06,-7e-06,6e-06,1e-05,-5e-06,2e-06,1e-06,1e-06,0,1e-06,-4e-06,6e-06,2e-06,1e-06,-2e-06,3e-06,0,3e-06,0,-2e-06,1e-06,-1e-06,-2e-06,0,6e-06,-1e-06,0,-2e-06,0,-1e-06,-4e-06,4e-06,1e-06,-2e-06,-1e-06,-1e-06,0
0,-1e-05,-1e-06,-1e-06,-1e-06,0,0,-4e-06,0,-1e-06,2e-06,-6e-06,-7e-06,-5e-06,0,6e-06,-5e-06,-2e-06,5e-06,5e-06,-5e-06,-9e-06,3e-06,3.4e-05,-3.8e-05,3.9e-05,7e-06,4.4e-05,5e-06,3e-06,-1.4e-05,1.5e-05,-3.2e-05,-1.2e-05,3.2e-05,-4.9e-05,-1.1e-05,-4e-06,1.6e-05,-1.4e-05,-6e-06,-3.6e-05,-1.3e-05,2.3e-05,5e-06,-6e-06,1.9e-05,1.5e-05,9e-06,-2.4e-05,1.4e-05,-4e-06,0,1.3e-05,6e-06,3e-06,6e-06,0,-4e-05,-2e-06,-1.7e-05,6e-06,7e-06,2.8e-05,-1.4e-05,2.1e-05,1e-06,9e-06,3e-06,-1e-06,-3e-06,8e-06,-8e-06,-3e-06,8e-06,-1e-06,2e-06,1.2e-05,-6e-06,-1e-06,4e-06,-4e-06,1e-06,1e-06,-4e-06,-4e-06,-1e-06,1e-05,2e-06,2e-06,-2e-06,0,0,-2e-06,3e-06,-2e-06,4e-06,0,0,-2e-06,-1e-06,-7e-06,-1e-06,3e-06,1e-06,-1e-06,4e-06,-2e-06,-4e-06,2e-06,0,1e-06,0,0,1e-06,-4e-06,0,1e-06,0,-1e-06,0
