-0.000152,4e-06,-6e-06,-0.000247,-4.6e-05,-0.000227,-9.7e-05,8.8e-05,-9.8e-05,-1.6e-05,-0.000143,3.6e-05,-2.5e-05,-0.000397,-0.000382,-0.000113,4.7e-05,-0.000187,-0.000217,-0.000209,-0.000234,-4.2e-05,-0.000164,-0.000177,-0.000316,-3.2e-05,-0.000184,-5e-06,-7.2e-05,-0.00024,-0.000193,-0.000155,-0.000149,-0.000137,-0.000227,-0.000263,-7e-05,-0.000142,-0.00033,-0.00011,-0.000183,-0.000189,-4.5e-05,-6.6e-05,-0.000206,-0.000147,-0.000129,-7.9e-05,-0.000316,-0.000156,-0.000141,-0.000205,-0.000186,-0.00023,-0.000449,-0.000101,-0.000281,-0.000387,-0.000233,-0.000177,-1.8e-05,-0.000228,-0.000343,-0.000129,-0.000479,-0.000237,-0.000167,-0.000221,-0.000302,-0.000359,-0.000211,-0.000352,-0.000345,-8.9e-05,-0.000262,-0.000342,-0.00048,-0.000364,-0.000358,-0.000475,-0.000363,-0.000255,-0.000248,-0.000235,-0.000409,-0.000291,-0.000367,-0.000431,-0.000182,-0.000413,-0.000303,-0.000229,-0.000361,-0.000168,-0.000244,-0.000472,-0.000453,-0.000658,-0.00036,-0.00046,-0.000437,-0.000441,-0.000167,-0.000244,-0.000126,0.000132,-4.8e-05,-0.000431,-0.000684,-0.000455,-0.000335,-0.00077,-0.000568,1.9e-05,-0.00039,-0.000343,-3.5e-05,2.9e-05,-0.000501,-0.000342,-0.000109
-6.4e-05,-0.000248,-0.000246,-0.00019,-0.000115,-0.000178,8.3e-05,-0.000171,-0.000229,4.2e-05,-6.3e-05,-0.000186,-0.000456,-0.000425,-0.000199,-0.000163,-0.000493,-0.000256,-0.000165,-0.000179,4.5e-05,2.2e-05,-0.000247,-0.000142,-6.5e-05,-0.000156,-0.000172,-0.000376,-0.000157,-8.7e-05,-0.000279,-0.000313,-0.000177,-0.000107,-0.00013,0.000184,5e-05,-0.000263,-0.000298,-0.000136,-0.000253,-0.000153,-0.000138,-0.000296,-0.000209,-8.5e-05,-7.1e-05,-0.000192,-9e-05,-0.000227,-8.5e-05,2.7e-05,0.000118,0.000187,0.000318,0.000275,-3.1e-05,3.1e-05,0.000216,-4.8e-05,-2.2e-05,-9.6e-05,-7e-06,3e-06,0.000136,0.000146,1e-05,-9.5e-05,3e-05,-4e-06,-4.3e-05,-0.000178,-0.00024,-0.000107,-2.1e-05,-9.6e-05,0.00014,4.7e-05,-3.5e-05,0.000219,5.6e-05,-0.000101,6.1e-05,-8.8e-05,-0.000208,-0.000189,6.3e-05,5.4e-05,-6.2e-05,7.6e-05,2.2e-05,-0.000221,-7.8e-05,6.3e-05,-0.000219,0.00019,9.8e-05,0.000115,-0.000121,-0.00018,-0.000245,-4.5e-05,-0.000156,-0.000527,-0.000178,-0.000246,-0.00026,5.4e-05,0.000233,0.00014,-0.000165,-1.9e-05,2.4e-05,0.000222,2e-06,-0.000145,-0.000346,-0.000346,0.000296,0.000198,0.000224
8.7e-05,-0.000162,-3.8e-05,-3e-05,-2.5e-05,-3e-05,-0.00025,-0.000101,0.000199,-6.3e-05,0.000109,-6.1e-05,0.000295,0.000469,0.000327,0.000187,8.8e-05,0.000112,0.000204,9.2e-05,-0.000189,-0.000204,0.000121,5e-06,8.3e-05,0.000243,-6.3e-05,0.00014,1.1e-05,-0.00012,4.8e-05,-7.4e-05,2.3e-05,-5.5e-05,6.4e-05,8.7e-05,-0.000174,4.1e-05,0.000211,9.7e-05,-0.000166,-0.000142,9e-05,0.000212,0.000386,1e-06,-5.3e-05,1.9e-05,0.000129,0.000228,8e-05,2.2e-05,-0.000215,-0.000101,-0.000305,-0.000175,4.9e-05,2.2e-05,-7.1e-05,-0.00023,8e-06,-0.000246,5e-06,0.000216,-3.2e-05,-0.000223,-0.000141,0.000147,-7.6e-05,-0.000231,-6.8e-05,4.3e-05,0.00032,-1e-04,0.000143,2.1e-05,-0.000197,-0.000115,0.000206,-7.9e-05,6e-06,0.000147,8.6e-05,9.7e-05,0.000315,1.4e-05,-0.000262,2.1e-05,-7.1e-05,0.000115,0.000185,5.2e-05,-1e-04,0.000115,0.000249,1.8e-05,-8e-05,3.4e-05,5e-06,0.000193,0.000405,0.000219,0.000234,0.000402,0.000168,-7.4e-05,-7.8e-05,-2.5e-05,-0.000191,-9.1e-05,0.000128,0.000172,0.000125,9e-05,-2.4e-05,-6.8e-05,0.00026,5e-05,7e-06,-4e-05,0.000219
-3e-05,-9.8e-05,-0.000118,-1.7e-05,8e-05,0.000168,8.2e-05,-8.9e-05,-5e-05,5e-05,-4.3e-05,-4.3e-05,-0.000105,-2e-05,-0.000172,-8.3e-05,-0.000173,2.5e-05,0.000165,-1e-05,6.8e-05,6.5e-05,-7e-05,-3.7e-05,-7.4e-05,-4e-05,1.8e-05,-3.2e-05,-7e-05,0.000197,1e-04,7.3e-05,-6e-05,1.3e-05,-9e-06,-0.000122,0.000148,0.000202,-0.000157,-0.000108,0.000147,5.6e-05,-4.8e-05,-0.00022,-0.000302,-0.000253,-4.9e-05,-4.1e-05,-6.1e-05,-0.000266,-0.000164,-3.2e-05,1.1e-05,-4.3e-05,5.9e-05,-3.7e-05,-0.000139,-0.000108,7.4e-05,0.000116,2.5e-05,0.000166,-0.000176,-0.000278,-5.9e-05,-7.1e-05,-1.2e-05,-0.000235,-2e-06,1.4e-05,3e-05,-0.000128,-0.00029,1.2e-05,-0.000219,-0.000173,-7e-05,1.8e-05,4.5e-05,-2.9e-05,8.7e-05,-0.000111,-6.8e-05,-6.9e-05,-0.000191,1e-04,-4.1e-05,0.000105,-9.9e-05,-0.000106,-0.000186,-4.9e-05,3.2e-05,-0.000194,-0.000229,-8e-05,3.8e-05,-2.6e-05,0.000145,4.5e-05,-0.000157,-0.000149,-1.1e-05,-6.5e-05,-5.8e-05,-0.000132,9e-05,-5e-06,6.7e-05,-0.000149,1.8e-05,-0.000138,-5.4e-05,-0.000185,0.00012,-9.2e-05,0.00013,6.5e-05,-0.000132,4.6e-05,-9.5e-05
3.6e-05,8e-05,0.000138,1.7e-05,-2e-05,-4e-05,-0.000136,-0.00017,-0.000198,-0.000255,-0.000219,-0.000219,5e-06,-0.000347,-0.000144,-0.00013,9.9e-05,-0.000268,-0.000312,-0.000138,-8e-05,-4e-06,8e-06,-3.8e-05,9.2e-05,-0.000115,-3.1e-05,4e-05,-3.5e-05,-0.000103,-7.4e-05,-8.8e-05,-6.1e-05,-3.8e-05,-5.6e-05,3.1e-05,9.9e-05,-0.000224,-3.7e-05,-1.3e-05,8.7e-05,-4.8e-05,2.5e-05,-9.6e-05,0.000137,-4.1e-05,-1.3e-05,1.6e-05,-0.000122,8.3e-05,-3.6e-05,3.6e-05,-7.8e-05,-1.9e-05,2.8e-05,3.2e-05,-5.5e-05,7e-05,-6.3e-05,-4.3e-05,-0.000133,1.8e-05,8.8e-05,9.1e-05,8.2e-05,-5.7e-05,-0.000172,9.9e-05,9.1e-05,0.000219,2.5e-05,-0.000124,0.000126,-2e-06,0.000106,0.000304,2.8e-05,0.000174,-5.4e-05,-0.000159,-0.000153,-8.2e-05,0,-9.5e-05,8e-05,-0.000177,0.00011,-0.000113,2.9e-05,-7.1e-05,2.6e-05,-8.3e-05,-3e-05,1e-06,2.8e-05,-8e-06,9e-06,-0.000129,-7.2e-05,-0.000112,-0.000165,-0.000162,-0.000177,-7e-05,-8.1e-05,-5.1e-05,-3.9e-05,3.8e-05,-8.3e-05,0.000136,0.000149,0.000127,-1.1e-05,1.7e-05,-0.000303,-0.000125,-0.000155,-0.000156,5.2e-05,-0.000199,-0.000112
-6.3e-05,-4.4e-05,0.000107,6.4e-05,2e-06,-5.3e-05,7.3e-05,-4e-06,0.00015,0.000142,1.3e-05,3.1e-05,9.5e-05,0.000287,0.000143,3.9e-05,7.2e-05,0.000112,0.000199,0.000116,0.000203,1e-06,8.1e-05,8.1e-05,-9.2e-05,1.9e-05,7.2e-05,-4.1e-05,-2.8e-05,-2e-06,-4.7e-05,-5.5e-05,0.000143,0.000124,1.1e-05,-2.3e-05,7.9e-05,7.6e-05,0.000122,0.000139,2e-06,0.000224,8.4e-05,0.000252,9e-06,0.000153,1.7e-05,5.3e-05,0.000101,0.000101,0.000103,7.3e-05,4e-05,0.000177,-9.6e-05,-4.7e-05,8e-05,7.7e-05,6.8e-05,-2.2e-05,1.6e-05,4e-06,-0.000152,-8.4e-05,-2.3e-05,0.000127,0.000173,9e-05,-4.2e-05,-0.000143,-3.9e-05,1.7e-05,8.2e-05,0.000142,5.8e-05,-0.000125,0.00015,-9.3e-05,-0.000122,4e-05,0.000105,0.000128,0.000104,7.1e-05,1.9e-05,0.000119,-2.2e-05,-1.8e-05,5e-06,0.000166,0.000163,8.6e-05,0.000162,-0.00013,-5.8e-05,0.000111,-9e-06,8.9e-05,2.9e-05,0.000161,0.000176,0.000106,0.000152,0.000127,0.000239,0.000134,-7.8e-05,-0.000121,5.5e-05,4e-06,-8e-05,-0.00015,3.4e-05,-4e-05,-3.9e-05,0.00012,0.000215,1.8e-05,6.7e-05,3.1e-05,-2.6e-05
1.4e-05,9e-06,-3.5e-05,-6.7e-05,1.7e-05,-1.6e-05,1.6e-05,5.7e-05,5.6e-05,0.000101,-1.5e-05,7.5e-05,-8.2e-05,-0.000111,-5e-06,-8e-06,-5.7e-05,0.000107,-2.9e-05,-5.1e-05,-1.3e-05,-3.5e-05,9.2e-05,1.7e-05,6.4e-05,-3.7e-05,1.2e-05,-5.8e-05,0.00013,-3.2e-05,-6.4e-05,0.000106,6.9e-05,-9e-05,-9.7e-05,-2.3e-05,-0.000142,-0.000147,-0.000131,-9.5e-05,-0.000112,-5.6e-05,-0.000108,-4.6e-05,-0.000118,-0.000144,-6.4e-05,-2.4e-05,-2.9e-05,-4.2e-05,-7e-05,3.5e-05,-1.7e-05,-9.4e-05,0.000108,2.8e-05,8.8e-05,-7.7e-05,-4.9e-05,4.4e-05,4.9e-05,4.9e-05,4.4e-05,3.1e-05,-6.8e-05,-7.7e-05,-4.2e-05,-5.3e-05,2e-05,3.4e-05,-7.7e-05,0.000161,-2e-06,-6.1e-05,5e-05,2.5e-05,-0.000161,-7e-06,0.000145,-6.7e-05,-0.000123,-6.9e-05,-0.000142,-7.5e-05,-2.7e-05,-7.5e-05,-2.8e-05,-6.2e-05,-4.4e-05,-8.7e-05,-6.1e-05,8e-06,-0.000184,7.4e-05,-2.4e-05,-0.000129,1.5e-05,-5.6e-05,6.7e-05,-7.1e-05,-0.000215,-2.1e-05,-4.8e-05,-9.8e-05,-9.8e-05,-3e-06,-1e-04,-2.8e-05,-4.7e-05,3.7e-05,-4.2e-05,-9.1e-05,-0.000205,1.7e-05,-5e-06,-8.1e-05,3e-05,-6.2e-05,-9.1e-05,-4e-06,2e-06
1e-06,-1.5e-05,-7.5e-05,-1.3e-05,3.3e-05,1.7e-05,-8.8e-05,7e-05,-4.9e-05,-0.000197,-8e-06,-0.000104,-0.00014,4.3e-05,-9e-05,-5.9e-05,3.9e-05,1.6e-05,-0.000125,-0.000105,-6.9e-05,-6.1e-05,-5.6e-05,-8.3e-05,-2.5e-05,6.3e-05,4e-06,4e-05,-4.8e-05,1.5e-05,0.000152,-6.3e-05,-9.3e-05,-5e-05,7e-05,-1.9e-05,5.1e-05,9.9e-05,1.6e-05,-4.4e-05,5.4e-05,-7.1e-05,-8.1e-05,-3.8e-05,-2.9e-05,5.8e-05,-9.5e-05,-5.3e-05,-0.000163,-3.2e-05,-8.4e-05,-5.5e-05,-5e-05,-3e-05,-3.9e-05,-7.3e-05,2e-06,2.7e-05,4.5e-05,-4e-06,-0.000115,-2e-06,-6.7e-05,1.9e-05,5.5e-05,-2.5e-05,2e-05,-7.4e-05,-1.8e-05,-1e-05,-3.9e-05,-0.000144,-7.9e-05,1.4e-05,-0.000126,-8e-06,4.5e-05,-2e-06,-8.1e-05,3.1e-05,-9e-06,6e-05,5e-05,6e-06,-1.8e-05,8e-05,-6.9e-05,-8e-06,0.000116,-4e-06,1.2e-05,-0.00012,-5.6e-05,3.1e-05,-3e-05,1e-06,-0.000127,-1.7e-05,-8.1e-05,-6.5e-05,5.1e-05,-4.2e-05,-4.7e-05,-3.4e-05,-1e-04,-5.7e-05,4.4e-05,-3.2e-05,7e-05,-0.000114,-4.2e-05,0.000145,0.000247,-3.1e-05,1.2e-05,-8.6e-05,-0.00016,-9.2e-05,-7.1e-05,-3.8e-05,-0.000279
-1e-06,2.2e-05,-3e-05,-1.1e-05,-0.000129,-1.6e-05,-3e-06,0,-2e-06,2.5e-05,2.8e-05,9.1e-05,-1.2e-05,1.8e-05,8.6e-05,0.000132,8.9e-05,1.1e-05,7.6e-05,4.8e-05,1e-06,2.6e-05,-1.9e-05,-3e-06,-9e-06,-2.1e-05,-4.8e-05,4.2e-05,-5.6e-05,-4.2e-05,-9e-05,-2e-06,3.6e-05,2e-06,4.4e-05,2.3e-05,-0.000133,-4.3e-05,5.5e-05,8.6e-05,-7.6e-05,-4.6e-05,8.6e-05,7.4e-05,5.8e-05,1e-05,-1.8e-05,-2e-06,0.000112,6.7e-05,8.4e-05,-3.9e-05,-4.3e-05,-8.7e-05,4.4e-05,4.5e-05,3e-05,-5.5e-05,-7.6e-05,-2e-05,-3.6e-05,-4.4e-05,0.000225,1.8e-05,-4.6e-05,8e-05,-1.7e-05,3.2e-05,-6.8e-05,1.7e-05,0.000134,7.8e-05,-3.1e-05,-0.000124,-2e-05,-8.8e-05,-6.5e-05,-6.5e-05,4.5e-05,1.7e-05,-3e-05,-7e-06,2e-05,7.2e-05,4.9e-05,-0.000117,5.6e-05,3.2e-05,1e-05,-7.3e-05,1.6e-05,0.000102,0.000144,-6e-06,5.8e-05,0.000111,8.1e-05,7e-06,2e-05,3.8e-05,6.1e-05,5.8e-05,7.8e-05,9.3e-05,3.3e-05,0.000113,-1.7e-05,6.6e-05,7e-06,5.9e-05,4.2e-05,-2.9e-05,-0.000109,3.8e-05,5.7e-05,0.000185,-3.7e-05,2.9e-05,-4.1e-05,-2.5e-05,0.000208
-3.8e-05,1.2e-05,-1.2e-05,5.5e-05,1.1e-05,1.7e-05,5.6e-05,-3.3e-05,-1.7e-05,-1.4e-05,3.2e-05,5.3e-05,2.7e-05,-2.2e-05,-7.4e-05,-8e-05,-6.2e-05,-0.000103,-3e-05,6e-06,4.6e-05,1.9e-05,-3.4e-05,2.2e-05,8.1e-05,-4e-06,-6.5e-05,-1.6e-05,5.6e-05,6.7e-05,-2e-06,3.1e-05,1.4e-05,8.3e-05,-4.5e-05,-3.3e-05,3.1e-05,3.1e-05,3.8e-05,-1.3e-05,-2e-06,7.9e-05,-4.2e-05,-1.1e-05,3e-06,1.3e-05,0.000103,1.8e-05,1.9e-05,-3.1e-05,-9.6e-05,-2.3e-05,9.4e-05,3.7e-05,-6.8e-05,-3.4e-05,-3.3e-05,4.4e-05,0.000106,4.3e-05,-8e-06,7.8e-05,-0.00012,3.8e-05,2e-05,4.5e-05,5.6e-05,-4.2e-05,8e-05,1.2e-05,-1.7e-05,-6.2e-05,2e-05,5.6e-05,4.5e-05,0.000113,0.000112,6.5e-05,0,2.8e-05,-9e-06,1.3e-05,-6.5e-05,2e-06,-2.3e-05,5.2e-05,2.3e-05,-4.9e-05,-8.8e-05,6e-06,-3.9e-05,-8.3e-05,3.7e-05,-2.9e-05,3.5e-05,-3e-05,-4.8e-05,-4.7e-05,6.2e-05,5.1e-05,-4e-05,-4.4e-05,-6.7e-05,-4.2e-05,-4e-05,-0.000122,5.4e-05,1.8e-05,-5.1e-05,-6.2e-05,1.9e-05,4e-05,2.1e-05,2.6e-05,-8.1e-05,-5e-06,-1.6e-05,3.1e-05,-0.000195,9e-06,-6.3e-05
1.7e-05,-1.7e-05,4e-06,-3.9e-05,3.2e-05,1e-06,6e-06,-3e-06,-1e-05,-8.2e-05,-7.6e-05,-2e-05,-2.8e-05,1.2e-05,4.4e-05,-5.6e-05,-2e-06,-9e-06,-3e-05,-5.7e-05,-4.6e-05,8.4e-05,4.6e-05,6e-06,1.3e-05,-7e-06,6.7e-05,3.6e-05,-2e-06,4.4e-05,3.1e-05,2.9e-05,-3.2e-05,-2.1e-05,-1.7e-05,2.2e-05,2.4e-05,4e-06,-2.6e-05,2.8e-05,7.3e-05,9e-06,8.8e-05,1.6e-05,2.4e-05,-5e-06,3e-05,-9e-06,0.000103,-1.4e-05,4.9e-05,-9e-06,5.5e-05,1e-06,4.2e-05,3.8e-05,2.5e-05,3e-05,-5.1e-05,-2.9e-05,8.3e-05,1.3e-05,-3.7e-05,3e-06,1.8e-05,-2.1e-05,-5.7e-05,7.3e-05,-1.7e-05,4e-06,-1.9e-05,0.000112,-3.6e-05,2e-05,7e-05,-2.9e-05,-1.9e-05,-1.4e-05,3e-05,-7.4e-05,3e-05,-2.2e-05,3.4e-05,-1.1e-05,3.5e-05,6e-06,-3.3e-05,3.4e-05,9.1e-05,3.3e-05,3.6e-05,7.1e-05,-4.3e-05,3e-06,5e-06,2.4e-05,2.4e-05,3.8e-05,-1.6e-05,-4.7e-05,3.2e-05,5.4e-05,-7.9e-05,1e-06,1.9e-05,7.1e-05,-6e-06,-1.6e-05,-1.7e-05,-1.5e-05,8e-06,-7.2e-05,-2e-06,-7.5e-05,2.3e-05,-2.9e-05,-2.7e-05,8e-06,0.000181,7.6e-05,0.000147
1.7e-05,2.7e-05,-1.5e-05,5e-06,1.2e-05,1.7e-05,-1.2e-05,-4.2e-05,-3e-05,3.2e-05,2.7e-05,2e-06,6.3e-05,-1.4e-05,-3.3e-05,6.2e-05,2.4e-05,2e-05,-3e-06,4.2e-05,-5e-06,-5.7e-05,-2.9e-05,4.2e-05,-8.4e-05,-2.2e-05,-3.1e-05,-2.5e-05,5e-06,-5.4e-05,1.9e-05,1.1e-05,-6e-06,-4e-06,2.7e-05,-4e-06,-4.3e-05,8e-06,-1.4e-05,-3.6e-05,-7.2e-05,-4.4e-05,7e-06,1e-05,1.3e-05,6e-06,-2.2e-05,4.6e-05,-3.3e-05,-2.2e-05,1e-06,3.7e-05,-6e-06,-2.8e-05,1e-06,-7e-06,-1.2e-05,-2.3e-05,-1e-05,2.2e-05,-6e-06,-4.8e-05,1.6e-05,3.1e-05,-5e-06,-1e-06,2.3e-05,4e-06,7e-06,4e-06,-1e-06,-4.9e-05,3.3e-05,-3.8e-05,-8.2e-05,-3.2e-05,-5.7e-05,-3.5e-05,-5.1e-05,4.4e-05,-2.9e-05,2.2e-05,-1e-06,0,-2.3e-05,-2.6e-05,5.1e-05,4e-06,0,2.2e-05,-7e-06,-2.4e-05,2.3e-05,-5e-06,-3e-05,-2e-06,4.6e-05,3.1e-05,-4.4e-05,-1.7e-05,-2.6e-05,-2.5e-05,6e-05,0,-1.7e-05,5.2e-05,-8e-06,5.5e-05,4.1e-05,2e-06,-2.6e-05,3.7e-05,9e-06,2.6e-05,-2.8e-05,-5e-06,0.000128,2.3e-05,4.5e-05,-1.7e-05,-8.1e-05
3e-06,3e-06,1.7e-05,4.3e-05,3.4e-05,-2.6e-05,-1.9e-05,2.4e-05,9e-06,-3e-06,1.5e-05,-2.3e-05,4.3e-05,-6e-06,7e-06,-3.8e-05,-5.4e-05,-1.6e-05,2.7e-05,-1.5e-05,-7e-06,3e-06,-2.2e-05,-9e-06,3.4e-05,1.6e-05,6e-06,-3.8e-05,-1.5e-05,-1.2e-05,-5e-06,-3.8e-05,-1.5e-05,-5e-06,-1.6e-05,1.1e-05,9e-05,-1.1e-05,1.4e-05,-1.2e-05,3.8e-05,5e-06,-7e-05,-6.2e-05,-1.8e-05,-1.4e-05,2.5e-05,-4.1e-05,-1.1e-05,-1.8e-05,-1e-06,-3e-05,2.1e-05,3.4e-05,1.8e-05,-6e-06,-2.6e-05,-2.8e-05,1.3e-05,-2e-05,1e-06,1.9e-05,1.9e-05,-6.5e-05,-1e-06,-1.8e-05,2e-06,3.1e-05,-1.1e-05,-2.6e-05,-1.6e-05,-1.4e-05,-1.9e-05,1e-05,4.5e-05,-1.4e-05,3.7e-05,3.5e-05,2.2e-05,-9e-06,1.2e-05,-2.6e-05,1.3e-05,8e-06,-3.8e-05,1.6e-05,1e-05,-2.5e-05,-3.7e-05,-4.3e-05,-3.3e-05,-3e-06,2e-05,5.2e-05,-1.4e-05,-1.8e-05,-3.2e-05,-3.6e-05,-1.1e-05,6.3e-05,3e-06,-7e-06,-4.3e-05,-9e-06,-6e-06,-6.2e-05,-1.8e-05,1e-05,-2.8e-05,2.6e-05,-1.1e-05,1.7e-05,6e-06,9e-05,2.9e-05,8e-06,-5e-06,-2e-05,-8.2e-05,1.6e-05,0
-6e-06,-1.8e-05,1.5e-05,-2e-06,-2.9e-05,1.2e-05,3.4e-05,6e-06,2.6e-05,3.5e-05,1.6e-05,1.1e-05,-3e-06,-4.4e-05,2e-06,-4e-06,2.6e-05,-1.7e-05,4.5e-05,1e-05,2e-06,2.1e-05,-5e-06,2.4e-05,1.3e-05,0,-3e-06,-2e-06,-2.1e-05,4e-06,9e-06,3.2e-05,5e-06,-2.6e-05,1.6e-05,-8e-06,-1.3e-05,1.6e-05,9e-06,-2.8e-05,4e-06,1.3e-05,8e-06,3.6e-05,1e-06,-2e-06,-6.2e-05,4e-06,-1.4e-05,4e-06,-2.2e-05,6e-06,4e-06,-9e-06,-1.7e-05,-1.3e-05,1e-06,-1.2e-05,-4e-05,-1e-06,-9e-06,-1.6e-05,-3.5e-05,2.7e-05,-1.8e-05,1.2e-05,-3.3e-05,-3e-05,-2.2e-05,2e-06,3e-06,-1.7e-05,3.3e-05,-2.1e-05,-3.1e-05,3.8e-05,-1.3e-05,1e-06,-1.5e-05,1.6e-05,3.8e-05,1.1e-05,-1.4e-05,2.1e-05,-1.2e-05,-2.9e-05,-4.9e-05,-2e-06,-2.1e-05,7e-05,-1.7e-05,9e-06,-4.7e-05,-3.2e-05,1e-05,2.7e-05,-8e-06,2.8e-05,-2.7e-05,-2.8e-05,-1.5e-05,-5e-06,3.8e-05,-2.1e-05,8e-06,-6e-06,-3e-06,-2.5e-05,-3.1e-05,-2.3e-05,-2e-06,-4e-06,-1.7e-05,-9.5e-05,-1.1e-05,1.5e-05,-7e-06,-1.1e-05,1.4e-05,1.8e-05,-6e-06
-1e-06,-1e-05,5e-06,-5e-06,-2e-05,1.3e-05,-2e-06,-2.8e-05,-8e-06,1.2e-05,2e-06,1.2e-05,-5e-06,-7e-06,-4e-06,1e-05,-4e-06,-6e-06,-2.8e-05,1e-06,-1.8e-05,-2e-05,5e-06,-1.3e-05,-2e-05,-2e-05,-4e-06,4e-06,2.1e-05,3e-06,-2.7e-05,6e-06,-6e-06,2e-06,4e-06,-1e-06,-1e-05,-2.1e-05,-1e-05,1.4e-05,-1.9e-05,-1.4e-05,1.3e-05,-1e-05,2e-06,1e-06,2.1e-05,2.1e-05,-4e-06,1.3e-05,2.2e-05,0,-7e-06,1e-05,-1e-06,1.3e-05,-1.3e-05,8e-06,2.2e-05,1.1e-05,1.5e-05,1.7e-05,5.5e-05,-1.1e-05,1.3e-05,-1.7e-05,3.1e-05,7e-06,6e-06,2.6e-05,6e-06,1.1e-05,-9e-06,-6e-06,1.2e-05,-2.6e-05,-5e-06,1e-06,1.2e-05,-3.9e-05,-2.5e-05,-1.4e-05,1e-05,-4e-06,2e-06,1e-05,5e-05,2.3e-05,-1e-06,-3.6e-05,1.2e-05,-5e-06,2.7e-05,-3.8e-05,1.6e-05,-3.6e-05,8e-06,-1.7e-05,1.3e-05,5e-06,3.7e-05,7e-06,-1.6e-05,2.6e-05,-3e-06,1.6e-05,-7e-06,1.6e-05,1e-05,7e-06,-1.5e-05,2e-05,-1.2e-05,3.9e-05,1.4e-05,-2e-05,5.1e-05,2e-06,7.1e-05,-2e-06,-1e-05
1.1e-05,7e-06,-4e-06,-4e-06,2.5e-05,-9e-06,-1.1e-05,-1.3e-05,2e-06,-1.9e-05,3e-06,-6e-06,4e-06,1e-06,0,1e-06,-1e-05,1.7e-05,-1.7e-05,1e-06,-1e-06,-4e-06,2.1e-05,7e-06,9e-06,5e-06,1.4e-05,-3e-06,3e-06,-2e-06,-2e-06,-1e-06,-6e-06,-1.6e-05,-1.6e-05,-3e-06,9e-06,5e-06,-1e-06,3e-06,2e-06,-1.9e-05,9e-06,4e-06,-1e-06,-5e-06,-2e-06,-1.8e-05,9e-06,1e-05,-1e-06,1.5e-05,-5e-06,2.4e-05,-2.3e-05,8e-06,4e-06,-1.1e-05,2.6e-05,-1.1e-05,-2e-06,-1.1e-05,-2.3e-05,2e-05,-1.7e-05,-6e-06,-2.5e-05,-2e-05,2.6e-05,-2.4e-05,1e-05,2.8e-05,3e-06,2e-06,-2e-05,8e-06,-9e-06,-7e-06,5e-06,1.5e-05,-5e-06,5e-06,-8e-06,-3e-06,5e-06,-5e-06,-1.4e-05,-1.1e-05,8e-06,6e-06,6e-06,9e-06,-1e-05,6e-06,1e-05,2.4e-05,-1.7e-05,-1e-06,4e-06,1.4e-05,-6e-06,1.5e-05,9e-06,-7e-06,-1e-06,-4e-06,1.9e-05,4e-06,1.4e-05,-7e-06,5e-06,-2e-05,6e-06,8e-06,-1.8e-05,2.1e-05,-3.8e-05,-9e-06,-2e-05,-5e-06,2e-05
-4e-06,1e-06,2e-06,0,2e-06,8e-06,5e-06,8e-06,-8e-06,1.8e-05,-4e-06,9e-06,-3.1e-05,1.4e-05,2e-06,-3e-06,-8e-06,7e-06,-2e-05,1.6e-05,1.2e-05,1.5e-05,5e-06,-4e-06,3e-06,5e-06,-1e-05,7e-06,-1.1e-05,8e-06,4e-06,-6e-06,5e-06,1.5e-05,-8e-06,7e-06,-5e-06,1e-05,7e-06,1e-06,2e-06,7e-06,-1.1e-05,-3e-06,4e-06,4e-06,-2e-06,1e-05,-9e-06,8e-06,-2.9e-05,-6e-06,1e-05,-6e-06,1.3e-05,-1.5e-05,4e-06,1e-06,-3e-06,1e-05,-1e-06,-1e-06,-9e-06,-2.2e-05,1.1e-05,2e-05,1.1e-05,0,-1.7e-05,1.6e-05,-3e-06,-1.9e-05,-4e-06,3.6e-05,8e-06,9e-06,1.8e-05,1e-06,-6e-06,6e-06,-1.1e-05,-7e-06,-7e-06,-7e-06,4e-06,0,-4e-06,5e-06,-1.4e-05,-1.4e-05,-6e-06,0,9e-06,9e-06,-8e-06,-1.2e-05,0,4e-06,-1e-05,-1e-05,-1.6e-05,-1.9e-05,9e-06,2e-06,6e-06,-1.5e-05,-1.5e-05,-3e-06,5e-06,-1e-06,1.4e-05,-9e-06,-3e-06,1e-06,-8e-06,-8e-06,-7e-06,7e-06,-1.1e-05,-5e-06,9e-06
5e-06,1e-06,-1e-06,-2e-06,-8e-06,-8e-06,7e-06,2e-06,3e-06,-6e-06,7e-06,-5e-06,-3e-06,8e-06,4e-06,-2.1e-05,7e-06,3e-06,3e-06,-1.7e-05,-3e-06,-6e-06,1e-06,-5e-06,-1.7e-05,0,8e-06,-2e-06,8e-06,-2e-06,1.2e-05,2e-06,7e-06,5e-06,5e-06,1e-06,-1.7e-05,-1e-05,-1e-06,-7e-06,-1.5e-05,8e-06,4e-06,3e-06,-3e-06,-7e-06,1.8e-05,-3e-06,1.5e-05,4e-06,1.6e-05,-3e-06,8e-06,5e-06,-5e-06,1.2e-05,-5e-06,5e-06,-1.7e-05,-3e-06,-1.3e-05,4e-06,-1e-05,1.6e-05,-9e-06,-9e-06,0,-6e-06,1.4e-05,-3e-06,-9e-06,-1.5e-05,-6e-06,-2.5e-05,0,-5e-06,-1.9e-05,-9e-06,-5e-06,-7e-06,8e-06,7e-06,5e-06,3e-06,2e-06,6e-06,1.8e-05,4e-06,1.2e-05,1.1e-05,0,-8e-06,-1.2e-05,1.2e-05,-3e-06,0,4e-06,1e-06,8e-06,-3e-06,9e-06,9e-06,-1e-05,-4e-06,-4e-06,3e-06,-2e-06,2.2e-05,-5e-06,-9e-06,-4e-06,1e-05,7e-06,-1.9e-05,8e-06,-2e-06,-3e-05,0,-3e-06,-1e-06,2e-06
-4e-06,-2e-06,-9e-06,-6e-06,4e-06,-3e-06,3e-06,1e-06,1e-06,-1.2e-05,2e-06,-4e-06,2e-06,-5e-06,-2e-06,2.4e-05,-2e-06,-5e-06,8e-06,1e-06,-2e-06,-1e-06,-1e-06,7e-06,-3e-06,0,-1e-05,-5e-06,0,-2e-06,0,1e-06,-1e-06,-3e-06,9e-06,0,3e-06,7e-06,-9e-06,5e-06,3e-06,1e-06,2e-06,-3e-06,3e-06,5e-06,0,0,-3e-06,2e-06,2e-06,-1e-06,3e-06,-4e-06,-7e-06,-5e-06,4e-06,6e-06,1e-06,0,1.7e-05,-5e-06,2.7e-05,-1.7e-05,2e-06,-6e-06,-8e-06,1.4e-05,3e-06,-7e-06,-2e-06,1.3e-05,1e-06,2e-05,6e-06,2e-06,0,6e-06,1e-06,6e-06,2e-06,-7e-06,-2e-06,2e-06,0,-4e-06,-6e-06,-9e-06,-2.7e-05,-8e-06,1.5e-05,1.8e-05,-5e-06,-8e-06,-9e-06,-7e-06,4e-06,-2e-06,3e-06,-8e-06,1e-06,-7e-06,1.4e-05,3e-06,-1e-06,7e-06,0,-6e-06,-1e-06,-1e-06,2e-06,9e-06,-4e-06,1.6e-05,-5e-06,-3e-06,-6e-06,0,-7e-06,8e-06,-7e-06
-4e-06,-2e-06,-1e-06,3e-06,-3e-06,0,-7e-06,-4e-06,-2e-06,6e-06,7e-06,7e-06,1e-05,-1e-06,-6e-06,-8e-06,-4e-06,-6e-06,1e-06,0,6e-06,4e-06,8e-06,-6e-06,-6e-06,-5e-06,7e-06,1e-06,-1e-06,-1e-06,-2e-06,5e-06,3e-06,-5e-06,-5e-06,-3e-06,9e-06,-3e-06,1e-06,-1e-06,3e-06,-1.1e-05,-7e-06,-1e-06,-2e-06,-4e-06,-6e-06,3e-06,-1e-05,-2e-06,-1.9e-05,1e-06,-6e-06,-1e-06,-2e-06,-1e-06,0,0,-2e-06,-1e-06,2e-06,0,-4e-06,1.3e-05,0,4e-06,7e-06,-2e-06,-9e-06,2e-06,5e-06,4e-06,-5e-06,-4e-06,-1.3e-05,-3e-06,4e-06,-3e-06,4e-06,-5e-06,3e-06,5e-06,2e-06,-4e-06,0,1e-06,4e-06,-1e-06,1.3e-05,0,1e-06,-1.6e-05,1e-06,-1.1e-05,5e-06,9e-06,-5e-06,-3e-06,-4e-06,-3e-06,2e-06,1e-05,-9e-06,-3e-06,-8e-06,-1.1e-05,-4e-06,-1e-06,3e-06,-1e-06,2e-06,-1e-06,-1.1e-05,-1.3e-05,8e-06,4e-06,1.8e-05,-1e-06,1.4e-05,-1e-06,-1.8e-05
3e-06,0,1e-06,-2e-06,4e-06,3e-06,-2e-06,-6e-06,-5e-06,-8e-06,-1e-06,-6e-06,4e-06,-2e-06,6e-06,-2e-06,5e-06,1.2e-05,1e-06,0,5e-06,-1.2e-05,-6e-06,5e-06,5e-06,3e-06,-3e-06,3e-06,3e-06,-4e-06,-3e-06,-4e-06,1e-06,-2e-06,2e-06,0,-9e-06,-2e-06,3e-06,-2e-06,-4e-06,8e-06,-3e-06,-3e-06,0,3e-06,-6e-06,-4e-06,-9e-06,0,1.2e-05,-1e-06,-2e-06,2e-06,2e-06,2e-06,3e-06,-7e-06,1e-06,3e-06,2e-06,-1e-06,2e-06,-1.1e-05,0,1e-06,-5e-06,1e-05,6e-06,3e-06,0,-2e-06,4e-06,-1.3e-05,8e-06,-1e-06,-6e-06,2e-06,-1e-06,0,5e-06,-2e-06,-1e-06,4e-06,-1e-06,4e-06,0,3e-06,0,1e-06,-9e-06,1.2e-05,-1.1e-05,-1e-06,3e-06,-4e-06,4e-06,4e-06,1.2e-05,6e-06,-2e-06,-7e-06,-7e-06,0,5e-06,4e-06,1e-06,-5e-06,-2e-06,3e-06,-9e-06,-5e-06,3e-06,9e-06,-7e-06,1e-06,2e-06,-2e-06,1.5e-05,-4e-06,3e-06
3e-06,2e-06,1e-06,1e-06,6e-06,0,1e-05,3e-06,2e-06,6e-06,-4e-06,6e-06,6e-06,8e-06,-2e-06,1e-06,1e-06,1e-06,0,2e-06,-4e-06,6e-06,-3e-06,-2e-06,1.2e-05,1e-06,-4e-06,0,-6e-06,2e-06,-2e-06,1e-06,2e-06,1e-06,-4e-06,1e-06,1.6e-05,1e-06,-1e-06,3e-06,3e-06,8e-06,5e-06,3e-06,-3e-06,-2e-06,-6e-06,1e-06,-4e-06,-1e-06,-5e-06,0,0,-3e-06,-2e-06,-3e-06,2e-06,0,5e-06,-5e-06,-1e-05,-1e-06,-3e-06,8e-06,-2e-06,1e-06,3e-06,-8e-06,-5e-06,-8e-06,1e-06,-7e-06,2e-06,1.3e-05,-1e-06,-3e-06,8e-06,3e-06,3e-06,-8e-06,-4e-06,4e-06,2e-06,-2e-06,2e-06,-6e-06,1e-06,-1e-06,6e-06,1e-06,2e-06,-3e-06,4e-06,1e-05,8e-06,-2e-06,-3e-06,-3e-06,-2e-06,-3e-06,4e-06,3e-06,4e-06,-1e-06,3e-06,3e-06,1e-06,1e-06,4e-06,-7e-06,0,-3e-06,-5e-06,-6e-06,-4e-06,-3e-06,1.3e-05,-2e-06,-2e-05,2e-06,6e-06
1e-06,-2e-06,1e-06,-3e-06,-1e-05,1e-06,-3e-06,1e-06,-1e-06,1e-06,1e-06,-1e-06,-2e-06,1e-06,1e-06,-4e-06,-2e-06,-5e-06,-5e-06,-2e-06,-2e-06,2e-06,-5e-06,-1e-06,-7e-06,-1e-06,6e-06,3e-06,3e-06,5e-06,5e-06,-1e-06,0,-4e-06,-3e-06,1e-06,3e-06,0,-5e-06,6e-06,3e-06,-5e-06,1e-06,2e-06,2e-06,1e-06,3e-06,1e-06,7e-06,-3e-06,-2e-06,-1e-06,-7e-06,5e-06,1e-06,3e-06,2e-06,6e-06,-7e-06,6e-06,4e-06,2e-06,2e-06,-6e-06,-1e-06,-5e-06,-4e-06,0,0,7e-06,1e-06,-2e-06,2e-06,-1.1e-05,0,6e-06,-1e-05,-3e-06,-4e-06,1.2e-05,0,0,-2e-06,-5e-06,3e-06,4e-06,1e-06,4e-06,-9e-06,5e-06,4e-06,0,3e-06,0,-3e-06,2e-06,-8e-06,3e-06,2e-06,0,0,-4e-06,-1e-06,2e-06,-3e-06,-5e-06,0,-1e-06,-3e-06,5e-06,4e-06,-1e-06,1.1e-05,7e-06,0,0,0,-1e-06,-3e-06,0,4e-06
-3e-06,0,3e-06,1e-06,0,0,-5e-06,0,3e-06,-4e-06,3e-06,-5e-06,-7e-06,0,-3e-06,4e-06,2e-06,-7e-06,6e-06,2e-06,2e-06,-9e-06,2e-06,-1e-06,-6e-06,2e-06,-6e-06,1e-06,5e-06,0,0,-2e-06,-3e-06,3e-06,5e-06,-1e-06,-1e-05,0,1e-06,-3e-06,-4e-06,-7e-06,3e-06,-2e-06,0,-1e-06,7e-06,1e-06,3e-06,-1e-06,-4e-06,2e-06,-3e-06,1e-06,-4e-06,-3e-06,-1e-06,-2e-06,8e-06,-4e-06,4e-06,1e-06,-7e-06,7e-06,2e-06,3e-06,6e-06,-1e-05,3e-06,-2e-06,-3e-06,1.1e-05,2e-06,5e-06,-5e-06,-9e-06,6e-06,0,2e-06,-2e-06,-2e-06,2e-06,-1e-06,1e-06,-1e-06,-3e-06,-1e-06,-1e-06,5e-06,-7e-06,-4e-06,5e-06,-4e-06,-1e-06,-3e-06,4e-06,7e-06,-5e-06,2e-06,3e-06,-1e-06,5e-06,3e-06,-1e-06,-1e-06,1e-06,-2e-06,4e-06,-3e-06,-1e-06,-2e-06,5e-06,-6e-06,-6e-06,1e-06,2e-06,2e-06,1e-06,2.1e-05,-2e-06,6e-06
1e-06,0,2e-06,0,5e-06,-2e-06,3e-06,-1e-06,-3e-06,9e-06,4e-06,6e-06,-5e-06,-5e-06,2e-06,-2e-06,2e-06,-3e-06,-1e-06,-1e-06,-2e-06,7e-06,-1e-06,-2e-06,5e-06,-2e-06,3e-06,-2e-06,-6e-06,-1e-06,-2e-06,-1e-06,0,1e-06,2e-06,-1e-06,5e-06,2e-06,2e-06,-2e-06,0,6e-06,-2e-06,2e-06,1e-06,0,-3e-06,0,0,-1e-06,2e-06,0,2e-06,0,1e-06,3e-06,1e-06,-3e-06,-4e-06,0,0,0,9e-06,-5e-06,-3e-06,6e-06,-5e-06,4e-06,-1e-06,0,-1e-06,-6e-06,-2e-06,-2e-06,6e-06,4e-06,0,3e-06,-2e-06,-1e-06,-2e-06,1e-06,2e-06,3e-06,-2e-06,1e-06,-1e-06,-1e-06,7e-06,1e-06,-1e-06,-4e-06,0,-6e-06,-6e-06,-6e-06,1e-06,6e-06,-9e-06,-1e-06,0,-3e-06,2e-06,-1e-06,1e-06,2e-06,1e-06,-1e-06,1e-06,-2e-06,4e-06,2e-06,2e-06,2e-06,2e-06,-4e-06,-1e-05,1e-06,-2e-06,1e-06,-9e-06
-1e-06,0,-1e-06,-2e-06,-2e-06,1e-06,3e-06,-3e-06,2e-06,-5e-06,-2e-06,-6e-06,-2e-06,-1e-06,-2e-06,2e-06,-2e-06,8e-06,-1e-06,0,-3e-06,2e-06,0,0,-1e-06,1e-06,-1e-06,-1e-06,1e-06,-1e-06,0,-2e-06,0,4e-06,-1e-06,0,-4e-06,-2e-06,-1e-06,0,0,4e-06,-2e-06,-3e-06,-1e-06,0,6e-06,1e-06,0,0,-1e-06,0,-1e-06,2e-06,0,-3e-06,-2e-06,1e-06,-4e-06,3e-06,-4e-06,1e-06,5e-06,1e-06,2e-06,-8e-06,4e-06,-3e-06,-3e-06,1e-06,1e-06,-1e-06,2e-06,5e-06,-3e-06,1e-06,-2e-06,-2e-06,3e-06,-6e-06,1e-06,-1e-06,-1e-06,-2e-06,-4e-06,-1e-06,5e-06,-1e-06,-7e-06,-1e-06,0,4e-06,1e-06,-1e-06,1e-06,3e-06,-4e-06,-4e-06,-2e-06,-2e-06,0,0,-7e-06,1e-06,3e-06,1e-06,-5e-06,0,-1e-06,-2e-06,0,-2e-06,-3e-06,-2e-06,-2e-06,2e-06,-5e-06,0,-1.7e-05,-1e-06,5e-06
2e-06,0,-1e-06,0,2e-06,-1e-06,0,0,-1e-06,-1e-06,-2e-06,2e-06,1e-06,-2e-06,1e-06,-1e-06,1e-06,0,-5e-06,-1e-06,-1e-06,-9e-06,0,-1e-06,0,0,-2e-06,0,1e-06,0,2e-06,0,-3e-06,-5e-06,-3e-06,1e-06,-7e-06,1e-06,-2e-06,0,-3e-06,-6e-06,-3e-06,1e-06,-1e-06,-1e-06,-2e-06,-2e-06,-4e-06,1e-06,-5e-06,0,-4e-06,0,2e-06,0,0,1e-06,3e-06,-4e-06,0,2e-06,-3e-06,-1e-06,-1e-06,3e-06,0,8e-06,5e-06,-1e-06,0,-6e-06,-4e-06,-8e-06,4e-06,-2e-06,-3e-06,0,-1e-06,6e-06,1e-06,1e-06,0,-1e-06,-3e-06,-1e-06,-8e-06,-1e-06,4e-06,2e-06,0,-1e-06,1e-06,6e-06,4e-06,2e-06,4e-06,3e-06,2e-06,-1e-06,2e-06,-1e-06,8e-06,-1e-06,-2e-06,-3e-06,3e-06,-5e-06,1e-06,2e-06,-4e-06,-4e-06,0,4e-06,0,-2e-06,-5e-06,0,4e-06,-1e-06,-1.2e-05
1e-06,0,-1e-06,0,0,2e-06,-4e-06,1e-06,1e-06,2e-06,-1e-06,2e-06,2e-06,-2e-06,0,-4e-06,0,-1e-06,-3e-06,1e-06,0,7e-06,3e-06,0,5e-06,0,3e-06,0,-1e-06,-1e-06,0,-1e-06,0,-2e-06,0,0,4e-06,0,2e-06,-3e-06,1e-06,-3e-06,3e-06,0,1e-06,1e-06,-7e-06,1e-06,0,1e-06,5e-06,0,-2e-06,0,0,3e-06,-1e-06,-2e-06,1e-06,3e-06,5e-06,-2e-06,-4e-06,2e-06,0,2e-06,-4e-06,-1e-06,-6e-06,0,1e-06,8e-06,1e-06,8e-06,-5e-06,0,5e-06,0,1e-06,-2e-06,1e-06,-1e-06,0,0,0,2e-06,6e-06,1e-06,-3e-06,-4e-06,0,-1e-06,-2e-06,3e-06,3e-06,0,0,-3e-06,-4e-06,1e-06,0,4e-06,-5e-06,0,-2e-06,1e-06,-3e-06,-3e-06,-1e-06,-3e-06,0,-2e-06,3e-06,-4e-06,-4e-06,3e-06,-2e-06,-1e-06,7e-06,1e-06,6e-06
-1e-06,0,-1e-06,0,-3e-06,-1e-06,1e-06,0,-1e-06,-3e-06,2e-06,-4e-06,3e-06,-1e-06,-1e-06,4e-06,-1e-06,-4e-06,6e-06,-1e-06,0,-2e-06,2e-06,0,-2e-06,1e-06,-4e-06,1e-06,2e-06,1e-06,0,-1e-06,0,0,1e-06,-1e-06,1e-06,-1e-06,1e-06,2e-06,1e-06,4e-06,0,0,0,-1e-06,1e-06,-1e-06,-2e-06,1e-06,-3e-06,1e-06,-1e-06,-2e-06,-2e-06,-3e-06,0,-3e-06,-1e-06,-2e-06,1e-06,1e-06,2e-06,0,1e-06,-1e-06,6e-06,5e-06,4e-06,0,0,0,-3e-06,-4e-06,4e-06,2e-06,-1e-06,-1e-06,-1e-06,0,1e-06,1e-06,1e-06,-1e-06,2e-06,-3e-06,-2e-06,1e-06,2e-06,2e-06,1e-06,3e-06,2e-06,-4e-06,0,-2e-06,-2e-06,2e-06,3e-06,0,-1e-06,-1e-06,6e-06,1e-06,1e-06,2e-06,3e-06,0,-1e-06,1e-06,0,3e-06,-1e-06,0,1e-06,-3e-06,1.1e-05,-1e-06,-1e-06,-1e-06,-1e-06
-1e-06,0,-1e-06,0,4e-06,1e-06,3e-06,-1e-06,1e-06,3e-06,1e-06,4e-06,1e-06,0,0,-1e-06,-1e-06,0,4e-06,0,0,-3e-06,0,0,-2e-06,-1e-06,3e-06,0,-3e-06,2e-06,-2e-06,-2e-06,1e-06,-1e-06,1e-06,-1e-06,0,2e-06,-2e-06,0,-1e-06,3e-06,1e-06,1e-06,1e-06,1e-06,0,-2e-06,3e-06,1e-06,-2e-06,-1e-06,-1e-06,0,1e-06,2e-06,0,0,0,1e-06,-4e-06,0,1e-06,-2e-06,0,0,-5e-06,-5e-06,0,1e-06,0,-2e-06,3e-06,-2e-06,-2e-06,0,-4e-06,1e-06,0,0,1e-06,-3e-06,-1e-06,1e-06,2e-06,2e-06,0,1e-06,-2e-06,1e-06,0,-3e-06,3e-06,-3e-06,-3e-06,2e-06,1e-06,-2e-06,0,0,0,0,-4e-06,-1e-06,0,-1e-06,-2e-06,-3e-06,2e-06,-1e-06,-1e-06,2e-06,0,1e-06,2e-06,1e-06,1e-06,-1e-06,-2e-06,-1e-06,8e-06
1e-06,-1e-06,0,0,0,-1e-06,-3e-06,-1e-06,-1e-06,-2e-06,1e-06,-3e-06,1e-06,3e-06,1e-06,-1e-06,0,6e-06,0,0,0,5e-06,-1e-06,0,-1e-06,0,-4e-06,-1e-06,-1e-06,-1e-06,-1e-06,-1e-06,1e-06,0,2e-06,0,6e-06,-2e-06,0,0,1e-06,-5e-06,1e-06,0,-1e-06,-1e-06,1e-06,3e-06,3e-06,0,1e-06,0,-2e-06,1e-06,1e-06,-2e-06,0,3e-06,0,-1e-06,-2e-06,-1e-06,-1e-06,1e-06,0,-2e-06,2e-06,1e-06,-2e-06,1e-06,0,-4e-06,0,6e-06,2e-06,-3e-06,4e-06,1e-06,-1e-06,0,-2e-06,1e-06,0,1e-06,1e-06,-1e-06,-1e-06,0,3e-06,1e-06,0,2e-06,-1e-06,1e-06,-2e-06,0,-2e-06,2e-06,-3e-06,1e-06,0,-2e-06,-2e-06,0,-1e-06,-1e-06,1e-06,0,0,1e-06,2e-06,0,-1e-06,2e-06,-1e-06,0,7e-06,1e-06,-2e-06,2e-06,-2e-06
1e-06,0,1e-06,0,-4e-06,-1e-06,-1e-06,0,0,0,-2e-06,0,-3e-06,0,-1e-06,2e-06,-1e-06,-1e-06,-3e-06,-1e-06,2e-06,-1e-06,0,0,-1e-06,0,2e-06,0,3e-06,0,1e-06,-1e-06,0,0,-2e-06,1e-06,0,1e-06,2e-06,-1e-06,0,-2e-06,0,-1e-06,0,1e-06,4e-06,-1e-06,1e-06,0,0,0,0,0,-1e-06,2e-06,0,0,-2e-06,2e-06,2e-06,1e-06,5e-06,-1e-06,0,4e-06,0,-6e-06,2e-06,-1e-06,-1e-06,5e-06,1e-06,-6e-06,-3e-06,3e-06,-2e-06,-1e-06,2e-06,-1e-06,-1e-06,-2e-06,1e-06,0,0,0,1e-06,-1e-06,-3e-06,-3e-06,1e-06,-1e-06,0,2e-06,-1e-06,-1e-06,1e-06,-2e-06,5e-06,0,1e-06,2e-06,2e-06,0,0,1e-06,-2e-06,0,0,-1e-06,0,-2e-06,0,-5e-06,0,0,0,0,0,0,-2e-06
0,0,1e-06,0,2e-06,1e-06,1e-06,0,0,3e-06,-1e-06,2e-06,-2e-06,0,0,-2e-06,-1e-06,-1e-06,-4e-06,1e-06,1e-06,-4e-06,0,0,2e-06,0,-1e-06,0,-1e-06,-1e-06,1e-06,0,2e-06,2e-06,-1e-06,0,-4e-06,0,0,1e-06,-1e-06,4e-06,-1e-06,0,0,-1e-06,-1e-06,1e-06,0,-1e-06,-1e-06,0,2e-06,0,0,-1e-06,0,-2e-06,3e-06,-2e-06,2e-06,-1e-06,-2e-06,2e-06,1e-06,-2e-06,-1e-06,2e-06,0,1e-06,1e-06,0,0,5e-06,3e-06,-3e-06,1e-06,1e-06,0,-1e-06,0,1e-06,-1e-06,0,-1e-06,0,-3e-06,0,-2e-06,0,1e-06,0,1e-06,1e-06,3e-06,0,1e-06,1e-06,-2e-06,0,0,1e-06,-1e-06,0,1e-06,0,1e-06,-2e-06,0,0,-1e-06,-2e-06,1e-06,3e-06,-2e-06,-1e-06,-4e-06,0,5e-06,-1e-06,-4e-06
-1e-06,0,1e-06,0,-1e-06,-1e-06,1e-06,0,0,-3e-06,0,-3e-06,0,-2e-06,0,1e-06,0,-3e-06,1e-06,-1e-06,-1e-06,6e-06,-1e-06,1e-06,1e-06,1e-06,0,0,0,-1e-06,0,-1e-06,0,-2e-06,0,-1e-06,1e-06,-1e-06,-1e-06,0,1e-06,3e-06,-1e-06,0,0,0,-1e-06,1e-06,-2e-06,0,-3e-06,0,0,0,-2e-06,-1e-06,0,1e-06,-1e-06,3e-06,-2e-06,0,-1e-06,-3e-06,-1e-06,-2e-06,1e-06,-2e-06,-2e-06,0,0,0,-1e-06,-4e-06,-2e-06,1e-06,-3e-06,-1e-06,0,3e-06,0,-1e-06,1e-06,0,0,0,3e-06,0,3e-06,1e-06,-2e-06,1e-06,0,-2e-06,2e-06,1e-06,-1e-06,-1e-06,1e-06,0,0,-1e-06,1e-06,0,0,-1e-06,-1e-06,-1e-06,-1e-06,0,0,1e-06,0,0,1e-06,1e-06,-3e-06,0,0,1e-06,1e-06
0,0,0,0,0,1e-06,-1e-06,-1e-06,0,1e-06,2e-06,3e-06,0,1e-06,1e-06,0,0,1e-06,1e-06,1e-06,0,-3e-06,-1e-06,-1e-06,-2e-06,-1e-06,1e-06,0,1e-06,1e-06,-1e-06,0,0,0,1e-06,0,-2e-06,1e-06,1e-06,1e-06,0,-4e-06,0,0,0,0,0,-1e-06,0,0,3e-06,0,-2e-06,1e-06,0,2e-06,0,1e-06,0,-2e-06,-2e-06,0,-3e-06,2e-06,1e-06,2e-06,0,6e-06,2e-06,-2e-06,0,-5e-06,0,3e-06,2e-06,-1e-06,2e-06,-1e-06,-1e-06,-2e-06,2e-06,2e-06,0,0,1e-06,1e-06,-4e-06,1e-06,-1e-06,0,0,-2e-06,0,-1e-06,1e-06,0,0,0,3e-06,0,0,0,-1e-06,-1e-06,-1e-06,0,0,-1e-06,1e-06,0,-1e-06,2e-06,-2e-06,0,0,0,-6e-06,0,-8e-06,0,-1e-06
1e-06,0,0,0,2e-06,-1e-06,-2e-06,-1e-06,-1e-06,0,0,-1e-06,0,2e-06,-1e-06,1e-06,0,3e-06,1e-06,0,0,-1e-06,0,1e-06,-1e-06,0,-2e-06,0,-2e-06,1e-06,0,0,0,-2e-06,0,0,-4e-06,-1e-06,1e-06,0,-1e-06,-2e-06,0,1e-06,0,0,-3e-06,1e-06,0,0,-2e-06,0,0,0,1e-06,-3e-06,1e-06,0,1e-06,1e-06,2e-06,0,5e-06,-2e-06,-1e-06,0,0,-1e-06,-1e-06,1e-06,0,3e-06,-1e-06,-4e-06,-3e-06,1e-06,0,1e-06,0,-1e-06,1e-06,-1e-06,0,1e-06,1e-06,-1e-06,3e-06,0,0,-1e-06,2e-06,1e-06,1e-06,1e-06,-2e-06,-1e-06,1e-06,0,-3e-06,0,0,0,-1e-06,0,1e-06,1e-06,0,0,-1e-06,-2e-06,0,1e-06,1e-06,-2e-06,1e-06,0,-1e-06,0,2e-06,-1e-06,5e-06
0,0,-1e-06,0,-2e-06,0,1e-06,0,1e-06,-1e-06,-1e-06,-1e-06,1e-06,1e-06,1e-06,1e-06,0,-2e-06,0,0,-1e-06,3e-06,1e-06,0,0,0,2e-06,0,1e-06,0,0,0,-1e-06,1e-06,-1e-06,0,4e-06,0,-1e-06,0,1e-06,5e-06,0,-1e-06,0,0,0,0,1e-06,0,-3e-06,0,2e-06,-1e-06,0,2e-06,0,-2e-06,-2e-06,0,2e-06,0,-2e-06,3e-06,0,-1e-06,-1e-06,3e-06,0,0,0,1e-06,0,4e-06,3e-06,-1e-06,-1e-06,1e-06,0,0,0,2e-06,0,0,1e-06,0,-2e-06,1e-06,-1e-06,-1e-06,0,-1e-06,-1e-06,1e-06,-2e-06,0,-1e-06,-1e-06,0,0,0,2e-06,1e-06,0,1e-06,0,-1e-06,1e-06,-1e-06,1e-06,1e-06,-2e-06,-1e-06,3e-06,0,0,1e-06,0,7e-06,1e-06,0
0,0,-1e-06,0,0,0,1e-06,0,-1e-06,2e-06,-1e-06,3e-06,1e-06,-1e-06,0,-3e-06,0,-1e-06,-3e-06,0,-1e-06,-1e-06,0,0,-1e-06,0,-1e-06,0,0,0,1e-06,1e-06,0,0,-1e-06,0,1e-06,1e-06,-1e-06,0,0,0,0,0,0,0,2e-06,-1e-06,1e-06,1e-06,3e-06,0,0,0,-1e-06,-1e-06,1e-06,0,0,-1e-06,-1e-06,0,3e-06,-3e-06,0,-1e-06,1e-06,-4e-06,1e-06,-1e-06,0,0,0,-2e-06,-1e-06,1e-06,-1e-06,0,0,2e-06,0,0,0,0,-1e-06,0,2e-06,0,1e-06,2e-06,-2e-06,0,-1e-06,0,-1e-06,1e-06,0,1e-06,1e-06,0,0,-2e-06,0,-1e-06,0,-1e-06,1e-06,1e-06,1e-06,0,0,-2e-06,3e-06,-2e-06,-1e-06,1e-06,6e-06,0,-3e-06,0,2e-06
-1e-06,0,-1e-06,0,2e-06,0,-1e-06,0,1e-06,-3e-06,0,-3e-06,0,-2e-06,0,2e-06,0,-2e-06,1e-06,0,1e-06,-2e-06,0,0,0,0,0,0,-2e-06,0,0,0,-1e-06,-1e-06,0,0,0,-1e-06,1e-06,0,0,-4e-06,0,0,0,0,0,1e-06,0,0,-2e-06,0,-1e-06,0,-1e-06,0,-1e-06,2e-06,1e-06,2e-06,-3e-06,0,-3e-06,2e-06,0,1e-06,-2e-06,0,-2e-06,1e-06,0,-3e-06,0,-1e-06,1e-06,0,1e-06,1e-06,0,-1e-06,-1e-06,1e-06,0,0,-1e-06,0,-1e-06,0,0,1e-06,1e-06,0,1e-06,-1e-06,2e-06,0,1e-06,-2e-06,-4e-06,0,0,0,0,0,-1e-06,0,-1e-06,1e-06,-1e-06,-2e-06,0,0,-2e-06,2e-06,0,-1e-06,2e-06,0,-4e-06,-1e-06,-4e-06
1e-06,0,0,0,-2e-06,0,0,0,-1e-06,1e-06,1e-06,2e-06,0,0,-1e-06,0,0,2e-06,2e-06,0,0,4e-06,0,0,1e-06,0,0,0,1e-06,-1e-06,0,1e-06,0,1e-06,1e-06,0,4e-06,1e-06,0,-1e-06,0,0,0,0,0,-1e-06,2e-06,-1e-06,-1e-06,0,-2e-06,0,1e-06,0,0,0,0,0,0,-2e-06,1e-06,1e-06,3e-06,-2e-06,0,1e-06,2e-06,-5e-06,2e-06,-1e-06,0,1e-06,0,4e-06,-2e-06,-1e-06,1e-06,-1e-06,0,0,-1e-06,-1e-06,0,0,-1e-06,0,1e-06,0,0,0,1e-06,0,0,-1e-06,2e-06,-1e-06,-1e-06,2e-06,3e-06,0,0,-1e-06,1e-06,0,0,0,1e-06,0,0,0,0,2e-06,-1e-06,-1e-06,0,0,4e-06,0,4e-06,1e-06,-2e-06
1e-06,0,0,0,0,0,1e-06,-1e-06,1e-06,1e-06,1e-06,1e-06,-1e-06,0,1e-06,-1e-06,0,3e-06,1e-06,0,-1e-06,-2e-06,0,1e-06,0,0,-2e-06,0,0,0,0,1e-06,1e-06,0,1e-06,0,-2e-06,0,-1e-06,1e-06,0,4e-06,0,0,0,0,-1e-06,0,0,0,1e-06,0,2e-06,0,0,-1e-06,-1e-06,-2e-06,0,2e-06,2e-06,0,-5e-06,2e-06,0,-2e-06,0,3e-06,-1e-06,0,0,2e-06,0,-5e-06,3e-06,2e-06,-3e-06,0,0,0,0,0,0,0,0,0,-2e-06,0,0,-2e-06,-1e-06,0,-2e-06,0,1e-06,2e-06,0,-2e-06,0,0,0,2e-06,-3e-06,0,1e-06,0,-2e-06,1e-06,0,1e-06,0,1e-06,0,1e-06,0,0,0,0,2e-06,0,0
0,0,0,0,1e-06,0,0,0,-1e-06,-2e-06,0,-2e-06,0,1e-06,0,1e-06,0,-2e-06,-1e-06,0,0,0,0,0,0,0,2e-06,0,-1e-06,0,0,1e-06,0,0,-1e-06,0,-3e-06,-1e-06,0,0,0,0,0,0,0,-1e-06,-1e-06,1e-06,0,0,0,0,0,0,0,2e-06,0,0,1e-06,-2e-06,0,0,4e-06,-2e-06,0,0,-2e-06,-1e-06,0,0,0,0,0,4e-06,-2e-06,-1e-06,1e-06,0,0,1e-06,1e-06,-1e-06,0,0,1e-06,0,3e-06,0,-1e-06,1e-06,0,0,-1e-06,0,-1e-06,0,0,2e-06,-2e-06,0,0,-1e-06,3e-06,0,0,0,1e-06,0,0,-1e-06,0,-1e-06,-1e-06,-2e-06,-1e-06,0,-6e-06,0,-2e-06,0,1e-06
