-0.001343,-0.001051,-0.000665,-0.000466,-0.00098,-0.000266,-0.00052,-0.000904,-0.000902,-0.001088,-0.000779,-0.000902,-0.001472,-0.001236,-0.00086,-0.000914,-0.001316,-0.001192,-0.001083,-0.001328,-0.000953,-0.00066,-0.000895,-0.000843,-0.000596,-0.000389,-0.001083,-0.000805,-0.000976,-0.000671,-0.000499,-0.000523,-0.000879,-0.001294,-0.00122,-0.000678,-0.000909,-0.001278,-0.000913,-0.001275,-0.001527,-0.001542,-0.000668,-0.000967,-0.000876,-0.001043,-0.000986,-0.001081,-0.000593,-0.000213,-0.000405,-0.000695,-0.000803,-0.000862,-0.000786,-0.000633,-0.000756,-0.000891,-0.001033,-0.001108,-0.001417,-0.001111,-0.000713,-0.000618,-0.000161,-0.00101,-0.000959,-0.000642,-0.001127,-0.000511,-0.000641,-0.000689,-0.000874,-0.000688,-0.000304,-0.000323,-0.000556,-0.000732,-0.000407,-0.000472,-0.000908,-0.001359,-0.000948,-0.000846,-0.000726,-0.001184,-0.000793,-0.000507,-0.00026,-9.5e-05,-0.000499,-0.000287,-2.7e-05,-0.000463,-0.00061,-0.001006,-0.000967,-0.000574,-0.000827,-0.000424,-0.000753,-0.001089,-0.000848,-0.000959,-0.000573,-0.000711,-0.000789,-0.000495,-0.000824,-0.000488,-0.000421,-0.000236,-0.000432,-0.000637,-0.000587,-0.000572,-0.000238,-0.000928,-0.000479,-0.00057,-0.000823
0.000204,0.00037,0.000228,8.8e-05,-2e-05,2.6e-05,-0.000297,0.000509,0.000428,0.000342,0.000386,8.3e-05,0.000374,4.5e-05,0.00014,0.000335,0.000219,4.8e-05,3.2e-05,0.000537,0.000341,0.000145,0.000174,0.000292,0.000119,0.000123,0.000923,0.000343,0.000555,0.000106,-5e-05,0.00055,0.000463,0.001033,0.000575,0.000271,-0.000141,0.000371,-0.000183,0.000656,0.001004,0.001252,0.000518,0.000411,-4.7e-05,0.000773,0.000507,4.1e-05,-0.000191,-7.2e-05,4.8e-05,0.000177,0.000591,0.000304,0.000427,0.000113,0.000373,0.000314,0.00037,-6e-06,0.000957,0.000298,0.000398,0.000413,-0.000266,-4.4e-05,7e-06,9.5e-05,0.000674,-0.000135,7.4e-05,8e-06,0.00065,0.000306,0.000275,0.000257,0.000299,0.000289,-0.000224,-0.000236,-0.000198,0.000592,0.000369,0.00018,0.000141,0.000339,0.000597,0.000577,-0.000146,-0.000155,0.000356,0.00031,-7.6e-05,0.00015,-0.000182,0.000524,0.000433,2.9e-05,0.000376,0.000247,0.000122,0.000553,-1e-04,0.000458,0.000287,0.000418,0.000303,0.000211,0.000162,0.000164,0.000285,-0.000314,2.5e-05,0.000152,-7.8e-05,5e-05,4.9e-05,4e-05,-0.000244,6.4e-05,0.00018
-9e-06,-0.000679,-0.000451,0.000109,-0.000383,-0.000123,-0.000178,-0.000358,-0.000285,-0.000279,-0.000196,-0.000166,4.3e-05,-6.3e-05,-2.5e-05,-6.6e-05,0.00016,0.000327,-0.000359,-0.00046,-7.3e-05,0.000241,0.000312,3.7e-05,-0.000143,-0.000147,-0.000536,-0.000218,-0.000399,-0.000387,0.000155,-0.000322,-0.000452,-0.000635,-0.00027,-8.3e-05,0.000296,7.8e-05,0.000447,-0.000374,-0.000991,-0.000543,-6.1e-05,4.9e-05,4.1e-05,-0.000603,-4.3e-05,-7.6e-05,-0.000147,2.2e-05,-5.2e-05,0.000125,-0.000162,0,-0.000592,-0.000447,-0.00035,-0.000131,-0.000139,6.7e-05,-0.000549,-4.4e-05,-0.000125,-0.000183,5.7e-05,0.000187,0.000129,4.8e-05,-8.6e-05,-0.000327,-7.4e-05,-0.000121,-0.000241,-0.000352,-0.000732,-0.000591,-0.000373,-0.00011,6e-05,0.000112,-0.00031,-0.000561,-0.000572,-3.5e-05,-0.000515,1.8e-05,-0.000401,-0.000115,-0.000431,-0.000377,-9.3e-05,-0.000298,-0.000181,-0.00044,1.8e-05,-0.000252,-0.000439,-0.000134,-0.00044,-0.000144,-4.1e-05,-0.00038,1e-05,-0.000322,-0.000169,-0.000488,-0.000206,-0.000142,0.000152,-0.000488,-0.000308,-0.000167,-3.1e-05,-0.000203,5.9e-05,-0.000344,-0.000419,-4.4e-05,-0.00029,-0.000337,-0.000114
-0.000312,0.000461,0.000126,-0.000219,0.000465,3e-05,-0.000126,4.4e-05,6.9e-05,-2.4e-05,0.000351,0.00031,-0.000347,0.000163,0.000479,-2.1e-05,-0.00034,-0.000499,0.000524,0.000209,3.3e-05,-0.000329,-0.000125,4e-05,-5.1e-05,-0.000273,0.000271,5.6e-05,0.000294,0.000103,5.4e-05,3e-06,0.00031,0.00027,-0.000171,-7.7e-05,5e-06,-0.000207,-0.000184,0.000109,0.000731,0.000326,0.000143,-9.7e-05,6.4e-05,0.000406,-0.000168,-0.00025,0.000154,1.5e-05,0.00014,-0.000258,-1.4e-05,-5e-05,0.000399,6.2e-05,0.000149,-6.4e-05,-5.5e-05,-0.000105,0.000384,-0.000138,0.000135,0.000235,0.000351,-7e-06,-4.6e-05,0.000137,0.000163,0.000244,0.000167,0.000298,0.000101,-0.000296,7.3e-05,0.000378,0.000222,6.7e-05,-0.000193,-9.1e-05,0.000164,0.000505,0.000473,0.000182,0.000127,-0.000435,4.6e-05,0.000176,-4.2e-05,0.000194,0.00023,-1e-06,-0.000237,-4.1e-05,0.000123,4.8e-05,0.000292,0.000408,0.000629,0.000371,0.000324,0.000371,0.000284,-9.7e-05,0.000432,0.000357,-4.1e-05,0.000155,-0.000446,0.00017,0.000402,0.000253,6.1e-05,0.000119,0.000174,0.000291,0.000314,8.7e-05,9.7e-05,5.9e-05,0.000119
0.000165,3.6e-05,7e-06,-0.000187,-6.9e-05,-3.4e-05,0.000494,0.000176,-0.000286,-0.000118,-0.000392,-0.000118,0.000427,0.000105,-0.000428,3.6e-05,0.000266,0.000367,-7.1e-05,5.2e-05,1.1e-05,-6.9e-05,0.000206,-9.1e-05,-0.000118,0.000149,1.9e-05,0.00014,-0.00043,0.000115,0.00038,8e-05,0.000127,-0.000283,-0.000202,0.000155,-5.7e-05,4.2e-05,-2.1e-05,-0.000121,-0.000308,8.6e-05,-0.000263,0.000259,0.000283,7.1e-05,0.000152,0.000337,0.000191,0.000177,0.000241,0.000223,-0.000282,0.000108,-0.000207,0.000214,4.7e-05,-1e-05,2.2e-05,8.9e-05,-0.000291,0.000169,-0.000159,-6.3e-05,2.9e-05,-0.000259,-7.7e-05,-0.000317,-6.8e-05,-0.000143,-0.000367,-0.000334,0.000206,1.8e-05,-4.6e-05,0.000124,0.000184,-0.000118,0.00014,-0.000178,-0.000189,-0.000507,-0.000321,9.2e-05,-0.000134,0.000232,4.9e-05,7.4e-05,6.3e-05,-6.9e-05,-2.1e-05,-0.000215,0.000138,3.4e-05,-0.000107,0.000123,-0.000143,-0.000353,-9e-06,-0.000139,-0.000232,-0.000346,-0.000173,9.8e-05,0.000164,-0.000474,-6.5e-05,0.000193,0.000206,5.1e-05,1.1e-05,-0.000143,0.000397,0.000105,0.000106,-0.000105,-3.7e-05,6e-06,1.6e-05,5.2e-05,-0.00011
-0.000288,-5.2e-05,-0.000174,0.000154,-0.000216,-2.6e-05,-0.000113,-0.000161,0.000225,0.000358,0.000328,0.000157,-4e-06,-0.000377,4.8e-05,-0.000317,-0.000141,-0.000491,-0.000439,-0.000151,0.000119,2.5e-05,-0.00034,-0.000259,0.000147,5.6e-05,-9.3e-05,-5e-05,0.000264,9.7e-05,-0.00025,-0.000182,-0.000312,7.8e-05,8.3e-05,-0.000292,-6e-05,2.9e-05,0.000213,0.000144,4.5e-05,-8.3e-05,-1.8e-05,-0.00032,-0.000313,-6e-05,-2e-05,-0.000155,-0.000462,-0.00027,-0.000117,-0.000162,7.9e-05,-0.000317,2.2e-05,-5.7e-05,-0.000233,0.000302,-1.8e-05,-1e-04,0.000329,-0.000159,8.6e-05,1e-05,-2.5e-05,7.6e-05,5.1e-05,0.000159,0.000216,-0.000229,3.1e-05,-1.4e-05,-0.000218,0.000128,0.000103,0.000182,-0.000197,5.8e-05,-4.6e-05,1e-04,1.9e-05,0.000515,0.000187,4.1e-05,0.000248,-3.6e-05,4.2e-05,9.2e-05,-2e-05,-0.000207,0.000394,5.4e-05,-6.2e-05,0.000115,0.000209,3.9e-05,0.000221,0.000304,9.3e-05,-9.6e-05,0.000323,6.3e-05,-3.4e-05,-5.7e-05,-1e-06,7.3e-05,2e-06,-0.000103,-6e-05,8.4e-05,-7.3e-05,-4.4e-05,8e-05,-0.000106,-0.000118,-3e-05,0.000127,6.9e-05,4.9e-05,-0.000177,7.6e-05
0.000301,0.000295,-5e-05,-0.000114,0.00014,0.000222,6.8e-05,-0.000328,-4.7e-05,-0.000102,-9e-06,6.8e-05,-3.7e-05,0.000348,0.000378,0.00014,0.000256,0.000282,0.000407,0.000235,-3.3e-05,-0.000177,0.00021,0.000435,0.000125,-0.000159,-0.000122,0.000246,-6.5e-05,-0.000109,0.000115,-3.4e-05,-0.000128,-0.000244,9.6e-05,-4.9e-05,-5.8e-05,0.000142,-0.000336,-0.000265,-4.8e-05,0.000239,-1.8e-05,7.9e-05,0.000277,8.8e-05,0.000139,7e-05,0.000362,-4e-06,-0.000137,2.7e-05,-7e-05,0.000287,9e-06,-6e-05,-7.2e-05,-0.00014,-1e-06,0.000219,-0.000137,5.7e-05,-3.8e-05,0.00013,-1.4e-05,1e-05,0.000119,-4.1e-05,-8e-05,-3.8e-05,9.4e-05,-0.000106,0.000204,-0.000141,-0.000215,-0.000101,0.000165,-9.4e-05,5.8e-05,0.000123,0.000137,-0.000283,-0.000239,-5.8e-05,-4.9e-05,0.000118,-5.9e-05,-0.000181,8e-06,-0.000109,-0.000159,-1.5e-05,-0.000203,-6.3e-05,2.5e-05,-0.000238,-0.000133,2.2e-05,-3e-06,-0.000334,-0.000184,8.3e-05,0.000245,0.000293,-0.000123,1.2e-05,0.000284,1.5e-05,0.000101,-6.1e-05,0.00013,8.4e-05,-0.000114,-5.2e-05,0.000153,0.000146,-5.1e-05,-3.1e-05,9.5e-05,-4.1e-05,9.1e-05
-0.00017,-0.000184,-4.5e-05,0.000266,-9e-05,-0.00017,7.4e-05,0.000324,-0.000208,-9.3e-05,-1.9e-05,-0.000115,-0.000184,-8.4e-05,-0.000523,2e-06,-0.000228,-4.7e-05,-0.000363,-7.3e-05,-0.000189,8.2e-05,-9.8e-05,-0.000323,-0.000175,-0.000102,4.5e-05,-0.000124,-0.000206,8.4e-05,-8.1e-05,-0.000249,-9.8e-05,4.5e-05,2.6e-05,-9.5e-05,1.5e-05,-0.000148,0.000209,0.000118,2.6e-05,-0.000177,-0.000116,-4.3e-05,-2.8e-05,-0.000131,-1.1e-05,-1.4e-05,-0.000292,3.2e-05,0.00015,-7.2e-05,-9.4e-05,-9.8e-05,-9.1e-05,-0.000195,1.9e-05,4.4e-05,4.9e-05,-0.000239,-6.4e-05,-4.2e-05,-1.3e-05,3e-05,-9.2e-05,-3.1e-05,-0.000137,-6e-05,-4.1e-05,2.4e-05,-0.000105,1.6e-05,-0.000146,-4.5e-05,-1.3e-05,-0.00011,-8.1e-05,-5.2e-05,-1.6e-05,-6.7e-05,-0.000154,-3.3e-05,0.000322,-5.8e-05,-0.000239,-9.6e-05,-9.2e-05,0.000113,-8.3e-05,0.000122,-8.7e-05,-0.000283,-8.5e-05,6.4e-05,-0.000109,0.000135,-0.000196,-0.000238,4.1e-05,0.000232,-9e-06,-0.00013,-0.000133,-0.000102,3.9e-05,1e-04,-0.00023,-4.1e-05,-9.2e-05,-2.2e-05,8.4e-05,1.1e-05,5.2e-05,-0.000146,-0.000186,-1.6e-05,3.2e-05,4.7e-05,-0.000175,0.000176,-0.000132
-3.5e-05,1e-05,0.000228,-0.000194,-7e-05,-0.000193,-0.000103,-9.9e-05,0.000108,-8.7e-05,-6.4e-05,-7.2e-05,0.000166,1e-06,0.000219,-0.000165,0.000148,-3.3e-05,8.6e-05,-1.5e-05,0.000163,-3.7e-05,4e-06,-1.9e-05,0.000211,3.1e-05,-2e-05,0.000281,8e-06,-0.000204,6.4e-05,0.000215,-4e-06,-6.1e-05,0,0.000151,-0.000209,4.2e-05,-2.5e-05,0.000101,-9e-06,4.6e-05,7.1e-05,4e-06,8.6e-05,9e-06,-8e-06,-0.00014,0.000183,0.000272,-0.000141,0.00011,0.000182,0.000139,7.4e-05,0.000219,9e-05,2e-05,2.3e-05,0.000136,7.9e-05,8.4e-05,0.000183,-5.6e-05,-5.8e-05,-1.1e-05,-1e-06,5.3e-05,1.6e-05,-1.8e-05,-8.2e-05,-0.000168,-4.3e-05,-4.9e-05,-0.00034,-0.000145,0.000106,6.7e-05,-1.3e-05,-0.000191,0.000125,-0.000114,-0.000224,-6.5e-05,0.000161,0.000181,0.000157,-0.000259,3e-05,9.7e-05,-2.1e-05,4.8e-05,-7.7e-05,5.5e-05,7e-06,7e-06,6.4e-05,0.000177,-4.8e-05,-3.2e-05,-4.4e-05,-0.000124,0.000115,2.1e-05,-9e-05,2e-06,5.6e-05,2.8e-05,-0.000138,-1e-06,0.000137,-8.7e-05,6.1e-05,-2.3e-05,0.000111,-7.7e-05,-4.4e-05,2.7e-05,0.000126,-0.00014,3e-05
-2.1e-05,2.9e-05,-7.2e-05,0.000141,0.000143,0.000251,7e-05,9.5e-05,7.5e-05,1.3e-05,5.4e-05,0.000236,-0.000205,7.4e-05,-0.000196,7.2e-05,-5.5e-05,-4e-05,-7.3e-05,-3e-06,9.7e-05,5.3e-05,1e-05,-4.8e-05,-7.4e-05,-2e-06,-2.2e-05,-0.00011,-4.2e-05,6.7e-05,-1.7e-05,-7.7e-05,0.000107,3.6e-05,5.6e-05,-0.000111,0.000111,4e-06,8.5e-05,-0.00023,-1.5e-05,-0.000115,-0.000166,-0.000128,-0.000139,-6.9e-05,-2.7e-05,0.000134,-1.3e-05,-4.1e-05,1e-06,-8.6e-05,-0.000146,-0.000108,-5.6e-05,-0.000216,-8.2e-05,1.2e-05,3.1e-05,-8.6e-05,-3.3e-05,-0.000111,-0.000138,2e-06,-1.7e-05,0.000129,0.000157,-1.5e-05,-4.2e-05,3.7e-05,-2.8e-05,0.000143,0.000154,0.000181,8.9e-05,-1e-05,-0.000139,-6.9e-05,-6.7e-05,2.8e-05,7.4e-05,2e-05,2.1e-05,-2.4e-05,7.6e-05,-0.000284,-7e-06,-5.1e-05,1.2e-05,0.000119,-4.8e-05,-1e-04,-7.4e-05,-1.3e-05,0.000184,1e-05,3e-06,-0.000106,8.1e-05,-6.8e-05,-7.3e-05,-6e-06,-1.7e-05,-2.5e-05,-5e-05,-2.7e-05,-0.000108,-2e-06,5.5e-05,-4e-05,-0.000141,-8.2e-05,2.7e-05,6.6e-05,-0.00011,-7e-05,-3.1e-05,-3.8e-05,9e-06,3e-05,-3.1e-05
7.4e-05,-4e-06,1.9e-05,1e-06,-5.1e-05,-1.7e-05,-7.4e-05,-0.000158,-9e-06,-0.000146,-4.7e-05,-0.000161,0.000117,-0.00013,9.1e-05,-7e-06,-4.2e-05,1.7e-05,-3.6e-05,3.3e-05,-9.7e-05,-0.000118,2e-06,-3e-06,2.8e-05,-5.2e-05,-5e-06,-1.3e-05,7.7e-05,1.4e-05,-4e-06,-6.5e-05,-0.000115,7.3e-05,-2.3e-05,0.000101,-0.000136,2.1e-05,-0.000187,1.8e-05,-8.3e-05,0.000108,7.3e-05,7.3e-05,6e-05,4e-05,-2.9e-05,-0.000109,-6.8e-05,-6.1e-05,-1.8e-05,-0.000109,-1.4e-05,0.000237,1e-04,0.00016,-9e-06,-1e-05,-2.8e-05,3.4e-05,6.3e-05,0.000142,0.000113,2.1e-05,1e-05,0,-7.6e-05,-5e-05,-4.7e-05,-1.4e-05,0.000134,7e-06,7e-06,-0.000156,6.2e-05,-5e-05,6e-06,-1.6e-05,-7e-05,8e-05,-2.5e-05,2.9e-05,9e-05,4.9e-05,-1e-05,0.000194,5.8e-05,4.7e-05,-3.9e-05,-0.000133,-3.1e-05,8e-06,0.000136,8e-05,-9.1e-05,-7e-05,-8.2e-05,8e-05,3e-06,-0.000123,0.000212,-6.7e-05,0.000112,8.1e-05,3.1e-05,5.9e-05,2e-05,1e-05,-5e-06,-1e-06,-2e-06,3.9e-05,-0.00011,-0.000108,2.6e-05,9e-06,-4e-06,-1.5e-05,-2e-06,3e-06,1e-06
-2.1e-05,-2e-06,6.6e-05,1.1e-05,5.3e-05,-0.000116,3.4e-05,-3e-06,1.9e-05,6.1e-05,2.5e-05,4e-05,-2.9e-05,-1.8e-05,-8.6e-05,-7.1e-05,4.4e-05,7.2e-05,0.000108,-3.1e-05,4.1e-05,7.1e-05,-3.1e-05,-1.9e-05,-0.000172,9.6e-05,-2.5e-05,5.6e-05,-0.000122,-9.1e-05,-2e-05,3.4e-05,4.5e-05,-7.3e-05,7e-06,-7.7e-05,0.000102,8.5e-05,1e-04,0.000124,7.5e-05,2e-06,-8.1e-05,2.5e-05,2.3e-05,-7.2e-05,8.3e-05,0.000135,1.8e-05,0.000132,0.000103,2.8e-05,-1.3e-05,-9.8e-05,-5.6e-05,-0.000127,-0.000102,-7.8e-05,4.1e-05,2.3e-05,-6.9e-05,-0.000146,-0.000124,-9e-06,-6.1e-05,1.8e-05,1.2e-05,2.7e-05,8e-06,-5.6e-05,-8.5e-05,-6.9e-05,2e-05,0.000133,-0.000127,-1.8e-05,-4.8e-05,-5.2e-05,1e-05,-1.1e-05,-1.9e-05,-9.4e-05,6.3e-05,2e-06,-3e-05,-0.000164,-8.1e-05,-4.2e-05,7.3e-05,-3.3e-05,-5.3e-05,8.3e-05,-5e-06,-1.4e-05,1e-06,3.7e-05,1.7e-05,-1.4e-05,-0.00011,2.7e-05,-0.000163,4.2e-05,-1.4e-05,-1e-05,-1.1e-05,-2.4e-05,-4.4e-05,4.3e-05,-2.3e-05,-2.1e-05,-5.8e-05,0,7.3e-05,-5e-05,-8.4e-05,-3.7e-05,-7e-06,4.8e-05,-3.1e-05,-5.5e-05,-0.000117
-2e-06,-3.3e-05,-9.2e-05,7e-06,-2e-05,-0.000127,-9e-05,-3.6e-05,-0.00013,4e-05,7.5e-05,1.5e-05,-8e-06,0.000115,-4.7e-05,9e-06,-1.2e-05,-4.8e-05,-6.6e-05,-6.1e-05,3.2e-05,-6e-05,3e-05,-5.5e-05,6.9e-05,-0.000105,-4e-05,-3e-05,0.000144,1.5e-05,2.3e-05,-1.3e-05,-6e-06,5.1e-05,-2.9e-05,4.4e-05,7.1e-05,-1.4e-05,-1.1e-05,-0.000124,-5.3e-05,-1.9e-05,1.7e-05,-5.7e-05,3.1e-05,5.5e-05,-2.9e-05,-2.5e-05,-2.3e-05,-5.1e-05,2e-06,6.9e-05,3.6e-05,5.6e-05,-1.1e-05,0.000106,4.5e-05,-3.2e-05,1.4e-05,-6.3e-05,3.8e-05,2.4e-05,3e-05,-5.9e-05,2.7e-05,-2.2e-05,-2.3e-05,3.6e-05,9e-06,4.9e-05,1.2e-05,5.8e-05,-6.3e-05,-0.000115,8e-05,-2.6e-05,2.9e-05,-4e-06,-8e-06,-1.3e-05,-3e-05,0.000101,-8.1e-05,8.7e-05,1.1e-05,8.4e-05,2.2e-05,3.9e-05,-5.4e-05,-9.3e-05,1.1e-05,-1.3e-05,-2.9e-05,-1.7e-05,-6.1e-05,-5.6e-05,-4e-06,-5.1e-05,9.5e-05,-1.8e-05,2.4e-05,1.3e-05,-5.2e-05,-1.7e-05,-0.000131,8.7e-05,2.8e-05,-0.000117,0,-2.1e-05,3.2e-05,-4e-06,-5.7e-05,6e-05,3.9e-05,-2.8e-05,-9e-06,-1.6e-05,-6.3e-05,-2.7e-05,6.3e-05
7.3e-05,-2e-05,5.9e-05,-1e-04,-2.7e-05,0.000122,6.9e-05,-1.6e-05,6.4e-05,-7e-05,-9.7e-05,-2.9e-05,-3.6e-05,-1.3e-05,6.3e-05,5.1e-05,-4.2e-05,8e-06,-7e-06,5.6e-05,-3.3e-05,2.3e-05,-8.9e-05,3.9e-05,9e-06,3.4e-05,0,-5.3e-05,-3.4e-05,-7e-06,-5e-06,9e-06,4.8e-05,0.000102,-3.8e-05,-5.6e-05,-0.000127,4.7e-05,-1.7e-05,9.4e-05,-3.1e-05,-3.5e-05,-3.5e-05,5.3e-05,-2e-05,-2.8e-05,-3.5e-05,3.7e-05,-4.7e-05,-2e-06,-4.8e-05,-3e-05,-3.7e-05,-1.5e-05,-2.6e-05,-7e-05,-1.2e-05,4.7e-05,2.3e-05,2.9e-05,-1.6e-05,8e-06,-4.3e-05,4.8e-05,3.5e-05,-1.3e-05,3.8e-05,-4e-05,2.6e-05,1.7e-05,-3.4e-05,-1.3e-05,0.000113,4.2e-05,-1.3e-05,2.2e-05,-1.9e-05,2.5e-05,2e-05,-2.1e-05,9e-05,-3.2e-05,3.6e-05,-0.000102,3.1e-05,-4.3e-05,-1.3e-05,-4e-05,-8e-06,5.1e-05,9.8e-05,-2.7e-05,8.1e-05,3.1e-05,-3e-06,1.3e-05,2.2e-05,-3.2e-05,-8.2e-05,-1.3e-05,-2e-05,-8.5e-05,2.8e-05,1.4e-05,0.000121,-2.1e-05,1.2e-05,3e-05,-5e-06,-8e-06,3.5e-05,-3.5e-05,-6.3e-05,-2.5e-05,4e-05,-4e-05,-9e-06,-9e-06,3.7e-05,4.4e-05,-1.2e-05
-1.9e-05,5.9e-05,5.6e-05,7.7e-05,3.7e-05,-4e-06,-2.5e-05,5.3e-05,3.9e-05,4.4e-05,8e-06,3.6e-05,7e-06,-6.1e-05,-2.4e-05,-4e-05,4.9e-05,-3.6e-05,3.2e-05,-0.000117,-1.2e-05,1.3e-05,6.5e-05,-3e-05,-8.5e-05,-4.7e-05,5e-06,-1.5e-05,8e-05,1.8e-05,5e-05,3e-06,-8.9e-05,1.6e-05,-1e-06,3.7e-05,9.4e-05,4.8e-05,8e-06,-9.3e-05,5.6e-05,1e-06,4e-05,-4.3e-05,5.7e-05,1e-06,6e-06,-1.6e-05,9.9e-05,4.7e-05,-3.3e-05,2.6e-05,-6e-06,-6.2e-05,-3.9e-05,2.9e-05,3.4e-05,-1.6e-05,-1.2e-05,5.3e-05,-1.3e-05,6e-06,1e-05,-8e-06,-3.4e-05,2.9e-05,-4.8e-05,2.1e-05,-3.2e-05,-2.7e-05,1.5e-05,-1e-06,-4.3e-05,-3.7e-05,-1.4e-05,-1.5e-05,4.4e-05,-3.7e-05,-8e-06,1.3e-05,5e-06,4.1e-05,-2.7e-05,6.6e-05,-3.5e-05,-2.7e-05,-4e-06,3.6e-05,2.3e-05,-4.1e-05,3.5e-05,-2.1e-05,-5.7e-05,-3.1e-05,4.6e-05,4.4e-05,-7e-06,-6.7e-05,3.7e-05,3.8e-05,3.8e-05,5.5e-05,-0.000102,-2.4e-05,-2.7e-05,2e-05,7.7e-05,3.5e-05,-2.4e-05,1.2e-05,-3.6e-05,-6e-06,2e-06,-3.9e-05,-1.7e-05,-1e-06,-2e-06,4e-06,-1.1e-05,-5.4e-05,5e-05
-1.7e-05,-2.9e-05,1.6e-05,-6.9e-05,-2.7e-05,2.3e-05,-1e-06,3e-06,-4.6e-05,1.6e-05,-2.9e-05,-2.1e-05,8e-06,3.1e-05,1.3e-05,3e-06,-1.6e-05,1.2e-05,-3.9e-05,5.6e-05,-8e-06,-5.3e-05,-2.1e-05,1.5e-05,4.6e-05,2.7e-05,6e-06,-3.2e-05,-7.7e-05,-4e-06,-3.5e-05,-1.2e-05,2.6e-05,1.4e-05,1.8e-05,-4.4e-05,-6.6e-05,-3e-05,-2.1e-05,3.1e-05,-2.5e-05,1e-06,-5.6e-05,1e-05,-7.6e-05,-4e-06,2.2e-05,2e-05,-6.9e-05,-2.4e-05,-2.2e-05,-3.4e-05,3.4e-05,-1e-06,-1.2e-05,-6e-06,-1.9e-05,-2e-05,5e-06,-2.9e-05,4e-06,-5e-06,-2e-06,4.1e-05,8e-06,3e-06,-3.4e-05,1e-06,3.4e-05,1.6e-05,2e-05,0,-3.3e-05,2.7e-05,1.6e-05,3.1e-05,-3.3e-05,1.7e-05,2.4e-05,9e-06,-3.2e-05,-1.7e-05,-1.2e-05,-5.3e-05,-9e-06,-1.4e-05,2e-06,-2.3e-05,-2.2e-05,2.3e-05,-2e-06,2.2e-05,3.4e-05,-2e-06,-2.1e-05,-1e-05,-2.2e-05,1.3e-05,2.1e-05,-2.7e-05,-1.8e-05,-1.9e-05,1.1e-05,2.2e-05,3.5e-05,-5e-06,-1.5e-05,4e-06,1.9e-05,0,-1e-06,-1e-06,0,2.6e-05,-2.9e-05,-6e-06,-9e-06,9e-06,-1.7e-05,2.1e-05,-4.4e-05
2.5e-05,-2.3e-05,-2.2e-05,3.5e-05,-1e-06,-4.5e-05,-1.8e-05,-2.1e-05,9e-06,-6e-06,2e-06,1.1e-05,-2.5e-05,-2e-05,-2.4e-05,3.3e-05,1.1e-05,8e-06,0,-4e-05,2.3e-05,5e-06,1.3e-05,1.9e-05,-2.7e-05,-6.7e-05,-5e-06,4e-06,1.8e-05,2.8e-05,1.2e-05,-1e-05,7e-06,-1.2e-05,-2.4e-05,2.5e-05,3.8e-05,-2e-06,1.4e-05,-3.9e-05,-1.7e-05,-2e-06,2e-05,-6e-06,6.3e-05,-2.9e-05,-7e-06,1.8e-05,3.8e-05,-1.5e-05,-3e-06,2.6e-05,-2.2e-05,1.3e-05,2e-05,2e-06,-2e-05,2e-06,-1.7e-05,1e-06,-3e-06,7e-06,-1.2e-05,-4.6e-05,-1.4e-05,8e-06,1.4e-05,2.2e-05,-2.1e-05,-8e-06,-2.3e-05,9e-06,3e-06,-4e-05,-2.7e-05,-2.4e-05,1.9e-05,3e-06,-5e-06,-3.3e-05,1.1e-05,-1e-05,2.2e-05,5e-06,1.8e-05,3.9e-05,1.3e-05,1.4e-05,6e-06,-3.1e-05,-3.4e-05,7e-06,2.1e-05,-1.7e-05,1e-05,-6e-06,-1e-06,2.1e-05,-2.5e-05,-2.8e-05,-3.9e-05,-2.7e-05,-1.9e-05,-2.2e-05,-4e-05,-1.1e-05,1.9e-05,2e-05,-2.2e-05,-1.3e-05,-1.6e-05,1.3e-05,2.7e-05,-8e-06,3.1e-05,7e-06,-2e-06,-1.8e-05,-1.7e-05,-7e-06,1.3e-05
2.8e-05,2.1e-05,1.3e-05,-2.8e-05,1.1e-05,4.8e-05,7e-06,-2.9e-05,-2e-06,6e-06,2e-06,9e-06,8e-06,1.1e-05,-2.5e-05,-3.6e-05,-1.3e-05,9e-06,2e-06,2.9e-05,-6e-06,-1.2e-05,-9e-06,-3.7e-05,4.8e-05,2.4e-05,-2e-06,-1e-06,-8e-06,1.8e-05,5e-06,-9e-06,-2e-06,9e-06,-8e-06,-2.2e-05,-1.2e-05,-1.2e-05,-4.1e-05,2.2e-05,1.8e-05,-9e-06,-2.5e-05,2e-06,-5.8e-05,-3e-06,-6e-06,4e-06,-1.2e-05,7e-06,0,-2.7e-05,-1.2e-05,-3.9e-05,-1.7e-05,-2.2e-05,-1.4e-05,1.2e-05,7e-06,2.1e-05,2e-05,-1.5e-05,0,1.4e-05,1.3e-05,-2e-05,1e-06,-1.3e-05,6e-06,-1e-05,-5e-06,-1.1e-05,9e-06,1.5e-05,-4e-06,1.6e-05,-3e-06,-9e-06,1.5e-05,-7e-06,8e-06,2e-06,-1.1e-05,9e-06,-4e-06,-1.5e-05,-3e-06,-1.5e-05,1.1e-05,-1.4e-05,-1e-05,-5.4e-05,-7e-06,5e-06,1.6e-05,-3e-06,1.1e-05,-1.8e-05,1.7e-05,1e-06,4.5e-05,1.8e-05,-1.8e-05,7e-06,1.8e-05,3e-05,-6e-06,-1.2e-05,7e-06,1.8e-05,8e-06,-2.7e-05,-2.3e-05,-2.3e-05,-3.7e-05,1e-06,-3e-06,1.4e-05,-3e-06,-1e-06,-4e-06
-1e-06,0,1e-06,-4e-06,-6e-06,-2.4e-05,-5e-06,2e-05,1.5e-05,-6.2e-05,-1.1e-05,-1.5e-05,-6e-06,1.3e-05,5.2e-05,3.4e-05,1.7e-05,-2.1e-05,-1.2e-05,-2.2e-05,-2.5e-05,1.4e-05,-2e-06,1.4e-05,-2.5e-05,-1e-06,-6e-06,-5e-06,1e-05,-1.5e-05,-1.6e-05,1.7e-05,0,7e-06,5e-06,7e-06,-1.3e-05,3e-06,3e-05,2.5e-05,-9e-06,3e-06,2.3e-05,6e-06,1.5e-05,7e-06,-3e-06,7e-06,-1.1e-05,-1.1e-05,1.6e-05,1.3e-05,4e-06,3e-06,-1e-06,1.9e-05,2e-06,-6e-06,-4e-06,-2.1e-05,-1.8e-05,4e-06,1e-06,0,-2.5e-05,2e-06,3e-06,-7e-06,-1e-06,6e-06,5e-06,2.1e-05,-1.7e-05,-1.3e-05,-1e-06,-1.7e-05,1e-06,-2e-06,-6e-06,-3e-06,-8e-06,-1.7e-05,-1.1e-05,-1.4e-05,7e-06,1.6e-05,-3e-06,-1.7e-05,-5e-06,-9e-06,-1.7e-05,7e-06,0,-1.2e-05,8e-06,-5e-06,-2.4e-05,3.2e-05,-1.3e-05,1.2e-05,-9e-06,-1.2e-05,6e-06,1e-06,-3.4e-05,-2.2e-05,2.1e-05,9e-06,-3e-06,-7e-06,2.1e-05,4e-06,3.4e-05,-3e-06,2.4e-05,-4e-06,2e-06,-9e-06,7e-06,-4e-06,6e-06
1e-05,-7e-06,7e-06,1.6e-05,-4e-06,1.7e-05,9e-06,-1.3e-05,-2e-06,3.1e-05,1.1e-05,1e-05,9e-06,-1e-05,-3.6e-05,-2.1e-05,1e-06,5e-06,1e-05,2.4e-05,1.3e-05,2e-06,-7e-06,0,9e-06,-5e-06,-1e-06,2.5e-05,-4e-06,2.1e-05,1.3e-05,-9e-06,1.8e-05,1e-05,9e-06,-1.8e-05,1e-06,1e-06,-1e-05,-4.3e-05,-3e-06,1.5e-05,-1.2e-05,-1e-06,-1.8e-05,-9e-06,-1e-06,-2e-06,7e-06,3e-06,6e-06,1e-06,3e-06,-3e-06,1.3e-05,-1.2e-05,4e-06,-1e-06,-4e-06,-4e-06,8e-06,-4e-06,-3e-06,1.3e-05,1.4e-05,-1e-06,-2e-06,1.4e-05,2e-06,-4e-06,3e-06,-7e-06,-8e-06,1.4e-05,0,2e-06,-5e-06,-7e-06,4e-06,6e-06,1e-06,1.8e-05,1e-06,1.3e-05,-1.4e-05,-1.3e-05,-6e-06,1.2e-05,-5e-06,6e-06,-1.2e-05,1.8e-05,1.2e-05,-2e-06,-1.1e-05,0,-2e-06,-1e-05,-8e-06,-3e-06,1e-06,-7e-06,3e-06,1.1e-05,6e-06,2e-06,-1.7e-05,-3.8e-05,3e-06,0,-4e-06,-1.1e-05,-1e-05,0,0,-4e-06,7e-06,5e-06,-3e-06,8e-06,-1.5e-05
0,8e-06,4e-06,-1.6e-05,1.2e-05,-4e-05,-5e-06,1.5e-05,-2.4e-05,-2.4e-05,-4e-06,-5e-06,-4e-06,-1.1e-05,1.4e-05,-4e-06,-2e-06,-4e-06,-4e-06,-2.1e-05,1e-05,-1.7e-05,1e-05,-1.8e-05,1.5e-05,-1.8e-05,-2e-06,-1.2e-05,-1e-06,-1.4e-05,-3e-06,-5e-06,-1.6e-05,1.3e-05,-1e-06,1.4e-05,7e-06,-1.4e-05,8e-06,1.3e-05,6e-06,-1e-06,2e-06,-3e-06,-3e-06,7e-06,3e-06,1.2e-05,4e-06,-5e-06,2e-06,-1e-06,7e-06,-6e-06,-1.3e-05,1.6e-05,7e-06,3e-06,-9e-06,4e-06,-7e-06,3e-06,1.5e-05,-2.6e-05,-6e-06,-3e-06,-3e-06,-2e-06,-5e-06,3e-06,0,-6e-06,6e-06,-1.3e-05,-1e-05,-1.4e-05,0,1.3e-05,-4e-06,5e-06,-3e-06,-1.2e-05,1.8e-05,-1e-06,4e-06,2e-05,3e-06,-2e-06,5e-06,6e-06,-3e-06,-7e-06,5e-06,0,1.4e-05,9e-06,1.3e-05,-1.2e-05,6e-06,1e-05,-1.6e-05,1e-06,-3e-06,-1.3e-05,-4e-06,-4e-06,1e-06,2.3e-05,-1e-05,1e-06,-6e-06,9e-06,-4e-06,-2e-06,-6e-06,-1e-06,-1e-06,-4e-06,-1e-06,-1.9e-05,-6e-06
3e-06,-3e-06,2.2e-05,1.9e-05,-1.7e-05,3.5e-05,5e-06,1.1e-05,2e-05,1e-06,1.3e-05,-5e-06,1e-06,1e-05,-3e-06,3e-06,-1e-05,1.7e-05,-2e-06,2.9e-05,-1.7e-05,-7e-06,-5e-06,5e-06,0,1.6e-05,2e-06,2.4e-05,3e-05,-5e-06,-3e-06,5e-06,-5e-06,6e-06,0,-1.4e-05,2e-05,4e-06,-6e-06,-1e-06,-5e-06,2e-06,-6e-06,3e-06,5e-06,6e-06,3e-06,-7e-06,-1.9e-05,2e-06,0,-2e-05,-1.6e-05,-5e-06,-4e-06,-2.1e-05,-5e-06,9e-06,-9e-06,-7e-06,2e-06,-5e-06,-1.2e-05,1.6e-05,6e-06,-1e-06,4e-06,-5e-06,-1e-06,4e-06,-1.2e-05,7e-06,8e-06,-9e-06,7e-06,6e-06,-1.3e-05,-1.3e-05,0,-1.3e-05,9e-06,1.7e-05,-2.2e-05,2e-06,9e-06,-1.3e-05,-2e-06,5e-06,0,-1e-06,2.2e-05,-4e-06,-7e-06,-6e-06,-2e-06,1e-06,-7e-06,1.1e-05,-1e-06,-1.1e-05,1.1e-05,-7e-06,1.1e-05,-1e-06,1.1e-05,-1.1e-05,-1.5e-05,-8e-06,3e-06,-3e-06,0,-1e-05,3e-06,-1.1e-05,-7e-06,-6e-06,2e-06,8e-06,1e-05,1e-05,-1e-06
1.2e-05,3e-06,-2e-05,-2.1e-05,1e-05,-1e-05,1e-06,-1.1e-05,7e-06,5e-06,-1.1e-05,1e-05,-4e-06,-5e-06,-5e-06,8e-06,1.2e-05,-1.2e-05,2e-06,-2.2e-05,1e-06,-1e-06,7e-06,-8e-06,-9e-06,-1.1e-05,2e-06,4e-06,-1.1e-05,9e-06,0,-1e-06,4e-06,-3e-06,-2e-06,9e-06,-1.8e-05,0,1e-06,-2e-06,-7e-06,-1.8e-05,-1e-06,-5e-06,2e-06,-4e-06,-3e-06,4e-06,2.5e-05,-7e-06,-1e-05,1.7e-05,5e-06,1.5e-05,9e-06,2.3e-05,-9e-06,-4e-06,0,-7e-06,5e-06,1e-05,9e-06,-9e-06,1e-06,-3e-06,-1e-06,-1e-06,6e-06,-7e-06,6e-06,-6e-06,0,1.6e-05,-5e-06,-4e-06,6e-06,-1e-06,0,1e-06,-6e-06,-6e-06,7e-06,0,-1.4e-05,1.1e-05,3e-06,-1e-06,-1e-06,-6e-06,1e-05,-1.4e-05,1.1e-05,2e-06,3e-06,-6e-06,1e-06,-2e-05,-3e-06,-1.1e-05,7e-06,-2e-06,3e-06,2e-06,1e-05,9e-06,2.2e-05,2e-06,-1e-06,2e-06,-9e-06,-2e-06,-7e-06,-3e-06,8e-06,-5e-06,-3e-06,-7e-06,-3e-06,-4e-06,0
6e-06,0,-4e-06,1.6e-05,-2e-06,8e-06,3e-06,-1.7e-05,-1e-05,8e-06,1e-06,-1e-05,8e-06,3e-06,1.5e-05,3e-06,-9e-06,-1e-06,-1.1e-05,2e-05,1e-05,1e-06,-4e-06,5e-06,-2e-06,-7e-06,-2e-06,9e-06,4e-06,-1e-05,4e-06,-1e-06,-7e-06,-3e-06,6e-06,-8e-06,5e-06,-2e-06,2e-06,3e-06,1e-05,8e-06,-3e-06,2e-06,0,-2e-06,-4e-06,-6e-06,-1.5e-05,-6e-06,-9e-06,1e-06,3e-06,-9e-06,-5e-06,-2.1e-05,-6e-06,-9e-06,-1e-06,2e-06,-1.1e-05,-8e-06,-8e-06,7e-06,-3e-06,4e-06,-8e-06,0,0,1e-06,4e-06,3e-06,-1.7e-05,-9e-06,-5e-06,7e-06,0,-2e-06,-2e-06,3e-06,-6e-06,2e-06,1e-06,-7e-06,1e-05,-1.1e-05,3e-06,-2e-06,-2e-06,-5e-06,3e-06,1.7e-05,5e-06,-1e-06,-2e-06,2e-06,-2e-06,1.7e-05,5e-06,0,-1.1e-05,-2e-06,7e-06,6e-06,4e-06,-1e-05,-4e-06,1.2e-05,-4e-06,-2e-06,9e-06,-7e-06,4e-06,7e-06,-5e-06,-4e-06,-3e-06,3e-06,2e-06,-2e-06,-1e-06
-1e-05,-7e-06,4e-06,-5e-06,-1e-06,-2.2e-05,-3e-06,7e-06,-2e-06,1e-06,-5e-06,4e-06,-1e-06,7e-06,-2e-05,-1e-05,0,-3e-06,1e-06,-1.7e-05,-1e-06,5e-06,0,4e-06,6e-06,-3e-06,-3e-06,-1.3e-05,-6e-06,4e-06,-7e-06,0,6e-06,0,2e-06,6e-06,-1.3e-05,-5e-06,-7e-06,-5e-06,-4e-06,-1e-06,4e-06,0,1.5e-05,2e-06,6e-06,0,1e-06,7e-06,-1e-06,3e-06,-5e-06,4e-06,-3e-06,1.6e-05,1e-06,1e-05,0,-1e-06,1e-05,-1e-06,2e-06,-7e-06,1e-06,-4e-06,1.3e-05,0,-3e-06,2e-06,-1e-06,5e-06,1e-05,-2e-06,0,2e-06,2e-06,4e-06,4e-06,1e-06,7e-06,0,-3e-06,8e-06,-5e-06,-6e-06,-1e-06,4e-06,7e-06,-3e-06,-2e-06,-8e-06,-9e-06,3e-06,-7e-06,-2e-06,-4e-06,0,0,8e-06,4e-06,-6e-06,3e-06,-3e-06,-4e-06,-3e-06,9e-06,-5e-06,2e-06,2e-06,3e-06,2e-06,-1.2e-05,-6e-06,9e-06,-1e-06,2e-06,-3e-06,-3e-06,-2e-06,1e-06
8e-06,9e-06,-1e-06,1e-06,2e-06,1.7e-05,1e-06,3e-06,-5e-06,6e-06,4e-06,6e-06,-2e-06,-4e-06,3e-06,1.2e-05,1e-06,1.1e-05,3e-06,1.2e-05,-4e-06,-3e-06,1e-06,-1.1e-05,-1.4e-05,7e-06,2e-06,1.1e-05,2e-06,1e-06,5e-06,0,4e-06,6e-06,1e-06,-1e-05,6e-06,-2e-06,1e-05,8e-06,-1.2e-05,6e-06,-6e-06,-1e-06,-1.2e-05,-6e-06,4e-06,-4e-06,7e-06,3e-06,4e-06,-8e-06,4e-06,1.4e-05,5e-06,-1.7e-05,2e-06,-4e-06,-4e-06,8e-06,-7e-06,0,4e-06,6e-06,-4e-06,-3e-06,0,-2e-06,1e-06,-3e-06,-1e-06,1e-06,3e-06,-5e-06,-2e-06,2e-06,4e-06,-8e-06,-3e-06,-2e-06,-1e-06,-7e-06,2e-06,-6e-06,1e-06,-1e-06,-2e-06,-3e-06,-8e-06,2e-06,4e-06,-6e-06,1.2e-05,2e-06,-1e-06,0,4e-06,-1e-06,-4e-06,4e-06,-1e-06,3e-06,0,-6e-06,-3e-06,-2e-06,-5e-06,0,-4e-06,-5e-06,-4e-06,-4e-06,8e-06,-1e-05,-3e-06,-4e-06,-1e-06,2e-06,0,2e-06,4e-06
8e-06,-3e-06,-5e-06,6e-06,0,-6e-06,1e-06,0,1e-05,-1.3e-05,3e-06,-8e-06,-4e-06,-8e-06,5e-06,-1.7e-05,0,-6e-06,-6e-06,-1.2e-05,-2e-06,-1.1e-05,1e-06,4e-06,1e-06,-1.1e-05,0,-1.7e-05,3e-06,6e-06,0,0,1e-06,0,-3e-06,7e-06,1e-05,3e-06,-6e-06,-1e-05,1.1e-05,-7e-06,4e-06,3e-06,1.2e-05,-2e-06,-5e-06,-2e-06,-1.3e-05,-5e-06,6e-06,5e-06,-2e-06,-3e-06,-4e-06,1.7e-05,2e-06,-1e-06,0,-2e-06,4e-06,1e-06,-4e-06,-3e-06,1e-06,-1e-06,-2e-06,4e-06,0,1e-06,-5e-06,1e-06,-2e-06,1e-05,-6e-06,0,1e-06,3e-06,6e-06,-4e-06,-5e-06,6e-06,4e-06,0,4e-06,1e-06,-3e-06,1e-06,5e-06,2e-06,-4e-06,1e-06,0,4e-06,-3e-06,3e-06,-6e-06,1e-06,6e-06,-3e-06,3e-06,-2e-06,2e-06,3e-06,-8e-06,-3e-06,1.4e-05,-1.1e-05,3e-06,2e-06,-6e-06,-3e-06,-8e-06,6e-06,0,0,0,-3e-06,2e-06,-9e-06,5e-06
-5e-06,-5e-06,7e-06,-1e-05,-3e-06,8e-06,-1e-06,7e-06,2e-06,4e-06,-2e-06,5e-06,5e-06,5e-06,-8e-06,1.7e-05,-2e-06,0,1e-06,5e-06,7e-06,0,-3e-06,-2e-06,-3e-06,-1e-06,-1e-06,8e-06,-6e-06,-4e-06,-4e-06,-1e-06,-6e-06,-5e-06,1e-06,-7e-06,-1.4e-05,-2e-06,2e-06,0,-4e-06,8e-06,-3e-06,-3e-06,-1.2e-05,3e-06,-5e-06,-2e-06,1.1e-05,5e-06,6e-06,-5e-06,0,1e-06,-4e-06,-1.3e-05,-2e-06,-4e-06,1e-06,3e-06,-1e-06,-1e-06,4e-06,7e-06,-1e-06,2e-06,-1e-06,-2e-06,-2e-06,0,7e-06,3e-06,-1e-06,-1.1e-05,4e-06,-4e-06,1e-06,-2e-06,-4e-06,2e-06,3e-06,-8e-06,-5e-06,5e-06,-6e-06,-4e-06,1e-06,-6e-06,0,-1e-06,-1.2e-05,-5e-06,-6e-06,1e-06,-3e-06,2e-06,-6e-06,-7e-06,-3e-06,-3e-06,-3e-06,-8e-06,-2e-06,4e-06,-1e-06,4e-06,-6e-06,1.2e-05,-3e-06,1e-06,6e-06,0,2e-06,-1e-06,-8e-06,-1e-06,-1e-06,2e-06,-5e-06,3e-06,-3e-06
-1e-06,6e-06,-7e-06,1.1e-05,5e-06,-1.1e-05,-1e-06,-4e-06,-1e-05,-1.3e-05,0,3e-06,-1e-06,2e-06,7e-06,-7e-06,4e-06,-4e-06,2e-06,-5e-06,-1e-06,1e-06,4e-06,1e-06,6e-06,3e-06,1e-06,-1.7e-05,9e-06,4e-06,4e-06,1e-06,3e-06,-3e-06,-1e-06,5e-06,1e-05,-2e-06,-5e-06,1.1e-05,-8e-06,-4e-06,0,1e-06,9e-06,-2e-06,4e-06,-3e-06,-2e-06,-3e-06,0,4e-06,-2e-06,7e-06,1e-06,1e-05,-4e-06,1e-06,3e-06,6e-06,-5e-06,2e-06,-4e-06,-6e-06,0,3e-06,-1e-06,0,1e-06,-1e-06,0,-4e-06,4e-06,7e-06,-3e-06,-1e-06,0,3e-06,4e-06,1e-06,0,8e-06,0,-6e-06,5e-06,4e-06,2e-06,5e-06,-4e-06,-2e-06,-6e-06,-1e-06,9e-06,1e-06,1e-06,-3e-06,8e-06,-3e-06,-1e-06,-6e-06,-2e-06,2e-06,-1e-06,-1e-06,1e-06,-2e-06,3e-06,-7e-06,1e-06,-3e-06,-6e-06,-5e-06,1e-06,-1.1e-05,7e-06,-2e-06,-1e-06,-1e-06,0,0,-1e-06
7e-06,-1e-06,-7e-06,-1.1e-05,-6e-06,7e-06,0,-8e-06,5e-06,-6e-06,-3e-06,-7e-06,-2e-06,-1e-06,-1e-05,-1e-06,-1e-06,4e-06,-3e-06,1e-06,-6e-06,2e-06,-1e-06,0,-1e-06,-3e-06,0,7e-06,-2e-06,4e-06,1e-06,-3e-06,-5e-06,0,0,-5e-06,-6e-06,1e-06,3e-06,-1e-05,1.1e-05,6e-06,1e-06,0,-1.1e-05,2e-06,2e-06,-1e-06,-4e-06,-3e-06,-5e-06,-2e-06,-1e-06,-1e-06,0,-9e-06,-4e-06,4e-06,3e-06,-7e-06,8e-06,-2e-06,0,2e-06,4e-06,-1e-06,5e-06,-2e-06,1e-06,1e-06,-2e-06,0,3e-06,-8e-06,-2e-06,-4e-06,-2e-06,-7e-06,-3e-06,-2e-06,-1e-06,-4e-06,6e-06,5e-06,-3e-06,-2e-06,-1e-06,1e-06,5e-06,-3e-06,4e-06,4e-06,-3e-06,2e-06,6e-06,-1e-06,-2e-06,2e-06,3e-06,1e-06,4e-06,3e-06,-2e-06,-4e-06,1e-06,0,-1.2e-05,6e-06,-2e-06,2e-06,1e-05,0,1e-06,2e-06,-2e-06,-1e-06,2e-06,1e-06,-1e-06,-6e-06,-2e-06
-1e-06,-3e-06,-2e-06,6e-06,2e-06,-1e-06,0,-1e-06,3e-06,1e-06,5e-06,8e-06,-1e-06,2e-06,7e-06,3e-06,0,-2e-06,-1e-06,-2e-06,3e-06,0,0,-7e-06,-2e-06,-5e-06,-2e-06,-1.4e-05,8e-06,-8e-06,-4e-06,0,2e-06,0,-2e-06,3e-06,7e-06,2e-06,0,2e-06,-6e-06,-1e-05,-1e-06,-2e-06,6e-06,2e-06,-1e-06,-3e-06,5e-06,5e-06,-5e-06,6e-06,4e-06,-3e-06,-2e-06,1e-05,0,-7e-06,2e-06,0,-7e-06,0,3e-06,-1e-06,-2e-06,-1e-06,-1.1e-05,5e-06,-1e-06,-1e-06,-2e-06,3e-06,-1e-06,9e-06,2e-06,1e-06,0,2e-06,2e-06,-2e-06,0,4e-06,-5e-06,-4e-06,0,2e-06,2e-06,-1e-06,-4e-06,1e-06,4e-06,-6e-06,-2e-06,1e-06,-3e-06,2e-06,-3e-06,-4e-06,-4e-06,4e-06,-3e-06,-7e-06,-3e-06,2e-06,5e-06,-1e-06,6e-06,2e-06,2e-06,-2e-06,-2e-06,-3e-06,3e-06,3e-06,1e-06,-2e-06,0,-1e-06,-1e-06,4e-06,1e-06
-6e-06,5e-06,3e-06,-3e-06,1e-06,1e-06,-1e-06,8e-06,-1e-06,0,-2e-06,-5e-06,2e-06,-2e-06,1e-06,-4e-06,0,3e-06,-2e-06,0,5e-06,-6e-06,-1e-06,4e-06,7e-06,1e-06,0,1.2e-05,-7e-06,7e-06,7e-06,4e-06,0,1e-06,0,-4e-06,-1e-06,1e-06,0,-1e-06,-6e-06,2e-06,0,1e-06,-5e-06,-2e-06,-1e-06,0,-1e-06,3e-06,-4e-06,-7e-06,-2e-06,4e-06,0,-1.1e-05,1e-06,2e-06,2e-06,2e-06,5e-06,-1e-06,-3e-06,-1e-06,3e-06,0,1e-06,-1e-06,-1e-06,0,1e-06,0,-4e-06,-7e-06,-4e-06,-1e-06,-3e-06,2e-06,-2e-06,-1e-06,0,0,1e-06,2e-06,4e-06,3e-06,0,0,2e-06,0,1e-06,1e-06,5e-06,0,2e-06,-1e-06,2e-06,1e-05,1e-06,3e-06,5e-06,-1e-06,-2e-06,2e-06,-4e-06,1e-06,-6e-06,-5e-06,-1e-06,1e-06,-3e-06,0,-1e-06,-6e-06,1e-06,-1e-06,0,1e-06,1e-06,-5e-06,-4e-06
2e-06,-2e-06,-5e-06,-1e-06,-1e-06,-5e-06,0,-1e-06,-3e-06,2e-06,0,-1e-06,-3e-06,-2e-06,-5e-06,7e-06,2e-06,-3e-06,1e-06,3e-06,-4e-06,-2e-06,0,1e-06,3e-06,0,1e-06,-1.1e-05,3e-06,-2e-06,-6e-06,-1e-06,3e-06,-1e-06,0,3e-06,-5e-06,-1e-06,1e-06,3e-06,9e-06,-3e-06,0,0,5e-06,0,0,-2e-06,-4e-06,-2e-06,-1e-06,1e-06,0,-5e-06,1e-06,1e-05,1e-06,2e-06,2e-06,-7e-06,-3e-06,0,5e-06,2e-06,-2e-06,2e-06,3e-06,-1e-06,1e-06,1e-06,3e-06,3e-06,1e-06,2e-06,0,3e-06,0,-2e-06,2e-06,1e-06,1e-06,-3e-06,1e-06,-3e-06,-5e-06,0,-2e-06,1e-06,-1e-06,1e-06,3e-06,-6e-06,-1e-06,0,0,0,-1e-06,-4e-06,2e-06,-3e-06,-6e-06,1e-06,-1e-06,0,6e-06,2e-06,4e-06,-1e-06,0,0,-1e-06,-5e-06,5e-06,-2e-06,1e-06,-3e-06,0,-1e-06,-2e-06,-1e-06,-2e-06
1e-06,-1e-06,0,5e-06,-1e-06,2e-06,-1e-06,0,-3e-06,6e-06,-2e-06,5e-06,-1e-06,4e-06,5e-06,-5e-06,-2e-06,-2e-06,-2e-06,-2e-06,-1e-06,0,1e-06,-2e-06,-6e-06,-5e-06,0,1.4e-05,0,-5e-06,2e-06,-2e-06,-1e-06,-1e-06,0,-3e-06,1e-06,0,-1e-06,-2e-06,-5e-06,8e-06,-1e-06,-1e-06,-3e-06,0,0,0,8e-06,0,3e-06,0,-1e-06,-4e-06,-1e-06,-1e-05,-1e-06,1e-06,2e-06,0,0,-1e-06,-4e-06,-3e-06,0,1e-06,-2e-06,-1e-06,1e-06,-1e-06,-1e-06,1e-06,5e-06,-1e-06,0,0,0,-2e-06,-1e-06,-1e-06,0,3e-06,0,3e-06,3e-06,-1e-06,0,-1e-06,1e-06,-2e-06,4e-06,9e-06,-2e-06,-1e-06,2e-06,1e-06,0,5e-06,-3e-06,-2e-06,2e-06,-3e-06,-3e-06,-3e-06,-8e-06,1e-06,-6e-06,-2e-06,0,1e-06,2e-06,1e-06,-5e-06,3e-06,-6e-06,-2e-06,-2e-06,1e-06,1e-06,-1e-06,-1e-06
-4e-06,1e-06,1e-06,-7e-06,3e-06,4e-06,1e-06,0,6e-06,-2e-06,1e-06,-7e-06,0,0,-4e-06,5e-06,0,0,0,4e-06,2e-06,3e-06,0,1e-06,7e-06,0,0,-9e-06,-2e-06,5e-06,0,1e-06,1e-06,-3e-06,0,2e-06,-4e-06,2e-06,0,-2e-06,-3e-06,-4e-06,2e-06,1e-06,5e-06,-2e-06,1e-06,-1e-06,-1e-05,0,5e-06,5e-06,0,1e-06,-1e-06,1.1e-05,-2e-06,-1e-06,3e-06,5e-06,3e-06,1e-06,1e-06,0,-1e-06,0,1e-06,0,-1e-06,-1e-06,-3e-06,-1e-06,-3e-06,1e-06,-2e-06,4e-06,-1e-06,1e-06,1e-06,-1e-06,-1e-06,-6e-06,-1e-06,-1e-06,-1e-06,-1e-06,1e-06,0,-1e-06,-1e-06,0,-4e-06,1e-06,-1e-06,1e-06,0,-1e-06,-5e-06,2e-06,-2e-06,-1e-06,-1e-06,0,1e-06,3e-06,0,8e-06,4e-06,0,1e-06,-1e-06,-3e-06,2e-06,-1e-06,6e-06,-2e-06,0,0,0,0,2e-06
0,-1e-06,-3e-06,7e-06,-4e-06,-4e-06,-1e-06,-3e-06,0,0,3e-06,5e-06,-1e-06,-2e-06,5e-06,-8e-06,0,3e-06,0,-6e-06,2e-06,1e-06,0,-2e-06,-5e-06,-1e-06,0,1.6e-05,1e-06,-3e-06,-3e-06,1e-06,-2e-06,-2e-06,-1e-06,-2e-06,8e-06,1e-06,-1e-06,5e-06,5e-06,3e-06,-1e-06,0,-4e-06,1e-06,-1e-06,0,8e-06,-1e-06,3e-06,-4e-06,1e-06,-1e-06,1e-06,-1.2e-05,-2e-06,-2e-06,2e-06,-4e-06,-5e-06,-1e-06,1e-06,-1e-06,-1e-06,0,-3e-06,1e-06,0,1e-06,3e-06,0,-2e-06,-4e-06,-1e-06,-3e-06,2e-06,2e-06,0,0,1e-06,4e-06,2e-06,1e-06,-1e-06,1e-06,1e-06,0,1e-06,-2e-06,-5e-06,-5e-06,2e-06,-1e-06,-2e-06,-1e-06,-4e-06,-2e-06,0,1e-06,2e-06,0,0,1e-06,-1e-06,-1e-06,-4e-06,-3e-06,0,-1e-06,5e-06,0,-3e-06,-4e-06,-2e-06,-2e-06,0,0,0,-5e-06,1e-06
-1e-06,1e-06,-2e-06,-7e-06,3e-06,0,0,-2e-06,-4e-06,-2e-06,-1e-06,-1e-06,-2e-06,2e-06,0,7e-06,0,-1e-06,0,8e-06,-3e-06,-5e-06,0,2e-06,3e-06,0,-1e-06,-8e-06,-1e-06,1e-06,1e-06,0,-1e-06,2e-06,0,2e-06,-6e-06,-1e-06,1e-06,-5e-06,-5e-06,-5e-06,1e-06,0,1e-06,0,-2e-06,0,-3e-06,0,1e-06,1e-06,-1e-06,-6e-06,-1e-06,1.1e-05,0,5e-06,-1e-06,4e-06,5e-06,0,-2e-06,6e-06,1e-06,0,0,-2e-06,1e-06,0,0,0,3e-06,2e-06,-1e-06,2e-06,1e-06,-3e-06,-1e-06,0,0,-4e-06,-2e-06,0,3e-06,-2e-06,0,0,-2e-06,0,-2e-06,0,-3e-06,-1e-06,-2e-06,0,3e-06,0,-1e-06,3e-06,-2e-06,-2e-06,0,0,-3e-06,2e-06,5e-06,5e-06,-1e-06,2e-06,-6e-06,-2e-06,0,-1e-06,-1e-06,-1e-06,0,0,1e-06,3e-06,0
-5e-06,-1e-06,5e-06,4e-06,0,-1e-06,0,4e-06,2e-06,-1.1e-05,-1e-06,-4e-06,0,-1e-06,-4e-06,-2e-06,-1e-06,-3e-06,-2e-06,-8e-06,-2e-06,-3e-06,-1e-06,0,-5e-06,-5e-06,0,1.3e-05,3e-06,0,0,-1e-06,1e-06,1e-06,0,-2e-06,4e-06,0,0,0,0,5e-06,-1e-06,0,-4e-06,0,1e-06,0,-1e-06,2e-06,-3e-06,-3e-06,2e-06,4e-06,-1e-06,-1e-05,0,-1e-06,-1e-06,4e-06,-4e-06,0,3e-06,-7e-06,-1e-06,0,4e-06,0,0,0,1e-06,0,2e-06,1e-06,-1e-06,-4e-06,0,0,1e-06,0,0,3e-06,0,0,-4e-06,1e-06,-1e-06,-1e-06,1e-06,0,-1e-06,1e-06,0,-1e-06,1e-06,0,1e-06,1e-06,1e-06,2e-06,-1e-06,-2e-06,2e-06,-2e-06,3e-06,0,-7e-06,-1e-06,0,-1e-06,1e-06,-2e-06,-2e-06,2e-06,0,-1e-06,1e-06,0,-1e-06,-4e-06,1e-06
0,-1e-06,0,-1e-06,-1e-06,5e-06,0,1e-06,1e-06,2e-06,-1e-06,7e-06,2e-06,-2e-06,5e-06,0,0,0,0,9e-06,3e-06,1e-06,0,-3e-06,0,3e-06,0,-1.2e-05,-1e-06,3e-06,-2e-06,0,1e-06,0,0,2e-06,-4e-06,0,0,1e-06,2e-06,-3e-06,-1e-06,0,1e-06,1e-06,2e-06,1e-06,1e-06,0,-4e-06,3e-06,-1e-06,-1e-06,1e-06,9e-06,0,-2e-06,-1e-06,-2e-06,2e-06,0,-2e-06,7e-06,2e-06,0,-4e-06,0,0,0,-3e-06,3e-06,-4e-06,-5e-06,-1e-06,1e-06,1e-06,0,-1e-06,-1e-06,1e-06,0,2e-06,-3e-06,4e-06,-1e-06,1e-06,2e-06,1e-06,0,-1e-06,-1e-06,3e-06,0,0,0,-4e-06,1e-06,0,-1e-06,2e-06,1e-06,1e-06,0,-1e-06,1e-06,5e-06,-3e-06,-1e-06,0,-1e-06,-1e-06,0,-3e-06,1e-06,-1e-06,-1e-06,0,1e-06,0,2e-06
1e-06,2e-06,-2e-06,-1e-06,0,-4e-06,0,-4e-06,1e-06,-7e-06,1e-06,-5e-06,-1e-06,3e-06,-3e-06,4e-06,-1e-06,2e-06,0,-1e-05,1e-06,1e-06,0,1e-06,4e-06,-3e-06,0,1.1e-05,1e-06,-3e-06,2e-06,0,1e-06,-2e-06,0,-2e-06,0,0,-1e-06,1e-06,-4e-06,1e-06,0,0,-4e-06,1e-06,0,1e-06,0,-3e-06,-3e-06,-2e-06,-1e-06,-1e-06,-1e-06,-1e-05,-1e-06,0,0,2e-06,0,-1e-06,0,-6e-06,0,0,0,0,0,-1e-06,1e-06,1e-06,-2e-06,3e-06,0,-3e-06,0,2e-06,2e-06,0,-1e-06,-1e-06,-1e-06,2e-06,-1e-06,0,0,0,-2e-06,-1e-06,-1e-06,-2e-06,-5e-06,0,-2e-06,0,2e-06,4e-06,0,-3e-06,1e-06,-2e-06,1e-06,1e-06,0,-1e-06,-5e-06,1e-06,0,0,2e-06,-1e-06,2e-06,-4e-06,-4e-06,-1e-06,0,0,0,-1e-06,0
-5e-06,-1e-06,3e-06,4e-06,1e-06,2e-06,0,2e-06,-2e-06,-1e-06,1e-06,1e-06,0,0,0,-6e-06,1e-06,1e-06,-2e-06,9e-06,-4e-06,2e-06,0,1e-06,-6e-06,-1e-06,0,-1.3e-05,0,0,-1e-06,1e-06,0,-1e-06,0,1e-06,6e-06,-1e-06,0,-1e-06,1e-06,-6e-06,0,0,5e-06,-1e-06,-2e-06,1e-06,-4e-06,0,0,4e-06,0,2e-06,-1e-06,9e-06,-1e-06,1e-06,-1e-06,-1e-06,-3e-06,0,1e-06,7e-06,1e-06,0,3e-06,0,0,0,1e-06,1e-06,4e-06,-3e-06,-1e-06,2e-06,-1e-06,-5e-06,-2e-06,0,0,3e-06,0,-3e-06,-3e-06,0,-1e-06,-1e-06,2e-06,0,1e-06,-4e-06,2e-06,0,0,0,1e-06,-2e-06,0,-1e-06,-2e-06,-1e-06,0,0,2e-06,-1e-06,4e-06,-4e-06,-1e-06,-1e-06,0,-1e-06,-3e-06,2e-06,4e-06,0,0,0,-1e-06,1e-06,-2e-06
-3e-06,-1e-06,2e-06,-6e-06,-2e-06,-4e-06,0,0,-1e-06,7e-06,0,4e-06,0,-2e-06,2e-06,5e-06,0,-1e-06,-1e-06,-1e-05,0,-1e-06,0,-1e-06,6e-06,-4e-06,0,9e-06,-1e-06,5e-06,0,0,0,1e-06,0,-2e-06,-7e-06,0,0,-3e-06,1e-06,5e-06,-1e-06,0,-4e-06,0,0,1e-06,8e-06,1e-06,3e-06,-3e-06,-1e-06,5e-06,0,-8e-06,-1e-06,0,-2e-06,-3e-06,4e-06,0,-2e-06,-7e-06,-1e-06,0,-2e-06,0,0,0,0,1e-06,1e-06,2e-06,-1e-06,-1e-06,0,1e-06,2e-06,-1e-06,0,-4e-06,-1e-06,4e-06,4e-06,2e-06,0,-1e-06,-2e-06,0,2e-06,4e-06,3e-06,0,0,0,-2e-06,2e-06,0,1e-06,0,0,-1e-06,0,-4e-06,1e-06,-6e-06,5e-06,0,1e-06,2e-06,-3e-06,3e-06,0,-1e-06,-1e-06,0,0,0,-5e-06,-1e-06
