1.9e-05,3e-06,1.1e-05,3e-06,5e-06,1e-06,5.1e-05,2.3e-05,5e-06,5e-06,9e-06,1.2e-05,7e-06,1.4e-05,1e-06,9e-06,6e-06,6e-06,1.3e-05,6.1e-05,4e-06,9e-06,1e-06,8e-06,5e-06,2e-06,1e-05,5e-06,3e-06,2e-06,1.4e-05,2e-06,2.9e-05,3.1e-05,0.000105,5e-05,1.6e-05,1.4e-05,5.5e-05,3.2e-05,5.6e-05,2.4e-05,0.000148,5.7e-05,1.4e-05,2.1e-05,0.000702,0.000717,0.000544,0.00048,0.000197,9.7e-05,6.5e-05,1e-06,0.000717,0.000867,0.000248,0.000416,0.000406,0.000205,0.000532,0.00017,9e-06,0.000337,0.000223,0.000294,0.000516,0.000343,0.000136,0.000516,0.000172,0.00024,0.00018,0.000155,0.000143,0.00026,6e-06,0.000161,0.00013,3.6e-05,0.000111,0.000157,3.5e-05,7.6e-05,5.5e-05,0.000159,2.6e-05,1.5e-05,7.4e-05,6e-05,4.7e-05,5e-06,2.8e-05,1.6e-05,2.6e-05,4.2e-05,4.2e-05,1.4e-05,1.1e-05,3.5e-05,7e-06,2.7e-05,2.2e-05,5e-06,2.3e-05,3.9e-05,1.7e-05,5e-06,7e-06,4.1e-05,1.3e-05,1.4e-05,2e-06,2e-06,2.1e-05,1.9e-05,2.6e-05,2e-06,1e-06,1.5e-05,2e-06
2.3e-05,2.7e-05,1.4e-05,1.2e-05,1.5e-05,2e-05,0.000114,0.000123,8.4e-05,4.2e-05,7e-06,1.8e-05,2.4e-05,3.5e-05,6.2e-05,2.9e-05,1.6e-05,1.8e-05,2.6e-05,0.000111,2.5e-05,3.8e-05,2.3e-05,1.2e-05,1.3e-05,3e-05,3.3e-05,2.3e-05,1.4e-05,1e-05,2.2e-05,2e-05,4.1e-05,0.000108,0.000216,0.000311,0.000259,0.000161,0.000149,4.3e-05,9.2e-05,0.000115,0.000413,0.000246,0.000109,7.9e-05,0.001405,0.002096,0.002223,0.00057,0.000793,0.000141,0.000741,0.000772,0.001147,0.001679,0.001934,0.000849,0.000724,0.000296,0.001391,0.000643,0.000654,0.000637,0.00028,0.000559,0.001206,0.001044,0.000232,0.000914,0.001418,0.00089,0.000661,9.3e-05,0.00082,0.000811,0.00063,0.000754,0.000249,9.8e-05,0.000286,0.000307,0.000166,6.2e-05,7.8e-05,0.000243,7.2e-05,4.9e-05,0.000184,0.000222,7e-05,5e-05,0.000106,0.000121,4.3e-05,0.000127,3.3e-05,0.000148,6e-05,2.3e-05,1.8e-05,7.4e-05,4.3e-05,4.9e-05,3.4e-05,0.00016,2.9e-05,2.4e-05,4.7e-05,8.4e-05,7.4e-05,5.2e-05,5e-06,1.9e-05,6.6e-05,2.4e-05,5.3e-05,5.8e-05,5.8e-05,4.5e-05,2.6e-05
1e-05,2.6e-05,3e-06,2.1e-05,1e-05,4.2e-05,0.000182,0.000468,0.000218,0.000138,3.6e-05,5.1e-05,4.7e-05,2.8e-05,5.9e-05,4.1e-05,3.6e-05,2.9e-05,4.9e-05,7.7e-05,1.7e-05,1.6e-05,1.6e-05,7e-06,2.4e-05,4.3e-05,3.6e-05,3.4e-05,5.3e-05,4.8e-05,3.8e-05,3.5e-05,6e-05,0.000258,0.000561,7.2e-05,4.1e-05,1.7e-05,0.000111,7e-05,6e-05,7.1e-05,0.000466,0.000435,0.000302,0.00011,0.001398,0.002912,0.001479,0.000687,0.000253,0.000299,0.001304,0.001693,0.001284,0.00142,0.000556,0.000624,0.001197,0.000793,0.000841,0.000544,0.000627,0.000713,0.000615,0.000654,0.000599,0.000626,0.000573,0.000573,0.002366,0.00214,0.000763,0.000226,0.001095,0.001817,0.000224,0.000653,0.000859,0.000121,0.000498,0.000446,0.000338,6.5e-05,7e-05,0.000348,0.000138,4.3e-05,0.000186,0.000375,0.000343,0.000184,8.5e-05,9.4e-05,0.000173,4.3e-05,5.5e-05,0.000231,0.00019,0.000205,9.3e-05,4.3e-05,8.8e-05,3.1e-05,4.1e-05,0.000158,0.000166,6.3e-05,8.5e-05,5.7e-05,4.1e-05,5.8e-05,3e-05,4.3e-05,3.2e-05,7.2e-05,7e-06,4.1e-05,2.9e-05,4.4e-05,2.1e-05
4.4e-05,3.2e-05,4.6e-05,4.6e-05,5.1e-05,5.7e-05,0.000289,0.000708,0.000291,0.000109,6e-05,0.000103,5.3e-05,1.9e-05,5e-05,5.8e-05,2.1e-05,2.4e-05,2.7e-05,0.000189,5.5e-05,2.1e-05,3.2e-05,4.8e-05,5e-05,1.9e-05,6e-06,2.5e-05,5.2e-05,5e-05,2.8e-05,2.3e-05,2.7e-05,0.000254,0.000441,0.000127,0.000135,6.8e-05,0.000152,0.000204,3.1e-05,8e-05,0.000534,0.000382,0.000267,3.6e-05,0.001245,0.002961,0.001215,0.001066,0.000309,0.00051,0.0017,0.000616,0.002289,0.000597,0.000398,0.000718,0.001682,0.001541,0.002031,0.000792,0.001473,0.00069,0.000269,0.00033,0.00067,0.001236,4.6e-05,0.000858,0.001467,0.000839,0.000423,0.000639,0.000578,0.000576,0.001024,0.000708,0.00074,0.000905,0.000889,0.000361,0.000555,0.000403,0.000265,0.000356,0.000148,6.9e-05,0.000159,0.000553,0.000525,0.000382,5.3e-05,4.2e-05,0.00011,0.000186,0.00013,0.000278,0.000289,0.000141,0.000119,6e-06,0.00012,9.2e-05,3.8e-05,9.7e-05,0.000107,0.000155,9.5e-05,9.9e-05,2.9e-05,4.1e-05,4.3e-05,1.9e-05,3.9e-05,5.4e-05,4.7e-05,6.7e-05,7.5e-05,0.000174,7.9e-05
1.2e-05,1.1e-05,3.2e-05,2e-05,2.5e-05,4.3e-05,0.000333,0.00043,0.000432,0.000185,2.1e-05,3.8e-05,2e-06,1.2e-05,3e-05,2e-05,2.8e-05,1.8e-05,9e-06,0.000153,4.9e-05,1.7e-05,2.8e-05,4.5e-05,2.4e-05,9e-06,2.8e-05,3.7e-05,4.1e-05,2.6e-05,1.6e-05,3.6e-05,5.6e-05,0.000181,0.000407,0.000156,0.000185,8.2e-05,0.000285,0.000185,0.000101,3.9e-05,0.000613,0.000466,0.000136,0.00012,0.000957,0.002108,0.001497,0.000475,0.001338,0.000727,0.002451,0.001162,0.000984,0.001748,0.000897,0.001058,0.002889,0.001152,0.001803,0.002162,0.002034,0.000651,0.000301,0.000465,0.000878,0.00141,0.00157,0.001596,0.002229,0.002641,0.001544,0.001672,0.001494,0.00077,0.000868,0.001201,0.001266,7.9e-05,0.000438,0.000133,0.000917,0.000658,0.000599,0.000637,0.000284,0.000185,0.000327,0.000647,0.000323,0.000208,0.000336,0.000123,0.000109,0.000197,1e-04,0.000116,8e-05,9.2e-05,6.4e-05,4.5e-05,0.000208,0.000148,8.5e-05,4.2e-05,2.7e-05,0.000134,7.8e-05,6.4e-05,8.6e-05,6.7e-05,4.1e-05,5.4e-05,2.4e-05,8.6e-05,6.5e-05,3.8e-05,4.3e-05,0.000178,5.2e-05
2.1e-05,5e-06,3.7e-05,4.6e-05,3.3e-05,4.3e-05,0.000326,0.000779,0.000638,0.000266,1.1e-05,6e-05,3.9e-05,3.4e-05,4.5e-05,5.1e-05,4.1e-05,3e-05,2.6e-05,0.000147,4e-06,3.2e-05,5.6e-05,5e-05,4.1e-05,4.7e-05,5.2e-05,7e-05,8.5e-05,2e-05,3.7e-05,7.2e-05,4.9e-05,0.000399,0.000683,0.000365,0.000102,2.8e-05,0.000212,0.00048,0.000194,0.000282,0.000667,0.000284,0.000118,0.000217,0.000907,0.001041,0.000767,0.000137,0.001294,0.001461,0.002885,0.002019,0.003568,0.002732,0.001728,0.001805,0.001859,0.001898,0.003429,0.003352,0.000703,0.001117,0.000753,0.00051,0.000669,0.001527,0.001516,0.000891,0.002302,0.000375,0.000961,0.001942,0.001179,0.000376,0.001324,0.001308,0.001395,0.001044,0.000287,0.000842,0.001654,0.000842,0.001106,0.000471,0.000495,0.000182,0.000312,0.000629,0.000253,0.000236,9.2e-05,8.9e-05,0.000283,4e-05,4.9e-05,0.000158,8.2e-05,0.00012,7.7e-05,2.2e-05,0.000208,0.000175,0.000202,2.7e-05,4.4e-05,0.00012,0.00016,5.2e-05,0.000189,0.000251,0.000181,6.4e-05,2e-05,0.000116,3.3e-05,4.8e-05,5.7e-05,0.000236,0.000143
2.6e-05,3.6e-05,2.2e-05,1.6e-05,3.3e-05,4.4e-05,0.000382,0.001512,0.000562,0.000178,3.3e-05,2.3e-05,3.2e-05,2.4e-05,3.2e-05,2.8e-05,3.4e-05,1.4e-05,8.1e-05,0.000342,4e-05,8e-05,4.4e-05,5.2e-05,1.6e-05,4.7e-05,3.9e-05,2.1e-05,5.9e-05,8.1e-05,9.1e-05,1.8e-05,0.000138,0.000607,0.000502,0.000239,0.000124,5.3e-05,0.000299,9.4e-05,0.000336,0.000725,7.3e-05,0.001129,0.000469,0.000123,0.00064,0.000544,0.001074,0.000629,0.001772,0.001558,0.002758,0.001621,0.004267,0.002537,0.000587,0.001912,0.002722,0.003318,0.002137,0.002179,0.002456,0.001087,0.001334,0.000944,0.000322,0.001777,0.002157,0.00134,0.002196,0.002877,0.001254,0.001497,0.003478,0.003824,0.00073,0.000687,0.002165,0.000977,0.00077,0.001106,0.000779,0.00137,0.001049,0.000709,0.000474,0.000264,0.00024,0.000189,0.000196,0.000171,0.000283,0.000263,0.000163,0.000161,0.000125,0.000176,0.000216,0.000282,0.00019,0.00011,0.000181,1.8e-05,0.000131,0.000132,8.1e-05,0.000173,0.000312,0.00021,7.8e-05,0.000158,3.9e-05,0.000116,0.00011,8.9e-05,0.000141,5e-05,8e-05,0.000202,9.9e-05
4.1e-05,2.6e-05,3.9e-05,2.7e-05,4.9e-05,1.8e-05,0.000379,0.001848,0.001163,0.000519,0.000132,6e-05,3.5e-05,5.2e-05,4e-05,5.1e-05,3.7e-05,3.5e-05,8.7e-05,0.000685,0.000454,0.000205,9e-05,8.7e-05,1.9e-05,6.7e-05,3.6e-05,1.3e-05,7.6e-05,4.4e-05,3e-05,6.4e-05,9.2e-05,0.000805,0.000199,0.000759,0.000174,8.3e-05,0.000451,0.000378,0.000366,0.000386,0.000975,0.002806,0.001849,0.001032,0.000644,0.000402,0.000938,0.002415,0.00152,0.000897,0.003283,0.002291,0.004145,0.003941,0.002831,0.003548,0.002209,0.00091,0.001473,0.003876,0.004196,0.003185,0.001981,0.002424,0.002494,0.002086,0.004469,0.004988,0.004499,0.00472,0.002943,0.002183,0.003079,0.003436,0.002429,0.002526,0.002714,0.001909,0.001072,0.0011,0.001896,0.002703,0.001477,0.000802,0.000913,0.000436,0.000156,0.000614,0.00026,0.000402,0.000598,0.000408,0.000398,0.000161,0.000163,0.000123,0.000179,4e-04,0.000254,0.000101,0.000129,5.2e-05,0.000127,6.5e-05,8e-05,8.6e-05,0.000161,0.000265,0.000218,0.000191,0.000159,0.000201,0.000106,0.000116,0.000131,0.00013,2.8e-05,0.000226,0.000326
3.3e-05,1.7e-05,3.1e-05,1.7e-05,1.7e-05,1.1e-05,0.000377,0.001923,0.000978,0.000181,6.9e-05,6.4e-05,1.7e-05,3.3e-05,2.4e-05,2.1e-05,2.4e-05,6e-06,8.8e-05,0.000732,0.000693,0.000293,5e-05,8e-05,9.9e-05,7.7e-05,9.1e-05,8.7e-05,7.5e-05,7.9e-05,3e-05,3.9e-05,0.000111,0.000674,0.001784,0.001043,0.001094,0.00041,0.000493,6.9e-05,0.000162,0.000313,0.000786,0.002904,0.002465,0.000812,0.000456,0.000782,0.001389,0.002975,0.003839,0.003573,0.005467,0.002644,0.004508,0.00328,0.000767,0.001261,0.001488,0.002007,0.001184,0.003972,0.006379,0.004423,0.002159,0.001696,0.001748,0.000886,0.003297,0.003442,0.00214,0.001488,0.000557,0.000372,0.004486,0.001576,0.001337,0.00143,0.000257,0.000992,0.000455,0.001017,0.001272,0.000757,0.000929,0.000592,0.000554,0.000289,0.000279,0.000579,0.000424,7.6e-05,0.000408,0.000128,0.00012,5.2e-05,0.000161,0.000136,0.000242,4.7e-05,5e-05,9.5e-05,8.6e-05,1.7e-05,8.5e-05,3.8e-05,2.7e-05,0.000116,0.000201,0.000296,0.00021,0.000103,0.000115,7.6e-05,3.4e-05,9.5e-05,2.5e-05,4e-05,2.2e-05,0.000226,0.000387
2.2e-05,1.6e-05,1.1e-05,2.1e-05,1.9e-05,2e-06,0.000358,0.001707,0.000747,2.6e-05,9.1e-05,4.4e-05,5e-06,2.3e-05,5.5e-05,2.5e-05,1.7e-05,2.4e-05,6e-05,0.000802,0.000494,0.000235,6.9e-05,1e-04,6e-05,4.4e-05,9.5e-05,2.4e-05,8.5e-05,0.000119,5.2e-05,5.1e-05,9.4e-05,0.000477,0.001991,0.00207,0.000644,0.00021,0.000416,0.000269,0.000259,0.000292,0.000616,0.00241,0.000488,0.000518,0.000374,0.000864,0.000795,0.001089,0.001214,0.001215,0.003033,0.002376,0.005307,0.002249,0.00128,0.000541,0.000398,0.00109,0.002819,0.002727,0.002559,0.00093,0.000966,0.002283,0.001012,0.001,0.001859,0.001062,0.003446,0.001851,0.001251,0.000812,0.003454,0.001528,0.000624,0.000732,0.000344,0.000552,0.000442,0.000578,0.000871,0.000629,0.000226,0.00013,0.000159,8.8e-05,0.000256,0.000167,5.6e-05,7.6e-05,0.00013,8.9e-05,5.2e-05,7.1e-05,0.000129,5.6e-05,0.000167,0.000117,7.2e-05,3e-05,3.9e-05,5.7e-05,5.3e-05,2.9e-05,4.4e-05,5.5e-05,0.000166,0.000113,4.8e-05,6.2e-05,3.5e-05,2.5e-05,2.3e-05,3.4e-05,2.1e-05,3.5e-05,1.3e-05,0.000163,0.000186
1e-05,1.6e-05,2.3e-05,4.6e-05,1.3e-05,8e-06,0.000325,0.001192,0.001194,0.00076,3e-04,0.000131,3.6e-05,1.8e-05,3.7e-05,4.3e-05,3.1e-05,1.2e-05,6.1e-05,0.000588,0.000371,0.000209,6e-05,2.2e-05,4.9e-05,4.2e-05,6.6e-05,7.9e-05,9.6e-05,7.7e-05,5.7e-05,9.7e-05,0.000153,0.000915,0.001862,0.000467,0.000978,0.000656,0.000126,0.000297,0.000191,0.00028,0.00075,0.001834,0.001241,0.000684,0.000611,0.000421,0.001142,0.001211,0.002322,0.00069,0.003097,0.001909,0.002646,0.00051,0.001808,0.000623,0.000731,0.000159,0.002869,0.000708,0.00114,0.003134,0.00082,0.002368,0.001629,0.001933,0.002181,0.001106,0.004895,0.003899,0.001377,0.000589,0.00062,0.001513,0.00094,0.000674,0.00071,0.00014,0.000496,0.000138,0.000538,0.000461,0.000227,0.000117,3.4e-05,9e-05,0.000143,0.000136,7.1e-05,0.00017,0.000165,6.5e-05,4.3e-05,2.6e-05,0.000119,3.9e-05,7.4e-05,0.000137,6.2e-05,8.8e-05,7.7e-05,5e-05,1.9e-05,7.8e-05,2e-05,1.3e-05,0.000118,7.2e-05,7.1e-05,6.9e-05,9.4e-05,2.9e-05,2.8e-05,5.9e-05,1.7e-05,3.5e-05,3.4e-05,8.6e-05,0.000109
2.3e-05,2.3e-05,2.1e-05,2.4e-05,2.9e-05,2.1e-05,0.000323,0.000641,0.000352,4.8e-05,4.8e-05,6.5e-05,4e-05,2.2e-05,3.1e-05,2.8e-05,1.8e-05,2.6e-05,3e-05,0.000347,0.000108,4.2e-05,5.5e-05,3.9e-05,3.2e-05,8.1e-05,4.8e-05,6.5e-05,4.1e-05,7.9e-05,2.7e-05,6.2e-05,0.000121,0.0014,0.000372,0.001772,0.001781,0.001434,0.00063,0.000525,0.000607,0.000461,0.00048,0.000922,0.000758,0.000422,0.000623,0.000461,0.001241,0.002908,0.001349,0.001479,0.003632,0.000952,0.000942,0.00038,0.000635,4.6e-05,0.000877,0.000919,0.002131,0.001449,0.002146,0.001468,0.000497,0.001677,0.000351,0.00295,0.002366,0.002454,0.003263,0.000373,0.000429,0.000546,0.002355,0.00198,0.000267,0.000618,0.000495,0.000747,0.000249,0.00018,0.000581,0.00012,0.00023,0.00021,5.1e-05,0.000152,0.000169,0.000171,0.000159,5.7e-05,1e-04,2.1e-05,6e-05,5.7e-05,4.6e-05,4.7e-05,0.000104,0.000128,6.5e-05,3.6e-05,3.2e-05,7.5e-05,5e-05,5.8e-05,2.4e-05,1.8e-05,4.7e-05,3.4e-05,5.2e-05,7e-06,6.2e-05,5.4e-05,4.4e-05,7.5e-05,6e-06,2.8e-05,1.7e-05,4.3e-05,0.000154
1.4e-05,2.1e-05,8e-06,1.8e-05,3.1e-05,1.9e-05,0.000302,0.000334,0.000164,3.9e-05,1.1e-05,3.3e-05,1.7e-05,1.5e-05,1.9e-05,2e-05,1.2e-05,1.2e-05,1.7e-05,4.5e-05,9.3e-05,4.6e-05,3.7e-05,2.8e-05,1e-05,6.3e-05,4.8e-05,5.1e-05,1e-06,4.1e-05,7e-05,6.2e-05,0.000125,0.001776,0.002602,0.002894,0.00156,0.001534,0.001131,0.000718,0.000243,0.000222,0.000707,3e-05,0.000125,0.000113,0.000316,0.000107,0.001944,0.003137,0.001485,0.002232,0.002847,0.002055,0.001286,0.001137,0.001482,0.000824,0.000659,0.000995,0.000575,0.002728,0.000815,0.00134,0.000204,0.00103,0.000773,0.003244,0.001216,0.00166,0.001995,0.002957,0.000926,0.001748,0.002202,0.00086,0.000877,0.001298,0.001231,0.001284,7e-04,0.000319,0.00032,0.00017,0.000293,0.000242,0.000103,9.4e-05,0.000169,0.000243,0.000146,0.00011,2.3e-05,5.3e-05,6.6e-05,7.4e-05,3.8e-05,5.5e-05,5.4e-05,0.000168,6.2e-05,2.2e-05,8.2e-05,6.8e-05,0.000108,5.1e-05,3.3e-05,4.4e-05,1e-04,9.2e-05,2.3e-05,2.6e-05,5.2e-05,4.6e-05,5.6e-05,6.8e-05,4.1e-05,1.5e-05,3.5e-05,4.6e-05,0.000144
4e-05,1.3e-05,9e-06,1.8e-05,4.2e-05,1.1e-05,0.000269,0.000107,6.5e-05,7e-06,1.8e-05,3.6e-05,2.4e-05,1.4e-05,2.3e-05,4.3e-05,2.9e-05,3.4e-05,4.1e-05,0.000238,7e-05,3.8e-05,4.8e-05,2.9e-05,3.8e-05,2.8e-05,1.5e-05,4e-05,4.4e-05,3.5e-05,3.8e-05,4.6e-05,5.1e-05,0.001627,0.00274,0.001056,0.000649,0.000824,0.000125,1.5e-05,0.000331,0.000352,0.000578,0.000514,0.000201,0.000156,0.000626,0.000934,0.003166,0.000425,0.002783,0.00269,0.0041,0.001575,0.000973,0.00195,0.002058,0.001432,0.001561,0.000244,0.001869,0.000949,0.002146,0.00284,0.001282,0.000708,0.00108,0.004421,0.002995,0.001372,0.00316,0.001918,0.002935,0.002758,0.003391,0.002685,0.000332,0.000975,0.002063,0.001941,0.000507,0.000535,0.000525,7e-05,0.000213,0.000588,0.000247,0.000188,0.000399,0.000217,0.000334,0.000102,7.6e-05,0.00022,0.000117,0.000165,9.3e-05,7.7e-05,0.000183,0.000157,0.000159,0.000118,0.000154,0.000103,0.000121,2e-05,5.6e-05,7.7e-05,0.000106,0.000163,0.000163,4e-05,8e-05,9e-05,5.3e-05,0.000111,0.000129,0.000117,0.00011,0.000106,2.3e-05
6e-05,5.1e-05,4.2e-05,3.4e-05,6e-05,6.2e-05,0.000229,8.4e-05,1.9e-05,4.3e-05,3.5e-05,4.8e-05,1.6e-05,1.4e-05,2.2e-05,2.7e-05,3.2e-05,5.2e-05,1.6e-05,0.000237,9e-05,4.6e-05,4.7e-05,2.6e-05,4.4e-05,5e-05,3.2e-05,3.6e-05,2.9e-05,3.4e-05,3.5e-05,4.2e-05,3.6e-05,0.001367,0.001372,0.000205,0.000884,2.6e-05,0.000227,9.9e-05,0.000184,3.8e-05,0.000455,0.000563,0.000365,7.3e-05,0.000759,0.001948,0.003502,0.001363,0.00312,0.001838,0.00275,0.002187,0.002781,0.003579,0.002514,0.001762,0.003339,0.003996,0.004155,0.001338,0.006983,0.00553,0.001688,0.001043,0.002324,0.004936,0.002816,0.00189,0.007799,0.004213,0.002116,0.005098,0.003229,0.003072,0.001387,0.001286,0.004766,0.001044,0.000602,0.001022,0.00056,0.000223,0.000316,0.000743,0.000227,0.000184,0.00015,0.000123,0.000447,0.000521,0.000319,0.000575,0.000451,0.000441,0.000511,0.000294,0.000399,0.000294,0.000308,0.000115,0.000133,6.8e-05,0.000169,0.000216,9.4e-05,4.3e-05,2.7e-05,8.7e-05,9.8e-05,0.000216,6.4e-05,0.000118,0.000138,6.2e-05,9.4e-05,2.7e-05,0.000109,0.00017,5e-05
3.7e-05,1.9e-05,2.4e-05,9e-06,4.1e-05,3.3e-05,0.000235,6.9e-05,6.9e-05,2.8e-05,1.6e-05,7e-06,1.6e-05,1.5e-05,1.3e-05,2.6e-05,3.5e-05,3.5e-05,5.3e-05,0.000223,0.000177,5.8e-05,6.5e-05,8.4e-05,9.5e-05,8.1e-05,6.1e-05,3.3e-05,2.9e-05,4.6e-05,3.9e-05,1.6e-05,6.3e-05,0.001374,0.001965,0.001202,0.000901,0.000522,0.000776,0.000265,9.2e-05,9.3e-05,0.000504,0.000841,0.000411,0.000294,0.000962,0.003011,0.005991,0.005661,0.003728,0.005389,0.002696,0.001345,0.003599,0.002353,0.004066,0.004614,0.00356,0.003197,0.000736,0.003881,0.006323,0.006484,0.007294,0.004519,0.003278,0.001453,0.003544,0.005261,0.00897,0.007504,0.004796,0.005862,0.008295,0.004876,0.001231,0.001934,0.00495,0.007389,0.002185,0.000668,0.00118,0.000679,0.000206,0.001421,0.000783,0.000545,0.000549,0.000498,0.000394,0.000382,0.001073,0.00017,0.000736,0.000202,0.000471,0.000413,0.000316,0.000637,0.000292,0.000455,0.000303,0.000279,0.000292,0.000312,0.000311,5.6e-05,0.000215,8.1e-05,0.000167,0.000291,0.00019,0.000101,0.000111,0.000166,0.000161,3.2e-05,0.000131,0.000167,0.000102
2.2e-05,2.8e-05,1.9e-05,2.2e-05,1.7e-05,6e-06,0.000234,0.000129,0.000123,1.9e-05,6e-06,1.4e-05,1.5e-05,9e-06,3e-05,3.3e-05,1.7e-05,7e-06,1.6e-05,0.000349,0.000198,6.6e-05,6.4e-05,4.8e-05,2.9e-05,2.8e-05,4.3e-05,2.7e-05,3e-05,4e-05,5.2e-05,5.4e-05,3.2e-05,0.001343,0.002419,0.001795,0.000637,0.000479,0.00076,0.000676,0.00029,0.000118,0.000426,0.000523,0.000317,0.000207,0.000873,0.003477,0.005546,0.01054,0.007111,0.007795,0.008785,0.005267,0.00075,0.004343,0.009119,0.011918,0.008174,0.007728,0.004077,0.00734,0.009453,0.005265,0.00967,0.005114,0.004588,0.001665,0.005338,0.007199,0.004688,0.000655,0.004209,0.001628,0.003894,0.008466,0.007738,0.004281,0.001085,0.00906,0.007716,0.003006,0.001279,0.001421,0.001351,0.001806,0.002057,0.001272,0.00095,0.001327,0.001288,0.00083,0.001392,0.001235,0.00027,0.000585,0.000266,8.2e-05,0.000517,0.001256,0.000862,0.000745,0.000286,0.000247,0.000267,0.000163,0.000269,0.000227,0.000291,0.00025,0.000165,9.2e-05,4.3e-05,0.000126,0.000265,8.5e-05,7.5e-05,0.000159,0.000104,6e-06,8.2e-05
8e-06,1.5e-05,2e-05,8e-06,1.3e-05,1e-06,0.000208,0.00022,0.000107,7.6e-05,4.9e-05,2.8e-05,4e-06,1.2e-05,2.7e-05,1.1e-05,1.9e-05,3.1e-05,1e-05,0.000315,0.000115,5.4e-05,6.5e-05,4.4e-05,6.6e-05,5.1e-05,3.9e-05,5.3e-05,5.7e-05,7.7e-05,4.6e-05,1.5e-05,5.1e-05,0.001106,0.001853,0.000902,0.000802,0.000534,0.00068,0.000645,0.000403,0.000235,0.00036,0.000255,8.3e-05,0.00028,0.001271,0.001456,0.007507,0.004256,0.007779,0.00934,0.00764,0.0081,0.00737,0.00354,0.008931,0.00647,0.008906,0.009956,0.007155,0.007547,0.001713,0.006246,0.006218,0.004763,0.009371,0.007908,0.008368,0.006655,0.002601,0.002809,0.006618,0.005796,0.004692,0.008597,0.010749,0.005665,0.004929,0.005717,0.004337,0.003469,0.000867,0.000687,0.000802,0.00148,0.001564,0.000724,0.001057,0.002063,0.001406,0.00179,0.000841,0.000628,0.000911,0.000642,0.000882,0.000508,0.000901,0.000873,0.000712,5e-05,0.000255,0.000593,0.000579,0.000377,0.000186,0.000363,0.000536,0.000186,0.000219,0.000142,4.7e-05,9.2e-05,0.000252,0.000358,0.000266,0.00026,0.000186,3e-05,0.000196
2.9e-05,2.7e-05,1.3e-05,2.6e-05,2.5e-05,1.6e-05,0.000184,0.000169,0.000124,7.4e-05,3.6e-05,3e-05,2.8e-05,5e-06,2.3e-05,3.3e-05,5.4e-05,4.8e-05,4.3e-05,0.000126,6.9e-05,5e-05,2.5e-05,3.2e-05,3.9e-05,6.5e-05,7.1e-05,4.4e-05,6.2e-05,8.6e-05,5.7e-05,3.3e-05,4.7e-05,0.000779,0.001136,0.00077,0.000557,0.000502,0.000636,0.000152,0.000173,5.4e-05,0.000421,0.000687,0.000442,0.000221,0.000801,0.002564,0.004752,0.004886,0.005695,0.002797,0.002514,0.006424,0.00653,0.009701,0.003074,0.001253,0.003467,0.001737,0.006408,0.003679,0.003708,0.006107,0.00561,0.002355,0.005598,0.00696,0.002477,0.005399,0.00362,0.006765,0.002803,0.002829,0.00251,0.004428,0.00346,0.001466,0.003845,0.002238,0.001284,0.001961,0.001591,0.000604,0.000656,0.00074,0.000443,0.000709,0.000485,0.001119,0.000952,0.00113,0.00094,0.000553,0.000559,0.000364,0.000622,0.000366,0.000795,0.000522,8.8e-05,0.000213,0.000194,0.000475,0.00042,0.000283,0.000422,0.000349,8.6e-05,0.000284,0.000433,0.000252,0.000144,0.000101,0.000159,0.000138,6.4e-05,0.000157,0.00018,0.00022,9.4e-05
1.9e-05,2.3e-05,1.5e-05,3.1e-05,2.8e-05,1.8e-05,0.000171,0.000112,4.7e-05,2.7e-05,1.4e-05,3.6e-05,4.9e-05,3.7e-05,1.9e-05,1.9e-05,2.2e-05,1.1e-05,1.8e-05,0.000137,6.9e-05,1.6e-05,1.5e-05,1.4e-05,2e-05,2.6e-05,3.2e-05,2.5e-05,3e-05,3.1e-05,3.6e-05,4.8e-05,5.9e-05,0.00058,0.001014,0.000337,0.000483,0.000242,0.000239,0.00015,0.000236,0.000223,0.000362,0.000995,0.00037,0.00011,0.000845,0.00471,0.004159,0.003071,0.003121,0.0033,0.00125,0.005373,0.001654,0.004716,0.004377,0.002558,0.001578,0.001538,0.00585,0.004919,0.00209,0.001597,0.001413,0.006524,0.002922,0.004149,0.004151,0.003603,0.000222,0.006047,0.008276,0.005987,0.00059,0.000327,0.002761,0.002203,0.003409,0.001788,0.000448,0.001924,0.000963,0.000291,0.000358,0.000612,0.000481,0.00061,0.000574,0.000321,0.000809,0.000109,9.4e-05,0.000425,0.000139,0.000577,3.7e-05,0.000462,0.00015,4e-04,0.000264,0.000204,0.000179,0.000394,0.000495,0.000275,0.000322,3.2e-05,2.4e-05,0.000304,0.000243,0.000108,9.5e-05,1e-05,0.000158,0.000119,9.3e-05,5.7e-05,0.000146,6.9e-05,0.000129
1.1e-05,2.4e-05,1.7e-05,2.8e-05,8e-06,1.7e-05,0.000178,0.000145,4.5e-05,2.5e-05,4e-05,1.7e-05,8e-06,1.8e-05,3.7e-05,9e-06,1.7e-05,1.7e-05,1.3e-05,0.000205,7.9e-05,3.6e-05,3.4e-05,4.1e-05,3e-05,2.6e-05,3.3e-05,3.6e-05,2.4e-05,1.7e-05,2.7e-05,2.1e-05,4.3e-05,0.00056,0.001378,0.001062,0.000231,0.000291,0.000174,6.3e-05,9e-05,0.000257,0.000275,0.001262,0.000749,0.000182,0.000809,0.004111,0.003885,0.002811,0.003074,0.000991,0.002344,0.001153,0.001989,0.000931,0.001861,0.001119,0.002691,0.00225,0.002111,0.003489,0.003208,0.001945,0.002557,0.006026,0.004516,0.002274,0.003266,0.003805,0.003167,0.00307,0.002602,0.00389,0.003109,0.000898,0.001621,0.00179,0.000861,0.001098,4e-04,0.000485,0.000159,0.000857,0.000422,0.000467,0.000668,0.000619,0.000725,0.000189,0.000391,0.000209,0.000194,0.000458,0.00054,0.000434,0.000685,0.000466,0.000319,0.000192,0.000161,0.00013,0.000124,0.000318,0.000127,0.00011,5.6e-05,5.2e-05,0.000113,0.000308,0.000201,0.000134,1.7e-05,2.3e-05,0.000116,3.6e-05,4.1e-05,2.7e-05,0.00011,0.000134,4e-06
5e-06,1.8e-05,4e-06,1e-05,1e-05,1.7e-05,0.000147,0.000103,4.3e-05,2.2e-05,1.6e-05,7e-06,6e-06,2.1e-05,1.9e-05,7e-06,2.2e-05,1.5e-05,1.3e-05,0.000133,0.000106,4.5e-05,3.2e-05,2.7e-05,2.4e-05,1.4e-05,3.5e-05,1.6e-05,2.8e-05,2.2e-05,1e-05,1.9e-05,1.3e-05,0.000364,0.001638,0.001367,0.000576,0.000142,8.9e-05,8.4e-05,7.6e-05,0.000131,0.000281,0.001068,0.000551,7.3e-05,0.000528,0.003229,0.000511,0.000768,0.000356,0.000355,0.001283,0.001985,0.001809,0.001484,0.000807,0.001144,0.001711,0.001439,0.003299,0.000738,0.001193,0.001916,0.000999,0.003341,0.001731,0.001939,0.002266,0.002488,0.001718,0.002693,0.001679,0.002014,0.001647,0.000634,0.000832,0.001056,0.000965,0.001373,0.000736,0.000449,0.000561,0.000225,0.000276,0.000413,0.000452,7.7e-05,0.000317,0.000243,0.000136,0.000189,0.000296,8.4e-05,0.000152,0.00036,0.000362,0.000169,0.000164,0.000211,6.5e-05,9.7e-05,9.4e-05,0.000121,0.000139,0.000117,7.4e-05,2.9e-05,0.00014,6.6e-05,5.7e-05,4e-05,3.4e-05,2.1e-05,4.2e-05,6.6e-05,2.9e-05,4e-05,4.3e-05,1.2e-05,0.000101
2e-06,2e-06,6e-06,6e-06,5e-06,6e-06,7.4e-05,2e-05,2.7e-05,1e-05,1.9e-05,1e-05,5e-06,6e-06,1.2e-05,1e-05,1.4e-05,7e-06,9e-06,4.3e-05,1.6e-05,6e-06,1e-05,6e-06,7e-06,5e-06,1.7e-05,9e-06,5e-06,1e-06,3e-06,6e-06,1.2e-05,0.000101,0.000464,7e-05,0.00014,5.9e-05,7.1e-05,4.6e-05,3.2e-05,3e-05,9.6e-05,0.000342,0.000184,7.9e-05,0.00023,0.001095,0.000874,0.000519,0.000248,0.000638,0.000836,0.000508,0.001413,0.000432,0.00059,0.000495,0.000445,0.000552,0.001556,0.000977,0.000501,0.000769,0.000575,0.000464,0.000601,0.000262,0.001175,0.000361,0.000243,0.000481,0.00055,0.001069,0.000162,0.000155,0.000319,4.9e-05,0.00054,0.000511,0.000325,7.5e-05,0.000113,2.2e-05,2.3e-05,0.000168,3.9e-05,9.6e-05,9.7e-05,6.5e-05,7.2e-05,3.5e-05,7.3e-05,7.7e-05,5.2e-05,6.8e-05,6.4e-05,5.3e-05,5.6e-05,7.1e-05,5e-05,1.7e-05,1.6e-05,4.2e-05,2.9e-05,6e-06,4.6e-05,1.9e-05,2.3e-05,2.3e-05,3.8e-05,6e-06,1.1e-05,1.7e-05,2.4e-05,5e-06,1.4e-05,7e-06,9e-06,6e-06,1.9e-05
1e-06,3e-06,7e-06,3e-06,1e-06,1e-06,7e-05,2e-06,8e-06,6e-06,1.8e-05,1.3e-05,1.1e-05,3e-06,5e-06,1e-05,7e-06,6e-06,7e-06,4.6e-05,2.4e-05,2e-05,1.5e-05,3e-06,9e-06,1.5e-05,8e-06,8e-06,1.5e-05,1e-05,4e-06,1.1e-05,4e-06,0.000121,2e-04,6.8e-05,0.000158,3.9e-05,2.6e-05,3.4e-05,1.7e-05,1.5e-05,8.6e-05,0.000154,7.2e-05,3.8e-05,0.000121,0.000487,0.00049,0.000521,8.5e-05,0.000559,0.000547,0.000518,0.001261,0.001339,9.6e-05,0.000546,0.000567,0.000515,0.000659,0.000555,0.00069,0.000584,0.000387,0.00048,0.000784,0.000399,0.000738,0.000932,0.000374,0.000187,0.000489,0.00078,0.000729,5e-05,0.000254,0.000346,0.000315,0.000538,0.00011,6.7e-05,7.6e-05,5.8e-05,2.1e-05,0.000157,6.1e-05,8.1e-05,5.9e-05,2.9e-05,7.9e-05,2.3e-05,0.000105,6.7e-05,2.6e-05,2.9e-05,3.3e-05,6.2e-05,6.5e-05,2.4e-05,3.3e-05,3.5e-05,3.2e-05,2.5e-05,2.4e-05,2.7e-05,2.6e-05,7e-06,4e-06,1.1e-05,2.6e-05,1.9e-05,2.2e-05,1.4e-05,8e-06,1.5e-05,6e-06,1.2e-05,5e-06,2e-05,7e-06
2e-06,3e-06,3e-06,4e-06,1e-06,4e-06,6.5e-05,1.4e-05,2.2e-05,9e-06,5e-06,5e-06,7e-06,6e-06,1e-05,9e-06,5e-06,6e-06,9e-06,1.7e-05,8e-06,1.8e-05,2e-06,1e-06,1.2e-05,0,5e-06,2e-06,1e-05,7e-06,7e-06,1.1e-05,1.8e-05,0.000211,0.000173,7.1e-05,0.000141,6.6e-05,4.4e-05,4.7e-05,1.5e-05,1e-05,8e-05,8.9e-05,7.4e-05,2.8e-05,5.5e-05,0.000205,0.000455,0.000438,0.000415,0.000162,0.000246,0.000324,0.000681,0.000258,0.000244,0.000522,0.000601,0.000616,2.7e-05,0.000698,0.000408,0.000271,0.000422,0.000499,0.000287,0.00034,0.000707,0.000658,0.000368,0.00029,0.000311,0.000435,0.00026,0.000183,0.000224,0.00012,0.000253,0.000178,5.2e-05,3.7e-05,7.9e-05,3.6e-05,1e-05,0.000102,1.8e-05,4.3e-05,7.7e-05,5e-05,6.1e-05,1.7e-05,6.9e-05,1.9e-05,2.9e-05,1.9e-05,4.7e-05,3.9e-05,3.1e-05,2.8e-05,1.3e-05,2e-05,1.7e-05,1.7e-05,2.8e-05,1.9e-05,2.7e-05,7e-06,4e-06,7e-06,8e-06,1.2e-05,1e-05,1.1e-05,2e-06,5e-06,1.1e-05,6e-06,5e-06,3.5e-05,2.1e-05
2e-06,2e-06,2e-06,4e-06,2e-06,2e-06,6.4e-05,3.1e-05,1.5e-05,1.3e-05,9e-06,8e-06,1e-06,2e-06,5e-06,4e-06,5e-06,1e-06,8e-06,8e-06,1.1e-05,9e-06,7e-06,0,7e-06,1e-05,6e-06,5e-06,8e-06,7e-06,1e-05,1.7e-05,1e-05,0.000257,0.000159,7.3e-05,0.000128,7.8e-05,7.2e-05,3.8e-05,1.4e-05,9e-06,7.8e-05,9.6e-05,3.4e-05,3e-05,4.4e-05,0.000239,3e-04,0.00019,0.000191,0.000437,0.00047,0.000214,0.000454,0.000403,0.000297,0.000413,0.000605,0.000438,0.000612,0.000318,0.000222,0.000381,0.000273,0.000273,0.000514,0.000415,0.000751,0.000395,0.000193,0.000432,0.000553,0.000629,0.000341,0.000194,3e-05,0.000329,0.000343,0.000288,0.000116,4.6e-05,5.4e-05,4.8e-05,2e-05,1e-04,5.1e-05,1.9e-05,4.3e-05,3.3e-05,5.6e-05,2.1e-05,6.8e-05,3.8e-05,3.2e-05,2.2e-05,4.8e-05,3.4e-05,3.7e-05,1.2e-05,2e-05,1.6e-05,1.8e-05,1.7e-05,2.4e-05,1.5e-05,2.8e-05,1e-05,3e-06,1.1e-05,1.1e-05,7e-06,5e-06,4e-06,4e-06,3e-06,8e-06,7e-06,5e-06,3.6e-05,2.1e-05
1e-06,1e-06,2e-06,3e-06,2e-06,2e-06,6e-05,3.2e-05,1e-05,1.4e-05,1.8e-05,1.1e-05,3e-06,3e-06,4e-06,2e-06,2e-06,3e-06,4e-06,9e-06,5e-06,4e-06,3e-06,3e-06,2e-06,1e-05,9e-06,5e-06,1.1e-05,3e-06,1.1e-05,3e-06,1.5e-05,0.000234,8e-05,4.8e-05,0.000103,7e-05,3.1e-05,2e-05,7e-06,1.3e-05,5.6e-05,5.5e-05,5e-05,2.9e-05,7.8e-05,0.000268,0.000192,0.000163,0.000297,0.000268,0.00011,9.8e-05,0.000311,0.000108,0.00051,0.000172,0.000499,0.000141,0.000541,0.000244,0.00026,0.000228,0.000538,0.000248,0.00045,0.000313,0.000556,0.000219,0.000288,0.000284,0.00026,0.000318,0.000239,5.2e-05,0.000244,0.000355,0.000305,0.000304,2e-06,1.8e-05,7.3e-05,4.1e-05,1.4e-05,7.2e-05,3.2e-05,1.7e-05,5.9e-05,3.2e-05,1.8e-05,1e-05,3.9e-05,6e-06,4.1e-05,2.1e-05,6e-05,3.2e-05,3e-05,1.5e-05,2.1e-05,2e-05,1.4e-05,1.7e-05,2e-05,2.3e-05,8e-06,2e-06,1.2e-05,6e-06,2.1e-05,1.4e-05,5e-06,7e-06,6e-06,1.4e-05,1.5e-05,2e-06,7e-06,2e-05,2.6e-05
1e-06,1e-06,3e-06,2e-06,0,1e-06,5.8e-05,1.9e-05,1.4e-05,2e-05,1e-05,3e-06,3e-06,3e-06,2e-06,3e-06,6e-06,2e-06,7e-06,1.4e-05,1.2e-05,7e-06,6e-06,5e-06,1e-06,4e-06,7e-06,1.3e-05,4e-06,8e-06,9e-06,1.2e-05,1.4e-05,0.000175,0.000215,9.8e-05,0.000107,6.4e-05,2e-05,3e-05,1.2e-05,5e-06,7.2e-05,3.7e-05,3.3e-05,3.3e-05,8.4e-05,0.000324,0.000363,0.000143,0.000309,0.000354,0.00029,0.000518,0.000498,0.000525,0.000488,0.000207,0.000228,0.000163,0.000242,0.000362,0.000231,0.000135,0.000245,0.00024,0.00038,0.000269,0.000296,0.000227,0.000236,0.000283,0.000212,0.000129,0.000511,0.000291,0.000103,0.00012,0.00029,0.000289,0.000119,8.5e-05,7.6e-05,8.5e-05,4.9e-05,5.3e-05,2.4e-05,3.7e-05,3e-05,1.9e-05,2.9e-05,1.2e-05,3.6e-05,2.7e-05,3.3e-05,2.7e-05,2.9e-05,2.9e-05,1.1e-05,7e-06,9e-06,9e-06,2.2e-05,1.5e-05,1.9e-05,2.3e-05,2.8e-05,1.2e-05,6e-06,1.8e-05,2.4e-05,9e-06,1.6e-05,7e-06,8e-06,1.1e-05,7e-06,8e-06,7e-06,2.1e-05,2.2e-05
1e-06,1e-06,2e-06,2e-06,1e-06,2e-06,5.7e-05,9e-06,7e-06,1.2e-05,4e-06,1e-06,2e-06,5e-06,6e-06,7e-06,2e-06,3e-06,3e-06,2.5e-05,2e-06,6e-06,8e-06,1e-06,4e-06,6e-06,5e-06,9e-06,5e-06,6e-06,6e-06,7e-06,1.9e-05,8.3e-05,0.000189,0.000104,0.000148,4e-05,5e-05,3.8e-05,9e-06,9e-06,5.5e-05,4.3e-05,1.4e-05,3.5e-05,5.5e-05,0.000282,0.000294,0.00021,0.000469,0.000277,0.000433,0.000117,0.000303,0.000148,0.000408,0.000227,0.000116,0.000196,0.000195,0.000237,0.000464,0.000589,0.000371,0.000185,0.000198,0.000177,0.000362,0.000284,0.000234,0.000255,0.000327,0.000347,4.9e-05,0.000342,0.000136,0.000387,0.000407,2e-04,9.8e-05,3.9e-05,9e-05,6.1e-05,3.9e-05,3.6e-05,3.4e-05,3.6e-05,4.3e-05,1.9e-05,4.3e-05,3.1e-05,4.6e-05,5.7e-05,6e-05,1.6e-05,5.9e-05,3e-06,7e-06,7e-06,3.4e-05,1.3e-05,1.2e-05,8e-06,2.6e-05,1.6e-05,2.7e-05,6e-06,1.6e-05,2.5e-05,1.6e-05,5e-06,3e-06,1e-05,6e-06,2.1e-05,1.4e-05,7e-06,1.2e-05,5.5e-05,2.6e-05
0,1e-06,1e-06,2e-06,1e-06,2e-06,5.4e-05,1.5e-05,1.4e-05,1.1e-05,5e-06,3e-06,4e-06,7e-06,4e-06,3e-06,7e-06,5e-06,8e-06,1e-05,3e-06,9e-06,7e-06,8e-06,7e-06,1.1e-05,1.3e-05,2e-06,6e-06,1.7e-05,7e-06,9e-06,7e-06,3.7e-05,0.000158,8.6e-05,0.00014,9.2e-05,2.8e-05,4.6e-05,1.6e-05,1.7e-05,4.8e-05,2.1e-05,3.9e-05,1.6e-05,7.2e-05,0.000283,0.000154,0.000176,0.000387,0.00036,0.000509,0.000412,0.000117,0.000419,0.000182,0.000233,9.8e-05,0.000171,0.000173,0.000576,0.000558,0.000246,0.000306,0.000321,0.000417,0.000112,0.000531,0.000366,0.000103,0.000333,0.000127,0.000394,0.000227,0.000243,0.000116,0.000505,9.1e-05,0.000192,3.8e-05,7.5e-05,8.9e-05,0.00014,7e-05,5.1e-05,5.8e-05,4.8e-05,6e-06,5.7e-05,5.1e-05,2.9e-05,1.1e-05,4.3e-05,1e-05,5.6e-05,6.8e-05,8.3e-05,2.6e-05,2.4e-05,1.1e-05,2.3e-05,1.9e-05,9e-06,2.2e-05,2.3e-05,6e-06,1.8e-05,1.3e-05,1.9e-05,1.7e-05,4e-06,9e-06,1.8e-05,1.4e-05,2e-05,8e-06,1.8e-05,1.4e-05,8.5e-05,1.7e-05
0,2e-06,2e-06,1e-06,1e-06,1e-06,5.4e-05,1.6e-05,1.2e-05,1.4e-05,8e-06,1e-05,4e-06,9e-06,3e-06,4e-06,7e-06,1e-06,9e-06,1.9e-05,1e-05,5e-06,6e-06,4e-06,1e-05,2e-06,1e-05,1.3e-05,1e-05,1e-05,3e-06,1.4e-05,1.1e-05,0.000101,0.000116,2.6e-05,0.000182,8.5e-05,4.1e-05,1.7e-05,1.3e-05,1.4e-05,5.1e-05,2e-05,3.4e-05,2.5e-05,5.4e-05,0.000296,0.000205,6e-05,0.000332,0.000198,0.000363,0.000131,0.000137,0.00014,0.000114,0.000206,0.000162,0.000129,1.5e-05,0.000362,4.6e-05,0.00031,2.8e-05,0.000263,7.3e-05,0.000442,0.000373,0.000238,4e-05,0.000433,0.000234,0.00012,0.00028,0.00016,8.3e-05,0.00046,0.00055,0.000287,0.000116,0.000184,9.3e-05,0.000104,5.2e-05,7.8e-05,4.5e-05,3.3e-05,4.5e-05,1.4e-05,1.7e-05,3.9e-05,8.5e-05,3.8e-05,2.8e-05,3.7e-05,3e-05,5.3e-05,3.1e-05,4.7e-05,2.5e-05,1.7e-05,1.4e-05,1.8e-05,1.9e-05,9e-06,1.3e-05,1.7e-05,1e-06,6e-06,4e-06,1.4e-05,1.6e-05,1.4e-05,1.4e-05,8e-06,8e-06,1.5e-05,9e-06,9.2e-05,0.000103
4e-06,1e-06,4e-06,2e-06,1e-06,0,5.4e-05,1.4e-05,3e-06,1.1e-05,3e-06,8e-06,4e-06,6e-06,7e-06,3e-06,3e-06,3e-06,8e-06,2.6e-05,1.2e-05,1.4e-05,1e-06,5e-06,0,5e-06,1.4e-05,1.1e-05,1.7e-05,1.1e-05,8e-06,1.1e-05,1.5e-05,0.000162,0.000185,5e-05,1e-04,2.7e-05,6.9e-05,5.7e-05,3e-05,2.5e-05,3.4e-05,6.8e-05,4.3e-05,2.9e-05,5e-05,0.000156,0.000229,0.000111,0.000249,0.000256,0.000316,0.000306,8.2e-05,0.000192,0.000228,0.00023,0.000224,8.7e-05,0.000209,0.000362,0.000367,0.000248,0.000229,0.000149,0.000156,0.000423,0.000584,0.00014,0.000173,0.000337,0.000227,0.000248,0.000368,9.3e-05,8.3e-05,0.000171,0.000227,0.000192,0.000135,5.1e-05,7e-06,6.4e-05,3.1e-05,7e-05,3.6e-05,7e-05,1.4e-05,3.1e-05,1.6e-05,2.1e-05,5.2e-05,3.8e-05,3e-05,4e-05,4.5e-05,1.5e-05,1.1e-05,3.3e-05,1.8e-05,1.5e-05,6e-06,1e-05,7e-06,2.8e-05,1.5e-05,1e-05,1.2e-05,2.1e-05,1.8e-05,1.2e-05,9e-06,1e-05,7e-06,2e-06,8e-06,2e-06,7e-06,9.9e-05,0.000132
2e-06,3e-06,3e-06,2e-06,1e-06,1e-06,5.3e-05,3e-06,1.7e-05,7e-06,7e-06,5e-06,3e-06,2e-06,1e-06,5e-06,5e-06,4e-06,7e-06,1.9e-05,1.7e-05,2e-06,1e-05,5e-06,4e-06,3e-06,9e-06,1.3e-05,1.6e-05,1.3e-05,7e-06,5e-06,2e-05,0.000252,4.7e-05,0.000127,5.9e-05,4.4e-05,0.000136,7.3e-05,4.6e-05,6e-05,0.000104,0.000159,0.000131,4.4e-05,7.1e-05,0.00011,0.000107,0.000117,0.00018,0.000204,0.000228,0.000242,0.000191,4e-04,0.000206,0.000186,0.000211,5.4e-05,0.000296,0.00032,0.000329,0.000157,0.000179,0.000105,0.00018,2e-04,0.000286,0.000271,0.000104,0.000227,0.000133,0.000228,0.00038,0.000162,9.9e-05,5.3e-05,0.000225,0.000174,1.2e-05,5.5e-05,6.7e-05,3.9e-05,2.3e-05,1.6e-05,5e-05,2.6e-05,4e-05,3.1e-05,4.4e-05,5.3e-05,5.8e-05,2e-05,9e-06,3.6e-05,6.9e-05,5.3e-05,1e-05,1.3e-05,1.6e-05,1.3e-05,2.2e-05,1.1e-05,1.2e-05,1.6e-05,2e-05,1.6e-05,1.6e-05,9e-06,1.3e-05,2.2e-05,1.7e-05,7e-06,1e-05,1.8e-05,1e-05,1.1e-05,5e-06,9.3e-05,7.4e-05
2e-06,1e-06,2e-06,1e-06,1e-06,1e-06,5.1e-05,6e-06,5e-06,7e-06,1e-05,6e-06,3e-06,6e-06,2e-06,1e-06,6e-06,8e-06,5e-06,1.3e-05,9e-06,8e-06,1.2e-05,5e-06,8e-06,5e-06,4e-06,9e-06,9e-06,6e-06,8e-06,7e-06,1.2e-05,0.000278,0.00039,0.00029,0.000268,6.8e-05,0.000148,0.000143,0.000132,0.000118,2.9e-05,0.000154,6.1e-05,5.4e-05,8.7e-05,0.000235,0.000168,0.000142,0.000224,0.000242,0.000218,0.000163,0.000181,5.4e-05,0.000185,0.000191,0.000168,0.000124,0.000296,0.000261,0.000257,0.00023,0.000179,0.000147,0.000143,0.000103,0.000213,0.000203,0.000108,0.000142,0.000393,0.000327,0.000292,0.000127,0.000154,5.4e-05,0.000188,0.000217,0.000106,4e-05,4.5e-05,2.9e-05,1.6e-05,5.3e-05,2e-06,2.4e-05,4.4e-05,1.3e-05,3.3e-05,4.9e-05,3e-05,1.3e-05,2.1e-05,4.5e-05,1.1e-05,1.7e-05,1.5e-05,1e-05,1.3e-05,8e-06,1.9e-05,2e-06,4e-06,8e-06,2.4e-05,1.3e-05,6e-06,7e-06,5e-06,6e-06,8e-06,5e-06,5e-06,1.3e-05,7e-06,3e-06,2e-06,6.9e-05,2.1e-05
1e-06,2e-06,3e-06,0,1e-06,1e-06,5e-05,1e-05,1.3e-05,1.1e-05,6e-06,2e-06,2e-06,5e-06,7e-06,6e-06,3e-06,7e-06,1.3e-05,1.6e-05,5e-06,1.1e-05,1.1e-05,1.1e-05,7e-06,1e-05,7e-06,5e-06,1.9e-05,1.3e-05,6e-06,1.5e-05,2e-05,0.000228,0.000321,0.000191,9.1e-05,8.7e-05,8.1e-05,6.7e-05,3.7e-05,3.4e-05,5.6e-05,0.000109,4e-05,1.2e-05,6.8e-05,0.000202,0.000156,6.3e-05,0.000227,0.000231,0.000252,0.000206,0.000192,0.000398,0.000121,0.00019,9.6e-05,0.000241,0.000295,0.000337,0.000171,0.000157,0.00015,8.8e-05,3.5e-05,0.000208,0.000158,0.000316,0.000256,0.000165,0.000265,0.000146,0.000303,0.00015,0.000159,0.000125,0.000282,0.00018,0.000107,1.6e-05,4.2e-05,3.2e-05,2.7e-05,4.5e-05,2.8e-05,3e-05,2.4e-05,1e-05,4e-05,2.5e-05,6e-05,2.5e-05,1.8e-05,3.5e-05,1.6e-05,1.7e-05,1.1e-05,1e-05,6e-06,4e-06,1.6e-05,1.2e-05,7e-06,1e-05,1.6e-05,5e-06,1e-06,2e-06,1e-05,2e-06,6e-06,3e-06,3e-06,2e-06,1e-06,5e-06,6e-06,3.7e-05,1.8e-05
1e-06,2e-06,2e-06,2e-06,1e-06,2e-06,4.9e-05,1.1e-05,1.8e-05,1e-05,9e-06,2e-06,1e-06,2e-06,2e-06,2e-06,4e-06,6e-06,3e-06,1.3e-05,4e-06,1.5e-05,5e-06,8e-06,7e-06,1.1e-05,1.2e-05,1e-05,9e-06,5e-06,1e-05,2e-06,1.1e-05,0.00015,0.000293,0.000145,9.6e-05,0.000115,9.1e-05,3.5e-05,3.3e-05,6.1e-05,1.5e-05,9.9e-05,5.5e-05,4.2e-05,9e-06,0.000116,0.000131,0.000169,0.00019,0.000174,0.000229,0.000107,0.000275,0.000296,0.00014,0.000197,0.000134,0.000172,0.000358,0.000128,0.000191,0.000269,0.000234,4.3e-05,7.9e-05,0.000245,3.4e-05,0.000383,0.000107,0.000325,6.7e-05,0.000117,0.000237,0.000123,0.00012,7.1e-05,0.000258,0.000128,9.5e-05,3.4e-05,6.2e-05,7e-06,3.4e-05,4.2e-05,4e-05,3.5e-05,5e-05,2.3e-05,2.8e-05,5e-06,5.6e-05,1.2e-05,2e-05,3.9e-05,2.1e-05,3e-05,1.3e-05,1.5e-05,1e-05,1.1e-05,1.1e-05,1.4e-05,3e-06,1.3e-05,8e-06,6e-06,3e-06,1e-06,1.6e-05,9e-06,1.3e-05,6e-06,2e-06,9e-06,5e-06,1e-05,3e-06,1.6e-05,6e-06
1e-06,2e-06,1e-06,2e-06,1e-06,2e-06,5e-05,1.7e-05,1.6e-05,6e-06,3e-06,4e-06,4e-06,1e-06,1e-06,1e-06,7e-06,2e-06,3e-06,1.6e-05,5e-06,9e-06,1e-05,0,8e-06,6e-06,1.1e-05,4e-06,6e-06,1.1e-05,1e-05,4e-06,1.6e-05,0.000101,0.00048,0.00037,0.000272,9.1e-05,7.6e-05,4.7e-05,1.6e-05,7.1e-05,0.000109,0.00011,0.00012,0.000148,0.000123,8.6e-05,0.000206,0.00023,0.000286,0.000223,0.000233,0.000178,0.000323,0.000213,0.000236,0.000155,0.000184,0.000243,0.000218,0.000121,0.000102,0.000104,0.000169,3.9e-05,1.1e-05,0.000159,0.000176,0.000106,6e-05,0.000382,9.9e-05,0.000304,8.6e-05,4.3e-05,7.3e-05,8.9e-05,0.00018,0.000247,0.00012,6.1e-05,7e-05,0.000135,0.000119,1.3e-05,5.2e-05,7.5e-05,4.4e-05,1.7e-05,2.4e-05,4e-05,6.8e-05,4.8e-05,3.2e-05,1.2e-05,2.5e-05,8e-06,1.3e-05,6e-06,6e-06,1.3e-05,1.1e-05,3.2e-05,1.9e-05,6e-06,1.7e-05,5e-06,9e-06,1.3e-05,1.7e-05,2.5e-05,1e-05,6e-06,6e-06,1.6e-05,6e-06,7e-06,4e-06,8e-06,6e-06
1e-06,2e-06,1e-06,1e-06,0,1e-06,4.8e-05,1.8e-05,1.1e-05,1.4e-05,1e-05,4e-06,8e-06,5e-06,1e-06,4e-06,5e-06,0,7e-06,1.6e-05,2e-06,7e-06,4e-06,5e-06,7e-06,4e-06,1e-05,9e-06,7e-06,7e-06,5e-06,1e-05,2.4e-05,6.7e-05,0.000433,0.000207,0.000108,0.000133,9.7e-05,0.000122,7.1e-05,6.1e-05,0.000144,6.8e-05,2e-05,6.5e-05,5e-05,0.00016,0.000233,0.00013,0.00013,0.00026,0.000205,0.000152,0.000411,0.00041,0.000263,0.000154,0.000309,1.9e-05,0.000157,0.000302,0.000268,0.000196,0.00024,3.4e-05,9.6e-05,0.000108,9.2e-05,0.000357,0.000205,0.000201,0.000269,0.000249,5.5e-05,3.5e-05,3.9e-05,1.6e-05,0.000258,0.00026,0.000178,7.7e-05,4.6e-05,1e-04,2.5e-05,7.7e-05,5.1e-05,5.6e-05,6.4e-05,2.7e-05,3.4e-05,4.9e-05,8.2e-05,4.8e-05,2.4e-05,4.8e-05,2e-05,6e-06,3.3e-05,2.6e-05,1.9e-05,1.6e-05,1.7e-05,1.9e-05,1.3e-05,1.3e-05,1.2e-05,8e-06,1.1e-05,1.2e-05,1.9e-05,2.3e-05,1.8e-05,1.2e-05,5e-06,1.1e-05,8e-06,6e-06,6e-06,7e-06,6e-06
0,1e-06,1e-06,1e-06,0,1e-06,4.8e-05,1.5e-05,1.4e-05,2e-06,8e-06,3e-06,6e-06,3e-06,2e-06,2e-06,4e-06,2e-06,7e-06,1.2e-05,6e-06,3e-06,7e-06,2e-06,3e-06,2e-06,1e-05,5e-06,4e-06,0,6e-06,8e-06,1e-05,6.5e-05,0.000247,0.000159,0.000102,4e-05,4.2e-05,5.2e-05,6.4e-05,8e-05,4.8e-05,6.2e-05,1.7e-05,3.9e-05,7.8e-05,0.000122,0.000225,9.9e-05,0.000213,9.6e-05,9.8e-05,0.000204,0.000353,8.3e-05,0.00011,1.2e-05,0.000279,6.6e-05,0.000192,0.000223,0.000436,0.000204,0.000179,5.3e-05,7.6e-05,0.000123,0.000244,0.000223,0.00012,0.00029,0.000118,0.000203,0.000212,7.7e-05,6e-05,0.000154,0.000127,0.000125,6.9e-05,3.1e-05,2e-05,5.4e-05,4.4e-05,1.6e-05,4.4e-05,6.4e-05,5.1e-05,6.2e-05,4.4e-05,2.2e-05,2.7e-05,2.6e-05,4.2e-05,1.9e-05,4.8e-05,4.1e-05,2e-05,2.4e-05,2.5e-05,6e-06,1.5e-05,9e-06,1.3e-05,2.1e-05,2.9e-05,1.2e-05,1.1e-05,5e-06,8e-06,1.3e-05,7e-06,4e-06,9e-06,5e-06,2e-06,1e-06,6e-06,1e-05,2e-06
1e-06,1e-06,1e-06,1e-06,1e-06,1e-06,4.8e-05,9e-06,6e-06,4e-06,1e-06,4e-06,1e-06,2e-06,2e-06,3e-06,2e-06,1e-06,5e-06,9e-06,6e-06,7e-06,4e-06,4e-06,1e-06,4e-06,4e-06,3e-06,2e-06,4e-06,3e-06,4e-06,1.5e-05,5.9e-05,7.7e-05,3e-05,7.9e-05,1.2e-05,1.5e-05,1.7e-05,2.5e-05,2.8e-05,2.5e-05,5.2e-05,2.4e-05,4e-06,2.4e-05,0.000112,0.000247,0.000102,0.000181,0.00019,7.6e-05,0.000158,0.000332,0.000269,0.000154,0.000123,0.000236,0.000111,0.00017,7.2e-05,0.000203,0.000176,0.000152,5.4e-05,3e-05,0.00012,0.000284,0.000319,4e-05,0.000148,0.000162,0.000172,0.000183,1e-04,3.7e-05,0.000145,0.000159,0.000208,4.2e-05,1.3e-05,5e-06,4e-05,2.4e-05,4.8e-05,1.6e-05,3.4e-05,3.6e-05,2.7e-05,3.5e-05,1.1e-05,4.1e-05,2.4e-05,1.3e-05,1.4e-05,2.3e-05,2.1e-05,1.8e-05,1.8e-05,1.3e-05,1e-06,9e-06,3e-06,4e-06,1.2e-05,1.6e-05,2e-06,6e-06,4e-06,9e-06,5e-06,2e-06,2e-06,4e-06,4e-06,2e-06,0,2e-06,5e-06,4e-06
0,1e-06,1e-06,1e-06,0,1e-06,4.7e-05,6e-06,5e-06,4e-06,4e-06,4e-06,2e-06,2e-06,1e-06,2e-06,3e-06,1e-06,5e-06,9e-06,1e-06,5e-06,2e-06,2e-06,1e-06,3e-06,4e-06,2e-06,3e-06,2e-06,3e-06,3e-06,1.2e-05,4.7e-05,5.2e-05,5.8e-05,7.2e-05,6e-06,1.3e-05,1.6e-05,6e-06,3.1e-05,6e-06,4.1e-05,1.4e-05,1.4e-05,2.8e-05,0.000139,0.000223,0.000177,9.3e-05,0.00016,0.000133,0.000122,0.000232,0.000111,0.000113,2e-04,0.000139,0.000128,0.000214,0.000244,9.2e-05,0.000108,9.9e-05,7.6e-05,2.8e-05,0.000109,0.000203,0.000347,0.000159,0.000197,0.000156,0.000186,0.000183,0.000136,7.5e-05,7.9e-05,0.000169,0.000163,6.1e-05,8e-06,4e-06,5.4e-05,2.4e-05,3.2e-05,7e-06,2.9e-05,2.3e-05,2.4e-05,3.5e-05,7e-06,3.1e-05,1.6e-05,1.2e-05,3e-06,2.6e-05,2.3e-05,1.5e-05,1.4e-05,1.3e-05,1e-06,1.1e-05,2e-06,4e-06,7e-06,1.4e-05,3e-06,1e-06,1e-06,6e-06,5e-06,2e-06,2e-06,4e-06,4e-06,1e-06,2e-06,3e-06,4e-06,5e-06
0,1e-06,1e-06,1e-06,0,1e-06,4.7e-05,8e-06,8e-06,1e-06,2e-06,2e-06,3e-06,2e-06,0,2e-06,3e-06,1e-06,5e-06,1e-05,1e-06,3e-06,3e-06,3e-06,1e-06,3e-06,3e-06,2e-06,3e-06,2e-06,2e-06,2e-06,1.2e-05,3.8e-05,3e-05,3.2e-05,6.2e-05,5e-06,1e-05,1e-05,1.1e-05,2.4e-05,2e-06,2.2e-05,9e-06,1.6e-05,2.5e-05,0.000123,0.000177,0.000104,0.000154,0.000127,0.000213,0.000122,0.000151,0.000221,0.000137,0.000128,0.00016,0.000106,0.000182,0.000219,0.000231,0.000115,0.000149,6e-05,6.2e-05,5.8e-05,0.00021,0.000255,7.6e-05,9.9e-05,9.4e-05,0.000214,5.8e-05,3.9e-05,4.3e-05,1e-04,0.000173,0.000146,5.7e-05,6e-06,4e-06,4.7e-05,1.2e-05,3.5e-05,7e-06,4.6e-05,4.8e-05,2.2e-05,2.9e-05,6e-06,3e-05,1.7e-05,1.4e-05,2e-06,2.3e-05,1.8e-05,1.5e-05,1.2e-05,1.2e-05,3e-06,9e-06,2e-06,2e-06,7e-06,1.2e-05,2e-06,4e-06,1e-06,6e-06,4e-06,2e-06,2e-06,4e-06,3e-06,3e-06,3e-06,2e-06,2e-06,3e-06
