0.000324,0.000273,0.000105,0.000637,0.000432,0.000388,0.000142,5.8e-05,7.2e-05,-1.5e-05,0.000294,5.4e-05,9.6e-05,-0.000819,-0.001623,-0.000858,-0.000197,6.9e-05,-0.000704,-0.009229,-0.014951,-0.010698,-0.004875,-0.006799,-0.006457,-0.009416,-0.007876,-0.004599,-0.007711,-0.006555,-0.00306,-0.006559,-0.00451,-0.005227,-0.016634,-0.021287,-0.00947,-0.004725,-0.0027,-0.00542,-0.011243,-0.02101,-0.012321,-0.011272,-0.018448,-0.019776,-0.012428,-0.013374,-0.012245,-0.017644,-0.008058,-0.008441,-0.009051,-0.008847,-0.01174,-0.015615,-0.010392,-0.010315,-0.007222,-0.008398,-0.007881,-0.011512,-0.009701,-0.014954,-0.016509,-0.011832,-0.007487,-0.009862,-0.00556,-0.009969,-0.009536,-0.007066,-0.004465,-0.004308,-0.001961,-0.001765,-0.002643,-0.002101,-0.00142,-0.003135,-0.001886,-0.001837,-0.000909,0.000386,0.000543,-0.000557,0.001907,0.003489,0.003079,0.00179,-0.002681,-0.003775,0.000497,0.00032,0.000122,-0.000354,2.9e-05,-0.000158,0.000287,0,0.000107,-7e-05,-0.000176,-9.3e-05,-0.000235,-0.000118,7.2e-05,-2.2e-05,-0.00022,-0.000144,0.000117,7.8e-05,0.000347,0.000367,7.6e-05,0.000121,0.000241,-7e-06,0.000223,0.000259,0.000266
-4e-05,7.1e-05,8.2e-05,0.000129,0.000166,-0.00021,-8e-05,2.6e-05,-1e-06,-0.000102,-0.000203,-0.000157,-6.3e-05,0.000254,0.000987,0.000605,0.000147,-0.000156,0.000199,0.000645,0.002402,0.004598,0.002233,0.004187,0.001697,0.001254,0.00553,0.002557,0.002068,0.003633,0.002689,0.004759,0.001486,0.001993,0.004795,0.013341,0.009624,0.00436,-0.00067,-0.004526,-0.002957,-0.00252,-0.003071,-0.003288,-0.003146,0.00261,0.010064,0.014965,0.000543,0.005698,0.000283,-0.000815,-0.001087,-0.005334,-0.005269,-0.005525,-0.002452,-0.004727,-0.003471,-0.005447,-0.001701,-0.001084,-0.004078,-0.005858,-0.004188,-0.005715,-0.004631,0.001249,0.001833,0.00177,0.001971,-0.000552,-0.003268,-0.001603,-0.000673,-0.002682,-0.001134,-0.000281,-0.001307,-0.000168,-0.001141,-0.000813,-0.000219,5.7e-05,-5.6e-05,-0.000983,0.001184,-0.001277,0.000954,0.000709,-0.000826,-0.000332,-0.004351,-9e-05,0.000425,0.000269,0.000282,0.000272,0.000585,0.000333,0.000196,9.4e-05,-0.000147,-4.9e-05,7.4e-05,7.1e-05,-7.4e-05,-6.6e-05,1e-04,-3.9e-05,0.000187,7.8e-05,-0.000165,9.7e-05,0.000109,-0.000101,4.3e-05,5e-06,0.00028,0.000114,0.000289
2.6e-05,0.000209,-2.5e-05,-0.000157,6.1e-05,-0.000242,-0.000183,-9.1e-05,-1e-05,3.5e-05,-0.000263,-6.7e-05,-7.7e-05,-0.000206,-0.000549,-0.000503,-3.4e-05,-0.000282,-0.000249,-0.000987,-0.001025,-0.002493,-0.001199,-0.000788,-0.000336,0.00106,-0.001775,-0.001933,-0.000825,-0.00242,-0.001392,-0.002499,-0.00279,-0.002066,0.001237,-0.005379,-0.002902,-0.00347,0.002766,0.003646,0.00067,-0.001788,-0.00379,-0.004676,-0.000433,-0.00286,-0.016311,-0.013423,-0.003785,-0.002188,-0.00311,-0.002781,-0.003677,-0.002994,-0.00022,0.001809,-0.003832,-0.00263,-0.002064,0.00435,-0.001701,-0.005101,-0.002513,0.002179,0.001449,0.001789,-0.000275,-0.003635,-0.002089,-0.003282,-0.002608,-0.005076,-0.000934,0.002027,-6e-06,0.001071,-0.001902,-0.000468,0.000446,-0.000434,-0.002597,-0.001951,-0.000872,7e-05,-0.000103,0.000411,0.000809,0.000865,0.000799,-0.000542,-0.000298,0.000855,-0.000144,-0.000629,-0.000499,-0.000256,0.000255,0.00017,0.00038,9.1e-05,5e-05,0.000154,-5.8e-05,-7.9e-05,5.6e-05,0.000113,-0.000193,-1.5e-05,-0.000173,-5.6e-05,6.5e-05,5e-05,0.000108,-2.5e-05,1.9e-05,-1.1e-05,1.1e-05,0.000125,9.8e-05,-1.3e-05,5.3e-05
2.8e-05,3.3e-05,-2.4e-05,-6.4e-05,8e-06,8.5e-05,0.000111,6.5e-05,4.1e-05,2.5e-05,-0.00012,-0.000161,-0.000109,-0.00011,0.000295,0.000255,0.000152,-0.000245,0.000177,0.000128,-0.002492,-0.00185,-0.000596,-0.000583,-0.001259,-0.002945,-0.000176,0.00073,0.000401,-0.000181,0.000304,-0.000212,7.3e-05,-0.002827,0.00049,0.001646,0.001544,0.001816,0.000853,-0.001217,-0.004231,-0.001596,0.002197,0.001577,-0.001551,-0.001042,-0.00307,0.002074,0.002361,0.003968,0.006781,0.001958,0.002747,0.002483,-0.00469,-0.000687,0.003388,0.00074,0.000864,-0.001871,0.003829,0.000588,0.000274,0.002137,0.004729,0.002403,0.00179,-0.001174,0.000217,0.002656,0.002165,0.00228,0.002281,0.000198,-0.000791,-0.000111,0.000669,-0.000363,0.000289,0.001062,-0.000736,-0.000806,-0.000493,-0.000146,-0.000411,-5e-05,0.000159,-0.002054,-0.000303,-0.000552,0.000541,0.000379,-7.7e-05,-0.000281,-0.000395,-0.000279,0.000172,-6.1e-05,1e-06,-0.000106,0.000141,-4.3e-05,9.9e-05,-5.2e-05,-0.00012,4e-05,-7.9e-05,-3.7e-05,-4e-05,-3.3e-05,2e-06,-1.4e-05,0.000288,-0.000164,-3.8e-05,0.000122,1.9e-05,-2e-06,-6.6e-05,-0.000115,-4.3e-05
-2.6e-05,-4e-05,5e-06,9.8e-05,6.9e-05,0.000118,0.000144,0.000118,5.8e-05,1.1e-05,7.4e-05,0.000128,0.000109,0.000143,-0.000175,-0.000121,-0.000156,0.000121,-0.000245,-0.000331,-0.000379,0.001606,0.000726,5.7e-05,0.000329,0.000223,-0.001322,0.000161,-0.00038,0.001429,0.000571,0.000155,-0.000882,0.000472,-0.000951,-0.002055,0.001048,0.00052,0.000439,-0.003355,0.001677,0.004643,-0.005027,-0.003824,0.002325,-0.002831,-0.007189,0.001232,-0.002475,-0.00253,-0.003252,-0.002664,0.000763,-0.000357,0.000534,-0.001591,4.6e-05,0.00185,0.00227,-0.001171,-0.000957,-0.001644,-0.000335,-0.003519,-0.005468,-0.003572,-0.001438,0.000224,0.002166,-0.001005,-0.001722,0.000318,0.000704,-0.001232,-0.00059,-0.001391,0.000351,2.8e-05,-0.00081,-0.000607,7.1e-05,0.000766,0.000345,0.000188,-0.000436,-7e-06,-0.000231,-0.000226,-0.000697,-0.00053,0.000205,1e-05,0.000229,-0.000732,-0.000665,-0.000319,-0.000122,6.4e-05,-5.1e-05,6.3e-05,6.4e-05,5.9e-05,1.1e-05,0.000147,7.9e-05,-6.9e-05,5.4e-05,0.000102,3.2e-05,-1.9e-05,-2.9e-05,0.000163,3.6e-05,-0.000135,-4.5e-05,4.1e-05,-5.2e-05,-4.5e-05,5e-06,-0.000131,8e-06
-0.000175,-9e-06,-4.2e-05,-2.4e-05,-1.1e-05,4.6e-05,-2.6e-05,1.4e-05,2.8e-05,6.1e-05,-8.5e-05,5e-06,-4.1e-05,-1.3e-05,8.5e-05,7e-06,0.00012,9.4e-05,0.000208,-0.000268,0.000709,0.001161,0.000936,-3.2e-05,0.000679,-0.000107,-7.1e-05,0.000781,0.001384,0.000232,-0.000606,0.000486,0.000787,-0.00036,0.000351,0.001407,-0.000893,-0.000521,0.000263,-0.000735,-0.001286,-0.001372,0.000649,0.006556,0.002083,-0.00051,-0.002508,0.001955,0.001865,-0.000475,0.003688,-0.001793,-0.000555,-0.000194,-2.7e-05,0.003376,-0.000653,0.00087,-0.002475,-0.001897,-0.001689,0.002226,-3.4e-05,0.001457,0.004129,0.004016,0.001509,0.000886,-0.002832,-0.00061,-0.000298,0.000141,-0.000869,0.000481,0.000931,-0.000583,0.000166,0.000669,-0.000473,0.000721,0.000762,0.000401,0.000207,-0.000239,-0.000153,-0.000277,7.1e-05,-0.000219,-0.001674,-0.000542,0.000136,-0.00019,-0.000717,-0.000482,-0.00045,-8e-05,0.000187,-7.7e-05,5e-05,-0.000172,5.1e-05,-6e-06,-3.7e-05,-4.1e-05,-1e-06,0.00011,-2.4e-05,1.4e-05,-1.9e-05,8.1e-05,-3.1e-05,6e-05,-2e-05,9.8e-05,2.7e-05,-0.000121,-4.9e-05,1.5e-05,3.4e-05,-0.000102,-8.1e-05
-0.000115,-0.000133,-1e-04,-5.3e-05,-8.5e-05,4e-05,-0.000127,-7.8e-05,6.2e-05,9.4e-05,-7.1e-05,6.8e-05,-2.6e-05,-0.000147,-0.00024,0.000154,6.8e-05,-1.6e-05,3.2e-05,0.000123,-0.000794,-0.00082,-0.000374,0.000464,-6.4e-05,0.000862,-0.001194,-0.001187,-0.001176,-0.001289,0.000735,0.000114,8.5e-05,0.001715,0.002003,-6.1e-05,0.003208,-0.000132,-0.000731,-0.000844,0.001997,-0.00027,-0.00067,-0.000237,-0.000492,0.004677,-0.000655,0.002059,0.00072,0.003295,-0.002669,-0.000204,-0.00212,-0.000738,0.002524,0.002047,-0.000498,-0.000488,-0.000701,0.000254,0.001059,0.001584,-3.9e-05,0.000269,-0.001623,-0.00056,-9.1e-05,-0.001093,0.000252,0.000643,-0.000124,-0.000105,0.000722,-0.000315,-0.000923,0.001029,-4.7e-05,0.000427,0.000827,0.000958,-0.000213,0.000479,0.000419,-0.000477,-0.000216,-0.000162,0.000432,3.1e-05,-0.001231,-0.000387,-0.000386,-0.000335,0.000338,-0.000274,-0.000303,-0.000232,-7.4e-05,-0.000256,-0.000154,-0.000182,-0.00013,-0.000187,1.5e-05,-5.4e-05,2.8e-05,-8e-05,-4.4e-05,-4.4e-05,-0.000112,-0.000106,6.6e-05,9.3e-05,-0.000123,-5.5e-05,-0.00014,-1.3e-05,-2.3e-05,-0.000106,-3e-06,-2.6e-05,-0.000139
-5.4e-05,-0.000156,-6e-05,-7.8e-05,-0.000296,5e-06,-3e-05,-9.1e-05,-5.4e-05,-1.2e-05,1.5e-05,-5e-05,-3.9e-05,-6.6e-05,-6.2e-05,-0.000201,-0.000185,-1.4e-05,-1e-04,9.3e-05,0.000848,0.000813,7.2e-05,-0.000448,0.000384,-0.00078,-0.000132,0.001308,0.000871,0.000622,-0.000854,-0.000248,6.9e-05,-0.001013,-0.000979,-0.000297,-0.00417,-0.001235,-5e-06,-0.000745,0.002906,0.000887,0.002783,-0.000626,0.001495,-0.001953,0.00476,-0.001147,-0.00484,-0.005041,-0.002773,-0.002806,-0.005028,-0.000348,0.000773,-0.000247,0.000316,0.000249,-0.001266,0.002123,-7.7e-05,-0.003285,-0.001542,2e-04,-0.000804,-0.00038,-0.001466,0.001233,-0.001076,-0.000363,-0.000659,0.000507,0.000505,-0.000813,-5e-04,-0.000132,0.000392,0.000117,-0.000659,-0.000743,0.000364,0.000101,-0.000183,4.4e-05,-0.000149,-0.000235,-0.000225,-0.000396,-0.001219,-0.000455,-3e-04,-7.8e-05,-0.000168,-4.2e-05,-0.000254,0.000181,-6.5e-05,-9.6e-05,-0.00011,-5.9e-05,4e-06,-7.2e-05,-3.5e-05,-8.1e-05,-6.5e-05,6.1e-05,3.6e-05,0,6.7e-05,-7e-06,-1.2e-05,8e-06,-7.9e-05,-0.000237,-0.000195,-0.000108,1.9e-05,-2.3e-05,-5.5e-05,-5.4e-05,-7.7e-05
3.2e-05,-3.2e-05,-1.1e-05,-6.4e-05,-0.000139,-2.4e-05,0.000129,1.3e-05,-4e-05,-4.3e-05,-1.7e-05,-3.5e-05,-3.4e-05,4.2e-05,-5.5e-05,0.000127,8e-05,7.5e-05,-0.000104,-8.4e-05,-0.000572,-0.001288,-0.000471,-0.000403,-2.3e-05,0.000511,-0.000207,-0.001753,-0.001734,-0.000464,0.000752,0.000933,-0.00028,0.000452,0.000432,0.000637,0.002699,0.000436,0.000406,0.000205,0.000971,-0.001733,-0.001389,-0.002847,-4.5e-05,0.001063,-0.000332,-0.004866,-0.003396,-0.000711,-0.000612,-0.001231,0.001981,-0.000489,-0.00075,0.000346,0.003076,-0.001372,6e-05,0.000798,-0.000895,0.001211,0.001559,0.001834,0.000648,-0.000122,0.001086,-0.001657,0.002276,0.000751,3.6e-05,-1.7e-05,0.00088,0.000387,0.001003,-4.4e-05,-0.000418,-0.000791,-0.000215,-0.000138,-0.000235,8.3e-05,-0.000795,-9.2e-05,-1.4e-05,-6.7e-05,-3.6e-05,-7.7e-05,0.000409,9.5e-05,4.2e-05,0.000375,0.000119,0.000268,0.000207,0.000109,-8.2e-05,5.4e-05,-5.1e-05,-0.000139,-6e-05,-0.000132,-5.6e-05,4.1e-05,-9.3e-05,1.4e-05,1.4e-05,5.1e-05,2.1e-05,-1.5e-05,-2.1e-05,-2e-05,-8e-06,-1.5e-05,-1e-05,-2.8e-05,-2.1e-05,1.6e-05,-4e-05,-1e-05,-8e-06
2.4e-05,3.9e-05,-5.8e-05,-2e-06,-3e-05,6.8e-05,4.8e-05,5e-06,2e-06,7e-06,9e-06,4.2e-05,2.1e-05,-3e-05,3.6e-05,-1.9e-05,-1.9e-05,-2.6e-05,-0.000141,0.000252,0.000998,0.000164,0.000189,0.00017,-0.000131,0.000464,0.000389,0.000853,0.000382,-0.000113,-0.000264,-0.000361,3e-05,-0.000143,-0.001249,-3.2e-05,-0.002334,-0.000536,-5.5e-05,-0.000369,-0.000975,0.001457,-0.000748,0.000794,-0.000101,-0.002067,-0.002129,0.002614,-0.002395,-0.002156,-0.001753,0.000757,0.001301,-0.000249,-0.000385,-0.000811,-0.000873,0.002297,0.001932,-0.001631,0.000451,0.000742,-0.000741,-0.000373,0.001106,0.000141,-0.000245,0.000135,-0.000451,0.000249,0.000926,0.000225,-0.000936,-0.000135,-0.000343,-9.3e-05,-0.000346,-0.000341,-3.2e-05,-0.000417,0.000141,-0.000235,9.3e-05,0.000123,9.6e-05,0.000122,0.000101,-2.1e-05,0.000574,0.000137,0.000314,0.000166,-0.000789,-0.000395,0.000899,0.00017,-5.8e-05,-7.4e-05,-7.8e-05,-6.6e-05,-0.000102,-1.9e-05,5.5e-05,-3.6e-05,1.7e-05,-5e-05,-3.9e-05,5.1e-05,8e-06,3.6e-05,3.4e-05,-7e-06,-4.5e-05,-7.1e-05,-9e-06,-3e-05,2.2e-05,-3.1e-05,-8e-06,-1.9e-05,5.4e-05
-3.3e-05,2.1e-05,6.9e-05,-1.4e-05,3.9e-05,1.2e-05,-5e-06,-2.8e-05,2.2e-05,1.4e-05,7e-06,0,8.7e-05,-2e-06,5.1e-05,3e-06,7.6e-05,2.3e-05,7.9e-05,-1e-06,-0.000135,-0.000189,0.000425,0.000159,-0.000284,-0.001117,-0.00015,-0.000925,0.000192,-0.000162,0.000567,0.000342,-0.000163,-7.8e-05,-0.000773,-0.000671,-0.000651,-0.000421,0.000197,-0.000108,-0.00044,-0.002083,-0.001573,0.001023,0.000602,0.000236,0.001645,-0.00399,0.002038,0.000688,-0.002176,-8.4e-05,0.000235,0.000313,0.000331,-0.000236,-0.00099,-0.001455,-5.1e-05,-0.000209,-0.000301,-0.000222,0.000387,0.000776,-1.3e-05,-0.000511,-6.2e-05,0.000561,8e-04,-0.000929,-0.00027,1.3e-05,-0.001116,-0.000247,-0.000528,-0.000406,0.000178,0.000187,-4.5e-05,9e-06,0.000143,2.6e-05,-0.000184,0,9.7e-05,0.000255,1.4e-05,-5.5e-05,0.000152,0.000413,0.000172,-3.9e-05,0.000154,0.00011,-4.6e-05,-0.000116,-4.1e-05,8e-06,-2.5e-05,5.7e-05,-4e-05,-3.1e-05,-6.2e-05,-3.9e-05,-1.6e-05,3.4e-05,1.3e-05,-1.6e-05,-2.8e-05,1e-06,4.1e-05,-6e-06,1.9e-05,3e-06,1.9e-05,-3.3e-05,6e-06,-4e-05,-5.7e-05,-4.2e-05,2.7e-05
-3.3e-05,-8e-06,-1.1e-05,-2.6e-05,-2e-06,-2.7e-05,2.4e-05,-2.5e-05,-1.6e-05,3e-06,-2e-06,-3.3e-05,2.3e-05,-2.3e-05,-4.9e-05,-2.8e-05,-4.1e-05,6.4e-05,6.9e-05,-5.5e-05,-0.000239,0.000115,-0.000209,-0.000247,0.000518,0.000938,0.000154,-0.000176,0.000219,0.000218,-0.000693,-0.000396,3e-06,2e-06,0.000226,-0.000166,0.000377,0.000442,-0.002042,-0.000305,0.000322,0.001009,-2.1e-05,-0.000653,0.000454,-0.000646,-0.001093,0.001529,-0.000842,0.000523,0.001397,-0.000176,-0.001019,0.000377,0.001035,-0.000469,-0.000438,0.001274,-0.000352,0.000831,0.000659,0.000392,0.001136,-0.00037,-0.000632,0.00065,0.000676,-5e-04,-0.000404,0.001075,-0.000157,-0.00023,0.000192,0.000255,0.000405,0.000257,0.000184,0.000412,-0.000125,-0.000222,-0.000142,4.4e-05,0.000429,0.000104,6.4e-05,4.2e-05,-0.000115,5.1e-05,-0.000167,-0.00016,-7.2e-05,2.3e-05,0.000285,-4e-06,3.3e-05,0.000138,2.7e-05,-7.3e-05,-1.3e-05,8e-06,-6.1e-05,-9e-06,4.3e-05,4.6e-05,1.5e-05,-6e-05,-7e-06,-3e-06,-1.9e-05,-2.4e-05,-1.3e-05,-7e-06,-1.5e-05,-3e-06,2.8e-05,-4.9e-05,2.4e-05,2.2e-05,-1.1e-05,-7e-06,6e-05
-2e-06,2.6e-05,-1.1e-05,1.6e-05,-5e-06,-6.9e-05,-4.4e-05,-1.3e-05,-2e-06,6e-06,-2.8e-05,3e-06,-3.3e-05,8e-06,-4e-06,-7.4e-05,2.9e-05,-5.6e-05,-4.7e-05,5.3e-05,6.3e-05,-0.000182,-1.3e-05,0.000527,-0.000408,-0.000691,-2e-04,0.000234,-0.000357,-3.8e-05,0.000254,-0.000128,-9.7e-05,0.000111,0.000278,9.2e-05,0.000581,-6.3e-05,0.00038,-0.000145,-8.8e-05,0.001154,0.000522,-0.000545,-0.001602,0.000559,0.000754,0.000208,0.000744,0.000177,-0.00118,0.000324,3e-05,0.000658,-0.001077,-0.000275,-0.000829,-0.00077,0.000695,0.00055,-0.000392,-8.5e-05,0.000463,0.000594,-5.2e-05,-0.000346,-0.000321,-0.00034,0.000332,-0.001646,-0.000141,-0.000556,0.000562,-2e-05,8.7e-05,0.000148,-0.00022,-0.000485,4.3e-05,5.7e-05,0.000385,-0.000212,0.000152,-0.000111,-8.5e-05,-7.5e-05,-0.00015,-5.5e-05,-0.000222,-0.000219,-0.000287,-4.8e-05,5e-06,-3.5e-05,-2e-05,-5.8e-05,5.6e-05,-1.5e-05,-4e-06,-3.9e-05,-3.7e-05,-1.6e-05,-3.2e-05,-2.2e-05,-3.1e-05,-2e-06,-1.9e-05,-5e-06,-2e-05,1e-05,-1.3e-05,-1.5e-05,-1.8e-05,-2.3e-05,-2.5e-05,1.5e-05,1e-06,3.2e-05,-3.6e-05,1.5e-05,2.2e-05
3e-05,3.3e-05,3e-06,-3e-06,2e-06,-2.7e-05,-3.7e-05,5e-06,-1.6e-05,-1e-05,-3e-06,1.1e-05,-2.7e-05,-5e-06,1.7e-05,-1e-05,-1e-05,3.2e-05,-1.7e-05,6.5e-05,-1e-05,0.000113,-7e-06,-0.000747,4.5e-05,0.000322,-0.000119,-0.000171,0.000115,-0.000258,-0.000139,0.000432,-1.2e-05,-0.000156,0.000448,0.000365,-0.000846,-0.000196,-1.7e-05,3e-06,-8e-04,-0.00101,0.000333,0.000421,0.000388,-0.000162,0.00012,0.001554,-0.000601,-0.001065,-2.2e-05,0.000413,-0.000104,0.000268,0.000227,0.000184,-0.000621,-0.00016,-9.4e-05,0.00035,-0.000991,-0.000146,-0.000125,-0.000568,-0.000273,2.1e-05,9.4e-05,0.000113,-9.5e-05,0.000466,0.000104,3.9e-05,4e-05,0.000468,-0.000117,-1e-05,0.000133,-0.00017,0.000169,-5.1e-05,7.9e-05,0.000147,3.5e-05,-0.000237,-1.8e-05,-8.8e-05,-9e-05,3.3e-05,-0.000125,-0.000101,-0.000345,0.000118,-0.000156,7.3e-05,-0.000212,5.1e-05,0.000134,-2.4e-05,-2.9e-05,1.5e-05,1.3e-05,-2.6e-05,-3.3e-05,1e-06,3.4e-05,-2.1e-05,1.1e-05,-3.7e-05,1.8e-05,5e-06,-4.5e-05,-2e-06,-1.1e-05,1.4e-05,-6e-05,2.7e-05,2.4e-05,-1.2e-05,1.6e-05,-2e-05,-7e-06
2e-06,1e-06,8e-06,-4e-06,-5e-06,-2.7e-05,-3e-06,1.4e-05,1.5e-05,3e-06,1.5e-05,-7e-06,1e-05,-1e-06,-8e-06,-1.6e-05,-9e-06,-1.4e-05,1.7e-05,5.4e-05,-5.2e-05,0.000286,-6e-05,0.000461,-1e-05,-3.8e-05,8.4e-05,0,-0.000268,-1.5e-05,0.000138,-0.000301,2.5e-05,-1e-06,-0.000148,-4.4e-05,0.000839,0.000183,-9.7e-05,8.4e-05,-0.000536,-0.000799,0.000259,0.000152,0.000227,-9.4e-05,-0.000479,-0.001003,0.001605,-0.000359,-0.000163,-0.000735,-0.000247,-0.000236,-0.00021,-0.000331,0.000422,0.000985,3.1e-05,-0.000611,0.000232,0.000158,-0.000417,-0.000196,0.000158,-0.000266,-0.000198,-0.000234,0.000267,0.000279,-8.2e-05,8.9e-05,-0.000214,-0.00034,0.000199,-0.00015,0.000165,0.000151,6.3e-05,3.6e-05,-0.000134,-7.5e-05,-3.9e-05,0.000162,6.4e-05,-3e-05,2.9e-05,-9e-06,2.8e-05,0.000159,-0.000307,4.2e-05,5.4e-05,-2.8e-05,0.000126,-8.8e-05,4.2e-05,3.1e-05,7e-06,-1.7e-05,6e-06,-3.1e-05,2.8e-05,1e-05,-1.3e-05,1.4e-05,-1.1e-05,-5e-06,6e-06,-4e-06,1.4e-05,1.3e-05,-9e-06,-1.1e-05,1.9e-05,3.3e-05,3e-06,-1.3e-05,1.7e-05,-7e-06,-7e-06
6e-06,-1.7e-05,-7e-06,9e-06,-3.9e-05,-6e-06,5e-06,3e-06,-2e-06,2e-06,5e-06,-2e-06,-5e-06,1.9e-05,-1.9e-05,-9e-06,5e-06,1.4e-05,3.6e-05,0,-3.9e-05,-3.8e-05,-0.000115,-0.00014,0,-2.1e-05,-2.9e-05,0.000293,0.000172,6.4e-05,-0.000238,0.000332,-2e-06,1e-04,3e-06,-9.8e-05,-0.000298,-9.9e-05,0.00034,-0.000157,-0.000246,0.000435,-0.000203,0.000309,-0.000436,-0.000275,0.000556,0.001074,-0.001523,0.000118,-2e-06,-0.000215,-0.000562,-5.8e-05,0.000139,0.00012,0.000559,-0.000192,-0.000352,-0.000535,-1.6e-05,-0.000333,0.00043,0.000153,-3.2e-05,0.000318,0.000401,5.7e-05,0.000254,-0.000164,-7.9e-05,-4.4e-05,3e-06,-2.8e-05,7.6e-05,1.8e-05,-0.000175,-5.6e-05,2.1e-05,3.4e-05,-0.000101,7.2e-05,0.000113,0.000179,0,-6e-06,2.2e-05,9e-06,0.00012,2.3e-05,-0.000144,-3.6e-05,-0.000151,-3.3e-05,0.000139,1.9e-05,-1.8e-05,0,-1.8e-05,-1e-05,1.4e-05,1.1e-05,-1.5e-05,0,1.2e-05,3e-05,5e-06,-4e-06,-5e-06,-6e-06,-7e-06,1.3e-05,4e-06,-7e-06,6e-06,1.3e-05,4e-06,5e-06,1e-06,3e-06,6e-06
-8e-06,-6e-06,-1e-05,1e-06,-1.6e-05,-2e-06,2e-06,-1.6e-05,-4e-06,3e-06,8e-06,2e-06,-8e-06,-6e-06,2e-06,-1.8e-05,-1e-05,-2.1e-05,-2.9e-05,-1.9e-05,5.1e-05,3.4e-05,-0.000101,-0.000146,-0.000126,6.5e-05,-6.8e-05,-5.1e-05,-1e-04,-5.8e-05,0.000167,-0.000147,7.1e-05,-6.9e-05,4.1e-05,8.9e-05,-2.9e-05,0.000187,-0.000254,0.00022,-0.000325,9.5e-05,-0.000222,9.9e-05,0.000221,0.000178,0.000307,-0.00076,-0.000292,0.000669,0.000196,0.000115,0.000626,-0.000104,-0.000351,0.000264,-0.000106,-0.000477,-2e-06,0.000119,5.5e-05,0.000146,0.000137,-4.5e-05,-9e-06,6.3e-05,-9.3e-05,0.000298,-0.000185,1e-05,-9.1e-05,-0.000139,0.000103,-0.000162,-5.1e-05,-1.1e-05,1.4e-05,1.6e-05,-0.000148,-1.9e-05,6.7e-05,-1e-05,-0.000135,-3.6e-05,-9e-06,3.6e-05,1e-05,8e-06,0.000115,-8.3e-05,-2.6e-05,-4.3e-05,2.4e-05,2e-05,1.3e-05,-6.4e-05,-3.6e-05,2e-06,1e-06,4e-06,4e-06,-2.5e-05,-1.2e-05,-4e-06,-1e-05,-1.6e-05,1e-06,-4e-06,6e-06,0,1.7e-05,1e-06,-1e-06,-2e-06,-7e-06,-1.7e-05,4e-06,-6e-06,-8e-06,-1e-05,5e-06
-1e-05,1e-05,1.4e-05,-7e-06,4e-06,7e-06,-2e-06,-3e-06,-2e-06,-2e-06,6e-06,2e-06,7e-06,-1.5e-05,2e-06,2.4e-05,-4e-06,1.9e-05,-1.4e-05,-2e-06,9.6e-05,2.1e-05,3.1e-05,6.5e-05,0.000115,-5.9e-05,1.5e-05,-2.3e-05,-1e-05,-5.8e-05,-0.000139,-8.3e-05,-7.7e-05,2.4e-05,-3.8e-05,-8e-06,-8.7e-05,-0.000154,-6.3e-05,-0.000166,6e-05,-0.000345,-8.1e-05,-0.000258,0.000219,-0.000202,-0.000187,0.000425,-0.000501,0.000155,5.4e-05,-7.7e-05,0.000234,8.3e-05,6.6e-05,0.000282,-6.2e-05,-0.000162,-0.000475,0.000367,6.9e-05,-4.4e-05,-0.000179,6e-05,0.000163,3e-06,-6e-05,-0.000195,-0.000245,-0.000148,0.000137,0.000105,8.8e-05,8.4e-05,-8e-05,5e-05,-4.9e-05,-0.000108,3.2e-05,1.4e-05,-9.9e-05,5.5e-05,-4.9e-05,-5.6e-05,-6e-06,-3e-06,3e-05,-4e-06,1e-06,3.9e-05,7.4e-05,-0.000122,3.1e-05,-3.2e-05,1.3e-05,8.6e-05,-1.1e-05,9e-06,-3e-06,-7e-06,-5e-06,4e-06,1.5e-05,-2e-06,2e-06,3e-06,-3e-06,1e-06,-7e-06,5e-06,-9e-06,-1e-06,2e-06,-6e-06,-2e-06,-1.3e-05,-1e-06,-2e-06,-4e-06,5e-06,1.6e-05
1e-06,7e-06,-6e-06,3e-06,1.2e-05,5e-06,2e-06,-1.6e-05,4e-06,-2e-06,0,2e-06,6e-06,2e-06,7e-06,-1.1e-05,-1.1e-05,-7e-06,9e-06,0,-0.000126,2.4e-05,5e-06,7.7e-05,-2.8e-05,7e-05,2.4e-05,2.1e-05,0.000121,3.9e-05,0.000102,0.000114,5.2e-05,-2.1e-05,2.2e-05,-2.1e-05,-0.000201,-5.2e-05,1e-06,6.8e-05,0.000276,0.000158,5.9e-05,-8.8e-05,3.2e-05,0.000161,-0.000266,-0.000866,4.4e-05,-0.000276,-3e-05,5.1e-05,-0.000347,0.000306,-7.1e-05,0.000118,0.000174,0.000166,0.000323,0.000117,-0.000134,-0.000277,0.000368,-9e-05,-4.2e-05,6.1e-05,-5.6e-05,-0.000125,4.1e-05,0.000192,-5.6e-05,7e-06,0.000137,5.7e-05,3.2e-05,2.4e-05,-0.000119,4.2e-05,3.9e-05,-1.3e-05,1.3e-05,-4.1e-05,-6.3e-05,-1.5e-05,1.2e-05,2.9e-05,-4e-06,8e-06,-0.000109,2e-06,3.8e-05,6e-06,6e-06,0,-5.7e-05,-3e-05,-1.1e-05,-2.1e-05,-6e-06,1e-06,-1.2e-05,1e-06,-1.3e-05,-2e-06,-2e-06,-1.1e-05,-7e-06,-2e-06,-3e-06,-3e-06,-3e-06,2e-06,1e-06,2e-06,6e-06,-1.1e-05,2e-06,7e-06,7e-06,-8e-06,6e-06
3e-06,3e-06,-1e-06,-2e-06,5e-06,5e-06,-1e-05,-7e-06,0,-1e-06,4e-06,-3e-06,-2e-06,2e-06,-2e-06,1.4e-05,7e-06,-5e-06,8e-06,1e-06,5.3e-05,-0.000124,8e-05,-1.2e-05,1.5e-05,-2.9e-05,-1.8e-05,-4.1e-05,5e-06,0,-0.000124,-3.4e-05,-2.8e-05,-5e-06,-8.8e-05,-1.4e-05,-9.6e-05,8.5e-05,-5.2e-05,-3.4e-05,-7.2e-05,-5.7e-05,0.000357,4.7e-05,-5.5e-05,-5.2e-05,0.00034,0.000383,4.2e-05,-0.000133,-0.000433,2e-04,-0.000177,-2.3e-05,-8.2e-05,5.9e-05,-0.000235,8.3e-05,0.000215,1.6e-05,0.000162,0.00011,0.000149,-0.000284,4.8e-05,-0.000148,0.000203,9.3e-05,-3.7e-05,-2e-05,-4.2e-05,2.8e-05,-1.6e-05,3.6e-05,1e-06,1.8e-05,6.3e-05,1.6e-05,1.8e-05,-2e-06,5.7e-05,3.7e-05,4e-06,-1.9e-05,1e-05,-7e-06,0,-6e-06,-6e-05,-2.9e-05,3.4e-05,-1.2e-05,-2.2e-05,-3e-06,-6e-05,-4.3e-05,-6e-06,-6e-06,-1e-06,0,-1e-05,-1e-06,8e-06,3e-06,6e-06,1e-05,4e-06,3e-06,4e-06,-4e-06,2e-06,-3e-06,-5e-06,-8e-06,4e-06,-6e-06,0,2e-06,-5e-06,-2e-06,3e-06
8e-06,7e-06,7e-06,-2e-06,-2e-06,5e-06,-1e-05,1e-06,-3e-06,0,3e-06,0,-3e-06,-1e-06,-8e-06,-1e-05,-7e-06,0,-6e-06,4e-06,-5.5e-05,-2.8e-05,4.3e-05,-9e-06,-3.3e-05,3.8e-05,-9e-05,-7.6e-05,8.4e-05,-5.6e-05,6.5e-05,-2.4e-05,3.2e-05,2e-06,-2.4e-05,2.2e-05,0.000345,1.5e-05,0.000178,-2.2e-05,-9.1e-05,0.000245,-4.7e-05,5.2e-05,3.3e-05,-1e-05,-3.6e-05,-0.000319,0.000259,8e-05,-0.000273,-0.000175,-3.8e-05,-0.000145,-3.9e-05,1e-06,-3e-06,-6e-05,1.1e-05,-0.000314,2e-05,0.000198,-0.000149,-0.000184,-6e-05,9.8e-05,-0.000159,2.7e-05,-3.8e-05,-5.6e-05,1.3e-05,3.1e-05,-0.000164,-4.4e-05,-5.2e-05,-0.000107,5.4e-05,8.6e-05,-5.9e-05,5e-06,-8.1e-05,3e-06,6.5e-05,9e-06,-1.6e-05,-1.4e-05,1e-05,4e-06,3e-06,-1.6e-05,-2.4e-05,2.8e-05,9e-06,-1.1e-05,3e-06,-1e-06,6e-06,8e-06,0,-7e-06,-8e-06,-1.8e-05,-4e-06,-4e-06,-8e-06,2e-06,-1e-06,0,2e-06,4e-06,8e-06,-4e-06,-1e-06,2e-06,-1.8e-05,8e-06,0,-5e-06,-5e-06,-1e-06,-6e-06
-1e-06,5e-06,-7e-06,3e-06,2e-06,2e-06,1e-05,6e-06,-1e-06,0,4e-06,3e-06,-5e-06,-4e-06,2e-06,1.5e-05,4e-06,6e-06,-5e-06,-2e-06,1.8e-05,0,1e-05,-1.3e-05,7e-05,-2.4e-05,3.7e-05,-7.4e-05,-7.2e-05,-8e-06,-3.2e-05,2.8e-05,-4.2e-05,8e-06,-6e-06,-4e-06,-0.000144,-8.9e-05,-7.7e-05,4.9e-05,0.000348,-1.9e-05,-5.3e-05,0.000174,-0.000145,7.4e-05,-0.000197,0.000372,-0.000111,-2.7e-05,-8e-05,0.000101,4.9e-05,-0.000136,-0.000103,-5.3e-05,0.000185,-0.000122,-4e-06,-5.7e-05,-0.000181,-0.000129,-1.9e-05,-5.9e-05,5e-05,-1.6e-05,6.2e-05,-1.3e-05,0.000188,0.00013,-2.8e-05,5.9e-05,-8.7e-05,-9e-06,7.2e-05,3.4e-05,2e-06,-5e-05,-3e-06,-3e-05,1.4e-05,-7e-06,4.5e-05,4.6e-05,-7e-06,-2.5e-05,-5e-06,-1e-06,5.1e-05,-6e-06,-2e-05,1.5e-05,-4.8e-05,1.7e-05,-1e-06,-7e-06,1.3e-05,5e-06,0,-1e-06,-2e-06,1e-06,-7e-06,3e-06,5e-06,-3e-06,-5e-06,1e-06,-2e-06,1e-06,-8e-06,-4e-06,-3e-06,-1e-06,-9e-06,6e-06,0,0,0,-6e-06,-2e-06
-1e-06,-6e-06,1e-06,-2e-06,-6e-06,5e-06,7e-06,1e-06,1e-06,-2e-06,0,-1e-06,-3e-06,7e-06,2e-06,-1e-05,1e-06,-8e-06,5e-06,-3e-06,-2.1e-05,-3.4e-05,7e-06,-3e-06,1.5e-05,4.5e-05,1.1e-05,3.5e-05,-2.6e-05,-1.2e-05,9e-05,-1.5e-05,1.4e-05,-3.6e-05,7.2e-05,-5.7e-05,2.7e-05,3.6e-05,5.1e-05,-5.8e-05,0.000218,-0.000135,-0.000171,-0.000215,0,3.6e-05,0.000324,-6e-05,0.000208,-0.000103,0.000197,-2.9e-05,-3.3e-05,0,0.000166,-4.4e-05,1.6e-05,5.9e-05,7.6e-05,8.4e-05,0.000177,-6e-06,1e-06,0.000128,9.1e-05,9.3e-05,-3.5e-05,1.1e-05,3.3e-05,1e-06,-1.2e-05,-3.3e-05,5e-06,-5.1e-05,5.7e-05,3.7e-05,-2.2e-05,-7.6e-05,-1e-06,3e-06,8e-06,2.4e-05,-3e-06,-4e-06,1.3e-05,1e-06,4e-06,1e-06,5.5e-05,4.3e-05,-2e-06,-3.9e-05,3.5e-05,7e-06,5e-05,2.5e-05,9e-06,-6e-06,-2e-06,3e-06,3e-06,-1.1e-05,7e-06,0,1e-06,3e-06,1e-06,5e-06,0,-2e-06,-1e-06,2e-06,0,-4e-06,7e-06,3e-06,1e-06,2e-06,5e-06,2e-06,-4e-06
-5e-06,-8e-06,0,0,-1.3e-05,-1e-06,3e-06,-1e-06,1e-06,1e-06,5e-06,-2e-06,4e-06,-2e-06,-4e-06,6e-06,-3e-06,-1e-06,5e-06,-2e-06,-1.7e-05,2.2e-05,6e-06,7e-06,-4e-05,-3.1e-05,-2e-06,-7.5e-05,-4.3e-05,-1.3e-05,-0.000119,9e-06,-1.3e-05,2.9e-05,-7e-06,4.6e-05,0.000119,7.9e-05,-9.6e-05,3.9e-05,-4.2e-05,-8e-06,-0.00013,-2.4e-05,0.000151,-4.8e-05,-7.7e-05,6.9e-05,-5.9e-05,-4.4e-05,-0.000302,-7.4e-05,-9.4e-05,2.5e-05,1.2e-05,-5.6e-05,-2.8e-05,-4e-06,-7.7e-05,0.000174,4e-05,0.000116,6.6e-05,0.000147,3.3e-05,-8e-06,2.5e-05,-0.000106,1.2e-05,-0.000144,-1.9e-05,3.9e-05,7.4e-05,2.2e-05,-8.1e-05,-8e-06,4.6e-05,5.4e-05,3.3e-05,4e-06,-3.2e-05,-2.4e-05,-2.6e-05,5e-06,1e-05,2e-06,-3e-06,-1e-06,1.4e-05,2e-06,2.1e-05,-2e-06,1e-06,-5e-06,2.1e-05,-1.8e-05,1e-05,3e-06,-2e-06,-2e-06,1e-06,-7e-06,-4e-06,-1e-06,0,-8e-06,1e-06,1e-06,0,-1e-06,4e-06,-3e-06,2e-06,0,2e-06,4e-06,-1e-06,-1e-06,-3e-06,-2e-06,3e-06
1e-06,1e-06,3e-06,1e-06,-6e-06,0,5e-06,3e-06,-1e-06,1e-06,1e-06,1e-06,2e-06,-4e-06,-2e-06,-1.6e-05,5e-06,7e-06,-4e-06,-1e-06,7.2e-05,3e-05,5e-06,1e-06,1.9e-05,1.6e-05,-3.5e-05,9.3e-05,7e-06,-1e-05,8.7e-05,-3.4e-05,1.3e-05,-1.8e-05,3e-06,2.5e-05,-8.7e-05,-9.6e-05,-0.000106,-2.5e-05,5.9e-05,1.9e-05,2.1e-05,0.000145,-4.1e-05,1.5e-05,-0.000161,8.7e-05,-0.000184,4.4e-05,0.000222,-0.000139,0.000105,-1.1e-05,4.7e-05,-6e-05,-6.1e-05,0.00013,-1e-04,2.5e-05,-3.1e-05,5e-06,-5.5e-05,0.000101,-2.6e-05,-7.7e-05,8e-06,-2.5e-05,-0.000125,8.4e-05,9e-06,2.4e-05,1.4e-05,4.3e-05,-3.1e-05,2.9e-05,-1.9e-05,9e-06,2.6e-05,-4e-06,2.3e-05,1.1e-05,2.5e-05,-2.1e-05,-6e-06,2.3e-05,-7e-06,-1e-06,-3e-05,-2.9e-05,2.8e-05,-2.2e-05,3e-06,-8e-06,-6.2e-05,1.9e-05,-4e-06,-9e-06,2e-06,-2e-06,4e-06,-1e-06,0,1e-06,-3e-06,3e-06,-3e-06,1e-06,-1e-06,2e-06,0,2e-06,0,-5e-06,-1e-06,-3e-06,1e-06,-2e-06,-3e-06,-3e-06,2e-06
2e-06,5e-06,-5e-06,-1e-06,4e-06,-5e-06,-4e-06,-6e-06,-1e-06,1e-06,1e-06,0,-1e-06,1e-06,2e-06,4e-06,-3e-06,-8e-06,-1e-06,0,-6.1e-05,3.2e-05,-3.2e-05,-3.1e-05,2.6e-05,-5e-06,-1e-05,-2.5e-05,2.4e-05,0,-2.8e-05,3e-05,-9e-06,6e-06,-1.2e-05,-1.9e-05,2.8e-05,2.9e-05,0.000131,1e-06,4e-06,-6.9e-05,7.7e-05,3.5e-05,-9.7e-05,-2e-06,5e-05,-6.3e-05,-0.000362,0.000116,-8.5e-05,9.5e-05,3e-05,-9.1e-05,-0.000144,-3.7e-05,-1.1e-05,-6.6e-05,-4.8e-05,-0.000166,3.9e-05,5e-05,-1.4e-05,1.5e-05,9e-06,1e-06,-4.6e-05,0.000119,1.8e-05,-6.4e-05,1e-06,-6.2e-05,-7.6e-05,-1.3e-05,7.2e-05,-1.8e-05,-6e-06,2e-06,-3.1e-05,8e-06,2.1e-05,-2.7e-05,-1e-05,-1.3e-05,-4e-06,6e-06,1e-06,-1e-06,-4.3e-05,-8e-06,6e-06,1.8e-05,6e-06,-6e-06,-1.4e-05,-2.2e-05,-6e-06,2e-06,-1e-06,2e-06,0,2e-06,4e-06,-1e-06,0,-5e-06,-1e-06,0,1e-06,1e-06,2e-06,1e-06,1e-06,3e-06,-1e-06,1e-06,-1e-06,1e-06,1e-06,0,4e-06
2e-06,2e-06,3e-06,-1e-06,8e-06,-1e-06,-6e-06,-3e-06,0,0,3e-06,-1e-06,1e-06,2e-06,1e-06,-1.1e-05,-1e-06,3e-06,3e-06,0,6.1e-05,7e-06,-1.6e-05,2.8e-05,-3.4e-05,2e-06,-7e-06,3.4e-05,1.4e-05,-1.3e-05,2e-05,2e-06,-3e-06,1e-06,-3e-06,-1.3e-05,-1e-05,-2.1e-05,-4.1e-05,1.7e-05,-0.000113,1e-05,7.7e-05,4.5e-05,-6e-06,-1e-06,9e-06,2.1e-05,4.9e-05,-3e-06,0.000135,-6.2e-05,-0.000168,-4.5e-05,5.7e-05,-3e-05,-4.1e-05,-0.000167,2.1e-05,-9.6e-05,-3.6e-05,-0.000174,5.2e-05,-1.3e-05,-1.5e-05,3.3e-05,1.2e-05,-1.3e-05,-7e-05,6.7e-05,-1e-05,-3.1e-05,-3.5e-05,3.5e-05,0,-3.5e-05,-8e-06,-5e-05,1.9e-05,-8e-06,-4.3e-05,2.7e-05,-1e-05,-4e-06,-2e-06,1e-06,-2e-06,-2e-06,-1.5e-05,1.8e-05,-2.2e-05,1.7e-05,-1.3e-05,2e-06,-1.5e-05,-6e-06,-6e-06,1e-06,-1e-06,-1e-06,0,-6e-06,-5e-06,-1e-06,0,4e-06,1e-06,0,1e-06,-2e-06,-7e-06,1e-06,-1e-06,-3e-06,0,-1e-06,0,1e-06,4e-06,-1e-06,-1e-06
1e-06,0,2e-06,1e-06,3e-06,-5e-06,-2e-06,-1e-06,1e-06,0,1e-06,0,1e-06,-1e-06,-2e-06,2e-06,4e-06,1e-06,-3e-06,-1e-06,-6.7e-05,2.8e-05,-5e-06,1e-06,-1.1e-05,1.5e-05,1.4e-05,5.1e-05,2e-06,-6e-06,-4.5e-05,-1.9e-05,2e-05,-2e-06,9e-06,9e-06,-0.000104,3.9e-05,3.3e-05,-2.5e-05,-1.2e-05,4.3e-05,-9.6e-05,-0.000287,-7e-06,2.3e-05,6.6e-05,-7.1e-05,-0.000195,-1.6e-05,-0.000191,2.9e-05,-2.3e-05,1.4e-05,5.7e-05,-1.1e-05,-4.2e-05,9e-05,-3.7e-05,5e-05,-5e-05,4.5e-05,-3.3e-05,-7.6e-05,-1.5e-05,5e-05,2.6e-05,-7.3e-05,3.8e-05,-1.6e-05,-2.2e-05,2e-06,6.5e-05,-3.6e-05,-4.5e-05,9e-06,-2.5e-05,1.6e-05,-9e-06,-2e-06,1.6e-05,-2.6e-05,-3.6e-05,2.4e-05,1.3e-05,-1.2e-05,4e-06,1e-06,1.6e-05,0,-4.8e-05,-1e-06,-1.8e-05,-5e-06,-2e-06,1.5e-05,-1.1e-05,3e-06,-1e-06,-1e-06,-2e-06,0,1e-06,1e-06,1e-06,4e-06,-1e-06,-2e-06,-1e-06,0,3e-06,0,-1e-06,-2e-06,-2e-06,-3e-06,0,-1e-06,-1e-06,-1e-06,-2e-06
-3e-06,2e-06,-5e-06,-1e-06,-1e-06,-1e-06,3e-06,1e-06,0,0,2e-06,0,-2e-06,-2e-06,-2e-06,-8e-06,-3e-06,1e-06,-1e-06,-1e-06,4.7e-05,-1.1e-05,-2e-06,-4e-06,2.2e-05,-1.9e-05,-5e-06,-3.6e-05,-1.3e-05,-1e-06,5.8e-05,1.8e-05,-1.5e-05,-8e-06,-1.3e-05,1.8e-05,7.6e-05,-2.7e-05,2.6e-05,2.5e-05,-1e-06,-3e-05,-1.6e-05,0.000106,-3.8e-05,-1e-06,-3.2e-05,7.4e-05,0.000216,-6.8e-05,-5.2e-05,1.5e-05,-2.8e-05,3.7e-05,9.2e-05,1.5e-05,9.3e-05,0.000135,7e-05,8.7e-05,1.8e-05,5.5e-05,-3e-06,-7.4e-05,1.5e-05,-0.000106,-2.4e-05,-3e-06,1.4e-05,-5.5e-05,-3e-06,-2e-05,4.7e-05,2.8e-05,2.3e-05,3.7e-05,-7e-06,1.9e-05,9e-06,2e-06,8e-06,2e-05,1.3e-05,9e-06,-3e-06,-5e-06,2e-06,-2e-06,3e-05,-1.4e-05,-5e-05,3e-06,2.7e-05,1e-06,2.9e-05,1e-06,-1e-06,-7e-06,-1e-06,-1e-06,-3e-06,-4e-06,0,0,-2e-06,-2e-06,-1e-06,-1e-06,0,1e-06,0,2e-06,0,2e-06,-4e-06,-1e-06,-1e-06,0,-4e-06,-1e-06,-3e-06
0,0,4e-06,0,0,-2e-06,4e-06,-2e-06,0,0,1e-06,0,-2e-06,3e-06,-1e-06,7e-06,3e-06,-5e-06,4e-06,0,-2.9e-05,-2.4e-05,5e-06,6e-06,-2.4e-05,1.6e-05,-2.2e-05,8e-06,1.4e-05,-1.8e-05,-4.9e-05,-8e-06,1.7e-05,9e-06,3e-06,-2e-05,2.8e-05,2.2e-05,-8.1e-05,-2.4e-05,-0.00017,1e-05,-8.6e-05,0.000116,1.1e-05,-3.6e-05,-0.000101,-0.000215,-0.000138,-4.5e-05,-3e-05,2.8e-05,2.3e-05,2.4e-05,-6.5e-05,3.4e-05,4.7e-05,-0.000103,8.6e-05,6.3e-05,-9e-06,-6.8e-05,-3e-06,-3e-06,-1.4e-05,4.7e-05,-3.5e-05,3e-06,-1.6e-05,9.8e-05,-3e-06,-3.8e-05,3e-05,-1e-06,2.4e-05,-7e-06,2.8e-05,6e-06,-6e-06,-3e-06,-2.5e-05,-1.5e-05,1.1e-05,-7e-06,-6e-06,-5e-06,-2e-06,1e-06,1.7e-05,1e-05,-3.4e-05,-1.3e-05,-8e-06,6e-06,5e-06,-6e-06,7e-06,6e-06,1e-06,0,-1e-06,-5e-06,-4e-06,-1e-06,0,1e-06,0,0,0,0,2e-06,-1e-06,0,-3e-06,-2e-06,-1e-06,0,1e-06,1e-06,-1e-06,0
-1e-06,-4e-06,-1e-06,1e-06,-4e-06,1e-06,0,1e-06,0,-1e-06,1e-06,0,1e-06,-1e-06,1e-06,-4e-06,-2e-06,5e-06,0,0,-1e-06,-6e-06,-8e-06,-1.5e-05,-5e-06,-1.7e-05,-1.3e-05,-3.7e-05,1e-06,-1e-05,4.9e-05,-1e-06,-2.3e-05,-5e-06,-1.2e-05,-4e-06,-0.00012,-4.8e-05,2.4e-05,1.5e-05,-0.000106,-6.2e-05,4.7e-05,-1e-04,5.1e-05,-2e-06,6.8e-05,0.000269,0.000149,-1e-05,5.1e-05,-3.6e-05,4.8e-05,-6.1e-05,-8.3e-05,4.2e-05,-3.9e-05,1.3e-05,-3.4e-05,-1.4e-05,1.1e-05,-3.3e-05,-5.5e-05,4.8e-05,2.6e-05,-1.6e-05,6.8e-05,1.6e-05,-6.2e-05,-0.000114,-8e-06,1.9e-05,-3.5e-05,-2.6e-05,-2.7e-05,0,9e-06,-8e-06,4e-06,-5e-06,2.8e-05,1e-05,2.8e-05,-5e-06,-2e-06,7e-06,0,0,-7e-06,9e-06,-9e-06,0,3e-06,-5e-06,-4e-06,-7e-06,3e-06,-2e-06,0,0,-1e-06,-4e-06,4e-06,1e-06,0,-5e-06,0,-1e-06,-1e-06,-1e-06,-2e-06,-2e-06,1e-06,1e-06,2e-06,0,0,0,2e-06,-1e-06,0
2e-06,-3e-06,-1e-06,-1e-06,-5e-06,0,0,1e-06,0,-1e-06,1e-06,0,1e-06,-1e-06,1e-06,5e-06,1e-06,-1e-06,-4e-06,0,2.5e-05,-1.5e-05,-7e-06,7e-06,3e-06,1.5e-05,1.5e-05,-6e-06,-1e-05,3e-06,-4.6e-05,3e-06,2.4e-05,-1e-06,1.3e-05,1.7e-05,0.000152,7.5e-05,-8e-06,-6e-06,4e-05,1e-06,4.8e-05,3.8e-05,-1.3e-05,1.9e-05,9.4e-05,-0.000159,-6.4e-05,7.1e-05,1e-06,-8e-06,-5.3e-05,-2.9e-05,3.5e-05,3.9e-05,6e-06,-4.4e-05,4.8e-05,-0.000113,-2.3e-05,9.9e-05,-5e-06,0.000109,-1.2e-05,5.5e-05,-4.4e-05,3.3e-05,2.1e-05,5.2e-05,-3e-06,-6e-06,-1.5e-05,-1.6e-05,-1e-05,-1.7e-05,-8e-06,-2.7e-05,-1.2e-05,0,6e-06,-5e-06,-1.5e-05,-1e-05,8e-06,5e-06,-3e-06,0,-2e-05,-5e-06,1e-05,9e-06,-4e-06,-1e-06,-9e-06,1.1e-05,4e-06,-3e-06,0,0,0,-2e-06,-2e-06,0,1e-06,3e-06,-1e-06,0,1e-06,0,0,1e-06,0,-1e-06,2e-06,4e-06,0,-1e-06,0,0,2e-06
0,2e-06,0,1e-06,-3e-06,2e-06,-3e-06,-1e-06,0,0,1e-06,0,0,0,-1e-06,-4e-06,-1e-06,-2e-06,2e-06,0,-2.8e-05,-1.8e-05,-3e-06,8e-06,1e-05,-6e-06,3e-06,-3.2e-05,-1.5e-05,-8e-06,2.3e-05,0,-1.9e-05,2e-06,-2e-06,-7e-06,-5.8e-05,-4e-05,2.5e-05,-3e-06,3.3e-05,-6e-06,6.5e-05,-8.5e-05,9e-06,0,-8.9e-05,0.000106,-3.5e-05,4.4e-05,-1.8e-05,-2.6e-05,-2.9e-05,5e-06,1.6e-05,1.9e-05,1.2e-05,2.8e-05,-5.2e-05,-1e-05,-2.6e-05,-3.8e-05,-2e-05,7.2e-05,-3.8e-05,-7.8e-05,-1.1e-05,-4.4e-05,4.1e-05,4.9e-05,-1e-06,-8e-06,-1.6e-05,-2e-05,1.9e-05,-8e-06,8e-06,1.9e-05,9e-06,1e-06,-2.2e-05,7e-06,-3e-06,-1e-06,1e-06,7e-06,1e-06,2e-06,-1.5e-05,-1.2e-05,1.4e-05,1e-06,-1.2e-05,6e-06,-2e-05,1e-06,0,0,0,0,1e-06,-1e-06,-1e-06,0,0,0,0,-1e-06,1e-06,1e-06,-1e-06,-2e-06,0,-1e-06,0,1e-06,0,1e-06,-3e-06,-1e-06,1e-06
0,2e-06,1e-06,0,3e-06,1e-06,-5e-06,0,0,0,1e-06,0,0,2e-06,0,3e-06,1e-06,1e-06,4e-06,0,4.4e-05,-2e-06,7e-06,-7e-06,-1.2e-05,4e-06,-2.2e-05,-8e-06,7e-06,-1.5e-05,-9e-06,3e-06,1.3e-05,-2e-06,9e-06,-8e-06,-1.1e-05,-2.7e-05,5e-06,8e-06,-5e-06,-4.2e-05,-4e-06,0.000169,1e-06,4e-06,-8.3e-05,-7.3e-05,-0.000169,1e-05,-2.2e-05,-4.6e-05,0,2.6e-05,1.8e-05,0,-4.2e-05,7.8e-05,-9e-06,3.5e-05,3.3e-05,-2.8e-05,2.6e-05,-3.3e-05,-9e-06,5e-05,1.7e-05,-4.7e-05,5.1e-05,-7.1e-05,-4e-06,1.4e-05,1e-05,1.4e-05,-9e-06,7e-06,-3e-06,9e-06,-1.2e-05,3e-06,1.3e-05,-4e-06,7e-06,5e-06,-5e-06,-2e-06,1e-06,0,1e-06,2e-06,7e-06,6e-06,0,-1e-06,0,-3e-06,-2e-06,4e-06,0,0,1e-06,-1e-06,3e-06,-1e-06,0,2e-06,-1e-06,1e-06,-1e-06,0,3e-06,0,0,2e-06,-2e-06,1e-06,0,1e-06,1e-06,0,0
-1e-06,0,0,0,5e-06,1e-06,1e-06,0,0,0,0,0,0,-1e-06,0,-1e-06,-1e-06,2e-06,-3e-06,0,-5.2e-05,1.9e-05,1e-06,-7e-06,7e-06,-4e-06,-1.2e-05,9e-06,9e-06,-1e-06,1.9e-05,-6e-06,-9e-06,1e-06,-6e-06,4e-06,6e-06,3.3e-05,-9e-06,-1.3e-05,3.4e-05,-1.3e-05,-4.2e-05,-7.7e-05,-1.8e-05,-1.2e-05,0.000107,1e-04,-6.1e-05,-4.8e-05,-2.6e-05,4e-05,-4e-05,2e-05,-7.5e-05,-1.3e-05,-3.3e-05,-7.6e-05,-7.7e-05,6.7e-05,-2e-05,7e-05,1.1e-05,-8.3e-05,1e-06,-1.1e-05,2.4e-05,3.8e-05,3.1e-05,3e-05,-6e-06,3.6e-05,1.3e-05,3e-05,-5e-06,2.6e-05,-4e-06,8e-06,3e-06,5e-06,2e-06,-1e-06,1e-06,1.8e-05,-2e-06,-3e-06,0,1e-06,1.3e-05,1.4e-05,-5e-06,-5e-06,1.3e-05,-1e-06,1.7e-05,1.1e-05,0,-3e-06,1e-06,1e-06,0,-1e-06,-4e-06,1e-06,0,1e-06,0,0,0,-1e-06,-2e-06,0,0,-2e-06,-2e-06,0,0,0,2e-06,0,-1e-06
0,0,-2e-06,0,2e-06,1e-06,3e-06,-1e-06,0,0,1e-06,0,-1e-06,-1e-06,-1e-06,1e-06,1e-06,-2e-06,-3e-06,0,4.3e-05,1e-06,-1e-06,4e-06,1e-05,-1e-06,1.2e-05,6e-06,1.2e-05,4e-06,-5e-05,3e-06,8e-06,2e-06,2e-06,1e-05,7e-06,1.4e-05,1.1e-05,1.3e-05,3.3e-05,3.5e-05,-1.4e-05,-4.1e-05,1e-06,-1.3e-05,4.5e-05,-0.000139,-8.3e-05,-5.6e-05,9e-06,-1.8e-05,1.1e-05,-1.3e-05,1.1e-05,-2.8e-05,6.6e-05,3e-06,3.6e-05,1e-06,-2.1e-05,-4.5e-05,-2.2e-05,-0.00011,1e-06,-5e-06,-4.4e-05,2.9e-05,-2.9e-05,1.3e-05,-8e-06,-5e-06,2e-06,1e-05,2.3e-05,-6e-06,0,-3.1e-05,9e-06,0,-1.7e-05,6e-06,-1.2e-05,-9e-06,3e-06,-8e-06,1e-06,0,1.1e-05,-2e-06,-8e-06,-7e-06,-8e-06,1e-06,3e-06,-1.6e-05,-4e-06,-1e-06,0,-1e-06,0,-3e-06,2e-06,0,0,-4e-06,0,0,0,0,0,1e-06,0,1e-06,0,-2e-06,0,0,0,-1e-06,-1e-06
0,1e-06,3e-06,0,-1e-06,0,2e-06,-2e-06,0,0,0,0,0,1e-06,-1e-06,-3e-06,0,-1e-06,3e-06,0,-3.4e-05,1e-05,1.4e-05,1e-05,6e-06,2e-06,7e-06,2.2e-05,-2e-06,-1.3e-05,5.3e-05,3e-06,-1e-06,-2e-06,-1e-06,-5e-06,-4.1e-05,-3.4e-05,-4.4e-05,-1e-05,4.1e-05,-1.2e-05,-1.7e-05,0.000119,8e-06,8e-06,-8.9e-05,0.000133,2.7e-05,-1e-06,-7.7e-05,-7e-06,-2.8e-05,-9e-06,-1.3e-05,-3.6e-05,3e-06,-4.1e-05,-3.4e-05,-5.1e-05,3.4e-05,1.5e-05,5e-06,-2.9e-05,1.5e-05,-4e-06,1.1e-05,-2e-05,-4.6e-05,-2.9e-05,-2e-06,1.3e-05,-3e-05,1e-06,-9e-06,-1.3e-05,-7e-06,1.1e-05,-3e-06,3e-06,2.1e-05,-7e-06,-9e-06,-1e-05,7e-06,-2e-06,-1e-06,0,3e-06,-1.1e-05,-4e-06,5e-06,5e-06,-1e-06,7e-06,6e-06,-1e-06,1e-06,0,-1e-06,0,-1e-06,1e-06,-1e-06,0,2e-06,-1e-06,1e-06,-1e-06,0,-1e-06,0,0,0,-1e-06,-1e-06,0,0,-3e-06,0,0
0,0,-3e-06,0,-2e-06,1e-06,1e-06,1e-06,0,0,0,0,0,0,0,1e-06,0,3e-06,3e-06,0,1.6e-05,1.8e-05,1.6e-05,-7e-06,-1.1e-05,0,-1.8e-05,1e-05,-8e-06,-1e-05,-2.8e-05,-6e-06,-5e-06,-1e-06,-1e-06,-1e-05,5.1e-05,-9e-06,2.1e-05,7e-06,5.3e-05,-3.2e-05,2.4e-05,-0.000133,-1.5e-05,1.6e-05,-5e-06,-0.000115,9e-06,6e-05,4.6e-05,1.5e-05,-1.3e-05,-7e-06,1.2e-05,-2.1e-05,-4.7e-05,6e-05,8.8e-05,-4.2e-05,-4e-06,-2.4e-05,1e-05,5.8e-05,-1e-06,3e-06,2.6e-05,-1.8e-05,-5.6e-05,2e-05,-3e-06,2.2e-05,-2e-06,-1.6e-05,-2.6e-05,-8e-06,-4e-06,5e-06,1e-06,4e-06,-3e-06,7e-06,7e-06,1e-06,-6e-06,1e-06,0,1e-06,-6e-06,0,6e-06,-5e-06,-6e-06,-2e-06,-1e-06,3e-06,1e-06,-2e-06,0,2e-06,-1e-06,-4e-06,-3e-06,0,0,-2e-06,0,0,0,0,2e-06,1e-06,0,-1e-06,-1e-06,0,0,0,0,-1e-06,0
0,-3e-06,0,0,-3e-06,-1e-06,-2e-06,0,0,0,0,0,0,0,1e-06,-2e-06,0,-2e-06,-3e-06,0,0,3e-06,1.2e-05,-4e-06,1.1e-05,3e-06,-1.1e-05,1.4e-05,-1e-05,4e-06,9e-06,4e-06,8e-06,1e-06,3e-06,1e-05,-7.6e-05,3.9e-05,1.5e-05,-3e-06,3.3e-05,-2e-06,-1e-06,4.7e-05,-1.2e-05,-3e-06,4.6e-05,3.8e-05,3.9e-05,2.3e-05,-2.3e-05,3.1e-05,4.2e-05,6e-06,-1.2e-05,-5e-06,4.1e-05,3e-05,-1.4e-05,1.4e-05,-6e-06,-2.7e-05,-2.2e-05,6.8e-05,-6e-06,3.9e-05,-1.5e-05,-1.5e-05,1.1e-05,-2.1e-05,-4e-06,-5e-06,8e-06,-1.1e-05,2.3e-05,-3e-06,6e-06,9e-06,-2e-06,-1e-06,-1.6e-05,-9e-06,1e-05,2e-06,-3e-06,6e-06,-1e-06,-1e-06,-8e-06,1.1e-05,1.1e-05,7e-06,-5e-06,-1e-06,-1.1e-05,2e-06,1e-06,1e-06,0,-1e-06,0,-1e-06,3e-06,1e-06,1e-06,2e-06,0,0,0,0,0,1e-06,0,0,1e-06,-1e-06,0,0,3e-06,-1e-06,1e-06
-1e-06,-1e-06,2e-06,0,-3e-06,0,-2e-06,-1e-06,0,0,0,0,0,-1e-06,0,0,0,0,-2e-06,0,-1.2e-05,-6e-06,-2e-06,1e-06,1e-06,-6e-06,2e-06,0,-4e-06,-2e-06,-1.3e-05,1e-06,-1.1e-05,-3e-06,-6e-06,4e-06,8.2e-05,-2.1e-05,-1.5e-05,-2e-06,-2.8e-05,-1.3e-05,1.7e-05,-1e-05,1.7e-05,-9e-06,-4e-06,-4e-06,-2.2e-05,-2.2e-05,4e-05,-3.5e-05,-4e-05,1.6e-05,-7e-06,4e-06,-1.3e-05,-5.4e-05,4e-05,4.9e-05,1e-05,7.8e-05,8e-06,5.8e-05,-5e-06,-6.7e-05,-1.8e-05,4e-06,1.6e-05,2.9e-05,-3e-06,-1.8e-05,2.4e-05,6e-06,2e-05,1.7e-05,7e-06,-4e-06,5e-06,0,1.7e-05,8e-06,7e-06,0,2e-06,3e-06,1e-06,0,-4e-06,2e-06,6e-06,-1e-06,1e-05,2e-06,-2e-06,-8e-06,2e-06,3e-06,0,-2e-06,0,-2e-06,-2e-06,0,0,1e-06,0,0,-1e-06,0,1e-06,-1e-06,0,-1e-06,1e-06,1e-06,0,0,0,0,0
0,1e-06,-2e-06,0,-2e-06,-1e-06,-1e-06,1e-06,0,0,0,0,0,1e-06,0,-1e-06,-1e-06,0,4e-06,0,2.9e-05,-1e-06,-1.2e-05,5e-06,-8e-06,3e-06,1e-05,-1e-05,1e-05,-1.4e-05,2.9e-05,-3e-06,1.1e-05,1e-06,6e-06,-9e-06,-4.2e-05,1e-06,1.9e-05,6e-06,-4.6e-05,-4e-06,-2.3e-05,-2e-06,-1.3e-05,-8e-06,-2.6e-05,2.7e-05,3.3e-05,-3.8e-05,-6.7e-05,1.1e-05,-5.3e-05,1e-05,2.3e-05,1e-05,-3e-05,-1.4e-05,-3.1e-05,3.3e-05,-2e-06,-6.8e-05,8e-06,-2e-06,-2e-06,5.5e-05,2.2e-05,3.6e-05,3.8e-05,0,-3e-06,3e-06,-1e-06,6e-06,-3.4e-05,8e-06,0,-2.2e-05,-3e-06,-3e-06,-9e-06,-8e-06,-1.4e-05,7e-06,4e-06,2e-06,1e-06,0,1e-06,-1.5e-05,-7e-06,-4e-06,3e-06,0,-1e-06,-2e-06,1e-06,-2e-06,0,2e-06,0,-1e-06,0,-1e-06,0,0,-1e-06,0,0,0,-2e-06,1e-06,0,0,-1e-06,0,0,0,-2e-06,-1e-06,1e-06
0,1e-06,1e-06,0,2e-06,0,1e-06,0,0,0,0,0,0,-1e-06,-1e-06,-1e-06,2e-06,2e-06,1e-06,0,-3.9e-05,-5e-06,-1.1e-05,5e-06,-6e-06,-5e-06,-9e-06,-1.1e-05,0,-7e-06,-3.3e-05,1e-06,-1.5e-05,0,-6e-06,0,2.6e-05,-1.1e-05,-5e-06,-8e-06,-3.2e-05,-8e-06,3e-06,7.3e-05,3e-06,3e-06,-2e-06,-5.1e-05,-0.000142,1.2e-05,2.8e-05,-6e-06,9e-06,4e-06,-1.3e-05,1.8e-05,2.1e-05,4e-06,2.9e-05,-1.8e-05,-1e-06,-8e-06,1.9e-05,-4.6e-05,5e-06,-5.7e-05,1.4e-05,-3e-06,-1.9e-05,-5.8e-05,-3e-06,-9e-06,-8e-06,-1e-06,-8e-06,-4e-06,-3e-06,1.8e-05,1.1e-05,-4e-06,-8e-06,1e-05,3e-06,3e-06,0,-5e-06,-1e-06,-1e-06,4e-06,0,-2e-05,6e-06,-7e-06,0,4e-06,1e-05,-2e-06,-2e-06,0,1e-06,0,-3e-06,2e-06,0,-1e-06,2e-06,0,0,0,0,2e-06,-1e-06,0,1e-06,-1e-06,0,0,0,0,0,-1e-06
