-0.000447,-0.00034,-0.000294,-0.000377,-0.000255,-0.00047,-0.000348,-0.000542,-0.000768,-0.000703,-0.000596,-0.00085,-0.000622,-0.000758,-0.000724,-0.000638,-0.000754,-0.001406,-0.000922,-0.000497,-0.000391,-0.000556,-0.000565,-0.000621,-0.000413,-0.000578,-0.00071,-0.000573,-0.000954,-0.000862,-0.000876,-0.000562,-0.000715,-0.00067,-0.000623,-0.000731,-0.001244,-0.001069,-0.000936,-0.001056,-0.00091,-0.001056,-0.000658,-0.000336,-0.00079,-0.000518,-0.000273,-0.000313,-0.000519,-0.000528,-0.000605,-0.000612,-0.000874,-0.001071,-0.000979,-0.000611,-0.000919,-0.000982,-0.001091,-0.001178,-0.000712,-0.001044,-0.00072,-0.001204,-0.000613,-0.000684,-0.001181,-0.000731,-0.000606,-0.000532,-0.000801,-0.000358,-0.000889,-0.000374,-0.000693,-0.000539,-0.001226,-0.001158,-0.001151,-0.000714,-0.000499,-0.000546,-0.000558,-0.000291,-0.001371,-0.001128,-0.000807,-0.001028,-0.001013,-0.000914,-0.000668,-0.000631,-0.000416,-0.000243,-7.7e-05,-0.000543,-0.000541,-0.000595,-0.001099,-0.001097,-0.000448,-0.000666,-0.00064,-0.000711,-0.000944,-0.000875,-0.00055,-0.00091,-0.000582,-0.000434,-0.001194,-0.000982,-0.000647,-0.000643,-0.000404,-0.000279,-0.000399,-0.000126,-0.000444,-0.000295,-0.000532
0.000136,8.3e-05,3.5e-05,6.8e-05,9.3e-05,-3.7e-05,5e-05,0.00028,0.000174,0.000271,-0.000271,0.000211,6.6e-05,0.000322,1.9e-05,5.1e-05,5.3e-05,0.000516,0.000382,0.000129,-4.4e-05,0.000174,0.000104,-0.000289,0.000144,7.2e-05,0.000169,-0.000151,-5.9e-05,0.000388,0.00019,0.000207,0.000288,-0.000101,6.3e-05,-4.1e-05,0.000514,9.3e-05,-0.000203,0.000647,5e-05,0.000437,8.1e-05,0.000356,-7.9e-05,-4.1e-05,-4.5e-05,-0.000169,-0.00036,-0.000317,-0.000215,-0.000426,4.2e-05,0.000318,4e-05,-0.000158,-0.000189,-0.000417,-0.000841,-0.000287,-0.00069,-0.000505,-0.000624,-0.000169,9.8e-05,0.00019,0.000222,-0.000241,-0.000165,-0.000218,-0.000221,-0.000361,9.2e-05,-2.5e-05,0.000112,0.000106,0.000141,0.000223,0.000292,-0.000284,-8e-05,-2.5e-05,-0.00025,-5.8e-05,8e-05,0.000211,-2e-05,0.000503,-9.5e-05,0.000196,-6.2e-05,-3.7e-05,-0.000457,-0.000371,-6.5e-05,1.6e-05,-0.000212,-0.000289,-0.000257,0.000189,-0.000217,9.3e-05,6e-05,0.000191,0.000378,0.000336,6.9e-05,0.000338,0.000273,-7.5e-05,0.000191,0.000298,0.00017,-1.3e-05,1.3e-05,-0.000173,0.000314,-6.5e-05,-6e-06,-0.000307,0.000129
8.8e-05,7.3e-05,0.000132,4.8e-05,-0.000128,-7.8e-05,5.5e-05,0.000123,0.000252,-0.000211,9.9e-05,3.9e-05,0.000273,-0.000133,-9.4e-05,0.000103,-0.000431,-0.000592,-0.000298,1.9e-05,-0.000144,0.000115,-0.000266,0.000303,3.4e-05,-0.000236,-0.000232,-0.000128,4.7e-05,-0.000146,-0.000114,-0.000152,-0.000106,0.00013,-0.000349,-0.000164,-0.000429,-2.3e-05,0.000448,-0.000237,7.4e-05,-0.00018,-0.00011,-0.000108,3.2e-05,-9e-06,3e-04,0.00021,0.000272,0.000347,1e-05,0.000453,0.000366,0.000282,3.7e-05,0.000289,-2.8e-05,0.000349,0.000854,0.000221,0.00025,0.000431,0.000474,0.000342,-9.8e-05,-0.000105,0.000329,0.000466,0.000114,0.000154,0.000505,0.000331,-5.4e-05,-0.000284,-7.5e-05,-0.000196,0.000327,0.000306,-4.9e-05,0.00042,-7.3e-05,-0.000236,6.8e-05,-2.4e-05,0.000101,0.000232,0.000183,-0.00011,0.000757,6.4e-05,-0.000285,-0.000251,-0.000149,0.000527,7.1e-05,0.000135,-8.2e-05,0.00024,7e-04,0.000138,0.000353,0.00025,0.000251,0.000219,-0.000339,-0.000153,0.000205,-0.000331,-0.000537,-7.9e-05,0.000194,0.000209,-7.9e-05,-7e-06,6.7e-05,0.000243,-3.5e-05,-6.7e-05,-0.000248,-5.7e-05,1.1e-05
-0.000146,-0.000175,-6.9e-05,-6.9e-05,7e-06,-1e-05,0.000102,-0.000252,-0.000465,3.3e-05,-0.000147,-0.000365,-0.000134,3.3e-05,-8.2e-05,5.2e-05,-0.000271,-0.000201,-2.3e-05,1.1e-05,-0.000207,-0.000461,-0.000283,-0.000335,-0.000572,-9.6e-05,8.8e-05,0.000316,4.2e-05,-0.000153,7.2e-05,0.000121,-0.00022,-0.000143,-0.000137,-0.000159,0.00011,-0.000356,-0.000306,-2.7e-05,-0.000162,-8.4e-05,2.7e-05,-0.000171,-0.000258,-0.000313,-0.000692,-0.000619,-0.000227,-0.000388,-0.00035,-0.00018,-0.000367,-0.000487,-9.6e-05,-0.00014,-0.000442,-0.000209,-0.000891,-0.00061,-0.000358,-0.000154,-0.000353,-0.000309,-0.000101,-0.000312,-0.000488,-0.000643,-0.000455,-0.00012,-0.000346,-0.000104,7.3e-05,-6e-06,-6e-05,-0.000234,-0.000285,-0.000271,-4.3e-05,-0.000428,-0.000195,-1.2e-05,-9.6e-05,-3.2e-05,-0.000187,-0.000476,-0.000198,-0.000259,-0.000778,-0.000386,1.8e-05,-0.000386,-0.000594,-0.00043,-0.000258,-0.000119,-0.000371,-0.000336,-0.000297,-0.000546,-0.000458,-0.000522,-0.000389,-0.000385,0.00011,7.1e-05,-0.000549,-4.6e-05,7.3e-05,5.8e-05,-0.00039,-0.000363,-0.000114,-0.000248,-0.000244,-9.5e-05,0.000166,-2e-06,-0.000118,-0.000271,-0.000517
8.1e-05,0.00015,-2e-06,-2e-05,0.000125,-3.7e-05,-2.6e-05,0.000143,0.00014,1.7e-05,0.000194,0.00033,-8.2e-05,2.6e-05,-8.9e-05,-9.9e-05,0.000127,3.1e-05,3.4e-05,3.6e-05,8.2e-05,8.4e-05,0.000198,-2e-05,0.000293,0.000154,-8.5e-05,-0.000165,6.6e-05,-6e-05,-3.3e-05,-3.1e-05,0.00026,9.8e-05,1.9e-05,-7e-05,3.6e-05,4.3e-05,0.000102,4.3e-05,3e-06,-0.000338,-0.000237,-0.000142,-2e-05,4.5e-05,0.00011,-9e-06,0.000111,0.00023,0.000288,0.000179,0.000294,0.000261,3e-05,0.00014,0.000229,0.000355,0.000735,0.000173,4.5e-05,8.7e-05,-3.9e-05,-0.00024,0.000163,6.9e-05,0.000156,0.000219,-0.000326,9.8e-05,-2e-05,-4.5e-05,-9.2e-05,-8.8e-05,-4.2e-05,0.000607,0.000109,-9.1e-05,-0.000107,0.000122,0.000305,0.000153,0.000126,-2.5e-05,-0.000103,0.00033,-9e-06,0.000171,0.000258,0.000389,0.000213,0.000206,0.000445,0.00021,-0.000125,-0.000183,9e-06,0.000137,0.000253,0.000346,0.00027,0.000176,1.8e-05,0.000139,-0.000193,-0.000405,-8.3e-05,4.8e-05,0.000184,-0.000131,0.000352,-0.000105,4.9e-05,0.00017,-2.2e-05,6.2e-05,-5.7e-05,0.000194,0.000154,1.9e-05,8.8e-05
-5.4e-05,-0.000181,-6.1e-05,-2.6e-05,3e-06,-1e-06,-4.8e-05,-2e-04,-0.000142,-0.000103,-6.4e-05,-8.9e-05,5.1e-05,-7.3e-05,0.000213,1.4e-05,-0.000182,5.7e-05,-6.2e-05,-3e-05,-4.4e-05,-9.8e-05,5.4e-05,9.7e-05,-7.7e-05,2.4e-05,0.000115,-0.000103,-9.9e-05,2.9e-05,3.3e-05,0.000156,-0.000229,-9e-05,0.000287,0.000248,8.1e-05,0.000229,1.9e-05,-0.000121,0.000202,0.000294,-6e-05,0.000139,-3.4e-05,0.000196,5.8e-05,0.000367,4.6e-05,1.1e-05,-6.9e-05,9e-06,-0.000239,1.3e-05,0.000213,-4.4e-05,5.5e-05,-0.000229,-0.000456,0.000132,0.000362,3.4e-05,0.000193,-7.8e-05,-0.000391,1.6e-05,-1e-06,-8e-06,-0.000109,-0.000171,-0.00017,6.1e-05,5.4e-05,-0.000106,6.7e-05,-5.9e-05,5e-05,0.000285,0.000282,0.000166,-0.00024,5.4e-05,-5e-06,-7.6e-05,0.000185,-0.000276,-0.000232,-0.000193,-1.3e-05,-0.000139,-0.000177,0.000111,6.6e-05,-0.000101,2.2e-05,-0.000151,0.000205,-0.000333,-0.000225,-7.5e-05,-9e-06,-5e-06,-9.4e-05,-0.000225,3.5e-05,0.000234,0.00012,0.000155,1.6e-05,3.7e-05,-0.00023,4.3e-05,-0.000148,6.9e-05,8.7e-05,-9.1e-05,-3.8e-05,-9.1e-05,-9.9e-05,0.000112,-0.000261
0.000134,8.3e-05,-4.7e-05,-1.2e-05,-0.000113,-2.2e-05,4e-05,-3.8e-05,-3e-05,0.000162,-5.2e-05,-3.4e-05,6.7e-05,0.000119,-0.000102,0.00012,0.000316,0.000165,-8.2e-05,2.7e-05,0.000102,-2.1e-05,2e-05,-0.000141,2.2e-05,-5e-05,4.7e-05,-3e-06,-0.000103,-0.000125,-0.000221,-0.000134,0.000117,-6e-06,-0.000159,0.000161,9e-05,-9.7e-05,-0.000205,9.3e-05,-0.000153,-7.9e-05,-7.7e-05,-7.4e-05,5.3e-05,-0.000274,-9.4e-05,-0.000194,2e-04,3.2e-05,-5.7e-05,-0.000141,-5.6e-05,-1.2e-05,-0.00021,-0.000156,-0.000233,-6.5e-05,-7e-05,7.4e-05,0.000127,-8.1e-05,-0.000109,0.000265,0.000199,0.000132,-0.000257,-7.7e-05,0.000294,0.000311,0.00014,-0.000308,4e-06,1e-06,0.000132,2.6e-05,-0.00027,-0.000189,-0.000104,5.2e-05,7.4e-05,-0.000271,-0.000134,0.000176,-0.000115,0.000235,0.000267,-3.7e-05,-0.000281,-1.9e-05,0.000161,-8.3e-05,8.7e-05,1.4e-05,-7.9e-05,-1.4e-05,3e-06,4.9e-05,-4.9e-05,0.000269,-0.000122,-0.00024,4e-05,5.9e-05,-0.000147,-0.000177,-0.000195,-4.7e-05,0.000102,-3.5e-05,7e-06,-0.00011,9.2e-05,-7.7e-05,0.000165,6.8e-05,3.9e-05,-0.00016,-4.1e-05,9e-05,0.000151
-7.3e-05,-0.000114,-5.4e-05,9e-06,-5.9e-05,-3e-06,-0.000182,3.7e-05,-9.6e-05,-5.9e-05,6.2e-05,7.7e-05,-8e-05,-0.000132,-8.7e-05,-8.3e-05,-0.000194,-2.9e-05,-0.00017,-1.2e-05,-0.000112,9.1e-05,1.9e-05,0.000262,8e-06,-0.000158,8e-05,9.4e-05,0.000151,8e-05,0.000137,7.6e-05,-0.000123,2.9e-05,-3.1e-05,-0.000172,-0.000261,-0.000142,2.6e-05,-0.000114,0.000205,2.4e-05,0.000208,8.3e-05,0.000128,2.9e-05,0.000133,0.000231,-4.3e-05,-7.9e-05,0.000173,-2.1e-05,0.000176,9.5e-05,-4.7e-05,-2.8e-05,0.000247,-2.5e-05,0.000124,-7.2e-05,-0.000276,4.2e-05,-0.00018,-0.000162,-0.000184,-1.8e-05,8.5e-05,2.4e-05,-0.000225,-8.6e-05,2.9e-05,0.000222,1.3e-05,0.000146,9e-06,-0.000159,0.000125,-3.5e-05,1.8e-05,-0.000126,3.7e-05,4.8e-05,-4.1e-05,-0.000236,6.6e-05,-4e-06,-0.000189,-3.8e-05,9.4e-05,7.8e-05,-5.4e-05,0.000118,-0.000155,-0.00019,-3.2e-05,7.8e-05,8.1e-05,3.9e-05,3.1e-05,-0.000204,-7.5e-05,0.000248,-3.4e-05,-4.5e-05,-2.5e-05,6.4e-05,-4.8e-05,-0.000139,-0.000315,-0.000271,0.000129,0.000128,0.000143,0.000163,-0.000109,-3.4e-05,-0.000239,-0.000105,-3.4e-05,-3.7e-05,0.000142
9.5e-05,0.000102,7.1e-05,4.8e-05,1.3e-05,-0.000118,0.000107,-3e-06,9.4e-05,-5e-05,1.9e-05,2.4e-05,0.000123,0.000104,0.000121,7e-05,4.1e-05,3e-05,6.5e-05,-7.1e-05,3.1e-05,-7.2e-05,-0.000108,-4e-05,5.2e-05,7e-05,-7.8e-05,-3.4e-05,-7.6e-05,-5.5e-05,-2.5e-05,-3.7e-05,3.9e-05,6.2e-05,0.000156,7.9e-05,1.1e-05,9.6e-05,0.000144,5.5e-05,-0.000109,-0.000148,-3.9e-05,0.000112,6e-06,7.1e-05,-5.3e-05,-0.000183,-0.000241,-5.6e-05,-0.000116,-0.000146,-0.00013,-0.00011,0.000138,0.000167,-1.2e-05,-5.6e-05,0.000137,5.5e-05,0.000158,9.2e-05,-3e-06,1.3e-05,-5.1e-05,3.4e-05,6.4e-05,1.5e-05,0.000209,-0.000174,-0.000119,1.5e-05,-0.000137,7e-06,9.5e-05,1.7e-05,0.000155,1.1e-05,1.2e-05,-3.1e-05,2.1e-05,3.1e-05,-4.4e-05,0.000134,3.3e-05,6.5e-05,6.6e-05,-4.3e-05,-6.1e-05,-0.000124,1e-06,-0.000135,-0.000166,-0.000139,-0.000163,-3.2e-05,-5e-06,7e-05,0.000141,-4.2e-05,6.1e-05,-0.000121,4.6e-05,8.2e-05,6.5e-05,0.000146,8e-05,2.4e-05,0.000159,0.000133,-5.5e-05,-0.000122,-0.000227,-8.4e-05,5.3e-05,-3.1e-05,8.2e-05,-2.6e-05,-2e-06,-6.5e-05,-4.5e-05
-7.7e-05,-7.8e-05,-4e-05,-1.6e-05,-4.1e-05,7.8e-05,-3.9e-05,-5.2e-05,-7e-05,5e-06,2.6e-05,-2.8e-05,-8.2e-05,-3.6e-05,-9.7e-05,5.7e-05,5.8e-05,-3e-05,3e-05,-6.6e-05,-4.4e-05,6.1e-05,1.5e-05,-8.3e-05,-3.6e-05,-0.000112,-2.4e-05,9.5e-05,8.3e-05,1e-05,3.3e-05,2.5e-05,-0.000104,-8e-06,-0.000121,-1e-05,2.7e-05,4.5e-05,-3.5e-05,2.3e-05,3.2e-05,0.000167,5.9e-05,-4.5e-05,-5.8e-05,-0.000189,-1.4e-05,-4.7e-05,0.000136,4.5e-05,8.1e-05,0.000129,3e-05,5e-05,-9.6e-05,-8.7e-05,4.6e-05,0.000191,1.7e-05,-7.3e-05,-0.000207,-6e-06,0.00015,7.1e-05,9e-05,-1.8e-05,2.6e-05,-3.3e-05,9.4e-05,-0.000112,5e-05,-2.1e-05,3.1e-05,-3.7e-05,-0.000108,-0.000117,-0.000259,-4.1e-05,0.000152,-3.3e-05,7e-06,1.6e-05,1e-04,2.9e-05,-5.9e-05,-9.3e-05,-0.000103,-6.8e-05,3.3e-05,4.4e-05,4.3e-05,9e-05,7.3e-05,0.000111,7.3e-05,4.4e-05,-1.7e-05,2e-06,6e-06,3e-06,8.5e-05,1.4e-05,9.7e-05,1e-05,-1.2e-05,-3.4e-05,0.000117,-2.1e-05,1.7e-05,2e-05,8.1e-05,5e-06,0.000211,3.8e-05,-0.000127,-1.8e-05,1.4e-05,-0.000117,-1.1e-05,-0.000157,-0.000103
6.7e-05,1.6e-05,4.1e-05,3.1e-05,4e-06,2.9e-05,1.8e-05,-7e-06,4.4e-05,-2.1e-05,-1.3e-05,5e-06,-6.9e-05,1.8e-05,5.2e-05,-6.3e-05,1.3e-05,6.6e-05,2.6e-05,3.3e-05,-4e-06,-4.2e-05,-3e-05,-3.4e-05,5.1e-05,7.9e-05,2.6e-05,-3.4e-05,-0.000115,6e-06,-1.7e-05,-4.9e-05,0.000104,3e-05,2.2e-05,0,0.000124,-2.8e-05,-2.1e-05,-4.5e-05,-2.8e-05,-0.000145,-4.9e-05,-2e-06,-8e-06,3e-05,6.5e-05,2.2e-05,-0.000109,6.6e-05,1e-06,2.5e-05,-4.2e-05,-5.3e-05,4.5e-05,2.6e-05,-1.2e-05,-1.8e-05,-7.9e-05,8.6e-05,2.7e-05,-0.000117,-5.2e-05,-9.1e-05,3.6e-05,0.000107,-2.2e-05,5.5e-05,-0.00021,-3e-06,-0.000161,1e-04,2.7e-05,5.2e-05,4e-06,6.2e-05,0.00011,-1e-06,-0.00013,-7e-06,7.5e-05,-1.5e-05,-1.3e-05,9.7e-05,0.000122,9.9e-05,5.7e-05,-0.000108,6.5e-05,5.8e-05,-1.8e-05,-4.5e-05,2.3e-05,0.000115,3e-05,2.2e-05,1.6e-05,6.4e-05,-4.8e-05,8e-06,-2.3e-05,2.2e-05,7e-06,-4.5e-05,6.6e-05,-8.4e-05,-2.3e-05,-7.3e-05,-7.1e-05,4.4e-05,-8.3e-05,1.9e-05,-7e-06,-0.000138,-3e-05,8.2e-05,7.4e-05,6.1e-05,2.8e-05,9.9e-05,4.5e-05
-7.7e-05,3e-06,2e-06,-3e-05,4.3e-05,2e-06,7.9e-05,3.9e-05,-1.4e-05,-5.3e-05,-4.1e-05,-2.4e-05,5.7e-05,3.5e-05,1.2e-05,-1.1e-05,-7.6e-05,-5.4e-05,4.3e-05,6.2e-05,-5e-05,6.6e-05,-2.1e-05,-3.4e-05,-9.9e-05,2.9e-05,1.7e-05,-6.3e-05,5.3e-05,9e-06,-3e-06,-4.6e-05,-8e-05,-6.2e-05,-9e-06,-2e-05,-3.3e-05,1.2e-05,4.1e-05,5.4e-05,0,0.000105,-2e-06,-3e-05,4.8e-05,1e-05,3e-06,2.3e-05,0.000104,3.5e-05,-3.8e-05,-8e-05,6e-06,2.1e-05,3e-06,-1.1e-05,7e-06,-2.9e-05,5e-06,3.3e-05,0.000126,6e-05,-5.2e-05,-6e-06,-3.1e-05,-8.2e-05,-1.6e-05,-1.3e-05,8.7e-05,-2.7e-05,3.8e-05,-2.4e-05,2e-05,-6e-05,-5.7e-05,-3e-06,-0.000126,1.1e-05,2.3e-05,-4.1e-05,-2.4e-05,3.3e-05,-3e-06,-3.7e-05,-9.1e-05,-4.7e-05,6.2e-05,0.000154,-9e-05,2.4e-05,-2.3e-05,1.7e-05,5.5e-05,-3.8e-05,1e-06,1.3e-05,-3.9e-05,-0.000116,5.9e-05,-1.4e-05,-2.4e-05,5.9e-05,-1.1e-05,3.4e-05,-5.9e-05,3.9e-05,-4.1e-05,-2.2e-05,8.4e-05,-4.7e-05,6.9e-05,-2.1e-05,-6.3e-05,6.8e-05,1.7e-05,-6e-05,-1.7e-05,-3.5e-05,9e-06,-6.5e-05,1e-05
-2.3e-05,-3.8e-05,2.4e-05,2.3e-05,3.1e-05,5e-06,-2.8e-05,1.7e-05,2.1e-05,3e-06,1.4e-05,-1.2e-05,2.2e-05,-4.2e-05,-2.7e-05,1.2e-05,-2.1e-05,5e-06,3e-06,-8.4e-05,-3.8e-05,-1e-05,1e-05,5.3e-05,-1.5e-05,-5.2e-05,-3e-06,1e-06,-3e-05,-1e-05,-4.6e-05,-2e-05,2.7e-05,-2e-05,2.3e-05,-1e-06,3e-05,-6.1e-05,-9.3e-05,-6e-05,1e-06,-9e-05,-2.7e-05,-2.8e-05,-1.1e-05,5.2e-05,-2.6e-05,-3.4e-05,7e-06,2.7e-05,0,0.00011,3e-05,-5.1e-05,-9.1e-05,-3.8e-05,-9e-06,5.8e-05,-6.1e-05,-0.000126,-4.8e-05,-7.1e-05,1.8e-05,5.1e-05,-1.8e-05,-6.6e-05,-0.000103,3e-06,-5.6e-05,-2.9e-05,-3.2e-05,3.4e-05,-3.8e-05,8e-06,7.7e-05,3.5e-05,9.4e-05,-1.5e-05,7e-06,0,-2.9e-05,-1.8e-05,-2.2e-05,-5e-06,4.4e-05,-6e-06,-5.4e-05,-3e-05,0.000125,4.9e-05,1.3e-05,-3.4e-05,8e-06,-4.5e-05,4e-05,-2e-06,-1e-06,1.8e-05,-4e-05,-2.4e-05,1e-06,-5.1e-05,4.1e-05,1.4e-05,8e-06,-5.1e-05,4.5e-05,2.5e-05,-3.9e-05,-5.6e-05,-4.1e-05,1.4e-05,3.6e-05,2.9e-05,-2.1e-05,-9e-06,-4.6e-05,8e-06,-2e-06,1.7e-05,4e-06
1.2e-05,0,-1.1e-05,1e-06,-3.1e-05,-1.9e-05,-1.5e-05,2.5e-05,-2.9e-05,-7e-06,-1.3e-05,1.2e-05,3.7e-05,2.5e-05,7e-06,-2.5e-05,0.000104,-3.1e-05,-2.4e-05,3e-06,1.3e-05,2.3e-05,0,-2.3e-05,6e-06,7.7e-05,-2.5e-05,-2.3e-05,7e-06,6e-06,5.9e-05,9e-06,-1.9e-05,1.5e-05,-2e-06,-7e-06,-3.5e-05,7e-06,0.000103,4e-06,-4e-06,2.8e-05,4.4e-05,3e-06,-7e-06,1.9e-05,2e-05,-4e-06,-5.3e-05,-5.2e-05,1.1e-05,-3.2e-05,9e-06,3.3e-05,5.6e-05,1.8e-05,1e-05,-6.3e-05,-3e-06,4.1e-05,5.9e-05,7.7e-05,5.6e-05,-8e-06,2.9e-05,4.3e-05,2.3e-05,-2.2e-05,-2.9e-05,8.7e-05,8.9e-05,-6.5e-05,2e-05,2.4e-05,-9.5e-05,-1.3e-05,-2.8e-05,-4.9e-05,-6.5e-05,0,-1.9e-05,-2e-05,1.8e-05,-7e-06,1.1e-05,-9e-06,3.9e-05,-3e-05,-5.9e-05,-1.4e-05,2.8e-05,5.7e-05,-4.5e-05,6e-06,-1.6e-05,4.1e-05,-8e-06,-1.2e-05,-9e-06,-5e-06,-1.7e-05,-2.7e-05,-2.2e-05,-1.7e-05,-4e-06,8e-06,-9.5e-05,-1.3e-05,-1.6e-05,1.9e-05,0.000119,-4.8e-05,4e-06,-4.8e-05,7e-06,3e-05,1e-06,5.8e-05,-2.6e-05,-4.7e-05,3.2e-05
3e-06,8e-06,1e-06,-3e-06,-7e-06,1.4e-05,2e-05,-4.7e-05,3.2e-05,-5e-06,6e-06,-8e-06,-1.6e-05,-3.6e-05,-1.1e-05,1.7e-05,-2.7e-05,-8e-06,-2.6e-05,2.8e-05,1.3e-05,2e-06,0,2e-05,2.5e-05,-3.9e-05,-5.2e-05,2.5e-05,1.4e-05,1.2e-05,-5.2e-05,-9e-06,3.3e-05,-1e-05,2e-05,3.4e-05,-2.1e-05,-2e-05,-4.3e-05,-6e-06,0,1.1e-05,5.6e-05,-3.8e-05,-1e-06,-1.4e-05,3.3e-05,3.8e-05,1e-05,-1.9e-05,2.1e-05,9e-06,3.2e-05,-1.5e-05,-8.2e-05,1.3e-05,-1.4e-05,-7e-06,5.3e-05,-4e-06,-3.9e-05,-5.4e-05,1.8e-05,-3e-06,2e-06,-3.7e-05,-3.4e-05,1.7e-05,2.2e-05,4.2e-05,-2e-05,3.3e-05,3.5e-05,4e-06,4.8e-05,-2.9e-05,4.1e-05,3.5e-05,6e-05,1.1e-05,4.7e-05,2.1e-05,-2.6e-05,2.8e-05,-3.9e-05,8e-06,-1.4e-05,-1.4e-05,5.1e-05,-2e-06,-3.2e-05,-2.2e-05,5.9e-05,-1.8e-05,1.4e-05,-5e-06,-4e-06,2.2e-05,5e-06,1.4e-05,-8e-06,1.2e-05,9e-06,0,1.4e-05,-4.5e-05,6.1e-05,5e-06,-3.4e-05,-2.2e-05,-5.6e-05,3.3e-05,-2.3e-05,0,2.4e-05,-2.6e-05,-9e-06,-9e-06,2.1e-05,1.2e-05,-2.2e-05
-1.2e-05,5e-06,1e-06,-2e-06,-4e-06,-8e-06,-2.7e-05,7e-06,-1.3e-05,2.6e-05,1.4e-05,8e-06,-2.7e-05,2e-05,2e-05,5e-06,-7e-06,-7e-06,-2.3e-05,-1.4e-05,-7e-06,-8e-06,1e-06,-2.6e-05,1e-05,-1.7e-05,3.2e-05,2e-06,-3e-06,-1.7e-05,5.2e-05,3e-05,-2.6e-05,8e-06,2e-06,-2.6e-05,-3e-06,1.4e-05,1.6e-05,1.8e-05,0,-2e-06,-3.2e-05,2.2e-05,-9e-06,4e-06,-1.9e-05,-2.4e-05,3.5e-05,2.3e-05,-2.8e-05,1.1e-05,-4.8e-05,2.3e-05,3.7e-05,-2e-06,-1.1e-05,-1.1e-05,1.4e-05,1.6e-05,4e-06,5e-05,-3.3e-05,7e-06,-7e-06,-1.1e-05,6.4e-05,-5e-06,-5.7e-05,9e-06,-2e-06,1.5e-05,-2.7e-05,3e-06,-1.7e-05,-5e-06,3e-06,-1.8e-05,-1.6e-05,1.3e-05,-2.4e-05,-5.5e-05,7e-06,-8e-06,-8e-06,-2.1e-05,-5e-05,4e-05,-1.9e-05,7e-06,-4e-06,8e-06,-1.6e-05,-6e-06,-2.7e-05,0,0,5e-06,-1.8e-05,0,-3e-06,-1e-05,1e-05,-1.7e-05,-9e-06,2e-06,-1.3e-05,1e-05,9e-06,2.7e-05,2.2e-05,-2.3e-05,1.9e-05,2.1e-05,-1e-05,9e-06,-6e-06,-2e-05,-1.3e-05,1.1e-05,2.3e-05
2.1e-05,-3e-06,-9e-06,-3e-06,-1.7e-05,-3e-06,2.4e-05,8e-06,1.3e-05,9e-06,-3e-06,-1.3e-05,1.3e-05,-1e-06,-3e-06,-2.1e-05,4e-06,2e-06,1.6e-05,1.6e-05,6e-06,1.4e-05,6e-06,-2.4e-05,-1.3e-05,-3e-06,-2.3e-05,-7e-06,4e-06,6e-06,-3.1e-05,1.8e-05,1.9e-05,-1.9e-05,-4e-06,-1.2e-05,-7e-06,3.1e-05,1.1e-05,-2e-05,-6e-06,4e-06,-1.2e-05,0,2.2e-05,-1.5e-05,-3e-06,4e-06,-3.4e-05,-1.5e-05,6e-06,-2.8e-05,-6e-06,-7e-06,7e-06,0,1e-06,8e-06,-1.8e-05,-1.8e-05,3.5e-05,-1.6e-05,-1.8e-05,1.5e-05,-9e-06,-3e-06,-1.9e-05,2e-05,2.4e-05,8e-06,1.9e-05,-1.2e-05,5e-06,-1.3e-05,5e-06,-1.2e-05,-2.6e-05,-5e-06,-1.5e-05,-1.9e-05,-1.4e-05,0,5e-06,7e-06,-1.1e-05,2.4e-05,6e-05,-2.2e-05,4.8e-05,-1.1e-05,1.1e-05,6e-06,-4e-05,1.7e-05,1.3e-05,1.5e-05,-1.4e-05,8e-06,-2.3e-05,-3e-06,1e-06,1.7e-05,4e-06,1.1e-05,-1.4e-05,-8e-06,2e-05,8e-06,-3.1e-05,-7e-06,-2.7e-05,1.5e-05,7e-06,4e-06,-4e-06,3.3e-05,2.2e-05,-1.4e-05,-6e-06,1e-06,-5e-06
-1.4e-05,-2e-06,1.5e-05,6e-06,-7e-06,-6e-06,-8e-06,-8e-06,-1.4e-05,-1.2e-05,2.3e-05,1.3e-05,-2e-06,-5e-06,-1e-05,1.6e-05,1.6e-05,-8e-06,6e-06,-3e-06,-5e-06,5e-06,5e-06,1.8e-05,7e-06,-1.9e-05,1.7e-05,-1.9e-05,-1e-06,-2e-06,1.1e-05,-6e-06,-1.6e-05,-2e-05,-8e-06,3e-05,-1e-06,-1.7e-05,-2e-05,5e-06,1.4e-05,2e-06,5e-06,-4e-06,-8e-06,-1e-05,-1.1e-05,-1e-06,-1.5e-05,-3e-06,-1.9e-05,9e-06,1.3e-05,1e-05,-1.3e-05,-1e-05,-1.1e-05,5e-06,-1e-05,-1.4e-05,-4.3e-05,0,-2e-06,3e-06,1.3e-05,-8e-06,0,-1e-05,2.5e-05,-4.4e-05,2e-06,3.1e-05,-3e-06,-7e-06,3e-06,4e-06,-3e-06,9e-06,3.2e-05,-6e-06,-3e-06,8e-06,-2e-06,-2.4e-05,-4e-06,-1.7e-05,-5.4e-05,1.6e-05,-2.9e-05,-1.7e-05,-1.6e-05,-3e-06,2.2e-05,1.7e-05,-7e-06,0,2.1e-05,-1.9e-05,4e-06,-1.2e-05,1e-05,-1.6e-05,-1.1e-05,-2e-06,5e-06,3e-06,-1.4e-05,-3e-06,2.9e-05,6e-06,2e-06,-1.8e-05,-3.1e-05,-1.3e-05,-1e-05,-2.3e-05,7e-06,-1.1e-05,1e-05,-5e-06,7e-06
1.2e-05,-5e-06,1e-06,-7e-06,1.7e-05,1.2e-05,5e-06,5e-06,-2e-06,1.9e-05,-1.8e-05,-1e-05,7e-06,4e-06,7e-06,-1.4e-05,-2e-05,2e-06,2e-06,-9e-06,5e-06,-4e-06,-4e-06,3e-06,2e-06,1.9e-05,-2.2e-05,3e-06,4e-06,-1e-06,-1.9e-05,1e-06,7e-06,1.3e-05,1.1e-05,-1.3e-05,2.2e-05,1.3e-05,4e-06,-1.1e-05,-1.2e-05,-5e-06,4e-06,8e-06,7e-06,2e-05,2.1e-05,1.5e-05,1.4e-05,8e-06,-7e-06,4e-06,-5e-06,-9e-06,2.3e-05,-3e-06,-9e-06,1.7e-05,1.6e-05,2.1e-05,1.7e-05,-7e-06,-1e-05,-1.5e-05,2e-06,7e-06,-1.7e-05,-7e-06,-2.1e-05,-6e-06,-1.9e-05,-1.6e-05,2e-06,-6e-06,1e-06,2e-06,-4e-06,2e-06,0,4e-06,-6e-06,3e-06,4e-06,7e-06,1.8e-05,7e-06,2.8e-05,-1.9e-05,3e-06,-1e-06,-3e-06,6e-06,4e-06,-7e-06,9e-06,1.1e-05,0,-2e-06,1e-06,-3e-06,-6e-06,6e-06,6e-06,-5e-06,4e-06,-8e-06,7e-06,-1.3e-05,-5e-06,-3e-06,-2e-06,5e-06,1.9e-05,7e-06,3e-06,1e-05,3e-06,-2e-06,-4e-06,5e-06,5e-06
1e-06,-1e-06,2e-06,1e-06,1.1e-05,2e-06,2e-06,-1e-05,-1e-06,-1e-06,1.7e-05,1.2e-05,-8e-06,3e-06,-4e-06,8e-06,1e-05,1.2e-05,1.7e-05,-6e-06,-7e-06,1.5e-05,-5e-06,-6e-06,-4e-06,-1.5e-05,3e-06,-2e-06,-8e-06,5e-06,1.5e-05,-3e-06,-8e-06,-1.1e-05,1e-06,-1e-05,5e-06,-2.3e-05,-6e-06,7e-06,3e-06,4e-06,8e-06,5e-06,-1.1e-05,-2.4e-05,-1.8e-05,-6e-06,-1e-05,9e-06,1e-06,-9e-06,1e-05,0,-2.1e-05,6e-06,5e-06,-1.7e-05,-1.4e-05,1.3e-05,-2.8e-05,1e-05,7e-06,-6e-06,-1.4e-05,4e-06,6e-06,-2e-06,-4e-06,-6e-06,-2e-06,5e-06,4e-06,8e-06,0,1e-05,0,-5e-06,-1.5e-05,-5e-06,-9e-06,-6e-06,4e-06,-2e-06,-1.4e-05,-7e-06,-5e-06,1.5e-05,1e-06,-2e-06,9e-06,-3e-06,-7e-06,1e-05,-1e-06,0,-7e-06,3e-06,1e-05,-4e-06,-7e-06,-1e-06,-7e-06,0,-6e-06,3e-06,1.2e-05,-1.2e-05,-5e-06,-2.4e-05,1e-05,4e-06,8e-06,0,1.2e-05,-4e-06,-6e-06,2e-06,0,-9e-06,4e-06
0,-2e-06,1e-06,0,-2e-06,-8e-06,-4e-06,7e-06,8e-06,-1.4e-05,-1e-05,4e-06,-7e-06,-1e-06,0,4e-06,4e-06,3e-06,-1.2e-05,-8e-06,0,-1.3e-05,0,-1.6e-05,2e-06,1e-05,2.3e-05,9e-06,0,2e-06,-1.1e-05,-6e-06,7e-06,2.6e-05,-1.6e-05,1.1e-05,0,1.4e-05,4e-06,1e-06,5e-06,1e-06,1e-06,-5e-06,3e-06,3e-06,-1e-06,-1e-06,1.6e-05,-1e-06,7e-06,4e-06,-2e-06,5e-06,4e-06,3e-06,-6e-06,-2e-06,1.3e-05,-2.2e-05,-3e-06,-3e-06,2e-05,2e-05,5e-06,3e-06,1.5e-05,1e-05,-1.2e-05,-1.9e-05,-5e-06,-2.2e-05,2e-06,0,5e-06,2e-06,4e-06,8e-06,4e-06,2e-06,9e-06,-7e-06,-4e-06,-9e-06,3e-06,8e-06,-2e-06,-1.2e-05,4e-06,-2e-06,-1.5e-05,7e-06,2e-06,-1.4e-05,-4e-06,-3e-06,9e-06,1e-05,-3e-06,-3e-06,-1e-06,1e-05,0,-4e-06,-1e-06,-1.2e-05,-1.1e-05,-6e-06,1.1e-05,-1.1e-05,0,-2e-06,-1.7e-05,-1e-06,-1.9e-05,-5e-06,-1.5e-05,1.1e-05,1e-06,5e-06,-1e-05
-4e-06,7e-06,-4e-06,3e-06,-2e-06,2e-06,-1e-06,0,-3e-06,5e-06,9e-06,3e-06,6e-06,0,2e-06,-1e-06,7e-06,2e-06,-6e-06,7e-06,2e-06,1.2e-05,2e-06,3e-06,2e-06,1.3e-05,4e-06,6e-06,4e-06,-4e-06,1.2e-05,4e-06,-6e-06,-1.3e-05,1e-05,-1e-06,-3e-06,-5e-06,9e-06,-1e-05,-1e-05,-1.1e-05,-6e-06,7e-06,1e-06,7e-06,1e-05,5e-06,-1.4e-05,-8e-06,-1e-05,-5e-06,-6e-06,-6e-06,4e-06,1e-06,0,-6e-06,1e-06,9e-06,2.1e-05,2e-06,3e-06,9e-06,5e-06,1e-06,2e-06,0,1e-06,-2e-06,-5e-06,1.2e-05,-3e-06,-6e-06,-5e-06,1e-06,-8e-06,-1.2e-05,9e-06,-7e-06,9e-06,1e-06,0,2e-06,-3e-06,-8e-06,9e-06,1.6e-05,4e-06,1e-06,5e-06,-1e-05,6e-06,-1e-05,4e-06,-2e-06,-2e-06,-2e-06,1e-06,-4e-06,7e-06,-7e-06,-1e-06,0,-4e-06,7e-06,2e-06,-7e-06,-8e-06,1.3e-05,-1.3e-05,-3e-06,5e-06,-5e-06,5e-06,-3e-06,0,-3e-06,0,-1.4e-05,1.3e-05
5e-06,-4e-06,3e-06,-3e-06,-3e-06,-3e-06,-3e-06,8e-06,1e-06,-7e-06,-5e-06,-1e-06,4e-06,-3e-06,-2e-06,-3e-06,-1.5e-05,5e-06,-1.2e-05,-1.4e-05,-4e-06,-1.2e-05,-5e-06,6e-06,-4e-06,-1.9e-05,-2.2e-05,2e-06,-1e-06,3e-06,-7e-06,-1.1e-05,5e-06,2e-06,-2e-06,-4e-06,-9e-06,-3e-06,-7e-06,5e-06,1e-05,9e-06,-9e-06,-1e-05,2e-06,1e-06,-8e-06,-3e-06,0,-1.1e-05,0,8e-06,-4e-06,2e-06,-1.1e-05,-2e-06,-5e-06,-7e-06,5e-06,-5e-06,-1.7e-05,-2e-06,-1.4e-05,-7e-06,-1e-05,4e-06,-2e-06,0,6e-06,1.5e-05,2e-06,-3e-06,0,5e-06,4e-06,-2e-06,1.1e-05,2e-06,-8e-06,4e-06,-5e-06,2e-06,-5e-06,8e-06,-4e-06,6e-06,-1e-05,-1e-05,2e-06,-3e-06,7e-06,1.6e-05,-9e-06,2e-06,-2e-06,3e-06,4e-06,1e-06,1e-06,1e-06,2e-06,-4e-06,-3e-06,1e-06,3e-06,1e-06,6e-06,-5e-06,1e-06,7e-06,1.1e-05,-4e-06,-4e-06,3e-06,-4e-06,1e-05,8e-06,4e-06,-3e-06,4e-06,5e-06
-8e-06,-2e-06,-3e-06,0,-6e-06,4e-06,0,-1.2e-05,0,-7e-06,-3e-06,1e-06,3e-06,2e-06,2e-06,2e-06,5e-06,3e-06,-6e-06,1.9e-05,-2e-06,9e-06,-1e-06,8e-06,-1e-06,9e-06,1.3e-05,-7e-06,-2e-06,4e-06,5e-06,7e-06,-4e-06,-4e-06,1e-06,4e-06,-2e-06,1e-05,-3e-06,5e-06,-7e-06,-2e-06,0,1.7e-05,-5e-06,5e-06,-1e-06,0,1.4e-05,2e-06,5e-06,-6e-06,8e-06,-6e-06,1.2e-05,-1e-06,1e-06,9e-06,-1.3e-05,3e-06,2.7e-05,-5e-06,-1e-06,-7e-06,8e-06,1.5e-05,-4e-06,-4e-06,-3e-06,6e-06,0,0,5e-06,-5e-06,-7e-06,0,-1.2e-05,3e-06,9e-06,0,-2e-06,-1.4e-05,1e-06,-5e-06,7e-06,-5e-06,1.4e-05,0,-1e-06,-8e-06,-6e-06,-1.6e-05,2e-05,1.2e-05,5e-06,2e-06,-1e-06,1e-06,-1e-06,0,-1e-06,6e-06,3e-06,0,0,-3e-06,1e-06,3e-06,4e-06,1e-06,-9e-06,4e-06,-3e-06,-3e-06,2e-06,0,4e-06,-1e-06,3e-06,-7e-06,-6e-06
1e-06,-2e-06,2e-06,-1e-06,-3e-06,0,3e-06,-1e-06,-2e-06,6e-06,5e-06,-4e-06,-6e-06,1e-06,-3e-06,-6e-06,4e-06,1e-06,9e-06,-3e-06,1e-06,-4e-06,1e-06,1e-06,0,-9e-06,2e-06,-4e-06,2e-06,-5e-06,-2e-06,1e-06,5e-06,1e-06,-5e-06,-5e-06,0,-6e-06,0,-5e-06,2e-06,2e-06,1e-06,-1.6e-05,0,-9e-06,-1e-06,0,-1e-06,0,0,2e-06,-1e-06,3e-06,-1e-05,-1e-06,4e-06,9e-06,5e-06,4e-06,-1e-05,4e-06,1.2e-05,0,-2e-06,-4e-06,-4e-06,1e-06,-2e-06,1.1e-05,2e-06,8e-06,-2e-06,-1e-06,3e-06,-7e-06,1.3e-05,-9e-06,-1.1e-05,0,7e-06,8e-06,1e-06,0,-9e-06,3e-06,-1.5e-05,-4e-06,3e-06,0,4e-06,1.1e-05,-1.2e-05,-3e-06,-4e-06,-3e-06,-5e-06,-7e-06,3e-06,1e-06,0,-4e-06,-4e-06,-1e-06,-4e-06,2e-06,3e-06,2e-06,-5e-06,-2e-06,2e-06,-1e-06,2e-06,4e-06,0,-4e-06,1e-06,-6e-06,-5e-06,2e-06,0
0,0,2e-06,3e-06,3e-06,-1e-06,0,6e-06,1e-06,-3e-06,-6e-06,0,-7e-06,-2e-06,1e-06,8e-06,-2e-06,-2e-06,-1e-06,7e-06,-2e-06,-1e-06,1e-06,-8e-06,4e-06,-3e-06,3e-06,2e-06,0,0,-3e-06,-7e-06,-6e-06,1.2e-05,3e-06,3e-06,1e-06,6e-06,-1.1e-05,1e-06,1e-06,-3e-06,5e-06,1e-05,1e-06,6e-06,7e-06,-3e-06,-8e-06,8e-06,3e-06,5e-06,1e-06,-1e-06,3e-06,-3e-06,-5e-06,0,0,-6e-06,-2e-06,-5e-06,-4e-06,7e-06,-5e-06,-2e-06,0,3e-06,-2e-06,5e-06,-1e-06,-1.3e-05,-3e-06,2e-06,-2e-06,-1e-06,-9e-06,1e-05,-1e-06,-1e-06,1e-06,1e-06,1e-06,-3e-06,4e-06,-1e-06,0,3e-06,-1.1e-05,-2e-06,2e-06,-6e-06,-7e-06,2e-06,3e-06,1e-06,0,5e-06,4e-06,1e-06,1e-06,4e-06,-3e-06,3e-06,-2e-06,-8e-06,-8e-06,2e-06,-1e-06,-7e-06,-1e-06,-3e-06,2e-06,-4e-06,-1e-06,7e-06,-2e-06,1e-06,4e-06,-6e-06,0
0,-1e-06,-4e-06,-1e-06,3e-06,1e-06,4e-06,-4e-06,0,-1e-06,2e-06,0,6e-06,1e-06,2e-06,-3e-06,-1e-06,-1e-06,5e-06,-1.1e-05,1e-06,2e-06,1e-06,-3e-06,-3e-06,3e-06,-5e-06,0,-4e-06,2e-06,4e-06,7e-06,5e-06,-6e-06,3e-06,1e-06,7e-06,-1.1e-05,9e-06,-1e-06,-3e-06,0,-7e-06,-5e-06,-2e-06,-1e-06,-7e-06,2e-06,0,0,3e-06,-2e-06,2e-06,2e-06,1e-06,3e-06,3e-06,0,6e-06,0,1.4e-05,5e-06,-8e-06,6e-06,7e-06,4e-06,1e-06,2e-06,3e-06,-5e-06,-2e-06,6e-06,0,-2e-06,2e-06,-1e-06,6e-06,-6e-06,7e-06,1e-06,-4e-06,-8e-06,-1e-06,1e-06,1e-06,1e-06,5e-06,-5e-06,6e-06,-4e-06,-2e-06,4e-06,9e-06,3e-06,-1e-06,-4e-06,-2e-06,2e-06,1e-06,2e-06,1e-06,-2e-06,-1e-06,-1e-06,1e-06,3e-06,5e-06,0,7e-06,-9e-06,-9e-06,-1e-06,-4e-06,-1e-06,1e-06,-5e-06,-3e-06,-2e-06,-3e-06,-1e-06,-4e-06
-4e-06,3e-06,4e-06,0,3e-06,2e-06,-6e-06,4e-06,2e-06,8e-06,1e-06,0,2e-06,-1e-06,-2e-06,1e-06,0,-2e-06,2e-06,8e-06,-2e-06,-2e-06,0,0,0,-8e-06,-4e-06,7e-06,3e-06,0,-1e-06,1e-06,-3e-06,6e-06,-8e-06,-4e-06,2e-06,7e-06,-3e-06,4e-06,5e-06,1e-06,-5e-06,2e-06,2e-06,-8e-06,-2e-06,1e-06,0,2e-06,1e-06,2e-06,-6e-06,-2e-06,-9e-06,3e-06,3e-06,-2e-06,-5e-06,3e-06,-1.9e-05,-4e-06,4e-06,-4e-06,-2e-06,-7e-06,2e-06,-2e-06,-4e-06,-8e-06,4e-06,-1e-05,3e-06,3e-06,-4e-06,4e-06,-6e-06,0,-2e-06,0,-1e-06,7e-06,4e-06,2e-06,-4e-06,-3e-06,-8e-06,4e-06,-3e-06,3e-06,-2e-06,-3e-06,0,-6e-06,1e-06,3e-06,3e-06,2e-06,-1e-06,-1e-06,-4e-06,-1e-06,-1e-06,2e-06,0,-3e-06,-1e-06,-1e-06,-1.1e-05,-1e-06,-2e-06,-1e-06,-2e-06,4e-06,3e-06,-4e-06,-2e-06,0,1e-06,-1e-06,5e-06
4e-06,-1e-06,-3e-06,-1e-06,3e-06,1e-06,2e-06,-2e-06,-3e-06,0,-3e-06,-2e-06,2e-06,3e-06,0,-1e-06,1e-06,-2e-06,-6e-06,-1e-05,0,1e-06,-1e-06,7e-06,1e-06,1.2e-05,1e-06,-1e-06,1e-06,-2e-06,3e-06,-2e-06,1e-06,-1e-05,4e-06,0,1e-06,-5e-06,1e-06,-1e-06,-4e-06,1e-06,1e-06,-2e-06,-3e-06,8e-06,6e-06,2e-06,0,2e-06,-1e-06,-4e-06,0,2e-06,9e-06,-2e-06,-1e-06,-8e-06,4e-06,-3e-06,1.3e-05,5e-06,-3e-06,-2e-06,-5e-06,2e-06,1e-06,-3e-06,-5e-06,-1e-06,-1e-06,7e-06,-1e-06,-2e-06,3e-06,1e-06,2e-06,2e-06,0,-2e-06,1e-06,-6e-06,-2e-06,0,6e-06,3e-06,6e-06,0,5e-06,-1e-06,1e-06,0,-7e-06,-6e-06,-1e-06,0,0,-3e-06,-2e-06,-1e-06,-1e-06,-2e-06,3e-06,0,-2e-06,0,4e-06,-2e-06,8e-06,3e-06,3e-06,3e-06,7e-06,1e-06,-6e-06,6e-06,-2e-06,2e-06,2e-06,0,-1e-06
-1e-06,-1e-06,2e-06,2e-06,-1e-06,-4e-06,-1e-06,0,3e-06,-1e-06,5e-06,-2e-06,-3e-06,-3e-06,0,1e-06,-2e-06,-1e-06,-2e-06,2e-06,1e-06,-1e-06,3e-06,0,-1e-06,-6e-06,4e-06,-4e-06,0,2e-06,-5e-06,3e-06,-1e-06,1e-06,1e-06,2e-06,-2e-06,2e-06,5e-06,-4e-06,2e-06,-4e-06,-4e-06,0,3e-06,-5e-06,-3e-06,-2e-06,3e-06,1e-06,3e-06,3e-06,4e-06,4e-06,-7e-06,0,0,0,-4e-06,3e-06,-1.2e-05,-5e-06,0,1e-06,6e-06,-5e-06,-2e-06,1e-06,3e-06,-1e-05,2e-06,0,-1e-06,2e-06,0,1e-06,-1e-06,-5e-06,0,-1e-06,-1e-06,2e-06,0,0,-4e-06,-1e-06,2e-06,0,-3e-06,2e-06,3e-06,2e-06,6e-06,3e-06,-1e-06,-1e-06,-3e-06,2e-06,0,-1e-06,4e-06,5e-06,-2e-06,-1e-06,-2e-06,-4e-06,-2e-06,-5e-06,-3e-06,5e-06,7e-06,-4e-06,-2e-06,-2e-06,2e-06,-2e-06,3e-06,2e-06,-3e-06,-2e-06,-4e-06
0,-2e-06,-1e-06,-1e-06,-6e-06,1e-06,-3e-06,-2e-06,-3e-06,2e-06,-6e-06,-1e-06,-3e-06,0,0,-1e-06,1e-06,-2e-06,-5e-06,3e-06,-1e-06,-1e-06,0,-3e-06,1e-06,-1e-06,-2e-06,-4e-06,1e-06,-2e-06,2e-06,-2e-06,1e-06,1e-06,-2e-06,-3e-06,-4e-06,5e-06,-7e-06,1e-06,1e-06,2e-06,3e-06,2e-06,-3e-06,1e-06,-1e-06,1e-06,-8e-06,-4e-06,-2e-06,0,0,-1e-06,2e-06,-3e-06,2e-06,2e-06,1e-06,-1e-06,-3e-06,4e-06,5e-06,1e-06,0,-5e-06,-2e-06,1e-06,-6e-06,-5e-06,-5e-06,2e-06,1e-06,-2e-06,1e-06,0,1e-06,3e-06,1e-06,-2e-06,0,0,-2e-06,0,0,0,-2e-06,3e-06,-1e-06,3e-06,-3e-06,-2e-06,-2e-06,4e-06,1e-06,-1e-06,1e-06,-2e-06,0,0,2e-06,0,0,1e-06,0,-2e-06,0,-6e-06,-5e-06,4e-06,-3e-06,1e-06,-1e-06,0,-2e-06,-2e-06,3e-06,0,1e-06,-1e-06,5e-06
2e-06,1e-06,0,1e-06,-4e-06,1e-06,4e-06,3e-06,2e-06,-1e-06,6e-06,0,3e-06,1e-06,0,3e-06,-1e-06,-1e-06,1e-06,1e-06,-1e-06,0,-3e-06,-3e-06,0,7e-06,-2e-06,0,-1e-06,-1e-06,-1e-06,1e-06,0,-1e-06,-1e-06,0,-1e-06,-4e-06,3e-06,2e-06,-2e-06,0,2e-06,-3e-06,3e-06,3e-06,-1e-06,1e-06,4e-06,-2e-06,-1e-06,-7e-06,-2e-06,-2e-06,3e-06,-1e-06,1e-06,4e-06,-2e-06,1e-06,1.4e-05,-2e-06,2e-06,2e-06,-5e-06,2e-06,-2e-06,1e-06,3e-06,6e-06,-2e-06,3e-06,0,0,-1e-06,-1e-06,0,1e-06,2e-06,2e-06,2e-06,-3e-06,1e-06,1e-06,2e-06,2e-06,-3e-06,-2e-06,1e-06,2e-06,1e-06,2e-06,-2e-06,0,-1e-06,-2e-06,-1e-06,2e-06,-1e-06,-1e-06,0,-5e-06,1e-06,-1e-06,0,-3e-06,2e-06,-2e-06,6e-06,-6e-06,7e-06,-1e-06,1e-06,2e-06,2e-06,3e-06,2e-06,-1e-06,0,-4e-06,1e-06
0,0,1e-06,-2e-06,0,-1e-06,-1e-06,-3e-06,-2e-06,-3e-06,-4e-06,1e-06,1e-06,-1e-06,0,-3e-06,1e-06,1e-06,4e-06,1e-06,0,-1e-06,1e-06,-1e-06,-1e-06,-1.1e-05,-4e-06,0,0,1e-06,0,0,0,4e-06,3e-06,0,0,2e-06,2e-06,-1e-06,3e-06,1e-06,-4e-06,2e-06,-1e-06,-4e-06,4e-06,-3e-06,4e-06,1e-06,1e-06,4e-06,0,-1e-06,-6e-06,3e-06,-1e-06,2e-06,4e-06,0,-1.3e-05,2e-06,-2e-06,-3e-06,5e-06,-3e-06,3e-06,-1e-06,2e-06,7e-06,0,-6e-06,1e-06,2e-06,0,-1e-06,0,-3e-06,-1e-06,0,-1e-06,2e-06,-1e-06,0,-5e-06,-2e-06,5e-06,-1e-06,-3e-06,0,1e-06,-3e-06,6e-06,4e-06,1e-06,2e-06,2e-06,0,0,-1e-06,-3e-06,2e-06,-1e-06,0,1e-06,2e-06,-2e-06,-1e-06,-4e-06,-6e-06,-8e-06,2e-06,2e-06,-1e-06,0,0,-2e-06,-1e-06,-1e-06,0,-3e-06
-1e-06,0,-1e-06,2e-06,1e-06,0,0,0,3e-06,1e-06,2e-06,2e-06,1e-06,1e-06,0,2e-06,-1e-06,1e-06,-1e-06,-3e-06,-1e-06,1e-06,0,2e-06,1e-06,5e-06,6e-06,4e-06,-2e-06,0,-1e-06,-4e-06,1e-06,-7e-06,0,0,2e-06,-5e-06,-1e-06,-1e-06,-3e-06,-1e-06,-1e-06,-3e-06,1e-06,3e-06,-3e-06,0,-2e-06,3e-06,-1e-06,0,0,1e-06,5e-06,1e-06,0,0,-3e-06,0,1.6e-05,-1e-06,-2e-06,-1e-06,-2e-06,2e-06,1e-06,-1e-06,-6e-06,4e-06,-1e-06,4e-06,-1e-06,-2e-06,1e-06,-1e-06,-2e-06,3e-06,-3e-06,0,-1e-06,-4e-06,2e-06,-1e-06,5e-06,0,-4e-06,-3e-06,3e-06,3e-06,-3e-06,3e-06,-6e-06,0,-1e-06,-1e-06,1e-06,2e-06,0,-1e-06,0,2e-06,-1e-06,0,-3e-06,-4e-06,1e-06,-1e-06,1e-06,-3e-06,3e-06,-2e-06,-1e-06,-2e-06,-3e-06,-4e-06,-2e-06,-3e-06,0,-3e-06,3e-06
2e-06,1e-06,0,-2e-06,3e-06,-1e-06,2e-06,1e-06,-3e-06,-1e-06,0,1e-06,-1e-06,0,0,-1e-06,0,0,2e-06,5e-06,-1e-06,-1e-06,-1e-06,0,-2e-06,-4e-06,4e-06,1e-06,0,-2e-06,4e-06,4e-06,-2e-06,1e-06,-3e-06,0,3e-06,3e-06,4e-06,0,2e-06,-1e-06,1e-06,5e-06,-1e-06,-4e-06,-1e-06,-1e-06,-2e-06,1e-06,-2e-06,0,-1e-06,0,-4e-06,-1e-06,2e-06,-4e-06,1e-06,1e-06,-7e-06,1e-06,-1e-06,3e-06,-1e-06,-1e-06,2e-06,0,4e-06,5e-06,1e-06,-5e-06,-1e-06,1e-06,1e-06,0,2e-06,-3e-06,2e-06,0,2e-06,3e-06,-1e-06,1e-06,-2e-06,1e-06,2e-06,4e-06,-1e-06,0,3e-06,-3e-06,1e-06,-5e-06,1e-06,0,-1e-06,-3e-06,-1e-06,1e-06,2e-06,-1e-06,3e-06,0,0,-1e-06,-2e-06,0,3e-06,0,-1e-06,0,1e-06,0,2e-06,3e-06,-1e-06,0,1e-06,1e-06,-2e-06
-1e-06,-1e-06,0,1e-06,4e-06,1e-06,-4e-06,-1e-06,2e-06,-2e-06,-2e-06,-1e-06,-3e-06,0,0,0,-1e-06,1e-06,-2e-06,-5e-06,0,2e-06,1e-06,0,1e-06,-1e-06,-6e-06,-3e-06,0,1e-06,-4e-06,-2e-06,2e-06,-3e-06,4e-06,-1e-06,1e-06,0,-2e-06,1e-06,0,1e-06,-1e-06,-5e-06,1e-06,1e-06,4e-06,1e-06,0,-1e-06,0,0,3e-06,-1e-06,0,-1e-06,-2e-06,-1e-06,-3e-06,-1e-06,-3e-06,-1e-06,3e-06,0,2e-06,1e-06,-2e-06,2e-06,-6e-06,0,2e-06,6e-06,0,0,-2e-06,0,-2e-06,0,2e-06,0,2e-06,0,1e-06,0,0,1e-06,-2e-06,-2e-06,1e-06,0,0,2e-06,3e-06,-1e-06,0,-1e-06,0,2e-06,0,0,-1e-06,-2e-06,1e-06,0,1e-06,-3e-06,0,0,-3e-06,5e-06,3e-06,-1e-06,3e-06,3e-06,0,0,1e-06,1e-06,-1e-06,-3e-06,-2e-06
0,-1e-06,0,-2e-06,1e-06,1e-06,1e-06,1e-06,-2e-06,3e-06,3e-06,0,1e-06,1e-06,0,-1e-06,1e-06,2e-06,-2e-06,4e-06,0,-2e-06,0,-2e-06,-1e-06,5e-06,-2e-06,-2e-06,0,1e-06,5e-06,-1e-06,-3e-06,3e-06,-1e-06,1e-06,0,2e-06,-2e-06,1e-06,-2e-06,1e-06,1e-06,4e-06,0,3e-06,-2e-06,-1e-06,1e-06,-1e-06,0,0,0,-1e-06,2e-06,0,1e-06,-3e-06,2e-06,1e-06,1e-05,0,0,-1e-06,-2e-06,4e-06,-2e-06,0,-3e-06,-3e-06,1e-06,-2e-06,1e-06,-2e-06,0,0,3e-06,0,-2e-06,0,-2e-06,-3e-06,0,-1e-06,3e-06,-2e-06,2e-06,2e-06,-2e-06,3e-06,-2e-06,-2e-06,-3e-06,1e-06,0,-1e-06,-1e-06,-1e-06,1e-06,0,-1e-06,2e-06,-2e-06,1e-06,0,-1e-06,2e-06,0,1e-06,3e-06,-2e-06,1e-06,-6e-06,-2e-06,0,-3e-06,2e-06,0,1e-06,0,3e-06
0,0,0,2e-06,-3e-06,0,1e-06,0,2e-06,0,-3e-06,0,0,-1e-06,0,1e-06,0,1e-06,-1e-06,-4e-06,0,2e-06,0,0,0,-8e-06,6e-06,-2e-06,1e-06,-1e-06,-7e-06,3e-06,4e-06,1e-06,-1e-06,1e-06,-2e-06,-2e-06,3e-06,-2e-06,3e-06,0,1e-06,-3e-06,0,-5e-06,-1e-06,1e-06,0,-1e-06,-1e-06,4e-06,-1e-06,1e-06,-5e-06,0,-1e-06,0,-3e-06,1e-06,-1.5e-05,0,0,-3e-06,0,-1e-06,0,-1e-06,6e-06,-6e-06,0,2e-06,0,2e-06,0,0,-1e-06,-1e-06,1e-06,-1e-06,-1e-06,2e-06,0,1e-06,-4e-06,2e-06,-2e-06,-3e-06,0,-1e-06,2e-06,2e-06,-1e-06,-2e-06,0,1e-06,1e-06,2e-06,1e-06,0,0,-1e-06,0,0,-1e-06,0,-1e-06,-1e-06,1e-06,0,0,-1e-06,5e-06,-2e-06,1e-06,2e-06,0,1e-06,0,-2e-06,0
0,0,0,-1e-06,-3e-06,-1e-06,-1e-06,0,-3e-06,-1e-06,1e-06,1e-06,1e-06,0,0,-1e-06,0,1e-06,-2e-06,1e-06,-1e-06,-2e-06,1e-06,0,0,8e-06,1e-06,2e-06,-1e-06,1e-06,6e-06,-2e-06,-4e-06,0,0,-1e-06,-2e-06,1e-06,-4e-06,0,-2e-06,-1e-06,-2e-06,1e-06,0,6e-06,2e-06,0,-1e-06,0,0,-3e-06,0,2e-06,4e-06,0,1e-06,5e-06,2e-06,-2e-06,1.1e-05,-1e-06,-2e-06,-2e-06,2e-06,3e-06,2e-06,-1e-06,-5e-06,-4e-06,0,-1e-06,-1e-06,-2e-06,1e-06,0,1e-06,1e-06,-1e-06,0,0,-1e-06,-2e-06,-1e-06,4e-06,-1e-06,1e-06,3e-06,0,-1e-06,-1e-06,-1e-06,4e-06,3e-06,0,0,0,0,0,0,2e-06,1e-06,1e-06,0,-1e-06,-2e-06,-1e-06,-3e-06,-3e-06,-5e-06,3e-06,0,2e-06,2e-06,-1e-06,1e-06,0,1e-06,0,0,-2e-06
-1e-06,0,1e-06,1e-06,-2e-06,1e-06,3e-06,-1e-06,3e-06,3e-06,1e-06,1e-06,-1e-06,0,0,1e-06,0,0,1e-06,-4e-06,-1e-06,1e-06,-1e-06,0,0,-3e-06,-3e-06,3e-06,0,0,-3e-06,2e-06,4e-06,-1e-06,2e-06,1e-06,-1e-06,1e-06,3e-06,0,1e-06,1e-06,2e-06,-1e-06,0,-2e-06,2e-06,0,-1e-06,-2e-06,1e-06,0,1e-06,-1e-06,-2e-06,2e-06,-1e-06,0,-2e-06,2e-06,-6e-06,1e-06,-1e-06,3e-06,-2e-06,-1e-06,0,1e-06,2e-06,-2e-06,-1e-06,-4e-06,0,1e-06,0,0,0,0,0,-1e-06,1e-06,-1e-06,2e-06,0,-2e-06,-1e-06,3e-06,-5e-06,1e-06,1e-06,0,0,-5e-06,5e-06,0,0,-1e-06,1e-06,-1e-06,0,-1e-06,1e-06,0,1e-06,0,-1e-06,0,-1e-06,3e-06,-5e-06,-2e-06,-1e-06,-6e-06,1e-06,0,-3e-06,-1e-06,0,0,-2e-06,2e-06
1e-06,1e-06,-1e-06,-1e-06,-1e-06,1e-06,0,1e-06,-3e-06,-1e-06,-2e-06,0,-1e-06,0,0,-1e-06,0,-1e-06,0,4e-06,0,1e-06,0,0,1e-06,-3e-06,-1e-06,1e-06,0,0,1e-06,0,-4e-06,-2e-06,-1e-06,1e-06,0,-3e-06,1e-06,0,1e-06,0,1e-06,0,0,-2e-06,-3e-06,1e-06,2e-06,0,1e-06,2e-06,0,-1e-06,-1e-06,0,0,1e-06,2e-06,-1e-06,-4e-06,-1e-06,5e-06,1e-06,0,-1e-06,1e-06,1e-06,-2e-06,1e-06,0,3e-06,1e-06,0,0,0,-1e-06,-1e-06,1e-06,1e-06,0,0,-1e-06,0,-1e-06,1e-06,-3e-06,4e-06,-1e-06,-2e-06,1e-06,0,3e-06,-2e-06,0,0,0,-2e-06,1e-06,0,-2e-06,-3e-06,0,0,1e-06,-2e-06,1e-06,-1e-06,-1e-06,-2e-06,5e-06,1e-06,2e-06,-2e-06,2e-06,2e-06,0,-1e-06,0,0,-1e-06
0,-1e-06,1e-06,1e-06,2e-06,-1e-06,-1e-06,-1e-06,3e-06,-2e-06,3e-06,-1e-06,1e-06,1e-06,0,0,0,-1e-06,-1e-06,0,0,-2e-06,1e-06,-1e-06,-1e-06,5e-06,0,-2e-06,0,-1e-06,0,-2e-06,4e-06,2e-06,-2e-06,0,1e-06,3e-06,-4e-06,1e-06,-2e-06,0,0,1e-06,-1e-06,3e-06,-1e-06,-1e-06,1e-06,1e-06,0,-2e-06,-1e-06,0,3e-06,-1e-06,0,-2e-06,-2e-06,-1e-06,1.2e-05,1e-06,1e-06,-3e-06,1e-06,1e-06,-1e-06,0,-5e-06,3e-06,-2e-06,-4e-06,0,-1e-06,0,0,1e-06,1e-06,0,0,0,-2e-06,1e-06,0,3e-06,2e-06,2e-06,-3e-06,1e-06,-2e-06,-1e-06,0,2e-06,-3e-06,1e-06,1e-06,-1e-06,1e-06,1e-06,-1e-06,1e-06,0,-1e-06,0,-1e-06,0,0,-2e-06,-2e-06,2e-06,-6e-06,-1e-06,1e-06,0,-3e-06,1e-06,0,-1e-06,0,-2e-06,-1e-06
