-0.000224,-9.7e-05,-8.2e-05,-5e-05,-2e-05,-2.7e-05,-3.8e-05,-3e-05,-2e-05,-4.9e-05,-8.2e-05,-7e-05,-8.7e-05,-0.000117,-8.5e-05,-4e-05,-4.3e-05,-4.9e-05,-4.6e-05,-2.3e-05,-2.6e-05,-2.1e-05,-1.2e-05,-1.6e-05,-8e-06,-7e-06,-1.2e-05,-2.1e-05
-0.000443,-0.000196,-0.000165,-8.9e-05,-4.5e-05,-5.7e-05,-6.5e-05,-5.2e-05,-3.7e-05,-9.3e-05,-0.000171,-0.000154,-0.000176,-0.000246,-0.000208,-8e-05,-7e-05,-7.4e-05,-7.7e-05,-4.9e-05,-4.1e-05,-3.4e-05,-2.9e-05,-4e-05,-2.7e-05,-2.8e-05,-2.9e-05,-3.6e-05
-0.000244,-0.000109,-9.7e-05,-5.9e-05,-4.8e-05,-3.6e-05,-3.5e-05,-5.5e-05,-7.2e-05,-8.3e-05,-0.000122,-0.000117,-0.000107,-0.000146,-0.000145,-5e-05,-3.5e-05,-2.7e-05,-3.1e-05,-3e-05,-1.6e-05,-1.3e-05,-2.2e-05,-2.8e-05,-2.3e-05,-2.4e-05,-1.8e-05,-1.4e-05
0.000118,6.5e-05,5e-05,1.3e-05,-1.1e-05,1.5e-05,2.9e-05,2.3e-05,1.9e-05,4.5e-05,4.9e-05,2.4e-05,5.8e-05,7.3e-05,3e-05,1.6e-05,1.3e-05,2.7e-05,3.3e-05,6e-06,1.5e-05,1.1e-05,-5e-06,-3e-06,-6e-06,-1e-05,-3e-06,-7e-06
0.000312,0.000153,0.000134,5.6e-05,2.1e-05,4e-05,4.8e-05,2.3e-05,1e-05,6.1e-05,0.000129,0.000122,0.000141,0.000186,0.000144,4.4e-05,1.5e-05,2.6e-05,4.6e-05,1.9e-05,1.8e-05,9e-06,1e-06,6e-06,2e-06,-4e-06,0,-2.2e-05
0.000224,8.8e-05,8.4e-05,3.5e-05,1.4e-05,1.4e-05,1.4e-05,-3e-06,-6e-06,1.5e-05,7.7e-05,0.000102,7.8e-05,0.000113,0.000114,1.8e-05,-1.6e-05,-1.2e-05,7e-06,6e-06,-6e-06,-1e-05,-7e-06,-5e-06,-6e-06,-1e-05,-5e-06,-2.1e-05
-3.1e-05,-4.6e-05,-2.2e-05,5e-06,9e-06,-1.7e-05,-2.2e-05,-7e-06,8e-06,-2.1e-05,-2e-05,1.4e-05,-3.8e-05,-3.9e-05,-1e-06,-8e-06,-8e-06,-1.9e-05,-2.8e-05,-7e-06,-1.5e-05,-1.4e-05,-7e-06,-5e-06,-5e-06,-5e-06,-2e-06,1.2e-05
-0.000252,-0.000126,-9.3e-05,-1.8e-05,8e-06,-2.1e-05,-3.4e-05,-2e-05,-2.4e-05,-6.2e-05,-9.5e-05,-7.8e-05,-0.000109,-0.000139,-0.000104,-1.8e-05,2.4e-05,4e-06,-2.4e-05,-2e-06,1e-06,5e-06,8e-06,1.5e-05,9e-06,1e-05,7e-06,3.6e-05
-0.000254,-8.7e-05,-8.7e-05,-3.8e-05,-5e-06,-7e-06,-1.2e-05,1.3e-05,1.6e-05,-2e-06,-6e-05,-0.000101,-7.5e-05,-0.00011,-0.000115,-1.7e-05,2.9e-05,2e-05,5e-06,1e-05,1.8e-05,2e-05,1.7e-05,2.6e-05,1.6e-05,1.8e-05,8e-06,2.2e-05
-1.7e-05,2.6e-05,-1.8e-05,-2.5e-05,-4e-06,1.5e-05,1.5e-05,1.3e-05,1.1e-05,3.3e-05,1.7e-05,-4.4e-05,2e-05,8e-06,-2.3e-05,-4e-06,5e-06,1.4e-05,2e-05,9e-06,1.3e-05,1.3e-05,1.2e-05,1.2e-05,7e-06,1.2e-05,4e-06,-2e-06
0.000251,0.000108,5.2e-05,1.3e-05,4e-06,1.9e-05,2.7e-05,1e-05,1.1e-05,3.4e-05,6.6e-05,4.3e-05,8.6e-05,0.000114,9.3e-05,1.4e-05,-1.9e-05,-5e-06,5e-06,-6e-06,-7e-06,-9e-06,-1e-06,-1.7e-05,-1.4e-05,-2e-06,-1e-06,-8e-06
0.000289,8.8e-05,7e-05,3.3e-05,-5e-06,-3e-06,1.4e-05,1.1e-05,1.9e-05,2e-05,6.1e-05,9.3e-05,7.5e-05,0.000124,0.000129,2.1e-05,-2.3e-05,-1.8e-05,-1.7e-05,-1.7e-05,-1.9e-05,-2e-05,-1.1e-05,-3.3e-05,-2.7e-05,-1.2e-05,-3e-06,-8e-06
4.3e-05,-1.3e-05,3.3e-05,2.6e-05,-1.1e-05,-2.5e-05,-1.2e-05,-1.5e-05,-2.7e-05,-4.1e-05,-1.1e-05,6.2e-05,-4e-06,2e-05,4.4e-05,1.2e-05,-5e-06,-1.5e-05,-1.8e-05,-1.5e-05,-1.2e-05,-9e-06,-9e-06,-2e-05,-1.6e-05,-1.1e-05,-5e-06,-2e-05
-0.00025,-9.8e-05,-3.1e-05,-9e-06,-1.5e-05,-2.8e-05,-2.3e-05,-7e-06,-1.1e-05,-3.5e-05,-5.9e-05,-1.5e-05,-7.8e-05,-0.000105,-9.2e-05,-1.2e-05,8e-06,-4e-06,1e-06,0,2e-06,9e-06,-1e-06,6e-06,5e-06,-6e-06,-8e-06,-2.8e-05
-0.000303,-9.4e-05,-7.4e-05,-4e-05,-2e-05,-1.5e-05,-1.8e-05,-2e-05,-2.7e-05,-1.6e-05,-5.9e-05,-8.2e-05,-8.2e-05,-0.000142,-0.000155,-3.3e-05,3e-06,2e-06,1.3e-05,1.1e-05,8e-06,1.2e-05,0,1.7e-05,1.5e-05,-3e-06,-6e-06,-8e-06
-6.5e-05,-8e-06,-5.3e-05,-2.4e-05,1e-06,1e-05,2e-06,-1.4e-05,-1.3e-05,1e-05,-1.2e-05,-7.3e-05,-1.8e-05,-6e-05,-8.3e-05,-2.1e-05,3e-06,1.2e-05,1.2e-05,1.2e-05,6e-06,4e-06,-1e-06,1.1e-05,1.3e-05,0,0,2.2e-05
0.000211,7.1e-05,4e-06,5e-06,1.8e-05,2e-05,1.6e-05,1.8e-05,3.9e-05,5e-05,5.3e-05,-5e-06,5.5e-05,6.6e-05,5.3e-05,1e-05,6e-06,1.5e-05,0,3e-06,1e-06,-6e-06,-2e-06,-2e-06,1e-06,2e-06,1e-06,2.5e-05
0.000262,7.5e-05,4.8e-05,1.6e-05,1e-05,8e-06,7e-06,1e-05,1.5e-05,1.9e-05,5.7e-05,5.2e-05,7.1e-05,0.000123,0.000128,2.3e-05,1e-06,1e-06,-1.2e-05,-7e-06,-1e-06,-7e-06,-4e-06,-8e-06,-5e-06,4e-06,0,4e-06
8.8e-05,1.8e-05,6.2e-05,2.4e-05,4e-06,-5e-06,1e-06,2.4e-05,2e-05,-3e-06,2.3e-05,7.2e-05,3.5e-05,7.7e-05,9.5e-05,1.8e-05,-1e-06,-8e-06,-5e-06,-4e-06,0,1e-06,-1e-06,-5e-06,-2e-06,9e-06,5e-06,-2e-06
