-0.002856,-0.002461,-0.002731,-0.002925,-0.003503,-0.005502,-0.004736,-0.004355,-0.002764,-0.004438,-0.001737,-0.004115,-0.002838,-0.002401,-0.002718,-0.003928,-0.003542,-0.003813,-0.002316,-0.002299,-0.002212,-0.008549,-0.005637,-0.003124,-0.001892,-0.005209,-0.003314,-0.003473,-0.002291,-0.005818,-0.003513,-0.001945,-0.001449,-0.00216,-0.005128,-0.002882,-0.002367,-0.003198,-0.004674,-0.005521,-0.002955,-0.003224,-0.003393,-0.003911,-0.00322,-0.004027,-0.001388,-0.003525,-0.003292,-0.003229,-0.004629,-0.002634,-0.004991,-0.00471,-0.003249,-0.001017,-0.004865,-0.003052,-0.003358,-0.003074,-0.003914,-0.001888,-0.002962,-0.003529,-0.00092,-0.000931,-0.0014,-0.002584,-0.00211,-0.004651,-0.004884,-0.00362,-0.00311,-0.002559,-0.002819,-0.002791,-0.001944,-0.003299,-0.001464,-0.000841,-0.00251,-0.00155,-0.002783,-0.003229,-0.002512,-0.000334,-0.001788,-0.001681,-0.001108,-0.005886,-0.003606,-0.002338,-0.001966,-0.002149,-0.002443,-0.002498,-0.003201,-0.00142,-0.002809,-0.002395,-0.001798,-0.00278,-0.002332,-0.002136,-0.002246,-0.003192,-0.001615,-0.002172,-0.003339,-0.003204,-0.001753,-0.001732,-0.001497,-0.001408,-0.002174,-0.002637,-0.003599,-0.004351,-0.004385,-0.00298,-0.000205
-0.000617,-0.000561,-0.00081,-0.000325,0.000467,0.001951,0.00076,-0.000754,-0.000322,0.002262,-0.000663,-0.001299,-0.000855,-0.001341,-0.000276,-0.001311,-0.001823,-0.000854,-0.000112,-0.000279,-0.000417,0.005176,0.003536,0.001332,-0.00097,0.001377,0.001265,-0.001601,-0.000735,0.002252,0.000716,-0.001268,-0.000899,0.000228,0.001549,-0.000382,0.000309,-0.000737,-0.000289,0.001905,-0.000433,0.001033,0.000685,0.000377,-0.000619,0.000234,0.001096,0.00059,0.000365,-0.000298,0.00179,0.000714,0.00235,0.001503,0.000672,0.000594,-0.001188,-0.001069,0.000521,0.000469,0.00027,-0.001335,-0.002063,-0.000903,-0.001456,-0.001368,0.00028,-0.001946,-0.000415,0.002946,0.003681,0.001549,0.00079,0.000289,0.000805,-0.001433,-0.00033,-0.000324,-0.000221,-0.001029,0.000237,-0.000952,-0.00096,0.000683,0.001131,0.000429,-0.000397,-0.000336,-0.000645,0.000834,0.000428,0.000825,7.1e-05,-0.000414,0.000293,-0.000345,0.001507,0.000417,0.00035,0.000234,0.000708,-0.000176,-0.000199,-0.000267,-0.000274,-0.000317,0.000547,-0.000718,-0.001254,-0.00079,-0.000877,-0.000393,0.000173,-0.001573,-0.000949,0.00061,0.002718,0.002336,0.002589,-0.000646,-0.000626
0.000282,0.000242,0.000429,0.000948,-0.000461,-0.002216,-0.001075,-0.000177,-0.000432,-0.002078,-0.001179,0.001577,0.000837,0.001188,-0.000484,0.000248,0.001407,-0.000532,-0.000427,0.00077,0.001346,-0.003807,-0.002771,-0.001998,-0.00062,-0.001777,-0.001182,-0.00057,0.000622,-0.001105,-0.000492,0.000119,0.000523,-0.000569,-0.001493,-0.000391,-0.001786,0.000589,0.000312,-0.001001,-0.001261,-0.001845,-0.001293,-0.00151,0.000283,0.000225,-0.002225,-0.000734,-0.000911,-0.000352,-0.002197,-0.001466,-0.001381,-0.00093,-0.000489,-0.00107,4.5e-05,-0.000933,-0.000338,9.7e-05,0.000466,0.00032,0.001588,-0.000207,-0.00107,-0.000277,-0.00096,0.000994,-0.000677,-0.002155,-0.002996,-0.001587,0.000156,-0.001504,-0.001146,0.000427,-0.000349,0.000111,-0.00046,-0.000301,-0.001204,-0.000925,0.000471,-0.000233,-0.000239,-9.2e-05,-0.001301,-0.000979,-0.000127,0.000425,-0.000249,-0.001613,-0.001187,3e-06,-0.00115,-0.000921,-0.001635,-0.000927,-0.000603,-0.000137,-0.000469,-0.000273,-2.3e-05,-0.001609,-0.000312,0.000312,-0.002635,-0.00236,0.000173,1e-05,-0.000258,-0.000176,-0.000369,-0.000476,-0.001454,-0.001738,-0.00259,-0.002415,-0.001432,-3e-05,-0.000923
2.9e-05,0.000152,0.000388,0.00014,0.000274,0.001763,0.001488,0.001405,0.002012,0.001805,0.001933,0.000264,-0.000202,-0.001115,0.001051,0.001309,-0.000433,0.001761,0.000345,-0.000537,0.00011,0.002243,0.002798,0.002207,0.002253,0.001603,0.001919,0.002873,0.000667,0.000997,0.00133,0.000799,-0.000142,0.000219,0.001498,0.001448,0.001959,6.7e-05,1.3e-05,-0.000353,0.001407,0.000884,0.000474,0.002333,0.000776,-0.000342,0.00159,-7.6e-05,0.001062,0.001374,0.001321,0.001462,0.001178,0.000761,0.000288,0.001683,0.002418,0.001817,0.000244,-0.000637,-0.000927,0.000553,0.000854,0.001018,0.001626,0.001477,0.00117,0.000145,0.000757,0.001651,0.001105,0.001275,3.3e-05,0.000155,0.000582,0.000816,0.001594,0.000275,0.000408,0.000721,0.001037,0.001038,0.001024,0.000361,-0.000246,-0.000324,0.001496,0.000897,0.000196,-0.000713,0.000733,0.00123,0.000712,0.000272,0.001874,0.002474,0.001269,0.000947,0.000868,3.1e-05,0.000348,0.000654,0.000387,0.001741,0.000325,-2.1e-05,0.002664,0.003339,0.001346,0.000877,0.001486,0.000889,0.000448,0.001332,0.001736,0.001003,0.001431,0.001983,0.000585,0.0013,0.000803
0.000333,-0.000178,-0.000825,-0.000578,-4e-06,-0.000861,-0.000112,-0.00064,-0.000752,-0.000391,-0.001082,-0.00076,0.000287,0.001129,7.8e-05,0.000488,0.000696,-0.000407,0.000267,0.000384,0.000323,-0.000774,-0.00138,-0.001191,-0.000878,-7.5e-05,-0.000896,-0.002057,-0.00054,-0.000235,-0.001196,-9.5e-05,4e-06,-0.000348,-0.000434,-0.001046,-0.000795,0.000289,0.000103,0.001092,-9.4e-05,0.000329,0.000573,-0.001216,-0.001496,0.000407,-0.000803,0.00106,3.8e-05,0.00028,-0.000882,-0.000874,-0.000185,-0.000253,0.000632,-0.001016,-0.001834,-0.000598,0.000273,0.000477,0.000337,-0.000651,-0.00151,-0.00041,0.000285,-0.000518,-0.000424,0.00011,0.000155,-0.000903,-0.000334,-0.000331,-0.000532,0.000349,-0.000586,-0.000212,-0.000691,0.000347,0.000268,-0.000275,0.000429,0.000608,-0.000958,0.000245,0.000289,0.000551,7.3e-05,0.000964,-0.00012,0.000764,-0.000623,0.000596,0.000321,0.000224,-0.000353,-0.001368,-0.000562,-0.000383,3.5e-05,0.000404,-7.8e-05,-0.000226,0.000206,-0.000113,0.000319,0.000182,-0.000675,-0.001247,-0.000955,-0.001106,-0.000633,-0.000261,0.000347,-0.000909,-0.000195,1e-04,-0.000521,-0.000664,-0.00036,-0.000728,-5.3e-05
0.000104,0.000618,0.000758,0.000195,0.000285,0.000527,0.00041,-0.000287,-0.000268,-0.001379,0.000172,4.2e-05,-0.000383,-0.000125,-0.000265,-0.001576,-0.000926,0.000206,-0.000327,-0.000464,-0.000952,-2.6e-05,-0.000161,0.001077,-0.000208,-0.000598,-0.000351,0.000889,0.000392,-0.000333,0.001041,7e-06,0.000523,0.000401,0.000423,0.001013,0.00028,-0.001396,-0.000496,-0.000291,0.00015,-0.000505,-0.000459,0.000515,0.001436,3e-06,0.00046,6e-06,-0.000407,-0.001177,0.001491,0.001116,-0.000615,0.000245,-0.000834,-0.000129,0.000635,0.000129,-0.000553,0.000303,0.000499,-3.1e-05,0.000398,0.000853,-0.00063,-0.000646,0.000693,-0.000312,0.000272,0.000531,-9.8e-05,-0.000228,-0.00023,0.000135,0.000191,-0.000505,1e-04,-0.000348,4e-05,6.7e-05,-0.000725,-0.000959,-0.000156,-0.000667,-2e-04,-0.000518,-0.000155,-0.001105,-9.1e-05,4.5e-05,0.000999,-0.000209,-1e-04,0.000427,-0.000583,-0.000157,-5.2e-05,0.000513,-0.000206,-0.000324,-0.000158,3.6e-05,-0.000899,-0.000225,-0.000128,0.000122,-0.000696,-0.000215,0.000138,0.000997,0.000221,-8.2e-05,2.6e-05,0.00041,-0.000325,0.000489,0.000785,0.000242,0.000548,-0.000363,-0.000692
-0.000397,-0.001059,-0.000597,-0.000685,-0.00038,-0.000744,-0.000934,9.1e-05,-4.7e-05,0.001179,-0.000319,0.000608,0.000472,-0.000581,-0.000135,0.000743,0.000225,-0.000621,0.000214,0.000106,0.000705,0.000575,0.000398,2.7e-05,-0.000594,-0.000303,-0.000227,-0.000435,-0.00073,0.000127,-0.000558,0.000251,-0.000394,0.000445,-0.00038,-0.000849,-0.000133,0.001058,0.00108,-5.5e-05,-0.000428,0.000135,0.000422,-0.000166,6.3e-05,0.00032,-0.000407,-0.000792,0.000187,0.000967,-0.000692,-0.000943,0.000876,-0.000703,0.000395,0.000172,-0.000215,-0.000196,0.000415,-0.000617,0.000143,0.000573,-0.000106,-0.000365,0.000784,0.000229,-0.000361,6.7e-05,-0.00033,-0.00074,0.000501,0.000251,0.000328,9.7e-05,-3e-06,8.4e-05,-0.000433,0.000271,-0.00062,-0.000372,5.7e-05,0.000841,0.000175,0.000277,9.2e-05,0.000161,-3.9e-05,0.000226,0.000544,-5e-04,-0.000771,-0.000811,-0.000664,-0.001168,-0.000135,0.00012,-4.4e-05,-0.000155,-2.7e-05,-0.000161,-0.00024,-0.000209,0.00017,0.000137,0.000279,0.000123,0.000745,0.000295,-0.000116,-0.000167,-0.000334,-0.000214,-5.3e-05,3.5e-05,-0.000331,0.000303,-0.000157,-0.000193,-0.000216,0.000358,0.000357
8.8e-05,4.7e-05,0.000233,0.000663,6.1e-05,0.000766,-2.3e-05,-0.000159,-5e-05,0.000184,0.000481,-0.000464,-8e-06,0.000175,-0.000115,-0.000214,0.00027,-0.000167,9.4e-05,0.000601,-0.000548,-0.000507,-0.000225,-0.000955,0.000967,0.000487,0.001095,0.000422,0.000276,1.2e-05,-2.4e-05,-0.000235,-0.000713,-0.001129,-0.00029,0.000137,-0.000213,0.000119,-0.001309,0.000225,-1.7e-05,9.7e-05,-0.000695,-0.000684,-0.001207,-0.000823,-0.000202,-9.9e-05,-0.000952,-0.000515,-0.000762,0.000138,-0.000632,0.001196,-0.000104,-7e-06,-0.00029,7.3e-05,-0.000383,0.00053,-0.000467,-0.000501,0.000301,-0.000524,-0.000855,0.000124,-0.000224,-0.000116,-0.000351,0.000357,-5.6e-05,-0.000352,-0.000131,7.6e-05,0.000448,0.000333,0.000353,-0.000159,0.000256,0.000176,0.000469,-0.000489,0.000331,0.000141,8e-05,-0.000109,-0.000145,-9.1e-05,8.3e-05,6.1e-05,-0.00017,7.5e-05,0.00052,0.000406,0.000359,0.000452,0.000119,-0.000232,-0.000172,-0.000113,0.000332,0.000212,0.000373,-8.2e-05,1.6e-05,-0.000513,-0.000171,0.000475,0.001207,-0.000455,-9e-06,0.000509,-0.000295,0.000294,0.000515,-0.001385,-0.00016,1e-05,0.000164,-0.000435,0.000213
2.6e-05,0.000825,-0.00012,6e-06,-5.2e-05,-0.00035,0.000538,0.000802,0.000477,-0.000381,-0.000569,0.000422,-0.000728,0.000363,0.000511,0.000121,-0.000123,0.00054,-0.000166,-0.000602,0.00045,6.7e-05,0.000333,0.000221,-0.000687,-7.4e-05,-0.000434,-0.000814,0.000129,0.000551,0.000187,3.2e-05,0.000336,0.001006,0.000468,-0.000232,0.000261,-0.000293,0.000697,-0.00043,2e-04,9.1e-05,0.000396,0.000977,0.00074,0.000219,0.000553,0.000482,0.001493,0.000248,0.000861,0.000175,-0.000214,-0.00056,9.3e-05,-0.000107,0.000405,-5.9e-05,0.000576,-7e-04,2.2e-05,0.000263,-0.00015,0.00083,0.00033,2.3e-05,5.6e-05,0.000171,0.000408,-0.000191,-4.5e-05,0.000191,-0.000532,4.1e-05,0.000108,-0.000252,4.4e-05,0.000401,0.000241,0.000243,-0.000306,0.000507,0.00015,0.000156,3.9e-05,0.000217,0.00014,0.000647,-0.000552,0.00036,0.000522,0.000488,0.000249,8.7e-05,-0.000127,-0.000636,4.2e-05,-0.000149,0.000301,0.000731,6.2e-05,-0.000239,-5.2e-05,-8.4e-05,-0.000306,0.000392,-0.000129,-0.000404,-0.001448,0.00012,-0.000385,-0.000348,1e-05,-0.000274,9.4e-05,0.000649,-0.000361,0.000137,-4.4e-05,0.000347,-0.000265
1.1e-05,-0.000454,0.000239,-7.7e-05,-4e-06,0.000183,-0.000475,-0.000733,-0.000383,-0.000223,0.000473,-0.000207,0.000746,-1.7e-05,-0.000302,-0.000251,0.000334,0.00031,4.8e-05,0.000262,-0.000369,9e-05,0.000119,2.6e-05,0.000328,-0.000299,-0.00057,0.00081,-0.000139,-0.000864,-0.000469,0,0.000721,-0.000324,2.9e-05,0.000262,-0.000323,-7.2e-05,-0.00034,7e-06,-0.000107,-0.000111,-0.000377,-0.000613,-0.000105,0.000518,-0.000171,-0.000226,-0.000894,-0.000339,-0.000308,-5e-06,3.3e-05,-0.000331,-6.3e-05,0.000116,-1.2e-05,2e-06,-0.000356,0.000453,2.2e-05,0.000277,0.000264,-8.2e-05,0.000114,-0.000161,6.6e-05,-0.000246,-0.000365,0.000106,-0.000387,2e-06,0.000728,-0.000177,-0.00052,0.000605,-0.000222,-0.000887,-0.000239,-0.000142,-7e-05,-0.000383,-5e-04,-0.000384,-0.00034,-0.000195,-0.000396,-0.000524,-0.000171,-0.000378,-0.000383,-0.000366,-0.00022,3.7e-05,-5.8e-05,0.000162,-6.6e-05,5.2e-05,-0.000367,-0.000803,-0.000366,0.000188,-8.2e-05,-0.000278,-0.000211,8.3e-05,0.000264,-0.000138,0.000568,0.000442,0.000723,0.000212,0.000335,2.8e-05,-0.00018,0.000107,0.000134,-7.2e-05,-0.000246,-6.9e-05,0.000113
-0.000231,-6e-06,-0.000154,6e-06,-0.00024,3.8e-05,0.000233,0.00019,-2.9e-05,0.000668,0.00028,-5.7e-05,-5.6e-05,-0.000327,3.9e-05,0.000265,-0.000503,-0.000653,5.5e-05,0.000126,0.000274,0.000218,-0.00057,0.000391,-0.000175,0.000117,0.000491,-0.000164,-6.3e-05,0.000753,0.000307,-0.000166,-0.000524,3.6e-05,-0.000236,-8.2e-05,0.000368,0.000118,-5.8e-05,0.000131,1.2e-05,-0.000179,0.00035,0.000289,1e-05,-0.000562,-2e-04,-0.000208,-0.000273,0.000194,-0.000181,3e-05,0.000171,0.000556,3.3e-05,-4e-05,0.00013,5e-06,1.8e-05,-0.000186,0.000254,-0.000478,-0.00016,-0.000632,-0.000126,5.1e-05,-0.000135,-7.2e-05,0.00018,-2.8e-05,0.00026,9.7e-05,-0.000401,0.000117,0.000123,-0.000317,0.000102,0.000557,0.000195,-0.000195,0.000257,-4.1e-05,0.000349,0.000188,0.000384,0.000265,0.000407,6.1e-05,0.000658,0.000329,0.000149,0.000119,3e-05,-0.000219,-0.000112,-8.7e-05,0.000108,9.4e-05,0.000205,0.000119,0.000169,-0.00038,-0.000203,0.000222,0.000468,-0.000242,-0.000389,0.000252,-0.000258,-0.000211,-0.000453,-0.000225,-0.000141,-0.000133,6.7e-05,-0.000247,0.000404,4e-05,0.000206,-7.2e-05,-0.000268
2e-04,0.000148,0.000175,0.000114,0.000522,-0.000258,9.1e-05,-4.6e-05,0.000119,-0.000244,-0.000572,8.1e-05,-0.000239,0.00027,0.000134,-0.000275,0.00019,0.000394,-7.3e-05,-0.000159,-2.3e-05,-0.000343,0.00037,-0.000147,-0.000198,1.7e-05,0.000125,0.000127,-1.5e-05,-0.00024,6.6e-05,0.000159,2.7e-05,-0.00011,-4.4e-05,0.000215,-0.000241,-0.000114,0.000242,0.000396,4e-06,0.000216,-4.7e-05,-0.000284,5e-05,0.000473,0.000355,0.000272,0.000378,0.000196,0.000139,-0.00022,7.9e-05,-0.000383,-8.4e-05,0.000221,-0.000351,-0.000142,0.000133,1.6e-05,-0.00047,0.000114,-8.9e-05,0.000267,-0.000268,-1.8e-05,-4.5e-05,0.00015,1e-05,0.000114,0.000218,0.000147,0.000335,-1.1e-05,3.8e-05,0.00025,0.00022,-7.8e-05,-6.4e-05,0.000392,2.2e-05,0.000216,-0.000333,-6.9e-05,-0.00013,-0.000319,-0.000219,-0.000126,-0.000336,3.8e-05,-2.9e-05,0.000138,-4.3e-05,0.000382,0.000256,0.000326,-0.000142,-6.8e-05,-0.000276,0.000203,2.6e-05,0.00045,0.000183,0.000177,-2.4e-05,-4.3e-05,0.000141,-0.000129,0.000372,-0.000168,0.000244,0.000188,-0.000165,2.5e-05,1.4e-05,-5.9e-05,-7.3e-05,-8.7e-05,-9.2e-05,0.000142,0.000416
-0.000197,-0.000161,6e-06,-0.000143,-0.000208,0.000137,-0.000132,6.7e-05,5e-06,-0.00016,0.000154,-0.000215,3.8e-05,-8.9e-05,-0.00013,0.000216,3.9e-05,-3.3e-05,0.000152,-0.000277,-8.4e-05,0.000207,-0.000495,-0.000167,0.000141,5.2e-05,-0.000204,-0.000586,4.2e-05,-0.000143,0.000105,-3.1e-05,0.000245,-0.000199,0.000282,-4e-05,0.000109,7.2e-05,-0.000105,-0.000626,-0.000185,-0.000196,-0.000117,0.000265,-0.00025,-0.00039,-0.000294,-4.1e-05,-8.1e-05,-0.000237,9.3e-05,0.000251,-0.00014,6.9e-05,0.000133,-4.9e-05,5.9e-05,7.7e-05,0.000209,0.000115,0.000397,7e-06,0.000156,0.000144,0.000305,6.4e-05,0.00016,3.2e-05,3e-06,-0.000101,-0.000237,-0.000192,-0.000674,-0.000116,-7.5e-05,-0.000444,-0.000287,-1e-04,5.4e-05,-0.000165,-9e-06,1e-06,0.000295,0.000117,-6.5e-05,9.4e-05,0.000124,4.6e-05,-4.7e-05,-0.000366,-0.000132,-0.000102,3.1e-05,-0.000211,1.8e-05,-8.4e-05,0.000167,-7e-05,0.000155,-7.6e-05,0,-0.000272,0.000122,-0.000131,-0.000252,-0.000101,4.5e-05,3.1e-05,-0.000304,-2.1e-05,-1.9e-05,-2.5e-05,8.7e-05,8.9e-05,-9e-05,0.000108,-0.000216,-2.1e-05,1.5e-05,-0.000182,-0.000313
0.000219,9.9e-05,-4.7e-05,3e-05,-1.9e-05,1.2e-05,0.00019,-9e-06,-9.2e-05,7e-05,8.9e-05,0.000164,0.00011,-0.000243,0.000101,8e-06,-3.5e-05,-5.6e-05,-9.7e-05,0.000193,-2.5e-05,1.8e-05,0.00044,3.3e-05,0.000136,-6.9e-05,0.00018,0.000417,2.5e-05,0.00022,-9.4e-05,-6.4e-05,-0.000101,0.000242,-0.000276,-0.000135,-1.2e-05,0.000175,0.000148,0.000285,0.000219,0.000262,-5e-06,4e-05,0.00033,0.000336,8.6e-05,3.3e-05,-1.2e-05,5.2e-05,-5.8e-05,-2.8e-05,4e-06,-2.5e-05,-9.1e-05,-2.6e-05,1.3e-05,4.4e-05,-0.000316,-1.3e-05,-0.000232,-1.8e-05,-0.000137,-8e-05,-2.8e-05,-0.000104,-5.9e-05,-0.000125,1.5e-05,-0.000175,-0.00012,-9.9e-05,0.000567,-7.6e-05,8e-05,6.2e-05,0.000131,-1.9e-05,-0.000113,-3.8e-05,-6.9e-05,-0.000256,-0.000162,-0.000154,2e-06,0.000138,2.3e-05,-3.3e-05,-0.000195,6e-05,0.000137,2e-05,-6.8e-05,6.3e-05,-4.5e-05,-4.3e-05,-3.8e-05,0.000176,4e-06,7e-06,2e-06,0.00014,-8.6e-05,3.6e-05,0.000181,0.000382,2.6e-05,3.8e-05,0.000128,0.000392,-3.1e-05,-0.000111,8.7e-05,-1e-04,-3.9e-05,8.4e-05,-0.000193,0.000124,-4.3e-05,4.8e-05,0.000317
-0.000122,-7.1e-05,-3.7e-05,1.8e-05,0.000192,8.9e-05,-0.000135,2.2e-05,2e-06,4e-06,5.8e-05,-8.6e-05,-0.000237,0.000212,-1e-05,-7.7e-05,-0.000174,-0.000105,-0.000223,0.000174,0.000121,-6.3e-05,1.9e-05,-3.2e-05,-8.4e-05,6.8e-05,-0.000115,2.3e-05,3e-05,-0.000107,-8.9e-05,0.000124,-0.000189,1e-06,8.2e-05,4e-06,3.3e-05,-0.000216,-4.4e-05,3.1e-05,-5.3e-05,-0.00013,0.000157,2.4e-05,-0.000139,-0.000287,0.000206,-3.7e-05,0.000147,-0.000165,-0.000123,-4.1e-05,-1.3e-05,0.000294,-1.8e-05,-0.000116,9.2e-05,1.8e-05,0.000153,6.7e-05,5e-05,0.000131,5.8e-05,-5.8e-05,-5.6e-05,0,-5.3e-05,9.3e-05,-1.1e-05,0.000294,5.1e-05,7.2e-05,-7.4e-05,0.000167,-2.9e-05,0.000127,-9.2e-05,0.000143,3.7e-05,6e-05,-4.4e-05,0.000277,-1e-06,-8.5e-05,6.4e-05,-0.000131,-2.6e-05,0.000124,0.000305,0.000101,-5e-06,1e-06,4.4e-05,-5e-05,-3.6e-05,-2.1e-05,-0.000127,3.6e-05,9.1e-05,5.8e-05,-7.8e-05,-6.9e-05,-1.8e-05,-1.5e-05,-0.000103,-0.000352,-0.000135,-0.000133,-1.1e-05,-0.00023,0,6.1e-05,-5.7e-05,2.1e-05,2.9e-05,9.5e-05,0.000294,-3.2e-05,-3e-05,8.8e-05,-0.000279
0.000102,0.000132,2.9e-05,-5e-05,-0.00013,-6.7e-05,4.9e-05,-9e-05,6.2e-05,-4.2e-05,-0.000148,3.7e-05,0.00032,9.5e-05,-6.4e-05,3.6e-05,0.000185,7.4e-05,0.000262,-0.000148,-0.000218,-1.4e-05,-5e-06,5.8e-05,1.1e-05,-4e-05,5e-06,-0.00023,-4.5e-05,-5.6e-05,0.000149,-8e-05,0.000101,-6.3e-05,5e-05,3.3e-05,-9e-06,0.00011,-5.4e-05,-5.1e-05,-6e-06,2.2e-05,-8.6e-05,-9.2e-05,3.1e-05,0.000173,-0.000191,1.2e-05,-0.000141,0.000193,8.8e-05,2.5e-05,0.000108,-0.000188,7.7e-05,0.000127,-0.000105,-5.3e-05,-5.3e-05,-0.000182,-3.3e-05,-0.000146,-3.1e-05,0.000106,-3.7e-05,1.1e-05,2.6e-05,-2.3e-05,4e-06,-0.00018,9e-05,5e-06,-1.2e-05,-0.000128,-0.000136,-0.000116,-9.8e-05,-0.000108,-3.2e-05,-7e-05,3.8e-05,-0.000166,5e-05,6.1e-05,-5.3e-05,7e-06,-1.9e-05,-3e-05,5e-06,2.7e-05,2.9e-05,-8.5e-05,-1.2e-05,-7e-06,-1.4e-05,-4.9e-05,0.000128,-6.4e-05,-1.2e-05,-6.4e-05,2.7e-05,1.6e-05,1.3e-05,-1.3e-05,1e-05,0.000169,7.8e-05,9.9e-05,-0.000117,-4.5e-05,-2e-05,-2.5e-05,-5.2e-05,-7e-05,1.4e-05,-0.000212,-9.4e-05,-6e-06,0.000122,-2.8e-05,8.2e-05
-6e-05,-5.9e-05,0,3.3e-05,-7.3e-05,2e-05,-9.4e-05,9.8e-05,-1.3e-05,9e-05,1.5e-05,-1.3e-05,-0.000296,-0.000141,7.1e-05,2e-06,-2e-06,0.000101,-9.8e-05,0,0.000203,-1.1e-05,-0.000184,-3.6e-05,2e-06,4.5e-05,7.1e-05,0.000195,1.2e-05,-3.6e-05,-3.1e-05,6.2e-05,7.4e-05,7e-05,-2e-06,1.1e-05,-6.4e-05,-6.8e-05,9.6e-05,-4.8e-05,2.8e-05,3e-06,6e-06,-1.6e-05,-5.8e-05,-7e-05,-2.6e-05,-2e-06,9.2e-05,-5e-05,7.6e-05,3.2e-05,-4.6e-05,-5.2e-05,-0.00011,-4.5e-05,6e-05,6e-06,3e-06,0.000125,1.8e-05,0.000126,-8e-06,1.9e-05,0.000106,-2.2e-05,2.5e-05,3.8e-05,3e-05,1.6e-05,-8e-06,-1.8e-05,-4.7e-05,2.3e-05,0.000129,0.000123,5.3e-05,5.9e-05,2.1e-05,3e-06,2e-05,1.3e-05,-0.000119,4.9e-05,1.8e-05,1.7e-05,3e-06,1.8e-05,-4.4e-05,-1.8e-05,-2.7e-05,2e-05,-2e-05,4.9e-05,-2.1e-05,3.5e-05,-5.8e-05,-3.5e-05,-6e-06,1.1e-05,3.3e-05,7.9e-05,6e-06,3.1e-05,4.2e-05,-8.5e-05,-2.3e-05,-9e-06,0.000233,6e-06,-3.4e-05,5.8e-05,1.9e-05,8.4e-05,2.5e-05,0.000127,-3.6e-05,-6.1e-05,-3.8e-05,2.5e-05,4.2e-05
1.2e-05,-3.2e-05,6e-06,-8e-06,5.2e-05,-9e-06,0.000108,-4.9e-05,-4e-06,-3.4e-05,5e-05,5.4e-05,0.000121,-3.2e-05,-8.9e-05,-3.5e-05,-3.9e-05,-0.000112,2.6e-05,-3.2e-05,-7.9e-05,5e-05,0.000149,8.5e-05,-8.5e-05,2.3e-05,1e-05,-0.000158,-5.8e-05,8.9e-05,-7.3e-05,-1.2e-05,-6.3e-05,-5.5e-05,-1.8e-05,-3.7e-05,2.9e-05,5.7e-05,-6.5e-05,-3e-06,-3.4e-05,-5.5e-05,-4e-05,1.7e-05,5.7e-05,0.000106,9.5e-05,-1.3e-05,-9e-05,-4.8e-05,-0.000112,-5e-06,-2.5e-05,0.000166,0.000103,1.9e-05,1.5e-05,-9e-06,9e-06,-5e-06,-4.7e-05,-8.5e-05,1.9e-05,-0.000101,-8.4e-05,3e-05,-4.8e-05,-6.5e-05,1e-05,7.3e-05,-3.3e-05,8.6e-05,4.1e-05,2e-05,5.6e-05,-0.000139,-2.4e-05,-3.2e-05,1.4e-05,2.4e-05,-3.2e-05,3.8e-05,7.8e-05,1.8e-05,-4e-06,1.3e-05,-2.2e-05,-1e-06,-4.8e-05,-1e-06,-5e-05,0.000124,2.2e-05,-7.4e-05,3.2e-05,3.8e-05,2.1e-05,1.5e-05,-4.8e-05,7.8e-05,-1e-05,-0.000101,-7e-06,-4.2e-05,-1.7e-05,5.5e-05,2.8e-05,-3e-05,-0.000162,7.6e-05,3.4e-05,-2e-05,2.9e-05,-3e-05,9e-06,2.2e-05,-4e-05,1e-06,-3.2e-05,-2.8e-05,-4.5e-05
-3e-06,6.5e-05,4.1e-05,-2e-06,-3e-06,-2.2e-05,-6.9e-05,2.5e-05,1.4e-05,-8.9e-05,-5.5e-05,-5e-05,0,9.2e-05,5.6e-05,7.8e-05,5.7e-05,4.8e-05,-4e-05,4.4e-05,6.2e-05,-2.6e-05,-0.000152,-2.5e-05,7.5e-05,-2.4e-05,-4.7e-05,0.000122,4.5e-05,-6.6e-05,4.8e-05,-3.8e-05,1.6e-05,5.7e-05,-1.7e-05,4.4e-05,-5e-06,-3.5e-05,2e-06,3.4e-05,5e-06,4.3e-05,7e-05,-1.4e-05,-2.7e-05,-9.9e-05,-8.2e-05,-2.6e-05,2.8e-05,1.6e-05,-9e-06,-3.7e-05,-4.6e-05,-0.000132,-6.3e-05,-5e-06,-3.6e-05,1.5e-05,2.6e-05,-2.3e-05,4.1e-05,7e-06,7e-06,2.5e-05,6.6e-05,-2e-06,7e-06,3.6e-05,7e-06,-4.6e-05,-6.8e-05,-5.5e-05,5e-06,-5e-06,-4e-05,6.9e-05,5.4e-05,1.9e-05,-1.2e-05,-9e-06,1.5e-05,-7e-06,4e-06,-4.3e-05,8e-06,6e-06,3e-06,-7e-06,-4e-06,3.7e-05,5.6e-05,-0.000159,-3.6e-05,7.6e-05,1.2e-05,-3.5e-05,5e-06,-2e-06,1.1e-05,-2.4e-05,2.3e-05,8.3e-05,-1.4e-05,8e-06,-2.6e-05,-2.4e-05,5.1e-05,5.6e-05,5.2e-05,3e-06,3.2e-05,-2.5e-05,-1.6e-05,3.2e-05,-2.3e-05,-0.00011,9.1e-05,7e-06,1.5e-05,-3.3e-05,3.9e-05
-1e-05,-3.2e-05,-5.9e-05,-6e-06,8e-06,4.3e-05,2.6e-05,-3.8e-05,-2.8e-05,7.2e-05,6.9e-05,5.3e-05,2.5e-05,-6.6e-05,-2.4e-05,-7.8e-05,-7e-06,-1.4e-05,1.1e-05,2.7e-05,-2.8e-05,-7e-06,0.000207,-2e-05,1.5e-05,5e-06,-5.7e-05,-7.2e-05,2.7e-05,-4.4e-05,-2.4e-05,1.6e-05,1e-06,-7.2e-05,4.6e-05,-4.2e-05,-1.1e-05,5e-05,0,4e-05,-2e-06,7e-06,-2.6e-05,9e-06,5.4e-05,-1e-06,4.4e-05,2e-05,0.000116,-5.3e-05,0.000103,3e-05,8.9e-05,5.9e-05,2.5e-05,-3.4e-05,6.9e-05,-7e-06,-7e-05,1.4e-05,8e-06,6.5e-05,-1.2e-05,1.8e-05,-4.7e-05,-1.4e-05,2.9e-05,-2e-05,5e-06,-2.3e-05,4.8e-05,-1e-05,-7.5e-05,-2.3e-05,0,-4.8e-05,2.1e-05,-7.7e-05,-3e-06,3e-06,-8e-06,-5.8e-05,-4e-05,-2.5e-05,3e-05,-4.4e-05,1.4e-05,-1.1e-05,6.8e-05,-5.8e-05,-5e-05,0.000118,5.2e-05,-4e-05,-1.9e-05,7e-06,-1e-05,1.2e-05,-2.7e-05,-4e-05,-3.5e-05,-6.5e-05,2.3e-05,2.6e-05,6.4e-05,-1e-06,-7.8e-05,-3.7e-05,-4.9e-05,-9.4e-05,-4e-05,2e-05,-1e-06,-2.9e-05,4e-06,2.2e-05,1e-06,2e-06,9e-06,3.3e-05,-2.1e-05
3e-06,1e-06,2.9e-05,-2e-06,9e-06,-4.4e-05,-1.7e-05,-3e-06,1.2e-05,4e-05,-5.1e-05,-2.9e-05,-8.5e-05,-2e-05,-1.5e-05,4e-05,-6e-05,-2e-06,2.7e-05,-2.5e-05,-1.9e-05,2.4e-05,-5.2e-05,-1e-06,-4.2e-05,-1e-05,9e-05,6.6e-05,-9e-06,0.000132,-7e-06,-2.1e-05,-2.2e-05,6.6e-05,7e-06,4.4e-05,4e-06,-7.2e-05,5e-06,-5e-06,6e-06,-1.6e-05,1.1e-05,1.5e-05,-8.9e-05,6.2e-05,2e-05,1.8e-05,-0.000136,5.9e-05,-3.8e-05,-2.2e-05,-4e-05,8e-06,-2e-06,4.6e-05,-6.8e-05,0,2e-05,-1.1e-05,-2.2e-05,-6.8e-05,8e-06,1.3e-05,-2e-06,8e-06,-1.3e-05,1.2e-05,-1.1e-05,3.5e-05,3.1e-05,2.8e-05,4.3e-05,4e-05,3e-06,6.5e-05,-2.2e-05,7.7e-05,-3e-06,2e-05,-2.3e-05,8.4e-05,3.8e-05,4.2e-05,-2.2e-05,5.9e-05,4e-06,3.4e-05,-9e-06,3e-06,2.2e-05,-2e-05,-2.8e-05,1.3e-05,-7e-06,1.8e-05,-1e-05,-1e-05,3e-05,1.3e-05,4e-06,4.1e-05,-1.3e-05,-2.7e-05,-3.2e-05,5.1e-05,2.6e-05,1e-06,3.8e-05,6.2e-05,7.5e-05,-1.4e-05,1.2e-05,1.8e-05,0,2.9e-05,-2.1e-05,2.3e-05,2e-06,-1.1e-05,5e-06
-1.8e-05,1.5e-05,-2e-05,8e-06,4e-06,3.3e-05,4.9e-05,2.1e-05,-2e-06,-3e-05,2.9e-05,2.1e-05,9.6e-05,6.4e-05,4.1e-05,-3.1e-05,2.5e-05,-6e-05,3.4e-05,1e-05,-9e-06,-2.1e-05,-6.9e-05,-1.6e-05,3.7e-05,-5e-06,-4.3e-05,-7.7e-05,-1.2e-05,-9.5e-05,7e-05,-3e-06,1.7e-05,-1.2e-05,-6.1e-05,-4.3e-05,2e-06,5e-05,2e-06,-9.6e-05,1e-05,-1e-06,-1.5e-05,-3.2e-05,9.9e-05,-3.2e-05,-2.1e-05,-1e-06,4.4e-05,-1.5e-05,-4.8e-05,2.4e-05,1.7e-05,-2.7e-05,-1.5e-05,-1.4e-05,7e-05,-3e-06,6e-06,2e-05,1.4e-05,5.4e-05,-7e-06,-5.7e-05,-2.6e-05,-3e-06,-2.2e-05,-9e-06,1e-06,9e-06,1e-05,-4.3e-05,0,0,5e-06,4e-06,2.4e-05,-4.9e-05,-2e-06,-4e-05,3.1e-05,-6.1e-05,-3.5e-05,1e-05,-1.7e-05,-2.8e-05,-5e-06,-3.6e-05,-5.8e-05,4.3e-05,5e-06,-3.3e-05,2e-06,-2e-05,2e-06,-4.2e-05,2.7e-05,4e-06,-1.5e-05,2e-05,5e-06,-1.7e-05,-2e-06,7e-06,1.1e-05,-4.1e-05,1.7e-05,1.9e-05,5e-06,1.6e-05,-8.2e-05,2.8e-05,1.1e-05,-5e-06,0,-1.8e-05,-3.1e-05,7e-06,-1.4e-05,2.8e-05,-2e-06
2.6e-05,-8e-06,2.7e-05,-1.9e-05,0,-3.1e-05,-5.8e-05,1.4e-05,-2e-06,-4.2e-05,-9e-06,7e-06,-8.8e-05,-1.5e-05,-4.9e-05,2.8e-05,2.8e-05,6.6e-05,-7.5e-05,-5e-06,2.7e-05,6e-06,5e-06,2.7e-05,-2.5e-05,1.6e-05,5e-06,6.1e-05,-1.4e-05,2.5e-05,-6.4e-05,9e-06,-2.1e-05,-3.5e-05,4.4e-05,2.7e-05,1.2e-05,-2.7e-05,9e-06,8.6e-05,-4e-05,1.5e-05,1.9e-05,1.7e-05,-5.3e-05,2.7e-05,-8e-06,1e-06,1.7e-05,1.8e-05,3.4e-05,-2.4e-05,-2.7e-05,-2.5e-05,1.9e-05,-1e-05,-5.4e-05,-4e-06,2.9e-05,-1.3e-05,1.8e-05,-2.7e-05,-6e-06,3e-06,4.7e-05,1.7e-05,7e-06,1e-06,6e-06,-4.7e-05,-6.2e-05,4e-06,1.2e-05,-3e-05,1.5e-05,-1.2e-05,-3e-05,2.3e-05,2e-06,2e-05,-6e-06,3.2e-05,3.8e-05,-7e-06,2.2e-05,-2.6e-05,2.9e-05,-1e-06,1e-06,-2.9e-05,-2.5e-05,1.4e-05,7e-06,5e-06,5e-06,4.5e-05,-3.6e-05,1.9e-05,2.4e-05,-2.2e-05,-4e-06,5e-06,1e-06,1.6e-05,-2.7e-05,7e-06,-4e-05,-1.1e-05,-3e-06,-2.5e-05,4.8e-05,-1.6e-05,-2.6e-05,-5e-06,1.2e-05,3.5e-05,2.1e-05,-6e-06,-1.4e-05,-4e-06,3.9e-05
-2.2e-05,-1e-06,-2.8e-05,1.1e-05,-4.2e-05,2.4e-05,3.1e-05,-9e-06,-1e-06,5e-06,-2.2e-05,-2.3e-05,8.7e-05,-1.6e-05,3.7e-05,-2.4e-05,-4e-05,-2.8e-05,3.6e-05,1e-05,-2.3e-05,7e-06,5e-06,-4e-06,-1.1e-05,-6e-06,4.1e-05,7e-06,1.4e-05,5.9e-05,1.2e-05,-2e-06,1.9e-05,4.5e-05,3e-05,-6e-06,-1.7e-05,2.3e-05,-7e-06,8e-06,2.9e-05,-5.4e-05,-1.3e-05,-2e-05,2.8e-05,-7e-05,1.4e-05,-7e-06,-5.3e-05,-1.8e-05,2.3e-05,1.2e-05,1.2e-05,3e-06,-7e-06,3e-06,2.6e-05,4e-06,-1.3e-05,-1.3e-05,-3.1e-05,-1.7e-05,2.8e-05,7e-05,-3.7e-05,-2e-06,2e-05,9e-06,-1.3e-05,4.4e-05,-2e-06,5.1e-05,-6e-06,1.5e-05,8e-06,1.5e-05,-1.2e-05,-1.1e-05,-2e-06,9e-06,-1.6e-05,-2.1e-05,1e-06,1.1e-05,1.1e-05,4.9e-05,-2.9e-05,-1.3e-05,3.3e-05,1.4e-05,3.2e-05,-1.3e-05,-9e-06,1e-06,-1e-06,-3.5e-05,2.3e-05,-1.6e-05,-1.1e-05,7e-06,1.9e-05,-1e-06,1.6e-05,-1.4e-05,2.7e-05,-1.3e-05,3.5e-05,4e-06,-1e-05,-2.2e-05,-2.8e-05,1.8e-05,3e-06,9e-06,-1e-06,-4.7e-05,4.2e-05,6e-06,2.4e-05,-2.4e-05,-8.1e-05
2.6e-05,-8e-06,2e-05,7e-06,3.6e-05,-1.2e-05,-1.5e-05,-1e-06,3e-06,4.2e-05,1.8e-05,1.3e-05,-3.1e-05,-1.4e-05,-1.3e-05,2.4e-05,2.2e-05,2.6e-05,2.4e-05,-2.6e-05,2.7e-05,-1.1e-05,8e-06,-2.2e-05,3.5e-05,2e-06,-7.8e-05,-6.7e-05,2e-06,-6.7e-05,1.2e-05,9e-06,1.9e-05,-4e-05,-6.8e-05,1.1e-05,5e-06,-1e-05,1.8e-05,-3.2e-05,-6e-06,4.8e-05,8e-06,2.1e-05,-3.6e-05,6.8e-05,0,5e-06,5.9e-05,0,-2.7e-05,8e-06,2.4e-05,5.4e-05,-9e-06,3e-06,-1.2e-05,-3e-06,-2e-05,2.3e-05,1.6e-05,3.2e-05,-2.5e-05,-5.7e-05,2.6e-05,-1.5e-05,-1.2e-05,-9e-06,1.4e-05,1e-06,4.3e-05,-2.1e-05,-2.3e-05,6e-06,-2.1e-05,-5.1e-05,3e-05,2.6e-05,9e-06,-8e-06,1.6e-05,2.6e-05,0,4e-06,-2.2e-05,-3.4e-05,5e-06,3e-06,2.9e-05,2.2e-05,-2.8e-05,1.7e-05,8e-06,1.4e-05,-1e-06,-6e-06,4e-06,-1.2e-05,1.7e-05,2.3e-05,-1.4e-05,-2e-06,-8e-06,-6e-06,-1.2e-05,1.8e-05,0,-5e-06,-3e-05,2.3e-05,4e-06,-2.6e-05,7e-06,-1.9e-05,-9e-06,2.9e-05,-2.9e-05,3e-06,-7e-06,5e-06,8.1e-05
-1.7e-05,1e-05,-1.6e-05,-9e-06,6e-06,-9e-06,1.6e-05,-9e-06,-2e-06,1.1e-05,-1.4e-05,-1.1e-05,-1.9e-05,5e-05,-1.3e-05,-2e-05,3e-06,-1.1e-05,-2.8e-05,1.5e-05,-2.1e-05,9e-06,5.5e-05,3.4e-05,-1.5e-05,1e-06,4.5e-05,7.6e-05,-4e-06,3.2e-05,-3e-05,5e-06,-3e-05,1.7e-05,1.7e-05,4e-06,4e-06,0,-1.5e-05,-4.1e-05,-9e-06,0,-1.6e-05,-8e-06,3.6e-05,-3.4e-05,-1.3e-05,-6e-06,-1.4e-05,3e-06,-1.5e-05,-2.6e-05,-1e-05,-6e-05,1.2e-05,2e-06,-2e-06,8e-06,-4e-06,-1.4e-05,1e-06,-2.5e-05,2.7e-05,3e-06,-2e-05,4e-06,-9e-06,1.3e-05,-7e-06,-3.1e-05,2.1e-05,-1e-06,1.8e-05,-1.5e-05,-1e-05,3.9e-05,-2e-05,-3e-05,-8e-06,7e-06,2e-06,-3.5e-05,9e-06,-4e-06,0,1e-05,8e-06,6e-06,-4.8e-05,-4e-05,1.7e-05,-2.3e-05,-4e-06,-4e-06,2e-06,2.7e-05,-1.2e-05,1.4e-05,-7e-06,-1.8e-05,-5e-06,-3e-06,-1e-05,3e-06,1.3e-05,1e-06,-3.1e-05,7e-06,4.7e-05,2.2e-05,6e-06,-8e-06,2e-06,1.4e-05,2e-06,2e-05,-4e-06,4e-06,-5e-06,-5e-06,-4.8e-05
1.5e-05,-2e-06,1.4e-05,1.1e-05,-2.9e-05,2.5e-05,-2.1e-05,4e-06,6e-06,-4.4e-05,3e-05,0,1e-05,-3.8e-05,2.8e-05,1.3e-05,-2e-06,6e-06,1e-06,5e-06,7e-06,-4e-06,-4.3e-05,-2.7e-05,-8e-06,-3e-06,5e-06,-4.8e-05,0,-5e-06,4.6e-05,-4e-06,-9e-06,1.7e-05,3.1e-05,-7e-06,-7e-06,-6e-06,1.4e-05,6.8e-05,1.2e-05,-1.6e-05,1.9e-05,3e-06,-2.2e-05,2.3e-05,1.3e-05,-7e-06,-2.6e-05,4e-06,3.2e-05,3.1e-05,-2.2e-05,3.4e-05,0,0,1.5e-05,-7e-06,1.2e-05,7e-06,-1e-05,1.5e-05,-2.9e-05,3.4e-05,2.9e-05,3e-06,9e-06,-2e-05,-6e-06,2.1e-05,-4.7e-05,2e-05,5e-06,0,1e-06,-3.3e-05,1.5e-05,2.7e-05,4e-06,-1.9e-05,-1e-05,3.1e-05,-2.5e-05,-1.5e-05,1.1e-05,5e-06,-2.6e-05,6e-06,-4e-06,-3e-06,0,3.3e-05,4e-06,-3e-06,-1e-06,-1.9e-05,-3e-06,-5e-06,7e-06,-1.3e-05,5e-06,8e-06,5e-06,6e-06,-1.5e-05,-9e-06,3.2e-05,-2e-06,-1.1e-05,-2.6e-05,7e-06,2.7e-05,-1e-05,-1.5e-05,-2e-06,-4.5e-05,-2.3e-05,-2e-06,-2e-06,9e-06,1.3e-05
-1.3e-05,-2e-06,-5e-06,-3e-06,3.3e-05,-2.2e-05,3.2e-05,3e-06,-1.7e-05,0,-2.8e-05,-4e-06,3.4e-05,-9e-06,-3.1e-05,-1e-05,-6e-06,1.2e-05,1.4e-05,3e-06,0,-8e-06,-3.6e-05,1.6e-05,1.3e-05,3e-06,-3e-06,2.6e-05,-1e-06,1.1e-05,-3.2e-05,4e-06,4.2e-05,-3.3e-05,-2.2e-05,-1e-06,3e-06,3e-06,-1.2e-05,-2.5e-05,-1.3e-05,1.4e-05,-8e-06,4e-06,2e-05,-3.1e-05,-9e-06,-1e-06,3.4e-05,-1e-05,3e-06,-2e-05,8e-06,1.2e-05,-1.2e-05,1e-06,-2.1e-05,0,-1e-06,-1.6e-05,-3e-06,0,6e-06,-1.3e-05,-2.3e-05,-7e-06,2e-06,2.3e-05,1.5e-05,9e-06,-1.1e-05,-3.4e-05,1.7e-05,7e-06,1.4e-05,5.3e-05,6e-06,-1.9e-05,-1e-06,1.1e-05,1e-05,-2e-05,8e-06,-8e-06,-1e-06,-1.3e-05,1.9e-05,7e-06,1.9e-05,1.7e-05,-9e-06,-2e-05,-6e-06,6e-06,0,1.8e-05,1.9e-05,0,-1.3e-05,2.7e-05,1e-06,-8e-06,3e-06,-2e-06,1.1e-05,-4e-06,-1.1e-05,-8e-06,2e-06,-1.9e-05,-5e-06,-1.8e-05,4e-06,1.3e-05,1e-06,1.8e-05,4.2e-05,-1.1e-05,9e-06,1.4e-05,6e-06
8e-06,1e-06,-1e-06,-2e-06,-1.2e-05,1.7e-05,-2.2e-05,-2e-06,1.6e-05,1e-05,1.1e-05,5e-06,-5.4e-05,3.3e-05,2.4e-05,1.3e-05,8e-06,-2.9e-05,-3e-05,-3e-06,-4e-06,1e-05,4.2e-05,-1.5e-05,-1.5e-05,-2e-06,-5e-06,-1.2e-05,-4e-06,-4e-05,-3e-06,1e-06,-2.5e-05,2.9e-05,-6e-06,-1.8e-05,-6e-06,6e-06,1e-05,0,1.8e-05,-1.6e-05,4e-06,-8e-06,-2.9e-05,2.3e-05,1e-06,1.2e-05,-4.5e-05,2e-06,-3.5e-05,1.1e-05,1.2e-05,-3.4e-05,1.6e-05,-7e-06,1.9e-05,0,9e-06,1.9e-05,1.1e-05,-1.3e-05,8e-06,-1.3e-05,3e-05,7e-06,-1e-06,-2.2e-05,-1.9e-05,-2.7e-05,2.3e-05,-2e-06,-3.5e-05,-2e-06,1e-06,-2.2e-05,-1.8e-05,9e-06,-2e-06,1.4e-05,-4e-06,1.7e-05,5e-06,1e-05,-4e-06,1.5e-05,0,0,1.5e-05,2e-06,2.1e-05,8e-06,5e-06,-1.5e-05,2e-06,2e-06,-2.1e-05,2e-06,-3e-06,-7e-06,-1e-06,4e-06,0,-5e-06,-7e-06,4e-06,-1.3e-05,1.2e-05,-1.7e-05,2.4e-05,3e-06,1.9e-05,4e-06,-9e-06,2e-06,8e-06,0,-1e-05,-2e-06,-8e-06,-1.1e-05
-9e-06,4e-06,-2e-06,-1e-06,-1.2e-05,-1.9e-05,1e-05,6e-06,-2e-06,1.2e-05,-2e-06,-9e-06,2.7e-05,-1e-06,-1e-05,-1.5e-05,-1.1e-05,2.1e-05,3.3e-05,-1.5e-05,4e-06,0,-3.4e-05,1e-06,1e-06,1e-06,-1.1e-05,5e-06,4e-06,2.1e-05,2.5e-05,-8e-06,-1.9e-05,-1.7e-05,3e-06,1.2e-05,1e-05,-1e-05,-8e-06,-2e-06,-1.5e-05,-1e-06,-6e-06,8e-06,1.8e-05,-1.1e-05,-1e-06,0,3.7e-05,2e-06,1.5e-05,-6e-06,-3e-06,1.7e-05,-1.4e-05,4e-06,-1.8e-05,1e-06,-1.7e-05,-4e-06,-8e-06,1.4e-05,-1e-05,-4e-06,-3.2e-05,-2e-06,-6e-06,1.9e-05,1.3e-05,1.1e-05,2.2e-05,2.2e-05,5e-06,-1e-06,-9e-06,1e-06,1.1e-05,-1.5e-05,1e-06,-1.3e-05,-6e-06,-1.7e-05,-8e-06,8e-06,0,-1.5e-05,-6e-06,-2e-06,-1.4e-05,-3e-06,-1.9e-05,2e-06,-4e-06,1.4e-05,-1e-06,-2.6e-05,1.4e-05,-7e-06,-9e-06,-1.1e-05,0,6e-06,-6e-06,7e-06,1.1e-05,-4e-06,2.5e-05,-8e-06,-1e-06,1e-05,-2e-06,-1.6e-05,-1e-06,7e-06,2e-06,-1.7e-05,-4.2e-05,-1e-06,-2e-06,1e-06,6e-06
3e-06,-8e-06,3e-06,0,2.2e-05,1.7e-05,-5e-06,-5e-06,-1.4e-05,1.1e-05,-6e-06,1.2e-05,-1e-06,-3.8e-05,-8e-06,2e-05,3e-06,-1.4e-05,-2.1e-05,1e-05,0,-3e-06,4e-05,1.3e-05,1.4e-05,-1e-06,2.6e-05,-1e-05,5e-06,2.9e-05,-2.3e-05,4e-06,3e-05,7e-06,1.7e-05,-9e-06,-8e-06,1.1e-05,3e-06,1e-06,-4e-06,1e-05,7e-06,-6e-06,4e-06,-1e-06,4e-06,-2e-06,0,4e-06,2.5e-05,-2e-06,5e-06,-2e-06,6e-06,5e-06,1.2e-05,0,-8e-06,-5e-06,-4e-06,-5e-06,1.9e-05,1.5e-05,1.5e-05,-2e-06,5e-06,-1.9e-05,-3e-06,1.4e-05,-1.7e-05,-1.4e-05,2e-05,4e-06,-1.1e-05,-1.1e-05,-1.3e-05,1.9e-05,1e-06,-4e-06,1e-05,2.3e-05,3e-06,-1e-05,0,9e-06,1.4e-05,-1e-06,-1.8e-05,2e-06,9e-06,-7e-06,1e-06,-1.3e-05,-3e-06,2e-05,-2e-06,1.3e-05,4e-06,7e-06,0,-1.3e-05,3e-06,1e-06,-1.7e-05,8e-06,-1.4e-05,0,1.8e-05,-1.4e-05,-1.3e-05,4e-06,-7e-06,-4e-06,-4e-06,1.7e-05,1.1e-05,1e-06,1e-06,-9e-06,1e-06
-1e-06,3e-06,2e-06,0,-1.9e-05,-8e-06,-1e-06,4e-06,1.2e-05,-2.8e-05,3e-06,-8e-06,-1.8e-05,2e-05,2e-05,-2.2e-05,4e-06,1.5e-05,-8e-06,2e-06,-1e-06,2e-06,-5e-06,-1.2e-05,-8e-06,1e-06,-3e-05,1.6e-05,0,-6.4e-05,1.9e-05,-7e-06,-3e-06,-1e-06,-1.3e-05,2e-05,5e-06,-1.4e-05,2e-06,0,1.5e-05,2e-06,-6e-06,2e-06,-8e-06,1e-05,1e-06,2e-06,-2.3e-05,-5e-06,-2.6e-05,5e-06,-1.7e-05,1.1e-05,1e-06,-9e-06,-3e-06,-2e-06,1.8e-05,3e-06,1.1e-05,-1e-06,-2.2e-05,-5e-06,-7e-06,3e-06,-1e-06,2e-05,-8e-06,-2.1e-05,-1.8e-05,8e-06,-5e-06,-4e-06,-1e-06,-1.9e-05,0,-1.8e-05,1e-06,9e-06,-3e-06,-2.5e-05,-1.4e-05,7e-06,3e-06,3e-06,-7e-06,1e-06,1.2e-05,6e-06,2e-06,-8e-06,2e-06,1e-05,1e-06,-1.2e-05,-8e-06,-5e-06,2e-06,-2e-06,3e-06,1.8e-05,2e-06,-8e-06,1.1e-05,-4e-06,-8e-06,4e-06,0,-9e-06,2.1e-05,0,4e-06,3e-06,1e-06,-1.4e-05,2.6e-05,2e-06,2e-06,-5e-06,-1e-06
-1e-06,5e-06,-5e-06,2e-06,-2e-06,0,-7e-06,-4e-06,1e-06,-1.6e-05,-3e-06,7e-06,4.2e-05,1.6e-05,-2.3e-05,1.7e-05,-4e-06,-1.9e-05,2.6e-05,5e-06,0,-3e-06,-1.6e-05,8e-06,1e-06,0,3e-05,-1.6e-05,-5e-06,4.4e-05,-4e-06,2e-06,-1.6e-05,-1e-05,-1.9e-05,-1.1e-05,-1e-06,1.3e-05,1e-06,1.4e-05,-1.5e-05,-2e-06,4e-06,0,0,-1e-05,-7e-06,2e-06,2.5e-05,-2e-06,-1e-05,-7e-06,1.1e-05,-2.2e-05,-4e-06,8e-06,-3e-06,3e-06,6e-06,-5e-06,-9e-06,1e-05,1.3e-05,-1.7e-05,1e-05,0,-4e-06,-1.8e-05,1.6e-05,7e-06,4e-06,1.5e-05,-2e-05,1e-06,2.2e-05,2.8e-05,1e-05,1.5e-05,-3e-06,-5e-06,-4e-06,2.5e-05,6e-06,-4e-06,-2e-06,-1.6e-05,-1e-06,-3e-06,9e-06,-1.4e-05,-8e-06,1.1e-05,-2e-06,-4e-06,1e-06,-1e-06,1e-05,-5e-06,1e-05,-4e-06,-5e-06,-1.6e-05,-1e-06,2e-06,-6e-06,2e-06,2.1e-05,-4e-06,-4e-06,1.4e-05,-2.4e-05,0,1e-06,2e-06,1e-06,6e-06,-4e-06,3e-06,-3e-06,8e-06,-1e-05
3e-06,-8e-06,4e-06,0,1.4e-05,8e-06,4e-06,3e-06,-9e-06,3.6e-05,1.5e-05,-1e-06,-4.5e-05,-2.2e-05,1.7e-05,-1.1e-05,6e-06,1.9e-05,-2.2e-05,-8e-06,3e-06,1e-06,-6e-06,-5e-06,3e-06,-1e-06,-9e-06,3e-06,-3e-06,-2e-06,-1.7e-05,1e-06,1.8e-05,2.4e-05,3.2e-05,9e-06,0,-1e-05,-3e-06,-1e-05,8e-06,3e-06,-2e-06,-5e-06,0,9e-06,6e-06,-3e-06,-1.4e-05,5e-06,2.5e-05,9e-06,7e-06,6e-06,1e-06,-4e-06,1e-05,-2e-06,-4e-06,7e-06,2e-06,-1.3e-05,-8e-06,1.9e-05,-2.3e-05,-1e-06,6e-06,1.4e-05,-1.6e-05,9e-06,1.8e-05,-1.7e-05,6e-06,3e-06,3e-06,-2e-05,-8e-06,-9e-06,1e-06,4e-06,5e-06,-2.1e-05,2e-06,-6e-06,-1e-06,2.2e-05,2e-06,0,0,-4e-06,1e-05,2e-06,1e-06,-2e-06,0,2.1e-05,-2e-06,8e-06,1e-06,8e-06,0,1.1e-05,-1e-06,4e-06,3e-06,-1e-06,-1.5e-05,5e-06,-1.5e-05,7e-06,2.3e-05,8e-06,-1e-06,-4e-06,0,1e-05,-2.2e-05,2e-06,1e-06,0,2.3e-05
-2e-06,7e-06,-3e-06,2e-06,-1.3e-05,-1.4e-05,3e-06,-4e-06,4e-06,1.2e-05,-1.7e-05,0,1.6e-05,-1e-06,-7e-06,8e-06,-4e-06,-1.8e-05,4e-06,1e-06,-8e-06,1e-06,1.8e-05,1e-06,-7e-06,1e-06,-2e-05,1.2e-05,5e-06,-2.6e-05,1.9e-05,-1e-06,-9e-06,-2.2e-05,1e-06,-7e-06,0,9e-06,5e-06,-1.4e-05,-7e-06,-1.2e-05,3e-06,4e-06,5e-06,-1.8e-05,-1e-06,-6e-06,-5e-06,-4e-06,1e-06,-1.2e-05,-5e-06,1e-05,3e-06,-1e-06,-1.5e-05,1e-06,-3e-06,-7e-06,3e-06,9e-06,7e-06,4e-06,2.4e-05,1e-06,-2e-06,-1.1e-05,1e-05,-9e-06,4e-06,-2e-06,2.9e-05,-3e-06,-1.5e-05,3.3e-05,1e-05,9e-06,1e-06,2e-06,-3e-06,1.3e-05,1e-06,-7e-06,2e-06,-1.7e-05,-5e-06,-6e-06,-1.3e-05,1.3e-05,-1e-05,-1.1e-05,-1e-06,5e-06,-1e-06,-2.4e-05,-9e-06,-7e-06,5e-06,-1e-06,3e-06,-4e-06,2e-06,-3e-06,0,-2e-06,-3e-06,-5e-06,6e-06,-1.5e-05,-1e-05,-1.3e-05,-3e-06,5e-06,1e-06,-1.8e-05,9e-06,1e-06,-1e-06,6e-06,-2.6e-05
4e-06,-5e-06,2e-06,0,1.2e-05,1.5e-05,-2e-06,5e-06,1e-06,-3.3e-05,7e-06,3e-06,8e-06,1.3e-05,-6e-06,-7e-06,0,1e-05,9e-06,3e-06,1.2e-05,-1e-06,-2.5e-05,5e-06,0,-1e-06,2.7e-05,-2.1e-05,1e-06,3.2e-05,-8e-06,3e-06,-9e-06,3e-06,-3.2e-05,4e-06,-1e-06,-9e-06,-5e-06,1.9e-05,0,5e-06,-5e-06,-3e-06,-5e-06,2e-05,-5e-06,0,2e-05,4e-06,-2.2e-05,1.2e-05,-5e-06,-2.1e-05,-4e-06,6e-06,1.5e-05,-1e-06,-8e-06,5e-06,-1e-06,-2e-06,5e-06,-1.2e-05,-2e-05,-4e-06,-1e-06,1.1e-05,1e-06,0,-1.1e-05,7e-06,-2.5e-05,-3e-06,-5e-06,-2.5e-05,0,-1.1e-05,-2e-06,-1e-05,-2e-06,-1.1e-05,1.1e-05,1.2e-05,2e-06,3e-06,0,3e-06,1e-06,-4e-06,3e-06,1.2e-05,2e-06,-3e-06,0,1.6e-05,1.4e-05,3e-06,-6e-06,-7e-06,-3e-06,-2e-06,0,-1e-06,2e-06,7e-06,1.6e-05,3e-06,1.1e-05,-1e-06,4e-06,1.2e-05,3e-06,-6e-06,0,9e-06,3e-06,3e-06,1e-06,-3e-06,1.7e-05
-4e-06,3e-06,0,-4e-06,-8e-06,-1.1e-05,4e-06,-5e-06,1e-06,-7e-06,-4e-06,-1e-06,-2e-06,4e-06,1.7e-05,8e-06,-2e-06,-6e-06,-2e-06,-4e-06,-1.3e-05,2e-06,3.2e-05,-1.1e-05,4e-06,1e-06,-1.5e-05,1.8e-05,-3e-06,-1.9e-05,-1e-06,1e-06,1.7e-05,1.4e-05,1.5e-05,-4e-06,1e-06,7e-06,5e-06,1e-06,1e-05,6e-06,6e-06,5e-06,4e-06,-7e-06,5e-06,5e-06,-1.7e-05,-3e-06,5e-06,-9e-06,1e-06,2.3e-05,2e-06,-7e-06,-1.4e-05,2e-06,4e-06,-3e-06,-5e-06,-7e-06,-8e-06,3e-06,2.1e-05,2e-06,0,-1e-05,-1.1e-05,8e-06,-1.4e-05,-1.1e-05,-1e-06,5e-06,1.2e-05,1.2e-05,-5e-06,1.3e-05,1e-06,7e-06,5e-06,1.1e-05,-9e-06,1.1e-05,-3e-06,1.1e-05,2e-06,0,1.1e-05,-1e-06,2e-06,0,-3e-06,0,0,-1e-06,-8e-06,1e-06,0,1e-06,2e-06,4e-06,-2e-06,2e-06,-5e-06,-7e-06,-1.6e-05,2e-06,-1e-06,1e-05,-2e-06,-1.4e-05,1e-06,4e-06,0,3e-06,6e-06,2e-06,-1e-06,-6e-06,-7e-06
3e-06,-1e-06,0,4e-06,-4e-06,8e-06,1e-06,6e-06,-3e-06,2e-05,3e-06,0,-3.2e-05,-2e-05,-1.9e-05,-1.1e-05,3e-06,1e-06,-1.4e-05,3e-06,1.3e-05,-1e-06,-1.1e-05,1.1e-05,-5e-06,0,9e-06,-1e-05,-1e-06,1.1e-05,8e-06,-1e-06,-7e-06,-1.7e-05,1.8e-05,-3e-06,-1e-06,-6e-06,-4e-06,-2e-06,-1.6e-05,-1e-06,-4e-06,-2e-06,-1.5e-05,2e-06,0,1e-06,4e-06,3e-06,1.9e-05,5e-06,2e-06,-4e-06,1e-06,3e-06,1.1e-05,0,8e-06,2e-06,7e-06,1.1e-05,3e-06,7e-06,-1.5e-05,1e-06,2e-06,6e-06,1.7e-05,-6e-06,9e-06,5e-06,2e-06,1e-06,6e-06,-1e-05,6e-06,-1.3e-05,0,2e-06,-3e-06,-1.7e-05,3e-06,3e-06,1e-06,-1.6e-05,1e-06,4e-06,1e-06,9e-06,-7e-06,-5e-06,2e-06,2e-06,0,-1.6e-05,-1e-06,-6e-06,-7e-06,7e-06,-1e-06,-5e-06,0,1e-06,8e-06,4e-06,2e-06,-6e-06,-7e-06,3e-06,-1e-06,9e-06,-1e-06,-3e-06,0,-1.1e-05,-1e-06,1e-06,-1e-06,1e-06,-1e-06
-3e-06,-2e-06,1e-06,-5e-06,2e-05,-4e-06,2e-06,-6e-06,-3e-06,1.1e-05,-1e-06,0,5.8e-05,1.1e-05,1.4e-05,1.3e-05,-5e-06,9e-06,2.6e-05,0,-1.2e-05,-1e-06,-6e-06,-6e-06,2e-06,0,-9e-06,-1e-06,1e-06,-1.7e-05,-1.7e-05,3e-06,-8e-06,1e-05,-2.1e-05,4e-06,0,5e-06,2e-06,-1.4e-05,1.3e-05,2e-06,2e-06,2e-06,2.6e-05,-7e-06,-7e-06,-2e-06,0,-2e-06,-1.2e-05,1e-06,6e-06,2e-06,-4e-06,0,-5e-06,-1e-06,-5e-06,0,-1e-06,-1.2e-05,-6e-06,-1e-06,1.5e-05,-3e-06,-1e-06,-3e-06,-1.5e-05,-3e-06,2e-05,1e-05,1.4e-05,-4e-06,-2e-06,0,-8e-06,8e-06,0,-5e-06,-2e-06,2.1e-05,0,-2e-05,0,1.4e-05,0,-1e-06,-9e-06,-8e-06,8e-06,0,0,-1e-06,0,2e-05,7e-06,1e-05,0,-3e-06,1e-06,3e-06,2e-06,-1e-06,-3e-06,-4e-06,1.3e-05,6e-06,-8e-06,-1.2e-05,-1e-06,0,-2e-06,2e-06,0,1.1e-05,-1e-05,0,2e-06,1e-06,5e-06
3e-06,4e-06,-1e-06,2e-06,-2.2e-05,-1e-06,-6e-06,4e-06,1e-05,-1.1e-05,-2e-06,0,-5.8e-05,1e-05,-4e-06,-1.2e-05,5e-06,-1e-05,-2.7e-05,1e-06,1e-05,2e-06,4e-06,2e-06,2e-06,1e-06,5e-06,7e-06,1e-06,2.4e-05,1.3e-05,-3e-06,1.6e-05,-2e-06,-7e-06,-3e-06,2e-06,-3e-06,-1e-06,1.1e-05,-4e-06,-5e-06,-3e-06,0,-2.3e-05,3e-06,7e-06,2e-06,-3e-06,-1e-06,-1.4e-05,-5e-06,-4e-06,-6e-06,4e-06,-1e-06,-1e-06,0,-2e-06,0,-4e-06,6e-06,8e-06,-1.1e-05,-1.7e-05,2e-06,-3e-06,3e-06,7e-06,9e-06,-6e-06,-7e-06,-1.2e-05,0,-5e-06,1.7e-05,3e-06,-8e-06,0,4e-06,5e-06,-2.2e-05,3e-06,1e-06,-1e-06,-6e-06,3e-06,4e-06,-1e-06,-6e-06,-4e-06,1e-06,-1e-06,0,0,-1.5e-05,-7e-06,-5e-06,-4e-06,-6e-06,1e-06,-2e-06,0,-2e-06,2e-06,1e-06,-1.7e-05,-3e-06,8e-06,-2e-06,-2e-06,-6e-06,2e-06,0,0,-8e-06,-4e-06,-3e-06,0,5e-06,-6e-06
-3e-06,-4e-06,2e-06,1e-06,3e-06,7e-06,7e-06,-5e-06,-7e-06,-1.5e-05,8e-06,-3e-06,4.3e-05,-1.2e-05,-5e-06,1.1e-05,1e-06,1.3e-05,1.5e-05,-2e-06,-9e-06,0,-1e-06,2e-06,-3e-06,-1e-06,5e-06,-3e-06,-1e-06,-4e-06,3e-06,1e-06,-1.1e-05,-3e-06,1.8e-05,1e-05,-3e-06,2e-06,2e-06,1e-06,-5e-06,-2e-06,4e-06,-2e-06,1.4e-05,8e-06,-1e-06,3e-06,5e-06,4e-06,1.8e-05,7e-06,-5e-06,-2e-06,-3e-06,2e-06,6e-06,0,-6e-06,2e-06,3e-06,2e-06,0,9e-06,1.9e-05,0,2e-06,-3e-06,4e-06,-6e-06,-2.3e-05,3e-06,-1e-06,3e-06,-6e-06,-1.7e-05,1e-06,8e-06,1e-06,-2e-06,-2e-06,1.8e-05,2e-06,3e-06,1e-06,-4e-06,-1e-06,-4e-06,8e-06,5e-06,0,-2e-06,2e-06,2e-06,0,0,2e-06,-2e-06,3e-06,6e-06,-2e-06,2e-06,-2e-06,2e-06,-2e-06,1e-06,6e-06,-2e-06,9e-06,1.2e-05,6e-06,7e-06,0,0,0,1e-06,1.8e-05,-2e-06,-3e-06,3e-06,7e-06
2e-06,1e-06,-4e-06,-3e-06,1.4e-05,-1.1e-05,-7e-06,5e-06,-5e-06,5e-06,-1e-05,4e-06,-2.3e-05,-5e-06,1.4e-05,-9e-06,-6e-06,-1.5e-05,1e-06,-1e-06,8e-06,-1e-06,-1.2e-05,-8e-06,1e-06,1e-06,-1.9e-05,-5e-06,0,-3.4e-05,-1.2e-05,-2e-06,-8e-06,8e-06,2e-06,-1e-05,4e-06,-1e-06,-3e-06,7e-06,9e-06,1e-06,-3e-06,3e-06,-1.4e-05,-6e-06,-6e-06,-1e-06,-1e-06,-2e-06,5e-06,-8e-06,3e-06,1.3e-05,1e-06,-1e-06,-1e-05,1e-06,1e-06,-2e-06,1e-06,-8e-06,-1e-06,6e-06,-1.5e-05,-1e-06,0,1e-06,-1.3e-05,-3e-06,2e-06,2e-06,-1e-06,-1e-06,3e-06,2.1e-05,-5e-06,-9e-06,1e-06,-3e-06,-2e-06,-1.1e-05,-8e-06,5e-06,0,1.2e-05,-2e-06,3e-06,2e-06,1e-06,6e-06,3e-06,-2e-06,-6e-06,0,1.5e-05,5e-06,6e-06,2e-06,2e-06,2e-06,-2e-06,0,1e-06,0,-3e-06,1e-05,4e-06,-3e-06,0,-9e-06,-8e-06,0,1e-06,0,8e-06,8e-06,0,0,-5e-06,-6e-06
