9.1e-05,9.5e-05,6.8e-05,0.000145,0.000103,6.6e-05,6.7e-05,7.2e-05,0.000103,7.6e-05,4.8e-05,9.1e-05,0.000108,0.000104,0.000138,0.000173,0.000182,0.000104,0.000122,9.4e-05,9.3e-05,9.8e-05,0.000115,0.000148,0.00014,6.7e-05,6.8e-05,8.7e-05,0.000128,9.8e-05,7.8e-05,0.000226,0.000124,8.8e-05,6.6e-05,0.000111,7.8e-05,0.000129,0.000118,9.6e-05,0.000135,6.7e-05,8.6e-05,0.000139,9.4e-05,0.000139,1e-04,0.000167,0.000155,5.7e-05,7.5e-05,9.6e-05,0.000129,0.000143,0.000183,0.00017,9.3e-05,7.3e-05,0.000145,0.000122,0.000113,0.000101,9.8e-05,9.3e-05,0.000108,6.6e-05,9.5e-05,0.000126,8.9e-05,0.000163,0.000118,0.000148,8.7e-05,0.000155,0.000125,5.2e-05,7.5e-05,9.3e-05,0.000101,0.000146,8e-05,5.8e-05,0.000103,8.8e-05,0.000145,0.000113,8.2e-05,3.5e-05,0.000199,0.000237,0.000155,8.6e-05,0.000114,0.000163,0.000141,7e-05,6.3e-05,0.000109,0.000125,0.000118,0.00012,5.6e-05,8.3e-05,7.3e-05,6.9e-05,7.2e-05,4.6e-05,5.7e-05,0.000105,6.3e-05,8.3e-05,6.6e-05,0.000156,9.1e-05,0.00011,7.1e-05,7.7e-05,0.000147,0.000108,7.6e-05,0.000106
-1.3e-05,-4e-05,-4.9e-05,-3.7e-05,-3.9e-05,-1.5e-05,-4.2e-05,-1.7e-05,1.1e-05,8e-06,-5.9e-05,-1.1e-05,1.2e-05,-4e-06,-6.7e-05,-7.8e-05,-3.6e-05,-0.000108,-9.2e-05,-0.000125,-1.2e-05,-1.1e-05,-1.5e-05,9e-06,2.7e-05,-6.7e-05,-4.4e-05,-6.8e-05,-9.8e-05,-5.6e-05,-2.4e-05,-9e-06,8e-06,-1.2e-05,-7.9e-05,-1.7e-05,-1.2e-05,-3.2e-05,-2.9e-05,-4.6e-05,5e-06,-1.4e-05,-4.5e-05,-7.8e-05,-2.6e-05,-4.6e-05,-7e-05,-7.2e-05,-2.3e-05,-4.9e-05,1.3e-05,-3.3e-05,-2.4e-05,4.6e-05,3.8e-05,-4.6e-05,-6.5e-05,-7.5e-05,-2.7e-05,-6.3e-05,-6.5e-05,-8.3e-05,-0.000111,-3.5e-05,1e-06,-1.7e-05,-2.6e-05,-3.6e-05,-7.3e-05,-5.5e-05,-4.6e-05,-5e-05,-4.2e-05,-6.6e-05,-3.7e-05,-8e-06,-4.9e-05,-5.4e-05,-9.3e-05,-2.4e-05,-4.9e-05,-1.2e-05,-1.7e-05,1.3e-05,-4.8e-05,-6.6e-05,-4.7e-05,-8.7e-05,-5e-06,2.4e-05,4e-05,-5.9e-05,-2.3e-05,2.1e-05,1.9e-05,1.2e-05,-2.2e-05,4e-06,-4.5e-05,-4.9e-05,-2.2e-05,-5.6e-05,-6e-05,-6.5e-05,-3.3e-05,-3.1e-05,-4.2e-05,-4.4e-05,-2.9e-05,-0.000102,-3.8e-05,-4.3e-05,1e-05,2.7e-05,-4.4e-05,-0.000114,-7.7e-05,-9.8e-05,-9.1e-05,-8.2e-05,-6.5e-05
-1.8e-05,3.4e-05,2.7e-05,-2.2e-05,-5.4e-05,-5.5e-05,-7.7e-05,-6.4e-05,-3e-05,-1.7e-05,-3.4e-05,5.1e-05,-3.8e-05,-2e-05,-7.4e-05,-0.000116,-3.1e-05,-2.2e-05,-7e-05,-7.8e-05,-5.6e-05,-3.9e-05,-6.4e-05,-6.6e-05,-1.5e-05,-3.6e-05,5e-06,5e-06,-7.5e-05,-6.2e-05,2e-06,-5.1e-05,-1.5e-05,-6e-05,-7.3e-05,-4.9e-05,-3.1e-05,-5.5e-05,-8.4e-05,-0.000104,-4.1e-05,-6e-06,-6.9e-05,-7.1e-05,-2.9e-05,-7e-06,-2.4e-05,-6.2e-05,-4.3e-05,-1.7e-05,-2.6e-05,-9.1e-05,-9.5e-05,-3.6e-05,-3.7e-05,-3.9e-05,-3.8e-05,-3.8e-05,-4e-06,-6.8e-05,-4.2e-05,-4.3e-05,-7.3e-05,-8.2e-05,-4.8e-05,-3.1e-05,-6e-05,-2.4e-05,-6.2e-05,-8.5e-05,-0.000108,-6.3e-05,-3.8e-05,-2.8e-05,9e-06,-2.3e-05,1.5e-05,-2.4e-05,-3.3e-05,-4.3e-05,-9.2e-05,-5e-05,-4.9e-05,-8e-06,-6.7e-05,-7.4e-05,-2.1e-05,-1e-05,-1.7e-05,-7.3e-05,7e-06,2.7e-05,-6e-06,-6.8e-05,2e-06,1e-06,-3.1e-05,-4.5e-05,-5.5e-05,-4.7e-05,-5.5e-05,-5e-05,-5.6e-05,-4.3e-05,-9.8e-05,-7.8e-05,-5.4e-05,-1.8e-05,-6.5e-05,-5.6e-05,-8.1e-05,-5.2e-05,-5.5e-05,-2e-05,-9.8e-05,-9.7e-05,-2.9e-05,-7.7e-05,-8e-05,-3.9e-05,-7.5e-05
2.1e-05,5.8e-05,3.7e-05,4e-06,-2.2e-05,-2e-05,-1.7e-05,-3.5e-05,-1.6e-05,-1.5e-05,3e-05,3.2e-05,-3.2e-05,-1.3e-05,-4e-06,-2.4e-05,2.2e-05,3.1e-05,-4.7e-05,-6e-06,-1.5e-05,-4.5e-05,-2.4e-05,-5.2e-05,6e-06,5.5e-05,1.4e-05,3.1e-05,-1.8e-05,-4.4e-05,-3.3e-05,-2.2e-05,3.9e-05,-2.4e-05,5e-06,1.3e-05,-4.7e-05,-4.3e-05,1e-06,-7.9e-05,-1.7e-05,1.3e-05,-1.9e-05,5e-06,-3.6e-05,-2.8e-05,-7e-06,-3.2e-05,1.2e-05,-3e-06,4.5e-05,-2e-05,-4.1e-05,-3.3e-05,-8.1e-05,2.4e-05,1.3e-05,-1.8e-05,2.2e-05,-5e-06,-1.9e-05,-2e-05,3e-06,-4.8e-05,1.5e-05,-2e-05,-4e-06,-3e-05,-3e-06,1.3e-05,-3.1e-05,-2.1e-05,3.4e-05,-9e-06,1.2e-05,-2.4e-05,1.7e-05,1.1e-05,-2.7e-05,-1.8e-05,-8e-06,-1e-06,-5e-05,1.1e-05,-3.4e-05,-2.5e-05,-1.4e-05,-2e-05,-5.4e-05,-1.2e-05,3.1e-05,1.4e-05,6.7e-05,-4.6e-05,-2e-06,2.3e-05,-1.7e-05,-4e-06,-1.1e-05,1.7e-05,-4.8e-05,-2.2e-05,-1.3e-05,6e-06,4.5e-05,5.9e-05,2.6e-05,-1e-06,-2.5e-05,2.7e-05,-3.5e-05,-1.8e-05,-3.6e-05,7e-06,-7e-05,1.9e-05,7e-06,-6e-05,-1.3e-05,-6e-06,-2.6e-05
2.9e-05,5.9e-05,2.8e-05,5e-05,4.9e-05,4.2e-05,5.1e-05,5e-05,5.6e-05,8.8e-05,6.8e-05,8.7e-05,4e-05,3.3e-05,4.5e-05,7.4e-05,7.9e-05,6.9e-05,3.9e-05,8.4e-05,6.8e-05,2.4e-05,6.1e-05,6.6e-05,0.000105,4e-05,7.6e-05,9e-05,6e-05,5.5e-05,7.2e-05,3.8e-05,7e-05,1.9e-05,4.3e-05,8.8e-05,2.3e-05,4.6e-05,8.8e-05,7.3e-05,9.3e-05,2.6e-05,3.8e-05,5.2e-05,5.6e-05,1.9e-05,7.6e-05,5.5e-05,9.2e-05,5.8e-05,0.000101,7.8e-05,8.2e-05,2e-05,0,7.7e-05,9.5e-05,7.4e-05,7.7e-05,5.4e-05,5.8e-05,6.3e-05,5.7e-05,4.8e-05,4.2e-05,6.7e-05,6.7e-05,6.8e-05,3.9e-05,5.4e-05,6.1e-05,8.3e-05,8.5e-05,3.9e-05,7.5e-05,7e-05,5.1e-05,5.7e-05,5e-05,7.3e-05,0.000104,8.2e-05,6.8e-05,0.000103,6.1e-05,8.2e-05,-3.8e-05,7e-06,5e-06,6e-05,7.5e-05,5e-05,9.1e-05,1.9e-05,3.5e-05,3.5e-05,8.3e-05,7.7e-05,9.8e-05,6.7e-05,5.5e-05,7.5e-05,4e-05,6.3e-05,2.8e-05,5.8e-05,6.5e-05,4.7e-05,1.4e-05,4.5e-05,6.6e-05,7.2e-05,1.6e-05,9.9e-05,4.2e-05,8e-05,0.000102,5e-05,8.1e-05,6.3e-05,4.7e-05
3.7e-05,3e-06,-1e-05,0,3.3e-05,-1.7e-05,1.7e-05,6e-06,3.2e-05,3e-05,-1.6e-05,1.6e-05,-9e-06,-2e-06,6e-06,3.7e-05,5.9e-05,2e-05,8e-06,3.3e-05,2.8e-05,-2.9e-05,2.7e-05,-7e-06,2.8e-05,5.3e-05,3.1e-05,4.1e-05,8e-06,4.5e-05,4.6e-05,-2.2e-05,3e-06,6e-06,-3e-06,1.4e-05,9e-06,-3.3e-05,4e-06,2.4e-05,-1e-06,-7e-06,1e-05,1.1e-05,9e-06,-4e-06,-6e-06,3.3e-05,5.7e-05,3.3e-05,-9e-06,1.1e-05,-9e-06,-3e-06,-4.5e-05,1.7e-05,3.4e-05,2.9e-05,3.1e-05,2.2e-05,8e-06,3.1e-05,1.8e-05,4.7e-05,-1.8e-05,-1e-06,1.5e-05,4.8e-05,-1.3e-05,-1.7e-05,4.3e-05,5e-05,1.3e-05,1.6e-05,8.1e-05,4e-05,2e-06,-1.1e-05,3e-05,3.4e-05,3e-05,2e-06,1.9e-05,2.2e-05,-3.5e-05,-2.4e-05,-2.1e-05,-1.9e-05,-2e-05,3e-06,4.8e-05,-6e-06,2.7e-05,2.4e-05,5.2e-05,7e-06,7e-06,3.9e-05,4.1e-05,-2.3e-05,1e-06,4e-06,2.5e-05,2e-05,3.3e-05,6.9e-05,3.5e-05,-3e-06,4e-06,2e-05,7e-06,2.7e-05,1e-06,3.1e-05,1e-06,-2.6e-05,3.5e-05,2e-06,4.5e-05,4.5e-05,3.2e-05
-1.7e-05,-2.8e-05,-6.9e-05,-3e-05,-2.4e-05,-4.8e-05,5e-06,-3.5e-05,-1.1e-05,-4e-06,-3.6e-05,-2.9e-05,-2.4e-05,-4e-05,-2.8e-05,-2.4e-05,-3e-05,-3.8e-05,-3.9e-05,-2.9e-05,-1.9e-05,-3.7e-05,-1e-06,-3.9e-05,-1.7e-05,-5e-06,-3.9e-05,-1.6e-05,-3.7e-05,-1.2e-05,-1.4e-05,-5.7e-05,-3.8e-05,-1.5e-05,-3.9e-05,-7e-06,-2.5e-05,-2.8e-05,-3.7e-05,-1.6e-05,-3.9e-05,-8.1e-05,-3.6e-05,-5.8e-05,-3.6e-05,-3.9e-05,-4.5e-05,-2.6e-05,-2.8e-05,-3.7e-05,-5e-06,1e-05,-3.6e-05,-4e-06,-6.4e-05,-1.3e-05,-5.4e-05,-2.7e-05,-2.5e-05,-1.2e-05,-4.7e-05,-4.3e-05,-3.4e-05,-1.5e-05,-3.1e-05,-4.5e-05,9e-06,8e-06,-8e-06,-4.5e-05,-2.2e-05,-1.2e-05,-4.1e-05,-4.8e-05,-7e-06,-1.6e-05,-2.6e-05,-2.5e-05,-2.4e-05,-3.1e-05,2e-06,-3.9e-05,1.7e-05,-2.1e-05,-3.3e-05,-6.8e-05,6e-06,2.2e-05,-3e-06,-5.9e-05,-3.2e-05,-6e-05,-4.3e-05,-2.7e-05,9e-06,-3.7e-05,-8e-06,1e-06,1.5e-05,-2.4e-05,-5.6e-05,-1.5e-05,-2.6e-05,-1.7e-05,-5.7e-05,-3.1e-05,-2.4e-05,-2.9e-05,-1.2e-05,-2.4e-05,-3e-05,-4e-06,-2.5e-05,-1.4e-05,-2.4e-05,-4.6e-05,-5.7e-05,-3.8e-05,-3.2e-05,-4.3e-05,-2.1e-05
-3.1e-05,5e-06,-1.9e-05,-8e-06,-4.8e-05,-4.4e-05,-6e-06,-2.8e-05,-2.2e-05,-9e-06,-2.6e-05,-3.3e-05,-2e-05,-4.5e-05,-1.5e-05,-2.7e-05,-4.7e-05,-2.3e-05,-3e-05,-4.3e-05,-1.4e-05,-2.8e-05,-1.5e-05,-4.8e-05,-2.7e-05,-3e-05,-4.9e-05,4e-06,0,-2.3e-05,-1.7e-05,-1.7e-05,-2.3e-05,-4e-05,-1.4e-05,-3.2e-05,-4.4e-05,-3.2e-05,-1.7e-05,-2.5e-05,-2.9e-05,-4.2e-05,-2e-06,-1.6e-05,-5e-06,-2.8e-05,-2.2e-05,-2e-05,-1.6e-05,-2.8e-05,-2.7e-05,-1.1e-05,-3.7e-05,5e-06,-4.2e-05,-4e-05,-2.1e-05,-2.4e-05,-1.7e-05,-9e-06,-4.3e-05,-3.1e-05,-1.3e-05,-1.7e-05,-2.6e-05,-2.2e-05,-8e-06,-3.4e-05,-2.1e-05,-2.1e-05,-5.1e-05,-3.2e-05,-2e-05,-2.4e-05,-2.5e-05,-8e-06,-2.6e-05,-6e-06,-2.5e-05,-2.2e-05,-2e-05,-2.8e-05,-1.8e-05,-8e-06,-2.2e-05,-4.9e-05,2.9e-05,3.6e-05,4.7e-05,-6.6e-05,-3.2e-05,-4.3e-05,3e-06,-3.8e-05,-2.9e-05,-1.8e-05,-1.4e-05,-1e-05,-6e-06,-1.9e-05,-3.4e-05,-3e-05,-1.6e-05,-1.9e-05,-3.4e-05,-2e-05,-2e-06,-8e-06,-3.4e-05,-8e-06,-2.1e-05,-1.1e-05,-2.7e-05,-1.9e-05,-2.8e-05,-3e-05,-3.3e-05,-2.3e-05,-2.8e-05,-3.2e-05,-8e-06
-1.1e-05,-1.2e-05,-9e-06,-1.1e-05,-3.4e-05,-3e-06,1e-06,-1.3e-05,-2.9e-05,0,-1.5e-05,-1.5e-05,-2.2e-05,-2.1e-05,-2.1e-05,-4e-06,-1.8e-05,-8e-06,-1e-05,-7e-06,-7e-06,6e-06,-2e-05,-1.5e-05,-2.3e-05,-2.4e-05,4e-06,-1.3e-05,9e-06,-5e-06,-2.2e-05,-1.2e-05,-9e-06,-2e-06,3e-06,-3e-06,-2.7e-05,-3.3e-05,-2.9e-05,7e-06,-2.1e-05,-2.4e-05,-1.8e-05,-3e-06,1e-06,-2.1e-05,-2e-05,-1e-05,-1.5e-05,-2.1e-05,1e-06,5e-06,-3e-06,-1e-06,-5e-06,-4.5e-05,-2e-06,-1.5e-05,-1.9e-05,-1.1e-05,-1.3e-05,-1.5e-05,-1e-05,-9e-06,1e-05,-1.7e-05,-1e-05,1e-06,-1.9e-05,8e-06,-2.7e-05,-1.9e-05,-7e-06,-1e-06,-2.1e-05,-1.4e-05,-1.5e-05,2e-06,-1.7e-05,-1.4e-05,-1.4e-05,-1e-05,1e-06,-2.5e-05,-5e-06,-1.3e-05,4e-06,-6e-06,-1e-05,-4.5e-05,-3.3e-05,-2.7e-05,-9e-06,-3e-05,-2.7e-05,4e-06,-2.4e-05,-2e-05,-9e-06,-1.7e-05,-1.4e-05,-2.5e-05,-2e-06,0,-4e-06,-1.3e-05,9e-06,-8e-06,-2e-05,-1.7e-05,3e-06,-1.3e-05,-8e-06,-2e-05,-1.7e-05,-3e-06,8e-06,-1.6e-05,-2.8e-05,-2.5e-05,-5e-06
3e-06,2e-05,-1e-06,5e-06,2e-06,2.4e-05,2.1e-05,2.2e-05,8e-06,8e-06,1.8e-05,2.2e-05,0,1.6e-05,-4e-06,1e-06,2.2e-05,8e-06,8e-06,1e-05,1.6e-05,2.7e-05,6e-06,1e-05,5e-06,1.9e-05,-6e-06,2e-05,2.7e-05,1.2e-05,9e-06,3e-06,3e-06,1.1e-05,3.1e-05,1.6e-05,1.2e-05,1e-05,-1e-06,2.7e-05,3.2e-05,2.6e-05,2.4e-05,3.9e-05,1e-05,2.3e-05,-6e-06,1.3e-05,4e-06,1.5e-05,1.4e-05,2.5e-05,2.9e-05,1.6e-05,2.2e-05,-5e-06,8e-06,1.3e-05,2.1e-05,2.1e-05,1e-05,0,1.4e-05,1.4e-05,2.8e-05,-2e-06,3.3e-05,2.4e-05,1.5e-05,2.1e-05,6e-06,2e-06,2.1e-05,1.1e-05,-2e-06,-1e-06,1e-05,4e-06,8e-06,1.4e-05,1.4e-05,2.6e-05,3e-05,1.4e-05,2e-05,3e-05,-5e-06,-1e-06,-2.8e-05,-1.9e-05,3e-06,4e-06,-3e-06,2e-06,-1.2e-05,1.9e-05,-2e-06,3.7e-05,2.6e-05,8e-06,2.3e-05,1.4e-05,2.7e-05,8e-06,4e-06,6e-06,2e-05,9e-06,1.5e-05,3e-06,2.7e-05,1.2e-05,2.3e-05,-8e-06,3.1e-05,3.5e-05,2.6e-05,2.8e-05,7e-06,1.9e-05,2.1e-05
1.1e-05,0,-1.7e-05,-5e-06,-7e-06,-1.7e-05,-4e-06,-1e-06,2e-06,7e-06,-4e-06,-7e-06,1e-06,0,-1.2e-05,-6e-06,1e-05,9e-06,5e-06,1.4e-05,7e-06,5e-06,-1.3e-05,-9e-06,-1e-05,-1e-06,-5e-06,1.1e-05,1.5e-05,-2e-06,1e-05,4e-06,-8e-06,1.6e-05,1.5e-05,0,0,8e-06,-1.4e-05,6e-06,1.4e-05,0,1.3e-05,1.5e-05,4e-06,1.3e-05,1e-06,-4e-06,4e-06,6e-06,-9e-06,1e-06,1.3e-05,-3e-06,5e-06,-2.5e-05,-1e-05,3e-06,1.5e-05,5e-06,3e-06,2e-06,4e-06,4e-06,1e-05,-1.1e-05,1.1e-05,1e-06,-1e-05,-5e-06,-1.5e-05,1.2e-05,9e-06,-1.6e-05,-3e-06,9e-06,-7e-06,-4e-06,-1.4e-05,5e-06,-5e-06,1e-06,3e-06,8e-06,-3e-06,-6e-06,-1e-06,-5e-06,-1.1e-05,-7e-06,-3e-06,-3e-06,-6e-06,-6e-06,-1.2e-05,-3e-06,-1.8e-05,-1e-06,7e-06,-9e-06,1e-06,3e-06,7e-06,4e-06,3e-06,0,1.6e-05,-6e-06,2e-06,3e-06,0,-4e-06,5e-06,-4e-06,9e-06,1.3e-05,-9e-06,1.7e-05,-4e-06,5e-06,1.3e-05
0,-5e-06,-8e-06,-9e-06,-1e-05,-1e-06,-1.2e-05,0,-7e-06,-2e-06,-1.2e-05,-1.1e-05,-6e-06,-7e-06,-2e-05,-1e-05,-3e-06,-8e-06,-6e-06,1e-06,1e-06,-1.2e-05,-1.2e-05,-9e-06,-9e-06,-8e-06,-7e-06,-1.5e-05,0,-1.6e-05,2e-06,-2.4e-05,-2e-06,0,8e-06,-2e-06,0,-1.1e-05,-1.2e-05,-7e-06,-2e-06,-1.1e-05,-8e-06,1e-05,0,-7e-06,-3e-06,-2e-05,-2e-06,-1e-05,-2e-05,-1e-06,1.3e-05,4e-06,-1.6e-05,-8e-06,-5e-06,-2.6e-05,-6e-06,-1e-06,-4e-06,-1.4e-05,-1.5e-05,-4e-06,-1.1e-05,-6e-06,-1.1e-05,4e-06,-2e-06,-1e-06,-2.3e-05,-5e-06,-3e-06,-2.9e-05,-1.4e-05,2e-06,-1.1e-05,-6e-06,-1.5e-05,-1e-06,-8e-06,-1.2e-05,-1e-05,1.1e-05,-9e-06,2e-06,2.1e-05,0,5e-06,1e-06,-1.1e-05,-1.4e-05,-1.7e-05,-1.2e-05,-7e-06,-1.1e-05,-2.5e-05,1e-06,-1e-06,-5e-06,-2e-05,-1.1e-05,-5e-06,-5e-06,-1.8e-05,-1.5e-05,-1e-06,-8e-06,-1e-06,-3e-06,-1.4e-05,-9e-06,-1.9e-05,-6e-06,4e-06,2e-06,0,-1.5e-05,-6e-06,-1.1e-05,-4e-06
-1e-05,-6e-06,-3e-06,0,-2e-06,-1.2e-05,-9e-06,-1e-06,-1e-05,-6e-06,-3e-06,3e-06,-6e-06,-4e-06,-1.1e-05,-7e-06,-4e-06,-5e-06,-1e-06,2e-06,4e-06,-9e-06,-6e-06,-7e-06,-8e-06,-7e-06,-4e-06,-1.5e-05,8e-06,-3e-06,-2e-06,-1.2e-05,5e-06,-1e-06,-4e-06,5e-06,0,-1e-05,-6e-06,5e-06,-6e-06,-3e-06,-8e-06,9e-06,6e-06,-5e-06,-1e-06,-1.1e-05,-3e-06,-2e-06,-1.5e-05,-3e-06,7e-06,1e-06,-1.3e-05,-1e-06,-8e-06,-1.2e-05,-9e-06,-2e-06,1e-06,-1e-05,-1e-05,-3e-06,-1.3e-05,-5e-06,-9e-06,5e-06,-6e-06,-2e-06,-6e-06,-1.1e-05,-8e-06,-1.1e-05,-5e-06,-2e-06,-2e-06,-3e-06,-5e-06,-1.1e-05,-7e-06,-1.5e-05,-1.2e-05,0,-1e-06,7e-06,1.8e-05,5e-06,-1e-06,1.1e-05,3e-06,-7e-06,-7e-06,-1.3e-05,-9e-06,-1.4e-05,-1.2e-05,0,-3e-06,-3e-06,3e-06,-1e-06,-7e-06,0,-2e-06,-8e-06,-5e-06,-2e-06,-1.1e-05,-1e-06,1e-06,-3e-06,-1.1e-05,-2e-06,1e-06,0,1e-05,-7e-06,1e-06,-8e-06,-1.3e-05
-4e-06,-3e-06,-5e-06,3e-06,2e-06,-1e-05,-2e-06,-7e-06,-2e-06,-9e-06,-6e-06,-4e-06,0,-1e-06,-3e-06,-8e-06,2e-06,2e-06,-1e-06,5e-06,0,-3e-06,4e-06,-1.6e-05,2e-06,-5e-06,-1.3e-05,2e-06,3e-06,-1e-06,1e-06,-6e-06,-2e-06,5e-06,-4e-06,0,-4e-06,4e-06,-2e-06,-6e-06,3e-06,-5e-06,-5e-06,0,-4e-06,-1e-06,3e-06,-7e-06,0,3e-06,-1e-05,1e-06,6e-06,-1e-06,-9e-06,8e-06,-1.3e-05,-4e-06,-6e-06,-2e-06,-3e-06,3e-06,-3e-06,-1e-06,-1e-06,2e-06,-1.4e-05,-4e-06,-2e-06,-1.1e-05,2e-06,-7e-06,-2e-06,-2e-06,1e-06,3e-06,-7e-06,0,-1e-06,-4e-06,2e-06,-1.1e-05,-4e-06,3e-06,-7e-06,-4e-06,0,-3e-06,-2e-06,7e-06,-1e-06,-4e-06,-4e-06,1e-06,-3e-06,-5e-06,-8e-06,-9e-06,-3e-06,-4e-06,2e-06,1e-06,-1e-05,-2e-06,-8e-06,1e-06,-3e-06,-4e-06,2e-06,4e-06,-8e-06,2e-06,-1.1e-05,4e-06,3e-06,-4e-06,5e-06,2e-06,3e-06,-8e-06,-4e-06
-1e-06,0,-5e-06,-1e-06,0,7e-06,-3e-06,-7e-06,4e-06,0,-6e-06,-2e-06,1e-06,-2e-06,4e-06,-8e-06,-6e-06,2e-06,0,4e-06,3e-06,2e-06,5e-06,-5e-06,0,7e-06,1e-06,-2e-06,1e-05,-3e-06,2e-06,2e-06,-1e-06,-2e-06,2e-06,4e-06,-4e-06,2e-06,3e-06,-6e-06,-1e-06,-2e-06,1e-06,4e-06,3e-06,0,6e-06,-6e-06,1e-06,-1e-06,5e-06,1e-06,4e-06,-5e-06,-1e-06,1.3e-05,0,-5e-06,0,1e-06,-2e-06,1e-06,-6e-06,-3e-06,2e-06,1e-06,-5e-06,5e-06,-2e-06,6e-06,3e-06,-1e-06,-5e-06,3e-06,7e-06,3e-06,-3e-06,2e-06,-4e-06,0,1e-06,-7e-06,2e-06,3e-06,0,-5e-06,-1e-05,-3e-06,6e-06,-1.7e-05,-1e-06,-2e-06,1e-06,-5e-06,-2e-06,3e-06,5e-06,-6e-06,4e-06,-2e-06,-6e-06,6e-06,-1e-06,4e-06,-2e-06,2e-06,-5e-06,-3e-06,0,2e-06,-3e-06,2e-06,3e-06,9e-06,-1e-06,1e-06,3e-06,3e-06,6e-06,-4e-06,1e-06
-3e-06,3e-06,-3e-06,-1e-06,-3e-06,6e-06,-4e-06,-2e-06,1e-06,-2e-06,1e-06,-2e-06,-2e-06,1e-06,2e-06,-3e-06,-5e-06,-1e-06,0,-1e-06,-3e-06,1e-06,4e-06,-2e-06,1e-06,-1e-06,-1e-06,-3e-06,6e-06,-1e-06,-4e-06,0,0,-3e-06,-5e-06,-1e-06,-4e-06,2e-06,2e-06,-5e-06,-3e-06,-2e-06,-1e-06,0,-2e-06,-1e-06,-1e-06,-3e-06,-3e-06,-3e-06,1e-06,0,6e-06,-3e-06,-2e-06,3e-06,4e-06,-8e-06,-1e-06,0,-2e-06,1e-06,-2e-06,-1e-06,3e-06,0,-7e-06,2e-06,-3e-06,2e-06,-3e-06,-4e-06,0,1e-06,1e-06,-3e-06,-1e-06,2e-06,-2e-06,-3e-06,1e-06,-3e-06,1e-06,-7e-06,0,0,-2e-06,-1e-06,0,-8e-06,-3e-06,-5e-06,-4e-06,-5e-06,-2e-06,6e-06,3e-06,-7e-06,-1e-06,-2e-06,0,-1e-06,-3e-06,0,1e-06,0,-4e-06,-2e-06,-1e-06,1e-06,1e-06,1e-06,-1e-06,0,2e-06,-3e-06,6e-06,-4e-06,3e-06,-3e-06,-1e-06
-3e-06,1e-06,-3e-06,1e-06,-1e-06,1e-06,2e-06,-3e-06,-1e-06,0,-3e-06,-1e-06,0,0,1e-06,-3e-06,-1e-06,0,0,-1e-06,1e-06,3e-06,2e-06,-3e-06,1e-06,1e-06,-4e-06,2e-06,2e-06,2e-06,-2e-06,1e-06,-3e-06,1e-06,-1e-06,1e-06,-3e-06,2e-06,2e-06,0,1e-06,1e-06,-2e-06,-2e-06,1e-06,0,-2e-06,1e-06,-2e-06,1e-06,3e-06,-1e-06,2e-06,0,0,-4e-06,3e-06,1e-06,-2e-06,0,0,2e-06,0,1e-06,4e-06,-4e-06,-5e-06,-1e-06,-2e-06,-2e-06,-1e-06,-4e-06,3e-06,-2e-06,-1e-06,-2e-06,-2e-06,1e-06,0,-1e-06,2e-06,4e-06,-4e-06,-4e-06,1e-06,-2e-06,4e-06,0,-1e-06,-3e-06,1e-06,-3e-06,1e-06,1e-06,1e-06,6e-06,1e-06,-3e-06,-1e-06,-1e-06,7e-06,-2e-06,1e-06,0,-2e-06,3e-06,-2e-06,0,0,0,3e-06,3e-06,1e-06,-2e-06,-1e-06,-1e-06,1e-06,-1e-06,-1e-06,2e-06,-2e-06
0,1e-06,-3e-06,-1e-06,-1e-06,3e-06,1e-06,-3e-06,2e-06,1e-06,0,1e-06,1e-06,1e-06,0,-3e-06,2e-06,1e-06,0,-1e-06,-1e-06,0,1e-06,-2e-06,0,2e-06,-2e-06,4e-06,0,1e-06,1e-06,-2e-06,-1e-06,2e-06,-3e-06,-1e-06,0,-1e-06,-2e-06,-4e-06,3e-06,-1e-06,1e-06,-2e-06,-1e-06,2e-06,-2e-06,0,0,0,2e-06,-1e-06,4e-06,-1e-06,-2e-06,-4e-06,5e-06,1e-06,0,0,0,1e-06,0,-1e-06,1e-06,-2e-06,2e-06,-1e-06,-1e-06,2e-06,1e-06,2e-06,3e-06,-2e-06,-2e-06,1e-06,0,0,-1e-06,1e-06,3e-06,4e-06,1e-06,-1e-06,-1e-06,-1e-06,3e-06,0,2e-06,-4e-06,0,1e-06,0,0,0,1e-06,0,-2e-06,2e-06,-1e-06,-1e-06,1e-06,0,0,2e-06,2e-06,0,-1e-06,1e-06,-1e-06,0,1e-06,0,-1e-06,3e-06,2e-06,-4e-06,2e-06,-2e-06,3e-06,0
2e-06,0,-1e-06,0,-2e-06,-2e-06,0,1e-06,1e-06,2e-06,2e-06,0,-2e-06,0,-1e-06,0,1e-06,0,0,0,1e-06,-3e-06,0,1e-06,-2e-06,1e-06,3e-06,0,1e-06,0,1e-06,-3e-06,1e-06,2e-06,-3e-06,-1e-06,-1e-06,0,-1e-06,-3e-06,0,0,0,1e-06,1e-06,1e-06,-2e-06,0,0,0,-1e-06,-2e-06,2e-06,0,-4e-06,-6e-06,5e-06,-1e-06,2e-06,1e-06,0,-1e-06,-1e-06,0,-2e-06,-4e-06,3e-06,-1e-06,-1e-06,0,-5e-06,2e-06,3e-06,-4e-06,-1e-06,-1e-06,0,-1e-06,-2e-06,2e-06,0,1e-06,0,0,0,2e-06,0,1e-06,0,-2e-06,-1e-06,-1e-06,-1e-06,-3e-06,-1e-06,-3e-06,0,2e-06,0,0,-3e-06,0,2e-06,0,-3e-06,0,-1e-06,-1e-06,0,-1e-06,-1e-06,0,-1e-06,-4e-06,1e-06,1e-06,-4e-06,0,-1e-06,2e-06,0
0,-3e-06,-1e-06,0,-3e-06,-2e-06,1e-06,-2e-06,-2e-06,-1e-06,-3e-06,0,0,-1e-06,-3e-06,0,0,-1e-06,-1e-06,0,-1e-06,-3e-06,-2e-06,-2e-06,-2e-06,-2e-06,-2e-06,0,-2e-06,0,0,-1e-06,0,-2e-06,-4e-06,-1e-06,-1e-06,-1e-06,-3e-06,-1e-06,-1e-06,-4e-06,-2e-06,-2e-06,0,-1e-06,-1e-06,-1e-06,-1e-06,-1e-06,-3e-06,-2e-06,1e-06,0,-5e-06,-6e-06,-2e-06,-2e-06,-1e-06,-1e-06,0,-3e-06,-1e-06,0,-3e-06,-2e-06,-1e-06,-2e-06,-2e-06,-3e-06,-5e-06,0,-2e-06,-2e-06,-4e-06,-1e-06,-1e-06,-1e-06,-2e-06,-1e-06,0,-3e-06,-3e-06,0,-1e-06,0,-4e-06,-1e-06,-3e-06,3e-06,-1e-06,-2e-06,1e-06,-3e-06,0,-4e-06,-5e-06,-2e-06,-1e-06,-1e-06,0,-3e-06,-2e-06,-1e-06,-1e-06,-2e-06,1e-06,0,-1e-06,-1e-06,0,-1e-06,-3e-06,-4e-06,0,-2e-06,-1e-06,-2e-06,-4e-06,-1e-06,-2e-06
-1e-06,-1e-06,-1e-06,0,-1e-06,-3e-06,2e-06,-1e-06,-2e-06,0,-2e-06,1e-06,0,-1e-06,-2e-06,-1e-06,1e-06,0,0,0,0,0,-1e-06,-3e-06,0,0,-2e-06,0,-2e-06,1e-06,0,-2e-06,1e-06,0,-4e-06,1e-06,-1e-06,-2e-06,-2e-06,0,0,-2e-06,-1e-06,0,0,-1e-06,1e-06,0,1e-06,0,0,0,1e-06,0,-2e-06,-1e-06,-3e-06,-1e-06,-1e-06,0,0,-1e-06,-1e-06,0,-1e-06,-1e-06,2e-06,0,0,2e-06,-2e-06,0,-2e-06,0,-2e-06,1e-06,-1e-06,0,-1e-06,0,-1e-06,-2e-06,0,3e-06,-1e-06,0,-2e-06,0,2e-06,1e-06,0,-2e-06,0,0,-1e-06,-2e-06,-4e-06,2e-06,0,0,1e-06,0,0,0,-2e-06,-1e-06,0,-1e-06,-1e-06,0,0,-1e-06,-1e-06,0,0,-1e-06,-1e-06,0,-1e-06,-2e-06,-1e-06
0,0,-2e-06,0,0,1e-06,1e-06,-1e-06,0,0,0,0,-1e-06,0,-1e-06,0,0,0,0,1e-06,0,1e-06,-1e-06,-2e-06,-1e-06,-1e-06,0,0,0,0,1e-06,1e-06,0,1e-06,-3e-06,-1e-06,-1e-06,0,-1e-06,-2e-06,0,-1e-06,0,-1e-06,0,0,1e-06,0,1e-06,0,-1e-06,0,0,0,-1e-06,1e-06,-2e-06,-1e-06,0,0,-1e-06,-1e-06,-1e-06,-1e-06,1e-06,0,1e-06,-1e-06,-1e-06,-1e-06,-1e-06,0,-2e-06,0,0,1e-06,-1e-06,0,-2e-06,0,-1e-06,-3e-06,1e-06,2e-06,0,-1e-06,1e-06,1e-06,0,-1e-06,1e-06,-1e-06,0,-1e-06,-1e-06,1e-06,-2e-06,0,0,0,-1e-06,1e-06,0,0,-1e-06,-1e-06,1e-06,0,0,0,0,-1e-06,1e-06,1e-06,1e-06,-2e-06,1e-06,0,1e-06,-1e-06,0
0,1e-06,-2e-06,0,-1e-06,2e-06,1e-06,-1e-06,0,0,-3e-06,-1e-06,0,0,-1e-06,-1e-06,-1e-06,0,0,0,0,1e-06,0,-1e-06,0,0,0,1e-06,-2e-06,-1e-06,0,-1e-06,0,-1e-06,-2e-06,1e-06,-2e-06,1e-06,-1e-06,-1e-06,0,0,0,-1e-06,0,0,1e-06,-1e-06,0,0,1e-06,0,-1e-06,0,-1e-06,3e-06,-2e-06,-1e-06,0,0,-1e-06,-1e-06,-1e-06,0,2e-06,0,1e-06,0,-1e-06,0,-2e-06,-1e-06,-1e-06,-1e-06,1e-06,0,-1e-06,0,-2e-06,0,-1e-06,0,1e-06,-1e-06,0,-1e-06,1e-06,0,-1e-06,0,-1e-06,-2e-06,-1e-06,-2e-06,-1e-06,3e-06,-3e-06,1e-06,0,-1e-06,-1e-06,0,0,0,0,-1e-06,0,-1e-06,0,1e-06,0,-1e-06,0,1e-06,-1e-06,-1e-06,2e-06,1e-06,1e-06,-2e-06,1e-06
0,1e-06,-2e-06,0,-1e-06,0,0,-1e-06,0,0,0,0,0,0,-1e-06,0,-1e-06,0,0,0,0,0,0,-1e-06,1e-06,0,-2e-06,-2e-06,-1e-06,0,0,0,0,0,-1e-06,0,-1e-06,-1e-06,0,1e-06,0,0,0,-1e-06,0,0,0,-1e-06,0,0,0,0,-1e-06,0,-2e-06,3e-06,-1e-06,-2e-06,0,0,0,0,-1e-06,1e-06,1e-06,0,2e-06,1e-06,-1e-06,1e-06,-1e-06,-1e-06,0,-1e-06,1e-06,0,0,0,-1e-06,0,-1e-06,1e-06,0,0,0,0,-1e-06,0,0,-1e-06,0,-1e-06,0,-2e-06,-1e-06,2e-06,-1e-06,0,0,0,1e-06,0,1e-06,0,-1e-06,0,1e-06,0,-1e-06,0,1e-06,0,0,2e-06,1e-06,0,2e-06,-1e-06,1e-06,-1e-06,0
0,1e-06,-1e-06,0,0,0,0,-1e-06,0,0,1e-06,0,-1e-06,0,-1e-06,-1e-06,0,0,0,0,0,0,0,-1e-06,1e-06,-1e-06,-1e-06,0,-1e-06,0,0,-1e-06,0,0,-1e-06,0,-1e-06,0,1e-06,1e-06,0,0,0,-1e-06,0,0,0,0,0,0,0,0,0,0,-1e-06,1e-06,1e-06,-1e-06,0,0,0,0,-1e-06,0,0,-1e-06,0,0,-1e-06,-1e-06,0,0,2e-06,-1e-06,1e-06,0,0,0,-1e-06,0,0,2e-06,0,-1e-06,0,0,-2e-06,0,1e-06,-2e-06,0,-1e-06,-1e-06,0,0,0,0,0,0,0,1e-06,0,0,0,1e-06,1e-06,1e-06,0,0,1e-06,0,0,-1e-06,2e-06,0,0,-1e-06,0,1e-06,0,0
0,-1e-06,-1e-06,0,0,1e-06,-1e-06,0,0,0,-1e-06,0,0,0,0,-1e-06,0,0,0,-1e-06,0,-1e-06,1e-06,0,0,2e-06,1e-06,-1e-06,-1e-06,-1e-06,0,0,0,0,0,0,0,0,0,-1e-06,0,0,0,0,0,0,-1e-06,-1e-06,0,0,-1e-06,0,-1e-06,0,-2e-06,1e-06,2e-06,-1e-06,0,0,0,0,-1e-06,0,-1e-06,-1e-06,0,0,-1e-06,1e-06,0,0,1e-06,0,1e-06,-1e-06,0,0,-1e-06,0,1e-06,0,0,-1e-06,-1e-06,-1e-06,-1e-06,0,-1e-06,-1e-06,0,0,0,-1e-06,0,-2e-06,0,0,0,0,-1e-06,0,0,0,-1e-06,1e-06,1e-06,0,0,0,-1e-06,1e-06,0,0,0,0,-1e-06,0,1e-06,1e-06,0
0,0,0,0,-1e-06,-2e-06,-1e-06,0,0,0,0,1e-06,0,0,0,-1e-06,0,0,0,0,0,-1e-06,0,0,0,0,0,0,-1e-06,0,0,-1e-06,0,0,0,0,-1e-06,0,0,1e-06,0,-1e-06,0,0,0,0,0,-1e-06,0,0,0,0,0,0,-2e-06,-1e-06,0,-2e-06,0,0,0,0,0,0,-1e-06,-1e-06,0,0,-1e-06,0,-1e-06,0,0,0,0,0,0,0,-1e-06,0,0,-1e-06,0,0,0,1e-06,1e-06,0,0,0,0,-1e-06,0,-1e-06,0,-2e-06,1e-06,0,0,0,-1e-06,0,-1e-06,0,0,1e-06,0,0,0,0,0,1e-06,0,-1e-06,0,0,0,0,0,0,0
0,-1e-06,0,0,-1e-06,0,-1e-06,0,0,0,-1e-06,0,0,0,0,-1e-06,0,0,0,0,0,0,0,-2e-06,0,0,-1e-06,-1e-06,-1e-06,0,0,0,0,0,0,0,-1e-06,0,0,1e-06,0,-1e-06,0,0,0,0,0,0,0,0,0,0,-1e-06,0,-1e-06,-2e-06,0,-1e-06,0,0,0,0,-1e-06,0,0,-1e-06,-1e-06,0,-1e-06,-1e-06,-1e-06,0,-1e-06,0,-1e-06,0,0,0,-1e-06,0,1e-06,-2e-06,0,1e-06,0,0,1e-06,0,1e-06,1e-06,0,-1e-06,0,-1e-06,0,0,1e-06,0,0,0,1e-06,-1e-06,0,0,-1e-06,1e-06,0,0,0,0,0,1e-06,0,-1e-06,0,0,-1e-06,0,-1e-06,0,0
0,0,-1e-06,0,-1e-06,1e-06,-1e-06,-1e-06,0,0,-2e-06,0,0,0,0,-1e-06,0,0,0,0,0,0,0,0,0,0,1e-06,1e-06,-1e-06,0,0,0,0,0,1e-06,0,-1e-06,0,0,0,0,-1e-06,0,0,0,0,0,0,0,0,1e-06,0,0,0,0,-2e-06,1e-06,0,0,0,0,0,-1e-06,0,1e-06,-1e-06,-1e-06,0,-1e-06,1e-06,-1e-06,0,-1e-06,0,-1e-06,0,0,0,-1e-06,0,1e-06,-1e-06,0,1e-06,0,-1e-06,0,0,0,0,0,-1e-06,0,0,0,2e-06,0,0,0,0,0,0,-1e-06,0,0,0,-1e-06,0,0,0,0,1e-06,0,-2e-06,0,-1e-06,-1e-06,0,-1e-06,0,0
0,0,-1e-06,0,0,0,-1e-06,0,0,0,0,0,0,0,0,0,0,0,0,0,0,0,0,0,0,0,0,0,-1e-06,0,0,0,0,0,1e-06,0,-1e-06,0,-1e-06,-1e-06,0,0,0,0,0,0,0,0,0,0,0,0,-1e-06,0,-1e-06,-1e-06,0,0,0,0,0,0,0,0,1e-06,0,0,0,0,0,-1e-06,0,-1e-06,0,-1e-06,0,0,0,-1e-06,0,0,0,1e-06,1e-06,0,0,-1e-06,0,0,0,0,-1e-06,0,-1e-06,0,2e-06,-1e-06,0,0,0,-2e-06,0,0,0,0,0,0,0,0,0,0,0,0,-1e-06,0,0,1e-06,0,-1e-06,-1e-06,0
0,1e-06,-1e-06,0,0,0,0,-1e-06,0,0,0,-1e-06,0,0,0,0,0,0,0,0,0,0,0,-1e-06,0,0,-1e-06,1e-06,0,0,0,0,0,0,1e-06,0,-1e-06,0,0,0,0,0,0,0,0,0,0,0,0,0,0,0,0,0,-1e-06,0,-1e-06,-1e-06,0,0,0,0,0,0,0,0,-1e-06,0,-1e-06,-1e-06,-1e-06,0,0,-1e-06,-1e-06,0,0,0,-1e-06,0,0,1e-06,0,1e-06,0,0,0,0,0,0,0,-1e-06,0,-1e-06,0,1e-06,-1e-06,-1e-06,0,0,0,0,0,0,-1e-06,0,-1e-06,0,0,0,0,0,0,0,0,0,1e-06,0,0,0,0
0,0,-1e-06,0,0,0,0,-1e-06,0,0,0,0,0,0,0,0,0,0,0,0,0,0,0,-1e-06,0,0,0,0,0,0,0,0,0,0,1e-06,0,-1e-06,0,0,0,0,0,0,0,0,0,0,0,0,0,0,0,-1e-06,0,-1e-06,1e-06,0,0,0,0,0,0,0,0,0,0,0,0,0,1e-06,-1e-06,0,1e-06,0,0,0,0,0,-1e-06,0,0,1e-06,0,-1e-06,0,0,1e-06,0,0,0,0,0,0,0,0,-1e-06,-2e-06,0,0,0,1e-06,0,0,0,0,-1e-06,-1e-06,0,0,0,0,-1e-06,0,1e-06,0,0,0,0,0,0,0
0,0,-1e-06,0,0,0,0,0,0,0,1e-06,0,0,0,0,0,0,0,0,0,0,0,0,0,0,-1e-06,0,0,0,0,0,0,0,0,1e-06,0,-1e-06,0,0,0,0,0,0,0,0,0,0,0,0,0,0,0,0,0,-1e-06,2e-06,0,0,0,0,0,0,0,0,-1e-06,0,0,0,-1e-06,-1e-06,-1e-06,0,1e-06,0,0,0,0,0,-1e-06,0,0,0,0,0,0,0,1e-06,0,0,-1e-06,0,-1e-06,0,0,0,-2e-06,-1e-06,0,0,0,-1e-06,0,0,0,-1e-06,0,0,0,0,0,0,-1e-06,0,1e-06,0,0,0,0,0,0,0
0,0,0,0,0,0,0,0,0,0,-1e-06,0,0,0,0,0,0,0,0,0,0,0,0,-1e-06,0,0,0,0,0,0,0,0,0,0,1e-06,0,-1e-06,0,0,0,0,0,0,0,0,0,0,0,0,0,0,0,0,0,-1e-06,1e-06,-1e-06,-1e-06,0,0,0,0,0,0,0,0,0,0,-1e-06,0,-1e-06,0,0,0,1e-06,0,0,0,-1e-06,0,0,0,0,0,0,0,0,0,0,0,0,0,0,-1e-06,0,-1e-06,-1e-06,0,0,0,-1e-06,0,0,0,0,0,0,0,0,0,0,0,0,1e-06,0,0,0,0,1e-06,0,0
0,0,0,0,0,0,1e-06,0,0,0,-1e-06,0,0,0,0,0,0,0,0,0,0,0,0,-1e-06,0,0,0,0,0,0,0,0,0,0,0,0,-1e-06,0,0,0,0,-1e-06,0,0,0,0,0,0,0,0,0,0,0,0,-1e-06,1e-06,0,-1e-06,0,0,0,0,-1e-06,0,0,0,0,0,0,1e-06,-1e-06,0,-1e-06,0,1e-06,0,0,0,-1e-06,0,0,-1e-06,0,-1e-06,0,0,0,0,0,0,0,-1e-06,0,-1e-06,0,0,0,0,0,0,0,0,0,0,0,0,0,0,0,0,0,0,0,0,0,0,0,0,0,0,0
0,0,0,0,0,1e-06,1e-06,0,0,0,0,0,0,0,0,0,0,0,0,0,0,0,0,0,0,0,0,0,0,0,0,0,0,0,0,0,-1e-06,0,0,0,0,0,0,0,0,0,0,0,0,0,0,0,0,0,-1e-06,0,0,-1e-06,0,0,0,0,0,0,0,0,0,0,0,-1e-06,-1e-06,0,-1e-06,0,0,0,0,0,-1e-06,0,0,-1e-06,0,0,0,0,0,0,0,0,0,0,0,0,0,2e-06,1e-06,0,0,0,1e-06,0,0,0,0,0,0,0,0,0,0,0,0,0,0,0,-1e-06,0,0,0,0
0,0,0,0,0,0,0,0,0,0,-1e-06,0,0,0,0,0,0,0,0,0,0,0,0,0,0,0,0,-1e-06,0,0,0,0,0,0,0,0,0,0,0,0,0,0,0,0,0,0,0,0,0,0,0,0,0,0,-1e-06,-1e-06,0,-1e-06,0,0,0,0,0,0,0,0,0,0,0,0,-1e-06,0,-1e-06,0,0,0,0,0,-1e-06,0,0,-1e-06,0,0,0,0,0,0,0,0,0,-1e-06,0,0,0,1e-06,1e-06,0,0,0,-1e-06,0,0,0,0,0,0,0,0,0,0,0,0,-1e-06,0,0,0,0,0,0,0
0,0,-1e-06,0,0,0,0,-1e-06,0,0,0,0,0,0,0,0,0,0,0,0,0,0,0,-1e-06,0,0,0,0,0,0,0,0,0,0,0,0,-1e-06,0,0,0,0,0,0,0,0,0,0,0,0,0,0,0,0,0,-1e-06,-1e-06,0,-1e-06,0,0,0,0,0,0,0,0,0,0,0,0,-1e-06,0,0,0,-1e-06,0,0,0,-1e-06,0,0,0,0,0,0,0,0,0,0,0,0,0,0,0,0,0,1e-06,0,0,0,-1e-06,0,0,0,0,0,0,0,0,0,0,1e-06,0,-1e-06,0,0,0,0,-1e-06,0,0
0,0,-1e-06,0,0,0,0,0,0,0,1e-06,0,0,0,0,0,0,0,0,0,0,0,0,0,0,0,0,0,0,0,0,0,0,0,0,0,-1e-06,0,0,0,0,0,0,0,0,0,0,0,0,0,0,0,0,0,-1e-06,-1e-06,1e-06,-1e-06,0,0,0,0,0,0,0,0,0,0,0,-1e-06,-1e-06,0,1e-06,0,-1e-06,0,0,0,0,0,0,1e-06,0,0,0,0,0,0,0,0,0,-1e-06,0,-1e-06,0,-1e-06,1e-06,0,0,0,1e-06,0,0,0,0,0,0,0,0,0,0,0,0,-1e-06,0,0,0,0,0,0,0
0,0,0,0,0,0,0,0,0,0,0,0,0,0,0,0,0,0,0,0,0,0,0,0,0,0,0,0,0,0,0,0,0,0,-1e-06,0,-1e-06,0,0,0,0,0,0,0,0,0,0,0,0,0,0,0,0,0,-1e-06,0,0,-1e-06,0,0,0,0,0,0,0,0,0,0,0,1e-06,-1e-06,0,1e-06,0,0,0,0,0,-1e-06,0,0,1e-06,0,0,0,0,0,0,0,0,0,0,0,0,0,-1e-06,0,0,0,0,0,0,0,0,0,0,0,0,0,0,0,0,0,0,0,0,0,0,0,0,0
0,0,0,0,0,0,0,0,0,0,0,0,0,0,0,0,0,0,0,0,0,0,0,0,0,0,-1e-06,0,0,0,0,0,0,0,-1e-06,0,-1e-06,0,0,0,0,0,0,0,0,0,0,0,0,0,0,0,0,0,-1e-06,0,0,0,0,0,0,0,0,0,0,0,0,0,0,0,-1e-06,0,0,0,0,0,0,0,-1e-06,0,0,0,0,0,0,0,0,0,0,0,0,0,0,0,0,-1e-06,-1e-06,0,0,0,-1e-06,0,0,0,0,0,0,0,0,0,0,0,0,0,0,0,0,0,0,0,0
0,0,0,0,0,0,0,0,0,0,0,0,0,0,0,0,0,0,0,0,0,0,0,0,0,0,0,1e-06,0,0,0,0,0,0,-1e-06,0,-1e-06,0,0,0,0,0,0,0,0,0,0,0,0,0,0,0,0,0,-1e-06,1e-06,0,0,0,0,0,0,0,0,0,0,0,0,0,-1e-06,-1e-06,0,-1e-06,0,0,0,0,0,-1e-06,0,0,-1e-06,0,0,0,0,0,0,0,0,0,0,0,0,0,1e-06,-1e-06,0,0,0,0,0,0,0,0,0,0,0,0,0,0,0,0,1e-06,0,0,0,0,0,0,0
