0.015441,0.01428,0.01488,0.016313,0.016123,0.014698,0.014748,0.014346,0.013519,0.014679,0.014297,0.011789,0.010367,0.009539,0.009699,0.009985,0.011136,0.010598,0.008537,0.009046,0.009483,0.008872,0.008804,0.008972,0.007714,0.006901,0.007346,0.007532
0.02002,0.018934,0.019863,0.02161,0.021058,0.019103,0.019087,0.018534,0.017515,0.019172,0.018633,0.015182,0.013297,0.012178,0.012444,0.012851,0.014424,0.013619,0.01074,0.011547,0.012316,0.011401,0.011069,0.011314,0.009836,0.008902,0.009365,0.009396
0.028359,0.027734,0.029037,0.031083,0.029871,0.027045,0.026943,0.026113,0.024589,0.026901,0.026197,0.021213,0.018517,0.017023,0.017428,0.017891,0.020121,0.019008,0.014798,0.015894,0.017239,0.015989,0.01525,0.015497,0.013579,0.012539,0.013088,0.012881
0.036631,0.037545,0.037963,0.039242,0.037472,0.034393,0.034484,0.033726,0.031127,0.032433,0.031894,0.026797,0.023548,0.021708,0.021761,0.021966,0.024487,0.023761,0.019305,0.019849,0.021277,0.020333,0.019412,0.019061,0.016558,0.0158,0.016883,0.016964
0.046218,0.049898,0.047549,0.047149,0.046807,0.04547,0.046334,0.045087,0.039052,0.036195,0.036374,0.034551,0.031202,0.027195,0.025363,0.025593,0.027993,0.028617,0.026257,0.025359,0.025612,0.025571,0.024602,0.022757,0.019876,0.01967,0.021649,0.022826
0.065218,0.072793,0.066724,0.064669,0.067036,0.069108,0.071946,0.068834,0.055765,0.046323,0.047172,0.050391,0.047082,0.037995,0.032256,0.033129,0.036364,0.039298,0.040399,0.03831,0.037027,0.03688,0.034016,0.030657,0.028378,0.028319,0.031357,0.0343
0.094685,0.107996,0.099112,0.095362,0.099457,0.103748,0.109355,0.104468,0.082994,0.067576,0.068543,0.074069,0.07059,0.056203,0.045875,0.047505,0.053989,0.060084,0.062847,0.059502,0.057673,0.057043,0.050174,0.044811,0.043394,0.043431,0.048338,0.05331
0.121867,0.141142,0.132166,0.127687,0.132842,0.137643,0.144204,0.138048,0.111213,0.092582,0.093734,0.09898,0.095559,0.07768,0.063629,0.065848,0.076833,0.086036,0.08887,0.083943,0.081447,0.080903,0.069664,0.062436,0.0617,0.060965,0.068164,0.075643
0.136308,0.156316,0.15016,0.146008,0.151033,0.155344,0.158375,0.150246,0.125173,0.110001,0.113367,0.116256,0.113626,0.095982,0.08035,0.083093,0.097844,0.10785,0.109128,0.103381,0.099584,0.0996,0.086108,0.077962,0.076846,0.074569,0.083131,0.092667
0.137635,0.150393,0.150873,0.147132,0.150664,0.157411,0.152137,0.138037,0.121103,0.115461,0.123771,0.124293,0.121368,0.107127,0.092489,0.096112,0.1123,0.118756,0.116729,0.11281,0.107825,0.106877,0.093676,0.084997,0.082869,0.079785,0.086793,0.09791
0.131013,0.139783,0.150083,0.143793,0.146784,0.162563,0.150966,0.126248,0.110764,0.1109,0.123816,0.125383,0.121085,0.113496,0.10463,0.106571,0.118137,0.119887,0.117784,0.120792,0.115424,0.109175,0.094294,0.083846,0.083808,0.083242,0.085509,0.093666
0.125849,0.142104,0.158374,0.146191,0.147338,0.165355,0.15255,0.128005,0.108018,0.105355,0.122536,0.127469,0.122297,0.123352,0.12388,0.117932,0.117421,0.115573,0.113568,0.127848,0.128866,0.1185,0.098648,0.084336,0.089763,0.095122,0.092768,0.091362
0.12162,0.14128,0.155266,0.147597,0.148378,0.157011,0.151913,0.137178,0.11503,0.109455,0.120836,0.122797,0.121807,0.129793,0.135254,0.119628,0.110259,0.110161,0.108071,0.130614,0.140359,0.130661,0.108783,0.091129,0.097512,0.105973,0.10517,0.097539
0.109154,0.125915,0.133365,0.138765,0.142525,0.145297,0.155027,0.147088,0.121973,0.114895,0.117891,0.111064,0.112106,0.121721,0.12662,0.110498,0.102688,0.110083,0.106776,0.120348,0.129037,0.125834,0.1108,0.092703,0.09596,0.10453,0.110173,0.105401
0.091421,0.102995,0.104922,0.118945,0.125482,0.123541,0.13766,0.135852,0.114911,0.106984,0.109643,0.099395,0.095372,0.101724,0.104896,0.097422,0.094548,0.104046,0.098864,0.096379,0.098958,0.106713,0.104668,0.086447,0.085003,0.093383,0.103189,0.10551
0.093247,0.08506,0.082416,0.096655,0.10471,0.098361,0.100429,0.10313,0.097547,0.090023,0.090029,0.090476,0.093281,0.097141,0.094411,0.090383,0.089112,0.09651,0.092767,0.080378,0.076302,0.087098,0.095082,0.077874,0.070243,0.078266,0.086402,0.09175
0.129419,0.094336,0.083145,0.095354,0.105632,0.095845,0.082687,0.092273,0.108273,0.100723,0.090316,0.102657,0.119172,0.120638,0.110533,0.103563,0.10328,0.107901,0.102101,0.090746,0.081518,0.088216,0.104241,0.084531,0.065122,0.072446,0.082518,0.088773
0.187408,0.1263,0.105778,0.124512,0.136214,0.120346,0.101784,0.118941,0.144153,0.131285,0.110831,0.128867,0.156314,0.156571,0.137333,0.12162,0.121561,0.129371,0.125466,0.116997,0.105626,0.111037,0.128531,0.102614,0.073237,0.083961,0.10485,0.116942
0.239304,0.162333,0.139739,0.16345,0.166158,0.144593,0.132641,0.151899,0.172977,0.159221,0.134835,0.155546,0.190449,0.191578,0.162165,0.132928,0.129194,0.134734,0.139323,0.145299,0.138462,0.137609,0.142689,0.116505,0.088879,0.100003,0.129588,0.151797
0.2563,0.18236,0.169185,0.194254,0.186689,0.162965,0.162091,0.176912,0.184008,0.177986,0.163021,0.181445,0.208533,0.214217,0.188166,0.146366,0.130328,0.126488,0.139657,0.161333,0.163858,0.15207,0.134552,0.116951,0.100666,0.110463,0.144943,0.17187
0.234898,0.178745,0.184275,0.216367,0.207891,0.178221,0.186206,0.197678,0.197464,0.19899,0.190297,0.200954,0.202644,0.20622,0.198622,0.158519,0.133155,0.125587,0.141058,0.162627,0.170083,0.151245,0.119017,0.107657,0.09849,0.112843,0.148093,0.166282
0.21358,0.177371,0.195487,0.237796,0.234926,0.201298,0.214488,0.229045,0.222739,0.21022,0.196207,0.204804,0.19089,0.178018,0.176906,0.154397,0.135534,0.131105,0.147149,0.1571,0.154766,0.141198,0.116485,0.100803,0.087079,0.106776,0.140475,0.146849
0.226184,0.195632,0.20477,0.246926,0.241059,0.214914,0.238453,0.259021,0.240659,0.200661,0.173278,0.176838,0.173903,0.156936,0.150289,0.140727,0.131437,0.133104,0.144225,0.140994,0.126546,0.12106,0.109164,0.088257,0.073524,0.092662,0.121293,0.124531
0.218835,0.191616,0.183165,0.214494,0.211995,0.201959,0.237977,0.265299,0.241295,0.187201,0.139363,0.13159,0.146414,0.142927,0.136138,0.123633,0.11937,0.127096,0.132857,0.129944,0.11207,0.10505,0.101669,0.078993,0.060438,0.073751,0.093648,0.09652
0.170622,0.149081,0.130286,0.146902,0.153645,0.157456,0.191249,0.216121,0.200021,0.156868,0.105177,0.08966,0.10881,0.123515,0.118115,0.103299,0.114196,0.12218,0.123297,0.123331,0.107162,0.098529,0.095807,0.072264,0.050018,0.05725,0.070996,0.076235
0.115878,0.105582,0.096663,0.101194,0.118202,0.125841,0.128636,0.130173,0.122531,0.10288,0.067034,0.061953,0.087269,0.106082,0.101337,0.100748,0.122631,0.119748,0.122179,0.119568,0.101705,0.093751,0.087251,0.065438,0.046487,0.054392,0.060646,0.0625
0.083209,0.086186,0.089339,0.088078,0.112409,0.12514,0.104223,0.075737,0.064933,0.063172,0.045039,0.053111,0.084666,0.096598,0.091938,0.10954,0.131981,0.114121,0.112659,0.109747,0.09714,0.087834,0.075254,0.057063,0.043104,0.057837,0.061989,0.05669
0.076084,0.079822,0.083208,0.085424,0.108851,0.120961,0.103637,0.0714,0.06257,0.062852,0.041666,0.048599,0.074679,0.075536,0.074192,0.103344,0.121438,0.098277,0.090183,0.092849,0.091785,0.077276,0.058848,0.047843,0.039553,0.053226,0.056649,0.048678
0.063481,0.067014,0.067123,0.07245,0.088106,0.097694,0.099261,0.072695,0.06294,0.067593,0.044786,0.041133,0.057596,0.057056,0.057226,0.079553,0.086569,0.069297,0.060167,0.066573,0.080961,0.069518,0.044392,0.03833,0.0376,0.044248,0.047565,0.044586
0.049433,0.051735,0.054011,0.06204,0.070907,0.077297,0.089559,0.071228,0.058541,0.067768,0.052322,0.040089,0.046286,0.051092,0.055494,0.061635,0.055117,0.046106,0.042928,0.048764,0.064294,0.060025,0.042087,0.0404,0.044242,0.042313,0.042022,0.04524
0.056847,0.051155,0.048365,0.054607,0.060944,0.071183,0.084695,0.071097,0.056513,0.06143,0.056208,0.04879,0.052044,0.060625,0.072471,0.072282,0.054316,0.046103,0.04655,0.044872,0.05059,0.053366,0.050257,0.052869,0.059709,0.053182,0.048369,0.054853
0.068523,0.058058,0.048052,0.053016,0.061394,0.072263,0.085271,0.074448,0.055378,0.05763,0.058411,0.055559,0.059352,0.069207,0.08696,0.087519,0.062315,0.051244,0.054822,0.047189,0.040725,0.046817,0.055175,0.061678,0.072253,0.063902,0.054148,0.0616
0.068902,0.055681,0.039814,0.047653,0.060906,0.065799,0.074982,0.068476,0.050059,0.054564,0.055954,0.052542,0.056583,0.06508,0.084574,0.086229,0.060396,0.048072,0.053829,0.043899,0.031771,0.037147,0.048802,0.058471,0.071287,0.061911,0.048689,0.056599
0.055568,0.04386,0.025826,0.034842,0.049722,0.047591,0.050583,0.048923,0.036042,0.043985,0.048144,0.044601,0.049323,0.053051,0.064004,0.064985,0.049672,0.039458,0.041235,0.033567,0.023737,0.025798,0.036593,0.046905,0.05566,0.046968,0.035533,0.042188
0.042408,0.034704,0.017533,0.022963,0.035639,0.031745,0.026876,0.028784,0.027283,0.03602,0.044892,0.043165,0.045325,0.049553,0.046215,0.037946,0.034089,0.028801,0.02629,0.024123,0.021829,0.021135,0.032846,0.041158,0.040706,0.035683,0.02936,0.031795
0.036159,0.028138,0.014916,0.019165,0.028198,0.025646,0.017953,0.021505,0.02941,0.033891,0.043371,0.042951,0.04584,0.05689,0.044856,0.025175,0.020804,0.023152,0.025793,0.024777,0.023672,0.024135,0.037301,0.045975,0.042652,0.039925,0.034467,0.040897
0.02866,0.020905,0.013763,0.018604,0.028316,0.025723,0.018322,0.022885,0.032457,0.034509,0.041742,0.043545,0.04886,0.060937,0.047791,0.025532,0.01588,0.019762,0.027488,0.025389,0.022657,0.025655,0.038175,0.046851,0.042474,0.043819,0.040536,0.059777
0.021266,0.016885,0.014731,0.018827,0.026695,0.02293,0.017834,0.023781,0.031335,0.030149,0.034159,0.037477,0.044299,0.05427,0.042174,0.02529,0.015292,0.017736,0.024709,0.021763,0.018339,0.022782,0.031974,0.038709,0.034279,0.041598,0.047374,0.085065
0.018735,0.016339,0.015675,0.017729,0.021193,0.01773,0.016363,0.022314,0.025758,0.024587,0.026113,0.026621,0.033082,0.038949,0.03,0.021128,0.013131,0.013824,0.018588,0.017941,0.017435,0.018679,0.021721,0.026776,0.02433,0.034748,0.051477,0.108061
0.021041,0.017353,0.015198,0.015711,0.016233,0.016247,0.018971,0.024067,0.023803,0.024696,0.024929,0.021898,0.025791,0.023581,0.020029,0.015834,0.011236,0.012181,0.015545,0.017398,0.019827,0.018143,0.015734,0.023304,0.021715,0.028936,0.047452,0.115685
