5e-06,1.4e-05,1.9e-05,1e-05,5e-06,8e-06,8e-06,5e-06,1.4e-05,1.3e-05,1.7e-05,0,6e-06,2e-06,4e-06,1.7e-05,1e-06,6e-06,7e-06,5.2e-05,0.000111,1e-06,4.8e-05,4e-06,0.000187,4.3e-05,3.5e-05,8.1e-05,0.000452,0.000488,0.00051,0.000989,0.000969,5e-06,0.000504,0.000287,0.000344,0.00055,9.8e-05,1e-04,0.000105,9.5e-05,0.000109,0.000416,0.000686,8.3e-05,0.000309,0.000101,0.000496,0.000185,0.000564,3.7e-05,6.8e-05,0.000663,0.000156,9.7e-05,1e-06,0.000245,0.000139,0.000382,0.000189,1.4e-05,0.000268,6.4e-05,6.5e-05,1.1e-05,0.000179,1.5e-05,2.3e-05,8.3e-05,7.6e-05,3.4e-05,4e-06,1.9e-05,6.6e-05,3.4e-05,3e-05,3.2e-05,8e-06,1.7e-05,0,2e-06,7.3e-05,4.3e-05,1.8e-05,3.5e-05,1.5e-05,1.2e-05,3.9e-05,1e-05,2.5e-05,2.2e-05,0.000181,0.000182,0.000133,6e-05,0.000124,7.3e-05,0.000179,6e-06,0.000143,2e-05,5.6e-05,3.7e-05,1.6e-05,5.2e-05,1.4e-05,3.2e-05,6e-06,6.4e-05,1.4e-05,5e-06,4e-06,1.8e-05,1.1e-05,4e-06,8e-06,1.2e-05,1.1e-05,1.4e-05,8e-06
4.1e-05,1.8e-05,6.1e-05,3.6e-05,4.5e-05,2.9e-05,1.4e-05,1.9e-05,1.7e-05,5.1e-05,9e-06,2e-05,1.7e-05,1.9e-05,8e-06,3.7e-05,2.4e-05,3.1e-05,2.5e-05,0.000114,0.000255,0.000137,0.000208,0.000127,0.000366,0.000197,0.000145,0.000188,0.000825,0.001333,0.00046,0.002183,0.002862,0.000831,0.000863,0.000225,0.000951,0.002116,0.000887,0.000463,0.000706,0.000368,0.000557,0.001354,0.00226,0.001736,0.00154,0.000883,0.001275,9e-04,0.001218,4.5e-05,0.000186,0.001382,0.000949,0.000787,0.000156,0.00044,0.000137,0.000805,0.000392,0.000843,0.000671,0.000135,9.8e-05,0.000125,0.000358,0.000103,0.000101,9.4e-05,0.000216,1e-04,3.2e-05,0.000104,0.000132,2.3e-05,0.000135,0.000235,0.000298,0.000198,7.2e-05,1.3e-05,0.00019,0.000238,0.000141,0.000126,0.000138,0.000158,0.000151,8e-05,4.3e-05,0.00011,0.000496,0.000276,1e-04,0.000218,0.000176,0.00029,5.5e-05,0.000224,0.000251,0.000231,0.000142,4.1e-05,4.2e-05,5e-05,5.1e-05,5.8e-05,6.3e-05,0.000115,3.8e-05,1e-05,1.5e-05,3.9e-05,1.2e-05,1.9e-05,6e-06,1.7e-05,4.4e-05,4e-05,4.4e-05
1.8e-05,3.8e-05,2e-05,1.5e-05,4.3e-05,1.1e-05,2e-05,1.9e-05,2.2e-05,3.6e-05,4e-05,3e-05,1.5e-05,6e-06,1.7e-05,2.3e-05,2.5e-05,2.8e-05,3.6e-05,0.000213,0.000453,0.000496,9.3e-05,4.8e-05,0.000403,0.000356,0.000274,0.000322,0.000557,0.000795,0.002988,0.002672,0.001605,0.003367,0.001116,0.00136,0.000756,0.002697,0.000387,0.000305,0.001021,0.001737,0.001193,0.000269,0.002509,0.003666,0.00116,0.00025,0.001819,0.001291,0.001006,0.000946,0.00044,0.000632,0.000637,0.000864,0.000198,0.000851,0.000197,0.000338,0.000514,0.000845,0.000982,0.000742,0.00035,0.000189,0.000215,0.000209,0.000363,0.000231,0.000139,0.000311,0.000187,0.000207,0.000226,0.000101,4.5e-05,0.000313,0.000374,0.000188,0.00014,3.1e-05,0.000182,0.000233,0.000176,5e-06,6.3e-05,0.000118,2e-05,2.4e-05,4.1e-05,6.6e-05,0.000485,0.000881,0.000283,0.000192,6.4e-05,0.000105,0.000218,0.000251,5.1e-05,6.9e-05,4.3e-05,6.4e-05,1.3e-05,2.9e-05,2.8e-05,2.6e-05,3.2e-05,7.4e-05,0.000194,7.4e-05,3.7e-05,4.4e-05,4.1e-05,2.3e-05,8e-06,2e-05,5.1e-05,2e-05,2.8e-05
5.4e-05,5.9e-05,5.1e-05,3.8e-05,3.8e-05,4.8e-05,4.7e-05,4.8e-05,2.8e-05,4.5e-05,3.3e-05,2.4e-05,2.9e-05,2.4e-05,2.6e-05,4.1e-05,2.3e-05,5.5e-05,4e-05,0.000366,0.000729,0.000708,0.000415,0.000182,0.000313,0.000598,0.000171,0.000421,0.000364,0.000289,0.004355,0.001859,0.001094,0.003141,0.002523,0.00158,0.001497,0.000957,0.001327,0.001065,0.000209,0.001567,0.000976,0.000703,0.002387,0.000523,0.001291,0.001037,0.003171,0.00065,0.000396,0.000564,0.000505,0.001266,0.000428,0.001364,0.000537,0.000884,0.001215,0.001228,0.000991,0.000373,0.000444,0.000196,0.000399,0.000356,0.000309,0.000238,0.000906,0.00088,0.000416,8.9e-05,0.000216,0.000152,0.000222,6.5e-05,9.3e-05,0.000408,0.000166,0.000201,0.000101,0.000109,9.1e-05,0.000189,8.4e-05,0.000103,0.000121,1.9e-05,6.2e-05,3.9e-05,7.9e-05,2.6e-05,0.000401,0.000505,0.000547,8e-05,8.6e-05,0.000106,0.000306,0.000122,0.000114,5.9e-05,4.4e-05,6.3e-05,6.3e-05,4.4e-05,1.5e-05,2.2e-05,4e-05,0.000109,0.000306,0.000177,8.3e-05,5.8e-05,4.9e-05,5.2e-05,5.9e-05,4.9e-05,2.2e-05,4.9e-05,7.3e-05
1.6e-05,1.3e-05,1.2e-05,3e-05,1.5e-05,2.4e-05,2.3e-05,2.8e-05,9e-06,2.9e-05,9e-06,7e-06,1.2e-05,8e-06,1e-05,1.2e-05,1.4e-05,3.7e-05,2.5e-05,0.000599,0.000449,3.4e-05,0.000327,4.9e-05,0.000246,0.000406,0.000315,0.000376,0.000864,0.000759,0.006137,0.003887,0.001538,0.002506,0.000702,0.00326,0.002031,0.00066,0.001031,0.000326,0.001517,0.001728,0.001578,0.000133,0.000937,0.001254,0.001584,0.001734,0.003014,0.00213,0.001619,0.001102,0.000862,0.002409,0.001447,0.002026,0.001528,0.001175,0.001435,0.00119,0.001555,0.000545,0.00037,0.00046,0.000467,0.000139,0.000302,0.000399,0.001309,0.000529,0.000196,0.000106,0.000193,0.000173,9.7e-05,1e-04,0.000171,0.000432,0.000324,0.000201,9.2e-05,5e-05,1e-04,9.8e-05,5.2e-05,5.9e-05,6.6e-05,8e-05,7.6e-05,3.2e-05,5.1e-05,9.4e-05,0.000204,0.000542,0.000486,0.00057,0.000201,0.00016,0.00022,0.00013,4.1e-05,7.7e-05,6.5e-05,1e-05,1e-05,2.1e-05,1.1e-05,2.2e-05,3.5e-05,9.5e-05,0.000269,0.000139,2.9e-05,1.8e-05,3.8e-05,1.2e-05,4.7e-05,2e-05,2e-05,4e-05,3.1e-05
2e-05,1.5e-05,9e-06,2.7e-05,3.3e-05,8e-06,2.7e-05,3.3e-05,9e-06,1.9e-05,7e-06,4e-06,2.5e-05,1.2e-05,2.4e-05,1.2e-05,7e-06,1.6e-05,1.1e-05,0.000772,0.000337,0.000199,0.000597,0.000469,0.000109,0.000265,0.000372,0.000103,0.001253,0.000199,0.005852,0.005372,0.003577,0.004313,0.001565,0.004852,0.001366,0.003183,0.001168,0.002118,0.002635,0.000601,0.000821,0.000927,0.001864,0.003553,0.003831,0.000205,0.004066,0.003185,0.00325,0.002037,0.003183,0.001729,0.000873,0.000848,0.000439,0.000965,0.001193,0.002805,0.000975,0.001443,0.001209,0.001134,0.000753,0.000858,0.000549,0.001037,0.000358,0.000202,0.000106,0.000147,0.000125,0.000113,5.8e-05,4.6e-05,0.000129,0.000398,0.000114,0.000145,8.7e-05,5e-05,6.3e-05,8.6e-05,0.000123,9.7e-05,9.2e-05,4.2e-05,8.7e-05,6e-05,2.6e-05,0.000145,0.00024,0.001258,0.000904,0.000537,0.000148,0.000108,2e-04,0.000115,0.000105,5.8e-05,6.9e-05,8.8e-05,6e-05,3.4e-05,2e-05,8e-06,1.7e-05,0.00012,0.000513,0.000204,5.1e-05,2.4e-05,5e-05,2.6e-05,4e-05,3.5e-05,2.4e-05,1.5e-05,2.1e-05
1.9e-05,1.8e-05,3.3e-05,4.2e-05,3.1e-05,2e-05,3.3e-05,4.7e-05,3.4e-05,1.5e-05,1.7e-05,1.5e-05,3.7e-05,4.2e-05,3.7e-05,3.5e-05,2.2e-05,3.5e-05,2.3e-05,0.000837,0.000274,0.000236,0.001,0.000733,0.000358,0.000678,0.000769,0.000612,0.001468,0.001468,0.004549,0.001903,0.001591,0.003375,0.003887,0.003762,0.003633,0.003878,0.003505,0.0034,0.003437,0.002838,0.001034,0.000359,0.004985,0.002815,0.003756,0.003267,0.003673,0.00287,0.001239,0.004889,0.003094,0.001457,0.001121,0.000322,0.001421,0.00208,0.000773,0.003315,0.00275,0.001397,0.000756,0.000871,0.000901,0.000782,0.000246,0.000674,0.000536,0.000505,0.00013,0.000188,0.000203,0.000157,6.9e-05,0.000171,0.00021,0.000329,0.000166,6.4e-05,0.000164,3e-05,6.8e-05,2.2e-05,7e-05,9.7e-05,0.000182,0.000214,0.000135,0.000109,0.000151,0.000242,0.000145,0.001375,0.002321,0.000927,0.000181,0.00015,0.000249,0.000233,0.000104,7e-05,0.00012,2.1e-05,2e-05,5.6e-05,3.9e-05,3.2e-05,4.1e-05,6.7e-05,0.000678,0.000386,0.00015,3.9e-05,3.8e-05,4.9e-05,4.1e-05,2.6e-05,3.7e-05,2.7e-05,1.1e-05
3.8e-05,2.1e-05,3.4e-05,3.7e-05,1.2e-05,7e-06,2e-05,2.7e-05,1.8e-05,1.1e-05,2.1e-05,2.1e-05,3.9e-05,1.2e-05,8e-06,2.2e-05,1.9e-05,4e-05,2.7e-05,0.000759,0.001305,0.000491,0.001031,0.000281,0.000157,0.000639,0.00061,0.00016,0.00114,0.001331,0.004023,0.003941,0.001165,0.004044,0.00689,0.004217,0.005218,0.008868,0.004893,0.001291,0.003855,0.001655,0.002367,0.000719,0.005706,0.009876,0.003741,0.000851,0.00511,0.001404,0.001236,0.004667,0.003047,0.001002,0.000657,0.001404,0.001544,0.001576,0.000654,0.002427,0.001523,0.001012,0.001578,0.001912,0.000408,0.001689,0.001139,0.000402,0.000896,0.000372,6.3e-05,0.000221,0.000329,0.000134,0.000148,0.000202,0.000134,0.00019,0.00022,3.3e-05,0.000145,2e-04,0.000148,0.000235,0.00015,0.00023,4.4e-05,0.000291,0.000126,0.000112,0.000227,3.9e-05,0.000323,0.001062,0.001577,0.001484,0.000587,0.000229,0.00023,0.000228,9.9e-05,9.2e-05,2.1e-05,8.1e-05,8.5e-05,4.6e-05,2.6e-05,6.8e-05,6.5e-05,3.4e-05,0.000499,0.000281,9.5e-05,3.2e-05,6.7e-05,3e-05,2.5e-05,1.5e-05,2.4e-05,6e-06,3.8e-05
2.8e-05,1.4e-05,3.1e-05,3.5e-05,3.2e-05,1.2e-05,1.5e-05,2.9e-05,2.3e-05,2.1e-05,1.6e-05,8e-06,2.6e-05,4.2e-05,2.5e-05,1.7e-05,3.4e-05,1.6e-05,1.9e-05,0.000554,0.001067,0.000984,0.000716,0.000515,0.000262,0.000637,0.000815,0.000958,5.3e-05,0.000301,0.002224,0.003462,0.005406,0.002007,0.006879,0.002313,0.006165,0.002977,0.001867,0.002315,0.005459,0.005867,0.001271,0.001739,0.005555,0.009702,0.00509,0.002778,0.00524,0.00559,0.003484,0.002674,0.002905,0.002186,0.002048,0.001077,0.002808,0.002076,0.001263,0.001377,0.002662,0.00221,0.002754,0.001733,0.001339,0.002318,0.001446,0.000656,0.000752,0.000704,0.000487,0.000133,4e-04,0.000525,0.000274,0.000242,0.000187,0.000253,0.000283,0.000118,0.000164,0.000183,0.000165,0.000314,0.000147,0.000162,0.000287,0.000264,0.000214,0.000213,0.000283,9.7e-05,0.000291,0.000897,0.000677,0.00094,0.000604,0.000368,0.000339,7.1e-05,5.7e-05,8.1e-05,5.7e-05,4.1e-05,7.3e-05,5.7e-05,4.8e-05,4.2e-05,2.1e-05,9.9e-05,0.000154,7.7e-05,0.000119,4.5e-05,7.3e-05,5.8e-05,6.2e-05,5.2e-05,5.5e-05,2.6e-05,5e-05
2e-06,1.1e-05,2e-05,6e-06,1.9e-05,1.2e-05,2.1e-05,2.8e-05,2.5e-05,2.7e-05,3e-05,1.7e-05,1.3e-05,1.9e-05,8e-06,1.6e-05,4e-05,4.9e-05,4.4e-05,0.000382,0.001105,0.000995,0.000337,6.1e-05,0.000239,0.001244,0.001381,0.001182,0.00041,0.00039,0.001209,0.000231,0.002492,0.007423,0.005988,0.007419,0.002912,0.004107,0.002297,0.003922,0.002653,0.001636,0.002423,0.001887,0.002138,0.004587,0.003471,0.002742,0.00172,0.003245,0.003143,0.002134,0.003056,0.002187,0.001039,0.00277,0.001387,0.001273,0.002644,0.004426,0.002486,0.000132,0.001666,0.000998,0.000792,0.001163,0.000859,0.000397,0.000306,0.000219,0.000205,0.000145,0.000476,0.00031,0.000241,0.000101,0.000101,0.000214,8.5e-05,9.1e-05,8.9e-05,8.6e-05,0.000155,0.000171,0.000255,0.00013,0.000257,4.7e-05,9.5e-05,8.6e-05,0.000213,0.000206,0.000305,0.000263,0.000852,0.000494,0.000154,0.00011,0.000128,0.000119,0.000101,6.3e-05,2.9e-05,2.6e-05,4.8e-05,4.1e-05,2.1e-05,6.2e-05,6.9e-05,0.000113,0.00023,0.000198,8.2e-05,6.5e-05,3.8e-05,4.1e-05,4.4e-05,1.8e-05,3.7e-05,3.2e-05,2.1e-05
1.9e-05,1.6e-05,1.3e-05,7e-06,1.3e-05,1.5e-05,7e-06,2e-05,4e-06,1.7e-05,3e-06,8e-06,1e-05,1.2e-05,5e-06,1.2e-05,4e-05,3.6e-05,1.1e-05,0.000448,0.001026,0.000518,0.000311,6e-05,0.000236,0.001843,0.001336,0.000461,0.000583,0.000425,0.001576,0.002745,0.002105,0.004664,0.002828,0.003491,0.002694,0.00281,0.001119,0.003489,0.003052,0.001194,0.001026,0.000268,0.002474,0.001036,0.001731,0.002214,0.002147,0.000151,0.001934,0.001386,0.001147,0.001392,0.001655,0.000787,0.001168,0.001126,0.001245,0.002074,0.001611,0.001018,0.000803,0.00042,0.000471,0.000491,0.000841,0.000344,0.000257,0.000205,7.3e-05,7.2e-05,0.000339,6.5e-05,0.000123,9.5e-05,0.000121,0.000202,4.3e-05,6.1e-05,8.2e-05,6.4e-05,7.7e-05,0.000187,0.000131,6.3e-05,0.000135,3.1e-05,6.6e-05,0.000154,0.000197,0.000155,0.000181,0.000359,0.00138,0.000529,0.000184,9.3e-05,6.3e-05,4.5e-05,9.1e-05,5.9e-05,4.4e-05,6.5e-05,7.3e-05,2e-05,4.6e-05,1.1e-05,2.3e-05,6.8e-05,0.000259,7.9e-05,2.4e-05,3.9e-05,2.4e-05,3.3e-05,3.7e-05,5e-06,2.4e-05,1.6e-05,2.6e-05
1.2e-05,1.6e-05,1.2e-05,9e-06,1.4e-05,5e-06,6e-06,2.1e-05,1.5e-05,1.2e-05,2e-05,1.1e-05,1.2e-05,1.3e-05,1.4e-05,1.3e-05,2.7e-05,7e-06,6e-06,0.00061,0.000923,0.000338,0.000157,3.9e-05,0.000201,0.001604,0.001058,0.000322,0.000682,0.000284,0.001977,0.002918,0.003226,0.000948,0.001744,0.002968,0.001378,0.001554,0.001394,0.003148,0.001243,0.00165,0.003324,0.001823,0.002758,0.002978,0.000304,0.000781,0.001547,0.000432,0.001603,0.000324,0.000189,0.001511,0.000322,0.000902,0.000516,0.000154,0.000945,0.001053,0.001149,0.001118,0.000688,0.000464,0.000296,0.000601,0.000914,0.000177,0.000183,7.4e-05,9e-05,1.4e-05,0.000213,6.5e-05,3.9e-05,6.8e-05,8.3e-05,8.7e-05,2.3e-05,6.4e-05,3.3e-05,7.2e-05,4e-05,8e-05,5.7e-05,0.000102,0.000202,7.3e-05,2.5e-05,1e-04,0.00018,0.000134,0.000161,0.000101,0.001518,0.000917,0.000364,7.8e-05,7.1e-05,6.3e-05,1.1e-05,2.2e-05,4.3e-05,3.6e-05,3.6e-05,3.7e-05,3.1e-05,2.6e-05,1.1e-05,6.7e-05,0.00013,6.4e-05,1.4e-05,1.4e-05,9e-06,2e-05,3.2e-05,3.9e-05,3.3e-05,2.5e-05,1.2e-05
1.5e-05,1.8e-05,4e-06,9e-06,4e-06,7e-06,1e-05,8e-06,7e-06,1e-05,9e-06,9e-06,2e-06,2e-06,1.4e-05,6e-06,2.4e-05,1.3e-05,8e-06,0.000723,0.001108,0.000471,9.9e-05,7.6e-05,0.000319,0.000898,0.000601,0.000488,0.000333,0.000241,0.001967,0.001606,0.001521,0.00221,0.001879,0.00264,0.001546,0.002747,0.001103,0.0022,0.001696,0.00203,0.00145,0.001338,0.001636,0.002365,0.001664,0.000913,0.000838,0.001481,0.00111,0.000707,0.001967,0.000526,4e-04,0.000832,0.001537,0.001003,0.001335,0.001308,0.001243,0.00085,0.00075,0.000466,0.000321,0.000669,0.000912,0.000186,0.000247,0.000124,0.00011,2.4e-05,0.000269,3.4e-05,0.000149,0.000147,0.000173,9.3e-05,8.6e-05,0.000117,9.1e-05,6.1e-05,0.000118,0.000143,0.000115,0.000103,8.8e-05,7.2e-05,9.6e-05,7.7e-05,5.7e-05,0.000154,6.9e-05,0.000283,0.001254,0.000783,0.000318,6.3e-05,8.9e-05,3.8e-05,2.8e-05,1.3e-05,2.3e-05,5.2e-05,8e-06,3e-05,4.3e-05,1.6e-05,2e-05,8.4e-05,9.3e-05,5.6e-05,1.7e-05,1e-05,1e-05,1.2e-05,1.6e-05,1.5e-05,1.1e-05,1.4e-05,5e-06
8e-06,9e-06,7e-06,1.1e-05,1.1e-05,7e-06,1.1e-05,8e-06,4e-06,8e-06,7e-06,6e-06,5e-06,7e-06,8e-06,4e-06,8e-06,6e-06,5e-06,0.000745,0.000243,0.000236,0.000233,5.2e-05,0.000464,0.000548,0.000439,0.00039,0.00044,0.000232,0.001344,0.001508,0.000558,0.00294,0.004369,0.003829,0.002763,0.001538,0.00182,0.002134,0.000215,0.003418,0.003521,0.00263,0.000635,0.001462,0.000492,0.002725,0.001896,0.002924,0.003071,0.000304,0.001605,0.001832,0.000848,0.000603,0.002654,0.001498,0.000412,0.001897,0.002226,0.002109,0.000664,0.00063,0.000636,0.0011,0.001106,0.000222,0.000454,0.00011,7e-06,1.5e-05,0.000131,0.000151,0.000158,0.000277,0.00027,0.000178,0.000143,0.000158,9.6e-05,0.000156,0.000103,0.000158,4.4e-05,7.4e-05,0.000101,0.00012,3.9e-05,9.2e-05,0.000176,0.000173,5.4e-05,0.000776,0.000254,4.3e-05,0.000154,4.9e-05,8.3e-05,2.8e-05,2.1e-05,1.5e-05,4e-06,1.8e-05,3e-05,3e-05,2.7e-05,3.4e-05,2.1e-05,6.1e-05,8.4e-05,6.3e-05,2.3e-05,1.6e-05,2.1e-05,2.9e-05,1.4e-05,4e-06,7e-06,1.5e-05,8e-06
1e-05,1.9e-05,1.6e-05,8e-06,1.6e-05,1.1e-05,1.6e-05,1.5e-05,1.6e-05,4e-06,1e-05,1.1e-05,1.1e-05,4e-06,1.3e-05,1.1e-05,1.6e-05,1.1e-05,5e-06,0.000675,0.000502,0.000212,0.000183,0.000115,0.000428,0.000401,0.000793,0.000197,0.000464,0.000461,0.001333,0.002455,0.001003,0.000636,0.005616,0.00202,0.004384,0.003219,0.001527,0.002568,0.003108,0.005793,0.001938,0.001983,0.001822,0.003033,0.000182,0.003496,0.000219,0.00194,0.00234,0.004604,0.002668,0.001852,0.001368,0.003239,0.002995,0.001979,0.000668,0.001459,0.001762,0.000936,0.001168,0.000809,0.00176,0.00033,0.002122,0.000868,0.000343,0.000281,0.000231,0.000176,0.000352,0.000356,0.000421,0.00024,0.000177,2.3e-05,7.3e-05,0.000136,0.000123,0.00013,6.6e-05,0.000364,0.000219,5.5e-05,0.000168,0.000118,6.4e-05,0.00014,0.000189,0.000177,0.000124,0.001157,0.00059,0.000293,0.000255,9.9e-05,0.000102,6e-05,5.8e-05,3e-05,3.1e-05,2.6e-05,3.1e-05,4.4e-05,7.7e-05,5.6e-05,3e-06,7.8e-05,7.9e-05,1.9e-05,3.8e-05,2e-05,1e-05,1.7e-05,8e-06,1.5e-05,2.3e-05,1.1e-05,2.6e-05
8e-06,1.1e-05,7e-06,2.1e-05,5e-06,8e-06,1.6e-05,1.3e-05,6e-06,6e-06,1.4e-05,8e-06,1.3e-05,1e-05,4e-06,5e-06,1.2e-05,5e-06,4e-06,0.000546,0.000425,0.000271,3.6e-05,1.8e-05,0.000435,0.000188,0.000502,0.000394,0.000637,0.000158,0.00199,0.005098,0.001749,0.000918,0.003689,0.006063,0.002159,0.002818,0.003142,0.002358,0.002557,0.005546,0.009686,0.006158,0.004947,0.008909,0.005603,0.000988,0.003897,0.003427,0.001993,0.005865,0.002029,0.00264,0.003108,0.002956,0.004956,0.002778,0.001922,0.002659,0.003195,0.002403,0.00218,0.000626,0.002642,0.002893,0.003963,0.002119,0.00188,0.000741,0.000516,0.00014,0.000968,0.000589,8.3e-05,0.000496,0.000557,0.000414,0.000163,0.00027,0.000209,0.000179,0.000301,0.000726,0.000153,0.000169,0.000319,0.000335,0.000121,8.9e-05,0.000152,0.000162,9.3e-05,0.001173,0.000796,8.6e-05,0.000275,0.000193,0.000151,7.2e-05,6.3e-05,3.8e-05,8e-06,6.6e-05,8.1e-05,2.9e-05,6e-05,2.4e-05,2.8e-05,0.000102,9.4e-05,5.5e-05,4.3e-05,2.8e-05,3.7e-05,1.2e-05,2.3e-05,1.4e-05,2.1e-05,2.7e-05,3.6e-05
1.2e-05,1.3e-05,1e-05,1.3e-05,1e-05,1.1e-05,8e-06,7e-06,7e-06,3e-06,1.2e-05,1.3e-05,1.4e-05,1.5e-05,4e-06,3e-06,7e-06,2e-06,4e-06,0.000396,0.000591,0.000226,0.000222,0.000149,0.000424,0.000727,0.000988,0.001113,0.00121,0.000977,0.002936,0.008209,0.007447,0.003165,0.002253,0.00236,0.006467,0.008007,0.010778,0.007761,0.002133,0.005662,0.010307,0.012389,0.007285,0.003195,0.006878,0.002049,0.00464,0.001663,0.00241,0.005268,0.009328,0.008841,0.006988,0.008583,0.011882,0.012874,0.011294,0.00938,0.009759,0.00984,0.008407,0.006143,0.004097,0.000418,0.002815,0.003112,0.001161,0.001039,0.000403,0.000308,0.001418,0.000941,0.000451,0.001017,0.001575,0.001328,0.001043,0.000992,0.000906,0.000856,0.000808,0.000634,0.000655,0.000558,0.000615,0.000582,0.000574,0.000379,0.000345,0.000383,0.000237,0.001107,0.001708,0.001254,0.000333,0.000125,0.000141,7.8e-05,6.9e-05,7.2e-05,7.7e-05,5.7e-05,9.2e-05,4.5e-05,5.6e-05,8.6e-05,6.2e-05,3.8e-05,0.000101,3.9e-05,4.4e-05,7e-05,8.6e-05,7.7e-05,4.3e-05,3.3e-05,2.9e-05,2e-06,1.3e-05
2.8e-05,3.6e-05,3.3e-05,3.4e-05,1.4e-05,2.4e-05,1.9e-05,7e-06,2.7e-05,2.1e-05,2e-05,1.1e-05,1.4e-05,7e-06,1.3e-05,4e-06,1.2e-05,8e-06,1e-05,0.000358,0.000563,0.00031,0.000462,9.5e-05,0.000372,0.001179,0.000802,0.000732,0.000952,0.000469,0.00315,0.006852,0.005332,0.005369,0.002282,0.000724,0.006386,0.00798,0.006725,0.006847,0.010132,0.004111,0.003651,0.004702,0.003742,0.000964,0.004772,0.007174,0.005712,0.008745,0.007021,0.007568,0.0058,0.007948,0.002823,0.005404,0.005696,0.00588,0.004886,0.000357,0.005192,0.002969,0.002981,0.000551,0.00129,0.001658,0.000353,0.001647,0.003818,0.002182,0.000758,0.000262,0.00122,0.001726,0.001091,0.000462,0.000668,0.000321,0.00025,0.000632,0.000619,0.000523,0.000487,0.000997,0.000863,0.000212,0.000299,0.000135,0.000223,0.000128,0.000287,0.000206,0.000272,0.000926,0.000908,0.000548,0.000527,0.000337,0.000356,0.000242,0.000136,5.4e-05,4.6e-05,5.8e-05,5e-05,3.3e-05,4.6e-05,7.7e-05,5.6e-05,8e-05,5.1e-05,5.3e-05,3.3e-05,2.7e-05,4e-05,3.5e-05,1.9e-05,5e-06,1.2e-05,1.9e-05,2.9e-05
6e-06,1.3e-05,7e-06,2.8e-05,2.6e-05,3.3e-05,1.8e-05,7e-06,3.8e-05,1.2e-05,1.8e-05,1.1e-05,3e-06,1e-06,5e-06,1e-06,2.7e-05,7e-06,7e-06,0.00041,0.000454,0.000205,0.000501,0.000328,3.9e-05,0.000682,0.001134,0.00026,0.000644,0.00027,0.003381,0.001513,0.004176,0.006235,0.00277,0.00405,0.005619,0.001256,0.004034,0.000931,0.006148,0.006327,0.002137,0.00235,0.004688,0.000957,0.00393,0.008099,0.006669,0.006322,0.007916,0.003763,0.002126,0.002497,0.004678,0.002083,0.001605,0.002318,0.004451,0.00415,0.001912,0.003392,0.00058,0.001844,0.00334,0.0028,0.003134,0.001372,0.002169,0.000944,0.000165,0.00034,0.001153,0.00035,7.7e-05,0.000455,0.000528,0.000679,0.000537,0.000203,0.000299,9.9e-05,0.000153,0.000809,0.000481,0.000185,0.000186,0.000409,0.000202,0.000272,0.00023,0.000207,0.000349,0.000842,0.000367,0.000601,0.000599,0.000325,0.000401,0.000116,5.6e-05,4.6e-05,8e-06,4.5e-05,3.2e-05,1.8e-05,1.4e-05,4.6e-05,6e-05,0.000107,2.5e-05,3.7e-05,4.2e-05,3.4e-05,2.3e-05,2.3e-05,1.8e-05,3e-05,2.4e-05,8e-06,4.8e-05
6e-06,2e-06,9e-06,2.3e-05,2.2e-05,1.4e-05,9e-06,1e-05,2.9e-05,2.5e-05,1.4e-05,6e-06,6e-06,4e-06,1.2e-05,6e-06,2.7e-05,2e-05,3e-06,0.000444,0.00057,0.00029,0.000528,0.000429,7.3e-05,0.000701,0.00152,0.00145,0.000749,0.000268,0.002971,0.002,0.004529,0.002477,0.002624,0.006233,0.002536,0.002018,0.00118,0.001877,0.002342,0.00339,0.001292,0.000479,0.003207,0.003957,0.004533,0.003382,0.002774,0.00542,0.00053,0.002026,0.003892,0.003086,0.005374,0.004683,0.001151,0.00053,0.002928,0.001812,0.002421,0.003025,0.002093,0.002184,0.003202,0.001898,0.002574,0.001788,0.001815,0.001329,0.00037,0.000165,0.000627,0.000597,0.000105,0.000289,0.000177,0.000695,0.000484,0.000489,8e-05,1.6e-05,0.000145,0.000539,0.000172,0.000155,0.000176,0.000419,0.000568,0.000347,0.000424,0.000234,0.000195,0.000641,0.000837,0.00062,0.000418,0.000184,0.000107,0.000127,0.000145,0.000115,6.9e-05,2.7e-05,4.3e-05,4.2e-05,1.5e-05,1.5e-05,2.5e-05,6.2e-05,2.7e-05,5.7e-05,4.3e-05,5.1e-05,7.7e-05,3.9e-05,2.8e-05,4.4e-05,1.7e-05,2.2e-05,4.9e-05
1.1e-05,1.7e-05,2.1e-05,2.1e-05,2e-06,2.4e-05,1.6e-05,1e-05,1.6e-05,1.6e-05,8e-06,1.1e-05,1.2e-05,1.6e-05,1.5e-05,6e-06,2.4e-05,2.9e-05,3e-05,0.000403,0.000337,0.000179,0.00028,6.9e-05,0.000342,0.001201,0.000533,0.000446,0.000317,0.000394,0.001956,0.000717,0.003388,0.005419,0.003593,0.002044,0.001783,0.00142,0.001213,0.001816,0.001468,0.00181,0.001407,0.001032,0.002139,0.00053,0.003675,0.004009,0.002549,0.001517,0.001231,0.002012,0.002138,0.00116,0.00295,0.001957,0.002557,0.00147,0.00122,0.000779,0.000397,0.001872,0.001194,0.001764,3.1e-05,0.001547,0.00083,0.001556,0.00037,0.000423,0.000349,0.000138,0.000654,0.000377,0.000204,0.000286,0.000132,0.00048,0.000253,0.000319,0.000401,5.1e-05,0.000176,0.00038,6.4e-05,0.000121,6.8e-05,0.000315,0.000332,0.000287,0.00016,0.00011,0.000159,0.000231,0.000667,0.000612,0.00041,0.000128,4.1e-05,2e-05,9.5e-05,6.9e-05,2.6e-05,5.7e-05,1.1e-05,1.6e-05,2.3e-05,4.1e-05,2.6e-05,6.3e-05,2e-05,2.2e-05,2.1e-05,4.5e-05,5.5e-05,3.8e-05,5.8e-05,2e-05,1.5e-05,1.1e-05,1.8e-05
2.3e-05,6e-06,1.6e-05,8e-06,5e-06,1.7e-05,8e-06,1.3e-05,1.3e-05,1.5e-05,1.7e-05,9e-06,1.3e-05,1e-05,4e-06,4e-06,1.3e-05,1.1e-05,1.3e-05,0.000341,6e-06,4.1e-05,0.000204,0.000178,0.000508,0.001406,0.00113,0.00023,0.000148,0.000254,0.001636,0.001274,0.002,0.001578,0.000913,0.000955,0.002276,0.00203,0.000677,0.001076,0.001376,0.001281,0.00114,0.000419,0.002444,0.00226,0.001102,0.001868,0.003497,0.002141,0.00126,0.001688,0.000435,0.001903,0.001807,0.001795,0.001287,0.000984,0.001038,0.001128,0.001076,0.000566,0.000336,0.001427,0.001029,0.001123,0.001098,0.001176,0.000476,0.000135,0.000209,0.000231,0.000628,0.00037,0.000231,0.000244,3e-04,0.00035,0.000113,0.000313,6.9e-05,5.6e-05,7.2e-05,0.000222,0.000176,0.000136,0.00014,0.000235,0.000103,0.000116,0.000176,0.000133,8.6e-05,0.000254,0.000438,0.000266,5.6e-05,2.3e-05,1.5e-05,3.6e-05,6.1e-05,7.8e-05,5.1e-05,4.9e-05,1.5e-05,7e-06,8e-06,3.6e-05,1.9e-05,5.8e-05,3.6e-05,3.1e-05,1.4e-05,2.7e-05,2.5e-05,2.9e-05,3.3e-05,2.4e-05,2.7e-05,1.3e-05,1e-05
9e-06,5e-06,1.1e-05,8e-06,5e-06,8e-06,7e-06,1.3e-05,1.5e-05,8e-06,9e-06,1.1e-05,1.4e-05,1.4e-05,1.6e-05,1.2e-05,1e-05,1e-05,1.1e-05,0.000133,6.5e-05,3.1e-05,4e-05,2.8e-05,0.000194,0.00033,9.7e-05,9.6e-05,5.3e-05,9.9e-05,0.000581,0.000754,0.000782,0.00027,0.000607,0.000752,0.000781,0.000586,0.000567,0.000151,0.000397,0.000792,0.000288,0.000432,0.000744,0.001124,0.000964,0.000773,0.000726,8.3e-05,0.000395,0.000452,0.000582,0.000536,0.000345,0.000144,0.000246,0.000433,0.000685,0.000354,0.000514,0.000688,0.000406,0.000425,0.000432,0.00056,0.000213,0.000193,0.000141,9.9e-05,6.2e-05,6e-05,0.000191,8.7e-05,2.9e-05,1.1e-05,0.000118,0.000132,1e-04,7.4e-05,8.7e-05,4.9e-05,5e-05,3.6e-05,2.9e-05,2.4e-05,6e-05,6.2e-05,2.6e-05,1.5e-05,2.2e-05,3e-06,2.1e-05,0.000134,0.000139,5.4e-05,3.3e-05,5.2e-05,1.5e-05,1.1e-05,2.2e-05,1.5e-05,6e-06,6e-06,1.5e-05,7e-06,4e-06,1.1e-05,1.8e-05,3.6e-05,2.4e-05,2.6e-05,2.1e-05,2.5e-05,3e-05,2.8e-05,2.2e-05,2.5e-05,2.1e-05,1.9e-05,1.8e-05
3e-06,3e-06,5e-06,1e-06,3e-06,7e-06,8e-06,7e-06,6e-06,8e-06,6e-06,1e-05,3e-06,4e-06,9e-06,4e-06,1e-06,1e-06,5e-06,0.000105,7.2e-05,2.2e-05,2.7e-05,2.4e-05,0.000137,0.000188,0.000402,3e-05,2.8e-05,8.5e-05,0.00047,0.00036,0.000757,0.000942,0.00086,0.000521,0.000134,0.000925,0.000414,0.000478,0.000607,0.000666,0.000529,0.000218,0.000218,0.000633,0.00079,0.000671,0.000569,0.000202,0.000357,0.000574,0.000336,0.000173,0.000738,0.000557,0.000204,0.000457,0.00015,7.8e-05,0.000401,0.000435,3.7e-05,0.00023,0.000365,0.000284,0.000189,0.000211,6.5e-05,5.2e-05,4.4e-05,2.7e-05,6.1e-05,5.4e-05,6.7e-05,3e-05,7.1e-05,0.000104,3.7e-05,7.1e-05,3.5e-05,3.9e-05,2.3e-05,6.7e-05,1.3e-05,2.2e-05,3.3e-05,6.8e-05,1.8e-05,6e-06,3e-06,3e-06,4.2e-05,7.8e-05,9.6e-05,8.9e-05,2.9e-05,1.6e-05,2.1e-05,1.5e-05,1e-05,1.3e-05,1.2e-05,1.7e-05,5e-06,7e-06,4e-06,2e-06,9e-06,3.4e-05,7e-06,1.5e-05,5e-06,1.5e-05,1.1e-05,1.7e-05,4e-06,9e-06,2e-06,1.1e-05,6e-06
4e-06,3e-06,0,3e-06,0,6e-06,2e-06,6e-06,5e-06,2e-06,4e-06,3e-06,2e-06,3e-06,4e-06,2e-06,2e-06,2e-06,3e-06,7.6e-05,1.1e-05,3e-05,3.2e-05,3e-05,6.1e-05,6.7e-05,0.000248,0.000193,0.000104,8e-05,0.000437,0.000466,0.000217,0.000521,0.000452,0.00087,0.000533,0.000237,0.000552,0.000624,0.000239,0.000316,0.000231,0.000275,0.000554,0.000721,0.000905,0.000433,9e-05,0.000595,0.000299,0.000392,0.000288,0.000274,0.000176,0.00045,0.000249,0.000345,0.000506,0.000178,0.000464,0.000262,9.5e-05,0.000274,8.9e-05,0.000314,0.00032,0.000105,4.7e-05,2.2e-05,6.6e-05,6e-05,7.3e-05,2.9e-05,6.6e-05,4.7e-05,9e-06,8.3e-05,6.7e-05,2.3e-05,3.1e-05,3.1e-05,1.3e-05,6.4e-05,2.1e-05,2.8e-05,1e-05,3.9e-05,1.8e-05,2e-05,1.5e-05,1.9e-05,3.6e-05,8.2e-05,5.7e-05,3e-06,2.3e-05,1.5e-05,2.6e-05,1.8e-05,5e-06,1.3e-05,8e-06,4e-06,7e-06,2e-06,3e-06,6e-06,1e-05,2.9e-05,2e-06,1.1e-05,8e-06,5e-06,1e-05,3e-06,4e-06,7e-06,7e-06,5e-06,5e-06
3e-06,4e-06,3e-06,2e-06,1e-06,4e-06,1e-06,4e-06,2e-06,2e-06,2e-06,3e-06,2e-06,3e-06,3e-06,1e-06,2e-06,2e-06,4e-06,7.5e-05,5.9e-05,2.6e-05,1.1e-05,2.6e-05,2e-05,0.000195,0.000186,0.000137,9.5e-05,0.000151,0.000336,0.000718,0.000552,0.00033,0.000603,0.000451,0.000249,0.000426,0.000286,0.000367,0.000228,0.000281,0.000455,0.000282,0.000775,0.000311,0.000146,0.000467,0.000314,0.000557,0.00056,0.000498,0.000467,0.000582,0.000221,0.000513,0.00035,0.00012,0.000396,0.000361,0.000366,0.000324,0.000171,0.000153,9.5e-05,0.000243,0.000189,8e-05,9.1e-05,0.000105,1.9e-05,4.6e-05,2.1e-05,4.3e-05,2.9e-05,4e-05,2.1e-05,1.3e-05,3e-05,3.2e-05,1.9e-05,4e-06,5e-06,3e-05,9e-06,1.7e-05,3.4e-05,4e-05,1.4e-05,1e-05,1.1e-05,1.7e-05,2.3e-05,4.3e-05,5.7e-05,7.9e-05,1.4e-05,6e-06,2.2e-05,9e-06,1e-05,8e-06,1.2e-05,1.1e-05,1.3e-05,6e-06,3e-06,6e-06,5e-06,2.9e-05,2e-06,0,5e-06,9e-06,9e-06,9e-06,3e-06,5e-06,5e-06,3e-06,4e-06
2e-06,4e-06,1e-06,0,2e-06,5e-06,1e-06,3e-06,3e-06,4e-06,3e-06,2e-06,2e-06,2e-06,4e-06,1e-06,1e-06,1e-06,3e-06,8.3e-05,3.7e-05,1.1e-05,2.4e-05,2.1e-05,2.9e-05,0.000192,0.000306,0.000185,9.2e-05,0.000145,0.000227,0.00068,0.000194,0.000451,0.000515,0.000582,0.000306,0.000235,0.000659,0.000173,0.000369,0.000188,1.3e-05,0.000327,0.000692,0.000558,0.000202,0.000197,0.000526,0.000364,0.000331,0.000389,0.000503,0.000243,0.000506,0.00065,0.000513,0.000261,0.000376,0.000275,0.000226,0.000253,2.5e-05,0.00018,8e-05,0.000249,0.000155,7.1e-05,4.7e-05,3.4e-05,3.7e-05,4.2e-05,1e-05,3e-05,5.9e-05,2.3e-05,2.6e-05,1e-05,1.5e-05,1.1e-05,2.9e-05,8e-06,1.9e-05,2.6e-05,1.1e-05,1.6e-05,2.7e-05,3.9e-05,1.4e-05,1.1e-05,1.4e-05,1.4e-05,5e-06,6.5e-05,7.5e-05,6e-06,7e-06,1.1e-05,2e-05,3e-06,1e-06,6e-06,5e-06,2e-05,5e-06,2e-06,7e-06,9e-06,5e-06,2.6e-05,9e-06,8e-06,4e-06,7e-06,7e-06,1e-06,7e-06,5e-06,2e-06,4e-06,4e-06
3e-06,1e-06,1e-06,1e-06,1e-06,3e-06,3e-06,1e-06,2e-06,3e-06,1e-06,2e-06,2e-06,1e-06,4e-06,1e-06,2e-06,2e-06,1e-06,9.7e-05,4.8e-05,3e-06,2.6e-05,1.7e-05,2.5e-05,0.000146,0.000105,7.7e-05,7.8e-05,0.000277,0.000237,0.000175,0.000611,0.000205,8.3e-05,0.000533,0.000564,0.000486,0.000316,2e-04,0.000585,0.000845,0.000301,0.000159,0.000747,8.9e-05,4e-04,0.000331,0.000875,0.000103,0.000408,0.000486,0.000579,0.000183,0.000211,0.000446,0.000301,8.2e-05,0.000242,0.000262,0.000289,0.000173,4.2e-05,0.000196,7.7e-05,0.000219,0.000141,7.1e-05,1.2e-05,3.9e-05,1.3e-05,2.4e-05,1.4e-05,2.8e-05,2.2e-05,2.8e-05,2.8e-05,1.8e-05,1.8e-05,1.8e-05,3.4e-05,2.6e-05,2.8e-05,4.8e-05,1.8e-05,1.7e-05,2.7e-05,3e-05,1.7e-05,1.8e-05,8e-06,6e-06,2e-05,5.3e-05,0.000102,8.4e-05,3.3e-05,3.8e-05,1.7e-05,1.2e-05,1.3e-05,6e-06,5e-06,1.1e-05,3e-06,5e-06,7e-06,0,6e-06,2.3e-05,1e-05,7e-06,7e-06,3e-06,5e-06,9e-06,1e-06,4e-06,3e-06,6e-06,3e-06
2e-06,1e-06,2e-06,0,1e-06,0,1e-06,2e-06,0,2e-06,3e-06,2e-06,3e-06,1e-06,6e-06,2e-06,3e-06,2e-06,3e-06,0.000103,2.5e-05,1.3e-05,2.1e-05,1.2e-05,2.9e-05,8.1e-05,7.6e-05,8.3e-05,0.000117,0.00029,0.000751,0.000395,0.000551,0.000683,0.000339,0.000454,0.000279,3e-04,0.000177,0.000143,0.000418,0.000251,0.000393,0.00012,0.000557,0.00036,0.000423,0.000266,0.000805,0.000689,0.000102,0.000443,0.000289,0.000187,0.000203,0.000325,0.000338,5.9e-05,0.000118,0.000195,0.000268,0.000225,5.5e-05,0.000187,8.6e-05,0.000239,0.000148,6e-06,6.3e-05,2.7e-05,2.5e-05,3.3e-05,4.6e-05,6e-06,6.3e-05,2.8e-05,2.7e-05,4.1e-05,2e-05,1.6e-05,3.4e-05,2.1e-05,8e-06,1.9e-05,1e-05,8e-06,2.5e-05,3.8e-05,1.2e-05,1.9e-05,2e-05,5e-06,2.6e-05,6.3e-05,8.4e-05,3.7e-05,0.000131,7.6e-05,3.8e-05,2.3e-05,9e-06,1.6e-05,1.8e-05,1.2e-05,8e-06,8e-06,2e-06,3e-06,8e-06,2.8e-05,7e-06,1e-05,1.2e-05,6e-06,7e-06,8e-06,1e-06,4e-06,2e-06,6e-06,2e-06
1e-06,1e-06,1e-06,3e-06,3e-06,2e-06,3e-06,3e-06,2e-06,2e-06,2e-06,1e-06,3e-06,5e-06,2e-06,3e-06,2e-06,3e-06,3e-06,9.4e-05,5.4e-05,2.3e-05,2.3e-05,1.2e-05,1.9e-05,6.5e-05,0.000148,9.3e-05,0.000207,0.000447,0.00051,0.00038,0.000392,0.000332,0.000834,0.000421,0.000459,0.000176,0.000325,0.000347,0.000178,0.000138,4.7e-05,0.000149,0.00043,0.000376,0.000204,0.000453,0.000453,0.000469,0.000175,0.000436,0.000145,0.000103,0.000255,0.000147,0.000303,8.7e-05,0.000165,5e-05,0.000166,0.000174,6.5e-05,9.5e-05,6.2e-05,0.000296,0.000161,0.000165,4.2e-05,2.4e-05,3.2e-05,4.7e-05,7.1e-05,6.8e-05,8.9e-05,3.2e-05,3e-05,5.3e-05,2.1e-05,2.1e-05,2.3e-05,2.2e-05,3.7e-05,5.4e-05,1.3e-05,2.8e-05,1.7e-05,1.6e-05,2.6e-05,2e-05,1.5e-05,1.9e-05,2.5e-05,7.1e-05,9e-05,0.000152,0.000129,8.9e-05,8.5e-05,3.8e-05,2e-05,1.9e-05,5e-06,1.4e-05,3e-06,5e-06,8e-06,1e-06,5e-06,2.6e-05,1.1e-05,1e-05,1.3e-05,6e-06,6e-06,3e-06,4e-06,4e-06,1e-06,5e-06,5e-06
2e-06,1e-06,1e-06,2e-06,1e-06,5e-06,1e-06,3e-06,2e-06,0,1e-06,2e-06,2e-06,1e-06,1e-06,2e-06,1e-06,4e-06,1e-06,8.8e-05,5.4e-05,1.5e-05,2.7e-05,2.1e-05,2e-05,6.5e-05,0.000143,7.6e-05,0.000151,0.000243,0.00052,0.000596,0.000556,0.000792,0.000779,0.000474,0.000203,4.2e-05,0.000158,0.000386,0.000493,0.000575,0.000254,0.000133,0.000306,0.000515,0.000153,0.000479,0.000375,0.000113,0.000252,0.000533,0.000193,3e-05,0.000136,0.000205,0.000282,0.000152,3.4e-05,0.000145,0.000146,0.000126,0.000159,0.000181,0.000169,0.000147,0.000104,0.00014,0.000105,6.6e-05,3.8e-05,8.4e-05,0.000136,7.5e-05,2.2e-05,4.2e-05,1.2e-05,6.4e-05,4.4e-05,4e-05,3.7e-05,1.6e-05,4.8e-05,3.1e-05,2.5e-05,2.7e-05,2e-05,4.4e-05,1.8e-05,1.8e-05,2.8e-05,3.8e-05,3.1e-05,8.3e-05,0.000251,0.000276,0.000208,0.000102,7.3e-05,4.3e-05,2.5e-05,1.7e-05,6e-06,1.3e-05,9e-06,4e-06,3e-06,3e-06,3e-06,2.1e-05,1.3e-05,1.6e-05,7e-06,8e-06,1.3e-05,9e-06,4e-06,3e-06,1e-06,6e-06,3e-06
2e-06,1e-06,1e-06,1e-06,2e-06,4e-06,2e-06,2e-06,1e-06,1e-06,0,2e-06,1e-06,1e-06,3e-06,1e-06,2e-06,2e-06,1e-06,8.9e-05,1.6e-05,2.8e-05,4.3e-05,2.1e-05,1.5e-05,7.3e-05,0.00024,0.000125,0.000184,0.000137,0.000445,0.000306,0.000183,6e-04,0.000146,0.000209,0.000257,0.000151,0.000291,0.000439,0.000199,0.000316,0.000203,0.000167,0.000195,0.000404,0.000541,0.000312,0.000317,0.000161,0.00033,0.000203,0.000292,7.8e-05,8e-05,0.000231,0.000206,0.000124,9.7e-05,7.6e-05,0.000214,9.6e-05,9.3e-05,0.000157,5.2e-05,3.1e-05,3.9e-05,9.7e-05,8.9e-05,6.4e-05,1.4e-05,7.1e-05,6.1e-05,3.5e-05,4.1e-05,4.9e-05,4.7e-05,5.1e-05,3.1e-05,3.6e-05,7e-06,1.9e-05,4.6e-05,8.2e-05,2.8e-05,3.9e-05,4.6e-05,2.2e-05,1.5e-05,1.1e-05,1.9e-05,2.2e-05,2.2e-05,7.6e-05,0.000288,8.8e-05,3.6e-05,3.9e-05,6.3e-05,2.6e-05,2.2e-05,1.9e-05,4e-06,9e-06,1.2e-05,3e-06,5e-06,8e-06,1.3e-05,2.4e-05,1e-05,1.2e-05,9e-06,7e-06,5e-06,1e-05,4e-06,2e-06,2e-06,8e-06,3e-06
1e-06,0,1e-06,3e-06,1e-06,3e-06,1e-06,1e-06,1e-06,2e-06,4e-06,4e-06,3e-06,4e-06,2e-06,2e-06,2e-06,1e-06,2e-06,8.9e-05,6.2e-05,2e-05,5.9e-05,3.2e-05,9e-06,7.9e-05,0.000239,0.000252,0.000285,0.000121,0.000144,0.000441,0.000269,0.00023,0.000238,0.000249,0.000102,6.3e-05,0.000184,0.000383,0.000434,0.000273,0.000122,0.000169,0.000254,0.000435,0.000279,0.000161,0.000353,0.000165,0.000299,0.000255,0.000254,0.000217,0.000118,0.000242,0.00021,1e-04,8.9e-05,0.000177,0.000232,4.6e-05,5.9e-05,0.000109,3.7e-05,0.000104,8.7e-05,8.1e-05,7.9e-05,5.9e-05,3.8e-05,6.1e-05,5.2e-05,4.2e-05,5.8e-05,5.9e-05,4.2e-05,4.3e-05,2.7e-05,3.4e-05,7e-06,6e-06,3.8e-05,4.5e-05,2.9e-05,1.8e-05,1.4e-05,3.4e-05,2.6e-05,1.8e-05,1.5e-05,7e-06,1.3e-05,0.000105,0.000195,3.5e-05,9.9e-05,5.1e-05,5e-05,3.5e-05,1.7e-05,8e-06,1.8e-05,1.7e-05,1e-05,8e-06,7e-06,3e-06,1.1e-05,1.7e-05,1e-05,1.4e-05,1.6e-05,8e-06,3e-06,4e-06,7e-06,5e-06,1e-06,5e-06,3e-06
2e-06,3e-06,1e-06,2e-06,2e-06,2e-06,1e-06,3e-06,2e-06,3e-06,3e-06,1e-06,4e-06,4e-06,3e-06,3e-06,2e-06,5e-06,4e-06,8.7e-05,5.4e-05,2.3e-05,3.9e-05,1.9e-05,1e-05,7.9e-05,9.8e-05,6.1e-05,0.000143,9.5e-05,9.6e-05,0.000165,0.000228,0.000387,0.000186,0.000155,0.000102,0.000218,0.000321,0.000286,0.000138,0.000203,0.00016,0.00025,0.000401,0.000375,0.000203,0.000223,0.000435,0.000258,0.000282,0.000153,0.000174,9.6e-05,0.000176,0.000248,0.000213,0.000118,0.000234,0.000171,0.000206,0.000168,0.000209,0.000245,7.8e-05,0.000109,1.2e-05,3e-05,8.6e-05,8e-05,5.6e-05,8.7e-05,5.1e-05,1.3e-05,2.3e-05,1.8e-05,3.4e-05,2.8e-05,4.6e-05,4.6e-05,7.3e-05,3.7e-05,3.3e-05,3.1e-05,1.6e-05,1.5e-05,1.9e-05,2.8e-05,1e-05,5e-06,1.7e-05,3e-05,1.9e-05,9.5e-05,0.000281,0.000151,0.000142,6.7e-05,1.2e-05,3e-05,1.1e-05,2.2e-05,1.8e-05,8e-06,1e-05,8e-06,4e-06,2e-06,9e-06,2.1e-05,9e-06,7e-06,8e-06,2e-06,9e-06,6e-06,4e-06,1e-06,4e-06,7e-06,2e-06
2e-06,4e-06,4e-06,3e-06,4e-06,2e-06,2e-06,3e-06,2e-06,2e-06,3e-06,2e-06,5e-06,6e-06,5e-06,3e-06,3e-06,5e-06,6e-06,7.8e-05,3.1e-05,3e-05,2.3e-05,2.8e-05,1.7e-05,5e-05,4.3e-05,3e-05,0.000244,0.000205,0.000247,0.000285,0.000188,0.000518,0.000613,0.000391,0.000274,0.000312,0.000114,0.000457,0.000297,0.000278,7.7e-05,0.000225,0.000347,9.4e-05,0.000218,0.000244,0.000445,0.00016,0.000333,0.000279,3.6e-05,3.1e-05,9.6e-05,6.3e-05,0.000225,0.000114,0.000159,0.000143,0.000154,0.000102,5.6e-05,6.5e-05,0.000108,8.9e-05,0.000139,7.1e-05,1e-04,5.7e-05,1.9e-05,3.7e-05,1.9e-05,2.9e-05,2.7e-05,4.1e-05,2.8e-05,4.4e-05,3.9e-05,2.3e-05,6.1e-05,2.2e-05,2.1e-05,1e-05,1.7e-05,5e-06,2.2e-05,2.8e-05,1.3e-05,2e-05,9e-06,3.8e-05,2.3e-05,8.8e-05,0.000145,0.000237,0.000241,0.000163,8.1e-05,7.2e-05,4.9e-05,3.7e-05,2.5e-05,1.2e-05,1e-05,5e-06,1.2e-05,9e-06,5e-06,7e-06,1.6e-05,6e-06,1e-06,7e-06,7e-06,1e-06,4e-06,3e-06,4e-06,6e-06,5e-06
1e-06,5e-06,3e-06,1e-06,2e-06,3e-06,2e-06,2e-06,2e-06,1e-06,3e-06,1e-06,2e-06,0,2e-06,1e-06,1e-06,4e-06,2e-06,7.1e-05,7e-05,2.2e-05,3.1e-05,1.3e-05,3e-06,6e-05,8.4e-05,3.3e-05,0.000312,0.000218,0.000252,0.000151,9.7e-05,0.000392,0.000313,0.000114,5.3e-05,0.000352,0.000298,0.000628,0.000443,0.000498,0.000248,0.000217,0.000104,0.000208,0.000365,0.000129,0.000309,0.000194,0.000312,0.000324,0.000247,0.000136,5.5e-05,0.000344,0.000328,0.000133,0.000121,0.000139,0.000109,3.4e-05,8.1e-05,0.000151,6.9e-05,0.000123,0.000109,0.00012,7.2e-05,7.4e-05,4e-05,1.8e-05,4.5e-05,3.5e-05,4.6e-05,2.3e-05,2.3e-05,1.9e-05,7e-06,1.7e-05,2.4e-05,1.4e-05,1.8e-05,5.1e-05,2.3e-05,2.8e-05,3.6e-05,3.4e-05,1.6e-05,1.7e-05,9e-06,3.6e-05,2.1e-05,5.8e-05,0.000142,0.000134,6.5e-05,5.9e-05,6.1e-05,6.4e-05,3.6e-05,1.4e-05,7e-06,3e-06,1.2e-05,5e-06,1.1e-05,9e-06,5e-06,1.2e-05,1e-05,9e-06,1e-06,3e-06,7e-06,4e-06,6e-06,2e-06,3e-06,4e-06,0
2e-06,2e-06,2e-06,2e-06,2e-06,1e-06,1e-06,2e-06,2e-06,2e-06,2e-06,2e-06,1e-06,1e-06,2e-06,1e-06,1e-06,4e-06,5e-06,7e-05,7.2e-05,3.1e-05,3.5e-05,1.5e-05,1.6e-05,9.4e-05,0.000169,0.000145,0.000236,0.000109,0.000274,0.00028,9.3e-05,0.000429,9.6e-05,0.000273,0.000266,0.000278,4.4e-05,0.000613,0.000314,0.000251,0.00019,0.000164,0.000324,8.8e-05,0.000264,0.000296,0.000165,0.000192,0.000242,0.000308,0.000168,0.000111,1.5e-05,0.000349,0.000172,0.000117,0.000263,0.000141,2.5e-05,7.8e-05,0.000122,0.000106,0.000116,0.000221,9.5e-05,0.000104,6.5e-05,3.8e-05,3.9e-05,4.2e-05,8.5e-05,6.7e-05,2e-05,3.2e-05,3.6e-05,2.3e-05,9e-06,1.8e-05,4e-05,1.5e-05,3.1e-05,3.1e-05,8e-06,3.8e-05,2.3e-05,2.5e-05,1.2e-05,1.9e-05,2.1e-05,5e-06,4e-06,5.9e-05,3.5e-05,4.8e-05,9.7e-05,6.8e-05,4.9e-05,4.7e-05,3.2e-05,1.4e-05,5e-06,3e-06,1.4e-05,1.3e-05,1.2e-05,7e-06,7e-06,1.9e-05,6e-06,4e-06,3e-06,1.2e-05,6e-06,6e-06,2e-06,2e-06,2e-06,1e-06,4e-06
1e-06,1e-06,2e-06,1e-06,2e-06,1e-06,2e-06,1e-06,1e-06,2e-06,1e-06,1e-06,2e-06,1e-06,1e-06,1e-06,1e-06,2e-06,2e-06,7.6e-05,3.6e-05,3e-05,2.4e-05,1.9e-05,1.2e-05,9.2e-05,6.5e-05,0.000196,0.000327,0.000245,0.000249,0.000372,0.000247,0.000551,0.000369,0.000294,0.000208,0.000295,0.000274,0.000552,0.000399,4.1e-05,4.1e-05,0.000176,0.000368,0.000229,0.000276,0.000107,3.9e-05,0.000113,0.000106,0.000274,0.000253,0.000189,8.2e-05,0.000339,0.000201,6.7e-05,0.000237,5.3e-05,5.6e-05,8.7e-05,1.6e-05,0.000171,0.00017,0.000182,0.000142,0.00018,4.6e-05,2.1e-05,4.4e-05,1.6e-05,8.3e-05,0.000115,5.4e-05,3.1e-05,2.5e-05,2.7e-05,2.8e-05,2.3e-05,4.6e-05,3.2e-05,2.1e-05,4.7e-05,2.5e-05,4.7e-05,1.1e-05,8e-06,2.8e-05,2.8e-05,2.2e-05,1.1e-05,7e-06,6e-05,0.000111,0.000151,6.9e-05,2.4e-05,5.9e-05,6.9e-05,4e-05,2.2e-05,4e-06,6e-06,9e-06,5e-06,9e-06,6e-06,5e-06,1.6e-05,8e-06,2e-06,3e-06,1.3e-05,9e-06,5e-06,1e-06,1e-06,1e-06,2e-06,2e-06
1e-06,0,0,2e-06,1e-06,1e-06,1e-06,2e-06,3e-06,1e-06,1e-06,0,2e-06,2e-06,1e-06,0,1e-06,1e-06,0,8.1e-05,3.2e-05,2.6e-05,2e-06,1.3e-05,6e-06,6.1e-05,0.000114,0.000122,0.000181,0.000159,0.000144,0.000243,0.000187,0.000401,6.4e-05,0.000321,0.00019,0.000318,0.000133,0.000398,0.000196,0.000133,0.000262,0.00023,0.000177,0.00043,0.000219,0.00015,9.4e-05,9.1e-05,0.000169,7e-05,5.3e-05,8.5e-05,0.000136,0.000171,0.000167,0.000107,0.000116,0.000178,0.000134,0.000114,8.5e-05,0.000234,0.000141,0.00018,0.000106,0.000246,0.000171,0.000126,4.1e-05,2e-05,0.00011,9.4e-05,7.7e-05,6.5e-05,5.3e-05,1.3e-05,2.8e-05,1.3e-05,2.5e-05,2.7e-05,2.9e-05,3.8e-05,3.9e-05,1.6e-05,3.3e-05,4.3e-05,3.2e-05,3.2e-05,2.8e-05,2.8e-05,2.6e-05,4.6e-05,8.3e-05,7.5e-05,9.6e-05,6.7e-05,4.6e-05,5e-06,1e-05,8e-06,7e-06,8e-06,5e-06,1e-06,1.1e-05,5e-06,3e-06,2e-05,9e-06,8e-06,7e-06,6e-06,5e-06,4e-06,1e-06,1e-06,1e-06,3e-06,1e-06
2e-06,1e-06,1e-06,2e-06,0,1e-06,1e-06,2e-06,2e-06,1e-06,1e-06,0,1e-06,1e-06,1e-06,1e-06,0,1e-06,1e-06,8.1e-05,3.4e-05,8e-06,1e-05,8e-06,3e-06,2.4e-05,4.7e-05,3.5e-05,0.00013,8.5e-05,0.000246,5.1e-05,0.000363,0.000469,2.5e-05,0.000348,0.000278,0.000248,0.000246,0.000213,0.000218,0.000137,0.000231,0.000108,0.00015,0.000161,0.000158,0.000161,0.000155,0.000107,2.7e-05,0.000233,0.000144,7.9e-05,0.000122,0.000276,5.8e-05,0.000186,0.000183,0.000174,0.00011,0.000124,2.4e-05,0.000199,6e-05,0.000163,0.000101,4e-05,8.8e-05,2.1e-05,1.7e-05,1e-05,8.6e-05,3.5e-05,3.6e-05,1.9e-05,3.4e-05,2.7e-05,2.1e-05,2.4e-05,4.2e-05,1e-05,1.8e-05,9e-06,4e-06,7e-06,2.3e-05,1.9e-05,1.6e-05,1.3e-05,7e-06,2.1e-05,1.3e-05,2.2e-05,7e-06,3.3e-05,9e-06,8e-06,4e-06,8e-06,1.4e-05,6e-06,6e-06,2e-06,2e-06,2e-06,7e-06,4e-06,4e-06,1.9e-05,3e-06,3e-06,5e-06,7e-06,1e-06,2e-06,0,1e-06,1e-06,1e-06,2e-06
1e-06,0,1e-06,2e-06,0,1e-06,0,2e-06,1e-06,0,0,0,0,1e-06,1e-06,0,0,1e-06,0,7.7e-05,3.1e-05,3e-06,9e-06,2e-06,6e-06,1.4e-05,5.5e-05,4.7e-05,6.1e-05,1.1e-05,0.00024,5e-05,0.000263,0.000279,7.9e-05,0.000139,8.9e-05,0.000139,0.000238,7.3e-05,0.000234,0.000231,0.000216,0.000234,0.000256,0.000148,0.000143,0.000203,0.000148,3.8e-05,1e-04,0.000139,0.000151,0.000101,4.5e-05,0.000254,0.000169,6.1e-05,0.000124,7.6e-05,0.000125,3.5e-05,3.5e-05,0.000116,7.2e-05,0.000162,6.3e-05,1.5e-05,2.9e-05,6.4e-05,2e-06,4e-06,3.8e-05,4e-06,2e-05,1.8e-05,1e-05,1.4e-05,1.3e-05,5e-06,2e-05,7e-06,1e-05,1.6e-05,2e-06,9e-06,1.7e-05,1.3e-05,5e-06,8e-06,4e-06,9e-06,4e-06,1.3e-05,2e-05,1.8e-05,1.5e-05,1.1e-05,6e-06,5e-06,6e-06,2e-06,3e-06,4e-06,1e-06,1e-06,5e-06,3e-06,2e-06,1.8e-05,1e-06,4e-06,5e-06,5e-06,3e-06,2e-06,1e-06,2e-06,1e-06,2e-06,1e-06
1e-06,1e-06,1e-06,2e-06,0,1e-06,0,2e-06,1e-06,1e-06,1e-06,0,0,1e-06,1e-06,0,0,1e-06,1e-06,7.4e-05,2.7e-05,3e-06,5e-06,2e-06,5e-06,1.1e-05,3.5e-05,4.3e-05,3.5e-05,2.2e-05,0.00022,7.5e-05,0.000214,0.000288,5.4e-05,0.000138,5.4e-05,7.6e-05,0.000243,7.4e-05,0.000196,0.000187,0.000162,0.000174,0.00031,0.000154,0.000145,2e-04,6.6e-05,5.4e-05,0.000111,0.000161,0.000197,8.6e-05,8.8e-05,0.000253,0.000225,9.1e-05,0.000134,0.000128,9.1e-05,4.6e-05,2.3e-05,0.000133,8.8e-05,0.000142,5.6e-05,2.5e-05,8e-06,3.8e-05,7e-06,7e-06,2.7e-05,8e-06,1.7e-05,7e-06,9e-06,1.2e-05,1.2e-05,7e-06,2.6e-05,9e-06,5e-06,1.7e-05,5e-06,9e-06,1.9e-05,1.4e-05,1e-06,6e-06,4e-06,7e-06,2e-06,1e-05,1.5e-05,7e-06,9e-06,1.1e-05,5e-06,3e-06,2e-06,3e-06,2e-06,3e-06,0,1e-06,5e-06,3e-06,2e-06,1.8e-05,2e-06,5e-06,4e-06,5e-06,3e-06,3e-06,0,1e-06,0,2e-06,1e-06
