-0.000479,-0.000102,-0.000632,-0.000609,-0.000928,-0.000707,-0.000657,-0.000432,-0.000355,-0.000394,-0.000548,-0.000374,-2.8e-05,-0.000142,-0.000396,-0.000608,-0.000784,-0.000522,-0.000347,-0.000313,-0.000421,-0.000286,-7.6e-05,-0.000354,-0.000174,1.8e-05,-2.5e-05,-0.00049,-0.000349,-0.000311,-0.000249,-0.000303,-0.000216,-0.000259,-7.9e-05,-0.000217,-0.000373,-0.000506,-0.000575,-0.000568,-0.00055,-0.00044,-0.00044,-0.00036,-0.00021,-0.000223,-0.00023,-0.000529,-0.000294,-0.000353,-0.000366,-0.000308,-0.000394,-0.000267,-0.00032,-0.000523,-0.000451,-0.000682,-0.000366,-0.000333,-0.00034,-0.000422,-0.000563,-0.000134,-0.000136,-0.000121,-0.000147,-0.000173,-9.9e-05,-8e-05,-7.8e-05,-0.000277,-4.8e-05,-0.000216,-0.000435,-0.000213,-0.00036,-9.4e-05,-0.000358,-0.000436,-0.000202,-0.000225,-0.000366,-0.000344,-0.000312,-0.000365,-0.000559,-0.000555,-0.000305,-0.000332,-0.000383,-0.000377,-0.000425,-0.000535,-0.000327,-0.000481,-0.000422,-0.000272,-0.00018,-0.000344,-0.000361,-0.000613,-0.000432,-0.00023,-2.4e-05,-0.000226,-0.000226,-0.000387,-0.000352,-0.000411,-0.000198,-0.000205,-0.000473,-0.000315,-3e-04,-0.000229,-0.000319,-0.000279,-0.000108,-2.5e-05,-0.000102
5.9e-05,-0.000212,-0.000264,-0.000495,3.3e-05,8.5e-05,5.5e-05,-0.000151,-0.000302,-0.000281,-0.00012,8.7e-05,-9.1e-05,-0.000124,-0.000142,-0.00025,-1.6e-05,-1.7e-05,-2.9e-05,-8.7e-05,-0.000133,-0.000203,-5.5e-05,1.2e-05,-3.8e-05,-0.000227,-8.2e-05,-0.000185,-0.00031,-0.000165,-0.00015,-0.000384,-0.000252,-7.9e-05,0.000197,-3e-06,1e-06,-7.8e-05,-1.4e-05,1e-05,5.2e-05,-0.000182,-0.000293,-0.00017,6.6e-05,-0.000394,-0.000278,-0.000127,-0.000212,5e-06,-6.5e-05,1e-06,-3.8e-05,-7.3e-05,-8.6e-05,8.2e-05,-3.4e-05,0.000107,-0.000194,-0.000238,-8.9e-05,5.3e-05,0.000108,4.7e-05,0.000175,-3e-06,2.1e-05,-0.000139,-0.000216,-0.000114,-0.000201,-5.4e-05,-0.000161,-6e-05,-0.000136,-0.000141,2.3e-05,-7e-05,-9.7e-05,-0.000142,-0.000345,-0.000217,-4.6e-05,-3.4e-05,-3e-06,-0.00015,5.6e-05,-7e-05,-0.000189,-0.000265,-0.00028,-0.000227,-0.000165,-1.7e-05,-1.9e-05,3.1e-05,-9.8e-05,-0.000294,-0.000168,9.4e-05,-0.000123,9.5e-05,-0.000144,-6.9e-05,-6e-06,5.3e-05,-0.000225,-3.9e-05,-3.6e-05,5.2e-05,-5.2e-05,-8e-05,-3.8e-05,3.7e-05,-8.8e-05,-9.5e-05,2e-06,-0.000215,-0.000166,-0.000312,-0.000142
-0.000151,9e-06,0.00019,0.000539,0.000552,0.000275,-0.000103,6.4e-05,9e-05,3.9e-05,7.4e-05,-0.000158,-0.000287,5e-06,0.000163,0.000364,0.000218,-1.8e-05,-0.000121,7.2e-05,-3.2e-05,6.4e-05,2.4e-05,0.000168,0.000122,0.000272,-0.000188,0.000218,0.00024,0.000244,0.00012,0.000321,0.00022,0.000116,-0.000206,0.000105,0.000141,0.000205,0.000228,0.000132,0.000186,0.00012,0.000169,7.8e-05,4e-06,0.000334,0.00026,0.000318,0.000248,1e-05,5.1e-05,-3.7e-05,6.2e-05,-2.7e-05,0.000254,4.5e-05,9.2e-05,1.7e-05,0.000175,0.000405,0.000239,0.000127,0.000114,6.3e-05,-5.6e-05,-3e-05,-4.7e-05,9.3e-05,3e-05,0.000107,1.5e-05,-6.7e-05,0.000112,0.000153,-9.8e-05,0.000161,-0.00015,0.000151,0.000124,0.000251,0.000227,-0.000157,-0.000149,0.000163,-1.3e-05,0.000152,0.000149,0.000144,0.000176,9.7e-05,0.000224,0.000328,0.000113,0.000189,0.000136,-6e-06,-0.000203,-7.8e-05,0.000141,0.000132,0.00014,6.3e-05,0.000115,0.000107,4.3e-05,-0.000145,5.6e-05,3.6e-05,-0.000112,0.000155,8.1e-05,3.2e-05,-0.000108,6.8e-05,4e-06,1.2e-05,8.9e-05,0.000212,1.6e-05,0.000138,0.000109
-0.00019,-4.1e-05,-3e-05,-0.000291,-0.000595,-0.000436,-3.3e-05,-0.00019,-0.000102,8.6e-05,5.8e-05,0.000159,-0.000124,-7.1e-05,-0.000398,-0.000543,-0.000321,-0.000286,-0.000137,-0.000146,-0.000185,-0.000221,-0.000184,-0.000254,3e-06,-1.9e-05,-0.000122,5.2e-05,-0.000346,-0.000151,-1.1e-05,-0.000244,-1.2e-05,-2.1e-05,-0.00029,-0.000448,-0.000198,-0.000368,-0.000212,-0.000385,-0.000147,-8.8e-05,-0.000127,2.8e-05,-5.7e-05,-0.000432,-0.000168,-0.000265,-0.00043,1.2e-05,4.4e-05,-0.000233,-4.8e-05,-0.000111,-0.000322,-0.000242,-0.000126,-0.000219,-0.000206,-0.000253,-0.000507,-0.00028,-0.000251,-0.000167,-9.2e-05,-8.8e-05,-0.000144,-0.000277,-0.000239,-0.000164,-4.6e-05,-0.000209,-0.000265,-0.000351,-0.000123,-0.00034,-9.1e-05,-0.000221,-6.7e-05,-6.4e-05,-1.8e-05,0.000115,-9e-05,-0.000103,-0.000147,-0.00015,-0.000107,-9.6e-05,-2.3e-05,-9.3e-05,-0.000169,-0.000239,-0.000227,-0.000335,-0.000124,1.1e-05,0.00017,6.7e-05,-3.8e-05,-0.000198,-0.000131,-0.000141,-3e-05,-0.000142,-0.000104,1e-06,-0.000195,-0.000196,-6.4e-05,-0.000162,-0.000256,-0.00015,5.6e-05,3.3e-05,2e-06,1.2e-05,-5e-05,-0.000103,-0.000204,-4.7e-05,-0.000138
0.000272,-5e-05,-4.5e-05,-0.000127,0.000242,0.000287,0.000168,0.000211,2e-05,-9.9e-05,-5.9e-05,6.5e-05,-0.000146,-4.5e-05,0.000139,0.000259,5.8e-05,0.000229,0.000148,0.000109,0.000166,0.000149,3.8e-05,0.000182,9e-05,9.5e-05,6.7e-05,8.3e-05,2e-06,9.3e-05,-3.5e-05,0.000116,2e-05,5.4e-05,-7e-05,0.000142,-2.2e-05,5.9e-05,-6e-06,0.000209,0.000186,-4.6e-05,0.000174,7e-05,0.000129,9.9e-05,-2.4e-05,4.9e-05,0.000274,-1.8e-05,-4.1e-05,-9e-06,7.6e-05,0.000182,0.000268,0.000194,0.000109,6.8e-05,0.000149,1.7e-05,-0.000124,0.000167,0.000199,6e-05,-8.5e-05,-8.1e-05,0.000112,0.000221,0.000239,2.7e-05,-2.4e-05,0.000107,5.7e-05,5.2e-05,0.000144,0.000185,0.000143,-2.2e-05,9.5e-05,-4.7e-05,6.2e-05,5e-05,6.1e-05,6.7e-05,0.00011,8.1e-05,0.000108,-4.1e-05,0.000112,0.000217,9.5e-05,0.000274,0.000194,0.000128,7e-06,6.5e-05,7e-05,6.7e-05,-1.4e-05,-9e-06,3e-06,4e-05,-6.5e-05,-1.8e-05,6.9e-05,-6.6e-05,8.4e-05,0.000223,0.000163,0.000162,0.00018,9.2e-05,2e-05,-8.3e-05,-4e-06,1e-05,6e-06,9.2e-05,0.000156,-0.000108,6e-05
-0.000239,-5.6e-05,0.000121,0.000157,-9.1e-05,-0.000242,-0.000229,-0.00013,2e-06,3.6e-05,-5.1e-05,-0.00015,-0.000126,-0.000145,-0.000215,-0.000208,-1e-05,-0.000141,6.1e-05,8e-06,2.1e-05,-8.4e-05,7e-06,6.9e-05,-2e-06,0.000155,9.2e-05,0.000139,-2e-06,-4.4e-05,4.7e-05,3.3e-05,-7.2e-05,-2e-05,0.000114,-0.000106,2e-06,-3.5e-05,0.00019,-0.000134,-0.000236,0.000162,-7.5e-05,-0.000114,-4e-05,-3e-06,-4e-05,6.8e-05,-6e-05,0.000136,6.7e-05,-1.3e-05,-2.1e-05,-0.00012,-3.5e-05,-9e-06,-8.1e-05,5.9e-05,-4.6e-05,2.1e-05,0.000179,-9.1e-05,-7e-05,3e-05,1.5e-05,-6.1e-05,1.1e-05,-6.8e-05,-4e-06,-7.4e-05,6e-05,1.5e-05,9e-06,-7.5e-05,-6.9e-05,-0.00015,-4.7e-05,5.6e-05,-0.000117,-1.8e-05,0.00011,6e-06,0.00012,7.7e-05,-7.3e-05,-0.000121,-5e-06,1.1e-05,-1.2e-05,-6.6e-05,4.3e-05,-6.6e-05,-0.000212,0.000117,-5e-05,-2.7e-05,-3e-05,2e-06,2.5e-05,7.9e-05,-4.5e-05,-1.1e-05,4.9e-05,-0.000134,-0.000149,9.9e-05,0.000128,3.7e-05,-4.1e-05,-0.000173,-7.8e-05,7e-06,3.3e-05,2.7e-05,6.8e-05,1e-06,0.000145,-9e-06,1e-05,-2.5e-05,-0.000144
3.7e-05,0.000121,0.000111,9e-06,0.000331,0.000109,0.000202,6e-05,0.000143,-3.7e-05,7.9e-05,-1.6e-05,-1.1e-05,-2e-04,1.9e-05,9.2e-05,-8.5e-05,4.3e-05,-8.1e-05,-1.6e-05,-0.000114,1.2e-05,-2.3e-05,6e-05,-0.000161,-0.000122,-0.000178,-1.4e-05,-5.7e-05,-5.4e-05,-2.9e-05,-3.4e-05,1.1e-05,4.4e-05,-7.3e-05,0.000141,-4.2e-05,6.5e-05,-4e-05,4e-05,0.000113,-0.000129,0.000103,8.2e-05,2.2e-05,4.7e-05,-1.1e-05,-0.000133,0.000146,-0.000122,-0.000111,7.4e-05,0.000116,-5e-05,4e-06,5.2e-05,5.2e-05,5.8e-05,-6.3e-05,-1.5e-05,-9.7e-05,-3.6e-05,9e-05,-0.000105,6.1e-05,0.000114,-4e-06,2.3e-05,-0.000101,1.1e-05,4.4e-05,-3e-06,-3.8e-05,-7.6e-05,7.5e-05,2.1e-05,2.4e-05,-8.3e-05,1.7e-05,1.8e-05,-7.4e-05,-5.1e-05,-9.1e-05,1.2e-05,2.9e-05,-2e-06,6.2e-05,8.1e-05,-7.8e-05,-2.1e-05,-0.000159,-1.9e-05,0.000168,-0.000167,-1.7e-05,3.1e-05,-2.2e-05,-8.4e-05,4.2e-05,-4.1e-05,9.7e-05,-1.9e-05,-7.7e-05,1.4e-05,-3.6e-05,3.5e-05,-1.9e-05,-0.000116,0.000148,8.5e-05,7.2e-05,1.1e-05,-3.1e-05,-4.8e-05,-3e-05,-6.9e-05,-0.000163,-1e-05,2.8e-05,3.7e-05,1.7e-05
5.3e-05,9.5e-05,-1e-06,-5.1e-05,-4.6e-05,-2.1e-05,-0.000239,-0.00013,-5.7e-05,4.2e-05,-6.8e-05,-8.7e-05,1.7e-05,8.8e-05,6e-06,0.000119,5.4e-05,-6.3e-05,-1.4e-05,2.3e-05,0.000146,6e-06,-0.000179,-2.6e-05,3.8e-05,7.9e-05,-2.3e-05,-5.1e-05,3.6e-05,7.9e-05,6e-05,-4e-06,5.4e-05,-5.1e-05,-3.5e-05,-0.000149,2.5e-05,-4.1e-05,-0.00016,-8.2e-05,-0.00019,5.9e-05,-0.000139,-0.000105,-0.000148,-0.000113,8.1e-05,8.5e-05,-1.8e-05,0.000101,8.6e-05,-5.7e-05,-8.6e-05,-4.3e-05,7e-06,-4.3e-05,-8e-05,-8.9e-05,-3.5e-05,-2.9e-05,2.1e-05,-9.5e-05,-0.000112,7e-06,-2.5e-05,-8.2e-05,-1.8e-05,-3.8e-05,1.9e-05,-9e-06,1.5e-05,2.1e-05,0.000149,4.6e-05,-4.8e-05,-6.8e-05,-8e-05,-6e-06,6e-05,1.9e-05,-6e-05,-4.5e-05,4e-06,-1.3e-05,1.5e-05,6.4e-05,-5.3e-05,-0.000104,0.000109,-8e-06,0.000109,0.000163,-1.8e-05,4.1e-05,-3.6e-05,-5e-06,-1e-06,-2.9e-05,-1.5e-05,-0.000111,-0.000107,-6e-05,-1.9e-05,8.2e-05,0,-6e-06,1.7e-05,6.3e-05,-5.9e-05,-9.1e-05,-0.000101,-1.7e-05,3.4e-05,-1.3e-05,1.7e-05,-6.8e-05,-2.7e-05,-5.4e-05,-4e-05,1.6e-05,4.6e-05
1.8e-05,-8.3e-05,-1.2e-05,-1.6e-05,4e-06,-5e-06,0.000168,0.000106,-8.6e-05,-7.1e-05,1.2e-05,7e-06,8.4e-05,4.3e-05,3.1e-05,-4.7e-05,-0.000165,-5.6e-05,-0.000145,-0.000158,-0.000174,-5.6e-05,0.000191,5e-05,-5.4e-05,2e-05,3.3e-05,-6.6e-05,-3.3e-05,-6.5e-05,-1.3e-05,-9.7e-05,-2.4e-05,7.3e-05,-1.8e-05,-4e-06,-5.2e-05,-2e-06,0.000132,7e-05,4.7e-05,-0.00018,-0.000137,3.8e-05,7.6e-05,0.000149,-3.8e-05,-3.3e-05,-9.5e-05,-0.00014,-1.5e-05,-3.7e-05,2.1e-05,7.4e-05,4.1e-05,-7.6e-05,6.4e-05,0.00012,9.3e-05,4.7e-05,1.2e-05,-4.6e-05,6e-05,3.7e-05,-1.4e-05,-1.5e-05,8.5e-05,-2.4e-05,-4.4e-05,-1.2e-05,6.2e-05,-3.5e-05,-6e-06,1.4e-05,3.3e-05,9.5e-05,0,4e-06,-6.3e-05,-4.7e-05,7.5e-05,-4.7e-05,-6.6e-05,-3.7e-05,3.7e-05,3.4e-05,1e-06,6.4e-05,-8.1e-05,-5.1e-05,-4.3e-05,-5.6e-05,-4e-06,-0.000122,3.1e-05,0.000107,1.7e-05,6.5e-05,-1.6e-05,-1.3e-05,2.4e-05,0.000113,-4e-06,-5.5e-05,-1.1e-05,2.1e-05,-6.2e-05,-8.1e-05,-6e-06,3.3e-05,1.9e-05,-6e-06,-2.3e-05,1e-06,-9.2e-05,7e-06,-3.8e-05,2e-06,-5.1e-05,-8e-06,6.8e-05
1e-06,-4.6e-05,-3.5e-05,7e-06,2.9e-05,-5.6e-05,-3.4e-05,4.1e-05,5.4e-05,1.4e-05,1e-05,3.1e-05,2.2e-05,0.000131,2.8e-05,3.1e-05,7e-05,6.2e-05,0.000113,9.3e-05,7.9e-05,6.9e-05,1.9e-05,3e-06,4.7e-05,6.8e-05,-5.1e-05,4.7e-05,-1.9e-05,0.000182,-1.7e-05,4.5e-05,4.1e-05,-2.5e-05,-2.9e-05,1e-06,0.000202,4.5e-05,-0.000116,2.7e-05,3.3e-05,0.000155,0.000119,7e-05,-6.5e-05,-3.8e-05,-0.000109,7.3e-05,-2.9e-05,-1.1e-05,1.1e-05,1.4e-05,-2.1e-05,-3.9e-05,-3.5e-05,7e-06,-1.7e-05,-0.000124,3.9e-05,9.2e-05,7e-06,5.6e-05,-2.1e-05,1e-05,4.2e-05,-1.4e-05,-2e-06,7.7e-05,5.5e-05,8.9e-05,-1.5e-05,-8e-06,-4.8e-05,3.8e-05,-2.2e-05,2.5e-05,3.6e-05,9.8e-05,5.4e-05,-6.9e-05,-2.7e-05,2.1e-05,9.9e-05,-5.2e-05,2.8e-05,-6.2e-05,4.3e-05,1.9e-05,-1.2e-05,6.6e-05,6.2e-05,-4.7e-05,4.4e-05,6.2e-05,-1.6e-05,-6.6e-05,-9e-06,-6e-05,2.6e-05,3.8e-05,1.4e-05,6.1e-05,3e-05,-5e-05,4.5e-05,-1e-05,2e-06,9.1e-05,3.9e-05,-4.8e-05,-5.7e-05,-1.5e-05,7.4e-05,2.8e-05,3.2e-05,6e-06,5e-05,1.1e-05,4.8e-05,-9e-06,-1.1e-05
-6.5e-05,-7.4e-05,-1.2e-05,-0.000171,-0.000127,6.6e-05,9e-06,-3.5e-05,-2e-06,8.5e-05,6e-05,-9e-06,5e-06,-3.6e-05,4.4e-05,-2.2e-05,3.3e-05,-3.5e-05,-5.6e-05,-2e-06,3.2e-05,-2.6e-05,5.6e-05,3.3e-05,-6.3e-05,-2.2e-05,-2.2e-05,-2e-06,-4e-06,-4.1e-05,2.7e-05,-3.7e-05,-1.1e-05,-1.7e-05,1.4e-05,-1.8e-05,-5.3e-05,1.4e-05,0.000102,-7.1e-05,-4.8e-05,-4e-05,-6.2e-05,5e-06,4e-05,5.1e-05,2.4e-05,-7.9e-05,-1.8e-05,6.5e-05,-2.9e-05,6e-06,-2.8e-05,-6e-06,-3.9e-05,-2.7e-05,-2.6e-05,7.3e-05,-2.3e-05,-7.4e-05,4.2e-05,-2.6e-05,-4e-06,-2.8e-05,1.8e-05,4e-05,3.9e-05,-5e-06,-3.7e-05,-0.000105,-4.6e-05,-2.4e-05,-1.6e-05,1.2e-05,-2.5e-05,-7e-06,-1.4e-05,-3.3e-05,1e-05,6.9e-05,-7e-06,-2.3e-05,5e-06,3.4e-05,-5.2e-05,4e-06,-6e-06,-2.4e-05,-1.7e-05,-1.8e-05,-2.5e-05,-2.3e-05,-2.1e-05,3.2e-05,1e-06,7.8e-05,-1.2e-05,4.3e-05,9e-06,2.3e-05,2.2e-05,4e-06,-2.7e-05,2.1e-05,3.7e-05,2e-05,3.6e-05,-1.4e-05,-5.7e-05,3.9e-05,1.4e-05,3.3e-05,-3.6e-05,-1.1e-05,1.2e-05,-1.7e-05,-4e-05,1.1e-05,-2.5e-05,6e-06,3.8e-05
4.1e-05,4e-05,-3.5e-05,7.6e-05,-1e-05,0.000132,5.1e-05,-4e-06,-6.9e-05,-4.3e-05,1e-05,4.1e-05,0,6.3e-05,6.5e-05,1.8e-05,7.6e-05,6e-06,-3e-06,1e-05,5e-06,-1e-06,-8.7e-05,-5.2e-05,-3.2e-05,-8.9e-05,-2e-05,-2.1e-05,-5e-06,-1.2e-05,-4.7e-05,2e-05,-5.3e-05,2.9e-05,1.7e-05,-1.4e-05,-3e-06,-5.3e-05,6e-06,-1.3e-05,1.7e-05,2.8e-05,1.8e-05,-6.3e-05,-5.6e-05,-3.2e-05,-4.7e-05,-2.9e-05,-5.3e-05,-3.9e-05,-5e-06,1.3e-05,-1.2e-05,-3.5e-05,-4.8e-05,2.8e-05,2.8e-05,-4.7e-05,-5.2e-05,1.8e-05,-1.3e-05,5e-06,-1.2e-05,-3.1e-05,-5.1e-05,-2.4e-05,1e-05,1.4e-05,1.5e-05,2.9e-05,-2.4e-05,-4e-06,-4.4e-05,-3.9e-05,-3.7e-05,-6e-06,-3.1e-05,-2e-05,-3.4e-05,-8.3e-05,-1e-06,-9e-06,4e-06,1e-06,2.9e-05,1.7e-05,-2.9e-05,2.3e-05,1.8e-05,-4.2e-05,1.5e-05,-3e-06,-4e-06,1.3e-05,-1.5e-05,-2.4e-05,1.7e-05,-2.9e-05,7e-06,9e-06,-1.8e-05,-6.9e-05,-9e-06,-1.6e-05,1.2e-05,-5.1e-05,-7e-06,-1.1e-05,6e-06,-7e-06,1.2e-05,0,-6e-06,2e-06,-1.4e-05,-1.9e-05,1.8e-05,-2e-05,-2.1e-05,-4.5e-05,-1.1e-05
-2.4e-05,2.4e-05,2.8e-05,-4e-06,3.7e-05,-4.6e-05,-1.5e-05,-2.4e-05,7e-05,4e-05,-2.4e-05,-1.4e-05,2.4e-05,-6.1e-05,-2e-05,-8e-06,2.6e-05,7e-06,-1.8e-05,-1.7e-05,-5.4e-05,2.4e-05,2.2e-05,-3.2e-05,-1e-06,-5e-06,1e-05,-8e-06,-8e-06,-6.2e-05,6.1e-05,8e-06,1.4e-05,0,-1.9e-05,7e-06,-7.7e-05,1e-05,2.4e-05,1.9e-05,7e-06,-2.1e-05,3.3e-05,-3e-06,5.1e-05,2.2e-05,8.9e-05,5.1e-05,4e-06,4.9e-05,-3.6e-05,-4.2e-05,-8e-06,-4.1e-05,2.3e-05,-1.5e-05,-5.2e-05,-7e-06,8e-06,-5.3e-05,-9e-06,3.4e-05,-1e-05,1.9e-05,2.1e-05,3e-06,-4.8e-05,1.1e-05,-1.4e-05,6e-06,-1.4e-05,-3.8e-05,1.8e-05,-4.1e-05,1.6e-05,-4.3e-05,2.5e-05,1.4e-05,1.7e-05,2.4e-05,-1.6e-05,-9e-06,-1.2e-05,1.8e-05,-4.9e-05,-8e-06,-2.7e-05,-5e-06,-2e-05,3.9e-05,2.3e-05,3.4e-05,3.2e-05,-1.8e-05,-7e-06,1.1e-05,-1.1e-05,1e-06,0,-3.8e-05,-7e-06,1.9e-05,4e-05,1.5e-05,-1e-05,-1e-06,1.4e-05,-3.5e-05,0,-8e-06,-4.6e-05,-2.3e-05,5e-06,7e-06,-1.7e-05,1.4e-05,-1.9e-05,-3e-05,7e-06,2.6e-05,6e-06
1.2e-05,-8.5e-05,-1.8e-05,1.5e-05,-3.2e-05,2e-06,-2.7e-05,1.2e-05,-4.6e-05,-2.7e-05,-2.5e-05,-1e-05,3.4e-05,2.1e-05,-3.4e-05,-6e-06,-1.8e-05,1.2e-05,4.2e-05,-3.9e-05,1.7e-05,-2.6e-05,-1.9e-05,-2e-05,-2.2e-05,-5e-06,-2.2e-05,-1.6e-05,1e-05,-2e-06,2e-06,-1.7e-05,-1.6e-05,3.7e-05,-1.6e-05,-1.2e-05,-3.1e-05,-1.3e-05,3.1e-05,1.3e-05,-1.1e-05,9e-06,7e-06,-1.8e-05,-3.8e-05,2e-06,-5e-06,-2e-06,-1.7e-05,-1.8e-05,4.9e-05,5e-06,5e-06,2.8e-05,-6e-06,-1.7e-05,9e-06,2.3e-05,4e-06,2.8e-05,-7e-06,-1.8e-05,-4.8e-05,-1.2e-05,4e-06,-1e-06,-4.3e-05,-4e-06,1.4e-05,-2e-06,-1e-06,6e-06,1.5e-05,-9e-06,-1.3e-05,-3e-06,-1e-06,-2.8e-05,-1e-05,4e-06,-1.2e-05,1.2e-05,-2.1e-05,1.2e-05,-7e-06,-1.8e-05,6e-06,-2.5e-05,-1.2e-05,-8e-06,-3e-06,-5e-06,-1.3e-05,1.5e-05,4.4e-05,-2.9e-05,-2.6e-05,6e-06,-2e-05,-1.8e-05,2e-06,-7e-06,-4e-06,1.1e-05,-4e-06,-3e-06,-4e-06,2.6e-05,-1e-06,-1.1e-05,1.5e-05,-7e-06,-2.8e-05,0,-5e-06,1.3e-05,3e-06,7e-06,-1.6e-05,0,3e-06
1.1e-05,3.4e-05,1.9e-05,-1.6e-05,-1.2e-05,2.4e-05,3.5e-05,2.2e-05,1.9e-05,6e-06,-7e-06,6e-06,-2.8e-05,1e-06,-5e-06,6e-06,-5e-06,1e-05,-2e-05,1.1e-05,7e-06,5e-06,-1e-06,1.8e-05,1.9e-05,7e-06,1.7e-05,2e-06,1.2e-05,-2.6e-05,6e-06,-1.1e-05,1.8e-05,-3.1e-05,3e-06,-5e-06,-1.8e-05,1.4e-05,-4.2e-05,-2e-05,1e-06,-4e-06,-1.2e-05,8e-06,1.1e-05,-2.7e-05,5e-06,-1.3e-05,5e-06,-1.4e-05,-1.8e-05,-8e-06,-1e-06,-3.9e-05,-1.3e-05,1.2e-05,2e-05,-4e-06,2e-06,1e-06,2.2e-05,-2.7e-05,1.5e-05,1.3e-05,0,-7e-06,-1.3e-05,3.1e-05,-1e-06,2.1e-05,1.9e-05,1.3e-05,-1.2e-05,1.5e-05,4e-06,1.2e-05,-2e-06,5e-06,1e-06,-1.8e-05,-4e-06,4e-06,3e-06,-2e-05,1.5e-05,6e-06,1.9e-05,3e-05,2.3e-05,-2e-06,5e-06,-1e-06,1.1e-05,1e-05,7e-06,1e-06,3e-06,-9e-06,2.5e-05,-7e-06,-3e-06,2e-06,8e-06,4e-06,7e-06,2e-06,1.1e-05,-7e-06,2.2e-05,1.2e-05,-1.1e-05,1.2e-05,9e-06,6e-06,1.1e-05,-3e-06,-1.7e-05,1.2e-05,-2.2e-05,2e-06,5e-06
-1e-05,-1.3e-05,-1.9e-05,1.2e-05,1.2e-05,-2.1e-05,-1.8e-05,-1.6e-05,-2.5e-05,0,1.2e-05,-1.1e-05,3e-06,7e-06,1e-06,1e-06,-8e-06,-7e-06,1.6e-05,-2e-06,-4e-06,1e-05,-5e-06,0,1.4e-05,6e-06,9e-06,1e-05,9e-06,7e-06,3e-05,-2.2e-05,-7e-06,-1e-06,2e-05,1e-05,1.6e-05,-4e-06,7e-06,2.4e-05,-3e-06,8e-06,2e-05,7e-06,-1e-05,1.8e-05,-4.2e-05,-5e-06,2.8e-05,-2.7e-05,9e-06,9e-06,-1.1e-05,2.9e-05,1.1e-05,-2e-06,-3e-05,6e-06,5e-06,1.7e-05,2e-06,1e-06,-7e-06,-6e-06,-1e-06,-1e-06,-1.3e-05,-1.1e-05,1.3e-05,-1.9e-05,-2.2e-05,-1.1e-05,-1.9e-05,1e-05,-2e-06,-5e-06,-3e-06,-1e-05,-5e-06,8e-06,1.7e-05,-1.1e-05,-2.8e-05,2.2e-05,-1e-06,-1e-05,6e-06,-6e-06,-2.5e-05,-9e-06,9e-06,-2.5e-05,5e-06,-3.8e-05,-1.6e-05,3e-06,-2.5e-05,0,-3e-06,2.3e-05,-5e-06,3e-06,-2.4e-05,-3e-05,3e-06,-8e-06,7e-06,1.4e-05,4e-06,-1.5e-05,1.8e-05,-1.2e-05,-3e-06,0,0,-7e-06,-5e-06,0,8e-06,-5e-06,9e-06
-3e-06,3e-06,7e-06,3e-06,-2.5e-05,-1.6e-05,-1.7e-05,1.2e-05,3.2e-05,-1.3e-05,3e-06,5e-06,1.5e-05,4e-06,7e-06,-9e-06,4e-06,1e-05,-1.5e-05,1e-06,5e-06,-1.2e-05,1.1e-05,7e-06,9e-06,-9e-06,-2.1e-05,-1.1e-05,-8e-06,6e-06,-8e-06,9e-06,1e-06,-3e-06,-1.7e-05,-9e-06,-1.4e-05,3e-06,-1.9e-05,-1.9e-05,-1.6e-05,-1.8e-05,-2.6e-05,6e-06,6e-06,1.4e-05,2.3e-05,8e-06,0,1.1e-05,-1e-06,3e-06,1.2e-05,-1.3e-05,1e-05,1.1e-05,1.3e-05,-1e-06,6e-06,-6e-06,-4e-06,-4e-06,4e-06,5e-06,-1e-06,6e-06,3e-06,2e-06,-3e-06,2e-06,5e-06,1e-06,4e-06,-1e-06,-1e-06,9e-06,-2e-06,3e-06,1e-05,-4e-06,-1.7e-05,1e-05,1.6e-05,9e-06,-8e-06,3e-06,-9e-06,-8e-06,3e-06,1.8e-05,2e-06,1.8e-05,-8e-06,-1.2e-05,-7e-06,-9e-06,1.1e-05,1e-05,-1.4e-05,-4e-06,5e-06,0,8e-06,5e-06,3e-06,-4e-06,-1e-05,8e-06,-2e-05,1e-05,-6e-06,9e-06,-4e-06,-8e-06,-1e-06,4e-06,2e-06,5e-06,-2e-06,5e-06,-4e-06
-3e-06,2.4e-05,1e-05,-1.2e-05,4e-06,1e-06,7e-06,-2e-06,-1.4e-05,1.4e-05,1.6e-05,-4e-06,-1.2e-05,-9e-06,-8e-06,8e-06,-1.2e-05,-1.9e-05,1.3e-05,-1e-06,0,6e-06,3e-06,7e-06,-1.4e-05,-1e-05,5e-06,6e-06,4e-06,-3e-06,-4e-06,-1e-06,-1.1e-05,-7e-06,-6e-06,3e-06,-2e-06,-1.5e-05,1e-06,4e-06,1.8e-05,9e-06,1e-05,1.2e-05,2e-06,-1.4e-05,1.4e-05,-7e-06,-1e-06,-2.1e-05,-8e-06,-8e-06,2e-06,2e-06,5e-06,-2e-06,-7e-06,-7e-06,-5e-06,0,6e-06,-3e-06,1e-05,-2e-06,-1e-06,-3e-06,3e-06,-3e-06,8e-06,7e-06,5e-06,8e-06,1.5e-05,-6e-06,1e-06,1e-06,-6e-06,-4e-06,-5e-06,-7e-06,4e-06,-1.1e-05,-6e-06,-1.7e-05,-1e-06,-1e-06,1e-05,9e-06,1e-06,-9e-06,0,1e-06,-3e-06,-1e-06,-4e-06,-6e-06,-5e-06,-1e-05,5e-06,-4e-06,0,-1.1e-05,-9e-06,1e-05,4e-06,1.4e-05,5e-06,-1.1e-05,1.3e-05,0,9e-06,-1e-05,-3e-06,1e-06,1e-06,0,-4e-06,4e-06,-5e-06,1e-06,-2e-06
0,-1.8e-05,-1.3e-05,7e-06,1.5e-05,1.4e-05,-7e-06,-3e-06,8e-06,-1e-05,-1.5e-05,-1e-06,6e-06,-5e-06,-5e-06,0,1.3e-05,1.2e-05,-1.4e-05,1e-05,0,4e-06,-9e-06,1.9e-05,7e-06,3e-06,-6e-06,2e-06,2e-06,-1.1e-05,-1e-06,-6e-06,1e-06,7e-06,7e-06,1e-06,-4e-06,1.3e-05,7e-06,-7e-06,1e-06,-2e-06,3e-06,-7e-06,-1.4e-05,-3e-06,-3e-06,4e-06,4e-06,1.1e-05,3e-06,-5e-06,1e-05,-3e-06,-1e-06,-1.1e-05,-1.2e-05,1e-05,-1e-05,-8e-06,6e-06,1.3e-05,8e-06,0,3e-06,-1e-06,4e-06,0,-3e-06,-3e-06,4e-06,-2e-06,-4e-06,-3e-06,3e-06,-5e-06,2e-06,-3e-06,-6e-06,-1e-06,5e-06,-1e-06,-8e-06,-1e-05,0,6e-06,5e-06,-5e-06,4e-06,6e-06,6e-06,0,6e-06,2e-05,5e-06,-2e-06,-3e-06,5e-06,2e-06,1e-06,-5e-06,5e-06,2e-06,-1e-06,-1e-06,0,-1.1e-05,-5e-06,0,4e-06,-9e-06,-4e-06,5e-06,-3e-06,-2e-06,-2e-06,6e-06,-5e-06,1e-06,-5e-06,-4e-06
-6e-06,1.1e-05,2e-06,0,-6e-06,1e-06,1e-06,2e-06,-3e-06,1e-05,3e-06,7e-06,2e-06,-2.2e-05,1e-06,1e-06,-2e-06,-6e-06,5e-06,-6e-06,-5e-06,-6e-06,-5e-06,4e-06,-1.5e-05,9e-06,-5e-06,-2e-06,-1e-06,-2e-06,4e-06,0,1e-06,-4e-06,-9e-06,-4e-06,-2.1e-05,-9e-06,-5e-06,-3e-06,-7e-06,-1e-06,-6e-06,-3e-06,5e-06,-8e-06,-9e-06,4e-06,-1e-06,1.7e-05,4e-06,0,-2e-06,-8e-06,1e-06,1.3e-05,1.2e-05,-1.2e-05,9e-06,-2e-06,3e-06,-2e-06,0,1e-06,0,1e-06,2e-06,-3e-06,-2e-06,1e-06,7e-06,-5e-06,-4e-06,-5e-06,-4e-06,-8e-06,-3e-06,-6e-06,9e-06,0,1e-06,0,2e-06,5e-06,1e-06,-6e-06,-1.1e-05,0,-1e-06,-7e-06,-3e-06,-1e-06,-6e-06,-1.6e-05,-1e-06,-4e-06,6e-06,-1e-06,0,3e-06,5e-06,-1.2e-05,0,-6e-06,1e-06,2e-06,2e-06,-1e-06,-3e-06,-5e-06,3e-06,3e-06,-3e-06,2e-06,1e-06,-4e-06,-2e-06,4e-06,-4e-06,8e-06,0
6e-06,-2e-06,-1e-06,-5e-06,1e-05,-5e-06,-5e-06,-3e-06,-9e-06,-2e-06,-7e-06,-4e-06,2e-06,5e-06,-1e-06,-1e-06,9e-06,1e-06,0,-1e-06,9e-06,5e-06,6e-06,-1e-06,2e-06,1e-06,-5e-06,3e-06,-4e-06,-1e-05,-1.2e-05,-2e-06,1.1e-05,1.2e-05,8e-06,-4e-06,9e-06,4e-06,9e-06,6e-06,6e-06,4e-06,3e-06,-1e-06,4e-06,-2e-06,-8e-06,-4e-06,-6e-06,-9e-06,1e-06,1e-06,-3e-06,6e-06,1e-06,1e-06,-7e-06,6e-06,-2e-06,3e-06,2e-06,1e-06,5e-06,3e-06,-3e-06,-3e-06,4e-06,0,1e-06,5e-06,5e-06,1e-06,-2e-06,3e-06,5e-06,5e-06,-5e-06,1e-06,-4e-06,-3e-06,-5e-06,-2e-06,2e-06,-5e-06,1e-06,0,0,1e-06,0,5e-06,2e-06,-9e-06,0,1.5e-05,4e-06,2e-06,-1e-06,3e-06,-2e-06,-3e-06,-2e-06,7e-06,2e-06,6e-06,-2e-06,-1e-06,2e-06,0,2e-06,6e-06,-1.2e-05,-2e-06,6e-06,4e-06,-1e-06,0,3e-06,-4e-06,-3e-06,-6e-06,-2e-06
-1e-06,-2e-06,-1e-06,-8e-06,-4e-06,1e-06,-4e-06,3e-06,9e-06,1e-06,-4e-06,3e-06,-2e-06,1e-06,-1e-05,2e-06,-5e-06,5e-06,2e-06,-1e-06,-1.3e-05,-1e-06,4e-06,-8e-06,-1e-06,3e-06,0,-1e-06,4e-06,9e-06,7e-06,-2e-06,-2e-06,-5e-06,2e-06,6e-06,5e-06,-4e-06,-1e-06,-8e-06,-3e-06,-1e-05,1.2e-05,0,-7e-06,5e-06,9e-06,0,-6e-06,7e-06,-1e-06,-4e-06,-3e-06,-7e-06,-6e-06,-9e-06,3e-06,-2e-06,8e-06,2e-06,0,2e-06,-3e-06,-1e-06,0,1e-06,6e-06,-2e-06,2e-06,-6e-06,-3e-06,0,-1e-06,-2e-06,-4e-06,1e-06,3e-06,2e-06,-2e-06,0,-1e-06,0,3e-06,7e-06,3e-06,-3e-06,5e-06,-4e-06,5e-06,-3e-06,-5e-06,7e-06,1e-06,-6e-06,-1e-06,-5e-06,4e-06,-3e-06,-2e-06,-3e-06,0,0,2e-06,-7e-06,-3e-06,0,-4e-06,0,-7e-06,-1e-05,5e-06,-1e-06,2e-06,-2e-06,-1e-06,4e-06,-3e-06,-1e-06,0,0,1e-06
4e-06,5e-06,-4e-06,3e-06,-3e-06,-5e-06,6e-06,2e-06,-2e-06,2e-06,7e-06,-1e-06,-2e-06,-2e-06,-4e-06,-2e-06,1e-06,-4e-06,-1e-06,-5e-06,6e-06,-1e-06,-5e-06,-3e-06,-1e-06,-5e-06,-1e-06,-2e-06,-1e-06,1.1e-05,-7e-06,3e-06,0,-1e-06,-1e-06,-6e-06,1e-05,4e-06,1e-06,2e-06,-9e-06,1.3e-05,-5e-06,-4e-06,1e-06,-1e-05,4e-06,-6e-06,-5e-06,-8e-06,0,2e-06,-1e-06,3e-06,-5e-06,4e-06,0,0,-3e-06,6e-06,4e-06,-1e-05,-6e-06,-2e-06,6e-06,2e-06,7e-06,0,-3e-06,-1e-06,1e-06,-3e-06,3e-06,-1e-06,-4e-06,5e-06,2e-06,-1e-06,1e-06,0,2e-06,3e-06,-1e-05,-6e-06,1e-06,2e-06,-2e-06,3e-06,-5e-06,2e-06,4e-06,2e-06,-6e-06,-2e-06,-5e-06,8e-06,1e-06,-1e-06,1e-06,-1e-06,1e-06,8e-06,-4e-06,-1e-06,0,1e-06,2e-06,0,0,3e-06,-7e-06,0,1e-06,2e-06,-1e-06,1e-06,-2e-06,1e-06,-2e-06,0,0
-3e-06,-8e-06,-2e-06,1e-06,1e-05,-4e-06,-2e-06,-3e-06,-3e-06,-7e-06,3e-06,0,0,4e-06,6e-06,2e-06,-4e-06,2e-06,5e-06,9e-06,3e-06,4e-06,2e-06,-3e-06,1e-06,4e-06,-6e-06,-1e-06,2e-06,6e-06,8e-06,0,-3e-06,0,-3e-06,2e-06,2e-06,-2e-06,-1e-06,-2e-06,7e-06,-1.2e-05,4e-06,5e-06,1e-06,2e-06,1.3e-05,5e-06,-2e-06,5e-06,-2e-06,-7e-06,-1e-06,-4e-06,1e-06,3e-06,-6e-06,0,-6e-06,-7e-06,5e-06,-6e-06,-3e-06,1e-06,0,-3e-06,3e-06,-1e-06,0,5e-06,-5e-06,-4e-06,1e-06,1e-06,3e-06,-1e-06,-2e-06,2e-06,2e-06,-2e-06,-1e-06,-3e-06,6e-06,5e-06,-4e-06,-1e-06,0,0,1e-06,-5e-06,-2e-06,-1e-06,1e-06,2e-06,3e-06,1e-06,0,4e-06,3e-06,-1e-06,-1e-06,-6e-06,3e-06,7e-06,2e-06,-4e-06,0,2e-06,2e-06,-3e-06,4e-06,2e-06,0,-1e-06,0,-4e-06,-4e-06,0,-4e-06,1e-06,-3e-06
0,-1e-06,4e-06,1e-06,-1.1e-05,3e-06,-5e-06,1e-06,-4e-06,7e-06,2e-06,1e-06,3e-06,-5e-06,5e-06,-3e-06,1e-06,2e-06,2e-06,-4e-06,-6e-06,-3e-06,2e-06,-1.1e-05,-1e-06,-3e-06,2e-06,-1e-06,-2e-06,1e-06,1e-06,-6e-06,-5e-06,0,0,-3e-06,-3e-06,1e-06,-8e-06,2e-06,2e-06,1.2e-05,2e-06,0,4e-06,1e-06,-2e-05,-1e-06,-1e-06,-1.2e-05,-1e-06,2e-06,-2e-06,-4e-06,-2e-06,-1e-05,5e-06,-1e-06,-2e-06,1e-06,0,4e-06,-3e-06,-1e-06,-6e-06,0,4e-06,-1e-06,2e-06,-4e-06,1e-06,4e-06,-1e-06,-4e-06,-5e-06,0,-4e-06,-3e-06,-4e-06,3e-06,0,0,2e-06,3e-06,-1e-06,2e-06,-3e-06,-1e-06,0,3e-06,0,-1e-06,-1e-06,-8e-06,3e-06,1e-06,0,-3e-06,-4e-06,1e-06,0,1e-06,-5e-06,-2e-06,0,-1e-06,3e-06,-2e-06,-4e-06,4e-06,-3e-06,0,-1e-06,-1e-06,1e-06,1e-06,1e-06,-1e-06,2e-06,-1e-06,-4e-06
-1e-06,2e-06,-5e-06,-7e-06,-8e-06,-2e-06,7e-06,-1e-06,8e-06,-6e-06,-4e-06,-3e-06,-4e-06,-5e-06,1e-06,2e-06,2e-06,-3e-06,-2e-06,1e-06,1e-06,1e-06,0,-1e-06,-2e-06,0,-1e-06,0,1e-06,-5e-06,-5e-06,2e-06,3e-06,0,1e-06,1e-06,-6e-06,-2e-06,7e-06,-4e-06,-2e-06,-1.1e-05,-8e-06,1e-06,-4e-06,-4e-06,0,1e-06,2e-06,6e-06,2e-06,2e-06,-1e-06,1e-06,0,7e-06,-4e-06,2e-06,3e-06,-4e-06,-1e-06,-2e-06,-4e-06,2e-06,5e-06,0,-1e-06,-1e-06,2e-06,4e-06,-4e-06,-1e-06,-3e-06,0,0,-3e-06,-1e-06,0,2e-06,-1e-06,0,1e-06,1e-06,3e-06,2e-06,-3e-06,0,1e-06,-1e-06,-1e-06,-2e-06,0,-1e-06,-2e-06,0,3e-06,-1e-06,-1e-06,0,1e-06,1e-06,2e-06,4e-06,-3e-06,0,0,-2e-06,0,2e-06,-3e-06,3e-06,-1e-06,-1e-06,1e-06,0,1e-06,0,1e-06,-4e-06,1e-06,0
-2e-06,-3e-06,3e-06,1e-06,6e-06,-3e-06,-4e-06,-1e-06,-4e-06,2e-06,-1e-06,1e-06,0,0,-6e-06,-1e-06,-1e-06,1e-06,1e-06,0,2e-06,3e-06,-4e-06,4e-06,-1e-06,-1e-06,-4e-06,0,-1e-06,-3e-06,4e-06,-1e-06,3e-06,-2e-06,1e-06,-1e-06,0,2e-06,-3e-06,1e-06,6e-06,8e-06,4e-06,-3e-06,0,0,3e-06,-1e-06,-1e-06,0,1e-06,0,0,-6e-06,0,0,0,-1e-06,4e-06,2e-06,1e-06,1e-06,-2e-06,-2e-06,3e-06,0,-5e-06,0,0,-2e-06,-2e-06,-3e-06,-1e-06,0,-1e-06,-2e-06,0,-2e-06,1e-06,0,-1e-06,-3e-06,-1e-06,-6e-06,-1e-06,0,5e-06,0,1e-06,0,-2e-06,0,-1e-06,6e-06,-2e-06,2e-06,-2e-06,3e-06,0,1e-06,-1e-06,4e-06,-1e-06,1e-06,0,0,-1e-06,3e-06,5e-06,5e-06,-1e-06,-1e-06,0,-1e-06,0,0,1e-06,0,-1e-06,0,1e-06
2e-06,1e-06,0,1e-06,3e-06,4e-06,0,1e-06,2e-06,1e-06,-2e-06,1e-06,2e-06,5e-06,0,0,-2e-06,1e-06,-3e-06,1e-06,-1e-06,-4e-06,3e-06,-1e-06,4e-06,1e-06,-1e-06,1e-06,1e-06,-6e-06,0,3e-06,-1e-06,5e-06,0,2e-06,1e-06,-1e-06,1e-06,-2e-06,-3e-06,-7e-06,-1e-06,0,-2e-06,0,6e-06,2e-06,4e-06,0,0,-1e-06,1e-06,2e-06,3e-06,-5e-06,3e-06,-1e-06,1e-06,0,3e-06,3e-06,1e-06,1e-06,-3e-06,1e-06,-3e-06,-1e-06,-1e-06,-1e-06,0,0,2e-06,-2e-06,0,1e-06,-2e-06,0,-3e-06,-2e-06,0,2e-06,2e-06,2e-06,0,-1e-06,-2e-06,0,-3e-06,-1e-06,-1e-06,-1e-06,2e-06,2e-06,-3e-06,1e-06,0,-1e-06,2e-06,-3e-06,2e-06,3e-06,1e-06,2e-06,-1e-06,0,2e-06,0,-2e-06,-4e-06,0,-2e-06,0,0,1e-06,-2e-06,2e-06,0,0,-3e-06,1e-06
3e-06,1e-06,2e-06,4e-06,1e-06,2e-06,3e-06,0,0,-1e-06,0,-2e-06,-2e-06,1e-06,1e-06,0,0,-3e-06,3e-06,-1e-06,-2e-06,1e-06,0,4e-06,-2e-06,1e-06,0,0,-2e-06,8e-06,-1e-06,0,2e-06,-2e-06,0,-2e-06,1e-06,1e-06,2e-06,1e-06,-3e-06,7e-06,-3e-06,1e-06,3e-06,1e-06,-1e-06,-1e-06,0,6e-06,0,-3e-06,1e-06,-2e-06,1e-06,4e-06,-3e-06,3e-06,-2e-06,2e-06,2e-06,-4e-06,2e-06,0,0,0,-5e-06,1e-06,2e-06,3e-06,-2e-06,1e-06,1e-06,-1e-06,-1e-06,2e-06,0,1e-06,0,0,1e-06,-1e-06,1e-06,-6e-06,1e-06,1e-06,-1e-06,0,5e-06,1e-06,-2e-06,4e-06,-1e-06,-2e-06,2e-06,1e-06,-3e-06,0,-2e-06,0,-1e-06,1e-06,0,-3e-06,0,-1e-06,-3e-06,0,0,1e-06,1e-06,0,-2e-06,0,0,-1e-06,0,1e-06,-2e-06,4e-06,0
-3e-06,-2e-06,-1e-06,-1e-06,-1e-06,-3e-06,-2e-06,1e-06,-2e-06,3e-06,2e-06,2e-06,-4e-06,2e-06,3e-06,1e-06,-1e-06,1e-06,-3e-06,-2e-06,3e-06,1e-06,1e-06,2e-06,2e-06,-2e-06,-1e-06,1e-06,1e-06,-1e-06,-1e-06,1e-06,-3e-06,0,-1e-06,1e-06,1e-06,-3e-06,-2e-06,0,1e-06,-6e-06,4e-06,0,0,4e-06,-5e-06,0,1e-06,-5e-06,-1e-06,1e-06,3e-06,-1e-06,0,-2e-06,2e-06,-1e-06,-3e-06,0,-2e-06,-2e-06,2e-06,0,1e-06,-1e-06,-4e-06,-1e-06,0,-3e-06,3e-06,0,-1e-06,-1e-06,1e-06,0,-1e-06,-1e-06,1e-06,0,0,-2e-06,-4e-06,5e-06,-1e-06,-2e-06,3e-06,-1e-06,-3e-06,0,0,-3e-06,2e-06,0,1e-06,0,-2e-06,-1e-06,-1e-06,2e-06,0,-3e-06,0,1e-06,0,2e-06,2e-06,0,1e-06,-2e-06,-2e-06,0,-1e-06,0,-1e-06,1e-06,-1e-06,-1e-06,-4e-06,-2e-06,-1e-06
1e-06,2e-06,1e-06,-2e-06,-5e-06,-1e-06,0,0,0,-3e-06,2e-06,0,5e-06,-3e-06,-3e-06,-2e-06,-1e-06,1e-06,3e-06,3e-06,-2e-06,-2e-06,-3e-06,5e-06,-1e-06,0,-3e-06,0,0,4e-06,2e-06,-3e-06,-1e-06,1e-06,0,0,-3e-06,2e-06,5e-06,-3e-06,-1e-06,4e-06,1e-06,0,-3e-06,-3e-06,-3e-06,1e-06,-1e-06,1e-06,1e-06,0,-1e-06,0,1e-06,-1e-06,1e-06,0,0,-1e-06,0,-2e-06,2e-06,0,0,0,0,1e-06,-2e-06,1e-06,0,-2e-06,-2e-06,-1e-06,-2e-06,1e-06,1e-06,0,-1e-06,0,-1e-06,3e-06,2e-06,-5e-06,-2e-06,1e-06,-1e-06,1e-06,1e-06,0,0,-2e-06,0,1e-06,1e-06,-1e-06,0,2e-06,-1e-06,0,1e-06,-2e-06,-1e-06,1e-06,0,0,0,0,0,2e-06,0,1e-06,-1e-06,0,0,1e-06,-2e-06,1e-06,2e-06,2e-06,-2e-06
-1e-06,1e-06,2e-06,0,5e-06,2e-06,3e-06,-1e-06,2e-06,4e-06,0,-1e-06,-1e-06,-2e-06,1e-06,2e-06,-1e-06,-3e-06,-3e-06,0,0,2e-06,2e-06,0,-1e-06,-1e-06,0,-1e-06,1e-06,-4e-06,-2e-06,1e-06,2e-06,-1e-06,1e-06,-1e-06,-2e-06,-1e-06,-6e-06,2e-06,-1e-06,-3e-06,-3e-06,1e-06,3e-06,4e-06,0,0,-1e-06,-5e-06,1e-06,2e-06,1e-06,-2e-06,0,4e-06,-1e-06,0,1e-06,0,2e-06,-4e-06,4e-06,-1e-06,1e-06,1e-06,-1e-06,-1e-06,1e-06,2e-06,2e-06,0,-1e-06,0,1e-06,-2e-06,0,0,-1e-06,1e-06,0,-3e-06,0,5e-06,1e-06,-1e-06,-1e-06,0,1e-06,0,-1e-06,2e-06,1e-06,-1e-06,0,-1e-06,-1e-06,-2e-06,2e-06,0,-1e-06,-2e-06,-1e-06,0,0,1e-06,0,-2e-06,0,-3e-06,-1e-06,-1e-06,0,0,0,-1e-06,-1e-06,-1e-06,-3e-06,-1e-06,0
-1e-06,-2e-06,-3e-06,1e-06,4e-06,0,-3e-06,1e-06,-1e-06,-3e-06,-3e-06,1e-06,-3e-06,1e-06,1e-06,0,1e-06,2e-06,4e-06,0,2e-06,0,0,3e-06,-1e-06,2e-06,-1e-06,1e-06,-1e-06,-3e-06,1e-06,1e-06,1e-06,-1e-06,-1e-06,0,-4e-06,0,2e-06,-3e-06,4e-06,3e-06,5e-06,0,1e-06,2e-06,9e-06,0,-1e-06,1e-06,0,-2e-06,-2e-06,0,-1e-06,-2e-06,2e-06,0,1e-06,-1e-06,1e-06,0,-1e-06,1e-06,-2e-06,0,0,1e-06,0,-1e-06,1e-06,0,2e-06,0,-2e-06,-1e-06,-1e-06,0,1e-06,-2e-06,1e-06,1e-06,0,-4e-06,1e-06,0,0,0,-1e-06,0,0,1e-06,0,-6e-06,-1e-06,-1e-06,1e-06,-1e-06,-1e-06,-1e-06,1e-06,2e-06,2e-06,-1e-06,1e-06,0,0,0,-1e-06,3e-06,-1e-06,-1e-06,1e-06,0,-1e-06,0,-1e-06,1e-06,-1e-06,1e-06,1e-06
0,2e-06,2e-06,2e-06,-3e-06,-1e-06,1e-06,0,-1e-06,0,0,-1e-06,2e-06,-1e-06,1e-06,0,3e-06,-1e-06,-2e-06,0,-2e-06,-1e-06,-1e-06,-2e-06,0,1e-06,-2e-06,-1e-06,1e-06,-5e-06,1e-06,-2e-06,0,-1e-06,0,-1e-06,1e-06,-1e-06,-1e-06,2e-06,-1e-06,-2e-06,-3e-06,-1e-06,-1e-06,-1e-06,-1e-06,0,-1e-06,-2e-06,0,-1e-06,1e-06,-1e-06,-2e-06,-2e-06,-2e-06,0,1e-06,2e-06,-1e-06,2e-06,0,0,-1e-06,0,3e-06,0,0,-1e-06,1e-06,-1e-06,1e-06,0,-1e-06,0,0,-1e-06,0,1e-06,0,1e-06,-4e-06,6e-06,0,-1e-06,-1e-06,0,1e-06,0,-1e-06,0,1e-06,4e-06,0,-1e-06,0,1e-06,0,0,1e-06,0,-3e-06,3e-06,0,1e-06,0,0,-1e-06,-1e-06,1e-06,1e-06,1e-06,0,0,0,1e-06,0,0,-1e-06,1e-06
1e-06,-2e-06,-2e-06,-2e-06,0,1e-06,0,0,0,2e-06,-2e-06,1e-06,-2e-06,4e-06,-1e-06,0,-1e-06,0,2e-06,0,0,2e-06,0,0,0,0,-1e-06,0,-1e-06,3e-06,-1e-06,1e-06,2e-06,2e-06,0,1e-06,1e-06,0,0,-1e-06,-2e-06,0,-1e-06,0,-1e-06,0,-4e-06,1e-06,-1e-06,5e-06,0,0,-1e-06,-1e-06,0,4e-06,0,0,1e-06,-1e-06,-2e-06,0,-1e-06,0,3e-06,0,2e-06,1e-06,-1e-06,2e-06,0,-1e-06,-1e-06,-1e-06,-1e-06,1e-06,-1e-06,1e-06,0,-1e-06,0,-3e-06,2e-06,-2e-06,0,1e-06,1e-06,0,-2e-06,0,0,-2e-06,0,-1e-06,0,-1e-06,1e-06,0,-1e-06,0,-1e-06,0,3e-06,-3e-06,0,1e-06,2e-06,0,1e-06,0,-1e-06,-1e-06,1e-06,0,0,1e-06,0,0,-1e-06,0,0
0,-1e-06,0,-3e-06,0,1e-06,-1e-06,0,0,-3e-06,2e-06,0,1e-06,-1e-06,-1e-06,1e-06,0,1e-06,-1e-06,-1e-06,1e-06,-1e-06,0,-2e-06,0,-2e-06,-1e-06,0,1e-06,2e-06,1e-06,-3e-06,-3e-06,-2e-06,1e-06,-1e-06,2e-06,-1e-06,2e-06,1e-06,1e-06,1e-06,3e-06,-1e-06,1e-06,0,-4e-06,0,0,1e-06,-1e-06,0,0,0,0,-2e-06,0,1e-06,-2e-06,1e-06,1e-06,1e-06,-2e-06,-1e-06,0,0,3e-06,0,1e-06,-1e-06,-1e-06,0,-1e-06,-2e-06,-1e-06,0,0,0,0,0,0,2e-06,1e-06,3e-06,1e-06,-1e-06,1e-06,0,2e-06,0,0,2e-06,0,1e-06,0,-2e-06,1e-06,-1e-06,1e-06,1e-06,1e-06,-2e-06,-2e-06,0,0,-1e-06,-2e-06,0,-1e-06,-2e-06,0,0,1e-06,0,0,-1e-06,1e-06,1e-06,-2e-06,2e-06,0
0,2e-06,-1e-06,-1e-06,0,0,2e-06,0,-1e-06,3e-06,1e-06,0,0,0,1e-06,0,-1e-06,-2e-06,1e-06,-1e-06,-1e-06,0,1e-06,-3e-06,1e-06,0,0,-1e-06,-1e-06,4e-06,-1e-06,2e-06,0,2e-06,0,0,0,1e-06,-3e-06,-2e-06,-2e-06,-2e-06,-2e-06,1e-06,0,1e-06,3e-06,0,1e-06,0,0,0,-2e-06,-2e-06,-1e-06,0,-1e-06,0,-2e-06,-1e-06,1e-06,0,-3e-06,1e-06,-2e-06,0,3e-06,0,0,0,0,-1e-06,0,-1e-06,-1e-06,1e-06,-1e-06,1e-06,0,0,0,-1e-06,-1e-06,-5e-06,0,0,-2e-06,0,-2e-06,1e-06,0,-1e-06,1e-06,2e-06,1e-06,0,0,1e-06,0,0,0,-2e-06,0,1e-06,0,0,1e-06,1e-06,0,2e-06,0,0,0,0,0,-1e-06,0,0,1e-06,-3e-06,-1e-06
0,-4e-06,1e-06,1e-06,0,0,-2e-06,0,3e-06,-2e-06,1e-06,1e-06,-1e-06,0,1e-06,0,-1e-06,1e-06,-1e-06,2e-06,0,1e-06,-2e-06,-3e-06,-1e-06,1e-06,-2e-06,1e-06,1e-06,0,1e-06,-1e-06,0,-1e-06,0,-1e-06,-1e-06,-1e-06,3e-06,0,0,3e-06,0,-1e-06,0,2e-06,3e-06,0,0,0,0,-1e-06,1e-06,0,0,2e-06,1e-06,-1e-06,0,0,-1e-06,-2e-06,0,0,1e-06,1e-06,2e-06,0,0,0,-1e-06,0,1e-06,0,-1e-06,-1e-06,0,0,-1e-06,-1e-06,0,0,-2e-06,4e-06,-1e-06,-1e-06,1e-06,0,1e-06,-1e-06,1e-06,0,0,-3e-06,-1e-06,0,1e-06,0,0,-1e-06,-1e-06,-2e-06,0,2e-06,0,0,0,0,1e-06,-2e-06,-1e-06,0,0,0,0,0,-1e-06,0,-2e-06,1e-06,0
-1e-06,3e-06,0,2e-06,-2e-06,-1e-06,-1e-06,0,-2e-06,2e-06,0,-1e-06,2e-06,-1e-06,0,-1e-06,0,-1e-06,2e-06,0,1e-06,-1e-06,1e-06,-2e-06,0,1e-06,-1e-06,0,-1e-06,-2e-06,0,1e-06,0,0,-1e-06,1e-06,0,0,-1e-06,-1e-06,2e-06,-5e-06,3e-06,0,0,-3e-06,1e-06,-1e-06,0,-2e-06,0,-1e-06,-1e-06,-2e-06,1e-06,-2e-06,-1e-06,1e-06,2e-06,0,-2e-06,-2e-06,-2e-06,0,1e-06,0,1e-06,0,-1e-06,-1e-06,-1e-06,-1e-06,0,0,0,0,-1e-06,0,0,0,0,1e-06,1e-06,-5e-06,0,1e-06,2e-06,0,0,1e-06,0,1e-06,0,2e-06,0,0,0,0,-1e-06,0,1e-06,1e-06,-1e-06,-2e-06,0,0,0,0,0,2e-06,1e-06,0,0,0,0,1e-06,-1e-06,0,-1e-06,0,1e-06
0,-1e-06,-1e-06,-2e-06,1e-06,0,2e-06,0,1e-06,0,-3e-06,0,-1e-06,1e-06,-1e-06,1e-06,0,1e-06,0,0,0,1e-06,0,0,0,0,-1e-06,0,1e-06,-4e-06,-1e-06,-1e-06,1e-06,0,1e-06,-1e-06,-2e-06,-1e-06,0,1e-06,0,5e-06,-2e-06,0,0,1e-06,-2e-06,0,0,-1e-06,0,0,2e-06,-1e-06,0,0,0,0,1e-06,-1e-06,0,-1e-06,0,0,0,-1e-06,-2e-06,0,1e-06,2e-06,0,0,-1e-06,1e-06,-1e-06,-1e-06,0,0,0,-1e-06,0,-1e-06,2e-06,4e-06,0,-1e-06,-1e-06,0,0,-1e-06,1e-06,0,0,-1e-06,0,1e-06,0,-1e-06,1e-06,0,-1e-06,2e-06,1e-06,0,0,0,0,0,0,-1e-06,0,0,0,0,0,0,-1e-06,0,1e-06,-1e-06,1e-06
0,-1e-06,2e-06,-1e-06,2e-06,1e-06,-1e-06,0,-2e-06,-1e-06,1e-06,0,-1e-06,0,0,0,0,0,1e-06,1e-06,0,0,0,1e-06,0,-1e-06,-1e-06,0,-1e-06,0,0,-1e-06,0,-1e-06,0,0,1e-06,0,1e-06,0,0,-5e-06,0,0,1e-06,0,-5e-06,0,0,-1e-06,0,1e-06,-1e-06,0,0,2e-06,1e-06,0,0,1e-06,0,-1e-06,1e-06,0,-1e-06,0,-1e-06,0,-1e-06,-1e-06,-1e-06,0,-1e-06,-1e-06,0,0,0,0,0,-1e-06,0,0,-2e-06,-5e-06,-1e-06,0,-1e-06,0,1e-06,1e-06,0,-1e-06,0,-2e-06,1e-06,1e-06,-1e-06,1e-06,0,0,0,2e-06,-1e-06,-2e-06,0,0,0,0,0,1e-06,-1e-06,0,0,0,0,0,0,0,-1e-06,2e-06,0
0,4e-06,-1e-06,0,0,0,-2e-06,0,3e-06,3e-06,0,0,2e-06,0,0,0,1e-06,1e-06,0,0,0,-1e-06,-1e-06,3e-06,0,1e-06,-1e-06,0,1e-06,1e-06,0,1e-06,0,1e-06,0,0,0,-1e-06,-2e-06,-1e-06,1e-06,6e-06,1e-06,-1e-06,0,-1e-06,2e-06,0,-1e-06,3e-06,0,-1e-06,1e-06,-2e-06,0,0,0,0,-1e-06,-1e-06,-1e-06,0,3e-06,1e-06,0,0,-2e-06,0,1e-06,-1e-06,1e-06,-1e-06,0,-1e-06,-1e-06,0,-1e-06,1e-06,0,0,0,0,1e-06,4e-06,0,-1e-06,0,0,-2e-06,-1e-06,1e-06,-1e-06,-1e-06,1e-06,0,1e-06,-1e-06,0,1e-06,0,1e-06,0,1e-06,1e-06,0,0,1e-06,0,0,-2e-06,1e-06,-1e-06,0,0,0,0,1e-06,0,-2e-06,-1e-06,0
