8.9e-05,0.000209,0.000237,9.1e-05,1e-05,0.000148,5.2e-05,6e-06,5.7e-05,0.000123,0.000141,0.000153,8.4e-05,8.2e-05,0.000151,4.7e-05,0.000109,9.4e-05,0.000162,3.2e-05,4.3e-05,-1e-06,2.9e-05,5.4e-05,0.000156,0.000123,0.000131,8.5e-05,0.000127,8.8e-05,5.6e-05,8.3e-05,0.000123,0.000102,0.000107,5.3e-05,0.000125,0.00016,6.7e-05,0.000114,7.1e-05,6.2e-05,6.1e-05,0.000117,5.4e-05,9.9e-05,7.7e-05,1.9e-05,0.000153,9.4e-05,-6e-06,4.1e-05,9e-06,1.2e-05,-2.2e-05,-4e-05,6.2e-05,0.000174,7e-06,-1e-06,5.2e-05,3.8e-05,-3.6e-05,0.00022,0.00016,9.7e-05,0.000115,0.000122,0.000213,0.000156,9.8e-05,8.8e-05,-1.7e-05,1.1e-05,4.8e-05,0.000173,2.1e-05,1e-05,0.000121,0.000111,2.2e-05,8.3e-05,0.000154,7.1e-05,3.7e-05,2e-05,8.2e-05,0.000147,0.000105,4.5e-05,0.000138,4.2e-05,0.000101,7.6e-05,4.5e-05,0.000192,0.000144,0.000212,0.000163,-3.6e-05,1.9e-05,7e-05,-2.6e-05,7.1e-05,9.3e-05,7.4e-05,8e-05,9e-06,-6.6e-05,4.9e-05,5.1e-05,4e-06,0.000103,1.4e-05,3.7e-05,3.2e-05,7e-06,-4e-05,2.1e-05,-8.6e-05,0.00012
-0.000125,-0.000106,-3.4e-05,-0.00012,-0.000122,-0.000181,-0.000109,-3.3e-05,-5.5e-05,-0.000173,-5.9e-05,4.2e-05,1e-05,2.5e-05,-9.9e-05,-4e-06,-6.5e-05,-1.8e-05,-2.1e-05,-4.3e-05,-1e-05,5.3e-05,7.4e-05,1.8e-05,-5.6e-05,-3.3e-05,-0.00018,-0.000157,-0.000113,-9.6e-05,-8.4e-05,-6.7e-05,-6.6e-05,-1.6e-05,-4.6e-05,-4.9e-05,-5.2e-05,4.5e-05,-0.000182,-4.6e-05,-3.6e-05,-2.5e-05,-0.00018,-4.9e-05,-4.9e-05,-5.6e-05,3e-05,4.1e-05,-0.000155,-7.2e-05,-3.6e-05,-8.3e-05,-2e-05,-4.5e-05,-3.7e-05,-7.7e-05,-8.4e-05,-4e-05,-9.8e-05,-8.9e-05,2.2e-05,-4.9e-05,-1.4e-05,8e-06,-8.2e-05,-6.5e-05,-4.1e-05,-5.1e-05,-8.3e-05,-2.5e-05,-0.000104,8e-06,-9e-06,-5.4e-05,-1.3e-05,-2.4e-05,-6.9e-05,7.6e-05,9.6e-05,5.1e-05,8e-05,-2.4e-05,-0.000117,-7.1e-05,1.1e-05,-0.000145,-0.000102,-4.6e-05,-4e-06,-5.5e-05,-2.2e-05,-4.4e-05,-2e-06,4.4e-05,-2.3e-05,-6.6e-05,-8.9e-05,-5.9e-05,-6e-05,3.1e-05,3.1e-05,-0.000105,-5.1e-05,-0.000143,-6.8e-05,-3.4e-05,-6.3e-05,-4.5e-05,-1.3e-05,-0.000114,-1.3e-05,-6.5e-05,-6.2e-05,2e-06,-2.1e-05,3.1e-05,9e-05,9e-06,-6.1e-05,-1e-05,1e-05
-1e-04,-0.000151,-7.7e-05,-7.8e-05,-4.8e-05,-5.8e-05,-6.9e-05,-7.7e-05,-7e-05,-9e-05,-7.8e-05,1.7e-05,3.7e-05,-5.1e-05,-0.000153,-0.00011,-0.000107,-9.9e-05,-2.4e-05,2.5e-05,0.000114,5.4e-05,1e-06,-3.5e-05,-0.000123,-3.5e-05,-0.000105,-6.6e-05,-3.2e-05,-0.000111,-6e-05,-8.7e-05,-0.000115,-0.00011,-0.000143,-7.6e-05,-3e-05,-3.9e-05,3e-06,2e-05,-7.7e-05,-5.6e-05,-6.3e-05,4.3e-05,4e-06,-2.8e-05,3e-06,-8.1e-05,-8.8e-05,-0.000119,-1.1e-05,1e-05,-2.6e-05,-4.2e-05,-0.000138,9e-06,-0.000124,-0.000164,-9.5e-05,1e-05,1e-05,-1e-05,-9.4e-05,-9e-05,-0.000178,-7.4e-05,-0.000112,-0.000135,-0.000117,-0.00015,-0.000112,-6.8e-05,-5.9e-05,-8.3e-05,-8.5e-05,-0.000193,-0.000125,-0.000114,-5.5e-05,-0.000125,-6.5e-05,-3.5e-05,-0.000159,-0.000112,-0.000122,-6e-05,-0.000138,-0.000129,-2.9e-05,3.1e-05,-4.3e-05,-5.4e-05,-0.000114,-1.8e-05,1.8e-05,-2.1e-05,-6.9e-05,-7.3e-05,-0.000167,-0.00011,-7.4e-05,-8.2e-05,-5.1e-05,-5.4e-05,-0.000125,-7e-05,-0.000103,-1.8e-05,2.8e-05,-7.6e-05,-6.5e-05,-6.9e-05,-1.7e-05,-8.9e-05,1.1e-05,-3.2e-05,1.2e-05,-1.5e-05,-2.7e-05,-1.8e-05,-7.4e-05
-3.6e-05,-5.3e-05,-7.3e-05,7.3e-05,-7e-05,0.000118,-4e-06,-4.6e-05,1.2e-05,-3e-06,-7.3e-05,2.1e-05,-3.1e-05,-1e-06,-0.000108,-2.2e-05,-5.7e-05,-3.4e-05,2e-05,4e-05,-2.9e-05,-2.6e-05,3e-05,-6.3e-05,-9.8e-05,1.9e-05,-4.5e-05,-5.8e-05,-4e-05,-3.9e-05,-2.1e-05,-9.3e-05,-0.000109,-3.9e-05,6.8e-05,6.5e-05,-7.3e-05,-9.9e-05,-4.2e-05,-2.3e-05,3.1e-05,-3.8e-05,4.6e-05,-2.6e-05,5.7e-05,3.3e-05,3.7e-05,-3.1e-05,9.3e-05,1.7e-05,-1.9e-05,-4.1e-05,-2e-05,2.8e-05,5.3e-05,2.5e-05,-3e-05,-0.000116,-7e-06,5.5e-05,1.7e-05,2.2e-05,-6e-06,-0.000128,-8.2e-05,-5.8e-05,-1.1e-05,-6.5e-05,-8.6e-05,-0.000132,1.5e-05,3.8e-05,-1.6e-05,3e-05,-5.2e-05,-3.6e-05,-1.3e-05,9e-06,-1.3e-05,-9.1e-05,-3.2e-05,6.2e-05,-3e-05,-3.9e-05,3e-06,0.000107,-1.9e-05,-0.000111,-2.4e-05,-5.4e-05,8e-06,-1.6e-05,-6.7e-05,-5.1e-05,-8.3e-05,-3.1e-05,2.8e-05,-1.5e-05,-8.1e-05,-2.3e-05,-4e-06,-7.1e-05,-5.2e-05,7e-05,-6.9e-05,-1.8e-05,-8e-05,1.4e-05,-1.5e-05,-9e-05,1.6e-05,-4.9e-05,-8.6e-05,-4.2e-05,-1.8e-05,-2.9e-05,-2.7e-05,-1.3e-05,-4.4e-05,-3.1e-05,-3.5e-05
9.7e-05,4.8e-05,8.2e-05,0.000129,0.00014,0.000116,2.6e-05,1e-06,3.1e-05,7.6e-05,7.6e-05,7.8e-05,-2.5e-05,0.000114,1e-04,6.2e-05,3.5e-05,2.7e-05,6.6e-05,3.8e-05,6e-05,9e-06,5.5e-05,-1e-06,3e-06,3.4e-05,7.2e-05,8e-05,2.9e-05,0.000128,0.00011,9.6e-05,9.6e-05,6.2e-05,5.7e-05,5.3e-05,5.5e-05,-6.5e-05,1.1e-05,-1e-06,1.8e-05,-4.7e-05,8.2e-05,5.5e-05,6e-06,9.5e-05,7.2e-05,3.8e-05,0.000118,5.6e-05,5.1e-05,2.7e-05,6.3e-05,2.5e-05,-2.1e-05,7.8e-05,6.6e-05,0.000113,2.1e-05,-5.7e-05,-5e-05,-4.1e-05,-1e-05,-9e-06,7.3e-05,3.1e-05,7.5e-05,5.6e-05,6.3e-05,2.7e-05,7.5e-05,7.1e-05,8e-05,4.3e-05,0.000157,8.4e-05,0.000102,3.1e-05,-1.8e-05,-6.4e-05,-9.3e-05,1e-06,3.2e-05,0.000104,0,-1.2e-05,6.8e-05,3.7e-05,6.8e-05,1e-06,8.3e-05,0.000122,3e-06,5.3e-05,-5e-06,3.4e-05,5e-05,2.3e-05,4.4e-05,3.9e-05,1e-06,5.2e-05,5.5e-05,-1.2e-05,-2.7e-05,1.1e-05,7e-06,1.3e-05,3.1e-05,-3e-06,4.9e-05,2.4e-05,-3.8e-05,-4e-06,1.2e-05,2e-06,2e-06,-1.2e-05,6e-05,6.2e-05,2e-06
-4.1e-05,2.7e-05,0.000138,3.1e-05,2.3e-05,-7e-06,9.8e-05,7.6e-05,-6e-06,3.9e-05,8e-05,5.4e-05,-1.8e-05,-1e-05,1.4e-05,2.8e-05,-1e-06,5.1e-05,3.8e-05,-4.8e-05,-3e-06,0,-2.4e-05,-1.1e-05,3.7e-05,-2.1e-05,-1.7e-05,9.6e-05,6.9e-05,4.3e-05,2.7e-05,2.3e-05,1.1e-05,6.9e-05,1.6e-05,-1.6e-05,5.1e-05,7e-06,4.1e-05,-5.7e-05,-4e-06,4.4e-05,4e-06,-6e-06,-4.5e-05,-5.2e-05,1.9e-05,-1.2e-05,-1e-06,1.6e-05,-1e-06,-2.5e-05,-5e-06,4e-05,9.4e-05,7e-06,-1.7e-05,3.7e-05,2.4e-05,-3.1e-05,2.8e-05,1.8e-05,4.9e-05,2.9e-05,4.1e-05,-3.4e-05,2.6e-05,6.9e-05,9.7e-05,0.000105,-9e-06,1.8e-05,2.4e-05,-1e-05,2.2e-05,-2e-06,3.4e-05,6.9e-05,4.2e-05,5.5e-05,-4e-06,7e-06,2.1e-05,3.1e-05,6.8e-05,-7e-06,-1.1e-05,2.7e-05,-5.1e-05,8e-06,-5.4e-05,2.1e-05,6.9e-05,-3e-06,6e-06,-5.5e-05,5.4e-05,0.000114,4.8e-05,9e-06,1e-06,2.6e-05,2.6e-05,1.8e-05,7.5e-05,3.2e-05,1.3e-05,-3e-05,-2.7e-05,4.7e-05,7e-05,2.5e-05,8.3e-05,-7e-06,-1.6e-05,-4.2e-05,-1.6e-05,1.2e-05,-2.4e-05,-1.8e-05,-2e-05
1.3e-05,-8.8e-05,-4.3e-05,-3.6e-05,-3.9e-05,2.2e-05,-2.7e-05,-3e-06,-4.8e-05,-5.2e-05,-1.2e-05,-4e-06,-2.9e-05,3.5e-05,-1.8e-05,-4.3e-05,8e-06,-2e-06,-6e-06,-4.2e-05,-6.4e-05,1.1e-05,-5.5e-05,-2.2e-05,2.6e-05,-7.8e-05,-2.7e-05,-7.1e-05,-7.4e-05,-9e-06,-5.3e-05,-2.4e-05,-3.6e-05,-3e-06,-4e-05,-9.3e-05,-8e-06,2.5e-05,5e-05,-1.2e-05,-4.7e-05,-8e-06,3e-06,-5e-05,1.3e-05,-1.9e-05,-3.2e-05,-1.8e-05,6e-06,-4.7e-05,-5.2e-05,2.6e-05,-2.9e-05,-4.7e-05,-6.2e-05,-4.7e-05,-2.8e-05,1.8e-05,-4.4e-05,3.6e-05,-2.5e-05,5e-06,-2.2e-05,1.9e-05,-2.1e-05,-5.3e-05,-5.4e-05,-1.8e-05,7e-06,-2.1e-05,-1.6e-05,-4.8e-05,2.3e-05,-2.1e-05,1.4e-05,-1.9e-05,-4.5e-05,-7.7e-05,-6.5e-05,-2.1e-05,7e-06,-4.1e-05,-6.4e-05,-1.8e-05,-8e-06,-8.3e-05,-6.8e-05,3.6e-05,-5.3e-05,1.2e-05,-1.3e-05,-2.2e-05,-6.4e-05,1e-06,-5.9e-05,-4.9e-05,-4.8e-05,5e-06,-4e-06,-1.1e-05,-4e-06,1.2e-05,2.7e-05,-2e-06,1.2e-05,-1.1e-05,-1.7e-05,-6e-06,-3.5e-05,-4.9e-05,-7.5e-05,-4e-05,-5.6e-05,-1.1e-05,-2.4e-05,-3e-06,-3.2e-05,-6.7e-05,-2e-05,-6e-06,-1.2e-05
1e-06,-5.7e-05,-6.9e-05,-4.7e-05,-3.9e-05,-8.7e-05,-6.2e-05,-4.5e-05,3e-06,-2.9e-05,-4.4e-05,-3.6e-05,-3.1e-05,2.8e-05,7e-06,-7e-05,-3.8e-05,-5.5e-05,-2.8e-05,5e-06,-3.6e-05,4.3e-05,1.3e-05,-2.3e-05,5e-06,-3.6e-05,-6e-06,-3.7e-05,-4.7e-05,-5.6e-05,-7e-06,-2e-05,-2.3e-05,-5.9e-05,-3e-05,-5.2e-05,-3.2e-05,-2e-05,2.5e-05,6.5e-05,-3.6e-05,-3e-05,-2e-05,3.7e-05,-2.2e-05,-2.7e-05,2.6e-05,-1e-05,-2.9e-05,-6.2e-05,-3.6e-05,-3e-06,-3.1e-05,1.1e-05,-3e-06,8e-06,-1.7e-05,-2.7e-05,-2.3e-05,-1.9e-05,-3e-05,-5.1e-05,-1.5e-05,1.7e-05,3.4e-05,1.6e-05,6e-06,-1.7e-05,-3.9e-05,-9e-06,-9e-05,1.6e-05,-3.9e-05,-8e-06,-3e-05,-2.9e-05,-1.7e-05,-2.2e-05,-2.8e-05,2e-06,1.7e-05,-3e-06,-1.2e-05,-5.5e-05,-5.2e-05,1.5e-05,1.9e-05,-2.8e-05,-6.2e-05,2.8e-05,1.3e-05,-9e-06,-3.4e-05,5e-06,-3e-06,-2.9e-05,-9.4e-05,-3.4e-05,0,-1.4e-05,-2.7e-05,-1.3e-05,-2.1e-05,-8e-06,-4.8e-05,-2.6e-05,-1.4e-05,-2.7e-05,-3e-05,-6e-06,-3.5e-05,-2.1e-05,-5.8e-05,1.5e-05,4e-05,-1.2e-05,-4.4e-05,8e-06,-1.5e-05,-2.5e-05,-1.4e-05
2.4e-05,-1.6e-05,-3.6e-05,-3.6e-05,3.1e-05,2e-06,1.7e-05,-1.6e-05,-2.5e-05,-1.8e-05,-1.5e-05,-3.5e-05,-3.2e-05,3.4e-05,-2.6e-05,-3e-06,1.4e-05,-4.9e-05,-4.3e-05,9e-06,-1.8e-05,-5.8e-05,-5.5e-05,-6.2e-05,-1e-06,1.9e-05,-8e-06,-2.2e-05,-1.6e-05,-2e-06,1e-06,-6e-06,-3.7e-05,-2.8e-05,1.3e-05,3.2e-05,2.9e-05,-1.6e-05,-4.7e-05,6e-06,-2.4e-05,-3.4e-05,-1.6e-05,-8e-06,-5.8e-05,-3.6e-05,1e-05,-3e-06,2.3e-05,-8e-06,-1.4e-05,-1.4e-05,-8e-06,1.4e-05,-1.1e-05,8e-06,2.5e-05,-2.8e-05,1.7e-05,6e-06,2e-05,-2.2e-05,-3e-06,-4e-05,-2.8e-05,8.1e-05,-1.3e-05,-3.2e-05,-4.1e-05,-2.9e-05,-4.4e-05,-2.3e-05,-9e-06,-6e-06,-1e-06,-6e-06,-8e-06,-2.7e-05,-5.1e-05,-2e-06,2.1e-05,-4e-06,3.5e-05,-1.7e-05,-9e-06,-2.2e-05,1.5e-05,-5.1e-05,7e-06,-1.8e-05,-5e-06,2e-05,9e-06,4e-06,-2.4e-05,-1.4e-05,-2e-05,-1e-05,-3.3e-05,2e-06,1.1e-05,6e-06,3e-06,2.5e-05,-1.2e-05,-2.5e-05,-3e-06,1.4e-05,2.8e-05,3.3e-05,-5e-06,-2.5e-05,-2.2e-05,-4.5e-05,4e-05,1.6e-05,-6e-06,-2.4e-05,0,-4e-05,-3.6e-05
1.8e-05,4.3e-05,1.9e-05,3.1e-05,3.6e-05,3.2e-05,6e-05,-1e-05,1.7e-05,9e-06,3.4e-05,5e-06,-1.1e-05,1.5e-05,1.7e-05,1.3e-05,2.6e-05,-3e-06,-1.8e-05,2e-06,1.8e-05,-3e-06,-2e-05,6e-06,-6e-06,2.7e-05,2.5e-05,1.1e-05,1.2e-05,-2.1e-05,5.2e-05,3.9e-05,1.9e-05,6e-06,3.1e-05,9e-06,4e-05,3e-06,7e-06,-3.3e-05,-3e-06,-4e-06,5e-06,-2.6e-05,8e-06,-9e-06,5e-05,4e-06,7e-06,1.7e-05,7e-06,1.1e-05,3e-06,3e-06,1.8e-05,2e-05,2e-06,3e-05,-1e-05,1.3e-05,1.7e-05,-1e-05,2.9e-05,-1.2e-05,-5e-06,5.3e-05,3e-06,3.3e-05,9e-06,-1e-05,2.7e-05,2.1e-05,2.2e-05,2.8e-05,1.4e-05,6.1e-05,2.9e-05,2.1e-05,7e-06,5e-06,1.4e-05,-3.5e-05,1e-06,0,1.4e-05,3.7e-05,3e-06,6e-06,4e-05,6e-06,4e-06,8e-06,3.6e-05,2.8e-05,5.6e-05,7e-06,-1.5e-05,2.6e-05,1e-06,-1e-06,1.5e-05,-4e-06,-6e-06,3e-06,3.7e-05,1.6e-05,3.3e-05,1e-06,-2.7e-05,-4e-06,1.1e-05,5e-05,9e-06,1.9e-05,2.2e-05,8e-06,2.4e-05,8e-06,4e-06,1.4e-05,2.9e-05
-3.3e-05,-2.2e-05,-1.6e-05,2.7e-05,-2.2e-05,-1.7e-05,1.2e-05,5e-06,2.9e-05,-2.4e-05,-1.1e-05,2.7e-05,-8e-06,-2.5e-05,-2.4e-05,6e-06,3.2e-05,3e-06,2.1e-05,-1e-05,-1.9e-05,-2.4e-05,-1.5e-05,1e-06,-1.2e-05,2.4e-05,3e-06,-1.7e-05,3.3e-05,-1e-06,7e-06,1.3e-05,8e-06,-3e-06,4e-06,-5e-06,-2.1e-05,-1.4e-05,-2.5e-05,-3.1e-05,-1.7e-05,1.7e-05,2.8e-05,-4e-06,2.1e-05,-8e-06,-1.7e-05,3e-06,-1e-06,-1e-05,6e-06,2.9e-05,-4e-06,6e-06,-3e-06,-1.1e-05,-2e-06,-1.7e-05,1.2e-05,7e-06,-3.1e-05,-2.4e-05,-1e-05,1.4e-05,1.5e-05,-1.6e-05,-2e-05,1.2e-05,1.6e-05,1.4e-05,1.1e-05,-6e-06,2e-06,-4e-06,-2e-06,0,-1.4e-05,3e-06,1.4e-05,1.3e-05,-1e-05,-1.7e-05,2.2e-05,0,3.2e-05,1.1e-05,6e-06,1.3e-05,1e-05,2.8e-05,3.2e-05,-2.6e-05,2e-05,4e-06,0,-9e-06,-4.7e-05,1.3e-05,1e-05,-6e-06,6e-06,-2e-06,-6e-06,-6e-06,-1.7e-05,9e-06,3.2e-05,9e-06,-1.4e-05,6e-06,5e-06,2.7e-05,5e-06,4e-06,-2.8e-05,-5e-06,6e-06,1.2e-05,1.6e-05,-2e-06,-1.3e-05
-1.4e-05,-5e-06,-2.6e-05,-3e-05,-3.7e-05,-2e-06,-2.1e-05,9e-06,-2.7e-05,-7e-06,1e-06,1.4e-05,-4e-06,-2.7e-05,3e-06,2.3e-05,-8e-06,-1.4e-05,1.1e-05,-1.8e-05,-1.6e-05,-9e-06,3e-06,-1.2e-05,2e-06,8e-06,-1.3e-05,6e-06,-4e-06,1.2e-05,1.5e-05,-2.6e-05,-7e-06,-3e-06,-1.3e-05,2e-06,-2.8e-05,-2e-06,-4e-06,-1.7e-05,5e-06,2e-06,6e-06,6e-06,2.1e-05,3e-06,-2.1e-05,-2.3e-05,-1.1e-05,-1.3e-05,2e-06,3e-06,1.4e-05,-3.3e-05,-1.1e-05,-1.9e-05,-1.7e-05,-3e-06,-1.6e-05,2.4e-05,1.3e-05,2.3e-05,1.8e-05,3e-06,-1e-06,-4e-05,-1.3e-05,-1.1e-05,4e-06,9e-06,1.3e-05,-1.9e-05,-7e-06,-1.4e-05,-2.9e-05,1.2e-05,8e-06,3e-06,5e-06,2.4e-05,0,2e-06,1e-05,-6e-06,-4e-06,-1.6e-05,-6e-06,-2.2e-05,2e-06,1.6e-05,-2.5e-05,3e-06,4e-06,-2e-05,-1.3e-05,1e-06,1e-06,8e-06,1.1e-05,4e-06,-3.4e-05,-6e-06,7e-06,-3.3e-05,-1.3e-05,3e-06,-9e-06,0,4e-06,-2e-06,1.6e-05,-2.1e-05,-1.2e-05,-5e-06,-1.8e-05,-1.9e-05,1.3e-05,0,-5e-06,0,2e-06
7e-06,9e-06,-9e-06,2e-06,-3e-06,-4e-06,2.1e-05,-1.5e-05,2e-06,-7e-06,-7e-06,-1.2e-05,1e-06,-1.7e-05,-4e-06,6e-06,-2.5e-05,5e-06,-2.5e-05,-1.1e-05,-3e-06,1.1e-05,2e-06,6e-06,-1.3e-05,-2.5e-05,-8e-06,3e-06,-2.5e-05,-2.5e-05,-1.8e-05,4e-06,-7e-06,-8e-06,-1.2e-05,-1e-05,-2.4e-05,-7e-06,-3e-06,2e-06,1.8e-05,0,5e-06,7e-06,-8e-06,-5e-06,-9e-06,-2e-06,-1.2e-05,9e-06,-1.1e-05,3e-06,3e-06,2e-06,2e-06,-1.6e-05,-1e-06,-1.5e-05,1e-06,-3e-06,1.6e-05,-3e-06,2e-06,-1.5e-05,4e-06,-3e-06,9e-06,0,-1e-06,1e-06,-1e-06,-2.7e-05,-1.9e-05,-1.7e-05,3e-06,-4e-06,-1e-06,8e-06,-2e-05,-5e-06,0,9e-06,2e-05,1.2e-05,-1.8e-05,-1.9e-05,-1e-06,-9e-06,-2e-05,-1.6e-05,-1.2e-05,8e-06,1.9e-05,4e-06,-1.7e-05,2e-06,-4e-06,-2.7e-05,-1.2e-05,-8e-06,-1.6e-05,-5e-06,-7e-06,-2e-05,3e-06,-4e-06,-1.4e-05,-3e-06,1.4e-05,0,8e-06,4e-06,-5e-06,-2e-06,-6e-06,2e-06,-1e-06,3e-06,8e-06,5e-06,-2.8e-05
-3e-06,-1.7e-05,1e-06,-9e-06,-1.6e-05,6e-06,-1e-05,-1.5e-05,-8e-06,-7e-06,1e-06,-1e-06,-4e-06,-1.4e-05,1.2e-05,3e-06,-1e-06,0,-1.1e-05,1e-06,2e-06,0,-9e-06,8e-06,-1.2e-05,-1.2e-05,-1e-06,9e-06,-6e-06,3e-06,-1.6e-05,9e-06,-5e-06,-1e-06,-1.2e-05,-5e-06,9e-06,-2e-06,-9e-06,1.8e-05,1.9e-05,1e-06,2e-06,-1.8e-05,-3.2e-05,-7e-06,-1.3e-05,-4e-06,-1.3e-05,-3e-06,-3e-06,-1.2e-05,-6e-06,-3e-06,-4e-06,-3e-06,6e-06,4e-06,-4e-06,-1.3e-05,0,-7e-06,-8e-06,-5e-06,-2e-06,-9e-06,2.8e-05,0,-3e-06,-4e-06,-5e-06,-9e-06,4e-06,-7e-06,3e-06,1e-06,-2e-06,-5e-06,-5e-06,0,1e-06,2.4e-05,-3e-06,1.4e-05,-6e-06,3e-06,-5e-06,-3e-06,-1.7e-05,-1.2e-05,-2.3e-05,-1.7e-05,-1e-06,0,-1e-06,8e-06,1.1e-05,-1.7e-05,2e-06,0,-2e-06,-2e-06,5e-06,2.5e-05,6e-06,0,-1e-05,3e-06,1.3e-05,1e-05,-1e-06,-7e-06,6e-06,2e-06,-1e-05,-5e-06,-2e-06,-3e-06,-8e-06,0,3e-06
0,-3e-06,3e-06,-1e-06,-1.4e-05,1e-06,1e-06,6e-06,-8e-06,2e-06,-1.1e-05,6e-06,0,-1e-05,1e-06,-6e-06,-2e-06,4e-06,-1e-06,1.4e-05,-7e-06,-1.4e-05,-5e-06,-2e-06,-1.3e-05,-1.3e-05,-1e-06,2e-06,7e-06,1.1e-05,-9e-06,4e-06,1e-06,1e-06,4e-06,-6e-06,-3e-06,-5e-06,3e-06,6e-06,-2.8e-05,3e-06,0,3e-06,1e-05,0,-1.1e-05,7e-06,5e-06,2e-06,7e-06,-1e-06,-4e-06,-3e-06,4e-06,1e-06,2e-06,-2e-06,-2e-06,-5e-06,-1.2e-05,6e-06,-1.1e-05,4e-06,2e-06,1.1e-05,1.1e-05,-7e-06,4e-06,-4e-06,-1.6e-05,4e-06,1e-05,-3e-06,-2e-06,0,6e-06,1e-06,1e-05,-1e-06,2e-06,7e-06,0,4e-06,-3e-06,6e-06,9e-06,1.6e-05,-4e-06,-3e-06,-3e-06,1.1e-05,1.1e-05,-8e-06,-1e-06,0,7e-06,-8e-06,0,0,4e-06,2e-06,-2e-06,-3e-06,1.2e-05,5e-06,-3e-06,0,-1e-06,6e-06,1e-06,1e-06,1e-06,-1e-06,1e-05,-1e-06,-4e-06,7e-06,0,1e-06,1.4e-05
1e-06,-8e-06,-2e-06,-3e-06,1.4e-05,-1.2e-05,-9e-06,1.5e-05,9e-06,5e-06,-3e-06,-1.1e-05,-1.3e-05,-5e-06,7e-06,2e-06,1e-06,0,0,6e-06,-5e-06,5e-06,-7e-06,-4e-06,-7e-06,5e-06,0,-1e-06,-2e-06,1e-06,-8e-06,0,3e-06,-2e-06,0,3e-06,-2e-06,2e-06,2e-06,-5e-06,-4e-06,3e-06,-2e-06,-1.3e-05,5e-06,0,2e-06,-6e-06,-8e-06,-2e-06,-1e-06,8e-06,1e-06,6e-06,-1e-06,6e-06,7e-06,5e-06,3e-06,3e-06,-1e-06,-2e-06,-3e-06,-1e-06,-1e-06,1.9e-05,-2e-06,-1e-06,4e-06,6e-06,-3e-06,0,-8e-06,-2e-06,3e-06,5e-06,-2e-06,-8e-06,3e-06,4e-06,-1e-06,-3e-06,-5e-06,9e-06,-4e-06,-1e-06,-3e-06,-7e-06,8e-06,3e-06,-2e-06,4e-06,-1e-06,-5e-06,6e-06,-2e-06,-3e-06,-1e-05,0,-1e-06,6e-06,1e-06,1e-06,1.2e-05,-1.4e-05,-4e-06,-2e-06,-2e-06,-2e-06,-8e-06,-6e-06,-5e-06,3e-06,1e-06,3e-06,1e-06,0,-1e-06,-2e-06,-1e-06,0
-1e-06,-3e-06,1e-06,1e-06,3e-06,-5e-06,4e-06,-5e-06,2e-06,-4e-06,-3e-06,-8e-06,-4e-06,-6e-06,0,2e-06,-1e-06,-7e-06,-3e-06,-3e-06,3e-06,8e-06,-6e-06,-3e-06,0,8e-06,2e-06,3e-06,0,6e-06,4e-06,1e-05,-7e-06,-2e-06,1e-06,-1e-06,-1e-06,4e-06,2e-06,-7e-06,-1e-06,-6e-06,-4e-06,2e-06,-2e-06,-2e-06,7e-06,-1e-06,1e-06,1e-06,-5e-06,-1e-06,-8e-06,0,-1e-06,6e-06,-2e-06,-6e-06,-5e-06,7e-06,5e-06,-1e-06,-6e-06,0,2e-06,-1e-06,-2e-06,-3e-06,-3e-06,-6e-06,-1e-05,1.4e-05,-2e-06,-1e-06,5e-06,-6e-06,0,1e-06,1e-06,1e-06,-3e-06,-9e-06,-1e-06,1e-06,-5e-06,6e-06,1e-06,0,7e-06,-1e-06,0,-1e-06,4e-06,-1e-06,0,-4e-06,4e-06,-1e-05,0,0,2e-06,-2e-06,0,-4e-06,5e-06,1e-06,5e-06,0,-1e-05,2e-06,-4e-06,4e-06,0,-1e-06,-1.2e-05,-2e-06,2e-06,0,1e-06,-5e-06,-2e-06
-1e-06,-3e-06,6e-06,2e-06,-6e-06,1e-06,6e-06,-7e-06,-1e-06,0,2e-06,4e-06,-1e-06,1e-06,2e-06,5e-06,3e-06,1e-06,2e-06,-6e-06,-2e-06,2e-06,2e-06,-1e-06,-7e-06,6e-06,-1e-06,-7e-06,6e-06,-1e-06,1e-06,2e-06,1e-06,2e-06,5e-06,2e-06,3e-06,-1e-06,2e-06,6e-06,-7e-06,-1e-06,-3e-06,0,4e-06,-1e-06,-4e-06,2e-06,2e-06,-3e-06,5e-06,-3e-06,-1e-06,2e-06,1e-06,2e-06,0,6e-06,3e-06,0,-3e-06,-8e-06,-3e-06,2e-06,0,-1.4e-05,-4e-06,2e-06,-1e-06,-2e-06,4e-06,2e-06,8e-06,-3e-06,-3e-06,5e-06,2e-06,3e-06,-3e-06,-2e-06,0,-5e-06,-2e-06,-3e-06,6e-06,-5e-06,2e-06,-2e-06,4e-06,-4e-06,-4e-06,-2e-06,6e-06,-2e-06,0,1e-06,-1.1e-05,-1e-06,2e-06,-1e-06,1e-06,-1e-06,1e-06,-1e-06,6e-06,1e-06,0,0,-4e-06,0,0,5e-06,0,-4e-06,-4e-06,0,3e-06,0,0,1e-06,3e-06
2e-06,0,-2e-06,9e-06,0,-7e-06,-8e-06,7e-06,2e-06,-3e-06,-3e-06,6e-06,0,6e-06,-1e-06,3e-06,-1e-06,-5e-06,2e-06,-4e-06,-2e-06,2e-06,0,1e-06,-1e-06,1e-06,0,0,5e-06,2e-06,3e-06,-3e-06,2e-06,-1e-06,-3e-06,-1e-06,-3e-06,-2e-06,1e-06,4e-06,4e-06,2e-06,-2e-06,3e-06,-3e-06,-2e-06,1e-06,-1e-06,0,-1e-06,2e-06,1e-06,2e-06,-3e-06,-1e-06,-2e-06,-2e-06,-3e-06,-2e-06,-1e-06,-3e-06,-2e-06,0,0,-2e-06,-9e-06,-6e-06,-1e-06,2e-06,3e-06,5e-06,0,0,0,-2e-06,0,-2e-06,-2e-06,6e-06,3e-06,1e-06,-4e-06,0,-4e-06,7e-06,-1e-06,-1e-06,5e-06,-1e-06,-1e-06,2e-06,1e-06,0,0,-1e-06,-1e-06,-8e-06,6e-06,-1e-06,-1e-06,-1e-06,0,-2e-06,1e-06,-6e-06,1e-06,-2e-06,0,3e-06,0,2e-06,2e-06,0,3e-06,4e-06,0,1e-06,-1e-06,1e-06,-1e-06,-2e-06
0,-5e-06,-5e-06,-3e-06,5e-06,5e-06,-2e-06,4e-06,0,-2e-06,1e-06,2e-06,-2e-06,6e-06,0,5e-06,-2e-06,-4e-06,3e-06,0,-2e-06,-8e-06,-3e-06,-2e-06,0,-5e-06,-1e-06,-2e-06,-4e-06,-3e-06,-2e-06,-2e-06,-5e-06,-1e-06,-1e-06,-1e-06,-2e-06,2e-06,2e-06,3e-06,4e-06,1e-06,0,-3e-06,2e-06,-1e-06,-1e-06,-3e-06,2e-06,0,-5e-06,-1e-06,2e-06,1e-06,1e-06,-2e-06,1e-06,2e-06,-1e-06,-1e-06,3e-06,2e-06,-1e-06,1e-06,4e-06,2e-06,-3e-06,0,0,0,1e-06,-3e-06,-1e-06,-3e-06,1e-06,-4e-06,0,2e-06,-2e-06,0,-1e-06,0,1e-06,-1e-06,-3e-06,-5e-06,-1e-06,-2e-06,-5e-06,1e-06,-1e-06,2e-06,1e-06,0,-3e-06,1e-06,-3e-06,2e-06,0,1e-06,-1e-06,-1e-06,2e-06,-1e-06,-1e-06,0,0,0,4e-06,0,1e-06,-3e-06,-3e-06,0,3e-06,-1e-06,1e-06,2e-06,0,-1e-06,0
2e-06,1e-06,0,-3e-06,-1e-06,2e-06,1e-06,-6e-06,-3e-06,-3e-06,1e-06,0,-2e-06,5e-06,0,2e-06,-1e-06,0,-2e-06,4e-06,2e-06,0,1e-06,-1e-06,-1e-06,-4e-06,0,1e-06,-4e-06,-4e-06,-2e-06,1e-06,-1e-06,-1e-06,0,-4e-06,4e-06,0,1e-06,-2e-06,2e-06,-1e-06,0,1e-06,4e-06,0,4e-06,1e-06,2e-06,-1e-06,0,-1e-06,-1e-06,0,-1e-06,-1e-06,-1e-06,-3e-06,-1e-06,-3e-06,1e-06,-1e-06,-2e-06,1e-06,-2e-06,6e-06,3e-06,-1e-06,-2e-06,-1e-06,1e-06,0,-1e-06,-1e-06,-3e-06,2e-06,0,1e-06,-3e-06,0,0,0,-3e-06,-1e-06,-2e-06,1e-06,1e-06,-4e-06,-7e-06,2e-06,-1e-06,-4e-06,-1e-06,0,-1e-06,0,-4e-06,-1e-06,2e-06,-1e-06,1e-06,0,-1e-06,2e-06,1e-06,-1e-06,-2e-06,0,2e-06,1e-06,1e-06,-3e-06,0,-4e-06,3e-06,1e-06,-1e-06,-1e-06,-1e-06,1e-06,0
-1e-06,-3e-06,1e-06,2e-06,-3e-06,3e-06,1e-06,-5e-06,0,-2e-06,1e-06,1e-06,-1e-06,4e-06,-1e-06,-1e-06,0,-1e-06,-2e-06,3e-06,-1e-06,3e-06,1e-06,1e-06,0,-2e-06,0,0,0,0,-2e-06,1e-06,2e-06,0,-2e-06,0,3e-06,-1e-06,-1e-06,-6e-06,1e-06,-1e-06,0,1e-06,-6e-06,-1e-06,0,1e-06,-3e-06,-1e-06,1e-06,-1e-06,1e-06,0,1e-06,0,1e-06,3e-06,-1e-06,1e-06,-3e-06,0,-1e-06,-1e-06,1e-06,6e-06,-2e-06,2e-06,0,0,-4e-06,-3e-06,2e-06,0,1e-06,-1e-06,0,1e-06,-1e-06,0,-1e-06,2e-06,-2e-06,2e-06,1e-06,2e-06,2e-06,0,0,-2e-06,1e-06,0,2e-06,1e-06,1e-06,0,1e-06,2e-06,-1e-06,0,1e-06,0,0,-1e-06,4e-06,1e-06,-1e-06,0,0,1e-06,2e-06,2e-06,1e-06,2e-06,2e-06,0,-2e-06,1e-06,0,1e-06,0
-1e-06,-3e-06,-2e-06,-6e-06,3e-06,3e-06,-4e-06,3e-06,2e-06,-1e-06,-2e-06,-1e-06,-1e-06,1e-06,1e-06,0,2e-06,1e-06,-2e-06,0,-2e-06,0,-3e-06,0,-1e-06,2e-06,0,2e-06,1e-06,-2e-06,0,-2e-06,-3e-06,-1e-06,2e-06,-1e-06,-1e-06,0,-2e-06,-1e-06,-2e-06,1e-06,0,-2e-06,-2e-06,0,4e-06,-2e-06,2e-06,1e-06,-1e-06,-1e-06,-1e-06,1e-06,-1e-06,1e-06,-1e-06,-2e-06,1e-06,-1e-06,-1e-06,1e-06,0,0,0,0,2e-06,-1e-06,0,2e-06,-5e-06,1e-06,1e-06,0,0,-1e-06,1e-06,-4e-06,1e-06,0,0,1e-06,-2e-06,2e-06,1e-06,2e-06,-2e-06,2e-06,3e-06,-2e-06,1e-06,2e-06,-3e-06,0,2e-06,0,2e-06,3e-06,-1e-06,0,1e-06,0,0,-1e-06,-1e-06,0,1e-06,0,0,-2e-06,-2e-06,-1e-06,0,1e-06,-2e-06,-1e-06,0,-1e-06,-1e-06,0,2e-06
1e-06,1e-06,-2e-06,1e-06,0,-3e-06,0,2e-06,-2e-06,-1e-06,1e-06,-2e-06,-1e-06,0,-1e-06,0,0,0,1e-06,-3e-06,0,-2e-06,-1e-06,-2e-06,-1e-06,4e-06,0,1e-06,0,0,3e-06,-1e-06,-1e-06,-1e-06,1e-06,2e-06,-2e-06,0,-1e-06,3e-06,-2e-06,0,0,1e-06,2e-06,0,1e-06,0,-2e-06,0,-1e-06,1e-06,-3e-06,-1e-06,1e-06,-1e-06,0,1e-06,-2e-06,-1e-06,3e-06,-1e-06,0,1e-06,0,-3e-06,2e-06,-1e-06,0,0,-3e-06,2e-06,-3e-06,0,-1e-06,0,-1e-06,0,3e-06,0,1e-06,2e-06,-2e-06,4e-06,-1e-06,2e-06,2e-06,-1e-06,3e-06,2e-06,0,-2e-06,-1e-06,0,0,-1e-06,1e-06,0,1e-06,-1e-06,-2e-06,0,-1e-06,-2e-06,-4e-06,0,1e-06,0,-1e-06,0,-1e-06,0,0,-2e-06,-2e-06,1e-06,1e-06,1e-06,0,0,-1e-06
0,-4e-06,2e-06,1e-06,-5e-06,-1e-06,3e-06,-3e-06,2e-06,-1e-06,0,-3e-06,-2e-06,-2e-06,1e-06,-1e-06,0,-1e-06,0,-2e-06,0,-1e-06,-1e-06,0,-1e-06,2e-06,0,1e-06,0,3e-06,3e-06,1e-06,1e-06,1e-06,-1e-06,0,2e-06,0,-1e-06,4e-06,0,-1e-06,-1e-06,-1e-06,0,-1e-06,-1e-06,0,0,-1e-06,3e-06,0,-1e-06,0,0,-1e-06,0,-1e-06,1e-06,3e-06,0,-1e-06,0,0,-1e-06,-7e-06,1e-06,1e-06,-1e-06,-2e-06,-1e-06,-2e-06,-2e-06,-1e-06,1e-06,0,1e-06,1e-06,-2e-06,0,0,0,-1e-06,2e-06,-2e-06,-3e-06,1e-06,-2e-06,2e-06,2e-06,0,-1e-06,0,1e-06,-1e-06,0,3e-06,0,0,0,-1e-06,0,0,-2e-06,2e-06,-1e-06,0,0,-1e-06,0,0,1e-06,0,1e-06,0,-1e-06,1e-06,-1e-06,0,0,-1e-06
-1e-06,0,2e-06,1e-06,-4e-06,-2e-06,1e-06,-1e-06,0,0,0,0,-1e-06,-2e-06,-1e-06,1e-06,0,1e-06,0,0,0,0,-1e-06,0,0,-1e-06,0,-1e-06,1e-06,-1e-06,2e-06,0,-2e-06,0,0,1e-06,0,1e-06,-1e-06,-2e-06,-4e-06,0,0,1e-06,3e-06,0,-3e-06,-1e-06,1e-06,0,-1e-06,0,1e-06,-1e-06,0,-2e-06,0,1e-06,-1e-06,-1e-06,-3e-06,0,1e-06,-1e-06,0,-2e-06,0,0,0,2e-06,0,1e-06,2e-06,-1e-06,1e-06,-1e-06,-1e-06,-1e-06,0,0,0,-1e-06,-1e-06,0,2e-06,-1e-06,-1e-06,0,-1e-06,0,-1e-06,2e-06,-2e-06,0,-1e-06,0,-3e-06,0,-1e-06,0,0,0,0,2e-06,3e-06,0,0,0,0,0,-1e-06,1e-06,1e-06,0,3e-06,0,0,0,0,-1e-06,0
0,-1e-06,-1e-06,2e-06,1e-06,-3e-06,-2e-06,1e-06,-2e-06,0,-1e-06,4e-06,-1e-06,-2e-06,1e-06,1e-06,0,-2e-06,0,2e-06,-2e-06,2e-06,0,-1e-06,-2e-06,-2e-06,0,-1e-06,0,2e-06,0,-2e-06,0,0,-1e-06,-1e-06,-1e-06,-1e-06,0,-2e-06,0,0,0,-1e-06,-2e-06,0,-2e-06,0,-2e-06,-1e-06,-1e-06,-1e-06,0,0,1e-06,-1e-06,0,-1e-06,0,0,0,-2e-06,1e-06,0,1e-06,7e-06,0,0,1e-06,0,3e-06,-1e-06,0,-2e-06,-1e-06,1e-06,0,0,0,0,0,-2e-06,0,-1e-06,1e-06,-2e-06,0,2e-06,-3e-06,-1e-06,-1e-06,1e-06,-1e-06,0,0,1e-06,-2e-06,1e-06,1e-06,0,0,0,0,0,-3e-06,0,0,0,-1e-06,0,0,-1e-06,0,-1e-06,1e-06,0,0,1e-06,0,0,1e-06
0,-1e-06,-1e-06,2e-06,-1e-06,1e-06,0,1e-06,1e-06,-1e-06,1e-06,2e-06,0,-2e-06,-1e-06,1e-06,0,-1e-06,1e-06,2e-06,1e-06,1e-06,1e-06,-1e-06,-1e-06,-2e-06,0,0,-1e-06,1e-06,-1e-06,0,0,0,-1e-06,-1e-06,-1e-06,0,0,-2e-06,2e-06,0,1e-06,1e-06,-2e-06,0,1e-06,0,1e-06,0,1e-06,0,0,0,-1e-06,1e-06,0,0,0,-1e-06,2e-06,0,0,0,-2e-06,5e-06,-2e-06,0,0,-2e-06,0,0,-1e-06,0,2e-06,-1e-06,0,0,0,-1e-06,0,-1e-06,-1e-06,-2e-06,-1e-06,1e-06,1e-06,-1e-06,-2e-06,-1e-06,0,-2e-06,-2e-06,0,0,-1e-06,-2e-06,-1e-06,0,0,0,0,0,1e-06,-1e-06,0,0,0,-1e-06,0,1e-06,-1e-06,-1e-06,1e-06,-2e-06,0,0,-1e-06,0,0,0
0,-1e-06,2e-06,-3e-06,-2e-06,1e-06,3e-06,0,-1e-06,0,0,-2e-06,-1e-06,-2e-06,1e-06,0,0,0,0,0,0,-2e-06,-1e-06,-1e-06,-2e-06,0,0,-2e-06,-1e-06,0,-2e-06,1e-06,-2e-06,0,1e-06,-1e-06,1e-06,1e-06,1e-06,2e-06,1e-06,0,0,-1e-06,3e-06,0,-1e-06,0,0,0,0,0,1e-06,0,1e-06,2e-06,0,0,-1e-06,-1e-06,-1e-06,0,0,0,2e-06,0,-2e-06,0,0,1e-06,0,0,0,-1e-06,0,1e-06,0,1e-06,0,0,0,-1e-06,0,-2e-06,-1e-06,1e-06,0,0,0,1e-06,0,1e-06,1e-06,0,0,0,-5e-06,-1e-06,0,0,0,0,0,0,2e-06,0,0,0,1e-06,0,1e-06,0,0,-1e-06,-1e-06,0,0,0,0,0,1e-06
0,-1e-06,0,1e-06,2e-06,1e-06,0,-1e-06,-1e-06,-1e-06,-1e-06,0,-1e-06,-1e-06,-1e-06,-1e-06,0,-1e-06,0,-2e-06,0,-1e-06,0,0,-1e-06,1e-06,0,0,0,0,-1e-06,0,0,0,0,0,0,-1e-06,0,3e-06,0,0,1e-06,0,-1e-06,0,2e-06,0,-1e-06,0,-1e-06,0,0,0,-1e-06,1e-06,0,0,0,1e-06,-2e-06,0,0,0,-1e-06,-3e-06,0,0,0,0,-2e-06,2e-06,1e-06,0,-1e-06,0,0,-2e-06,-1e-06,0,0,1e-06,0,-1e-06,0,1e-06,0,-1e-06,2e-06,0,0,0,-2e-06,-1e-06,1e-06,0,0,-1e-06,0,0,1e-06,0,0,-1e-06,1e-06,-1e-06,0,0,2e-06,0,0,0,0,-1e-06,-1e-06,0,0,0,0,1e-06,0
0,-2e-06,-2e-06,-1e-06,2e-06,3e-06,-1e-06,-1e-06,1e-06,-1e-06,0,1e-06,-1e-06,0,1e-06,-1e-06,0,0,-1e-06,-2e-06,-1e-06,0,0,0,-1e-06,2e-06,0,0,0,-1e-06,0,-1e-06,0,0,0,0,0,0,1e-06,0,1e-06,0,0,0,0,0,0,0,1e-06,0,1e-06,0,-2e-06,0,0,0,0,0,-1e-06,1e-06,1e-06,0,0,0,1e-06,-4e-06,0,0,0,0,-3e-06,0,1e-06,-1e-06,1e-06,0,0,0,1e-06,-1e-06,0,1e-06,0,0,1e-06,0,1e-06,1e-06,2e-06,-1e-06,0,-1e-06,-1e-06,0,0,0,-1e-06,0,0,0,0,0,0,1e-06,-1e-06,1e-06,0,0,1e-06,0,0,0,0,1e-06,0,0,0,0,0,0,0
0,0,0,-2e-06,-1e-06,-1e-06,0,0,-1e-06,-1e-06,0,-1e-06,-1e-06,1e-06,0,-1e-06,0,0,0,0,0,1e-06,-1e-06,-1e-06,-2e-06,1e-06,0,1e-06,0,0,0,0,-1e-06,-1e-06,0,1e-06,0,0,1e-06,-3e-06,-1e-06,0,0,0,1e-06,0,0,-1e-06,0,0,1e-06,0,-1e-06,0,0,0,0,0,0,0,1e-06,-1e-06,0,0,0,-2e-06,0,0,0,0,-1e-06,0,-1e-06,0,0,0,0,1e-06,0,0,0,1e-06,0,1e-06,-1e-06,-1e-06,0,0,0,-1e-06,0,0,0,0,-1e-06,0,1e-06,0,-1e-06,0,0,0,0,-1e-06,-2e-06,0,0,0,0,0,0,0,0,-1e-06,2e-06,0,0,0,0,0,0
0,-1e-06,1e-06,2e-06,-1e-06,0,1e-06,1e-06,0,-1e-06,0,-2e-06,0,1e-06,0,0,0,0,0,1e-06,0,0,-1e-06,0,0,0,0,0,0,-1e-06,1e-06,0,0,0,-1e-06,0,0,0,0,-2e-06,-1e-06,0,0,0,-1e-06,0,-2e-06,1e-06,0,0,-1e-06,0,0,0,0,-1e-06,0,0,0,0,-1e-06,0,0,0,0,3e-06,1e-06,0,0,0,-1e-06,0,0,-1e-06,-1e-06,0,0,0,0,0,0,0,0,1e-06,0,-1e-06,0,-1e-06,-1e-06,0,-1e-06,1e-06,0,0,0,0,2e-06,0,1e-06,0,0,0,0,1e-06,2e-06,0,0,0,-1e-06,0,-1e-06,0,0,-1e-06,1e-06,0,0,0,0,0,0
0,-1e-06,0,0,2e-06,-1e-06,0,-1e-06,0,-1e-06,-1e-06,1e-06,-1e-06,1e-06,0,0,0,0,0,2e-06,-1e-06,-1e-06,0,0,-1e-06,-1e-06,0,1e-06,0,0,0,0,-1e-06,0,0,0,0,0,0,1e-06,0,0,0,0,1e-06,0,1e-06,0,2e-06,-1e-06,1e-06,0,0,0,0,-1e-06,0,-1e-06,0,0,-1e-06,-1e-06,0,0,0,4e-06,1e-06,0,0,0,0,-1e-06,1e-06,0,0,0,0,0,-1e-06,0,0,0,1e-06,1e-06,0,-1e-06,0,0,-1e-06,1e-06,1e-06,0,0,0,0,0,0,0,0,0,0,0,0,0,2e-06,0,0,0,-1e-06,0,0,0,0,1e-06,-1e-06,0,0,0,0,0,0
0,0,-1e-06,0,0,-2e-06,-1e-06,-2e-06,0,0,0,2e-06,0,1e-06,0,0,0,0,0,0,0,-1e-06,0,0,-1e-06,-1e-06,0,0,0,1e-06,-1e-06,0,0,0,0,-1e-06,0,0,0,2e-06,0,0,0,0,1e-06,0,0,-1e-06,-2e-06,0,0,0,0,0,0,0,0,0,0,0,1e-06,0,0,0,0,2e-06,0,0,0,-1e-06,1e-06,0,0,0,0,0,0,0,0,0,0,0,0,1e-06,1e-06,1e-06,0,0,-1e-06,0,0,-1e-06,-1e-06,0,0,0,1e-06,0,-1e-06,0,0,0,0,0,-3e-06,0,0,0,-1e-06,0,0,0,0,0,-1e-06,0,0,0,0,0,0
0,-2e-06,0,2e-06,-2e-06,0,0,1e-06,0,-1e-06,0,1e-06,0,1e-06,0,0,0,-1e-06,0,-1e-06,0,1e-06,0,0,0,0,0,0,0,0,-1e-06,0,0,0,0,-1e-06,0,0,-1e-06,1e-06,0,0,0,0,-2e-06,0,1e-06,0,1e-06,0,-1e-06,0,1e-06,0,0,0,0,-1e-06,-1e-06,0,1e-06,-1e-06,-1e-06,0,0,-3e-06,0,0,0,1e-06,0,0,-1e-06,0,0,0,0,1e-06,1e-06,0,0,0,1e-06,0,0,0,0,0,0,-1e-06,1e-06,1e-06,1e-06,0,0,0,-1e-06,1e-06,0,0,0,0,0,0,0,0,0,0,0,0,0,0,0,-1e-06,1e-06,0,0,0,0,0,0
0,0,1e-06,-1e-06,0,0,1e-06,1e-06,0,0,0,-1e-06,0,0,0,0,0,0,0,-1e-06,0,1e-06,0,0,0,1e-06,0,0,0,0,0,0,-1e-06,0,0,0,0,0,-1e-06,-1e-06,0,0,0,0,0,0,1e-06,0,-1e-06,0,-1e-06,0,0,0,0,0,0,1e-06,0,0,-1e-06,0,0,0,-1e-06,-4e-06,0,0,0,0,-1e-06,0,0,0,1e-06,0,0,-1e-06,0,0,0,0,0,-1e-06,-1e-06,1e-06,0,-1e-06,1e-06,0,0,0,0,0,0,0,-2e-06,0,0,0,0,0,0,-1e-06,2e-06,0,0,0,1e-06,0,0,0,0,1e-06,1e-06,0,0,0,0,0,0
0,-1e-06,0,0,1e-06,1e-06,0,-1e-06,0,0,-1e-06,0,0,0,0,0,0,0,0,0,0,0,0,0,-1e-06,1e-06,0,0,0,1e-06,0,0,0,0,0,0,0,0,0,-2e-06,0,0,0,0,1e-06,0,0,0,0,0,1e-06,0,-1e-06,0,0,0,0,-1e-06,-1e-06,0,0,0,0,0,1e-06,-1e-06,-1e-06,0,0,-1e-06,-1e-06,0,0,0,0,0,0,0,0,0,0,0,1e-06,-1e-06,0,0,0,0,1e-06,0,1e-06,-1e-06,0,0,0,0,-1e-06,0,0,0,0,0,0,1e-06,0,0,0,0,1e-06,0,0,0,0,0,0,0,0,0,0,0,0
0,-1e-06,-1e-06,0,-2e-06,2e-06,-1e-06,-2e-06,-1e-06,0,1e-06,0,0,0,0,-1e-06,0,-1e-06,0,1e-06,0,0,0,0,-1e-06,0,0,0,0,0,1e-06,0,0,0,0,1e-06,0,0,0,0,0,0,0,0,0,0,0,0,0,0,0,0,0,0,0,-1e-06,0,1e-06,0,0,1e-06,0,0,0,0,2e-06,0,0,0,1e-06,-2e-06,0,0,0,0,0,0,0,0,0,0,0,0,-1e-06,1e-06,-1e-06,0,0,0,1e-06,-1e-06,0,0,0,0,0,-3e-06,0,0,0,0,0,0,0,-1e-06,0,0,0,0,0,0,0,0,-1e-06,0,0,0,0,0,0,0
0,0,0,-1e-06,-1e-06,0,0,0,1e-06,0,0,-1e-06,0,-1e-06,0,0,0,0,0,1e-06,0,0,0,0,-1e-06,0,0,0,0,0,1e-06,0,-1e-06,0,0,0,0,0,0,2e-06,0,0,0,0,1e-06,0,-1e-06,0,0,0,-1e-06,0,0,0,0,0,0,-1e-06,0,1e-06,0,0,0,0,0,3e-06,0,0,0,0,-1e-06,0,0,0,1e-06,0,0,0,0,0,0,0,0,-1e-06,0,-1e-06,0,0,-1e-06,0,1e-06,0,0,0,0,0,0,0,0,0,0,0,0,0,-1e-06,0,0,0,0,0,0,0,0,1e-06,-1e-06,0,0,0,0,0,0
0,-1e-06,1e-06,0,2e-06,0,1e-06,1e-06,0,0,0,-1e-06,0,0,0,0,0,0,0,1e-06,0,0,0,0,-1e-06,0,0,0,0,0,0,0,0,0,0,0,0,0,0,1e-06,-1e-06,0,0,0,-1e-06,0,0,0,-1e-06,0,1e-06,0,-1e-06,0,0,0,0,1e-06,0,0,-1e-06,0,0,0,0,2e-06,0,0,0,0,-1e-06,0,0,0,0,0,0,0,0,0,0,0,0,0,-1e-06,-1e-06,0,0,0,-1e-06,-1e-06,0,1e-06,0,0,0,0,0,0,0,0,0,0,0,2e-06,0,0,0,0,0,0,0,0,0,-1e-06,0,0,0,0,0,0
0,-1e-06,0,2e-06,1e-06,0,0,0,-1e-06,-1e-06,0,1e-06,0,-1e-06,0,0,0,-1e-06,0,-1e-06,0,0,0,0,0,0,0,0,0,0,0,0,0,0,0,-1e-06,0,0,0,-1e-06,0,0,0,0,0,0,-1e-06,0,1e-06,0,0,0,0,0,0,1e-06,0,-1e-06,0,-1e-06,0,0,0,0,0,-2e-06,0,0,0,0,0,0,0,0,-1e-06,0,0,0,0,0,0,0,0,1e-06,0,1e-06,0,0,0,0,1e-06,0,0,0,0,0,0,0,0,0,0,0,0,-1e-06,0,0,0,0,0,0,0,0,0,0,0,0,0,0,0,0,0
