0.014032,0.017057,0.019961,0.019179,0.018469,0.017723,0.017377,0.017852,0.019464,0.020065,0.01916,0.021042,0.024583,0.0321,0.036047,0.030317,0.028295,0.02863,0.024927,0.022376,0.022031,0.020668,0.021643,0.021645,0.020542,0.022851,0.026345,0.027347
0.016754,0.020626,0.023765,0.021953,0.020934,0.020697,0.020533,0.021075,0.023456,0.024537,0.023083,0.02455,0.028373,0.037226,0.042873,0.036338,0.032566,0.032604,0.0293,0.027093,0.026622,0.024438,0.024782,0.024787,0.023912,0.026878,0.030846,0.031929
0.021361,0.026835,0.030207,0.026283,0.024644,0.025382,0.025712,0.026673,0.030749,0.032527,0.029399,0.029557,0.034064,0.045093,0.053404,0.045966,0.039046,0.038361,0.036136,0.035079,0.034962,0.031007,0.029327,0.029406,0.029524,0.033985,0.038579,0.039251
0.025141,0.031753,0.03596,0.030793,0.028233,0.029163,0.030343,0.033026,0.039569,0.041258,0.034298,0.032086,0.037966,0.050829,0.060494,0.052998,0.043818,0.04289,0.042061,0.042223,0.043219,0.037495,0.033131,0.033017,0.034249,0.040275,0.045249,0.044896
0.030544,0.038245,0.044001,0.038052,0.034199,0.033975,0.037261,0.044418,0.05224,0.0514,0.038568,0.033767,0.04281,0.058709,0.069777,0.063294,0.054471,0.052448,0.05029,0.050097,0.051844,0.046448,0.041491,0.040284,0.040867,0.046916,0.051229,0.050319
0.044009,0.055513,0.063295,0.054743,0.048146,0.045603,0.053496,0.06787,0.075505,0.069345,0.048741,0.042522,0.058218,0.080763,0.097129,0.092141,0.082775,0.075842,0.069952,0.069965,0.07261,0.068083,0.063104,0.059704,0.057241,0.062198,0.066117,0.065285
0.070895,0.090103,0.103314,0.089169,0.077102,0.072454,0.087896,0.113113,0.122695,0.108511,0.075573,0.069538,0.097817,0.133924,0.161674,0.156096,0.141012,0.125593,0.114079,0.116472,0.123731,0.117765,0.109029,0.100391,0.095122,0.103591,0.108493,0.104575
0.116395,0.145818,0.170527,0.146355,0.123389,0.118515,0.145683,0.189656,0.205815,0.176654,0.1231,0.118097,0.162721,0.220885,0.272503,0.263204,0.232565,0.205732,0.187843,0.196615,0.213164,0.201578,0.183662,0.165753,0.163387,0.183962,0.188576,0.176451
0.182343,0.220919,0.263145,0.224791,0.18409,0.183501,0.225848,0.296995,0.331842,0.280249,0.192839,0.188781,0.248735,0.333256,0.424228,0.409346,0.352086,0.314166,0.292141,0.315784,0.348339,0.323323,0.283991,0.249637,0.262884,0.309263,0.313505,0.287375
0.262901,0.306787,0.371435,0.316008,0.250022,0.260285,0.320451,0.4265,0.497069,0.413411,0.276155,0.273858,0.346831,0.455594,0.596179,0.579598,0.492762,0.448352,0.428662,0.478678,0.527792,0.475208,0.399291,0.344949,0.392801,0.479112,0.481198,0.436996
0.341475,0.388509,0.479016,0.404888,0.30539,0.327642,0.403568,0.548416,0.674687,0.554619,0.351948,0.347446,0.432356,0.558491,0.7338,0.722266,0.629335,0.58534,0.571393,0.654963,0.714853,0.62487,0.507346,0.440402,0.530047,0.653814,0.653568,0.600424
0.38626,0.435901,0.538731,0.449214,0.327875,0.361575,0.439752,0.599866,0.778138,0.644044,0.389378,0.374555,0.468276,0.592285,0.758042,0.763714,0.710215,0.667846,0.642968,0.748042,0.80607,0.691681,0.565146,0.501589,0.607132,0.740126,0.739397,0.698197
0.360935,0.395123,0.47869,0.403817,0.303404,0.339505,0.403074,0.541126,0.724075,0.610634,0.357247,0.332714,0.42745,0.529074,0.641146,0.65437,0.656923,0.627638,0.580283,0.6668,0.708988,0.604292,0.512073,0.472447,0.560018,0.667206,0.667052,0.650105
0.270275,0.282018,0.32816,0.289624,0.234702,0.255788,0.297697,0.396474,0.527963,0.46047,0.271943,0.240532,0.316962,0.377466,0.420143,0.429762,0.470058,0.464946,0.408174,0.44243,0.460103,0.392279,0.360471,0.352203,0.397293,0.463974,0.46661,0.462499
0.169246,0.182208,0.198546,0.183966,0.1663,0.16865,0.194338,0.251688,0.304716,0.279052,0.191983,0.171647,0.212663,0.243436,0.248122,0.243989,0.275576,0.284114,0.252447,0.247023,0.245482,0.20777,0.214055,0.230399,0.239503,0.262463,0.25838,0.257324
0.133717,0.158178,0.162479,0.155361,0.155158,0.151328,0.163292,0.197044,0.212312,0.199866,0.168765,0.152783,0.179457,0.236122,0.249385,0.212379,0.202133,0.227706,0.229066,0.204825,0.18871,0.158185,0.181666,0.214942,0.191082,0.167562,0.164146,0.174233
0.146737,0.18864,0.20027,0.199305,0.210177,0.211008,0.207148,0.226021,0.248911,0.239937,0.202963,0.182955,0.211259,0.299079,0.328027,0.266101,0.238104,0.282246,0.292858,0.253005,0.23355,0.206092,0.233305,0.268209,0.231066,0.183304,0.179574,0.196723
0.167527,0.232755,0.256779,0.258194,0.279738,0.283437,0.259986,0.257672,0.285184,0.28594,0.246399,0.228485,0.265005,0.376053,0.409353,0.332658,0.31888,0.371737,0.363004,0.311619,0.297024,0.27332,0.295689,0.331171,0.293909,0.235645,0.238519,0.267812
0.192721,0.267048,0.302521,0.308309,0.339312,0.342587,0.297704,0.287424,0.316131,0.313625,0.278421,0.263888,0.313007,0.446359,0.482521,0.406505,0.414661,0.45387,0.411987,0.361936,0.36525,0.340138,0.342693,0.38361,0.359049,0.295704,0.304196,0.34319
0.225377,0.298038,0.332981,0.336603,0.382105,0.382822,0.334632,0.339877,0.364947,0.35574,0.305489,0.270822,0.323991,0.477198,0.542372,0.479879,0.492116,0.512717,0.445282,0.411694,0.438989,0.385866,0.347426,0.400986,0.409954,0.352959,0.352904,0.377276
0.247116,0.30837,0.347291,0.351876,0.396012,0.391467,0.36009,0.388553,0.412531,0.413698,0.336013,0.262822,0.306391,0.448904,0.552988,0.522679,0.519836,0.549589,0.479891,0.449873,0.493642,0.407313,0.334188,0.382736,0.408785,0.36911,0.355811,0.344725
0.23442,0.291823,0.367342,0.373703,0.396802,0.406226,0.394043,0.407186,0.407392,0.427987,0.352456,0.265706,0.29972,0.417189,0.526083,0.523095,0.508307,0.559621,0.512063,0.471167,0.52226,0.430451,0.353177,0.362024,0.343889,0.324044,0.330945,0.306295
0.211833,0.280566,0.402044,0.40175,0.413179,0.445751,0.440325,0.412782,0.356569,0.381234,0.353423,0.295643,0.318892,0.404598,0.480826,0.512925,0.514621,0.553356,0.510424,0.436283,0.471816,0.413027,0.380528,0.373976,0.297732,0.277726,0.325626,0.305642
0.209814,0.303627,0.433066,0.420838,0.431748,0.452564,0.428454,0.367547,0.274238,0.302374,0.339479,0.341477,0.359676,0.398995,0.457173,0.531061,0.55427,0.543601,0.455689,0.364192,0.37415,0.352958,0.373693,0.370906,0.300076,0.289489,0.32063,0.287284
0.234242,0.329722,0.434118,0.418187,0.419818,0.398379,0.354209,0.302986,0.230413,0.264047,0.340514,0.397892,0.403316,0.386782,0.434649,0.539715,0.582794,0.53768,0.41242,0.332106,0.32086,0.319106,0.378249,0.372588,0.308883,0.297393,0.290198,0.250135
0.26668,0.323979,0.382049,0.393448,0.433366,0.384092,0.316193,0.297709,0.258559,0.281935,0.363754,0.431418,0.409308,0.368132,0.403547,0.507077,0.561734,0.521083,0.408443,0.341848,0.321564,0.340255,0.422376,0.394519,0.31139,0.296017,0.300111,0.282645
0.279108,0.281738,0.320058,0.373953,0.440611,0.379976,0.333067,0.369212,0.350091,0.324878,0.372549,0.419483,0.380534,0.368527,0.410227,0.494722,0.536237,0.485861,0.394608,0.363324,0.371238,0.393936,0.465851,0.407695,0.31022,0.296815,0.340131,0.367839
0.276178,0.216493,0.275845,0.378989,0.437001,0.362828,0.351898,0.439828,0.425911,0.354161,0.353801,0.38417,0.392148,0.446145,0.466966,0.530888,0.559697,0.495577,0.421311,0.384186,0.416209,0.441847,0.486555,0.408599,0.306832,0.292728,0.391136,0.451942
0.302057,0.198093,0.296633,0.419969,0.424342,0.354231,0.373069,0.479968,0.449361,0.347531,0.349322,0.371873,0.403375,0.523611,0.529179,0.546268,0.533599,0.490723,0.477821,0.444854,0.486807,0.500793,0.478077,0.374422,0.287178,0.281283,0.429845,0.5072
0.33676,0.247542,0.392463,0.503623,0.44738,0.365557,0.413262,0.532567,0.433636,0.325574,0.386416,0.402254,0.394678,0.538997,0.603627,0.59338,0.518053,0.493575,0.534728,0.525936,0.579681,0.557964,0.422014,0.296027,0.25757,0.286642,0.439747,0.522447
0.354207,0.332913,0.50098,0.580099,0.48533,0.379422,0.475194,0.586387,0.403992,0.330879,0.406854,0.4081,0.388794,0.498637,0.610962,0.626738,0.544995,0.539161,0.617356,0.597987,0.606172,0.574271,0.376188,0.244296,0.26072,0.320166,0.441285,0.562175
0.357502,0.394586,0.541085,0.568739,0.474887,0.375407,0.505872,0.589275,0.384528,0.367863,0.380313,0.363326,0.398425,0.44032,0.529079,0.629268,0.619282,0.618102,0.694553,0.619893,0.529688,0.499211,0.367944,0.295173,0.321664,0.352579,0.443532,0.613321
0.330284,0.397292,0.473143,0.480759,0.456488,0.362373,0.471802,0.564912,0.408229,0.374192,0.31646,0.303933,0.356643,0.359746,0.422642,0.579404,0.676762,0.681101,0.699281,0.592626,0.445298,0.37962,0.376738,0.427695,0.417319,0.349254,0.417819,0.605757
0.291907,0.342031,0.359672,0.427201,0.456792,0.359932,0.416309,0.485273,0.406909,0.334351,0.258055,0.246566,0.27141,0.318114,0.400341,0.553044,0.67391,0.616377,0.587737,0.541912,0.421703,0.355153,0.461733,0.582419,0.477564,0.293637,0.367165,0.523167
0.252505,0.273684,0.323386,0.464181,0.460534,0.377809,0.384363,0.405751,0.388073,0.293801,0.22252,0.191486,0.223451,0.326428,0.483042,0.649244,0.62405,0.446358,0.44884,0.545424,0.511001,0.46107,0.585008,0.684957,0.458785,0.238408,0.370321,0.463826
0.245814,0.270335,0.338346,0.47048,0.461173,0.44651,0.432824,0.438647,0.422042,0.343465,0.258967,0.174957,0.239068,0.357603,0.571716,0.782759,0.602257,0.393565,0.435937,0.544825,0.570858,0.554099,0.630455,0.666331,0.377153,0.21402,0.384012,0.422456
0.259676,0.311365,0.362873,0.410189,0.444884,0.496832,0.466872,0.47111,0.424273,0.389713,0.336152,0.229568,0.297626,0.4031,0.659833,0.929462,0.690049,0.492306,0.524891,0.499269,0.539507,0.580898,0.590423,0.548917,0.317219,0.226336,0.372127,0.395109
0.256945,0.357941,0.366292,0.33353,0.465062,0.495779,0.40762,0.425987,0.356212,0.375265,0.409716,0.308146,0.358256,0.43279,0.684761,0.955769,0.713045,0.577037,0.675406,0.565367,0.521782,0.585373,0.567084,0.416278,0.293832,0.243902,0.312188,0.336176
0.260908,0.411857,0.346757,0.251999,0.442254,0.426809,0.285266,0.336229,0.288541,0.320152,0.444825,0.370319,0.457374,0.49374,0.610125,0.812342,0.651664,0.63971,0.821236,0.70612,0.567804,0.595775,0.531401,0.35264,0.347866,0.258485,0.231322,0.261969
0.293997,0.465107,0.361444,0.253532,0.38275,0.350097,0.211491,0.273172,0.280339,0.327922,0.448553,0.439729,0.62569,0.590284,0.455173,0.56889,0.573319,0.698919,0.855977,0.759081,0.663569,0.660914,0.47823,0.349855,0.402574,0.248437,0.180194,0.24995
