0.097014,0.093001,0.100945,0.10994,0.105392,0.098814,0.095143,0.08776,0.081002,0.084153,0.089767,0.086198,0.088387,0.095477,0.096504,0.10337,0.0994,0.090648,0.090298,0.081737,0.070993,0.064404,0.062519,0.064551,0.060195,0.052043,0.050819,0.053879
0.11581,0.115787,0.128097,0.137505,0.131185,0.124506,0.119833,0.10868,0.09933,0.105938,0.113719,0.10741,0.110647,0.120559,0.121915,0.128442,0.123949,0.115177,0.115995,0.104521,0.089318,0.082833,0.080981,0.080593,0.073614,0.064503,0.063782,0.068119
0.142545,0.150547,0.169912,0.17938,0.171061,0.164965,0.158324,0.140381,0.126831,0.140548,0.153163,0.14255,0.147042,0.161628,0.163846,0.169051,0.163837,0.15573,0.15883,0.142544,0.120191,0.115719,0.114861,0.109178,0.096682,0.085649,0.086015,0.092859
0.150308,0.164568,0.186472,0.193887,0.185331,0.18273,0.175853,0.153547,0.139189,0.158441,0.174925,0.163708,0.16874,0.18548,0.188137,0.19033,0.186268,0.180417,0.18342,0.164679,0.14016,0.141183,0.142719,0.131245,0.112792,0.099226,0.100297,0.109053
0.142301,0.157641,0.17269,0.17471,0.167203,0.172808,0.171882,0.149936,0.139388,0.156618,0.169337,0.161268,0.165732,0.180921,0.18315,0.183019,0.185459,0.183529,0.177902,0.159805,0.143574,0.148954,0.151117,0.138378,0.117811,0.10066,0.101128,0.109318
0.152202,0.16661,0.167323,0.161082,0.159805,0.171834,0.178036,0.160098,0.154675,0.159664,0.156048,0.153512,0.160264,0.173355,0.174898,0.180086,0.192123,0.187466,0.166788,0.150479,0.145507,0.149626,0.153037,0.146131,0.124736,0.103809,0.105522,0.11011
0.206573,0.215876,0.201102,0.191901,0.212058,0.231384,0.233376,0.212812,0.212909,0.209391,0.193245,0.202935,0.206372,0.20537,0.213907,0.242419,0.253989,0.233775,0.207917,0.189428,0.185235,0.188605,0.196877,0.203132,0.177554,0.138628,0.131088,0.13115
0.316889,0.301684,0.282578,0.295099,0.353276,0.38517,0.36963,0.329344,0.345218,0.342076,0.306266,0.339292,0.342331,0.319869,0.346941,0.403802,0.390101,0.344888,0.329056,0.297075,0.280694,0.295355,0.313858,0.339262,0.302169,0.218076,0.189486,0.1909
0.497547,0.440196,0.426653,0.479312,0.60733,0.675943,0.631348,0.538236,0.589428,0.594549,0.497978,0.564933,0.584579,0.538841,0.601102,0.691576,0.618751,0.536437,0.539751,0.482047,0.445326,0.481605,0.527073,0.584488,0.508087,0.343055,0.298178,0.30591
0.764155,0.66176,0.63745,0.723394,0.962607,1.109432,1.035959,0.852024,0.950599,0.967586,0.757097,0.868874,0.934632,0.860354,0.970851,1.118158,0.956952,0.809622,0.832842,0.754168,0.701354,0.758901,0.846438,0.951369,0.791661,0.508435,0.472099,0.486055
1.035676,0.900314,0.85725,0.958673,1.324203,1.573362,1.49179,1.209818,1.346398,1.370038,1.020472,1.17994,1.318928,1.206234,1.355145,1.592611,1.336431,1.087381,1.123686,1.052446,1.000157,1.075771,1.209371,1.355702,1.074853,0.670522,0.689003,0.704608
1.163737,1.012353,0.96587,1.069953,1.509802,1.823156,1.769671,1.447836,1.58013,1.592573,1.148913,1.339991,1.56077,1.411423,1.551284,1.876642,1.568215,1.215123,1.258028,1.241717,1.200031,1.266272,1.423065,1.580752,1.200225,0.743494,0.863262,0.887835
1.03932,0.905211,0.8772,0.978641,1.384832,1.657935,1.643382,1.386879,1.461822,1.447655,1.042689,1.226491,1.479565,1.328415,1.407553,1.733476,1.463796,1.086907,1.123753,1.179266,1.143279,1.162699,1.292001,1.421792,1.056943,0.68269,0.887886,0.919662
0.751883,0.690565,0.678057,0.736402,1.007875,1.188224,1.199815,1.054696,1.037422,1.015627,0.821847,0.948866,1.115037,1.02761,1.068622,1.266502,1.115308,0.855239,0.850406,0.911805,0.8724,0.83127,0.884231,0.960629,0.744855,0.560261,0.737707,0.75135
0.623213,0.671589,0.664684,0.633986,0.808811,0.947008,0.965977,0.922083,0.774136,0.72054,0.805948,0.899582,0.906623,0.903069,0.989137,1.034641,1.021161,0.929297,0.832365,0.772154,0.65952,0.580183,0.595406,0.617373,0.555173,0.564412,0.618841,0.567223
0.865841,0.995621,0.98113,0.893478,1.058879,1.180457,1.213264,1.232835,0.989304,0.887637,1.127821,1.237424,1.137294,1.174872,1.37011,1.431108,1.440753,1.323182,1.153899,0.981122,0.738475,0.617221,0.674076,0.710847,0.680646,0.78525,0.812596,0.671778
1.266079,1.455161,1.502112,1.420126,1.504737,1.501126,1.530859,1.627124,1.351176,1.227954,1.543938,1.63069,1.476191,1.569336,1.857131,2.007233,1.979147,1.714055,1.498936,1.288998,0.971263,0.841386,0.937275,0.998782,0.938979,1.076629,1.16557,0.972969
1.677927,1.907049,2.135976,2.13736,1.980971,1.700125,1.704303,1.901952,1.692662,1.537482,1.814636,1.859611,1.723458,1.884347,2.197991,2.449309,2.3751,1.915974,1.672376,1.531521,1.247322,1.166894,1.265332,1.316469,1.212926,1.320685,1.475569,1.326284
2.026639,2.306936,2.789728,2.869867,2.395044,1.894851,1.920809,2.186992,2.084338,1.778837,1.813465,1.885228,1.91233,2.110415,2.386107,2.67817,2.58708,1.992395,1.73527,1.738012,1.547675,1.60315,1.693556,1.655596,1.459343,1.439086,1.604308,1.611053
2.24748,2.667106,3.351383,3.303854,2.620992,2.1603,2.292592,2.639069,2.559091,1.937123,1.554309,1.769135,2.119462,2.360785,2.571756,2.813007,2.757741,2.103576,1.814692,1.929547,1.822781,2.028612,2.097606,1.931246,1.581197,1.385055,1.585814,1.78057
2.184856,2.782398,3.443248,3.056267,2.357638,2.135557,2.397351,2.852429,2.761583,1.896839,1.250633,1.578864,2.109535,2.390794,2.53828,2.649663,2.681662,2.164764,1.846441,1.893237,1.837171,2.146854,2.160361,1.908577,1.533162,1.23127,1.445994,1.745071
1.837346,2.366801,2.786055,2.222002,1.680994,1.674001,2.027127,2.547612,2.410861,1.55345,1.02745,1.386975,1.86237,2.112744,2.145325,2.05002,2.096085,1.874609,1.641676,1.549078,1.479259,1.754901,1.761223,1.56714,1.3785,1.119162,1.205195,1.45146
1.309034,1.613759,1.796215,1.478799,1.175444,1.198089,1.506288,1.8442,1.675361,1.110855,0.934154,1.255766,1.514671,1.701792,1.714851,1.470691,1.375873,1.337023,1.273672,1.176365,1.036455,1.115212,1.17701,1.137946,1.157603,1.058007,0.996698,1.089711
0.873263,1.121639,1.286767,1.21793,1.075341,1.149624,1.401901,1.408654,1.177179,0.971594,1.026092,1.247864,1.299653,1.557677,1.718745,1.360879,1.083089,1.044445,1.007075,0.884939,0.757886,0.764953,0.840195,0.934647,1.097062,1.125685,1.008697,0.970399
0.819513,1.163258,1.347881,1.328935,1.203149,1.323746,1.615418,1.537098,1.181678,1.067293,1.287425,1.432861,1.367615,1.941155,2.298438,1.650567,1.182382,1.17276,1.110813,0.822196,0.673981,0.796048,0.903116,1.080337,1.320612,1.309141,1.13201,1.110741
0.92613,1.324039,1.580308,1.530673,1.299729,1.36506,1.614122,1.57826,1.242317,1.172001,1.553631,1.649484,1.52304,2.447898,2.920004,1.946236,1.283154,1.383026,1.367651,0.883907,0.688801,0.876191,1.017521,1.314875,1.6388,1.517273,1.258154,1.304433
0.939167,1.360396,1.697266,1.518858,1.150523,1.21223,1.366641,1.349754,1.193085,1.176701,1.63602,1.738262,1.611462,2.657407,3.023509,1.863658,1.148263,1.418928,1.462581,0.833641,0.673958,0.889515,1.069381,1.484204,1.789709,1.529309,1.230381,1.35509
0.794021,1.144285,1.454026,1.19172,0.832867,0.967262,1.04975,1.02061,1.016632,0.997228,1.368072,1.473199,1.440241,2.295358,2.375875,1.346841,0.849178,1.238138,1.279572,0.648282,0.562326,0.803026,1.015877,1.430812,1.689115,1.409964,1.072489,1.188693
0.637137,0.849723,0.980451,0.797732,0.643441,0.801728,0.899339,0.889551,0.826451,0.749371,0.917372,0.954688,1.024497,1.506002,1.372739,0.788254,0.598793,0.901432,0.946781,0.499473,0.431327,0.612717,0.801411,1.10726,1.337728,1.181146,0.838715,0.838379
0.613848,0.645805,0.629703,0.589172,0.594368,0.629928,0.671355,0.716707,0.644119,0.557883,0.580806,0.56506,0.642151,0.788022,0.703859,0.537097,0.459007,0.600419,0.631993,0.407369,0.345478,0.415859,0.554121,0.712708,0.869604,0.84448,0.597993,0.545771
0.651447,0.516711,0.438166,0.47432,0.505655,0.429211,0.40119,0.485942,0.505683,0.485382,0.490725,0.430355,0.402077,0.432638,0.506982,0.496036,0.390009,0.460923,0.490843,0.367237,0.276404,0.252418,0.351987,0.427734,0.505192,0.524005,0.440423,0.466682
0.623809,0.429309,0.374295,0.429672,0.391268,0.273681,0.233475,0.317548,0.414958,0.456478,0.426428,0.305612,0.255239,0.359644,0.497052,0.443721,0.326176,0.357947,0.389948,0.330963,0.225398,0.190715,0.264396,0.310902,0.30808,0.313155,0.341473,0.416701
0.484184,0.301745,0.287617,0.366597,0.316894,0.190637,0.192142,0.29722,0.398672,0.42936,0.341013,0.202942,0.161486,0.29911,0.452633,0.381646,0.255675,0.233207,0.24992,0.247844,0.190545,0.187033,0.225551,0.261527,0.255697,0.236172,0.247665,0.302086
0.293648,0.183856,0.18303,0.254004,0.25686,0.186342,0.200335,0.2818,0.338431,0.353153,0.286983,0.162629,0.121615,0.234138,0.343753,0.302007,0.19777,0.147187,0.139703,0.162277,0.175496,0.196656,0.220542,0.229824,0.220531,0.23161,0.203441,0.185519
0.146505,0.121552,0.134077,0.161173,0.187413,0.193707,0.213591,0.253592,0.260603,0.266918,0.245417,0.158104,0.116034,0.18561,0.224918,0.221832,0.158269,0.098485,0.106966,0.146297,0.186115,0.201806,0.211247,0.207151,0.186614,0.207417,0.17399,0.128798
0.072232,0.09655,0.138916,0.148178,0.141428,0.17685,0.198208,0.207292,0.216451,0.217386,0.207138,0.15011,0.109415,0.14752,0.159927,0.160621,0.118307,0.074667,0.108213,0.161142,0.194525,0.186278,0.164647,0.156283,0.137498,0.153711,0.139489,0.105245
0.070343,0.095493,0.1374,0.145017,0.117329,0.14245,0.152905,0.161913,0.201647,0.192625,0.192156,0.145846,0.096424,0.11808,0.133037,0.111817,0.079246,0.066714,0.110403,0.150897,0.167563,0.152083,0.109541,0.095113,0.083968,0.099835,0.103401,0.085008
0.077095,0.09003,0.112673,0.132672,0.126593,0.12403,0.112113,0.125242,0.163017,0.155779,0.16152,0.127259,0.082575,0.094018,0.104057,0.074001,0.045041,0.051286,0.094335,0.112423,0.116954,0.125868,0.096566,0.074984,0.063332,0.073657,0.085977,0.07817
0.082777,0.079512,0.082059,0.115344,0.136857,0.11905,0.096144,0.098696,0.118132,0.137395,0.127908,0.099221,0.079125,0.083187,0.07604,0.056291,0.035679,0.038786,0.066183,0.067294,0.085666,0.10511,0.085183,0.073975,0.061335,0.069726,0.088632,0.078609
0.0935,0.085848,0.080812,0.110133,0.127014,0.11071,0.090808,0.083904,0.095777,0.119435,0.112067,0.093297,0.08391,0.074724,0.064593,0.044078,0.03346,0.038707,0.045025,0.040351,0.076992,0.090397,0.063276,0.063533,0.064719,0.077499,0.095892,0.077222
