0.073753,0.07659,0.080612,0.084737,0.08496,0.087977,0.088022,0.087032,0.095078,0.097592,0.096274,0.106446,0.101493,0.087599,0.093247,0.091742,0.07917,0.073666,0.078439,0.081646,0.076876,0.071836,0.072621,0.081189,0.082533,0.086234,0.081892,0.069368
0.090323,0.095043,0.09896,0.101381,0.10165,0.105356,0.105607,0.10453,0.111144,0.11362,0.115705,0.127852,0.121796,0.107253,0.111859,0.108956,0.095513,0.088454,0.092762,0.097923,0.092977,0.085558,0.084939,0.09587,0.099857,0.10552,0.100957,0.085194
0.119006,0.125663,0.127531,0.125857,0.126431,0.13045,0.131292,0.130007,0.132575,0.136092,0.146219,0.160355,0.153242,0.139704,0.139598,0.134169,0.122165,0.11343,0.117184,0.125157,0.11922,0.108126,0.103976,0.116406,0.12619,0.136466,0.131938,0.112842
0.144343,0.148042,0.143295,0.138578,0.14154,0.14284,0.142836,0.143376,0.14295,0.146811,0.163446,0.17674,0.17199,0.164761,0.15628,0.148437,0.142277,0.135114,0.140637,0.148456,0.138309,0.125037,0.116954,0.125447,0.142296,0.156611,0.152438,0.137261
0.173955,0.170218,0.156046,0.153377,0.162515,0.157132,0.151987,0.15775,0.160181,0.161062,0.175995,0.184849,0.181868,0.18282,0.172588,0.165248,0.164553,0.161105,0.166316,0.168564,0.155492,0.144169,0.132356,0.133167,0.154976,0.166618,0.161669,0.160207
0.212485,0.203603,0.186899,0.189626,0.205682,0.191247,0.175404,0.188683,0.198653,0.193967,0.198765,0.204009,0.203329,0.207712,0.204112,0.196771,0.197103,0.200595,0.198241,0.188148,0.180417,0.178241,0.161282,0.156082,0.181347,0.183857,0.174953,0.186212
0.249771,0.23857,0.230535,0.2411,0.259178,0.232752,0.204158,0.228536,0.249045,0.238808,0.232621,0.235912,0.239351,0.246665,0.24733,0.235037,0.236265,0.250039,0.238533,0.218317,0.223036,0.226328,0.196613,0.189159,0.221775,0.218865,0.205574,0.218041
0.275265,0.270857,0.278261,0.293943,0.305962,0.272089,0.237358,0.271139,0.29658,0.280243,0.26906,0.270235,0.277198,0.288206,0.284258,0.268332,0.275715,0.297422,0.279234,0.260924,0.286448,0.28022,0.227482,0.221696,0.26823,0.272982,0.251837,0.244002
0.29127,0.301924,0.32273,0.332318,0.332228,0.301301,0.277829,0.324761,0.34281,0.309575,0.295715,0.297052,0.3016,0.317281,0.308775,0.290769,0.307483,0.331131,0.308681,0.31202,0.367466,0.335378,0.255963,0.252391,0.312264,0.336974,0.306284,0.265539
0.313555,0.339083,0.363337,0.35565,0.348076,0.325534,0.312419,0.37337,0.387064,0.333311,0.306705,0.304662,0.307252,0.334886,0.329466,0.317054,0.341968,0.358305,0.334028,0.359271,0.432782,0.380125,0.290462,0.279694,0.340814,0.387543,0.347636,0.276212
0.321544,0.348026,0.366225,0.349485,0.344191,0.330231,0.318995,0.376341,0.395504,0.348099,0.317285,0.311965,0.312277,0.343782,0.338957,0.332397,0.357537,0.364941,0.348342,0.377759,0.429752,0.369664,0.30381,0.29538,0.343885,0.389595,0.347037,0.273576
0.305263,0.315479,0.316115,0.307492,0.318081,0.316786,0.310406,0.338213,0.343696,0.328602,0.319824,0.310052,0.301171,0.32311,0.315184,0.310314,0.335987,0.337907,0.327094,0.341111,0.351365,0.30209,0.275411,0.276177,0.306423,0.34795,0.321649,0.260323
0.285902,0.284542,0.254589,0.262012,0.313927,0.320766,0.321463,0.325646,0.284846,0.28768,0.310712,0.293727,0.284854,0.308416,0.291231,0.276718,0.306639,0.30464,0.285399,0.282744,0.272816,0.237737,0.228736,0.233032,0.258371,0.312473,0.309887,0.261063
0.258998,0.267843,0.228709,0.239452,0.311646,0.31965,0.319649,0.3153,0.247456,0.253354,0.291952,0.273149,0.274239,0.309095,0.29142,0.26908,0.293587,0.282787,0.252454,0.241976,0.237372,0.220973,0.207879,0.202481,0.225038,0.279906,0.293136,0.26265
0.233636,0.24105,0.23074,0.251525,0.300252,0.296423,0.280314,0.277071,0.228212,0.22599,0.267368,0.273264,0.27079,0.283334,0.275079,0.271899,0.286887,0.268691,0.248654,0.251333,0.247269,0.238101,0.225085,0.2095,0.222882,0.254953,0.264166,0.252927
0.255654,0.254959,0.28875,0.331868,0.331763,0.297469,0.257831,0.269682,0.270061,0.252682,0.29271,0.335645,0.326794,0.29473,0.288666,0.325727,0.334797,0.303146,0.312724,0.345235,0.329411,0.308757,0.287097,0.270904,0.29168,0.301984,0.279617,0.268207
0.351626,0.353973,0.421861,0.469398,0.434422,0.39433,0.359861,0.395327,0.42006,0.374722,0.411089,0.482742,0.476175,0.400702,0.388559,0.469955,0.473476,0.411329,0.434774,0.492889,0.46425,0.445755,0.417632,0.387445,0.427197,0.438933,0.384958,0.360877
0.457129,0.471075,0.571581,0.61162,0.556995,0.538237,0.543329,0.600502,0.621144,0.544957,0.565279,0.65639,0.665235,0.546693,0.519922,0.636568,0.622946,0.514973,0.539336,0.618224,0.575726,0.59901,0.599524,0.537173,0.575943,0.596503,0.532165,0.505927
0.521673,0.55225,0.689523,0.737396,0.67132,0.653535,0.71143,0.793579,0.798685,0.689903,0.671428,0.779229,0.840327,0.707569,0.649218,0.759444,0.711097,0.560553,0.583373,0.680055,0.627,0.720083,0.795399,0.711571,0.715518,0.721901,0.651421,0.631603
0.529558,0.56828,0.72484,0.805931,0.749321,0.697993,0.785013,0.907782,0.903153,0.746833,0.690264,0.801513,0.927374,0.83599,0.737003,0.79095,0.718627,0.562573,0.570213,0.661885,0.620625,0.773309,0.923472,0.840062,0.80325,0.783977,0.683828,0.661949
0.478954,0.502212,0.657572,0.797889,0.750512,0.63256,0.7136,0.908008,0.910846,0.702011,0.641293,0.720016,0.870173,0.865658,0.734217,0.718873,0.657318,0.550767,0.554969,0.612167,0.585696,0.720941,0.882459,0.833616,0.818501,0.791534,0.629087,0.597974
0.439965,0.427757,0.572769,0.735313,0.681243,0.535855,0.583551,0.803303,0.790783,0.580809,0.575003,0.620954,0.773597,0.828269,0.670634,0.625464,0.574268,0.530765,0.542359,0.54504,0.512108,0.568365,0.701938,0.710645,0.75275,0.725969,0.512421,0.505925
0.465368,0.431728,0.51935,0.615302,0.5685,0.464118,0.507929,0.677812,0.607627,0.443029,0.490407,0.564391,0.727957,0.720436,0.54055,0.523531,0.510771,0.536546,0.525446,0.491726,0.493026,0.484505,0.566955,0.618335,0.655871,0.583744,0.385834,0.396477
0.507758,0.472747,0.480683,0.509143,0.484115,0.427859,0.496061,0.59876,0.476357,0.340863,0.405719,0.512175,0.625114,0.533339,0.414246,0.465317,0.505017,0.573564,0.515663,0.448898,0.501817,0.487356,0.52402,0.591585,0.590052,0.486274,0.314282,0.272268
0.505386,0.468022,0.468958,0.485659,0.423941,0.364231,0.486795,0.554727,0.384471,0.282281,0.391217,0.47845,0.48209,0.378218,0.372221,0.450085,0.477457,0.552933,0.49537,0.421724,0.492215,0.488238,0.477328,0.528345,0.526432,0.445064,0.295907,0.211993
0.431467,0.395216,0.427633,0.463485,0.369645,0.315617,0.459903,0.493424,0.319508,0.259988,0.393479,0.458822,0.410724,0.325018,0.351369,0.403034,0.403459,0.459037,0.442171,0.416207,0.464182,0.440639,0.39831,0.414441,0.423356,0.397732,0.304434,0.228447
0.366124,0.345418,0.379949,0.396542,0.31258,0.301977,0.407759,0.399785,0.261198,0.237723,0.36503,0.417343,0.355331,0.27964,0.305799,0.332738,0.334598,0.380593,0.378431,0.376989,0.403588,0.367761,0.324233,0.332498,0.343034,0.343225,0.304948,0.25822
0.299737,0.328204,0.376463,0.360998,0.297855,0.305625,0.329702,0.307183,0.233711,0.214733,0.292629,0.331022,0.305458,0.25887,0.25669,0.249769,0.266521,0.343938,0.336993,0.323262,0.347412,0.30648,0.289242,0.2885,0.28306,0.319913,0.316162,0.290761
0.258308,0.298773,0.354291,0.368465,0.343255,0.346174,0.303653,0.273681,0.252767,0.237811,0.282926,0.285974,0.273869,0.275146,0.253693,0.216194,0.245305,0.338038,0.31466,0.299322,0.333542,0.285467,0.304264,0.283844,0.249229,0.309838,0.310043,0.305564
0.258946,0.264665,0.318293,0.401407,0.41649,0.397003,0.319325,0.267417,0.260122,0.27659,0.324196,0.287265,0.258081,0.301998,0.270432,0.218327,0.272988,0.340586,0.31417,0.294569,0.298388,0.261688,0.314634,0.27888,0.241903,0.305584,0.285904,0.302463
0.298376,0.263379,0.307597,0.419173,0.444734,0.393377,0.312298,0.257123,0.249979,0.301437,0.338541,0.280337,0.28883,0.365828,0.311256,0.250497,0.308286,0.340731,0.320136,0.292512,0.239236,0.212081,0.297805,0.259723,0.247632,0.312669,0.273194,0.297225
0.353043,0.272418,0.309282,0.452028,0.473744,0.366047,0.26041,0.229765,0.246339,0.306444,0.332764,0.301073,0.34369,0.407093,0.348312,0.311187,0.348028,0.325336,0.320433,0.314039,0.210016,0.180032,0.271166,0.230098,0.243207,0.318732,0.29078,0.304928
0.390989,0.29311,0.339698,0.52935,0.550959,0.381097,0.234893,0.214738,0.236288,0.277645,0.337337,0.34482,0.372053,0.390142,0.346416,0.364581,0.400114,0.3312,0.312947,0.340423,0.229405,0.16928,0.218323,0.19709,0.232635,0.33654,0.315899,0.266908
0.384713,0.306722,0.369917,0.56259,0.566097,0.397732,0.275192,0.246026,0.220634,0.213395,0.317065,0.364513,0.375838,0.3514,0.328226,0.383348,0.439992,0.394102,0.332077,0.324863,0.226666,0.146194,0.152187,0.169907,0.233502,0.350982,0.317105,0.194047
0.318002,0.288831,0.351769,0.491261,0.462782,0.359432,0.308219,0.278549,0.221818,0.168908,0.26717,0.319919,0.331799,0.297627,0.294836,0.387528,0.463093,0.458145,0.343477,0.254608,0.189215,0.146035,0.135672,0.164106,0.268624,0.356646,0.286497,0.16284
0.243047,0.271096,0.313785,0.359823,0.304048,0.273986,0.293429,0.276596,0.23326,0.180442,0.213924,0.248154,0.273248,0.240561,0.241565,0.343407,0.426532,0.45822,0.326884,0.18283,0.14764,0.172977,0.16423,0.178326,0.281728,0.30688,0.222036,0.155867
0.20568,0.258246,0.247111,0.244952,0.204522,0.192615,0.249665,0.27024,0.259642,0.21663,0.183441,0.190518,0.226151,0.185906,0.180336,0.251556,0.321512,0.374297,0.277893,0.15044,0.140041,0.212465,0.213937,0.198099,0.247276,0.223476,0.170651,0.16768
0.188145,0.217229,0.171875,0.2012,0.190112,0.154944,0.230964,0.276379,0.277386,0.244761,0.174775,0.152115,0.195485,0.176443,0.159608,0.201136,0.243004,0.264706,0.201623,0.155129,0.19219,0.254847,0.254438,0.207753,0.188786,0.177863,0.185634,0.220402
0.179096,0.17204,0.135892,0.218986,0.244365,0.181259,0.245029,0.273079,0.25495,0.229069,0.157262,0.131949,0.179141,0.204173,0.19528,0.242682,0.258891,0.199647,0.149227,0.180517,0.248737,0.26463,0.261939,0.207434,0.180746,0.203248,0.225542,0.270548
0.190234,0.165955,0.135488,0.259935,0.288625,0.240282,0.33143,0.318213,0.218846,0.176212,0.126785,0.110464,0.173661,0.235032,0.215413,0.271688,0.276432,0.165313,0.11906,0.199986,0.277281,0.230642,0.229663,0.192286,0.199499,0.287172,0.268457,0.295449
