0.145342,0.338577,0.785728,1.332425,1.44092,1.170831,0.924855,0.873626,0.951072,0.944778,0.926678,0.800562,0.524833,0.347617,0.308902,0.26801,0.212725,0.221794,0.166193,0.108804,0.088731,0.057372,0.088934,0.124889,0.083235,0.035014,0.016779,0.012606
0.174165,0.392975,0.880122,1.467799,1.608287,1.327226,1.046219,0.994365,1.072677,1.066679,1.049553,0.900831,0.590866,0.393829,0.352078,0.303693,0.239315,0.250759,0.193718,0.136495,0.112574,0.070207,0.104696,0.145029,0.096638,0.041908,0.021393,0.016347
0.220222,0.471025,0.999609,1.620334,1.806874,1.530973,1.21873,1.168481,1.234995,1.23527,1.204662,1.007519,0.660984,0.446302,0.402537,0.341607,0.26704,0.285321,0.232155,0.180801,0.151933,0.090146,0.126354,0.173129,0.116808,0.053582,0.030655,0.024072
0.247345,0.501668,1.057161,1.695157,1.878741,1.622783,1.348248,1.318422,1.368507,1.34107,1.227234,0.96965,0.632735,0.431153,0.394042,0.329251,0.258744,0.288933,0.24611,0.203233,0.174425,0.100455,0.132421,0.181635,0.126134,0.062005,0.040871,0.033491
0.249826,0.496569,1.178272,1.915719,2.001438,1.737521,1.559983,1.560815,1.62066,1.506342,1.223308,0.883204,0.551964,0.372685,0.339484,0.283072,0.236779,0.286296,0.246283,0.194539,0.170387,0.099099,0.131822,0.187102,0.134119,0.067769,0.049785,0.042054
0.248975,0.497737,1.393556,2.313498,2.313061,2.058872,1.987785,2.010583,2.068421,1.817055,1.311466,0.849441,0.494653,0.332925,0.302202,0.265389,0.250688,0.310068,0.253678,0.179746,0.158916,0.097014,0.154585,0.229829,0.159043,0.071601,0.053126,0.045778
0.278782,0.559806,1.686138,2.803211,2.890411,2.757085,2.742871,2.822976,2.906914,2.573532,1.814267,1.071263,0.591713,0.402661,0.380258,0.354363,0.334318,0.381651,0.293064,0.195349,0.171057,0.110091,0.22585,0.339292,0.215469,0.077459,0.051645,0.046132
0.366632,0.724467,2.184266,3.55479,3.960055,4.233688,4.354684,4.543396,4.659809,4.27996,3.17264,1.859439,1.013207,0.677577,0.632345,0.579577,0.520493,0.555518,0.40712,0.252051,0.215796,0.146599,0.34803,0.516286,0.307909,0.094562,0.058187,0.055859
0.515671,0.976617,2.980942,5.044329,6.074519,6.892696,7.305369,7.571782,7.570037,7.055841,5.395011,3.200814,1.73831,1.14652,1.030495,0.915428,0.808009,0.816067,0.572752,0.326017,0.269887,0.194578,0.493175,0.720533,0.413757,0.118555,0.070619,0.06877
0.694043,1.247434,4.026298,7.28521,9.099367,10.490879,11.376528,11.460524,10.982907,10.306746,8.051702,4.844655,2.635042,1.721123,1.495489,1.290978,1.15153,1.116674,0.745418,0.382656,0.299948,0.231918,0.615449,0.882723,0.489169,0.130173,0.073694,0.071785
0.840886,1.498096,5.204082,9.85023,12.311351,14.023772,15.213169,14.761584,13.549843,12.730563,10.132865,6.239473,3.396659,2.189884,1.865851,1.57451,1.451154,1.386525,0.876854,0.408105,0.306054,0.246742,0.657063,0.922779,0.499058,0.129102,0.070417,0.067686
0.935956,1.695365,6.011732,11.622271,14.395519,15.924918,16.779521,15.654345,13.940722,12.933405,10.421438,6.618308,3.587136,2.260197,1.928119,1.60858,1.539997,1.465333,0.885726,0.388424,0.281589,0.229726,0.606845,0.832357,0.442063,0.125112,0.075442,0.069772
0.977272,1.775629,6.028827,11.479739,13.911829,14.722148,14.609774,13.060904,11.490724,10.574873,8.696409,5.682431,2.994811,1.818579,1.611172,1.359157,1.352579,1.301738,0.771834,0.346697,0.247616,0.19104,0.503638,0.679757,0.3605,0.123134,0.087207,0.07732
0.919247,1.64102,5.197418,9.196251,10.500889,10.569199,9.828646,8.572202,7.739618,7.181732,5.942186,3.892365,1.993687,1.169128,1.09256,0.963737,1.005766,1.014795,0.6339,0.347037,0.258711,0.163717,0.383146,0.527888,0.307793,0.127438,0.093581,0.08035
0.818721,1.380416,3.744044,5.838341,6.114192,5.779831,5.27061,4.896461,4.549011,4.14657,3.292128,2.087278,1.103393,0.64123,0.609229,0.611473,0.69798,0.751525,0.538633,0.374,0.279595,0.149639,0.295618,0.481809,0.353987,0.139174,0.082782,0.070734
0.807429,1.209271,2.85863,4.145582,3.922313,3.050941,2.52486,2.620098,2.680399,2.415705,1.708982,1.008535,0.58046,0.376669,0.362212,0.410812,0.553805,0.672231,0.545795,0.434086,0.329328,0.167987,0.337323,0.661124,0.531891,0.160895,0.055918,0.049386
0.960065,1.335252,2.809734,4.088786,3.84544,2.635593,2.015159,2.2767,2.441268,1.977026,1.184559,0.70372,0.451275,0.311554,0.286007,0.337801,0.517902,0.718237,0.626949,0.520224,0.41794,0.231512,0.504096,1.043068,0.833601,0.210582,0.038038,0.041308
1.208897,1.644319,3.201934,4.749885,4.664082,3.243147,2.539806,2.908244,3.233297,2.642392,1.538134,0.918281,0.573832,0.361645,0.31156,0.318177,0.476313,0.76989,0.733973,0.633053,0.52817,0.31069,0.741061,1.535426,1.199061,0.288581,0.0442,0.053397
1.392151,2.073436,4.137094,6.244481,6.143914,4.306195,3.426543,4.018798,4.699709,3.865334,2.224327,1.32973,0.800554,0.471804,0.400299,0.34896,0.485572,0.865561,0.850131,0.723928,0.609499,0.372708,1.00048,2.02596,1.508414,0.348998,0.058843,0.069842
1.395706,2.454174,5.213253,8.182603,7.962388,5.506369,4.561338,5.381084,6.252443,5.054545,2.945488,1.800831,1.062778,0.607595,0.503488,0.412605,0.541434,0.948874,0.916422,0.750234,0.617499,0.384651,1.190864,2.31451,1.605689,0.352037,0.071861,0.081362
1.285292,2.768366,6.603928,10.599365,9.935821,6.631998,5.578381,6.40054,7.023343,5.650869,3.494449,2.188103,1.302987,0.72495,0.555601,0.450387,0.581548,0.949996,0.897441,0.708067,0.56365,0.358798,1.227731,2.255664,1.447609,0.306326,0.076629,0.079937
1.167447,2.954201,7.915777,13.037707,11.772738,7.349976,6.09154,6.619972,6.56196,5.382079,3.676897,2.357306,1.454505,0.781582,0.541957,0.43188,0.587151,0.911132,0.820801,0.602878,0.477406,0.319139,1.072089,1.871316,1.145218,0.254654,0.074103,0.069859
0.998515,2.772706,8.104728,13.799744,12.285361,7.245205,5.919038,5.949391,5.187797,4.315432,3.252692,2.216669,1.396352,0.726241,0.501902,0.402964,0.544019,0.789722,0.674551,0.465724,0.365124,0.25343,0.787763,1.301121,0.767047,0.185218,0.066451,0.061852
0.777102,2.362202,6.978114,11.852616,10.683986,6.395068,5.125641,4.57058,3.470634,2.835376,2.296361,1.729188,1.116197,0.602514,0.443355,0.393505,0.509138,0.644345,0.501249,0.316452,0.24271,0.185633,0.518582,0.781909,0.431195,0.110821,0.052686,0.053239
0.648952,1.93745,5.268466,8.455652,7.860341,5.215404,4.115407,3.31901,2.09383,1.493153,1.375321,1.199469,0.781204,0.459886,0.356901,0.359484,0.511587,0.592634,0.398588,0.205114,0.150079,0.144913,0.344253,0.449208,0.22495,0.067638,0.042898,0.047841
0.604785,1.548688,3.971403,5.957882,5.524357,3.99317,3.359023,2.939661,1.765558,0.982966,0.966456,0.914077,0.585316,0.365479,0.313672,0.32172,0.475925,0.562917,0.363864,0.163685,0.111077,0.129148,0.271474,0.319618,0.149885,0.053178,0.037159,0.039855
0.599147,1.357754,3.102304,4.372377,4.108114,3.054252,2.634664,2.449981,1.52679,0.805253,0.720428,0.683237,0.484002,0.32888,0.301073,0.294847,0.40183,0.490105,0.328776,0.155963,0.113227,0.137263,0.298438,0.354931,0.163387,0.053655,0.036959,0.038455
0.553342,1.274324,2.678879,3.794289,3.635723,2.542264,1.958247,1.682927,1.111922,0.651291,0.523319,0.558186,0.477255,0.312468,0.275004,0.283635,0.364999,0.42755,0.305056,0.161786,0.130128,0.1534,0.365652,0.462399,0.216772,0.061307,0.039177,0.042982
0.469691,1.102463,2.374452,3.355803,3.032412,2.182277,1.731233,1.244626,0.877713,0.679829,0.478673,0.4668,0.442911,0.28824,0.243881,0.256767,0.332383,0.391166,0.314841,0.185935,0.155612,0.173526,0.442635,0.597278,0.285468,0.06958,0.043543,0.050497
0.36542,0.861692,2.008155,2.660335,2.111491,1.84763,1.671469,1.05976,0.845826,0.833001,0.572147,0.425213,0.416975,0.283611,0.22168,0.213201,0.314181,0.415799,0.34186,0.196338,0.167599,0.181129,0.485224,0.686564,0.32989,0.074742,0.049744,0.057633
0.279458,0.754161,1.748896,2.018095,1.570119,1.788022,1.641025,0.917958,0.789453,0.924461,0.683623,0.45315,0.43647,0.288073,0.203516,0.171749,0.289691,0.448918,0.360609,0.183706,0.160237,0.176844,0.476784,0.671191,0.319943,0.076856,0.054321,0.06392
0.229592,0.729345,1.603542,2.068836,1.919502,1.870862,1.543571,0.895456,0.705242,0.860821,0.749091,0.509613,0.449773,0.297258,0.223518,0.168386,0.258445,0.444364,0.360605,0.171128,0.149834,0.160813,0.415485,0.552698,0.260063,0.076319,0.056745,0.067482
0.213005,0.632501,1.507043,2.526761,2.516196,1.804687,1.293202,0.87553,0.615342,0.722354,0.734379,0.502347,0.421595,0.330949,0.265863,0.165781,0.224603,0.394204,0.32464,0.155937,0.128971,0.128248,0.324461,0.403692,0.188431,0.070282,0.051422,0.059706
0.188635,0.477687,1.395373,2.995399,3.101978,1.811305,1.137931,0.816514,0.536792,0.612377,0.636906,0.406484,0.341352,0.340032,0.301064,0.177746,0.213541,0.315795,0.235222,0.115973,0.093883,0.095631,0.26283,0.321394,0.139622,0.051228,0.036731,0.041957
0.173632,0.431906,1.419084,3.182092,3.320721,1.873132,1.115305,0.754503,0.515402,0.500327,0.460505,0.287795,0.271514,0.301332,0.302134,0.206821,0.222596,0.251289,0.146579,0.073808,0.065512,0.073881,0.218589,0.258267,0.099026,0.029669,0.023779,0.029752
0.168712,0.479131,1.360143,2.824039,2.914583,1.735425,1.213727,0.82292,0.532167,0.372939,0.318426,0.250506,0.23811,0.223465,0.250518,0.211643,0.229203,0.236759,0.11803,0.058752,0.056447,0.061544,0.182656,0.198759,0.067275,0.020963,0.02229,0.028981
0.145116,0.492266,1.258831,2.276596,2.144883,1.365871,1.207992,0.881122,0.517404,0.313926,0.260239,0.231515,0.18613,0.132506,0.16971,0.174919,0.211593,0.234356,0.127654,0.059529,0.049852,0.055657,0.162881,0.181349,0.063308,0.020688,0.02772,0.033078
0.1008,0.428256,1.220585,1.870783,1.521879,1.078457,1.018849,0.799635,0.432101,0.290779,0.253958,0.205045,0.143277,0.096094,0.109952,0.123921,0.181596,0.257457,0.165337,0.064101,0.038221,0.043605,0.142306,0.171892,0.064217,0.02149,0.031192,0.037145
0.060837,0.309908,1.056569,1.406714,0.986977,0.836793,0.895721,0.65934,0.346377,0.324225,0.282914,0.188877,0.136239,0.110786,0.082558,0.101835,0.199953,0.303703,0.206879,0.070172,0.027234,0.031298,0.126687,0.154101,0.055809,0.018724,0.030251,0.040086
0.050762,0.196834,0.819227,0.987161,0.675955,0.656969,0.901649,0.599351,0.346861,0.366211,0.286732,0.175132,0.134548,0.136207,0.092507,0.108425,0.247473,0.344887,0.22695,0.076495,0.020406,0.025731,0.11665,0.134383,0.042175,0.01405,0.027231,0.03797
