-0.006765,-0.003466,-0.001159,-0.001857,-0.004394,-0.001019,-0.002299,-0.002786,-0.00186,-0.005013,-0.00488,-0.004611,-0.004138,-0.004508,-0.005171,-0.004914,-0.000254,-0.000644,-0.00482,-0.003487,-0.003209,-0.003306,-0.003329,-0.003759,-0.002756,-0.003631,-0.004393,-0.001454,-0.003127,-0.004617,-0.003624,-0.000497,-0.003446,-0.004833,0.000117,-0.000616,-0.000635,-0.002402,-0.001945,-0.003843,-0.00473,-0.002397,-0.004214,-0.004262,-0.001038,-0.002703,-0.00256,-0.000552,-0.001079,-0.001003,-0.004166,-0.004016,-0.002578,-7.1e-05,-0.004959,-0.004324,-0.003844,-0.006341,-0.004766,-0.001173,-0.001131,-7e-06,-0.001487,-0.002148,-0.001629,-0.001862,-0.000855,-0.000194,0.000242,-0.000686,-0.00225,-0.001289,-0.006603,-0.004126,-0.004972,-0.005716,-0.002517,-0.001948,-0.002053,-0.005983,-0.003015,-0.001989,-0.006256,-0.00417,-0.00462,-0.004686,-0.003974,-0.003414,-0.003652,-0.002334,-0.002137,-0.001742,-0.003203,-0.001302,-0.002653,-0.001391,-0.003853,-0.002141,-0.004112,-0.005396,-0.004084,-0.00202,-0.000301,-0.005478,-0.004857,-0.002991,-0.00194,-0.001692,-3.6e-05,-0.003239,-0.002872,-0.000855,-0.001951,-0.004179,-0.004212,-0.002726,-0.001097,0.002129,0.00079,-0.001876,-0.002646
-0.003279,-0.000484,0.000544,0.002885,0.001967,5e-04,-0.003214,-0.005778,-0.003599,0.000911,0.003302,0.001514,0.001265,0.000488,-0.000256,0.001241,0.000766,0.000526,0.00257,0.000363,-0.000462,-0.000834,-0.000562,0.001881,0.000111,-0.001497,0.00311,0.000789,-0.001437,-0.001356,0.000264,0.001924,0.000431,-0.000916,-0.003398,-0.002097,0.001819,-0.000274,-0.001501,0.000405,-0.000461,-0.000893,-0.0011,1.7e-05,0.000504,-0.001298,-0.003454,-0.001818,-0.001879,0.002479,0.000378,-0.000247,-0.000228,-0.001223,0.001903,0.003938,-0.000459,-0.001722,-0.000338,0.000138,-0.001142,-0.005633,-0.002167,-0.002341,-0.003056,-0.002023,-0.003019,-0.00239,-0.001507,-0.00301,-0.001913,-0.001192,0.002105,0.001523,0.000526,0.001048,0.000731,-0.001081,0.002549,0.002297,0.002863,0.002076,0.00399,0.001971,0.002942,0.002684,0.000644,0.001412,-7.6e-05,-0.001634,-0.001302,-0.001418,0.000403,-0.00092,0.000466,0.00101,0.002896,0.000296,0.001672,0.002109,-0.000306,0.001298,-0.000685,0.00238,0.002694,0.001732,0.002928,0.000201,-0.002324,0.000649,-0.00152,-0.002486,-0.000742,0.00231,0.002279,-0.000499,-0.001435,-0.003793,-0.004179,0.000702,0.001505
-0.002279,-0.002388,-0.000692,-0.001599,-0.00283,0.000955,-0.000851,-0.000348,0.000805,0.000282,0.00049,-0.001949,-0.000886,-0.002154,-0.001006,-0.002835,-0.001435,-0.002559,-0.004427,-0.001372,-0.000366,-0.00172,-0.002128,-0.001689,-0.001506,0.002149,-0.000497,2.2e-05,-0.001917,0.000656,-0.002514,-0.003386,-0.00301,-0.001257,-0.003977,-0.000652,-0.000906,-0.000877,-0.0026,-0.002111,-0.001535,0.000596,-0.001882,-0.000453,-0.003118,-0.001318,-0.000724,-0.003561,-0.000398,-0.003185,-0.00288,-0.000995,-0.003015,-0.001086,-0.004939,-0.003378,-0.001625,0.001137,-0.001364,-0.00181,-0.003556,-0.002327,-0.001991,-0.00355,0.000416,0.001919,-0.001498,-0.002506,-0.003982,-0.001054,0.000722,-0.000629,-0.002649,-0.002088,-0.001259,-0.005407,-0.001722,-0.004764,-0.002907,-0.002504,-0.00139,-0.000543,-0.000822,-0.002054,-0.002431,-0.003086,-0.002596,-0.002417,-0.000407,-0.001593,-0.001182,-0.002601,-0.001419,-0.000509,-0.002011,-0.000805,-0.002904,-0.003024,-0.002847,-0.004576,-0.002782,-0.002414,-0.003788,-0.001704,-0.004317,-0.001691,-0.001376,-0.000876,-0.001896,-0.003475,-0.000537,-0.003547,-0.001603,-0.004804,-0.00487,-0.004393,-0.001644,0.000603,-0.00214,-0.001759,-0.002351
0.004601,0.000935,-0.000522,0.002112,0.00183,0.00092,0.002032,0.002145,0.000743,-0.000881,-0.001268,0.001688,0.002422,0.002939,0.002449,0.000998,0.000508,-0.000865,0.0024,0.000316,0.000351,0.001128,0.00257,-0.000105,0.001773,-0.001862,0.001119,0.000386,0.001011,-4.3e-05,-0.000543,-0.001977,0.00429,0.003227,0.001398,0.000716,-0.000961,0.000897,0.002297,-0.000285,0.001539,0.000498,-0.00162,-0.001056,-0.001547,-0.000137,0.002915,0.000305,-0.001317,0.001158,0.004047,-0.002016,0.002065,0.002221,0.001336,0.003806,0.00185,0.00099,0.0017,-0.000226,0.001604,0.001023,0.000955,-0.000194,0.000554,-0.000332,0.001137,0.000669,0.003916,0.001305,-0.000856,-0.000463,-0.000124,-0.001939,-0.001414,0.002207,0.001747,0.001518,0.00232,0.001222,-0.00125,-5.2e-05,0.000574,7.5e-05,0.001057,6e-06,0.002054,-0.001053,-0.001279,0.000105,0.001416,0.00048,-0.000419,-0.000705,-0.002124,-0.001847,-0.000545,0.001634,0.002601,0.002613,0.000687,0.00035,-0.001062,-0.000458,0.002291,0.001389,-0.000923,1e-04,-0.000886,0.00049,0.000921,0.000758,0.000474,0.000701,0.004306,6.5e-05,0.000927,0.000124,0.000918,0.000242,0.002157
-0.002064,-0.001451,-0.000625,-0.001012,-0.00348,-0.003137,-0.000207,0.001416,-0.00019,-0.000226,-0.00079,-0.002192,-0.002928,-0.00174,-0.003244,-0.000482,0.001506,-0.001429,-0.001335,-0.000765,0.000995,0.001429,-0.002092,0.000337,0.001585,-0.00067,-0.000678,-0.001109,-0.001914,0.000226,0.001227,0.001854,-0.000164,0.00024,0.001629,-0.000793,0.001007,-0.002043,-0.000807,0.000277,-0.001093,-0.000381,0.001375,-0.001854,-0.000637,9.4e-05,-0.000403,0.001685,0.000222,-0.001042,-0.001258,0.001464,0.000487,-5e-05,-0.001029,-0.003607,-0.000511,-0.00121,-0.002174,-0.001427,-0.001234,-0.000488,-0.001772,0.001288,-0.000661,-0.003363,-0.001344,0.000833,-0.000538,0.002183,8.2e-05,-0.00169,0.000596,0.002753,0.000829,-5e-04,-0.000869,0.000901,-0.002916,-0.003378,-0.001251,-0.001478,-0.002387,-2.7e-05,-0.000122,0.000676,-0.00268,1.4e-05,0.001448,3.9e-05,-0.000167,0.000374,0.000589,0.000431,0.001235,0.000282,-0.000636,-4.5e-05,0.000589,-0.001291,0.001287,4.6e-05,0.001213,-9.4e-05,-0.002364,-0.001021,0.000267,0.001198,0.000849,-0.001277,-0.000809,0.002504,0.000542,0.000989,-0.000852,0.00141,0.000878,-0.001162,0.000499,-0.000148,-0.002182
-6.7e-05,0.000315,-0.001029,-0.001726,0.001879,0.000908,-0.000683,-0.001766,0.000515,0.000613,0.000442,0.001045,0.000272,0.000132,0.001712,-0.000132,-0.000572,0.000481,0.001048,0.000595,0.000429,0.000276,0.000144,0.001709,0.000944,0.000595,0.00134,0.000274,-0.00033,0.001667,0.001738,0.000541,-0.00098,-0.001373,-0.002995,-8.7e-05,-0.000369,0.002448,0.000161,1.8e-05,0.000618,0.00162,-0.000855,-0.000393,0.000545,-1.5e-05,-0.00185,-0.001584,0.000968,-0.000466,-0.000382,0.001071,-0.001332,-0.001513,0.000164,0.001654,0.000447,-0.000397,0.001679,0.001013,0.000456,-0.000783,0.000372,-0.0011,-0.001444,0.002243,0.000831,-0.00071,-0.001186,-0.001973,0.000164,0.00188,0.001028,-0.000714,0.00091,-0.00036,-0.001727,-0.000724,0.001275,0.001957,0.001265,0.000263,0.00087,0.001295,0.001656,-0.000892,0.000422,0.000509,-4.9e-05,9e-04,0.000426,0.000298,-0.000825,-0.00128,9.2e-05,-0.001152,0.000221,0.000754,0.000515,0.001377,0.002198,-0.000643,0.000711,0.000343,0.001161,0.00135,0.000469,-0.000958,-0.000279,0.000201,-0.001017,-0.001149,0.000347,0.000291,0.000777,-0.001848,-0.00323,-0.00056,6e-05,-0.000751,-0.00032
-0.002797,-0.000222,0.000892,0.000414,-0.000229,-0.001641,0.000402,-0.001284,-0.002135,-0.001251,-0.001153,-0.00227,-0.000251,-0.000794,-0.000708,0.000557,-0.002741,-0.000465,-0.000808,-0.001727,-0.000625,-0.001319,-0.001988,-0.000728,-0.002186,-0.00013,-0.003078,-0.001661,-0.000203,-0.002066,-0.001438,-0.001113,-0.001211,-0.000901,0.000869,-0.000305,0.000105,0.000369,0.000636,-0.001141,-0.000598,-0.001816,0.000217,0.000125,0.001138,-0.000532,-0.000642,-0.00046,-0.000615,-0.000489,-0.000925,-0.001859,-0.000621,0.000997,-0.000828,-0.001275,4.9e-05,0.000777,0.000469,0.000529,0.000273,-0.000714,0.002397,0.000104,0.000436,0.000655,0.000521,-0.00112,-0.000917,0.000242,0.001256,0.000319,-0.000424,-0.001289,0.000852,-0.00044,-0.000503,-0.000306,-0.000304,-0.001624,0.000566,0.00037,-0.000743,-0.000842,-0.000766,0.001042,7e-04,0.001051,0.001218,-0.000844,-0.000413,0.000697,0.00137,0.001131,0.001321,0.000739,0.001349,0.000395,-0.001906,-0.00142,-0.002723,-0.000737,-7e-05,0.000147,-0.000582,-0.001039,-0.000361,-0.00063,-0.001498,0.001888,-0.000236,-2e-06,0.000129,-0.000886,-0.002186,3.2e-05,0.001357,0.000721,-0.000246,-0.000802,-0.000217
0.00282,0.000454,0.000829,-0.000158,0.001137,0.00036,-0.001785,0.001961,0.000347,0.000779,0.001021,0.002302,2.5e-05,0.001025,0.000853,-0.000654,0.000663,0.000415,0.000776,0.000361,-0.001133,0.000935,0.001878,-0.000593,-9.7e-05,-0.000212,0.001018,0.000845,0.000843,0.000843,0.000498,-0.00059,-0.000508,0.001132,-0.000131,7.8e-05,-0.000705,0.000256,-0.000889,0.003078,0.000539,-9e-06,0.000771,0.000848,4e-05,-0.000655,0.000328,0.001285,5.7e-05,0.00083,-0.000341,0.001763,-0.000506,-0.000363,-8.9e-05,0.000155,-0.000502,0.000862,-0.001312,-0.000738,0.000193,0.001146,-0.001799,-0.000566,0.001209,-0.001035,-0.000479,-0.000214,0.000306,8.1e-05,-0.001849,-0.001219,0.001562,-0.000507,-0.000211,0.000234,0.000985,0.001135,-0.000891,0.000526,-7.2e-05,0.000259,0.000672,-0.000656,0.000204,-0.001113,-0.000763,-0.00086,-0.001126,-0.000244,-1.7e-05,-0.000551,-0.000612,-0.000812,-0.001115,0.000498,0.000821,0.000128,0.000885,0.00089,0.001141,0.001201,0.000152,0.000342,-6e-05,0.00011,-0.000238,-6.9e-05,0.000905,-0.000145,0.001085,0.00083,0.000296,0.001016,0.000531,0.00022,7.2e-05,0.000721,0.000837,0.001409,0.001259
-0.00127,-0.000365,-0.000942,-0.000164,-0.000407,-1.6e-05,-7.8e-05,-0.001494,0.001443,0.000497,0.000694,-0.000833,0.000296,-0.000849,-0.001068,0.000152,0.000531,-0.00016,6.5e-05,-6.9e-05,0.000278,0.000292,0.000524,-6.3e-05,-0.000377,-0.00098,7.7e-05,-0.000996,-0.000528,0.001296,0.000776,0.000936,0.001906,-0.000221,0.000489,9.5e-05,-0.000182,-0.000555,-0.000373,-0.000234,0.000504,0.000519,-0.00046,0.00076,0.000597,-0.000425,-0.000272,0.000675,0.000564,-0.000169,0.000377,-2.1e-05,0.001525,0.000212,0.001424,0.000651,-0.000201,-7e-04,0.000304,0.000193,-0.000377,-0.000215,-0.000612,0.000884,0.000347,0.001197,0.00011,0.001134,0.000764,0.000757,-0.000415,0.000382,-6e-06,0.000545,-0.000861,0.000161,0.00053,0.000421,0.000365,0.000173,4e-05,0.000413,-0.000448,0.000117,-0.000888,0.000428,0.000846,0.000944,-7.9e-05,-4.7e-05,-0.00066,-0.000329,5.1e-05,0.000368,0.000408,0.00085,-0.001327,-0.000854,-5.9e-05,0.000884,-0.000856,0.000918,0.001027,2e-06,0.001062,0.000615,-0.000474,0.000107,0.001001,0.000138,-0.000204,-0.000271,-0.000456,-0.00053,0.001234,0.00217,0.002035,-0.000863,-0.000394,0.000924,6.5e-05
0.001204,5e-05,0.000559,0.000409,0.000175,0.001843,1.1e-05,0.000777,-0.000399,-0.000426,-0.000797,0.000527,0.000139,0.000178,0.000722,-0.000179,-0.000379,5.1e-05,-0.001079,0.000583,-0.000253,-0.000476,-0.001074,-0.000183,-0.000588,-0.000336,-0.001185,6.7e-05,0.000864,-0.002165,-0.000744,-0.000629,0.000219,-0.001462,-0.000587,-0.000262,-8.9e-05,0.000455,0.000259,-7.6e-05,-0.00044,0.000556,0.000296,-0.000834,0.000475,0.000552,0.000811,-0.000738,-0.000746,0.000567,0.000131,0.000991,0.000838,2.2e-05,-0.000695,0.001012,-7e-06,0.000502,0.000527,-0.000208,-9.3e-05,0.000685,0.00057,-0.00075,-3.8e-05,-0.000603,-0.000116,-0.000393,-0.000132,-0.000779,0.001067,-9.3e-05,-0.00036,0.000477,0.000228,0.000476,-8.7e-05,-0.000966,0.000687,0.000722,0.00061,0.000396,0.000663,-0.000372,0.000476,0.000214,-0.000579,-0.000895,5.7e-05,0.000839,0.000885,0.001604,-6e-05,0.000957,0.000464,-0.000448,6e-04,-0.000133,0.000547,-0.000348,0.00083,-0.001567,-0.000479,-0.000387,-0.000551,-0.000256,0.000518,0.000351,-0.000489,-0.000788,0.000462,-0.000533,-0.000601,-0.000123,-0.00073,-0.001304,-0.000799,0.000456,-0.000331,-0.000499,-0.000368
-0.000369,0.000497,0.000821,0.000677,6.6e-05,-0.001011,0.000349,2.6e-05,-9.6e-05,-0.000556,0.000146,0.00036,-0.000297,0.00037,0.000545,3.8e-05,0.000185,0.000839,0.000202,0.000158,0.000581,-4.1e-05,0.000241,1.1e-05,0.001458,0.001131,0.001242,0.001227,-0.000366,-0.001111,-2.3e-05,0.001246,0.00022,0.000712,0.000226,0.000829,-0.000334,-0.000262,-0.000525,-0.000627,-0.000567,-0.000454,-0.000184,-1.3e-05,-0.000662,0.00139,-4.5e-05,-3.5e-05,0.000761,0.001175,0.000363,-0.001331,-0.001152,-0.000818,-0.000505,0.000519,-0.000173,-0.000219,-0.000346,0.00026,0.000433,-0.000191,6.7e-05,0.001631,-0.000428,8e-06,0.000107,0.00046,0.000111,0.000305,0.000214,0.000423,-0.001484,-0.000395,-0.000331,0.000163,0.000197,0.000463,0.000184,-0.000172,-0.000369,-0.001311,-0.000451,-0.000457,-0.000183,0.000536,4.4e-05,0.000521,0.000305,-0.000386,-0.000437,-0.000669,3.4e-05,-0.000864,-0.000627,-0.000628,-0.00035,0.000187,-0.000814,-0.000657,-0.000974,-0.000532,-0.000715,0.000297,-0.000368,-0.00026,-0.000268,-0.000165,0.000213,-2.5e-05,7.1e-05,9.4e-05,0.00101,0.000767,0.000285,0.000463,0.000164,0.000401,0.000258,-0.001025,0.000188
0.000332,0.000144,-0.000674,-7.3e-05,-0.00039,-6.4e-05,0.000341,-0.000473,-0.000393,0.001123,0.000398,-0.000798,0.000642,-9.4e-05,0.000102,-7.6e-05,0.00063,-0.000256,0.000449,0.000329,-0.00073,-0.000528,0.000415,-0.000405,-0.000731,0.000211,1.8e-05,-0.000235,0.000412,0.000754,0.000173,-0.000597,-0.000316,8.5e-05,0.000176,-0.00059,-0.000657,-1.5e-05,0.000352,0.000438,0.000886,-2.1e-05,-7e-05,0.000252,-0.000138,-0.000723,0.000103,0.000293,-0.000647,-0.000882,0.000394,0.000164,-0.000107,0.000147,0.001012,-0.000586,0.000365,5e-06,-1.3e-05,0.000123,-0.000281,-8.5e-05,0.000314,0.000443,5.9e-05,-0.001328,-0.00039,0.000264,-1.4e-05,-8.5e-05,-0.000443,-0.000417,0.000525,0.001066,0.000791,0.000459,-0.000235,-0.000513,-0.00079,0.00037,-2e-06,4e-04,0.00024,0.000291,-0.000387,-0.000145,0.000177,-0.000491,-0.000176,-2.1e-05,-3.2e-05,-0.00067,-0.000112,-0.000281,0.000141,9.1e-05,-1e-04,0.000208,0.000318,0.000547,0.00066,0.000617,0.000478,5.9e-05,0.000229,-0.000306,-0.000246,0.00033,-0.000405,0.00041,-0.000646,-0.000449,-0.000392,0.000353,0.000173,-0.00099,-3.2e-05,0.000124,0.000193,0.000389,6.1e-05
-0.00049,-0.000316,-0.00048,-0.000206,-0.000184,-0.000493,0.000727,0.000223,1.1e-05,-0.000175,-0.000239,0.000263,-0.000464,0.000339,-0.000426,6.6e-05,-0.000411,-0.000202,-5.2e-05,-0.000243,0.000603,0.000188,-0.000307,-2.2e-05,6.9e-05,-0.000289,4.9e-05,-0.000228,-0.000444,0.000367,0.000189,3.3e-05,-0.00011,0.000559,0.000157,0.000451,0.001107,0.000172,-0.000363,-0.000154,-0.00049,0.000126,0.000136,-0.000138,-0.000179,-0.000368,1.3e-05,-0.000367,0.000142,-0.000617,-0.000323,-9.1e-05,-1e-05,0.000696,-0.000388,-0.000747,0.000273,0.000193,-0.000448,-0.000369,7.9e-05,-0.000264,-0.000486,-0.000873,0.00027,0.000824,0.00016,-0.000556,0.000361,0.000402,-0.000319,5.7e-05,-0.000606,-0.000301,-0.000951,-0.000864,-0.000108,0.000216,-0.00021,-0.000528,-0.000211,-2.4e-05,-0.00057,0.000218,0.000461,0.00031,0.000125,-6.2e-05,0.000174,1e-06,0.000204,1.4e-05,-1.8e-05,7.4e-05,-0.000172,9e-05,-0.000323,1e-06,-0.000412,2.8e-05,-9e-06,0.000188,1e-05,-5e-06,-0.000121,9.7e-05,-2.9e-05,-0.000285,0.000274,-0.000451,-0.00025,0.000181,-7.7e-05,-0.000563,-0.000529,0.000937,-0.000249,-0.000531,-0.000382,-0.000266,-0.000154
-0.000216,8.9e-05,0.00066,-0.000165,-4e-05,7.7e-05,-0.000261,0.000253,0.000124,-0.000244,-0.000117,-0.000113,0.000282,-0.000329,0.000108,0.000193,-0.00044,-0.000164,0.000112,-0.000257,0.000194,0.000132,-2.5e-05,0.000576,-7.6e-05,-0.000195,-0.000366,0.000243,2e-04,0.000236,2.5e-05,0.000328,-0.000181,0.000107,-0.000202,-0.000152,0.000689,-0.000632,0.000217,8e-06,0.000324,7e-05,0.000298,0.000243,-9.1e-05,4.7e-05,0.000212,6.6e-05,-2.1e-05,-6.2e-05,-0.000104,-0.000341,-6.5e-05,-0.000151,0.000126,-0.000288,7.7e-05,4.5e-05,0.000836,0.000226,6.2e-05,2e-05,6.5e-05,-0.000316,-0.00034,0.000619,0.000187,-0.000185,4.1e-05,7.1e-05,0.000297,9.4e-05,0.000382,0.000235,-0.000226,1.3e-05,0.000315,-3.1e-05,0.000282,-0.000251,-0.000197,7e-05,0.000382,0.00016,-0.000353,-0.000446,3e-06,1e-04,0.000101,-0.000147,-0.000215,0.000173,-5.6e-05,0.00025,0.00017,0.000205,0.000252,0.000168,-0.000177,-9.3e-05,-3e-06,0.000165,-3.4e-05,-0.000379,0.000203,1e-05,0.00012,0.000169,-0.000133,-0.000527,1e-05,-5.5e-05,4.5e-05,-0.000245,2.4e-05,-4.5e-05,0.000119,-0.000386,6e-05,0.00032,-0.000169
-3.2e-05,-9.8e-05,-0.000198,-0.000133,-1.5e-05,0.00022,-0.000134,-0.000121,-0.000304,-0.000239,-3e-06,0.000188,-0.000222,7.3e-05,-7.3e-05,-1.7e-05,0.000463,0.00037,-7.7e-05,2.2e-05,0.000127,0.00022,0.000284,-6.5e-05,7.7e-05,-6.6e-05,0.000126,-0.000168,6.3e-05,0.000343,-0.000161,-8.3e-05,0.00035,-0.000453,9e-06,8.8e-05,-0.000302,0.000105,-6.5e-05,0.000413,-9e-05,-0.000124,-0.000429,-0.000177,2.3e-05,-0.000332,-0.000202,0.00016,0.000151,0.000228,-7.7e-05,0.000223,-0.000166,-0.000118,-6.5e-05,0.000575,-0.000332,-0.000359,-0.000487,1.1e-05,5e-06,3.3e-05,0.000519,0.000253,8e-06,8.7e-05,-3.5e-05,0.000208,-0.000133,-3.4e-05,0.000265,-0.000168,-0.000154,-0.000435,0.000428,0.000348,-2e-05,-7.3e-05,0.000133,0.000119,-6.1e-05,-6e-06,1.8e-05,1.4e-05,8.7e-05,0.000385,3e-06,-3.4e-05,-0.000187,7.9e-05,0.000196,-2e-06,-4.6e-05,-7.2e-05,-0.000199,-0.000193,-9e-06,-1.4e-05,0.000496,-0.000115,6.4e-05,-0.000205,-5e-06,0.00039,-0.000195,-1.4e-05,0.000122,-0.000114,6.3e-05,0.000374,0.000283,1e-04,-3e-06,0.000134,4.1e-05,1.4e-05,-0.000165,0.000175,-1e-06,0.000165,-5.3e-05
-8e-05,3.9e-05,3.1e-05,-0.000136,-2.7e-05,-0.000223,-0.000331,0.000232,0.000343,0.000217,0.000117,-0.000113,0.000103,9.9e-05,-0.000161,-4.1e-05,-1.9e-05,-9.5e-05,1.7e-05,-0.000122,-3.1e-05,4.7e-05,-0.000344,-5.5e-05,-1e-04,0.000234,0.000309,-0.00011,-5e-05,3.1e-05,-0.000173,-0.000105,-0.000189,-0.00025,-0.000125,4.9e-05,-0.000483,-6.2e-05,9e-06,-0.000587,2.4e-05,3.1e-05,0.000151,-0.000125,-0.000166,-5.2e-05,0.000348,-0.000294,-7.9e-05,0.000225,-0.000328,-4.5e-05,2e-06,1.5e-05,0.000256,2.7e-05,-0.000226,7.1e-05,-0.000105,-7e-05,-0.000118,5.9e-05,-0.000148,-0.000251,-5.1e-05,-0.000476,-9.5e-05,0.000181,0.000103,-0.000133,-0.000358,0.000199,0.000302,3.9e-05,7.4e-05,-0.000101,2.7e-05,1.3e-05,-0.00025,0.000434,5.2e-05,-0.000202,-9e-05,0.000188,-2e-05,-8e-06,-0.000124,4.7e-05,7.1e-05,-1.3e-05,-3.6e-05,-8.2e-05,1.1e-05,0.000117,0.000117,-2.3e-05,0.000172,-5e-06,1e-05,8.1e-05,-0.000371,-9.7e-05,-0.000188,-0.000183,-0.000101,0.000313,6.3e-05,0.000129,0.000107,-3.5e-05,0.000115,3.1e-05,-7e-06,-8e-06,8.5e-05,3e-05,-4.9e-05,0.000112,-9.6e-05,-0.000204,0.000199
0.000214,0.00013,-0.000167,4.2e-05,8.9e-05,0.000411,7e-06,5.1e-05,-9.7e-05,5.2e-05,-2.3e-05,0.000108,-0.000105,-0.00021,4.6e-05,8e-06,-9.8e-05,-0.000102,0.000107,0.000218,-0.000204,-1.7e-05,3.4e-05,2e-06,3.2e-05,4.7e-05,-0.000274,0.000111,4.3e-05,-4.1e-05,-0.000112,0.000221,9.4e-05,-0.000135,9e-06,-6.9e-05,0.00015,-0.000105,-1.1e-05,-0.000105,8.6e-05,0.00012,2.3e-05,0.000116,0,1.8e-05,-0.00036,-1.7e-05,-6e-05,-0.000155,0.000118,8.8e-05,0.000306,-0.000238,-0.000118,-0.00025,-0.000138,-9.3e-05,-3.2e-05,5.9e-05,0.000133,1.7e-05,-8.7e-05,4.4e-05,-0.000269,-0.000128,-6e-05,-0.000248,-0.000144,-0.000116,-0.000147,-0.000116,-0.000155,-1.8e-05,-3e-06,8.1e-05,-0.000188,-4e-05,1.2e-05,-2.4e-05,-9.7e-05,0.000152,4.2e-05,-0.000226,9e-06,4.9e-05,0.000116,-0.000162,-0.000172,0.000116,-3.8e-05,0.000122,-1.1e-05,-8.6e-05,2e-06,2.8e-05,-6.7e-05,-7.9e-05,5.9e-05,-0.000118,0.000182,-0.000268,-4.5e-05,7.6e-05,0.000184,-0.000133,-1.4e-05,-9e-06,-0.000226,0.000117,-8.4e-05,1.1e-05,-9.3e-05,0.000164,-0.000118,8.3e-05,2.1e-05,-6.1e-05,0.000123,-9.2e-05,0.000118
-6.8e-05,-0.000169,-0.00013,0.000362,-6.2e-05,-0.000261,2.5e-05,-6.5e-05,-7.5e-05,6.5e-05,-8.1e-05,-5.7e-05,0.000109,0.000142,-9.4e-05,1e-05,8.6e-05,9.9e-05,-7.3e-05,2.7e-05,7.4e-05,8.3e-05,0.000164,0.000121,0.000211,-0.000103,0.000233,0.00012,1.2e-05,-0.000201,-4.1e-05,-1.1e-05,-3.5e-05,0.000119,0.000107,8.2e-05,2.6e-05,-1e-04,4.3e-05,6.9e-05,-1.8e-05,-8.5e-05,-6.6e-05,2.6e-05,7.9e-05,0.000181,0.000279,0.000125,1.4e-05,-9.7e-05,0.000106,-5.1e-05,-0.000207,0.000198,-0.000117,0.000112,5.6e-05,3.9e-05,1.5e-05,-1.6e-05,-3.3e-05,-1.4e-05,-6.5e-05,9.1e-05,0.000288,0.000382,0.000123,0.000282,-4.4e-05,-1.4e-05,0.00018,0,0.000327,7.5e-05,3.7e-05,-8.5e-05,-6.1e-05,2e-06,0.000221,-0.000182,0.000206,-2.9e-05,-0.000129,-8e-05,5.1e-05,-7.2e-05,-1.7e-05,0.000227,-7e-06,4.6e-05,2.3e-05,3.7e-05,6.4e-05,4.9e-05,2.9e-05,-5.6e-05,-0.000151,-8.8e-05,-7.5e-05,-0.000117,-0.000251,0.000366,1e-06,-7.4e-05,-0.000159,-3.9e-05,4.7e-05,0,0.00014,-5e-05,-0.000129,1e-06,-3.3e-05,-4e-05,-7e-06,-0.000312,-4.7e-05,-2.4e-05,-4.3e-05,7.8e-05,-9e-05
0.000135,0.000154,0.000187,-0.000112,0.000105,-2.1e-05,9.5e-05,-4.9e-05,8.6e-05,2.7e-05,-3.9e-05,-0.000141,-9e-05,-4.3e-05,0.000129,-1e-06,0.000153,-1e-05,-1e-06,0,-0.000256,-3.5e-05,-0.000111,-0.000129,-0.000134,-4e-06,-5.9e-05,-1.2e-05,-8e-05,0.000138,-3.6e-05,-1e-05,-0.000192,9.6e-05,-4.9e-05,-4.1e-05,-8.3e-05,0.000166,-7.9e-05,2.8e-05,5.9e-05,-0.000134,3.5e-05,1.6e-05,3.8e-05,2e-06,-0.000184,-5.5e-05,3.6e-05,1e-05,7e-05,-2.4e-05,-3.1e-05,-9.4e-05,0.000226,-0.000136,8.9e-05,0.000115,0.000168,-4.4e-05,-7e-05,-5.7e-05,2.3e-05,-2e-05,-9.4e-05,7.3e-05,3e-06,-0.000132,0.000115,-3.1e-05,0.000148,4.2e-05,5.5e-05,-3e-06,0.000118,3.6e-05,6e-06,0.000129,-4.2e-05,-1.4e-05,-0.000125,0.000133,0.000125,-7.3e-05,-9.1e-05,0.000108,-9e-06,-0.000119,-2.2e-05,-9e-05,2.2e-05,-2.3e-05,-2.5e-05,-4e-05,-0.000104,0.000218,0.000178,-5.6e-05,-6.9e-05,0.000165,0.000202,2.7e-05,-3.4e-05,1e-05,8.3e-05,7.1e-05,-4.3e-05,4.9e-05,-9.1e-05,-0.000105,-2.4e-05,2.5e-05,1.1e-05,0,0.00012,0.000353,-7e-06,-6e-05,-2.3e-05,7.1e-05,-8.1e-05
-0.000189,-8.8e-05,6.2e-05,-8.8e-05,-2e-05,-3e-06,0.000139,6.9e-05,0,-8.1e-05,2.8e-05,0.000136,4.5e-05,1.5e-05,-2.1e-05,4.1e-05,-0.000202,1.2e-05,-5e-05,-8e-06,0.000136,-6.7e-05,3.2e-05,-6.8e-05,7.4e-05,0.00011,-5e-05,4e-05,0.000101,-0.000159,2.8e-05,-7.2e-05,2.4e-05,-1.3e-05,2.1e-05,3.2e-05,1.3e-05,4.7e-05,7e-05,-4.1e-05,-4.4e-05,2.6e-05,7.1e-05,-4.7e-05,-3.2e-05,-1.8e-05,0.000137,-4.7e-05,-8.3e-05,2e-05,0.000104,0.000162,0.00016,0.00011,0,-0.000111,7.1e-05,-9.4e-05,-0.000213,5.8e-05,9.9e-05,4.2e-05,0.000158,-0.00011,9e-05,-0.000147,-7.7e-05,-0.000105,-5.4e-05,2.9e-05,-0.000156,-5.4e-05,1.6e-05,3.6e-05,8.9e-05,-0.000131,1e-04,-0.000133,-0.00013,-1.4e-05,0.000122,-5.3e-05,-6.1e-05,4.8e-05,0.000141,-0.000127,2.6e-05,0.000136,7.3e-05,9.1e-05,-6.1e-05,8e-06,5.4e-05,9e-06,6.7e-05,-0.000125,2.6e-05,1.6e-05,-9e-05,-2.7e-05,-0.000107,-0.00011,5.5e-05,6.2e-05,4.3e-05,-8e-05,3.3e-05,-4.2e-05,8.2e-05,0.000242,4.3e-05,-2.1e-05,3.1e-05,-7e-06,-0.00016,-9.8e-05,3.2e-05,0.000117,4.3e-05,3.8e-05,-1.1e-05
7.2e-05,-4e-06,-0.00014,-5.8e-05,2e-05,-1.8e-05,5e-05,-0.000135,9.6e-05,-0.000114,4.5e-05,-3.9e-05,-3.3e-05,8e-06,-5.3e-05,-6.3e-05,-5.2e-05,-3.3e-05,9e-06,-0.000129,9e-06,5.5e-05,-3.5e-05,5e-06,1.1e-05,5.8e-05,1e-06,-5.8e-05,-9e-05,-0.000242,5.8e-05,0.000162,3.7e-05,2.7e-05,-1e-06,-8e-06,-1e-06,8.2e-05,-7.5e-05,0,-8e-05,9.9e-05,-0.000126,-4.3e-05,9.5e-05,-9.7e-05,-2.6e-05,0.000112,9.5e-05,-2.7e-05,-0.000129,-0.000143,-0.000125,-0.000138,-0.000142,4.8e-05,7.7e-05,-2e-05,4e-05,-5.7e-05,-7.6e-05,-1.6e-05,-0.000154,6.5e-05,-7e-06,-8.7e-05,2.8e-05,4.6e-05,3.3e-05,-3.3e-05,-8.9e-05,6.8e-05,-7.9e-05,-5.4e-05,2.8e-05,4.5e-05,-1e-06,0.000114,4.6e-05,6.2e-05,-1.7e-05,-4e-06,0.000113,-8e-05,-7.4e-05,3.8e-05,-3.1e-05,-0.000152,-1.5e-05,-9.1e-05,4.9e-05,3.7e-05,-1.5e-05,1.5e-05,2.4e-05,3.1e-05,-6.8e-05,1.5e-05,1.8e-05,-6.8e-05,0.00011,-8.7e-05,-5.2e-05,-4.2e-05,-0.000111,3e-06,-9.3e-05,5.1e-05,-4e-05,1.7e-05,7e-05,-2.4e-05,2.7e-05,-1.7e-05,7e-05,4.2e-05,-0.000101,-4.2e-05,-1.3e-05,-4e-06,3.3e-05
-5.5e-05,6e-05,-3.7e-05,-7.9e-05,2.1e-05,0.000216,-1.1e-05,0.000163,-4.7e-05,0.000103,6e-06,4.8e-05,7e-05,-2e-05,-5e-06,7.9e-05,0.000126,0,4.8e-05,3.1e-05,0.000196,-8.1e-05,2.5e-05,7.2e-05,-0.000158,-9.4e-05,-2e-05,-9.1e-05,6.9e-05,0.000135,6e-06,-0.000101,3.3e-05,1e-06,-9e-06,-1.6e-05,7.4e-05,-1.1e-05,3.5e-05,3e-06,0.00014,-3.6e-05,7e-05,3.8e-05,-5.1e-05,-9.8e-05,6e-06,-6.1e-05,-6.8e-05,2.6e-05,-8.3e-05,0.000143,6.3e-05,0.000106,0.000142,9.1e-05,1e-06,3.9e-05,0.00014,6.7e-05,3.8e-05,1.4e-05,-2.8e-05,-9.5e-05,-5.1e-05,-3.2e-05,3e-05,9.5e-05,-1.2e-05,3.7e-05,9.2e-05,-4.9e-05,-1.4e-05,-4.2e-05,-0.000138,-2.1e-05,-1.3e-05,-4.3e-05,0.000101,-2.7e-05,2.5e-05,-3.8e-05,-9.3e-05,6.2e-05,-9e-06,-8.1e-05,1.1e-05,0.000113,7.1e-05,7.5e-05,-1.7e-05,4e-05,2.4e-05,6.4e-05,-3.8e-05,-7.2e-05,-8.8e-05,1.9e-05,4e-05,3.6e-05,-1.1e-05,1e-06,1.6e-05,3.9e-05,6.6e-05,6e-06,1e-04,-6.2e-05,1.6e-05,-5.9e-05,3.5e-05,-1.7e-05,-4.7e-05,5e-06,8.6e-05,-9.7e-05,0.000107,-4e-06,-5e-06,-6.1e-05,7.6e-05
9.7e-05,-7.7e-05,9.3e-05,6.9e-05,-1.1e-05,-0.000173,-9.1e-05,-4.4e-05,2e-05,0.000112,-2.3e-05,-1.8e-05,-5.3e-05,1.1e-05,-1.2e-05,-7.5e-05,-1.6e-05,1.3e-05,-2.5e-05,-2.5e-05,-6.7e-05,2e-06,-8e-06,-3.8e-05,0.000108,-7.6e-05,9.1e-05,5.2e-05,-2.9e-05,5.3e-05,6e-06,-4.5e-05,7.1e-05,7e-06,9e-06,1.9e-05,8e-06,5e-06,-1e-06,-9.6e-05,-7.4e-05,-3.8e-05,2.6e-05,7e-06,3.2e-05,5.5e-05,-1e-04,4e-06,4.6e-05,7.9e-05,-2e-06,-9e-05,2e-05,-7.4e-05,3.1e-05,0.000113,-3.2e-05,-1.6e-05,-0.000101,-7.5e-05,1.8e-05,2.7e-05,8.3e-05,-7.1e-05,6.9e-05,9.7e-05,-1.2e-05,-0.000111,-4.9e-05,-3.1e-05,0.000106,1.4e-05,-6e-05,-2.4e-05,-4.7e-05,7e-05,-7.1e-05,-1.6e-05,1.3e-05,7.9e-05,1e-06,-7e-06,2.9e-05,8.7e-05,1.8e-05,2.3e-05,3.3e-05,-2.2e-05,-8e-06,-3.8e-05,-1.5e-05,-2.4e-05,-2.3e-05,-9.5e-05,-2.4e-05,3.1e-05,5.3e-05,4e-05,3e-06,2.5e-05,-3.9e-05,5.8e-05,5.1e-05,-5.8e-05,-3e-05,-1.2e-05,-6.3e-05,3.6e-05,2e-05,-2.3e-05,-1.5e-05,-3.2e-05,7.9e-05,-2.2e-05,-8.2e-05,6.6e-05,-7e-05,1e-06,2.5e-05,-6e-05,-2.3e-05
3.8e-05,5.6e-05,-1.3e-05,8e-05,1.4e-05,0.000101,-8.3e-05,-7e-06,-2.8e-05,-9.6e-05,-3e-05,-9e-06,5.2e-05,-2.8e-05,3.4e-05,6e-05,-5.6e-05,1.2e-05,8e-06,6.1e-05,7.1e-05,-1.7e-05,-3.6e-05,2e-06,-4.4e-05,4.2e-05,-0.000115,1.5e-05,-7e-06,9.7e-05,3.7e-05,9.1e-05,-7.2e-05,-2.3e-05,6e-06,-1.8e-05,-7.5e-05,6.1e-05,-2.2e-05,0.000127,5e-06,2.7e-05,-8.1e-05,2.5e-05,1.5e-05,2e-05,8.4e-05,1.9e-05,-3.3e-05,-2e-06,-2.4e-05,6.5e-05,-1.6e-05,4.9e-05,-8.9e-05,-3.5e-05,-5.2e-05,8.8e-05,6e-06,4.2e-05,-5.7e-05,-2e-05,-1.9e-05,9.9e-05,-1.2e-05,-9.2e-05,-2.2e-05,6.2e-05,2e-05,4.4e-05,-9e-05,1.3e-05,-8.9e-05,-5.8e-05,7.3e-05,-3.5e-05,-1.6e-05,6.2e-05,-0.000101,-2e-05,1.4e-05,9e-05,-3.5e-05,4e-05,-5.1e-05,-2.7e-05,-2.6e-05,-2e-06,-1e-06,9e-06,6.1e-05,-3.6e-05,7e-06,9e-06,4.4e-05,6.4e-05,2.1e-05,1.9e-05,1e-05,-2.3e-05,6.7e-05,4.9e-05,-1e-05,6.4e-05,-4e-06,-1.2e-05,3.8e-05,-1.5e-05,-6.9e-05,-6.6e-05,-5.6e-05,-2.4e-05,-8e-06,2.2e-05,2.4e-05,-8.1e-05,8e-05,1.4e-05,-1.5e-05,3.7e-05,-4e-05
7e-06,1e-06,1.9e-05,-7e-06,-2.3e-05,-9.5e-05,-3.5e-05,2.9e-05,-2e-05,-5e-05,-1e-05,-3.4e-05,-6.7e-05,1.1e-05,-8e-06,-4.2e-05,8.4e-05,1.2e-05,-5e-06,3.8e-05,-0.000121,-1e-05,7.4e-05,2.5e-05,2.2e-05,7.9e-05,0.000107,1.1e-05,2.9e-05,0.000112,-1e-06,-5.2e-05,-2.9e-05,-6.8e-05,-1.5e-05,1.3e-05,0.000116,-4.7e-05,1.9e-05,8.7e-05,2.7e-05,1.1e-05,6.3e-05,-2.6e-05,-5.7e-05,2.5e-05,-9.8e-05,4.3e-05,9e-06,-5.9e-05,9.4e-05,-5.6e-05,2.6e-05,1.9e-05,4.5e-05,-0.000106,-4.3e-05,-4.4e-05,-4.3e-05,1.7e-05,4.9e-05,-8e-06,3e-05,5.2e-05,2.3e-05,0.000124,1.3e-05,4.5e-05,-2e-05,-4.6e-05,-0.000106,-3.2e-05,4.1e-05,7.5e-05,-3.9e-05,7e-06,2.4e-05,-5e-05,-3e-06,-1.2e-05,-3.8e-05,-6.1e-05,3.3e-05,-5.2e-05,8e-06,2.1e-05,1.3e-05,-6.1e-05,-1.5e-05,3.7e-05,-5.3e-05,9e-06,-1.2e-05,9e-06,3e-06,-4.6e-05,8e-06,4e-06,-3.3e-05,3e-06,-0.000111,-2e-06,3.7e-05,-4.4e-05,4.4e-05,-2.4e-05,-3.1e-05,2.5e-05,5.8e-05,6.6e-05,-2.1e-05,6e-06,-5e-06,1.7e-05,1e-05,8e-05,-1.3e-05,2.9e-05,2e-06,7.3e-05,-2e-06
-3e-06,-3.8e-05,-6.3e-05,-9e-06,1e-05,8e-06,2.4e-05,-2.2e-05,2.1e-05,4.8e-05,4.1e-05,1.2e-05,0,1e-06,1.3e-05,1.8e-05,1e-06,-4.5e-05,4e-06,-2.6e-05,5e-06,6.8e-05,-4.6e-05,4.9e-05,3.2e-05,5e-06,-1.1e-05,2.1e-05,-4.5e-05,2.7e-05,-2e-06,-1.5e-05,-2.8e-05,-3.6e-05,2.5e-05,-1.4e-05,-2.8e-05,-8e-06,-5e-06,-4.7e-05,-4.8e-05,-5.4e-05,-6e-06,-3e-05,7.6e-05,2.5e-05,0.000135,-8.2e-05,-8e-06,-3.5e-05,5.7e-05,-1.4e-05,-7.6e-05,-4.7e-05,4.4e-05,-4.1e-05,-1.9e-05,1.7e-05,4.1e-05,-3.8e-05,-2.8e-05,8e-06,-6.9e-05,-6e-05,3e-06,7e-06,1.7e-05,-8.2e-05,1.2e-05,2.9e-05,8.2e-05,2.9e-05,-7.3e-05,-4.7e-05,-9e-05,1e-06,6.1e-05,0,7.4e-05,-5.1e-05,3.6e-05,3.6e-05,-3e-06,1.7e-05,-1.5e-05,-5.8e-05,-2e-06,5.3e-05,-1.5e-05,-5.3e-05,9e-06,7e-06,-8e-06,2.1e-05,-3.9e-05,1.5e-05,-5.9e-05,-1.8e-05,2e-05,3.8e-05,9.3e-05,-6.3e-05,9e-06,2.4e-05,-5.9e-05,5.1e-05,2.3e-05,-8e-06,-2.6e-05,-1.6e-05,1.3e-05,-1.4e-05,1.3e-05,-2.1e-05,-1.4e-05,-5.2e-05,-1e-05,-3.2e-05,7e-06,-3.2e-05,5e-06
-5.2e-05,5.8e-05,2.5e-05,-1.5e-05,-1.3e-05,5.4e-05,6.1e-05,-1.2e-05,1.4e-05,1.5e-05,2.3e-05,3.1e-05,2e-05,1e-05,-1e-06,-1.5e-05,-8.8e-05,1.6e-05,1e-05,4e-06,-0.000117,-1.8e-05,-2.7e-05,-3.8e-05,9e-06,-6.4e-05,-6.2e-05,-9e-06,3.8e-05,-9.1e-05,2.4e-05,5e-05,1.4e-05,1.7e-05,-2e-05,8e-06,-0.000155,-3.1e-05,-4e-06,-9e-06,5.1e-05,-2e-06,-4.2e-05,2.7e-05,-7.5e-05,1e-06,-2.5e-05,6.8e-05,1.8e-05,2.1e-05,-1.2e-05,4.6e-05,6.2e-05,4e-06,-1.7e-05,4.4e-05,2.7e-05,-3.6e-05,5.2e-05,1e-06,7e-06,0,2e-06,3.5e-05,-4.2e-05,-7.3e-05,-2.4e-05,-1e-06,-4e-06,-4.1e-05,8.3e-05,-1.9e-05,5.2e-05,6.7e-05,-1.2e-05,-4.9e-05,-1.2e-05,1e-05,-1.5e-05,1.5e-05,-4.7e-05,-8.2e-05,7e-06,-2.7e-05,3.7e-05,3e-05,-1.1e-05,-3.5e-05,-1.5e-05,3.8e-05,1.4e-05,-3.1e-05,-8e-06,-3.1e-05,1e-05,-4.4e-05,5e-06,-1.8e-05,-1.1e-05,-1.4e-05,-9.2e-05,-4.5e-05,9e-06,-2.2e-05,2.3e-05,2e-06,-3e-06,-7e-06,1.5e-05,-0.000103,2.6e-05,1e-05,-2.8e-05,-7e-06,-2.3e-05,2.3e-05,4e-06,1e-06,-1.1e-05,-2.2e-05,1.4e-05
1.8e-05,-3.6e-05,5.9e-05,-3e-05,0,-5.8e-05,5.4e-05,5e-06,2.7e-05,-2.3e-05,-2.6e-05,-1.3e-05,-1.5e-05,-4e-06,8e-06,9e-06,3.5e-05,2.1e-05,-8e-06,-4.8e-05,6.4e-05,2.9e-05,4.7e-05,-2.1e-05,-6e-06,-2e-05,2.9e-05,-2.9e-05,-2.1e-05,-6.9e-05,6e-06,-1.4e-05,5.7e-05,6.3e-05,1.9e-05,-9e-06,5.6e-05,6e-06,1e-05,2.4e-05,-3e-05,6.1e-05,3.5e-05,3e-06,2.6e-05,-6e-05,3.9e-05,-1.7e-05,-1.4e-05,4e-05,-8e-06,-6.5e-05,-1e-06,-2e-05,-3.8e-05,6.3e-05,3.8e-05,5.3e-05,-0.000133,4.5e-05,1.4e-05,-8e-06,7e-05,1.6e-05,3.2e-05,-4.6e-05,-4e-06,4.2e-05,-1e-06,3.4e-05,-6.5e-05,1.7e-05,-2.1e-05,-3.5e-05,8.2e-05,5.2e-05,-2.7e-05,-3.4e-05,-5.2e-05,7e-06,1.7e-05,4.8e-05,1e-05,-4.6e-05,2e-06,-3.9e-05,2.1e-05,5e-05,2e-05,-3.1e-05,-1.5e-05,-1e-06,-2e-06,2.8e-05,2.1e-05,2.4e-05,4.9e-05,-1.2e-05,1.2e-05,-2.7e-05,7.9e-05,5.6e-05,1e-06,7e-06,2e-06,5e-06,1.2e-05,9e-06,-7e-06,1e-05,2.9e-05,1.4e-05,6e-06,1e-05,2.2e-05,-5e-05,9e-06,-5e-06,1.2e-05,-1.6e-05,6e-06
-2.3e-05,6e-06,-3.4e-05,-9e-06,-4e-06,0.000109,1.2e-05,2e-06,-2.9e-05,3.1e-05,-2.3e-05,1.5e-05,3.6e-05,-1.7e-05,-5e-06,-1.4e-05,2.1e-05,-1.2e-05,-1e-06,9e-06,-7e-06,-7e-06,-2.8e-05,3e-06,-4.4e-05,5.1e-05,-3e-05,-6e-06,9e-06,-1.3e-05,-2e-05,-2.2e-05,1.7e-05,4.2e-05,-1e-05,4e-06,8.3e-05,-1.4e-05,-1.4e-05,-3e-06,-1.9e-05,1.1e-05,1.4e-05,9e-06,-9e-06,-4e-05,-4.8e-05,-1.3e-05,2e-05,8e-06,-7.1e-05,6.3e-05,-5.2e-05,5.7e-05,4.7e-05,8e-06,3.2e-05,-2.3e-05,8.9e-05,-4.7e-05,-2.5e-05,1.4e-05,-5.1e-05,-3.7e-05,-2.3e-05,4e-05,2.5e-05,-1.5e-05,2e-06,-1.6e-05,-7.1e-05,0,0.000107,2e-05,2.1e-05,-1.8e-05,-3.1e-05,1.4e-05,2.6e-05,3.2e-05,-5e-06,1.1e-05,-4.5e-05,-2.7e-05,1.1e-05,1.1e-05,-7e-06,-9.9e-05,2e-06,1e-05,9e-06,1.6e-05,-1e-06,-1.8e-05,-1e-06,1.5e-05,1.3e-05,-9e-06,2e-05,2.3e-05,-4.6e-05,6.8e-05,-4e-06,4e-06,-2.9e-05,1.1e-05,-1.4e-05,-1.8e-05,-3e-06,2e-06,-2.1e-05,1e-06,-8e-06,3e-06,2.9e-05,2.5e-05,-9e-06,1.6e-05,-1.1e-05,1e-06,-9e-06
5.3e-05,3.2e-05,-5.4e-05,1.8e-05,3e-06,-0.000107,-1.3e-05,-2.5e-05,6e-06,-2.1e-05,9e-06,-2.3e-05,-1.6e-05,2.4e-05,-9e-06,2.2e-05,-1.1e-05,-1e-05,-4e-06,6e-06,8.6e-05,-1.2e-05,5e-06,1.4e-05,3.7e-05,2.6e-05,5.5e-05,5e-06,-2e-06,-2e-06,6e-06,1.4e-05,-1.8e-05,-1.2e-05,5e-06,-1e-06,-5e-05,-3e-06,5e-06,8e-06,3.1e-05,-4.9e-05,-5.2e-05,-1.1e-05,-1.7e-05,1.1e-05,-3.3e-05,-8e-06,-2.8e-05,-2.3e-05,-2.7e-05,-4.5e-05,7e-05,-4.5e-05,1.8e-05,-1.7e-05,8e-06,2.5e-05,-9e-06,1.7e-05,2.6e-05,-5e-06,-3e-06,6e-06,2.2e-05,0.000106,-1e-05,-2.7e-05,-4e-06,3.5e-05,4.3e-05,-1.7e-05,-4.1e-05,-1.5e-05,-9e-06,3.5e-05,-1e-06,-2.1e-05,4e-05,4e-06,-8e-06,6e-06,3.3e-05,2.9e-05,1.7e-05,-1.6e-05,-6e-06,9.1e-05,1.1e-05,5e-06,5e-06,-5e-06,4e-06,1.2e-05,-3.1e-05,3e-06,-4.4e-05,5e-06,-2.2e-05,1.2e-05,2.7e-05,-6.4e-05,1.7e-05,-9e-06,3.1e-05,-1.2e-05,1.1e-05,1.6e-05,1.3e-05,2.8e-05,-1.6e-05,1.1e-05,-1.3e-05,2e-06,-4.8e-05,-4e-05,3.6e-05,4e-06,7e-06,2.7e-05,-2e-06
-1.8e-05,-4.6e-05,5.7e-05,8e-06,-2e-06,5.2e-05,-4.4e-05,1.4e-05,-2.4e-05,-3.5e-05,1.8e-05,-2e-06,3e-06,-2e-05,6e-06,-3.1e-05,-1.3e-05,1e-06,0,1.4e-05,2e-06,1.3e-05,1.5e-05,-2.2e-05,-3.2e-05,-3.4e-05,-5e-05,3e-06,2e-06,-7.3e-05,2.1e-05,3e-06,-2.5e-05,-3e-05,-2e-06,-6e-06,9e-06,-8e-06,6e-06,3.2e-05,-3.5e-05,-7e-06,4.8e-05,-1.3e-05,1.7e-05,7e-06,-1.7e-05,3.7e-05,1.8e-05,-1.5e-05,2.5e-05,3.5e-05,-3.7e-05,4.7e-05,-5.6e-05,-2.4e-05,-2.6e-05,-4.1e-05,-5e-06,-3e-06,-1.8e-05,-8e-06,3e-06,3.1e-05,-1.3e-05,-4.2e-05,-8e-06,5.8e-05,8e-06,-9e-06,7.1e-05,1.3e-05,7.4e-05,-1e-06,-1e-06,-3.6e-05,3e-05,1.2e-05,-1.5e-05,-2.6e-05,1e-05,2e-06,-2.1e-05,1.3e-05,-1.6e-05,1.6e-05,1.1e-05,-4.1e-05,0,-1.6e-05,-2.1e-05,2e-06,4e-06,-1.2e-05,1.5e-05,-9e-06,-9e-06,9e-06,-9e-06,-1.9e-05,1.3e-05,1.8e-05,-2.4e-05,8e-06,-2e-05,-8e-06,-1e-05,-1.3e-05,-2.2e-05,1.7e-05,-2e-05,4e-06,1e-06,0,1.9e-05,4.8e-05,-4.7e-05,-1.2e-05,-3e-06,1.6e-05,5e-06
1.7e-05,3.6e-05,1e-05,3e-05,3e-06,-3.9e-05,-3.1e-05,-1.8e-05,9e-06,2.1e-05,0,-5e-06,-3e-06,4e-06,-2e-06,3.6e-05,4.7e-05,1.6e-05,5e-06,1.8e-05,3e-05,-3.7e-05,-2.4e-05,-7e-06,8e-06,-3.9e-05,3.7e-05,1.5e-05,-1e-05,3.9e-05,-1.6e-05,-1.9e-05,-2.8e-05,-2.8e-05,3e-06,9e-06,9e-06,4e-06,-1.3e-05,-3.9e-05,1e-05,2.8e-05,-1.1e-05,6e-06,-1.6e-05,1.2e-05,2.4e-05,-5e-05,-1.6e-05,9e-06,1.9e-05,-1.7e-05,-6e-06,-5.1e-05,1.8e-05,-2.6e-05,-3e-05,-6e-06,6e-06,1.1e-05,4e-06,8e-06,0,-1.1e-05,-9e-06,-9e-05,3e-06,-3.3e-05,-1.2e-05,1.5e-05,-3.5e-05,-1e-05,-3.5e-05,0,4.4e-05,2.5e-05,2.5e-05,-6e-06,-3.9e-05,-1e-05,-4e-06,-4.7e-05,3.9e-05,4e-06,4e-06,-1.6e-05,-1e-05,3.1e-05,5e-06,1.9e-05,2.5e-05,2e-06,0,9e-06,1.6e-05,-1.2e-05,3.4e-05,1e-05,-2e-06,0,-4.2e-05,-3.5e-05,-9e-06,-1.1e-05,-6e-06,-2e-05,8e-06,1.7e-05,2e-05,-4.3e-05,9e-06,-6e-06,-4e-06,0,1.6e-05,-4.1e-05,2.1e-05,0,-5e-06,-1.3e-05,-1e-06
-2.9e-05,-9e-06,-3.3e-05,-1.3e-05,2e-06,8e-06,-1.9e-05,-6e-06,1e-05,5.6e-05,-1.2e-05,1.8e-05,3e-06,5e-06,7e-06,-3.2e-05,-4e-05,-1.1e-05,-5e-06,-1.1e-05,-3.1e-05,4e-06,1.1e-05,2.1e-05,4.2e-05,2e-05,0,1e-06,1.6e-05,6e-05,-2.8e-05,-7e-06,1.2e-05,-8e-06,-8e-06,-1e-05,-1.5e-05,1.4e-05,1e-05,-4.8e-05,2e-06,-1.2e-05,-2.5e-05,8e-06,1.5e-05,1.3e-05,2.3e-05,2.6e-05,1.1e-05,-2e-06,4.7e-05,-9e-06,2.6e-05,2.3e-05,3.8e-05,0,-1.6e-05,5e-06,-5.4e-05,-1.2e-05,9e-06,-1e-06,3.3e-05,8e-06,8e-06,2e-06,3e-06,-9e-06,1.3e-05,-1.3e-05,-6.9e-05,9e-06,2.4e-05,1.2e-05,3.2e-05,-3.5e-05,-1.4e-05,-4e-06,1.5e-05,-1e-05,-1e-06,4e-05,-3.4e-05,2.4e-05,-2.9e-05,2.4e-05,6e-06,-3e-05,-1.2e-05,-1.7e-05,-5e-06,8e-06,4e-06,-2e-06,-1.3e-05,-3e-06,1.2e-05,8e-06,-2e-06,8e-06,5e-05,1.6e-05,9e-06,1.1e-05,1.1e-05,1.7e-05,-1.2e-05,-1.2e-05,-9e-06,2.8e-05,1.9e-05,-1e-06,1.2e-05,0,-3.4e-05,1e-05,-1.7e-05,1e-06,9e-06,-1.8e-05,-5e-06
-3e-06,-2.1e-05,2.1e-05,-1.7e-05,-1e-06,5.1e-05,1.9e-05,1.3e-05,3e-06,-3.6e-05,-3e-06,1e-06,-8e-06,-1e-05,-6e-06,2.7e-05,-1.1e-05,-3e-06,2e-06,-2e-06,-4e-05,-5e-06,8e-06,1.3e-05,-3.2e-05,4.5e-05,-3.6e-05,-9e-06,-1.8e-05,3.3e-05,-2e-06,4.7e-05,2.8e-05,1.1e-05,6e-06,9e-06,2.7e-05,-6e-06,-8e-06,2.2e-05,-2.8e-05,-1.7e-05,3.2e-05,4e-06,-9e-06,-5e-06,1.1e-05,6e-06,0,1e-06,8e-06,2.6e-05,-3.7e-05,0,-4.3e-05,2.9e-05,1e-06,0,7.7e-05,-7e-06,-1.8e-05,-9e-06,-3.8e-05,1.7e-05,-9e-06,4.1e-05,-8e-06,1e-06,-7e-06,-2e-06,2.8e-05,0,-4.3e-05,-2e-06,-3.3e-05,2.1e-05,-1.9e-05,1.6e-05,3e-05,2.7e-05,9e-06,-1.9e-05,1.8e-05,1.3e-05,-1e-05,-1.5e-05,5e-06,-1e-06,0,7e-06,-1.4e-05,3e-06,-3e-06,1.4e-05,-1.5e-05,1.8e-05,-2.3e-05,0,4e-06,-1e-05,-6.3e-05,3e-05,-2.8e-05,-4e-06,-1.8e-05,1e-06,1.2e-05,7e-06,-2e-06,3.1e-05,6e-06,-7e-06,-8e-06,-1e-06,1.5e-05,-1.3e-05,6e-06,4e-06,-5e-06,0,3e-06
-4e-06,3e-05,-2.5e-05,-2e-06,5e-06,-6.5e-05,3.4e-05,-7e-06,2.1e-05,-3.8e-05,5e-06,-2e-06,7e-06,1.4e-05,0,-1.6e-05,2.4e-05,4e-06,0,-1.5e-05,-3.1e-05,-3e-06,-1.9e-05,-1.2e-05,1.8e-05,-3e-06,3.4e-05,0,1.5e-05,3.8e-05,0,-5.3e-05,1.3e-05,1e-05,-8e-06,-7e-06,-2.3e-05,9e-06,6e-06,3e-06,3.6e-05,2.5e-05,-7e-06,-7e-06,2e-05,-2.4e-05,0,-1.5e-05,0,7e-06,-3.2e-05,-3.6e-05,4.3e-05,0,-1.2e-05,2.9e-05,1.8e-05,8e-06,-3.6e-05,2.2e-05,1.8e-05,7e-06,-2e-06,-2.1e-05,1.4e-05,3.5e-05,-4e-06,2.3e-05,-1e-06,-6e-06,6.8e-05,-3e-06,8e-06,3e-06,-4.1e-05,-1.3e-05,-1.2e-05,-1.3e-05,-1.7e-05,-6e-06,-5e-06,3.2e-05,-2.2e-05,-1.7e-05,3e-06,1.6e-05,-1e-05,5.1e-05,-1.1e-05,-2e-06,1.5e-05,-7e-06,4e-06,-2.3e-05,1.6e-05,0,-2.6e-05,-2e-06,1.3e-05,-4e-06,5.7e-05,-4e-06,-1e-06,5e-06,1.2e-05,-2.1e-05,-1.2e-05,-8e-06,9e-06,-1.6e-05,3e-06,-1e-05,7e-06,2e-06,1.2e-05,1.4e-05,8e-06,-3e-06,1e-06,1.2e-05,4e-06
1.3e-05,-2.7e-05,1e-06,-4e-06,-4e-06,7.2e-05,3.3e-05,-7e-06,-2.4e-05,2.9e-05,6e-06,0,-1.9e-05,-1e-05,-1e-06,9e-06,-6e-06,-2e-06,0,1e-06,-3e-05,1.7e-05,1.5e-05,-5e-06,-6e-06,-4.1e-05,-2.9e-05,-2e-06,-9e-06,1.6e-05,-6e-06,3e-05,-2e-06,9e-06,2e-06,5e-06,-2.1e-05,2e-06,-2e-06,-7e-06,-2.2e-05,2.2e-05,-2.4e-05,-7e-06,-2.1e-05,-1.9e-05,-4e-05,-3e-06,-4e-06,3e-06,-2.3e-05,3.7e-05,-2.1e-05,-3e-06,3.3e-05,-3e-06,2.2e-05,-1.9e-05,-2.5e-05,-1.5e-05,-1.1e-05,0,2.3e-05,-1e-05,-2e-06,-2.8e-05,1e-05,-2.4e-05,1.1e-05,-6e-06,-2.4e-05,6e-06,-2.9e-05,-2e-06,-3e-06,2.1e-05,5e-06,1.1e-05,-2.3e-05,5e-06,1e-06,-2.5e-05,1.3e-05,-1.3e-05,-2e-06,-8e-06,7e-06,-5.8e-05,3e-06,-3e-06,-1e-05,2e-06,-3e-06,4e-06,1.1e-05,-3e-06,2.2e-05,-6e-06,-4e-06,1.2e-05,-5.2e-05,-1.2e-05,-1e-06,-3e-06,-3e-06,1.8e-05,1.1e-05,1e-06,-1.3e-05,-6e-06,-1.8e-05,-2e-06,6e-06,-2e-06,-1e-05,-1.9e-05,-1.7e-05,-8e-06,3e-06,4e-06,2e-06
1.5e-05,6e-06,4.3e-05,3e-06,4e-06,-8.1e-05,5e-06,1.1e-05,1.3e-05,1.4e-05,2e-06,-1.3e-05,1.7e-05,0,-2e-06,-1e-06,-1e-05,4e-06,1e-06,2e-06,3.8e-05,-1e-05,2e-06,1.1e-05,-1.8e-05,-1.6e-05,3.2e-05,-4e-06,1e-06,-4.9e-05,0,3e-06,-2.2e-05,7e-06,1e-06,-2e-06,4.6e-05,9e-06,-2e-06,-9e-06,-9e-06,-2.9e-05,3.1e-05,5e-06,2.5e-05,-8e-06,-7e-06,1.9e-05,1e-06,-1e-06,-2.8e-05,-3e-05,-1.5e-05,4e-06,-1.1e-05,-3.5e-05,7e-06,8e-06,4.6e-05,-6e-06,1e-06,-9e-06,-8e-06,1.5e-05,-3e-06,2e-06,0,9e-06,-1.5e-05,7e-06,-6e-05,-1e-05,-1.7e-05,-1e-05,1.6e-05,0,2.1e-05,9e-06,1.7e-05,-9e-06,9e-06,6e-06,2e-06,-1e-06,1.5e-05,1.2e-05,-1e-06,4.2e-05,-1e-06,9e-06,7e-06,1e-06,1e-06,6e-06,-1.5e-05,-4e-06,2.4e-05,-6e-06,-4e-06,-1e-06,4.3e-05,-2e-05,-7e-06,3e-06,-1e-05,5e-06,-7e-06,2e-06,1.4e-05,-2.5e-05,-2e-06,-6e-06,-4e-06,-1e-06,-6e-06,2.8e-05,5e-06,7e-06,-2e-06,-1e-06,-3e-06
-3e-06,1.6e-05,-2.9e-05,1.5e-05,-2e-06,4.9e-05,-2.1e-05,-1.6e-05,-1.6e-05,-2e-05,-6e-06,6e-06,-1e-05,5e-06,2e-06,-2e-06,2e-05,-3e-06,-3e-06,6e-06,-1e-06,2.3e-05,-1.8e-05,0,9e-06,3.3e-05,-2.6e-05,3e-06,5e-06,-5.6e-05,1e-06,-1e-05,-1.6e-05,2e-06,-2e-06,-1e-06,-2.1e-05,1e-06,0,-8e-06,2.2e-05,-2.2e-05,-9e-06,4e-06,-1.6e-05,0,-1.1e-05,-1.2e-05,-8e-06,-9e-06,6e-06,1.8e-05,4e-05,-2e-06,-3.3e-05,-1.8e-05,-5e-06,-1.4e-05,-4.1e-05,2.1e-05,1e-05,5e-06,6e-06,-8e-06,2e-06,-2e-05,-9e-06,1.6e-05,1e-05,-6e-06,1.6e-05,5e-06,5e-06,9e-06,-2.6e-05,-1e-05,6e-06,-1.8e-05,1.6e-05,-2e-06,-1.2e-05,-8e-06,1e-06,-9e-06,1e-05,-7e-06,-5e-06,-5.3e-05,9e-06,-8e-06,4e-06,-3e-06,-1e-06,2e-06,-7e-06,-8e-06,-1.3e-05,-1e-06,0,-1.3e-05,-1.9e-05,1.9e-05,2e-06,1e-06,7e-06,-1.4e-05,5e-06,-1e-06,-1e-05,5e-06,-3e-06,-3e-06,1e-05,3e-06,1.1e-05,-2.2e-05,-2e-06,-2e-06,-1e-06,-9e-06,-7e-06
1e-06,-2.6e-05,-3.2e-05,0,-1e-06,-2e-05,-3.3e-05,5e-06,4e-06,1.4e-05,-7e-06,1e-06,1.9e-05,-7e-06,-2e-06,-1e-06,1e-06,-1e-06,0,4e-06,7.4e-05,1e-06,1.9e-05,-1.5e-05,2e-06,2.7e-05,1.5e-05,5e-06,-7e-06,-3.9e-05,-2e-06,-1.6e-05,9e-06,-8e-06,5e-06,3e-06,-2.4e-05,-1e-06,3e-06,-8e-06,-1.8e-05,2.5e-05,-2.1e-05,3e-06,5e-06,1.6e-05,4.4e-05,-8e-06,9e-06,-3e-06,3.6e-05,-8e-06,-4.3e-05,-1e-05,1.1e-05,1.5e-05,-1.3e-05,2.4e-05,3.7e-05,-1.4e-05,-1.4e-05,3e-06,-1.8e-05,-5e-06,-3e-06,-2e-06,7e-06,-1.2e-05,-2e-06,1.6e-05,6e-05,-1e-06,-1.5e-05,-1.5e-05,-3.7e-05,1.1e-05,-1.1e-05,1.8e-05,-2e-05,-2e-06,1.4e-05,-3e-06,7e-06,-5e-06,1.4e-05,1.5e-05,8e-06,6.2e-05,0,7e-06,-1.4e-05,-2e-06,-1e-06,-1.3e-05,1.7e-05,1e-05,-2.8e-05,-1e-06,-4e-06,4e-06,-1e-06,9e-06,-5e-06,-2e-06,-9e-06,1.2e-05,-3e-06,6e-06,6e-06,2.1e-05,9e-06,3e-06,-6e-06,-1e-06,3e-06,1.4e-05,5e-06,2e-06,4e-06,-9e-06,0
-1.9e-05,1.9e-05,4.1e-05,-5e-06,1e-06,-2e-06,-2e-05,-5e-06,6e-06,1.2e-05,4e-06,6e-06,-6e-06,4e-06,3e-06,6e-06,-3.2e-05,-1e-06,-1e-06,-3e-06,-2.1e-05,-1e-06,-9e-06,-5e-06,3e-06,-2.1e-05,6e-06,0,6e-06,9e-06,5e-06,3.3e-05,1.6e-05,-1.5e-05,-4e-06,-3e-06,4.7e-05,0,-4e-06,1.5e-05,1.4e-05,1.3e-05,3.3e-05,-4e-06,7e-06,1.2e-05,7e-06,2.3e-05,-4e-06,9e-06,2.1e-05,-1.1e-05,2.2e-05,1.8e-05,1.9e-05,2.2e-05,-1.5e-05,-1.7e-05,-2.6e-05,-9e-06,1e-05,-8e-06,5e-06,1.4e-05,4e-06,1.6e-05,5e-06,-8e-06,-3e-06,-1.2e-05,-7e-06,2e-06,2.2e-05,1.4e-05,1e-05,-2.4e-05,-1e-05,-1.2e-05,-6e-06,1e-06,-1.2e-05,1.7e-05,-2.1e-05,0,0,-1e-05,-7e-06,-4e-05,8e-06,-4e-06,1e-05,-3e-06,0,1e-05,5e-06,-2e-06,1.1e-05,2e-06,4e-06,9e-06,2.5e-05,-1.1e-05,1.3e-05,2e-06,1e-06,1.3e-05,1e-06,-6e-06,-1e-06,-2.8e-05,8e-06,-2e-06,0,-2e-06,-2e-05,-5e-06,-2e-06,-3e-06,-4e-06,1e-05,7e-06
6e-06,-1e-06,-1e-06,-3e-06,-2e-06,4.4e-05,1e-06,8e-06,-9e-06,-3.7e-05,8e-06,2e-06,6e-06,-1e-06,1e-06,-1.3e-05,2.3e-05,3e-06,1e-06,0,4.3e-05,1e-06,-3e-06,1.5e-05,2e-06,-3.3e-05,-2.6e-05,2e-06,-2e-06,1e-06,1.1e-05,-3.4e-05,1.1e-05,-6e-06,3e-06,3e-06,-1e-05,-2e-06,2e-06,2.5e-05,-3e-06,-2.4e-05,-1.6e-05,-7e-06,-2e-05,-9e-06,3.1e-05,-1.9e-05,4e-06,6e-06,9e-06,2.4e-05,8e-06,-8e-06,-3.4e-05,1e-05,-2e-06,1.6e-05,-9e-06,2e-05,-2e-06,6e-06,1.6e-05,-4e-06,0,3.3e-05,-9e-06,5e-06,6e-06,1.5e-05,-5.9e-05,4e-06,-1.4e-05,-7e-06,3.9e-05,2.2e-05,-6e-06,-4e-06,1.8e-05,6e-06,6e-06,-1.2e-05,1.7e-05,1.1e-05,-3e-06,1.2e-05,0,1.1e-05,-5e-06,-1e-06,4e-06,2e-06,1e-06,-3e-06,-1.8e-05,4e-06,2.7e-05,2e-06,1e-06,-6e-06,-4.2e-05,-5e-06,2e-06,-5e-06,2e-06,-1.2e-05,0,4e-06,-7e-06,-1.7e-05,-2e-06,2e-06,2e-06,0,1.2e-05,1.3e-05,3e-06,1e-06,0,1e-05,4e-06
-4e-06,-1.6e-05,-2.2e-05,1e-06,1e-06,-6.6e-05,2.1e-05,-1.1e-05,1.6e-05,-1e-06,-1e-06,-4e-06,-1.1e-05,-2e-06,-1e-06,1.7e-05,3e-06,4e-06,2e-06,-4e-06,-7.6e-05,-1.7e-05,1.3e-05,1e-06,-2e-06,6e-06,2.9e-05,0,-3e-06,2.3e-05,3e-06,1.5e-05,-6e-06,9e-06,-2e-06,-1e-06,-2.5e-05,-2e-06,-3e-06,-5e-06,-1.5e-05,-4e-06,-1.2e-05,5e-06,2.6e-05,-1.3e-05,-4.9e-05,1e-06,-3e-06,-4e-06,-1.5e-05,-2.9e-05,-3e-05,4e-06,-1.5e-05,-9e-06,9e-06,-1.2e-05,4.6e-05,-9e-06,-6e-06,6e-06,-9e-06,-8e-06,-2e-06,-4e-06,1e-06,1.4e-05,-5e-06,-2.1e-05,3e-06,-6e-06,4e-05,6e-06,1.1e-05,-2.4e-05,4e-06,7e-06,2e-06,-3e-06,-3e-06,2.2e-05,-2e-05,2e-06,-4e-06,-9e-06,5e-06,-1.4e-05,1e-06,4e-06,-8e-06,2e-06,-2e-06,3e-06,0,-2e-06,-3e-06,1e-06,-2e-06,-3e-06,4.8e-05,1e-05,-4e-06,4e-06,-7e-06,-8e-06,0,-7e-06,1.3e-05,1.3e-05,0,4e-06,-8e-06,0,1e-05,-1.3e-05,-7e-06,3e-06,4e-06,-3e-06,-3e-06
