-0.003006,-0.00674,-0.002416,-0.000298,-7.1e-05,-4.3e-05,-7e-05,-0.002823,-0.031668,-0.021718,-0.022985,-0.113513,-0.216962,-0.207479,-0.178487,-0.174692,-0.149479,-0.129063,-0.072464,-0.030275,-0.011829,-0.006005,-0.001705,-0.000763,-0.000452,-0.000879,-0.003142,-0.00582
-0.002208,-0.005325,-0.001966,-0.000205,-2.6e-05,-6e-06,-3.6e-05,-0.001956,-0.02464,-0.016257,0.001455,-0.057905,-0.032922,0.041798,0.076891,0.103615,0.133216,0.130083,0.070373,0.01864,0.014008,0.007303,0.002075,0.000526,6.4e-05,-0.000172,-0.001943,-0.004574
0.000711,0.001247,0.000466,0.000138,5.6e-05,2.4e-05,2.4e-05,0.00099,0.012384,0.008232,-0.007556,-0.022409,0.000658,0.003137,-0.010586,-0.019628,-0.038179,-0.02707,-0.029139,-0.011131,-0.004846,-0.001447,-0.001003,-0.000395,0.000199,0.000837,0.001352,0.001452
0.002365,0.005525,0.002067,0.000304,0.000116,7.7e-05,8.2e-05,0.002815,0.032991,0.021161,0.000954,0.025283,-0.006767,-0.051164,-0.07677,-0.111129,-0.120088,-0.118208,-0.049481,-0.011839,-0.010343,-0.006067,-0.001267,-0.000377,0.000114,0.001103,0.002792,0.004661
0.001199,0.003242,0.001135,7.6e-05,7.5e-05,8.3e-05,6.8e-05,0.000642,0.006253,0.004183,0.010732,0.077135,0.140336,0.152777,0.142193,0.148589,0.16148,0.133845,0.084172,0.036971,0.015471,0.006756,0.002431,0.00101,0.000261,0.000684,0.001879,0.002678
-0.001582,-0.003429,-0.001319,-0.000253,-6.6e-05,-2.9e-05,-5e-05,-0.002748,-0.03132,-0.02061,-0.013616,-0.004754,0.044941,0.042059,0.024055,0.048716,0.027529,0.038032,-0.000516,-0.005161,-0.001909,0.000268,-0.000539,-0.000126,-0.000164,-0.000616,-0.000989,-0.00201
-0.001873,-0.004668,-0.001646,-0.000146,-4.4e-05,-3.9e-05,-6.1e-05,-0.001418,-0.017677,-0.011869,-0.001644,-0.070663,-0.167521,-0.197088,-0.17515,-0.172082,-0.15785,-0.134147,-0.063826,-0.030671,-0.012023,-0.006294,-0.001533,-0.000568,-0.000154,-0.000431,-0.001366,-0.002879
0.000466,0.000665,0.000324,0.000172,6.9e-05,3.2e-05,3e-05,0.001354,0.014949,0.009877,0.005404,-0.027644,-0.046892,-0.000287,0.038753,0.032084,0.069366,0.046486,0.028386,0.011986,0.008933,0.003383,0.001103,0.000369,0.000273,0.000583,0.000637,0.000536
0.001598,0.00377,0.001325,0.000184,7.7e-05,5.1e-05,6.7e-05,0.001952,0.024461,0.015918,-0.001979,0.023684,0.111219,0.147871,0.113414,0.100451,0.056179,0.057339,0.013084,0.008113,0.001419,0.002368,5e-05,-5.5e-05,7e-06,0.000695,0.001625,0.00262
0.000487,0.001504,0.000441,-1.4e-05,2.8e-05,4.6e-05,4.2e-05,6.2e-05,0.001282,0.000981,0.00709,0.018863,-0.002392,-0.041651,-0.063624,-0.073216,-0.102309,-0.08702,-0.02404,-0.004923,-0.006779,-0.003674,-0.000654,-0.000288,-0.000305,0.000106,0.000517,0.00073
-0.000966,-0.002121,-0.000773,-0.000136,-2e-05,3e-06,-2.3e-05,-0.001772,-0.022117,-0.01457,-0.002268,-0.013752,-0.065237,-0.053522,-0.013884,0.000531,0.047872,0.022536,0.015067,0.008417,0.005712,0.001283,0.000643,0.000288,-8e-06,-0.000341,-0.00066,-0.00144
-0.000964,-0.002499,-0.000793,-5.4e-05,-3e-05,-3.3e-05,-5.1e-05,-0.000744,-0.010374,-0.007248,-0.001145,-0.009797,0.015266,0.060438,0.04849,0.058945,0.059873,0.07526,0.013787,-0.002245,0.001564,0.002279,8e-05,6.7e-05,0.000162,-0.000192,-0.000191,-0.000741
0.000341,0.000612,0.000311,0.000106,2.2e-05,-4e-06,5e-06,0.000949,0.012034,0.008483,0.006381,-0.015507,-0.019958,-0.035709,-0.06985,-0.076145,-0.086485,-0.061316,-0.018141,-0.01424,-0.006013,-0.00246,-0.000675,-0.000248,-3.7e-05,0.000203,0.000429,0.000405
0.000928,0.00231,0.000784,0.000113,5.8e-05,4.3e-05,5.6e-05,0.001051,0.014647,0.010286,-0.006479,-0.025906,-0.043909,-0.04083,-0.025873,-0.033519,0.006915,-0.029273,-0.008937,0.003895,0.002058,-0.000795,4.8e-05,-3e-05,-0.000168,0.00011,0.000552,0.000893
8.7e-05,0.000377,4e-06,-4.1e-05,1.4e-05,3.8e-05,3.2e-05,-9e-05,-0.000933,-0.000953,-0.004433,0.018939,0.077664,0.096428,0.088181,0.093713,0.06143,0.061032,0.019044,0.013123,0.002999,0.002446,0.000735,0.000276,-7.2e-05,0.000118,0.000792,0.00093
-0.000372,-0.000978,-0.000414,-1e-04,-3.1e-05,-7e-06,-2.1e-05,-0.000998,-0.014008,-0.009649,0.003812,0.019444,0.03909,0.001394,-0.014501,0.001794,-0.049241,-0.015953,0.006711,-0.001104,-0.002538,-0.000231,-0.000113,-7.8e-05,5e-05,0.000248,0.000456,8.4e-05
-0.000435,-0.001233,-0.000342,-2.7e-05,-3.4e-05,-4.8e-05,-5.6e-05,-0.000436,-0.006609,-0.004791,-0.005401,-0.034628,-0.102816,-0.110983,-0.076292,-0.067727,-0.019669,-0.041558,-0.02218,-0.009014,-0.000458,-0.00192,-0.000465,-0.000152,6.4e-05,-0.000217,-0.000647,-0.000993
-0.000162,-0.000312,4.1e-05,4.7e-05,-6e-06,-2.7e-05,-2.3e-05,0.00071,0.009781,0.00691,0.002256,-0.016861,-0.030604,0.019669,0.036336,0.028464,0.049013,0.043608,0.002593,-0.000675,0.001074,0.000796,0.000213,8.6e-05,-0.000116,-0.000348,-0.000647,-0.000908
0.000404,0.001305,0.000451,4.3e-05,1.5e-05,1.7e-05,3.9e-05,0.000348,0.006982,0.005589,0.003065,0.014753,0.065849,0.074067,0.046448,0.02983,-0.004129,0.016309,0.017414,0.001614,-0.000619,0.001001,-4e-05,-0.000127,-0.00024,-5.9e-05,0.000228,0.00032
