0.0069,0.007327,0.007143,0.007319,0.008207,0.008593,0.008286,0.00837,0.008286,0.007654,0.00732,0.007509,0.008196,0.008402,0.008425,0.00896,0.008017,0.006261,0.005811,0.005359,0.004945,0.00546,0.006264,0.006789,0.006831,0.006693,0.006156,0.005677
0.008365,0.008906,0.008684,0.008944,0.010086,0.010722,0.010593,0.010596,0.010193,0.009382,0.008911,0.008954,0.009842,0.010236,0.010274,0.010759,0.009502,0.00741,0.006959,0.006591,0.00609,0.006567,0.007626,0.008264,0.008196,0.007984,0.007313,0.006766
0.011241,0.012037,0.011872,0.012384,0.013906,0.015193,0.015662,0.01521,0.013743,0.012413,0.011719,0.011413,0.01265,0.013707,0.013804,0.013966,0.012041,0.00936,0.008956,0.008842,0.008133,0.008459,0.010051,0.010874,0.010545,0.010306,0.009473,0.008811
0.014812,0.016033,0.016299,0.017072,0.018957,0.021374,0.022795,0.021208,0.017659,0.015138,0.014487,0.013994,0.015382,0.017677,0.017769,0.016988,0.014375,0.01133,0.011117,0.01122,0.010043,0.010239,0.012594,0.013507,0.012668,0.012586,0.012031,0.011255
0.018995,0.020902,0.022015,0.022979,0.025538,0.029352,0.031138,0.027873,0.021953,0.01797,0.017791,0.017494,0.019011,0.022599,0.02233,0.020288,0.017125,0.013661,0.013583,0.013605,0.011517,0.011827,0.01512,0.015994,0.014702,0.015226,0.01543,0.014366
0.023497,0.026268,0.028671,0.030717,0.035878,0.041493,0.041085,0.034906,0.02726,0.021961,0.021991,0.022084,0.024423,0.029519,0.029103,0.025853,0.021615,0.017201,0.016635,0.015856,0.012867,0.013428,0.017198,0.017825,0.016867,0.018814,0.019577,0.01772
0.02924,0.034103,0.040101,0.0461,0.058376,0.067914,0.060762,0.047461,0.036686,0.02788,0.026114,0.027727,0.03499,0.044533,0.044132,0.03743,0.029831,0.024072,0.021998,0.018719,0.01518,0.015945,0.018664,0.018653,0.019128,0.022785,0.023267,0.020448
0.041191,0.050966,0.063307,0.074985,0.0996,0.117216,0.100073,0.073504,0.054026,0.037242,0.031855,0.038272,0.057957,0.07663,0.074468,0.060181,0.046399,0.038227,0.033491,0.025381,0.02036,0.020398,0.020685,0.020308,0.023614,0.029259,0.028216,0.024733
0.061618,0.079943,0.098835,0.114654,0.154156,0.182758,0.155213,0.112051,0.079866,0.05182,0.041851,0.056053,0.093434,0.124304,0.118227,0.092348,0.071354,0.06096,0.053259,0.038704,0.0301,0.028287,0.02627,0.026572,0.033882,0.042816,0.040555,0.036191
0.084194,0.111945,0.134965,0.150575,0.200315,0.237041,0.202493,0.147189,0.104565,0.067713,0.05559,0.077464,0.130372,0.171467,0.159959,0.121949,0.095826,0.085003,0.074703,0.054077,0.042141,0.039558,0.035712,0.037007,0.049469,0.062681,0.06034,0.054718
0.097063,0.131006,0.15279,0.160645,0.205693,0.240581,0.208941,0.15669,0.114281,0.078493,0.068468,0.092116,0.147206,0.189098,0.17577,0.134013,0.106719,0.096622,0.085614,0.063036,0.050824,0.049239,0.044278,0.04857,0.067648,0.083852,0.082147,0.07561
0.095621,0.124273,0.136291,0.132979,0.159769,0.182856,0.166301,0.135196,0.104064,0.080451,0.077378,0.09308,0.129646,0.160109,0.15325,0.121524,0.097116,0.086928,0.077394,0.059606,0.051894,0.052111,0.047871,0.058572,0.083972,0.100448,0.099355,0.091668
0.09011,0.098723,0.093922,0.087245,0.098883,0.108015,0.1082,0.10427,0.086447,0.07373,0.076676,0.083219,0.094841,0.10831,0.108095,0.09055,0.074493,0.066391,0.057967,0.047741,0.047188,0.048972,0.048008,0.064901,0.093968,0.108526,0.105426,0.095943
0.080894,0.073238,0.05844,0.056993,0.067268,0.073608,0.07993,0.084761,0.072756,0.062998,0.06498,0.06959,0.071762,0.072075,0.069271,0.061205,0.05645,0.05367,0.045067,0.038313,0.042511,0.046541,0.049434,0.065971,0.094894,0.106957,0.097628,0.085421
0.068881,0.057995,0.04668,0.046247,0.052985,0.062864,0.07175,0.07312,0.064331,0.057234,0.054524,0.057884,0.058754,0.051635,0.046622,0.045737,0.049156,0.049665,0.040193,0.032836,0.036104,0.042727,0.048775,0.059882,0.084399,0.093544,0.079202,0.066052
0.068948,0.051814,0.046231,0.042681,0.043817,0.055112,0.062466,0.063203,0.065087,0.064477,0.062023,0.061947,0.056252,0.045652,0.039796,0.039996,0.043925,0.043146,0.034837,0.028066,0.029773,0.039132,0.044692,0.048456,0.065405,0.072306,0.060049,0.048277
0.105545,0.07176,0.061569,0.050236,0.045699,0.053453,0.056168,0.063973,0.082678,0.090359,0.091661,0.086522,0.072982,0.058945,0.049271,0.0441,0.041724,0.036759,0.028668,0.024123,0.026811,0.038439,0.040108,0.038556,0.048657,0.049393,0.038963,0.031987
0.168209,0.114141,0.093604,0.073866,0.064771,0.06926,0.073995,0.09513,0.125534,0.134419,0.134823,0.122677,0.101196,0.081621,0.065562,0.055274,0.047665,0.037475,0.028705,0.027195,0.029778,0.040423,0.043423,0.045419,0.055056,0.048086,0.03143,0.027164
0.227803,0.158254,0.129887,0.108356,0.098806,0.104282,0.116769,0.151093,0.182965,0.181884,0.173677,0.15478,0.13003,0.105976,0.083491,0.068996,0.057826,0.045211,0.038179,0.03752,0.036784,0.044586,0.054413,0.064987,0.078288,0.067054,0.042838,0.039025
0.245934,0.179244,0.157378,0.149984,0.14356,0.156476,0.181098,0.219857,0.242277,0.222872,0.194572,0.163201,0.140178,0.121845,0.102057,0.081849,0.065585,0.056346,0.054809,0.053009,0.047477,0.05475,0.072189,0.089656,0.109688,0.096648,0.062656,0.05677
0.205393,0.169446,0.173334,0.188947,0.184397,0.208917,0.249135,0.284032,0.294588,0.257564,0.205062,0.156087,0.131921,0.128606,0.119635,0.094563,0.072576,0.067229,0.070779,0.067072,0.0601,0.067598,0.087641,0.106959,0.133443,0.123834,0.084358,0.075101
0.14904,0.157047,0.187034,0.208617,0.197437,0.230563,0.282143,0.301467,0.29998,0.262697,0.205038,0.147247,0.120652,0.131319,0.134707,0.114029,0.088431,0.078173,0.081218,0.074773,0.071077,0.086067,0.109824,0.122894,0.143132,0.137714,0.110095,0.106145
0.121929,0.142035,0.183163,0.206418,0.184325,0.205451,0.248925,0.247684,0.240345,0.216864,0.171266,0.130527,0.127772,0.154531,0.165016,0.153144,0.115647,0.089539,0.093019,0.083607,0.084282,0.124465,0.172098,0.178035,0.177183,0.165905,0.153706,0.166994
0.09914,0.117611,0.164727,0.209577,0.194896,0.17645,0.177091,0.164849,0.165672,0.156794,0.129031,0.120464,0.157479,0.21539,0.231009,0.209474,0.148434,0.106812,0.120073,0.107504,0.106302,0.179679,0.265486,0.274227,0.265183,0.241156,0.219333,0.254413
0.09999,0.114928,0.183824,0.280454,0.282995,0.207272,0.152405,0.142966,0.142664,0.131627,0.11977,0.127591,0.186004,0.272058,0.287486,0.244032,0.173723,0.132639,0.154201,0.134534,0.126998,0.226831,0.347477,0.364898,0.357418,0.319381,0.271739,0.332455
0.13046,0.138606,0.233897,0.387396,0.407079,0.28293,0.181369,0.172003,0.170219,0.144573,0.125249,0.131367,0.184817,0.276238,0.286145,0.224904,0.171714,0.145837,0.171211,0.151136,0.133023,0.230407,0.358551,0.386118,0.389015,0.34685,0.277152,0.353912
0.167426,0.163992,0.263006,0.458178,0.501858,0.340475,0.196186,0.186136,0.190059,0.147413,0.113834,0.116756,0.149967,0.216429,0.219521,0.162125,0.137813,0.129016,0.152774,0.142848,0.117234,0.177772,0.27291,0.303468,0.319064,0.298028,0.244135,0.304749
0.180412,0.168153,0.244492,0.434441,0.497155,0.334035,0.17318,0.157659,0.17064,0.129065,0.097162,0.099873,0.111304,0.137886,0.142441,0.111493,0.097114,0.090396,0.110787,0.115964,0.090082,0.10264,0.144641,0.165799,0.18499,0.19305,0.179452,0.204987
0.151489,0.151076,0.199888,0.320651,0.371863,0.248878,0.117344,0.09973,0.12006,0.099637,0.081968,0.08575,0.086472,0.086614,0.093721,0.087541,0.073103,0.064394,0.076904,0.084204,0.066655,0.058058,0.066047,0.071469,0.083027,0.097535,0.105822,0.112172
0.102935,0.115939,0.141905,0.179952,0.198023,0.133932,0.064712,0.05422,0.077923,0.080273,0.076248,0.086514,0.093857,0.09231,0.088659,0.086966,0.069014,0.061671,0.066063,0.065547,0.064144,0.063702,0.06944,0.068837,0.07635,0.080004,0.079208,0.076718
0.092078,0.092882,0.09902,0.09845,0.092288,0.073603,0.053964,0.046275,0.067573,0.076097,0.078612,0.10155,0.128019,0.135923,0.117668,0.110697,0.086774,0.088499,0.096304,0.082991,0.083166,0.094066,0.106049,0.105847,0.119766,0.118732,0.11428,0.101563
0.09777,0.092225,0.082021,0.080439,0.092974,0.088657,0.074597,0.059021,0.068829,0.074376,0.079147,0.1111,0.163272,0.190601,0.166217,0.149658,0.116559,0.130219,0.144877,0.118102,0.111941,0.131279,0.150949,0.154154,0.179162,0.175475,0.166055,0.147431
0.089695,0.102221,0.092662,0.09009,0.120662,0.121976,0.103288,0.078307,0.06653,0.064652,0.071502,0.106957,0.17899,0.226385,0.205347,0.175101,0.136803,0.165357,0.18615,0.145782,0.133876,0.158728,0.182011,0.192857,0.228092,0.223948,0.204473,0.180434
0.075209,0.12034,0.120551,0.106334,0.140817,0.146121,0.124603,0.096502,0.064973,0.048352,0.056165,0.103494,0.173036,0.216892,0.208289,0.167601,0.131035,0.171424,0.195142,0.149358,0.137308,0.160249,0.177427,0.195928,0.235682,0.237287,0.205649,0.176542
0.074696,0.139694,0.138098,0.107454,0.134826,0.143002,0.12286,0.101592,0.063434,0.038105,0.052718,0.103552,0.142208,0.161719,0.167157,0.135856,0.103531,0.141105,0.162018,0.132317,0.129794,0.138194,0.139327,0.154676,0.191347,0.212082,0.178983,0.137607
0.082978,0.140378,0.131464,0.093362,0.106066,0.110473,0.096007,0.087197,0.05823,0.037461,0.052613,0.092977,0.109339,0.100022,0.108938,0.107626,0.081926,0.098451,0.109052,0.107258,0.117933,0.119616,0.104412,0.09674,0.125272,0.175528,0.162004,0.103592
0.085865,0.113768,0.10732,0.088703,0.085047,0.073861,0.068732,0.063421,0.048906,0.040453,0.047265,0.07257,0.084655,0.067765,0.07168,0.077281,0.06285,0.064387,0.073293,0.082525,0.090216,0.093194,0.083264,0.059433,0.082948,0.138808,0.151733,0.104415
0.080045,0.074675,0.078878,0.089937,0.076944,0.062947,0.057187,0.045007,0.041467,0.045231,0.044728,0.057363,0.061527,0.05969,0.072555,0.067557,0.047306,0.03793,0.044508,0.054259,0.057977,0.060232,0.05625,0.033879,0.05042,0.093657,0.123868,0.097472
0.072594,0.053908,0.070666,0.087385,0.064152,0.05783,0.047124,0.031489,0.037298,0.049453,0.052522,0.055434,0.048779,0.066734,0.092135,0.080832,0.046087,0.027698,0.025482,0.034156,0.04481,0.042165,0.033464,0.021098,0.030783,0.055516,0.08645,0.077832
0.076504,0.060036,0.073093,0.078942,0.053953,0.04724,0.03335,0.018546,0.030251,0.047618,0.055184,0.050337,0.038027,0.070059,0.104555,0.088621,0.043654,0.022626,0.019546,0.029066,0.039342,0.038922,0.027087,0.018137,0.023064,0.041833,0.059064,0.05253
