-7e-06,-2.1e-05,-0.001051,-0.037728,-0.063726,-0.019437,-0.023369,-0.124219,-0.174249,-0.178003,-0.189846,-0.172264,-0.138111,-0.120887,-0.097208,-0.031522,-0.007143,-0.002387,-0.000794,-0.000444,-0.000506,-0.001854,-0.001144,-0.000489,-0.000317,-6.3e-05,-1.2e-05,-0.000168
8e-06,7e-06,-0.00106,-0.033458,-0.061024,-0.020249,0.001577,0.042362,0.062067,0.124884,0.1396,0.070833,0.097496,0.108633,0.089641,0.031484,0.006504,0.001709,0.000798,0.000352,-4.6e-05,0.000336,5.9e-05,0.001113,0.000412,-3.3e-05,1e-05,-0.00014
0,9e-06,0.000227,0.00938,0.008553,-0.000509,-0.007874,-0.013123,-0.007136,0.010142,0.025154,-0.016407,-0.005241,-0.016,-0.004415,-0.000689,-0.000754,-0.000186,-0.000144,-3.4e-05,-0.000476,-0.000203,-0.000295,-0.000775,-0.000227,2e-05,0,3.1e-05
-7e-06,-1e-06,0.001124,0.037663,0.062834,0.018746,-0.017985,-0.088688,-0.113257,-0.169041,-0.175449,-0.114899,-0.107001,-0.11355,-0.099405,-0.035463,-0.008245,-0.002482,-0.000708,-0.000369,-0.000571,-0.000765,-0.000378,-0.000404,-0.000119,4.6e-05,-1e-06,0.000146
6e-06,9e-06,0.000568,0.018507,0.038716,0.014595,0.013984,0.088789,0.139795,0.128081,0.10997,0.141265,0.110686,0.113689,0.083791,0.02667,0.006363,0.002219,0.00093,0.000362,0.000304,0.000796,0.000539,0.001239,0.000578,1.5e-05,1.3e-05,0.000101
0,-4e-06,-0.000697,-0.027082,-0.038663,-0.008561,0.011916,0.064496,0.098656,0.126623,0.127372,0.096609,0.059862,0.051935,0.05315,0.01799,0.003484,0.001136,0.000104,0.000134,0.00022,1e-05,-0.000358,-0.001038,-0.000504,-3.4e-05,-5e-06,-6.3e-05
-9e-06,-1.3e-05,-0.000959,-0.032832,-0.056873,-0.017479,-0.015505,-0.107983,-0.162208,-0.170531,-0.160123,-0.161555,-0.127731,-0.112436,-0.093771,-0.031601,-0.006961,-0.002538,-0.00092,-0.000395,-0.000223,-0.001052,-0.00073,-0.000118,-9.6e-05,-2.2e-05,-1.1e-05,-0.000122
4e-06,1.2e-05,4.9e-05,0.007051,0.002329,-0.003995,-0.002089,-0.005646,-0.020032,-0.022625,-0.030666,-0.037832,-0.001393,0.023898,0.011476,0.004657,0.001709,0.000502,0.000457,9.3e-05,0.000206,0.00025,0.000258,0.000733,0.000375,2.7e-05,1e-05,-1.7e-05
7e-06,1.5e-05,0.00084,0.03011,0.044599,0.010704,0.013134,0.085009,0.116789,0.132059,0.121897,0.082785,0.075641,0.056677,0.059898,0.021887,0.004425,0.001529,0.000392,0.000262,0.000307,0.001072,0.000641,-5e-04,-0.000181,1.8e-05,6e-06,8.1e-05
-1e-06,-1e-05,0.000464,0.011755,0.025802,0.010992,-0.002393,-0.045404,-0.068671,-0.082092,-0.06126,-0.036632,-0.043809,-0.070455,-0.057301,-0.020256,-0.004217,-0.001519,-0.000618,-0.00021,-0.000188,-4e-05,9.7e-05,-0.000155,-0.000158,-1.5e-05,-2e-06,6.8e-05
3e-06,-5e-06,-0.000387,-0.016426,-0.017283,-0.001057,-0.005368,-0.034027,-0.039941,-0.043833,-0.038533,0.013291,-0.010955,-0.001767,-0.015731,-0.006867,-0.000935,-4.9e-05,0.00028,-5e-05,-0.000133,-0.000625,-0.000172,0.000713,0.000307,-9e-06,3e-06,-1.3e-05
8e-06,1.5e-05,-0.000599,-0.02032,-0.033583,-0.010188,0.006267,0.06547,0.099201,0.127112,0.099857,0.079406,0.057553,0.062904,0.061687,0.023251,0.004334,0.001622,0.000412,0.000224,0.000173,0.000188,0.000104,-5e-04,-2e-04,1.2e-05,2e-06,-5.6e-05
2e-06,7e-06,-7.5e-05,0.000385,-0.008692,-0.006168,-0.005437,-0.029264,-0.042167,-0.044043,-0.031152,-0.057722,-0.026535,-0.024464,-0.017808,-0.00637,-0.001685,-0.001078,-0.000612,-0.00012,-4e-06,0.00028,0.000169,-3.3e-05,-2.2e-05,1.3e-05,0,-2.2e-05
0,-4e-06,0.000426,0.018128,0.024433,0.004636,-0.011481,-0.061321,-0.080013,-0.105893,-0.07589,-0.059392,-0.044678,-0.029285,-0.038188,-0.014783,-0.002185,-0.000562,3.5e-05,-0.000142,-0.000274,-0.000516,-0.000239,0.000319,0.000159,-3e-06,1e-06,2.1e-05
2e-06,0,0.000324,0.009228,0.019858,0.007889,0.012197,0.074706,0.091318,0.087473,0.061496,0.05694,0.040242,0.030649,0.037015,0.015738,0.002943,0.00136,0.000467,0.000135,-6.3e-05,3.3e-05,-0.000107,-0.000347,-0.00014,-1.2e-05,-1e-06,1.9e-05
-1e-06,0,-0.000133,-0.008727,-0.006571,0.001417,0.011417,0.031223,0.02303,0.038202,0.02515,0.020945,0.026317,0.003896,0.011072,0.002993,-0.000258,-0.00053,-0.000384,-2e-06,6.7e-05,0.000373,0.000114,6.4e-05,-2e-06,-7e-06,-3e-06,4e-06
-4e-06,-3e-06,-0.000328,-0.011462,-0.017616,-0.005051,-0.011327,-0.079476,-0.098181,-0.084238,-0.052607,-0.02506,-0.040526,-0.035025,-0.044988,-0.019916,-0.003669,-0.001285,-0.000148,-0.00012,-0.000265,-0.000779,-0.000423,7.7e-05,7.3e-05,5e-06,-6e-06,-1.1e-05
-2e-06,2e-06,-8.6e-05,-0.000151,-0.006497,-0.004395,-0.001797,0.019856,0.042254,0.042895,0.021887,0.017347,-0.000957,0.009906,0.009482,0.007148,0.002144,0.001228,0.000491,0.000109,-8.5e-05,-0.000373,-0.000258,-0.000162,-2e-05,9e-06,-3e-06,-2.3e-05
-1e-06,1e-06,0.00019,0.00796,0.008296,0.001134,0.006932,0.052129,0.063355,0.048407,0.021796,-0.013484,0.025384,0.029504,0.031936,0.012653,0.002042,0.00029,-0.000232,1.3e-05,0.000132,0.000428,8.3e-05,-0.000133,-9.3e-05,-5e-06,3e-06,-1.9e-05
