-0.13507,-0.13768,-0.187455,-0.098369,-0.012403,-0.015186,-0.022953,-0.105001,-0.048068,-0.070109,-0.071642,-0.02253,-0.026895,-0.003466,-3e-04,-0.005593,-0.0093,-0.085628,-0.104608,-0.043619,-0.107295,-0.064567,-0.003874,-0.000617,-2e-04,-0.00121,-0.012943,-0.048951
-0.067969,-0.087527,-0.136086,-0.069589,0.00168,-0.00103,-0.022941,-0.11912,-0.04784,0.006999,-0.006444,-0.015836,-0.02668,-0.003578,-3e-05,-0.003868,-0.007103,-0.090425,-0.105511,-0.017193,-0.103249,-0.072995,-0.00379,-0.000317,-8.8e-05,-0.000783,-0.011793,-0.040096
-0.031576,0.002697,0.046667,0.040026,-0.00844,-0.011994,-0.000731,-0.002861,-0.003696,-0.013323,-0.006554,0.000222,0.000151,0.000176,-6.1e-05,-0.001461,-0.001496,-0.007616,-0.009688,-0.002266,-0.022569,-0.024951,-0.000701,9e-05,-2.6e-05,-0.000348,-0.00292,-7.1e-05
0.073477,0.106825,0.170883,0.092199,0.004002,0.004415,0.023966,0.115528,0.048844,0.028932,0.043777,0.022349,0.029033,0.003916,0.000305,0.00424,0.006558,0.088035,0.111504,0.038573,0.097371,0.057999,0.003508,0.000476,9.6e-05,0.001006,0.012107,0.04403
0.084269,0.052147,0.05639,0.018825,0.011435,0.01495,0.015972,0.078884,0.040227,0.046926,0.039759,0.016212,0.021711,0.002646,0.000351,0.004435,0.007689,0.079233,0.095703,0.01793,0.083674,0.064602,0.003137,0.000234,0.000108,0.000868,0.010115,0.035635
-0.050226,-0.082116,-0.147722,-0.083342,-0.009114,-0.008714,-0.016785,-0.06856,-0.02814,-0.058503,-0.064359,-0.016438,-0.016384,-0.002265,-0.000215,-0.002967,-0.003193,-0.037291,-0.055551,-0.034544,-0.027298,7.1e-05,-0.000847,-0.000497,-0.000128,-0.000837,-0.007257,-0.025367
-0.049229,-0.041065,-0.092053,-0.04533,0.000225,-0.001475,-0.022345,-0.112574,-0.048512,-0.019997,-0.019369,-0.017234,-0.026974,-0.00345,-8.9e-05,-0.002744,-0.006974,-0.093826,-0.111855,-0.013962,-0.064567,-0.041306,-0.002206,-0.000281,-8.3e-05,-0.000512,-0.008607,-0.044276
-0.000985,0.029384,0.089585,0.06527,0.009357,0.006869,-0.002059,-0.022137,-0.008489,0.050486,0.047444,0.003183,-0.003929,-0.000381,0.000174,0.001071,-0.000732,-0.031685,-0.032659,0.008534,-0.047193,-0.049323,-0.001709,0.000257,6.6e-05,0.000244,-0.000256,-0.004298
0.026539,0.042271,0.10046,0.059696,-0.003161,-0.003706,0.017282,0.083723,0.029745,-0.012073,0.001693,0.013214,0.018569,0.002577,4.1e-05,0.001117,0.003267,0.053268,0.06433,0.014947,0.014675,-0.005365,2.3e-05,0.000269,7.2e-05,0.000287,0.005839,0.031699
0.044534,0.012148,-0.018011,-0.029969,0.000233,0.00207,0.017618,0.089626,0.036846,-0.007637,-0.003422,0.010513,0.018949,0.002397,6e-05,0.001226,0.00346,0.073989,0.092395,0.009027,0.061099,0.047541,0.002166,0.00014,4e-05,0.000438,0.00701,0.026583
-0.014741,-0.048145,-0.100667,-0.060878,0.000509,0.000862,-0.005208,-0.013091,0.001585,0.008199,-0.01022,-0.00706,-0.005081,-0.000871,-8.1e-05,-0.000812,-0.000148,0.004262,0.002584,-0.013608,0.019218,0.029123,0.000902,-0.000328,-9e-05,-0.000291,-0.002762,-0.007964
-0.026408,-0.006432,-0.035595,-0.004931,-0.005191,-0.006784,-0.018303,-0.083288,-0.034556,-0.022044,-0.017462,-0.012316,-0.01901,-0.002373,-0.000138,-0.002495,-0.003676,-0.067736,-0.089067,-0.00779,-0.016793,-0.00352,-9.5e-05,-0.00022,-5.4e-05,-0.000617,-0.008848,-0.033345
-0.011588,0.034449,0.085867,0.056584,0.002495,0.000356,-0.006281,-0.042342,-0.019759,0.021514,0.032065,0.001138,-0.007174,-0.00065,0.000119,0.000491,-0.001776,-0.048868,-0.056602,0.005219,-0.025352,-0.023183,-0.000593,0.000242,0.000101,6.1e-05,-0.002378,-0.014042
-0.013571,-0.010505,0.056576,0.03007,0.002581,0.002774,0.008701,0.03504,0.014357,0.019815,0.012227,0.008174,0.010543,0.001384,7.9e-05,0.001818,0.00172,0.022471,0.030277,0.004553,-0.023718,-0.031202,-0.001523,0.000136,3.7e-05,3e-04,0.004688,0.020993
0.017317,-0.020696,-0.054077,-0.046586,-0.002239,0.000152,0.012656,0.06364,0.022576,-0.042515,-0.039344,0.003563,0.011958,0.001393,-6.3e-05,0.000418,0.002278,0.059138,0.071233,-0.002055,0.003731,-0.001008,-0.000409,-9.2e-05,-6.3e-05,0.000303,0.006949,0.024886
0.020656,0.000619,-0.070733,-0.049415,0.001699,0.001193,0.003162,0.020942,0.009954,0.000574,-0.003595,-0.003647,0.000118,-0.000169,-3.7e-05,0.000242,0.001021,0.025974,0.035032,-0.002486,0.019178,0.020144,0.001035,-1.6e-05,-1.9e-05,0.00013,0.001811,0.00042
-0.004061,0.020003,0.007432,0.020964,0.003722,0.002347,-0.012025,-0.050401,-0.014519,0.027697,0.020234,-0.004776,-0.009328,-0.001345,-0.000102,-0.000966,-0.001335,-0.03397,-0.043029,0.005684,0.026271,0.025195,0.001276,-0.000123,-4.8e-05,-0.000409,-0.006654,-0.022646
-0.012575,0.025591,0.070562,0.049829,-0.001521,-0.00142,-0.010442,-0.052647,-0.022891,-0.011259,0.007447,0.001851,-0.006364,-0.000634,-7.8e-05,-0.001978,-0.002797,-0.048506,-0.064263,0.00107,0.010488,0.013655,0.000756,4e-05,1.3e-05,-0.000381,-0.006387,-0.014986
-0.031639,-0.032074,0.018444,0.000325,-0.003304,-0.004384,0.002862,0.007004,0.001185,0.006123,0.007012,0.003507,0.003238,0.000608,3.2e-05,0.000122,-0.000796,-0.002429,-0.001975,-0.007223,-0.032575,-0.027221,-0.001429,0.000114,8.4e-05,0.000137,0.002003,0.010962
