0.000114,3.9e-05,1e-06,6.5e-05,5.6e-05,1.7e-05,1.6e-05,3.7e-05,6.5e-05,6.3e-05,2e-05,7.4e-05,6.5e-05,3.7e-05,0.000108,1.8e-05,0.000119,3.2e-05,8.7e-05,6.3e-05,3.5e-05,4.9e-05,0.000126,9.8e-05,2.4e-05,5.4e-05,2.3e-05,1.9e-05,0.000103,6.9e-05,0.000112,4.7e-05,4e-06,1.6e-05,9.3e-05,5.6e-05,6e-06,1e-05,1.1e-05,3.5e-05,2.5e-05,3.1e-05,9.5e-05,9.5e-05,7.6e-05,7.1e-05,8.7e-05,5e-05,0.000106,7.6e-05,3.9e-05,4.6e-05,0.000106,2.5e-05,4.3e-05,6e-05,4e-06,3.2e-05,6.1e-05,4.2e-05,5.6e-05,2.1e-05,3.5e-05,2.1e-05,4.5e-05,4e-05,1.6e-05,6.3e-05,6.5e-05,5e-05,4.1e-05,1e-06,3e-05,1.9e-05,2.5e-05,3.5e-05,4e-06,7.2e-05,3.8e-05,3.4e-05,9e-06,2.8e-05,1e-06,6e-06,1.9e-05,1.8e-05,1.6e-05,3e-06,2.2e-05,3.7e-05,2.3e-05,3e-05,1e-05,6e-05,2.8e-05,5.5e-05,1.1e-05,1.3e-05,2e-06,1.5e-05,5.8e-05,5.3e-05,4.4e-05,4.6e-05,6e-06,2.1e-05,1e-06,1e-05,5e-06,1.6e-05,1.4e-05,1.1e-05,8e-06,7e-06,4e-05,3.5e-05,5e-06,3e-05,3.1e-05,7e-06,1.1e-05
0.000304,0.000133,7.4e-05,0.000102,0.00014,5.5e-05,4.9e-05,0.000117,0.000202,0.000131,1.9e-05,0.000129,9.6e-05,0.000177,0.000181,0.000112,2e-04,9.1e-05,0.000159,0.000114,7.3e-05,7.4e-05,0.00025,0.000255,8.3e-05,9.1e-05,5.6e-05,8.7e-05,0.000171,0.000114,0.000249,0.000135,2.5e-05,0.000112,0.00025,0.000144,6.3e-05,6.7e-05,4.9e-05,1.7e-05,0.000113,0.000158,0.000181,0.000243,0.000176,0.000143,0.00017,2.6e-05,0.000158,0.000108,0.000149,2.6e-05,0.000196,3.2e-05,0.000162,0.000172,7.5e-05,4.5e-05,9.4e-05,7.9e-05,9.8e-05,7e-06,0.000119,7.9e-05,9.9e-05,3.6e-05,1.3e-05,0.000121,1e-04,5.8e-05,7.4e-05,1.3e-05,3.3e-05,8.5e-05,7e-06,8.2e-05,3.2e-05,0.000133,0.000133,9.9e-05,3e-05,8.7e-05,4.7e-05,3.6e-05,6.9e-05,6.8e-05,8.3e-05,5.1e-05,6.4e-05,4.6e-05,7.4e-05,3.5e-05,0.000109,0.000126,5e-05,9.1e-05,5.8e-05,3.4e-05,5.4e-05,3.6e-05,0.000113,0.000118,0.000119,0.000114,3.5e-05,8.4e-05,3.2e-05,3.6e-05,1.3e-05,3.6e-05,9e-06,2e-05,1.3e-05,2.8e-05,7.2e-05,7.8e-05,3.7e-05,4.5e-05,7.6e-05,4.5e-05,2.7e-05
0.000418,8.6e-05,3.2e-05,0.000115,0.000148,6e-05,0.000161,0.000202,0.000411,4.9e-05,0.000162,0.000338,0.000265,0.000396,0.000331,0.000111,0.000288,3.4e-05,0.000242,4.7e-05,9.4e-05,7.1e-05,0.000313,0.000469,0.000353,0.000245,0.000118,0.000134,0.00035,0.000159,0.000366,0.000141,2.5e-05,0.000231,0.000469,0.000269,0.000105,0.00016,0.000106,8e-05,0.000216,0.00016,0.00021,0.000338,0.000192,0.000187,0.000102,7.4e-05,0.000223,0.00013,0.000347,0.000161,0.00023,0.000137,0.000189,0.000236,0.00018,5e-05,0.000221,0.000116,0.000192,8.2e-05,0.000214,0.00011,0.000176,8.8e-05,0.000111,0.000105,0.000198,0.000108,4.8e-05,8.9e-05,3.1e-05,8.5e-05,5.9e-05,7e-05,9.3e-05,0.000177,0.00019,0.000151,0.000143,0.000117,3.2e-05,3.8e-05,0.000149,1.9e-05,0.000149,7.5e-05,2.5e-05,9e-05,1e-04,5.3e-05,7e-05,0.000148,8e-05,0.000155,0.000101,4e-05,8.1e-05,9.7e-05,0.000135,0.000125,9.2e-05,1.4e-05,0.000109,0.000118,1.2e-05,7.2e-05,5.1e-05,1.8e-05,2.6e-05,3.1e-05,1.6e-05,6e-05,0.000113,8.1e-05,0.000103,5.6e-05,0.00013,7e-05,4e-06
0.000542,0.000387,0.000392,0.000326,0.000117,0.000237,0.000362,0.000305,0.000484,0.000557,0.000266,0.000824,0.000599,0.000848,0.000652,0.000654,0.000529,4e-05,0.000284,0.000401,0.000379,0.000176,0.00015,0.000198,0.000112,0.00022,0.000151,0.000347,0.000605,2e-04,0.000773,0.000696,0.000254,0.000366,0.000173,0.000196,0.00056,0.000393,0.000208,0.000132,0.000425,0.000361,0.000262,0.000601,0.000345,0.000287,0.000257,0.000381,3e-04,0.000168,0.00028,0.000466,0.000492,0.000243,0.000217,0.000186,0.000499,0.000519,0.000493,0.000379,0.000564,0.000359,0.000374,0.000374,0.000462,0.000219,0.000377,0.000358,0.000234,0.000219,0.000109,0.000161,0.000238,0.000146,0.000166,5.8e-05,0.000162,0.000298,0.000228,0.000192,0.000151,0.000325,0.000217,0.000233,0.000128,0.000202,1e-04,0.000124,7.6e-05,9.2e-05,0.000135,0.000209,0.000212,0.000103,0.000314,0.000268,0.000137,0.00012,6.6e-05,6.5e-05,0.000244,0.000451,0.000211,0.000141,0.000216,0.000111,0.000113,0.000154,0.00011,0.000149,6.1e-05,2.7e-05,9e-05,9.1e-05,0.000226,0.000208,0.000135,0.000204,0.000107,4.7e-05,5e-05
0.000236,0.000106,0.000329,0.000381,0.000456,0.000744,0.000333,0.000574,9.5e-05,0.00049,0.000413,0.000714,0.001012,0.000936,0.001038,0.000163,4.5e-05,0.000426,0.000591,0.000735,0.000522,0.000434,6.6e-05,0.000411,6.4e-05,0.000498,0.00072,0.000996,0.000205,0.000215,0.000694,0.000731,0.00043,0.000418,0.000786,0.000333,0.000489,0.000506,2.2e-05,0.000286,0.000212,0.000501,0.000786,0.000743,0.00062,0.000903,0.000845,0.000394,0.000386,0.000425,0.000533,0.000184,0.000392,0.000466,0.000771,0.00055,0.000651,0.000359,0.000353,0.000423,0.000108,0.000394,0.000293,0.000156,0.000471,0.00061,0.000204,0.000275,0.000255,6e-05,0.000159,0.000153,0.000159,0.000199,0.000188,0.000385,0.000398,0.000647,0.000738,0.000548,0.000414,0.00016,0.000227,0.000251,0.000136,0.000156,0.000363,0.000373,0.000152,3.9e-05,0.000227,0.000124,0.000579,0.000473,0.000552,0.00029,0.00029,0.00025,0.00015,3.5e-05,0.00029,0.00034,0.00011,0.000173,0.000385,0.000307,0.000359,0.000285,9.6e-05,0.000213,0.000121,5.4e-05,9.4e-05,0.00012,0.000215,0.000234,0.000175,0.000197,0.000269,0.000169,0.000128
0.000392,0.000422,0.000459,0.000507,0.000669,0.000536,0.00034,0.000337,0.000214,0.000271,0.000275,0.000652,0.000407,0.000422,0.000695,0.000701,0.000534,0.000342,0.000449,0.000178,0.00041,0.000328,0.000446,0.000903,0.000497,0.000376,0.000628,0.000436,0.00054,0.00021,0.00049,0.000276,0.000218,0.00048,0.000555,0.000256,0.00066,0.000509,0.000395,0.000107,0.000264,0.000287,0.000318,0.000113,0.000388,0.000674,0.000575,0.000378,0.000477,0.000551,6.1e-05,0.000548,7.1e-05,5.5e-05,0.000502,0.000366,9.9e-05,6.9e-05,0.00021,6.4e-05,0.000387,0.000224,4.8e-05,0.00013,0.000257,0.000136,0.00028,0.000243,0.000266,0.00023,8.1e-05,0.000153,0.000275,0.000113,0.000431,0.000311,0.000188,0.000324,0.000427,7.6e-05,0.000126,0.000262,0.000188,0.000168,0.000228,0.00022,0.000462,6.9e-05,3.8e-05,0.000102,4e-06,0.000187,0.000377,0.000368,0.000139,0.00013,0.000271,0.000273,0.00021,0.000212,0.000421,0.000293,0.000142,0.000171,0.000316,9.6e-05,0.000185,8.6e-05,0.000112,0.000154,8.9e-05,2.4e-05,6.3e-05,0.00018,5e-05,9.5e-05,0.000109,7.2e-05,0.000109,0.000105,5.9e-05
2.9e-05,0.000325,0.000205,6.3e-05,0.000615,0.00049,0.000159,0.000382,0.00023,0.000204,0.000238,0.000477,0.000259,0.000185,0.000503,0.000332,0.000857,0.000293,0.000409,0.000224,0.000387,0.000124,4.4e-05,0.00063,0.000217,2e-04,0.000749,0.000646,0.000508,0.00039,0.000287,0.000352,0.000321,0.00045,0.000429,0.000208,0.000603,0.00037,0.000106,2e-04,0.000511,0.000701,0.000182,0.000127,0.000274,0.000839,0.000696,0.000467,0.000399,0.000182,0.00028,0.00037,0.000189,0.000423,0.000141,0.000309,0.000207,0.00041,0.000266,5.1e-05,0.000349,0.000242,0.000212,5.7e-05,4e-05,0.000226,0.000155,0.000298,0.000297,0.000406,0.000296,0.000128,0.000278,0.000329,0.000401,0.000358,0.000213,0.000345,0.000214,0.000164,0.000266,0.000246,9.6e-05,0.00018,0.000162,3.8e-05,0.00041,0.000219,0.000104,0.00016,0.000289,7.6e-05,0.000313,8.4e-05,9.7e-05,9.1e-05,9.4e-05,3.1e-05,0.000144,0.000136,0.00029,0.000232,0.00029,4.4e-05,0.000199,6.5e-05,0.000152,2e-04,5.8e-05,0.000136,0.000167,0.000115,0.000129,8e-05,0.000141,5.8e-05,0.000163,6.8e-05,2.9e-05,0.000124,3.1e-05
0.000507,0.000254,0.000485,0.000778,0.000155,0.000141,0.000485,0.00088,0.000806,0.000265,0.000395,0.000234,0.000184,0.000224,0.000569,0.000855,0.001084,0.0011,0.000192,5e-04,0.00074,9.2e-05,0.000227,0.000686,0.000672,0.000905,0.00056,0.000432,0.001186,0.001123,0.000527,0.000675,0.00041,0.000429,0.001112,0.001248,0.000209,0.000285,0.000229,0.000461,0.000478,0.000374,0.000917,0.000347,0.000329,0.000678,0.001385,0.000944,0.000158,0.00037,0.000528,0.000821,0.000644,0.000441,0.000461,0.000503,0.000218,0.00048,0.000331,0.000416,0.000244,0.000188,0.000342,0.000444,0.000245,0.000647,0.00089,0.00035,0.000207,0.00046,0.000527,0.000502,0.00064,0.000438,0.000591,0.000561,0.000286,0.000205,0.000401,0.000315,0.00028,0.000156,0.000207,0.000122,7.6e-05,0.000124,0.000391,0.000407,0.000185,0.000158,0.000551,0.000316,0.000205,0.000305,0.000251,1.6e-05,0.000237,0.000266,0.000215,0.000133,0.000243,0.000336,0.000388,0.00029,0.000386,0.000289,0.000167,7.8e-05,0.000152,6.3e-05,0.000223,4.9e-05,0.000163,0.000186,0.000179,0.00013,0.000228,9.3e-05,1.3e-05,0.000151,0.000182
0.000347,0.000332,0.00055,0.001167,6.8e-05,0.000492,0.000793,0.000717,0.000563,0.00075,0.000519,7e-05,0.000402,0.000288,0.000725,0.001545,0.002431,0.001993,0.001424,0.001465,0.001616,0.001169,0.000856,0.001057,0.000683,0.001212,0.001082,0.000671,0.000801,0.000536,0.000599,0.00063,9e-05,0.000659,0.000916,0.000529,0.000761,0.000951,0.000703,0.001311,0.001084,0.000864,0.001255,0.00084,0.000692,0.000708,0.001096,0.00126,0.001203,0.000591,5e-04,0.000657,0.001107,0.001325,0.000875,0.000589,0.000245,0.000498,0.000776,0.000869,0.000182,0.000302,0.000443,0.000717,0.001151,0.000776,0.000775,0.001612,0.001503,0.00066,0.000217,0.000219,0.000555,0.000438,0.000688,0.00067,0.000553,9.8e-05,0.000245,0.000136,0.000563,0.000559,0.000258,0.000209,0.000343,0.00018,0.000428,0.000631,0.000156,0.000217,0.000787,0.000389,0.000301,0.000129,0.000104,9.2e-05,0.000279,0.000128,0.000384,0.00033,0.000148,0.000155,0.000136,0.000276,0.000302,0.00042,0.000233,0.000149,9.3e-05,0.000214,0.000363,0.000236,0.000229,0.000117,0.000119,0.000152,0.000249,0.000177,9.2e-05,0.000149,0.000201
0.000286,0.000783,0.000993,0.000875,0.001611,0.000516,0.000675,0.000126,0.000866,0.001415,0.001954,0.001268,0.000718,0.001243,0.000502,0.001271,0.001095,0.000263,0.000549,0.000641,0.001007,0.001006,0.000178,0.000987,0.000818,0.001161,0.000677,0.000245,0.000791,0.000535,0.000743,0.001156,0.000716,0.000525,0.00047,0.00026,0.000549,0.000851,0.000863,0.000727,0.000514,0.000656,7.9e-05,0.001289,0.000409,0.001545,0.000772,0.000621,0.000974,0.00042,0.000224,0.000827,0.000398,0.00064,0.000258,0.000282,0.000512,0.000166,0.000334,0.000398,0.000621,0.000635,0.000321,0.00024,0.000994,0.000909,0.000462,0.00162,0.000166,0.00045,7.1e-05,0.000491,0.000252,0.000442,0.000242,0.000153,0.000548,0.000474,0.000409,7.8e-05,0.000811,0.000357,0.000359,0.000598,0.000153,0.000172,0.000418,0.000235,0.000455,0.00033,0.000434,0.000474,0.000267,0.000139,8.7e-05,0.000123,0.000305,0.000261,0.000272,0.000104,0.000159,7.7e-05,0.000256,0.000264,0.000218,0.000112,8.5e-05,0.000119,0.000112,0.000214,0.000201,0.000218,0.000294,0.000236,6.6e-05,0.000264,1.6e-05,0.00015,0.000154,0.000161,0.000131
0.000907,0.000741,0.000236,0.00113,0.002131,0.002035,0.000963,9.3e-05,0.000794,0.001043,0.000811,0.000823,0.001071,0.001774,0.001852,0.000501,0.001218,0.001549,0.00129,0.001383,0.001759,0.000664,0.000477,0.000535,0.000607,0.001522,0.001072,0.000524,0.000798,0.000897,0.000351,0.000477,0.000371,0.000539,0.000751,0.000384,0.000405,0.000138,0.000552,0.000966,0.001245,0.001038,0.000168,0.001304,0.00133,0.00161,0.000241,0.000637,0.000965,0.000655,0.000554,0.000733,0.000533,0.000515,0.000812,0.000634,0.000461,0.000487,0.000284,0.000386,0.000413,0.000431,0.000437,0.000257,0.000795,0.001016,0.000773,0.000777,0.001239,0.000802,0.000554,0.000542,0.000682,0.000251,0.000269,0.000206,0.000681,0.000335,0.000271,0.000287,0.000699,0.000539,0.00044,0.000325,0.000561,0.000459,0.000387,0.00041,0.000605,0.000394,0.000372,0.000746,0.00054,0.000395,0.000227,0.000102,0.000383,0.000226,0.000326,0.000375,0.000313,0.000364,5.8e-05,0.000369,0.000343,0.000241,7.5e-05,7.5e-05,0.000104,0.00021,0.000329,0.000186,0.000269,8.5e-05,0.000131,0.000228,0.000211,6.4e-05,0.000191,5.4e-05,0.000129
0.000481,0.000225,0.000257,0.000518,0.000854,0.000501,0.000298,0.000433,0.000495,0.000566,0.00076,0.000311,0.000927,0.000369,0.00068,0.000715,0.000624,0.000533,0.000377,0.000316,0.000561,0.000113,0.000235,0.000578,0.000151,0.000627,0.000422,0.000278,0.000635,0.000324,0.000327,0.000281,0.000182,0.000102,0.000511,0.000435,0.000288,0.000299,0.000544,0.000215,0.000837,0.000494,0.000676,0.000585,0.000498,0.000278,0.000556,0.000855,0.000712,0.000212,0.000426,0.000323,0.000215,0.000478,0.00076,0.000459,0.000309,0.000345,0.000383,0.000334,0.00015,0.000595,0.000613,0.000299,0.000236,0.000243,0.000292,4e-04,0.000436,0.00011,0.000212,0.000303,0.000361,0.000479,0.000407,0.000392,6e-04,0.000441,0.000243,6.1e-05,0.000438,3e-04,0.000178,0.000188,0.000238,0.000148,0.00025,0.000376,5.8e-05,9.8e-05,0.000408,0.000523,0.000116,0.000211,2.4e-05,1.5e-05,0.000409,0.000274,0.000255,0.000226,9.8e-05,0.000187,0.000263,0.000178,7.9e-05,9.5e-05,8.2e-05,4.4e-05,2.9e-05,0.000141,0.000106,8.4e-05,8e-05,0.00016,0.000195,3.1e-05,5.6e-05,0.000127,0.000125,9.9e-05,9.4e-05
0.000307,8.3e-05,0.00017,0.000347,0.000325,0.000117,2.7e-05,2.9e-05,0.000287,0.000325,0.000412,0.000189,0.000477,0.000246,0.000366,0.000117,0.000456,0.000347,0.000162,0.000265,0.000323,0.000142,0.00015,0.000309,0.000159,0.000103,8.4e-05,7e-05,0.000436,7.7e-05,6.1e-05,0.000177,0.000108,8.1e-05,6e-05,5.6e-05,0.000212,0.000263,0.000145,0.000263,0.000364,0.000123,0.00013,0.000228,0.00013,0.000161,0.000293,0.000244,4.2e-05,0.000248,0.00011,0.000266,0.000152,0.00034,0.000259,8.8e-05,7.1e-05,0.000318,6.3e-05,0.000103,0.000134,0.000361,0.000173,9.5e-05,6.3e-05,0.000139,0.00022,0.000241,0.000222,2.9e-05,1.8e-05,0.000147,6.3e-05,0.000178,0.00014,9.8e-05,3.8e-05,0.000148,3.2e-05,0.000131,0.000165,4.8e-05,0.000101,9.9e-05,0.000119,8.3e-05,0.000231,2.1e-05,0.000157,2.7e-05,0.00027,0.000127,8.2e-05,4.9e-05,7.7e-05,6.7e-05,0.00025,8.2e-05,0.000117,6.3e-05,0.000116,3.8e-05,0.000116,4.2e-05,6.4e-05,4.3e-05,1.4e-05,2.7e-05,1e-05,7e-05,5.5e-05,4.1e-05,5.2e-05,0.000109,4.7e-05,3e-05,2.1e-05,3.6e-05,3.8e-05,3.1e-05,2.2e-05
0.000144,0.000115,0.000173,0.000279,0.00011,0.000147,0.000203,0.000118,0.000457,0.000358,0.000478,3e-04,0.00035,0.000168,0.000117,0.000117,0.000341,0.00045,0.000208,5.7e-05,0.00039,0.000146,8.3e-05,8.6e-05,0.000142,0.000123,8.5e-05,1e-05,0.000341,8.3e-05,0.000152,0.000256,0.000133,0.000103,0.000181,0.000111,0.000158,0.000109,6e-05,0.000199,0.000164,0.000205,0.000151,0.000255,0.000317,0.000209,0.000322,0.000358,0.000129,0.000175,0.00011,0.000236,0.000113,0.000334,0.000151,0.000221,3.3e-05,0.000273,0.000105,0.000208,0.000267,0.000194,0.000121,9.3e-05,3.5e-05,5.1e-05,2e-05,0.000127,0.000211,1.2e-05,9.2e-05,6.4e-05,0.000116,0.000154,9.1e-05,0.000142,0.000126,5.6e-05,6.6e-05,0.000165,0.000145,5.6e-05,3.3e-05,0.000127,7.3e-05,4e-05,0.000207,8.2e-05,0.000118,2.8e-05,0.00022,6.9e-05,6.1e-05,0.000171,7.8e-05,4.7e-05,0.000147,0.000104,9.5e-05,4e-05,0.00011,5.7e-05,0.000125,4.5e-05,1.5e-05,4.4e-05,3.3e-05,5.3e-05,7e-06,6.8e-05,2.5e-05,1e-05,2.9e-05,8e-05,9.8e-05,6.7e-05,3.2e-05,2.5e-05,2.9e-05,3.5e-05,2.3e-05
0.000467,0.000439,0.000471,0.000478,0.000253,0.000268,0.000288,0.000148,0.000582,0.000205,0.000689,0.000333,0.000569,0.000534,0.000211,0.000221,0.000566,0.000508,0.000195,0.000405,0.000665,0.000172,0.000227,2e-04,0.000644,0.000315,0.000112,9.8e-05,0.000372,0.00035,0.000315,0.000353,0.00022,0.000124,0.000276,0.000206,0.000338,8.5e-05,4.6e-05,0.000576,0.00014,0.000214,0.000383,5.3e-05,0.000459,0.000285,0.000198,0.000267,0.000478,0.000295,0.000378,0.000225,0.000142,0.000283,0.000378,9e-05,0.00018,0.000335,0.000252,0.000123,0.000324,0.000263,0.000303,0.00014,0.000114,4.5e-05,0.000385,0.000239,0.000332,5.6e-05,8.3e-05,0.000225,0.000274,6.6e-05,0.000205,0.000373,0.000245,0.000163,5.5e-05,0.000247,6.3e-05,0.000168,0.000148,1.6e-05,1e-04,7e-05,0.000218,0.000247,9.8e-05,0.000128,0.000153,0.000155,2.8e-05,0.000307,0.000142,8.3e-05,0.000197,0.00013,0.000127,6.5e-05,0.000208,1.3e-05,0.00024,0.000185,4.6e-05,8.3e-05,4e-05,5.8e-05,6.3e-05,0.000104,0.000149,0.000164,7.1e-05,9.6e-05,7.8e-05,7.1e-05,7.7e-05,3.1e-05,1e-04,5.9e-05,5.5e-05
0.000563,0.000647,0.000495,0.00042,0.000835,0.000671,0.000781,0.001072,0.000207,0.000747,0.000748,0.001314,0.001402,0.000392,0.000521,0.00024,0.000528,0.001062,0.001069,0.000942,0.00125,0.00113,0.000543,0.00025,0.001053,0.001019,0.000398,0.000112,0.000438,0.000874,0.000607,0.000314,0.000481,0.000196,0.000196,0.000782,0.00102,0.000691,0.000549,0.001043,0.000928,0.000635,0.000392,5.4e-05,0.000603,0.00059,0.000404,0.000511,0.001053,0.001019,0.001064,0.000718,0.000506,0.000455,0.000795,0.000714,0.000188,0.000462,0.000328,0.000364,0.000698,0.000857,0.000673,0.000278,0.000458,0.000209,0.000621,0.000907,0.000529,0.000191,0.000134,0.000156,0.000655,0.000647,0.00061,0.000679,0.000384,0.000128,0.000171,0.000376,0.000461,0.000495,0.000532,0.000369,0.000266,0.000128,0.000299,0.000743,0.000651,0.000185,4.6e-05,0.000187,0.000122,0.000269,0.000359,0.000253,0.000382,0.000469,0.000337,0.000286,0.000277,0.000318,0.000473,0.000581,0.000456,0.000233,9.9e-05,5e-05,0.000142,0.000212,0.000252,5.7e-05,6.7e-05,0.000121,0.000213,0.000187,0.000224,0.000182,0.000229,0.000153,1.4e-05
0.000967,0.001141,0.00061,0.000614,0.000777,0.000626,0.000324,0.000938,0.001284,0.001255,0.002015,0.001983,0.001114,0.001418,0.000706,0.000362,0.00044,0.000656,0.000694,0.000969,0.000995,0.000751,0.000723,0.000596,0.000949,0.001088,0.001062,7e-04,0.000793,0.000916,0.000476,0.000361,0.000494,0.000339,0.000127,0.00089,0.000642,0.000499,0.000422,0.00103,0.000684,8e-05,0.000553,0.00054,0.000737,0.000552,0.000602,0.000797,0.000938,0.000806,0.000931,0.000907,0.000485,0.000197,0.000502,0.00051,0.000434,0.000588,0.000338,0.000371,0.000615,0.000545,0.000514,0.000303,0.000436,0.000272,0.000597,0.000585,0.000573,0.000699,0.000499,0.000293,0.000465,0.000578,0.000253,0.00039,0.00052,0.000421,0.000316,0.000582,0.000637,0.000543,0.000331,8.4e-05,0.000107,6.9e-05,0.000355,0.00077,0.00062,0.000386,0.000257,0.000205,5.6e-05,0.000182,0.000168,9.1e-05,0.000216,0.000409,0.000277,0.000182,0.000305,0.000334,0.000115,0.000286,1.8e-05,1.4e-05,5.8e-05,0.000115,0.000127,5.2e-05,7.3e-05,0.000135,3.5e-05,9.9e-05,0.000112,0.000121,0.000138,0.000118,7.3e-05,3.9e-05,6.2e-05
0.000245,0.000334,0.000194,0.000179,0.000605,0.000415,0.000333,0.000507,0.000416,0.000267,0.000956,0.000364,0.000194,0.000565,0.00021,0.000474,0.000432,0.000406,0.000336,0.00045,0.000358,7.5e-05,0.00029,0.000248,0.000541,3e-04,0.000385,2.7e-05,0.000285,0.000392,0.000304,0.00046,0.000219,0.00019,0.000184,0.00051,0.000214,0.000386,0.000272,0.000404,0.000225,0.000225,0.00055,0.00014,0.000509,0.000367,0.000112,0.000374,0.000409,2.8e-05,0.000558,0.000237,0.000237,0.000101,0.000362,7.6e-05,0.00012,0.000207,0.000176,0.000109,0.000254,9.9e-05,0.000241,0.000178,0.000177,0.000202,0.000278,0.000276,0.000139,0.000284,3.2e-05,3.9e-05,0.000342,0.00016,3.7e-05,0.000186,0.000173,6.9e-05,0.000126,0.000242,5.8e-05,0.000321,0.000136,4.2e-05,0.000102,8.9e-05,2e-04,0.000341,9.8e-05,4.4e-05,0.000153,1.3e-05,8.6e-05,7.6e-05,0.000112,4.5e-05,0.000137,0.000121,8.4e-05,9.2e-05,5.6e-05,0.00011,0.000236,2e-05,6.7e-05,5.2e-05,1.8e-05,0.000106,2.7e-05,3.8e-05,5.4e-05,4.8e-05,5e-05,4.5e-05,5.3e-05,3.7e-05,5.4e-05,2.3e-05,5.2e-05,3.3e-05,4.1e-05
0.000181,0.000342,0.00018,0.000133,0.000547,0.000124,3.8e-05,1.1e-05,0.000174,0.000206,3e-04,0.000514,0.000314,0.000159,4.3e-05,0.000367,0.000272,0.000129,9.9e-05,0.00034,0.000228,0.000161,0.000118,4.8e-05,0.000172,0.000256,4.2e-05,9.8e-05,0.000195,6e-05,0.000138,0.000155,0.00017,0.000183,0.000322,0.000346,0.000176,0.000187,0.000212,0.000194,0.000111,0.000216,0.000234,0.000254,0.000418,7.7e-05,0.000129,0.000145,0.000211,0.000125,0.000139,0.000165,0.000144,0.000121,7.8e-05,6.5e-05,5.9e-05,8.1e-05,3.9e-05,9.2e-05,0.000187,7.8e-05,0.00011,0.000104,0.000108,0.000133,0.000279,8.7e-05,0.000169,0.000117,5.4e-05,4.5e-05,8.5e-05,0.000161,5.9e-05,0.000127,2.3e-05,9.6e-05,7.8e-05,0.000155,0.000179,0.000188,0.000132,5.2e-05,0.000107,4.8e-05,3.3e-05,0.000188,0.000104,6e-05,7e-05,9.2e-05,5.6e-05,0.000104,1.5e-05,2.2e-05,6.5e-05,0.000131,3.8e-05,6.3e-05,6.3e-05,5e-05,0.000164,9.8e-05,7e-05,2.2e-05,2.5e-05,4.7e-05,1.9e-05,4.1e-05,3e-05,1.8e-05,7e-06,1.9e-05,5.4e-05,4.3e-05,3.1e-05,2.1e-05,1e-05,1.5e-05,1.8e-05
0.000197,0.000333,0.000236,0.000163,0.000408,0.000259,0.000189,0.000222,0.00015,4.7e-05,0.000181,0.000308,0.000167,0.000219,3.7e-05,0.000224,0.000169,5.5e-05,0.000172,1.2e-05,0.00017,0.000228,0.000153,0.000102,0.000286,0.000247,0.000105,7.5e-05,0.000239,0.000116,0.00016,0.000239,0.000197,8e-05,0.000118,0.000143,6.6e-05,0.000198,0.000137,0.000117,6.3e-05,9.4e-05,0.000138,0.000118,0.000114,0.000183,4.5e-05,1.9e-05,0.000223,0.000116,0.000106,0.000193,0.000163,9.7e-05,0.000205,0.000119,6.5e-05,0.000164,0.000138,6.3e-05,0.000168,0.000124,0.000124,6.5e-05,6.3e-05,0.000154,0.000334,7.4e-05,3.4e-05,5.6e-05,3.6e-05,5e-06,6.9e-05,9.1e-05,2.2e-05,0.000147,3.8e-05,3.7e-05,6.2e-05,0.000134,0.000132,0.000167,8e-05,3.2e-05,7.1e-05,5.6e-05,0.00014,0.000226,1e-04,3.6e-05,2.9e-05,1e-05,6e-05,6.7e-05,6.6e-05,8.7e-05,5.1e-05,4.4e-05,5e-06,2.8e-05,3.7e-05,8e-05,5.2e-05,2.5e-05,0.000118,0.000105,7.2e-05,1.8e-05,2.5e-05,6.1e-05,3.5e-05,9e-06,1.6e-05,1.9e-05,4.8e-05,4.7e-05,1.1e-05,1.8e-05,2.2e-05,1.7e-05,1.3e-05
0.000139,0.000159,0.000161,0.000174,0.000231,0.000152,0.000155,8.1e-05,0.000145,0.000103,0.00021,9.9e-05,0.000184,0.000213,0.000117,0.000244,0.000113,0.000107,0.000123,3.5e-05,0.000141,4e-05,0.000245,7.3e-05,0.000173,0.000124,8.8e-05,7.1e-05,0.000235,6.3e-05,0.000138,9e-06,2.8e-05,0.000105,0.000103,0.000159,6.5e-05,0.000246,8.6e-05,9.4e-05,9.8e-05,6.1e-05,0.000139,5e-05,0.000101,0.000141,8.6e-05,7.2e-05,0.000149,0.000102,0.00017,3.6e-05,7.9e-05,3.1e-05,0.000189,6.3e-05,3.3e-05,9.8e-05,0.000102,3.3e-05,8.3e-05,9.3e-05,3.2e-05,5.4e-05,2.5e-05,7.3e-05,0.000147,9.1e-05,3.8e-05,3.7e-05,6.9e-05,5.6e-05,4.8e-05,8.8e-05,3e-05,0.000109,4.6e-05,4.2e-05,2.3e-05,0.000154,0.00012,0.000109,9.6e-05,9e-05,3.7e-05,2.3e-05,8.9e-05,0.000111,3e-06,2.9e-05,3.2e-05,5.5e-05,4.7e-05,6.3e-05,6e-05,2.7e-05,1.1e-05,2.6e-05,2.3e-05,9e-06,3.7e-05,4.8e-05,5.8e-05,4e-05,7.5e-05,8.1e-05,3.4e-05,2.3e-05,1.7e-05,4e-05,2.8e-05,2e-05,3.4e-05,5e-06,2.8e-05,6e-06,1.9e-05,3.3e-05,9e-06,9e-06,2.1e-05
0.000119,5.1e-05,4.7e-05,0.000168,0.000188,3e-05,0.000143,0.000103,0.000165,4.3e-05,0.00016,0.000163,9e-05,0.000146,9.2e-05,9e-05,5.6e-05,0.000182,0.000104,3.6e-05,9.4e-05,3.8e-05,1e-04,0.000178,0.000206,0.000196,8.9e-05,7.2e-05,0.000206,0.000128,5.8e-05,4.5e-05,9e-06,1.9e-05,4e-05,0.000138,6.6e-05,0.000118,9.4e-05,5e-05,9.6e-05,0.000105,5.4e-05,4.2e-05,8.3e-05,8.9e-05,1.9e-05,3.5e-05,5.9e-05,1.8e-05,0.000113,6.3e-05,8.8e-05,4.9e-05,3.9e-05,5.6e-05,4.5e-05,4.7e-05,8.9e-05,7.4e-05,0.000109,7e-06,4.4e-05,6.4e-05,9.5e-05,5e-05,0.000117,2.8e-05,1.3e-05,3.3e-05,2.3e-05,3e-05,4.2e-05,5.8e-05,2.5e-05,6.7e-05,2.8e-05,3.2e-05,3.6e-05,5.8e-05,5.4e-05,8e-05,3.9e-05,3.8e-05,1.9e-05,1.6e-05,9.8e-05,9.4e-05,1.6e-05,1.8e-05,4e-06,2.7e-05,2.8e-05,1.5e-05,9e-06,1.9e-05,1.1e-05,3.7e-05,4.3e-05,5.3e-05,9e-05,3.3e-05,6.1e-05,4.3e-05,3.8e-05,5.3e-05,2.7e-05,3.4e-05,1.4e-05,3.5e-05,2e-05,4.6e-05,1e-05,1.4e-05,1.1e-05,1.2e-05,2.3e-05,3.7e-05,1.7e-05,1.6e-05,2e-05
3.9e-05,3.5e-05,4e-05,8e-05,5.9e-05,3.2e-05,6.2e-05,3.7e-05,8.1e-05,1.6e-05,5.6e-05,7.7e-05,5e-05,6.1e-05,3e-05,4.1e-05,9e-06,8.2e-05,5.9e-05,2.5e-05,3.3e-05,2.4e-05,9e-06,4.5e-05,8.8e-05,5.2e-05,3.5e-05,3.9e-05,8e-05,4.4e-05,9e-06,1.1e-05,9e-06,8e-06,2.4e-05,7.9e-05,4.5e-05,6.4e-05,5.3e-05,1.8e-05,4.2e-05,3e-05,4.3e-05,9e-06,6.1e-05,3.5e-05,2.9e-05,2e-05,3.7e-05,2.1e-05,5.3e-05,3.1e-05,4e-06,2.3e-05,3.5e-05,3.3e-05,9e-06,3.4e-05,1.6e-05,6e-06,5e-05,3.2e-05,2.8e-05,2.1e-05,2.3e-05,1.6e-05,6.1e-05,1.3e-05,1.5e-05,6e-06,1.3e-05,1.3e-05,2.5e-05,3.7e-05,1.6e-05,3.4e-05,1e-05,9e-06,1.9e-05,2.7e-05,2.2e-05,3.2e-05,1.7e-05,4e-06,1.7e-05,9e-06,3.5e-05,3.8e-05,3e-06,8e-06,1e-06,0,1.5e-05,8e-06,1.2e-05,1e-05,6e-06,1.7e-05,2.6e-05,1.1e-05,2.8e-05,3e-06,3.3e-05,1.4e-05,6e-06,1.9e-05,1.4e-05,1.4e-05,3e-06,1.3e-05,4e-06,8e-06,9e-06,9e-06,1.3e-05,1.3e-05,5e-06,9e-06,1.2e-05,5e-06,8e-06
2.3e-05,2.9e-05,4.5e-05,3.6e-05,3.7e-05,1.8e-05,3.1e-05,3.9e-05,6.1e-05,3.2e-05,2.7e-05,7.5e-05,7.9e-05,6.5e-05,1.3e-05,2.3e-05,3e-05,5.5e-05,5.2e-05,1.6e-05,2.8e-05,1.7e-05,4.3e-05,3.4e-05,5e-05,5.7e-05,4.3e-05,1.5e-05,8.1e-05,2.5e-05,2.2e-05,1.4e-05,1.6e-05,2.3e-05,2.4e-05,6e-05,4.5e-05,6.8e-05,3.8e-05,3.1e-05,4.2e-05,3.9e-05,4.2e-05,1.1e-05,4.2e-05,3.3e-05,2.6e-05,1.7e-05,3.5e-05,2.7e-05,4.2e-05,1.6e-05,2.1e-05,2.6e-05,2.8e-05,1.4e-05,2e-05,1.4e-05,2.3e-05,6e-06,3.1e-05,2.1e-05,2.1e-05,2e-05,6e-06,9e-06,6.3e-05,1e-05,2e-06,1.3e-05,7e-06,1.1e-05,2.3e-05,3.9e-05,1.4e-05,2.7e-05,2.1e-05,4e-06,1.6e-05,3.1e-05,2.5e-05,2.9e-05,2.2e-05,1.3e-05,6e-06,5e-06,2.3e-05,3.7e-05,5e-06,7e-06,4e-06,1.5e-05,1.3e-05,4e-06,5e-06,7e-06,1.1e-05,7e-06,1.2e-05,2.2e-05,3e-05,9e-06,1.7e-05,1.1e-05,1.7e-05,4e-06,6e-06,8e-06,3e-06,4e-06,6e-06,1e-05,1e-05,4e-06,1.2e-05,6e-06,1.1e-05,1.1e-05,6e-06,1e-05,2e-06
3.7e-05,2.2e-05,2.7e-05,4.7e-05,5.3e-05,2.3e-05,3.7e-05,5.1e-05,6.6e-05,4.7e-05,5.6e-05,7e-05,7e-05,5.7e-05,1.8e-05,3e-05,5e-05,6.1e-05,4.6e-05,1.3e-05,4.3e-05,4e-05,4.3e-05,6.4e-05,2.3e-05,2.8e-05,2e-05,2.5e-05,7.9e-05,3.7e-05,1.6e-05,1e-06,1.9e-05,2.1e-05,2e-05,5.7e-05,3.8e-05,7.3e-05,4.6e-05,2.9e-05,2.5e-05,1.6e-05,4.2e-05,3e-06,2.5e-05,2.9e-05,3e-05,2e-05,3.9e-05,2.6e-05,5.2e-05,8e-06,3e-05,1.5e-05,3.2e-05,2.3e-05,1.8e-05,1.7e-05,1.1e-05,7e-06,3.6e-05,1.8e-05,2.3e-05,1.7e-05,1.6e-05,1.4e-05,5.4e-05,1.4e-05,8e-06,1.7e-05,1.3e-05,2.2e-05,2e-05,3.6e-05,1.6e-05,2.3e-05,7e-06,8e-06,1.2e-05,1.4e-05,2.9e-05,3.6e-05,2.8e-05,1.2e-05,1.8e-05,8e-06,3.2e-05,4.3e-05,5e-06,8e-06,6e-06,2.6e-05,8e-06,9e-06,8e-06,4e-06,1.1e-05,2e-06,2e-05,1.1e-05,1.8e-05,6e-06,1.4e-05,1.2e-05,2.2e-05,7e-06,5e-06,6e-06,9e-06,8e-06,1e-05,6e-06,1e-05,4e-06,1e-05,1.1e-05,7e-06,9e-06,4e-06,3e-06,3e-06
6e-05,4e-05,3e-06,7.8e-05,7.1e-05,6.4e-05,2.7e-05,5.5e-05,1.6e-05,1.7e-05,3.3e-05,6.5e-05,1.2e-05,5.5e-05,2.1e-05,4.9e-05,2.8e-05,4.8e-05,6.1e-05,2.5e-05,3.2e-05,2.8e-05,1.3e-05,2.6e-05,6.1e-05,5.3e-05,2.6e-05,8e-06,5.6e-05,5.4e-05,1.8e-05,1.3e-05,5e-06,2.4e-05,3.3e-05,5.3e-05,3.4e-05,4.9e-05,7e-06,3.3e-05,2.7e-05,2e-05,4.6e-05,2.4e-05,2.8e-05,3.5e-05,2.1e-05,4e-05,2.4e-05,2.7e-05,7e-05,3.1e-05,1.1e-05,1.8e-05,5.6e-05,1.9e-05,4e-06,1e-05,2.9e-05,1.8e-05,9e-06,1.1e-05,1.9e-05,5e-06,7e-06,1.6e-05,5.7e-05,1.4e-05,1.4e-05,1.6e-05,1.7e-05,1.2e-05,3.8e-05,2.2e-05,1.9e-05,8e-06,9e-06,1.2e-05,1.3e-05,1.8e-05,2.3e-05,4.3e-05,2.8e-05,2.2e-05,6e-06,1e-05,3.1e-05,2.9e-05,3e-06,1.2e-05,1.2e-05,3e-05,1.9e-05,8e-06,1.5e-05,1.5e-05,1.1e-05,9e-06,1.7e-05,2.5e-05,1.2e-05,1e-05,8e-06,1.2e-05,1.4e-05,2e-06,1e-06,5e-06,8e-06,7e-06,1.2e-05,8e-06,5e-06,5e-06,2e-06,3e-06,1.2e-05,1.2e-05,3e-06,4e-06,4e-06
3.2e-05,2.3e-05,7e-06,4.9e-05,5.4e-05,2.9e-05,1.3e-05,2.2e-05,1.1e-05,3.1e-05,4.5e-05,3.3e-05,5.9e-05,8.3e-05,5e-05,3.1e-05,3.2e-05,7.6e-05,1.8e-05,6e-06,2.6e-05,3.7e-05,3e-05,1.9e-05,3.9e-05,6.7e-05,2.6e-05,1e-05,3.3e-05,3.4e-05,3.3e-05,4.5e-05,2.6e-05,1.2e-05,8e-06,3.4e-05,2.4e-05,3.5e-05,3e-06,2.3e-05,1.9e-05,2.3e-05,1.5e-05,1.8e-05,4.4e-05,2.8e-05,2e-06,3.8e-05,3.1e-05,1.2e-05,5.2e-05,3.4e-05,2.8e-05,3.1e-05,5.6e-05,2.8e-05,5e-06,3.6e-05,4e-06,1.9e-05,1.4e-05,2.5e-05,3.1e-05,2.6e-05,2.1e-05,2.6e-05,7.2e-05,2e-05,9e-06,1.6e-05,2.9e-05,1.1e-05,2.2e-05,2.9e-05,3e-05,1.7e-05,2e-05,8e-06,8e-06,2.7e-05,3.6e-05,3.3e-05,7e-06,1.7e-05,9e-06,1.1e-05,2.7e-05,3.8e-05,1.7e-05,2e-05,6e-06,1e-05,2.7e-05,1e-05,3e-06,9e-06,8e-06,3e-06,1e-05,1.9e-05,2.2e-05,1.2e-05,1.6e-05,1.6e-05,1.6e-05,5e-06,4e-06,9e-06,6e-06,1.1e-05,1.3e-05,1.1e-05,1.2e-05,8e-06,4e-06,3e-06,5e-06,1e-05,9e-06,1.2e-05,8e-06
8e-06,2.8e-05,3.8e-05,3.2e-05,6.3e-05,2.1e-05,2.6e-05,5.9e-05,5.3e-05,7e-06,4.9e-05,5.2e-05,7e-05,6.1e-05,1.9e-05,1.2e-05,4e-06,6.7e-05,3.3e-05,1.5e-05,2.5e-05,1.8e-05,1.6e-05,2.9e-05,1.3e-05,1.8e-05,1.3e-05,7e-06,6.8e-05,4.8e-05,3.8e-05,2.5e-05,9e-06,7e-06,1.8e-05,4.9e-05,2.8e-05,4.9e-05,3e-05,3.2e-05,2.7e-05,3.1e-05,2.6e-05,5e-06,2.8e-05,4.2e-05,6e-06,1.5e-05,1.7e-05,2.3e-05,2.5e-05,1e-06,2.2e-05,2.5e-05,4.2e-05,2.2e-05,1.9e-05,3.5e-05,1.7e-05,6e-06,2.7e-05,9e-06,2e-05,1.5e-05,2.3e-05,1.1e-05,5.5e-05,1e-05,1.3e-05,2e-05,1.7e-05,1.2e-05,1.5e-05,1.5e-05,1.8e-05,2.8e-05,2.2e-05,1.5e-05,1.2e-05,3e-05,1.1e-05,1.5e-05,2.1e-05,1.5e-05,3e-06,6e-06,2.1e-05,3.2e-05,1.4e-05,4e-06,1.6e-05,1.4e-05,1.8e-05,7e-06,1e-06,8e-06,1.4e-05,1.3e-05,7e-06,3e-06,1e-05,5e-06,1.5e-05,9e-06,1.4e-05,2e-06,9e-06,2e-06,1.3e-05,2e-06,1e-05,5e-06,1.5e-05,1e-05,9e-06,2e-06,9e-06,2e-06,9e-06,5e-06,7e-06
3.2e-05,1.8e-05,2.7e-05,3e-05,4.5e-05,1.9e-05,2.8e-05,2.9e-05,6.4e-05,1.1e-05,4.5e-05,3.9e-05,5.3e-05,5.4e-05,8e-06,1.3e-05,3e-06,5.5e-05,3.9e-05,1.2e-05,2.2e-05,1.5e-05,1.4e-05,1.7e-05,2.9e-05,2.3e-05,2.8e-05,3e-06,5.2e-05,3.4e-05,1.9e-05,1.9e-05,1.4e-05,4e-06,3e-06,6.7e-05,4.1e-05,5e-05,2.7e-05,1.3e-05,2e-05,2.6e-05,2.3e-05,7e-06,2.6e-05,2.8e-05,4e-06,2e-05,1.8e-05,1.5e-05,2.1e-05,1e-05,2.7e-05,1.7e-05,2.8e-05,1.1e-05,1.3e-05,1.4e-05,2.4e-05,7e-06,2.5e-05,1.1e-05,1.4e-05,2e-05,2.1e-05,5e-06,4.9e-05,1e-05,6e-06,8e-06,9e-06,7e-06,7e-06,1.6e-05,6e-06,1.3e-05,6e-06,3e-06,9e-06,1.7e-05,2.5e-05,1.8e-05,1.5e-05,1.2e-05,1.4e-05,4e-06,7e-06,3.9e-05,1.7e-05,6e-06,1.4e-05,4e-06,1.9e-05,9e-06,1e-05,8e-06,1.1e-05,1e-05,3e-06,3e-06,6e-06,8e-06,7e-06,1.2e-05,1.1e-05,2e-06,6e-06,6e-06,8e-06,5e-06,9e-06,8e-06,6e-06,6e-06,6e-06,5e-06,3e-06,6e-06,6e-06,8e-06,5e-06
2.8e-05,6e-06,2.4e-05,2.3e-05,2.6e-05,2.1e-05,2.9e-05,2e-05,3.2e-05,8e-06,5.7e-05,2.4e-05,4.1e-05,4.9e-05,1e-05,1e-06,7e-06,5.5e-05,4.9e-05,1.6e-05,1.6e-05,1.5e-05,2.3e-05,3e-05,4.7e-05,3.6e-05,2.2e-05,1.7e-05,5.3e-05,3.1e-05,2.1e-05,5e-06,2e-05,2.8e-05,1.6e-05,4.6e-05,2e-05,3.8e-05,2.2e-05,2e-05,6e-06,7e-06,1.2e-05,8e-06,1.6e-05,3.7e-05,1.7e-05,1.4e-05,2.7e-05,2.1e-05,2.6e-05,1.8e-05,2.7e-05,1.3e-05,1.7e-05,1.3e-05,7e-06,2.8e-05,3.3e-05,1.3e-05,2.2e-05,9e-06,7e-06,1.6e-05,3e-06,6e-06,4.4e-05,1.4e-05,1.4e-05,2e-06,1.9e-05,1e-05,1.5e-05,1.7e-05,8e-06,9e-06,8e-06,1e-06,9e-06,9e-06,5.1e-05,3.7e-05,1.4e-05,9e-06,1.3e-05,1.9e-05,1.5e-05,1.6e-05,1.5e-05,2e-06,8e-06,3e-06,2.6e-05,9e-06,5e-06,3e-06,8e-06,2.4e-05,1e-05,3e-06,1.2e-05,1.2e-05,8e-06,9e-06,1.6e-05,7e-06,4e-06,3e-06,3e-06,4e-06,1.1e-05,8e-06,5e-06,1.2e-05,2e-06,4e-06,7e-06,7e-06,6e-06,6e-06,5e-06
9e-06,1.3e-05,3.1e-05,2e-05,3.5e-05,4.2e-05,2.9e-05,2.1e-05,2.3e-05,2.1e-05,5.9e-05,1e-05,9.4e-05,3.2e-05,2e-05,3e-05,1.2e-05,5.9e-05,4e-05,1.9e-05,3e-05,4e-06,1.2e-05,4.7e-05,1.8e-05,3.9e-05,1.1e-05,9e-06,5.7e-05,3.7e-05,1.3e-05,3.7e-05,1.5e-05,2.6e-05,2.3e-05,5.8e-05,4.8e-05,4.5e-05,3.1e-05,1.2e-05,3.2e-05,3.1e-05,1.6e-05,8e-06,9e-06,1.2e-05,4.2e-05,1.9e-05,3.3e-05,9e-06,2.9e-05,1.3e-05,3.4e-05,3.4e-05,1.4e-05,2.6e-05,1.1e-05,2.6e-05,2.3e-05,2e-05,1.3e-05,1.5e-05,1.4e-05,2.3e-05,3e-05,1.5e-05,3.6e-05,6e-06,1.3e-05,1.4e-05,2.1e-05,1.7e-05,3.6e-05,2.9e-05,5e-06,2.2e-05,1.8e-05,1.2e-05,6e-06,3.9e-05,2.1e-05,1.8e-05,1e-05,9e-06,4e-06,2e-05,3.1e-05,1.2e-05,3.5e-05,2.6e-05,1e-05,6e-06,1.2e-05,5e-06,1e-05,3e-06,6e-06,3e-05,2.3e-05,1.2e-05,1.2e-05,6e-06,6e-06,1.1e-05,2.1e-05,4e-06,5e-06,7e-06,8e-06,5e-06,1.2e-05,1.8e-05,9e-06,1.7e-05,9e-06,1e-06,3e-06,7e-06,3e-06,5e-06,2e-06
2.1e-05,8e-06,1.4e-05,3.6e-05,7e-06,3.8e-05,5.6e-05,1.2e-05,4.9e-05,1e-05,1.1e-05,4.9e-05,8.1e-05,5.2e-05,3.7e-05,2.5e-05,2e-06,3.3e-05,4.4e-05,1.4e-05,1e-05,3.4e-05,4.2e-05,3.7e-05,2e-05,4e-05,3.7e-05,6e-06,6e-05,2.1e-05,1.6e-05,4.4e-05,3.5e-05,1.1e-05,1.8e-05,3.5e-05,1.6e-05,4.5e-05,4e-05,1.5e-05,3e-05,2.2e-05,3e-06,1.4e-05,5e-06,4e-05,1.5e-05,1.8e-05,4.4e-05,1.4e-05,3.6e-05,1.1e-05,1.1e-05,1.2e-05,3.5e-05,1.4e-05,7e-06,9e-06,3.3e-05,1.5e-05,2.2e-05,1.3e-05,9e-06,2.3e-05,2.9e-05,2.4e-05,6.2e-05,9e-06,1.4e-05,1.2e-05,1.7e-05,1.6e-05,1.8e-05,1.6e-05,1.7e-05,2.5e-05,4e-06,8e-06,8e-06,4e-05,2.9e-05,2.4e-05,1.2e-05,8e-06,1e-05,2.1e-05,7e-06,1.5e-05,3.5e-05,2.1e-05,1.8e-05,2e-06,2.8e-05,8e-06,1.2e-05,1.9e-05,9e-06,2.6e-05,1.5e-05,2e-06,9e-06,1e-05,1e-05,1.6e-05,1.4e-05,1.3e-05,9e-06,1.3e-05,1.5e-05,8e-06,1.1e-05,2.4e-05,1.2e-05,7e-06,9e-06,1.3e-05,1e-05,7e-06,5e-06,4e-06,6e-06
5.1e-05,2.7e-05,7e-06,3.5e-05,2.8e-05,4.3e-05,4.4e-05,3.9e-05,5.3e-05,4e-06,3.8e-05,5.5e-05,6.6e-05,5e-05,5.7e-05,4e-05,3.5e-05,5.5e-05,6.2e-05,5e-06,9e-06,3.5e-05,3.8e-05,7.5e-05,1.8e-05,1.6e-05,1.2e-05,2.6e-05,5.5e-05,2e-05,1.3e-05,4e-05,3e-05,2.9e-05,1.8e-05,7e-06,4.6e-05,4.8e-05,2.9e-05,1.6e-05,2.5e-05,3.7e-05,3.4e-05,2.7e-05,2.7e-05,3.6e-05,2.3e-05,1.9e-05,4.2e-05,1.5e-05,1.6e-05,4.3e-05,3.3e-05,4e-06,3.5e-05,2.8e-05,1.6e-05,2.3e-05,2.7e-05,6e-06,1.3e-05,2.5e-05,1.7e-05,1.2e-05,3.1e-05,1e-05,6e-05,1.9e-05,6e-06,1.5e-05,1.4e-05,9e-06,1.8e-05,1.6e-05,1.9e-05,4.3e-05,1.6e-05,1e-05,7e-06,1.6e-05,2.6e-05,2.1e-05,2.9e-05,7e-06,1.9e-05,9e-06,2.8e-05,4.5e-05,7e-06,2e-06,2.3e-05,3.4e-05,4.1e-05,2.1e-05,1.3e-05,1.2e-05,1.5e-05,1.7e-05,2.1e-05,1.6e-05,8e-06,1e-05,2.7e-05,1e-05,2e-05,8e-06,8e-06,7e-06,5e-06,6e-06,3e-06,1.3e-05,8e-06,1e-06,3e-06,6e-06,3e-06,7e-06,6e-06,2e-06,4e-06
1.5e-05,1.1e-05,4.1e-05,4.8e-05,2e-05,3e-05,3.2e-05,4.2e-05,1.2e-05,1.9e-05,4.3e-05,4.2e-05,1.2e-05,6.4e-05,1.4e-05,3.5e-05,8e-06,8.4e-05,5.7e-05,5.1e-05,2.9e-05,1.7e-05,1.8e-05,5.2e-05,6.5e-05,1e-06,3.1e-05,2.4e-05,3.5e-05,2.5e-05,2.2e-05,2.2e-05,2.4e-05,2.2e-05,1.7e-05,2.6e-05,2.6e-05,4.6e-05,1.6e-05,2.3e-05,3.7e-05,3.4e-05,2.7e-05,2.6e-05,2.2e-05,3e-05,2.4e-05,1.3e-05,2.7e-05,2.5e-05,3.2e-05,6e-05,2e-05,8e-06,3.6e-05,1.7e-05,1.6e-05,3.5e-05,4e-06,6e-06,2.2e-05,2.2e-05,2.1e-05,3e-06,1.7e-05,6e-06,5.1e-05,3.9e-05,2.5e-05,2.2e-05,1.8e-05,1.2e-05,3.6e-05,5e-06,8e-06,2.1e-05,1.8e-05,2.6e-05,1.6e-05,1.4e-05,2.9e-05,5e-06,2.4e-05,2.2e-05,1.9e-05,1.3e-05,1.8e-05,3.9e-05,1.3e-05,3e-06,2.2e-05,1.4e-05,1.2e-05,3e-06,1e-06,1.2e-05,6e-06,1.1e-05,8e-06,5e-06,5e-06,3e-06,2e-05,1.2e-05,7e-06,5e-06,4e-06,7e-06,4e-06,3e-06,8e-06,3e-06,4e-06,4e-06,2e-06,3e-06,2e-06,5e-06,2e-06,4e-06,4e-06
1.4e-05,1.9e-05,1.9e-05,4.4e-05,3.1e-05,6e-06,1.1e-05,1.7e-05,3.9e-05,8e-06,3e-05,1.5e-05,4.1e-05,4.2e-05,2.6e-05,2.5e-05,7e-06,6.5e-05,2.8e-05,2.4e-05,3e-05,2.2e-05,2.2e-05,2.3e-05,3.3e-05,2.7e-05,6e-06,1.6e-05,3.3e-05,1.5e-05,1e-05,2.2e-05,2.6e-05,2.4e-05,3.9e-05,2.1e-05,2e-05,4.9e-05,2.1e-05,6e-06,3e-05,2.2e-05,4.4e-05,1.4e-05,7e-06,2.7e-05,1.7e-05,1e-05,1.2e-05,2.7e-05,5e-06,3.2e-05,3.1e-05,2e-05,9e-06,9e-06,8e-06,1.6e-05,3.1e-05,1.9e-05,2.2e-05,2.5e-05,2e-06,1e-05,9e-06,4e-06,4.8e-05,2.8e-05,5e-06,9e-06,1.1e-05,8e-06,2e-05,2.7e-05,1e-05,1.4e-05,8e-06,1.2e-05,3e-06,2.3e-05,2.4e-05,2e-05,1.6e-05,1.2e-05,5e-06,6e-06,2e-05,3.1e-05,5e-06,6e-06,1.5e-05,2.6e-05,1.7e-05,6e-06,1e-05,5e-06,8e-06,1.2e-05,1.4e-05,8e-06,1e-05,0,8e-06,1.2e-05,1.4e-05,4e-06,5e-06,1e-06,4e-06,4e-06,9e-06,2e-06,7e-06,1e-06,5e-06,7e-06,4e-06,2e-06,2e-06,3e-06,5e-06
1.6e-05,7e-06,2.5e-05,4.9e-05,1.5e-05,1e-05,2.9e-05,1.4e-05,2.9e-05,2e-06,3.8e-05,2.8e-05,3.3e-05,3.4e-05,2.5e-05,2.4e-05,2.6e-05,5e-05,8e-06,3.1e-05,1.7e-05,5e-06,1.7e-05,1.8e-05,3.2e-05,1.4e-05,1.8e-05,1e-05,5.1e-05,2.7e-05,1.4e-05,1.4e-05,9e-06,1.7e-05,2.1e-05,3.3e-05,3e-05,3.8e-05,7e-06,1.4e-05,1.4e-05,4e-06,3.1e-05,3e-06,1.5e-05,3.2e-05,1.1e-05,1.4e-05,3.2e-05,1e-05,1.1e-05,1.1e-05,1e-05,2.1e-05,2.6e-05,8e-06,1.2e-05,9e-06,1.9e-05,1.5e-05,2e-06,1.9e-05,1.1e-05,1.9e-05,4e-06,1e-06,4.2e-05,1.5e-05,1.8e-05,8e-06,1.4e-05,1.2e-05,1e-05,1.2e-05,3e-06,1.2e-05,4e-06,6e-06,3e-06,1.9e-05,9e-06,1.4e-05,9e-06,1.3e-05,4e-06,7e-06,1.6e-05,2e-05,9e-06,6e-06,8e-06,1.8e-05,1.2e-05,5e-06,6e-06,7e-06,2e-06,9e-06,8e-06,2e-06,3e-06,5e-06,1.1e-05,1e-05,1.1e-05,2e-06,6e-06,3e-06,1e-06,5e-06,6e-06,7e-06,7e-06,4e-06,6e-06,4e-06,3e-06,5e-06,3e-06,4e-06,3e-06
1.6e-05,2e-05,3e-05,4.7e-05,2.2e-05,8e-06,3.6e-05,3.3e-05,4.3e-05,1.2e-05,3.7e-05,2.3e-05,3e-05,4e-05,2.1e-05,1.4e-05,2.7e-05,2.1e-05,4.4e-05,2.5e-05,2.3e-05,1.1e-05,9e-06,2.2e-05,2.6e-05,1.3e-05,2.9e-05,9e-06,3e-05,3.2e-05,2e-06,1.7e-05,1.5e-05,7e-06,1.7e-05,3.4e-05,3.7e-05,2.3e-05,2.4e-05,1.4e-05,1.9e-05,1.3e-05,3.1e-05,6e-06,1.4e-05,1.7e-05,9e-06,2.4e-05,1.3e-05,1.4e-05,6e-06,1.1e-05,2e-05,3.6e-05,1.6e-05,5e-06,1.2e-05,1.1e-05,2.7e-05,1.6e-05,1.4e-05,1e-05,1.8e-05,1.4e-05,1.9e-05,1.5e-05,4.4e-05,1.4e-05,1.7e-05,4e-06,1.4e-05,1e-05,4e-06,1.2e-05,5e-06,1.4e-05,1.3e-05,5e-06,8e-06,1.9e-05,1.5e-05,1.8e-05,1.8e-05,9e-06,5e-06,7e-06,1.6e-05,2.1e-05,6e-06,2e-06,6e-06,1.4e-05,1.2e-05,1e-06,4e-06,5e-06,3e-06,1e-05,4e-06,7e-06,7e-06,1e-06,1.3e-05,1.3e-05,1e-05,5e-06,1e-06,4e-06,2e-06,2e-06,4e-06,5e-06,8e-06,2e-06,3e-06,2e-06,0,2e-06,2e-06,4e-06,2e-06
1.2e-05,1.9e-05,1.5e-05,3.5e-05,7e-06,2.7e-05,2.5e-05,1.8e-05,4.4e-05,1.6e-05,4.7e-05,3.8e-05,3.3e-05,4.7e-05,1.7e-05,2e-05,9e-06,3.4e-05,1.9e-05,2.3e-05,2.5e-05,1.1e-05,1.1e-05,2.1e-05,3.2e-05,2.1e-05,4e-06,9e-06,4.1e-05,1.5e-05,1e-05,1.5e-05,1.3e-05,1.8e-05,1.4e-05,2.6e-05,1.8e-05,3.9e-05,1.6e-05,1.8e-05,1.9e-05,1.4e-05,1.9e-05,1.4e-05,1e-05,2.4e-05,1.2e-05,9e-06,1.9e-05,2.6e-05,2.1e-05,1.1e-05,2.6e-05,3.8e-05,3.3e-05,8e-06,1.2e-05,1.1e-05,2e-05,1.6e-05,1e-05,0,1.3e-05,1.7e-05,1.1e-05,1.4e-05,3.8e-05,5e-06,1e-06,1.3e-05,6e-06,9e-06,8e-06,1.1e-05,4e-06,1.8e-05,1.7e-05,1.2e-05,8e-06,1.4e-05,1.8e-05,1.7e-05,1.8e-05,6e-06,7e-06,7e-06,1.4e-05,2.1e-05,3e-06,7e-06,7e-06,1.3e-05,1.1e-05,7e-06,6e-06,3e-06,2e-06,7e-06,6e-06,2e-06,1e-05,2e-06,9e-06,1.1e-05,1.1e-05,2e-06,4e-06,3e-06,3e-06,2e-06,4e-06,5e-06,1e-05,5e-06,2e-06,2e-06,5e-06,4e-06,1e-06,2e-06,2e-06
5e-06,1.1e-05,1.8e-05,3.3e-05,1.4e-05,1.8e-05,1.1e-05,5e-06,3.6e-05,9e-06,3.2e-05,3.4e-05,4.1e-05,3.7e-05,1.2e-05,6e-06,1e-05,3.8e-05,2e-05,2.2e-05,1e-05,9e-06,1.8e-05,2.8e-05,3.1e-05,2.1e-05,1.5e-05,1.5e-05,4.8e-05,2.1e-05,1.1e-05,6e-06,7e-06,1.1e-05,1.3e-05,1.6e-05,2e-05,4e-05,1.5e-05,1.3e-05,3e-05,2e-05,2.6e-05,6e-06,9e-06,2.4e-05,9e-06,6e-06,2.5e-05,1.6e-05,2.1e-05,7e-06,3e-05,2e-05,2.3e-05,3e-06,4e-06,1.6e-05,1.5e-05,4e-06,8e-06,1.1e-05,1.1e-05,1.5e-05,8e-06,1.1e-05,3.7e-05,7e-06,5e-06,8e-06,9e-06,7e-06,1.6e-05,1.5e-05,3e-06,1.6e-05,8e-06,7e-06,9e-06,1.3e-05,1.6e-05,1.8e-05,1.3e-05,4e-06,3e-06,3e-06,1.8e-05,2.6e-05,5e-06,4e-06,3e-06,1.7e-05,7e-06,5e-06,4e-06,4e-06,3e-06,0,5e-06,3e-06,8e-06,1e-06,9e-06,9e-06,1.1e-05,4e-06,1e-06,2e-06,1e-06,4e-06,2e-06,8e-06,5e-06,4e-06,3e-06,1e-06,5e-06,3e-06,1e-06,2e-06,1e-06
7e-06,1.1e-05,1.9e-05,3.2e-05,1.3e-05,7e-06,1.9e-05,4e-06,3.4e-05,5e-06,3e-05,3e-05,4.4e-05,4.7e-05,6e-06,8e-06,1e-06,4.2e-05,3.4e-05,8e-06,1e-05,1.1e-05,1.2e-05,2.3e-05,2.9e-05,2.2e-05,1.7e-05,1e-05,4.3e-05,1.8e-05,8e-06,9e-06,5e-06,9e-06,1.2e-05,2.4e-05,2.7e-05,3.2e-05,2.2e-05,6e-06,2.4e-05,1.1e-05,3e-05,3e-06,5e-06,2.4e-05,1e-05,8e-06,2.4e-05,1.9e-05,1.5e-05,3e-06,2.4e-05,2.5e-05,2e-05,3e-06,3e-06,9e-06,1.3e-05,9e-06,5e-06,5e-06,1.5e-05,1.2e-05,1.2e-05,8e-06,3.5e-05,4e-06,1e-06,5e-06,8e-06,6e-06,1.4e-05,1.3e-05,2e-06,1.4e-05,6e-06,1e-06,5e-06,1.6e-05,1.7e-05,1.6e-05,1.1e-05,4e-06,3e-06,5e-06,1.6e-05,2.3e-05,3e-06,2e-06,3e-06,1.6e-05,1.1e-05,4e-06,5e-06,2e-06,3e-06,6e-06,2e-06,3e-06,6e-06,0,7e-06,8e-06,8e-06,2e-06,2e-06,3e-06,3e-06,5e-06,2e-06,6e-06,6e-06,3e-06,3e-06,2e-06,4e-06,3e-06,2e-06,3e-06,1e-06
1e-06,1.3e-05,2.2e-05,3.2e-05,2.1e-05,1.1e-05,2.1e-05,3e-06,3e-05,6e-06,3.1e-05,2.4e-05,3.5e-05,4.1e-05,1.3e-05,8e-06,7e-06,3.2e-05,2.2e-05,1.2e-05,3e-06,4e-06,1.3e-05,2.5e-05,2.5e-05,1.9e-05,1.3e-05,1e-05,4.3e-05,1.6e-05,3e-06,7e-06,4e-06,1.2e-05,1.3e-05,2.7e-05,2.5e-05,3.6e-05,2e-05,7e-06,2.5e-05,1.3e-05,2.1e-05,6e-06,7e-06,3e-05,9e-06,1.1e-05,2.5e-05,1.4e-05,1.7e-05,3e-06,2.5e-05,1.5e-05,2e-05,7e-06,3e-06,1.3e-05,1.7e-05,6e-06,1e-06,1e-05,1.3e-05,1.2e-05,9e-06,4e-06,3.7e-05,2e-06,2e-06,8e-06,7e-06,6e-06,1.1e-05,1.5e-05,4e-06,1.2e-05,2e-06,2e-06,7e-06,1.6e-05,1.8e-05,1.6e-05,1.4e-05,4e-06,2e-06,3e-06,1.6e-05,2e-05,2e-06,2e-06,4e-06,1.4e-05,1.2e-05,3e-06,5e-06,3e-06,3e-06,2e-06,4e-06,2e-06,7e-06,1e-06,7e-06,1.1e-05,9e-06,1e-06,3e-06,2e-06,1e-06,3e-06,2e-06,6e-06,6e-06,3e-06,3e-06,3e-06,2e-06,4e-06,2e-06,4e-06,2e-06
4e-06,1.3e-05,2.2e-05,3.1e-05,1.9e-05,8e-06,1.9e-05,6e-06,3.3e-05,0,3.3e-05,2.9e-05,3.6e-05,4.4e-05,1e-05,4e-06,9e-06,3.6e-05,2.4e-05,9e-06,8e-06,3e-06,1e-05,2.1e-05,2.7e-05,1.9e-05,1.5e-05,1.3e-05,4.2e-05,1.7e-05,6e-06,6e-06,3e-06,9e-06,1.5e-05,2.7e-05,2.3e-05,3.6e-05,2e-05,6e-06,2.1e-05,1.5e-05,2.5e-05,4e-06,8e-06,2.8e-05,6e-06,8e-06,2.1e-05,1.5e-05,1.8e-05,0,2e-05,1.8e-05,2.2e-05,5e-06,4e-06,1.1e-05,1.9e-05,5e-06,3e-06,1.1e-05,1.1e-05,1.3e-05,1e-05,3e-06,3.7e-05,4e-06,3e-06,4e-06,5e-06,5e-06,8e-06,1.4e-05,3e-06,1.3e-05,3e-06,5e-06,6e-06,1.5e-05,1.7e-05,1.4e-05,1.3e-05,6e-06,4e-06,3e-06,1.7e-05,2.2e-05,1e-06,1e-06,4e-06,1.4e-05,1.1e-05,3e-06,5e-06,2e-06,1e-06,3e-06,3e-06,3e-06,6e-06,1e-06,8e-06,9e-06,1e-05,1e-06,3e-06,2e-06,1e-06,3e-06,1e-06,5e-06,5e-06,2e-06,4e-06,2e-06,3e-06,4e-06,2e-06,4e-06,2e-06
