1.5e-05,2.1e-05,4.4e-05,4.9e-05,0.000109,1.4e-05,7.8e-05,9.7e-05,5.8e-05,2.7e-05,2.7e-05,1.1e-05,5.3e-05,7e-06,7.6e-05,0.000136,6.6e-05,2.4e-05,2.6e-05,9.8e-05,2.3e-05,1.3e-05,1.1e-05,0.000165,4.6e-05,3.1e-05,3.7e-05,0.000101,0.000144,5e-06,7.2e-05,1e-05,4.9e-05,1.9e-05,0.000125,2.4e-05,0.000109,4e-06,1e-05,6.8e-05,0.000128,7.7e-05,0.00015,5.4e-05,8.7e-05,4.4e-05,6e-06,2.8e-05,1.2e-05,1.5e-05,6.4e-05,1.6e-05,4.9e-05,0.000175,5.8e-05,2.4e-05,8.3e-05,0.000126,5e-06,2.4e-05,6.2e-05,5.9e-05,0.000102,6.2e-05,1.8e-05,8e-06,3.1e-05,0.000136,0.000126,1.9e-05,4.6e-05,3.8e-05,0.000135,7e-06,1.8e-05,3.4e-05,3e-06,3.2e-05,7.4e-05,0.000212,7.2e-05,0.000126,4e-05,5.5e-05,4.6e-05,0.000153,4.7e-05,2.6e-05,6.5e-05,1.1e-05,0.000112,5.4e-05,0,1.5e-05,3.5e-05,2.1e-05,6.5e-05,2e-05,2.4e-05,2e-05,9.8e-05,6.9e-05,0.000108,4.4e-05,0.000126,2.1e-05,9.4e-05,0.000125,5.2e-05,3.3e-05,3.3e-05,1.8e-05,6.6e-05,1.5e-05,7.5e-05,6.9e-05,0.000116,1.1e-05,8.2e-05,8e-06,1.5e-05
3.5e-05,6.8e-05,9.4e-05,4.7e-05,0.000251,2.2e-05,0.000185,0.000213,5.5e-05,0.000136,4.1e-05,2e-05,9.9e-05,4e-05,0.000184,0.00032,0.000176,7.1e-05,0.000109,0.000232,8.6e-05,4.3e-05,1.6e-05,0.000373,0.000149,4.5e-05,7.8e-05,0.000255,0.000365,3.1e-05,0.000207,0.000116,0.000149,8.7e-05,0.000272,5.8e-05,0.000231,9.6e-05,9.1e-05,0.000191,0.000283,0.000106,0.000265,0.000105,0.000212,8.2e-05,1.9e-05,8.4e-05,9.5e-05,5.5e-05,0.000131,7.3e-05,0.000177,0.000425,2.7e-05,3.7e-05,0.000136,0.00025,4.1e-05,9.9e-05,0.000145,8.5e-05,0.00012,0.000219,7.4e-05,8.3e-05,0.00011,0.000326,0.000164,0.000155,0.000144,6.7e-05,0.000346,5.7e-05,0.000107,7.5e-05,1.8e-05,0.000125,6.3e-05,0.000353,0.000155,0.000255,4.9e-05,0.000113,0.000114,0.000254,5.3e-05,0.000132,0.000152,0.000103,0.000229,0.000104,8.5e-05,7.7e-05,5.5e-05,5.3e-05,0.000145,2.1e-05,0.000127,7.7e-05,0.000175,0.00013,0.000303,0.000119,0.000216,6.4e-05,0.000162,0.00028,0.000115,5e-06,3.7e-05,6.3e-05,7.6e-05,5.7e-05,0.000179,0.000187,0.000257,9e-05,0.000132,1.6e-05,4.7e-05
0.00011,8.3e-05,0.000225,0.00014,0.00037,0.000117,0.000217,0.000245,0.000199,0.000193,9.5e-05,0.000162,0.000194,0.000155,0.000259,0.000381,0.000187,0.000161,0.000101,0.000214,0.000245,0.000129,0.000142,0.000338,0.000233,3.1e-05,0.000165,0.000385,0.000374,1.7e-05,0.000279,0.000143,9.4e-05,0.000145,0.000369,0.000138,9.7e-05,8.7e-05,0.000221,0.00026,0.000336,0.000119,0.000197,0.000162,0.000348,0.000132,7.2e-05,0.000153,0.000347,9.6e-05,0.000101,0.00013,0.00051,0.000201,0.000192,0.000182,8.2e-05,0.000372,7.7e-05,0.000218,1e-04,0.000304,0.000225,0.000542,0.000149,0.00022,0.000364,0.000321,0.000303,0.000128,0.000127,0.000238,0.000357,0.000208,0.000189,0.000103,0.000256,0.000152,0.000274,0.000668,0.000326,0.00037,0.000166,0.000242,0.000146,0.000416,8e-05,0.000472,8.9e-05,0.000269,0.000353,8.8e-05,5e-05,0.000189,6.1e-05,0.000203,0.000164,0.000194,0.000229,0.000248,0.000379,0.000193,0.000489,0.000304,0.00016,0.00023,9.2e-05,0.000451,3.9e-05,0.000202,0.000231,0.000239,6.1e-05,0.00025,0.000153,0.000467,0.000194,0.000123,0.000254,5.7e-05,9.2e-05
0.000206,0.000146,0.000447,0.000231,0.00043,0.000119,0.000338,0.000126,0.000142,0.000171,0.00024,0.000128,5.1e-05,0.000439,0.000275,0.000879,0.000534,0.000579,0.000357,0.000168,0.00025,0.000203,0.000251,0.000245,0.000671,0.000559,0.000485,0.000889,0.001293,0.000557,0.000299,0.000882,0.000254,0.000341,0.000698,0.000667,0.000399,0.000164,0.000627,0.000639,0.000776,0.000455,0.000197,0.000251,0.000321,0.000281,0.00036,0.000147,0.000615,0.000598,0.00049,0.000144,0.000768,0.001052,0.000584,0.000673,0.000403,0.000464,0.00033,0.000208,0.000503,0.000556,0.000737,0.001242,0.000845,0.000271,0.000399,0.00072,0.000838,0.000329,0.000281,0.000714,0.000808,0.000437,0.000121,0.000195,0.000353,3e-04,0.000183,0.001191,0.000272,0.000959,0.000482,0.00042,0.000282,0.000376,0.000422,0.000738,0.000752,0.000699,9.2e-05,0.00036,0.000104,0.000445,0.000495,0.000346,0.000154,0.000503,0.000703,0.000306,0.000447,0.000376,0.000623,0.000409,0.000517,0.000644,0.000406,0.000757,0.00069,0.00018,0.000359,0.000457,0.000594,5.9e-05,0.00025,0.000257,0.00049,0.000369,0.000617,0.000458,6.3e-05
0.000211,0.000157,0.000459,0.000605,0.000244,0.000291,0.000487,0.00054,0.000197,0.000262,0.000175,0.000217,4.4e-05,0.000702,0.000524,0.001046,0.00041,0.000278,0.000393,0.000454,0.000287,0.000337,1.7e-05,0.000527,0.000958,0.000493,0.000193,0.001065,0.001139,0.001182,0.001212,0.00166,0.001467,0.001139,0.000862,0.000514,0.000509,0.000258,0.001033,0.001298,0.001019,0.000557,0.000537,0.000461,0.000119,0.000231,0.000295,0.00024,0.000962,0.001111,7e-04,0.000533,0.000422,0.000247,0.000283,0.000607,0.000259,0.000331,0.000341,0.00061,0.000915,0.001059,0.00064,0.001112,0.001348,0.000779,0.000353,0.000635,0.000427,0.001024,0.000954,0.000872,0.000179,0.000107,0.000227,0.000131,0.000494,0.00048,0.000498,0.001129,0.001107,0.001637,0.001112,0.001076,0.000782,0.00023,0.000602,0.000545,0.000805,0.000362,0.000544,0.000565,0.000434,0.000723,0.000109,0.000468,0.000687,0.000886,0.000644,0.000401,0.000202,0.000574,0.000146,0.000343,0.000392,0.000515,0.000334,0.000806,0.000849,0.000417,0.000767,0.000491,0.000495,0.00055,0.000382,0.000357,0.000502,0.000918,0.000226,9.4e-05,0.000319
0.000318,0.00029,0.000257,0.000236,0.000152,0.000454,0.000176,0.000184,0.000529,6e-04,0.000409,0.000309,0.000512,4e-04,0.000486,2e-04,0.000453,0.00045,0.000253,0.000359,0.000188,0.000183,0.000151,0.000271,0.000201,0.000199,0.000348,0.000611,0.000371,0.000547,0.000471,0.000747,0.000542,0.000143,0.000238,0.000359,0.000813,4.2e-05,0.000831,0.000523,0.000181,0.000279,0.000407,8e-05,0.000502,0.000168,7.6e-05,5e-04,0.000521,0.000292,0.000443,0.000741,4e-04,0.000221,0.000416,0.000473,0.000609,0.000342,0.000143,0.000499,6e-05,0.000374,0.000364,0.000746,0.000618,0.000514,0.000496,0.000558,0.000169,0.000847,0.000508,0.000386,0.000447,0.000229,0.000417,0.000328,0.000257,0.000421,0.000203,0.00049,0.000638,0.000375,0.000101,0.000466,4e-06,0.000135,0.000402,0.000489,0.000537,0.000227,0.000319,0.000178,0.000295,0.000425,0.000736,0.000125,0.000533,0.000167,0.00014,3e-05,0.000324,0.000263,0.00033,0.000798,0.000183,7.3e-05,0.000376,0.000356,0.000185,0.000448,0.000667,4.5e-05,0.000585,0.000337,0.000138,0.000212,0.000204,0.000621,0.000249,5.4e-05,0.000126
0.000339,0.000483,0.000414,0.000342,0.000434,0.000422,0.00022,0.00023,0.000194,0.000262,8.4e-05,0.000134,0.000437,0.000405,7.2e-05,0.00014,0.000247,0.000156,0.000146,0.000532,0.000273,7.1e-05,0.000276,0.000327,0.000396,0.000407,0.000485,0.000546,0.00032,0.000244,0.000357,0.000376,0.00031,0.000363,0.000117,0.000494,0.000476,0.000811,0.000273,0.000553,2e-05,0.000536,0.000704,0.000461,0.000219,0.00033,0.000443,0.000737,0.000787,0.000492,0.000287,5.8e-05,0.000361,0.000519,0.000713,0.001256,0.000329,0.00029,0.00013,0.000326,0.000427,0.000185,0.000544,0.000273,0.000684,0.000843,0.000768,0.00104,0.000775,0.000384,0.000211,0.000237,0.000411,0.000212,0.000583,0.000426,0.000647,0.000227,0.000377,0.000431,0.000107,0.000305,0.000339,0.000341,0.000123,0.000353,0.000353,0.00048,0.000184,0.000314,0.000302,0.000433,0.000178,0.000191,0.00045,0.000762,0.000184,0.000408,0.000238,0.000219,0.000416,0.000499,0.000437,0.001149,0.000643,0.000312,0.000489,0.000252,0.000421,0.000381,0.000195,0.000493,0.000591,0.000325,0.000405,0.000234,0.000336,0.00014,0.000523,0.000311,8e-05
0.000218,0.000822,0.000381,0.000292,0.000946,0.000359,0.000202,0.000641,0.00017,0.000171,0.000293,8.7e-05,0.000433,0.000406,0.00022,0.000536,0.000356,0.000337,0.000118,0.000312,0.000442,0.000176,0.000571,0.001341,0.001083,0.000381,0.000668,0.000641,0.000578,0.000737,0.000354,0.00019,0.000594,0.000435,0.000602,0.000728,0.000997,0.00116,0.000571,0.001169,0.000966,0.000735,0.000661,0.000869,0.000442,0.00021,0.000804,0.000972,0.000834,0.000225,0.000396,0.000618,0.000613,9.4e-05,0.000547,0.000677,0.000836,0.000559,0.000567,0.000559,0.001071,0.000935,6.8e-05,0.000373,0.000422,0.000276,0.000755,6e-05,0.000221,0.000433,0.000695,0.000683,0.000495,0.000945,0.000463,0.000132,0.000557,0.000623,0.000583,0.001025,0.000983,0.00078,0.000577,0.000401,0.000383,0.000817,0.00099,0.000347,0.000632,0.000817,0.000522,0.00045,0.000788,0.000861,0.000233,0.000761,0.000539,0.000644,0.000433,0.00067,0.000151,0.000689,0.000495,0.001092,0.000866,0.001009,0.001076,0.000922,0.000162,0.000621,0.000913,0.001262,0.000994,0.000144,0.000811,0.000485,0.000284,2.9e-05,0.000618,0.000232,0.000496
0.000433,0.000917,0.000644,0.000197,0.000665,0.000893,0.000839,0.000906,0.000771,0.000443,0.000574,0.000379,0.000207,0.000837,0.000569,0.000387,0.000829,0.000816,0.000491,0.000103,3.7e-05,0.000388,9e-04,0.001014,0.000967,0.000847,0.000823,0.000184,0.000618,0.00086,0.000498,0.000181,0.000718,0.000547,0.000414,0.001118,0.000219,0.000309,0.000741,0.001314,0.000794,0.000586,0.000436,0.000423,0.00074,0.000271,0.000781,0.001359,0.000743,0.000586,0.000611,0.000454,0.000658,0.001018,0.000864,0.001043,0.000582,0.000485,0.000568,0.000544,0.001322,0.000724,0.000275,0.00041,0.000286,0.000642,0.000678,0.000357,0.000302,0.000858,0.000697,0.000428,0.000579,0.001088,0.001052,0.000837,0.000139,0.000574,0.001253,0.001488,0.001514,0.001099,0.000766,0.000838,0.00031,0.000848,0.001271,0.001528,0.00077,0.000378,0.000725,0.000345,0.000872,0.000416,0.000565,0.000386,0.000508,0.000386,0.000105,0.000524,0.000732,0.000451,0.00028,0.000717,0.000464,0.000508,0.000772,0.000663,0.000916,0.000478,0.000602,0.000768,0.000507,0.000793,0.001004,0.00054,0.000277,0.000494,0.000738,0.000584,0.000698
0.000724,0.000673,0.000321,0.000105,0.000559,0.000615,0.000201,7.7e-05,0.000174,7.1e-05,0.000455,8e-05,0.000296,0.000846,0.00029,0.00014,0.000667,0.000396,0.000312,0.000327,0.000411,0.000691,0.000748,0.001017,0.000809,0.000372,0.000169,0.000159,0.000522,0.000554,0.000468,0.000213,0.000604,0.000161,0.000483,0.000691,0.000998,0.000299,0.00056,0.000741,0.000369,0.000744,0.000715,0.000528,0.000572,0.000844,0.000624,0.000753,0.000257,0.000472,0.000661,0.000295,5.1e-05,0.000801,0.000196,0.000187,0.000406,0.000279,0.00077,0.000437,0.000858,0.000174,0.000238,0.00031,0.000271,0.000767,0.000578,0.000656,0.000432,0.000498,0.00026,0.000364,0.000437,0.000497,0.000318,0.000438,0.000426,0.000114,0.000875,0.001225,0.000401,0.000549,0.000356,0.000605,0.000468,0.000473,0.000494,0.00053,0.000319,0.000525,0.000197,0.000835,0.00062,0.000487,0.000353,9.5e-05,0.000471,6.3e-05,0.000103,0.000358,0.000183,5.7e-05,0.000476,0.00028,0.000426,0.000328,0.000164,0.000269,0.00031,0.000182,0.000443,0.00051,0.000144,0.000368,0.000166,0.000136,0.000115,0.000432,0.000274,0.000212,0.000255
0.00046,0.000108,0.000211,0.000307,0.000219,6.7e-05,0.000378,0.000227,0.000134,7.5e-05,0.000329,0.000406,0.000158,0.000387,0.000471,0.000516,0.000726,0.000657,0.000524,0.000282,0.000444,0.000618,0.001014,0.001332,0.000744,0.000517,0.000274,4.3e-05,0.000454,0.000819,0.000815,0.000741,0.000168,0.000577,0.000217,0.000424,0.000714,0.000709,0.000412,0.000613,0.000393,0.000377,0.000261,6.4e-05,0.000575,0.000224,0.000548,0.000994,0.000986,0.000519,0.000288,0.000237,0.000398,0.000678,0.000578,0.000173,0.000305,0.000652,0.000808,0.000634,0.000889,0.000923,0.000585,0.00021,0.000477,0.000487,0.000465,0.000534,9.7e-05,0.000375,0.000348,0.000478,0.000215,0.000339,0.000583,0.000162,3.1e-05,0.000171,0.000653,0.000323,5.7e-05,0.000217,0.000567,0.00024,0.00047,0.000564,0.000355,0.000158,0.000121,0.000354,0.000713,0.000848,0.000984,0.000696,0.00054,0.000339,0.000421,0.00034,0.000139,0.000167,0.000341,0.000154,0.000477,0.000464,0.000342,0.000521,0.000452,0.000101,6e-05,3.6e-05,0.000214,0.000239,0.000168,0.000343,0.000241,7.5e-05,0.000199,0.000453,0.000247,0.000253,0.000185
0.000423,0.000256,3.5e-05,0.000118,0.000258,0.000177,0.000159,6.3e-05,0.000231,4.7e-05,9e-05,0.000302,0.000136,0.000137,6.9e-05,0.000306,0.000245,7.2e-05,0.000207,0.000258,0.000282,0.000203,0.000247,0.000434,0.000233,0.000141,0.000217,0.000122,0.000369,0.000546,0.000393,0.000193,0.000169,0.000289,0.000282,0.000226,0.000444,0.000317,8.4e-05,0.000192,0.000154,0.000319,0.000181,9.5e-05,0.000354,0.000202,0.000263,0.000119,0.000266,0.000111,0.000355,0.000265,0.000475,9.7e-05,1e-04,0.00018,0.000146,0.000399,2e-04,0.000115,0.000202,0.000362,0.000205,0.000256,0.000354,0.000243,0.000284,0.000157,0.000236,0.000509,0.000244,0.000423,0.000139,0.000193,0.00032,0.000272,0.000465,0.000513,0.000306,0.000356,0.000193,0.000332,0.000156,0.000365,0.000373,0.000104,0.000348,0.000334,0.000127,0.000205,0.00048,9.8e-05,0.000436,0.000145,0.000219,0.000181,6.8e-05,0.000205,0.000143,0.000135,0.000169,4.1e-05,0.000377,9e-06,0.00029,0.00037,0.000118,4.5e-05,0.000197,6.4e-05,0.000257,0.000177,6.3e-05,0.000256,0.000197,0.000293,6.8e-05,0.000208,8.6e-05,0.000103,0.00025
9.8e-05,0.000195,9.9e-05,8.6e-05,0.000127,0.000181,6.9e-05,0.000105,0.000141,0.000134,7e-06,0.000233,0.000138,6.3e-05,0.000123,0.000193,0.000135,0.000176,9.2e-05,0.000222,0.000216,0.000158,0.000216,0.000249,0.00018,6.3e-05,7.5e-05,0.00023,0.000273,0.000202,0.000277,0.000218,0.000121,4.5e-05,0.000121,0.000187,0.000274,0.000417,0.000315,9.6e-05,0.000208,0.000239,0.000154,0.000251,0.000231,0.00022,0.000153,0.000165,0.000154,5.2e-05,0.000278,0.000202,0.000439,8.7e-05,0.000181,0.00021,0.00015,0.000218,0.000114,0.000101,9.9e-05,0.000201,0.000146,0.000222,0.000111,0.000181,0.000131,9.7e-05,0.000158,0.000192,0.000115,0.000305,0.000156,7.8e-05,0.000285,0.00013,0.00029,0.000264,0.000424,0.000276,4.3e-05,0.000244,0.000186,0.00018,0.000201,0.000109,0.000187,4e-04,0.000223,2.8e-05,0.000242,7.1e-05,0.000139,2.5e-05,0.000139,0.000135,0.00011,7.2e-05,0.000127,3.8e-05,0.000183,8.9e-05,0.000257,0.000124,9.2e-05,0.000255,0.000112,0.000141,8.1e-05,3.6e-05,0.000199,0.000203,7.7e-05,0.000274,3.4e-05,0.000198,5.1e-05,0.000111,0.000106,9.5e-05,0.000184
0.000158,0.000557,0.000134,0.000364,0.000177,0.000263,9.3e-05,0.000168,0.000163,1e-04,0.000155,0.000315,0.000164,0.000376,0.000167,0.000196,0.000117,0.000272,8.7e-05,0.000483,0.000109,0.000277,0.000122,0.000282,0.000166,0.000151,0.000169,0.000372,0.000193,0.000196,0.000365,3.3e-05,0.000168,0.000125,0.000167,0.000301,0.000301,0.000387,0.000392,0.00018,0.000407,0.000301,0.000352,0.000542,0.000366,0.000114,0.000185,0.000173,0.000119,0.000243,0.000244,0.000233,0.00044,0.000161,0.000168,0.000331,0.000351,0.000469,0.000215,0.000183,3.6e-05,1.4e-05,0.000376,0.000187,0.000172,0.000319,0.000132,0.000246,0.000199,0.000271,0.000191,0.000472,0.000224,0.000321,0.00053,0.000182,0.000228,0.000292,0.000433,3e-04,0.00019,0.000301,0.000222,0.000231,0.000149,0.000335,0.000157,0.000522,0.000134,4e-04,0.000248,0.000135,7.3e-05,0.000262,0.000215,0.00043,6.7e-05,0.000314,0.000126,6.5e-05,0.000171,0.000201,0.000392,0.000197,2e-04,0.000196,8.7e-05,0.000246,0.000148,7.4e-05,0.000321,0.00014,0.00022,0.000307,4e-05,0.000189,0.000132,0.000266,0.000134,8.6e-05,0.000243
0.000634,0.000891,0.000695,0.000306,0.000242,0.000446,0.00034,0.000275,0.000104,0.000372,0.000632,0.000489,0.000307,0.00076,0.000182,2e-04,0.000512,0.000391,0.000442,0.00105,0.000569,0.000768,0.000761,8.2e-05,0.000116,9.1e-05,0.000295,0.000563,0.000737,0.000383,0.00032,0.000401,0.000145,0.000242,0.000239,0.000361,0.000435,0.000458,0.000938,0.000811,4.9e-05,0.001202,0.001044,0.00097,0.000677,0.000501,0.000217,0.00077,0.000427,0.00047,0.001018,0.00056,0.000422,0.000252,0.000112,0.000664,0.000817,0.000506,0.000168,0.000298,0.000412,0.000427,0.00051,0.000256,4.9e-05,0.000514,0.000575,6e-04,0.00076,0.000172,0.000285,0.000348,0.000366,0.000527,0.000474,0.000497,0.000184,0.000285,0.000792,0.000641,0.000391,0.000328,0.000644,0.000411,0.000375,0.000596,0.000779,0.000744,0.000565,0.000382,0.000793,0.000175,7.2e-05,0.000396,0.000135,0.000684,0.000663,0.000183,0.000372,0.000252,0.000185,0.000308,0.000256,0.000689,0.000257,7.3e-05,0.000218,0.000544,0.000496,0.000339,0.000623,0.000894,0.000364,0.000558,0.000366,0.000126,0.000142,0.000206,0.000171,0.000121,0.000427
0.001446,0.001686,0.001133,0.001069,0.000633,0.000872,0.000996,0.001193,0.000649,0.000488,0.000485,0.000908,0.001024,0.00122,0.001077,0.000285,0.000569,0.000444,0.00021,0.001235,0.001131,0.000421,0.000899,0.00088,0.000498,0.000232,0.000345,0.000647,0.000776,0.000545,0.000118,0.000328,0.00013,0.000271,0.000361,0.000381,0.000598,0.001217,0.001575,0.000798,0.000544,0.001748,0.002615,0.002821,0.002427,0.00221,0.001342,0.001297,0.001215,0.001539,0.001597,0.001462,0.001322,0.000926,0.000531,0.000863,0.001295,0.001531,0.00133,0.000455,0.000619,0.000788,0.001238,0.000949,0.000559,0.000671,0.00104,0.000769,0.000447,0.00085,0.000341,0.000585,0.001013,0.000751,0.001037,0.000832,0.000736,0.000536,0.001077,0.001743,0.001384,0.001083,0.000979,0.001069,0.000848,0.001278,0.00134,0.001768,0.001561,0.001389,0.001232,0.000858,0.000421,0.000152,3e-04,0.000937,0.001092,0.000796,0.000601,0.000224,5.9e-05,8.6e-05,0.000514,0.000794,0.000785,0.000479,0.000143,0.000537,0.000941,0.000482,0.000515,0.000938,0.000699,0.000834,0.000667,0.000406,0.000292,0.000206,0.000325,0.000259,0.000508
0.000329,0.00073,8.4e-05,0.000471,0.000126,0.000711,0.000578,0.000453,0.000455,0.000516,0.000209,0.000422,0.000342,0.000782,0.000868,0.000589,5e-04,0.000213,0.000251,0.000743,0.000812,0.00061,0.000607,0.000342,0.000194,0.000149,0.000174,0.000422,0.000106,0.000116,0.000282,9.6e-05,0.000169,0.000187,0.000285,0.000113,0.00017,0.000714,0.000475,0.000324,0.000282,0.001017,0.000889,0.000782,0.000408,0.000733,0.000409,0.00037,0.000562,0.00054,0.000492,0.000282,0.000502,0.000903,0.000611,0.000686,0.000341,0.000335,0.000475,0.000734,0.00047,0.00061,0.000811,0.000431,0.00029,0.000386,0.000505,0.000179,0.00029,0.000332,0.000386,0.00083,0.000631,0.000181,0.000544,0.000443,0.000435,0.000665,0.000425,0.000649,0.000344,0.000117,0.000269,0.000333,0.000304,0.000704,0.000353,0.000481,0.000403,0.000351,0.000469,0.000362,0.000129,0.000149,0.000196,0.000438,0.00039,0.00014,0.000282,0.000231,7.3e-05,5.8e-05,0.000419,0.000107,0.000336,0.000221,0.000266,0.000496,0.000276,0.000295,0.000168,0.00032,2.4e-05,0.000315,5.6e-05,4.7e-05,0.000179,0.000203,0.000208,0.000115,0.000305
0.000164,0.000292,0.000271,0.000313,0.000275,0.000454,0.000233,0.000317,7e-05,0.00014,0.000227,7e-05,0.000273,0.000745,0.000262,4.5e-05,0.000339,0.000163,0.000227,0.000571,1e-04,0.000162,0.000156,0.000184,1.7e-05,7.6e-05,4e-05,0.000259,0.000147,6.1e-05,0.000209,0.000163,0.00028,0.000264,0.00024,0.000232,0.000316,0.000192,5.5e-05,0.000158,0.000475,0.000428,0.000489,0.000375,0.000309,0.000262,0.000237,0.00036,0.000315,0.000167,0.000234,0.000168,0.000182,0.000393,0.000357,0.000169,0.000282,0.000273,0.000216,0.000268,0.000127,0.00043,0.000237,0.000126,0.000175,0.00027,0.000153,8.6e-05,0.000184,5.5e-05,0.000261,0.00036,0.000208,4.4e-05,0.000243,0.000154,0.00029,0.000182,0.000444,0.000327,0.000251,0.000354,0.000233,5.8e-05,0.00043,0.000225,0.00028,0.000208,0.000132,0.000399,0.00054,0.000348,0.000186,0.000219,0.000171,0.00019,0.000155,0.000268,3.5e-05,0.000131,0.000244,1e-04,0.000264,0.000202,0.000142,3.3e-05,0.000202,4.1e-05,0.000201,0.000141,0.000247,0.000215,4e-05,0.000106,8.2e-05,0.000144,5.6e-05,0.000108,0.000192,0.000118,0.000224
0.000169,9e-05,4.9e-05,4.8e-05,0.000143,0.000331,0.000171,0.000174,0.000233,0.000131,0.000177,0.000172,6.3e-05,0.000194,0.000345,0.000274,5.9e-05,7.2e-05,9e-05,0.000228,0.000131,0.00023,0.000112,8e-05,2.6e-05,7e-05,0.000119,1.7e-05,0.00014,5.2e-05,0.000192,0.000163,0.000193,6.4e-05,8.3e-05,0.000197,0.000223,0.000332,0.000207,0.000111,0.000353,0.000472,0.00054,0.000438,0.000228,0.000152,0.000162,0.000323,0.000514,0.000251,8.1e-05,0.00012,0.000163,0.000136,3e-05,0.000123,0.000234,0.000205,0.000166,0.000206,0.000158,0.000212,0.000169,0.000172,3.3e-05,0.000195,0.000202,5.9e-05,0.000154,0.00011,0.000202,0.000113,5.6e-05,0.000113,0.000202,4.1e-05,0.000234,0.00012,0.000234,0.000199,0.000174,0.000187,0.00016,0.000219,0.000269,0.000276,0.000244,0.00012,0.000119,0.000337,0.000596,0.000648,0.000339,0.000158,0.000138,0.000228,4e-05,0.000147,9.4e-05,0.000141,0.000247,0.000102,0.000142,0.000154,4.4e-05,1.5e-05,0.000153,6.3e-05,0.000167,0.000153,0.00018,0.000189,7.7e-05,0.000203,0.00013,5.2e-05,0.00013,4.6e-05,7.8e-05,5.5e-05,0.000193
0.000333,0.00017,9.7e-05,5.6e-05,3.4e-05,0.000167,0.000109,0.000162,0.000225,0.00016,0.000149,0.000141,0.00016,0.000167,6.4e-05,0.000183,0.000161,0.000139,0.000148,5.8e-05,0.000251,9.9e-05,0.000301,9.2e-05,4.8e-05,1.5e-05,4.3e-05,0.00014,0.000225,0.000236,3.7e-05,0.000105,0.000138,0.000179,0.000102,6.9e-05,0.000147,0.000167,9.4e-05,0.000112,0.000247,0.000305,0.000333,0.000155,0.000171,0.000158,5.7e-05,0.000305,0.000242,0.000299,6.9e-05,9.6e-05,0.00014,0.000125,0.000137,9.9e-05,0.000146,0.000148,0.000158,0.000182,9.6e-05,0.000235,0.000111,5.4e-05,8.3e-05,0.000151,0.00015,7.1e-05,9e-05,5.8e-05,8.8e-05,0.000123,0.000119,3.4e-05,0.000135,8.2e-05,0.000238,9.7e-05,0.000158,0.000151,0.000113,5.3e-05,9.5e-05,8.6e-05,8.3e-05,0.000133,7e-05,0.000154,5.8e-05,0.000239,0.000311,0.000158,0.000102,6.2e-05,0.000133,0.000137,0.000112,8.3e-05,7.4e-05,5.5e-05,5e-05,0.000118,0.000139,0.000126,3.8e-05,1.8e-05,7.4e-05,0.000172,9e-05,0.000132,0.000251,9.3e-05,3.3e-05,0.000158,0.000146,7e-05,0.000162,0.000138,4.9e-05,6.7e-05,8.3e-05
0.000193,0.000193,0.000211,6.6e-05,5e-05,0.00019,0.000213,9.7e-05,0.000111,0.000111,0.000189,9e-05,4.2e-05,0.000124,0.000133,0.000143,0.00014,0.000159,0.000197,0.000224,0.000129,5.3e-05,0.000163,5.9e-05,8.5e-05,9.6e-05,3.9e-05,0.00013,8.4e-05,0.000123,0.000127,0.000105,8.5e-05,7.8e-05,5.1e-05,0.00011,0.000165,0.00015,5.2e-05,6.9e-05,0.000238,0.000344,0.000237,0.000112,0.000126,8e-05,0.000144,8.7e-05,0.000262,0.000297,0.000174,9.8e-05,0.000111,2.8e-05,0.000197,0.000114,0.000125,0.000188,1.2e-05,9.8e-05,6.1e-05,0.00017,4.2e-05,6.5e-05,8.4e-05,0.000102,0.000168,5.7e-05,9.6e-05,5.1e-05,0.000105,3.3e-05,6.8e-05,2.9e-05,0.000127,5.8e-05,7.1e-05,0.000163,1.4e-05,3.5e-05,0.000192,0.000123,6.9e-05,7.5e-05,0.000142,5.1e-05,6.1e-05,5.6e-05,2.2e-05,0.000135,9.3e-05,2.3e-05,7.8e-05,2.6e-05,0.000147,8.5e-05,3.4e-05,5e-06,2.1e-05,3.4e-05,4.1e-05,5.6e-05,3.5e-05,7e-05,8.3e-05,0.000107,9.7e-05,9.1e-05,4.6e-05,0.000117,0.000163,0.000112,7.7e-05,4.4e-05,8.1e-05,8.6e-05,5.4e-05,6e-05,3.1e-05,9.5e-05,7.3e-05
0.000131,4.3e-05,4.2e-05,5.5e-05,4.8e-05,0.00012,0.000144,0.000118,5.2e-05,0.000168,0.000142,6.4e-05,2.7e-05,5e-05,7.8e-05,0.000156,8.8e-05,0.000112,5.4e-05,0.000181,0.000113,8.3e-05,8.7e-05,0.000125,0.000106,4.9e-05,0.00011,6.1e-05,6.3e-05,6.1e-05,1.8e-05,0.000144,9.2e-05,6.3e-05,7e-06,1e-04,0.000107,0.000131,4e-05,3.9e-05,0.000145,0.00023,0.000204,0.000145,0.00012,4.4e-05,8.6e-05,4.9e-05,0.000106,0.00017,3.2e-05,4.8e-05,3.4e-05,4e-05,9.3e-05,4.9e-05,6.8e-05,0.000114,5.4e-05,6.4e-05,4.6e-05,0.000196,4.4e-05,2.8e-05,8.9e-05,7e-05,0.000105,3.6e-05,6e-05,6e-05,6.4e-05,6.2e-05,8.1e-05,6.5e-05,0.000106,5.7e-05,0.000125,0.000158,7.2e-05,0.000109,0.000102,5.9e-05,8.8e-05,8.3e-05,8.7e-05,7.7e-05,9.3e-05,7.3e-05,8.8e-05,0.000151,0.000163,0.00015,7e-05,4.6e-05,0.000179,9.2e-05,6e-05,7e-05,1.5e-05,2.8e-05,5.2e-05,4.1e-05,8.6e-05,7.4e-05,7e-05,7.9e-05,3.9e-05,3.2e-05,8.1e-05,7.3e-05,9.3e-05,4.4e-05,4.9e-05,4.6e-05,5.7e-05,4.6e-05,5.7e-05,5.2e-05,1.4e-05,6.7e-05,4.1e-05
4.3e-05,2.9e-05,1.4e-05,2.7e-05,5e-06,3.5e-05,6.9e-05,5.1e-05,3.5e-05,5.3e-05,7.3e-05,1.6e-05,3.1e-05,1.8e-05,3.5e-05,3.3e-05,2.2e-05,2.4e-05,7.2e-05,6.1e-05,5.5e-05,4.1e-05,3.7e-05,3.8e-05,3.2e-05,1.1e-05,1.6e-05,4.1e-05,2.1e-05,2.4e-05,2e-05,4.4e-05,2.8e-05,3.7e-05,2.2e-05,3.5e-05,3.8e-05,4.3e-05,1e-05,6e-06,6.7e-05,0.000113,0.000101,5.3e-05,6e-05,1.1e-05,2.4e-05,1.9e-05,8.5e-05,6.7e-05,1.7e-05,2.3e-05,1.9e-05,2.5e-05,3.5e-05,1.4e-05,2.7e-05,5.5e-05,2.6e-05,3.2e-05,3.4e-05,6.8e-05,1.8e-05,2.8e-05,2.4e-05,2.2e-05,5.7e-05,2.5e-05,5e-06,2.3e-05,2.3e-05,2.9e-05,6.1e-05,1e-06,4.4e-05,3e-05,3.1e-05,5.7e-05,1.5e-05,4.4e-05,1.7e-05,4.3e-05,2.9e-05,8e-06,2.7e-05,3.7e-05,3.9e-05,3e-05,3e-05,9.3e-05,5.3e-05,2.2e-05,3e-05,2.7e-05,6.4e-05,3.8e-05,2.7e-05,2.6e-05,9e-06,1.5e-05,1.2e-05,3.2e-05,2e-05,2.7e-05,2.8e-05,2e-05,1.8e-05,3.2e-05,1.6e-05,2.4e-05,3.9e-05,3.2e-05,2.5e-05,2.5e-05,1.9e-05,2.4e-05,1.9e-05,1e-05,8e-06,1e-05,2.6e-05
4.3e-05,3.1e-05,8e-06,6e-06,1.6e-05,3.1e-05,6.7e-05,4.8e-05,3e-05,3.8e-05,6.1e-05,1.3e-05,2.9e-05,1.1e-05,1.7e-05,5.5e-05,2e-05,2.4e-05,6.8e-05,5.1e-05,5.7e-05,2.5e-05,5.6e-05,2.8e-05,3e-05,1.9e-05,3.2e-05,3.9e-05,1.1e-05,2.6e-05,1.5e-05,3.1e-05,2.1e-05,2e-05,1.8e-05,2.4e-05,2.8e-05,3.6e-05,1.2e-05,1.4e-05,5.7e-05,8.9e-05,6.7e-05,3.5e-05,4.3e-05,2.1e-05,4.6e-05,4e-05,7.4e-05,7.4e-05,2.1e-05,2.8e-05,2.8e-05,9e-06,3.8e-05,2.2e-05,2.3e-05,6.1e-05,2.8e-05,3e-05,4.1e-05,7.6e-05,1.7e-05,1.7e-05,1.9e-05,2.3e-05,4.7e-05,9e-06,1.4e-05,1.4e-05,2.1e-05,1.1e-05,5e-05,9e-06,2.2e-05,7e-06,5.9e-05,3e-05,2.5e-05,5e-05,1.7e-05,2.7e-05,2.9e-05,2.7e-05,2.4e-05,2.7e-05,4.3e-05,3.1e-05,1.4e-05,7.4e-05,4e-05,3.6e-05,4.9e-05,1.2e-05,6.3e-05,4.5e-05,2.8e-05,2.1e-05,9e-06,1.2e-05,2.9e-05,2.6e-05,2.6e-05,3.5e-05,1.8e-05,1.3e-05,1.1e-05,2.8e-05,1.4e-05,2.4e-05,2.5e-05,3.1e-05,2e-05,1.5e-05,2.1e-05,2.3e-05,2.6e-05,2.1e-05,8e-06,2.1e-05,2.4e-05
6.8e-05,5.6e-05,2.2e-05,1.9e-05,3e-05,1.9e-05,6.5e-05,1.4e-05,2.1e-05,1.6e-05,8.1e-05,1.9e-05,3.4e-05,1.2e-05,1.1e-05,3.7e-05,3.9e-05,1.9e-05,6.5e-05,5e-05,2.3e-05,5.7e-05,3.6e-05,4.8e-05,3.6e-05,3e-06,2.8e-05,4.9e-05,1.5e-05,3.4e-05,2.5e-05,5.4e-05,5.5e-05,3.2e-05,1.6e-05,3.5e-05,2.3e-05,2.5e-05,2.9e-05,2.5e-05,5.1e-05,1e-04,5.3e-05,7.7e-05,3.4e-05,3e-06,3.8e-05,2.4e-05,6.1e-05,8.6e-05,1.1e-05,2.9e-05,4e-06,1.8e-05,3.4e-05,5e-06,3.6e-05,4.3e-05,2.4e-05,2.1e-05,3.7e-05,6e-05,2.1e-05,2.6e-05,1.8e-05,1.5e-05,4.3e-05,6e-06,2.3e-05,2.6e-05,2.8e-05,2.5e-05,5e-05,2.2e-05,3.2e-05,6e-06,6.3e-05,3.2e-05,2.8e-05,6.2e-05,3.7e-05,2.3e-05,2.9e-05,1.3e-05,2.6e-05,1.7e-05,4.5e-05,2.8e-05,2.4e-05,8.7e-05,8.7e-05,5.8e-05,6.7e-05,3.6e-05,5.2e-05,3.9e-05,2.1e-05,2.5e-05,1.2e-05,1.3e-05,2.3e-05,1.6e-05,1.5e-05,3.6e-05,1.4e-05,6e-06,2.6e-05,3.6e-05,5e-06,2.2e-05,1.2e-05,2.1e-05,1.8e-05,2.1e-05,2.8e-05,2.9e-05,3.7e-05,2.2e-05,2.6e-05,2e-05,1.4e-05
9.1e-05,0.000109,0.000105,8.9e-05,3.5e-05,3.5e-05,1.3e-05,7.1e-05,3.4e-05,6.1e-05,8.8e-05,6.4e-05,3.7e-05,1.6e-05,3.7e-05,2.5e-05,4.9e-05,6.2e-05,6.4e-05,6.3e-05,2.4e-05,5.5e-05,4.3e-05,3.5e-05,5e-06,3.4e-05,6.3e-05,7.1e-05,4.3e-05,5.2e-05,6.4e-05,1.8e-05,7.5e-05,3.6e-05,6.9e-05,9e-05,6.6e-05,5.4e-05,4.6e-05,1.1e-05,5.9e-05,8.9e-05,7.8e-05,7.9e-05,6.4e-05,1.4e-05,2.8e-05,3.4e-05,7.2e-05,6.4e-05,4.8e-05,3.2e-05,2.3e-05,2.3e-05,3.1e-05,2.3e-05,3.7e-05,3.3e-05,2.8e-05,4e-05,1.1e-05,6.8e-05,3.8e-05,5.9e-05,4.4e-05,5e-05,4.7e-05,2e-05,2.9e-05,2.8e-05,1.1e-05,5.6e-05,5.5e-05,4e-05,6.3e-05,2.8e-05,3.8e-05,7.7e-05,2.2e-05,4.2e-05,2.9e-05,1.8e-05,2.3e-05,4e-06,3.1e-05,4.2e-05,2.5e-05,1.5e-05,2.4e-05,0.000106,2.8e-05,5.5e-05,9.2e-05,4.6e-05,4.2e-05,4.2e-05,1.6e-05,2.6e-05,1.5e-05,3.7e-05,4.3e-05,8e-06,3.2e-05,3.9e-05,1.6e-05,6e-06,1.7e-05,2.1e-05,2.5e-05,4.5e-05,5.9e-05,6.7e-05,9e-06,3e-05,2.6e-05,1.7e-05,2.6e-05,3.3e-05,1.8e-05,3.9e-05,2.4e-05
4.3e-05,5e-05,1.2e-05,2.4e-05,1.6e-05,4.5e-05,4.4e-05,2.5e-05,1.7e-05,4.2e-05,5.3e-05,1.6e-05,1e-05,3e-06,3.6e-05,3.3e-05,2.6e-05,4.3e-05,2.2e-05,4.8e-05,2e-05,1e-05,4.5e-05,3.4e-05,7e-06,4.4e-05,2.3e-05,3.7e-05,3e-05,3.3e-05,5.2e-05,6.7e-05,2.9e-05,6.2e-05,1.4e-05,3.8e-05,2.6e-05,3.4e-05,1.7e-05,3.3e-05,4.9e-05,2.5e-05,6.2e-05,3.8e-05,1.8e-05,2e-05,4e-06,1.2e-05,2.9e-05,5.8e-05,3.8e-05,1.6e-05,1.1e-05,2.3e-05,5.9e-05,2.7e-05,5.6e-05,1.1e-05,4.2e-05,5.8e-05,3.2e-05,4.4e-05,5e-05,6.8e-05,4e-05,8e-06,5.5e-05,1.4e-05,3.3e-05,4.8e-05,4.1e-05,4.9e-05,3.4e-05,6.4e-05,1.9e-05,1.6e-05,5.3e-05,1e-04,7.5e-05,4.7e-05,6.7e-05,2.7e-05,2e-05,2e-05,3.7e-05,5e-05,5.8e-05,2.5e-05,2.3e-05,5.8e-05,2.6e-05,4.3e-05,2.4e-05,2.8e-05,7.2e-05,5.2e-05,3.3e-05,2.5e-05,2.6e-05,3e-05,1.8e-05,2e-05,3.2e-05,2.4e-05,3e-05,9e-06,1.4e-05,2e-05,2.3e-05,5.8e-05,4.1e-05,2.8e-05,1.9e-05,5.3e-05,1.6e-05,2.2e-05,2.2e-05,1.2e-05,1e-05,4e-05,2.3e-05
2e-05,1e-05,1.5e-05,3.1e-05,1.7e-05,4.8e-05,2e-05,2.4e-05,1.1e-05,1.2e-05,2.5e-05,2.1e-05,1.7e-05,1.7e-05,1.8e-05,3.1e-05,1.2e-05,1.8e-05,1.6e-05,3.2e-05,1.6e-05,1.9e-05,5.4e-05,5e-05,1.8e-05,4e-05,2.3e-05,1e-05,1.5e-05,1.1e-05,3.3e-05,4e-05,2.5e-05,2.7e-05,2e-05,3.4e-05,6e-06,4.2e-05,2.1e-05,2.6e-05,2.2e-05,6e-05,8.6e-05,4.5e-05,4.8e-05,7e-06,2.6e-05,3.2e-05,7.3e-05,4.2e-05,1e-05,2.4e-05,1.7e-05,7e-06,3.1e-05,1.3e-05,3.4e-05,4.7e-05,2e-05,4.6e-05,1.4e-05,5e-05,1.5e-05,2.1e-05,2.3e-05,2.6e-05,3.8e-05,2.2e-05,2.4e-05,8e-06,2.2e-05,8e-06,2.9e-05,3.5e-05,2.5e-05,2.4e-05,4e-05,3.5e-05,4.9e-05,3.6e-05,3.2e-05,4.5e-05,2.9e-05,2.3e-05,3e-06,2.9e-05,1.7e-05,5.1e-05,2.5e-05,5.6e-05,3e-05,5e-06,1.9e-05,1.6e-05,5.3e-05,5.2e-05,1.3e-05,3e-05,1.7e-05,1.1e-05,7e-06,7e-06,1.7e-05,2.1e-05,1.1e-05,2.7e-05,5e-06,1e-05,1.8e-05,4.7e-05,3.3e-05,1.8e-05,2.6e-05,2.2e-05,1.1e-05,1.6e-05,1e-05,8e-06,1.4e-05,2.5e-05,5e-06
4e-05,1.2e-05,1.2e-05,6.1e-05,3.1e-05,2.9e-05,5.4e-05,2.5e-05,4e-06,1.4e-05,3e-05,1.6e-05,2.3e-05,3.2e-05,2.3e-05,2e-05,2.7e-05,3e-05,2.6e-05,2.5e-05,7e-06,3.4e-05,2.9e-05,3.5e-05,8e-06,1.5e-05,1.8e-05,2.3e-05,2e-05,1e-05,4e-06,2.9e-05,2e-05,2.8e-05,5e-06,2.8e-05,2.2e-05,1.8e-05,2.1e-05,5e-06,3.9e-05,5.5e-05,7.3e-05,1e-05,2.3e-05,1.7e-05,2.9e-05,1.8e-05,7.9e-05,4.5e-05,5e-06,3.7e-05,2.1e-05,2.4e-05,1.9e-05,2.2e-05,2.7e-05,6.1e-05,3.3e-05,2.6e-05,4.4e-05,6.9e-05,1.1e-05,2e-05,4.7e-05,3.8e-05,3.2e-05,3.4e-05,1.4e-05,1.5e-05,5.7e-05,1.1e-05,2.3e-05,1.1e-05,4e-06,2.2e-05,2.5e-05,4.7e-05,6.3e-05,3.2e-05,7e-06,1.7e-05,2.1e-05,3.5e-05,3.1e-05,2.1e-05,1.1e-05,2.7e-05,8e-06,7.9e-05,1.1e-05,1.4e-05,1.8e-05,4.3e-05,3.5e-05,4.8e-05,1e-05,1.9e-05,1.9e-05,1.5e-05,3e-06,6e-06,2.6e-05,1.1e-05,1.4e-05,1.6e-05,1.2e-05,1.2e-05,2.2e-05,3.5e-05,3.1e-05,1.3e-05,1.7e-05,3.6e-05,1.5e-05,1.8e-05,2.2e-05,9e-06,1.6e-05,1.5e-05,1.1e-05
5.1e-05,1.9e-05,1.1e-05,6.6e-05,4.9e-05,2.5e-05,7.5e-05,5.4e-05,3e-05,4.5e-05,5.3e-05,1.8e-05,4.1e-05,4.1e-05,5.1e-05,3.5e-05,2.4e-05,2.6e-05,3.9e-05,7.9e-05,5.8e-05,7.4e-05,1.2e-05,2.8e-05,6e-06,3.4e-05,3.2e-05,2.6e-05,4.4e-05,6.3e-05,4.7e-05,8.1e-05,1.3e-05,1.8e-05,1.2e-05,2.6e-05,2.2e-05,6.5e-05,4.4e-05,1.3e-05,3.4e-05,8.6e-05,6.5e-05,2e-05,2.5e-05,3.7e-05,2.8e-05,3.5e-05,3.7e-05,5.7e-05,3.4e-05,5.1e-05,3e-05,4.4e-05,2.2e-05,3.5e-05,5.7e-05,8.1e-05,5.1e-05,8.2e-05,4.9e-05,6.7e-05,3e-05,3.4e-05,4.4e-05,3.8e-05,6.1e-05,3.6e-05,6e-06,2.4e-05,7.5e-05,6.5e-05,4.8e-05,1.6e-05,9e-06,2e-05,2.2e-05,2.3e-05,5.8e-05,0.000102,4.9e-05,4.2e-05,6.1e-05,5.6e-05,4.7e-05,2.4e-05,3.8e-05,4e-05,4.2e-05,0.000104,3.2e-05,2.4e-05,3.9e-05,8.6e-05,7.2e-05,4.8e-05,1.3e-05,3.5e-05,2e-05,5e-06,2.5e-05,1e-05,3.1e-05,2.2e-05,5.2e-05,4.8e-05,1.4e-05,3.9e-05,5.8e-05,6.5e-05,3.2e-05,1e-06,3.3e-05,2.5e-05,1.4e-05,3.3e-05,3.5e-05,1.7e-05,3e-05,4.1e-05,2.8e-05
2.3e-05,6.1e-05,3e-05,3.1e-05,2e-05,3.9e-05,4.6e-05,7e-05,3.5e-05,5.9e-05,7.5e-05,8e-05,4.1e-05,9.1e-05,5e-05,9e-06,1.6e-05,2.7e-05,5.3e-05,4e-05,3.3e-05,5.9e-05,8.4e-05,4.7e-05,1.5e-05,4.2e-05,4.5e-05,7.3e-05,3.7e-05,7.3e-05,7.9e-05,4.9e-05,1.5e-05,2.1e-05,2.4e-05,6.4e-05,4.7e-05,9.4e-05,0.000106,5.8e-05,5.2e-05,1e-04,6.5e-05,3.6e-05,5.2e-05,4.1e-05,5.9e-05,7.4e-05,6.5e-05,1.8e-05,4.8e-05,0.000104,8.5e-05,2.7e-05,6.1e-05,1.4e-05,5.2e-05,0.000104,4.9e-05,9.2e-05,4.9e-05,3.7e-05,8.1e-05,7.3e-05,8.5e-05,7.3e-05,1.5e-05,4.2e-05,5.2e-05,3.5e-05,9.3e-05,7.3e-05,6.5e-05,2.3e-05,2.5e-05,4e-05,3.1e-05,5.7e-05,8.1e-05,0.00011,6.8e-05,3.1e-05,4.9e-05,3.7e-05,5.6e-05,3.9e-05,4.5e-05,3.3e-05,7.4e-05,5.6e-05,4e-05,3.2e-05,8e-06,8.3e-05,5.6e-05,6.5e-05,6.6e-05,2.9e-05,2e-06,1.5e-05,3.3e-05,4e-06,1.7e-05,4.4e-05,3.7e-05,3.9e-05,3.7e-05,3e-05,5.9e-05,2.6e-05,3.4e-05,2e-05,6e-05,5.4e-05,2.2e-05,2.4e-05,4.3e-05,4.8e-05,4.1e-05,4e-05,1.1e-05
2.1e-05,6.8e-05,4.8e-05,3.2e-05,2.6e-05,3.7e-05,4.1e-05,3.9e-05,2.9e-05,3.9e-05,7.9e-05,6.6e-05,3.8e-05,6e-05,5e-05,3.1e-05,2.8e-05,2.3e-05,4.8e-05,5.4e-05,7.9e-05,9e-05,9.7e-05,6.8e-05,5.3e-05,1.3e-05,1.2e-05,3.4e-05,6.8e-05,2.1e-05,1.7e-05,2.5e-05,4.4e-05,2.6e-05,4.5e-05,6.5e-05,6.5e-05,0.000117,3.1e-05,2.5e-05,3.8e-05,6.4e-05,6.3e-05,1.7e-05,2.8e-05,3.7e-05,3.2e-05,1e-05,7.9e-05,6.7e-05,7.1e-05,5.2e-05,1.3e-05,6e-05,6.9e-05,6e-05,4.2e-05,3.2e-05,5e-05,4.8e-05,5.7e-05,2.5e-05,4.9e-05,2.5e-05,1.1e-05,3.9e-05,3.6e-05,4e-05,2.4e-05,2.5e-05,6e-05,1.2e-05,2.2e-05,1.9e-05,7e-06,3.2e-05,3.1e-05,6.4e-05,2e-05,2.8e-05,4.7e-05,8.3e-05,3.2e-05,2.4e-05,4.8e-05,2.6e-05,1.5e-05,3.3e-05,3.4e-05,4.8e-05,8.1e-05,5.4e-05,6.5e-05,2.5e-05,4.7e-05,1.3e-05,1.4e-05,2.5e-05,3.7e-05,5.2e-05,3.2e-05,2.7e-05,1.4e-05,2.7e-05,5.7e-05,3.3e-05,2.2e-05,3e-05,2.5e-05,2.7e-05,3.4e-05,3.2e-05,3.6e-05,1.4e-05,3.5e-05,3.5e-05,2.3e-05,1.5e-05,1.2e-05,3.1e-05,3e-06
2.7e-05,2.8e-05,2.9e-05,1.4e-05,7e-06,3.4e-05,4.9e-05,1.8e-05,1.4e-05,2.9e-05,3.3e-05,2.9e-05,1.7e-05,3.7e-05,2.2e-05,2.3e-05,4e-06,2.7e-05,2e-05,2.1e-05,2.7e-05,2.3e-05,3e-05,3.5e-05,1.5e-05,2.4e-05,9e-06,1.7e-05,6e-06,2e-05,2e-05,5.1e-05,1.1e-05,2.6e-05,2.2e-05,2.6e-05,3.5e-05,4.3e-05,1e-06,8e-06,2.3e-05,4.3e-05,6.4e-05,1.7e-05,2.4e-05,2.4e-05,2e-05,1.6e-05,4.8e-05,7e-05,3.3e-05,1.6e-05,5e-06,2.4e-05,2.6e-05,3.3e-05,8e-06,5e-06,1.1e-05,3.7e-05,3.7e-05,2.2e-05,2.2e-05,1.5e-05,1.4e-05,2.2e-05,2.5e-05,9e-06,1.6e-05,1.5e-05,1.3e-05,6e-06,2e-06,5e-06,1.5e-05,1.7e-05,2.5e-05,3.9e-05,1.7e-05,1e-05,4.3e-05,1.5e-05,2.4e-05,3.3e-05,2.3e-05,1.6e-05,2.5e-05,1e-05,2.3e-05,2.8e-05,2.8e-05,1.4e-05,4.4e-05,1.8e-05,3e-05,2.7e-05,1.7e-05,1.9e-05,3.2e-05,2.3e-05,1.5e-05,8e-06,4e-06,1e-05,3.2e-05,6e-06,1.8e-05,2.5e-05,1.2e-05,2.3e-05,2.3e-05,2.6e-05,1.5e-05,9e-06,1.4e-05,1.5e-05,1e-05,1.3e-05,7e-06,2.7e-05,1.8e-05
1e-05,9e-06,1.2e-05,1.2e-05,4e-06,4.5e-05,3.8e-05,3e-06,5e-06,2.1e-05,3e-05,3.2e-05,2.2e-05,1.5e-05,2.6e-05,1.7e-05,7e-06,2.6e-05,7e-06,1.5e-05,1.2e-05,2.1e-05,1.3e-05,2.2e-05,8e-06,9e-06,2e-06,1.3e-05,2.2e-05,1.5e-05,2.9e-05,4.5e-05,2.1e-05,3e-05,2.3e-05,3.6e-05,6e-06,4.5e-05,3e-06,6e-06,2.7e-05,5.6e-05,4.3e-05,8e-06,2.2e-05,6e-06,1.2e-05,8e-06,5.6e-05,5.9e-05,1.6e-05,4e-06,1e-05,2.4e-05,3.2e-05,2e-05,0,3e-06,1e-05,4.7e-05,4e-05,4e-05,1.8e-05,1.3e-05,1.8e-05,1.5e-05,3.9e-05,9e-06,2e-06,1.2e-05,1.9e-05,1e-05,1.6e-05,1e-05,1.5e-05,1.4e-05,2.2e-05,3.2e-05,7e-06,2.1e-05,4.2e-05,4.7e-05,0,1.6e-05,1.6e-05,1.1e-05,2.5e-05,1.2e-05,1e-06,2.4e-05,1.9e-05,8e-06,3.4e-05,1.4e-05,3.2e-05,2.1e-05,8e-06,1.6e-05,1.7e-05,1.2e-05,1.2e-05,4e-06,9e-06,1.2e-05,2.6e-05,1.4e-05,1.7e-05,1.9e-05,8e-06,2.6e-05,1.3e-05,2.4e-05,1e-05,1e-06,6e-06,1e-05,1.8e-05,1.9e-05,1.1e-05,1.9e-05,1.1e-05
3e-06,7e-06,1.9e-05,1e-05,1.6e-05,3.4e-05,3.3e-05,8e-06,6e-06,1.4e-05,2.8e-05,1.4e-05,1.3e-05,3e-06,1.3e-05,1.4e-05,1e-06,9e-06,1e-05,1e-05,1.2e-05,1.1e-05,2.6e-05,3.3e-05,9e-06,9e-06,1e-05,2.1e-05,1.2e-05,1.1e-05,2.4e-05,3.5e-05,1.1e-05,2.6e-05,8e-06,3.2e-05,1.1e-05,2.8e-05,1e-06,6e-06,2.2e-05,5.1e-05,5e-05,8e-06,1.9e-05,1e-06,5e-06,1e-05,6e-05,6.5e-05,1.2e-05,6e-06,8e-06,1.5e-05,1.8e-05,4e-06,1.6e-05,1.6e-05,1.1e-05,3.4e-05,3.2e-05,3.3e-05,2e-05,1.7e-05,5e-06,1.7e-05,4.2e-05,1.1e-05,7e-06,1.3e-05,1.6e-05,1.3e-05,2.1e-05,6e-06,2.1e-05,1e-05,1.7e-05,3.2e-05,6e-06,2.5e-05,4e-05,3.1e-05,1e-05,1.5e-05,1.5e-05,8e-06,1.9e-05,2e-05,1.3e-05,3.5e-05,9e-06,1.4e-05,4.1e-05,1e-06,3.5e-05,2.8e-05,1.4e-05,1.1e-05,1.4e-05,5e-06,1.1e-05,8e-06,1.1e-05,8e-06,1.6e-05,5e-06,1.1e-05,2.7e-05,2e-06,2.1e-05,5e-06,2.5e-05,8e-06,9e-06,5e-06,5e-06,1e-05,1.2e-05,4e-06,2.3e-05,5e-06
6e-06,4e-06,1.8e-05,7e-06,1.8e-05,4.1e-05,4e-05,1.6e-05,1.1e-05,2.3e-05,1.7e-05,1.4e-05,1.7e-05,1.7e-05,2e-05,2.5e-05,9e-06,2.1e-05,8e-06,1.2e-05,1.3e-05,1.3e-05,2.8e-05,2.2e-05,9e-06,1.3e-05,1.2e-05,7e-06,1.5e-05,1.6e-05,1.8e-05,4e-05,1e-05,1.6e-05,3e-06,2.9e-05,1.1e-05,3e-05,1.6e-05,1.6e-05,1.9e-05,5.4e-05,4.9e-05,6e-06,1.9e-05,7e-06,9e-06,1.5e-05,6.3e-05,6.1e-05,1.8e-05,6e-06,9e-06,1.2e-05,1.3e-05,1.7e-05,7e-06,7e-06,1.1e-05,4.2e-05,2.4e-05,2.6e-05,1.6e-05,2e-05,9e-06,1.6e-05,3.5e-05,7e-06,9e-06,5e-06,1.4e-05,1.4e-05,1.7e-05,5e-06,1.4e-05,4e-06,2.8e-05,3.2e-05,8e-06,1.6e-05,2.6e-05,2.9e-05,7e-06,1.1e-05,1.4e-05,3e-06,2.2e-05,4e-06,1e-06,4.1e-05,1.9e-05,1.2e-05,3.1e-05,8e-06,3.9e-05,1.9e-05,2.2e-05,8e-06,1.8e-05,1e-05,1.3e-05,3e-06,7e-06,1e-05,1.4e-05,8e-06,6e-06,1.5e-05,1.1e-05,1.9e-05,9e-06,1.2e-05,4e-06,1.5e-05,6e-06,1.1e-05,1.3e-05,1.2e-05,0,1.9e-05,1.3e-05
9e-06,9e-06,1.4e-05,1.1e-05,2.1e-05,2.4e-05,3.8e-05,2e-06,7e-06,1.8e-05,2.5e-05,2.7e-05,3.7e-05,4e-06,2.3e-05,1.4e-05,4e-06,2.5e-05,1.2e-05,1.9e-05,1.3e-05,7e-06,3.2e-05,3.8e-05,2.1e-05,1.6e-05,1.2e-05,1.5e-05,1.9e-05,1.1e-05,2.4e-05,3.8e-05,7e-06,2.9e-05,8e-06,2.5e-05,8e-06,2.2e-05,2.3e-05,1.3e-05,3e-05,6.4e-05,5.6e-05,9e-06,2.3e-05,1e-05,6e-06,5e-06,5.8e-05,5.4e-05,2.3e-05,9e-06,6e-06,1.9e-05,2.2e-05,1.5e-05,7e-06,7e-06,1.9e-05,3.2e-05,3.2e-05,3.7e-05,1.9e-05,2.5e-05,1.3e-05,1.5e-05,3.1e-05,1.3e-05,1.1e-05,9e-06,1e-05,2.2e-05,1.9e-05,5e-06,1.5e-05,1.4e-05,2.4e-05,3.9e-05,1e-06,1.8e-05,1.4e-05,1.8e-05,1e-05,1.3e-05,1.4e-05,8e-06,2.2e-05,6e-06,4e-06,3.7e-05,2e-05,1.4e-05,3.2e-05,8e-06,4e-05,1.7e-05,9e-06,1.3e-05,1.2e-05,1e-05,1.2e-05,1e-06,5e-06,1.4e-05,1.5e-05,8e-06,9e-06,1.2e-05,2e-06,1.7e-05,7e-06,2e-05,1e-05,1.5e-05,6e-06,1.7e-05,1.4e-05,8e-06,8e-06,2.1e-05,1.2e-05
1.5e-05,1.6e-05,2.2e-05,1.2e-05,1.5e-05,3.8e-05,2.8e-05,3e-06,1.1e-05,2.4e-05,3.1e-05,1.7e-05,2.9e-05,1.8e-05,2.3e-05,1.7e-05,1e-06,1.4e-05,2.1e-05,2e-05,1.5e-05,6e-06,3.1e-05,3.2e-05,7e-06,1e-05,2.3e-05,1.8e-05,1.9e-05,5e-06,1.8e-05,3.8e-05,7e-06,2.9e-05,6e-06,2.6e-05,2e-06,2.9e-05,8e-06,3e-06,3.7e-05,4.6e-05,3.8e-05,1.2e-05,0,1.5e-05,5e-06,9e-06,5e-05,3.8e-05,6e-06,1.4e-05,1.1e-05,1.9e-05,1.8e-05,2.1e-05,2e-06,1.5e-05,1.2e-05,2.8e-05,3.3e-05,2.8e-05,2.1e-05,1.5e-05,1.9e-05,3.2e-05,2.9e-05,1.3e-05,7e-06,8e-06,2.2e-05,2e-06,2e-05,4e-06,1.7e-05,1.2e-05,7e-06,3.1e-05,8e-06,1.9e-05,1.9e-05,1.4e-05,8e-06,1e-05,7e-06,8e-06,3.5e-05,1.3e-05,4e-06,4.3e-05,2.3e-05,8e-06,4.1e-05,1.4e-05,3.9e-05,1.8e-05,1.3e-05,1.8e-05,1.3e-05,2e-06,6e-06,3e-06,8e-06,1e-05,8e-06,1.3e-05,1.5e-05,1.6e-05,4e-06,2.2e-05,1.3e-05,2.2e-05,4e-06,1.6e-05,8e-06,1.3e-05,1.8e-05,1.5e-05,1.4e-05,1.4e-05,1e-05
5e-06,4e-06,6e-06,1.8e-05,1.2e-05,3.8e-05,2.7e-05,1.2e-05,3e-06,2.6e-05,2.2e-05,1.7e-05,2.9e-05,1.3e-05,9e-06,1.6e-05,1.3e-05,1.6e-05,1.2e-05,1.9e-05,1.1e-05,1.6e-05,3.1e-05,2.5e-05,2e-06,1.2e-05,1.8e-05,8e-06,1.6e-05,4e-06,2.6e-05,2.5e-05,1.1e-05,1.5e-05,3e-06,2.6e-05,7e-06,2.1e-05,2.1e-05,1.2e-05,2.7e-05,4.5e-05,3.6e-05,5e-06,9e-06,1.2e-05,7e-06,5e-06,4.3e-05,4.1e-05,1.2e-05,1e-05,6e-06,2e-06,2e-05,1.2e-05,8e-06,9e-06,1.1e-05,2.9e-05,2.8e-05,3.2e-05,2.5e-05,1.1e-05,6e-06,1.7e-05,4e-05,1.2e-05,4e-06,7e-06,1.7e-05,4e-06,1.9e-05,6e-06,1.3e-05,7e-06,2.1e-05,2.9e-05,2e-06,1e-05,1e-05,2.5e-05,4e-06,7e-06,9e-06,7e-06,2.6e-05,1.1e-05,7e-06,4.1e-05,1.3e-05,3e-06,4e-05,1.3e-05,3.6e-05,2e-05,1.3e-05,1.3e-05,1e-05,8e-06,1.4e-05,1e-06,6e-06,1.3e-05,1.1e-05,1e-05,1.1e-05,1e-05,8e-06,2e-05,7e-06,2.5e-05,5e-06,9e-06,1e-06,2e-06,1.3e-05,1.8e-05,3e-06,1.4e-05,9e-06
1e-05,8e-06,1.3e-05,8e-06,1.3e-05,3e-05,3.3e-05,5e-06,8e-06,2.2e-05,2.2e-05,1.5e-05,2.1e-05,1.6e-05,1.6e-05,1.6e-05,1.2e-05,1e-05,7e-06,1.7e-05,1e-06,7e-06,2.7e-05,2.5e-05,2e-06,7e-06,1.6e-05,1.4e-05,1.2e-05,8e-06,2.5e-05,2.8e-05,4e-06,1.8e-05,1e-06,2.9e-05,9e-06,3.3e-05,1.6e-05,4e-06,2.3e-05,4.6e-05,3.7e-05,4e-06,1.2e-05,1e-05,7e-06,6e-06,4.9e-05,3.8e-05,3e-06,4e-06,9e-06,1e-06,2.2e-05,1.1e-05,1e-05,1.3e-05,1.1e-05,2.8e-05,2.5e-05,3.7e-05,1.5e-05,1.5e-05,2e-06,1.5e-05,3.1e-05,1e-05,5e-06,8e-06,9e-06,1.2e-05,2e-05,2e-06,1.7e-05,1e-06,2.2e-05,2.7e-05,8e-06,1.2e-05,9e-06,1.7e-05,4e-06,1.3e-05,1e-05,7e-06,2.8e-05,7e-06,2e-06,3.1e-05,2.3e-05,1.5e-05,4e-05,5e-06,3.7e-05,2.3e-05,1.3e-05,1.5e-05,1e-05,9e-06,9e-06,2e-06,6e-06,1.7e-05,8e-06,9e-06,7e-06,9e-06,2e-06,2.5e-05,1.3e-05,2.2e-05,6e-06,1.6e-05,3e-06,3e-06,1.2e-05,1.4e-05,4e-06,1.5e-05,8e-06
4e-06,3e-06,1.1e-05,1e-05,1.2e-05,3.3e-05,2.8e-05,2e-06,6e-06,2e-05,2.2e-05,1.3e-05,2e-05,1.3e-05,1.3e-05,1.5e-05,9e-06,1.5e-05,1.2e-05,1.9e-05,9e-06,6e-06,2.5e-05,2.2e-05,7e-06,7e-06,1.4e-05,1.1e-05,1.1e-05,6e-06,2.3e-05,2.9e-05,3e-06,1.9e-05,0,2.8e-05,4e-06,3e-05,1.3e-05,5e-06,2.3e-05,5e-05,4.1e-05,2e-06,1.3e-05,8e-06,5e-06,5e-06,4.9e-05,4.2e-05,7e-06,5e-06,6e-06,3e-06,2.2e-05,1e-05,9e-06,1.4e-05,1e-05,2.8e-05,2.9e-05,3.3e-05,1.5e-05,1.5e-05,4e-06,1.3e-05,3.2e-05,8e-06,1e-06,9e-06,1.3e-05,9e-06,1.8e-05,4e-06,1.6e-05,4e-06,2.6e-05,2.7e-05,3e-06,1.6e-05,1e-05,2.2e-05,4e-06,1.3e-05,1.2e-05,5e-06,2.9e-05,9e-06,4e-06,3.4e-05,2.1e-05,9e-06,3.3e-05,5e-06,3.7e-05,1.9e-05,1.4e-05,1.3e-05,1.3e-05,5e-06,1e-05,1e-06,7e-06,1.5e-05,1.3e-05,9e-06,8e-06,9e-06,2e-06,2.5e-05,1e-05,2e-05,5e-06,1.6e-05,3e-06,3e-06,1.2e-05,1.1e-05,4e-06,1.4e-05,8e-06
2e-06,2e-06,1.1e-05,8e-06,8e-06,3.2e-05,3.2e-05,3e-06,4e-06,2.1e-05,2.3e-05,1.3e-05,2e-05,1.3e-05,1.6e-05,1.5e-05,6e-06,7e-06,1.5e-05,1.2e-05,7e-06,6e-06,2.5e-05,2.5e-05,6e-06,5e-06,1.4e-05,9e-06,1.3e-05,7e-06,2.3e-05,3e-05,2e-06,2e-05,1e-06,2.6e-05,4e-06,2.8e-05,1.1e-05,3e-06,2.4e-05,4.7e-05,4.2e-05,2e-06,9e-06,8e-06,6e-06,3e-06,5e-05,4.3e-05,7e-06,3e-06,9e-06,4e-06,2e-05,1.3e-05,5e-06,1.2e-05,1e-05,3e-05,2.5e-05,3.4e-05,1.4e-05,1.6e-05,5e-06,1.3e-05,3.4e-05,7e-06,2e-06,1e-05,1.2e-05,8e-06,1.7e-05,5e-06,1.6e-05,5e-06,2.5e-05,2.8e-05,0,1.2e-05,5e-06,2e-05,2e-06,1e-05,9e-06,2e-06,2.7e-05,7e-06,4e-06,3.3e-05,1.8e-05,1e-05,3.1e-05,3e-06,3.6e-05,2.1e-05,1.2e-05,1.2e-05,1.1e-05,6e-06,1.2e-05,0,6e-06,1.6e-05,1.1e-05,9e-06,1e-05,9e-06,1e-06,2.5e-05,1.1e-05,2.1e-05,4e-06,1.3e-05,2e-06,3e-06,1e-05,1.3e-05,1e-06,1.4e-05,7e-06
