-0.00334,-0.001851,-0.00302,-0.002077,-0.002812,-0.002427,-0.001791,-0.002516,-0.00118,-0.002192,-0.00309,-0.002501,-0.001558,-0.002945,-0.002281,-0.003025,-0.002111,-0.003203,-0.002023,-0.001307,-0.0027,-0.002224,-0.002173,-0.001558,-0.00107,-0.001849,-0.003259,-0.002457,-0.002012,-0.00249,-0.002849,-0.002199,-0.002995,-0.002041,-0.00135,-0.002321,-0.001903,-0.002643,-0.001754,-0.001575,-0.001974,-0.001591,-0.00142,-0.001411,-0.0011,-0.001447,-0.002053,-0.002434,-0.001814,-0.002909,-0.002816,-0.002871,-0.002293,-0.002068,-0.001538,-0.002409,-0.002614,-0.00261,-0.002321,-0.000658,-0.001933,-0.002597,-0.002446,-0.004222,-0.002642,-0.001698,-0.000843,-0.002296,-0.002309,-0.001865,-0.001076,-0.00156,-0.00143,-0.002048,-0.001447,-0.000329,-0.001746,-0.001488,-0.00144,-0.001299,-0.000867,-0.000911,-0.001289,-0.000698,-0.001697,-0.001207,-0.00146,-0.001628,-0.002084,-0.001209,-0.000784,-0.000473,-0.002419,-0.002722,-0.001908,-0.001958,-0.001686,-0.001082,-0.001344,-0.001435,-0.000867,-0.001027,-0.002071,-0.002486,-0.001832,-0.000658,-0.000594,-0.000927,-0.001469,-0.001828,-0.001621,-0.001067,-0.000563,-0.002054,-0.001951,-0.001366,-0.001072,-0.001235,-0.00128,-0.001761,-0.000823
0.001472,0.000434,0.001254,0.000855,0.000554,0.000928,0.000268,0.001259,0.000514,0.000666,0.001958,0.000799,0.000523,0.001132,0.001023,0.001294,0.000384,0.00174,0.000929,0.000375,0.001458,0.001103,0.000754,1e-04,-3.3e-05,0.001004,0.002081,0.00127,0.000772,0.001462,0.001711,0.000346,0.001484,0.000644,0.000344,0.000843,0.000681,0.000654,0.00043,0.000177,0.000964,0.000827,0.000111,4.1e-05,0.000515,0.00023,0.001036,0.001318,0.000457,0.000975,0.00062,0.001257,0.000254,0.001012,0.000501,0.001829,0.001542,0.001346,0.001409,0.000211,0.00015,0.001155,0.000813,0.002404,0.001253,0.000691,0.000264,0.00044,0.001246,0.000492,0.000771,0.00046,0.00023,0.001099,0.000756,4e-05,0.000531,0.00077,0.000645,0.000363,0.000322,-1.4e-05,0.001281,0.000341,0.000452,0.000628,0.000793,0.000329,0.000829,0.000399,0.000116,8.1e-05,0.001591,0.001304,0.000754,0.001124,0.001037,0.000238,7.4e-05,0.000781,0.000308,-0.000175,0.000683,0.001268,0.000668,0.000747,-9.6e-05,0.000395,0.000241,0.000572,0.000725,0.00038,3.9e-05,0.001438,0.001314,0.000957,0.000359,0.000629,0.001188,0.000858,0.000254
-0.001235,-0.000493,-0.000917,-0.000525,3.6e-05,-0.000215,4e-06,-0.000401,-0.000172,-0.000155,-0.001799,-0.000952,-0.000713,-0.001429,-0.000684,-0.000914,0.000241,-0.001451,-0.000563,-1.1e-05,-0.001354,-0.000503,-0.000426,0.00017,-7.2e-05,-0.000848,-0.000856,-0.000527,-0.00027,-0.000579,-0.001049,0.00034,-0.001098,-0.00064,-0.00052,-0.000658,-0.000403,-0.000105,-0.000138,-0.00044,-0.000694,-0.000563,-3.7e-05,2e-05,-3e-04,0.000177,-0.000719,-0.001075,-0.00037,-0.000251,-0.000602,-0.0018,-0.000622,-0.000728,-0.00027,-0.001043,-0.001099,-0.000174,-0.000982,-0.000665,-0.000479,-0.000843,-0.00029,-0.001246,-0.000447,-0.000518,-0.000327,9.8e-05,-0.000962,-0.000684,0.000232,-2.1e-05,-0.000147,-0.001059,-0.001097,-0.000572,-0.000246,-8.9e-05,-0.000197,-0.000326,-0.000207,-2e-05,-0.000975,-0.000361,-0.000438,-0.000446,-0.000725,-0.000558,-0.000419,-0.000177,-0.000185,0.000103,-0.001089,-0.000267,-8.7e-05,-0.000941,-0.00055,-0.000343,2.9e-05,-0.000794,-0.000327,0.000199,-0.000507,-0.000731,-0.000257,-0.000223,-0.00016,-5.5e-05,5e-06,-0.000309,-0.000402,5.8e-05,3e-06,-0.000807,-0.001204,-0.000724,-0.000386,-0.000338,-0.000954,-0.000626,-0.000406
0.001068,0.000238,0.000471,-9e-05,-0.000165,-0.000348,-0.000568,-0.000489,-0.000204,-2.2e-05,0.000718,0.000571,0.000257,0.000801,-0.000301,0.000714,-0.000745,0.000388,0.000184,2.7e-05,0.00043,-0.000207,-0.000359,-0.000473,-0.000165,0.000335,-0.000212,-0.000199,-0.000788,-0.000151,0.000183,-0.000468,0.000409,0.000223,4e-05,3.3e-05,5.2e-05,-0.000343,-5e-06,0.000223,0.00042,-0.000148,-0.000143,-0.000167,-8.4e-05,-0.000465,0.000107,0.000404,0.000879,-0.000147,-2.5e-05,0.000905,0.000278,0.000287,-0.000547,0.000809,0.001004,-0.000346,0.000874,0.000248,0.000244,8.2e-05,5e-06,0.000219,-0.000358,-0.000104,-0.000187,-0.000488,0.000757,0.000559,-0.000864,-0.000689,-0.000186,0.000641,0.000722,0.000221,-0.000152,-0.00035,-0.000298,0.000216,-0.000203,-0.000318,0.000305,-5e-06,-0.000109,-4.9e-05,0.000425,0.000241,7.8e-05,-0.000482,0.000101,-0.000239,0.000653,-0.000366,-0.000593,0.000527,0.000244,0.000121,-0.000172,0.000397,0.000263,-0.000313,5.9e-05,-0.000161,-0.000147,-0.000734,-0.000487,-0.000254,-0.000269,-0.000479,-0.000122,-0.000103,-0.000125,0.000476,0.000681,-5.9e-05,-2.1e-05,0.000391,0.000717,0.000306,-0.000215
-0.001014,-1.8e-05,-0.000482,0.000551,-4.1e-05,0.000291,0.000434,0.000152,0.00044,0.00078,-5.1e-05,0.000334,-0.000398,-0.000286,0.001318,-0.000182,0.001187,-3.1e-05,-0.000384,-0.000207,-5.6e-05,0.00058,0.000349,0.000386,0.000277,-0.000321,-0.000254,0.000367,0.001016,0.000337,-0.000139,0.00031,-0.000264,-0.000105,0.000179,0.00052,0.000462,0.000502,-0.000318,-0.000336,-0.000348,0.000214,-4.4e-05,-5.2e-05,0.000238,0.000336,0.000266,-0.000631,-0.000847,2.4e-05,0.00038,0.000262,9.1e-05,0.000142,0.000547,-0.000563,-0.000671,-0.00015,-0.000396,-0.000478,-0.000312,0.000618,-7.4e-05,-0.000213,0.000114,-0.000355,-5.9e-05,0.000147,-0.000943,-0.000491,0.00053,0.000523,0.000109,-0.000236,-0.000385,2.6e-05,5.1e-05,1e-05,0.000402,-0.000146,0.00033,0.000366,-0.00038,0.000152,0.000464,7.6e-05,-0.000444,-0.000294,0.000111,0.000815,-0.000112,-6.1e-05,-0.000454,0.000485,0.000946,-0.000375,-0.000513,8.3e-05,-0.000174,-0.000355,-0.000119,-0.000123,0.000327,0.000611,0.000221,0.000222,-0.000158,-0.000106,-0.000172,0.00081,0.000292,-3.1e-05,-0.000124,-0.000275,-0.000643,0.000308,-0.000308,-0.000169,-0.000814,-0.000144,0.000229
0.000287,-0.00056,0.000178,-0.000526,0.000363,-2e-04,-0.000511,-0.000379,-0.000928,-0.00079,-0.000233,-0.000348,0.000575,0.000455,-0.000685,-0.000194,-0.00072,-0.000169,0.000368,0.000205,2e-06,-0.000854,0.000112,-0.000264,-0.000179,-8.2e-05,5.8e-05,-0.000691,-0.001163,-0.000709,0.000164,-0.000262,0.000455,0.00014,-0.000252,-0.000234,-0.000658,-0.000369,0.000388,0.00058,7.8e-05,-0.000141,0.000139,0.000231,-5.2e-05,-0.000232,-0.000302,0.000583,0.000511,-9.5e-05,0.000273,-0.000129,1.4e-05,-0.000462,-0.00051,0.000154,0.00022,0.00022,-0.000139,0.000154,-2e-05,-0.00067,-4.7e-05,-5.6e-05,-0.00059,0.000323,-0.000239,-1.9e-05,0.000873,0.000372,-0.000407,-0.000292,-0.000272,0.000309,0.00061,0.000238,6.3e-05,0.000143,-0.000334,-2.2e-05,-0.000215,-0.000141,-5.7e-05,-0.000116,-0.00034,-0.000473,5e-06,0.000562,-0.000199,-0.00034,-0.000119,0.00019,4.8e-05,-0.000573,-0.00062,-3.3e-05,0.000258,-0.000103,0.000466,0.000144,0.000131,-3.2e-05,-0.000385,-0.000493,-0.000423,5.6e-05,0.00011,0.000211,0.000513,-0.000428,-0.00046,-0.000211,0.000134,7.2e-05,0.000127,-0.000456,3.3e-05,7e-06,3.2e-05,-9.3e-05,-0.000318
0.000226,0.000849,4.4e-05,0.000415,-0.000222,0.000461,0.000432,0.000268,0.000683,9.6e-05,0.000255,-1e-06,-7.4e-05,-0.000167,-5.4e-05,0.000233,0.000531,4e-04,-0.000244,-0.000401,-0.000168,0.000798,0.000256,0.000222,0.000473,0.000112,0.000386,0.00078,0.000722,0.000588,-0.000487,0.000257,-0.000372,-0.000122,0.000324,0.000436,0.000255,0.000261,-0.000527,-0.000551,-4.8e-05,0.000159,-1.7e-05,-7.5e-05,0.000217,3.2e-05,0.000253,-0.000491,4e-05,4.9e-05,-0.000637,0.000487,0.000117,0.000435,0.000396,0.000282,-0.000206,-1e-05,0.000232,-7.6e-05,-4e-05,0.00029,4.3e-05,0.00052,0.000543,-0.000139,0.000299,8.8e-05,-0.000385,7.2e-05,1.4e-05,0.000263,0.000304,-4.1e-05,-0.000394,-6.1e-05,2.2e-05,-0.000138,0.000384,-0.000116,-0.000152,0.000123,0.000125,-5e-05,9.1e-05,0.000789,-6.3e-05,-0.000473,9.6e-05,0.000402,-6.9e-05,-1.2e-05,0.000217,0.000303,3.1e-05,0.000176,-8e-05,-1.7e-05,-0.000222,3.5e-05,7.2e-05,0.000119,0.000161,0.000325,0.000687,-2.8e-05,0.000299,-5.3e-05,-0.000443,6.2e-05,3e-04,0.000379,-0.000132,-0.000242,6.8e-05,0.000448,0.000355,2e-05,0.00029,5.5e-05,0.000604
-0.000435,-0.000722,-0.00018,-0.000295,6.7e-05,-0.000462,-0.000317,-5e-05,-0.00069,-0.000211,-0.000393,-3.8e-05,-1.8e-05,2.8e-05,-0.000251,-0.000146,-0.000573,-0.000264,0.000253,0.000177,0.000251,-0.000444,-0.000282,-0.000133,-0.000232,-0.000118,-0.00013,-0.000172,-0.000372,-0.000288,0.000736,4.7e-05,0.000108,9.2e-05,-0.000406,-0.000514,6.7e-05,-0.000291,0.000241,0.000387,-0.000239,-0.000191,0.000199,9.7e-05,-0.000205,1.3e-05,-0.00036,0.000342,-5.4e-05,-0.00015,0.000626,-0.00034,-0.00044,-0.000392,-0.000528,-0.000212,0.000368,-4.2e-05,-0.000196,0.000216,0.000176,-2.4e-05,-0.000131,-0.000653,-0.000543,5.3e-05,7.1e-05,-7.7e-05,-1.8e-05,-4e-06,8.7e-05,4.8e-05,-4.9e-05,-0.000287,3.3e-05,-0.000122,-3.8e-05,-7.6e-05,-0.000275,-2.3e-05,0.000226,0.000132,-0.00018,3.8e-05,5.6e-05,-0.000676,-0.000225,0.000505,0.000276,-0.000224,0.000203,-6.1e-05,-3e-05,-0.00016,0.00024,-0.000198,0.000145,-0.000121,6.1e-05,3e-06,1.7e-05,1.4e-05,5e-06,-0.00022,-0.000825,-4.6e-05,-8.3e-05,-0.000327,0.000369,0.000104,-6.8e-05,-0.000283,2.9e-05,5.1e-05,4.9e-05,-0.000586,-0.000171,1.1e-05,-0.000226,-0.000293,-0.000367
0.000192,0.000376,0.000202,0.000214,5e-06,8.2e-05,3.6e-05,-0.00015,0.000542,0.000233,0.000188,-0.000181,-0.000261,-0.000198,0.000288,5.5e-05,0.000358,0.000171,-9.9e-05,-6.3e-05,-9.8e-05,0.000424,0.000131,0.000342,7.4e-05,0.000172,2.8e-05,-0.00018,4.3e-05,0.000208,-0.000673,-0.000119,9.8e-05,-3.2e-05,0.000312,5.4e-05,-0.000211,0.000273,0.000215,-9e-05,0.000276,0.000168,-0.00015,-0.000204,5.9e-05,-3.6e-05,0.000179,-0.000392,-0.000176,0.000108,-0.000512,-2.2e-05,0.000515,5.7e-05,0.000493,0.000153,-0.000253,2e-04,0.000257,-0.000247,3e-06,0.000141,-4.1e-05,0.000307,0.000418,0.000224,0,-0.000226,0.000219,-0.000105,-2.7e-05,-0.000239,-0.000284,0.000186,5.5e-05,3.6e-05,-6.6e-05,2.7e-05,5.5e-05,-1e-05,-0.000114,-0.000107,0.000104,1.3e-05,-5.7e-05,8.2e-05,0.000195,-0.000423,-0.000155,-1e-05,-0.000204,8.8e-05,3.5e-05,0.000105,-0.000287,3.4e-05,-4.1e-05,-1.7e-05,-5.7e-05,-0.000118,-0.000255,-0.000107,-0.000166,0.000109,0.000503,0.000132,-0.000114,4.9e-05,-0.000166,-7e-05,-1.2e-05,0.000176,-3e-05,-5.3e-05,8e-06,0.000294,0.00014,-3.9e-05,0.000176,0.000363,6.5e-05
-6.7e-05,-0.000168,-0.000117,-0.00033,-4.5e-05,-8.5e-05,0.00013,0.000184,2.2e-05,2.3e-05,-2.9e-05,0.000351,0.000283,0.00017,-7.7e-05,-0.000134,-0.000612,8.9e-05,0.00013,0.000168,9.3e-05,-0.000196,-0.000101,-0.000435,-6.6e-05,-0.000208,-0.000148,-0.000162,0.000349,6e-06,0.000457,-0.000111,-0.000254,8.5e-05,-0.000268,8.5e-05,0.000154,-6.1e-05,-0.000218,2.6e-05,-0.000234,-0.000171,-1.2e-05,0.000164,9.4e-05,7e-06,5.1e-05,0.000119,2.9e-05,-0.000196,5.5e-05,0.000167,-0.000194,5.5e-05,-0.000395,-0.000339,0.000322,-9e-05,-0.000267,4e-04,-2.1e-05,0,0.000105,-7.2e-05,-9.9e-05,-0.000182,-2.2e-05,0.000258,-0.000279,4.1e-05,-3.2e-05,0.000198,0.000414,-6.6e-05,1.8e-05,6.5e-05,-4.8e-05,-0.000125,1.8e-05,0.000129,0.000101,4e-05,-9.2e-05,4.3e-05,0.000107,-0.000165,-0.000118,0.00032,0.000186,-8e-05,8.9e-05,-0.00012,-0.000184,-0.000124,0.000182,0.00033,8e-06,0.000121,0.000187,5e-05,7.4e-05,6.6e-05,5.2e-05,-5.3e-05,-5e-06,-0.000142,0.00016,-9.3e-05,-5.7e-05,2.7e-05,0.000104,-0.000112,4.1e-05,-1.8e-05,3.2e-05,-3e-05,-2e-05,-0.000132,-7.3e-05,-0.000177,6.4e-05
2.8e-05,6.8e-05,0.000119,0.000267,0.000195,0.000144,-0.000188,-0.000115,-4.4e-05,-0.000163,4.7e-05,-0.000295,1.4e-05,-0.000255,0.000178,-1.6e-05,0.000688,-5.3e-05,-0.000156,-0.00014,-3e-05,4.1e-05,0.000136,0.000231,-9.2e-05,0.000203,-4.1e-05,0.00012,-0.000353,-0.000137,-0.000341,0.000115,0.000262,6e-06,0.000315,-8.1e-05,-3.2e-05,0.000111,0.000206,-5.3e-05,5.5e-05,0.000159,5e-05,-0.000121,0.000154,-5e-06,-0.000103,0.000101,-0.000211,0.000122,-4.7e-05,-0.000213,0.000175,4.5e-05,0.000283,0.00024,-0.000288,3.4e-05,0.000185,-0.000171,0.000146,-4.5e-05,2.8e-05,-2e-05,6.3e-05,0.000301,6.2e-05,-0.000243,4.5e-05,4.4e-05,-0.000137,-0.000156,-0.000145,-4.8e-05,0.000125,-2.9e-05,0.000112,0.000143,6.1e-05,-5.2e-05,5.5e-05,1.2e-05,-3.1e-05,9.1e-05,-0.000148,8.9e-05,0.000205,-0.000351,-0.000219,0.000208,8.7e-05,4.8e-05,0.000139,0.00011,-0.000111,-0.000185,5.4e-05,-5.3e-05,-0.000128,8.6e-05,4e-06,-0.000113,0.000182,4.4e-05,-9.3e-05,0.000144,-0.000171,0.000231,0.000226,0.000173,-3e-06,0.000104,-4.8e-05,0.000121,-6.5e-05,2.4e-05,-8.9e-05,3.3e-05,4.8e-05,0.000161,4.6e-05
3.8e-05,4e-05,1e-05,-9.6e-05,-0.000203,-0.000136,0.000179,0.000154,0.000165,3e-04,2.6e-05,0.000102,-2.7e-05,0.000281,-4.7e-05,6.1e-05,-0.000356,-2.3e-05,0.000132,0.000185,5.3e-05,2e-06,-1.1e-05,-0.000264,6e-05,1.2e-05,7e-05,3.4e-05,0.00032,0.000121,0.000122,-0.000246,-0.000292,-0.000133,-0.000275,0.000157,-0.000104,-0.000217,-0.000264,0.000125,6.2e-05,-7e-05,1.7e-05,8e-06,-0.000263,-6.6e-05,5.2e-05,-0.000203,9e-06,-0.000185,3e-05,5.8e-05,-0.000199,-9.3e-05,-0.000134,-0.000167,0.000129,-8.3e-05,-0.000238,0.000165,-9.7e-05,1.8e-05,-3.5e-05,3.1e-05,-4.5e-05,-0.000193,-0.000116,0.000201,3.7e-05,-0.00016,0.00018,3.8e-05,-8.8e-05,4.8e-05,-0.000122,9.3e-05,-0.000105,1.7e-05,-0.000124,1.3e-05,5e-06,-7.6e-05,2.9e-05,-1e-06,7.7e-05,0.000114,-0.000212,0.000177,3.2e-05,-0.000166,-7.4e-05,-8.8e-05,-6.7e-05,4.8e-05,8.2e-05,1.4e-05,3e-05,0.000152,6.8e-05,-0.000114,-3e-05,0.000182,3e-06,2.1e-05,4.6e-05,-7.9e-05,0.000119,-4.2e-05,-2.4e-05,-0.000207,-1.2e-05,-8.2e-05,8e-06,-2.5e-05,-2.9e-05,3.4e-05,0.000239,3.2e-05,-2.6e-05,-3e-05,-0.000145
0.00015,-2.5e-05,-6.8e-05,9.8e-05,0.000101,0.000156,-0.000103,-0.000126,-5e-05,-0.000264,-1e-06,-2.7e-05,-6.5e-05,-7.4e-05,-9.9e-05,0.000109,0.000193,2e-04,-0.000111,-0.00031,-0.000105,-1.8e-05,1.7e-05,0.000133,5e-06,2.9e-05,-0.000103,9.3e-05,-0.000339,-2.7e-05,3e-05,0.000208,0.000202,8.6e-05,0.000158,-0.000189,-7e-06,0.000174,0.000166,-0.000113,-8.2e-05,-0.000103,-2.6e-05,2.3e-05,0.000186,3.2e-05,-1.4e-05,0.000155,7.2e-05,-1.2e-05,3.5e-05,4.5e-05,2.4e-05,9.3e-05,-0.000109,0.000118,-2e-05,0.000174,0.000145,-8.7e-05,0.000107,-5.3e-05,2.8e-05,3.1e-05,-2e-05,4e-05,9e-05,-7.5e-05,4.4e-05,0.000135,-0.000192,2.8e-05,7e-06,-0.000125,-6e-06,-0.000111,0.000107,-5e-06,5.5e-05,7.5e-05,7e-06,6.9e-05,7e-05,1.4e-05,-6.8e-05,-8.4e-05,1.2e-05,-0.000165,-4.3e-05,-4e-06,0.000153,5.4e-05,1.2e-05,-5.3e-05,-1.3e-05,0.000117,-5.8e-05,-0.000167,-0.00021,3.7e-05,4.3e-05,-6.2e-05,-5e-06,-4.9e-05,-4.3e-05,0.000125,4e-06,0.000121,-0.000145,7.6e-05,1e-06,5e-06,-2.7e-05,-9e-06,1.4e-05,-1.1e-05,-0.000213,0.000143,5e-06,-2.2e-05,3.2e-05
-0.000151,0.000196,9.7e-05,-1.1e-05,-6.3e-05,-0.000115,3.7e-05,8.6e-05,-0.000134,0.000249,4e-05,-3e-06,-2.3e-05,-6.8e-05,-3.8e-05,-2.5e-05,-0.000112,-0.000217,2.1e-05,0.000177,4.9e-05,4e-06,-8.8e-05,-2.1e-05,1e-06,-8.5e-05,8.7e-05,-3.2e-05,0.00015,3.3e-05,-5.6e-05,-0.000153,-1e-06,1.9e-05,-5.7e-05,8.9e-05,0.000151,-0.000107,-9.8e-05,1.9e-05,5.9e-05,-3.4e-05,1.9e-05,-3.5e-05,-0.000116,-1.7e-05,-5.2e-05,-0.00016,-1.1e-05,1.8e-05,-0.000142,-5.2e-05,-5.5e-05,-0.000159,9.5e-05,-8.9e-05,0.000149,-7.5e-05,-3.2e-05,-1.1e-05,-0.000104,0.000106,-3e-05,-5.6e-05,2.8e-05,-3.4e-05,-5.3e-05,9e-06,-1.8e-05,-7.1e-05,0.000149,-3.4e-05,-0.00011,0.000122,1.6e-05,5.6e-05,-8.9e-05,-6.2e-05,-5.8e-05,-0.000186,-7e-05,-0.00011,-5.1e-05,-3.5e-05,1.5e-05,-8.5e-05,0.000132,4e-06,4.7e-05,-3.5e-05,-0.000142,-9.2e-05,4.7e-05,-5.3e-05,-2.4e-05,-2e-04,5.6e-05,0.000103,9.9e-05,-2.9e-05,1.1e-05,7e-05,-1.1e-05,2e-05,-1.8e-05,-0.000132,-7e-05,-1e-04,9e-06,-9.8e-05,-2.7e-05,1.9e-05,1.3e-05,4e-05,-6.8e-05,-3e-06,0.000167,3.8e-05,2.1e-05,2.6e-05,5e-06
6.5e-05,-0.000159,-9.3e-05,1.6e-05,-1.2e-05,6.1e-05,-1.8e-05,-3e-05,0.000149,-0.000203,-5.9e-05,3.4e-05,6.9e-05,-1.4e-05,5.7e-05,-7.9e-05,5e-05,0.000111,-1.7e-05,-4.6e-05,2e-06,-2e-05,-7e-06,2.3e-05,2e-06,4.9e-05,-5.8e-05,-5.2e-05,-5.3e-05,-1.4e-05,9.7e-05,0.000131,-2.8e-05,-4.6e-05,3e-06,-4.8e-05,-6.3e-05,2.3e-05,7.6e-05,4.1e-05,-2.3e-05,3.4e-05,9e-06,6.6e-05,-2.2e-05,4.2e-05,3.3e-05,0.000108,2.8e-05,3.5e-05,0.000165,-1.2e-05,1.8e-05,2.3e-05,1.7e-05,-1.1e-05,-0.000138,5.6e-05,3.8e-05,0.000107,3e-05,-3e-05,2e-05,5.2e-05,5.7e-05,4.1e-05,1.3e-05,-7e-06,-8.6e-05,-3.3e-05,-0.000109,1.6e-05,7.6e-05,-2.6e-05,-3.7e-05,-9e-06,5.6e-05,-1.7e-05,2.4e-05,0.000127,5.5e-05,7.7e-05,-1.5e-05,7e-05,-7e-06,0.000128,-2.8e-05,3.5e-05,-3.3e-05,3.8e-05,5.4e-05,8.4e-05,-3.4e-05,2.2e-05,3.8e-05,0.000138,-7.6e-05,-5.7e-05,-7.1e-05,-1.7e-05,-9e-06,-6.3e-05,7e-06,-4.3e-05,7.4e-05,5.6e-05,4.1e-05,0,-1.4e-05,6e-06,-7e-06,-4.9e-05,-3e-05,-4e-06,2.4e-05,5e-06,-0.00013,-3.6e-05,-3.6e-05,-4.9e-05,-2.6e-05
1.2e-05,0.000143,4.7e-05,-6.4e-05,1.3e-05,-2e-06,2.9e-05,-1e-06,-0.000116,5.2e-05,-1.2e-05,-2.4e-05,-3.9e-05,5.9e-05,3e-06,-1.8e-05,7e-06,-6.8e-05,-2e-05,2.2e-05,-3.9e-05,2e-05,3.4e-05,-3.4e-05,2.2e-05,2.9e-05,7.5e-05,-2.7e-05,0.000149,-1.8e-05,-7.1e-05,-8e-05,1.4e-05,3.4e-05,-1.7e-05,-7e-06,-1.8e-05,3.7e-05,0,-2.2e-05,-1.4e-05,-1.3e-05,-6e-06,-5.4e-05,7.2e-05,-5.7e-05,2.7e-05,-3.2e-05,1.3e-05,-2.5e-05,-7.3e-05,4.3e-05,6.6e-05,5.5e-05,-8.9e-05,1e-05,1.8e-05,-7e-05,-2.6e-05,-4.2e-05,-5e-06,3.1e-05,1.2e-05,-3.4e-05,-0.000121,-5.1e-05,3e-06,-2.3e-05,2.4e-05,1.5e-05,0.000106,-1e-05,-2.1e-05,-2.3e-05,-2.8e-05,2.9e-05,-1e-05,4.9e-05,3.1e-05,-1.2e-05,-3.6e-05,-4.9e-05,2e-06,-2e-05,1.9e-05,-4.4e-05,5e-05,-5.6e-05,-3e-06,-5.5e-05,1.8e-05,-2e-06,-1.2e-05,4e-05,-4.4e-05,-3.7e-05,-8e-06,-2.6e-05,5.8e-05,4.5e-05,1e-06,1.9e-05,-1.8e-05,-1e-05,-5.3e-05,-2.3e-05,1.5e-05,-6.8e-05,-1.1e-05,1e-06,2e-06,5.5e-05,3.6e-05,0,3.6e-05,-1.5e-05,3.1e-05,-5.9e-05,-1.2e-05,2.7e-05,4.8e-05
-5.6e-05,-0.000157,-7e-06,7.6e-05,-3.6e-05,4e-06,-2.5e-05,1e-05,5.6e-05,-3.7e-05,6e-06,5.9e-05,2e-06,-1.9e-05,-2.1e-05,1.7e-05,5.5e-05,2e-05,2.1e-05,8e-06,3.3e-05,-5.8e-05,-4.4e-05,1e-06,-1.7e-05,-5.9e-05,6e-06,3.9e-05,-0.00012,-1.3e-05,7.1e-05,5e-05,-1.8e-05,2.8e-05,3.4e-05,-3.6e-05,5.2e-05,1.3e-05,-6.4e-05,-2.3e-05,1.3e-05,2.3e-05,4.7e-05,2e-05,-1.1e-05,-9e-06,-1.5e-05,-5.1e-05,-3.2e-05,2.4e-05,2.6e-05,-3.5e-05,-8e-05,-3.4e-05,7.7e-05,1e-06,-5e-05,4.1e-05,-1.4e-05,1.4e-05,-2.7e-05,-4.7e-05,-3.4e-05,5e-06,3e-05,5.8e-05,-5e-06,-1.1e-05,-4e-05,1.8e-05,-0.000115,-9e-06,8e-06,4.6e-05,-2e-06,-1e-06,-1.2e-05,6e-06,-4.4e-05,-6e-06,1.1e-05,2.4e-05,2e-06,1e-05,-1.1e-05,-4e-06,-2.2e-05,9.6e-05,-1.5e-05,4.9e-05,1.5e-05,1.2e-05,1.6e-05,-3.3e-05,6e-05,8e-06,4.6e-05,2.2e-05,-1.6e-05,-1.6e-05,-8e-06,3.3e-05,1.6e-05,1.5e-05,1.9e-05,1.8e-05,-2.1e-05,1.4e-05,-5e-06,1e-06,-4e-06,-1e-05,-1e-05,-1.3e-05,-3.3e-05,-4.2e-05,-1.4e-05,4e-05,9e-06,1.9e-05,-1.1e-05
4.6e-05,9.5e-05,-6e-06,-4.9e-05,4.3e-05,-2.6e-05,1.4e-05,7e-06,3e-06,3.3e-05,0,-8.2e-05,-1.4e-05,-1.8e-05,6.5e-05,2.6e-05,-0.000124,1.4e-05,6e-06,-5e-06,7e-06,6.7e-05,1e-05,-3.9e-05,7e-06,7e-05,-1.3e-05,-2.6e-05,8.4e-05,3.7e-05,-6.9e-05,-3.2e-05,1.7e-05,-1.8e-05,-2.3e-05,2.3e-05,-9.6e-05,-5e-06,5.5e-05,4e-06,-5e-06,-2e-06,-2.7e-05,8e-06,9e-06,9e-06,1.3e-05,4.7e-05,2.5e-05,-2.2e-05,-2.9e-05,2.3e-05,8.2e-05,4.8e-05,-5.8e-05,1.8e-05,-4e-06,-1.1e-05,-1.6e-05,-2e-05,1e-05,2.7e-05,3e-05,1.6e-05,1.3e-05,-7.3e-05,1.7e-05,7e-06,6.2e-05,6e-06,9.3e-05,-1.1e-05,-1.4e-05,-3.2e-05,1.5e-05,-2.6e-05,1e-06,-4e-06,2.2e-05,3.8e-05,0,-8e-06,2.2e-05,-1.2e-05,6e-06,-3.1e-05,-3.8e-05,-9.6e-05,1.7e-05,3e-06,1.2e-05,3e-06,-2.3e-05,2.4e-05,-6.4e-05,-2.6e-05,-3.1e-05,-1.3e-05,2e-05,3e-06,-8e-06,0,-2e-05,2e-06,1.7e-05,-1e-06,1.2e-05,3.6e-05,5e-06,-2.5e-05,1.3e-05,-1.8e-05,8e-06,2e-05,-1e-05,6.1e-05,2.7e-05,-3.2e-05,2.5e-05,4e-06,1.2e-05
-1.1e-05,-8.8e-05,5e-06,1.1e-05,-1.4e-05,2.2e-05,1.3e-05,-1.4e-05,-3e-05,-3.4e-05,0,5.8e-05,8e-06,-1e-05,-2.4e-05,6e-06,0.000112,-2.8e-05,-9e-06,9e-06,-3.4e-05,-4.8e-05,-1e-06,9.1e-05,-2.7e-05,-1.2e-05,-3.5e-05,-5e-06,-7.3e-05,-5e-06,6.5e-05,3.6e-05,-1.8e-05,2e-06,2.4e-05,-1.8e-05,5e-05,-4e-06,-3.3e-05,1.9e-05,0,6e-06,2e-05,-2.2e-05,-2.1e-05,1.9e-05,9e-06,-4.9e-05,-5.3e-05,5e-06,5e-06,-9e-06,-5.9e-05,-1e-06,2.5e-05,-2.9e-05,2.5e-05,3.3e-05,2.7e-05,1.5e-05,-1.8e-05,-1.5e-05,-2.4e-05,-1.1e-05,-1.7e-05,7.3e-05,4.1e-05,-5e-06,-2.6e-05,1e-05,-6.6e-05,1.4e-05,3.8e-05,-1.3e-05,-2e-06,2.4e-05,-6e-06,-8e-06,1.6e-05,-1.3e-05,0,1.4e-05,2e-06,-9e-06,1e-06,7e-06,4.1e-05,9.4e-05,2.5e-05,2.1e-05,-1.5e-05,-1.1e-05,4e-06,-1.7e-05,4.7e-05,1.4e-05,-2e-06,1.7e-05,2.6e-05,-1.3e-05,4e-06,-2.3e-05,1.7e-05,-7e-06,-1.9e-05,-1.5e-05,-9e-06,-3e-06,1.7e-05,2.9e-05,-1e-05,5e-06,5e-06,-7e-06,1.5e-05,-5.9e-05,-5.4e-05,9e-06,1.2e-05,6e-06,6e-06
-2e-06,4.9e-05,0,-5e-06,0,-2.9e-05,-3.1e-05,1.1e-05,1.3e-05,6.3e-05,1.1e-05,-6.2e-05,1.2e-05,-1.1e-05,-2.1e-05,-1e-06,-9.2e-05,8e-06,0,-4.7e-05,1.4e-05,5.2e-05,1.2e-05,-5.8e-05,1.9e-05,-1.3e-05,4.6e-05,-1.8e-05,2.4e-05,5e-06,-5.7e-05,-3.3e-05,-3e-06,6e-06,-1.5e-05,2.8e-05,-2e-06,-3e-06,1.9e-05,-1.1e-05,7e-06,-3e-06,-1.2e-05,2.1e-05,8e-06,-1e-05,-1.2e-05,4.3e-05,1.4e-05,-7e-06,6e-06,1.5e-05,2.4e-05,-1.5e-05,-1.4e-05,-1.8e-05,-3e-06,-2.8e-05,-1.3e-05,-4e-06,-4e-06,4e-06,1.2e-05,4e-06,2.4e-05,-5e-05,-3e-05,-2e-06,7e-06,-4e-06,3.3e-05,-1.5e-05,-3.7e-05,1.5e-05,-1.1e-05,-6e-06,1.1e-05,9e-06,-1.2e-05,-5e-06,4e-06,-6e-06,-2.8e-05,8e-06,-5e-06,2.5e-05,-2.7e-05,-5.9e-05,1.1e-05,1.4e-05,-5e-06,1e-05,-7e-06,1e-06,-2.9e-05,-1.4e-05,8e-06,-8e-06,-3.3e-05,2.6e-05,-1e-06,7e-06,7e-06,9e-06,-1e-05,1.7e-05,-4e-06,1.8e-05,-2.5e-05,-6e-06,-5e-06,1.4e-05,-1.5e-05,-2e-06,0,4.7e-05,5.3e-05,-7e-06,-3.3e-05,-2e-05,1e-05
2.7e-05,-2.1e-05,-5e-06,2.8e-05,1.6e-05,2.5e-05,2.2e-05,-3e-06,2e-06,-4.4e-05,7e-06,5.2e-05,-2.9e-05,3.2e-05,-2.3e-05,-2.5e-05,7e-05,4e-06,1.4e-05,2.9e-05,7e-06,-5.6e-05,-1e-05,4.5e-05,-1.2e-05,1e-05,1.2e-05,2.2e-05,2e-06,-1.5e-05,4.4e-05,2.8e-05,3.1e-05,-1e-05,1.1e-05,-1.2e-05,4e-06,-4e-06,-4e-06,1.2e-05,-2.1e-05,1.6e-05,5e-06,-2.2e-05,-2e-06,-1.2e-05,8e-06,-3.8e-05,-5e-06,-1.1e-05,-4.2e-05,-2.5e-05,-2e-06,5e-06,-7e-06,2.4e-05,-1e-06,3e-06,9e-06,6e-06,-1e-05,3e-06,-1.2e-05,8e-06,8e-06,1.2e-05,4e-06,7e-06,-1.3e-05,4e-06,-1.7e-05,1.4e-05,-6e-06,-2.9e-05,9e-06,-1e-05,-4e-06,2e-06,-7e-06,-8e-06,-1.3e-05,9e-06,1.3e-05,-1.8e-05,5e-06,8e-06,3.2e-05,4.5e-05,-4e-06,-1e-05,1.2e-05,-6e-06,2e-06,-4e-06,3e-06,-4e-06,2e-06,1.4e-05,2.3e-05,-1.9e-05,2e-06,1.3e-05,-4e-06,4e-06,5e-06,3e-06,1.3e-05,-1e-06,4.3e-05,-4e-06,4e-06,-1e-05,1.7e-05,8e-06,4e-06,-4.5e-05,-3.8e-05,8e-06,9e-06,1e-06,-2.1e-05
-2e-05,2.6e-05,3e-06,-4.9e-05,-1.4e-05,-1.8e-05,-1e-05,1e-06,-3.2e-05,9e-06,-1e-05,-2.3e-05,2.4e-05,-3.4e-05,3.5e-05,0,-5e-05,-2.1e-05,-1.1e-05,-1.5e-05,-1.4e-05,5e-05,4e-06,-4.6e-05,-5e-06,0,-1.2e-05,1.6e-05,-7e-06,-7e-06,-4e-05,-3.4e-05,-3e-05,1.4e-05,-3e-06,1e-05,-1.2e-05,-2e-06,-1.4e-05,-8e-06,1.8e-05,-2e-05,-1e-05,1.2e-05,-6e-06,0,0,8e-06,7e-06,-5e-06,3.3e-05,3.1e-05,-2.4e-05,-1e-06,9e-06,-7e-06,-1.4e-05,-3e-06,-1.2e-05,-2.7e-05,0,7e-06,1.1e-05,-8e-06,-3.1e-05,2.3e-05,1.4e-05,-9e-06,-1.4e-05,9e-06,2.2e-05,-1e-06,2.9e-05,1.1e-05,9e-06,7e-06,-2e-06,-9e-06,1.4e-05,4e-06,8e-06,3e-06,7e-06,1.4e-05,-4e-06,-4.8e-05,8e-06,-3e-05,-3e-06,-8e-06,-2e-06,-5e-06,0,1e-05,1.6e-05,2.5e-05,-3e-06,-3e-05,-1.2e-05,0,9e-06,-1e-06,0,-2e-06,1e-05,-1.2e-05,-5e-06,-3e-06,-2.7e-05,1.9e-05,-6e-06,6e-06,-1e-05,-6e-06,1.1e-05,3.4e-05,1.7e-05,9e-06,7e-06,1e-06,1.7e-05
1e-06,-1.3e-05,-7e-06,2.9e-05,1.9e-05,2e-06,5e-06,2e-06,3.9e-05,-1.7e-05,-1e-05,1.2e-05,-1.4e-05,2.1e-05,-1.2e-05,2.6e-05,2.5e-05,1.3e-05,8e-06,0,1e-05,-4.3e-05,8e-06,1.2e-05,2.2e-05,-4e-06,-3.1e-05,1e-06,1.9e-05,5e-06,2.6e-05,1.9e-05,1.7e-05,-2e-06,-1.3e-05,-3e-06,7e-06,1e-06,2.4e-05,7e-06,-1.5e-05,1.2e-05,1.3e-05,1e-06,2e-06,4e-06,2e-06,7e-06,6e-06,-1e-06,-1.8e-05,-2.1e-05,3.4e-05,-2.9e-05,-8e-06,1.4e-05,2e-05,-2e-06,2e-06,1.7e-05,3e-06,-1.3e-05,-6e-06,4e-06,1.1e-05,-3.9e-05,-1e-05,6e-06,5.1e-05,-1.1e-05,-1.5e-05,-8e-06,-7e-06,1.2e-05,-1.3e-05,0,2e-06,1e-06,-1.5e-05,0,-1e-05,1e-06,-1e-06,-1.6e-05,6e-06,2.4e-05,-1.3e-05,2.1e-05,2e-06,8e-06,-6e-06,6e-06,0,-9e-06,-2.4e-05,-3.7e-05,-5e-06,1.7e-05,2.4e-05,1.1e-05,1e-06,-3e-06,-1.3e-05,2e-06,-6e-06,7e-06,-1.2e-05,-2.3e-05,1.8e-05,-8e-06,-2e-06,-2e-06,1e-05,4e-06,-8e-06,-3.2e-05,1e-05,1.4e-05,-7e-06,-9e-06,-7e-06
7e-06,0,5e-06,-1.3e-05,-9e-06,-2e-06,-6e-06,1e-06,-2.9e-05,7e-06,4e-06,1.5e-05,6e-06,2e-06,8e-06,1e-06,-7e-06,8e-06,-4e-06,3.4e-05,5e-06,4.1e-05,1e-06,3e-06,-1.8e-05,-8e-06,1.5e-05,-2.4e-05,-1.7e-05,3e-06,-1.4e-05,-1.9e-05,-2e-06,-1.2e-05,1.8e-05,-8e-06,1.1e-05,-3e-06,-2.6e-05,-1.6e-05,1e-05,6e-06,-1.8e-05,-8e-06,3e-06,-3e-06,2e-06,-1.8e-05,2e-06,-1.4e-05,0,2e-06,-1.8e-05,3.1e-05,-1e-06,-1.5e-05,-1.4e-05,1.1e-05,-2e-06,-1.7e-05,-7e-06,4e-06,1e-06,-2e-06,-1.1e-05,4.2e-05,0,-1e-06,-4.4e-05,7e-06,-2e-06,7e-06,2e-06,-1.9e-05,8e-06,-2e-06,-2e-06,-1e-06,1.3e-05,1.1e-05,1.1e-05,-1e-06,3e-06,9e-06,-5e-06,1.2e-05,1e-06,-1.2e-05,1e-06,-5e-06,-4e-06,-7e-06,0,6e-06,2.6e-05,2.2e-05,6e-06,-1.8e-05,-2.5e-05,-1.5e-05,1e-06,-8e-06,-1.5e-05,4e-06,9e-06,0,1.5e-05,-1.3e-05,5e-06,5e-06,9e-06,7e-06,-8e-06,-5e-06,1e-06,2.7e-05,-1.5e-05,9e-06,1.1e-05,1.8e-05,0
-1.9e-05,8e-06,-2e-06,9e-06,7e-06,1.1e-05,1.2e-05,-2e-06,9e-06,-1e-06,4e-06,-3.7e-05,-2e-06,-6e-06,-5e-06,-2e-05,3e-06,-2e-06,5e-06,-3.8e-05,-9e-06,-3.1e-05,-4e-06,9e-06,1.3e-05,1.4e-05,1.2e-05,3e-06,2.1e-05,4e-06,1.2e-05,2.2e-05,-1e-06,1.7e-05,-1.6e-05,9e-06,-1.6e-05,0,1.6e-05,7e-06,-3e-06,-1.5e-05,1.1e-05,5e-06,3e-06,-3e-06,-6e-06,1.4e-05,1e-06,-1e-06,8e-06,0,1.2e-05,-1.1e-05,0,-1.7e-05,3.1e-05,-1.1e-05,1.2e-05,1.8e-05,2e-06,4e-06,9e-06,-4e-06,2e-06,-3.1e-05,5e-06,-5e-06,1.1e-05,-4e-06,1.2e-05,-5e-06,-3e-06,1.1e-05,4e-06,-1e-06,6e-06,7e-06,-1.4e-05,5e-06,-5e-06,7e-06,-1.1e-05,-7e-06,2e-06,-8e-06,-1.8e-05,-8e-06,5e-06,-2e-05,5e-06,6e-06,-2e-06,2e-06,-2.8e-05,-4e-06,2e-06,1.3e-05,2e-06,9e-06,0,7e-06,7e-06,-1e-06,-5e-06,3e-06,-8e-06,1.6e-05,9e-06,-1e-06,-2e-06,-1e-05,7e-06,-1e-06,4e-06,-3.1e-05,1.5e-05,-2.3e-05,-1.1e-05,-1.3e-05,-7e-06
1.2e-05,-2.6e-05,-3e-06,-1.4e-05,-2e-06,-8e-06,-1.2e-05,-2e-06,1.4e-05,6e-06,-2e-06,3.5e-05,-1e-06,2e-06,1e-05,-3e-06,-1.1e-05,1e-06,-7e-06,2.6e-05,2e-06,2.3e-05,5e-06,-1.3e-05,1.1e-05,-3e-06,-8e-06,5e-06,-3.8e-05,-2e-06,3e-06,-1.6e-05,2e-06,-4e-06,1.6e-05,-2e-06,2.3e-05,-1e-06,-3e-06,1e-06,0,-2e-06,-1.2e-05,-7e-06,-4e-06,3e-06,0,-1.9e-05,3e-06,3e-06,-3e-06,-1e-06,-1.3e-05,-2e-06,-1.3e-05,1.6e-05,-1.8e-05,9e-06,-6e-06,-2.6e-05,0,0,-9e-06,2e-06,9e-06,1.9e-05,-1e-05,-1e-06,-7e-06,-8e-06,-2.1e-05,2e-06,1e-06,1e-06,-1e-06,0,-4e-06,2e-06,0,-9e-06,3e-06,-1.4e-05,0,6e-06,-3e-06,-4e-06,2.2e-05,8e-06,-6e-06,9e-06,5e-06,-4e-06,2e-06,-2e-06,3.1e-05,-5e-06,-1e-06,-1e-06,-1.1e-05,1e-06,-5e-06,3e-06,-2e-06,-2e-06,-7e-06,-1.1e-05,-3e-06,4e-06,-1.2e-05,3e-06,1e-06,8e-06,-5e-06,4e-06,-5e-06,3.4e-05,-2e-06,-1e-05,-2e-06,1.3e-05,1.2e-05
5e-06,3.7e-05,5e-06,1.6e-05,-7e-06,9e-06,6e-06,5e-06,-2.6e-05,2e-06,-1e-06,-3.4e-05,1.1e-05,-7e-06,-1.3e-05,7e-06,2.3e-05,-6e-06,2e-06,-1.4e-05,3e-06,-2.1e-05,3e-06,1e-05,-1.9e-05,-9e-06,-6e-06,6e-06,3.4e-05,-3e-06,-1.4e-05,2e-05,-1.3e-05,-1.5e-05,-1.2e-05,-5e-06,-1.9e-05,-3e-06,-1e-06,-2e-06,3e-06,8e-06,7e-06,1.1e-05,-4e-06,-1e-06,3e-06,1e-05,1e-06,2e-06,1.2e-05,-9e-06,-1e-06,7e-06,1.7e-05,1.1e-05,0,-1.2e-05,1e-06,1.3e-05,2e-06,1e-06,7e-06,-2e-06,-3e-06,-4e-06,3e-06,1e-06,-1e-06,4e-06,2e-05,2e-06,-1.1e-05,-5e-06,-2e-06,2e-06,-3e-06,-4e-06,1.1e-05,2e-06,0,1.5e-05,1.3e-05,-4e-06,1e-06,-5e-06,5e-06,-1.4e-05,-3e-06,-7e-06,-5e-06,4e-06,0,-5e-06,-3.2e-05,1e-06,5e-06,3e-06,6e-06,-4e-06,-3e-06,-4e-06,-1e-06,0,4e-06,1.4e-05,6e-06,9e-06,-3e-06,-7e-06,4e-06,-9e-06,1e-06,-3e-06,-3e-06,-2.6e-05,0,0,1e-05,-1.8e-05,-1.1e-05
-1e-05,-5.2e-05,-2e-06,-1.6e-05,8e-06,-3e-06,1e-06,-2e-06,2.2e-05,-4e-06,3e-06,2.9e-05,-1.1e-05,5e-06,-1e-06,5e-06,-3.6e-05,2e-06,-2e-06,9e-06,-5e-06,1.7e-05,-2e-06,-2.8e-05,9e-06,9e-06,1.3e-05,-5e-06,-2.5e-05,-1e-06,2.3e-05,-1.7e-05,1.7e-05,1.6e-05,8e-06,1.4e-05,3e-06,1e-06,7e-06,0,0,-1e-05,-5e-06,-9e-06,9e-06,-7e-06,-6e-06,-6e-06,-7e-06,-3e-06,-1.6e-05,1.4e-05,8e-06,-1e-05,-1.2e-05,-1.5e-05,-1.4e-05,1.5e-05,-4e-06,0,2e-06,-2e-06,-7e-06,-3e-06,-6e-06,-5e-06,3e-06,1e-06,1.8e-05,-4e-06,-1.6e-05,0,1.4e-05,1e-05,0,-2e-06,2e-06,-4e-06,-3e-06,-1e-05,-1e-06,-1.9e-05,-3e-06,2e-06,-1e-06,0,-9e-06,2.1e-05,-4e-06,2e-06,0,-6e-06,-1e-06,0,2.9e-05,3e-06,-9e-06,1e-06,-1e-05,-1e-06,-2e-06,0,1e-05,-3e-06,-1e-06,-8e-06,-9e-06,-1e-06,3e-06,7e-06,-2e-06,6e-06,-4e-06,2e-06,7e-06,2.1e-05,4e-06,5e-06,-5e-06,7e-06,8e-06
1e-05,5.4e-05,1e-06,2e-05,-1e-05,3e-06,-6e-06,-1e-06,-1e-05,-3e-06,-2e-06,-1.7e-05,3e-06,-1e-06,4e-06,6e-06,3.7e-05,6e-06,-1e-06,1e-06,1e-06,-1.2e-05,-5e-06,2.8e-05,-5e-06,-6e-06,2e-06,-5e-06,2.7e-05,5e-06,-2.8e-05,1.4e-05,-1e-05,-3e-06,-7e-06,-3e-06,-1e-06,-3e-06,-1.1e-05,-1e-06,-6e-06,4e-06,5e-06,1e-06,-1.1e-05,1e-06,2e-06,-1e-06,-4e-06,0,1.2e-05,-1e-05,-1.7e-05,-5e-06,-1.2e-05,-2e-06,1.3e-05,-1.3e-05,-1e-06,-9e-06,0,3e-06,3e-06,1e-06,1e-06,5e-06,3e-06,-4e-06,-2e-05,-2e-06,1.8e-05,-3e-06,-9e-06,-7e-06,6e-06,3e-06,-2e-06,2e-06,-1.2e-05,2e-06,0,1.3e-05,-7e-06,3e-06,1e-06,2e-05,4e-06,-2.4e-05,2e-06,-3e-06,-1e-05,7e-06,1e-06,3e-06,-2e-05,3e-06,1e-06,-9e-06,7e-06,3e-06,-1e-06,-3e-06,-1e-06,-3e-06,-4e-06,-1e-06,5e-06,4e-06,-1.1e-05,-8e-06,-1e-06,2e-06,5e-06,0,-4e-06,-1.3e-05,3e-06,2e-06,3e-06,-6e-06,-6e-06
-4e-06,-4.4e-05,-1e-06,-1.5e-05,0,-2e-06,5e-06,0,-3e-06,-1e-06,-5e-06,7e-06,-4e-06,0,-1e-06,-5e-06,-2.5e-05,-9e-06,-1e-06,-1.4e-05,5e-06,8e-06,2e-06,-1.3e-05,-7e-06,-1e-06,-6e-06,0,-2.4e-05,-2e-06,2.9e-05,-1.6e-05,-4e-06,-1.1e-05,1.3e-05,0,1e-06,2e-06,7e-06,2e-06,5e-06,1e-06,-1e-06,3e-06,1.1e-05,5e-06,2e-06,-1e-06,-4e-06,-4e-06,-1e-05,3e-06,2e-05,1e-05,2e-05,3e-06,-6e-06,1.4e-05,3e-06,8e-06,4e-06,-5e-06,-2e-06,-1e-06,2e-06,0,-2e-06,1e-06,1.3e-05,2e-06,-2.1e-05,4e-06,2e-06,-1e-06,-8e-06,-1e-06,4e-06,4e-06,1.2e-05,8e-06,-2e-06,-1.3e-05,1e-06,-4e-06,0,-1.7e-05,-1.1e-05,2.5e-05,2e-06,1e-05,4e-06,-3e-06,-1e-06,0,1.1e-05,-7e-06,8e-06,9e-06,8e-06,1e-06,2e-06,2e-06,-7e-06,0,1.6e-05,4e-06,6e-06,-9e-06,3e-06,4e-06,0,-3e-06,-3e-06,0,-3e-06,7e-06,-1.1e-05,8e-06,-1e-06,5e-06,9e-06
-8e-06,4e-05,1e-06,3e-06,-1e-06,-3e-06,-1e-06,1e-06,9e-06,2e-06,1e-06,6e-06,1.3e-05,0,3e-06,-1.1e-05,1.2e-05,5e-06,0,2.1e-05,-4e-06,-3e-06,1e-06,1.1e-05,7e-06,-1e-06,-4e-06,1e-05,1.8e-05,0,-3.2e-05,1.4e-05,1.1e-05,9e-06,-1.8e-05,1e-06,3e-06,-3e-06,-4e-06,-3e-06,-5e-06,0,0,-2e-06,-1.1e-05,1e-06,-4e-06,-3e-06,1e-06,-3e-06,0,4e-06,-1.7e-05,-6e-06,-1.9e-05,-1e-06,9e-06,-1.7e-05,4e-06,-8e-06,-2e-06,5e-06,1e-06,-2e-06,5e-06,-8e-06,-6e-06,-4e-06,-1.7e-05,-2e-06,2.2e-05,-4e-06,5e-06,8e-06,-2e-06,-2e-06,-5e-06,-1e-06,-2e-06,-1e-06,6e-06,8e-06,2e-06,3e-06,0,-6e-06,4e-06,-2.3e-05,2e-06,-5e-06,0,3e-06,1e-06,1e-06,-3e-06,1.2e-05,-7e-06,-1.3e-05,7e-06,-7e-06,2e-06,-2e-06,3e-06,-2e-06,-1.6e-05,0,-6e-06,-9e-06,-7e-06,-3e-06,-1e-06,-3e-06,-1e-06,-1e-06,3e-06,-2e-06,1.6e-05,-2e-06,-2e-06,-3e-06,-8e-06
1e-05,-3.7e-05,0,-4e-06,-1e-06,-4e-06,1e-06,-2e-06,-3e-06,0,4e-06,-1.2e-05,-9e-06,-1e-06,-2e-06,2e-06,-2e-06,0,0,-2.7e-05,-1e-06,-3e-06,-3e-06,-8e-06,-4e-06,5e-06,5e-06,2e-06,-1.4e-05,-1e-06,2.6e-05,-1.6e-05,-9e-06,-2e-06,1.2e-05,-3e-06,-3e-06,2e-06,0,4e-06,3e-06,2e-06,2e-06,3e-06,1.2e-05,-7e-06,2e-06,5e-06,4e-06,-2e-06,-1e-06,1e-06,1.6e-05,6e-06,8e-06,1e-05,-6e-06,1.6e-05,-3e-06,8e-06,3e-06,-3e-06,4e-06,1e-06,-7e-06,8e-06,-2e-06,1e-06,8e-06,2e-06,-1.7e-05,1e-06,-7e-06,-9e-06,5e-06,3e-06,1e-06,-3e-06,0,4e-06,-5e-06,-6e-06,2e-06,-3e-06,0,1.2e-05,5e-06,2.3e-05,-1e-06,1.5e-05,1e-06,-1e-06,0,-2e-06,0,-1.5e-05,0,1.2e-05,0,9e-06,1e-06,1e-06,-4e-06,-1e-06,7e-06,-1e-06,1e-06,2e-06,6e-06,1e-06,1e-06,3e-06,0,-1e-06,-3e-06,0,-1.5e-05,0,3e-06,4e-06,9e-06
-8e-06,3.1e-05,-1e-06,9e-06,4e-06,4e-06,-3e-06,3e-06,-1e-05,3e-06,-2e-06,1.3e-05,-4e-06,-2e-06,-1e-06,1.1e-05,-4e-06,-5e-06,0,1.7e-05,4e-06,5e-06,-1e-06,-5e-06,4e-06,-2e-06,2e-06,-7e-06,6e-06,-2e-06,-2.5e-05,1.2e-05,6e-06,-5e-06,-8e-06,0,4e-06,-1e-06,3e-06,-3e-06,-1e-06,1e-06,-2e-06,-6e-06,-8e-06,-2e-06,1e-06,-8e-06,2e-06,-2e-06,-3e-06,-4e-06,-3e-06,5e-06,-2e-06,-5e-06,-1e-06,-1.6e-05,-1e-06,-6e-06,0,0,-5e-06,-1e-06,1e-06,-5e-06,9e-06,-1e-06,5e-06,3e-06,1.1e-05,2e-06,-1e-06,1e-06,-2e-06,-1e-06,0,0,0,-6e-06,1e-06,4e-06,2e-06,1e-06,-1e-06,-2e-06,-3e-06,-1.6e-05,-1e-06,-6e-06,2e-06,-1e-06,-1e-06,0,0,9e-06,3e-06,-8e-06,-5e-06,-5e-06,2e-06,-2e-06,-2e-06,2e-06,0,-2e-06,3e-06,3e-06,-7e-06,-3e-06,1e-06,2e-06,0,1e-06,-2e-06,0,9e-06,4e-06,-1e-06,-8e-06,-1e-05
0,-2.4e-05,0,-1.8e-05,-4e-06,-4e-06,4e-06,-2e-06,2.1e-05,-3e-06,-3e-06,-1.5e-05,6e-06,1e-06,-3e-06,1e-06,6e-06,1e-06,2e-06,-9e-06,-3e-06,-6e-06,2e-06,2e-06,2e-06,-1e-06,-4e-06,-5e-06,-4e-06,1e-06,2.1e-05,-1.3e-05,-4e-06,5e-06,1.2e-05,-1e-06,-3e-06,1e-06,-5e-06,1e-06,1e-06,-2e-06,4e-06,5e-06,2e-06,3e-06,0,5e-06,2e-06,-3e-06,3e-06,6e-06,-5e-06,-7e-06,-1e-06,-1.3e-05,2e-06,1.7e-05,-1e-06,5e-06,1e-06,3e-06,4e-06,0,-1e-06,-1e-06,-4e-06,-2e-06,-4e-06,-1e-06,-9e-06,-3e-06,4e-06,3e-06,-3e-06,-1e-06,1e-06,4e-06,-4e-06,-5e-06,1e-06,-1e-06,-6e-06,0,0,0,5e-06,1.3e-05,-1e-06,2e-06,-4e-06,1e-06,1e-06,-2e-06,0,1e-06,-2e-06,8e-06,5e-06,-2e-06,1e-06,-1e-06,5e-06,0,-8e-06,4e-06,-4e-06,5e-06,1.1e-05,4e-06,0,-1e-06,3e-06,-1e-06,6e-06,0,-4e-06,-4e-06,1e-06,9e-06,9e-06
7e-06,1.5e-05,1e-06,1.3e-05,3e-06,1e-06,-4e-06,0,-2.7e-05,2e-06,2e-06,1.8e-05,-3e-06,1e-06,3e-06,-6e-06,-4e-06,2e-06,-2e-06,6e-06,-1e-06,8e-06,1e-06,7e-06,0,5e-06,3e-06,2e-06,2e-06,0,-1.3e-05,1.1e-05,2e-06,-1e-06,-1.3e-05,0,4e-06,-1e-06,4e-06,-2e-06,-1e-06,1e-06,-5e-06,0,0,3e-06,-1e-06,-5e-06,1e-06,-1e-06,-4e-06,-5e-06,7e-06,2e-06,0,9e-06,2e-06,-1.7e-05,2e-06,-4e-06,-1e-06,0,-3e-06,0,-3e-06,5e-06,-3e-06,-1e-06,4e-06,3e-06,8e-06,2e-06,-1e-06,-4e-06,-1e-06,2e-06,1e-06,1e-06,4e-06,0,1e-06,2e-06,-1e-06,0,0,-2e-06,-7e-06,-1e-05,2e-06,-4e-06,3e-06,0,-1e-06,2e-06,0,-3e-06,2e-06,-5e-06,-6e-06,6e-06,0,-1e-06,2e-06,1e-06,6e-06,-2e-06,2e-06,-1e-06,-6e-06,-3e-06,0,0,-4e-06,1e-06,-2e-06,4e-06,-3e-06,-8e-06,-3e-06,-1.1e-05,-6e-06
-7e-06,-7e-06,0,-5e-06,2e-06,1e-06,3e-06,-1e-06,2.5e-05,-3e-06,3e-06,-2e-05,8e-06,2e-06,0,-4e-06,-3e-06,2e-06,1e-06,-2e-06,3e-06,-9e-06,-2e-06,-4e-06,2e-06,-4e-06,1e-06,5e-06,5e-06,0,7e-06,-9e-06,3e-06,-4e-06,1e-05,1e-06,-9e-06,0,-2e-06,2e-06,1e-06,-1e-06,4e-06,-2e-06,1e-06,-2e-06,3e-06,2e-06,-1e-06,0,4e-06,-1e-06,-1.3e-05,-1e-06,4e-06,9e-06,3e-06,1.6e-05,0,7e-06,0,-2e-06,3e-06,-1e-06,5e-06,-9e-06,5e-06,-1e-06,-1.4e-05,1e-06,-6e-06,-1e-06,-3e-06,5e-06,3e-06,-2e-06,-2e-06,-3e-06,3e-06,2e-06,-4e-06,0,6e-06,0,1e-06,-6e-06,-3e-06,5e-06,1e-06,4e-06,-2e-06,0,0,0,-1e-06,0,0,4e-06,0,-3e-06,0,1e-06,1e-06,2e-06,2e-06,-3e-06,0,3e-06,5e-06,3e-06,-1e-06,-2e-06,3e-06,0,-3e-06,-7e-06,2e-06,-4e-06,-1e-06,1.2e-05,6e-06
5e-06,-4e-06,0,3e-06,0,3e-06,-2e-06,1e-06,-1.6e-05,3e-06,-3e-06,1.6e-05,-1.2e-05,-3e-06,0,1e-06,9e-06,-1e-06,1e-06,5e-06,-1e-06,1.2e-05,1e-06,6e-06,-5e-06,0,-6e-06,1e-06,-5e-06,-1e-06,2e-06,1.1e-05,-7e-06,8e-06,-6e-06,-2e-06,9e-06,1e-06,1e-06,1e-06,-1e-06,0,-4e-06,2e-06,-1e-06,-2e-06,1e-06,0,-2e-06,-2e-06,0,2e-06,1.2e-05,-4e-06,-1e-05,-8e-06,-4e-06,-1.7e-05,1e-06,-6e-06,0,1e-06,-3e-06,0,2e-06,8e-06,-2e-06,1e-06,1.5e-05,0,1e-06,-1e-06,7e-06,-2e-06,-1e-06,0,0,-2e-06,-7e-06,5e-06,1e-06,2e-06,-2e-06,-1e-06,0,1.2e-05,5e-06,0,-1e-06,-1.5e-05,-2e-06,1e-06,1e-06,0,-2e-06,0,-2e-06,-3e-06,-5e-06,0,0,2e-06,4e-06,1e-06,-3e-06,5e-06,-4e-06,-1e-06,1e-06,-1e-06,0,0,0,-1e-06,4e-06,1e-05,1e-06,5e-06,2e-06,-1e-05,-9e-06
1e-06,1.5e-05,0,-6e-06,2e-06,1e-06,0,-1e-06,6e-06,-2e-06,-2e-06,-9e-06,4e-06,1e-06,-2e-06,5e-06,-1.2e-05,-3e-06,0,-1e-06,-1e-06,-1.4e-05,1e-06,-1.4e-05,0,1e-06,0,-4e-06,7e-06,1e-06,-7e-06,-9e-06,6e-06,-5e-06,7e-06,1e-06,-5e-06,1e-06,2e-06,-1e-06,0,-2e-06,3e-06,-4e-06,0,-1e-06,-2e-06,-3e-06,-3e-06,-2e-06,0,-3e-06,-9e-06,3e-06,1.4e-05,-1e-06,-2e-06,1.7e-05,-3e-06,2e-06,-1e-06,1e-06,2e-06,0,-4e-06,-6e-06,-2e-06,-3e-06,-7e-06,2e-06,4e-06,1e-06,-6e-06,-1e-06,-2e-06,0,1e-06,3e-06,1e-06,0,3e-06,-2e-06,-1e-06,1e-06,0,-2e-06,-2e-06,-6e-06,-2e-06,5e-06,0,-1e-06,-1e-06,0,6e-06,0,2e-06,-1e-06,0,0,0,-2e-06,-2e-06,1e-06,8e-06,-3e-06,3e-06,-3e-06,2e-06,1e-06,0,1e-06,1e-06,0,-2e-06,-1.5e-05,-6e-06,4e-06,-2e-06,1.1e-05,9e-06
-7e-06,-2.2e-05,0,1.2e-05,-1e-06,1e-06,1e-06,0,-1e-06,3e-06,1e-06,2e-06,3e-06,-2e-06,4e-06,3e-06,1.2e-05,3e-06,-1e-06,-3e-06,1e-06,1.3e-05,0,7e-06,0,1e-06,8e-06,-2e-06,-1e-05,0,1.2e-05,1e-05,-1e-06,-3e-06,-1e-05,1e-06,-1e-06,-1e-06,-2e-06,1e-06,-2e-06,1e-06,-2e-06,5e-06,0,0,1e-06,2e-06,-1e-06,0,2e-06,-1e-06,5e-06,2e-06,-1.3e-05,2e-06,-4e-06,-1.7e-05,0,3e-06,-1e-06,0,0,-1e-06,4e-06,0,5e-06,0,6e-06,-2e-06,-5e-06,0,0,7e-06,1e-06,1e-06,0,2e-06,7e-06,-1e-06,-3e-06,4e-06,0,-1e-06,0,-1.1e-05,4e-06,9e-06,-1e-06,-4e-06,2e-06,1e-06,0,0,-1.1e-05,-1e-06,1e-06,4e-06,-4e-06,2e-06,0,-1e-06,-4e-06,0,-1.1e-05,0,0,-3e-06,1e-06,-1e-06,0,1e-06,-2e-06,0,-1e-06,1.8e-05,7e-06,5e-06,2e-06,-1.1e-05,-6e-06
6e-06,2.7e-05,0,-1.1e-05,1e-06,-2e-06,-1e-06,0,5e-06,-4e-06,0,4e-06,-2e-06,1e-06,-2e-06,-5e-06,-7e-06,2e-06,1e-06,8e-06,0,-1.3e-05,-1e-06,-1e-06,-4e-06,-2e-06,1e-06,5e-06,1.1e-05,0,-1.6e-05,-1e-05,-1e-06,8e-06,8e-06,-3e-06,6e-06,1e-06,1e-06,0,2e-06,-1e-06,1e-06,-1e-06,2e-06,1e-06,0,-2e-06,-1e-06,-1e-06,-3e-06,3e-06,1e-06,-1e-06,1.3e-05,-3e-06,7e-06,1.7e-05,1e-06,-2e-06,0,0,-2e-06,0,-4e-06,4e-06,-4e-06,-1e-06,-2e-06,0,6e-06,1e-06,5e-06,-5e-06,1e-06,0,0,-1e-06,-5e-06,-5e-06,0,-6e-06,-2e-06,2e-06,0,6e-06,-4e-06,-1.3e-05,2e-06,2e-06,3e-06,-1e-06,1e-06,-1e-06,1.5e-05,4e-06,0,-5e-06,-1e-06,-3e-06,0,0,-1e-06,0,4e-06,1e-06,-3e-06,-1e-06,-4e-06,1e-06,0,-3e-06,2e-06,0,3e-06,-1.8e-05,-5e-06,2e-06,-2e-06,7e-06,6e-06
-1e-06,-3.1e-05,0,8e-06,-1e-06,1e-06,1e-06,0,-1.5e-05,2e-06,-3e-06,-1.1e-05,0,-1e-06,-2e-06,-5e-06,0,-3e-06,-1e-06,-6e-06,-1e-06,1.4e-05,1e-06,5e-06,2e-06,1e-06,-7e-06,4e-06,-1.3e-05,0,1.8e-05,9e-06,1e-06,-5e-06,-6e-06,1e-06,-8e-06,-1e-06,0,0,-2e-06,1e-06,-1e-06,-3e-06,-5e-06,1e-06,-1e-06,1e-06,1e-06,-3e-06,2e-06,-1e-06,-5e-06,2e-06,-8e-06,7e-06,-2e-06,-1.7e-05,0,2e-06,-1e-06,0,2e-06,0,1e-06,-7e-06,-3e-06,-1e-06,-1e-05,0,-7e-06,0,-3e-06,0,0,0,-2e-06,-3e-06,-1e-06,-2e-06,1e-06,7e-06,3e-06,-1e-06,0,4e-06,-2e-06,1.6e-05,1e-06,-2e-06,1e-06,1e-06,-1e-06,-1e-06,-1.7e-05,-3e-06,-1e-06,8e-06,0,1e-06,0,4e-06,-1e-06,-1e-06,1e-06,-1e-06,1e-06,2e-06,4e-06,-2e-06,0,3e-06,-1e-06,0,-1e-06,1.5e-05,1e-06,-4e-06,-1e-06,-7e-06,-8e-06
-4e-06,3.4e-05,0,-6e-06,-2e-06,-1e-06,-2e-06,-1e-06,2.5e-05,-2e-06,0,1.8e-05,-4e-06,1e-06,0,2e-06,7e-06,0,-1e-06,0,0,-1.5e-05,-1e-06,-1e-06,3e-06,1e-06,-1e-06,-2e-06,1.4e-05,1e-06,-2.1e-05,-1.1e-05,-3e-06,-2e-06,8e-06,1e-06,4e-06,2e-06,-1e-06,-1e-06,0,0,0,2e-06,5e-06,-1e-06,-1e-06,-1e-06,1e-06,-2e-06,-5e-06,0,1e-05,-1e-06,4e-06,3e-06,3e-06,1.8e-05,0,-3e-06,0,1e-06,-3e-06,0,1e-06,7e-06,2e-06,0,1.3e-05,-2e-06,9e-06,0,-2e-06,3e-06,-1e-06,1e-06,1e-06,0,1e-06,4e-06,1e-06,-9e-06,1e-06,0,0,-4e-06,5e-06,-1.6e-05,0,9e-06,0,-2e-06,0,1e-06,1.8e-05,0,0,-8e-06,4e-06,4e-06,0,-2e-06,1e-06,-2e-06,-3e-06,0,1e-06,1e-06,-7e-06,1e-06,0,-1e-06,1e-06,0,-2e-06,-1.5e-05,5e-06,-2e-06,3e-06,8e-06,8e-06
