0.009828,0.010391,0.011212,0.012455,0.012127,0.012582,0.014888,0.01475,0.012696,0.011858,0.013423,0.014798,0.013884,0.01278,0.014567,0.015997,0.015042,0.014689,0.01521,0.01488,0.015067,0.017586,0.016227,0.012393,0.012798,0.014149,0.015569,0.016354
0.011829,0.012615,0.013809,0.015678,0.01518,0.015286,0.018085,0.017946,0.015435,0.014687,0.016932,0.018898,0.017792,0.016381,0.01848,0.019944,0.018563,0.018168,0.018805,0.018316,0.01879,0.021845,0.020146,0.015693,0.016341,0.017893,0.019219,0.019955
0.015649,0.016772,0.018591,0.021797,0.02106,0.020107,0.023699,0.023922,0.020774,0.020293,0.023676,0.026766,0.025614,0.023534,0.025691,0.027266,0.025625,0.025211,0.025717,0.024788,0.025796,0.029476,0.027247,0.022098,0.023515,0.025524,0.02614,0.026598
0.020086,0.021348,0.023613,0.028109,0.027415,0.025471,0.029493,0.030644,0.027998,0.027876,0.031236,0.035248,0.035237,0.032492,0.033566,0.036156,0.035627,0.034538,0.034366,0.033262,0.03409,0.036971,0.03495,0.030405,0.032972,0.03526,0.034295,0.034636
0.026016,0.027862,0.030528,0.035223,0.035313,0.034532,0.038861,0.040527,0.039708,0.040463,0.041226,0.045803,0.049516,0.045841,0.045026,0.051884,0.054192,0.050135,0.04899,0.047619,0.04592,0.047304,0.047278,0.044269,0.048543,0.05039,0.046953,0.048722
0.037858,0.0417,0.045103,0.048377,0.050317,0.053942,0.058753,0.060329,0.061731,0.06233,0.058363,0.06597,0.077795,0.071959,0.067681,0.082833,0.08979,0.079419,0.076393,0.073172,0.06609,0.068545,0.073117,0.069403,0.076173,0.079133,0.07375,0.07922
0.059976,0.065676,0.070068,0.073554,0.078542,0.08704,0.091821,0.092653,0.09671,0.097248,0.087727,0.100916,0.12331,0.113246,0.103425,0.129176,0.142434,0.123771,0.118632,0.111348,0.095831,0.102732,0.113793,0.106384,0.118157,0.126275,0.118772,0.128147
0.090458,0.096034,0.100538,0.107127,0.116806,0.128525,0.132639,0.131419,0.136365,0.137557,0.125509,0.144299,0.173163,0.158377,0.144423,0.178853,0.198115,0.173139,0.1672,0.15371,0.127351,0.141966,0.160058,0.14743,0.165012,0.181567,0.171356,0.180676
0.125152,0.129954,0.131015,0.139334,0.153258,0.163215,0.165074,0.162449,0.165475,0.168032,0.159979,0.178895,0.202637,0.186182,0.172794,0.206482,0.228355,0.20809,0.207206,0.186941,0.151408,0.173504,0.196103,0.179214,0.196541,0.219697,0.20773,0.210066
0.156723,0.166226,0.161434,0.162855,0.174885,0.175355,0.174009,0.174243,0.17437,0.180333,0.181526,0.191015,0.199786,0.190224,0.183282,0.201564,0.217184,0.215428,0.229548,0.208144,0.168374,0.187523,0.208808,0.191418,0.198142,0.219155,0.208737,0.202339
0.178972,0.201379,0.192241,0.177064,0.182504,0.173983,0.17097,0.175208,0.174059,0.186363,0.19305,0.186416,0.187899,0.197259,0.196951,0.188424,0.190041,0.215367,0.251003,0.232378,0.188934,0.189926,0.202474,0.192059,0.191751,0.202415,0.193851,0.189802
0.186771,0.220724,0.208794,0.177607,0.179742,0.179433,0.18276,0.182248,0.179002,0.197687,0.200384,0.182908,0.194025,0.223176,0.223025,0.190002,0.183326,0.228752,0.277934,0.264678,0.218933,0.198402,0.19693,0.19634,0.206573,0.217595,0.209218,0.204504
0.180229,0.213648,0.197988,0.166411,0.175063,0.190449,0.200721,0.189166,0.180722,0.198221,0.192083,0.176113,0.201138,0.24,0.244096,0.199196,0.18502,0.234104,0.277898,0.27506,0.241735,0.206595,0.185044,0.192087,0.216672,0.235942,0.234997,0.214497
0.151326,0.179159,0.171167,0.155753,0.169139,0.19336,0.209438,0.189028,0.170019,0.182397,0.177995,0.169077,0.195821,0.237366,0.249206,0.200187,0.185875,0.23859,0.26333,0.259823,0.240181,0.195229,0.158509,0.175353,0.212234,0.232197,0.238967,0.20838
0.126383,0.152784,0.168622,0.170748,0.166326,0.17814,0.207894,0.20303,0.168013,0.164646,0.180091,0.186142,0.202856,0.235517,0.248794,0.218002,0.216998,0.262332,0.257378,0.239226,0.227027,0.188597,0.159238,0.182797,0.214814,0.21414,0.228002,0.211992
0.126567,0.159145,0.207689,0.221757,0.19205,0.178391,0.218044,0.255677,0.217135,0.190467,0.236686,0.27309,0.286708,0.302417,0.304297,0.298133,0.30694,0.356296,0.33226,0.271812,0.246288,0.221941,0.216495,0.266706,0.302714,0.260869,0.277864,0.28045
0.161612,0.207689,0.277115,0.294121,0.249327,0.224827,0.283745,0.362479,0.314159,0.259525,0.33294,0.408182,0.433634,0.442529,0.430685,0.427711,0.432064,0.499546,0.479117,0.387527,0.341356,0.311532,0.313931,0.401743,0.465469,0.386149,0.394546,0.397827
0.200041,0.256396,0.330649,0.340673,0.288676,0.275692,0.361779,0.462059,0.404437,0.328941,0.412937,0.518868,0.560607,0.567949,0.544065,0.531283,0.525365,0.605054,0.599518,0.499148,0.43503,0.394321,0.395626,0.514151,0.613916,0.511352,0.501113,0.499084
0.211102,0.262507,0.320023,0.316418,0.267846,0.276995,0.382489,0.484923,0.43854,0.352783,0.410353,0.518941,0.569962,0.585233,0.559705,0.52711,0.507707,0.578334,0.593929,0.519527,0.449261,0.403211,0.401347,0.520998,0.645049,0.556492,0.529403,0.516268
0.207477,0.231749,0.251316,0.23458,0.19959,0.226588,0.341222,0.424354,0.395663,0.322554,0.332998,0.397469,0.432001,0.459628,0.452607,0.413539,0.394057,0.431389,0.454032,0.440941,0.38576,0.337857,0.329391,0.406755,0.526581,0.492641,0.459828,0.43631
0.203473,0.213969,0.193183,0.164149,0.150692,0.180897,0.29051,0.342114,0.312333,0.282854,0.294163,0.287074,0.26485,0.285593,0.300937,0.289419,0.283304,0.281748,0.290764,0.351948,0.341691,0.284022,0.255449,0.271543,0.349048,0.370196,0.355153,0.332467
0.18629,0.211681,0.175971,0.132674,0.138374,0.168598,0.244077,0.271468,0.250569,0.247036,0.271101,0.246825,0.209002,0.205578,0.231067,0.258669,0.235977,0.197672,0.201174,0.278157,0.312025,0.272964,0.219972,0.206454,0.240364,0.273563,0.305805,0.305086
0.157213,0.188198,0.1503,0.112001,0.12489,0.14268,0.179157,0.207709,0.210398,0.197123,0.207711,0.20748,0.188599,0.175879,0.211796,0.247888,0.208674,0.160176,0.159778,0.211617,0.265459,0.254693,0.184805,0.170723,0.198866,0.22101,0.258878,0.273892
0.118899,0.145005,0.120196,0.105504,0.113151,0.113053,0.128267,0.153567,0.166719,0.142477,0.131862,0.144675,0.145061,0.137971,0.168909,0.198489,0.172548,0.132714,0.126549,0.172691,0.226615,0.216345,0.147677,0.129713,0.155618,0.170294,0.192369,0.216498
0.081046,0.096617,0.09108,0.097623,0.09999,0.091063,0.093394,0.107058,0.125348,0.111398,0.091922,0.092563,0.095693,0.100651,0.117587,0.129028,0.122313,0.104024,0.097579,0.136003,0.172775,0.155842,0.11866,0.107509,0.121371,0.137785,0.142585,0.155896
0.053655,0.062186,0.072349,0.08083,0.084158,0.081292,0.071892,0.083881,0.109635,0.104313,0.088342,0.075695,0.069124,0.074613,0.089995,0.097959,0.088244,0.078978,0.08433,0.104266,0.118126,0.104552,0.101154,0.10536,0.101504,0.109567,0.104732,0.106888
0.040629,0.058774,0.069454,0.060671,0.072046,0.084237,0.067034,0.077136,0.099268,0.093568,0.088459,0.080888,0.067628,0.059306,0.074326,0.097399,0.090614,0.0724,0.077579,0.083466,0.082829,0.079815,0.099262,0.111308,0.089908,0.084429,0.077869,0.073587
0.036039,0.057188,0.065096,0.048222,0.064496,0.083934,0.066868,0.068235,0.078886,0.077711,0.082321,0.084367,0.07308,0.054301,0.058552,0.088312,0.095355,0.073279,0.068429,0.069529,0.067165,0.070557,0.097069,0.110762,0.087932,0.079475,0.074863,0.06459
0.033938,0.047981,0.053973,0.042591,0.054232,0.067278,0.059791,0.061325,0.063754,0.061622,0.066677,0.076314,0.070487,0.05543,0.050687,0.06885,0.083484,0.067813,0.059429,0.057125,0.050739,0.058278,0.084741,0.095293,0.07897,0.070231,0.065582,0.056413
0.038777,0.041883,0.04219,0.040546,0.043632,0.044393,0.048948,0.056675,0.052944,0.047946,0.052015,0.062701,0.058671,0.053515,0.050987,0.052474,0.060009,0.055487,0.053362,0.049565,0.040839,0.05187,0.0683,0.07034,0.063184,0.057821,0.053113,0.047484
0.048742,0.046183,0.045431,0.046316,0.041559,0.036417,0.04409,0.053321,0.04723,0.043943,0.051442,0.057129,0.053082,0.053966,0.055906,0.050271,0.052382,0.055863,0.057934,0.053099,0.041962,0.048658,0.056428,0.053371,0.054649,0.059147,0.053615,0.045049
0.056133,0.053041,0.054186,0.05189,0.043692,0.038561,0.041451,0.045614,0.043191,0.045764,0.059754,0.062037,0.053377,0.056574,0.05925,0.055884,0.060937,0.064654,0.065499,0.059479,0.046077,0.043258,0.04665,0.047902,0.05556,0.066394,0.059441,0.049643
0.054372,0.050448,0.054126,0.048867,0.039462,0.03736,0.037608,0.038235,0.037577,0.044477,0.062412,0.059014,0.046652,0.05166,0.052219,0.05169,0.06005,0.061805,0.060328,0.056531,0.046666,0.039336,0.037238,0.041288,0.053695,0.065078,0.057874,0.048404
0.04634,0.040248,0.043656,0.038531,0.032627,0.033293,0.035574,0.037763,0.032169,0.036328,0.052792,0.044775,0.032356,0.036795,0.036375,0.039094,0.047035,0.04523,0.042066,0.046576,0.045755,0.036788,0.031746,0.030493,0.042708,0.055903,0.052729,0.0428
0.035954,0.030167,0.031301,0.028429,0.027905,0.027836,0.033903,0.040964,0.029102,0.027862,0.037362,0.029032,0.021033,0.021559,0.024656,0.033691,0.035553,0.027996,0.023599,0.034419,0.043,0.037317,0.030644,0.022601,0.030816,0.048759,0.048377,0.039062
0.027822,0.021993,0.025272,0.021494,0.026756,0.026717,0.032058,0.04158,0.027049,0.021842,0.027887,0.023921,0.017732,0.016995,0.022291,0.031852,0.031135,0.024704,0.019265,0.027198,0.035794,0.03548,0.029998,0.022444,0.026921,0.040179,0.038659,0.032626
0.028497,0.018382,0.02108,0.019367,0.029801,0.032381,0.032548,0.039293,0.025714,0.017435,0.021517,0.020303,0.016334,0.021114,0.029159,0.032488,0.033364,0.029148,0.021293,0.024572,0.026112,0.030423,0.031667,0.025152,0.026451,0.03343,0.034074,0.028148
0.031287,0.017369,0.016788,0.017528,0.030397,0.037867,0.032349,0.035715,0.027896,0.018483,0.017888,0.017603,0.018273,0.029439,0.038868,0.033255,0.037143,0.037231,0.026819,0.025091,0.019619,0.02499,0.031926,0.024619,0.024547,0.034724,0.041824,0.030639
0.031416,0.015413,0.011973,0.013483,0.026868,0.039906,0.032693,0.029849,0.028517,0.023981,0.019428,0.018133,0.021091,0.036414,0.046658,0.036821,0.040907,0.04532,0.033737,0.026859,0.0178,0.022566,0.030354,0.020852,0.024588,0.041657,0.050244,0.037651
0.027399,0.013698,0.010009,0.011737,0.024148,0.037984,0.030602,0.021922,0.026047,0.028812,0.022481,0.017585,0.020553,0.037654,0.048044,0.037142,0.039812,0.047985,0.036703,0.027637,0.021015,0.024776,0.030605,0.019598,0.025042,0.045007,0.051288,0.04311
