-3e-06,-3.9e-05,-9.7e-05,-4e-05,9.8e-05,0.000299,-0.000135,-0.00023,-0.017328,-0.010383,-0.004452,-0.000906,-5.1e-05,-7.8e-05,0.000266,8.8e-05,-6.4e-05,9.5e-05,-2.3e-05,-8.5e-05,-6e-05,-8.5e-05,-0.000173,-7.8e-05,0.00023,-0.000117,-9.3e-05,0.000108,-5e-06,-0.003505,-0.015593,-0.010102,-0.003747,-0.006068,-0.004629,-0.00183,-0.000685,-0.000164,-0.000844,-0.000512,-0.001581,-0.002043,0.000484,0.004849,-0.004578,-0.015806,-0.015741,-0.016285,-0.016692,-0.016576,-0.018678,-0.010466,-0.015788,-0.010342,-0.009133,-0.014847,-0.018339,-0.01781,-0.015236,-0.010016,-0.007449,-0.014767,-0.014388,-0.010621,-0.010644,-0.010632,-0.017146,-0.024263,-0.014811,-0.010414,-0.015905,-0.007482,-0.009621,-0.017744,-0.00744,-0.004951,-0.000884,-0.004303,-0.003049,-0.002029,0.000174,-0.000733,-0.000614,-0.001839,-0.001576,-0.00085,-0.001137,-0.000221,-0.000497,0.000941,0.001146,-0.001206,-0.001491,-0.002744,-0.003205,-0.001676,-0.001101,-0.009516,-0.00557,-0.002877,-0.001303,-0.000504,0.00083,-0.003565,-0.001827,-0.000176,-0.000655,-0.00282,-0.006857,-0.004319,-0.003112,-0.00084,-0.011443,-0.007431,-0.002666,-0.000331,0.000245,0.000301,0.000241,0.000319,-8e-05
-4.2e-05,3.4e-05,-1e-05,3.2e-05,-0.000197,-0.000104,3.6e-05,0.000266,0.010438,0.007544,0.003298,0.000647,0.000184,9.4e-05,0.000166,0.00018,0.000233,3e-05,5e-05,8.6e-05,-3.3e-05,4.3e-05,-4.5e-05,0.000203,6.3e-05,0.00023,0.000221,3.8e-05,2e-05,0.00246,0.00852,0.005873,0.00053,-0.002904,-0.000663,0.000544,0.000379,0.000294,0.000117,-0.000347,-0.001111,-0.002098,-0.002654,-0.00041,-0.017538,-0.003784,0.002066,-0.007656,-0.007273,0.003859,-0.001002,-0.004907,0.009429,0.002612,0.002131,0.001127,0.008042,0.002514,0.004737,0.002536,0.001511,-1.5e-05,0.001972,-0.008424,-0.005038,-0.001852,0.00023,0.008314,0.004164,0.000795,0.001383,-0.006649,-0.004111,0.004156,-0.001053,-0.007309,-0.005192,-0.000647,0.00175,-0.000137,-0.001575,-0.000402,-0.001068,-0.000142,0.000954,-0.00011,0.000274,0.000387,0.000421,0.000185,0.000334,0.000779,0.001528,0.001406,0.001753,0.00041,-4e-06,0.003898,0.001099,0.000269,-0.000394,-0.000122,-0.001626,-0.001471,0.000537,0.001694,0.001294,-0.000593,0.002155,0.001955,0.002527,0.000707,0.006991,0.00521,0.002499,0.000448,0.000635,0.000287,0.000492,0.000388,0.000196
-4.7e-05,-7.5e-05,-4.6e-05,-6.2e-05,-0.000123,-0.000319,-0.000243,-0.000159,-0.002922,-0.004313,-0.002254,-0.000532,-3e-06,2.9e-05,-7e-06,0.000198,8.7e-05,-7e-05,-8.1e-05,-8.2e-05,-9e-05,-0.000201,-0.00025,-0.000156,-0.00021,-8.1e-05,-0.000244,-0.000119,-0.00019,0.000378,-0.006463,-0.005009,-0.001648,0.002784,0.00056,0.000154,-8.9e-05,-0.000112,-0.000348,-0.000143,-0.000151,0.000579,0.001037,0.000405,-0.00229,-0.007774,-0.012664,6.2e-05,0.000754,-0.012015,-0.001423,-0.002667,-0.003928,-0.011982,-0.008085,0.001748,0.00419,0.001146,-0.002323,-0.006505,0.00209,-0.004148,0.003382,-0.000719,-0.00091,-0.001084,-0.001017,-0.004009,-0.008396,-0.006326,-0.00212,-0.000495,-0.003453,-0.004137,-0.002242,-0.002581,-0.002003,-0.004182,-0.001682,7.3e-05,-0.001577,-0.00097,-0.000895,-0.000848,-0.000354,-0.001426,0.000129,0.001161,0.00041,0.000132,6.6e-05,0.000422,-0.000256,-0.000639,-0.000811,-0.000844,-0.00017,-0.001702,-0.000682,-0.000125,0.000107,-0.000568,0.000142,-0.0012,-0.001013,-0.000751,-5.4e-05,0.002732,0.0011,2.2e-05,-0.000628,0.000121,-0.001741,-0.001778,-0.000666,-0.000121,0.000229,-0.000155,0.000215,-1.3e-05,1.2e-05
-0.000154,3.7e-05,2e-05,-2.8e-05,7.2e-05,1e-05,-4e-06,0.000224,0.000908,0.001913,0.00107,0.000263,6e-05,1.2e-05,1e-05,-0.000115,-0.000132,2e-05,7.5e-05,4e-05,-4.5e-05,-0.000166,0.000109,0.000131,-6.9e-05,-9.8e-05,-0.00012,1.6e-05,-0.000144,-0.000326,0.002105,0.003747,0.001996,-0.000578,-0.000128,0.000259,0.000143,0.000145,0.000251,-5.8e-05,-0.001151,0.000382,-9.1e-05,0.001712,-0.00016,0.00551,0.000341,-0.003632,-0.003775,0.002794,-0.004864,0.003726,0.003457,0.00245,0.004222,0.005596,-0.000209,-0.003147,-0.000623,0.000415,0.002549,0.005813,-0.007163,0.001663,-0.000686,0.007486,0.000117,0.002944,0.008937,0.001768,0.000874,-0.001398,0.002853,0.003903,0.003379,0.003513,0.000954,0.000284,-0.000454,0.00039,-0.001135,-0.000808,-0.000362,0.000379,-0.00079,0.000197,-0.000212,-0.000127,-6.3e-05,3e-06,-0.000115,-0.000202,-0.000624,0.00073,0.00108,0.000958,0.000703,-6e-06,0.00158,0.000167,-6.4e-05,-0.000214,-7e-06,0.000676,0.000574,0.000432,-0.000487,0.000998,-0.001351,-0.000396,0.00104,0.000888,0.001552,0.001479,0.000859,0.000323,0.000123,0.00011,9e-06,-5.7e-05,-8.5e-05
0.000117,7.6e-05,5.3e-05,9.6e-05,7.4e-05,8.4e-05,0.000153,-0.000152,-0.000703,-0.001585,-0.000627,-0.000134,-7e-06,2e-05,-3.7e-05,4.2e-05,2.7e-05,5.7e-05,-2e-06,-1.5e-05,-6e-06,0.000184,8.1e-05,4e-05,-0.000129,4.9e-05,2.3e-05,9e-05,-8.4e-05,-4e-06,-0.000413,-0.003762,-0.001898,-0.000973,-0.00074,-0.000266,-7e-06,-0.000315,-0.000134,0.000269,0.000317,-0.000601,-0.000285,-0.000407,-0.000844,-0.001151,-0.005476,0.003021,0.003381,-0.00013,0.007829,-0.000691,0.003634,-0.009661,-0.000974,0.000828,-0.000791,-0.001758,-0.002721,-0.000702,0.000467,-0.005164,0.001443,0.000398,0.00085,-0.003447,-0.002281,-0.001316,-0.006451,-0.001548,-0.000318,0.000393,-0.000473,-0.001634,-0.00253,0.003741,0.000398,-0.000376,-0.001297,-0.001649,-0.00073,0.000176,0.000761,0.000649,-7.3e-05,-0.000344,0.000137,-0.000199,-0.000377,0.000277,-0.000405,0.000234,0.001051,-0.00119,-0.000708,-0.000134,-0.000128,-0.001719,-0.003262,-0.001466,-0.000266,0.000351,0.000388,-0.000478,-0.000383,-0.000602,0.00023,-0.000596,0.001726,-0.000308,-0.000947,-1.1e-05,-0.001084,-0.000913,-0.00078,-0.000228,4e-06,-5.9e-05,-7.9e-05,-6.3e-05,-3e-06
9e-06,2.6e-05,-1.4e-05,-3.4e-05,4e-05,3.9e-05,4.9e-05,1.9e-05,-0.000298,8e-05,0.000197,0.00016,1.6e-05,3.4e-05,1.7e-05,-0.000102,-0.000176,5e-05,-3.6e-05,-5.1e-05,3.4e-05,4.8e-05,4.3e-05,-5.2e-05,6.9e-05,-3.3e-05,2.3e-05,-3.1e-05,-1.8e-05,5.5e-05,-0.000325,0.001646,0.002462,0.00067,0.00049,0.000304,2.9e-05,7e-06,-0.000156,0.000131,0.000411,0.000318,-0.000494,0.001496,-0.001079,-0.002725,0.00414,0.000465,-0.000889,-0.002416,-0.006436,-0.001751,-0.000671,0.002578,0.001968,0.001908,-0.001284,0.002176,0.003187,0.000646,-0.00214,0.001975,-0.000894,0.000929,0.000204,-0.000125,0.001857,0.004207,0.003637,0.007642,0.003061,-0.001623,-0.000831,0.000137,0.003372,-0.000868,0.000553,-0.000194,0.000972,0.000853,0.00117,0.000498,0.000506,0.000972,0.000436,0.000186,0.000347,0.00013,-8.7e-05,0.000112,-0.00026,-0.000453,-0.000518,-0.000202,-0.000359,-0.000439,8.7e-05,0.000535,2.4e-05,0.000273,-4.7e-05,-0.000215,-4.9e-05,0.000579,-0.000988,-0.000357,-2.9e-05,-0.000235,-0.00179,-0.000782,0.000668,0.000442,-0.000749,0.000166,-6.2e-05,-5.7e-05,2.8e-05,-0.000172,4.7e-05,-0.000241,-4.6e-05
2.1e-05,-7.1e-05,-6.5e-05,1.3e-05,3e-05,-7.6e-05,-6e-05,-0.000225,0.000209,0.000134,-0.000294,-0.000292,-6.1e-05,3.6e-05,-0.000139,-7e-05,-7.2e-05,3.5e-05,-4.4e-05,-5e-05,8e-06,4.2e-05,-2.9e-05,-8.3e-05,-3e-06,-7.3e-05,6e-05,-0.000146,-1.9e-05,1.5e-05,-0.000208,-0.00219,-0.001069,6.3e-05,0.000136,0.00011,-2.7e-05,8.5e-05,6e-05,-8e-06,-0.000248,-0.000411,0.000925,-0.002349,0.000231,-0.001469,-0.003214,0.001737,0.001058,-0.000408,0.000581,0.00303,-0.000284,-0.001319,-0.001381,-0.001344,-0.000695,-0.000394,-0.000326,0.001512,0.001298,-0.002973,0.000805,-0.003099,-0.002072,0.001784,-0.001365,-0.004183,-0.002001,-0.002496,-0.004531,0.002247,-0.002251,0.000493,-0.002063,-0.001851,-0.000231,0.00171,0.00136,-0.002424,-0.001552,-0.001248,-0.000344,0.000567,0.00023,-0.000454,0.00013,-0.000135,-0.000499,0.000138,-0.000562,-7.5e-05,-0.000172,-0.000609,0.00062,-4.5e-05,-4.9e-05,-0.000157,-0.000307,-0.000596,-0.000501,0.000183,0.000349,-0.000339,-0.00058,-0.000358,-0.000199,-0.000233,0.000309,-3.9e-05,-0.000842,0.000325,0.00037,0.000137,0.000157,-0.000213,-3.5e-05,-0.000235,-0.000125,-9.8e-05,-0.000123
1e-05,-5e-06,0,-3.3e-05,-3.2e-05,-4.5e-05,-0.000176,0.000131,1.6e-05,-5.7e-05,0.000384,0.000274,-1.1e-05,3.4e-05,2.7e-05,-2.4e-05,-1.4e-05,1e-06,-6.2e-05,3e-06,1.5e-05,-1.2e-05,-8.1e-05,1.5e-05,-9e-06,-0.00012,-7.9e-05,2e-06,-3.4e-05,1.7e-05,-0.00038,-0.000195,0.000914,3.6e-05,0.000407,-1.8e-05,-4.8e-05,-9.6e-05,-0.000197,-0.000219,-6.4e-05,0.000356,-0.000668,-0.001134,-0.00077,0.009109,0.003941,-0.002935,0.002372,0.001004,-0.002801,0.000569,-0.001681,0.000861,-0.003376,0.002058,-0.000984,0.004792,-0.000449,-0.001354,0.001304,-0.002448,-0.003622,0.000687,0.002351,-0.001284,0.001102,0.002021,0.001564,-0.00054,0.002065,-0.000215,0.001673,0.000946,-0.000139,0.001559,-0.000977,0.000832,0.000849,0.002089,0.000831,-0.001348,-0.00077,-0.000209,-0.000191,0.000152,-3.2e-05,-0.000611,-0.000256,-4.8e-05,-0.000149,-0.000125,-0.000373,-0.000607,-4.4e-05,-0.000492,0.000238,0.000228,0.000631,0.000467,5.9e-05,-0.000317,-0.000298,0.000476,-0.000548,-0.000229,-0.000366,0.000565,-0.000871,-0.000613,-0.000391,0.000357,-0.000151,0.000145,-9.8e-05,-0.000196,-2.6e-05,-0.000185,-1.6e-05,-0.000143,-0.000187
-3.6e-05,0,-5e-06,-2e-06,2e-05,1e-05,8e-06,3.7e-05,4.2e-05,4.7e-05,-0.000494,-0.000175,-1e-06,2.8e-05,8e-06,3e-06,-8.6e-05,-1.5e-05,5e-06,3e-06,-7e-06,-3.2e-05,6.3e-05,4.1e-05,-1.7e-05,3e-06,5.7e-05,-2.8e-05,3.6e-05,-2.8e-05,2.5e-05,-0.000197,0.000335,-0.000215,-0.000545,-0.000442,-0.000357,-4.1e-05,0.000313,0.000164,-6e-05,-0.000105,-0.000916,0.000288,0.000437,-9.8e-05,-0.002732,7e-06,-0.00078,0.000353,0.003106,0.005691,-0.000677,-0.003853,-0.001112,-0.001595,-0.00052,-0.000662,-0.000164,0.004062,-0.000124,0.001316,0.002015,0.000565,-0.000298,0.003287,0.001402,0.001853,-0.003896,0.001114,-0.002015,0.000136,-3.3e-05,-0.000906,0.000932,-0.001774,0.000254,-0.000313,-0.000614,-0.001012,0.000147,0.000289,8.6e-05,-0.000373,-0.001039,-0.000103,-0.000145,9e-06,-0.000129,-3e-05,5.5e-05,0.000177,-0.000272,-0.00013,9.4e-05,0.000153,0.000158,-0.00011,0.000194,0.000119,3.1e-05,0.000255,-0.000107,-2.8e-05,0.00133,0.000201,-0.000412,0.000427,-0.000643,0.000247,-0.000268,-0.000345,-0.000244,-0.000102,-0.000216,-9.8e-05,-0.00013,-0.000121,-0.000128,-4e-05,-0.000131
-1.2e-05,-1.3e-05,1.3e-05,-7e-06,3.4e-05,2e-06,-2.2e-05,-3.5e-05,-0.000116,-7e-05,0.000229,0.000105,-6e-06,1.9e-05,-1.5e-05,-1.9e-05,4e-06,-6.9e-05,-1.6e-05,-5.2e-05,2.1e-05,-4.5e-05,-4.3e-05,1.4e-05,-2.1e-05,-3e-05,7.8e-05,9.7e-05,-2.3e-05,-7.4e-05,0.000146,0.000531,0.00021,0.000319,-0.000161,-7e-06,0.00021,-7e-05,3.8e-05,-3.5e-05,0.000104,8.9e-05,0.001024,-0.000296,0.000211,-0.003599,0.001008,-0.00463,-0.001581,-0.000937,-0.002362,-0.002552,0.000519,0.003098,-0.00209,-0.003249,-0.000615,0.000849,-0.001265,-0.003451,-0.000471,0.000182,-0.001484,-0.00314,-0.0021,-0.002084,-1.3e-05,-0.001285,0.001996,0.000163,-0.000266,-0.000335,0.00185,-0.000821,0.00031,0.000272,-0.001541,-0.001385,-0.000781,0.000475,0.00069,-0.000132,0.000342,-1e-04,9.6e-05,-0.000312,-0.00042,-0.000171,3.2e-05,-0.000128,-0.000155,-0.000174,-0.000172,4e-05,-9.4e-05,-0.00044,2.9e-05,-0.000165,1.7e-05,0.000213,5.1e-05,-1e-06,0.000112,1.4e-05,0.000228,-0.00057,-1e-05,0.000263,0.000215,-0.000532,-0.000463,0.000184,4.9e-05,-0.000373,-0.000141,-5.1e-05,-0.000163,-4.2e-05,-4.4e-05,-5.3e-05,-4.5e-05
0,4.3e-05,0,1.1e-05,2.2e-05,-9e-06,2.1e-05,-3e-06,-4.6e-05,3.3e-05,3.9e-05,-1.2e-05,8e-06,9e-06,-4e-06,2.5e-05,-3e-06,6e-06,-1.8e-05,-1.6e-05,2.8e-05,-1e-06,1.5e-05,-4e-06,7.4e-05,2.8e-05,3.9e-05,1.6e-05,3.4e-05,-0.000154,-5e-05,0.000343,-0.000582,-7.4e-05,3e-06,0.000152,-9.9e-05,-2e-05,-4.6e-05,-0.000119,0.000172,8e-06,-7.3e-05,0.000233,-0.000181,0.001261,-0.000369,0.003799,0.000477,0.001558,0.001032,0.000549,0.001735,0.000706,0.002056,0.002546,-0.001166,-0.001738,0.000885,0.000425,-0.002363,-0.000958,0.000782,0.003253,0.001203,0.000413,-0.001103,-9.4e-05,-0.000721,-0.001162,0.001495,-0.001491,-0.000287,0.001518,-0.00071,0.000113,0.001629,0.000434,-0.000233,-0.000483,-0.000311,0.000345,-0.000276,-3.2e-05,-0.00012,-0.000252,-0.00033,-3e-06,-0.000309,-0.00024,-2.9e-05,8.9e-05,-0.000368,-8.3e-05,6.2e-05,-3.7e-05,5.7e-05,-3.8e-05,-8.3e-05,-0.000204,0.000176,-2.7e-05,1.8e-05,1.5e-05,-0.000485,0.000357,-0.000388,-0.000164,0.000321,0.00026,-9.8e-05,-0.000102,-0.000332,1.9e-05,-5.9e-05,-6.2e-05,-4.1e-05,-5.1e-05,-7.4e-05,-1.2e-05,8e-06
-3e-06,-4e-06,-1.3e-05,-2e-05,3e-06,7e-06,-2.3e-05,-6.5e-05,3.2e-05,4.5e-05,-1.8e-05,-7.1e-05,-5e-06,-5e-06,-2.6e-05,-4.2e-05,-2.4e-05,-4.1e-05,-5e-06,1.7e-05,-2.4e-05,1.2e-05,1.5e-05,-2.5e-05,-3.5e-05,7e-06,5e-06,3e-06,-3e-06,5.6e-05,0.00011,-0.000367,9.5e-05,0.000493,0.000246,0.000103,8e-05,1.3e-05,5.1e-05,3.8e-05,-3e-05,1.9e-05,8.2e-05,-0.000143,-1.5e-05,-0.001061,-0.000637,0.000553,-4.2e-05,0.000869,-0.000456,0.000397,-0.001487,-0.000637,-0.00141,-0.001098,0.000791,0.000574,-0.000359,0.00059,0.00021,0.000144,-0.000115,0.000324,-0.001655,5.6e-05,0.000113,-9.6e-05,-0.000514,0.000573,-0.001098,0.001454,0.000348,-0.001054,-0.001748,-0.000421,-0.000204,0.00049,-0.000247,0.000478,0.000192,0.00018,-0.000564,-0.000205,0.000329,0.000163,3.9e-05,2.4e-05,0.00016,-2.8e-05,-0.000178,6e-05,0.000109,-0.000273,-0.000322,0.000118,-8.1e-05,0.000119,-0.000155,0.000424,2e-05,8.4e-05,-5.2e-05,-9.6e-05,-6.1e-05,0.000411,3.6e-05,0.000103,-0.000369,-0.000723,-4e-06,0.000116,-7e-05,2.3e-05,-9.8e-05,0.000107,-5.1e-05,1e-06,-3e-05,-5.2e-05,4e-06
-1.8e-05,-1.1e-05,2e-06,1.5e-05,-3e-06,-1.8e-05,8e-06,5.8e-05,8.5e-05,-9e-06,-6.4e-05,-8.4e-05,-1.2e-05,-1.8e-05,-6e-06,2.8e-05,2.2e-05,-2.5e-05,-1.7e-05,1e-05,8e-06,-1.7e-05,0,-2.8e-05,-1.2e-05,1e-05,-4e-05,7e-06,-2e-06,5.8e-05,-2.8e-05,8.9e-05,0.000615,-0.00016,-0.000152,-3.6e-05,-0.000116,-1.2e-05,1e-06,-2.2e-05,1.1e-05,-4.5e-05,-0.000185,0.000361,0.000194,-0.000782,-0.000197,0.000967,-3.9e-05,-0.002307,0.001173,0.00221,-0.001567,0.00229,0.002081,0.00073,-0.001663,0.000604,0.001601,-0.000344,-1.3e-05,-0.001449,6.3e-05,0.000374,0.000892,-0.001468,-0.000278,0.000329,0.000616,-0.000499,0.000696,-0.000343,-0.000287,-0.000284,0.000881,-0.000428,-0.000416,0.000924,-0.000203,-0.000535,-0.00037,-4.3e-05,-5e-05,-0.000109,-0.000105,3.7e-05,4.6e-05,-2.8e-05,1.9e-05,-0.000114,-5.8e-05,-4.8e-05,1.6e-05,0.000112,-0.000206,3.4e-05,4.6e-05,3.9e-05,4.7e-05,-0.000411,-4.4e-05,0.000111,-0.000147,8e-06,-0.000226,-9e-06,-8.4e-05,-0.000155,-1e-06,0.000806,-4.3e-05,-0.000366,-0.000157,-4.8e-05,-0.000136,-5e-05,-3.5e-05,-4.3e-05,5.9e-05,-3e-06,2.8e-05
-7e-06,0,-4e-06,-1.3e-05,1e-06,-1e-05,1.6e-05,5.5e-05,4e-06,6e-06,5.1e-05,-3.6e-05,-9e-06,-1.5e-05,-2.3e-05,-4e-06,-1.4e-05,1.7e-05,-2.4e-05,2.6e-05,9e-06,2e-05,1e-05,2.3e-05,-2e-06,-5e-06,-3.7e-05,-4.5e-05,8e-06,3.5e-05,-5e-05,-0.000265,-0.000911,0.000395,-4.2e-05,7.8e-05,-2.7e-05,8e-06,-1e-05,1.2e-05,-5.3e-05,5e-06,-6.1e-05,-0.000432,-9.9e-05,0.000915,0.001441,-0.001689,0.002499,0.000804,-0.000781,-0.001281,0.000207,-0.000872,-0.000555,-0.001106,6.5e-05,-0.000494,0.000977,0.000739,-0.000476,0.000293,-0.000729,-0.00061,0.000109,-0.00019,0.000307,-0.00086,-0.000425,0.000286,0.000126,0.000524,0.000277,0.00055,0.000838,0.000192,0.000342,-0.000831,-1.7e-05,-3.3e-05,0.000247,0.000192,-1e-06,-8e-06,-2.3e-05,-2.9e-05,3.3e-05,-6.1e-05,-3.4e-05,-5.4e-05,-6.8e-05,-0.000103,7e-06,-0.000168,-1.6e-05,-4.2e-05,-0.000126,7.6e-05,0.000138,0.000113,-7.8e-05,5.3e-05,0.000151,-2.5e-05,-3.3e-05,-0.000193,0.000189,-6.7e-05,-9.9e-05,7.6e-05,2.7e-05,-1.3e-05,6.5e-05,3.3e-05,4.5e-05,1.5e-05,-3.7e-05,-2.9e-05,1e-06,-2.7e-05,2.3e-05
1.1e-05,-1.4e-05,-3e-06,7e-06,2e-06,1e-05,-1.1e-05,3.8e-05,-4.4e-05,-3.5e-05,-3e-06,3.9e-05,-2e-06,2e-06,0,-1e-06,-2.2e-05,-1.1e-05,3e-06,3e-06,3e-06,-8e-06,-8e-06,-2e-06,9e-06,-1.1e-05,-1.6e-05,2.4e-05,-1.4e-05,2e-06,3.9e-05,-1.6e-05,-0.000854,-0.000177,-2.8e-05,-6.9e-05,-2.2e-05,-5e-06,2.4e-05,2.9e-05,0.000118,-1.3e-05,4.3e-05,-7.8e-05,-0.000114,-0.000277,-0.000618,0.001248,-0.000653,0.000228,-0.000514,-0.001121,-0.000447,0.000205,0.000192,-0.00054,0.001183,-0.001308,-0.001081,-0.000236,0.000708,0.000159,0.00039,6e-04,0.000212,0.000758,0.000389,-0.000367,0.000146,-0.001129,3.4e-05,-0.000509,-0.000523,-0.000401,-0.000324,0.000366,4.8e-05,-0.000138,0.00026,0.000157,-7.7e-05,-3.7e-05,-7e-05,0.000107,-1.3e-05,-4.6e-05,3.7e-05,-4.5e-05,1.9e-05,-1e-06,5.3e-05,-4.4e-05,0,0.000211,3.1e-05,0.000115,-5e-06,-1.3e-05,3.4e-05,0.000118,0.000116,4.9e-05,-4.9e-05,2.6e-05,0.000194,-0.00015,-0.000157,-0.000197,-0.000136,-0.000342,-1.4e-05,-0.000222,-2.3e-05,1e-06,-1.7e-05,-5.6e-05,5.1e-05,-2.4e-05,-1.7e-05,2.1e-05,1e-06
-1e-06,0,6e-06,-6e-06,-4e-06,-1e-06,-1.6e-05,-2.4e-05,-2.6e-05,-8e-06,-2.9e-05,6e-06,-2e-06,-1.1e-05,-4e-06,-5e-06,-6e-06,1.9e-05,-1e-05,-5e-06,-1.2e-05,1.4e-05,1e-06,1.7e-05,7e-06,-2e-06,-7e-06,-1e-06,1e-05,5e-06,-5.4e-05,1.1e-05,0.000373,0.000297,5.4e-05,4.2e-05,-2.7e-05,-5e-06,3e-06,-1e-05,-1.8e-05,-2.7e-05,6.7e-05,0.000355,2.1e-05,-0.001437,-0.000871,-0.00057,0.00038,-0.000843,0.000441,-0.000737,-0.000109,0.000972,1.4e-05,-0.000134,-0.000397,-8.8e-05,0.000483,-0.000549,-0.000384,-0.000113,-0.000241,0.000153,-0.000337,-0.000368,-0.000381,-4.3e-05,0.000274,0.000473,-0.000863,-0.000272,6.5e-05,0.000326,-0.000201,-0.00022,3.7e-05,-5e-05,-7.9e-05,1.8e-05,4.4e-05,-0.000105,0.000182,-2.7e-05,7.8e-05,3e-05,0.000106,4e-06,-2.2e-05,-4e-06,6e-05,5.7e-05,9.2e-05,-4.1e-05,3e-05,-3.6e-05,-2.8e-05,3.4e-05,2e-05,-5e-06,-1.8e-05,-6.3e-05,3.9e-05,-1.7e-05,9.4e-05,2e-06,6.3e-05,-9.3e-05,-7.2e-05,7e-05,-0.000171,-0.000176,1.8e-05,-2.1e-05,5.5e-05,-5.6e-05,-8e-06,-5e-06,-5e-06,-1.9e-05,-2.6e-05
-2e-06,0,-3e-06,7e-06,-7e-06,-4e-06,1e-06,-2.3e-05,1.5e-05,1.8e-05,3.4e-05,1.4e-05,-6e-06,8e-06,-8e-06,1e-06,5e-06,9e-06,-2e-06,-7e-06,-3e-06,-4e-06,-2e-06,-2e-06,-6e-06,-2e-06,-2.8e-05,3e-06,1e-06,5e-06,4.3e-05,-1.2e-05,-6.6e-05,-0.000312,2.2e-05,-3e-05,3.1e-05,-1.4e-05,2.1e-05,-2.2e-05,2.4e-05,1.6e-05,-0.000152,-0.000103,5.8e-05,0.000693,0.000643,0.000436,-0.000889,0.001001,0.000143,0.000429,0.00025,0.000137,-0.000654,0.000724,-0.000384,-0.000236,-0.00026,-5.8e-05,0.00027,0.000438,0.00016,-0.000348,-0.000265,0.000738,0.000446,4.3e-05,-0.000222,-7.4e-05,-3.5e-05,0.000189,0.00037,0.00019,0.000216,0.000497,8.2e-05,0.000136,-4e-06,0.00016,8.8e-05,-7e-06,6.7e-05,1e-05,-3.5e-05,5.1e-05,-2.8e-05,5e-06,-8e-06,3e-05,-4.4e-05,4.3e-05,-7.4e-05,-9.4e-05,-1.3e-05,-8.6e-05,-8.8e-05,5.5e-05,-6.4e-05,1e-06,-3.9e-05,-1.4e-05,2e-06,-2.1e-05,-4.9e-05,9.5e-05,-5.1e-05,-2.9e-05,-5.1e-05,-0.000134,6e-05,0.000102,-0.000149,1.1e-05,-1.5e-05,8.2e-05,-4e-06,5e-06,-2e-06,-2e-06,-1.5e-05
1e-06,6e-06,0,-6e-06,-3e-06,4e-06,-6e-06,1e-06,3.3e-05,-8e-06,-5e-06,3.7e-05,-2e-06,-1.1e-05,5e-06,1e-06,-9e-06,2e-06,4e-06,4e-06,7e-06,2e-06,-6e-06,-5e-06,-2e-06,-2e-06,2e-06,-9e-06,-3e-06,1e-05,-1.9e-05,0.000114,-0.000102,0.000265,-2e-06,-5.5e-05,3.2e-05,1.5e-05,-3.6e-05,2.3e-05,1.9e-05,-2.3e-05,6e-05,-3.8e-05,-8e-06,0.000628,-8.9e-05,-0.001367,0.00053,-0.000487,-0.00036,-0.000497,0.000171,0.000202,0.000358,2.9e-05,-0.000459,6.3e-05,0.000325,2.7e-05,0.000113,-0.000125,-7.7e-05,0.000117,0.000341,-0.000654,-0.000339,0.000116,-0.000244,-6.5e-05,0.00047,0.000115,-0.000151,-1.1e-05,0.000466,-0.000313,-0.000247,0.000135,2.2e-05,-0.000209,-9.4e-05,-0.000102,5.2e-05,4.2e-05,-8.1e-05,-6.1e-05,5e-06,6.7e-05,-2.8e-05,3e-05,-1.1e-05,-4.6e-05,7e-06,-1.5e-05,-2.4e-05,1e-06,-2e-06,-7e-06,0,-0.000119,3.3e-05,-9.6e-05,3.2e-05,3e-06,-7.6e-05,2e-05,-7e-06,-2.3e-05,-4e-05,0.000148,-0.000126,1.1e-05,1.8e-05,5.2e-05,-3.5e-05,-3.5e-05,9e-06,3e-06,3e-06,-7e-06,-4e-06
3e-06,3e-06,0,4e-06,-4e-06,-1e-06,-4e-06,4e-06,4e-06,4e-06,-3.2e-05,-2.2e-05,0,3e-06,-6e-06,-2e-06,-1e-06,6e-06,-1.3e-05,2e-06,-6e-06,-3e-06,2e-06,-7e-06,5e-06,5e-06,6e-06,7e-06,6e-06,-5e-06,1.1e-05,-0.000108,0.000315,-0.000204,-1e-06,-1.7e-05,5e-06,-8e-06,-1e-06,-1.7e-05,1.4e-05,3.3e-05,4.8e-05,-1.4e-05,-9e-06,-0.000589,8.8e-05,0.000604,-9.1e-05,-0.000418,0.000222,-4.9e-05,0.000188,0.000259,-0.000174,2.9e-05,0.000255,9.1e-05,-0.000555,0.000475,9e-05,-0.000292,-9.7e-05,1.3e-05,8e-06,-0.000266,1.1e-05,-5.4e-05,0.000327,-0.000181,-0.000519,5.8e-05,6.8e-05,-0.000158,-0.000345,0.000366,0.000234,-0.000173,-4e-06,0.000182,1.1e-05,1e-04,2e-05,-4.2e-05,-1e-06,-5.1e-05,-3.4e-05,-2.6e-05,-3e-05,-2.1e-05,-2e-06,-1.3e-05,-2.4e-05,-4.1e-05,-4.5e-05,1e-05,-5.4e-05,-4e-06,1.3e-05,-4e-06,-6e-05,1.5e-05,-1.9e-05,5e-06,-0.000135,1.1e-05,2.1e-05,2e-06,8.6e-05,-0.000115,-2.6e-05,-5.4e-05,3.8e-05,-4.4e-05,3e-06,3.3e-05,-1.4e-05,-1.4e-05,-8e-06,-4e-06,-6e-06
-1e-06,1e-06,-3e-06,-4e-06,-6e-06,-2e-06,-2e-06,1.5e-05,-2.1e-05,-4e-06,2.6e-05,-5e-06,0,3e-06,2e-06,5e-06,-2e-06,-7e-06,2e-06,3e-06,-2e-06,-5e-06,1e-06,0,-2e-06,1e-06,-1.2e-05,1e-06,0,-1e-06,1.5e-05,2.5e-05,-0.000257,6.7e-05,2.1e-05,3.4e-05,-5e-06,0,7e-06,-1.4e-05,1e-05,-2.6e-05,-3.3e-05,7.8e-05,-2.6e-05,0.00037,-7.5e-05,0.000222,-5e-06,0.00052,0.000285,-0.000322,0.000145,-0.000142,0.000164,-0.000108,0.000492,-0.00028,0.000238,-0.000564,-0.00019,-3.6e-05,7.4e-05,0.000231,0.000185,0.000155,0.000241,0.000221,-0.000204,0.000448,0.00052,-0.000127,-0.000293,0.000287,-8.7e-05,1e-05,-9.6e-05,-0.000226,0.000126,-0.00018,-8.3e-05,3.1e-05,-9.7e-05,6.1e-05,4.6e-05,7e-05,-3.8e-05,-2e-06,3.1e-05,2.1e-05,-1.4e-05,1.5e-05,-4e-06,3.3e-05,5.6e-05,-3.3e-05,2.9e-05,-2e-06,2e-05,0,9e-06,1.5e-05,1.8e-05,1e-05,7.4e-05,-3.7e-05,-5.1e-05,1.2e-05,-3.9e-05,0.000149,2.6e-05,0.000139,-2.3e-05,-2.8e-05,-6e-06,-5e-06,-1.1e-05,-1.3e-05,2e-06,-9e-06,6e-06
-1e-06,0,1e-06,3e-06,1e-06,1e-06,5e-06,3e-06,-1.7e-05,1e-06,-5e-06,1.1e-05,-1e-06,3e-06,-3e-06,-1e-06,-5e-06,0,-7e-06,1e-06,2e-06,2e-06,2e-06,2e-06,2e-06,0,-6e-06,-1e-05,-2e-06,-1e-06,-1.9e-05,-8.2e-05,0.000189,-6.2e-05,4.2e-05,3.8e-05,-1.6e-05,3e-06,-1.4e-05,-6e-06,4e-06,2.6e-05,2.6e-05,-3.9e-05,-1.8e-05,0.000214,0.000213,2.4e-05,-0.000519,-0.000347,-0.000343,-0.00012,-0.000232,0.000225,0.000264,0.000365,-0.000146,0.000113,-0.00037,0.000371,-8.7e-05,-0.00022,-8.4e-05,7.2e-05,-0.000216,-0.000102,-2.6e-05,-5.4e-05,-7.4e-05,-0.000162,2.3e-05,1.4e-05,1e-05,-0.000128,1.6e-05,-0.000262,7.4e-05,6e-05,-1.6e-05,0.000166,5.2e-05,6.2e-05,-2.5e-05,-4e-05,1e-05,8e-06,-2.8e-05,-1.8e-05,-2e-06,-1.3e-05,6e-06,1.7e-05,-1.5e-05,-4e-06,1e-05,2.3e-05,-1e-05,5e-06,3.1e-05,7.3e-05,2.6e-05,-2.4e-05,-1.5e-05,-2e-06,8e-06,-2e-05,-1e-05,-5e-06,-5.8e-05,-0.000113,-5.4e-05,-6.9e-05,1e-05,2.3e-05,-6e-06,-1.5e-05,-3e-06,-1.4e-05,-7e-06,3e-06,8e-06
0,-6e-06,-1e-06,-3e-06,-1e-06,0,2e-06,-7e-06,4e-06,7e-06,-3e-06,2e-06,0,3e-06,2e-06,-1e-06,0,-7e-06,-5e-06,1e-06,-2e-06,-5e-06,3e-06,5e-06,-3e-06,-2e-06,7e-06,6e-06,4e-06,0,1.8e-05,-9e-06,2.4e-05,-2.2e-05,-3e-06,-6e-06,-3.9e-05,-3e-06,1.1e-05,2e-06,1e-05,-2.1e-05,-6.1e-05,-3.3e-05,3e-06,-0.000492,-0.000316,-0.000306,7.1e-05,0.000177,0.000124,0.000101,-0.000155,0.000303,-0.000121,-0.000329,-0.000164,7.8e-05,0.000453,-0.000285,-6.3e-05,4.2e-05,0.000155,4.5e-05,-0.000108,0.000353,1e-04,0.000191,6.7e-05,8.1e-05,-0.000215,-3.9e-05,-4.6e-05,-9.8e-05,3.3e-05,-7e-05,-6.4e-05,0.000113,-8.9e-05,-6.9e-05,-4.2e-05,1.7e-05,2.8e-05,-2.8e-05,-4e-05,-3.4e-05,4e-06,-1.1e-05,-2e-06,-1.7e-05,4e-06,-1e-05,1.5e-05,-1.3e-05,0,1.7e-05,3.8e-05,6e-06,-3.9e-05,-2e-06,-3e-05,6e-06,3e-06,-7e-06,7.3e-05,4.1e-05,-2e-06,-1e-05,-1.4e-05,3.4e-05,7e-05,7.4e-05,-2.7e-05,-8e-06,-2e-06,-1e-05,5e-06,-9e-06,1e-06,-7e-06,5e-06
-1e-06,0,1e-06,4e-06,0,-1e-06,-3e-06,-6e-06,1.5e-05,-7e-06,1e-06,-4e-06,0,2e-06,0,-5e-06,-2e-06,-3e-06,1e-06,2e-06,-1e-06,2e-06,-2e-06,0,1e-06,-2e-06,2e-06,-4e-06,-3e-06,1e-06,-2.4e-05,3e-05,5.4e-05,1e-06,-8e-06,-4e-06,0,2e-06,-4e-06,-5e-06,0,8e-06,3.3e-05,4.3e-05,1.5e-05,0.000244,0.00027,0.000544,-4.2e-05,-4e-05,-3.6e-05,0.000286,0.000259,-0.000274,0.000306,5.9e-05,-0.00014,0.000221,-0.000143,-1.6e-05,-5.1e-05,0.000236,-0.000107,0.000133,0.00017,-7.2e-05,-0.000238,-5.6e-05,-9.8e-05,-2.1e-05,7.8e-05,0.000207,-1e-06,0.000162,4.5e-05,3.7e-05,1e-06,9e-06,-2e-06,9e-05,-1.5e-05,-8.7e-05,-8.8e-05,1.1e-05,-1.5e-05,3e-06,2e-06,0,-1.5e-05,4e-06,-5e-06,-1.6e-05,2e-06,-3.3e-05,-5e-06,-2.3e-05,3e-06,0,-3e-06,-3.8e-05,1.4e-05,1e-05,1e-06,-5e-06,-7e-06,-9e-06,1.7e-05,1.9e-05,-2.7e-05,-3.6e-05,-3.3e-05,-1.1e-05,-4.2e-05,4e-06,-1.9e-05,1.6e-05,-8e-06,-3e-06,8e-06,1e-06,-1e-06
0,1e-06,-1e-06,-3e-06,3e-06,-1e-06,-2e-06,0,6e-06,-1e-06,-7e-06,-9e-06,-1e-06,0,-3e-06,4e-06,-4e-06,1e-06,-5e-06,4e-06,-1e-06,-2e-06,1e-06,-2e-06,2e-06,-1e-06,6e-06,5e-06,1e-06,0,1.3e-05,-3.8e-05,-0.000119,-3.8e-05,-7e-06,1e-06,3.6e-05,-4e-06,-5e-06,2e-06,3e-06,-8e-06,0,1.1e-05,-1e-06,0.000358,-0.000125,-0.000282,0.00025,-0.000105,0.000199,-9.6e-05,-0.000218,0.000396,-0.000323,-0.000283,-0.000107,9.4e-05,0.000206,0.000284,0.000159,-0.000169,7.7e-05,-0.000162,0.000107,-0.000267,0.000117,5.9e-05,0.000103,6.3e-05,-0.000183,-0.00011,5.4e-05,-9.8e-05,-0.000147,-0.000125,7e-05,-5.9e-05,2e-05,-8.6e-05,1e-06,2.9e-05,-6e-06,-8e-06,2.8e-05,8e-06,1.5e-05,7e-06,1.1e-05,-1.9e-05,-1.5e-05,3e-06,1.2e-05,-3e-06,-1.1e-05,-1e-05,-1.7e-05,0,-8e-06,5.8e-05,4.1e-05,-3e-05,1.1e-05,0,-3.1e-05,-5.4e-05,-3.5e-05,1.3e-05,-1.8e-05,1.2e-05,-2.9e-05,4.6e-05,1.9e-05,1.2e-05,-7e-06,-1.6e-05,0,-6e-06,-2e-06,-2e-06,-1.1e-05
-1e-06,-1e-06,1e-06,2e-06,1e-06,2e-06,-2e-06,6e-06,-8e-06,-3e-06,9e-06,-3e-06,0,0,4e-06,0,-1e-06,-4e-06,-1e-06,1e-06,1e-06,2e-06,-2e-06,-3e-06,-3e-06,0,5e-06,-3e-06,2e-06,0,-8e-06,4.3e-05,4.7e-05,9e-06,9e-06,7e-06,-2.6e-05,-1e-06,-1e-06,-2e-06,4e-06,3e-06,7e-06,-3.2e-05,-1.6e-05,-0.000395,-6.4e-05,0.000156,-0.000213,0.000156,-0.000303,0.000204,-0.000152,-3.2e-05,0.000192,-0.000168,0.000328,-4.6e-05,-0.000296,-1e-04,-0.000128,9.9e-05,-0.000124,2.3e-05,3e-06,0.000128,4.7e-05,0,-5e-06,3e-06,5.5e-05,2.6e-05,-3.2e-05,-3.2e-05,0.000124,-6.1e-05,-4.1e-05,-8.7e-05,1.3e-05,2.3e-05,-1.3e-05,-5.1e-05,3e-05,-3.5e-05,6e-06,1.1e-05,1.2e-05,-4e-06,-2.5e-05,5e-06,-1e-06,1e-05,-1.7e-05,-1.5e-05,-2.1e-05,-4e-06,4.9e-05,-2e-06,1e-05,-3.5e-05,-4.6e-05,8e-06,-1.3e-05,3e-06,-6.5e-05,3.6e-05,2.5e-05,1.9e-05,1.1e-05,7.5e-05,-1.4e-05,-8.2e-05,0,-1.5e-05,1.8e-05,-8e-06,3e-06,-2e-06,1e-06,-2e-06,-6e-06
0,4e-06,-1e-06,-2e-06,1e-06,-1e-06,-3e-06,3e-06,-9e-06,-1e-06,-8e-06,-1.6e-05,0,-1e-06,-3e-06,2e-06,-2e-06,5e-06,-2e-06,-2e-06,0,-1e-06,-1e-06,-1e-06,1e-06,0,0,1e-06,-1e-06,0,3e-06,-5.2e-05,3.1e-05,-3.8e-05,0,-1.7e-05,1.3e-05,1e-06,-7e-06,1.1e-05,0,-1e-06,-1.9e-05,-7e-06,-5e-06,-7.1e-05,9.9e-05,-0.000308,-6.4e-05,-0.00025,0.00015,-0.000142,0.000119,-0.000133,-0.000214,0.000289,3e-06,-7e-05,0.000177,-4e-06,0.000137,-0.000111,0.000158,-4.8e-05,-8e-05,-0.000231,2e-06,-5e-05,-5.9e-05,-0.00017,1.7e-05,-6.3e-05,5.5e-05,0.000136,7.2e-05,0.000203,3.5e-05,4.8e-05,-1.8e-05,7e-06,1.3e-05,2.3e-05,-2.4e-05,1.2e-05,-2.5e-05,-2.4e-05,1.1e-05,8e-06,-7e-06,-3e-06,8e-06,-2e-06,1.6e-05,9e-06,2e-06,-1.2e-05,-2.3e-05,-2e-06,1.7e-05,2.2e-05,-1.2e-05,-1.4e-05,4e-06,0,1.6e-05,1.7e-05,-8e-06,0,-4e-06,-5.6e-05,-3.1e-05,9e-06,-4e-06,-1.1e-05,2e-06,2.1e-05,3e-06,-6e-06,-9e-06,-2e-06,-1e-06
-1e-06,0,-1e-06,3e-06,3e-06,-1e-06,-2e-06,-2e-06,1e-06,3e-06,5e-06,-4e-06,0,-1e-06,1e-06,-3e-06,-2e-06,0,-4e-06,-2e-06,0,2e-06,0,2e-06,0,1e-06,3e-06,2e-06,1e-06,0,7e-06,1.1e-05,-0.000115,1.9e-05,-6e-06,-1.9e-05,2e-06,0,7e-06,-6e-06,-2e-06,0,2e-05,2.3e-05,-9e-06,0.000243,-0.000132,-4e-05,-9.3e-05,0.000182,-2e-05,0.000251,-2e-06,0.000198,5.5e-05,-8.6e-05,-0.000193,5.7e-05,-0.000163,-1.6e-05,-0.000135,-0.00018,-7.7e-05,-5e-05,-2.9e-05,0.000169,4.3e-05,-1.7e-05,2.4e-05,1e-04,1.5e-05,6e-06,-7.9e-05,-8.9e-05,-7.3e-05,-0.000163,-4.1e-05,7.5e-05,-2.2e-05,-1.8e-05,-1e-05,6e-06,2.4e-05,2e-06,-5e-06,0,3e-06,1e-06,-3e-06,-2e-06,-7e-06,-2e-06,-6e-06,9e-06,-4e-06,-1.5e-05,2.4e-05,1e-06,-1.3e-05,-6e-06,2.2e-05,2e-06,2e-06,-2e-06,1e-05,9e-06,-1e-05,-1.4e-05,-7e-06,-3.7e-05,-3.2e-05,2.1e-05,5e-06,1.9e-05,-2e-06,6e-06,-2e-06,-6e-06,2e-06,0,-4e-06
1e-06,-1e-06,0,-2e-06,0,2e-06,0,-5e-06,8e-06,-2e-06,1e-06,1.4e-05,0,0,0,2e-06,0,2e-06,-2e-06,1e-06,0,-1e-06,0,2e-06,0,0,3e-06,-3e-06,0,0,-9e-06,-2.5e-05,7e-05,-2.3e-05,-2e-06,-4e-06,-9e-06,4e-06,1e-06,2e-06,-4e-06,6e-06,-7e-06,-1.8e-05,1.1e-05,-0.000212,-1.4e-05,0.00022,3e-05,-4.9e-05,6.2e-05,-9e-06,3.4e-05,-6.9e-05,9e-05,8.2e-05,0.000118,4.6e-05,0.00017,-5.1e-05,8.2e-05,0.000105,0.000107,1.6e-05,1.6e-05,0.000114,-6.9e-05,-8.7e-05,1.5e-05,-3.1e-05,0,0.000102,0,-1.8e-05,1e-06,0.000161,5e-06,-5.7e-05,-6e-06,4.9e-05,1.5e-05,2.7e-05,1.6e-05,9e-06,7e-06,2.8e-05,-3e-06,0,4e-06,8e-06,2e-06,-2e-06,-1.1e-05,-3e-05,1.1e-05,7e-06,-8e-06,2e-06,1e-06,-2.1e-05,2e-06,2e-06,-3e-06,-2e-06,4.9e-05,-1.2e-05,-8e-06,-9e-06,0,4.4e-05,2.3e-05,-3.6e-05,-1.9e-05,4e-06,-4e-06,-1e-05,-2e-06,-5e-06,5e-06,-4e-06,2e-06
0,0,-1e-06,2e-06,1e-06,-2e-06,1e-06,-2e-06,4e-06,3e-06,-1e-05,1e-06,0,-1e-06,0,-2e-06,-2e-06,3e-06,-1e-06,1e-06,0,0,1e-06,2e-06,1e-06,0,-3e-06,1e-06,0,0,1.3e-05,-1.2e-05,-8.5e-05,1.2e-05,3e-06,1.6e-05,-3e-06,-6e-06,-4e-06,3e-06,0,-4e-06,5e-06,-1e-05,0,-3.2e-05,5.2e-05,-8.1e-05,6.9e-05,-0.000112,-0.00022,7.9e-05,3.6e-05,-2.6e-05,-8.9e-05,-8.4e-05,-0.000102,-1e-05,-0.000151,0.000164,-1.7e-05,-2.4e-05,-0.000129,3e-06,4.4e-05,-0.000128,-1e-06,-3.4e-05,-3.6e-05,-3.5e-05,4e-06,-7.4e-05,-1.6e-05,7.3e-05,-8e-05,4.5e-05,3.9e-05,-4.7e-05,2.4e-05,-5.5e-05,1e-06,2e-05,-1.2e-05,-2e-06,1.4e-05,-1.5e-05,-9e-06,3e-06,7e-06,-3e-06,2e-06,1e-06,2e-06,-2e-06,2e-06,4e-06,-1.3e-05,0,-1.4e-05,1.5e-05,-2.2e-05,-3e-06,-1e-06,-1e-06,-1.1e-05,-2.4e-05,6e-06,0,-2.2e-05,-1.5e-05,-2e-05,-9e-06,-1e-05,-1.8e-05,-5e-06,-2e-06,0,-6e-06,-1e-06,1e-06,5e-06
0,-1e-06,1e-06,-2e-06,1e-06,1e-06,0,2e-06,-5e-06,0,8e-06,4e-06,0,-1e-06,1e-06,1e-06,-2e-06,-2e-06,-4e-06,2e-06,1e-06,0,0,-2e-06,-1e-06,-1e-06,-2e-06,-1e-06,0,0,-1.3e-05,2.1e-05,3e-05,-9e-06,1.3e-05,1.8e-05,-7e-06,4e-06,5e-06,-2e-06,-3e-06,6e-06,0,8e-06,-8e-06,0.000218,0.000147,-1.7e-05,-1.4e-05,0.000255,0.000147,7e-05,-4.5e-05,4e-05,0.000216,3.1e-05,-1.9e-05,-9.8e-05,0.000128,-0.000124,-4e-05,3.9e-05,7.2e-05,0.000119,1.2e-05,6.9e-05,-7.6e-05,-6.1e-05,-1.3e-05,-3e-05,9.9e-05,4e-05,4.9e-05,-1.8e-05,0.000144,-6.5e-05,-2.1e-05,6e-06,5e-06,6.8e-05,0,-4e-06,3.1e-05,1.7e-05,-9e-06,-1.5e-05,-9e-06,-6e-06,-1e-05,-1e-06,-4e-06,4e-06,5e-06,-2.2e-05,-3e-06,-6e-06,1.7e-05,-1e-06,5e-06,-1e-05,1.4e-05,1.2e-05,4e-06,1e-06,-9e-06,-1e-06,0,3e-06,-1.5e-05,1.3e-05,9e-06,2e-06,1.1e-05,5e-06,-3e-06,1e-06,-1e-06,-3e-06,-2e-06,-1e-06,2e-06
0,0,-1e-06,2e-06,-1e-06,0,-1e-06,3e-06,-6e-06,-1e-06,-2e-06,5e-06,0,0,-2e-06,-1e-06,0,1e-06,0,1e-06,0,-1e-06,0,-1e-06,0,0,1e-06,3e-06,0,0,9e-06,-2.9e-05,2e-05,1.2e-05,1e-06,3e-06,3e-06,-4e-06,-4e-06,-6e-06,-3e-06,-1e-05,-1.2e-05,7e-06,-5e-06,-0.000149,-0.000191,8.7e-05,4.9e-05,-0.000194,4e-06,-0.000217,1.2e-05,-6.8e-05,-0.000151,0.000139,0.000156,-7.4e-05,-0.000158,0.000125,3.4e-05,9.5e-05,-5.6e-05,-7.9e-05,-3.6e-05,-0.000135,9.8e-05,1e-06,-1.4e-05,0.000103,-0.00012,-7.3e-05,-4e-06,-4.9e-05,-6.3e-05,8.8e-05,-7e-06,2.4e-05,-2.2e-05,-8.6e-05,9e-06,-2.1e-05,-2.2e-05,-2e-06,-8e-06,1.3e-05,-5e-06,-9e-06,2e-06,8e-06,-1e-06,1e-06,-1e-05,2e-06,-1e-05,1e-06,-3.1e-05,-1e-06,1e-05,-9e-06,0,-3e-06,-1e-06,2e-06,-4e-05,1.8e-05,-1.1e-05,3e-06,7e-06,-6e-06,1.8e-05,-1e-06,-3e-06,4e-06,-1e-06,-1.2e-05,-2e-06,-3e-06,-3e-06,-1e-06,-2e-06
1e-06,1e-06,1e-06,-2e-06,-1e-06,-1e-06,-1e-06,1e-06,1e-06,1e-06,-4e-06,1e-06,0,0,2e-06,1e-06,-1e-06,-3e-06,-2e-06,-1e-06,-1e-06,1e-06,0,-1e-06,1e-06,0,-2e-06,-3e-06,1e-06,0,-7e-06,2.1e-05,-9e-06,-4e-06,1e-06,-6e-06,0,3e-06,0,3e-06,-3e-06,9e-06,2.1e-05,-1e-05,-1e-06,-9.4e-05,0.000133,-5.1e-05,-9e-06,2.6e-05,-4.9e-05,0.00012,3e-05,-7.1e-05,0.000104,-5.6e-05,-0.000101,-1.1e-05,0.000171,-0.000122,-5.8e-05,-0.00014,6.9e-05,-1.2e-05,-1.5e-05,-2e-05,-7e-06,2.8e-05,-5e-06,-6.4e-05,5.9e-05,6.1e-05,2.3e-05,5.8e-05,2e-06,-4.5e-05,-2e-05,5.3e-05,-2e-06,7.3e-05,-1e-06,7e-06,-2.5e-05,1.1e-05,4e-06,7e-06,5e-06,7e-06,-6e-06,-5e-06,2e-06,-4e-06,4e-06,1.1e-05,4e-06,5e-06,1.6e-05,1e-06,-4e-06,8e-06,-8e-06,-1e-06,-2e-06,2e-06,3e-06,1e-05,4e-06,-4e-06,-7e-06,1.5e-05,-3.1e-05,-5e-06,2e-06,-7e-06,3e-06,7e-06,1e-06,-3e-06,4e-06,0,-3e-06
-1e-06,1e-06,0,2e-06,0,1e-06,-1e-06,-1e-06,5e-06,-2e-06,5e-06,-4e-06,0,0,-1e-06,-2e-06,-2e-06,-1e-06,-3e-06,0,1e-06,-1e-06,-1e-06,0,-2e-06,0,-3e-06,0,0,0,0,-2.8e-05,-7e-06,1.2e-05,1e-06,-4e-06,1.5e-05,-1e-06,3e-06,-5e-06,-3e-06,-1e-05,-1e-05,-2e-06,-1e-06,0.000186,-8.5e-05,-8e-06,7.7e-05,8.9e-05,-4.3e-05,1.3e-05,-8e-05,9.4e-05,-6.4e-05,3.9e-05,4.8e-05,5.1e-05,-9.4e-05,-7e-06,6.8e-05,-3.6e-05,-4.9e-05,-3e-06,1e-06,0.000138,-3.6e-05,2.7e-05,2.4e-05,5e-05,1.1e-05,-6e-06,-1.4e-05,-1.6e-05,-2.6e-05,-4.2e-05,5.2e-05,-3.4e-05,6e-06,-5.7e-05,7e-06,-4e-05,1e-05,-8e-06,5e-06,-7e-06,0,1e-06,-1e-05,-2e-06,0,-4e-06,3e-06,-6e-06,1e-06,-1.1e-05,-1.2e-05,0,4e-06,-7e-06,1.3e-05,9e-06,3e-06,-1e-06,8e-06,-3e-06,-2e-06,-7e-06,1e-06,-2.2e-05,1e-05,2e-05,0,1e-05,-5e-06,7e-06,1e-06,-3e-06,0,-2e-06,-3e-06
0,0,0,-1e-06,-1e-06,-1e-06,-2e-06,-2e-06,2e-06,0,-4e-06,1e-06,0,0,0,0,0,-1e-06,0,0,0,1e-06,0,1e-06,1e-06,0,-2e-06,1e-06,0,0,5e-06,-3e-06,8.2e-05,-2e-06,6e-06,4e-06,-7e-06,-1e-06,-1e-06,0,-2e-06,8e-06,6e-06,1.3e-05,5e-06,-3.1e-05,-9e-06,0.000119,1.3e-05,-0.000169,0.00011,-2.2e-05,2e-05,-0.000101,-5.5e-05,-0.000122,1e-05,1.5e-05,3e-05,8e-05,-3.2e-05,1e-06,1.7e-05,-6.6e-05,-1.3e-05,-5.9e-05,-1.3e-05,4.2e-05,-2.2e-05,-2.7e-05,-8.6e-05,1.6e-05,-1e-06,-3.9e-05,0,3e-06,-3.1e-05,-3.5e-05,8e-06,5.5e-05,-5e-06,3.8e-05,-2e-05,0,-2e-06,-1e-05,6e-06,2e-06,-1e-06,1e-06,-2e-06,3e-06,-3e-06,-1.3e-05,8e-06,-5e-06,-1.1e-05,-1e-06,-1e-05,2e-05,-1.1e-05,-8e-06,-2e-06,-1e-06,3e-05,-1.3e-05,5e-06,-2e-06,2e-06,1e-06,-3.3e-05,-1e-06,-1.2e-05,4e-06,1e-06,2e-06,-2e-06,-5e-06,1e-06,-1e-06,-2e-06
-1e-06,0,0,1e-06,-1e-06,1e-06,-1e-06,-1e-06,-3e-06,-1e-06,1e-06,3e-06,0,1e-06,0,0,-2e-06,-1e-06,-3e-06,0,0,-1e-06,0,1e-06,-1e-06,0,-2e-06,-1e-06,0,0,-7e-06,-1e-06,-7e-05,8e-06,1e-06,-1e-05,-1e-05,3e-06,3e-06,2e-06,-2e-06,-5e-06,-1e-05,-1e-06,-7e-06,-9.2e-05,3e-06,-0.00027,6.7e-05,0.000135,-1e-05,-3e-05,5.1e-05,-4.3e-05,0.000105,1.6e-05,-0.000143,-3.6e-05,-3.7e-05,-3.4e-05,5.3e-05,-8.4e-05,-3.5e-05,-3e-05,2.8e-05,9.8e-05,-5.3e-05,1.2e-05,-1e-05,6.3e-05,4.5e-05,-3e-05,-7e-06,5.6e-05,6.8e-05,3.1e-05,-3e-06,3.3e-05,3e-06,-3.8e-05,0,-1e-05,-1e-05,-6e-06,-8e-06,8e-06,6e-06,-2e-06,1e-06,-4e-06,1e-06,5e-06,-2e-06,-1.3e-05,-2e-06,3e-06,1.4e-05,0,0,1e-06,7e-06,3e-06,-1e-06,0,-2e-06,-1e-06,-9e-06,2e-06,-9e-06,1.9e-05,-1.6e-05,-2e-06,1e-06,-1.3e-05,-3e-06,-1e-05,0,-4e-06,-1e-06,0,-2e-06
1e-06,0,0,-1e-06,0,1e-06,-1e-06,1e-06,-4e-06,-1e-06,1e-06,-6e-06,0,0,-1e-06,1e-06,-2e-06,2e-06,-1e-06,0,0,1e-06,0,-1e-06,0,0,-1e-06,1e-06,-1e-06,0,1.1e-05,-1.5e-05,2.4e-05,1e-06,-2e-06,-8e-06,-6e-06,-4e-06,-2e-06,1e-06,-1e-06,4e-06,7e-06,-6e-06,-2e-06,1e-04,4.6e-05,0.000152,-1.7e-05,-3.6e-05,-5.9e-05,-0.000135,3e-06,3.8e-05,-0.000138,8.4e-05,9e-05,-2.4e-05,2.5e-05,1.1e-05,-2.8e-05,0.000126,2.5e-05,-6e-06,3.2e-05,-6.4e-05,5.8e-05,3.5e-05,3.4e-05,-3.9e-05,-4e-06,-7e-06,-8e-06,-1.8e-05,-8.8e-05,-0.00013,2.6e-05,3.9e-05,-1.2e-05,1.9e-05,-1e-06,3e-05,1.7e-05,-4e-06,0,1.3e-05,0,-7e-06,6e-06,3e-06,0,-3e-06,3e-06,-3e-06,-3e-06,-5e-06,-1e-05,0,3e-06,-1.5e-05,5e-06,1e-06,1e-06,1e-06,-6e-06,1.5e-05,1e-06,4e-06,-4e-06,-1.1e-05,-2e-06,9e-06,4e-06,2e-06,2e-06,5e-06,2e-06,-3e-06,-3e-06,-1e-06,-1e-06
-1e-06,-1e-06,0,1e-06,-1e-06,-1e-06,0,1e-06,1e-06,2e-06,-2e-06,-4e-06,0,0,1e-06,0,0,-1e-06,-1e-06,0,0,0,0,-1e-06,1e-06,0,-1e-06,-1e-06,1e-06,0,-9e-06,1.6e-05,4e-05,4e-06,-1e-06,-5e-06,7e-06,2e-06,-1e-06,0,-2e-06,0,-1e-06,8e-06,0,-4e-06,-6.3e-05,-6.7e-05,3e-05,-4.9e-05,5.3e-05,0.000151,-3.4e-05,-0.000107,0.000155,-0.000114,3.2e-05,1.4e-05,-3.7e-05,-1.2e-05,1.4e-05,1e-05,-5e-06,-2e-06,-4e-05,-8.6e-05,-3e-05,6e-06,-1.8e-05,-2e-06,1e-05,1.4e-05,1.3e-05,-3.1e-05,4.5e-05,0.000114,-4.2e-05,-2e-06,4e-06,-6e-06,-1e-06,-1.3e-05,-8e-06,-4e-06,5e-06,-1.7e-05,-3e-06,3e-06,-4e-06,-2e-06,-3e-06,-5e-06,-1e-06,0,-5e-06,-8e-06,1.3e-05,0,0,0,-8e-06,-3e-06,2e-06,1e-06,-2.6e-05,-7e-06,0,2e-06,-6e-06,1.7e-05,-7e-06,7e-06,-1e-06,9e-06,1e-06,-1e-06,0,-3e-06,2e-06,1e-06,1e-06
0,0,0,-1e-06,0,1e-06,0,0,4e-06,0,1e-06,0,0,0,-1e-06,0,-1e-06,2e-06,-2e-06,0,0,0,0,-1e-06,-2e-06,0,-1e-06,2e-06,0,0,7e-06,-1.9e-05,-2.5e-05,-1e-06,0,1.3e-05,-4e-06,-2e-06,2e-06,3e-06,-1e-06,-2e-06,1e-06,2e-06,-3e-06,-7.6e-05,2.5e-05,9.2e-05,-6.4e-05,0.000104,3.4e-05,-6.5e-05,0,-2e-06,-9.9e-05,3.7e-05,-1.7e-05,5.2e-05,4.9e-05,-2.2e-05,-1e-05,-5.4e-05,-7e-06,2.5e-05,-1.7e-05,7.9e-05,4.6e-05,2e-05,1e-05,1.8e-05,1.2e-05,2e-06,-6e-06,3.5e-05,-3e-05,-1.4e-05,4.8e-05,-4e-05,2e-06,-1.5e-05,2e-06,8e-06,9e-06,-3e-06,-1e-06,-6e-06,-3e-06,6e-06,-2e-06,0,0,2e-06,-2e-06,7e-06,-1e-06,6e-06,-1.3e-05,0,6e-06,0,-7e-06,6e-06,-3e-06,0,1e-06,-9e-06,-1e-06,0,-2e-06,-3.1e-05,3e-06,-1e-05,3e-06,-8e-06,1e-06,-8e-06,-2e-06,-3e-06,1e-06,-1e-06,1e-06
-1e-06,1e-06,0,1e-06,1e-06,-1e-06,0,-1e-06,2e-06,1e-06,-2e-06,-3e-06,0,0,1e-06,1e-06,-1e-06,0,0,0,-1e-06,0,1e-06,0,1e-06,0,1e-06,-1e-06,-1e-06,0,-4e-06,4e-06,-1.7e-05,4e-06,2e-06,1.3e-05,-2e-06,1e-06,-2e-06,-1e-06,0,3e-06,-3e-06,-3e-06,4e-06,5.2e-05,4.7e-05,3e-06,2.8e-05,-1e-04,-3.4e-05,7e-06,-2e-06,1.2e-05,7.3e-05,-8.3e-05,5.8e-05,2.4e-05,-3.4e-05,1.5e-05,9e-06,3.5e-05,5e-06,1e-06,-5e-06,-5.1e-05,-1.7e-05,2e-06,0,-1.1e-05,9e-06,1.9e-05,1.3e-05,6e-06,5.3e-05,-7.2e-05,-3.4e-05,-4.2e-05,3e-06,2.9e-05,-3e-06,-1.9e-05,1.1e-05,-1e-06,-4e-06,1.8e-05,-3e-06,-1e-06,-4e-06,3e-06,0,5e-06,-1e-06,-1.1e-05,0,-2e-06,7e-06,0,-6e-06,7e-06,7e-06,-5e-06,2e-06,0,3e-06,3e-06,-3e-06,-2e-06,-2e-06,1.6e-05,7e-06,6e-06,-2e-06,-3e-06,-3e-06,9e-06,0,-3e-06,2e-06,-1e-06,-2e-06
1e-06,0,0,-1e-06,0,0,0,-1e-06,-3e-06,0,2e-06,-3e-06,0,0,0,0,0,0,-2e-06,1e-06,0,0,0,1e-06,0,0,1e-06,0,1e-06,0,-2e-06,-1.1e-05,1.2e-05,-4e-06,-1e-06,1e-06,1.6e-05,1e-06,2e-06,3e-06,-1e-06,-5e-06,-3e-06,-3e-06,-6e-06,2.9e-05,-9e-05,-2.1e-05,-3.1e-05,5.5e-05,-5.1e-05,-1.3e-05,-1.1e-05,-8.9e-05,6e-06,5.2e-05,-1e-04,-2.8e-05,1.4e-05,-1.1e-05,1e-05,-0.000119,-1.5e-05,3.9e-05,2.4e-05,9.3e-05,-3.3e-05,2e-06,-1.7e-05,-1.5e-05,-2.8e-05,-3.6e-05,-1.6e-05,-3.8e-05,-1.4e-05,0.000114,1.5e-05,4.4e-05,0,-3.5e-05,1e-06,4e-06,-1.1e-05,4e-06,-1e-06,-4e-06,-4e-06,1e-06,-6e-06,-3e-06,0,-1e-06,3e-06,-1.1e-05,6e-06,-7e-06,7e-06,0,-1e-06,-5e-06,2e-06,3e-06,0,-1e-06,2.4e-05,4e-06,-2e-06,0,3e-06,4e-06,-4e-06,-6e-06,-5e-06,7e-06,0,0,2e-06,-3e-06,-2e-06,0,-1e-06
-1e-06,0,0,1e-06,1e-06,1e-06,-1e-06,0,-3e-06,0,1e-06,5e-06,0,0,0,0,-1e-06,0,-1e-06,0,0,1e-06,0,0,0,0,1e-06,1e-06,0,0,5e-06,-1.1e-05,2.3e-05,2e-06,-2e-06,-7e-06,-4e-06,-2e-06,0,-2e-06,-1e-06,5e-06,7e-06,1e-06,-1e-06,-5.4e-05,9.2e-05,-3.9e-05,4.3e-05,8e-06,8.2e-05,-3.1e-05,-9e-06,-7e-06,-7e-05,7.4e-05,-2.1e-05,-3.4e-05,-9e-06,3.8e-05,-2.7e-05,-1.7e-05,2.5e-05,-4.5e-05,4.4e-05,3.8e-05,2.3e-05,-2e-05,2.2e-05,2e-06,-4e-06,2.4e-05,6e-06,2.4e-05,-4.4e-05,-6.6e-05,7e-06,4.1e-05,-4e-06,4.8e-05,-2e-06,-1.9e-05,2e-06,-1e-06,4e-06,-1.1e-05,1e-06,-4e-06,-2e-06,0,0,-5e-06,-2e-06,-6e-06,0,2e-06,-6e-06,0,0,-8e-06,-6e-06,0,0,-1e-06,2e-06,8e-06,4e-06,-1e-06,-2e-06,-5e-06,-9e-06,6e-06,0,-7e-06,-1e-06,-4e-06,-2e-06,-3e-06,-3e-06,-1e-06,0
1e-06,0,0,-1e-06,1e-06,-1e-06,-1e-06,0,1e-06,0,-3e-06,4e-06,0,0,1e-06,-1e-06,-1e-06,-2e-06,-1e-06,-1e-06,0,-1e-06,0,-1e-06,1e-06,0,1e-06,-1e-06,0,0,-8e-06,9e-06,-6.9e-05,-4e-06,1e-06,-6e-06,-8e-06,3e-06,-2e-06,-1e-06,0,-5e-06,-9e-06,2e-06,0,-7e-06,-3.8e-05,0.000151,-7.2e-05,-7.5e-05,-2e-05,7.9e-05,2e-06,-2e-06,0.000113,-4.6e-05,6.9e-05,7e-06,1.9e-05,-2.6e-05,2e-05,8.2e-05,-1.5e-05,-1.9e-05,-1.9e-05,-8.9e-05,-1.8e-05,-2.8e-05,-2e-06,7e-06,4.2e-05,-2.6e-05,-1e-05,1e-05,3.6e-05,1.8e-05,-3.9e-05,-1e-05,0,-5.7e-05,2e-06,3e-05,1e-06,3e-06,0,3e-06,4e-06,-1e-06,-4e-06,2e-06,0,0,-2e-06,-6e-06,-2e-06,0,9e-06,0,-2e-06,-2e-06,5e-06,-5e-06,-2e-06,0,-4e-06,-1e-06,-3e-06,1e-06,-7e-06,-3e-06,0,-1.9e-05,2e-06,-3e-06,-1e-06,-2e-06,0,-3e-06,1e-06,0,-1e-06
