-0.046022,-0.115097,-0.16607,-0.173757,-0.173784,-0.160311,-0.147521,-0.135916,-0.088398,-0.05687,-0.01532,-0.004305,-0.002852,-0.001726,-0.00151,-0.000859,-0.00048,-0.000344,-0.000248,-0.000211,-0.000168,-0.000112,-0.000148,-0.000224,-0.000511,-0.001132,-0.002207,-0.00289
0.037436,0.115324,0.171914,0.148947,0.149118,0.179062,0.182112,0.162886,0.098083,0.056823,0.014768,0.002928,0.002636,0.001743,0.001745,0.000848,0.000436,0.000317,0.000209,0.000175,0.00012,3.6e-05,1.8e-05,7.3e-05,0.000661,0.000901,0.001533,-0.000743
-0.000628,0.014477,0.016247,-0.000751,-0.011957,-0.007103,-0.008172,-0.013537,-0.015093,-0.005594,-0.002688,-0.000817,-0.000726,-0.000315,-0.000266,-3.2e-05,-1e-06,-2.1e-05,-2.3e-05,-3.3e-05,-4e-06,-3.3e-05,9e-06,1e-06,-0.000315,-0.000493,-0.000556,-0.003164
-0.047622,-0.137748,-0.184299,-0.155215,-0.162028,-0.176387,-0.171228,-0.150259,-0.087782,-0.053399,-0.014197,-0.003485,-0.003009,-0.001718,-0.001673,-0.000907,-0.000461,-0.000355,-0.000239,-0.000191,-0.000142,-8.5e-05,-7.3e-05,-5.7e-05,-0.000385,-0.000447,-0.002022,-0.00352
0.029969,0.069495,0.12009,0.136465,0.144364,0.14802,0.144709,0.135858,0.092536,0.055194,0.016131,0.003928,0.002799,0.001814,0.001684,0.000759,0.000363,0.000248,0.000156,0.000167,1e-04,7.9e-05,2.3e-05,7.6e-05,6e-04,0.00095,0.001668,0.002988
0.023747,0.077417,0.101515,0.07712,0.077253,0.067436,0.057095,0.046257,0.021482,0.019041,0.004957,0.001226,0.000933,0.000469,0.000437,0.000397,0.000236,0.000186,0.000134,9.6e-05,8.2e-05,7.5e-05,4.5e-05,-5.6e-05,-2.6e-05,-0.00012,0.000944,0.000846
-0.045529,-0.123589,-0.185213,-0.18343,-0.179976,-0.192095,-0.183082,-0.162931,-0.100147,-0.065118,-0.017152,-0.004533,-0.003182,-0.001972,-0.001837,-0.000868,-0.000405,-0.000239,-0.000134,-0.000144,-0.000102,-5.1e-05,-4e-05,-0.000163,-0.000472,-0.000783,-0.002347,-0.002067
0.001126,0.00111,0.011472,0.006986,0.0295,0.066903,0.077575,0.069666,0.049583,0.024057,0.005965,0.000668,0.001086,0.000858,0.00095,0.000228,5.4e-05,8.7e-05,2.5e-05,4.6e-05,9e-06,-2e-06,-3.6e-05,-5.3e-05,0.000288,0.000268,0.000203,0.001653
0.028986,0.102046,0.143831,0.118638,0.117748,0.121057,0.107898,0.087593,0.041804,0.032237,0.007103,0.002303,0.001654,0.000912,0.000809,0.000506,0.000232,0.000121,6.2e-05,3.2e-05,3.7e-05,1.4e-05,-2.2e-05,-4.9e-05,-2.8e-05,0.000299,0.000998,0.000624
-0.025529,-0.075859,-0.111192,-0.074742,-0.097807,-0.149216,-0.152888,-0.127461,-0.07179,-0.044457,-0.010983,-0.001575,-0.001854,-0.001226,-0.001464,-0.000575,-0.000213,-0.000205,-8.9e-05,-0.000107,-5.7e-05,-4.1e-05,-2.8e-05,-1e-05,-0.000224,4.2e-05,0.000301,-0.001242
-0.009562,-0.041169,-0.04755,-0.022786,-0.00716,0.007995,0.016122,0.017797,0.024221,0.011585,0.004279,0.000297,0.000324,0.000462,0.000579,4.3e-05,-1.3e-05,-2e-06,-2.5e-05,4.4e-05,2.3e-05,1e-06,-1.7e-05,6.1e-05,0.000284,1.9e-05,-0.000678,-0.002228
0.030581,0.103104,0.140499,0.090784,0.109935,0.136324,0.128576,0.097696,0.043071,0.0343,0.008306,0.001367,0.001294,0.000675,0.000899,0.000489,0.000197,0.000112,4.2e-05,5.5e-05,3.3e-05,2e-05,-7e-06,-1.4e-05,-1.5e-05,-0.000274,5.2e-05,-0.002679
-0.013,-0.030494,-0.056982,-0.062984,-0.0748,-0.112112,-0.114528,-0.093915,-0.058305,-0.038355,-0.009941,-0.002118,-0.001727,-0.001342,-0.001444,-0.000454,-0.000162,-1e-04,5e-06,-5.3e-05,-5.2e-05,-1.9e-05,9e-06,-6.1e-05,-0.000155,-0.000166,-0.000244,-0.001617
-0.023288,-0.080728,-0.100993,-0.07296,-0.066956,-0.04785,-0.035868,-0.023291,0.003957,-0.008191,-0.00238,-0.000879,-0.000456,1.1e-05,1e-04,-0.000167,-8.8e-05,3.6e-05,1.7e-05,4e-05,2.8e-05,1.8e-05,4.2e-05,2.8e-05,6.9e-05,0.000196,-0.000569,0.000786
0.028538,0.081326,0.120185,0.096682,0.086547,0.132917,0.132869,0.099063,0.047967,0.042327,0.009749,0.002376,0.001884,0.001153,0.001193,0.00051,0.000212,0.000141,3e-05,2.8e-05,5.4e-05,4e-05,4.8e-05,0.000108,3.3e-05,0.000132,0.000363,0.001365
0.008971,0.020471,0.022569,0.034416,-0.007307,-0.057592,-0.063222,-0.048069,-0.037335,-0.020255,-0.004271,0.000478,-0.000154,-0.000552,-0.000885,-0.000156,-4.7e-05,-0.000116,-1.5e-05,-8.3e-05,-6.4e-05,-2.4e-05,-3e-06,4.3e-05,-3e-05,-2.4e-05,0.000491,0.000796
-0.025739,-0.090877,-0.114761,-0.069563,-0.061169,-0.080602,-0.07555,-0.052789,-0.01323,-0.020759,-0.00395,-0.00108,-0.000797,-0.000237,-0.000142,-0.000229,-0.000119,-6.5e-05,-3.6e-05,1.5e-05,-1.5e-05,-2.5e-05,-4.7e-05,-4.4e-05,4e-05,4.3e-05,0.000339,-0.000121
0.01012,0.044398,0.060453,0.025002,0.064123,0.112631,0.111242,0.07455,0.035906,0.031161,0.007208,0.000394,0.00064,0.00068,0.001028,0.000352,0.000145,0.000109,-2e-06,4.3e-05,5.4e-05,1.3e-05,-2.5e-05,-1e-05,3.1e-05,-0.000239,-0.00046,-0.000161
0.013177,0.060035,0.059927,0.028038,0.030622,-0.00417,-0.013688,-0.007321,-0.016851,-0.006625,-0.002267,-0.000298,-0.000323,-0.000551,-0.000823,-0.00016,-5.3e-05,-8.3e-05,-9e-06,-5.9e-05,-5.3e-05,-2.9e-05,6e-06,7e-06,-8.5e-05,7.4e-05,0.000129,0.000583
