-0.000629,-0.005793,-0.018258,-0.061658,-0.127108,-0.236103,-0.198953,-0.163135,-0.15718,-0.17119,-0.128441,-0.065303,-0.046024,-0.017015,-0.006179,-0.003392,-0.002092,-0.000587,-0.005586,-0.015485,-0.015636,-0.008857,-0.003937,-0.005284,-0.016792,-0.055285,-0.061076,-0.006365
-0.000217,-0.000941,-0.00934,-0.04707,-0.114662,-0.090487,0.06424,0.141864,0.145652,0.112968,0.075371,0.053581,0.046367,0.015972,0.006853,0.004027,0.002492,0.000554,0.005165,0.010844,0.00812,-0.004052,-0.003033,-0.002778,-0.015093,-0.01171,-0.012598,-0.00198
-1e-05,0.002191,0.002559,0.008859,0.002066,0.016803,0.000278,0.001611,0.011124,0.031756,0.018392,0.003915,0.002976,0.001457,0.000442,0.000293,0.000152,6.2e-05,-0.002429,-0.004283,-0.002206,0.00036,0.00032,-0.001566,-0.002442,0.000724,0.003488,-3.7e-05
0.000226,-0.000302,0.005233,0.039337,0.096844,0.044134,-0.131403,-0.1627,-0.14959,-0.135463,-0.087956,-0.059018,-0.05139,-0.017822,-0.006911,-0.004014,-0.002479,-0.000483,-0.00079,-0.001352,-0.000228,0.005055,0.003097,0.002264,0.012799,0.020672,0.020549,0.001668
0.000372,-0.000854,0.004205,0.023266,0.08295,0.139898,0.135357,0.125424,0.114877,0.090895,0.078915,0.047125,0.035898,0.012563,0.004925,0.002745,0.001852,0.000622,0.005607,0.011229,0.01252,0.008281,0.003311,0.005207,0.013119,0.037346,0.033121,0.002156
-0.000195,0.000578,-0.000313,-0.017966,-0.037306,0.024176,0.135915,0.098129,0.070643,0.091858,0.0553,0.030662,0.029541,0.010837,0.003309,0.001939,0.00116,2e-04,-0.005441,-0.012186,-0.011173,-0.005058,-0.001519,-0.001834,-0.00781,-0.027489,-0.03473,-0.005481
-0.000463,0.000386,-0.003127,-0.028971,-0.11174,-0.191825,-0.164622,-0.155478,-0.156638,-0.150429,-0.126232,-0.065735,-0.051821,-0.01894,-0.007096,-0.003973,-0.002576,-0.000706,-0.002169,-0.002985,-0.00414,-0.004999,-0.003185,-0.004203,-0.013802,-0.044998,-0.046047,-0.005584
2.1e-05,-0.000843,-0.001761,-0.000699,-0.032562,-0.052225,-0.048239,0.018482,0.036571,-0.014277,-0.001505,0.008436,0.005656,0.001088,0.001494,0.000739,0.000651,0.000135,0.006283,0.011645,0.007506,0.002486,0.000399,7.9e-05,-0.001766,0.014963,0.024024,0.004092
0.00025,-0.000454,0.000336,0.021598,0.068867,0.144194,0.123638,0.10119,0.109843,0.135446,0.109368,0.050598,0.041217,0.015604,0.005473,0.002994,0.001898,0.000424,-0.002459,-0.004544,0.000435,0.001651,0.001946,0.001194,0.006794,0.019393,0.022506,0.003896
0.00018,0.001333,0.001922,0.008402,0.058254,0.026727,-0.079317,-0.112042,-0.099424,-0.046627,-0.04305,-0.034817,-0.03238,-0.010039,-0.00464,-0.00262,-0.001857,-0.000323,-0.001646,-0.001045,0.000625,0.002131,0.001107,0.001167,0.006272,-0.003984,-0.006981,0.000597
0.000113,6.4e-05,-0.001,-0.017281,-0.016615,-0.067302,-0.072574,-0.019292,-0.01713,-0.065566,-0.051033,-0.018936,-0.013729,-0.006363,-0.001858,-0.00091,-0.000418,-7e-05,0.002607,0.003327,-0.001457,-0.001923,-0.000671,0.000497,-0.001959,-0.007729,-0.011165,-0.000373
-0.000184,-0.001101,-0.001675,-0.010473,-0.050502,-0.009407,0.127585,0.114464,0.085133,0.067554,0.054292,0.036943,0.040998,0.014034,0.005342,0.003002,0.001972,0.000393,-0.002949,-0.007244,-0.003627,-0.001796,-0.00127,-0.000811,-0.004291,-0.017208,-0.016714,-0.001657
-3e-04,-5e-06,0.0013,0.009119,-0.019245,-0.008241,0.014829,-0.049509,-0.061878,-0.01025,-0.016458,-0.013877,-0.015225,-0.003926,-0.001999,-0.001185,-0.001074,-0.000288,0.000696,0.003084,0.00134,0.000247,-0.000179,-0.000602,0.000612,-0.000761,0.006672,0.000931
0.000133,0.001111,0.002672,0.01021,0.025015,0.00727,-0.076919,-0.045633,-0.026197,-0.055343,-0.042132,-0.02482,-0.030632,-0.011943,-0.003624,-0.001973,-0.001092,-0.000277,0.003113,0.00594,0.003285,0.003374,0.001695,0.001491,0.005811,0.0392,0.046551,0.00504
0.000245,0.000221,-0.000444,-3.9e-05,0.037505,0.068935,0.057573,0.077469,0.078724,0.049952,0.059016,0.032771,0.033477,0.011471,0.004537,0.002447,0.001782,0.000368,-0.003339,-0.007063,-0.002088,-0.001113,0.000352,-3e-05,-0.000432,0.001022,-0.004329,-0.001221
-6.8e-05,-0.000692,-0.001532,-0.000754,0.003036,-0.008911,0.001761,-0.034422,-0.033714,0.024331,0.0155,0.004729,0.006735,0.004478,0.000529,0.000212,-0.000221,7.8e-05,-2e-05,0.000615,-0.001591,-0.001701,-0.001083,-0.001403,-0.005274,-0.029231,-0.038398,-0.005437
-0.000123,-0.000712,-0.000502,-0.000349,-0.030136,-0.095904,-0.116326,-0.065506,-0.04244,-0.051312,-0.060734,-0.029338,-0.034112,-0.013196,-0.004619,-0.002393,-0.001492,-0.000376,0.001783,0.003595,0.000541,-0.002148,-0.00099,-0.00034,-0.002958,-0.005417,-0.007767,-0.002018
-4.2e-05,0.000731,0.000999,-0.002791,-0.00883,0.013476,0.035138,0.071775,0.057546,0.005415,0.014712,0.01535,0.017158,0.004066,0.002557,0.001367,0.001186,0.000129,-0.001434,-0.003665,-0.001891,-7.3e-05,0.000404,0.00072,0.002149,0.002083,0.000667,-0.000553
-4.5e-05,0.000637,-0.000205,-0.006674,0.017465,0.081653,0.103951,0.020704,-0.012557,0.03159,0.038796,0.015192,0.019394,0.009078,0.00249,0.001192,0.000461,0.000121,0.001041,0.001882,-0.000639,0.001902,0.001149,0.000261,0.003899,0.011821,0.015033,0.002056
