0.000395,0.000352,0.000107,0.000459,9e-06,0.000276,0.000183,0.000139,5e-05,0.000145,0.000164,0.000376,0.000382,0.000255,0.000428,0.000262,9.6e-05,0.00029,0.000541,3.2e-05,0.000125,0.000159,0.000299,0.000232,0.000936,0.000271,0.000143,0.000394,0.000544,0.000224,0.000361,0.000372,0.000761,0.000577,0.000163,0.000487,0.000203,0.000426,0.000459,0.00042,8.3e-05,9.9e-05,0.000242,0.000189,8.1e-05,0.000255,1.5e-05,0.000107,0.00047,3.5e-05,1.7e-05,0.000188,0.00037,0.000361,6e-05,0.000216,0.000211,0.000103,0.000334,0.000419,0.000122,0.00012,0.000171,0.000373,0.00019,4.5e-05,4.9e-05,0.00024,0.00013,2e-05,3.8e-05,0.000193,0.000221,0.000195,4.9e-05,7.8e-05,0.000484,0.000414,4e-05,0.000261,0.000395,0.000368,0.000136,0.000289,2.7e-05,0.000103,0.00024,0.000197,8.6e-05,8.1e-05,0.000207,0.000188,0.00032,0.000113,0.000158,0.00011,0.000117,0.000127,0.000221,0.000227,5.2e-05,0.000222,0.000252,0.00049,0.00037,0.000305,0.000246,0.000238,2e-04,7e-05,0.000325,0.000139,0.000159,3.1e-05,0.001012,0.000685,0.000131,2e-04,0.00013,0.000166,0.000174
0.000267,0.001229,0.000569,0.001433,0.000822,0.000547,0.000476,0.000543,0.00071,0.000463,0.000748,0.001327,0.001413,0.00108,0.001417,0.001695,0.001397,0.00093,0.001357,0.000589,0.00044,0.000606,0.001628,0.001469,0.002435,0.00248,0.002519,0.00119,0.000415,0.000607,3.3e-05,0.000992,0.000557,0.001585,0.001491,0.000647,0.002071,0.001058,0.000182,0.000962,0.000794,0.000755,0.000572,0.000661,0.000501,0.000916,0.00151,0.001004,0.00073,0.00075,0.000724,0.000503,0.001089,0.001565,0.001071,0.000914,0.001434,0.001138,0.000382,0.001074,0.00088,0.000858,0.000624,0.000274,0.000715,9.4e-05,0.00037,0.000468,0.000474,0.000389,0.00052,0.000979,0.000689,0.00062,0.000542,0.000655,0.001251,0.001212,0.000454,0.000708,0.000705,0.001095,0.001042,0.001227,0.000618,0.000994,0.00044,0.000839,5e-04,0.000366,0.000647,0.00035,0.000832,0.000917,0.000124,0.000201,0.000422,0.000409,0.000173,0.000287,0.000188,0.001056,0.000615,0.000718,0.001596,0.001877,0.000672,0.000796,0.000151,0.000151,0.000921,0.000613,0.000434,0.000179,0.00191,0.002328,0.000942,0.000938,0.000371,0.000825,0.000218
0.001561,0.001052,0.000987,0.001327,0.000681,0.000475,0.000975,0.000909,0.00118,0.00051,0.000427,0.00084,0.001843,0.002532,0.000958,0.001088,0.002397,0.001437,0.00082,0.00097,0.000895,0.001015,0.003246,0.001768,0.000946,0.002172,0.001702,0.00035,0.000431,0.000322,0.000504,0.000736,0.001264,0.000912,0.00063,0.002187,0.002451,0.001415,0.000209,0.000464,0.000561,0.000333,0.000706,0.000178,0.000917,0.001253,0.000789,0.001012,0.001303,0.000516,0.001474,0.000945,0.000538,0.00085,0.000159,0.002509,0.002,0.000654,0.000583,0.00139,0.001708,0.001845,0.001478,0.00064,0.000688,0.000668,0.000926,0.000427,0.000734,0.001554,0.000344,0.001125,0.000744,0.000786,0.000213,0.001013,0.001072,0.000717,0.00048,0.00071,0.000265,0.000348,0.000713,0.000206,0.000313,0.000758,0.000772,0.001055,0.000401,0.000849,0.000246,0.000254,0.000632,0.00064,0.001215,0.000506,0.000512,0.000542,0.000388,0.000355,0.000824,0.001436,0.002032,0.000556,0.001502,0.000233,0.000226,0.000702,0.000363,0.000515,0.001062,0.000325,0.000514,0.000346,0.001188,0.00135,0.001655,0.000513,0.001065,0.000869,0.000636
0.001257,0.001577,0.001186,0.00174,0.001096,0.000871,0.001414,0.000913,0.001153,0.001863,0.00139,0.001315,0.00139,0.001035,0.000927,0.000461,0.001081,7.1e-05,0.000739,0.001277,0.000949,0.001957,0.001606,0.000626,0.000282,0.001572,0.002771,0.001888,4e-04,0.000426,0.000503,0.000334,0.000698,0.001192,0.001466,0.001305,0.000447,0.000374,0.000792,0.001263,0.000274,0.000451,0.001801,0.001275,0.001332,0.000753,0.001472,0.000602,0.001593,0.001512,0.00113,0.000283,0.000409,0.000573,0.00052,0.002698,0.000949,0.000252,0.001143,0.000607,0.000529,0.000916,0.000656,0.001112,0.000383,0.001168,0.00131,0.000645,0.001357,0.000997,0.001457,0.000306,0.000822,0.000382,0.001118,0.001334,0.001263,0.000309,0.000667,4e-04,0.001064,0.000435,0.000329,0.00051,0.000491,0.000401,0.000849,0.000273,0.000814,0.000973,0.000811,0.000206,0.000435,0.000296,0.000873,0.000668,0.00041,0.000739,0.000406,0.00048,0.001717,0.001427,0.000541,0.000728,0.001131,0.00186,0.001073,0.000579,0.000472,0.001388,0.000401,0.000417,0.000554,0.001082,0.001244,0.001177,0.000418,0.001457,0.001756,0.001451,0.000765
0.002672,0.002964,0.001749,0.002004,0.001297,0.001225,0.001406,0.00208,0.001108,0.001775,0.001321,0.000953,0.001464,0.000286,0.001173,0.002381,0.001835,0.001281,0.001429,0.001608,0.00276,0.000579,0.002086,0.001113,0.001121,0.001255,0.002027,0.001587,0.001763,0.000773,0.001336,0.001616,0.000685,0.000975,0.000668,0.001337,0.001417,0.001204,0.000781,0.000916,0.001144,0.000638,0.001223,0.000882,0.001225,0.001553,0.000688,0.001146,0.000755,0.001431,0.001006,0.000149,0.000288,0.000816,0.000437,0.001477,0.00161,0.001464,0.001705,0.001296,0.00149,0.00075,0.000823,0.000437,0.001308,0.001847,0.001505,0.000923,0.001441,0.002053,0.001123,0.001609,0.001685,0.001083,0.001903,0.002435,0.001385,0.00151,0.001404,0.001002,0.001495,0.00119,0.001052,0.00094,0.000596,0.000593,0.000742,0.00064,0.00085,0.0012,0.000785,0.000496,0.000389,0.00034,0.000954,0.000551,0.000877,0.000389,0.00046,0.00093,0.001733,0.000752,0.000761,0.001533,0.001277,0.000649,0.00118,0.000863,0.001205,0.001282,0.001229,0.000886,0.000924,0.000656,0.000997,0.000885,0.000313,0.000896,0.000177,0.000379,0.000384
0.001987,0.000204,0.000661,0.000814,0.00106,0.00239,0.000734,0.000788,0.000831,0.000671,0.000349,0.000175,0.000671,0.000109,0.001234,0.000919,0.000235,0.001125,0.000406,0.00047,0.001294,0.001707,0.002033,0.002313,0.001531,0.001094,0.000549,0.001122,0.001111,0.001156,0.001056,0.000668,0.000625,0.000376,0.001327,0.00085,0.000929,0.001076,0.000315,0.000678,0.00113,0.000894,0.000584,0.001358,0.00066,0.000366,0.001378,0.001005,0.000505,0.00045,0.000217,1.2e-05,0.000127,0.000594,9.4e-05,0.000321,0.000235,0.000508,0.000287,0.000626,0.000739,0.000743,0.000392,0.00026,0.000171,0.00084,0.000569,0.000795,0.000373,0.000819,0.000386,0.001391,0.000145,0.000478,0.000879,0.000349,0.000367,0.000318,0.000336,0.00042,0.000404,0.000189,0.001073,0.000662,0.000202,0.000427,0.001043,0.000636,0.000801,0.000703,0.000713,0.000452,0.000529,0.000447,0.000553,0.000175,0.000109,0.000824,0.001306,5.2e-05,0.000687,0.000256,0.000407,0.001043,0.000227,0.001045,0.000694,0.000449,0.000965,0.001806,0.000381,0.000357,0.000674,0.000259,0.000567,0.001436,0.000589,0.000826,0.000842,0.001074,0.000849
0.000711,0.000122,0.001024,0.001687,0.000665,0.002851,0.001059,0.000282,0.000139,0.00083,0.000849,0.00096,0.001025,0.000279,0.000581,0.000819,0.000414,0.001016,0.000491,0.000128,0.000149,0.000704,0.001165,0.001703,0.000972,0.000676,0.001367,0.001157,0.001966,0.000863,0.001292,0.000307,0.000427,0.000442,0.00149,0.001923,0.001673,0.001028,0.000905,0.000745,0.000752,0.001081,0.00176,0.001658,0.000906,0.001405,0.001651,0.000742,0.00096,0.001373,0.001046,0.000285,0.000367,0.00041,0.000815,0.000989,0.00053,0.000256,0.000433,0.00044,0.000539,0.000542,0.000544,0.000445,0.000949,0.000618,0.000656,0.001037,9.4e-05,0.000348,0.000143,0.000881,5.5e-05,0.000505,0.000401,0.000429,0.000757,0.000185,0.000555,0.000443,0.000317,0.000132,0.001537,0.000569,0.000229,0.000239,0.000461,0.000366,0.000803,0.000891,0.000983,0.001075,0.000863,0.000812,0.001139,0.000691,0.00071,0.00073,0.001087,0.001141,0.00125,0.001003,0.000746,0.000814,0.000535,0.001056,0.001637,0.000675,0.000286,0.000554,0.000525,0.00137,8.4e-05,0.001208,0.001323,0.001529,0.000209,0.000395,0.000797,0.001091,0.001074
0.003119,0.001255,0.001461,0.003787,0.003344,0.002962,0.003841,0.002761,0.002126,0.000662,0.00035,0.002643,0.002763,0.001321,6e-04,0.003985,0.00298,0.002604,0.001598,0.000412,0.00111,0.001484,0.002777,0.002304,0.00291,0.000992,0.002438,0.001086,0.003654,0.003542,0.002964,0.002275,0.001424,0.0011,0.002083,0.000989,0.001631,0.003329,0.001344,0.00135,0.000622,0.002366,0.00259,0.00288,0.001258,0.00137,0.0018,0.001508,0.002743,0.004285,0.00153,0.002092,0.000727,0.001028,0.000474,0.000492,0.000806,0.000529,0.000962,0.000479,0.000797,0.000891,0.001379,0.000798,0.002359,0.002185,0.000646,0.000748,0.00134,0.001169,0.000368,0.000866,0.001076,0.000135,0.001333,0.002171,0.001809,0.001044,0.001288,0.001646,0.000564,8.7e-05,0.001434,0.002346,0.001721,0.000636,9.6e-05,0.000523,0.00131,0.000684,0.002124,0.002255,0.001394,0.00085,0.000739,0.001305,0.002316,0.001018,0.000275,0.000659,0.001511,0.001481,0.00222,0.000847,0.001818,0.001171,0.002394,0.002244,0.002601,0.000285,0.000674,0.001083,0.001378,0.002789,0.002964,0.003181,0.003835,0.00178,0.000317,0.002002,0.00309
0.002121,0.000887,0.00197,0.004135,0.002845,0.002229,0.003009,0.00169,0.001163,0.00098,0.000657,0.003023,0.003812,0.003738,0.002752,0.004363,0.004493,0.000772,0.000623,0.001853,0.003086,0.003274,0.003002,0.003557,0.003043,0.002137,0.003793,0.001438,0.003616,0.002857,0.003381,0.003394,0.001558,0.001422,0.001438,0.002436,0.000559,0.003578,0.003836,0.001428,0.000624,0.003127,0.004328,0.006346,0.004414,0.001925,0.003577,0.002567,0.001211,0.003684,0.003568,0.00374,0.001414,0.001868,0.001482,0.001076,0.001576,0.001258,0.000942,0.001594,0.002746,0.00137,0.000872,0.001167,0.001778,0.003308,0.002349,0.001023,0.000965,0.001135,0.000859,0.00158,0.002036,0.001979,0.001657,0.001567,0.003342,0.002567,0.001878,0.000806,0.001162,0.00123,0.001071,0.002291,0.001233,0.000694,0.000408,0.000828,0.00082,0.001494,0.002212,0.000713,0.001629,0.001038,0.001316,0.000319,0.002529,0.004219,0.001659,0.00202,0.000698,0.001843,0.002685,0.002409,0.002227,0.002108,0.001173,0.000745,0.002098,0.002565,0.00304,0.002351,0.000777,0.002005,0.004237,0.00194,0.002948,0.002249,0.001085,0.002285,0.001943
0.001711,0.001174,0.000942,0.001633,0.001486,0.002017,0.001259,0.000962,0.001423,0.002774,0.001371,0.002779,0.000481,0.002099,0.001107,0.004869,0.003899,0.003353,0.002548,0.002322,0.002627,0.00248,0.004118,0.004362,0.002576,0.000376,0.001165,0.001354,0.001546,0.001149,0.002004,0.001142,0.001188,0.001561,0.001339,0.002235,0.002377,0.003442,0.002222,0.001317,0.001288,0.000866,0.001342,0.002531,0.001909,0.001806,0.001811,0.001486,0.000865,0.001565,0.002445,0.000599,0.001684,0.003012,0.001579,0.002386,0.001609,0.000389,0.001648,0.001088,0.001929,0.001564,0.001482,0.001164,0.001732,0.001963,0.001016,0.000615,0.000486,0.001142,0.000935,0.001393,0.000498,0.001262,0.001659,0.000225,0.002245,0.002229,0.002337,0.001711,0.000375,0.000613,0.001911,0.000489,0.000358,0.001155,0.001238,0.001516,0.001214,0.001479,0.000654,0.000984,0.00163,0.000833,0.000939,0.001184,0.00115,0.002113,0.002668,0.002154,0.001707,0.001083,0.001331,0.00109,0.001264,0.001187,0.002496,0.002021,0.002561,0.001457,0.001286,0.001372,0.000773,0.001501,0.001912,0.000554,0.002976,0.002835,0.00061,0.001702,0.002141
0.001846,9e-04,0.000727,0.001507,0.00203,0.002092,0.002654,0.001702,0.002095,0.002316,0.001513,0.001433,0.001324,0.002501,0.003219,0.001708,0.00276,0.002356,0.000254,0.001027,0.001325,0.003186,0.000396,0.002265,0.00196,0.001751,0.001178,0.001271,0.001205,0.00146,0.002367,0.001399,0.001187,0.000835,0.001519,0.001064,0.000924,0.000307,0.000844,0.00196,0.000974,0.000485,0.002156,0.001362,0.001126,0.000383,0.001089,0.00179,0.001614,0.001157,0.001077,0.0014,0.001829,0.000685,0.000462,0.001191,0.000552,0.001017,0.001309,0.001162,0.002281,0.001525,0.00206,0.001419,0.000947,0.000209,0.000671,0.000535,0.001345,0.001333,0.00088,0.000477,0.000427,0.001234,0.000973,0.001375,0.001845,0.001266,0.000131,0.001786,0.002393,0.000964,0.001593,0.000616,0.000179,0.001776,0.001572,0.000724,0.000567,0.000852,0.00111,0.001523,0.000558,0.001051,0.000461,0.00085,0.000524,0.001179,0.002266,0.001209,0.001296,0.001642,0.001434,0.000771,0.001484,0.001931,0.00255,0.001399,0.001357,0.001392,0.0015,8.5e-05,0.000501,0.000885,0.001214,0.001832,0.000883,0.000389,0.001072,0.000835,0.001143
0.000902,0.000767,0.000596,0.001735,0.001172,0.001683,0.001955,0.001052,0.001388,0.000714,0.000718,0.000594,0.000656,0.000879,0.001398,0.001175,0.001498,0.000154,0.00078,0.0011,0.00122,0.001207,0.001568,0.001063,2.7e-05,0.000439,0.000633,0.00068,0.000929,0.000838,0.000522,0.00066,0.000328,0.001067,0.000871,0.001032,0.001254,0.001151,0.001167,0.00053,0.000518,0.001608,0.002087,0.001548,0.000909,0.000766,0.001141,0.001113,0.000426,0.000628,0.000553,0.000929,0.000536,0.000562,0.000186,0.000583,0.000528,0.001008,0.000585,0.000115,0.001488,0.001949,0.001006,0.00065,0.000841,0.001,0.000253,0.00039,0.000681,0.001059,0.000868,0.001158,0.001406,0.000105,0.00113,0.000929,0.000628,0.000658,0.001041,0.001521,0.000872,0.00073,0.000912,0.000696,0.000439,0.001599,0.000389,0.000554,0.001341,0.001778,0.000673,0.001316,0.001315,0.000414,0.000409,0.000523,0.000261,0.000974,0.001524,0.000857,0.001659,0.000988,0.00148,0.002009,0.001397,0.00058,0.001651,0.000662,0.001467,0.001783,0.001043,0.000375,0.000369,0.000624,0.001097,0.000512,0.000831,0.000782,0.000992,0.000525,0.000916
0.00036,0.000301,0.00054,0.000984,0.000305,0.000578,8e-04,0.000581,0.000342,0.000498,0.00023,0.000252,0.000323,0.000281,0.000391,0.000663,0.000358,0.000294,8.4e-05,0.000172,0.000749,0.000288,0.001166,0.000508,0.000508,0.000402,0.00042,0.000228,0.000405,0.000258,0.000546,0.000382,0.000222,0.000735,0.000336,0.000494,0.000803,0.00053,0.000237,0.000173,0.000527,0.000897,0.000688,0.000677,0.000405,7e-04,0.00085,0.000347,0.000172,0.000345,0.000603,0.00054,0.000331,0.000385,0.000266,0.000567,0.00058,0.000379,0.000227,0.000587,0.000502,0.000994,0.001251,0.000278,0.000861,0.000482,0.000422,0.000271,0.000281,0.000318,0.000736,0.00059,0.000544,0.000168,0.000805,0.000417,0.000525,0.000126,0.000637,0.000435,0.000734,0.000234,0.000329,0.001272,0.000646,0.000427,0.000452,0.000368,0.000612,0.000802,8.9e-05,0.000376,8.6e-05,0.000365,0.000289,0.000351,0.000444,0.001057,0.000473,0.000304,0.000648,0.000406,0.000923,0.00044,0.000431,0.000684,0.001148,0.000697,0.001114,0.000657,0.000668,0.000287,0.000383,0.000477,0.000748,0.000379,0.000601,0.000339,0.000174,0.000518,0.000521
0.00022,0.000424,0.000559,0.001296,0.000367,0.000263,0.000375,0.000543,0.000178,0.000451,0.000153,0.000347,0.000233,7.8e-05,0.000415,0.000382,0.000411,0.000136,0.000425,0.000558,0.000761,0.000207,0.000704,0.000636,0.000152,0.000107,0.000424,0.000518,0.000162,0.000464,0.000534,0.000423,0.000391,0.001004,0.000399,0.000646,0.000739,0.00027,0.000158,0.000193,0.000349,0.00051,0.000442,0.00043,0.000219,0.000294,0.00056,0.000561,0.000175,0.00031,0.00076,0.000437,9.3e-05,0.000519,0.00019,0.000331,0.000411,0.000455,0.000256,0.000873,0.000864,0.000918,0.000802,0.000711,0.000221,0.000506,0.000625,0.00037,0.001025,0.000599,0.000639,0.00047,0.001323,0.00039,0.000735,0.000882,0.000897,0.000455,0.000372,0.000765,0.000735,0.000532,0.000333,0.001187,0.000707,3.4e-05,3e-04,0.000458,0.000373,0.00024,0.00061,0.001139,0.000693,0.000786,0.000916,0.000137,0.000809,0.000642,0.00108,0.000272,0.000378,0.000574,0.000314,0.000598,0.000742,0.00037,0.000703,0.000341,0.000927,0.000939,0.001352,0.000317,0.000493,0.000199,0.000888,0.000116,0.000866,0.000852,0.000428,0.000575,0.000134
0.000466,0.000661,9.8e-05,0.001633,0.000763,0.000149,0.000487,0.000453,0.000895,0.000343,0.000296,0.000305,0.000561,0.000289,0.000645,0.000366,0.000431,0.000617,0.000193,0.000575,0.000222,0.00089,0.000787,0.000417,0.000793,0.000141,0.000749,0.00072,0.000376,0.000401,0.001501,0.000351,0.000651,0.001224,0.000257,0.000459,0.00108,0.000365,0.000341,0.000631,0.000274,0.000442,0.000822,0.000381,0.000447,0.000504,0.000764,0.001157,0.000599,0.000909,0.001764,0.000283,0.000757,0.000159,0.00058,0.000908,0.000979,0.000623,0.001021,0.001079,0.000814,0.001842,0.000801,0.000597,0.00072,0.001619,0.001091,0.000776,0.000978,0.000935,0.000494,0.000439,0.001519,0.00129,0.001414,0.001185,0.000766,0.000519,0.00143,0.001144,0.000895,0.000523,0.000934,0.001394,0.001369,0.001126,0.000955,0.000417,0.000707,0.00089,0.00092,0.00137,0.002166,0.001016,0.001391,0.001472,0.001827,0.001873,0.001807,0.002257,0.00207,0.00052,0.000922,0.001157,0.000574,0.000511,0.000624,0.000619,0.000708,0.00017,0.001173,0.001644,0.001738,0.001344,0.001729,0.001353,0.001796,0.001893,0.001245,0.000974,0.000837
0.001748,0.001694,0.001746,0.001952,0.000632,0.001153,0.001424,0.00041,0.001143,0.001398,0.000256,0.001231,0.00147,0.001239,0.000297,0.000458,0.002147,0.002964,0.000939,0.000852,0.000457,0.001372,0.000729,0.000627,0.001246,0.001251,0.001631,0.001739,0.002087,0.001816,0.001179,0.001495,0.001022,0.001852,0.001972,7e-04,0.001262,0.001283,0.001327,0.000766,0.000271,0.000529,0.0011,0.001259,0.000801,0.001588,0.001769,0.002336,0.001033,0.001131,0.001577,0.00221,0.002153,0.001408,0.000297,0.001895,0.00213,0.001879,0.001715,0.000808,0.002148,0.002875,0.002534,0.001952,0.001574,0.002344,0.002563,0.001686,0.001427,0.000449,0.000415,0.001259,0.001169,0.000671,0.000683,0.000449,0.000241,0.00034,0.00121,0.000204,0.001001,0.000715,0.000777,0.001068,0.00074,0.000185,0.000239,0.000595,0.000367,0.000655,0.000442,0.00125,0.001233,0.001385,0.000634,0.000622,0.001075,0.001074,0.000962,0.001691,0.000541,0.000541,0.001061,0.000603,0.001497,0.000637,0.000142,0.000331,0.000194,0.000359,0.000885,0.000778,0.000468,0.000617,0.000501,0.000673,0.000754,0.000424,0.000491,0.000718,0.000506
0.003391,0.002658,0.000931,0.00066,0.001134,0.00179,0.000987,0.00207,0.001275,0.000712,0.001635,0.001113,0.001446,0.000431,0.000861,0.000958,0.001583,0.002824,0.003053,0.001975,0.000402,0.001148,0.001178,0.000995,0.001508,0.000195,0.001917,0.003174,0.003747,0.002519,0.00225,0.001832,0.001093,0.001692,0.001706,0.001642,0.00243,0.002986,0.001773,0.001522,0.000872,0.000203,0.000668,0.000204,0.000103,0.001193,0.000835,0.001799,0.002056,0.000773,0.001884,0.002637,0.001648,0.001319,0.001366,0.001707,0.000286,0.001207,9.7e-05,0.000476,0.002353,0.000274,0.000584,0.000412,0.001042,0.000876,0.000557,0.000278,0.000908,0.000803,0.000862,0.000988,0.000586,0.000599,0.000329,0.000132,0.000317,0.000121,0.000582,0.000403,0.000713,0.000196,0.000735,0.001055,0.000641,0.000306,0.000357,0.000742,0.000651,0.00021,6.8e-05,0.000381,0.000516,0.000456,0.000516,8.6e-05,0.000408,0.000611,0.000963,0.000461,0.000302,0.000606,0.000546,0.000171,0.000742,0.000756,0.000576,0.000571,0.000747,0.000612,0.000197,0.000489,4.6e-05,0.000624,0.000337,0.000178,0.000692,0.000567,0.000565,0.000287,0.000227
0.001132,0.000108,0.000718,0.000474,0.000925,0.000671,0.000677,0.001866,0.001413,0.000498,0.000859,0.000704,0.000985,0.001115,0.000779,0.000875,0.000436,0.001717,0.000947,0.000884,0.000882,0.000835,0.000616,0.000628,0.000489,0.000727,0.001205,0.000866,0.000975,0.000671,0.00047,0.000472,0.000749,0.00019,0.000817,0.001193,0.001196,0.000835,0.000406,0.000759,0.000437,0.000552,0.000714,0.001128,0.000847,0.000731,0.000646,0.000957,0.000571,0.000297,0.001387,0.000374,0.000836,0.000311,0.000531,0.000504,0.000642,0.000463,0.000576,0.000565,0.001052,0.000558,0.000226,0.000191,0.000772,0.000649,0.000249,0.000495,0.001005,0.000494,0.000141,0.000186,0.000138,0.000309,0.000604,9.6e-05,0.000295,0.000308,0.000194,0.000177,3.8e-05,0.000142,0.000397,0.000563,0.000257,0.000327,0.000468,0.000257,0.000512,0.000178,0.000224,0.00022,3.8e-05,0.000303,0.000275,0.000114,0.000521,0.000243,0.000571,0.000657,0.000302,0.000491,0.000486,0.000191,0.000503,0.000532,0.000543,0.000834,0.000516,0.000316,0.000319,0.000522,0.000155,0.000549,0.000165,0.000109,0.000327,4e-04,0.000294,0.000246,0.000309
0.000643,0.000358,0.000291,0.000255,0.000719,0.000705,0.00081,0.000551,0.000626,0.000614,0.000158,0.000199,0.000346,0.000292,0.000575,0.001258,0.001095,0.000427,0.000345,0.000317,0.000153,8e-04,0.000302,0.000107,0.000194,0.000494,0.000657,0.000644,0.000319,0.000305,0.000464,5e-04,0.000367,3.6e-05,0.000576,0.000489,0.000377,0.000578,0.000445,2e-04,0.000507,6.8e-05,0.000426,0.000635,0.000712,0.000456,0.000725,5e-04,0.00024,0.000389,0.000802,0.000449,0.000185,0.000363,0.000195,0.000275,0.000511,0.000551,0.000355,0.000234,0.000513,0.00015,0.000163,8.8e-05,0.000291,0.000176,0.000434,0.000213,0.000401,0.000161,0.000264,0.000116,0.000138,0.00012,0.000248,5.4e-05,0.000306,0.000327,0.000118,0.000156,0.000177,0.000119,0.000195,0.000125,3.4e-05,0.000247,0.000364,2.3e-05,0.000472,0.000227,0.000118,0.000332,0.000205,6.5e-05,0.000115,0.000229,0.000505,0.000141,0.000163,0.000545,0.000179,0.000275,0.000297,0.000226,5.2e-05,0.000344,0.00043,0.000273,0.000425,7.2e-05,0.000183,0.000276,0.000175,0.000458,0.000294,0.000139,0.000226,0.000161,0.000208,7.8e-05,0.000299
0.000563,0.000177,0.000209,0.00025,0.000308,0.000256,0.000411,0.000234,0.000585,0.000464,0.000412,0.000305,8.6e-05,0.000242,0.000381,0.000726,0.000498,0.00024,0.000243,0.000262,0.000228,0.000205,0.000311,0.000193,0.000375,0.00027,0.000332,0.00053,0.000543,0.000418,0.000226,7.1e-05,0.000147,0.00037,7.6e-05,0.00034,0.000287,0.00024,0.00034,8.9e-05,0.000376,0.00028,6.9e-05,0.000483,0.000179,0.000109,0.000405,0.000273,0.000128,0.000115,0.000446,0.000158,0.000128,0.000314,0.000218,0.000184,0.000391,0.000395,6.2e-05,0.000115,0.000447,0.000244,0.000192,4.4e-05,0.000609,8.1e-05,0.000382,0.000132,4.9e-05,0.000118,0.000109,0.000149,7.5e-05,2.2e-05,0.000231,0.000113,0.000283,0.000174,0.00022,0.000188,5.6e-05,3.9e-05,0.000124,7.3e-05,9.1e-05,0.000236,0.000153,9.1e-05,0.000259,0.000134,0.000181,0.000369,8.1e-05,0.000126,5.5e-05,0.000207,0.00045,0.000132,0.00017,0.00045,0.000157,0.000221,0.000218,9.1e-05,4.2e-05,0.000127,0.000144,0.000288,0.00027,4.7e-05,0.000152,0.000198,0.000137,0.000334,0.000116,0.000171,0.000235,6.7e-05,0.000257,6.2e-05,0.00019
0.000337,9.2e-05,7.4e-05,0.000173,0.000108,0.000294,0.000304,0.000152,0.000395,0.000211,0.000141,0.000392,7.4e-05,4.7e-05,2.6e-05,0.000788,0.000624,0.000264,0.000243,0.000285,0.000413,0.000254,0.000185,0.000158,0.000261,0.000279,0.000232,0.000361,0.000578,0.00012,7.9e-05,0.000259,0.000224,0.000299,0.000223,0.000325,0.000163,0.000382,0.000154,0.000171,0.000211,3.2e-05,5.1e-05,0.000403,0.000125,9.1e-05,0.000148,0.000263,0.000189,0.00018,0.000213,0.000214,6.5e-05,0.000209,4.1e-05,0.00014,0.000175,0.000176,0.000145,4.2e-05,0.000408,7.5e-05,0.000124,1e-04,0.000448,0.00017,0.000205,4.1e-05,0.000178,2.3e-05,0.000124,8.1e-05,3.9e-05,0.000138,0.000259,8.8e-05,0.00021,0.000206,0.00018,0.000101,5.7e-05,6.8e-05,9.2e-05,4.9e-05,6.7e-05,0.000176,0.00018,0.000112,0.000213,0.000125,0.000177,0.000201,9.3e-05,0.000198,1.3e-05,4e-05,0.000336,0.000136,0.000176,0.000376,0.000118,0.000195,2.8e-05,0.000133,0.000114,0.000237,0.000165,0.000188,0.000252,0.000123,6.1e-05,7.7e-05,7.8e-05,0.000311,0.000114,6.4e-05,0.000176,0.000106,0.000195,1.1e-05,0.000227
0.000395,0.000214,6.7e-05,0.000219,0.000175,0.000241,0.000295,0.000149,0.000249,6.2e-05,0.000106,0.000189,6.2e-05,0.000112,7.7e-05,0.000625,0.000582,0.00026,0.000118,0.000182,0.00027,9.6e-05,0.000146,0.000164,0.000228,0.000142,0.000146,0.000168,0.000202,0.000156,9.2e-05,0.000257,0.000124,0.000232,0.000173,0.000282,0.000185,0.000194,7.9e-05,7.9e-05,2e-04,0.000127,8.1e-05,0.000255,5.7e-05,6.3e-05,0.000118,0.00021,0.000139,0.000153,0.000138,0.000137,2.8e-05,0.000125,5.4e-05,0.000134,0.000114,0.000175,8.3e-05,0.000117,0.000348,9.1e-05,9.4e-05,6.6e-05,0.000369,8.3e-05,0.000205,3.5e-05,8.6e-05,1.9e-05,0.000104,5.5e-05,6.4e-05,0.000122,0.000198,3.3e-05,0.000172,0.000104,0.000242,3.9e-05,5e-05,3.9e-05,0.000152,0.000115,7.1e-05,0.000174,0.000202,2.4e-05,0.000239,0.000115,3.9e-05,0.000176,9.5e-05,0.000116,6.4e-05,6.1e-05,0.000363,5.9e-05,9.4e-05,0.000403,0.000133,0.000153,0.000102,4.5e-05,7.8e-05,0.000227,0.000288,1.4e-05,0.000199,0.000147,1.1e-05,0.000111,4.6e-05,0.000263,8.6e-05,6.8e-05,0.00013,0.000109,0.000149,7.1e-05,0.000241
1e-04,6.6e-05,2.6e-05,0.000109,7.5e-05,8.3e-05,0.00014,7.2e-05,0.000155,6.1e-05,6.5e-05,6.2e-05,4.5e-05,7.8e-05,1e-05,0.000336,0.000217,0.00013,9.4e-05,0.00011,0.00016,7.9e-05,0.000119,8e-05,0.000117,0.000129,9.5e-05,9.8e-05,0.000145,6.5e-05,1.4e-05,9.6e-05,0.000116,9.8e-05,5.4e-05,0.000166,8.1e-05,0.000111,2.6e-05,2.2e-05,4e-05,2e-05,8.7e-05,0.000149,3.2e-05,4.7e-05,1.3e-05,0.000127,4.6e-05,7e-05,7.5e-05,6.1e-05,5e-05,0.000111,7.9e-05,5.9e-05,8.3e-05,5.4e-05,3.3e-05,3.3e-05,0.000189,1.2e-05,5.1e-05,3.9e-05,0.000166,6e-05,8.9e-05,4.7e-05,5.1e-05,4.2e-05,4.7e-05,3.9e-05,1.5e-05,2.1e-05,0.000138,3e-05,6.3e-05,2.5e-05,8.6e-05,1.6e-05,1.8e-05,2.7e-05,5.2e-05,3.9e-05,1.8e-05,7.9e-05,6.5e-05,5.1e-05,0.000117,3.6e-05,3.3e-05,8.9e-05,4.6e-05,4.8e-05,1.1e-05,3e-05,0.000176,5e-05,3.4e-05,0.00018,9e-05,6.2e-05,7.7e-05,4.4e-05,2.4e-05,0.000104,0.000119,0.000137,8e-05,3.8e-05,7e-06,5.7e-05,4e-06,0.000122,4e-05,2.1e-05,4.7e-05,2.2e-05,6.3e-05,4.5e-05,0.000115
8.9e-05,6.9e-05,1.9e-05,8.4e-05,2.1e-05,9.5e-05,0.000158,1.9e-05,8e-05,6.2e-05,6.3e-05,3.4e-05,5e-05,9.4e-05,4.5e-05,0.000272,0.000227,0.00011,7.5e-05,5.5e-05,9e-05,3.8e-05,8.5e-05,6.5e-05,5.4e-05,8.4e-05,6.5e-05,6.1e-05,0.000114,4.3e-05,2.6e-05,7.5e-05,5.5e-05,0.000102,5.1e-05,0.000138,0.00011,0.000104,1.1e-05,1.5e-05,4.5e-05,3.4e-05,9.1e-05,7.9e-05,5e-05,2.9e-05,6.2e-05,6.8e-05,0.000105,4.9e-05,0.000116,8.8e-05,5.9e-05,0.000104,2.9e-05,8.2e-05,5.4e-05,8.3e-05,3.9e-05,5.4e-05,0.000215,4.7e-05,3.5e-05,2e-05,0.000146,2.7e-05,3.7e-05,5.5e-05,8.1e-05,3.4e-05,2.3e-05,3.8e-05,4e-06,1.8e-05,0.000107,4.1e-05,7.4e-05,2e-05,0.00011,3.3e-05,2.9e-05,2.8e-05,3e-05,2e-05,2.2e-05,7.5e-05,5.7e-05,4.9e-05,9.2e-05,5.3e-05,5e-05,5.7e-05,1.4e-05,5.5e-05,1.8e-05,3.2e-05,0.000118,6.7e-05,3.8e-05,0.000167,7.8e-05,8.1e-05,4.9e-05,4.9e-05,3e-05,9.7e-05,0.000103,1.7e-05,0.000113,4.5e-05,1.9e-05,3.5e-05,3e-05,0.000128,4e-05,2.9e-05,6.5e-05,1.9e-05,6.8e-05,4.3e-05,0.00011
6.9e-05,2.5e-05,3.4e-05,0.000124,4.7e-05,7.8e-05,9.8e-05,5.4e-05,0.000129,0.000122,0.000108,7.2e-05,5.1e-05,6.7e-05,3.1e-05,0.000253,0.000246,0.000152,8.7e-05,3.9e-05,7.8e-05,0.000116,0.000154,1.5e-05,4.2e-05,8.4e-05,6.6e-05,0.000117,0.000142,6.6e-05,2.5e-05,2.3e-05,8.9e-05,7.2e-05,7e-05,7.9e-05,7.2e-05,8.5e-05,4.6e-05,5e-05,4.5e-05,6e-06,7.2e-05,6.4e-05,5.8e-05,5e-05,6.8e-05,7.3e-05,6.9e-05,6.7e-05,9.7e-05,4.7e-05,6.1e-05,8.4e-05,9.4e-05,5e-05,1.7e-05,7.8e-05,5.5e-05,3.1e-05,0.00021,3.5e-05,3.9e-05,2.1e-05,0.000145,3.2e-05,6.4e-05,3.8e-05,4.1e-05,4.6e-05,5.9e-05,1.8e-05,1.5e-05,4.6e-05,0.000108,3.9e-05,8.7e-05,2.1e-05,0.00011,3.3e-05,3.1e-05,6.1e-05,4.6e-05,5e-06,2.3e-05,8e-05,5.6e-05,3.9e-05,8.7e-05,6.1e-05,6.6e-05,8.3e-05,4.4e-05,6.2e-05,1.8e-05,5e-06,0.000143,5.9e-05,2.7e-05,0.000164,0.000105,6.6e-05,4.7e-05,3.2e-05,2.8e-05,7.9e-05,7e-05,0.000106,9.8e-05,3.8e-05,2.1e-05,4.7e-05,4e-05,0.000134,3.2e-05,3.7e-05,4.9e-05,2.3e-05,6.1e-05,3.8e-05,9.8e-05
9.7e-05,1.9e-05,4.8e-05,0.000116,7e-05,1.6e-05,0.000156,9.9e-05,0.000225,7.7e-05,0.000106,0.000107,7e-05,4.4e-05,2.4e-05,0.000307,0.000225,8.2e-05,4e-05,0.000141,6.9e-05,8.5e-05,0.000131,0.000105,3.3e-05,6.3e-05,7.7e-05,0.000115,9.2e-05,4.7e-05,3.3e-05,3.7e-05,5.8e-05,9.8e-05,7.5e-05,8.1e-05,6.9e-05,3e-05,3.9e-05,3.5e-05,3.5e-05,6e-05,5.7e-05,0.000121,1.3e-05,3.1e-05,6.5e-05,5.5e-05,0.000103,6.8e-05,2.6e-05,9.7e-05,4.2e-05,7e-05,9.1e-05,0.000108,6e-05,5e-05,2.9e-05,4.3e-05,0.000116,2.9e-05,8e-06,2e-05,0.000126,6.2e-05,6e-05,0.000112,8.6e-05,3.1e-05,2.1e-05,1.8e-05,2.3e-05,3.8e-05,9.4e-05,4e-05,0.000157,7.9e-05,0.000146,6e-05,6.7e-05,5.8e-05,4.6e-05,5.2e-05,7.1e-05,8.2e-05,9.5e-05,5.5e-05,5.5e-05,1.5e-05,2.5e-05,7.7e-05,6.5e-05,6.4e-05,1.1e-05,3.1e-05,0.000169,7.7e-05,8.9e-05,0.000206,9.9e-05,9.2e-05,5e-05,6.3e-05,2.7e-05,6.9e-05,7.3e-05,6.7e-05,4.9e-05,7.6e-05,4e-05,5.1e-05,2.8e-05,0.000128,9.3e-05,3.2e-05,4.3e-05,2.6e-05,4.7e-05,3.8e-05,0.000106
6.6e-05,2.4e-05,6.2e-05,0.000117,6.1e-05,6.4e-05,0.000138,5.6e-05,1e-04,9.8e-05,4.5e-05,0.000108,4.6e-05,4.1e-05,2.6e-05,0.000272,0.000168,7.7e-05,7.4e-05,7.3e-05,8.5e-05,8.7e-05,6.7e-05,4.9e-05,4.6e-05,0.00011,5.6e-05,6.7e-05,4.1e-05,4e-05,4.8e-05,2.4e-05,7.4e-05,5.9e-05,1.7e-05,8.5e-05,2.5e-05,7.8e-05,7.1e-05,3.1e-05,7.1e-05,2.5e-05,6.5e-05,9.4e-05,3.8e-05,1.9e-05,7e-06,5.3e-05,8.2e-05,2.7e-05,3.2e-05,1.8e-05,5e-05,8.8e-05,2.6e-05,3.6e-05,2.3e-05,4.4e-05,1.5e-05,3.8e-05,0.00015,4.2e-05,3e-05,3.7e-05,0.000126,1e-04,0.000114,7.8e-05,7.5e-05,2.1e-05,2.4e-05,8.3e-05,3.3e-05,8e-06,0.000108,5e-05,6.4e-05,3.5e-05,9.3e-05,6.2e-05,3.7e-05,3.7e-05,4.3e-05,7.3e-05,2.4e-05,9.8e-05,0.000117,4.2e-05,6.6e-05,4.7e-05,6.6e-05,9.7e-05,5.2e-05,7e-05,6.6e-05,4.5e-05,0.000105,4.2e-05,3.4e-05,0.000115,0.000104,7.7e-05,0.000128,9.1e-05,8.1e-05,9.1e-05,6e-05,0.00016,0.000129,7e-05,2.8e-05,3.3e-05,6.8e-05,1e-04,0.00018,7e-05,6.9e-05,1.4e-05,4.3e-05,4.4e-05,9.5e-05
1.3e-05,8.2e-05,3.8e-05,7.3e-05,4e-05,5.8e-05,0.000116,6.2e-05,0.000157,3.7e-05,3.4e-05,1e-04,4.8e-05,8.4e-05,5.3e-05,0.000162,0.000208,6.1e-05,6.6e-05,8.9e-05,9.6e-05,2.5e-05,3.6e-05,5.9e-05,7.1e-05,3.7e-05,4.4e-05,6.3e-05,0.000105,5.6e-05,3.8e-05,7.9e-05,6.6e-05,3e-05,1.8e-05,9.3e-05,6.7e-05,6.1e-05,9.6e-05,4.9e-05,7.9e-05,4.3e-05,9e-05,9e-05,3.3e-05,2.9e-05,1.7e-05,7.7e-05,7.8e-05,3.9e-05,3.4e-05,3.1e-05,1.7e-05,3.9e-05,1.9e-05,5e-05,3.6e-05,3.7e-05,4e-05,7.1e-05,0.000173,3.6e-05,4.9e-05,1.3e-05,0.000146,5.7e-05,4.3e-05,6.9e-05,4.7e-05,3e-06,4.2e-05,6.1e-05,2.4e-05,1e-05,0.000129,2.1e-05,4.9e-05,2.7e-05,5.6e-05,3.9e-05,4.4e-05,3.9e-05,4.4e-05,4.6e-05,7.3e-05,6.7e-05,6.9e-05,8.9e-05,0.000128,3.8e-05,8.9e-05,8.4e-05,6.9e-05,7.6e-05,1.7e-05,2.2e-05,0.000138,4.2e-05,1e-05,9.7e-05,1.3e-05,4.1e-05,2.4e-05,4.7e-05,3.8e-05,3.8e-05,9.1e-05,7.4e-05,9.5e-05,2.7e-05,1.5e-05,5.5e-05,0.000106,6.8e-05,5.7e-05,7.6e-05,6.5e-05,2.2e-05,6.8e-05,2.2e-05,9e-06
4e-05,8.3e-05,2.1e-05,5.6e-05,3.5e-05,7.9e-05,0.000113,4.8e-05,8.9e-05,5.4e-05,4.7e-05,1e-05,5.2e-05,6.5e-05,1.5e-05,0.000234,0.000149,6.2e-05,3.4e-05,5.4e-05,7.5e-05,3.3e-05,7.9e-05,5.7e-05,7.5e-05,9.3e-05,3.4e-05,4.7e-05,0.000118,6.2e-05,5.3e-05,3.4e-05,2.9e-05,3.8e-05,8.8e-05,0.000118,2.7e-05,7.6e-05,6.5e-05,2.7e-05,7.6e-05,2.6e-05,0.000107,4.5e-05,8.2e-05,2.9e-05,1.7e-05,8.7e-05,8.5e-05,8.8e-05,4e-05,3.9e-05,5e-06,7e-05,4.9e-05,8e-05,7.5e-05,5e-05,6.9e-05,4e-05,0.000186,7e-05,4.5e-05,1.5e-05,0.000164,1e-04,8.9e-05,6.5e-05,2.9e-05,3.8e-05,4.1e-05,5.1e-05,6.1e-05,2.2e-05,0.000104,2e-05,0.000114,4.3e-05,4.9e-05,5.3e-05,1.9e-05,4.2e-05,2.1e-05,9e-06,6.2e-05,0.000121,6.3e-05,5.1e-05,0.000113,7.4e-05,1.4e-05,5.9e-05,6e-06,8.5e-05,5.9e-05,2e-05,0.000143,1.9e-05,4.2e-05,0.000153,3.9e-05,1.5e-05,6.2e-05,1.1e-05,2e-05,8.2e-05,7.5e-05,4.1e-05,0.000134,2e-05,8.9e-05,6.5e-05,4.4e-05,0.000104,7e-05,2.7e-05,5.4e-05,3.2e-05,6.4e-05,3.1e-05,6.9e-05
4.1e-05,6e-05,3.2e-05,6.2e-05,4.9e-05,8.3e-05,0.000129,4.1e-05,9.7e-05,4.9e-05,9.8e-05,8.5e-05,1.7e-05,6.7e-05,7.2e-05,0.000336,0.000165,7.9e-05,7.4e-05,6.8e-05,8.1e-05,6.4e-05,2.9e-05,6.8e-05,0.000114,9.7e-05,5.4e-05,3.7e-05,8.8e-05,6.3e-05,1.1e-05,2.3e-05,5e-05,2.2e-05,0.000131,9.1e-05,5e-05,6.8e-05,5.5e-05,6.5e-05,1e-04,3.4e-05,8.4e-05,4.3e-05,1.4e-05,8.3e-05,6.1e-05,4.4e-05,5.2e-05,8e-05,8.6e-05,3.8e-05,3.2e-05,7.2e-05,8.4e-05,2.9e-05,9e-06,4.3e-05,5.4e-05,6.1e-05,0.00016,5e-05,5.4e-05,5.5e-05,0.000152,5.2e-05,5.6e-05,7.4e-05,5.6e-05,7.3e-05,6e-05,4.4e-05,3.2e-05,5e-05,7.4e-05,3.4e-05,6.3e-05,9.5e-05,9.8e-05,4.8e-05,4.9e-05,2.5e-05,2.6e-05,4.8e-05,2.2e-05,0.000106,6.9e-05,1e-04,9.4e-05,3.7e-05,6.5e-05,9.2e-05,8.5e-05,1.4e-05,2.5e-05,7.1e-05,6.1e-05,3.1e-05,4.7e-05,9.9e-05,1.8e-05,0.000119,1.5e-05,2.4e-05,3.5e-05,7.7e-05,3.2e-05,3.2e-05,5.5e-05,2.4e-05,0.000148,7.6e-05,3e-05,9.7e-05,2e-05,4.4e-05,3.5e-05,0.000101,9.8e-05,8.1e-05,1.9e-05
1.4e-05,0.000156,5.8e-05,9.5e-05,5.5e-05,4.1e-05,0.000117,3e-05,8e-05,3.1e-05,0.000114,1.1e-05,4.1e-05,4e-05,7.3e-05,0.000263,0.00018,9.7e-05,8e-05,0.00011,2.8e-05,6.5e-05,6.4e-05,5.7e-05,6.9e-05,9.4e-05,5.6e-05,5.8e-05,9.3e-05,3.8e-05,5.5e-05,2.2e-05,5.5e-05,8.7e-05,3.2e-05,7.1e-05,9e-05,0.000112,2.6e-05,4.3e-05,4.3e-05,2.1e-05,0.000104,4.4e-05,8.2e-05,6.7e-05,8.2e-05,7.3e-05,7.6e-05,1.3e-05,1.7e-05,6.8e-05,1.9e-05,4.3e-05,9.6e-05,5.1e-05,3.4e-05,1e-05,1.6e-05,6.5e-05,0.000147,4.2e-05,3.6e-05,3.1e-05,0.000139,2e-05,7.4e-05,9.8e-05,4.4e-05,2.1e-05,8.2e-05,2.9e-05,2e-05,2.4e-05,0.000118,6.9e-05,4.9e-05,7e-05,4.5e-05,4e-05,3.9e-05,3.2e-05,7.1e-05,0.000129,6.1e-05,0.000147,4.4e-05,5.7e-05,5.7e-05,6.7e-05,5.7e-05,0.00011,7.7e-05,2.6e-05,3.5e-05,3.4e-05,0.000118,6.4e-05,4.9e-05,0.000149,5.7e-05,9.9e-05,5.1e-05,3e-05,0.00011,9.1e-05,5.1e-05,6.4e-05,0.000142,5.1e-05,0.000125,0.00011,0.000165,0.000132,2.9e-05,8e-06,7.4e-05,0.000156,0.000106,4.3e-05,0.000103
4.4e-05,8.4e-05,3.5e-05,0.000105,1.4e-05,3e-06,0.000111,5.1e-05,6.9e-05,1.7e-05,0.000108,8.2e-05,3.3e-05,4.9e-05,6.1e-05,0.000275,0.000193,7.1e-05,5.1e-05,7.6e-05,3.4e-05,9.9e-05,6.2e-05,7.5e-05,9.9e-05,7.5e-05,8.1e-05,7.6e-05,4.2e-05,4.1e-05,2.7e-05,3.9e-05,3e-05,0.000112,8.6e-05,0.000127,3.6e-05,5.7e-05,7.1e-05,3.2e-05,6e-05,2.4e-05,4.2e-05,9.2e-05,8e-06,6.3e-05,3.8e-05,1.5e-05,9.9e-05,4.4e-05,1.8e-05,2.4e-05,2.9e-05,5.4e-05,5.9e-05,4.2e-05,4.6e-05,6.6e-05,3e-05,7.5e-05,0.000167,2.5e-05,5.2e-05,4.7e-05,0.000104,5.3e-05,7.2e-05,4.8e-05,4.7e-05,4.6e-05,3e-05,3.2e-05,2.2e-05,2.4e-05,8e-05,7e-05,2.4e-05,3.6e-05,8.3e-05,3.1e-05,3.5e-05,8e-06,0.000108,9.7e-05,7.3e-05,0.000122,1.8e-05,1.6e-05,4.6e-05,2.9e-05,0.000119,4.9e-05,7.8e-05,4.5e-05,4e-05,6.2e-05,9.6e-05,5.9e-05,4.7e-05,0.000142,7.1e-05,7.2e-05,3.3e-05,2.6e-05,8.6e-05,0.000107,0.000129,7.4e-05,0.000104,5.9e-05,7.4e-05,1.8e-05,0.000137,8.8e-05,2.9e-05,5.9e-05,8.3e-05,7.5e-05,0.000147,9.2e-05,0.000109
7e-05,7.2e-05,1.7e-05,9e-05,4.1e-05,6.4e-05,5e-05,4.7e-05,7.4e-05,3.7e-05,0.000103,6.7e-05,4.6e-05,6.5e-05,3.6e-05,0.000235,6.9e-05,1.5e-05,2.7e-05,6.7e-05,6.6e-05,8.4e-05,0.000134,3.8e-05,9.3e-05,3e-05,2.9e-05,4.2e-05,7.6e-05,1.1e-05,4.3e-05,5.6e-05,5.6e-05,8.9e-05,3e-05,0.000106,4e-05,3.6e-05,1.3e-05,5.8e-05,3.8e-05,2.8e-05,3.3e-05,5.2e-05,3e-05,5e-05,3.7e-05,2.7e-05,0.000101,8.1e-05,5.5e-05,5.6e-05,5.3e-05,4.6e-05,4.2e-05,3.6e-05,1.6e-05,6.9e-05,1.5e-05,4.6e-05,0.00012,7.1e-05,9.1e-05,0.000113,0.000123,3.6e-05,8.9e-05,4.3e-05,4.3e-05,2.1e-05,2e-05,4.3e-05,4.4e-05,7e-06,6.5e-05,1e-04,0.000113,6.1e-05,3.2e-05,3.2e-05,7.1e-05,6.2e-05,8.6e-05,6.1e-05,6.8e-05,8.4e-05,0.000103,4.1e-05,5.4e-05,9e-06,9.1e-05,0.000109,2e-05,7e-05,7.2e-05,3.7e-05,0.000114,1.5e-05,3.7e-05,0.000114,5.7e-05,6.1e-05,7.6e-05,4.3e-05,4.2e-05,8.6e-05,6.9e-05,6.3e-05,2.4e-05,2e-06,4.5e-05,9.4e-05,2.3e-05,7.4e-05,5.5e-05,4.3e-05,6.6e-05,1.9e-05,8.7e-05,5.4e-05,0.00015
0.000103,0.000108,7.6e-05,0.000127,3.9e-05,1.3e-05,8.9e-05,9.5e-05,0.000114,5.2e-05,7.9e-05,4.9e-05,2.3e-05,4.1e-05,3.8e-05,0.000242,0.000166,9.5e-05,2.5e-05,8e-05,8.3e-05,7e-05,8e-05,7.9e-05,3.1e-05,2.9e-05,4.7e-05,4.2e-05,0.000124,6.4e-05,2.4e-05,6.7e-05,9.1e-05,7.9e-05,2.8e-05,7.6e-05,4.1e-05,1.9e-05,7.4e-05,5.8e-05,0.000125,5.7e-05,1.6e-05,1.6e-05,5.5e-05,4e-05,6.6e-05,6.1e-05,8.2e-05,6e-06,4.9e-05,3.3e-05,7.7e-05,8.5e-05,8.5e-05,7.6e-05,4.5e-05,8e-05,4.3e-05,3.1e-05,0.000139,7.4e-05,0.000153,7.7e-05,0.000166,4.8e-05,4.5e-05,7.6e-05,4.4e-05,1.6e-05,3e-05,6e-06,4.2e-05,2.1e-05,0.000115,4.4e-05,7.4e-05,2.2e-05,5.6e-05,2.1e-05,4.6e-05,7e-06,7e-05,4.9e-05,1e-05,1.2e-05,3.7e-05,3e-05,7e-05,2.3e-05,4.5e-05,3.2e-05,1.7e-05,0.000105,2.9e-05,1.4e-05,9.1e-05,3.7e-05,5.3e-05,0.000114,3.7e-05,9.6e-05,6.5e-05,5e-06,1.1e-05,5.7e-05,0.000125,0.000117,4.8e-05,3.4e-05,3.2e-05,6e-05,1.7e-05,0.00011,3.7e-05,3.6e-05,4.7e-05,2.6e-05,8.9e-05,2e-05,0.000106
6.8e-05,8.4e-05,5.8e-05,9.2e-05,6.5e-05,3.9e-05,0.000129,1.9e-05,7.4e-05,1.8e-05,5.9e-05,5.3e-05,5.1e-05,3.4e-05,4.1e-05,0.00029,0.000173,7.3e-05,3.5e-05,6.2e-05,3.4e-05,4e-05,6.2e-05,4.9e-05,6.4e-05,9.1e-05,1.9e-05,1.9e-05,5.2e-05,9.7e-05,9.8e-05,4.7e-05,8e-05,6e-05,6.7e-05,3.4e-05,2.1e-05,6.8e-05,2e-05,6e-05,0.000102,4.2e-05,6e-05,2.5e-05,1.8e-05,7e-06,4.2e-05,4.2e-05,4.5e-05,3.2e-05,4e-05,9.9e-05,4.4e-05,4.4e-05,6.3e-05,3.2e-05,1.5e-05,5.4e-05,2e-06,3.2e-05,0.000128,4.1e-05,7.3e-05,2.5e-05,0.000151,4.1e-05,5.2e-05,3.9e-05,2.4e-05,2e-05,4e-05,1.1e-05,3.2e-05,1.9e-05,0.00012,4.9e-05,5.9e-05,3.5e-05,6.7e-05,2.6e-05,2.9e-05,1.9e-05,6.8e-05,2.2e-05,3.1e-05,6e-05,2.6e-05,3.3e-05,7e-05,1.3e-05,2.9e-05,5.8e-05,2e-05,7.2e-05,7e-06,5e-06,0.000109,3.1e-05,4.3e-05,9.8e-05,2.3e-05,4.3e-05,5.7e-05,2.9e-05,1.1e-05,8.2e-05,0.000137,3.2e-05,6.9e-05,2e-05,2e-05,4.5e-05,1.9e-05,0.000111,1.8e-05,3.6e-05,4.8e-05,3.5e-05,4.3e-05,9e-06,8e-05
6.3e-05,7.2e-05,6.1e-05,6e-05,3.2e-05,7.9e-05,0.000104,4.7e-05,0.000143,9.9e-05,0.000156,6e-05,3.6e-05,2.9e-05,3.1e-05,0.000243,9.6e-05,4.1e-05,3.6e-05,5.5e-05,7.4e-05,4.3e-05,0.000108,4.7e-05,3e-05,0.000118,6.1e-05,3.1e-05,0.000104,9.6e-05,7.5e-05,0.000108,6.9e-05,7.5e-05,6.4e-05,6.7e-05,5.6e-05,6.5e-05,2.3e-05,4.1e-05,2.9e-05,9e-06,5.6e-05,4.1e-05,5.1e-05,4.5e-05,3.3e-05,3.8e-05,0.000102,3.8e-05,4.1e-05,8.1e-05,2.6e-05,5.9e-05,5.9e-05,5.2e-05,2.3e-05,4.2e-05,3.7e-05,3.6e-05,0.000142,1.7e-05,5.9e-05,2.9e-05,0.000155,7.4e-05,5.3e-05,5.7e-05,1.3e-05,5.1e-05,2.8e-05,2.7e-05,4.8e-05,2e-05,0.000107,6.5e-05,8.7e-05,5.3e-05,3.4e-05,2.9e-05,6.3e-05,3.4e-05,7.9e-05,5e-05,9e-06,4.9e-05,7.2e-05,5.2e-05,8.6e-05,2e-05,3.1e-05,4.9e-05,3.6e-05,7.1e-05,1.1e-05,2.4e-05,8.2e-05,4.2e-05,6.1e-05,0.000134,8.1e-05,4.8e-05,4.4e-05,1.5e-05,5.2e-05,4.7e-05,7.8e-05,6.5e-05,2.9e-05,2e-05,5.3e-05,5.8e-05,7.4e-05,8.8e-05,4.1e-05,5.1e-05,7.9e-05,5.4e-05,5.7e-05,8e-06,9.7e-05
8.6e-05,4.7e-05,9.8e-05,8.6e-05,7.8e-05,4.3e-05,0.000182,5.6e-05,8.8e-05,3.2e-05,0.000123,3.1e-05,2.9e-05,8.9e-05,2.5e-05,0.000206,0.000124,5.5e-05,6.7e-05,4.5e-05,0.000112,3.7e-05,0.000154,0.000108,4e-05,7.3e-05,1.8e-05,4.6e-05,8e-05,2.3e-05,7.1e-05,6e-05,3.7e-05,6e-05,2.8e-05,8.1e-05,5.4e-05,4.8e-05,4.7e-05,1.6e-05,1.2e-05,1.4e-05,1.4e-05,1.9e-05,8.2e-05,4.8e-05,2.5e-05,4.5e-05,9.1e-05,5e-05,2.9e-05,9.4e-05,5.7e-05,1.3e-05,3.5e-05,3.8e-05,7e-06,4.2e-05,6.7e-05,2.9e-05,0.00018,9.8e-05,7.2e-05,3.3e-05,0.000164,0.00014,0.000103,7.1e-05,5e-05,5.7e-05,9.7e-05,6.3e-05,4.4e-05,9.2e-05,4.8e-05,0.000103,0.000172,8.1e-05,8.3e-05,0.000141,0.000167,0.000104,7.8e-05,7.1e-05,9.5e-05,0.000146,0.000127,8.6e-05,7e-06,1e-05,0.000103,0.000144,8e-06,0.000141,9.5e-05,1.9e-05,6.9e-05,0.000117,0.000168,0.000167,9e-05,0.000122,3.2e-05,9.5e-05,3.4e-05,0.00017,0.000136,7.1e-05,5.4e-05,2.9e-05,4.8e-05,5.5e-05,0.000117,0.000129,3.5e-05,6.8e-05,8.8e-05,0.000122,2.4e-05,2.7e-05,0.000135
1.5e-05,2.2e-05,4.3e-05,4.5e-05,2.1e-05,5.1e-05,9.9e-05,5.7e-05,4.1e-05,2.4e-05,6.8e-05,3.5e-05,3.4e-05,9.3e-05,2.1e-05,0.000205,0.000157,2.6e-05,2e-05,5.3e-05,0.000114,9.1e-05,3.6e-05,5e-05,0.000118,6.3e-05,4.1e-05,4e-05,6.5e-05,9.3e-05,6e-05,6.3e-05,1.6e-05,7.1e-05,2.2e-05,6e-05,5.1e-05,4.5e-05,1.4e-05,3.8e-05,4.6e-05,5e-05,6.6e-05,7.2e-05,3.1e-05,5.8e-05,6e-05,4.4e-05,4.9e-05,4.6e-05,4.4e-05,8.2e-05,0.000101,4.5e-05,0.000128,4.6e-05,4.6e-05,0.000127,8.4e-05,8.3e-05,0.000259,6.3e-05,7.2e-05,0.000123,0.000213,9.5e-05,6.4e-05,4.2e-05,7.1e-05,7.7e-05,8.7e-05,3.6e-05,6.3e-05,0.000147,0.000161,0.00014,0.00019,0.000153,0.000153,7.6e-05,5.7e-05,6e-05,2.7e-05,0.00014,0.000145,0.000114,0.000152,0.000138,0.000112,0.000107,0.00017,2.5e-05,0.000133,0.00018,0.000137,0.000151,0.000102,0.000118,8.7e-05,0.000148,6.3e-05,3.8e-05,1.9e-05,8.9e-05,0.000127,0.000161,0.000186,2e-04,0.000164,0.000127,0.000107,2.1e-05,7.5e-05,4.5e-05,0.000113,0.000131,8.8e-05,4.8e-05,9.4e-05,4.2e-05,7.8e-05
3.1e-05,4.6e-05,4.2e-05,6e-05,6.2e-05,3.2e-05,0.000128,8.7e-05,0.000173,7.3e-05,7.3e-05,5.5e-05,5.3e-05,1.3e-05,4.4e-05,0.000219,0.000162,3.7e-05,4.8e-05,8.2e-05,3.6e-05,9.7e-05,0.000102,2.3e-05,8e-05,8.9e-05,5.2e-05,4.1e-05,6.8e-05,6.5e-05,0.000116,8.4e-05,8.7e-05,1.2e-05,3.4e-05,0.000118,6.1e-05,7.6e-05,2.8e-05,4.3e-05,8.1e-05,4.6e-05,6.5e-05,9.6e-05,7e-05,2.5e-05,3.7e-05,7.2e-05,8.7e-05,4.7e-05,3.6e-05,3e-06,3.9e-05,4.1e-05,0.000121,8.6e-05,7.2e-05,0.000116,5.2e-05,8e-05,0.000141,9.2e-05,7e-05,5.8e-05,0.000162,9.5e-05,2.1e-05,1.9e-05,2.8e-05,2.1e-05,7e-06,3.4e-05,6.1e-05,4.4e-05,4.6e-05,3.6e-05,4.5e-05,8.1e-05,7.3e-05,4.3e-05,2.3e-05,3.3e-05,2.8e-05,1e-04,2.6e-05,0.000104,4.5e-05,5.8e-05,8.7e-05,7e-05,3.3e-05,1e-05,0.000124,4.9e-05,5.9e-05,7.1e-05,8.2e-05,2e-05,5.1e-05,0.000136,4.9e-05,6.9e-05,5.7e-05,8.3e-05,4.3e-05,0.000117,7.1e-05,0.000159,0.000106,6.2e-05,4.5e-05,8.7e-05,4.6e-05,8.8e-05,5.7e-05,4.3e-05,6.1e-05,5.6e-05,9.4e-05,3e-06,8.3e-05
6.1e-05,4.3e-05,1.5e-05,7e-05,4.6e-05,4.1e-05,7.6e-05,3.2e-05,0.00011,4.1e-05,4.4e-05,2.4e-05,5.1e-05,4.7e-05,3.1e-05,0.000182,0.000127,4.2e-05,4.8e-05,6.5e-05,2e-05,5.1e-05,7.2e-05,3e-05,5.7e-05,6.8e-05,3.3e-05,4.9e-05,4.2e-05,2.8e-05,3.4e-05,3.8e-05,7.3e-05,8e-05,6.2e-05,0.000108,1.8e-05,5.1e-05,7e-06,1.3e-05,6.8e-05,1.5e-05,4.6e-05,5.9e-05,1.2e-05,2.5e-05,1.5e-05,6.9e-05,5.7e-05,2.5e-05,3.2e-05,2.3e-05,1.4e-05,7e-06,6.3e-05,1e-05,3.2e-05,3.3e-05,2.1e-05,3.9e-05,0.000114,4.1e-05,1.4e-05,3.6e-05,0.000115,4.3e-05,2.1e-05,3e-05,1.8e-05,1.6e-05,2.1e-05,1.1e-05,2.5e-05,2.7e-05,4.8e-05,1.8e-05,1e-05,4.4e-05,7.8e-05,3.3e-05,2.1e-05,8e-06,1.8e-05,3.8e-05,3.9e-05,3.2e-05,1.6e-05,4.1e-05,8.3e-05,5.3e-05,4.3e-05,9e-06,5.7e-05,3.2e-05,1.8e-05,2.6e-05,0.000107,1.9e-05,2.7e-05,9.3e-05,3.6e-05,6.4e-05,3.4e-05,2.1e-05,5e-05,8.5e-05,2.2e-05,6.1e-05,8.9e-05,5.7e-05,2.3e-05,4.6e-05,2.1e-05,9.3e-05,2.4e-05,2.8e-05,6e-05,3.1e-05,5.7e-05,2.1e-05,7.2e-05
4.7e-05,4.5e-05,1.5e-05,8.2e-05,3.5e-05,3.3e-05,7.6e-05,3.2e-05,0.000107,2.9e-05,4.2e-05,1.2e-05,3.2e-05,5.8e-05,1.2e-05,0.000188,0.00014,4.7e-05,4.9e-05,7.2e-05,3.5e-05,5e-05,6e-05,4e-06,4.4e-05,6.1e-05,1.4e-05,3.3e-05,2.9e-05,1.2e-05,3.3e-05,3.5e-05,5e-05,7.2e-05,5e-05,9.8e-05,1.4e-05,4.2e-05,8e-06,8e-06,5.6e-05,4e-06,4.8e-05,4.8e-05,1.6e-05,2e-05,2.2e-05,6e-05,5.7e-05,3.2e-05,1.6e-05,1.4e-05,1.4e-05,1.6e-05,5.2e-05,1.8e-05,2.8e-05,4.3e-05,1.5e-05,3.3e-05,0.00012,1e-05,2.4e-05,1.5e-05,0.000127,4.2e-05,1.3e-05,3.2e-05,2.1e-05,2.2e-05,1.6e-05,1e-06,2.1e-05,2.9e-05,4.6e-05,2.5e-05,2e-06,2.2e-05,6.1e-05,1.8e-05,1e-06,1.4e-05,1.9e-05,1.7e-05,5.3e-05,3.1e-05,1.1e-05,3.4e-05,7.5e-05,4.1e-05,3.9e-05,7e-06,2.7e-05,2.9e-05,1.4e-05,2.3e-05,0.000108,1.3e-05,1.8e-05,0.000116,3.9e-05,4.8e-05,2.1e-05,1.3e-05,4.6e-05,7.1e-05,1.8e-05,5.9e-05,8.6e-05,5.3e-05,6e-06,4.5e-05,1.7e-05,8.9e-05,2.4e-05,3.9e-05,5.3e-05,2.4e-05,5e-05,1.2e-05,6.1e-05
4.6e-05,4.1e-05,1e-05,8.2e-05,3.7e-05,1.9e-05,7.5e-05,1.9e-05,0.000102,3.3e-05,4.7e-05,2e-05,3.5e-05,5.2e-05,1e-05,0.000191,0.000137,4.2e-05,5e-05,6.8e-05,4.1e-05,4.6e-05,6.2e-05,9e-06,5.1e-05,5.3e-05,1.2e-05,2.8e-05,3.1e-05,8e-06,2.7e-05,2.5e-05,4.9e-05,6.4e-05,5.4e-05,9.2e-05,8e-06,4.1e-05,8e-06,2e-06,5.3e-05,1.3e-05,4.4e-05,4.5e-05,1.9e-05,1.7e-05,1.3e-05,4.9e-05,5.3e-05,2.6e-05,8e-06,2e-05,6e-06,1.6e-05,4.1e-05,1.1e-05,2e-05,4.6e-05,9e-06,2.9e-05,0.000122,1.6e-05,1.5e-05,6e-06,0.000132,3.5e-05,1.7e-05,2.1e-05,2e-05,1.4e-05,1.8e-05,4e-06,1.8e-05,2.2e-05,5.8e-05,1.8e-05,6e-06,1.4e-05,5.9e-05,1.3e-05,1e-05,7e-06,2.1e-05,2.2e-05,4.3e-05,2.8e-05,7e-06,3.3e-05,7.7e-05,3.8e-05,4e-05,1.5e-05,1.6e-05,2.5e-05,6e-06,2.2e-05,0.000103,6e-06,1.6e-05,0.000111,3.1e-05,6.3e-05,2.5e-05,6e-06,4.6e-05,6.8e-05,2.1e-05,5.7e-05,8.3e-05,4.9e-05,1.1e-05,5e-05,1.6e-05,8.7e-05,2.2e-05,3.3e-05,4.6e-05,2.6e-05,5.5e-05,1.6e-05,6.2e-05
