-0.000184,-2.6e-05,0.000123,0.00019,6.1e-05,-7.1e-05,-9e-05,-6e-06,-0.000217,-0.000114,-6.5e-05,-0.000308,-0.000187,-0.000584,-0.000405,-0.000214,1e-05,-0.002308,-0.012865,-0.023306,-0.019408,-0.011966,-0.005341,-0.001928,-0.000928,0.003111,-0.012438,-0.019619,-0.017027,-0.023236,-0.023799,-0.013439,-0.017475,-0.019012,-0.021654,-0.024414,-0.014363,-0.011875,-0.007424,-0.014059,-0.02038,-0.016346,-0.01668,-0.020872,-0.016726,-0.014442,-0.021746,-0.021573,-0.017932,-0.013752,-0.011588,-0.008602,-0.013482,-0.01369,-0.004614,-0.014851,-0.01323,-0.00925,-0.00945,-0.007473,-0.007321,-0.007543,-0.008351,-0.010273,-0.004568,-0.004974,-0.005829,-0.009746,-0.007771,-0.004866,-0.002258,-0.001287,-0.001316,-0.000381,-0.000519,-0.000873,-0.000697,-0.00071,-0.00136,-0.001015,-0.001047,-0.000806,-0.002031,-0.001536,-0.002806,-0.002136,-0.001749,-0.000574,-0.00265,-0.008857,-0.004128,-0.000544,0.000867,0.000692,0.001498,0.001005,3.4e-05,-0.00023,-0.000224,-0.000105,-0.000422,-0.000632,-0.000368,-0.000146,-0.000448,-6.4e-05,-0.000282,-0.000506,-0.000332,6.5e-05,8e-06,-0.002392,9e-04,0.000451,0.000364,4.4e-05,1.1e-05,-0.000202,-0.000161,-0.00019,4.6e-05
9.3e-05,3e-06,-3.1e-05,4e-06,0.000122,0.000117,0.000113,-3.2e-05,0.000111,-1.9e-05,-3e-06,5.8e-05,0.000128,0.000343,0.000154,-7.8e-05,4.4e-05,-0.00212,0.000309,0.002422,-0.003138,0.011293,0.009872,0.002645,0.00126,0.008153,-0.009695,-0.010023,0.001407,0.016625,0.013836,0.005819,-0.001043,0.003812,0.006486,0.007455,0.001561,-0.00081,0.001765,0.004343,0.003678,0.006164,0.00387,0.006604,0.002106,-0.002408,-8.9e-05,0.005828,0.000538,-0.001521,0.000442,-0.001788,0.001849,0.002743,-0.007084,0.002141,0.002882,-0.001881,0.002926,0.000258,0.001028,0.001327,-0.001771,-0.002253,-0.001228,-0.00082,0.000164,0.004132,0.003262,-0.000828,-0.00347,-0.00102,0.000705,-0.000181,-0.000272,0.000517,0.000376,-4.5e-05,-9e-06,-9.3e-05,0.000529,0.000241,0.000405,-0.000375,0.001425,0.001052,0.000712,0.000665,-0.001393,0.000828,0.002,0.001496,0.00081,-0.000706,-0.000411,0.00056,0.000848,0.000675,-2.1e-05,-9.7e-05,-6.8e-05,0.000146,-0.000162,2.1e-05,9e-06,0.000118,0.000333,0.000249,-0.000121,2.3e-05,-1.3e-05,0.001089,0.00187,0.000999,0.000739,0.000346,0.000272,0.000299,3.1e-05,0.000133,0.000216
-0.000109,-0.000144,-0.000123,-9.9e-05,4e-06,3.5e-05,-9e-05,-0.000149,-0.000163,-2.7e-05,-4.7e-05,-0.000109,-0.000105,-8.2e-05,-1.2e-05,4.4e-05,-0.000214,-0.000278,-0.005943,-0.000945,-0.005894,-0.007419,-0.00281,-0.001613,-0.002424,-0.000475,0.001575,0.005534,0.002183,-0.010479,-0.005571,-0.00556,-0.001417,-0.002888,-0.016046,-0.004926,-0.007102,-0.005635,-0.003578,-0.006066,-0.005289,-0.002233,-0.004327,-0.006332,-0.009211,-0.001497,0.000547,-0.003886,-0.003048,-0.00112,-0.005116,-0.002355,0.000186,0.002587,-0.001551,-0.004422,-0.003592,0.000701,0.000799,0.000388,-0.00013,-0.000548,-0.000828,-0.003493,-0.00257,-0.001337,-0.001351,-0.002203,-0.001663,0.001176,-0.000912,-0.001244,-0.001049,-0.000236,0.000575,7.3e-05,0.000251,-0.000382,0.000234,-0.000239,-0.000765,-0.000404,-0.001496,-0.000401,-0.000769,-3.9e-05,-0.000278,7.4e-05,-0.001245,0.00212,0.001439,9e-04,0.000661,0.000294,-0.000765,0.000326,0.000242,6.7e-05,0.000225,5.5e-05,0.000131,8.8e-05,0.000236,5.3e-05,-0.000119,-0.000225,-0.000124,-0.000286,-8e-06,-0.000176,-0.000551,-0.000162,-0.002937,-0.001807,-0.000234,0.000145,-6.4e-05,-0.000208,-0.000134,-0.000342,-0.000162
-0.000144,1.2e-05,4.8e-05,1.6e-05,-6.2e-05,-3.5e-05,-2e-06,-0.000108,7.7e-05,-2.9e-05,-8.4e-05,3e-05,0.000159,-7.8e-05,-0.000136,1.6e-05,2.1e-05,0.000108,0.003016,0.002392,0.000789,-0.001917,6.7e-05,0.000854,0.002951,0.00035,0.001742,0.002725,0.002461,-0.002621,0.000444,-5e-04,0.002286,-0.004635,0.001843,0.00305,0.005765,0.00217,-0.003634,-0.002099,0.001956,0.001718,-0.002092,0.008237,0.006518,0.003994,-0.000308,0.001161,0.003406,-0.005375,0.00221,-0.003115,-0.001748,-0.000693,0.001396,0.004105,0.004177,-0.000938,-0.003879,-0.000118,-0.000585,-0.001821,-0.00167,0.002432,-0.001544,-0.001339,-0.001984,-0.000529,-0.001763,-0.000912,-7.9e-05,-0.000194,0.000292,0.000354,0.000543,-0.000189,-0.000118,5.7e-05,-0.000125,-0.000289,0.000201,-5.2e-05,-7.2e-05,0.000355,-0.00119,-0.001137,-9.2e-05,-0.000362,0.001019,0.000993,-0.00013,0.000413,0.00025,0.000396,-0.000126,0.00026,-4.7e-05,0.000223,-0.000108,-0.000223,-4.4e-05,-0.000336,-0.000156,1.5e-05,-0.000166,-0.000118,-0.000141,9e-05,-1e-06,7.5e-05,5.5e-05,-0.000778,-0.000303,-0.000526,-0.000137,3e-06,4.8e-05,3e-05,6e-05,2.1e-05,0.000125
4e-06,2.9e-05,0.000104,0.000112,-3.7e-05,6.1e-05,-5.9e-05,8.9e-05,-8.8e-05,3e-05,0.000107,4e-05,-2.1e-05,4.5e-05,2e-04,2e-05,-0.000146,-6e-06,-0.000738,-0.005873,0.000893,-0.002518,0.001284,0.001372,-0.000469,-0.000974,-0.002146,-0.009493,-0.01055,-0.009462,-0.003117,-0.004028,-0.003067,0.004214,0.003227,-0.006817,-0.010271,-0.004605,0.000208,-0.002692,-0.00455,-0.002157,0.000824,0.000599,-0.003957,-0.000594,-0.000193,-0.001252,0.002921,0.002075,-0.004098,0.001487,-0.002625,-0.001617,0.000692,-0.002301,-0.002804,-0.000628,0.003278,-0.000476,0.001396,0.000475,-0.000337,0.002494,0.002616,0.000708,8.3e-05,-0.002605,0.000268,0.001642,0.00159,0.000273,0.000288,0.000524,3.8e-05,-0.000187,-0.00011,1e-06,0.000195,0.000345,-0.000196,-0.000127,0.000464,-0.000418,-0.00133,-0.000935,-0.000597,0.000134,0.001098,-0.002032,-0.001639,0.00016,-0.000266,0.000543,0.000104,0.000753,8e-06,-0.000175,8.2e-05,4.1e-05,-5e-06,0.000251,-2.5e-05,7.5e-05,9e-05,7.4e-05,-4.2e-05,-5.7e-05,-6.4e-05,5.8e-05,0.000123,-0.000163,-0.000572,-0.000192,0.000264,1e-05,-2.2e-05,-4.5e-05,7e-06,3.9e-05,0.000121
7.3e-05,5.5e-05,-6e-06,7.5e-05,-3.2e-05,-4.3e-05,-5e-06,3.3e-05,1.5e-05,-2.6e-05,-2.3e-05,2.8e-05,0.000117,7e-05,1.3e-05,1e-04,-3.1e-05,7e-05,0.00041,0.001744,-0.001084,-0.005651,-0.003187,0.000585,0.000238,-0.001013,-0.002187,0.00278,0.003259,0.003942,0.003545,0.002392,0.002796,0.000974,0.002572,0.004062,0.001599,0.003865,0.004386,0.001941,0.002902,0.002852,-0.000832,-0.001467,0.000657,0.004648,0.003059,0.000548,-0.003237,-0.000453,0.000777,-0.00038,-0.001583,-0.000726,0.000484,0.001614,0.000505,0.002563,-0.002298,1.7e-05,-0.001443,-0.00092,0.000992,-0.002692,-0.000706,-0.000503,5e-04,0.000975,-0.001504,-0.000541,0.000601,-0.000159,-0.00057,0.000196,-7.8e-05,-0.000165,-0.000168,0.000219,0.000494,-2e-05,-2.2e-05,-0.00018,0.000366,0.000617,-0.000544,-8e-05,0.000125,9e-05,0.000414,0.000173,-0.00014,0.000254,-0.000482,0.000241,-0.000301,-0.000114,-0.000211,0.000285,0.000193,0.000223,0.000142,0.000111,0.000186,0.000109,4.9e-05,-1.1e-05,-0.000133,3.6e-05,-4e-05,6.9e-05,3.7e-05,5.2e-05,-0.000288,-0.000371,-2.1e-05,8e-06,4.5e-05,4.1e-05,4e-06,3.2e-05,4.8e-05
2.8e-05,-7.6e-05,-6.9e-05,-2.2e-05,-5.4e-05,-9e-06,-8.2e-05,3e-05,1.5e-05,-3.2e-05,-1.3e-05,-1.6e-05,-9.7e-05,-0.000119,1.9e-05,3.3e-05,-6.7e-05,-0.000166,0.000621,-0.00035,0.002753,-0.000289,0.002081,0.000919,3e-04,0.001091,-0.000603,-0.004498,0.004442,0.002644,-0.003709,-0.001918,0.000413,-0.001057,-0.002865,-0.00529,-0.000828,-0.002136,-0.0025,-0.00115,-0.002807,-0.001387,0.001522,-0.001029,-0.001329,-0.003607,-0.002342,0.001036,0.002746,0.002106,0.002254,0.00188,0.000956,-0.002302,-0.000133,-0.001183,-0.001304,-0.001007,0.000314,-0.000355,0.000488,0.000212,0.001411,0.000872,0.000581,0.000264,-0.000363,-0.000404,0.000242,0.000175,0.000845,0.00108,0.000236,0.000498,-0.000266,-0.000313,-0.00039,-0.000257,-1.9e-05,-0.000192,-0.000348,-0.000267,-7.8e-05,3.9e-05,-0.000332,-0.001178,-0.000458,0.000229,0.00013,5e-04,-0.000623,5.5e-05,-0.000218,0.000606,0.000116,-7.5e-05,-0.000483,-4e-04,-0.000181,-0.000196,-0.00013,-0.000124,-0.000174,-9e-05,-4.4e-05,0.000101,-0.000141,6e-06,2e-05,-0.000119,-6.8e-05,-4e-05,-0.000105,0.000122,3.2e-05,-0.000216,-1.8e-05,4e-06,-2.3e-05,-2.6e-05,-5.7e-05
4.6e-05,3.3e-05,-4.4e-05,-4.8e-05,-6e-06,-3e-05,5.6e-05,2.6e-05,5e-06,2e-06,-2.1e-05,-4.6e-05,2.2e-05,6e-05,-1.2e-05,5.4e-05,-2.8e-05,-0.000109,-0.000421,0.000319,-0.002011,0.001149,-0.001753,-0.000265,0.000248,-0.000432,-0.000575,0.000876,-0.004694,0.001338,-0.002121,-0.001287,-0.000271,8e-06,-0.001352,0.001222,-0.000431,0.003098,0.001528,0.001544,0.00255,0.002338,-0.000195,-0.000709,-0.001236,0.002856,-0.000506,0.00102,-0.00166,-0.003045,-0.000611,0.000721,-3.3e-05,-0.000581,0.00066,-0.002296,0.00096,-0.000262,0.00016,0.00088,-0.000175,-0.000162,-0.002186,-0.000303,-0.00161,2e-05,0.000891,0.00078,-1e-04,3e-06,-0.001583,8.4e-05,-0.00086,-0.00014,-0.000171,-0.000461,-8e-05,0.000293,-0.00018,-3.7e-05,-9e-05,0.000116,-0.000113,0.000541,-6e-05,0.000638,-0.000308,-6.4e-05,3.4e-05,-0.001383,-0.000814,-0.000209,-0.000101,-3.1e-05,-0.000325,-0.000562,-0.000256,1.3e-05,-4.5e-05,-3.9e-05,-7.8e-05,-2.4e-05,2e-06,0.000184,-6.8e-05,0.000176,0.000109,9e-06,-2e-05,0.000109,6.7e-05,3.5e-05,3.2e-05,-0.000678,-0.000442,-0.000128,-0.000101,1e-05,-4.3e-05,-7.5e-05,-0.000113
-1.6e-05,-0.000114,-1.8e-05,1.7e-05,1.1e-05,-2.2e-05,-8.1e-05,-4.8e-05,2.8e-05,5.9e-05,-2.8e-05,6e-06,3.1e-05,-0.000138,-6e-06,-4.3e-05,7e-06,-7.1e-05,0.00045,-0.001396,-0.000583,0.000583,-6.6e-05,0.00097,-0.000214,-0.000379,-0.001012,0.001974,0.002932,-0.000407,-0.00232,-0.001857,-0.00389,0.001452,0.0035,-0.005148,-0.00376,-0.00377,-0.001588,0.001249,-0.002479,-0.001169,-0.001692,0.000326,-0.001017,-0.000718,0.000923,-0.000191,0.00302,0.002897,0.003159,0.001901,0.002699,0.001959,-0.000714,0.000137,-0.001951,0.000115,0.000324,0.000494,0.000472,-0.000111,0.002343,0.000603,0.000791,0.000344,0.000201,-0.000388,0.001168,-0.000724,0.000696,-0.000576,-0.000452,-0.000434,-0.000191,-0.000258,-0.000173,-8.6e-05,-0.000242,-7.9e-05,0.000268,-0.000105,2.7e-05,-3.8e-05,7.7e-05,-4e-06,0.000437,0.000135,-0.000439,-0.000566,-0.000249,-0.000482,-0.000848,0.000311,-0.000166,2.4e-05,-0.000332,-0.000121,-1.8e-05,1e-06,-3e-05,6.6e-05,4e-05,4.4e-05,2.6e-05,-6.7e-05,8e-05,-6e-06,4.1e-05,-3.4e-05,-2.3e-05,7.5e-05,-4.5e-05,9e-05,-0.000133,-0.000151,-0.000111,-3.4e-05,4.3e-05,4.9e-05,-7e-06
-1.3e-05,3.1e-05,2.8e-05,2.6e-05,-2.2e-05,-8e-06,1e-05,-1e-05,-3.4e-05,-2.7e-05,1.1e-05,-5e-06,-2e-05,4.1e-05,1.2e-05,-5.6e-05,1.9e-05,0.000119,-0.000316,0.002061,-0.000576,-0.000645,-0.001575,-0.000346,0.000526,-0.000309,-0.00041,0.00235,0.003215,0.000549,-0.003299,-9.4e-05,0.001511,-0.001459,-0.002868,0.002506,0.001792,0.005138,0.000268,-0.002498,-0.001675,-0.000802,0.000557,-0.000768,9.4e-05,0.002254,-0.000665,0.000428,-0.001746,-0.002611,-0.001783,-0.00217,-0.00116,-0.001605,-0.000678,-0.000274,0.002489,-0.000338,3.9e-05,-0.001252,-0.000593,0.000522,-0.000509,0.000274,0.000775,-0.000315,-0.000295,0.000368,0.000514,-0.000359,0.000291,-0.000445,-0.000177,-8.3e-05,-0.000329,-0.000139,-6.7e-05,-0.000154,2e-05,-7.9e-05,-0.000121,1.2e-05,-0.000152,-0.000524,0.000266,0.000204,6e-05,-9.6e-05,-0.000242,9.9e-05,-0.000121,3e-04,-6e-06,0.000312,-0.000113,1.5e-05,-5.5e-05,-0.000187,-5.1e-05,9e-06,-2.1e-05,7e-06,-4e-05,-0.000115,-0.00013,-0.000154,-8e-05,-3e-05,-0.000103,-0.000172,3.2e-05,-1.8e-05,0.000161,0.000201,-0.000166,-1.5e-05,-3.8e-05,2.1e-05,4.6e-05,-8e-06,2.4e-05
4e-06,1.1e-05,-3.2e-05,-9e-06,-2.5e-05,1e-05,-1.5e-05,-3.2e-05,1e-06,-1e-05,-5.1e-05,2e-05,1.3e-05,-1.2e-05,-2.8e-05,4.6e-05,1.2e-05,-1.7e-05,2.8e-05,-0.000886,0.001415,-0.000694,0.000311,0.001419,0.000827,0.000328,-0.000551,0.001617,-0.004609,-0.002173,0.000781,-0.001345,0.000739,-0.000488,0.000829,0.00191,0.000486,-0.003791,-0.001346,-0.000403,0.000862,-0.001106,-0.002906,-0.000272,0.001327,-0.004127,-0.00074,-0.00066,0.000638,0.000112,0.000156,0.000121,2.3e-05,0.000429,0.000153,0.001195,-0.000139,0.000476,-5.8e-05,0.001108,0.001449,-2.5e-05,0.000291,0.000318,-0.000604,2.8e-05,-0.000283,-0.000256,-0.000732,-0.000835,-7.8e-05,-2e-04,0.000212,-0.000148,-1e-05,0.000157,0.000238,-9e-05,0.000118,-0.000132,-6e-06,1.1e-05,-5.7e-05,-4e-06,6.5e-05,-3.6e-05,1.6e-05,0.000108,-6.6e-05,0.000456,-0.000133,-0.000696,-0.000626,-0.000393,-0.000374,-0.000219,-0.000209,0.000117,8.1e-05,-6e-05,6.4e-05,-5e-06,4.3e-05,5e-06,6.8e-05,6.9e-05,4.9e-05,-7.2e-05,-3.8e-05,2.1e-05,2.2e-05,-1e-04,-0.000122,-0.000152,-0.000143,-5.2e-05,-6.1e-05,1e-06,1.1e-05,-1.5e-05,-2e-06
-2e-06,3.7e-05,0,-2.4e-05,-2.9e-05,1.5e-05,-3e-06,-1.1e-05,-1.1e-05,-7e-06,2.7e-05,-2.2e-05,-3e-06,2.8e-05,-9e-06,2.5e-05,1e-05,1.6e-05,0.000128,0.000474,-0.002528,-0.000401,-0.002342,-7.4e-05,-8.5e-05,-9.3e-05,-0.00017,-0.002014,0.002748,0.000479,0.000738,0.001243,0.000593,0.000528,0.000504,0.000379,0.001667,0.001486,0.000575,0.000619,0.001009,-0.000741,0.00312,0.000205,-0.000222,0.000682,-0.000571,-3.6e-05,-0.001004,-0.000464,-0.000824,-0.000726,-0.000601,-0.000111,-0.000734,-0.000183,-0.002133,-0.001612,-0.000302,-0.000363,-0.000701,-0.00051,-0.000398,-0.000235,-0.000311,-0.000126,-0.000669,-0.000115,-9e-05,0.000381,1.7e-05,0.000303,0.000144,4.1e-05,-0.000145,-8.1e-05,-0.000152,1.2e-05,-3.6e-05,0.000183,1.8e-05,0.000106,-9.3e-05,0.00018,7.6e-05,3.9e-05,0.000193,3.4e-05,-0.000222,0.000406,5.7e-05,0.00014,-0.000146,-0.00021,-0.000187,0.000155,-0.000112,-6.3e-05,3.2e-05,1.5e-05,-1.6e-05,-1e-05,-3.9e-05,2.1e-05,1.4e-05,2e-05,-9.4e-05,-6.5e-05,-1.1e-05,-8e-06,-6e-06,-1.2e-05,-6e-06,0.000135,-2.7e-05,-5.7e-05,7e-06,0,6e-06,-7e-06,2.6e-05
-3.9e-05,-5e-06,6e-06,2e-06,1e-05,1e-06,1.4e-05,-1.9e-05,-1e-05,-2e-06,-1.1e-05,-5e-06,-1.3e-05,-3.1e-05,-6e-06,-3.6e-05,-2.8e-05,3.5e-05,-9.9e-05,-0.000705,0.000903,-5.8e-05,0.000385,-0.000271,0.00067,-0.000181,-0.000214,0.000741,-0.001146,0.001136,-0.000689,-0.000581,0.000511,0.000272,-0.001003,-0.001877,-4.4e-05,0.000228,-0.000757,0.000162,-0.000159,0.000346,-0.002032,4.9e-05,-0.000729,0.000217,6.1e-05,-5.6e-05,0.001701,0.000536,0.000994,4.6e-05,-2.6e-05,0.001043,0.000623,-1.3e-05,0.001159,8e-04,-0.000548,0.000123,0.000327,0.000482,-0.000346,-0.000145,0.000275,0.000195,-0.000298,6e-06,8.2e-05,0.000328,-0.000251,5.9e-05,2.4e-05,-0.000115,6.7e-05,-0.000124,2.5e-05,-0.000154,-5.8e-05,-3.7e-05,-0.000102,-1e-04,-4.9e-05,2e-05,-0.000303,7e-05,5.4e-05,-0.000162,0.000152,-0.000297,-0.000445,-4.1e-05,-4.5e-05,-2.3e-05,-0.000161,-6.6e-05,-0.000164,-5.2e-05,1e-05,-9.5e-05,-4.1e-05,-2.4e-05,3.1e-05,-1.6e-05,1.1e-05,-1.6e-05,-2e-06,3.4e-05,6e-06,2.9e-05,2.3e-05,6.5e-05,-1e-05,5e-06,-1.8e-05,-6.4e-05,-6.1e-05,1e-05,-3.3e-05,-1.4e-05,-9e-06
-2.7e-05,0,-3.7e-05,-1.7e-05,8e-06,-1.2e-05,-2e-06,-1.3e-05,1.1e-05,1.1e-05,2.1e-05,-4e-06,6e-06,-3.1e-05,-3.3e-05,-6e-06,9e-06,1.1e-05,3.5e-05,0.000438,-0.000531,0.000104,0.001688,0.000216,4.6e-05,-4e-06,0.000276,-0.000732,-0.000803,-0.000853,0.001683,0.000746,-0.000252,-0.000565,-0.000602,-0.001449,-0.000869,-0.00052,0.000737,4.7e-05,0.00011,0.00038,0.000586,-0.001148,0.00017,-0.000993,-0.000138,-0.000334,-0.000495,0.000115,0.000563,0.00025,-0.000231,-0.000516,-0.000176,6.3e-05,0.000987,-0.000173,0.000928,0.000258,0.000143,-0.000262,5.8e-05,-0.000452,-0.000286,0.000217,0.000691,2.2e-05,6e-06,-0.000106,0.000171,4.7e-05,-0.000137,-5.1e-05,4.5e-05,3e-05,-2.1e-05,2.3e-05,9.1e-05,-2.6e-05,0.000114,9.3e-05,4e-06,-6.1e-05,8e-06,-5.7e-05,-0.000204,-8.9e-05,6.5e-05,-3.4e-05,0.000263,1.6e-05,0.00016,-0.000209,-7.3e-05,-4.6e-05,8e-06,9e-06,3.5e-05,-1.3e-05,5e-05,5.1e-05,-2.4e-05,1.6e-05,-2e-05,-2.8e-05,-2e-06,1.8e-05,1.4e-05,-1e-05,-3.2e-05,1.2e-05,1.3e-05,-4.4e-05,9.3e-05,-1.1e-05,-2e-06,0,-1.9e-05,6e-06,3e-06
1.5e-05,-1.2e-05,1.6e-05,5e-06,-8e-06,-7e-06,9e-06,1.5e-05,-1.3e-05,-3e-06,-9e-06,-7e-06,7e-06,5e-06,1e-06,1.9e-05,4e-06,8e-06,-8e-05,-0.000207,0.000608,8.4e-05,-6.7e-05,-0.000905,0.000212,-0.000135,-0.000175,0.000774,0.000688,-0.000182,-0.000776,0.000292,4e-05,-0.000645,0.001049,0.000788,0.000825,0.000794,0.000629,-3.6e-05,0.000442,-0.000306,-0.001314,-0.00067,1.6e-05,-1.3e-05,-0.001489,-0.000151,-9.1e-05,-0.000752,-0.000349,2.1e-05,0.000187,0.000407,0.000782,-0.000168,-0.000374,-0.000305,-0.000714,-0.000378,-0.000296,-7.8e-05,-0.000158,6.6e-05,0.000131,-0.000118,-8.5e-05,4.7e-05,2.4e-05,0.000364,-8e-06,-0.000357,-0.000167,5.9e-05,4.9e-05,9.9e-05,-1e-06,-3.9e-05,-1.7e-05,-5e-05,2e-05,-0.000102,1.9e-05,-1e-05,5.1e-05,4.3e-05,7.7e-05,-6.3e-05,-9e-06,-3.7e-05,0.000288,-0.000242,-8.9e-05,-4.7e-05,-7.1e-05,-2.7e-05,0.000166,-5.1e-05,1e-06,5e-06,-1.7e-05,2.3e-05,1.6e-05,-2.5e-05,0,-8e-06,2.5e-05,5e-06,2.1e-05,2.4e-05,-2.7e-05,-5.6e-05,1.1e-05,4e-06,0.000102,-2e-06,3.1e-05,-1e-06,-1.9e-05,6e-06,-7e-06
4e-06,-7e-06,1e-06,0,-8e-06,1e-06,-1.3e-05,0,1e-05,4e-06,4e-06,5e-06,-1.4e-05,8e-06,1.5e-05,-9e-06,2e-06,4e-06,3.4e-05,9e-06,-0.000764,-0.000274,-0.000722,-0.000578,7.7e-05,0.000184,-8.3e-05,1.5e-05,-0.001186,0.000258,-0.000623,-1e-04,0.000166,0.000324,0.000112,0.000144,-0.000358,-0.00097,0.000458,0.00025,-0.000443,8.4e-05,0.000649,0.000525,0.000108,-0.000454,0.000659,0.00032,-0.000121,6.8e-05,9e-06,-0.000117,0.000176,-0.000237,5.2e-05,-0.000392,-0.000333,0.000516,0.000112,2.5e-05,8.8e-05,-1.4e-05,-3.6e-05,0.000306,-6.6e-05,-4.2e-05,0.000264,0.000113,4.9e-05,-2e-06,-0.000333,-8.9e-05,-1e-06,-2e-05,-1.2e-05,7e-06,1.8e-05,2.6e-05,-4.1e-05,2.7e-05,2e-05,4.8e-05,-1.3e-05,-7e-05,8.2e-05,-2.7e-05,3e-06,2.1e-05,3.2e-05,1.6e-05,3.1e-05,0.000209,1.6e-05,-0.000188,-4.2e-05,-3.7e-05,-2.7e-05,5.3e-05,-1.3e-05,2e-06,-1.4e-05,3.2e-05,-2e-05,-2.7e-05,0,-7e-06,7e-06,9e-06,-4e-06,-2.5e-05,3e-06,-6e-06,1.5e-05,-2.7e-05,-3e-05,2e-05,5e-06,3e-06,-3e-06,5e-06,-8e-06
-1.2e-05,-2e-06,2e-06,4e-06,-5e-06,1e-06,7e-06,5e-06,-5e-06,-7e-06,-3e-06,-4e-06,6e-06,-4e-06,-5e-06,1e-06,7e-06,-5e-06,6e-06,1.5e-05,0.000782,-0.000344,1.7e-05,-0.000384,-5.8e-05,-0.000314,-0.000191,-8.6e-05,0.001307,-0.000109,-0.00093,-8e-05,-0.000185,-0.000768,-0.000793,0.000146,0.000532,0.000326,-0.000815,-0.000205,-0.000108,9.9e-05,-4.5e-05,-4.3e-05,-2.8e-05,0.000336,-0.000754,-5.1e-05,0.000759,0.000814,-0.000279,-0.000217,-3.5e-05,-0.000544,0.000593,-0.000336,8.8e-05,-0.000226,-0.000116,-0.000195,-6e-06,8.2e-05,4.7e-05,-0.000209,0.000162,-2.8e-05,-3.2e-05,-3.4e-05,-0.000113,0.00015,0.000182,0.000287,4.1e-05,6e-05,-6.7e-05,-4.2e-05,-2e-05,8e-06,-9.9e-05,-1.8e-05,-3.4e-05,4e-06,4e-05,7e-05,4.3e-05,1.3e-05,8.2e-05,4e-05,3.8e-05,-3.9e-05,-0.000204,1.9e-05,9e-06,-8e-06,-1.7e-05,-4.2e-05,-0.000105,-4.8e-05,-1e-05,1e-05,-1.4e-05,-4e-06,1e-05,2.9e-05,-5e-06,2.7e-05,-3.2e-05,-2e-06,4e-06,-9e-06,-6e-06,2.6e-05,-2e-06,-1e-06,-5.1e-05,2.1e-05,-7e-06,-5e-06,-2e-06,-5e-06,-1.1e-05
3e-06,-6e-06,0,1e-06,0,1e-06,-1.1e-05,1.3e-05,2e-06,-1e-06,-3e-06,3e-06,-5e-06,-1e-06,6e-06,-1e-05,2e-06,0,-3.6e-05,7e-06,-0.000693,0.000324,0.000122,-0.000267,0.000105,0.000129,-2.4e-05,0.00013,-0.000328,0.000426,0.000158,4.6e-05,-0.000156,6.3e-05,0.000409,-0.000245,0.000351,-0.000526,0.000698,-0.000207,-9.6e-05,-3.9e-05,0.000166,0.000266,-0.000222,-6.7e-05,0.000733,-0.000121,-0.000851,-0.000355,-4.7e-05,0.00023,-0.000181,-3e-05,-9.7e-05,2.1e-05,-9.9e-05,9.3e-05,0.000195,1.6e-05,0,-6.8e-05,-1.7e-05,7.2e-05,5e-06,0.000125,-0.000125,3.9e-05,0.000111,-0.000159,-8.7e-05,-2.8e-05,6.4e-05,-3.4e-05,1.8e-05,-3.6e-05,-1.1e-05,2e-06,-1e-06,-5e-06,1.5e-05,3.3e-05,2.3e-05,1.2e-05,-4.8e-05,-6e-06,2.4e-05,-3.4e-05,-2.1e-05,-4.9e-05,-8.4e-05,-6.3e-05,-6.7e-05,-3.1e-05,-1.9e-05,2.3e-05,-9.3e-05,1.1e-05,-1e-05,6e-06,1.2e-05,1.2e-05,-7e-06,1.3e-05,1e-06,-1.2e-05,-7e-06,0,2e-06,2.2e-05,-1.1e-05,6e-06,-1.5e-05,-1e-06,4.5e-05,2.2e-05,-6e-06,-4e-06,-8e-06,2e-06,9e-06
8e-06,4e-06,3e-06,3e-06,2e-06,0,3e-06,1e-06,5e-06,1e-06,-5e-06,2e-06,0,-2e-06,9e-06,1e-05,2e-06,0,2.1e-05,0.000162,0.000518,-7e-05,-3.1e-05,0.000193,-8.4e-05,-7e-05,-4.9e-05,-0.000897,-0.000752,-0.000295,-0.000441,-0.000275,0.000116,-0.000277,0.00015,0.000492,0.000108,0.00068,1e-06,0.000389,-0.000262,4.6e-05,-2.3e-05,0.000287,0.000342,0.000331,-0.000219,-0.000177,8.5e-05,-0.000203,0.000361,1.8e-05,4e-06,0.000222,-0.000154,0.000371,0.000522,7.5e-05,-0.000279,6.4e-05,-7.4e-05,5.7e-05,0.000105,0.000122,-0.000179,1e-06,2.1e-05,2e-05,-0.000165,8e-06,-4.5e-05,-0.000106,5.1e-05,6.8e-05,-2.4e-05,-1.2e-05,-2.7e-05,3e-05,-9e-06,-2.6e-05,5e-06,-2.2e-05,-7e-06,-2e-05,7e-06,2.4e-05,-4.8e-05,-2.6e-05,-3.7e-05,8.3e-05,5.2e-05,-9e-06,1.8e-05,2.2e-05,-5e-05,-1.6e-05,-1.7e-05,-5e-06,1e-06,6e-06,3e-06,-7e-06,1e-06,-6e-06,-5e-06,-1.2e-05,1.4e-05,-1e-06,-8e-06,-9e-06,6e-06,-1.8e-05,2.6e-05,-1.6e-05,-4.9e-05,3e-06,-1.1e-05,2e-06,-4e-06,-4e-06,1e-06
5e-06,4e-06,-7e-06,-4e-06,-1e-06,3e-06,-2e-06,3e-06,-5e-06,2e-06,-2e-06,-2e-06,5e-06,3e-06,-2e-06,-3e-06,-1e-06,2e-06,-6e-06,-0.000167,-0.000271,-6e-06,-0.000125,0.000111,-6.3e-05,0.000103,-1.8e-05,0.000122,0.000789,-0.000389,1.4e-05,0.00018,7.9e-05,0.000401,-0.000474,-0.000163,0.000217,-0.000608,0.000225,-4.3e-05,8.8e-05,-8.6e-05,-0.000104,4.4e-05,-7.1e-05,3.4e-05,0.000474,-0.000157,0,0.000108,-6.3e-05,2.1e-05,-7.3e-05,0.000364,9e-05,-0.000193,0.000138,8.7e-05,0.000175,-0.000209,3.7e-05,-3.9e-05,-0.000106,-0.000153,9.5e-05,4e-06,3.9e-05,2e-06,0.000112,-0.000125,9e-05,-2e-05,5e-06,-1e-06,1.5e-05,9e-06,2e-05,-1.4e-05,2.1e-05,1.7e-05,1.9e-05,-3e-06,1.7e-05,-4.3e-05,-2.3e-05,5e-06,2.2e-05,2.9e-05,-2.8e-05,6.1e-05,5.3e-05,-2.9e-05,-0.000104,6e-05,-3.2e-05,4.4e-05,-5.7e-05,-1.7e-05,4e-06,-9e-06,-5e-06,-1e-06,-3e-06,-7e-06,-1e-06,1e-05,-3e-06,-6e-06,-4e-06,-3e-06,2e-06,0,-4e-06,8e-06,-3.1e-05,-3.7e-05,-5e-06,0,-9e-06,0,4e-06
2e-06,4e-06,3e-06,3e-06,0,0,-2e-06,1e-06,5e-06,0,3e-06,1e-06,-5e-06,-4e-06,-1e-06,-4e-06,4e-06,2e-06,4e-06,0.000116,-9.3e-05,-6.3e-05,3.6e-05,0.000107,1e-05,-7.2e-05,-3.9e-05,-0.000313,-0.00013,0.000471,0.000223,-8.5e-05,0.000194,-0.00023,0.000165,-0.000356,6.5e-05,0.000387,-0.000659,-8.8e-05,0.000248,-0.000116,2.1e-05,-0.000241,-9.8e-05,0.000159,7.6e-05,0.000107,0.000231,0.000163,-4.9e-05,1.4e-05,-9e-06,6e-05,-5.7e-05,-6e-06,-0.000397,2.2e-05,-8.6e-05,0.000217,-3.3e-05,2e-05,3.3e-05,-4.2e-05,2.7e-05,-7.6e-05,6e-05,3.2e-05,-3.3e-05,-3e-06,-2.8e-05,-1.8e-05,-8.1e-05,-1.4e-05,0,-1.2e-05,-1e-06,6e-06,-2.7e-05,-1.2e-05,4e-06,-2e-06,-6e-06,3e-06,5e-06,-2.4e-05,-1.6e-05,1.6e-05,-1.6e-05,-1e-06,-1.8e-05,7.6e-05,5e-06,6.6e-05,-3.4e-05,-1.1e-05,-5e-06,1.8e-05,1e-05,4e-06,9e-06,-1.1e-05,1e-06,4e-06,0,7e-06,6e-06,1e-06,0,1e-06,-7e-06,1e-05,0,-9e-06,3e-06,-1.4e-05,-8e-06,1e-06,-5e-06,-1e-06,1e-06
0,-4e-06,-5e-06,-1e-06,-5e-06,-2e-06,2e-06,-3e-06,-4e-06,0,-5e-06,-1e-06,4e-06,-2e-06,1e-06,1e-05,4e-06,1e-06,1e-06,-0.000159,3.7e-05,1.9e-05,-0.000336,0.000116,-0.000123,-3.5e-05,-3.9e-05,0.000419,-8.8e-05,0.000139,0.000563,2.5e-05,-4.6e-05,0.000278,0.000109,-0.000494,0.000261,-0.000269,0.000627,-1.8e-05,0.000111,-5.7e-05,-0.000234,-0.000217,5.8e-05,-0.000234,-0.000153,0.000246,-0.000329,9.4e-05,-0.000334,-4.8e-05,6.3e-05,-0.000125,-1.2e-05,1e-06,0.000221,-8.1e-05,9.9e-05,-1.1e-05,4e-06,-2e-06,-3.1e-05,0.000116,-4e-06,5e-05,-2.9e-05,-1.5e-05,4e-05,-3e-05,2.5e-05,8.7e-05,-5.9e-05,-3.1e-05,2e-06,-2.3e-05,9e-06,-1e-06,3.7e-05,-2e-06,-9e-06,-2e-06,-8e-06,4.7e-05,1.4e-05,2.7e-05,-2.5e-05,-3e-06,-6e-06,-6.3e-05,-1.4e-05,-5.7e-05,-2.5e-05,2.2e-05,-3.4e-05,-2e-05,1.2e-05,-1.7e-05,5e-06,-1.3e-05,-2e-06,8e-06,3e-06,3e-06,-3e-06,-4e-06,1e-06,-1e-06,-1e-06,3e-06,5e-06,-4e-06,-1.9e-05,9e-06,2.2e-05,-4e-06,-2e-06,-1e-06,-1e-06,0,3e-06
1e-06,1e-06,0,-1e-06,-3e-06,-3e-06,-3e-06,-2e-06,1e-06,-2e-06,3e-06,0,-1e-06,-2e-06,-5e-06,-1.1e-05,1e-06,0,-6e-06,0.000112,5.1e-05,-0.000173,0.000211,-1.1e-05,-1.4e-05,3.9e-05,-2.5e-05,-0.000153,0.000218,-0.000182,-0.000613,0.000133,-5.6e-05,-0.000386,-1.1e-05,0.000243,4e-05,-0.000118,-0.000302,1.2e-05,-4.9e-05,-8e-06,0.000337,0.000108,-0.000172,0.000207,-9.9e-05,-3e-06,0.00026,-0.00032,0.000106,-3.7e-05,6e-06,-6e-05,3e-05,4.7e-05,8.4e-05,-0.000109,-6.6e-05,0.000118,-1.4e-05,-6e-06,4.2e-05,9e-06,-8.1e-05,-5e-05,-2.2e-05,2.5e-05,-5e-05,6e-06,7.2e-05,4.2e-05,-4e-05,-5.2e-05,7e-06,4e-06,-1.2e-05,-9e-06,1.6e-05,1e-05,1.3e-05,1e-06,-7e-06,-2.1e-05,1.6e-05,-2.1e-05,-2e-06,7e-06,1e-05,-3.5e-05,1.4e-05,-1.4e-05,2.1e-05,3e-05,-3.9e-05,1e-05,4e-06,6e-06,-2e-06,9e-06,1e-06,-5e-06,-3e-06,1e-06,2e-06,2e-06,-1e-05,-6e-06,2e-06,-1e-06,1e-06,-5e-06,1.5e-05,5e-06,-1.3e-05,1e-05,3e-06,2e-06,1e-06,0,-7e-06
1e-06,-4e-06,4e-06,1e-06,3e-06,0,4e-06,-3e-06,1e-06,1e-06,1e-06,0,-2e-06,3e-06,-2e-06,7e-06,2e-06,0,7e-06,-0.000125,-0.000117,7.8e-05,4.8e-05,0.000158,-1.9e-05,-1.6e-05,-2e-05,-0.000208,-0.000211,-9.3e-05,4.8e-05,-9.2e-05,-2.7e-05,0.000153,-8.8e-05,0.000468,0.000115,0.000476,0.000199,4.3e-05,-5.6e-05,-2.5e-05,-0.000476,0.00018,0.000105,-0.000234,-0.000359,-0.000108,-0.000249,0.000118,2.9e-05,5.3e-05,-1.1e-05,-0.000224,4.7e-05,7e-06,-0.000152,0.000124,-6e-05,2e-05,6.5e-05,1.4e-05,2.4e-05,2.2e-05,0.000101,3.1e-05,-4.9e-05,-2.3e-05,-2.1e-05,0.000103,-4.1e-05,-3.8e-05,-8e-06,2.4e-05,-4e-06,2.8e-05,2e-06,-1.1e-05,1.4e-05,-1.4e-05,-7e-06,-5e-06,3e-06,-1e-05,1.5e-05,7e-06,2e-05,-1e-06,9e-06,3.1e-05,6e-06,1.6e-05,-1.8e-05,4e-06,-3.6e-05,-9e-06,-3.7e-05,-7e-06,-3e-06,-8e-06,-6e-06,1e-06,2e-06,2e-06,2e-06,-1e-06,-8e-06,4e-06,-1e-06,0,-4e-06,4e-06,-4e-06,-4e-06,3e-05,5e-06,-1e-06,-2e-06,7e-06,0,-1e-06
0,-1e-06,-4e-06,0,0,2e-06,-5e-06,-1e-06,-3e-06,-1e-06,-1e-06,-1e-06,2e-06,0,-2e-06,0,3e-06,0,-4e-06,7.5e-05,-3.1e-05,-5e-06,6.4e-05,-1.5e-05,-4.1e-05,4e-05,-2.1e-05,-7.9e-05,0.000289,-9.4e-05,-0.000225,7.7e-05,1.8e-05,-0.00028,2.8e-05,3.3e-05,0.000128,-0.000395,-0.00018,-9.3e-05,-6.5e-05,6.9e-05,0.000307,7.5e-05,1e-05,0.000152,0.000109,-7.6e-05,0.000383,2.7e-05,4.2e-05,-1.5e-05,-4.2e-05,0.000116,7.8e-05,-0.000171,0.000103,-0.000169,2e-05,-0.000116,-8.2e-05,0,7e-06,2e-05,-3.6e-05,1.9e-05,-3.9e-05,2.6e-05,6e-05,-2.6e-05,3.4e-05,-4.4e-05,3.1e-05,2e-06,3e-06,-8e-06,-3e-06,-7e-06,-2.9e-05,3e-06,4e-06,6e-06,1e-06,-1e-05,3e-06,8e-06,5e-06,-3e-06,1.4e-05,1.4e-05,-4.9e-05,5.3e-05,-3e-06,-1.1e-05,-2.6e-05,-1.4e-05,-4.3e-05,-3e-06,-7e-06,1e-06,-5e-06,-4e-06,0,-5e-06,-3e-06,-6e-06,8e-06,2e-06,0,4e-06,3e-06,4e-06,-5e-06,-3e-06,-1.3e-05,5e-06,2e-06,0,4e-06,-2e-06,-1e-06
-4e-06,0,3e-06,-1e-06,-1e-06,1e-06,4e-06,-2e-06,3e-06,2e-06,1e-06,1e-06,-1e-06,-2e-06,-2e-06,1e-06,-1e-06,0,0,-3.9e-05,-8e-06,-7.2e-05,6.6e-05,0.000109,-2.8e-05,-5.3e-05,-1.2e-05,-0.000284,-0.000281,0.000188,-0.000239,-4.3e-05,-5.6e-05,0.000317,0.000105,-0.000335,2.6e-05,0.000155,0.000217,9.6e-05,-4.2e-05,0.000145,-3e-04,4.5e-05,-8e-05,-0.000264,-3.3e-05,-3.7e-05,-0.000259,-1.7e-05,0.000104,2e-06,-2e-06,1.2e-05,-0.000145,9.1e-05,0.000171,8e-05,6.1e-05,0.000178,5.5e-05,-1.5e-05,4.1e-05,-1.5e-05,-1.7e-05,-1e-06,7e-05,-1e-06,2.7e-05,1.7e-05,-8e-06,5e-06,2.2e-05,7e-06,-1e-05,-2.4e-05,3e-06,-4e-06,2e-06,-4e-06,1e-05,-8e-06,-8e-06,1.4e-05,-1.3e-05,5e-06,-1.4e-05,6e-06,1.1e-05,-8e-06,-1.1e-05,-8.9e-05,-6e-06,-1.6e-05,-1.8e-05,7e-06,-1.5e-05,7e-06,-3e-06,-1e-06,4e-06,3e-06,-1e-06,-6e-06,-1e-06,7e-06,7e-06,-2e-06,1e-06,-7e-06,2e-06,-7e-06,-6e-06,6e-06,7e-06,-5e-06,0,0,1e-06,1e-06,-1e-06
-3e-06,1e-06,-1e-06,0,-1e-06,0,-4e-06,1e-06,-3e-06,-1e-06,-2e-06,-1e-06,0,0,1e-06,-4e-06,1e-06,0,1e-06,8.7e-05,-0.000104,-2e-05,-0.000101,0,-1.4e-05,1.8e-05,-1.7e-05,0.000265,1.8e-05,0.000124,-0.000206,-2.8e-05,4.4e-05,-0.000183,-0.000157,-0.000205,0.000125,-3.7e-05,-8.5e-05,3.7e-05,-3.3e-05,1e-05,0.000277,-1.6e-05,4.3e-05,9.2e-05,0.00011,0.000105,2.3e-05,-9.8e-05,-0.000206,-3.9e-05,-3e-05,0.000129,0.00017,9.1e-05,-0.000244,-6.8e-05,-7e-06,-0.000148,-2.4e-05,7e-06,-4e-06,-1.7e-05,-1.3e-05,-5.1e-05,2.8e-05,1e-05,-2.6e-05,1e-06,-8e-06,4.7e-05,-3e-06,-7e-06,0,-2e-06,3e-06,0,-7e-06,2e-06,-4e-06,2e-06,3e-06,0,-9e-06,9e-06,-1.3e-05,0,1e-06,0,4.3e-05,5.5e-05,-1.7e-05,-3e-05,-2.9e-05,6e-06,-2e-06,-8e-06,-1e-06,-2e-06,1e-06,-4e-06,1e-06,7e-06,-2e-06,2e-06,-2e-06,5e-06,0,2e-06,-2e-06,-2e-06,5e-06,-1.1e-05,4e-06,-6e-06,-4e-06,1e-06,0,-1e-06,2e-06
1e-06,0,-1e-06,1e-06,-1e-06,0,1e-06,1e-06,1e-06,0,-1e-06,0,2e-06,0,0,2e-06,2e-06,0,-2e-06,-4.6e-05,4.4e-05,3.5e-05,-0.000213,5e-05,-2e-06,-5e-06,-1.4e-05,-9.2e-05,0.000219,-0.000237,-3e-05,3.1e-05,-2.9e-05,0.000266,7e-06,0.00028,6.2e-05,4e-05,1e-04,-0.000114,3.1e-05,-7e-05,-0.000146,-0.000125,-4e-05,-0.000116,-3.7e-05,7.8e-05,0.000166,0.000104,2.3e-05,3.6e-05,-8e-06,-3e-05,-0.000141,-7.2e-05,-2.8e-05,7.4e-05,-8.8e-05,1.6e-05,0,0,-1.1e-05,-2.6e-05,1.7e-05,8e-06,0,5e-06,-7e-06,2.1e-05,3.8e-05,1.3e-05,-2e-06,8e-06,-6e-06,1.1e-05,-9e-06,-4e-06,5e-06,-4e-06,2e-06,-1e-05,4e-06,-2e-06,4e-06,-1.4e-05,-1.6e-05,-1.3e-05,-5e-06,1e-05,2.6e-05,-2.1e-05,8e-06,-2.1e-05,-2.1e-05,1e-06,1e-06,3e-06,3e-06,-2e-06,0,4e-06,-1e-06,2e-06,3e-06,-8e-06,-5e-06,-1e-06,-1e-06,4e-06,1e-06,5e-06,5e-06,1.1e-05,-1.4e-05,-5e-06,1e-06,0,-3e-06,0,4e-06
0,1e-06,1e-06,0,1e-06,0,-1e-06,1e-06,0,-1e-06,-1e-06,0,-1e-06,1e-06,1e-06,0,1e-06,0,1e-06,3e-06,-5e-05,-3e-05,0.000119,-3.6e-05,-1.9e-05,2e-05,-1.2e-05,0.000244,-0.000249,-1.6e-05,6.7e-05,5e-06,2.8e-05,-0.000259,0.000198,-9.2e-05,-2.5e-05,-5e-06,-0.00013,4.9e-05,2.3e-05,-1.1e-05,8.9e-05,-0.000155,2.4e-05,-3.3e-05,-0.000123,-4.3e-05,1.3e-05,-5.4e-05,7e-05,-1.6e-05,3e-05,-7e-05,5e-06,-5.5e-05,1e-04,-4.2e-05,8.1e-05,-2e-05,-1.4e-05,-3e-06,-1.5e-05,0,4e-05,3.6e-05,4e-06,3e-06,1e-05,-1.7e-05,-4.9e-05,-3.9e-05,-2.2e-05,1.1e-05,3e-06,-3e-06,9e-06,1e-05,-1.6e-05,3e-06,-1e-06,8e-06,-1e-06,1e-06,1.1e-05,1.8e-05,8e-06,-4e-06,-6e-06,1.1e-05,-2e-05,1e-05,-3.3e-05,-2.3e-05,-1.9e-05,7e-06,-2.9e-05,-3e-06,4e-06,2e-06,0,-3e-06,1e-06,-4e-06,0,2e-06,-2e-06,-1e-06,1e-06,-4e-06,0,2e-06,-3e-06,-1.2e-05,-1.5e-05,4e-06,-2e-06,0,2e-06,0,-1e-06
-3e-06,0,0,0,0,-1e-06,-1e-06,2e-06,-1e-06,1e-06,0,0,0,-1e-06,4e-06,1e-06,1e-06,0,-1e-06,-2.2e-05,-5e-05,-4e-05,0.000141,-3.5e-05,2.7e-05,-1.4e-05,-1e-05,-0.000142,0.00015,0.000125,0.000207,-2.6e-05,4.6e-05,0.000194,-8.9e-05,-9.2e-05,7e-06,4.3e-05,5e-06,-2e-05,3.1e-05,3e-06,-0.000118,-1e-06,2.4e-05,0.000193,-2.5e-05,-8.7e-05,-0.000293,-2.4e-05,5.2e-05,1.2e-05,1.3e-05,7.2e-05,-5.3e-05,-4.8e-05,-6.5e-05,5.9e-05,-3.6e-05,-7.6e-05,2.6e-05,2e-06,-2.3e-05,5.7e-05,-6.8e-05,1e-06,-2.2e-05,-3e-06,-7e-06,-4.6e-05,-5e-06,-1.2e-05,-1.6e-05,-2e-06,3e-06,-1.8e-05,-7e-06,-3e-06,8e-06,-7e-06,-5e-06,0,3e-06,-1.1e-05,8e-06,-1.2e-05,-1e-05,7e-06,-5e-06,-1.3e-05,-3.3e-05,-1e-05,1.4e-05,-1.6e-05,-1.6e-05,-1.1e-05,-2.2e-05,-1e-06,2e-06,-1e-06,3e-06,-1e-06,0,2e-06,-1e-06,4e-06,-1e-06,2e-06,-2e-06,1e-06,-2e-06,-5e-06,0,1e-06,1.4e-05,2e-06,-3e-06,0,0,-1e-06,-1e-06
0,-2e-06,-2e-06,0,0,0,1e-06,1e-06,2e-06,0,-2e-06,0,1e-06,0,0,-3e-06,1e-06,0,0,-1.5e-05,5.7e-05,2e-05,-4.2e-05,-0.000113,1.4e-05,-6e-06,-7e-06,-6.9e-05,-7.9e-05,-5e-06,-8.7e-05,1.2e-05,-5.6e-05,-0.000251,-4.2e-05,-5.3e-05,3.6e-05,-0.000105,5.4e-05,7.1e-05,3.4e-05,1.7e-05,6e-06,9e-05,-6.6e-05,-0.000141,-1.5e-05,-2e-06,0.000277,-5.7e-05,8.6e-05,-3e-06,-2.1e-05,-6.8e-05,-8e-06,9.9e-05,8.3e-05,-1.6e-05,-1.4e-05,9.6e-05,-1.1e-05,1e-06,2.3e-05,-2.3e-05,2.7e-05,-2.4e-05,-7e-06,9e-06,2.9e-05,9e-06,1.9e-05,1e-06,1e-05,-2e-06,1e-06,-1e-05,-1e-06,0,7e-06,5e-06,8e-06,0,-2e-06,7e-06,2e-06,7e-06,4e-06,-1e-06,-5e-06,-1.8e-05,6e-06,1.4e-05,-2.4e-05,0,-2e-05,4e-06,-1.6e-05,1e-06,1e-06,-1e-06,-1e-06,-6e-06,1e-06,-1e-06,-2e-06,-2e-06,4e-06,-3e-06,-1e-06,-1e-06,1e-06,-1e-06,0,3e-06,-3e-06,4e-06,-1e-06,0,-1e-06,0,0
2e-06,0,2e-06,0,0,0,-3e-06,1e-06,-2e-06,1e-06,2e-06,0,-2e-06,0,1e-06,0,1e-06,0,0,1e-06,-4.8e-05,-2.4e-05,-0.00017,-2.9e-05,-1.4e-05,0,-7e-06,1e-06,-2e-06,1.9e-05,-1.7e-05,0,9e-06,0.000192,0.00011,0.000161,1.5e-05,0.000123,-1.7e-05,-5e-05,-2.3e-05,1e-06,-1.4e-05,3e-05,3.5e-05,0.000192,9.5e-05,3e-05,-0.000149,0.000164,-0.000106,6e-06,-3e-06,6.9e-05,-6.7e-05,-1e-05,-4.4e-05,7.1e-05,-4e-06,-0.000103,3e-06,-5e-06,-1.4e-05,-2.4e-05,2.8e-05,1.3e-05,2e-06,-6e-06,-2.1e-05,-7e-06,-3.4e-05,2e-05,1.7e-05,-1.1e-05,3e-06,7e-06,3e-06,3e-06,5e-06,0,-1e-06,-4e-06,0,8e-06,-3e-06,3e-06,1e-05,-5e-06,-2e-06,5e-06,2.9e-05,-1e-05,1.3e-05,3e-06,-2e-05,-7e-06,-4e-06,-1e-06,-2e-06,2e-06,-4e-06,2e-06,0,-1e-06,0,0,3e-06,-1e-06,0,4e-06,0,4e-06,7e-06,-3e-06,-8e-06,-5e-06,1e-06,0,-1e-06,0,-2e-06
1e-06,-1e-06,-1e-06,1e-06,-1e-06,1e-06,2e-06,0,2e-06,0,-1e-06,0,1e-06,0,2e-06,3e-06,0,0,-1e-06,-1.6e-05,-1.3e-05,-4.1e-05,1e-04,-6.7e-05,3e-05,1.3e-05,-8e-06,-2.5e-05,0.000117,-7.4e-05,-4.3e-05,3.5e-05,-4e-05,-0.000169,-7e-05,0.000105,2.4e-05,-3.2e-05,-5e-05,1e-06,-5.3e-05,-2.3e-05,1.4e-05,4e-06,4e-06,-0.000159,4.9e-05,4.4e-05,7.6e-05,-0.000121,-1.5e-05,-1.2e-05,-1.1e-05,-4e-05,4.3e-05,-9e-05,-0.000124,-9.2e-05,4.3e-05,0.000123,3e-06,5e-06,6e-06,2.5e-05,-2.2e-05,-1.5e-05,1.7e-05,1.1e-05,2.5e-05,2e-05,1e-05,1.3e-05,1.8e-05,8e-06,-3e-06,6e-06,-3e-06,0,-1.1e-05,-2e-06,1e-06,6e-06,1e-06,-2e-06,-1e-06,0,-9e-06,2e-06,3e-06,1.2e-05,4e-06,4e-06,-1.5e-05,8e-06,-2e-05,0,-1.5e-05,0,-2e-06,-3e-06,1e-06,-2e-06,1e-06,5e-06,1e-06,1e-06,-3e-06,2e-06,0,-3e-06,-1e-06,-1e-06,-3e-06,1e-06,1.3e-05,-3e-06,1e-06,0,-4e-06,0,0
0,0,-1e-06,-1e-06,0,0,-4e-06,0,0,0,0,0,0,0,-2e-06,-5e-06,0,0,1e-06,3.6e-05,-1e-05,1.3e-05,-2.1e-05,2.4e-05,9e-06,-9e-06,-7e-06,0.000245,-0.000228,-5.7e-05,-2.2e-05,-2.8e-05,1.2e-05,0.000204,-6.6e-05,-0.000174,-4.8e-05,-5.8e-05,-7e-05,4.5e-05,-1.7e-05,-1e-05,2.2e-05,1.3e-05,-3.4e-05,0.000137,-2.5e-05,-1e-06,-0.000125,3e-06,-1.4e-05,6e-06,-8e-06,-2.2e-05,1.2e-05,6.2e-05,4.1e-05,9e-05,-3.6e-05,-5.2e-05,-1e-06,-3e-06,2e-06,-2.2e-05,-5e-06,-4e-06,3e-06,-5e-06,-1.5e-05,-1.4e-05,-1e-06,-2.1e-05,3e-06,-6e-06,-2e-06,-9e-06,4e-06,0,-4e-06,-1e-06,-2e-06,-4e-06,-1e-06,-9e-06,-4e-06,9e-06,1e-06,3e-06,4e-06,3e-06,-2e-05,-1.8e-05,1.2e-05,1.5e-05,-1.5e-05,2e-06,-2e-06,-2e-06,-2e-06,2e-06,0,0,0,1e-06,1e-06,-3e-06,-2e-06,-2e-06,0,2e-06,1e-06,-3e-06,-1e-06,1e-06,1e-06,-4e-06,-1e-06,0,-2e-06,0,1e-06
0,0,2e-06,0,0,0,3e-06,-1e-06,-1e-06,-1e-06,0,0,-1e-06,-1e-06,-1e-06,4e-06,1e-06,0,0,-9e-06,-6e-06,2e-05,6.3e-05,-1.2e-05,2e-06,-2e-06,-6e-06,-8.1e-05,0.000204,9.9e-05,-0.000153,-1e-06,-2.3e-05,-0.000185,8.3e-05,-0.000167,-8e-06,2.1e-05,0.000143,-5.1e-05,1.6e-05,8e-06,-6.6e-05,-4.7e-05,3.6e-05,-6e-05,9e-06,-5.4e-05,0.000104,-3.6e-05,4.6e-05,9e-06,5e-06,3e-06,1.3e-05,3.5e-05,9.2e-05,-0.000102,2.2e-05,-3.6e-05,-5e-06,0,-1.4e-05,-1.7e-05,-2e-06,2.1e-05,-8e-06,1e-06,-1.7e-05,2.8e-05,-1.7e-05,-1.3e-05,-2.1e-05,-3e-06,-1e-06,-1.2e-05,-2e-06,-4e-06,2e-06,-1e-06,-4e-06,0,0,2e-06,2e-06,-5e-06,-5e-06,-1e-06,4e-06,-4e-06,-4e-06,7e-06,-1e-05,1.3e-05,-1.9e-05,1e-06,-2e-06,1e-06,0,-2e-06,0,0,0,-4e-06,-1e-06,3e-06,0,1e-06,0,1e-06,-1e-06,1e-06,-2e-06,-4e-06,1e-06,1e-06,0,0,-3e-06,0,1e-06
1e-06,1e-06,-2e-06,0,0,0,-3e-06,-1e-06,1e-06,0,-1e-06,0,1e-06,0,0,-3e-06,0,0,0,2.2e-05,-2.4e-05,-3.2e-05,-3e-06,3e-05,1.8e-05,-4e-06,-5e-06,9.6e-05,-2.5e-05,2.9e-05,-0.000145,-9e-06,3.1e-05,0.000118,-4e-06,7.9e-05,-2.4e-05,3.3e-05,-7.6e-05,1.9e-05,1e-06,1e-05,5.9e-05,-7.7e-05,-5.1e-05,-9e-06,-9.9e-05,-2.9e-05,1.5e-05,0.000158,6.2e-05,-6e-06,1.5e-05,-3.6e-05,5e-06,-4e-06,-5.4e-05,6.3e-05,-1.9e-05,0.000113,-1e-06,3e-06,4e-06,4e-05,3.9e-05,2e-06,-8e-06,0,5e-06,-7e-06,3.1e-05,1e-06,-2.9e-05,-2e-06,-1e-06,6e-06,0,-1e-06,-1e-06,3e-06,3e-06,-1e-06,-1e-06,5e-06,4e-06,1.3e-05,4e-06,2e-06,1e-06,-2e-06,7e-06,1.8e-05,1e-06,1.2e-05,-1.8e-05,0,-1.8e-05,0,0,0,0,2e-06,0,-1e-06,-1e-06,1e-06,0,2e-06,0,-2e-06,-1e-06,2e-06,2e-06,3e-06,-2e-06,3e-06,1e-06,0,-2e-06,0,1e-06
1e-06,0,1e-06,0,0,0,1e-06,0,-2e-06,0,0,0,-1e-06,0,-2e-06,1e-06,0,0,0,-3.1e-05,6e-06,-1.3e-05,-6e-06,1.3e-05,4e-06,9e-06,-4e-06,-0.000174,-0.00012,-2.8e-05,8e-05,2.4e-05,-1.3e-05,-0.000204,-1e-05,0.000181,-5.4e-05,-2.7e-05,1.5e-05,3e-06,-1.3e-05,1e-05,-8.2e-05,-1.4e-05,1e-05,2.1e-05,1.4e-05,4.6e-05,1.9e-05,-0.000147,-9.9e-05,-6e-06,6e-06,9.6e-05,4.1e-05,-5.2e-05,5e-06,-6.9e-05,-1.4e-05,-9.9e-05,1.5e-05,-2e-06,-1.2e-05,2e-06,-3.6e-05,-1.6e-05,-8e-06,-4e-06,1.4e-05,-2e-06,-1e-05,7e-06,-2e-05,4e-06,2e-06,7e-06,0,-1e-06,-3e-06,-3e-06,2e-06,1e-06,0,3e-06,6e-06,-7e-06,0,1e-06,0,2e-06,2e-06,-2.5e-05,-3e-06,1e-05,-1.7e-05,4e-06,-2.7e-05,1e-06,2e-06,0,1e-06,-1e-06,0,2e-06,0,-2e-06,1e-06,-2e-06,0,1e-06,1e-06,-2e-06,-1e-06,0,0,2e-06,-1e-06,0,0,0,1e-06
0,0,0,0,-1e-06,0,-1e-06,-1e-06,2e-06,0,-1e-06,0,0,0,-1e-06,0,1e-06,0,0,1.1e-05,-1.6e-05,1.5e-05,-6.5e-05,4e-06,-1e-06,-2e-06,-4e-06,1.1e-05,0.000178,-3.3e-05,7.1e-05,-5e-06,2e-06,0.000153,3.4e-05,-6.9e-05,4e-06,9e-06,-9.3e-05,2.8e-05,1.1e-05,2.7e-05,6.7e-05,4.9e-05,3.6e-05,-8.9e-05,-4.7e-05,4e-05,-0.000143,4.6e-05,-1.5e-05,5e-06,-1.1e-05,-1.8e-05,-3.5e-05,-3.1e-05,-1.8e-05,3.2e-05,2.4e-05,7.4e-05,-2.1e-05,0,0,-6e-06,-1e-06,-1e-06,7e-06,7e-06,-4e-06,-1e-06,-6e-06,3e-06,-3e-06,4e-06,-1e-06,-8e-06,-3e-06,-4e-06,3e-06,-2e-06,-1e-06,0,1e-06,-7e-06,1e-06,7e-06,3e-06,-1e-06,-1e-06,0,-5e-06,1.4e-05,-9e-06,4e-06,-1.5e-05,-2e-06,-1.4e-05,-2e-06,1e-06,0,0,2e-06,0,0,1e-06,1e-06,2e-06,0,0,0,0,-1e-06,-1e-06,-3e-06,-6e-06,3e-06,-1e-06,0,-1e-06,0,-1e-06
-1e-06,0,-1e-06,0,0,0,-1e-06,0,-1e-06,0,-1e-06,0,1e-06,0,1e-06,-1e-06,0,0,0,-2.5e-05,-4.1e-05,-2e-05,-1.2e-05,1.6e-05,-6e-06,-9e-06,-4e-06,2.6e-05,-0.000165,-3.5e-05,-5.6e-05,-2.8e-05,1.3e-05,-0.000145,-3.4e-05,-0.000158,-3.8e-05,-2.5e-05,0.000173,-2.9e-05,3e-06,4e-06,-7.2e-05,4.8e-05,-5.8e-05,4e-05,2.5e-05,-9e-06,0.000203,-3.5e-05,-1.1e-05,0,-3e-06,6e-06,1.7e-05,7.6e-05,-4.8e-05,-4.3e-05,0,-6.8e-05,1.3e-05,2e-06,1.2e-05,8e-06,1.8e-05,1e-06,6e-06,-8e-06,-1e-06,-2e-06,1.8e-05,-9e-06,1.2e-05,-2e-06,1e-06,-1.3e-05,4e-06,0,1.1e-05,2e-06,-2e-06,-2e-06,-1e-06,0,-3e-06,3e-06,1e-06,1e-06,-2e-06,-3e-06,-9e-06,-2e-06,8e-06,0,-1.6e-05,-3e-06,3e-06,1e-06,1e-06,-1e-06,-1e-06,0,0,-1e-06,0,1e-06,0,2e-06,-1e-06,-1e-06,-1e-06,2e-06,-2e-06,5e-06,3e-06,-4e-06,0,0,1e-06,0,-1e-06
0,-1e-06,2e-06,0,0,0,1e-06,0,0,0,0,0,-1e-06,0,-1e-06,1e-06,0,0,0,6e-06,3.1e-05,-2.5e-05,1.8e-05,-1.5e-05,9e-06,7e-06,-4e-06,2.5e-05,9.3e-05,5.2e-05,-2.4e-05,1.8e-05,-2.1e-05,0.000176,-1e-06,4.6e-05,-7.6e-05,-8e-06,-0.000135,-1.5e-05,-8e-06,-3.8e-05,4.7e-05,3.7e-05,3.3e-05,-3e-05,2.6e-05,-3e-05,-6.7e-05,0.000112,1.8e-05,-6e-06,5e-06,-3.3e-05,-4e-06,-2.3e-05,6.5e-05,4.9e-05,-1.8e-05,2.8e-05,-6e-06,-1e-06,1e-06,-1.7e-05,5e-06,3e-06,3e-06,9e-06,-1.3e-05,3e-06,-6e-06,0,1.6e-05,2e-06,-1e-06,1e-06,-3e-06,1e-06,1e-06,1e-06,0,-2e-06,1e-06,3e-06,-3e-06,1e-06,2e-06,2e-06,-2e-06,-1e-06,9e-06,1.2e-05,-1.4e-05,-4e-06,-1.6e-05,-1e-06,-5e-06,0,0,1e-06,0,1e-06,0,1e-06,-1e-06,-3e-06,-4e-06,-2e-06,0,0,1e-06,1e-06,-1e-06,-4e-06,-6e-06,-2e-06,0,0,0,0,-1e-06
1e-06,0,-1e-06,0,0,0,-2e-06,0,1e-06,0,0,0,0,0,1e-06,-1e-06,0,0,0,-1.1e-05,-6.5e-05,1.7e-05,9.4e-05,1.2e-05,-8e-06,-5e-06,-4e-06,0.000111,1.5e-05,2.6e-05,4.1e-05,1e-05,2.3e-05,-0.000141,-1.2e-05,0.000135,-2.2e-05,8.8e-05,8.9e-05,2.6e-05,1.7e-05,-2.3e-05,-7.8e-05,2.7e-05,-8e-06,2.8e-05,-2.1e-05,-4.3e-05,-1.2e-05,-0.000135,6.6e-05,1.1e-05,-9e-06,-4.6e-05,-5e-06,-6e-05,2.2e-05,-5.9e-05,1.3e-05,3.2e-05,4e-06,-1e-06,3e-06,-3e-06,-8e-06,1.2e-05,5e-06,-8e-06,-1e-06,-1.5e-05,-5e-06,-2e-06,6e-06,0,0,8e-06,1e-06,-2e-06,-3e-06,-3e-06,0,2e-06,0,0,1e-06,7e-06,0,-2e-06,0,2e-06,9e-06,-2.2e-05,6e-06,-8e-06,-1.6e-05,0,-1e-05,-1e-06,-1e-06,-1e-06,0,0,0,-2e-06,-1e-06,2e-06,-2e-06,0,0,-1e-06,0,-2e-06,4e-06,1e-06,4e-06,-3e-06,-1e-06,0,0,0,0
0,0,-1e-06,0,0,0,2e-06,1e-06,-1e-06,0,-1e-06,0,0,0,1e-06,0,0,0,0,1.2e-05,2e-05,0,-3.9e-05,9e-06,-1.5e-05,1.1e-05,-4e-06,-0.000159,-0.000145,-2.7e-05,-7.4e-05,2e-06,-1.7e-05,0.000149,-1.2e-05,-4.7e-05,-2.2e-05,-0.000112,-0.000136,-3e-06,-6e-06,1.1e-05,4.7e-05,-2.8e-05,-3.6e-05,2.2e-05,3.1e-05,1.6e-05,-9.6e-05,6e-05,-2.1e-05,-3e-06,3e-06,6.2e-05,-2.1e-05,2.7e-05,-2.6e-05,9.2e-05,1.5e-05,-9.7e-05,-1.1e-05,1e-06,1e-06,1.3e-05,-2.4e-05,-2e-06,-5e-06,6e-06,1.2e-05,9e-06,1.2e-05,2e-06,-7e-06,1e-06,0,-4e-06,2e-06,4e-06,-6e-06,0,1e-06,1e-06,-1e-06,3e-06,2e-06,-5e-06,-4e-06,-1e-06,1e-06,1e-06,-6e-06,2.1e-05,-1.3e-05,-9e-06,-1.5e-05,4e-06,-1.7e-05,2e-06,0,0,0,0,0,-1e-06,0,1e-06,1e-06,1e-06,0,2e-06,-1e-06,0,0,1e-06,0,3e-06,0,0,2e-06,0,0
