8.2e-05,5.4e-05,2.3e-05,2e-05,3.1e-05,3.2e-05,5e-06,6e-06,6e-06,1.4e-05,3.9e-05,7e-06,2.1e-05,3.1e-05,2.5e-05,1.2e-05,2.7e-05,2.3e-05,5.5e-05,1.2e-05,1.4e-05,1.3e-05,3.6e-05,4.2e-05,2.7e-05,3.2e-05,2.2e-05,5.3e-05,2.7e-05,1e-05,5e-06,1.9e-05,9e-06,2.7e-05,2.2e-05,5.8e-05,3.5e-05,0.00014,7.5e-05,6e-06,4.5e-05,1.3e-05,1e-05,2.2e-05,3.4e-05,0.000121,9.6e-05,7.8e-05,0.000255,0.000606,0.000203,0.00011,6.2e-05,0.000633,0.000208,1.4e-05,0.000542,0.000163,0.000405,0.000307,0.000663,0.000126,0.000127,0.000123,0.000285,0.000208,5.6e-05,0.00044,0.000509,0.000527,0.000109,1e-06,0.000433,0.000253,0.000528,0.000355,0.000252,0.000146,9e-05,2.4e-05,0.000642,0.000188,0.000179,0.000301,7.9e-05,2e-05,0.00012,1.8e-05,7.1e-05,4.6e-05,6.8e-05,8.1e-05,0.000101,6.1e-05,0.00011,6e-06,0.000102,9.8e-05,3.1e-05,4.6e-05,9.1e-05,4.8e-05,3.7e-05,0.000103,5.3e-05,0.000246,0.000267,0.000158,0.000134,1e-04,0.000217,5e-06,0.00011,1e-05,1e-06,3.5e-05,1.4e-05,1e-06,4e-06,1e-06,0
0.000124,0.000179,9.6e-05,7.1e-05,3e-05,9.1e-05,8.5e-05,8.2e-05,3.3e-05,2.3e-05,9.7e-05,9.6e-05,7.9e-05,9e-05,0.000146,0.00011,7.7e-05,6.3e-05,0.000125,0.000157,7.8e-05,9e-06,6.1e-05,0.000138,0.000152,6.5e-05,7.8e-05,5e-05,0.000116,7.1e-05,4.7e-05,5.7e-05,0.00013,3.8e-05,8.4e-05,0.000103,0.000159,0.000483,0.000178,0.000128,9.5e-05,0.000126,8.4e-05,8e-05,0.000112,0.000203,0.000218,6.6e-05,0.000441,0.001361,0.001831,0.001206,0.000642,0.001494,0.000348,0.000569,0.001253,0.000408,0.001502,0.002177,0.001606,0.002223,0.001214,0.000936,0.001006,0.000586,0.000634,0.001274,0.001467,0.001837,0.000517,0.00078,0.001308,0.001286,0.001091,0.00033,0.000658,0.00081,0.000683,0.000551,0.001548,0.000364,0.000557,0.000828,0.000347,0.000527,0.000355,0.000285,0.000339,0.000234,0.000277,0.000434,0.000395,0.000258,0.000312,0.000335,0.000236,0.000263,0.000143,0.000163,0.000263,0.00041,0.000301,0.000196,0.000603,0.00127,0.001346,0.000653,9.9e-05,0.000603,0.000762,0.000595,0.000297,0.000204,0.000162,5.3e-05,8.6e-05,0.000116,6.2e-05,6.8e-05,7.8e-05
5.8e-05,2.5e-05,1.3e-05,5e-05,7e-06,3.8e-05,5.5e-05,4e-05,2.3e-05,3.2e-05,5.3e-05,6.5e-05,4.6e-05,1.1e-05,0.000105,1.6e-05,3e-05,5.6e-05,1.7e-05,8.3e-05,4.2e-05,4.5e-05,2.4e-05,6.5e-05,6.3e-05,5.7e-05,2.8e-05,3.1e-05,5.3e-05,6.9e-05,7.3e-05,1.8e-05,0.000199,0.00019,6.8e-05,4.4e-05,6.1e-05,0.000491,6.6e-05,3.7e-05,2.8e-05,4.8e-05,2.8e-05,2.4e-05,3.9e-05,0.000389,0.000134,0.00023,0.000289,0.000338,0.003654,0.001783,0.002451,0.002876,0.001352,0.000324,0.00128,0.000949,0.002415,0.00245,0.000699,0.001449,0.000496,0.000601,0.001009,0.000425,0.000447,0.000928,0.000495,0.000977,0.000803,0.000971,0.000331,0.000982,0.000963,0.000884,0.000783,0.000771,0.000212,0.000669,0.000997,0.000733,0.000158,0.000382,0.000604,0.000545,0.000242,0.000285,0.000227,0.000256,0.00033,0.000218,0.000194,0.000258,4.9e-05,0.000143,7.6e-05,0.000277,0.000128,0.000202,0.000132,0.000285,7.7e-05,0.00033,0.000856,0.001181,0.000661,0.000288,0.000295,0.000492,0.000271,0.000113,7.9e-05,4.4e-05,0.000114,0.000129,3.6e-05,9.7e-05,7.7e-05,3.2e-05,7.8e-05
0.000149,0.00011,6.1e-05,4.8e-05,4.1e-05,4.6e-05,2.5e-05,6.9e-05,8.5e-05,8.1e-05,2.8e-05,2.9e-05,3.2e-05,6.2e-05,4.2e-05,6.1e-05,7.7e-05,3.6e-05,2.5e-05,4.2e-05,3.7e-05,6.4e-05,2.8e-05,4.3e-05,5.6e-05,6.6e-05,5.4e-05,8.6e-05,8.1e-05,8.4e-05,3.1e-05,3.7e-05,0.000231,0.000144,7.3e-05,4.8e-05,1.9e-05,0.000661,0.000324,0.000201,7.3e-05,3e-06,8e-06,1e-05,2.8e-05,0.000451,0.000364,0.000336,0.000381,0.000368,0.003091,0.001941,0.002428,0.002895,0.001906,0.001699,0.000947,0.001021,0.001634,0.001037,0.001307,0.000875,0.001068,0.000995,0.001697,0.000938,0.001399,0.000293,0.001475,0.001084,0.00144,0.001868,0.001128,0.001565,0.001182,0.001117,0.001215,0.00028,0.00077,0.001334,0.001708,0.000592,0.000271,0.000525,0.00041,0.00104,0.000592,0.000426,0.000194,0.000342,0.000246,0.00039,0.000312,7.8e-05,0.000127,0.000139,0.00013,0.000723,0.000296,0.000318,0.000268,0.000246,0.000257,0.000372,0.000435,0.000701,7.6e-05,5.9e-05,2.9e-05,0.000426,0.000244,0.000184,1.5e-05,3.9e-05,6.4e-05,7.6e-05,4.7e-05,7.3e-05,5.7e-05,7e-05,1.8e-05
0.000171,0.000131,3.7e-05,3.5e-05,2.1e-05,3.4e-05,3.5e-05,4.3e-05,4.2e-05,4.8e-05,2.9e-05,4e-05,3.9e-05,4.9e-05,1.7e-05,1.9e-05,5.5e-05,2.5e-05,1.3e-05,2.5e-05,9e-06,4.5e-05,1.2e-05,4.5e-05,7e-06,2.4e-05,3.3e-05,3.9e-05,1.2e-05,5.5e-05,1.5e-05,3.1e-05,0.00023,0.000169,7.8e-05,5.1e-05,3.5e-05,0.000779,0.000213,0.000134,8e-05,3.4e-05,1.4e-05,2e-06,3.7e-05,0.000482,0.000246,9.4e-05,0.000208,0.000667,0.001462,0.001403,0.001684,0.002062,0.00197,0.000342,0.002829,0.002839,0.003132,0.000949,0.000252,0.000348,0.000661,0.001065,0.001725,0.001403,0.001802,0.001779,0.001084,0.001414,0.00096,0.000718,0.000705,0.001854,0.000544,0.001507,0.001349,0.001482,0.001005,0.001083,0.001123,0.000915,0.000439,0.000744,0.00084,0.000897,0.000389,0.000198,0.00023,7.1e-05,0.000169,0.000196,9.3e-05,0.00017,1.8e-05,7.9e-05,0.00015,0.00071,0.000245,0.000444,0.000198,0.000157,0.000122,0.000316,0.000341,0.000596,0.000324,0.000237,0.00022,0.000137,0.000217,0.000169,1.6e-05,7.9e-05,4.2e-05,5e-05,4.8e-05,4.5e-05,3e-05,1.9e-05,2.7e-05
0.000131,0.000109,3.6e-05,1.4e-05,6e-06,2.3e-05,3.8e-05,2.7e-05,4.4e-05,2.3e-05,2.7e-05,5e-05,5.6e-05,4.3e-05,2.1e-05,3.5e-05,2.7e-05,5.5e-05,3.8e-05,2.7e-05,7e-06,2.9e-05,2.4e-05,6.4e-05,3.8e-05,3e-06,3.4e-05,1.5e-05,2.8e-05,4.7e-05,2.1e-05,3.2e-05,0.000158,7.7e-05,1.9e-05,7.6e-05,4.5e-05,0.000954,0.000316,0.00015,4.1e-05,3.5e-05,3.3e-05,2.5e-05,5.6e-05,0.000413,0.000197,0.00012,9e-05,0.000456,0.002576,0.000769,0.001363,0.003477,0.003323,0.00308,0.003554,0.004376,0.001634,0.001724,0.000437,0.001097,0.000792,0.001754,0.002328,0.001119,0.001955,0.001579,0.000884,0.003566,0.003384,0.002187,0.001623,0.002654,0.003078,0.00124,0.001135,0.001369,0.002783,0.002028,0.001555,0.000756,0.000538,0.000655,0.000492,8.6e-05,5.4e-05,0.000197,0.000276,0.00022,0.000225,0.000129,9e-05,0.000251,0.000244,7e-05,0.000144,0.000901,0.000448,0.000463,0.000249,6.7e-05,3.3e-05,0.000183,0.000226,0.000394,0.000358,0.000341,0.000405,0.000522,0.000272,0.000141,7e-05,8.4e-05,3.6e-05,5.5e-05,1.8e-05,6e-06,1.6e-05,3.5e-05,1.2e-05
8.3e-05,4e-05,8.3e-05,1.7e-05,2e-05,2.6e-05,3.4e-05,1.3e-05,3.7e-05,2.9e-05,3.9e-05,7.2e-05,7.6e-05,7e-06,5.3e-05,7.5e-05,4.4e-05,5.4e-05,4e-06,2.3e-05,2.5e-05,4.2e-05,6.4e-05,5.3e-05,2.2e-05,3.5e-05,1.2e-05,3.6e-05,3.3e-05,3.6e-05,1.4e-05,4e-05,5.5e-05,0.000126,4.4e-05,3.4e-05,3.5e-05,0.001102,0.000769,0.000474,0.000183,4.1e-05,6.2e-05,3.5e-05,6.6e-05,0.000437,0.000566,0.000484,0.000242,0.001106,0.003407,0.003768,0.004654,0.002859,0.00457,0.001856,0.003136,0.003603,0.001259,0.003345,0.003351,0.003455,0.002225,0.000603,0.002401,0.000464,0.002037,0.000956,0.000491,0.004378,0.001152,0.001238,0.00083,0.002234,0.001651,0.002212,0.001848,0.000462,0.001874,0.001406,0.00051,0.000802,0.000153,0.000735,0.000475,0.000479,0.000282,0.000301,5.1e-05,0.000131,0.000252,3.4e-05,0.000173,0.000192,0.000156,7.6e-05,0.000218,0.001004,0.000669,6.6e-05,0.000205,0.000106,6.1e-05,0.000253,0.000121,0.000414,0.000185,0.000696,7.4e-05,0.000716,0.000359,0.000102,3.2e-05,2.4e-05,5.3e-05,2.3e-05,3.3e-05,2.9e-05,1.1e-05,5.7e-05,6.7e-05
0.000391,0.000382,0.000132,9e-05,6.6e-05,1.7e-05,1.5e-05,1.7e-05,3e-05,2.5e-05,2.3e-05,9e-05,4.5e-05,7.1e-05,6.2e-05,2.9e-05,2.3e-05,6e-05,4.5e-05,1.8e-05,1.1e-05,5e-05,5.2e-05,4.6e-05,3.5e-05,7.4e-05,2.8e-05,5.4e-05,3.7e-05,6.6e-05,3.9e-05,3.9e-05,2.8e-05,0.000162,0.000105,5.6e-05,2.4e-05,0.001161,0.001096,0.000332,4.9e-05,7.9e-05,5.8e-05,1.5e-05,6.1e-05,0.000258,0.000581,0.00061,0.000496,0.001221,0.001359,0.000969,0.002878,0.005273,0.008297,0.008009,0.004641,0.007873,0.006017,0.001298,0.002137,0.003584,0.002642,0.001037,0.001734,0.002267,0.001081,0.00137,0.00118,0.002865,0.003344,0.001508,0.001693,0.002081,0.002754,0.000897,0.002839,0.001399,0.000788,0.000707,0.001278,0.001494,0.001025,0.000459,0.000374,0.000209,5.6e-05,0.000392,0.000188,0.000297,0.000355,0.000279,7.6e-05,0.000123,8.3e-05,5.1e-05,0.000223,0.000948,0.000753,0.000439,5.6e-05,0.000108,7.1e-05,0.000242,0.00016,0.000583,0.000478,0.001354,0.000752,0.000859,0.000422,0.000152,1.8e-05,5.3e-05,1.6e-05,4.1e-05,5.6e-05,4.3e-05,1.9e-05,5.3e-05,3.1e-05
0.000816,0.000467,0.000318,0.000213,6.9e-05,5.3e-05,4.7e-05,2.1e-05,1.6e-05,4.3e-05,2e-05,7.5e-05,0.000146,0.000112,0.000131,6.3e-05,1.8e-05,4e-05,5e-06,2.9e-05,7e-06,6.9e-05,6.3e-05,1.8e-05,6.7e-05,4.1e-05,5e-05,0.000135,6.3e-05,7.8e-05,5.5e-05,6.4e-05,5e-05,0.000226,1.4e-05,1.6e-05,4.5e-05,0.001193,0.001432,0.00086,0.000305,7.2e-05,2e-05,4.7e-05,5.9e-05,0.000173,0.000543,0.001056,0.000327,0.001517,0.002399,0.001734,0.00265,0.004449,0.00825,0.002164,0.002382,0.007089,0.009193,0.006716,0.002285,0.002769,0.000875,0.002582,0.001703,0.000452,0.001589,0.001132,0.0018,0.000618,0.001401,0.000106,0.000863,0.001399,0.002766,0.002797,0.003797,0.002492,0.003167,0.002225,0.002143,0.001245,0.000921,0.001385,0.000324,0.000208,0.000199,0.000497,0.000415,0.00046,0.000454,0.000368,0.000135,0.000167,0.000214,7.1e-05,0.000133,0.000839,0.001096,0.000756,0.000183,0.000221,9e-05,0.000315,0.000251,0.000229,0.000287,0.001611,0.000878,0.001831,0.000812,0.000341,5.7e-05,4e-05,7.6e-05,8.5e-05,0.000103,2.5e-05,2.6e-05,4.9e-05,5.5e-05
0.001071,0.001517,0.000733,0.000464,0.000238,0.000113,5.3e-05,5.6e-05,5.8e-05,4.9e-05,2.1e-05,5.8e-05,0.000266,0.000128,0.000114,0.000135,5.3e-05,1.2e-05,3.7e-05,6.7e-05,4.4e-05,5.3e-05,8e-05,6.1e-05,5.6e-05,9.5e-05,4.4e-05,0.000141,0.000199,0.000138,9.2e-05,1.7e-05,8.2e-05,9.8e-05,0.000235,0.000165,0.000101,0.001138,0.001352,0.000516,0.000176,7.1e-05,5.4e-05,4.2e-05,0.000132,6.5e-05,0.000521,0.000584,0.000813,0.001586,0.002417,0.002854,0.007035,0.002349,0.004835,0.00274,0.001745,0.006594,0.004605,0.00162,0.000701,0.001204,0.002533,4e-05,0.001162,0.000292,0.001763,0.002138,0.000956,0.001743,0.000481,0.001582,0.001666,0.001034,0.000873,0.000938,0.001498,0.000484,0.002572,0.000784,0.000482,0.00127,0.000641,0.001048,0.000458,0.000145,0.000199,0.000328,0.000386,0.000217,0.00037,0.000217,0.000193,1.2e-05,0.000186,0.000263,0.000258,0.00055,0.000926,0.00037,4e-04,9.3e-05,0.000132,0.000338,0.000567,0.000335,0.000202,0.001472,0.001213,0.00204,0.001364,0.000492,9.1e-05,5.8e-05,9.3e-05,7.1e-05,0.000111,0.000115,0.000113,0.000104,7.5e-05
0.001104,0.00108,6e-04,0.000429,0.000216,9.2e-05,5.3e-05,1.8e-05,2.1e-05,1.3e-05,1.9e-05,7.4e-05,0.000278,0.00025,9.2e-05,6.1e-05,4.3e-05,1e-05,3.5e-05,5.3e-05,3.5e-05,4.2e-05,5.5e-05,7.6e-05,8.7e-05,4.4e-05,4.4e-05,8.9e-05,9.3e-05,0.000117,6.7e-05,7.1e-05,4.4e-05,0.000103,0.000255,0.000194,0.00013,0.000829,0.00059,0.000407,0.00023,0.000112,2.9e-05,4.3e-05,0.000119,1.1e-05,0.000513,0.000676,0.000757,0.001265,0.001009,0.002115,0.007322,0.006191,0.00364,0.001061,0.000639,0.004389,0.000673,0.000721,0.000772,0.00095,0.002867,0.002069,0.00202,0.000464,0.001368,0.000436,0.002247,0.000946,0.000881,0.001824,0.001375,0.000903,0.00032,0.000999,0.001111,0.001274,0.000562,0.000698,0.000617,0.00094,0.000356,0.000674,8.5e-05,0.000281,0.000175,0.000425,0.000155,0.000202,0.000133,0.000166,0.000279,0.000165,0.000211,0.000216,0.000195,0.000771,0.000772,0.000669,0.000249,0.000191,8.2e-05,0.000292,0.000818,0.000662,0.00048,0.001181,0.000666,0.001075,0.000902,0.000514,0.00015,1.3e-05,0.000105,3.9e-05,0.000133,0.000171,6.5e-05,7e-05,6.1e-05
0.000845,0.000102,0.000166,0.000135,4.9e-05,2.4e-05,7e-06,1.6e-05,5e-06,9e-06,1.3e-05,7.3e-05,0.00013,3.1e-05,3.7e-05,2e-06,5.5e-05,5.6e-05,5.9e-05,7e-06,1e-05,1.5e-05,3.3e-05,3.5e-05,2.7e-05,1.9e-05,3.5e-05,5.7e-05,3.9e-05,3.5e-05,1.8e-05,3.5e-05,3.8e-05,3.7e-05,0.000106,0.000119,6e-05,0.000598,0.000138,3.3e-05,8.3e-05,4.2e-05,1.8e-05,2.3e-05,6.3e-05,0.000213,0.000333,0.000512,9.3e-05,0.000957,0.000752,0.003856,0.006076,0.004478,0.00337,0.001226,0.000775,0.003251,0.002012,0.00235,0.002146,0.001957,0.00127,0.00157,0.002784,0.001779,0.001159,0.000577,0.001765,0.000822,0.001255,0.001292,0.001452,0.001505,0.001675,0.00025,0.000533,0.000889,0.00045,0.000405,0.000561,0.000877,0.000609,0.001106,0.00044,0.000337,8.8e-05,0.000191,0.000244,8.4e-05,0.000197,3.9e-05,0.000204,7.3e-05,0.000163,6.8e-05,0.000116,0.000771,0.000434,0.000105,0.000121,9.9e-05,4.8e-05,0.000153,0.000494,0.000218,9.5e-05,0.000435,0.000226,0.000667,8e-05,0.000113,2.1e-05,2.7e-05,1.6e-05,3.6e-05,7.2e-05,3.9e-05,3.6e-05,3.5e-05,2.3e-05
0.000384,0.000107,0.000117,8.9e-05,4e-05,1.1e-05,1.4e-05,5e-06,2e-06,8e-06,5e-06,7.4e-05,2.6e-05,8e-06,3.1e-05,1.4e-05,4.2e-05,4e-06,2.8e-05,1.5e-05,7e-06,1.6e-05,2.1e-05,1.8e-05,3.1e-05,2.7e-05,2.6e-05,5.6e-05,4.7e-05,1.1e-05,3.2e-05,1.8e-05,4.1e-05,2.2e-05,8.4e-05,1.9e-05,7.1e-05,0.000261,0.00015,0.000172,5.8e-05,3.4e-05,4.4e-05,5.4e-05,0.000102,0.000276,0.000425,0.000114,0.000146,0.000925,0.000948,0.004517,0.003979,0.000971,0.00123,0.000539,0.000597,0.00161,0.00143,0.000527,0.002686,0.002043,0.001101,0.001214,0.001608,0.000271,0.001748,0.001316,0.002583,0.003263,0.001438,0.002678,0.001664,0.001055,0.001673,0.000788,0.000793,0.000592,0.00094,0.000636,0.001067,0.000641,0.000647,0.00084,0.000331,0.000294,3.8e-05,0.000148,0.000154,8.1e-05,0.000194,3e-05,0.000212,9.5e-05,0.000156,1.7e-05,0.000203,0.00049,0.000189,8.9e-05,0.00013,2e-05,6.1e-05,0.000181,0.000187,4e-04,0.000168,0.000269,0.00028,0.000196,0.000113,6.6e-05,2.2e-05,9e-06,4.8e-05,3.9e-05,3.4e-05,1.9e-05,2e-05,1.9e-05,1.5e-05
7.3e-05,0.000169,3.3e-05,3.7e-05,1e-05,1.1e-05,1.7e-05,1.1e-05,1.1e-05,2.3e-05,1.3e-05,5.8e-05,6.5e-05,4.9e-05,3e-06,2.3e-05,2e-05,3.6e-05,4.5e-05,2.1e-05,2e-05,1.3e-05,1.3e-05,1e-05,1.7e-05,3e-06,2e-05,4e-05,1.3e-05,1e-05,4.4e-05,2e-05,5e-05,0.000117,0.000143,0.000135,5.2e-05,0.000322,0.00012,1.9e-05,3.8e-05,2.3e-05,5.4e-05,1.1e-05,0.000124,0.000151,0.000438,0.000135,3.9e-05,0.000485,0.001284,0.005859,0.001071,5.8e-05,0.004056,0.000685,0.002476,0.003643,0.001516,0.001622,0.002035,0.001782,0.002096,0.00186,0.000796,0.000784,0.002659,0.00295,0.002111,0.003491,0.002874,0.003255,0.002867,0.001096,0.001653,0.000264,0.001191,0.000403,0.001335,0.000877,0.001445,0.00141,8.5e-05,0.001206,0.000137,0.000418,0.00023,0.000132,0.000277,0.000133,0.000318,5.7e-05,0.000225,0.000104,0.000123,0.000141,0.000217,0.000342,0.000141,0.000161,0.000104,3.8e-05,6.6e-05,0.000268,0.00028,0.00018,0.000149,0.000567,0.000255,9.7e-05,7.1e-05,3.1e-05,5.9e-05,5.8e-05,2.3e-05,2.7e-05,4.1e-05,2e-05,3.7e-05,4.6e-05,1.9e-05
0.00035,0.000113,4.7e-05,4.5e-05,2.3e-05,2.4e-05,2e-06,7e-06,1.6e-05,4.2e-05,3.5e-05,5.1e-05,2.7e-05,3.2e-05,1.8e-05,2.9e-05,1.8e-05,2.9e-05,2.2e-05,1.1e-05,3.3e-05,2.6e-05,1.9e-05,9e-06,6e-06,3e-06,3.6e-05,2.1e-05,2.3e-05,9e-06,2.6e-05,6.2e-05,7.1e-05,0.000252,7.9e-05,9.8e-05,0.000125,0.000427,0.000358,9.3e-05,6.1e-05,1.2e-05,2.9e-05,6.1e-05,8.7e-05,0.000232,0.000299,0.000293,0.00019,0.000611,0.001933,0.00588,0.001897,0.003553,0.009198,0.004582,0.005465,0.001894,0.003321,0.004832,0.005009,0.003998,0.004958,0.001657,0.003365,0.001127,0.00508,0.004007,0.004953,0.004352,0.003726,0.000555,0.001095,0.002309,0.002386,0.00101,0.002091,0.002202,0.002506,0.002422,0.002632,0.000934,0.000899,0.00228,0.000612,0.000738,0.000412,0.000434,0.000616,0.000388,0.000173,0.000166,0.000341,6e-06,7.4e-05,0.000191,0.000185,0.000606,0.000747,0.000532,0.000608,0.00024,0.00013,0.000367,0.000463,0.000192,0.000109,0.000962,0.000738,0.00052,0.000103,0.000129,2.5e-05,3.9e-05,1.4e-05,3.1e-05,7.2e-05,5e-05,5.1e-05,2.3e-05,2.3e-05
0.000325,0.000143,7.2e-05,3.2e-05,2.6e-05,2.7e-05,3.3e-05,2.5e-05,7e-06,2.6e-05,7e-06,6.4e-05,6.8e-05,3.2e-05,1.2e-05,1.8e-05,1.3e-05,1.5e-05,2.6e-05,2.1e-05,2.6e-05,1.5e-05,9e-06,1e-05,1.8e-05,1.7e-05,3.5e-05,3e-05,2.2e-05,2.6e-05,2e-05,6e-05,4.3e-05,0.000182,0.000371,0.000185,0.000104,3e-04,0.000345,0.000305,0.000187,8.4e-05,3.3e-05,5.7e-05,4.8e-05,0.000149,0.000666,0.000672,0.000236,0.000748,0.002752,0.008368,0.004699,0.005186,0.004731,0.005343,0.004505,0.003742,0.00277,0.007784,0.001408,0.005955,0.005929,0.001375,0.007352,0.004734,0.004962,0.004128,0.00288,0.007649,0.002824,0.004741,0.004066,0.00211,0.00521,0.001808,0.00058,0.003387,0.000927,0.00078,0.002756,0.004684,0.000865,0.00344,0.001656,0.002183,0.001484,0.001043,0.000513,0.000659,0.000727,0.000667,0.000552,0.000125,1.9e-05,0.000375,0.000154,0.000609,0.001124,0.000336,0.000791,0.000474,6.6e-05,0.000609,0.000148,0.000429,0.000124,0.001614,0.000575,0.000125,0.000116,8.5e-05,9.7e-05,5.9e-05,7.8e-05,1.4e-05,5.4e-05,3.7e-05,6.1e-05,8.5e-05,4.7e-05
0.000185,0.000131,3.5e-05,6.2e-05,4.7e-05,2.2e-05,1.6e-05,1.2e-05,1.7e-05,1.5e-05,7e-06,6.5e-05,5.4e-05,1.8e-05,8e-06,2.5e-05,2.1e-05,1.5e-05,1.6e-05,1.2e-05,1.9e-05,1.6e-05,2.1e-05,3e-05,7e-06,8e-06,3.6e-05,1.1e-05,2.3e-05,3.7e-05,4.1e-05,6.1e-05,8.2e-05,0.000154,0.000311,0.000107,0.000124,0.000455,0.000319,0.000184,5.7e-05,6.3e-05,4.8e-05,1.7e-05,8.9e-05,1.4e-05,0.000627,0.000801,0.00058,0.000938,0.002982,0.006818,0.005518,0.009382,0.007063,0.010116,0.005239,0.003866,0.003078,0.008929,0.011862,0.011607,0.005976,0.009271,0.003849,0.010772,0.011975,0.01282,0.00864,0.007543,0.007902,0.00845,0.012527,0.009497,0.006413,0.009682,0.004299,0.003168,0.003911,0.002944,0.004477,0.007631,0.006668,0.006273,0.00623,0.004168,0.003266,0.001248,0.000607,0.001007,0.001115,0.001006,0.001801,0.001571,0.000788,0.000593,0.000509,0.000594,0.000523,0.000531,0.000601,0.00075,0.000371,0.000401,0.000723,0.000891,0.000387,0.002123,0.001374,0.000728,0.000229,9.3e-05,4.6e-05,2e-05,0.00012,0.000106,5.4e-05,3e-05,3.4e-05,3.5e-05,5.3e-05
0.000173,0.000148,1.2e-05,8.1e-05,2.3e-05,3.2e-05,3.3e-05,9e-06,1e-05,3.4e-05,2.7e-05,4.4e-05,2.1e-05,5.2e-05,1.9e-05,2.7e-05,2.5e-05,2.1e-05,3.1e-05,7e-06,3.3e-05,3.5e-05,6.2e-05,3.7e-05,3.2e-05,1.2e-05,5.3e-05,4.6e-05,5.1e-05,3.3e-05,1.7e-05,1.8e-05,6.7e-05,0.000101,0.00016,0.000127,0.000132,0.000538,0.000701,0.000335,0.000121,3.2e-05,1.9e-05,2e-05,0.000156,0.00018,0.000352,0.000515,0.000284,0.000392,0.003329,0.003344,0.005616,0.004937,0.001495,0.006704,0.006523,0.005973,0.007217,0.006027,0.005421,0.001676,0.005665,0.009857,0.010673,0.005581,0.001937,0.005664,0.006828,0.003751,0.0052,0.006478,0.006548,0.008096,0.010431,0.007619,0.006778,0.002433,0.004086,0.004382,0.005756,0.001799,0.005767,0.001257,0.004246,0.002917,0.001814,0.00114,0.000642,0.000324,0.000854,0.000302,0.00137,0.001834,0.000878,0.000575,0.000648,0.000814,0.000171,0.000157,0.000367,0.000395,0.000273,0.000248,0.000708,0.00014,0.000116,0.001931,0.001409,0.000648,0.000194,0.000115,7.2e-05,2.3e-05,7.4e-05,8e-05,4.8e-05,6.2e-05,6.6e-05,3.3e-05,5.4e-05
0.000269,9.8e-05,0.000102,5e-05,2.8e-05,3.1e-05,1.9e-05,3.8e-05,2.5e-05,2.5e-05,3e-06,4.3e-05,1.1e-05,1.6e-05,2.2e-05,2.4e-05,1.1e-05,1.8e-05,1.3e-05,3.5e-05,4.7e-05,6.7e-05,2.2e-05,1.6e-05,1.1e-05,1.2e-05,5.9e-05,1.9e-05,2.8e-05,3.1e-05,5.5e-05,3.8e-05,9.6e-05,0.000139,9.1e-05,0.000124,9.5e-05,0.000712,0.000755,0.000333,0.000138,5.3e-05,9e-06,4.4e-05,0.000184,0.000158,0.000178,0.000533,9.6e-05,0.000125,0.003235,0.002981,0.004145,0.002868,0.000557,0.004247,0.006717,0.005366,0.004538,0.003947,0.00305,0.003831,0.006521,0.002773,0.00203,0.004432,0.003487,0.002292,0.001594,0.002964,0.006435,0.006622,0.004695,0.004604,0.000853,0.005368,0.005648,0.003426,0.000613,0.003168,0.000655,0.003968,0.003276,0.003135,0.001247,0.001748,0.00125,0.001081,0.000566,0.000432,0.000562,0.000315,0.000555,0.000713,0.000515,0.000576,0.00031,0.000757,8e-04,0.000556,0.000373,0.000108,9.9e-05,0.000237,0.000315,0.000156,1e-04,0.001425,0.000604,0.000276,0.00024,0.000132,0.000108,7.5e-05,1.9e-05,3e-05,1.1e-05,4e-05,3.2e-05,2e-05,3.1e-05
0.000253,0.000162,8.8e-05,1.3e-05,1.9e-05,1.7e-05,1.3e-05,2e-05,9e-06,2.2e-05,2e-05,3.9e-05,2.7e-05,1.7e-05,1.7e-05,1.5e-05,1.6e-05,8e-06,4e-06,3.1e-05,3.1e-05,1.5e-05,4.5e-05,1.1e-05,3e-06,1.1e-05,4e-05,2.9e-05,1.9e-05,2.3e-05,6.6e-05,4.1e-05,7.3e-05,0.000112,5.4e-05,0.000177,9.5e-05,0.000874,0.000425,0.000203,9.8e-05,4e-05,2.5e-05,6e-05,0.000145,5.5e-05,0.000252,0.000115,0.00023,0.000612,0.002852,0.00089,0.004534,0.002237,0.002365,0.00277,0.003149,0.000891,0.004254,0.002393,0.000286,0.00308,0.003027,0.003462,0.002699,0.002893,0.002532,0.001335,0.002051,0.004789,0.001322,0.000455,0.000675,0.00321,0.001593,0.00288,0.002654,0.001974,0.001507,0.001777,0.00166,0.003029,0.001259,0.001422,0.000899,0.001272,8.5e-05,0.000813,0.000819,0.000256,0.000398,0.000574,0.000315,0.000319,4.9e-05,0.000295,0.000235,0.000669,0.000375,0.000102,0.000188,0.000111,0.000205,9.5e-05,8.2e-05,0.000149,6e-05,0.000904,0.000533,0.000411,0.000133,0.000186,7.8e-05,8.3e-05,6.8e-05,7e-06,1.8e-05,1.4e-05,3.1e-05,1.2e-05,4e-05
0.000147,7.3e-05,4.7e-05,9e-06,1.2e-05,1.2e-05,1.3e-05,1.2e-05,1e-05,2.1e-05,2.3e-05,5e-05,4.5e-05,2.2e-05,1.3e-05,7e-06,8e-06,2e-06,9e-06,1.8e-05,6e-06,1.2e-05,5e-06,1.3e-05,4e-06,4e-06,2.3e-05,1.5e-05,1.5e-05,4.5e-05,3.4e-05,2.8e-05,4e-05,0.000137,9.4e-05,0.000225,0.000121,0.000825,0.000219,0.00014,9.7e-05,7e-05,5.9e-05,2.7e-05,8.3e-05,0.000265,0.000118,0.000124,0.000151,0.000885,0.0011,0.000661,0.002592,0.000561,0.001373,0.002583,0.000489,0.001755,0.000671,0.001037,0.001354,0.00272,0.003072,0.003413,0.002142,0.001483,0.001058,0.00123,0.003361,0.001114,0.00142,0.00164,0.00034,0.000638,0.001199,0.002344,0.001402,0.000636,0.001692,0.001722,0.000555,0.001186,0.0011,0.000736,0.000135,0.001276,7e-04,0.000875,0.00068,0.000616,0.000423,0.000248,0.000411,0.000363,0.00019,0.000133,0.000263,0.000699,0.000134,0.000163,0.000324,0.000282,0.000143,0.000167,0.000285,8.5e-05,4.9e-05,0.000674,0.000508,0.000248,0.000109,0.000219,0.000132,8.9e-05,2.4e-05,3.9e-05,2.6e-05,2.5e-05,2.5e-05,2.2e-05,4.2e-05
4.7e-05,1e-04,6.4e-05,6.8e-05,3.7e-05,1.3e-05,1.5e-05,1e-05,6e-06,1.2e-05,1e-05,1.3e-05,5e-06,1.5e-05,2.5e-05,2.3e-05,3.2e-05,2e-05,7e-06,1.3e-05,1.5e-05,5e-06,1.1e-05,1.7e-05,1e-05,1.1e-05,2.5e-05,3.1e-05,2.4e-05,4.5e-05,6.1e-05,4e-05,4e-05,5.1e-05,3.8e-05,0.000162,0.000142,0.000761,0.000437,0.000127,0.000103,4.3e-05,2.9e-05,3e-05,7.8e-05,0.000234,0.000321,0.000338,0.000245,0.000726,0.001543,0.000773,0.001721,0.001498,0.00116,0.000925,0.001341,0.002071,0.001142,0.001171,0.001066,0.002303,0.002485,0.001692,0.00023,0.001326,0.000516,0.001426,0.0034,0.002827,0.001213,0.000185,0.000225,0.000957,0.001035,0.001404,0.001227,0.001946,0.00041,0.000496,0.001028,0.001594,0.000696,7.3e-05,0.000453,0.000503,0.000453,0.000418,2e-04,0.000361,0.000218,1e-04,0.000255,0.000281,0.000322,0.000345,9.9e-05,0.000544,0.000203,0.000133,0.000275,0.000127,3.1e-05,0.000115,0.000177,4.4e-05,5.8e-05,0.000647,0.000175,0.000167,8.5e-05,0.000203,9.4e-05,0.000123,0.000155,0.000114,0.000115,7.9e-05,5.3e-05,3.3e-05,2.8e-05
5e-05,3e-06,1.8e-05,2.1e-05,1e-05,5e-06,1.3e-05,1.1e-05,2e-06,6e-06,8e-06,4e-06,6e-06,3e-06,1e-06,6e-06,1e-05,8e-06,6e-06,7e-06,6e-06,8e-06,1.5e-05,5e-06,1e-05,1e-05,1.4e-05,1.7e-05,1.1e-05,2.2e-05,7e-06,3e-06,9e-06,9e-06,1.9e-05,3.7e-05,3e-06,0.000268,0.000222,0.000108,6.9e-05,2.1e-05,1e-05,1e-05,4.4e-05,0.000106,0.00015,6.1e-05,3.7e-05,0.000285,0.000765,0.000262,0.000354,0.000754,0.000827,0.000738,0.000827,0.000432,0.000528,0.000818,0.000581,0.000925,0.000307,0.000316,0.00026,0.000416,0.000275,0.000387,0.001216,2e-04,0.000862,6e-04,0.000323,0.000449,0.000662,0.000849,5e-04,0.000167,0.000392,0.00041,0.000443,0.000338,0.000113,0.000245,0.000183,9.5e-05,2.7e-05,4.4e-05,2.6e-05,9.3e-05,0.000115,2.5e-05,0.000105,4.9e-05,5.4e-05,5.2e-05,6e-05,0.000132,0.000154,3.9e-05,6.7e-05,2.2e-05,1.6e-05,5.3e-05,1e-06,2.6e-05,2.5e-05,0.000246,0.000134,2.9e-05,5.9e-05,3.3e-05,4.1e-05,2.6e-05,3.2e-05,1.4e-05,2.1e-05,1.3e-05,6e-06,1e-06,1.5e-05
4.8e-05,2.4e-05,1.2e-05,4e-06,4e-06,9e-06,1.3e-05,1.2e-05,1.1e-05,8e-06,3e-06,1.7e-05,9e-06,1.2e-05,1.3e-05,4e-06,8e-06,9e-06,3e-06,5e-06,1.2e-05,1.4e-05,9e-06,1.2e-05,1e-05,1.3e-05,1.1e-05,3e-06,1e-06,9e-06,1.7e-05,5e-06,9e-06,1.8e-05,1.2e-05,1.1e-05,6e-06,0.000185,0.000144,5.5e-05,3.4e-05,2e-05,1.5e-05,1.9e-05,4e-05,9.8e-05,9.5e-05,4.8e-05,5e-05,6.8e-05,0.001004,0.000437,0.000371,0.00101,0.000999,0.000192,0.000621,0.000558,0.000848,0.000346,0.00049,0.000117,0.00063,0.000647,0.000342,0.00046,0.000394,8.5e-05,0.00054,0.000548,0.000472,0.000245,0.000219,0.000454,0.000522,0.000285,5.1e-05,0.000109,7.2e-05,0.000182,0.000163,0.000219,9.6e-05,0.000252,0.000114,0.000139,6e-05,3e-06,2.4e-05,9.2e-05,7e-05,7.3e-05,0.000106,8e-05,3e-05,1e-05,4.7e-05,4e-05,0.000134,0.000128,2.9e-05,1.1e-05,1.2e-05,3.5e-05,7.3e-05,6.1e-05,1.4e-05,0.00014,5.3e-05,3.6e-05,1.8e-05,1.4e-05,3e-06,2.3e-05,1.7e-05,6e-06,1.9e-05,1e-05,1e-05,1.2e-05,1.4e-05
3.7e-05,1e-05,4e-06,1e-06,1e-06,5e-06,1e-06,5e-06,7e-06,5e-06,3e-06,1e-05,5e-06,9e-06,2e-06,4e-06,6e-06,6e-06,2e-06,0,6e-06,7e-06,4e-06,7e-06,2e-06,7e-06,3e-06,4e-06,3e-06,3e-06,1e-05,8e-06,6e-06,1.1e-05,1.3e-05,8e-06,9e-06,0.000137,8.9e-05,2.3e-05,1.3e-05,1e-05,1.6e-05,1.5e-05,5e-05,9.1e-05,0.000107,2.7e-05,6e-06,7.4e-05,0.000649,0.000434,0.000878,0.000561,0.000141,0.000489,0.000334,0.000234,0.000612,0.000168,4e-04,0.000435,0.000633,0.000296,0.000475,0.000619,0.000438,0.000493,0.000192,0.000116,0.00046,0.000185,0.000398,0.000371,0.000405,0.000509,0.00016,0.000124,1.3e-05,0.000152,0.00014,0.000212,9.7e-05,0.000138,0.000128,0.000167,3.4e-05,5.4e-05,4.4e-05,8.9e-05,2.5e-05,3.3e-05,9.6e-05,4.9e-05,2.2e-05,3.5e-05,1.9e-05,1.5e-05,4.8e-05,0.000119,2e-05,6e-06,1.3e-05,5.1e-05,6.3e-05,3.5e-05,9e-06,4.3e-05,1e-04,4e-05,1.9e-05,1.5e-05,1.8e-05,8e-06,1.4e-05,0,1.5e-05,4e-06,2e-06,5e-06,4e-06
4.1e-05,1.8e-05,5e-06,8e-06,5e-06,3e-06,4e-06,3e-06,2e-06,2e-06,3e-06,1e-06,1e-06,3e-06,3e-06,4e-06,1e-06,3e-06,0,2e-06,4e-06,5e-06,1e-06,7e-06,8e-06,6e-06,2e-06,5e-06,6e-06,9e-06,1e-05,1.2e-05,4e-06,1.4e-05,1e-05,5e-06,1.5e-05,0.000135,4.9e-05,2e-05,9e-06,1.1e-05,4e-06,1e-06,5.3e-05,0.00012,6.7e-05,5.9e-05,3.5e-05,0.000135,0.000521,0.000622,0.000923,0.001153,0.000592,0.00072,0.000525,0.000342,0.000129,0.000507,0.000368,0.000402,0.00032,0.000257,0.000344,0.000226,0.000408,0.000404,0.000204,0.00012,0.000344,0.000357,0.000261,0.000528,0.000515,0.00036,0.000188,2e-04,0.000109,0.000124,9.3e-05,0.000207,7.8e-05,0.00011,8.5e-05,9.4e-05,3.2e-05,2.8e-05,1.3e-05,6.6e-05,4.1e-05,4.6e-05,8e-05,5e-06,4.9e-05,4.5e-05,4.5e-05,4.5e-05,6.7e-05,8.2e-05,2e-05,2.4e-05,4e-06,4.4e-05,6.5e-05,4.4e-05,1.7e-05,9.1e-05,1.6e-05,2.2e-05,1.2e-05,2e-05,4e-06,6e-06,1.2e-05,2e-06,1.5e-05,7e-06,5e-06,3e-06,3e-06
3.3e-05,9e-06,1.4e-05,8e-06,4e-06,6e-06,0,3e-06,2e-06,3e-06,1e-06,8e-06,1.2e-05,1e-05,4e-06,2e-06,2e-06,5e-06,1e-06,2e-06,5e-06,4e-06,6e-06,6e-06,6e-06,4e-06,3e-06,3e-06,3e-06,7e-06,1.1e-05,7e-06,1.2e-05,2.3e-05,1.8e-05,1.1e-05,9e-06,0.000128,6e-05,4.2e-05,2.3e-05,8e-06,4e-06,7e-06,6.4e-05,7.5e-05,7.2e-05,2.7e-05,4.3e-05,0.000111,0.000378,5.2e-05,0.00036,0.00045,0.000198,0.00028,8.2e-05,0.000465,0.000686,0.000769,0.000164,0.000324,0.000164,0.000125,0.000197,0.000254,0.000224,0.000293,0.000284,0.00032,0.000159,0.000349,0.000196,0.000414,0.00013,0.000535,0.000104,0.000301,2.5e-05,8.6e-05,0.000134,0.000157,0.000173,0.000139,3.9e-05,0.000116,4.6e-05,5.2e-05,3.8e-05,7e-05,3.5e-05,5e-05,9.9e-05,2.2e-05,3.1e-05,3.3e-05,4.2e-05,6.8e-05,1.4e-05,5.9e-05,1.8e-05,1.6e-05,1.5e-05,4.8e-05,4.4e-05,3.3e-05,9e-06,0.000118,2.8e-05,1.8e-05,1.1e-05,2e-05,2.2e-05,7e-06,1e-06,6e-06,9e-06,5e-06,4e-06,6e-06,7e-06
2.6e-05,1.4e-05,1e-05,4e-06,6e-06,4e-06,4e-06,4e-06,6e-06,3e-06,2e-06,1.2e-05,5e-06,9e-06,6e-06,5e-06,6e-06,2e-06,2e-06,2e-06,6e-06,2e-06,4e-06,9e-06,3e-06,3e-06,3e-06,2e-06,5e-06,6e-06,7e-06,5e-06,8e-06,2.5e-05,1.3e-05,2.3e-05,1.9e-05,9.8e-05,1.3e-05,2.5e-05,6e-06,1.3e-05,5e-06,5e-06,5.9e-05,7.2e-05,0.000154,9.8e-05,9.6e-05,0.000107,2e-04,0.000387,0.000454,0.000394,0.000333,0.000323,0.000626,0.000487,0.000613,0.000326,0.000238,0.00025,0.000189,5.4e-05,0.000186,0.000253,0.000124,0.000209,0.000404,0.000272,0.000462,0.000269,0.000208,0.000316,0.00011,0.000323,0.000342,9.4e-05,4.9e-05,2.3e-05,8e-05,0.000173,9.4e-05,4.8e-05,5.3e-05,7.9e-05,6.8e-05,7.9e-05,6.2e-05,9.7e-05,4.8e-05,2.2e-05,6e-05,3.8e-05,3.9e-05,4.1e-05,4.3e-05,8.9e-05,6.1e-05,4.5e-05,4.2e-05,2.2e-05,1.2e-05,6.4e-05,3.2e-05,3.6e-05,1.1e-05,0.000105,7.8e-05,3e-05,1.3e-05,1.4e-05,1.1e-05,2e-06,6e-06,0,8e-06,5e-06,1e-06,5e-06,5e-06
3.6e-05,1.6e-05,1.1e-05,4e-06,2e-06,6e-06,2e-06,6e-06,5e-06,4e-06,4e-06,1.2e-05,9e-06,6e-06,4e-06,3e-06,3e-06,3e-06,4e-06,2e-06,4e-06,5e-06,3e-06,9e-06,5e-06,4e-06,1e-06,3e-06,3e-06,5e-06,5e-06,2e-06,1.2e-05,2.3e-05,1.8e-05,7e-06,7e-06,7.8e-05,8e-05,4.5e-05,2.7e-05,1.8e-05,1.2e-05,1.1e-05,4.6e-05,8.5e-05,0.00019,0.000116,5.9e-05,0.000104,0.000133,0.000224,0.000308,0.000366,0.000459,0.000518,0.000169,0.000358,0.000101,0.000281,0.000309,0.000128,0.000271,3.3e-05,0.000192,0.000246,3.8e-05,0.000366,0.000396,0.000119,0.000355,0.000267,6.2e-05,0.000261,9.9e-05,0.00021,0.00011,0.000267,0.000179,5.1e-05,0.000165,0.000107,8.8e-05,7e-05,7.4e-05,8.1e-05,9.1e-05,3.3e-05,9.3e-05,3.5e-05,1.2e-05,5.2e-05,6.3e-05,3.7e-05,2.2e-05,3.3e-05,2.6e-05,9.7e-05,2.8e-05,8e-05,4.5e-05,2.3e-05,1e-05,4.2e-05,2.7e-05,1.2e-05,1.7e-05,6.7e-05,8.6e-05,2.6e-05,2.1e-05,2e-05,1.5e-05,1.6e-05,3e-06,5e-06,9e-06,6e-06,1e-06,3e-06,5e-06
3.6e-05,3e-06,1e-05,9e-06,8e-06,7e-06,1e-05,4e-06,3e-06,3e-06,1e-06,1.4e-05,1e-05,8e-06,8e-06,4e-06,3e-06,4e-06,4e-06,1e-06,2e-06,3e-06,4e-06,3e-06,2e-06,6e-06,3e-06,5e-06,4e-06,5e-06,5e-06,3e-06,3e-06,2.7e-05,1.8e-05,1.6e-05,2e-06,3.9e-05,6.6e-05,3.3e-05,2.4e-05,8e-06,7e-06,1.4e-05,3.2e-05,3.1e-05,0.000126,9.1e-05,0.00011,8.1e-05,0.00028,0.000148,0.000282,0.000752,0.000345,0.000331,8.5e-05,6.9e-05,0.000244,0.000466,5.2e-05,0.000269,7.3e-05,0.000118,0.000114,0.000321,0.000115,0.000264,0.000301,9e-05,0.000441,7.4e-05,9.1e-05,0.000142,0.000239,0.000115,0.000194,0.000455,0.000115,7.7e-05,7.4e-05,0.000278,0.000145,8.5e-05,2.8e-05,8e-05,8.8e-05,0.000162,2.7e-05,0.000116,7e-05,3.9e-05,8.1e-05,2.6e-05,1e-05,2e-05,3.4e-05,8.9e-05,0.000116,0.000113,8.7e-05,2.4e-05,2.2e-05,4.5e-05,6.7e-05,4.6e-05,5e-06,5.5e-05,3.7e-05,4.7e-05,2.2e-05,2e-05,1.2e-05,1.9e-05,1.7e-05,1e-06,6e-06,3e-06,2e-06,9e-06,4e-06
2.5e-05,9e-06,1.2e-05,4e-06,4e-06,4e-06,3e-06,5e-06,1e-06,0,3e-06,1.3e-05,1e-06,3e-06,5e-06,1e-06,3e-06,3e-06,0,1e-06,1e-06,4e-06,6e-06,7e-06,4e-06,7e-06,1.2e-05,4e-06,0,4e-06,7e-06,3e-06,4e-06,2.2e-05,2e-05,4e-06,7e-06,4.3e-05,2.8e-05,9e-06,5e-06,2e-06,1.3e-05,7e-06,4.7e-05,5.6e-05,0.00012,3.3e-05,3.8e-05,0.000109,0.00028,0.000239,0.000353,0.000407,0.000386,0.00033,0.000271,0.000149,0.000103,0.000137,1.5e-05,9.8e-05,0.000187,0.000189,0.000178,0.000314,0.000182,0.000274,0.000202,6.2e-05,0.00058,0.000337,0.000169,9.7e-05,7.1e-05,0.000106,0.000194,0.000259,1e-04,9.9e-05,0.000139,0.000294,0.000154,0.000187,0.000145,0.000118,6.6e-05,0.000157,0.000169,0.000106,5.8e-05,4.2e-05,3.9e-05,5.4e-05,2.9e-05,6e-05,6e-05,0.000102,0.000124,7e-05,4.9e-05,5.6e-05,9e-06,4e-06,5.4e-05,5.6e-05,2e-05,7.4e-05,5.1e-05,5e-06,1.9e-05,2.4e-05,1.1e-05,1.8e-05,3e-06,7e-06,8e-06,5e-06,6e-06,5e-06,9e-06
3.6e-05,1.4e-05,1.1e-05,8e-06,5e-06,2e-06,2e-06,3e-06,5e-06,3e-06,2e-06,1.6e-05,4e-06,3e-06,3e-06,3e-06,2e-06,1e-06,3e-06,2e-06,2e-06,5e-06,7e-06,5e-06,4e-06,4e-06,7e-06,2e-06,4e-06,4e-06,9e-06,6e-06,1e-05,2.4e-05,2.5e-05,2e-05,1.1e-05,8.4e-05,2.6e-05,3e-06,1e-05,1e-05,7e-06,1.7e-05,6.4e-05,2.2e-05,0.000141,0.00011,6.3e-05,9.5e-05,0.000221,0.000215,0.000239,0.000218,5.5e-05,0.000284,0.000215,0.000151,0.000229,0.000391,0.000159,0.000128,0.000266,0.00015,0.000251,0.00018,0.000224,4.3e-05,0.000246,8e-05,0.000454,0.000133,0.000146,0.000139,3e-05,0.000208,9.9e-05,0.000117,5.6e-05,8.3e-05,0.000171,0.000255,0.000144,0.000177,8.3e-05,0.000127,4.9e-05,9e-05,3e-05,9.1e-05,5.8e-05,3e-05,8.3e-05,4.2e-05,7e-06,3.3e-05,3.5e-05,8.8e-05,1.8e-05,3.2e-05,4.3e-05,3.2e-05,2.6e-05,1.7e-05,4.4e-05,4.6e-05,4e-06,6e-05,5.1e-05,4.3e-05,3e-05,6e-06,1.9e-05,7e-06,5e-06,3e-06,3e-06,3e-06,6e-06,4e-06,4e-06
3.8e-05,8e-06,8e-06,7e-06,1.2e-05,5e-06,0,3e-06,3e-06,3e-06,1e-06,1.6e-05,5e-06,5e-06,6e-06,3e-06,3e-06,3e-06,4e-06,0,4e-06,2e-06,4e-06,2e-06,8e-06,2e-06,4e-06,7e-06,4e-06,7e-06,9e-06,4e-06,5e-06,1.8e-05,1e-05,1.1e-05,2.2e-05,0.000118,4.8e-05,5e-06,9e-06,1.6e-05,1.1e-05,1.5e-05,6.7e-05,5.7e-05,8.9e-05,2.2e-05,2.1e-05,9.1e-05,0.000173,0.000239,3.9e-05,0.000306,9.1e-05,0.000226,0.000165,2e-04,0.000241,0.00035,0.000152,0.000167,0.000289,0.000292,5e-05,0.000169,0.000131,0.000185,0.000124,0.000301,0.000552,0.000183,0.000102,0.000139,5.1e-05,0.000244,1.7e-05,0.000238,0.000107,3.2e-05,0.000102,0.000199,0.000109,0.000109,8.1e-05,4.1e-05,0.000115,7.9e-05,2.4e-05,4.8e-05,4.8e-05,7.4e-05,0.000121,2.9e-05,4e-05,2.1e-05,4e-05,9.2e-05,9.2e-05,5.4e-05,1.5e-05,1.1e-05,9e-06,2.5e-05,4e-05,1.7e-05,1.3e-05,3.5e-05,5.7e-05,4.9e-05,1.3e-05,1.9e-05,1.1e-05,1.3e-05,2e-06,3e-06,4e-06,4e-06,7e-06,1e-06,5e-06
1.9e-05,1.8e-05,5e-06,7e-06,3e-06,3e-06,2e-06,1e-06,4e-06,1e-06,0,1.5e-05,1.2e-05,6e-06,5e-06,4e-06,4e-06,3e-06,2e-06,2e-06,3e-06,4e-06,4e-06,1e-06,5e-06,8e-06,1e-05,1.1e-05,1.3e-05,1e-06,1.2e-05,1.2e-05,1.5e-05,1.4e-05,3.2e-05,3.5e-05,2.8e-05,0.000137,4.8e-05,2.4e-05,1.5e-05,8e-06,6e-06,3e-06,6.1e-05,3.7e-05,4.9e-05,3.8e-05,5.1e-05,5.7e-05,0.000139,0.000171,0.000182,0.000313,0.000146,0.000315,0.000119,0.000161,0.00022,0.000277,6.7e-05,0.00013,4e-05,0.000238,0.000182,0.000203,8.2e-05,0.000163,2.6e-05,0.000259,0.000266,0.000114,1.7e-05,8.7e-05,7.7e-05,0.000229,0.000172,0.000241,0.000149,9.5e-05,7.9e-05,8e-05,7.1e-05,3.5e-05,1.3e-05,6.8e-05,6.1e-05,9e-05,9.7e-05,3.6e-05,0.000115,2.7e-05,4.8e-05,3e-05,4.5e-05,3.4e-05,3e-05,0.000101,9.6e-05,8.1e-05,2e-05,2.6e-05,1.5e-05,2.1e-05,5.8e-05,4.5e-05,9e-06,1.9e-05,4.5e-05,2.7e-05,2.6e-05,1.8e-05,1.4e-05,5e-06,7e-06,4e-06,1.2e-05,4e-06,3e-06,8e-06,4e-06
1.5e-05,1.2e-05,8e-06,1.2e-05,3e-06,4e-06,3e-06,1e-06,2e-06,2e-06,2e-06,1.3e-05,7e-06,4e-06,8e-06,3e-06,4e-06,3e-06,3e-06,1e-06,2e-06,4e-06,5e-06,2e-06,2e-06,6e-06,8e-06,3e-06,8e-06,1.1e-05,1.4e-05,1e-05,1.4e-05,1.2e-05,3.8e-05,1.5e-05,1.8e-05,0.000112,6.6e-05,4e-05,2.3e-05,1.3e-05,2.3e-05,1.7e-05,8e-05,2.2e-05,3.3e-05,9e-06,3.2e-05,7.9e-05,0.000106,0.000268,0.000323,0.00048,0.000124,0.000231,0.00013,4e-04,0.000469,0.000389,0.000122,1e-05,0.000264,0.000106,0.00017,0.000236,6e-05,0.000264,0.000273,0.000251,0.000443,0.000128,3.8e-05,4.8e-05,9.1e-05,0.000248,0.000197,3e-04,8.7e-05,0.00012,6.1e-05,5.2e-05,0.000178,0.000115,5.5e-05,7.5e-05,4.4e-05,9.6e-05,9.2e-05,0.00011,4.9e-05,5.3e-05,5.8e-05,3.1e-05,2.3e-05,2.5e-05,2e-05,7.8e-05,5.8e-05,3.6e-05,1.9e-05,1.4e-05,4e-06,2.5e-05,5.4e-05,2.5e-05,2.1e-05,4.4e-05,5e-06,1.2e-05,1.8e-05,1.8e-05,9e-06,9e-06,1.2e-05,2e-06,1.3e-05,1.1e-05,8e-06,4e-06,6e-06
3.7e-05,1e-05,3e-06,7e-06,1.1e-05,8e-06,3e-06,3e-06,3e-06,2e-06,2e-06,1.4e-05,5e-06,9e-06,4e-06,1e-06,4e-06,3e-06,3e-06,0,2e-06,1e-06,2e-06,1e-06,2e-06,7e-06,9e-06,8e-06,7e-06,7e-06,9e-06,1.3e-05,1.3e-05,1.6e-05,3e-05,4e-05,1.9e-05,0.000116,8.2e-05,4.3e-05,2.2e-05,1.7e-05,2.1e-05,1.9e-05,9.8e-05,9.1e-05,1.9e-05,2.2e-05,2.3e-05,4.4e-05,0.000154,0.000184,0.000187,0.00054,7.7e-05,0.000328,0.000176,0.000486,7e-05,0.000344,8.7e-05,0.000131,0.000339,0.00026,0.000225,0.000259,0.000106,0.000211,0.000361,0.000215,0.000195,9.2e-05,9e-05,6e-05,5.8e-05,2e-04,0.00018,0.000145,8.6e-05,4e-06,8.4e-05,0.000112,0.000129,3e-05,7.2e-05,2.7e-05,6.7e-05,9.6e-05,3.1e-05,8.7e-05,4.9e-05,3.5e-05,6.8e-05,7e-06,2.4e-05,4.3e-05,1.6e-05,8e-05,1.6e-05,2.9e-05,7e-06,1.5e-05,1.5e-05,2.4e-05,5.7e-05,5.1e-05,2.4e-05,6.8e-05,3.3e-05,2.9e-05,2.6e-05,3e-05,1.3e-05,1.3e-05,8e-06,5e-06,6e-06,3e-06,5e-06,9e-06,1.2e-05
4.4e-05,1.6e-05,1e-05,2e-06,6e-06,2e-06,2e-06,2e-06,3e-06,2e-06,1e-06,1.2e-05,8e-06,2e-06,2e-06,1e-06,2e-06,1e-06,3e-06,1e-06,1e-06,0,1e-06,2e-06,2e-06,4e-06,1e-05,6e-06,1.1e-05,6e-06,1.1e-05,5e-06,2e-06,1.4e-05,2.5e-05,7e-06,3.1e-05,9.1e-05,0.000125,5.3e-05,1.8e-05,6e-06,1.6e-05,3e-06,9.9e-05,9.1e-05,8.4e-05,7.2e-05,6.3e-05,7.6e-05,0.000273,0.000325,0.000232,0.000447,1e-05,0.000293,0.00017,0.00035,0.000234,0.000326,4e-05,0.000271,5.6e-05,2e-04,0.000141,0.000182,0.000179,0.000231,0.000323,8.9e-05,0.000189,2.4e-05,6.2e-05,7.2e-05,0.000105,0.000252,0.000157,0.000151,9e-05,0.000245,0.000185,0.000217,0.000237,0.000241,0.000134,0.000134,8.1e-05,0.000116,9e-05,8.9e-05,4.4e-05,2.1e-05,2.1e-05,1.2e-05,1.8e-05,3.7e-05,1.1e-05,0.000112,2.8e-05,3.5e-05,2.4e-05,4e-05,2.6e-05,1.5e-05,2e-05,5e-05,9e-06,5.7e-05,5.1e-05,3.1e-05,1.8e-05,8e-06,6e-06,5e-06,4e-06,1e-06,4e-06,8e-06,1.4e-05,9e-06,5e-06
2.9e-05,1.2e-05,6e-06,5e-06,1e-06,1e-06,3e-06,4e-06,1e-06,2e-06,2e-06,1e-05,3e-06,2e-06,2e-06,2e-06,1e-06,2e-06,2e-06,2e-06,2e-06,3e-06,4e-06,3e-06,2e-06,2e-06,1e-05,3e-06,9e-06,6e-06,6e-06,7e-06,1e-06,1.5e-05,9e-06,1.8e-05,1.9e-05,7e-05,0.000131,6.6e-05,2.7e-05,1.3e-05,1.1e-05,9e-06,7.5e-05,3.3e-05,6.1e-05,7.4e-05,0.000102,3.5e-05,0.000282,0.000295,0.000304,0.000492,0.000378,0.000101,0.000353,0.000465,0.000223,6.5e-05,0.000186,0.00026,8.9e-05,9.7e-05,0.000103,0.00011,0.000144,7.6e-05,0.000254,0.000204,5.5e-05,0.000109,2.9e-05,0.000125,5.2e-05,0.000231,9.3e-05,0.000173,0.000107,0.000319,0.000179,6.4e-05,0.000185,0.000169,0.000202,7.2e-05,3.1e-05,8.5e-05,7e-05,1.2e-05,8.6e-05,5.8e-05,1.4e-05,5.4e-05,2.7e-05,4.4e-05,4.2e-05,0.000136,0.00012,8.2e-05,4.5e-05,6.6e-05,3.5e-05,2.9e-05,2.8e-05,4.5e-05,1.8e-05,4.5e-05,5.1e-05,8e-06,5e-06,3e-06,4e-06,8e-06,1e-05,4e-06,1.2e-05,6e-06,9e-06,3e-06,6e-06
1.4e-05,1.8e-05,1e-05,5e-06,3e-06,4e-06,4e-06,2e-06,1e-06,1e-06,1e-06,9e-06,6e-06,6e-06,3e-06,1e-06,1e-06,3e-06,1e-06,3e-06,0,1e-06,4e-06,2e-06,1e-06,1e-06,3e-06,5e-06,3e-06,2e-06,4e-06,4e-06,6e-06,6e-06,4e-06,1.4e-05,9e-06,5.1e-05,8.6e-05,5.6e-05,2.6e-05,7e-06,1e-05,2e-06,4.3e-05,2.6e-05,2.6e-05,3.4e-05,5e-05,9.7e-05,0.000335,0.000348,0.000236,0.000223,0.000317,0.000413,0.000239,0.000276,0.000176,2.7e-05,3.2e-05,0.000175,0.000299,0.000135,0.00019,0.000166,0.000149,6.3e-05,5.2e-05,0.000169,0.000133,3.6e-05,6.4e-05,0.00016,0.000168,0.000321,4.5e-05,0.000257,0.00015,0.000334,0.000149,5.4e-05,0.000128,0.000144,0.000158,8.2e-05,2.3e-05,4e-06,5.5e-05,4.7e-05,6.9e-05,9.5e-05,0.000137,4.5e-05,4.1e-05,4.1e-05,3.6e-05,0.000129,0.000106,4.8e-05,1.1e-05,3.2e-05,2.7e-05,1.8e-05,2.3e-05,4.4e-05,2.7e-05,1.5e-05,2.4e-05,1.7e-05,9e-06,1.3e-05,1e-05,1.6e-05,3e-06,5e-06,1.3e-05,6e-06,3e-06,4e-06,2e-06
1.6e-05,2e-06,6e-06,5e-06,0,2e-06,1e-06,2e-06,1e-06,1e-06,2e-06,8e-06,6e-06,4e-06,1e-06,1e-06,1e-06,1e-06,1e-06,1e-06,1e-06,1e-06,4e-06,1e-06,1e-06,0,2e-06,2e-06,1e-06,2e-06,3e-06,2e-06,5e-06,6e-06,5e-06,1e-05,1e-05,3.8e-05,3e-05,7e-06,3e-06,7e-06,6e-06,8e-06,2.2e-05,1.6e-05,1.2e-05,2.1e-05,3.5e-05,7.3e-05,0.000294,0.000465,0.000337,0.000288,0.000236,0.000174,0.000158,0.000153,0.000127,0.000117,0.000141,0.000111,7.2e-05,0.000131,0.000146,0.000259,7.2e-05,0.000183,4.4e-05,0.000171,0.000252,9.4e-05,6.7e-05,0.000139,0.000126,0.000176,5.6e-05,0.000174,4e-05,0.000113,2e-05,0.000126,3e-05,8e-05,2.1e-05,4.7e-05,3.6e-05,2.7e-05,3.1e-05,2.2e-05,1.2e-05,5.8e-05,5.6e-05,8e-06,2.7e-05,2.3e-05,2e-05,0.000111,2.9e-05,4e-06,9e-06,1.2e-05,1.5e-05,1.7e-05,1.5e-05,1.7e-05,7e-06,4.1e-05,2.1e-05,2e-06,1e-06,8e-06,7e-06,8e-06,2e-06,2e-06,8e-06,6e-06,5e-06,4e-06,5e-06
1.7e-05,7e-06,6e-06,1e-06,0,1e-06,2e-06,1e-06,0,1e-06,1e-06,8e-06,6e-06,3e-06,2e-06,0,1e-06,2e-06,1e-06,2e-06,1e-06,1e-06,4e-06,2e-06,1e-06,0,3e-06,1e-06,0,2e-06,3e-06,1e-06,4e-06,5e-06,3e-06,7e-06,8e-06,2.9e-05,1.2e-05,1.3e-05,6e-06,7e-06,1e-06,5e-06,1.2e-05,1.7e-05,1.9e-05,7e-06,1.8e-05,7.7e-05,0.00028,0.000331,0.000151,0.000364,0.000164,0.000135,0.000162,0.000118,2.6e-05,0.000249,6.7e-05,1e-04,7e-05,5.4e-05,6.6e-05,0.000198,6.5e-05,0.000126,9.7e-05,0.000157,0.000137,4.3e-05,5.3e-05,0.000184,9.2e-05,0.000218,2.5e-05,0.000134,2.7e-05,0.000109,2e-05,0.000148,3.2e-05,4.3e-05,1.9e-05,3.3e-05,1.2e-05,1.7e-05,1.2e-05,3.5e-05,1.3e-05,3.3e-05,5.6e-05,3e-06,1.2e-05,1.4e-05,2e-05,9.7e-05,1.9e-05,2.3e-05,1.8e-05,4e-06,9e-06,1.6e-05,2.3e-05,2.1e-05,3e-06,3.9e-05,9e-06,7e-06,1e-06,5e-06,6e-06,7e-06,2e-06,0,7e-06,4e-06,3e-06,2e-06,5e-06
1.8e-05,4e-06,1e-06,3e-06,1e-06,1e-06,1e-06,2e-06,1e-06,0,1e-06,7e-06,5e-06,1e-06,2e-06,0,1e-06,2e-06,2e-06,1e-06,1e-06,0,3e-06,1e-06,1e-06,0,3e-06,1e-06,0,1e-06,3e-06,1e-06,4e-06,4e-06,4e-06,5e-06,7e-06,1.7e-05,8e-06,7e-06,3e-06,3e-06,2e-06,4e-06,1.3e-05,1.3e-05,1.8e-05,2e-06,7e-06,7.3e-05,0.000279,0.000285,0.00025,0.000299,0.000149,0.000169,5.3e-05,0.000108,4.9e-05,0.000151,9.2e-05,3.3e-05,8.5e-05,0.000107,8.1e-05,0.000192,1e-05,0.000126,0.000152,7.3e-05,0.000213,2.5e-05,2.7e-05,0.000132,9.1e-05,0.00014,4.2e-05,0.000137,2.1e-05,0.000102,3.3e-05,0.000126,2.1e-05,3.9e-05,4.3e-05,4.7e-05,8e-06,2.1e-05,1.4e-05,3.2e-05,5e-06,2.7e-05,5.5e-05,1e-06,8e-06,1.1e-05,1.9e-05,8.3e-05,1.6e-05,2.4e-05,1.2e-05,2e-06,7e-06,1.8e-05,1.9e-05,2.4e-05,3e-06,2.9e-05,1e-05,5e-06,4e-06,2e-06,3e-06,4e-06,3e-06,2e-06,6e-06,3e-06,3e-06,2e-06,4e-06
