0.18295,0.18026,0.195182,0.211173,0.215391,0.243284,0.250617,0.203103,0.185895,0.220338,0.241033,0.219437,0.196657,0.18163,0.179658,0.188371,0.222534,0.252087,0.239839,0.206198,0.178956,0.185552,0.190072,0.184114,0.172772,0.16435,0.16356,0.152956
0.219466,0.221807,0.245538,0.267282,0.270093,0.301739,0.310247,0.251544,0.23142,0.273734,0.295414,0.272474,0.250841,0.230037,0.227807,0.237704,0.283805,0.331752,0.316722,0.266202,0.23059,0.242498,0.245822,0.235935,0.21646,0.195129,0.191248,0.187325
0.276036,0.290591,0.329225,0.359623,0.358061,0.392629,0.401262,0.329656,0.307557,0.360086,0.380501,0.356973,0.341389,0.312065,0.309204,0.321231,0.387285,0.468875,0.451609,0.371371,0.320746,0.342907,0.343658,0.325987,0.292721,0.245762,0.233069,0.245054
0.312344,0.33702,0.383349,0.417218,0.405905,0.434659,0.444425,0.378273,0.356259,0.405395,0.424134,0.405508,0.399515,0.368877,0.366871,0.379315,0.453323,0.555479,0.53847,0.440612,0.382787,0.412273,0.408035,0.381138,0.340846,0.276342,0.256097,0.286689
0.337802,0.370978,0.409801,0.427483,0.402925,0.422189,0.44521,0.404617,0.373521,0.399195,0.427524,0.422424,0.41446,0.390203,0.388864,0.401291,0.454721,0.535376,0.518402,0.432535,0.385336,0.411162,0.40397,0.370243,0.335086,0.288939,0.275686,0.304552
0.427635,0.47451,0.487378,0.467835,0.439361,0.462237,0.516615,0.506276,0.461386,0.46544,0.507509,0.507521,0.474409,0.447885,0.440074,0.457625,0.475314,0.498912,0.468136,0.40455,0.375141,0.386305,0.392184,0.3647,0.341471,0.345527,0.346181,0.341571
0.659628,0.733685,0.716262,0.664497,0.646187,0.696732,0.760885,0.741001,0.699959,0.711874,0.762705,0.763064,0.687266,0.611251,0.608202,0.67108,0.700493,0.699422,0.615945,0.521588,0.500257,0.515303,0.542551,0.512014,0.496829,0.554395,0.550479,0.497559
1.094599,1.244479,1.19098,1.082989,1.080793,1.189743,1.249268,1.178533,1.143317,1.162041,1.190346,1.21279,1.115134,0.925622,0.933819,1.123933,1.220865,1.233864,1.053411,0.852464,0.82242,0.836543,0.878867,0.849564,0.863137,0.986176,0.960653,0.844736
1.781875,2.035109,1.933853,1.75509,1.780766,1.960275,2.011789,1.872911,1.828762,1.823898,1.783036,1.856306,1.779616,1.432448,1.460508,1.868888,2.08592,2.103214,1.75313,1.379746,1.322757,1.313872,1.36163,1.342476,1.449341,1.718228,1.653746,1.411547
2.583917,2.940783,2.816481,2.560537,2.604484,2.87609,2.92062,2.713638,2.657894,2.597895,2.480883,2.636312,2.612493,2.077163,2.099682,2.80164,3.19648,3.177664,2.600467,2.029766,1.92958,1.877192,1.900376,1.876425,2.180956,2.735633,2.627317,2.178679
3.168354,3.561738,3.44416,3.122672,3.162826,3.524798,3.559032,3.313869,3.297576,3.20694,3.031276,3.254824,3.2955,2.604887,2.564148,3.522332,4.102352,3.990773,3.214082,2.521916,2.407757,2.355585,2.319275,2.240817,2.800558,3.72322,3.581275,2.896138
3.09552,3.406178,3.355514,3.028876,3.01407,3.406518,3.43188,3.225826,3.326746,3.239556,3.0146,3.249052,3.335813,2.646414,2.522129,3.507702,4.165732,3.935652,3.126043,2.511319,2.462279,2.50944,2.400075,2.225024,2.935565,4.074957,3.923783,3.116652
2.327967,2.458914,2.485116,2.25397,2.175333,2.503956,2.526804,2.404267,2.595632,2.529365,2.287644,2.44891,2.54157,2.05654,1.927964,2.653496,3.170219,2.893828,2.287289,1.928626,2.014813,2.208136,2.0573,1.811303,2.398302,3.360879,3.241575,2.552039
1.50397,1.50933,1.486668,1.375574,1.389722,1.568564,1.518168,1.495756,1.665201,1.575094,1.394112,1.477691,1.53518,1.363321,1.342922,1.645837,1.83764,1.637704,1.369759,1.269177,1.440155,1.663681,1.520016,1.289075,1.535262,2.00395,1.956686,1.595484
1.522727,1.501112,1.265585,1.088863,1.357949,1.579111,1.434545,1.41828,1.603835,1.565386,1.489219,1.494939,1.452744,1.508667,1.673499,1.731555,1.561351,1.345103,1.27293,1.264005,1.418252,1.566676,1.541606,1.479377,1.40635,1.361746,1.359481,1.295311
2.272747,2.278699,1.890139,1.557116,1.969905,2.323856,2.113135,2.053997,2.354286,2.411331,2.356862,2.305483,2.158457,2.254455,2.551308,2.603578,2.236448,1.913315,1.825191,1.804265,2.060636,2.231801,2.234068,2.243838,2.119075,1.934851,1.878107,1.874084
3.041022,3.187317,2.760656,2.2326,2.61459,3.116876,2.943888,2.75723,3.107847,3.372546,3.34555,3.205741,3.005049,3.097596,3.460741,3.506486,2.982249,2.575962,2.453273,2.417796,2.815455,3.032576,3.044787,3.078852,2.979721,2.780022,2.654601,2.661802
3.512557,3.833268,3.463998,2.809191,3.024471,3.620582,3.538365,3.192613,3.491074,3.999394,4.004925,3.714996,3.60452,3.77323,4.031019,3.965858,3.390672,2.944056,2.801904,2.774657,3.205596,3.41316,3.491361,3.557843,3.550788,3.440173,3.274904,3.28091
3.858481,4.030067,3.710831,3.253575,3.378753,3.856931,3.658681,3.192855,3.417074,4.121716,4.076506,3.540441,3.732554,4.271288,4.227083,3.874037,3.559093,3.081186,2.780609,2.789794,3.045114,3.119219,3.334465,3.41582,3.463651,3.477491,3.379804,3.441557
4.265431,4.020199,3.68045,3.529365,3.583082,3.909185,3.585338,3.098812,3.305065,3.972194,3.703299,3.046164,3.732431,4.657799,4.157348,3.635578,3.862798,3.198168,2.610318,2.706815,2.663654,2.710317,3.084745,2.932486,2.812757,2.838494,2.911771,3.067199
4.230671,3.701857,3.458236,3.640732,3.635901,3.618681,3.283362,3.071992,3.247794,3.452537,3.041824,2.6948,3.788397,4.725533,3.962662,3.496538,3.889241,2.989954,2.298106,2.574402,2.533331,2.799173,3.222022,2.672055,2.35273,2.255897,2.303419,2.54455
3.647801,3.265812,2.975811,3.181315,3.284735,3.045947,2.749534,2.762416,2.813707,2.565534,2.338079,2.519326,3.646616,4.285104,3.492067,3.093653,3.193968,2.309388,1.854251,2.193024,2.283769,2.805193,3.232401,2.492277,2.125534,2.000142,1.913612,2.08973
2.74546,2.545426,2.230409,2.313443,2.544587,2.362034,1.992744,1.984415,2.067163,1.779034,1.77568,2.155739,2.891353,3.25363,2.694865,2.2634,2.069206,1.578225,1.432609,1.628577,1.770227,2.322338,2.597581,1.955099,1.721373,1.646911,1.492437,1.593722
1.995938,1.861445,1.655269,1.631225,1.799488,1.762871,1.359305,1.235373,1.553966,1.645253,1.536325,1.527101,1.779234,2.022051,1.803111,1.443068,1.247078,1.193541,1.255591,1.247152,1.265132,1.571025,1.617692,1.303367,1.299466,1.294574,1.162508,1.179154
1.800576,1.664511,1.59891,1.574057,1.522944,1.41254,1.200272,1.190132,1.700251,2.060609,1.688479,1.172453,1.212804,1.440487,1.377645,1.189829,1.138904,1.212086,1.261586,1.203358,1.123589,1.10435,1.105697,1.144569,1.237873,1.275701,1.192626,1.049179
2.050411,1.909496,1.725309,1.626835,1.464954,1.286627,1.27135,1.379879,1.995966,2.491732,1.93222,1.207082,1.28133,1.418233,1.311302,1.195534,1.240478,1.347138,1.38071,1.385114,1.219787,1.068002,1.222221,1.31615,1.286502,1.38533,1.37523,1.181769
2.246684,2.072085,1.727318,1.483561,1.440504,1.384524,1.406916,1.563557,2.133801,2.523382,2.035147,1.47507,1.514487,1.542525,1.402836,1.247221,1.333327,1.463226,1.502238,1.534022,1.305263,1.214036,1.491405,1.499876,1.369938,1.472483,1.483427,1.321235
2.132576,1.907415,1.616484,1.272904,1.299792,1.492426,1.548398,1.650303,1.945629,2.007093,1.817864,1.66058,1.602397,1.583521,1.469117,1.211522,1.395568,1.617632,1.547481,1.471063,1.204925,1.254568,1.596924,1.575685,1.462972,1.562009,1.515837,1.39112
1.650536,1.417818,1.302667,1.152939,1.206831,1.405968,1.45972,1.47263,1.502277,1.356316,1.433189,1.624543,1.462455,1.376519,1.315708,1.072847,1.370166,1.660337,1.447268,1.260796,1.06206,1.159165,1.442223,1.383339,1.284527,1.422969,1.38891,1.352679
1.057054,0.902388,0.847838,0.956631,1.014229,1.048201,1.130146,1.214012,1.168549,1.036663,1.161886,1.395552,1.30791,1.210676,1.083621,0.883582,1.161028,1.460993,1.30664,1.118685,0.99236,0.984283,1.16388,1.063949,0.878823,0.994903,1.056213,1.167414
0.569686,0.560012,0.556249,0.699954,0.684117,0.620473,0.782898,0.983162,0.882829,0.718725,0.787269,0.97351,1.069988,1.025937,0.831324,0.674394,0.80971,1.110839,1.111539,0.980722,0.930609,0.791046,0.790875,0.690631,0.506422,0.556171,0.723596,0.90984
0.430524,0.455936,0.442118,0.475303,0.389904,0.359412,0.536992,0.743242,0.640961,0.435167,0.417436,0.560624,0.828453,0.806855,0.534685,0.427425,0.480118,0.801115,0.921031,0.784507,0.781157,0.631776,0.474233,0.37732,0.309931,0.390506,0.543566,0.629302
0.430583,0.432345,0.387726,0.306573,0.210187,0.246019,0.382491,0.494605,0.424109,0.279999,0.295666,0.365108,0.571948,0.570809,0.337421,0.284578,0.330163,0.574167,0.685537,0.557184,0.55197,0.513331,0.380795,0.304207,0.277519,0.350413,0.463353,0.466493
0.422269,0.431084,0.36471,0.258641,0.173394,0.234637,0.339345,0.378013,0.330921,0.250849,0.290796,0.29239,0.338494,0.367241,0.279156,0.268116,0.290475,0.421795,0.492358,0.430691,0.381142,0.375124,0.347692,0.323672,0.285567,0.305678,0.380481,0.350117
0.419933,0.456131,0.369968,0.247514,0.176262,0.23408,0.312223,0.3558,0.334967,0.243329,0.282957,0.23973,0.193763,0.253698,0.278433,0.281547,0.257813,0.312878,0.385912,0.396707,0.305933,0.272484,0.358886,0.398436,0.305725,0.258778,0.278532,0.235392
0.372902,0.443191,0.353132,0.20489,0.163882,0.217832,0.27201,0.30565,0.297426,0.206298,0.228948,0.189778,0.157954,0.228417,0.273774,0.265873,0.222776,0.21435,0.256625,0.3215,0.278828,0.238107,0.356078,0.454825,0.343095,0.237745,0.215303,0.173601
0.272929,0.356476,0.302773,0.158878,0.140322,0.199421,0.248189,0.240668,0.224132,0.170916,0.165242,0.136103,0.148993,0.239206,0.264607,0.213798,0.173226,0.137724,0.144008,0.224879,0.240012,0.224937,0.337005,0.442099,0.337775,0.217252,0.174368,0.145858
0.221633,0.25398,0.234594,0.130291,0.117959,0.214365,0.241573,0.178274,0.168572,0.15072,0.113412,0.099757,0.15561,0.279702,0.263988,0.145473,0.120093,0.111542,0.117272,0.183762,0.2028,0.208955,0.303442,0.355599,0.267243,0.18372,0.146591,0.116884
0.233998,0.183855,0.164643,0.121904,0.116816,0.231312,0.229994,0.137533,0.136902,0.128697,0.072378,0.071499,0.15286,0.29991,0.243981,0.096818,0.099132,0.111321,0.117332,0.179232,0.192619,0.164472,0.226633,0.231059,0.164046,0.12791,0.104282,0.093485
0.230702,0.133603,0.138754,0.129598,0.133685,0.225527,0.196705,0.096715,0.112967,0.104517,0.047026,0.043768,0.129439,0.276395,0.208008,0.084589,0.101229,0.107557,0.115965,0.171989,0.182565,0.117371,0.139852,0.128961,0.095004,0.087685,0.06525,0.094484
