-6.7e-05,-5.5e-05,-3.6e-05,-0.000272,-0.000409,-9.8e-05,-4.5e-05,-0.002152,-0.011248,-0.029036,-0.009426,-0.043723,-0.135838,-0.159961,-0.156236,-0.152922,-0.150081,-0.128472,-0.066767,-0.030458,-0.01613,-0.007284,-0.003127,-0.004712,-0.010135,-0.026769,-0.046937,-0.015392
-5.2e-05,-5e-05,-2.7e-05,-0.000171,-0.000231,-4.9e-05,-2.3e-05,-0.00171,-0.011385,-0.033926,-0.010795,0.03868,0.144785,0.180789,0.177508,0.167974,0.168001,0.141463,0.071748,0.028594,0.00266,0.000318,8.1e-05,-0.0011,-0.007175,-0.020847,-0.021573,-0.005845
2.9e-05,1.7e-05,1.3e-05,0.00011,0.000157,3.4e-05,1.3e-05,0.000465,0.001871,0.002349,-7.2e-05,0.004292,0.006968,-0.000478,-0.003749,-0.005087,-0.008742,-0.001136,-0.002994,-0.006587,-0.003634,-0.000921,-0.00106,-0.001199,-0.001812,0.005886,0.027035,0.007212
6.6e-05,5.9e-05,3.3e-05,0.000239,0.000327,7.5e-05,2.7e-05,0.001272,0.010535,0.032491,0.007189,-0.040159,-0.138916,-0.170364,-0.168185,-0.16076,-0.162097,-0.140515,-0.071717,-0.028858,-0.003027,4.9e-05,-0.003064,-0.004605,0.000896,0.014652,0.022386,0.006436
8e-06,2e-05,5e-06,3.1e-05,5.5e-05,1.4e-05,1.1e-05,0.000369,0.005241,0.020698,0.00797,0.030094,0.10657,0.137967,0.138117,0.134257,0.139221,0.111567,0.061426,0.033489,0.017368,0.007322,0.001983,0.001537,0.004166,4.6e-05,-0.021983,-0.003426
-6e-05,-4.8e-05,-3.2e-05,-0.000227,-0.000306,-7.7e-05,-3.1e-05,-0.000671,-0.00528,-0.01481,-0.004494,0.01473,0.054824,0.060996,0.061636,0.065435,0.062619,0.060472,0.030317,0.007709,-0.000447,-0.001173,-0.000538,-0.000424,0.000522,-0.012505,-0.036737,-0.011291
-4e-05,-4.9e-05,-2.1e-05,-0.00011,-0.000153,-3.6e-05,-2.3e-05,-0.000469,-0.007271,-0.027777,-0.009086,-0.043364,-0.145884,-0.180532,-0.177623,-0.164421,-0.170973,-0.145619,-0.077369,-0.036108,-0.017578,-0.007862,-0.003382,-0.003763,-0.003576,-0.002973,0.0068,-0.001962
2.6e-05,1.2e-05,1.5e-05,0.000125,0.000167,3.9e-05,1.9e-05,0.000164,-0.000587,-0.006055,-0.001592,0.011113,0.047384,0.07244,0.067539,0.051564,0.061116,0.042979,0.021664,0.014431,0.002381,0.001697,0.001747,0.002434,-0.000745,0.006436,0.032024,0.009316
4.4e-05,4.8e-05,2.1e-05,0.000125,0.000153,2.9e-05,1.9e-05,-0.000134,0.004185,0.01853,0.005791,0.029963,0.099386,0.119916,0.11334,0.098019,0.09946,0.096161,0.047766,0.016558,0.006473,0.003217,0.003069,0.004923,0.000508,5.6e-05,0.001467,0.003506
6e-06,2.2e-05,3e-06,-7e-06,-5e-06,3e-06,-6e-06,-0.00037,0.002978,0.017412,0.003752,-0.027849,-0.1024,-0.14256,-0.138981,-0.122242,-0.133895,-0.106146,-0.052325,-0.023901,-0.002,-0.000947,-0.001943,-0.002798,-0.000843,-0.001895,-0.020299,-0.005047
-3.1e-05,-2.6e-05,-1.4e-05,-0.000118,-0.000133,-2.8e-05,-1.7e-05,0.00033,-0.000285,-0.002687,-9e-05,-0.00534,-0.011118,-0.002675,0.001792,0.005134,0.016532,-0.003857,-0.001396,0.0089,0.005639,0.001996,-0.0019,-0.003939,0.000293,0.004241,0.002639,-0.001031
-2.2e-05,-3.3e-05,-7e-06,-4.1e-05,-5.8e-05,-1.4e-05,-1e-06,0.000721,-0.002159,-0.016183,-0.005034,0.024936,0.093434,0.122641,0.121739,0.111097,0.114518,0.100294,0.049863,0.017875,0.000488,-0.000351,0.000381,3.4e-05,9.1e-05,0.004306,0.02379,0.005303
1.4e-05,2e-06,8e-06,7.3e-05,8.3e-05,2.2e-05,1.2e-05,4.9e-05,-0.001669,-0.009181,-0.00418,-0.016943,-0.066854,-0.098,-0.097402,-0.085264,-0.10366,-0.075514,-0.035589,-0.022865,-0.010386,-0.004543,-0.00089,-0.001285,-0.003471,-0.005165,0.005891,0.00173
2.6e-05,3.4e-05,1.1e-05,4.8e-05,4.2e-05,6e-06,1e-05,-0.000586,0.000318,0.006716,0.001801,-0.011847,-0.037157,-0.040723,-0.04306,-0.041273,-0.029853,-0.044893,-0.02452,-0.00284,0.00058,0.001203,0.000234,-0.000608,-0.001928,-0.010234,-0.023358,-0.005891
7e-06,2.3e-05,3e-06,-1.9e-05,-2.7e-05,-1e-05,-7e-06,-0.000357,0.001675,0.012064,0.005006,0.025875,0.093358,0.12655,0.122197,0.102134,0.114378,0.098957,0.046608,0.021237,0.00764,0.003655,0.002836,0.004189,0.002843,-0.001425,-0.015549,-0.003993
-1.5e-05,-1.5e-05,-6e-06,-2.9e-05,-8e-06,1e-06,-1.7e-05,0.00024,0.001189,0.003328,0.001507,-0.00338,-0.02746,-0.047681,-0.042571,-0.037996,-0.059293,-0.024666,-0.008079,-0.011163,-0.001042,-0.001229,0.000472,0.001867,0.002499,0.009491,0.01295,0.002966
-2.1e-05,-3.3e-05,-8e-06,-1e-05,-4e-06,-6e-06,-8e-06,0.000485,-0.000423,-0.007322,-0.002373,-0.019431,-0.060949,-0.077525,-0.076039,-0.060927,-0.055556,-0.066544,-0.032951,-0.008104,-0.001783,-0.000947,-0.000905,-0.000796,-0.000426,0.004122,0.011559,0.002107
-4e-06,-1e-05,-2e-06,1.5e-05,-6e-06,-8e-06,9e-06,6.9e-05,-0.001623,-0.008352,-0.002932,0.013511,0.064091,0.095547,0.089826,0.081918,0.102298,0.072114,0.029594,0.016005,0.00072,0.000273,0.000812,0.001949,-0.001272,-0.008501,-0.008869,-0.002093
1.4e-05,1.9e-05,1e-06,0,-1.2e-05,-2e-06,1e-06,-0.000463,-0.001088,-0.000346,-0.000507,0.006672,0.003277,-0.001631,0.001338,-0.0057,-0.02495,0.00947,0.00887,-0.006352,-0.002898,-0.001503,0.000414,0.001589,-5e-04,-0.007188,-0.012081,-0.002529
