0.009928,0.01033,0.009872,0.009443,0.009343,0.009415,0.009346,0.008618,0.008447,0.008546,0.007595,0.006908,0.007627,0.007902,0.007991,0.008357,0.008184,0.007998,0.00824,0.008729,0.008665,0.007847,0.007087,0.007738,0.008095,0.007726,0.007147,0.006434
0.012766,0.013531,0.013108,0.012396,0.012223,0.01217,0.011869,0.011025,0.011054,0.011322,0.009837,0.008846,0.00994,0.010193,0.010299,0.010818,0.010626,0.010563,0.010961,0.011353,0.01091,0.009804,0.009085,0.010092,0.010445,0.009935,0.009026,0.008057
0.018018,0.019443,0.019115,0.017957,0.017636,0.01718,0.016372,0.015413,0.016002,0.016715,0.014217,0.012583,0.014186,0.014413,0.014705,0.01563,0.01549,0.015519,0.016102,0.01635,0.01512,0.013388,0.012855,0.014473,0.01469,0.014052,0.012583,0.011062
0.023566,0.025322,0.024674,0.023033,0.022654,0.021685,0.020551,0.019777,0.021251,0.022317,0.01881,0.016694,0.018162,0.018151,0.018925,0.020975,0.021239,0.020673,0.020922,0.021049,0.019265,0.017087,0.017011,0.018686,0.018528,0.018401,0.016512,0.014224
0.030046,0.031949,0.029603,0.026899,0.026794,0.025537,0.025133,0.025361,0.027575,0.028039,0.023498,0.021463,0.022018,0.021544,0.02268,0.026811,0.028264,0.025729,0.024455,0.024777,0.023836,0.021901,0.022497,0.023085,0.02276,0.024938,0.022427,0.018382
0.039979,0.042743,0.037587,0.032847,0.033837,0.033,0.033634,0.034961,0.037792,0.036977,0.030532,0.028407,0.028436,0.027883,0.0287,0.034904,0.03856,0.033486,0.029489,0.03042,0.031204,0.029617,0.031454,0.030659,0.030667,0.037187,0.033124,0.025116
0.052337,0.056601,0.049572,0.042902,0.045036,0.044748,0.045225,0.046382,0.049332,0.048286,0.04004,0.037149,0.037398,0.037061,0.037832,0.045977,0.051626,0.044478,0.037979,0.039489,0.040966,0.038672,0.041747,0.040932,0.042174,0.05277,0.046066,0.033034
0.059539,0.064792,0.057607,0.050427,0.053251,0.053294,0.052476,0.052583,0.054794,0.054531,0.046111,0.042593,0.043872,0.044113,0.045022,0.052956,0.058774,0.05183,0.044437,0.046182,0.047613,0.044354,0.047975,0.048096,0.050891,0.063362,0.054334,0.037841
0.056575,0.060509,0.055316,0.050395,0.051839,0.051364,0.049755,0.049657,0.050875,0.051419,0.045448,0.042085,0.043765,0.044672,0.045812,0.050095,0.053856,0.050955,0.045393,0.046118,0.047195,0.044495,0.046762,0.046347,0.049812,0.060455,0.051119,0.036061
0.050823,0.050871,0.048054,0.047213,0.044318,0.041422,0.041346,0.043393,0.043722,0.04444,0.04232,0.039638,0.039528,0.040749,0.04375,0.043406,0.042003,0.043035,0.041849,0.041209,0.042227,0.042659,0.041952,0.03755,0.040279,0.0478,0.040879,0.031508
0.053096,0.051435,0.049508,0.050942,0.043488,0.037052,0.039834,0.043876,0.042074,0.041828,0.040896,0.039163,0.038498,0.040677,0.046203,0.042745,0.035791,0.039363,0.043404,0.040225,0.038986,0.043435,0.042538,0.03333,0.035186,0.043534,0.038395,0.031747
0.063218,0.059109,0.055461,0.059673,0.051137,0.041924,0.047692,0.052042,0.046455,0.045628,0.043634,0.040451,0.040969,0.044776,0.051151,0.046152,0.03743,0.044379,0.052624,0.047733,0.042087,0.047366,0.049759,0.038897,0.03782,0.046166,0.041812,0.035403
0.073064,0.068613,0.061311,0.064802,0.057542,0.047833,0.055923,0.061023,0.053724,0.052565,0.049133,0.045445,0.046901,0.049691,0.057216,0.052871,0.043204,0.050791,0.059942,0.057248,0.051398,0.053941,0.056954,0.047112,0.042511,0.048051,0.043917,0.038545
0.07749,0.075577,0.065046,0.0631,0.056496,0.048945,0.05941,0.065213,0.057372,0.05789,0.054295,0.050026,0.05199,0.053839,0.06319,0.060956,0.049422,0.05198,0.058633,0.062278,0.061479,0.062228,0.064486,0.05444,0.045334,0.046163,0.042354,0.039527
0.075807,0.075443,0.066611,0.060096,0.053268,0.049707,0.061726,0.066732,0.057454,0.058616,0.055873,0.051892,0.054669,0.056267,0.064819,0.065316,0.054546,0.050666,0.053156,0.062018,0.06641,0.067564,0.069986,0.059001,0.047226,0.046339,0.043457,0.040825
0.078173,0.073551,0.06841,0.062483,0.059144,0.059101,0.064947,0.069741,0.063673,0.060478,0.057901,0.057367,0.058841,0.058348,0.064976,0.068018,0.060758,0.05318,0.052108,0.06081,0.06638,0.067743,0.069812,0.06247,0.054466,0.057358,0.054818,0.047625
0.096155,0.084766,0.080678,0.080022,0.081669,0.083392,0.078786,0.082553,0.081021,0.071915,0.069717,0.072641,0.070512,0.067089,0.075088,0.083065,0.079695,0.069548,0.065034,0.070141,0.074098,0.072238,0.071606,0.07185,0.071726,0.081431,0.076787,0.062993
0.119068,0.107091,0.106148,0.11299,0.116159,0.117062,0.106619,0.105038,0.100923,0.08931,0.089081,0.09147,0.084006,0.079961,0.093499,0.107759,0.106153,0.092488,0.086201,0.089178,0.091867,0.085856,0.082332,0.087462,0.091016,0.105698,0.09929,0.080978
0.133009,0.128051,0.136123,0.148196,0.146476,0.146528,0.136714,0.123493,0.11235,0.106106,0.106839,0.103749,0.094059,0.090466,0.105659,0.122631,0.123549,0.110319,0.105876,0.106656,0.109568,0.10151,0.09358,0.100213,0.102447,0.115815,0.111436,0.094194
0.137107,0.137502,0.154662,0.16681,0.156355,0.159123,0.153061,0.126992,0.113623,0.118922,0.119029,0.109767,0.103785,0.099143,0.107474,0.123213,0.128983,0.117807,0.118943,0.121888,0.12356,0.113458,0.099746,0.108457,0.107056,0.10768,0.109103,0.102235
0.136445,0.13695,0.155502,0.155779,0.139362,0.149029,0.147098,0.115497,0.105339,0.120424,0.121344,0.111807,0.110549,0.104183,0.104635,0.115445,0.124637,0.114077,0.119157,0.130291,0.131729,0.117894,0.098173,0.110158,0.108687,0.096379,0.102995,0.104817
0.133678,0.134929,0.144775,0.125746,0.112807,0.127637,0.130612,0.106757,0.091614,0.105331,0.113057,0.109138,0.107724,0.101204,0.101025,0.103728,0.107555,0.102038,0.111342,0.12625,0.124428,0.109495,0.092485,0.106291,0.106048,0.091063,0.096742,0.093959
0.132242,0.131986,0.123617,0.095,0.088384,0.104184,0.117983,0.109628,0.086315,0.084426,0.094706,0.096644,0.088713,0.083098,0.092174,0.092202,0.085955,0.088303,0.09939,0.105892,0.096762,0.08994,0.089514,0.101376,0.098955,0.082072,0.07823,0.071124
0.124663,0.12494,0.097558,0.071941,0.069767,0.087116,0.112303,0.113934,0.088766,0.070277,0.078305,0.090475,0.082504,0.073208,0.080473,0.079347,0.068845,0.074058,0.083936,0.082042,0.067688,0.07045,0.091289,0.101374,0.087926,0.069215,0.063018,0.059892
0.106759,0.120081,0.088151,0.066281,0.065088,0.07723,0.096855,0.102675,0.086443,0.068968,0.076353,0.091727,0.09119,0.078645,0.070554,0.062272,0.0519,0.057959,0.068451,0.066561,0.058049,0.063488,0.0875,0.095494,0.075583,0.059626,0.063266,0.065842
0.09609,0.108382,0.077578,0.061764,0.065455,0.073888,0.07994,0.082079,0.075034,0.068829,0.075332,0.084602,0.091616,0.081111,0.056771,0.041474,0.039189,0.047623,0.056819,0.05646,0.055392,0.060916,0.075906,0.079617,0.059885,0.049886,0.063998,0.069539
0.086113,0.087589,0.066887,0.058873,0.064958,0.077351,0.084918,0.076222,0.065787,0.072319,0.079506,0.074253,0.075252,0.068604,0.042822,0.030886,0.036866,0.045176,0.047778,0.046046,0.050397,0.058937,0.06566,0.063462,0.049265,0.042724,0.056483,0.061945
0.071987,0.06913,0.065291,0.064975,0.063355,0.079595,0.101004,0.083821,0.062404,0.07608,0.086455,0.06975,0.055144,0.04774,0.034003,0.030429,0.035909,0.041443,0.04073,0.036514,0.043019,0.057696,0.065402,0.056629,0.041757,0.037935,0.045966,0.048569
0.062497,0.059605,0.064982,0.064223,0.056161,0.074048,0.104734,0.089711,0.066853,0.080166,0.088001,0.069438,0.051835,0.042354,0.034127,0.034135,0.03539,0.036828,0.038454,0.038044,0.042048,0.053368,0.059025,0.047126,0.032835,0.033564,0.040331,0.042042
0.063534,0.058847,0.062042,0.059282,0.055135,0.073101,0.094136,0.08369,0.073319,0.080621,0.078,0.066826,0.059833,0.050384,0.040788,0.042133,0.042283,0.03834,0.041393,0.047005,0.051356,0.057946,0.054016,0.039313,0.029237,0.030417,0.039275,0.048799
0.067249,0.065774,0.067591,0.067251,0.069215,0.083783,0.081171,0.067183,0.072841,0.078277,0.069827,0.063976,0.063902,0.05669,0.050977,0.055477,0.056924,0.047155,0.047553,0.057578,0.061898,0.07157,0.065839,0.045561,0.035592,0.033132,0.042279,0.058866
0.065839,0.071865,0.074944,0.079364,0.083394,0.090154,0.07234,0.055004,0.065805,0.070941,0.061778,0.054392,0.058938,0.058601,0.060107,0.067554,0.069107,0.055299,0.052964,0.066266,0.068954,0.079752,0.076801,0.052922,0.040669,0.037721,0.047732,0.067032
0.060739,0.064737,0.068103,0.07804,0.081769,0.080833,0.064107,0.054145,0.058443,0.058834,0.053396,0.04512,0.050423,0.052616,0.059367,0.067386,0.068219,0.057575,0.053144,0.064197,0.06467,0.071709,0.072165,0.050448,0.037678,0.035251,0.044465,0.062668
0.056818,0.049142,0.047921,0.060662,0.064279,0.059935,0.053715,0.053061,0.047707,0.041657,0.040856,0.041633,0.050338,0.045833,0.046893,0.051315,0.051354,0.051577,0.047863,0.049775,0.047025,0.048605,0.051183,0.039534,0.030743,0.026953,0.032579,0.04528
0.058049,0.043545,0.032641,0.043525,0.052423,0.047271,0.048072,0.055179,0.043922,0.030566,0.029694,0.038122,0.049836,0.041997,0.032843,0.029102,0.028277,0.037433,0.041119,0.035621,0.027258,0.024668,0.026525,0.026741,0.027111,0.023295,0.023301,0.027691
0.052795,0.042258,0.028893,0.037695,0.045859,0.038526,0.044144,0.054227,0.039228,0.022054,0.023937,0.033154,0.041963,0.035492,0.022885,0.016597,0.0133,0.022554,0.032904,0.026732,0.016283,0.013442,0.013917,0.017762,0.02243,0.022341,0.020566,0.019864
0.039026,0.034206,0.024662,0.032078,0.034905,0.028446,0.038891,0.046188,0.031132,0.01775,0.021074,0.025683,0.030115,0.02857,0.019919,0.017943,0.012959,0.017396,0.025789,0.021357,0.012434,0.010215,0.01241,0.014395,0.018588,0.023777,0.022149,0.017489
0.029706,0.024578,0.020754,0.024776,0.023688,0.022474,0.033428,0.035203,0.028529,0.020531,0.022038,0.021011,0.021734,0.024395,0.018893,0.020143,0.016173,0.018742,0.024197,0.019717,0.011805,0.007981,0.010993,0.011751,0.019687,0.027048,0.023471,0.016465
0.029916,0.021209,0.022625,0.023217,0.020067,0.020065,0.026006,0.025563,0.030627,0.026546,0.02341,0.020686,0.019922,0.022662,0.019484,0.020265,0.017668,0.01821,0.021168,0.01939,0.013953,0.00826,0.010538,0.011452,0.022749,0.033161,0.027515,0.015926
0.031738,0.020092,0.024303,0.022401,0.017215,0.020682,0.020987,0.02158,0.032496,0.03017,0.0213,0.018884,0.017502,0.019496,0.018114,0.017119,0.016541,0.015369,0.016163,0.017642,0.016038,0.008575,0.010453,0.01492,0.026655,0.038387,0.032025,0.015887
