-3e-05,2e-06,2e-06,2e-06,1e-06,2e-06,2e-06,3e-06,2e-06,2e-06,1e-06,2e-06,1e-06,1e-06,-6e-06,-3.7e-05,-0.000917,-0.002137,-0.000469,-0.000175,-0.000219,-0.000184,-1e-04,-1.9e-05,1.3e-05,-1.1e-05,-9.5e-05,-2.8e-05
-1e-05,-1e-06,-1e-06,-2e-06,-1e-06,-1e-06,-1e-06,-1e-06,-1e-06,-1e-06,-2e-06,-1e-06,-1e-06,2e-06,2.8e-05,-1.3e-05,-0.000451,-0.000845,-0.000195,-0.000135,-0.000193,-0.000171,-9.5e-05,-2e-05,1.1e-05,-1.8e-05,-0.000138,-5.2e-05
5e-06,-2e-06,-3e-06,-3e-06,-2e-06,-2e-06,-3e-06,-4e-06,-3e-06,-3e-06,-3e-06,-3e-06,-2e-06,-6e-06,-3.5e-05,-5e-06,-3e-04,-0.000745,-4.5e-05,5e-05,6.1e-05,6e-05,4e-05,1e-05,1.1e-05,1e-06,-2.8e-05,0
1.8e-05,-2e-06,-2e-06,-3e-06,-1e-06,-2e-06,-4e-06,-5e-06,-4e-06,-4e-06,-3e-06,-4e-06,-2e-06,0,1.6e-05,4.3e-05,0.000425,0.000877,0.000263,0.000184,0.000249,0.000214,0.000122,2.9e-05,1.1e-05,2.3e-05,0.000102,6.3e-05
1.7e-05,-2e-06,-2e-06,-3e-06,-2e-06,-2e-06,-4e-06,-5e-06,-3e-06,-4e-06,-3e-06,-4e-06,-2e-06,-1e-06,1e-05,1e-05,0.000972,0.002372,0.000378,6.1e-05,8.4e-05,6.8e-05,3.3e-05,1.1e-05,1e-05,2.5e-05,0.000126,7.4e-05
-3.5e-05,-2e-06,-3e-06,-3e-06,-3e-06,-3e-06,-4e-06,-5e-06,-3e-06,-3e-06,-3e-06,-4e-06,-2e-06,-5e-06,-3.5e-05,-5.2e-05,-0.000311,-0.000733,-0.000269,-0.000162,-0.000203,-0.000172,-9.9e-05,-2e-05,6e-06,6e-06,3.4e-05,2.8e-05
-2.1e-05,-1e-06,-2e-06,-1e-06,-2e-06,-3e-06,-3e-06,-3e-06,-2e-06,-2e-06,-1e-06,-2e-06,-1e-06,1e-06,2.2e-05,-1e-05,-0.000822,-0.001954,-0.000376,-0.000132,-0.000181,-0.000159,-8.7e-05,-2.1e-05,4e-06,-1.1e-05,-7e-05,-2.1e-05
2.4e-05,1e-06,1e-06,1e-06,0,-1e-06,-1e-06,0,0,0,1e-06,1e-06,2e-06,0,-3e-06,1.5e-05,0.000124,0.000352,0.000166,6.8e-05,6.7e-05,6.2e-05,4.2e-05,8e-06,5e-06,-1.2e-05,-9.2e-05,-3.2e-05
2.3e-05,2e-06,3e-06,3e-06,2e-06,2e-06,2e-06,3e-06,2e-06,2e-06,3e-06,3e-06,3e-06,1e-06,-1e-05,2.1e-05,0.000197,0.000337,0.000143,0.000133,0.000196,0.000182,0.000105,2.5e-05,4e-06,-2e-06,-3.4e-05,-5e-06
-6e-06,3e-06,4e-06,3e-06,2e-06,3e-06,3e-06,5e-06,2e-06,3e-06,3e-06,4e-06,3e-06,4e-06,2.5e-05,1.4e-05,0.00012,0.000232,8e-06,4.8e-05,8.9e-05,6.8e-05,3.2e-05,8e-06,2e-06,8e-06,3.6e-05,2.8e-05
-5e-06,2e-06,3e-06,3e-06,2e-06,2e-06,3e-06,5e-06,2e-06,3e-06,2e-06,3e-06,2e-06,0,-1.6e-05,-3e-05,0.000258,0.000818,4.5e-05,-8.9e-05,-0.00014,-0.000135,-7.8e-05,-1.6e-05,-1e-06,9e-06,6.6e-05,3.9e-05
-1.3e-05,2e-06,1e-06,1e-06,1e-06,1e-06,2e-06,3e-06,1e-06,1e-06,1e-06,2e-06,1e-06,1e-06,2e-06,-1e-05,-0.000341,-0.00079,-0.000162,-0.000115,-0.00017,-0.000145,-7.1e-05,-1.6e-05,-3e-06,4e-06,4.9e-05,2.4e-05
7e-06,1e-06,0,0,1e-06,0,1e-06,0,0,0,0,0,-1e-06,1e-06,1.4e-05,2.1e-05,-0.000306,-0.000859,-7.1e-05,2.1e-05,3.6e-05,4.2e-05,3.2e-05,6e-06,-3e-06,-4e-06,-1.8e-05,-1.4e-05
2.1e-05,0,-1e-06,-1e-06,0,0,0,-2e-06,-2e-06,-2e-06,-2e-06,-2e-06,-2e-06,-3e-06,-1.6e-05,8e-06,0.000429,0.001012,0.000229,0.000107,0.000159,0.000151,8.1e-05,1.8e-05,-4e-06,-1.3e-05,-9.2e-05,-4.9e-05
-7e-06,-1e-06,-2e-06,-2e-06,-1e-06,-1e-06,-1e-06,-4e-06,-3e-06,-3e-06,-3e-06,-4e-06,-3e-06,-1e-06,6e-06,-2e-06,0.000142,0.000307,8e-06,4.7e-05,7.6e-05,6.1e-05,2.1e-05,5e-06,-6e-06,-1.3e-05,-8e-05,-4e-05
-1.9e-05,-2e-06,-2e-06,-3e-06,-2e-06,-2e-06,-2e-06,-5e-06,-3e-06,-3e-06,-3e-06,-4e-06,-3e-06,-2e-06,-3e-06,-1.6e-05,-0.000256,-0.00058,-0.000161,-5.3e-05,-9.1e-05,-9.8e-05,-6e-05,-1.6e-05,-8e-06,-1e-06,1.4e-05,8e-06
2e-06,-2e-06,-3e-06,-2e-06,-2e-06,-2e-06,-3e-06,-4e-06,-2e-06,-3e-06,-3e-06,-4e-06,-2e-06,-3e-06,-9e-06,-1e-05,-4.7e-05,1.7e-05,1e-05,-8.1e-05,-0.000139,-0.000126,-6e-05,-1.7e-05,-9e-06,7e-06,8.1e-05,4e-05
5e-06,-2e-06,-2e-06,-1e-06,-2e-06,-2e-06,-2e-06,-2e-06,-1e-06,-1e-06,-1e-06,-2e-06,-1e-06,0,9e-06,1.2e-05,-5.5e-05,-0.000206,7e-06,-1.7e-05,-4e-06,1.1e-05,1.5e-05,0,-8e-06,4e-06,5.3e-05,2.4e-05
4e-06,-1e-06,0,1e-06,0,-1e-06,-1e-06,0,1e-06,1e-06,1e-06,-1e-06,0,0,-7e-06,3e-06,7.3e-05,5.8e-05,2.6e-05,6.6e-05,0.000127,0.000125,6e-05,1.2e-05,-7e-06,-4e-06,-3.4e-05,-2.3e-05
