8e-06,2.3e-05,1.3e-05,6.5e-05,1e-05,3.3e-05,5.1e-05,1.1e-05,4.4e-05,2e-06,2e-06,8e-05,5e-06,6.2e-05,1.2e-05,2e-06,4.7e-05,6e-06,2.6e-05,3.3e-05,1.5e-05,7.5e-05,9e-06,5.4e-05,1.1e-05,2.5e-05,0.000223,8e-06,0.00011,4e-05,5.2e-05,9.3e-05,4e-06,5.3e-05,1.8e-05,3.7e-05,6e-05,4.1e-05,2.5e-05,3.5e-05,6e-06,6.3e-05,3.6e-05,2e-06,2.7e-05,1.9e-05,3.8e-05,2.9e-05,2.8e-05,2.8e-05,2.5e-05,4.2e-05,3.4e-05,8e-06,4.8e-05,4.4e-05,5.4e-05,5e-05,5e-06,3.9e-05,6.9e-05,2.7e-05,6.4e-05,1.1e-05,4.4e-05,5.7e-05,3.1e-05,5.4e-05,2.1e-05,2.9e-05,7e-05,3.9e-05,6.4e-05,6e-06,2.5e-05,6.1e-05,1.6e-05,4.3e-05,1.8e-05,3.4e-05,6.8e-05,3e-05,4.5e-05,2.4e-05,7e-06,6.3e-05,2.2e-05,5.6e-05,2.4e-05,4.1e-05,7.4e-05,1.4e-05,4.4e-05,2.6e-05,1.4e-05,4.9e-05,1.2e-05,4.4e-05,5.4e-05,1.4e-05,7.6e-05,8e-06,1.6e-05,3.8e-05,1.4e-05,6.6e-05,1.2e-05,5e-06,4e-05,3.1e-05,0.000149,4.3e-05,2.8e-05,6e-06,0.000133,0.000131,2.6e-05,0.000125,3e-05,5.6e-05,1e-06
5.5e-05,5.2e-05,0.000102,0.00011,9.4e-05,2.8e-05,3.5e-05,8.4e-05,7.1e-05,6.1e-05,2.4e-05,0.000127,0.00013,0.000102,8.4e-05,3.4e-05,5.9e-05,5.9e-05,5.1e-05,3.1e-05,9e-06,0.000131,0.000134,8.6e-05,8e-05,0.000389,0.000522,0.000459,0.00026,0.000129,8.3e-05,6.4e-05,0.000129,9.4e-05,6.9e-05,8.1e-05,0.000166,0.000139,0.000112,6e-05,3e-05,9.7e-05,5.5e-05,6.6e-05,2.3e-05,7.7e-05,0.000119,0.00017,0.000133,3.8e-05,2.5e-05,9.5e-05,9e-05,6.3e-05,5.1e-05,5.2e-05,0.000142,0.000105,9.4e-05,2.3e-05,8e-05,0.000143,0.000138,9.3e-05,5e-05,5.3e-05,0.000124,8.4e-05,6.4e-05,4.3e-05,0.00011,0.000186,0.000118,9.5e-05,8e-06,7.7e-05,0.000121,8.4e-05,5.1e-05,5.7e-05,8.1e-05,0.000154,0.000105,6.2e-05,4e-06,0.00011,0.000167,9.7e-05,4.6e-05,7.6e-05,7.2e-05,0.000122,6.8e-05,2e-05,9.4e-05,0.000146,0.000134,7e-05,1.8e-05,3.1e-05,0.000122,0.000185,0.000116,5.4e-05,6.7e-05,0.000134,0.000164,0.000135,7.6e-05,7.9e-05,0.000305,0.000414,0.000258,9.6e-05,0.000263,0.000484,0.000537,0.000432,0.000348,0.000194,0.000128
5.5e-05,7.2e-05,6.6e-05,3.7e-05,3.3e-05,3e-05,6e-06,4.8e-05,1.8e-05,1.6e-05,2.3e-05,4.5e-05,1e-05,2e-05,2.4e-05,3.3e-05,3e-05,1e-05,3.6e-05,1.5e-05,4e-05,3.6e-05,4.4e-05,2.4e-05,3.5e-05,0.000731,0.000652,0.000215,0.000126,5.4e-05,1.7e-05,7.4e-05,6.3e-05,2.5e-05,2.4e-05,6.2e-05,7.4e-05,5.6e-05,1.3e-05,6.8e-05,4.4e-05,5e-05,3.2e-05,4.1e-05,4.7e-05,3.2e-05,0.000108,7.7e-05,3.2e-05,5.3e-05,1.2e-05,5.9e-05,4.4e-05,2.1e-05,5.3e-05,2.5e-05,9.1e-05,1.9e-05,4.3e-05,3.6e-05,2.7e-05,5.2e-05,6.5e-05,3.2e-05,4e-05,3.5e-05,4.3e-05,2e-06,4.9e-05,6.8e-05,4e-05,6.9e-05,2.9e-05,4.2e-05,3.9e-05,1.4e-05,4.2e-05,1.6e-05,2.1e-05,7.4e-05,1.6e-05,6.2e-05,3.3e-05,1.6e-05,2.6e-05,7.6e-05,6.4e-05,1.9e-05,5e-06,9.3e-05,6.3e-05,7.4e-05,2.6e-05,3e-05,0.000102,7.3e-05,4e-05,3.7e-05,4e-06,2.9e-05,7.5e-05,9.2e-05,1.6e-05,4.1e-05,5e-05,6.4e-05,8e-05,6.2e-05,7.2e-05,3.3e-05,0.000162,0.000186,0.000159,0.000114,0.000196,0.00026,0.000265,4.4e-05,5.6e-05,6.1e-05,5.1e-05
5.7e-05,9.4e-05,0.000115,0.00012,9.7e-05,9.5e-05,6.2e-05,1.5e-05,1.3e-05,5.1e-05,6.8e-05,8.5e-05,0.000103,6.7e-05,5.5e-05,5.7e-05,6.4e-05,4.9e-05,4.6e-05,3.3e-05,7.8e-05,5.7e-05,3.9e-05,4.8e-05,4.6e-05,0.000884,0.000621,0.000296,9.8e-05,5.4e-05,3.1e-05,4e-05,4.9e-05,1.3e-05,1.5e-05,4.8e-05,6.1e-05,1.9e-05,7.5e-05,7.4e-05,1.4e-05,4.8e-05,2.2e-05,4.7e-05,6.1e-05,5.4e-05,9.3e-05,5.4e-05,5.2e-05,5.9e-05,4.6e-05,0.000105,6.9e-05,6.6e-05,2.1e-05,5.3e-05,8.7e-05,7.4e-05,4.7e-05,0.000104,5.3e-05,1.5e-05,5.4e-05,5.3e-05,7.7e-05,7.1e-05,7.9e-05,4.9e-05,5.9e-05,2.9e-05,3.7e-05,7.2e-05,9.3e-05,6.2e-05,7.6e-05,3e-05,5e-06,3.3e-05,4.1e-05,4.4e-05,4.8e-05,5.3e-05,3.2e-05,4.7e-05,4.4e-05,3.1e-05,9.1e-05,6.4e-05,5.6e-05,0.00011,9.4e-05,4e-05,2.6e-05,3.5e-05,7.8e-05,0.000136,6.3e-05,5.6e-05,5.4e-05,4.8e-05,4e-06,7.8e-05,8.6e-05,4.3e-05,5.1e-05,6.2e-05,4.3e-05,1.6e-05,2.9e-05,4.5e-05,0.000102,0.00011,8.6e-05,1.7e-05,7.6e-05,0.000103,0.000134,8.3e-05,6.8e-05,3.5e-05,3.5e-05
2.9e-05,1.2e-05,4.6e-05,6e-05,6.5e-05,2.8e-05,2.7e-05,1.4e-05,1.5e-05,6.1e-05,6.1e-05,3e-06,7.7e-05,3.7e-05,3.5e-05,2.6e-05,2.8e-05,2.3e-05,2.1e-05,4.5e-05,6e-05,1.1e-05,4.4e-05,3e-05,1.7e-05,0.001252,0.000457,0.000124,0.000212,3e-05,4.1e-05,2.2e-05,2.4e-05,4.4e-05,5.6e-05,9e-06,2.9e-05,2.2e-05,8.6e-05,4.2e-05,3e-06,4.3e-05,6e-05,1.3e-05,9.1e-05,3.2e-05,9.8e-05,5e-05,0.000105,7.6e-05,1.6e-05,7.8e-05,5.1e-05,5.2e-05,3.8e-05,7.8e-05,1.4e-05,3.3e-05,2.5e-05,3.5e-05,2.5e-05,4e-05,3.9e-05,3.4e-05,5.4e-05,2e-06,4.7e-05,2.7e-05,3.8e-05,3.1e-05,3e-05,2.6e-05,7.2e-05,1.3e-05,4.1e-05,2.7e-05,2.4e-05,2.1e-05,4.2e-05,4.9e-05,2e-05,4.2e-05,1.7e-05,1.8e-05,2.9e-05,3.4e-05,4.7e-05,2e-05,1.9e-05,3.7e-05,2.1e-05,1.3e-05,2.7e-05,4.8e-05,2.1e-05,7.2e-05,3.9e-05,3.5e-05,3.8e-05,1.4e-05,2.5e-05,4.6e-05,6e-05,5.2e-05,2.6e-05,1.1e-05,2.2e-05,1.1e-05,3.1e-05,1.2e-05,4.4e-05,9.2e-05,1.3e-05,2.2e-05,6.5e-05,0.000109,0.000101,7.8e-05,4.6e-05,1.8e-05,1.3e-05
6.5e-05,0.000113,5.2e-05,2.2e-05,5e-05,5.7e-05,2.2e-05,1e-05,2.5e-05,3.1e-05,4.4e-05,1.7e-05,5.9e-05,2.8e-05,8e-06,7e-06,4e-05,2.8e-05,2.7e-05,3.6e-05,1.1e-05,5e-06,3.6e-05,9.4e-05,8.5e-05,0.001891,0.002208,0.001244,0.000469,0.000249,0.000124,5.7e-05,3.4e-05,5.5e-05,2.4e-05,4.6e-05,2.4e-05,1.2e-05,6.5e-05,5.6e-05,4e-06,3.4e-05,5.9e-05,9.5e-05,0.000127,7.8e-05,0.000117,8.9e-05,2.2e-05,2.5e-05,3.3e-05,5.4e-05,2.5e-05,4.3e-05,3.7e-05,3.2e-05,2.7e-05,2e-05,3.2e-05,6e-06,2.1e-05,5.1e-05,2e-05,5.5e-05,1.9e-05,2.7e-05,5.2e-05,1.9e-05,2.5e-05,2.1e-05,2.7e-05,2e-05,3.3e-05,3.2e-05,1e-05,2.4e-05,3e-05,3.6e-05,2.7e-05,7e-06,8e-06,5.5e-05,2e-06,2e-05,3e-05,2.2e-05,2.4e-05,2.2e-05,2.8e-05,3.3e-05,3e-05,1.1e-05,1.8e-05,6.7e-05,8.3e-05,4.1e-05,7.9e-05,5.1e-05,1.4e-05,1.7e-05,6e-06,2.5e-05,2.2e-05,3.4e-05,2.4e-05,1.1e-05,1.3e-05,2.2e-05,1.5e-05,4e-06,3.6e-05,7.1e-05,4.1e-05,2.8e-05,3.1e-05,4e-05,0.000119,2.9e-05,1.3e-05,4.9e-05,4.1e-05
4.7e-05,8.4e-05,4.4e-05,3.9e-05,6.6e-05,5e-05,3.6e-05,3e-05,6e-06,1.3e-05,4.3e-05,6.9e-05,6.2e-05,5.8e-05,5.7e-05,7.2e-05,0.000123,3.9e-05,3.4e-05,5.4e-05,6.1e-05,3.5e-05,1.3e-05,7.1e-05,3.7e-05,0.002475,0.002873,0.001702,0.000551,0.000217,8.7e-05,4.1e-05,3e-06,3.4e-05,5.7e-05,2e-05,1.7e-05,1.4e-05,4.7e-05,2.9e-05,7.6e-05,8e-06,4.6e-05,0.000103,5.1e-05,0.00012,0.000258,7.6e-05,2.7e-05,4.6e-05,2.5e-05,5.8e-05,4.2e-05,3.3e-05,4e-06,1.2e-05,2.4e-05,4.2e-05,1.7e-05,4e-05,4.9e-05,4.5e-05,2.6e-05,6.9e-05,9e-06,2.2e-05,5.6e-05,4.2e-05,3.2e-05,1.5e-05,2.7e-05,3.1e-05,2.8e-05,2.4e-05,2.9e-05,4.4e-05,8e-06,3.4e-05,1.3e-05,8e-06,4e-06,4.7e-05,2.3e-05,2.5e-05,3.1e-05,1.8e-05,3.2e-05,2.2e-05,2e-05,2e-05,2.9e-05,2.8e-05,3.3e-05,9.9e-05,2.5e-05,6.1e-05,5.7e-05,5.6e-05,1.2e-05,2.4e-05,1.1e-05,3.2e-05,4.2e-05,1.9e-05,2.8e-05,2.5e-05,2.4e-05,1.6e-05,2.1e-05,2.9e-05,2.8e-05,6.5e-05,1.7e-05,1.7e-05,6e-06,4.8e-05,6.8e-05,3.4e-05,1.6e-05,1.9e-05,2e-05
4e-05,6.9e-05,0.000122,7.2e-05,0.000105,0.000139,7.8e-05,6.2e-05,1e-05,3.5e-05,3.3e-05,7.6e-05,6.2e-05,1.8e-05,5.2e-05,6.1e-05,0.000106,7.1e-05,2.4e-05,2.8e-05,5.8e-05,8e-06,3.1e-05,6.6e-05,8.9e-05,0.002754,0.001728,0.000661,8.3e-05,6.5e-05,3.3e-05,2e-05,4.2e-05,3.9e-05,1.3e-05,1.9e-05,1.1e-05,1.9e-05,0.000111,5.2e-05,8.4e-05,8.7e-05,9.9e-05,3.9e-05,7.3e-05,0.000173,0.000566,0.000327,8.5e-05,5e-05,2.1e-05,2e-05,7.1e-05,1.8e-05,6.2e-05,5e-06,2.5e-05,3.9e-05,1.3e-05,1.3e-05,6.1e-05,1.5e-05,2.2e-05,7.4e-05,6e-05,2.2e-05,4e-05,1.9e-05,3.2e-05,2.7e-05,4.6e-05,1.6e-05,2.6e-05,1.4e-05,2.4e-05,2.9e-05,2.6e-05,3.1e-05,1.2e-05,1.1e-05,5e-06,4.1e-05,1.9e-05,4.8e-05,2.4e-05,2.4e-05,3.1e-05,2.6e-05,5.6e-05,5.5e-05,5.3e-05,7.4e-05,5.7e-05,6.9e-05,0.000101,0.000148,4.7e-05,7.9e-05,5.3e-05,4e-06,2e-05,3.1e-05,3.6e-05,2.2e-05,3.7e-05,1.5e-05,2.6e-05,3.8e-05,5e-06,3.2e-05,8e-06,3.7e-05,1.7e-05,1.8e-05,1.7e-05,9e-05,7.7e-05,2.5e-05,3.2e-05,1.6e-05,3.1e-05
5.2e-05,0.000101,9.5e-05,0.000198,1.9e-05,5.2e-05,2.6e-05,5.4e-05,5.3e-05,9e-06,9.4e-05,9.1e-05,7.8e-05,9.4e-05,4.5e-05,0.000103,0.000192,0.000285,0.000161,8e-05,6.7e-05,0.000128,9.7e-05,8.6e-05,0.000131,0.002391,0.000364,0.000325,3e-04,0.000144,3.4e-05,1.8e-05,3.8e-05,2.9e-05,4e-05,2.5e-05,2.2e-05,3.3e-05,0.000179,0.000122,6.2e-05,0.000129,8.1e-05,5e-05,0.000133,0.000247,0.000568,0.000374,0.000308,9e-05,5.5e-05,4.4e-05,9.2e-05,5.9e-05,0.000118,0.000113,5.5e-05,6.3e-05,6.6e-05,6.8e-05,7.3e-05,5e-05,5.1e-05,6.2e-05,6.4e-05,6.4e-05,5e-06,4.1e-05,6.5e-05,9.1e-05,1.8e-05,2e-05,3.3e-05,4.4e-05,1.7e-05,1.8e-05,5.2e-05,2.8e-05,2.9e-05,1.4e-05,1.2e-05,4.3e-05,6.2e-05,4.7e-05,7.6e-05,9.3e-05,5.1e-05,3.2e-05,6.9e-05,0.000216,0.00025,0.000123,9.5e-05,1.8e-05,7.6e-05,0.000301,0.00011,0.000139,0.000135,8.8e-05,3.7e-05,3.1e-05,1.3e-05,1.4e-05,3.7e-05,3e-05,1.8e-05,3.1e-05,5.4e-05,4.5e-05,4.4e-05,2.2e-05,1.4e-05,1.4e-05,4.3e-05,5.7e-05,4.3e-05,1e-05,1.5e-05,3.3e-05,2.1e-05
3.6e-05,0.000152,0.000178,0.000247,0.000232,0.000118,5.3e-05,9e-05,4.2e-05,3.5e-05,0.000159,0.000157,0.000138,6.3e-05,8e-05,6.5e-05,0.000142,0.000314,0.000181,7.3e-05,9.4e-05,0.000114,8.8e-05,0.000146,8.9e-05,0.001936,0.001195,0.000749,0.000294,0.000137,7.9e-05,2.5e-05,2.6e-05,1.4e-05,5.2e-05,2.9e-05,2.2e-05,7.8e-05,0.000241,0.000121,5.5e-05,0.000156,0.000175,7.4e-05,0.000122,0.000106,0.000856,0.000655,0.000333,0.000127,0.000103,0.000107,1e-04,0.000106,0.000148,8.8e-05,8e-05,7.3e-05,7.7e-05,0.000185,0.000193,0.000121,2.4e-05,5.6e-05,5.8e-05,4.9e-05,4.9e-05,2.5e-05,4.7e-05,2.8e-05,3.8e-05,3e-05,3.7e-05,8e-06,1.6e-05,2.2e-05,4.6e-05,1.2e-05,3.2e-05,3.5e-05,1.2e-05,5.7e-05,1e-04,6.8e-05,6.3e-05,1.3e-05,3.6e-05,3.8e-05,4.6e-05,0.000208,0.000325,0.000308,0.00032,0.000324,8.3e-05,0.000418,0.00042,0.000276,0.000181,4.7e-05,1.2e-05,3.2e-05,2.8e-05,8e-06,2.7e-05,1.2e-05,2e-06,2.7e-05,4.7e-05,2.4e-05,3.2e-05,2.4e-05,1.5e-05,1.9e-05,3.4e-05,4.3e-05,4.7e-05,2e-05,2.8e-05,3.4e-05,4.1e-05
0.000178,8.8e-05,4.1e-05,0.000187,0.000117,1.4e-05,1.4e-05,4.9e-05,4.3e-05,5.2e-05,0.000104,7.5e-05,9e-06,5.3e-05,2.4e-05,5.4e-05,6.9e-05,0.000166,6.7e-05,4.5e-05,3e-06,6.8e-05,3.2e-05,4.1e-05,6.1e-05,0.001256,0.001186,0.000509,0.000107,1e-05,1.7e-05,2.4e-05,1.5e-05,1.9e-05,2.9e-05,4.5e-05,4.3e-05,8.2e-05,0.000116,8.3e-05,5.7e-05,6.5e-05,1.7e-05,3e-05,8.3e-05,6.7e-05,0.000753,7e-04,0.000372,0.000107,5.5e-05,8.8e-05,0.00011,0.000171,6.3e-05,1.2e-05,9.9e-05,0.000115,3.1e-05,0.000146,8.4e-05,3.3e-05,1.2e-05,3.5e-05,5.4e-05,5e-05,1e-05,1.9e-05,3.2e-05,4.5e-05,4.1e-05,2.7e-05,1e-06,1.8e-05,1.5e-05,1.8e-05,1.7e-05,1.6e-05,2e-05,2.2e-05,2e-05,5.7e-05,3.6e-05,3.8e-05,4.9e-05,4.1e-05,4e-06,2.8e-05,6.2e-05,0.000116,0.000118,8.2e-05,0.000162,0.000186,0.000256,0.000391,0.000262,9.5e-05,2.6e-05,1.5e-05,3.7e-05,2.5e-05,8e-06,1e-05,8e-06,8e-06,1.1e-05,1.2e-05,2.2e-05,1e-05,2e-06,1.9e-05,2.4e-05,2.2e-05,6e-06,2.7e-05,3.1e-05,1.8e-05,3.5e-05,3.1e-05,2.1e-05
9e-06,8.4e-05,2.3e-05,9.3e-05,4.3e-05,6e-06,1.8e-05,3.5e-05,3e-05,2.6e-05,5e-05,1.1e-05,1.2e-05,2.4e-05,2.1e-05,5.6e-05,0.000135,3.2e-05,5.7e-05,1.9e-05,1.9e-05,2.1e-05,3.9e-05,3.2e-05,6.4e-05,0.000461,0.000261,0.000133,3.2e-05,3e-06,1.3e-05,3.7e-05,4.9e-05,2.2e-05,1e-05,1.6e-05,4e-06,7.3e-05,5.8e-05,4.7e-05,7.1e-05,3.9e-05,4.3e-05,5.9e-05,0.000101,8e-06,0.00045,5.6e-05,2.9e-05,4.1e-05,3.6e-05,4.6e-05,5.5e-05,0.000114,6.1e-05,4e-05,7.2e-05,5.6e-05,4.8e-05,9e-05,3.9e-05,1.1e-05,1.1e-05,2.8e-05,3.2e-05,1.6e-05,2.8e-05,6e-06,1.9e-05,6e-06,1.2e-05,1.5e-05,2e-06,1.3e-05,1e-05,1e-05,1.5e-05,8e-06,4e-06,6e-06,9e-06,3.1e-05,2.5e-05,4.2e-05,3e-06,2.2e-05,2.8e-05,3e-05,3.4e-05,7e-05,2.5e-05,9.2e-05,3.6e-05,0.000154,7.3e-05,0.000158,5.3e-05,7.1e-05,2.5e-05,1.3e-05,1.4e-05,1.1e-05,1.3e-05,8e-06,1.1e-05,5e-06,1.1e-05,1.2e-05,1.8e-05,9e-06,1.1e-05,2.4e-05,9e-06,5e-06,1.9e-05,3.2e-05,3.3e-05,2.2e-05,2.1e-05,1.6e-05,6e-06
4e-05,5.1e-05,3.9e-05,2.7e-05,1e-05,2.1e-05,2e-05,1.4e-05,2.6e-05,1.6e-05,4e-05,2.6e-05,1.4e-05,7e-06,7e-06,4.1e-05,9.7e-05,1.7e-05,1.6e-05,1.9e-05,1.3e-05,1.6e-05,1.2e-05,3.1e-05,2.7e-05,0.000409,0.000177,0.000165,9.8e-05,5e-05,5.5e-05,1.9e-05,9e-06,5e-06,1.7e-05,1e-05,1.4e-05,3.2e-05,4.1e-05,8.5e-05,5.8e-05,1.2e-05,2.8e-05,4.3e-05,4.1e-05,2.1e-05,0.000121,5.3e-05,5.1e-05,4.7e-05,5.4e-05,3.4e-05,5.9e-05,2.4e-05,4.2e-05,1.4e-05,2.5e-05,5e-05,2e-05,2.6e-05,1e-05,9e-06,5e-06,4e-06,2.5e-05,5e-06,1.2e-05,1.2e-05,1.3e-05,2.1e-05,6e-06,9e-06,4e-06,1.2e-05,6e-06,3e-06,5e-06,1e-05,1.1e-05,1.3e-05,2e-06,2.1e-05,2e-05,1.8e-05,2e-06,3e-05,1.4e-05,3.3e-05,1.2e-05,9.7e-05,6.7e-05,9.9e-05,4.1e-05,4.8e-05,5.1e-05,7.2e-05,4.4e-05,3.2e-05,1.4e-05,1.2e-05,1.1e-05,2e-06,1.3e-05,9e-06,2e-06,6e-06,1.1e-05,8e-06,1.1e-05,1.4e-05,3e-06,1.7e-05,9e-06,4e-06,1.5e-05,2.7e-05,2e-05,7e-06,1.8e-05,6e-06,1e-05
3.9e-05,2.5e-05,7e-06,2.2e-05,2.4e-05,1.9e-05,6e-06,3e-06,2.5e-05,1.7e-05,5.4e-05,3.4e-05,1.8e-05,1.4e-05,1.4e-05,1.1e-05,6.2e-05,3.8e-05,1.6e-05,1.3e-05,3.3e-05,2.7e-05,2.8e-05,2.3e-05,1.7e-05,0.000865,0.000326,0.000177,5.6e-05,3.4e-05,3.3e-05,4.8e-05,3.4e-05,8e-06,1.5e-05,1e-05,3e-05,3.2e-05,7e-06,8.7e-05,9.4e-05,6.9e-05,4.6e-05,3.6e-05,5.1e-05,2.3e-05,0.00011,0.000159,0.000104,2.4e-05,4.6e-05,2.3e-05,2.5e-05,2.4e-05,3.9e-05,5.1e-05,4.4e-05,1.6e-05,3.6e-05,2.4e-05,1.6e-05,1.4e-05,7e-06,1.1e-05,9e-06,3e-06,1.2e-05,1.3e-05,1e-05,1.8e-05,1.3e-05,1.4e-05,1e-06,1.5e-05,2e-05,1.1e-05,3e-06,2e-06,9e-06,1e-06,5e-06,2.1e-05,1.4e-05,2.3e-05,9e-06,2.4e-05,1.9e-05,2.3e-05,1.7e-05,7.1e-05,3.4e-05,4.9e-05,7e-06,6.2e-05,4.4e-05,3.1e-05,4e-05,1.2e-05,2e-06,8e-06,6e-06,5e-06,6e-06,4e-06,6e-06,7e-06,1.6e-05,1.8e-05,1.1e-05,1e-05,1.1e-05,1.9e-05,7e-06,9e-06,5e-06,3e-05,1.7e-05,1.3e-05,1.5e-05,2.5e-05,9e-06
2.7e-05,2.2e-05,3.6e-05,2.2e-05,2e-05,2.2e-05,2.1e-05,1.8e-05,4.2e-05,3e-05,2.8e-05,2.3e-05,4.3e-05,2.4e-05,1.5e-05,2.6e-05,9e-05,7e-06,2.5e-05,1.3e-05,4.4e-05,3.8e-05,1.9e-05,8e-06,3e-06,0.000982,0.000744,0.000335,0.000137,5.5e-05,4.2e-05,3.8e-05,4e-06,1.9e-05,1.8e-05,1.1e-05,3.5e-05,5.2e-05,2.4e-05,5.7e-05,7.2e-05,2.9e-05,2.3e-05,3.7e-05,5.2e-05,2e-05,0.000135,0.000144,6e-06,4.8e-05,3.8e-05,2.9e-05,4.1e-05,3.8e-05,5e-05,3.8e-05,5.6e-05,2.7e-05,5e-05,1.4e-05,1.6e-05,6e-06,5e-06,2.1e-05,6e-06,8e-06,1.6e-05,5e-06,1.7e-05,1.7e-05,1.9e-05,3.3e-05,2.1e-05,9e-06,1e-05,1e-05,6e-06,8e-06,1.1e-05,1.3e-05,1.1e-05,1.3e-05,1.8e-05,1.8e-05,2.1e-05,2.8e-05,1.5e-05,4.6e-05,4.9e-05,4.6e-05,4.3e-05,6.9e-05,3.6e-05,6.3e-05,4.8e-05,5.1e-05,1.4e-05,1.6e-05,5e-06,2.5e-05,8e-06,6e-06,8e-06,6e-06,1.4e-05,1.4e-05,6e-06,2.2e-05,1.3e-05,7e-06,4e-06,2.2e-05,2e-06,7e-06,1.7e-05,2.6e-05,2.1e-05,2e-05,3.2e-05,3.2e-05,3e-06
2.1e-05,3.6e-05,3.6e-05,3.4e-05,1.1e-05,3.5e-05,3e-05,1e-05,5.1e-05,2.6e-05,3.8e-05,7.4e-05,9.7e-05,5.2e-05,5.2e-05,5.7e-05,0.000103,8.8e-05,5.1e-05,3.3e-05,4.3e-05,3.5e-05,4.5e-05,3e-05,2.2e-05,0.000805,0.001052,0.000722,0.00024,5.7e-05,9e-06,1.5e-05,2.8e-05,1.5e-05,1.4e-05,7e-06,3.8e-05,6.4e-05,3.4e-05,6.1e-05,5e-05,1.3e-05,5e-06,2.1e-05,0.000102,2.3e-05,0.000153,0.000141,6.7e-05,2.8e-05,2.9e-05,4.4e-05,4.8e-05,4.6e-05,4.9e-05,3.3e-05,3.5e-05,2.7e-05,6.4e-05,4.7e-05,3.2e-05,2.2e-05,1.1e-05,1.5e-05,1.4e-05,1e-05,1.8e-05,9e-06,6e-06,2.9e-05,3e-06,1.4e-05,2e-06,1.3e-05,1.3e-05,1.2e-05,5e-06,1.7e-05,8e-06,2.2e-05,4e-06,6e-06,6e-06,2.2e-05,1.7e-05,2.1e-05,3e-05,4.5e-05,7.4e-05,8.5e-05,6e-05,4.6e-05,2.6e-05,6.4e-05,7.8e-05,9.1e-05,8.7e-05,3.5e-05,2.4e-05,2e-05,1.5e-05,5e-06,6e-06,9e-06,9e-06,1.6e-05,7e-06,2.9e-05,2.1e-05,1.6e-05,8e-06,1.3e-05,9e-06,1.3e-05,1.3e-05,8e-06,1.1e-05,2.8e-05,1.2e-05,6e-06,2.1e-05
2.5e-05,3.1e-05,1.7e-05,1.6e-05,1.8e-05,2.4e-05,3.9e-05,3.8e-05,4.2e-05,6e-05,6.2e-05,4.6e-05,2e-05,4.4e-05,3.5e-05,3.7e-05,0.000142,1e-04,1.4e-05,1.6e-05,1.2e-05,3.1e-05,3.8e-05,4.2e-05,3.3e-05,0.000501,0.000348,0.000132,0.000128,6.9e-05,1.4e-05,1.3e-05,8e-06,1e-05,1.5e-05,1.9e-05,3.9e-05,2.6e-05,3.5e-05,0.000124,0.000182,4.6e-05,8.5e-05,5.2e-05,0.00018,4.8e-05,0.000252,0.000104,6.4e-05,7.7e-05,1.3e-05,7.1e-05,6.1e-05,7.7e-05,0.000103,6.3e-05,2.4e-05,3.6e-05,6.2e-05,4.5e-05,5e-06,1.9e-05,1.6e-05,1.5e-05,6e-06,1.2e-05,6e-06,1.4e-05,1.3e-05,1.6e-05,2.7e-05,1.3e-05,1.1e-05,1.2e-05,1e-05,1.4e-05,1.5e-05,7e-06,1.2e-05,2e-05,2e-05,1.3e-05,7e-06,1.8e-05,1.3e-05,1.5e-05,1.7e-05,6.1e-05,5e-05,2.3e-05,6.7e-05,4.3e-05,3.3e-05,8.3e-05,5.9e-05,5.3e-05,2.4e-05,2e-05,1.9e-05,2.3e-05,2.2e-05,1e-05,9e-06,9e-06,1.9e-05,1.7e-05,1.8e-05,1e-05,9e-06,6e-06,1.1e-05,1.7e-05,9e-06,1.2e-05,7e-06,2.3e-05,2.9e-05,1.2e-05,1.6e-05,1e-05,2.5e-05
3.5e-05,5.2e-05,5.3e-05,1.2e-05,2.8e-05,2.1e-05,7.3e-05,3.1e-05,5.7e-05,7.3e-05,7.4e-05,9.7e-05,9.6e-05,9e-06,5.5e-05,2.9e-05,7e-05,0.000107,3.1e-05,3e-05,2.9e-05,2.7e-05,5.8e-05,2.7e-05,2.5e-05,0.000322,0.000157,0.000358,0.00017,4.5e-05,3.1e-05,3.9e-05,2.3e-05,1.2e-05,1.5e-05,1e-05,3.5e-05,7.2e-05,3.2e-05,0.000168,0.000409,0.000274,7.4e-05,9.4e-05,0.000168,0.000176,0.000211,0.00023,7.6e-05,0.000128,4.9e-05,8.7e-05,6.6e-05,4.8e-05,8.4e-05,9.8e-05,1.9e-05,5e-05,6e-05,6.7e-05,5e-05,2.1e-05,7e-06,3e-06,1.3e-05,1.5e-05,1.3e-05,9e-06,1.2e-05,1.7e-05,9e-06,1.3e-05,1.7e-05,1.7e-05,2.4e-05,5e-06,1.1e-05,8e-06,1.6e-05,2.2e-05,1.4e-05,2.6e-05,2.1e-05,1e-05,3e-06,1.8e-05,3.4e-05,4.9e-05,7.5e-05,4.2e-05,1.4e-05,6e-05,5.7e-05,4.3e-05,0.000145,4.6e-05,2.9e-05,3.6e-05,4e-05,2.9e-05,2e-05,1.1e-05,1.2e-05,1.5e-05,3e-05,2.9e-05,2.5e-05,1.4e-05,1.2e-05,1.7e-05,1.1e-05,2.7e-05,1.7e-05,9e-06,9e-06,1.4e-05,3.6e-05,1.7e-05,1.7e-05,2.3e-05,2e-05
3.3e-05,6.4e-05,6.1e-05,3.3e-05,6.8e-05,5e-06,7.3e-05,2.6e-05,0.00015,0.000122,0.000194,0.00022,0.000156,0.000106,6.4e-05,7.9e-05,4.9e-05,0.000199,1e-04,5.9e-05,4.3e-05,4.6e-05,2.9e-05,4.4e-05,7.5e-05,0.000497,0.000583,0.000574,0.000251,5.2e-05,3.2e-05,1.4e-05,7e-06,9e-06,1.6e-05,1.6e-05,3e-05,9.1e-05,0.000168,0.000137,0.000595,0.000336,0.000266,0.000222,0.000205,0.000316,0.000459,0.000274,0.000287,0.000251,9.9e-05,8.8e-05,0.000112,0.000134,0.000128,3e-05,7e-05,4e-05,9e-05,0.000111,6.4e-05,2.8e-05,1.1e-05,8e-06,2e-06,4e-06,7e-06,2.5e-05,2.2e-05,5e-06,1.3e-05,3.2e-05,3.1e-05,2.8e-05,1e-05,1.1e-05,2e-06,4e-06,7e-06,3e-05,8e-06,2.2e-05,1.2e-05,8e-06,4e-06,2.8e-05,5.7e-05,1.4e-05,6.4e-05,9.6e-05,4e-05,0.000106,0.000156,9.7e-05,4.1e-05,6.3e-05,8.2e-05,3.8e-05,3.5e-05,1.6e-05,8e-06,4e-06,1.3e-05,1.2e-05,1.7e-05,4e-06,1.2e-05,6e-06,1.7e-05,2.1e-05,1.9e-05,2e-05,6e-06,6e-06,2.2e-05,1.4e-05,2.3e-05,8e-06,1.1e-05,7e-06,2.3e-05
5.8e-05,6.5e-05,0.000114,8.6e-05,9.2e-05,8.7e-05,9.1e-05,8e-05,0.000231,0.000233,2.8e-05,0.000164,7.7e-05,8.4e-05,0.000132,0.000129,0.000103,0.000229,0.000155,7.9e-05,5.5e-05,0.000102,2.1e-05,1.1e-05,3.2e-05,0.000556,0.000263,0.00051,0.00028,6.2e-05,4.4e-05,1.6e-05,4e-06,4e-06,1e-05,1.2e-05,8e-06,5.9e-05,0.000168,0.000246,0.000327,0.000242,0.00022,0.000172,1.2e-05,0.000225,0.000203,0.000163,0.000269,6.7e-05,0.000192,0.000229,0.00015,0.000141,0.000134,0.000137,5.6e-05,9.6e-05,0.00019,0.000112,7.6e-05,3e-05,9e-06,6e-06,6e-06,1.3e-05,1.5e-05,1.4e-05,1e-06,1e-05,1e-05,2.5e-05,7e-06,3.2e-05,2.6e-05,5e-06,1e-06,2e-06,8e-06,2.4e-05,2.9e-05,2.2e-05,1.1e-05,1.1e-05,3e-06,3.8e-05,3.7e-05,5e-05,4e-05,8.3e-05,9.7e-05,0.000188,0.000129,0.000165,3.8e-05,0.000117,8.5e-05,6e-05,9.6e-05,4.8e-05,2.8e-05,1.4e-05,1.7e-05,1.7e-05,5e-06,9e-06,5e-06,5e-06,2.1e-05,6e-06,1.8e-05,7e-06,1.6e-05,8e-06,2.1e-05,3.1e-05,1.2e-05,1e-05,2.5e-05,6e-06,2.6e-05
0.000135,8.5e-05,5.4e-05,3.6e-05,2.1e-05,3.1e-05,0.000137,1.5e-05,0.000204,0.000221,0.000151,0.000129,8.8e-05,8e-05,0.000114,8.9e-05,0.000117,6.4e-05,4.8e-05,1.5e-05,5.8e-05,8.3e-05,8.9e-05,4.2e-05,2.5e-05,0.000534,0.001298,0.000727,0.000236,7.9e-05,1.5e-05,2.6e-05,6e-06,2e-06,7e-06,9e-06,2.2e-05,2e-05,0.000149,0.000122,0.000118,0.000201,5.7e-05,6.3e-05,0.000107,7.1e-05,0.000125,0.000158,0.000166,0.000256,0.000181,6.5e-05,3.9e-05,5.7e-05,3.3e-05,0.000103,0.000136,0.000123,0.000112,0.000241,0.000117,2.1e-05,1.4e-05,2.1e-05,3e-06,2.3e-05,1.6e-05,1.1e-05,6e-06,1.4e-05,1e-05,6e-06,6e-06,2.6e-05,1.3e-05,1.4e-05,1.6e-05,1.3e-05,1.7e-05,4e-06,2.6e-05,6e-06,4e-06,8e-06,1e-05,3.1e-05,1.5e-05,5.1e-05,5.1e-05,7.6e-05,0.000114,0.000137,0.000127,0.000163,0.000149,0.000154,6.4e-05,3.1e-05,8.2e-05,4.6e-05,3.2e-05,1e-05,7e-06,1.5e-05,1.1e-05,3e-06,9e-06,4e-06,1.1e-05,1.5e-05,8e-06,6e-06,9e-06,1.3e-05,5e-06,2.1e-05,1e-05,1e-05,2.8e-05,2.3e-05,3.1e-05
7.2e-05,3.2e-05,4.1e-05,5.1e-05,1.5e-05,3.3e-05,1e-04,0.000133,4.7e-05,0.000106,6.9e-05,0.000107,5.4e-05,5.4e-05,2.1e-05,2.2e-05,0.00015,0.000118,3.8e-05,2e-05,5.2e-05,8.8e-05,8.7e-05,5.2e-05,3.7e-05,0.000467,0.001121,0.000424,0.000205,2.3e-05,2.1e-05,4.1e-05,2.9e-05,1.4e-05,2e-05,1.1e-05,2.8e-05,1.8e-05,8.8e-05,0.000192,0.000215,0.000136,9.9e-05,0.000135,0.000209,0.00015,9.1e-05,0.000133,8.3e-05,5.4e-05,2.1e-05,0.000121,8.1e-05,8.9e-05,7.9e-05,0.000103,0.00011,0.000134,0.000149,0.000138,8e-05,3.5e-05,9e-06,2.3e-05,2.2e-05,2.7e-05,7e-06,8e-06,9e-06,1e-05,1e-05,1e-05,4e-06,1.8e-05,7e-06,9e-06,7e-06,8e-06,8e-06,1e-05,2.3e-05,1.3e-05,6e-06,8e-06,2.3e-05,3.2e-05,2.4e-05,5.9e-05,7.8e-05,7.6e-05,2e-05,9.8e-05,0.000138,3.5e-05,5e-05,4.7e-05,5.3e-05,7.6e-05,1.8e-05,4.8e-05,2.2e-05,1.5e-05,6e-06,9e-06,1.2e-05,1.3e-05,1.9e-05,5e-06,6e-06,1.2e-05,9e-06,8e-06,5e-06,6e-06,7e-06,1.2e-05,2e-05,7e-06,1.8e-05,5e-06,1.5e-05
1.1e-05,6e-06,1e-05,1.7e-05,2.2e-05,6e-06,1.6e-05,3.8e-05,4e-05,3.1e-05,4.4e-05,2.1e-05,2.2e-05,1.3e-05,1.4e-05,1.7e-05,4.2e-05,3.4e-05,3.1e-05,1.9e-05,1.9e-05,4.4e-05,1.2e-05,5e-06,2.1e-05,0.00022,0.00019,6.3e-05,2.9e-05,5e-06,6e-06,1e-05,1.2e-05,6e-06,1.3e-05,1.5e-05,6e-06,1.5e-05,3.5e-05,3.7e-05,8e-05,1.3e-05,4.3e-05,7e-05,2.1e-05,4.1e-05,8.2e-05,1e-05,3.1e-05,3.5e-05,2.3e-05,4.2e-05,6e-06,4.7e-05,2.3e-05,2.2e-05,1.1e-05,2.8e-05,1.2e-05,3.6e-05,1.1e-05,1e-06,2e-06,1.1e-05,1e-05,5e-06,1e-06,6e-06,1e-06,5e-06,3e-06,6e-06,4e-06,5e-06,6e-06,3e-06,3e-06,5e-06,1e-05,2e-06,6e-06,8e-06,6e-06,2e-06,9e-06,4e-06,1e-06,1.8e-05,1.3e-05,8e-06,1.8e-05,2.4e-05,1.1e-05,2.5e-05,2.9e-05,9e-06,7e-06,1.5e-05,1.3e-05,1e-05,4e-06,6e-06,4e-06,2e-06,4e-06,4e-06,5e-06,4e-06,4e-06,2e-06,1e-06,5e-06,4e-06,2e-06,4e-06,1.3e-05,8e-06,5e-06,1e-05,7e-06,5e-06
1.8e-05,1e-05,3e-05,2.7e-05,6e-06,1.5e-05,1.2e-05,2.5e-05,3.7e-05,3.9e-05,5.3e-05,5.2e-05,2.1e-05,6e-06,1.8e-05,7e-06,1.7e-05,1.3e-05,2.1e-05,2e-05,1.2e-05,1.2e-05,8e-06,6e-06,4e-06,0.000199,0.000155,5e-05,1.6e-05,7e-06,4e-06,8e-06,9e-06,5e-06,9e-06,4e-06,4e-06,1.6e-05,2.7e-05,4.2e-05,7.3e-05,4.9e-05,7e-05,1.8e-05,3.1e-05,1.7e-05,9.7e-05,4e-05,2.5e-05,3.3e-05,2.6e-05,6e-06,2.6e-05,3.3e-05,1.3e-05,2.3e-05,2.3e-05,2.3e-05,6e-06,1.8e-05,1.2e-05,3e-06,1e-06,4e-06,3e-06,3e-06,3e-06,7e-06,4e-06,4e-06,3e-06,1e-06,2e-06,3e-06,3e-06,3e-06,2e-06,2e-06,7e-06,4e-06,4e-06,5e-06,3e-06,4e-06,8e-06,5e-06,1e-06,5e-06,5e-06,1.7e-05,8e-06,1e-05,3e-06,8e-06,2.2e-05,1e-05,1.1e-05,1.2e-05,1.2e-05,8e-06,1e-06,3e-06,4e-06,2e-06,3e-06,3e-06,6e-06,3e-06,5e-06,4e-06,2e-06,6e-06,3e-06,1e-06,3e-06,1.1e-05,9e-06,5e-06,9e-06,7e-06,3e-06
1.2e-05,6e-06,1.9e-05,2e-06,5e-06,6e-06,7e-06,1.4e-05,5.2e-05,5e-05,1e-05,2.3e-05,1.1e-05,4e-06,1.5e-05,1.3e-05,1.1e-05,1.1e-05,2.4e-05,1e-05,9e-06,4e-06,4e-06,1.3e-05,1.6e-05,0.000183,0.000153,6.3e-05,2.5e-05,5e-06,7e-06,1.1e-05,8e-06,8e-06,1e-06,4e-06,6e-06,1e-05,2.5e-05,3.5e-05,3.2e-05,9e-06,3.2e-05,2.4e-05,1.3e-05,6e-06,4.3e-05,3.8e-05,1.8e-05,3.4e-05,1e-05,7e-06,1.7e-05,2.5e-05,6e-06,2.5e-05,1.5e-05,7e-06,1.1e-05,1.5e-05,5e-06,1e-06,4e-06,6e-06,1e-06,3e-06,3e-06,5e-06,3e-06,4e-06,2e-06,2e-06,2e-06,2e-06,3e-06,3e-06,5e-06,3e-06,3e-06,4e-06,3e-06,1e-06,3e-06,2e-06,4e-06,7e-06,8e-06,5e-06,5e-06,1.5e-05,1.1e-05,5e-06,1.2e-05,2e-06,2e-05,1e-05,1.4e-05,1.4e-05,7e-06,8e-06,4e-06,4e-06,1e-06,3e-06,3e-06,2e-06,1e-06,0,5e-06,3e-06,3e-06,6e-06,2e-06,2e-06,3e-06,4e-06,1e-05,4e-06,4e-06,2e-06,5e-06
2e-06,7e-06,2.3e-05,1.8e-05,9e-06,7e-06,1.4e-05,1.3e-05,2.9e-05,1.3e-05,1.5e-05,4.9e-05,3.1e-05,6e-06,8e-06,7e-06,2.2e-05,1e-05,1.1e-05,1.4e-05,1e-05,3e-06,3e-06,1.1e-05,1e-05,0.000196,0.000122,2.5e-05,2e-06,5e-06,1.1e-05,1.3e-05,7e-06,5e-06,6e-06,4e-06,7e-06,1e-05,2e-05,6e-06,2.5e-05,1.7e-05,2.4e-05,4e-06,2.4e-05,1.1e-05,2.3e-05,2.4e-05,1e-05,2.6e-05,2e-06,2e-06,1.3e-05,1.3e-05,1.1e-05,1e-05,1.4e-05,1.7e-05,1.9e-05,5e-06,8e-06,8e-06,8e-06,4e-06,2e-06,3e-06,3e-06,4e-06,1e-06,1e-06,5e-06,2e-06,3e-06,2e-06,5e-06,2e-06,4e-06,1e-06,1e-06,3e-06,1e-06,6e-06,1e-06,4e-06,1e-06,9e-06,8e-06,1e-05,2e-06,9e-06,3e-06,4e-06,5e-06,7e-06,1.9e-05,1.7e-05,4e-06,1.5e-05,1e-05,8e-06,2e-06,2e-06,3e-06,5e-06,5e-06,2e-06,4e-06,2e-06,6e-06,2e-06,2e-06,2e-06,1e-06,4e-06,3e-06,8e-06,7e-06,7e-06,3e-06,1e-06,2e-06
6e-06,3e-06,3.6e-05,1.8e-05,5e-06,1.6e-05,1.9e-05,3e-06,1.3e-05,8e-06,2.6e-05,5.6e-05,2.2e-05,4e-06,1.7e-05,1e-05,7e-06,1.1e-05,4e-06,3e-06,4e-06,8e-06,4e-06,1.3e-05,1.1e-05,0.000214,0.00017,4.9e-05,2e-06,1.5e-05,7e-06,3e-06,7e-06,3e-06,4e-06,2e-06,4e-06,9e-06,1.2e-05,1.9e-05,1.8e-05,5e-06,1.7e-05,1.2e-05,2.1e-05,8e-06,4.4e-05,7e-06,5e-06,1.3e-05,2e-06,8e-06,1e-05,3e-06,7e-06,5e-06,1e-05,1.1e-05,9e-06,5e-06,9e-06,6e-06,1e-06,2e-06,3e-06,1e-06,4e-06,2e-06,3e-06,2e-06,3e-06,1e-06,1e-06,1e-06,2e-06,4e-06,5e-06,2e-06,2e-06,2e-06,2e-06,5e-06,4e-06,2e-06,4e-06,8e-06,2e-06,9e-06,1.1e-05,5e-06,1.4e-05,4e-06,8e-06,1.3e-05,7e-06,9e-06,1.3e-05,1.9e-05,1.9e-05,1.5e-05,3e-06,1e-06,3e-06,4e-06,1e-06,4e-06,4e-06,3e-06,4e-06,4e-06,6e-06,3e-06,3e-06,4e-06,5e-06,1e-05,1.1e-05,7e-06,4e-06,6e-06,8e-06
9e-06,1.4e-05,2.2e-05,9e-06,5e-06,9e-06,1.2e-05,1.5e-05,2e-05,5e-06,4.7e-05,1.5e-05,7e-06,1.4e-05,8e-06,1.2e-05,1e-05,1.6e-05,1.3e-05,1e-05,1e-05,7e-06,3e-06,9e-06,5e-06,0.000218,0.000196,8.5e-05,1.4e-05,1.5e-05,8e-06,7e-06,1e-06,5e-06,6e-06,1e-06,3e-06,7e-06,1.2e-05,1.1e-05,1.9e-05,4e-06,1.8e-05,1.1e-05,2e-05,1e-05,2.5e-05,3.4e-05,8e-06,2.2e-05,9e-06,1.1e-05,1.2e-05,6e-06,1.1e-05,9e-06,2.3e-05,1.3e-05,1e-05,7e-06,2e-06,1e-06,3e-06,3e-06,4e-06,4e-06,2e-06,3e-06,2e-06,1e-06,2e-06,2e-06,2e-06,1e-06,1e-06,1e-06,0,1e-06,4e-06,1e-06,2e-06,1e-06,1e-06,4e-06,1e-06,9e-06,4e-06,1.1e-05,1.2e-05,1.2e-05,8e-06,1.5e-05,1.4e-05,1.7e-05,6e-06,7e-06,5e-06,1.8e-05,1.6e-05,3e-06,1e-06,3e-06,2e-06,1e-06,1e-06,4e-06,1e-06,3e-06,6e-06,2e-06,2e-06,8e-06,2e-06,1e-06,5e-06,7e-06,9e-06,5e-06,4e-06,8e-06,3e-06
2e-05,1e-05,1.1e-05,6e-06,1.7e-05,1.1e-05,8e-06,8e-06,2.6e-05,1e-05,3.5e-05,2.9e-05,1.4e-05,1.1e-05,9e-06,8e-06,2e-05,3.1e-05,2.3e-05,9e-06,8e-06,2e-06,3e-06,4e-06,5e-06,0.000186,0.000147,7.9e-05,1.6e-05,1.1e-05,1e-05,3e-06,3e-06,2e-06,2e-06,8e-06,2e-06,4e-06,7e-06,1.2e-05,1e-05,1e-05,2.2e-05,1.3e-05,1e-05,3e-06,6e-06,5e-06,2e-06,2.5e-05,9e-06,4e-06,2e-06,5e-06,6e-06,6e-06,1e-05,1.5e-05,1e-05,7e-06,2e-06,3e-06,1e-06,3e-06,4e-06,4e-06,4e-06,3e-06,2e-06,1e-06,2e-06,4e-06,2e-06,1e-06,4e-06,2e-06,0,1e-06,5e-06,5e-06,2e-06,1e-06,2e-06,4e-06,4e-06,6e-06,2e-06,9e-06,1e-05,7e-06,2e-06,1.8e-05,5e-06,1.3e-05,2.2e-05,1.2e-05,1e-05,2.6e-05,1.6e-05,4e-06,2e-06,3e-06,1e-06,2e-06,2e-06,3e-06,2e-06,3e-06,1e-06,1e-06,1e-06,5e-06,3e-06,1e-06,6e-06,9e-06,7e-06,5e-06,4e-06,4e-06,4e-06
1e-05,6e-06,4e-06,3e-06,2.3e-05,3.6e-05,2.4e-05,2.9e-05,4.9e-05,3e-05,3e-05,2.4e-05,2.7e-05,7e-06,5e-06,7e-06,1.4e-05,2.3e-05,2.2e-05,5e-06,3e-06,3e-06,2e-06,4e-06,1.1e-05,0.000139,0.00025,7.7e-05,1.8e-05,5e-06,5e-06,8e-06,2e-06,6e-06,4e-06,6e-06,4e-06,4e-06,7e-06,7e-06,8e-06,4e-06,1.8e-05,2.1e-05,7e-06,6e-06,1.8e-05,1.6e-05,1e-05,2.2e-05,1.9e-05,3e-06,7e-06,5e-06,1.1e-05,3e-06,5e-06,3.1e-05,2.7e-05,2.2e-05,6e-06,2e-06,1e-06,2e-06,4e-06,1e-06,4e-06,1e-06,1e-06,3e-06,2e-06,1e-06,2e-06,1e-06,4e-06,2e-06,1e-06,1e-06,3e-06,1e-06,1e-06,2e-06,3e-06,1e-06,2e-06,1e-06,5e-06,5e-06,5e-06,5e-06,1.2e-05,1.8e-05,3.7e-05,2.3e-05,3.6e-05,3.3e-05,1.7e-05,1.5e-05,1.3e-05,9e-06,3e-06,2e-06,4e-06,4e-06,1e-06,3e-06,2e-06,2e-06,4e-06,3e-06,2e-06,4e-06,3e-06,2e-06,3e-06,6e-06,6e-06,1e-06,4e-06,1e-06,0
2.1e-05,1.4e-05,1.3e-05,4e-06,1.6e-05,1.9e-05,8e-06,2.3e-05,2.2e-05,9e-06,4.3e-05,1.8e-05,2.7e-05,1.8e-05,1.5e-05,4e-06,1.1e-05,2.6e-05,1.6e-05,9e-06,1e-06,1e-06,4e-06,4e-06,1.9e-05,9.2e-05,0.000103,7.6e-05,2.3e-05,4e-06,1.2e-05,1.4e-05,1.2e-05,8e-06,5e-06,2e-06,3e-06,6e-06,4e-06,1.4e-05,1.1e-05,1e-05,1.1e-05,5e-06,2.1e-05,1.4e-05,9e-06,1.4e-05,1e-05,5e-06,1.2e-05,1.3e-05,9e-06,6e-06,1.4e-05,9e-06,1.2e-05,3.4e-05,2.4e-05,8e-06,3e-06,2e-06,2e-06,6e-06,3e-06,1e-06,2e-06,2e-06,1e-06,3e-06,2e-06,3e-06,3e-06,1e-06,3e-06,3e-06,1e-06,2e-06,3e-06,3e-06,2e-06,4e-06,4e-06,2e-06,4e-06,8e-06,3e-06,7e-06,2.1e-05,1.2e-05,1.5e-05,1.7e-05,3.7e-05,1.6e-05,1.1e-05,1e-05,3e-06,1.2e-05,7e-06,7e-06,3e-06,1e-06,2e-06,2e-06,2e-06,2e-06,3e-06,1e-06,4e-06,1e-06,3e-06,3e-06,1e-06,2e-06,1e-06,8e-06,5e-06,1e-06,2e-06,5e-06,2e-06
1.7e-05,1.3e-05,5e-06,6e-06,8e-06,1e-05,1.3e-05,1.5e-05,3.3e-05,5e-06,3.3e-05,1.4e-05,1.8e-05,4e-06,2e-05,2.4e-05,7e-06,4.1e-05,1.2e-05,9e-06,2e-06,2e-06,4e-06,6e-06,1.4e-05,0.000121,0.000115,5e-05,1.6e-05,1.3e-05,1.4e-05,8e-06,4e-06,1e-05,6e-06,2e-06,3e-06,5e-06,2e-06,8e-06,1.5e-05,2e-05,2.6e-05,9e-06,1.8e-05,1.7e-05,2.2e-05,2e-05,4e-06,1.3e-05,2.8e-05,1.8e-05,1.1e-05,1.1e-05,1.5e-05,6e-06,1.3e-05,2.3e-05,2e-05,1.6e-05,4e-06,3e-06,2e-06,4e-06,2e-06,3e-06,3e-06,1e-06,3e-06,3e-06,1e-06,3e-06,3e-06,3e-06,1e-06,1e-06,3e-06,1e-06,3e-06,3e-06,3e-06,5e-06,2e-06,0,4e-06,1e-05,2e-06,1e-05,1.6e-05,1.3e-05,1.8e-05,3.3e-05,1e-05,9e-06,7e-06,1.3e-05,1.9e-05,8e-06,1e-06,4e-06,1e-06,1e-06,1e-06,1e-06,1e-06,1e-06,2e-06,3e-06,5e-06,3e-06,1e-06,3e-06,1e-06,4e-06,1e-06,6e-06,4e-06,2e-06,3e-06,2e-06,2e-06
1.2e-05,1.9e-05,2.2e-05,6e-06,1.1e-05,6e-06,1.2e-05,2.3e-05,3e-05,3e-05,2.9e-05,5e-06,1e-05,1e-05,3.1e-05,2e-05,2.2e-05,4.9e-05,3.8e-05,8e-06,1.5e-05,7e-06,4e-06,9e-06,1.4e-05,0.00018,0.000188,4.9e-05,1e-05,8e-06,8e-06,8e-06,3e-06,8e-06,1e-06,3e-06,3e-06,2e-06,2e-06,5e-06,1.4e-05,7e-06,2.8e-05,1.7e-05,5e-06,2.5e-05,1.7e-05,3.6e-05,1.3e-05,2.4e-05,5.2e-05,3.7e-05,3e-05,9e-06,1.1e-05,1.2e-05,9e-06,2.1e-05,3.7e-05,1.3e-05,6e-06,3e-06,3e-06,3e-06,4e-06,4e-06,2e-06,4e-06,3e-06,2e-06,1e-06,4e-06,4e-06,5e-06,1e-06,2e-06,3e-06,2e-06,2e-06,1e-06,4e-06,2e-06,2e-06,2e-06,7e-06,9e-06,8e-06,1.1e-05,1.8e-05,2.6e-05,9e-06,2.7e-05,2.9e-05,1.7e-05,1.1e-05,1.3e-05,2.1e-05,3e-05,1e-05,3e-06,3e-06,2e-06,3e-06,1e-06,2e-06,2e-06,2e-06,2e-06,3e-06,2e-06,2e-06,4e-06,1e-06,4e-06,4e-06,5e-06,7e-06,3e-06,1e-06,5e-06,2e-06
5e-06,7e-06,1.6e-05,1.2e-05,1.3e-05,7e-06,1.8e-05,1.5e-05,1.5e-05,1.4e-05,2.8e-05,2.8e-05,1e-05,2.2e-05,4.4e-05,3e-05,1.8e-05,4.4e-05,3.7e-05,2.6e-05,1.2e-05,8e-06,2e-06,1.3e-05,1.1e-05,0.000235,8.2e-05,8.3e-05,3.2e-05,5e-06,4e-06,9e-06,9e-06,3e-06,4e-06,2e-06,2e-06,3e-06,6e-06,1e-05,6e-06,4e-06,3.5e-05,3.1e-05,2e-06,1.7e-05,2.2e-05,3e-05,1.6e-05,1.3e-05,3.8e-05,1.9e-05,1.6e-05,8e-06,2.8e-05,3.4e-05,3.9e-05,1.8e-05,2.3e-05,1.7e-05,6e-06,3e-06,7e-06,4e-06,7e-06,1e-06,1e-06,3e-06,1e-06,1e-06,1e-06,6e-06,4e-06,1e-06,2e-06,3e-06,2e-06,2e-06,1e-06,1e-06,1e-06,2e-06,1e-06,5e-06,9e-06,1.6e-05,7e-06,4e-06,1.1e-05,1.1e-05,1.4e-05,1.5e-05,1.1e-05,4e-06,1.2e-05,5e-06,1.9e-05,4e-06,1e-05,1e-06,1e-06,1e-06,2e-06,1e-06,1e-06,3e-06,2e-06,1e-06,5e-06,1e-06,1e-06,3e-06,1e-06,2e-06,0,7e-06,5e-06,2e-06,2e-06,3e-06,5e-06
1.1e-05,1.4e-05,2e-06,1e-05,7e-06,7e-06,1.4e-05,6e-06,1.6e-05,1.7e-05,1.9e-05,5.3e-05,2.3e-05,2.9e-05,2.1e-05,2.2e-05,1.9e-05,4e-05,2.4e-05,8e-06,6e-06,3e-06,6e-06,1.1e-05,2.4e-05,0.000285,0.000257,7.4e-05,3e-05,1.4e-05,5e-06,1e-05,3e-06,4e-06,6e-06,8e-06,4e-06,8e-06,9e-06,5e-06,1.6e-05,1.6e-05,3.1e-05,4.4e-05,1.5e-05,1.3e-05,3e-05,2e-05,4.4e-05,2.3e-05,2e-05,2.1e-05,2.3e-05,1.5e-05,1.9e-05,1.4e-05,2.6e-05,2.9e-05,1.5e-05,1e-05,3e-06,1e-06,7e-06,5e-06,6e-06,6e-06,3e-06,4e-06,2e-06,0,2e-06,4e-06,0,2e-06,1e-06,2e-06,3e-06,3e-06,5e-06,1e-06,2e-06,3e-06,1e-06,6e-06,7e-06,8e-06,9e-06,7e-06,5e-06,1.4e-05,1.7e-05,9e-06,1.3e-05,1.7e-05,1.5e-05,5e-06,1.1e-05,9e-06,1.6e-05,8e-06,6e-06,2e-06,2e-06,1e-06,2e-06,3e-06,3e-06,3e-06,5e-06,3e-06,3e-06,3e-06,3e-06,3e-06,5e-06,9e-06,4e-06,3e-06,3e-06,4e-06,4e-06
1.4e-05,7e-06,6e-06,9e-06,6e-06,9e-06,1e-05,1e-05,1.6e-05,3e-05,4.9e-05,9.2e-05,6.9e-05,4.7e-05,2.9e-05,1.7e-05,1.3e-05,5e-05,3.4e-05,1.7e-05,1.1e-05,8e-06,6e-06,5e-06,1.6e-05,0.000276,0.000201,0.000142,4.2e-05,1.1e-05,6e-06,8e-06,4e-06,5e-06,4e-06,4e-06,1e-06,7e-06,4e-06,2e-05,1.4e-05,1.8e-05,3e-06,3e-05,4.7e-05,1.5e-05,5.9e-05,3.5e-05,4.7e-05,3.6e-05,2.6e-05,7e-06,2e-06,2e-05,2.6e-05,1.5e-05,2.4e-05,5e-06,1.5e-05,8e-06,5e-06,1e-06,4e-06,2e-06,2e-06,4e-06,4e-06,3e-06,3e-06,4e-06,1e-06,3e-06,2e-06,2e-06,1e-06,1e-06,2e-06,2e-06,2e-06,4e-06,2e-06,4e-06,5e-06,4e-06,4e-06,4e-06,9e-06,1.1e-05,1e-05,1.1e-05,2.8e-05,7e-06,1.4e-05,2e-05,1.6e-05,1.5e-05,2e-06,1.3e-05,1.7e-05,8e-06,3e-06,3e-06,1e-06,1e-06,3e-06,3e-06,5e-06,2e-06,1e-06,1e-06,0,5e-06,1e-06,2e-06,7e-06,5e-06,6e-06,3e-06,4e-06,0,1e-06
1.2e-05,1.2e-05,9e-06,6e-06,1.5e-05,3e-06,8e-06,4e-06,2.5e-05,1.5e-05,3.9e-05,6.5e-05,4.1e-05,1.2e-05,1.3e-05,1.1e-05,1.1e-05,2.7e-05,2.1e-05,8e-06,1.4e-05,3e-06,5e-06,1e-05,1.4e-05,0.000224,0.000179,6.1e-05,2.4e-05,6e-06,6e-06,3e-06,1e-06,6e-06,4e-06,1e-06,3e-06,6e-06,2e-06,2.3e-05,1.4e-05,1.3e-05,3.1e-05,1.1e-05,4.2e-05,5.3e-05,2.2e-05,4.8e-05,4e-05,1.8e-05,9e-06,1.5e-05,1.6e-05,1.7e-05,1.4e-05,9e-06,2e-05,1.5e-05,8e-06,1.1e-05,4e-06,2e-06,1e-06,5e-06,4e-06,5e-06,1e-06,2e-06,4e-06,3e-06,2e-06,1e-06,3e-06,1e-06,1e-06,1e-06,2e-06,2e-06,2e-06,2e-06,2e-06,3e-06,2e-06,2e-06,3e-06,5e-06,5e-06,3e-06,2e-06,6e-06,1.1e-05,7e-06,1.2e-05,4e-06,8e-06,1.1e-05,3e-06,1.2e-05,2e-06,4e-06,2e-06,2e-06,1e-06,1e-06,1e-06,2e-06,3e-06,1e-06,3e-06,2e-06,1e-06,4e-06,1e-06,3e-06,2e-06,8e-06,7e-06,4e-06,2e-06,1e-06,1e-06
9e-06,5e-06,1.2e-05,9e-06,1.6e-05,1.9e-05,2e-05,1.3e-05,1.8e-05,1.6e-05,2.2e-05,1.1e-05,1.3e-05,9e-06,7e-06,5e-06,3e-06,1.3e-05,5e-06,3e-06,6e-06,6e-06,3e-06,6e-06,2e-05,0.000159,0.000167,9.1e-05,5.2e-05,1.8e-05,1.1e-05,4e-06,5e-06,8e-06,4e-06,1e-06,4e-06,3e-06,3e-06,1.8e-05,1e-05,2e-05,2.6e-05,1.1e-05,3.1e-05,1.4e-05,2.2e-05,1.1e-05,1.5e-05,3e-06,7e-06,4e-06,1e-05,2.1e-05,1.2e-05,1.1e-05,1e-05,2e-06,1e-05,4e-06,1e-06,4e-06,2e-06,5e-06,1e-06,2e-06,2e-06,1e-06,2e-06,3e-06,2e-06,3e-06,2e-06,2e-06,1e-06,2e-06,2e-06,1e-06,4e-06,2e-06,0,1e-06,1e-06,2e-06,2e-06,5e-06,3e-06,4e-06,2e-06,3e-06,9e-06,5e-06,4e-06,1e-06,1.2e-05,1.2e-05,3e-06,3e-06,8e-06,9e-06,4e-06,3e-06,1e-06,2e-06,2e-06,1e-06,4e-06,2e-06,3e-06,1e-06,2e-06,5e-06,1e-06,2e-06,4e-06,6e-06,4e-06,2e-06,1e-06,2e-06,2e-06
7e-06,4e-06,8e-06,6e-06,8e-06,1.5e-05,1.2e-05,4e-06,2.1e-05,5e-06,2e-06,4e-06,4e-06,1e-06,2e-06,7e-06,4e-06,9e-06,3e-06,5e-06,2e-06,5e-06,1e-06,2e-06,1.4e-05,8.8e-05,0.000231,0.000104,2.7e-05,5e-06,6e-06,2e-06,4e-06,4e-06,1e-06,1e-06,3e-06,5e-06,3e-06,1.6e-05,4e-06,1.7e-05,1.8e-05,4e-06,1.2e-05,8e-06,1.1e-05,7e-06,7e-06,6e-06,3e-06,4e-06,4e-06,8e-06,3e-06,7e-06,1e-05,9e-06,8e-06,8e-06,1e-06,2e-06,1e-06,3e-06,2e-06,1e-06,1e-06,2e-06,1e-06,3e-06,0,2e-06,3e-06,1e-06,0,1e-06,2e-06,1e-06,1e-06,2e-06,1e-06,0,1e-06,2e-06,2e-06,5e-06,3e-06,2e-06,2e-06,1e-06,1e-05,4e-06,2e-06,7e-06,7e-06,4e-06,7e-06,5e-06,8e-06,4e-06,3e-06,3e-06,2e-06,1e-06,0,1e-06,2e-06,1e-06,2e-06,1e-06,2e-06,4e-06,0,1e-06,1e-06,7e-06,6e-06,2e-06,1e-06,2e-06,1e-06
5e-06,2e-06,2e-06,1e-06,4e-06,8e-06,4e-06,3e-06,9e-06,3e-06,8e-06,1.2e-05,3e-06,4e-06,5e-06,3e-06,4e-06,7e-06,1e-06,6e-06,5e-06,4e-06,0,4e-06,9e-06,2.6e-05,5.8e-05,2.6e-05,6e-06,5e-06,2e-06,1e-06,2e-06,1e-06,2e-06,2e-06,2e-06,3e-06,3e-06,1.3e-05,7e-06,1e-05,1.5e-05,6e-06,5e-06,3e-06,1.2e-05,8e-06,4e-06,4e-06,1e-06,3e-06,5e-06,5e-06,7e-06,6e-06,4e-06,4e-06,4e-06,5e-06,0,3e-06,2e-06,2e-06,2e-06,1e-06,1e-06,1e-06,1e-06,1e-06,0,1e-06,1e-06,1e-06,1e-06,0,2e-06,1e-06,1e-06,1e-06,1e-06,1e-06,0,0,0,3e-06,1e-06,1e-06,2e-06,3e-06,4e-06,1e-06,5e-06,4e-06,7e-06,4e-06,5e-06,2e-06,3e-06,3e-06,3e-06,2e-06,2e-06,1e-06,1e-06,0,2e-06,1e-06,3e-06,1e-06,1e-06,4e-06,0,1e-06,1e-06,6e-06,5e-06,2e-06,2e-06,2e-06,0
2e-06,1e-06,1e-06,1e-06,3e-06,3e-06,2e-06,0,7e-06,2e-06,7e-06,5e-06,3e-06,4e-06,2e-06,1e-06,2e-06,4e-06,2e-06,1e-06,3e-06,4e-06,1e-06,4e-06,9e-06,1.2e-05,6.6e-05,5e-06,2e-06,1e-06,5e-06,2e-06,2e-06,1e-06,3e-06,2e-06,0,5e-06,2e-06,1.3e-05,8e-06,7e-06,1.2e-05,3e-06,3e-06,3e-06,6e-06,1e-05,5e-06,1e-06,1e-06,1e-06,7e-06,5e-06,8e-06,4e-06,6e-06,2e-06,4e-06,6e-06,0,3e-06,1e-06,2e-06,2e-06,1e-06,1e-06,1e-06,0,2e-06,0,1e-06,1e-06,0,1e-06,0,2e-06,1e-06,1e-06,1e-06,0,0,0,1e-06,0,2e-06,1e-06,2e-06,2e-06,5e-06,6e-06,2e-06,6e-06,1e-06,4e-06,2e-06,2e-06,0,1e-06,1e-06,1e-06,1e-06,2e-06,1e-06,1e-06,1e-06,2e-06,0,3e-06,1e-06,2e-06,4e-06,0,1e-06,1e-06,6e-06,5e-06,3e-06,2e-06,2e-06,0
1e-06,1e-06,2e-06,0,3e-06,2e-06,2e-06,1e-06,7e-06,2e-06,6e-06,6e-06,5e-06,3e-06,3e-06,2e-06,2e-06,4e-06,2e-06,3e-06,4e-06,4e-06,1e-06,3e-06,8e-06,2.8e-05,5.9e-05,2e-06,3e-06,4e-06,0,1e-06,1e-06,1e-06,2e-06,2e-06,1e-06,4e-06,1e-06,1.3e-05,7e-06,8e-06,1.2e-05,4e-06,1e-06,5e-06,1e-05,1e-05,5e-06,3e-06,1e-06,1e-06,6e-06,5e-06,7e-06,3e-06,5e-06,3e-06,6e-06,6e-06,1e-06,2e-06,1e-06,2e-06,2e-06,0,1e-06,2e-06,0,1e-06,0,1e-06,1e-06,0,1e-06,0,2e-06,0,1e-06,1e-06,0,0,0,1e-06,0,2e-06,1e-06,2e-06,2e-06,5e-06,7e-06,1e-06,5e-06,1e-06,2e-06,1e-06,1e-06,0,1e-06,1e-06,1e-06,1e-06,2e-06,1e-06,1e-06,1e-06,2e-06,0,2e-06,1e-06,1e-06,4e-06,0,0,1e-06,6e-06,5e-06,2e-06,2e-06,2e-06,1e-06
