0.022605,0.022186,0.020187,0.023002,0.026197,0.028359,0.03187,0.032789,0.035144,0.035424,0.031614,0.028393,0.026599,0.024664,0.021839,0.018755,0.021221,0.027711,0.028066,0.025261,0.023944,0.022496,0.019629,0.018022,0.01961,0.022042,0.022468,0.02146
0.026443,0.025983,0.023765,0.027295,0.031035,0.033123,0.037492,0.039053,0.041157,0.041324,0.037192,0.033445,0.031539,0.029346,0.025969,0.022493,0.025082,0.032111,0.032165,0.028892,0.027616,0.025943,0.02288,0.021266,0.02278,0.02553,0.026645,0.025647
0.033063,0.032472,0.030011,0.034737,0.038848,0.04027,0.046215,0.049313,0.050827,0.050447,0.045838,0.041651,0.039649,0.037174,0.033214,0.02927,0.031284,0.038232,0.037864,0.034733,0.033823,0.031109,0.027559,0.026538,0.027793,0.030409,0.03312,0.032488
0.039429,0.037918,0.035181,0.040689,0.044414,0.045401,0.052694,0.057009,0.057819,0.056606,0.052208,0.048934,0.046836,0.044161,0.040484,0.036545,0.036997,0.042297,0.041574,0.040283,0.04013,0.034871,0.029986,0.030087,0.031169,0.032766,0.037294,0.037863
0.049015,0.044365,0.04046,0.046813,0.051591,0.055172,0.062607,0.066276,0.0674,0.064943,0.061332,0.059811,0.056531,0.052749,0.050174,0.046258,0.04472,0.048421,0.046918,0.048508,0.049272,0.040296,0.033801,0.034985,0.035963,0.036103,0.042257,0.045413
0.070405,0.060381,0.053031,0.06109,0.070794,0.082108,0.088075,0.088756,0.094754,0.091876,0.086486,0.084704,0.078925,0.07093,0.066841,0.061409,0.057369,0.062423,0.062157,0.067024,0.067507,0.054173,0.047402,0.049547,0.048934,0.047641,0.055587,0.062537
0.110371,0.091767,0.080125,0.093116,0.111931,0.133854,0.138238,0.134318,0.144902,0.139643,0.128437,0.124602,0.118976,0.105916,0.096761,0.088419,0.082141,0.091348,0.09538,0.105005,0.104065,0.082915,0.074003,0.078301,0.074831,0.071847,0.083185,0.094317
0.163739,0.135043,0.123536,0.146724,0.175915,0.210164,0.21449,0.203928,0.21795,0.209687,0.188659,0.181077,0.180987,0.160835,0.139336,0.128073,0.121433,0.136938,0.147163,0.161609,0.158244,0.125055,0.110245,0.119625,0.113305,0.106283,0.122118,0.138275
0.217221,0.183794,0.177239,0.210868,0.246363,0.29601,0.309392,0.28932,0.304053,0.298711,0.265131,0.247195,0.255746,0.227424,0.18619,0.172279,0.168723,0.193083,0.210109,0.226639,0.220392,0.171819,0.145898,0.164213,0.156649,0.143135,0.163308,0.181925
0.253937,0.227749,0.227161,0.260809,0.296358,0.365654,0.395935,0.365298,0.378123,0.383354,0.336711,0.305609,0.327369,0.293263,0.231424,0.213987,0.213666,0.246104,0.270192,0.290581,0.285042,0.217304,0.171136,0.196321,0.190128,0.171575,0.196602,0.212449
0.257241,0.248044,0.251408,0.272297,0.305057,0.393714,0.439821,0.411641,0.42979,0.436945,0.376709,0.343424,0.375579,0.339438,0.273035,0.254025,0.250128,0.282198,0.31228,0.340657,0.339278,0.255632,0.186433,0.210579,0.210375,0.188333,0.214027,0.220856
0.238215,0.24997,0.254148,0.262715,0.288064,0.374298,0.429221,0.423059,0.444645,0.43401,0.366472,0.342561,0.375857,0.344882,0.29059,0.275176,0.270922,0.295577,0.328283,0.359366,0.360372,0.284394,0.206633,0.215147,0.216378,0.190011,0.214144,0.213136
0.220375,0.240135,0.23946,0.243781,0.259039,0.322383,0.383616,0.405601,0.413483,0.380394,0.324605,0.30918,0.331069,0.309186,0.273972,0.263368,0.263114,0.278695,0.307151,0.332945,0.331834,0.282322,0.217666,0.212202,0.213557,0.185446,0.20545,0.204679
0.191914,0.221127,0.218506,0.212008,0.209491,0.24066,0.297158,0.348343,0.361581,0.328022,0.279556,0.253733,0.267097,0.255142,0.231633,0.224757,0.221121,0.226575,0.253068,0.276695,0.272543,0.247021,0.204567,0.192166,0.193893,0.171364,0.190078,0.19377
0.181026,0.211934,0.197597,0.17437,0.165854,0.184874,0.222486,0.278178,0.302246,0.288984,0.253862,0.212202,0.22178,0.212363,0.184919,0.18461,0.175156,0.175532,0.200899,0.232186,0.234926,0.216888,0.193805,0.171591,0.164099,0.151867,0.173358,0.189436
0.231138,0.236488,0.19284,0.162203,0.168269,0.214086,0.231881,0.247877,0.285198,0.321117,0.302662,0.233473,0.240914,0.233966,0.184171,0.177175,0.176304,0.192137,0.20692,0.247418,0.264035,0.235273,0.213245,0.180173,0.164657,0.162711,0.190618,0.227289
0.322666,0.309013,0.249739,0.212184,0.216335,0.29365,0.313472,0.293999,0.366751,0.4456,0.410524,0.301541,0.299871,0.303025,0.240013,0.218722,0.220603,0.25882,0.272168,0.310793,0.328738,0.299214,0.277715,0.231305,0.202554,0.207175,0.24921,0.29852
0.418537,0.39449,0.341337,0.307598,0.307987,0.411489,0.441899,0.415344,0.539656,0.61704,0.537711,0.411236,0.401326,0.391969,0.310416,0.286052,0.283285,0.33213,0.346906,0.366529,0.383814,0.387412,0.371852,0.305709,0.256159,0.257646,0.310647,0.354012
0.514626,0.472916,0.433162,0.423263,0.444646,0.58228,0.602098,0.550436,0.721496,0.805331,0.706028,0.565114,0.548543,0.518345,0.387747,0.355694,0.345443,0.382501,0.396475,0.401142,0.423757,0.465543,0.448747,0.368225,0.29743,0.298379,0.379718,0.405373
0.628292,0.555609,0.500253,0.534109,0.600068,0.754468,0.731349,0.647208,0.854567,0.988492,0.924037,0.752967,0.7054,0.653501,0.457301,0.404554,0.396757,0.402452,0.40219,0.418723,0.448493,0.496467,0.489219,0.412164,0.315477,0.323855,0.457895,0.474611
0.720424,0.628526,0.545516,0.640924,0.746406,0.851395,0.780314,0.707372,0.951913,1.163688,1.178289,0.963037,0.810013,0.733008,0.528327,0.455259,0.440523,0.416783,0.409175,0.455699,0.473319,0.478263,0.489776,0.439474,0.329189,0.361112,0.545647,0.539817
0.70521,0.639962,0.578765,0.739257,0.854864,0.862832,0.760625,0.736624,1.012278,1.268957,1.345772,1.110572,0.842884,0.756587,0.61088,0.526033,0.479027,0.436186,0.451729,0.509921,0.48416,0.456842,0.504798,0.488933,0.380441,0.428291,0.613303,0.554394
0.585842,0.587927,0.625387,0.829196,0.912999,0.843247,0.725998,0.711717,0.98831,1.203407,1.262249,1.131739,0.880952,0.760454,0.641908,0.554972,0.508158,0.472546,0.497688,0.535478,0.493928,0.472151,0.51942,0.523056,0.455547,0.506877,0.626613,0.503114
0.45396,0.552023,0.734758,0.968914,1.003708,0.869646,0.712279,0.640632,0.912917,1.053188,1.032959,1.072261,0.901089,0.720569,0.621747,0.541539,0.529533,0.527598,0.535363,0.553833,0.541829,0.507711,0.478365,0.49373,0.509481,0.540356,0.563747,0.424154
0.422605,0.545521,0.769831,1.010448,1.043288,0.911484,0.765744,0.677074,0.882147,0.944812,0.916228,0.997532,0.813758,0.609071,0.572993,0.548756,0.572153,0.582272,0.557182,0.569386,0.58493,0.512828,0.397709,0.424017,0.517787,0.516907,0.501782,0.42334
0.496093,0.529361,0.646067,0.87764,0.997901,0.927783,0.82249,0.786353,0.9572,0.976251,0.878496,0.883066,0.73981,0.551334,0.545092,0.588607,0.621079,0.601349,0.567659,0.601513,0.596597,0.514153,0.37913,0.391469,0.506529,0.489452,0.485496,0.472144
0.544506,0.460806,0.45847,0.664226,0.840045,0.876801,0.816488,0.847571,1.08582,1.060397,0.813276,0.730895,0.688452,0.576682,0.566375,0.592887,0.617068,0.610724,0.574839,0.60213,0.570622,0.518439,0.430408,0.425219,0.505713,0.488755,0.48076,0.494906
0.559042,0.468554,0.43721,0.635516,0.796217,0.843271,0.780305,0.842164,1.100372,1.060841,0.761143,0.599561,0.623665,0.581473,0.550066,0.522892,0.571951,0.617896,0.545261,0.541801,0.529016,0.509655,0.466739,0.486098,0.508267,0.462194,0.460136,0.516425
0.58406,0.537368,0.543922,0.710622,0.851588,0.898665,0.783945,0.835492,1.022213,0.942809,0.693515,0.546868,0.61049,0.593718,0.553785,0.497949,0.530518,0.563146,0.548755,0.560672,0.483115,0.466148,0.464775,0.512381,0.502299,0.415587,0.454573,0.583072
0.600774,0.633143,0.723168,0.761385,0.861549,0.91451,0.786006,0.839381,0.941829,0.808426,0.620017,0.565595,0.623914,0.645218,0.620488,0.530717,0.506868,0.517784,0.625047,0.667696,0.520373,0.495353,0.487628,0.486067,0.469979,0.396819,0.491115,0.6641
0.636804,0.794906,0.916838,0.7515,0.773911,0.812911,0.751734,0.83001,0.907772,0.785414,0.622647,0.639484,0.662198,0.725996,0.755609,0.639691,0.519731,0.514397,0.710945,0.747524,0.603135,0.551845,0.480023,0.41859,0.410898,0.388485,0.516908,0.662884
0.696056,0.982839,1.042421,0.680078,0.624046,0.729495,0.821534,0.841564,0.856273,0.798447,0.631969,0.682837,0.737169,0.802808,0.810388,0.695305,0.57916,0.570786,0.710448,0.684039,0.589157,0.520176,0.400041,0.366863,0.375453,0.357031,0.48026,0.551368
0.650331,1.026145,1.062314,0.578592,0.425133,0.629325,0.865944,0.843916,0.763327,0.692582,0.571834,0.672787,0.769288,0.793615,0.748949,0.647923,0.583135,0.588777,0.595196,0.502839,0.458573,0.403631,0.324692,0.356542,0.375161,0.348248,0.399805,0.390573
0.561305,0.863679,0.920818,0.491787,0.281909,0.471505,0.752432,0.706217,0.570246,0.544754,0.525629,0.608413,0.660081,0.684504,0.700566,0.598375,0.541131,0.534452,0.459139,0.356311,0.332316,0.344979,0.333927,0.399805,0.412592,0.3612,0.347355,0.320302
0.544856,0.649518,0.683997,0.469481,0.296273,0.383386,0.571027,0.547448,0.501446,0.512147,0.476096,0.494803,0.470962,0.628855,0.756155,0.585616,0.508089,0.486783,0.450677,0.316559,0.26132,0.34963,0.390845,0.437134,0.429223,0.377995,0.390486,0.338329
0.619694,0.570073,0.530099,0.568497,0.466966,0.473165,0.596733,0.581614,0.639519,0.633215,0.500721,0.452475,0.355503,0.647992,0.865767,0.631223,0.511628,0.528953,0.503062,0.351056,0.298562,0.359768,0.441697,0.443857,0.392374,0.38373,0.466312,0.368072
0.683089,0.611996,0.613252,0.837483,0.704266,0.672102,0.844962,0.741729,0.745139,0.802647,0.647086,0.470781,0.310685,0.688122,0.951314,0.672203,0.576573,0.625456,0.530521,0.423289,0.400391,0.348989,0.454149,0.46952,0.367267,0.403856,0.512428,0.383198
0.715105,0.724709,0.812449,1.119997,0.927558,0.899662,1.118857,0.842532,0.714995,0.885961,0.773561,0.469323,0.280307,0.701871,1.084,0.822672,0.693473,0.681205,0.521058,0.544618,0.519451,0.367872,0.454235,0.486816,0.325088,0.381312,0.476094,0.354672
0.706097,0.807005,0.997856,1.266982,1.03321,1.046753,1.280023,0.830731,0.597109,0.828153,0.823603,0.497467,0.336044,0.759886,1.201823,0.987598,0.815844,0.684859,0.529604,0.678447,0.594688,0.431073,0.521112,0.473856,0.243003,0.299865,0.372286,0.301607
0.597509,0.792556,1.056446,1.190965,0.961506,1.014399,1.252101,0.776213,0.592576,0.724065,0.799469,0.572608,0.463399,0.837799,1.178714,1.009097,0.844615,0.638133,0.562484,0.757588,0.601458,0.485345,0.630817,0.439565,0.191595,0.227343,0.283624,0.316066
