-7.6e-05,-0.000135,-3.9e-05,-0.000194,-0.000182,-8e-05,-8.4e-05,-7e-06,-1.1e-05,-0.000245,-0.000611,-0.000325,-0.000176,-0.000105,-0.002898,-0.002283,-0.006006,-0.007357,-0.006278,-0.008421,-0.004574,-0.001501,0.000225,-0.002944,-0.002153,-0.001329,-0.000594,-0.000257,-0.00046,-0.000444,-0.000196,3.1e-05,-0.001218,-0.000582,-9.6e-05,-0.008976,-0.007926,-0.00405,-0.004397,-0.001994,-0.000944,-0.001118,-0.00067,0.00752,-0.007741,-0.012026,-0.010705,-0.009557,-0.012564,-0.011241,-0.014318,-0.015786,-0.017516,-0.012574,-0.015239,-0.009485,-0.011214,-0.021453,-0.011861,-0.009773,-0.012047,-0.003945,-0.006055,-0.008,-0.009679,-0.011125,-0.010524,-0.014138,-0.012862,-0.013121,-0.011406,-0.013392,-0.014504,-0.012042,-0.007413,-0.008269,-0.007617,-0.006981,-0.006609,-0.005977,-0.007081,-0.005869,-0.005034,-0.003788,-0.002962,-0.002157,-0.002562,-0.002495,-0.001111,-0.00158,-0.001816,-0.001712,-0.001382,-0.00041,-0.000857,-0.000805,-0.001152,-0.001038,-0.000909,-0.000946,-0.000561,-0.00091,-0.000743,-0.000493,-0.000218,-0.00066,-0.000858,-0.000494,-0.000269,-0.000385,-0.000279,-0.000245,-0.000325,-0.000173,-0.000469,-0.000548,-0.000523,-0.000431,-0.000402,-0.000429,-0.000196
-0.00012,-0.000174,-0.000126,-1.6e-05,-1.3e-05,7e-06,-3.7e-05,-8.4e-05,5.5e-05,-5.3e-05,0.000148,4.1e-05,-4e-05,1.1e-05,4.5e-05,0.000456,0.002571,0.004719,0.001303,0.004358,0.003056,0.001526,0.000546,0.001847,0.00153,0.000998,0.00067,3e-05,0.000309,0.000283,-2.9e-05,-0.000255,-0.000351,-0.00035,-0.001692,-0.004114,-0.006911,-0.003477,-0.003729,-0.00244,-0.001155,-0.000258,-0.000192,-0.000493,-0.002995,-0.001161,-0.000209,0.000969,0.000841,-0.003816,-0.000874,-0.001728,-0.000623,-0.005623,-0.001789,-0.000211,-0.000847,0.003474,0.000404,-0.002976,-0.003664,-0.005808,-0.003945,-0.006674,-0.001369,0.00492,0.00223,-0.001206,-0.003934,0.004643,-0.001665,-0.005307,0.000328,0.00154,-0.004633,-0.002382,-0.00042,-0.002582,0.001338,0.000766,-0.000371,0.000382,-0.003122,-0.003537,-0.001387,-0.001272,-0.001028,-0.00063,-0.001607,-0.001132,-0.000982,-0.001153,-0.001055,-0.000964,-0.001083,-0.000483,-0.000275,-0.00071,-0.000117,-0.000378,-0.000687,-0.000338,-0.000331,-8.4e-05,9.7e-05,-0.000182,-0.000175,-0.000258,-0.000129,-0.00017,-0.000262,-0.000133,4e-06,7e-06,-0.000167,-0.000123,-0.000187,-0.000336,-0.000198,-7.7e-05,-0.000267
0.000206,0.000158,5.3e-05,7.2e-05,4e-06,7.5e-05,-2.6e-05,-8.8e-05,1.8e-05,5e-05,-0.000147,-5.3e-05,-2.1e-05,5e-06,-0.000123,-9e-04,-0.004432,-0.002806,-0.002146,-0.003265,-0.002155,-0.000726,-4.1e-05,-0.000525,-0.00096,-0.000837,-0.000433,-0.000171,-0.000142,-1.8e-05,-8.4e-05,-0.000395,0.000696,9.1e-05,0.000412,-0.002276,0.002394,0.001382,0.001889,-0.000935,0.000661,0.000322,-8.6e-05,-0.001447,-0.00934,-0.004585,-0.00145,-0.001541,-0.003464,-0.002364,-0.007841,-0.001857,0.000969,-0.005706,-0.002647,-0.007967,-0.004003,-0.008729,-0.008433,-0.006235,-0.003497,0.000396,0.003441,-0.000714,0.001286,-0.001968,-0.002302,0.001832,0.002045,-0.00511,-0.003028,-0.001003,-0.001598,-0.000963,0.000721,0.001175,-0.002519,-0.000451,-0.001983,-0.000479,0.000668,-0.000247,0.001462,0.000611,-3.4e-05,-0.001433,-0.001002,-0.000371,1e-06,0.000362,8.9e-05,0.00031,0.000205,-0.000382,-0.000102,-5.3e-05,-2.3e-05,-0.000237,-0.000351,-2.2e-05,0.000229,0.000248,-0.000124,3.2e-05,1e-06,0.000165,-0.000134,-0.000166,9.6e-05,-8.1e-05,-0.000217,2.6e-05,0.00011,9.4e-05,3.7e-05,-4.5e-05,1.1e-05,-1.4e-05,0.000219,-9.4e-05,-6.1e-05
-0.00012,-7.7e-05,-3.3e-05,7e-06,-4.4e-05,-7e-06,6.9e-05,-2.2e-05,-5.4e-05,-0.000144,-4.6e-05,6e-06,-1.4e-05,-0.000113,-6e-06,0.000696,-0.00086,-0.001988,0.000647,0.001039,0.001727,0.000738,0.000144,0.000105,0.00072,0.000181,0.00032,-0.000115,2.7e-05,5.1e-05,5.4e-05,0.000109,-0.000461,-0.000272,-0.000125,0.002253,-0.002596,-0.002293,0.000433,0.000612,-6.9e-05,-0.000728,0.000311,0.000328,0.0035,0.002621,-0.00388,0.002295,0.004402,0.001418,3.5e-05,-0.001802,0.006271,0.002817,0.002879,-0.001002,-0.000244,-0.001389,-0.002464,0.00044,-0.002612,-0.000671,0.002323,0.000924,0.00172,0.001472,0.003545,-0.004269,-0.000619,0.000593,0.003611,0.005582,0.006562,0.002616,0.001164,0.002536,-0.001649,-0.001874,0.000133,0.000319,0.001344,0.000228,0.00076,0.001289,0.000127,0.001157,0.000925,0.000841,0.00043,0.000445,0.000204,0.000412,-0.000629,0.000707,0.00046,-0.000211,-0.000279,2.4e-05,0.000144,5.4e-05,-3.6e-05,0.000139,0.000199,-0.000181,-0.000118,-5e-06,0.000162,0.000169,0.000117,-3.7e-05,-5.5e-05,-5.6e-05,-4.1e-05,8e-06,-7.6e-05,-4.6e-05,-3.4e-05,0.00014,9.7e-05,-3.5e-05,-7e-05
-1e-06,-0.000101,-0.000149,-5.6e-05,6e-06,-2.6e-05,-8.1e-05,-6e-05,3.9e-05,5.1e-05,7.5e-05,1.6e-05,4.6e-05,5.4e-05,4.8e-05,-0.000278,0.000946,-0.001,-0.00084,-0.000776,-9e-04,-0.000405,-3.4e-05,0.000218,-0.000335,-8e-05,-0.000147,-5e-06,-0.000116,-9.9e-05,-0.000102,-0.000114,-0.000342,-0.000344,-0.000414,0.000401,0.00342,0.000841,0.000421,0.000767,0.000164,0.000224,2.3e-05,-0.000366,-0.006095,-0.006604,0.001232,0.000863,0.002444,-0.000372,-0.003203,-0.004943,-0.009788,-0.002253,-0.000333,-0.003246,-0.002124,0.002166,-0.003674,-0.001216,0.00447,-0.003175,-0.002697,0.003173,-0.002967,-0.000994,-0.000412,0.001155,0.001654,-0.001953,0.00268,-0.001594,-0.001008,-0.001532,-0.000926,0.002112,-0.000175,0.002232,0.000252,0.000289,-0.000662,-0.000417,-0.001106,2.8e-05,-0.000183,0.000366,-0.000597,-2e-06,-8.4e-05,-0.000381,0.000178,0.000261,0.000272,-0.00113,-5.6e-05,0.000269,2.6e-05,0.000357,-4.1e-05,0.000133,-0.000138,-4e-06,-0.000138,4e-06,0.000101,9.7e-05,-1.1e-05,7.2e-05,1.4e-05,-0.000244,-5e-05,-8e-06,-5.1e-05,0.00015,-0.000124,3.8e-05,-6e-06,8.2e-05,-4.9e-05,0.00023,-2e-06
5.3e-05,9.4e-05,7e-05,0.000113,-6.2e-05,-1.3e-05,-1.4e-05,4.9e-05,3.8e-05,-3e-06,-2.2e-05,-1.9e-05,-3.2e-05,2.7e-05,4.4e-05,-1.9e-05,-0.000689,0.000503,0.001584,0.000796,3.8e-05,8e-06,-5.3e-05,-0.000257,0.000125,0.000213,0.000255,-8e-06,-1.4e-05,9.1e-05,-1e-04,4.3e-05,5.4e-05,0.000293,-3.3e-05,0.000766,0.000919,0.000125,-7.3e-05,-0.000525,5e-05,-0.000299,0.000127,0.000416,-0.001992,-0.003395,-0.003026,0.004983,-0.000151,-0.000137,0.005026,0.004457,0.002438,0.001699,0.00246,0.000299,-0.000782,0.000846,0.007045,0.002805,0.001745,0.004352,-0.004668,-0.001194,0.000718,-0.000628,-0.003655,-0.001511,-0.000886,0.00202,0.000544,-0.000108,0.003442,0.002055,0.003199,0.001947,0.00129,0.001144,0.00095,0.001127,0.000483,0.001333,3.8e-05,-8.3e-05,1.6e-05,4e-04,0.000238,-0.000231,0.000182,0.000174,-3.2e-05,-3.7e-05,0.000424,0.000147,1.9e-05,0.000158,-9.4e-05,-6e-06,-4.3e-05,-0.000101,-5.9e-05,-0.00026,0.000123,-0.000211,4.2e-05,-0.000169,-7e-05,-2.6e-05,-6.1e-05,0.00014,0.000153,0.000148,0.00015,5.4e-05,8.4e-05,0.000168,0.000163,2.1e-05,8.1e-05,-3.9e-05,2.5e-05
-2.4e-05,-5e-05,-1.6e-05,-1.8e-05,3.1e-05,3e-06,-8e-06,-1.9e-05,-4.1e-05,-7.8e-05,3.5e-05,-4.6e-05,2.8e-05,0,8e-06,8.7e-05,-0.000499,0.000547,-0.002129,-0.00101,-0.000513,-5.1e-05,-0.000102,-0.000446,-0.000205,-0.000353,-0.000122,-0.000108,6.8e-05,-3e-06,5.9e-05,5.2e-05,9.6e-05,-0.000181,0.000134,-0.001172,-0.002275,-0.002067,-0.000459,-0.001228,-0.001662,-0.000733,-1.8e-05,-0.000253,0.001092,-0.000223,-0.002979,-0.00218,-0.00347,0.000419,0.001099,-0.001081,0.001329,-0.004029,-0.004455,0.000211,0.000732,-0.001368,-0.001828,-0.002407,0.000174,0.000639,0.001716,0.000277,-0.001914,-0.003401,0.000559,0.002173,0.000925,0.00088,-0.001442,-0.002196,-0.004747,0.000566,-0.003524,-0.002561,4.4e-05,0.000482,-1.1e-05,-0.001163,-0.000172,-0.000967,0.000556,-0.000184,8e-05,0.000103,-0.000199,-0.000643,0.000164,0.000188,-0.000344,-0.000346,-0.00027,4.9e-05,-0.000228,0.000273,7e-06,8.1e-05,8.1e-05,-1.7e-05,1.8e-05,0.000255,-6.2e-05,1.4e-05,-8.9e-05,1.2e-05,-0.000117,-3e-05,4.3e-05,4e-06,0.000144,-5.7e-05,-7.4e-05,-7e-06,-1.7e-05,-8.1e-05,9.5e-05,9e-06,-9.3e-05,-0.000125,7.3e-05
-3e-06,6e-06,-5.6e-05,-5.6e-05,2.4e-05,1.3e-05,-8e-06,-4.4e-05,-3.1e-05,4.6e-05,-1.6e-05,-8e-05,-1e-05,9e-06,-4.6e-05,-2.8e-05,0.000709,1e-05,0.001725,0.000493,-6.3e-05,-8.3e-05,-0.000154,-0.000131,4.6e-05,0.000209,0.000259,0.000122,7e-06,3.7e-05,-2.4e-05,-0.000123,7.8e-05,0.000159,0.000199,7e-04,0.000742,0.000775,-0.000338,0.000126,-0.000303,-8.5e-05,5.8e-05,-1e-04,-0.000409,0.001246,0.001074,0.003698,-0.000921,-0.002242,-0.001296,0.002624,-0.000157,0.00557,-0.002038,-0.00169,0.001076,-0.001534,0.002769,0.000786,-2.8e-05,-0.00181,0.000815,0.003221,0.001246,-0.001811,-0.002526,0.000488,-0.000135,-0.000879,-5.2e-05,0.002728,-0.000368,-0.001776,0.000208,0.000547,-0.002155,-0.001015,-0.000535,0.000465,0.000168,0.00042,-0.000439,8e-05,-3.4e-05,0.00014,0.000503,0.00043,0.000202,6e-06,-3.8e-05,-0.000278,-0.000194,5e-05,1.2e-05,-9.8e-05,0.000108,9.8e-05,0.00011,1.5e-05,5.8e-05,-7.1e-05,-5.4e-05,-6e-06,-1.7e-05,-7.3e-05,4.4e-05,-8.1e-05,-0.000107,-2.3e-05,-0.000132,-0.000123,-1.3e-05,1e-06,-0.00014,-0.000157,-0.000113,-6e-05,-8.1e-05,-5e-06,-7.5e-05
4.5e-05,2.5e-05,6.5e-05,-7e-06,-7.1e-05,-1.2e-05,1.3e-05,2e-06,2e-06,2e-06,-4.9e-05,9.2e-05,4e-06,-1.9e-05,-1e-06,-1.9e-05,-0.000164,0.00025,-0.000701,-0.000524,-0.000421,-0.000165,-0.000159,-3e-06,-7.8e-05,-0.000223,-3.7e-05,-0.000113,-5.8e-05,-8.4e-05,1.4e-05,-5.4e-05,-8.8e-05,-7.1e-05,-0.000153,-0.000295,-0.000147,0.000368,-0.000919,-0.000466,-0.000229,-0.000598,-0.000319,-0.000194,0.000232,0.001773,0.001818,-0.004844,-0.001964,-4e-05,0.002828,0.001802,-0.002034,-0.00248,0.000954,0.000301,-0.003993,-0.001582,-0.003015,-0.000393,-0.000686,-0.00034,-0.000652,0.001546,0.000264,0.001679,0.001619,-0.000963,0.000415,0.000436,5.8e-05,-7.3e-05,0.000662,0.001483,-0.00055,-0.000869,0.000893,0.001151,0.000817,-2.7e-05,1.5e-05,7.7e-05,-2.1e-05,0.000111,1.3e-05,7.2e-05,-4.1e-05,-0.000359,-0.000686,3.2e-05,0.000274,0.00037,4.2e-05,0.000177,0.000276,-0.00015,-0.000113,-0.000146,-7.4e-05,0.000114,1.2e-05,-1.3e-05,-8.8e-05,3.7e-05,-3.9e-05,-5.9e-05,6.1e-05,-1e-06,-5.1e-05,8.1e-05,0.000151,-1.4e-05,2.1e-05,-4e-05,-2.5e-05,-0.000111,-4.4e-05,-3.1e-05,0.000104,-5.5e-05,-2.7e-05
-3.8e-05,-3.4e-05,1e-06,1.1e-05,2.4e-05,5e-06,-1.2e-05,4.2e-05,6e-06,3.4e-05,1.7e-05,-2.2e-05,4.4e-05,1.4e-05,3.8e-05,2.1e-05,6.8e-05,5e-05,0.000363,0.000909,0.00027,-7.6e-05,-0.000108,-6e-05,3.6e-05,-2.9e-05,-7.2e-05,-1.3e-05,1.2e-05,-2e-06,-7e-06,4e-06,-5.1e-05,0.000291,-6.2e-05,-5.4e-05,3e-04,0.000319,0.000786,0.000137,0.000348,0.000616,-2.1e-05,0.000166,3.8e-05,0.001065,0.00083,-0.000623,0.001207,-0.00239,-0.000732,-0.000682,-0.002705,0.000799,0.001608,0.001059,4e-06,0.001317,0.000594,-0.000472,0.000249,-0.001462,0.001066,-0.001062,-0.000981,-0.000625,4.4e-05,-0.001476,-0.001436,-0.001056,0.001925,-0.001785,0.000704,-0.000368,-0.000518,0.000266,-0.001916,-0.000449,-0.000469,5.7e-05,0.000179,-0.000659,0.000602,-4.3e-05,-0.000197,-7.1e-05,-0.000123,0.000169,-0.000107,-0.000261,2.1e-05,-3.9e-05,0.000134,3.2e-05,-0.000109,-6.1e-05,0.000127,-3e-06,-4e-05,-0.000134,-0.000109,2.3e-05,7.2e-05,-3.7e-05,-0.000126,7.7e-05,6.1e-05,5e-05,9e-06,-6.2e-05,-1e-04,5.3e-05,-1.4e-05,2.8e-05,3.6e-05,1.3e-05,-3.2e-05,2e-05,-3.1e-05,-5e-06,8e-06
-2.9e-05,4e-06,-2.8e-05,-5.8e-05,2.8e-05,1.3e-05,-9e-06,-3e-06,3e-06,-3.6e-05,-2.6e-05,1.9e-05,1.6e-05,-2.7e-05,-9e-06,0,-0.000497,-0.000214,0.000368,-0.000478,4.1e-05,-1.8e-05,-7.7e-05,-2.9e-05,7.6e-05,1.6e-05,5.1e-05,-3.8e-05,1.1e-05,-8.5e-05,1.5e-05,1.7e-05,-4e-06,-0.000166,6.8e-05,3e-06,-0.000423,-0.000137,-0.000189,0.000119,0.000591,0.000333,1e-05,-0.000211,-0.000408,4.1e-05,0.001205,8e-04,-0.001027,0.001406,-0.001037,-0.001222,-0.001079,-0.000453,0.000261,-8.1e-05,0.000571,0.001525,0.000899,0.002234,0.00218,0.002148,-0.000152,-0.001981,-0.00116,0.000624,0.000481,0.002503,0.000829,0.000415,-0.00192,-0.000444,-0.001308,-0.000133,-0.000197,-0.000769,0.001228,-0.000429,-0.000173,-0.000101,-0.000125,1.9e-05,-0.000147,5.5e-05,9.6e-05,-0.000526,-0.000111,0.000119,0.000335,3.8e-05,-5e-05,5e-05,-9.3e-05,-0.000392,-3.5e-05,6.5e-05,-0.000186,-0.00013,-5.7e-05,-1.9e-05,4.5e-05,-1.3e-05,-6.7e-05,-0.000133,-3e-05,-1e-05,-3.4e-05,4.3e-05,1.3e-05,6.8e-05,-1e-05,-6.8e-05,8e-05,-1e-06,3.8e-05,5.5e-05,2e-06,2e-06,1.7e-05,2.2e-05,2.5e-05
1.3e-05,3e-06,9e-06,3.4e-05,-1e-06,-1.4e-05,1.8e-05,9e-06,1.5e-05,6e-06,-3e-06,-2.9e-05,-8.1e-05,2e-05,3.6e-05,-9e-06,0.00044,0.000289,0.000103,-0.000402,-6.3e-05,2.7e-05,-1.5e-05,3.6e-05,-5e-05,-1.4e-05,-7.1e-05,-0.000109,-1.8e-05,-9e-06,-3.7e-05,9e-06,4.3e-05,-5.2e-05,-0.000296,2.8e-05,0.000418,-0.00015,-0.000871,0.000134,-5.9e-05,-3.6e-05,-5.2e-05,0.000197,0.000177,-0.000948,0.00011,-0.002208,0.000187,-0.000302,-0.000343,8.4e-05,0.000911,0.001143,-0.000108,-0.000304,0.000655,0.001392,0.000692,-0.001453,-0.001577,-0.000201,-0.000733,7e-06,0.000483,0.000864,0.001203,-0.001179,-0.000128,-0.000741,0.000341,0.000794,-0.000195,0.000345,-0.000248,0.000649,3e-06,-3.5e-05,-0.000104,0.00021,0.000382,0.000236,0.000532,-0.00021,0.000142,0.000127,-2.5e-05,2e-05,0.000141,-3.7e-05,-5.6e-05,-9.5e-05,9.7e-05,-3.3e-05,-0.00015,-1.4e-05,-2.2e-05,2.4e-05,6.3e-05,-3.2e-05,-4.3e-05,-3.9e-05,-4.7e-05,-9.4e-05,2.9e-05,-1.2e-05,-4.5e-05,-2.2e-05,4.7e-05,2.6e-05,8e-06,2.6e-05,-5.9e-05,-1.4e-05,-6.4e-05,-2.3e-05,-5e-06,4e-06,3e-06,2.9e-05,5.6e-05
0,0,-1.8e-05,-1.2e-05,-4e-06,1.1e-05,-9e-06,-6e-06,-2e-06,-2.5e-05,-5e-06,1.7e-05,7.9e-05,5e-06,-3.9e-05,-3e-06,-0.000114,-4.4e-05,-1e-06,-0.000276,-8.5e-05,1.8e-05,3.9e-05,2e-06,-2.8e-05,-1e-05,3.5e-05,0.000132,5e-06,-1.6e-05,1.2e-05,-2e-06,3.4e-05,-1e-06,0.00018,7.5e-05,-0.000132,-1.8e-05,0.001771,2.5e-05,-0.000174,-0.00019,-1.3e-05,-0.000244,-5.9e-05,-0.000141,0.000825,0.000599,0.000766,0.000339,0.000372,0.000462,0.001972,0.000419,-6e-06,-1.9e-05,-0.000442,0.000256,-0.000494,-0.000211,-0.00014,0.000693,-0.000336,0.000249,0.000199,-0.001116,-0.000526,0.000971,0.000304,0.001643,0.000297,0.000422,0.000192,-0.000207,-0.000246,-0.000735,0.000137,-0.00013,-0.000101,-0.000158,-0.000108,6.5e-05,-0.000386,0.000385,-0.000202,0.00016,7.7e-05,1.5e-05,-6.6e-05,0.000191,-1e-05,-0.000134,-0.000116,0.00017,-1.5e-05,-6.7e-05,9e-06,-1.4e-05,-2.5e-05,5.1e-05,5.8e-05,4.9e-05,0.000129,9.9e-05,3.7e-05,2.7e-05,-3e-06,-8.6e-05,4e-06,3.9e-05,-2.1e-05,4.2e-05,-2.4e-05,2e-06,1.3e-05,1.3e-05,-5e-06,-3e-06,-5e-06,-1.9e-05,-3.2e-05
1.6e-05,0,5e-06,1.3e-05,1.2e-05,6e-06,-3e-06,5e-06,-2e-06,1.1e-05,3e-06,-3e-05,-5e-05,-1.3e-05,1e-06,2e-06,-0.000192,-7e-05,-0.000558,0.000364,2e-06,4.8e-05,-5.7e-05,-1.2e-05,4e-06,5.6e-05,-5.7e-05,-7.8e-05,-1.6e-05,-2.6e-05,1e-05,2.2e-05,-3.7e-05,6.5e-05,-2e-06,-8.1e-05,-6.4e-05,0.000248,-0.000349,-1.2e-05,5.7e-05,-3.3e-05,1.2e-05,1.4e-05,0,0.000794,1e-06,-2.2e-05,-8.5e-05,-0.000406,0.000238,-0.000459,0.000239,-0.000617,0.001135,0.000487,0.000207,-0.000902,-0.000196,0.000371,-0.000654,-0.000521,0.000155,-0.001535,-0.000733,-0.000642,-4.4e-05,-0.00065,-0.000384,0.000661,-7.4e-05,0.000605,0.000393,-0.000292,0.00029,-0.00012,-0.000197,0.000166,0.000106,-0.000458,-0.000239,-0.00017,-0.000349,-0.00048,1.4e-05,-0.000165,4.4e-05,6e-05,-0.000174,-0.000109,-2.9e-05,6.4e-05,6e-05,7.2e-05,9.3e-05,-0.000133,9e-05,1.2e-05,5.8e-05,8e-05,3e-05,-3.4e-05,-4.4e-05,6.8e-05,-4.4e-05,-1.1e-05,1.7e-05,7.5e-05,4e-06,-1.2e-05,-1.2e-05,-2.8e-05,-3.5e-05,1.6e-05,6e-06,1e-06,-5.1e-05,-3e-06,4e-06,-7e-06,6e-06
-3.8e-05,2e-06,2e-06,9e-06,-1.3e-05,-2e-06,9e-06,4e-06,3e-06,0,1e-05,1e-06,9e-06,1.1e-05,-7e-06,-5e-06,0.000113,0.00011,0.000338,-0.000178,-6.1e-05,-1.4e-05,4.2e-05,1.9e-05,-1.7e-05,-4.7e-05,-1e-06,1.6e-05,1.6e-05,-1.2e-05,-4e-06,2.2e-05,-6e-06,-1e-05,-8.1e-05,5.4e-05,8e-05,7.2e-05,-0.000298,0.000139,0,2.3e-05,-4.8e-05,-1.9e-05,6e-06,0.000869,-0.00167,0.001422,-0.000353,0.000293,-0.000278,-0.000168,-0.000386,0.000553,-0.002261,-0.00017,-0.000163,-0.000853,0.000399,-0.000929,-0.000337,-6.4e-05,0.000492,0.000976,0.000202,4.7e-05,0.000868,-3e-05,0.00012,-0.000776,9.1e-05,-3e-04,-0.00123,5.1e-05,0.000152,-0.000154,-0.000299,-0.000479,-0.000111,-0.000437,0.000231,-8.4e-05,7.7e-05,0.00026,-3.5e-05,0.000166,3e-05,-0.000124,-3.6e-05,-4.3e-05,-8.9e-05,-2.1e-05,1e-06,-4.1e-05,1.5e-05,0.000217,5.9e-05,2.9e-05,-2e-06,7e-06,-3e-05,2.4e-05,-1.6e-05,6e-06,-1.8e-05,9e-06,-9e-06,-4e-06,3e-06,-4.2e-05,8e-06,-1.7e-05,8e-06,-2e-06,-7e-06,-2e-06,-1.8e-05,2.3e-05,-2.1e-05,1e-06,6e-06
7e-06,3e-06,-8e-06,-6e-06,5e-06,-3e-06,-8e-06,-1e-05,1e-06,-1e-06,6e-06,2.6e-05,-4e-06,6e-06,1.2e-05,1e-06,7.2e-05,-6.8e-05,-0.000137,0.000261,-3.9e-05,-4.3e-05,-6.2e-05,4.7e-05,-1e-05,7.2e-05,0,-4e-06,0,3.4e-05,1.2e-05,3e-06,6e-06,-2.1e-05,9.5e-05,-4.5e-05,-1.4e-05,-7.3e-05,-0.000222,-6.9e-05,-8.1e-05,1.3e-05,6.2e-05,9.7e-05,-3.6e-05,0.00025,-0.000645,0.000316,0.000215,-2.7e-05,-0.000468,0.000529,-0.000438,-0.000778,0.000493,-0.000349,0.00061,-0.00067,-0.000396,0.000588,-0.000446,0.00026,0.000241,-5.3e-05,0.000244,0.000225,-0.000322,-9.4e-05,3.2e-05,0.000766,-0.000458,-0.000906,-5e-05,0.000137,-0.00076,-0.000186,-0.000147,-0.000112,-1e-04,0.000287,-0.00014,6.7e-05,0.000106,-8.3e-05,3.3e-05,2.7e-05,-8.9e-05,1e-05,2.5e-05,3.5e-05,0,2.9e-05,-1.6e-05,-0.000101,5e-06,1.3e-05,6e-06,-2.6e-05,1e-06,-5.4e-05,1e-06,2.8e-05,3e-06,-4.8e-05,-9e-06,2.5e-05,3e-05,-2.8e-05,-3e-06,-1.1e-05,-3e-05,-1.8e-05,-6e-06,1e-05,-2e-06,-5e-06,0,-3e-06,2.1e-05,-2.3e-05,-4e-06
3e-06,-1e-05,7e-06,1e-06,7e-06,5e-06,8e-06,1e-06,-2e-06,2e-06,-3e-06,-9e-06,-4e-06,-2e-06,0,2e-06,-0.000126,9.7e-05,1.2e-05,2e-05,-2.5e-05,-1.3e-05,6.4e-05,4e-06,1.1e-05,-6.2e-05,-4e-05,5e-06,-6e-06,-9e-06,0,1e-06,1.1e-05,1e-06,-3e-06,1e-06,4.5e-05,-0.000163,-0.000178,-7.3e-05,0.000111,0,-3.8e-05,1.4e-05,-3.1e-05,-0.000268,0.000661,-0.000362,-0.000214,0.000306,1e-05,-3.3e-05,-0.000185,-1e-06,0.000456,-2.8e-05,-5.6e-05,0.000581,0.000146,-0.000451,0.000339,6.6e-05,-0.000264,-0.000365,3e-05,0.000366,0.000158,0.000528,-4e-06,-5.9e-05,0.000218,0.000204,0.000496,0.000126,5.6e-05,0.000169,0.00056,4e-05,4.9e-05,0.000211,-1.1e-05,1.3e-05,-7e-06,8.6e-05,-6e-06,-7.4e-05,1.6e-05,-5e-06,5.6e-05,-1.3e-05,2.4e-05,8e-06,1.1e-05,2.4e-05,-4e-05,-6e-05,2e-06,2.2e-05,4e-06,1.7e-05,-2.5e-05,-2.4e-05,2.4e-05,1.6e-05,-3e-06,1e-06,-3.2e-05,3e-06,-4e-06,1.1e-05,2.1e-05,1e-06,1e-05,0,-1.2e-05,-1e-05,1.5e-05,-1.3e-05,-1e-05,4e-06,1e-05
1.7e-05,2e-06,-1.4e-05,-6e-06,-1e-05,-1e-06,-6e-06,-1e-06,-2e-06,-3e-06,1e-06,6e-06,0,3e-06,0,-1e-06,1.7e-05,-6.8e-05,-0.000141,-1.1e-05,5e-06,7e-06,-5.8e-05,7e-06,-2e-06,5.6e-05,4e-05,2e-06,-6e-06,2.6e-05,-1.2e-05,1e-06,4e-06,7e-06,1.6e-05,-1.8e-05,-0.000115,-0.000105,4.9e-05,0.00013,8e-06,6e-05,-2.8e-05,-2.2e-05,-3e-06,-0.000165,0.000387,0.000256,-0.000191,-9.7e-05,-0.000196,0.000282,0.000275,-0.000373,8.2e-05,-1.3e-05,-4.5e-05,-0.000505,-0.000319,0.000301,8.9e-05,0.000173,-7e-06,7.7e-05,-8e-05,0.00032,-1e-05,-0.000344,-1.9e-05,0.00013,0.000101,4.5e-05,0.000162,-0.000256,0.000233,0.00015,-0.00019,0.00013,8.1e-05,-8.2e-05,-6.6e-05,-4.6e-05,4.3e-05,-8.8e-05,-3.5e-05,2e-06,-9e-06,1.3e-05,5.1e-05,1.1e-05,1.3e-05,9e-06,-1.4e-05,1.1e-05,-1.6e-05,4e-06,7e-06,2e-06,4e-06,-1e-06,-3e-06,-6e-06,-5e-06,7e-06,1.8e-05,-3e-06,-1.5e-05,4e-06,-8e-06,-1e-06,-7e-06,-4e-06,1.3e-05,-2.3e-05,6e-06,-7e-06,1.2e-05,1.5e-05,-2e-06,-3e-06,-6e-06
-1.1e-05,0,4e-06,-4e-06,5e-06,-1e-06,6e-06,3e-06,3e-06,-3e-06,0,-7e-06,0,-1e-06,-1e-06,0,8.3e-05,-4.7e-05,0.000125,-4.2e-05,2.8e-05,-4e-06,2e-06,-3e-06,-8e-06,-7.2e-05,-1.7e-05,-1.7e-05,4e-06,-2.6e-05,7e-06,-6e-06,-1.2e-05,-5e-06,-9e-06,1.2e-05,0.000132,2.2e-05,9.4e-05,-3.8e-05,5e-06,-1.8e-05,3e-05,1.6e-05,-2e-05,-2.8e-05,-0.000735,-0.000118,0.000116,0.000202,-0.000293,1.8e-05,0.00013,0.000159,-9.3e-05,-2.1e-05,-0.000315,-0.000488,0.000137,-0.000481,1.5e-05,-0.000326,-0.000588,0.000484,9.3e-05,-0.00032,-2.1e-05,-0.000287,7.6e-05,-0.000117,-3e-06,0.000148,2.6e-05,-5.2e-05,-0.000238,0.000239,2.8e-05,-0.000134,4.3e-05,-0.000163,-3.8e-05,4.3e-05,-2.8e-05,5.3e-05,4e-06,1.5e-05,4e-05,1.7e-05,-1.1e-05,1e-06,-1.2e-05,1.6e-05,6e-06,3.5e-05,-2.2e-05,9e-06,2.1e-05,-2e-06,1e-06,1e-05,7e-06,0,-1.4e-05,-1.7e-05,-6e-06,8e-06,1e-05,8e-06,-6e-06,-1e-06,5e-06,7e-06,-4e-06,-2e-06,2e-06,5e-06,-7e-06,1e-06,1e-06,1e-06,2e-06
0,2e-06,-2e-06,0,4e-06,-1e-06,-4e-06,-3e-06,0,-2e-06,-3e-06,-1e-06,-4e-06,0,-1e-06,1e-06,-9.5e-05,0.000129,-8e-06,-1e-05,-1e-05,2e-06,2e-06,-2e-06,6e-06,4e-05,1.4e-05,1.7e-05,4e-06,1.7e-05,-4e-06,2e-06,-4e-06,-1.3e-05,1.1e-05,-5e-06,-8.9e-05,6.3e-05,3.3e-05,-5.4e-05,-5.3e-05,5.2e-05,-1e-05,-2e-06,-2e-06,0.000274,0.000281,0.000311,-0.000124,-0.000128,0.000128,-0.000128,-0.000188,-0.000286,0,7.6e-05,0.000263,0.000235,-4.3e-05,0.000191,0.000295,0.000177,0.000117,0.000127,-7.1e-05,-0.000218,0.000141,0.000128,-6.6e-05,-7.2e-05,-0.000205,0.000287,-4.6e-05,0.000338,-0.000125,3e-06,-0.000355,8.8e-05,-4.1e-05,0.000172,2.3e-05,0,6.9e-05,4.1e-05,3.4e-05,1.9e-05,-5.6e-05,3.4e-05,-2.2e-05,-9e-06,1e-06,-6.2e-05,-1e-05,-9e-06,3e-05,1.7e-05,1.1e-05,9e-06,8e-06,4e-06,1.6e-05,8e-06,3e-06,-1.9e-05,-1e-05,0,-6e-06,-1.1e-05,7e-06,-8e-06,5e-06,8e-06,-1.1e-05,0,-6e-06,5e-06,0,-6e-06,2e-06,2e-06,3e-06
-5e-06,-2e-06,-3e-06,-1e-06,-4e-06,-1e-06,1e-06,0,-1e-06,8e-06,-1e-06,-7e-06,2e-06,-3e-06,-1e-06,-1e-06,-2.2e-05,-9.9e-05,-4.3e-05,8e-06,-3.2e-05,4e-06,-7e-06,1e-06,-2e-06,-2.9e-05,-4e-06,-2.2e-05,-1e-06,-8e-06,5e-06,6e-06,6e-06,1.6e-05,-1.3e-05,-3e-06,3.5e-05,5.8e-05,0.000134,5.1e-05,-6e-06,-9.2e-05,-8e-06,4e-06,-7e-06,0.000292,-0.000348,-0.000899,0.000186,0.000154,0.000491,-3.6e-05,-0.00022,-6.2e-05,7.1e-05,2.3e-05,9.6e-05,9.8e-05,-1e-05,-0.000269,-6.6e-05,0.000238,-3.9e-05,-0.000234,3.3e-05,0.000116,-0.000235,9.3e-05,-9.2e-05,-8e-06,0.00022,-0.000252,0.000188,-0.00014,-9e-06,6.4e-05,0.000215,-1e-06,-1.3e-05,-3.7e-05,3.2e-05,-7.5e-05,-1e-04,-5.6e-05,-3.1e-05,4e-06,-4e-06,4e-06,3e-06,-1e-06,9e-06,1.7e-05,7e-06,0,1.9e-05,-2.4e-05,4e-06,-1.2e-05,-1.4e-05,-1.9e-05,2e-06,2.6e-05,7e-06,5e-06,-3e-06,-4e-06,5e-06,2e-06,8e-06,3e-06,-1e-05,-1e-06,7e-06,-4e-06,-1e-06,-3e-06,1.3e-05,1e-06,1e-06,3e-06,-2e-06
6e-06,-1e-06,5e-06,1e-06,2e-06,3e-06,1e-06,0,0,-6e-06,-1e-06,5e-06,2e-06,2e-06,0,0,5.1e-05,1.9e-05,3.4e-05,5e-06,-1.7e-05,4e-06,-1e-06,5e-06,-6e-06,1.2e-05,1.3e-05,6e-06,-5e-06,-1.7e-05,-1e-06,1e-06,7e-06,0,9e-06,9e-06,-1e-05,-1.1e-05,7.8e-05,-1e-05,6.6e-05,7.1e-05,1.2e-05,-1e-06,-1.6e-05,-3e-06,-0.000165,6.3e-05,1.1e-05,-5.1e-05,-0.000228,-4.3e-05,0.000209,-9e-06,-0.00028,4.4e-05,-0.00023,-0.000141,-0.000106,0.000115,2.9e-05,-0.000188,6e-05,0.000197,-7.8e-05,8.2e-05,3.9e-05,-2.5e-05,9.2e-05,-7.7e-05,-0.000133,-8.2e-05,-0.000364,-0.000135,0.000242,-0.000116,-9.5e-05,9.2e-05,-1e-06,5.2e-05,-2e-05,2.5e-05,5.7e-05,2.1e-05,-6.1e-05,-3.9e-05,-3e-05,-1.3e-05,5e-06,-2.3e-05,-1.7e-05,3e-06,6e-06,-1.9e-05,-4e-06,-2.4e-05,-1e-06,2e-06,9e-06,-4e-06,-9e-06,-1.9e-05,3e-06,9e-06,6e-06,9e-06,1e-05,-1e-06,7e-06,0,1.2e-05,-1e-06,1e-05,6e-06,-2e-06,0,-1e-06,9e-06,-1e-06,0,5e-06
-2e-06,0,-7e-06,4e-06,0,-2e-06,-3e-06,-3e-06,1e-06,1e-06,0,3e-06,-2e-06,0,0,1e-06,-2.1e-05,2e-05,-2.5e-05,1.1e-05,-1.1e-05,5e-06,3e-06,6e-06,8e-06,-2e-06,0,-2e-06,1e-06,1e-05,0,-3e-06,-2e-06,-8e-06,1e-06,-7e-06,1e-06,-4e-06,-0.000236,-4.5e-05,-1.3e-05,-5.3e-05,-1.3e-05,-4e-06,-2e-06,-0.000264,-2.3e-05,0.000227,6.3e-05,0.000124,-0.000115,0.000241,0.000222,1e-06,-2e-06,-9.8e-05,-6.5e-05,-0.000112,6.9e-05,-4.1e-05,0.000288,0.000103,0.00014,-1e-05,-5.6e-05,-3e-05,8.2e-05,5.2e-05,-1.8e-05,5.6e-05,-3e-06,0.000131,-0.000168,7.5e-05,-6.3e-05,-7e-05,0.000121,-9.4e-05,5.2e-05,5.5e-05,-9e-06,3.2e-05,-6e-05,1.1e-05,4.9e-05,-1.2e-05,2.4e-05,-1e-06,-6e-06,2.4e-05,-1.6e-05,0,-5e-06,-6e-06,-2e-05,2.8e-05,-5e-06,-9e-06,-5e-06,1.4e-05,3e-06,-4e-06,-2.3e-05,3e-06,-6e-06,1e-06,-3e-06,1e-06,-4e-06,-3e-06,3e-06,-2e-06,1e-06,6e-06,5e-06,-3e-06,-8e-06,-7e-06,0,-4e-06,-1e-06
4e-06,-1e-06,4e-06,0,-4e-06,0,2e-06,1e-06,-1e-06,-1e-06,1e-06,1e-06,0,-1e-06,0,0,-3.8e-05,-3.5e-05,5.9e-05,-3.1e-05,-5e-06,-6e-06,-1e-06,7e-06,1e-06,0,-9e-06,-4e-06,5e-06,-1e-05,-2e-06,1e-06,-7e-06,-8e-06,-1.2e-05,6e-06,1.2e-05,-1.1e-05,7.9e-05,2.7e-05,2.4e-05,6e-06,-2e-06,-1e-06,-5e-06,-0.000208,0.000317,0.000107,-3.1e-05,-3.7e-05,0.000138,-0.00012,-4.1e-05,8e-05,-4.8e-05,-6.3e-05,-3.4e-05,-1.8e-05,-6.2e-05,5.1e-05,-0.000106,-0.000231,-8.7e-05,-3e-04,3.9e-05,-5.4e-05,-5.5e-05,-0.000178,-7.4e-05,5.2e-05,6.7e-05,6.6e-05,4.5e-05,5.7e-05,-0.000111,-6.7e-05,-4.8e-05,3.3e-05,2.1e-05,-0.000145,-9e-06,-1.3e-05,1.4e-05,2e-05,2.4e-05,-8e-06,-5e-06,-3e-05,1e-06,7e-06,1.8e-05,4e-06,-2e-06,-4e-06,3e-06,-1.9e-05,-2e-06,2e-06,1e-06,-6e-06,0,1.6e-05,1.5e-05,-5e-06,5e-06,-3e-06,-1.1e-05,5e-06,-3e-06,2e-06,-1e-05,-4e-06,-5e-06,-2e-06,-7e-06,-4e-06,-3e-06,-2e-06,1e-06,2e-06,-2e-06
-5e-06,1e-06,-2e-06,2e-06,4e-06,-1e-06,-1e-06,-2e-06,-1e-06,0,0,2e-06,6e-06,0,0,0,3.9e-05,4.1e-05,-0.000127,-8e-06,6e-06,-8e-06,-5e-06,3e-06,-5e-06,-1e-06,1.2e-05,5e-06,-1e-06,-4e-06,1e-06,2e-06,0,1.2e-05,9e-06,-5e-06,-3.4e-05,8e-06,-1.8e-05,1.2e-05,2.4e-05,2.1e-05,9e-06,1e-06,-2e-06,3.1e-05,-0.000148,0.000117,2e-05,5e-05,-1.5e-05,-1.1e-05,-7.1e-05,-0.000202,0.000252,3.8e-05,0.000124,5.5e-05,1.6e-05,-0.000141,8.7e-05,9.8e-05,2.5e-05,1.6e-05,-4.8e-05,0.000142,4.9e-05,5.1e-05,8.7e-05,0.000141,-0.000155,-7.3e-05,0.000148,-6e-05,-5.8e-05,-7e-05,-0.000124,-7e-06,-8.3e-05,-4.7e-05,2.7e-05,-2e-05,2.4e-05,-3.5e-05,-1.8e-05,5e-06,7e-06,3e-06,-3.1e-05,-9e-06,4e-06,-7e-06,4e-06,2.9e-05,-1.5e-05,2e-05,2e-06,-4e-06,8e-06,-2e-06,-1e-05,-2e-06,-2e-06,-2e-06,-2e-06,6e-06,0,-6e-06,-3e-06,0,6e-06,2e-06,1e-06,2e-06,1e-06,-2e-06,-3e-06,2e-06,-3e-06,-5e-06,0
-2e-06,-1e-06,-2e-06,-1e-06,1e-06,0,0,1e-06,1e-06,-1e-06,0,-6e-06,-4e-06,2e-06,0,0,2e-06,-4e-05,9.4e-05,-6e-06,4e-06,-1e-06,2e-06,-2e-06,1e-06,6e-06,-1.5e-05,-7e-06,-4e-06,1e-05,-2e-06,-1e-06,4e-06,0,-3e-06,3e-06,5.2e-05,0,2e-05,-1.7e-05,-2.3e-05,2.4e-05,-2e-06,0,-2e-06,0.000134,9.4e-05,4.2e-05,-8.5e-05,-2e-06,3.5e-05,8.8e-05,-0.000198,0.000106,-3.5e-05,-2e-06,-6.7e-05,0.000199,4.6e-05,0.000112,1.3e-05,-5.4e-05,-2.5e-05,0.000107,6.6e-05,0.000116,-5.8e-05,5e-05,-0.000126,-0.000201,2e-04,-0.000105,-2.6e-05,4.8e-05,2.6e-05,2.7e-05,-7.8e-05,-9e-06,-1e-06,-0.000103,2.5e-05,-1.7e-05,2.1e-05,4e-06,-4e-05,3.6e-05,-9e-06,-2e-06,9e-06,-1e-05,-5e-06,-3e-06,-2e-06,8e-06,1.6e-05,-1.6e-05,5e-06,0,-8e-06,4e-06,1.2e-05,1e-06,-6e-06,-3e-06,-2e-06,-4e-06,4e-06,-3e-06,0,-3e-06,-5e-06,-5e-06,-5e-06,-2e-06,0,-1e-06,1e-06,2e-06,0,1e-06,-1e-06
1e-06,0,4e-06,-1e-06,-5e-06,0,0,-1e-06,0,1e-06,1e-06,-1e-06,3e-06,0,0,0,-3.7e-05,1.3e-05,-2.9e-05,2.1e-05,-1e-06,0,-5e-06,-2e-06,-2e-06,-7e-06,1e-06,0,0,-9e-06,2e-06,-1e-06,3e-06,-5e-06,-1e-06,-2e-06,-5.1e-05,-2.3e-05,-9e-05,8e-06,-1.7e-05,-2.2e-05,-6e-06,3e-06,-7e-06,8.5e-05,6.6e-05,0.000144,-8.6e-05,3.4e-05,1.3e-05,-0.000108,-3.5e-05,5e-06,-4.1e-05,-1.9e-05,5.5e-05,7.5e-05,-0.000117,-0.000194,-0.000143,-3.1e-05,9.5e-05,-0.000132,1.3e-05,-0.000208,3e-05,4.2e-05,9.3e-05,-0.000142,-8.8e-05,-7e-05,-1e-06,-2.9e-05,4.1e-05,3e-05,0.00013,-4.1e-05,2.5e-05,6.8e-05,-1.4e-05,2.6e-05,-2.5e-05,3.6e-05,4e-06,-6e-06,9e-06,5e-06,2.2e-05,3e-06,3e-06,-1e-05,0,-2.2e-05,1e-05,-1e-06,-2e-06,4e-06,8e-06,-4e-06,-3e-06,-1e-06,-1e-06,-5e-06,-4e-06,0,4e-06,6e-06,-3e-06,1e-06,3e-06,3e-06,-3e-06,-6e-06,0,-3e-06,-5e-06,-2e-06,0,1e-06,3e-06
4e-06,-1e-06,-5e-06,-1e-06,3e-06,-1e-06,1e-06,0,-1e-06,1e-06,0,0,0,-2e-06,0,0,9e-06,2e-05,1e-05,-1.3e-05,-9e-06,1e-06,1.1e-05,2e-06,-3e-06,7e-06,0,4e-06,3e-06,1.1e-05,-1e-06,1e-06,-3e-06,-3e-06,7e-06,0,3.6e-05,-1.7e-05,6.3e-05,1.9e-05,-2.1e-05,-1.2e-05,4e-06,-2e-06,-3e-06,-6.6e-05,-0.000184,-0.000105,1e-05,5e-06,0.000134,3.4e-05,0.000202,3.5e-05,2.3e-05,-2e-06,-0.000151,-9.3e-05,0.000123,0.000113,-3.2e-05,1.8e-05,-0.000102,-0.00015,6e-06,-7.9e-05,5e-05,-7.1e-05,-4.5e-05,0.000248,-1.5e-05,1.5e-05,9.8e-05,-3e-06,-7.9e-05,1.4e-05,1.7e-05,-2.4e-05,2.2e-05,9e-06,-1e-06,-1.1e-05,4.3e-05,-3.9e-05,2.3e-05,-6e-06,8e-06,6e-06,1.6e-05,1.3e-05,2e-06,-2e-06,-3e-06,-8e-06,-2e-06,2.2e-05,1e-06,-4e-06,-9e-06,3e-06,0,-8e-06,5e-06,-2e-06,4e-06,1e-06,1e-06,-1e-06,1e-06,1e-06,0,4e-06,0,2e-06,0,3e-06,-8e-06,0,1e-06,1e-06,-1e-06
1e-06,0,2e-06,-1e-06,1e-06,1e-06,-1e-06,0,0,-2e-06,0,0,-2e-06,2e-06,0,0,1.3e-05,-4e-05,-1e-06,3e-05,-1.4e-05,4e-06,-9e-06,2e-06,2e-06,-1e-05,-1e-06,-9e-06,1e-06,-3e-06,1e-06,-2e-06,-4e-06,7e-06,-6e-06,0,-2.2e-05,-1.7e-05,3.9e-05,-1.8e-05,5e-06,6e-06,-1e-06,1e-06,-2e-06,-0.000178,0.000206,2.7e-05,1.8e-05,6e-06,1.1e-05,-9.8e-05,8e-06,-9e-06,-4.3e-05,7e-06,0.000176,-5.8e-05,-0.000118,-4e-06,-4.9e-05,5e-06,4.1e-05,0.000216,1e-06,8.8e-05,-9.3e-05,-3.3e-05,-2.4e-05,-0.000132,1.2e-05,0.000103,2e-06,-6e-06,-4.1e-05,2e-06,-5e-06,1.6e-05,-9e-06,3.1e-05,0,-1.6e-05,-5.3e-05,8e-06,-7e-06,1e-06,7e-06,4e-06,2e-06,-4e-06,2e-06,1.2e-05,2e-06,-1e-06,-1.5e-05,3e-06,-2e-06,8e-06,1e-06,-2e-06,0,1.1e-05,2e-06,7e-06,1e-06,0,-7e-06,-3e-06,1e-06,2e-06,-7e-06,-4e-06,3e-06,-1e-06,-4e-06,-1e-06,2e-06,2e-06,0,0,-2e-06
-4e-06,0,-2e-06,0,-3e-06,-1e-06,1e-06,-1e-06,0,1e-06,0,4e-06,2e-06,0,0,0,-2.3e-05,2.9e-05,7e-06,-1.6e-05,-8e-06,1e-06,-5e-06,0,1e-06,4e-06,-3e-06,1e-05,-2e-06,-3e-06,0,-1e-06,0,-1e-06,4e-06,-1e-06,1.2e-05,7e-06,9e-06,0,2.8e-05,1e-05,-1e-06,0,-3e-06,-9.9e-05,-7.8e-05,-0.000162,1.2e-05,-1.5e-05,-0.000215,-7e-06,-7.9e-05,9.4e-05,-5.7e-05,-2.2e-05,1.3e-05,3.5e-05,3.4e-05,5.9e-05,-4.5e-05,9.5e-05,-6.2e-05,1.8e-05,-3e-06,5.6e-05,5e-05,4.6e-05,6e-05,1.7e-05,1.2e-05,9.8e-05,-0.000117,3.2e-05,5.5e-05,5e-06,-0.000163,-9e-06,-4.1e-05,3.4e-05,1.6e-05,1.5e-05,2.5e-05,-1e-06,-2e-05,-1.2e-05,-2e-06,-1.1e-05,-2.3e-05,-3e-06,-1.2e-05,-2e-06,-1e-06,1.9e-05,1e-06,-1.9e-05,0,-5e-06,0,4e-06,-1e-06,-1e-06,-7e-06,2e-06,-3e-06,-1e-06,2e-06,0,6e-06,-1e-06,5e-06,-1e-06,1e-06,-2e-06,3e-06,-2e-06,2e-06,0,0,0,1e-06
-1e-06,0,-2e-06,1e-06,2e-06,0,-1e-06,1e-06,0,-1e-06,0,-1e-06,-2e-06,-2e-06,0,0,-3e-06,-6e-06,5.1e-05,3e-06,2e-06,-1e-06,5e-06,1e-06,-1e-06,-1e-06,-1e-06,-1.3e-05,-2e-06,9e-06,0,2e-06,3e-06,-4e-06,-2e-06,1e-06,-1e-06,1.7e-05,1.1e-05,1.1e-05,-9e-06,7e-06,1e-06,1e-06,-2e-06,5.6e-05,-2.4e-05,-0.000116,-4.7e-05,1.5e-05,-2.4e-05,9.3e-05,1.2e-05,-1.2e-05,1.2e-05,2.7e-05,9e-06,7.9e-05,-2e-05,-5.5e-05,-5.2e-05,-4.2e-05,3.8e-05,-2.1e-05,-3.9e-05,5.2e-05,-1.9e-05,-1.1e-05,-8.5e-05,-1.1e-05,-1.1e-05,4.5e-05,-2.2e-05,-5e-06,7.7e-05,1e-05,6.3e-05,-3e-06,1.5e-05,1.4e-05,-1e-06,-5e-06,-1.2e-05,1.9e-05,2e-06,6e-06,-3e-06,3e-06,-9e-06,-2e-06,3e-06,8e-06,0,-6e-06,1e-06,-3e-06,1e-06,4e-06,-1e-06,-2e-06,-2e-06,-1e-05,4e-06,-7e-06,0,2e-06,0,1e-06,0,-1e-06,-1e-06,2e-06,0,4e-06,-1e-06,-1e-06,-1e-06,-2e-06,1e-06,1e-06,0
2e-06,0,3e-06,1e-06,0,0,1e-06,-1e-06,0,1e-06,0,0,1e-06,0,0,0,1.8e-05,-1.3e-05,-7.7e-05,-5e-06,2e-06,-1e-06,0,3e-06,1e-06,-6e-06,7e-06,1.2e-05,2e-06,-1.1e-05,0,0,1e-06,1e-06,2e-06,-1e-06,-1.2e-05,1.7e-05,-5.3e-05,-8e-06,9e-06,-1e-05,-3e-06,0,-3e-06,1e-04,5.5e-05,0.000121,7e-05,-1e-06,0.00014,-2.7e-05,9e-06,8e-06,5.5e-05,8e-06,-0.000106,2.9e-05,3.8e-05,6e-05,8.4e-05,1.9e-05,3.1e-05,9.4e-05,1.8e-05,-5.9e-05,-5.7e-05,5.3e-05,3.9e-05,-2.2e-05,5e-06,-0.000117,6.7e-05,-3.5e-05,-8.2e-05,-3.5e-05,-4.8e-05,-9e-06,3e-05,9e-06,0,-1.7e-05,0,-2.9e-05,1.4e-05,4e-06,-2e-06,-1.3e-05,9e-06,-2e-06,7e-06,-4e-06,0,3e-06,6e-06,1.2e-05,2e-06,-2e-06,0,-2e-06,2e-06,3e-06,3e-06,-7e-06,1e-06,-1e-06,-6e-06,2e-06,0,1e-06,-2e-06,-2e-06,1e-06,1e-06,0,-2e-06,1e-06,2e-06,0,-3e-06,0
3e-06,0,-4e-06,1e-06,-2e-06,0,-1e-06,0,0,-1e-06,0,-3e-06,0,1e-06,0,0,-1.2e-05,1.9e-05,3.4e-05,3e-06,2e-06,-1e-06,1e-06,-1e-06,0,7e-06,-6e-06,-1.1e-05,1e-06,4e-06,0,-2e-06,-2e-06,3e-06,-3e-06,1e-06,2.5e-05,3e-06,5e-06,-7e-06,3e-06,-1e-05,4e-06,0,-2e-06,6e-06,0.000133,-6.3e-05,-4.9e-05,8e-06,-5.3e-05,5.6e-05,6.5e-05,6.8e-05,2.3e-05,-6e-06,6.9e-05,-3.4e-05,-1.2e-05,-9e-05,-5.8e-05,-9e-06,-1.6e-05,9.4e-05,-1.4e-05,-6.4e-05,5.5e-05,-4e-05,1.4e-05,3e-06,-3e-06,-3.5e-05,-3e-06,-1.4e-05,-6.5e-05,3.3e-05,0.000103,2.3e-05,1e-06,-2.7e-05,-1e-05,4e-06,1e-06,7e-06,-4e-06,-5e-06,-3e-06,-5e-06,1.2e-05,6e-06,-7e-06,-6e-06,2e-06,-6e-06,2e-06,1e-06,-2e-06,-2e-06,2e-06,-3e-06,1e-06,-2e-06,1e-06,1e-06,-1e-06,-1e-06,7e-06,-3e-06,-3e-06,0,2e-06,-2e-06,-2e-06,-1e-06,-1e-06,-3e-06,0,0,0,1e-06,0
-1e-06,0,2e-06,0,3e-06,1e-06,0,0,0,1e-06,0,-1e-06,-1e-06,-1e-06,0,0,-1.1e-05,-1.6e-05,-2.3e-05,0,0,-1e-06,-6e-06,-2e-06,-2e-06,-7e-06,4e-06,7e-06,-1e-06,-1e-06,0,0,-2e-06,0,3e-06,-1e-06,-3.1e-05,-5e-06,-4.5e-05,9e-06,-2.2e-05,2.2e-05,-2e-06,0,0,-9.5e-05,-2e-04,-2.7e-05,-1.5e-05,-9e-06,-6.5e-05,-4.4e-05,4.1e-05,1.6e-05,-1.5e-05,-2e-06,0,-3.2e-05,-3.2e-05,-1.3e-05,2.5e-05,-4.4e-05,-2e-05,-6.5e-05,-1e-05,5.3e-05,-1.9e-05,-2.3e-05,-5e-05,-1.1e-05,-2.7e-05,1.1e-05,-4.9e-05,7.6e-05,6.1e-05,4e-06,-3.2e-05,-1e-06,-1.5e-05,-7e-06,8e-06,9e-06,1.6e-05,1.5e-05,-1.7e-05,-1e-06,-2e-06,5e-06,4e-06,-2e-06,3e-06,-1e-06,0,-1e-06,3e-06,-1.1e-05,0,3e-06,-4e-06,4e-06,-2e-06,0,-7e-06,4e-06,1e-06,2e-06,2e-06,1e-06,0,0,-3e-06,2e-06,1e-06,2e-06,-1e-06,1e-06,2e-06,-1e-06,0,0,-1e-06
-1e-06,0,-1e-06,0,0,-1e-06,0,0,0,-1e-06,0,1e-06,0,-1e-06,0,0,1.1e-05,1.1e-05,2.7e-05,0,-5e-06,0,0,1e-06,1e-06,6e-06,3e-06,-5e-06,-1e-06,-3e-06,0,1e-06,1e-06,-4e-06,-2e-06,1e-06,3e-05,-3e-06,3.4e-05,-1e-06,1e-05,-8e-06,-3e-06,0,-1e-06,-9.8e-05,7.8e-05,5.9e-05,5e-06,1e-06,7.6e-05,-2.4e-05,-0.000119,-1.2e-05,-1.9e-05,-1.6e-05,2e-06,3.4e-05,-1e-06,4.7e-05,5.3e-05,4.3e-05,-6.5e-05,-9.5e-05,3.8e-05,2.1e-05,1e-06,2e-05,6.3e-05,6.7e-05,7.6e-05,-5.8e-05,1.9e-05,-2.2e-05,1.8e-05,2.2e-05,-6.6e-05,4e-06,-1.4e-05,-1.2e-05,-5e-06,-1e-06,-1.5e-05,-1.5e-05,-7e-06,-7e-06,-3e-06,2e-06,-1.5e-05,1e-06,0,0,0,-1e-06,-1.3e-05,-5e-06,-1e-06,-6e-06,4e-06,0,1e-06,3e-06,3e-06,0,2e-06,-2e-06,-4e-06,-1e-06,-3e-06,0,4e-06,1e-06,0,-2e-06,2e-06,-1e-06,2e-06,0,0,0,0
-2e-06,0,-1e-06,0,-2e-06,0,-1e-06,0,0,0,0,1e-06,0,1e-06,0,0,-5e-06,-3e-06,-4.6e-05,0,-7e-06,0,2e-06,2e-06,0,-5e-06,-3e-06,2e-06,1e-06,3e-06,0,0,2e-06,1e-06,1e-06,0,-2.5e-05,-6e-06,3e-05,-7e-06,-5e-06,-5e-06,3e-06,0,-1e-06,-2.6e-05,1.6e-05,0.00011,1e-06,2e-06,-2.1e-05,6e-06,-6.9e-05,-2.2e-05,-3e-06,-2.4e-05,-5e-05,2.2e-05,1.3e-05,2.1e-05,0,-8.4e-05,5.9e-05,9.9e-05,-1.4e-05,-5.4e-05,-1.4e-05,1.6e-05,-4.8e-05,1.9e-05,-8.8e-05,4.8e-05,5e-05,-5e-05,-2.6e-05,-1.1e-05,-6.3e-05,-9e-06,1.8e-05,-4.3e-05,1e-06,-2.1e-05,1.5e-05,1e-06,1.2e-05,2e-06,-8e-06,2e-06,-5e-06,-4e-06,1e-06,4e-06,0,1e-06,1e-06,8e-06,0,5e-06,-3e-06,2e-06,1e-06,-8e-06,4e-06,-3e-06,-2e-06,1e-06,-1e-06,0,1e-06,0,-1e-06,-1e-06,-1e-06,-2e-06,-2e-06,0,-3e-06,2e-06,0,1e-06,0
1e-06,0,2e-06,-1e-06,2e-06,0,0,0,0,0,0,3e-06,0,0,0,0,-1.3e-05,-9e-06,2.8e-05,-5e-06,-6e-06,0,-1e-06,-1e-06,-1e-06,4e-06,-1e-06,-1e-06,2e-06,-1e-06,0,0,0,2e-06,0,0,1.9e-05,-3e-06,-1.1e-05,6e-06,4e-06,3e-06,1e-06,0,-1e-06,6.9e-05,-0.000112,-2.1e-05,-7e-06,3e-06,-7.7e-05,-4.3e-05,6.4e-05,5.5e-05,-2.4e-05,1.8e-05,-3.9e-05,-7.4e-05,3.4e-05,-1.3e-05,2e-05,6.7e-05,3.2e-05,-9.4e-05,1.3e-05,2.5e-05,2e-06,-1e-06,2.6e-05,-4.8e-05,4.4e-05,-2.2e-05,-5.8e-05,1.8e-05,-5.4e-05,8e-06,4.9e-05,1.9e-05,1.1e-05,3.7e-05,-5e-06,6e-06,-1.1e-05,-2e-06,6e-06,8e-06,2e-06,6e-06,6e-06,-1e-06,-2e-06,1e-06,0,6e-06,5e-06,1.1e-05,-1e-06,-5e-06,1e-06,-4e-06,-1e-06,2e-06,-5e-06,-1e-06,-1e-06,0,-1e-06,1e-06,-1e-06,0,-2e-06,1e-06,1e-06,2e-06,0,0,-1e-06,-1e-06,0,0,0
1e-06,0,-3e-06,0,0,1e-06,0,0,0,0,0,-2e-06,0,-1e-06,0,0,8e-06,1.9e-05,1.6e-05,1e-06,-2e-06,1e-06,0,0,1e-06,-3e-06,2e-06,1e-06,-1e-06,1e-06,1e-06,0,-2e-06,0,0,0,-1e-05,-3e-06,5e-06,2e-06,1.2e-05,3e-06,-3e-06,0,-1e-06,7.3e-05,6.3e-05,-3.4e-05,1.3e-05,-3e-06,-2.7e-05,4.7e-05,6e-05,-6e-05,9e-06,9e-06,4.3e-05,-9.8e-05,-4.5e-05,2.3e-05,4.3e-05,-3.4e-05,4.9e-05,-0.000104,-6e-06,3.5e-05,5.3e-05,-1.5e-05,7e-06,-6.3e-05,7e-06,-3e-06,-2.3e-05,3.9e-05,3.2e-05,-1.5e-05,2.7e-05,-1.1e-05,-1.3e-05,-8e-06,2e-06,1.3e-05,2e-06,1.6e-05,-9e-06,1e-06,-5e-06,-4e-06,1e-05,5e-06,-5e-06,0,0,1e-06,1e-06,-8e-06,1e-06,3e-06,1e-06,1e-06,1e-06,4e-06,-2e-06,0,1e-06,0,3e-06,-2e-06,3e-06,0,3e-06,0,1e-06,-1e-06,-1e-06,-1e-06,1e-06,0,0,0,0
1e-06,0,2e-06,0,-1e-06,0,0,0,0,0,0,-1e-06,0,1e-06,0,0,2e-06,-1.6e-05,-2.2e-05,1e-06,3e-06,1e-06,1e-06,1e-06,0,2e-06,1e-06,-3e-06,-2e-06,3e-06,0,0,-1e-06,-2e-06,-1e-06,0,0,-4e-06,-1.5e-05,-4e-06,-1.8e-05,3e-06,2e-06,0,0,-7e-06,5.1e-05,-1.6e-05,6e-06,-2e-06,6.3e-05,0,2.2e-05,-1.8e-05,2.2e-05,-2e-06,6e-06,-5.1e-05,2.3e-05,-2e-06,-1.5e-05,4.3e-05,-7e-06,1.6e-05,-7e-06,-7e-06,-4e-05,-2e-06,-2.4e-05,5.4e-05,-3.5e-05,7.2e-05,4.9e-05,-2.4e-05,4.7e-05,-2.8e-05,2.3e-05,4e-06,-8e-06,6e-06,2e-06,-1.5e-05,-6e-06,-1.5e-05,-1.2e-05,2e-06,6e-06,-9e-06,2e-06,2e-06,5e-06,-2e-06,-1e-06,-3e-06,0,-3e-06,-1e-06,-1e-06,-2e-06,0,2e-06,-3e-06,3e-06,-1e-06,0,0,-1e-06,1e-06,1e-06,0,-2e-06,-1e-06,-2e-06,0,1e-06,-3e-06,-1e-06,1e-06,0,0,-1e-06
-2e-06,0,-1e-06,0,2e-06,0,0,0,0,0,0,-2e-06,0,1e-06,0,0,-1e-05,3e-06,1e-05,3e-06,3e-06,-1e-06,3e-06,0,-1e-06,-4e-06,-4e-06,5e-06,1e-06,-4e-06,0,0,1e-06,0,1e-06,0,1.1e-05,-4e-06,-2e-06,2e-06,3e-06,-7e-06,1e-06,0,-1e-06,-7.1e-05,-6.3e-05,-3.7e-05,-1.3e-05,1e-06,9.3e-05,3.3e-05,-3.2e-05,1.1e-05,2.5e-05,9e-06,2.1e-05,2.5e-05,-7e-06,-0.000112,1.2e-05,2e-06,-4.7e-05,5.1e-05,5e-06,-2.4e-05,2e-06,9e-06,3e-05,4.8e-05,4.3e-05,2e-05,3.3e-05,-1.5e-05,-1.8e-05,4e-06,-8.9e-05,-1.5e-05,2e-06,1.8e-05,-3e-06,-6e-06,4e-06,1e-06,1e-06,-3e-06,-5e-06,7e-06,-1.1e-05,-2e-06,-1e-06,-6e-06,1e-06,-5e-06,0,1e-06,0,-1e-06,2e-06,1e-06,-3e-06,3e-06,3e-06,-2e-06,-1e-06,0,-1e-06,0,2e-06,0,1e-06,0,-2e-06,2e-06,0,0,-1e-06,1e-06,0,0,1e-06
-2e-06,0,-1e-06,0,-1e-06,0,0,0,0,0,0,-1e-06,0,-1e-06,0,0,4e-06,7e-06,-6e-06,-2e-06,-1e-06,0,-8e-06,-2e-06,1e-06,5e-06,3e-06,-8e-06,2e-06,3e-06,0,1e-06,2e-06,1e-06,-2e-06,0,-2e-05,1e-06,1.9e-05,1e-06,1e-06,8e-06,-2e-06,0,-1e-06,-3.1e-05,-7e-06,5.9e-05,1.4e-05,2e-06,-6.9e-05,1.1e-05,-7.1e-05,-2.8e-05,-4e-06,0,-8e-05,6.2e-05,3.2e-05,4.9e-05,-3.4e-05,-2.6e-05,-3e-05,-3e-05,-9e-06,-2.5e-05,1.8e-05,-7e-06,-2e-06,-5e-05,-3.3e-05,1.8e-05,-4.3e-05,1e-05,-4.4e-05,-1.1e-05,-1.6e-05,1.6e-05,1.2e-05,-1.3e-05,-2e-06,1.1e-05,-3e-06,8e-06,8e-06,-4e-06,7e-06,-6e-06,-9e-06,-4e-06,-3e-06,1e-06,0,5e-06,-6e-06,7e-06,0,3e-06,-1e-06,0,1e-06,-2e-06,-5e-06,-1e-06,2e-06,0,3e-06,0,-2e-06,-1e-06,-1e-06,-1e-06,2e-06,-1e-06,-2e-06,-2e-06,-2e-06,-1e-06,0,0,0
0,0,2e-06,0,-1e-06,0,0,0,0,-1e-06,0,1e-06,1e-06,0,0,0,2e-06,-1e-05,3.4e-05,4e-06,-5e-06,0,8e-06,0,1e-06,-8e-06,1e-06,9e-06,0,-1e-06,0,0,0,0,2e-06,0,2.5e-05,7e-06,-1.5e-05,-1e-06,-5e-06,-1.2e-05,0,0,-1e-06,5.1e-05,8.1e-05,-3.7e-05,-3.7e-05,0,-4.2e-05,-4.9e-05,1e-05,-1.5e-05,-1.8e-05,-9e-06,5.5e-05,1.8e-05,1e-05,9e-06,1e-06,3.5e-05,7e-06,-1.7e-05,-1e-06,1.4e-05,-2.2e-05,1.9e-05,-1.6e-05,1e-05,6e-06,-3.2e-05,-2.1e-05,1.1e-05,-7e-06,2.7e-05,-3.3e-05,-1.8e-05,1e-06,1.7e-05,1e-06,-4e-06,4e-06,1e-06,-2e-06,1e-06,-5e-06,1e-06,5e-06,1e-06,2e-06,1e-06,0,-1e-06,3e-06,4e-06,1e-06,-4e-06,0,2e-06,1e-06,-2e-06,1e-06,0,0,-1e-06,0,0,0,0,-3e-06,0,1e-06,-1e-06,1e-06,0,0,0,0,0,0
