3e-05,-3.6e-05,-0.000243,-0.002391,-0.012616,-0.041348,-0.131261,-0.161197,-0.184771,-0.163988,-0.100474,-0.035438,-0.005938,-0.001378,-0.000998,-0.001016,-0.000955,-0.000535,-0.001084,-0.001736,-0.009517,-0.009089,-0.003875,-0.002073,-0.000222,-1.4e-05,-3e-06,-1e-06
4.4e-05,-9e-06,-0.000112,-0.001262,-0.006323,-0.014446,0.076714,0.151139,0.077503,0.100778,0.109015,0.043245,0.005845,0.001131,0.001263,0.000587,-7.6e-05,0.000177,-3e-06,-0.000644,-0.004927,-0.00347,-0.001393,-0.001043,-7.5e-05,2.2e-05,1e-05,8e-06
3e-05,2.9e-05,4.6e-05,-0.000478,-0.000172,-0.039507,-0.061122,-0.019927,-0.025261,-0.021625,-0.020758,-0.011018,-0.001815,-0.000639,-0.000289,-4.2e-05,6e-06,-1.6e-05,0.000225,0.000261,0.001682,0.002036,0.000947,0.000466,6e-05,-1e-06,-3e-06,3e-06
2.1e-05,5.2e-05,0.000135,0.000887,0.005373,-0.029685,-0.111599,-0.137654,-0.086762,-0.100073,-0.096939,-0.034968,-0.005506,-0.001131,-0.001095,-0.000499,1e-04,-9.9e-05,0.000176,0.000373,0.004112,0.003565,0.001144,0.00073,7.7e-05,-1.4e-05,-1e-05,-1e-06
2.7e-05,4.6e-05,0.000132,0.00117,0.002754,0.031607,0.128931,0.150988,0.170596,0.14811,0.100937,0.03891,0.006191,0.001637,0.00113,0.000784,0.000557,0.000355,0.000388,-3.7e-05,0.000115,0.001937,0.00171,0.00106,0.000117,1.7e-05,3e-06,6e-06
1.1e-05,-1.3e-05,-7.4e-05,-0.000633,-0.006538,0.012019,0.03653,0.043055,0.049602,0.043726,0.025182,0.003254,0.001306,2.5e-05,0.000134,1.9e-05,-0.000173,-8.5e-05,-0.000373,-0.001424,-0.008621,-0.005737,-0.000772,-8.1e-05,-5.6e-05,-4e-06,-7e-06,-2e-06
3e-06,-3.1e-05,-0.000141,-0.000181,3e-06,-0.009234,-0.100244,-0.162142,-0.178864,-0.155665,-0.102692,-0.03474,-0.00558,-0.001533,-0.001134,-0.000829,-0.000447,-0.000277,-0.000359,-0.00072,-0.00371,-0.004207,-0.002455,-0.001387,-0.000176,-2.4e-05,-1.5e-05,-1.1e-05
8e-06,9e-06,2.6e-05,0.000718,0.007545,0.015171,0.052757,0.060825,0.009953,0.022048,0.045192,0.021172,0.00212,0.000589,0.00068,0.000478,0.000329,0.000259,0.00053,0.001252,0.006817,0.005083,0.000458,-0.00059,0,8e-06,1e-06,3e-06
6e-06,2.8e-05,8.6e-05,-0.000214,0.000641,-0.003182,0.020501,0.07624,0.087134,0.081945,0.048008,0.011144,0.002022,0.000322,0.000453,0.000321,3.3e-05,2.2e-05,2e-05,0.000723,0.004466,0.004323,0.002163,0.000877,0.000123,1.1e-05,4e-06,4e-06
2e-06,1.3e-05,1.3e-05,-0.000772,-0.006343,-0.015673,-0.085258,-0.106587,-0.049977,-0.049046,-0.067831,-0.022844,-0.002801,-0.000554,-0.000817,-0.000605,-0.000283,-0.000262,-0.000496,-0.000432,-0.001607,-0.002456,-9e-05,0.00088,3.2e-05,-9e-06,-2e-06,-2e-06
-1e-06,-6e-06,-2.5e-05,-0.000745,-0.006338,0.008778,0.050462,0.026676,0.01218,-0.001676,0.014214,0.008693,0.000541,0.000729,0.000248,0.000225,0.000275,0.000113,0.000173,-0.000242,-0.00288,-0.003368,-0.001139,-0.000196,-4.1e-05,-1e-06,1e-06,-1e-06
-7e-06,-1.1e-05,-2e-05,0.000245,0.002978,-0.000577,0.050045,0.084377,0.051106,0.036469,0.048144,0.010766,0.00205,0.00029,0.000486,0.000406,0.000133,0.000168,0.00037,0.000177,-0.000288,0.000401,0.00014,-0.000506,-3.1e-05,1.1e-05,4e-06,4e-06
-6e-06,-2e-06,-3e-06,0.001283,0.008709,-0.017025,-0.086097,-0.085692,-0.0707,-0.052052,-0.05286,-0.016005,-0.001442,-0.000886,-0.000701,-0.000521,-0.000325,-6.1e-05,-0.000122,0.000415,0.004226,0.002855,0.000103,-0.000377,-2.9e-05,-1e-06,2e-06,4e-06
-6e-06,2e-06,2.7e-05,0.000394,0.000812,0.000178,-0.008628,-0.027996,-0.033077,-0.016883,-0.009242,0.00145,-0.000861,0.000228,-3.3e-05,-0.00012,-3.6e-05,-3.6e-05,-0.000185,0.000164,0.002011,0.001238,-2e-05,-8e-06,1e-05,-4e-06,0,0
-8e-06,-2e-06,8e-06,-0.000692,-0.005439,0.011603,0.063202,0.085648,0.076182,0.064552,0.054852,0.013482,0.001869,0.000551,0.000599,0.000438,0.00025,3.7e-05,2.9e-05,-0.000577,-0.004083,-0.000895,0.001037,0.000668,8.9e-05,8e-06,2e-06,1e-06
-1.1e-05,-6e-06,-1.7e-05,-0.000543,-0.00298,0.011806,-0.014721,-0.028488,0.009974,0.006238,-0.02452,-0.005711,0.000343,-0.000446,-0.000337,-0.000142,2.4e-05,-3.5e-05,1.6e-05,-0.000536,-0.00343,-0.001519,0.000296,0.000451,2.1e-05,-2e-06,-3e-06,-4e-06
-1.3e-05,-9e-06,-6e-06,-0.000117,0.000794,0.002318,-0.015492,-0.046218,-0.044535,-0.043532,-0.027545,-0.007599,-0.002467,-5.7e-05,-0.000219,-0.000158,-6.7e-05,-5.1e-05,-3.2e-05,3.6e-05,-0.000197,-0.00142,-0.00113,-0.000546,-9.1e-05,-1.7e-05,-8e-06,-7e-06
-1.3e-05,-1.3e-05,-7e-06,0.000248,0.003163,-0.018335,0.010637,0.058108,0.013202,-0.002337,0.037335,0.005551,0.000102,0.000239,0.000521,0.000241,-6.5e-05,1.6e-05,0,0.000167,0.001346,0.000871,-0.000182,-0.00064,-3.8e-05,3e-06,-1e-06,0
-1.2e-05,-1e-05,-7e-06,7.7e-05,-0.000473,-0.018164,-0.032405,0.001334,0.011707,0.011128,-0.011088,0.001056,0.001749,-0.000607,-0.00017,-9.4e-05,-7.4e-05,1.7e-05,-8.3e-05,9.2e-05,0.002158,0.002124,0.000799,0.000231,4.8e-05,7e-06,1e-06,2e-06
