-0.001248,-0.001268,-0.001226,-0.001191,-0.000506,-0.001532,-0.000956,-0.001215,-0.001588,-0.000591,0.000168,-0.000541,-0.001015,-0.001551,-0.002075,-0.001616,-0.000821,-0.000514,-0.000161,-0.000302,-0.000741,-0.001029,-0.000868,-0.000561,-0.000511,-0.000523,-0.001221,-0.001691,-0.000983,-0.000701,-0.000933,-0.001584,-0.001483,-6.3e-05,-0.001167,-9e-04,-0.001004,-0.00157,-0.001325,-0.001423,-0.001838,-0.001423,-0.001018,-0.000673,-0.00176,-0.000902,-0.000449,-0.002005,-0.001536,-0.000903,-0.000729,-0.000395,-0.000268,-8e-04,-0.001431,-0.00126,-0.000243,-0.000525,-7.3e-05,-1.2e-05,5.3e-05,-0.000799,-0.001046,-0.001089,-0.000608,-0.000603,-0.000708,-0.000374,-0.000335,-0.000228,-0.000243,-0.000296,-0.000685,-0.000628,-0.000351,-0.001387,-0.000356,0.000107,-0.000441,-0.000229,-0.000506,-0.000482,-0.000399,-0.000245,-0.000341,-0.000464,-0.000853,-0.000455,-0.000123,-0.000911,-0.000554,-0.000106,-0.000971,-0.000713,-0.000341,-0.000245,-0.000239,-0.000535,0.00013,-0.000298,-0.000339,-0.000374,-0.000324,0.000128,-0.000364,-0.000404,-0.000428,-0.000149,-0.000577,-0.000102,0.00017,-0.000426,-0.000377,-0.000348,-0.000124,0.000108,-4.2e-05,-0.000314,-6.9e-05,1e-05,-0.000293
-0.000736,-0.000132,0.000382,-0.000348,-0.00016,-0.000276,-0.000236,0.000452,0.001072,0.000588,-0.00057,-0.000845,-0.000169,0.000862,-0.000217,-0.000612,-0.000346,-0.000307,-0.000402,-0.000808,9.8e-05,0.000189,-5.4e-05,-0.001373,-0.000765,-0.00048,-0.000199,0.00018,-0.000323,-0.000819,-0.000118,0.000608,0.000586,-0.000262,-0.000363,0.000591,0.00033,0.000995,-0.000288,0.000535,0.00111,0.000445,1e-04,0.000718,0.000491,5.4e-05,-0.000941,2e-04,-0.000215,-0.000545,-0.000464,-0.000293,0.000241,0.000501,0.000463,-0.000397,-0.000621,-0.000327,-0.001889,-0.001282,-0.00102,9.3e-05,0.00025,0.000136,-0.000147,0.000143,0.000352,-7e-05,0.000222,-0.000327,-0.000571,-1.1e-05,5e-05,-0.000175,-0.000371,-0.000134,-0.000963,0.000115,-0.000167,-0.000374,-0.000442,-0.000596,-0.000175,-3.3e-05,0.000132,0.000257,0.000155,4.8e-05,-0.000343,-0.00011,0.00025,-0.00011,0.000485,-0.000202,-0.000113,-0.000391,-0.000594,-0.000124,-0.000378,-4.8e-05,-0.000362,-0.000392,-0.000383,-0.001021,-0.000442,-0.000119,-3.2e-05,-0.000133,0.000202,-0.00034,-0.000258,-0.000117,-0.000149,0.000303,-0.000452,-3.3e-05,-0.000562,-0.00031,-0.000137,-0.000363,-0.000308
0.000677,-0.000649,-0.000956,-0.000746,-0.000411,0.000182,-0.00059,-0.001276,-0.001099,-0.001017,-0.000835,0.000322,-0.000902,-0.001153,0.00035,0.000134,7e-05,-0.000152,-0.000278,0.000304,-0.000837,-0.000901,0.000355,0.000119,-3e-05,-0.000129,-8.7e-05,0.000186,0.000371,-0.000251,-0.000236,-0.000323,-0.000757,-0.000776,-0.000273,-0.000446,-0.000362,-0.000234,0.000466,-0.001057,-0.000878,-0.00098,-0.000264,-0.000497,-0.001233,-0.000785,-0.000169,-9.1e-05,0.000524,-0.000256,-0.000432,-0.000157,-0.000304,-0.000714,0.000146,-0.000531,-0.000328,-2e-05,0.000377,0.000255,-0.000387,-0.000112,-7.9e-05,-9.8e-05,0.00024,-0.000561,-0.00041,-0.000435,-0.00068,-0.000626,-0.000227,0.000354,-0.000825,-0.00055,-0.000656,-5.3e-05,-0.000252,-0.000384,-0.000185,0.000192,0.000427,6.6e-05,-8.6e-05,-0.000279,7.7e-05,-0.000318,-0.000189,-0.000185,7.7e-05,0.000227,8.4e-05,-0.00051,-0.000398,-0.000592,-0.000383,-2e-06,-1.6e-05,-1.8e-05,-9.4e-05,-0.000241,-1.6e-05,0.000115,2.9e-05,0.00042,0.000174,0.000139,-7.1e-05,-0.000281,-0.000225,-0.000206,-0.00027,-0.000399,-0.000112,-0.000355,-4.8e-05,-4.7e-05,0.000219,-0.000165,-0.000178,0.000338,0.00017
7.7e-05,5.2e-05,0.000746,0.00093,0.000349,0.00013,0.000336,-0.00025,0.000198,-0.00022,9.6e-05,0.000179,0.000993,3.9e-05,-0.000372,0.000255,0.000303,-9e-05,-0.000145,0.000226,0.000594,0.000981,1.1e-05,0.000258,6.7e-05,6.2e-05,0.000382,-0.000471,-0.00028,4.4e-05,0.000681,0.000521,0.000782,0.000686,-0.000465,-9.3e-05,0.000121,6e-06,-0.000483,0.000483,6.9e-05,0.001577,0.000538,0.000356,0.001573,0.00097,0.000314,0.000223,-0.000157,0.000321,0.00032,0.000388,2.7e-05,0.00045,-0.00075,0.000751,0.000296,-0.000232,0.000409,0.00088,0.000981,0.000339,0.00014,6.6e-05,-0.000151,0.000152,0.000623,-6.2e-05,4.8e-05,0.000103,1.8e-05,-0.000642,5e-06,7.9e-05,0.000784,0.000798,0.000493,1.9e-05,3.5e-05,-0.000427,-0.000435,-8.7e-05,-1e-04,4.5e-05,-2.7e-05,0.000215,0.000214,-7.8e-05,0.00014,-0.000136,6.7e-05,0.000128,-2.2e-05,0.000733,0.000266,0.000288,0.000424,0.000194,-1.1e-05,8.9e-05,5.3e-05,-3.1e-05,0.000288,0.000402,7.6e-05,2.8e-05,-4.7e-05,0.00035,0.000321,0.00025,0.000452,0.000128,0.000287,0.00013,6.1e-05,5.2e-05,0.000127,0.000296,-0.000131,-0.000278,-2.9e-05
-0.000661,0.000224,-2.8e-05,-0.000476,0.000531,-0.00067,0.000286,0.000504,-8.1e-05,-0.000185,-0.000154,-0.000958,-0.00023,0.000406,0.000237,-0.000577,-0.000322,0.000143,-5.8e-05,-0.000648,0.000195,-0.000442,-0.000369,0.000388,0.000532,0.000143,-0.000523,0.000447,5.9e-05,0.00046,-0.000128,-0.00063,-0.000656,-0.000198,0.000278,-9e-06,-9.6e-05,-0.000139,-6.6e-05,-9e-06,-0.000262,-8e-04,-0.000506,-7.3e-05,-0.000621,-0.000385,0.000382,-0.000168,0.00024,-0.000328,3.8e-05,0.00017,0.000145,1.1e-05,0.000474,-0.00025,-0.000799,-0.00025,9e-06,-6.8e-05,1.2e-05,8e-06,-5.4e-05,-9.7e-05,-0.000243,-0.000118,-0.000377,0.000109,-0.000104,-0.000598,0.000202,-0.000212,-0.000213,0.000546,-0.000632,-0.000809,-0.000283,3.6e-05,-0.00038,-0.000108,-4e-05,-0.000131,0.000404,0.000147,-4.9e-05,-0.000151,-0.000118,0.000105,1.4e-05,1.1e-05,-0.000243,-0.00016,-0.000168,-0.000389,-0.00015,-0.000124,-0.000179,-7.5e-05,-9.2e-05,-0.000116,-0.000132,-5.2e-05,-0.000139,-0.000272,-0.000212,-7.7e-05,1.9e-05,-1.6e-05,-0.000201,-0.000223,-0.000233,0.000188,-0.000198,-2.1e-05,-6.7e-05,-0.000124,-0.000159,-0.000253,-0.000125,-0.000105,-0.000349
0.000406,-1.2e-05,-0.000262,0.000111,-0.000707,2.4e-05,-0.000155,0.000102,-0.000197,0.000168,1.6e-05,3e-04,8.1e-05,-0.000275,0.000129,0.000465,0.000182,7.5e-05,-7.7e-05,-0.000236,-0.000305,-0.000144,0.00011,-0.000383,-0.000876,-0.000212,0.000291,-0.000256,-0.00011,-0.000261,-0.000103,9.3e-05,0.000283,-0.00038,0.000216,-0.000179,6.4e-05,-0.000106,0.000269,0.000201,0.000688,3.7e-05,6.3e-05,-0.000115,2.2e-05,-0.000107,-0.000157,-0.000208,-0.000603,-9.3e-05,0.000166,-0.000193,-0.000184,-2.2e-05,-0.000164,-0.000306,0.000209,0.000127,-9.7e-05,-0.000832,-0.000616,-0.000368,8e-05,-9.4e-05,-7.2e-05,-4.3e-05,-9.6e-05,-0.000358,-0.00016,0.000497,3.7e-05,0.00024,0.000581,-0.000125,5.5e-05,8.1e-05,-0.000453,-0.000376,0.00017,0.000252,0.000345,0.000306,-9.7e-05,-0.000265,-0.000176,0.000121,0.000225,-3e-05,-0.000334,9.8e-05,0.000123,8.9e-05,0.000136,0.000373,0.000174,-8.9e-05,0.000102,-0.000161,0.000113,-1.8e-05,0.000124,-1.8e-05,-0.000112,-0.000144,-2.6e-05,-7e-05,-0.000117,-0.000171,-2.2e-05,0.000246,-4.6e-05,-8.9e-05,0.000103,-1e-05,0.000205,1.4e-05,-5.2e-05,-0.000109,-9.5e-05,6e-06,0.000101
9.5e-05,0.000245,0.00023,-9.3e-05,-0.000187,4e-05,-0.00012,-0.000179,0.000682,5.3e-05,0.000971,0.000385,0.000223,-0.000398,-0.000643,4.4e-05,-0.000134,-0.000187,0.000148,0.000363,0.000109,-5.5e-05,0.000252,0.000363,0.000386,7.2e-05,7.5e-05,-5e-04,-3e-06,-0.000456,-0.000157,-0.000246,-8.6e-05,0.000228,0.000104,0.000212,0.000211,0.000127,-0.000395,-1e-06,-0.000489,-0.000277,0.000384,-1.5e-05,5.3e-05,-9.3e-05,-0.000303,0.000375,0.000228,0.00047,2.7e-05,4.5e-05,2.4e-05,4e-06,-8.9e-05,3e-05,0.000455,0.000405,0.000142,0.000491,0.000258,0.000269,-2.9e-05,0.000176,0.000115,0.000414,4.1e-05,0.000416,0.000627,1.1e-05,4e-05,-7.1e-05,-0.000199,0.00016,0.000392,0.000286,0.000348,0.000478,0.000494,-0.000177,-0.000154,-0.00032,-0.000333,0.000196,0.000167,-0.000275,-0.000213,0.000225,0.00014,-0.00013,-0.000104,0,0.000135,-0.000158,-0.000349,4.4e-05,3.9e-05,0.000169,-6.6e-05,0.000185,6e-06,0.000204,0.000159,0.000111,8.9e-05,-1.2e-05,-7.1e-05,-7.5e-05,-0.000174,-0.000174,-0.000117,-7.9e-05,-8.4e-05,-7.3e-05,-0.000107,0.000242,2.6e-05,0.000415,0.00042,0.000198,0.000139
-0.000339,-0.000453,-1.9e-05,6.8e-05,0.000321,0.00029,0.000237,-1.9e-05,-7e-05,1.4e-05,-0.000253,0.000209,-4.6e-05,0.000127,0.000482,-8e-05,4e-06,0.000133,0.000215,0.000293,0.000235,0.000286,-0.000281,-0.000325,7.1e-05,9.4e-05,9.9e-05,0.000444,0.000127,0.000527,-7.9e-05,0.000102,-3.3e-05,-8.8e-05,-0.000334,0.000212,-0.000268,-0.000159,0.00023,-0.000194,6.9e-05,0.000231,-0.000505,0.000115,-5.9e-05,4e-04,0.000253,-3.8e-05,3e-04,-0.000376,4.1e-05,-6.1e-05,-0.000178,-0.000257,-7.4e-05,-0.000232,-0.000258,-0.000198,-0.000256,0.000129,0.000138,-8e-05,-0.000124,-9.8e-05,0.000157,4.6e-05,0.000217,3.6e-05,-8e-06,3.6e-05,-0.000167,0,0.00031,-0.000652,-0.000112,0.000165,0.000128,0.000402,-4e-06,0.000267,-2.6e-05,0.000297,0.000114,0.000163,-7.1e-05,6.7e-05,9.9e-05,-0.000251,-7.5e-05,2e-05,6.4e-05,0.000181,0.000114,4.3e-05,-3.2e-05,4.7e-05,0.000131,-4.6e-05,-5.1e-05,1.1e-05,4.6e-05,2.7e-05,4.2e-05,4.5e-05,-5e-06,0.000267,0.000125,7.3e-05,0.000208,0.000145,0.000214,0.000139,0.000229,0.000139,7e-05,-0.000115,2.2e-05,-9.3e-05,-0.000154,0.000102,-8.6e-05
0.00025,0.000274,0.00027,5.9e-05,0.000231,-0.000149,-0.000367,9.2e-05,-1e-05,-0.000335,-4.2e-05,-0.000186,-0.000363,0.000113,-2.6e-05,-6.8e-05,4.2e-05,6.9e-05,-0.000213,-0.000149,-0.000161,3.3e-05,6.6e-05,-1.8e-05,-0.000176,4.6e-05,-4.8e-05,-7.1e-05,6.8e-05,-0.000154,0.000184,-8e-06,-0.000179,0.000255,0.000293,9.1e-05,1e-05,-1.4e-05,-0.000124,0.000131,-0.000246,-0.000201,-3.2e-05,-7.8e-05,-0.000143,-0.000172,-1e-05,-0.00018,-0.000318,8.7e-05,-0.000164,0.000219,0.000136,-5.1e-05,2.1e-05,0.000198,5e-05,-1.1e-05,0.000167,-0.000237,-0.000211,4.9e-05,4.1e-05,-9.8e-05,-6e-06,6.1e-05,0,6.3e-05,-0.000187,-5.8e-05,-9e-06,1.9e-05,-0.000208,0.000202,0.000159,-0.000311,-0.000362,-0.000532,-0.000123,4.1e-05,2.8e-05,-0.000267,1.2e-05,-0.000132,0.000208,4e-06,-1.2e-05,4.8e-05,0.000184,-9e-06,0.000151,-0.000198,-0.000141,-0.000108,0.000107,0.000237,-0.000137,-9.3e-05,-0.000103,-8.4e-05,-0.000136,-0.000188,2e-05,-0.000128,4.2e-05,-9.5e-05,-8.6e-05,-1e-06,-8.8e-05,5.8e-05,-1.4e-05,3.5e-05,-5.3e-05,-9.3e-05,-0.000148,-0.000152,-6.5e-05,-7e-06,-9.2e-05,-0.000268,-1.5e-05
-0.00019,-5.4e-05,-0.000367,-9.2e-05,-0.000399,-0.000294,-0.000101,7.2e-05,-0.000256,0.000137,-0.000296,-0.000157,0.000168,0.000187,0.000104,-0.000126,-2.3e-05,7e-05,1e-05,-1e-06,-0.000213,-7.4e-05,-0.000154,3.9e-05,-5e-06,-0.000198,-4.6e-05,-4.3e-05,-0.000235,-0.000288,-9.1e-05,2.8e-05,2.4e-05,-0.000326,5.7e-05,-0.000106,2.6e-05,0.000153,0.000175,4.1e-05,0.000335,0.000186,8e-06,-3e-05,4.7e-05,8e-05,-0.000129,2.1e-05,4.2e-05,-0.000152,0.000119,7.7e-05,-1.8e-05,-0.000109,7.8e-05,0.000168,-0.000104,2.5e-05,8.5e-05,0.000133,-0.00024,-0.000124,0.000151,0.000113,7e-06,-0.000263,-0.000147,-0.000199,-0.000168,-7.8e-05,-5.9e-05,-0.000208,1.2e-05,0.000273,-0.00033,9e-05,0.000109,-0.000148,-0.000209,-0.000257,-0.000136,-5.4e-05,-2.9e-05,-5.1e-05,-0.000179,-0.000112,-4.6e-05,9.4e-05,-7.7e-05,-3.2e-05,-0.000121,2.9e-05,-8.7e-05,9.4e-05,5.1e-05,-9.9e-05,2.4e-05,6e-06,5.5e-05,3.4e-05,7e-06,-4.1e-05,-7e-05,-3.2e-05,-6e-05,-0.000146,3e-05,9.4e-05,6.6e-05,-5.8e-05,4.9e-05,-0.000142,-0.000189,-3.1e-05,7.6e-05,7e-06,-4e-06,-6.6e-05,2e-05,-3.8e-05,-1.8e-05
7.4e-05,-0.000126,-0.000312,0.000141,0.000319,0.000347,2.7e-05,-2.6e-05,0.000138,-0.000156,8.4e-05,-8e-06,0.000115,-0.000226,-9.3e-05,-1e-05,-3.4e-05,-0.000136,-0.000129,-0.000126,7.6e-05,-0.000195,0.000202,-6e-06,6.7e-05,-0.000134,2.4e-05,3.9e-05,0.000223,0.000334,-4.1e-05,-0.000157,1e-05,0.000195,-0.00011,-0.000199,-7.1e-05,-9.5e-05,-0.000112,-0.000128,-2.3e-05,-0.000218,0.000183,0.000183,8.6e-05,-0.000105,-8.4e-05,-0.000113,6.8e-05,0.000284,-0.000145,-0.000427,-0.000102,0.000107,-9.4e-05,-0.000112,0.000246,-2.7e-05,3.1e-05,-0.000192,0.000182,0.000191,-6.9e-05,-0.000167,-1.9e-05,2.8e-05,7.2e-05,0.000127,0.000117,-3.5e-05,-1.8e-05,-5e-06,-7.5e-05,-6.5e-05,9e-05,-0.000143,7.7e-05,2e-06,0.000249,-1e-04,3.9e-05,0.000215,0.000123,4.8e-05,3.7e-05,0.000112,-4.7e-05,1.4e-05,3.1e-05,-5.6e-05,-2.9e-05,7.9e-05,2.7e-05,0.000135,-2.6e-05,-8.4e-05,3.7e-05,-1.3e-05,0.000176,4.4e-05,3.2e-05,0.000113,5.4e-05,0.000119,2.7e-05,0.000105,-9e-06,-4.6e-05,-3.9e-05,-8.1e-05,-0.000103,4.5e-05,2e-05,2e-05,2.2e-05,1.2e-05,8.1e-05,4.1e-05,3e-05,3.6e-05,4e-06
-4.8e-05,6.7e-05,0.000157,-4.2e-05,-0.000102,-1e-05,0.000107,0.000173,1e-05,5.3e-05,-0.000142,-0.000223,2.8e-05,9.5e-05,-7.2e-05,0.000336,5.7e-05,-7.4e-05,4.5e-05,5.5e-05,0.000171,0.000165,-0.000165,4.9e-05,-5.9e-05,0.000294,2.6e-05,0.000115,2.5e-05,-9.3e-05,0.000146,7.6e-05,0.000155,-7.3e-05,-8e-06,1.8e-05,0.000155,6.7e-05,7.8e-05,0.000113,-0.00012,-4e-06,-9e-06,-0.000213,-6.2e-05,4.7e-05,8.2e-05,0.000288,4.2e-05,-8.2e-05,0.00015,0.000113,9e-06,8.7e-05,0.000143,4.4e-05,2.2e-05,6.2e-05,-0.000174,2.6e-05,3e-05,-4.8e-05,-7.8e-05,9.2e-05,1.1e-05,4.3e-05,-0.000114,-3.2e-05,3.4e-05,-0.000105,7.3e-05,0.000192,5.7e-05,2.5e-05,3.9e-05,4.4e-05,-3.3e-05,0.000102,-0.000102,9.1e-05,-6e-06,2.6e-05,-6.2e-05,3.9e-05,8e-06,2.7e-05,4.2e-05,-1e-05,-7.7e-05,3e-06,6.8e-05,-0.000105,-7e-06,-5.7e-05,-5.1e-05,8.7e-05,-3e-05,-3.8e-05,-0.000154,-5.2e-05,2.7e-05,-2e-05,-9.6e-05,-9.2e-05,-2e-06,-1.1e-05,0.000104,5.6e-05,2.9e-05,5.9e-05,1.4e-05,4e-06,3e-05,-1e-05,-3e-05,9.9e-05,-5.7e-05,-1.4e-05,-3e-05,-4.6e-05,-5e-06
-9.1e-05,7.2e-05,0.000191,9e-06,-5.1e-05,-5.6e-05,2e-06,-0.000151,2.6e-05,0.000188,0.000116,0.000278,1.6e-05,2.2e-05,0.000141,-0.000168,-2.6e-05,6.2e-05,5.5e-05,2.9e-05,-9.1e-05,-9.9e-05,2.8e-05,-8.3e-05,1.1e-05,-4.8e-05,-5.8e-05,-0.000143,2.1e-05,1.9e-05,-0.000148,0.000143,-6e-06,5.3e-05,7.6e-05,9.7e-05,2.5e-05,-0.000125,-0.000121,7e-06,9.2e-05,9.8e-05,-0.000107,0.000169,6.3e-05,-0.000108,7.4e-05,-0.000154,-0.000128,-0.000149,-0.000115,-3.1e-05,-2.2e-05,-0.000125,-5.1e-05,-6.7e-05,-7.2e-05,-6.5e-05,-1.1e-05,2.4e-05,-9.6e-05,-7.6e-05,7.8e-05,-1.4e-05,1.6e-05,-6.6e-05,-2.6e-05,6.8e-05,-1.3e-05,0.000133,-7.2e-05,0.000114,-2e-05,6.7e-05,0.000161,3.2e-05,-1e-05,-5.9e-05,7.4e-05,9.2e-05,-2e-06,-5.3e-05,4e-05,2.9e-05,-5.3e-05,-1.5e-05,-7.6e-05,1.2e-05,-2.3e-05,5.7e-05,4.3e-05,0.000112,-1.8e-05,-1e-05,6.4e-05,0.000105,-1.1e-05,1.7e-05,6e-06,3.6e-05,-5.1e-05,9.4e-05,-4.2e-05,-9e-06,-2.9e-05,-2.8e-05,-4.9e-05,5e-06,-3e-06,-3e-06,-1.2e-05,-9e-06,7.4e-05,1.9e-05,-1.1e-05,-3.1e-05,1.2e-05,-3e-06,-3e-06,7.2e-05,-1e-05
0.000124,-0.000112,1.7e-05,-6.4e-05,4.3e-05,-0.000132,3.6e-05,7.9e-05,-0.000174,-6e-05,-0.000186,-8.2e-05,-8.1e-05,-0.000122,-9.4e-05,5.8e-05,4e-06,-3.2e-05,-7.9e-05,4.8e-05,4.2e-05,-2.4e-05,2.5e-05,7.3e-05,2.1e-05,-7.2e-05,1.9e-05,1.5e-05,-7.4e-05,-1.5e-05,1.7e-05,-8.2e-05,-6.5e-05,4.3e-05,6e-05,1.6e-05,9e-06,0.000113,9.5e-05,-5e-06,-5.5e-05,-4e-05,3.9e-05,6.6e-05,-2.6e-05,0.000103,-0.000116,3.5e-05,0.000135,0.000139,1.6e-05,1.8e-05,6.8e-05,9.1e-05,6.6e-05,2.9e-05,-7.3e-05,1.6e-05,-3e-06,7.6e-05,8.8e-05,3.5e-05,8e-06,3.9e-05,8e-06,8.2e-05,4.5e-05,-4.9e-05,-5.1e-05,9.1e-05,8.2e-05,-0.000146,-4.7e-05,-0.00021,-4.6e-05,-4.9e-05,4.4e-05,8e-06,-5e-05,-7.8e-05,3.7e-05,2.9e-05,-2.6e-05,-1.2e-05,5.3e-05,-6.6e-05,5.1e-05,1.7e-05,6.1e-05,1.1e-05,-2.3e-05,-6.5e-05,2.9e-05,-6.4e-05,-7.6e-05,-7.3e-05,-7.4e-05,-1.9e-05,4e-05,-2.7e-05,7e-06,-3.3e-05,4.5e-05,-6e-06,3e-05,2.5e-05,-5.5e-05,-3.9e-05,-1.4e-05,-3.2e-05,-1e-06,1.1e-05,-4.5e-05,2e-05,2.5e-05,-8e-06,1.1e-05,-1.2e-05,3.3e-05,-1.4e-05,3.7e-05
0,8e-05,-8.9e-05,-6.5e-05,-5e-06,0.000108,4e-06,-9.4e-05,3.6e-05,1e-06,8.7e-05,4.1e-05,-1.8e-05,7.3e-05,0,-7.4e-05,6e-06,-1.8e-05,-3.4e-05,-1.6e-05,-1.7e-05,8.4e-05,7.8e-05,-2.3e-05,-5e-06,8.1e-05,-1.9e-05,2.7e-05,2.9e-05,1e-05,6.1e-05,-3.2e-05,3.5e-05,4.4e-05,-0.000139,-7.9e-05,-3e-06,-1.4e-05,-3.1e-05,4.5e-05,-2.4e-05,0,7.5e-05,-4.3e-05,-3.3e-05,-4.1e-05,8.4e-05,-2.1e-05,-7e-06,-2e-05,-1e-06,4.5e-05,-3e-06,-1.6e-05,-5.6e-05,7e-06,2e-06,-1.2e-05,-2.7e-05,-7.9e-05,-9.2e-05,-3.7e-05,-5.4e-05,-3.2e-05,-1.4e-05,-4.7e-05,4.6e-05,2.9e-05,4.4e-05,-0.000122,-6.8e-05,-7e-06,2e-06,4.4e-05,-0.000122,0.000105,-3e-06,-4.4e-05,5e-05,-1e-05,-1.6e-05,-2.1e-05,8e-06,-4e-05,-3.2e-05,1.7e-05,-2e-05,0,-3e-06,7e-06,-2.1e-05,-1.3e-05,-2.6e-05,2.2e-05,8e-06,-1.5e-05,2.6e-05,0,5e-06,-3.1e-05,0,1e-06,1.1e-05,2.1e-05,-4.4e-05,-1.6e-05,4.2e-05,-5e-06,5e-06,-8e-06,0,1.2e-05,1e-06,3e-06,1.4e-05,6e-06,0,-4e-06,1.1e-05,7e-06,-1.5e-05
-2.8e-05,-4.8e-05,0.000124,5.4e-05,-1e-06,7e-06,2e-06,-3e-06,8e-06,-4.2e-05,-6.1e-05,-5.5e-05,-3.4e-05,0.000102,1.1e-05,-9e-06,2e-06,3.8e-05,8.1e-05,-2.7e-05,-2.7e-05,-3.6e-05,-3.8e-05,3.3e-05,-2.3e-05,-5.6e-05,6.4e-05,-2e-06,-3.5e-05,-1.8e-05,-6.4e-05,0,4e-06,-3.9e-05,3.2e-05,-3.3e-05,-4.8e-05,-1.7e-05,5.4e-05,-1.6e-05,2.8e-05,-1e-06,1.4e-05,-3.5e-05,7e-06,1.8e-05,-1.5e-05,2.2e-05,-3.2e-05,1.1e-05,4.6e-05,7.4e-05,1.9e-05,1e-05,3.9e-05,3e-06,7.7e-05,4e-06,5.8e-05,1.4e-05,2.5e-05,-2.3e-05,1.5e-05,-2.1e-05,-1.1e-05,0,-1.1e-05,-2.5e-05,3.6e-05,3.3e-05,2.9e-05,5.7e-05,-2.9e-05,-5.4e-05,1.9e-05,-6.1e-05,7e-06,3.6e-05,-7.9e-05,5.4e-05,-1.7e-05,-1.6e-05,8e-06,5e-06,2.5e-05,-2e-06,3.2e-05,-1.8e-05,-1.6e-05,-5e-05,1.6e-05,5.5e-05,2.6e-05,-3.1e-05,8.3e-05,-3.4e-05,-1.5e-05,4e-06,7e-06,3.4e-05,7e-06,5e-06,-4e-06,-2e-06,2.4e-05,-1.4e-05,1.7e-05,1.1e-05,-2.2e-05,1.5e-05,4e-06,-2.1e-05,-3e-06,-1.6e-05,-1.7e-05,2e-06,1e-05,-1.5e-05,7e-06,-2.9e-05,1.3e-05
1.7e-05,3.3e-05,-9.8e-05,2e-06,-4.1e-05,2.8e-05,3.3e-05,-4.8e-05,3.4e-05,6.8e-05,7.5e-05,3.6e-05,8e-06,-8.8e-05,4e-06,7.1e-05,1.5e-05,6e-06,1e-06,9e-06,-7e-06,-1.7e-05,1e-05,-3.2e-05,3e-05,2.1e-05,-3.8e-05,2.6e-05,1.3e-05,-1.4e-05,6.3e-05,3e-05,-1.2e-05,2.1e-05,1e-05,4.8e-05,6e-06,9e-06,-6.6e-05,-3.2e-05,1.2e-05,1e-05,-5.4e-05,-6e-06,-1.4e-05,7e-06,-3.3e-05,1.6e-05,-5e-06,-3.6e-05,-4.5e-05,-3e-05,-2.5e-05,-2.5e-05,1.2e-05,2.8e-05,-3.8e-05,-8e-06,3.6e-05,-4.3e-05,5e-05,2.1e-05,2.3e-05,2.2e-05,-2e-06,3.3e-05,-8e-06,6e-06,1.4e-05,-4e-05,-3.2e-05,-3e-06,3.5e-05,3.5e-05,1.7e-05,8e-06,3e-06,6e-05,1.7e-05,-4.9e-05,-1e-06,2e-06,1.9e-05,1.8e-05,-2.3e-05,-1.5e-05,-2e-06,-2e-05,-1e-06,2.8e-05,-1.1e-05,-2.4e-05,-4e-06,2.2e-05,-3.9e-05,1.6e-05,1e-05,-3e-06,-8e-06,-1.9e-05,-1e-06,-9e-06,-2.3e-05,2.4e-05,-1.4e-05,2.5e-05,-2.2e-05,-1e-05,1.3e-05,-9e-06,1.2e-05,1.3e-05,1.4e-05,-4e-06,5e-06,2e-06,-1.2e-05,2.3e-05,-1.6e-05,3.3e-05,-8e-06
-1.1e-05,1.8e-05,4.3e-05,1.6e-05,7e-05,-3e-05,-6.4e-05,4.9e-05,-2.1e-05,-5.6e-05,-3.5e-05,6.3e-05,1.7e-05,2.9e-05,-2.2e-05,-9e-05,-4e-06,-5.6e-05,1.5e-05,1.7e-05,-1e-06,1.5e-05,-4.5e-05,1.1e-05,-4.6e-05,4.3e-05,-7e-06,-1e-06,-1.4e-05,1.9e-05,-1.8e-05,-7e-06,-4e-06,-4.3e-05,-1.5e-05,2.2e-05,-5e-06,-5e-06,5.5e-05,1.1e-05,2e-06,1.9e-05,-1.8e-05,-8e-06,3e-06,-1.6e-05,2.5e-05,3e-06,-6.5e-05,9e-06,3.2e-05,-3.3e-05,-4e-06,-9e-06,-3.8e-05,-2.4e-05,-3.1e-05,8e-06,0,5.2e-05,-5.5e-05,-4e-06,-1.2e-05,-5e-06,1e-06,7e-06,2e-06,-1.6e-05,-4.4e-05,6.7e-05,5e-06,-2.4e-05,-1.3e-05,6.6e-05,1.5e-05,-2e-05,1e-06,-2.2e-05,-1.3e-05,8e-06,3.2e-05,1.1e-05,0,-1.1e-05,-7e-06,2.3e-05,2e-06,2e-05,-2.9e-05,-1.7e-05,-7e-06,7e-06,9e-06,7e-06,-1.5e-05,-6e-06,-1e-06,-3e-06,1.6e-05,1.1e-05,-1.3e-05,-2.4e-05,-2.7e-05,-1e-05,-3e-06,6e-06,2.8e-05,-7e-06,-7e-06,9e-06,-1.2e-05,4e-06,1e-06,9e-06,-1e-06,-6e-06,-5e-06,-1e-05,6e-06,-1.3e-05,1e-06
-2e-06,-4.5e-05,4.2e-05,-5e-06,-8.3e-05,-4.5e-05,5e-06,-3.4e-05,-1.1e-05,1.4e-05,4.1e-05,-1e-05,2.5e-05,3e-06,4e-06,1.9e-05,-4e-06,4.7e-05,-1.6e-05,1.6e-05,1.3e-05,-1e-06,5.5e-05,-6e-06,3.8e-05,-1.4e-05,2e-05,-1.5e-05,7e-06,-2.5e-05,-1.7e-05,-1e-05,3e-06,2.8e-05,-3.2e-05,1.6e-05,-2.2e-05,4e-06,-3.1e-05,-1.2e-05,8e-06,-1.3e-05,4.1e-05,2.8e-05,1.4e-05,2e-06,-7e-06,-4.5e-05,5.3e-05,3.5e-05,-6e-06,-1.4e-05,-9e-06,1.3e-05,3.3e-05,-3e-06,4e-06,-1.6e-05,1.7e-05,1.5e-05,2e-05,1e-06,-1.2e-05,9e-06,-4e-06,-6e-06,-1.4e-05,1.3e-05,-2e-06,-2.8e-05,-3e-06,-6e-06,9e-06,-2.4e-05,-3e-06,2.3e-05,2e-06,-4.2e-05,-2.4e-05,2.5e-05,-2.3e-05,-1e-05,-1.8e-05,-3e-06,4e-06,-1e-06,-5e-06,-1.2e-05,5e-06,1e-06,1.2e-05,0,-1.3e-05,0,1.8e-05,6e-06,-4e-06,1e-06,4e-06,1e-06,7e-06,1.5e-05,2.8e-05,5e-06,-1e-06,-1.9e-05,-1.4e-05,3e-06,6e-06,1.2e-05,8e-06,-9e-06,-4e-06,-5e-06,7e-06,-2.1e-05,3e-06,-3e-06,7e-06,3e-06,6e-06
2.9e-05,2.5e-05,-7.3e-05,-1.1e-05,5.5e-05,3e-05,-1.8e-05,7e-06,1.4e-05,5e-06,-3.1e-05,-2.3e-05,2.4e-05,-1.3e-05,1e-05,-4e-06,0,1.4e-05,-9e-06,-1.2e-05,-1.6e-05,-6e-06,-2.6e-05,5e-06,-2.6e-05,-2.8e-05,-2.1e-05,-1.6e-05,-1.6e-05,7e-06,2.2e-05,1.7e-05,1.2e-05,-3.1e-05,1.4e-05,-1.7e-05,2.2e-05,-2.3e-05,1e-05,-2.5e-05,2e-06,-9e-06,1.4e-05,-6e-06,-1e-06,1.4e-05,-1e-05,1.6e-05,1e-05,-2.7e-05,-2e-06,5.7e-05,1.6e-05,1.7e-05,-9e-06,-5e-06,1.7e-05,1.1e-05,-3.3e-05,-2.1e-05,-4e-06,1e-05,0,-9e-06,-5e-06,-6e-06,1.7e-05,-1.8e-05,2e-05,-2.5e-05,0,1.5e-05,-1e-06,4.6e-05,-2.5e-05,1e-05,-3e-06,1.2e-05,3e-06,-1.9e-05,6e-06,1.1e-05,1e-06,-3e-06,8e-06,-1e-06,-5e-06,-3e-06,2.1e-05,2e-06,-6e-06,4e-06,8e-06,2.5e-05,-9e-06,-7e-06,7e-06,-5e-06,1e-06,-6e-06,1e-06,-2.5e-05,2e-06,-7e-06,-1e-06,5e-06,-2e-06,-9e-06,-3e-06,-1.1e-05,-6e-06,5e-06,-2.1e-05,-4e-06,-6e-06,2.1e-05,3e-06,1e-05,-2e-06,-2e-05,-5e-06
-3.9e-05,1.5e-05,6e-06,5e-06,-1e-05,2.4e-05,1.6e-05,-9e-06,3.8e-05,-1.2e-05,5.4e-05,-2.7e-05,5e-06,-4e-06,-1.5e-05,-1.1e-05,-3e-06,-3.8e-05,1.5e-05,-1.7e-05,-4e-06,1.8e-05,-4e-06,-8e-06,4e-06,9e-06,3.5e-05,3.1e-05,1.3e-05,-6e-06,-3.1e-05,-2.3e-05,3e-06,2.3e-05,1.5e-05,-1.4e-05,4e-06,1.6e-05,1e-05,5e-06,0,8e-06,-1.6e-05,-1.6e-05,3e-06,-1e-06,5e-06,2e-06,1.1e-05,-3e-06,4e-06,-3.4e-05,-5e-06,-1.2e-05,1.3e-05,-4e-06,1.2e-05,-7e-06,9e-06,1.6e-05,-1.4e-05,-2e-05,2.3e-05,-3e-06,-3e-06,-4e-06,5e-06,8e-06,1.5e-05,1.6e-05,2e-06,-1.3e-05,1.1e-05,-2.7e-05,7e-06,-2.1e-05,2e-06,1.8e-05,5e-06,-2.8e-05,0,1.6e-05,-3e-06,-5e-06,-1e-06,-3e-06,-5e-06,-2e-06,-5e-06,4e-06,-7e-06,-1e-05,-7e-06,-2.7e-05,-2.1e-05,-1.3e-05,1.1e-05,-2e-06,-8e-06,2e-06,4e-06,2.3e-05,5e-06,-8e-06,3e-06,0,1e-05,-1e-06,-2e-06,4e-06,7e-06,1e-06,-4e-06,6e-06,2e-06,6e-06,-4e-06,-7e-06,-4e-06,2e-06,3e-06
1.9e-05,-3e-05,-2.5e-05,-4e-06,-9e-06,-4e-06,4e-06,2.6e-05,-7e-06,2.2e-05,-3.8e-05,2e-06,-2e-06,1e-05,8e-06,3.8e-05,4e-06,1.6e-05,-3e-06,-3e-06,2.8e-05,-2.5e-05,-2e-06,0,1e-05,1.1e-05,-2.6e-05,-1.1e-05,-7e-06,-4e-06,1.4e-05,-6e-06,9e-06,3e-06,-6e-06,-8e-06,2e-06,-7e-06,-2.1e-05,1.5e-05,1e-06,-6e-06,-1.8e-05,2e-06,-6e-06,-1.7e-05,-9e-06,1.5e-05,-2.2e-05,8e-06,-2e-06,-2.5e-05,1e-06,1.2e-05,-2.5e-05,1.4e-05,-3.5e-05,8e-06,-1e-06,-3.4e-05,1.8e-05,2e-06,-4e-06,-1e-06,1e-06,5e-06,-1.5e-05,-6e-06,-1.9e-05,-8e-06,-1e-06,2.5e-05,2e-06,-3.9e-05,1.7e-05,-6e-06,5e-06,2e-06,-7e-06,1.9e-05,6e-06,-2.1e-05,5e-06,1.3e-05,0,1e-06,1e-06,2e-06,3e-06,3e-06,-1e-06,1.5e-05,1e-05,1.5e-05,2.3e-05,-4e-06,-4e-06,-2e-06,1e-06,6e-06,-1e-05,-2e-06,-1e-06,1.1e-05,-1e-06,-5e-06,-1e-06,5e-06,-2e-06,1e-06,1e-06,-6e-06,1.8e-05,-2e-06,1e-06,-1e-05,2e-06,7e-06,-3e-06,1.1e-05,-2e-06
-3e-06,2.6e-05,4.1e-05,7e-06,2e-06,-2.8e-05,1.1e-05,-3.2e-05,-1e-05,-2.3e-05,2.3e-05,3.2e-05,-1.1e-05,1.6e-05,-8e-06,-3.1e-05,0,2.2e-05,-1e-06,1.5e-05,0,3e-06,1e-05,1e-05,-7e-06,1.1e-05,6e-06,2e-06,7e-06,1.1e-05,9e-06,2.4e-05,1e-06,-1.4e-05,-1.1e-05,2.9e-05,8e-06,1.4e-05,3.3e-05,-2e-05,0,-7e-06,2e-05,1.7e-05,-5e-06,2.7e-05,1.7e-05,-3e-06,-9e-06,-7e-06,-3e-06,2.3e-05,-2e-06,0,2.2e-05,-2e-06,-2e-06,-6e-06,-5e-06,8e-06,-1e-05,9e-06,-2.5e-05,6e-06,2e-06,-8e-06,-5e-06,7e-06,-1.3e-05,1.2e-05,4e-06,5e-06,-5e-06,1e-05,9e-06,-4e-06,-3e-06,-6e-06,1.2e-05,2.1e-05,-1e-06,1e-06,-6e-06,1e-06,-9e-06,-1.2e-05,-3e-06,0,-1.1e-05,-5e-06,1e-05,-1e-05,-1e-05,-1e-05,5e-06,1.1e-05,0,-2e-06,1.2e-05,-5e-06,6e-06,-1e-06,-6e-06,-1.2e-05,0,1.1e-05,-2e-06,-6e-06,-1e-06,0,-4e-06,0,-1e-06,-1e-06,1e-06,2e-06,1e-06,-1e-06,6e-06,2e-06,1e-06
-8e-06,-1.5e-05,1.4e-05,3e-06,1.5e-05,-1e-06,8e-06,3e-05,-8e-06,2.5e-05,-2.9e-05,-9e-06,-7e-06,-2.6e-05,1e-05,-1.2e-05,-2e-06,-2.8e-05,-7e-06,7e-06,-2.1e-05,-4e-06,-3e-06,-4e-06,-5e-06,-1.4e-05,1e-06,2e-05,-7e-06,-1.5e-05,-1.5e-05,7e-06,-1.2e-05,4e-06,1.8e-05,1e-05,-1.1e-05,-1.9e-05,-3.7e-05,1.8e-05,-1e-06,8e-06,2.1e-05,-2e-05,-2e-06,-3e-05,-9e-06,-1.7e-05,1.2e-05,1e-05,-1e-06,-3e-05,-1e-06,3e-06,-5e-06,3e-06,1.6e-05,1e-06,-1e-06,2e-05,3e-06,-8e-06,1.8e-05,-1e-06,-1e-06,2e-06,1e-06,-9e-06,4e-06,-5e-06,-5e-06,-3e-05,5e-06,3e-06,-9e-06,2e-05,-2e-06,-1.7e-05,-2e-06,-2.2e-05,-5e-06,-1e-06,7e-06,-1.2e-05,3e-06,2e-06,3e-06,-3e-06,-3e-06,5e-06,1e-06,-2e-06,1e-06,5e-06,-9e-06,2e-06,0,-2e-06,-8e-06,-1e-06,-3e-06,0,-3e-06,1.2e-05,1e-06,-2e-06,2e-06,3e-06,4e-06,0,2e-06,5e-06,3e-06,2e-06,0,-6e-06,-2e-06,-2e-06,1e-06,-6e-06,3e-06
1e-05,2e-06,-1.6e-05,-1e-06,-2.1e-05,2e-05,-1.5e-05,-1e-05,1.4e-05,-2.1e-05,1.8e-05,-1.6e-05,-3e-06,7e-06,-1e-05,2.3e-05,2e-06,-7e-06,3e-06,-3e-06,1.3e-05,1e-06,6e-06,6e-06,1e-05,7e-06,-4e-06,-1.2e-05,6e-06,5e-06,1.7e-05,-1.8e-05,3e-06,8e-06,1.1e-05,-1.8e-05,-4e-06,3e-06,3.2e-05,8e-06,2e-06,4e-06,-1.9e-05,1e-05,-2e-06,1.8e-05,9e-06,4e-06,-5e-06,-1.1e-05,4e-06,3e-06,5e-06,-7e-06,-9e-06,-1e-06,1e-06,4e-06,-6e-06,-9e-06,-6e-06,8e-06,1.1e-05,-1e-06,1e-06,3e-06,7e-06,5e-06,1.9e-05,-2e-06,3e-06,-4e-06,-8e-06,1e-06,-9e-06,-3e-06,7e-06,-1e-06,3e-06,-5e-06,6e-06,-4e-06,-3e-06,2e-06,3e-06,9e-06,1e-06,-3e-06,1e-06,-1e-06,-1e-05,1.6e-05,-3e-06,7e-06,0,5e-06,1e-06,-1e-06,1e-06,4e-06,4e-06,0,-1e-06,-6e-06,0,-1e-05,4e-06,2e-06,-2e-06,-2e-06,-3e-06,-6e-06,-6e-06,3e-06,-1e-06,8e-06,1e-06,2e-06,-3e-06,-4e-06,-2e-06
-4e-06,1.4e-05,4e-06,3e-06,7e-06,9e-06,1.6e-05,1.4e-05,3e-06,9e-06,-2.5e-05,-6e-06,0,8e-06,9e-06,-2.4e-05,-1e-06,3.1e-05,0,-1.2e-05,3e-06,5e-06,-1.9e-05,-6e-06,-7e-06,0,1.1e-05,-1.1e-05,-3e-06,0,-9e-06,-4e-06,2e-06,-1e-05,-1.3e-05,-2.1e-05,-3e-06,6e-06,-2.7e-05,-1.7e-05,2e-06,2e-06,-1.2e-05,9e-06,4e-06,-6e-06,-1e-06,1.3e-05,1.8e-05,5e-06,-8e-06,3.3e-05,-3e-06,-3e-06,5e-06,-8e-06,3e-06,4e-06,-6e-06,0,7e-06,1e-06,-2.1e-05,-2e-06,0,-8e-06,3e-06,-1e-06,-2e-06,1e-05,-9e-06,2.4e-05,2e-06,3.9e-05,0,0,-5e-06,2.6e-05,-2e-06,1.3e-05,-4e-06,-1e-06,6e-06,5e-06,4e-06,-4e-06,1e-06,6e-06,1.1e-05,-5e-06,4e-06,-2e-05,8e-06,-5e-06,5e-06,-7e-06,-5e-06,-1e-06,1e-06,-2e-06,-4e-06,-6e-06,6e-06,3e-06,-1e-06,5e-06,2e-06,-2e-06,2e-06,0,4e-06,2e-06,-1e-06,-4e-06,2e-06,3e-06,-1e-06,-2e-06,-1e-06,7e-06,2e-06
-5e-06,-1.9e-05,-4e-06,-4e-06,1.1e-05,-1.2e-05,-2.1e-05,-9e-06,-1.1e-05,-1e-06,1.9e-05,6e-06,4e-06,-4e-06,-5e-06,2.2e-05,0,-1.8e-05,3e-06,-1e-06,-1.5e-05,-3e-06,2.1e-05,7e-06,-8e-06,-1e-05,-1.3e-05,2e-06,5e-06,-2e-06,-5e-06,1e-05,-5e-06,5e-06,-1e-06,6e-06,-2e-06,-1e-06,2.2e-05,1.2e-05,-5e-06,-6e-06,6e-06,-2.2e-05,3e-06,3e-06,-3e-06,-1e-06,-2.1e-05,2e-06,7e-06,1.3e-05,4e-06,6e-06,1e-06,3e-06,-2e-05,-2e-06,3e-06,2e-06,1e-06,-5e-06,2e-06,-1e-06,1e-06,9e-06,-2e-06,3e-06,-1.3e-05,-1.3e-05,6e-06,4e-06,-3e-06,-3e-05,5e-06,-5e-06,1e-06,-2e-06,1.1e-05,-3e-06,0,3e-06,-1.1e-05,-1e-06,-3e-06,2e-06,3e-06,-2e-06,-2e-06,-4e-06,0,1.3e-05,-5e-06,5e-06,-7e-06,1e-06,-3e-06,-1e-06,1e-06,-1e-06,1e-06,4e-06,1e-06,-2e-06,0,4e-06,-3e-06,0,-3e-06,1e-06,-2e-06,2e-06,6e-06,-1e-06,-1e-06,-1.1e-05,0,2e-06,4e-06,-1e-06,0
1.4e-05,9e-06,3e-06,-1e-06,-1.3e-05,-1e-05,3e-06,8e-06,-1.4e-05,-5e-06,-1.8e-05,2.3e-05,2e-06,-1.1e-05,5e-06,-8e-06,-1e-06,-1.2e-05,-3e-06,7e-06,2e-06,0,-9e-06,-7e-06,1.4e-05,1.6e-05,6e-06,8e-06,-3e-06,-5e-06,1e-05,-2e-06,6e-06,-1e-06,1.3e-05,1.7e-05,4e-06,0,-1.6e-05,-3e-06,1e-06,-3e-06,1.5e-05,1.7e-05,1e-06,-7e-06,2e-06,-1e-06,6e-06,-7e-06,-3e-06,-1.2e-05,-4e-06,0,3e-06,0,1.3e-05,0,-6e-06,-1.5e-05,-1.1e-05,5e-06,1.4e-05,5e-06,1e-06,0,-1e-06,-3e-06,-4e-06,9e-06,-6e-06,-2.1e-05,1e-06,1.5e-05,1e-05,-3e-06,1e-06,-1.3e-05,-1.1e-05,-7e-06,-1e-06,-1e-06,3e-06,1e-06,-3e-06,0,-1e-06,0,1e-06,3e-06,1e-06,-1e-06,1e-06,-8e-06,0,6e-06,2e-06,-1e-06,1e-06,3e-06,0,-6e-06,-7e-06,2e-06,0,-2e-06,0,2e-06,0,-1e-06,0,-1e-06,-1e-06,3e-06,1e-06,2e-06,0,-2e-06,-2e-06,1e-06,1e-06
-1.5e-05,7e-06,1e-06,-1e-06,0,5e-06,-5e-06,-2e-06,5e-06,1.2e-05,1.5e-05,-2e-06,0,1.7e-05,-4e-06,-1.4e-05,-1e-06,1.9e-05,2e-06,5e-06,9e-06,-6e-06,1e-06,3e-06,-1.2e-05,-4e-06,0,-7e-06,2e-06,4e-06,-1.1e-05,-4e-06,5e-06,2e-06,4e-06,2e-06,0,-4e-06,1.2e-05,-1e-05,0,7e-06,2e-06,-5e-06,-1e-06,1.2e-05,-8e-06,-1.3e-05,-5e-06,1.1e-05,2e-06,-6e-06,1e-06,0,-1.2e-05,2e-06,3e-06,1e-06,1.4e-05,1.4e-05,1.3e-05,-4e-06,-4e-06,-3e-06,-1e-06,-3e-06,-4e-06,2e-06,1.2e-05,-2e-06,3e-06,1e-06,-4e-06,-1.7e-05,-1.1e-05,6e-06,0,-4e-06,6e-06,1e-05,4e-06,-3e-06,-2e-06,-2e-06,1e-06,-1e-06,1e-06,2e-06,-8e-06,1e-06,2e-06,-8e-06,-1e-06,1e-06,4e-06,5e-06,-2e-06,-1e-06,-3e-06,-3e-06,1e-06,3e-06,-2e-06,-1e-06,0,1e-06,1e-06,-2e-06,0,-1e-06,1e-06,-2e-06,-2e-06,-1e-06,-2e-06,5e-06,0,-3e-06,2e-06,-7e-06,1e-06
7e-06,-1.5e-05,-1e-06,-2e-06,1e-05,1.2e-05,3e-06,3e-06,7e-06,-1.7e-05,-1.1e-05,-1.3e-05,-3e-06,-4e-06,3e-06,2.5e-05,2e-06,-2e-06,1e-06,-3e-06,-3e-06,4e-06,-2e-06,-3e-06,3e-06,-1.5e-05,-3e-06,1e-05,-2e-06,3e-06,6e-06,1e-06,-2e-06,-6e-06,-1e-05,-9e-06,4e-06,5e-06,-1.2e-05,1e-05,-3e-06,1e-06,-1.7e-05,-6e-06,-3e-06,-1.4e-05,2e-06,3e-06,6e-06,-1.1e-05,0,-3e-06,-2e-06,4e-06,1.2e-05,3e-06,2e-06,1e-06,1e-06,6e-06,-1.2e-05,-1e-06,-7e-06,1e-06,0,2e-06,2e-06,-1e-06,6e-06,-3e-06,-3e-06,1.1e-05,2e-06,-1.6e-05,0,1e-06,-1e-06,7e-06,-1e-06,1e-06,-3e-06,2e-06,9e-06,-1e-06,-1e-06,-5e-06,-2e-06,1e-06,-1e-06,-1e-06,-2e-06,1e-05,3e-06,-8e-06,0,-1e-06,1e-06,-1e-06,0,1e-06,0,1e-06,-2e-06,2e-06,-1e-06,-1e-06,0,0,1e-06,2e-06,-1e-06,4e-06,-6e-06,-2e-06,1e-06,-1e-06,1e-06,4e-06,-4e-06,3e-06,-1e-06
-1e-06,1.2e-05,-9e-06,2e-06,-6e-06,-2e-06,2e-06,-5e-06,0,1.6e-05,1.9e-05,-5e-06,-4e-06,-1.2e-05,1e-06,-1.6e-05,0,-1.5e-05,-1e-06,-8e-06,-4e-06,0,3e-06,3e-06,2e-06,7e-06,8e-06,4e-06,1e-06,-8e-06,3e-06,1e-06,1e-06,2e-06,2e-06,-1e-05,3e-06,-4e-06,1.3e-05,-4e-06,1e-06,-4e-06,1e-06,1e-05,-2e-06,1e-05,0,1e-05,3e-06,2e-06,2e-06,4e-06,3e-06,-1e-06,-4e-06,-3e-06,-3e-06,1e-06,5e-06,-1.5e-05,2e-06,3e-06,0,-2e-06,0,0,4e-06,0,-6e-06,4e-06,1e-06,-1e-06,1e-06,1.7e-05,0,1e-06,0,5e-06,-3e-06,-1.2e-05,3e-06,-3e-06,-1e-05,4e-06,5e-06,2e-06,-1e-06,1e-06,2e-06,2e-06,0,-4e-06,-2e-06,4e-06,-1e-06,-4e-06,1e-06,-1e-06,2e-06,2e-06,-2e-06,4e-06,3e-06,-2e-06,0,-4e-06,2e-06,2e-06,1e-06,-2e-06,1e-06,-3e-06,1e-06,2e-06,-1e-06,3e-06,-1e-06,-2e-06,3e-06,-1e-06,1e-06
-4e-06,-6e-06,-3e-06,0,-7e-06,-1.2e-05,1e-06,0,-7e-06,-9e-06,-1.5e-05,-1e-06,-2e-06,1.2e-05,-3e-06,7e-06,0,1.1e-05,1e-06,-1e-06,6e-06,2e-06,1e-06,-2e-06,-4e-06,3e-06,-1e-05,-8e-06,-1e-06,4e-06,-7e-06,-3e-06,-1e-06,6e-06,5e-06,5e-06,-3e-06,0,-1.3e-05,2e-06,1e-06,0,1.2e-05,-4e-06,-1e-06,-1e-06,-1e-06,0,-5e-06,6e-06,-3e-06,-1e-05,-1e-06,0,-1e-06,0,-7e-06,-3e-06,1e-06,1.4e-05,9e-06,-3e-06,8e-06,1e-06,1e-06,0,-1e-06,0,-1e-05,-8e-06,0,-2e-06,-2e-06,-1e-06,1e-06,-6e-06,1e-06,1e-06,2e-06,3e-06,-1e-06,-2e-06,6e-06,-1e-06,-1e-06,3e-06,-1e-06,-1e-06,6e-06,1e-06,-2e-06,-2e-06,0,-2e-06,-3e-06,-2e-06,0,-1e-06,-1e-06,-2e-06,2e-06,-2e-06,3e-06,1e-06,0,3e-06,-1e-06,-2e-06,-1e-06,0,-1e-06,1e-06,3e-06,0,0,-8e-06,1e-06,1e-06,1e-06,4e-06,0
4e-06,-1e-06,9e-06,0,1.5e-05,-1e-06,8e-06,1e-06,0,2e-06,1.5e-05,1.9e-05,0,-2e-06,5e-06,4e-06,0,8e-06,-1e-06,5e-06,3e-06,-2e-06,3e-06,1e-06,0,-6e-06,7e-06,0,1e-06,1e-06,6e-06,2e-06,-2e-06,-9e-06,-5e-06,1e-05,1e-06,-1e-06,1.1e-05,7e-06,0,2e-06,1e-06,-6e-06,1e-06,-5e-06,3e-06,-4e-06,4e-06,-6e-06,4e-06,9e-06,2e-06,-1e-06,-2e-06,-1e-06,9e-06,0,-2e-06,-1.5e-05,-1.4e-05,1e-06,1e-06,1e-06,0,-1e-06,-2e-06,1e-06,3e-06,1e-05,-2e-06,0,2e-06,5e-06,6e-06,-1e-06,-2e-06,-8e-06,-1e-06,1.2e-05,1e-06,1e-06,-4e-06,-3e-06,-1e-06,-2e-06,-1e-06,0,-2e-06,0,3e-06,4e-06,-1e-06,2e-06,2e-06,3e-06,1e-06,-1e-06,-1e-06,1e-06,-2e-06,2e-06,1e-06,-1e-06,0,3e-06,-2e-06,1e-06,0,3e-06,2e-06,0,2e-06,-2e-06,0,2e-06,0,1e-06,-1e-06,-4e-06,0
-1e-06,9e-06,3e-06,-1e-06,-1.2e-05,8e-06,-1.2e-05,-3e-06,8e-06,1e-06,-1e-05,-4e-06,3e-06,-2e-06,-6e-06,-1.6e-05,-1e-06,-1.4e-05,0,4e-06,-6e-06,0,-1e-05,1e-06,3e-06,4e-06,-1e-06,0,-1e-06,-4e-06,-4e-06,6e-06,1e-06,6e-06,-8e-06,5e-06,-2e-06,4e-06,-9e-06,-4e-06,0,-1e-06,-9e-06,8e-06,2e-06,5e-06,0,-5e-06,-1.1e-05,4e-06,-3e-06,-5e-06,-2e-06,-1e-06,5e-06,0,2e-06,-2e-06,-2e-06,5e-06,1.1e-05,0,-1.3e-05,0,0,-1e-06,-1e-06,-1e-06,9e-06,-5e-06,0,-5e-06,0,1.8e-05,-6e-06,3e-06,1e-06,-5e-06,-3e-06,-8e-06,1e-06,0,7e-06,2e-06,-1e-06,3e-06,0,2e-06,-1e-06,-2e-06,2e-06,-1e-06,0,4e-06,2e-06,0,1e-06,-1e-06,1e-06,1e-06,1e-06,-2e-06,-1e-06,-1e-06,0,-4e-06,1e-06,1e-06,-1e-06,-2e-06,0,0,-1e-06,1e-06,0,7e-06,0,-3e-06,0,1e-06,0
-4e-06,-1.2e-05,1e-06,-1e-06,4e-06,4e-06,1.1e-05,-2e-06,5e-06,-5e-06,9e-06,-9e-06,3e-06,0,6e-06,1.7e-05,1e-06,4e-06,-1e-06,-3e-06,-3e-06,-3e-06,1e-05,0,-4e-06,-1e-06,-3e-06,-1e-06,0,0,-2e-06,-3e-06,-1e-06,0,0,-8e-06,-4e-06,-1e-06,6e-06,4e-06,1e-06,-2e-06,-6e-06,-2e-06,2e-06,-2e-06,4e-06,3e-06,1e-05,-4e-06,1e-06,-1.4e-05,0,0,-1e-06,2e-06,-4e-06,1e-06,-2e-06,9e-06,-4e-06,-2e-06,5e-06,0,0,1e-06,-1e-06,-1e-06,1e-06,1e-06,-2e-06,-1e-06,1e-06,-2.2e-05,0,3e-06,-1e-06,8e-06,1e-06,-7e-06,-1e-06,-1e-06,-1e-05,0,1e-06,0,1e-06,-1e-06,-4e-06,0,-4e-06,-5e-06,0,-5e-06,-5e-06,-2e-06,1e-06,-1e-06,0,-1e-06,-2e-06,0,-4e-06,2e-06,0,0,1e-06,-2e-06,1e-06,0,-1e-06,-2e-06,-2e-06,2e-06,0,-5e-06,0,2e-06,-1e-06,-1e-06,0
6e-06,6e-06,-2e-06,1e-06,-1e-06,-6e-06,-9e-06,0,-5e-06,8e-06,-1.1e-05,-6e-06,2e-06,3e-06,-6e-06,-7e-06,0,7e-06,0,-4e-06,6e-06,1e-06,-6e-06,1e-06,2e-06,-2e-06,6e-06,1e-06,-1e-06,1e-06,5e-06,-5e-06,1e-06,-2e-06,2e-06,-8e-06,2e-06,-2e-06,-1e-06,0,0,0,9e-06,-4e-06,1e-06,-1e-06,-2e-06,7e-06,-6e-06,3e-06,0,9e-06,-1e-06,-1e-06,-5e-06,0,1e-06,-1e-06,-3e-06,-8e-06,-4e-06,2e-06,1.2e-05,-1e-06,0,-1e-06,1e-06,1e-06,-9e-06,1e-06,1e-06,9e-06,-1e-06,3e-06,2e-06,0,0,4e-06,1e-06,8e-06,1e-06,1e-06,8e-06,-1e-06,1e-06,-2e-06,1e-06,0,0,0,0,6e-06,0,7e-06,3e-06,-2e-06,-1e-06,-1e-06,1e-06,0,1e-06,0,0,-1e-06,0,1e-06,-2e-06,0,0,2e-06,1e-06,2e-06,0,-2e-06,-1e-06,1e-06,0,0,1e-06,3e-06,0
-5e-06,3e-06,-4e-06,0,3e-06,-6e-06,2e-06,4e-06,-3e-06,-9e-06,9e-06,0,0,0,5e-06,-5e-06,0,-6e-06,0,0,0,0,2e-06,-1e-06,-1e-06,0,-9e-06,6e-06,0,0,-3e-06,2e-06,0,-2e-06,-5e-06,1e-06,1e-06,1e-06,-5e-06,-5e-06,0,4e-06,7e-06,5e-06,0,1e-06,-1e-06,-1e-06,7e-06,2e-06,-1e-06,1e-05,0,1e-06,4e-06,0,-6e-06,0,2e-06,2e-06,9e-06,-1e-06,-1.1e-05,1e-06,0,0,2e-06,0,-3e-06,-3e-06,-2e-06,1e-06,1e-06,-4e-06,-1e-06,-2e-06,-1e-06,-3e-06,-2e-06,1e-06,0,0,-5e-06,2e-06,0,-2e-06,1e-06,1e-06,3e-06,-1e-06,0,-3e-06,0,-5e-06,4e-06,0,0,-1e-06,-1e-06,1e-06,-1e-06,0,3e-06,0,0,-1e-06,0,0,0,-2e-06,0,-2e-06,1e-06,-1e-06,0,-2e-06,1e-06,0,0,-1e-06,0
2e-06,-8e-06,6e-06,0,-5e-06,5e-06,-1e-06,-8e-06,3e-06,8e-06,-1.2e-05,1.7e-05,-2e-06,-4e-06,-3e-06,1.3e-05,0,-2e-06,1e-06,4e-06,-7e-06,-1e-06,-1e-06,1e-06,0,3e-06,9e-06,-4e-06,0,-3e-06,1e-06,4e-06,0,4e-06,-3e-06,9e-06,0,0,8e-06,2e-06,0,0,-7e-06,-1e-06,-1e-06,3e-06,0,-7e-06,-3e-06,-8e-06,0,3e-06,1e-06,1e-06,0,0,1e-05,-1e-06,-5e-06,2e-06,-9e-06,0,-6e-06,0,0,2e-06,0,0,6e-06,4e-06,1e-06,-9e-06,-1e-06,-1e-05,3e-06,-1e-06,0,-4e-06,0,-7e-06,0,-1e-06,8e-06,-1e-06,0,2e-06,0,0,2e-06,0,1e-06,-2e-06,-1e-06,4e-06,-6e-06,0,1e-06,-1e-06,1e-06,-1e-06,1e-06,-2e-06,1e-06,1e-06,0,2e-06,0,-1e-06,0,0,1e-06,1e-06,1e-06,2e-06,0,0,0,2e-06,-1e-06,-1e-06,0
1e-06,8e-06,-3e-06,0,5e-06,6e-06,1e-06,6e-06,4e-06,-4e-06,8e-06,-2e-06,-2e-06,2e-06,0,-1.6e-05,0,5e-06,-1e-06,2e-06,5e-06,0,-1e-06,-2e-06,-1e-06,0,-5e-06,-1e-06,0,2e-06,1e-06,-2e-06,1e-06,-3e-06,4e-06,5e-06,2e-06,1e-06,-1.1e-05,-2e-06,0,-4e-06,-8e-06,-6e-06,-1e-06,-7e-06,-3e-06,-2e-06,-1e-06,7e-06,0,5e-06,-1e-06,0,-1e-06,-1e-06,-6e-06,1e-06,2e-06,-8e-06,5e-06,2e-06,1.2e-05,1e-06,0,-2e-06,-1e-06,0,6e-06,-3e-06,-1e-06,0,0,2.3e-05,-3e-06,0,0,0,1e-06,4e-06,0,0,-1e-05,-2e-06,0,0,0,0,0,1e-06,1e-06,7e-06,1e-06,0,0,0,-1e-06,-1e-06,-1e-06,0,0,3e-06,-1e-06,-2e-06,0,1e-06,-1e-06,0,0,1e-06,-1e-06,0,-1e-06,-1e-06,0,7e-06,0,-2e-06,0,-2e-06,0
-2e-06,-6e-06,-2e-06,0,-1e-06,-2e-06,1e-06,-1e-06,-2e-06,0,-7e-06,-7e-06,-2e-06,3e-06,2e-06,1.1e-05,0,0,0,-2e-06,6e-06,-2e-06,1e-06,1e-06,2e-06,-6e-06,1e-06,3e-06,0,0,-2e-06,-3e-06,-2e-06,0,5e-06,-8e-06,1e-06,-2e-06,1.3e-05,-2e-06,0,0,3e-06,8e-06,-1e-06,9e-06,0,3e-06,3e-06,-1e-06,0,-6e-06,1e-06,0,-2e-06,0,1e-06,0,-2e-06,8e-06,-1e-06,-1e-06,-1e-06,-1e-06,0,1e-06,-1e-06,1e-06,-4e-06,0,0,7e-06,1e-06,-6e-06,0,2e-06,-1e-06,2e-06,-1e-06,5e-06,0,0,7e-06,2e-06,-1e-06,-1e-06,0,-1e-06,-4e-06,0,-1e-06,-6e-06,0,-1e-06,6e-06,0,-1e-06,-1e-06,0,1e-06,0,-2e-06,-3e-06,2e-06,0,-3e-06,-1e-06,1e-06,0,-2e-06,0,1e-06,-1e-06,-2e-06,0,-5e-06,0,0,1e-06,2e-06,0
0,1e-06,1e-06,0,-2e-06,-6e-06,-3e-06,2e-06,-5e-06,4e-06,8e-06,-7e-06,0,-4e-06,-4e-06,1e-06,0,-3e-06,0,-3e-06,-7e-06,1e-06,3e-06,-1e-06,-4e-06,2e-06,4e-06,-5e-06,0,-2e-06,1e-06,2e-06,-1e-06,-1e-06,-5e-06,-9e-06,-1e-06,1e-06,-1.5e-05,2e-06,0,3e-06,9e-06,-3e-06,0,-6e-06,1e-06,6e-06,-5e-06,-3e-06,0,-6e-06,-1e-06,0,4e-06,0,-1e-06,1e-06,1e-06,3e-06,-3e-06,0,-8e-06,0,0,0,0,-1e-06,-7e-06,2e-06,-1e-06,0,-1e-06,3e-06,1e-06,2e-06,1e-06,4e-06,2e-06,-8e-06,0,0,-5e-06,0,0,2e-06,0,0,-1e-06,0,-1e-06,2e-06,-1e-06,2e-06,-5e-06,1e-06,0,-1e-06,0,0,0,1e-06,-1e-06,-2e-06,0,0,-1e-06,0,0,1e-06,1e-06,-1e-06,0,2e-06,0,-3e-06,0,0,-1e-06,0,0
2e-06,6e-06,-2e-06,0,3e-06,0,9e-06,-5e-06,0,-6e-06,-9e-06,0,1e-06,-2e-06,5e-06,-1.2e-05,0,2e-06,0,1e-06,-3e-06,-1e-06,-6e-06,2e-06,5e-06,3e-06,-7e-06,0,0,0,1e-06,1e-06,1e-06,6e-06,2e-06,2e-06,-1e-06,-1e-06,1.5e-05,1e-06,0,0,-1e-06,-5e-06,0,3e-06,1e-06,-1e-06,7e-06,4e-06,2e-06,3e-06,1e-06,-1e-06,0,0,-2e-06,0,2e-06,-1.2e-05,6e-06,1e-06,1e-06,0,0,-1e-06,1e-06,1e-06,1e-06,-4e-06,0,-2e-06,0,5e-06,-1e-06,-1e-06,0,-1e-06,0,-2e-06,1e-06,0,8e-06,-1e-06,1e-06,-1e-06,0,0,1e-06,0,0,4e-06,0,-5e-06,-3e-06,0,0,-1e-06,-1e-06,0,0,-1e-06,1e-06,2e-06,0,1e-06,-1e-06,0,0,1e-06,-1e-06,1e-06,1e-06,0,0,4e-06,0,-1e-06,2e-06,0,0
