-0.013124,-0.010679,-0.01046,-0.011168,-0.009839,-0.010856,-0.012711,-0.011006,-0.009769,-0.010044,-0.010837,-0.010022,-0.008926,-0.012307,-0.009467,-0.007356,-0.009731,-0.008936,-0.011046,-0.008794,-0.013169,-0.015452,-0.013797,-0.009972,-0.009172,-0.009068,-0.007172,-0.007769
-0.009957,-0.006242,-0.009702,-0.010696,-0.009585,-0.008405,-0.009733,-0.007553,-0.004781,-0.004573,-0.00503,-0.004927,-0.00368,-0.002406,-0.004137,-0.00257,-0.001685,-0.001816,-0.002936,-0.003308,-0.007003,-0.002689,-0.008705,-0.006222,-0.000201,-0.001327,-0.002112,-0.004336
-0.000557,-0.002872,-0.004507,-0.00243,-0.001619,-0.002013,-0.000744,0.000339,-0.000278,-0.001202,-0.002573,-0.001629,0.000709,0.003318,-4.3e-05,-0.000972,-0.002629,-0.001726,-5.1e-05,0.00064,0.001019,0.001366,-0.000213,-0.001202,-0.000675,0.00029,0.000335,0.000108
0.006989,0.002129,0.003478,0.004528,0.005113,0.005295,0.008357,0.006701,0.003063,0.002538,0.001407,0.001489,0.001836,0.002659,0.002512,0.000381,-0.001888,-0.00101,0.000711,0.001505,0.004505,0.001714,0.006637,0.003643,-0.001285,-0.000216,0.000788,0.002631
0.007782,0.00934,0.009928,0.005089,0.004711,0.008219,0.009522,0.006672,0.005936,0.007631,0.009374,0.006835,0.003415,0.003689,0.005755,0.004399,0.007899,0.00712,0.006547,0.003101,0.004336,0.008461,0.009921,0.007016,0.006465,0.005156,0.003804,0.004187
-0.00444,-0.000162,0.000508,-0.002919,-0.003061,-0.002897,-0.00544,-0.005151,-0.002827,-0.00165,0.000347,-0.000308,-0.001906,-0.004301,-0.002154,-0.001363,0.000299,0.000635,-0.000674,-0.001995,-0.004954,-0.003624,-0.00306,-0.001955,-0.000678,-0.00104,-0.001068,-0.001763
-0.008876,-0.008984,-0.008582,-0.004232,-0.003993,-0.008641,-0.011928,-0.009154,-0.007564,-0.008013,-0.008757,-0.006154,-0.004139,-0.006755,-0.007095,-0.00484,-0.008169,-0.007665,-0.007302,-0.003473,-0.005482,-0.012259,-0.012493,-0.00781,-0.00798,-0.007485,-0.005421,-0.005457
0.003543,0.000886,-0.001112,0.00432,0.003444,0.001251,0.001225,0.002373,0.002859,0.002316,0.000763,0.002388,0.004019,0.006487,0.003107,0.003806,0.003541,0.002029,0.002958,0.00406,0.006976,0.005393,-0.00041,0.001753,0.003801,0.00308,0.001931,0.001671
0.007213,0.004815,0.004463,0.004684,0.00398,0.005777,0.008366,0.00677,0.005778,0.004795,0.003981,0.003516,0.003777,0.006036,0.005453,0.004098,0.005262,0.005114,0.003727,0.001999,0.00508,0.008618,0.00779,0.006049,0.005962,0.006215,0.004376,0.0044
-0.000673,-0.000865,0.001911,-0.001734,-0.001183,0.00171,0.003806,0.001349,-0.001046,-0.001695,-0.001477,-0.003315,-0.004619,-0.007097,-0.002507,-0.003171,-0.004094,-0.003276,-0.005068,-0.004761,-0.005599,-0.004897,0.002932,0.000345,-0.003834,-0.003049,-0.001907,-0.000536
-0.002543,0.001441,0.002042,-0.002181,-0.002191,-0.000205,-0.000845,-0.00098,-0.000728,0.000327,0.002441,-0.000106,-0.002585,-0.003266,-0.001719,-0.001645,0.000212,-0.000839,0.000705,0.00024,-0.002661,-0.00028,0.001448,-0.001063,-0.00076,-0.001732,-0.001389,-0.001123
-0.002364,0.000497,-0.001331,-0.001603,-0.00172,-0.003104,-0.005714,-0.002602,-0.000106,-0.000128,0.001482,0.002205,0.003249,0.0056,0.000641,0.000486,0.002315,0.002529,0.004938,0.003607,0.001697,0.003498,-0.001993,-0.002297,0.00176,0.001936,0.001441,-0.000521
-0.003078,-0.00586,-0.00691,-0.003314,-0.001689,-0.00425,-0.004883,-0.002945,-0.003411,-0.004662,-0.006466,-0.002924,0.00055,0.000689,-0.002296,-0.001577,-0.004629,-0.003021,-0.003303,-0.001841,-0.001432,-0.006247,-0.00858,-0.004864,-0.004228,-0.002771,-0.001356,-0.002696
0.001983,-0.000489,-0.001259,-0.000845,0.00042,0.001681,0.003853,0.001815,-1.1e-05,0.001161,-0.001163,-0.000822,-0.00159,-0.002448,0.000975,0.001581,0.00038,-0.000244,-0.001513,-0.001353,0.000257,-0.001224,-0.001252,0.000959,0.000243,-0.000624,-0.000782,0.000313
0.004103,0.004974,0.0057,0.003166,0.001942,0.004235,0.005282,0.002533,0.003255,0.004726,0.00514,0.003017,0.000184,-0.000355,0.0037,0.002842,0.00499,0.004595,0.004064,0.001718,0.002642,0.007238,0.008717,0.00557,0.004713,0.003967,0.001934,0.004042
-2.6e-05,-6.4e-05,0.002839,0.004584,0.002258,0.000286,-0.000719,-0.001249,-0.000369,-0.001125,0.000306,0.000197,0.000329,-0.001202,-0.00149,-0.001763,-0.002308,-0.00157,-0.001591,-0.000355,0.000464,-0.000639,0.00359,0.000886,-0.002196,-0.001195,-0.00043,0.000796
-0.000281,-0.000581,-9.9e-05,0.003769,0.002314,-0.001226,-0.002223,-0.000699,-0.000889,-0.001071,-0.000429,0.000302,0.001614,0.002174,-0.001642,-0.001022,-0.001371,-0.002867,-0.00223,0.000328,0.001144,-0.002835,-0.003114,-0.001256,-0.001464,-0.002134,-0.000957,-0.002065
-0.000294,0.001081,-0.001585,-0.001745,-0.000813,-0.001275,-0.001642,0.000526,0.000555,0.000501,0.000259,0.000189,0.0017,0.004527,0.001555,0.001119,0.002814,0.00218,0.001818,0.000879,-0.000347,0.001082,-0.003744,-0.000553,0.003494,0.002679,0.001423,-0.001748
-0.003373,-0.003111,-0.00459,-0.007188,-0.004219,-0.001977,-0.000999,-0.000465,-0.001415,-0.002701,-0.003951,-0.004231,-0.003594,-0.003729,-0.001382,-0.001626,-0.003039,-0.000727,-0.002152,-0.002557,-0.004476,-0.003531,-0.003798,-0.002281,-0.001338,6.2e-05,-0.000166,-0.001517
