0.009794,0.087538,0.273386,0.51876,0.537852,0.307162,0.125349,0.115064,0.416887,0.670351,0.651754,0.624787,0.624695,0.706653,0.811602,0.824341,0.6425,0.425541,0.321981,0.248107,0.285952,0.269255,0.172579,0.134562,0.10963,0.099604,0.10194,0.08847
0.011837,0.108305,0.340605,0.622268,0.6213,0.352087,0.147519,0.135723,0.49333,0.77925,0.735342,0.727118,0.745928,0.821919,0.930913,0.948866,0.759016,0.515671,0.384122,0.29136,0.328564,0.306662,0.196306,0.151977,0.125559,0.115953,0.11755,0.102646
0.014919,0.143178,0.452607,0.772297,0.718195,0.40045,0.177755,0.166309,0.611304,0.946078,0.864686,0.909861,0.96342,1.010409,1.115812,1.13861,0.953704,0.674563,0.48755,0.35768,0.382999,0.352034,0.229631,0.177505,0.148877,0.139361,0.138681,0.123542
0.016534,0.164592,0.526141,0.836671,0.710364,0.383348,0.182362,0.183382,0.689143,1.072216,0.991855,1.107073,1.204688,1.218093,1.277636,1.282434,1.120559,0.810624,0.562755,0.393676,0.387919,0.352544,0.246707,0.192268,0.160111,0.148527,0.14467,0.13365
0.01708,0.165558,0.5421,0.838251,0.671993,0.340991,0.161421,0.191979,0.747808,1.221605,1.206628,1.375896,1.520214,1.521201,1.50084,1.423933,1.226081,0.88463,0.601899,0.398873,0.375869,0.343714,0.250047,0.197169,0.163183,0.144202,0.139024,0.134603
0.019108,0.184499,0.58794,0.875458,0.689623,0.325147,0.132602,0.225067,0.908705,1.537445,1.617459,1.855175,2.026903,1.974138,1.842262,1.639606,1.314262,0.888084,0.591815,0.385539,0.388016,0.356945,0.23423,0.183018,0.156485,0.134482,0.129995,0.126918
0.024197,0.25709,0.772236,1.09906,0.873338,0.399919,0.13496,0.319934,1.363737,2.289267,2.471638,2.918766,3.083571,2.754802,2.478158,2.246452,1.738694,1.049943,0.657377,0.443831,0.454781,0.395186,0.227853,0.190293,0.173632,0.154823,0.148137,0.131036
0.031523,0.354049,1.038783,1.508356,1.267562,0.599137,0.185728,0.516857,2.340781,3.934889,4.255512,5.024615,5.151877,4.280246,3.759887,3.569541,2.869353,1.733946,1.041076,0.685931,0.59816,0.471352,0.285396,0.282435,0.276252,0.252483,0.23482,0.191173
0.039781,0.449627,1.32718,2.042527,1.818234,0.871527,0.256078,0.810676,3.911379,6.815332,7.432987,8.359795,8.307334,6.866625,6.106834,5.889085,4.838233,2.970097,1.741847,1.130772,0.840334,0.601199,0.421339,0.462751,0.456049,0.42294,0.392288,0.309771
0.047564,0.521666,1.609589,2.628697,2.372435,1.107485,0.315779,1.160678,5.936413,10.803382,11.931849,12.518856,12.005105,10.222702,9.364054,9.071182,7.520947,4.631164,2.652932,1.758274,1.211655,0.806668,0.612391,0.699392,0.686524,0.638014,0.587823,0.459729
0.051469,0.555695,1.813128,3.038705,2.662468,1.179934,0.33307,1.448831,7.82927,14.80455,16.473821,16.011445,14.934222,13.487972,12.743092,12.226596,10.126569,6.249908,3.512016,2.411082,1.617237,1.021063,0.794712,0.928438,0.911298,0.832576,0.756173,0.593414
0.047989,0.527742,1.843481,3.111252,2.56238,1.041055,0.29888,1.503651,8.453407,16.491934,18.464327,16.657236,15.306364,15.203688,15.016048,14.066892,11.382282,7.049612,3.940787,2.756493,1.828499,1.108627,0.863077,1.02745,1.023932,0.919687,0.824591,0.654386
0.040973,0.48344,1.775358,2.954127,2.245246,0.801971,0.235623,1.278098,7.13768,14.086358,15.876119,13.684563,12.780546,14.303024,14.93291,13.432058,10.30607,6.5112,3.708026,2.50963,1.65708,0.993919,0.767869,0.911559,0.935089,0.832694,0.729543,0.586542
0.03643,0.412178,1.504576,2.443641,1.784595,0.613556,0.197422,0.88615,4.645054,8.934292,10.078845,8.723456,8.603482,10.76868,11.968552,10.383096,7.470148,4.857125,2.793898,1.772129,1.161595,0.705599,0.564352,0.645323,0.657062,0.575557,0.49714,0.418739
0.032271,0.295987,1.033773,1.686366,1.29324,0.510114,0.190973,0.579159,2.788793,4.894813,5.362464,4.8774,4.93684,6.375799,7.365234,6.32501,4.355848,2.877064,1.697838,1.015831,0.626265,0.394004,0.3382,0.358516,0.336356,0.287271,0.254792,0.230286
0.030257,0.21019,0.744025,1.451986,1.366247,0.608508,0.193508,0.386795,1.766144,2.94203,3.185848,3.162692,3.306985,3.799265,4.03007,3.519463,2.370396,1.485362,1.033958,0.655974,0.336196,0.212337,0.172839,0.166284,0.138786,0.118415,0.111671,0.103775
0.035771,0.258662,0.920015,1.939382,1.910584,0.796297,0.196636,0.322915,1.373388,2.208085,2.312372,2.461897,2.812887,2.943849,2.705644,2.399321,1.63191,1.001397,0.896833,0.630641,0.299873,0.185907,0.130383,0.111807,0.099457,0.096719,0.077763,0.058674
0.044449,0.371302,1.343476,2.734517,2.585666,1.015603,0.220465,0.374171,1.477663,2.21995,2.164816,2.414597,3.005417,3.206415,2.638583,2.337059,1.850086,1.16667,1.080096,0.771308,0.361863,0.231059,0.169741,0.141646,0.120253,0.119813,0.093849,0.065546
0.053418,0.492436,1.828152,3.486753,3.085385,1.169926,0.257285,0.445154,1.769621,2.641452,2.540911,2.885842,3.700476,4.288234,3.786249,3.328796,2.55114,1.515721,1.462176,1.044675,0.461646,0.302479,0.239795,0.198523,0.153897,0.15004,0.119107,0.084373
0.061854,0.592497,2.200054,3.869742,3.176973,1.175099,0.275031,0.498195,1.983686,3.014628,3.077282,3.654794,4.524889,5.479407,5.250243,4.674142,3.484635,2.035607,2.002971,1.358689,0.558019,0.389804,0.327038,0.269953,0.192771,0.177438,0.140494,0.102125
0.068442,0.650611,2.287697,3.618886,2.727311,0.997697,0.260604,0.503245,2.075828,3.356708,3.696008,4.523833,5.300624,6.267875,6.16754,5.524137,4.134042,2.490136,2.440683,1.559765,0.621181,0.465777,0.404919,0.337193,0.22748,0.194824,0.157896,0.119699
0.072842,0.60604,1.968373,2.816212,1.942727,0.693335,0.205402,0.48135,2.14835,3.700099,4.074409,4.92461,5.584452,6.18067,5.911052,5.213234,4.037823,2.62447,2.485207,1.519276,0.647047,0.505357,0.435988,0.363112,0.24728,0.203988,0.168661,0.136656
0.072987,0.451579,1.375156,1.875222,1.237282,0.425291,0.134337,0.432507,2.109421,3.812035,3.888788,4.315543,4.822797,5.132878,4.797387,4.157835,3.371567,2.334668,2.033044,1.190733,0.58325,0.461229,0.382014,0.3249,0.253028,0.217993,0.170767,0.144966
0.070661,0.290303,0.804203,1.064847,0.726337,0.27991,0.098974,0.403517,1.899856,3.51615,3.384715,3.144096,3.406381,3.810861,3.790312,3.493694,2.928193,1.95241,1.413547,0.772665,0.438562,0.354694,0.292019,0.25163,0.23212,0.212281,0.157174,0.14186
0.066807,0.192264,0.469886,0.635605,0.484968,0.216148,0.083203,0.385209,1.676396,3.015987,2.803566,2.263122,2.541042,3.02763,2.996378,2.873555,2.457339,1.545379,0.977331,0.573703,0.360404,0.267164,0.223562,0.189082,0.181395,0.177438,0.138325,0.131257
0.06038,0.134347,0.353922,0.57811,0.458207,0.174786,0.065128,0.355135,1.676486,2.856292,2.454974,2.009374,2.393271,2.542711,2.233563,2.479947,2.255538,1.237755,0.782892,0.553855,0.331465,0.213844,0.179182,0.155594,0.136172,0.135251,0.120302,0.111636
0.049044,0.091471,0.301923,0.571949,0.443363,0.148192,0.059731,0.368523,1.672536,2.680569,2.284902,1.918205,2.173084,2.246976,1.959302,2.346391,2.12963,1.061006,0.716933,0.573546,0.348392,0.202903,0.157157,0.145239,0.109325,0.096784,0.103166,0.095644
0.041274,0.069374,0.261814,0.519109,0.392272,0.124037,0.063454,0.393388,1.535732,2.360198,2.19463,1.900843,1.788735,1.898998,1.89631,2.097025,1.809205,0.935238,0.641902,0.537761,0.367639,0.222257,0.162905,0.152131,0.100599,0.074889,0.086991,0.080269
0.038348,0.074733,0.238484,0.414996,0.303003,0.102273,0.062713,0.405623,1.479382,2.100123,1.919973,1.716223,1.533836,1.681521,1.812094,1.767376,1.374144,0.749215,0.505844,0.415018,0.325205,0.233286,0.19103,0.173783,0.104648,0.071306,0.080769,0.074344
0.043568,0.090207,0.224933,0.307769,0.205715,0.08403,0.063558,0.42503,1.654806,2.283555,1.834121,1.538446,1.418975,1.529036,1.730213,1.681904,1.175484,0.629556,0.439179,0.311789,0.242047,0.215871,0.216453,0.187948,0.103553,0.071034,0.078934,0.07412
0.05562,0.10548,0.218552,0.27035,0.17694,0.072902,0.062401,0.421958,1.796176,2.471541,1.918042,1.594404,1.276122,1.158839,1.452686,1.574581,1.057088,0.588037,0.480949,0.292147,0.186612,0.205908,0.246376,0.193001,0.098507,0.070914,0.079351,0.078304
0.064558,0.108123,0.222507,0.301424,0.192627,0.061043,0.058244,0.373713,1.653259,2.311031,1.828634,1.661406,1.29671,0.874172,1.038927,1.289213,0.855112,0.503436,0.532978,0.33019,0.174984,0.199791,0.257073,0.190328,0.099487,0.07671,0.080198,0.082341
0.059868,0.092729,0.238512,0.359792,0.218926,0.056284,0.049358,0.340691,1.358005,1.876539,1.536753,1.593727,1.413559,0.870291,0.837706,1.179767,0.811605,0.417898,0.514019,0.358102,0.189567,0.178714,0.238031,0.194094,0.107337,0.078088,0.075842,0.079694
0.041979,0.070359,0.255492,0.408723,0.242515,0.062289,0.042436,0.382471,1.167146,1.48822,1.257123,1.341884,1.329267,0.896996,0.793413,1.185455,0.865157,0.36196,0.417797,0.31902,0.190056,0.146137,0.196757,0.197673,0.122202,0.081512,0.068997,0.067572
0.025156,0.059129,0.266936,0.458643,0.288804,0.077425,0.040916,0.423942,1.13209,1.408578,1.212854,1.102978,1.086598,0.901397,0.797737,1.126312,0.86074,0.308039,0.302013,0.237222,0.161818,0.122689,0.159525,0.189192,0.131555,0.077568,0.056731,0.057613
0.019035,0.051725,0.270634,0.538291,0.368488,0.089394,0.047269,0.438952,1.191726,1.468614,1.139041,0.925716,0.918379,0.84083,0.703012,0.918383,0.776105,0.252629,0.228902,0.186768,0.115216,0.109706,0.158212,0.193523,0.137314,0.069027,0.048112,0.05466
0.017064,0.048188,0.302023,0.641386,0.438723,0.087722,0.049055,0.432994,1.125532,1.342683,1.049311,0.838271,0.826467,0.793188,0.580569,0.694253,0.652108,0.209728,0.173264,0.159323,0.090708,0.103187,0.181709,0.221923,0.139356,0.065115,0.055587,0.057394
0.017599,0.047275,0.314841,0.699869,0.475835,0.083543,0.048836,0.451923,1.153683,1.227243,0.911849,0.813501,0.885026,0.886715,0.601029,0.647806,0.564258,0.195073,0.140592,0.13508,0.090169,0.099169,0.188987,0.235119,0.127571,0.06452,0.069096,0.064548
0.020223,0.047459,0.28966,0.684578,0.48651,0.099163,0.052555,0.483716,1.440765,1.484613,0.856413,0.761323,0.952526,1.030098,0.753448,0.762786,0.593921,0.203626,0.120707,0.118969,0.102327,0.105169,0.179358,0.224081,0.116092,0.0712,0.077684,0.064109
0.021768,0.047255,0.264991,0.625201,0.456732,0.11774,0.054454,0.516585,1.739279,1.890435,0.93692,0.724939,0.988061,1.124192,0.912224,0.941112,0.679342,0.230554,0.126058,0.127069,0.132424,0.138793,0.191499,0.20215,0.100368,0.077002,0.075497,0.051734
