-0.000347,-0.000255,-0.000139,-0.000156,-0.000461,-0.000258,2e-06,-5.4e-05,-4.6e-05,-4.8e-05,1.6e-05,-0.002343,-0.00147,-0.000164,0.000295,2.4e-05,-0.000341,0.000172,0.000362,0.000373,8.3e-05,0.00043,-7.5e-05,-0.000157,-0.000248,0.000363,-0.000615,-0.000612,0.000203,-0.000334,-0.000606,0.00016,0.000232,-0.00318,-0.000655,0.000871,0.000871,0.001492,0.003402,0.002783,0.002463,0.002392,0.002097,0.000757,0.005109,0.00889,0.008825,0.007976,0.004746,0.003934,0.001269,0.000293,0.004767,0.003792,0.004548,0.003559,0.002707,0.002817,0.010537,0.0079,0.004641,-0.000865,-0.005164,-0.001792,-0.00041,-0.000641,0.00018,0.000721,8.2e-05,0.001602,0.001889,0.000335,0.001688,0.001121,4.6e-05,0.002961,0.00312,0.000869,0.000893,0.000303,0.001532,0.001148,0.003266,0.002281,0.00186,0.000954,0.001017,0.001282,0.001209,0.001712,0.001293,0.000669,0.000266,-0.000522,-4.5e-05,-0.002282,-0.00128,-0.001541,-0.001705,0.000173,-0.000455,-7.2e-05,-3.2e-05,-0.000358,0.00074,-0.000378,-0.023721,-0.014067,-0.005743,0.003925,0.004265,0.002364,0.001072,-0.000114,0.005181,0.003585,0.004153,0.002289,0.000935,-0.00048,-0.000565
-0.000242,0.000198,0.000361,0.000316,0.000282,0.000453,8.2e-05,-0.000133,4.7e-05,3e-05,8.1e-05,0.001532,0.000264,0.000322,0.000184,-5.6e-05,0.000258,0.000346,0.000442,0.000213,0.000364,0.000164,0.000852,0.001043,0.000776,0.000911,0.000691,0.001121,0.000225,0.000555,0.000101,0.000814,0.000697,-0.000182,-0.001188,-7.3e-05,0.000621,0.000373,-9.2e-05,0.00084,0.000245,0.000745,-0.000853,-0.001941,0.000989,-0.001367,-0.001844,-0.000428,0.001106,0.000287,0.001065,0.000177,0.002619,0.002455,-0.000608,-0.000716,0.000905,-0.000585,0.002824,0.003504,0.003363,0.00032,0.003275,0.001533,0.001407,0.000818,0.000925,0.001576,0.000237,0.00093,0.001726,0.001396,0.001314,0.001098,0.000606,0.000226,0.001545,0.000782,0.00079,0.001092,0.001225,0.000625,0.001753,0.001682,0.001511,0.000952,0.000567,0.000616,0.000259,0.001093,0.000882,0.000704,0.000373,0.000203,0.000313,0.000416,0.000475,0.000418,0.002212,0.001332,0.000786,0.000919,0.000263,-6.2e-05,3.1e-05,-0.000779,0.010673,0.008551,0.004174,-0.003344,-0.003348,-0.002546,-0.000741,0.000682,0.001605,-0.000904,0.001129,0.001179,9.6e-05,0.001114,0.001593
-0.000412,-0.000182,-9.8e-05,8.1e-05,6.7e-05,-2.9e-05,-0.00011,-9e-06,-0.000126,-0.000144,0.000158,-0.002368,-0.001847,-0.000722,-9.5e-05,-0.00031,-0.000309,7.9e-05,0.000233,-7.9e-05,-0.000234,-9.3e-05,-9.4e-05,-5.1e-05,-2.8e-05,-7e-05,-0.000277,-0.000398,-0.000188,-0.00016,7.6e-05,-9.6e-05,-0.000256,-3e-05,-0.000873,-0.001817,-0.001364,-0.000282,-0.001166,-0.001109,-0.000861,-0.00165,-0.000462,-0.001272,-0.001749,-0.000915,-0.00354,-0.000818,0.001881,0.000514,-0.00069,-0.001622,0.000609,0.000223,-0.000612,-0.00181,-0.000566,-0.000323,-0.002032,-0.000692,0.001256,0.000433,-0.002102,-0.001837,-0.003219,-0.001573,-0.000939,-0.001419,-0.000965,-1.7e-05,0.000125,-0.000365,-2.4e-05,-0.000294,-0.000279,-0.001668,-0.000737,-0.000265,0.000536,0.00051,0.000652,0.00056,0.000215,0.000258,0.000824,0.000634,0.000282,0.000247,-6.7e-05,0.00051,6.8e-05,0.000348,6.1e-05,0.000159,4.1e-05,-0.000203,0.000411,0.000199,-0.000777,-0.000487,-0.000251,-0.000349,-0.00064,-0.000929,-0.000405,-1.4e-05,-0.000278,-0.008609,-0.004266,-0.005414,-0.001308,-0.001295,-0.000553,-0.000134,0.000458,-0.001092,-0.000784,4.5e-05,-0.000581,0.000798,-0.000383
2e-06,8.2e-05,-8.3e-05,0.000226,-1.6e-05,5.1e-05,-4.4e-05,5.7e-05,-2.3e-05,-6e-06,0.000202,3.6e-05,0.001272,0.000698,-1.1e-05,-0.000116,-0.000309,2.3e-05,-0.000154,-1e-05,-0.000209,-0.000181,-0.000275,0.000304,-3.1e-05,3.9e-05,0.000372,-0.00025,2e-04,0.000547,0.000152,-4.2e-05,-0.000129,2e-06,0.000316,0.000275,-0.000133,0.000622,-0.000119,-0.000444,-0.002367,-0.002294,-0.00013,0.001437,-0.001886,0.000868,-0.0013,-0.000784,0.001017,0.001522,0.000677,5.3e-05,-0.000232,-0.00066,0.000882,6.6e-05,0.000677,-0.000722,-0.003788,-0.002306,-0.000422,0.000176,0.001593,0.000117,-0.000643,0.000602,-0.001039,-0.001382,-4e-04,5e-06,-0.000395,0.000485,0.000209,9e-06,4.8e-05,-0.000984,-0.00134,-0.000543,0.000192,7.9e-05,-2.1e-05,0.000288,0.000228,-0.00036,4e-04,0.000213,0.000182,0.000167,3e-06,0.00042,-0.000186,7.7e-05,0.000114,-1.4e-05,-0.000207,5.3e-05,-7.5e-05,0.000138,0.000816,4e-06,-0.000146,9.6e-05,-3e-05,0.00018,0.000259,0.001174,-0.000373,0.00333,0.00258,0.002545,-0.001074,0.000262,-1.5e-05,0.000172,-0.001055,-0.000833,1.5e-05,-0.000791,-0.000386,-0.000306,-0.000162
0.000216,9.9e-05,5.5e-05,-9.8e-05,0.000179,0.00012,0.000137,8.1e-05,-4e-05,-7.9e-05,0.000218,-4.1e-05,1.9e-05,0.000124,-0.000157,-0.000225,9.5e-05,5.5e-05,-0.000252,0.000127,-1.3e-05,0.000137,-0.000229,-6e-06,8.9e-05,0.000252,-0.000229,-9.1e-05,5.4e-05,9.4e-05,8.6e-05,3e-05,8.3e-05,0.000191,-0.000589,0.001917,7.4e-05,8.9e-05,-0.000731,-0.000915,-0.00067,0.000121,0.000102,0.000282,-0.001423,0.00146,0.001511,0.000149,-0.000125,0.000634,0.000443,0.002053,0.000525,-0.001386,0.000795,0.000457,0.000679,-2.8e-05,-0.001892,-0.003298,-0.001627,-2.5e-05,-0.000664,-0.000398,0.000432,-0.000993,-1.5e-05,-0.00118,-0.00065,-0.000833,-0.000746,0.00011,-4.3e-05,-0.000468,-0.000111,-0.001013,-0.001239,-0.000635,8.2e-05,0.000124,5.4e-05,0.000802,-0.000185,-0.000753,0.00033,0.000305,0.000136,0.000182,-0.000176,0.000176,-0.000113,-3.9e-05,3e-05,0,5.6e-05,0.000446,0.000609,-0.000353,-0.000302,0.000216,0.000215,-6.5e-05,-0.000201,0.000178,9.5e-05,1.2e-05,-0.001515,-0.004173,-0.002325,-0.000147,-0.00257,0.000143,0.000201,0.000199,-0.000329,0.00071,0.000703,-0.000513,-0.000527,0.000157,0.000249
-0.000145,-0.000167,-0.000275,-2.5e-05,9.6e-05,-0.000125,-2.3e-05,-0.000104,-7.2e-05,0.000125,-4e-06,-5.4e-05,0.000338,-0.000105,-0.000277,-0.000182,-0.000155,0.000165,-7.8e-05,-0.000221,-8.9e-05,-7.9e-05,-0.000188,-0.000434,-0.000228,-7.6e-05,-0.000157,-9.1e-05,-0.000268,-0.000106,0.000204,5.4e-05,0.000115,0.000443,-0.000218,0.000755,-0.000576,-0.000133,0.000124,-0.00148,-0.000659,-0.000451,0.000417,7.5e-05,0.000281,-0.001254,0.004273,-0.00108,-0.000497,-0.000899,0.00102,0.000264,0.000139,-0.001566,0.000536,5.6e-05,7.1e-05,-0.000243,2.5e-05,-0.002761,-0.001493,-0.000596,-0.000412,8.4e-05,0.000587,0.001256,-0.000372,-0.000761,-0.000319,0.000587,-0.000484,0.000147,7e-05,-0.000583,-0.000766,-0.000444,-0.000287,-0.000262,7.1e-05,-5.7e-05,-0.000294,0.00027,-8.8e-05,-0.00075,-0.000106,0.000199,-0.000214,0.000127,-0.000293,-0.000142,-0.000273,-0.000223,-0.000116,-0.000157,-0.000103,-0.00017,-0.000267,0.000292,0.000316,-0.000448,-6.3e-05,1.9e-05,-0.000354,-0.000233,0.000235,-0.000914,0.000533,-0.002235,-0.001887,-0.000558,-0.000405,-0.000131,0.000381,0.000947,-0.000413,-0.000756,0.000507,-0.001132,-0.000866,-0.00056,-0.000763
-0.000223,2.8e-05,-3.1e-05,-0.00011,9e-06,-0.000185,-7.1e-05,-7e-06,-4e-06,-7e-06,-2e-06,-3.6e-05,-0.000749,-0.000412,-0.000148,-0.000117,-1.4e-05,8e-06,-0.000141,-0.000179,-0.000122,-0.00012,-0.000105,-0.000106,0.000108,-1.4e-05,-0.000104,8.4e-05,-0.000178,-0.000209,-0.000451,-8.1e-05,-0.000323,0.000152,9.5e-05,-0.000435,1.2e-05,-0.000291,0.000217,-0.000659,0.000321,0.000836,-0.000555,-0.001132,0.000553,-0.000986,0.000752,-0.000711,-0.001402,-0.001368,7.6e-05,0.000601,-0.000208,-0.001279,0.000381,-0.000264,-0.000993,-0.000325,0.000148,-0.001452,-0.001353,-0.000684,0.000633,0.000174,-0.000342,0.000385,0.000123,-9.3e-05,-0.000631,-0.000293,-0.000525,-0.000334,-0.000158,-0.000731,-0.000498,-1.4e-05,2.4e-05,-1.1e-05,0.000202,-8e-06,-0.000124,7.8e-05,-0.000223,-0.000447,-0.00022,-1e-05,-0.000247,0.000315,-0.000499,-0.000257,-0.000366,-0.000239,-7e-05,-7.5e-05,7.4e-05,-0.000141,0.000207,0.000117,-0.000632,-0.000288,-0.000355,-0.000192,0.000101,-0.000127,-0.000383,-0.000551,-0.000793,0.001354,2.7e-05,0.000411,0.001884,-0.000319,-0.000339,0.000153,-0.000106,-1.1e-05,-0.000782,-0.000439,-0.00077,-4.9e-05,-0.000265
5.9e-05,0.000143,-3.3e-05,-0.000105,-2e-05,1e-05,-4.8e-05,3e-05,5e-05,-5.9e-05,-8.6e-05,0.000107,-0.000111,-8.8e-05,-0.000103,6.9e-05,2.9e-05,-8.4e-05,-0.000158,-5e-05,-0.00015,-0.000177,1e-06,-0.000267,-0.00024,-0.000162,1.4e-05,-0.000128,-0.000169,-3.3e-05,3.5e-05,5.3e-05,-3e-05,0.000111,-0.000147,-6.9e-05,1e-06,6.9e-05,-0.000194,-9.4e-05,0.000144,0.000765,-9e-06,0.000293,-0.00023,-0.001586,-0.000107,-0.000389,-0.001372,-0.000946,-0.000718,-0.000137,-0.000346,-0.000931,8.5e-05,-3e-04,-0.000955,0.000658,-0.000457,0.000205,-0.000784,-0.000432,-0.000464,2.7e-05,-4.1e-05,-0.000621,0.000379,0.000403,0.000446,-0.000221,-4.4e-05,6.8e-05,-0.00026,-0.000463,-0.000271,-0.000246,4.7e-05,-8.6e-05,6.6e-05,8.4e-05,-0.000302,-0.000186,-0.000538,6.2e-05,-0.00036,2e-05,-0.000248,0.000429,-7.5e-05,-0.00019,-0.000412,-0.000155,-0.000237,1e-05,4.7e-05,-0.000189,-0.000263,-7.5e-05,-9.4e-05,-0.000292,-0.000184,-3e-04,8.6e-05,-1e-04,-6.6e-05,-0.000139,-0.000456,0.001519,0.001189,0.001551,0.000562,0.000161,4.7e-05,-0.000399,-0.000306,0.000136,-0.000721,-0.000146,-0.000101,-0.000241,-0.000264
-7e-05,8.1e-05,3.1e-05,3.2e-05,9.3e-05,3e-06,7.6e-05,7e-06,-6.6e-05,-3.2e-05,-2e-05,0.000134,0.000106,0.000276,-9.9e-05,-3e-06,3.7e-05,-6.6e-05,6.4e-05,-0.000164,-0.000182,-0.000104,-8.2e-05,-7.2e-05,-0.000195,-0.000203,5.4e-05,0.000179,-3e-06,6.7e-05,-7.3e-05,-0.000102,-0.000442,-7.9e-05,0.000179,-0.000509,-0.000447,0.000218,-0.000638,0.000177,0.000262,0.000419,-0.000494,5e-04,-0.001138,-0.001382,0.000438,0.000549,0.000728,-0.000621,-0.000798,1.7e-05,-0.000499,-0.000434,1.4e-05,-0.000617,2.6e-05,0.000675,0.000254,0.000832,-0.000286,-0.000779,-0.000298,-5.3e-05,5.4e-05,-0.000522,-0.000576,-0.00021,-0.000123,-0.000489,-5.8e-05,-0.000265,-0.000276,0.00017,-6.8e-05,-0.000119,-2.9e-05,-0.000375,-0.000165,-2.1e-05,-0.000299,-0.000133,-0.000257,-0.000326,-0.000524,-0.00019,-0.000274,0.000159,-0.000132,-0.000153,-0.000592,-8.3e-05,-0.000214,-0.000108,0,-9e-05,-1e-06,0.000144,6.4e-05,-7.3e-05,0.000101,-9.5e-05,-0.000213,0.000221,-2.6e-05,0.000123,0.000407,-0.00135,6.4e-05,0.000227,-0.001067,-0.000769,-4.8e-05,-0.000133,-3.3e-05,-0.000462,-0.000895,-4e-04,5.5e-05,-0.000123,-0.000246
3.7e-05,-0.000194,-6.5e-05,-0.00015,-1.5e-05,-2.8e-05,4e-06,2.7e-05,-1e-06,-8.4e-05,-2.4e-05,1.3e-05,-7.2e-05,-0.00025,3.3e-05,7.6e-05,1.5e-05,-8.5e-05,-1.9e-05,-6.5e-05,-5.8e-05,-1.2e-05,-6.7e-05,-7.1e-05,3.3e-05,-5.2e-05,-3e-05,8.3e-05,5.1e-05,-0.00017,-3.1e-05,-4e-05,-0.00019,-1e-04,-9e-05,-0.000189,-0.000445,-0.000194,-0.000494,-6.4e-05,0.000435,-2.7e-05,1e-04,-0.000434,0.000341,-1.8e-05,0.001172,-0.000403,-0.000762,-0.001036,-9e-05,-0.000148,-0.000142,6.4e-05,-0.000367,-0.00058,0.000173,0.000646,-4.7e-05,0.000314,-7.8e-05,-0.00064,5.9e-05,3.6e-05,-0.000507,-0.000153,-9e-05,-0.000118,0.000149,-4e-06,2e-06,8.4e-05,3.9e-05,-0.000274,-7.7e-05,1.9e-05,4e-05,-0.000177,0.000304,-3.7e-05,-0.000133,-9.4e-05,1.8e-05,-8.6e-05,-0.000619,-0.000131,-0.000147,-0.000112,-7.3e-05,-1.8e-05,-0.000213,-8.3e-05,-0.000199,2e-06,5.5e-05,-6.8e-05,0.000101,-0.000166,-0.000286,-0.000299,-7.2e-05,-0.000167,-1.8e-05,0.00012,0.00021,0.000113,0.000112,0.000888,-0.001774,-0.000618,-0.000405,-0.000229,-0.000109,8.7e-05,0.000248,0.000223,-0.000297,-0.000514,0.000116,9.8e-05,-0.000105
2e-05,-0.000172,1e-06,3.1e-05,-2.3e-05,1e-06,2.3e-05,1.4e-05,2.2e-05,2e-06,4.7e-05,7.8e-05,0.000101,7e-06,5.3e-05,9.6e-05,3.3e-05,6e-06,1.2e-05,6.3e-05,1e-06,8.8e-05,3.6e-05,-3.1e-05,-6.4e-05,-0.00012,-0.000154,0.000163,0.000201,0.000135,-0.000137,-1e-06,1.6e-05,5.7e-05,-9.5e-05,-0.000299,-0.000426,-0.00033,-0.000295,-0.000129,0.000645,-0.000413,-8.8e-05,-0.000296,9.4e-05,0.00049,-0.000233,-0.000579,-0.000126,-0.000676,3.6e-05,0.000413,0.00033,2.5e-05,-0.000381,-0.000551,0.000105,0.00013,0.000159,-0.000611,-0.000147,-0.000588,3e-06,-0.000267,0.000322,-3e-06,-0.000693,7.2e-05,0.000223,0.000325,-0.000357,-3.8e-05,-0.000166,-6.3e-05,-1.2e-05,0.000209,5.6e-05,-0.000156,7.2e-05,-1.8e-05,-0.00016,-0.00016,-0.000211,-0.000137,-0.000338,-0.00011,-0.000155,-3e-05,-4.5e-05,-7.4e-05,-5.3e-05,-7.4e-05,-0.000133,-7.8e-05,0.00012,1.6e-05,-6e-06,-6.8e-05,6.6e-05,4.8e-05,-3.2e-05,0.000101,-0.000105,0.00011,-9.9e-05,9.8e-05,0.000187,-0.000458,0.00059,-0.00038,0.000256,0.000743,0.000445,-1.4e-05,-0.000493,-7.3e-05,4e-06,-0.000104,0.00037,0.000265,1.6e-05
2e-06,9.1e-05,6.4e-05,1.7e-05,-3e-05,-1e-04,-5.2e-05,-5.2e-05,3.6e-05,-5.5e-05,-1.8e-05,1e-05,8e-05,-8.2e-05,-4.2e-05,-4.2e-05,-1.3e-05,-2.6e-05,-4.6e-05,4.4e-05,2.6e-05,-3.9e-05,4e-06,0.000113,-2.7e-05,-1.4e-05,3.3e-05,5.3e-05,-5e-06,-7e-05,-0.000163,-7e-05,-2.8e-05,-7e-06,-7e-05,3.8e-05,1.1e-05,-0.000228,-0.000214,-0.000267,0.00014,-5.5e-05,0.000162,-0.000435,-3e-06,0.000249,-0.000679,-0.001118,0.000891,0.000119,-0.000404,-3e-05,-1e-05,-0.000743,-0.000409,-0.000243,-4.2e-05,0.000313,-0.000187,-0.000485,-0.000204,-0.000573,0.000152,1e-04,-0.000483,0.000148,-9.5e-05,6.9e-05,0.000106,0.000306,7.8e-05,-5.8e-05,-0.000256,-8e-05,0.000157,0.000205,4e-05,7.6e-05,2.3e-05,0.000113,-3.4e-05,-4.2e-05,-0.000218,-3.3e-05,-0.000144,-6.7e-05,-0.000127,-4.9e-05,-6.4e-05,-5.2e-05,0,-8.8e-05,-7.8e-05,-4.5e-05,8e-06,6.7e-05,-0.000164,3e-05,2.7e-05,-0.000169,1.7e-05,-3.6e-05,6.5e-05,0.000107,6e-06,-0.000298,8e-06,0.000144,0.000741,-0.000532,5.5e-05,0.000497,2.7e-05,-8e-05,-7e-05,-5.3e-05,-7e-06,-1.7e-05,0.00016,0.000221,0.000184
5e-06,-8.6e-05,-1.4e-05,-1.8e-05,-5.7e-05,-2.2e-05,5e-06,6.3e-05,-4.7e-05,2.4e-05,-7e-06,1.4e-05,6.4e-05,9.7e-05,-5.3e-05,3.8e-05,7e-06,1.6e-05,-7.2e-05,-2.3e-05,4.4e-05,-3.1e-05,3e-06,0.000102,4.4e-05,-8.5e-05,-2.1e-05,1.5e-05,-2.6e-05,2.1e-05,8.4e-05,4e-06,1.8e-05,-0.000167,-0.000146,-0.000235,8.7e-05,0.000105,-0.000125,-0.000229,-7.2e-05,-0.000145,9.5e-05,-0.00029,-0.000344,-0.000133,-0.000358,-0.000282,0.000264,-9.8e-05,8.1e-05,-2.9e-05,-0.000136,-0.000363,-0.000458,-0.00018,-0.000225,0.000348,-0.00019,4.9e-05,-0.000114,-0.000317,8.3e-05,6.6e-05,0.000413,-0.000137,-1.3e-05,-0.000249,1.9e-05,-2.9e-05,0.000126,7.6e-05,-0.000293,-0.000206,4.9e-05,5e-06,-1e-06,-1.6e-05,-0.000164,-4.3e-05,-4.8e-05,4e-06,-0.000222,3.6e-05,0.000155,-5e-06,-6.4e-05,-6.1e-05,-0.000133,-2e-06,-4.7e-05,8e-06,-4.2e-05,2.6e-05,3.4e-05,-1.5e-05,-3e-05,0.000174,-3.5e-05,9e-05,-8.1e-05,3.5e-05,4.1e-05,1.7e-05,-2.8e-05,0.000158,2.4e-05,0.000288,-0.000687,-0.000512,-0.000344,-0.000102,-0.000561,-1.2e-05,-0.000146,-6.5e-05,0.00028,7.7e-05,5e-06,5.5e-05,4.3e-05
-1e-06,6.3e-05,-9e-05,-7e-06,-2e-06,-1.3e-05,1.5e-05,-2.3e-05,-2.9e-05,1.1e-05,-2.2e-05,4.5e-05,-6.1e-05,8.6e-05,-1.2e-05,8e-06,-1.2e-05,3.5e-05,2.9e-05,4.5e-05,1.7e-05,-1e-06,2.8e-05,6e-06,5.2e-05,0,6.1e-05,4.9e-05,-5.7e-05,0,-5e-06,-5e-05,-4.1e-05,-6.9e-05,2.1e-05,0.000105,-5e-06,0.00014,-9.5e-05,4.7e-05,0.000248,-0.000163,-8.9e-05,0.00028,-0.000206,-0.000102,-0.000577,-7.7e-05,-0.000339,2.8e-05,0.000293,-0.000205,-0.000208,4.8e-05,-0.000394,1.9e-05,-0.000181,0.000473,-0.000227,0.000248,4.8e-05,7.8e-05,9.2e-05,-0.000204,-0.000122,-5.3e-05,0.000406,0.000146,8.8e-05,7.9e-05,-2.2e-05,-2.1e-05,-0.000105,2.4e-05,0,2.3e-05,2.6e-05,-5.6e-05,-0.000321,3e-06,-3.6e-05,1.8e-05,-0.000138,3.4e-05,5.9e-05,6.6e-05,-6.6e-05,-6.7e-05,-0.000175,-2.4e-05,-4.9e-05,3.5e-05,4.8e-05,1.7e-05,-1e-05,1.1e-05,-2e-06,-6.7e-05,2.1e-05,-1.5e-05,0.000108,2.9e-05,-5.8e-05,-8.5e-05,0.000142,-0.000142,5.9e-05,-2e-04,0.000612,-0.000343,-0.000243,-0.000327,-0.000168,0.000111,8.8e-05,0.000117,6e-06,-7.7e-05,-0.000162,-3.5e-05,-6e-06
-5e-06,5.1e-05,-1.2e-05,-3e-06,-1.9e-05,-3e-06,-3.7e-05,7e-06,-1.7e-05,-3.1e-05,-2e-05,-3e-06,1.9e-05,4.5e-05,2e-05,5.7e-05,1.5e-05,1.3e-05,9e-06,2.6e-05,1.2e-05,1.6e-05,-1.5e-05,-9e-06,1.8e-05,-3.2e-05,1.8e-05,3.3e-05,-4.7e-05,3.9e-05,-5e-06,2.3e-05,1.2e-05,-8.4e-05,-2.8e-05,0.000276,-4.4e-05,-6.4e-05,0.000121,0.000169,0.000255,-6e-05,-4.5e-05,0.000188,0.00046,-0.000105,-0.000494,1.2e-05,-0.000532,-0.000219,6.7e-05,7.2e-05,-7.6e-05,8.4e-05,5.8e-05,6.9e-05,-0.000169,3.7e-05,-2.8e-05,8.5e-05,-1.6e-05,0.000178,0.000151,-5.4e-05,3.2e-05,0.000129,-8.5e-05,0.000107,-0.000106,-2e-06,-3.3e-05,-2.7e-05,-4.1e-05,1.3e-05,-3.7e-05,4.1e-05,1.2e-05,-2.3e-05,-0.000245,2.1e-05,-2.3e-05,4e-05,5.3e-05,-3.3e-05,4.5e-05,3.9e-05,-3.1e-05,-0.000136,-0.00013,-2.5e-05,-2.1e-05,2.4e-05,1.3e-05,2.1e-05,3.1e-05,-2.5e-05,-5e-06,-3.1e-05,-7.2e-05,2e-06,-0.000131,-3.4e-05,-4e-06,-0.000108,-1.1e-05,0.000162,-3.8e-05,-0.000205,-0.000633,0.000109,9.3e-05,8.4e-05,-0.000159,3.1e-05,5.4e-05,-4e-05,2.9e-05,-4.3e-05,1.2e-05,9.3e-05,-5.6e-05
2.7e-05,-5e-05,4.2e-05,-2e-06,1e-06,-1.2e-05,2.7e-05,4e-06,2e-05,4e-06,-1e-06,-5e-06,-3.7e-05,-9e-06,4e-06,-1.4e-05,-1e-06,5e-06,1.9e-05,-3.5e-05,-2.4e-05,1.2e-05,-1.1e-05,-7.2e-05,1.5e-05,2.7e-05,-1.8e-05,2.4e-05,-6e-06,-1.9e-05,-1e-06,2e-06,-5.2e-05,-3e-06,-1.8e-05,5.9e-05,3.3e-05,-3.5e-05,7.1e-05,8e-06,1.5e-05,-0.000161,-0.000148,0.000292,3.7e-05,-0.000129,-0.000356,-0.00017,-0.000177,-0.000228,-5.8e-05,6.7e-05,-0.000104,-2.8e-05,5.6e-05,3.7e-05,6e-06,-0.000279,-0.000119,-8.1e-05,-9.6e-05,0.000239,-2.4e-05,6.1e-05,-8.1e-05,-3.5e-05,-9.2e-05,2.5e-05,0.000184,-2.3e-05,1.6e-05,-2.2e-05,1.9e-05,-1.9e-05,-2e-05,-1e-05,-9e-06,2e-06,-9.8e-05,-2.6e-05,-2.5e-05,2.4e-05,-7.1e-05,-7.8e-05,-1.8e-05,0,-3.6e-05,-5.7e-05,-1.5e-05,-1e-06,-4.3e-05,-2.6e-05,0,9e-06,-8e-06,-2.9e-05,-7e-06,-1.1e-05,-8e-06,4e-05,8.8e-05,4e-06,-1.9e-05,2.5e-05,1.7e-05,-8.3e-05,4.5e-05,0.000107,1.4e-05,0.000143,0.000168,-7.8e-05,-0.00015,-3.6e-05,4.1e-05,-2.4e-05,-7.5e-05,-6.5e-05,4.8e-05,4.1e-05,-6e-05
-3e-05,-4e-06,1.9e-05,-1.3e-05,1.6e-05,-4e-06,-1.6e-05,-2e-06,1.2e-05,1e-05,-5e-06,3e-06,-2.3e-05,-3.1e-05,2.1e-05,-1.1e-05,-1e-05,0,-4e-06,1.6e-05,-1.4e-05,1e-06,2e-06,3e-06,-4.2e-05,-5e-06,-2.6e-05,1e-05,-2e-06,-1.5e-05,9e-06,0,-2.6e-05,-2.6e-05,-2.4e-05,-6.4e-05,-7.1e-05,-5.8e-05,-3.8e-05,-3.6e-05,2.6e-05,3.4e-05,-8e-06,-3.6e-05,-0.000163,-3.4e-05,0.00015,-5.5e-05,0.00011,8.9e-05,-7.8e-05,-5.8e-05,-3e-05,-0.000261,6e-05,3.7e-05,1e-04,-7.9e-05,-4.7e-05,-0.000205,-1e-04,0.000149,-5.4e-05,-1.4e-05,0,-8.5e-05,1.1e-05,3e-05,-8e-05,-6.7e-05,-1.6e-05,-6e-06,3.2e-05,-3.1e-05,-3e-06,-1.6e-05,-9e-06,-8e-06,-3.4e-05,-3.1e-05,-1.2e-05,9e-06,3.2e-05,6e-05,-7.3e-05,-2.7e-05,-2.4e-05,-1.2e-05,-1.8e-05,-6e-06,-6.2e-05,-2.8e-05,-2.5e-05,-5e-06,2e-06,-3.2e-05,4.9e-05,4.4e-05,-5e-06,-3e-06,-2.9e-05,-3.4e-05,2e-06,-1.7e-05,0,4.8e-05,2.9e-05,-1.8e-05,0.000163,0.000202,2e-05,5.4e-05,1e-05,-9e-06,-0.000109,3.7e-05,-8.1e-05,3.3e-05,0.000141,-4e-06,-3.1e-05
1.5e-05,5.3e-05,-5e-06,-8e-06,1.1e-05,-1e-05,4e-06,-2e-06,1e-06,-3e-06,7e-06,1e-06,3.2e-05,-1.1e-05,-1e-06,3.4e-05,7e-06,0,-1.3e-05,3e-06,-1e-05,-5e-06,3e-06,3.8e-05,-1.5e-05,-5e-06,2e-06,-6e-06,1.4e-05,8e-06,-2.2e-05,3e-06,-1.1e-05,1e-06,-2.8e-05,-2.2e-05,3e-06,-1e-06,-4.1e-05,-2.8e-05,7e-05,2.8e-05,-4.6e-05,-3.7e-05,-4.5e-05,-9e-06,2.1e-05,-7.6e-05,0.000114,-0.000118,-1.3e-05,2.4e-05,2.9e-05,-0.000112,9.6e-05,-4.2e-05,6.8e-05,-3e-05,-0.000116,-9e-05,-1.4e-05,-2.2e-05,-3.9e-05,-1.3e-05,3.7e-05,1e-06,3e-06,-1e-06,9.7e-05,-2.3e-05,2.8e-05,1.4e-05,1.6e-05,-4.7e-05,4.8e-05,-3.2e-05,1.3e-05,-2.7e-05,0.000108,1.3e-05,-2.6e-05,-1.7e-05,-2.6e-05,-1.5e-05,-7.8e-05,-7e-06,-2.7e-05,3.4e-05,-3e-05,-1.2e-05,-5.5e-05,-1.9e-05,-5e-05,-2.4e-05,-1e-06,-1.4e-05,-1.5e-05,-4.1e-05,9e-06,-4.9e-05,-1e-06,1.6e-05,9e-06,-2e-05,6e-06,-5.1e-05,-2.5e-05,-8e-06,0.000129,6.3e-05,-0.000203,-4.5e-05,0.000134,4.2e-05,1e-06,-3.9e-05,-5.4e-05,-1.8e-05,5.7e-05,3e-06,1e-05
1e-06,-2e-06,-1.2e-05,6e-06,9e-06,-7e-06,-4e-06,0,-1.2e-05,-2.1e-05,4e-06,0,2e-06,-7e-06,3e-06,0,-2e-06,-1e-05,2e-06,-3e-06,-4e-06,7e-06,5e-06,2.2e-05,7e-06,8e-06,0,2e-06,2e-06,-8e-06,-5.5e-05,-1.3e-05,-2.9e-05,3.4e-05,1.1e-05,-6.5e-05,-5.5e-05,2.6e-05,-3.1e-05,-4e-05,3.4e-05,-3e-05,2.8e-05,-6.3e-05,8.6e-05,6.8e-05,6.5e-05,-2.7e-05,0.000333,-4.8e-05,-6.1e-05,8.1e-05,4e-06,-4.5e-05,3.7e-05,-4.3e-05,3.3e-05,-3.2e-05,5e-06,9.6e-05,3e-06,-0.000156,-2.8e-05,1.4e-05,-5.5e-05,5e-06,4.3e-05,4.5e-05,-1.9e-05,6.2e-05,-2.7e-05,-1.3e-05,-3e-06,-6e-06,3.5e-05,-1.2e-05,0,-3.2e-05,4.6e-05,1.4e-05,-6e-06,-1.5e-05,-4e-06,3.8e-05,-5.6e-05,-5e-06,-2.7e-05,1.4e-05,-2.6e-05,-1e-06,-2.7e-05,2e-06,-2.9e-05,8e-06,0,-3e-06,5e-06,-1e-05,3.1e-05,2.6e-05,6e-06,-1.6e-05,-3e-06,1.4e-05,-4e-05,9e-06,3e-05,4.8e-05,-0.000119,6e-05,-3.5e-05,4.7e-05,3.2e-05,-3e-05,6e-06,2e-05,-2.9e-05,-3.4e-05,3.5e-05,-9e-06,1.1e-05
-7e-06,6e-06,-1.3e-05,0,7e-06,0,0,2e-06,3e-06,1e-06,2e-06,0,2.3e-05,2.5e-05,-1.7e-05,9e-06,-2e-06,-7e-06,-3e-06,0,2e-06,-1.1e-05,-4e-06,1.8e-05,-2e-06,-2e-05,2.1e-05,0,-7e-06,9e-06,5e-06,9e-06,1e-06,3.6e-05,-5e-06,-6.9e-05,-5.6e-05,2.3e-05,-2.9e-05,1.8e-05,-4e-06,1.4e-05,-7e-06,-8.9e-05,8.2e-05,4.2e-05,0.000165,-1.7e-05,-3e-05,-5.2e-05,-8.2e-05,-2.6e-05,1.9e-05,-0.000107,2.1e-05,-7.3e-05,-4.6e-05,-7.4e-05,-3.2e-05,0.000108,-1.5e-05,-0.000161,3e-05,4.4e-05,-1.2e-05,-1e-05,-3.3e-05,1e-05,2.7e-05,4.7e-05,1.3e-05,1.3e-05,-3.3e-05,-3.4e-05,1.7e-05,1.2e-05,1e-06,-2.4e-05,3e-06,-1.1e-05,-4e-06,-2.7e-05,-2.2e-05,-2.8e-05,-5.8e-05,-2e-05,-1.6e-05,1.1e-05,-4.2e-05,-2e-06,4e-06,9e-06,-3.7e-05,-7e-06,-5e-06,5e-06,-1.8e-05,1.6e-05,-3.2e-05,-1.7e-05,-7e-06,5e-06,-2e-05,-3.3e-05,1e-05,-1e-05,-2.9e-05,-0.000106,-0.000147,5.8e-05,0.000115,1.3e-05,-7e-06,-4.3e-05,5e-06,2e-06,3.8e-05,-3.6e-05,-1.8e-05,1.8e-05,1.9e-05
0,-2.4e-05,3e-06,-6e-06,6e-06,-5e-06,7e-06,-7e-06,9e-06,-2e-06,-1e-06,-2e-06,-9e-06,9e-06,-2e-06,5e-06,4e-06,1e-06,-1e-06,1.9e-05,3e-06,-1e-06,0,-8e-06,-4e-06,2e-06,0,-1.4e-05,-1.7e-05,2e-06,9e-06,-1.5e-05,-8e-06,1.7e-05,-1.2e-05,-4.9e-05,-2.2e-05,-4e-06,-3e-05,3.2e-05,-3.9e-05,5.4e-05,2e-05,5e-05,-7.6e-05,-1.6e-05,0.000184,1.5e-05,-0.000154,-9.9e-05,-3.1e-05,8e-06,-2.1e-05,-2e-05,4e-06,-6.5e-05,-7.2e-05,-5.3e-05,-2e-05,3e-06,-1.2e-05,-0.000106,2.8e-05,-3.3e-05,5.1e-05,1.5e-05,-6.9e-05,5.1e-05,5e-06,-1.8e-05,7e-06,-4e-06,-1.6e-05,-2.3e-05,-1e-05,-1.1e-05,-7e-06,9e-06,5e-06,3e-06,-6e-06,-1e-05,-1.9e-05,-2.9e-05,-1.2e-05,-7e-06,-2.1e-05,1.8e-05,-3.4e-05,-2e-06,-2.7e-05,7e-06,-2e-05,8e-06,-5e-06,-1e-06,1.1e-05,1.3e-05,7e-06,-6e-06,1e-06,8e-06,2e-06,-5.2e-05,5e-06,1.6e-05,4e-06,3.3e-05,0.000109,3e-05,9e-06,7.5e-05,4.1e-05,1e-06,-5e-06,-2e-06,3e-06,-3e-06,-1e-06,1.3e-05,2e-06
7e-06,-7e-06,1.5e-05,8e-06,-4e-06,2e-06,-8e-06,4e-06,-1e-06,-6e-06,-1e-06,-5e-06,1.3e-05,5e-06,0,0,-2e-06,4e-06,6e-06,-5e-06,5e-06,-2e-06,1e-06,-1e-05,1.3e-05,-1.2e-05,-1e-05,-6e-06,-2.6e-05,5e-06,-1.4e-05,5e-06,3e-06,-2e-06,7e-06,-8e-06,-2.6e-05,-4e-05,-3.6e-05,1e-06,-4.1e-05,5e-06,-4e-06,-5.6e-05,-9.9e-05,-3.3e-05,0.000102,-5.5e-05,-8.5e-05,-2e-05,7.9e-05,7e-06,2e-06,-1e-06,-4.4e-05,-4.5e-05,-5.2e-05,-0.000111,-2.3e-05,-9e-05,-2.4e-05,-5.1e-05,8e-06,-9e-06,-7.8e-05,-7.1e-05,-1.5e-05,1.3e-05,3e-06,-1.8e-05,-2.9e-05,1e-06,-1.6e-05,2.9e-05,-8e-06,-1.3e-05,3e-06,-5e-06,-2.2e-05,0,-8e-06,0,-7e-06,1.9e-05,3e-05,4e-06,-1.4e-05,1.5e-05,-2.9e-05,0,-2.6e-05,-8e-06,-1e-06,0,-2e-06,4e-06,-1e-05,4e-06,4e-06,1e-05,-3e-06,-1e-06,7e-06,-7e-06,2e-06,7e-06,1e-05,4.4e-05,4.3e-05,1e-04,-3.1e-05,-5.7e-05,-3e-05,1.9e-05,-6e-06,-1.5e-05,4.4e-05,-9e-06,1.8e-05,-6e-06,-1.7e-05
-3e-06,-5e-06,3e-06,-3e-06,-3e-06,1e-06,5e-06,-2e-06,-6e-06,-5e-06,-1e-06,-3e-06,-1.5e-05,4e-06,1e-05,1e-06,-3e-06,4e-06,0,-2e-06,-1e-06,5e-06,0,0,5e-06,2e-06,-8e-06,-6e-06,1.1e-05,-3e-06,-6e-06,2e-06,-1.1e-05,7e-06,-2.4e-05,-2e-06,3e-06,-6e-06,-1.9e-05,-1.9e-05,5e-06,7e-06,-9e-06,-1.3e-05,6.9e-05,-2.2e-05,1e-06,-4e-05,-4e-05,-1e-05,5e-05,-4.7e-05,-2.5e-05,-5.2e-05,-2.8e-05,-3.2e-05,-1.2e-05,-6.8e-05,5e-06,-8.8e-05,-2.4e-05,-1.4e-05,2e-05,6.4e-05,4.1e-05,6.3e-05,2.8e-05,0,6e-06,-2e-06,1.7e-05,-4e-06,1e-06,-4.2e-05,1e-06,-1e-06,7e-06,-2.3e-05,3e-06,-2e-06,-4e-06,9e-06,0,1e-05,4.6e-05,1.3e-05,-1e-05,2.5e-05,-1.3e-05,-2e-06,-1.5e-05,-1.2e-05,1e-06,-4e-06,-2e-06,-8e-06,4e-06,-3.4e-05,-1.5e-05,-4e-06,-4e-06,-2e-06,-1e-05,-1.4e-05,1e-06,-6e-06,-1.7e-05,-2.9e-05,-6e-05,-0.000146,-0.000117,-5.3e-05,-1.9e-05,2e-06,4e-06,2.8e-05,-1e-06,6e-06,3.4e-05,-2.2e-05,-8e-06
1e-06,1e-05,-1e-05,-1e-05,-5e-06,-9e-06,-1e-06,-3e-06,-1e-06,0,0,-1e-06,-1.2e-05,-1.1e-05,-8e-06,-1e-06,7e-06,1e-06,-3e-06,1e-05,-3e-06,2e-06,1e-06,-3e-06,4e-06,-5e-06,-3e-06,-4e-06,1e-06,-9e-06,2e-06,2e-06,-6e-06,-3e-06,-1e-06,3.8e-05,-2.2e-05,1e-05,-1.1e-05,-1.1e-05,-3.1e-05,3.7e-05,-4e-06,-3.2e-05,8.4e-05,-2.2e-05,7.4e-05,-4.7e-05,1.2e-05,-2.8e-05,-2.9e-05,1.4e-05,9e-06,-7.7e-05,-4.4e-05,-9e-06,4.3e-05,-2.9e-05,-6e-06,2.7e-05,-2.2e-05,8e-06,-1e-06,-4.8e-05,-1.5e-05,1.3e-05,-4e-06,3.7e-05,1.1e-05,1.3e-05,2.4e-05,-2e-06,-1.6e-05,-1.7e-05,1.2e-05,-1e-05,-7e-06,-1e-05,3.3e-05,1e-06,-2e-06,1.4e-05,-8e-06,4e-06,1.8e-05,3e-06,-1.1e-05,1e-06,-1.8e-05,-1e-06,-1.3e-05,-4e-06,1e-05,1e-06,-3e-06,-9e-06,-2e-06,1e-06,5e-06,-3e-06,4e-06,-6e-06,3e-06,0,0,-1e-06,1.6e-05,-3e-06,0.00014,4e-06,4.1e-05,9e-06,4e-05,-1e-05,-1.6e-05,-2.6e-05,-1.3e-05,-2.2e-05,3.8e-05,3e-06,-1.2e-05
-1e-06,9e-06,0,5e-06,-3e-06,-4e-06,-4e-06,4e-06,4e-06,3e-06,0,0,7e-06,4e-06,7e-06,1e-06,-2e-06,1e-06,-4e-06,-7e-06,-4e-06,-1e-06,0,1e-06,-8e-06,3e-06,7e-06,-8e-06,9e-06,1e-06,1.3e-05,-3e-06,2e-06,-9e-06,2e-06,8.9e-05,-1.5e-05,1.4e-05,5e-06,-8e-06,-8.3e-05,-2.4e-05,-1.3e-05,-9e-06,-5.8e-05,5e-06,-2.7e-05,-1e-05,5e-06,-1.1e-05,2.4e-05,-9e-06,-2e-06,-0.00011,-3.6e-05,-3e-06,3.5e-05,-1e-06,-8e-06,5.9e-05,4e-06,1.5e-05,-1.1e-05,-9e-06,9e-06,-4.2e-05,5e-06,7e-06,-9e-06,-1.3e-05,-2.8e-05,5e-06,-7e-06,-9e-06,1.6e-05,-6e-06,-2e-06,-3e-06,1e-05,4e-06,-6e-06,9e-06,-1e-05,-1.8e-05,0,5e-06,-9e-06,-1.4e-05,-1.6e-05,0,-2.1e-05,5e-06,-2e-06,-1e-06,1e-06,-3e-06,3e-06,3.2e-05,-4e-06,7e-06,3e-06,5e-06,-9e-06,8e-06,2e-06,-5e-06,-7e-06,1e-05,-0.000189,-6.3e-05,2.2e-05,9e-06,-6e-06,1e-05,9e-06,1.2e-05,-6e-06,-1.3e-05,3.1e-05,0,-1e-05
-1e-06,-2e-06,4e-06,0,-8e-06,1e-06,3e-06,-2e-06,1e-06,-6e-06,1e-06,2e-06,-7e-06,-7e-06,-4e-06,-3e-06,-3e-06,1e-06,2e-06,-4e-06,-5e-06,-1e-06,-1e-06,1e-06,-5e-06,-1e-06,9e-06,-5e-06,8e-06,-2e-06,-1.5e-05,-1e-06,-1.9e-05,-2e-05,-9e-06,1.5e-05,-1.2e-05,3e-06,-9e-06,4e-06,-4.5e-05,-8e-06,5e-06,6e-05,-4.9e-05,8e-06,-4.5e-05,-1.4e-05,9.9e-05,-4.9e-05,2.3e-05,-2.7e-05,2e-06,4e-06,-1.2e-05,3e-06,1.8e-05,-9e-06,-8e-06,3.2e-05,1.2e-05,1.9e-05,-1.4e-05,3.5e-05,-7e-06,6e-06,1.4e-05,2.6e-05,8e-06,-2.2e-05,-4e-06,-7e-06,-1e-05,-1.9e-05,1.3e-05,0,3e-06,-2e-06,2.4e-05,-2e-06,-1e-06,6e-06,2e-06,7e-06,-2.7e-05,2e-06,-8e-06,-1.1e-05,-1.8e-05,-1e-06,-2.3e-05,6e-06,-9e-06,6e-06,-3e-06,-6e-06,-4e-06,-2e-06,6e-06,-7e-06,-1.4e-05,-7e-06,-4e-06,8e-06,-7e-06,-2e-06,-1e-06,-2.7e-05,3.5e-05,-3.6e-05,1e-05,1e-05,-1.6e-05,1.6e-05,1e-06,0,-2.6e-05,-1e-05,9e-06,2e-06,5e-06
7e-06,-1.5e-05,-2e-06,-2e-06,-2e-06,1e-06,-2e-06,1e-06,1e-06,-2e-06,0,-1e-06,1.3e-05,-3e-06,-3e-06,3e-06,3e-06,1e-06,3e-06,5e-06,0,0,1e-06,4e-06,4e-06,-1e-06,1e-06,-3e-06,-6e-06,3e-06,-6e-06,1e-06,0,-1e-05,0,-1.4e-05,-2.4e-05,-1.3e-05,-1e-06,1.5e-05,-2e-06,6e-06,-5e-06,2.5e-05,6e-06,1.2e-05,-9.3e-05,-1e-05,5.9e-05,-8e-06,-2.9e-05,4e-06,-1e-06,2.2e-05,-9e-06,-4e-06,-1e-05,-1.6e-05,1e-06,-2.6e-05,-1.2e-05,1.2e-05,-2.1e-05,-1.5e-05,-3e-06,-2e-06,-3.6e-05,6e-06,-8e-06,1.1e-05,9e-06,7e-06,-2e-06,-5e-06,4e-06,-1e-05,2e-06,-6e-06,-9e-06,-7e-06,-2e-06,-4e-06,-9e-06,-1.1e-05,-2.8e-05,-3e-06,-7e-06,-6e-06,-2e-05,0,-1.5e-05,-1e-06,-1.3e-05,-3e-06,1e-06,0,-2e-06,-7e-06,0,3e-06,2e-05,-1e-06,2e-06,1e-06,6e-06,1e-05,7e-06,2.6e-05,0.000108,-3.3e-05,-7.1e-05,-4e-06,-3e-06,-7e-06,5e-06,-1e-06,1e-06,4e-06,-7e-06,-7e-06,8e-06
-4e-06,1.2e-05,-6e-06,4e-06,1e-06,0,1e-06,0,-5e-06,2e-06,0,-3e-06,-2e-06,-1e-06,-1e-06,-4e-06,-1e-06,-3e-06,0,4e-06,-1e-06,-1e-06,0,9e-06,-1e-06,2e-06,-1e-05,-1e-06,-4e-06,1e-06,7e-06,2e-06,-3e-06,-3e-06,-7e-06,-1.3e-05,-1.3e-05,-5e-06,-7e-06,0,-4.4e-05,-5e-06,9e-06,5.8e-05,6.8e-05,4e-06,-3.4e-05,-1.5e-05,-5.9e-05,-1.8e-05,-3.8e-05,2.2e-05,0,-5.2e-05,1e-05,-6e-06,-4e-05,1.3e-05,-2e-06,-5.3e-05,-2.1e-05,-6e-06,0,-1.1e-05,7e-06,2e-06,8e-06,1e-05,-1e-06,2.3e-05,0,-4e-06,-3e-06,-4e-06,2e-06,3e-06,-1e-06,-1.4e-05,-4.2e-05,6e-06,-2e-06,-7e-06,5e-06,1.4e-05,-2.1e-05,-7e-06,-7e-06,-3e-06,-1.9e-05,0,-8e-06,-6e-06,-2e-05,1e-06,0,2e-06,2e-06,-8e-06,-5e-06,-1e-06,-1.7e-05,5e-06,-2e-06,-3e-06,-8e-06,-8e-06,-1.2e-05,3e-06,-6.6e-05,3.4e-05,-9e-06,1.3e-05,-1.9e-05,-1.6e-05,-1e-05,-5e-06,-3e-06,-9e-06,2e-06,-4e-06,4e-06
-2e-06,3e-06,2e-06,-2e-06,2e-06,-1e-06,1e-06,0,0,-2e-06,0,-1e-06,8e-06,-2e-06,4e-06,-3e-06,0,-2e-06,-2e-06,-5e-06,0,1e-06,-1e-06,4e-06,-4e-06,-2e-06,-1e-06,-3e-06,-1e-05,3e-06,-1.2e-05,-2e-06,-6e-06,-6e-06,-5e-06,-1.7e-05,-1.4e-05,-2e-06,-8e-06,-1.1e-05,-6e-05,-1.4e-05,-3e-06,-1.2e-05,3e-06,-6e-06,-4.7e-05,-1.1e-05,-2e-05,-2.8e-05,-1.5e-05,-2.3e-05,-2e-06,-5.5e-05,2e-05,-1.6e-05,-2.2e-05,2.1e-05,-7e-06,-2.2e-05,-1.1e-05,-2.7e-05,6e-06,1e-05,-1.7e-05,1.3e-05,7e-06,2.2e-05,-3e-06,2e-06,3e-06,1e-06,2e-06,-9e-06,1e-06,0,-1e-06,-7e-06,-3.1e-05,5e-06,-2e-06,-1e-05,-7e-06,4e-06,-9e-06,-4e-06,-6e-06,-6e-06,-1.5e-05,-1e-06,-5e-06,-6e-06,-1.4e-05,-7e-06,1e-06,0,2e-06,-3e-06,1e-06,-3e-06,9e-06,-3e-06,-4e-06,6e-06,7e-06,1.2e-05,6e-06,-2.5e-05,3e-06,-9e-06,-4e-06,-1e-05,-3.2e-05,2e-06,5e-06,9e-06,1.1e-05,-5e-06,4e-06,1e-06,1e-06
6e-06,0,3e-06,2e-06,3e-06,-2e-06,-1e-06,0,3e-06,-3e-06,0,1e-06,-6e-06,4e-06,-3e-06,0,1e-06,1e-06,0,5e-06,0,-1e-06,0,-5e-06,3e-06,0,-2e-06,0,0,1e-06,-1.3e-05,1e-06,2e-06,-1e-06,2e-06,-4e-05,-2.1e-05,7e-06,-4e-06,-2e-06,-2.2e-05,-4e-06,2e-06,-3e-05,-6.8e-05,-5e-06,-5e-05,-1e-05,-6.1e-05,0,1.3e-05,2.9e-05,-6e-06,-3.9e-05,1.1e-05,-1.6e-05,-9e-06,3.8e-05,0,3.3e-05,6e-06,-4.4e-05,3e-06,5e-06,5e-06,-2.5e-05,-8e-06,4e-06,-1.1e-05,-1.8e-05,-7e-06,1e-06,3e-06,-1.2e-05,1e-06,-4e-06,0,1e-06,-1.9e-05,-4e-06,-1e-06,-6e-06,1e-06,-1.2e-05,2e-06,0,-5e-06,-8e-06,-1.1e-05,0,-1.6e-05,1e-06,-1.2e-05,0,-1e-06,1e-06,1e-06,5e-06,-6e-06,-1e-06,-9e-06,2e-06,-2e-06,3e-06,-5e-06,-1.4e-05,-2e-06,1.9e-05,-3.3e-05,4.1e-05,4.4e-05,9e-06,-7e-06,1e-05,-4e-06,-7e-06,3e-06,-1.2e-05,1.6e-05,0,-7e-06
-2e-06,3e-06,1e-06,-4e-06,4e-06,-1e-06,4e-06,-1e-06,2e-06,-3e-06,0,1e-06,-3e-06,2e-06,2e-06,-2e-06,0,0,0,1e-06,0,1e-06,0,-9e-06,4e-06,-2e-06,7e-06,1e-06,6e-06,-6e-06,-7e-06,-1e-06,-6e-06,0,-6e-06,-2e-05,-1.5e-05,5e-06,-1.3e-05,-1e-06,-5e-06,4e-06,-3e-06,-2.1e-05,-1e-06,-8e-06,-3e-06,-6e-06,-2.5e-05,-2.6e-05,5e-06,0,2e-06,-1.2e-05,1.2e-05,-1.8e-05,1.9e-05,1.9e-05,-4e-06,3.1e-05,5e-06,-4.7e-05,1e-05,-9e-06,7e-06,-1e-06,0,6e-06,9e-06,-7e-06,3e-06,-2e-06,-2e-06,-1.6e-05,4e-06,0,1e-06,-3e-06,2e-06,-2e-06,0,0,0,-1e-06,1e-05,3e-06,-4e-06,-3e-06,-1.1e-05,0,-1.6e-05,5e-06,-3e-06,3e-06,1e-06,-2e-06,-1e-06,4e-06,4e-06,4e-06,8e-06,-1e-06,-1e-06,1e-05,4e-06,1e-05,-4e-06,-5e-06,2.9e-05,-7e-06,-5.5e-05,-1.2e-05,1.2e-05,-8e-06,-2e-06,1e-06,7e-06,-1e-06,1.5e-05,-2e-06,-6e-06
-3e-06,-9e-06,2e-06,-2e-06,4e-06,0,-5e-06,1e-06,-3e-06,3e-06,0,1e-06,1e-06,2e-06,0,0,-2e-06,0,0,-5e-06,-1e-06,0,1e-06,-5e-06,1e-06,1e-06,4e-06,1e-06,1e-06,3e-06,1.2e-05,0,3e-06,8e-06,1e-06,1.2e-05,-7e-06,-3e-06,-5e-06,1e-06,-2e-05,-1.5e-05,-2e-06,-3.7e-05,4.7e-05,2e-06,8e-06,-1e-06,4.1e-05,-6e-06,-1e-06,5e-06,0,-2.3e-05,7e-06,-1.6e-05,2.9e-05,2.3e-05,2e-06,1e-06,-7e-06,-3.6e-05,1e-06,-2e-06,-8e-06,2.8e-05,-8e-06,1e-05,-1.9e-05,1.1e-05,3e-06,2e-06,-1e-06,1e-06,7e-06,0,-1e-06,-8e-06,2.8e-05,2e-06,-1e-06,2e-06,-5e-06,0,1.3e-05,0,-4e-06,2e-06,-1.2e-05,0,-5e-06,4e-06,3e-06,0,1e-06,-2e-06,1e-06,-2e-06,2e-06,-5e-06,-4e-06,2e-06,-2e-06,8e-06,-4e-06,-1.1e-05,6e-06,-3e-06,0,4.3e-05,-1.1e-05,-9e-06,-7e-06,-8e-06,3e-06,4e-06,1e-06,-3e-06,2e-06,-3e-06,-2e-06
4e-06,-6e-06,-3e-06,3e-06,0,0,4e-06,-2e-06,-1e-06,-3e-06,0,0,-7e-06,1e-06,-2e-06,-2e-06,3e-06,1e-06,0,2e-06,-3e-06,-1e-06,-1e-06,2e-06,-1e-06,-2e-06,-1e-06,0,1e-05,-1e-06,1e-06,-3e-06,-9e-06,6e-06,0,1.9e-05,-1.2e-05,-6e-06,-3e-06,5e-06,-2.2e-05,6e-06,-2e-06,1e-05,1.7e-05,-2e-06,3.3e-05,-5e-06,5.3e-05,-3e-06,1.1e-05,6e-06,0,-4.3e-05,-3e-06,-1e-05,9e-06,1.6e-05,-6e-06,-2.6e-05,-5e-06,-1.8e-05,-2e-06,1.2e-05,8e-06,-2.3e-05,-7e-06,1.3e-05,8e-06,8e-06,-9e-06,-2e-06,-5e-06,-1.1e-05,7e-06,-2e-06,-1e-06,-5e-06,1.2e-05,-1e-06,0,7e-06,1e-06,8e-06,1.1e-05,1e-06,-4e-06,9e-06,-1.3e-05,0,-8e-06,-1e-06,-1e-06,3e-06,0,-2e-06,-1e-06,4e-06,-2e-06,1e-06,-1e-06,-4e-06,0,7e-06,4e-06,1.1e-05,-4e-06,9e-06,-2e-06,-8e-06,-2.4e-05,4e-06,1.3e-05,8e-06,1e-06,-5e-06,-9e-06,-1e-06,-3e-06,0,-2e-06
0,5e-06,-4e-06,-2e-06,0,1e-06,-2e-06,1e-06,1e-06,-4e-06,0,-1e-06,7e-06,-2e-06,1e-06,0,-1e-06,0,1e-06,2e-06,-1e-06,0,0,7e-06,-3e-06,1e-06,-6e-06,1e-06,-7e-06,0,-6e-06,3e-06,0,2e-06,-5e-06,3e-05,-1.1e-05,-1e-06,-4e-06,0,-6e-06,7e-06,0,-7e-06,-3.9e-05,6e-06,7e-06,-6e-06,3.6e-05,-1.6e-05,2.3e-05,1e-06,0,-6e-06,-3e-06,-1e-05,1e-06,1.9e-05,3e-06,-2.2e-05,-5e-06,-4e-06,-4e-06,-7e-06,-1.6e-05,2e-06,6e-06,2e-06,-1.4e-05,-1.4e-05,6e-06,1e-06,0,-8e-06,5e-06,3e-06,1e-06,-3e-06,2e-06,1e-06,-1e-06,5e-06,-3e-06,0,0,3e-06,-3e-06,2e-06,-1.2e-05,0,-1.5e-05,-5e-06,3e-06,-4e-06,0,-2e-06,-1e-06,-4e-06,3e-06,3e-06,3e-06,0,-3e-06,3e-06,-1e-06,-8e-06,2e-06,-7e-06,2.2e-05,2e-05,3.9e-05,7e-06,1.1e-05,9e-06,-2e-06,3e-06,2e-06,-9e-06,-8e-06,1e-06,3e-06
0,4e-06,2e-06,0,-1e-06,1e-06,-1e-06,0,1e-06,1e-06,0,0,-3e-06,-2e-06,-1e-06,-1e-06,-1e-06,0,1e-06,-3e-06,-1e-06,0,0,5e-06,2e-06,-1e-06,-1e-06,1e-06,-2e-06,1e-06,7e-06,-2e-06,-1e-06,2e-06,0,2.1e-05,-6e-06,3e-06,-2e-06,-5e-06,1e-05,-6e-06,0,5e-06,-2.6e-05,-1e-06,4.7e-05,-8e-06,-3.7e-05,-4e-06,-3e-06,-1.5e-05,1e-06,-1.3e-05,-8e-06,-3e-06,-2.2e-05,1.5e-05,-5e-06,6e-06,-2e-06,2e-06,-1e-05,-3e-06,1.1e-05,6e-06,1.1e-05,0,4e-06,-6e-06,7e-06,-1e-06,-3e-06,0,2e-06,-2e-06,0,-2e-06,2e-06,1e-06,0,4e-06,1e-06,-2e-06,-8e-06,2e-06,-3e-06,1e-06,-1.2e-05,0,-1.1e-05,-3e-06,-3e-06,2e-06,1e-06,1e-06,0,-4e-06,0,-4e-06,1e-06,3e-06,-2e-06,-2e-06,-2e-06,7e-06,0,-4e-06,-6e-05,-2e-05,-3.3e-05,5e-06,-7e-06,-3e-06,-1e-06,-1e-06,-8e-06,-2e-06,-5e-06,1e-06,3e-06
0,-1e-06,5e-06,4e-06,-2e-06,-2e-06,2e-06,-1e-06,0,1e-06,0,0,6e-06,0,0,0,0,0,-1e-06,0,-1e-06,0,1e-06,1e-06,1e-06,1e-06,0,1e-06,-3e-06,1e-06,-1e-06,3e-06,-7e-06,0,-2e-06,-1.2e-05,-1.6e-05,4e-06,-5e-06,-1e-06,1e-05,4e-06,0,1e-05,3e-05,2e-06,2.4e-05,-2e-06,-3.4e-05,-1.3e-05,-1.9e-05,1.2e-05,0,-3.5e-05,-9e-06,-5e-06,-2.1e-05,1.1e-05,4e-06,1.8e-05,-1e-06,0,-2e-06,8e-06,2e-06,-9e-06,-1.3e-05,1.1e-05,-7e-06,1.1e-05,-1.3e-05,1e-06,1e-06,-1.3e-05,0,0,0,-2e-06,-1.9e-05,-3e-06,-1e-06,0,-2e-06,-8e-06,-1.1e-05,-1e-06,-3e-06,1e-06,-1e-05,0,-6e-06,1e-06,-6e-06,-3e-06,0,0,1e-06,3e-06,-1e-06,1e-06,-3e-06,-4e-06,-1e-06,-2e-06,2e-06,-5e-06,-2e-06,1.1e-05,2.6e-05,-6e-06,-3e-06,-4e-06,1e-06,-5e-06,3e-06,2e-06,0,-4e-06,0,-1e-06,0
0,-1e-06,-1e-06,-1e-06,-4e-06,-1e-06,-2e-06,1e-06,-1e-06,-2e-06,0,1e-06,-3e-06,1e-06,1e-06,0,1e-06,0,-1e-06,4e-06,-1e-06,0,0,-3e-06,-3e-06,-1e-06,5e-06,0,-6e-06,0,-8e-06,-2e-06,4e-06,2e-06,-2e-06,-2.1e-05,-1.2e-05,-2e-06,0,0,-3e-06,9e-06,2e-06,-3e-06,3.3e-05,-1e-06,2e-05,-6e-06,-1.5e-05,-1.1e-05,3e-06,-2.2e-05,-2e-06,-3.9e-05,-5e-06,-4e-06,-4e-06,3e-06,-6e-06,8e-06,1e-06,-7e-06,1e-06,-1e-06,-7e-06,9e-06,3e-06,3e-06,-1e-06,1e-05,4e-06,0,-2e-06,-8e-06,0,1e-06,0,-6e-06,-3e-06,-1e-06,0,-4e-06,0,6e-06,-7e-06,-4e-06,-3e-06,1e-06,-1e-05,0,-6e-06,4e-06,-9e-06,4e-06,0,0,0,5e-06,-1e-06,2e-06,0,1e-06,-2e-06,-1e-06,-1e-06,2e-06,3e-06,-8e-06,3.9e-05,-2.6e-05,-4.3e-05,3e-06,4e-06,4e-06,-1e-06,-5e-06,2e-06,0,1e-06,0,0
2e-06,-4e-06,-4e-06,-2e-06,-2e-06,0,3e-06,-1e-06,-1e-06,-3e-06,0,1e-06,1e-06,1e-06,0,-1e-06,0,-1e-06,1e-06,-3e-06,0,0,0,-2e-06,0,1e-06,2e-06,1e-06,7e-06,-3e-06,-1.1e-05,1e-06,-5e-06,-3e-06,0,-7e-06,-7e-06,-1e-06,-5e-06,0,9e-06,-5e-06,-2e-06,2.7e-05,-2.5e-05,-1e-06,4e-06,-1e-06,-1.6e-05,0,-5e-06,1e-06,0,-2.1e-05,-4e-06,-4e-06,4e-06,-7e-06,4e-06,-5e-06,1e-06,-1.3e-05,4e-06,-5e-06,0,0,-4e-06,-1e-06,-3e-06,-6e-06,6e-06,0,0,-3e-06,3e-06,-1e-06,0,-4e-06,9e-06,2e-06,0,-5e-06,-1e-06,5e-06,-1e-06,-1e-06,-3e-06,5e-06,-9e-06,0,-9e-06,2e-06,-1.3e-05,-1e-06,0,0,0,1e-06,0,-2e-06,5e-06,0,-1e-06,-1e-06,0,-2e-06,-2e-06,3e-06,-5.2e-05,9e-06,3.6e-05,-5e-06,-2e-06,2e-06,-1e-06,6e-06,2e-06,-5e-06,-3e-06,0,-2e-06
0,3e-06,-1e-06,2e-06,-1e-06,0,-2e-06,0,0,2e-06,0,0,-1e-06,1e-06,-1e-06,0,-1e-06,0,1e-06,0,-1e-06,0,0,-2e-06,4e-06,0,-3e-06,0,0,1e-06,4e-06,0,1e-06,-3e-06,-3e-06,-7e-06,-1.5e-05,-3e-06,1e-06,2e-06,3e-05,-2e-06,1e-06,5e-06,-3.3e-05,-1e-06,3e-06,-5e-06,4e-05,-1.3e-05,-1.1e-05,1e-06,1e-06,4e-06,-3e-06,-7e-06,2.2e-05,-6e-06,-5e-06,-1.2e-05,-5e-06,-1.6e-05,7e-06,4e-06,3e-06,-1.6e-05,-3e-06,6e-06,0,-1.4e-05,-6e-06,1e-06,-1e-06,-7e-06,5e-06,0,1e-06,-1e-06,8e-06,1e-06,-1e-06,-5e-06,0,-1e-06,2e-06,0,-2e-06,-1e-06,-1e-05,0,-1.1e-05,-2e-06,-6e-06,0,0,-1e-06,0,-3e-06,2e-06,0,-7e-06,0,-1e-06,-2e-06,-1e-06,1e-06,1e-06,1e-06,2.5e-05,-2.3e-05,-2e-05,3e-06,0,-6e-06,-1e-06,-6e-06,2e-06,-2e-06,-6e-06,0,-3e-06
-2e-06,0,2e-06,-1e-06,0,1e-06,2e-06,0,1e-06,0,0,-1e-06,-3e-06,-1e-06,2e-06,-1e-06,2e-06,0,0,3e-06,-1e-06,0,0,-1e-06,-2e-06,-1e-06,-2e-06,0,4e-06,0,1e-06,0,-4e-06,-1e-06,0,-1.3e-05,-1.1e-05,1e-06,-4e-06,-1e-06,2.3e-05,8e-06,-1e-06,1.1e-05,1.5e-05,-3e-06,-1e-06,-1e-06,2.5e-05,-3e-06,-1e-06,-5e-06,-2e-06,-2.2e-05,3e-06,-6e-06,1.3e-05,-1e-05,5e-06,-4e-06,-4e-06,-1.6e-05,2e-06,0,2e-06,1.5e-05,6e-06,4e-06,-7e-06,4e-06,1e-06,-1e-06,-1e-06,-7e-06,5e-06,0,0,-4e-06,1.9e-05,-3e-06,0,-2e-06,0,-1e-06,2e-06,0,-3e-06,-3e-06,-1e-05,0,-9e-06,-4e-06,-7e-06,0,0,-1e-06,0,-4e-06,-1e-06,0,5e-06,-1e-06,-2e-06,1e-06,2e-06,0,1e-06,-4e-06,0,4e-06,7e-06,-4e-06,7e-06,-3e-06,3e-06,4e-06,2e-06,-5e-06,-1e-05,1e-06,-2e-06
3e-06,5e-06,1e-06,-1e-06,1e-06,0,0,0,-1e-06,-3e-06,0,0,3e-06,-1e-06,-1e-06,0,-2e-06,0,-1e-06,-2e-06,-1e-06,0,0,0,-1e-06,1e-06,-3e-06,0,2e-06,-1e-06,-9e-06,0,-3e-06,1e-06,-1e-06,2e-06,-9e-06,2e-06,-4e-06,-1e-06,5e-06,-7e-06,0,0,3.4e-05,2e-06,-2.8e-05,-5e-06,0,-6e-06,5e-06,1e-06,2e-06,-3.8e-05,2e-06,-8e-06,1e-06,-1e-05,-6e-06,3e-06,-1e-06,-1.6e-05,0,-2e-06,-8e-06,1e-06,-4e-06,-2e-06,5e-06,1.2e-05,2e-06,0,0,-3e-06,3e-06,-1e-06,-1e-06,-3e-06,-1e-06,0,0,1e-06,-1e-06,-7e-06,0,-1e-06,-2e-06,-4e-06,-1e-05,0,-4e-06,-2e-06,-3e-06,-3e-06,0,-1e-06,-1e-06,0,0,0,-5e-06,0,-1e-06,-5e-06,-1e-06,1e-06,-1e-06,3e-06,-9e-06,0,-4.9e-05,0,-5e-06,4e-06,-3e-06,-4e-06,0,-1e-06,-8e-06,1e-06,-1e-06
1e-06,-2e-06,-1e-06,1e-06,2e-06,-1e-06,-2e-06,1e-06,0,-1e-06,0,0,-2e-06,0,0,-1e-06,0,0,0,-1e-06,-1e-06,0,0,1e-06,0,-2e-06,2e-06,0,-6e-06,1e-06,2e-06,0,3e-06,1e-06,-2e-06,1.3e-05,-1.1e-05,0,0,0,2.1e-05,-5e-06,1e-06,-2.6e-05,-2e-06,-2e-06,-1.1e-05,0,-9e-06,-1.1e-05,6e-06,1.7e-05,-2e-06,-1.7e-05,4e-06,-7e-06,-8e-06,-1.7e-05,5e-06,2e-06,0,-1.7e-05,-3e-06,1e-06,-3e-06,-1.3e-05,-2e-06,2e-06,-8e-06,-2e-06,-3e-06,0,-1e-06,-6e-06,1e-06,0,0,-2e-06,-1.9e-05,0,0,4e-06,1e-06,2e-06,1e-06,1e-06,-2e-06,-1e-06,-1e-05,0,-8e-06,2e-06,1e-06,3e-06,0,-1e-06,0,1e-06,0,0,8e-06,2e-06,-1e-06,-7e-06,0,-1e-06,1e-06,0,1.1e-05,2.9e-05,1.9e-05,-1e-06,-9e-06,2e-06,0,5e-06,-5e-06,-4e-06,-5e-06,0,1e-06
