0.020198,0.016632,0.014672,0.014845,0.015115,0.015207,0.01491,0.013754,0.013201,0.013008,0.014064,0.017122,0.020284,0.020801,0.022846,0.025961,0.027479,0.03236,0.034383,0.028822,0.024022,0.02768,0.035525,0.038054,0.039148,0.040878,0.039941,0.03685
0.025307,0.020287,0.01789,0.018437,0.018951,0.019038,0.019051,0.017968,0.017351,0.016798,0.018155,0.023113,0.027832,0.02833,0.031665,0.036131,0.037106,0.044724,0.048964,0.039761,0.032148,0.038827,0.050843,0.054465,0.056056,0.057063,0.05346,0.049266
0.034209,0.026719,0.023817,0.025084,0.025764,0.026051,0.026917,0.026005,0.025369,0.024111,0.026278,0.035396,0.043383,0.044084,0.049804,0.056318,0.056155,0.06934,0.077944,0.061401,0.048184,0.06092,0.081423,0.087911,0.090501,0.089661,0.080506,0.073573
0.040493,0.031619,0.028845,0.03067,0.031174,0.032089,0.034067,0.033551,0.033074,0.031249,0.034885,0.048582,0.060195,0.061309,0.068754,0.076253,0.074344,0.093069,0.106365,0.082426,0.063655,0.082453,0.111162,0.121668,0.126082,0.122551,0.106911,0.096855
0.040461,0.032791,0.03049,0.032129,0.032564,0.03445,0.037316,0.037099,0.036611,0.035272,0.040639,0.055975,0.068905,0.070662,0.078096,0.084262,0.080901,0.101807,0.117072,0.090298,0.069592,0.090374,0.121533,0.13565,0.142309,0.136364,0.11712,0.105686
0.036329,0.032037,0.029731,0.030215,0.030976,0.033555,0.036624,0.035897,0.034577,0.035329,0.041613,0.052885,0.062645,0.064868,0.07016,0.073108,0.0703,0.087376,0.099107,0.07826,0.061823,0.077002,0.101084,0.115487,0.123341,0.117959,0.10258,0.093431
0.037766,0.036667,0.034011,0.032156,0.032232,0.033657,0.036326,0.035164,0.032515,0.035533,0.04243,0.046122,0.048083,0.050428,0.054081,0.055309,0.055127,0.064344,0.068798,0.058396,0.050167,0.055724,0.066858,0.077983,0.086365,0.086114,0.078515,0.072094
0.050772,0.05227,0.048514,0.04013,0.038455,0.042378,0.046641,0.044437,0.040255,0.043048,0.047907,0.047757,0.046239,0.048848,0.052954,0.055217,0.057124,0.061415,0.059265,0.055737,0.056746,0.055528,0.058195,0.069125,0.080187,0.085729,0.082418,0.075875
0.080969,0.087362,0.07946,0.057228,0.053985,0.066135,0.07387,0.067421,0.059746,0.061858,0.063346,0.066115,0.069141,0.070385,0.073681,0.077788,0.082491,0.08991,0.087732,0.085532,0.092567,0.088789,0.091738,0.107562,0.124584,0.140627,0.137814,0.121958
0.134194,0.148372,0.13095,0.086956,0.083152,0.108504,0.123266,0.106756,0.089651,0.095014,0.094751,0.102505,0.113192,0.114071,0.117632,0.122785,0.128798,0.146243,0.148155,0.143913,0.158452,0.153849,0.162416,0.189545,0.220979,0.259129,0.253458,0.21221
0.205855,0.231377,0.198072,0.126397,0.123287,0.167608,0.194942,0.16027,0.126957,0.141778,0.142677,0.157182,0.175908,0.177222,0.185557,0.19075,0.19495,0.230457,0.238291,0.227768,0.25393,0.253069,0.276001,0.318535,0.369995,0.449097,0.442884,0.357569
0.268924,0.308948,0.261795,0.165437,0.162789,0.230337,0.273373,0.214521,0.162995,0.192889,0.197481,0.215556,0.242329,0.246636,0.260746,0.26608,0.270174,0.327861,0.337834,0.319689,0.362195,0.369814,0.415181,0.470385,0.540481,0.681222,0.682355,0.536792
0.284362,0.332157,0.284023,0.185996,0.184347,0.265898,0.317417,0.241954,0.181376,0.222324,0.232476,0.249039,0.279008,0.287763,0.306386,0.31589,0.323108,0.392684,0.397209,0.375757,0.432716,0.45131,0.519744,0.574558,0.64993,0.85395,0.873522,0.675205
0.240112,0.277644,0.243587,0.173309,0.172702,0.245476,0.287101,0.21766,0.169272,0.206827,0.220474,0.233485,0.257786,0.268731,0.286252,0.302939,0.317805,0.3763,0.372889,0.361372,0.417488,0.440893,0.518132,0.555302,0.614671,0.838117,0.875849,0.673803
0.217473,0.222702,0.187804,0.145791,0.144565,0.185516,0.198505,0.152371,0.133731,0.162918,0.175776,0.186955,0.202891,0.211666,0.220149,0.241883,0.269161,0.295534,0.293139,0.311433,0.350916,0.363682,0.419628,0.444095,0.482536,0.638407,0.669051,0.53472
0.29808,0.269528,0.204401,0.159744,0.156255,0.170573,0.155465,0.117718,0.114455,0.150904,0.17072,0.173309,0.18209,0.20439,0.219115,0.253827,0.29478,0.270293,0.257056,0.309268,0.330591,0.330819,0.371028,0.405427,0.444428,0.517497,0.55321,0.505885
0.428855,0.376862,0.283098,0.226633,0.217362,0.222738,0.194283,0.144018,0.131238,0.179031,0.211954,0.214119,0.225976,0.267079,0.29645,0.343287,0.401382,0.358483,0.327184,0.399664,0.418782,0.402779,0.457673,0.526479,0.561749,0.623905,0.700903,0.669433
0.547786,0.464358,0.35208,0.289919,0.270397,0.266589,0.237022,0.184692,0.164916,0.225788,0.277558,0.279878,0.287008,0.341517,0.382925,0.433325,0.513242,0.477482,0.415241,0.474544,0.493751,0.475503,0.560491,0.666995,0.682631,0.715047,0.836968,0.831392
0.640609,0.509669,0.39314,0.331158,0.302908,0.296528,0.264985,0.215714,0.204041,0.284127,0.351578,0.345451,0.340642,0.395714,0.439219,0.486159,0.570275,0.547891,0.463541,0.492273,0.510045,0.504382,0.635436,0.75065,0.721974,0.709432,0.844407,0.864982
0.695899,0.506802,0.40068,0.348898,0.322738,0.333917,0.286505,0.232876,0.245281,0.34009,0.416433,0.398857,0.377205,0.409886,0.444842,0.505691,0.573648,0.560043,0.491948,0.503891,0.499812,0.490793,0.666198,0.767302,0.724843,0.700912,0.796059,0.805848
0.69323,0.469661,0.383195,0.359235,0.336139,0.37301,0.311071,0.247876,0.289012,0.388691,0.458353,0.426548,0.375903,0.374735,0.41129,0.491522,0.559974,0.581678,0.540017,0.520163,0.479895,0.465973,0.648773,0.720669,0.701117,0.709617,0.781987,0.777761
0.574729,0.376258,0.326226,0.345798,0.337345,0.381551,0.314716,0.251604,0.313866,0.411086,0.451828,0.400831,0.341118,0.322255,0.353869,0.431608,0.50767,0.563454,0.55886,0.521638,0.449888,0.436928,0.579551,0.609681,0.60356,0.649286,0.708499,0.676099
0.406728,0.261723,0.25526,0.312462,0.316691,0.351903,0.312776,0.259135,0.304666,0.399216,0.412229,0.342783,0.311745,0.316007,0.331405,0.372998,0.421856,0.454353,0.470032,0.468648,0.42,0.417229,0.492493,0.487509,0.477814,0.541593,0.582476,0.49787
0.331811,0.233587,0.233815,0.294289,0.301448,0.322305,0.307349,0.270477,0.286077,0.341491,0.334478,0.27498,0.287271,0.341157,0.365952,0.374179,0.377653,0.35044,0.341156,0.39812,0.394834,0.373169,0.418213,0.416909,0.390392,0.433268,0.45209,0.400857
0.386602,0.290502,0.253209,0.291536,0.305178,0.338916,0.316712,0.270221,0.270834,0.287996,0.25954,0.21052,0.266866,0.368622,0.402637,0.38128,0.351581,0.319518,0.29712,0.370549,0.370013,0.317731,0.418998,0.450666,0.358655,0.337273,0.357333,0.399066
0.506534,0.391862,0.303596,0.330947,0.347144,0.393562,0.372588,0.305315,0.294423,0.285135,0.220838,0.181214,0.310461,0.449539,0.441098,0.382292,0.364744,0.361834,0.309958,0.368913,0.381783,0.323472,0.456073,0.53472,0.410621,0.295689,0.302922,0.410167
0.660995,0.483724,0.337883,0.382487,0.404599,0.437163,0.431746,0.365128,0.345133,0.317084,0.223048,0.186577,0.36841,0.508655,0.450775,0.399172,0.44557,0.476714,0.37285,0.385837,0.420299,0.38654,0.520459,0.656107,0.54797,0.357379,0.31828,0.401803
0.756822,0.502542,0.320876,0.397212,0.450139,0.457231,0.442856,0.379503,0.350818,0.321334,0.233432,0.19615,0.377146,0.500897,0.443437,0.455744,0.58961,0.622899,0.46321,0.443023,0.483644,0.47993,0.62331,0.815763,0.745001,0.482044,0.393499,0.440125
0.730462,0.46822,0.313905,0.393989,0.440892,0.430752,0.408161,0.330292,0.291279,0.283688,0.222824,0.192185,0.332067,0.438423,0.417966,0.506463,0.728589,0.730002,0.502229,0.452681,0.505755,0.544995,0.671548,0.896324,0.883843,0.567032,0.440912,0.487612
0.618007,0.443853,0.318254,0.347504,0.347759,0.339549,0.330173,0.245528,0.215268,0.236148,0.19439,0.184921,0.272479,0.34469,0.39051,0.539078,0.76182,0.704681,0.439998,0.369303,0.441021,0.516554,0.586768,0.798059,0.84567,0.538385,0.410141,0.489818
0.436363,0.383529,0.28732,0.272798,0.258066,0.270008,0.272917,0.203216,0.188767,0.205817,0.169188,0.171037,0.217205,0.241401,0.342725,0.515579,0.633294,0.534487,0.317597,0.256525,0.336266,0.408381,0.405225,0.546287,0.628159,0.415223,0.328176,0.443926
0.27623,0.272411,0.210764,0.202221,0.214547,0.244962,0.271652,0.222523,0.209592,0.209493,0.154058,0.153905,0.217303,0.218,0.300994,0.423667,0.404446,0.319219,0.221344,0.207692,0.266069,0.323684,0.293245,0.330986,0.413972,0.326649,0.272931,0.357696
0.205974,0.187821,0.157032,0.169215,0.188046,0.231286,0.27616,0.268286,0.256153,0.208452,0.129898,0.13788,0.213174,0.213867,0.243898,0.292026,0.213646,0.173698,0.165115,0.178362,0.204987,0.255309,0.256166,0.258999,0.308287,0.260653,0.237182,0.297334
0.161586,0.155023,0.149773,0.160681,0.168896,0.220398,0.281172,0.312766,0.300036,0.196223,0.105969,0.126755,0.193365,0.184796,0.165155,0.191858,0.151861,0.125664,0.13778,0.173594,0.181043,0.195654,0.197101,0.225768,0.267703,0.196984,0.175141,0.225545
0.147603,0.126931,0.128592,0.137346,0.134303,0.187488,0.254186,0.310921,0.304155,0.182348,0.09841,0.118276,0.16413,0.139756,0.103365,0.132234,0.1268,0.094207,0.11395,0.163456,0.152025,0.132505,0.139416,0.180054,0.20515,0.142295,0.116433,0.14646
0.143194,0.09988,0.09552,0.105913,0.104284,0.134329,0.182063,0.245569,0.246533,0.139896,0.078744,0.092622,0.12014,0.107262,0.088374,0.108359,0.111641,0.069415,0.088487,0.138181,0.109718,0.0736,0.082318,0.11637,0.128112,0.107842,0.093379,0.090096
0.120066,0.079119,0.073846,0.080352,0.099103,0.107463,0.122461,0.1677,0.159693,0.085957,0.055165,0.073034,0.087722,0.092554,0.088036,0.096473,0.099932,0.059154,0.067608,0.102878,0.077781,0.042434,0.046933,0.074529,0.087141,0.089572,0.084006,0.083427
0.088884,0.074781,0.085003,0.100591,0.131495,0.140805,0.141772,0.150058,0.123824,0.063956,0.057261,0.090054,0.087572,0.081114,0.083889,0.09671,0.091279,0.061617,0.059607,0.070178,0.057067,0.035766,0.047815,0.087877,0.103089,0.09483,0.097141,0.101513
0.057427,0.074209,0.108603,0.135765,0.175454,0.19289,0.193068,0.190449,0.138856,0.065795,0.069715,0.108096,0.101973,0.080084,0.071738,0.088338,0.087915,0.07711,0.069244,0.057742,0.049294,0.039877,0.0541,0.105707,0.123263,0.109103,0.122573,0.122816
0.033178,0.067803,0.123504,0.158217,0.200947,0.226336,0.230299,0.219458,0.146422,0.071917,0.078679,0.109386,0.1032,0.075302,0.067728,0.073771,0.080455,0.094462,0.087738,0.067297,0.053709,0.041108,0.052731,0.107211,0.130456,0.123227,0.141818,0.131857
