3.4e-05,-7.5e-05,-1e-06,2.5e-05,-0.000133,2.2e-05,2e-06,-0.000206,-0.002875,-0.001806,-0.001078,-0.000262,-0.013118,-0.02585,-0.014979,-0.00822,-0.00593,-0.010924,-0.008303,-0.005782,-0.001646,-0.00101,-0.000475,0.000346,0.000198,0.009645,-0.001294,-0.00951,-0.017469,-0.009834,-0.01417,-0.018096,-0.011695,-0.015426,-0.008961,-0.014718,-0.020577,-0.020176,-0.013074,-0.010485,-0.011363,-0.011945,-0.0105,-0.012227,-0.012188,-0.01526,-0.014633,-0.017123,-0.012297,-0.005738,-0.00684,-0.008643,-0.011418,-0.008124,-0.003744,-0.007524,-0.007063,-0.004334,-0.007306,-0.004216,-0.008609,-0.006642,-0.002849,-0.001479,-0.001078,-0.001153,-0.00231,-0.001783,-0.001948,-0.002504,-0.001116,-0.000416,-0.000339,9.9e-05,0.000756,0.000485,0.001055,0.000497,-0.002664,-0.002558,0.002023,0.001059,-0.002679,-0.001812,-0.001089,-0.001,-0.000401,-0.000346,-0.001835,-0.000522,-5.4e-05,-0.00047,-0.002024,-0.001151,-0.000266,0.000137,-0.000959,-0.00199,-0.000276,0.000145,0.000276,0.000108,9e-06,0.000171,9.7e-05,0.000122,-3.2e-05,-2.2e-05,1.5e-05,0.000119,6.3e-05,0.000332,0.000245,6.3e-05,0.000134,0.000195,0.000138,5.4e-05,-2.9e-05,0.000185,0.000105
4.1e-05,-5e-05,-0.000111,-8.7e-05,7.6e-05,4e-05,-4.9e-05,-0.000159,0.001571,0.00137,0.000468,5e-05,-0.000821,0.016424,0.008679,0.005799,0.003507,0.00112,0.003947,0.003047,0.002545,0.000426,0.00037,0.001507,0.000513,-0.013523,-0.013274,-0.00417,0.000409,0.003592,-0.008535,-0.001545,-0.003033,-0.002116,-0.000938,5e-06,0.005161,0.005238,-0.000442,0.000853,-0.000981,-0.005877,-0.003766,-0.00372,-0.005275,-0.009119,-0.003353,-0.000571,0.002421,0.002866,-0.002491,-0.00281,-0.004275,-0.001635,-0.007185,-0.004653,-0.003411,-0.001866,-0.002656,-0.002698,-0.001117,-0.001691,-0.002147,-0.000682,-0.00135,-0.000913,-1.4e-05,-0.001452,-0.001871,-0.000228,-5e-04,-0.000103,0.000185,-0.000115,-0.001743,-0.000583,0.000616,0.000363,0.000699,0.000646,-0.002813,0.000163,0.001768,0.000582,0.00052,8e-04,0.00064,-0.00052,0.000613,0.000738,0.000271,0.000264,0.001481,0.001347,0.000711,0.000398,0.000309,0.00146,0.001286,0.000536,0.000289,9.3e-05,9.9e-05,0.000134,2.7e-05,9.9e-05,7e-06,4.7e-05,-1.4e-05,-0.000244,-0.000172,6.7e-05,7.5e-05,8.7e-05,5.1e-05,6.9e-05,1.6e-05,-4.3e-05,-0.000107,-0.000173,4.4e-05
5.3e-05,2.9e-05,0.000112,6.7e-05,5.6e-05,-6e-06,-0.000155,5e-06,-0.001204,-0.000889,-0.000499,-0.000167,-0.000441,-0.004105,-0.005099,-0.002744,-0.001691,0.001688,-0.002633,-0.001855,-0.000964,-0.000868,-6e-05,0.000412,6.5e-05,-0.001811,-0.00615,-0.009541,-0.008001,-0.000826,0.005528,0.002268,-0.001221,0.000236,-0.003316,-0.002879,-0.006332,-0.007021,-0.01083,-0.00458,0.001936,-0.002273,0.001331,0.002289,0.002221,0.002805,-0.002021,-0.000912,-0.002727,-0.003,-2.8e-05,0.0023,-0.000798,-0.003752,0.004997,0.003438,0.004943,0.000731,-0.000945,-0.000337,-0.001751,-0.001818,-0.001686,-0.000277,0.001215,-1.9e-05,0.000139,-0.001654,4e-05,-0.000989,-0.000361,0.000116,-0.000398,-0.000258,-8.1e-05,-0.001096,-0.000509,-0.000365,-0.002519,-0.00198,-0.000492,-0.000867,-0.001047,0.000432,0.000597,0.000102,-0.000105,-0.000261,-3.7e-05,4.2e-05,-0.00013,-0.000184,-0.001274,-0.000773,-0.000123,2.5e-05,-0.000232,-0.001235,-0.000399,-0.000166,7.6e-05,-2e-05,2.2e-05,6.5e-05,4.5e-05,0.000142,0.000126,0.000146,6.4e-05,2.3e-05,6.6e-05,-7e-05,4.4e-05,0.000123,0.000166,-6.6e-05,-5.3e-05,-0.000141,-0.000107,-6.3e-05,0.000177
2e-06,-0.000119,-1e-04,-0.000175,-2e-06,7.5e-05,2e-05,0.000157,0.000447,0.000615,0.000272,0.000149,-0.000163,-0.000108,-0.001662,-0.000219,0.000569,0.001528,0.001056,0.000909,-0.000289,-0.001438,3.1e-05,0.000869,0.000324,5.2e-05,0.001466,0.00427,0.003976,-0.007584,-0.009935,-0.012312,-0.005058,-0.003701,-0.000227,0.00069,0.007162,0.005051,-2.6e-05,0.000235,0.000714,0.002802,0.001436,-0.00355,-0.003864,0.000819,0.005093,0.002189,0.001429,-0.000202,7.3e-05,0.000366,0.00275,1e-05,0.002322,0.00019,-0.00378,-0.003089,0.000257,-0.000533,0.001457,0.001103,0.001057,-0.000231,-0.000368,-0.000477,0.000174,0.000215,0.000162,0.000971,0.000452,0.000411,0.000412,3.1e-05,0.000569,0.000255,0.000594,-3e-06,-0.000381,-0.000205,-0.001947,-0.001698,-0.000272,-0.000141,7.1e-05,2.6e-05,0.00023,-0.00039,-9.3e-05,7e-05,-0.000142,0.000103,0.000478,0.000366,0.000315,-2.8e-05,0.000218,0.000618,0.000434,9.3e-05,0.000134,0.000131,-2.5e-05,1.6e-05,0,-2.6e-05,-0.000149,-7.3e-05,-4.1e-05,-1.4e-05,6e-06,-0.000147,-6.7e-05,-3e-06,4.9e-05,-0.00011,9e-05,-5e-05,7.7e-05,-6.5e-05,-3.3e-05
7.3e-05,1e-04,0.000181,7.2e-05,1.9e-05,0.000127,-2e-06,7.1e-05,0.000158,-0.000145,-0.000204,0.000136,0.000209,-0.000644,0.002935,0.001112,1.5e-05,-0.00084,-0.000323,-0.000519,0.000183,-0.001087,-0.001514,-8.1e-05,-0.000175,-0.000208,-0.010605,-0.004441,0.001476,-0.003533,0.006589,0.007993,0.002611,-0.000636,-0.003984,0.002452,-0.007907,0.002671,-0.000741,0.001623,-0.004107,-0.002726,-0.002251,0.003368,0.003333,0.003313,0.000443,0.002493,-0.003614,-0.001904,0.000584,0.001256,-0.002649,0.000663,-0.003902,-0.002996,0.000699,0.001715,0.000319,0.002324,-0.001313,-0.000435,-0.000983,0.000124,0.000299,-0.000374,-0.000301,0.000169,0.000334,3.2e-05,-7.4e-05,-0.000149,0.000425,-0.000113,0.000635,-0.000153,-0.000519,-0.000259,0.000288,0.000874,0.000212,-0.000132,-0.000175,0.000222,-7.9e-05,-0.000502,7.8e-05,9e-05,8e-05,-9.1e-05,-0.000203,-0.000338,-4.5e-05,-0.000159,-9e-06,2e-06,-2.7e-05,-0.000114,-6.3e-05,-0.000301,-4.8e-05,5.3e-05,5.1e-05,5.8e-05,3e-05,6.2e-05,0.000142,0.000186,2.1e-05,2.9e-05,0.000114,1.3e-05,0.000106,9.2e-05,8e-05,4.7e-05,0.000103,6e-05,8.8e-05,-2.3e-05,8.6e-05
0.00011,-5e-06,3.5e-05,6.6e-05,8.6e-05,2.7e-05,-3.5e-05,5.9e-05,-0.00013,0.000115,9.3e-05,1e-06,0.000173,0.001841,0.000387,-0.000631,-0.000362,0.000335,-0.001112,-0.000948,-0.000528,-0.00023,3.8e-05,-0.000125,-0.000371,-0.000213,0.003783,0.000746,-0.001014,-0.001522,0.000415,-0.004789,-0.005164,-0.001745,0.001085,0.000638,0.004224,0.001859,0.000509,0.000666,0.004407,-0.003178,-0.003039,-0.004705,-0.002125,-0.005566,-0.00441,-0.000686,0.000871,0.001531,-0.00079,-0.002144,-0.000292,-0.001295,0.000516,0.00106,0.000636,-0.000511,-0.00068,0.000963,-0.000302,0.00035,0.001367,0.000689,0.000181,0.000722,0.000456,0.000359,-0.000154,0.000548,0.000428,0.000104,-0.000288,-0.000191,-0.000223,-6.2e-05,-0.000183,-0.000266,-9.6e-05,-0.000501,-0.000836,-0.000181,0.000454,-4.3e-05,0.000225,0.000143,0.000232,-1.5e-05,0.000511,0.000188,2.7e-05,-6.3e-05,-4.5e-05,-7.8e-05,-5.3e-05,-0.000108,0.000221,0.000359,-5e-06,-0.000236,-1.4e-05,4.9e-05,-3.5e-05,-1e-06,-1e-06,6.9e-05,7.4e-05,-6.2e-05,-6.7e-05,-9.6e-05,4.8e-05,8.5e-05,-2.7e-05,6.4e-05,-4.3e-05,-1e-06,-6.7e-05,4.8e-05,-3.1e-05,6.1e-05,0.000107
-0.000212,-0.00013,-9.2e-05,-0.000163,-0.000178,-0.000162,-6.2e-05,1.2e-05,-6.7e-05,-0.000188,2.9e-05,-0.000122,-0.000237,-0.002857,0.000413,0.001396,8.5e-05,0.000352,-0.000114,0.00092,0.000721,0.000533,-0.000645,-0.00044,-0.000477,1e-04,0.001268,-0.001649,-0.003848,0.000902,-0.002361,0.003318,0.004827,0.002457,-0.002453,0.002188,0.00542,-0.002119,0.003605,0.003382,-0.003023,0.002211,0.001293,0.000599,0.001565,0.000661,0.000565,0.000885,0.000658,-0.001749,0.000799,0.000402,7.7e-05,0.001724,-0.000514,-0.002631,-0.001257,0.001991,0.001091,3.2e-05,0.000346,-0.000936,-0.000547,0.000477,-0.000545,-0.000163,-0.000159,-1.3e-05,-0.000494,-0.000249,-0.00046,-0.000228,-0.000394,1.3e-05,-0.000202,-0.000174,-0.001525,-0.000643,-0.00031,0.000811,0.000743,-0.000687,-0.000991,-0.000299,-0.000112,-0.000281,-6.1e-05,5.3e-05,-6.9e-05,-0.000332,-0.000183,1.6e-05,-0.000144,-0.000269,4.4e-05,-0.000154,-0.000119,-0.000113,5.7e-05,-0.000144,-0.000145,-3.5e-05,1.5e-05,-4e-06,-4.6e-05,-7e-06,2e-05,-5.7e-05,-5.5e-05,-3e-05,-0.000132,-9.3e-05,-0.000127,-9.1e-05,-0.000129,-0.00011,-5.5e-05,-4.3e-05,-9e-06,-7e-05,-8.1e-05
-6.5e-05,-3.6e-05,-1.2e-05,-9e-06,-1.1e-05,-4e-05,-0.000109,-5.1e-05,1e-06,7.7e-05,-5.1e-05,-6.5e-05,0.000109,0.002334,-6.3e-05,0.001044,-0.000739,-0.000101,0.000591,-0.001114,-0.000725,-0.000254,-0.000502,-0.00048,-0.000356,-4.8e-05,-0.001685,-0.001857,0.000369,-0.001644,-0.00363,-0.001183,-0.002261,0.000422,0.000895,-0.003374,-0.001183,-0.002232,-0.000719,0.000387,0.00122,-0.002709,0.000327,-0.001539,-0.00322,-0.002344,0.001172,-0.000174,-0.000198,0.001954,-0.000264,-8.1e-05,0.001878,-0.001032,-0.00065,-0.000913,-0.001226,-0.001846,-0.000595,-0.000819,0.000382,0.001657,0.001072,3.9e-05,-9.7e-05,-6.7e-05,-0.000461,8.1e-05,6.4e-05,-1e-06,-0.000285,-0.000155,-2.8e-05,-3.8e-05,-0.000187,2.9e-05,-0.000235,-0.000649,1.4e-05,-0.000764,0.00036,0.000115,0.000533,4e-05,0.000189,-0.000235,0.000131,-1.9e-05,-0.000121,-5e-05,3.8e-05,-0.000204,5.4e-05,-0.000219,-0.000156,-9.9e-05,7.5e-05,7.6e-05,-2.6e-05,-4.7e-05,-9.9e-05,-2e-06,-1.1e-05,-1.3e-05,-9.7e-05,-1.5e-05,8e-06,-1.3e-05,-3e-06,-2.5e-05,0,-7.7e-05,-0.000164,-0.000125,-4.8e-05,-9.8e-05,-0.000107,-2.8e-05,-9.2e-05,-8.6e-05,-0.000126
-2.3e-05,-3.4e-05,-5.9e-05,-4.5e-05,-2e-06,-4.8e-05,3.6e-05,9.4e-05,-5.5e-05,-5.1e-05,-4.6e-05,8.5e-05,9e-05,-0.000436,-0.000292,-0.002544,0.00048,-1.6e-05,3e-06,0.001429,0.000265,-0.000273,7.7e-05,-0.000574,0.000157,0.000316,0.000541,-0.004503,0.00303,0.00214,-0.003932,-0.003182,0.002429,6.2e-05,-0.001075,-0.000234,0.000923,-0.002866,0.001308,0.002889,-0.00135,0.001142,-0.001149,-0.000779,0.000388,3.5e-05,-0.000514,-0.000654,-0.000452,-0.002186,0.000225,-0.00062,0.00045,-5.3e-05,-0.001169,0.000828,0.002805,0.000843,-0.000234,0.001349,0.001079,-0.000124,-0.001046,-0.00044,-0.000209,-0.000253,0.000296,-0.000728,4e-06,0.000332,-9.8e-05,2e-05,-3.3e-05,-0.000281,-0.000138,9.7e-05,0.000579,0.000291,0.00018,0.000191,-0.00023,0.000352,-0.000133,6.5e-05,-2.8e-05,6.4e-05,5.6e-05,5e-06,-4e-06,-7.7e-05,-0.000103,-3e-05,-0.000141,-8.2e-05,-0.000118,-0.00015,0.000201,5.2e-05,-0.000135,-4.9e-05,-6.7e-05,-7e-06,3e-06,-1.2e-05,-2.4e-05,-1.5e-05,2e-06,-3.3e-05,-0.000111,-4.6e-05,-2.8e-05,-1.9e-05,-0.000103,-1.1e-05,-7.2e-05,-4.3e-05,-5.6e-05,-7.4e-05,7e-06,-2.5e-05,-2e-06
-2.8e-05,-8e-06,-3e-06,-1.8e-05,-2.2e-05,-1.1e-05,-6.6e-05,2.2e-05,5.8e-05,2.9e-05,0.000128,1.1e-05,-7.4e-05,0.000197,-0.000128,0.001289,-0.000197,0.000422,-3e-06,-0.000584,-3.1e-05,0.00036,0.000301,-0.000191,-0.000349,9.9e-05,-0.001876,0.001674,-0.003435,-0.002919,8.9e-05,-0.001588,0.000813,0.00137,-0.000733,-0.000217,-0.001932,0.001408,-0.002274,-0.005032,-0.000833,-0.000162,-0.003892,-0.000443,0.0011,0.001244,-0.00109,-0.000424,-0.000455,-0.001933,-0.000852,0.001462,-5.8e-05,0.000478,5.1e-05,0.000694,-0.001466,0.000723,-0.000301,-0.001817,-0.000937,-0.001302,-0.000751,0.000477,0.000157,0.000124,-0.000229,8.4e-05,0.000283,-0.000449,0.000386,0.000256,2.9e-05,-7.6e-05,5.5e-05,5.2e-05,0.000171,-1e-06,0.000345,2.6e-05,9.6e-05,-0.000286,0.000241,2.8e-05,-5e-06,-3.5e-05,4.2e-05,6.8e-05,-0.000141,4.9e-05,9.7e-05,-0.000186,3.1e-05,0.000175,3.4e-05,-7e-06,8.4e-05,3.9e-05,-8.2e-05,-9.2e-05,-1e-06,1.5e-05,-5.7e-05,1.1e-05,-2.8e-05,-1.4e-05,9e-06,-1.4e-05,3.5e-05,-4e-06,1e-05,3.3e-05,5.3e-05,1.6e-05,-1.9e-05,1.9e-05,8e-06,4e-05,1.6e-05,3.7e-05,-1.6e-05
4.1e-05,5.2e-05,4e-06,-4e-06,1.6e-05,-1e-05,3.8e-05,-7.3e-05,3.5e-05,-6e-06,-5.9e-05,2.7e-05,4.3e-05,-0.000601,-0.00031,-0.001211,-0.000428,0.000448,0.000197,0.000192,-0.000223,-0.000446,0.00024,0.00025,5.8e-05,3.3e-05,0.001292,0.003713,-0.001278,-0.001773,-0.000125,0.000246,-0.001207,-0.000483,0.001926,-0.001022,-0.000613,0.000588,0.000349,0.000837,-2e-06,-0.000261,0.003593,0.000734,-0.001616,0.000336,-6.1e-05,-0.000224,-0.000446,0.00059,0.000374,-0.000778,0.000431,-0.000727,-0.000637,4.7e-05,0.000456,-0.001319,0.000471,0.000397,0.000759,0.000214,0.000319,-0.000241,-0.000275,0.000113,-0.000378,4.6e-05,-9.2e-05,4.5e-05,2.3e-05,-0.000192,-1.7e-05,7.5e-05,0.000105,5e-06,-0.000142,4.2e-05,0.000181,-0.000186,-0.000399,5.4e-05,-0.00036,-7.4e-05,-8e-05,-2.5e-05,-0.000193,4e-05,1.4e-05,5e-06,9e-06,4.3e-05,-9e-06,-8.2e-05,-3.5e-05,-6.1e-05,3.8e-05,2.9e-05,1e-05,-6.6e-05,-4.6e-05,1.6e-05,5e-06,8e-06,-1.6e-05,-1.8e-05,2e-06,-9e-06,8e-06,-2.3e-05,-3.5e-05,1e-06,-7e-06,0,-3e-05,-1.4e-05,-1.7e-05,0,2.2e-05,0,2.7e-05
6e-06,-3.1e-05,-2.3e-05,-2.8e-05,-1.8e-05,-4.7e-05,-2.1e-05,-4.7e-05,1.7e-05,-8e-06,0.000135,1.6e-05,-0.000137,3.7e-05,0.001304,0.000852,0.000513,-0.000885,-0.000265,0.00039,-8.5e-05,0.000336,-0.00017,7.8e-05,-0.000105,-0.000175,-0.000142,0.001332,9e-04,0.001158,0.002285,0.000327,0.001466,-0.000345,-0.00108,-0.001164,0.001284,-0.00166,0.00037,-0.001934,-0.000797,0.000857,0.000647,-0.000691,0.00038,-0.000574,-0.000649,0.002454,-0.000965,-0.001193,-0.00124,-0.001624,-0.001097,-0.000134,0.000584,-0.000146,0.000621,0.001032,0.000639,-0.000165,-0.000201,4.7e-05,0.000297,-4.3e-05,-0.000139,1.9e-05,0.000188,-2.8e-05,3.5e-05,-0.000245,5.1e-05,3.2e-05,7e-06,7e-05,0.000184,-1.5e-05,-6.8e-05,-0.000146,-7.7e-05,-6.6e-05,0.000181,-1e-04,-0.000434,-0.000231,1.5e-05,-0.000137,2.9e-05,-7e-05,-0.000117,-1.8e-05,-1.4e-05,5.2e-05,-8.6e-05,-2.6e-05,5.7e-05,6.8e-05,-7e-05,-4.4e-05,7.9e-05,2.6e-05,3.1e-05,-1e-06,-1.9e-05,-1.2e-05,-3e-06,-5e-06,-8e-06,-1.5e-05,-1.2e-05,2e-05,1.8e-05,5e-06,3.4e-05,-2.3e-05,-3.3e-05,-2.1e-05,-1.1e-05,-3e-05,1.4e-05,-2.3e-05,-2.2e-05
-1.4e-05,-1.6e-05,-5e-06,-1.1e-05,-1e-05,5e-06,-4e-06,-6.5e-05,-1.1e-05,-5e-06,-0.00012,3e-06,9e-06,0.000199,-0.000789,-0.000345,-0.000783,0,0.000146,-0.000209,0.000143,-0.00026,-0.000138,1.3e-05,9.4e-05,3.5e-05,-0.000741,-0.000824,-0.001862,0.001885,0.001013,0.000488,-0.00087,-0.000765,0.000687,0.001042,-1.1e-05,0.000949,-1.2e-05,0.001754,-0.000445,-0.000557,0.000668,0.000698,-0.00027,-0.001267,0.000521,-0.002266,-7.8e-05,0.001452,0.000705,0.000336,0.000447,0.00033,0.001207,-0.000232,-0.000316,0.000637,-0.000347,0.00028,0.000207,-0.00083,-0.000147,-6.3e-05,-0.000107,-0.000177,-5.3e-05,4.8e-05,-1e-06,4.3e-05,-0.000192,-4.1e-05,-3.4e-05,-1.1e-05,6.2e-05,-1.8e-05,-2.4e-05,0.000105,-8.6e-05,2.5e-05,6e-06,8.8e-05,-0.00029,-0.000171,-5.6e-05,-0.000142,-0.000227,0.000125,3.3e-05,-0.000141,-1.8e-05,7.5e-05,5.7e-05,3e-06,-7.6e-05,-8.9e-05,-4.2e-05,-1.9e-05,-6.7e-05,-7.9e-05,-1.6e-05,-1.3e-05,-1.6e-05,-1.8e-05,-1e-05,-3.9e-05,-9e-06,-1.4e-05,-1.3e-05,-1.4e-05,4e-06,-2e-06,-4e-06,1.1e-05,-3e-05,4e-06,0,-4e-06,1e-05,-2e-05,1.1e-05
1.4e-05,2.2e-05,1.9e-05,-4e-06,8e-06,8e-06,4e-06,9e-06,4e-05,-1.1e-05,4.2e-05,-6e-05,5.7e-05,-0.000153,-0.000265,0.000129,0.000349,-0.00011,0.000343,-3.1e-05,0.000277,0.000282,8.8e-05,-0.000237,-0.000134,-5.4e-05,0.000385,0.000178,0.000191,-0.000703,0.001441,0.001194,0.000308,0.000988,-0.000511,9.9e-05,-5.4e-05,0.000308,-0.000412,-0.001456,-0.000124,0.000446,0.000354,0.001002,-0.000489,0.000507,-3e-06,0.000253,0.000937,7.9e-05,-0.000527,-0.000212,0.000198,4.6e-05,-0.001362,0.000108,0.000486,-0.001241,-0.000122,-5.5e-05,-0.000317,0.000479,-2e-04,-5.1e-05,-4e-05,0.000117,4.4e-05,0.000113,-4e-05,-2.2e-05,3.1e-05,3e-05,-4e-06,-3.6e-05,-4.3e-05,1.2e-05,-0.000135,-0.000137,-2.2e-05,-0.00012,0.000118,-0.000154,0.000326,-4.9e-05,-4.2e-05,0.00011,-5.6e-05,2.9e-05,-1e-06,-9e-06,-1.4e-05,-2.2e-05,-3.4e-05,-1.3e-05,2.9e-05,4.6e-05,1e-05,1.4e-05,1.6e-05,3e-05,-1e-05,1.8e-05,-3.3e-05,7e-06,5e-06,-3.2e-05,-2e-06,-3e-06,-5e-06,5e-06,-2e-06,1.3e-05,-3e-06,5e-06,2.3e-05,-2e-06,3e-06,0,6e-06,-5e-06,-3e-06
-1e-06,-1.8e-05,-1.3e-05,1e-06,-1e-06,-6e-06,-3e-06,-3e-06,2.9e-05,0,6e-06,-2.1e-05,8e-06,0.000422,3.8e-05,-3e-05,0.00015,-0.000134,3.8e-05,0.000165,-0.000446,-0.000124,-0.000111,8.3e-05,5.7e-05,-0.000234,-0.000756,-0.000843,0.002227,-0.001799,-0.00055,-2e-05,0.000607,0.00025,-0.000124,-2.2e-05,-8e-05,-0.001018,-5.5e-05,0.00121,0.001421,-7.7e-05,-0.000518,0.000404,0.000337,-0.00045,0.000258,-0.000133,-0.000178,6.8e-05,0.000363,0.000274,-0.000471,3.1e-05,0.000277,0.00027,-0.000242,0.000424,0.00029,7e-06,0.000155,0.000159,0.000153,3.4e-05,0.000109,1.4e-05,1.1e-05,-1e-05,-2.2e-05,6.3e-05,-7e-06,4.8e-05,-1.6e-05,1e-05,6.1e-05,-9e-06,4.2e-05,0.000237,-9.7e-05,5.7e-05,-8.5e-05,5.2e-05,0.000392,-0.000145,4.9e-05,-5.2e-05,3.2e-05,3e-05,0,2.9e-05,-2e-06,4e-06,2.7e-05,-3e-06,3e-06,-1.5e-05,-6.8e-05,2e-06,-2.2e-05,-2.8e-05,-1.4e-05,7e-06,-2.6e-05,-3e-06,-1e-05,5e-06,0,0,-4e-06,1.7e-05,0,-4e-06,2e-06,-1e-05,3e-06,-4e-06,-8e-06,-5e-06,1e-05,1e-05,3e-06
6e-06,-6e-06,1.3e-05,-1e-06,-1e-06,9e-06,0,3e-06,1e-06,-2e-06,-3e-06,2.3e-05,-7e-06,-0.000314,0.00024,-0.000112,-0.000283,0.000172,7e-06,-0.000355,0.000367,5.3e-05,0.000105,3.3e-05,1.4e-05,-6.3e-05,0.000554,0.000166,-0.000195,0.001261,-0.000377,0.000335,-0.000332,-0.00047,0.000276,0.000183,-0.00056,-7.3e-05,-0.000543,-0.000341,-0.000271,0.000144,-0.000303,5.7e-05,-0.000603,0.000352,-0.000236,-3.7e-05,-0.000235,-0.00015,-0.000361,0.000358,-4.1e-05,4.8e-05,-0.000518,-0.000189,3.5e-05,8.6e-05,-0.000283,0.000234,4.5e-05,0.00012,2.4e-05,-8.2e-05,0.000146,3.6e-05,-7.5e-05,3.1e-05,9.8e-05,3.5e-05,-0.000119,-4.5e-05,1.8e-05,5.4e-05,-6e-06,-2e-06,0.000129,-0.000152,-8.1e-05,-4.1e-05,3.8e-05,3.6e-05,-0.000274,-8.4e-05,-6e-06,-2e-06,-1.4e-05,4.6e-05,1.4e-05,1.7e-05,1.2e-05,1e-06,2.3e-05,8e-06,-1e-06,-2.2e-05,-3e-05,2e-06,-2e-06,1.6e-05,-2.5e-05,-5e-06,-1.3e-05,-1e-06,-7e-06,-4e-06,-6e-06,-2e-06,1.2e-05,0,2e-06,-3e-06,-9e-06,6e-06,-8e-06,7e-06,-2e-06,-1e-06,-8e-06,-2e-06,-8e-06
-1.7e-05,1.1e-05,-6e-06,-2e-06,4e-06,-5e-06,5e-06,1.2e-05,-2e-06,0,1e-05,-4.4e-05,-1e-06,5.3e-05,-7.6e-05,0.000544,0.000307,8.4e-05,1.9e-05,0.000303,-7e-06,-3.7e-05,-7e-06,-5.5e-05,-1.4e-05,-0.000119,-0.000241,-5.3e-05,-0.001088,0.001041,-0.000447,-0.000333,-0.000238,-3.2e-05,-0.000398,0.000341,-0.000174,0.000208,0.000306,0.000114,0.000112,-8.4e-05,3.1e-05,-0.000806,-3.9e-05,0.000297,-0.000438,-0.00013,-0.000257,3.4e-05,0.000265,-5e-05,-0.000441,-7.9e-05,0.000394,-0.000149,-0.000249,-8.4e-05,-7.1e-05,-0.000147,0.00016,-5.3e-05,-0.000194,2.3e-05,2e-05,-6.1e-05,6.5e-05,0.000115,5.6e-05,-2.7e-05,2.7e-05,-6e-06,-1.3e-05,-3.3e-05,2.6e-05,-1.4e-05,2e-06,1.3e-05,-5e-05,4.3e-05,-3e-05,-6.8e-05,0.00011,9e-06,-1.9e-05,-2.2e-05,2.6e-05,1.3e-05,1.2e-05,2.6e-05,9e-06,2.8e-05,-2.9e-05,2e-06,-1.4e-05,1e-05,-3.7e-05,-8e-06,7e-06,-3.6e-05,2.1e-05,-1e-05,-1.2e-05,-2e-06,-3e-06,1e-06,1e-06,-2e-06,-1.3e-05,-5e-06,-2e-06,3e-06,-5e-06,-4e-06,-6e-06,5e-06,-6e-06,4e-06,3e-06,0,-7e-06
6e-06,-4e-06,0,-5e-06,1e-06,-5e-06,-6e-06,6e-06,1e-06,1e-06,-1.7e-05,3.8e-05,-9e-06,-0.000184,-0.000231,-0.000557,-4.3e-05,-0.000119,-7e-05,-3.2e-05,1.3e-05,3.3e-05,2.4e-05,-3.3e-05,-6.3e-05,-2.8e-05,-0.000331,0.000186,0.000174,-0.000455,0.000555,0.000384,0.000128,-8.6e-05,0.000344,-0.000122,-0.000405,-2.2e-05,0.000396,0.000714,-0.000533,0.000259,-0.000174,-5.3e-05,0.000281,0.000131,0.000377,0.000494,-0.000128,0.000198,-0.000201,0.000419,0.000101,0.000232,8.9e-05,0.000199,-7.8e-05,1.6e-05,9.6e-05,3e-06,-7.9e-05,7.7e-05,0.000134,3.2e-05,-5.1e-05,2.3e-05,2e-06,-9.8e-05,5.6e-05,6.3e-05,4.1e-05,-4.6e-05,1.5e-05,-6e-06,-9e-06,-6e-06,-5.8e-05,5.2e-05,-1.2e-05,5.6e-05,4.3e-05,1e-06,2.6e-05,1.2e-05,1.4e-05,-1.9e-05,-1e-06,2.3e-05,2e-06,-1e-06,1e-06,-2.5e-05,2e-06,1.6e-05,3e-06,-1.4e-05,-1.8e-05,-4e-06,-8e-06,1e-06,-1.2e-05,-3e-06,0,3e-06,-6e-06,-2e-06,-1e-06,-2e-06,-6e-06,4e-06,-3e-06,4e-06,5e-06,3e-06,-5e-06,-4e-06,-3e-06,3e-06,7e-06,-1e-06,2e-06
4e-06,-5e-06,-5e-06,-4e-06,-9e-06,-4e-06,4e-06,0,-7e-06,-4e-06,1.8e-05,-2.2e-05,3e-06,0.00021,0.000279,0.000262,-0.000151,7.4e-05,7e-06,-0.000146,-0.000102,-1.5e-05,-2e-05,-2.1e-05,5.5e-05,-1.9e-05,0.000266,0.001101,-0.000207,-0.000234,-0.000339,-0.000753,-0.000787,-0.000172,-2e-04,-0.000132,0.00011,0.000314,-0.000644,9.5e-05,4e-05,-0.000441,2.9e-05,0.000101,-0.000371,-0.000163,-9.1e-05,-0.000564,0.00029,-0.000465,1.5e-05,-3.5e-05,-6.9e-05,4e-06,2e-05,4.7e-05,0.000224,-0.000267,-3.8e-05,-3.1e-05,-0.000117,-0.000128,-0.000169,5.3e-05,-7.4e-05,-1e-05,-1.5e-05,-4.1e-05,-5.8e-05,9e-06,6.1e-05,3.8e-05,1.6e-05,-1.9e-05,-4e-06,1.1e-05,-3.7e-05,-5.1e-05,-4.5e-05,6e-06,1e-06,-6e-06,-7.4e-05,2.5e-05,-1.3e-05,-9e-06,6.1e-05,-1.6e-05,-8e-06,-5e-06,-1.9e-05,-1e-05,1e-05,-1.6e-05,0,3e-06,-1.3e-05,2e-06,-3.6e-05,-1.7e-05,3e-06,-7e-06,-4e-06,-1e-06,-3e-06,6e-06,1e-06,-1e-06,7e-06,-5e-06,5e-06,-2e-06,3e-06,-5e-06,-2e-06,-3e-06,-1e-06,-2e-06,0,-3e-06,4e-06
6e-06,8e-06,3e-06,-3e-06,1e-06,-2e-06,-1e-05,4e-06,-5e-06,-2e-06,-1.9e-05,1.4e-05,-2e-06,-1.3e-05,-0.000127,-0.000143,0.000147,-0.000104,4.1e-05,4.3e-05,8.9e-05,-2e-06,-3.3e-05,7.7e-05,-5.4e-05,-7e-06,-0.000392,0.000134,-0.000139,0.00032,0.000522,0.000302,0.000526,0.000441,0.000174,0.000116,0.00031,-0.000424,0.000476,-0.00036,5.3e-05,0.000493,0.000283,2.1e-05,0.000294,3.4e-05,0.000146,0.000371,4.2e-05,0.000313,-7.3e-05,-0.000312,0.000128,0.000132,-0.000216,3.3e-05,0.000106,9.2e-05,5.7e-05,-9e-05,-4.1e-05,1.5e-05,7.2e-05,-6.3e-05,-1.5e-05,-4e-06,2e-05,1.5e-05,-6e-06,-2.7e-05,-4e-06,-1e-05,4e-06,2.8e-05,-1.5e-05,3e-06,-1.7e-05,-2.5e-05,-4e-05,5.2e-05,-1e-05,7e-06,-4.6e-05,1.8e-05,0,-3.5e-05,-7e-06,1.5e-05,-9e-06,-3.3e-05,1.3e-05,1e-05,-1.9e-05,-1.1e-05,9e-06,-4e-06,2e-06,-1e-06,2.9e-05,2e-06,7e-06,3e-06,0,0,-4e-06,2e-06,0,-1e-06,-4e-06,1e-06,-3e-06,-1e-06,2e-06,0,-5e-06,0,-2e-06,0,5e-06,-6e-06,-1e-06
1e-06,-6e-06,-4e-06,-4e-06,0,0,9e-06,7e-06,0,1e-06,1.2e-05,-1.1e-05,1e-06,-4.6e-05,3e-06,-1.5e-05,-0.000139,3.6e-05,2.9e-05,-3.8e-05,-7.9e-05,1.2e-05,2.2e-05,3.3e-05,2.6e-05,-7e-06,0.000288,-0.000115,0.000128,0.000139,0.000317,-0.000202,-0.000313,-0.000391,-7.7e-05,-0.000182,-4.7e-05,9e-05,0.000172,-5.4e-05,-1e-04,-0.000223,0.00035,0.000134,-0.000199,-0.000163,-0.000149,-0.000124,6.5e-05,-0.000197,0.000182,1.9e-05,3.2e-05,7.9e-05,5.2e-05,-5e-06,-0.000175,8.6e-05,4.4e-05,2.3e-05,4.1e-05,0.000125,-2e-06,2.8e-05,-1.6e-05,-7e-06,-5.4e-05,0,-3e-05,1.3e-05,-6e-06,1.4e-05,-1.3e-05,1.4e-05,0,-1e-06,-1e-06,2e-05,-1.9e-05,-3e-06,1e-06,-1.4e-05,0.00013,1e-06,-3e-06,1.4e-05,1.1e-05,-1.5e-05,-5e-06,-9e-06,-7e-06,1.4e-05,6e-06,1.1e-05,-8e-06,2e-06,1.5e-05,3e-06,-2e-06,-1.3e-05,-8e-06,0,-2e-06,-1e-06,1e-06,-2e-06,2e-06,-2e-06,-6e-06,2e-06,3e-06,3e-06,1e-06,2e-06,1e-06,-1e-06,1e-06,-3e-06,1e-06,-2e-06,2e-06
0,-2e-06,2e-06,-3e-06,-1e-06,0,-4e-06,2e-06,-1e-06,-1e-06,-1e-05,1e-06,-1e-06,4.9e-05,-8e-06,6.4e-05,3.5e-05,2.2e-05,-2.5e-05,-3.8e-05,1.5e-05,-1.3e-05,-3.5e-05,-1e-05,-1.8e-05,-1e-06,-0.000216,-0.000449,0.000222,1.6e-05,0.000494,0.000249,-4e-05,0.000155,-0.000172,-5.7e-05,-4e-05,0.00014,-0.000165,-0.000332,-5.2e-05,-3.2e-05,-8.2e-05,-8.6e-05,2.8e-05,0.000187,-3.7e-05,6e-05,4.1e-05,0.000157,-0.000175,-5.7e-05,-7.9e-05,2e-06,0.000269,5.1e-05,9.6e-05,-0.000188,-2.6e-05,-0.000116,3.7e-05,-4e-06,-1.3e-05,9e-06,1.3e-05,-1e-05,1.7e-05,5e-06,5.5e-05,-2.4e-05,2.1e-05,-1.8e-05,0,-3e-06,3e-06,-5e-06,3.9e-05,2.2e-05,-9e-06,-2.1e-05,-1.7e-05,-9e-06,-1.6e-05,-2.3e-05,-1.1e-05,-1.4e-05,7e-06,1.3e-05,-9e-06,7e-06,2e-06,7e-06,7e-06,-5e-06,-7e-06,-6e-06,1.5e-05,2e-06,0,-2e-06,-2e-06,4e-06,0,1e-06,-1e-06,-3e-06,1e-06,0,-3e-06,1e-06,-2e-06,0,-1e-06,-2e-06,-1e-06,-1e-06,-1e-06,2e-06,0,0,1e-06
-2e-06,2e-06,-1e-06,-2e-06,3e-06,1e-06,1e-06,-1e-06,0,0,1e-06,-3e-06,0,-0.000146,7.7e-05,-5.5e-05,5.1e-05,1.8e-05,-2e-05,0.000128,3.2e-05,2.4e-05,3.9e-05,-2.3e-05,1.8e-05,4e-06,-0.000118,-0.000145,-0.000249,5.5e-05,-0.000169,-3e-06,-0.000299,1.1e-05,0.000167,6.2e-05,-0.00015,-0.000166,0.000314,6.9e-05,-0.000138,0.000263,-0.000281,8.4e-05,-0.000117,9.1e-05,2.8e-05,-0.000302,-0.000143,0.000148,0.000144,-0.000161,6.4e-05,0.000111,-0.000146,-5e-06,-7.7e-05,0.000134,-2.3e-05,8.4e-05,-3e-05,-0.000142,1.4e-05,-3e-06,4e-06,2.9e-05,1.3e-05,6e-06,1e-06,-2.1e-05,-1.1e-05,4e-06,-1e-06,-8e-06,4e-06,-5e-06,3.5e-05,-8e-06,2e-06,2.8e-05,2.3e-05,1e-05,-8e-05,-1.4e-05,7e-06,-1.5e-05,-2.1e-05,-1.6e-05,-3e-06,2.5e-05,1e-06,6e-06,-1.1e-05,1e-06,7e-06,4e-06,9e-06,0,1e-06,-1.6e-05,-8e-06,2e-06,-4e-06,0,-3e-06,0,0,0,0,2e-06,3e-06,-2e-06,-1e-06,2e-06,1e-06,0,-1e-06,0,-1e-06,-1e-06,1e-06
-6e-06,-3e-06,1e-06,-1e-06,0,1e-06,-1e-06,-1.2e-05,-1e-06,2e-06,-1e-06,5e-06,0,8.4e-05,-0.000152,6.1e-05,-5.2e-05,4e-06,-2.9e-05,-0.000151,-2.8e-05,-2.7e-05,9e-06,-3.4e-05,-3e-05,-2e-06,0.000159,0.000184,-0.000102,1.3e-05,-3.4e-05,0.000221,7.3e-05,-7.6e-05,-0.000134,3.7e-05,5.4e-05,-0.000101,-6.3e-05,-9.3e-05,8.8e-05,-0.000213,-0.000124,3.4e-05,-8e-06,0.000151,-0.000116,0.000353,3.1e-05,-0.000168,-8.7e-05,-7e-06,-0.000117,-4.9e-05,0.000141,-0.000123,-8e-06,0.00012,1.4e-05,-3.9e-05,-6.3e-05,1e-06,-7.3e-05,-5e-06,-3e-06,-1.2e-05,-2.2e-05,-2e-05,3.2e-05,-1.5e-05,-6e-06,2e-06,-4e-06,-6e-06,-2e-06,3e-06,-1.9e-05,-3.9e-05,0,-2.1e-05,-1.9e-05,-8e-06,-5.1e-05,-6e-06,1e-05,1e-06,-2e-05,1e-06,2e-06,1e-06,-5e-06,-6e-06,7e-06,7e-06,-2e-06,-7e-06,9e-06,3e-06,-5e-06,8e-06,5e-06,0,-1e-06,0,-2e-06,0,0,0,0,1e-06,-3e-06,0,-1e-06,0,-2e-06,0,-2e-06,-5e-06,-3e-06,-1e-06,-6e-06
0,0,0,-2e-06,1e-06,-1e-06,-1e-06,-6e-06,-3e-06,-1e-06,5e-06,0,-1e-06,-5e-05,4e-05,-0.000159,-1.7e-05,-2.8e-05,8e-06,2.6e-05,2.6e-05,2.2e-05,-1.8e-05,1.2e-05,4e-06,1e-06,-0.000253,8.1e-05,0.000286,-0.000256,-0.000339,1.1e-05,-8.5e-05,6.2e-05,0.000145,-2.3e-05,0.000294,0.000122,-9.5e-05,-0.000121,1.2e-05,0.000151,-1.6e-05,-8.5e-05,-0.000129,8e-06,0.000202,-0.000122,-5.6e-05,8.1e-05,3.5e-05,3.5e-05,0.000125,-4e-06,-0.000308,6.5e-05,-0.000128,-0.000315,2e-05,3.3e-05,-1.6e-05,0.000135,7.4e-05,-4.4e-05,-1.6e-05,0,5e-06,7e-06,-1.9e-05,2.4e-05,-1e-05,-8e-06,2e-06,1.6e-05,-2e-06,4e-06,-3.6e-05,2.8e-05,5e-06,-2e-06,2e-05,-2e-06,5.1e-05,-6e-06,-5e-06,-2.4e-05,-1.5e-05,-7e-06,6e-06,-6e-06,8e-06,0,2e-06,-2e-06,3e-06,4e-06,8e-06,0,0,-1.2e-05,-3e-06,-3e-06,-4e-06,0,-1e-06,-1e-06,0,0,0,0,1e-06,2e-06,-1e-06,1e-06,-1e-06,0,-1e-06,4e-06,0,-2e-06,-1e-06
1e-06,3e-06,-1e-06,-1e-06,-1e-06,-1e-06,2e-06,-8e-06,-3e-06,0,-1.3e-05,3e-06,1e-06,0.000135,6.9e-05,0.00032,6.6e-05,-1e-05,3e-05,2.6e-05,-9e-06,-1.6e-05,7e-06,2e-06,-1e-06,3e-06,0.00016,0.000225,-8.6e-05,0.000111,1.7e-05,9e-06,0.000388,-0.00011,-0.000124,6.3e-05,1e-05,6.7e-05,0.000217,-7.6e-05,0.000121,1.8e-05,0.000169,-4.1e-05,7.1e-05,-4.8e-05,-9.5e-05,-5.2e-05,5.4e-05,-6.7e-05,-7.2e-05,9.8e-05,-4e-06,6.1e-05,0.000173,3.4e-05,4.8e-05,0.000147,-5.3e-05,2.2e-05,1e-05,-8.7e-05,-3.3e-05,2.2e-05,-9e-06,-9e-06,-1.6e-05,4.1e-05,-7e-06,-2e-06,-7e-06,7e-06,2e-06,-5e-06,-1e-06,2e-06,-1e-05,-4e-06,1.8e-05,5e-06,-2.3e-05,0,4.1e-05,-2.2e-05,1e-05,3e-06,-1.2e-05,-3e-06,5e-06,-1.1e-05,-1.1e-05,9e-06,-9e-06,-2e-06,-4e-06,-4e-06,6e-06,-1e-06,6e-06,-1e-06,2e-06,-1e-06,-1e-06,0,-2e-06,-2e-06,0,0,-5e-06,0,-1e-06,-1e-06,2e-06,-1e-06,0,0,-2e-06,-1e-06,0,0,2e-06
2e-06,-1e-06,2e-06,-1e-06,-2e-06,-1e-06,-1e-06,1e-06,-3e-06,0,9e-06,1e-06,0,-8.5e-05,-6e-06,-0.000257,-8.7e-05,-1.4e-05,-2.4e-05,-4.4e-05,5e-06,1.5e-05,-1.7e-05,-3e-06,6e-06,-3e-06,-0.000157,4.8e-05,-0.000109,0.000283,-8.4e-05,4.5e-05,-0.000368,0.000105,8.5e-05,1e-05,-2.1e-05,-0.000167,-0.000174,7e-06,-5e-06,-3.9e-05,2.3e-05,3.6e-05,-0.000218,-7.3e-05,-5.5e-05,1.7e-05,8.3e-05,4.6e-05,9.9e-05,0.000128,2.4e-05,-3.4e-05,2e-05,9e-05,0.000112,0.000133,1e-05,-8e-06,1.1e-05,8.9e-05,5e-06,5e-06,2e-06,9e-06,8e-06,-1.8e-05,-2.5e-05,-1.1e-05,1e-06,-2e-06,-2e-06,1e-06,1e-06,-1e-06,1e-05,-1.5e-05,9e-06,-2.4e-05,1.7e-05,-5e-06,-2.5e-05,-3.2e-05,-5e-06,-5e-06,-1.8e-05,-7e-06,4e-06,-3e-06,9e-06,-1e-06,6e-06,-4e-06,4e-06,-5e-06,2e-06,0,-3e-06,-7e-06,1e-06,0,-3e-06,0,-2e-06,-1e-06,-1e-06,-1e-06,0,1e-06,0,-1e-06,1e-06,-1e-06,0,0,0,-1e-06,0,-2e-06,2e-06
2e-06,-2e-06,-2e-06,-2e-06,0,0,-2e-06,3e-06,-2e-06,0,-5e-06,-2e-06,0,7e-06,-6.6e-05,0.000133,9.7e-05,1.1e-05,-9e-06,5.5e-05,-1e-05,-1.2e-05,5e-06,1e-05,-1.6e-05,1e-06,-3.9e-05,8.2e-05,0.000299,-0.000121,0.000168,-2.3e-05,0.000219,1.9e-05,2.2e-05,-1.2e-05,-1e-04,9.5e-05,-3.8e-05,0.00034,8.2e-05,0,-7.5e-05,2.5e-05,0.000205,-2.1e-05,3.6e-05,7.8e-05,-0.000101,-0.000122,-8.2e-05,4.7e-05,2.3e-05,5e-06,1.6e-05,-9.5e-05,-5.4e-05,-0.000136,3.3e-05,-1.1e-05,-2.9e-05,-2.3e-05,-8e-06,-6e-06,-3e-06,2e-06,2e-05,-1.2e-05,1.1e-05,1.2e-05,5e-06,3e-06,5e-06,-7e-06,-1e-06,-4e-06,9e-06,1e-06,1e-06,7e-06,-1e-05,-2e-06,3.1e-05,-2.1e-05,-1.2e-05,-8e-06,1.7e-05,-3e-06,3e-06,1e-06,-2e-06,-3e-06,0,-1e-06,-1e-06,7e-06,-2e-06,-1e-06,-6e-06,-4e-06,-3e-06,1e-06,-1e-06,0,-1e-06,1e-06,0,0,1e-06,0,0,1e-06,1e-06,2e-06,-1e-06,0,0,1e-06,1e-06,-2e-06,-1e-06
3e-06,0,2e-06,-2e-06,0,0,2e-06,4e-06,-2e-06,1e-06,-2e-06,-3e-06,0,-1.8e-05,2e-05,-7.4e-05,-7.1e-05,1.6e-05,-2e-06,-2.3e-05,7e-06,8e-06,6e-06,6e-06,1.9e-05,0,7.1e-05,-7.5e-05,-0.000169,-0.000258,0.000106,-4.7e-05,-0.00021,-8.7e-05,-7.1e-05,4e-06,-0.000112,1.5e-05,0.000122,-6.9e-05,-2.6e-05,9.7e-05,1.7e-05,-6.5e-05,-8.7e-05,4e-05,-2.1e-05,-0.000157,-5.4e-05,0.000113,6.4e-05,-2.8e-05,-8.9e-05,1.7e-05,-9.1e-05,4.3e-05,-4.1e-05,7.1e-05,-1.6e-05,-4.1e-05,-9e-06,-3.9e-05,-5e-06,-6e-06,2.1e-05,-5e-06,-1.2e-05,2e-06,1.2e-05,1.9e-05,5e-06,-5e-06,-1e-06,7e-06,0,-1e-06,1.4e-05,2.3e-05,5e-06,5e-06,7e-06,1e-06,-5.9e-05,-1.2e-05,1e-05,-7e-06,2e-06,-6e-06,0,2e-06,-1e-06,3e-06,-8e-06,5e-06,2e-06,-7e-06,-5e-06,0,3e-06,-2e-06,1e-06,0,-3e-06,0,1e-06,1e-06,0,0,-2e-06,2e-06,0,1e-06,0,-1e-06,0,0,0,-1e-06,-2e-06,-1e-06,1e-06
-3e-06,0,-1e-06,-1e-06,-1e-06,-1e-06,-3e-06,4e-06,-1e-06,0,6e-06,-1e-06,0,-2.4e-05,6.2e-05,2.4e-05,1.1e-05,1e-06,-1.1e-05,-3.3e-05,-1.2e-05,-4e-06,4e-06,1e-06,-1.9e-05,-2e-06,-0.000159,-0.000225,-0.000201,4.3e-05,0.000198,1.5e-05,0.000192,4.6e-05,5.6e-05,7e-06,8.8e-05,-2.4e-05,-0.000176,8.5e-05,-2e-05,-0.000139,5.4e-05,-1.4e-05,3.6e-05,6.2e-05,7.9e-05,0.00017,-2e-05,0,-5.5e-05,2.3e-05,4e-05,-2.3e-05,-8e-06,-2.8e-05,5.2e-05,-0.000108,1.4e-05,1e-06,8e-06,-2.3e-05,3.7e-05,1.4e-05,-3e-06,1e-06,1e-06,-4e-06,1.8e-05,-2e-06,1.1e-05,-2e-06,-4e-06,5e-06,-1e-06,1e-06,6e-06,-1.3e-05,5e-06,-9e-06,-2e-06,3e-06,3.6e-05,-3e-06,0,-1.1e-05,1.2e-05,-4e-06,-3e-06,1e-05,1e-06,3e-06,8e-06,-1e-06,-3e-06,4e-06,-6e-06,-1e-06,4e-06,-4e-06,-6e-06,2e-06,-1e-06,0,-1e-06,0,0,0,-3e-06,-1e-06,1e-06,-1e-06,-1e-06,0,0,0,0,1e-06,0,-1e-06,1e-06
-2e-06,-1e-06,1e-06,-1e-06,0,0,3e-06,0,0,0,-8e-06,1e-06,0,6.3e-05,-8.2e-05,0,2.1e-05,1e-06,-2e-06,7.9e-05,3e-06,2e-06,2e-06,3e-06,1.3e-05,-1e-06,9e-05,3.8e-05,0.000216,0.000267,-1.8e-05,2.8e-05,-3.9e-05,-7.9e-05,-9.8e-05,-2.6e-05,2.8e-05,2.3e-05,-2.4e-05,-0.000137,-1.5e-05,0.000154,1.3e-05,4.6e-05,-8.6e-05,1.9e-05,-0.000109,-5.4e-05,-1.2e-05,-9.8e-05,3.8e-05,-6.8e-05,-6.8e-05,4e-06,5.8e-05,2.3e-05,-2.7e-05,7e-05,3e-06,-9e-06,3.5e-05,8.2e-05,-6e-05,9e-06,6e-06,4e-06,-9e-06,4e-06,-8e-06,-5e-06,4e-06,2e-06,3e-06,-3e-06,0,2e-06,-1.9e-05,-3e-06,0,1.8e-05,-5e-06,-7e-06,-6e-06,2e-06,-4e-06,1e-06,1.2e-05,-5e-06,-4e-06,1e-06,-5e-06,4e-06,-2e-06,-1e-06,1e-06,-4e-06,-6e-06,-1e-06,-3e-06,-1e-06,3e-06,0,-2e-06,0,-1e-06,0,0,0,0,2e-06,-1e-06,0,0,-1e-06,0,1e-06,0,-1e-06,-1e-06,-1e-06,-1e-06
-2e-06,0,-1e-06,-1e-06,0,0,-3e-06,3e-06,0,0,8e-06,-2e-06,0,-3.4e-05,3.9e-05,-4e-05,-1.2e-05,-7e-06,3e-06,-5.4e-05,1.1e-05,-2e-06,-1.2e-05,-1.7e-05,-1.2e-05,-1e-06,-0.000112,2.2e-05,3.4e-05,-1.4e-05,-2e-05,2e-06,0.000134,8.1e-05,9.7e-05,1.6e-05,2.5e-05,-0.000119,0.000144,8.8e-05,-3.9e-05,-0.000134,-5.2e-05,1.5e-05,0.000102,-2e-05,2.5e-05,-5e-05,6.1e-05,0.000117,-4.1e-05,-0.000117,4.6e-05,7e-06,-3.8e-05,-2.7e-05,-4.2e-05,2.1e-05,-1.2e-05,-1e-05,4e-06,-3.2e-05,4e-05,-3e-06,-2.5e-05,0,-2e-06,4e-06,-5e-06,4e-06,-4e-06,1e-06,-1e-06,-4e-06,0,1e-06,-1.5e-05,-5e-06,-4e-06,-1.1e-05,6e-06,0,-1.2e-05,8e-06,8e-06,-9e-06,1.7e-05,-3e-06,-3e-06,-4e-06,6e-06,2e-06,-6e-06,3e-06,-1e-06,2e-06,-4e-06,0,0,-4e-06,0,-1e-06,-1e-06,0,0,1e-06,0,0,-1e-06,-1e-06,1e-06,1e-06,0,1e-06,0,0,0,1e-06,-2e-06,-1e-06,-2e-06
1e-06,1e-06,0,-1e-06,0,0,1e-06,1e-06,0,0,-5e-06,5e-06,0,5.5e-05,2e-05,0.000103,-1.6e-05,-8e-06,5e-06,1.5e-05,-3e-06,-1e-06,9e-06,-1.2e-05,9e-06,0,-1e-06,0.000112,-0.000111,-0.00016,-0.000121,5.4e-05,-0.000211,1.2e-05,-4.7e-05,-1e-05,-1.1e-05,8.3e-05,-0.000127,-6.9e-05,2.5e-05,0.000102,-7.7e-05,2e-05,-0.000142,-5.3e-05,-3.3e-05,2.8e-05,-5e-06,-3.2e-05,3.3e-05,3.5e-05,-5e-06,-3.7e-05,0.000104,6e-06,9e-06,-8.7e-05,1.2e-05,2.6e-05,-1.4e-05,-1e-06,-3.1e-05,-8e-06,4e-06,-7e-06,1.3e-05,-7e-06,-1.3e-05,-1.2e-05,0,5e-06,1e-06,-1e-06,0,-2e-06,6e-06,2e-06,-7e-06,0,-8e-06,2e-06,3.5e-05,-2e-06,-9e-06,1e-06,4e-06,-1e-06,-3e-06,-1e-05,-4e-06,-2e-06,8e-06,-3e-06,2e-06,-4e-06,-3e-06,0,1e-06,-3e-06,0,0,-1e-06,0,-1e-06,1e-06,0,0,1e-06,1e-06,-1e-06,0,0,0,0,-1e-06,-1e-06,-1e-06,1e-06,-1e-06,1e-06
0,-1e-06,0,-1e-06,0,0,-1e-06,2e-06,0,0,4e-06,-3e-06,0,-9.7e-05,-1.6e-05,-0.000195,4.5e-05,3e-06,-8e-06,3.5e-05,-1.2e-05,3e-06,-3e-06,4e-06,-7e-06,-1e-06,1.1e-05,5e-05,9.4e-05,2.2e-05,-5.9e-05,-2e-06,0.000256,-5.6e-05,-2e-06,-1.7e-05,-0.00012,3.9e-05,-2e-06,8.8e-05,-4.1e-05,-2.7e-05,1.2e-05,-6.6e-05,7.1e-05,-4e-05,-3.2e-05,5.4e-05,1.5e-05,-1.7e-05,-2.1e-05,-3.1e-05,-1e-05,9e-06,-0.000142,2.7e-05,2.7e-05,8.5e-05,-7e-06,-8e-06,-9e-06,-1.7e-05,-5e-06,-4e-06,-1e-05,0,-5e-06,-4e-06,-2e-06,-5e-06,-6e-06,-8e-06,0,8e-06,0,-2e-06,1.1e-05,1e-05,-6e-06,7e-06,9e-06,0,-4e-06,-1.1e-05,6e-06,-4e-06,-8e-06,-1e-06,-1e-06,-1e-06,0,0,-5e-06,-2e-06,-2e-06,3e-06,-1e-06,1e-06,-4e-06,-3e-06,2e-06,0,0,0,-1e-06,-1e-06,0,0,-2e-06,0,1e-06,-1e-06,0,-1e-06,0,0,0,1e-06,0,0,1e-06
3e-06,1e-06,0,-1e-06,0,0,0,-1e-06,0,1e-06,-2e-06,2e-06,0,4.8e-05,-3e-05,0.000225,-5.5e-05,3e-06,-6e-06,-5.7e-05,1.7e-05,-3e-06,-6e-06,8e-06,5e-06,0,-9.3e-05,-4.2e-05,4.1e-05,4.4e-05,-7.8e-05,4.5e-05,-0.000243,2.5e-05,1.2e-05,2e-05,8e-06,-6.6e-05,0.000122,-0.000144,1.7e-05,-3.1e-05,3.5e-05,-1.7e-05,-0.00016,1.3e-05,8.4e-05,-5.9e-05,-5e-06,-5e-06,3.3e-05,1.5e-05,2.7e-05,-1.3e-05,7.8e-05,-1.7e-05,3.3e-05,7e-06,-5e-06,2.3e-05,1.9e-05,1.5e-05,2.6e-05,1.7e-05,8e-06,5e-06,-2e-06,9e-06,1e-06,0,-5e-06,5e-06,1e-06,0,0,-1e-06,5e-06,-1.4e-05,-5e-06,-6e-06,-8e-06,0,-3.3e-05,-3e-06,-2e-06,-1.4e-05,5e-06,1e-06,1e-06,4e-06,2e-06,3e-06,-2e-06,1e-06,0,-3e-06,0,0,4e-06,-2e-06,-2e-06,0,-1e-06,0,-1e-06,-1e-06,0,0,-2e-06,1e-06,-1e-06,0,1e-06,1e-06,0,0,0,-1e-06,0,-1e-06,0
1e-06,0,0,-1e-06,0,0,0,-3e-06,1e-06,0,2e-06,-3e-06,0,-3.1e-05,5.9e-05,-0.000127,4.6e-05,4e-06,-3e-06,5.5e-05,-1.1e-05,2e-06,9e-06,1.3e-05,-6e-06,0,4.6e-05,4e-06,-9.1e-05,2.8e-05,5e-06,-4.2e-05,0.000266,-1.6e-05,-5.3e-05,7e-06,9e-06,2.3e-05,-7.1e-05,-1e-05,-1.2e-05,8.1e-05,4.3e-05,5e-05,0.00011,3.1e-05,-4e-05,9e-06,-2.1e-05,3.5e-05,-5e-05,5.1e-05,-4.7e-05,-9e-06,-1.7e-05,1.2e-05,-3.9e-05,-9.1e-05,2e-06,-8e-06,2.6e-05,-1.7e-05,-4e-05,-1.4e-05,3e-06,1e-06,-7e-06,2e-06,1.2e-05,0,-1e-06,-4e-06,2e-06,-4e-06,0,1e-06,1e-06,3e-06,-8e-06,7e-06,6e-06,-2e-06,-1.5e-05,-1e-06,-2e-06,0,-2e-05,-1e-06,2e-06,6e-06,-2e-06,1e-06,6e-06,1e-06,1e-06,1e-06,1e-06,1e-06,1e-06,-5e-06,0,0,-1e-06,0,0,0,0,0,1e-06,0,1e-06,1e-06,0,0,0,0,0,-1e-06,1e-06,-1e-06,-1e-06
0,-2e-06,0,-1e-06,0,0,-1e-06,-5e-06,1e-06,1e-06,0,1e-06,0,4.4e-05,-1.5e-05,2.4e-05,-2.3e-05,2e-06,1e-05,-1.3e-05,-5e-06,-2e-06,-5e-06,-1e-06,7e-06,0,-8.2e-05,-8.2e-05,-3.3e-05,4.6e-05,3.1e-05,5.2e-05,-0.000203,2.8e-05,6.8e-05,-9e-06,5.3e-05,1.7e-05,9e-06,-4.3e-05,2.4e-05,-7.3e-05,1.9e-05,-3e-05,-0.000106,4.3e-05,2.2e-05,4.8e-05,2.4e-05,-4.5e-05,5e-05,-2.2e-05,4.3e-05,-1e-06,1.2e-05,-1.8e-05,1.9e-05,4e-05,-1e-06,1.3e-05,5e-06,9e-06,4.4e-05,-5e-06,-1e-06,-3e-06,-2e-06,1e-06,7e-06,4e-06,3e-06,5e-06,-1e-06,-3e-06,0,2e-06,-8e-06,-1e-06,-8e-06,4e-06,-6e-06,1e-06,3.7e-05,-6e-06,-2e-06,0,-9e-06,2e-06,2e-06,2e-06,4e-06,-1e-06,-6e-06,0,0,-1e-06,2e-06,1e-06,-5e-06,0,-2e-06,0,0,0,0,0,0,0,0,0,0,-1e-06,0,1e-06,-1e-06,0,0,2e-06,0,-1e-06,1e-06
-1e-06,1e-06,0,-1e-06,0,0,0,-3e-06,0,0,-1e-06,-1e-06,0,7e-06,-3.4e-05,1.9e-05,-9e-06,-3e-06,9e-06,-3.1e-05,1e-05,2e-06,4e-06,-6e-06,-1.1e-05,0,1e-05,2e-06,0.000109,-2.8e-05,7.4e-05,-4.8e-05,0.000129,-1.6e-05,-5.1e-05,1.5e-05,8.8e-05,1.5e-05,7.9e-05,0.000197,2.4e-05,3e-05,-1e-05,1.2e-05,6.8e-05,8e-06,-7.1e-05,-7.7e-05,9e-06,2.2e-05,-3.2e-05,9.2e-05,-2.3e-05,-6e-06,-9e-06,2.6e-05,1.2e-05,7.4e-05,9e-06,-1e-06,-1.5e-05,4.1e-05,-3.1e-05,2e-06,0,-1e-06,1.3e-05,-4e-06,-3e-06,-1e-06,5e-06,-3e-06,-3e-06,3e-06,0,1e-06,-8e-06,0,-3e-06,-9e-06,4e-06,1e-06,1.8e-05,-7e-06,4e-06,-5e-06,-9e-06,-1e-06,2e-06,0,-5e-06,1e-06,1e-06,0,1e-06,0,2e-06,0,2e-06,-6e-06,1e-06,1e-06,-1e-06,0,-1e-06,0,0,0,-2e-06,0,0,-1e-06,0,-1e-06,0,0,0,-1e-06,-1e-06,-1e-06,0
-1e-06,1e-06,0,-1e-06,0,0,0,-1e-06,1e-06,0,1e-06,1e-06,0,-1.9e-05,8e-06,-1.8e-05,1.5e-05,-3e-06,-9e-06,5.4e-05,-1e-06,-1e-06,-4e-06,-2e-06,9e-06,0,-2.7e-05,-1.3e-05,-1.1e-05,-9.2e-05,3.5e-05,1.7e-05,-0.000156,-1.8e-05,3.9e-05,1e-06,-6.5e-05,-7.2e-05,-5.8e-05,-5.9e-05,-1e-06,1.9e-05,-2.3e-05,9e-06,-5.8e-05,-2.5e-05,2.1e-05,4.3e-05,9e-06,2.3e-05,1.1e-05,5e-06,2.3e-05,1.1e-05,-9e-06,-2.5e-05,-2.6e-05,-0.000105,-2e-06,-7e-06,-1.1e-05,-3.9e-05,1.8e-05,7e-06,-1e-05,2e-06,-2e-06,-5e-06,-7e-06,4e-06,0,0,1e-06,3e-06,0,-1e-06,4e-06,-4e-06,0,1.2e-05,-1e-06,0,-3e-05,-6e-06,-3e-06,-9e-06,-5e-06,3e-06,1e-06,-3e-06,2e-06,1e-06,4e-06,-1e-06,-1e-06,2e-06,2e-06,1e-06,2e-06,2e-06,0,0,0,0,0,-1e-06,0,0,-2e-06,0,0,1e-06,0,0,0,0,0,0,0,0,-1e-06
-1e-06,-1e-06,0,-1e-06,0,0,-1e-06,1e-06,1e-06,0,-2e-06,0,0,1.1e-05,2.9e-05,1.4e-05,-2e-06,-2e-06,-2e-06,-4.1e-05,-1e-06,1e-06,-1e-06,-4e-06,-7e-06,0,-4.1e-05,3.4e-05,-0.000134,-1.4e-05,1e-05,1e-06,0.000158,1.3e-05,-1e-05,-1e-05,-4e-05,2.4e-05,8e-06,4.1e-05,7e-06,-2.7e-05,-4.3e-05,-9e-06,6.8e-05,-3.1e-05,2.6e-05,5e-06,7e-06,-4.5e-05,-5e-06,-1.3e-05,1e-05,-1.7e-05,1.3e-05,1e-06,-1e-06,2.5e-05,1e-06,1e-06,7e-06,5e-06,9e-06,4e-06,6e-06,-1e-06,-3e-06,5e-06,-9e-06,-1e-06,5e-06,0,2e-06,-1e-06,0,-2e-06,8e-06,-4e-06,-2e-06,-9e-06,-2e-06,0,-1.1e-05,-7e-06,3e-06,-3e-06,-1e-06,0,0,-5e-06,1e-06,1e-06,-5e-06,1e-06,1e-06,-4e-06,1e-06,0,-4e-06,-5e-06,0,0,-1e-06,0,0,0,0,0,0,1e-06,0,0,0,0,0,0,0,0,-1e-06,-1e-06,-1e-06
0,1e-06,0,-1e-06,0,0,1e-06,3e-06,1e-06,0,2e-06,1e-06,0,-5.5e-05,-1.5e-05,-5.3e-05,-1.3e-05,0,5e-06,-8e-06,0,-1e-06,2e-06,3e-06,7e-06,0,5e-06,4.8e-05,9.4e-05,0.000151,-3.2e-05,-7e-06,-0.000181,1.1e-05,-3.4e-05,6e-06,-3.5e-05,1.7e-05,1.1e-05,-0.000115,-2.1e-05,-2.7e-05,-1.1e-05,1e-05,-0.00013,-8e-06,-2.4e-05,1.3e-05,-2.5e-05,3.8e-05,2e-05,2.4e-05,-2.4e-05,-6e-06,-3.4e-05,-7e-06,1.6e-05,3.7e-05,2e-06,4e-06,1e-05,-1.4e-05,-2.9e-05,-1.3e-05,-1e-05,-3e-06,-4e-06,3e-06,1e-06,2e-06,-1e-06,0,-3e-06,-3e-06,0,-1e-06,2e-06,1e-05,-1e-06,1e-06,2e-06,-2e-06,1.9e-05,-8e-06,2e-06,0,5e-06,4e-06,-1e-06,-2e-06,-2e-06,1e-06,2e-06,-1e-06,0,3e-06,0,-1e-06,2e-06,0,1e-06,0,0,0,0,1e-06,0,0,0,0,0,-1e-06,0,0,0,0,0,-1e-06,0,-1e-06,1e-06
1e-06,1e-06,0,-1e-06,0,0,-2e-06,1e-06,1e-06,-1e-06,-2e-06,0,0,6.3e-05,-3.4e-05,0.000126,3.3e-05,2e-06,2e-06,4.1e-05,8e-06,2e-06,-5e-06,2e-06,-8e-06,0,-5.5e-05,-4.8e-05,6.2e-05,1.3e-05,-4.2e-05,2.2e-05,0.000208,8e-06,5.4e-05,2e-06,3e-06,6e-06,-1.9e-05,9.6e-05,-6e-06,9.5e-05,3.1e-05,-4e-06,8.3e-05,2e-05,2.2e-05,-6.7e-05,-6e-06,-5e-06,-3.9e-05,-4.9e-05,3.1e-05,-4e-06,7.8e-05,8e-06,-1.1e-05,-4.3e-05,-4e-06,7e-06,-7e-06,2.5e-05,2.4e-05,4e-06,1.1e-05,0,-3e-06,-1e-06,2e-06,2e-06,-2e-06,2e-06,-1e-06,0,0,1e-06,-3e-06,3e-06,2e-06,4e-06,-5e-06,1e-06,-6e-06,-3e-06,-8e-06,-6e-06,1.6e-05,1e-06,-2e-06,2e-06,3e-06,0,3e-06,-1e-06,1e-06,-2e-06,0,0,2e-06,-4e-06,-1e-06,-1e-06,-1e-06,0,0,0,0,0,-1e-06,1e-06,0,0,0,0,0,0,0,0,1e-06,0,0
