1.6e-05,7e-06,9e-06,1.1e-05,0.000152,0.000233,0.000102,0.000121,0.000134,0.000181,0.000339,0.000286,4.4e-05,0.000612,0.000927,0.000685,0.000765,0.000211,0.000407,0.000561,0.000162,0.00015,0.000484,0.000267,0.000495,0.000203,0.000182,0.00012,4e-06,0.000392,0.000114,4.3e-05,0.000446,0.000433,0.000253,0.00021,0.000241,0.000187,0.000197,7.5e-05,0.000104,4.3e-05,5.8e-05,8.1e-05,0.000104,1.3e-05,6.2e-05,7.5e-05,7e-05,5.3e-05,3.5e-05,3.4e-05,1.4e-05,2.3e-05,4.8e-05,1.8e-05,2e-05,1.6e-05,2e-05,1.4e-05,1.9e-05,2.4e-05,1.8e-05,1.8e-05,1e-06,6.1e-05,3.5e-05,2e-06,7e-06,3e-06,3e-06,3e-06,1.1e-05,1e-06,6e-06,1e-06,1.5e-05,1.8e-05,3e-06,1.5e-05,3e-06,1.8e-05,3e-05,8e-06,4e-05,8.9e-05,8.4e-05,1e-05,7.5e-05,4e-06,0.000276,7.1e-05,0.000122,0.000255,7.4e-05,3e-05,0.000124,4.9e-05,0.000192,5e-06,0.000535,6.2e-05,0.000578,0.000312,0.000133,3.8e-05,4.7e-05,3.1e-05,8e-06,2.2e-05,9e-06,0.000268,9.4e-05,3.6e-05,8.4e-05,3.4e-05,3.2e-05,1.6e-05,2.1e-05,1e-06,1e-06
1.7e-05,6e-06,2.3e-05,0.000716,0.00096,0.001194,0.000962,0.000386,0.000947,0.00084,0.000835,0.000529,0.000958,0.001287,0.002169,0.002909,0.000529,0.001238,0.001588,0.00177,0.001468,0.000772,0.001146,0.001632,0.000846,0.001567,0.000753,0.00083,0.000225,0.001388,0.001093,0.000427,0.000652,0.001186,0.001106,0.000228,0.000466,0.000395,0.000647,0.000148,0.000387,0.000146,0.000152,0.000122,0.00031,0.000157,0.000177,0.000135,0.000282,0.000205,0.000149,0.000176,0.000123,3.7e-05,9.9e-05,5.2e-05,7.9e-05,2.9e-05,3.7e-05,4.3e-05,7.6e-05,7.8e-05,8e-05,2.7e-05,2.6e-05,0.000113,4.4e-05,2.1e-05,4.6e-05,3.1e-05,2.7e-05,4.1e-05,4.7e-05,3.1e-05,1.7e-05,1.7e-05,2.9e-05,3.4e-05,1.5e-05,1.8e-05,1e-05,8.9e-05,0.000109,5e-05,0.00011,0.000277,8.6e-05,0.000581,0.000356,0.000302,0.000596,0.000521,0.000307,0.000553,0.000147,0.000139,0.000144,0.000119,0.00053,0.000705,0.001203,0.00081,0.000798,0.001529,0.000622,0.000218,3e-05,9.7e-05,9.3e-05,8.5e-05,7.4e-05,0.000469,0.000358,0.000264,0.000135,0.000195,0.000125,9.6e-05,0.000122,6.2e-05,6.9e-05
1.8e-05,9e-06,2.9e-05,0.001287,0.001969,0.000466,0.001242,0.000682,0.001446,0.001922,0.001842,0.002181,0.002185,0.000998,0.001226,0.000401,0.001155,0.00127,0.001223,0.000757,0.000673,0.000277,0.000205,0.001301,0.001008,0.001434,0.001129,0.00021,0.000271,0.001539,0.000768,0.000481,0.00038,0.00038,0.000552,0.000955,0.001332,0.000388,0.000257,0.00043,0.000706,0.000396,0.000403,0.000245,0.000112,0.000232,0.000251,0.000258,0.000475,6.4e-05,0.000297,0.000168,5.1e-05,0.000164,3.6e-05,0.000178,2.8e-05,5.1e-05,6.1e-05,0.000147,0.000184,5e-05,1.4e-05,1.8e-05,7.2e-05,0.000166,0.000112,6.3e-05,4e-05,3.7e-05,2.7e-05,2.7e-05,3.2e-05,5.6e-05,4.3e-05,1.3e-05,4.8e-05,2.9e-05,5e-06,1.5e-05,1.7e-05,0.000198,8.4e-05,1.2e-05,0.000103,0.000467,0.00051,0.000989,0.000577,0.00023,0.000801,0.000818,0.000418,0.000918,0.000583,0.000242,0.000279,0.000199,0.000539,0.001903,0.001324,0.000858,0.001029,0.001561,0.001281,0.000448,0.000138,7.2e-05,1.5e-05,5e-05,1.4e-05,0.000529,0.00071,0.00019,6.9e-05,4e-05,2.5e-05,1.6e-05,6.2e-05,1.9e-05,7.6e-05
3e-05,4.3e-05,6.3e-05,0.001442,0.001183,0.001141,0.001606,0.001055,0.000702,0.001897,0.000423,0.002277,0.001524,0.001336,0.00088,0.001379,0.000342,0.00096,0.002389,0.002221,0.00192,0.000982,0.001572,0.001323,0.000196,0.001293,0.000256,0.000635,0.000141,0.001322,0.000908,0.00052,0.001492,0.000683,0.001174,0.001248,0.001309,0.000868,0.000766,0.000637,0.001014,0.000672,0.000276,0.00052,0.000335,0.000133,0.000197,0.000145,0.000146,6.4e-05,0.000239,0.000227,0.000135,0.000174,4.5e-05,0.000175,0.000232,2e-04,0.000115,0.000104,6.5e-05,5.6e-05,4.2e-05,7.9e-05,0.000105,0.000116,9.9e-05,7e-05,5.4e-05,8.4e-05,4.8e-05,8.4e-05,4.5e-05,5.7e-05,2.6e-05,2.7e-05,5.9e-05,5.6e-05,2.8e-05,5.9e-05,3.8e-05,0.000313,0.000173,3.3e-05,0.000135,0.000495,9.1e-05,0.00071,0.000443,0.000516,0.001177,0.001595,0.001138,0.000436,0.000346,0.000333,0.000286,0.000729,0.000685,0.001925,0.000486,0.000632,0.001043,0.001387,0.001422,0.000846,0.000388,9.8e-05,5.8e-05,7.9e-05,7.8e-05,0.000646,0.000438,0.000141,9e-05,8.3e-05,2.6e-05,2.4e-05,2.9e-05,1.5e-05,6.4e-05
2.1e-05,1.7e-05,4.6e-05,0.001124,0.00067,0.001332,0.000514,0.000437,0.000838,0.001823,0.002596,0.003599,0.001349,0.001107,0.002683,0.001858,0.001788,0.002373,0.000548,0.000974,0.001944,0.000807,0.00154,0.000568,0.001012,0.000502,0.001148,0.001644,0.000855,0.001801,0.00147,0.001206,0.002763,0.002017,0.000178,0.000354,0.00099,0.000437,0.000237,0.000397,0.000412,0.000283,0.000662,0.000378,0.000573,0.000449,0.000353,0.000109,0.000434,0.000253,0.000151,0.000233,0.000199,9.6e-05,0.000163,0.000142,0.000106,6.8e-05,0.000288,0.000201,0.000146,1.3e-05,7.8e-05,0.000109,3.6e-05,0.000235,0.000115,7.9e-05,6.5e-05,0.000101,7.2e-05,7.8e-05,0.000119,4e-06,5.6e-05,4.6e-05,6.1e-05,7e-05,8.5e-05,8e-05,1.5e-05,0.000317,2e-04,5.9e-05,9.2e-05,0.000258,0.000322,0.000209,4.8e-05,0.000556,0.001399,0.00136,0.000452,0.000896,0.000378,6.5e-05,0.000349,0.000982,0.000369,0.001786,0.002352,0.000807,0.000931,0.0027,0.000793,0.000366,8.8e-05,0.000101,7.8e-05,0.000106,4.7e-05,0.00058,0.000501,0.000141,6.1e-05,7.1e-05,5.3e-05,3.3e-05,7e-05,2.8e-05,6.9e-05
5.1e-05,3.6e-05,7.4e-05,0.000687,0.001322,0.000793,0.000785,0.001334,0.001749,0.001047,0.001,0.002778,0.002624,0.001745,0.002906,0.002114,0.001219,0.002565,0.00305,0.001492,0.002168,0.001759,0.001921,0.000272,0.000684,0.000764,0.000562,0.001418,0.000902,0.001293,0.001295,0.000639,0.004079,0.00115,0.000174,0.00093,8.6e-05,0.000625,0.000621,0.000473,0.000385,0.000603,0.001125,0.000867,0.000988,0.000401,3.9e-05,6.2e-05,0.000464,0.000175,0.000404,8.7e-05,0.000133,0.000277,0.000155,0.000153,0.000199,3.1e-05,0.000452,0.000334,0.000157,0.00019,0.000191,0.000342,0.00028,0.000383,0.000307,0.000267,0.000126,0.000172,0.000147,8.4e-05,0.000114,0.000132,0.000152,7e-05,8.1e-05,0.00018,0.000129,0.000149,0.00015,0.000219,9.9e-05,9.5e-05,9.1e-05,0.000114,0.000336,0.000246,0.000118,0.000468,0.001132,0.000775,0.000398,0.001241,0.00066,0.000486,0.001071,0.000223,0.000379,0.001719,0.003364,0.001236,0.001438,0.002258,0.001598,0.000598,0.000171,0.000269,0.000221,9.6e-05,0.000109,0.000479,0.000384,8.6e-05,0.000155,0.000137,0.000103,7.3e-05,0.000122,7.4e-05,0.000137
3.6e-05,6.1e-05,8.2e-05,0.000495,0.001517,0.000626,0.001548,0.001338,0.002243,0.000367,0.000301,0.001772,0.000579,0.002775,0.003856,0.003447,0.001177,0.004332,0.000928,0.000944,0.002216,0.000659,0.002436,0.002301,0.000979,0.001178,0.000496,0.001805,0.000984,0.001064,0.003163,0.002093,0.004034,0.003295,0.001074,0.001296,0.002208,0.001627,0.000653,0.000537,0.000738,0.000469,0.000647,0.000465,0.000351,0.000725,0.000171,0.000177,0.000183,0.000486,0.00035,0.000308,0.000425,0.000398,0.000204,0.000409,0.000204,0.000274,0.00036,0.000638,0.000402,0.000113,0.000111,0.000282,0.000272,5.1e-05,8e-05,0.000107,0.000139,0.000105,0.000117,0.000126,4.7e-05,0.000125,0.000225,0.000149,5e-05,9.2e-05,4.9e-05,0.000107,7.4e-05,0.000168,0.000161,5.2e-05,7.3e-05,0.000206,0.000299,0.000222,6.7e-05,0.000508,0.001953,0.000706,0.00046,0.0016,0.000826,0.000352,0.002011,0.000688,0.000139,0.001796,0.001733,0.000636,0.000874,0.002802,0.001096,0.000557,9.6e-05,9.8e-05,3.6e-05,1.3e-05,0.000132,0.000648,0.00183,0.000476,0.000312,7.3e-05,9.7e-05,5.9e-05,9.6e-05,0.000133,0.00013
6.9e-05,8.5e-05,1.6e-05,0.000625,0.00133,0.002045,0.002602,0.001917,0.001951,0.003224,0.004562,0.002096,0.002231,0.003169,0.001179,0.000897,0.001405,0.004594,0.003933,0.003675,0.002271,0.003082,0.003185,0.002775,0.00104,0.001474,0.000525,0.00134,0.002559,0.002445,0.002013,0.003321,0.006115,0.002139,0.001018,0.001334,0.00109,0.001675,0.001572,0.001148,0.000495,0.000706,0.001029,0.000495,0.00037,0.001014,0.001184,0.000657,0.000608,0.000714,0.000416,0.00024,0.000298,0.000258,0.00015,0.000254,0.000281,0.000227,0.000487,0.000282,0.000142,4.9e-05,4.8e-05,0.000263,0.00013,9.8e-05,3.5e-05,7.3e-05,6.8e-05,8.4e-05,4.2e-05,0.000209,0.000217,1.9e-05,9.8e-05,4.8e-05,7.5e-05,5.6e-05,5.7e-05,8.9e-05,9.1e-05,6.5e-05,5.1e-05,0.000109,7e-05,0.000185,0.000536,0.000492,0.000552,0.001057,0.001776,0.00103,0.000793,0.001436,0.00221,0.001086,0.003274,0.002008,0.000637,0.001631,0.004217,0.003002,0.002069,0.002436,0.001488,0.000442,0.000149,0.000137,8.5e-05,3.1e-05,0.000161,0.000478,0.004032,0.002524,0.001107,0.000323,6.7e-05,5e-06,6.1e-05,5.8e-05,0.00012
4.8e-05,6.4e-05,7.6e-05,0.000601,0.001775,0.001339,0.00259,0.002094,0.003848,0.001651,0.004757,0.002058,0.002096,0.003496,0.004496,0.002976,0.002506,0.00579,0.00417,0.001044,0.003789,0.00042,0.0014,0.001843,0.002691,0.00182,0.00161,0.000743,0.002208,0.000195,0.001581,0.00227,0.001999,0.002742,0.001838,0.000212,0.000581,0.001017,0.000449,0.000432,0.001288,0.000806,0.000526,0.000554,0.000224,0.000559,0.000424,0.000536,8.3e-05,0.000344,0.000139,7.3e-05,0.000328,0.000383,0.000376,0.00035,9.2e-05,0.000222,0.000247,0.000188,0.000107,7.1e-05,0.000121,0.000129,0.000123,9.3e-05,4.1e-05,3.4e-05,3.5e-05,5.2e-05,3.3e-05,0.000191,0.000105,0.000123,8.9e-05,6.2e-05,3.9e-05,3.6e-05,3.9e-05,3.6e-05,5.1e-05,2.6e-05,6e-05,7.7e-05,0.000129,0.000175,0.000406,0.001035,0.00089,0.001023,0.002077,0.003857,0.001641,0.001313,0.003113,0.001677,0.004585,0.003098,0.001345,0.00158,0.004214,0.004202,0.000821,0.001476,0.001078,0.000835,0.000363,0.000157,5.2e-05,0.000144,0.000185,0.000532,0.004732,0.003817,0.001748,0.000466,7.9e-05,2.9e-05,4.8e-05,9.7e-05,4e-05
5.1e-05,1.4e-05,1.5e-05,0.000543,0.001335,0.000508,0.000958,0.00218,0.002685,0.002846,0.004232,0.003306,0.001748,0.0022,0.002051,0.001023,0.001261,0.004259,0.003044,0.002577,0.000543,0.002189,0.002134,0.001861,0.002463,0.001549,0.000833,0.002775,0.002779,0.002538,0.001285,0.001233,0.00129,0.00032,0.001505,0.001339,0.001036,0.000373,0.000283,0.000301,0.000517,0.000207,0.00013,0.000274,0.000402,0.000127,0.000136,0.000191,0.000204,0.000158,0.000197,0.000226,7e-05,0.000122,0.00018,0.000112,0.000114,0.00011,0.000146,5.3e-05,9.7e-05,4e-05,0.000108,7.4e-05,0.000108,4e-05,4.7e-05,3.8e-05,5.4e-05,4e-05,8e-06,0.000201,5.3e-05,4.1e-05,3.1e-05,2.7e-05,4.1e-05,3.6e-05,4.6e-05,1.1e-05,1.6e-05,6.2e-05,9.9e-05,0.000126,0.000183,0.000225,0.000787,0.001163,0.000704,0.000564,0.001662,0.005616,0.003,0.000695,0.002188,0.000994,0.00445,0.003102,0.00152,0.001437,0.003501,0.002722,0.002174,0.00267,0.001355,5e-04,6.4e-05,0.000142,0.000169,0.000198,0.000195,0.000333,0.004282,0.001818,0.000598,0.000105,3.4e-05,3.9e-05,5.2e-05,3.6e-05,2.3e-05
4.8e-05,4e-05,3.5e-05,0.000477,0.000449,0.000274,0.001031,0.001141,0.001008,0.00038,0.002368,0.000429,0.00195,0.00083,0.001751,0.000674,0.001166,0.00203,0.001889,0.001158,0.000469,0.001269,0.000824,0.000315,0.001086,0.000899,0.001159,0.00182,0.001705,0.000596,0.001108,0.001297,0.002032,0.001638,0.001859,0.000338,0.000618,0.000541,0.000492,0.000102,8.5e-05,0.000281,7e-05,0.000253,0.000127,0.00019,7.6e-05,0.000117,0.000178,8.8e-05,7.2e-05,0.000131,8.6e-05,0.000122,9.1e-05,0.000182,4.5e-05,3.8e-05,9.9e-05,8.4e-05,7.4e-05,5e-05,3e-05,8.2e-05,7.2e-05,8.3e-05,0.000112,6.8e-05,6.6e-05,2.3e-05,6.1e-05,0.000154,0.000147,6e-05,5.5e-05,9e-06,6.4e-05,5.4e-05,3.1e-05,4.1e-05,2.8e-05,0.000104,0.000102,5.7e-05,0.000106,0.000134,0.000832,0.000863,0.000614,0.000815,0.001863,0.004991,0.003117,0.001457,0.000517,0.000395,0.003385,0.00237,0.001201,0.001259,0.003851,0.002327,0.003846,0.003683,0.001803,0.00054,0.00019,4.7e-05,3.3e-05,8.3e-05,3e-05,0.000383,0.003924,0.002321,0.000965,0.000166,6.7e-05,0.000122,9.5e-05,5.8e-05,5.4e-05
6.7e-05,2.7e-05,1.8e-05,0.000296,0.00072,0.000528,0.002414,0.001386,0.001478,0.000982,0.00034,0.001784,0.001446,0.002482,0.002123,0.000847,0.002073,0.000929,0.001023,0.000332,0.00132,0.000369,0.000549,0.001899,0.002482,0.002781,0.00225,0.002781,0.000777,0.001672,0.001073,0.000389,0.001792,0.001304,0.000779,0.000802,0.000443,0.000511,0.000639,0.00025,5.4e-05,0.000285,0.000283,0.000151,0.000193,3.9e-05,0.000176,9.7e-05,0.000192,3.2e-05,0.000162,4.2e-05,0.00012,0.000116,0.000118,0.00022,0.000161,4.2e-05,7.9e-05,0.000106,5.9e-05,5.1e-05,0.000103,9.7e-05,5.2e-05,5.4e-05,1.9e-05,3.4e-05,3.9e-05,0.000105,9.7e-05,0.000189,0.000161,9.7e-05,6.6e-05,4e-05,2.1e-05,4.1e-05,4e-05,2.7e-05,5.1e-05,0.000108,7.1e-05,6.6e-05,5.9e-05,0.000109,0.000642,0.00062,0.000706,0.000193,0.001138,0.002346,0.000873,0.001512,0.000539,0.000152,0.001892,0.000328,4.7e-05,0.00056,0.002876,0.001723,0.004067,0.002535,0.001127,0.000251,0.000123,9.5e-05,9.1e-05,8e-06,2.9e-05,0.000292,0.002966,0.001322,0.00056,0.000109,0.000105,6.1e-05,2.1e-05,3.7e-05,3.2e-05
3.3e-05,4e-06,1.6e-05,0.000303,0.001037,0.000804,0.00288,0.000394,0.001376,0.000858,0.001709,0.001878,0.002099,0.00155,0.002671,0.001128,0.00271,0.00121,0.000998,0.000496,0.001134,0.001792,0.001738,0.002155,0.003894,0.001806,0.003169,0.002211,0.001904,0.003437,0.00147,0.00121,0.001757,0.001283,0.000697,0.000883,0.000394,0.00095,0.000472,0.000339,0.000347,0.000264,0.000137,0.000103,0.000129,0.000193,0.000203,0.000118,0.000267,5.2e-05,0.000129,9.9e-05,5.1e-05,8.1e-05,0.000141,0.000141,0.000111,1.3e-05,7.1e-05,8.6e-05,0.000143,3.6e-05,7.9e-05,0.000118,9e-06,6.7e-05,4.6e-05,5.7e-05,7.2e-05,7.8e-05,0.000103,9.3e-05,8e-05,6.5e-05,4.5e-05,2.1e-05,4.1e-05,4e-06,1.4e-05,2.4e-05,1.4e-05,3.3e-05,8.3e-05,7.6e-05,8.6e-05,4.4e-05,0.000597,0.000349,0.000122,0.000152,0.001246,0.000275,0.000272,0.001161,0.000327,0.000195,0.000664,0.000437,0.000219,0.00016,0.002508,0.001141,0.003707,0.002379,0.000918,0.00032,9.8e-05,3.3e-05,3e-05,3e-05,3.4e-05,0.000187,0.001242,0.000831,0.000221,6.2e-05,4.3e-05,3.7e-05,3.2e-05,4.6e-05,5.2e-05
4.3e-05,4.8e-05,2.3e-05,0.000486,0.002254,0.00077,0.002583,0.001526,0.001238,0.001507,0.004098,0.001779,0.003752,0.002517,0.00116,0.00281,0.003935,0.001497,0.002344,0.003136,0.000742,0.003227,0.002615,0.000567,0.002515,0.001482,0.003256,0.003711,0.003394,0.00208,0.002012,0.0019,0.004579,0.001283,0.001411,0.001594,0.001563,0.001274,0.001045,0.000831,0.000772,0.000226,0.000594,0.000527,0.000125,0.000114,9.8e-05,6.3e-05,0.000254,5.3e-05,0.000194,0.000176,0.000128,9.1e-05,0.000156,0.000161,0.000217,5.2e-05,8.8e-05,0.000106,0.000214,0.00022,5.9e-05,9.3e-05,2.3e-05,8.1e-05,0.000137,0.000133,5.7e-05,1.4e-05,9e-05,0.000112,8.8e-05,1.1e-05,6.9e-05,7.6e-05,6.5e-05,0.00011,6.8e-05,4.7e-05,1.4e-05,9.9e-05,3e-05,3.2e-05,0.000106,4.1e-05,0.000639,0.000606,0.000358,0.000262,0.001263,0.000428,0.000129,0.001035,0.000216,0.00011,0.000739,0.000218,1.2e-05,9.2e-05,0.00118,7e-06,0.002723,0.000419,0.000169,0.000154,4.1e-05,3.9e-05,4.1e-05,4.2e-05,7.7e-05,0.000163,0.000416,0.000194,0.000186,0.00017,1e-04,6.6e-05,5e-05,7.7e-05,8.2e-05
5.5e-05,3.2e-05,6.9e-05,0.000914,0.003703,0.001251,0.002678,0.002443,0.001954,0.002403,0.003805,0.002173,0.006216,0.010444,0.003673,0.002569,0.004863,0.003859,0.001761,0.005638,0.003303,0.003999,0.003236,0.001241,0.003423,0.000982,0.002845,0.003099,0.004572,0.004864,0.002071,0.001098,0.005124,0.005585,0.003154,0.001477,0.001863,0.001162,0.000904,0.0023,0.000198,0.000662,0.001579,0.000828,0.000417,0.00036,0.000181,0.000142,0.000607,0.000283,7.4e-05,6.1e-05,0.000102,7.4e-05,0.000224,0.000415,0.000454,0.000212,0.000219,0.000387,0.000379,0.000209,0.000218,0.000114,0.00011,1.2e-05,0.000125,7.2e-05,9.2e-05,0.000125,8.4e-05,0.000232,0.000307,0.000162,0.000248,0.000109,5.1e-05,0.000164,4.4e-05,8.2e-05,6.4e-05,0.000189,0.000129,0.000117,0.000152,8.6e-05,0.000584,0.00068,0.000554,0.000238,0.000708,0.000956,0.000512,0.000931,0.000212,4.6e-05,0.000932,0.000339,0.00031,0.000262,0.00048,0.000567,0.002085,0.002172,0.000849,0.000202,7.3e-05,4.5e-05,4.3e-05,2.5e-05,6.8e-05,0.000118,0.001063,0.000337,2e-04,0.000109,5e-06,6e-05,6.2e-05,3.1e-05,3.5e-05
5.2e-05,2.1e-05,3.5e-05,0.001599,0.003768,0.003747,0.001986,0.004105,0.001033,0.000129,0.004512,0.003594,0.00666,0.006052,0.007513,0.004966,0.002473,0.003524,0.006564,0.006082,0.002654,0.002707,0.007213,0.009507,0.004551,0.00565,0.002703,0.003514,0.007182,0.000651,0.002107,0.002995,0.006775,0.001173,0.002876,0.004196,0.003376,0.003945,0.002579,0.003276,0.003288,0.001223,0.001093,0.002122,0.001677,0.00147,0.001026,0.000464,0.001551,0.000851,0.000421,0.00037,0.000224,1e-04,0.000311,0.000858,0.000556,0.000129,0.000423,0.000266,0.00012,0.000222,0.000198,0.000411,0.000189,0.000192,0.000198,0.000219,0.000236,0.000197,0.000161,0.000432,0.000179,7.3e-05,0.000402,0.00024,5.2e-05,0.000107,0.000139,0.00012,7.1e-05,0.00017,5e-06,0.000131,9.4e-05,7.1e-05,0.000465,0.000686,0.000503,0.000104,0.000819,0.00181,0.001161,0.000998,0.000442,0.000297,0.000852,0.000228,0.000108,0.000328,0.001041,0.000413,0.003282,0.001146,0.00015,0.00016,0.000115,2.9e-05,5.7e-05,3.5e-05,1.3e-05,2.9e-05,0.001011,0.00075,0.000238,9.9e-05,3.1e-05,7.1e-05,3.4e-05,1.4e-05,7.9e-05
5.9e-05,4.9e-05,9e-05,0.002049,0.00552,0.008387,0.007829,0.007855,0.00694,0.006257,0.002981,0.004383,0.007456,0.005392,0.00723,0.010672,0.011205,0.009288,0.004626,0.00917,0.006836,0.005662,0.001912,0.007837,0.008925,0.009525,0.012033,0.011366,0.008973,0.011075,0.00963,0.008101,0.003337,0.006343,0.009479,0.007593,0.006341,0.001563,0.003256,0.003539,0.001918,0.00225,0.001655,0.001639,0.002019,0.00078,0.000104,0.000466,0.001555,0.002257,0.001296,0.000317,0.000169,7.1e-05,0.000371,0.000924,0.001221,0.001367,0.001255,0.000711,0.000655,0.000526,0.000359,0.000666,0.000374,0.00017,0.000127,0.000119,0.000114,7.7e-05,4.2e-05,0.000308,0.000623,0.000615,0.000556,0.000546,0.000379,0.000189,8.3e-05,0.000243,0.000176,0.000203,0.00015,0.000106,0.000261,0.000123,0.000592,0.00038,0.000148,0.000233,0.000751,0.001312,0.000461,0.000219,0.000296,0.000169,0.000323,0.000106,0.000177,0.000115,0.001263,0.000701,0.003083,0.002565,0.001826,0.000621,0.000308,0.000236,0.000141,5.7e-05,5.9e-05,5.8e-05,0.00075,0.000511,0.000258,8.5e-05,0.000107,8.9e-05,5.4e-05,4.1e-05,0.000114
5.2e-05,0.000121,0.000116,0.002016,0.002752,0.003256,0.002024,0.00591,0.002783,0.007126,0.007651,0.005398,0.003895,0.002592,0.003272,0.006143,0.006285,0.002253,0.002875,0.004093,0.002851,0.005035,0.003733,0.005146,0.003278,0.005853,0.00763,0.003776,0.003512,0.007603,0.008407,0.003957,0.004792,0.008898,0.008176,0.010508,0.00434,0.001758,0.003593,0.000368,0.002785,0.001824,0.002315,0.001404,0.001943,0.000774,0.000291,0.000534,0.001536,0.001425,0.001174,0.001323,0.000852,0.000216,5e-04,0.000638,0.000316,0.000855,0.000725,0.000516,0.000249,0.00032,0.000689,0.00029,0.000341,0.00038,0.000513,0.000432,0.000383,0.000323,0.000291,7.6e-05,0.000405,0.000462,0.000642,0.000276,0.000102,0.000129,0.000199,0.000125,0.000113,7.7e-05,0.000217,0.000263,8e-05,0.000118,0.000573,0.00078,0.000548,0.000231,0.000821,0.000789,0.000855,0.000654,0.00037,0.000212,0.000372,0.000134,0.000333,0.000166,0.001086,0.000525,0.002374,0.000693,0.000445,0.000367,0.000349,0.000154,0.000102,0.00013,0.000151,7.4e-05,0.000744,0.000497,0.000192,8.9e-05,4.5e-05,5.1e-05,3.4e-05,0.000104,3.4e-05
6.3e-05,8.3e-05,4.5e-05,0.001537,0.003557,0.003027,0.002772,0.004029,0.00832,0.003569,0.003395,0.000442,0.002291,0.003602,0.002941,0.003462,0.000851,0.00379,0.003756,0.000838,0.004904,0.00766,0.005862,0.001955,0.003443,0.001555,0.001852,0.001094,0.00098,0.003772,0.004535,0.004489,0.004349,0.003045,0.00507,0.002658,0.002862,0.002962,0.002855,0.004241,0.001873,0.00043,0.002525,0.001791,0.001851,0.000988,6.2e-05,0.000342,0.000558,0.000427,0.00043,0.000282,0.000153,0.000337,0.000704,0.000345,0.000308,0.000893,0.000687,0.000196,0.000426,0.000311,0.000532,0.000506,0.000529,0.000883,0.000684,0.00011,0.000227,0.000176,0.000134,0.00017,0.000172,0.000166,0.000285,0.000108,6.7e-05,0.000119,5.9e-05,7.5e-05,2.4e-05,0.00012,0.000236,3.9e-05,2.2e-05,0.000113,0.000535,0.001302,0.000828,0.000423,0.001054,0.001806,0.000613,0.000469,0.00052,0.000318,0.000564,0.000215,0.000147,0.000135,0.000876,0.000629,0.000907,0.000616,0.00026,0.000202,7.1e-05,6.2e-05,6.7e-05,9.1e-05,3.9e-05,0.00024,0.000562,0.000376,0.000335,0.000166,8.3e-05,5.6e-05,3.6e-05,0.000113,0.000155
7.7e-05,5e-05,0.00012,0.000931,0.001918,0.004784,0.007457,0.005615,0.006659,0.007374,0.005037,0.002951,0.003194,0.001028,0.004435,0.00345,0.003701,0.004658,0.00783,0.00598,0.007644,0.001891,0.004087,0.003139,0.003086,0.005166,0.002165,0.002791,0.00336,0.000885,0.001885,0.003957,0.002395,0.001122,0.002441,0.001909,0.002389,0.003425,0.001649,0.002286,0.000947,0.000269,0.001554,0.000675,0.001042,0.001528,0.001156,0.000411,0.000392,0.00015,0.000161,0.000291,0.000101,0.000251,0.000232,0.000413,0.000481,0.000409,0.000904,0.000774,0.000783,0.000632,0.000224,0.000423,8.8e-05,0.000697,0.000272,9.6e-05,0.000132,9.9e-05,2.5e-05,7.5e-05,0.000126,0.000137,0.000231,1e-04,0.000114,1e-04,3.9e-05,0.00011,0.000135,0.00021,0.000161,9e-05,5.2e-05,0.000101,0.000447,0.000935,8.3e-05,0.000194,0.000841,0.001647,0.000809,0.000604,0.000624,0.00035,0.000249,0.00019,3e-04,0.000274,0.00052,0.000181,0.00044,0.000129,0.000163,0.000172,8.8e-05,6.4e-05,5.7e-05,6.6e-05,7.4e-05,0.000257,0.000604,0.000652,0.000284,0.000225,1e-04,6.2e-05,0.00013,6.6e-05,5.9e-05
1e-05,6.8e-05,8.5e-05,0.00032,0.001466,0.004333,0.00481,0.001704,0.000526,0.000939,0.003492,0.007863,0.004324,0.002263,0.003534,0.001585,0.002369,0.004724,0.004041,0.001527,0.005604,0.005409,0.001634,0.001907,0.003116,0.002196,0.001693,0.002807,0.002035,0.000772,0.001654,0.002162,0.001675,0.002041,0.002433,0.00087,0.001962,0.000397,0.000666,0.00155,0.001521,0.000946,0.000978,0.00087,0.000456,0.000688,0.000265,0.000139,0.00027,0.000189,0.000482,0.000557,0.000429,0.000115,0.000145,0.000149,0.000226,0.000357,0.000354,2e-06,0.000226,0.00018,0.000155,0.000282,0.000275,0.00034,0.000275,0.000263,0.000241,0.000256,0.000202,0.00021,0.00017,1.6e-05,5.8e-05,0.000134,0.000149,8.8e-05,6.9e-05,6.3e-05,5.1e-05,6.8e-05,5.6e-05,5e-05,4.2e-05,5.9e-05,0.000592,0.000668,0.00063,0.000224,0.000838,0.001201,0.000964,0.000229,0.000144,0.000175,0.000106,7.8e-05,0.000199,0.000276,0.000308,0.000436,0.000757,0.000291,0.000265,5.9e-05,0.000114,5.3e-05,6.3e-05,1.9e-05,5.1e-05,0.000221,0.001479,0.001178,0.000501,0.000112,1.4e-05,9.9e-05,7.5e-05,4.8e-05,2.7e-05
4.9e-05,7e-05,3.6e-05,0.000233,0.000836,0.003079,0.001128,0.003641,0.002316,0.002203,0.003509,0.003676,0.002237,0.000241,0.002964,0.001856,0.001359,0.001626,0.00128,0.001448,0.001705,0.002511,0.001481,0.001552,0.002371,0.000982,0.001205,0.002093,0.002691,0.002245,0.001636,0.001178,0.000343,0.001877,0.000202,0.001294,0.001648,0.001751,0.00036,0.000426,0.00078,0.000476,0.000269,0.000301,0.000331,0.000293,0.000241,0.000151,0.000288,0.000281,0.000391,3e-05,0.000148,5.9e-05,0.000192,0.000225,3.1e-05,0.000132,6.6e-05,6.1e-05,5.8e-05,8.6e-05,0.000186,1e-05,7.2e-05,0.000129,9.8e-05,0.00011,0.00012,0.000137,4.3e-05,0.00018,7.5e-05,0.000105,7.7e-05,7.1e-05,5.7e-05,3.6e-05,4.1e-05,3e-05,2.9e-05,3.7e-05,6.7e-05,2e-05,1.2e-05,8.3e-05,0.000412,0.000588,0.000189,7e-05,0.000809,0.000913,0.000387,0.00067,0.000525,0.000158,0.000149,0.000136,0.00015,0.000308,0.000143,0.00028,0.000198,0.000354,0.000268,0.000155,9.9e-05,2e-05,2.8e-05,0.000101,0.000113,0.000184,0.001562,0.000588,0.000244,8.7e-05,4.4e-05,5.6e-05,6.9e-05,6e-06,1.4e-05
1.2e-05,1.6e-05,1.7e-05,0.000114,0.000393,0.000776,0.001004,0.000511,0.000561,0.000991,0.000984,0.000533,0.000759,0.000204,0.001208,0.000608,0.000385,0.000327,0.000274,0.001086,0.000458,0.001336,0.00016,0.000444,0.000274,0.000322,0.000659,0.000873,0.000269,0.00065,0.000543,0.00068,0.000723,0.000768,0.000674,0.000506,0.000236,0.000339,0.000256,8.4e-05,0.000164,3.7e-05,0.000127,2.6e-05,5.7e-05,9.9e-05,9.1e-05,3.3e-05,9.6e-05,9e-05,9.1e-05,6.5e-05,2.5e-05,4.4e-05,5.4e-05,6.1e-05,2.6e-05,5e-05,3.9e-05,2.8e-05,4e-05,7.6e-05,6.8e-05,2.8e-05,3.8e-05,2.8e-05,5.5e-05,1.8e-05,2.7e-05,1.1e-05,3.4e-05,3.6e-05,2.1e-05,2.1e-05,2.1e-05,1.3e-05,1.8e-05,2e-05,3e-05,2e-05,1.3e-05,4e-05,4e-06,1.6e-05,1.2e-05,1.4e-05,0.000137,0.000167,5.4e-05,1.9e-05,0.000375,0.000371,0.000222,0.000302,0.000256,0.000139,8.2e-05,4.5e-05,5e-05,0.00012,2.6e-05,2.2e-05,0.000114,0.000165,8.3e-05,4.4e-05,4.3e-05,3.8e-05,3.2e-05,3.6e-05,2.5e-05,0.000168,0.000409,0.000174,7.6e-05,3.8e-05,2.1e-05,1.9e-05,2.2e-05,2.9e-05,9e-06
2e-06,9e-06,1.1e-05,9.5e-05,0.000518,0.000387,0.00103,0.001069,0.000573,7.6e-05,0.000451,0.000124,0.000464,0.000166,0.000617,0.000401,0.000513,0.000504,0.000364,0.000558,0.000671,0.000884,0.000989,0.000491,0.000218,0.000528,0.000417,0.000315,0.000441,0.000512,0.000483,0.000242,0.000139,0.000463,0.000217,0.00035,0.000172,0.000291,0.000176,5e-05,6.9e-05,9.5e-05,0.000103,7.2e-05,7.4e-05,9.2e-05,8e-05,4.6e-05,5.7e-05,4.9e-05,3.1e-05,2.5e-05,2.1e-05,3.4e-05,5.1e-05,2.8e-05,2.6e-05,5.1e-05,1.2e-05,2.8e-05,4.9e-05,5.4e-05,4.1e-05,2.3e-05,3.5e-05,2.4e-05,1.6e-05,3e-06,3.1e-05,1e-05,2.3e-05,3.5e-05,1.4e-05,9e-06,8e-06,1.1e-05,1.2e-05,7e-06,1.4e-05,7e-06,1.4e-05,2.8e-05,1.3e-05,1.6e-05,3.1e-05,2.2e-05,0.000137,0.000135,2.2e-05,1.4e-05,0.000285,0.000276,0.00013,0.000263,0.000116,6.5e-05,0.000144,2.3e-05,4.8e-05,3.7e-05,6.8e-05,4.9e-05,0.00013,5.2e-05,1.4e-05,2.6e-05,2.9e-05,8e-06,2.1e-05,1.1e-05,2.5e-05,0.000146,5e-05,6.9e-05,5.3e-05,1.2e-05,1.5e-05,1.1e-05,2e-05,7e-06,4e-06
7e-06,1.1e-05,2e-06,5e-05,0.000374,0.000654,0.00032,0.000833,0.000423,0.000644,0.000412,0.000534,0.000854,0.000694,0.000743,0.000464,0.00052,0.000832,0.000984,0.000422,0.000183,0.000417,0.00035,0.000333,0.000142,0.000106,0.000353,0.000277,0.000189,0.000304,0.000458,0.000265,0.000259,0.000241,0.000302,0.000117,0.000301,0.000276,9.8e-05,4e-05,9.6e-05,5.3e-05,9e-05,8.3e-05,9.1e-05,9e-05,7.6e-05,2.8e-05,5.5e-05,2.8e-05,4.6e-05,6e-06,1.1e-05,2.9e-05,3.8e-05,3.4e-05,1.9e-05,3.3e-05,1.9e-05,2e-06,3.7e-05,3.2e-05,3.3e-05,1.2e-05,2.8e-05,2.7e-05,2e-05,5e-06,2.7e-05,6e-06,2.1e-05,3.5e-05,1.7e-05,9e-06,8e-06,6e-06,1.1e-05,4e-06,1e-05,7e-06,7e-06,1e-05,7e-06,1.8e-05,1e-05,5e-06,0.000136,9.1e-05,4.2e-05,2.1e-05,0.000253,0.000106,1.9e-05,0.000281,8.8e-05,1.6e-05,0.000122,2.2e-05,1.6e-05,3.3e-05,0.000118,4.9e-05,9.7e-05,6.2e-05,1.4e-05,2.4e-05,2.7e-05,3e-06,1.6e-05,1e-05,1.7e-05,0.000166,0.000239,0.000147,4.5e-05,1.9e-05,1.7e-05,5e-06,1.8e-05,1.8e-05,2e-06
7e-06,1.2e-05,4e-06,1.2e-05,0.000275,0.000818,0.000323,0.000496,0.000182,0.000479,0.000665,0.000786,3.2e-05,0.000338,0.000327,0.000394,0.000354,0.00038,0.000418,0.000226,0.000383,0.000148,0.000388,0.000353,0.00025,0.000162,0.00032,0.000441,0.000461,0.000378,0.000565,0.000272,0.000342,5.1e-05,0.000326,0.000334,0.000103,0.00026,0.000159,2e-05,8.9e-05,2.1e-05,6.2e-05,4.7e-05,3.3e-05,6.6e-05,3.4e-05,5.1e-05,5.2e-05,4.7e-05,4.5e-05,1e-05,6e-06,1.5e-05,4.3e-05,2.7e-05,1.4e-05,1.7e-05,2.8e-05,2.3e-05,3.6e-05,2.6e-05,1.6e-05,1.5e-05,2.1e-05,3.4e-05,9e-06,4e-06,1.6e-05,4e-06,2.1e-05,3.8e-05,1.9e-05,2e-06,1.3e-05,1.3e-05,1.3e-05,6e-06,1e-05,5e-06,4e-06,3.1e-05,1.3e-05,1.6e-05,3.2e-05,1e-05,9.2e-05,6.8e-05,4.3e-05,3.6e-05,0.000171,2e-04,0.000118,0.000179,2.2e-05,1.5e-05,0.000142,3.4e-05,5e-05,6.6e-05,0.000132,6.2e-05,0.000272,9.2e-05,2.5e-05,8e-06,1.3e-05,1.3e-05,8e-06,1.8e-05,1.7e-05,0.000186,0.000294,0.000179,6.7e-05,3e-05,7e-06,1.3e-05,1.9e-05,1.3e-05,1.3e-05
7e-06,7e-06,1.1e-05,3.8e-05,0.000295,0.000766,0.000505,0.000446,0.000185,2e-05,0.000282,0.000394,0.000141,0.000395,0.000206,0.000298,0.000189,0.000204,0.000376,0.000398,0.00025,0.00011,0.000215,0.000277,0.000298,0.000405,2.6e-05,0.000441,0.000467,4.2e-05,0.000465,0.000135,0.000169,0.000313,0.000332,0.000188,0.00012,0.000316,0.000171,3.7e-05,9.3e-05,9e-05,0.000101,3.1e-05,7e-05,4.4e-05,1.6e-05,3.8e-05,8.9e-05,3.6e-05,4.6e-05,7e-06,7e-06,1.2e-05,3.9e-05,2.7e-05,8e-06,2.1e-05,4.4e-05,1.2e-05,4.6e-05,4.1e-05,2.8e-05,1.5e-05,1e-05,2.5e-05,6e-06,2e-06,1.4e-05,5e-06,1.4e-05,3.5e-05,1.7e-05,2e-06,1.1e-05,1.4e-05,7e-06,2e-06,1.7e-05,6e-06,6e-06,2.4e-05,7e-06,9e-06,2.4e-05,8e-06,8e-05,0.000116,3.3e-05,3e-05,0.000126,0.000304,0.000145,0.000144,1.5e-05,1e-05,0.000131,1e-05,2.3e-05,5e-05,8.9e-05,3e-05,0.000311,0.000109,3.3e-05,1.3e-05,1e-05,3e-05,2.1e-05,1.3e-05,1.9e-05,0.000206,0.00036,0.000138,6.9e-05,6e-06,1.1e-05,3e-06,1.5e-05,1.1e-05,2e-06
4e-06,8e-06,8e-06,3.9e-05,0.000265,0.000564,0.000297,0.000675,0.00031,0.000336,0.00023,0.000183,0.00031,0.000322,0.000518,0.000361,0.000376,0.000168,0.000159,0.00022,0.000223,5.6e-05,0.000448,0.000238,0.00016,0.00043,0.000369,0.00034,0.00044,0.000191,0.000517,0.000136,0.00017,3.7e-05,0.00036,0.000419,0.000134,0.000233,6.6e-05,9.1e-05,7.9e-05,9.6e-05,1.2e-05,8e-05,6.5e-05,8.5e-05,4.8e-05,7e-06,5.6e-05,5.5e-05,2e-05,4.6e-05,2.9e-05,1.2e-05,3.3e-05,2.9e-05,1.7e-05,1.4e-05,4.2e-05,2.1e-05,4.8e-05,4.6e-05,1.9e-05,2e-06,2.6e-05,3e-05,3e-06,8e-06,1.6e-05,1e-06,5e-06,3.9e-05,2.4e-05,9e-06,2.1e-05,1.2e-05,1.2e-05,7e-06,1.1e-05,5e-06,5e-06,4e-06,1.4e-05,6e-06,1.2e-05,1e-06,8.8e-05,4.1e-05,2.1e-05,2.3e-05,0.000132,0.000289,0.000138,0.000111,7e-06,3.3e-05,0.000104,1.1e-05,5.8e-05,7.1e-05,6e-05,9.1e-05,0.000227,7.1e-05,9e-06,2.7e-05,2e-05,3.7e-05,1.7e-05,1.8e-05,4e-06,0.000187,0.000234,0.000126,5.5e-05,4e-06,9e-06,1.3e-05,1.3e-05,7e-06,5e-06
5e-06,8e-06,5e-06,3.2e-05,0.000205,0.000223,0.000496,0.000527,0.000363,6.2e-05,0.000335,0.000182,9.6e-05,0.000247,0.000268,0.000305,0.000358,0.000498,0.000137,0.000429,0.000235,0.000199,0.000482,0.000395,0.000148,0.000259,0.000163,0.000173,0.000253,0.000356,0.000455,0.000471,0.00054,0.000311,0.000366,0.000258,0.000229,7.9e-05,0.000208,0.00015,5e-05,8.8e-05,6e-05,6e-05,4.9e-05,5.9e-05,2.4e-05,2.6e-05,4.2e-05,5.8e-05,6e-05,3.3e-05,1.4e-05,1.9e-05,5.8e-05,2.2e-05,3.6e-05,2.8e-05,3.4e-05,4e-06,2.8e-05,2.5e-05,1.5e-05,1.3e-05,2.5e-05,2.7e-05,1.2e-05,1.9e-05,1.2e-05,2.4e-05,1.3e-05,2.5e-05,7e-06,2.6e-05,2.7e-05,1.2e-05,1.7e-05,9e-06,1.9e-05,9e-06,1.3e-05,2e-05,1.7e-05,1.3e-05,1.9e-05,1e-06,6.8e-05,8e-05,3.8e-05,2.3e-05,0.00018,0.000177,0.000109,0.000146,3.3e-05,2.2e-05,0.000111,2.7e-05,8.1e-05,3.5e-05,2.9e-05,4.8e-05,3.1e-05,0.000111,6.7e-05,4e-05,7e-06,2.1e-05,6e-06,1.2e-05,5e-06,0.000182,0.000147,9.1e-05,2.3e-05,2.8e-05,2.4e-05,6e-06,4e-06,3e-06,6e-06
4e-06,2e-06,5e-06,7.7e-05,0.000149,0.000288,0.000326,0.000588,0.000481,0.000577,0.000606,0.000655,0.000646,0.000161,0.000494,0.000195,0.000247,0.00034,0.000463,0.000232,0.000111,0.000275,0.000187,0.000332,0.00018,0.000267,0.000119,5.9e-05,0.000482,0.000271,0.000168,0.000172,0.000447,4.5e-05,0.000306,0.000128,0.000208,0.000193,0.00021,0.000125,0.000235,9.7e-05,9.9e-05,0.000133,0.000152,0.000109,5.6e-05,6.9e-05,9.7e-05,7e-05,3.4e-05,8e-05,4.8e-05,2.7e-05,8.2e-05,3.4e-05,1.1e-05,1.4e-05,6.4e-05,4.6e-05,5e-05,5e-05,1.4e-05,1.9e-05,2.7e-05,2e-06,2.9e-05,4.7e-05,2.2e-05,2.7e-05,3.5e-05,3.1e-05,2.3e-05,3.6e-05,2.2e-05,2.4e-05,9e-06,1.4e-05,1.6e-05,1.4e-05,6e-06,2.3e-05,1.4e-05,1.7e-05,1.3e-05,5e-06,6.2e-05,1e-04,8.5e-05,8e-05,0.00019,0.000232,0.00011,0.00018,5.6e-05,4.9e-05,0.000162,2.2e-05,3.9e-05,4.4e-05,4.9e-05,7.2e-05,0.000157,0.000134,5.6e-05,1.3e-05,2.9e-05,1.6e-05,3e-06,1e-05,2e-06,0.000183,0.000238,0.000101,3.9e-05,5e-06,1.4e-05,1.3e-05,7e-06,8e-06,5e-06
2e-06,7e-06,1e-06,8.3e-05,0.000253,0.000478,0.000598,0.000476,9.8e-05,0.000326,0.000189,0.000279,0.000258,0.000255,0.000357,0.000216,0.000377,0.000574,0.00067,9.6e-05,0.000255,7.6e-05,0.000355,7.4e-05,0.000451,0.000324,0.000254,0.000181,0.000351,0.000143,0.000232,0.00023,0.000431,0.000312,0.00041,0.000182,0.000108,0.000465,0.000353,0.000214,8.4e-05,7.5e-05,7.8e-05,0.000166,5.6e-05,6.5e-05,4.1e-05,2.5e-05,7.5e-05,6.9e-05,1.8e-05,7.1e-05,5.5e-05,2.1e-05,8.1e-05,3.8e-05,2.3e-05,1.6e-05,3.5e-05,2.7e-05,4e-05,5e-05,5.5e-05,4.8e-05,5.8e-05,8e-06,2.1e-05,4.5e-05,3.2e-05,3.7e-05,2e-05,3.4e-05,2.2e-05,2.5e-05,1.8e-05,3.3e-05,3.8e-05,3.3e-05,3.2e-05,9e-06,8e-06,5e-06,1.5e-05,2.9e-05,3.7e-05,1.5e-05,7e-05,0.000153,0.000114,8.1e-05,0.000288,0.000131,4.3e-05,0.000144,2.9e-05,2.8e-05,0.000156,5.2e-05,4.6e-05,4.8e-05,9e-05,9.2e-05,0.000228,0.000149,0.000109,3.2e-05,7e-06,1e-05,1.2e-05,7e-06,9e-06,0.000158,0.000255,0.000131,3.5e-05,2.9e-05,1.2e-05,1.5e-05,1e-06,6e-06,1.2e-05
6e-06,8e-06,6e-06,4.6e-05,0.000258,0.000354,0.000201,0.000357,0.000444,0.000138,0.00021,0.00028,0.000371,0.000101,0.000194,0.000143,0.00039,0.000618,0.000128,0.000378,0.000446,0.000432,0.000268,0.000511,0.000363,0.000101,8.4e-05,0.000234,0.000331,0.000243,9.6e-05,0.000358,0.000498,0.00013,0.000305,8.2e-05,1.8e-05,0.000358,8.1e-05,0.000102,0.000106,0.000173,0.000178,9.6e-05,8.4e-05,2.3e-05,6.9e-05,2.6e-05,5.2e-05,2.2e-05,6e-05,5.1e-05,2.6e-05,5.4e-05,4.1e-05,7.1e-05,2.3e-05,2.4e-05,2.8e-05,1.3e-05,2.9e-05,1.8e-05,3.5e-05,1.5e-05,2.5e-05,3.1e-05,2.1e-05,2.6e-05,2.3e-05,3.9e-05,4e-05,1.8e-05,1.2e-05,6e-06,7e-06,8e-06,1.3e-05,4e-06,7e-06,2.2e-05,1.4e-05,1e-05,1.2e-05,2e-05,1e-05,5e-06,7.5e-05,0.000208,8.9e-05,4.9e-05,0.000246,0.000181,0.000144,0.000178,7.7e-05,2.6e-05,0.000123,4.1e-05,7e-05,3.6e-05,0.000104,6.1e-05,0.000266,9.7e-05,7.9e-05,7.1e-05,3.4e-05,7e-06,1.3e-05,1.8e-05,2.6e-05,0.000148,0.000234,0.00013,4.9e-05,5e-06,6e-06,1.7e-05,2e-05,6e-06,6e-06
6e-06,4e-06,6e-06,3e-06,0.000243,0.000298,0.000115,0.00035,0.000265,0.000423,0.000106,0.000191,0.000254,0.000333,0.00039,0.000194,0.000327,0.000239,7.8e-05,0.000264,0.00053,6.6e-05,0.000246,0.000312,0.000189,0.000209,0.000151,0.000172,0.000459,0.000202,0.000117,0.000122,0.000215,0.00024,0.000337,0.000167,0.000146,0.000189,7e-06,0.000151,0.000193,0.000121,9.5e-05,0.000129,8.2e-05,9.8e-05,7.4e-05,3.8e-05,5.4e-05,2.8e-05,7.5e-05,5.8e-05,4.1e-05,4.2e-05,6e-05,1.4e-05,1e-05,2.4e-05,2.1e-05,3e-06,9e-06,1.2e-05,6e-05,3.5e-05,1.2e-05,2.2e-05,1.8e-05,1.9e-05,1.9e-05,2.2e-05,2.2e-05,6e-06,1.7e-05,2.7e-05,2.2e-05,8e-06,1e-05,9e-06,8e-06,1.2e-05,1.1e-05,2.4e-05,1.5e-05,1.7e-05,1.3e-05,5e-06,6.6e-05,0.000142,7.7e-05,5e-05,0.000207,0.000397,0.000131,0.000154,9.7e-05,5e-05,9.2e-05,2.8e-05,1.6e-05,4e-05,0.000119,2.4e-05,0.00029,0.00018,7.3e-05,5.5e-05,4.8e-05,2e-06,1.8e-05,1.2e-05,2.6e-05,0.000155,0.000448,0.000223,0.000113,4.1e-05,3e-05,6e-06,5e-06,8e-06,8e-06
1e-05,8e-06,8e-06,5.1e-05,0.000139,6.3e-05,0.000301,0.000107,0.000304,0.000358,3.4e-05,0.000196,0.000308,0.000494,0.000237,0.000165,0.000213,0.00017,0.000263,0.000329,0.000313,0.000361,0.000182,0.000204,0.000306,0.000319,0.000243,7.1e-05,0.00027,0.000109,5e-05,0.000322,0.000557,0.000222,0.000209,9.3e-05,0.000159,0.000159,0.000214,0.000334,0.00029,9.5e-05,0.000115,0.000145,7e-05,7.8e-05,2.3e-05,2.5e-05,6.3e-05,6.3e-05,2.7e-05,6.3e-05,4.9e-05,4.7e-05,6e-05,8.5e-05,5.6e-05,4.8e-05,6.5e-05,3.9e-05,1.7e-05,1.1e-05,2.8e-05,1.5e-05,3.7e-05,1.3e-05,1.6e-05,1.1e-05,1e-06,1.6e-05,7e-06,2e-06,2.1e-05,6e-06,1.8e-05,1.9e-05,2.7e-05,1.2e-05,1.1e-05,1.2e-05,1.3e-05,2.2e-05,1.8e-05,3.3e-05,2.3e-05,9e-06,6e-05,4e-05,4e-05,2.3e-05,0.000225,0.000446,0.000265,0.000225,9.6e-05,4.8e-05,9.4e-05,3.5e-05,7e-06,6.7e-05,0.00012,4.3e-05,0.000183,9.3e-05,4.2e-05,4.8e-05,1.5e-05,4.2e-05,4.2e-05,1.5e-05,1.3e-05,0.00015,0.000664,0.000372,0.00017,3.7e-05,2.3e-05,1.7e-05,1.3e-05,1.4e-05,3e-06
3e-06,8e-06,1.2e-05,6.4e-05,0.000109,0.000192,0.000254,0.000154,0.000289,0.000187,0.000178,0.000276,0.000216,0.000361,0.000135,0.000124,0.000162,0.000193,9.7e-05,0.000253,3.3e-05,0.000142,8e-05,0.000307,0.000135,0.000179,0.000102,9e-06,0.000231,0.000243,0.000161,0.000211,0.00043,0.000186,0.000293,4.6e-05,9.7e-05,0.000206,7.2e-05,0.000217,2.8e-05,3.6e-05,8e-05,8.1e-05,3.2e-05,1e-05,2.7e-05,1.3e-05,5.4e-05,8.5e-05,5.5e-05,2.1e-05,1.4e-05,3.8e-05,6.7e-05,1.2e-05,3.7e-05,3.1e-05,1.8e-05,3e-06,2e-05,2e-05,2.5e-05,4.3e-05,8e-06,2.6e-05,2.9e-05,1.2e-05,1.4e-05,1.8e-05,7e-06,2.1e-05,7e-06,6e-06,1.8e-05,2e-05,6e-06,6e-06,9e-06,5e-06,6e-06,1.5e-05,1.2e-05,2.2e-05,1.8e-05,1.1e-05,5.8e-05,3.6e-05,9e-06,2.3e-05,0.000188,0.000335,0.000177,0.00018,8e-05,4.9e-05,9.5e-05,3.5e-05,6.6e-05,2.5e-05,2.3e-05,4.4e-05,8.2e-05,7.9e-05,3.2e-05,2.5e-05,1.3e-05,3.3e-05,2.1e-05,2.4e-05,1.2e-05,0.000151,0.000583,0.000311,0.000144,4.9e-05,2e-06,1.3e-05,1e-06,1.1e-05,1.8e-05
1.2e-05,8e-06,1e-05,2.7e-05,0.000104,0.000222,0.000163,0.000104,7.6e-05,0.00021,0.00025,4.8e-05,0.000218,0.000159,0.000307,0.000161,9.8e-05,0.000276,0.000225,0.000257,0.00016,0.000136,0.000153,0.000268,0.000295,0.000126,0.00013,0.000118,0.000304,0.000245,0.000111,7.1e-05,0.000366,0.000148,0.000162,2.7e-05,6.8e-05,0.000221,1.7e-05,0.00015,0.000178,9e-05,9.4e-05,4.1e-05,3.2e-05,4.1e-05,2.7e-05,3.4e-05,1.8e-05,2.5e-05,5.3e-05,1.7e-05,1.7e-05,4.2e-05,2.8e-05,1.5e-05,1.2e-05,3.3e-05,1.5e-05,7e-06,9e-06,2e-05,2.7e-05,1.9e-05,1.8e-05,3.2e-05,1.5e-05,1e-05,1.9e-05,1.4e-05,1.7e-05,2.2e-05,7e-06,1.7e-05,1.9e-05,6e-06,6e-06,7e-06,5e-06,7e-06,1e-05,1.8e-05,1.1e-05,9e-06,2.3e-05,1.4e-05,5.2e-05,4.2e-05,1.5e-05,1e-05,0.000164,0.000388,0.000196,0.000155,7.4e-05,2.3e-05,0.000127,4.7e-05,4.8e-05,4.8e-05,2.9e-05,4e-05,0.000201,0.000113,6.5e-05,3.5e-05,1.1e-05,2.9e-05,1.3e-05,2.2e-05,1.9e-05,0.000159,0.000219,8.8e-05,6.3e-05,2.5e-05,3.2e-05,9e-06,7e-06,7e-06,1.1e-05
1.2e-05,3e-06,1e-05,1.6e-05,0.000162,0.000212,0.000269,0.000179,0.000236,0.000134,0.00029,0.000212,0.000276,0.000171,0.000172,0.000103,0.000121,2.8e-05,0.000244,0.000227,0.000234,0.000167,0.000216,0.000183,8.4e-05,0.00014,0.000182,0.000247,0.000215,0.00034,0.000243,0.000129,0.000212,0.000106,0.000196,9.1e-05,6.6e-05,7.6e-05,0.000169,0.000285,0.000242,0.00014,4.3e-05,5.1e-05,6.7e-05,1.7e-05,2.4e-05,4.4e-05,2.5e-05,4e-05,6.8e-05,1.2e-05,2e-05,2.9e-05,1.5e-05,1.4e-05,1.4e-05,3e-05,4.7e-05,2.2e-05,1.8e-05,2.9e-05,3.1e-05,2e-05,1.8e-05,3e-05,1.9e-05,2e-05,2.4e-05,2.8e-05,2.9e-05,3.4e-05,2.6e-05,1.1e-05,7e-06,1.2e-05,1.2e-05,9e-06,7e-06,1.1e-05,8e-06,1.7e-05,1e-06,6e-06,1.7e-05,2e-06,4.4e-05,6.8e-05,5.8e-05,2.4e-05,0.000116,0.000516,0.000237,0.000102,5.2e-05,4.5e-05,0.000144,6.5e-05,9e-06,5.7e-05,6e-05,1.9e-05,0.000257,0.000121,3.5e-05,1e-05,2.4e-05,1.3e-05,1.5e-05,6e-06,3e-06,0.000148,0.000134,4.9e-05,2.3e-05,7e-06,2.5e-05,1.4e-05,3e-06,8e-06,6e-06
1.2e-05,2e-06,8e-06,4.4e-05,0.000217,9.8e-05,0.000289,0.000116,0.000194,0.000265,0.000176,5.9e-05,0.000197,0.000166,0.000193,0.000141,0.000156,0.000113,6.1e-05,0.000213,0.000254,6.8e-05,0.000245,0.000322,0.000253,0.000225,9.8e-05,0.000199,0.000251,5.7e-05,0.000169,0.000209,0.000136,0.000177,8.7e-05,0.000107,8.6e-05,0.000156,9.3e-05,0.000345,7.6e-05,5.3e-05,5.6e-05,0.000122,4.1e-05,0.000109,7.1e-05,3.8e-05,5.9e-05,8.4e-05,4.5e-05,4.9e-05,3.7e-05,2.2e-05,4.7e-05,5e-05,1.2e-05,3.3e-05,6.5e-05,4.4e-05,1.2e-05,1.6e-05,1.6e-05,1.8e-05,3.1e-05,4.2e-05,3.4e-05,2.8e-05,1.1e-05,7e-06,6e-06,6e-06,2.2e-05,2.1e-05,1.2e-05,7e-06,8e-06,3e-06,9e-06,9e-06,1e-06,1.2e-05,1.2e-05,7e-06,4e-06,6e-06,3.3e-05,0.000147,0.000106,6.1e-05,4.9e-05,0.00038,0.000314,0.000218,6.2e-05,3.6e-05,0.000114,2.8e-05,5.2e-05,3e-05,1e-04,8e-05,0.00029,0.000244,0.000138,4.3e-05,2.6e-05,2.4e-05,2e-05,2.3e-05,1.3e-05,0.000126,0.00025,0.000197,7.2e-05,2e-05,8e-06,1.1e-05,1.4e-05,1.4e-05,9e-06
3e-06,7e-06,7e-06,5.7e-05,0.000155,8.8e-05,0.00025,0.000199,0.000138,0.000185,0.000136,3.3e-05,0.000154,8.3e-05,0.000195,0.000136,9.9e-05,0.000205,0.000167,1.3e-05,0.000158,7.8e-05,0.000171,7.6e-05,0.000247,8.9e-05,0.000141,0.000254,0.000266,0.000164,0.000191,0.000208,0.000169,0.000108,0.000162,0.000101,5.2e-05,0.000253,0.000173,0.000164,0.000109,9.8e-05,3.8e-05,9.5e-05,4.5e-05,0.000127,7.5e-05,4.8e-05,1.9e-05,2.1e-05,5.4e-05,3.6e-05,2.1e-05,2.7e-05,4.9e-05,3.9e-05,3.5e-05,2.2e-05,4.2e-05,2.6e-05,6e-06,3e-05,6e-06,2.1e-05,2.7e-05,3e-05,1.6e-05,1.3e-05,3e-06,3e-06,8e-06,1.9e-05,1.2e-05,8e-06,8e-06,5e-06,1.7e-05,1.2e-05,8e-06,5e-06,5e-06,3e-06,8e-06,7e-06,5e-06,3e-06,1.3e-05,0.000156,9.5e-05,3.8e-05,3.9e-05,0.00021,0.000128,0.000147,5e-05,4.1e-05,1e-04,2.5e-05,4.1e-05,2.2e-05,0.000112,4.8e-05,0.000241,0.000172,8.7e-05,5.7e-05,1.4e-05,9e-06,1.4e-05,2.3e-05,1.4e-05,9.9e-05,0.000237,0.000174,0.000103,2.6e-05,1.6e-05,1.3e-05,3e-06,6e-06,4e-06
2e-06,4e-06,5e-06,4.4e-05,0.000133,0.000204,0.00011,0.000162,0.000147,9.4e-05,0.000192,6.1e-05,0.000163,0.000227,0.000254,0.000157,0.000239,0.000335,8.3e-05,0.000182,0.000126,4.5e-05,0.000138,0.000195,0.000132,6.5e-05,7.9e-05,0.000199,0.000196,9.7e-05,8.4e-05,0.00019,0.000175,6.3e-05,0.000154,0.000107,4.8e-05,0.000183,0.000119,0.00011,6.1e-05,4.6e-05,2.3e-05,4e-05,2.4e-05,5.6e-05,2.7e-05,2.1e-05,1.6e-05,3.4e-05,2.5e-05,9e-06,7e-06,1.4e-05,3.5e-05,1.6e-05,1e-05,1.4e-05,3.2e-05,1e-06,1.6e-05,2.5e-05,1.2e-05,1.3e-05,1.8e-05,2e-05,3e-06,1e-06,5e-06,5e-06,2e-06,1e-05,1.1e-05,5e-06,5e-06,7e-06,1.3e-05,3e-06,1e-06,1.1e-05,1e-06,5e-06,4e-06,3e-06,1.1e-05,3e-06,1.3e-05,0.000115,1.4e-05,5e-06,5.1e-05,0.000142,7.5e-05,0.00011,3.6e-05,1.2e-05,9.7e-05,7e-06,4.9e-05,1.5e-05,6.7e-05,2.1e-05,0.000196,2.9e-05,2.3e-05,1.5e-05,9e-06,1.3e-05,4e-06,1.6e-05,3e-06,8e-05,0.000171,9.9e-05,4e-05,1.3e-05,1.5e-05,6e-06,4e-06,5e-06,2e-06
2e-06,4e-06,4e-06,3.9e-05,0.00012,0.000178,0.000203,0.000156,0.000117,0.000181,0.000226,7.5e-05,0.000239,0.000278,0.000147,7.5e-05,0.000165,9.3e-05,8.7e-05,0.00023,0.000181,9.9e-05,7.5e-05,0.000138,6.2e-05,7.1e-05,0.000105,0.000149,0.000263,0.000149,0.000119,9.2e-05,0.000153,5e-05,0.000185,2.7e-05,3.5e-05,0.000213,0.000112,5.6e-05,2.1e-05,3.6e-05,3.4e-05,4.3e-05,1.2e-05,6.1e-05,1.6e-05,1.9e-05,7e-06,2.8e-05,2.6e-05,1.1e-05,1e-06,1.3e-05,3.4e-05,5e-06,1.1e-05,2e-06,2.2e-05,4e-06,1.1e-05,2e-05,1.3e-05,3e-06,1.7e-05,1.7e-05,2e-06,4e-06,2e-06,1e-05,4e-06,5e-06,6e-06,3e-06,3e-06,3e-06,7e-06,3e-06,1e-06,7e-06,4e-06,5e-06,3e-06,3e-06,1e-05,2e-06,1.5e-05,7.1e-05,9e-06,3e-06,6.9e-05,7.2e-05,1.5e-05,8.2e-05,1.9e-05,1.7e-05,9.5e-05,9e-06,3.8e-05,1.9e-05,4.7e-05,1.1e-05,0.000175,6e-05,1.9e-05,9e-06,1.2e-05,1.7e-05,6e-06,9e-06,1e-06,7.3e-05,7.8e-05,3.1e-05,8e-06,6e-06,1e-06,3e-06,3e-06,1e-06,1e-06
1e-06,4e-06,3e-06,4.5e-05,0.000113,0.00016,0.000194,0.000203,0.000121,0.000171,0.000207,0.000116,0.000166,0.000183,0.000221,5.7e-05,9.7e-05,0.000119,9.6e-05,0.000215,0.000154,0.000142,1e-05,0.000124,1.4e-05,6.9e-05,7.5e-05,0.000158,0.000116,0.000119,0.00015,0.000136,0.000173,2.2e-05,0.000161,2.2e-05,4.8e-05,0.000175,9.2e-05,7.1e-05,1e-05,3.5e-05,3e-05,4.2e-05,6e-06,5.7e-05,1.4e-05,1.5e-05,3e-06,2.9e-05,1.9e-05,5e-06,2e-06,1.1e-05,3.6e-05,6e-06,1.2e-05,5e-06,1.6e-05,3e-06,1.6e-05,2.1e-05,1e-05,4e-06,1.8e-05,1.4e-05,2e-06,5e-06,3e-06,8e-06,0,6e-06,7e-06,2e-06,2e-06,4e-06,7e-06,3e-06,3e-06,7e-06,4e-06,3e-06,2e-06,3e-06,1.1e-05,1e-06,1.8e-05,6e-05,1e-05,3e-06,8.3e-05,3.8e-05,1.1e-05,8.5e-05,1.3e-05,9e-06,9.3e-05,4e-06,3.5e-05,1.1e-05,4.2e-05,8e-06,0.000119,2.7e-05,3e-06,3e-06,9e-06,9e-06,8e-06,7e-06,1e-06,6.8e-05,1.5e-05,1.1e-05,1e-06,6e-06,2e-06,4e-06,2e-06,1e-06,2e-06
