1.5e-05,2e-05,1.9e-05,1.4e-05,2.3e-05,1.7e-05,4e-06,2.9e-05,1.5e-05,6e-06,5e-06,6e-06,1.8e-05,2e-06,1.3e-05,9e-06,1e-05,1.5e-05,8e-06,1.7e-05,5e-06,4e-06,1.5e-05,7e-06,1.3e-05,1.5e-05,0,1.2e-05,5e-06,8e-06,1e-05,1.8e-05,1.3e-05,0,1.1e-05,1.3e-05,1.3e-05,1.8e-05,4e-06,1.7e-05,2.8e-05,2e-05,3e-05,3e-06,1.8e-05,0,5e-06,8e-06,0,1.8e-05,6e-06,9e-06,2.4e-05,1e-06,1e-05,1.8e-05,1.3e-05,2e-05,3e-06,8e-06,9e-06,1.3e-05,3e-06,4e-06,1.6e-05,4e-06,4e-06,0,2e-06,2.8e-05,1.4e-05,1.5e-05,9e-06,4e-06,0.00011,4e-05,2.4e-05,3.6e-05,2.5e-05,1.7e-05,1.1e-05,2.8e-05,1.3e-05,5e-06,9e-06,4e-06,1.8e-05,1e-05,3e-06,1.1e-05,5e-06,1.7e-05,2e-06,1e-06,2e-06,5e-06,1.2e-05,2.3e-05,3e-06,5e-06,1.3e-05,1e-05,3e-06,9e-06,7e-06,0,1.2e-05,1e-06,5e-06,8e-06,5e-05,2.6e-05,1.2e-05,1e-06,1.2e-05,4.5e-05,9e-06,1.1e-05,0.000394,8.1e-05,4.2e-05
7.6e-05,8.5e-05,7.3e-05,9.9e-05,7.6e-05,8e-05,6.3e-05,7.6e-05,8.6e-05,9.9e-05,7.4e-05,5.3e-05,6.2e-05,5.2e-05,6e-05,6.5e-05,4.5e-05,5e-05,7.6e-05,8.5e-05,6.7e-05,4.8e-05,3.8e-05,5.2e-05,7.4e-05,7.3e-05,4.3e-05,4.1e-05,4.9e-05,6.6e-05,7e-05,6.6e-05,5.4e-05,6.5e-05,7.7e-05,7.2e-05,6.9e-05,6.6e-05,4.8e-05,6.1e-05,8.7e-05,9.2e-05,0.000113,6.7e-05,2.5e-05,3.5e-05,3.2e-05,1.6e-05,4.4e-05,5.2e-05,4.6e-05,5.2e-05,7.8e-05,6.2e-05,5.8e-05,5.8e-05,5e-05,7e-05,4.3e-05,4.1e-05,4.4e-05,4.5e-05,1.9e-05,5.6e-05,5.3e-05,5.1e-05,4.5e-05,3e-05,5.7e-05,7.9e-05,7.6e-05,1.4e-05,1.9e-05,3.3e-05,0.000172,0.000214,7e-05,6.4e-05,4.2e-05,6.8e-05,5.9e-05,0.000108,8e-05,5.8e-05,5.5e-05,5.2e-05,4.4e-05,5.5e-05,4.5e-05,4e-05,5.3e-05,5.8e-05,3.8e-05,4.4e-05,4.2e-05,3.2e-05,4.3e-05,7.3e-05,7.2e-05,8.3e-05,7.6e-05,6.6e-05,5.9e-05,5.5e-05,4.1e-05,4.2e-05,3.4e-05,3.4e-05,4.5e-05,4.6e-05,9.4e-05,0.000122,8e-05,6.7e-05,6e-05,0.000111,0.000108,7.7e-05,0.000754,0.000643,0.000532
2.9e-05,1.9e-05,4e-05,5.8e-05,1.6e-05,2.7e-05,3.3e-05,1.1e-05,5.2e-05,5.2e-05,2.9e-05,2.1e-05,4.5e-05,1.7e-05,4.4e-05,2.4e-05,2.8e-05,1.6e-05,5.1e-05,4.4e-05,4.2e-05,3.4e-05,2.8e-05,2.9e-05,4.8e-05,2.2e-05,2.2e-05,2e-05,2.5e-05,6.8e-05,1.9e-05,1.8e-05,1.9e-05,4.8e-05,4.1e-05,2.9e-05,2.2e-05,6e-06,2.8e-05,2.9e-05,1.2e-05,5.3e-05,2.1e-05,6.2e-05,3.2e-05,4e-05,1.9e-05,2.7e-05,3.1e-05,1.4e-05,2.3e-05,3.8e-05,2e-05,4.3e-05,1.3e-05,1.1e-05,2e-05,3.2e-05,2.3e-05,2.8e-05,1.5e-05,1.5e-05,2.7e-05,4.8e-05,6e-06,4.2e-05,9e-06,2.6e-05,4.2e-05,2.8e-05,2.1e-05,3.3e-05,3.4e-05,2.8e-05,0.000158,0.000316,0.000252,0.000146,0.000167,8.4e-05,4.2e-05,0.000116,7.3e-05,1.3e-05,2.7e-05,1.7e-05,3e-05,3.7e-05,2.5e-05,2.3e-05,3.6e-05,2.1e-05,5.3e-05,1.4e-05,2.3e-05,4.3e-05,1e-05,2.9e-05,4.6e-05,4.6e-05,4.2e-05,1e-05,2.7e-05,2.4e-05,2.2e-05,4.4e-05,2.2e-05,3.4e-05,2.8e-05,2.1e-05,2.8e-05,3.3e-05,1.6e-05,4.6e-05,2.2e-05,3.5e-05,1.7e-05,2.2e-05,0.000628,0.001167,0.000509
4.7e-05,5.2e-05,5.4e-05,8.3e-05,8.1e-05,3.2e-05,4.3e-05,5e-05,3.5e-05,8.2e-05,5.3e-05,2.5e-05,3.2e-05,1.6e-05,3.9e-05,6.8e-05,6.9e-05,4.7e-05,6.2e-05,6.4e-05,6e-06,2.6e-05,2.2e-05,3.8e-05,6.8e-05,3.4e-05,3.9e-05,3.2e-05,3.3e-05,3.9e-05,6.9e-05,7.2e-05,5e-05,7.1e-05,8.7e-05,3e-05,4e-06,3e-05,4.6e-05,5.1e-05,2.1e-05,4e-05,4.7e-05,2.6e-05,3.9e-05,4.4e-05,5.7e-05,4.3e-05,5e-05,4e-05,2.4e-05,6.5e-05,6.3e-05,3.4e-05,4.4e-05,3.2e-05,6e-05,4.4e-05,2e-05,4.4e-05,4.8e-05,6e-05,4.4e-05,5.9e-05,5.5e-05,2.7e-05,3.9e-05,1.9e-05,3.5e-05,5.6e-05,5e-05,5.5e-05,6.6e-05,5.1e-05,0.000181,0.000195,0.000228,0.000465,0.000592,0.000213,0.000102,0.000123,6.3e-05,3.3e-05,4.3e-05,4.5e-05,6.5e-05,4.4e-05,3.8e-05,1.8e-05,5.5e-05,5.5e-05,6.2e-05,6.6e-05,6e-05,4.6e-05,5e-05,4.9e-05,1.3e-05,7.2e-05,2.5e-05,1.3e-05,2e-05,1.7e-05,1.6e-05,6.3e-05,5.6e-05,4.1e-05,7.1e-05,6.5e-05,6.9e-05,7e-05,4.3e-05,3.2e-05,4.4e-05,2.7e-05,3.5e-05,4.1e-05,0.000567,0.000714,0.000351
1.1e-05,1.6e-05,3.3e-05,1.8e-05,1.2e-05,1.1e-05,3.5e-05,1.1e-05,2.9e-05,4.2e-05,4.3e-05,2.1e-05,1.7e-05,1.4e-05,2e-05,2.6e-05,2.7e-05,2e-05,5e-06,2e-05,4.3e-05,1.1e-05,1.5e-05,1.5e-05,2.3e-05,2.1e-05,1.8e-05,1.4e-05,2.2e-05,1.2e-05,2.6e-05,2.3e-05,1.3e-05,2e-05,2.3e-05,3.8e-05,2e-05,2.4e-05,3.2e-05,2.5e-05,3e-05,3.4e-05,8e-06,2.2e-05,3.7e-05,3.1e-05,3.1e-05,2e-06,2.5e-05,2.1e-05,1.3e-05,3.8e-05,1.3e-05,1e-05,1.8e-05,2.3e-05,6e-05,1.9e-05,7e-06,2.7e-05,2.5e-05,3.7e-05,1e-05,1.1e-05,1.6e-05,1.1e-05,4e-06,1e-05,4.3e-05,8e-06,2.3e-05,4.8e-05,2.1e-05,1.2e-05,0.000162,0.000209,0.000284,0.000363,0.000349,0.000298,0.000149,1.8e-05,9e-06,1.3e-05,4.8e-05,2.4e-05,4.1e-05,4e-06,8e-06,3.3e-05,4.8e-05,1.5e-05,3.6e-05,3.9e-05,1.6e-05,1.1e-05,4.1e-05,1.1e-05,1.7e-05,4.2e-05,3.3e-05,2.1e-05,1.1e-05,2.8e-05,1.6e-05,1.5e-05,1.6e-05,3.1e-05,5.2e-05,3e-05,8.7e-05,4.4e-05,2.8e-05,1.1e-05,2.6e-05,4.6e-05,2.4e-05,4.8e-05,0.000692,0.000408,0.000255
1e-06,2.2e-05,3.9e-05,2.1e-05,2e-05,1.6e-05,2.6e-05,4e-05,9e-06,3e-05,1.3e-05,1.6e-05,2.2e-05,2.2e-05,1.3e-05,2.1e-05,5e-06,1.7e-05,8e-06,9e-06,2.9e-05,2.7e-05,3e-06,9e-06,2.3e-05,4e-06,2.4e-05,2.9e-05,3.4e-05,1.5e-05,2.2e-05,8e-06,2e-05,3e-05,1.8e-05,1e-05,2.3e-05,2.4e-05,2.1e-05,2.2e-05,9e-06,8e-06,1.8e-05,1e-05,1.5e-05,1.7e-05,1.1e-05,1.1e-05,2.9e-05,1.8e-05,2.9e-05,2.5e-05,3.2e-05,1.9e-05,5e-06,1.9e-05,2.7e-05,1.9e-05,1.7e-05,4e-06,1.8e-05,1.5e-05,1.5e-05,2.7e-05,1.5e-05,1.6e-05,3e-05,1.8e-05,2.3e-05,2.9e-05,1.2e-05,3.8e-05,2.7e-05,2.2e-05,9.7e-05,0.000224,2e-05,0.00058,0.000218,0.000288,0.000174,9.6e-05,3.1e-05,2.2e-05,5.4e-05,7.7e-05,5.6e-05,3.5e-05,3.4e-05,4.9e-05,1.8e-05,1.8e-05,2.7e-05,9e-06,3.1e-05,3.1e-05,3.6e-05,3.8e-05,2.1e-05,3.1e-05,1.9e-05,3.2e-05,2.5e-05,4.5e-05,2.5e-05,2.9e-05,1.3e-05,2.6e-05,1.5e-05,3.3e-05,0.000107,3.6e-05,4.4e-05,3.3e-05,4.5e-05,3.9e-05,3.5e-05,6.2e-05,0.000948,0.001311,0.000724
4.3e-05,3e-05,2.6e-05,2.1e-05,4e-05,4.1e-05,4.5e-05,3.1e-05,2.6e-05,3e-06,1.2e-05,1.5e-05,9e-06,1.1e-05,3.2e-05,3.2e-05,1.9e-05,3e-06,1.7e-05,4e-05,1.8e-05,1.9e-05,1.9e-05,1.3e-05,1.3e-05,1.9e-05,2.2e-05,3.5e-05,1.9e-05,1.5e-05,4.2e-05,4.7e-05,4.9e-05,1.8e-05,1.7e-05,1e-05,2.4e-05,2.7e-05,3.2e-05,1e-05,3e-06,1.1e-05,2.3e-05,3.7e-05,3.7e-05,4e-05,2.3e-05,2e-05,1.3e-05,3.6e-05,1.2e-05,1.9e-05,2.5e-05,2.1e-05,1.6e-05,1.5e-05,3.1e-05,4.2e-05,1.6e-05,1.7e-05,3e-05,1.6e-05,9e-06,8e-06,2.5e-05,4.8e-05,1.9e-05,3.8e-05,2.6e-05,2.7e-05,2.7e-05,3.9e-05,4.8e-05,3.7e-05,9.2e-05,0.000148,5.8e-05,0.000847,0.000296,0.00026,5.8e-05,5.4e-05,2.1e-05,2.3e-05,1.3e-05,4.2e-05,4.1e-05,2.7e-05,2.7e-05,4.4e-05,6e-05,8e-06,2.2e-05,2.1e-05,2.2e-05,2.6e-05,5.3e-05,3.2e-05,1.3e-05,2.3e-05,3.1e-05,5.6e-05,4.6e-05,8e-06,9e-06,3.4e-05,2.6e-05,1e-05,3.3e-05,5.1e-05,9.1e-05,1.1e-05,3.9e-05,5.6e-05,1.9e-05,3.8e-05,2.1e-05,3.3e-05,0.001233,0.000876,0.000587
1.5e-05,2.3e-05,2.7e-05,1.1e-05,1.8e-05,2e-05,3.5e-05,9e-06,2.4e-05,2.6e-05,4.7e-05,5.8e-05,2.7e-05,1.5e-05,1.4e-05,4e-06,3e-05,1.6e-05,9e-06,3e-05,4e-05,3.6e-05,1.4e-05,2.6e-05,1.9e-05,3e-06,1.2e-05,2.2e-05,1.5e-05,5e-06,3.7e-05,2.8e-05,1.3e-05,1.8e-05,1e-05,2.6e-05,4e-05,3.6e-05,1.9e-05,2e-06,1.2e-05,2.6e-05,1.1e-05,4.1e-05,4.3e-05,1.3e-05,3.9e-05,9e-06,9e-06,1.9e-05,2.5e-05,9e-06,2.5e-05,2.8e-05,2.1e-05,1.4e-05,3.9e-05,2.5e-05,1.7e-05,2.7e-05,4e-06,5e-06,5e-06,2.4e-05,2.3e-05,5.2e-05,2.4e-05,3.1e-05,0.000106,4.9e-05,3e-05,3.7e-05,2.7e-05,2.7e-05,8.9e-05,0.000517,0.00045,0.00101,0.001162,0.000311,0.000121,0.000115,6e-05,1.5e-05,4e-05,1.6e-05,4.2e-05,1.6e-05,4.3e-05,8.3e-05,2.1e-05,7.5e-05,3.3e-05,1.9e-05,1.2e-05,4.1e-05,3e-05,3.3e-05,1.7e-05,5.7e-05,2.8e-05,3.6e-05,2.1e-05,1.5e-05,1.9e-05,1.3e-05,3.8e-05,1.2e-05,3.5e-05,4.1e-05,7.3e-05,0.00013,7.4e-05,5e-06,1.4e-05,3e-05,1e-05,4e-05,0.001519,0.002206,0.000733
2.1e-05,2.8e-05,3.5e-05,5e-06,8e-06,3.3e-05,2.7e-05,2.9e-05,6.2e-05,6e-06,8.3e-05,7.7e-05,4.3e-05,3.9e-05,3.1e-05,8e-06,2.9e-05,1.9e-05,1.1e-05,1.3e-05,4.2e-05,3.1e-05,1.1e-05,3.6e-05,1.9e-05,9e-06,2.2e-05,3e-05,2.6e-05,1.5e-05,2.5e-05,4.7e-05,6e-05,3.7e-05,5.1e-05,3.1e-05,2.5e-05,1.5e-05,2.5e-05,6e-06,7e-06,2.5e-05,1e-05,5e-05,4.3e-05,1.2e-05,4.3e-05,5.1e-05,3e-05,2.3e-05,4.9e-05,5.1e-05,6e-05,2.8e-05,2.7e-05,1.7e-05,4.5e-05,3.2e-05,2e-05,2e-06,8e-06,9e-06,2e-05,3.7e-05,2.3e-05,5.5e-05,2.9e-05,2.7e-05,0.000122,8.9e-05,3.9e-05,7.8e-05,5.1e-05,2.2e-05,4e-05,0.000608,0.000107,0.001069,0.001988,0.001749,0.00082,0.000267,0.000115,9.4e-05,6.4e-05,7.3e-05,3e-05,3.2e-05,4.3e-05,4.8e-05,8.7e-05,0.00012,7.8e-05,5e-05,5.7e-05,4.4e-05,7.8e-05,9.4e-05,5.8e-05,7.3e-05,7.1e-05,5.6e-05,3.1e-05,1e-05,2.4e-05,6.1e-05,8.9e-05,6.9e-05,7.8e-05,9.8e-05,5.7e-05,0.000256,0.000162,8.8e-05,4e-05,2.2e-05,4.2e-05,7.4e-05,0.001649,0.003525,0.002165
2.2e-05,1e-05,4.1e-05,4.2e-05,4.1e-05,1e-05,3.5e-05,2.9e-05,3.9e-05,5.1e-05,0.000119,0.000189,0.000101,3.2e-05,4.6e-05,2.5e-05,2.4e-05,2.5e-05,3.4e-05,1.5e-05,5.1e-05,3.6e-05,2e-05,2.1e-05,1.4e-05,2.5e-05,1.1e-05,1.5e-05,2.6e-05,1e-05,1.1e-05,4e-06,3.8e-05,1.7e-05,4.4e-05,3.5e-05,1.4e-05,3e-05,3.4e-05,1.9e-05,4e-06,2.4e-05,2.4e-05,5.4e-05,7.6e-05,4.1e-05,1.4e-05,2.6e-05,1.1e-05,2.5e-05,4.4e-05,4.7e-05,2.6e-05,2.1e-05,2.9e-05,1.5e-05,2.8e-05,1.1e-05,2.5e-05,1.1e-05,1.5e-05,4e-06,1.8e-05,3.5e-05,2.2e-05,6e-05,5.7e-05,4e-05,0.000113,1.6e-05,6.4e-05,4.8e-05,6.4e-05,4.5e-05,1.8e-05,0.000459,0.000457,0.000698,0.000849,0.000661,0.000353,0.000135,4.1e-05,4.7e-05,1e-04,8.6e-05,6.4e-05,3.9e-05,4.3e-05,5.8e-05,9.2e-05,1.2e-05,6.8e-05,4.2e-05,1.1e-05,3.2e-05,3.4e-05,3.9e-05,3.9e-05,8.3e-05,5.7e-05,2.5e-05,4.7e-05,1.6e-05,3e-05,6.4e-05,8.8e-05,3.1e-05,7.2e-05,3e-05,7e-05,0.000244,0.000124,4.1e-05,2e-05,6.3e-05,9.5e-05,0.000122,0.001729,0.002159,0.001331
1.6e-05,1.7e-05,2.5e-05,2.9e-05,1.5e-05,1.2e-05,3e-05,1.1e-05,3.6e-05,2.9e-05,6.5e-05,0.000141,9.8e-05,6.1e-05,2.2e-05,3e-06,4e-06,7e-06,2.4e-05,2.8e-05,2.3e-05,1.7e-05,6e-06,1.1e-05,4e-06,1.9e-05,1.4e-05,1.4e-05,2.6e-05,1.5e-05,9e-06,1.8e-05,2e-05,2.8e-05,1.6e-05,2.5e-05,2.1e-05,3.2e-05,1.4e-05,6e-06,1.4e-05,9e-06,1.6e-05,3.9e-05,1.2e-05,1.3e-05,1.1e-05,5e-06,1.8e-05,3.2e-05,4e-05,1e-05,4e-06,7e-06,1.2e-05,1.5e-05,2.1e-05,3e-05,5e-06,1.7e-05,2e-05,1.8e-05,1.2e-05,2.1e-05,1.8e-05,2.7e-05,2.4e-05,4.7e-05,4.6e-05,7.6e-05,3.3e-05,4.8e-05,2.8e-05,5e-06,7e-06,0.000211,0.000168,0.000761,0.000516,0.000305,0.000168,6.1e-05,6e-05,4.3e-05,1e-04,3.8e-05,1.7e-05,1.4e-05,4.9e-05,3.4e-05,2.2e-05,2.7e-05,5.7e-05,3.2e-05,8e-06,1.1e-05,2.6e-05,1.9e-05,2.7e-05,1.6e-05,1.9e-05,1.4e-05,5.2e-05,2.6e-05,2.5e-05,6.3e-05,1.3e-05,1.9e-05,5.4e-05,6.3e-05,0.000121,0.00016,7.1e-05,3.1e-05,2.6e-05,3.7e-05,5.5e-05,8.4e-05,0.001786,0.000192,4.7e-05
6e-06,8e-06,1.2e-05,1.2e-05,1.7e-05,9e-06,1.5e-05,2e-05,2.6e-05,1.1e-05,6.3e-05,2.8e-05,2.3e-05,2.1e-05,1.6e-05,1.2e-05,4e-06,3e-06,1.8e-05,9e-06,1.3e-05,1.6e-05,7e-06,1e-06,3e-06,7e-06,4e-06,1e-05,7e-06,6e-06,8e-06,1.6e-05,4e-06,1.9e-05,1e-05,1.5e-05,9e-06,9e-06,4e-06,1e-06,6e-06,1.1e-05,2.2e-05,4e-06,6e-06,1e-05,1.3e-05,1e-06,1.2e-05,8e-06,1.7e-05,2e-05,7e-06,1.3e-05,1.2e-05,6e-06,1.3e-05,8e-06,7e-06,1.3e-05,3e-06,6e-06,5e-06,1.3e-05,1.4e-05,2e-06,1.4e-05,9e-06,2.2e-05,2.3e-05,1.8e-05,2.8e-05,8e-06,1.1e-05,1.9e-05,3.8e-05,5.5e-05,0.000462,0.000342,1.8e-05,8.5e-05,3.4e-05,1e-05,1.3e-05,3.4e-05,1.2e-05,1.6e-05,2.1e-05,9e-06,3.2e-05,1.2e-05,1.7e-05,2.8e-05,6e-06,1.1e-05,1.2e-05,1.8e-05,1.9e-05,3.4e-05,2.4e-05,4.4e-05,1.9e-05,4.4e-05,2.7e-05,1.2e-05,2.4e-05,1.3e-05,3.6e-05,3.2e-05,2.5e-05,7.2e-05,1e-05,2.5e-05,2.2e-05,9e-06,2.7e-05,2.6e-05,1.9e-05,0.001526,0.000629,0.000112
7e-06,7e-06,9e-06,6e-06,1.7e-05,4e-06,4e-06,1.4e-05,1.1e-05,3e-06,6e-05,5.4e-05,2.2e-05,3e-05,9e-06,1.1e-05,2e-06,4e-06,7e-06,1.2e-05,1.3e-05,8e-06,6e-06,5e-06,8e-06,5e-06,5e-06,6e-06,9e-06,0,1.1e-05,9e-06,8e-06,1.4e-05,2e-06,9e-06,6e-06,2e-06,7e-06,9e-06,1.3e-05,6e-06,8e-06,1.2e-05,1.2e-05,1e-05,1e-05,4e-06,2e-06,8e-06,7e-06,4e-06,1.4e-05,1.2e-05,1e-05,9e-06,8e-06,1.1e-05,7e-06,6e-06,1e-06,1e-05,1.3e-05,1.1e-05,3e-06,1.6e-05,4e-06,1.2e-05,2.8e-05,3e-06,2.6e-05,8e-06,9e-06,8e-06,3.3e-05,2.5e-05,2.4e-05,0.000271,0.00062,0.000151,0.000117,3.4e-05,2.5e-05,3e-06,4e-06,6e-06,1.8e-05,8e-06,1.8e-05,2.9e-05,1.8e-05,1.8e-05,6e-06,1.6e-05,5e-06,1.8e-05,2.6e-05,1.3e-05,3.5e-05,1.7e-05,2.3e-05,8e-06,4.9e-05,3.6e-05,3.2e-05,3.8e-05,4.2e-05,9e-06,1.9e-05,2.5e-05,8.4e-05,6e-05,2.1e-05,1.2e-05,1.5e-05,8e-06,1.4e-05,1.3e-05,0.001173,0.002022,0.001381
5e-06,1e-05,4e-06,6e-06,1.8e-05,1.7e-05,8e-06,1.5e-05,4e-06,7e-06,3.3e-05,2e-05,1.6e-05,1.8e-05,1.3e-05,1.2e-05,5e-06,2e-06,7e-06,3e-06,1.5e-05,1.1e-05,9e-06,7e-06,2e-06,5e-06,8e-06,2e-06,1.3e-05,3e-06,4e-06,7e-06,1e-05,1.5e-05,1e-05,1.6e-05,1.2e-05,5e-06,8e-06,7e-06,9e-06,6e-06,5e-06,1.6e-05,1e-05,4e-06,5e-06,7e-06,7e-06,1e-05,7e-06,5e-06,5e-06,2e-05,4e-06,4e-06,3e-06,9e-06,6e-06,1e-05,4e-06,2e-06,7e-06,1.4e-05,1.6e-05,8e-06,5e-06,2e-05,4.1e-05,3.9e-05,1.9e-05,2.4e-05,9e-06,7e-06,5.3e-05,0.000211,9.8e-05,0.000104,0.000256,0.000189,9.7e-05,5.4e-05,1.2e-05,1.9e-05,3e-06,1.5e-05,9e-06,2.5e-05,1.9e-05,1.4e-05,1.3e-05,1.8e-05,1.1e-05,6e-06,1e-06,2e-05,4.1e-05,3.3e-05,1.7e-05,7e-06,2.3e-05,2.1e-05,7.3e-05,2.4e-05,3.9e-05,2.8e-05,5.4e-05,7e-06,3.8e-05,2.5e-05,7.9e-05,4.6e-05,2.6e-05,8e-06,1.8e-05,2.2e-05,1.9e-05,3.5e-05,0.00084,0.001864,0.000891
1.5e-05,6e-06,5e-06,1.7e-05,2.8e-05,8e-06,4e-06,8e-06,1e-05,1.5e-05,2e-05,3.1e-05,1.2e-05,1.3e-05,9e-06,1.2e-05,2.2e-05,4e-06,8e-06,4e-06,1.3e-05,1e-05,2e-06,7e-06,8e-06,7e-06,1e-05,1.2e-05,5e-06,6e-06,1e-06,9e-06,6e-06,1e-05,1.2e-05,5e-06,9e-06,1e-06,1e-06,1.3e-05,1.5e-05,1e-05,1e-05,5e-06,1.5e-05,9e-06,7e-06,1.1e-05,1e-06,2e-06,1.6e-05,1.8e-05,8e-06,1.9e-05,8e-06,1.1e-05,6e-06,1.4e-05,1.7e-05,2e-06,4e-06,1.4e-05,5e-06,8e-06,1.9e-05,3e-05,1e-05,9e-06,4.9e-05,2.1e-05,2e-05,1.4e-05,6e-06,5e-06,7e-05,0.00046,0.000381,2.7e-05,0.000213,7.7e-05,4.3e-05,5.4e-05,2.7e-05,2.3e-05,2.5e-05,7e-06,1.9e-05,2.8e-05,2.6e-05,3.6e-05,2.6e-05,1.3e-05,2.8e-05,1.5e-05,2e-06,1.4e-05,4.3e-05,2e-05,1.4e-05,3.7e-05,3.4e-05,4.2e-05,0.000114,5.4e-05,1.9e-05,3.1e-05,3.3e-05,4.6e-05,2.8e-05,3e-05,2.2e-05,6.6e-05,2.7e-05,2.7e-05,2e-06,1.3e-05,2.3e-05,2.5e-05,0.000449,0.000571,0.000536
1.5e-05,3e-06,1e-05,1.1e-05,9e-06,1.5e-05,1.4e-05,6e-06,8e-06,8e-06,5.4e-05,3e-05,1.8e-05,1.2e-05,8e-06,7e-06,1.2e-05,2.2e-05,1e-05,1.1e-05,1.1e-05,5e-06,3e-06,6e-06,9e-06,1.2e-05,1.1e-05,4e-06,8e-06,2e-06,6e-06,1e-06,1e-06,1.9e-05,6e-06,9e-06,1e-05,1e-05,2e-06,1.1e-05,7e-06,3e-06,8e-06,3e-06,1.8e-05,9e-06,4e-06,7e-06,9e-06,2e-06,2.7e-05,2.1e-05,2.2e-05,2.1e-05,2.5e-05,1.8e-05,1.7e-05,3.3e-05,3.1e-05,2.5e-05,8e-06,3e-05,1.4e-05,3.3e-05,1.5e-05,3.4e-05,3.3e-05,3.4e-05,4e-05,1.6e-05,4e-06,2.1e-05,1.3e-05,9e-06,0.000104,0.000574,0.000195,0.000522,4e-04,8.7e-05,6.1e-05,3.3e-05,1.4e-05,1.9e-05,3.5e-05,1.9e-05,1.6e-05,4.6e-05,4e-05,9e-06,1e-06,2.7e-05,3.6e-05,1.5e-05,4e-06,2.2e-05,4.1e-05,1.8e-05,2e-05,2e-05,4.2e-05,3.3e-05,9.4e-05,5e-05,5.9e-05,2.8e-05,4.3e-05,5.2e-05,3.1e-05,4.2e-05,5.1e-05,5.7e-05,4.8e-05,7e-06,1.9e-05,1.4e-05,2e-05,4.3e-05,3.5e-05,0.001422,0.000978
1.8e-05,2.3e-05,1.4e-05,1.3e-05,4e-06,4e-06,3.2e-05,1.8e-05,8e-06,6e-06,7.6e-05,5e-05,2.2e-05,1.8e-05,1.3e-05,1.7e-05,6e-06,2.2e-05,2.6e-05,3e-06,1.5e-05,7e-06,4e-06,2e-06,1.5e-05,5e-06,4e-06,2e-06,1.6e-05,2e-06,8e-06,2e-06,8e-06,1.2e-05,7e-06,5e-06,1.6e-05,2e-05,1.5e-05,1.4e-05,8e-06,8e-06,3e-06,3e-06,1.2e-05,1e-05,1.6e-05,1.9e-05,1e-05,1.3e-05,3e-05,5e-06,6e-06,8e-06,2.4e-05,6e-06,1.2e-05,2.2e-05,9e-06,1.5e-05,6e-06,2.8e-05,2.4e-05,4.2e-05,4.4e-05,4.1e-05,3.1e-05,3.6e-05,5.5e-05,5.3e-05,3.1e-05,2.7e-05,2.1e-05,6e-06,0.00014,0.000465,0.000361,0.00097,0.000558,0.000369,8e-05,1.1e-05,1.7e-05,1.8e-05,1.8e-05,3e-06,5e-06,2.9e-05,3.5e-05,1.4e-05,2.3e-05,2.3e-05,4.4e-05,2.1e-05,1.2e-05,2.9e-05,2.9e-05,1.2e-05,6e-06,1.9e-05,5.7e-05,3.1e-05,0.000126,6.1e-05,6.5e-05,4.7e-05,6.3e-05,6.8e-05,8.9e-05,3.2e-05,5.7e-05,8.1e-05,4.2e-05,1.9e-05,2.5e-05,9e-06,3.4e-05,4.2e-05,0.000242,0.002286,0.000807
1e-06,2.6e-05,1.7e-05,9e-06,4e-06,1.3e-05,3.4e-05,3.3e-05,3.4e-05,2.2e-05,8.4e-05,6.3e-05,1.8e-05,6e-06,1.8e-05,2e-05,1.3e-05,2.1e-05,1.7e-05,1.8e-05,1.1e-05,1.2e-05,7e-06,8e-06,2.1e-05,1.8e-05,1.4e-05,8e-06,2e-05,1.9e-05,1.4e-05,8e-06,1.6e-05,1.7e-05,1.3e-05,1.3e-05,2.2e-05,3e-06,3e-06,5e-06,2.4e-05,8e-06,6e-06,1e-05,9e-06,5e-06,2e-05,8e-06,1.3e-05,1.2e-05,2.8e-05,3e-05,3.5e-05,1.8e-05,2e-05,2.4e-05,1.6e-05,1.1e-05,1.3e-05,2.2e-05,1.8e-05,3.3e-05,1.4e-05,7.3e-05,2.5e-05,3e-05,1.8e-05,3.7e-05,0.000121,4.3e-05,3.4e-05,1.1e-05,1.8e-05,2.7e-05,0.000188,0.000317,0.000136,0.001367,0.001285,0.000386,9.2e-05,3.7e-05,4.8e-05,1.1e-05,5e-06,1.6e-05,1.5e-05,2.6e-05,2e-05,4.1e-05,3.6e-05,2.4e-05,6.5e-05,4.3e-05,1.8e-05,3.3e-05,7.2e-05,5.2e-05,3.8e-05,5.1e-05,8.4e-05,2.9e-05,0.000136,0.000119,3.5e-05,4.7e-05,7.6e-05,2.2e-05,5.9e-05,0.000122,9.3e-05,0.000159,7.4e-05,2.5e-05,2.7e-05,2.6e-05,4.2e-05,7.3e-05,0.000354,0.003164,0.001945
7e-06,1e-05,1.3e-05,2e-05,1.4e-05,2e-05,1.7e-05,8e-06,2.6e-05,1.3e-05,9.9e-05,8.2e-05,5.6e-05,1.8e-05,2.5e-05,4.2e-05,2.7e-05,1.2e-05,7e-06,6e-06,1.4e-05,8e-06,1.1e-05,6e-06,2.3e-05,1.4e-05,6e-06,8e-06,3e-05,3.5e-05,2.1e-05,9e-06,1.5e-05,9e-06,8e-06,2e-06,1.5e-05,2.1e-05,2.3e-05,1.7e-05,2.8e-05,1.6e-05,7e-06,1.5e-05,2e-06,4e-06,2.2e-05,3.8e-05,3.6e-05,2.9e-05,1.4e-05,2e-05,1.3e-05,2.9e-05,1.6e-05,1.7e-05,1.6e-05,1.3e-05,2.5e-05,2.4e-05,1.8e-05,1.6e-05,5e-05,6e-05,3.9e-05,3.1e-05,3.1e-05,4.8e-05,0.000145,8.8e-05,7e-06,5.2e-05,3.3e-05,2.3e-05,0.000201,0.000199,0.000229,0.001784,0.001507,0.000915,0.000286,4.1e-05,2.5e-05,2.9e-05,2.4e-05,1.8e-05,2.7e-05,4.1e-05,3.8e-05,4e-05,7.8e-05,6.5e-05,2.6e-05,6.2e-05,3.5e-05,2.5e-05,6.1e-05,7.8e-05,1.7e-05,4.9e-05,0.000121,0.000102,0.000205,0.000214,0.000106,7e-05,6.7e-05,6e-05,1.7e-05,0.000147,0.000143,0.000138,6.4e-05,5.2e-05,4.7e-05,4e-05,3.4e-05,4e-05,0.000622,0.003522,0.002041
6e-05,4e-05,1.7e-05,2.3e-05,1.3e-05,1.8e-05,2.1e-05,1.9e-05,1.1e-05,3e-06,8e-05,2.8e-05,1.1e-05,2e-05,1.5e-05,1.8e-05,2.4e-05,2.7e-05,1.7e-05,4e-06,1.2e-05,7e-06,1e-05,1e-05,2.5e-05,9e-06,1.7e-05,1.1e-05,1.6e-05,1e-05,2.3e-05,1e-05,7e-06,1.9e-05,8e-06,4e-06,8e-06,9e-06,9e-06,1.8e-05,4.2e-05,2.5e-05,1.8e-05,2.6e-05,1.9e-05,1.7e-05,2.7e-05,2.1e-05,6e-06,6e-06,1e-06,1.4e-05,2.4e-05,2.2e-05,1.3e-05,9e-06,1.5e-05,1.2e-05,2.9e-05,5.2e-05,2.2e-05,1.6e-05,5e-05,0.000118,7.4e-05,5.5e-05,6.7e-05,5.8e-05,0.00011,4.4e-05,1.8e-05,3.3e-05,2.2e-05,1.3e-05,0.000244,0.000175,5e-05,0.001742,0.00099,0.000233,2.8e-05,6.7e-05,1.8e-05,2.3e-05,3e-06,1.9e-05,1.5e-05,1.9e-05,2.8e-05,2.9e-05,7.1e-05,2.1e-05,6.4e-05,5.5e-05,4e-05,6.7e-05,3.6e-05,5.8e-05,3.9e-05,7.7e-05,0.000115,6.7e-05,0.000273,0.000326,0.000157,0.000104,0.000101,4.4e-05,5.6e-05,9e-05,9.9e-05,7.4e-05,5.6e-05,7.3e-05,3e-06,2.3e-05,3.8e-05,5.9e-05,0.000809,0.002447,0.001189
1.4e-05,3.5e-05,2.2e-05,3.2e-05,1.9e-05,1.1e-05,1.2e-05,1.8e-05,1.3e-05,4e-06,4.4e-05,2.3e-05,2.9e-05,3e-06,1.2e-05,1.3e-05,2.6e-05,1.9e-05,1.5e-05,3e-06,7e-06,1.2e-05,7e-06,6e-06,1.3e-05,7e-06,2e-05,1.1e-05,6e-06,1.9e-05,1.9e-05,1.2e-05,1.1e-05,2e-05,2.3e-05,1.1e-05,1.3e-05,5e-06,1.8e-05,1.4e-05,1.1e-05,1.1e-05,1.8e-05,1.4e-05,4e-06,9e-06,1e-05,2.1e-05,9e-06,5e-06,7e-06,8e-06,1.5e-05,4e-06,5e-06,7e-06,1.4e-05,1.8e-05,1.4e-05,2.4e-05,2.8e-05,3.1e-05,2.5e-05,7e-05,4e-05,5.1e-05,5.8e-05,2.2e-05,6.5e-05,4.4e-05,2.1e-05,1.4e-05,6e-06,2.3e-05,0.000206,0.000313,9.8e-05,0.001589,0.000695,0.000381,7.6e-05,4e-05,2.2e-05,2.4e-05,2.5e-05,7e-06,6e-06,8e-06,2.2e-05,6.8e-05,8.2e-05,4.8e-05,4.9e-05,4.1e-05,2.2e-05,6.4e-05,5e-05,2.3e-05,3.3e-05,4.6e-05,6.9e-05,8.3e-05,0.000309,0.000256,0.000142,0.000109,5.4e-05,5.5e-05,6.5e-05,4.3e-05,0.000115,1.5e-05,3.6e-05,4.3e-05,4.7e-05,4e-05,3.9e-05,5.5e-05,0.000875,0.000603,0.000277
1.1e-05,2.9e-05,2.3e-05,1.5e-05,2.9e-05,1.5e-05,8e-06,3e-06,6e-06,1.3e-05,3.1e-05,1.8e-05,2e-05,3.5e-05,3.4e-05,1.1e-05,2.9e-05,2.6e-05,1.4e-05,1.6e-05,1e-05,6e-06,4e-06,9e-06,1e-05,7e-06,1.6e-05,1e-05,6e-06,1.1e-05,5e-06,1e-06,1.4e-05,4e-06,1.1e-05,1.1e-05,1.5e-05,1.6e-05,1.7e-05,1.2e-05,1e-05,1e-05,4e-06,7e-06,7e-06,4e-06,1e-05,1.4e-05,7e-06,5e-06,3e-06,8e-06,9e-06,5e-06,5e-06,5e-06,9e-06,4e-06,4e-06,1.7e-05,1.6e-05,1e-06,1.1e-05,2.1e-05,1.1e-05,4e-05,2.4e-05,5.2e-05,4e-06,2.4e-05,1.6e-05,3.5e-05,2.7e-05,2.1e-05,0.000186,0.000363,0.000293,0.001329,0.00045,0.000159,3.3e-05,3.9e-05,1.3e-05,1.2e-05,1.5e-05,1e-05,8e-06,9e-06,1.4e-05,5.7e-05,2.6e-05,1.5e-05,3e-05,4.4e-05,2.6e-05,4e-05,5e-06,1.2e-05,2.3e-05,4.6e-05,2.5e-05,4.1e-05,0.000177,4.5e-05,5.1e-05,1.9e-05,3.9e-05,6.1e-05,2.8e-05,6.8e-05,9.3e-05,5.8e-05,4.4e-05,2.6e-05,2.2e-05,3e-06,3.5e-05,7.1e-05,0.000869,0.000158,3e-04
5e-06,6e-06,3e-06,8e-06,7e-06,4e-06,4e-06,4e-06,6e-06,8e-06,1.6e-05,1.3e-05,1.9e-05,1.6e-05,6e-06,7e-06,1e-05,9e-06,8e-06,4e-06,1e-06,2e-06,5e-06,1e-06,3e-06,3e-06,6e-06,4e-06,1e-06,9e-06,0,3e-06,4e-06,8e-06,3e-06,7e-06,1e-05,2e-06,4e-06,4e-06,2e-06,2e-06,3e-06,2e-06,1e-06,1e-06,6e-06,4e-06,5e-06,5e-06,5e-06,3e-06,1e-06,2e-06,3e-06,6e-06,5e-06,5e-06,3e-06,1e-05,2e-06,2e-06,5e-06,9e-06,1e-05,1.4e-05,9e-06,2.5e-05,1.1e-05,9e-06,5e-06,1.5e-05,7e-06,1e-06,8.2e-05,0.000116,1.4e-05,0.00038,0.000134,7.6e-05,2.6e-05,1.2e-05,1e-05,5e-06,6e-06,7e-06,7e-06,1e-05,6e-06,1.5e-05,5e-06,9e-06,1e-05,1.5e-05,1.2e-05,8e-06,1.1e-05,1e-05,7e-06,9e-06,1.4e-05,9e-06,4.5e-05,8e-06,1.9e-05,1.6e-05,2.6e-05,2.4e-05,1.6e-05,1.9e-05,1.9e-05,2e-05,8e-06,8e-06,7e-06,6e-06,1.3e-05,6e-06,0.000419,0.000214,0.00022
1.7e-05,1.1e-05,0,3e-06,9e-06,3e-06,1e-06,6e-06,0,1e-06,1.2e-05,1.6e-05,5e-06,7e-06,1.1e-05,7e-06,5e-06,2e-06,4e-06,5e-06,2e-06,2e-06,4e-06,4e-06,2e-06,2e-06,3e-06,3e-06,1e-06,6e-06,6e-06,5e-06,4e-06,5e-06,6e-06,5e-06,4e-06,3e-06,4e-06,2e-06,2e-06,1e-06,3e-06,4e-06,1e-06,1e-06,5e-06,2e-06,3e-06,4e-06,3e-06,3e-06,5e-06,3e-06,3e-06,4e-06,3e-06,3e-06,6e-06,8e-06,5e-06,0,8e-06,1.2e-05,9e-06,1.9e-05,1.1e-05,8e-06,1e-06,7e-06,8e-06,1e-06,2e-06,4e-06,7e-05,6.9e-05,5.2e-05,0.000189,0.000234,8.1e-05,3e-05,8e-06,2e-06,1.1e-05,1.7e-05,5e-06,2e-06,8e-06,8e-06,1e-05,3e-06,7e-06,5e-06,6e-06,4e-06,4e-06,1.3e-05,4e-06,9e-06,1.3e-05,1.3e-05,1.9e-05,2.8e-05,4e-06,1.9e-05,8e-06,1.3e-05,5e-06,8e-06,1.8e-05,2e-05,5e-06,3e-06,1e-06,5e-06,1.3e-05,1.7e-05,4e-06,0.000382,0.000508,0.000179
1.4e-05,2e-06,2e-06,4e-06,3e-06,0,3e-06,7e-06,3e-06,3e-06,1.6e-05,1.4e-05,7e-06,3e-06,5e-06,1e-06,3e-06,4e-06,3e-06,3e-06,2e-06,1e-06,2e-06,1e-06,3e-06,1e-06,2e-06,2e-06,4e-06,4e-06,4e-06,1e-06,1e-06,3e-06,1e-06,4e-06,2e-06,1e-06,3e-06,3e-06,5e-06,3e-06,2e-06,3e-06,2e-06,2e-06,4e-06,3e-06,1e-06,4e-06,7e-06,6e-06,2e-06,1e-06,1e-06,3e-06,3e-06,1e-06,4e-06,1.2e-05,6e-06,5e-06,9e-06,8e-06,1e-06,1.3e-05,4e-06,5e-06,4e-06,4e-06,6e-06,6e-06,7e-06,1.2e-05,6.1e-05,8.4e-05,4e-05,3.2e-05,7.2e-05,5.3e-05,2e-05,1.1e-05,1.1e-05,1.3e-05,8e-06,7e-06,8e-06,7e-06,3e-06,1.9e-05,1.1e-05,2e-06,4e-06,5e-06,5e-06,5e-06,1.3e-05,7e-06,1.4e-05,2e-05,2.1e-05,3.5e-05,4.2e-05,2.1e-05,1.6e-05,1.4e-05,1.5e-05,1e-06,8e-06,1.7e-05,1.8e-05,3e-06,3e-06,4e-06,3e-06,8e-06,5e-06,2e-05,0.000366,0.000366,0.000192
9e-06,7e-06,3e-06,3e-06,2e-06,1e-06,4e-06,1e-06,3e-06,6e-06,1.4e-05,1e-06,4e-06,2e-06,4e-06,1e-06,3e-06,1e-06,7e-06,5e-06,3e-06,2e-06,3e-06,2e-06,3e-06,3e-06,2e-06,2e-06,3e-06,4e-06,1e-06,1e-06,2e-06,3e-06,4e-06,2e-06,2e-06,1e-06,2e-06,2e-06,5e-06,3e-06,2e-06,3e-06,2e-06,3e-06,1e-06,5e-06,0,3e-06,4e-06,2e-06,1e-06,1e-06,2e-06,2e-06,5e-06,2e-06,1e-06,8e-06,5e-06,6e-06,4e-06,3e-06,1e-06,9e-06,7e-06,5e-06,3e-06,2e-06,7e-06,3e-06,4e-06,7e-06,3.9e-05,3.4e-05,4e-05,9.8e-05,6.8e-05,7e-06,2e-06,5e-06,1.2e-05,2e-06,7e-06,5e-06,8e-06,5e-06,5e-06,1.3e-05,4e-06,1.1e-05,8e-06,2e-06,1.3e-05,1.3e-05,1.7e-05,1.2e-05,8e-06,1e-05,1.1e-05,3.1e-05,3.6e-05,2.1e-05,1.2e-05,8e-06,1.7e-05,1.2e-05,1.6e-05,5e-06,2.4e-05,6e-06,4e-06,7e-06,7e-06,9e-06,6e-06,1.2e-05,0.000343,0.000204,0.000104
0,7e-06,4e-06,1e-06,2e-06,3e-06,1e-06,1e-06,2e-06,1e-06,1.1e-05,2e-06,4e-06,4e-06,5e-06,1e-06,2e-06,2e-06,5e-06,6e-06,8e-06,6e-06,2e-06,2e-06,2e-06,1e-06,1e-06,5e-06,5e-06,7e-06,5e-06,1e-06,2e-06,2e-06,3e-06,3e-06,1e-06,2e-06,1e-06,1e-06,4e-06,4e-06,3e-06,2e-06,3e-06,2e-06,2e-06,4e-06,3e-06,2e-06,2e-06,2e-06,2e-06,1e-06,1e-06,2e-06,3e-06,4e-06,3e-06,4e-06,3e-06,2e-06,5e-06,4e-06,2e-06,5e-06,4e-06,8e-06,6e-06,2e-06,5e-06,2e-06,2e-06,5e-06,3.8e-05,3.5e-05,8e-06,0.000141,3.6e-05,2.2e-05,2e-05,2e-06,1e-05,6e-06,7e-06,1e-06,3e-06,2e-06,2e-06,8e-06,7e-06,1.1e-05,1e-05,4e-06,9e-06,1e-05,1.4e-05,1.6e-05,1.7e-05,1.7e-05,1.5e-05,1.2e-05,4.5e-05,2.7e-05,2.1e-05,1.2e-05,8e-06,7e-06,7e-06,8e-06,2.1e-05,1.9e-05,9e-06,7e-06,8e-06,6e-06,4e-06,4e-06,0.000296,0.000202,8.2e-05
5e-06,6e-06,2e-06,1e-06,3e-06,2e-06,2e-06,1e-06,1e-06,3e-06,7e-06,3e-06,3e-06,2e-06,2e-06,1e-06,4e-06,2e-06,3e-06,1e-06,3e-06,0,2e-06,2e-06,2e-06,1e-06,1e-06,3e-06,1e-06,2e-06,3e-06,2e-06,1e-06,3e-06,1e-06,1e-06,1e-06,1e-06,3e-06,2e-06,3e-06,1e-06,2e-06,3e-06,1e-06,2e-06,0,3e-06,1e-06,4e-06,2e-06,3e-06,2e-06,2e-06,2e-06,1e-06,3e-06,1e-06,1e-06,2e-06,4e-06,4e-06,0,7e-06,6e-06,3e-06,2e-06,4e-06,1e-05,1e-05,4e-06,4e-06,5e-06,3e-06,3.4e-05,5.4e-05,1.4e-05,0.000166,6.6e-05,2.5e-05,2.7e-05,1.3e-05,6e-06,6e-06,6e-06,5e-06,1e-06,4e-06,4e-06,9e-06,9e-06,3e-06,4e-06,3e-06,3e-06,5e-06,5e-06,5e-06,8e-06,1.5e-05,1.1e-05,7e-06,4.3e-05,1.6e-05,2.1e-05,1.9e-05,8e-06,6e-06,5e-06,7e-06,2e-05,2.5e-05,1.6e-05,1.1e-05,3e-06,3e-06,3e-06,1e-05,0.000254,0.000122,7.2e-05
2e-06,7e-06,6e-06,4e-06,8e-06,4e-06,3e-06,4e-06,2e-06,2e-06,4e-06,6e-06,4e-06,3e-06,4e-06,1e-06,5e-06,2e-06,1e-06,1e-06,2e-06,1e-06,0,1e-06,1e-06,1e-06,1e-06,1e-06,0,2e-06,1e-06,2e-06,1e-06,2e-06,1e-06,1e-06,2e-06,0,2e-06,3e-06,1e-06,1e-06,1e-06,2e-06,1e-06,1e-06,2e-06,2e-06,1e-06,1e-06,3e-06,3e-06,1e-06,2e-06,3e-06,1e-06,1e-06,4e-06,2e-06,5e-06,3e-06,2e-06,9e-06,9e-06,4e-06,3e-06,2e-06,7e-06,8e-06,7e-06,2e-06,3e-06,2e-06,4e-06,3.9e-05,2.1e-05,2.5e-05,0.000149,8.2e-05,2.6e-05,1.4e-05,1.1e-05,6e-06,6e-06,3e-06,5e-06,5e-06,4e-06,5e-06,1e-05,2e-06,2e-06,3e-06,3e-06,8e-06,3e-06,1e-05,1e-05,7e-06,7e-06,7e-06,2.2e-05,4.1e-05,1.9e-05,2.3e-05,1.6e-05,1.2e-05,1.1e-05,1.6e-05,7e-06,2.2e-05,1.2e-05,4e-06,5e-06,6e-06,2e-06,9e-06,1.6e-05,0.000236,0.000359,0.000162
2e-06,4e-06,3e-06,3e-06,5e-06,4e-06,3e-06,1e-06,1e-06,3e-06,2e-06,5e-06,4e-06,2e-06,1e-06,1e-06,4e-06,3e-06,1e-06,4e-06,3e-06,2e-06,1e-06,2e-06,2e-06,1e-06,2e-06,1e-06,2e-06,0,2e-06,1e-06,1e-06,1e-06,1e-06,0,1e-06,2e-06,1e-06,1e-06,2e-06,3e-06,3e-06,3e-06,2e-06,0,2e-06,3e-06,1e-06,3e-06,3e-06,1e-06,2e-06,2e-06,1e-06,2e-06,2e-06,4e-06,3e-06,4e-06,7e-06,5e-06,9e-06,1.6e-05,1e-05,5e-06,3e-06,2e-06,1e-06,4e-06,1e-06,4e-06,1e-06,5e-06,3.8e-05,4.2e-05,1e-05,0.000101,0.000111,5e-05,9e-06,5e-06,4e-06,5e-06,6e-06,4e-06,4e-06,4e-06,5e-06,5e-06,7e-06,3e-06,5e-06,5e-06,9e-06,1.6e-05,1e-06,4e-06,1.6e-05,1.8e-05,7e-06,1.8e-05,4.9e-05,2.7e-05,3.5e-05,1.7e-05,7e-06,1e-05,7e-06,1.9e-05,1.8e-05,6e-06,5e-06,9e-06,9e-06,8e-06,7e-06,4e-06,0.000217,0.000295,0.000222
4e-06,1e-06,5e-06,2e-06,4e-06,3e-06,3e-06,2e-06,1e-06,5e-06,7e-06,3e-06,0,6e-06,2e-06,2e-06,1e-06,2e-06,5e-06,2e-06,2e-06,2e-06,1e-06,1e-06,2e-06,2e-06,2e-06,2e-06,1e-06,2e-06,2e-06,2e-06,1e-06,0,3e-06,2e-06,1e-06,1e-06,1e-06,1e-06,2e-06,2e-06,2e-06,0,1e-06,1e-06,3e-06,1e-06,2e-06,1e-06,2e-06,2e-06,3e-06,0,1e-06,0,1e-06,3e-06,2e-06,5e-06,3e-06,3e-06,5e-06,1.1e-05,5e-06,3e-06,4e-06,3e-06,1e-06,5e-06,1e-06,4e-06,1e-06,7e-06,4.8e-05,4.3e-05,2.4e-05,7.8e-05,5.7e-05,2.4e-05,8e-06,8e-06,6e-06,7e-06,3e-06,7e-06,4e-06,2e-06,4e-06,5e-06,7e-06,5e-06,4e-06,6e-06,3e-06,8e-06,1.1e-05,1e-05,6e-06,9e-06,1e-06,1.3e-05,5.9e-05,1.9e-05,8e-06,9e-06,1.5e-05,1.1e-05,1.3e-05,1.3e-05,3e-05,1.1e-05,1e-06,5e-06,4e-06,1e-06,6e-06,8e-06,0.000158,0.000141,6.4e-05
3e-06,4e-06,5e-06,2e-06,2e-06,1e-06,1e-06,1e-06,1e-06,4e-06,4e-06,2e-06,2e-06,5e-06,3e-06,2e-06,2e-06,2e-06,1e-06,1e-06,3e-06,1e-06,1e-06,1e-06,2e-06,3e-06,2e-06,2e-06,1e-06,3e-06,1e-06,4e-06,1e-06,1e-06,3e-06,1e-06,1e-06,1e-06,1e-06,2e-06,3e-06,3e-06,3e-06,1e-06,1e-06,3e-06,2e-06,2e-06,2e-06,2e-06,3e-06,0,2e-06,2e-06,1e-06,2e-06,2e-06,2e-06,2e-06,3e-06,1e-06,3e-06,4e-06,7e-06,4e-06,4e-06,6e-06,7e-06,4e-06,6e-06,3e-06,1e-06,1e-06,8e-06,4.5e-05,1.1e-05,8e-06,8e-05,2.3e-05,1.6e-05,7e-06,1.1e-05,2e-06,7e-06,4e-06,2e-06,3e-06,5e-06,5e-06,3e-06,5e-06,2e-06,1.1e-05,1e-06,3e-06,4e-06,8e-06,6e-06,9e-06,1.1e-05,2e-06,8e-06,6.6e-05,3.2e-05,2.1e-05,2e-05,1.3e-05,1.4e-05,4e-06,1.6e-05,1.3e-05,1.2e-05,1e-05,5e-06,2e-06,2e-06,3e-06,8e-06,9.3e-05,7e-05,2.9e-05
4e-06,3e-06,2e-06,0,2e-06,1e-06,1e-06,1e-06,3e-06,2e-06,6e-06,5e-06,5e-06,5e-06,5e-06,2e-06,1e-06,1e-06,0,0,2e-06,2e-06,1e-06,1e-06,2e-06,1e-06,2e-06,0,2e-06,2e-06,2e-06,2e-06,3e-06,2e-06,1e-06,1e-06,0,1e-06,2e-06,1e-06,3e-06,1e-06,2e-06,3e-06,2e-06,3e-06,2e-06,2e-06,1e-06,1e-06,2e-06,1e-06,2e-06,3e-06,1e-06,2e-06,2e-06,1e-06,1e-06,3e-06,3e-06,5e-06,9e-06,7e-06,3e-06,2e-06,3e-06,4e-06,1e-06,1e-06,1e-06,4e-06,2e-06,7e-06,5.2e-05,1.2e-05,4e-06,0.000108,5.8e-05,3.3e-05,9e-06,2e-06,7e-06,7e-06,2e-06,2e-06,4e-06,4e-06,3e-06,4e-06,3e-06,6e-06,1.3e-05,1.4e-05,9e-06,1e-05,6e-06,1.2e-05,8e-06,2.1e-05,2.7e-05,8e-06,5.5e-05,4e-05,3.2e-05,2e-05,2.9e-05,2.2e-05,1.9e-05,6e-06,2e-05,9e-06,7e-06,7e-06,1e-06,4e-06,4e-06,8e-06,5.4e-05,0.000276,0.000163
4e-06,4e-06,3e-06,2e-06,5e-06,3e-06,2e-06,3e-06,3e-06,0,8e-06,3e-06,3e-06,3e-06,1e-06,1e-06,3e-06,2e-06,3e-06,1e-06,3e-06,4e-06,2e-06,1e-06,1e-06,2e-06,1e-06,0,3e-06,2e-06,0,1e-06,1e-06,1e-06,0,2e-06,2e-06,1e-06,2e-06,2e-06,2e-06,1e-06,1e-06,2e-06,1e-06,1e-06,2e-06,2e-06,2e-06,2e-06,4e-06,1e-06,2e-06,1e-06,2e-06,0,3e-06,1e-06,4e-06,4e-06,1e-06,4e-06,4e-06,7e-06,4e-06,1e-06,3e-06,3e-06,3e-06,1e-06,1e-06,7e-06,3e-06,4e-06,4.4e-05,4.4e-05,2.5e-05,0.00014,5.5e-05,2.6e-05,2.2e-05,1.7e-05,4e-06,4e-06,7e-06,5e-06,6e-06,3e-06,1e-06,5e-06,4e-06,6e-06,1.1e-05,9e-06,1e-05,7e-06,6e-06,9e-06,1.9e-05,2.3e-05,1.4e-05,1.7e-05,7.3e-05,6.7e-05,1.9e-05,1e-05,1.3e-05,1.4e-05,1.3e-05,1e-05,2e-05,1.6e-05,1.1e-05,2e-06,6e-06,8e-06,3e-06,9e-06,3.5e-05,0.000281,7.7e-05
3e-06,3e-06,2e-06,1e-06,6e-06,2e-06,1e-06,4e-06,5e-06,2e-06,7e-06,5e-06,7e-06,6e-06,4e-06,4e-06,6e-06,4e-06,4e-06,3e-06,2e-06,4e-06,2e-06,2e-06,2e-06,2e-06,3e-06,2e-06,4e-06,2e-06,1e-06,2e-06,2e-06,4e-06,3e-06,1e-06,2e-06,2e-06,5e-06,0,2e-06,2e-06,4e-06,3e-06,3e-06,2e-06,1e-06,3e-06,2e-06,4e-06,6e-06,4e-06,4e-06,4e-06,3e-06,1e-06,3e-06,2e-06,4e-06,5e-06,7e-06,3e-06,3e-06,8e-06,3e-06,2e-06,1e-06,4e-06,5e-06,6e-06,1e-06,8e-06,3e-06,3e-06,4.5e-05,9.4e-05,3.5e-05,0.000143,2.8e-05,1.4e-05,7e-06,6e-06,9e-06,1.7e-05,1.3e-05,3e-06,3e-06,2e-06,3e-06,6e-06,2e-06,9e-06,2.3e-05,1.5e-05,1.3e-05,7e-06,3e-06,5e-06,1e-05,2.5e-05,9e-06,2.1e-05,0.000104,0.000109,4e-05,2.4e-05,2.4e-05,3.1e-05,2.2e-05,5e-06,1.4e-05,1.2e-05,3e-06,8e-06,1.2e-05,5e-06,2e-06,9e-06,7.7e-05,6.4e-05,0.000111
4e-06,4e-06,4e-06,1e-06,5e-06,4e-06,2e-06,4e-06,5e-06,6e-06,7e-06,4e-06,7e-06,2e-06,1e-06,3e-06,1e-06,1e-06,3e-06,2e-06,1e-06,2e-06,1e-06,1e-06,1e-06,1e-06,2e-06,2e-06,2e-06,2e-06,3e-06,1e-06,2e-06,2e-06,1e-06,2e-06,3e-06,2e-06,2e-06,2e-06,2e-06,2e-06,3e-06,2e-06,1e-06,2e-06,3e-06,2e-06,2e-06,2e-06,0,3e-06,2e-06,3e-06,1e-06,1e-06,3e-06,1e-06,2e-06,3e-06,2e-06,5e-06,3e-06,4e-06,5e-06,1e-06,4e-06,4e-06,7e-06,4e-06,3e-06,3e-06,6e-06,5e-06,4e-05,8e-05,5.6e-05,0.000147,4e-05,3.4e-05,1e-05,6e-06,9e-06,8e-06,3e-06,6e-06,4e-06,2e-06,3e-06,1e-06,4e-06,1e-05,1.9e-05,2.2e-05,9e-06,1e-05,1.2e-05,1.4e-05,1.4e-05,2.3e-05,2e-05,1.9e-05,0.000108,7.2e-05,6e-05,3.7e-05,8e-06,1.5e-05,4e-06,4e-06,1.4e-05,1.3e-05,3e-06,8e-06,9e-06,1.2e-05,3e-06,5e-06,0.000125,0.00014,0.000108
5e-06,4e-06,2e-06,4e-06,6e-06,4e-06,2e-06,3e-06,2e-06,4e-06,4e-06,2e-06,2e-06,2e-06,2e-06,2e-06,1e-06,1e-06,4e-06,2e-06,2e-06,1e-06,2e-06,1e-06,1e-06,1e-06,2e-06,2e-06,3e-06,2e-06,2e-06,1e-06,1e-06,1e-06,1e-06,2e-06,2e-06,1e-06,1e-06,1e-06,1e-06,2e-06,4e-06,1e-06,0,2e-06,0,4e-06,3e-06,1e-06,3e-06,2e-06,3e-06,1e-06,1e-06,2e-06,1e-06,0,3e-06,1e-06,2e-06,4e-06,2e-06,2e-06,4e-06,6e-06,6e-06,6e-06,7e-06,8e-06,7e-06,7e-06,8e-06,2e-06,3.6e-05,3.6e-05,1.6e-05,0.000113,9.8e-05,4.1e-05,1.8e-05,1.5e-05,4e-06,6e-06,2e-06,4e-06,1e-06,2e-06,3e-06,2e-06,6e-06,8e-06,1.4e-05,7e-06,1e-06,1e-05,1e-05,1.5e-05,8e-06,3e-05,2.2e-05,3.1e-05,0.000102,4.4e-05,4e-05,1.1e-05,1e-05,9e-06,3e-06,3e-06,1.6e-05,1.4e-05,9e-06,1e-05,3e-06,1.3e-05,7e-06,1.5e-05,0.000141,8e-05,4.1e-05
5e-06,3e-06,1e-06,2e-06,2e-06,1e-06,1e-06,1e-06,1e-06,1e-06,6e-06,3e-06,3e-06,3e-06,1e-06,1e-06,3e-06,3e-06,5e-06,2e-06,2e-06,1e-06,2e-06,0,2e-06,1e-06,1e-06,0,3e-06,4e-06,2e-06,3e-06,4e-06,2e-06,2e-06,3e-06,3e-06,2e-06,1e-06,1e-06,1e-06,2e-06,3e-06,2e-06,1e-06,1e-06,1e-06,3e-06,1e-06,1e-06,4e-06,2e-06,3e-06,3e-06,3e-06,2e-06,2e-06,1e-06,2e-06,2e-06,3e-06,2e-06,3e-06,5e-06,5e-06,4e-06,1e-06,4e-06,5e-06,8e-06,4e-06,2e-06,3e-06,3e-06,2.9e-05,2.9e-05,3e-05,9.9e-05,0.000122,6.1e-05,3.2e-05,6e-06,0,4e-06,8e-06,6e-06,4e-06,3e-06,2e-06,4e-06,8e-06,2e-06,8e-06,4e-06,3e-06,2e-06,2e-06,1.2e-05,8e-06,2.3e-05,1.4e-05,4e-06,5.7e-05,2.3e-05,4e-06,1.3e-05,6e-06,2e-06,5e-06,5e-06,9e-06,9e-06,5e-06,6e-06,1.1e-05,5e-06,7e-06,2.5e-05,0.000175,0.000111,2.4e-05
2e-06,1e-06,2e-06,2e-06,1e-06,1e-06,1e-06,3e-06,1e-06,1e-06,4e-06,4e-06,1e-06,3e-06,2e-06,1e-06,1e-06,3e-06,1e-06,1e-06,2e-06,1e-06,1e-06,2e-06,0,1e-06,1e-06,2e-06,2e-06,3e-06,1e-06,3e-06,2e-06,0,0,0,1e-06,1e-06,1e-06,1e-06,1e-06,2e-06,2e-06,1e-06,1e-06,1e-06,1e-06,2e-06,1e-06,0,3e-06,2e-06,1e-06,1e-06,2e-06,0,2e-06,1e-06,1e-06,1e-06,4e-06,2e-06,2e-06,5e-06,5e-06,1e-06,0,4e-06,4e-06,2e-06,4e-06,2e-06,1e-06,2e-06,2.2e-05,2.1e-05,1.1e-05,8.4e-05,7.2e-05,3.4e-05,1.5e-05,6e-06,3e-06,5e-06,7e-06,5e-06,2e-06,1e-06,3e-06,2e-06,5e-06,3e-06,4e-06,1e-06,1e-06,2e-06,2e-06,1e-05,9e-06,8e-06,1.1e-05,8e-06,4.1e-05,9e-06,1.9e-05,4e-06,6e-06,3e-06,4e-06,3e-06,6e-06,5e-06,4e-06,2e-06,8e-06,9e-06,8e-06,1.2e-05,0.000171,0.000124,0.000137
2e-06,1e-06,1e-06,1e-06,1e-06,0,0,2e-06,1e-06,1e-06,4e-06,3e-06,1e-06,2e-06,2e-06,1e-06,1e-06,1e-06,1e-06,1e-06,2e-06,0,1e-06,1e-06,1e-06,1e-06,0,1e-06,2e-06,1e-06,1e-06,1e-06,2e-06,0,1e-06,1e-06,1e-06,1e-06,1e-06,1e-06,1e-06,0,2e-06,1e-06,1e-06,1e-06,0,1e-06,1e-06,0,3e-06,1e-06,1e-06,1e-06,1e-06,0,0,0,1e-06,2e-06,2e-06,1e-06,2e-06,2e-06,1e-06,1e-06,1e-06,3e-06,2e-06,3e-06,3e-06,1e-06,1e-06,1e-06,1.5e-05,9e-06,5e-06,8.3e-05,3.2e-05,9e-06,2e-06,4e-06,4e-06,3e-06,4e-06,3e-06,2e-06,1e-06,2e-06,3e-06,1e-06,1e-06,1e-06,3e-06,1e-06,2e-06,1e-06,5e-06,1e-06,8e-06,8e-06,3e-06,3.4e-05,5e-06,1.7e-05,8e-06,3e-06,3e-06,3e-06,1e-06,6e-06,2e-06,1e-06,3e-06,3e-06,1e-06,3e-06,8e-06,0.000168,9e-05,4.8e-05
3e-06,1e-06,1e-06,0,0,1e-06,1e-06,2e-06,1e-06,1e-06,4e-06,1e-06,2e-06,2e-06,2e-06,1e-06,1e-06,0,1e-06,1e-06,2e-06,0,0,1e-06,1e-06,1e-06,0,1e-06,2e-06,1e-06,1e-06,1e-06,2e-06,0,1e-06,0,1e-06,1e-06,1e-06,1e-06,0,0,1e-06,1e-06,1e-06,1e-06,0,2e-06,1e-06,0,2e-06,1e-06,1e-06,0,1e-06,0,0,0,1e-06,2e-06,1e-06,0,1e-06,1e-06,2e-06,1e-06,1e-06,4e-06,1e-06,1e-06,0,1e-06,2e-06,2e-06,1.2e-05,6e-06,1e-06,8.3e-05,2.9e-05,7e-06,5e-06,1e-06,2e-06,4e-06,4e-06,2e-06,1e-06,0,2e-06,1e-06,0,0,0,1e-06,1e-06,2e-06,0,3e-06,2e-06,7e-06,6e-06,3e-06,2.8e-05,2e-06,1.1e-05,1e-06,2e-06,0,3e-06,2e-06,6e-06,1e-06,1e-06,2e-06,2e-06,1e-06,2e-06,8e-06,0.000154,5.1e-05,3e-06
2e-06,1e-06,1e-06,1e-06,0,0,0,2e-06,1e-06,1e-06,3e-06,0,1e-06,1e-06,2e-06,1e-06,0,0,1e-06,1e-06,1e-06,0,1e-06,1e-06,1e-06,1e-06,0,1e-06,1e-06,1e-06,1e-06,1e-06,2e-06,0,1e-06,0,1e-06,1e-06,1e-06,1e-06,0,0,1e-06,1e-06,1e-06,1e-06,0,2e-06,1e-06,0,2e-06,1e-06,1e-06,0,1e-06,0,1e-06,0,1e-06,2e-06,1e-06,0,0,0,1e-06,1e-06,1e-06,3e-06,0,1e-06,1e-06,1e-06,2e-06,2e-06,9e-06,9e-06,1e-06,8.5e-05,3.2e-05,7e-06,2e-06,1e-06,2e-06,4e-06,2e-06,1e-06,1e-06,1e-06,1e-06,1e-06,0,1e-06,0,1e-06,1e-06,2e-06,0,3e-06,2e-06,7e-06,4e-06,2e-06,2.8e-05,1e-06,1e-05,1e-06,3e-06,1e-06,2e-06,0,5e-06,2e-06,1e-06,2e-06,2e-06,1e-06,3e-06,8e-06,0.000143,3.3e-05,7e-06
