-9.2e-05,-0.000176,2e-06,-8e-06,-0.000389,-0.000285,4.2e-05,-3.1e-05,-6.7e-05,-0.000204,2e-05,-0.000147,-0.000458,-0.000203,-0.000156,-0.000282,2.5e-05,-9e-06,-0.000308,0.000187,-8.4e-05,-0.000277,-0.000301,-8.5e-05,-0.00016,-0.000136,-0.000303,-0.000498,-0.000392,0.000208,-0.000189,-0.000591,-0.000204,0.000192,-7.3e-05,-0.000127,-0.000118,0.000254,-0.000129,-7e-05,-0.000119,0.000208,-0.000269,5.7e-05,-0.000188,-0.000218,-1e-05,-0.000161,-3.9e-05,0.000401,0.000268,0.000188,7.1e-05,-4.1e-05,-0.000199,0.000266,0.000384,5.1e-05,0.000185,7.3e-05,-8.2e-05,-0.000311,-7e-05,-0.000143,-7.1e-05,-0.000399,-0.000322,-0.000119,3.6e-05,-5.2e-05,0.000117,7.1e-05,0.00017,0.000311,6.1e-05,1.7e-05,-0.000723,-7.7e-05,-9.2e-05,-0.000504,-0.000579,-0.000373,-0.000465,-0.000266,0.000112,8.5e-05,-4.2e-05,-1e-04,-0.000152,-0.00013,-0.000121,-0.000203,-0.000535,-0.000241,3.5e-05,4.8e-05,2.2e-05,-0.000332,-0.000123,8.6e-05,-0.00041,-0.000128,-0.000294,-0.00019,-8.4e-05,-0.000303,-0.000233,0.000201,0.000203,-9e-05,-0.000276,-0.000235,0.000296,4.7e-05,-6.4e-05,-0.000206,-0.000168,-0.000224,-0.00027,-6e-06,-0.000107
1.5e-05,-5e-05,-6.4e-05,-0.00019,5.3e-05,-0.000282,-6e-06,-6.6e-05,-0.00021,-0.000252,-0.000277,4.3e-05,0.000295,-0.000467,-0.000217,0.00011,-0.000284,-0.00021,-4e-05,-0.000376,-0.000338,0.000111,0.000337,-3.9e-05,-0.000125,-0.000271,-0.00037,-0.000165,-8.6e-05,-0.000812,-0.000392,0.000256,3.9e-05,-0.000307,-0.000249,-6.2e-05,-6.3e-05,3e-05,6e-05,1.6e-05,-0.000264,-0.000645,-0.000109,-0.000577,-0.000102,-4e-05,-0.000532,-0.000174,1.1e-05,-0.000537,-0.000399,-5.3e-05,-0.000127,-3e-06,-7.5e-05,-0.000462,0.000114,0.000141,5.2e-05,-0.000677,-0.000319,2.7e-05,0.000177,1e-04,8.3e-05,6.1e-05,-0.000132,-3.5e-05,0.000178,0.000221,-0.000328,-0.000523,-0.000231,0.000205,-7.1e-05,9.1e-05,0.000396,-4.3e-05,-0.000348,8.4e-05,0.000301,7.5e-05,0.000214,9.6e-05,-0.000193,-8.1e-05,-0.000116,-0.000139,-0.000256,-9.3e-05,1.9e-05,-0.000112,-1.7e-05,-0.000239,-0.00035,-0.000328,-0.000505,0.000195,0.000177,3.5e-05,8e-05,0.000109,0.000173,7.2e-05,0.000211,-2.7e-05,3.1e-05,-0.000325,-0.000651,-0.000625,-0.000253,-3.1e-05,-0.000571,-0.000574,-0.00015,-0.000202,-0.000159,-0.000379,-0.000226,1.4e-05,-0.000181
5.2e-05,2.5e-05,-8.4e-05,-0.000216,-0.000194,0.000262,-0.000172,-0.000189,-3.8e-05,0.000269,-8.7e-05,-5.5e-05,-0.000141,-1.9e-05,6.5e-05,-0.000247,6.2e-05,-0.000102,-0.000108,-0.000143,-6.1e-05,-8.9e-05,4e-06,-0.000157,-4.8e-05,0.00023,0.000197,0.000219,0.000262,0.000179,2e-06,-3.1e-05,-0.000129,-8.3e-05,-0.000158,-9.8e-05,2.8e-05,-0.000189,-0.000223,-2.8e-05,2.1e-05,-0.000263,-0.000235,-0.000258,-0.000188,-8e-05,1.5e-05,-1.8e-05,1.2e-05,-0.000221,-8e-06,-0.000117,8.3e-05,-1.8e-05,0.000182,-6.9e-05,0.000118,-9.3e-05,-0.000165,0.000162,9e-05,-1e-04,-6.9e-05,-0.000175,-4.1e-05,0.000109,3.1e-05,-0.000253,-0.000121,-9.1e-05,-0.000334,-0.000132,-0.00011,-0.000389,-0.000156,-0.000155,-0.000281,-0.000441,7.5e-05,-3.2e-05,-9.5e-05,3.7e-05,-0.000126,-7.7e-05,-9e-06,4.1e-05,-2e-05,-1e-06,0.000159,-7.1e-05,-2.7e-05,-4.8e-05,1.5e-05,-4.2e-05,-0.000185,-0.000156,0.000364,-0.000214,-9.6e-05,-7.3e-05,-0.000162,-0.000258,-0.000325,-0.000141,-0.000149,0.000253,-7.4e-05,0.000148,0.000343,-0.000117,0.000131,-1.6e-05,3.6e-05,7.1e-05,0.000138,0.000326,0.000214,0.000242,0.000144,-0.000108,-0.00029
-6e-05,-1e-05,0.000122,7.2e-05,0.000176,-6.6e-05,-6.8e-05,-1e-06,0.000193,-9.3e-05,-1.2e-05,8.4e-05,1.2e-05,0.000174,0.000153,0.000197,-1e-04,0.000119,-2e-06,0.000253,0.000106,-0.000117,-9e-05,-0.000153,-3.9e-05,1.1e-05,0.000174,-0.000265,-6e-06,0.000434,0.000232,0.000127,-0.00011,3.4e-05,-0.000236,-0.000171,-9e-06,-0.000127,7.4e-05,4.6e-05,-4.3e-05,0.000194,0.000134,0.000277,0.000327,1.8e-05,0.000253,0.000378,9.9e-05,-7.2e-05,6e-06,-9.8e-05,-0.000158,5.4e-05,-3.7e-05,0.000191,0.000146,0.000119,0.000222,3.7e-05,0.000248,-5.9e-05,-9.4e-05,9.7e-05,0.000164,-0.000114,0.000128,-4.5e-05,8.2e-05,2.6e-05,0.000184,0.000437,4.7e-05,5e-05,6.5e-05,-4.3e-05,1.1e-05,0.000161,0.000211,0.000145,2e-06,-0.000183,-3.3e-05,-3.5e-05,-6.5e-05,-0.000172,1.1e-05,7e-05,9.8e-05,-4.7e-05,9.4e-05,0.000204,0.000105,-4.3e-05,-0.00015,0.000114,-3.5e-05,9.8e-05,0.000114,5.1e-05,0.000159,0.000318,-0.00025,-1e-04,0.000126,-5.3e-05,-2.2e-05,5.9e-05,0.000242,0.000542,-5.1e-05,4.7e-05,0.000104,0.000394,1.7e-05,-0.000108,8.5e-05,2.8e-05,0.00017,0.00014,0.000159
-1e-04,-0.000137,6.7e-05,0.000306,-6.6e-05,2.7e-05,-7.4e-05,-0.000324,-0.000248,-0.000153,0.000155,-4.6e-05,1.7e-05,3.3e-05,-0.000202,-0.000242,-9.4e-05,-7.3e-05,3.8e-05,-5e-05,0.000218,0.000145,6.6e-05,-2.8e-05,-5.7e-05,-0.000239,-0.000163,0.000189,-6e-05,-5e-05,-0.000197,-6.2e-05,5.1e-05,0.000312,0.000223,7.5e-05,4.7e-05,-0.000212,-0.00012,5.1e-05,-4.2e-05,0.000167,0.000126,-9.7e-05,-0.000332,-8e-05,-3.1e-05,-0.000284,-0.000201,-5.1e-05,-0.000146,-0.000231,0.000176,-3.4e-05,6.3e-05,1.1e-05,-8.9e-05,-0.000362,-1.7e-05,8.4e-05,-0.000131,-0.000297,-0.000322,-0.000158,-0.000233,-0.000257,-7.2e-05,4.4e-05,-1.8e-05,-3.4e-05,0.000105,1.1e-05,-0.000121,0.000113,-0.000138,-6.8e-05,-9.3e-05,-0.000149,-0.000121,-0.00015,-0.000132,9.1e-05,2.1e-05,-2.9e-05,4.4e-05,-0.00014,4.8e-05,8.6e-05,-0.000133,-4.2e-05,-7.2e-05,-2.7e-05,-4e-06,-2e-05,-7.1e-05,-0.000131,-0.00012,2.5e-05,-0.000169,-6e-05,1.9e-05,-9.5e-05,1e-05,-9e-06,5.8e-05,6.7e-05,0.000104,0.000103,-0.000296,-0.000338,2e-06,0.000109,-0.000189,-0.000157,0.000144,-6.3e-05,-2.2e-05,4.7e-05,9.9e-05,0.000102,0.000295
-7.2e-05,4e-05,-2.7e-05,-0.000235,-2.5e-05,-0.000276,8.2e-05,7e-06,4.4e-05,8.7e-05,-8e-06,3.2e-05,-2e-05,-6.1e-05,0.000146,7e-05,-0.000108,-7.4e-05,-6.6e-05,-7e-05,-0.000191,-0.000113,0.00012,7.7e-05,4.9e-05,0.000121,7.7e-05,-0.000331,-0.000177,-7.1e-05,1e-06,5.8e-05,-1.9e-05,-0.000127,6.6e-05,0.000151,-7.8e-05,0.000128,-0.000126,-0.000105,-0.000108,-0.000143,0.000347,-5.1e-05,-8e-06,6e-06,3.3e-05,-7.4e-05,6e-06,-5.2e-05,-0.000275,-6.1e-05,8.4e-05,-0.000108,-8.1e-05,-0.000109,-0.000304,-0.000126,0.000131,6.7e-05,-0.000174,1.4e-05,3e-06,-3.7e-05,6.4e-05,-1e-06,-0.000192,-8.7e-05,-7.5e-05,-0.000183,-1e-05,-0.000157,4.8e-05,0.000105,7.1e-05,-7.8e-05,0.000143,0.000168,1.7e-05,-0.000147,-4.7e-05,-3.9e-05,-8.9e-05,-5e-06,-9.4e-05,-5.3e-05,8.5e-05,-0.000162,-8.7e-05,-2.4e-05,-3e-06,2.7e-05,-8.4e-05,0.000142,0.000269,-0.00011,-0.00011,-0.000201,2e-06,-1e-06,-9e-06,-0.000124,0.000131,0.000138,7.2e-05,-4.3e-05,-8.8e-05,3.5e-05,4e-05,-6e-05,-0.000136,-8.3e-05,-0.000257,-0.000207,-2e-05,-7e-06,0.000103,-9.4e-05,-0.00024,-0.000219,-0.000384
-6.7e-05,4.4e-05,-3.1e-05,-5.2e-05,-7e-06,0.000141,-0.00011,0.000179,0.000106,7.5e-05,-6e-05,5.6e-05,-9.5e-05,3e-05,0.000112,4.1e-05,8.2e-05,-5.3e-05,-3.1e-05,0.000137,-5.2e-05,-2.2e-05,-1e-06,-4.7e-05,9.6e-05,-9.3e-05,9.4e-05,1e-04,0.000154,0.000175,-1.2e-05,-1.5e-05,0.000111,-0.000194,-0.000143,-0.000136,4.8e-05,-6.3e-05,2.2e-05,0.000106,-3.7e-05,4.5e-05,-0.000272,-6.3e-05,0.000215,-0.000111,-0.000102,0.000111,-7.5e-05,-3e-05,0.000142,8.4e-05,-3.7e-05,8e-06,-0.000141,0.000179,0.000208,-6.5e-05,-1.7e-05,-1.6e-05,0.00027,0.000128,0.000126,-1.9e-05,-5e-05,-1.9e-05,7.6e-05,4.4e-05,-0.000162,-9e-06,-8.1e-05,-6.6e-05,0.000213,-0.000147,-0.000171,-0.000186,-6.6e-05,-0.000159,-9.7e-05,5.5e-05,-1.5e-05,0.000116,5.5e-05,7.1e-05,-7e-06,3.4e-05,-7.4e-05,-0.000104,-3.2e-05,4.6e-05,3.8e-05,-5.1e-05,-6.8e-05,-0.000152,-5.3e-05,-4.9e-05,0.000185,0.000121,4.5e-05,5e-06,1e-06,-4.6e-05,-0.000131,-6.2e-05,-8.2e-05,7.9e-05,7.4e-05,8e-06,3.1e-05,0.000199,5.2e-05,3.9e-05,0.000193,0.000232,0.000102,-8.2e-05,4e-05,-1.2e-05,0.000177,3e-06,4.1e-05
-3.6e-05,9e-06,3.1e-05,-1.6e-05,0.000107,-1.3e-05,-5.1e-05,-2.1e-05,1e-05,-4.9e-05,7e-05,0,2.1e-05,-0.000102,-0.000194,-9.3e-05,-0.000273,0.000105,0.000107,-9e-06,4.1e-05,-2e-05,3e-06,1.3e-05,-6.6e-05,2.5e-05,-0.000156,7.2e-05,-3.8e-05,-0.000159,-8.7e-05,7.6e-05,-8e-06,0.000135,7.3e-05,-1.4e-05,-7.3e-05,-2.7e-05,-9e-06,-4.9e-05,3.5e-05,-6.1e-05,-0.00026,3.7e-05,-0.000139,-1e-06,-6.6e-05,-1.7e-05,4.3e-05,8e-06,0.000136,-8.5e-05,-0.000112,-0.000125,8e-06,-3.1e-05,8.5e-05,-7e-05,2.7e-05,-0.000101,-5.2e-05,-3.3e-05,4.2e-05,-4.1e-05,-5.9e-05,-0.00023,-0.000148,-5.6e-05,6.8e-05,-5.8e-05,9.6e-05,-3.8e-05,-5.9e-05,-0.000111,-1.7e-05,-1e-06,3.9e-05,-1.2e-05,-4.2e-05,-6.4e-05,5.7e-05,-0.000111,-7.2e-05,-2.1e-05,-3.8e-05,6e-06,-5.3e-05,4e-05,5.7e-05,1.1e-05,5.9e-05,5.8e-05,0.000102,3.6e-05,-2.6e-05,-3.3e-05,-0.000153,-0.000173,-0.000105,-0.000128,3e-06,5.3e-05,6e-05,0.000111,6e-06,-1.5e-05,-6e-05,-0.000101,-6.9e-05,-6.7e-05,2.3e-05,-5.8e-05,-0.00021,-0.000159,9.2e-05,0.000147,-0.000102,-1.1e-05,-2.6e-05,0.000144,-3.5e-05
-9.1e-05,-3e-06,-8.2e-05,-1.3e-05,-8.4e-05,2.8e-05,5.4e-05,-3.7e-05,1.4e-05,-1.6e-05,3e-06,-4.4e-05,4e-06,3.9e-05,5.4e-05,-5e-06,0.000107,-3e-05,7e-06,4.3e-05,1.5e-05,-0.000129,-0.000153,-2e-06,-6.8e-05,-4.6e-05,1e-06,-2e-06,4e-05,-6.4e-05,7e-05,-4.7e-05,1.3e-05,-7.6e-05,1.8e-05,-0.000106,-1.8e-05,2.7e-05,3.8e-05,-2.9e-05,1.9e-05,-4e-05,7.8e-05,0.00016,-0.000125,4.3e-05,5.8e-05,-5.7e-05,-2.1e-05,6.1e-05,1.7e-05,3.8e-05,6e-06,0.000102,1.4e-05,-3.5e-05,-6.4e-05,-7.4e-05,-7.8e-05,-0.000183,1.6e-05,-8.1e-05,-7e-06,6.1e-05,6e-06,6.3e-05,-5.7e-05,8.9e-05,2.6e-05,6e-05,4.8e-05,4.8e-05,-0.000104,-5.2e-05,-1.4e-05,7.3e-05,2.5e-05,7.4e-05,-1.8e-05,-0.000142,-6e-05,8.1e-05,9.1e-05,4.7e-05,3.4e-05,-3e-05,0,-1.2e-05,-1.3e-05,-6.3e-05,-4e-06,-0.000128,-6.4e-05,-5.8e-05,3.2e-05,0.000177,-0.000116,-8e-06,2.1e-05,-6.6e-05,-4.8e-05,1.2e-05,-2.6e-05,-0.000196,-2.5e-05,1.8e-05,-6.3e-05,7.5e-05,2.9e-05,-4.1e-05,0.000198,-1e-06,0.000146,2.3e-05,-5.4e-05,-0.000211,-2.1e-05,0,2.3e-05,-0.000123,-4e-06
9e-05,3.8e-05,-6e-06,-1.6e-05,-0.000104,-7.1e-05,1e-04,5.7e-05,8.8e-05,3.1e-05,-6.6e-05,-4.3e-05,-4.2e-05,-1.9e-05,-1.7e-05,6.5e-05,8e-05,7e-05,-2.1e-05,0,-6.3e-05,-3.8e-05,0.000107,4.9e-05,0.000102,6.4e-05,7.1e-05,-0.000107,-7e-06,-3.4e-05,1.8e-05,6e-05,-4e-06,9.5e-05,8.8e-05,-1.6e-05,2.1e-05,0.000108,9.5e-05,-8.1e-05,-6.2e-05,-2.3e-05,4.8e-05,1.6e-05,6.3e-05,1.1e-05,2.2e-05,-6e-06,-2.2e-05,8e-05,2.1e-05,0.000121,-7.8e-05,-6.1e-05,-2.6e-05,8.6e-05,-3.5e-05,0.00013,-4.8e-05,7e-06,-6.3e-05,0.000138,8e-05,0.000132,-7e-06,2.1e-05,1e-04,-2e-06,5.2e-05,-7.9e-05,-4e-06,-3.7e-05,4.9e-05,-1.5e-05,1.8e-05,9e-06,-5.1e-05,1.8e-05,3.3e-05,0.000133,4.8e-05,-1.8e-05,-2.9e-05,-4.1e-05,2.5e-05,-1.3e-05,-0.000119,1e-06,-1e-06,0.000142,6.7e-05,1.7e-05,-2.4e-05,0.000135,-3.6e-05,3e-06,6.9e-05,1.5e-05,-3.8e-05,-6e-06,2.8e-05,-4e-05,0.000109,-3.7e-05,-8.7e-05,1.7e-05,4.6e-05,8.1e-05,-8.2e-05,5.4e-05,-0.000245,8e-06,-0.000153,-6.5e-05,-0.000123,4.3e-05,7.8e-05,-6.2e-05,-4.1e-05,-3.9e-05,-7.9e-05
6e-06,-0.000102,3.9e-05,-9e-06,-1.1e-05,5.1e-05,-6e-05,-4.9e-05,-4.6e-05,-1.9e-05,7.8e-05,3.2e-05,2.7e-05,-3.2e-05,9.2e-05,-3.1e-05,4e-06,6.6e-05,-0.000142,-4.3e-05,-9e-06,0.000102,-9.9e-05,3e-05,9e-06,1.7e-05,-8.7e-05,0.000108,3.1e-05,7.4e-05,4.2e-05,-9.3e-05,2.6e-05,-3.9e-05,-1e-06,7.5e-05,-2.1e-05,5.2e-05,-5e-06,-5e-06,-2.5e-05,-3.7e-05,-4e-05,-6.5e-05,0.00011,5.2e-05,-2.5e-05,-4e-06,-7e-06,4.8e-05,-5e-05,2.6e-05,-2.5e-05,-8.1e-05,-4e-05,-3.9e-05,-3.1e-05,-2e-06,-7.6e-05,1.8e-05,-9.6e-05,-6e-05,-1.2e-05,-5.6e-05,1e-06,8.3e-05,8e-06,2.1e-05,-6e-06,1.4e-05,0.000101,-6e-06,0.000115,-1.6e-05,-4.8e-05,0.000114,8e-06,3.6e-05,-7.8e-05,0,6.4e-05,2.7e-05,1.4e-05,1.2e-05,-1.4e-05,1.4e-05,6e-06,-1.9e-05,2e-06,-2.5e-05,-4.8e-05,3.1e-05,-3.1e-05,-7.5e-05,3.6e-05,5e-06,8.8e-05,7e-05,0.000121,3e-06,-1.4e-05,-1.1e-05,-8.9e-05,-6e-06,0.000108,-9e-06,-4.3e-05,-5.4e-05,5e-06,-1.1e-05,-4.9e-05,-4.5e-05,2.3e-05,-4e-06,0.000102,9e-06,-3.8e-05,4e-05,-3.6e-05,-9e-06,3e-06
5e-06,3.6e-05,-6e-06,1.1e-05,1.8e-05,-1.1e-05,3.2e-05,4.3e-05,-8e-05,-3.7e-05,1.6e-05,-2e-06,6e-06,2.3e-05,-6.2e-05,-2e-05,-3.3e-05,-7.1e-05,3.9e-05,6.6e-05,4.7e-05,1.8e-05,4.2e-05,7e-06,-6e-06,-2.6e-05,2.9e-05,-4e-05,7.4e-05,-1.6e-05,-4e-06,-3e-05,-7e-06,9.4e-05,-4.7e-05,-1.2e-05,3.4e-05,-5.8e-05,-6.5e-05,3.3e-05,4e-05,5e-06,-5.2e-05,-3.9e-05,-1.6e-05,6e-05,6e-05,4.9e-05,6e-06,-4.9e-05,8e-06,-7e-05,6.4e-05,-1.8e-05,4.6e-05,0.000125,-5e-06,-0.000118,-5.3e-05,-3.9e-05,-1.1e-05,1.5e-05,-6.4e-05,-2e-05,2.1e-05,-3.8e-05,-1.7e-05,-2.2e-05,-4.5e-05,-7e-06,7e-06,-7e-06,-6.9e-05,6.4e-05,3.2e-05,-1.7e-05,-8.8e-05,-2.1e-05,8.4e-05,-8.4e-05,-1.1e-05,-4.3e-05,-3e-05,-2e-06,4e-06,2.1e-05,6.5e-05,-6e-05,2e-06,-0.000108,-2.5e-05,-1.8e-05,1.3e-05,-2.5e-05,-5e-06,-5.6e-05,-4.6e-05,2.7e-05,-2.3e-05,2.1e-05,-5.9e-05,-1.2e-05,1.7e-05,9e-06,-2.6e-05,-4.2e-05,-7e-06,4.8e-05,1e-05,0,0.000111,-4e-05,-4e-06,-1.4e-05,0.000112,0,-1e-05,-6e-05,2.2e-05,4e-05,5.4e-05
1.2e-05,-8e-06,6e-06,-1.7e-05,3.9e-05,3.3e-05,-3.5e-05,4.6e-05,-3e-05,-1.1e-05,-4.1e-05,-1.1e-05,-6.5e-05,2e-05,2.3e-05,3.4e-05,3.1e-05,4.7e-05,6e-06,-4e-05,-8.5e-05,-3.4e-05,-1.2e-05,2.5e-05,1e-06,2.4e-05,-2.2e-05,-1e-06,-7e-05,3.2e-05,1.6e-05,7e-05,2.5e-05,-0.000137,3.2e-05,-4.6e-05,-2.9e-05,1.4e-05,5.3e-05,5.4e-05,-1.4e-05,1.5e-05,0.000113,1.6e-05,-4.1e-05,-4.8e-05,8e-06,4.2e-05,1.8e-05,1.8e-05,1.7e-05,-7.1e-05,-8e-06,1.7e-05,-2.4e-05,-2.1e-05,3.4e-05,-2e-05,-2.8e-05,-3.8e-05,3.4e-05,-5e-06,2e-05,-1.2e-05,-7e-06,2.4e-05,2.7e-05,-1.2e-05,3.5e-05,4.6e-05,2.2e-05,-4e-06,-1.4e-05,3.8e-05,2e-06,9e-06,-1.5e-05,-3.5e-05,-3.9e-05,-2e-06,1e-05,1.7e-05,-2e-06,7e-06,1.2e-05,-6e-06,-3e-06,5e-06,1.2e-05,8.1e-05,7e-06,2.6e-05,-4e-06,6e-05,-1.1e-05,-3.2e-05,-1.3e-05,1.4e-05,-3.5e-05,5.8e-05,1e-05,-3e-06,2.7e-05,-2e-06,6e-06,3e-06,-2.3e-05,-1e-05,1.9e-05,-3e-06,1e-06,9.8e-05,-1.2e-05,1e-05,-9.2e-05,-5.2e-05,-3.1e-05,-2.3e-05,-8e-06,-6.1e-05,-3.1e-05
-1e-06,-5.5e-05,1e-05,6e-06,-5e-06,-1.5e-05,4.3e-05,-9e-05,1.4e-05,-2.2e-05,1.9e-05,0,-5e-06,-5e-06,3e-06,-3.1e-05,-5.5e-05,4e-06,-2e-05,-1.5e-05,6.7e-05,-1.9e-05,-3.8e-05,-2e-05,-3.4e-05,-4.8e-05,3e-05,4.2e-05,-4.7e-05,1.5e-05,-4.7e-05,-7.2e-05,4.5e-05,6.1e-05,-2e-05,2.7e-05,-1.2e-05,1.3e-05,-2.2e-05,4e-06,-2.1e-05,-3e-06,-5.1e-05,8e-06,-2.9e-05,-6.5e-05,-3e-06,-4.4e-05,-1e-05,3.2e-05,-4e-06,4.4e-05,4e-06,2e-06,3.9e-05,2e-05,-1.3e-05,2e-06,1.4e-05,4.7e-05,8e-06,3.5e-05,2.9e-05,0,-6e-06,-5e-06,2e-06,-4e-06,-2e-05,-3.6e-05,-2e-05,-1.4e-05,-6.2e-05,-8e-05,2e-06,-9e-06,1e-06,0,7e-06,-1e-06,8e-06,-1.3e-05,-1.1e-05,-4.2e-05,-4.3e-05,-1.8e-05,8e-06,8e-06,3e-06,-1.9e-05,5e-06,-2e-05,2.5e-05,5e-06,-7e-06,1.9e-05,4e-06,-2.5e-05,4.6e-05,-1e-06,-1.5e-05,1.2e-05,-1.3e-05,1.1e-05,-4.6e-05,-4e-06,1.4e-05,-7.6e-05,-2.2e-05,-1.4e-05,-3.4e-05,1e-05,1.8e-05,2e-06,-2.8e-05,2.8e-05,1.9e-05,4.3e-05,-3.7e-05,2.6e-05,-2e-06
7e-06,-2.5e-05,-2.7e-05,-8e-06,-2e-06,2.7e-05,-3.8e-05,2.6e-05,6e-06,1.7e-05,2e-06,7e-06,3.5e-05,2.1e-05,-9e-06,2.8e-05,2.8e-05,-6e-06,4e-05,9e-06,-4.6e-05,1.2e-05,-3.3e-05,1.4e-05,3.3e-05,-9e-06,2e-06,1.1e-05,4.2e-05,-1.5e-05,1.8e-05,-1.5e-05,-2.9e-05,-5.3e-05,1.7e-05,3.5e-05,3.2e-05,-7e-06,2e-06,6e-06,4.3e-05,3e-06,-1.3e-05,2e-06,3.6e-05,3.6e-05,-5e-06,-2.6e-05,3e-06,-3.4e-05,-2.1e-05,2e-05,4.5e-05,2.2e-05,-3.2e-05,1e-05,-3.3e-05,3.6e-05,2.7e-05,-3.8e-05,1e-05,3.4e-05,-3.9e-05,-4e-06,-7e-06,4e-06,-1e-05,-2.1e-05,7e-06,-1.2e-05,-2.8e-05,6e-06,5.6e-05,-2.5e-05,-3e-06,3e-05,-1.8e-05,2e-06,7e-06,4.7e-05,1e-06,-5e-06,1.3e-05,1.4e-05,8e-06,-7e-06,7e-06,9e-06,9e-06,0,-7e-06,-1.9e-05,1.1e-05,0,-4e-06,2.7e-05,2.4e-05,4e-06,-1.1e-05,-8e-06,1.8e-05,3e-06,9e-06,4e-06,-3.7e-05,3e-06,-8e-06,2.9e-05,-3.3e-05,4e-06,5.6e-05,-6.2e-05,-7e-06,-2.5e-05,-5e-06,-6e-06,3e-06,-2.8e-05,2.1e-05,-2.9e-05,9e-06
-2.7e-05,1.3e-05,-5e-06,8e-06,-6e-06,0,7e-06,1e-05,2e-06,6e-06,-1.5e-05,2e-06,0,5e-06,1.2e-05,-3e-05,5e-06,-9e-06,-1.1e-05,7e-06,1.2e-05,0,4.5e-05,-2e-06,-1.5e-05,7e-06,-2e-06,-5.1e-05,-1.2e-05,-3e-06,0,1.7e-05,-2.9e-05,8e-06,-1.8e-05,-2.3e-05,-4e-06,1e-06,5e-06,-2.2e-05,-8e-06,1.3e-05,-1.9e-05,-1e-06,2e-05,1.2e-05,-1e-05,9e-06,-5e-06,9e-06,-1.6e-05,-1.1e-05,1.3e-05,-5e-06,-9e-06,-2e-06,-2.5e-05,-2.2e-05,2.1e-05,1.4e-05,-5e-05,8e-06,-1.3e-05,1.1e-05,6e-06,-1.5e-05,1e-06,8e-06,1e-06,-1e-05,-1.1e-05,-7e-06,4e-06,3.4e-05,-2e-06,8e-06,-3e-06,2.4e-05,-1.9e-05,3e-06,1.3e-05,-3e-06,-9e-06,6e-06,3e-06,1.5e-05,4e-06,3e-05,0,-2e-05,-7e-06,-7e-06,-2.3e-05,-5e-06,2.3e-05,-3e-06,1.4e-05,-1.2e-05,9e-06,-2e-05,-1e-06,-1e-06,0,1.4e-05,1.1e-05,2.3e-05,1e-06,-1.9e-05,9e-06,0,-2.8e-05,5e-06,-1.3e-05,1.9e-05,-1.3e-05,-3.6e-05,-2e-05,-1e-06,-1e-05,1.5e-05,0
9e-06,0,-1e-06,-1.5e-05,2.1e-05,-6e-06,1.3e-05,5e-06,-8e-06,3e-06,1e-06,-4e-06,-1.2e-05,-7e-06,-3.3e-05,8e-06,1e-05,1.7e-05,-1.1e-05,1.5e-05,-8e-06,-1.2e-05,1.8e-05,-2e-06,-1.7e-05,1.2e-05,2e-06,4.5e-05,3e-05,-4.3e-05,4e-06,-9e-06,2.5e-05,1.1e-05,2.6e-05,-2e-05,-1.2e-05,9e-06,-2e-05,-5e-06,2e-06,-1.3e-05,2.1e-05,-1.2e-05,-4.8e-05,-2e-06,-4e-06,6e-06,-2e-06,0,-1.3e-05,-2.2e-05,-3.4e-05,-9e-06,-1.2e-05,-7e-06,1.8e-05,-6e-06,1e-05,-1.8e-05,8e-06,-1.6e-05,-3e-06,1.3e-05,8e-06,2e-06,-6e-06,-2.2e-05,1.1e-05,2.7e-05,-1.8e-05,-6e-06,-3.8e-05,-1.3e-05,2e-06,2.3e-05,2.3e-05,3e-06,1e-06,-1.9e-05,7e-06,-4e-06,6e-06,-1.6e-05,2e-06,0,-1.5e-05,-3e-06,9e-06,-8e-06,1e-06,-5e-06,-8e-06,1.5e-05,-2.6e-05,9e-06,-2.6e-05,6e-06,-6e-06,-1.4e-05,1.5e-05,-4e-06,-4e-06,1.6e-05,-6e-06,-1.5e-05,-1.6e-05,1.1e-05,-9e-06,0,-1.9e-05,1.1e-05,2.7e-05,-1.5e-05,-8e-06,1.9e-05,5e-06,-1e-06,-1e-06,4e-06,-1e-06
9e-06,9e-06,-6e-06,1.3e-05,-1e-06,-8e-06,3e-06,4e-06,-5e-06,3e-06,7e-06,3e-06,5e-06,0,1.4e-05,1.4e-05,-8e-06,-2.8e-05,1.2e-05,-1e-06,9e-06,7e-06,-9e-06,-1e-06,7e-06,7e-06,-4e-06,-1.4e-05,-8e-06,-5e-06,1.1e-05,2.1e-05,-1e-06,3e-06,-1.8e-05,8e-06,4e-06,9e-06,6e-06,1e-06,-1.3e-05,7e-06,-6e-06,-9e-06,-4e-06,8e-06,-1.3e-05,1.1e-05,5e-06,1e-06,1.7e-05,5e-06,-1.6e-05,-6e-06,2e-05,-5e-06,-3e-06,-1.2e-05,0,-2e-06,1.9e-05,1.2e-05,4e-06,-7e-06,-6e-06,9e-06,8e-06,5e-06,-1.6e-05,-1.3e-05,-1e-05,-1e-06,-2e-06,-2.8e-05,-7e-06,1.4e-05,1.4e-05,4e-06,-8e-06,-1.8e-05,3e-06,-2e-06,-7e-06,1.3e-05,3e-06,-7e-06,-1e-05,-8e-06,1e-06,2.1e-05,1e-05,6e-06,-2e-06,-8e-06,1.1e-05,-2.5e-05,-1.1e-05,7e-06,-1e-05,1.9e-05,-1e-06,2e-06,4e-06,-2.2e-05,2.3e-05,6e-06,4e-06,-9e-06,1.4e-05,-2e-06,2.5e-05,-9e-06,-2.4e-05,2e-06,-9e-06,-1.5e-05,7e-06,-8e-06,1.7e-05,-2e-06,1.3e-05
1.6e-05,-1.1e-05,0,-8e-06,-1e-05,2e-06,-1.1e-05,-2.2e-05,7e-06,0,-5e-06,-6e-06,-1e-06,-3e-06,0,-1.6e-05,3e-06,1.8e-05,1.6e-05,-1.8e-05,-1.2e-05,-2e-06,-1.2e-05,-4e-06,-3e-06,-6e-06,-1e-06,0,-3e-05,1e-05,-1.1e-05,5e-06,-9e-06,-6e-06,-2e-06,5e-06,-4e-06,-1.2e-05,-5e-06,-4e-06,3e-06,-1e-06,-2.5e-05,-1e-06,1.5e-05,0,8e-06,-1.1e-05,-5e-06,-9e-06,-6e-06,1.4e-05,6e-06,-7e-06,2e-06,-1.9e-05,9e-06,0,0,5e-06,6e-06,1.5e-05,1.5e-05,-1.2e-05,1e-06,1.2e-05,9e-06,-1.2e-05,2e-06,7e-06,-9e-06,-4e-06,1.4e-05,1.6e-05,3e-06,-6e-06,7e-06,1e-05,7e-06,1.5e-05,0,3e-06,-2e-06,-4e-06,-4e-06,-4e-06,1e-06,-2e-06,5e-06,-2e-06,1e-06,4e-06,0,3e-06,-4e-06,5e-06,1.3e-05,6e-06,1.3e-05,-1.5e-05,3e-06,2e-06,-5e-06,-1.7e-05,3e-06,-6e-06,0,9e-06,-2e-06,-6e-06,1.7e-05,6e-06,9e-06,0,-1.3e-05,1.3e-05,-1e-06,-5e-06,-8e-06,-1.5e-05,-1.3e-05
-6e-06,5e-06,3e-06,1e-06,-1.3e-05,1e-06,-6e-06,2e-06,7e-06,8e-06,3e-06,1e-06,-1.2e-05,3e-06,6e-06,9e-06,-1.4e-05,-1.1e-05,-4e-06,1.4e-05,8e-06,1e-05,7e-06,1e-06,-1e-06,-4e-06,-3e-06,1e-06,1.1e-05,3e-06,9e-06,-1e-05,-1e-06,2e-06,-2e-06,-8e-06,5e-06,-1.3e-05,-7e-06,-8e-06,-1e-06,-5e-06,3.6e-05,5e-06,1.3e-05,-9e-06,4e-06,-6e-06,3e-06,0,-3e-06,-1.2e-05,-8e-06,4e-06,8e-06,5e-06,-1.2e-05,-9e-06,-1.5e-05,-1.4e-05,5e-06,-1e-06,-2.6e-05,3e-06,0,-1.1e-05,-7e-06,1e-06,5e-06,-1.2e-05,-5e-06,-2e-06,1.7e-05,9e-06,0,-4e-06,3e-06,-6e-06,-5e-06,-1.1e-05,0,-7e-06,-1e-06,-2e-06,1e-06,4e-06,-6e-06,-3e-06,1e-06,-1.8e-05,0,1.1e-05,4e-06,0,5e-06,0,5e-06,4e-06,1e-06,1e-05,-5e-06,2e-06,7e-06,3e-06,6e-06,1e-06,-5e-06,-1.2e-05,-6e-06,6e-06,-2e-05,1e-06,-6e-06,-6e-06,1.5e-05,-1.2e-05,-2e-06,0,5e-06,1.9e-05,5e-06
-1e-06,6e-06,0,-1e-06,-6e-06,7e-06,1.1e-05,1.9e-05,9e-06,-2e-06,1e-05,4e-06,5e-06,3e-06,-8e-06,-5e-06,1.1e-05,-5e-06,-1.1e-05,-1.2e-05,-2e-06,5e-06,1.2e-05,-6e-06,-2e-06,-8e-06,-2e-06,1.4e-05,-8e-06,1.5e-05,-1.4e-05,1.2e-05,-3e-06,-2e-06,0,-4e-06,-3e-06,1.1e-05,8e-06,1.1e-05,-2e-06,4e-06,-3e-06,1e-06,-5e-06,-7e-06,3e-06,4e-06,-4e-06,-7e-06,-8e-06,-1.2e-05,-8e-06,-1e-06,-9e-06,-6e-06,-1.2e-05,-6e-06,-9e-06,0,-2.1e-05,4e-06,-7e-06,-6e-06,0,-2e-06,2e-06,-8e-06,-5e-06,4e-06,-2e-06,2e-06,-1.5e-05,-1.1e-05,3e-06,5e-06,6e-06,7e-06,5e-06,6e-06,-1e-06,9e-06,1e-06,5e-06,0,3e-06,9e-06,2e-06,2e-06,8e-06,3e-06,-1e-06,0,0,-1e-06,3e-06,-4e-06,0,-5e-06,2e-06,-3e-06,-1e-06,-5e-06,-2e-06,3e-06,0,0,1.1e-05,4e-06,-5e-06,-1.1e-05,-1e-06,-6e-06,3e-06,2.3e-05,4e-06,-2e-06,1e-06,1e-06,-1.1e-05,3e-06
0,3e-06,0,2e-06,1e-05,0,-5e-06,-8e-06,5e-06,-3e-06,-8e-06,-3e-06,4e-06,3e-06,3e-06,0,-5e-06,2e-06,-4e-06,8e-06,-3e-06,-1.1e-05,-1.5e-05,2e-06,-7e-06,3e-06,1e-06,-2.4e-05,1.5e-05,3e-06,6e-06,-8e-06,1e-06,-1.3e-05,-3e-06,1e-06,-1e-06,0,-5e-06,6e-06,6e-06,-5e-06,0,-3e-06,-1.5e-05,2e-06,0,1.1e-05,2e-06,-1e-06,-1e-06,1.5e-05,1.6e-05,-3e-06,-2e-06,-9e-06,1.2e-05,1.2e-05,-1.2e-05,-6e-06,-7e-06,-6e-06,2e-05,1.4e-05,0,1e-06,-1e-06,3e-06,7e-06,-1e-06,-4e-06,-3e-06,-7e-06,-3e-06,-4e-06,2e-06,-2e-06,-1e-06,-5e-06,3e-06,-3e-06,2e-06,0,7e-06,1e-06,-2e-06,8e-06,4e-06,2e-06,1.2e-05,-2e-06,0,-3e-06,7e-06,-5e-06,7e-06,-5e-06,-7e-06,-8e-06,6e-06,-3e-06,1e-06,0,-1e-05,-1.5e-05,3e-06,-2e-06,-1.1e-05,-5e-06,0,8e-06,2e-06,8e-06,-2e-06,-1e-06,-1.4e-05,1e-06,-7e-06,-9e-06,2e-06,0
0,0,1e-06,-3e-06,7e-06,-5e-06,3e-06,-4e-06,-5e-06,-3e-06,3e-06,0,-6e-06,4e-06,5e-06,5e-06,4e-06,-4e-06,-2e-06,0,3e-06,-1e-06,-5e-06,-7e-06,9e-06,1e-06,3e-06,2e-05,1e-06,-1e-06,-3e-06,-3e-06,-1e-06,1.8e-05,-2e-06,7e-06,4e-06,-3e-06,-5e-06,9e-06,-7e-06,3e-06,-1.2e-05,-1e-06,-1e-06,2e-06,-5e-06,-5e-06,1e-06,-3e-06,3e-06,7e-06,1e-05,-2e-06,-6e-06,7e-06,5e-06,-6e-06,-4e-06,3e-06,9e-06,8e-06,-7e-06,-4e-06,-2e-06,4e-06,-6e-06,-5e-06,-4e-06,6e-06,3e-06,1e-06,3e-06,6e-06,4e-06,3e-06,-6e-06,4e-06,-1e-06,-1e-06,3e-06,-4e-06,0,-7e-06,-1e-06,-5e-06,1e-06,-1e-06,2e-06,-1.1e-05,1e-06,-6e-06,0,-8e-06,1e-05,-6e-06,2e-06,-1e-06,1.2e-05,-4e-06,-2e-06,-2e-06,0,4e-06,-2e-06,-2e-06,0,9e-06,4e-06,5e-06,5e-06,-3e-06,-6e-06,-2e-06,-1.2e-05,5e-06,2e-06,-1e-06,5e-06,3e-06,-5e-06
2e-06,-2e-06,-2e-06,1e-06,2e-06,1e-06,-8e-06,1e-06,-3e-06,-3e-06,7e-06,1e-06,1e-06,1e-06,-5e-06,-7e-06,1e-06,-1e-06,-2e-06,-4e-06,-1e-06,5e-06,2e-06,5e-06,1e-06,3e-06,-1e-06,-5e-06,-8e-06,-3e-06,4e-06,9e-06,-2e-06,-1.3e-05,1e-06,4e-06,-1e-06,-5e-06,4e-06,0,2e-06,0,9e-06,-1e-06,1.9e-05,2e-06,-2e-06,-6e-06,-1e-06,-4e-06,6e-06,-7e-06,-4e-06,-4e-06,4e-06,-1.2e-05,-1e-06,-4e-06,0,-9e-06,3e-06,1e-06,-2e-06,-1e-06,2e-06,-4e-06,4e-06,2e-06,2e-06,-7e-06,0,-1e-06,1.9e-05,-3e-06,-3e-06,5e-06,-7e-06,3e-06,0,0,-4e-06,4e-06,-2e-06,0,3e-06,1e-06,0,-1e-06,1e-06,-4e-06,1e-06,-7e-06,3e-06,3e-06,-6e-06,-1e-06,7e-06,-1e-06,0,-1e-06,0,0,3e-06,4e-06,-5e-06,-1e-06,-1e-06,0,-2e-06,-7e-06,-4e-06,2e-06,2e-06,2e-06,3e-06,-1e-06,-4e-06,-2e-06,-3e-06,-4e-06,6e-06
-1e-06,-6e-06,-1e-06,-1e-06,-3e-06,-1e-06,1.1e-05,-6e-06,-4e-06,0,-7e-06,1e-06,3e-06,1e-06,2e-06,3e-06,1e-06,-3e-06,3e-06,2e-06,0,0,1e-05,-5e-06,-4e-06,2e-06,3e-06,0,8e-06,-8e-06,0,-1.2e-05,1e-06,1.1e-05,-1e-06,-1e-05,-2e-06,2e-06,-3e-06,-7e-06,-2e-06,0,-1e-06,2e-06,-4e-06,6e-06,-5e-06,-2e-06,2e-06,3e-06,-3e-06,-1.2e-05,1e-06,2e-06,2e-06,6e-06,-2e-06,-1.1e-05,4e-06,1e-06,4e-06,-3e-06,1e-06,-1e-06,0,-2e-06,0,-2e-06,-4e-06,3e-06,4e-06,-2e-06,-9e-06,-7e-06,2e-06,-3e-06,-5e-06,-4e-06,-9e-06,-9e-06,-1e-06,0,1e-06,5e-06,-2e-06,2e-06,-2e-06,0,1e-06,7e-06,0,0,0,1e-06,4e-06,-1e-06,-3e-06,2e-06,-9e-06,-8e-06,0,1e-06,-1e-06,3e-06,5e-06,-1e-06,-2e-06,-2e-06,-1e-06,5e-06,7e-06,2e-06,-1e-06,-2e-06,5e-06,-5e-06,1e-06,-4e-06,-3e-06,-1e-06,0
6e-06,0,1e-06,-2e-06,1e-06,0,-9e-06,1.5e-05,2e-06,-4e-06,1e-06,0,-5e-06,1e-06,-1e-06,3e-06,-5e-06,6e-06,4e-06,2e-06,-2e-06,-3e-06,-8e-06,3e-06,2e-06,-1e-06,0,-4e-06,-8e-06,-3e-06,-2e-06,-2e-06,0,-6e-06,-1e-06,-5e-06,2e-06,4e-06,0,-8e-06,2e-06,1e-06,-1.5e-05,2e-06,-1.1e-05,-1e-06,2e-06,3e-06,-3e-06,-5e-06,-1e-06,6e-06,3e-06,2e-06,1e-06,-2e-06,-9e-06,4e-06,8e-06,-4e-06,-7e-06,-2e-06,-4e-06,-5e-06,0,3e-06,3e-06,-1e-06,1e-06,-4e-06,5e-06,-1e-06,-1.1e-05,6e-06,-1e-06,-6e-06,-6e-06,3e-06,6e-06,-4e-06,0,3e-06,-2e-06,-4e-06,1e-06,2e-06,-3e-06,0,0,3e-06,-2e-06,0,-2e-06,-1e-06,-2e-06,-1e-06,-6e-06,2e-06,6e-06,4e-06,1e-06,1e-06,-4e-06,3e-06,6e-06,0,-2e-06,3e-06,2e-06,-1e-06,-3e-06,-6e-06,-2e-06,0,1e-06,-1e-06,1e-06,2e-06,4e-06,5e-06,-1e-06
0,0,0,2e-06,2e-06,1e-06,4e-06,-7e-06,2e-06,0,3e-06,-1e-06,-3e-06,-1e-06,-1e-06,-4e-06,3e-06,-7e-06,-6e-06,-6e-06,4e-06,2e-06,3e-06,-4e-06,2e-06,-3e-06,0,1.2e-05,3e-06,-3e-06,2e-06,5e-06,-1e-06,5e-06,0,9e-06,-2e-06,-6e-06,3e-06,0,0,0,1.2e-05,1e-06,1e-06,-8e-06,1e-06,5e-06,1e-06,2e-06,-2e-06,1.2e-05,-9e-06,-1e-06,0,-2e-06,4e-06,2e-06,5e-06,-1e-06,-7e-06,2e-06,8e-06,5e-06,1e-06,3e-06,4e-06,1e-06,1e-06,4e-06,3e-06,0,4e-06,4e-06,0,1e-06,-3e-06,-3e-06,-3e-06,6e-06,-5e-06,-3e-06,1e-06,0,-1e-06,-3e-06,-5e-06,2e-06,0,0,1e-06,6e-06,-3e-06,-2e-06,0,4e-06,1e-06,1e-06,-5e-06,-3e-06,1e-06,-1e-06,5e-06,-3e-06,-3e-06,2e-06,2e-06,-1e-06,-2e-06,-1e-06,-1e-05,0,1e-06,-1e-06,-2e-06,-3e-06,0,-2e-06,-3e-06,-4e-06,-1e-06
1e-06,-6e-06,0,-3e-06,1e-06,0,-3e-06,-5e-06,-3e-06,1e-06,-1e-06,0,6e-06,-1e-06,5e-06,3e-06,-1e-06,6e-06,0,7e-06,-5e-06,2e-06,-3e-06,3e-06,2e-06,-3e-06,0,-1.4e-05,0,4e-06,-5e-06,-3e-06,0,-9e-06,2e-06,-2e-06,1e-06,0,-4e-06,-1e-06,-3e-06,0,0,-1e-06,7e-06,-1e-06,4e-06,0,0,-2e-06,3e-06,-5e-06,-6e-06,-3e-06,-1e-06,4e-06,6e-06,-1e-06,5e-06,-4e-06,6e-06,-2e-06,-3e-06,1e-06,-1e-06,-4e-06,-3e-06,-3e-06,2e-06,-3e-06,4e-06,-1e-06,6e-06,-7e-06,1e-06,-3e-06,2e-06,2e-06,0,6e-06,0,-3e-06,0,1e-06,0,-2e-06,0,1e-06,1e-06,-1e-05,-2e-06,3e-06,-3e-06,1e-06,3e-06,0,5e-06,0,7e-06,5e-06,1e-06,0,-1e-06,-5e-06,4e-06,1e-06,-3e-06,-1e-06,2e-06,1e-06,7e-06,4e-06,0,-1e-06,-6e-06,3e-06,0,-4e-06,1e-06,0,1e-06
-3e-06,-3e-06,1e-06,1e-06,-5e-06,-2e-06,6e-06,3e-06,-2e-06,2e-06,-5e-06,1e-06,0,0,-6e-06,0,0,-1e-06,6e-06,-6e-06,3e-06,-2e-06,3e-06,-3e-06,-1e-06,1e-06,-2e-06,1e-05,-1e-06,5e-06,2e-06,3e-06,2e-06,6e-06,1e-06,-1e-05,0,3e-06,2e-06,3e-06,3e-06,0,6e-06,-1e-06,5e-06,2e-06,1e-06,-5e-06,0,1e-06,2e-06,-9e-06,4e-06,-4e-06,0,-1e-06,-1e-06,-3e-06,-1e-06,-2e-06,3e-06,-2e-06,-5e-06,-1e-06,0,-2e-06,-1e-06,2e-06,-1e-06,2e-06,1e-06,0,3e-06,0,-1e-06,-2e-06,4e-06,0,0,-4e-06,-2e-06,3e-06,-1e-06,-2e-06,0,1e-06,2e-06,-1e-06,0,5e-06,1e-06,1e-06,1e-06,1e-06,-5e-06,-1e-06,0,-1e-06,-1e-06,-2e-06,0,0,-2e-06,1e-06,-7e-06,0,0,-2e-06,-3e-06,-1e-06,8e-06,-1e-06,-2e-06,1e-06,-1e-06,-5e-06,0,-1e-06,2e-06,2e-06,-1e-06
1e-06,-2e-06,-1e-06,-2e-06,-5e-06,3e-06,-6e-06,0,-2e-06,2e-06,6e-06,0,-4e-06,0,2e-06,-2e-06,1e-06,-1e-06,1e-06,3e-06,-1e-06,1e-06,-1e-06,3e-06,-2e-06,1e-06,-1e-06,-4e-06,6e-06,2e-06,-1e-06,1e-06,0,-3e-06,-1e-06,3e-06,0,1e-06,1e-06,2e-06,-4e-06,0,-9e-06,0,-7e-06,1e-06,0,-1e-06,1e-06,0,0,4e-06,1e-06,1e-06,-1e-06,2e-06,-5e-06,-3e-06,-2e-06,-1e-06,3e-06,-3e-06,7e-06,2e-06,0,1e-06,0,-3e-06,-1e-06,-3e-06,1e-06,-1e-06,-1e-05,6e-06,1e-06,2e-06,3e-06,-1e-06,-1e-06,-2e-06,-2e-06,0,-1e-06,-1e-06,-1e-06,3e-06,1e-06,-1e-06,0,9e-06,0,-2e-06,3e-06,-3e-06,6e-06,0,-3e-06,-2e-06,-8e-06,5e-06,0,0,2e-06,-1e-06,1e-06,-1e-06,-1e-06,3e-06,1e-06,2e-06,-7e-06,-1e-06,2e-06,-2e-06,7e-06,1e-06,0,-2e-06,-2e-06,-3e-06,2e-06
1e-06,3e-06,0,1e-06,-1e-06,-2e-06,1e-06,2e-06,0,-1e-06,-2e-06,0,2e-06,1e-06,0,4e-06,-1e-06,3e-06,-1e-06,0,0,-1e-06,2e-06,-2e-06,2e-06,2e-06,0,2e-06,-3e-06,2e-06,1e-06,-4e-06,-1e-06,1e-06,2e-06,6e-06,1e-06,-3e-06,-3e-06,2e-06,2e-06,-1e-06,6e-06,0,-6e-06,1e-06,-1e-06,3e-06,-1e-06,1e-06,-3e-06,7e-06,-3e-06,0,1e-06,3e-06,-3e-06,1e-06,-5e-06,-5e-06,-3e-06,-1e-06,-2e-06,-3e-06,0,3e-06,-1e-06,1e-06,2e-06,2e-06,0,0,-5e-06,-4e-06,-1e-06,0,3e-06,2e-06,-2e-06,-5e-06,0,-3e-06,0,1e-06,0,-1e-06,3e-06,0,0,-1e-05,0,-3e-06,2e-06,2e-06,-4e-06,-3e-06,-1e-06,0,7e-06,-7e-06,0,0,2e-06,-5e-06,-2e-06,0,-1e-06,-5e-06,0,-3e-06,-3e-06,1e-06,-3e-06,2e-06,-2e-06,-4e-06,0,-2e-06,3e-06,1e-06,0
1e-06,0,0,-2e-06,3e-06,0,1e-06,0,3e-06,2e-06,-3e-06,0,1e-06,1e-06,1e-06,-4e-06,0,1e-06,-1e-06,-2e-06,0,-2e-06,-3e-06,2e-06,1e-06,0,1e-06,-6e-06,-1e-06,-2e-06,1e-06,5e-06,1e-06,-1e-06,1e-06,-4e-06,-1e-06,-2e-06,3e-06,2e-06,-1e-06,1e-06,1e-06,0,8e-06,1e-06,-3e-06,1e-06,1e-06,0,0,-2e-06,5e-06,0,-2e-06,-1e-06,1e-06,-4e-06,-4e-06,3e-06,-5e-06,0,-3e-06,1e-06,0,-1e-06,2e-06,-3e-06,-3e-06,-2e-06,-1e-06,0,1.1e-05,-3e-06,1e-06,-5e-06,4e-06,-3e-06,-2e-06,2e-06,-2e-06,0,-1e-06,1e-06,0,-3e-06,2e-06,0,0,-3e-06,-1e-06,-3e-06,-1e-06,-1e-06,3e-06,2e-06,2e-06,0,-2e-06,5e-06,-1e-06,0,-1e-06,0,2e-06,-1e-06,0,5e-06,0,2e-06,3e-06,-1e-06,3e-06,-1e-06,-8e-06,1e-06,-1e-06,0,-1e-06,1e-06,-2e-06
1e-06,0,0,1e-06,4e-06,0,1e-06,-5e-06,1e-06,0,2e-06,-1e-06,-4e-06,0,-1e-06,1e-06,0,-1e-06,-3e-06,1e-06,1e-06,3e-06,0,-1e-06,-2e-06,-2e-06,0,9e-06,-2e-06,-2e-06,-1e-06,0,1e-06,3e-06,1e-06,-4e-06,0,5e-06,-1e-06,1e-06,0,0,-8e-06,0,5e-06,-1e-06,0,0,-1e-06,1e-06,-1e-06,-8e-06,5e-06,1e-06,1e-06,2e-06,6e-06,1e-06,-4e-06,-7e-06,1e-06,-3e-06,3e-06,-1e-06,0,-3e-06,2e-06,1e-06,1e-06,2e-06,-1e-06,0,2e-06,4e-06,-1e-06,-2e-06,2e-06,2e-06,0,2e-06,0,0,0,-2e-06,0,0,-1e-06,1e-06,0,8e-06,1e-06,-1e-06,-2e-06,0,-1e-06,1e-06,1e-06,1e-06,1e-06,-7e-06,-1e-06,0,-2e-06,2e-06,2e-06,1e-06,-1e-06,-4e-06,1e-06,0,-1e-06,0,-2e-06,0,0,-2e-06,-1e-06,-1e-06,-1e-06,-1e-06,1e-06
0,-1e-06,0,-1e-06,1e-06,0,-2e-06,4e-06,1e-06,0,2e-06,0,1e-06,0,-1e-06,2e-06,0,2e-06,-2e-06,0,0,0,2e-06,1e-06,-1e-06,-2e-06,1e-06,-1e-05,0,-3e-06,1e-06,-2e-06,0,-4e-06,0,1e-06,1e-06,0,-1e-06,-4e-06,0,0,4e-06,0,-6e-06,-2e-06,0,-2e-06,0,0,1e-06,3e-06,-3e-06,-2e-06,-1e-06,2e-06,1e-06,-2e-06,-1e-06,3e-06,3e-06,-2e-06,-1e-06,0,0,1e-06,0,-3e-06,1e-06,-2e-06,-2e-06,-1e-06,-5e-06,1e-06,1e-06,0,-1e-06,-1e-06,-2e-06,0,-1e-06,2e-06,0,1e-06,-1e-06,2e-06,-2e-06,0,0,0,0,2e-06,-1e-06,0,-1e-06,0,-2e-06,1e-06,-1e-06,4e-06,-1e-06,-1e-06,2e-06,1e-06,0,0,0,2e-06,-1e-06,-2e-06,1e-06,0,1e-06,1e-06,6e-06,0,1e-06,-2e-06,2e-06,-1e-06,1e-06
1e-06,2e-06,0,1e-06,0,-1e-06,-1e-06,2e-06,0,-1e-06,-3e-06,1e-06,3e-06,0,3e-06,-4e-06,-1e-06,1e-06,2e-06,-2e-06,0,-2e-06,1e-06,-1e-06,1e-06,0,0,7e-06,3e-06,-2e-06,-2e-06,3e-06,0,1e-06,1e-06,1e-06,-1e-06,-3e-06,2e-06,-4e-06,-2e-06,0,-2e-06,-1e-06,-3e-06,0,3e-06,-1e-06,0,1e-06,0,7e-06,-2e-06,-1e-06,2e-06,-2e-06,-5e-06,1e-06,1e-06,-5e-06,2e-06,0,0,2e-06,0,2e-06,0,0,0,1e-06,-1e-06,0,-6e-06,-3e-06,-1e-06,-2e-06,-3e-06,-1e-06,4e-06,0,0,-2e-06,0,2e-06,0,1e-06,-2e-06,0,0,-5e-06,0,3e-06,0,-1e-06,3e-06,1e-06,-2e-06,0,-2e-06,-4e-06,0,0,0,2e-06,1e-06,0,0,-2e-06,0,3e-06,3e-06,0,-1e-06,-1e-06,1e-06,-2e-06,-1e-06,-1e-06,-2e-06,2e-06,-2e-06
-1e-06,0,0,0,-1e-06,1e-06,3e-06,-2e-06,-1e-06,-2e-06,2e-06,-1e-06,-2e-06,0,-4e-06,3e-06,2e-06,-2e-06,2e-06,3e-06,1e-06,1e-06,-1e-06,1e-06,0,1e-06,0,-4e-06,0,1e-06,1e-06,-4e-06,0,2e-06,0,-1e-06,0,0,-2e-06,-2e-06,2e-06,0,7e-06,-1e-06,3e-06,1e-06,1e-06,2e-06,-1e-06,0,-1e-06,-2e-06,3e-06,0,-2e-06,3e-06,-3e-06,-3e-06,3e-06,0,0,0,0,-1e-06,0,-1e-06,-1e-06,-2e-06,-1e-06,-2e-06,-1e-06,-1e-06,6e-06,1e-06,1e-06,1e-06,-3e-06,2e-06,-4e-06,-1e-06,0,0,-1e-06,0,0,-2e-06,-1e-06,0,0,-2e-06,0,2e-06,0,1e-06,-4e-06,-2e-06,2e-06,-1e-06,4e-06,4e-06,0,0,-2e-06,0,-2e-06,-1e-06,-1e-06,1e-06,-1e-06,-2e-06,-2e-06,0,1e-06,0,-2e-06,-1e-06,0,-1e-06,0,-2e-06,0
0,1e-06,0,0,0,-1e-06,-3e-06,0,1e-06,0,1e-06,0,-1e-06,-1e-06,4e-06,0,-2e-06,4e-06,-1e-06,-2e-06,-1e-06,1e-06,-3e-06,-1e-06,-1e-06,1e-06,0,3e-06,0,1e-06,-1e-06,0,0,-4e-06,0,-2e-06,0,2e-06,0,1e-06,-2e-06,0,-6e-06,0,5e-06,1e-06,0,2e-06,1e-06,1e-06,-1e-06,-7e-06,-2e-06,-1e-06,0,-1e-06,2e-06,-2e-06,4e-06,-2e-06,-3e-06,-1e-06,-3e-06,-1e-06,0,-2e-06,-1e-06,-1e-06,1e-06,2e-06,-1e-06,0,5e-06,2e-06,0,1e-06,-3e-06,-2e-06,2e-06,-3e-06,0,2e-06,0,-1e-06,0,-1e-06,0,0,-1e-06,5e-06,0,0,-1e-06,0,4e-06,0,2e-06,0,-2e-06,-2e-06,1e-06,0,1e-06,-2e-06,-2e-06,0,-1e-06,-2e-06,0,0,-3e-06,0,-1e-06,0,0,0,0,-1e-06,1e-06,1e-06,2e-06
0,-2e-06,0,0,-1e-06,1e-06,1e-06,-1e-06,1e-06,-2e-06,0,1e-06,3e-06,-1e-06,-3e-06,-1e-06,1e-06,-2e-06,-2e-06,0,0,-1e-06,3e-06,1e-06,-1e-06,1e-06,-1e-06,-5e-06,-1e-06,2e-06,1e-06,2e-06,0,3e-06,0,-2e-06,0,2e-06,1e-06,4e-06,1e-06,0,3e-06,0,-1e-06,1e-06,-1e-06,-2e-06,-1e-06,0,1e-06,1e-06,-4e-06,1e-06,-2e-06,-1e-06,4e-06,0,3e-06,-3e-06,-1e-06,0,2e-06,0,0,1e-06,1e-06,-1e-06,0,-1e-06,0,0,-2e-06,-1e-06,0,-1e-06,-3e-06,2e-06,-1e-06,-2e-06,1e-06,0,0,2e-06,0,1e-06,2e-06,0,0,2e-06,0,-2e-06,-1e-06,0,-3e-06,0,-1e-06,0,1e-06,3e-06,1e-06,0,1e-06,0,0,0,0,2e-06,0,0,3e-06,0,1e-06,-1e-06,2e-06,-2e-06,-1e-06,-1e-06,-1e-06,0,-1e-06
1e-06,-1e-06,0,-1e-06,-2e-06,0,-1e-06,1e-06,0,-1e-06,-1e-06,0,-1e-06,0,0,2e-06,-1e-06,-1e-06,1e-06,1e-06,0,-1e-06,1e-06,-1e-06,1e-06,-1e-06,-1e-06,7e-06,0,1e-06,0,-3e-06,0,-1e-06,0,3e-06,0,-3e-06,-2e-06,3e-06,-1e-06,0,1e-06,0,-7e-06,0,-2e-06,-2e-06,0,-1e-06,0,7e-06,2e-06,-1e-06,2e-06,1e-06,1e-06,0,3e-06,0,1e-06,0,2e-06,0,0,3e-06,1e-06,-2e-06,-1e-06,1e-06,-1e-06,0,-7e-06,-1e-06,0,0,-2e-06,-1e-06,-3e-06,1e-06,0,-1e-06,0,0,0,1e-06,2e-06,0,0,-5e-06,0,-2e-06,0,0,1e-06,0,-2e-06,0,-1e-06,-4e-06,0,0,-1e-06,0,0,0,0,-2e-06,0,0,1e-06,1e-06,-1e-06,0,2e-06,0,1e-06,-1e-06,1e-06,0,0
0,0,0,1e-06,-2e-06,0,3e-06,1e-06,-1e-06,0,2e-06,0,-2e-06,0,2e-06,-2e-06,1e-06,1e-06,2e-06,-1e-06,0,1e-06,0,1e-06,0,-1e-06,0,-8e-06,0,1e-06,-1e-06,2e-06,0,1e-06,0,2e-06,0,-1e-06,1e-06,1e-06,-1e-06,0,-3e-06,0,2e-06,-1e-06,-1e-06,1e-06,0,1e-06,1e-06,-1e-06,3e-06,-2e-06,0,-2e-06,-4e-06,0,0,-4e-06,1e-06,1e-06,-3e-06,1e-06,0,0,1e-06,0,1e-06,-2e-06,1e-06,0,2e-06,1e-06,-1e-06,1e-06,0,0,1e-06,2e-06,1e-06,0,0,-2e-06,0,-1e-06,1e-06,0,0,-3e-06,1e-06,-2e-06,1e-06,1e-06,0,1e-06,1e-06,0,0,4e-06,0,0,-1e-06,-3e-06,2e-06,0,0,1e-06,0,0,-1e-06,0,1e-06,0,-1e-06,-2e-06,-1e-06,-1e-06,-1e-06,0,1e-06
0,0,0,-1e-06,0,0,-5e-06,-2e-06,-1e-06,1e-06,-2e-06,0,2e-06,0,-2e-06,0,-2e-06,-2e-06,1e-06,0,0,-1e-06,-3e-06,-1e-06,-1e-06,0,0,6e-06,0,0,1e-06,0,0,-2e-06,-1e-06,-6e-06,0,3e-06,0,-1e-06,1e-06,0,2e-06,0,5e-06,-1e-06,-1e-06,3e-06,0,-1e-06,-1e-06,-7e-06,-3e-06,-1e-06,2e-06,1e-06,-3e-06,-2e-06,-1e-06,1e-06,1e-06,0,0,0,0,-2e-06,1e-06,-2e-06,0,1e-06,1e-06,0,8e-06,0,1e-06,-2e-06,2e-06,1e-06,-2e-06,2e-06,1e-06,1e-06,0,1e-06,0,-2e-06,0,0,0,6e-06,0,0,0,0,-2e-06,0,2e-06,0,2e-06,-4e-06,0,0,1e-06,0,-1e-06,0,-1e-06,-1e-06,0,0,0,0,-1e-06,0,-3e-06,0,0,-1e-06,0,1e-06,0
0,-1e-06,0,1e-06,2e-06,1e-06,3e-06,0,0,2e-06,1e-06,0,1e-06,0,1e-06,2e-06,2e-06,0,-1e-06,1e-06,1e-06,0,2e-06,1e-06,0,0,0,-5e-06,1e-06,-2e-06,-1e-06,-2e-06,0,4e-06,0,-2e-06,0,0,-1e-06,-1e-06,-2e-06,0,-5e-06,0,-1e-06,1e-06,1e-06,-1e-06,1e-06,1e-06,0,0,0,0,-2e-06,0,1e-06,0,-3e-06,-4e-06,-1e-06,0,1e-06,-1e-06,0,0,-1e-06,0,0,-1e-06,1e-06,-1e-06,-3e-06,0,-1e-06,0,3e-06,-2e-06,1e-06,-2e-06,0,0,0,0,0,0,-1e-06,0,-1e-06,2e-06,0,2e-06,-1e-06,-1e-06,3e-06,-1e-06,0,0,-2e-06,5e-06,0,0,0,1e-06,1e-06,0,0,0,0,1e-06,1e-06,0,1e-06,0,0,-2e-06,1e-06,-1e-06,1e-06,-1e-06,-1e-06
