-0.003434,-0.003444,-0.002595,-0.003263,-0.005111,-0.004294,-0.003034,-0.002713,-0.002931,-0.002989,-0.002739,-0.002603,-0.00276,-0.002654,-0.002249,-0.002524,-0.002828,-0.002299,-0.001429,-0.001249,-0.00115,-0.001923,-0.001923,-0.001466,-0.001291,-0.00176,-0.001693,-0.0016
-0.000328,-0.000616,4.1e-05,0.000415,-0.003894,-0.003427,-0.001557,-0.000544,-0.000642,-0.001557,-0.001956,-0.002293,-0.002281,-0.001323,-7.9e-05,0.001041,-0.001714,-0.001278,-0.000456,-0.00061,-0.00101,-0.001566,-0.001482,-0.001186,-0.000859,-0.001277,-0.000653,-0.000682
-0.000319,-0.000722,-0.00121,-0.000748,-7e-06,-0.000865,-0.000654,-0.000441,-0.00023,-0.000209,-0.000397,-0.000411,-0.000792,-0.000763,-0.000659,-0.000756,-6.8e-05,6.5e-05,-0.000184,3.7e-05,-6.3e-05,-0.000658,-0.000672,-0.000237,-0.000167,-0.00065,-0.000785,-0.000306
0.000203,-0.000157,-0.001087,-0.000761,0.003429,0.002169,0.000602,-0.000134,0.000205,0.001008,0.001179,0.001517,0.001331,0.000212,-0.000839,-0.001829,0.001336,0.001062,1.2e-05,0.000271,0.000589,0.000524,0.000489,0.000685,0.00035,0.000146,-0.000385,0.000171
0.002591,0.002551,0.002278,0.002669,0.003444,0.003157,0.002081,0.001974,0.001917,0.001845,0.001645,0.001884,0.002615,0.00207,0.00157,0.00205,0.001779,0.001356,0.000706,0.000237,0.000377,0.001612,0.00161,0.000905,0.000599,0.001112,0.001292,0.000997
-0.001119,-0.000783,-4.9e-05,-0.000841,-0.002396,-0.001456,-0.000489,-0.000184,-0.000684,-0.001016,-0.001063,-0.000745,-0.000242,-0.000202,7.2e-05,0.000318,-0.001199,-0.000967,-0.000447,-0.000655,-0.000543,0.000155,-6.2e-05,-0.000527,-0.000414,-0.00028,-2.5e-05,-0.000493
-0.00315,-0.002835,-0.001764,-0.002801,-0.004741,-0.003513,-0.00188,-0.002142,-0.002381,-0.002396,-0.002004,-0.002135,-0.002442,-0.00203,-0.001469,-0.002244,-0.002599,-0.002018,-0.000956,-0.000576,-0.000562,-0.001331,-0.001562,-0.001122,-0.000785,-0.001333,-0.001293,-0.001401
0.001823,0.001999,0.001951,0.002454,0.000715,0.000688,0.000867,0.000931,0.001255,0.000972,0.000964,7.2e-05,-0.000322,0.000999,0.001473,0.001731,0.000692,0.000629,0.000921,0.000894,0.000437,-0.000242,-5.5e-05,0.000333,0.000594,0.000728,0.000795,0.000598
0.002154,0.002277,0.001035,0.001648,0.003666,0.002614,0.001144,0.001552,0.002056,0.002054,0.001912,0.001471,0.001085,0.001725,0.001364,0.001855,0.002391,0.001833,0.001026,0.000881,0.000586,0.00037,0.000804,0.000985,0.000888,0.001643,0.001272,0.001251
-0.000985,-0.001152,-0.001853,-0.001985,0.001404,0.00116,-0.000454,-0.000843,-0.00071,-0.000145,0.000158,0.00067,0.000644,-0.000654,-0.001474,-0.001838,0.000569,0.000231,-0.000468,-0.000339,-4.7e-05,-2.2e-05,0.000304,0.000307,-0.000134,0.000156,-0.000263,7.3e-05
0.00012,-0.000297,0.000242,0.000444,-0.000764,9.1e-05,0.000251,-0.000193,-0.000642,-0.000621,-0.000724,-6e-06,0.000685,-0.000543,-0.000501,-0.000104,-0.000756,-0.000715,-0.000275,-0.000331,-0.000155,0.000743,0.000673,-0.000111,-0.000377,-0.000519,3e-06,-3.4e-05
-0.000208,-0.000246,0.000623,0.000482,-0.002183,-0.001605,0.000196,0.000361,-3.1e-05,-0.000378,-0.000953,-0.000543,-0.000312,-0.000259,0.000497,0.000998,-0.001157,-0.000847,4.9e-05,0.000159,0.000135,0.000869,0.000306,-0.00039,-0.000126,-0.000645,-0.000148,-0.000204
-0.002092,-0.001852,-0.001339,-0.001841,-0.00199,-0.00255,-0.001486,-0.00129,-0.001013,-0.00084,-0.000802,-0.001036,-0.001711,-0.00123,-0.00096,-0.001911,-0.001118,-0.000703,-0.000568,-0.000215,-1.7e-05,-0.000817,-0.001274,-0.000653,-0.000274,-0.001078,-0.001455,-0.000969
9e-04,0.00087,0.000492,0.000957,0.001512,0.000274,-0.000497,-1.8e-05,0.000289,0.000489,0.000894,-1.8e-05,-0.000373,0.00054,0.000122,-0.000305,0.000774,0.000758,-8e-06,-0.000292,-0.000272,-0.001233,-0.001043,-9.7e-05,-2.4e-05,4e-06,-0.000278,-4.5e-05
0.002006,0.001827,0.000813,0.001271,0.002721,0.00218,0.001109,0.001694,0.001457,0.001238,0.001359,0.000883,0.001097,0.001712,0.001263,0.002032,0.001737,0.001277,0.000416,-7.9e-05,-0.000287,-0.000149,3e-04,0.000458,0.000237,0.001099,0.001188,0.000868
-0.00118,-0.001232,-0.001388,-0.001842,-0.000326,0.000655,0.000434,-0.000229,-0.000553,-0.000509,-0.00037,0.000154,0.000503,-0.000494,-0.000529,-0.000666,-0.000311,-0.000336,-0.000294,-0.000176,-0.000136,0.000346,0.000525,0.000206,-7.9e-05,0.000169,0.000216,-7e-05
-0.000483,-0.000328,0.000394,0.000223,-0.001664,-0.000381,0.000185,-0.000928,-0.000895,-0.000854,-0.000985,-0.000282,0.000278,-0.000691,-0.000304,-0.000701,-0.001345,-0.000946,4.3e-05,0.000241,0.000269,0.000774,0.000579,-3.2e-05,4e-05,-0.000306,-4.9e-05,-0.000448
0.000803,0.001204,0.00157,0.001597,-0.000613,-0.000572,0.00016,0.00035,0.000809,0.000298,-0.000361,-9.9e-05,6.1e-05,0.000609,0.001026,0.001529,-7.3e-05,-4.1e-05,0.000556,0.000559,0.000423,0.000725,0.000365,-4.8e-05,0.000358,0.000293,0.000354,2.1e-05
-0.001028,-0.000697,-0.000848,-0.001217,0.000152,-0.000849,-0.001067,-0.000325,0.000155,0.000104,9.3e-05,-0.000222,-0.000963,-0.000378,-0.000478,-0.000527,0.000527,0.000372,-0.000172,-7e-06,-3e-06,-0.000735,-0.000733,-0.000169,-3e-06,5.4e-05,-0.000528,-3.5e-05
