-2e-05,0.000111,0.000148,0.000129,9e-05,-4e-06,1e-05,6.1e-05,0.000116,8.6e-05,7.6e-05,7.2e-05,5e-05,3.6e-05,6.1e-05,9.7e-05,0.000124,5.7e-05,8e-05,6.3e-05,0.000144,0.000154,0.00015,0.000115,2.7e-05,2.9e-05,2e-05,0.000229,3.6e-05,4.1e-05,0.00015,4.7e-05,-0.00011,-0.000164,-0.000138,-0.000112,-0.000207,-5.3e-05,0.000283,0.000369,0.000169,9.6e-05,-4.6e-05,0.000137,0.000162,0.000241,6.9e-05,0.000122,4.9e-05,1.4e-05,7.5e-05,-1.5e-05,0.000125,0.000194,9.6e-05,-7.9e-05,8e-05,8.4e-05,0.000321,0.000225,9.7e-05,-3.1e-05,0.000202,0.00011,0.000136,6.8e-05,-9e-06,-5.7e-05,-2.9e-05,0.000131,0.000207,5.9e-05,-2.4e-05,6.1e-05,7.1e-05,-2.1e-05,6.7e-05,5.7e-05,0.000139,0.000206,4e-06,-6.3e-05,6.7e-05,0.000171,3.3e-05,6.1e-05,0.000241,5e-05,4.2e-05,2.5e-05,6.8e-05,1.3e-05,3.3e-05,6e-06,2.6e-05,4e-05,4.5e-05,6e-05,2.1e-05,-8e-06,-0.000201,-1.5e-05,-0.000173,4.7e-05,-0.000115,-0.000164,-0.000113,-9.7e-05,-0.000145,-0.000161,-0.000148,-3.6e-05,5.1e-05,2e-06,6e-05,-8.8e-05,-0.000194,-0.000142,-3.6e-05,-7e-05,-7.6e-05
1.2e-05,6e-06,8.9e-05,-0.000138,-3e-05,0,-1.5e-05,-1.5e-05,-0.000116,-8.1e-05,-2.7e-05,-7.9e-05,-3.3e-05,-3.1e-05,-7.4e-05,-0.000141,-0.000192,-0.000141,-7e-05,-5.6e-05,-7.7e-05,-2.4e-05,-0.000111,-6e-05,-4.4e-05,1e-06,-5.8e-05,-0.000177,-0.000325,-0.000156,-0.000236,-6.7e-05,9.1e-05,0.000206,3.9e-05,3.6e-05,5.4e-05,7.6e-05,-0.000102,-0.000309,-0.000415,-0.000432,-0.000442,-0.000244,-0.00021,-0.000334,-0.00034,-0.000278,-0.00015,-0.000116,-0.000101,-7e-05,-0.000117,-0.000169,1.1e-05,-8.3e-05,-0.000211,-0.000222,-0.00034,-0.000222,-3e-06,-1.2e-05,-0.000214,-0.000473,-0.000274,-0.000138,-0.000289,-0.000113,8e-06,-4.2e-05,-0.000305,-0.000158,-9e-05,-9.2e-05,-0.000207,-0.000162,-0.00015,-0.000126,-0.000109,-0.000175,1.5e-05,4.7e-05,-0.000122,-6.9e-05,-0.000224,-0.000251,-6.2e-05,7e-06,-1.4e-05,-8.8e-05,-7.9e-05,-4e-06,-4e-05,7.7e-05,-9.4e-05,5.2e-05,-6.7e-05,-0.000176,-5.5e-05,-0.000108,5e-05,4.3e-05,-8.1e-05,0.000193,0.000111,0.000124,0.000131,-3.2e-05,-0.000139,-6.8e-05,-7.9e-05,-4.2e-05,-0.000203,-6.6e-05,-8.2e-05,-3.3e-05,2.8e-05,1.3e-05,-0.000118,7.1e-05,1.6e-05
2e-06,-0.000148,3.7e-05,0,-1e-06,9e-06,1.7e-05,-0.000137,-0.000198,-0.000151,-4.1e-05,-5.6e-05,-9.4e-05,-4.9e-05,-7e-05,-0.000152,-0.000121,-8.4e-05,-7e-06,1.2e-05,-5e-06,-9.3e-05,-0.000156,-0.000117,-5.6e-05,9.5e-05,-9e-06,-0.000129,-0.00011,-0.000195,-0.000263,-0.00029,-0.000174,-0.00012,-0.000129,6.8e-05,4.3e-05,-8e-05,-0.00043,-0.000507,-0.00027,-0.000186,-2.2e-05,-0.000236,-0.000475,-0.000363,-0.000171,-0.000197,-0.000216,-0.000225,-0.000168,-0.000264,-0.000149,-0.000222,-0.000292,-0.000215,-0.000164,-0.000126,-0.000271,-0.000396,-0.000262,-0.000109,-0.000154,-0.000172,-0.000238,-0.000364,-0.000119,-2.2e-05,0.000135,-0.000114,-0.000113,-0.000198,-0.000138,-6.5e-05,-7e-06,-5.7e-05,-9.6e-05,-1.6e-05,-5.4e-05,-0.000263,-0.000205,-0.000107,-0.000136,-0.000289,-0.000168,-5.2e-05,-0.000218,-0.000203,-9.6e-05,-3.9e-05,-0.000122,-0.000153,-0.00025,-0.000216,-4.5e-05,-8.6e-05,-0.00012,-3.5e-05,-7.8e-05,-7.4e-05,-0.00014,-4.5e-05,-7e-05,-0.000267,-0.000278,-0.000167,-0.000132,0.000197,2.9e-05,1.8e-05,6.9e-05,-1.3e-05,-0.000263,-0.000133,2.7e-05,-7.4e-05,-0.000147,-0.000159,-0.000133,-0.000217,-0.000174
-3.2e-05,-5e-06,1.8e-05,2.8e-05,1e-05,-1.2e-05,0.000104,2e-06,-7e-06,-0.000108,-9.6e-05,2.6e-05,-5.9e-05,-1.2e-05,1.7e-05,-5.9e-05,5.2e-05,5e-06,1.1e-05,5e-06,-6e-05,-7.3e-05,4.6e-05,0.000116,-9e-06,-5.7e-05,2.8e-05,1e-05,0.000216,0.00029,2.4e-05,0.00013,4.2e-05,0.000164,0.000161,1e-06,9e-06,2.7e-05,0.00013,4.8e-05,0.000164,0.000242,0.000242,4.2e-05,0.000161,0.000103,9.7e-05,0.000117,0.000269,0.000152,9.9e-05,3.3e-05,4.3e-05,3.8e-05,0.000216,0.000233,4.6e-05,5.3e-05,0.000103,-0.000215,-1.2e-05,2.2e-05,4.7e-05,0.000169,7.5e-05,0.00012,2.2e-05,-6.8e-05,-7.6e-05,-0.000269,4.3e-05,5.7e-05,4.6e-05,3e-05,1.2e-05,8e-06,-2.1e-05,-6.2e-05,-2.5e-05,7e-06,1.2e-05,-2e-05,-1e-06,-1.4e-05,6.6e-05,-2.3e-05,-0.000129,-9.4e-05,-7e-06,-0.000151,-4.7e-05,-8.6e-05,7.9e-05,0.000129,0.000108,-2.1e-05,2.3e-05,3.9e-05,4e-06,4.6e-05,2.2e-05,0.000106,2.4e-05,-1e-06,-0.000202,1.6e-05,6.9e-05,-5.2e-05,0.00017,6.5e-05,-2.5e-05,-9.4e-05,0.000119,-7.3e-05,-5.9e-05,3.4e-05,0.000145,0.000108,0.000116,1e-05,0.000108
7.8e-05,6.2e-05,4.9e-05,7e-06,2.5e-05,-1.6e-05,-3.2e-05,-7.5e-05,3.9e-05,4.1e-05,-1.1e-05,9e-05,-3.3e-05,2.3e-05,7.5e-05,7.1e-05,0.000118,5.1e-05,9.9e-05,0.000149,-1.3e-05,6.6e-05,1.5e-05,3.4e-05,5.8e-05,8.5e-05,1.3e-05,3.1e-05,-4e-06,-1.5e-05,0.000129,1.6e-05,-4.1e-05,2.7e-05,-7.9e-05,2.5e-05,5.8e-05,-1e-06,0.000102,0.000324,0.000293,7.2e-05,0.000117,0.000187,0.000333,0.000282,0.000294,0.000208,1.4e-05,0.000116,6.4e-05,0.000108,0.000174,0.000162,0.000112,8.9e-05,0.000185,0.000257,0.000159,0.000305,-4e-06,3.3e-05,0.000163,0.00018,0.000204,0.000178,0.000218,0.000176,9.6e-05,9.2e-05,5.2e-05,0.000132,0.000107,1.2e-05,4.6e-05,1e-04,0.000106,5.9e-05,3.5e-05,9.2e-05,-1e-06,2e-05,-2.3e-05,8.4e-05,0.000124,9.8e-05,8.9e-05,8.2e-05,9.1e-05,8.9e-05,0.000153,7.2e-05,4.1e-05,4.6e-05,2.5e-05,-1.1e-05,7e-06,5.8e-05,0.000117,3.5e-05,7.8e-05,-7e-05,8.4e-05,-9e-06,-0.000144,-0.000134,-0.000127,-0.000124,-0.00018,-0.000196,-2.1e-05,6.8e-05,0.000125,2.6e-05,-1e-05,0.000105,-4e-05,-5e-05,5.1e-05,0.000136,-3.7e-05
-3.5e-05,2e-06,4.2e-05,4.2e-05,8.6e-05,3.5e-05,1.9e-05,1.8e-05,5.7e-05,9.4e-05,2.3e-05,-5e-05,4.6e-05,3.5e-05,7e-06,3.7e-05,-1.5e-05,0.000105,1.1e-05,-1e-05,1.8e-05,1.9e-05,8.7e-05,-4e-05,1.5e-05,3.4e-05,-4.4e-05,-8.1e-05,-8.1e-05,-7.6e-05,-2.3e-05,6.7e-05,-1.9e-05,-2.3e-05,3.9e-05,-7.2e-05,-0.000101,-1.4e-05,-3.8e-05,-0.000127,-0.000157,-0.000189,-0.000274,-0.000157,-9e-06,-3.6e-05,-0.000134,-7.7e-05,-0.000114,-7.5e-05,1.5e-05,3.1e-05,-9.9e-05,-7e-06,-0.000201,-1e-04,-0.000165,-0.000147,-0.000173,3.7e-05,-9.1e-05,-0.000171,-8.7e-05,-0.000143,-1e-05,-3.5e-05,-3.2e-05,-8.5e-05,-4.9e-05,-7.4e-05,-0.00011,-1.1e-05,-4.5e-05,-8e-05,-3.6e-05,-1.7e-05,-6.1e-05,7.9e-05,-0.000105,7e-05,0.000117,4.6e-05,5.5e-05,0.000115,6.1e-05,0,2.5e-05,8e-05,-4.4e-05,4.6e-05,0.000103,5.3e-05,9.9e-05,2e-05,-7.1e-05,-0.00011,1.6e-05,-9.3e-05,-3.7e-05,-6.8e-05,2.9e-05,1.7e-05,-5.9e-05,0.000113,0.000182,0.000161,-1e-06,-4.2e-05,3e-05,1.8e-05,2.9e-05,-2.1e-05,2.5e-05,6.7e-05,5e-05,-4.9e-05,-9.8e-05,0.000122,-1.7e-05,7.4e-05,7.3e-05
-2e-06,1e-06,-5.1e-05,-2.1e-05,-4.7e-05,3e-06,-3e-06,-4.5e-05,2.4e-05,4e-06,5.7e-05,-3e-06,-1.1e-05,-3.3e-05,-8e-06,-2e-05,-3.6e-05,-7.4e-05,-7.4e-05,-5.1e-05,-9e-06,-3.1e-05,1.8e-05,-8.4e-05,4e-05,-4e-06,-1.3e-05,4.7e-05,-9.1e-05,2e-05,-8.5e-05,-3e-06,-2.3e-05,-3.2e-05,-5.8e-05,-6.6e-05,-6e-06,-7e-06,-4.2e-05,-4.7e-05,-0.000191,-3.5e-05,1e-05,-7.8e-05,-0.000107,-0.000106,-8.7e-05,-4e-05,-6.5e-05,-1.2e-05,-9.5e-05,-2.4e-05,-3.6e-05,-9e-06,-8.3e-05,-9.1e-05,4e-06,-3.5e-05,-6.6e-05,3.2e-05,2.6e-05,4.4e-05,1e-06,-2.4e-05,-0.000158,-0.000137,-9.1e-05,2.1e-05,5e-06,-2.6e-05,-7.5e-05,-8.3e-05,-6.5e-05,-1.4e-05,-8.4e-05,-7.2e-05,-7.9e-05,-5.2e-05,-2.9e-05,-3.3e-05,5.5e-05,-2.5e-05,-3.4e-05,-4.7e-05,-3.6e-05,-0.000111,-4.6e-05,0.000101,-2.8e-05,-2e-06,-4.4e-05,-9.9e-05,-7.4e-05,-0.000132,-6.7e-05,1.3e-05,9e-06,-6.6e-05,-7.5e-05,-2.1e-05,-5e-05,-5.8e-05,1.4e-05,-0.000108,-1.2e-05,5e-06,-6.2e-05,8.1e-05,9e-06,9.9e-05,-3.4e-05,2.2e-05,-2e-05,-1.3e-05,6.5e-05,3e-06,-9e-06,-6.2e-05,-8.5e-05,-6.5e-05,-5.6e-05
-7.5e-05,-4.8e-05,-6e-05,-2.2e-05,-6.4e-05,-9e-06,-2.7e-05,1e-05,-2.3e-05,-2.7e-05,3.8e-05,-2.4e-05,-8e-06,3.1e-05,1.1e-05,-1.9e-05,-2e-05,-7.3e-05,-2.3e-05,-1.6e-05,-2.9e-05,-1.8e-05,-7.3e-05,3e-06,-7.9e-05,-4.1e-05,-3.7e-05,4.3e-05,6.2e-05,0.000135,1.7e-05,-7.4e-05,9.3e-05,3.8e-05,4.5e-05,2.8e-05,4.3e-05,-7e-06,-5e-05,-6.4e-05,-4.7e-05,4.2e-05,4.7e-05,5.7e-05,-0.000124,-9.9e-05,-6.3e-05,5e-06,0.000122,3.2e-05,-1.1e-05,-9.5e-05,-5.8e-05,-4.5e-05,-3.2e-05,3e-06,-2.7e-05,-4.2e-05,-5.5e-05,-1e-04,-2.8e-05,-7.3e-05,-0.000129,1.4e-05,-2.4e-05,-6e-06,-8.4e-05,2e-06,5e-06,2.8e-05,-6e-05,1.2e-05,-1.1e-05,1.1e-05,-8e-06,2.6e-05,3.1e-05,-4.2e-05,-1e-05,0,-5.1e-05,-2.4e-05,-2.9e-05,-3.2e-05,-8e-05,-1e-05,-4e-06,-5.1e-05,-4.3e-05,-2.2e-05,3.4e-05,-3.8e-05,6e-06,-2.7e-05,-2e-05,4.1e-05,2.1e-05,-8e-06,-1.4e-05,-2.2e-05,-1.3e-05,9e-05,-1.8e-05,-4.8e-05,-1.3e-05,-2.9e-05,6.5e-05,2.1e-05,-6.8e-05,-5.9e-05,-5e-06,-3e-05,-2.9e-05,-6.4e-05,-1.5e-05,-1.3e-05,-4.4e-05,-4.4e-05,5.6e-05,-2.1e-05,-2.6e-05
2e-06,2.3e-05,-7.1e-05,-1.4e-05,1.9e-05,-5e-06,1.4e-05,4.4e-05,-1.7e-05,-1.8e-05,-5.8e-05,-3.6e-05,-1.1e-05,-2.6e-05,3.3e-05,2e-06,-3.7e-05,-2e-06,-3e-06,1.1e-05,-2.9e-05,-5.2e-05,-3.2e-05,1.4e-05,-2e-05,-5e-06,-2.4e-05,3.6e-05,1e-05,-2.1e-05,5.7e-05,4.6e-05,3.6e-05,2.2e-05,-3.1e-05,2.2e-05,-1.1e-05,4.4e-05,1.2e-05,5.1e-05,0.000115,0.000102,7.7e-05,1e-04,0.000118,0.00014,9.2e-05,0.000126,3.2e-05,5.4e-05,6.2e-05,5.8e-05,3.8e-05,6.8e-05,0.000115,6.3e-05,9.6e-05,8.1e-05,0.00011,7.1e-05,0.000137,7e-06,6.2e-05,6e-05,0.000111,5.9e-05,7.5e-05,2.3e-05,-3e-05,-1.2e-05,5.1e-05,1.6e-05,7.8e-05,2.1e-05,2.7e-05,1e-06,9e-06,-1.1e-05,7e-06,2e-05,-4e-05,-4.5e-05,-6e-06,-5e-06,2.1e-05,8.7e-05,-2e-06,-4.4e-05,2.7e-05,1.1e-05,-6.4e-05,-1.5e-05,-3.3e-05,-4e-06,3.3e-05,-3e-06,2.7e-05,4.1e-05,9e-06,3.3e-05,-1e-06,-3.1e-05,5e-06,6e-05,-3.4e-05,-9.7e-05,-4.6e-05,-4e-06,2e-05,-1.6e-05,-2.9e-05,-4e-06,-3.8e-05,-2.2e-05,0,-3e-05,5.5e-05,7e-05,4e-06,3.5e-05,1.7e-05
2e-06,-1e-05,3.2e-05,1.9e-05,-1.8e-05,-7e-06,-6e-06,3e-06,2.1e-05,8e-06,-2.8e-05,2.4e-05,2.8e-05,2.2e-05,9e-06,1.8e-05,4.8e-05,3.9e-05,1.5e-05,1.3e-05,-1.1e-05,-3.4e-05,-1.6e-05,2e-05,3e-06,1.5e-05,4.3e-05,2e-06,-1.5e-05,-4.1e-05,1.1e-05,-2.4e-05,4e-05,-2e-05,-5.9e-05,-2e-05,2.9e-05,-2.6e-05,-1.3e-05,-1.6e-05,0.000105,-5.9e-05,-6.6e-05,-9e-05,-5e-05,4.6e-05,2.3e-05,4e-06,-3.7e-05,-5.2e-05,2e-06,1e-05,3.4e-05,-3e-06,3e-06,-7.4e-05,-8.4e-05,-3.9e-05,-2.8e-05,2.6e-05,-2.6e-05,-4.4e-05,-5.5e-05,-7e-06,2e-06,-3e-06,3.7e-05,-1.3e-05,4.7e-05,1.1e-05,6.4e-05,-2.6e-05,2.1e-05,4e-06,-4e-06,9e-06,3.6e-05,2e-05,2.8e-05,-1.4e-05,2.7e-05,1.4e-05,6e-06,-1.2e-05,-1.5e-05,6e-06,3.4e-05,5e-06,4.2e-05,3.8e-05,5e-06,7.1e-05,3e-05,4e-05,-8e-06,-2.9e-05,-1.4e-05,-1e-06,-8e-06,1.7e-05,1.5e-05,-1.6e-05,-3.6e-05,-1.8e-05,4.7e-05,-4.9e-05,5.1e-05,1.5e-05,2.4e-05,0.000112,7.4e-05,5e-05,-4e-06,1e-06,-6.6e-05,2.4e-05,-1.3e-05,4.5e-05,9e-06,1.1e-05,-5e-06
-5e-06,-3e-06,-1.3e-05,1e-05,-3.3e-05,-1.4e-05,-2.4e-05,-6e-06,-3.7e-05,0,-1.8e-05,1.8e-05,2.4e-05,2e-05,1e-05,4e-06,-2.8e-05,-3e-06,2.6e-05,-1e-05,2.1e-05,0,4e-06,2e-05,1e-06,9e-06,-3.5e-05,-9e-06,5.2e-05,-4e-06,-5.6e-05,-6e-06,-3.2e-05,-5e-06,2.2e-05,-2e-05,-1.3e-05,-3e-05,2e-05,2e-06,-5.4e-05,-8.8e-05,1.2e-05,-3.1e-05,2.3e-05,7e-06,-1.3e-05,-6.2e-05,-2.8e-05,-2.4e-05,-5e-06,1e-06,3e-06,-4e-06,-1.4e-05,-1.5e-05,-2e-05,-1.2e-05,-6.3e-05,-2.9e-05,-6.8e-05,5.8e-05,-1.9e-05,-1.1e-05,-3.9e-05,1.8e-05,-2.8e-05,-8e-06,-3.5e-05,-1.7e-05,1.3e-05,4e-06,-2.6e-05,-4.4e-05,-1.1e-05,-8e-06,-1.5e-05,0,-1e-05,-3.1e-05,-4e-06,3.5e-05,3e-06,-1.7e-05,3.7e-05,-1.5e-05,-6e-06,-4e-06,-3e-06,-1.2e-05,1.4e-05,3e-06,9e-06,-1.5e-05,-2e-05,2.2e-05,-3e-05,1e-06,-1.5e-05,-3.6e-05,-2.7e-05,-2.5e-05,0,3.1e-05,-1.4e-05,0,-6.9e-05,2e-05,2.2e-05,1.7e-05,-1.6e-05,-2.2e-05,8e-06,1.9e-05,-3.4e-05,2.6e-05,-2.4e-05,-7e-06,1.5e-05,-1.3e-05,-6e-06
-2e-06,-1.5e-05,1.9e-05,-2e-06,-6e-06,1.8e-05,-4e-06,2.3e-05,-1.8e-05,6e-06,1.2e-05,1.5e-05,-4e-06,-2e-06,-3.9e-05,-8e-06,1.5e-05,-3e-05,-2.8e-05,-1.5e-05,-9e-06,-3e-06,1e-06,-3.2e-05,-4.9e-05,9e-06,4e-06,-2e-06,-9e-06,1.8e-05,5.9e-05,2e-06,-2.9e-05,-1e-06,-3e-06,-9e-06,1.4e-05,1.4e-05,-1.5e-05,-2.4e-05,1.9e-05,-1e-06,3e-06,1.6e-05,-1.1e-05,-6.5e-05,-1.6e-05,-3.7e-05,-5.4e-05,2e-05,0,-3e-05,-2.1e-05,-3.4e-05,-5.6e-05,-3e-06,-4.1e-05,0,-1.1e-05,-4.9e-05,-3.3e-05,4.3e-05,2.2e-05,-2.8e-05,1.2e-05,-5.9e-05,-1.4e-05,5e-06,3.6e-05,1.4e-05,3.5e-05,-3.5e-05,-1.6e-05,1.2e-05,1e-05,-1e-05,-1e-05,-4.7e-05,-5.1e-05,-3.2e-05,-2e-06,2.1e-05,-7e-06,1.3e-05,-3.6e-05,-3.6e-05,-2.1e-05,-1.2e-05,-1.4e-05,-2.1e-05,-1.7e-05,1.6e-05,-3.3e-05,1e-05,-9e-06,3.1e-05,3e-05,-8e-06,-1e-06,-1.5e-05,-3e-06,-5e-06,0,-7e-06,1.1e-05,3.4e-05,1.3e-05,-1.7e-05,-2.3e-05,-2.1e-05,4e-06,-2.9e-05,-2.1e-05,-1.5e-05,2e-05,-4e-06,2.3e-05,-2.1e-05,-4e-05,-1.8e-05,-4e-06
-9e-06,-1.3e-05,-1.9e-05,-1e-05,-5e-06,1e-06,-1e-06,-7e-06,3e-06,3e-06,2.1e-05,-7e-06,2e-06,-1.5e-05,2e-06,1e-05,-1e-05,7e-06,-2.2e-05,4e-06,-1.7e-05,-1e-06,-2.9e-05,-2.1e-05,-2.1e-05,-1.4e-05,-1e-05,0,3e-06,1.6e-05,2.6e-05,-1.3e-05,6.1e-05,-1.6e-05,6e-06,2e-06,-5e-06,-3.4e-05,1.7e-05,-6e-06,-1.1e-05,3e-05,1e-06,3e-05,3.5e-05,2.2e-05,0,6e-06,3.6e-05,6e-06,1.4e-05,4e-06,-1.8e-05,2e-06,-1.1e-05,4.8e-05,2.4e-05,1.1e-05,1.6e-05,1e-06,2.9e-05,1e-06,9e-06,1.4e-05,1.4e-05,2.2e-05,2.6e-05,0,5e-06,-2e-06,-1.7e-05,-6e-06,-2e-06,1.6e-05,1.5e-05,2e-06,5e-06,2.3e-05,2e-06,3e-06,-2.3e-05,-1.4e-05,-1.5e-05,-1.2e-05,1.5e-05,-1.9e-05,-5e-06,-2.7e-05,-4.1e-05,-1.9e-05,-4e-06,3e-06,-2e-06,-2e-05,6e-06,2.2e-05,-1.2e-05,-1.2e-05,3e-06,2.5e-05,7e-06,3.3e-05,2.1e-05,1.5e-05,-6e-06,8e-06,-3.1e-05,1.1e-05,-4e-06,-2e-06,-2.3e-05,2.4e-05,2.3e-05,8e-06,3.4e-05,-8e-06,-1.5e-05,-4e-06,-2e-06,1.2e-05,3e-06
-3e-06,0,-1e-06,-1e-06,2e-06,-1.1e-05,-7e-06,1e-05,3e-06,5e-06,0,-1.6e-05,7e-06,-4e-06,-6e-06,1e-05,9e-06,-4e-06,6e-06,0,1e-06,3e-06,-1e-06,-3e-06,5e-06,-2e-05,-1.1e-05,-7e-06,-1.7e-05,-1.2e-05,-1.5e-05,9e-06,1.3e-05,-2.2e-05,-5e-06,-1.5e-05,1.1e-05,0,-9e-06,-3e-06,-5e-06,4.6e-05,-1e-05,-1.2e-05,3.1e-05,-1.8e-05,-1e-06,7e-06,-1.2e-05,-1e-06,-5e-06,4e-06,1.5e-05,-1e-06,3e-06,1e-06,-2.4e-05,-1.2e-05,-3e-06,2e-06,1.3e-05,-2.7e-05,3e-06,5e-06,-1.1e-05,9e-06,1e-06,3e-06,-9e-06,-7e-06,-9e-06,1.3e-05,-6e-06,6e-06,-1e-05,7e-06,-5e-06,6e-06,1.3e-05,-1.6e-05,1.8e-05,-1e-06,-3e-06,-6e-06,-2e-06,8e-06,1.4e-05,9e-06,-2.1e-05,5e-06,1.2e-05,-5e-06,-4e-06,-1.7e-05,8e-06,-1e-06,-1e-05,-1.2e-05,8e-06,7e-06,1e-05,1.2e-05,-1.5e-05,3e-06,-1.1e-05,3e-06,4.4e-05,-7e-06,-6e-06,-1.9e-05,1.6e-05,-1.9e-05,-7e-06,7e-06,-2.1e-05,-8e-06,2e-06,-2e-06,8e-06,2.2e-05,-1e-06
0,1e-06,-2e-06,-2e-06,-9e-06,4e-06,-1.5e-05,2e-06,-3e-06,4e-06,-1.9e-05,-1e-05,1e-06,5e-06,8e-06,8e-06,-8e-06,-4e-06,2e-06,1e-06,0,2e-06,-3e-06,2e-06,1.5e-05,-5e-06,3e-06,-8e-06,-5e-06,-2.5e-05,-4e-06,-1e-05,2e-06,-1.7e-05,-6e-06,9e-06,-2.5e-05,-6e-06,-1e-06,-5e-06,-5e-06,-1.9e-05,-1.1e-05,9e-06,-3.7e-05,-5e-06,-9e-06,1e-05,-9e-06,8e-06,-6e-06,1.5e-05,-6e-06,2e-06,8e-06,1e-06,-3e-06,-3e-06,-1e-06,-2.7e-05,-1.1e-05,-4.7e-05,1.7e-05,1e-06,1e-06,-8e-06,-2e-06,-1.1e-05,-2.7e-05,-4e-06,3e-06,5e-06,-3e-06,-8e-06,-5e-06,-4e-06,0,6e-06,3e-06,7e-06,-2e-06,1e-06,-4e-06,4e-06,0,1.1e-05,-6e-06,1.1e-05,1.3e-05,9e-06,9e-06,-8e-06,5e-06,2e-06,7e-06,-6e-06,-1e-06,1e-06,9e-06,-2e-06,6e-06,-4e-06,1e-06,-1.3e-05,1.1e-05,1e-06,4.9e-05,6e-06,-5e-06,7e-06,-5e-06,-3e-06,1.5e-05,-6e-06,-1.8e-05,-2.4e-05,6e-06,-8e-06,-1.5e-05,-1.8e-05,-2e-06
0,2e-06,-1.6e-05,2e-06,8e-06,0,1e-06,8e-06,3e-06,3e-06,1.2e-05,0,-5e-06,-9e-06,1e-05,4e-06,3e-06,-5e-06,-5e-06,7e-06,2e-06,-2e-06,-1e-05,1.1e-05,-5e-06,2e-06,0,-1.2e-05,-3e-06,1e-06,2e-05,7e-06,-4e-06,1.6e-05,-3e-06,8e-06,2.2e-05,-1.2e-05,-1e-06,-1e-06,2.8e-05,-1e-06,8e-06,2e-06,6e-06,1.6e-05,-5e-06,-5e-06,-2e-06,-1.4e-05,4e-06,-1.4e-05,2e-06,4e-06,9e-06,-8e-06,5e-06,-7e-06,1e-06,4e-06,-7e-06,4e-06,1.5e-05,1.3e-05,9e-06,3e-06,4e-06,-1.2e-05,1.2e-05,-1e-06,2e-06,1.2e-05,1.4e-05,-5e-06,-1e-06,1e-06,3e-06,-4e-06,5e-06,4e-06,-2e-06,-4e-06,8e-06,-2e-06,-5e-06,1.1e-05,6e-06,-3e-06,2e-05,0,-2e-06,6e-06,4e-06,0,-1e-06,5e-06,-5e-06,-2e-06,-4e-06,1e-05,3e-06,-1.2e-05,2e-06,7e-06,-1.5e-05,8e-06,0,3e-06,3e-06,9e-06,-1.2e-05,1e-05,-1e-06,-3e-06,0,7e-06,-3e-06,-1.2e-05,-1.6e-05,7e-06,-1e-06
-4e-06,1e-06,0,-3e-06,3e-06,3e-06,-1e-06,2e-06,3e-06,-2e-06,6e-06,2e-06,5e-06,-1e-06,4e-06,2e-06,-2e-06,5e-06,7e-06,1e-06,-5e-06,1e-06,3e-06,1e-05,2e-06,-7e-06,-5e-06,-1e-06,2e-06,-1.1e-05,-6e-06,0,-1e-05,1.4e-05,-2e-06,-6e-06,-1e-05,9e-06,-6e-06,0,1e-05,-1.5e-05,-1e-06,-5e-06,2e-06,1e-06,4e-06,2e-06,-4e-06,-5e-06,0,6e-06,5e-06,-1e-06,-1e-06,-2.3e-05,1e-06,-4e-06,-1e-06,-5e-06,2e-06,1.7e-05,4e-06,1.1e-05,-5e-06,7e-06,1e-06,9e-06,7e-06,8e-06,1.8e-05,1e-05,6e-06,-7e-06,-1e-06,4e-06,-1e-06,3e-06,-5e-06,-6e-06,-4e-06,-4e-06,9e-06,2e-06,1e-06,-7e-06,3e-06,0,6e-06,0,2e-06,1e-05,-1e-06,4e-06,-5e-06,1.6e-05,0,6e-06,-2e-06,-7e-06,3e-06,6e-06,-7e-06,-1e-06,6e-06,0,-1.4e-05,7e-06,-4e-06,-1.8e-05,-2e-06,1e-06,-8e-06,-1e-06,2.3e-05,1.1e-05,-6e-06,5e-06,3e-06,6e-06,2e-06
5e-06,2e-06,-2e-06,3e-06,-8e-06,-3e-06,6e-06,1e-06,4e-06,2e-06,1e-06,7e-06,1e-06,-2e-06,-3e-06,2e-06,1e-06,7e-06,4e-06,-4e-06,-1e-06,-2e-06,-3e-06,-2e-06,6e-06,-3e-06,1e-06,-5e-06,9e-06,1e-05,-4e-06,-4e-06,-3e-06,-2e-06,1e-06,-4e-06,4e-06,-4e-06,1.3e-05,2e-06,3e-06,-7e-06,7e-06,2e-06,-1.1e-05,2e-06,-2e-06,-1.2e-05,5e-06,1e-06,-2e-06,0,-2e-06,-1e-06,-1.1e-05,2e-06,4e-06,-2e-06,-9e-06,-5e-06,-5e-06,9e-06,-7e-06,-1e-06,-7e-06,-5e-06,0,-4e-06,5e-06,-3e-06,8e-06,3e-06,-9e-06,3e-06,4e-06,-1e-06,-4e-06,6e-06,-5e-06,6e-06,0,2e-06,2e-06,-3e-06,-1e-06,-6e-06,-2e-06,9e-06,3e-06,0,0,0,6e-06,2e-06,-8e-06,4e-06,0,-5e-06,-2e-06,-2e-06,-2e-06,-3e-06,7e-06,0,-3e-06,-2e-05,-9e-06,-1e-05,6e-06,5e-06,7e-06,-1e-06,5e-06,1e-06,0,-2e-06,3e-06,1e-06,-1e-05,-1.4e-05,-2e-06
-4e-06,1e-06,7e-06,-1e-06,0,-1e-06,2e-06,3e-06,3e-06,0,-7e-06,5e-06,1e-06,0,0,1e-06,0,-7e-06,-6e-06,-1e-06,1e-06,-3e-06,3e-06,-6e-06,-1e-06,9e-06,-2e-06,0,-4e-06,4e-06,1.3e-05,7e-06,5e-06,2e-06,-5e-06,1e-06,-1e-06,1e-06,-6e-06,-5e-06,-4e-06,1.5e-05,-1e-06,9e-06,6e-06,-3e-06,-1e-06,7e-06,7e-06,1e-06,1e-06,-6e-06,-2e-06,0,-5e-06,5e-06,3e-06,5e-06,3e-06,-1e-06,5e-06,3e-06,2e-06,7e-06,8e-06,-7e-06,-3e-06,-1e-06,-3e-06,-1e-06,-2e-06,-3e-06,-1e-06,4e-06,1e-06,-1e-06,0,-1.1e-05,1e-06,0,6e-06,6e-06,0,2e-06,1e-06,-6e-06,-2e-06,6e-06,-4e-06,-4e-06,-6e-06,6e-06,-2e-06,0,0,-3e-06,-1e-06,-1e-06,-5e-06,1e-06,0,8e-06,-4e-06,0,0,-6e-06,1e-06,-3e-06,-3e-06,-3e-06,-2e-06,-1e-06,-7e-06,-2e-06,-1e-05,4e-06,-3e-06,-8e-06,-2e-06,-1e-06,-2e-06
1e-06,-1e-06,-2e-06,2e-06,0,3e-06,0,-1e-06,-4e-06,1e-06,-4e-06,0,-1e-06,1e-06,0,0,0,1e-06,-1e-06,-1e-06,1e-06,-1e-06,1e-06,-4e-06,-1e-05,5e-06,-3e-06,0,0,-3e-06,-5e-06,-3e-06,1e-06,-4e-06,3e-06,-2e-06,0,3e-06,2e-06,1e-06,1e-06,2e-06,-3e-06,-4e-06,2e-06,-2e-06,2e-06,5e-06,8e-06,-3e-06,4e-06,-2e-06,-3e-06,0,1e-06,4e-06,1e-06,0,1e-06,1e-06,7e-06,-3e-06,-5e-06,-1e-06,2e-06,8e-06,1e-06,4e-06,0,1e-06,2e-06,1e-06,2e-06,2e-06,2e-06,2e-06,-1e-06,-2e-06,-1e-06,2e-06,-3e-06,4e-06,1e-06,0,-2e-06,-1e-06,3e-06,0,-9e-06,-3e-06,-1e-06,1e-06,1e-06,-3e-06,4e-06,-2e-06,1e-06,-6e-06,0,3e-06,0,-1e-06,0,2e-06,0,1e-06,6e-06,3e-06,0,-6e-06,-2e-06,-1e-06,0,0,-4e-06,2e-06,1e-06,0,9e-06,4e-06,0
-3e-06,0,2e-06,-1e-06,-1e-06,-1e-06,0,1e-06,3e-06,0,1e-06,-2e-06,-2e-06,-1e-06,-1e-06,0,2e-06,-1e-06,-1e-06,-2e-06,-3e-06,0,-4e-06,-3e-06,-6e-06,-5e-06,3e-06,-1e-06,-6e-06,4e-06,-4e-06,-1e-06,-8e-06,-6e-06,0,1e-06,-8e-06,-5e-06,3e-06,-1e-06,-1.2e-05,-4e-06,-6e-06,-1e-06,7e-06,3e-06,0,5e-06,-8e-06,2e-06,-4e-06,2e-06,2e-06,0,4e-06,4e-06,-4e-06,0,-1e-06,4e-06,-3e-06,-4e-06,-2e-06,1e-06,-4e-06,-3e-06,4e-06,1e-06,-2e-06,2e-06,-7e-06,-3e-06,0,-2e-06,-3e-06,0,-2e-06,1e-06,1e-06,-1e-06,-4e-06,1e-06,-1e-06,-4e-06,3e-06,2e-06,-1e-06,-5e-06,-4e-06,0,-2e-06,-1e-06,-3e-06,-3e-06,3e-06,1e-06,1e-06,0,3e-06,1e-06,0,-9e-06,-3e-06,0,-2e-06,3e-06,7e-06,1e-06,-3e-06,0,-5e-06,3e-06,-1e-06,-1e-06,3e-06,-7e-06,1e-06,4e-06,-1e-06,-1e-06,0
1e-06,1e-06,-2e-06,0,-3e-06,0,-4e-06,0,-2e-06,-1e-06,7e-06,-4e-06,3e-06,0,0,1e-06,-3e-06,2e-06,-1e-06,1e-06,0,-1e-06,1e-06,4e-06,-1e-06,-3e-06,-4e-06,1e-06,-3e-06,3e-06,1e-06,3e-06,-6e-06,4e-06,0,2e-06,9e-06,5e-06,-2e-06,-1e-06,6e-06,-3e-06,1e-06,1e-06,-6e-06,-2e-06,0,-1e-06,-1e-06,0,0,-1e-06,-1e-06,1e-06,5e-06,1e-06,0,0,-2e-06,-2e-06,-5e-06,-4e-06,3e-06,-1e-06,2e-06,-2e-06,-2e-06,-3e-06,-4e-06,-4e-06,0,-3e-06,4e-06,-2e-06,0,-1e-06,1e-06,4e-06,4e-06,-1e-06,4e-06,-3e-06,0,2e-06,0,4e-06,0,0,7e-06,1e-06,-5e-06,-3e-06,2e-06,-1e-06,1e-06,4e-06,0,-2e-06,1e-06,0,0,1e-06,2e-06,-3e-06,3e-06,1e-06,-5e-06,0,0,-3e-06,3e-06,-1e-06,1e-06,1e-06,6e-06,0,-1e-06,2e-06,3e-06,-4e-06,-1e-06
-1e-06,-2e-06,0,1e-06,-1e-06,1e-06,1e-06,0,-3e-06,1e-06,-2e-06,-2e-06,-2e-06,1e-06,1e-06,0,3e-06,-5e-06,2e-06,1e-06,-1e-06,0,-3e-06,5e-06,-1e-06,2e-06,1e-06,1e-06,0,3e-06,4e-06,-3e-06,-8e-06,3e-06,0,0,-5e-06,-3e-06,1e-06,0,4e-06,-4e-06,0,0,4e-06,1e-06,0,-1e-06,-1e-06,1e-06,2e-06,-1e-06,2e-06,0,1e-06,1e-06,-3e-06,0,-1e-06,2e-06,0,-4e-06,2e-06,-1e-06,3e-06,6e-06,2e-06,6e-06,2e-06,2e-06,2e-06,2e-06,5e-06,0,-1e-06,1e-06,-1e-06,-4e-06,-3e-06,-1e-06,1e-06,-2e-06,1e-06,-1e-06,1e-06,-1e-06,0,2e-06,4e-06,-1e-06,4e-06,0,-1e-06,1e-06,-1e-06,2e-06,3e-06,2e-06,1e-06,-2e-06,2e-06,0,-2e-06,2e-06,-2e-06,-2e-06,-2e-06,-1e-06,1e-06,2e-06,0,-1e-06,1e-06,-1e-06,0,1e-06,0,0,1e-06,3e-06,0
1e-06,0,-4e-06,0,4e-06,-1e-06,-1e-06,-2e-06,1e-06,-1e-06,-4e-06,0,-1e-06,3e-06,-2e-06,0,-3e-06,1e-06,2e-06,0,1e-06,1e-06,-1e-06,1e-06,-4e-06,0,0,1e-06,1e-06,2e-06,-6e-06,3e-06,2e-06,-2e-06,-2e-06,-2e-06,5e-06,-2e-06,-1e-06,0,5e-06,3e-06,5e-06,-1e-06,1e-06,2e-06,1e-06,-3e-06,-4e-06,0,-2e-06,0,-1e-06,-1e-06,-4e-06,-2e-06,1e-06,-1e-06,0,0,2e-06,-2e-06,3e-06,-2e-06,-3e-06,-4e-06,1e-06,-1e-06,1e-06,1e-06,1e-06,-1e-06,0,2e-06,1e-06,0,-1e-06,0,-2e-06,-3e-06,-2e-06,1e-06,0,-1e-06,-1e-06,-3e-06,0,-5e-06,2e-06,-1e-06,1e-06,2e-06,-1e-06,2e-06,-2e-06,-4e-06,-3e-06,-2e-06,1e-06,1e-06,1e-06,6e-06,2e-06,0,0,4e-06,-2e-06,-3e-06,0,7e-06,-3e-06,1e-06,0,-1e-06,-6e-06,-2e-06,-1e-06,2e-06,1e-06,3e-06,0
0,0,0,1e-06,-2e-06,1e-06,0,0,-2e-06,1e-06,0,2e-06,0,-1e-06,-1e-06,-1e-06,2e-06,2e-06,-1e-06,0,-1e-06,-1e-06,0,-1e-06,-2e-06,-2e-06,-2e-06,2e-06,3e-06,0,-1e-06,-2e-06,3e-06,0,0,-1e-06,-2e-06,2e-06,0,-1e-06,-3e-06,4e-06,0,2e-06,-6e-06,-1e-06,-1e-06,0,5e-06,3e-06,0,2e-06,0,0,-3e-06,-1e-06,-2e-06,0,-1e-06,1e-06,1e-06,4e-06,0,0,-1e-06,-1e-06,-1e-06,-2e-06,0,-1e-06,3e-06,1e-06,-4e-06,1e-06,0,0,0,4e-06,1e-06,0,-1e-06,-2e-06,1e-06,1e-06,1e-06,-4e-06,0,-4e-06,-2e-06,0,0,1e-06,1e-06,1e-06,-1e-06,-3e-06,2e-06,0,0,0,1e-06,-3e-06,-3e-06,-1e-06,-1e-06,4e-06,3e-06,1e-06,1e-06,-6e-06,2e-06,0,3e-06,0,-2e-06,3e-06,-1e-06,3e-06,-3e-06,-3e-06,0
0,-1e-06,1e-06,-1e-06,-1e-06,0,0,-2e-06,1e-06,-1e-06,3e-06,3e-06,0,0,0,-1e-06,-1e-06,-1e-06,0,0,-1e-06,0,-2e-06,-3e-06,4e-06,1e-06,0,0,0,-4e-06,3e-06,0,-4e-06,-1e-06,-1e-06,1e-06,-1e-06,-4e-06,1e-06,0,1e-06,1e-06,-1e-06,0,3e-06,-1e-06,1e-06,-1e-06,-2e-06,-2e-06,0,-1e-06,-1e-06,0,0,-2e-06,2e-06,0,0,-3e-06,-1e-06,7e-06,1e-06,-2e-06,3e-06,2e-06,-1e-06,2e-06,1e-06,0,-3e-06,3e-06,-1e-06,0,0,1e-06,-1e-06,0,-1e-06,-1e-06,1e-06,-1e-06,0,-1e-06,-1e-06,0,0,1e-06,-4e-06,1e-06,3e-06,-1e-06,-1e-06,0,1e-06,1e-06,-1e-06,-3e-06,-1e-06,1e-06,1e-06,0,1e-06,0,0,-3e-06,3e-06,3e-06,-1e-06,-1e-06,2e-06,-1e-06,-2e-06,0,1e-06,2e-06,2e-06,-1e-06,3e-06,1e-06,0
0,0,2e-06,1e-06,2e-06,-1e-06,-1e-06,-1e-06,1e-06,0,2e-06,1e-06,-1e-06,1e-06,0,-1e-06,1e-06,-1e-06,0,0,0,0,1e-06,-3e-06,2e-06,2e-06,0,0,0,2e-06,-2e-06,1e-06,-1e-06,-2e-06,0,0,-2e-06,1e-06,0,0,-6e-06,-2e-06,-2e-06,-1e-06,-1e-06,0,0,1e-06,-3e-06,0,0,-2e-06,0,-1e-06,2e-06,-3e-06,-2e-06,0,0,1e-06,0,2e-06,-1e-06,0,0,-1e-06,0,0,3e-06,1e-06,-2e-06,1e-06,0,-1e-06,1e-06,0,0,-2e-06,1e-06,0,2e-06,3e-06,0,1e-06,-1e-06,0,-1e-06,2e-06,-5e-06,0,1e-06,1e-06,1e-06,-1e-06,1e-06,1e-06,0,-1e-06,0,1e-06,0,-5e-06,-1e-06,1e-06,0,-4e-06,3e-06,-1e-06,0,4e-06,1e-06,2e-06,1e-06,-1e-06,6e-06,-3e-06,-2e-06,-1e-06,-1e-06,1e-06,0
-1e-06,1e-06,0,0,0,1e-06,1e-06,-1e-06,0,0,-1e-06,-1e-06,-1e-06,-1e-06,0,-1e-06,-2e-06,-1e-06,-1e-06,0,0,0,-1e-06,1e-06,-1e-06,0,-2e-06,1e-06,-3e-06,-2e-06,-1e-06,-2e-06,-1e-06,0,0,1e-06,3e-06,0,0,-1e-06,-1e-06,-3e-06,-1e-06,0,0,0,0,-1e-06,0,0,0,1e-06,0,0,3e-06,1e-06,1e-06,0,1e-06,-1e-06,-1e-06,-5e-06,0,-1e-06,-2e-06,0,0,-2e-06,-2e-06,-1e-06,-2e-06,1e-06,0,0,0,0,0,-1e-06,0,0,-2e-06,2e-06,0,0,1e-06,1e-06,0,0,2e-06,0,-1e-06,0,-1e-06,-1e-06,1e-06,0,-1e-06,-2e-06,0,-1e-06,-1e-06,2e-06,1e-06,1e-06,-1e-06,-3e-06,-3e-06,-2e-06,-1e-06,-1e-06,-3e-06,-2e-06,-1e-06,0,-1e-06,0,1e-06,1e-06,-4e-06,-1e-06,0
0,0,0,0,-1e-06,-1e-06,-1e-06,0,1e-06,0,-3e-06,-1e-06,-1e-06,0,1e-06,-1e-06,2e-06,2e-06,0,0,0,-1e-06,0,3e-06,-1e-06,-1e-06,1e-06,-1e-06,-1e-06,-2e-06,0,2e-06,0,1e-06,0,0,-1e-06,-2e-06,1e-06,0,0,0,0,1e-06,2e-06,-1e-06,0,0,0,0,0,0,0,0,1e-06,2e-06,-1e-06,0,-2e-06,-2e-06,-1e-06,-5e-06,-1e-06,0,1e-06,1e-06,0,1e-06,-3e-06,0,-3e-06,1e-06,1e-06,1e-06,0,0,0,2e-06,-1e-06,0,0,-1e-06,1e-06,0,-1e-06,1e-06,1e-06,-1e-06,3e-06,0,-1e-06,-2e-06,0,-1e-06,-1e-06,-2e-06,1e-06,1e-06,0,0,-1e-06,2e-06,-1e-06,-2e-06,0,0,-4e-06,1e-06,0,4e-06,0,1e-06,-1e-06,0,-4e-06,0,0,0,2e-06,0,-1e-06
-1e-06,0,0,-1e-06,-1e-06,1e-06,0,-2e-06,1e-06,0,0,-1e-06,0,0,0,-1e-06,-1e-06,-1e-06,1e-06,0,0,0,1e-06,1e-06,1e-06,-1e-06,-1e-06,0,0,0,1e-06,-1e-06,5e-06,1e-06,1e-06,0,2e-06,2e-06,0,0,3e-06,2e-06,1e-06,-1e-06,-1e-06,1e-06,0,0,-1e-06,0,1e-06,-1e-06,1e-06,0,-2e-06,3e-06,1e-06,0,0,-1e-06,1e-06,-3e-06,1e-06,-1e-06,1e-06,0,0,-1e-06,0,0,1e-06,0,1e-06,1e-06,-1e-06,0,-1e-06,-1e-06,0,1e-06,0,-1e-06,0,1e-06,1e-06,-1e-06,-1e-06,2e-06,3e-06,0,0,-1e-06,0,0,-1e-06,-1e-06,-1e-06,-1e-06,0,0,0,0,0,1e-06,0,2e-06,0,0,0,-1e-06,1e-06,0,0,0,-1e-06,-2e-06,-1e-06,-1e-06,-3e-06,-1e-06,0
1e-06,1e-06,-1e-06,1e-06,1e-06,0,0,-1e-06,0,-1e-06,3e-06,0,0,0,0,-1e-06,1e-06,0,0,0,0,0,-1e-06,1e-06,-2e-06,0,-1e-06,0,1e-06,-2e-06,-2e-06,0,2e-06,2e-06,0,-1e-06,-1e-06,-1e-06,0,0,0,1e-06,2e-06,0,1e-06,0,0,1e-06,3e-06,1e-06,0,0,-1e-06,0,-2e-06,2e-06,-1e-06,0,0,0,1e-06,2e-06,-2e-06,-1e-06,-1e-06,-2e-06,0,-1e-06,2e-06,0,0,-1e-06,-1e-06,0,0,0,0,-2e-06,0,0,1e-06,-1e-06,0,-1e-06,0,-2e-06,0,4e-06,1e-06,0,-2e-06,1e-06,0,1e-06,0,0,1e-06,0,1e-06,0,0,0,0,0,0,-1e-06,1e-06,0,0,-2e-06,1e-06,0,-1e-06,0,4e-06,2e-06,1e-06,-1e-06,-2e-06,2e-06,0
-1e-06,0,0,0,0,0,0,-1e-06,1e-06,0,0,1e-06,-1e-06,0,0,-1e-06,0,1e-06,0,0,0,0,0,-1e-06,-3e-06,0,1e-06,0,2e-06,0,1e-06,1e-06,-1e-06,0,0,0,-1e-06,0,1e-06,0,1e-06,0,-1e-06,0,-1e-06,-1e-06,-1e-06,1e-06,0,0,0,0,0,0,-1e-06,0,0,0,0,0,-1e-06,3e-06,2e-06,-1e-06,0,2e-06,0,1e-06,1e-06,0,0,0,-2e-06,-1e-06,0,0,0,0,-1e-06,1e-06,0,-1e-06,0,1e-06,1e-06,0,0,0,-1e-06,0,0,0,0,0,0,1e-06,-1e-06,-2e-06,0,0,0,-2e-06,0,-1e-06,-1e-06,0,3e-06,1e-06,0,4e-06,-1e-06,0,1e-06,0,2e-06,1e-06,-1e-06,0,1e-06,-1e-06,0
1e-06,0,-1e-06,0,-1e-06,0,0,-1e-06,0,-1e-06,-2e-06,1e-06,0,0,0,-1e-06,0,0,0,0,0,0,-1e-06,-2e-06,-3e-06,1e-06,-1e-06,0,0,1e-06,1e-06,-2e-06,1e-06,-2e-06,0,1e-06,-1e-06,1e-06,-1e-06,0,-3e-06,-2e-06,-1e-06,0,0,1e-06,0,1e-06,-3e-06,0,0,0,-1e-06,0,1e-06,-1e-06,0,0,0,-1e-06,0,1e-06,-1e-06,-1e-06,1e-06,-1e-06,-1e-06,0,1e-06,0,0,-1e-06,0,0,0,0,0,1e-06,1e-06,0,-1e-06,0,0,0,0,0,0,-2e-06,-3e-06,0,1e-06,0,0,0,1e-06,-1e-06,0,0,0,0,0,1e-06,0,0,0,1e-06,0,-1e-06,0,-2e-06,0,0,0,0,-2e-06,-1e-06,0,0,0,-1e-06,0
-1e-06,0,2e-06,0,1e-06,0,-1e-06,0,-1e-06,0,-2e-06,1e-06,0,0,0,0,-1e-06,0,0,0,-1e-06,0,0,-1e-06,0,0,0,0,0,0,0,2e-06,1e-06,0,0,0,1e-06,-1e-06,0,0,-2e-06,0,-1e-06,0,0,-1e-06,0,0,2e-06,0,0,0,0,0,2e-06,-2e-06,0,0,0,1e-06,0,0,1e-06,0,-1e-06,-1e-06,0,-1e-06,0,0,-2e-06,-1e-06,1e-06,0,0,0,0,0,0,0,0,0,0,-1e-06,1e-06,1e-06,0,0,-1e-06,0,-1e-06,0,1e-06,0,0,-1e-06,0,-1e-06,0,0,0,-1e-06,-1e-06,0,0,1e-06,-2e-06,0,0,-1e-06,0,0,1e-06,0,-3e-06,1e-06,0,-1e-06,-2e-06,1e-06,0
0,0,0,0,0,0,0,0,1e-06,0,1e-06,0,0,0,0,0,0,-1e-06,0,0,0,0,0,1e-06,0,0,0,0,-1e-06,1e-06,0,-1e-06,2e-06,0,0,0,0,1e-06,0,0,0,0,0,0,0,0,0,0,-1e-06,0,-1e-06,0,0,0,1e-06,-1e-06,0,0,0,0,0,-1e-06,-1e-06,-1e-06,-1e-06,1e-06,0,1e-06,-1e-06,0,0,1e-06,0,0,0,0,0,-1e-06,-1e-06,0,1e-06,0,0,1e-06,0,0,0,1e-06,1e-06,0,1e-06,0,-1e-06,0,0,-1e-06,0,0,0,0,0,4e-06,0,0,0,1e-06,-2e-06,1e-06,0,1e-06,0,0,0,0,1e-06,0,-1e-06,0,2e-06,1e-06,0
-1e-06,0,1e-06,0,-1e-06,0,0,0,-1e-06,0,2e-06,-1e-06,0,1e-06,0,0,0,1e-06,0,0,0,0,-1e-06,1e-06,0,0,-1e-06,0,-1e-06,1e-06,1e-06,0,3e-06,0,0,-1e-06,0,0,0,0,2e-06,1e-06,0,0,1e-06,0,0,-1e-06,-1e-06,0,0,0,0,0,-1e-06,0,0,0,0,0,0,-2e-06,1e-06,0,1e-06,0,0,0,-1e-06,0,0,0,1e-06,0,0,0,0,1e-06,0,-1e-06,-1e-06,1e-06,0,0,0,-1e-06,0,-1e-06,2e-06,0,1e-06,-1e-06,0,0,0,1e-06,1e-06,-1e-06,0,0,0,-3e-06,0,-1e-06,0,-2e-06,0,0,0,-2e-06,-1e-06,0,0,0,3e-06,-2e-06,0,1e-06,1e-06,-1e-06,0
0,0,-1e-06,0,0,0,-1e-06,0,0,0,0,-1e-06,0,-1e-06,0,0,-1e-06,-1e-06,0,0,0,0,0,1e-06,0,0,0,0,0,1e-06,0,1e-06,-1e-06,2e-06,0,0,0,-1e-06,0,0,1e-06,0,1e-06,0,-1e-06,0,0,0,1e-06,0,0,0,0,0,-1e-06,1e-06,0,0,0,0,0,-2e-06,0,0,0,-1e-06,0,0,0,0,0,1e-06,0,0,0,0,0,1e-06,0,0,0,1e-06,0,0,-1e-06,-1e-06,0,-3e-06,2e-06,0,0,0,0,0,0,0,0,0,0,0,0,1e-06,0,0,0,-1e-06,2e-06,-1e-06,0,1e-06,0,-1e-06,0,0,1e-06,1e-06,0,0,-1e-06,0,0
0,0,0,0,0,0,0,1e-06,0,0,-2e-06,0,0,0,0,0,1e-06,0,0,0,0,0,0,0,2e-06,0,0,0,0,1e-06,-1e-06,-2e-06,-1e-06,0,0,0,-1e-06,1e-06,0,0,1e-06,-1e-06,0,0,1e-06,0,0,0,-1e-06,0,0,0,0,0,-1e-06,1e-06,0,0,0,0,0,0,0,0,-1e-06,1e-06,0,1e-06,0,0,1e-06,1e-06,-1e-06,0,0,0,0,0,0,0,0,-1e-06,0,0,0,0,0,0,0,0,1e-06,0,0,0,0,0,0,-1e-06,0,0,0,-1e-06,-1e-06,1e-06,0,1e-06,1e-06,0,0,0,1e-06,0,-1e-06,0,-2e-06,0,0,0,2e-06,1e-06,0
0,0,0,0,0,0,0,0,0,0,-1e-06,1e-06,0,0,0,0,-1e-06,0,0,0,0,0,0,-2e-06,1e-06,-1e-06,-1e-06,0,1e-06,1e-06,1e-06,1e-06,0,-1e-06,0,0,0,-1e-06,0,0,-1e-06,0,0,0,0,0,0,0,-1e-06,0,0,0,0,0,1e-06,1e-06,0,0,0,0,0,1e-06,-1e-06,1e-06,0,0,0,1e-06,0,0,0,1e-06,0,0,0,0,0,-1e-06,0,0,1e-06,-1e-06,0,0,-1e-06,0,0,2e-06,-2e-06,0,0,0,0,0,0,-1e-06,0,0,0,0,0,-1e-06,0,-1e-06,0,0,0,0,0,-3e-06,0,0,0,0,-2e-06,0,0,0,0,-1e-06,0
0,0,-1e-06,0,-1e-06,0,0,1e-06,0,0,1e-06,1e-06,0,0,0,0,0,0,0,0,0,0,0,-1e-06,0,0,0,0,1e-06,-1e-06,1e-06,-1e-06,-1e-06,0,0,0,0,1e-06,0,0,-2e-06,0,-1e-06,0,0,0,0,0,1e-06,0,0,0,0,0,2e-06,1e-06,0,0,0,0,0,2e-06,0,0,1e-06,0,0,-1e-06,0,0,0,0,0,0,0,0,0,0,0,0,0,0,0,0,1e-06,0,0,0,-2e-06,0,-1e-06,0,0,0,0,1e-06,1e-06,-1e-06,0,0,0,3e-06,0,0,0,0,-2e-06,0,0,2e-06,0,0,0,0,1e-06,1e-06,0,0,-1e-06,-1e-06,-1e-06
0,0,0,0,0,0,0,0,0,0,2e-06,0,0,0,0,1e-06,-1e-06,0,0,0,0,0,0,-1e-06,-1e-06,1e-06,0,0,0,-1e-06,0,0,0,-1e-06,0,0,0,0,0,0,0,0,0,0,1e-06,0,0,0,0,0,0,0,0,0,1e-06,0,0,0,0,0,0,1e-06,0,1e-06,-1e-06,0,0,0,1e-06,0,0,0,0,0,0,0,0,1e-06,0,0,-1e-06,0,0,0,-1e-06,0,0,-1e-06,-1e-06,0,0,0,0,0,0,0,-1e-06,0,0,0,0,-1e-06,0,0,0,-1e-06,-1e-06,0,0,1e-06,0,0,0,0,2e-06,0,0,0,0,1e-06,0
0,0,0,0,0,0,0,1e-06,0,0,-1e-06,0,0,0,0,1e-06,1e-06,-1e-06,0,0,0,0,0,1e-06,-1e-06,0,0,0,-1e-06,0,0,1e-06,-1e-06,0,0,0,0,-1e-06,0,0,1e-06,0,0,0,-1e-06,0,0,0,-1e-06,0,0,0,0,0,-1e-06,-1e-06,-1e-06,0,0,0,0,-1e-06,0,1e-06,0,1e-06,0,0,0,0,0,0,0,0,0,0,0,0,0,0,0,0,0,0,1e-06,-1e-06,0,1e-06,2e-06,0,0,0,0,0,0,0,1e-06,-1e-06,0,0,0,1e-06,-1e-06,0,0,0,1e-06,0,0,-2e-06,0,0,0,0,-1e-06,-1e-06,0,0,0,0,0
