-0.000437,-0.000256,-0.000174,-0.000119,-7.1e-05,-0.000129,-7.6e-05,7e-06,-7e-06,-0.000124,-0.000209,-0.000167,-0.00013,-0.000183,-0.000195,-0.000223,-0.00027,-0.00031,-0.000309,-0.000372,-0.000396,-0.000322,-0.000579,-0.000698,-0.00058,-0.001175,-0.001262,-0.00106
-0.00085,-0.000301,-0.00015,-0.000267,-0.000201,-0.000287,-0.00014,-6.6e-05,-0.000111,-0.000208,-0.000266,-0.000164,-0.000186,-0.000305,-0.000309,-0.000355,-0.000519,-0.00049,-0.000306,-0.000418,-0.00038,-0.000287,-0.00065,-0.000846,-0.000673,-0.000361,-0.000449,-0.000733
-0.000507,-0.000152,-4.4e-05,-0.000192,-0.000169,-0.000232,-0.000185,-0.000114,-0.000122,-0.000136,-8.2e-05,-2.8e-05,-0.000147,-0.000218,-0.000216,-0.000208,-0.000353,-0.000356,-0.000152,-0.000134,-0.000166,-0.000108,-0.000289,-0.000436,-0.000416,0.000277,0.000406,0.000166
-0.000119,-0.000111,-2.4e-05,-6.2e-05,-9.4e-05,-0.000104,-0.000225,-0.000139,-7.9e-05,-4.2e-05,1e-04,5.8e-05,-0.000121,-0.000145,-0.000146,-0.00014,-0.000254,-0.000295,-0.000101,1e-06,-0.000165,-0.00016,-0.000199,-0.000361,-0.000553,-0.000236,4.2e-05,0.000216
-5e-05,-7.4e-05,9e-06,3.2e-05,-1.1e-05,6.8e-05,-4.1e-05,-4.6e-05,-1e-06,5.7e-05,0.000158,8.9e-05,-9e-06,-4.4e-05,-4e-05,-0.000116,-0.00023,-0.000153,6.8e-05,5.9e-05,-4.7e-05,-0.000102,-4.2e-05,-0.000219,-0.000447,-8e-06,4.8e-05,-1.2e-05
-0.000168,-0.000104,-3.9e-05,8e-06,1.3e-05,8e-05,7.8e-05,1e-06,8e-06,3.9e-05,3.2e-05,3e-06,4e-05,2.7e-05,2.2e-05,-0.000132,-0.000205,-8.7e-05,8.5e-05,2.4e-05,4.3e-05,-2.2e-05,3.7e-05,-0.000131,-0.000246,0.000283,0.000109,-0.000294
-7e-06,-7e-05,-8.7e-05,-4.5e-05,1.2e-05,-5.5e-05,-1.5e-05,-5.6e-05,-5e-05,-7.4e-05,-0.000139,-0.000132,-3e-05,5.4e-05,1.1e-05,-0.000127,-6.6e-05,-0.000115,-0.000153,-8.5e-05,-2.5e-05,-9.5e-05,-0.000128,-0.000156,-0.000171,-0.000503,-0.000514,-0.000517
0.000511,0.000234,7e-05,3.9e-05,7.8e-05,-2.8e-05,3.1e-05,-3.4e-05,-4.5e-05,-5e-05,-9.3e-05,-7e-05,5.7e-05,0.000193,0.000153,0.000134,0.000331,0.00025,-7e-06,4.4e-05,0.000153,7e-05,0.000199,0.000518,0.000542,-0.000349,-0.000211,0.000129
0.000712,0.000375,0.00017,0.000138,0.000113,9.3e-05,0.000134,1.6e-05,-8e-06,6.4e-05,8.2e-05,7.9e-05,0.000152,0.000227,0.000235,0.000342,0.000589,0.000623,0.000282,0.000171,0.000335,0.000298,0.000665,0.001102,0.001119,0.000735,0.000729,0.000802
0.000268,6.6e-05,6e-06,7.6e-05,1.9e-05,4.9e-05,-2e-05,-5.3e-05,-2.2e-05,5.6e-05,0.000103,6.9e-05,3e-05,-2.8e-05,2.6e-05,0.00019,0.000368,0.000407,0.000181,2.3e-05,6e-05,0.00016,0.00035,0.000442,0.000546,0.000477,0.000269,0.000243
-0.000295,-0.000174,-9.5e-05,-4.1e-05,-7.9e-05,-5.4e-05,-0.000162,-0.000101,-5e-05,-2e-06,1e-06,-1.8e-05,-0.000113,-0.000247,-0.000173,-4.6e-05,-2e-06,-5.3e-05,-6.6e-05,-0.000116,-0.000225,-6.1e-05,-0.000351,-0.000538,-0.000255,-0.000412,-0.000605,-0.000477
-0.000541,-0.000105,-1.2e-05,-7.8e-05,-9.3e-05,-7.4e-05,-5.9e-05,-2.4e-05,-3.1e-05,1.3e-05,-4.5e-05,-1.7e-05,-7.5e-05,-0.000153,-7.3e-05,-2.1e-05,-0.000126,-0.000181,-4.7e-05,0,-6.6e-05,3.2e-05,-0.000386,-0.000492,-0.000248,4.5e-05,2e-05,-3e-05
-0.000519,-9.4e-05,-1.6e-05,-9.9e-05,-0.000108,-0.000127,-2.5e-05,1.3e-05,-3e-06,-5e-06,-5.2e-05,-1.3e-05,-3.9e-05,0,3.6e-05,7e-06,-0.00022,-0.000273,-0.000112,5e-06,3.2e-05,3.1e-05,-0.000172,-0.000239,-0.000316,0.000296,0.000472,0.000334
-0.000224,-0.000113,-6.9e-05,-9.9e-05,-0.000108,-0.000148,-8.9e-05,-8e-06,2.6e-05,-5.6e-05,-4.6e-05,-3.9e-05,-5.2e-05,2.3e-05,-2.7e-05,-0.000107,-4e-04,-0.000439,-0.000285,-0.000143,-0.000154,-0.000217,-0.000203,-0.000427,-0.000726,-0.00062,-0.000405,-0.00022
0.000235,4.7e-05,7e-06,-8e-06,-1.5e-05,3.1e-05,4e-05,4.7e-05,8e-05,-3e-06,2.6e-05,4e-06,4.7e-05,6.8e-05,-2.2e-05,-0.000103,-0.000343,-0.000249,-9.9e-05,-4.1e-05,-0.00012,-0.000197,2.6e-05,-0.000189,-0.000418,-0.000466,-0.000496,-0.000339
0.000439,0.000122,4.8e-05,8.7e-05,9.2e-05,0.000199,0.000165,9.7e-05,0.000101,6.8e-05,6.5e-05,3.9e-05,0.000116,0.000113,2.9e-05,-2.6e-05,-5.8e-05,0.000102,0.00018,0.000166,0.000109,4.4e-05,0.000323,0.000318,0.000222,0.000603,0.000422,0.000185
0.000261,0,-2e-05,8e-05,0.000104,0.000125,4.8e-05,5.2e-05,5.3e-05,3.6e-05,-8e-06,-1e-06,6.9e-05,7.3e-05,-2e-06,-5.1e-05,0.000135,0.000186,0.000177,0.000132,0.00011,9.1e-05,0.000132,0.000319,0.000305,0.000309,0.000312,0.000157
2.3e-05,-3.3e-05,-2.5e-05,2.8e-05,5.5e-05,-2.9e-05,-4.5e-05,2e-05,-7e-06,-1e-06,-5.5e-05,-2.5e-05,1.7e-05,2.5e-05,-2.4e-05,-8.6e-05,0.000187,0.000116,4.3e-05,-2.7e-05,1.4e-05,3.5e-05,-0.000128,0.000166,0.000195,-0.000584,-0.00038,-0.00029
-4.7e-05,2e-05,9e-06,-1e-06,5e-06,-8.5e-05,-1e-06,3.1e-05,-3e-05,1.2e-05,1.2e-05,1.4e-05,5e-06,1.3e-05,4e-05,4.6e-05,0.000274,0.000175,3e-05,-1.6e-05,9.4e-05,0.000126,0.000144,0.000358,0.000413,-4.8e-05,-3.3e-05,-0.000203
