-0.000403,-0.000854,-0.000395,-0.000736,-0.001908,-0.001619,-0.000416,0.000223,-0.000576,-0.000889,0.00017,-0.00039,-0.000341,-0.000644,-0.000914,-0.000945,-0.000433,-0.000497,-0.000731,-0.000237,-0.001113,5.1e-05,0.000449,-0.000239,9.5e-05,7e-05,-0.000569,-0.000322,-0.001103,-0.000808,-3.7e-05,0.000323,-0.000436,-0.000611,-0.000785,-0.001483,-0.000175,-0.000384,-0.000559,-0.001321,-0.000684,-0.001051,-0.001007,-0.000906,-0.000657,-0.000481,-0.000426,-0.000903,-0.000858,-0.000696,-0.000883,-0.00123,-7.9e-05,-0.000163,-0.000613,-0.000468,-0.00138,-0.001272,-0.001159,0.000103,-0.000597,-0.000516,-0.000315,-0.000446,-0.001029,3.1e-05,-0.000299,-0.00035,-1.6e-05,-1.1e-05,-0.000271,-2.6e-05,-0.000128,-0.000515,-6.8e-05,-0.000128,-9e-05,-0.000166,2e-05,-0.000217,-0.000142,9.9e-05,9.6e-05,0.000171,2e-05,0.000787,0.000543,0.00044,0.000241,0.00019,2e-06,-0.000103,0.000153,0.000166,5.9e-05,2.2e-05,0.000279,0.000483,-0.000133,8e-05,0.000262,0.000231,0.000411,9.4e-05,5.4e-05,-0.002124,-0.003798,-0.001791,-0.000256,0.000102,0.000171,0.000574,0.000432,0.000203,7e-06,0.000172,1.7e-05,0.000192,0.000114,-0.000419,-0.000313
-0.001688,-0.000334,-0.001199,-0.000592,0.000186,0.000592,0.000429,-0.001038,-0.000754,-0.000754,-0.001638,-0.001462,-0.001088,0.000337,-0.000105,0.000247,-0.000968,0.000445,0.000113,0.000656,0.000402,-0.000555,-0.001558,-0.001158,-0.000642,-0.000445,-0.001075,-0.000305,-0.000192,-0.000111,-0.001786,-0.001137,-0.000761,-0.000923,-3.7e-05,0.000225,-0.000982,-0.001239,-0.001142,4.5e-05,-0.000355,-0.000141,0.000917,0.000174,-0.000475,-0.000289,-0.000279,0.000516,-0.000559,0.00053,0.000206,8.3e-05,-0.000612,-0.000711,-0.000586,-0.000251,0.00029,0.000544,-0.000475,1e-06,-9.7e-05,-0.000356,-0.000401,0.000333,0.000862,1.6e-05,-8e-06,-0.000151,-0.000745,-0.001169,-0.000592,-0.000187,-0.000586,-0.000486,-0.000876,-0.000381,-0.000316,-0.000448,-0.000516,-1e-06,-0.000136,-0.000118,-0.000266,-0.00038,-0.000536,-0.000769,-0.000833,-0.000348,-0.00035,-0.000153,-4.9e-05,0.000171,0.000117,-3.8e-05,-0.000216,-0.000279,-0.000103,-0.000731,-0.000398,-0.000543,-0.000669,-0.000582,-0.000358,-0.000457,-0.000266,0.000907,0.002229,0.001355,0.000284,-0.000462,-0.000281,0.000121,-0.000523,-0.00024,-0.000185,0.000149,-4.7e-05,-0.000111,-7.6e-05,3.7e-05,-0.000198
0.000457,-0.000489,3.3e-05,-1e-05,0.000337,-0.000731,-0.000295,-0.001666,-0.000653,-0.000577,-0.000418,-0.000291,-0.000974,-0.000456,-0.001106,-0.000432,0.000236,-0.000963,-0.000704,-0.000508,-0.000779,-0.001014,-0.000781,-6.5e-05,-0.000372,-0.000995,-0.000491,-0.001056,-0.000328,0.00019,7.1e-05,-0.000397,-0.000215,-0.000305,-0.000639,-9.4e-05,-0.00061,0.000157,0.000538,-0.000215,-0.000683,-0.000424,-0.001157,-0.000831,-0.000143,-9.9e-05,0.000346,-0.000399,-0.000147,-0.000544,-0.000755,2.5e-05,-0.000599,-0.000275,-0.000675,-0.000278,-0.000165,-0.000171,-0.000516,-0.001248,-0.000503,-0.000375,-9e-05,-0.000179,-0.000468,-0.000639,-0.000585,8.5e-05,-0.000102,0.000441,-0.000141,-0.000801,0.000252,-6.8e-05,7.2e-05,5.2e-05,6.2e-05,0.000166,0.000149,-0.000415,-0.000147,7.6e-05,-9.9e-05,0.000112,5.5e-05,-0.000442,-0.000379,-0.000131,9e-05,0.000153,-5e-04,-0.000346,-6.6e-05,-0.000289,-3e-05,-0.00014,2.1e-05,-0.00016,-0.000317,-0.000116,-0.000233,-0.000156,-0.00012,0.000171,0.000179,-1.3e-05,-0.000728,-0.000493,-0.000511,-0.000116,-4.8e-05,-0.000136,-0.000145,-0.000327,-7.1e-05,-0.000202,-1.6e-05,-0.000218,-7.5e-05,5.8e-05,0.000142
0.000437,0.000782,0.000607,-0.000333,-0.000474,0.000539,-0.000353,0.00068,5.7e-05,0.001088,0.001391,0.000498,0.001199,0.000319,0.000642,0.000179,0.000269,0.000192,0.000528,0.000218,0.00101,0.000579,0.000579,0.000885,2e-06,0.000867,-3.7e-05,0.000125,0.000405,0.000913,0.000671,0.000759,0.000739,0.001066,0.000728,5.6e-05,0.000243,0.000505,0.000547,0.000577,0.000465,0.000358,0.000603,0.000648,-3.6e-05,0.000556,0.000502,0.00013,-1e-06,0.000319,0.000545,0.000524,0.000739,-1e-05,0.00042,0.000442,3.7e-05,0.000199,0.001254,0.001466,0.000737,1.6e-05,9e-05,5.1e-05,0.000431,0.000434,0.00033,4.8e-05,0.000469,0.000748,0.000567,0.000676,5e-04,0.000228,0.000816,0.000354,0.000176,0.000209,0.000327,0.000371,0.000225,2.3e-05,-2.6e-05,0.000401,0.000215,0.000333,0.000645,0.000138,0.000123,6.4e-05,0.000213,0.000211,0.000143,-2.9e-05,5.5e-05,0.000182,8.6e-05,4.4e-05,0.000481,0.000403,0.000447,2.6e-05,0.000238,-0.000102,-7e-06,9.2e-05,-0.000339,-0.000135,-9.6e-05,0.00044,0.000125,0.000219,0.000341,6.7e-05,7.1e-05,-0.000171,2.9e-05,8e-06,-4e-05,-3e-05,-0.000147
-0.000303,-0.00042,-0.000306,0.000816,0.000463,-0.000312,7.5e-05,0.000329,0.000498,-0.000396,-0.00058,0.000251,0.000444,9.8e-05,0.000122,0.00031,-0.000206,0.000235,0.000144,0.000426,-0.000741,6.2e-05,0.00049,-0.000275,0.000216,0.000124,0.000528,0.000271,-7.2e-05,-0.000826,-0.000469,-0.000344,-0.000316,-0.00034,-0.000455,-0.000494,-0.000351,-0.00086,-0.000732,-0.000527,-0.000406,-0.000381,-0.000365,3e-06,-0.000125,1e-05,-0.000586,-0.000181,-5.7e-05,-0.000495,-0.000172,-0.000277,9.4e-05,-0.000103,0.000223,0.000231,8.8e-05,-2.8e-05,-0.000672,-0.000222,-0.000159,-0.000154,-5.9e-05,-0.000184,-0.000453,-0.00015,-5.4e-05,-0.000284,7.6e-05,-0.000706,8.5e-05,-0.000106,-0.000423,1e-06,-0.000414,-0.000324,-0.000219,-6e-06,-0.000194,-0.00023,-7.6e-05,-9.4e-05,3.5e-05,-5e-06,0.000193,0.000248,0.000228,-0.000144,6.2e-05,-8.4e-05,9.7e-05,-9.2e-05,0.000249,0.000194,-3e-06,2.8e-05,-8.1e-05,6.5e-05,-6.7e-05,-0.000355,-0.000188,-0.000209,0.000147,-0.000115,-0.000159,-0.000134,0.000258,-4.6e-05,-5e-05,7.9e-05,-2e-04,6.7e-05,0.000161,0.000396,2.3e-05,4.1e-05,-8.6e-05,0.000123,0.000225,0.000135,-2.4e-05
-0.000494,-0.000578,-0.000228,-0.000265,-4.2e-05,0.000194,0.00026,-1.7e-05,0.000543,0.000154,-8.1e-05,-0.000715,-0.000567,-0.000647,-0.000374,-0.000314,7.9e-05,-3e-05,6e-06,-0.000131,-0.000128,-0.00022,-7.5e-05,-0.000411,-0.000394,-0.000172,-0.000186,2.4e-05,7e-05,7.3e-05,5.8e-05,-0.000563,-0.000492,-0.000194,-0.000152,9.1e-05,0.000118,-0.000113,-4e-05,6.9e-05,0.00029,0.000305,0.000125,-0.000245,0.000137,0.000124,-7e-06,-0.000265,-8.8e-05,-7.1e-05,-0.000142,-6.6e-05,-7.1e-05,0.000495,-0.000127,-0.000214,-0.000255,6.7e-05,0.000173,-0.000172,-0.00034,3.8e-05,-0.000113,0.000322,0.000633,0.000114,-0.000133,0.000109,-0.000358,-0.000259,-0.000503,6e-05,-0.000108,2.3e-05,-0.000217,-0.000315,0.000126,-0.000195,-0.000156,0.000161,-4.6e-05,-0.000132,-0.000211,-0.000219,-0.000297,-0.00021,-0.000338,-5.3e-05,-8.1e-05,0.000106,-4e-06,0.000158,-3.8e-05,2.3e-05,4.8e-05,-6.6e-05,-2.4e-05,8.3e-05,-0.000268,0.000275,-4.6e-05,-4.6e-05,-0.000126,8.2e-05,1e-05,-0.000168,-7.3e-05,0.000148,-6.5e-05,-0.000108,-9e-06,9.7e-05,-0.000126,-2.6e-05,0.00021,-1.6e-05,8e-06,6e-06,0.000146,-4e-06,4.6e-05
9e-05,0.000407,0.000132,-0.000262,-0.000164,5.2e-05,-0.000264,-8.6e-05,-0.000676,-0.000351,0.000542,0.000187,-0.000159,-4.3e-05,0.000137,0.000175,-2.7e-05,-0.000262,-0.000281,-0.000154,-0.000182,6.7e-05,-0.000626,7.1e-05,0.000141,-0.00045,-0.000435,-0.000172,-0.000379,0.000192,0.000351,-5.7e-05,0.000217,0.000227,4.6e-05,0.000157,0.000377,0.000443,0.00053,0.000151,-0.000301,0.000201,7.6e-05,3.7e-05,0.000165,-0.000203,-0.000162,-0.000283,0.000171,0.000296,-2.8e-05,2.3e-05,0.000213,0.000136,1.5e-05,1.6e-05,0.000139,2.4e-05,-0.000396,-0.000257,-0.000286,-7.4e-05,0.000371,-0.000131,-0.000231,-0.000245,-0.000135,-0.000215,-0.00014,0.000123,6.4e-05,-0.000484,4e-05,-0.000285,-2.7e-05,6.3e-05,0.000152,-1e-06,0.000243,-0.000116,-6.2e-05,0.00015,-5.8e-05,0.000103,-3.8e-05,3.7e-05,-0.000249,-5.7e-05,4.9e-05,-0.000112,3.3e-05,-5e-05,1e-05,-8.7e-05,-4.4e-05,0.000138,-4e-06,0.000134,3e-05,0.000139,-5e-06,0.000262,-9.3e-05,6.2e-05,6.9e-05,-0.000105,2.1e-05,-6.5e-05,-0.000178,-6.3e-05,0.000172,-4.6e-05,-0.000209,-0.000194,-9.9e-05,9e-06,-0.000117,-3.2e-05,-5.6e-05,-3.9e-05,0.000122
0.000159,0.000111,-3e-05,-0.000152,5.2e-05,2.3e-05,-0.000132,-0.000437,-0.000301,-0.000359,0.000108,0.000365,0.000292,0.000327,0.00023,2.4e-05,9.7e-05,5.5e-05,-9.6e-05,-0.000106,-5.4e-05,0.000237,3.8e-05,0.000151,0.000151,0.000152,0.000297,-0.000322,-3.8e-05,-7.1e-05,-0.000463,0.000255,0.000316,7e-05,0.000342,5.9e-05,-0.000638,-3e-06,-0.000349,-0.000284,0.000294,-0.000228,-6e-06,-0.00026,0.000176,0.000168,2e-04,0.000393,-0.000367,-0.000142,-0.000107,0.000165,-2.7e-05,-0.000497,-0.000132,1.8e-05,1e-06,-0.00019,-3.8e-05,0.000474,0.000487,-0.000126,-0.000165,5e-05,0.000273,0.000134,0.000174,0.000178,3.5e-05,-8.8e-05,0.000149,0.00018,0.000278,0.000381,-0.000131,1.4e-05,-4e-06,4e-05,-0.000133,-5.9e-05,-0.000132,5e-06,0.000139,-5.7e-05,7.9e-05,7.8e-05,0.000191,3.3e-05,-0.000116,-0.00015,-4e-05,-7.4e-05,-0.000116,3.7e-05,3.9e-05,-3.9e-05,-7.8e-05,-1.7e-05,0.000194,-5.7e-05,-4.6e-05,7.7e-05,-3.8e-05,0.000105,-4.3e-05,9.7e-05,0.000107,-2.8e-05,3.5e-05,-1.7e-05,-3.1e-05,3e-06,-0.000237,-3.7e-05,2.2e-05,-3.9e-05,-0.000213,-6.8e-05,-0.000108,1.8e-05,-8.2e-05
-0.000214,-0.000282,0.00025,9.9e-05,-0.00033,1.6e-05,-0.000106,0.000142,0.000111,0.00026,-0.000434,-0.000152,7.3e-05,0.00015,-0.000172,0.000252,-2e-05,0.000248,0.00015,3e-05,0.000113,2e-06,9e-05,0.000142,0.000127,0.000291,0.00013,0.000176,0.00037,-7e-06,-8.9e-05,-0.000125,0.000133,-0.000117,-0.000228,-0.000178,0.000467,7.4e-05,-0.00018,7.5e-05,-0.000292,-5.2e-05,-0.000232,0.000136,-8e-06,0.000235,-0.000168,-0.000164,0.000173,-0.000126,-0.000174,-8.6e-05,-6.8e-05,0.000209,-0.000354,-1e-05,-0.000112,8.4e-05,1.9e-05,-0.000182,-0.000273,-0.00031,-0.000381,-0.000234,-0.000114,-5.9e-05,-0.000159,-0.000245,-0.000285,0.000116,-0.000241,1e-04,-8.1e-05,-0.000183,0.000173,-6.9e-05,-0.000139,-0.000103,-6.3e-05,1.2e-05,8.5e-05,-2e-05,-1e-05,3.7e-05,-2e-05,0.000104,5.4e-05,-1e-04,-0.000174,-1.4e-05,-9.4e-05,-4.8e-05,-7.3e-05,8.6e-05,-1.8e-05,-7e-05,-8.6e-05,-8.1e-05,-3.2e-05,-0.000116,-1e-05,-0.000242,-0.000101,-4.1e-05,1.6e-05,-2.8e-05,-0.000134,-3.7e-05,3.4e-05,0.000112,-0.000131,-9.4e-05,8e-06,8.1e-05,-4.9e-05,-6.9e-05,1.6e-05,1.8e-05,3.1e-05,4.3e-05,-7e-06
3.6e-05,5e-06,-0.000392,-0.000104,0.000423,-0.000172,-1.7e-05,-0.000131,6.2e-05,0.000429,9.3e-05,-0.000161,-0.000211,-0.000135,-0.000245,-0.000322,-8.8e-05,-0.000118,-9.4e-05,-2e-05,-0.00019,-0.000246,5.3e-05,1.9e-05,-0.000426,-4.4e-05,-4e-06,2e-05,0.000211,1.8e-05,4.4e-05,3.9e-05,-0.000295,-9.2e-05,-0.000104,0.000143,-0.000303,-1.6e-05,0.000115,4.8e-05,-5.5e-05,-0.000133,-6e-05,-0.000143,-0.000264,-0.000287,-0.000147,-2.9e-05,-0.000144,-0.00019,0.000118,8.4e-05,-0.000255,0.000104,0.000461,0.000166,2.7e-05,-2.2e-05,-0.000201,-3.9e-05,3.9e-05,0.000226,0.000116,1.7e-05,-0.000171,4.5e-05,6.8e-05,0.00021,0.000165,-0.000272,-0.000215,-8.4e-05,-2.4e-05,-0.000149,-0.00017,3.6e-05,0.000133,3.1e-05,-6.6e-05,-7.4e-05,-5.3e-05,4e-05,-2.3e-05,-4.6e-05,-0.000147,-2.3e-05,1.5e-05,6e-06,7.9e-05,8e-06,6e-06,6.8e-05,-0.000101,6.3e-05,-6.4e-05,-9e-06,4.3e-05,9e-05,4e-05,7.4e-05,8e-05,-2.3e-05,-7e-06,-3.8e-05,1.8e-05,-0.000112,5e-06,-9e-05,-2.2e-05,-2.5e-05,-1.7e-05,-2.3e-05,-4e-06,-3.1e-05,7.4e-05,-3e-05,2.9e-05,-2.3e-05,2.3e-05,4.6e-05,1e-05
0.000309,-1.9e-05,0.000122,6.2e-05,-0.000211,5.3e-05,-9.4e-05,0.000207,-2.4e-05,-0.000348,-9e-05,0.000256,0,-0.000363,0.000125,-3.6e-05,5.4e-05,-0.000202,-2.8e-05,-0.000119,-6.4e-05,5.6e-05,-0.000126,-0.000233,6.2e-05,-1e-06,-0.000173,-0.000149,-0.00013,-8.5e-05,9.6e-05,-1.5e-05,0.000294,3.5e-05,-6.4e-05,3.1e-05,8.5e-05,-8.6e-05,0.00012,1.6e-05,0.000302,1.1e-05,0.000217,7.3e-05,0.000203,-9.4e-05,-9.4e-05,-1.5e-05,0.00021,2e-06,0.000177,-6e-05,8.6e-05,6.8e-05,-4.2e-05,-4.1e-05,0.000107,2.7e-05,0.000149,-2e-06,-7.2e-05,9.6e-05,-0.000116,-2.9e-05,0.000158,-0.000163,-2.6e-05,0.000136,6.1e-05,0.000111,0.000197,-0.000126,-5.7e-05,0.000128,-8e-06,6.4e-05,9.6e-05,4.8e-05,8.6e-05,-1.4e-05,-9.1e-05,-4.1e-05,2.2e-05,-3.9e-05,-5e-06,-3.7e-05,3e-06,5.7e-05,8.6e-05,1.3e-05,-2.7e-05,4.4e-05,0.000116,4.2e-05,-2.1e-05,2.9e-05,3.1e-05,9e-06,-4.7e-05,9.5e-05,5.6e-05,0.000185,0.000127,0.000161,1.7e-05,0.000139,-9e-06,4.6e-05,7.6e-05,2.9e-05,4.4e-05,-9e-06,-5.9e-05,1.2e-05,8.3e-05,4.9e-05,6.6e-05,-6e-05,-6.7e-05,5e-06,3.6e-05
-7.1e-05,-1e-06,5.4e-05,7.7e-05,-1.3e-05,-7.6e-05,4e-06,-0.000176,-7.6e-05,-0.000176,0.000226,-0.000211,0.00019,0.000121,7.7e-05,2.7e-05,9.9e-05,0.000251,7.9e-05,-0.00023,2.1e-05,-0.00011,0.000106,0.000149,8.5e-05,-1.6e-05,7.9e-05,8.6e-05,-0.000134,0.000126,-0.000172,-0.000115,0.000115,6.5e-05,7.4e-05,-8.1e-05,-0.00011,-1.2e-05,-0.000267,-4.4e-05,-0.000103,9e-06,-5e-05,5.2e-05,-0.000142,-2.1e-05,0.000103,0.000102,-0.000216,7e-05,-4.6e-05,5.5e-05,-4e-06,-5e-05,-0.000202,-1.4e-05,-9e-06,-5e-06,-0.000114,-0.000185,4.8e-05,-7.2e-05,2.5e-05,0.000123,6e-05,1.1e-05,-2.5e-05,2.9e-05,3.3e-05,-4.5e-05,-2.1e-05,-8.1e-05,0.000133,3.9e-05,0.000103,-6.7e-05,-0.000115,-3.4e-05,-2.1e-05,-2.2e-05,5.6e-05,6.2e-05,1.3e-05,5.1e-05,2.2e-05,4.1e-05,2.6e-05,-1.9e-05,-2e-05,-6.7e-05,-4.1e-05,8e-06,-1.6e-05,2.9e-05,-2.6e-05,4.4e-05,-3.9e-05,-6.7e-05,-6.3e-05,-0.000119,-2.2e-05,-8.2e-05,3.6e-05,2.3e-05,-6.3e-05,5.5e-05,6.6e-05,-1.5e-05,-5.4e-05,5.8e-05,-1.2e-05,6.9e-05,-2e-06,-2.4e-05,1e-06,5e-06,-1e-05,-6.1e-05,3.2e-05,1.1e-05,5.1e-05
-1.3e-05,7.1e-05,-0.00015,-7e-05,-5e-05,0.000115,9.4e-05,3.5e-05,7.9e-05,0.000217,-4e-06,-0.000118,-9.8e-05,0.000143,-5.2e-05,5e-05,-7.4e-05,-0.000202,-3.5e-05,8.6e-05,-1.8e-05,-8e-06,-8.1e-05,5.8e-05,5.2e-05,0.00017,-2.1e-05,-3.8e-05,4.6e-05,-2.1e-05,5.7e-05,1.1e-05,-9.1e-05,-3.1e-05,3.2e-05,-9e-06,0.000162,0.000128,1.5e-05,2.3e-05,-0.000139,-7.3e-05,-1.3e-05,-1.7e-05,0.000185,-0.000149,-3.8e-05,9e-06,0.000139,6.2e-05,-8.2e-05,-1e-06,-2.3e-05,3.3e-05,4.7e-05,-2.2e-05,-1e-05,-4.7e-05,3.4e-05,3.8e-05,-7.3e-05,-6.2e-05,-3.6e-05,2.3e-05,-0.000128,-8.8e-05,-2e-05,-0.000113,-3.7e-05,7.3e-05,-1.9e-05,0.000183,3.5e-05,-9.7e-05,-5.8e-05,5.1e-05,-7.1e-05,-1.4e-05,-3.3e-05,5e-05,5.7e-05,1.6e-05,-4.1e-05,-3.7e-05,-6.5e-05,9e-06,-1.2e-05,-2.5e-05,-4.1e-05,-5e-06,-5.6e-05,-7e-06,9e-06,-2.8e-05,6e-06,-2.8e-05,-1.4e-05,-2.9e-05,3e-06,-0.000109,-7e-06,-1.8e-05,-2.3e-05,-8.9e-05,-4e-05,-9.1e-05,-6.4e-05,3.6e-05,1e-05,-7.4e-05,-4.1e-05,-1.5e-05,4e-06,-4.1e-05,-1.7e-05,1e-06,-1.7e-05,-6.5e-05,-1.4e-05,1e-06,-5.5e-05
-7.7e-05,-2.1e-05,3.1e-05,2.6e-05,0.000109,-4.8e-05,-2e-06,0,-0.000115,3.2e-05,-5.7e-05,2.6e-05,-4.9e-05,-7e-06,-3.5e-05,-2e-05,-6.5e-05,3.2e-05,1e-05,2.6e-05,5.3e-05,-2.1e-05,-1e-05,-8e-06,-1.6e-05,-0.000257,4.1e-05,3.5e-05,-1.7e-05,-7.6e-05,-2e-06,3.6e-05,3e-05,-5.9e-05,-6.5e-05,3.9e-05,-7.1e-05,-2.6e-05,3.2e-05,1.3e-05,0.000138,1.6e-05,-6.9e-05,-4.7e-05,-0.000156,2e-05,-7e-06,1.5e-05,6.3e-05,1.2e-05,5.7e-05,5e-06,-3.1e-05,0.00012,3.3e-05,-4e-06,1e-05,4.6e-05,-3.3e-05,-1.5e-05,6.6e-05,2.8e-05,-1.5e-05,-0.000236,1.4e-05,4.3e-05,4.2e-05,7e-06,1.1e-05,2.3e-05,7.2e-05,-0.000138,-2.3e-05,5.6e-05,-1.9e-05,-1.2e-05,4.8e-05,1.6e-05,-4e-06,-6.4e-05,-5e-06,1e-05,2e-06,-2.4e-05,2.3e-05,-5e-05,-2.1e-05,-1.4e-05,2.6e-05,3e-06,-4e-06,1.1e-05,-2.7e-05,-3e-06,-2.5e-05,-3.2e-05,-1.3e-05,-5e-06,2.9e-05,4.8e-05,1.2e-05,-4.2e-05,-3.4e-05,-4.3e-05,4e-06,4e-05,2.2e-05,3e-05,3.2e-05,1.7e-05,-0.000101,-4e-05,-2.9e-05,-2.5e-05,1.1e-05,-5e-05,-1.1e-05,1e-06,5e-06,-1.1e-05,1.3e-05
5e-06,-4e-06,9e-06,-1.9e-05,-0.000105,-2.4e-05,-3.2e-05,2.7e-05,2.4e-05,4e-06,-9.9e-05,-3.7e-05,5.6e-05,-6.2e-05,1.7e-05,-2.1e-05,6e-06,4.5e-05,-9e-06,1e-05,-1.8e-05,-2e-05,-0.000117,3e-05,-1e-05,3.9e-05,5e-05,3e-06,4.7e-05,-6.5e-05,4.2e-05,4e-05,-3.3e-05,1.6e-05,-4e-06,5.4e-05,1.6e-05,5e-05,0.000137,-1.2e-05,4e-06,6e-05,-4e-06,2.4e-05,7e-05,6.4e-05,5.4e-05,-3.4e-05,-4.3e-05,3e-06,-8e-06,2.3e-05,3e-05,-8.2e-05,-4.2e-05,9e-06,4.1e-05,-3.2e-05,-4e-05,-2.7e-05,-2.7e-05,5.3e-05,0,3.4e-05,-1.6e-05,2.6e-05,-4e-05,5.7e-05,-1e-06,-1.9e-05,-8.7e-05,-1e-06,-2.9e-05,-2.7e-05,4.7e-05,2e-06,-1e-06,6e-06,2.1e-05,1.8e-05,-9e-06,-1.9e-05,1.7e-05,2.7e-05,-1.9e-05,-1.6e-05,1.4e-05,-2e-06,0,-1.3e-05,2.9e-05,-8e-06,3e-05,-3e-05,1e-06,8e-06,-9e-06,-1e-05,1.5e-05,3.7e-05,7e-06,1.2e-05,-2.1e-05,7e-06,2.4e-05,-3.1e-05,-1.6e-05,-1.4e-05,-5e-06,-5.9e-05,2e-05,4e-06,-2.8e-05,1.6e-05,1.9e-05,-1e-06,-2.5e-05,8e-06,-1.7e-05,-1.2e-05,8e-06
1e-04,5e-06,-4.1e-05,-2e-06,4.9e-05,-1.7e-05,-1e-05,6.1e-05,-1e-05,7e-05,7.6e-05,4e-06,-7.4e-05,-1.8e-05,-2.7e-05,7.9e-05,-7e-06,-5.2e-05,-8e-06,-3.6e-05,1e-06,-1.8e-05,8.7e-05,-7.2e-05,-6.1e-05,0.000107,-3.7e-05,-1.2e-05,3.7e-05,6e-06,-5e-05,-2.1e-05,-1.4e-05,-2.2e-05,-2.7e-05,1.3e-05,-1.5e-05,-8.1e-05,5.2e-05,2.7e-05,-5.8e-05,-3e-05,9e-06,-2.7e-05,-3.1e-05,3.4e-05,-1.7e-05,3.1e-05,2.6e-05,5e-06,7.8e-05,-6.4e-05,2e-06,-5.2e-05,1.2e-05,1.3e-05,0,-6e-05,1.1e-05,2.9e-05,1.5e-05,-4.3e-05,4.2e-05,2.2e-05,8e-06,-4.8e-05,2.2e-05,9e-06,9e-06,-4.5e-05,1.3e-05,0.000128,1.5e-05,-3.5e-05,-4.5e-05,4.5e-05,-2e-05,-2.9e-05,-7e-06,-5e-06,2.1e-05,0,-1.6e-05,-1.6e-05,-1.1e-05,-1.5e-05,-2.1e-05,5e-06,-3e-06,1.3e-05,-2e-06,-2.1e-05,-2e-05,1.7e-05,6e-06,5e-06,-5e-06,-9e-06,-1.5e-05,1.6e-05,0,9e-06,-5e-06,-2e-06,-1.6e-05,-2.6e-05,2.4e-05,1.1e-05,9e-06,2.7e-05,0,4e-06,3e-06,-1.4e-05,-3.9e-05,-1.6e-05,-6e-06,1.1e-05,-6e-06,-7e-06,1.7e-05
4.5e-05,-2.2e-05,1.1e-05,-3.9e-05,3.9e-05,-1.5e-05,1.8e-05,-2.3e-05,-6e-06,-4e-06,4e-06,2.7e-05,-1.9e-05,-2.8e-05,1.2e-05,-9.1e-05,1.4e-05,5e-06,4e-06,3.9e-05,1e-05,2.5e-05,-3.1e-05,-1.6e-05,5.3e-05,-3.4e-05,1.4e-05,-2e-05,-1e-06,5.9e-05,-3.3e-05,3e-06,3.9e-05,-3e-06,7e-06,-2.7e-05,5.8e-05,3.6e-05,-2.4e-05,-1.1e-05,8e-06,1.2e-05,-1.7e-05,1.3e-05,1.2e-05,-5e-06,2.7e-05,2.1e-05,-2.3e-05,7e-06,-3e-06,-9e-06,-6e-06,7e-06,9e-06,-3.2e-05,4e-06,1.7e-05,-4.7e-05,-1.4e-05,-3e-05,-2.3e-05,-1.9e-05,-1e-05,-3.7e-05,2.5e-05,1.3e-05,-1.3e-05,-6.2e-05,-6e-06,2.2e-05,-1.5e-05,4.1e-05,3.6e-05,2.8e-05,-1.2e-05,-2.1e-05,-1e-06,2.6e-05,-8e-06,-1.3e-05,-5e-06,1.1e-05,1.7e-05,1e-06,-1.9e-05,1.9e-05,-9e-06,-2.5e-05,1e-06,1.3e-05,4e-06,-2e-06,-2.3e-05,7e-06,-3e-06,3e-06,-4e-06,-4e-06,-2.1e-05,-5e-06,1.6e-05,-3e-06,-1e-05,-2.1e-05,2.8e-05,-1e-06,-2.1e-05,2.6e-05,-4e-05,-1.2e-05,-3e-06,-6e-06,-5e-06,-9e-06,2e-06,2e-05,1e-05,-2e-06,3e-06,2e-06
-6e-06,-5e-06,9e-06,2.8e-05,-2.7e-05,5.9e-05,-7e-06,5.1e-05,1.3e-05,-4.4e-05,4.2e-05,-2.9e-05,2.5e-05,3.5e-05,8e-06,6.2e-05,-7e-06,-1.4e-05,-8e-06,-2.9e-05,-4e-06,0,2.8e-05,4.1e-05,3.6e-05,1.3e-05,-2.8e-05,7e-06,-3.5e-05,2.2e-05,-1.5e-05,-3.8e-05,-2.1e-05,1e-06,4e-06,-1.6e-05,-5.8e-05,2e-06,-6.4e-05,-1e-06,1.2e-05,1.6e-05,-1.3e-05,3e-06,1.4e-05,-1.9e-05,-2e-05,-7e-06,3.4e-05,4e-06,1.9e-05,3e-06,4e-06,-1.3e-05,-2.2e-05,6e-06,-2.2e-05,3.4e-05,1.4e-05,-9e-06,6.4e-05,3.1e-05,2.5e-05,-2.7e-05,2.5e-05,-1.4e-05,-2.6e-05,-8e-06,1.9e-05,1e-05,-3.1e-05,-3.8e-05,-9e-06,0,-2e-05,-6e-06,-1e-05,-8e-06,-2.2e-05,1e-06,-7e-06,6e-06,-1e-06,4e-06,1.3e-05,-1e-06,-5e-06,4e-06,1.2e-05,8e-06,1.4e-05,-1e-06,-1.3e-05,-3e-06,4e-06,2e-06,5e-06,6e-06,-1.4e-05,-4e-06,0,-4.1e-05,1.2e-05,-1e-06,1e-06,1.8e-05,-1.2e-05,1.3e-05,-1.7e-05,3.6e-05,-5e-06,-9e-06,-8e-06,1.3e-05,-1.2e-05,-1.4e-05,1.5e-05,1e-06,-1.2e-05,1e-06,-1e-05
6e-06,1e-05,-1.1e-05,1.3e-05,3e-06,-4.6e-05,-1.7e-05,-1.3e-05,-1.7e-05,-2.2e-05,-4.2e-05,-5e-05,-2.2e-05,1.3e-05,-2e-05,-2.2e-05,3e-06,1.4e-05,1.1e-05,-3.2e-05,1.1e-05,5e-06,3.2e-05,4e-06,-1.8e-05,1e-05,2.6e-05,-1.9e-05,-3.9e-05,2e-06,2.3e-05,3.6e-05,-2.5e-05,-1.1e-05,-6e-06,2.4e-05,4.2e-05,7e-06,1.7e-05,-9e-06,-1.5e-05,-3.1e-05,9e-06,0,-2.7e-05,3.3e-05,1e-06,8e-06,-3.2e-05,-3.3e-05,-4e-06,7e-06,-2.2e-05,8e-06,4.3e-05,-2.3e-05,6e-06,1e-06,-8e-06,1.1e-05,-7.2e-05,1.9e-05,-2.3e-05,7e-06,1.1e-05,-3e-06,1.1e-05,1.1e-05,-1.4e-05,2.2e-05,-1.2e-05,4.2e-05,4e-06,-3.2e-05,1.3e-05,1.3e-05,2.5e-05,-2e-06,-2e-06,-1.5e-05,-2e-06,-2e-06,-7e-06,-9e-06,-1.5e-05,-2e-06,3e-06,-9e-06,1e-05,-1.4e-05,-4e-06,4e-06,2e-06,-4e-06,-2e-06,-4e-06,-3e-06,6e-06,1.4e-05,2e-05,0,1.6e-05,1e-05,-1.2e-05,1.2e-05,-2e-06,1e-06,-4e-06,1.4e-05,-4e-06,-2e-05,2e-06,-8e-06,-5e-06,0,6e-06,-1e-06,-2e-06,-4e-06,-4e-06,7e-06
-1.7e-05,-1e-05,5e-06,1e-06,-2.3e-05,3.7e-05,8e-06,6e-06,2.2e-05,1.1e-05,-2.4e-05,6.5e-05,3e-06,1e-06,0,-7e-06,-2e-06,-2.7e-05,7e-06,3.6e-05,-1.3e-05,1e-05,-1.6e-05,1.9e-05,-1.2e-05,-1.6e-05,-3e-06,1.4e-05,9e-06,-5e-05,-2.3e-05,-4e-06,-1.9e-05,1.2e-05,-3e-06,2e-05,-3.8e-05,1.1e-05,-1.5e-05,0,-7e-06,1.2e-05,1.8e-05,9e-06,0,-3.8e-05,-2.6e-05,1.3e-05,1.3e-05,-4e-06,-7e-06,2.1e-05,4e-06,-4.7e-05,-3.4e-05,9e-06,1.6e-05,1.5e-05,-9e-06,-5e-06,5.6e-05,-8e-06,-1e-06,2.8e-05,-1e-05,3e-06,1e-06,-4e-06,2.9e-05,0,2.7e-05,-1e-06,-2.5e-05,1.1e-05,1e-06,-3e-06,6e-06,8e-06,6e-06,1.1e-05,2.2e-05,-7e-06,-1e-06,2e-06,0,-3e-06,-6e-06,5e-06,7e-06,-9e-06,4e-06,3e-06,3e-06,-1.2e-05,-1e-06,8e-06,-3e-06,6e-06,1.3e-05,-1e-06,-2e-06,1.4e-05,8e-06,1e-05,4e-06,-4e-06,-2e-06,6e-06,1e-05,2e-06,2.5e-05,-2e-06,-1e-06,-6e-06,-7e-06,-4e-06,-3e-06,-6e-06,9e-06,-1e-06,2e-06
9e-06,-1e-06,-5e-06,-4e-06,1.5e-05,-3.1e-05,8e-06,9e-06,-1.4e-05,3.3e-05,3e-05,-2.9e-05,1.6e-05,-2.8e-05,9e-06,-3.1e-05,1.4e-05,-3e-06,-1e-05,-7e-06,-1e-05,-4e-06,1.2e-05,-1.4e-05,8e-06,-3.8e-05,1.1e-05,-2e-06,1.4e-05,-1.3e-05,-3e-06,0,3e-06,1.6e-05,-6e-06,-7e-06,3.5e-05,-3e-05,1.3e-05,6e-06,2.4e-05,-2.2e-05,0,-3e-06,1e-05,1.5e-05,2e-06,-5e-06,-1.8e-05,1.2e-05,-7e-06,-1.2e-05,-1e-06,2.2e-05,-1.7e-05,3e-06,-9e-06,-2.5e-05,1.4e-05,5e-06,-2.6e-05,-1.6e-05,-9e-06,-9e-06,1.4e-05,-5e-06,-2e-06,-1.6e-05,-1.9e-05,1e-06,-1.3e-05,-3.5e-05,0,1.1e-05,-1.6e-05,1.2e-05,-1.5e-05,0,2e-06,-1.2e-05,-5e-06,1e-06,6e-06,-4e-06,-9e-06,1e-06,2e-06,-4e-06,-9e-06,-3e-06,-8e-06,-4e-06,1.1e-05,-5e-06,-6e-06,2e-06,-2e-06,1e-06,4e-06,-1.5e-05,-1e-06,0,-5e-06,1.1e-05,-3e-06,0,1.4e-05,-8e-06,-9e-06,2e-06,-2e-06,5e-06,-8e-06,5e-06,-6e-06,2e-06,-1.1e-05,-5e-06,0,-3e-06,-2e-06
1.2e-05,6e-06,3e-06,1e-05,-2.1e-05,6e-06,-3e-06,-1e-06,-1.1e-05,2.5e-05,-1.3e-05,1.9e-05,-4e-06,-1.2e-05,-3e-06,2.4e-05,1e-06,3.8e-05,5e-06,1.4e-05,-3e-06,0,-2.9e-05,-2.5e-05,3e-06,1.2e-05,-1.2e-05,-7e-06,2.1e-05,1.4e-05,-5e-06,1e-06,-6e-06,3e-06,1.3e-05,-9e-06,-2.9e-05,4e-06,-8e-06,-2e-06,-2.6e-05,-2e-06,-8e-06,-1.4e-05,-1.4e-05,9e-06,2.4e-05,-6e-06,1.7e-05,1e-05,-5e-06,3e-06,0,-1.1e-05,3e-05,1.9e-05,-5e-06,9e-06,-2.1e-05,0,1e-06,1.3e-05,-6e-06,-1e-06,-8e-06,4e-06,-4e-06,-9e-06,1.9e-05,-2.5e-05,7e-06,2.2e-05,1.1e-05,-2e-05,1.8e-05,1.5e-05,7e-06,-4e-06,-6e-06,1e-06,4e-06,-3e-06,-3e-06,-2e-06,-5e-06,2e-06,-4e-06,-1e-06,-1e-06,3e-06,-1.2e-05,3e-06,-7e-06,0,-2e-06,-3e-06,-2e-06,6e-06,-2e-06,-5e-06,-2e-06,-1.1e-05,-1e-05,-1.1e-05,-3e-06,-4e-06,-1.4e-05,9e-06,1.4e-05,-1.5e-05,-1.1e-05,-2e-06,-6e-06,-1e-06,4e-06,-6e-06,-8e-06,-7e-06,0,0,-5e-06
1.3e-05,-4e-06,-5e-06,-1.1e-05,2e-05,1.3e-05,-4e-06,2e-06,9e-06,-1.1e-05,2e-06,1e-05,5e-06,2e-06,-1e-06,-1.1e-05,-6e-06,-3.4e-05,1e-06,-4.9e-05,2e-06,-2e-06,2.4e-05,1.4e-05,1e-06,1.6e-05,-3e-06,1.3e-05,4e-06,1.6e-05,9e-06,-9e-06,-6e-06,2e-06,-4e-06,1e-06,1.3e-05,-4e-06,2e-06,3e-06,6e-06,-5e-06,-4e-06,7e-06,2.4e-05,-3.4e-05,-4e-06,1.3e-05,-1.1e-05,-1e-06,6e-06,-8e-06,-8e-06,-1e-06,-1.9e-05,-1.1e-05,1e-06,5e-06,-4e-06,-1.1e-05,4e-06,1.1e-05,-1.1e-05,-1.8e-05,0,-6e-06,1e-05,1.6e-05,-2.5e-05,2e-05,1.4e-05,7e-06,4e-06,8e-06,-1.4e-05,-5e-06,2e-05,-1e-06,0,-2e-06,1.1e-05,5e-06,-1e-06,4e-06,-7e-06,3e-06,1e-06,-1e-06,1e-06,0,1e-06,-4e-06,5e-06,3e-06,-4e-06,-1e-06,-1e-06,3e-06,-9e-06,9e-06,-1e-06,1e-06,-9e-06,1e-06,4e-06,1e-06,7e-06,-5e-06,1e-06,8e-06,-1.1e-05,-2e-06,-5e-06,-6e-06,0,-2e-06,0,-5e-06,4e-06,2e-06,-2e-06
1.2e-05,2e-06,1e-06,-6e-06,-2.1e-05,-1.2e-05,4e-06,4e-06,-1.3e-05,-1.1e-05,-8e-06,-8e-06,0,2.4e-05,-1e-06,2e-06,1e-06,2e-06,-1.2e-05,5.1e-05,6e-06,-4e-06,-1.8e-05,1e-06,1.5e-05,1e-06,-2e-06,-1e-05,-1.1e-05,1.7e-05,-1e-06,-1e-06,9e-06,-5e-06,-2e-06,8e-06,1e-06,1.5e-05,2e-06,0,1.7e-05,0,0,-2e-06,-2.7e-05,0,1e-06,0,1e-05,-5e-06,1e-05,1e-06,1.5e-05,-1.4e-05,-3e-06,1e-05,6e-06,-1.7e-05,-4e-06,5e-06,5e-06,-9e-06,1e-05,3e-06,2e-06,-1e-06,-1.2e-05,7e-06,1.1e-05,-5e-06,-2e-05,0,-2e-06,8e-06,0,2e-06,-4e-06,-3e-06,0,-5e-06,0,-2e-06,2e-06,-2e-06,3e-06,2e-06,4e-06,0,-3e-06,0,-8e-06,-3e-06,-1e-06,1e-06,-2e-06,-1e-06,1e-06,-1e-06,-4e-06,0,-1e-06,0,-1e-06,1e-05,0,4e-06,-8e-06,0,0,-2e-06,-1e-06,-1e-06,-2e-06,3e-06,3e-06,-1e-06,3e-06,-6e-06,2e-06,3e-06,-1e-06
6e-06,3e-06,0,4e-06,2.6e-05,7e-06,3e-06,-7e-06,6e-06,1e-06,-2e-06,-2.4e-05,1e-06,5e-06,-4e-06,1.3e-05,-1e-06,2.2e-05,8e-06,-2.9e-05,-3e-06,-5e-06,1.1e-05,4e-06,-2.1e-05,0,-2e-06,2e-06,-1.7e-05,-1.6e-05,-1.3e-05,3e-06,-1.9e-05,-1e-05,-4e-06,-1e-06,-4e-06,-1e-05,-2e-06,-4e-06,-1.4e-05,0,4e-06,-1e-06,2e-05,-1e-06,-8e-06,-8e-06,-1.2e-05,-3e-06,-1.3e-05,6e-06,-1.2e-05,7e-06,1.1e-05,-1.2e-05,-5e-06,4e-06,-1.5e-05,1e-06,-1.4e-05,-4e-06,-6e-06,2e-06,-1e-06,2e-06,4e-06,-2e-06,-1.7e-05,1.1e-05,-7e-06,-1.3e-05,-1e-05,-1.4e-05,9e-06,3e-06,-3e-06,-4e-06,5e-06,2e-06,1e-06,-3e-06,-2e-06,2e-06,-6e-06,1e-06,-1e-06,1e-06,-1e-06,4e-06,-3e-06,1e-06,-5e-06,6e-06,-1e-06,0,1e-06,-2e-06,5e-06,-8e-06,-1e-06,8e-06,4e-06,5e-06,-3e-06,-2e-06,1.2e-05,-3e-06,5e-06,3e-06,7e-06,1e-06,-4e-06,2e-06,-3e-06,1e-06,7e-06,-2e-06,-7e-06,2e-06,1e-06
-4e-06,-5e-06,1e-06,0,-2.1e-05,-9e-06,-5e-06,1.4e-05,-5e-06,-1.4e-05,4e-06,3.2e-05,2e-06,-1.6e-05,2e-06,-4e-06,6e-06,-2e-05,3e-06,1.8e-05,-3e-06,-3e-06,4e-06,3e-06,0,-1e-05,8e-06,1e-06,-5e-06,-7e-06,-6e-06,4e-06,1.1e-05,-3e-06,-5e-06,-7e-06,1e-06,0,1e-06,-1e-06,0,5e-06,-2e-06,3e-06,-1.1e-05,1.2e-05,2e-06,2e-06,2.4e-05,6e-06,8e-06,-2e-06,1.2e-05,-3e-06,-4e-06,5e-06,-2e-06,5e-06,-2e-06,-6e-06,1.2e-05,6e-06,8e-06,5e-06,-7e-06,-2e-06,7e-06,-1.5e-05,1.2e-05,-7e-06,8e-06,1.2e-05,2e-06,1e-06,-1e-05,-2e-06,-2e-06,2e-06,-3e-06,-6e-06,-5e-06,-1e-06,0,-1e-06,-1e-06,2e-06,2e-06,-2e-06,-2e-06,-4e-06,5e-06,1e-06,-3e-06,1e-06,0,2e-06,-1e-06,-2e-06,5e-06,-3e-06,0,-4e-06,5e-06,1e-06,-2e-06,1e-06,-8e-06,3e-06,4e-06,5e-06,-7e-06,2e-06,-2e-06,-5e-06,8e-06,-1e-06,5e-06,-2e-06,1e-06,1e-06,-6e-06
-8e-06,1e-06,-9e-06,-3e-06,6e-06,5e-06,-4e-06,-1.1e-05,1e-06,6e-06,1.4e-05,-3.5e-05,-5e-06,-1.5e-05,0,-1e-06,-3e-06,1e-06,-9e-06,-1.1e-05,-4e-06,0,-8e-06,-1.4e-05,8e-06,1.5e-05,-8e-06,-5e-06,1.3e-05,4e-06,3e-06,-1e-06,5e-06,-6e-06,5e-06,1e-06,1e-06,-1.1e-05,1.4e-05,-2e-06,5e-06,-2e-06,-2e-06,-2e-06,8e-06,2e-06,0,4e-06,-1.9e-05,3e-06,-8e-06,1e-06,-1.1e-05,1e-05,-2e-06,-2e-06,-6e-06,-3e-06,0,8e-06,-3e-06,6e-06,-1e-06,-3e-06,1e-06,1e-06,-7e-06,0,-7e-06,-9e-06,-1.1e-05,1.2e-05,1e-06,1.1e-05,8e-06,7e-06,3e-06,1e-06,1e-06,4e-06,7e-06,0,1e-06,-1e-06,-1e-06,0,-3e-06,1e-06,6e-06,-2e-06,-1e-06,2e-06,1e-06,6e-06,1e-06,-1e-06,0,-2e-06,-1e-06,5e-06,-1e-06,-7e-06,4e-06,-3e-06,2e-06,2e-06,4e-06,2e-06,-5e-06,4e-06,-9e-06,-2e-06,-2e-06,0,3e-06,-1e-06,-4e-06,2e-06,-1e-06,0,1e-06
0,2e-06,1.1e-05,7e-06,-3e-06,-3e-06,3e-06,5e-06,3e-06,2.6e-05,-1.4e-05,1.3e-05,6e-06,7e-06,-4e-06,4e-06,1e-06,8e-06,8e-06,1.7e-05,1e-06,-2e-06,9e-06,2e-06,6e-06,-1.9e-05,5e-06,0,1.3e-05,-2e-06,1e-06,6e-06,-1e-06,-3e-06,-3e-06,6e-06,-2e-06,3e-06,6e-06,2e-06,-1e-06,4e-06,1e-06,0,0,1.1e-05,8e-06,-2e-06,1.5e-05,-5e-06,-4e-06,-3e-06,1e-05,-8e-06,3e-06,4e-06,3e-06,5e-06,-4e-06,0,-4e-06,-3e-06,-1e-06,-1.2e-05,5e-06,0,3e-06,6e-06,1.1e-05,2e-06,2e-06,-2e-05,4e-06,-1.1e-05,-2e-06,5e-06,1e-06,0,-2e-06,-6e-06,-3e-06,3e-06,-1e-06,0,-1e-06,0,2e-06,-1e-06,0,-3e-06,5e-06,0,-1e-06,-2e-06,1e-06,-1e-06,-1e-06,-3e-06,-3e-06,6e-06,0,2e-06,0,0,0,-2e-06,-6e-06,0,8e-06,-8e-06,-6e-06,1e-06,-4e-06,2e-06,5e-06,-1e-06,-4e-06,0,0,0,-1e-06
1e-06,-2e-06,-8e-06,2e-06,8e-06,7e-06,2e-06,-5e-06,-6e-06,-3e-06,8e-06,-1e-05,-2e-06,1.1e-05,0,5e-06,-1e-06,-2e-06,1e-06,-1.4e-05,2e-06,1e-06,-1.4e-05,5e-06,-1e-05,-2e-06,-5e-06,1e-06,3e-06,5e-06,-7e-06,-1.1e-05,4e-06,3e-06,0,-1e-06,2e-06,6e-06,-2e-06,2e-06,-4e-06,-4e-06,-1e-06,2e-06,-5e-06,5e-06,-5e-06,0,-1.4e-05,-4e-06,1.2e-05,5e-06,-1.2e-05,2e-05,-7e-06,-4e-06,1e-06,-7e-06,-1e-06,-7e-06,4e-06,-3e-06,0,9e-06,-4e-06,-1e-06,0,-1e-06,-6e-06,5e-06,9e-06,1e-05,-2e-06,-1e-06,-1e-06,-3e-06,-9e-06,0,2e-06,0,1e-06,-1e-06,-1e-06,0,-4e-06,0,-3e-06,1e-06,1e-06,2e-06,3e-06,0,4e-06,6e-06,1e-06,1e-06,-1e-06,-1e-06,-5e-06,-2e-06,0,4e-06,-3e-06,3e-06,-2e-06,-1e-06,5e-06,-4e-06,1e-06,2e-06,3e-06,0,-2e-06,-4e-06,0,0,-4e-06,1e-06,-4e-06,0,0
6e-06,1e-06,1e-06,-6e-06,-9e-06,-4e-06,-3e-06,1e-06,5e-06,-1.6e-05,-8e-06,-1e-06,-3e-06,4e-06,1e-06,-7e-06,1e-06,-6e-06,-5e-06,-4e-06,-1e-06,0,1.3e-05,-1e-06,8e-06,1.9e-05,4e-06,-4e-06,-7e-06,-7e-06,-1e-06,3e-06,2e-06,3e-06,-2e-06,-7e-06,-3e-06,-4e-06,-1.3e-05,1e-06,0,1e-06,-2e-06,-2e-06,6e-06,-1.4e-05,-7e-06,-1e-06,1.1e-05,1e-06,-7e-06,1e-06,1.2e-05,-9e-06,2e-06,3e-06,-3e-06,-2e-06,-3e-06,8e-06,2e-06,2e-06,-1e-06,5e-06,1e-06,1e-06,-1e-06,-2e-06,4e-06,2e-06,-5e-06,8e-06,-3e-06,9e-06,2e-06,3e-06,-3e-06,-1e-06,1e-06,-2e-06,6e-06,1e-06,1e-06,0,-1e-06,-1e-06,3e-06,-1e-06,-5e-06,1e-06,-2e-06,1e-06,3e-06,-3e-06,0,0,1e-06,-1e-06,0,-2e-06,0,-2e-06,-4e-06,0,-2e-06,0,-1e-06,2e-06,-2e-06,-7e-06,2e-06,1e-06,-4e-06,0,1e-06,-1e-06,-2e-06,0,3e-06,-1e-06,0
2e-06,1e-06,2e-06,1e-06,4e-06,-3e-06,-1e-06,1e-06,-6e-06,0,6e-06,-1.1e-05,5e-06,-6e-06,-3e-06,0,-1e-06,1e-06,4e-06,1e-05,-1e-06,1e-06,-1e-05,3e-06,-8e-06,-7e-06,-2e-06,4e-06,-1e-05,-2e-06,-2e-06,0,3e-06,4e-06,0,-2e-06,2e-06,3e-06,-8e-06,0,2e-06,-7e-06,-1e-06,1e-06,-4e-06,3e-06,1e-06,0,-1.1e-05,4e-06,5e-06,-1e-06,-1.2e-05,1.2e-05,4e-06,-4e-06,-2e-06,5e-06,-8e-06,-1e-06,-6e-06,3e-06,-4e-06,-5e-06,0,0,-1e-06,-3e-06,-6e-06,2e-06,1e-06,-9e-06,0,-8e-06,-4e-06,-2e-06,1e-06,-2e-06,-1e-06,-2e-06,2e-06,-3e-06,-1e-06,1e-06,-3e-06,-1e-06,-1e-06,0,2e-06,-2e-06,2e-06,-1e-06,-2e-06,3e-06,0,0,0,0,4e-06,2e-06,0,-2e-06,-2e-06,-3e-06,2e-06,0,0,3e-06,4e-06,5e-06,-7e-06,-1e-06,-1e-06,3e-06,2e-06,0,3e-06,-1e-06,2e-06,0,-2e-06
-3e-06,-1e-06,-1e-06,3e-06,1e-06,7e-06,2e-06,-1e-06,1e-06,-4e-06,1e-06,1.2e-05,-5e-06,-7e-06,0,-5e-06,-1e-06,9e-06,-3e-06,-1e-05,-3e-06,0,8e-06,-5e-06,3e-06,-2e-06,-1e-06,-2e-06,-5e-06,1e-05,5e-06,1e-06,4e-06,3e-06,2e-06,4e-06,1e-06,-1e-05,1e-06,-2e-06,0,0,1e-06,0,1e-06,-2e-06,3e-06,1e-06,3e-06,2e-06,5e-06,-2e-06,1e-05,-5e-06,-7e-06,-1e-06,1e-06,-6e-06,-4e-06,-6e-06,2e-06,-1e-06,0,-7e-06,-1e-06,-1e-06,4e-06,8e-06,1e-06,-9e-06,4e-06,-3e-06,1e-06,0,3e-06,-2e-06,3e-06,0,-1e-06,1e-06,0,3e-06,-1e-06,-1e-06,-3e-06,0,1e-06,-1e-06,-2e-06,2e-06,-3e-06,-1e-06,2e-06,-2e-06,-1e-06,-1e-06,0,1e-06,2e-06,1e-06,0,-1e-06,1e-06,-3e-06,1e-06,0,-2e-06,1e-06,1e-06,-2e-06,-4e-06,0,-2e-06,-2e-06,-4e-06,-1e-06,4e-06,-1e-06,-2e-06,0,3e-06
-5e-06,1e-06,-2e-06,-3e-06,-4e-06,-8e-06,0,0,0,0,-2e-06,-8e-06,-1e-06,0,1e-06,3e-06,-1e-06,-1.1e-05,-1e-06,8e-06,-2e-06,1e-06,-1e-06,-3e-06,2e-06,2e-06,1e-06,-1e-06,5e-06,0,-5e-06,2e-06,1e-06,0,-2e-06,3e-06,-5e-06,6e-06,5e-06,-1e-06,-2e-06,-5e-06,2e-06,-2e-06,1e-06,-6e-06,5e-06,-1e-06,-2e-06,-3e-06,-9e-06,-4e-06,-1e-05,9e-06,4e-06,0,1e-06,3e-06,-5e-06,7e-06,6e-06,-1e-06,-2e-06,4e-06,1e-06,1e-06,-4e-06,-1e-06,-1e-06,0,-8e-06,9e-06,3e-06,6e-06,-2e-06,4e-06,-5e-06,0,2e-06,-3e-06,-1e-06,-1e-06,1e-06,0,-1e-06,-1e-06,0,0,1e-06,-2e-06,-3e-06,0,-2e-06,0,-1e-06,0,0,1e-06,0,-1e-06,0,2e-06,2e-06,0,0,1e-06,-1e-06,-2e-06,-5e-06,4e-06,-1e-06,-1e-06,-1e-06,-1e-06,0,1e-06,3e-06,-3e-06,-1e-06,0,-1e-06
-5e-06,1e-06,6e-06,0,2e-06,7e-06,-1e-06,0,-2e-06,1.3e-05,-3e-06,1e-06,3e-06,4e-06,-2e-06,-4e-06,0,-1e-06,2e-06,-1.4e-05,1e-06,0,-1e-06,4e-06,4e-06,0,-3e-06,2e-06,9e-06,0,-3e-06,-2e-06,1e-06,-1e-06,-1e-06,-3e-06,8e-06,-2e-06,4e-06,0,3e-06,-1e-06,1e-06,2e-06,-5e-06,-3e-06,-2e-06,0,-1e-06,-2e-06,4e-06,0,1.1e-05,-2e-06,0,-1e-06,-1e-06,5e-06,-4e-06,-2e-06,-1.2e-05,2e-06,0,5e-06,0,-2e-06,0,-5e-06,1e-06,0,-2e-06,-3e-06,-2e-06,-5e-06,0,0,1e-06,0,0,2e-06,1e-06,2e-06,0,-1e-06,-2e-06,0,0,0,-1e-06,0,0,0,-2e-06,-2e-06,-1e-06,1e-06,0,1e-06,-2e-06,-3e-06,0,2e-06,2e-06,1e-06,-1e-06,0,3e-06,-2e-06,6e-06,0,3e-06,0,-2e-06,2e-06,-4e-06,-1e-06,0,-1e-06,2e-06,0,1e-06
-2e-06,-1e-06,-8e-06,4e-06,-3e-06,-4e-06,0,0,3e-06,0,3e-06,9e-06,-5e-06,5e-06,0,6e-06,2e-06,1.2e-05,-2e-06,1.3e-05,0,-1e-06,3e-06,0,-8e-06,-4e-06,3e-06,-3e-06,4e-06,-9e-06,-4e-06,-1e-06,-1e-06,-1e-06,-2e-06,-4e-06,-9e-06,5e-06,1e-06,1e-06,0,0,-1e-06,0,6e-06,1e-06,-2e-06,2e-06,3e-06,2e-06,-1e-06,1e-06,-1e-05,1e-06,-4e-06,3e-06,-1e-06,-2e-06,1e-06,-5e-06,1.1e-05,3e-06,1e-06,-2e-06,-1e-06,1e-06,3e-06,-1e-06,2e-06,6e-06,2e-06,-7e-06,0,-2e-06,1e-06,-1e-06,4e-06,0,0,-3e-06,-1e-06,-2e-06,-1e-06,0,-2e-06,0,0,0,2e-06,-1e-06,-3e-06,1e-06,-2e-06,-2e-06,-1e-06,0,0,1e-06,-2e-06,0,0,-1e-06,1e-06,-1e-06,0,0,-1e-06,1e-06,-2e-06,-2e-06,-2e-06,0,-1e-06,-1e-06,0,0,-4e-06,-2e-06,-1e-06,-1e-06,-1e-06
1e-06,0,6e-06,-1e-06,5e-06,-1e-06,1e-06,2e-06,-4e-06,-8e-06,-1e-06,-6e-06,2e-06,1e-06,1e-06,0,0,-1e-05,2e-06,-1e-05,-1e-06,0,-5e-06,2e-06,4e-06,2e-06,-3e-06,1e-06,-5e-06,-4e-06,4e-06,1e-06,2e-06,-2e-06,0,1e-06,1e-05,-1e-06,-1e-06,1e-06,-1e-06,0,0,-1e-06,-6e-06,-1e-06,-5e-06,-1e-06,-3e-06,2e-06,-6e-06,4e-06,1.1e-05,0,3e-06,0,0,3e-06,-2e-06,6e-06,-6e-06,0,-2e-06,-2e-06,0,0,-1e-06,4e-06,-1e-06,0,-3e-06,9e-06,-1e-06,4e-06,-2e-06,0,2e-06,0,0,0,-3e-06,0,0,0,-2e-06,0,-1e-06,0,1e-06,0,1e-06,0,3e-06,-1e-06,0,-1e-06,-1e-06,1e-06,1e-06,1e-06,0,-2e-06,-1e-06,-2e-06,1e-06,0,0,0,-1e-06,-1e-06,-6e-06,0,-2e-06,-2e-06,-3e-06,-1e-06,-3e-06,-1e-06,-3e-06,-1e-06,1e-06
2e-06,0,-3e-06,-2e-06,-3e-06,2e-06,0,0,2e-06,-2e-06,0,6e-06,1e-06,-4e-06,-1e-06,1e-06,0,-2e-06,-2e-06,6e-06,-2e-06,-1e-06,5e-06,-1e-06,0,1e-06,3e-06,0,-9e-06,9e-06,-4e-06,1e-06,-1e-06,-1e-06,1e-06,3e-06,-1.1e-05,-2e-06,-2e-06,0,0,0,1e-06,0,5e-06,-1e-06,3e-06,-2e-06,6e-06,0,5e-06,1e-06,-1.1e-05,2e-06,-2e-06,2e-06,2e-06,-2e-06,-3e-06,-2e-06,2e-06,-1e-06,2e-06,-2e-06,3e-06,-1e-06,0,5e-06,2e-06,-1e-06,2e-06,-1e-06,1e-06,-2e-06,2e-06,-4e-06,1e-06,-1e-06,1e-06,-2e-06,2e-06,0,0,0,-1e-06,0,1e-06,0,-1e-06,2e-06,1e-06,0,-2e-06,-2e-06,0,0,0,0,3e-06,0,0,1e-06,-1e-06,0,0,0,-3e-06,0,2e-06,-3e-06,-1e-06,0,-1e-06,1e-06,-1e-06,0,-1e-06,0,1e-06,0,1e-06
0,-1e-06,1e-06,1e-06,4e-06,0,0,-1e-06,-2e-06,-6e-06,2e-06,-3e-06,-3e-06,-5e-06,-1e-06,1e-06,-1e-06,9e-06,-1e-06,-3e-06,-2e-06,0,-4e-06,-4e-06,0,2e-06,-1e-06,-2e-06,-4e-06,4e-06,0,-1e-06,-1e-06,0,0,-1e-06,1.1e-05,0,-2e-06,0,0,2e-06,0,-1e-06,-3e-06,8e-06,3e-06,2e-06,-4e-06,-3e-06,-3e-06,-1e-06,1.1e-05,-2e-06,-1e-06,-4e-06,0,-2e-06,-3e-06,-2e-06,-2e-06,1e-06,0,3e-06,-1e-06,1e-06,0,-4e-06,-4e-06,-6e-06,3e-06,-4e-06,1e-06,-1e-06,0,-1e-06,-1e-06,-1e-06,0,-1e-06,2e-06,0,0,1e-06,-2e-06,0,-1e-06,0,0,-1e-06,0,0,4e-06,0,0,0,0,0,1e-06,-1e-06,0,1e-06,-1e-06,2e-06,-1e-06,0,3e-06,-1e-06,-1e-06,4e-06,0,0,-1e-06,0,-1e-06,0,1e-06,0,2e-06,0,0
-5e-06,0,0,-2e-06,-4e-06,0,0,0,0,2e-06,-5e-06,4e-06,3e-06,1e-06,0,1e-06,0,-4e-06,3e-06,3e-06,0,0,4e-06,2e-06,-1e-06,0,1e-06,1e-06,4e-06,3e-06,-6e-06,1e-06,0,0,0,-3e-06,-1e-05,0,1e-06,-1e-06,1e-06,-2e-06,0,0,1e-06,2e-06,0,0,6e-06,-1e-06,-2e-06,-1e-06,-1.1e-05,-2e-06,2e-06,3e-06,-1e-06,4e-06,-5e-06,4e-06,6e-06,2e-06,0,2e-06,-2e-06,-1e-06,-1e-06,-3e-06,3e-06,2e-06,-1e-06,2e-06,0,2e-06,0,1e-06,3e-06,-1e-06,0,0,0,1e-06,0,-1e-06,-1e-06,0,1e-06,0,-2e-06,0,3e-06,-1e-06,0,-1e-06,0,0,0,0,-1e-06,0,0,0,0,0,0,0,0,1e-06,-4e-06,-2e-06,2e-06,0,-1e-06,-1e-06,0,0,3e-06,0,-1e-06,0,0
-5e-06,0,1e-06,-3e-06,6e-06,0,0,-1e-06,0,1.4e-05,6e-06,-9e-06,-1e-06,5e-06,0,-2e-06,0,-5e-06,-4e-06,1e-06,0,0,-1e-06,1e-06,2e-06,-6e-06,0,-1e-06,8e-06,-9e-06,2e-06,-2e-06,-2e-06,1e-06,-1e-06,1e-06,9e-06,4e-06,4e-06,-1e-06,-3e-06,1e-06,0,0,0,-2e-06,-2e-06,-2e-06,-6e-06,2e-06,3e-06,-1e-06,1e-05,-1e-06,-2e-06,-3e-06,0,-3e-06,-5e-06,-3e-06,-9e-06,0,0,-1e-06,1e-06,1e-06,0,0,-4e-06,2e-06,1e-06,3e-06,0,-1e-06,1e-06,-1e-06,0,-1e-06,0,-1e-06,0,-1e-06,0,0,-2e-06,0,0,0,1e-06,-1e-06,-1e-06,0,1e-06,2e-06,0,0,0,-1e-06,-2e-06,1e-06,0,0,1e-06,0,0,0,1e-06,-1e-06,4e-06,4e-06,-4e-06,0,-1e-06,0,1e-06,0,2e-06,0,-1e-06,1e-06,0
-5e-06,0,-3e-06,2e-06,-6e-06,0,0,1e-06,-1e-06,-1e-06,-3e-06,9e-06,0,3e-06,-1e-06,-1e-06,0,6e-06,1e-06,-4e-06,-1e-06,0,0,1e-06,-4e-06,4e-06,-2e-06,0,4e-06,-7e-06,-2e-06,1e-06,0,0,0,3e-06,-8e-06,-2e-06,2e-06,0,2e-06,-2e-06,0,0,-1e-06,2e-06,-3e-06,1e-06,6e-06,2e-06,-1e-06,0,-1e-05,-1e-06,0,4e-06,1e-06,0,-3e-06,0,8e-06,-1e-06,0,-3e-06,1e-06,0,1e-06,3e-06,4e-06,3e-06,0,-3e-06,-1e-06,0,-1e-06,0,-3e-06,0,0,0,0,0,0,0,-1e-06,0,0,0,-2e-06,0,-1e-06,0,-2e-06,-1e-06,0,0,0,0,-1e-06,0,0,-1e-06,1e-06,-1e-06,0,0,-3e-06,0,-3e-06,0,-5e-06,0,-1e-06,0,0,0,0,-1e-06,1e-06,0,1e-06
1e-06,0,5e-06,2e-06,4e-06,-2e-06,0,-2e-06,2e-06,-7e-06,2e-06,-1.4e-05,2e-06,-2e-06,0,2e-06,1e-06,1e-06,3e-06,6e-06,-1e-06,0,0,1e-06,0,2e-06,2e-06,1e-06,-3e-06,6e-06,1e-06,1e-06,-1e-06,0,0,0,8e-06,3e-06,-2e-06,1e-06,1e-06,-2e-06,0,0,2e-06,-2e-06,3e-06,1e-06,-8e-06,-1e-06,0,1e-06,1e-05,-1e-06,1e-06,-4e-06,0,2e-06,-1e-06,2e-06,-4e-06,1e-06,-2e-06,0,0,0,0,1e-06,-4e-06,-2e-06,-2e-06,-2e-06,1e-06,0,1e-06,-1e-06,-1e-06,0,0,-2e-06,1e-06,-1e-06,0,-1e-06,-2e-06,0,0,0,2e-06,1e-06,0,0,2e-06,4e-06,0,0,0,-1e-06,1e-06,0,0,0,0,0,0,0,2e-06,0,-2e-06,-1e-06,0,0,-1e-06,0,4e-06,0,-2e-06,-1e-06,0,0,-1e-06
