-0.000612,-0.00209,-0.001758,-0.00154,-0.001135,-0.000808,-0.000561,-0.00198,-0.001738,-0.001795,-0.001592,-0.000954,-0.001349,-0.001949,-0.001899,-0.001663,-0.00124,-0.000876,-0.000742,-0.001987,-0.001127,-0.001653,-0.001097,-0.001221,-0.001454,-0.001333,-0.001515,-0.001343,-0.000917,-0.001159,-0.001062,-0.0021,-0.001653,-0.001205,-0.000455,-0.001419,-0.001387,-0.002136,-0.00301,-0.001748,-0.001187,-0.001251,-0.001644,-0.001955,-0.000933,-0.002667,-0.002488,-0.001554,-0.001747,-0.001442,-0.000812,-0.00098,-0.002004,-0.001077,-0.000671,-0.00131,-0.001511,-0.002043,-0.001322,-0.002652,-0.001646,-0.001353,-0.001045,-0.000618,-0.000495,-0.001234,-0.001334,-0.001196,-0.001279,-0.002385,-0.00258,-0.001639,-0.001666,-0.001774,-0.00145,-0.001725,-0.001028,-0.000783,-0.001234,-0.001568,-0.0015,-0.000933,-0.000889,-0.001311,-0.001144,-0.001373,-0.001972,-0.001527,-0.000722,-0.000962,-0.001632,-0.000978,-0.000721,-0.001478,-0.001941,-0.002317,-0.00117,-0.000753,-0.000688,-0.001128,-0.00093,-0.001579,-0.002112,-0.001284,-0.001153,-0.001076,-0.001172,-0.001627,-0.00144,-0.001179,-0.001008,-0.001581,-0.000982,-0.001257,-0.000675,-0.001065,-0.001111,-0.001312,-0.001246,-0.001216,-0.000942
7.8e-05,0.000948,0.000513,0.00046,0.000234,0.000248,0.000579,0.00165,0.000855,0.001073,0.000903,-5.3e-05,0.000163,0.001032,0.001588,0.001079,0.000442,0.000334,-0.000251,0.001352,0.000785,0.000633,0.000641,5.6e-05,0.000449,0.000429,0.000722,0.000425,0.000245,0.000161,0.000128,0.001107,0.000486,0.000354,0.000342,0.000921,0.000406,0.000859,0.00196,0.001127,0.000565,0.000542,0.001172,0.000848,0.000282,0.001494,0.001448,0.000694,0.000846,0.000722,0.000643,0.000521,0.001072,0.00067,0.000135,0.000474,0.000833,0.000931,0.000606,0.002243,0.000873,0.000779,0.000473,1e-04,0.000108,0.000428,0.000441,0.00056,0.000755,0.000845,0.001553,0.000937,0.000938,0.000723,0.000634,0.000451,9.9e-05,0.000162,0.00019,0.000359,0.000426,0.000363,0.00031,0.000598,0.000583,0.000684,0.001113,0.000887,0.000149,0.000205,0.000865,0.00058,0.000378,0.000303,0.000596,0.00155,0.000738,0.000431,7.1e-05,7.2e-05,0.000528,0.000957,0.00118,0.000414,0.000154,0.000113,0.000716,0.000867,0.000485,0.000569,0.000192,0.000506,0.000309,0.000796,0.000505,0.000473,0.000653,0.000763,0.000566,0.00044,0.000324
0.000391,0.000257,0.00026,-0.000283,-0.000152,-0.00019,-0.000386,-0.00118,-0.000366,-0.000872,-0.000536,-5e-06,0.000464,-0.000132,-0.000866,-0.000507,-0.000202,-0.000381,0.000422,-0.000658,-0.000565,-0.000336,-0.000548,0.000265,0.000211,-0.00013,-0.000236,9e-06,-0.000198,5e-06,0.000127,-0.000693,-8.7e-05,-0.000158,-0.000332,-0.000965,-5.9e-05,-0.000475,-0.001315,-0.000475,-0.00023,-0.000277,-0.000792,-0.000383,4.2e-05,-0.000981,-0.00097,-0.000392,-0.000331,-0.000408,-0.000423,-0.000457,-0.000477,-0.000468,-0.000257,-0.000257,-0.000371,0.000137,6.3e-05,-0.001328,-0.000773,-0.000233,-0.000584,-0.000271,0.000127,-0.000318,-0.000468,-0.000501,-0.000819,-0.000697,-0.000708,-0.000416,-0.000936,-0.000146,-0.000157,6.3e-05,-0.000393,7.4e-05,0.000186,0.000193,2e-04,0.000217,-0.000189,-0.000529,-0.000649,-0.000421,-0.000648,-0.000435,7.8e-05,-0.000195,-0.000569,-0.000316,-0.000202,-0.000248,0.000252,-0.000869,-0.000502,-0.000221,-5e-06,0.000482,1.7e-05,-0.000586,-0.000658,-3.5e-05,0.00038,-0.000145,-0.000224,-0.000319,-7.4e-05,-0.000173,2.8e-05,-2.9e-05,-0.000504,-0.000469,-0.00043,-0.000317,-0.000582,-0.000491,-0.000411,-0.000414,-2e-04
-0.000337,-0.000629,-0.000567,0.000145,-0.000293,0.000108,-2.9e-05,0.000635,-0.000256,0.000357,0.00016,-0.000226,-0.00063,-0.000118,0.000515,0.000155,-4.9e-05,-0.000178,-0.000184,0.000275,0.000122,-0.000134,0.000239,8e-06,-0.000143,-0.00042,-0.000158,-0.000498,-1.7e-05,0.000161,-1.4e-05,0.000277,-0.000178,7.5e-05,-7.7e-05,0.000357,-0.000331,0.000126,0.000586,-4.2e-05,-8.1e-05,-6e-06,0.000317,2.2e-05,-0.000338,0.000393,-0.000116,-0.000196,9e-05,-0.000167,-0.000114,-4.3e-05,-0.000135,-0.000184,7.8e-05,0.000111,8.7e-05,-0.000504,-0.00094,0.000381,0.000417,-0.000205,0.000279,-2.9e-05,-0.000134,0.000188,0.000174,0.000252,9.3e-05,-0.000134,-8.3e-05,0.000301,0.000804,-0.000272,-0.000104,-0.000295,0.00054,-3.7e-05,-0.000485,-0.000375,-0.000233,-0.000396,-2.9e-05,0.000249,0.000205,-4e-06,-5.7e-05,-0.000279,-6.3e-05,6.4e-05,6.1e-05,-0.000153,-0.000155,9.7e-05,-0.000499,0.000285,7.5e-05,-6.2e-05,0.000336,-0.000223,2.4e-05,1.2e-05,0.000275,-0.000233,-0.000373,-1.7e-05,-0.000637,-0.000261,-0.000218,-0.000278,-0.000115,-0.000249,0.000229,0.000391,5.3e-05,0.000117,0.000493,6e-05,0.000181,0.000199,0.000271
0.000289,0.000502,0.000231,2.5e-05,0.000508,-1.9e-05,-0.000155,-0.000131,0.000441,-0.000383,-0.000358,0.000474,0.000375,-2.6e-05,-0.000373,-0.000113,0.000325,0.000146,4.8e-05,-0.000109,5.8e-05,0.000478,6.9e-05,-3.9e-05,-0.000186,3.3e-05,0.000338,0.000558,-7e-05,-0.00019,-5.5e-05,0.000154,0.000193,-2.7e-05,-9.5e-05,3.1e-05,0.000446,-0.000309,-0.000304,0.000121,0.00026,-6.9e-05,-0.000224,0.00014,-5.6e-05,-8.8e-05,0.000921,0.000678,0,0.000295,0.000105,4.8e-05,0.000158,0.000261,4.7e-05,-4e-06,0.000199,0.000312,0.000618,0.000119,-0.00013,2.1e-05,-2.9e-05,0.000192,8.2e-05,-0.00023,-0.000181,-0.00017,-7.7e-05,5.3e-05,0.000101,0.00039,-0.000613,0.00044,3.6e-05,0.00011,-0.000164,-3.1e-05,0.000356,0.000486,-1.4e-05,-6.4e-05,3e-05,-1e-05,-9.8e-05,0.000156,0.000317,0.000419,0.000148,2e-06,0.00012,0.000327,1.9e-05,0.000119,0.000739,0.000158,4.9e-05,4.4e-05,-0.000182,-0.000237,-0.000155,-0.000161,-0.000293,0.000135,0.000144,5e-06,0.000404,0.000437,0.00036,0.000302,-0.000177,0.000363,-8.2e-05,-0.000205,0.000147,0.000155,-0.000253,0.000199,-0.000242,-0.000203,-0.000349
-8.5e-05,-0.000172,0.000157,9.5e-05,-0.00018,0.000286,1.9e-05,0.000276,-0.000384,0.000288,0.000144,-0.00011,-0.000193,1.9e-05,3.6e-05,0.000243,-0.000274,-0.000125,5e-06,0.000268,-0.000335,-0.000335,-6e-05,-9.8e-05,0.000298,0.000428,-0.000376,-0.000464,0.00015,0.00013,-0.000297,-0.000107,-0.000283,-0.000188,1e-04,-0.000277,-0.000353,0.000295,0.000427,-2.3e-05,-0.000268,6.5e-05,0.000455,-0.000219,0,-5.6e-05,-0.000838,-0.000772,0.000166,-0.000304,-3.2e-05,0.000141,0.000176,-0.000308,-0.000109,-3.4e-05,-0.000134,-0.000272,0.000105,-0.000192,0.000171,5.3e-05,0.000156,1e-06,9.3e-05,0.000148,0.000149,0.000251,6.3e-05,-0.000321,-0.00014,-0.000592,0.00036,-0.000488,-0.000158,0.000131,8e-05,2e-06,-0.000127,-0.000435,0.000174,0.000245,3.9e-05,-0.000109,0.000119,0.000107,-0.000243,-0.000285,-0.000417,-6e-06,-5.4e-05,-0.000297,0.000194,-4.7e-05,-0.000674,-4.3e-05,-7.1e-05,-3.9e-05,9.4e-05,0.000392,-6.5e-05,0.000359,0.000262,-0.000233,-0.000134,-0.000238,-0.000297,-0.000305,-0.000293,-0.000207,-7e-06,-0.000262,-5.2e-05,8.2e-05,-0.000245,-6.4e-05,-2e-05,-0.000137,0.000149,0.000229,0.000511
0.000312,-0.000111,-0.000199,-0.000161,1.3e-05,-0.000356,-7e-06,-7.8e-05,0.00018,0.000192,0.000182,0.000222,0.000182,-0.000135,-3.6e-05,-0.000375,2e-04,0.000128,0.000185,-0.000212,0.000272,-1e-06,2.9e-05,9.3e-05,-0.000232,-0.00033,0.000277,0.000261,5.2e-05,-8.2e-05,0.000387,-0.000102,0.000122,0.000384,4.6e-05,-0.000175,0.000271,-6.8e-05,-0.000485,-0.000258,0.000114,-0.00013,-0.00038,0.000208,3e-06,-3e-06,0.000472,0.000406,-0.000148,0.000298,0.000265,0.000126,-0.000286,0.00043,-7.7e-05,-5.6e-05,-0.000269,-2.2e-05,-0.000326,-6e-05,-0.00025,3e-06,-3.7e-05,6.4e-05,6.3e-05,3.7e-05,0.000211,-0.00018,-0.000157,0.000299,5.3e-05,0.000347,-2e-04,0.000376,8.3e-05,1.4e-05,-0.000137,-0.000273,0.000102,0.000278,-6.7e-05,-0.00014,0.000105,8.1e-05,8e-06,-6.6e-05,0.000144,0.000239,0.00048,0.000226,-0.000108,6.4e-05,-0.000139,2.8e-05,0.000181,-0.000115,-8.3e-05,0.000176,-1.2e-05,-0.000202,7e-05,-0.000116,-5.1e-05,0.000133,0.000233,0.000104,0.000181,9e-06,0.000143,0.000132,3.8e-05,-0.000105,0.000116,-0.000115,0.00013,0.000106,0.00018,7.3e-05,5.2e-05,-0.000128,-0.000501
-0.000153,6.5e-05,-5.8e-05,0.000155,0.000121,0.000269,5.9e-05,0.000254,9.6e-05,-0.00024,-0.000257,-0.000355,2.1e-05,2e-06,-1.8e-05,0.000498,-9.9e-05,-0.00022,8.8e-05,8.3e-05,-0.000103,0.000128,-4.6e-05,-5.9e-05,-2.6e-05,0.000203,-0.000406,-0.000162,-1e-04,9.1e-05,-0.000337,7.4e-05,-9.5e-05,-0.000335,-0.000114,0.000257,-0.000488,-4.3e-05,0.000303,0.000303,-1e-05,0.000114,0.00024,-0.000288,-7.1e-05,4.7e-05,-0.000145,-0.000211,9.7e-05,-0.000115,-0.000333,-5.7e-05,0.000232,-0.000338,9.5e-05,0.000128,0.000393,0.000113,8.2e-05,0.000158,0.000369,0.000195,-0.00018,-0.000159,-4.8e-05,-1.4e-05,-0.000245,0,0.000225,0.000217,-4.4e-05,1.7e-05,-7.8e-05,-0.000279,1e-05,-0.000124,5.1e-05,0.000483,1e-04,2.4e-05,-2.2e-05,4.7e-05,-1.8e-05,-2.3e-05,-1.3e-05,8.2e-05,-3.4e-05,-0.000215,-0.000207,-0.000264,6e-06,-2.2e-05,-0.000127,-8.5e-05,0.000142,0.000143,8.6e-05,-7.7e-05,-0.000192,5.8e-05,-8.2e-05,0.000153,-0.000158,-8.3e-05,-0.000305,-7.1e-05,-6.7e-05,-5.6e-05,-0.00015,0.000105,-0.000114,0.000187,2e-05,0.000109,-0.000206,-2.3e-05,-6.6e-05,-7.8e-05,-2.9e-05,9.7e-05,0.000414
-0.000217,-0.000127,0.000191,-0.000212,-0.000189,5e-05,-0.000118,-0.00032,-1e-04,6.6e-05,0.000208,0.000161,-6e-05,0.000222,-5.4e-05,-0.000345,-9.3e-05,0.000119,-0.000226,4.3e-05,0.000117,-0.000162,5e-06,9.1e-05,0.000149,-0.00019,0.000302,0.000203,0.000104,-9.1e-05,0.000109,-0.000111,8e-06,0.00034,3.4e-05,-5.8e-05,0.000356,0.000159,-0.000245,-0.000236,8.5e-05,-7e-06,-0.000144,0.000223,3e-05,-1.4e-05,7.7e-05,-7.4e-05,-0.00018,7e-06,0.00021,4.2e-05,-0.000195,9.3e-05,4.8e-05,-3.1e-05,-0.000104,-8.1e-05,-2.6e-05,-0.000306,-0.000418,-8.3e-05,0.000237,0.00017,-3.7e-05,1.5e-05,3.4e-05,-2.4e-05,-0.000204,-2.3e-05,-6.7e-05,-0.000299,0.000139,0.000278,2.1e-05,0.00022,-7e-06,-0.000278,-0.000122,-0.000248,-4.5e-05,-8.6e-05,-0.000128,3.4e-05,-6.8e-05,-0.000228,-1.2e-05,1.8e-05,0.000104,7.5e-05,1e-04,2.2e-05,0.000266,5.7e-05,-3e-05,-9e-05,1.6e-05,0.000155,0.00022,3e-05,1e-06,-2.7e-05,0.000218,0.000163,7.5e-05,0.000305,9.2e-05,-0.000118,-0.00012,-0.000164,0.00021,-0.000176,-6.6e-05,-0.000339,4.4e-05,-0.000162,6.1e-05,-1.1e-05,-0.000128,-0.000146,-0.000272
-2e-05,9.9e-05,-8.9e-05,0.000206,0.000186,-0.000179,3.5e-05,0.000101,4.7e-05,9.9e-05,-5e-05,-6.9e-05,4.2e-05,-0.000116,4.5e-05,0.000359,9e-05,-0.000165,-3.9e-05,-9.4e-05,-0.000143,0.000213,0.000171,-9.7e-05,-5.2e-05,6.1e-05,-7.1e-05,-3.1e-05,-8.2e-05,0.00014,-3.8e-05,-5e-06,0.000141,-0.00026,-5.5e-05,2e-04,-7.1e-05,-0.000269,0.000147,0.000136,-6.2e-05,-0.000129,-4.7e-05,5.9e-05,-3.1e-05,-5e-06,-0.000118,0.000131,0.000105,-2e-06,-3.1e-05,-8.4e-05,9.9e-05,2.9e-05,4e-06,-5.4e-05,-7.8e-05,0,-2.2e-05,3.6e-05,0.000175,-2.4e-05,-0.000172,-2.8e-05,-8e-05,-4.5e-05,-1.9e-05,-3.8e-05,5.2e-05,-0.000161,0.000178,0.000254,-1.6e-05,-0.000341,-8.9e-05,-0.000254,-0.000108,1.7e-05,6e-06,0.000205,-2.3e-05,-1.5e-05,5.6e-05,-6e-06,0.000136,0.000139,-7.6e-05,-1.6e-05,1.4e-05,-6.7e-05,-5.5e-05,-4.7e-05,-0.000298,6.9e-05,-9.8e-05,3.3e-05,-0.000104,-0.000125,-0.000127,0.000123,0.000155,5.3e-05,4.8e-05,-4.6e-05,3.2e-05,-0.000265,-7.3e-05,0.000136,0.000128,7.1e-05,-9.1e-05,3.9e-05,1.4e-05,0.000216,2e-05,2e-04,4.8e-05,9.5e-05,0.000108,9.9e-05,2.5e-05
7e-05,-0.000154,-0.000132,-0.00015,-8.1e-05,0.000114,-8.8e-05,-0.000171,-0.000143,-0.000153,-0.000146,0.000134,-0.000149,-6.8e-05,-8e-06,-0.000216,-4.8e-05,0.000124,-0.000125,7.9e-05,0.000219,-0.000148,-0.000152,8.1e-05,4.4e-05,7.4e-05,5.3e-05,-4.5e-05,9.9e-05,-0.000185,-3e-06,2.2e-05,-9.9e-05,0.000248,1.5e-05,-0.000172,9e-06,0.000246,-2e-06,-6.8e-05,6.1e-05,0.000184,-7.5e-05,-0.00012,9.7e-05,0.000102,0.000129,-2.7e-05,7.5e-05,9.9e-05,-0.000108,1.7e-05,-2.2e-05,-1e-06,3e-06,3.5e-05,-5.2e-05,-1.6e-05,8.7e-05,0.000105,-4.5e-05,0.000143,0.000102,-1e-05,-3.7e-05,-3.9e-05,-9e-06,3e-05,3.3e-05,6.5e-05,-1.7e-05,-0.000169,0.000148,0.000158,0.000122,0.000192,0.000144,-8.9e-05,5e-05,-0.000107,6.3e-05,3.4e-05,-2e-06,4.7e-05,-9.1e-05,-0.000168,8.5e-05,-1.3e-05,-0.000108,0.000119,-7.1e-05,2.2e-05,0.000216,4.5e-05,7.1e-05,2.7e-05,0.000103,9.5e-05,9.9e-05,-8.1e-05,-0.000232,-1e-05,-0.000144,-1.4e-05,-8.1e-05,0.000178,0.000117,-3.2e-05,4.4e-05,5e-06,-4.5e-05,-8e-06,6e-06,-8.2e-05,-3.6e-05,-0.000234,-0.000107,-0.000123,-0.000125,-5e-06,-1e-06
1e-05,-1.2e-05,0.000129,6.9e-05,5.5e-05,-0.00016,6.6e-05,5.4e-05,-2.9e-05,4.3e-05,0.000176,-5e-06,0.000129,0.00012,-5.6e-05,5.4e-05,-5.7e-05,-0.000138,9.6e-05,1e-06,-0.000153,0.000127,3e-05,-7.6e-05,-8.7e-05,-0.000123,-2e-06,2.2e-05,-0.000105,6e-06,-2.1e-05,0.000147,-2.5e-05,-0.000151,-1.2e-05,0.000102,-1.8e-05,-3.9e-05,-4.7e-05,5e-05,-0.000174,-0.000164,0.000101,-3.5e-05,-9.2e-05,-2.8e-05,-0.00011,5.2e-05,-0.000261,-5.6e-05,0.000107,8.5e-05,3.2e-05,-6.7e-05,-0.000101,3.7e-05,0.000134,0.000134,-2.8e-05,-2.3e-05,-0.000107,-0.000179,4.3e-05,1e-05,2.2e-05,4.2e-05,-2.1e-05,-4e-06,-3e-06,-2.1e-05,-4.5e-05,7e-06,-6e-05,-7.2e-05,-0.000109,-0.000142,-1.1e-05,0.000155,-6.3e-05,9.1e-05,-7.5e-05,-5.7e-05,-2.8e-05,-4.1e-05,-1.1e-05,0.000147,-4.3e-05,7e-06,2.3e-05,-4.7e-05,8.7e-05,2.9e-05,-0.000149,6.9e-05,-5.9e-05,-4.8e-05,-3.5e-05,-5.9e-05,-0.000102,-4.3e-05,0.000115,-9.6e-05,-7e-06,-8.4e-05,6.6e-05,-2.4e-05,-0.000122,6.2e-05,-9.4e-05,-3e-06,2.6e-05,1.9e-05,1.1e-05,2.3e-05,-9.5e-05,0.000172,2.1e-05,7.3e-05,0.000149,1.5e-05,3.2e-05
1.1e-05,-2.9e-05,-6.3e-05,-5.1e-05,-1e-05,0.000106,-2.3e-05,-3e-06,-6.8e-05,-2.9e-05,-0.000155,-1e-05,-0.000106,-9.7e-05,8.9e-05,3e-05,0.000118,0.00011,-4.3e-05,6.2e-05,3.2e-05,-2.4e-05,-1e-06,7.7e-05,8.8e-05,8.4e-05,-3.5e-05,-5.3e-05,5.9e-05,2.9e-05,5.1e-05,-6.8e-05,-1.7e-05,5e-05,1.2e-05,-7.7e-05,0.000165,3.3e-05,0.000143,-3.8e-05,0.000152,6.2e-05,3e-05,2.1e-05,8.9e-05,-4.5e-05,5.3e-05,-4.1e-05,0.000203,3.7e-05,-4.4e-05,-0.000128,1.7e-05,0.000119,8.7e-05,2.2e-05,-6.5e-05,-0.000161,6.3e-05,-5.4e-05,8.8e-05,0.000213,-7e-05,-2.4e-05,1.7e-05,1.4e-05,3.7e-05,4e-05,3e-06,-1.3e-05,-5.4e-05,-2.1e-05,-9e-05,7.1e-05,3.5e-05,3.3e-05,2.5e-05,-9.3e-05,7.7e-05,-3.8e-05,7e-06,1.8e-05,3e-06,-3.7e-05,2.5e-05,-8e-05,3e-05,-9e-06,4e-05,-2.9e-05,-4.4e-05,-4.3e-05,7.6e-05,-5.7e-05,-3.4e-05,-1.9e-05,-9.1e-05,7e-06,-6.4e-05,3.7e-05,-1.3e-05,3.2e-05,1.3e-05,0.000103,2.2e-05,-0.000105,6.8e-05,-7e-06,-3e-06,2.8e-05,4.7e-05,1.1e-05,-6.7e-05,0.00011,0.000108,-0.000147,-6e-06,-5.4e-05,-9.1e-05,4.2e-05,4.6e-05
-1.8e-05,4.7e-05,0.000107,3.2e-05,3.6e-05,2.4e-05,-7.5e-05,-3.6e-05,7.5e-05,5.6e-05,0.000131,7e-05,7.7e-05,4.2e-05,-5.7e-05,-0.000107,-0.00011,-4.2e-05,3e-05,-5.4e-05,3.3e-05,-1.7e-05,3e-06,-7.3e-05,-6.9e-05,-7e-06,-6.4e-05,2.1e-05,-1.3e-05,-3.5e-05,-9.1e-05,3.8e-05,1e-05,-1.6e-05,1e-05,1.5e-05,-8.3e-05,-9.1e-05,-9e-05,4.6e-05,-7.5e-05,-2.5e-05,-8.8e-05,-5.8e-05,-0.000101,6.4e-05,-3e-06,9e-06,-0.000104,-6.2e-05,2.1e-05,4.3e-05,-1.1e-05,-0.000146,-5.7e-05,-4.3e-05,1.8e-05,9.4e-05,-4.5e-05,9e-06,-6e-06,-0.000161,-4.3e-05,3e-06,-2.4e-05,1.3e-05,1e-06,-7.4e-05,1e-05,-4e-06,1.2e-05,6.5e-05,0.000215,2.4e-05,2.2e-05,4.9e-05,-2.4e-05,5.8e-05,-6e-05,2.9e-05,4.7e-05,2.7e-05,5e-06,6.8e-05,-4e-06,2.8e-05,-2.5e-05,3.2e-05,6e-06,8e-06,-1.8e-05,1.9e-05,-2.3e-05,-5.4e-05,0.000107,3.5e-05,5.5e-05,-1e-06,2e-06,-1.3e-05,-4.8e-05,1e-06,-3e-05,-4.3e-05,-7.4e-05,0.000119,-3.7e-05,-3.2e-05,6e-05,3.1e-05,-7.6e-05,5e-06,2.5e-05,-0.000114,1.8e-05,3.2e-05,6e-06,3.6e-05,4.5e-05,-2.4e-05,-5e-05
-4e-06,3.7e-05,-7.4e-05,-1.3e-05,-1.7e-05,-5.3e-05,7.6e-05,4.5e-05,-3.3e-05,-2.6e-05,-9e-05,-1e-04,-7.1e-05,-8.6e-05,-2.5e-05,2.8e-05,2.3e-05,-6e-06,-4.9e-05,-6.1e-05,-7e-06,1e-05,-1.1e-05,9.1e-05,2.8e-05,-3.2e-05,7.2e-05,3.5e-05,-3e-05,8.7e-05,7.5e-05,2.8e-05,-1.3e-05,8e-06,7e-06,4.5e-05,5.2e-05,4.3e-05,-4e-06,-3e-05,6.2e-05,-3.7e-05,6.4e-05,4.8e-05,5.1e-05,-5.9e-05,2.2e-05,-2.5e-05,1.8e-05,4.2e-05,-2.9e-05,4e-06,2.5e-05,8.5e-05,8.7e-05,3e-06,1.4e-05,-4.8e-05,3.1e-05,7e-06,2.5e-05,7.5e-05,3.1e-05,0,1.6e-05,-2.3e-05,2.5e-05,1e-05,2.5e-05,-6.5e-05,2e-06,-6.2e-05,-0.000146,-1.7e-05,3e-06,-6.4e-05,-2e-06,3.8e-05,8e-06,-7.9e-05,-4.3e-05,-3.9e-05,-1.1e-05,-1.2e-05,-6e-06,-1.2e-05,2.5e-05,-3.4e-05,-3.2e-05,-6e-06,4.6e-05,-5e-06,-2.2e-05,2.9e-05,-6e-05,9e-06,-1.2e-05,-3.3e-05,2e-06,6e-05,1.4e-05,-5e-06,-4.8e-05,-4e-05,6.7e-05,-5.7e-05,-4e-06,8e-06,-1.2e-05,-6e-06,6.3e-05,2.7e-05,6e-06,2.3e-05,1.8e-05,-2.8e-05,-1.5e-05,-2.6e-05,-2.2e-05,-1.7e-05,2.6e-05
-4e-06,2.7e-05,2.3e-05,-2.2e-05,-1.9e-05,3.4e-05,-2.7e-05,-2.7e-05,3.9e-05,2e-06,3.9e-05,4e-05,3.5e-05,5.7e-05,3.8e-05,-5.2e-05,-3.9e-05,1.5e-05,2.9e-05,1.7e-05,2e-06,-2.3e-05,1.3e-05,-6.7e-05,-2.5e-05,3e-06,-2.4e-05,-8e-06,4e-05,-4.3e-05,-2.5e-05,-2.3e-05,1.5e-05,-1e-05,-5e-06,0,-0.000106,1.9e-05,2.3e-05,-1.4e-05,-8.7e-05,5.8e-05,-1.4e-05,-1.3e-05,2.2e-05,4.2e-05,-6e-06,2.5e-05,2.4e-05,-2e-05,1.6e-05,-1.5e-05,-1.4e-05,-2.4e-05,-5.4e-05,-1.3e-05,-7e-06,3e-05,-1.9e-05,3e-06,-4.1e-05,-3.1e-05,-4.6e-05,-1e-05,2e-06,-1e-05,1e-05,-2.1e-05,-5e-06,4.5e-05,2.9e-05,7.8e-05,4.2e-05,1.5e-05,-4e-05,4.5e-05,2e-06,-8.4e-05,-3.7e-05,6.8e-05,2.1e-05,3.4e-05,1e-06,-1e-05,-1.7e-05,1.1e-05,-2.7e-05,1.1e-05,-3.5e-05,-1.4e-05,8e-06,-5e-06,3.8e-05,-4.2e-05,-3.1e-05,-2.9e-05,8e-06,-3e-06,4.1e-05,-7.5e-05,-2e-06,-4.1e-05,3e-05,2.1e-05,-4.5e-05,3.8e-05,1.3e-05,-2.8e-05,1.5e-05,-2.2e-05,-8.5e-05,-2.7e-05,-1.4e-05,-1e-05,-4.1e-05,4.7e-05,2.4e-05,2.9e-05,2.1e-05,1.1e-05,-2.7e-05
1.3e-05,-5.5e-05,5.6e-05,3.7e-05,1.1e-05,-4.9e-05,1.1e-05,1.4e-05,0,-7e-05,-1.1e-05,8e-06,-2.9e-05,3.3e-05,-1.9e-05,5.7e-05,7e-06,-3e-06,7e-06,-2.2e-05,2.6e-05,-6e-06,1.5e-05,3.9e-05,2.7e-05,1.7e-05,4e-06,-1.7e-05,-1.8e-05,1.8e-05,1.2e-05,-2.1e-05,1e-05,1.3e-05,1.2e-05,-2.8e-05,4.8e-05,-5e-05,-8e-06,8e-06,7.8e-05,-1.1e-05,-1.9e-05,2.3e-05,-4e-06,-1.9e-05,3.6e-05,-3.4e-05,-2.5e-05,7e-06,5e-06,0,-6e-06,-2e-06,2.5e-05,-3e-06,-2e-05,-2.9e-05,-4e-06,8e-06,3.7e-05,2e-05,3.1e-05,1.3e-05,1.2e-05,1.8e-05,-8e-06,1.4e-05,0,-4.6e-05,-4e-06,-2.7e-05,3.2e-05,-2.6e-05,-3e-06,-1.5e-05,-1.9e-05,3.8e-05,5.5e-05,-4.4e-05,-1.9e-05,-1.7e-05,5e-06,4e-06,1.6e-05,2.8e-05,2.6e-05,-9e-06,-1e-06,1.2e-05,-4.5e-05,-2e-06,-1.8e-05,7e-06,3e-06,6e-06,-9e-06,1.4e-05,2e-06,1.7e-05,-7e-06,3.8e-05,1.7e-05,-1.1e-05,5e-06,-7.6e-05,-8e-06,-1e-05,0,1.8e-05,6.9e-05,1.9e-05,1.4e-05,-1.8e-05,2.7e-05,-3.9e-05,-3.2e-05,-3.4e-05,-1.8e-05,-2.8e-05,2.7e-05
-2.8e-05,3.5e-05,-4.9e-05,-2.9e-05,-4e-06,3e-05,4e-06,8e-06,3e-06,5.2e-05,3e-05,-3.4e-05,2.2e-05,-2.8e-05,-2e-06,-6e-05,-1.9e-05,-1.3e-05,1.5e-05,1.3e-05,-2.4e-05,-6e-06,-6e-06,-2.9e-05,-6e-06,-1e-05,2.8e-05,2e-06,0,-1.9e-05,-3e-06,2.1e-05,-1e-05,-1.9e-05,-6e-06,1.6e-05,-4e-05,2.2e-05,7e-06,-9e-06,-5.8e-05,-2.2e-05,4e-06,1.2e-05,5e-06,8e-06,-1.7e-05,3.2e-05,3.4e-05,-2.6e-05,1.3e-05,-1e-06,0,-6e-06,-2.8e-05,1.7e-05,4e-06,1.1e-05,1.8e-05,-8e-06,-9e-06,-1.2e-05,-1.6e-05,-7e-06,-1e-05,-1e-05,1.2e-05,-1.7e-05,2e-05,4.8e-05,-4e-06,1.5e-05,-4.1e-05,4.6e-05,3e-06,1e-05,-1.8e-05,-2.7e-05,-2.5e-05,4.4e-05,1.1e-05,2e-06,-6e-06,3e-06,-1.3e-05,-5e-05,-2.4e-05,2e-06,2.6e-05,-1.8e-05,2e-05,4e-06,-8e-06,0,1e-05,1.3e-05,1e-06,-2.4e-05,-1.4e-05,-1e-05,2.6e-05,-5e-06,-2.1e-05,2e-05,6e-06,3.6e-05,-3e-06,1.9e-05,-5e-06,-4e-06,-1.4e-05,-1.9e-05,-1e-06,-6e-06,-6e-06,6e-06,8e-06,1.1e-05,6e-06,1e-05,-1.5e-05
-1e-06,-4.4e-05,4.8e-05,2.4e-05,1.5e-05,-2.1e-05,-2.6e-05,-2e-06,-8e-06,-3.3e-05,-4.9e-05,1.9e-05,-1.1e-05,8e-06,7e-06,3.1e-05,2.5e-05,2.1e-05,-2.6e-05,-1e-06,2.8e-05,3.4e-05,-7e-06,5e-06,-1.7e-05,-3e-06,-2.3e-05,-1e-06,0,-3e-06,-1.5e-05,2e-06,-7e-06,1.6e-05,1e-06,-1.5e-05,5.1e-05,-1.6e-05,-1e-05,1.6e-05,1.3e-05,8e-06,1.1e-05,-3.5e-05,-1.7e-05,-2e-06,-4e-06,-2.1e-05,-4.2e-05,1.2e-05,-3e-05,2e-06,-7e-06,4.3e-05,2.3e-05,-1.5e-05,-2e-06,6e-06,-1.3e-05,4e-06,-1.6e-05,-1.4e-05,1.4e-05,0,-1e-05,5e-06,-1e-06,1.7e-05,-2e-05,-3.2e-05,-1.3e-05,-4e-06,3.5e-05,-2.6e-05,-1e-05,9e-06,3e-05,4.3e-05,4e-06,-2.6e-05,-1e-06,1.4e-05,1e-06,-1.7e-05,6e-06,4.1e-05,2.2e-05,-8e-06,3e-06,1.9e-05,-1.3e-05,2e-06,1.4e-05,-2e-06,-2.1e-05,-1.5e-05,-2e-06,1.2e-05,0,-1.1e-05,-3.5e-05,-2.2e-05,2e-06,2e-06,-3e-06,0,3e-06,-6e-06,5e-06,1.3e-05,3e-06,7e-06,-1e-06,2.5e-05,-1.5e-05,1.2e-05,1.1e-05,8e-06,-6e-06,-4e-06,-5e-06
1.7e-05,2.3e-05,-2.1e-05,-1.5e-05,-1.3e-05,2.7e-05,1.4e-05,-1.4e-05,1e-05,-1.4e-05,4.1e-05,1.4e-05,8e-06,-1e-05,-8e-06,1e-06,-4e-06,-2.4e-05,7e-06,7e-06,-2.6e-05,-3.5e-05,2e-06,1.1e-05,1.7e-05,8e-06,3e-06,-1e-06,-5e-06,8e-06,0,-1.5e-05,-1e-06,-1.5e-05,4e-06,8e-06,-3e-05,1e-05,4e-06,-1.5e-05,2.2e-05,-4e-06,-1.2e-05,9e-06,3.2e-05,-5e-06,-3e-06,1.6e-05,2.8e-05,1e-06,2.2e-05,7e-06,1.1e-05,-5.3e-05,-9e-06,4e-06,8e-06,-1.3e-05,9e-06,7e-06,1e-05,9e-06,6e-06,3e-06,2e-06,-6e-06,2e-06,5e-06,1.6e-05,-1e-06,-3e-06,-1.4e-05,-4.6e-05,2e-05,1.7e-05,-2.8e-05,-1e-06,-4.7e-05,-1e-05,1.3e-05,3e-06,-2.3e-05,3e-06,1.2e-05,-1.7e-05,-2.3e-05,-1.2e-05,6e-06,0,-1e-06,3e-06,2e-06,-7e-06,3e-06,4.6e-05,4e-06,0,-6e-06,-6e-06,8e-06,1.9e-05,1.1e-05,1.1e-05,-3e-06,-5e-06,-3.4e-05,0,1.5e-05,-9e-06,-1.3e-05,-4e-06,-4e-06,1.1e-05,8e-06,-1e-06,1e-06,-1.1e-05,-1.2e-05,2e-06,5e-06,2e-06
-2e-06,-1.6e-05,2e-06,3e-06,4e-06,-2.2e-05,6e-06,4e-06,-6e-06,2.3e-05,-3e-05,-3.3e-05,-5e-06,-1.2e-05,-4e-06,-4e-06,-5e-06,2.1e-05,-8e-06,2e-06,2.5e-05,1.5e-05,1e-05,-1.3e-05,-2e-06,-4e-06,-1.5e-05,6e-06,8e-06,-4e-06,9e-06,2.1e-05,8e-06,7e-06,-4e-06,1.9e-05,3.9e-05,-3e-06,9e-06,1.1e-05,1.2e-05,2.2e-05,-6e-06,7e-06,-1.2e-05,3e-06,0,-1.9e-05,-1.7e-05,4e-06,-6e-06,-4e-06,-2e-06,4.2e-05,9e-06,7e-06,-9e-06,1.4e-05,-1e-05,-1.1e-05,-7e-06,-2e-06,-2.1e-05,-4e-06,-6e-06,0,5e-06,-4e-06,1e-06,-3e-06,1e-06,-9e-06,3e-06,-4.8e-05,-4e-06,1.3e-05,-6e-06,2.9e-05,1.9e-05,-1.4e-05,-3e-06,1.3e-05,-7e-06,-3e-06,2.3e-05,1.2e-05,6e-06,0,-1e-05,-6e-06,-2e-06,-2e-06,1e-06,-7e-06,-2.3e-05,7e-06,-1e-05,1.4e-05,4e-06,-8e-06,-1e-06,1.5e-05,2e-06,-4e-06,1.6e-05,4.8e-05,-3e-06,-5e-06,-2e-06,-6e-06,1e-06,-8e-06,-1e-05,-4e-06,1.9e-05,1.1e-05,1.3e-05,1.2e-05,8e-06,-3e-06,1e-06
-2e-06,2.2e-05,1.9e-05,3e-06,-8e-06,8e-06,-1.4e-05,-7e-06,-3e-06,-5e-06,2.7e-05,3.3e-05,6e-06,3.3e-05,1.1e-05,2.3e-05,8e-06,-1.6e-05,1e-05,-1.2e-05,-2.4e-05,3e-06,-1.3e-05,2.2e-05,-3e-06,6e-06,1.1e-05,2e-06,-1.4e-05,6e-06,-3e-06,5e-06,4e-06,5e-06,0,-1.3e-05,-3.5e-05,-6e-06,-1.1e-05,-1e-05,-2.9e-05,-2.5e-05,9e-06,-1e-05,1e-05,-4e-06,-1.2e-05,1.2e-05,-3e-06,-1.8e-05,-4e-06,-1e-06,7e-06,-1.6e-05,9e-06,-1.4e-05,6e-06,-8e-06,1.3e-05,1e-06,8e-06,-6e-06,2e-05,1e-06,4e-06,6e-06,1e-06,-6e-06,4e-06,8e-06,8e-06,2e-06,2.4e-05,5.4e-05,-1e-05,-4e-06,9e-06,-1.2e-05,-2e-06,1.3e-05,7e-06,-2e-06,3e-06,-7e-06,-1.8e-05,-2e-06,3e-06,3e-06,-2e-06,-1e-06,7e-06,1e-06,-3e-06,-4e-06,-1.1e-05,-3e-06,6e-06,-7e-06,8e-06,2.3e-05,-1.2e-05,-1.1e-05,-6e-06,5e-06,-1.5e-05,-3.4e-05,2e-06,-2e-06,5e-06,3e-06,-1.5e-05,2e-06,5e-06,4e-06,-5e-06,-2.4e-05,-5e-06,-1.5e-05,-1.7e-05,0,1.4e-05
3e-06,-1.7e-05,-3.2e-05,6e-06,1e-06,-3e-06,9e-06,1e-06,-1e-06,-5e-06,-1.9e-05,-2.6e-05,-1e-06,-1.9e-05,-4e-06,-2.3e-05,-1.2e-05,7e-06,-5e-06,8e-06,2.4e-05,-1.9e-05,-1e-06,-2.7e-05,1e-06,-4e-06,1e-06,3e-06,1.5e-05,-7e-06,-6e-06,-1.3e-05,-4e-06,-1.3e-05,2e-06,-3e-06,2e-05,4e-06,-8e-06,7e-06,1.2e-05,-1e-06,-1e-06,1.2e-05,-1.1e-05,-2e-06,4e-06,-1.5e-05,1.5e-05,1.5e-05,2e-06,5e-06,-1e-06,3e-06,-2.5e-05,7e-06,-1e-06,1.1e-05,-6e-06,-7e-06,-1.1e-05,5e-06,-8e-06,3e-06,-3e-06,-4e-06,3e-06,-1.1e-05,1e-06,7e-06,7e-06,1e-05,-4.1e-05,-3.4e-05,5e-06,-1e-06,-5e-06,-6e-06,0,-1e-05,-4e-06,1e-06,3e-06,4e-06,4e-06,-1.2e-05,-9e-06,-7e-06,5e-06,-5e-06,-6e-06,0,3e-06,5e-06,1.1e-05,2e-06,3e-06,8e-06,0,-2e-05,1.4e-05,-1e-05,2e-06,0,2e-06,8e-06,2e-06,-5e-06,1.1e-05,6e-06,2.6e-05,3e-06,-1e-06,-2.4e-05,-5e-06,1.9e-05,-5e-06,1e-05,1.5e-05,4e-06,-1.5e-05
-5e-06,1.3e-05,4.4e-05,-1.4e-05,-2e-06,-2e-06,-3e-06,1e-06,-5e-06,2e-06,1e-05,7e-06,0,1e-05,-8e-06,2.9e-05,-7e-06,0,-1e-06,0,-1.4e-05,1.2e-05,8e-06,2.3e-05,-6e-06,-5e-06,8e-06,-1.4e-05,-1e-05,1e-06,4e-06,-5e-06,-5e-06,1.1e-05,0,3e-06,-2.5e-05,-1.1e-05,7e-06,-2e-06,0,1.5e-05,-4e-06,0,1.5e-05,4e-06,1e-06,1.5e-05,-1.7e-05,-4e-06,6e-06,-3e-06,-3e-06,-6e-06,1.7e-05,-2e-06,0,-1.4e-05,-3e-06,-1e-06,1.5e-05,-1.2e-05,-1.2e-05,-3e-06,2e-06,3e-06,4e-06,7e-06,-5e-06,-1e-06,-5e-06,-3e-06,2.4e-05,3.7e-05,6e-06,0,-2e-06,1.8e-05,-6e-06,7e-06,-3e-06,2e-06,-5e-06,0,1e-06,1.3e-05,4e-06,6e-06,6e-06,-2e-06,-3e-06,0,1e-06,-1e-06,1e-06,-1e-06,-2e-06,1e-06,-4e-06,2e-06,-3e-06,2e-05,8e-06,6e-06,8e-06,6e-06,-2e-06,0,-2e-06,2e-06,-9e-06,1e-06,-3e-06,9e-06,4e-06,-1.1e-05,1.2e-05,-7e-06,-5e-06,-8e-06,1.1e-05
5e-06,-9e-06,-2.4e-05,8e-06,2e-06,9e-06,-5e-06,-1e-06,4e-06,7e-06,-6e-06,6e-06,-4e-06,-9e-06,9e-06,-2e-05,1e-06,-7e-06,-3e-06,-3e-06,0,-3e-06,-4e-06,-2.3e-05,1.5e-05,5e-06,-1.2e-05,5e-06,-2e-06,-1e-06,-1e-05,1e-05,1e-06,-8e-06,0,-1e-05,1.8e-05,1.5e-05,-3e-06,-2e-06,7e-06,-1.3e-05,2e-06,-7e-06,2e-06,-4e-06,1e-06,-7e-06,1.8e-05,8e-06,-6e-06,4e-06,-2e-06,1.6e-05,-1.5e-05,-2e-06,2e-06,1.4e-05,1e-06,1.6e-05,-1.1e-05,1.4e-05,1.6e-05,2e-06,3e-06,-1e-06,0,-1e-05,4e-06,-6e-06,-7e-06,1.6e-05,0,-3.7e-05,-7e-06,-6e-06,-6e-06,-1.4e-05,3e-06,-1e-06,4e-06,-3e-06,0,-8e-06,6e-06,-1.2e-05,1e-06,-4e-06,-2e-06,3e-06,9e-06,0,-1e-06,1e-05,-2e-06,-2e-06,-1e-06,1e-06,-5e-06,2e-06,-9e-06,-7e-06,-6e-06,-4e-06,-1.2e-05,-9e-06,-1e-06,-5e-06,-5e-06,-1e-05,2e-06,1e-06,3e-06,-1e-06,5e-06,7e-06,-7e-06,4e-06,4e-06,8e-06,-1.1e-05
0,1.1e-05,6e-06,0,2e-06,-1.3e-05,1e-05,5e-06,-2e-06,-8e-06,8e-06,-8e-06,3e-06,-6e-06,-5e-06,9e-06,-1e-06,6e-06,4e-06,4e-06,2e-06,7e-06,-3e-06,2.2e-05,-1.4e-05,1e-06,9e-06,1e-06,1e-05,9e-06,1.5e-05,-8e-06,1e-06,8e-06,0,5e-06,-1.9e-05,-9e-06,-2e-06,6e-06,-1.9e-05,3e-06,6e-06,4e-06,-2e-06,0,2e-06,7e-06,-1.2e-05,-1.4e-05,4e-06,-5e-06,-5e-06,-2.7e-05,1.5e-05,6e-06,0,-1.3e-05,3e-06,-9e-06,2e-06,-7e-06,-7e-06,-1e-06,1e-06,-3e-06,3e-06,8e-06,-4e-06,0,-3e-06,-1.9e-05,-2.4e-05,2.7e-05,4e-06,1e-05,0,7e-06,-1e-06,1e-06,-5e-06,0,1e-06,6e-06,-6e-06,9e-06,-4e-06,0,-5e-06,-8e-06,-5e-06,0,-5e-06,1e-06,5e-06,-2e-06,5e-06,-2e-06,-3e-06,5e-06,1.3e-05,-1e-05,-7e-06,-2e-06,6e-06,1.6e-05,4e-06,7e-06,1e-06,2e-06,-4e-06,4e-06,0,-5e-06,-4e-06,-1.2e-05,-3e-06,-5e-06,-6e-06,-2e-06,7e-06
-8e-06,-6e-06,8e-06,-2e-06,-5e-06,1.5e-05,-1e-05,-1e-06,5e-06,1.3e-05,-8e-06,4e-06,-6e-06,1.6e-05,-1e-06,-7e-06,-1e-06,-4e-06,4e-06,3e-06,1e-06,-1e-05,4e-06,-1.8e-05,7e-06,-4e-06,-8e-06,2e-06,-8e-06,-2e-06,-1e-05,-5e-06,0,-7e-06,1e-06,7e-06,2.4e-05,0,5e-06,-7e-06,2.9e-05,-4e-06,-6e-06,-1e-05,0,-2e-06,2e-06,-4e-06,5e-06,6e-06,-2e-06,0,1e-06,2.9e-05,-9e-06,-3e-06,2e-06,7e-06,-2e-06,-7e-06,3e-06,7e-06,0,0,1e-06,2e-06,-2e-06,-2e-06,5e-06,4e-06,2e-06,1.3e-05,2e-05,-2.9e-05,-3e-06,-1e-06,1e-05,-1.6e-05,4e-06,3e-06,6e-06,2e-06,0,-3e-06,-5e-06,-7e-06,6e-06,-1e-06,-2e-06,8e-06,-5e-06,-1e-06,9e-06,1e-06,3e-06,4e-06,-5e-06,3e-06,1e-06,4e-06,-1e-05,9e-06,5e-06,2e-06,2e-06,-2e-05,-6e-06,0,4e-06,-1e-06,-1e-06,-2e-06,-1e-06,1.2e-05,-2e-06,9e-06,7e-06,7e-06,3e-06,-1e-06,-3e-06
3e-06,5e-06,-1.4e-05,-3e-06,4e-06,-1.6e-05,4e-06,0,-3e-06,-1.4e-05,5e-06,5e-06,6e-06,-1.3e-05,6e-06,2e-06,8e-06,-3e-06,-3e-06,3e-06,-4e-06,1.1e-05,0,1.4e-05,2e-06,2e-06,0,-2e-06,4e-06,0,2e-06,1.3e-05,2e-06,8e-06,0,-4e-06,-1.4e-05,4e-06,-2e-06,8e-06,-2.4e-05,0,-3e-06,1.1e-05,1e-06,-1e-06,-1e-06,0,4e-06,1e-06,1e-06,1e-06,-1e-06,-1.6e-05,7e-06,1e-06,-2e-06,1e-06,0,1e-05,-3e-06,-6e-06,4e-06,1e-06,-3e-06,0,1e-06,4e-06,1e-06,-1e-06,3e-06,-1e-05,-1.5e-05,3.1e-05,-4e-06,-4e-06,-5e-06,2.2e-05,-5e-06,-5e-06,-6e-06,0,2e-06,1e-06,9e-06,3e-06,-6e-06,1e-06,3e-06,-1e-06,7e-06,0,-5e-06,1e-06,-2.3e-05,-1e-06,-3e-06,-4e-06,4e-06,-1.4e-05,3e-06,3e-06,0,2e-06,-7e-06,1.7e-05,6e-06,3e-06,-4e-06,4e-06,2e-06,1e-06,2e-06,3e-06,1e-06,-5e-06,-4e-06,-3e-06,-5e-06,4e-06,0
3e-06,-9e-06,1.7e-05,3e-06,-4e-06,1.1e-05,4e-06,2e-06,4e-06,2e-06,-2e-06,-1e-05,-9e-06,5e-06,-6e-06,2e-06,-2e-06,6e-06,1e-06,-7e-06,8e-06,-9e-06,-1e-06,-1.1e-05,-5e-06,3e-06,-1e-06,2e-06,-2e-06,-5e-06,-5e-06,-1e-06,1e-06,-6e-06,-2e-06,3e-06,1.4e-05,-1e-06,1e-06,-7e-06,2e-06,7e-06,6e-06,3e-06,3e-06,0,0,-5e-06,-5e-06,6e-06,-1e-06,0,3e-06,5e-06,-8e-06,0,1e-06,-1e-06,0,1e-06,-1e-06,4e-06,-8e-06,0,-1e-06,1e-06,0,-4e-06,0,2e-06,2e-06,6e-06,0,-1.6e-05,1e-06,4e-06,0,-1.4e-05,0,-1e-06,2e-06,-2e-06,-1e-06,0,-5e-06,1e-06,6e-06,0,4e-06,1e-06,-2e-06,0,-5e-06,-2e-06,2.1e-05,-3e-06,4e-06,1e-06,2e-06,1.2e-05,1e-06,-8e-06,-4e-06,-2e-06,7e-06,-6e-06,-4e-06,-1e-06,-1e-06,-1e-06,1e-05,1e-06,-3e-06,-2e-06,1e-06,5e-06,-2e-06,0,8e-06,-4e-06,1e-06
-2e-06,4e-06,-1e-05,-1e-06,3e-06,-4e-06,-7e-06,-2e-06,-2e-06,1e-05,0,1.1e-05,7e-06,-1e-06,0,-1.2e-05,-6e-06,-8e-06,-4e-06,0,-1e-05,1e-06,-1e-06,7e-06,6e-06,-2e-06,7e-06,-2e-06,0,-3e-06,6e-06,-9e-06,-3e-06,5e-06,1e-06,-7e-06,-1.4e-05,4e-06,-1e-06,4e-06,1e-06,-9e-06,0,-6e-06,2e-06,-1e-06,-2e-06,0,7e-06,-1.1e-05,-2e-06,-1e-06,0,-4e-06,2e-06,-2e-06,0,2e-06,0,-5e-06,-3e-06,-1e-06,4e-06,0,1e-06,-2e-06,0,-3e-06,-1e-06,-7e-06,-2e-06,-3e-06,1.2e-05,8e-06,5e-06,-2e-06,7e-06,8e-06,-2e-06,-2e-06,4e-06,2e-06,-1e-06,-1e-06,2e-06,0,-3e-06,-1e-06,-1e-06,0,-6e-06,0,1.1e-05,-1e-06,-5e-06,4e-06,-2e-06,-2e-06,1e-06,-6e-06,-7e-06,1e-06,1e-06,1e-06,-2e-06,-7e-06,3e-06,0,3e-06,-3e-06,-1.4e-05,-3e-06,2e-06,-4e-06,-1e-06,-5e-06,3e-06,3e-06,-6e-06,3e-06,-3e-06
1e-06,-4e-06,-2e-06,-1e-06,1e-06,-1e-06,5e-06,0,1e-06,-1e-05,1e-06,-9e-06,-9e-06,-4e-06,4e-06,1e-05,2e-06,5e-06,5e-06,2e-06,9e-06,4e-06,-1e-06,-3e-06,-8e-06,0,-3e-06,-2e-06,1e-06,2e-06,-6e-06,4e-06,-2e-06,-4e-06,1e-06,1e-06,1.1e-05,-5e-06,-3e-06,-2e-06,1e-05,6e-06,-5e-06,6e-06,-4e-06,1e-06,-3e-06,0,-9e-06,4e-06,5e-06,0,1e-06,8e-06,4e-06,2e-06,1e-06,-6e-06,1e-06,-2e-06,4e-06,1e-06,-5e-06,1e-06,-2e-06,0,0,1e-06,-2e-06,-1e-06,-2e-06,4e-06,-1.2e-05,-1.6e-05,-3e-06,4e-06,-4e-06,-2e-06,5e-06,4e-06,-5e-06,-2e-06,1e-06,2e-06,-7e-06,1e-06,0,0,-3e-06,-2e-06,3e-06,0,-1.2e-05,0,-1e-06,0,-4e-06,0,-5e-06,3e-06,8e-06,5e-06,2e-06,0,-4e-06,1.8e-05,-3e-06,-2e-06,2e-06,0,5e-06,-1e-06,-2e-06,-1e-06,-1e-06,3e-06,-2e-06,-5e-06,0,-1e-06,7e-06
-2e-06,4e-06,6e-06,4e-06,0,5e-06,-2e-06,-1e-06,-1e-06,0,-1e-06,3e-06,9e-06,9e-06,-1e-06,-8e-06,-3e-06,-3e-06,-4e-06,-2e-06,-1e-05,-4e-06,2e-06,2e-06,1e-05,0,1e-06,2e-06,0,2e-06,6e-06,2e-06,1e-06,4e-06,0,5e-06,-1.4e-05,4e-06,5e-06,0,-1.1e-05,-2e-06,3e-06,-3e-06,5e-06,0,1e-06,2e-06,8e-06,-1e-06,0,0,-1e-06,-1.5e-05,-5e-06,0,-2e-06,8e-06,-1e-06,4e-06,-6e-06,-1e-06,2e-06,-1e-06,2e-06,2e-06,0,-6e-06,1e-06,2e-06,-2e-06,-6e-06,1.1e-05,1.2e-05,-1e-06,-5e-06,-3e-06,-6e-06,-1e-06,-1e-06,5e-06,1e-06,0,0,1e-05,-1e-06,3e-06,1e-06,-2e-06,-1e-06,5e-06,0,1e-05,0,-2e-06,-3e-06,6e-06,-1e-06,-1e-06,-3e-06,-3e-06,-2e-06,-1e-06,0,5e-06,-1.9e-05,3e-06,-1e-06,-2e-06,-1e-06,-3e-06,-1e-06,0,-3e-06,2e-06,0,0,4e-06,2e-06,0,-5e-06
0,-1e-06,-1.2e-05,-5e-06,-1e-06,-8e-06,-2e-06,0,1e-06,8e-06,2e-06,2e-06,-7e-06,-9e-06,-2e-06,6e-06,-4e-06,-1e-06,3e-06,1e-06,9e-06,4e-06,-1e-06,-1e-06,-6e-06,-1e-06,-4e-06,2e-06,2e-06,1e-06,-8e-06,-1e-05,1e-06,-3e-06,-1e-06,-4e-06,1e-05,0,-2e-06,1e-06,9e-06,-4e-06,2e-06,-4e-06,-4e-06,0,-1e-06,1e-06,-4e-06,7e-06,-4e-06,1e-06,-1e-06,1.9e-05,8e-06,-1e-06,1e-06,-6e-06,0,1e-06,7e-06,-1e-06,4e-06,1e-06,-1e-06,-2e-06,0,4e-06,-1e-06,0,0,3e-06,-3e-06,1e-06,1e-06,-1e-06,-1e-06,8e-06,-1e-06,4e-06,-5e-06,-1e-06,0,1e-06,-9e-06,2e-06,-5e-06,-1e-06,2e-06,2e-06,-5e-06,1e-06,-8e-06,0,7e-06,2e-06,0,-1e-06,0,1e-06,-2e-06,-1e-06,-1e-06,1e-06,-3e-06,1.3e-05,-3e-06,0,-1e-06,3e-06,6e-06,-1e-06,1e-06,1e-06,2e-06,-1e-06,1e-06,-3e-06,-1e-06,1e-06,4e-06
2e-06,1e-06,1.4e-05,3e-06,-1e-06,8e-06,4e-06,0,-1e-06,-6e-06,-3e-06,-6e-06,8e-06,4e-06,3e-06,-4e-06,5e-06,2e-06,-5e-06,1e-06,-7e-06,-1e-06,-1e-06,0,-1e-06,1e-06,0,-2e-06,-5e-06,0,5e-06,2e-06,0,2e-06,0,2e-06,-9e-06,-1e-06,-2e-06,-2e-06,-4e-06,6e-06,-4e-06,4e-06,4e-06,0,0,1e-06,-2e-06,-8e-06,1e-06,0,-1e-06,-1.6e-05,-8e-06,1e-06,0,6e-06,1e-06,-2e-06,-1e-06,1e-06,-6e-06,0,3e-06,1e-06,1e-06,-3e-06,1e-06,-2e-06,2e-06,0,-7e-06,-1e-06,-3e-06,1e-06,3e-06,-6e-06,-2e-06,-5e-06,3e-06,1e-06,0,3e-06,1e-06,-2e-06,3e-06,0,2e-06,-4e-06,0,0,4e-06,0,-1.5e-05,1e-06,-5e-06,2e-06,1e-06,6e-06,5e-06,1e-06,1e-06,-1e-06,-1e-06,-7e-06,2e-06,2e-06,1e-06,-1e-06,0,1e-06,0,1e-06,-3e-06,1e-06,-3e-06,2e-06,1e-06,-1e-06,-5e-06
-2e-06,0,-7e-06,1e-06,3e-06,-6e-06,-3e-06,0,0,-3e-06,3e-06,8e-06,-6e-06,0,-2e-06,3e-06,2e-06,-3e-06,4e-06,1e-06,5e-06,3e-06,2e-06,0,4e-06,-1e-06,2e-06,0,4e-06,-3e-06,-3e-06,9e-06,0,-2e-06,1e-06,2e-06,1.1e-05,2e-06,4e-06,3e-06,-1e-06,-6e-06,1e-06,-4e-06,-6e-06,1e-06,0,-1e-06,4e-06,0,2e-06,-1e-06,0,9e-06,5e-06,-1e-06,0,-6e-06,-1e-06,-1e-06,0,2e-06,5e-06,0,0,0,-1e-06,5e-06,1e-06,-1e-06,2e-06,-1e-06,1.3e-05,3e-06,2e-06,0,1e-06,1e-05,2e-06,4e-06,1e-06,0,0,-3e-06,-1e-06,3e-06,0,0,1e-06,4e-06,5e-06,0,2e-06,-2e-06,1.4e-05,-2e-06,2e-06,-3e-06,3e-06,-1.1e-05,-6e-06,1e-06,1e-06,1e-06,4e-06,-1e-06,-1e-06,-1e-06,1e-06,0,-1e-06,1e-06,1e-06,2e-06,-1e-06,-2e-06,1e-06,-1e-06,-1e-06,1e-06,4e-06
-1e-06,-2e-06,-8e-06,0,-2e-06,4e-06,1e-06,0,0,4e-06,-4e-06,-4e-06,5e-06,-3e-06,-2e-06,3e-06,0,1e-06,-2e-06,-2e-06,-2e-06,-5e-06,0,0,-4e-06,-1e-06,-1e-06,0,1e-06,1e-06,3e-06,-4e-06,0,3e-06,0,-4e-06,-8e-06,-3e-06,-2e-06,-3e-06,-3e-06,1e-06,3e-06,4e-06,4e-06,0,2e-06,-1e-06,-4e-06,-1e-06,-2e-06,1e-06,0,-4e-06,-5e-06,0,0,2e-06,1e-06,-1e-06,0,-3e-06,-1e-06,0,1e-06,0,0,-4e-06,-2e-06,-4e-06,0,7e-06,-8e-06,-1.2e-05,2e-06,-1e-06,-3e-06,-1.2e-05,1e-06,-4e-06,-5e-06,0,0,2e-06,5e-06,-5e-06,-2e-06,0,-2e-06,-2e-06,-4e-06,0,-7e-06,0,2e-06,1e-06,1e-06,3e-06,0,6e-06,1e-06,0,-1e-06,0,-3e-06,8e-06,1e-06,2e-06,-1e-06,-2e-06,-6e-06,1e-06,0,4e-06,2e-06,1e-06,3e-06,2e-06,-1e-06,-1e-06,-2e-06
1e-06,2e-06,1.3e-05,-2e-06,2e-06,-1e-06,2e-06,1e-06,0,-3e-06,5e-06,0,-4e-06,8e-06,4e-06,-2e-06,2e-06,0,3e-06,-1e-06,0,3e-06,-1e-06,-1e-06,4e-06,2e-06,2e-06,0,-4e-06,0,-4e-06,-3e-06,0,-4e-06,-1e-06,2e-06,9e-06,2e-06,0,3e-06,1.1e-05,1e-06,-1e-06,-1e-06,-2e-06,1e-06,-1e-06,-1e-06,4e-06,7e-06,0,0,1e-06,3e-06,4e-06,1e-06,1e-06,-2e-06,0,2e-06,1e-06,0,-3e-06,0,-1e-06,0,-1e-06,1e-06,-1e-06,3e-06,-2e-06,-3e-06,3e-06,1.1e-05,-3e-06,0,3e-06,8e-06,1e-06,4e-06,7e-06,1e-06,0,0,-4e-06,4e-06,3e-06,0,0,1e-06,-2e-06,0,7e-06,-1e-06,-1.1e-05,1e-06,-4e-06,-1e-06,-3e-06,-2e-06,4e-06,1e-06,-1e-06,0,1e-06,-1.3e-05,-1e-06,0,-1e-06,0,5e-06,0,-1e-06,-3e-06,-1e-06,-1e-06,-4e-06,-1e-06,1e-06,2e-06,2e-06
0,-2e-06,-1.2e-05,2e-06,-1e-06,-1e-06,-3e-06,0,1e-06,2e-06,-5e-06,5e-06,3e-06,-8e-06,-3e-06,3e-06,-2e-06,-3e-06,-3e-06,2e-06,0,-1e-06,0,2e-06,-5e-06,0,1e-06,-2e-06,3e-06,2e-06,2e-06,7e-06,0,4e-06,1e-06,1e-06,-9e-06,-1e-06,1e-06,-2e-06,-1e-05,-3e-06,-2e-06,-5e-06,0,0,2e-06,-1e-06,-4e-06,-6e-06,0,0,0,-1e-05,-1e-06,-2e-06,0,3e-06,-1e-06,0,0,-1e-06,4e-06,0,-1e-06,-1e-06,0,-1e-06,0,1e-06,-2e-06,2e-06,8e-06,-8e-06,0,1e-06,2e-06,-5e-06,-2e-06,-6e-06,-6e-06,-2e-06,0,-2e-06,-3e-06,-4e-06,-3e-06,-1e-06,0,0,3e-06,0,-3e-06,0,8e-06,-2e-06,2e-06,1e-06,1e-06,6e-06,-4e-06,-1e-06,1e-06,0,3e-06,1.4e-05,1e-06,-1e-06,0,3e-06,0,1e-06,0,-2e-06,-1e-06,2e-06,0,1e-06,2e-06,-1e-06,-1e-06
1e-06,2e-06,8e-06,0,0,2e-06,3e-06,0,-1e-06,1e-06,5e-06,-7e-06,-2e-06,3e-06,-1e-06,-1e-06,-4e-06,3e-06,2e-06,-2e-06,2e-06,-1e-06,0,-2e-06,3e-06,-1e-06,-2e-06,2e-06,-1e-06,-1e-06,-3e-06,-3e-06,0,-4e-06,0,-3e-06,6e-06,0,-1e-06,2e-06,4e-06,5e-06,1e-06,6e-06,-1e-06,1e-06,-1e-06,1e-06,2e-06,0,1e-06,0,1e-06,1.5e-05,-1e-06,1e-06,0,1e-06,1e-06,-3e-06,-1e-06,2e-06,-3e-06,0,0,1e-06,0,-2e-06,0,-1e-06,1e-06,-3e-06,-1.2e-05,1.8e-05,1e-06,2e-06,-4e-06,1e-06,0,6e-06,5e-06,1e-06,0,2e-06,6e-06,1e-06,3e-06,1e-06,1e-06,-1e-06,0,0,0,1e-06,-2e-06,1e-06,2e-06,-1e-06,-1e-06,-5e-06,5e-06,0,0,0,-4e-06,-1.1e-05,0,-1e-06,2e-06,1e-06,4e-06,0,-1e-06,-1e-06,1e-06,-3e-06,3e-06,0,-4e-06,-1e-06,-1e-06
-1e-06,-2e-06,-6e-06,-2e-06,0,-2e-06,-2e-06,0,1e-06,-6e-06,-5e-06,4e-06,1e-06,-1e-06,3e-06,2e-06,1e-06,-3e-06,-2e-06,0,-4e-06,2e-06,0,3e-06,1e-06,1e-06,-1e-06,1e-06,-1e-06,-1e-06,3e-06,-7e-06,1e-06,2e-06,0,3e-06,-9e-06,0,2e-06,0,-1e-06,-3e-06,1e-06,-2e-06,-3e-06,0,0,-1e-06,1e-06,-3e-06,0,0,0,-1.5e-05,3e-06,0,0,-4e-06,-1e-06,2e-06,2e-06,-1e-06,1e-06,0,0,0,-1e-06,1e-06,0,0,2e-06,0,6e-06,-2.3e-05,-1e-06,0,-1e-06,5e-06,1e-06,-4e-06,-1e-06,0,0,-2e-06,-2e-06,1e-06,-2e-06,0,-1e-06,0,-4e-06,0,2e-06,0,-2e-06,1e-06,-2e-06,2e-06,2e-06,-3e-06,-5e-06,2e-06,-1e-06,0,3e-06,2e-06,0,0,0,-1e-06,-4e-06,0,0,-2e-06,0,2e-06,-3e-06,-1e-06,3e-06,1e-06,3e-06
-1e-06,2e-06,-3e-06,1e-06,-1e-06,2e-06,-1e-06,0,-1e-06,5e-06,5e-06,1e-06,0,0,-1e-06,-3e-06,-2e-06,0,3e-06,2e-06,6e-06,-2e-06,0,-4e-06,-5e-06,0,1e-06,-1e-06,2e-06,-2e-06,-3e-06,6e-06,0,0,0,-2e-06,8e-06,-2e-06,-1e-06,-1e-06,1e-06,-2e-06,-2e-06,-1e-06,4e-06,0,-1e-06,2e-06,-3e-06,7e-06,-1e-06,0,0,1.1e-05,-6e-06,0,0,3e-06,0,1e-06,-3e-06,0,2e-06,0,-1e-06,0,-1e-06,-2e-06,1e-06,-2e-06,1e-06,-3e-06,0,1.7e-05,2e-06,-1e-06,3e-06,-7e-06,2e-06,7e-06,-3e-06,0,0,-1e-06,2e-06,-3e-06,0,0,0,1e-06,3e-06,0,-4e-06,1e-06,0,-1e-06,1e-06,-3e-06,1e-06,7e-06,1e-06,-2e-06,1e-06,0,-1e-06,5e-06,0,-1e-06,-1e-06,-2e-06,-1e-06,-1e-06,0,-1e-06,-1e-06,-1e-06,1e-06,2e-06,-2e-06,-1e-06,-3e-06
0,-2e-06,1.2e-05,0,1e-06,-2e-06,2e-06,0,0,4e-06,-5e-06,-7e-06,-1e-06,4e-06,0,-1e-06,0,1e-06,-3e-06,0,-7e-06,2e-06,0,4e-06,5e-06,-1e-06,-2e-06,0,0,2e-06,1e-06,3e-06,-1e-06,-1e-06,0,-2e-06,-6e-06,2e-06,-1e-06,2e-06,-7e-06,2e-06,0,3e-06,-5e-06,1e-06,1e-06,-2e-06,4e-06,-4e-06,-1e-06,0,0,-6e-06,7e-06,1e-06,0,-4e-06,0,-1e-06,1e-06,1e-06,-4e-06,0,1e-06,1e-06,0,3e-06,0,1e-06,-1e-06,5e-06,-6e-06,-1.8e-05,0,0,1e-06,7e-06,-1e-06,-7e-06,5e-06,1e-06,0,1e-06,-6e-06,5e-06,3e-06,0,0,-3e-06,3e-06,0,7e-06,0,1e-05,0,1e-06,3e-06,0,-5e-06,2e-06,-1e-06,0,0,-1e-06,-1e-05,0,0,0,1e-06,-1e-06,-1e-06,0,1e-06,0,2e-06,1e-06,-2e-06,1e-06,0,4e-06
