5.1e-05,9.4e-05,3.4e-05,0.000125,5.1e-05,5.4e-05,3.4e-05,3.1e-05,0.00018,1.4e-05,3e-06,3e-05,0.000104,8.1e-05,4e-06,3.5e-05,5.1e-05,7e-06,4.6e-05,1e-04,0.000123,3.1e-05,1.7e-05,4.3e-05,2.9e-05,4.7e-05,5.1e-05,1.9e-05,6.8e-05,0.000136,0.000116,1e-06,2.6e-05,9.8e-05,6.7e-05,2e-06,8e-06,8.1e-05,7.3e-05,3.3e-05,0.000108,3.8e-05,6.1e-05,4e-06,0.000104,2.2e-05,1.8e-05,4e-06,1e-06,0.000116,3.1e-05,6.4e-05,8e-05,2.2e-05,5.3e-05,3.8e-05,9e-06,9e-06,7.1e-05,2.6e-05,4e-05,0.000103,5.6e-05,3.6e-05,4e-05,5.8e-05,1.2e-05,2.4e-05,0.000126,8.8e-05,6e-05,6e-06,5.1e-05,1.7e-05,3.7e-05,4.7e-05,3.7e-05,1.3e-05,7.3e-05,0.00015,4.2e-05,9.1e-05,1.6e-05,2.4e-05,2.4e-05,4e-06,0.000106,2.1e-05,1.3e-05,4.2e-05,7e-05,4.7e-05,1.2e-05,5.1e-05,3.1e-05,2.2e-05,7.6e-05,1.3e-05,1.1e-05,6.5e-05,0.000103,7e-06,2e-05,7.4e-05,1.2e-05,5.5e-05,2.1e-05,4.6e-05,1.2e-05,5.9e-05,2e-05,3.4e-05,3e-06,5e-06,9.7e-05,1.4e-05,6.2e-05,2e-06,2e-06,5e-06,0.000108
0.000153,0.000262,0.000155,0.000303,0.000137,0.000167,0.000113,0.000138,0.000432,3.3e-05,5.4e-05,0.000162,0.000179,0.000178,1.2e-05,9.6e-05,0.000132,1.8e-05,0.000108,0.000245,0.000312,0.000152,0.000127,0.000116,6.2e-05,0.000127,0.000118,7e-05,0.000169,0.000312,0.00033,0.000108,8.8e-05,0.000205,0.000194,3.5e-05,2.7e-05,0.000211,0.000217,4e-05,0.00026,0.000124,0.000156,3.7e-05,0.000259,8e-05,6.1e-05,9e-06,1.4e-05,0.000262,7.2e-05,0.000131,0.000169,5e-05,9.4e-05,0.000101,3.6e-05,3.2e-05,9.4e-05,6.5e-05,0.000116,0.000243,0.000123,0.000124,8e-05,0.00011,3.9e-05,2.3e-05,0.000269,0.000234,0.00017,1.7e-05,0.000129,3.5e-05,7.6e-05,0.000169,9.3e-05,0.000112,0.000162,0.000376,0.000134,0.000232,7.8e-05,7.4e-05,1.6e-05,3e-05,0.00025,6.5e-05,9.1e-05,0.000123,0.000158,6.2e-05,2.3e-05,0.00016,6.9e-05,3.3e-05,0.000134,3.1e-05,2.5e-05,0.000126,0.000229,9.9e-05,6.2e-05,0.000184,9.7e-05,0.00014,2.2e-05,0.000106,1.7e-05,8.9e-05,8.4e-05,0.000117,6.5e-05,6.5e-05,0.00018,1.7e-05,0.000156,3.2e-05,3.5e-05,7e-06,0.000241
0.000143,0.00027,0.00024,0.000308,0.000274,0.000371,0.000236,0.000186,0.00031,0.00024,0.000178,0.000156,0.000541,0.000201,7.4e-05,9.3e-05,0.000222,8.9e-05,3.7e-05,0.000149,0.000283,0.000258,1.9e-05,1.1e-05,9.3e-05,0.000262,0.000127,0.000138,0.000301,0.000299,0.000221,6.6e-05,5.2e-05,0.000199,0.000196,8.6e-05,0.000141,0.000119,0.000176,8.3e-05,0.000423,0.000202,0.000111,0.000155,0.000119,6e-05,0.000198,0.000129,5.6e-05,0.000243,0.000118,0.000181,0.000308,0.000249,0.000234,0.000254,4.1e-05,8.5e-05,9.8e-05,6.5e-05,4.9e-05,0.000279,0.000276,0.000254,0.000135,0.000196,5.8e-05,0.000125,0.000485,0.000275,6.4e-05,6.1e-05,7.8e-05,5.8e-05,0.000141,0.000238,0.000151,0.000291,0.000194,0.000308,0.000126,0.000166,1e-04,0.000108,0.000128,4.7e-05,0.000209,0.000212,0.000137,7.1e-05,0.000206,7.6e-05,5.8e-05,0.000105,7.9e-05,9.1e-05,0.00011,0.000104,9e-05,0.000137,0.000245,7e-05,0.000112,0.000233,3.6e-05,0.000203,1.1e-05,8.2e-05,0.000118,0.000205,4.6e-05,6.6e-05,0.000125,0.000127,0.000327,8.8e-05,0.000172,0.000107,0.000109,8.6e-05,0.000289
0.000131,0.000488,2e-04,0.000593,0.000617,0.000254,0.000142,6.6e-05,0.000575,0.000387,0.000205,5.2e-05,0.000688,0.000664,0.000192,0.000348,0.000111,0.000101,0.000175,0.000144,0.000406,0.000357,0.000425,0.000342,7.2e-05,0.000404,0.000233,0.000207,0.000356,0.000149,0.000599,0.000304,0.000264,0.00033,0.000302,0.000161,0.000217,0.000245,0.000194,0.000593,0.000547,0.00013,0.000352,0.00039,0.000308,0.000241,0.000209,0.000172,0.00013,0.000315,0.00016,0.000499,0.000283,0.000209,0.000292,0.000277,0.000278,0.000285,0.000211,5.7e-05,4.4e-05,0.000484,0.000331,0.000114,0.000444,0.000182,0.000236,0.000175,0.000523,0.000347,7.6e-05,0.000122,6.8e-05,6.3e-05,0.000199,0.000112,9.5e-05,0.000134,9.1e-05,0.000479,0.000166,0.000374,0.000306,0.000212,0.000359,0.000276,0.000218,0.000256,9.9e-05,0.000245,0.000271,0.000239,9.9e-05,0.000234,7.2e-05,0.000274,0.000212,0.000103,0.000285,0.000425,0.000266,0.000127,0.000166,0.000295,0.000196,0.000235,0.000303,0.000152,0.000305,0.000262,6.3e-05,5.9e-05,0.000105,0.00026,0.000357,0.000311,0.000302,0.000102,0.000237,0.000197,0.000543
0.000375,0.000556,0.000917,0.001049,0.001131,0.001117,0.000805,0.000379,0.000849,0.000749,0.000495,0.000284,0.000826,0.000947,0.000555,0.000418,4.1e-05,0.000233,0.000556,0.000679,0.00056,0.000696,6e-04,0.000672,0.00061,0.000809,0.000612,0.000576,0.000567,0.000743,0.001094,0.001,0.000454,0.000527,0.000887,0.000881,0.000735,0.00034,0.000472,0.001227,0.001172,0.001006,0.00078,0.000473,0.000483,0.000162,0.000618,0.000473,0.000139,0.000638,0.000675,0.000603,0.000792,0.000464,0.000407,0.000444,0.000524,0.000129,0.000122,3.5e-05,9.4e-05,0.000363,0.00043,0.000307,0.000398,0.000607,0.000511,0.000309,0.000444,0.000691,0.000419,0.000305,0.000325,6.4e-05,6.9e-05,0.000189,0.000306,0.000111,0.000348,0.000523,0.000548,0.000943,0.001263,0.001083,0.00049,0.000267,0.000713,0.000346,0.000264,0.000391,0.000639,0.000755,0.00054,0.000415,0.00039,0.000374,0.000696,0.000382,0.000171,0.000624,0.000684,0.000364,5.4e-05,0.000594,0.000688,0.000647,0.000631,0.000383,0.000327,0.00053,0.000364,0.000166,0.000213,0.000157,0.000539,0.000527,0.000241,0.000362,0.000437,0.000275,0.000571
0.000829,0.000372,0.000604,0.000109,0.000232,0.00062,0.000552,0.000328,0.000442,0.000413,0.000278,0.000226,0.000634,9.7e-05,5.6e-05,0.000172,0.000318,0.000387,0.000556,0.000382,0.00022,0.000509,0.000137,0.000479,0.000331,0.000372,0.000388,0.000186,0.000309,6e-05,0.001008,0.000819,0.000527,0.000767,0.000707,0.000428,0.000607,0.000431,0.000199,0.000677,0.000591,0.000243,0.00044,0.000101,0.000531,0.000311,0.000591,0.000459,0.000462,0.000633,0.000516,0.000312,0.000531,0.000413,0.000737,0.00075,0.000594,0.000783,0.000251,0.000124,0.000135,0.000202,0.000379,0.00022,0.000154,0.000467,0.00043,8.5e-05,0.000275,0.000335,0.000394,0.000141,9.6e-05,5.1e-05,0.000181,0.000169,0.000438,0.000636,0.000576,0.000491,0.000494,0.000651,0.000421,0.000538,0.000298,0.000711,0.00012,0.000234,0.000274,0.000472,7.7e-05,0.000324,0.000137,1e-04,0.000333,0.000394,0.000287,0.000115,0.000294,0.00059,0.00101,0.000688,0.000679,0.000621,0.000178,8.9e-05,0.000333,0.000272,0.000168,0.000296,0.000329,0.000238,0.00048,0.000298,0.000428,0.000203,1.8e-05,0.000311,3.1e-05,0.000206,0.000287
0.000295,6.6e-05,0.000365,0.00022,0.000515,0.000602,0.000225,9.4e-05,0.000202,0.000369,0.000435,0.000424,0.000226,0.000242,0.000389,0.000118,8.8e-05,8e-05,0.000427,0.000669,0.000532,0.000127,0.000504,0.000485,0.000205,0.000367,0.000471,0.000402,0.000744,0.000156,0.000898,0.000308,0.000391,0.00024,0.000234,0.000421,0.00047,0.000198,0.000265,0.00067,0.000212,0.000537,0.000338,0.000488,0.000434,0.000527,0.000686,0.000183,0.000366,0.000557,0.000484,0.000538,0.000248,0.000308,0.000238,0.000265,0.000561,0.000449,0.000635,0.000182,0.000451,6.3e-05,0.000217,2.1e-05,9.7e-05,0.000297,0.000125,4.1e-05,0.000684,0.000123,0.000504,0.000218,0.000339,0.000119,0.000296,0.000132,0.000564,0.000289,0.000304,2.3e-05,0.000429,0.00059,0.000431,0.000184,0.000369,0.000585,0.000399,0.000311,0.000341,0.00071,0.000468,0.000179,0.000451,0.000544,0.000481,0.000404,0.000582,0.00043,0.000502,0.000974,6.4e-05,0.000192,0.000598,0.000342,0.000221,0.000187,0.000449,0.000104,0.000185,0.000334,3.4e-05,0.000359,0.000649,0.000392,0.000732,0.000512,0.00019,0.000336,0.000224,0.000297,0.000222
0.000263,0.000418,0.00038,0.000174,0.000638,0.001089,0.000713,0.000198,0.000869,0.000466,0.00084,0.000442,0.000264,0.000412,0.000662,0.000697,0.000301,2.8e-05,0.000236,0.000666,0.000206,0.00085,0.000746,0.000308,0.000371,3e-05,0.000257,0.000757,0.001251,0.001676,0.001052,0.000896,0.000594,8.8e-05,0.000318,0.000176,0.000887,0.001285,0.001101,0.001302,0.000682,0.000662,0.00086,0.000646,0.000351,0.000821,0.00099,0.000864,0.000219,0.000867,0.000581,0.000779,0.000681,0.000954,0.000808,0.000579,0.000784,0.000724,0.00072,8e-04,0.000606,0.000861,0.000674,0.00044,0.000293,0.00041,0.000318,0.000334,0.000981,0.000672,3e-04,0.000447,0.000778,0.000583,0.000244,0.00026,0.000404,0.000655,0.00042,0.00025,0.000838,0.001081,9.2e-05,0.000705,0.000753,0.000592,0.000313,8.3e-05,0.000243,0.000614,0.000703,0.000603,0.001009,0.000372,0.00022,0.000128,0.000729,0.000702,0.000249,0.000746,0.000689,0.000513,0.000545,0.000536,0.000482,0.000264,0.000417,0.000445,0.000141,0.000274,0.000215,0.000548,0.00089,0.000418,0.000513,0.000505,0.000533,0.000411,0.000188,0.000452,0.000349
0.000407,0.000268,0.000698,0.000373,0.000674,0.000533,0.000233,0.000489,0.000917,0.000809,0.001007,0.000925,0.001097,0.000471,0.000289,0.000225,0.00034,0.00041,0.000298,0.000113,0.000509,0.001111,0.001108,0.000942,0.000327,0.000119,0.000415,0.000805,0.000739,0.001211,0.000827,0.00053,0.000587,0.000708,8.8e-05,0.000355,0.000896,0.001223,0.000864,0.000729,0.000896,0.000639,0.000321,0.00013,0.000422,0.000807,0.001264,0.000594,0.000527,0.00111,0.001608,0.001133,0.000634,0.000711,0.001146,0.000499,0.000467,0.000268,0.000191,0.000639,0.00025,0.000824,0.000221,0.000661,0.000466,0.000554,0.000136,0.000328,0.000922,0.000971,0.00085,0.000341,0.00057,0.00115,0.000902,0.000495,0.000629,0.000729,0.000694,0.000232,0.000995,0.001117,0.001129,0.001423,0.001312,0.000913,0.000503,0.000588,0.000533,0.000545,0.000489,8.1e-05,0.000716,0.001148,0.000939,0.000566,0.000838,0.00036,0.000146,0.000297,0.000145,0.000503,0.000728,0.000462,0.000324,0.000271,0.000438,0.000391,0.000466,0.000509,0.000487,0.000694,0.001287,0.00108,0.000456,0.00039,0.000291,0.000217,0.000132,0.000321,0.000537
0.00044,0.00036,0.000505,0.00031,0.000287,0.000152,0.000419,0.000189,0.000352,0.000625,0.000805,0.000696,0.000613,0.000192,8.6e-05,0.000401,0.000151,0.00027,0.000419,0.000317,0.000431,0.000685,0.000779,0.000385,0.000464,0.000292,0.000604,0.000643,0.000667,0.000222,0.000872,0.000562,0.000247,0.000491,0.000538,0.000161,0.000325,0.000865,0.000169,0.000286,0.000532,1e-04,0.000456,0.000386,0.000605,0.000182,0.000492,0.000363,0.000455,0.000593,6e-04,0.000541,0.000511,0.000256,0.000728,0.000509,0.000163,0.000605,0.000525,4e-04,0.000109,0.000596,0.000561,0.000607,0.00021,0.00056,0.000825,0.000427,0.000376,0.000533,0.00023,0.000183,0.000572,0.001016,5.6e-05,9.4e-05,0.000321,0.000314,0.000289,0.000781,0.000938,0.000857,0.000362,0.000678,3.9e-05,0.000468,0.000504,0.000651,0.000354,0.000268,0.000524,0.000637,0.000199,0.000412,0.000743,0.000338,0.000782,0.000553,0.000132,0.000206,0.000155,0.000538,0.000389,0.000597,0.000246,0.000325,0.000461,0.000193,0.000409,0.000287,0.000273,0.000248,0.00068,0.000425,9e-05,0.000175,0.000238,0.000191,0.000206,0.000222,0.000192
0.000223,9.7e-05,0.000306,0.000483,0.000436,0.000588,5.8e-05,0.000229,0.000183,0.000354,0.000504,0.000572,0.000443,0.000129,0.000215,0.000557,0.000449,0.000381,0.000481,0.000468,0.000539,1.5e-05,0.000622,0.000388,0.000465,0.000394,0.000659,7.5e-05,0.000227,0.000242,0.000679,0.000618,0.000464,0.000575,0.000441,0.000547,0.000245,0.000373,0.00027,0.000282,0.000343,0.000193,0.000328,0.000233,0.000589,0.000965,0.000451,0.000382,0.000174,0.000619,0.000757,0.000849,0.000193,0.000767,0.000584,0.000697,0.000292,0.000618,0.000395,0.000334,0.000349,0.000341,0.000443,0.00028,0.000683,0.00048,0.000457,0.000378,0.000204,0.000764,0.00071,0.000321,0.000503,0.000268,0.000543,0.000352,0.000326,0.00053,0.000661,0.000718,0.000437,0.000418,0.000706,0.00031,0.000138,0.000416,0.000229,0.000465,0.000508,0.000314,0.000169,0.000435,0.000446,0.000295,0.000719,0.000519,0.000314,0.000464,0.000448,0.00042,5.8e-05,0.000356,1.6e-05,0.000659,0.000344,0.000421,0.000318,8.4e-05,0.000348,0.000317,0.000563,0.000582,0.000834,0.000478,0.000425,0.000488,0.000397,0.000135,0.000332,0.000195,0.000123
0.000331,0.000395,0.000152,0.000322,0.000275,0.000299,0.000307,0.000269,2.2e-05,0.000181,0.000383,0.000121,0.000196,0.000121,0.000315,0.000337,0.00032,0.000272,0.000136,0.000143,1.8e-05,0.000178,0.000501,0.000246,7e-05,0.000128,0.000107,0.000141,0.000168,0.000203,0.000289,0.000362,0.000248,0.000183,0.000206,0.000141,0.000139,0.000247,5.6e-05,0.000313,0.000159,0.000113,0.000236,3.2e-05,0.000315,0.000456,0.00025,0.000105,4e-05,0.000267,0.000459,0.000167,0.000385,0.000666,0.000303,0.00025,0.000192,0.000467,0.000458,0.000498,0.00014,0.000115,0.000224,0.000298,0.000646,0.000381,0.000276,0.000269,0.000348,0.000395,0.000224,0.000179,0.000257,0.000218,0.000287,0.000153,0.000318,0.000146,0.000178,0.000272,0.000206,0.000442,0.000443,0.000199,0.000232,0.000106,0.000334,0.000186,0.00017,0.000111,0.000204,8.2e-05,0.000158,0.000283,0.000233,7.7e-05,0.000349,0.000108,0.000135,0.000104,0.000224,0.000138,3.6e-05,0.000439,0.000293,0.000418,0.000285,0.000214,0.000243,0.000445,0.000453,9.7e-05,0.000436,0.000284,0.00021,0.000334,0.000159,5.9e-05,0.000175,0.000276,0.000238
0.000102,0.000157,6.8e-05,0.000189,0.000287,0.000101,7.4e-05,0.000122,4.6e-05,3e-04,0.000157,7.7e-05,0.000129,4e-05,0.000183,7.3e-05,9.9e-05,0.000203,9.8e-05,4e-05,9.6e-05,4.2e-05,0.00024,7.2e-05,5.5e-05,0.000143,0.000167,9.9e-05,0.000153,2.7e-05,0.000243,0.000247,0.000106,0.000209,3.9e-05,6.7e-05,0.000139,0.00012,0.000179,0.000101,7.5e-05,8.7e-05,0.000266,6.1e-05,7.3e-05,0.00028,0.000125,0.000111,6.5e-05,6.7e-05,0.000226,8.6e-05,0.000251,0.000335,9.6e-05,0.00014,0.000131,0.000313,0.000288,0.000237,5.1e-05,0.000139,0.000187,0.000121,0.000265,0.000141,6.6e-05,0.000116,0.000192,0.000132,4.2e-05,6.1e-05,0.000189,4.1e-05,2.5e-05,9.8e-05,0.000218,7.4e-05,6.1e-05,0.000202,7.5e-05,0.000197,0.00027,0.000148,0.000148,0.000106,0.000202,2.8e-05,0.000193,5.9e-05,0.000125,0.000145,8.4e-05,0.000205,0.000134,3.5e-05,7.1e-05,4.8e-05,1.1e-05,9.6e-05,7.5e-05,0.000142,0.000105,5e-05,6.9e-05,0.000166,5e-05,0.000142,8.8e-05,0.000123,0.000131,4.3e-05,0.000329,0.000155,0.000107,0.000112,4.8e-05,1.3e-05,8.2e-05,0.000155,0.00011
5.1e-05,0.000172,0.000157,9.2e-05,0.000181,0.000112,0.000175,0.000115,6.5e-05,0.000264,0.000146,5.4e-05,0.000154,3.7e-05,0.000168,5.5e-05,0.000187,0.000172,8.1e-05,0.000107,3.5e-05,3.5e-05,0.000242,9.4e-05,4.1e-05,6.8e-05,0.000237,8.2e-05,0.000127,0.00016,0.000206,0.000227,0.000151,0.000123,1.1e-05,6.9e-05,0.000122,0.000207,0.000214,0.000102,9.8e-05,8.6e-05,0.000261,9.6e-05,7.8e-05,0.000293,0.000106,4.5e-05,0.000114,0.00011,4.9e-05,0.00015,0.000155,0.000126,9.4e-05,0.000134,0.000166,0.000338,0.000273,0.000263,5.5e-05,0.000131,0.000115,0.000132,0.000214,0.000144,0.000145,4.7e-05,0.000248,0.000206,9.3e-05,8.3e-05,0.000198,0.000142,0.00012,0.000152,0.000138,9e-05,0.000109,5.6e-05,8.6e-05,0.000145,0.000257,0.000126,0.000172,4.4e-05,0.000155,7.8e-05,0.000151,3.6e-05,0.000116,0.000121,7.8e-05,0.000127,9.4e-05,1e-04,6.6e-05,4e-05,5.2e-05,0.000132,0.000101,0.000163,0.000183,0.000109,6.1e-05,8.9e-05,5e-05,7.2e-05,5.3e-05,6.9e-05,9.7e-05,0.000139,0.000167,9.5e-05,5.5e-05,6.7e-05,4.4e-05,9e-05,0.000104,0.00014,5.3e-05
0.000244,0.000264,0.00027,0.000222,0.000153,0.000229,0.000155,2.2e-05,4.5e-05,0.000403,0.000251,0.000107,0.000231,0.000204,0.000243,0.000109,0.00038,0.000138,0.000125,0.000128,0.000176,4.5e-05,0.000298,5.7e-05,0.00012,4.2e-05,0.000266,0.000305,0.000129,0.000172,9.3e-05,0.000239,3.7e-05,0.000176,5.7e-05,7e-05,0.000194,0.000291,0.000205,4.1e-05,0.00011,9.8e-05,0.00024,0.000115,0.000273,0.000436,0.000171,7.2e-05,0.000103,6.8e-05,0.00015,9.4e-05,0.000285,1.8e-05,0.000173,8.8e-05,0.000132,0.000325,0.000172,0.000308,8e-05,0.000349,0.000194,0.000103,6.9e-05,0.000139,0.000277,0.000223,0.00029,0.000149,0.000253,0.000217,0.000138,7.1e-05,0.000105,0.000152,5.8e-05,8.1e-05,0.00031,0.000108,0.000157,0.000187,0.000215,0.000179,9.4e-05,0.000145,0.000208,8.3e-05,0.000203,0.000138,0.000102,0.000129,0.000102,0.000135,0.00013,0.000145,4.2e-05,6.7e-05,8.8e-05,0.000168,8.5e-05,0.000171,0.000219,0.000217,0.000161,0.000122,0.000138,5.5e-05,9.9e-05,0.000155,3.1e-05,0.000228,0.000321,0.000148,0.000125,8.2e-05,0.000205,5.5e-05,0.000169,0.000171,0.000105
0.000206,0.00012,0.000598,0.000432,0.000283,0.000339,0.000388,0.000212,0.000347,0.000712,0.000573,0.000568,2e-04,0.000554,0.000365,0.000293,0.00037,0.000569,0.000149,0.000175,0.000223,0.000426,0.000316,0.000159,0.000192,0.000261,0.000363,0.000397,0.000406,0.000583,0.000296,0.00018,0.000314,0.000239,0.00027,9.2e-05,8.3e-05,0.000523,0.00044,0.000441,0.000209,0.000323,0.000281,0.000347,0.000397,0.000259,0.000494,3.7e-05,0.000183,0.000354,0.000112,0.000377,0.000461,0.00015,0.000188,0.000263,0.000626,0.000536,0.000406,0.000605,0.000162,0.000482,0.000591,0.000232,7.1e-05,0.000379,0.000265,6e-05,0.000124,0.000427,0.000596,0.000683,0.000772,0.000145,0.000252,0.000142,0.000112,5.4e-05,0.00048,0.000524,0.000792,0.000694,0.000431,0.000269,0.000278,0.000311,5.6e-05,0.000177,0.000195,0.000141,0.000335,0.000168,7.9e-05,0.000214,0.000212,0.000208,0.000306,9.6e-05,0.000268,0.000267,7.9e-05,0.00036,0.000539,0.000389,0.000294,0.000384,0.000132,7.3e-05,0.000146,0.000145,1.4e-05,0.000386,4.7e-05,0.000423,0.000382,0.000373,0.000363,0.00021,0.000571,0.000501,0.000541
0.001236,0.000891,0.000615,0.000914,0.000925,0.00068,0.000593,0.000311,0.000463,0.000739,0.000468,0.000461,0.000952,0.001354,0.000741,0.000224,0.000307,0.000357,0.000508,0.000404,0.000252,0.000597,0.000433,0.00026,0.000255,0.000426,0.00064,0.00028,0.000407,0.001258,0.001125,0.00062,0.000356,0.000426,0.000505,0.000549,0.000437,0.00073,0.001064,0.00147,0.000931,0.000711,0.000271,0.000254,0.000629,0.001078,0.001128,0.001018,0.000253,0.000438,0.000206,0.000574,0.000895,0.001025,0.000896,0.000355,0.000652,0.001267,0.001424,0.001717,0.001253,0.000947,0.001114,0.000914,0.00034,0.000557,0.000821,0.000706,0.000431,0.000616,0.000409,0.000729,0.000314,0.000777,0.000799,0.000539,0.000422,0.000293,0.000527,0.000208,0.000605,0.000287,5.5e-05,0.00057,0.000301,0.000671,0.000691,0.00063,0.000298,0.000159,0.000319,0.000407,0.000324,0.000139,6e-05,0.000115,0.000269,0.00035,0.000241,0.000603,0.000633,0.000702,0.000845,0.000689,0.000418,0.000241,0.000274,0.000189,0.000241,0.000408,0.000431,0.000384,0.000517,0.000604,0.000596,0.000118,0.000516,0.000505,0.000417,0.000293,0.000239
0.000438,0.000376,0.000402,0.000151,2e-04,0.000129,0.000429,0.000409,0.000216,0.000319,1.8e-05,0.000634,0.000516,0.000817,0.000417,0.000264,0.00017,0.000379,0.000342,0.000259,0.000369,0.000409,0.00032,0.000403,0.000381,0.000266,0.000388,0.000246,0.000694,0.000954,0.000807,0.000542,0.000625,0.000506,0.000272,5.5e-05,0.000181,0.000293,0.000614,0.000544,0.000545,0.000424,0.000286,0.000175,0.000248,0.000718,0.000689,0.000511,0.000685,0.000288,0.000276,0.000528,0.000254,0.000551,0.000525,0.000137,0.000521,0.000361,0.000333,0.000774,0.000777,2e-04,0.000575,0.00021,0.000208,0.000437,0.00048,0.000838,0.000411,0.000237,0.000234,0.000521,0.000562,0.000752,0.000265,0.000178,0.000122,9.6e-05,0.000304,0.000233,0.000394,0.000282,0.000158,0.000415,0.000326,0.000568,0.000419,0.000344,0.000433,0.00025,0.000231,0.000342,0.000114,0.000223,0.000343,0.000251,0.000374,3e-04,0.000307,0.000415,0.000352,0.000193,0.000203,0.000289,0.000316,0.000489,0.000243,4.2e-05,0.000279,0.000256,0.000189,0.000452,0.00016,0.000152,2e-05,0.000222,0.000369,0.000359,0.000522,0.000302,0.000244
0.000105,0.000247,0.000142,6.7e-05,3.5e-05,0.000187,0.000419,0.000281,0.000335,4.2e-05,0.000165,0.000327,0.000272,0.000392,0.000229,5.1e-05,0.000147,5.3e-05,0.000162,0.000313,0.000191,0.000174,0.000194,0.000465,0.000316,0.000252,0.000138,0.000323,0.000369,0.000345,0.000332,0.000144,0.000226,9.2e-05,9e-05,0.000104,0.000125,0.00022,0.000304,0.000237,0.000306,0.000198,0.000136,0.000258,0.000302,0.000244,5.1e-05,0.000313,0.000297,0.000173,0.000211,0.000109,4.7e-05,0.000543,0.000133,0.000318,0.000102,0.000134,8.1e-05,0.000422,0.000119,0.00056,0.000174,0.000191,0.000146,0.000251,0.000353,0.000447,0.000208,0.000117,0.000153,0.000128,0.000244,0.000167,8.1e-05,0.000152,7.8e-05,3e-05,0.000247,0.000183,0.000314,7.7e-05,6.5e-05,0.00015,0.000237,0.000188,8e-05,0.00034,0.000137,6.1e-05,0.000259,0.000231,0.000212,9.3e-05,0.000234,0.000186,0.000156,0.000174,0.000278,0.000114,0.000181,6.1e-05,0.000144,6.5e-05,0.000183,0.000226,0.000213,0.000184,0.000166,2.4e-05,8.9e-05,0.000169,0.000155,4.3e-05,0.000186,0.000302,0.000177,2e-04,6.8e-05,0.000186,7.3e-05
0.000219,0.000245,0.000289,0.000273,0.000217,0.000224,0.000241,0.00015,0.00022,0.000101,0.000134,5.7e-05,0.00016,6.4e-05,0.00016,0.000213,0.000118,2.7e-05,8.6e-05,0.000303,0.000411,0.000255,0.000137,0.000196,0.00016,9.4e-05,0.000154,0.00024,0.000217,0.000278,0.000201,4.2e-05,0.000118,8e-05,2.7e-05,0.000123,6.8e-05,0.000133,0.000221,5.9e-05,0.000317,0.00035,0.000171,0.000164,0.000263,0.000393,0.000263,0.000214,0.000181,0.000176,0.000263,8.6e-05,0.000293,0.00048,0.000118,0.000189,0.000161,0.000236,0.000342,0.000229,3.3e-05,0.000246,0.000341,0.000343,0.000156,0.000157,0.000231,0.000162,8.6e-05,5e-05,9.2e-05,0.000111,0.000122,2.5e-05,0.000126,2.3e-05,5.8e-05,0.000142,0.000292,0.000194,0.000137,0.00016,0.000195,0.00022,0.000104,0.000217,0.000258,0.000169,2e-04,0.000241,0.000318,0.00011,1.6e-05,9.1e-05,0.000108,0.000136,0.000135,0.000142,0.000193,0.000145,0.000156,0.000161,0.000181,0.000142,4.9e-05,0.000234,0.000109,4.3e-05,7.1e-05,0.000117,0.000171,4.7e-05,2.2e-05,6.4e-05,0.000234,4.2e-05,9.5e-05,5.8e-05,5.6e-05,0.000152,0.000163
0.000119,0.000296,5.6e-05,0.000198,4.4e-05,5e-05,0.000142,4.7e-05,0.000138,8.3e-05,0.000285,0.000127,0.000215,0.000135,6.3e-05,0.000205,0.000138,4.2e-05,0.000191,6.3e-05,0.000318,0.000174,6.3e-05,0.00017,0.000244,0.000216,5.4e-05,0.000105,0.000187,0.000113,5.6e-05,0.000162,0.000172,0.000187,6e-05,0.000103,5.7e-05,9.7e-05,0.000119,0.000113,0.000132,0.000171,0.000185,9.3e-05,0.000229,0.000331,6.9e-05,0.000246,0.000192,0.000209,9e-05,0.000291,0.000147,0.000211,0.00014,0.000209,6.6e-05,0.000327,4.2e-05,0.000128,7.6e-05,1e-04,0.000216,3.7e-05,9.5e-05,0.000106,7e-05,7.5e-05,3.7e-05,3.3e-05,0.000113,0.000186,0.000173,0.000154,7.1e-05,9.5e-05,8.9e-05,0.000122,0.000132,0.000134,0.00012,0.000108,0.000242,0.000227,0.000124,6.6e-05,0.000203,0.000157,9e-05,0.000166,0.000109,0.000191,0.000108,2.6e-05,0.000209,0.000164,0.000147,6.5e-05,0.000215,6.9e-05,3.4e-05,0.000163,7.8e-05,0.000183,0.000122,0.000161,4.5e-05,1.8e-05,3.1e-05,0.000145,0.00018,0.00013,0.000181,6.2e-05,0.000195,0.000215,7.9e-05,0.000141,9.2e-05,0.000119,0.000106
0.000385,0.000287,0.000193,0.000238,0.000212,0.000254,0.000165,0.000121,0.000199,8.1e-05,0.00023,0.000233,0.000201,0.000151,0.00012,0.000267,0.000255,0.000217,0.00018,5.1e-05,0.000314,0.000397,0.000253,0.000122,7e-06,4.4e-05,0.000129,0.000248,3.7e-05,8.9e-05,5.1e-05,8.6e-05,0.000125,8.7e-05,6.9e-05,2.9e-05,8.8e-05,9.2e-05,0.000167,0.000159,0.000162,5.9e-05,0.000155,5e-05,0.000206,2.3e-05,5.4e-05,0.000134,1.8e-05,6.1e-05,0.000163,0.000298,0.000317,0.000367,0.000233,0.000169,2.3e-05,0.000165,0.000235,7e-05,0.000148,0.000231,0.000177,0.000226,0.000229,0.000121,7.7e-05,1e-05,0.00015,0.000102,0.000238,0.000203,0.000103,0.000155,0.000198,0.000206,0.000157,0.000135,0.000103,0.000101,0.000259,0.000166,7.8e-05,0.00024,0.000101,0.000151,0.000131,0.00016,0.000215,0.00028,0.000193,0.000138,0.00013,6.3e-05,0.000225,7e-05,0.00015,0.000128,0.000175,9.3e-05,9.4e-05,9.3e-05,0.000162,2.7e-05,4.2e-05,0.000142,0.000147,5e-05,2.4e-05,9e-05,7e-05,5.6e-05,0.000172,0.000203,7.4e-05,0.000163,0.000234,0.000139,0.000109,6.5e-05,6.8e-05
4.8e-05,9.3e-05,5.7e-05,4.4e-05,8.4e-05,8e-05,6.3e-05,0.000106,8e-06,1.4e-05,9e-05,0.000123,0.000131,4.8e-05,2.6e-05,9.8e-05,9.1e-05,5.2e-05,5.6e-05,1.4e-05,8.9e-05,5.7e-05,2.1e-05,3.4e-05,5.3e-05,4.6e-05,5.1e-05,5.5e-05,7.9e-05,7.9e-05,9.3e-05,6.1e-05,2.5e-05,4e-05,2.7e-05,6.7e-05,7.1e-05,7e-05,6.5e-05,6.5e-05,4.3e-05,1.9e-05,5.4e-05,2.5e-05,9.2e-05,3.3e-05,4.4e-05,4.8e-05,3.4e-05,1.4e-05,2.8e-05,4.1e-05,7.6e-05,0.000166,8.4e-05,7.8e-05,6.2e-05,8.8e-05,9.1e-05,7.7e-05,1.1e-05,6.9e-05,4.3e-05,2.6e-05,4.1e-05,3.2e-05,4.9e-05,5.1e-05,8.7e-05,8.7e-05,7.1e-05,4.8e-05,3.1e-05,6.1e-05,1e-05,3.4e-05,3.9e-05,4.7e-05,3.2e-05,8.2e-05,8e-05,3.9e-05,3.3e-05,1.1e-05,3.7e-05,5.8e-05,4.2e-05,8.9e-05,1e-04,1.6e-05,6.6e-05,8.2e-05,7.5e-05,3.3e-05,4e-05,1.3e-05,6.6e-05,4.6e-05,5.5e-05,3.8e-05,6e-05,6.7e-05,4.4e-05,3e-05,3.5e-05,8.2e-05,5.1e-05,4.4e-05,3.9e-05,6.4e-05,3.6e-05,3.7e-05,5.9e-05,6e-05,6.9e-05,1.1e-05,3.3e-05,3.1e-05,2.8e-05,2.6e-05,6.5e-05
1.6e-05,2.1e-05,2.4e-05,3.9e-05,4.5e-05,2.4e-05,1.5e-05,4.5e-05,3.1e-05,2.5e-05,3.6e-05,5.2e-05,6.3e-05,1.6e-05,2.1e-05,4.2e-05,3.5e-05,2.3e-05,4.4e-05,1.5e-05,4.1e-05,3.1e-05,3.4e-05,1.4e-05,3.7e-05,3.2e-05,3e-05,3.1e-05,6.7e-05,4.4e-05,7.7e-05,4e-05,2.8e-05,1.5e-05,1e-05,4.5e-05,3.4e-05,3.2e-05,5.4e-05,4.2e-05,6e-06,3e-06,4.1e-05,1.9e-05,4.6e-05,2e-05,4.8e-05,2.4e-05,2.3e-05,1.2e-05,1.6e-05,3.7e-05,5.3e-05,0.00012,5.3e-05,5.7e-05,3.7e-05,4.1e-05,5.2e-05,3.2e-05,7e-06,3.9e-05,3.6e-05,1.3e-05,3.7e-05,2.4e-05,4.5e-05,3.4e-05,4.6e-05,3.5e-05,4.2e-05,4e-05,7e-06,1e-05,1.7e-05,1.1e-05,2.3e-05,3.8e-05,5e-06,6e-05,3.8e-05,1.1e-05,3.9e-05,2.1e-05,2.7e-05,3.7e-05,2.2e-05,4e-05,6.3e-05,3.4e-05,4.2e-05,4.8e-05,9e-06,3e-05,3.1e-05,1.3e-05,5.3e-05,9e-06,4.4e-05,2.4e-05,2e-05,3e-05,4e-05,1.9e-05,3.1e-05,3.4e-05,5e-06,1.5e-05,2.4e-05,4.6e-05,1.6e-05,1.5e-05,3e-05,3e-05,2.6e-05,1.6e-05,1.8e-05,8e-06,3.6e-05,1.9e-05,2e-05
1.5e-05,1.4e-05,1e-05,2.8e-05,1.9e-05,1e-05,1.2e-05,4.4e-05,3e-05,1.8e-05,2.2e-05,4.7e-05,5.1e-05,1.6e-05,1.7e-05,3.3e-05,2.7e-05,1.5e-05,4.4e-05,1e-05,3.2e-05,2.7e-05,3.2e-05,1.3e-05,2.7e-05,3.2e-05,2.9e-05,2.3e-05,6.7e-05,4.4e-05,6.2e-05,4e-05,6e-06,6e-06,1e-05,4.2e-05,2.5e-05,2.6e-05,4.8e-05,3.2e-05,1.4e-05,2e-06,3e-05,2.1e-05,5.2e-05,2.3e-05,3.8e-05,3.5e-05,1.2e-05,1.1e-05,2.4e-05,3.8e-05,2.8e-05,0.000102,4.2e-05,5.2e-05,2.9e-05,3.5e-05,2.7e-05,3e-05,4e-06,3.3e-05,2.5e-05,1e-06,3.8e-05,2.6e-05,3.8e-05,3.5e-05,3.3e-05,2e-05,2.8e-05,3.2e-05,8e-06,7e-06,1.1e-05,1.9e-05,1.7e-05,2.3e-05,1e-06,4.9e-05,3.2e-05,4e-06,4.1e-05,2.7e-05,2e-05,3.1e-05,3.1e-05,3e-05,4.4e-05,2.5e-05,3.6e-05,2.9e-05,1.5e-05,2e-05,2.3e-05,6e-06,4.9e-05,7e-06,4.2e-05,1.4e-05,1.7e-05,1.4e-05,2.8e-05,1.1e-05,1.3e-05,1.8e-05,8e-06,2.1e-05,1.6e-05,3e-05,2.3e-05,2.2e-05,2.6e-05,2.4e-05,2.5e-05,1.1e-05,2.1e-05,3e-06,2.8e-05,2.2e-05,1.6e-05
1.9e-05,1.7e-05,2e-05,2.8e-05,1.8e-05,7e-06,1.5e-05,3.1e-05,2.7e-05,1.1e-05,2.2e-05,4.4e-05,3.6e-05,1.3e-05,1.5e-05,1.5e-05,1.7e-05,1.1e-05,3e-05,1.7e-05,1.8e-05,3.2e-05,2.6e-05,4e-06,2.5e-05,2.1e-05,2e-05,2.9e-05,5.4e-05,3.6e-05,6.2e-05,3.5e-05,1.9e-05,4e-06,1e-05,3.6e-05,2.2e-05,1.7e-05,3.5e-05,2.3e-05,7e-06,4e-06,2.2e-05,1e-05,4.3e-05,2e-05,3.8e-05,3.3e-05,2e-05,1.1e-05,2.1e-05,3.4e-05,3e-05,0.000105,3.1e-05,5.2e-05,1.7e-05,3.7e-05,1.7e-05,3.4e-05,1.3e-05,1.7e-05,2.3e-05,1.1e-05,2.6e-05,2.2e-05,3.8e-05,3.9e-05,2.4e-05,2e-05,2.3e-05,2.6e-05,1.4e-05,9e-06,5e-06,1.4e-05,8e-06,2.3e-05,3e-06,3.5e-05,4.7e-05,1.7e-05,3.7e-05,2.3e-05,6e-06,3.2e-05,2.1e-05,2.6e-05,3.8e-05,1.8e-05,3.4e-05,2.3e-05,1.2e-05,2.3e-05,1.4e-05,2e-06,3.8e-05,3e-06,3.8e-05,1.7e-05,1.9e-05,2.3e-05,2.3e-05,6e-06,1.3e-05,1.2e-05,1e-06,2.1e-05,1.8e-05,2.8e-05,1.6e-05,8e-06,2.1e-05,2.1e-05,2e-05,1.2e-05,1.2e-05,7e-06,1.9e-05,1.7e-05,7e-06
2.5e-05,1.8e-05,1.6e-05,1.7e-05,2e-05,1.1e-05,1.9e-05,3.1e-05,2.2e-05,1.2e-05,1.4e-05,3.6e-05,2.9e-05,1.2e-05,2.1e-05,2.2e-05,1.7e-05,6e-06,3.4e-05,1.9e-05,2.4e-05,3.1e-05,2.5e-05,1.2e-05,1e-05,1.3e-05,1.3e-05,3.1e-05,4.6e-05,4.2e-05,5e-05,2.1e-05,1.5e-05,5e-06,5e-06,3.3e-05,2.2e-05,2.6e-05,3.5e-05,3.1e-05,8e-06,7e-06,3.3e-05,1.2e-05,3.7e-05,1.6e-05,3.5e-05,3.5e-05,1.8e-05,1.2e-05,2.9e-05,3e-05,2.9e-05,1e-04,2.4e-05,4.2e-05,1.9e-05,2.4e-05,1.5e-05,3.3e-05,1e-05,1.9e-05,1.5e-05,1.2e-05,2.5e-05,2.3e-05,3.3e-05,2.8e-05,2.6e-05,1.4e-05,1.6e-05,2e-05,1e-05,4e-06,7e-06,7e-06,9e-06,2e-05,0,2.5e-05,4.2e-05,1.2e-05,3.4e-05,1.7e-05,1.5e-05,2.6e-05,1.9e-05,2.4e-05,4.1e-05,1.9e-05,3.4e-05,1.6e-05,1.5e-05,2e-05,1.4e-05,3e-06,3.2e-05,6e-06,3.6e-05,1.2e-05,1.9e-05,2.2e-05,1.8e-05,4e-06,7e-06,1.2e-05,2e-06,1.8e-05,1.8e-05,2.9e-05,9e-06,1.4e-05,2.6e-05,1.3e-05,5e-06,7e-06,8e-06,5e-06,1.7e-05,9e-06,1e-05
2e-05,2.2e-05,1.9e-05,1e-05,1.4e-05,8e-06,1.2e-05,3.3e-05,2.6e-05,1.1e-05,1.2e-05,3.4e-05,2.6e-05,1.4e-05,2.8e-05,9e-06,4e-06,1.1e-05,2.9e-05,1.4e-05,2.2e-05,3e-05,2.6e-05,1.2e-05,8e-06,6e-06,1.4e-05,3e-05,3.1e-05,3.3e-05,6.3e-05,3.1e-05,5e-06,4e-06,9e-06,3.3e-05,1.6e-05,2e-05,3.6e-05,3.1e-05,1.8e-05,4e-06,2.5e-05,1.2e-05,2.9e-05,4e-06,2.6e-05,3.3e-05,1.8e-05,7e-06,2.2e-05,3.1e-05,2.2e-05,9e-05,2.8e-05,3.8e-05,2.2e-05,2.3e-05,2.5e-05,2.3e-05,9e-06,1.4e-05,7e-06,8e-06,3.3e-05,2.3e-05,2.7e-05,2.7e-05,2.4e-05,2.2e-05,1.5e-05,2.7e-05,4e-06,1e-06,1.2e-05,1.5e-05,1.6e-05,2.4e-05,3e-06,3e-05,3.3e-05,9e-06,3.7e-05,1.8e-05,1.6e-05,2.2e-05,2.1e-05,1.3e-05,3.3e-05,1.7e-05,2.7e-05,2.2e-05,1.4e-05,1.5e-05,8e-06,7e-06,3.1e-05,2e-06,3.4e-05,1.1e-05,1.1e-05,2.4e-05,1.6e-05,4e-06,2e-06,6e-06,8e-06,1.3e-05,1.1e-05,2.7e-05,7e-06,1.1e-05,1.6e-05,1.1e-05,1.2e-05,1.2e-05,9e-06,4e-06,2e-05,9e-06,8e-06
2.4e-05,1.4e-05,1.3e-05,1.1e-05,1.6e-05,1e-06,1.2e-05,2.7e-05,3e-05,6e-06,3e-06,2.4e-05,3.3e-05,1.1e-05,1.7e-05,1.6e-05,1.8e-05,1e-05,3.4e-05,2.1e-05,2.1e-05,4e-05,3.1e-05,4e-06,1.1e-05,1.6e-05,2.4e-05,3.3e-05,3.2e-05,2.8e-05,5.4e-05,2.2e-05,8e-06,1.3e-05,6e-06,2.9e-05,1.1e-05,2.3e-05,4.5e-05,2.5e-05,9e-06,5e-06,2.3e-05,1.6e-05,2.5e-05,1.2e-05,2.1e-05,1.9e-05,1.2e-05,5e-06,2.4e-05,3.5e-05,2e-05,8.9e-05,3.8e-05,3.7e-05,2.4e-05,2.5e-05,2.6e-05,2.6e-05,7e-06,3.1e-05,9e-06,1.8e-05,3.4e-05,1.8e-05,3e-05,2.8e-05,2.6e-05,2e-05,2.7e-05,2.8e-05,1.3e-05,9e-06,5e-06,7e-06,1.2e-05,1.1e-05,6e-06,3.2e-05,2.9e-05,8e-06,3.5e-05,2.5e-05,1.1e-05,1.3e-05,3.2e-05,1.5e-05,3.6e-05,1.6e-05,3e-05,2e-05,1.4e-05,1.7e-05,8e-06,3e-06,3.1e-05,8e-06,3.4e-05,1e-05,1e-05,2.1e-05,2.3e-05,1.2e-05,5e-06,7e-06,7e-06,1.6e-05,1.3e-05,3e-05,1.2e-05,5e-06,2e-05,8e-06,1.8e-05,6e-06,9e-06,2e-06,2e-05,1e-05,2.1e-05
4.3e-05,2.9e-05,8e-06,1.7e-05,5e-06,1.3e-05,1.6e-05,3.4e-05,4.4e-05,3e-05,3.4e-05,1.5e-05,6e-06,1.2e-05,2.1e-05,3.4e-05,1.7e-05,1.2e-05,2.6e-05,2.2e-05,7e-06,2.4e-05,4.5e-05,1.8e-05,1.3e-05,1.4e-05,3.1e-05,4e-05,3.3e-05,3e-05,4e-05,2.2e-05,1.8e-05,2.3e-05,1.6e-05,2.3e-05,1.1e-05,1.5e-05,2.7e-05,3.2e-05,9e-06,1.5e-05,2.9e-05,1.9e-05,3.2e-05,1.9e-05,3e-05,1.7e-05,1.6e-05,1.2e-05,3.3e-05,3.9e-05,3.4e-05,9.1e-05,4.7e-05,1.6e-05,1.1e-05,2.4e-05,2.6e-05,4.4e-05,9e-06,4.1e-05,3.5e-05,3.7e-05,2.7e-05,2.5e-05,2.6e-05,3.2e-05,2.1e-05,1.9e-05,1.5e-05,3.1e-05,1.9e-05,3.3e-05,4.3e-05,3.5e-05,3.1e-05,2.5e-05,1.8e-05,4.1e-05,3.1e-05,1e-05,2.8e-05,1.8e-05,2e-06,7e-06,1.1e-05,4.6e-05,3.6e-05,2.1e-05,2.5e-05,1.7e-05,1.6e-05,2.1e-05,1.4e-05,1.5e-05,2.9e-05,7e-06,1.8e-05,2.1e-05,2.4e-05,1.4e-05,1.9e-05,2.3e-05,3.4e-05,3.2e-05,2.7e-05,2.9e-05,1.3e-05,1.6e-05,2.2e-05,8e-06,2e-05,5e-06,1.1e-05,7e-06,1.2e-05,1e-06,2.3e-05,2.4e-05,5.1e-05
4.4e-05,2.8e-05,2.1e-05,1e-05,1.5e-05,2.4e-05,2.1e-05,5.9e-05,2e-06,2.7e-05,4e-05,3.2e-05,4.9e-05,3.5e-05,1.6e-05,2.3e-05,1.3e-05,7e-06,1.8e-05,2.6e-05,1.8e-05,2e-05,1.4e-05,3.4e-05,4.4e-05,2.3e-05,2.2e-05,3.2e-05,6.2e-05,4.9e-05,6.6e-05,2.2e-05,2.6e-05,4.3e-05,2.4e-05,2.7e-05,1.6e-05,3.4e-05,2.8e-05,3.3e-05,1e-05,1.2e-05,2e-05,1.6e-05,6e-06,1.7e-05,7e-06,1.6e-05,2e-06,2e-05,2.8e-05,2.4e-05,2e-06,6.9e-05,1.3e-05,4.1e-05,1e-05,8e-06,2e-05,3.5e-05,2.8e-05,6e-06,2.3e-05,2.5e-05,2.6e-05,1.4e-05,1.9e-05,1e-05,2.4e-05,1.8e-05,1.5e-05,3.1e-05,1.9e-05,2.5e-05,4.1e-05,2.5e-05,2.2e-05,2.3e-05,3e-06,3.2e-05,1.6e-05,9e-06,3.3e-05,1.4e-05,3.5e-05,1.4e-05,3.6e-05,1.6e-05,3.3e-05,7e-06,1.6e-05,1.3e-05,5e-06,1e-05,2.8e-05,1.9e-05,1.8e-05,1.7e-05,1.7e-05,7e-06,2.2e-05,3.2e-05,1.3e-05,2.9e-05,1.5e-05,2.5e-05,8e-06,1.1e-05,1.1e-05,2.4e-05,1.3e-05,2e-05,3.6e-05,1.4e-05,9e-06,6e-06,1.4e-05,1.4e-05,2.5e-05,3.8e-05,4.5e-05
1.1e-05,1.8e-05,3e-06,1.8e-05,1.6e-05,9e-06,8e-06,3.7e-05,1.9e-05,3.4e-05,1.5e-05,3.5e-05,3.5e-05,2.6e-05,5e-06,1.7e-05,5e-06,1e-05,1.9e-05,1.7e-05,7e-06,1.6e-05,2.4e-05,1.6e-05,1.8e-05,1.8e-05,1.7e-05,1.2e-05,5e-05,3.6e-05,3.2e-05,1.7e-05,1e-05,1.8e-05,1e-05,2.8e-05,1e-05,2.5e-05,3.6e-05,9e-06,1.2e-05,8e-06,1.8e-05,5e-06,6e-06,1.5e-05,2e-05,1.8e-05,1.9e-05,6e-06,3.2e-05,1.8e-05,2.4e-05,5.6e-05,2e-05,3.1e-05,1.7e-05,1.3e-05,9e-06,9e-06,3e-06,1.8e-05,1.3e-05,1.1e-05,1.8e-05,1.5e-05,2.5e-05,1.1e-05,2.7e-05,1.3e-05,3.1e-05,1.3e-05,1.3e-05,2.2e-05,1.4e-05,1.4e-05,1.3e-05,2.4e-05,9e-06,2.6e-05,2.3e-05,8e-06,3.9e-05,1.5e-05,1.8e-05,2.1e-05,2.2e-05,1.8e-05,3.4e-05,1.1e-05,2.5e-05,1.8e-05,7e-06,3e-06,1.3e-05,1e-05,1.7e-05,1e-05,3.2e-05,1.1e-05,1e-05,1.9e-05,2.1e-05,1.4e-05,1.5e-05,1.2e-05,6e-06,8e-06,1.7e-05,2e-05,1e-05,1.4e-05,2.4e-05,8e-06,9e-06,5e-06,1e-05,1.2e-05,1e-05,1.9e-05,2.1e-05
1.7e-05,1.9e-05,7e-06,1.4e-05,1.2e-05,5e-06,6e-06,3.9e-05,1.5e-05,2.8e-05,2.2e-05,3.9e-05,3.5e-05,2.2e-05,9e-06,1.6e-05,7e-06,8e-06,2.1e-05,5e-06,1.6e-05,1e-05,1.4e-05,8e-06,1.5e-05,2e-05,1.9e-05,1e-05,4.6e-05,2.8e-05,4.9e-05,2e-06,7e-06,1.7e-05,8e-06,2.6e-05,1.3e-05,1.3e-05,3.4e-05,2e-05,4e-06,1.2e-05,1.3e-05,1.3e-05,1e-05,7e-06,2.4e-05,2.9e-05,1.5e-05,5e-06,1.6e-05,1.5e-05,2.2e-05,7e-05,2.2e-05,3.2e-05,1.7e-05,1.8e-05,8e-06,1.9e-05,4e-06,1.5e-05,1.2e-05,5e-06,2.7e-05,1.6e-05,2.3e-05,2.3e-05,1.8e-05,6e-06,1.9e-05,8e-06,1.5e-05,1e-05,9e-06,1.4e-05,8e-06,1.6e-05,5e-06,1.6e-05,2.4e-05,1.6e-05,3.2e-05,1.6e-05,1.9e-05,1.2e-05,1.1e-05,1.9e-05,3.4e-05,1.3e-05,3e-05,1.6e-05,1.2e-05,5e-06,1.8e-05,8e-06,2.2e-05,8e-06,2.4e-05,5e-06,9e-06,1.1e-05,1.8e-05,8e-06,7e-06,1.4e-05,8e-06,7e-06,1.5e-05,2e-05,5e-06,5e-06,2e-05,1.2e-05,9e-06,5e-06,6e-06,1.4e-05,2e-05,1.2e-05,1.6e-05
1.2e-05,1.1e-05,5e-06,1.6e-05,1.4e-05,4e-06,3e-06,3.6e-05,1.8e-05,2.2e-05,1.3e-05,2.6e-05,3.2e-05,1.7e-05,3e-06,1.5e-05,6e-06,4e-06,2.4e-05,8e-06,1.8e-05,7e-06,2.3e-05,8e-06,1.8e-05,1.9e-05,2.4e-05,2.1e-05,3.4e-05,2e-05,4.4e-05,1e-05,7e-06,8e-06,7e-06,2.1e-05,1.2e-05,1.9e-05,3e-05,1.7e-05,8e-06,6e-06,2.1e-05,4e-06,1.5e-05,1.3e-05,2.2e-05,2.4e-05,1e-05,5e-06,2e-05,1.5e-05,1.8e-05,6.7e-05,1.7e-05,3.7e-05,8e-06,1.2e-05,9e-06,2.9e-05,1.3e-05,6e-06,1.5e-05,6e-06,2e-05,1.4e-05,2.1e-05,1.7e-05,1.5e-05,3e-06,1.6e-05,1.1e-05,1.2e-05,7e-06,1.2e-05,5e-06,1e-05,1.7e-05,6e-06,1.7e-05,2.6e-05,1.2e-05,4.1e-05,1.4e-05,1.8e-05,1.8e-05,2.1e-05,1.4e-05,3.7e-05,1.6e-05,2.1e-05,1.1e-05,9e-06,5e-06,1.4e-05,8e-06,2.3e-05,6e-06,2.7e-05,4e-06,1.3e-05,1.4e-05,1.9e-05,7e-06,8e-06,1.5e-05,6e-06,1.2e-05,1.5e-05,1.6e-05,7e-06,9e-06,1.8e-05,8e-06,2e-06,9e-06,1e-06,1.2e-05,8e-06,1.7e-05,1e-05
9e-06,1.5e-05,1.1e-05,8e-06,9e-06,8e-06,2e-06,3.2e-05,1.2e-05,1.8e-05,7e-06,3.4e-05,2.4e-05,2e-05,1.4e-05,1.6e-05,3e-06,4e-06,2.8e-05,1.3e-05,6e-06,1.2e-05,1.8e-05,1.6e-05,1.1e-05,1.1e-05,1.9e-05,2.6e-05,4.4e-05,2.2e-05,4.3e-05,1.9e-05,1.1e-05,9e-06,3e-06,2.1e-05,1e-05,2.9e-05,3.7e-05,1.9e-05,7e-06,8e-06,1.5e-05,1e-05,1.2e-05,1.5e-05,1.4e-05,1.7e-05,9e-06,7e-06,1.7e-05,2.3e-05,2.5e-05,6.6e-05,1.1e-05,4e-05,1.2e-05,4e-06,9e-06,1.6e-05,4e-06,1.2e-05,5e-06,9e-06,2e-05,1e-05,2.1e-05,2e-05,1.3e-05,3e-06,1.6e-05,1.3e-05,4e-06,1.7e-05,3e-06,6e-06,9e-06,1.6e-05,7e-06,1.7e-05,2.1e-05,4e-06,4e-05,2.2e-05,1.3e-05,1.5e-05,2e-05,2e-05,2.6e-05,1e-05,2.3e-05,1.1e-05,7e-06,8e-06,1.4e-05,1e-06,2.7e-05,4e-06,2.8e-05,3e-06,1e-06,1.6e-05,1.4e-05,8e-06,1e-05,8e-06,9e-06,5e-06,1.1e-05,2.7e-05,5e-06,1.2e-05,1.5e-05,9e-06,1.2e-05,9e-06,5e-06,1.4e-05,1.1e-05,7e-06,6e-06
6e-06,9e-06,7e-06,1.2e-05,5e-06,3e-06,4e-06,2.7e-05,1.6e-05,2.1e-05,9e-06,2.5e-05,2.1e-05,8e-06,9e-06,1e-05,8e-06,3e-06,2.4e-05,8e-06,9e-06,1.2e-05,2.5e-05,1.7e-05,1.1e-05,9e-06,2.1e-05,2.7e-05,3.3e-05,1.8e-05,3.8e-05,1.2e-05,8e-06,1e-06,5e-06,2.5e-05,6e-06,1.8e-05,2.9e-05,2.5e-05,1.1e-05,8e-06,2.8e-05,5e-06,9e-06,3e-06,2.4e-05,2.1e-05,1.3e-05,1.1e-05,1.9e-05,8e-06,9e-06,7e-05,2.9e-05,2.1e-05,1.9e-05,1.4e-05,1.9e-05,1.8e-05,4e-06,1.3e-05,5e-06,4e-06,2.5e-05,1.5e-05,2.2e-05,2.1e-05,1.5e-05,5e-06,2.1e-05,1e-05,2e-06,1.6e-05,6e-06,5e-06,7e-06,1.7e-05,2e-06,1.9e-05,1.6e-05,1.3e-05,3.1e-05,1.9e-05,1.1e-05,1.7e-05,2.3e-05,2e-05,3.3e-05,1e-05,2.7e-05,1e-05,6e-06,3e-06,1.1e-05,6e-06,3.4e-05,1.5e-05,2.6e-05,5e-06,1.1e-05,1.7e-05,4e-06,7e-06,5e-06,7e-06,9e-06,2e-05,1.6e-05,2.2e-05,6e-06,1.3e-05,2.2e-05,4e-06,9e-06,5e-06,3e-06,1.1e-05,4e-06,1.4e-05,1e-05
1.6e-05,1.2e-05,3e-06,1.5e-05,7e-06,1e-06,5e-06,2.6e-05,1.1e-05,2.4e-05,2e-06,2.7e-05,2.9e-05,7e-06,1.2e-05,1.5e-05,1.1e-05,6e-06,2.6e-05,2e-06,2e-06,2e-05,1.8e-05,3e-06,1.4e-05,1.2e-05,1.4e-05,2.6e-05,4.2e-05,1.3e-05,3.9e-05,1e-05,4e-06,7e-06,5e-06,2e-05,9e-06,1.9e-05,2.4e-05,1.7e-05,1.4e-05,9e-06,2.9e-05,6e-06,8e-06,1.4e-05,2.3e-05,1.9e-05,7e-06,1e-05,7e-06,1.4e-05,1.9e-05,7e-05,1.6e-05,2.8e-05,1.9e-05,1.2e-05,1.4e-05,1e-05,5e-06,7e-06,8e-06,1.3e-05,2.6e-05,1.4e-05,1.4e-05,2.1e-05,1.8e-05,6e-06,9e-06,1e-05,6e-06,4e-06,7e-06,8e-06,6e-06,2e-05,9e-06,1.6e-05,1.9e-05,7e-06,3.2e-05,1.8e-05,1.3e-05,2.1e-05,2e-05,2.5e-05,2.6e-05,1.5e-05,1.9e-05,4e-06,1.1e-05,6e-06,6e-06,2e-06,2.5e-05,2e-06,2.2e-05,5e-06,9e-06,1.1e-05,8e-06,1.2e-05,9e-06,9e-06,7e-06,1.2e-05,1.3e-05,1.1e-05,4e-06,1.2e-05,1.8e-05,1e-06,1e-05,9e-06,4e-06,5e-06,6e-06,1e-05,7e-06
1.4e-05,7e-06,2e-06,6e-06,1.3e-05,6e-06,6e-06,2.5e-05,1.9e-05,2.5e-05,1.3e-05,3e-05,3e-05,1.7e-05,7e-06,2.1e-05,4e-06,4e-06,2.9e-05,9e-06,1e-05,1.5e-05,2.1e-05,1.3e-05,1.2e-05,1.3e-05,1.2e-05,2.2e-05,3.6e-05,1.6e-05,5e-05,1.8e-05,1.2e-05,8e-06,7e-06,2.5e-05,8e-06,1.9e-05,2.1e-05,2.8e-05,1.4e-05,1.1e-05,1.9e-05,9e-06,1.3e-05,1e-05,1.7e-05,1.7e-05,8e-06,9e-06,1.3e-05,1.4e-05,1.7e-05,7e-05,2.2e-05,4.1e-05,1.5e-05,1.5e-05,2e-06,1.2e-05,5e-06,1.6e-05,7e-06,1.5e-05,2.2e-05,1.5e-05,1.4e-05,1.9e-05,2.1e-05,1e-05,1.7e-05,1.4e-05,7e-06,6e-06,6e-06,9e-06,4e-06,1.4e-05,4e-06,2e-05,1.4e-05,9e-06,3.2e-05,1.3e-05,1.9e-05,1.4e-05,2.5e-05,1.4e-05,2.9e-05,1.5e-05,2.4e-05,1.5e-05,4e-06,5e-06,9e-06,2e-06,1.9e-05,3e-06,2e-05,1.1e-05,7e-06,1.1e-05,1.1e-05,8e-06,6e-06,9e-06,5e-06,1e-05,1.2e-05,1.7e-05,1e-06,8e-06,2.2e-05,7e-06,2e-06,3e-06,3e-06,9e-06,5e-06,1e-05,4e-06
1.1e-05,6e-06,6e-06,1e-05,8e-06,3e-06,1e-06,2.9e-05,1.8e-05,1.8e-05,5e-06,2.3e-05,2.6e-05,1.1e-05,6e-06,1.5e-05,1e-05,4e-06,2.3e-05,0,9e-06,1.3e-05,1.7e-05,6e-06,1.2e-05,6e-06,1.4e-05,1.3e-05,3.8e-05,7e-06,4.2e-05,1.8e-05,9e-06,6e-06,1e-06,2.4e-05,1.2e-05,2e-05,2.9e-05,2.4e-05,9e-06,4e-06,2.6e-05,1e-05,1.1e-05,3e-06,2e-05,8e-06,1.2e-05,7e-06,1.4e-05,1.9e-05,2e-05,6.6e-05,2.6e-05,3.5e-05,1.5e-05,1.5e-05,3e-06,1.5e-05,2e-06,1.1e-05,7e-06,1e-05,2.4e-05,1.5e-05,1.4e-05,2.1e-05,1.5e-05,6e-06,1.9e-05,7e-06,6e-06,9e-06,5e-06,6e-06,7e-06,1.5e-05,2e-06,1.6e-05,2.9e-05,6e-06,3e-05,1.3e-05,1.2e-05,1.6e-05,1.9e-05,1e-05,2.8e-05,1.1e-05,2.1e-05,1.9e-05,8e-06,2e-06,1.1e-05,4e-06,2e-05,3e-06,1.9e-05,8e-06,4e-06,1.5e-05,9e-06,4e-06,2e-06,1.2e-05,4e-06,1.1e-05,1.2e-05,1.7e-05,2e-06,3e-06,2e-05,5e-06,4e-06,1e-06,4e-06,6e-06,7e-06,1.1e-05,7e-06
1.2e-05,7e-06,9e-06,4e-06,4e-06,6e-06,3e-06,2.9e-05,1.7e-05,1.8e-05,5e-06,2.3e-05,2.4e-05,1.1e-05,8e-06,1e-05,6e-06,7e-06,2.2e-05,3e-06,4e-06,1.6e-05,1.4e-05,8e-06,1.5e-05,1.5e-05,2.3e-05,2e-05,3.4e-05,1.2e-05,4.2e-05,8e-06,2e-06,6e-06,4e-06,2.3e-05,1.1e-05,1.3e-05,2.5e-05,2.3e-05,4e-06,7e-06,1.7e-05,6e-06,1.1e-05,9e-06,1.6e-05,1.8e-05,8e-06,4e-06,1.7e-05,1.7e-05,1.4e-05,6.7e-05,2.2e-05,3.2e-05,1.4e-05,1e-05,6e-06,1.9e-05,8e-06,1.7e-05,2e-06,7e-06,2.5e-05,1.2e-05,1.4e-05,2e-05,1.4e-05,3e-06,2e-05,1.5e-05,6e-06,9e-06,4e-06,8e-06,6e-06,1.4e-05,3e-06,1.2e-05,2.3e-05,7e-06,3.2e-05,1.5e-05,6e-06,1e-05,2e-05,1.6e-05,2.9e-05,1.2e-05,2.4e-05,1.6e-05,8e-06,3e-06,8e-06,3e-06,2e-05,0,1.9e-05,5e-06,5e-06,1.2e-05,1.2e-05,6e-06,5e-06,9e-06,4e-06,1.1e-05,1.1e-05,1.6e-05,2e-06,7e-06,1.7e-05,5e-06,2e-06,5e-06,2e-06,2e-06,6e-06,1.1e-05,6e-06
1.5e-05,8e-06,6e-06,7e-06,7e-06,3e-06,3e-06,3e-05,1.2e-05,2e-05,8e-06,2.6e-05,2.1e-05,1e-05,7e-06,1.4e-05,7e-06,6e-06,2.1e-05,3e-06,6e-06,1.3e-05,1.5e-05,8e-06,1.4e-05,1.3e-05,1.7e-05,1.9e-05,3.2e-05,1.3e-05,4.6e-05,1.2e-05,7e-06,8e-06,1e-06,2.3e-05,9e-06,1.4e-05,2.9e-05,2.1e-05,5e-06,2e-06,1.9e-05,6e-06,8e-06,7e-06,1.2e-05,1.8e-05,7e-06,7e-06,1.6e-05,1.4e-05,1.5e-05,6.7e-05,2.2e-05,3e-05,1.2e-05,1.1e-05,3e-06,1.8e-05,4e-06,1.3e-05,8e-06,1e-05,2e-05,1.3e-05,1.6e-05,1.6e-05,1.3e-05,1e-06,1.4e-05,1.4e-05,7e-06,2e-06,1e-06,7e-06,6e-06,1.3e-05,5e-06,1.3e-05,2.1e-05,5e-06,3.6e-05,1.5e-05,9e-06,1.4e-05,2e-05,1.6e-05,2.8e-05,1e-05,2.3e-05,1.1e-05,7e-06,6e-06,1e-05,2e-06,1.9e-05,2e-06,2e-05,6e-06,3e-06,1.5e-05,9e-06,2e-06,7e-06,7e-06,2e-06,1e-05,9e-06,1.6e-05,2e-06,8e-06,1.7e-05,3e-06,4e-06,4e-06,1e-06,6e-06,9e-06,9e-06,6e-06
1.1e-05,6e-06,3e-06,4e-06,6e-06,1e-06,3e-06,2.8e-05,1.5e-05,1.7e-05,6e-06,2.5e-05,2.3e-05,1.1e-05,1.1e-05,1e-05,7e-06,5e-06,2.3e-05,2e-06,7e-06,1.5e-05,1.4e-05,7e-06,1.4e-05,1e-05,1.5e-05,1.9e-05,3.4e-05,1.2e-05,4e-05,1.2e-05,6e-06,5e-06,2e-06,2.3e-05,1e-05,1.3e-05,2.7e-05,1.7e-05,4e-06,2e-06,1.9e-05,3e-06,8e-06,7e-06,1.6e-05,2.1e-05,8e-06,4e-06,1.3e-05,1.5e-05,1.7e-05,6.5e-05,2.1e-05,3.3e-05,1.4e-05,1.1e-05,3e-06,1.7e-05,3e-06,1.2e-05,4e-06,6e-06,2.2e-05,1.3e-05,1.6e-05,1.7e-05,1.3e-05,2e-06,1.4e-05,1.4e-05,3e-06,6e-06,3e-06,9e-06,6e-06,1.4e-05,2e-06,1.1e-05,2.2e-05,8e-06,3.3e-05,1.1e-05,8e-06,1.4e-05,2.2e-05,1.5e-05,2.8e-05,1e-05,2.2e-05,1.3e-05,8e-06,5e-06,9e-06,2e-06,1.9e-05,1e-06,2.1e-05,5e-06,3e-06,1.2e-05,8e-06,2e-06,5e-06,5e-06,2e-06,1.2e-05,1.1e-05,1.7e-05,4e-06,8e-06,1.7e-05,2e-06,2e-06,2e-06,4e-06,5e-06,7e-06,1e-05,6e-06
