-0.000397,-0.001004,-0.001227,-0.000416,-0.00206,-0.002135,-0.001969,-0.001622,-0.002433,-0.001724,-0.001702,-0.001407,-0.000992,-0.001912,-0.001341,-0.002208,-0.002264,-0.004521,-0.002506,-0.002976,-0.002959,-0.004334,-0.002619,-0.002853,-0.004718,-0.005868,-0.005625,-0.006858,-0.007074,-0.008141,-0.005283,-0.007008,-0.005745,-0.003721,-0.00444,-0.004959,-0.004502,-0.010422,-0.008841,-0.004936,-0.006152,-0.009167,-0.006153,-0.004646,-0.006248,-0.005768,-0.008045,-0.004759,-0.002738,-0.006141,-0.006765,-0.007007,-0.006068,-0.004728,-0.002763,-0.004052,-0.002099,-0.003767,-0.005518,-0.006991,-0.006668,-0.008646,-0.007732,-0.010406,-0.006426,-0.004483,-0.010582,-0.009212,-0.008552,-0.011267,-0.008112,-0.009665,-0.006875,-0.006221,-0.006581,-0.007589,-0.004792,-0.008491,-0.004299,-0.001474,-0.000244,-0.002472,-0.007183,-0.008771,-0.005445,-0.007887,-0.012146,-0.012182,-0.009147,-0.006836,-0.003859,-0.007797,-0.011258,-0.007296,-0.008752,-0.00584,-0.005531,-0.015441,-0.010217,-0.009847,-0.009935,-0.007622,-0.008074,-0.015862,-0.012014,-0.006336,-0.004608,-0.010175,-0.008868,-0.009669,-0.013523,-0.010215,-0.011783,-0.010359,-0.014143,-0.011991,-0.015567,-0.013317,-0.008085,-0.004728,-0.006841
0.000139,0.000413,0.000868,0.000338,0.00034,0.00103,-0.000213,0.000197,0.00038,0.000275,0.000333,-4.7e-05,-0.000924,-0.000141,-0.000531,-0.000508,1.1e-05,0.002152,-0.000156,0.00081,-3.2e-05,0.000749,0.000189,0.000448,0.001758,0.001967,0.001011,0.002295,0.003186,0.004375,0.003031,0.001833,0.00301,0.001986,0.000295,-0.000673,0.001915,0.003067,0.002123,0.000343,0.004441,0.003336,0.00252,-0.000518,0.001503,0.001239,0.001743,-0.000981,-0.001789,0.001488,0.002564,0.002434,0.001873,0.000956,-0.00063,0.000895,0.000252,0.001037,0.001147,0.000562,0.001096,0.000535,-0.000437,0.005038,0.003667,0.001881,0.001626,0.003309,0.000386,0.003163,0.000606,0.001084,-0.001084,0.000565,-0.005069,0.000452,0.001726,0.003229,0.002164,-0.000601,-0.003945,-0.003548,0.000505,0.004493,-0.002209,-0.003667,-0.003417,-0.000999,0.00017,-0.00288,-0.001607,-0.001439,0.000579,-0.002347,-0.001321,-0.000363,0.000911,0.006942,0.003964,0.00558,0.00328,0.001423,0.001904,0.005607,0.001271,0.002102,-0.002164,0.002751,0.000546,0.001684,0.002767,0.00198,0.00015,0.001936,0.004493,-0.000203,0.000275,-2.5e-05,0.001771,-0.001097,-0.002353
0.000128,-0.000587,-0.000892,-0.000809,-0.000306,-0.000284,-5.8e-05,0.000121,0.0011,-7.5e-05,-0.000831,-0.000436,0.000618,0.000784,0.001003,0.000875,0.000288,0.000579,0.000575,-0.000809,0.00013,-0.000278,-0.000746,-0.001028,-0.000995,-0.000191,-0.001076,-0.001119,-0.000939,-0.001726,-0.001419,1e-06,-0.000926,-0.001415,0.000722,0.001233,-0.001886,-0.001759,0.00018,-0.000886,-0.002147,-0.003385,-0.002335,0.000715,-0.001806,-0.001659,-7.4e-05,-0.000716,0.00163,0.000635,-0.001334,-0.001421,0.000179,0.001409,0.000244,-0.000691,0.001738,0.001659,-0.003614,-0.001337,-0.000384,0.000371,-0.001469,-0.003454,-0.002214,-0.002515,-0.00031,0.002364,0.003721,0.000712,0.00132,0.001226,0.000186,-0.000164,0.004406,-0.001746,-0.003131,0.000153,-0.004268,0.000807,0.000252,0.000326,-0.00183,-0.003757,0.001047,0.003351,0.002001,0.003614,0.001893,0.001528,0.002717,0.000894,0.00113,0.00438,0.003032,0.00073,0.000599,-0.003916,-0.003901,-0.004058,-0.002241,-0.001211,-0.004588,-0.00413,-0.001972,-0.003653,0.000266,-0.001163,0.001139,0.000814,0.001327,0.001634,0.003255,0.001839,-0.001588,0.002664,0.004311,0.001585,-0.001112,-0.002325,-0.000411
-2.5e-05,0.000342,0.000588,0.000499,-0.000134,0.000389,0.000639,0.000707,-0.000788,0.000209,0.000736,0.000646,0.000275,-0.000957,-0.000552,1e-05,0.000822,-0.000662,-6.9e-05,0.001299,0.000956,0.000814,0.002346,0.000809,0.000499,0.001168,0.002012,0.002046,0.00044,0.001231,0.001876,-4.2e-05,1.9e-05,0.001442,-0.001074,-3.5e-05,0.00239,9.7e-05,0.001447,0.002054,0.001677,0.004486,0.002671,0.000198,0.000965,0.001366,0.000373,0.00169,0.000534,0.00088,0.001518,0.001114,0.003189,-0.000107,-0.000233,0.000552,0.001695,-5.2e-05,0.004088,0.001828,0.000945,0.000883,0.005486,0.005804,0.002572,0.002523,0.001842,2.2e-05,-0.002906,-0.000484,0.000727,0.002013,0.000607,0.002725,-0.000975,0.000802,0.00402,-0.000152,0.001488,-0.001172,0.002584,0.005301,0.004092,0.003799,0.003595,0.001816,0.004037,0.001059,0.000667,0.001933,0.001998,0.004478,0.002011,0.002403,0.000382,-0.001324,-2.9e-05,-1.3e-05,0.003238,0.001927,0.002487,0.002434,0.003237,0.005919,0.004373,0.005223,0.003828,0.00208,0.001345,0.000943,0.001742,-0.001165,-0.001933,-0.002268,0.001783,0.001324,-0.000675,0.002727,0.003635,0.003545,0.000751
-0.000172,-0.000212,-0.000418,-0.000556,-7.2e-05,-0.00045,-0.00081,-0.00064,-0.000738,-0.000436,-0.000778,-0.000118,-0.000299,7.1e-05,-0.000441,-0.00041,-0.000677,-0.000559,-0.000588,-0.00116,-7.2e-05,-0.00131,-0.002244,-0.000299,-0.000252,-0.001802,-0.000621,-0.002707,-0.000549,-0.002149,-0.001524,0.000265,-0.00072,-0.000919,0.000182,-0.000541,-0.000622,-0.00087,-0.003154,-0.001008,-0.000558,-0.003192,-0.002152,-0.00047,0.000243,-0.000691,-0.001687,-0.00035,-0.001362,-0.001755,-0.000955,-0.000817,-0.005179,-0.002463,-0.000553,0.000933,-0.001695,-0.002111,-0.001341,-0.001181,0.000111,-0.003103,-0.006106,-0.003858,-0.000572,-0.001794,-0.003553,-0.003709,-8.1e-05,-0.001862,-0.005868,-0.003646,0.000989,-0.002707,-0.002065,0.000342,-0.005091,-0.000687,0.000435,-0.002841,-0.003284,0.000933,-0.002388,-0.002345,-0.002466,-0.004533,-0.007533,-0.005037,-0.004261,-0.002776,-0.003624,-0.003238,-0.003652,-0.004635,-0.002973,-3.4e-05,-0.000851,-4.6e-05,-0.001276,-0.002782,-0.003524,-0.003881,-0.001841,-0.003418,-0.005099,-0.004785,-0.002711,-0.00302,-0.00103,-0.000334,-0.003074,-0.000944,-0.001138,0.000545,-0.001991,-0.003873,-0.002311,-0.004875,-0.004526,-0.000894,0.00091
-3.5e-05,-0.000137,9.7e-05,0.000243,0.000356,0.000403,0.00045,0.000429,0.000872,0.000387,-7.6e-05,-0.00033,0.000318,0.000319,0.000556,0.000325,0.00026,0.000104,-0.000116,0.000428,-0.000168,0.000695,0.000987,1.7e-05,0.000409,0.001182,-0.000711,0.001297,0.000717,0.001403,0.000689,-0.00033,-0.000189,0.00075,-0.000187,-9.5e-05,0.000284,0.001667,0.002574,0.00039,-0.001853,0.000312,0.000699,0.000544,-0.000677,-0.000956,0.001028,0.00077,0.000697,0.000244,0.00086,-0.000368,0.002871,0.000191,-0.001207,0.000186,0.000628,0.000493,0.000805,-0.000331,-0.001062,0.001359,4.9e-05,-0.000607,0.001864,0.002827,0.000925,0.003656,0.000948,0.001755,0.003771,0.001887,-0.000525,-0.000476,0.002889,-4.5e-05,0.000113,-0.00157,-0.000881,0.001019,0.002295,-0.004298,-0.000104,0.000475,0.002483,0.001047,0.002027,0.00552,0.003257,0.001302,0.002408,-0.000776,0.000896,0.002163,0.000196,0.000236,-0.000509,0.000722,-0.000861,0.002854,0.003749,0.002003,0.001645,0.000785,0.002143,0.001121,0.003014,0.001081,0.000323,-0.000479,0.002406,0.00053,0.002118,-0.000139,0.002023,0.003524,0.000661,0.004244,0.002471,0.000495,-0.000765
0.000101,0.000266,-0.000114,-3.2e-05,-0.000176,-0.000184,-0.000312,0.000165,-0.00035,0.000541,0.000469,-7.7e-05,-0.000373,-0.000223,-0.000506,4.4e-05,1e-06,0.000198,0.000435,0.000318,-0.000273,0.000153,-9e-05,0.000373,5.2e-05,-0.000453,0.001462,0.000767,0.000326,-0.000406,0.000528,0.000161,3e-04,-1e-05,-0.000861,0.000227,-0.001308,-0.000959,-0.000228,-1.7e-05,0.000946,-0.000195,-0.000261,0.000863,-0.000153,0.001554,-0.000184,0.000514,0.000752,0.001281,-0.00101,-0.000356,-0.000342,0.000749,0.000491,-0.000351,-0.000306,-0.000675,-0.000149,2e-05,-0.000113,4e-04,0.001501,0.001702,-0.00223,-0.001368,-0.000405,-0.002537,-0.000156,-0.000515,-5e-06,-1.3e-05,-0.000267,-0.000499,-0.001264,-0.000437,-0.00188,0.000219,0.000224,0.001081,0.002142,0.000988,-0.000153,-0.000729,-0.00081,0.001249,0.001729,-0.002291,-0.000836,0.000152,0.001326,0.000424,0.00091,6.2e-05,0.001048,0.000481,-0.000466,-0.001012,0.000273,-0.000893,-0.002538,-0.001602,-0.001089,0.000105,0.000116,-0.001352,-0.001306,0.001144,0.000106,6.3e-05,-0.000308,-0.000628,-0.002111,0.000157,-0.001682,-0.00217,0.001962,-0.000405,-0.000353,-0.000696,-0.001244
-9.5e-05,-0.000185,0.000217,0.000324,8.7e-05,-0.000211,-1.7e-05,-0.00023,-0.000139,-0.000812,-0.000122,0.000308,2e-06,1.5e-05,-0.000174,-0.000201,-0.000453,-0.000319,-5.6e-05,-0.000411,4.6e-05,-0.001066,-0.000106,-3.8e-05,-0.000597,-0.000148,-0.000714,-0.000855,-0.001151,-0.000382,-0.000936,-0.000325,-3.8e-05,-0.000613,0.000454,-0.000381,0.000175,0.000133,-0.000573,-0.000107,-0.000182,0.000926,0.00043,-0.001219,0.000269,-6.9e-05,-0.000626,-0.001465,-0.000666,-0.000391,0.000263,-4e-06,-0.00026,-0.001373,0.00012,-0.000659,-0.000817,-0.000582,-0.000324,-0.001129,0.001382,-0.00061,-0.001478,-0.000704,0.00013,0.000651,-0.000281,-0.000364,0.000178,-0.001617,-0.000446,-0.002201,0.00153,0.000983,-0.000222,-0.000754,0.001065,0.000316,0.00108,0.000793,0.00014,0.001021,7e-05,0.000172,0.000423,-0.001197,-0.00212,-0.002167,-0.000174,-0.000138,-0.000105,0.000371,0.000657,9.3e-05,-0.00168,-0.000235,0.000706,0.000358,0.000366,-0.001337,2.7e-05,-0.000233,0.001321,0.000309,-0.001152,0.001136,-0.000237,-0.001011,-0.000768,9e-05,-0.000556,0.000207,0.000328,0.00019,0.000276,0.001076,-0.00211,-0.00152,-0.000843,0.000643,0.00137
4.2e-05,0.000192,2.2e-05,-0.000143,-6.8e-05,-0.000245,0.000131,-0.000184,0.00029,0.000455,-0.000307,-0.000392,-0.000187,-0.000105,0.000411,0.00019,0.000193,8.5e-05,0.000377,0.000104,-3.9e-05,0.000604,2e-04,-9.7e-05,0.000357,0.00015,0.000173,-0.000632,0.000881,0.000549,9.6e-05,0.000117,-0.000274,0.000439,-0.000122,-0.000135,0.000802,0.000538,0.000576,-2.9e-05,0.000446,-0.000769,0.00058,0.000792,-0.000215,-0.00042,2.1e-05,0.00047,-0.000354,2.3e-05,0.000122,0.001165,9e-06,0.001365,-0.000496,-0.000441,0.000129,-0.000126,6e-05,0.000836,0.000226,0.00039,0.001588,-0.000476,0.00017,-0.000206,0.000379,0.000643,0.000244,0.001738,7.8e-05,0.001202,-0.001602,0.000464,-0.000226,0.001245,0.001585,-0.000675,-0.001255,-0.001466,0.001014,-0.001169,-0.001492,-0.000234,-0.000439,-0.001101,9.2e-05,0.000498,0.000775,-0.001467,-0.001884,-0.002174,-0.001608,-0.000987,0.000258,-0.000497,0.000196,-8e-04,0.001529,0.00138,0.00094,0.000166,-0.000418,-0.000989,0.000525,0.000604,-0.000634,0.000478,1.7e-05,0.000148,4.5e-05,-0.001132,0.000989,0.000308,0.00056,-0.00012,8e-05,0.000541,-7.3e-05,-0.001177,-7.4e-05
7.6e-05,-4.4e-05,-3.5e-05,1.3e-05,9.8e-05,0.000343,-0.000201,8.8e-05,-2.2e-05,-0.000161,2.6e-05,9.8e-05,0.000262,-1.2e-05,-0.00032,7e-06,0.000164,-0.00033,5.4e-05,-0.000343,0.000444,0.000457,2.4e-05,-0.000209,-0.000281,0.000121,9.7e-05,0.00065,-0.000199,-0.000624,-6e-06,-6.1e-05,0.000131,-0.000427,0.000593,6.2e-05,-0.000974,-1.2e-05,-0.000847,-0.000678,-0.000756,0.000445,-0.000728,-0.000656,1e-06,0.000234,-5e-04,9.2e-05,-0.000455,0.00013,0.000239,-0.001226,-0.000646,-0.000958,0.00021,0.000884,-0.000457,-0.00033,0.00032,0.000461,-1.4e-05,-0.000222,-0.00019,0.000591,0.000109,0.001471,-0.000878,-0.001463,-0.00081,0.000165,0.000169,0.000417,0.001236,-0.000749,0.001379,-0.000891,-0.001376,0.000818,0.001695,4.1e-05,-0.000559,0.000183,0.000897,0.000496,-0.000271,0.001277,0.000891,0.000723,-0.000118,0.00166,0.000238,0.001091,0.000734,0.000528,0.001389,0.001556,-0.00019,0.000732,-0.000271,-0.000739,-0.000369,0.001376,-8.1e-05,0.000338,0.000205,-0.00077,0.000281,-0.000702,0.001337,-0.001063,0.000199,0.001715,-0.000364,-0.000785,-0.000463,-0.00039,0.001355,-0.000336,0.001109,0.00042,0.000216
-3.3e-05,-2.7e-05,-1.9e-05,5.2e-05,-0.000253,-6.8e-05,0.000126,1.8e-05,3.6e-05,-2.8e-05,0.000139,0.000214,-0.000103,7.5e-05,0.00036,-0.000217,-0.000163,0.000293,0.000254,0.000384,-0.00029,-0.000337,-0.000253,0.000257,0.000421,7.4e-05,0.000127,-0.000247,-2.3e-05,0.000426,-5.6e-05,-0.000277,-0.000178,-0.000123,-0.000953,0.000191,0.000247,0.000335,0.000372,0.000142,-0.000212,7.4e-05,-0.000206,0.000517,0.000503,0.000225,0.001018,5.6e-05,0.001078,-9.5e-05,-0.000566,0.00064,0.000391,0.000484,0.000293,-0.000411,5.6e-05,-0.00018,-0.000591,-9.1e-05,-0.00081,-0.000287,-0.000574,1.3e-05,-0.001835,-0.000892,0.000142,0.00013,-0.00021,-9.9e-05,-0.000485,0.000166,-0.000419,-0.000747,7e-05,0.000732,-0.001428,-0.000823,0.000973,0.000501,-7.5e-05,0.000389,0.000414,0.000776,0.000355,-0.001096,-4e-04,-0.000749,-0.001409,-0.000474,-1.3e-05,0.000406,0.000858,-0.000336,-0.001213,-0.000369,0.000518,-0.000392,2.3e-05,-0.00027,-0.000517,-0.001064,-0.000513,-0.000224,0.000142,0.000992,3.1e-05,0.001534,-0.000374,0.00118,0.000285,-0.000667,0.00024,0.000537,0.001126,-0.000181,-0.001683,0.000325,0.000245,0.000695,-0.000457
-2.6e-05,5e-05,-2.4e-05,-4e-06,0.000202,4.8e-05,-0.000133,-0.000109,-2e-06,-9.7e-05,2.3e-05,-9.6e-05,-0.000128,-1.7e-05,-0.000136,0.000149,1.7e-05,-2.2e-05,-0.000195,-0.000375,-0.000132,0.000126,0.000205,-2.4e-05,-0.000168,-0.000422,-0.000127,0.000545,-0.000188,-0.000161,-9.3e-05,0.000501,0.00026,0.00024,0.000449,5.6e-05,0.000634,-0.000458,-0.00021,0.000362,0.000496,-0.000113,0.000201,-0.000503,-0.000209,-9e-05,-0.000443,1.1e-05,-0.000634,0.000131,0.000596,-0.000335,-0.000323,-0.000428,-0.000604,3.1e-05,0.000171,0.000346,0.000543,0.000271,0.000998,0.000565,0.000175,-0.000625,5.3e-05,0.000674,0.000339,0.000104,0.00082,0.000839,0.000419,-0.001282,-0.000892,0.000602,-0.000403,-0.000291,0.001196,0.000612,-0.000293,0.000115,-0.001607,-0.001436,-0.000585,-0.000149,-0.000153,0.000771,-6.8e-05,-0.000635,0.000814,-9.4e-05,-0.000391,-0.001162,-0.000303,7.2e-05,5e-04,-0.000132,-0.000593,0.00023,-0.000691,-0.000443,0.000104,-0.000136,0.000854,0.000969,0.000259,-0.000751,-0.000963,5.5e-05,-0.000339,-0.001008,-0.000718,3e-05,3e-05,-0.000608,-0.000588,0.000305,0.001308,-0.000222,-0.000544,-0.001293,0.000574
4.2e-05,-2.9e-05,-1.5e-05,-6.4e-05,-0.000101,-3.5e-05,9.6e-05,0.000115,6.4e-05,0.000131,-6.5e-05,-3.9e-05,5.3e-05,-1.2e-05,-1.6e-05,-8.7e-05,6.7e-05,-4.9e-05,-4.6e-05,1.7e-05,0.00019,-0.000206,9e-05,7.5e-05,2.3e-05,0.00016,-0.000352,-0.000381,1.5e-05,0.000192,0.000255,-0.000514,-0.000168,-0.000173,-0.000116,8.2e-05,-0.000505,1.6e-05,5.3e-05,1.7e-05,-0.000111,9.6e-05,-0.000372,0.000403,-0.000204,0.000136,3.1e-05,-4e-06,0.00059,9e-06,-0.000195,0.000148,0.000204,0.000188,0.000133,0.000186,-0.000183,-0.000444,-0.000293,0.000341,-0.000422,-0.000531,-7e-05,0.000663,0.001096,-0.000464,-0.000488,0.000222,-0.000338,-0.00011,-0.000114,0.000984,0.000602,-0.000496,-5.3e-05,-5.4e-05,-8e-05,-0.000851,4.9e-05,-0.000479,0.000371,-0.000447,-0.000233,-6e-05,0.000286,-0.000314,-0.000178,0.001519,0.000832,0.000227,7.7e-05,0.00055,-0.000528,-0.000317,-0.000552,-0.000253,-0.000253,1e-06,0.000456,0.000396,0.000337,0.000189,-0.001341,-0.000623,-0.000616,-0.000134,0.000672,-0.000372,-0.000136,0.000687,0.000433,-0.000207,0.000222,0.000254,-0.00047,-3.3e-05,-0.000986,-7e-06,-0.000463,0.000604,-0.000835
2.4e-05,-2.3e-05,-1.1e-05,2.4e-05,5e-06,4e-06,9.2e-05,-0.000158,-7e-05,-4e-05,0.000108,1.9e-05,0.000101,-1.6e-05,-3.8e-05,2.9e-05,-7.9e-05,1e-06,7.7e-05,0.00048,3e-05,0.000257,-0.000196,-7.4e-05,2e-05,0.000101,0.000188,0.000142,5.7e-05,-0.000172,6e-06,0.000275,0.000117,0.000192,0.000173,-0.000215,1.6e-05,0.000396,2.7e-05,-0.000208,-2.3e-05,-0.00027,0.000262,-9.6e-05,0.000244,-0.000103,0.000233,0.000355,-0.000561,0.000186,-8.1e-05,-2e-06,-0.000205,2e-04,0.000404,-2.2e-05,-8.1e-05,0.000184,-0.000101,-4e-06,0.000225,0.000317,0.000252,-0.000356,-0.000239,0.00016,0.000251,-0.000237,0.00016,-8e-06,-8.9e-05,-0.000254,-0.000143,0.000418,-2.6e-05,0.000103,-0.000483,0.000489,0.000563,-0.000135,1.3e-05,0.00019,0.000118,0.000578,-3e-05,-1.4e-05,0.000522,-8.8e-05,-0.000286,-0.000329,-5e-05,4.3e-05,0.000504,0.000116,0.000388,1e-06,0.000767,0.000325,5.6e-05,0.000919,-0.000478,2.5e-05,-9.5e-05,0.000173,0.000116,0.000415,0.000345,-0.000548,0.000109,-3.2e-05,-0.000258,-5e-06,-6.9e-05,-0.000311,0.000351,0.00028,0.000622,0.000262,0.000252,0.000743,0.000279
-1.8e-05,1.1e-05,2.7e-05,-3.1e-05,1.7e-05,-5.8e-05,-5.2e-05,9.2e-05,-3.8e-05,4.7e-05,-7e-05,-2.9e-05,-7.2e-05,5.1e-05,-1e-05,4.2e-05,-2e-05,-3.1e-05,2.1e-05,-0.000198,-3e-05,-0.000139,-8.8e-05,8e-06,4.3e-05,-2.5e-05,-3e-05,0.000109,1.8e-05,-4e-06,-0.000166,-7.3e-05,-7.9e-05,-7.2e-05,-1.4e-05,4.3e-05,0.00037,-0.000307,-1e-04,-4.3e-05,7.9e-05,0.000208,1.7e-05,0.000102,-5.9e-05,-2.8e-05,-0.000399,1.7e-05,0.000164,-0.000158,0.000115,8.6e-05,0.000325,-5e-05,-0.000345,-0.000151,-5.4e-05,-0.000105,-0.000281,0.000157,-0.000246,0.000319,6.3e-05,6.8e-05,-0.000137,-0.000158,-8.3e-05,-0.000217,-0.000341,-7.5e-05,-0.000536,-0.000137,-0.000333,-0.000103,0.000367,0.000183,0.000542,-0.000103,-0.000417,-0.000412,-6e-05,-0.000521,5e-06,4.8e-05,-0.000196,7.5e-05,-0.000345,-0.000172,-0.000176,-9.6e-05,7.5e-05,9.5e-05,-5.7e-05,-1.3e-05,2.8e-05,3.2e-05,-0.000557,-0.00053,7.8e-05,-0.000393,-8.1e-05,0.000307,0.000695,-0.000167,0.00012,-9.9e-05,-0.000205,6e-04,-2e-06,-0.000445,0.000168,0.000489,-0.000224,0.000152,-0.000231,-0.000372,-0.000242,-0.000288,0.000179,-0.000498,1.1e-05
-2e-05,0,-7e-06,5e-05,5e-06,-9e-06,7e-06,7e-06,5.2e-05,3.7e-05,5.4e-05,2.4e-05,9e-05,-1.4e-05,7.8e-05,-4e-05,2.6e-05,2.6e-05,-8e-05,5.1e-05,-2.3e-05,4.9e-05,-1.8e-05,1.6e-05,-0.000119,4e-06,4.5e-05,-0.000119,-5.9e-05,5.9e-05,0.000141,0.000158,8.6e-05,-5.4e-05,5e-05,4.9e-05,-0.000226,-5.2e-05,0.00012,8e-05,0.000157,4e-06,-4.3e-05,-0.000178,-2.8e-05,2e-06,0.000206,-0.000178,4e-06,-0.000371,0.000138,-0.000267,-0.000129,-0.000179,7.3e-05,-5e-05,0.000106,4.2e-05,6.3e-05,0.000122,-8.2e-05,-0.000132,-0.000143,0.000221,0.000497,-0.000406,9.1e-05,0.000298,2.4e-05,-3.4e-05,0.000617,7e-06,-0.000174,-0.000233,-0.000305,-0.000238,-0.000719,0.000135,-0.000411,0.000132,-0.000106,0.000838,0.000111,9.1e-05,-0.000154,-0.000142,0.000158,-5.8e-05,0.000242,0.000303,0.000156,0.000132,-7.4e-05,-4.1e-05,1.9e-05,-0.000372,-0.000207,0.000235,-0.000185,-0.000242,9.3e-05,-0.000287,-0.000328,2.4e-05,-9e-05,-4.9e-05,0.000277,-0.000183,-0.000326,0.000166,-2.1e-05,-0.000239,0.000241,-5.1e-05,0.000108,0.000113,8.5e-05,0.000345,-0.000169,8.4e-05,-5.4e-05
1.4e-05,-9e-06,-9e-06,-2.4e-05,1.9e-05,6e-06,-1.4e-05,-5.1e-05,7e-06,-2.3e-05,-6.6e-05,1.6e-05,2.3e-05,7e-06,1e-06,3.1e-05,-9e-06,-1e-05,-7e-06,8.5e-05,5.6e-05,3.3e-05,1e-04,5.3e-05,0.000103,-4.4e-05,1.9e-05,-9e-06,9.5e-05,8.9e-05,7e-05,-0.000251,-4.3e-05,0.000118,-2.7e-05,9e-05,-4.8e-05,1e-06,3e-06,-9.3e-05,-0.000332,-1.9e-05,5e-06,0.000102,5.8e-05,-5.3e-05,-3.3e-05,7.9e-05,-6.1e-05,0.000229,-7.5e-05,0.000213,-7.3e-05,0.000209,4.8e-05,9.8e-05,0.000124,-1e-04,-4.3e-05,3.6e-05,-0.00027,-8e-05,5.6e-05,-0.000225,-3.1e-05,-9.3e-05,-3e-06,2.2e-05,4.3e-05,0.000153,-9.5e-05,0.000168,0.000184,0.000157,8.4e-05,2.4e-05,4.3e-05,-0.000147,0.000141,0.000104,8.2e-05,0.000244,8.5e-05,-0.000123,-0.000136,-3.8e-05,-0.000206,4.5e-05,0.00033,-5.6e-05,-5.6e-05,-0.000291,1.9e-05,-1.1e-05,-1.5e-05,0.000178,0.000287,-0.000106,-0.000187,0.000394,-3e-05,0.000197,-0.000124,-0.00017,-2e-06,-0.000256,-0.000148,-5.9e-05,9.9e-05,0.000131,-0.00012,6.6e-05,-3.2e-05,8.6e-05,0.000299,1.3e-05,-0.00014,-0.00012,3.5e-05,-0.000475,5.1e-05
1e-05,-6e-06,-4e-06,6e-06,-2.2e-05,3.5e-05,-2.6e-05,4.2e-05,-2.9e-05,-1.9e-05,5.9e-05,-2e-06,-3.4e-05,-1.6e-05,2e-06,-2.7e-05,1.7e-05,-2e-06,-9.7e-05,-7.5e-05,-2.3e-05,8.7e-05,-6e-06,-3.4e-05,-2.6e-05,-1e-06,9e-06,6e-06,3.7e-05,-9.1e-05,-0.000191,0.000173,3.6e-05,-8.5e-05,-0.00015,-4.9e-05,0.000128,8.7e-05,3.5e-05,-6.3e-05,0.000215,-0.000106,4.8e-05,-8.8e-05,3.8e-05,-6e-06,-6.9e-05,-4.3e-05,-6.6e-05,6.7e-05,-0.000118,-8.7e-05,4.1e-05,-8e-06,-0.000112,-0.000102,-4.6e-05,-5.3e-05,-3.8e-05,1.7e-05,6.4e-05,7.5e-05,-0.000104,1.9e-05,-0.000259,3.8e-05,1.8e-05,-0.000195,4.1e-05,-3.8e-05,0.000241,-0.000119,-0.000198,1e-06,7.6e-05,-0.000118,8.4e-05,-9.8e-05,-0.000224,-0.000178,0.000106,-0.000245,-6.8e-05,-3.9e-05,6e-05,2.4e-05,0.000146,0.000308,-0.000149,-7.9e-05,-5.4e-05,-1.5e-05,-0.000224,-6e-06,2.1e-05,2.3e-05,9e-06,6.2e-05,1.6e-05,-0.000169,-3e-06,7.6e-05,0.000191,4.8e-05,0.000124,0.000195,1.2e-05,-0.000234,-5.5e-05,-0.000356,0.000119,-0.00017,-5e-06,-1.1e-05,-0.000215,-2.8e-05,0.000141,-1.5e-05,0.000108,0.000426,3.5e-05
-5e-06,1.3e-05,1.5e-05,3e-06,2.3e-05,2.6e-05,2.8e-05,-3.7e-05,-3.9e-05,4e-05,-2.8e-05,1.1e-05,-1.1e-05,3.1e-05,1.7e-05,9e-06,6e-06,1.7e-05,-4e-06,-1.6e-05,-1e-05,-6.5e-05,-3.1e-05,6e-06,-2.1e-05,-3.4e-05,-8.6e-05,4.4e-05,-4.8e-05,-9e-06,3.1e-05,-6.6e-05,-2.3e-05,-6.9e-05,0.000125,2.3e-05,-4.3e-05,-0.000111,-2.2e-05,9.9e-05,-2e-05,5.1e-05,-6.6e-05,0.000142,-4.1e-05,8e-06,0.000154,-6.3e-05,2.1e-05,6e-06,0.000148,5.9e-05,-6.3e-05,-7.9e-05,8.2e-05,4.3e-05,-8.1e-05,3e-06,6.2e-05,6e-06,7.1e-05,6.9e-05,5.6e-05,7.2e-05,-0.000121,7.9e-05,-8.3e-05,9.7e-05,-6.7e-05,-6.2e-05,-0.000269,6.1e-05,0.000249,3.2e-05,-4.2e-05,8e-05,8.2e-05,0.000144,-8e-05,-6.6e-05,0.000171,0.000116,8.4e-05,0.000203,-1e-05,2.2e-05,-2.1e-05,-0.000577,-0.000151,4e-05,-8e-06,1e-06,5.6e-05,9.2e-05,-5.9e-05,-7.6e-05,-0.000168,-4e-06,3.3e-05,-2.3e-05,-3.6e-05,-0.000351,6.3e-05,-0.000138,-0.000146,-6.9e-05,-0.000249,0.000203,7.7e-05,0.000421,-4e-06,0.000161,-7.2e-05,8e-05,8.4e-05,8.2e-05,-7.7e-05,4.4e-05,9.9e-05,-0.000155,6.7e-05
-2e-06,0,-4e-06,-5e-06,-9e-06,-2.5e-05,4e-06,2.7e-05,1.5e-05,-7e-05,-2.1e-05,3e-06,-3.7e-05,-1.4e-05,-6e-05,1.4e-05,-2e-05,6e-06,1.1e-05,2.8e-05,-2.3e-05,-6.9e-05,2e-06,-2.5e-05,2.9e-05,2.4e-05,0.000101,-3.2e-05,-2e-05,-4.9e-05,6.3e-05,1.5e-05,1.4e-05,9.4e-05,-4.1e-05,-2.7e-05,-5e-05,-5.9e-05,-4e-06,6.5e-05,-5.2e-05,-4e-05,1e-04,-0.000145,2.5e-05,5e-06,-0.000144,-3.2e-05,1e-06,-9.6e-05,-2.7e-05,1.6e-05,0.000103,3e-06,6.4e-05,9.8e-05,8e-06,2e-05,6e-06,-1e-06,-9.9e-05,3.1e-05,4.3e-05,-6.8e-05,5.1e-05,-0.000182,7.6e-05,-3.9e-05,-2.6e-05,6.7e-05,0.00012,-9e-05,4.8e-05,4.3e-05,-4.5e-05,-6.4e-05,-3.1e-05,-0.00015,4.9e-05,-3.4e-05,0.000153,-0.000165,-9.7e-05,-5.8e-05,8.2e-05,-8e-06,5.7e-05,0.000217,0.000174,1.4e-05,8.9e-05,5.3e-05,3.5e-05,-6.6e-05,-5.6e-05,-8.2e-05,3.7e-05,-3.2e-05,8e-06,9e-06,7e-06,0.000252,-0.000103,4e-05,0.000138,-5.8e-05,4.4e-05,-6e-05,-8e-06,-0.000252,-6e-06,-2.3e-05,9.9e-05,-2.3e-05,-3.6e-05,-8.5e-05,-1e-05,-0.000125,-0.000288,-4.4e-05,-0.000133
4e-06,-1.1e-05,-1e-06,4e-06,-3e-06,-8e-06,-7e-06,4e-06,3.4e-05,4.8e-05,4.1e-05,-3.4e-05,5.1e-05,0,2.8e-05,-1.6e-05,5e-06,-1.7e-05,8e-06,1.2e-05,5e-06,5.2e-05,7e-06,-2e-06,1.4e-05,4e-05,-7.9e-05,1.7e-05,2.1e-05,5.3e-05,-8.3e-05,-1.8e-05,5e-06,-8.1e-05,9.5e-05,1.7e-05,3.5e-05,4.8e-05,-8e-06,-1.1e-05,6.4e-05,-2.2e-05,-1.2e-05,0.000101,5e-06,-5.8e-05,0.000125,-6e-05,0.000141,-8e-06,0,-2.4e-05,-6.7e-05,7.1e-05,-0.000152,2.3e-05,4.2e-05,4e-06,1.3e-05,-2e-06,1.5e-05,-5.5e-05,-5.7e-05,4.4e-05,-4.9e-05,0.000205,-6.7e-05,4e-06,5.3e-05,-0.000114,0.000116,-2e-05,-0.000174,-5.7e-05,-7.1e-05,5e-06,-0.000194,0.00022,-0.000158,0.000158,5e-05,-0.000275,-5e-05,-4.9e-05,1.5e-05,6.2e-05,-0.00012,0.000241,-0.000101,-2.3e-05,-6.7e-05,4e-06,-0.000101,2.1e-05,4.8e-05,5.7e-05,0.000164,4e-05,2.2e-05,1e-04,7.2e-05,-1.9e-05,2.2e-05,8.2e-05,-0.000143,0.000216,7.6e-05,7e-06,5.4e-05,9e-06,3.1e-05,6e-06,-8.3e-05,3e-05,-0.000112,5.7e-05,7e-05,3.5e-05,-5.7e-05,5.8e-05,8.9e-05
0,1.3e-05,8e-06,4e-06,-1e-06,1e-05,1.8e-05,-1.4e-05,-2.2e-05,-1.1e-05,-1.7e-05,9e-06,-2.2e-05,-1e-06,-2.8e-05,8e-06,0,-9e-06,-4e-05,-4.1e-05,1e-05,1.6e-05,1.2e-05,1.5e-05,-3.7e-05,-5e-06,3.8e-05,-2.4e-05,1.8e-05,1.2e-05,5.4e-05,1.6e-05,-1e-06,7.2e-05,-9.1e-05,-4e-06,3.8e-05,3.4e-05,-3.7e-05,-3.9e-05,-1.8e-05,6.9e-05,-3.4e-05,-3.1e-05,-8e-06,4.9e-05,-4.9e-05,8e-05,-0.000116,7.7e-05,-3.8e-05,0,2.3e-05,-3.8e-05,9.4e-05,-9e-05,-2.8e-05,-5.6e-05,-2.5e-05,-2.1e-05,-5.2e-05,-2.3e-05,5.9e-05,-3e-05,-0.000101,-7.1e-05,6.5e-05,-4.2e-05,-1.1e-05,-1.8e-05,3.4e-05,7.6e-05,0.000231,-1.8e-05,0.000106,2e-05,-9.6e-05,-0.000189,-7.5e-05,-6.1e-05,-9.1e-05,0.000238,4e-05,9e-06,2.1e-05,-6.6e-05,1e-04,-7.4e-05,-2.2e-05,5.6e-05,-2.8e-05,7.8e-05,9e-06,-5.1e-05,2.1e-05,6e-05,-0.000134,-6e-06,-1.9e-05,-8e-06,-7.5e-05,6.7e-05,8.3e-05,6.4e-05,5.2e-05,-0.000201,-2.8e-05,-1.6e-05,-4.7e-05,8.3e-05,-8.1e-05,1.8e-05,4.3e-05,-1.1e-05,0.000112,-7.2e-05,-0.000115,5.4e-05,0.000165,0.000134,-1.2e-05
-3e-06,-2e-06,-6e-06,-6e-06,-1e-06,-1.5e-05,-2.3e-05,2e-06,-1.8e-05,-3.6e-05,1e-06,5e-06,8e-06,8e-06,4e-05,-7e-06,-1.8e-05,6e-06,2.1e-05,1.6e-05,5e-06,2.7e-05,-1.1e-05,-2e-06,2.3e-05,-2.1e-05,-2e-06,6.9e-05,-1.5e-05,-3.1e-05,3.5e-05,2.6e-05,2e-06,6e-06,2.4e-05,1e-06,-3.4e-05,-3.6e-05,1.4e-05,8e-06,-5.2e-05,-9.3e-05,3e-06,2e-05,0,-1.3e-05,-6e-05,8e-06,-8e-06,9e-06,7.6e-05,2.3e-05,-2.4e-05,1.3e-05,6e-06,-2.3e-05,1.5e-05,-1.4e-05,3e-05,-2.7e-05,9e-05,6.4e-05,-7.7e-05,2.1e-05,0.000218,5.8e-05,-5.7e-05,2.7e-05,5e-06,-2.4e-05,-4.2e-05,-3.3e-05,-7.5e-05,6e-06,-3.2e-05,-2.7e-05,5.1e-05,0.000129,7.7e-05,-1.5e-05,3.2e-05,7.5e-05,2.1e-05,-2.3e-05,2.8e-05,1.3e-05,-7.1e-05,4.2e-05,0.000116,-0.000112,-4.1e-05,-7.6e-05,1.3e-05,4.2e-05,4.8e-05,-9.5e-05,2.5e-05,1.9e-05,-2.3e-05,-0.000166,-1.5e-05,9e-06,-3.5e-05,-1.9e-05,1.2e-05,4e-06,3.8e-05,-5.1e-05,2e-05,-4.2e-05,5.5e-05,-6.8e-05,-7.8e-05,2.5e-05,3.8e-05,5.9e-05,0.000146,-5e-05,0.000122,-0.000131,-1.4e-05
-2e-06,-4e-06,-2e-06,0,2e-06,-1.4e-05,2.1e-05,2e-06,1.3e-05,5.5e-05,-9e-06,-6e-06,1.4e-05,-1e-06,7e-06,-3e-06,1.9e-05,1.3e-05,-1.5e-05,3.1e-05,-4e-06,-3.6e-05,1.3e-05,-6e-06,4e-06,-1.5e-05,6e-06,-4.2e-05,-2.5e-05,-1.3e-05,-2.6e-05,-4e-05,-1e-06,-6.3e-05,-1.6e-05,0,-4.2e-05,-2.4e-05,-2e-05,1e-06,6.5e-05,5.3e-05,-3.3e-05,1.4e-05,2.4e-05,4e-06,9.2e-05,-3.3e-05,-1e-06,-2.6e-05,-7.7e-05,-2.4e-05,4.2e-05,-3.6e-05,-4.7e-05,3.9e-05,-2e-05,-2.6e-05,-1.3e-05,-1.4e-05,-5e-05,-1.9e-05,7e-06,1.6e-05,4.9e-05,0,3.7e-05,5.5e-05,-2.3e-05,-1.8e-05,-9.4e-05,-4.8e-05,-2.4e-05,-8e-06,-3.4e-05,-6e-06,8.6e-05,-0.000171,-6.3e-05,-5.6e-05,-0.000129,-0.00019,1e-06,1.1e-05,-7.1e-05,1.1e-05,5.1e-05,-6.9e-05,-2.6e-05,4.8e-05,5e-06,-2.8e-05,3e-06,-4.2e-05,-9e-05,8.8e-05,1.6e-05,-5.9e-05,-1e-05,0.000122,4.2e-05,-0.000137,-0.000112,-8.2e-05,2e-06,0.000153,4.4e-05,3.2e-05,-1.9e-05,-6e-06,-3.8e-05,1e-04,8.6e-05,-4.7e-05,-5e-06,-5e-06,-0.000135,6.1e-05,-7.3e-05,9.6e-05,2.4e-05
5e-06,9e-06,1e-06,4e-06,-7e-06,2.3e-05,-8e-06,-1e-06,1.1e-05,-2.4e-05,3.3e-05,2e-05,-7e-06,0,-3e-06,2e-06,1e-05,-1.1e-05,1.8e-05,-3e-05,-1e-05,9e-06,-1.3e-05,-9e-06,-2.8e-05,1.5e-05,5e-06,-1.9e-05,2.4e-05,-8e-06,1.8e-05,2.2e-05,3e-06,7.5e-05,6e-06,4e-06,5.6e-05,2.8e-05,2.3e-05,-5.7e-05,-2.1e-05,-1.9e-05,3e-06,-1.7e-05,-1.7e-05,-5e-06,-0.000106,4.2e-05,2.8e-05,-1.8e-05,1.5e-05,9e-06,-2.5e-05,5.2e-05,3.8e-05,9e-06,3e-06,4.1e-05,5e-06,-4.3e-05,9.5e-05,-1.3e-05,4.4e-05,-7.1e-05,-3.7e-05,1.6e-05,-2.6e-05,-0.000104,3e-05,2.1e-05,7.6e-05,0.000117,1.8e-05,5.6e-05,-1.8e-05,2e-06,-7e-05,0.000132,-4.3e-05,5.1e-05,-6.2e-05,0.000122,-4e-06,-3.6e-05,5e-06,-3.1e-05,-3.4e-05,0.00015,-4e-05,3.5e-05,5.9e-05,3.2e-05,-1.7e-05,3.5e-05,3.9e-05,4e-06,-4.5e-05,4.4e-05,3.5e-05,0.000121,-2.8e-05,0.000112,8e-05,3.3e-05,-2.8e-05,-0.000174,3.3e-05,8e-05,6e-06,1.6e-05,-5e-06,-8.7e-05,-5.3e-05,1.1e-05,1.4e-05,1.6e-05,9.6e-05,-2.4e-05,-0.000111,-7.6e-05,3e-06
2e-06,-3e-06,4e-06,-7e-06,9e-06,1e-05,-2e-06,-1e-06,-6e-06,-1e-05,-3.4e-05,-3e-06,3e-06,4e-06,-8e-06,1e-06,-1.1e-05,5e-06,1.6e-05,2.2e-05,5e-06,1.4e-05,0,3e-06,2.1e-05,7e-06,-6e-06,4e-06,1.8e-05,1.7e-05,-1.9e-05,-1.2e-05,0,-3e-05,2.4e-05,9e-06,-5e-06,5.7e-05,0,1.9e-05,-1.8e-05,-2e-05,-4e-06,7e-06,4e-06,4e-06,7.2e-05,-3.3e-05,1e-05,-5e-06,2.4e-05,-5e-06,-1.3e-05,-2e-06,1.9e-05,-4.3e-05,2.9e-05,-4.2e-05,-5e-06,-3e-05,-3.6e-05,6e-06,-3.4e-05,8.3e-05,9e-06,5.4e-05,3e-05,4.6e-05,-3.5e-05,-2.2e-05,3.8e-05,-7.2e-05,-3e-06,-3.9e-05,2.7e-05,-8e-06,-1.8e-05,-5.5e-05,0.000133,3.2e-05,-1.2e-05,-8.7e-05,-3e-06,-4.5e-05,-2e-05,2.4e-05,2e-05,-8.9e-05,-6.7e-05,-1.3e-05,2.1e-05,-6.3e-05,-4e-06,-2.1e-05,-3e-05,-5e-06,6.6e-05,-2.3e-05,3.2e-05,-0.000121,1e-05,-4.2e-05,-1.6e-05,4e-06,4.3e-05,9e-05,-1.6e-05,-5.5e-05,2.9e-05,-4.7e-05,7e-06,5.8e-05,-1.5e-05,-2.4e-05,-6.7e-05,-2.6e-05,-6.4e-05,-1.7e-05,4e-05,-2e-06,-1.5e-05
-5e-06,-1e-06,-3e-06,6e-06,-4e-06,-7e-06,6e-06,4e-06,-1e-05,3.1e-05,1.7e-05,-1.6e-05,-1e-05,0,-1.6e-05,-1e-06,4e-06,-1.1e-05,1e-06,9e-06,5e-06,-2.7e-05,1.3e-05,4e-06,5e-06,5e-06,1.1e-05,1e-05,-2.3e-05,1.9e-05,6e-06,1.8e-05,1e-06,-3.9e-05,-8e-06,-1e-06,-5.8e-05,-2.8e-05,-6e-06,4.6e-05,4.3e-05,2.7e-05,1.2e-05,-2.4e-05,4e-06,9e-06,2e-05,5e-06,-5.3e-05,2.3e-05,-6e-06,3e-06,3.8e-05,-4.9e-05,-8e-05,7e-06,-1.4e-05,4e-06,2e-06,-2.9e-05,0,3e-06,2.9e-05,-1.2e-05,5.6e-05,-4.3e-05,-2.8e-05,2.7e-05,2.6e-05,4e-06,1e-05,-3.3e-05,-6.3e-05,-8e-06,1e-05,1.6e-05,-0.000139,2.7e-05,0,-2.9e-05,-8.3e-05,-0.000112,-1.8e-05,3.6e-05,1.2e-05,-1.6e-05,-1.4e-05,-0.000141,4.8e-05,3e-06,-1.9e-05,8.1e-05,9e-06,5e-06,3.6e-05,-2.7e-05,6e-06,2.4e-05,-1e-06,-1.9e-05,-2.9e-05,2e-06,-0.00011,-3.7e-05,-5.6e-05,5e-05,-5e-05,-2.6e-05,-1.6e-05,2.1e-05,1.5e-05,-3.3e-05,2.7e-05,1.6e-05,-2.7e-05,2e-06,4.4e-05,6.1e-05,5.8e-05,-3.9e-05,-9e-06
0,4e-06,-2e-06,-5e-06,1e-06,-5e-06,-9e-06,-1.3e-05,7e-06,-2.1e-05,1e-06,8e-06,5e-06,1e-06,-1e-06,2e-06,-1e-06,1.1e-05,0,-2.5e-05,-3e-06,-1.8e-05,-1e-05,5e-06,-2.1e-05,-2e-06,-1.7e-05,1.1e-05,-5e-06,-2e-05,1e-06,-3.1e-05,-1e-06,4.7e-05,1.5e-05,-6e-06,5.8e-05,-2.2e-05,2.7e-05,-2.3e-05,-3.4e-05,-1.4e-05,-2e-06,1.9e-05,-1e-06,1.4e-05,-6.6e-05,-1e-05,7e-06,2.1e-05,-2.2e-05,-5e-06,-5.7e-05,3.2e-05,8.2e-05,5.9e-05,-1.5e-05,-1.9e-05,-1.9e-05,-2.3e-05,1.2e-05,1.1e-05,-1.3e-05,-7.4e-05,-6.2e-05,4e-05,1.8e-05,-3.5e-05,-1e-05,0,-9.2e-05,2.1e-05,1.7e-05,-1e-06,-2.1e-05,-1e-05,2.1e-05,2.1e-05,-1.7e-05,-3.4e-05,3e-06,0.000162,2e-05,-2.6e-05,2.2e-05,1.1e-05,7e-06,0.000147,3.7e-05,-3.6e-05,-9e-06,4e-06,4.1e-05,-1e-06,-1.1e-05,1.3e-05,-7.7e-05,-2.3e-05,-2.7e-05,4.1e-05,7e-06,4.4e-05,9.1e-05,-2e-05,4.3e-05,-0.000103,-1e-05,2.5e-05,1.6e-05,7e-06,8e-06,2e-05,-2.5e-05,-1e-05,1.6e-05,-1e-06,-2.7e-05,-5.2e-05,-4.3e-05,8.2e-05,3.3e-05
4e-06,-3e-06,2e-06,4e-06,0,0,5e-06,1.7e-05,8e-06,4e-06,0,-3e-06,3e-06,-1e-06,1.1e-05,-3e-06,-9e-06,-7e-06,1.2e-05,-2e-06,-6e-06,2.9e-05,-5e-06,-3e-06,1.5e-05,-2e-06,0,-3e-05,8e-06,-8e-06,-3.4e-05,2.6e-05,1e-06,-2.8e-05,-4.8e-05,-4e-06,9e-06,4.5e-05,-1.8e-05,-8e-06,0,-7e-06,-4e-06,-2.8e-05,-7e-06,-6e-06,7.6e-05,-3.7e-05,3.7e-05,-1.5e-05,5e-06,4e-06,6.6e-05,1e-05,-2.1e-05,-1.3e-05,6e-06,5e-06,-3e-06,-2.9e-05,2.4e-05,-1.2e-05,-2.4e-05,9.2e-05,-0.000152,-4.9e-05,-1.2e-05,-1.2e-05,-6e-06,-1.9e-05,5.3e-05,3e-05,4e-06,-5e-06,4e-06,7e-06,5.6e-05,-7.5e-05,7.7e-05,-7e-06,2e-05,4.2e-05,-1e-05,-1.8e-05,-5e-06,-3e-06,-1e-05,-3.4e-05,-0.000122,2.2e-05,4e-06,-4.9e-05,1.1e-05,-7e-06,4e-06,3.6e-05,3.8e-05,1.9e-05,-1.6e-05,-2e-06,6e-06,-6e-06,3e-06,4.3e-05,-1.8e-05,4.2e-05,1.2e-05,6.5e-05,-3.4e-05,2.7e-05,6e-06,8e-06,3.1e-05,9e-06,1.4e-05,1.1e-05,1e-05,1.9e-05,-4.3e-05,-0.000126,-3.4e-05
0,1e-06,0,-3e-06,1e-06,0,4e-06,-1e-05,-8e-06,1e-05,-1.5e-05,-5e-06,-5e-06,2e-06,5e-06,2e-06,5e-06,8e-06,1e-06,1.2e-05,2e-06,5e-06,3e-06,-6e-06,5e-06,-7e-06,2e-06,2e-05,1.7e-05,1e-06,1.3e-05,-2.5e-05,0,4e-06,3.3e-05,-1e-06,-5.4e-05,2.1e-05,1.7e-05,1.9e-05,1.6e-05,1.8e-05,-1e-06,2.8e-05,9e-06,-1.3e-05,-6.7e-05,4.9e-05,9e-06,-1.2e-05,3.1e-05,7e-06,-5.1e-05,-1.2e-05,-3.5e-05,-3.4e-05,2e-06,-1.7e-05,-1e-06,-1.5e-05,0,-1.3e-05,3.3e-05,-3.4e-05,9e-05,4e-05,8e-06,8e-06,-1e-06,1.3e-05,-3.3e-05,-4.9e-05,-7.4e-05,3.1e-05,9e-06,1e-06,-2e-05,5.9e-05,1e-05,3.4e-05,5.9e-05,-5.8e-05,5e-06,3e-06,1.9e-05,0,4e-06,1.7e-05,0,2e-06,-9e-06,3.7e-05,-1.7e-05,1.6e-05,3e-06,-4.3e-05,5.5e-05,-1e-05,2.6e-05,-1.9e-05,-1.6e-05,0,-4.9e-05,2.1e-05,-1.4e-05,1e-05,-5.5e-05,-4.6e-05,2.5e-05,-2.9e-05,-3e-06,-2.9e-05,-4.7e-05,1e-06,3.5e-05,-9e-06,3e-06,-2.1e-05,5.7e-05,8.4e-05,1.2e-05
-3e-06,1e-06,-2e-06,1e-06,0,-2e-06,-5e-06,0,0,-1.9e-05,1.6e-05,1.2e-05,1e-06,0,1.1e-05,-1e-06,0,-7e-06,-2e-06,-9e-06,8e-06,-1e-05,-2e-06,3e-06,-2e-05,-3e-06,2e-06,3e-06,-1.5e-05,1.1e-05,1.3e-05,2.7e-05,0,2.6e-05,-1e-05,7e-06,3.1e-05,-3e-05,-1.4e-05,1e-06,-1.2e-05,-3e-06,1.5e-05,-3.4e-05,-3e-06,1.5e-05,1.9e-05,-8e-06,-1.1e-05,-1e-05,-4.1e-05,-4e-06,1.5e-05,-3e-06,3.8e-05,1.1e-05,1e-05,-1.1e-05,-1e-06,-1.8e-05,-3.1e-05,1.3e-05,-2.4e-05,-4.3e-05,-3e-06,-5.1e-05,-3e-06,2.5e-05,1e-05,3e-06,8.4e-05,3.4e-05,7.3e-05,-9e-06,1e-05,-3e-06,-2.9e-05,-6.8e-05,-1.5e-05,-7e-06,3.5e-05,8.7e-05,1.2e-05,3e-06,-1.4e-05,-1.2e-05,0,-1.5e-05,2.7e-05,1.5e-05,3e-06,-3.4e-05,0,-1.7e-05,-9e-06,6e-06,-7.3e-05,1.1e-05,1e-05,-2.2e-05,-1e-06,-6.1e-05,2.9e-05,2e-05,2.2e-05,-2e-05,4.1e-05,-4.6e-05,-2.4e-05,3.5e-05,-1.3e-05,2.5e-05,4.4e-05,1.2e-05,4e-06,-1.1e-05,-1.2e-05,-2.6e-05,6.6e-05,7.8e-05,-1e-06
-1e-06,-1e-06,1e-06,-1e-06,-2e-06,-2e-06,7e-06,5e-06,3e-06,5e-06,-2e-06,0,4e-06,2e-06,-9e-06,2e-06,0,5e-06,6e-06,-7e-06,0,-1.3e-05,4e-06,-1e-06,1.5e-05,9e-06,-1e-06,8e-06,-5e-06,8e-06,2e-06,-2.1e-05,0,-4.3e-05,2.4e-05,0,1.9e-05,-1.8e-05,-1e-06,-1.1e-05,0,-2.3e-05,-1.7e-05,5.8e-05,-2e-06,1e-06,2.4e-05,3e-06,-3.6e-05,5e-06,1.4e-05,-3e-06,1.4e-05,-3e-06,2e-06,4e-06,-3e-06,1.1e-05,1e-06,-1.2e-05,1.8e-05,2e-06,1.7e-05,7.9e-05,-2.8e-05,1e-05,0,-2e-05,-3e-06,8e-06,-6.7e-05,5e-06,-2.8e-05,-1.1e-05,-8e-06,6e-06,-5e-05,0.000106,3.4e-05,-1.6e-05,4.7e-05,-8.2e-05,-6e-06,4e-06,-6e-06,7e-06,-5e-06,3.4e-05,-4.4e-05,-1.6e-05,2e-06,1e-06,1.2e-05,1.7e-05,-8e-06,-8e-06,-2e-06,-1.4e-05,-4e-06,5.7e-05,0,3.5e-05,2.7e-05,-9e-06,-5e-06,1.9e-05,1.7e-05,5.3e-05,1.1e-05,-2.5e-05,8e-06,-3e-05,-2.3e-05,3e-06,-1.4e-05,1.5e-05,2.1e-05,4.7e-05,-6.2e-05,-8.6e-05,-1e-06
2e-06,0,2e-06,1e-06,2e-06,7e-06,-5e-06,-9e-06,0,6e-06,-7e-06,-7e-06,-5e-06,-1e-06,-7e-06,0,6e-06,-5e-06,-8e-06,1.9e-05,-9e-06,2e-06,3e-06,6e-06,1e-06,3e-06,1.4e-05,-2.2e-05,4e-06,-1.7e-05,-2e-06,1.7e-05,-1e-06,3.6e-05,-1.2e-05,2e-06,-4.3e-05,3e-05,0,-1.8e-05,1.4e-05,3.4e-05,2e-05,-5.2e-05,1e-06,1e-06,-5.2e-05,2.4e-05,1.2e-05,1.9e-05,-1e-06,4e-06,-2.5e-05,1.3e-05,-4e-05,-2e-05,-1.2e-05,-1e-05,0,-9e-06,-3.2e-05,-9e-06,2e-06,-4.6e-05,2.5e-05,-4e-06,0,-1.6e-05,-1e-05,1.1e-05,1.9e-05,-1.9e-05,-1.5e-05,0,-2e-06,-5e-06,-3.9e-05,-9.6e-05,5e-06,-1.9e-05,4.3e-05,-9.7e-05,-8e-06,-1.3e-05,-1e-05,-4e-06,5e-06,4.2e-05,4e-06,-1.3e-05,-4e-06,3.1e-05,-2e-06,-1.7e-05,3e-06,1.6e-05,5.6e-05,4e-06,-1.6e-05,0,4e-06,2.4e-05,-1.3e-05,-2e-05,-1.1e-05,-3e-06,2e-06,1.8e-05,-1.3e-05,-2.8e-05,-1.6e-05,3.7e-05,8e-06,3e-06,-3e-05,-9e-06,-2.8e-05,-1.5e-05,-6.7e-05,3.1e-05,4e-06
0,0,-3e-06,-1e-06,-2e-06,7e-06,1e-06,1.1e-05,-3e-06,-2e-06,-1e-06,6e-06,5e-06,1e-06,-7e-06,-1e-06,-5e-06,4e-06,2e-06,-6e-06,1e-06,7e-06,-9e-06,-3e-06,-1.2e-05,-3e-06,-1.4e-05,0,1.1e-05,-6e-06,2e-06,-1.3e-05,1e-06,1e-06,-4e-06,-5e-06,1.6e-05,3e-06,-1e-05,2e-05,-1.7e-05,-1.9e-05,-7e-06,4.8e-05,-1e-06,-9e-06,6.3e-05,-2.5e-05,3e-05,1e-06,1.3e-05,-3e-06,2.9e-05,0,4.3e-05,8e-06,5e-06,-3e-06,9e-06,-3e-06,1.8e-05,-1e-06,-1.6e-05,-1.6e-05,8.6e-05,-2e-05,0,3.5e-05,9e-06,-2e-06,-2.7e-05,1.4e-05,5.2e-05,-2e-06,5e-06,1e-06,3e-06,8e-05,-2.2e-05,2e-05,-2.5e-05,8.9e-05,-4e-06,-1.3e-05,-4e-06,-1e-06,-1e-05,-0.000103,-5e-06,2e-05,-2e-06,-1.5e-05,1e-06,1.1e-05,1.3e-05,-9e-06,-2.2e-05,3e-06,1e-06,-6.8e-05,-1e-06,-1.2e-05,-1.5e-05,-1.7e-05,1.5e-05,-4e-06,1.5e-05,-3.5e-05,1.1e-05,5.3e-05,0,-2.2e-05,-6e-06,3e-06,-1.8e-05,1.8e-05,3e-05,1.4e-05,2.1e-05,-3.3e-05,2e-06
-2e-06,0,0,0,1e-06,-9e-06,1e-06,-9e-06,2e-06,-8e-06,1.1e-05,-4e-06,-4e-06,-1e-06,3e-06,1e-06,-3e-06,-5e-06,-5e-06,-1.1e-05,9e-06,-1.7e-05,5e-06,-2e-06,9e-06,-5e-06,3e-06,1.2e-05,-1.3e-05,4e-06,1.6e-05,6e-06,0,-3.3e-05,-2e-06,0,2.3e-05,-3.1e-05,9e-06,5e-06,6e-06,-4e-06,-1e-05,-5.4e-05,-2e-06,-7e-06,-4.2e-05,2.7e-05,-1.9e-05,-1.3e-05,-2.5e-05,-2e-06,-2.9e-05,-2.1e-05,-1.3e-05,2.2e-05,5e-06,-2.4e-05,-5e-06,-2e-06,-1.4e-05,2e-06,1.3e-05,5.6e-05,3.5e-05,3e-05,1e-06,-1.8e-05,-3e-06,7e-06,4.2e-05,-1.6e-05,-2.2e-05,9e-06,1.2e-05,-1e-06,5.8e-05,-7.9e-05,1.7e-05,4e-06,-4e-06,-2e-05,6e-06,1.7e-05,6e-06,4e-06,1.2e-05,2.5e-05,7e-06,-2e-06,-4e-06,-9e-06,-1e-06,-9e-06,-6e-06,-2e-05,-4.1e-05,-2e-06,4e-06,3.1e-05,-1.2e-05,6e-06,2.1e-05,-1e-06,-1.5e-05,-1.7e-05,-1.3e-05,-1e-05,-5e-06,-2.8e-05,5e-06,9e-06,8e-06,-8e-06,1.6e-05,-1.4e-05,-2.7e-05,3e-06,8.1e-05,1.6e-05,0
0,-2e-06,2e-06,0,0,-6e-06,-2e-06,4e-06,3e-06,1.6e-05,-7e-06,-5e-06,4e-06,2e-06,7e-06,-2e-06,5e-06,7e-06,0,1.2e-05,0,0,1e-06,-2e-06,4e-06,-1e-06,-6e-06,0,-1e-06,1e-05,-2.2e-05,3e-06,0,2.7e-05,-7e-06,-2e-06,-2.2e-05,-1.1e-05,-5e-06,-2.3e-05,6e-06,2.1e-05,2e-06,5.2e-05,0,1.1e-05,8e-06,-1.6e-05,4e-06,-1.3e-05,1.9e-05,3e-06,2.4e-05,1.8e-05,-2.9e-05,-4e-06,-3e-06,2e-06,3e-06,5e-06,7e-06,4e-06,-8e-06,-4.8e-05,-0.000108,-3.6e-05,-1e-06,-1.5e-05,2e-06,-2e-06,-1.5e-05,-4e-06,9e-06,5e-06,-9e-06,-2e-06,-5.6e-05,4.2e-05,-6e-06,-1e-06,-2.2e-05,-2.1e-05,-2e-06,8e-06,1e-06,-6e-06,-1.4e-05,2.5e-05,-2.6e-05,-1e-06,-2e-06,1e-05,-3e-06,1e-05,6e-06,8e-06,2.8e-05,1e-06,1e-06,3.9e-05,5e-06,-1e-05,-2e-06,-9e-06,7e-06,2.3e-05,1.3e-05,1.3e-05,2e-06,-1.2e-05,0,-1e-05,3e-06,3e-06,1.7e-05,6e-06,2.2e-05,-2.5e-05,-2.5e-05,-9e-06,-9e-06
1e-06,2e-06,0,0,1e-06,5e-06,2e-06,-1e-06,-5e-06,-1.2e-05,-4e-06,8e-06,-1e-06,-2e-06,8e-06,2e-06,-5e-06,-6e-06,-8e-06,0,-9e-06,1.8e-05,-2e-06,1e-06,-1.1e-05,3e-06,-3e-06,-9e-06,6e-06,-2e-06,0,-1e-05,0,-6e-06,1.7e-05,3e-06,-2e-06,2.2e-05,8e-06,1.8e-05,-8e-06,-2.1e-05,-7e-06,-5.4e-05,1e-06,2e-06,3.3e-05,-2e-05,-3.4e-05,9e-06,-2e-06,-2e-06,-2.2e-05,0,4.9e-05,-1.6e-05,4e-06,-3e-06,0,5e-06,-1.9e-05,-2e-06,2e-06,8e-06,4.5e-05,3.2e-05,1e-06,1.5e-05,-3e-06,-1e-06,3e-06,2e-05,1.4e-05,-8e-06,1e-06,1e-06,-2.4e-05,-6e-06,-2.5e-05,-1.8e-05,-5.8e-05,9.3e-05,6e-06,-4e-06,1.1e-05,5e-06,1.2e-05,-3.5e-05,-2e-06,-5e-06,1.1e-05,-1.5e-05,0,-7e-06,-1.6e-05,1.1e-05,1.6e-05,-4e-06,-7e-06,-2.6e-05,0,4e-06,-2.4e-05,-2e-06,5e-06,0,-1.8e-05,2e-05,2e-06,3.7e-05,6e-06,0,-9e-06,-7e-06,1.9e-05,-4e-06,-1.6e-05,2.2e-05,-4.5e-05,-2.6e-05,9e-06
0,0,-2e-06,0,0,1e-06,0,1e-06,-2e-06,-3e-06,1.3e-05,-2e-06,-5e-06,2e-06,-2e-06,0,0,5e-06,8e-06,-7e-06,0,6e-06,3e-06,3e-06,8e-06,1e-06,4e-06,0,4e-06,-9e-06,1.6e-05,9e-06,0,-1.2e-05,-2e-06,-1e-06,1.8e-05,4e-06,-1e-06,1.4e-05,5e-06,3e-06,-6e-06,5.1e-05,-2e-06,-9e-06,-5.9e-05,2.6e-05,4.6e-05,1.6e-05,-9e-06,2e-06,2.1e-05,-8e-06,-2.5e-05,9e-06,-4e-06,1e-06,0,8e-06,3e-06,-4e-06,9e-06,2.9e-05,-1e-05,-1.3e-05,-3e-06,4e-06,3e-06,5e-06,-9e-06,-1.2e-05,2e-06,-2e-06,0,-2e-06,-3.2e-05,1e-06,8e-06,7e-06,-1.6e-05,-4.3e-05,-2e-06,-1e-06,-4e-06,-4e-06,-1.3e-05,1.3e-05,5.1e-05,0,1e-05,-1e-06,-8e-06,2e-06,7e-06,8e-06,-6e-06,6e-06,7e-06,-2.7e-05,-2e-06,-2.4e-05,4e-06,1.6e-05,-1.4e-05,-2.2e-05,-1.9e-05,-2.6e-05,-3e-06,-2.9e-05,2e-06,1e-05,9e-06,1e-06,5e-06,-1e-06,8e-06,-4e-06,5e-06,1.2e-05,-4e-06
-1e-06,-2e-06,1e-06,-1e-06,0,-5e-06,-1e-06,0,5e-06,1.7e-05,-1e-05,-3e-06,4e-06,-1e-06,-4e-06,0,6e-06,-7e-06,-8e-06,1e-06,9e-06,-1.8e-05,-3e-06,-1e-06,3e-06,1e-06,1e-06,1.3e-05,-8e-06,-6e-06,-2.9e-05,-8e-06,0,2.2e-05,5e-06,2e-06,-5e-06,-2.5e-05,2e-06,-1.9e-05,3e-06,1.3e-05,4e-06,-5.1e-05,1e-06,-5e-06,5.1e-05,-2.5e-05,-8e-06,-2e-06,9e-06,0,-1.6e-05,2e-06,-1.7e-05,8e-06,-4e-06,-1e-05,-1e-06,1.2e-05,9e-06,3e-06,-1.2e-05,-3.8e-05,-5.9e-05,5e-06,4e-06,-6e-06,-5e-06,-2e-06,-1.6e-05,-5e-06,-2.4e-05,-3e-06,3e-06,0,-2.3e-05,2.2e-05,-3e-06,8e-06,-2e-05,-5.8e-05,-1e-06,6e-06,3e-06,2e-06,1.1e-05,5e-06,-3.1e-05,1e-06,-2e-06,2.6e-05,-6e-06,2e-06,0,-2.7e-05,-9e-06,-6e-06,2e-06,2e-05,-3e-06,2.4e-05,1.2e-05,2.1e-05,1.5e-05,2.8e-05,1.1e-05,0,9e-06,4e-06,-2e-06,-8e-06,-5e-06,-7e-06,-2.5e-05,2e-06,-1e-06,-8e-06,5.3e-05,7.6e-05,2e-06
0,3e-06,1e-06,1e-06,1e-06,3e-06,2e-06,-2e-06,1e-06,-1.7e-05,2e-06,7e-06,-3e-06,2e-06,-9e-06,-1e-06,-3e-06,7e-06,7e-06,4e-06,0,-7e-06,1e-06,-2e-06,-9e-06,-1e-06,5e-06,-3e-06,-2e-06,1e-05,9e-06,1.1e-05,0,-2.2e-05,-1.4e-05,-2e-06,-1.8e-05,-4e-06,3e-06,-7e-06,-9e-06,-1.7e-05,2e-06,5.7e-05,0,4e-06,-2.5e-05,1.5e-05,2e-06,-1.1e-05,0,0,2e-06,0,3e-05,-1.6e-05,7e-06,-1.1e-05,-1e-06,1.1e-05,-9e-06,1e-06,5e-06,2.1e-05,-3.2e-05,4e-06,-5e-06,-1.2e-05,2e-06,2e-06,2.9e-05,1.5e-05,2.7e-05,6e-06,-2e-06,0,3.8e-05,-5.2e-05,-1.7e-05,-2e-06,-1.3e-05,7.1e-05,-1e-06,1e-06,-3e-06,-2e-06,-1.1e-05,3.8e-05,0,6e-06,-1.1e-05,-1.9e-05,4e-06,-6e-06,2e-06,2e-06,-8e-06,5e-06,-1e-06,3e-05,-1e-06,3e-06,-2.2e-05,1e-05,-9e-06,-1.8e-05,-7e-06,8e-06,-1e-05,8e-06,1e-06,6e-06,8e-06,3e-06,-1.6e-05,-6e-06,-5e-06,0,-1.8e-05,-8e-05,2e-06
1e-06,-1e-06,-2e-06,-1e-06,-1e-06,5e-06,-1e-06,3e-06,-6e-06,2e-06,-2e-06,-3e-06,1e-06,-2e-06,-3e-06,1e-06,0,-4e-06,-6e-06,-6e-06,-9e-06,9e-06,1e-06,-2e-06,5e-06,-2e-06,0,-8e-06,7e-06,5e-06,1.2e-05,-1.2e-05,0,1e-05,2e-06,2e-06,1.5e-05,2.8e-05,-5e-06,1e-05,3e-06,4e-06,-3e-06,-6e-05,0,6e-06,-1.2e-05,2e-06,-2.6e-05,-5e-06,0,0,2e-05,-1e-06,-3e-06,-6e-06,-2e-06,-2e-06,1e-06,1.4e-05,1.7e-05,-2e-06,0,3e-06,4.1e-05,-8e-06,5e-06,1.5e-05,4e-06,-1e-06,-1.7e-05,-2e-06,-1e-05,6e-06,-7e-06,-2e-06,-1.4e-05,5.5e-05,5e-06,-7e-06,2.1e-05,-4.2e-05,-3e-06,-2e-06,-5e-06,3e-06,9e-06,-2.7e-05,3e-05,-2e-06,-8e-06,3e-06,6e-06,9e-06,4e-06,2.6e-05,1.9e-05,-6e-06,-1.1e-05,-4.3e-05,5e-06,-4e-06,7e-06,-9e-06,2e-06,-5e-06,0,3e-06,8e-06,-1.2e-05,0,-1.1e-05,-1.1e-05,2e-06,-6e-06,3e-06,1e-05,-1.3e-05,-5.3e-05,6.2e-05,-2e-06
0,-2e-06,0,2e-06,0,-2e-06,0,-5e-06,0,1.7e-05,1.3e-05,-4e-06,0,2e-06,6e-06,-1e-06,2e-06,5e-06,8e-06,-2e-06,0,3e-06,-1e-06,2e-06,4e-06,2e-06,-2e-06,-4e-06,1e-06,0,-1e-05,8e-06,0,1.6e-05,2e-06,-2e-06,1e-05,3e-06,4e-06,4e-06,5e-06,1.2e-05,7e-06,5.8e-05,-1e-06,1e-06,4.3e-05,-2e-05,7e-06,4e-06,-1.5e-05,0,-3.5e-05,8e-06,-3.3e-05,8e-06,-4e-06,-7e-06,0,1.5e-05,-1.1e-05,0,-6e-06,-2.1e-05,6.3e-05,1.8e-05,-5e-06,9e-06,-1e-06,-5e-06,2.2e-05,-1.8e-05,-3.2e-05,-5e-06,7e-06,2e-06,-2.4e-05,-7.1e-05,5e-06,-4e-06,3.8e-05,-3.3e-05,4e-06,2e-06,5e-06,-3e-06,-1e-05,-3.1e-05,0,-9e-06,4e-06,1.4e-05,-3e-06,-9e-06,-3e-06,-4e-06,0,6e-06,6e-06,-1.6e-05,-5e-06,1.6e-05,1.7e-05,-1.2e-05,4e-06,2.1e-05,8e-06,3e-06,-1.1e-05,8e-06,-5e-06,8e-06,9e-06,2e-06,8e-06,-1e-06,-1.3e-05,7e-06,7e-06,-5.2e-05,1e-06
