0.009354,0.016622,0.016399,0.016616,0.026973,0.038057,0.051556,0.072911,0.109775,0.165403,0.181429,0.175235,0.178334,0.169599,0.203037,0.240283,0.241204,0.260356,0.331141,0.371737,0.356754,0.320161,0.302894,0.338834,0.350493,0.287272,0.268477,0.317585
0.011178,0.01901,0.018608,0.019015,0.030664,0.043316,0.05941,0.084482,0.126179,0.18729,0.202892,0.196428,0.205321,0.197187,0.229359,0.268865,0.270229,0.290306,0.370692,0.420906,0.400891,0.356939,0.344362,0.383134,0.388307,0.320958,0.306193,0.357678
0.013728,0.021602,0.020993,0.021848,0.034991,0.049725,0.069639,0.0992,0.144475,0.208485,0.222573,0.217625,0.237229,0.231622,0.255074,0.292118,0.294587,0.313769,0.401237,0.462785,0.434739,0.382207,0.381901,0.422166,0.414898,0.348505,0.343291,0.392724
0.014445,0.020954,0.020617,0.022132,0.03493,0.04998,0.07155,0.101134,0.138474,0.189681,0.204927,0.204017,0.229758,0.230743,0.234031,0.258289,0.266004,0.280421,0.3472,0.400849,0.373333,0.325886,0.338165,0.373128,0.358173,0.308347,0.310834,0.344239
0.013791,0.018715,0.019431,0.022844,0.035881,0.052308,0.077087,0.107024,0.12839,0.156254,0.179941,0.18588,0.207126,0.215165,0.204923,0.218502,0.23497,0.244664,0.268237,0.296823,0.288436,0.263702,0.274788,0.301377,0.296181,0.26337,0.254874,0.26147
0.013494,0.017161,0.019653,0.027279,0.046335,0.075502,0.119624,0.161696,0.168499,0.168963,0.192354,0.207288,0.229944,0.245413,0.240711,0.257765,0.287733,0.291296,0.288551,0.314702,0.317104,0.302336,0.313239,0.352388,0.36624,0.328938,0.296051,0.272645
0.013112,0.015559,0.021763,0.040168,0.076617,0.136945,0.229565,0.306422,0.301155,0.268492,0.27867,0.302692,0.354066,0.386594,0.396578,0.439273,0.495189,0.484222,0.464349,0.511179,0.508668,0.480918,0.496787,0.586229,0.627822,0.560667,0.491668,0.440509
0.01347,0.015868,0.028624,0.067442,0.136548,0.25023,0.431737,0.576725,0.554059,0.475979,0.474811,0.516457,0.62902,0.696051,0.723592,0.819564,0.926242,0.884249,0.829556,0.902959,0.894333,0.839648,0.866624,1.070029,1.163144,1.023996,0.88605,0.793135
0.015463,0.019497,0.042121,0.11159,0.228609,0.417508,0.732653,0.984448,0.937607,0.789913,0.771039,0.853084,1.075906,1.209463,1.255679,1.416808,1.607698,1.524217,1.403148,1.521745,1.526499,1.436373,1.48648,1.887139,2.072795,1.791954,1.539946,1.396494
0.01809,0.024969,0.060275,0.169489,0.342854,0.606679,1.070037,1.447709,1.381706,1.166685,1.121183,1.252963,1.625095,1.864468,1.924259,2.135031,2.447093,2.328684,2.113098,2.29115,2.346527,2.236398,2.32154,2.974026,3.279082,2.798895,2.423404,2.247183
0.019947,0.0302,0.078999,0.226857,0.442408,0.734062,1.281219,1.745687,1.692702,1.472088,1.402564,1.563021,2.055817,2.408993,2.463723,2.663869,3.116928,3.013025,2.699152,2.911623,3.056887,2.974845,3.095851,3.949792,4.356663,3.726602,3.306503,3.129136
0.020046,0.032787,0.091937,0.257024,0.469257,0.710238,1.20266,1.649714,1.647074,1.511103,1.458406,1.619578,2.093742,2.474845,2.496839,2.611689,3.162085,3.140195,2.783789,2.962266,3.186544,3.188349,3.321003,4.165403,4.591047,4.010863,3.696747,3.554241
0.018826,0.032373,0.089911,0.233296,0.393448,0.539408,0.865627,1.196357,1.245158,1.222314,1.237463,1.360996,1.632258,1.914207,1.907516,1.931183,2.441419,2.502832,2.252722,2.346599,2.531332,2.61741,2.720922,3.292823,3.624031,3.288776,3.162134,3.094712
0.017987,0.030435,0.072867,0.171439,0.277335,0.352678,0.500984,0.664211,0.725022,0.776009,0.826951,0.878338,0.946044,1.105506,1.108465,1.128889,1.45579,1.47988,1.417306,1.494578,1.555259,1.651385,1.716866,1.923398,2.09291,2.001369,1.9651,1.943776
0.017587,0.02911,0.055811,0.135319,0.259693,0.308374,0.323503,0.383752,0.469914,0.570878,0.57159,0.523039,0.564441,0.641696,0.628585,0.754912,0.952072,0.875575,0.892294,0.994395,0.961296,0.99433,1.037875,1.031531,1.083206,1.128258,1.056366,1.000814
0.019708,0.033021,0.058988,0.166958,0.382467,0.43938,0.372149,0.417673,0.55822,0.752305,0.774423,0.65226,0.695346,0.712156,0.657455,0.944631,1.23193,1.084372,1.017194,1.086907,1.033141,1.05084,1.068704,1.049005,1.097924,1.143848,1.05633,0.992834
0.026187,0.041655,0.078958,0.246983,0.58526,0.685698,0.555247,0.586013,0.79577,1.120836,1.237725,1.036014,1.025434,1.035426,0.910712,1.293208,1.75685,1.582691,1.39676,1.419344,1.372042,1.401431,1.394815,1.397519,1.489287,1.527804,1.498314,1.466815
0.035476,0.050992,0.105136,0.342901,0.798994,0.984351,0.823175,0.804188,1.091379,1.609258,1.891705,1.570944,1.412943,1.418364,1.257682,1.718391,2.366419,2.152221,1.753414,1.72078,1.707956,1.710259,1.642823,1.659768,1.805548,1.893302,2.066498,2.095855
0.042528,0.055159,0.125911,0.412485,0.936091,1.242842,1.113932,0.997955,1.359987,2.148049,2.652392,2.207403,1.827879,1.776757,1.629493,2.14008,2.881272,2.580138,2.003515,2.029299,2.013122,1.870804,1.729159,1.7984,1.976894,2.136508,2.658933,2.790254
0.043502,0.053554,0.131753,0.414747,0.932905,1.34484,1.281501,1.08752,1.529327,2.527552,3.175337,2.654742,2.07782,1.932169,1.832107,2.381209,3.091267,2.719722,2.194796,2.388499,2.245542,1.921166,1.807906,1.912886,2.024404,2.25951,3.164188,3.38789
0.037416,0.046791,0.121048,0.357853,0.81269,1.221829,1.188002,0.993997,1.471511,2.414527,2.998896,2.53734,1.970463,1.804947,1.733685,2.283527,2.879216,2.59716,2.31091,2.52406,2.159008,1.706542,1.76347,1.934899,1.869344,2.064772,3.11954,3.35405
0.031381,0.039436,0.100225,0.281205,0.605028,0.886802,0.878761,0.77206,1.151604,1.765358,2.135387,1.861634,1.508771,1.425259,1.39664,1.824187,2.215737,2.101268,2.021141,2.091625,1.62738,1.213261,1.435663,1.678208,1.527781,1.597298,2.373416,2.513722
0.031253,0.036021,0.079042,0.208148,0.387943,0.516787,0.551067,0.592969,0.796801,1.054046,1.246073,1.123658,0.962544,0.971551,1.015802,1.23892,1.413306,1.39062,1.341195,1.28601,0.986127,0.783329,1.012734,1.235192,1.140729,1.139309,1.417132,1.455909
0.034052,0.038171,0.069752,0.179062,0.29769,0.325871,0.385686,0.570994,0.669649,0.646396,0.682366,0.682975,0.60306,0.59907,0.730983,0.905525,0.956324,0.917049,0.838833,0.745527,0.69749,0.716824,0.821159,0.864751,0.811923,0.79621,0.776319,0.839039
0.032416,0.035357,0.060019,0.165285,0.284752,0.309488,0.396572,0.651068,0.732942,0.568299,0.553987,0.6535,0.565082,0.486765,0.715939,1.002928,1.076175,1.022301,0.872878,0.758825,0.793172,0.838169,0.802774,0.704249,0.714302,0.750756,0.634034,0.701411
0.024355,0.025858,0.043049,0.130148,0.236266,0.294003,0.413341,0.669568,0.74915,0.592003,0.590563,0.761044,0.699611,0.554129,0.792106,1.096036,1.254064,1.240536,0.973776,0.839187,0.903474,0.963823,0.896393,0.707345,0.720286,0.866694,0.782916,0.72461
0.018059,0.019213,0.028327,0.078773,0.153831,0.249262,0.374954,0.590231,0.674905,0.586108,0.610639,0.823849,0.826791,0.636886,0.786695,0.996294,1.260216,1.344479,0.984358,0.831058,0.877546,0.942047,0.899155,0.68444,0.739365,1.05556,1.059054,0.843313
0.020717,0.021025,0.021849,0.039596,0.100809,0.213835,0.302285,0.442933,0.51297,0.495185,0.545305,0.766793,0.823616,0.622823,0.68511,0.790168,1.07492,1.238304,0.904512,0.788593,0.827951,0.857878,0.828025,0.638826,0.716607,1.148644,1.243369,0.972072
0.024891,0.024735,0.02085,0.025816,0.084691,0.179444,0.233107,0.328018,0.395287,0.393949,0.402913,0.5869,0.672359,0.514148,0.520509,0.572381,0.785681,0.91766,0.731616,0.715897,0.74433,0.7372,0.676842,0.529017,0.614283,1.031423,1.154283,0.924865
0.029978,0.02838,0.02521,0.026206,0.076563,0.156003,0.194258,0.261873,0.343155,0.328822,0.297511,0.428974,0.492396,0.397343,0.348203,0.368669,0.522525,0.577755,0.538108,0.586426,0.560934,0.555969,0.535137,0.427074,0.485541,0.756347,0.806179,0.688061
0.038164,0.033467,0.032407,0.030773,0.073451,0.148274,0.173085,0.201446,0.275201,0.305202,0.315629,0.376578,0.373953,0.324625,0.254706,0.239877,0.386193,0.427248,0.449497,0.53474,0.439754,0.435072,0.489361,0.404231,0.399643,0.472286,0.430937,0.448231
0.044543,0.038014,0.037565,0.036612,0.070241,0.135966,0.158025,0.170917,0.222529,0.258532,0.317512,0.368382,0.331397,0.297616,0.251512,0.219413,0.304443,0.310666,0.365502,0.502017,0.406946,0.372479,0.481151,0.426908,0.330321,0.316629,0.280115,0.328657
0.041763,0.034877,0.034798,0.038816,0.064787,0.106567,0.125276,0.148662,0.196117,0.207947,0.27625,0.373182,0.331856,0.272297,0.238428,0.203007,0.241584,0.230821,0.27712,0.4041,0.34621,0.282811,0.417864,0.399281,0.293941,0.302374,0.265861,0.299914
0.029606,0.023943,0.025181,0.036204,0.057642,0.071997,0.090577,0.130405,0.176819,0.184753,0.246499,0.351456,0.312903,0.230552,0.186542,0.162008,0.200715,0.19101,0.193929,0.273093,0.279466,0.241489,0.356161,0.337151,0.252503,0.276081,0.234119,0.26768
0.016135,0.012289,0.017168,0.033208,0.049952,0.055161,0.065079,0.117154,0.167324,0.15346,0.201344,0.279282,0.248022,0.18686,0.153791,0.140356,0.157828,0.140474,0.145767,0.21025,0.259927,0.255914,0.314834,0.30314,0.231921,0.244643,0.230548,0.234692
0.009871,0.006836,0.013049,0.027796,0.03778,0.047311,0.049806,0.099335,0.155589,0.118467,0.146664,0.208199,0.182106,0.158296,0.166949,0.175624,0.161898,0.116907,0.118261,0.178925,0.241031,0.240802,0.242835,0.247865,0.19626,0.19672,0.227706,0.221532
0.007479,0.005127,0.011869,0.021368,0.025613,0.038434,0.037405,0.080384,0.154625,0.121791,0.115079,0.172368,0.141499,0.120475,0.171248,0.221779,0.212637,0.145092,0.108982,0.134321,0.183449,0.203341,0.184412,0.171892,0.138833,0.154723,0.208622,0.199739
0.005526,0.003974,0.009669,0.016399,0.021651,0.031779,0.032066,0.06768,0.151167,0.123391,0.087445,0.142108,0.125308,0.106575,0.166331,0.238972,0.245762,0.184379,0.139172,0.133961,0.131359,0.15003,0.135622,0.1197,0.110308,0.147688,0.186356,0.151752
0.006338,0.004392,0.007649,0.012949,0.019688,0.025864,0.029714,0.068505,0.148268,0.113297,0.073092,0.125122,0.11394,0.107271,0.149001,0.209598,0.230558,0.203792,0.176682,0.16774,0.133515,0.112979,0.108516,0.123977,0.125377,0.144573,0.159529,0.11445
0.007714,0.005292,0.007466,0.01348,0.020076,0.01965,0.02491,0.071582,0.138942,0.101834,0.066565,0.114426,0.111969,0.102942,0.122196,0.14941,0.170042,0.18743,0.190895,0.18716,0.157043,0.100095,0.083153,0.127531,0.132418,0.120184,0.130572,0.088558
