0.031515,0.031227,0.027685,0.029045,0.033162,0.031309,0.027351,0.024262,0.022637,0.026401,0.028286,0.027863,0.028136,0.028578,0.029303,0.029256,0.027251,0.026848,0.02925,0.037125,0.039908,0.033786,0.033384,0.035041,0.035246,0.034001,0.035781,0.041699
0.039029,0.038706,0.03442,0.034897,0.039136,0.037302,0.033079,0.02939,0.027843,0.031887,0.032915,0.032431,0.033607,0.034505,0.034493,0.034096,0.032452,0.032788,0.035663,0.043766,0.046934,0.040581,0.039977,0.041402,0.041387,0.040454,0.042236,0.048434
0.053829,0.05303,0.046603,0.044762,0.048703,0.047215,0.042771,0.037976,0.036634,0.040454,0.039692,0.039488,0.042366,0.04422,0.042547,0.04152,0.041293,0.043323,0.046873,0.054165,0.057577,0.051604,0.050738,0.051094,0.050738,0.051565,0.053272,0.058804
0.070901,0.069047,0.058734,0.054168,0.056884,0.056141,0.051927,0.045607,0.044086,0.047269,0.046102,0.046684,0.050358,0.0528,0.049008,0.048697,0.051706,0.05461,0.057686,0.062149,0.064769,0.061215,0.060809,0.058146,0.05684,0.06195,0.063828,0.066804
0.086333,0.083719,0.069482,0.064028,0.065597,0.06532,0.061089,0.053641,0.051574,0.054127,0.054756,0.056084,0.060136,0.063618,0.05726,0.058211,0.066077,0.067928,0.068946,0.070616,0.072231,0.072887,0.073834,0.066306,0.062603,0.072618,0.076513,0.079606
0.096811,0.094309,0.080487,0.075845,0.074114,0.072057,0.06888,0.062269,0.060781,0.062324,0.063565,0.065718,0.070696,0.076958,0.068819,0.069703,0.080818,0.079109,0.077752,0.078042,0.081012,0.088632,0.090218,0.076982,0.070864,0.083679,0.090724,0.097859
0.098822,0.096266,0.087344,0.083378,0.076796,0.073477,0.072814,0.067137,0.068646,0.06991,0.068418,0.069967,0.0748,0.083306,0.075059,0.075031,0.087347,0.083781,0.08165,0.081505,0.087472,0.100248,0.099365,0.08355,0.078779,0.091584,0.099092,0.110461
0.094341,0.088682,0.084348,0.084571,0.077767,0.073333,0.070778,0.064911,0.071086,0.073582,0.070046,0.069048,0.070101,0.07716,0.070579,0.071011,0.081966,0.079295,0.07822,0.07717,0.085537,0.100946,0.098274,0.083387,0.080508,0.0898,0.093435,0.104513
0.087023,0.079971,0.083261,0.093613,0.089828,0.081367,0.072271,0.065744,0.073168,0.075288,0.072707,0.069763,0.067399,0.069882,0.065315,0.069063,0.076241,0.07312,0.072129,0.072564,0.085147,0.103609,0.098802,0.080312,0.07904,0.085602,0.083078,0.091434
0.084088,0.083273,0.097179,0.114212,0.111824,0.099984,0.083877,0.07492,0.080847,0.081339,0.077546,0.073153,0.07076,0.069039,0.066632,0.074716,0.078931,0.072443,0.068116,0.074045,0.095143,0.115517,0.10497,0.078532,0.079283,0.087634,0.082608,0.091231
0.08956,0.094918,0.112259,0.125976,0.121686,0.109053,0.090927,0.082284,0.088164,0.08764,0.079967,0.072854,0.071189,0.068837,0.069714,0.081092,0.085161,0.077399,0.070573,0.078733,0.101822,0.118333,0.101283,0.072455,0.080044,0.092497,0.08366,0.089635
0.090152,0.097705,0.111484,0.116782,0.109049,0.098193,0.08517,0.079847,0.083004,0.081108,0.075413,0.070463,0.067195,0.064371,0.068511,0.078832,0.082615,0.079895,0.073732,0.076857,0.092843,0.102262,0.084662,0.062388,0.077557,0.092562,0.081719,0.082345
0.085489,0.09133,0.097806,0.097647,0.089453,0.085042,0.079873,0.072445,0.067539,0.063801,0.069217,0.073808,0.067387,0.061565,0.065329,0.071838,0.074782,0.078522,0.074283,0.071081,0.077703,0.078761,0.06436,0.054313,0.077207,0.089835,0.075752,0.073077
0.082785,0.090161,0.091932,0.086628,0.081916,0.084902,0.081673,0.067833,0.058206,0.055259,0.065523,0.076103,0.070797,0.062377,0.06335,0.06839,0.073667,0.081276,0.07965,0.075365,0.07583,0.069646,0.055723,0.053891,0.081059,0.093383,0.080244,0.077359
0.085971,0.099969,0.096973,0.084068,0.09059,0.101082,0.092843,0.073353,0.064569,0.066278,0.070731,0.073822,0.072414,0.068078,0.067803,0.070597,0.077721,0.085346,0.086399,0.084992,0.083605,0.074463,0.059445,0.060939,0.084717,0.09514,0.089921,0.094235
0.098105,0.112399,0.104314,0.085905,0.104291,0.127716,0.115384,0.088043,0.077984,0.08418,0.082056,0.073404,0.079005,0.082828,0.079108,0.078223,0.088542,0.094287,0.091754,0.092856,0.094056,0.085965,0.070975,0.073286,0.092465,0.0979,0.098428,0.111805
0.114213,0.115474,0.109772,0.096183,0.120696,0.155709,0.147015,0.112827,0.091152,0.096497,0.092965,0.076756,0.092577,0.102829,0.091133,0.089042,0.102992,0.10826,0.09932,0.099387,0.103667,0.100803,0.090869,0.093786,0.107606,0.102217,0.100569,0.121233
0.13838,0.118421,0.117828,0.114157,0.141891,0.182366,0.183142,0.145582,0.102328,0.099,0.099033,0.079758,0.103613,0.11758,0.097223,0.098213,0.114466,0.118179,0.111414,0.115844,0.114801,0.1154,0.116515,0.119575,0.126599,0.108527,0.098736,0.120458
0.162292,0.128386,0.125544,0.122861,0.157479,0.200524,0.205127,0.170925,0.112658,0.099541,0.107073,0.087145,0.109429,0.125825,0.099633,0.10056,0.1195,0.120202,0.117506,0.130933,0.122863,0.123989,0.134801,0.138847,0.144112,0.119343,0.103752,0.119054
0.1653,0.132829,0.120637,0.109646,0.145557,0.184772,0.194559,0.180888,0.125844,0.103152,0.112899,0.094646,0.107601,0.122617,0.100808,0.098155,0.113981,0.113555,0.114216,0.131803,0.120939,0.120649,0.13369,0.137219,0.142629,0.119733,0.102757,0.108084
0.147336,0.134985,0.118889,0.094883,0.112894,0.141545,0.158953,0.172385,0.138427,0.109528,0.111252,0.09346,0.098576,0.114628,0.103097,0.090911,0.095913,0.10294,0.114567,0.127391,0.117988,0.11285,0.117086,0.116713,0.115102,0.103292,0.098168,0.097661
0.123045,0.140254,0.137713,0.113818,0.107526,0.111111,0.126204,0.159293,0.149659,0.115286,0.098832,0.0837,0.094643,0.114791,0.110776,0.092532,0.089501,0.105252,0.125451,0.13749,0.131088,0.110933,0.104469,0.10354,0.091635,0.091195,0.104251,0.102134
0.11404,0.156716,0.166402,0.144797,0.129051,0.117457,0.123287,0.156843,0.163983,0.124444,0.091328,0.08308,0.103945,0.135557,0.137041,0.109071,0.100562,0.117196,0.133194,0.14736,0.142785,0.109882,0.098289,0.102368,0.096388,0.109446,0.126286,0.116336
0.11234,0.164479,0.174973,0.156775,0.142555,0.126318,0.118866,0.144484,0.166635,0.13539,0.098375,0.094372,0.118444,0.156508,0.161851,0.121406,0.107249,0.1264,0.139398,0.148489,0.137242,0.103173,0.092334,0.099732,0.102703,0.126851,0.138548,0.12388
0.104891,0.145306,0.150439,0.138684,0.128457,0.111809,0.093766,0.108603,0.14301,0.132652,0.099471,0.099563,0.120057,0.149747,0.164049,0.123547,0.103084,0.124848,0.138262,0.134553,0.115423,0.095481,0.087898,0.090958,0.098112,0.126302,0.129753,0.117635
0.090627,0.114238,0.111927,0.106377,0.099899,0.081856,0.063862,0.071661,0.107285,0.110279,0.086954,0.093041,0.100819,0.112544,0.137205,0.113437,0.08662,0.10569,0.119817,0.108407,0.095617,0.090508,0.081972,0.074708,0.078157,0.102311,0.105675,0.104428
0.07112,0.087,0.085415,0.080024,0.072295,0.062221,0.052621,0.049693,0.070736,0.07477,0.065779,0.075124,0.073825,0.074676,0.094395,0.083795,0.05976,0.074304,0.087157,0.080828,0.08126,0.080051,0.067894,0.057547,0.061172,0.070983,0.070394,0.07955
0.052081,0.05939,0.065432,0.0652,0.059774,0.060377,0.053354,0.041305,0.048476,0.052636,0.051144,0.053556,0.05212,0.056038,0.060683,0.050759,0.04071,0.053613,0.060397,0.059353,0.06294,0.058132,0.046336,0.044811,0.056104,0.051984,0.041168,0.050392
0.042851,0.044978,0.050806,0.04995,0.051632,0.057056,0.047802,0.037324,0.040086,0.043099,0.044612,0.043461,0.04125,0.04554,0.047058,0.038002,0.033436,0.041568,0.042375,0.044788,0.043525,0.035269,0.031881,0.039505,0.050805,0.040831,0.028218,0.034387
0.040715,0.045277,0.050742,0.046459,0.048021,0.047004,0.036944,0.034911,0.039095,0.03901,0.038846,0.044175,0.04658,0.046743,0.04408,0.037105,0.037654,0.036468,0.028717,0.032045,0.034438,0.033162,0.035682,0.04381,0.048714,0.035361,0.024014,0.031355
0.045933,0.05567,0.06127,0.052515,0.04627,0.041868,0.037354,0.03794,0.045342,0.04301,0.034157,0.045129,0.057785,0.05689,0.047888,0.042033,0.048906,0.04254,0.025335,0.026072,0.03646,0.042978,0.047151,0.055978,0.054339,0.036671,0.027612,0.038172
0.051874,0.064371,0.068575,0.055472,0.043521,0.04271,0.043946,0.042754,0.049343,0.045953,0.036102,0.049398,0.06638,0.066127,0.051755,0.046933,0.058651,0.051361,0.028474,0.027941,0.041703,0.049929,0.055446,0.064407,0.060632,0.041724,0.033225,0.044952
0.049276,0.06075,0.062078,0.049316,0.040233,0.042935,0.04542,0.042359,0.043903,0.039931,0.035333,0.047398,0.061897,0.062469,0.045916,0.043864,0.057208,0.052292,0.029451,0.026847,0.040113,0.046846,0.0527,0.059563,0.055129,0.040056,0.033948,0.043582
0.036735,0.044837,0.044047,0.037343,0.036144,0.038731,0.043357,0.04093,0.032712,0.027402,0.02906,0.036633,0.043585,0.044848,0.033549,0.035886,0.044783,0.043982,0.028706,0.023237,0.03174,0.034919,0.038941,0.042354,0.039119,0.03333,0.03181,0.03442
0.025952,0.030889,0.030939,0.030421,0.032174,0.03376,0.04306,0.043145,0.029792,0.023148,0.025797,0.025268,0.023082,0.025221,0.025769,0.032033,0.031258,0.0322,0.027942,0.02189,0.024966,0.023833,0.024606,0.026131,0.025694,0.02905,0.030077,0.02361
0.025022,0.025734,0.025078,0.030374,0.031968,0.027923,0.039668,0.041902,0.031406,0.026458,0.026211,0.019586,0.012735,0.016512,0.021765,0.028219,0.025362,0.024921,0.026117,0.022835,0.020308,0.017128,0.016226,0.01792,0.021493,0.026465,0.02491,0.016952
0.028259,0.028843,0.027761,0.033727,0.032411,0.024039,0.031935,0.032397,0.027416,0.026344,0.023914,0.016636,0.012434,0.016166,0.018845,0.022305,0.021474,0.021131,0.024393,0.022135,0.016356,0.014531,0.012246,0.012932,0.019444,0.022824,0.017248,0.01228
0.027925,0.03052,0.03206,0.035289,0.03338,0.022669,0.021483,0.01911,0.018932,0.022372,0.020252,0.016079,0.015654,0.017025,0.017146,0.016997,0.016034,0.020509,0.025616,0.020508,0.014092,0.014105,0.011847,0.011369,0.016678,0.01791,0.012322,0.009564
0.025397,0.029063,0.031539,0.030521,0.031987,0.021558,0.012616,0.01088,0.013283,0.021028,0.020101,0.016942,0.019081,0.017581,0.015974,0.015153,0.011642,0.017403,0.02588,0.019898,0.0119,0.013917,0.014193,0.013542,0.017913,0.01697,0.012183,0.008775
0.023148,0.025867,0.025481,0.021129,0.027242,0.020271,0.009241,0.010155,0.014462,0.02193,0.019387,0.015995,0.019847,0.019601,0.016989,0.015084,0.01096,0.013962,0.023834,0.018685,0.012032,0.016026,0.017122,0.016351,0.020508,0.020682,0.015446,0.008073
