-6e-04,-0.001122,-0.000943,-0.000703,-0.001111,-0.001196,-0.001936,-0.002495,-0.001525,-0.000417,-0.002462,-0.001127,-0.002733,-0.001314,-0.001391,-0.000927,-0.001329,-0.000195,-0.000666,-0.002135,-0.002587,-0.003693,-0.006854,-0.003659,-0.002262,-0.001457,-0.003365,-0.004194,-0.002711,-0.005586,-0.00495,-0.007064,-0.003765,-0.003001,-0.004533,-0.005744,-0.006694,-0.004625,-0.003554,-0.004042,-0.004334,-0.005127,-0.005141,-0.004494,-0.00328,-0.004385,-0.004814,-0.00683,-0.00498,-0.007903,-0.004568,-0.002296,-0.006066,-0.003892,-0.004926,-0.005137,-0.004938,-0.004035,-0.004053,-0.006104,-0.006281,-0.00642,-0.00416,-0.002469,-0.005346,-0.004724,-0.002529,-0.004655,-0.003895,-0.00389,-0.006194,-0.00517,-0.005802,-0.004072,-0.004242,-0.005935,-0.004861,-0.003133,-0.004536,-0.004099,-0.002627,-0.000888,-0.001877,-0.003218,-0.003846,-0.00272,-0.00616,-0.00472,-0.005427,-0.003078,-0.003076,-0.006003,-0.009058,-0.006394,-0.005476,-0.004293,-0.005277,-0.001904,-0.003698,-0.005879,-0.005471,-0.003382,-0.003472,-0.004842,-0.007507,-0.007186,-0.006658,-0.006959,-0.007303,-0.006214,-0.004448,-0.006784,-0.004626,-0.004434,-0.007021,-0.004187,-0.001446,-0.004258,-0.006036,-0.006827,-0.006564
0.000395,0.000258,-0.000172,-0.000382,0.000309,0.000429,0.000736,0.000362,0.000854,-2.5e-05,-4.6e-05,-0.000215,0.001219,0.000684,0.000441,-9.2e-05,-0.00077,-0.000108,-3e-05,0.001962,0.00038,0.00225,0.001487,-0.001004,-0.001135,-0.003501,-0.001304,0.000124,-0.002301,0.00042,0.003503,0.003692,-0.000665,-0.000214,0.000143,-0.001073,0.00105,0.000819,-0.000216,-0.000179,-0.002209,-0.002493,-0.002324,-0.002416,-0.003213,-0.002377,0.000787,0.001413,-0.000439,-0.001722,-0.00279,-0.005182,6e-04,-0.001244,-0.001647,0.000819,0.001382,0.000712,-0.001177,0.000463,-0.000729,-0.000586,-0.000252,6.5e-05,0.000701,-0.000925,-0.00197,-0.000973,-0.001829,0.001102,0.000826,-0.002506,0.000512,-0.000106,-0.000455,0.00117,0.000784,0.00086,-0.000802,-0.000449,-0.000908,-0.003774,-0.005525,-0.003236,-0.006069,-0.004937,0.001666,0.001144,0.003101,0.001087,-0.001031,0.001643,0.002962,0.000925,0.001558,0.002982,-0.004027,-0.006173,-0.002314,-0.001383,-0.000244,-0.003997,-0.002377,-0.001188,0.004177,0.001854,-0.001222,0.00252,0.000555,-0.006401,-0.0053,-0.00272,-0.002889,-0.003731,0.003388,0.00082,-0.004902,-0.004313,-0.000853,-0.00293,-0.001614
-0.000597,-0.000445,-0.000384,-0.000353,-0.000809,-0.000726,-0.00055,6.8e-05,-0.00084,-0.00039,-0.000325,-0.000712,-0.000399,-0.000125,-0.001038,-0.000401,-6.4e-05,-0.000437,-0.00041,-0.00101,-0.000747,-0.001629,-0.001469,1.1e-05,0.000222,-0.000119,-0.000285,-2e-05,0.001397,0.000273,-0.003881,-0.003619,-0.002221,0.000155,-0.001271,-0.002359,-0.001957,-0.001338,0.000302,-0.000437,0.001888,0.000339,0.000797,0.001612,-0.000487,0.000745,-0.000125,-0.001091,0.001688,0.000945,0.001059,0.000473,-0.001882,0.000849,0.000734,-0.000449,0.00024,-0.000938,0.00166,-0.000686,-0.000232,0.000845,0.000573,0.000201,-0.001433,-0.001323,0.001226,0.001473,0.000219,-0.000156,0.001213,0.000927,6.1e-05,-0.001124,-0.001204,0.000858,-0.00198,-2e-05,0.000793,-0.000105,0.000651,0.002477,0.003143,0.001843,0.001863,0.000926,-0.000668,5.5e-05,-0.003568,-0.001848,-0.002136,-0.00094,0.000621,-0.000322,-0.00143,-0.001817,0.001041,0.002416,-0.001051,-0.000986,-0.000126,0.001818,0.000494,0.004175,-0.005222,-0.002658,0.002259,-0.001578,0.000912,0.003787,0.002412,0.004026,0.001671,0.002809,-0.002614,0.00021,0.001189,-0.000436,-0.000776,0.00187,0.002161
0.000271,0.000478,0.000904,0.00084,0.00059,0.000157,0.000142,0.000906,0.000742,-0.00025,0.000601,0.00059,-0.000272,-5e-05,-7.8e-05,0.000129,0.00071,-0.000184,-0.000273,0.00059,-0.000316,0.002285,0.002249,0.00283,0.002621,0.004214,0.00183,0.001064,0.001231,0.000923,0.003094,0.002805,0.003175,0.00111,0.001878,0.005989,0.004087,0.002717,-0.000111,0.002227,0.00022,0.000367,0.002958,0.001796,0.003371,0.004951,0.001659,0.000153,0.000444,0.000986,0.002335,0.001537,0.005017,0.000534,0.000786,0.000701,-0.000487,0.001147,-0.000296,7.1e-05,0.002862,0.000503,0.00158,0.001453,0.000996,0.000738,-0.000493,0.000172,0.000729,0.001103,-0.000537,0.001595,0.001152,0.001433,0.001358,-0.001417,0.001005,-0.000875,0.000357,0.001251,0.001531,0.000737,0.001554,-0.000877,0.00175,0.002875,0.00206,0.000824,0.001044,0.001274,0.000782,0.001479,0.000771,0.000268,0.00039,0.002274,0.003466,0.002716,0.001102,0.003352,0.001563,0.000704,-0.000898,-0.003336,0.003258,0.003971,0.001793,0.000877,-0.000162,-0.000813,0.000514,-0.001587,-0.000695,0.000958,0.001646,-0.000553,0.002588,0.003855,0.00204,0.002202,-0.000371
-0.000689,-0.000611,-0.000304,-0.000214,-0.00029,7.7e-05,-0.000264,-0.001095,-0.001195,-0.000145,-0.000142,0.000255,0.00018,-0.000153,0.00018,-6.6e-05,-0.000328,-0.00041,-0.000601,0.000586,0.002447,-0.001285,-0.002802,-0.003535,-0.002383,-0.00215,-0.002849,-0.001962,-0.001825,-0.002625,-0.002472,-0.002233,-0.002156,-0.001765,-0.000852,-0.005183,-0.002828,-0.001823,0.001379,-0.000372,-0.000699,-0.000353,-0.003478,-0.00072,-0.003509,-0.00466,-0.004321,0.000398,-0.000283,-0.000597,-0.001778,-0.000304,-0.002515,-0.001602,-0.001002,7e-06,-0.000598,-0.000612,0.000146,-0.001896,-0.002976,-0.000416,-0.001552,-0.001753,-0.000239,0.000137,-0.000651,-0.000441,-0.000588,-0.001599,-0.000719,-0.000604,-0.000781,0.000222,-0.002261,0.00039,-0.001204,0.000843,-0.000346,-0.000214,-0.002456,-0.002311,-0.002624,-0.001529,-0.000662,-0.001417,-0.002044,-0.002541,-0.000469,-0.000962,0.001236,-0.000311,-0.000801,-0.001136,-0.001636,-0.002651,-0.003807,-0.003486,-0.000792,-0.0017,-0.000436,-0.000255,-0.000522,0.001401,-0.000939,-0.002502,-0.002396,-0.000173,-0.00052,0.000262,0.001117,0.000702,0.00037,0.000163,-0.002375,-0.001001,-0.001792,-0.002466,-0.000601,-0.0025,0.000831
0.000406,0.000391,0.000245,-0.000574,9.4e-05,-0.000149,0.000657,0.000727,0.000743,0.000699,0.000159,-6.4e-05,8e-05,-0.000288,-0.000188,-5.2e-05,6.6e-05,-0.000134,-2.9e-05,-0.00076,-0.001882,0.000653,0.001709,0.001322,-0.000812,-0.000319,0.001367,0.000852,0.000722,0.001421,0.002055,0.001605,0.002038,0.000543,0.00044,0.001867,0.000119,-0.000344,-0.000914,-0.000625,-0.000271,-0.001701,-0.000622,-0.002172,0.000246,0.000263,0.002915,0.000607,-0.000517,0.000752,-0.000666,-0.000382,-0.00176,0.001584,0.001305,-0.001077,0.000247,9.8e-05,0.000471,0.003133,0.000502,-0.00157,-0.002228,-0.000576,-1.6e-05,0.000989,-0.000231,-0.000381,0.000299,0.000912,0.00026,-0.000154,0.000535,0.000513,0.001544,0.00116,0.001858,6.7e-05,0.000409,-0.00059,0.000621,2e-04,0.001157,0.001966,-0.000408,-0.001885,0.000546,0.002708,0.001706,0.000179,-0.000238,0.000241,0.000605,0.001486,0.000599,0.00065,0.001801,0.001324,0.001857,9.5e-05,-0.000263,0.000863,0.002614,0.00036,0.000204,0.001193,0.00093,-0.000768,0.000943,0.000137,-0.002389,-0.00074,0.001293,-0.000806,0.000498,-0.000714,0.000893,-0.00025,-0.001729,0.001323,-0.001223
-5.9e-05,-0.000305,-0.000241,0.00038,1e-04,1.9e-05,-0.000497,-0.000695,-0.000224,-0.000105,-0.00059,-0.000298,-0.000233,0.00032,-0.000163,3e-06,-0.000111,0.000179,0.000176,-0.000192,0.000662,2.7e-05,-0.001148,0.000373,0.001221,0.00086,0.000936,0.00055,-0.000228,0.000111,-0.000799,-0.00164,-0.001941,0.001308,0.00022,0.000141,-0.00056,8e-05,0.000678,0.00085,0.001288,0.001966,0.000947,0.002763,0.000919,0.000966,-0.000926,-0.001104,0.000276,-0.001069,0.001013,0.001337,0.001497,4.6e-05,-0.00041,0.001476,-5.8e-05,-0.000205,-0.000527,-0.002161,0.000178,0.001752,0.002737,0.000992,-0.000136,-0.002234,0.000586,0.000664,5e-05,-0.000351,-0.000829,0.000346,-0.000243,-0.001437,0.000452,-0.001154,-0.000927,-0.001084,-0.001044,0.001259,0.000885,0.000841,0.000345,-0.001915,-0.000112,0.001251,0.000189,-0.002668,-0.001257,6.8e-05,0.000112,-0.000359,5.3e-05,6.7e-05,0.00061,-0.000884,-0.001573,0.000695,-0.001823,-0.000158,0.000589,-0.000531,-0.001403,-0.001262,-9e-06,-0.001777,-0.000581,0.001598,-0.001799,-0.000142,0.001996,2.3e-05,-0.001055,0.000342,0.001075,0.002833,-0.000322,0.001855,0.002251,0.000488,5.6e-05
0.000198,0.000363,0.000113,-0.000199,-4e-06,1.8e-05,0.000442,0.000371,-0.000118,-4.9e-05,9.7e-05,0.000322,-6.2e-05,-0.000313,0.000206,0.000298,1e-04,0.000129,8e-05,3e-06,-0.00017,-0.000707,0.000477,0.000202,0.000101,-0.00043,-0.001541,-1.7e-05,-2.2e-05,-0.000146,0.00059,0.001727,0.000991,-0.000172,-0.000514,-0.000421,0.001865,0.000791,-0.000338,-0.000519,-0.001094,-0.000579,-5.5e-05,-0.000921,-0.001409,-0.000225,-8.6e-05,0.000971,0.000337,-0.000123,-0.000826,2.8e-05,-3e-05,-0.001308,-0.000604,-0.001062,-0.001016,-0.001098,-0.000424,-1e-05,-0.000685,-0.000684,-0.001474,-0.000425,0.001205,0.001715,0.000934,-0.000488,-0.000864,-0.000686,0.000945,-0.000319,-0.000373,1.3e-05,-0.001455,-0.000272,0.000648,-0.000187,0.000346,-0.00088,-0.000719,-0.001187,-0.000698,0.000269,-0.000716,-0.000296,-0.000147,0.000884,0.001094,0.000715,-0.000449,-0.000123,-0.000656,-0.001224,-0.000428,0.00111,0.001265,-0.000823,-0.000253,-0.000633,-0.000289,7.7e-05,-0.001294,-0.000723,-0.000179,0.002289,0.000447,-0.000612,0.001572,-3e-06,8.1e-05,0.000995,-0.00069,0.000209,-0.00055,-0.002102,-0.000773,-0.000202,-0.000143,-0.00165,0.000406
-2.6e-05,-2.5e-05,-0.000123,-2.2e-05,-0.000255,-1.2e-05,-0.000475,9e-06,-0.000105,-0.000214,0.000324,-4.1e-05,0.00019,-0.000148,-8.9e-05,-0.000146,-0.000254,-0.000444,-4.5e-05,0.000509,-6.4e-05,-0.000205,8e-06,-0.000506,-0.000493,-0.00041,5.8e-05,0.000173,0.000322,-2.3e-05,-1.5e-05,-0.000891,-0.000438,-0.001248,0.000282,-0.000136,-0.001956,-8.3e-05,-0.000631,-4.9e-05,-0.000198,-0.000269,0.000542,-0.00047,-0.00011,5.1e-05,0.000258,-0.001073,-7.1e-05,-0.00015,0.000469,-0.001736,-0.000737,0.001461,0.001229,-0.000262,0.001412,0.000716,0.000651,0.000482,0.000789,-0.00053,0.00063,-0.00027,-0.000741,-0.000443,-0.000133,0.00013,0.001204,0.000147,-0.000475,0.000312,0.000747,0.000622,0.001322,-0.000272,-0.000348,-5.7e-05,0.000752,-0.00011,-0.000387,0.000412,-6.6e-05,0.002349,0.000118,0.000203,-0.000253,0.000149,-0.000194,-9.8e-05,-0.00011,0.000917,0.000306,0.001215,0.00072,-7.3e-05,-0.000765,-0.000545,0.001437,0.00134,0.000145,-0.000219,0.001286,0.00121,0.001435,-0.000606,-0.000312,-0.00028,-0.00048,0.000405,-0.001425,-0.001087,0.00169,-0.000276,-0.000264,0.000837,0.000536,-0.000641,-0.000732,0.000492,-0.000146
7.3e-05,3e-06,-0.000135,4.1e-05,3.3e-05,0.000112,7.6e-05,-0.000146,0.000126,0.000247,3.6e-05,1.6e-05,0.000101,0.000168,2.7e-05,-7.1e-05,0.000196,2.1e-05,0.000314,-8e-06,-0.000325,0.001109,-0.000177,0.000777,0.000297,-0.000149,0.000305,0.000178,0.000378,0.000288,-0.000978,-0.000164,0.000705,0.000931,0.000631,-0.000169,0.000887,-0.000569,0.00018,0.000141,0.00073,0.000169,-0.000604,-0.000357,-0.000179,0.000313,5.7e-05,0.000725,-0.000819,0.001105,0.000218,0.000515,0.000198,0.000257,-0.001414,0.000682,-0.000545,0.000148,-0.000338,-0.00022,0.00071,0.000337,-6.5e-05,0.000326,-6.2e-05,0.000205,-0.001002,0.000526,-4e-06,5.1e-05,-5.4e-05,-0.000179,-0.000561,-0.000251,-0.00103,0.000561,8.6e-05,0.000505,-0.000866,-0.000224,-0.000107,0.000371,-0.000116,-0.000966,0.000675,-3.4e-05,-0.000112,-0.00017,-4.5e-05,-0.000538,-0.00019,-0.000479,-0.000205,-0.000353,-0.000935,0.00032,0.000817,0.001233,-0.000686,8.1e-05,-0.000784,-0.000353,-0.000385,-0.000378,-0.000968,0.00046,1e-06,0.000874,0.000544,-0.000699,0.000613,0.000809,-0.000999,-2.6e-05,0.000409,-0.00066,0.000203,0.000323,0.000256,5.7e-05,0.000399
-8.7e-05,-0.000142,-3.7e-05,2e-05,0.000157,7.7e-05,0.000152,-0.000112,1.9e-05,-0.000278,-0.000149,8.8e-05,-0.000415,-0.000169,8.4e-05,-0.000469,-0.000154,0.00021,-0.000127,0.000269,-0.000154,-0.000431,-6.6e-05,-0.000888,0.000121,0.000957,0.000202,-0.000532,-0.000424,-0.000295,-4.1e-05,-0.000293,-2.7e-05,-0.000817,-0.000405,6.4e-05,5.6e-05,0.000544,0.000837,-0.000424,-0.000579,-1.3e-05,0.000468,0.001171,0.000791,0.000279,-0.000763,-0.000225,0.00075,-0.001056,-6e-04,0.000871,-0.000101,-0.001476,0.000817,-0.000121,-0.000546,-0.000332,0.000121,0.000556,-0.000877,0.000466,-5.8e-05,0.000644,3.8e-05,2.7e-05,0.000299,-0.000595,-0.00023,0.000318,0.000117,-0.000143,0.000286,-0.000498,0.001115,-9.9e-05,0.000294,-4.6e-05,0.000672,1.4e-05,0.000163,-0.000144,0.000181,-0.000645,-0.000844,9.2e-05,-0.000107,-0.000414,-0.000265,-0.000159,0.000275,-0.000212,8.3e-05,0.000362,5.5e-05,0.000425,-0.000167,-0.000419,-0.000543,-0.001056,0.00082,0.000435,-0.000148,0.000659,0.000591,-0.000798,0.000244,-0.000893,-0.000734,0.000381,-0.000298,8e-05,0.000124,0.000199,0.000463,4.7e-05,0.000452,-0.000421,0.000178,8e-05,-0.000177
2.9e-05,-1.3e-05,4.2e-05,-6.2e-05,-5.5e-05,9e-06,-0.000184,0.000149,-2.4e-05,9.9e-05,0.000113,-0.000201,0.000239,-2.7e-05,-1e-04,0.000308,0.000175,-3.7e-05,-8.1e-05,4.1e-05,0.000258,6.4e-05,0.000152,0.000452,-0.000344,-0.000517,-4.4e-05,-0.000159,-5.3e-05,8.4e-05,0.000733,0.000654,-0.000145,0.000976,-0.000486,0.000262,-0.000374,-9e-05,-0.000683,3.1e-05,0.000444,-0.000198,-0.000241,-0.000955,-0.000655,-0.000102,0.000112,4.7e-05,-6.9e-05,0.000617,0.000442,-0.001077,0.000293,0.000334,-0.000291,-0.000131,0.000292,0.000616,-4.6e-05,-0.000511,-6.6e-05,-0.000234,0.000141,-0.000373,0.000229,0.000136,0.000265,0.000299,-0.000161,-0.000273,-1.5e-05,3e-04,-6.1e-05,0.000593,-4e-05,0.000523,0.00033,0.000163,-0.000504,0.000254,-9.4e-05,-0.000247,-0.000257,0.000796,0.000679,-7.7e-05,-0.000271,0.000548,8.9e-05,0.000175,3e-06,-6.1e-05,-0.000339,-0.000497,0.00044,-0.000982,-0.000235,0.000737,0.000384,0.000497,-0.000276,-8e-05,0.00024,-0.000182,2.2e-05,7.6e-05,-0.000121,0.000709,1.1e-05,0.000243,0.000117,-0.000219,0.000141,-0.000487,-0.000321,-0.000613,-0.000788,4.8e-05,-0.000356,1.8e-05,0.000391
-1.5e-05,8e-05,8.6e-05,0.000151,3.6e-05,-0.000168,8.5e-05,-1.6e-05,-0.000102,-5.6e-05,-0.000195,6.8e-05,5e-06,0.000183,5.8e-05,7.5e-05,-0.000206,-7.3e-05,0.000129,-0.000274,4.7e-05,-0.000145,9.9e-05,-0.000112,-0.000123,0.000224,-0.000142,0.000674,-0.000193,-7.9e-05,-0.000459,-0.000196,-0.000154,-0.000785,0.000158,5.3e-05,0.000146,-0.000104,0.000253,0.000122,-0.000213,-7.3e-05,-9.2e-05,0.000265,0.00015,0.000189,0.000365,7e-05,-3.5e-05,-0.000426,-0.000119,0.00052,-8.3e-05,0.000517,0.000625,0.000174,0.000243,-0.000254,-0.000421,0.000333,0.00015,0.000149,-8.1e-05,0.000151,-0.000465,-0.000168,8.9e-05,-0.000149,0.000225,0.000371,-0.000167,-0.000465,-2e-06,-4.2e-05,-0.000422,-0.00048,-0.000547,-2.3e-05,0.000287,-6.1e-05,0.000219,0.000175,0.000109,6e-06,0.000619,7.3e-05,0.000806,9.3e-05,-0.00033,8e-06,0.00032,0.000288,0.000286,0.000226,-0.000112,0.000305,-7e-05,-0.000708,0.000169,0.000151,0.000114,-0.000181,3.3e-05,-0.000687,-0.000681,0.000253,-0.000206,-0.000458,0.000647,-0.00033,2.5e-05,-7.6e-05,-5.5e-05,0.000576,0,0.000841,0.000838,0.00045,8.8e-05,-0.000249,-0.000709
-2.4e-05,-7.9e-05,8e-05,-0.000107,-4.9e-05,-7e-06,-6.5e-05,0.000149,7.5e-05,-3e-05,3.2e-05,2.7e-05,-8e-06,8.5e-05,6.2e-05,-8e-05,-2.5e-05,-2e-05,7.7e-05,-9.7e-05,9.2e-05,-8.4e-05,-7.9e-05,-0.00013,0.000258,-3.2e-05,0.00013,-0.000158,-1.5e-05,0.00011,2e-06,-0.000292,-5.2e-05,0.00015,0.000131,-0.000264,4.5e-05,5.9e-05,-7.9e-05,0.000211,0.000108,0.000296,0.000359,-0.00047,0.00016,0.000129,-3.7e-05,0.000516,0.000375,0.000457,0.000195,-0.000126,0.000311,-0.000125,-0.000496,-0.000332,-0.00015,-0.000104,-0.000106,-0.000317,-4.1e-05,-7.6e-05,1.7e-05,-0.000411,2.2e-05,3.3e-05,-0.000324,-8.9e-05,-9.8e-05,-0.000379,0.000173,-1e-06,6.6e-05,-0.000209,-2e-06,6.9e-05,0.00016,-0.000153,-0.000147,-0.000315,-0.000164,0.000151,0.000103,-0.000298,-0.000664,0.000137,-0.000387,-0.000627,0.000164,-1e-05,-0.000417,-0.000242,-7e-05,-0.000111,-7.4e-05,-6.1e-05,-0.000212,0.000207,-0.000717,-0.000232,0.000128,7.7e-05,0.000275,0.000183,5.6e-05,-0.000561,-4.6e-05,0.000224,-0.00082,0.000114,-7.7e-05,-0.000227,0.000152,-0.000442,0.000254,-0.000501,-0.000771,-0.00019,-0.000144,0.000651,0.000433
3.6e-05,1.5e-05,-3.9e-05,4.2e-05,7.5e-05,5.5e-05,0.000124,-0.000151,7.2e-05,-3.9e-05,-5.2e-05,-2.3e-05,-9.9e-05,-0.000143,-5.8e-05,0.000133,2.6e-05,-4.5e-05,-5.7e-05,6e-05,-0.000116,0.000155,-0.000286,7.9e-05,-0.00019,-1e-04,-3.2e-05,-0.000382,5e-06,1.6e-05,0.000213,0.000526,6.4e-05,-0.000171,-1.4e-05,0.000216,-3.1e-05,8e-06,0.000317,-4e-05,2e-05,-2e-04,-0.00021,0.00011,-0.000282,-4.2e-05,-0.000126,-0.000424,-0.000487,-0.000497,-0.000255,2e-06,7.3e-05,-0.000445,0.000249,0.000277,9.1e-05,0.000169,0.000182,3e-04,0.000195,-0.000512,0.000222,0.00021,0.000212,-0.000225,-3.5e-05,0.000259,-6.6e-05,0.000251,8e-05,2.6e-05,-6.2e-05,-0.000103,0.00035,0.000259,-5.2e-05,5e-05,3e-06,0.000376,0.000106,3e-05,-8.2e-05,0.000163,0.00019,-0.00028,-4.7e-05,0.000263,-0.000167,-3.9e-05,0.00032,4.6e-05,-0.000227,0.000193,-1e-05,0.00012,0.000196,-0.000207,0.000358,0.000267,-0.00036,0.000283,-0.000518,0.000277,1.7e-05,0.000429,-0.00011,-0.000276,0.000491,-0.000266,2.1e-05,8.6e-05,-0.000379,0.000254,-1.1e-05,0.000173,0.000449,-2.2e-05,4.4e-05,-0.000426,-0.00027
-4.4e-05,6.1e-05,-7.6e-05,-8e-06,1e-06,4e-06,-6.4e-05,-5e-05,-2.8e-05,0.000113,0.000128,2.2e-05,0.000108,1e-06,3.5e-05,-0.000111,8.6e-05,8.6e-05,-7e-06,-4.2e-05,3e-05,-0.000286,0.000239,-8.2e-05,0.000175,-2.7e-05,-0.000142,-4.5e-05,0.00018,1.7e-05,-4.8e-05,-0.000233,-0.000104,0.000285,7.7e-05,8.5e-05,0.000128,-0.000132,-0.000393,-9.4e-05,5.5e-05,9.3e-05,8.4e-05,0.000289,0.000106,-9.6e-05,-1.4e-05,1.7e-05,-3e-06,0.000385,0.000148,0.000319,-0.000478,0.000124,-0.000279,2.4e-05,-9.7e-05,-0.000107,1.6e-05,-0.000117,-0.000181,0.000516,-0.000366,0.00016,-0.000114,0.000201,-6.4e-05,-0.000217,0.000124,-3.7e-05,-0.000172,-9e-06,7.5e-05,0.00018,-0.000141,-0.000289,-0.00029,3.8e-05,8e-05,-0.000165,-3.4e-05,-1.8e-05,7e-06,0.000345,-0.000111,0.000153,4.5e-05,0.000452,8.2e-05,-6e-05,-0.000212,0.000188,0.000268,-0.000175,0.000101,0.000245,-1e-05,0.000112,0.000208,-6.5e-05,-9.8e-05,-0.000156,0.000285,-4.5e-05,8.1e-05,-0.000321,0.00025,0.000255,-0.00024,0.00029,0.000244,3.8e-05,0.000464,2.4e-05,9.1e-05,-0.000174,-3.5e-05,-1e-04,0.000214,4.2e-05,0.000189
1.9e-05,-0.000101,-1e-05,-1.1e-05,-4e-05,-2.8e-05,2.3e-05,2.3e-05,-4.2e-05,-0.000101,-3.6e-05,2.3e-05,-5.5e-05,7e-06,-6e-06,0.000101,4.4e-05,-4.6e-05,8e-06,-9e-06,-0.000184,0.00018,-8.9e-05,-9.5e-05,-9.4e-05,-3.6e-05,7.4e-05,8.7e-05,4.3e-05,1.1e-05,-1.4e-05,-0.000128,6.8e-05,1.2e-05,-0.000133,-6.8e-05,-5.3e-05,9.9e-05,7e-05,1.2e-05,-0.000153,-9e-06,-3.4e-05,0.000105,8e-06,-4.3e-05,0.000164,0.000214,-4.1e-05,-0.000248,-6.1e-05,-0.000282,7.1e-05,0.000165,0.000143,-0.000146,6.7e-05,2.4e-05,0.000124,1.2e-05,3e-06,-0.000142,0.000146,-0.000179,0.000113,-4.7e-05,0.000233,0.000122,1.3e-05,-0.000107,0.000151,5.9e-05,-0.000128,-1.6e-05,6e-06,0.000179,0.000186,6e-06,-0.000137,-1.7e-05,-6.2e-05,-2.5e-05,-1.1e-05,-0.000444,-7.4e-05,-0.000109,3.6e-05,-0.000132,-5.8e-05,0.000129,4.3e-05,-2e-04,-2.5e-05,5.9e-05,2.3e-05,-0.000303,0.000107,-1.5e-05,3.3e-05,3.8e-05,0.000359,-4e-06,0.000101,2.8e-05,-8.3e-05,3.5e-05,-2.9e-05,-9.9e-05,1.8e-05,-0.000175,-0.000261,1.1e-05,-0.000209,-0.000192,-8.8e-05,0.000258,8e-05,-4.1e-05,-0.000156,-9.5e-05,-0.000127
-5e-06,6.9e-05,-2e-06,3e-06,2.6e-05,2.8e-05,3.4e-05,0,-3e-06,8.8e-05,5e-06,-4.1e-05,1e-06,2.3e-05,-1e-06,5.6e-05,-4e-06,-1.4e-05,2.4e-05,7.6e-05,6.4e-05,2.1e-05,2.3e-05,0.000125,2e-06,5.9e-05,1.2e-05,0.000168,-0.00015,-7.2e-05,4e-06,0.000193,-4e-06,-5.4e-05,0.000141,5.8e-05,-0.000124,7e-06,-6.4e-05,-5.9e-05,0.000154,-2.9e-05,-1e-04,-0.000236,7.5e-05,2.9e-05,5.1e-05,-0.000192,0.000159,0.000104,1.8e-05,8.2e-05,0.000108,-4.8e-05,-9e-05,0.000141,-0.000116,6.3e-05,-4.5e-05,9e-05,-7.6e-05,4e-06,-5.4e-05,7.1e-05,-6e-06,-2.5e-05,-3.2e-05,-5.7e-05,-1.2e-05,8.4e-05,-0.000113,-1.6e-05,9.8e-05,-0.000108,-0.000214,-0.00015,2.8e-05,2.9e-05,0.000127,6.4e-05,0.000142,2.2e-05,4.4e-05,-0.000142,0.000147,-2.8e-05,0.000117,-0.000286,0.000144,7.9e-05,3.4e-05,0,7.3e-05,-8.2e-05,-3.9e-05,2.2e-05,-1.6e-05,9e-05,-0.000208,-7.4e-05,-0.000215,-0.000162,-0.00017,6.2e-05,2.4e-05,6.5e-05,5.7e-05,-1.3e-05,0.000112,9e-05,0.000144,6.7e-05,-9.2e-05,0.000138,-3.9e-05,0.000131,9.7e-05,6.1e-05,-5.9e-05,4.5e-05,5.8e-05
4e-06,-8e-06,-8e-06,1.3e-05,-1e-06,-1.9e-05,-4.4e-05,4.4e-05,3.9e-05,-7e-05,-1e-05,-3e-06,1e-05,-1e-06,1.7e-05,-6.6e-05,-1.4e-05,-2.3e-05,-5e-06,-2.5e-05,-4.5e-05,2.2e-05,1.4e-05,-8.3e-05,-7e-06,6e-05,8.1e-05,-6.9e-05,4.2e-05,2.3e-05,1e-05,-5e-05,-4.1e-05,-8e-06,-7.5e-05,-0.00016,0.00014,-3.1e-05,0.000186,3.2e-05,-0.000137,5.1e-05,0.000171,0.000199,0.000122,1.7e-05,-5.4e-05,0.000122,-0.000108,-9e-06,-2e-06,2e-06,-3.7e-05,-0.000201,6.5e-05,-5.9e-05,2.6e-05,-1.6e-05,5.1e-05,-0.000131,5e-06,4.8e-05,4.5e-05,-5.5e-05,-1.7e-05,2e-05,-1.8e-05,-9.2e-05,-8e-05,-9.4e-05,1.2e-05,2.5e-05,-9.7e-05,7.7e-05,0.000259,0.000217,-0.000119,-5e-06,-8.6e-05,-8.6e-05,-0.000106,2.4e-05,-5e-05,0.000299,-7e-05,7.3e-05,-0.000131,0.000146,-6.6e-05,-7.8e-05,-4.5e-05,0.000101,-0.000133,7.3e-05,3.5e-05,7.5e-05,-1.9e-05,1e-05,0.000111,-7.5e-05,0.000125,4.1e-05,-3.4e-05,-7e-06,6.5e-05,0.000125,-8.8e-05,-8.1e-05,-0.000112,-5.1e-05,-2.8e-05,-0.000101,0.000122,-2.9e-05,7.6e-05,-0.000133,-0.000192,-3e-06,7.3e-05,-2e-06,-8.9e-05
-8e-06,6e-06,1e-05,-1.9e-05,3e-06,-3e-06,1.8e-05,-1.5e-05,-6e-06,5.8e-05,-3.7e-05,4.9e-05,5e-06,0,-1.1e-05,5e-06,-2.9e-05,4.9e-05,-7e-06,-6.8e-05,1.5e-05,-7e-05,-6e-05,1.9e-05,4.6e-05,-2e-05,-9.5e-05,-0.000122,-6.9e-05,9e-06,-4.9e-05,-4.6e-05,-1e-05,-7.4e-05,-1.5e-05,0.000113,-8.8e-05,0,-8.3e-05,-3.5e-05,1e-04,2.1e-05,-4.3e-05,-0.000137,-0.000158,-7e-06,1.9e-05,-8e-06,4.2e-05,3.4e-05,1e-05,-4.9e-05,0.000106,0.000251,-2e-05,-1.2e-05,0.000122,0.000108,-6.6e-05,7.5e-05,8.7e-05,-3.3e-05,6.6e-05,2.5e-05,2.8e-05,-2.5e-05,-0.000105,0.000112,3.1e-05,8.6e-05,6.2e-05,5.2e-05,1.3e-05,1e-05,-8.6e-05,-0.000138,5e-05,-4.5e-05,6.2e-05,0.000123,9e-05,-4.3e-05,6e-06,-2.1e-05,0.000106,-6.2e-05,-1.1e-05,3.5e-05,3e-05,-3e-06,7.3e-05,-2e-05,3.8e-05,-6e-05,3e-05,-0.000121,-7.5e-05,-2.3e-05,7.5e-05,0.000143,-6.4e-05,8.2e-05,5.7e-05,-0.000174,-0.000165,-0.000104,4e-06,7.7e-05,0.000137,8e-06,-7.2e-05,9.8e-05,-0.000146,-4.6e-05,-1.8e-05,-0.000166,8.2e-05,-5.3e-05,1.5e-05,2.2e-05,6.8e-05
5e-06,-1e-06,1.4e-05,2.2e-05,-9e-06,-3e-06,-2.6e-05,-1.5e-05,-2.9e-05,-2.5e-05,1.7e-05,-4.1e-05,-6e-06,-2e-05,2e-06,-6.1e-05,-5e-06,-2e-05,5e-06,2.5e-05,2.4e-05,2e-06,5.4e-05,7e-05,-1.6e-05,3.7e-05,-6e-06,6.3e-05,9.1e-05,-1.4e-05,4e-06,1.7e-05,-2.3e-05,0.000237,4.7e-05,-3.3e-05,3.2e-05,1.3e-05,4e-06,2.2e-05,-7.9e-05,-5.8e-05,3.5e-05,5.6e-05,7.1e-05,-4.2e-05,7e-06,4.8e-05,-5.8e-05,2.2e-05,-6.3e-05,1.3e-05,-0.000134,3.4e-05,-2.5e-05,7.2e-05,-6.7e-05,-9.6e-05,1.2e-05,-8.1e-05,-4e-05,-5.4e-05,-3.7e-05,4.2e-05,4.4e-05,-9e-06,7.7e-05,-3e-05,5.5e-05,4.3e-05,-3.4e-05,-3.5e-05,2.6e-05,-4.3e-05,-0.000119,4e-06,5.7e-05,-1e-06,-2.7e-05,-3e-05,-4.4e-05,3.1e-05,4.4e-05,-0.000245,-2.4e-05,1.2e-05,-5.4e-05,-3.3e-05,8e-06,4.4e-05,1e-06,-5e-05,-7.1e-05,1.5e-05,-6.4e-05,0.00013,-2.3e-05,-1.8e-05,-0.000206,-6.4e-05,-6.5e-05,-5e-05,7.8e-05,-7e-06,0.000155,8.9e-05,3e-06,-2.9e-05,-0.000166,-1e-05,4.4e-05,-4.2e-05,8.9e-05,3.2e-05,-1.5e-05,0.00017,-7.4e-05,1e-06,-9e-06,-9e-05,2.5e-05
3e-06,-1.4e-05,5e-06,-1.8e-05,4e-06,9e-06,1.5e-05,-4e-06,9e-06,3e-06,-1e-06,2e-05,-2.3e-05,3.2e-05,1.1e-05,1.7e-05,-7e-06,-2e-05,2e-06,2.3e-05,2e-05,3.1e-05,-4.3e-05,-0.000106,2.4e-05,-7.3e-05,4.3e-05,2e-05,-1e-05,-1e-06,4.3e-05,4.2e-05,1.9e-05,-0.000213,-9e-06,-4.1e-05,4.5e-05,-3.7e-05,-3.8e-05,4e-06,6.9e-05,5.1e-05,0,-7.3e-05,-6.8e-05,-3.1e-05,-2e-06,-2.1e-05,4.8e-05,-6.5e-05,7.4e-05,0,-2.4e-05,-0.000137,2.7e-05,-9.7e-05,-7.3e-05,-4e-05,4e-06,6e-05,2.9e-05,0.000113,-7.8e-05,-9.1e-05,-4.9e-05,0,4.4e-05,3.6e-05,-5.1e-05,-0.000101,1.7e-05,8e-06,-3.3e-05,5e-06,1.8e-05,-7e-06,-6.3e-05,-6e-06,0,-7.1e-05,0,8e-06,-5.3e-05,8.7e-05,-5.6e-05,-4e-06,0.000112,-2.4e-05,1.5e-05,-4.7e-05,-2.4e-05,-1.5e-05,6.6e-05,-2.4e-05,2.8e-05,-2.8e-05,8.3e-05,-2.8e-05,8.7e-05,5e-06,9.1e-05,-1.3e-05,-8e-05,7.2e-05,1e-05,-6e-06,1.7e-05,-1.5e-05,0.00018,5.3e-05,-2.3e-05,-2.6e-05,-6.3e-05,2.9e-05,-2.1e-05,2.8e-05,3.4e-05,2e-05,2.2e-05,0.000155,1.9e-05
-1.2e-05,2.3e-05,3e-06,7e-06,7e-06,-5e-06,-1e-05,6e-06,2.2e-05,-7e-06,3.8e-05,-1e-06,2.9e-05,-1.8e-05,-2e-06,3.5e-05,1.5e-05,9e-06,-1.4e-05,-2.4e-05,-4e-06,-3.2e-05,1.1e-05,0.000106,-4.1e-05,3.5e-05,-1.4e-05,2.1e-05,-5e-06,-9e-06,-3.3e-05,-2.3e-05,-3e-06,0.000109,4e-06,9.4e-05,-4.9e-05,2.7e-05,8.2e-05,4e-06,-4.9e-05,-3.3e-05,-6.8e-05,7e-06,7e-05,6e-06,2.3e-05,-1.4e-05,-5e-06,6.2e-05,-5.9e-05,-6e-05,0.000114,-2.3e-05,4e-06,4.8e-05,8e-05,6.8e-05,1.3e-05,-3.6e-05,-4.4e-05,-0.000121,7.4e-05,4e-06,-4e-06,2.7e-05,3e-05,-1.6e-05,6e-06,4.3e-05,-2.1e-05,4e-06,3.3e-05,3.1e-05,4.5e-05,-1.6e-05,4.8e-05,1.9e-05,2e-06,8.7e-05,4.2e-05,-2e-05,2.5e-05,0.000146,2.1e-05,-2.6e-05,-3.3e-05,0.000107,-2.1e-05,3.8e-05,4.9e-05,7.5e-05,-5.3e-05,4.5e-05,4.3e-05,-9e-06,3.3e-05,-2.6e-05,9e-05,4.1e-05,7e-05,5.2e-05,-4.7e-05,5.9e-05,-0.000103,-5.8e-05,7e-06,7.8e-05,-9.6e-05,-5.5e-05,-1.7e-05,2.6e-05,5e-05,-5.2e-05,2.2e-05,-3.2e-05,3.7e-05,9e-06,-6.3e-05,-1e-04,2.8e-05
1.6e-05,-2e-05,4e-06,2e-06,-5e-06,1.3e-05,4e-06,1e-05,-5e-06,1.2e-05,-1.3e-05,-2e-05,-9e-06,4e-06,6e-06,-4e-06,2e-06,-2.1e-05,4e-06,2.7e-05,-8e-06,3.1e-05,-9e-06,-5.5e-05,3.1e-05,-3.7e-05,-8e-06,4.3e-05,2.1e-05,6e-06,-9e-06,-3.6e-05,1.9e-05,-0.000145,-1.8e-05,-8.9e-05,-1e-06,6e-06,-6.3e-05,1.7e-05,5.7e-05,1.4e-05,6.4e-05,-5.7e-05,-1e-06,1e-06,6e-06,-4.6e-05,4.2e-05,-8.5e-05,4.4e-05,6.1e-05,-4.7e-05,0.000155,-1.4e-05,5.2e-05,-2.3e-05,-6.5e-05,-1.1e-05,-1.7e-05,-5.3e-05,4.2e-05,-4.2e-05,6.6e-05,2.2e-05,-1e-06,-8.6e-05,-3.3e-05,8e-06,-2.2e-05,2.5e-05,-1.9e-05,-3.3e-05,-2.4e-05,-3.2e-05,4.3e-05,3.7e-05,1.6e-05,3e-06,-6.2e-05,-5.6e-05,1.3e-05,1.4e-05,-0.000204,-1.9e-05,7e-06,1.2e-05,-6.2e-05,-8e-06,0,-5.6e-05,-4.5e-05,7.6e-05,-2.8e-05,-2.8e-05,-2e-06,-3.8e-05,8.6e-05,-6.2e-05,-6.5e-05,-0.000124,1.7e-05,0.000104,1.8e-05,0.000119,8.9e-05,1e-06,-0.00012,1.1e-05,1.5e-05,2.6e-05,-1.6e-05,-1.4e-05,4.6e-05,7e-06,-2.9e-05,-6e-05,2.3e-05,3.2e-05,3.2e-05,-6.9e-05
-7e-06,6e-06,-1e-05,-4e-06,5e-06,-5e-06,5e-06,-5e-06,-2e-05,-2.2e-05,-5e-06,1.6e-05,-7e-06,2e-06,-7e-06,-7e-06,2e-06,3.3e-05,4e-06,1.9e-05,1.9e-05,-3.7e-05,-1.4e-05,3e-05,-3.3e-05,2.3e-05,-1.9e-05,-4.9e-05,-6.2e-05,1e-06,3.7e-05,6.7e-05,4e-06,0.000148,-1e-05,4.2e-05,2.8e-05,-2.9e-05,5e-06,2e-06,-6.3e-05,1.1e-05,-3e-06,9e-05,-5e-05,1.5e-05,4e-06,3.1e-05,-5.1e-05,0.000117,-1.4e-05,4.4e-05,3.3e-05,-5.5e-05,1.5e-05,-8.7e-05,-2.7e-05,5.1e-05,1.1e-05,1.2e-05,6.8e-05,5.9e-05,4.6e-05,-6e-06,-3.4e-05,-1e-06,2e-06,2.1e-05,-1.7e-05,1.1e-05,-3.4e-05,2e-05,2.4e-05,-1.8e-05,2e-06,-6.5e-05,-4.7e-05,-1.8e-05,-1e-06,2.1e-05,3e-05,-1.3e-05,-2.6e-05,-1.9e-05,-2.4e-05,1.6e-05,-9e-06,-6.4e-05,5e-06,-4.4e-05,5.1e-05,-4e-06,-5.6e-05,9e-06,-3.5e-05,-4.4e-05,2.7e-05,-5.6e-05,-4e-05,3e-05,7e-06,-1.5e-05,-1e-06,-4.6e-05,-4.8e-05,-8e-05,-7e-06,7.1e-05,-4e-06,-9e-06,-4.7e-05,4.9e-05,-4.5e-05,-3e-05,-5.1e-05,-4.3e-05,9.9e-05,-1.1e-05,5e-06,-4.4e-05,1.1e-05
1e-06,6e-06,-1.1e-05,0,-1.1e-05,-5e-06,-4e-06,-8e-06,1e-06,2.3e-05,-7e-06,2e-06,3e-06,-2e-06,8e-06,6e-06,-8e-06,-2.8e-05,-7e-06,-3.1e-05,-5.7e-05,6.3e-05,2.4e-05,-1.6e-05,2.6e-05,1e-06,2.1e-05,-3.8e-05,4e-05,0,-9e-06,-2.2e-05,2e-06,-4.3e-05,3.1e-05,4e-06,-3e-05,2.9e-05,-2.7e-05,-4e-06,4.5e-05,-7e-06,5e-06,-2.9e-05,7.6e-05,-5e-06,-1.7e-05,3e-06,-1.8e-05,-0.00012,-8e-06,-7.7e-05,-4e-06,-7.8e-05,-3.3e-05,5.2e-05,1.9e-05,1.4e-05,-2.9e-05,-3e-05,0,-5.4e-05,-2e-06,-3.3e-05,-2e-06,4e-06,1.3e-05,2e-05,-4e-06,3.4e-05,1.9e-05,-2.9e-05,-7e-06,3e-05,-7.5e-05,9.9e-05,3.3e-05,2e-06,6e-06,3.2e-05,-1.8e-05,5e-06,9e-06,0.000174,3e-05,-2.6e-05,-2.1e-05,0.000105,-2.1e-05,1.6e-05,-4.5e-05,6.1e-05,4.7e-05,-1.5e-05,2e-05,3.9e-05,-6e-05,4.4e-05,6.5e-05,-1e-05,1.4e-05,-2.2e-05,-8.6e-05,-3.9e-05,-3e-05,7.5e-05,-6e-06,0,-2.4e-05,2.6e-05,6.6e-05,-4.3e-05,7.9e-05,9e-06,3e-06,6.4e-05,-0.000116,-1.2e-05,-1e-05,1.5e-05,-5e-05
-2e-06,-1.3e-05,-1e-06,6e-06,7e-06,1e-06,1.1e-05,-1e-06,1.8e-05,-2e-05,-1.5e-05,-8e-06,8e-06,-1.1e-05,0,0,-2e-06,-1e-06,-1e-06,-1e-05,4e-05,-5.4e-05,-6e-06,2.5e-05,9e-06,5e-06,1.7e-05,1.4e-05,-3.1e-05,-5e-06,-1.2e-05,-3.4e-05,9e-06,-4e-06,-1.7e-05,-1.8e-05,9e-06,-1.4e-05,6e-05,-1.6e-05,-3.1e-05,-4e-06,1.8e-05,-1.3e-05,-5.6e-05,-1.1e-05,3e-06,-7.9e-05,3.3e-05,0.000113,6e-06,4.4e-05,-8.9e-05,1.5e-05,3.3e-05,-2e-06,1.8e-05,-1.8e-05,6e-06,2.7e-05,1e-05,2.1e-05,-3.1e-05,-1e-06,1.6e-05,1.8e-05,5e-05,-1.4e-05,-9e-06,-4.5e-05,1.4e-05,0,-8e-06,8e-06,7.3e-05,-6.9e-05,2e-05,-2e-06,-1.2e-05,-7.5e-05,1.2e-05,4e-06,5e-06,-4.3e-05,1.9e-05,1.9e-05,1.7e-05,-4.2e-05,-1e-06,2.1e-05,2e-05,-3.9e-05,-5.6e-05,2.7e-05,3.1e-05,1e-06,-7e-06,0,9e-06,6e-06,3.9e-05,1.4e-05,4.6e-05,-7e-06,2.7e-05,-8.3e-05,-1.2e-05,-2e-06,4.9e-05,-1.7e-05,-5e-06,2.8e-05,-5e-05,-1e-06,1.2e-05,1.9e-05,6.7e-05,1.1e-05,-4e-06,1.5e-05,6.6e-05
4e-06,5e-06,1e-06,-1e-05,2e-06,5e-06,-8e-06,5e-06,-3e-06,1.4e-05,1.2e-05,-1e-06,-1e-05,1.7e-05,-5e-06,2.7e-05,2e-06,-7e-06,-2e-06,2.2e-05,-2.9e-05,1.2e-05,-1.1e-05,-4.2e-05,-2e-05,1e-05,-2.7e-05,4.3e-05,3.7e-05,4e-06,7e-06,3.7e-05,-4e-06,-2.7e-05,3e-06,1.8e-05,3.3e-05,-7e-06,-2.6e-05,-4e-06,2.4e-05,1e-05,-4e-05,1e-06,3.9e-05,2e-06,2.9e-05,5.4e-05,-1.1e-05,-9.2e-05,-2e-06,1.9e-05,6.8e-05,7.9e-05,-3.1e-05,-3.9e-05,-4e-06,2.2e-05,-3e-06,-3.8e-05,7e-06,-7e-06,2e-06,6e-06,-8e-06,-2.1e-05,-2.8e-05,-4e-06,2.5e-05,4e-06,-2.1e-05,8e-06,1.5e-05,-2.6e-05,2e-06,4.5e-05,-2.8e-05,-4e-06,1.4e-05,5.4e-05,3e-06,-9e-06,-1e-06,-0.000135,-1.3e-05,-1.2e-05,-2e-06,-1.8e-05,-5e-06,-2.1e-05,8e-06,-3.3e-05,5.3e-05,-1.4e-05,-2.2e-05,6e-06,3.1e-05,-6.2e-05,-8.1e-05,2.5e-05,6e-06,-6e-06,2.8e-05,6e-06,6e-06,1.6e-05,-8e-06,-3e-06,-7.5e-05,-1.7e-05,-4e-05,-2.6e-05,-4e-06,-1.3e-05,4e-06,-7e-06,-2.6e-05,5e-06,1.3e-05,-1.7e-05,-2e-05
-3e-06,-2e-06,4e-06,8e-06,-7e-06,-4e-06,2e-06,5e-06,-1.2e-05,-6e-06,2e-06,1.1e-05,1e-06,-8e-06,7e-06,1.4e-05,7e-06,1.5e-05,2e-06,-6e-06,2.4e-05,-1e-05,0,4.1e-05,6e-06,-1.6e-05,6e-06,2.5e-05,-1.1e-05,3e-06,3e-06,-3e-06,9e-06,-6e-06,0,-3.3e-05,-4.8e-05,2.1e-05,8e-06,-4e-06,-2.4e-05,-1e-05,1.4e-05,3.5e-05,-8e-06,-1e-06,0,1.2e-05,4.9e-05,8.1e-05,7e-06,-4.7e-05,-2e-06,-4.8e-05,3.8e-05,5.2e-05,-3.9e-05,-4.4e-05,1.7e-05,3.2e-05,-6.4e-05,-2e-05,9e-06,1.5e-05,-5e-06,1.4e-05,-2.7e-05,7e-06,-1.7e-05,2e-05,2.1e-05,-1.7e-05,-1.1e-05,0,-2.8e-05,-5.4e-05,-4e-06,-1e-06,-1.6e-05,-1e-06,2e-06,0,-1.3e-05,0.000107,2.6e-05,-4e-06,1.2e-05,-1e-06,1.5e-05,2.1e-05,-1e-05,1.7e-05,-5.2e-05,5e-06,-2.5e-05,-6e-06,-9e-06,6.5e-05,5e-05,-4.1e-05,-1.1e-05,-1.4e-05,-1.7e-05,1.3e-05,-1.5e-05,1.8e-05,2e-05,-1e-06,8.8e-05,2.7e-05,4e-05,-7e-06,3.7e-05,1.3e-05,-3e-06,-5.2e-05,-1.4e-05,-1e-06,-1.5e-05,1e-05,4.3e-05
0,4e-06,6e-06,-2e-06,4e-06,2e-06,-1e-06,0,-1e-06,0,1.4e-05,-1.4e-05,6e-06,-1e-06,-3e-06,-4.8e-05,5e-06,-8e-06,-1e-06,-5e-06,-1.2e-05,9e-06,-1e-05,-3.6e-05,0,8e-06,2e-06,-5.5e-05,-3e-06,-5e-06,-9e-06,-2.1e-05,-6e-06,7.8e-05,1e-06,3.7e-05,2.6e-05,-1.4e-05,-3e-05,7e-06,1.3e-05,1.1e-05,1.5e-05,-4e-06,-2.5e-05,1.4e-05,-1.2e-05,-4.6e-05,-6.1e-05,-8.5e-05,-8e-06,3e-05,-2.1e-05,-4.2e-05,-1.8e-05,-2.9e-05,1.7e-05,-6e-06,6e-06,-2.5e-05,2.4e-05,9e-06,5e-06,2e-06,2e-05,0,-1e-05,-1.3e-05,1e-06,-1.9e-05,-1.8e-05,1.8e-05,7e-06,1.4e-05,1e-05,1.6e-05,9e-06,3e-06,1.2e-05,-2.1e-05,-5e-06,5e-06,1.4e-05,6.5e-05,-3.2e-05,1e-05,-2e-05,5.3e-05,-1.1e-05,-1.3e-05,1.8e-05,2.1e-05,5.1e-05,-1e-05,2.6e-05,-1.4e-05,4.2e-05,-6.3e-05,4.7e-05,2.3e-05,-5.5e-05,-2e-06,-2.8e-05,2.8e-05,-1.1e-05,-2e-05,8e-06,-1.1e-05,-6e-05,-1.6e-05,5e-06,2.4e-05,-1.2e-05,2e-06,-2.8e-05,3.1e-05,5.6e-05,-2e-06,1.7e-05,1.4e-05,-4.4e-05
3e-06,-1e-06,2e-06,-3e-06,-2e-06,2e-06,-1e-06,-4e-06,1.1e-05,6e-06,-7e-06,1e-05,-4e-06,2e-06,0,1.2e-05,1e-06,-8e-06,-2e-06,1.6e-05,2.7e-05,1.2e-05,1e-05,8e-06,-8e-06,-1.2e-05,2e-06,-4.1e-05,6e-06,0,1e-06,1.2e-05,3e-06,-7.1e-05,4e-06,-1.8e-05,1e-06,-2e-06,4.1e-05,3e-06,-7e-06,0,-1e-06,2.1e-05,4.5e-05,0,-5e-06,-1.7e-05,2.4e-05,8.1e-05,6e-06,-1.3e-05,3.6e-05,4.5e-05,-5e-06,-9e-06,2.8e-05,2.8e-05,1e-06,1.1e-05,1.2e-05,3.2e-05,2e-06,-2.8e-05,-3e-06,-3e-06,3.7e-05,1.7e-05,-3e-06,2.4e-05,5e-06,1e-06,-4e-06,-3e-06,9e-06,1.4e-05,-7e-06,0,-8e-06,4.3e-05,0,-4e-06,4e-06,-0.000119,-1e-06,-1.2e-05,-6e-06,-3.4e-05,1e-05,-8e-06,-1.4e-05,-2.4e-05,-3.4e-05,1.4e-05,1.1e-05,1.4e-05,-3.1e-05,4.1e-05,-4.5e-05,-6e-06,3.2e-05,1.3e-05,1.4e-05,2e-05,3.7e-05,1.8e-05,1.2e-05,2.2e-05,2.8e-05,0,-4.4e-05,-3.4e-05,1e-05,-8e-06,5e-06,-2e-05,-6.5e-05,-6e-06,-1e-05,-7e-06,4e-06
-4e-06,-5e-06,-1e-06,4e-06,4e-06,-2e-06,-1e-06,-3e-06,2e-06,-8e-06,-5e-06,2e-06,-3e-06,0,4e-06,-1.2e-05,-5e-06,5e-06,-1e-06,-4e-06,-2.6e-05,-2.7e-05,-5e-06,2e-06,1e-05,3e-06,0,3.5e-05,-2.3e-05,3e-06,4e-06,1.1e-05,-9e-06,4.7e-05,-7e-06,5e-06,-2.3e-05,8e-06,-1.5e-05,4e-06,7e-06,-3e-06,1e-05,-3.2e-05,-4.4e-05,-3e-06,6e-06,3e-05,-3.2e-05,-6.4e-05,-6e-06,-1.7e-05,-4.9e-05,3.5e-05,1.2e-05,3.7e-05,-2.6e-05,-2e-05,-6e-06,-6e-06,1e-05,-5.2e-05,-3e-06,1.6e-05,-6e-06,-2e-06,6e-06,-1.6e-05,6e-06,-2.3e-05,0,-3e-06,1e-06,-5e-06,1.3e-05,-2.5e-05,-1.1e-05,6e-06,7e-06,-4.3e-05,1e-05,0,-2e-05,1.7e-05,-1e-06,3e-06,1.2e-05,-3.9e-05,0,2.1e-05,7e-06,2e-06,4e-05,-8e-06,-2.1e-05,-1.5e-05,-8e-06,-5e-06,-1.4e-05,-1.4e-05,2.8e-05,3e-06,4.2e-05,-2.6e-05,-3.5e-05,-1.4e-05,-1.1e-05,-2e-06,0,-4e-06,3.1e-05,3.1e-05,-2.7e-05,1e-05,1.6e-05,6.5e-05,5.8e-05,-4e-06,0,-7e-06,-2.5e-05
3e-06,1e-05,-2e-06,-1e-06,-4e-06,-2e-06,-3e-06,2e-06,-1e-05,8e-06,-5e-06,-1.2e-05,3e-06,-3e-06,-4e-06,1e-05,-8e-06,-1.1e-05,2e-06,-1.8e-05,1.5e-05,3.1e-05,-3e-06,-1.1e-05,8e-06,4e-06,-1.1e-05,3.6e-05,2.4e-05,-2e-06,-4e-06,-1.7e-05,-5e-06,-8e-05,2e-06,-4e-06,2.9e-05,-4e-06,-4e-06,1e-06,-3e-06,0,-1.2e-05,-1.9e-05,4e-05,1e-06,8e-06,-1.5e-05,4.4e-05,3.9e-05,0,2.2e-05,1.8e-05,-4.9e-05,-1.3e-05,-3.6e-05,-6e-06,2.6e-05,-4e-06,-1.1e-05,1.9e-05,4.5e-05,-9e-06,1.5e-05,1e-05,1e-06,-1.1e-05,3e-06,-2e-06,-4e-06,6e-06,1.1e-05,3e-06,4e-06,2.7e-05,4.6e-05,7e-06,-3e-06,-3e-06,1.1e-05,-1.6e-05,4e-06,1.8e-05,0.000102,-1.7e-05,-2e-06,1.1e-05,5.9e-05,7e-06,-5e-06,-2e-06,3.7e-05,-4.6e-05,2e-06,-1e-06,1.5e-05,6e-06,7e-06,3.6e-05,2.8e-05,-2.2e-05,1e-06,-3.9e-05,-3.4e-05,-5e-06,1.1e-05,-1.3e-05,-9e-06,-2.1e-05,1.1e-05,-1.6e-05,-1.3e-05,3.1e-05,-2e-06,0,-5.6e-05,-4.2e-05,6e-06,2e-06,4e-06,2.2e-05
-2e-06,-8e-06,-2e-06,-3e-06,0,2e-06,4e-06,2e-06,-1e-06,-8e-06,-4e-06,1.2e-05,1e-06,6e-06,1e-06,2.2e-05,-5e-06,1.4e-05,-1e-06,6e-06,-1.1e-05,-2.5e-05,3e-06,6e-06,-1.6e-05,-4e-06,1.4e-05,-2e-06,-1.7e-05,1e-06,1e-06,3e-06,-3e-06,9.7e-05,2e-06,2e-06,-9e-06,-6e-06,-1.8e-05,0,-7e-06,0,-8e-06,1.1e-05,-1.7e-05,-2e-06,3e-06,-2.3e-05,-1.2e-05,-1.8e-05,4e-06,-5e-06,3.2e-05,-1.2e-05,1.2e-05,1.1e-05,2.5e-05,3e-06,-5e-06,1.8e-05,-3.7e-05,-2e-05,-6e-06,-1.9e-05,0,-1e-06,-2.8e-05,1.9e-05,1e-06,2.4e-05,0,-8e-06,-6e-06,-1e-06,-4.2e-05,-4.4e-05,-6e-06,-9e-06,-1e-06,1.9e-05,1.8e-05,-6e-06,1e-06,-6.2e-05,2.5e-05,-1e-06,2e-06,-1.6e-05,-7e-06,-1.2e-05,-5e-06,-2.4e-05,2.7e-05,-5e-06,1.8e-05,0,-2.5e-05,-1.2e-05,-1.3e-05,-2e-05,-1.9e-05,3e-06,-1.6e-05,-1.2e-05,4e-05,-9e-06,-5e-06,-3e-06,3.5e-05,-1.3e-05,-3e-06,1e-05,0,-7e-06,-5e-06,1e-06,8e-06,0,4e-06,-1.4e-05,8e-06
3e-06,3e-06,-3e-06,5e-06,5e-06,-1e-06,-2e-06,1e-06,9e-06,5e-06,6e-06,-4e-06,-3e-06,-5e-06,0,-3.7e-05,0,-1.3e-05,-1e-06,8e-06,-6e-06,2e-05,-7e-06,3e-06,1e-05,1.1e-05,0,-2.9e-05,2.1e-05,1e-06,1e-06,1.2e-05,-4e-06,-5.3e-05,-1e-06,1.4e-05,-1.1e-05,1e-05,3.3e-05,-1e-06,9e-06,0,5e-06,-9e-06,-4e-06,8e-06,-8e-06,1.1e-05,-2e-06,1.1e-05,2e-06,-5e-06,-3.3e-05,4.1e-05,-1.3e-05,1.8e-05,-1.6e-05,-1.9e-05,5e-06,-2.4e-05,-6e-06,-8e-06,2.5e-05,2e-06,-7e-06,-6e-06,1e-05,-2.1e-05,0,-1.8e-05,-7e-06,2e-06,5e-06,-5e-06,3.3e-05,4.7e-05,-8e-06,4e-06,2e-06,-4.1e-05,-1.3e-05,5e-06,-1.4e-05,-6.9e-05,-9e-06,-3e-06,-2e-05,-1.4e-05,4e-06,1.1e-05,6e-06,-1.8e-05,-3e-05,6e-06,-6e-06,-1e-05,2.8e-05,1.5e-05,-3.5e-05,9e-06,2.1e-05,1e-06,3.6e-05,2.7e-05,-3.3e-05,1.8e-05,5e-06,-3e-06,-4.4e-05,3e-06,1.1e-05,4e-06,-2.9e-05,4e-06,-7e-06,-1.3e-05,1.7e-05,-4e-06,-8e-06,2.4e-05,7e-06
-3e-06,4e-06,-1e-06,-3e-06,-6e-06,0,2e-06,-1e-06,0,-2e-06,4e-06,-2e-06,1e-06,0,-1e-06,1.6e-05,6e-06,-1e-06,1e-06,-7e-06,4e-06,-2.2e-05,2e-06,0,-8e-06,-9e-06,-6e-06,-2.1e-05,-1.6e-05,-2e-06,3e-06,-1e-05,1e-06,2.6e-05,-2e-06,-2.9e-05,1.7e-05,0,-9e-06,-2e-06,-1e-05,2e-06,3e-06,0,2.3e-05,0,-5e-06,1.3e-05,-1.6e-05,0,-9e-06,1.1e-05,3.1e-05,0,1.5e-05,-3.3e-05,-1.2e-05,5e-06,-1e-06,2.2e-05,1e-06,1.7e-05,-1.4e-05,0,1e-06,2e-06,2.2e-05,1.1e-05,5e-06,7e-06,1e-05,1e-06,-3e-06,6e-06,9e-06,-5e-05,1.1e-05,3e-06,-3e-06,3.2e-05,3e-06,-3e-06,1e-05,0.000102,9e-06,2e-06,1e-06,1e-05,-1e-06,-9e-06,-1.1e-05,2.2e-05,3.3e-05,-4e-06,-1.5e-05,1.2e-05,5e-06,-2.7e-05,3.4e-05,0,-1.5e-05,-5e-06,2e-06,1.5e-05,6e-06,-1.5e-05,8e-06,1.7e-05,3.9e-05,0,-1e-05,-2e-05,3e-05,-1e-06,4e-06,5.4e-05,-3.5e-05,1e-06,5e-06,-3.3e-05,-7e-06
1e-06,-5e-06,2e-06,1e-06,2e-06,1e-06,0,-1e-06,-8e-06,2e-06,4e-06,2e-06,2e-06,4e-06,0,-1e-06,6e-06,-1e-06,0,3e-06,-4e-06,1.6e-05,-2e-06,-2e-06,6e-06,7e-06,2e-06,1.7e-05,5e-06,2e-06,-3e-06,-3e-06,-4e-06,-3.6e-05,0,3e-05,-1.2e-05,-1.1e-05,-5e-06,-2e-06,1.3e-05,0,1e-06,8e-06,-3.8e-05,-2e-06,4e-06,-1e-06,2e-06,-1.9e-05,1.3e-05,-8e-06,-1.7e-05,-3e-05,-1.7e-05,2.4e-05,1.1e-05,-1.6e-05,3e-06,-1.5e-05,1.1e-05,-1.2e-05,3e-06,3e-06,1e-06,4e-06,6e-06,-1.1e-05,-7e-06,-4e-06,-1.2e-05,-7e-06,2e-06,3e-06,-1e-05,2.4e-05,-3e-06,1e-06,4e-06,-2e-06,8e-06,0,3e-06,7e-06,2e-06,-7e-06,5e-06,5e-06,-2e-06,5e-06,1.1e-05,-2e-06,-2.3e-05,2e-06,1.1e-05,-1.2e-05,-5e-06,1.3e-05,1.3e-05,-1.4e-05,2.8e-05,-1e-06,-2.3e-05,1e-05,1.9e-05,1.4e-05,7e-06,-1e-05,-3.3e-05,4e-06,9e-06,2.3e-05,-1.3e-05,-2e-06,6e-06,-3e-05,4.9e-05,-1e-06,-5e-06,3.7e-05,-2.2e-05
1e-06,3e-06,1e-06,1e-06,2e-06,-1e-06,0,1e-06,-1e-06,-4e-06,-2e-06,1e-06,-2e-06,-2e-06,-2e-06,8e-06,3e-06,2e-06,0,7e-06,1e-05,-3e-06,-2e-06,1.8e-05,-3e-06,-7e-06,-4e-06,2.9e-05,-3e-06,0,-1e-06,7e-06,1e-06,1.4e-05,1e-06,-2.1e-05,-4e-06,1e-05,-1e-05,-1e-06,-1.8e-05,-2e-06,-1e-06,1.5e-05,3.9e-05,-2e-06,3e-06,-1.8e-05,2.1e-05,3.5e-05,-1.5e-05,5e-06,-2.9e-05,-2e-06,1.5e-05,5e-06,1.1e-05,3e-06,-1e-06,9e-06,2.5e-05,-3e-06,2e-06,8e-06,-6e-06,-4e-06,-2.2e-05,5e-06,6e-06,-7e-06,9e-06,5e-06,-1e-06,-7e-06,6e-06,-1.1e-05,-5e-06,-1e-06,-4e-06,-2.4e-05,-1.5e-05,1e-06,-7e-06,-9.7e-05,-7e-06,3e-06,5e-06,-1.1e-05,-3e-06,3e-06,-8e-06,-2e-05,2.6e-05,-4e-06,1.2e-05,2e-06,3e-06,8e-06,-2.7e-05,2e-05,-1e-05,-1e-06,1e-06,-3e-06,-1.9e-05,-1.1e-05,-4e-06,-2e-06,1.9e-05,-1.2e-05,6e-06,-2.2e-05,1.4e-05,3e-06,3e-06,1.9e-05,-4.4e-05,1e-06,4e-06,-3.1e-05,5e-06
-1e-06,-3e-06,2e-06,-1e-06,-2e-06,0,0,0,8e-06,5e-06,-4e-06,-5e-06,-1e-06,-2e-06,2e-06,1.8e-05,-3e-06,-3e-06,0,-7e-06,-8e-06,-5e-06,1e-06,-2.2e-05,9e-06,2e-06,8e-06,6e-06,-3e-06,-1e-06,3e-06,0,-4e-06,3.6e-05,1e-06,1e-05,1.6e-05,-1e-06,2.2e-05,0,2e-05,1e-06,-4e-06,-5e-06,-2.3e-05,-2e-06,8e-06,2e-05,-6e-06,-4.5e-05,1.1e-05,4e-06,3.8e-05,2.7e-05,-1.3e-05,-2.8e-05,-9e-06,1.7e-05,-1e-06,0,-1.7e-05,1.7e-05,-1.7e-05,-1.4e-05,0,1e-06,-1.3e-05,9e-06,-4e-06,1.8e-05,-1e-06,-4e-06,0,-2e-06,-1.3e-05,6e-06,6e-06,0,4e-06,3.8e-05,1.3e-05,-1e-06,-2e-06,4.4e-05,0,-3e-06,2e-06,-4e-06,1e-06,-7e-06,3e-06,1.1e-05,-2.8e-05,4e-06,-1.6e-05,8e-06,-1.3e-05,-1.6e-05,2e-06,-1.5e-05,-2.6e-05,-2e-06,1.5e-05,-9e-06,2e-06,0,-6e-06,-2e-06,-2e-06,7e-06,-1.4e-05,1.5e-05,-1.9e-05,0,-2e-06,-4.9e-05,2.7e-05,3e-06,-1e-06,3e-05,-1e-06
0,3e-06,2e-06,0,-1e-06,1e-06,-1e-06,0,0,-6e-06,-3e-06,5e-06,2e-06,4e-06,-1e-06,-2.5e-05,-5e-06,-2e-06,0,-8e-06,1.7e-05,9e-06,-2e-06,2.3e-05,-1.4e-05,0,-4e-06,-2.2e-05,1.1e-05,1e-06,-1e-06,-1e-05,0,-4.4e-05,-2e-06,-1e-06,-1.4e-05,-7e-06,-1e-05,2e-06,-2.1e-05,0,-2e-06,1.2e-05,5e-06,3e-06,-9e-06,2.1e-05,2e-06,5.2e-05,-5e-06,-1.4e-05,-2.3e-05,-3e-06,1.3e-05,2.5e-05,-1.4e-05,-3e-06,-3e-06,-7e-06,-1.2e-05,-1.1e-05,1.8e-05,3e-06,4e-06,4e-06,1.3e-05,-1.1e-05,8e-06,-1.1e-05,-3e-06,-1e-06,2e-06,5e-06,5e-06,2.3e-05,3e-06,-1e-06,-3e-06,-2.5e-05,-8e-06,0,1.1e-05,6.7e-05,-6e-06,-3e-06,-9e-06,2.1e-05,1e-06,4e-06,1e-06,2.3e-05,2.1e-05,-3e-06,-7e-06,-7e-06,3e-06,2.1e-05,2e-05,7e-06,1.8e-05,-3e-06,6e-06,-2e-05,9e-06,6e-06,-5e-06,-1e-06,-8e-06,2e-06,1.5e-05,-1e-06,2e-06,1e-06,-2e-06,4.2e-05,-4e-06,-2e-06,1e-06,-3.1e-05,3.1e-05
-1e-06,0,-1e-06,1e-06,2e-06,0,1e-06,0,-6e-06,9e-06,-2e-06,1e-06,-1e-06,-2e-06,-2e-06,-5e-06,-3e-06,0,0,6e-06,-1.8e-05,-1.4e-05,0,-1.8e-05,1e-05,-3e-06,-4e-06,-2.6e-05,-1e-05,0,-1e-06,7e-06,3e-06,3.2e-05,1e-06,-1.1e-05,3e-06,7e-06,-4e-06,0,2.4e-05,1e-06,1e-06,-2.1e-05,1.4e-05,1e-06,-9e-06,-2.3e-05,-2.7e-05,-5.8e-05,4e-06,9e-06,2e-06,-1.9e-05,-8e-06,-5e-06,1.5e-05,5e-06,0,1.2e-05,-9e-06,-5e-06,6e-06,7e-06,-2e-06,-5e-06,2.1e-05,2e-06,-7e-06,-3e-06,6e-06,3e-06,-3e-06,1e-06,4e-06,-3.3e-05,-2e-06,0,2e-06,-2e-06,0,0,-7e-06,-8e-05,2e-06,2e-06,2e-06,-1.3e-05,-2e-06,1e-06,-6e-06,-1.9e-05,-2.5e-05,2e-06,1.8e-05,4e-06,1e-06,-6e-06,-2.1e-05,5e-06,9e-06,4e-06,-1.7e-05,-8e-06,-7e-06,-9e-06,-2e-06,9e-06,2.1e-05,-6e-06,-3e-06,-1.1e-05,1.4e-05,1e-06,0,-7e-06,-2.2e-05,-1e-06,-3e-06,2.8e-05,-8e-06
3e-06,-4e-06,-2e-06,-1e-06,1e-06,-1e-06,-1e-06,0,0,-1.1e-05,4e-06,-8e-06,0,-2e-06,1e-06,6e-06,2e-06,-7e-06,0,3e-06,1.6e-05,2.3e-05,0,5e-06,-8e-06,7e-06,5e-06,8e-06,1.3e-05,0,0,6e-06,3e-06,-5.4e-05,-2e-06,2.4e-05,9e-06,0,-8e-06,1e-06,-2.4e-05,-1e-06,-1e-06,4e-06,-3e-05,-1e-06,6e-06,-1e-06,2.2e-05,6.1e-05,-5e-06,6e-06,2.4e-05,-3e-06,-1e-06,-1.6e-05,6e-06,0,0,-1.4e-05,-1e-06,2.1e-05,-2e-05,-5e-06,0,1e-06,-5e-06,-1e-06,3e-06,7e-06,-6e-06,-2e-06,2e-06,-2e-06,-2.4e-05,3.6e-05,0,0,-2e-06,2.6e-05,8e-06,0,-8e-06,-2.9e-05,1e-06,-6e-06,-5e-06,-1.1e-05,2e-06,-6e-06,1e-05,-1.2e-05,2.6e-05,-2e-06,3e-06,0,-8e-06,-1e-05,-9e-06,-1.4e-05,-1.9e-05,4e-06,-9e-06,9e-06,-4e-06,1.4e-05,5e-06,1e-06,-3e-05,0,-1.5e-05,1.7e-05,-2.1e-05,-4e-06,0,2.3e-05,4.1e-05,2e-06,4e-06,-2.5e-05,6e-06
