1e-06,-1.8e-05,-0.000278,-0.001448,-0.006007,-0.016169,-0.021993,-0.036841,-0.033529,-0.020584,-0.020802,-0.020195,-0.029254,-0.018795,-0.01083,-0.005861,-0.004223,-0.002411,-0.001912,-0.001696,-0.001072,-0.000977,-0.001126,-0.000765,-0.000414,-0.000253,-0.000184,-0.000179
-1e-06,-2.5e-05,-0.000371,-0.001082,-0.003447,-0.004543,-0.00612,-0.015366,-0.005487,0.002225,0.003902,0.002312,0.005793,0.003169,0.003482,0.002627,0.003773,0.001788,0.001097,0.000551,0.000637,0.000646,0.000533,0.000515,0.000337,0.000103,9.6e-05,0.000109
-2e-06,-1.2e-05,-0.000155,2.1e-05,0.000956,0.002794,0.000996,0.007441,0.009718,0.001612,0.000715,0.001702,0.006395,0.002308,-0.001858,-0.002157,-0.001763,-0.001001,-0.000679,-8.6e-05,-8.7e-05,-0.000209,-9.9e-05,-0.000104,-0.000132,-3.9e-05,-4.3e-05,0
-3e-06,7e-06,0.00014,0.000696,0.003404,0.003012,-7e-04,0.010855,0.004896,-0.000278,-0.003114,-0.003115,-0.000635,-0.000997,-0.004885,-0.004129,-0.002902,-0.001965,-0.001177,-0.000556,-0.000353,-0.000177,-0.000126,-0.000165,-0.000135,-8.6e-05,-8e-05,-9.3e-05
-2e-06,1.3e-05,0.000248,0.000595,0.001664,0.003592,0.005698,0.005889,0.003183,0.007043,0.009498,0.006161,0.006354,0.005634,0.006675,0.004464,0.003987,0.001906,0.001417,0.000786,0.000591,0.000658,0.000702,0.000523,0.00037,0.000176,0.000146,0.000104
-2e-06,3e-06,0.000106,-0.000219,-0.003122,-0.003929,-0.00045,-0.012369,-0.010528,-0.007116,-0.001221,-0.00034,-0.009273,-0.003735,0.002989,0.002146,-3e-05,0.000937,0.001071,0.000582,-0.000101,-0.000413,-0.00044,-0.000402,-0.000179,1e-06,-3e-06,1.2e-05
-2e-06,-1e-06,-2.3e-05,-0.000426,-0.002152,-0.004635,-0.00582,-0.009704,-0.008609,-0.007564,-0.011257,-0.010588,-0.012448,-0.007426,-0.00438,-0.002543,-0.002952,-0.001621,-0.001071,-0.000904,-0.000547,-0.000448,-0.000614,-0.000372,-0.000254,-0.000166,-0.000114,-9.9e-05
-1e-06,1e-06,-6e-05,0.000263,0.002845,0.006052,0.008442,0.020466,0.01647,0.015318,0.00992,0.010668,0.019295,0.009515,0.002157,0.002154,0.003007,0.000971,0.00016,6.5e-05,4e-04,0.000534,0.000683,0.000677,0.000335,1e-04,9.5e-05,6.5e-05
1e-06,-4e-06,-0.000126,0.000253,0.002522,0.005313,0.010029,0.016103,0.010193,0.002895,0.005677,0.008209,0.011284,0.004993,0.000302,-0.000319,-0.000429,0.000124,-1.3e-05,0.000425,0.000209,0.000141,0.000248,1.3e-05,-1.3e-05,8.3e-05,3.7e-05,4.6e-05
2e-06,-1.1e-05,-0.000154,-0.000621,-0.001881,-0.004559,-0.006346,-0.01527,-0.008988,-0.009189,-0.007885,-0.006553,-0.013899,-0.006232,-0.002895,-0.001527,-0.001441,-0.000771,-0.000432,-0.000179,-1.4e-05,-2.2e-05,-0.000243,-0.000393,-0.000193,-9e-05,-9.5e-05,-7.2e-05
3e-06,-6e-06,-2.9e-05,-0.000567,-0.003387,-0.007076,-0.013779,-0.025197,-0.017122,-0.00576,-0.007328,-0.01089,-0.014325,-0.009914,-0.002301,-0.000502,0.001145,2e-06,-0.000309,-0.000351,-0.000266,-0.000296,-0.000243,5.3e-05,0.000114,-4.6e-05,-1.4e-05,-2.3e-05
3e-06,9e-06,0.000192,0.000641,0.000179,0.00078,-0.002133,0.000214,-0.000827,0.000734,0.004023,-0.000293,0.004894,0.00409,0.002017,-0.000551,-0.000708,0.000409,0.000491,-0.000134,-0.00017,-0.00019,-0.000301,-5.3e-05,-2.7e-05,1.9e-05,2.9e-05,2.9e-05
2e-06,1.9e-05,0.000247,0.000848,0.003205,0.007276,0.007828,0.02135,0.019415,0.008153,0.006901,0.009527,0.01601,0.012033,0.004162,0.001163,-0.000153,0.000352,0.000813,0.000507,0.000157,0.000253,0.00041,0.000144,-2.5e-05,2.5e-05,1.1e-05,2.2e-05
0,1e-05,2.7e-05,-0.000149,0.001543,0.00279,0.005411,0.011414,0.008099,0.005435,0.001212,0.002417,-0.001117,-0.00208,3.6e-05,0.001451,0.001569,-0.000131,-0.000191,0.000463,0.000254,0.000202,0.000403,0.000236,0.000115,4.1e-05,4.7e-05,1.8e-05
-1e-06,-8e-06,-0.000208,-0.000703,-0.001776,-0.005323,-0.000519,-0.009178,-0.01518,-0.008623,-0.0028,-0.002771,-0.011202,-0.007636,-0.00391,-0.002075,-0.001597,-0.000559,-0.000807,-0.000582,-0.000256,-0.000119,-0.000342,-0.000338,-8.6e-05,1.7e-05,1e-06,-1.9e-05
-2e-06,-1.5e-05,-0.000194,-0.000467,-0.002543,-0.003634,-0.001712,-0.010359,-0.005227,-0.005794,-0.005945,-0.003469,-0.002281,-0.000635,-0.000181,0.000616,-0.000534,-7.8e-05,7.7e-05,-0.000235,5.8e-05,1.5e-05,-7.7e-05,-8.6e-05,-5e-05,-3.3e-05,-5.2e-05,-2.5e-05
-3e-06,-1e-05,-2.2e-05,0.000184,4.5e-05,0.001571,-0.001832,0.001355,0.007676,0.007416,0.000717,0.002252,0.006289,0.001855,0.001374,0.00156,0.001638,5e-06,-9.9e-05,0.000182,0.000107,-0.000206,-1.4e-05,0.000273,7.9e-05,-5.3e-05,-1.5e-05,1.2e-05
-3e-06,-1e-06,0.000115,0.000745,0.00265,0.002322,0.000157,0.005057,-0.002124,0.001599,0.005944,0.00127,0.00603,0.002278,-0.000845,-0.00137,-3e-05,0.000702,7.2e-05,-0.000199,-0.000133,2.3e-05,-0.000187,-4.9e-05,-1.5e-05,-1.3e-05,7e-06,9e-06
-2e-06,5e-06,0.000115,0.000318,0.001275,0.001587,0.002875,0.000604,-0.003164,-0.00503,-0.001237,-0.001196,-0.000305,0.002354,0.00061,-0.000974,-0.000922,5.9e-05,0.000635,0.000139,-7e-06,0.000282,0.000342,-4.3e-05,2.1e-05,5.6e-05,1e-05,-1e-05
