6.5e-05,2.9e-05,0.000338,0.000268,7.8e-05,8.1e-05,5e-06,4.1e-05,2.8e-05,0.000187,5.9e-05,8.6e-05,0.000111,0.000112,0.000119,3.1e-05,0.000212,7e-06,2.1e-05,0.000195,0.000334,4.6e-05,0.000297,6.3e-05,0.000208,4.8e-05,3.9e-05,0.000128,0.000236,8.3e-05,0.00016,0.000126,0.000177,0.000234,0.000194,5.6e-05,5.8e-05,7.2e-05,9.7e-05,8.9e-05,5.5e-05,0.000189,0.000135,0.000173,0.00011,4.2e-05,0.000132,5e-05,0.000122,3.1e-05,3.9e-05,0.000145,0.000187,9.5e-05,0.000123,0.000202,0.000202,0.000114,3.8e-05,6.9e-05,0.000299,2.2e-05,0.00033,7e-05,9.8e-05,0.000183,8.3e-05,0.000137,0.00032,0.000193,0.000212,0.00017,9.7e-05,0.000203,0.000219,8.2e-05,2.8e-05,0.000112,0.000338,0.000118,0.000401,0.000129,0.00013,0.000567,0.00018,9.5e-05,0.000251,0.00011,0.000222,0.000384,0.000169,0.000384,0.000142,0.000367,0.000236,0.000411,3.1e-05,0.000218,8.6e-05,1.4e-05,0.000118,2.6e-05,2.4e-05,0.000128,4e-05,0.000117,3.8e-05,1.3e-05,3.1e-05,0.000249,2e-05,0.000119,0.00021,4e-05,0.000351,0.000141,0.00042,0.000286,0.000156,0.000373,0.000183
0.000544,0.000341,0.001162,0.000361,0.000621,0.000451,0.000427,0.000377,0.000131,0.000894,0.000706,0.000403,0.000171,0.000462,0.000554,0.000417,0.000523,0.00036,0.000289,0.000267,0.000973,0.000937,0.000776,0.000522,0.000355,0.000535,0.000279,0.000423,0.000509,0.000575,0.00016,0.000286,0.000586,0.000684,0.000826,0.000686,0.000395,0.000388,0.000343,0.000337,0.000331,0.000528,0.000679,0.000271,0.000359,0.000344,0.000293,0.00021,0.000209,0.000208,0.00021,0.000371,0.00067,0.000535,0.000971,0.000285,0.001038,0.000123,0.000296,0.00035,0.001251,0.000521,0.000705,0.000732,0.000263,0.000697,0.000298,0.000136,0.000745,0.00031,0.000466,0.000175,0.000208,0.000243,0.000659,0.000784,0.000503,0.00062,0.000655,0.000763,0.000231,0.000324,0.000363,0.00132,0.000764,0.000972,0.000532,0.000559,0.000636,0.000277,0.000676,0.000272,0.000254,0.000614,0.000676,0.001071,0.000926,0.000384,0.000301,0.000128,0.000132,0.000288,0.000202,0.000226,0.000209,9.8e-05,0.000182,0.000145,0.000111,0.00051,0.000461,0.000345,0.000455,0.000298,0.000438,0.001087,0.001061,0.001195,0.001206,0.001002,0.001009
0.000859,0.00041,0.001302,0.001066,0.000608,0.000597,7e-04,0.000491,0.000468,0.001267,0.000772,0.000514,0.000153,0.000307,0.000206,0.000308,0.00014,0.000428,0.000266,0.000284,0.000564,0.000117,8.2e-05,0.000221,0.000661,0.000495,0.000196,0.000493,0.000137,0.000382,0.000262,0.000409,0.000799,0.000763,0.000256,0.000251,9.5e-05,0.000261,0.000428,6.4e-05,0.000306,0.000223,0.000183,0.000165,9.8e-05,0.000192,4.9e-05,0.000106,0.000157,0.000321,0.000231,2.4e-05,0.000395,0.000182,0.000911,0.001015,0.001447,0.001199,0.00084,0.000416,0.001566,0.001693,0.001773,0.001501,0.000906,0.001208,0.000646,0.000112,0.000689,0.00074,0.000763,0.000448,0.000137,6.3e-05,0.000245,0.00024,0.000226,0.000425,5.3e-05,0.000161,0.000586,0.000641,0.000854,0.000824,0.000668,0.00122,0.000886,0.000189,8.7e-05,0.000234,3.8e-05,7.4e-05,0.000198,0.000185,0.000388,0.000262,8.4e-05,0.000273,0.00024,0.000212,0.000176,0.000193,7.3e-05,9.1e-05,0.000227,0.00023,0.00015,6.8e-05,0.000289,0.000167,0.000119,0.000144,0.000551,0.001062,0.000859,0.000842,0.000919,0.000875,0.000843,0.000982,0.00047
0.000574,0.000492,0.00077,0.001334,0.000956,0.000897,0.000474,0.000456,0.000205,0.000605,0.000183,0.000187,9.9e-05,0.000115,8.4e-05,0.000152,3e-04,0.000482,0.000549,0.000369,0.000516,0.000756,0.000543,0.000306,0.000398,0.000127,0.000154,0.00034,0.000229,0.000478,0.000515,0.000481,0.000127,0.000142,8.5e-05,0.000159,0.000235,6.5e-05,0.000249,0.000397,9e-05,6.2e-05,0.000101,6.9e-05,0.000122,0.000126,5.2e-05,4.2e-05,0.000103,0.000146,0.000214,0.000171,0.000321,0.000619,0.000643,0.000724,0.000346,0.000967,0.000192,0.000552,0.001785,0.001166,0.000547,0.000273,0.000634,0.000429,0.000349,0.000303,0.000324,0.000181,1e-04,6.6e-05,0.000266,0.000122,9.2e-05,0.000136,0.000112,0.000257,0.000104,0.000137,0.000539,0.000483,0.000557,0.000102,0.000393,0.000742,0.000333,0.000371,0.000115,5.6e-05,0.000401,0.000457,0.000179,5.3e-05,0.000284,6.9e-05,9.6e-05,6.3e-05,8.9e-05,0.000196,3.2e-05,0.000164,0.000122,0.000144,0.000139,0.000158,0.000101,4.6e-05,0.000228,0.000269,0.000301,0.000193,0.000702,0.001281,0.000813,0.000816,0.000882,0.000427,0.000479,0.000418,0.000222
0.000442,0.000596,0.00064,0.000727,0.000392,0.000675,0.000247,0.000209,0.00037,0.00026,0.000115,9.1e-05,1e-04,9.1e-05,6.1e-05,0.000131,0.000198,9.5e-05,0.000154,8.2e-05,0.000202,0.000734,0.000209,0.000243,0.000195,0.000144,0.000206,0.000167,0.000104,0.000404,0.000223,0.000207,4.8e-05,0.00013,0.000269,0.000107,7.2e-05,7.6e-05,0.00018,1e-04,8.2e-05,5.2e-05,6.5e-05,5.5e-05,0.000111,8.8e-05,7e-06,3.6e-05,0.000125,0.000143,0.000155,0.000233,0.000452,0.000346,0.000317,0.000323,0.000228,0.000541,0.000578,0.00057,0.001201,0.000784,0.000932,0.001224,0.000624,0.000602,0.000392,0.000336,0.000231,9.4e-05,0.000242,0.00012,0.000265,7.8e-05,0.000154,0.000158,9.5e-05,7.8e-05,0.000126,0.000271,0.000321,0.000153,0.000571,0.000213,0.000222,0.000179,0.000165,0.000472,0.000369,0.000255,0.000482,0.000193,4.9e-05,7e-05,0.00022,0.000149,0.000381,0.00015,0.000168,8.5e-05,0.000192,0.000224,6e-05,8.5e-05,0.000214,0.000225,0.000112,2.9e-05,0.000128,6.8e-05,0.000213,0.00011,0.000327,0.000662,0.000175,0.000209,0.001229,0.001173,0.000866,0.000228,0.00021
0.000384,0.001124,0.000774,0.000805,0.000492,0.000438,0.000215,8.1e-05,0.000153,0.000243,4.7e-05,9.5e-05,0.000165,0.000235,0.000165,0.00023,0.000207,0.000126,4.4e-05,0.000137,0.000305,0.000397,0.000189,7.7e-05,6.6e-05,9.3e-05,8.6e-05,0.000132,0.00011,0.000191,7.8e-05,0.000113,7.7e-05,0.000198,0.000165,0.000113,5.5e-05,0.000208,0.000155,0.000416,0.000144,1.8e-05,3.3e-05,0.00024,0.000122,3.6e-05,7.2e-05,7.8e-05,0.000142,0.000161,0.000216,0.000113,0.000193,0.000371,0.00045,0.000181,0.000371,0.000565,0.000448,0.00022,0.000532,0.000509,0.000877,0.000735,0.000364,0.000351,0.000303,0.000122,0.00012,0.000163,0.000198,0.000214,9.1e-05,3.6e-05,0.000142,8.4e-05,8.8e-05,0.000122,9e-06,8.9e-05,0.00014,0.000296,0.000359,0.000377,0.000167,0.000252,0.00023,0.000372,0.000236,4.7e-05,0.000231,0.000191,7.3e-05,1e-04,0.000193,0.000161,3e-04,0.00021,0.000227,3.7e-05,0.000251,0.000309,8.6e-05,0.000102,7.4e-05,0.000226,6.3e-05,5.2e-05,5.8e-05,0.000123,0.000106,9.9e-05,0.000209,0.000376,0.000732,0.000534,0.00058,0.00068,0.000597,0.000403,0.000198
0.000308,0.000767,0.000106,0.000272,0.000139,0.000496,0.00032,3.4e-05,0.000256,0.000188,2.4e-05,0.000178,0.000207,0.000125,0.000189,5.3e-05,7.7e-05,6.5e-05,9e-05,4.7e-05,0.000283,0.000537,0.00019,0.000261,0.000187,0.000181,3.7e-05,0.000209,0.000209,0.000221,7e-05,5.3e-05,9.3e-05,7.4e-05,5e-05,0.000126,0.000118,0.000156,0.000166,0.000704,0.000202,5.4e-05,3.5e-05,0.00032,7.8e-05,2.5e-05,7e-05,3.7e-05,6.2e-05,0.00024,5.4e-05,0.000232,0.00029,0.000306,0.000185,0.000134,0.000521,5.7e-05,0.000183,0.000233,0.000415,0.000212,0.000563,0.000284,0.000256,5.7e-05,0.000244,0.000126,9.6e-05,0.000123,0.000176,3.2e-05,0.000215,0.000174,0.000145,3.3e-05,0.000117,3.7e-05,6.2e-05,0.000166,0.000165,0.000316,0.000206,0.000339,8.9e-05,0.000258,9.6e-05,0.000239,0.000107,9e-05,0.000171,0.000262,0.000182,0.000187,0.000156,9.5e-05,0.000278,4e-05,0.000416,7.7e-05,0.00035,0.000163,7.1e-05,7.6e-05,3.6e-05,0.000327,9.1e-05,0.000104,5.7e-05,0.000135,6.1e-05,0.000133,0.000478,0.00032,0.000586,0.000215,0.00026,0.000347,0.000217,0.000111,0.000173
0.000155,0.000536,0.000586,0.000216,0.00053,0.00017,0.000159,0.000399,0.000419,0.000283,9.1e-05,0.000161,0.00015,0.000233,7.4e-05,9e-05,2e-05,0.000136,8.6e-05,6.3e-05,0.000159,0.000448,0.000639,0.000734,0.00051,0.000546,0.000258,0.000245,0.000194,0.000228,0.000266,0.000217,0.000327,0.000173,9.8e-05,0.000152,0.000154,0.000501,3.3e-05,0.000654,0.000443,0.000152,5.4e-05,0.000139,0.000214,3.2e-05,3.3e-05,6.5e-05,9.6e-05,0.000225,0.000129,0.000208,3.9e-05,9.4e-05,8.5e-05,0.000308,0.000434,0.000244,7.9e-05,0.000311,0.000176,9.3e-05,0.000407,0.000304,0.000115,3.8e-05,0.000236,0.000151,2.1e-05,8.9e-05,9.9e-05,6.3e-05,0.000207,0.000133,0.000148,0.000188,0.00011,0.000323,0.000244,0.00039,0.000115,0.000231,0.000127,3e-05,0.000145,0.00016,0.000106,0.000203,0.000138,0.000235,0.00034,0.000874,0.000284,0.000313,0.000639,0.000159,0.000177,0.000854,0.000436,0.000226,0.000425,0.000735,6.1e-05,2.8e-05,0.000141,0.000903,0.000254,7.5e-05,6.4e-05,9.4e-05,9.6e-05,8e-05,0.000258,0.000197,0.000137,8e-05,0.00016,0.00022,0.000301,0.000181,6.4e-05
0.000421,0.000605,0.000615,0.000938,0.001096,0.000562,0.000493,0.000539,0.000439,0.00037,0.000103,5.6e-05,0.000122,0.000161,0.000157,0.000202,0.000164,0.000213,0.000138,9.4e-05,3.3e-05,0.000593,0.00124,0.000591,0.000783,0.000333,8.7e-05,8.6e-05,0.000356,0.000246,0.000324,8.9e-05,0.000289,0.000224,0.000214,6.7e-05,0.000347,0.000698,0.00059,0.000608,0.001054,6e-04,0.000122,0.000252,0.000358,0.000349,0.000194,0.000144,0.000192,8e-05,1.9e-05,5.1e-05,0.000219,0.000158,6.3e-05,0.000414,0.000393,0.000388,0.000267,0.00024,0.000105,7.4e-05,0.000306,0.000391,0.000335,0.000236,0.000314,0.000109,1e-05,0.000113,0.00015,6.9e-05,0.00014,0.000121,0.000232,0.000524,0.000445,0.000653,0.000543,0.000384,0.00053,0.000403,0.000187,0.000193,0.000193,8.5e-05,0.000147,0.000237,0.000203,6.4e-05,0.000222,0.00091,0.000743,0.000401,0.000691,0.000573,0.000204,0.001363,0.001231,0.001087,0.000218,0.001032,0.000789,0.000354,0.00012,0.001651,0.001044,0.000765,0.000295,6.2e-05,0.000128,0.000309,0.00033,9.4e-05,0.000249,0.000166,0.000158,0.000256,0.00021,0.000154,0.000161
0.000361,0.000188,0.000314,0.000598,0.000585,0.000337,0.000327,0.000465,0.000171,0.000274,0.000281,3.5e-05,0.000264,0.000248,0.000137,5.9e-05,6.5e-05,8.2e-05,6.8e-05,0.000175,0.000245,0.000487,0.001041,0.000861,0.000703,0.000562,0.000481,0.000312,0.000376,0.000484,0.000345,0.000216,0.000115,3.5e-05,2.4e-05,2.7e-05,0.00038,0.000768,0.000563,0.000363,0.001334,0.000637,7e-05,0.000437,0.000743,0.000267,6.2e-05,0.000127,0.000225,0.000284,0.000195,8e-05,0.00023,0.000196,0.000171,0.00047,0.00036,0.000192,0.000218,0.000121,0.000232,0.000124,0.000404,0.000684,0.000251,7.1e-05,0.000146,0.000134,0.000113,0.000134,7.3e-05,4.9e-05,8.9e-05,0.000199,0.000198,0.000403,0.000272,0.000298,0.000184,0.000427,0.000238,0.000111,0.000258,0.000352,3.1e-05,0.000199,0.000368,0.00018,0.000129,8.3e-05,0.000139,0.000774,0.000699,0.000156,0.00021,0.000211,0.000291,0.001474,0.001102,0.000584,0.000403,0.000883,0.000969,0.000528,0.000113,0.002313,0.002077,0.000862,0.000452,0.000213,0.000278,0.00039,0.000151,0.000165,0.00033,0.000156,7.1e-05,0.000153,0.000168,0.000164,0.000186
0.000383,0.000531,0.000466,0.000623,0.000275,0.000288,0.000445,0.00024,0.000215,0.000251,7.9e-05,0.000123,0.000293,0.000185,8.1e-05,2.1e-05,7.7e-05,9.6e-05,0.000159,8.3e-05,9.6e-05,0.000162,0.000487,0.000212,0.00017,3.7e-05,0.000144,8.9e-05,0.000112,0.000192,5.7e-05,0.000124,2.1e-05,0.000119,0.000124,0.000105,0.000251,0.000776,0.000412,0.000672,0.000985,0.000618,0.000365,0.000552,0.000637,0.00033,0.000146,3.6e-05,8.5e-05,7.3e-05,7.3e-05,0.000123,6.7e-05,0.000257,7.4e-05,0.000442,0.000446,0.000429,0.000283,0.00035,0.000231,0.000326,6.3e-05,0.000247,0.000158,0.000146,2.7e-05,8.1e-05,0.000121,8e-05,9.8e-05,0.000135,0.000116,7.2e-05,5.7e-05,0.000288,0.000163,0.000112,1.3e-05,0.000234,0.000138,0.000122,9.9e-05,0.000114,0.00019,0.000295,0.000289,0.000154,4.7e-05,9.4e-05,0.000269,0.00078,0.000404,0.000394,0.000278,9e-05,0.000317,0.001408,0.000643,0.000502,0.000347,0.000845,0.000429,6.3e-05,0.000413,0.002381,0.001422,0.000623,0.000207,0.000196,0.000196,0.000124,0.000345,0.000178,0.000222,9.4e-05,0.000125,8.1e-05,9.9e-05,8.7e-05,0.000116
0.000177,0.000353,0.000172,0.000146,0.000151,0.000148,0.000223,0.000187,0.000182,8.8e-05,7.9e-05,6.7e-05,0.000138,9.2e-05,5.3e-05,9.5e-05,8.1e-05,9.5e-05,2.4e-05,7.7e-05,6.8e-05,0.000265,0.000127,0.000163,0.000101,5.8e-05,2.6e-05,6.4e-05,9.1e-05,5.5e-05,2.8e-05,8.3e-05,3.6e-05,5e-05,7.9e-05,5.1e-05,0.000288,0.00031,9.6e-05,0.000861,0.000188,0.000147,8.8e-05,0.000528,0.00012,8.1e-05,2.5e-05,1.2e-05,6.1e-05,5.5e-05,4.5e-05,5e-05,8.8e-05,0.000169,0.000112,0.000172,0.00019,2.2e-05,0.000235,0.000161,0.000109,0.000118,0.000116,0.000204,7.8e-05,0.000154,3.1e-05,2e-05,8.3e-05,4.9e-05,5.3e-05,8.6e-05,2.1e-05,8.9e-05,0.000124,0.000152,0.000129,0.000152,6.4e-05,0.000108,9.8e-05,4.1e-05,9.5e-05,4.7e-05,0.000139,0.000225,5.5e-05,3.2e-05,4.3e-05,5e-05,0.000166,0.000499,0.000173,0.000233,0.000158,8.1e-05,0.000348,0.000516,0.000485,0.000109,0.000282,0.000119,0.000247,0.000203,0.000422,0.001064,0.000312,7e-05,9.7e-05,1.8e-05,0.000148,6.7e-05,0.000207,8.9e-05,0.000116,7.6e-05,6.2e-05,7e-05,8.2e-05,2e-05,1.1e-05
0.000191,7.5e-05,0.000127,0.000162,6.2e-05,0.000171,0.000129,9.2e-05,2.2e-05,3e-05,6.3e-05,0.00013,2e-05,6e-05,1.9e-05,6e-05,4e-05,6.4e-05,2.5e-05,5.5e-05,9.8e-05,0.000282,0.000134,0.000145,6.8e-05,0.000145,0.00021,0.000156,5e-05,2.6e-05,3.8e-05,6.7e-05,3.4e-05,5.6e-05,5.2e-05,5.4e-05,0.000234,0.000218,4.6e-05,0.000702,0.000281,0.000113,9.5e-05,0.00028,9.6e-05,6e-05,4.6e-05,4.2e-05,1.4e-05,6e-05,6.6e-05,6.1e-05,7.5e-05,0.00015,5.9e-05,0.000116,0.00021,1e-04,0.00021,0.000288,9.3e-05,7.5e-05,8.9e-05,7.7e-05,5.1e-05,7.8e-05,5.2e-05,3.7e-05,1.9e-05,3.1e-05,5.6e-05,5.7e-05,7.1e-05,9.9e-05,0.000115,0.000106,0.000114,0.000229,3e-05,0.000149,0.000142,2.3e-05,8.8e-05,3.9e-05,0.000152,0.000221,9.9e-05,7.2e-05,4e-06,3.5e-05,0.000131,7.9e-05,0.000111,0.000168,5.2e-05,1.5e-05,0.000343,0.000262,0.000117,8.6e-05,0.000287,0.000296,0.000127,0.000183,0.000658,0.000378,0.000206,1.9e-05,5.7e-05,4.6e-05,0.000178,5.5e-05,0.000101,0.000129,0.000128,4.1e-05,6.6e-05,8e-06,5e-05,3e-06,2.2e-05
0.000156,0.000229,0.000155,0.000167,2.9e-05,0.000139,9e-05,9.5e-05,1.9e-05,4.1e-05,9.1e-05,6.2e-05,7e-05,5.1e-05,9e-06,4.7e-05,1.7e-05,6.5e-05,4e-05,1.7e-05,0.000109,0.000169,7.4e-05,0.000105,4.7e-05,5.6e-05,0.000116,9.6e-05,8.8e-05,7.2e-05,5e-05,2.6e-05,7.7e-05,8e-05,5.5e-05,6e-05,0.000214,0.000229,1e-04,0.000357,8.6e-05,4.5e-05,0.000104,8.2e-05,6.5e-05,2.8e-05,4.8e-05,5.8e-05,3.5e-05,4.1e-05,0.000122,2.4e-05,0.000192,0.000124,0.000147,0.000161,0.00039,9.8e-05,0.00015,4.1e-05,9.1e-05,7.7e-05,5.6e-05,0.000134,0.000105,8.1e-05,8.9e-05,7.5e-05,7.1e-05,1.2e-05,1.8e-05,6.7e-05,7.5e-05,8e-05,0.000119,9.3e-05,0.000154,7.2e-05,3.6e-05,7.4e-05,0.000163,0.000127,0.000104,9.3e-05,5.6e-05,0.00014,9.7e-05,1e-04,6.3e-05,3.5e-05,0.000113,0.000201,2.8e-05,0.000213,0.000102,5e-05,0.000261,0.000215,8.2e-05,6.4e-05,0.000285,0.000114,6.8e-05,5.4e-05,0.000579,0.000429,9.7e-05,6.9e-05,3.2e-05,4.5e-05,0.000162,0.000111,0.000227,0.000215,0.000295,0.000137,5.8e-05,5.3e-05,4.7e-05,5.3e-05,4.9e-05
0.000115,0.000239,0.000244,0.000172,9.4e-05,0.000128,8.3e-05,8e-05,4e-05,5.6e-05,7.7e-05,0.000133,0.000106,7.7e-05,3e-05,6.5e-05,2.6e-05,6.5e-05,7.1e-05,6.8e-05,9.7e-05,0.000232,0.000172,0.000171,3.7e-05,1.7e-05,5.3e-05,0.000132,0.000185,9e-05,7.5e-05,6.2e-05,5.4e-05,2.4e-05,2.5e-05,2.9e-05,9.2e-05,0.000104,5.3e-05,0.000383,0.000173,5.3e-05,9.1e-05,0.000195,8.4e-05,1.3e-05,1.4e-05,5.2e-05,2.6e-05,5.7e-05,0.000208,0.000172,0.000298,0.000277,0.000182,4.6e-05,0.000313,0.000188,0.000162,0.000187,5.6e-05,1.6e-05,4.6e-05,0.000102,0.000103,0.000199,0.000109,3e-05,6.6e-05,1.9e-05,2.3e-05,4.9e-05,0.000102,0.000136,0.000113,0.000154,0.000261,0.000213,8.3e-05,3.6e-05,0.000104,8.5e-05,9.2e-05,0.000132,8.2e-05,0.000114,0.000171,8.1e-05,6.3e-05,2.3e-05,0.000129,0.000138,9.7e-05,0.000181,4.3e-05,1.1e-05,0.000162,0.000145,0.000217,0.000157,0.000222,0.000113,8.4e-05,1.4e-05,0.000684,0.000794,0.000253,1.9e-05,6.6e-05,1.5e-05,0.000125,0.000107,0.000172,7.5e-05,6.9e-05,0.000107,8.8e-05,2.4e-05,3.2e-05,1e-05,7.3e-05
0.000154,0.00038,0.000338,7.1e-05,7.2e-05,6.1e-05,9.6e-05,5.6e-05,3.1e-05,2.8e-05,4e-05,8.9e-05,1.7e-05,4.9e-05,4.3e-05,4.4e-05,1e-05,3.7e-05,8.4e-05,1.8e-05,7.6e-05,0.000289,0.000164,7.6e-05,0.000148,0.000103,0.00013,0.000202,3.9e-05,1.1e-05,6.9e-05,6.2e-05,0.000103,8.7e-05,6.5e-05,4.4e-05,7.1e-05,9e-05,0.000102,0.000496,0.000337,0.00017,8.1e-05,0.000212,0.000128,9.1e-05,1.1e-05,5.2e-05,4.3e-05,6.1e-05,0.00021,0.000174,0.000116,0.000193,0.000157,0.00011,0.000215,9e-06,8.8e-05,0.000112,0.000134,1.4e-05,3.4e-05,5.8e-05,0.000126,0.000157,0.000117,4.9e-05,0.000185,0.000157,7.4e-05,6.4e-05,9.3e-05,2.3e-05,2.4e-05,8.3e-05,9.1e-05,0.000117,6.3e-05,0.000243,0.000352,0.000206,1.7e-05,0.000193,0.000229,1e-05,1.6e-05,5e-05,1.4e-05,3.7e-05,6.7e-05,0.000155,0.00011,0.000266,0.000213,0.000124,5.6e-05,0.000144,7.9e-05,7.8e-05,0.000167,9e-05,6.3e-05,6.3e-05,0.000741,0.000714,0.000398,6.3e-05,0.000125,9.9e-05,0.000179,7e-05,0.000163,2.2e-05,4.9e-05,0.00014,0.00025,0.000147,6.6e-05,9.8e-05,1e-04
4.5e-05,0.000158,0.000122,0.000145,4e-05,9.2e-05,0.00013,1e-04,7.5e-05,6.6e-05,3.3e-05,4.7e-05,4e-06,6.7e-05,3.3e-05,2.9e-05,4e-05,2.7e-05,3.5e-05,5.5e-05,8.2e-05,0.000209,0.000238,0.000246,0.000218,4.5e-05,0.000242,6.7e-05,6.4e-05,9.7e-05,3.4e-05,6.8e-05,6.2e-05,9e-06,6.7e-05,1.5e-05,8.2e-05,0.000164,6.8e-05,0.000413,0.000197,0.000117,7.7e-05,0.00016,9.2e-05,1.2e-05,5e-05,4.8e-05,5e-06,2.8e-05,0.000159,3.9e-05,0.00012,4.8e-05,1.4e-05,7.5e-05,0.000338,0.000136,0.000179,0.000118,0.00017,0.00015,0.00012,9.1e-05,8e-05,5.2e-05,0.000113,0.000128,0.000188,0.000141,5.8e-05,3.9e-05,7.2e-05,4e-06,8.6e-05,5.2e-05,2.6e-05,0.000221,8.6e-05,0.000236,0.000321,0.000188,0.000136,0.000178,0.000159,0.000195,0.000158,9e-06,5.1e-05,4.4e-05,8.6e-05,0.000128,2.7e-05,0.000182,0.000181,0.000107,0.000107,0.000222,0.000164,3.8e-05,4.4e-05,0.000173,7.9e-05,7.3e-05,0.000796,0.000609,0.000273,0.000133,0.000137,9.9e-05,0.000122,5.5e-05,9.7e-05,0.000192,6.4e-05,0.000145,0.000182,0.000235,0.000111,0.000229,0.000152
6.5e-05,0.000146,0.000271,0.000289,0.000118,0.000209,9.7e-05,0.000109,7.7e-05,3.2e-05,3e-05,4.1e-05,2e-05,5.2e-05,1.6e-05,4e-05,4.4e-05,3.2e-05,5.6e-05,6.6e-05,9e-05,0.000183,0.000225,0.000234,0.000475,0.000355,0.00033,0.00013,1.5e-05,0.000141,0.000144,0.000118,6e-05,2.1e-05,4.4e-05,7.1e-05,0.000112,0.000227,0.000105,0.000111,9.6e-05,0.000107,4.6e-05,2.8e-05,2.7e-05,2.2e-05,1.1e-05,3.3e-05,2.7e-05,4.8e-05,0.000103,8.8e-05,0.000142,5.6e-05,5.7e-05,6.4e-05,0.000445,0.000449,0.000156,5.4e-05,0.000122,0.000132,0.000108,0.000172,0.000121,6e-05,6.8e-05,3e-05,7e-05,1.9e-05,3.2e-05,6.2e-05,0.000128,9.2e-05,0.000193,6.3e-05,3.2e-05,0.000228,0.000165,0.000199,0.000508,0.000322,0.000421,0.000194,7.3e-05,0.000128,6.2e-05,4.9e-05,9.2e-05,6.3e-05,0.000104,0.000101,9e-05,0.000186,0.000145,6e-05,0.000145,0.000126,4.5e-05,5e-05,0.000151,6.3e-05,2.3e-05,1.5e-05,0.000809,0.000339,0.000332,0.000108,7.9e-05,0.000119,0.00018,0.000197,0.000377,0.000114,1.5e-05,0.00017,0.000118,0.000261,0.000153,0.000122,0.000127
3.7e-05,0.000163,0.00021,0.000233,0.000153,9.3e-05,0.000101,6.3e-05,2.3e-05,2.4e-05,2.1e-05,1.1e-05,3.3e-05,6.1e-05,2.7e-05,1.6e-05,5.3e-05,6.3e-05,7.9e-05,0.000118,0.000185,8.9e-05,0.000144,0.000289,0.00048,0.000428,0.000172,0.000103,1.2e-05,0.000114,8.3e-05,0.000108,9e-05,7.9e-05,2.2e-05,3e-05,0.00019,0.000327,0.00027,0.000297,0.000276,0.000179,8.3e-05,0.000176,5.2e-05,4.1e-05,5.6e-05,2.6e-05,2.1e-05,3.6e-05,6.5e-05,4.7e-05,0.000115,0.000133,0.000172,0.000185,0.000222,0.000404,0.000158,0.000181,9e-05,2.9e-05,0.000129,0.000149,9.4e-05,8.4e-05,5e-05,6.9e-05,8.9e-05,6.8e-05,1.5e-05,5.2e-05,7.2e-05,0.000128,0.000323,0.000362,0.000185,0.000105,0.000233,0.000318,0.000653,0.000294,0.000231,0.000136,8.7e-05,0.000166,0.000172,0.000118,9.4e-05,2.4e-05,8e-05,0.000204,0.000131,0.000122,0.000244,0.000167,0.000294,0.000168,0.000103,4.2e-05,0.000166,8.7e-05,7.4e-05,8.9e-05,0.000833,0.000388,0.000247,0.00021,0.000128,3.5e-05,8.9e-05,6e-05,0.000256,0.000242,0.000156,8.3e-05,0.000276,0.00019,0.000139,8.6e-05,2.7e-05
3.7e-05,0.000139,0.000408,0.000614,0.000334,0.000278,8.1e-05,5.8e-05,3.4e-05,3.3e-05,1.5e-05,7e-06,4.5e-05,2.8e-05,3e-05,1.4e-05,8e-06,8.3e-05,8.3e-05,3.3e-05,0.000167,0.000332,0.000187,0.000151,0.000211,0.000113,4.5e-05,8.5e-05,0.000105,3.3e-05,0.000143,0.000181,6.2e-05,8.5e-05,1.2e-05,2e-05,0.000218,0.000393,0.000177,0.000582,0.000358,0.000132,3.2e-05,0.000217,0.00015,2e-05,2.6e-05,1.4e-05,9.3e-05,1e-06,7.6e-05,0.000125,8.5e-05,8.7e-05,0.000101,0.000149,0.000119,0.000334,0.000301,0.000353,0.000251,6.7e-05,3.8e-05,3.1e-05,1.4e-05,3.5e-05,3.3e-05,4.2e-05,7.6e-05,5.9e-05,7.3e-05,2.9e-05,3.2e-05,5.6e-05,3e-04,0.000385,0.000213,0.000213,0.000204,0.000205,0.00028,0.000195,0.000209,0.000206,4.5e-05,0.000167,5e-05,2.4e-05,2.4e-05,5.3e-05,9.5e-05,0.000218,0.00011,0.000107,0.000408,0.000178,0.000319,0.000282,0.000213,8.5e-05,0.000248,9.5e-05,6.6e-05,0.000141,0.000886,0.000712,0.000357,0.000171,4.7e-05,1.6e-05,1.9e-05,0.000129,0.000129,0.000162,0.000129,6e-06,0.000288,0.000361,0.000213,4.1e-05,9.3e-05
0.000203,0.00017,0.000399,0.000417,0.00019,0.000382,0.000236,0.000119,8.1e-05,2.3e-05,4.5e-05,2.2e-05,5.7e-05,5.2e-05,2.3e-05,3.7e-05,5.6e-05,5e-05,1.5e-05,2.3e-05,0.00013,0.000136,5.1e-05,0.000165,9.9e-05,0.000136,0.000179,0.000192,0.000102,6.3e-05,9.5e-05,2.4e-05,0,5.3e-05,7.4e-05,5.1e-05,0.000234,0.000357,0.000141,0.000583,0.00031,0.000123,2e-05,0.00023,0.000115,8.2e-05,4.6e-05,4e-05,0.000151,0.000226,0.000123,0.000135,8.7e-05,0.000187,0.000204,8.3e-05,0.000217,0.000356,0.000104,0.000222,7.7e-05,0.000118,0.000124,8.4e-05,4.1e-05,9e-06,5.6e-05,6.3e-05,5.1e-05,6.5e-05,7.5e-05,4e-05,2.6e-05,4.6e-05,0.000161,8.6e-05,7.1e-05,0.000191,8.5e-05,0.000175,8.3e-05,0.000101,0.000194,6.2e-05,5.1e-05,0.000117,0.000195,0.000149,6e-05,1.7e-05,6e-05,9.3e-05,3e-05,0.000114,0.000377,0.00021,0.000293,0.000333,9.3e-05,5.9e-05,0.000269,0.000187,0.00021,0.000254,0.000824,0.000991,0.000486,0.000203,9.1e-05,3.3e-05,5.3e-05,0.000157,0.000134,0.000253,0.000302,0.000264,0.000127,0.000177,0.000166,0.000196,9.1e-05
0.000148,0.000171,0.00018,0.000173,8.4e-05,0.00027,0.000141,0.000123,0.000125,4e-05,6e-05,5e-05,3.6e-05,2e-05,3.7e-05,5.2e-05,2.6e-05,3.3e-05,2.1e-05,2.6e-05,0.000109,0.000113,7e-06,0.000135,7.4e-05,7.6e-05,0.000141,5.6e-05,5.9e-05,4.4e-05,7.5e-05,7.6e-05,2.8e-05,4.4e-05,0.000127,7.3e-05,0.000256,0.000279,0.000158,0.000465,0.000233,6.5e-05,1.6e-05,0.000205,0.000139,0.000107,4.7e-05,3e-05,0.000117,0.000192,0.000182,5.8e-05,8.7e-05,9.3e-05,6e-05,0.000112,0.000295,0.000235,0.000178,0.00015,0.00018,0.000206,8.8e-05,3.6e-05,4.5e-05,8.8e-05,9e-06,3.8e-05,4.4e-05,6e-05,6e-06,4.4e-05,3.6e-05,5.1e-05,0.000115,0.000174,0.000171,7.3e-05,7.5e-05,5.6e-05,5.2e-05,0.000185,8.9e-05,5.1e-05,1e-05,0.000135,0.000121,1.9e-05,4.9e-05,2.9e-05,3.8e-05,4.7e-05,5.9e-05,0.000109,0.000208,9e-05,0.000204,0.000103,5.9e-05,2.8e-05,0.000242,0.000213,7.3e-05,0.00013,0.000741,0.000951,0.000394,0.00013,0.000102,9.6e-05,0.000147,5.7e-05,9e-05,0.000151,0.000196,0.000254,7.5e-05,0.000155,0.000122,2e-05,1.3e-05
5.9e-05,4.4e-05,4.6e-05,3.3e-05,2.4e-05,5.6e-05,4.9e-05,1.4e-05,3.6e-05,4.6e-05,2.4e-05,2.7e-05,1.4e-05,6e-06,2e-06,1.6e-05,1.9e-05,1.8e-05,5e-06,1.1e-05,3e-05,4.8e-05,3.2e-05,3.4e-05,1.4e-05,1.5e-05,0.000103,7e-05,4.1e-05,4.8e-05,2.7e-05,2.9e-05,6e-06,2.1e-05,4.5e-05,2.7e-05,0.000103,5.9e-05,5e-05,0.000134,8.4e-05,2.5e-05,7e-06,7.8e-05,3.8e-05,1e-05,3.9e-05,4.1e-05,5.3e-05,0.000111,6.7e-05,4.8e-05,4.9e-05,4e-05,4.2e-05,4.2e-05,2.4e-05,5.6e-05,8.5e-05,4e-05,5.9e-05,3.2e-05,7.5e-05,8.6e-05,1.2e-05,3.2e-05,2.7e-05,1.7e-05,9e-06,1.3e-05,1.2e-05,2.5e-05,1e-05,6e-06,3.6e-05,3.9e-05,3.6e-05,4.6e-05,7.1e-05,3.9e-05,7.8e-05,0.000151,6e-05,1.8e-05,2.6e-05,5e-05,1.5e-05,9e-06,3.4e-05,3.3e-05,1.5e-05,1.3e-05,9e-06,6.5e-05,6.5e-05,3.1e-05,8.9e-05,6.3e-05,1.6e-05,8e-06,9.5e-05,5.8e-05,7.2e-05,0.000103,0.000342,0.000227,0.000136,6.6e-05,2.8e-05,3.8e-05,4.5e-05,3.5e-05,1.1e-05,6e-05,2.6e-05,6.9e-05,7e-06,7.8e-05,1.8e-05,2.6e-05,3.8e-05
2.5e-05,2.1e-05,1.8e-05,2.1e-05,1.7e-05,1.4e-05,1.8e-05,3e-06,1.7e-05,4.3e-05,2.2e-05,1.1e-05,5e-06,3e-06,1.1e-05,1.3e-05,8e-06,1.9e-05,9e-06,6e-06,2.9e-05,4.4e-05,3.9e-05,7.4e-05,6.7e-05,5e-05,4.6e-05,5e-06,4.7e-05,4.5e-05,2.9e-05,2.1e-05,9e-06,1.8e-05,8e-06,8e-06,9.4e-05,4.8e-05,2.2e-05,6.4e-05,1.5e-05,1.6e-05,7e-06,5.9e-05,3.4e-05,7e-06,1.9e-05,3.9e-05,4.2e-05,6.7e-05,7e-06,1.8e-05,9e-06,2.6e-05,1.7e-05,4.4e-05,0.000105,4.7e-05,1.3e-05,4.1e-05,5.3e-05,3.5e-05,5.1e-05,2e-05,3.9e-05,1.7e-05,1e-05,1.8e-05,1.4e-05,1.3e-05,6e-06,2.5e-05,9e-06,2.3e-05,1.4e-05,2e-05,2.8e-05,3.1e-05,4.4e-05,2.3e-05,5.7e-05,9.9e-05,5e-05,3.5e-05,1.3e-05,4.2e-05,3.5e-05,1.8e-05,1.1e-05,2.2e-05,1e-05,9e-06,1.4e-05,5.4e-05,3.6e-05,2.2e-05,7.7e-05,5.4e-05,2.1e-05,1.7e-05,7.7e-05,7.5e-05,8.5e-05,3.6e-05,0.000274,0.00016,6.8e-05,4.8e-05,5.3e-05,1.3e-05,4.5e-05,1.3e-05,5e-05,6.8e-05,2.2e-05,5.6e-05,4e-06,7.1e-05,3.9e-05,3.8e-05,1.6e-05
1.4e-05,1.3e-05,1e-05,6.4e-05,2.5e-05,1.3e-05,3.8e-05,1.9e-05,1e-05,2.4e-05,9e-06,1.6e-05,6e-06,8e-06,9e-06,7e-06,5e-06,1.3e-05,6e-06,8e-06,2.6e-05,3.3e-05,7.9e-05,5.4e-05,2.6e-05,4e-06,2.2e-05,2.8e-05,5e-05,1.4e-05,2.5e-05,2.4e-05,1.3e-05,8e-06,7e-06,7e-06,6.5e-05,2.3e-05,1.5e-05,4.7e-05,3.2e-05,1.7e-05,1.2e-05,2.6e-05,1e-05,3.8e-05,3.1e-05,2.7e-05,1.2e-05,8e-06,2.5e-05,1.8e-05,1e-05,2.6e-05,2.6e-05,1e-05,7.8e-05,2.8e-05,1.8e-05,2.2e-05,2.9e-05,1.9e-05,9e-06,4.1e-05,2.8e-05,1.7e-05,1.8e-05,1.1e-05,1.6e-05,6e-06,8e-06,2e-05,9e-06,2.7e-05,2.4e-05,3.4e-05,2.6e-05,1.5e-05,3e-05,4.7e-05,2.3e-05,6.8e-05,6.4e-05,4.1e-05,2.7e-05,5.2e-05,2e-05,1.3e-05,1.6e-05,1.9e-05,8e-06,1.8e-05,8e-06,5.7e-05,1e-05,7e-06,4.5e-05,5.3e-05,1.9e-05,6e-06,6.2e-05,3.8e-05,6e-05,5.2e-05,0.00025,7.2e-05,7.2e-05,1.6e-05,1.9e-05,1.8e-05,2.8e-05,3.3e-05,4.3e-05,9e-06,1.4e-05,8.7e-05,4.4e-05,8e-06,1.9e-05,2.3e-05,2.3e-05
1.7e-05,4e-06,1e-05,5.4e-05,3.3e-05,3.3e-05,7e-06,1.1e-05,1.7e-05,1.2e-05,1.1e-05,1.7e-05,5e-06,9e-06,8e-06,8e-06,9e-06,1.3e-05,3e-06,5e-06,1.6e-05,3.5e-05,6.8e-05,5.9e-05,5.7e-05,5e-05,2.4e-05,2.1e-05,2.1e-05,1.4e-05,3e-06,1.2e-05,8e-06,3e-06,1.1e-05,7e-06,5.6e-05,1.9e-05,4e-06,2.8e-05,2.7e-05,9e-06,1.9e-05,8e-06,2.4e-05,3.4e-05,1.5e-05,2.8e-05,1.6e-05,3.3e-05,2.6e-05,1.6e-05,4e-06,1.9e-05,4.2e-05,2.8e-05,3.9e-05,2e-05,2.3e-05,3.5e-05,1.7e-05,2e-05,2e-06,2.4e-05,1.2e-05,3e-05,1.7e-05,1e-05,1e-05,9e-06,5e-06,1.3e-05,1e-05,1e-05,1.8e-05,2.5e-05,2.2e-05,2.2e-05,1.4e-05,3.3e-05,1.4e-05,2.2e-05,7e-06,1.6e-05,3.1e-05,1.9e-05,3.2e-05,1.8e-05,2.4e-05,1.4e-05,7e-06,1.8e-05,8e-06,4.8e-05,1.8e-05,1.6e-05,2.1e-05,3.8e-05,2.6e-05,1.5e-05,3.2e-05,6.2e-05,2.2e-05,5e-06,0.000189,7.3e-05,2.7e-05,1.7e-05,2.1e-05,1e-05,1.9e-05,9e-06,5.8e-05,2e-05,8e-06,5.9e-05,7e-06,1.8e-05,6e-06,9e-06,1.7e-05
1.7e-05,2e-06,9e-06,2.6e-05,9e-06,1.7e-05,4e-06,9e-06,5e-06,8e-06,3e-06,1.2e-05,7e-06,6e-06,2e-06,1e-05,3e-06,1.6e-05,5e-06,6e-06,1.5e-05,2.1e-05,3.8e-05,6e-05,2.6e-05,1.2e-05,8e-06,7e-06,2.1e-05,1.4e-05,1e-05,1.6e-05,1.2e-05,8e-06,7e-06,5e-06,3.6e-05,1.8e-05,1.8e-05,1.6e-05,2.3e-05,2e-05,1.9e-05,7e-06,1.6e-05,1.5e-05,8e-06,1.3e-05,1.3e-05,2.8e-05,6e-06,1.4e-05,8e-06,2.4e-05,3.5e-05,1.5e-05,4.3e-05,6e-06,1.8e-05,2.8e-05,1.6e-05,2e-06,3e-06,2.3e-05,1.7e-05,3.1e-05,1e-05,1.6e-05,1.3e-05,7e-06,4e-06,6e-06,2e-06,1e-05,9e-06,2.3e-05,2.9e-05,2e-06,2.6e-05,1.9e-05,3.1e-05,9e-06,1.3e-05,2.2e-05,1.9e-05,1.6e-05,5e-06,1.7e-05,1.2e-05,4e-06,6e-06,4e-06,1.4e-05,4.2e-05,4e-06,1.3e-05,1.9e-05,2.6e-05,1.1e-05,1.3e-05,1.6e-05,4.3e-05,1.9e-05,8e-06,0.000145,5.9e-05,4.1e-05,4e-05,2.4e-05,1.5e-05,9e-06,6e-06,4.6e-05,1.5e-05,2e-05,4.5e-05,2e-05,1.8e-05,5e-06,1.1e-05,1.7e-05
1.4e-05,3e-06,2e-06,3e-05,1e-05,3e-06,1.8e-05,7e-06,5e-06,1.6e-05,1e-06,1.5e-05,9e-06,2e-06,6e-06,1e-05,7e-06,1.4e-05,3e-06,7e-06,1.3e-05,2.6e-05,5.1e-05,3.1e-05,2.1e-05,1.5e-05,2.7e-05,1e-05,1.9e-05,6e-06,1.1e-05,8e-06,1.1e-05,6e-06,9e-06,4e-06,1.9e-05,1e-05,7e-06,6e-06,1.6e-05,1.9e-05,1.3e-05,1.5e-05,1.1e-05,6e-06,9e-06,7e-06,1.7e-05,3e-06,1.9e-05,1.7e-05,1e-06,2.2e-05,2.1e-05,1.8e-05,2.9e-05,7e-06,1.5e-05,2e-05,2.1e-05,2.1e-05,1.9e-05,1.4e-05,6e-06,1.8e-05,2e-06,1.5e-05,1.4e-05,5e-06,9e-06,6e-06,6e-06,1.5e-05,5e-06,2.4e-05,2.7e-05,1.6e-05,1.3e-05,5e-06,3.2e-05,2e-06,7e-06,1.3e-05,1.2e-05,4.1e-05,5e-06,8e-06,9e-06,8e-06,7e-06,1e-05,8e-06,3.7e-05,1.2e-05,6e-06,1.1e-05,4.2e-05,1.5e-05,1.2e-05,7e-06,2e-05,4e-06,4e-06,0.000101,2.7e-05,4.7e-05,5.2e-05,2.4e-05,7e-06,1.2e-05,9e-06,3.3e-05,1.2e-05,2.1e-05,3.8e-05,1.9e-05,1.4e-05,3e-06,4e-06,1.3e-05
9e-06,1.1e-05,1.1e-05,3.4e-05,1.3e-05,3.3e-05,1.8e-05,7e-06,9e-06,1.8e-05,9e-06,1.3e-05,1.1e-05,4e-06,5e-06,9e-06,1e-05,1.4e-05,1.5e-05,5e-06,6e-06,2.8e-05,6.1e-05,5.4e-05,1.2e-05,1.1e-05,4.1e-05,2.6e-05,2.7e-05,7e-06,3e-06,1.3e-05,1.4e-05,7e-06,6e-06,6e-06,1e-05,2e-05,5e-06,1.1e-05,2.7e-05,1.7e-05,3e-06,2.3e-05,2.3e-05,1.4e-05,1e-05,1.1e-05,1.2e-05,9e-06,8e-06,7e-06,8e-06,2.3e-05,2.1e-05,1.2e-05,1.8e-05,1.4e-05,1e-05,3.1e-05,1.9e-05,1.3e-05,1.2e-05,1.7e-05,1.8e-05,1.8e-05,4e-06,1.2e-05,1.5e-05,5e-06,4e-06,1.4e-05,9e-06,5e-06,3e-06,1.7e-05,1.8e-05,1.5e-05,9e-06,1e-05,3.2e-05,5e-06,7e-06,1.3e-05,1.3e-05,3.4e-05,2.8e-05,6e-06,1.4e-05,6e-06,8e-06,6e-06,7e-06,3.9e-05,1.8e-05,1.6e-05,1.7e-05,2.8e-05,1.1e-05,5e-06,1.4e-05,1.3e-05,6e-06,3e-06,7e-05,7.1e-05,1.9e-05,2.3e-05,3e-05,2.6e-05,8e-06,1e-05,4.3e-05,1.5e-05,1e-05,3.3e-05,1.6e-05,9e-06,6e-06,1.1e-05,2e-05
1.5e-05,7e-06,1.1e-05,3.2e-05,3e-06,2.5e-05,2.2e-05,4e-06,5e-06,1.4e-05,2e-06,5e-06,1e-05,4e-06,6e-06,3e-06,7e-06,7e-06,1.1e-05,9e-06,1.3e-05,1.8e-05,3.3e-05,4.2e-05,1.7e-05,1.8e-05,2.8e-05,2.7e-05,2.1e-05,9e-06,1.2e-05,1.7e-05,2.2e-05,5e-06,4e-06,6e-06,1e-05,3.2e-05,2.7e-05,2e-05,8e-06,1.6e-05,2.5e-05,2.3e-05,7e-06,8e-06,3e-06,1.2e-05,6e-06,2.3e-05,2e-05,1e-05,1.6e-05,1.6e-05,1.1e-05,3.9e-05,3.5e-05,1.9e-05,3.2e-05,2.3e-05,1.7e-05,1e-05,1e-05,7e-06,4e-06,1.9e-05,3e-06,1.3e-05,1e-05,1.1e-05,4e-06,1e-05,7e-06,9e-06,2e-06,1.6e-05,8e-06,2.3e-05,1.2e-05,1.8e-05,2.4e-05,2.9e-05,1.8e-05,2.8e-05,3e-05,3.3e-05,3.3e-05,3.4e-05,8e-06,1e-05,4e-06,1.7e-05,7e-06,3.5e-05,3e-06,7e-06,3.4e-05,2.7e-05,8e-06,1.1e-05,3.8e-05,4.5e-05,1.8e-05,9e-06,4.2e-05,0.000114,4.7e-05,1.7e-05,2.8e-05,3.2e-05,3.5e-05,1.7e-05,4e-05,7e-06,1.7e-05,3.4e-05,1.3e-05,1.1e-05,2e-06,1.2e-05,1.4e-05
1.5e-05,6e-06,6e-06,2.3e-05,1.4e-05,9e-06,1.8e-05,1.1e-05,8e-06,8e-06,7e-06,8e-06,2e-06,7e-06,3e-06,1e-05,2e-06,5e-06,5e-06,6e-06,1.4e-05,2.8e-05,1.2e-05,4.3e-05,3.5e-05,3.2e-05,1.7e-05,1.4e-05,5e-06,1.8e-05,1.7e-05,7e-06,1.7e-05,1.9e-05,1.1e-05,2e-06,3e-05,3.1e-05,1.3e-05,3.8e-05,4e-05,1.5e-05,1.4e-05,2.2e-05,2.2e-05,7e-06,7e-06,7e-06,1.1e-05,2e-05,1.9e-05,3e-06,1.1e-05,2.4e-05,1e-06,2.6e-05,1.9e-05,2e-05,1.2e-05,2.1e-05,1.1e-05,1e-05,6e-06,1.9e-05,1.1e-05,1.3e-05,8e-06,1.1e-05,4e-06,2e-06,2e-06,4e-06,6e-06,9e-06,4e-06,2.5e-05,5e-06,2.9e-05,2.3e-05,1.6e-05,2.5e-05,2.5e-05,2.6e-05,4e-06,2.2e-05,1.9e-05,1.6e-05,6e-06,7e-06,3e-06,7e-06,2.6e-05,1.2e-05,4.3e-05,1.7e-05,5e-06,4.4e-05,3.4e-05,1.6e-05,1.2e-05,6.6e-05,3.9e-05,2e-05,1.1e-05,1.7e-05,8.6e-05,6.7e-05,2e-05,1.6e-05,3e-06,1.4e-05,2e-05,4.8e-05,1.1e-05,1.6e-05,3.5e-05,1.9e-05,2e-05,4e-06,1.6e-05,1.5e-05
9e-06,1.5e-05,1.3e-05,1.8e-05,1.2e-05,2.3e-05,1.4e-05,8e-06,3e-06,7e-06,0,7e-06,2e-06,2e-06,1e-06,3e-06,1.2e-05,6e-06,7e-06,7e-06,8e-06,1.8e-05,2.1e-05,4.3e-05,2.9e-05,1e-05,5e-06,6e-06,1.1e-05,8e-06,1.2e-05,1.9e-05,4e-06,1e-06,7e-06,9e-06,2.7e-05,2.4e-05,5e-06,4.5e-05,6e-06,8e-06,1.4e-05,1.6e-05,5e-06,9e-06,1e-06,8e-06,8e-06,2.2e-05,8e-06,1.2e-05,5e-06,1.5e-05,2.2e-05,6e-06,1.1e-05,9e-06,1.7e-05,2.8e-05,1.5e-05,5e-06,6e-06,7e-06,1.4e-05,1.1e-05,9e-06,1.4e-05,9e-06,6e-06,1.3e-05,1.1e-05,7e-06,6e-06,3e-06,1.2e-05,2e-05,1.5e-05,5e-06,2.4e-05,1.3e-05,1e-05,1.8e-05,1e-06,2.7e-05,1.7e-05,5e-06,9e-06,7e-06,7e-06,8e-06,1.8e-05,1.5e-05,4.1e-05,1.5e-05,1.7e-05,6.2e-05,6.2e-05,3.1e-05,6e-06,9e-05,3.3e-05,8e-06,7e-06,2.4e-05,0.000105,3.3e-05,2e-06,3e-06,4e-06,1.9e-05,1.3e-05,3.8e-05,1.2e-05,1.4e-05,3.8e-05,1.4e-05,1.2e-05,9e-06,1.4e-05,7e-06
1.6e-05,1.7e-05,1.7e-05,2.6e-05,1.9e-05,3.1e-05,2.3e-05,5e-06,2e-06,9e-06,5e-06,5e-06,3e-06,5e-06,7e-06,9e-06,1.1e-05,8e-06,1e-06,1.5e-05,1.2e-05,2.5e-05,2.4e-05,2e-05,1.3e-05,1e-05,1e-05,1.5e-05,1e-05,1.2e-05,7e-06,1.8e-05,7e-06,3e-06,1.6e-05,1.8e-05,3.5e-05,3.4e-05,2.3e-05,5.9e-05,3.6e-05,2.6e-05,4e-06,2.3e-05,2.4e-05,1.8e-05,6e-06,1.4e-05,1.5e-05,1.8e-05,1.1e-05,7e-06,1.7e-05,1.4e-05,3.8e-05,3.4e-05,2.2e-05,3e-05,3.5e-05,2.8e-05,2.3e-05,5e-06,1.6e-05,1.6e-05,1.6e-05,3e-06,6e-06,1.6e-05,1.2e-05,8e-06,1.2e-05,8e-06,1.9e-05,5e-06,1.8e-05,1.8e-05,1e-05,1.5e-05,8e-06,2.2e-05,2.7e-05,2.4e-05,2.7e-05,1.3e-05,1.2e-05,1.7e-05,4e-06,1.6e-05,9e-06,1.1e-05,1.8e-05,3.1e-05,2e-06,4.7e-05,3.9e-05,1e-05,6.7e-05,7e-06,4e-06,9e-06,1e-04,5e-05,2.7e-05,7e-06,5.8e-05,0.000132,4.5e-05,1.1e-05,3.5e-05,1.7e-05,1.2e-05,1.2e-05,3.1e-05,9e-06,1.7e-05,4.3e-05,1.8e-05,1.6e-05,1.3e-05,2.3e-05,2.2e-05
1.6e-05,2.3e-05,6e-06,3.9e-05,7e-06,1.2e-05,3.6e-05,2.3e-05,8e-06,8e-06,4e-06,5e-06,1.1e-05,1e-05,9e-06,7e-06,1.2e-05,1.1e-05,1.4e-05,2.2e-05,4e-06,1.8e-05,3.6e-05,2.9e-05,1.2e-05,3.3e-05,3.3e-05,4.9e-05,2e-05,2.3e-05,3.2e-05,4.5e-05,2.4e-05,1.4e-05,9e-06,8e-06,3.1e-05,4.9e-05,2.2e-05,4e-05,2.7e-05,3.3e-05,2.5e-05,2.4e-05,1e-06,1e-05,1.4e-05,1.9e-05,1.8e-05,1.1e-05,4e-06,1.9e-05,3.2e-05,3.2e-05,2.8e-05,5.7e-05,5.2e-05,5.7e-05,2e-06,1.4e-05,1e-06,3.2e-05,3e-06,2.4e-05,2.5e-05,2.9e-05,5e-06,9e-06,1.6e-05,1.1e-05,1.1e-05,1.5e-05,1.2e-05,2.2e-05,3.1e-05,1.6e-05,1.9e-05,3.2e-05,2.3e-05,1e-05,3.3e-05,1.1e-05,3e-06,1.8e-05,2.4e-05,1.6e-05,8e-06,4e-06,1.2e-05,5e-06,1.6e-05,5.5e-05,3.6e-05,5.2e-05,7e-05,4.3e-05,6.9e-05,5.9e-05,1e-05,5e-06,0.000115,9.7e-05,4.2e-05,1e-05,7.8e-05,0.000196,0.000113,1.6e-05,3.9e-05,2.7e-05,7e-06,1.7e-05,3.7e-05,1.4e-05,2.1e-05,3.6e-05,9e-06,1e-05,1e-05,3.3e-05,5e-05
1.4e-05,2.6e-05,3.5e-05,4.3e-05,1.8e-05,9e-06,1.8e-05,8e-06,8e-06,3e-06,1e-05,1.2e-05,1.6e-05,1e-05,7e-06,1.5e-05,5e-06,1e-05,2e-06,2.5e-05,2.7e-05,4e-06,2.8e-05,1.5e-05,3.6e-05,7e-06,3e-05,6e-05,3.6e-05,3.2e-05,1.2e-05,2.5e-05,1.2e-05,1e-05,1.3e-05,1.2e-05,4.7e-05,4.6e-05,2.7e-05,2.1e-05,3.1e-05,9e-06,5e-06,9e-06,1.8e-05,7e-06,7e-06,6e-06,5e-06,6e-06,2.4e-05,1.6e-05,2.5e-05,4e-05,1.3e-05,3.9e-05,2.6e-05,3.3e-05,4.4e-05,3.2e-05,1.1e-05,1.6e-05,1.9e-05,3.8e-05,2.2e-05,2.6e-05,1.9e-05,1.2e-05,4e-06,1.5e-05,1.1e-05,3.5e-05,2.1e-05,2.8e-05,4.6e-05,5.1e-05,3.9e-05,4e-06,1.2e-05,2.8e-05,1.8e-05,1.5e-05,2.6e-05,2.1e-05,3.2e-05,3.5e-05,3.4e-05,2.6e-05,1.6e-05,1.2e-05,5e-06,4.8e-05,2.5e-05,4.4e-05,6.6e-05,3.1e-05,4.7e-05,2.3e-05,3.8e-05,2.2e-05,0.000101,8.6e-05,4.3e-05,9e-06,8.6e-05,0.000277,0.000147,2.3e-05,1.9e-05,1e-05,4.2e-05,2.8e-05,5.3e-05,2.1e-05,1.8e-05,1.7e-05,2.4e-05,2e-05,7e-06,4.4e-05,4.6e-05
2e-05,1.9e-05,1.2e-05,3.1e-05,1.8e-05,3.6e-05,5e-06,8e-06,3e-06,1e-06,1.2e-05,8e-06,1.2e-05,8e-06,2e-06,9e-06,7e-06,9e-06,7e-06,2.4e-05,1.6e-05,1.3e-05,2.8e-05,6.2e-05,9e-06,1.6e-05,1e-05,2.9e-05,3e-05,2.3e-05,2e-06,1.3e-05,2.7e-05,7e-06,6e-06,9e-06,2.9e-05,1.5e-05,9e-06,3e-05,2.3e-05,2e-06,8e-06,7e-06,8e-06,1.1e-05,6e-06,8e-06,4e-06,1.6e-05,2.2e-05,1.3e-05,9e-06,2.3e-05,3.6e-05,1.2e-05,1.6e-05,3.3e-05,4e-06,1.1e-05,1.1e-05,1.3e-05,1.6e-05,8e-06,5e-06,2.2e-05,9e-06,9e-06,8e-06,5e-06,2.4e-05,3.2e-05,1.7e-05,1e-05,1.4e-05,2.9e-05,5.3e-05,3.8e-05,6e-06,2.9e-05,2.3e-05,2.2e-05,1.6e-05,1.1e-05,2.4e-05,2e-05,4.9e-05,2.4e-05,1.4e-05,1.2e-05,9e-06,3.5e-05,1.8e-05,3.4e-05,4.3e-05,2.4e-05,4.5e-05,3.2e-05,9e-06,4e-06,8.9e-05,5.5e-05,1.9e-05,8e-06,0.000114,0.000205,8.9e-05,5e-05,5.1e-05,1.7e-05,3.6e-05,1e-05,3.4e-05,1.7e-05,2.6e-05,2.8e-05,1.4e-05,1.6e-05,5e-06,3.6e-05,1.1e-05
3.1e-05,4e-06,4e-06,2.1e-05,1.9e-05,1.6e-05,9e-06,5e-06,8e-06,1.3e-05,6e-06,3e-06,5e-06,1e-06,5e-06,3e-06,5e-06,1.3e-05,2e-06,1.3e-05,8e-06,1.9e-05,3.4e-05,3.7e-05,3.2e-05,2.3e-05,2.8e-05,9e-06,4e-06,1.6e-05,1.3e-05,7e-06,1.6e-05,7e-06,3e-06,5e-06,2.4e-05,9e-06,6e-06,2.9e-05,1.9e-05,7e-06,2e-06,8e-06,1e-05,1.1e-05,5e-06,1e-06,1.2e-05,9e-06,1.4e-05,2e-06,8e-06,5e-06,2e-05,1.9e-05,2e-05,1e-05,1.7e-05,1.2e-05,1.6e-05,1.2e-05,7e-06,1.4e-05,1.3e-05,9e-06,1e-05,1.1e-05,6e-06,5e-06,1.7e-05,2.6e-05,1.9e-05,1.1e-05,8e-06,2.5e-05,2.3e-05,1.9e-05,1.9e-05,7e-06,2.2e-05,1.5e-05,1.6e-05,1.4e-05,1.9e-05,1.8e-05,1.8e-05,7e-06,2.6e-05,2.3e-05,7e-06,1e-05,7e-06,4.5e-05,2.2e-05,1e-05,2.8e-05,2.1e-05,1.4e-05,6e-06,6.3e-05,3.2e-05,1.3e-05,6e-06,0.000117,9.3e-05,7.9e-05,1.4e-05,1.7e-05,2.4e-05,2.9e-05,9e-06,2e-05,9e-06,9e-06,3e-05,4e-06,2e-05,5e-06,2.7e-05,1.2e-05
2.5e-05,2.5e-05,1.8e-05,2.3e-05,1.3e-05,1.8e-05,1.2e-05,7e-06,9e-06,1.2e-05,2e-06,8e-06,9e-06,6e-06,1e-05,9e-06,3e-06,7e-06,4e-06,5e-06,2e-06,2.1e-05,3.6e-05,2.1e-05,4.5e-05,4.7e-05,1.3e-05,2.7e-05,3.2e-05,1.5e-05,1.2e-05,2.5e-05,1e-05,1.3e-05,5e-06,4e-06,2.6e-05,1.6e-05,1e-05,3.1e-05,2.1e-05,1e-05,5e-06,8e-06,7e-06,9e-06,1e-05,9e-06,1.2e-05,9e-06,6e-06,1.7e-05,1.2e-05,3e-05,1e-05,1e-05,2.1e-05,1.2e-05,1.2e-05,2.2e-05,1.8e-05,9e-06,9e-06,1.8e-05,1.9e-05,7e-06,1.2e-05,4e-06,4e-06,7e-06,3e-06,1.5e-05,2.6e-05,2e-05,4e-06,1.5e-05,1.7e-05,3.2e-05,3.5e-05,1.9e-05,1.9e-05,8e-06,7e-06,1.9e-05,1.1e-05,2e-06,1e-05,1.9e-05,2e-06,3e-06,1.1e-05,8e-06,4e-06,4.9e-05,8e-06,1.1e-05,2e-05,2.1e-05,4e-06,1.3e-05,3.6e-05,4e-06,2e-05,1e-05,0.000117,8.9e-05,4.2e-05,5e-06,1.1e-05,1.3e-05,1.6e-05,4e-06,2.2e-05,8e-06,9e-06,3.2e-05,1e-05,1.6e-05,6e-06,2.2e-05,7e-06
2.4e-05,9e-06,6e-06,2.8e-05,7e-06,1.3e-05,1.1e-05,3e-06,9e-06,1e-05,8e-06,1e-06,7e-06,3e-06,5e-06,7e-06,6e-06,3e-06,7e-06,6e-06,4e-06,2.5e-05,1.3e-05,2.6e-05,3.8e-05,3e-05,3.6e-05,1.3e-05,1.6e-05,1.6e-05,6e-06,1.2e-05,4e-06,7e-06,6e-06,3e-06,2.5e-05,4e-06,4e-06,2.3e-05,1.7e-05,2e-06,2e-06,3e-06,1.1e-05,3e-06,4e-06,7e-06,1.6e-05,6e-06,1e-05,1.2e-05,9e-06,2e-05,3.1e-05,1.4e-05,6e-06,4e-06,1.3e-05,1.8e-05,2e-05,8e-06,1e-05,1.1e-05,7e-06,9e-06,4e-06,1e-05,1.4e-05,5e-06,6e-06,1.8e-05,2.6e-05,1.7e-05,1.2e-05,1.1e-05,9e-06,9e-06,8e-06,8e-06,5e-06,1e-05,3e-06,1e-05,1.4e-05,2e-06,1.6e-05,1.7e-05,7e-06,8e-06,1e-06,6e-06,1e-06,4.7e-05,3e-06,6e-06,2e-06,1.7e-05,3e-06,7e-06,2.1e-05,1e-05,1.8e-05,1.1e-05,0.000106,7.4e-05,3.8e-05,1.9e-05,1.6e-05,6e-06,2.5e-05,5e-06,1.9e-05,6e-06,1e-05,2.9e-05,6e-06,9e-06,3e-06,1.5e-05,4e-06
7e-06,1.7e-05,1.3e-05,3e-05,5e-06,1.9e-05,1.3e-05,3e-06,8e-06,9e-06,7e-06,5e-06,4e-06,3e-06,4e-06,9e-06,3e-06,6e-06,7e-06,3e-06,1e-06,2.3e-05,5e-06,2.6e-05,1.2e-05,1e-05,3e-06,1.1e-05,1.4e-05,8e-06,3e-06,1.3e-05,7e-06,5e-06,4e-06,1e-06,2.7e-05,7e-06,5e-06,1.6e-05,1.4e-05,1e-06,5e-06,5e-06,7e-06,2e-06,1e-06,7e-06,4e-06,1e-05,1e-05,2e-06,2e-06,1.2e-05,2.1e-05,1.1e-05,8e-06,6e-06,1e-05,2.3e-05,1.2e-05,1.4e-05,7e-06,1.3e-05,7e-06,4e-06,5e-06,6e-06,9e-06,1e-06,4e-06,1.9e-05,1.1e-05,3e-06,5e-06,1.2e-05,1e-06,7e-06,6e-06,6e-06,1.2e-05,5e-06,7e-06,8e-06,1.2e-05,4e-06,6e-06,7e-06,7e-06,6e-06,4e-06,4e-06,4e-06,4.5e-05,5e-06,3e-06,6e-06,1.3e-05,1e-05,4e-06,9e-06,2e-06,8e-06,1e-06,0.000102,5.2e-05,8e-06,1.2e-05,6e-06,4e-06,1.6e-05,3e-06,2.9e-05,3e-06,7e-06,2.4e-05,7e-06,8e-06,2e-06,1.2e-05,6e-06
1.1e-05,1.2e-05,9e-06,3e-05,2e-06,1.7e-05,9e-06,2e-06,5e-06,9e-06,6e-06,4e-06,3e-06,5e-06,3e-06,8e-06,4e-06,5e-06,6e-06,1e-06,2e-06,2.4e-05,4e-06,3e-05,5e-06,8e-06,4e-06,4e-06,1.1e-05,7e-06,1e-06,1.3e-05,8e-06,3e-06,5e-06,1e-06,2.5e-05,3e-06,4e-06,1.6e-05,1.5e-05,3e-06,7e-06,1e-06,8e-06,1e-06,2e-06,2e-06,6e-06,7e-06,6e-06,0,3e-06,1e-05,1.5e-05,7e-06,5e-06,3e-06,1.1e-05,2.1e-05,1.4e-05,1.2e-05,9e-06,1.3e-05,7e-06,5e-06,3e-06,5e-06,7e-06,1e-06,4e-06,1.6e-05,5e-06,3e-06,4e-06,1.3e-05,5e-06,4e-06,5e-06,4e-06,1.3e-05,4e-06,5e-06,7e-06,1.6e-05,4e-06,6e-06,1e-05,5e-06,9e-06,1e-06,2e-06,3e-06,3.6e-05,5e-06,4e-06,7e-06,1.7e-05,2e-06,5e-06,9e-06,4e-06,6e-06,3e-06,9.9e-05,4.8e-05,7e-06,9e-06,4e-06,3e-06,2e-05,3e-06,2.7e-05,4e-06,1.1e-05,3e-05,9e-06,1.2e-05,2e-06,1.1e-05,4e-06
1e-05,1.1e-05,9e-06,2.7e-05,1e-06,1.6e-05,9e-06,0,6e-06,7e-06,6e-06,5e-06,3e-06,4e-06,3e-06,7e-06,3e-06,5e-06,4e-06,0,1e-06,2.2e-05,5e-06,2.7e-05,6e-06,9e-06,5e-06,2e-06,1.1e-05,7e-06,1e-06,1.3e-05,7e-06,4e-06,4e-06,2e-06,2.4e-05,3e-06,7e-06,1.6e-05,1.4e-05,1e-06,6e-06,2e-06,7e-06,2e-06,2e-06,2e-06,7e-06,7e-06,8e-06,1e-06,2e-06,9e-06,1.4e-05,5e-06,5e-06,1e-06,1e-05,2e-05,1.1e-05,1e-05,7e-06,1.4e-05,6e-06,5e-06,3e-06,4e-06,7e-06,2e-06,5e-06,1.4e-05,5e-06,1e-06,1e-06,1.3e-05,5e-06,5e-06,7e-06,4e-06,1.4e-05,5e-06,5e-06,6e-06,1.5e-05,6e-06,8e-06,7e-06,5e-06,8e-06,1e-06,0,4e-06,3.8e-05,3e-06,1e-06,3e-06,2e-05,2e-06,5e-06,1e-05,4e-06,3e-06,0,1e-04,3.6e-05,4e-06,1e-05,5e-06,2e-06,1.7e-05,4e-06,2.7e-05,4e-06,1.2e-05,2.7e-05,7e-06,1.1e-05,1e-06,1.1e-05,3e-06
