-0.000141,-0.000341,-0.00016,-0.000538,-0.00135,-0.010544,-0.013682,-0.011853,-0.008553,-0.012737,-0.010073,-0.014121,-0.012372,-0.007825,-0.005324,-0.004512,-0.002656,-0.004008,-0.004012,-0.003404,0.009322,-0.007753,-0.009867,-0.014319,-0.025129,-0.014949,-0.008542,-0.014591,-0.005402,-0.007286,-0.011496,-0.029977,-0.024729,-0.015891,-0.009248,-0.01596,-0.01052,-0.015684,-0.01455,-0.014356,-0.017484,-0.017087,-0.008363,-0.008763,-0.007636,-0.010653,-0.007738,-0.008692,-0.012214,-0.016268,-0.013581,-0.012997,-0.009488,-0.008015,-0.004931,-0.0038,-0.003113,-0.003424,-0.002262,-0.002327,-0.001697,-0.002021,-0.002387,-0.00108,-0.001816,-0.00108,-0.000735,-0.0223,-0.014383,-0.006021,-0.00262,-0.001424,-0.001162,-0.001834,-0.000759,-0.001124,-0.000835,-0.000705,-0.000414,-8.5e-05,-0.000216,-0.000307,-0.000716,-0.001123,-0.000982,-0.000815,-0.000379,-0.000345,-0.000582,-0.000606,-0.000382,-0.000626,-0.000444,-0.000739,-0.000647,-0.000434,-0.000405,-0.000429,-0.000324,-0.000313,-0.000372,-0.000383,-0.000126,-0.000528,-0.000435,-0.000386,-0.00023,-0.000226,-0.000242,-0.000275,-0.000233,-0.000248,-0.000109,-0.000902,-0.004447,-0.002664,-0.001004,-0.000271,-4.8e-05,-0.000127,-6.3e-05
-4.6e-05,6e-05,-0.000343,9.9e-05,-0.000117,0.002464,0.00136,0.004228,0.002162,0.005596,0.005658,0.00598,0.004632,0.003867,0.001378,-1.7e-05,-7.1e-05,0.00018,0.000157,4e-04,-0.005048,-0.005384,-0.008539,-0.002069,9.5e-05,0.000984,-0.001029,-0.000524,-0.005984,-0.000336,0.000444,0.009028,0.003499,-0.001814,-0.004107,-0.001446,-0.001908,0.001687,-0.003786,-0.005675,-0.005158,0.003167,-0.002367,-0.003319,-0.003384,-0.002027,-0.008161,-0.002962,0.002081,0.002237,-0.001917,-0.000931,-0.002312,-0.000995,-0.001606,-0.000691,-0.001655,-0.001241,-0.001042,-0.000847,0.000156,-0.001125,-0.001035,-0.000167,-4e-05,-0.000256,-5.4e-05,0.011746,0.007091,0.003126,0.000562,-0.000485,-0.000171,0.00019,-0.000223,-0.000133,-0.000562,-6.1e-05,0.000217,0.000191,0.00039,9.8e-05,-0.000298,-0.000498,-0.000224,-0.00018,-0.000491,-0.000666,-0.000105,0.000224,0.000182,4.2e-05,-1.9e-05,0.00011,2.7e-05,-0.000219,-0.00014,-5.5e-05,6.6e-05,-0.000196,1.7e-05,-0.00028,-2.6e-05,-0.000134,-7.1e-05,7.7e-05,-9e-06,-9e-06,-3.3e-05,-7e-05,-8.3e-05,-1.2e-05,-8.8e-05,0.000558,0.002734,0.001363,0.000391,-7.4e-05,-1e-04,0.000117,-4.3e-05
0.000165,-7.9e-05,5.8e-05,0.000162,-4.4e-05,-0.001728,-0.001157,-0.003123,-0.001343,-0.002766,-0.004683,-0.005647,-0.001544,0.000253,0.000644,0.001244,-0.000127,0.000382,-0.000126,-0.000353,-0.005021,-0.000508,0.002419,-0.004776,-0.015681,-0.008054,-0.001761,-0.005823,-0.006358,0.00085,-0.000243,-0.007119,0.001617,0.006194,-0.001975,0.00148,0.003628,-0.000416,0.002567,0.002276,-0.002003,0.004581,-0.002045,0.003192,0.001129,0.000132,-0.002036,0.000282,-0.005577,-0.000118,-0.00276,-0.001243,0.000817,-0.001179,-0.002019,-0.00056,0.001187,0.001248,0.000298,0.000361,-6.1e-05,-0.00041,0.000565,-1.9e-05,-0.000877,-0.000608,-0.000409,-0.004879,-0.003843,-0.001986,-0.000458,-0.000342,-0.000155,6.8e-05,-0.000251,0.000236,0.000201,3.4e-05,0.000126,-0.000629,-0.000447,1.4e-05,5.7e-05,-0.00014,0.00017,9.8e-05,0.000594,0.000107,3.2e-05,-0.000107,-0.000196,7e-05,-0.000152,0.000176,0.000244,-9.7e-05,-9e-06,-9e-06,7.9e-05,7.2e-05,1.7e-05,-0.000105,-5.7e-05,8e-05,0.000149,1.8e-05,-4e-05,-8.6e-05,-4.6e-05,-0.000134,7e-05,9.9e-05,0.000163,0.00012,-0.001411,-0.000819,-0.000274,9e-06,3.2e-05,-0.000122,-0.000147
-0.000242,1.5e-05,4.9e-05,-0.000243,0.000145,0.001004,0.002199,0.000773,0.00118,-0.00033,0.002959,0.004058,0.001137,-0.00153,-0.001134,-3e-06,0.000403,-0.000238,0.000511,0.000746,-0.001077,-0.002138,0.000851,0.001736,0.01177,0.002171,0.003888,0.005663,-0.003495,0.001191,-0.00211,-0.002073,-0.002485,-0.001173,0.003567,-0.005183,-0.006407,0.000555,0.003975,-0.001621,0.003871,-0.003553,-0.004609,-0.001805,-0.000184,-0.000588,0.006098,-0.004786,-0.000307,-0.001162,0.000223,-0.000391,-0.001496,-0.001137,0.001073,-0.00051,-0.00094,0.00023,0.000369,0.000225,-0.00067,0.001229,8.9e-05,-0.00038,0.000123,0.00034,0.000771,0.00112,0.003381,0.002258,4e-06,0.000564,0.000372,-0.00021,-0.000196,-0.000261,0.000432,4.4e-05,-0.00068,-0.000185,-0.000349,-0.000175,0.000134,3.2e-05,-0.000125,9e-06,-0.000243,-0.000494,-0.000285,-0.000153,-3.5e-05,-3.3e-05,0.000158,-0.000221,0.000148,-7.1e-05,-1e-04,-3.1e-05,-0.00023,7.7e-05,-0.000127,2.3e-05,8.7e-05,-8.5e-05,-0.000141,-0.000138,-5.3e-05,-3.4e-05,-8.1e-05,6.8e-05,-0.000195,-0.000288,-0.000116,8e-06,0.001018,0.000648,0.000264,-0.000121,-0.000163,-6.7e-05,-7e-06
0.000149,5.4e-05,3.4e-05,0.000212,-3e-06,-0.000554,-0.000853,0.001801,-0.001872,0.000363,-0.002214,-0.00231,-0.000763,0.000713,0.000702,1.6e-05,-0.000663,-0.00023,-0.000348,0.000563,-0.000797,-0.000436,-0.00252,0.003331,-0.001642,-0.004818,-0.002524,-0.000193,0.000543,-0.004714,-0.003189,0.002055,0.001184,0.000216,-0.001525,0.001793,0.002261,-0.000175,-0.001278,0.00116,-0.005816,-0.000521,0.00554,-0.004809,0.000682,0.00246,0.000369,0.00134,0.002726,-2.3e-05,0.002139,0.002174,0.001958,-0.001616,-0.00133,-0.001068,0.000611,-0.000423,7e-05,6.2e-05,0.000845,-0.000143,0.00073,-6.4e-05,0.000283,-0.000118,-0.001418,0.000126,-0.003991,-0.002148,0.000234,-5.4e-05,-3e-05,0.000304,0.000111,0.000253,-0.000202,-0.000194,0.000262,-2e-04,-0.000504,-0.000199,-0.000189,0.000215,4.5e-05,9.8e-05,-2.5e-05,1.1e-05,2e-05,0.000114,8e-05,-5.3e-05,-0.000139,2.1e-05,-0.000126,-0.000103,2.5e-05,-6.5e-05,6.7e-05,-1.3e-05,0.000209,8.6e-05,6.6e-05,6.3e-05,6e-06,2.1e-05,9.6e-05,5.6e-05,8.7e-05,3.5e-05,1e-04,2e-04,-1.4e-05,0.000125,-0.000596,-0.00058,-0.000379,-1.9e-05,0.000171,6.9e-05,5.8e-05
7e-06,-7e-05,8.9e-05,3.7e-05,-0.000147,0.000777,-0.001256,-0.002734,0.001468,0.000163,0.001253,0.001975,-0.000539,-0.000343,0.000194,-0.000167,0.000223,0.000669,-6.3e-05,-0.000378,-0.000148,-0.003677,-0.002439,-0.000726,0.000209,-0.000456,0.0012,-0.001795,0.001189,0.001011,-0.003738,0.000412,-0.000452,-0.000958,0.000906,-0.0028,-0.002641,-0.000595,-0.000225,-0.000489,0.002131,-0.001665,-0.003639,-0.001431,-0.003028,-0.001065,-0.001671,0.001523,0.002487,-0.003106,0.001332,0.0014,-0.000917,0.003155,0.002537,0.001207,-0.000801,0.00022,0.000586,-0.000409,-0.000106,-4.2e-05,5.9e-05,0.000456,0.00037,0.000111,-0.000204,-0.001637,0.00242,0.001421,-6e-06,-0.000434,-1e-04,-4.2e-05,0.000234,-0.000279,0.000138,-0.000109,0.000196,-0.000137,1e-04,-9.6e-05,-0.000114,-8.5e-05,3.1e-05,-0.000105,9.1e-05,0.000269,-6e-06,-0.000208,-0.000158,-0.000127,-0.000108,-0.000156,9.7e-05,-2.8e-05,-9.1e-05,2.9e-05,8e-06,-3.2e-05,-8.5e-05,-9.7e-05,4e-06,-3.4e-05,-7e-06,-5.1e-05,-3.9e-05,9.8e-05,1e-06,3.1e-05,-7.8e-05,-4.7e-05,-1e-06,8.2e-05,-3.5e-05,0.000458,0.000338,0.000146,7.9e-05,0.000129,3.4e-05
2e-05,-3.6e-05,1.1e-05,-0.000115,-2.8e-05,-0.000277,0.001889,0.001565,-6.5e-05,0.00113,-0.001084,-0.001455,0.000478,-0.00089,-0.000475,0.000765,0.000358,-0.000849,-2e-06,-0.000431,-0.000395,-0.001808,1.6e-05,-0.000491,-0.00132,-0.002851,-0.001577,0.00152,-0.000788,-0.004453,-0.000638,0.001387,0.005493,0.002784,0.002056,-0.001488,-0.000168,-0.000876,-0.002585,-0.000267,0.001686,0.00173,-0.001055,0.000955,-0.000254,-0.003583,0.001169,0.000204,0.001619,0.002576,-0.001173,-0.001068,0.001781,-0.000905,-0.001327,0.000775,-0.00024,-0.000728,-0.001077,-0.000253,0.000361,0.000234,-0.000601,-0.000239,-0.000196,-6.3e-05,3.8e-05,-2.8e-05,-0.000942,-0.000396,2.3e-05,0.000185,-0.000457,-0.00038,-0.000139,0.000251,4.7e-05,0.000234,1.3e-05,0.000191,-6.1e-05,1.1e-05,9.1e-05,-4.6e-05,-0.000154,-2.2e-05,-0.000151,-0.00032,-0.000233,0.000126,6e-05,3.3e-05,3.1e-05,0.000206,6.9e-05,7.3e-05,6.6e-05,4.3e-05,2.7e-05,0.000112,8.1e-05,3.9e-05,-0.000103,-7.1e-05,2e-05,0.000123,3e-05,-3.9e-05,-5.6e-05,-2e-06,2.3e-05,6.7e-05,-6.6e-05,1e-06,0.000114,-0.000349,-0.000138,-0.000112,-4.1e-05,-6e-05,-3.7e-05
5.1e-05,2e-05,-8e-05,1.3e-05,0.000166,4.4e-05,-0.000485,0.000448,-0.000795,-0.00111,-0.000451,0.001132,0.000323,0.001187,-0.000289,-0.000307,-0.000379,0.000172,0.000506,0.000795,6.9e-05,0.00203,-0.001711,0.000448,0.001235,0.003297,0.000909,-0.001555,-0.00095,0.002273,0.000249,-0.000107,-0.003041,-0.002212,-0.000729,0.001363,0.000917,-0.002292,-0.001692,-0.001222,0.002724,-0.002882,-0.000224,0.003875,0.003935,0.004024,-0.002257,0.000356,-0.003002,-0.000402,0.000129,-0.000682,-0.000356,2.7e-05,-0.000234,-0.000326,-0.000166,0.000354,-0.000149,5.7e-05,-0.000454,-0.000479,-0.000599,-0.000468,-0.00011,0.000248,0.000303,0.000561,0.000343,0.000221,-0.000284,-8.4e-05,-7.1e-05,1.9e-05,0.00021,4.7e-05,-0.000409,-0.000129,-0.000169,-7e-06,0.000188,3e-05,-0.000102,-0.000149,-3.8e-05,4.3e-05,-7.2e-05,0.000143,0.000228,-0.000107,-6.2e-05,-9.1e-05,-5.6e-05,-5e-05,-0.00011,1.8e-05,9.8e-05,8e-06,-6.6e-05,-1.9e-05,-2.3e-05,3.7e-05,-2.3e-05,-4.1e-05,-6.8e-05,-6.7e-05,-6.9e-05,6.6e-05,4.2e-05,-5.2e-05,2.6e-05,1e-06,3.9e-05,2e-06,-0.000229,0.000225,8.1e-05,-1e-05,-4.5e-05,4e-06,-1e-06
-0.000119,-4.8e-05,6e-05,-2.2e-05,-0.000102,9.3e-05,-0.000166,-0.000399,0.000462,-0.000163,0.000528,-0.00085,0.000684,-0.000712,0.000162,-0.000396,0.000168,0.000245,-0.000181,-0.000483,-0.000242,-0.000261,0.002057,-0.000667,9.9e-05,0.00139,-0.000578,-8.4e-05,-0.000636,-0.002043,-0.000997,-0.00326,0.002287,0.001306,-0.001416,0.001028,-0.000721,0.001541,0.00058,-0.000379,-0.003443,0.001978,-0.001633,-0.001334,-0.001523,0.000648,0.000222,-0.000695,-0.001111,-5.7e-05,0.001997,0.003049,-0.000927,0.000547,-0.000267,-0.000441,-0.000218,-0.000425,0.000876,-7.5e-05,-0.000371,4.8e-05,0.000814,0.000623,-9.7e-05,-0.00029,-7.3e-05,-0.000263,-0.000283,-0.000865,-0.000205,0.000192,0.000434,0.000119,-0.00026,-0.000136,0.000247,-7.6e-05,0.000101,6.7e-05,1.5e-05,-7.4e-05,-0.000111,0.000305,-5.7e-05,-0.000102,0.000188,1.8e-05,1.7e-05,8e-05,-6.2e-05,-2.6e-05,2.2e-05,-5.6e-05,6e-06,5.1e-05,-2.7e-05,6e-06,9e-05,-8e-06,-6e-05,-8.6e-05,-2.1e-05,-7.2e-05,-1.8e-05,-1.8e-05,2.9e-05,-6.4e-05,-3.7e-05,5.1e-05,2.9e-05,-6e-06,4.8e-05,4.9e-05,2.3e-05,-4.2e-05,-6.5e-05,3.3e-05,-1.8e-05,0,-4e-06
4.2e-05,4.9e-05,-2.8e-05,-3.1e-05,0.000107,-0.000149,-0.000177,0.000378,-0.000677,-0.000124,-3.6e-05,0.000535,-0.000984,0.000336,0.000369,0.00046,-0.00014,0.000239,-1.6e-05,0.000101,0.000258,3.1e-05,-0.000157,-0.001171,0.00033,-0.002111,-0.000347,0.000373,0.001999,0.002735,0.000867,-0.001534,-0.002253,-0.000675,-0.000936,0.000389,0.001949,0.000656,0.000174,3.4e-05,0.00017,-0.000154,-0.000265,0.001661,-0.001161,0.001953,0.000811,-0.001252,0.000252,-0.000976,-0.001013,-0.002183,0.000401,-0.000651,-0.000363,-0.00037,0.00048,0.000615,7.2e-05,1.8e-05,3.3e-05,-9.2e-05,-0.000147,3.9e-05,6e-05,1.5e-05,-7.5e-05,0.000336,0.000754,0.000261,-0.000282,-0.000345,-0.000197,1.5e-05,0.000131,-7.8e-05,-0.000191,-8e-06,4e-05,-0.000126,4.9e-05,5e-06,-9.5e-05,-1e-05,2.7e-05,-4.2e-05,-1.6e-05,2.2e-05,-2.5e-05,5.3e-05,4.5e-05,0.000101,-1.8e-05,-0.000176,-7.8e-05,-9.1e-05,4.6e-05,-1.7e-05,-2.5e-05,3.9e-05,-1.8e-05,6.3e-05,1.5e-05,9.9e-05,2.8e-05,6.4e-05,1.4e-05,3.3e-05,4.8e-05,2.3e-05,-4.9e-05,6.8e-05,-4.8e-05,-3.2e-05,6.8e-05,-8.1e-05,-5e-06,2e-06,-1.3e-05,-4.5e-05,1e-05
-2e-06,-3.4e-05,-2.2e-05,1.2e-05,-6.1e-05,8.9e-05,-3.3e-05,-0.00087,-3.4e-05,0.000489,-0.000164,1.7e-05,0.000726,-0.000189,-0.000237,-0.000522,1e-04,7.9e-05,0.00012,1.4e-05,-0.00024,-0.000232,0.0029,0.001562,-0.001043,-0.000648,-5.6e-05,-0.000523,-0.000332,0.002236,0.001096,0.000529,5.8e-05,-0.00186,-0.000876,-0.000207,0.000485,0.000521,0.00042,0.000972,0.000356,0.001654,-0.000777,-0.001981,0.001083,-0.001692,-0.001482,-0.000401,-0.001194,-0.000652,-1.7e-05,0.000803,0.000297,0.001431,0.000623,0.001013,0.000432,-0.000325,-0.000352,0.000164,0.000158,0.000453,0.000115,-6.6e-05,0.000203,-0.000144,8.7e-05,0.000258,-3.4e-05,-0.000329,0.000224,6.6e-05,-2.7e-05,-5.4e-05,1.7e-05,-5.5e-05,1.6e-05,-1.9e-05,-7.8e-05,3.3e-05,-1.7e-05,-6.6e-05,2e-05,-7e-06,-1.6e-05,0.000111,3.5e-05,-5e-06,-7e-06,-2.9e-05,-2e-05,-2.7e-05,4.3e-05,1e-05,4.5e-05,8.2e-05,-6e-06,-3.2e-05,0,-8.3e-05,4.8e-05,-3.4e-05,2.2e-05,-7e-06,5e-06,-5.5e-05,-1.3e-05,4e-06,7e-06,-4.7e-05,-4e-06,-8e-06,7e-06,-2.3e-05,2.6e-05,7.1e-05,4.4e-05,-6.1e-05,7e-06,9.5e-05,8e-06
-6.1e-05,-1e-05,-1e-06,2.1e-05,-7e-06,-9.9e-05,1.3e-05,0.000788,0.000645,-0.000801,-0.000151,-0.00026,-0.000789,-4.4e-05,-0.000138,-7.4e-05,-0.000127,-8.9e-05,-0.000112,8e-05,0.000139,-0.000319,-0.00144,-0.002159,0.000181,-0.000706,-0.002581,-0.001212,5.4e-05,-0.001282,-0.000489,2.8e-05,0.00014,0.000817,0.000656,0.001295,0.000264,0.000728,0.000382,-5.4e-05,-0.001181,-0.002264,0.002066,0.00137,0.000108,-0.00022,0.000301,0.000859,0.001427,-0.000563,-0.001672,-0.00021,-0.000787,-0.001357,0.000182,-0.000145,-0.000211,2e-06,0.000122,-0.000367,-1.5e-05,-0.000217,-0.000122,-6.4e-05,-6.6e-05,0.000142,5.7e-05,-0.00026,-0.000669,-0.000181,-9.8e-05,-2.4e-05,3.2e-05,-2.2e-05,-7.6e-05,5.8e-05,-9.2e-05,-9.2e-05,-9e-06,-7.7e-05,-3e-06,6.4e-05,9.3e-05,-7.2e-05,0.000113,-5.7e-05,-5.5e-05,-6.7e-05,-2e-05,4.9e-05,1.1e-05,-1e-05,-2e-06,3e-05,-3.4e-05,1e-05,1.4e-05,3.3e-05,-2.3e-05,0,-3e-06,5.4e-05,3.9e-05,1.5e-05,3e-06,2e-05,3.3e-05,-3e-06,6e-06,1e-05,7e-06,4e-06,-4e-05,-1.3e-05,1.1e-05,-2.4e-05,9.4e-05,7e-05,-1e-05,-2.5e-05,-6e-06
1e-06,-1.3e-05,-4.4e-05,-2.5e-05,5e-05,3.6e-05,0.000339,-0.000234,-0.000899,0.000809,0.000773,0.000358,0.000594,0.000211,0.000333,0.000186,8.5e-05,3.5e-05,-1.6e-05,-0.000125,-4.7e-05,-0.000138,-0.001416,-0.000576,0.000453,0.000751,0.001237,0.000621,-7.5e-05,0.000273,-0.000218,4e-06,0.00035,-0.00152,0.000901,-0.000922,-0.000439,-0.000857,-0.000454,0.000276,0.001565,0.000974,-4.5e-05,0.001285,0.000177,-0.000111,0.000252,-0.001007,0.000533,0.000448,0.000505,-0.000642,-0.000457,0.000316,-7.5e-05,-3e-04,-0.000404,-1.5e-05,3.5e-05,0.000249,-0.000101,-8.5e-05,5.4e-05,-0.000175,-6.1e-05,7.8e-05,-6.8e-05,-9.5e-05,0.000221,-0.00016,0.00017,6.5e-05,-8.4e-05,8e-06,5.8e-05,3.3e-05,-8e-05,0.000106,-2.9e-05,5.8e-05,1.7e-05,2.2e-05,5e-05,1.7e-05,-1.3e-05,9e-06,9.6e-05,1.2e-05,7e-05,-4.5e-05,-1.1e-05,-4.8e-05,-3.6e-05,3e-05,2.5e-05,0,-1.5e-05,2.1e-05,-8e-06,1.5e-05,-5.3e-05,-1.2e-05,-4e-06,-1.9e-05,2.2e-05,1.4e-05,-5e-06,-1.6e-05,-9e-06,-2.8e-05,-3e-06,-1.7e-05,1.2e-05,-3.1e-05,1.1e-05,-4.1e-05,-0.000119,-6.8e-05,-5e-06,1e-05,-4e-06
3.1e-05,-2e-06,2.2e-05,1.9e-05,2.8e-05,-3e-05,-0.000106,3.3e-05,0.001463,-0.000545,-0.000224,-0.000413,-0.00035,-0.000188,-0.00027,-0.000183,0.000101,-0.00017,5.6e-05,-6.4e-05,4.8e-05,0.000296,0.000289,0.000606,-0.000928,0.000312,0.000473,-0.000494,0.000741,-0.001816,-0.000615,0.002481,-0.000659,9.2e-05,-0.00096,-8.2e-05,0.000562,0.000184,0.001283,2.8e-05,-0.000732,-0.001375,-0.001035,0.000177,0.000468,-0.000368,9.3e-05,-0.000701,-0.000784,-0.000151,0.00016,-0.000711,0.000758,0.000324,-0.000319,-0.000149,-0.000187,-7.9e-05,2.3e-05,8.2e-05,-0.000119,9e-06,-3.3e-05,5.7e-05,2.5e-05,8.8e-05,0.000121,0.000184,6.3e-05,0.000366,-0.00035,9.5e-05,-7.6e-05,4.4e-05,2.9e-05,-9e-06,0.000125,-5e-06,-1.3e-05,1.7e-05,-5.1e-05,9.6e-05,4e-06,1.3e-05,2.7e-05,-1.1e-05,-2.3e-05,-3.1e-05,-4.6e-05,-2e-05,5.2e-05,4.3e-05,3.6e-05,-7e-06,-3e-06,7e-06,2.8e-05,1.8e-05,5e-06,6e-06,-7e-06,-1.7e-05,-2e-05,-4e-06,-3.5e-05,-7.4e-05,-4e-06,0,-8e-06,3.6e-05,1.8e-05,-2e-06,0,3.2e-05,-1.4e-05,1.7e-05,6.8e-05,4.4e-05,8e-06,-1.6e-05,-6e-06
-3.5e-05,3e-06,-4e-06,9e-06,-3.6e-05,4e-06,-2.9e-05,-4.2e-05,-0.000607,-7.1e-05,-0.00021,0.000132,0.000184,0.000215,0.000111,-0.000114,-0.000141,-6.1e-05,-4.8e-05,0.000104,-4.8e-05,-2e-05,0.000322,0.000615,0.00061,-4e-04,0.001037,0.00035,1.8e-05,0.000639,0.00051,-8.1e-05,4.2e-05,0.00033,0.000125,0.000247,-0.000396,-0.000388,-0.000949,5.5e-05,-0.000319,0.000713,0.000739,7.2e-05,-0.000638,4.3e-05,-0.000319,0.000263,-0.000177,3.2e-05,-0.000408,9.9e-05,-0.000284,-0.00023,0.000399,-1.3e-05,7.2e-05,0.000106,-0.000253,-1.7e-05,0.000103,-7.1e-05,-0.000154,0.000114,-2.2e-05,-0.000239,-8.3e-05,1.8e-05,-3.4e-05,-3.8e-05,0.000327,5.9e-05,-6e-06,4e-06,-5.2e-05,1.9e-05,3.3e-05,-5e-06,-1.2e-05,-3.1e-05,3.9e-05,-6.1e-05,3.5e-05,-1.4e-05,-5.7e-05,3.3e-05,-4.6e-05,4.8e-05,-5e-06,3.2e-05,-1.6e-05,-3e-06,-2.1e-05,4e-06,-1.5e-05,1.8e-05,-5.3e-05,-1.5e-05,4e-06,3e-06,4.8e-05,-4e-06,-1.7e-05,-2e-06,7e-06,-9e-06,-2.7e-05,3e-06,0,-3e-06,-1.6e-05,-1.2e-05,-1.5e-05,-8e-06,8e-06,-2e-05,-9e-06,-4.4e-05,-2e-06,2e-06,7e-06
1.9e-05,1e-06,-3e-06,-8e-06,-7e-06,1.9e-05,-3.8e-05,-1e-04,-1e-05,0.000304,3.9e-05,1e-04,-0.000109,-0.000116,-0.000137,0.000193,9.6e-05,1.4e-05,-4.9e-05,-8.5e-05,-4.6e-05,-0.000121,0.000887,-7.8e-05,-0.000116,-0.00021,-0.001027,0.00014,0.000167,0.000667,-0.000173,-0.000188,-3.2e-05,0.000714,0.000507,-0.000134,-0.00025,-0.000123,0.000407,0.000372,-0.000283,-7.2e-05,-0.000201,-0.000292,-0.000594,0.000446,-0.000428,0.000368,0.000562,0.000374,0.000141,0.000846,0.000382,0.000389,-0.000252,-1.9e-05,0.00022,-9.9e-05,0.000172,3.1e-05,6.4e-05,3.5e-05,0.000146,-9.6e-05,3.7e-05,5.4e-05,3.7e-05,0,-4.2e-05,5e-05,-0.000114,-4.4e-05,6.1e-05,-4.7e-05,-2.8e-05,-1.9e-05,7.1e-05,4.9e-05,6e-06,1.3e-05,5e-06,-1.8e-05,-2.3e-05,2.5e-05,7e-06,-3.8e-05,8e-06,-3e-05,2e-05,-1.7e-05,-2e-06,0,1.4e-05,1.4e-05,-1e-05,-1e-06,3.5e-05,-2.6e-05,-1.2e-05,5e-06,-1.2e-05,2e-05,6e-06,-1.5e-05,2e-06,1.4e-05,-2e-06,-1.9e-05,7e-06,-4e-06,-1e-06,6e-06,2e-06,-5e-06,1.2e-05,1.1e-05,-1.1e-05,3.7e-05,-5e-06,1e-06,-3e-06
8e-06,8e-06,1.3e-05,-7e-06,-1.3e-05,-2.4e-05,2.5e-05,3.2e-05,0.000155,-8.1e-05,1e-05,-6.4e-05,-2.2e-05,-2.3e-05,0.000158,4.1e-05,-6e-06,5.5e-05,-4.6e-05,3.2e-05,5.7e-05,-0.000144,-0.000775,0.000254,-9.9e-05,-0.000571,-0.000407,0.000218,-0.000168,0.000303,-0.000214,0.000317,9.8e-05,-8.8e-05,-0.000299,-0.000115,-0.000201,0.000266,-0.000304,-0.000123,0.000155,0.000691,2.7e-05,-0.000381,0.00029,-0.000225,0.000223,-0.000277,-0.000231,-2e-05,8e-06,-0.000311,-0.000171,-0.000274,3.4e-05,-5e-06,6e-06,8.5e-05,3.9e-05,0.00018,-7e-05,-5.1e-05,1.4e-05,8.2e-05,1.7e-05,3e-06,-8.8e-05,1e-06,3.1e-05,0.000191,0.000105,6.6e-05,-3.1e-05,-3.1e-05,6.6e-05,1.1e-05,1.3e-05,-3.1e-05,-1.4e-05,1.5e-05,1.7e-05,2.8e-05,-8e-06,-8e-06,-1.2e-05,4.3e-05,0,0,-2e-06,7e-06,7e-06,7e-06,-5e-06,-9e-06,-7e-06,-8e-06,-1.8e-05,2e-06,5e-06,-9e-06,6e-06,-7e-06,4e-06,1.7e-05,6e-06,1e-06,2e-06,7e-06,0,1e-06,-4e-06,-1.1e-05,-1.5e-05,1e-05,4e-06,8e-06,1.7e-05,-2.5e-05,4e-06,-1e-05,-1e-06
-8e-06,-2e-06,-2e-06,8e-06,1.1e-05,2.3e-05,4.6e-05,-1.4e-05,-0.000248,2.1e-05,-8.1e-05,0.000142,1.4e-05,5.8e-05,-0.000105,-1.4e-05,-5e-06,-8.8e-05,-3e-06,-1.7e-05,3.6e-05,4.2e-05,-0.000232,0.00034,0.000349,0.000464,0.000501,4.7e-05,0.000336,-0.000255,-0.000207,-0.000344,-0.000113,0.000153,0.000793,5.7e-05,0.000244,0.000125,7.2e-05,8.3e-05,-0.000437,-0.000705,-0.000476,9.7e-05,-8.7e-05,-0.000545,-0.000256,0.00012,-0.000351,0.00015,0.000143,0.000219,-7.1e-05,0.000118,0.000107,-0.000145,-1.8e-05,-6.5e-05,-0.000114,-0.000109,-2e-05,-6e-06,-2.8e-05,-3.4e-05,-3.1e-05,4.8e-05,-2e-06,-6.1e-05,5.2e-05,-0.000248,-0.000115,1e-05,5.4e-05,1.8e-05,-2.3e-05,4.5e-05,-6.4e-05,2.4e-05,1.5e-05,-1.1e-05,-1.4e-05,5e-06,1.9e-05,-2.9e-05,2.2e-05,-4.7e-05,-1.7e-05,1.2e-05,-1.1e-05,2e-05,-1.2e-05,-2e-06,-1e-06,6e-06,7e-06,1.7e-05,-9e-06,-5e-06,8e-06,1.3e-05,3e-06,-2e-06,5e-06,-1.1e-05,5e-06,2e-06,-2e-06,6e-06,-1e-06,0,1.1e-05,-1e-06,8e-06,-7e-06,4e-06,-5e-06,-2.5e-05,2.1e-05,0,1e-06,1e-06
5e-06,-5e-06,5e-06,-7e-06,8e-06,-8e-06,1.7e-05,0.000116,0.000122,5.3e-05,2.8e-05,-7.9e-05,-3.4e-05,-8.9e-05,4.4e-05,4.4e-05,1.2e-05,3.2e-05,1.3e-05,5.4e-05,-5.7e-05,-4e-05,0.000121,-2.4e-05,8.5e-05,0.000159,-0.000214,0.000209,0.000125,-0.00047,8.5e-05,-0.000515,0.000161,-0.000337,-0.000369,8.7e-05,9.4e-05,0.000171,0.000375,5.2e-05,8.8e-05,2.9e-05,0.000635,0.000432,-0.000169,0.000404,0.000301,-0.000189,-0.000229,-0.000356,-3e-05,-0.000111,1.4e-05,-2.1e-05,-0.000114,0.000141,-4.4e-05,2.7e-05,1.2e-05,1.9e-05,2.4e-05,2.3e-05,-1.9e-05,2.7e-05,-2.1e-05,-6.3e-05,1.6e-05,5e-06,7e-06,6.4e-05,5.7e-05,1.6e-05,1e-06,2.2e-05,1.3e-05,-3.6e-05,1.5e-05,1.2e-05,1.4e-05,1.5e-05,-2e-06,-1.1e-05,-1.5e-05,-1.8e-05,-1.3e-05,1.6e-05,-2e-06,-4e-06,1.1e-05,-2.4e-05,-6e-06,0,3e-06,-1.2e-05,3e-06,3e-06,-3e-06,-6e-06,3e-06,-3e-06,-2e-06,5e-06,1e-05,4e-06,-4e-06,-8e-06,-2e-06,1e-06,0,-1e-06,-5e-06,-2e-06,-2e-06,-2e-06,1e-05,1e-05,1.7e-05,-1.7e-05,-9e-06,1e-06,-2e-06
3e-06,-4e-06,1e-06,-2e-06,-2e-06,6e-06,-6.5e-05,-0.00011,7e-06,-1.8e-05,5e-06,1.2e-05,0.000105,0.000108,-2e-05,-9.6e-05,-1.6e-05,4e-06,1.5e-05,-5.4e-05,4.2e-05,5e-06,-0.000114,-1.3e-05,-4e-06,-0.000135,-4.6e-05,-0.000275,9e-06,8.6e-05,-4.3e-05,0.000101,-0.000174,-2e-05,-5.3e-05,-2.7e-05,-2.1e-05,-0.000228,-0.000248,-2.6e-05,0.00052,-0.00029,-0.000265,-0.000457,-1.6e-05,-0.000132,-6.8e-05,0.000128,3.1e-05,-3.9e-05,7.6e-05,0.000247,3.9e-05,-0.000205,0.000178,6.8e-05,-9.2e-05,-4.1e-05,3.9e-05,3.8e-05,2.4e-05,-1.1e-05,4e-06,-3.6e-05,1.6e-05,5e-06,2.2e-05,4.1e-05,-6.2e-05,-4.5e-05,1e-06,-3.5e-05,-9e-06,2e-06,-1.7e-05,-4e-06,-4.7e-05,-1.4e-05,-1.9e-05,-7e-06,1.7e-05,-1.6e-05,4e-06,7e-06,3e-06,-1e-06,1.8e-05,0,3e-06,2e-06,8e-06,-6e-06,-2e-06,1.1e-05,0,-5e-06,7e-06,8e-06,-9e-06,3e-06,-4e-06,-6e-06,-2e-06,-8e-06,-8e-06,1.4e-05,0,-3e-06,-4e-06,-2e-06,2e-06,-4e-06,4e-06,1e-06,5e-06,-1.5e-05,-1.2e-05,0,0,3e-06,1e-06
-1.1e-05,-1e-06,-4e-06,3e-06,-5e-06,2e-06,-1.6e-05,6.8e-05,-0.000253,2.3e-05,4.1e-05,1.5e-05,-8.9e-05,-0.000138,5.1e-05,-1.1e-05,5e-06,-1.6e-05,-8e-06,2.6e-05,-8e-06,6e-06,2e-06,-0.000198,4.7e-05,-0.000172,-0.000157,-8.1e-05,7.5e-05,-0.000379,-5.7e-05,-8.2e-05,2.8e-05,5.8e-05,-0.000125,4.8e-05,-7.7e-05,-0.000199,0.000315,-2e-05,-0.000527,0.000374,-1.3e-05,0.000109,6.9e-05,0.00028,-0.000204,7.2e-05,0.000165,-7.6e-05,0.000117,-0.000108,-0.00016,0.000226,-3.7e-05,-3.1e-05,-3.8e-05,5e-06,3.9e-05,-2.4e-05,9e-06,1.7e-05,-2.5e-05,-2.4e-05,2.2e-05,-1.4e-05,1e-05,-1.4e-05,-1e-05,-6.1e-05,-9.4e-05,-2e-05,-1.6e-05,-1.5e-05,-4e-06,-1.1e-05,5e-06,1.1e-05,-4e-06,1e-06,-1e-05,1.8e-05,1.2e-05,1.8e-05,-3e-06,9e-06,-9e-06,-3e-06,-5e-06,-3e-06,-5e-06,-2e-06,-1e-06,-8e-06,3e-06,-2e-06,-1.4e-05,-4e-06,0,-6e-06,8e-06,7e-06,-1.2e-05,7e-06,-1e-06,2e-06,2e-06,5e-06,-2e-06,-2e-06,-5e-06,-4e-06,-1e-06,2e-06,2e-06,1.2e-05,1.4e-05,8e-06,7e-06,-7e-06,-2e-06
5e-06,1e-06,2e-06,6e-06,-8e-06,-4e-06,2.5e-05,-9e-05,0.000347,7e-06,-2e-05,-4e-05,2.7e-05,0.00014,-6.2e-05,5.2e-05,-1e-06,-2.4e-05,8e-06,6e-06,1.4e-05,-6.4e-05,4.5e-05,-0.000218,-0.000108,-0.000229,0.000171,-2.1e-05,7.5e-05,0.000329,-6.2e-05,-0.000281,9.2e-05,-0.000314,2.5e-05,-2.5e-05,-6.9e-05,0.000115,-0.00049,-6.2e-05,0.000546,-0.000184,0.000103,-0.000103,-4.8e-05,6.2e-05,0.000312,-4.6e-05,-8e-05,4.5e-05,-9.4e-05,0.000129,9.9e-05,-4.1e-05,-9e-06,-3.1e-05,2.5e-05,2e-05,-5.6e-05,4e-06,-3.2e-05,-2.8e-05,7e-06,5.1e-05,-5e-06,1.4e-05,-3e-06,-1.2e-05,8e-05,9.5e-05,0.000104,5e-06,-1.1e-05,-9e-06,1.2e-05,1e-05,1.8e-05,-5e-06,5e-06,4e-06,-7e-06,0,-2e-06,3e-06,1.3e-05,-1e-05,1e-06,6e-06,-3e-06,-2e-06,5e-06,1.2e-05,0,1e-06,0,8e-06,3e-06,-1e-06,6e-06,-1e-06,-5e-06,-5e-06,3e-06,-3e-06,4e-06,-3e-06,-1e-06,1e-06,0,5e-06,1e-06,5e-06,-4e-06,-2e-06,4e-06,2e-06,-2e-06,-5e-06,-5e-06,1e-06,0
1e-06,0,-6e-06,-5e-06,2e-06,5e-06,1.8e-05,6.5e-05,-0.00019,-7.5e-05,-4.6e-05,3.8e-05,-5e-06,-0.000122,3e-06,-4.2e-05,1.7e-05,1e-05,9e-06,-1.2e-05,-3.6e-05,1e-06,0.000288,0.000183,5.9e-05,0.000115,0.000104,-0.000262,9.6e-05,9.1e-05,-8e-06,0.000453,-7.4e-05,0.000163,6.8e-05,-1.3e-05,0.000125,-3.1e-05,7.4e-05,7e-06,-0.000334,0.000197,1.3e-05,6.2e-05,6.2e-05,8.5e-05,-6.7e-05,-0.000197,-8.6e-05,0.000193,-7.8e-05,3.6e-05,-2.9e-05,1.8e-05,4.1e-05,7e-06,6e-05,-1.3e-05,1e-06,3.6e-05,-1.5e-05,1.6e-05,1.4e-05,-3.6e-05,-9e-06,1.9e-05,0,1.1e-05,-3.4e-05,-9e-06,-3.1e-05,3.2e-05,2.7e-05,8e-06,1.2e-05,-6e-06,-1e-05,-4e-06,1e-06,2e-06,-3e-06,8e-06,0,-3e-06,-2e-06,1.5e-05,-3e-06,-3e-06,4e-06,1.1e-05,1e-06,-4e-06,-1e-06,-7e-06,0,-5e-06,4e-06,3e-06,1e-06,-2e-06,-6e-06,3e-06,0,-2e-06,3e-06,0,-4e-06,1e-06,-1e-06,-3e-06,0,3e-06,-1e-06,-2e-06,3e-06,-1.3e-05,-6e-06,6e-06,-1e-06,6e-06,2e-06
-8e-06,-2e-06,0,4e-06,7e-06,-7e-06,8e-06,2.2e-05,5e-05,2.1e-05,4.7e-05,-2.2e-05,-9e-06,7.4e-05,2e-05,-2e-06,-2.6e-05,4.6e-05,-7e-06,6e-06,2.3e-05,-3.7e-05,3.6e-05,-0.000115,4.2e-05,0.000174,-0.000314,3.6e-05,1e-04,9.8e-05,-4.2e-05,0.000222,-1.6e-05,-0.000273,0.000111,-4.8e-05,1.2e-05,-1.1e-05,-2.7e-05,5.2e-05,-0.000103,-0.000146,-9.1e-05,-3.5e-05,2e-04,-0.00015,-7.5e-05,2.6e-05,0.000111,-9.6e-05,-5e-05,-0.000296,1.3e-05,-8e-05,-3.7e-05,6.8e-05,5.4e-05,1.7e-05,7.3e-05,-2e-05,2.7e-05,-1e-06,1.8e-05,7e-06,-5e-06,-2.2e-05,-5e-06,-5e-06,-2.5e-05,1.4e-05,0,3.3e-05,2e-06,4e-06,-1.3e-05,1.1e-05,1.6e-05,9e-06,-3e-06,-4e-06,2e-05,-4e-06,3e-06,-3e-06,-9e-06,-1.4e-05,5e-06,0,5e-06,-2e-06,0,-2e-06,0,1e-05,-4e-06,-7e-06,-4e-06,0,-2e-06,2e-06,3e-06,-5e-06,-4e-06,0,3e-06,-1e-06,-1e-06,-2e-06,0,0,3e-06,0,1e-06,1e-06,3e-06,9e-06,1e-06,-1.2e-05,6e-06,-4e-06,-1e-06
6e-06,0,-1e-06,1e-06,2e-06,3e-06,-1.4e-05,-3.9e-05,4.5e-05,2.3e-05,4.2e-05,1.5e-05,2.9e-05,-4.9e-05,3e-05,2.7e-05,2.7e-05,-2.7e-05,-2e-06,4e-06,-9e-06,1.6e-05,-0.000517,-0.000146,-6.7e-05,-4.8e-05,0.000389,7.4e-05,7e-06,-0.000204,-5.2e-05,1.7e-05,4.1e-05,3.3e-05,-0.000233,6e-06,-0.000123,6.5e-05,-7e-06,2.7e-05,0.000167,0.000179,-0.000105,-0.00014,-7.1e-05,-0.000121,0.000123,5e-05,-8e-06,-3.8e-05,0,-5.5e-05,-2.4e-05,-4.8e-05,-6e-06,-1e-06,-6e-06,-2.2e-05,-3.8e-05,5e-06,1.7e-05,-7e-06,-1.3e-05,3e-06,1e-05,-9e-06,-1e-06,-2e-06,2.7e-05,4.6e-05,-2.5e-05,2.2e-05,-1.2e-05,-8e-06,-5e-06,-1.3e-05,-1.4e-05,9e-06,-5e-06,3e-06,-5e-06,-2e-06,-1e-05,-1e-05,-3e-06,3e-06,-2e-06,3e-06,-5e-06,1e-06,-3e-06,-2e-06,1e-06,5e-06,-4e-06,7e-06,3e-06,2e-06,1e-06,0,2e-06,4e-06,6e-06,-2e-06,-5e-06,-5e-06,2e-06,1e-06,1e-06,-1e-06,-2e-06,1e-06,2e-06,0,3e-06,-3e-06,8e-06,1.5e-05,-2e-06,0,1e-06
0,-1e-06,-2e-06,-4e-06,-6e-06,-4e-06,-1.9e-05,2.7e-05,-8.2e-05,-3.1e-05,-2.5e-05,-1.2e-05,-2.7e-05,3e-05,-4.3e-05,-2.5e-05,-1.6e-05,-2e-06,8e-06,-1e-06,6e-06,-2.6e-05,5.6e-05,0.000218,9.8e-05,-9.8e-05,5.6e-05,-9.1e-05,-2.9e-05,-4.2e-05,-5.9e-05,0.000254,-7e-06,0.000216,8.9e-05,-2.5e-05,-0.000115,7.7e-05,0.000166,2.2e-05,-3e-06,-0.000318,0.000284,-9.9e-05,-0.000111,0.000177,-0.000139,6e-06,3e-05,-9.9e-05,-1.7e-05,5.5e-05,0.000134,9.3e-05,-6e-06,-5.8e-05,-6.8e-05,1e-05,-3.3e-05,1.8e-05,-1.9e-05,1.5e-05,-3e-06,8e-06,9e-06,2e-06,-7e-06,7e-06,1e-06,-5.2e-05,5e-06,7e-06,1.2e-05,3e-06,6e-06,1.3e-05,9e-06,-4e-06,7e-06,-2e-06,-4e-06,-1e-05,2e-06,4e-06,1e-06,2e-06,-2e-06,-2e-06,-1e-06,0,2e-06,3e-06,-1e-06,2e-06,1e-06,-5e-06,0,-5e-06,2e-06,1e-06,-3e-06,-4e-06,4e-06,1e-06,-2e-06,1e-06,0,0,1e-06,1e-06,-2e-06,1e-06,0,1e-06,2e-06,-3e-06,-1.6e-05,-1e-05,-1e-06,1e-06,-1e-06
-3e-06,-2e-06,2e-06,-2e-06,0,-1e-06,1.1e-05,-4.8e-05,0.000158,8e-06,-3.3e-05,6e-06,3.4e-05,2e-06,-7e-06,4e-06,-5e-06,2.2e-05,0,-1e-05,0,-8e-06,-5.6e-05,0.000172,-9.6e-05,-0.000152,-0.000224,0.000143,0.000149,-0.00012,3.1e-05,-4.8e-05,1.7e-05,-1.7e-05,0.000108,4e-05,0.000126,-4.4e-05,-8.8e-05,0,-8e-05,8e-05,-0.00017,0.000112,0.000106,-6e-06,6e-05,-0.000107,7.5e-05,-7.1e-05,-4.4e-05,2.6e-05,-0.000113,-9.6e-05,2.5e-05,-1.5e-05,-4.9e-05,-1.4e-05,2.5e-05,1e-06,-9e-06,-1.6e-05,-9e-06,3e-06,-5e-06,-5e-06,-5e-06,-4e-06,-1.2e-05,-1e-06,1.7e-05,-6e-06,-1.4e-05,-1e-06,-4e-06,-3e-06,1.9e-05,3e-06,2e-06,-3e-06,-5e-06,7e-06,0,5e-06,1e-05,1e-06,0,1e-06,1e-06,-1.1e-05,-1e-06,0,0,-7e-06,1e-06,-4e-06,7e-06,0,0,0,0,2e-06,-3e-06,-4e-06,1e-06,-5e-06,-1e-06,-1e-06,-1e-06,1e-06,2e-06,1e-06,-3e-06,1e-06,1e-06,4e-06,1e-05,3e-06,1e-06,2e-06,0
2e-06,-1e-06,1e-06,2e-06,-2e-06,1e-06,1.4e-05,4.7e-05,-0.000103,1.9e-05,-1e-05,1e-05,-1.7e-05,-2.3e-05,2.1e-05,2.7e-05,1.8e-05,-6e-06,4e-06,3e-06,-5e-06,-2e-06,0.000316,-1e-05,-5.2e-05,-1e-06,-0.000133,0.000122,-2.9e-05,0.000101,1.8e-05,-0.000333,-4e-05,0.000105,-3.2e-05,2.8e-05,5.3e-05,-0.000158,9e-05,7e-06,-5e-05,3.9e-05,7e-06,0.000128,-0.000143,9e-06,3.6e-05,6e-06,-0.000102,2.8e-05,1.5e-05,-1.1e-05,0.000119,-1.6e-05,-2.4e-05,5.5e-05,-3e-06,9e-06,1.5e-05,-1.2e-05,6e-06,8e-06,0,-2.7e-05,-6e-06,6e-06,1e-06,0,-9e-06,1.4e-05,4e-06,-1.6e-05,0,-2e-06,8e-06,1.1e-05,-1e-06,-4e-06,-1e-05,4e-06,6e-06,4e-06,-2e-06,1e-05,-5e-06,-3e-06,5e-06,0,2e-06,6e-06,0,-2e-06,1e-06,-5e-06,3e-06,0,-5e-06,2e-06,-3e-06,2e-06,1e-06,-2e-06,-3e-06,1e-06,2e-06,-3e-06,1e-06,-2e-06,-2e-06,-2e-06,-1e-06,1e-06,-1e-06,-1e-06,2e-06,-2e-06,-3e-06,-2e-06,-2e-06,-2e-06,0
3e-06,1e-06,1e-06,-1e-06,4e-06,-2e-06,0,-2.4e-05,-2.4e-05,-8e-06,4e-06,-2.5e-05,1.1e-05,2.7e-05,1.3e-05,-1.5e-05,-1.9e-05,-1.5e-05,-1e-06,1e-06,1.1e-05,-3.1e-05,0,7e-05,7.1e-05,9.2e-05,-2.7e-05,-7.8e-05,-3e-06,0.000192,-2.7e-05,-3e-06,-1.1e-05,5.6e-05,0.000106,1.3e-05,-2.9e-05,3.7e-05,-0.000116,-6e-05,9.4e-05,0.000166,7.3e-05,-5.4e-05,2.2e-05,-8.5e-05,-0.000111,1e-05,-3.9e-05,-2.9e-05,4.7e-05,-2e-06,-9.4e-05,6.1e-05,3.1e-05,-3e-06,3.5e-05,1e-06,-1.5e-05,1.6e-05,1e-05,2e-06,-3e-06,2.2e-05,-2e-06,1e-05,5e-06,4e-06,1e-05,-5.6e-05,-2.4e-05,-1e-05,4e-06,-2e-06,0,-7e-06,-2e-06,-5e-06,1e-06,1e-06,3e-06,-5e-06,4e-06,-4e-06,1e-06,6e-06,-4e-06,-1e-06,-1e-06,2e-06,-2e-06,0,-1e-06,3e-06,1e-06,-2e-06,6e-06,-1e-06,-2e-06,0,0,1e-06,1e-06,-2e-06,0,-1e-06,1e-06,0,0,0,2e-06,0,0,-1e-06,1e-06,0,-1e-06,7e-06,0,-1e-06,-1e-06
-5e-06,0,1e-06,-1e-06,2e-06,2e-06,-6e-06,2.2e-05,4.7e-05,-1.2e-05,3e-06,2.6e-05,-8e-06,-2.3e-05,-9e-06,7e-06,8e-06,-4e-06,-5e-06,-3e-06,-1.4e-05,4e-06,-0.000191,5e-06,-1.4e-05,5.1e-05,0.00026,5.6e-05,1.6e-05,-9.9e-05,-6.3e-05,-3.5e-05,5e-05,-8.8e-05,-6.8e-05,7e-06,-4.7e-05,3.5e-05,-1.2e-05,-4.4e-05,-0.000318,-0.000119,1.9e-05,-0.000109,7.6e-05,8e-06,7.6e-05,6.4e-05,1e-04,2.9e-05,1.5e-05,0.000105,6.2e-05,-1.1e-05,-3e-05,-4.8e-05,4.2e-05,-1e-06,-2.1e-05,-8e-06,3e-06,-5e-06,2.1e-05,-1e-05,5e-06,-2.2e-05,9e-06,-5e-06,1.7e-05,4.2e-05,1e-05,-1.3e-05,-2e-06,4e-06,-4e-06,-1e-06,-1.9e-05,1e-05,3e-06,-4e-06,-9e-06,2e-06,1e-06,-6e-06,-5e-06,-5e-06,2e-06,1e-06,-1e-06,-1e-06,1e-06,2e-06,0,3e-06,0,-1e-06,-3e-06,4e-06,1e-06,0,2e-06,-1e-06,-2e-06,-1e-06,1e-06,-1e-06,0,1e-06,1e-06,0,-2e-06,1e-06,1e-06,1e-06,0,1e-06,3e-06,-4e-06,0,2e-06,1e-06
4e-06,-1e-06,0,3e-06,0,-2e-06,-1.2e-05,-2.2e-05,-6.4e-05,3.2e-05,7e-06,-1.1e-05,-4e-06,1.2e-05,-1.7e-05,1.1e-05,-2e-06,1.4e-05,1e-06,0,9e-06,-6e-06,-2.2e-05,-8.3e-05,3.6e-05,-6.1e-05,-0.00012,-6.6e-05,1.4e-05,-2e-06,-2.4e-05,-0.000174,-5.3e-05,-2.5e-05,-0.000119,-1.5e-05,6e-06,-1.7e-05,2.7e-05,4e-06,0.00029,-9e-06,-5.9e-05,-7e-05,-9.6e-05,-7.1e-05,-1.7e-05,-4.9e-05,-3.7e-05,0,-1.6e-05,-2.3e-05,-2.7e-05,-2e-05,1.6e-05,-8e-06,1.4e-05,3e-06,2.7e-05,-5e-06,-1.1e-05,4e-06,2e-06,5e-06,6e-06,6e-06,5e-06,-2e-06,-1.1e-05,-2.8e-05,-6e-06,-1e-06,1e-06,2e-06,-7e-06,-4e-06,-9e-06,-3e-06,0,3e-06,3e-06,-5e-06,-3e-06,-3e-06,7e-06,0,1e-06,-2e-06,2e-06,5e-06,0,-1e-06,0,1e-06,-1e-06,-5e-06,4e-06,-1e-06,2e-06,-1e-06,-1e-06,0,-2e-06,0,-2e-06,2e-06,-2e-06,-2e-06,1e-06,0,1e-06,-1e-06,0,1e-06,1e-06,1e-06,-4e-06,-3e-06,-1e-06,-2e-06,-1e-06
-1e-06,-1e-06,1e-06,1e-06,-4e-06,2e-06,0,1e-05,1.6e-05,-1.5e-05,5e-06,-1e-06,2e-06,1e-06,1.8e-05,-2.2e-05,-6e-06,-6e-06,3e-06,3e-06,-6e-06,-9e-06,-9.8e-05,1e-06,3e-06,-9.1e-05,-2.9e-05,-0.000115,-2.1e-05,-4.8e-05,-3e-06,0.000173,-2e-06,-5.1e-05,6.7e-05,-1.6e-05,3.2e-05,2.9e-05,6e-06,-2.5e-05,-7.2e-05,-3.5e-05,-3.2e-05,8.7e-05,5.7e-05,-1.2e-05,0,-3.2e-05,-9.1e-05,-2.3e-05,1.8e-05,-5e-06,6.2e-05,-3.4e-05,-1e-06,2.6e-05,-2.7e-05,-6e-06,3e-06,5e-06,-8e-06,-6e-06,-1.3e-05,0,-2e-06,-6e-06,0,4e-06,-1.8e-05,5e-06,9e-06,7e-06,8e-06,-1e-06,8e-06,0,2e-06,-1e-06,-1e-06,-2e-06,3e-06,6e-06,3e-06,0,-3e-06,-2e-06,0,2e-06,-2e-06,-5e-06,1e-06,-2e-06,0,-5e-06,-2e-06,1e-06,-4e-06,-2e-06,-1e-06,-1e-06,1e-06,0,4e-06,-1e-06,1e-06,-3e-06,0,0,0,0,-2e-06,-1e-06,0,-1e-06,0,-1e-06,6e-06,2e-06,0,0,1e-06
-2e-06,-1e-06,-1e-06,-2e-06,0,0,1.4e-05,-7e-06,5e-05,-1e-06,9e-06,1e-05,-8e-06,-1.5e-05,-2e-06,-3e-06,1e-05,-2e-06,-1e-06,-1e-06,8e-06,-8e-06,0.00015,-8.3e-05,-3.1e-05,-6.4e-05,8.2e-05,5.1e-05,3.9e-05,4.1e-05,1e-05,0.000117,3.4e-05,-0.000117,-2.7e-05,4e-06,1.5e-05,4e-06,5.9e-05,4e-05,-0.000123,1.9e-05,0.000145,0.000112,-4e-06,0.000104,1e-06,-1.8e-05,2e-06,2e-06,1.2e-05,7.1e-05,-0.000103,2e-05,-2.4e-05,1e-05,-3.8e-05,2e-06,-2.3e-05,-7e-06,1e-05,5e-06,3e-06,-1e-06,-5e-06,1.8e-05,-5e-06,0,1.5e-05,2.5e-05,-2e-06,1.3e-05,-5e-06,-4e-06,1e-06,-1e-06,5e-06,1e-06,-2e-06,-1e-06,3e-06,-2e-06,-2e-06,3e-06,2e-06,3e-06,-1e-06,-1e-06,-1e-06,-2e-06,-1e-06,1e-06,0,1e-06,-1e-06,0,3e-06,1e-06,-2e-06,-1e-06,-2e-06,-1e-06,2e-06,1e-06,0,-3e-06,1e-06,0,0,-1e-06,2e-06,-2e-06,-1e-06,0,0,-1e-06,-5e-06,1e-06,1e-06,0,-1e-06
2e-06,-1e-06,-1e-06,1e-06,1e-06,0,2e-06,5e-06,-5.9e-05,-1.8e-05,2e-06,-1.1e-05,8e-06,2.6e-05,3e-06,2e-06,-8e-06,7e-06,1e-06,0,-1e-05,-9e-06,-4.7e-05,-0.000128,1e-05,5.2e-05,-3e-05,-6.1e-05,-6.9e-05,-0.000101,-9e-06,-4e-05,-5e-05,3.6e-05,3.7e-05,9e-06,-5.6e-05,2e-05,-2.1e-05,1.2e-05,0.000194,-2.6e-05,-0.000148,4.4e-05,1.8e-05,-2e-06,-1.6e-05,4e-05,2.1e-05,-6.1e-05,-1.8e-05,-4.1e-05,9e-05,4.8e-05,3e-05,0,-2.5e-05,-3e-06,5e-06,-2e-06,7e-06,-4e-06,-8e-06,1.2e-05,-1e-06,-1.5e-05,-6e-06,-1e-06,9e-06,-1.7e-05,8e-06,1.7e-05,-3e-06,-1e-06,0,-1e-06,1.1e-05,-3e-06,4e-06,3e-06,-4e-06,0,-2e-06,3e-06,-4e-06,-2e-06,0,0,1e-06,1e-06,0,1e-06,-1e-06,1e-06,0,-4e-06,-3e-06,-1e-06,1e-06,0,1e-06,1e-06,-3e-06,-3e-06,0,6e-06,1e-06,1e-06,0,1e-06,-1e-06,0,0,0,0,2e-06,1e-06,1e-06,1e-06,0,0
0,0,0,0,2e-06,1e-06,-8e-06,7e-06,6.5e-05,1.7e-05,-1.3e-05,1e-06,0,-3.5e-05,-1.2e-05,-9e-06,3e-06,-3e-06,-2e-06,-2e-06,9e-06,-3e-06,7e-06,6.9e-05,-6e-06,4.9e-05,1.4e-05,-3.2e-05,-5e-06,9.6e-05,-1.7e-05,0.000129,5.3e-05,-4.3e-05,-6e-06,-4e-06,-4.5e-05,-5.2e-05,-2e-06,1.1e-05,-0.000167,5.1e-05,4.7e-05,-0.000145,3.3e-05,-5.8e-05,3.1e-05,2.5e-05,2e-06,1.9e-05,-1.4e-05,2.8e-05,-5e-05,-3.9e-05,-2.2e-05,-3.7e-05,1e-05,4e-06,1.3e-05,6e-06,-5e-06,2e-06,2e-06,-1.6e-05,4e-06,-1e-06,-4e-06,0,-1.1e-05,3.9e-05,-1.5e-05,1e-06,1e-06,2e-06,-1e-06,1e-06,3e-06,-1e-06,-1e-06,-1e-06,-4e-06,-3e-06,2e-06,1e-06,4e-06,5e-06,-1e-06,1e-06,1e-06,-3e-06,0,0,0,3e-06,1e-06,1e-06,1e-06,0,1e-06,0,-1e-06,-1e-06,1e-06,1e-06,-1e-06,-1e-06,-2e-06,0,0,0,1e-06,-2e-06,0,0,-1e-06,0,0,-5e-06,0,0,0
-2e-06,0,-1e-06,-2e-06,0,-1e-06,-4e-06,-9e-06,-6.1e-05,4e-06,5e-06,0,0,3.6e-05,1.2e-05,1e-05,0,-4e-06,-2e-06,5e-06,-7e-06,-1.1e-05,6.1e-05,6.5e-05,-4e-06,3e-06,-6.9e-05,0.000118,9e-06,1.9e-05,-1.7e-05,6.6e-05,-4e-06,5.5e-05,-4.4e-05,1.1e-05,4.8e-05,-5.1e-05,-2.2e-05,1.1e-05,1.9e-05,4.3e-05,1.1e-05,-3.9e-05,-2.7e-05,2.9e-05,-3.3e-05,-6.8e-05,-6e-06,1.7e-05,-1e-06,-5.3e-05,3.8e-05,-4e-06,1.7e-05,2.2e-05,3.3e-05,0,-2e-06,-9e-06,-7e-06,3e-06,4e-06,7e-06,2e-06,-5e-06,0,0,-1e-06,-1.6e-05,3e-06,-5e-06,-2e-06,3e-06,-5e-06,-1e-06,0,5e-06,-2e-06,-2e-06,4e-06,1e-06,-2e-06,-4e-06,0,-4e-06,1e-06,-1e-06,0,6e-06,0,-1e-06,0,-2e-06,1e-06,1e-06,-2e-06,0,-1e-06,0,2e-06,1e-06,-1e-06,-2e-06,0,-3e-06,0,0,1e-06,-1e-06,-1e-06,0,1e-06,1e-06,-1e-06,-2e-06,-1e-06,3e-06,-1e-06,0,-1e-06
3e-06,0,0,0,-1e-06,1e-06,1e-06,5e-06,2.9e-05,-1e-05,8e-06,0,-2e-06,-3.2e-05,-6e-06,9e-06,-2e-06,-1e-06,3e-06,-3e-06,7e-06,-1e-06,-0.000137,-2.8e-05,1.5e-05,-7.9e-05,8.9e-05,-2.8e-05,-5.5e-05,-3.9e-05,-1.8e-05,-0.000168,-3.2e-05,6e-05,4.3e-05,1.4e-05,4e-05,5.6e-05,-4.1e-05,-2.3e-05,4.1e-05,-5.7e-05,3.9e-05,-1e-06,3e-06,1.1e-05,-7e-06,-2.5e-05,2.1e-05,1.6e-05,1e-06,-8e-06,-2.4e-05,3.9e-05,-5e-06,3.9e-05,2.9e-05,-1e-06,-1.1e-05,-1e-06,2e-06,-7e-06,6e-06,-4e-06,-3e-06,2e-06,3e-06,0,7e-06,1e-06,4e-06,-9e-06,5e-06,0,3e-06,7e-06,-6e-06,-3e-06,1e-06,2e-06,0,1e-06,0,-4e-06,2e-06,1e-06,0,2e-06,-1e-06,1e-06,-1e-06,0,0,0,0,-1e-06,-1e-06,0,-2e-06,0,-2e-06,-1e-06,-2e-06,0,1e-06,0,1e-06,1e-06,0,0,0,-1e-06,0,0,-1e-06,2e-06,2e-06,0,0,0,1e-06
0,-1e-06,0,2e-06,-2e-06,-1e-06,8e-06,-9e-06,2e-05,-1.3e-05,-1.2e-05,-5e-06,-5e-06,2.2e-05,6e-06,-1e-06,2e-06,0,-2e-06,1e-06,-3e-06,-6e-06,-2.3e-05,7.1e-05,-2.1e-05,-4.3e-05,-3.2e-05,2e-05,-3.3e-05,5.8e-05,-1.8e-05,-9e-06,5.5e-05,3e-05,1.5e-05,0,-2.7e-05,4e-06,2.9e-05,-1.3e-05,1.7e-05,-3.2e-05,-9.2e-05,0.000107,-6e-05,-1.9e-05,3.6e-05,3.8e-05,4.6e-05,1.3e-05,-7e-06,-8.4e-05,3.9e-05,-1.4e-05,2e-06,-1.6e-05,-2e-06,2e-06,3e-06,6e-06,4e-06,8e-06,7e-06,3e-06,-3e-06,6e-06,4e-06,1e-06,0,1e-05,5e-06,-1.7e-05,0,-3e-06,5e-06,-1e-06,-5e-06,1e-06,0,-1e-06,0,1e-06,1e-06,-2e-06,-3e-06,-2e-06,0,-1e-06,0,-3e-06,0,1e-06,0,0,0,0,1e-06,0,1e-06,0,1e-06,1e-06,1e-06,-1e-06,1e-06,1e-06,0,0,-1e-06,-1e-06,1e-06,0,-1e-06,-1e-06,-1e-06,-1e-06,1e-06,1e-06,-2e-06,0,-1e-06
-2e-06,-1e-06,0,0,0,0,3e-06,8e-06,-3.2e-05,1.3e-05,-9e-06,8e-06,2e-06,-1e-05,-7e-06,-4e-06,-2e-06,0,-2e-06,1e-06,-1e-06,-9e-06,-5.5e-05,8.9e-05,-9e-06,-2.3e-05,-6.4e-05,8.4e-05,-9e-06,-5.4e-05,-9e-06,-3e-05,-4.9e-05,2.5e-05,1.1e-05,-4e-06,-3.4e-05,-1.7e-05,2e-06,-2.5e-05,-0.00011,2.2e-05,3.4e-05,1.4e-05,1.2e-05,3.3e-05,-6.4e-05,1.6e-05,-3e-06,-4.6e-05,-9e-06,-7e-06,-6.4e-05,-4e-06,-3e-06,-3.8e-05,-2.7e-05,-2e-06,7e-06,-5e-06,3e-06,-5e-06,-1.4e-05,0,0,-6e-06,4e-06,0,-8e-06,-4.2e-05,-6e-06,-7e-06,-5e-06,-1e-06,-1e-06,5e-06,0,2e-06,1e-06,0,-3e-06,-1e-06,-1e-06,4e-06,0,4e-06,0,1e-06,1e-06,3e-06,0,-1e-06,0,2e-06,-1e-06,2e-06,-2e-06,0,2e-06,1e-06,-2e-06,-1e-06,1e-06,-1e-06,0,0,-2e-06,0,0,1e-06,0,0,0,0,-1e-06,0,-2e-06,-2e-06,0,0,0
3e-06,-1e-06,0,-1e-06,2e-06,0,-8e-06,2e-06,2.2e-05,9e-06,-4e-06,-7e-06,-1e-06,-3e-06,8e-06,3e-06,1e-06,3e-06,3e-06,0,4e-06,-1e-06,9.7e-05,-1.9e-05,2e-06,6.7e-05,2.1e-05,-7.5e-05,-5.5e-05,-3.1e-05,1.2e-05,-0.000172,3.1e-05,3.5e-05,0,4e-06,2.4e-05,2.3e-05,1.9e-05,-5e-06,9.1e-05,4.4e-05,7.2e-05,-5.3e-05,4e-06,2e-05,6.8e-05,-2e-05,-1.9e-05,-2.9e-05,-4e-06,5.2e-05,6.1e-05,-1.5e-05,-2e-06,2.4e-05,-3.4e-05,-1e-06,-4e-06,-5e-06,-3e-06,1e-06,-5e-06,-2e-06,2e-06,-6e-06,2e-06,0,-1e-06,1.8e-05,6e-06,-5e-06,4e-06,3e-06,-3e-06,-5e-06,5e-06,-5e-06,0,1e-06,2e-06,-1e-06,1e-06,2e-06,0,-3e-06,0,0,0,-6e-06,0,0,0,-1e-06,-1e-06,1e-06,1e-06,1e-06,0,0,3e-06,1e-06,0,0,-1e-06,-2e-06,0,-1e-06,0,0,1e-06,1e-06,0,1e-06,-1e-06,1e-06,1e-06,0,1e-06,0,0
-2e-06,-1e-06,0,1e-06,0,-1e-06,-4e-06,-8e-06,-1e-05,-1.3e-05,4e-06,-2e-06,-1e-06,1.7e-05,-1e-05,-3e-06,-1e-06,0,-1e-06,-2e-06,-5e-06,-9e-06,0.00013,-2.5e-05,-8e-06,5e-06,4.5e-05,1.4e-05,-2.6e-05,1.5e-05,-4e-06,7.8e-05,-3e-06,-3e-06,-3.3e-05,-1e-06,2.7e-05,9e-06,2.1e-05,8e-06,-1.8e-05,-4.6e-05,-1e-04,-4.5e-05,5e-06,-2.5e-05,-2.3e-05,-3.4e-05,2.3e-05,-2.5e-05,1.4e-05,0,-6.3e-05,2.3e-05,8e-06,1.5e-05,-1e-05,2e-06,-4e-06,5e-06,-5e-06,3e-06,4e-06,8e-06,2e-06,3e-06,-1e-06,1e-06,1.2e-05,-3e-06,-1e-05,0,-1e-06,1e-06,-1e-06,3e-06,3e-06,0,0,-1e-06,2e-06,1e-06,0,3e-06,2e-06,3e-06,1e-06,-1e-06,0,0,-1e-06,0,0,-1e-06,0,0,-1e-06,0,-1e-06,0,-2e-06,0,0,-2e-06,-1e-06,-1e-06,1e-06,1e-06,0,-1e-06,-1e-06,0,0,0,-1e-06,-1e-06,2e-06,2e-06,0,0,0
0,0,0,0,0,1e-06,3e-06,8e-06,-2.5e-05,2e-06,8e-06,1e-05,4e-06,-2.7e-05,7e-06,-5e-06,0,-2e-06,-2e-06,3e-06,5e-06,-3e-06,-0.000154,-3.1e-05,4e-06,-1.6e-05,3.8e-05,3.7e-05,-1.4e-05,4.9e-05,-1.5e-05,0.00011,-4.9e-05,-9.5e-05,-6e-06,0,-1e-05,-1.2e-05,-3.4e-05,1e-06,-0.000153,1.3e-05,3.5e-05,-1.7e-05,3.5e-05,-2.8e-05,-3.1e-05,8e-06,-1.2e-05,-6e-06,9e-06,3.7e-05,3.1e-05,2.2e-05,-1.8e-05,-4e-06,1.8e-05,-1e-06,1e-06,-1e-06,1e-06,-6e-06,-3e-06,-6e-06,-1e-06,-4e-06,-3e-06,0,1e-06,-1.6e-05,1e-06,8e-06,-2e-06,-1e-06,-1e-06,-6e-06,-2e-06,3e-06,1e-06,0,-1e-06,-4e-06,-1e-06,-3e-06,0,-2e-06,0,1e-06,0,4e-06,0,0,0,0,1e-06,1e-06,3e-06,-1e-06,0,-1e-06,2e-06,1e-06,-1e-06,1e-06,1e-06,0,0,0,0,0,1e-06,1e-06,0,0,-2e-06,0,-2e-06,0,0,0,0
