0.636916,0.377591,0.150987,0.087552,0.053628,0.183134,0.634625,0.655279,0.417458,0.569764,0.767608,0.609722,0.241705,0.112951,0.083927,0.096941,0.401057,0.589504,0.349379,0.415642,0.556884,0.36802,0.301089,0.3434,0.236456,0.224977,0.640204,1.008117
0.764519,0.458092,0.190517,0.109315,0.064988,0.218273,0.744586,0.760731,0.477577,0.672387,0.931886,0.740878,0.292961,0.13856,0.103029,0.116575,0.480977,0.704175,0.412819,0.488695,0.668352,0.454283,0.369191,0.411217,0.280144,0.269814,0.747962,1.168438
0.954331,0.580637,0.253279,0.142796,0.082652,0.277813,0.915439,0.913811,0.565022,0.841197,1.209188,0.957943,0.372993,0.177235,0.132782,0.14776,0.596617,0.864972,0.503386,0.611142,0.850593,0.58851,0.471718,0.509548,0.341423,0.338432,0.914414,1.421603
1.049461,0.639255,0.284728,0.157867,0.091742,0.326787,1.011419,0.974122,0.623843,0.976576,1.417571,1.11747,0.419038,0.192021,0.145533,0.163302,0.638107,0.909507,0.545629,0.748788,1.016023,0.668254,0.517979,0.547353,0.360668,0.385794,1.063819,1.640356
1.064584,0.630272,0.274402,0.150089,0.092005,0.376795,1.07423,0.988315,0.712569,1.144337,1.590288,1.237431,0.43515,0.179898,0.139162,0.162789,0.624477,0.883079,0.575622,0.936561,1.204429,0.706347,0.518814,0.55378,0.360342,0.44192,1.269273,1.892622
1.149333,0.659073,0.272352,0.142658,0.096873,0.459651,1.213303,1.081726,0.917277,1.490221,1.912563,1.444823,0.486399,0.180846,0.145079,0.178951,0.689393,0.973553,0.668226,1.185992,1.521949,0.854892,0.55856,0.589294,0.387226,0.532558,1.58845,2.352354
1.502592,0.845785,0.335215,0.164922,0.122123,0.607237,1.558944,1.39059,1.282953,2.089834,2.623173,1.968388,0.658049,0.246051,0.198338,0.244296,0.913314,1.273461,0.869431,1.574746,2.094623,1.211924,0.708227,0.713918,0.470245,0.65428,1.999067,3.12868
2.091757,1.167693,0.436576,0.213519,0.164398,0.761509,1.965692,1.797748,1.695744,2.804177,3.737152,2.873489,0.941876,0.363398,0.29109,0.342466,1.217201,1.696895,1.159235,2.08359,2.823006,1.666297,0.953768,0.929242,0.588038,0.833783,2.603169,4.126837
2.711071,1.501378,0.51714,0.261736,0.205838,0.872697,2.25839,2.097977,1.91848,3.285296,4.87393,3.903764,1.250045,0.476091,0.378123,0.428096,1.480481,2.096682,1.455133,2.5591,3.446216,2.031074,1.187799,1.137392,0.689309,1.045957,3.26009,4.910277
3.034832,1.674496,0.530241,0.272804,0.222475,0.903442,2.331423,2.155219,1.793639,3.209723,5.431879,4.572844,1.436719,0.515492,0.405744,0.455052,1.599591,2.307427,1.625556,2.775796,3.648005,2.099638,1.271426,1.25136,0.74998,1.211968,3.680172,5.088153
2.791325,1.574615,0.487826,0.240726,0.205852,0.848331,2.180767,1.977544,1.450289,2.708721,5.206248,4.574298,1.399835,0.461782,0.362187,0.41876,1.524726,2.187854,1.540359,2.637049,3.438853,1.957561,1.189886,1.209706,0.739246,1.256525,3.755498,4.845606
2.160965,1.283677,0.415817,0.193775,0.17074,0.762366,1.907773,1.679428,1.207262,2.193618,4.385508,3.97245,1.19226,0.355358,0.295866,0.374632,1.333961,1.820276,1.240884,2.28758,3.046067,1.737711,1.02246,1.060401,0.678287,1.165598,3.443987,4.50395
1.779349,1.102989,0.35032,0.164922,0.144868,0.729599,1.779238,1.521119,1.108041,1.787605,3.398959,3.137863,0.949787,0.268449,0.241135,0.356651,1.229867,1.541725,0.929582,1.896399,2.609882,1.470581,0.898712,1.028148,0.675318,1.053947,3.042383,3.985149
1.785415,1.101409,0.314434,0.153455,0.13682,0.798605,2.016359,1.696012,1.057555,1.589443,2.921565,2.653479,0.779231,0.202836,0.186485,0.322551,1.225154,1.505339,0.815586,1.750145,2.405432,1.260583,0.797884,1.034403,0.687801,0.98666,2.734855,3.365531
2.159131,1.328321,0.36577,0.167604,0.143132,0.942809,2.46447,2.05291,1.087254,1.603398,2.737065,2.327549,0.658648,0.166349,0.145602,0.278315,1.159017,1.454201,0.793902,1.841682,2.51182,1.219481,0.806202,1.179639,0.761085,0.999535,2.807851,3.293543
3.067418,1.913701,0.540222,0.22701,0.171385,1.14426,3.076169,2.598528,1.306502,1.801518,2.698409,2.193774,0.682731,0.195253,0.160764,0.291376,1.181729,1.497228,0.870512,2.285083,3.057281,1.365057,0.986813,1.617606,1.012338,1.160948,3.661782,4.455718
4.622663,2.92327,0.833148,0.333129,0.222974,1.646257,4.588949,3.90189,1.877556,2.3635,3.171258,2.616116,0.945926,0.289563,0.23936,0.401961,1.660224,2.0966,1.172054,3.169255,4.239874,1.83279,1.456329,2.53396,1.546437,1.612518,5.584733,6.995237
6.440488,4.080194,1.193396,0.463406,0.294002,2.388253,6.85606,5.845005,2.637852,3.17585,4.342983,3.719989,1.375984,0.402556,0.339628,0.545922,2.486676,3.19428,1.641389,4.100614,5.633986,2.509201,2.119123,3.774578,2.280896,2.288676,8.176613,10.331036
7.796948,4.848127,1.447482,0.553673,0.367828,3.088064,8.957649,7.633886,3.307875,3.982836,5.872775,5.170113,1.812802,0.481241,0.417762,0.65977,3.466414,4.553051,2.174259,4.893492,6.963396,3.228055,2.733738,4.968681,3.016252,2.800034,10.072862,12.887041
8.121461,4.92032,1.444035,0.545295,0.404084,3.326877,9.631148,8.223512,3.564468,4.473401,7.283839,6.494454,2.070519,0.482564,0.42482,0.68062,4.229274,5.707885,2.645064,5.435735,7.942462,3.776365,3.013995,5.559386,3.410622,2.776484,9.846528,12.867294
7.302714,4.368016,1.216551,0.457786,0.369708,2.881098,8.294755,7.194288,3.222583,4.231023,7.68229,6.94476,2.054816,0.425006,0.349845,0.589816,4.299003,5.975024,2.818563,5.605065,8.386627,4.057561,2.819478,5.185535,3.203113,2.22543,7.505458,10.277404
6.078852,3.670127,1.003047,0.351439,0.27231,2.067506,5.835235,5.161886,2.482285,3.343705,6.551794,6.066221,1.789762,0.329349,0.228622,0.437469,3.485971,4.978048,2.468538,5.527123,8.48943,4.099944,2.255979,4.007048,2.479867,1.568163,4.919029,7.320573
5.10265,3.073027,0.794854,0.243343,0.185851,1.441937,3.816814,3.322747,1.722945,2.353406,4.589682,4.381607,1.398537,0.239422,0.14699,0.314104,2.179538,3.158662,1.696642,4.546188,7.124743,3.477309,1.585572,2.657739,1.685903,1.350629,4.170981,5.715281
3.522737,2.096995,0.532086,0.164507,0.155231,1.014387,2.262982,1.822406,1.07212,1.616322,3.120964,2.974989,0.980265,0.17217,0.116343,0.234035,1.053353,1.495811,0.929916,2.946439,4.618509,2.382756,1.030233,1.47503,0.98841,1.401368,4.094845,4.568644
2.004784,1.235258,0.355093,0.125444,0.138869,0.929565,1.805452,1.232408,0.625828,1.039025,2.093548,1.933854,0.600451,0.123019,0.105604,0.18698,0.495477,0.643877,0.485228,1.580021,2.459024,1.462674,0.718241,0.795836,0.573049,1.39833,3.780714,3.660733
1.521718,0.912878,0.228681,0.088292,0.122771,0.902834,1.680179,1.056228,0.509478,0.821008,1.548829,1.422317,0.439852,0.096767,0.086506,0.14903,0.386403,0.483506,0.342768,0.980491,1.658686,1.143528,0.62418,0.664541,0.488196,1.239797,3.143299,3.035895
1.558478,0.843966,0.152866,0.063696,0.106123,0.84326,1.612148,1.008545,0.50894,0.761514,1.270676,1.194122,0.394067,0.089331,0.072781,0.119285,0.404019,0.503542,0.286703,0.820491,1.465682,1.015531,0.554893,0.662344,0.507595,0.957254,2.311377,2.485277
1.531134,0.787908,0.132982,0.053172,0.087731,0.769574,1.494001,0.946069,0.56372,0.804139,1.115442,1.0009,0.344664,0.094727,0.068876,0.104903,0.498149,0.647676,0.334779,0.927442,1.558031,0.950799,0.467291,0.640775,0.543116,0.712861,1.666136,2.022321
1.320658,0.662468,0.134597,0.056678,0.075043,0.674539,1.313228,0.889011,0.656003,0.851797,0.921947,0.76048,0.299656,0.098978,0.068383,0.115386,0.64127,0.871274,0.461515,1.053842,1.627365,0.913006,0.412875,0.586001,0.562579,0.623947,1.431128,1.814714
1.025854,0.498965,0.139048,0.065144,0.068139,0.61974,1.290432,0.986903,0.717199,0.823564,0.772773,0.622153,0.292881,0.102597,0.076255,0.131025,0.751566,1.052336,0.567912,1.086929,1.591466,0.871156,0.415744,0.610257,0.618362,0.586467,1.281339,1.735212
0.949071,0.426982,0.139995,0.069606,0.067681,0.638012,1.493803,1.227742,0.699268,0.731605,0.83314,0.717366,0.31253,0.109666,0.088183,0.144135,0.774587,1.088936,0.587552,0.9588,1.349399,0.733326,0.424352,0.734656,0.709703,0.559385,1.153071,1.60949
1.046889,0.482347,0.142972,0.067422,0.068539,0.664347,1.691211,1.397574,0.650239,0.646888,0.881722,0.800863,0.298964,0.107328,0.095513,0.141241,0.682608,0.944333,0.512675,0.705358,0.960984,0.529824,0.394159,0.820689,0.745295,0.503444,1.042691,1.379676
1.114939,0.523553,0.129093,0.061074,0.061425,0.629461,1.701308,1.366351,0.563284,0.576378,0.829167,0.760445,0.240225,0.088969,0.086542,0.114821,0.509809,0.676472,0.374479,0.464543,0.644414,0.402315,0.359697,0.816693,0.72288,0.455952,0.970748,1.165903
1.135505,0.508559,0.099078,0.055654,0.047343,0.539033,1.489881,1.154924,0.44463,0.488462,0.696569,0.631037,0.193977,0.076949,0.068764,0.088135,0.353644,0.426282,0.235835,0.302946,0.417769,0.292068,0.345847,0.75092,0.633053,0.398182,0.858903,1.08868
1.110937,0.467135,0.072667,0.056121,0.035991,0.434837,1.163263,0.88754,0.351896,0.363356,0.526069,0.504226,0.17269,0.078019,0.06809,0.084704,0.253869,0.284094,0.160239,0.249183,0.343172,0.226786,0.340011,0.734244,0.594866,0.338214,0.766486,1.172454
1.039032,0.428357,0.061194,0.051786,0.031743,0.31695,0.828369,0.661647,0.271752,0.274624,0.468279,0.472703,0.178271,0.081982,0.07438,0.086202,0.19593,0.210182,0.125323,0.214616,0.333993,0.233961,0.335017,0.777128,0.636439,0.341887,0.852728,1.401657
0.941163,0.380234,0.049405,0.039504,0.026791,0.21574,0.545482,0.470507,0.210679,0.233828,0.444668,0.437212,0.169447,0.072221,0.067932,0.076832,0.150171,0.16501,0.11574,0.226877,0.356825,0.238791,0.314766,0.752889,0.628402,0.393559,1.025269,1.59193
0.851172,0.338092,0.035264,0.029096,0.029459,0.145795,0.330035,0.297296,0.18197,0.235575,0.399667,0.364825,0.141909,0.058867,0.0492,0.055274,0.104182,0.122105,0.109462,0.279562,0.407133,0.23874,0.309066,0.666791,0.54271,0.441613,1.086138,1.525691
0.745014,0.28833,0.034209,0.031621,0.036681,0.100052,0.209496,0.20103,0.177261,0.266951,0.411183,0.340239,0.126927,0.053746,0.029863,0.038532,0.076558,0.103381,0.106055,0.317148,0.440798,0.23556,0.319706,0.599909,0.465016,0.457823,0.989864,1.206467
0.62186,0.242068,0.04394,0.040013,0.041127,0.088604,0.225907,0.228011,0.194745,0.297984,0.502896,0.430437,0.154616,0.05688,0.029705,0.038143,0.090433,0.126781,0.100467,0.326227,0.432781,0.200891,0.301727,0.649988,0.53895,0.437193,0.824237,0.86061
