3.2e-05,1.5e-05,7e-06,1.3e-05,1.8e-05,2.6e-05,4.8e-05,1.6e-05,5.4e-05,2.8e-05,1.6e-05,1.3e-05,2.3e-05,4.1e-05,1.5e-05,3e-06,5.8e-05,3e-06,7.2e-05,3e-06,3.7e-05,8.9e-05,0.000101,4.3e-05,8e-06,1e-05,0.000105,0.000115,0.000102,7e-06,0.000123,0.000242,7.8e-05,0.000929,8.9e-05,0.000792,2e-06,0.000308,0.000132,8.9e-05,0.00054,0.00071,0.000478,0.000272,0.000324,0.000144,0.000111,5.2e-05,0.000455,0.000526,0.000122,0.000132,1.3e-05,0.000247,0.000555,0.000289,0.000277,0.000389,0.00049,0.000247,8e-06,0.000317,0.000119,1e-06,0.00025,8e-05,5e-06,0.000143,0.000102,7.3e-05,2.6e-05,3.1e-05,4.6e-05,4.9e-05,2.8e-05,1e-05,5.1e-05,1.8e-05,4.5e-05,0.000192,0.000105,0.000104,0.000139,1.8e-05,0.000108,7.6e-05,0.00014,6.3e-05,4.9e-05,5.4e-05,8e-06,3.7e-05,3.5e-05,5e-06,8.7e-05,2.5e-05,6.3e-05,5.3e-05,3.9e-05,3.3e-05,1.4e-05,1.2e-05,3.4e-05,4.1e-05,1.2e-05,7.6e-05,8e-06,2.2e-05,2.2e-05,3e-05,3.2e-05,4.4e-05,1.6e-05,8e-05,1.1e-05,5.8e-05,1.9e-05,1.2e-05,4e-06,3e-05,9e-06
4.4e-05,6.4e-05,5.8e-05,5e-05,7e-05,6e-05,0.000137,9.8e-05,8.3e-05,4.4e-05,4.1e-05,3.7e-05,3.2e-05,9.5e-05,6.6e-05,1.8e-05,9.4e-05,0.000118,0.000105,0.000121,0.000138,0.000228,0.000105,0.000199,0.000183,0.000193,0.00024,0.000348,0.000382,0.000308,0.000186,0.000837,0.00082,0.001302,0.001613,0.001695,0.001042,0.001422,0.000246,0.00033,0.000877,0.001901,0.001887,0.000508,0.000787,0.000602,0.000895,0.000183,0.00075,0.00148,0.001413,0.000617,0.000233,0.000822,0.001673,0.000396,0.000584,0.000175,0.000776,0.00077,0.000697,0.000974,0.000222,0.000196,0.000763,0.000102,0.00013,0.000185,0.000388,9.8e-05,0.000178,6.1e-05,8e-05,0.000131,0.000153,0.000213,0.000229,9.8e-05,2.7e-05,0.000496,0.000664,0.000771,0.000527,0.000213,0.000303,0.000251,0.000452,0.00047,0.000329,0.000218,0.000218,0.00013,0.000147,0.000221,0.00024,0.000235,0.000168,0.000209,0.000129,0.000159,0.000134,0.000109,6.5e-05,0.000119,0.000152,0.000158,0.000158,9.4e-05,9e-05,0.000124,3.1e-05,1e-04,9.4e-05,0.000156,0.000133,0.000141,0.000157,0.000122,8.8e-05,8.1e-05,0.000121
2.5e-05,4.3e-05,5e-05,4.2e-05,3.2e-05,4e-05,6.4e-05,3.2e-05,8.4e-05,7.6e-05,4.3e-05,5.9e-05,4.6e-05,1.5e-05,3.9e-05,5.2e-05,4.2e-05,3.1e-05,1.3e-05,6.9e-05,7.3e-05,0.000316,9.3e-05,8.2e-05,7.7e-05,9.2e-05,0.000205,0.000365,0.000442,0.000221,0.000165,0.000978,0.000783,0.001866,0.002435,0.002171,0.001063,0.000673,0.000476,0.00036,0.001211,0.002257,0.001,0.000686,0.001005,0.001938,0.001666,0.000616,0.00066,0.000573,0.000762,0.000534,4e-04,0.001312,0.000896,0.000182,0.000419,0.000271,0.000413,0.001235,0.000969,0.001363,0.000185,0.000288,0.001114,0.000558,0.000228,0.000196,0.000389,0.000271,0.000211,0.000227,0.00022,0.00024,0.000161,0.00018,0.000146,0.000109,7.1e-05,0.000552,0.001229,0.00062,0.000347,0.000369,0.000434,0.00021,0.000395,4.4e-05,0.000141,3.8e-05,0.00014,5.4e-05,5.8e-05,0.000179,8.9e-05,6.6e-05,7.9e-05,6.8e-05,5.4e-05,7.2e-05,1e-05,4.6e-05,4.9e-05,3.6e-05,0.000102,3.9e-05,3.8e-05,5.2e-05,8.3e-05,7.7e-05,1e-04,5.7e-05,4.2e-05,3.8e-05,9e-06,9e-05,1.7e-05,2.5e-05,5e-05,7e-06,0.000115
2.3e-05,6.7e-05,8.1e-05,0.000109,0.000119,6.6e-05,6e-05,5.6e-05,4.7e-05,4.5e-05,4.3e-05,7.4e-05,2.9e-05,3.8e-05,9.9e-05,7.5e-05,7.5e-05,4.8e-05,6.7e-05,3.8e-05,6.5e-05,0.000355,0.000195,0.000113,0.000161,0.000116,0.000222,0.000258,0.000299,0.000335,0.000246,0.001105,0.000194,0.001486,0.002382,0.001373,0.001459,0.00133,0.000464,0.000923,0.0011,0.001676,0.002377,0.000695,0.001234,0.001031,0.001238,0.001105,0.001342,0.000102,0.000583,0.001093,0.001768,0.002358,0.002937,0.000934,0.001264,0.000816,0.000666,0.000971,0.000964,0.001637,0.000539,0.000432,0.000862,0.000377,0.000159,0.000165,0.000279,0.000376,0.000289,0.000351,0.000303,0.000123,0.000121,2e-04,1.5e-05,4.5e-05,0.000268,0.000357,0.000847,0.000667,0.000435,0.000467,9.1e-05,0.000461,0.000348,0.000198,0.000179,0.000114,2.4e-05,0.000127,0.000212,9.3e-05,6.8e-05,3.7e-05,4.5e-05,6.8e-05,2.4e-05,4.9e-05,5.3e-05,7.5e-05,8e-05,4.3e-05,6.1e-05,2.5e-05,7.1e-05,7.8e-05,3.9e-05,5.8e-05,9.6e-05,8.2e-05,9.1e-05,4.7e-05,6.4e-05,3.8e-05,3.1e-05,5e-05,1.3e-05,2.4e-05,9.7e-05
1.4e-05,3.3e-05,1.7e-05,4e-05,3.7e-05,3.9e-05,3.8e-05,3.7e-05,2.9e-05,5e-05,5.7e-05,2.7e-05,1.1e-05,5.5e-05,9.1e-05,1.5e-05,3e-05,2e-05,3.9e-05,1.3e-05,2.7e-05,0.000429,0.000136,0.000109,0.000104,8.6e-05,0.000139,0.000303,0.000123,0.000303,1e-04,0.000665,0.00051,0.001196,0.003916,0.001523,0.000671,0.00131,0.00011,0.000523,0.00172,0.001462,0.000517,0.001229,0.002078,0.000971,0.002707,0.001467,0.00186,0.000921,0.00098,0.000588,0.001367,0.000813,0.000937,0.00165,0.00049,0.001306,0.000749,0.000912,0.000335,0.001818,0.001207,0.001033,0.001026,0.00108,0.000592,0.000417,0.000552,0.000294,0.000347,0.000181,6.8e-05,0.000266,0.000332,0.000249,9e-05,3e-06,0.000305,0.000581,0.000464,9.5e-05,0.000409,0.000303,0.000201,0.000473,0.000192,1.6e-05,5.5e-05,9.6e-05,7.4e-05,5.1e-05,0.00017,0.000121,2.4e-05,5.2e-05,5e-05,6.1e-05,1e-05,4.1e-05,5.6e-05,3.4e-05,1.9e-05,3.6e-05,5.1e-05,3.4e-05,8.7e-05,4e-06,2.7e-05,5.5e-05,3.3e-05,3.5e-05,5e-06,2.7e-05,3.9e-05,2.4e-05,7e-06,2.8e-05,1.3e-05,1.8e-05,2.7e-05
5.6e-05,1.1e-05,1.2e-05,1.5e-05,4.4e-05,1.8e-05,2.7e-05,3.7e-05,4.2e-05,1.8e-05,2.1e-05,1.3e-05,1.7e-05,4.9e-05,4.5e-05,7e-06,3.9e-05,4.6e-05,4.2e-05,2e-05,2.5e-05,0.00048,0.000271,3.3e-05,7.6e-05,0.000242,0.000383,0.000421,0.000134,0.000204,0.000158,0.000293,0.000273,0.000938,0.003884,0.004868,0.000851,0.001034,0.0011,0.000339,0.002991,0.00219,0.001486,0.001419,0.002651,0.001316,0.003099,0.001464,0.003459,0.002342,0.00179,0.001536,0.001912,0.001924,0.000987,0.002009,0.000808,0.000926,0.002038,0.002271,0.001641,0.001747,0.000785,0.00047,0.000747,0.000913,0.001246,0.000175,0.000547,0.000622,0.000248,0.000666,0.000443,0.00017,0.000219,0.000206,0.000131,7.8e-05,0.000202,0.000288,0.000288,0.000121,0.000464,0.00017,9.4e-05,0.000544,0.000251,6.3e-05,5.3e-05,0.00013,2.2e-05,3.4e-05,0.000149,0.000128,4.9e-05,8.8e-05,3.8e-05,1e-05,4.3e-05,6.2e-05,2.2e-05,2.9e-05,3.9e-05,4.7e-05,5.4e-05,4.6e-05,2.8e-05,2e-05,2.1e-05,2e-05,4.9e-05,4.3e-05,3.5e-05,1.2e-05,2.9e-05,5.5e-05,4.6e-05,2.4e-05,2e-06,2e-05,2.8e-05
4.5e-05,5.8e-05,3.6e-05,3e-06,3.6e-05,1.3e-05,1.7e-05,4e-05,6.4e-05,2.6e-05,2e-06,2.2e-05,3.8e-05,1.8e-05,0.000161,3.5e-05,3.7e-05,5.8e-05,3.2e-05,6e-06,2.1e-05,0.000483,0.000128,2e-04,8.1e-05,0.00019,0.000512,0.000358,0.00017,0.000808,0.000362,0.000425,0.00011,0.002051,0.004826,0.002765,0.00232,0.001774,0.000924,0.001571,0.00474,0.002293,0.005157,0.003198,0.006362,0.003341,0.005166,0.005758,0.006431,0.004321,0.004782,0.005415,0.001988,0.004223,0.003576,0.001706,0.001726,0.000567,0.003481,0.004776,0.001664,0.000968,0.001658,0.001331,0.001177,0.000298,0.001654,0.001367,0.001149,0.000934,0.000764,0.000798,0.000407,0.000212,0.000246,0.000347,0.000102,1.4e-05,0.000109,0.000315,0.000281,0.000198,0.000485,0.000474,0.000396,0.000194,0.000158,9.8e-05,6.8e-05,8.1e-05,0.000173,4.1e-05,0.000121,0.000159,7.3e-05,5.6e-05,2.9e-05,3.1e-05,4.3e-05,8.1e-05,6.5e-05,3.8e-05,5.1e-05,2.6e-05,3.4e-05,3.7e-05,4.2e-05,1.8e-05,1.4e-05,3.4e-05,5.3e-05,5.1e-05,2.9e-05,4.2e-05,5.1e-05,4.3e-05,2.4e-05,4e-05,1.5e-05,3.1e-05,2e-05
4.7e-05,2.2e-05,4.2e-05,3.8e-05,2e-05,1.5e-05,2.6e-05,1.5e-05,6.3e-05,4.4e-05,1.7e-05,5e-06,2.6e-05,1.9e-05,0.000264,0.000155,5.6e-05,3.8e-05,7.1e-05,2e-05,1.7e-05,0.000459,0.000743,0.000234,9.2e-05,0.000133,0.000696,0.000719,0.000501,0.001696,0.001076,0.000442,0.000599,0.003449,0.005562,0.005246,0.007736,0.003496,0.00063,0.001706,0.006198,0.006253,0.004656,0.001672,0.005918,0.003501,0.004569,0.005723,0.003131,0.000942,0.002893,0.003363,0.003325,0.006055,0.001597,0.001672,0.001457,0.001464,0.004209,0.003908,0.002305,0.001983,0.002192,0.002732,0.002912,0.003131,0.000962,0.001376,6e-04,0.00084,0.000724,0.001054,0.001154,0.000773,0.000653,0.000172,0.000147,3.8e-05,0.000172,0.00056,0.000583,0.000223,0.000443,0.000256,0.000141,0.000282,0.000215,2.5e-05,6.1e-05,9.2e-05,0.00024,0.000163,0.000268,0.000105,5.6e-05,4.6e-05,2.9e-05,5.1e-05,3.2e-05,6.3e-05,5.6e-05,7.1e-05,5e-06,4.2e-05,2.6e-05,4.9e-05,5.5e-05,5.8e-05,3.3e-05,6.1e-05,6.3e-05,4e-05,5e-06,6.1e-05,1.2e-05,5.2e-05,2e-05,1.6e-05,1.8e-05,5.8e-05,1.6e-05
2e-05,4.2e-05,7.8e-05,5e-05,2e-05,1.1e-05,9e-06,1.6e-05,2.5e-05,1.6e-05,1.5e-05,2.3e-05,2.8e-05,5.1e-05,0.000262,0.000294,0.000209,7.1e-05,7.9e-05,8.6e-05,6.5e-05,0.000478,0.000882,0.000916,0.000411,8.5e-05,0.000964,0.001153,0.000835,0.00138,0.001599,0.001222,0.000969,0.003128,0.003143,0.001932,0.006089,0.003895,0.002324,0.002392,0.002523,0.004268,0.005481,0.004807,0.002587,0.004397,0.004343,0.003589,0.00471,0.002541,0.00371,0.001652,0.003105,0.006728,0.00646,0.002256,0.001752,0.000497,0.002899,0.001725,0.001035,0.002482,0.000862,0.002028,0.000181,0.001859,0.002611,0.001144,0.001021,0.001072,0.000419,0.001156,0.001156,0.000577,0.000306,0.000399,0.000213,0.000129,0.000127,0.000595,0.000573,0.00038,0.000406,0.000277,0.000138,0.000215,0.000249,0.000174,8.7e-05,0.00021,0.000185,0.000128,0.000334,0.000187,5.2e-05,6.1e-05,4.8e-05,5e-05,5.8e-05,9e-06,0.000102,0.000123,0.000108,4.7e-05,4.7e-05,6e-05,8e-06,6.4e-05,5.8e-05,4.4e-05,8.1e-05,0.000115,7.1e-05,8.3e-05,6.8e-05,8.6e-05,4.2e-05,5e-05,1.7e-05,6.3e-05,8.1e-05
4e-05,5.5e-05,1.8e-05,1.1e-05,2.2e-05,2.2e-05,1.9e-05,1.1e-05,1e-05,1.1e-05,1.8e-05,4.5e-05,2e-05,2.4e-05,0.00021,0.000223,2.2e-05,3.2e-05,9.7e-05,8.6e-05,6.4e-05,0.000484,0.000384,0.00054,0.000328,0.000109,0.000881,0.000393,0.000576,0.001393,0.000327,0.00023,0.000286,0.003245,0.004258,0.003654,0.00111,0.001649,0.000373,0.001061,0.002205,0.002531,0.000385,0.002199,0.002405,0.001132,0.002439,0.001099,0.001421,0.001197,0.00199,0.002603,0.000605,0.003301,0.002179,0.002527,0.002807,0.001331,0.001578,0.001231,0.000654,0.001565,0.001703,0.000267,0.000674,0.000759,0.000625,0.000353,0.000784,0.000473,0.000159,0.001089,0.000279,0.000185,0.000203,0.000278,8.7e-05,8.4e-05,0.000166,0.000488,0.000235,9.4e-05,0.000369,0.000532,0.000421,4.6e-05,5.6e-05,5.7e-05,4.8e-05,0.000148,0.000101,0.000139,0.000242,0.000147,7.4e-05,2.2e-05,7.7e-05,4.5e-05,6.5e-05,6.4e-05,0.000113,6.3e-05,6.9e-05,3.7e-05,2.8e-05,2.6e-05,6e-05,4.3e-05,5.2e-05,6.2e-05,0.000106,0.000248,9.2e-05,5.2e-05,5.5e-05,5.1e-05,5.2e-05,5.6e-05,4.3e-05,5.1e-05,8.5e-05
1.7e-05,2.3e-05,2.1e-05,3e-06,2.1e-05,6e-06,9e-06,1.8e-05,1.6e-05,8e-06,1.7e-05,1.6e-05,1.2e-05,2.2e-05,0.000226,0.000124,0.000105,9.7e-05,2.9e-05,1.3e-05,5.1e-05,0.000366,0.000478,0.000269,8.1e-05,0.000223,0.000484,0.000193,0.000289,0.000946,0.001451,0.000836,0.000505,0.002255,0.002313,0.001101,0.001519,0.00047,0.000826,0.000437,0.002348,0.001326,0.002124,0.00189,0.001259,0.000794,0.004786,0.002571,0.001076,0.000743,0.000889,0.001485,0.000844,0.001404,0.001174,0.001717,0.001414,0.001074,0.000542,0.000342,0.000932,0.000868,0.000369,0.000264,0.000329,0.000198,0.000189,0.000215,0.000447,0.000127,0.000144,0.000943,0.000429,0.000279,0.000339,0.00019,0.000152,9e-05,0.00031,0.000522,0.000169,0.000135,0.000363,0.000443,0.000161,0.000243,0.000189,0.000123,5.2e-05,0.000106,0.000103,0.000125,0.000325,0.000209,0.000134,8.4e-05,9.3e-05,9.6e-05,8e-06,4.5e-05,3.3e-05,4.1e-05,2.5e-05,8e-06,1.6e-05,2.6e-05,4.2e-05,4.6e-05,7e-05,5.7e-05,5.4e-05,0.000294,0.000241,0.000102,5.6e-05,2.1e-05,4.5e-05,5.7e-05,1.5e-05,3.2e-05,3.2e-05
1.3e-05,2.1e-05,2.1e-05,1.1e-05,2e-06,2e-06,1e-05,9e-06,2e-06,4e-06,2.2e-05,1.3e-05,1.1e-05,3.3e-05,0.000198,3e-05,2.6e-05,4.6e-05,4.7e-05,4.8e-05,5.5e-05,0.000293,0.000447,0.000142,6.5e-05,0.000232,0.000195,8.5e-05,0.000187,0.000332,0.000585,0.000259,0.000317,0.001795,0.000688,0.00081,0.003105,0.000971,0.000621,0.001578,0.001991,0.002687,0.00151,0.000995,0.000485,0.002267,0.004735,0.002603,0.000387,0.001054,0.001003,0.001361,0.000924,0.000909,0.001217,0.000462,0.000846,0.000523,0.000714,0.001642,0.00106,0.000905,0.000559,0.00053,0.000261,0.000473,0.000561,0.000375,0.000762,0.000376,0.000188,0.000608,0.000439,0.000144,0.000223,0.000197,7.2e-05,0.000118,0.000282,0.00014,8.7e-05,7.6e-05,0.000323,0.000132,3e-05,0.000125,0.000105,6.3e-05,5.6e-05,9.4e-05,4.4e-05,4e-05,0.000293,0.00015,8.8e-05,3.5e-05,2.3e-05,3.2e-05,3.6e-05,3.6e-05,4e-05,2.9e-05,3.6e-05,2e-05,2.5e-05,2.9e-05,2e-06,5.3e-05,2.9e-05,1.7e-05,5.1e-05,0.000206,6.8e-05,2.5e-05,2.4e-05,3.3e-05,2.8e-05,7e-06,1.6e-05,1.3e-05,1.6e-05
1.9e-05,2.4e-05,1.4e-05,8e-06,5e-06,1.1e-05,1.3e-05,1.2e-05,9e-06,9e-06,1.1e-05,4e-06,7e-06,2.4e-05,0.000108,0.000113,5.6e-05,2.7e-05,6e-06,2.8e-05,4.5e-05,0.000296,0.000236,0.000205,0.000107,0.000164,5.9e-05,0.000158,0.000112,0.000253,0.000664,0.000514,0.000153,0.000985,6.5e-05,0.000993,0.001329,0.001147,0.001356,0.001649,0.002136,0.002626,0.003231,0.002062,0.001641,0.000623,0.002279,0.000611,0.000668,0.000839,0.001673,0.001378,0.002089,0.001621,0.000571,0.00102,0.001243,0.000966,0.002099,8e-04,0.002035,0.000825,0.000905,0.000651,0.000614,0.000285,0.000268,0.000377,0.000438,0.000462,0.000121,5.5e-05,0.000259,0.000212,0.000244,0.00024,5.3e-05,4.1e-05,0.000328,0.000297,9.6e-05,4.3e-05,0.000435,0.000443,0.000135,6.7e-05,3.9e-05,4.9e-05,9.6e-05,2.6e-05,7e-06,2.4e-05,0.00031,0.000228,7.4e-05,1.2e-05,2.9e-05,2.5e-05,2e-05,5.3e-05,3.1e-05,1.5e-05,2.5e-05,1.9e-05,2.3e-05,3.1e-05,3.9e-05,3.5e-05,4.3e-05,5.4e-05,6.9e-05,3.6e-05,7.1e-05,3.8e-05,4.6e-05,4.5e-05,3.5e-05,2.9e-05,1.2e-05,1.4e-05,8e-06
2.5e-05,1e-05,7e-06,1.3e-05,9e-06,1.4e-05,9e-06,3e-06,1e-05,8e-06,1e-05,5e-06,1.1e-05,2.7e-05,8.8e-05,5.6e-05,3.9e-05,1.8e-05,1.6e-05,1.5e-05,4.4e-05,0.000273,0.000399,0.000182,0.00015,8.1e-05,0.000322,0.000116,0.000123,0.000129,0.000392,0.000163,9.7e-05,0.000374,0.002378,0.003043,0.002962,0.002231,0.001992,0.002049,0.003164,0.001177,0.000898,0.001221,0.003725,0.002082,0.002074,0.001322,0.001957,0.001146,0.001137,0.000511,0.000311,0.001567,0.002437,0.000786,0.00166,0.001791,0.00356,0.00197,0.000698,0.00138,0.000736,0.000456,4.5e-05,0.000481,0.000648,0.00044,0.000518,0.000417,0.000236,0.00054,0.000289,0.000399,9e-05,0.000265,0.000128,0.000137,0.00031,6.4e-05,0.000126,2.2e-05,0.000603,0.000784,0.000403,0.000155,1e-05,8.3e-05,4.5e-05,6.9e-05,1.6e-05,5.5e-05,0.000249,8e-05,5.1e-05,6e-06,2.8e-05,2e-05,2.3e-05,4.4e-05,1.1e-05,3.5e-05,2.4e-05,2e-05,1.4e-05,3.5e-05,2.1e-05,5.2e-05,1.7e-05,4.4e-05,7e-05,0.000109,8.5e-05,5.4e-05,6.7e-05,7.4e-05,6.8e-05,2.1e-05,1.8e-05,1.3e-05,2.8e-05
3.2e-05,2.3e-05,7e-06,9e-06,4e-06,1.5e-05,1.6e-05,1.1e-05,1.2e-05,1.7e-05,9e-06,5e-06,6e-06,4.6e-05,6.5e-05,1.5e-05,4.1e-05,5.3e-05,3.5e-05,4.6e-05,2.5e-05,0.000321,0.00034,0.000171,5.7e-05,4.5e-05,0.000521,0.000467,0.000491,0.000347,0.000468,0.000277,0.000162,0.000242,0.004617,0.001881,0.004186,0.002668,0.003318,0.005069,0.003548,0.00303,0.002746,0.004226,0.005135,0.003078,0.002705,0.002111,0.002442,0.005492,0.003311,0.003427,0.00413,0.000673,0.001709,0.00439,0.00121,0.002,0.004215,0.004414,0.00322,0.003994,0.000965,0.000478,0.00043,0.000122,0.000604,0.000717,0.00174,0.001227,0.000393,0.000884,0.000907,0.001314,0.000857,0.000322,0.000151,0.000154,0.000278,0.000453,0.000134,4.5e-05,0.000645,0.000444,0.000294,0.000135,8.5e-05,0.000145,0.000102,5.7e-05,3.2e-05,8.4e-05,0.000247,0.00012,4.2e-05,4.1e-05,3.8e-05,6.4e-05,5.8e-05,5.4e-05,4.5e-05,4.2e-05,2.4e-05,9e-06,2.5e-05,4.5e-05,2.2e-05,4.8e-05,1e-05,1.8e-05,5.3e-05,3.6e-05,0.00011,1.5e-05,1e-05,7.9e-05,1.6e-05,2.1e-05,2.2e-05,2.8e-05,4.2e-05
2e-05,6e-06,1.6e-05,6e-06,4e-06,5e-06,9e-06,1.8e-05,2.2e-05,1.1e-05,9e-06,1.2e-05,1.7e-05,3.6e-05,5.3e-05,0.000113,7.6e-05,3.9e-05,4.3e-05,6.3e-05,4.9e-05,0.000304,0.000201,0.000321,0.000179,0.00014,0.000626,0.000489,0.000348,0.000392,0.000899,0.000513,0.000189,0.000529,0.006243,0.007719,0.010131,0.010833,0.004447,0.010016,0.012999,0.009226,0.010267,0.013135,0.012387,0.01017,0.009051,0.010099,0.005888,0.006938,0.003607,0.007542,0.002987,0.004314,0.004398,0.005796,0.0064,0.005826,0.004828,0.010269,0.006422,0.006838,0.00684,0.00391,0.001831,0.000305,0.000373,0.000791,0.001868,0.000827,0.00066,0.000871,0.000447,0.001303,0.000565,0.000871,0.00066,0.000147,0.000482,0.000712,0.00031,3.6e-05,0.000671,0.00092,0.000342,3.1e-05,0.000127,0.000102,6.8e-05,5.6e-05,5.8e-05,0.000106,0.000177,6.1e-05,5.6e-05,5.6e-05,6.5e-05,4.5e-05,1.9e-05,4.3e-05,3.3e-05,1.5e-05,4.8e-05,2.8e-05,2.8e-05,4.2e-05,2e-05,3.8e-05,5.2e-05,5.8e-05,4.9e-05,0.000117,0.000161,0.000134,9.3e-05,0.000106,0.000102,6.8e-05,1.4e-05,1.2e-05,2.3e-05
2.5e-05,2.2e-05,1.1e-05,1.7e-05,4e-06,1.7e-05,4e-06,7e-06,2.9e-05,7e-06,1.1e-05,1.4e-05,1.4e-05,2.3e-05,9e-05,7.4e-05,4.8e-05,1.4e-05,3.2e-05,4e-05,1.7e-05,0.000248,0.000373,0.000146,0.000113,8.8e-05,0.000399,0.000165,0.000301,0.000386,0.001043,0.000462,0.00035,0.000129,0.005849,0.009948,0.004179,0.008438,0.012914,0.009718,0.004595,0.000889,0.006114,0.006523,0.000864,0.004737,0.006508,0.004942,0.002867,0.006903,0.008778,0.008021,0.011136,0.003068,0.005624,0.01147,0.002664,0.009118,0.010466,0.005861,0.010465,0.002854,0.005531,0.00244,0.001231,0.001862,0.001097,0.00091,0.003059,0.003632,0.002679,0.002278,0.001955,0.000492,0.000928,0.00177,0.00148,0.000825,0.000736,0.000436,0.00042,0.000241,0.000475,0.001334,0.000992,0.000441,6.7e-05,8.3e-05,8.9e-05,0.000102,6.8e-05,5e-05,0.000189,0.00016,0.000124,2.7e-05,2.6e-05,4.1e-05,6.8e-05,1.3e-05,2.1e-05,4.3e-05,7.1e-05,7.3e-05,1e-04,4.7e-05,3.8e-05,1.6e-05,4e-05,4.7e-05,9.4e-05,0.000302,6.9e-05,5e-05,3.2e-05,3.9e-05,2.7e-05,1.5e-05,5e-06,9e-06,2.4e-05
9e-06,1.5e-05,2.5e-05,1.9e-05,2e-05,1.4e-05,2e-05,2.1e-05,3e-05,3.3e-05,2.8e-05,1.4e-05,1.3e-05,4.4e-05,6.7e-05,8.3e-05,6e-05,5.2e-05,2.2e-05,2.1e-05,4.7e-05,0.000217,0.000374,0.000434,0.000239,4.3e-05,5.1e-05,0.000145,0.000392,0.000766,0.000751,0.000543,0.000397,0.000957,0.004039,0.004,0.006063,0.002028,0.005001,0.003124,0.001172,0.002897,0.005249,0.003863,0.003343,0.00451,0.004237,0.006714,0.005658,0.006378,0.007519,0.006986,0.007002,0.005973,0.005484,0.002936,0.00677,0.007145,0.002184,0.003866,0.005023,0.006713,0.004459,0.0043,0.002341,0.002187,0.001312,0.001874,0.00284,0.00265,0.000694,0.000829,0.001929,0.001866,0.001388,0.000539,0.000413,0.000294,3e-04,8.9e-05,0.000114,2.2e-05,0.000566,0.001083,0.000534,0.000257,4.4e-05,5.5e-05,7e-05,6.1e-05,5.7e-05,9.2e-05,0.000228,0.000212,6.4e-05,4.1e-05,7e-06,2.2e-05,6.5e-05,4.7e-05,6.1e-05,9.4e-05,1.4e-05,3.7e-05,4.4e-05,2.6e-05,4.9e-05,6.1e-05,1.7e-05,2.9e-05,8.2e-05,0.000582,0.000345,0.000203,6.5e-05,4e-05,4.6e-05,7e-05,4.4e-05,3.9e-05,6.1e-05
2.7e-05,2.3e-05,1.8e-05,1e-05,1e-05,2e-06,1.9e-05,1.1e-05,2.1e-05,1.7e-05,3e-05,2.8e-05,2.2e-05,3.1e-05,7.5e-05,6.6e-05,5e-06,3.2e-05,3.3e-05,2.6e-05,5e-05,0.000209,0.000529,0.000281,0.000141,6e-05,0.000245,0.000458,0.000228,0.000625,0.001262,0.000554,0.000238,0.001241,0.003685,0.001414,0.002662,0.002347,0.00145,0.001548,0.000285,0.003521,0.00162,0.001108,0.003319,0.005522,0.001557,0.001711,0.00495,0.00425,0.001753,0.002247,0.001738,0.002661,0.006713,0.004635,0.004277,0.003743,0.003502,0.003839,0.001053,0.003915,0.000756,0.002762,0.002803,0.000609,0.000208,0.001478,0.001466,0.000544,0.000297,0.000376,0.001165,0.000408,0.000199,0.000376,4.8e-05,0.000164,0.000178,0.000174,5.9e-05,8.5e-05,0.000573,0.000501,0.000146,0.000123,6.6e-05,5.8e-05,4.4e-05,4.7e-05,3.4e-05,5.4e-05,0.000104,0.000127,5.1e-05,4.1e-05,3e-05,3.5e-05,3.9e-05,6.3e-05,6.2e-05,4.2e-05,6.9e-05,1.1e-05,4e-05,1.8e-05,4.5e-05,5e-05,9.8e-05,0.000109,7e-05,0.000933,0.000606,0.000229,4.8e-05,7.3e-05,4.8e-05,8.2e-05,5.5e-05,3.8e-05,3.7e-05
3.9e-05,1e-05,1e-05,1e-05,1e-05,6e-06,1.9e-05,2.7e-05,2.4e-05,2.5e-05,9e-06,9e-06,5e-06,3.1e-05,6.7e-05,6e-05,1e-05,4.4e-05,4.3e-05,3.7e-05,6.7e-05,0.000167,0.000431,0.00027,0.000105,7.8e-05,0.000392,0.00032,0.000233,0.000303,0.000831,0.000426,0.000401,0.000678,0.000913,0.001274,0.00046,0.002131,0.001767,0.000948,0.000167,0.002563,0.000377,0.00162,0.002275,0.000775,0.002362,0.003638,0.002756,0.001777,0.000889,0.002234,0.001776,0.00244,0.000863,0.001426,0.002066,0.001528,0.003485,0.000875,0.001493,0.001626,0.000633,0.001895,0.000546,0.001327,0.001008,0.000837,0.001953,0.000611,0.000152,0.000252,0.000334,0.000751,0.000375,0.000128,0.000227,0.000189,0.000152,0.000375,0.000225,0.00013,0.000641,0.000485,0.000227,0.000162,0.000104,4.1e-05,7.8e-05,6.9e-05,2.9e-05,2.6e-05,7.3e-05,0.000138,9.7e-05,6e-05,2.8e-05,7.3e-05,3.1e-05,6.2e-05,4e-05,1.2e-05,2.6e-05,4.8e-05,4.7e-05,2.5e-05,2.7e-05,3.6e-05,9.7e-05,0.000124,0.000156,0.001051,0.000598,0.000174,9.2e-05,5.9e-05,6.1e-05,6.1e-05,0.000111,9.8e-05,7.3e-05
2.6e-05,2.4e-05,1.7e-05,4e-06,1.7e-05,1.8e-05,1e-05,1e-05,1.2e-05,3e-06,1e-05,1.8e-05,1.1e-05,2.2e-05,6.1e-05,2.5e-05,4.7e-05,3.6e-05,2.7e-05,2.3e-05,4.8e-05,0.000261,8.6e-05,0.000131,8e-05,1.2e-05,0.000273,0.000135,0.000102,0.000485,0.000982,0.000511,0.000355,0.000516,0.001368,0.002085,0.001835,0.001149,0.000987,0.001274,0.000982,0.000463,0.001462,0.000668,0.001704,0.001608,0.001913,0.001845,0.001881,0.002461,0.000408,0.002038,0.001196,0.002207,0.001904,0.00188,0.004027,0.001817,0.001822,0.00219,0.000614,0.000929,0.001492,0.000446,0.000617,0.000876,0.000207,0.000553,0.00057,0.000704,0.000371,0.000312,0.000185,0.00017,0.000284,0.000384,0.000107,9.5e-05,0.000138,0.00032,0.000163,9.3e-05,0.000558,0.000397,3e-04,0.000117,5.7e-05,7.4e-05,7.4e-05,4.6e-05,3.2e-05,4.6e-05,6e-05,8e-05,2.9e-05,2.1e-05,1.8e-05,5.7e-05,2.8e-05,3.2e-05,5.1e-05,4.4e-05,3.2e-05,5.1e-05,6.9e-05,4.6e-05,3.7e-05,6e-05,2.8e-05,4.9e-05,4.4e-05,0.00068,0.000278,0.00011,2.9e-05,3.2e-05,3.5e-05,3.3e-05,5.6e-05,7.7e-05,4.3e-05
5e-06,9e-06,5e-06,3e-06,7e-06,1.9e-05,1.5e-05,1e-05,1.2e-05,1.5e-05,1.2e-05,1.1e-05,1e-06,1.5e-05,6.9e-05,6e-05,5.4e-05,3.1e-05,3.6e-05,5e-06,3.5e-05,0.00025,0.000467,0.000242,9.5e-05,5.1e-05,0.000128,0.000162,0.00021,0.000512,0.001004,0.000535,0.000336,0.000942,0.002748,0.001277,0.000301,0.000892,0.000987,0.001403,0.000533,0.00036,0.001161,0.000559,0.000592,0.000745,0.000805,0.000811,0.002235,0.000514,0.000868,0.001084,0.000475,0.001791,0.000252,0.000895,0.002576,0.001706,0.000236,0.000467,0.000347,0.000437,0.000246,0.000271,0.000198,0.000833,0.000373,0.000333,0.000305,0.000152,0.00019,0.000282,0.000154,6.4e-05,0.000196,0.000208,0.000145,8.3e-05,8.2e-05,0.000144,0.000125,4.1e-05,0.000459,0.000343,0.000157,2.9e-05,1e-05,3.1e-05,7.3e-05,6.9e-05,4.9e-05,4.8e-05,2.8e-05,3.8e-05,2.5e-05,3e-05,4e-05,2.8e-05,3e-06,1.8e-05,1e-05,2.3e-05,1e-06,3e-05,1.6e-05,3.2e-05,5.6e-05,2e-05,4.1e-05,2.6e-05,8.2e-05,0.000348,0.000198,4e-05,3.5e-05,8e-05,6.4e-05,2.7e-05,4e-05,1e-05,1.3e-05
0,1.1e-05,3e-06,7e-06,2e-06,6e-06,1e-06,8e-06,5e-06,5e-06,2e-06,8e-06,6e-06,7e-06,2.8e-05,2e-05,5e-06,1.5e-05,6e-06,1.4e-05,2e-05,0.000127,0.000172,7.4e-05,4.4e-05,3.1e-05,9.1e-05,2.1e-05,2e-05,0.000203,0.00025,0.00011,0.000104,0.00032,0.000783,0.000384,0.000451,0.000529,0.000265,0.000419,0.000452,0.00028,0.000964,0.00047,0.000221,0.000344,0.000381,0.000585,0.00051,0.000535,0.000177,0.000502,0.000402,0.000706,0.000246,0.000274,0.000606,0.000257,0.000319,0.000246,0.000168,0.000171,0.00023,0.000126,0.000251,0.00016,5.8e-05,0.000139,0.000166,0.000133,7.4e-05,0.000131,0.00011,9.3e-05,0.000182,0.000148,1.4e-05,4.1e-05,4.6e-05,9e-05,6.2e-05,4.3e-05,0.000161,0.000127,5.5e-05,1.2e-05,7e-06,1.1e-05,7e-06,3.1e-05,4e-06,2.9e-05,3e-05,4.3e-05,1.8e-05,1.4e-05,1.1e-05,3e-06,1e-05,1.1e-05,1.2e-05,1e-05,8e-06,6e-06,1.2e-05,5e-06,8e-06,1.7e-05,7e-06,1.8e-05,4e-05,0.000174,8.8e-05,1.9e-05,2.5e-05,3.5e-05,1.8e-05,1.5e-05,1.6e-05,9e-06,1e-05
9e-06,1e-05,1.2e-05,1.1e-05,1.6e-05,1.1e-05,9e-06,1.1e-05,8e-06,5e-06,6e-06,1.1e-05,9e-06,1.1e-05,1.4e-05,7e-06,1.4e-05,1.7e-05,1.7e-05,1.3e-05,1.3e-05,9.6e-05,0.000151,6.8e-05,3e-05,2.7e-05,5.7e-05,8e-05,5.3e-05,0.000187,0.000125,6.9e-05,9.2e-05,0.000345,0.000562,0.000175,0.000345,6.3e-05,0.000418,9.7e-05,0.000908,0.000833,0.000385,0.000615,0.000755,0.00055,0.000568,0.000482,0.000436,0.000776,0.000226,0.000422,0.000279,0.000781,0.000225,0.000436,0.000517,0.000405,0.000181,0.000396,3.9e-05,0.00012,0.000244,7.5e-05,0.000123,0.000127,4.9e-05,7.7e-05,5.4e-05,0.000119,3.2e-05,0.000112,2.6e-05,9.3e-05,9e-05,0.000123,3.9e-05,2.4e-05,8.3e-05,7.3e-05,4.2e-05,3e-05,9.5e-05,0.000143,7.8e-05,2.4e-05,1.9e-05,1.9e-05,2.9e-05,8e-06,1.3e-05,1.7e-05,4.8e-05,5.9e-05,3.4e-05,1.9e-05,7e-06,5e-06,1e-05,1.1e-05,1e-05,8e-06,1.1e-05,6e-06,6e-06,1.1e-05,1.6e-05,1.8e-05,2.1e-05,7e-06,3.6e-05,0.000126,4.4e-05,2.9e-05,2.3e-05,2.5e-05,6e-06,7e-06,9e-06,1e-06,1e-05
3e-06,4e-06,9e-06,5e-06,1.1e-05,2e-06,7e-06,4e-06,2e-06,4e-06,3e-06,5e-06,5e-06,4e-06,1.1e-05,1.4e-05,8e-06,8e-06,4e-06,1.9e-05,4e-06,7.5e-05,0.00012,7.2e-05,2.2e-05,2.2e-05,1.8e-05,0.000102,1.9e-05,0.000232,0.000135,7e-06,0.000137,0.000378,0.00043,0.000203,0.000436,0.000488,0.000383,0.000363,0.000915,0.000149,0.000519,0.000371,0.000367,8.8e-05,0.000533,0.001054,0.00035,0.000487,0.000391,0.000386,4.3e-05,0.00055,0.000276,0.000466,0.000116,0.000279,0.000115,0.000432,0.000296,8.8e-05,6.8e-05,0.000142,5.4e-05,0.000165,9.1e-05,9.5e-05,0.000121,4.8e-05,5.4e-05,5.8e-05,8.9e-05,0.000103,6.8e-05,8.5e-05,6e-05,6.8e-05,7.9e-05,0.000108,1.2e-05,9e-06,7e-05,5.5e-05,8e-06,2.1e-05,6e-06,1.8e-05,8e-06,4e-06,1.1e-05,8e-06,8.2e-05,3.5e-05,9e-06,6e-06,6e-06,6e-06,2e-06,3e-06,1e-05,1.1e-05,1e-06,4e-06,9e-06,6e-06,8e-06,7e-06,1.2e-05,1e-05,3.6e-05,8.2e-05,6.3e-05,2.7e-05,9e-06,1.7e-05,1.5e-05,7e-06,1.1e-05,5e-06,5e-06
5e-06,4e-06,3e-06,3e-06,3e-06,2e-06,5e-06,1e-06,3e-06,1e-06,2e-06,5e-06,2e-06,4e-06,1.2e-05,7e-06,1.1e-05,1e-05,8e-06,1.6e-05,5e-06,4.9e-05,0.000107,5.2e-05,2.2e-05,2.4e-05,7.4e-05,7e-05,8.7e-05,0.000162,0.000114,0.00014,0.00013,0.000321,0.000155,0.000555,0.000989,0.000364,0.000409,0.000343,0.000432,3e-04,0.000137,0.000438,0.000363,0.000167,0.000281,0.000651,0.000712,0.000419,0.000151,5.4e-05,0.000364,0.000717,0.000217,0.000464,0.000416,0.000324,0.000236,2e-04,0.00019,6.5e-05,0.000115,9.2e-05,8.2e-05,0.000177,2.7e-05,8.2e-05,0.000117,6e-05,6.3e-05,4.8e-05,1.5e-05,8.9e-05,7.5e-05,7e-05,3.1e-05,3.5e-05,5.1e-05,8.8e-05,5e-05,2.7e-05,6.2e-05,6.7e-05,2.8e-05,1.5e-05,8e-06,2.3e-05,1.8e-05,6e-06,6e-06,6e-06,9.2e-05,4e-05,1.8e-05,5e-06,3e-06,1.3e-05,7e-06,2e-06,9e-06,5e-06,3e-06,4e-06,6e-06,1e-06,3e-06,5e-06,1.2e-05,1.3e-05,2.4e-05,0.000121,4.7e-05,1.7e-05,1.6e-05,2e-06,2e-06,5e-06,6e-06,9e-06,8e-06
2e-06,2e-06,2e-06,1e-06,3e-06,1e-06,3e-06,2e-06,3e-06,4e-06,2e-06,3e-06,2e-06,4e-06,9e-06,5e-06,8e-06,2e-06,7e-06,8e-06,1e-05,3.4e-05,8.5e-05,4.9e-05,1.5e-05,2.5e-05,7.4e-05,0.000111,4e-05,3.9e-05,0.000139,0.000109,0.000117,0.000338,0.000294,0.000466,0.000577,0.00033,0.000302,0.000254,0.000207,0.000311,0.000339,0.000395,0.000559,0.000227,0.000131,0.000194,0.000333,0.000153,3.5e-05,0.000262,0.000214,0.00042,3e-04,6.3e-05,0.000381,0.000255,0.000167,0.000324,0.000256,0.000177,6.1e-05,0.00012,3.7e-05,8.1e-05,0.000113,4e-05,7.8e-05,6.2e-05,3.6e-05,5.7e-05,7.6e-05,5.5e-05,4.6e-05,9.2e-05,4e-05,1.6e-05,7.7e-05,1.2e-05,4.9e-05,2.9e-05,6.6e-05,4.9e-05,1.9e-05,2.3e-05,1e-05,2.2e-05,1.2e-05,4e-06,1.1e-05,1e-05,9.7e-05,4.4e-05,2e-05,8e-06,1e-05,1.1e-05,1e-05,6e-06,6e-06,3e-06,6e-06,5e-06,7e-06,8e-06,9e-06,1.4e-05,1.2e-05,1.3e-05,3.8e-05,9.3e-05,4.6e-05,1.5e-05,1.3e-05,6e-06,5e-06,1.1e-05,9e-06,1.7e-05,2e-06
4e-06,3e-06,2e-06,2e-06,4e-06,2e-06,5e-06,2e-06,3e-06,2e-06,2e-06,3e-06,4e-06,6e-06,9e-06,4e-06,6e-06,6e-06,3e-06,5e-06,8e-06,2.1e-05,6.8e-05,1.6e-05,1.4e-05,5e-06,6.1e-05,5.8e-05,2.1e-05,0.000146,7.9e-05,5.3e-05,0.000159,0.000241,0.000406,0.000362,0.000235,0.000319,0.000247,0.000328,0.000208,0.000345,0.000654,5.2e-05,0.000473,0.000308,0.000295,0.000392,0.000288,0.000346,0.000213,0.000259,0.000159,0.000366,0.000189,0.000213,0.000216,0.000254,8.7e-05,0.000266,0.000143,0.000227,9.3e-05,5.7e-05,8.1e-05,0.000106,4.4e-05,3.3e-05,6.2e-05,5.9e-05,4.5e-05,0.000103,4.9e-05,6.5e-05,9.1e-05,7.3e-05,6.3e-05,3.1e-05,5.5e-05,1.5e-05,3.6e-05,9e-06,6.9e-05,5.1e-05,4.8e-05,3.3e-05,3.1e-05,1.2e-05,3e-05,2.3e-05,7e-06,7e-06,8.5e-05,4.1e-05,1.5e-05,1e-05,1.1e-05,1.4e-05,1.2e-05,1.2e-05,5e-06,1.2e-05,7e-06,4e-06,4e-06,5e-06,4e-06,1.7e-05,1.2e-05,5e-06,3.3e-05,9.6e-05,7.5e-05,3.9e-05,2.1e-05,6e-06,6e-06,1.7e-05,1.4e-05,2e-06,7e-06
5e-06,1e-06,3e-06,3e-06,2e-06,1e-06,2e-06,1e-06,3e-06,1e-06,2e-06,4e-06,3e-06,5e-06,4e-06,7e-06,5e-06,4e-06,5e-06,1.2e-05,8e-06,2.4e-05,6.7e-05,4.9e-05,1.3e-05,1.7e-05,8.2e-05,4.8e-05,3.6e-05,0.000139,0.000166,9.5e-05,8.7e-05,0.000315,0.000382,0.00026,0.000446,0.00016,0.000272,0.000299,8.9e-05,8.3e-05,0.000462,0.000339,0.000297,0.000261,0.000426,0.000264,0.000298,0.000194,0.000431,0.000314,0.000226,0.000219,0.000502,5.7e-05,0.000307,0.000148,0.000144,0.000138,0.00022,0.000143,3e-05,0.000185,0.00014,0.000193,5.8e-05,9.3e-05,0.000181,6e-05,1.9e-05,8.3e-05,4.3e-05,5.6e-05,0.000128,3e-05,5.1e-05,1.7e-05,4.2e-05,5.1e-05,1.2e-05,7e-06,6.9e-05,6e-06,4e-05,2.6e-05,2e-05,2e-05,1.8e-05,1.5e-05,3e-06,8e-06,6.8e-05,4.1e-05,2.1e-05,1e-05,1e-06,9e-06,1e-05,8e-06,8e-06,1.1e-05,7e-06,1.2e-05,6e-06,9e-06,1.1e-05,1.1e-05,1.9e-05,7e-06,3.9e-05,9.3e-05,1.6e-05,2.5e-05,3e-06,2.8e-05,1.7e-05,8e-06,4e-06,3e-06,4e-06
6e-06,6e-06,5e-06,1e-06,3e-06,1e-06,2e-06,1e-06,2e-06,4e-06,3e-06,5e-06,3e-06,7e-06,4e-06,2e-06,2e-06,8e-06,3e-06,1.6e-05,9e-06,2.5e-05,0.000121,7.3e-05,3.1e-05,1.2e-05,8.2e-05,7.5e-05,3.1e-05,7.6e-05,5.6e-05,0.000128,0.000152,0.000156,9.6e-05,0.000445,0.000123,7.1e-05,0.000147,3e-04,0.000131,0.000354,0.000184,0.000137,0.000139,0.000158,0.000307,0.000157,0.000314,0.000115,0.000274,0.000334,0.000147,0.00039,9.9e-05,0.000272,0.000262,0.000241,3.9e-05,0.000104,0.000181,0.000196,0.000302,0.000371,0.000455,0.000155,4.2e-05,0.000131,0.000193,0.000226,0.000177,5.4e-05,0.000104,5.1e-05,9.6e-05,0.000139,7e-05,4e-05,4.2e-05,9.2e-05,2.9e-05,1.2e-05,5.7e-05,7.3e-05,4.4e-05,2.6e-05,5e-06,7e-06,1.9e-05,1.6e-05,3e-06,9e-06,4.2e-05,5e-05,2.6e-05,1e-05,6e-06,1.6e-05,1.8e-05,1.5e-05,1.4e-05,1.5e-05,5e-06,1.4e-05,6e-06,1.1e-05,7e-06,1.2e-05,2e-05,1.6e-05,4e-05,4.1e-05,4.1e-05,2e-05,1.6e-05,3.5e-05,1.8e-05,1.4e-05,7e-06,5e-06,5e-06
3e-06,5e-06,4e-06,2e-06,1e-06,1e-06,2e-06,1e-06,2e-06,2e-06,2e-06,2e-06,3e-06,4e-06,8e-06,9e-06,6e-06,8e-06,1.2e-05,1.3e-05,3e-06,3.4e-05,0.000137,3.9e-05,3e-06,1.3e-05,6.7e-05,2.6e-05,4.3e-05,4.7e-05,4.6e-05,0.000109,0.000102,0.000103,0.000245,0.000276,0.000416,0.000313,0.000176,0.000298,0.000221,0.000248,0.000282,0.000214,8.1e-05,1.8e-05,0.000169,0.000397,0.000187,0.000383,0.000282,0.000135,0.000138,0.000767,0.000503,0.000209,4.4e-05,0.000228,0.000144,0.000168,0.000379,0.000414,0.000446,0.000362,0.000462,0.000345,0.000283,0.000228,0.000392,0.000245,5e-05,3.2e-05,0.000108,0.000192,0.000136,9.5e-05,8e-05,1.9e-05,4.1e-05,7.9e-05,3.1e-05,7e-06,6e-05,7.7e-05,2.9e-05,1.4e-05,2e-05,1.1e-05,3e-06,1.2e-05,3e-06,5e-06,3.4e-05,4e-05,1.5e-05,3e-06,2e-06,1.7e-05,7e-06,1.6e-05,1e-06,6e-06,3e-06,7e-06,1.2e-05,1.4e-05,2e-05,4e-06,5e-06,1e-05,3e-05,5.9e-05,2.3e-05,1.9e-05,8e-06,1.9e-05,1.7e-05,1.6e-05,6e-06,9e-06,9e-06
5e-06,2e-06,2e-06,2e-06,4e-06,2e-06,1e-06,1e-06,2e-06,2e-06,0,3e-06,1e-06,3e-06,3e-06,6e-06,5e-06,1.4e-05,1.1e-05,1.1e-05,1.9e-05,3.6e-05,9.1e-05,6.6e-05,2.8e-05,1.1e-05,5.2e-05,2.9e-05,2.2e-05,5e-05,7.8e-05,0.00012,5.7e-05,0.000202,0.00031,0.000233,0.000242,0.000186,0.000203,0.000218,0.000248,0.000516,0.000161,0.000156,0.000162,0.000218,0.000174,0.000376,0.000347,0.000205,0.000477,0.000403,9.1e-05,0.000553,0.000102,0.000139,0.000381,0.00011,0.000199,0.000199,0.000315,0.000271,0.000205,0.000587,0.000272,4.3e-05,6.7e-05,9.3e-05,0.000209,4.9e-05,2.4e-05,5e-05,7.1e-05,6.7e-05,4.5e-05,0.000137,5.1e-05,2.2e-05,1.7e-05,8.7e-05,3e-05,1.2e-05,6.4e-05,3.3e-05,2e-05,2.8e-05,1.6e-05,6e-06,1.5e-05,8e-06,1.3e-05,7e-06,4.6e-05,3.3e-05,2.2e-05,4e-06,5e-06,1.4e-05,1.9e-05,4e-06,6e-06,1.4e-05,7e-06,3e-06,1e-05,9e-06,1.5e-05,2.1e-05,2.9e-05,1.2e-05,2.6e-05,7.9e-05,3.2e-05,1.8e-05,2e-06,1.9e-05,1.8e-05,9e-06,1.4e-05,1.7e-05,5e-06
3e-06,0,0,3e-06,2e-06,3e-06,1e-06,1e-06,1e-06,1e-06,1e-06,1e-06,1e-06,3e-06,1e-05,1.6e-05,1.8e-05,1.2e-05,1.7e-05,1.2e-05,1.9e-05,4.5e-05,6.9e-05,5.2e-05,2.2e-05,2.2e-05,4.6e-05,2.9e-05,1.9e-05,4e-05,0.000105,2.7e-05,7.9e-05,9.3e-05,0.000384,6.8e-05,9.4e-05,0.000145,0.000177,0.00024,0.000337,0.000535,0.000596,0.000123,9.1e-05,9.7e-05,0.000248,0.000119,0.000138,0.000122,0.00034,0.000175,0.000206,0.000236,0.000145,0.00022,0.000353,0.000233,5.5e-05,0.000114,0.000164,0.000301,0.00016,0.000425,0.000231,0.000135,7.8e-05,6.3e-05,3.8e-05,4.6e-05,4.2e-05,8.1e-05,9.1e-05,6.5e-05,3.2e-05,5.2e-05,1.7e-05,1.6e-05,4e-05,8.4e-05,3.7e-05,1.7e-05,6.6e-05,1.5e-05,1.6e-05,3.6e-05,2.5e-05,4e-06,9e-06,5e-06,1.5e-05,1.3e-05,4.5e-05,4.5e-05,2e-05,1.1e-05,1.1e-05,5e-06,1e-05,8e-06,1.3e-05,1.3e-05,8e-06,2e-06,9e-06,7e-06,1.3e-05,1.6e-05,5e-06,6e-06,2.7e-05,6.1e-05,4.6e-05,3.4e-05,1.5e-05,8e-06,5e-06,1e-05,9e-06,1.1e-05,7e-06
1e-06,4e-06,2e-06,2e-06,3e-06,2e-06,4e-06,3e-06,2e-06,1e-06,1e-06,3e-06,1e-06,3e-06,1.8e-05,9e-06,7e-06,2.3e-05,2e-05,3.4e-05,3.6e-05,1.5e-05,9.4e-05,4.6e-05,2.2e-05,2.4e-05,2.4e-05,3.9e-05,1.2e-05,4.2e-05,9.6e-05,8.4e-05,2.4e-05,9.9e-05,0.000295,0.00014,0.000374,0.000174,0.00019,0.000295,0.000322,0.000618,0.000188,0.000252,3.1e-05,0.000198,0.00013,0.000138,0.000339,0.000315,0.000411,0.000229,0.000287,0.000661,0.000373,0.000156,0.000215,0.000133,6.4e-05,0.000156,0.000115,0.000348,0.000155,0.000292,0.000153,6.5e-05,0.000166,0.000106,8.8e-05,0.000125,0.000143,4.3e-05,3.4e-05,6.3e-05,6.5e-05,8e-06,2.8e-05,2.8e-05,3.6e-05,6.8e-05,6e-05,3.1e-05,6.7e-05,3.3e-05,4.2e-05,1.9e-05,2.9e-05,2.7e-05,8e-06,3e-05,3.1e-05,2.3e-05,5.1e-05,5.2e-05,2.5e-05,7e-06,8e-06,1e-05,5e-06,4e-06,1.3e-05,8e-06,5e-06,7e-06,6e-06,3e-06,3e-06,6e-06,4e-06,1.9e-05,2.4e-05,9.8e-05,4.1e-05,1.7e-05,1.8e-05,1e-05,6e-06,4e-06,3e-06,1.1e-05,9e-06
2e-06,4e-06,3e-06,2e-06,1e-06,1e-06,4e-06,2e-06,1e-06,2e-06,2e-06,3e-06,1e-06,3e-06,2e-05,1.4e-05,5e-06,1.5e-05,1.3e-05,3.1e-05,3.5e-05,3.8e-05,0.000108,5.6e-05,3.6e-05,2.2e-05,4.3e-05,5.2e-05,2.1e-05,8.9e-05,2.8e-05,2.9e-05,4e-05,0.00022,0.000233,0.000193,0.00032,0.000269,0.000186,0.000221,0.000138,0.000596,0.000629,0.000315,0.000273,0.000281,0.00031,0.000106,0.000495,0.000402,0.000385,0.000226,0.000179,0.000355,0.000235,0.000294,0.000384,0.000296,0.000194,7.2e-05,0.000209,0.000255,5.8e-05,0.000158,0.000165,5.5e-05,7.4e-05,8.3e-05,0.000136,0.00018,6.3e-05,6.3e-05,2.8e-05,7.2e-05,2.8e-05,9.9e-05,4.3e-05,2.3e-05,7.2e-05,1.6e-05,5e-06,1.3e-05,4.9e-05,5.3e-05,4.3e-05,1.4e-05,7e-06,8e-06,2.1e-05,3.2e-05,1.7e-05,3e-06,5.3e-05,4.7e-05,2.6e-05,1e-05,1e-06,6e-06,4e-06,7e-06,1.3e-05,1.4e-05,1.1e-05,7e-06,1e-05,1.1e-05,1.5e-05,7e-06,2.5e-05,2e-06,3.4e-05,0.000123,7.4e-05,1.9e-05,1e-05,1.9e-05,3e-06,1e-06,7e-06,1.3e-05,9e-06
3e-06,4e-06,4e-06,1e-06,2e-06,1e-06,3e-06,2e-06,1e-06,1e-06,2e-06,4e-06,1e-06,2e-06,1.6e-05,1.2e-05,9e-06,9e-06,8e-06,2.5e-05,1.9e-05,3.4e-05,8e-05,1.8e-05,1.9e-05,9e-06,6.9e-05,6.1e-05,6.2e-05,4.1e-05,1.1e-05,0.000136,0.000116,0.000183,0.000267,0.000186,0.000134,0.000128,0.000166,0.000201,0.000116,0.000806,0.000668,0.000469,2e-04,0.000424,0.000226,0.00043,0.000295,5.7e-05,0.000371,0.000114,0.000145,0.00021,9.8e-05,0.000124,0.000313,0.000119,0.00017,0.000157,0.000265,0.000225,1e-05,0.000265,0.000292,0.000286,0.000144,0.000129,0.000118,7.1e-05,5.1e-05,2.3e-05,9.3e-05,7.4e-05,5.7e-05,4.6e-05,4.3e-05,3.6e-05,7.4e-05,6.2e-05,2.4e-05,3e-06,4.2e-05,6.1e-05,2.6e-05,1.7e-05,8e-06,1.2e-05,2.9e-05,2.6e-05,2e-05,2e-06,5.7e-05,2.8e-05,9e-06,8e-06,1.2e-05,1.3e-05,5e-06,9e-06,1e-06,1e-05,1.2e-05,7e-06,1e-05,9e-06,9e-06,8e-06,1.9e-05,1.5e-05,3.2e-05,0.000113,6e-05,3.1e-05,1.7e-05,1.6e-05,1.3e-05,5e-06,7e-06,3e-06,8e-06
2e-06,4e-06,2e-06,1e-06,3e-06,2e-06,1e-06,1e-06,2e-06,3e-06,1e-06,4e-06,2e-06,3e-06,9e-06,6e-06,7e-06,7e-06,4e-06,2.1e-05,2e-06,2.2e-05,4.4e-05,6.3e-05,2.1e-05,1.4e-05,5.5e-05,5e-05,1.4e-05,1.6e-05,5e-05,0.000208,7.7e-05,0.000117,0.000297,0.000284,0.000204,0.000214,0.000152,0.000219,0.000283,0.000517,0.000308,0.000223,0.000181,0.000164,0.000275,0.000336,0.00059,0.000229,0.000449,0.000471,0.000397,0.000264,8.6e-05,0.000152,0.000129,0.000298,0.000152,0.000422,0.00026,0.000214,0.000252,0.000346,0.00035,0.000171,0.000225,0.00021,0.00025,0.000233,0.000124,5.6e-05,0.000146,0.000128,3.9e-05,6.1e-05,8.8e-05,2e-05,4.1e-05,1e-05,2.7e-05,1.3e-05,3e-05,1e-04,4.6e-05,2.2e-05,4.2e-05,4.2e-05,8e-06,2.2e-05,4e-06,9e-06,5.5e-05,2.7e-05,9e-06,7e-06,6e-06,7e-06,7e-06,7e-06,9e-06,9e-06,1.7e-05,6e-06,9e-06,1.6e-05,9e-06,1.3e-05,1.5e-05,9e-06,2.3e-05,0.000142,7.7e-05,3.5e-05,1.5e-05,0,9e-06,8e-06,6e-06,6e-06,6e-06
1e-06,3e-06,3e-06,1e-06,1e-06,2e-06,2e-06,1e-06,2e-06,1e-06,1e-06,2e-06,0,3e-06,1.1e-05,7e-06,5e-06,5e-06,5e-06,1e-05,5e-06,1.6e-05,5e-05,6.5e-05,3.7e-05,2e-05,3.6e-05,4.7e-05,7.9e-05,3.9e-05,5.9e-05,0.000175,0.000201,0.000121,0.000194,0.000295,0.000598,0.000377,0.000243,0.000119,0.000537,0.000576,0.000592,5.8e-05,9e-05,0.000225,0.000434,8.5e-05,0.000316,0.000278,0.000333,0.000291,0.000358,0.000151,8.5e-05,6.1e-05,0.000194,0.000217,0.000265,0.000289,0.000185,0.000142,0.000239,7.6e-05,0.000135,0.000227,7.7e-05,0.000175,0.000276,3e-04,0.000172,4.4e-05,0.000107,8.9e-05,0.000115,8.2e-05,3.8e-05,2e-05,1.9e-05,3.3e-05,3.7e-05,3.5e-05,1.1e-05,7.4e-05,3.4e-05,3.5e-05,4.1e-05,2.1e-05,2.4e-05,4.5e-05,2.5e-05,1.6e-05,4.3e-05,4.4e-05,2.2e-05,4e-06,1.2e-05,5e-06,8e-06,1.5e-05,7e-06,1.3e-05,1.5e-05,1e-05,6e-06,8e-06,7e-06,9e-06,1.6e-05,5e-06,1.4e-05,0.000137,9.9e-05,4.4e-05,1e-05,6e-06,9e-06,0,4e-06,6e-06,5e-06
2e-06,1e-06,1e-06,2e-06,2e-06,1e-06,1e-06,1e-06,1e-06,2e-06,1e-06,2e-06,0,4e-06,9e-06,4e-06,2e-06,1e-06,1e-06,6e-06,4e-06,3e-06,4.9e-05,4e-05,2e-05,2.3e-05,2.1e-05,8e-06,5.2e-05,3.5e-05,5.3e-05,0.000156,4.5e-05,8.5e-05,0.000154,0.000324,0.000365,0.000182,0.000188,9.1e-05,0.000405,0.00017,0.000196,0.000405,0.000247,5.9e-05,0.000362,0.000111,0.000256,0.000392,0.000283,0.000148,0.000166,0.000301,8.4e-05,0.000235,5.4e-05,0.000203,0.000219,0.000129,0.000108,0.000303,0.000225,0.000123,0.000327,0.000365,0.000297,3.4e-05,0.000122,5.7e-05,1.5e-05,3.4e-05,2.6e-05,3.9e-05,3.5e-05,3.3e-05,2.6e-05,3e-05,2e-05,2.8e-05,4.4e-05,9e-06,1.4e-05,1e-05,1.7e-05,1.7e-05,1.4e-05,7e-06,1.2e-05,2.2e-05,1.5e-05,7e-06,4.8e-05,4.2e-05,2.6e-05,6e-06,7e-06,5e-06,3e-06,1e-05,8e-06,1.7e-05,4e-06,7e-06,2e-06,1e-05,6e-06,1e-06,1.8e-05,6e-06,1.9e-05,8.9e-05,3.9e-05,1.4e-05,1.1e-05,7e-06,3e-06,5e-06,5e-06,3e-06,2e-06
2e-06,2e-06,2e-06,1e-06,2e-06,1e-06,0,1e-06,1e-06,1e-06,1e-06,2e-06,0,4e-06,6e-06,8e-06,6e-06,3e-06,2e-06,1e-06,3e-06,6e-06,4.7e-05,7e-06,7e-06,1.3e-05,5e-06,7e-06,1.4e-05,2.5e-05,2.8e-05,6.7e-05,6.5e-05,6.9e-05,0.000155,0.000108,7e-05,0.000244,0.000158,0.000248,0.000219,0.000228,6.1e-05,9.6e-05,8.1e-05,7.9e-05,0.000332,0.000275,0.000251,0.000172,0.000194,0.000166,0.000332,0.000138,0.000112,0.00021,0.000167,0.000159,9.7e-05,9.7e-05,0.00011,0.000246,0.000173,0.000129,0.000192,9.5e-05,8.6e-05,6.1e-05,8.2e-05,3.9e-05,3.5e-05,2.2e-05,5.4e-05,2.7e-05,2.7e-05,4.4e-05,1.8e-05,1.8e-05,1.4e-05,1.2e-05,1.4e-05,1e-05,8e-06,1.8e-05,1.8e-05,2.4e-05,6e-06,3e-06,1.2e-05,9e-06,6e-06,5e-06,3.8e-05,1.6e-05,5e-06,3e-06,8e-06,2e-06,5e-06,3e-06,4e-06,1e-05,2e-06,6e-06,4e-06,5e-06,1e-06,3e-06,8e-06,3e-06,2e-05,2.9e-05,2.2e-05,1.1e-05,1.7e-05,3e-06,4e-06,2e-06,3e-06,1e-06,1e-06
2e-06,1e-06,2e-06,0,2e-06,1e-06,0,1e-06,0,1e-06,1e-06,2e-06,0,3e-06,6e-06,6e-06,4e-06,0,2e-06,4e-06,5e-06,7e-06,3.3e-05,7e-06,9e-06,3e-06,1.3e-05,7e-06,1.8e-05,3.1e-05,8e-06,3.7e-05,4.3e-05,6.4e-05,0.000309,0.00014,0.000105,0.00016,0.000194,0.000221,0.000206,6.4e-05,0.000146,5.6e-05,6e-05,6.4e-05,0.000245,0.00022,0.000194,5.5e-05,0.000153,0.000135,0.000202,0.000302,7.3e-05,0.000151,0.000191,0.000205,6.4e-05,7.3e-05,2.3e-05,0.000192,0.000163,7.5e-05,0.000126,8.8e-05,7.6e-05,3.4e-05,5.8e-05,4.6e-05,1.3e-05,3.1e-05,4e-05,3.1e-05,2.1e-05,4e-05,1.1e-05,1.3e-05,1.5e-05,1.6e-05,9e-06,4e-06,7e-06,1.1e-05,6e-06,1.9e-05,5e-06,3e-06,2e-06,8e-06,3e-06,3e-06,3.2e-05,2e-06,2e-06,2e-06,5e-06,1e-06,2e-06,2e-06,3e-06,8e-06,2e-06,3e-06,4e-06,5e-06,1e-06,3e-06,8e-06,3e-06,2.1e-05,1.3e-05,1.2e-05,4e-06,1.2e-05,6e-06,3e-06,2e-06,2e-06,1e-06,0
2e-06,2e-06,2e-06,0,2e-06,1e-06,0,1e-06,0,1e-06,1e-06,2e-06,0,3e-06,7e-06,6e-06,3e-06,1e-06,1e-06,4e-06,4e-06,1.2e-05,2.5e-05,6e-06,5e-06,4e-06,7e-06,8e-06,1.5e-05,3e-05,5e-06,2.5e-05,5e-05,8.9e-05,0.000286,4.4e-05,0.000117,0.000125,0.000151,2e-04,0.000217,7.4e-05,9e-05,3.5e-05,5.1e-05,7.3e-05,0.000247,0.000191,0.000165,0.000141,0.000161,0.000159,0.000125,0.00029,9.8e-05,0.000126,0.000156,0.000171,5.3e-05,0.000143,3.3e-05,0.000132,9.1e-05,5.9e-05,0.000108,7.5e-05,7.7e-05,2.6e-05,6.1e-05,4.4e-05,4e-06,2.3e-05,3.8e-05,3e-05,2.1e-05,4.2e-05,1.3e-05,1.2e-05,1.4e-05,1.8e-05,8e-06,6e-06,7e-06,2e-05,9e-06,1.6e-05,4e-06,4e-06,4e-06,8e-06,3e-06,3e-06,2.7e-05,3e-06,1e-06,1e-06,5e-06,1e-06,2e-06,2e-06,2e-06,8e-06,1e-06,3e-06,3e-06,5e-06,0,3e-06,8e-06,1e-06,2e-05,1.5e-05,2e-06,2e-06,9e-06,4e-06,3e-06,1e-06,2e-06,0,0
