-1e-06,-1e-06,-1e-06,-3e-06,-1.1e-05,-9e-06,-1.6e-05,-0.000397,-0.000567,-4.8e-05,-7e-06,-5e-06,-3e-06,-2e-06,-3e-06,-6e-06,-5e-06,-9e-06,-7e-06,-1e-06,-1e-06,0,1e-06,1e-06,0,0,1e-06,1e-06
-1e-06,-1e-06,-1e-06,-2e-06,-5e-06,-2e-06,4e-06,0.000345,0.000338,3e-06,-1e-06,-3e-06,-2e-06,-2e-06,-5e-06,-6e-06,-5e-06,-8e-06,-5e-06,-1e-06,-1e-06,-1e-06,0,-1e-06,-3e-06,-2e-06,-1e-06,0
0,-1e-06,-1e-06,-1e-06,1e-06,0,-3e-06,-7.5e-05,-4.1e-05,4e-06,-2e-06,0,-1e-06,-1e-06,-1e-06,0,0,1e-06,-2e-06,-2e-06,-1e-06,-1e-06,-1e-06,-2e-06,-3e-06,-1e-06,-1e-06,-1e-06
0,0,0,1e-06,6e-06,3e-06,4e-06,-0.000118,-3.9e-05,1.9e-05,3e-06,2e-06,1e-06,1e-06,3e-06,6e-06,4e-06,7e-06,3e-06,0,0,-2e-06,-1e-06,-1e-06,-1e-06,-1e-06,-1e-06,-1e-06
-1e-06,-1e-06,-1e-06,0,4e-06,5e-06,1.1e-05,0.00032,0.000387,2.2e-05,4e-06,1e-06,0,1e-06,2e-06,3e-06,3e-06,4e-06,5e-06,1e-06,0,-2e-06,-1e-06,-1e-06,-1e-06,-1e-06,-2e-06,-2e-06
-3e-06,-2e-06,-3e-06,-4e-06,-1.1e-05,-8e-06,-1.1e-05,-0.000216,-0.000376,-4.7e-05,-8e-06,-5e-06,-5e-06,-3e-06,-4e-06,-6e-06,-4e-06,-6e-06,-3e-06,-1e-06,-1e-06,-2e-06,-1e-06,-1e-06,-1e-06,-2e-06,-3e-06,-3e-06
-2e-06,-2e-06,-3e-06,-4e-06,-1e-05,-8e-06,-1e-05,-0.000268,-0.000362,-2.7e-05,-6e-06,-5e-06,-4e-06,-4e-06,-5e-06,-6e-06,-5e-06,-8e-06,-6e-06,-2e-06,-2e-06,-1e-06,-1e-06,-1e-06,-1e-06,-2e-06,-3e-06,-3e-06
1e-06,0,0,1e-06,4e-06,3e-06,1e-05,0.000318,0.000466,4e-05,4e-06,2e-06,1e-06,0,-1e-06,1e-06,1e-06,1e-06,-1e-06,-1e-06,0,0,0,-1e-06,-1e-06,0,0,0
1e-06,1e-06,1e-06,3e-06,8e-06,4e-06,3e-06,8.2e-05,0.00016,1.7e-05,3e-06,5e-06,4e-06,2e-06,2e-06,4e-06,3e-06,6e-06,2e-06,0,1e-06,1e-06,0,0,0,0,1e-06,2e-06
1e-06,1e-06,1e-06,2e-06,2e-06,1e-06,-2e-06,-0.000209,-0.00029,-1.7e-05,4e-06,2e-06,2e-06,2e-06,3e-06,2e-06,2e-06,3e-06,2e-06,1e-06,1e-06,1e-06,0,1e-06,0,1e-06,1e-06,2e-06
0,1e-06,1e-06,1e-06,-6e-06,-4e-06,-1e-06,1.8e-05,-4.5e-05,-1.2e-05,0,-1e-06,-1e-06,-1e-06,0,-3e-06,-3e-06,-4e-06,0,1e-06,1e-06,1e-06,1e-06,2e-06,1e-06,1e-06,1e-06,1e-06
1e-06,1e-06,1e-06,1e-06,0,1e-06,-2e-06,7e-05,7.9e-05,-1e-06,-4e-06,-1e-06,-1e-06,0,0,-3e-06,-3e-06,-4e-06,0,1e-06,0,1e-06,1e-06,3e-06,3e-06,1e-06,2e-06,1e-06
2e-06,2e-06,2e-06,2e-06,6e-06,4e-06,3e-06,-7.8e-05,-2.9e-05,1.6e-05,4e-06,1e-06,1e-06,1e-06,3e-06,2e-06,1e-06,2e-06,1e-06,1e-06,1e-06,1e-06,1e-06,2e-06,3e-06,1e-06,2e-06,1e-06
1e-06,1e-06,2e-06,2e-06,4e-06,3e-06,7e-06,0.000112,0.00017,1.7e-05,5e-06,2e-06,1e-06,1e-06,3e-06,4e-06,2e-06,4e-06,1e-06,0,1e-06,1e-06,0,1e-06,1e-06,0,1e-06,1e-06
-2e-06,-1e-06,0,-1e-06,-3e-06,-4e-06,-4e-06,2.1e-05,-2.4e-05,-1.4e-05,-2e-06,-1e-06,-1e-06,-1e-06,0,0,0,0,-1e-06,-1e-06,0,0,-1e-06,-1e-06,-2e-06,-2e-06,-1e-06,-1e-06
-2e-06,-2e-06,-2e-06,-3e-06,-6e-06,-2e-06,-4e-06,-0.000178,-0.000264,-1.8e-05,-1e-06,-1e-06,-2e-06,-3e-06,-3e-06,-4e-06,-3e-06,-4e-06,-2e-06,-1e-06,-1e-06,-1e-06,-2e-06,-3e-06,-3e-06,-2e-06,-2e-06,-2e-06
-2e-06,-2e-06,-3e-06,-3e-06,-4e-06,-3e-06,-3e-06,7.2e-05,0.000109,5e-06,-3e-06,-2e-06,-3e-06,-4e-06,-4e-06,-4e-06,-3e-06,-4e-06,-3e-06,-1e-06,-1e-06,-1e-06,-2e-06,-3e-06,-3e-06,-2e-06,-2e-06,-2e-06
-1e-06,-1e-06,-1e-06,0,3e-06,2e-06,0,0.000104,0.000182,1.4e-05,-2e-06,0,-1e-06,-1e-06,-1e-06,0,0,0,-1e-06,-1e-06,-1e-06,-1e-06,-1e-06,-2e-06,-1e-06,-1e-06,-2e-06,-2e-06
0,0,-1e-06,0,2e-06,2e-06,2e-06,-0.000115,-0.000154,-7e-06,2e-06,1e-06,0,1e-06,1e-06,2e-06,2e-06,3e-06,1e-06,-1e-06,0,-1e-06,-1e-06,-1e-06,0,-1e-06,-1e-06,-1e-06
