-0.001279,0.000134,-0.000833,-0.000536,-3.5e-05,0.00036,-0.000618,-0.001835,-0.000878,-0.000342,-0.000205,-0.000159,-0.00112,-0.001135,-0.000241,-0.000254,-0.000258,-0.001728,6.2e-05,-0.00035,-0.000155,-0.000157,0.000384,-0.000243,0.000202,-2.8e-05,-5e-04,-0.000611,-0.000323,-0.000331,-0.000555,-0.001107,-0.00241,-0.001989,-0.003531,-0.003158,-0.001915,-0.001669,-0.001105,-0.001633,-0.001106,-0.001266,-0.002022,-0.002234,-0.002398,-0.00118,-0.00117,-0.001649,-0.002195,-0.000566,-0.002636,-0.000902,-0.000507,-0.000166,0.000444,0.000124,-0.001801,-0.001995,-0.001952,-0.001668,-0.003678,-0.00397,-0.002741,-0.000965,-0.001032,-0.00059,-0.000249,-0.002115,-0.002155,-0.002256,-0.00184,-0.003312,-0.002014,-0.001434,-0.000107,-0.000829,-0.001512,-0.001507,-0.00266,-0.002211,-0.003006,-0.001525,-0.001268,-0.001339,-0.001514,-0.00246,-0.001611,-0.00168,-0.002579,-0.001395,-0.002604,-0.002374,-0.002187,-0.001245,-0.000496,-0.000537,-0.001697,-0.003631,-0.001839,-0.001729,-0.003098,-0.001487,-0.001872,-0.001746,-0.001995,-0.000923,-5e-06,-0.000148,-0.000289,-0.000287,-0.00114,-0.001141,-0.001308,-0.001689,-0.00257,-0.002251,-0.000953,-0.001298,-6.8e-05,-0.000298,0.000264
0.001091,-0.000472,0.000408,0.000279,-0.00028,-3e-06,0.000795,0.001596,0.000856,-0.000207,-0.000432,-0.00067,-0.000645,0.000466,-1.9e-05,0.000693,-0.000744,-0.000189,0.000306,-0.000939,-7.6e-05,-0.00044,-0.000507,-0.000406,0.000957,0.000704,0.000648,0.000241,-0.000887,-0.001321,0.001716,0.002154,0.001636,0.000521,0.002159,0.0024,0.001198,0.00133,0.001038,0.001354,7.2e-05,-0.000242,0.002171,0.00127,0.002292,0.001271,0.001016,0.000169,0.001433,0.001696,0.002472,0.00022,0.000344,5.8e-05,-0.001076,0.000406,0.00069,0.001987,0.001604,0.001016,0.002487,0.002608,0.002326,0.001211,0.000719,0.000388,-0.000616,2.5e-05,0.000139,0.000674,0.001759,0.002735,0.000456,-0.000259,0.000556,-0.000486,0.000676,-0.000149,0.000658,-0.000426,0.000972,0.000158,0.000729,0.000749,-1.8e-05,-0.000257,0.000401,0.001103,0.001892,0.001443,0.001126,0.000716,0.000496,0.000456,0.00106,-0.000135,-0.000141,0.001219,0.001285,6.4e-05,-5.5e-05,-5.2e-05,-0.000374,-0.000297,-0.000822,-0.000741,-0.000316,0.000215,0.000663,0.001237,0.000328,0.000644,0.000512,0.001407,0.002132,0.00176,0.001025,0.002285,0.000652,0.000617,0.000312
-0.000252,-0.001033,-0.000903,-0.000612,0.000327,-9.1e-05,-0.000349,-0.001762,-0.001193,1.7e-05,-0.000403,-7.2e-05,-0.000696,-0.000245,-0.000789,-0.000758,-0.000214,-0.000335,-0.001499,-0.000537,-0.000218,-0.000695,-0.000264,0.000238,-0.000441,-0.001272,-0.00059,-0.00083,-0.000708,-0.000445,-0.001257,-0.00163,-0.001351,-0.000854,-0.001883,-0.002633,-0.001398,-0.00102,-0.001516,-0.000989,-0.001093,-0.000906,-0.002635,-0.000126,-0.000837,-0.001779,7.2e-05,-0.000255,-0.000656,-0.000566,-0.001938,-0.001903,-0.001407,-0.000637,-0.000407,0.000164,-0.001304,-0.002142,-0.001438,-0.00227,-0.002422,-0.001907,-0.001649,-0.001074,-0.000986,-0.000462,-0.000491,-0.000606,-0.002028,-0.000888,-0.001501,-0.00196,-0.001071,0.000221,7e-04,0.000441,-0.000278,0.000156,-0.000117,0.000672,-0.001579,-0.000597,-0.000655,-0.000568,-0.001275,-0.000296,-0.00149,-0.000932,-0.000526,-0.000267,-0.001017,-0.000229,-0.000804,-0.000642,-3.7e-05,0.000884,-6.2e-05,-0.000557,-0.001277,-0.000418,-0.000524,-0.001312,-0.000183,-0.001043,0.00042,0.000781,0.001007,0.000375,0.000105,-0.001268,-0.000837,-0.000594,0.000361,-0.001243,-0.001939,-0.00124,-0.000979,-0.001064,-0.000231,-0.000351,0.000357
-0.000141,-0.000191,2e-06,0.00026,-0.000177,-0.000809,-0.000285,0.001195,0.000108,0.00053,-0.000352,-5.2e-05,-7.4e-05,-3.5e-05,-0.000429,0.000118,0.00045,0.001043,0.000467,0.000365,0.001173,0.001297,0.000192,-8.3e-05,-0.000568,-0.000153,0.00035,0.000552,0.000992,0.000784,0.00073,0.000964,0.001156,0.000406,0.001697,0.002253,0.00097,0.001646,5.1e-05,0.000498,0.001114,0.000739,0.000255,0.001444,0.001223,0.000605,0.000711,0.000471,8e-04,0.00027,0.001037,0.002452,0.001173,0.000124,0.000153,-0.000396,0.001065,0.001072,0.000755,0.001705,0.00188,0.001165,0.001371,0.000266,0.000151,0.000669,5e-06,0.000847,0.000826,0.00044,0.00044,0.002281,0.001792,0.000573,-0.000287,0.000415,0.000211,0.001226,0.000101,0.000315,0.000543,1.2e-05,-0.000596,0.00029,0.000507,0.000749,0.000625,0.000426,-0.001389,-0.00095,-0.000937,0.000346,0.000621,-0.000451,-0.000683,-0.000898,-0.000333,1.2e-05,0.000655,0.00078,-4.6e-05,0.000185,-0.000535,0.000427,-0.000585,-0.000767,-0.001117,-0.000761,0.000231,-0.000123,-0.000313,-0.000809,-0.000244,0,0.000629,0.001288,0.000308,0.000803,-0.000932,0.000238,-0.000968
-0.000134,-0.000254,0.000696,8.5e-05,-3.7e-05,-0.000352,-1.6e-05,-0.000587,-0.00101,-0.001042,-0.000452,-0.000105,0.000169,0.000133,0.000297,0.00018,9.5e-05,0.000124,-0.000354,0.000548,6.6e-05,-0.000364,-0.000695,-9.6e-05,-0.000748,-0.000912,-0.000725,-0.000539,-0.000755,-0.000449,-0.000775,-0.001438,-0.001326,-0.000545,-0.001068,-0.000986,-0.001252,-0.001435,-0.000748,-0.00035,-0.000569,0.000697,-0.000737,-0.001309,-0.001533,-0.001749,-0.001042,-0.001811,-0.001423,-0.001738,-0.00118,-0.001079,-0.000607,-0.000436,-7.9e-05,-0.000577,-0.00065,-0.000769,-0.00147,-0.001381,-0.001731,-0.0016,-0.001281,-0.000565,-0.000203,-0.000978,-0.000338,-0.001031,-0.000266,-0.000941,-0.001536,-0.001277,-0.001357,-0.00168,-0.000644,-0.000269,-1.9e-05,-0.001229,0.000252,0.000771,-0.00077,-0.000289,-0.001192,-0.000122,0.001119,-0.000295,-0.000338,0.000632,0.00017,0.000601,-0.000179,-0.000318,-0.000284,0.000106,-0.000609,-0.001299,0.000241,-0.00048,-0.000664,-0.000169,0.000542,7.7e-05,6e-05,0.000132,0.000423,0.000103,-0.00029,-0.000354,-9e-06,-0.000599,-0.00048,0.000353,3.5e-05,0.000138,-0.000838,-0.001263,-2.5e-05,-0.001065,-0.000436,-0.000244,0.00048
4.1e-05,-2.4e-05,-0.000488,-0.000733,-0.000223,0.00019,0.000217,6.8e-05,0.000112,0.000247,0.000691,0.000357,-0.000335,-0.000297,-0.00051,-0.000683,-0.000129,-0.000774,-0.000472,-0.000464,-0.000538,-0.000226,0.000341,-0.000428,0.000126,-0.000238,2.3e-05,0.000372,0.000181,-0.000378,-0.000431,-2.2e-05,5.1e-05,-3.4e-05,0.000702,0.000103,0.000758,0.000528,0.000162,0.000755,0.000422,-0.000486,0.000408,0.000995,0.000642,0.000899,0.00035,0.001094,0.000292,0.000581,0.001058,0.000589,2e-05,4.5e-05,8.8e-05,-0.00023,-0.000157,0.001104,0.000142,0.000684,0.001277,0.00157,0.001168,0.000191,-0.000316,-9e-05,0.000368,0.000589,0.000407,-0.000176,-0.000102,0.000343,0.000741,0.000763,-0.000149,-5.9e-05,-0.000658,-0.000195,-0.000759,-0.000803,-4.3e-05,-0.001397,-0.00039,0.000211,0.000279,0.000989,-0.000135,-0.000622,0.000332,-0.00028,-0.000101,-0.000386,-0.000673,-0.000303,-0.000455,0.000131,-9e-06,-0.000175,0.000326,0.000306,-5.8e-05,0.000159,1.8e-05,0.000219,0.000499,-0.000947,-0.000249,-0.000567,7.9e-05,0.000176,7.9e-05,-0.000804,-0.000801,-0.000393,0.000304,0.000671,-0.00019,1.8e-05,-0.00019,-0.000605,-0.000745
-9.2e-05,-0.000104,-0.000473,-9.2e-05,-0.000425,-0.00011,0.00026,-0.000509,-0.000844,-0.000653,-0.000663,-5.1e-05,2.9e-05,0.000372,0.000201,-0.000138,-0.000336,0.000156,-0.000358,-0.000894,-0.000454,-0.000295,7.7e-05,-3e-04,-0.000313,-9e-06,-0.000607,-0.00049,5.5e-05,0.000177,-0.000211,-0.000777,-0.00013,-0.000363,0.000139,-0.000545,-0.000873,-0.000725,-0.000239,-0.000735,-0.000785,7.6e-05,-0.000538,-0.001411,-0.00082,-0.000666,-0.000674,-0.000964,-0.000349,-0.000723,-0.000184,-0.00055,-0.000398,-0.000647,-0.000743,-0.000552,-0.000512,-0.000661,-0.000667,-0.000366,-1.7e-05,-0.000828,-0.000843,-0.000292,-0.000379,-0.000198,-0.000242,-2e-06,-0.000683,0.000311,-0.000119,-0.000406,-0.000757,-0.000255,-0.000159,-0.000666,-0.00066,-0.000362,0.000413,0.000152,-0.000238,0.00035,-0.000129,0,-0.001278,-0.001261,-0.000652,-8.7e-05,-0.000771,-3.2e-05,-0.000465,-0.000606,-0.000627,-0.000632,-0.000129,0.00021,-0.000137,9.3e-05,7.3e-05,-0.000673,-0.000119,-0.000484,-0.000374,-0.000494,-0.000266,0.000707,-0.000216,-0.000378,-0.000374,-0.000417,-0.001012,-0.000143,-0.000127,-0.000462,-0.000488,-0.000365,0.000127,2.1e-05,-0.000673,-0.000403,-0.00016
0.000122,0.000165,-0.000286,-2e-06,0.000147,-0.000309,0.000335,0.000162,0.000264,-0.000198,3e-06,-0.000354,0.000601,0.000268,-3.8e-05,0.000259,0.000267,0.000119,0.000599,0.000438,6.1e-05,0.000386,-0.000468,6.9e-05,6.7e-05,-3.1e-05,0.000475,0.000151,0.000122,-7.4e-05,0.000278,0.000206,0.00025,0.000237,-0.000497,0.000587,0.000435,0.00055,-0.000182,-1e-05,0.000261,-0.000494,-0.000387,0.000583,-0.000257,0.000359,0.000503,0.000177,7e-06,0.00031,9.2e-05,0.000222,0.000421,0.000235,1.9e-05,3.9e-05,-0.000356,-0.000335,1.6e-05,-4.3e-05,-9.1e-05,0.000143,0.000156,-9.3e-05,0.000137,0.000117,-5e-06,-0.000645,0.000501,0.000435,0.000598,0.000336,8.1e-05,-8.9e-05,7.3e-05,-0.000274,-0.000284,-0.000119,-1.6e-05,-5.4e-05,-0.000266,-0.000123,0.000744,-0.000274,0.00079,0.000601,0.000456,-0.000313,0.000192,-0.000717,0.000427,-0.000365,0.000343,0.000204,-0.000278,-5.6e-05,0.000174,-0.000331,-0.000194,0.000426,-4e-04,-0.000148,0.00093,0.000437,-0.000179,-3.9e-05,0.000223,0.000306,4.5e-05,-0.000132,0.000236,0.000146,-0.000191,-0.000102,0.000394,0.000213,-0.000697,-0.000336,-0.000116,-0.000539,-1.9e-05
0.000379,0.00018,0.00026,0.000125,0.000159,0.000222,5e-06,-0.000332,-0.000303,3.9e-05,0.000125,-0.000221,4.3e-05,-0.000176,-0.000273,0.000255,3.8e-05,0.000138,0.000288,-0.00018,9.3e-05,-0.000476,-0.00044,-2e-04,-0.000511,0.000252,-2.9e-05,-0.000265,5.2e-05,2e-05,-0.000202,0.000352,2.9e-05,2e-06,0.000236,-0.00049,-4.2e-05,-0.000562,-6.6e-05,-0.000431,-6e-06,0.000588,0.000185,-0.000131,-5.3e-05,-0.000249,-0.00083,0.000282,-0.000215,-0.000217,-5.6e-05,1.5e-05,-0.000429,0.000236,1.3e-05,0.000273,-2.7e-05,-5.8e-05,-1e-06,0.000338,-0.000491,-0.000281,-0.000205,-5.4e-05,-9.5e-05,2.5e-05,1.6e-05,-9.7e-05,-0.000194,-0.00042,-0.000388,-0.000395,-0.000456,-0.00047,-0.000396,-0.000353,0.000517,-0.000105,0.000241,0.000229,-0.00017,0.00017,-5e-04,-0.000276,-0.000422,1.4e-05,-0.000261,0.000108,-3.3e-05,-0.000145,-0.000364,7.5e-05,-0.000683,-0.000274,0.000505,0.000325,-0.000149,0.000571,-0.000287,-0.000657,0.000244,0.000272,-0.000342,-0.00025,-0.000185,-7.7e-05,-0.000246,8.9e-05,1.5e-05,0.000141,0.000101,-0.000199,-0.00021,-0.000167,-0.000225,-0.000309,0.000408,0.000279,0.000438,0.000297,-0.000128
-8.9e-05,-1e-05,-0.000357,-7.3e-05,3e-06,0.000133,-0.00027,9e-06,0.000425,0.000385,0.000345,0.00011,-0.000152,-5.2e-05,4e-06,0.00025,-5.4e-05,-0.00022,-0.000247,0.000282,-0.000118,-0.000107,0.000306,0.000125,8.7e-05,-0.000134,-4.1e-05,0.000268,8.2e-05,-1.3e-05,9.5e-05,3.1e-05,-6e-05,-0.000484,-0.000421,-2.6e-05,-2e-04,-8.2e-05,0.000231,1.4e-05,-2.8e-05,-0.000551,3.8e-05,-0.000218,0.000217,0.000292,-3.5e-05,-7.6e-05,0.00033,0.000156,-0.00011,-0.000136,7.8e-05,9.9e-05,0.000111,-2.7e-05,0.000229,0.000343,0.000405,-2.2e-05,0.00035,0.000303,5.2e-05,-5.7e-05,0.000159,-7.6e-05,0.000305,0.000252,-0.000104,-0.000225,0.000142,3.4e-05,0.000318,0.000281,0.000282,0.000158,-0.000232,7.5e-05,-0.000359,-0.000437,3.1e-05,0.000177,-6.9e-05,-0.00032,-1e-04,-8.9e-05,0.000324,-4e-05,-0.000294,-0.000344,-2.6e-05,0.000409,0.00093,0.000311,-0.000252,3.9e-05,0.000303,-0.000177,-0.000183,0.000599,0.000221,-0.000147,0.000249,1e-04,0.000388,0.000135,0.000388,-6.1e-05,-7.7e-05,-8.2e-05,0.000295,6.4e-05,0.000333,0.000312,-0.000208,2e-05,-0.000485,-0.000458,3.1e-05,-5e-05,-0.00016
-0.000192,-0.000184,0.00034,-0.00021,-4.6e-05,-8.2e-05,-0.000101,0.000102,-3.1e-05,-0.000125,-0.000285,-0.000239,-0.000125,-0.000118,1.2e-05,-0.000145,2.2e-05,2.6e-05,-8e-05,-0.000326,-0.000168,-2.6e-05,0.000124,0.000143,0.000241,-3.8e-05,4.7e-05,-0.000113,-7.9e-05,0.000138,0.000145,-0.000111,3.5e-05,0.000444,0.000211,0.000109,0.000129,0.000149,0.000225,0.000202,-0.000197,0.000293,0.000326,-9.9e-05,-0.000271,1.2e-05,0.000246,8.2e-05,-0.000204,-0.000175,-9.4e-05,-0.000154,5.2e-05,-0.000263,-4.5e-05,-3.7e-05,-0.000146,-0.000217,0.000145,0.000328,-0.000268,-0.000218,0.000143,-4.9e-05,-0.000142,-4.4e-05,-0.000356,7.8e-05,0.000408,-0.000203,-1e-05,-0.000281,-0.000156,0.000132,1.1e-05,0.000201,-0.000233,6.5e-05,0.000184,-1.8e-05,0.000345,-0.00028,0.000633,-9.8e-05,-0.000119,0.000165,-0.000148,2.8e-05,0.000303,0.00019,7.7e-05,-2e-05,-0.000321,-0.000328,0.000351,1.7e-05,8e-06,0.000298,0.000149,-0.000366,-0.00027,3.4e-05,-0.000645,-0.000428,-0.000158,-0.000278,-0.00012,-5.3e-05,-0.000214,-5.2e-05,5e-05,9e-06,-5.1e-05,-0.000367,0.000274,-0.000217,0.000287,0.000377,0.000128,0.000314,1.5e-05
5.5e-05,-5.3e-05,5.9e-05,9.2e-05,0.000188,8.2e-05,2.1e-05,0.000107,-6.3e-05,5.3e-05,0.000122,5.8e-05,8.8e-05,-2.7e-05,0.000274,-4e-06,5.8e-05,2e-06,0.00022,0.000427,0.000216,0.000156,-1.1e-05,-4.5e-05,2.2e-05,8.7e-05,-7.6e-05,0.000123,0.000148,-8.3e-05,-0.00021,3.2e-05,-3.5e-05,0.000121,-7.9e-05,0.00021,5.8e-05,4.9e-05,-0.000126,-0.000141,-3.5e-05,-0.000227,-0.000188,7.1e-05,0.000127,6.7e-05,0.000209,-0.000125,4.3e-05,0.000286,-4.6e-05,-0.000122,-0.000152,3e-05,8e-05,-0.000125,0.000158,-2.9e-05,2.1e-05,0.000116,4.6e-05,0.000192,-8.7e-05,6e-05,0.00013,7.9e-05,0.000135,0.000208,1.6e-05,0.000272,0.000169,-7e-06,0.000295,0.000144,-5.1e-05,0.000116,0.000465,0.000195,-8.4e-05,0.00021,-0.000408,0.000152,-0.000312,0.000424,-4e-05,7.2e-05,-0.000109,-3.8e-05,-0.000152,0.000203,0.000235,0.000164,3.2e-05,0.000532,-0.000172,0.00026,3.4e-05,-5.1e-05,-5.1e-05,0.000152,7.8e-05,6.1e-05,0.000589,0.00026,-2.6e-05,-0.000124,0.000138,0.000198,6.7e-05,8.3e-05,-4.6e-05,0.000166,0.000163,0.000325,-7.1e-05,3.4e-05,-0.000176,-5e-05,1.7e-05,-8.1e-05,0.000244
2.2e-05,6.9e-05,5e-06,0.000122,4.5e-05,-9e-05,-1.1e-05,-3e-06,-2.8e-05,-0.000158,-0.000105,6.7e-05,1.8e-05,-5.7e-05,4e-06,1.1e-05,8e-05,6.2e-05,-5e-05,-9.2e-05,-0.000101,6.7e-05,-6e-05,-0.000212,9.7e-05,-6.6e-05,3.3e-05,0.000226,-2.4e-05,5.8e-05,0.000221,0.000172,0,0.000198,-2.4e-05,-5.2e-05,-1.3e-05,0.000175,0.000146,0.000265,4e-06,0.000197,-1.9e-05,9.7e-05,0.000111,-8e-06,0.000152,2e-04,0.000144,0.000158,-5e-06,-0.000209,0.000112,0.000113,8.5e-05,0.000156,0.000175,0.00022,-0.000215,2e-05,-1.1e-05,0.000125,-1.7e-05,-1.2e-05,-0.000133,-1e-06,-0.000106,-7.2e-05,-7.7e-05,-0.000125,-0.000344,0.000159,-0.000215,-9.7e-05,-0.000104,2e-05,-1.1e-05,0.000259,-9e-06,-0.000113,0.000365,-2e-05,0.000183,1e-05,-3.2e-05,-0.000134,6.5e-05,-5.7e-05,0.000139,0.000187,-0.000213,1.5e-05,0.000129,-0.000143,8.2e-05,-0.000169,6.4e-05,-0.000203,2.6e-05,-7.5e-05,-1.1e-05,-8.4e-05,-0.000131,0.000261,0.000108,0.000349,-7e-05,-6.8e-05,-3.9e-05,0.000105,4e-05,6.5e-05,-6.3e-05,-1.5e-05,1.4e-05,0.000108,0.000333,1.2e-05,-9e-06,0.000112,7.4e-05
-0.000139,-3.4e-05,-4.9e-05,0.000109,3e-06,9.8e-05,-0.000103,-5.3e-05,0.000125,0.000186,-1.7e-05,1e-04,0.000125,-1.1e-05,-4.6e-05,-4.7e-05,-2.3e-05,-1e-06,-0.000101,2e-05,0.000192,-3.1e-05,0.000165,0.000228,-9e-05,0.000116,-1.8e-05,0.000179,6.6e-05,-6.3e-05,-2.6e-05,-5.6e-05,5e-06,2.1e-05,4.4e-05,6e-05,2e-06,-0.000138,0.000102,-1.8e-05,0.000119,-9.3e-05,8e-06,7.9e-05,9.2e-05,-1.9e-05,5.3e-05,0.000126,-0.000122,-0.000171,4e-06,0.000219,-3e-06,-3.3e-05,1.9e-05,0.000146,-0.000156,-0.000116,5.1e-05,-5e-06,-8.8e-05,-9.8e-05,1e-05,4.7e-05,7.5e-05,4.9e-05,0.00012,4.4e-05,0,7.7e-05,0.000172,9.6e-05,0.000167,1.1e-05,0.000242,4.3e-05,-8e-06,-0.000323,-6.8e-05,-1.4e-05,-8.7e-05,0.000162,-0.000243,-1.1e-05,1.6e-05,-4.2e-05,0.000102,0.000215,-0.000122,5e-06,0.000387,5e-06,3.4e-05,-5.5e-05,0.000192,3.4e-05,-1.5e-05,7.9e-05,-1.7e-05,-8.1e-05,2.5e-05,0.000133,-4.4e-05,-5.1e-05,-1.7e-05,-9.9e-05,-4.4e-05,-1.4e-05,0.000157,-1.1e-05,6.5e-05,1.2e-05,2.2e-05,0.000232,2.9e-05,-5e-06,-0.000137,-5.4e-05,-0.000118,-8.9e-05,0.000263
7.4e-05,3.4e-05,-1.8e-05,3.6e-05,-6.8e-05,-3.4e-05,-4.1e-05,5.8e-05,-2.4e-05,-2.2e-05,0,1.4e-05,-3.2e-05,1e-06,0.000103,9.9e-05,-8.9e-05,-3.8e-05,3.8e-05,-0.000142,-3e-05,-7e-06,7.9e-05,-3.5e-05,5.3e-05,-2.7e-05,6.8e-05,-4.9e-05,-4.3e-05,3.1e-05,-1.5e-05,-9.7e-05,-3e-05,4.1e-05,1.6e-05,-1.4e-05,-2e-05,-1.9e-05,-0.000176,9.1e-05,0.000112,5.9e-05,0.000122,-0.000118,1.1e-05,5.8e-05,-8e-05,-0.00014,9e-06,4.5e-05,-4.2e-05,2.5e-05,-4e-06,3.6e-05,-8e-06,-7e-06,-1.2e-05,-1.2e-05,0.000132,-0.000172,0.000267,-9.5e-05,-5.8e-05,-6.9e-05,7e-06,-3.2e-05,-2.1e-05,-0.000102,-6.2e-05,-0.000166,0.000191,-2.9e-05,-4.6e-05,-4e-05,-7.1e-05,-0.000123,7.3e-05,4.5e-05,7.5e-05,4e-05,2.4e-05,-8e-05,8.9e-05,0.000262,0.000178,-2.8e-05,-6.1e-05,-0.000117,3.5e-05,-0.000124,-0.000156,-4.7e-05,-5e-05,7e-05,-7.7e-05,-5.1e-05,-0.000122,-0.000146,0.00016,5e-06,-0.000102,-2e-06,-5.7e-05,-4e-05,-4e-05,6.3e-05,-2e-06,2.4e-05,-4e-06,1.1e-05,1.3e-05,-0.000101,0,-0.000146,-7.1e-05,7.5e-05,0.000111,9.4e-05,6e-06,7e-06,-8.8e-05
4.1e-05,-2e-06,-9.8e-05,-7.6e-05,7.8e-05,-1.7e-05,6.3e-05,-4.3e-05,2.8e-05,-5.9e-05,6e-05,4.5e-05,-8.9e-05,3.2e-05,-6.1e-05,4.7e-05,-3.7e-05,1.7e-05,-1.9e-05,3.2e-05,-3.8e-05,1.7e-05,-0.000148,-4e-06,-3e-05,-4.8e-05,-6.1e-05,-5.5e-05,3e-06,-9e-06,1.2e-05,0.000122,4.8e-05,-7.4e-05,1.1e-05,-0.000117,5.7e-05,5.9e-05,3e-06,-2.2e-05,7e-06,-7.1e-05,-0.000122,3.5e-05,-5.9e-05,-4e-05,-2e-06,-3.7e-05,-4e-06,5.1e-05,7.6e-05,0.000118,8.3e-05,1.4e-05,-9.8e-05,-5.3e-05,-7.4e-05,8e-06,0.00017,-4.1e-05,-2.6e-05,7.8e-05,3.5e-05,8e-06,2e-06,-2.1e-05,-1e-05,-2.7e-05,2.1e-05,3.5e-05,-8.5e-05,2.7e-05,6.7e-05,7.8e-05,2.5e-05,1.2e-05,1.5e-05,5.1e-05,-2.4e-05,-1.5e-05,4.2e-05,1e-05,0.000183,-7e-05,0.000111,-3e-05,4e-06,1.3e-05,5.3e-05,6e-06,-3.8e-05,-7e-06,-1.1e-05,2e-06,-5.1e-05,6.4e-05,4.5e-05,0.000122,3.9e-05,3.2e-05,9.4e-05,-5.6e-05,-8.4e-05,3.5e-05,-4e-05,-0.000128,4.9e-05,-2.1e-05,-2e-05,-6e-06,5.4e-05,-1e-06,2.8e-05,5e-05,9.1e-05,-4.1e-05,-4.9e-05,-1.9e-05,7.9e-05,-3.2e-05,-7e-05
-3.8e-05,-9e-06,-2e-06,-1.9e-05,-1e-06,-2.1e-05,4e-06,-1.2e-05,-1.4e-05,9.3e-05,3.9e-05,-5e-06,-3e-05,1.1e-05,-1e-06,-6.4e-05,-2.9e-05,-3e-05,-1.6e-05,-4e-06,9e-06,2.4e-05,-3.3e-05,4.5e-05,4.4e-05,7e-06,-4e-06,1.5e-05,-2.3e-05,1.7e-05,-1.8e-05,-2.6e-05,-3.5e-05,-8e-06,4.8e-05,6.6e-05,-7.3e-05,-3.4e-05,6.8e-05,-1.4e-05,4e-06,8.2e-05,3.3e-05,-2.8e-05,-8.2e-05,1.7e-05,-1.9e-05,-2e-06,4e-06,-2.6e-05,-1e-05,5.1e-05,-8.1e-05,-1.7e-05,4.5e-05,-1.1e-05,4e-06,-2.9e-05,-0.00012,1.4e-05,2.7e-05,-2.1e-05,-1.5e-05,-3.7e-05,7e-06,1.5e-05,4.6e-05,-7.8e-05,-2.3e-05,5.1e-05,5e-06,-2.6e-05,-6.8e-05,-4.8e-05,-9e-06,-6.3e-05,-4e-05,1.9e-05,1.7e-05,6e-06,-7.4e-05,-2.4e-05,-0.000123,-5.6e-05,9.5e-05,-4.2e-05,4.4e-05,-2.7e-05,-4.6e-05,-2.8e-05,4.5e-05,8.7e-05,8.6e-05,2.8e-05,-1.3e-05,-1.5e-05,-4.6e-05,1.7e-05,-0.000108,8e-06,-3.9e-05,7.5e-05,8.1e-05,-1.1e-05,7e-06,1.8e-05,2.2e-05,-3.4e-05,1.6e-05,-3.3e-05,1.3e-05,1.7e-05,1.6e-05,0,-1.7e-05,-5e-06,5.2e-05,3.6e-05,9e-06,6e-05,-1.8e-05
-2e-05,4e-06,4.2e-05,-3e-06,2.3e-05,2.6e-05,4.6e-05,1.3e-05,-2.5e-05,-2.5e-05,-5.5e-05,7e-06,2.4e-05,2e-05,6.3e-05,-9.7e-05,8e-06,-7e-06,4.8e-05,1.7e-05,-8.2e-05,-1e-06,4.9e-05,-1.8e-05,-4.9e-05,1.5e-05,5.2e-05,-6e-05,-2.8e-05,-1.7e-05,-1.7e-05,-4.3e-05,6e-06,-2.1e-05,-2.8e-05,-9e-06,5.1e-05,6.5e-05,4.7e-05,-7.6e-05,-2.4e-05,-7.6e-05,3.9e-05,-4e-06,6.3e-05,-4e-06,6.7e-05,6.4e-05,3.7e-05,2.1e-05,2e-05,-4.9e-05,7e-05,-2.5e-05,0,2e-06,8.4e-05,7.1e-05,1.9e-05,-2.1e-05,7.1e-05,-2e-06,6.1e-05,5.2e-05,-2.4e-05,1.3e-05,-3.3e-05,2e-06,-7e-06,-1e-06,-5.6e-05,-3.9e-05,4.1e-05,2.1e-05,-3.9e-05,3.3e-05,-3.3e-05,0.000109,3.4e-05,1.8e-05,1.8e-05,2e-06,6.7e-05,5e-06,1.4e-05,3.3e-05,-5.5e-05,-1.8e-05,3e-05,4.1e-05,-1.9e-05,7.6e-05,-9.3e-05,3e-06,6.7e-05,6e-06,-1.6e-05,1.7e-05,-2e-06,1.8e-05,2.9e-05,-1e-06,-4.4e-05,-4e-05,2.4e-05,2.6e-05,-1.7e-05,2.5e-05,-2.3e-05,3.1e-05,-2e-06,1.9e-05,4.1e-05,0,-3.1e-05,1.6e-05,-0.000101,-2.5e-05,-2.3e-05,3.4e-05,5.6e-05
2.7e-05,0,4.6e-05,3.7e-05,3e-06,-1.8e-05,1.9e-05,4e-06,1.3e-05,1.8e-05,2.9e-05,-2.9e-05,-1.4e-05,-3e-06,-8.3e-05,2.4e-05,2.3e-05,4e-06,0,3.3e-05,6.7e-05,-3e-06,5.5e-05,-4.5e-05,2.4e-05,-5e-06,-5.8e-05,1.1e-05,-4.1e-05,1.7e-05,4e-05,4e-05,-6e-06,1.7e-05,4.2e-05,-1.4e-05,-1e-05,-7.7e-05,-4.7e-05,2.8e-05,-2.5e-05,6.6e-05,-1.5e-05,6.2e-05,1.6e-05,7e-06,-0.000106,-2.2e-05,-3.4e-05,-4.1e-05,4e-06,-9e-06,-3.4e-05,1e-05,1e-05,1.3e-05,-2.4e-05,-4.2e-05,-4.1e-05,1e-05,-4e-05,-7.5e-05,-2.5e-05,-5.2e-05,1.4e-05,1.5e-05,3.8e-05,5.6e-05,6e-06,6.1e-05,1.2e-05,-1.8e-05,-1.1e-05,-1.2e-05,3.6e-05,6.3e-05,8.6e-05,-8.1e-05,-1.4e-05,-1.6e-05,2e-05,2.2e-05,-7.8e-05,-9.6e-05,-0.000113,-3.9e-05,-3e-06,1.1e-05,-2.4e-05,-4.1e-05,3.2e-05,-3e-05,1e-04,3.8e-05,-9e-06,-5.9e-05,-1e-06,-8e-06,-7e-06,7e-06,-3.6e-05,-3.6e-05,6.5e-05,2.5e-05,-1.7e-05,6.1e-05,-3e-06,2.7e-05,-1.9e-05,-2.7e-05,9e-06,9e-06,1e-05,-1.7e-05,2.2e-05,-9e-06,9.1e-05,1.1e-05,4e-06,7e-06,-2.2e-05
9e-06,1.2e-05,-1.4e-05,4.5e-05,-2.3e-05,-3e-06,-3.2e-05,2.5e-05,-1.3e-05,-4.7e-05,4e-06,-2.7e-05,-4e-06,-1e-06,7.8e-05,-1.2e-05,6e-06,4e-06,-3.4e-05,5e-06,-9e-06,-2.2e-05,-2.8e-05,7e-05,3.5e-05,7e-06,3.5e-05,9e-06,-5e-06,-8e-06,-1.4e-05,6e-06,1.8e-05,-3e-06,-4.2e-05,3.3e-05,7e-06,2.9e-05,4.2e-05,3e-05,1.6e-05,-6.4e-05,-2.3e-05,-5.6e-05,2e-05,2.1e-05,8.3e-05,2.2e-05,-8e-06,2.5e-05,-5e-06,-2.7e-05,-2e-06,5.1e-05,2.2e-05,3.9e-05,2.9e-05,-9e-06,3.3e-05,-4.1e-05,3.5e-05,6.6e-05,-1.9e-05,3.5e-05,-2.8e-05,1e-06,-2.9e-05,3.2e-05,0,-0.000129,8.3e-05,5e-06,-6e-06,5.4e-05,5e-06,1.6e-05,1.9e-05,3e-06,4e-06,1.6e-05,-2.7e-05,1e-06,7.8e-05,9e-06,-2.7e-05,1.8e-05,3.2e-05,-1e-06,2e-05,0.000104,-2.1e-05,-9e-06,-6.9e-05,-4.6e-05,-5e-06,3.9e-05,-3e-06,-3.3e-05,2.5e-05,-6e-06,3.5e-05,2.6e-05,-9.7e-05,-1e-05,-1.6e-05,-7.1e-05,-1.6e-05,-2.3e-05,9e-06,3.2e-05,2e-06,-5e-06,-2.8e-05,3.4e-05,-3e-06,9e-06,-4.7e-05,0,1.6e-05,-1.7e-05,3.9e-05
-2e-05,-1e-05,2.6e-05,3e-06,-1.1e-05,-9e-06,2.7e-05,-1.4e-05,2.2e-05,2.7e-05,8e-06,2.8e-05,-2.1e-05,4e-06,-1.2e-05,2.6e-05,-9e-06,3e-06,4e-06,-1.2e-05,2e-05,1.4e-05,-3.9e-05,-4.3e-05,-5e-06,-6e-06,1.4e-05,1.8e-05,-2.4e-05,2e-06,-1.4e-05,-2e-05,-6e-06,1.6e-05,-3e-06,3.7e-05,-1.1e-05,2.9e-05,-2.2e-05,5e-06,-1e-06,4.7e-05,-2e-06,4.2e-05,-5e-06,-3.3e-05,-1.3e-05,-9e-06,-2e-06,6e-06,1.4e-05,-2.2e-05,2.6e-05,-2.5e-05,5e-06,1e-05,-7e-06,6.3e-05,-1.7e-05,-2.2e-05,-4.7e-05,3.2e-05,-8e-06,-3.4e-05,2.5e-05,-1.8e-05,4.5e-05,1e-06,-6e-06,6.3e-05,1.4e-05,9e-06,1.6e-05,-3e-05,-6e-06,1.1e-05,-3.6e-05,-2.9e-05,7e-06,-2.6e-05,-2.4e-05,1.2e-05,-6.1e-05,3.3e-05,-3.9e-05,1.4e-05,5e-06,1e-05,1e-06,3.6e-05,4.6e-05,-1.3e-05,1.2e-05,0,1e-05,-1.2e-05,-2.3e-05,3.3e-05,-1.7e-05,-2e-05,-1.4e-05,9e-06,5e-05,-3.7e-05,3.8e-05,2e-05,2.2e-05,-1e-05,1.7e-05,3e-06,1.3e-05,4e-06,9e-06,4e-06,-1.5e-05,-8e-06,4.5e-05,1e-05,-2.1e-05,3e-06,-7e-06
1.8e-05,0,-2.7e-05,-3e-05,-1.1e-05,1.1e-05,2.5e-05,5e-06,-4e-06,6e-06,-2.4e-05,-1.8e-05,-8e-06,-2e-06,1.4e-05,1e-06,-1.1e-05,5e-06,1.6e-05,-2.5e-05,2.3e-05,1e-05,4.9e-05,2.3e-05,-2e-06,-5e-06,-2.7e-05,-1.4e-05,-2e-06,-1e-06,3.3e-05,-1.2e-05,1e-06,-3e-06,1.8e-05,-4.1e-05,1.3e-05,-7e-06,3.7e-05,3e-05,1.4e-05,-2e-05,3.4e-05,-3.5e-05,1.1e-05,2e-06,5.5e-05,-4e-06,0,3e-06,-1e-05,-1.5e-05,-1.9e-05,-5e-06,-7e-06,-4e-05,-6e-05,-3.7e-05,5.4e-05,7e-06,-3.6e-05,-3.9e-05,-7e-06,2.1e-05,-6e-06,-6e-06,-3.5e-05,-2.1e-05,-2.8e-05,-2.1e-05,-8.8e-05,-4e-06,-2e-06,-6e-06,-1.3e-05,-1.5e-05,3.5e-05,3e-05,1e-05,4e-06,5.1e-05,-3.6e-05,2.7e-05,3e-05,-1.8e-05,-4e-06,-2.2e-05,1.7e-05,-1.6e-05,1.4e-05,-8e-06,-2.8e-05,2.5e-05,1e-06,7e-06,-7e-06,1.3e-05,-3e-06,-1.9e-05,0,0,5e-06,-3.7e-05,5.1e-05,6e-06,-2.9e-05,-1.3e-05,-1e-06,-1.5e-05,-1.4e-05,1.6e-05,0,-7e-06,2e-06,1.8e-05,2e-06,-3.9e-05,7e-06,-2e-06,-2.6e-05,4e-06
1e-05,4e-06,-3.6e-05,9e-06,2.3e-05,-6e-06,-2.5e-05,-3e-06,0,1e-06,3.1e-05,3e-05,6e-06,-1.1e-05,1e-06,-8e-06,3e-06,-8e-06,-6e-06,1.5e-05,-4.5e-05,3e-06,2.2e-05,1.8e-05,-2.2e-05,1e-06,1.2e-05,-9e-06,-7e-06,3e-06,-2.3e-05,2.1e-05,-7e-06,-1.4e-05,-2.3e-05,1.6e-05,-1.1e-05,1.5e-05,-1.9e-05,2e-05,3e-06,1e-05,-1.5e-05,1.7e-05,-2.1e-05,5e-06,-3e-05,-3e-06,1.1e-05,-1e-05,-7e-06,-6e-06,6e-06,1.7e-05,-6e-06,-1e-05,1.5e-05,-2.4e-05,1.8e-05,-4.2e-05,3.8e-05,-2.2e-05,1e-05,-2.3e-05,-8e-06,1.6e-05,2e-05,-2.5e-05,1.2e-05,3.3e-05,2.8e-05,1.9e-05,2.9e-05,-9e-06,3.4e-05,-3.4e-05,-9e-06,2e-06,-1.2e-05,1.8e-05,-1.4e-05,2.7e-05,0,3e-05,4.7e-05,1.8e-05,1.5e-05,-2.9e-05,1.1e-05,-5.7e-05,-1.2e-05,-7e-06,-2.2e-05,1.5e-05,-5.7e-05,-2.3e-05,-4e-06,2e-05,1e-05,1e-05,-1e-06,7e-06,3.6e-05,-3e-06,-1.8e-05,3.2e-05,2.8e-05,-2e-06,1e-06,1e-05,6e-06,1.1e-05,1.9e-05,3e-06,3e-06,7e-06,5.7e-05,-9e-06,1.8e-05,1.1e-05,1e-06
-2.1e-05,-6e-06,-5e-06,1e-05,-2e-06,-1e-05,-1.5e-05,-7e-06,-9e-06,0,1e-05,1e-06,1.3e-05,-4e-06,-2e-06,-3.8e-05,3e-06,3e-06,0,-3.3e-05,1.7e-05,2e-06,-2.2e-05,0,3.7e-05,7e-06,-4e-06,-1.3e-05,-5e-06,-6e-06,-4e-06,4e-06,7e-06,-2e-06,2.3e-05,-1.4e-05,3e-06,-4.7e-05,-1.4e-05,1.8e-05,1e-06,-8e-06,-1.4e-05,1e-05,9e-06,2e-06,-2.1e-05,-7e-06,-7e-06,-1.4e-05,2e-06,4e-06,1.1e-05,-1.3e-05,-1e-06,2e-05,-1.3e-05,3.5e-05,-1.5e-05,3e-05,-1.1e-05,2e-05,5e-06,1.3e-05,1.7e-05,-2e-06,-1.4e-05,-2.5e-05,3e-06,-4e-06,3.8e-05,1.3e-05,-4.1e-05,5e-06,-3.9e-05,-1.3e-05,-2.4e-05,-1e-06,-4e-06,-1e-05,-1.7e-05,-2.6e-05,-3.7e-05,1e-05,4e-06,-3e-06,7e-06,9e-06,-6e-06,-1.5e-05,2.8e-05,1.3e-05,-1e-05,-3.4e-05,3.1e-05,-6e-06,-1.3e-05,2.3e-05,2.2e-05,-2.4e-05,1e-06,-1.1e-05,8e-06,2.3e-05,0,1.5e-05,-4e-05,3e-06,5e-06,-9e-06,1e-06,-1e-06,1.2e-05,-1.3e-05,-1.9e-05,2e-06,-4.6e-05,0,-1e-06,1.2e-05,1.2e-05
-6e-06,4e-06,1.6e-05,1.2e-05,-8e-06,8e-06,-2e-06,2e-06,3e-06,-1.1e-05,-1.9e-05,1.7e-05,1e-06,-6e-06,-1e-06,3e-06,-6e-06,0,6e-06,3.4e-05,-2.2e-05,-9e-06,-3.3e-05,-2.9e-05,-2.4e-05,-5e-06,4e-06,-2.2e-05,0,9e-06,1.4e-05,-1.6e-05,-3e-06,-1.4e-05,1e-06,-2.5e-05,-1e-06,1.7e-05,1.4e-05,-5.3e-05,1.8e-05,9e-06,1.4e-05,-1.9e-05,1.6e-05,-9e-06,-2.3e-05,3.1e-05,-2e-06,3e-06,-9e-06,1.4e-05,-7e-06,3e-06,2e-06,1.3e-05,-3e-06,-1e-05,-3.5e-05,-9e-06,2e-06,1.2e-05,-1e-06,-2.2e-05,-2e-05,6e-06,6e-06,-1.5e-05,-2.4e-05,-5e-05,-2.6e-05,2e-06,3.2e-05,1.5e-05,1.4e-05,7e-06,7e-06,4e-06,-3e-06,2e-06,2.5e-05,3e-05,6.4e-05,0,1.4e-05,2.5e-05,-1.4e-05,-8e-06,1.4e-05,-9e-06,-2e-06,2.8e-05,1.6e-05,3e-06,-1.3e-05,1.5e-05,2e-05,-1.9e-05,2e-06,4.6e-05,3e-06,-2e-06,-2.4e-05,-8e-06,6e-06,1.1e-05,2.4e-05,1e-05,1.9e-05,5e-06,1e-06,-6e-06,0,1.6e-05,1.3e-05,-1e-06,2.4e-05,8e-06,-1.6e-05,2.4e-05,-1.9e-05
2.2e-05,-1e-06,2e-06,6e-06,-3e-06,3e-06,-8e-06,-1e-06,0,2.7e-05,1e-06,-3e-06,1e-06,4e-06,9e-06,1.5e-05,7e-06,-3e-06,-8e-06,-7e-06,8e-06,4e-06,1.8e-05,2.7e-05,9e-06,3e-06,-5e-06,-1.6e-05,2e-06,-5e-06,-1.2e-05,-1e-06,4e-06,-6e-06,-6e-06,1.3e-05,0,7e-06,4.1e-05,-4e-06,-2e-06,-1.4e-05,8e-06,1e-05,-1e-05,5e-06,1.3e-05,-1.9e-05,-7e-06,1.9e-05,1e-05,1.6e-05,6e-06,5e-06,5e-06,-4e-06,3.1e-05,-6e-06,-2.3e-05,9e-06,1.7e-05,-2.3e-05,8e-06,1.4e-05,1.9e-05,-4e-06,5e-06,1.1e-05,1.9e-05,2.4e-05,7e-06,-5e-06,-2.7e-05,-1.7e-05,8e-06,1e-05,1.3e-05,-3e-06,3e-06,1e-05,-1.3e-05,-1.6e-05,-5.4e-05,-1.6e-05,7e-06,-2.6e-05,8e-06,0,-1e-05,8e-06,-2.1e-05,0,5e-06,-4e-06,2.3e-05,1e-05,-9e-06,1.4e-05,-1.2e-05,-4.2e-05,-5e-06,4e-06,2.1e-05,-6e-06,-5e-06,-4.3e-05,-1.5e-05,-1e-05,-1.8e-05,6e-06,2e-06,7e-06,3e-06,-1.3e-05,5e-06,1e-06,-1.7e-05,-4e-06,7e-06,-6e-06,-3e-06
-5e-06,0,2e-05,-1.7e-05,-3e-06,-5e-06,4e-06,4e-06,-2e-06,-3.7e-05,6e-06,-1e-06,-5e-06,3e-06,-1.4e-05,1.4e-05,0,2e-06,-2e-06,1.1e-05,1.8e-05,0,2.8e-05,-1e-05,-8e-06,-4e-06,1e-05,-1.9e-05,3e-06,1e-06,1e-06,9e-06,-2e-06,-5e-06,1.9e-05,1.5e-05,-2e-06,4e-06,-5e-05,-4e-06,6e-06,1.1e-05,-8e-06,-7e-06,2e-06,-2e-06,1.4e-05,-4e-06,-5e-06,-1e-05,-7e-06,1.4e-05,-1e-06,1.1e-05,-2e-06,-5e-06,-1.4e-05,6e-06,2.3e-05,2.2e-05,-3e-06,-2e-06,-2e-06,-1.5e-05,-1.9e-05,-1.3e-05,-9e-06,2.4e-05,9e-06,-1.6e-05,-9e-06,-1.2e-05,2e-05,5e-06,-1e-05,1.8e-05,9e-06,2.8e-05,-1e-06,-1.3e-05,7e-06,7e-06,7e-06,-2.9e-05,1.6e-05,2.3e-05,1e-05,1.8e-05,-3e-06,1.7e-05,3e-05,-8e-06,-1.7e-05,0,-2.7e-05,-1.3e-05,0,-1.1e-05,-1e-06,3e-05,2e-06,3e-06,-1.6e-05,-2.1e-05,-3e-06,2.3e-05,1.9e-05,-1e-05,8e-06,-8e-06,0,3e-06,-8e-06,3e-06,-1.4e-05,0,1.9e-05,5e-06,1e-05,-8e-06,3e-06
-1.8e-05,-1e-06,6e-06,-3e-06,-9e-06,-1e-06,4e-06,-3e-06,-1e-06,2.3e-05,9e-06,-4e-06,3e-06,0,1.8e-05,4e-06,2e-06,-1e-06,8e-06,-8e-06,-1.6e-05,1e-06,-1.7e-05,-1e-06,1e-05,-1e-06,-3e-06,4e-06,7e-06,2e-06,6e-06,-2e-06,-2e-06,3e-06,-1.3e-05,-3e-06,0,6e-06,2.1e-05,1e-06,-6e-06,-5e-06,-9e-06,1e-06,-5e-06,-3e-06,-3e-06,5e-06,9e-06,-9e-06,2e-06,0,2e-06,-9e-06,5e-06,-9e-06,4e-06,-5e-06,2.9e-05,-1.7e-05,2.4e-05,1.3e-05,-1e-05,1.2e-05,1.5e-05,1e-05,1.3e-05,1.7e-05,-1.6e-05,3.6e-05,1e-06,-8e-06,-2.2e-05,-1e-06,5e-06,1.1e-05,-1.9e-05,-4.1e-05,9e-06,8e-06,-5e-06,-7e-06,1.1e-05,-8e-06,-6e-06,-5e-06,-1.1e-05,-2.2e-05,1.1e-05,1e-05,-1.4e-05,-1e-05,1.7e-05,1.1e-05,-2e-06,-9e-06,1.5e-05,0,4e-06,-2.7e-05,0,5e-06,2.9e-05,1.3e-05,0,-2.1e-05,-2.4e-05,5e-06,-1e-05,6e-06,2e-06,1e-06,-4e-06,0,7e-06,-1e-06,-2.6e-05,-9e-06,-6e-06,-1e-06,-2e-06
1.3e-05,0,-1.1e-05,1e-06,1.3e-05,2e-06,-8e-06,2e-06,0,-3e-06,-2e-05,-5e-06,7e-06,-1e-06,-1e-05,-1.4e-05,4e-06,1e-06,0,6e-06,1.8e-05,0,-1.8e-05,1.2e-05,1e-06,6e-06,-1.3e-05,0,6e-06,0,-7e-06,-7e-06,0,-2e-06,5e-06,8e-06,2e-06,-2.1e-05,1.3e-05,-6e-06,-9e-06,3e-06,1.1e-05,1.1e-05,-3e-06,0,-5e-06,-2e-06,-3e-06,5e-06,6e-06,5e-06,-2e-06,-9e-06,1e-06,-3e-06,-7e-06,1.7e-05,1.3e-05,2e-05,-7e-06,7e-06,-3e-06,-1e-05,-9e-06,1e-06,-1.3e-05,3e-06,7e-06,-2e-05,2.1e-05,-3e-06,3.5e-05,7e-06,-1e-06,-8e-06,1e-05,6e-06,-2e-06,-6e-06,-8e-06,0,-2e-06,4e-06,-1e-05,-2.6e-05,-5e-06,1.6e-05,-5e-06,2.2e-05,0,-5e-06,-1.9e-05,-4e-06,7e-06,0,-1e-05,1.3e-05,4e-06,1.7e-05,3e-06,1e-06,-1e-05,-1.2e-05,5e-06,2.9e-05,1.5e-05,6e-06,4e-06,-3e-06,4e-06,2e-06,0,4e-06,1e-06,1e-06,2.8e-05,3e-06,-5e-06,-7e-06,-2e-06
8e-06,1e-06,-1.5e-05,1.7e-05,-9e-06,2e-06,3e-06,0,-1e-06,0,1.5e-05,-1e-06,2e-06,4e-06,5e-06,0,-4e-06,0,-5e-06,-1.7e-05,-1e-05,-1e-06,7e-06,4e-06,-3e-06,-6e-06,1.8e-05,5e-06,4e-06,-1e-06,4e-06,8e-06,2e-06,7e-06,-4e-06,8e-06,-1e-06,1.7e-05,-1.6e-05,1.7e-05,1e-06,-4e-06,2e-06,-6e-06,1.1e-05,-3e-06,-1e-06,1.4e-05,-3e-06,2e-06,-4e-06,-2e-05,1e-06,1.5e-05,0,1.1e-05,-2.5e-05,-1.3e-05,-3.8e-05,-7e-06,-1.7e-05,-1.5e-05,0,-1e-06,3e-06,4e-06,1e-05,-1.4e-05,7e-06,-7e-06,-1.3e-05,6e-06,-2.8e-05,-7e-06,-2e-06,-9e-06,5e-06,-1.2e-05,-3e-06,1e-06,4e-06,5e-06,1.4e-05,-4e-06,1e-06,1.9e-05,9e-06,-8e-06,-1e-06,-1.2e-05,1.1e-05,-6e-06,1.1e-05,-1e-06,9e-06,7e-06,3e-06,-5e-06,-1e-05,-1.4e-05,-5e-06,-4e-06,-6e-06,-8e-06,4e-06,-1.2e-05,-7e-06,-1e-06,-8e-06,-1e-06,-4e-06,-2e-06,9e-06,-4e-06,-1e-06,-2e-06,-1.9e-05,1e-06,9e-06,0,6e-06
-1.6e-05,0,1e-06,6e-06,9e-06,-2e-06,1e-05,-2e-06,-1e-06,9e-06,5e-06,-6e-06,-3e-06,4e-06,1e-06,-7e-06,-1e-06,0,2e-06,9e-06,-4e-06,2e-06,2.7e-05,-1.7e-05,5e-06,1e-06,-6e-06,-3e-06,6e-06,3e-06,4e-06,1e-06,1e-06,-5e-06,-7e-06,-2e-05,0,-5e-06,-3e-06,2.9e-05,-4e-06,3e-06,-8e-06,0,-2e-06,1e-06,8e-06,-1.9e-05,-2e-06,0,7e-06,-1e-06,2e-06,-5e-06,-3e-06,7e-06,1.3e-05,-1.4e-05,-1.3e-05,-1e-06,1e-05,4e-06,7e-06,-1e-06,3e-06,-2e-06,-1.2e-05,-1.6e-05,-2e-06,-7e-06,-2.2e-05,6e-06,1.9e-05,-5e-06,-1e-06,-1e-05,-1.7e-05,1.3e-05,0,5e-06,4e-06,-6e-06,-1.4e-05,2.4e-05,-2.8e-05,-2e-05,-6e-06,0,-1e-06,1e-06,-8e-06,9e-06,3e-06,2e-06,-1.1e-05,7e-06,5e-06,9e-06,-7e-06,6e-06,4e-06,-4e-06,-2e-06,1.9e-05,-8e-06,-3e-06,5e-06,-1e-06,1.2e-05,2e-06,-5e-06,2e-06,3e-06,2e-06,3e-06,1e-06,1.8e-05,-3e-06,-1e-06,1.2e-05,-2e-06
2e-06,0,-4e-06,-1.3e-05,-1.1e-05,-2e-06,4e-06,-2e-06,-1e-06,-1.8e-05,-8e-06,1.2e-05,1e-06,-1e-06,2e-06,1.1e-05,-4e-06,1e-06,1e-06,-8e-06,1e-05,0,-1.2e-05,1.3e-05,-1.2e-05,2e-06,-4e-06,1e-06,2e-06,-2e-06,-8e-06,-9e-06,-2e-06,1e-06,7e-06,-4e-06,1e-06,4e-06,1.4e-05,-1.3e-05,8e-06,0,-1e-06,0,-6e-06,-5e-06,-1e-06,8e-06,-3e-06,-3e-06,-5e-06,-1e-05,-4e-06,-1e-06,1e-06,-6e-06,-3e-06,2.8e-05,-8e-06,1.8e-05,-1.1e-05,8e-06,2e-06,-3e-06,-7e-06,-6e-06,1.1e-05,-1.5e-05,-2e-06,6e-06,2.8e-05,4e-06,-1.3e-05,3e-06,1.2e-05,-7e-06,8e-06,1.9e-05,1e-06,-5e-06,-7e-06,1e-05,0,1e-05,3e-06,2e-06,-2e-06,7e-06,3e-06,-2.7e-05,4e-06,8e-06,-1.2e-05,5e-06,-1e-06,-7e-06,-6e-06,-8e-06,1.4e-05,6e-06,-3e-06,-2e-06,-2e-06,-5e-06,0,-1.4e-05,-1e-06,-3e-06,-1e-06,0,-1e-06,1e-06,1e-06,-6e-06,0,2e-06,-1.8e-05,4e-06,-9e-06,4e-06,-4e-06
1.4e-05,0,2e-06,-4e-06,7e-06,3e-06,0,1e-06,-1e-06,1.4e-05,-3e-06,-6e-06,-2e-06,-2e-06,-1.4e-05,7e-06,1e-06,0,-2e-06,9e-06,-1.5e-05,0,-2.3e-05,0,1.8e-05,-5e-06,6e-06,-5e-06,3e-06,0,6e-06,3e-06,0,-7e-06,-6e-06,3e-06,0,-4e-06,-2e-05,-7e-06,2e-06,-1e-06,6e-06,-9e-06,3e-06,3e-06,-7e-06,-2e-06,2e-06,0,2e-06,-5e-06,6e-06,2e-06,-1e-06,-6e-06,0,-1.2e-05,1.7e-05,-1.8e-05,-4e-06,-7e-06,0,-1e-06,8e-06,1e-06,-7e-06,-4e-06,4e-06,1.2e-05,7e-06,-1e-06,5e-06,5e-06,-1.6e-05,5e-06,3e-06,-1.7e-05,0,0,0,-1.2e-05,0,-4e-06,5e-06,-3e-06,9e-06,-1.2e-05,3e-06,-2e-06,-3e-06,3e-06,6e-06,-4e-06,4e-06,1e-06,3e-06,-1e-06,4e-06,-1.3e-05,2e-06,6e-06,1.1e-05,5e-06,5e-06,1.7e-05,-4e-06,-5e-06,0,1e-06,-1e-06,2e-06,-6e-06,4e-06,-5e-06,-1e-06,1.9e-05,-6e-06,2e-06,-2e-06,-1e-06
-8e-06,0,1e-05,-1e-06,-2e-06,1e-06,-6e-06,4e-06,2e-06,-8e-06,6e-06,1.2e-05,-1e-06,-1e-06,1.8e-05,3e-06,1e-06,0,1e-06,3e-06,1e-05,-1e-06,9e-06,-1.1e-05,-1.3e-05,3e-06,-3e-06,-4e-06,1e-06,2e-06,-2e-06,4e-06,-1e-06,3e-06,6e-06,-4e-06,-1e-06,-9e-06,1.6e-05,-1e-05,1e-06,5e-06,0,1.3e-05,0,-2e-06,-1.2e-05,-2e-06,1e-06,0,1e-06,7e-06,-5e-06,0,2e-06,-1e-06,1.2e-05,-1.3e-05,4e-06,1.6e-05,1e-06,-7e-06,0,-3e-06,-7e-06,1e-06,6e-06,1e-05,5e-06,-7e-06,-2.2e-05,-1e-06,-3e-06,-5e-06,1e-05,9e-06,-6e-06,3e-06,3e-06,8e-06,1.2e-05,9e-06,9e-06,1e-06,0,2e-06,1e-06,1.3e-05,-5e-06,0,0,-4e-06,3e-06,4e-06,3e-06,4e-06,0,0,-7e-06,1.7e-05,-3e-06,3e-06,-1.5e-05,4e-06,-5e-06,-8e-06,-1e-06,4e-06,-3e-06,0,-4e-06,0,-4e-06,-1e-06,4e-06,1e-06,-1.8e-05,3e-06,7e-06,-6e-06,1e-06
-1e-05,0,5e-06,4e-06,-3e-06,-3e-06,2e-06,-2e-06,-2e-06,3e-06,5e-06,-6e-06,3e-06,-1e-06,-1.9e-05,-1.3e-05,1e-06,1e-06,1e-06,-5e-06,-4e-06,-1e-06,1.7e-05,1.1e-05,3e-06,0,-2e-06,1e-06,1e-06,0,-5e-06,-3e-06,1e-06,-2e-06,0,6e-06,1e-06,1.2e-05,-8e-06,0,2e-06,-7e-06,-5e-06,-6e-06,2e-06,1e-06,9e-06,5e-06,-6e-06,0,-3e-06,-5e-06,3e-06,-2e-06,-2e-06,2e-06,-1.5e-05,1.8e-05,1.3e-05,-9e-06,-7e-06,1.1e-05,-2e-06,2e-06,6e-06,4e-06,-5e-06,1.5e-05,-4e-06,-4e-06,0,-1e-06,-4e-06,2e-06,-1e-06,5e-06,0,-1.6e-05,0,-1.1e-05,-9e-06,-7e-06,-1.2e-05,-9e-06,8e-06,5e-06,-5e-06,-5e-06,3e-06,2.5e-05,3e-06,-6e-06,-5e-06,-6e-06,-9e-06,4e-06,-2e-06,-2e-06,-5e-06,-1.4e-05,3e-06,-1e-06,1e-05,-4e-06,-3e-06,1.4e-05,3e-06,5e-06,2e-06,-4e-06,-3e-06,-1e-06,1e-06,-2e-06,-1e-06,-1e-06,1.3e-05,1e-06,-2e-06,1e-06,-3e-06
1.3e-05,-1e-06,-4e-06,7e-06,4e-06,0,4e-06,0,-1e-06,-1e-06,-1.2e-05,5e-06,-1e-06,0,8e-06,1e-06,1e-06,-1e-06,-2e-06,4e-06,-2e-06,0,-1e-06,3e-06,-5e-06,-2e-06,1e-06,2e-06,0,-2e-06,6e-06,-2e-06,-1e-06,5e-06,-2e-06,1.3e-05,-1e-06,-3e-06,-1.5e-05,-1.4e-05,-4e-06,3e-06,2e-06,3e-06,5e-06,2e-06,6e-06,-6e-06,-1e-06,1e-06,2e-06,9e-06,0,-4e-06,1e-06,5e-06,0,-4e-06,-1.2e-05,-6e-06,1.2e-05,5e-06,-2e-06,-4e-06,-4e-06,0,1e-06,1.2e-05,0,-1e-05,5e-06,-2e-06,1e-05,-4e-06,-4e-06,4e-06,1e-06,1.2e-05,-2e-06,7e-06,-1e-06,6e-06,0,-1e-05,3e-06,-9e-06,5e-06,-4e-06,-1e-06,4e-06,-6e-06,-6e-06,1e-06,-1.1e-05,2e-06,-2e-06,-1e-06,6e-06,4e-06,5e-06,-2e-06,-1e-06,-1.3e-05,-1.1e-05,3e-06,-1.4e-05,3e-06,-3e-06,2e-06,2e-06,0,2e-06,1e-06,2e-06,-2e-06,-1e-06,-1.3e-05,-2e-06,-4e-06,-4e-06,4e-06
2e-06,1e-06,-1e-06,-2e-06,-2e-06,2e-06,-8e-06,0,-1e-06,4e-06,6e-06,-4e-06,-4e-06,0,0,-1e-06,-1e-06,1e-06,-1e-06,-5e-06,1.4e-05,1e-06,-2.4e-05,-1.3e-05,1e-05,2e-06,3e-06,4e-06,0,3e-06,-3e-06,1e-06,1e-06,-2e-06,5e-06,-5e-06,0,6e-06,1.7e-05,2e-06,2e-06,-2e-06,2e-06,1e-06,-3e-06,-2e-06,8e-06,6e-06,1e-06,2e-06,-3e-06,4e-06,-4e-06,8e-06,1e-06,1e-06,-3e-06,-3e-06,-1.5e-05,1.2e-05,2e-06,-1e-05,-2e-06,3e-06,3e-06,-4e-06,1e-06,1e-06,2e-06,8e-06,5e-06,-1e-06,-6e-06,5e-06,3e-06,-2e-06,3e-06,-5e-06,-3e-06,-1e-06,6e-06,-4e-06,4e-06,-1e-06,3e-06,2.1e-05,1e-06,7e-06,2e-06,-1e-06,4e-06,-4e-06,1e-06,-2e-06,1e-05,-1e-06,1e-06,-3e-06,6e-06,-2e-06,1e-06,-3e-06,6e-06,8e-06,1e-06,5e-06,-8e-06,-3e-06,-4e-06,2e-06,-4e-06,-1e-06,4e-06,0,5e-06,1e-06,1.3e-05,4e-06,3e-06,-3e-06,-1e-06
-1.1e-05,-1e-06,-4e-06,-1e-05,3e-06,-1e-06,0,1e-06,0,-4e-06,5e-06,-3e-06,2e-06,-2e-06,-9e-06,3e-06,0,0,2e-06,1e-06,-1.4e-05,0,7e-06,8e-06,-5e-06,-1e-06,-2e-06,3e-06,-2e-06,-1e-06,-1e-06,2e-06,-1e-06,3e-06,-5e-06,-3e-06,-1e-06,-9e-06,-4e-06,1.3e-05,-3e-06,3e-06,-1e-06,-7e-06,-6e-06,-2e-06,-1.2e-05,-6e-06,0,-2e-06,2e-06,2e-06,7e-06,-3e-06,-2e-06,-6e-06,-1.1e-05,-1e-06,-1.4e-05,-1.8e-05,-4e-06,-4e-06,2e-06,-9e-06,0,0,-4e-06,-9e-06,0,3e-06,2e-06,-1e-06,3e-06,-1e-06,0,-7e-06,-3e-06,4e-06,0,-2e-06,-3e-06,2e-06,-3e-06,3e-06,-2e-06,-1.3e-05,-7e-06,-9e-06,-1e-06,-5e-06,-3e-06,5e-06,-3e-06,1e-05,-1e-05,-1e-06,-2e-06,1e-06,-5e-06,4e-06,0,-1e-06,0,-9e-06,1e-06,-6e-06,9e-06,1e-06,5e-06,-2e-06,-6e-06,2e-06,0,0,-1e-06,0,-1.3e-05,-5e-06,3e-06,9e-06,0
4e-06,0,-3e-06,0,-3e-06,0,1e-06,-1e-06,0,0,-5e-06,1e-06,0,1e-06,8e-06,4e-06,-2e-06,-1e-06,0,-1e-06,1e-05,0,1.8e-05,4e-06,-5e-06,0,-1e-06,6e-06,-1e-06,0,6e-06,-2e-06,1e-06,-2e-06,3e-06,-1e-06,1e-06,-1e-06,-2.4e-05,9e-06,-1e-06,-4e-06,-2e-06,7e-06,-1e-06,0,0,0,-1e-06,-2e-06,-1e-06,8e-06,-5e-06,-1e-06,0,-1e-06,1.1e-05,-3e-06,6e-06,1.4e-05,9e-06,1.2e-05,4e-06,6e-06,-2e-06,1e-06,5e-06,-1.5e-05,-1e-06,1e-06,-1.1e-05,1e-06,-5e-06,-3e-06,-2e-06,-4e-06,-2e-06,-2e-06,2e-06,2e-06,-3e-06,-1e-06,4e-06,3e-06,1e-06,4e-06,0,8e-06,0,-5e-06,-4e-06,5e-06,4e-06,-6e-06,2e-06,4e-06,0,-3e-06,-4e-06,-5e-06,-1e-06,3e-06,-3e-06,-4e-06,0,1.2e-05,-6e-06,0,-5e-06,2e-06,-1e-06,0,-2e-06,-2e-06,-4e-06,1e-06,1.2e-05,3e-06,-5e-06,-1e-06,-2e-06
7e-06,0,0,6e-06,3e-06,-1e-06,-7e-06,-1e-06,-1e-06,0,-4e-06,-5e-06,-3e-06,0,-3e-06,-5e-06,1e-06,0,-1e-06,3e-06,-7e-06,0,-2e-06,-1.2e-05,9e-06,2e-06,4e-06,2e-06,-2e-06,2e-06,-4e-06,-1e-06,0,3e-06,-2e-06,-1e-05,-1e-06,4e-06,1.8e-05,5e-06,-1e-06,6e-06,1e-06,-4e-06,0,1e-06,-1e-06,4e-06,-2e-06,1e-06,0,-3e-06,0,0,-2e-06,5e-06,-4e-06,1.2e-05,1.9e-05,-6e-06,-4e-06,2e-06,0,-1e-05,3e-06,1e-06,-5e-06,-1.1e-05,-5e-06,-6e-06,-4e-06,1e-06,1e-05,1e-06,0,-2e-06,3e-06,0,0,0,0,-3e-06,-4e-06,5e-06,-6e-06,7e-06,3e-06,-1e-06,1e-06,-6e-06,4e-06,4e-06,-4e-06,-1.1e-05,-3e-06,-4e-06,1e-06,-2e-06,2e-06,7e-06,1e-06,1e-06,7e-06,1e-05,-1e-06,-1e-05,6e-06,0,5e-06,-2e-06,-1e-06,0,-3e-06,-1e-06,5e-06,-1e-06,-1.1e-05,-1e-06,-1e-06,-3e-06,3e-06
-9e-06,0,3e-06,2e-06,-6e-06,2e-06,8e-06,1e-06,-1e-06,-4e-06,5e-06,6e-06,2e-06,0,-8e-06,-1e-06,0,-1e-06,1e-06,-4e-06,-6e-06,0,-1.6e-05,9e-06,-8e-06,-1e-06,-3e-06,2e-06,-2e-06,-1e-06,0,3e-06,1e-06,-2e-06,-2e-06,1e-06,1e-06,0,-6e-06,-6e-06,-1e-06,-7e-06,1e-06,1e-06,3e-06,-1e-06,1e-05,-4e-06,-3e-06,2e-06,1e-06,-3e-06,3e-06,-2e-06,2e-06,0,-1e-06,-1e-05,1.1e-05,-5e-06,-1e-06,-1.4e-05,-2e-06,6e-06,-4e-06,2e-06,6e-06,0,3e-06,-5e-06,1.5e-05,1e-06,-1.7e-05,1e-06,3e-06,1e-06,-4e-06,1e-05,2e-06,-3e-06,1e-06,5e-06,-1e-06,2e-06,-3e-06,-1.2e-05,-3e-06,-5e-06,0,-1.3e-05,-4e-06,0,1e-06,9e-06,7e-06,-2e-06,-1e-06,1e-06,3e-06,-6e-06,-1e-06,2e-06,-1.1e-05,-6e-06,1e-06,9e-06,-1.1e-05,3e-06,-6e-06,-1e-06,-5e-06,1e-06,-3e-06,1e-06,-3e-06,-1e-06,1.2e-05,-1e-06,4e-06,2e-06,-5e-06
-4e-06,0,1e-06,-2e-06,6e-06,0,5e-06,0,0,1e-05,4e-06,-5e-06,1e-06,-1e-06,1.3e-05,0,-1e-06,-1e-06,0,7e-06,1.3e-05,0,-4e-06,2e-06,8e-06,-1e-06,-1e-06,0,-2e-06,-1e-06,2e-06,0,-1e-06,2e-06,4e-06,6e-06,-1e-06,4e-06,-1.4e-05,-2e-06,3e-06,5e-06,-1e-06,2e-06,1e-06,1e-06,-4e-06,6e-06,0,0,-2e-06,0,-5e-06,3e-06,-2e-06,-2e-06,3e-06,-8e-06,-1e-05,1.3e-05,2e-06,0,0,-9e-06,4e-06,-1e-06,-6e-06,9e-06,1e-06,3e-06,1e-06,0,1.9e-05,1e-06,-7e-06,4e-06,-1e-06,-1.3e-05,-1e-06,5e-06,0,-7e-06,0,-2e-06,5e-06,7e-06,0,9e-06,1e-06,1.3e-05,-1e-06,-2e-06,2e-06,5e-06,-4e-06,1e-06,0,-2e-06,-1e-06,2e-06,0,0,1.3e-05,-2e-06,1e-06,-1e-05,1.2e-05,0,7e-06,2e-06,-3e-06,0,1e-06,1e-06,-2e-06,0,-1.2e-05,3e-06,1e-06,0,3e-06
