4e-06,5e-06,4e-06,2e-06,3e-06,8e-06,1e-06,3e-06,6e-06,7e-06,1e-05,1.9e-05,2e-06,1.7e-05,6e-06,0,9e-06,2e-06,6e-06,3e-06,1.2e-05,4e-06,9e-06,5e-06,4e-06,2e-06,1.1e-05,2.9e-05,1.3e-05,3.4e-05,2.2e-05,3e-06,4e-06,6e-06,1e-06,5e-06,1.1e-05,5e-06,1.3e-05,7e-06,1.5e-05,5e-06,1.8e-05,3e-06,2e-06,5e-06,3e-06,1e-05,9e-06,7e-06,3e-06,1.9e-05,6e-06,7e-06,5e-06,7e-06,2e-06,1e-05,1.6e-05,1.8e-05,6e-06,5e-06,1.7e-05,0,0,1.4e-05,9e-06,5e-06,1e-06,8e-06,5e-06,8e-06,1.1e-05,1e-06,1e-06,1.2e-05,1.2e-05,1.4e-05,4e-06,3e-06,1.1e-05,0,1.6e-05,1.2e-05,1.2e-05,9e-06,4e-06,1.3e-05,7e-06,9e-06,1e-06,8e-06,4e-06,6e-06,1.2e-05,1e-06,9e-06,1.1e-05,4e-06,2e-06,2e-06,1.2e-05,1.1e-05,1e-06,5e-06,7e-06,3e-06,9e-06,5e-06,6e-06,1e-06,4e-06,1.2e-05,3e-06,1e-06,1.4e-05,1.1e-05,7e-06,5e-06,1.7e-05,8e-06
5e-06,5e-06,1.3e-05,1.5e-05,1.6e-05,1.2e-05,1.6e-05,3.1e-05,2.1e-05,1.5e-05,2.3e-05,3.7e-05,2.6e-05,5.5e-05,1.6e-05,1.4e-05,2.8e-05,6e-06,1.6e-05,2e-06,2.9e-05,6e-06,2.1e-05,1.7e-05,1.5e-05,5e-06,2.2e-05,8.7e-05,9.6e-05,3.1e-05,5.1e-05,8e-06,1.6e-05,9e-06,7e-06,1.6e-05,1e-05,1.5e-05,1.6e-05,2.3e-05,1.2e-05,1.1e-05,2.6e-05,2.2e-05,2.9e-05,1.4e-05,2.3e-05,3.4e-05,7e-06,1.6e-05,2.2e-05,2.8e-05,3e-05,1.9e-05,4.2e-05,1.1e-05,5e-06,3.4e-05,5.6e-05,1.3e-05,2.3e-05,1.6e-05,2.7e-05,2e-05,1.6e-05,3.7e-05,3e-06,1e-05,4e-06,1.5e-05,6e-06,1.4e-05,1.3e-05,1.7e-05,1.9e-05,3.5e-05,1.4e-05,2.1e-05,1.6e-05,2.6e-05,4e-05,3.3e-05,3.9e-05,3.1e-05,2.1e-05,3.7e-05,3.5e-05,2.6e-05,1.3e-05,1.6e-05,8e-06,2.6e-05,1.1e-05,9e-06,3.5e-05,1.7e-05,3.2e-05,3.8e-05,1.4e-05,1.5e-05,2.4e-05,2.8e-05,2.8e-05,9e-06,2.1e-05,2.1e-05,1.6e-05,2.3e-05,1.8e-05,1.7e-05,9e-06,1.3e-05,2.7e-05,1.5e-05,1.9e-05,3.3e-05,4.3e-05,1.6e-05,1.1e-05,6.3e-05,3e-05
2.2e-05,3e-05,1.1e-05,2.7e-05,2.1e-05,2.9e-05,2e-05,2.6e-05,6e-06,4e-05,3.1e-05,4e-05,6.7e-05,1.7e-05,3.5e-05,1.7e-05,4e-05,2.6e-05,3.1e-05,6e-06,3e-05,3.1e-05,3.7e-05,1.2e-05,2e-05,1.8e-05,2e-05,0.000132,0.000206,0.000264,0.000109,1.1e-05,2.5e-05,1.4e-05,1.3e-05,6e-06,1.9e-05,5e-06,2.5e-05,1.3e-05,2.7e-05,1.3e-05,1.6e-05,4e-05,2.3e-05,5.2e-05,1.6e-05,3.9e-05,3.3e-05,1.4e-05,2.9e-05,5.3e-05,2e-05,2.3e-05,6e-05,2.7e-05,1.4e-05,4.8e-05,5e-06,1.7e-05,4e-05,4e-05,3.6e-05,5.9e-05,2.6e-05,3.5e-05,3.5e-05,1.9e-05,1e-05,1e-05,2e-05,8e-06,2.2e-05,3.8e-05,1.9e-05,5e-05,5e-05,2.8e-05,5.1e-05,9e-06,3.8e-05,2.2e-05,4e-05,4.2e-05,3.9e-05,7e-05,3.6e-05,3.7e-05,3e-05,4.3e-05,2.9e-05,1.7e-05,4e-06,7e-06,4.2e-05,2e-05,4.7e-05,5.2e-05,2.3e-05,1.3e-05,3.4e-05,3.1e-05,3.9e-05,3.8e-05,2.2e-05,4.5e-05,1.9e-05,7e-06,1.5e-05,4.5e-05,2.8e-05,3.3e-05,2.8e-05,2e-06,2e-05,4.3e-05,3e-05,8e-06,2.5e-05,7.8e-05,4.4e-05
5.1e-05,5.6e-05,4.9e-05,5e-05,5.3e-05,6.9e-05,4.5e-05,4e-05,4.1e-05,6.3e-05,0.000111,0.000104,8.4e-05,8e-05,5.9e-05,4.9e-05,3.2e-05,4.4e-05,6.6e-05,2.7e-05,2.6e-05,4.9e-05,2.4e-05,4.7e-05,4.8e-05,4.1e-05,1.7e-05,0.000129,0.000236,9.5e-05,0.000195,0.000171,0.000119,8.3e-05,4.3e-05,2e-05,3e-05,3.3e-05,1.6e-05,1.8e-05,2.2e-05,4.7e-05,2.9e-05,5.7e-05,9.8e-05,4.9e-05,6.1e-05,6.6e-05,4.8e-05,4.2e-05,6e-05,3.7e-05,5.6e-05,3.8e-05,6.2e-05,6.9e-05,4e-05,4e-05,4.2e-05,1.3e-05,4e-05,5.6e-05,0.000118,0.000121,5.9e-05,3.2e-05,8e-06,2.6e-05,2.7e-05,3.3e-05,5e-05,5.4e-05,3.6e-05,5.5e-05,5.9e-05,2.3e-05,7e-06,8.4e-05,9.1e-05,6.9e-05,2.5e-05,6e-05,3.7e-05,8.6e-05,8.6e-05,7.2e-05,9.8e-05,3.3e-05,3e-06,2.1e-05,7.3e-05,0.000104,6e-05,4.5e-05,6.1e-05,7.3e-05,3.1e-05,5.9e-05,1.7e-05,3.6e-05,7e-05,8.2e-05,6.4e-05,7.7e-05,8.3e-05,4.8e-05,5.3e-05,2.3e-05,7.6e-05,9.4e-05,6.4e-05,4.5e-05,7.1e-05,3e-05,9e-06,3e-05,8e-05,6.1e-05,8e-06,0.000103,6.3e-05
4.6e-05,7e-06,2.7e-05,6e-06,2e-05,2.3e-05,1.4e-05,1.9e-05,4.4e-05,2.9e-05,7.4e-05,2.2e-05,3.6e-05,3e-05,1.9e-05,2.3e-05,1.4e-05,3.8e-05,2.7e-05,3.2e-05,4.8e-05,4.9e-05,4.4e-05,7.9e-05,3.3e-05,4.1e-05,4.3e-05,0.000157,0.000288,0.000281,6.6e-05,3.8e-05,3.5e-05,7.9e-05,4.6e-05,3.6e-05,3.3e-05,1.9e-05,3.2e-05,2.1e-05,2.4e-05,5.1e-05,4.9e-05,5.5e-05,6.6e-05,7.9e-05,3.1e-05,5e-05,2.6e-05,5.4e-05,3.6e-05,0.000112,0.000114,8e-05,7.6e-05,8.4e-05,2.5e-05,5.4e-05,6.8e-05,4e-05,4.8e-05,2.1e-05,9.1e-05,2.9e-05,3e-05,4.6e-05,4.5e-05,5.2e-05,2.8e-05,2e-05,5e-05,2.9e-05,3.1e-05,6.1e-05,2.9e-05,5.8e-05,7e-05,0.000102,6e-06,4e-06,6.2e-05,7.7e-05,4.5e-05,3.2e-05,2.5e-05,4.6e-05,0.000125,0.00011,2.6e-05,5.1e-05,8.6e-05,5.2e-05,3.1e-05,1.8e-05,6e-05,8.5e-05,5.3e-05,1.5e-05,3e-05,4.7e-05,3.4e-05,2.4e-05,5.5e-05,9.1e-05,4.2e-05,4.7e-05,5.6e-05,1e-05,0.000105,0.00011,3.3e-05,2.2e-05,4.2e-05,9.6e-05,9e-05,9.7e-05,3.9e-05,5.6e-05,6.7e-05,8.1e-05,5.2e-05
3.3e-05,1.8e-05,3e-05,2.8e-05,1.8e-05,1.5e-05,2.4e-05,3.8e-05,3.9e-05,3e-05,4.6e-05,2.2e-05,5e-05,2.1e-05,3.7e-05,4.1e-05,2.7e-05,1.6e-05,5.4e-05,4.2e-05,4.5e-05,1.1e-05,2.9e-05,5.5e-05,4.1e-05,8.7e-05,1e-06,0.000229,0.000207,0.000151,0.000121,1.3e-05,6.3e-05,7e-05,0.000104,1.4e-05,3.8e-05,2.1e-05,5.5e-05,6e-06,5.5e-05,6.8e-05,3e-05,1.5e-05,5.8e-05,0.000105,0.00012,4.7e-05,8.8e-05,9e-06,7.1e-05,9.1e-05,4e-05,1e-06,6.4e-05,3.5e-05,5.4e-05,0.000114,2.3e-05,6.2e-05,7.4e-05,3.6e-05,6.9e-05,7.1e-05,6.4e-05,7.9e-05,0.000107,8.5e-05,7e-05,1.7e-05,5.4e-05,0.000114,5.4e-05,6.2e-05,7.3e-05,5.5e-05,2.5e-05,8.2e-05,8.3e-05,7.4e-05,0.000105,0.000108,9.7e-05,3e-05,7.2e-05,0.000142,0.000151,0.000122,0.000107,2.6e-05,0.000102,0.000131,7e-05,9e-06,9e-05,9e-06,5.3e-05,4.5e-05,4.2e-05,3e-06,1e-04,0.000114,0.000117,2.5e-05,9.8e-05,6.4e-05,1.2e-05,4.3e-05,0.000109,4.4e-05,0.000125,8.1e-05,5.9e-05,4.2e-05,2.9e-05,6.3e-05,6.5e-05,4.4e-05,1.8e-05,0.000172,0.000154
7e-06,9e-06,1.7e-05,3.1e-05,2.5e-05,3.4e-05,3e-05,3.3e-05,9e-06,4.1e-05,3.9e-05,3.5e-05,5.7e-05,3.4e-05,5.3e-05,6.7e-05,4.2e-05,3.1e-05,5.6e-05,4.4e-05,2.7e-05,4.9e-05,3.8e-05,8.4e-05,9.6e-05,0.000102,0.000119,0.000211,0.000274,0.000344,0.000214,0.000166,6.7e-05,2.6e-05,6.8e-05,9.2e-05,8.8e-05,5.1e-05,0.000101,0.000126,0.000114,6.6e-05,8.9e-05,9.2e-05,4.1e-05,9.5e-05,9.4e-05,8.9e-05,0.000102,0.000118,0.00012,6e-05,9.1e-05,8.4e-05,6.9e-05,4.6e-05,5.9e-05,0.00016,0.000128,8.2e-05,0.000105,6.9e-05,6.5e-05,6.7e-05,5.3e-05,6.5e-05,4.3e-05,5e-05,6.1e-05,3.9e-05,8.7e-05,0.000161,9.1e-05,9e-06,4e-05,6e-06,3.7e-05,1.6e-05,1.5e-05,4.4e-05,5.7e-05,4.6e-05,0.000103,0.000189,0.000129,0.000159,9.9e-05,4.8e-05,2.6e-05,7.4e-05,9.8e-05,4e-05,8e-05,4.7e-05,8e-05,9.3e-05,0.000117,8.9e-05,4.9e-05,1e-06,0.000148,8.5e-05,0.000163,0.000114,0.000133,8.4e-05,2e-05,1.6e-05,4e-05,9e-06,0.000141,0.000126,4e-05,2.5e-05,2.3e-05,6.6e-05,0.000159,0.000145,0.000103,0.000239,0.000196
2.5e-05,1.8e-05,2.7e-05,3.2e-05,4e-06,5e-05,1.7e-05,3.2e-05,1.4e-05,6.3e-05,6.7e-05,2.2e-05,4.1e-05,3.5e-05,4.8e-05,1.7e-05,1.9e-05,6.8e-05,1.2e-05,1.9e-05,3.6e-05,5.2e-05,4.8e-05,4.6e-05,3e-05,7.6e-05,3.7e-05,0.000231,0.000372,0.000138,8.8e-05,8.3e-05,1.7e-05,1.3e-05,4.9e-05,7.8e-05,5.7e-05,8.2e-05,6.3e-05,7.6e-05,2.4e-05,5e-05,8e-05,5e-05,2.7e-05,7.2e-05,3.3e-05,2.1e-05,5.1e-05,4.2e-05,2.4e-05,2e-05,4.7e-05,5e-05,5.6e-05,7e-05,6.6e-05,8e-05,1.8e-05,1e-05,9.5e-05,2.5e-05,6.1e-05,1.8e-05,4.7e-05,8e-06,3.8e-05,2.7e-05,6.8e-05,6e-05,5.6e-05,8.2e-05,5.9e-05,7e-06,2.9e-05,3.5e-05,4.2e-05,7.1e-05,6.5e-05,6.1e-05,2e-05,1.7e-05,5.8e-05,9.3e-05,9.4e-05,5.8e-05,9.5e-05,8.6e-05,7.8e-05,6e-05,1.2e-05,3.5e-05,7.5e-05,5.3e-05,3.1e-05,5.1e-05,2.8e-05,5e-05,5.2e-05,5.6e-05,0.000117,9.2e-05,0.000134,4.6e-05,7.4e-05,3.1e-05,4.4e-05,5.2e-05,6.6e-05,4e-05,0.000119,6.4e-05,4e-06,6.7e-05,7.5e-05,8.7e-05,9e-05,0.000126,8.2e-05,0.000176,7.3e-05
2.2e-05,2.8e-05,5.9e-05,2.4e-05,1.5e-05,4.1e-05,5.7e-05,3.9e-05,1.9e-05,6.1e-05,1.6e-05,3.2e-05,1.2e-05,3.9e-05,2.7e-05,2e-05,1e-05,6.5e-05,6.8e-05,3.5e-05,3.2e-05,4.2e-05,5.2e-05,4.3e-05,1.3e-05,6.1e-05,7.3e-05,0.00026,0.00012,9.1e-05,7.8e-05,4.1e-05,2.6e-05,2.2e-05,2.4e-05,5.6e-05,3.6e-05,1.8e-05,4.2e-05,6.8e-05,2.8e-05,3.4e-05,9e-05,0.000108,9.6e-05,2.6e-05,3.4e-05,7.1e-05,1.8e-05,2.5e-05,2.4e-05,2.8e-05,2.4e-05,0.000114,0.000112,7.7e-05,6.9e-05,4.4e-05,7.4e-05,5.9e-05,4.8e-05,4.6e-05,6.8e-05,5.1e-05,2.9e-05,2e-05,5e-05,6.3e-05,9.7e-05,5.3e-05,5.5e-05,8.4e-05,0.000123,8.6e-05,5.8e-05,4.8e-05,6.9e-05,5.8e-05,5.6e-05,3.9e-05,4e-05,5.7e-05,4.5e-05,6.2e-05,0.00012,0.000106,2.2e-05,5.1e-05,0.000118,7.8e-05,3.2e-05,3.8e-05,7.6e-05,9.9e-05,8.4e-05,2.9e-05,2.7e-05,7.9e-05,0.000139,6.1e-05,9.8e-05,6.8e-05,0.000167,0.000205,7.9e-05,5.5e-05,2.4e-05,5.4e-05,0.000125,9.1e-05,0.000131,0.000151,0.000101,0.00012,7e-06,7.6e-05,6.7e-05,0.000105,9.9e-05,0.000168,4.5e-05
9e-06,1.3e-05,4e-05,4e-05,4.5e-05,2.9e-05,2.8e-05,3.7e-05,4.5e-05,3.3e-05,2.8e-05,2.8e-05,3.1e-05,1.7e-05,3.3e-05,2.2e-05,2.4e-05,2.5e-05,4.1e-05,4e-05,1.1e-05,3.2e-05,1.8e-05,3.2e-05,1.7e-05,3.6e-05,7e-06,0.000194,0.000148,0.000119,8.9e-05,5.3e-05,3.2e-05,4.1e-05,1.6e-05,3.2e-05,3.3e-05,1.9e-05,3.8e-05,4.2e-05,5.3e-05,4.7e-05,7.4e-05,9.9e-05,3.9e-05,2e-05,8.1e-05,0.000125,5.7e-05,2.2e-05,4.3e-05,4.8e-05,5.9e-05,0.000123,7.7e-05,6.7e-05,2.2e-05,2.8e-05,7.9e-05,2.9e-05,6.6e-05,5.7e-05,7.6e-05,4.4e-05,4.9e-05,5.8e-05,2e-05,3.8e-05,3.5e-05,4e-05,8e-06,2.4e-05,6.1e-05,1.5e-05,1.6e-05,4.3e-05,4e-05,5.2e-05,6e-06,1e-05,5.3e-05,1.8e-05,2.9e-05,3.7e-05,8.3e-05,2.3e-05,2.6e-05,6.5e-05,9.9e-05,3.4e-05,4.9e-05,3.3e-05,9.1e-05,5.2e-05,1.3e-05,3.4e-05,2.9e-05,1e-04,6.3e-05,5.6e-05,2e-05,9.1e-05,0.000165,0.000156,8.2e-05,7.1e-05,9.3e-05,9.2e-05,2e-05,4e-05,4.3e-05,9.6e-05,6.9e-05,3.2e-05,6.5e-05,5.4e-05,1.3e-05,8.2e-05,3.6e-05,3.4e-05,5.8e-05
1.4e-05,1.9e-05,1.2e-05,2.6e-05,1.1e-05,7e-06,1.6e-05,2.6e-05,9e-06,2e-05,1.6e-05,5e-06,2.1e-05,3.4e-05,1.7e-05,1.8e-05,1.1e-05,9e-06,1.3e-05,5e-06,2.5e-05,1.6e-05,1.6e-05,4.5e-05,4.4e-05,4.1e-05,2.7e-05,0.000149,0.000188,6e-05,4.3e-05,1.9e-05,1.4e-05,1.3e-05,1.2e-05,3e-05,3.2e-05,4e-05,5e-05,2.8e-05,3.5e-05,1.3e-05,3e-05,1.2e-05,4.1e-05,1.6e-05,6.6e-05,4.7e-05,7e-05,3e-05,3.3e-05,3.3e-05,3.2e-05,4.7e-05,1.6e-05,1.9e-05,4.8e-05,9e-06,4e-05,2.3e-05,5.5e-05,3.2e-05,3.2e-05,7e-06,4.7e-05,7.9e-05,5.7e-05,2.6e-05,3.3e-05,3.8e-05,3.6e-05,1.7e-05,4.8e-05,6e-05,5.4e-05,2.7e-05,5e-05,3e-05,2.2e-05,9e-06,2.7e-05,3.3e-05,3.1e-05,5.8e-05,8e-06,4.6e-05,3.2e-05,7.8e-05,1.8e-05,2.4e-05,6.4e-05,4.1e-05,3.2e-05,1.8e-05,2.8e-05,7.8e-05,2.1e-05,6.4e-05,4.7e-05,6.5e-05,3.5e-05,0.000101,2.7e-05,4.5e-05,3.2e-05,2.6e-05,6.3e-05,3.5e-05,2.4e-05,3.6e-05,1.8e-05,6.6e-05,5.3e-05,4.7e-05,3.8e-05,4.4e-05,4.3e-05,6.7e-05,6.5e-05,5e-05,4e-05
5e-06,2e-05,2.8e-05,1.1e-05,8e-06,1.1e-05,2.7e-05,2.6e-05,1.9e-05,8e-06,1.3e-05,9e-06,1.4e-05,3.7e-05,3.1e-05,2.6e-05,1.3e-05,1.7e-05,1.7e-05,2.2e-05,2.9e-05,6e-06,2.8e-05,3.1e-05,2.2e-05,1.9e-05,2.3e-05,0.00014,0.000112,6.7e-05,3.8e-05,1.9e-05,3.2e-05,4.1e-05,9e-06,2.7e-05,2e-05,2.2e-05,3.8e-05,1.5e-05,1.2e-05,1.4e-05,2.5e-05,1.8e-05,4.2e-05,2.7e-05,5.4e-05,3e-05,6.6e-05,4.2e-05,1.2e-05,1.9e-05,2.7e-05,2.1e-05,2.2e-05,2.6e-05,3.1e-05,1.8e-05,1.5e-05,1.1e-05,4.4e-05,1.5e-05,1.6e-05,3.1e-05,7.1e-05,5.2e-05,2.8e-05,1.9e-05,6.9e-05,5.6e-05,3e-05,1e-05,3.7e-05,5.4e-05,1.2e-05,7e-06,7.4e-05,8.7e-05,3.2e-05,1.6e-05,2.5e-05,3.7e-05,2.7e-05,2e-05,7e-06,3.4e-05,2.6e-05,3.8e-05,5e-06,1.4e-05,5.3e-05,2.9e-05,3.7e-05,5e-05,5.7e-05,2.4e-05,3.7e-05,1.2e-05,4.9e-05,7.8e-05,4.5e-05,3.6e-05,3.4e-05,3.6e-05,4e-05,5.4e-05,2.1e-05,1.4e-05,4e-05,4e-05,2.1e-05,2.3e-05,3e-05,4.2e-05,3.5e-05,7e-05,6e-05,4.4e-05,6.7e-05,4.6e-05,4.9e-05
1.1e-05,2.3e-05,1.2e-05,3.6e-05,1.8e-05,2.1e-05,1.8e-05,5e-06,8e-06,1.1e-05,2e-06,1.4e-05,2e-05,1.6e-05,6e-06,9e-06,1.5e-05,1e-05,2.7e-05,3.9e-05,2.3e-05,8e-06,3.3e-05,4.2e-05,4.9e-05,9e-06,5e-06,0.000153,8.1e-05,3.5e-05,2.1e-05,1.2e-05,3.5e-05,4.7e-05,1.5e-05,3.6e-05,5e-06,3.3e-05,1.6e-05,2.2e-05,1.1e-05,1.6e-05,1.6e-05,9e-06,2.6e-05,1.9e-05,8.9e-05,4e-05,2.2e-05,1.9e-05,1.1e-05,1.9e-05,1.4e-05,2.5e-05,1.9e-05,2e-05,2.8e-05,1.9e-05,3.6e-05,1.4e-05,4.6e-05,3e-05,1.9e-05,1.8e-05,3.1e-05,3.2e-05,3.1e-05,3.2e-05,5.2e-05,6e-05,1.2e-05,2.7e-05,3.2e-05,6.5e-05,2.2e-05,1.4e-05,4.8e-05,3.3e-05,4.4e-05,7e-06,1.5e-05,3.5e-05,3.1e-05,3.9e-05,1.8e-05,3.3e-05,4.4e-05,1.9e-05,1.9e-05,2.9e-05,2.8e-05,2.3e-05,5.5e-05,6.2e-05,5.5e-05,1.8e-05,1.3e-05,4.8e-05,5.5e-05,2.6e-05,2.9e-05,2.7e-05,5.7e-05,2.9e-05,7.5e-05,1.4e-05,4.2e-05,2e-05,2e-05,2.1e-05,3.3e-05,2.4e-05,2.1e-05,5.9e-05,9e-06,3e-05,4.5e-05,2.8e-05,5.2e-05,2.1e-05,1e-05
1.9e-05,1e-06,7e-06,2.7e-05,1.2e-05,2.8e-05,2.3e-05,3e-05,1.8e-05,2.9e-05,3.3e-05,1.9e-05,1.8e-05,1e-05,2.1e-05,2.5e-05,2.1e-05,1.9e-05,2.4e-05,1e-05,3.4e-05,3e-06,2.2e-05,3.6e-05,6e-06,1.9e-05,1e-06,0.000112,6.4e-05,9.2e-05,4.4e-05,2.1e-05,3.2e-05,4.9e-05,3.7e-05,2.1e-05,2.5e-05,6.6e-05,4.8e-05,1.4e-05,8e-06,8e-06,3.1e-05,3.2e-05,3.4e-05,1.4e-05,6.7e-05,3.2e-05,1.4e-05,1.7e-05,3.1e-05,2e-05,4e-05,5.6e-05,4.7e-05,2.4e-05,3e-05,1.1e-05,3.8e-05,3e-05,4.1e-05,5.3e-05,2.2e-05,1.2e-05,2.7e-05,4.8e-05,5.3e-05,2.3e-05,4.3e-05,2.4e-05,4.4e-05,3.1e-05,3.8e-05,3.5e-05,4.6e-05,4.4e-05,3.6e-05,3.5e-05,9e-06,1.9e-05,1.4e-05,3.3e-05,4e-06,5.1e-05,4.8e-05,2.8e-05,6.9e-05,7.4e-05,4e-05,4.4e-05,2.6e-05,8e-06,5.2e-05,2.7e-05,4.9e-05,3.1e-05,1.9e-05,3.4e-05,4.1e-05,4e-05,5.8e-05,5e-05,5e-05,7.1e-05,8.7e-05,4.5e-05,3.6e-05,2.6e-05,4.7e-05,4.2e-05,4e-05,6.3e-05,4.7e-05,8.6e-05,3.1e-05,7e-06,2.5e-05,7.2e-05,2.3e-05,3.2e-05,1.4e-05
1.4e-05,1.2e-05,2.7e-05,3.4e-05,4.4e-05,3.8e-05,2.3e-05,3.9e-05,4.4e-05,2e-06,1.3e-05,1.3e-05,1.6e-05,1.4e-05,1.9e-05,6e-06,4.2e-05,3.2e-05,4.4e-05,2.7e-05,4.8e-05,4.5e-05,1.2e-05,1.7e-05,3.3e-05,8e-06,1.5e-05,0.000121,6.4e-05,3.9e-05,1.5e-05,2.5e-05,1.4e-05,5.3e-05,5.6e-05,4.7e-05,5.9e-05,2.7e-05,1.6e-05,2.4e-05,1.7e-05,1.6e-05,3.7e-05,5.5e-05,8.1e-05,7e-05,8.6e-05,7.1e-05,3.6e-05,2e-05,4.4e-05,6.7e-05,4.9e-05,6.2e-05,4e-05,6.6e-05,5.5e-05,3.6e-05,1.5e-05,1.9e-05,2.1e-05,2.3e-05,2.9e-05,1.4e-05,2.4e-05,4.5e-05,6e-06,2.8e-05,3.1e-05,5e-06,3.6e-05,3.1e-05,4.5e-05,5.3e-05,6.6e-05,3.6e-05,2.3e-05,2.3e-05,4.2e-05,1.7e-05,4e-06,4.5e-05,5.5e-05,4.8e-05,7.1e-05,3.7e-05,7.3e-05,2.1e-05,2.3e-05,3.5e-05,5.4e-05,2.9e-05,2.7e-05,7e-05,2.6e-05,2.8e-05,2.8e-05,4.4e-05,4.3e-05,7.7e-05,9.2e-05,2.4e-05,7.3e-05,2.8e-05,7.7e-05,8.4e-05,7e-05,4.8e-05,3.4e-05,4.1e-05,8.5e-05,5.5e-05,7.1e-05,6.4e-05,6.1e-05,6.1e-05,6.7e-05,7.6e-05,3.9e-05,3e-06,1.3e-05
4.4e-05,1.6e-05,2.3e-05,1.2e-05,4.9e-05,2.7e-05,3.3e-05,5e-05,2e-05,2.6e-05,2.4e-05,1.9e-05,2.4e-05,1.8e-05,4e-05,3.3e-05,3.8e-05,1e-05,1.9e-05,1.5e-05,4.4e-05,4.1e-05,5.3e-05,3.6e-05,1.8e-05,4.2e-05,2.5e-05,0.000151,8.7e-05,2.5e-05,1.9e-05,3.8e-05,2.4e-05,4.8e-05,4e-06,2.9e-05,4.6e-05,4.5e-05,8.6e-05,7.7e-05,4.7e-05,3.8e-05,3.2e-05,2.3e-05,1.9e-05,8.5e-05,8.3e-05,4.3e-05,2.5e-05,2e-05,5.3e-05,1.9e-05,9e-06,5.5e-05,3e-05,5.4e-05,5.2e-05,5.9e-05,2.6e-05,5.2e-05,5.1e-05,6.2e-05,7e-06,2.3e-05,2.6e-05,4e-05,3.4e-05,2.7e-05,1e-05,1.7e-05,3.5e-05,6.6e-05,9.1e-05,5.9e-05,3.2e-05,2.1e-05,5.6e-05,2.7e-05,5.5e-05,5.7e-05,3.2e-05,2.6e-05,3.6e-05,5.6e-05,5.4e-05,8.7e-05,4.6e-05,2.9e-05,4.2e-05,2.8e-05,3.6e-05,3.5e-05,2.9e-05,5.4e-05,3e-05,3.5e-05,1.2e-05,5e-05,4.5e-05,5.7e-05,2.9e-05,9.1e-05,0.000104,8e-05,4e-05,6.8e-05,1.4e-05,3.9e-05,3.5e-05,8.2e-05,0.00013,8.5e-05,3.8e-05,6.4e-05,0.000102,4.3e-05,3.1e-05,4.8e-05,9.6e-05,7.5e-05,2.8e-05
6e-05,4.3e-05,5e-06,2.4e-05,2.9e-05,2.6e-05,3.3e-05,1.8e-05,1.3e-05,2.1e-05,2.4e-05,5.4e-05,7.2e-05,4.9e-05,1.6e-05,0,5.2e-05,2.4e-05,9e-06,1.5e-05,4.3e-05,2.2e-05,4.5e-05,1.8e-05,4.3e-05,2.4e-05,2.9e-05,0.000135,7e-06,3.6e-05,5.9e-05,5.6e-05,3.1e-05,2.7e-05,2.4e-05,4.7e-05,1e-05,8e-06,8.6e-05,2.6e-05,4.2e-05,7.6e-05,5.5e-05,7.7e-05,5.7e-05,7.5e-05,5.4e-05,5.2e-05,5.3e-05,3.6e-05,7.4e-05,4.8e-05,1.6e-05,1.5e-05,2.5e-05,5.8e-05,5.9e-05,2.6e-05,5e-05,7.6e-05,3.8e-05,4.5e-05,6.9e-05,6.2e-05,4.1e-05,3.4e-05,3e-05,9e-06,2.5e-05,2.6e-05,2e-05,5e-05,1.7e-05,2.2e-05,4.6e-05,4.1e-05,4.7e-05,7.2e-05,1.8e-05,3.7e-05,5.9e-05,2.6e-05,4.1e-05,7.7e-05,8.2e-05,0.000105,6.4e-05,1e-05,4.5e-05,2.8e-05,6.2e-05,8e-05,3.6e-05,7e-05,6.7e-05,2.1e-05,6.9e-05,3e-05,3.5e-05,3.9e-05,3.9e-05,0.000119,3.1e-05,6.2e-05,8.4e-05,0.000106,4.8e-05,1.9e-05,2.2e-05,9.9e-05,0.000114,7.7e-05,4.5e-05,8.7e-05,0.000102,8.9e-05,9.4e-05,4.5e-05,5.5e-05,3.3e-05,5.5e-05
3.6e-05,2.1e-05,2.7e-05,1.3e-05,3.2e-05,1.1e-05,4.5e-05,4.3e-05,4e-05,1.7e-05,3.7e-05,2.9e-05,4e-05,4.9e-05,5e-05,3.5e-05,5.5e-05,4.8e-05,4.1e-05,4.5e-05,4.2e-05,5.2e-05,1.1e-05,8e-06,3.7e-05,5.5e-05,6e-05,9.8e-05,5.7e-05,1.1e-05,3.7e-05,4.8e-05,2.5e-05,4.1e-05,1.7e-05,3.4e-05,2.7e-05,2.6e-05,6.9e-05,5.8e-05,2.7e-05,4.7e-05,9.4e-05,6.6e-05,6.3e-05,4e-05,3.5e-05,2.3e-05,2.6e-05,2.4e-05,4.7e-05,3.6e-05,6.5e-05,6.2e-05,6.1e-05,6e-05,2e-05,1.7e-05,4.6e-05,5.1e-05,7e-06,5.1e-05,1.7e-05,5.9e-05,7.9e-05,8.5e-05,2.1e-05,1.6e-05,4.8e-05,2e-06,1.6e-05,1.4e-05,1.7e-05,2.1e-05,1.2e-05,1.1e-05,7.1e-05,6.8e-05,7.9e-05,7.1e-05,9.5e-05,8.6e-05,5.8e-05,0.000125,0.000109,2.8e-05,3.9e-05,2.6e-05,3.1e-05,1.7e-05,6.4e-05,2.1e-05,4.7e-05,4e-05,4.1e-05,8.4e-05,6.7e-05,5.6e-05,6.3e-05,7.2e-05,5.6e-05,0.000127,8.5e-05,7.9e-05,8.7e-05,4.3e-05,4e-05,1.6e-05,2.8e-05,0.00011,4.9e-05,2.5e-05,6.1e-05,0.000111,7.4e-05,2.1e-05,0.000118,0.000102,0.000117,5.8e-05,3.9e-05
1.6e-05,5e-06,9e-06,1e-05,1e-05,1.6e-05,1.5e-05,1e-05,1.5e-05,9e-06,2.2e-05,3e-05,9e-06,2.3e-05,3e-06,4e-06,2e-05,2.7e-05,1.3e-05,1.9e-05,2.9e-05,1.2e-05,1.1e-05,9e-06,3.1e-05,6e-06,2.5e-05,6.2e-05,2.7e-05,5e-05,1.1e-05,1.8e-05,7e-06,2.1e-05,1.2e-05,1.7e-05,1.5e-05,1.7e-05,1.6e-05,3.7e-05,2.2e-05,3e-05,3.2e-05,3.5e-05,2.7e-05,1e-05,1.3e-05,1.9e-05,4.2e-05,4.3e-05,1.1e-05,2.9e-05,5.2e-05,9.2e-05,3.2e-05,5.4e-05,5.8e-05,3.9e-05,3.2e-05,5.9e-05,4.8e-05,5.4e-05,6.2e-05,3.5e-05,5.4e-05,5.6e-05,4.8e-05,4e-05,2.6e-05,3.3e-05,2.3e-05,1.2e-05,8e-06,4e-05,1.9e-05,2.2e-05,6.7e-05,7e-06,2.2e-05,2.8e-05,2.3e-05,6.6e-05,6.5e-05,4.8e-05,2.6e-05,8.1e-05,5.5e-05,1.8e-05,1.7e-05,2.1e-05,4.9e-05,4.7e-05,4.1e-05,4.4e-05,2.1e-05,5.1e-05,6.6e-05,3.6e-05,0.000107,5.2e-05,3.7e-05,6.7e-05,5.3e-05,3.2e-05,6.8e-05,2.2e-05,3.7e-05,3.7e-05,3.3e-05,5.1e-05,4.6e-05,6.9e-05,7.4e-05,6.4e-05,2.9e-05,2.2e-05,0.000102,6.2e-05,5.3e-05,2.7e-05,5e-05
1.6e-05,1.1e-05,6e-06,1.2e-05,7e-06,1e-05,1.4e-05,1.1e-05,1e-06,7e-06,1.1e-05,2e-05,1.7e-05,1e-05,1.2e-05,1.2e-05,7e-06,1.2e-05,2e-05,2e-05,7e-06,5e-06,1.1e-05,1.1e-05,1.4e-05,2.1e-05,1.2e-05,6.7e-05,4.3e-05,7e-06,1.8e-05,3e-05,1.5e-05,8e-06,2.2e-05,1.3e-05,1.6e-05,1.5e-05,1.4e-05,2.8e-05,2.9e-05,3.7e-05,2.2e-05,1.5e-05,1.1e-05,4e-06,2.4e-05,2.1e-05,1.2e-05,4e-05,3.7e-05,2.1e-05,5.6e-05,2.2e-05,8e-06,1.5e-05,1.7e-05,2.7e-05,2.2e-05,2.5e-05,4.7e-05,1e-05,3.8e-05,2.1e-05,2.4e-05,2.3e-05,9e-06,3.5e-05,3.1e-05,2.5e-05,1e-05,2.1e-05,1.4e-05,4.5e-05,3.5e-05,2.2e-05,4.1e-05,4.6e-05,2.9e-05,1e-05,3.4e-05,5.6e-05,2.5e-05,6e-06,3.5e-05,3.1e-05,2.4e-05,3.1e-05,3.9e-05,3.2e-05,1.1e-05,2.1e-05,1e-05,2.5e-05,3.2e-05,1.5e-05,4.1e-05,2.6e-05,7.7e-05,2.1e-05,7e-06,3.1e-05,1.5e-05,3.3e-05,2.6e-05,2.7e-05,3.1e-05,6e-06,1.6e-05,1.4e-05,4.9e-05,3.6e-05,1.5e-05,3.3e-05,2.4e-05,1.1e-05,7.7e-05,5.5e-05,6.8e-05,4.3e-05,3.1e-05
5e-06,6e-06,5e-06,1e-05,3e-06,7e-06,1.9e-05,9e-06,1.1e-05,1.5e-05,4e-06,1.3e-05,8e-06,3e-06,9e-06,1.2e-05,1.6e-05,7e-06,1.2e-05,1.9e-05,1.9e-05,1.8e-05,2e-05,9e-06,9e-06,6e-06,4e-06,7.8e-05,4.5e-05,3.4e-05,2e-05,1.2e-05,2.4e-05,7e-06,2.4e-05,1.1e-05,8e-06,2.5e-05,9e-06,1.3e-05,7e-06,1.8e-05,1.9e-05,2e-05,1.3e-05,8e-06,2.9e-05,2.5e-05,1.3e-05,1.6e-05,1.2e-05,1.9e-05,1.6e-05,1.3e-05,3.5e-05,2.1e-05,3.3e-05,1.8e-05,6e-06,2.4e-05,2.8e-05,1.4e-05,4.2e-05,1.9e-05,2.4e-05,2.8e-05,6e-06,2.2e-05,9e-06,1e-05,1.2e-05,1.7e-05,1.2e-05,4.3e-05,2.7e-05,2.4e-05,1.7e-05,2.4e-05,9e-06,1.9e-05,3.7e-05,3.1e-05,2.9e-05,1.8e-05,1.7e-05,2.5e-05,7e-06,1.2e-05,3.1e-05,5e-06,1.8e-05,3.1e-05,2.7e-05,1.8e-05,1.4e-05,1.8e-05,3.1e-05,2e-05,2e-05,2.3e-05,3.5e-05,3.8e-05,4.2e-05,2.8e-05,1.2e-05,3.3e-05,1.9e-05,1.6e-05,1.3e-05,2.8e-05,5.9e-05,2.6e-05,2.7e-05,3.4e-05,3.9e-05,4.2e-05,5.4e-05,2e-05,1.3e-05,1.5e-05,2.1e-05
1.2e-05,4e-06,5e-06,7e-06,1e-06,1.2e-05,9e-06,8e-06,1.6e-05,4e-06,1.2e-05,1.4e-05,8e-06,1.1e-05,2e-06,7e-06,1e-05,2e-06,1.2e-05,7e-06,1.3e-05,6e-06,1.5e-05,3e-06,1e-05,1.3e-05,7e-06,6.9e-05,2.3e-05,2e-05,1.5e-05,9e-06,7e-06,1.7e-05,1.4e-05,9e-06,6e-06,1.2e-05,1.7e-05,2e-05,1.3e-05,5e-06,2.8e-05,2.6e-05,2.2e-05,1.2e-05,2.8e-05,2.5e-05,2.2e-05,1.2e-05,1.8e-05,1.4e-05,2.7e-05,2.1e-05,1.2e-05,1.1e-05,3.2e-05,1.6e-05,2e-05,2.2e-05,1.6e-05,1.7e-05,3.5e-05,1.5e-05,1.9e-05,2.4e-05,2.2e-05,1e-05,7e-06,1.4e-05,9e-06,1.5e-05,8e-06,2.2e-05,2.3e-05,2.2e-05,2.1e-05,1e-05,1.4e-05,1.2e-05,2.3e-05,2.3e-05,8e-06,3.4e-05,2e-06,7e-06,2.2e-05,9e-06,1.4e-05,8e-06,2.8e-05,7e-06,8e-06,1.3e-05,1.2e-05,8e-06,2.7e-05,1.8e-05,1e-05,1.1e-05,1.2e-05,2.6e-05,2e-05,1.5e-05,2.1e-05,1.9e-05,2e-05,7e-06,1.6e-05,2.4e-05,3.6e-05,2.8e-05,8e-06,3.6e-05,3.2e-05,2e-06,3.3e-05,1.7e-05,1.1e-05,1.5e-05,6e-06
4e-06,2e-06,1e-06,1e-06,3e-06,3e-06,6e-06,9e-06,1e-06,5e-06,1e-06,3e-06,5e-06,4e-06,1e-06,2e-06,2e-06,3e-06,7e-06,6e-06,5e-06,6e-06,5e-06,6e-06,8e-06,4e-06,7e-06,3e-05,2.3e-05,1.1e-05,1e-05,6e-06,3e-06,9e-06,1.1e-05,4e-06,6e-06,3e-06,1.2e-05,5e-06,7e-06,6e-06,1.2e-05,9e-06,7e-06,5e-06,8e-06,2e-06,4e-06,1e-05,8e-06,1e-05,1.2e-05,1.6e-05,8e-06,1.2e-05,6e-06,9e-06,4e-06,1.3e-05,9e-06,5e-06,5e-06,5e-06,6e-06,5e-06,9e-06,5e-06,7e-06,1e-05,7e-06,4e-06,5e-06,9e-06,1e-05,4e-06,1e-06,1e-05,4e-06,6e-06,8e-06,7e-06,8e-06,1.5e-05,4e-06,7e-06,1.6e-05,6e-06,1.2e-05,8e-06,1.3e-05,8e-06,2e-06,5e-06,8e-06,8e-06,1e-05,4e-06,7e-06,9e-06,1e-05,6e-06,8e-06,1.2e-05,6e-06,3e-06,4e-06,6e-06,8e-06,1.6e-05,1.5e-05,6e-06,8e-06,2e-05,3e-06,4e-06,1.5e-05,5e-06,1e-05,2e-06,3e-06
9e-06,5e-06,4e-06,3e-06,1e-06,2e-06,6e-06,6e-06,1e-06,4e-06,4e-06,4e-06,6e-06,4e-06,6e-06,1e-06,2e-06,1e-06,5e-06,5e-06,1e-05,1e-06,7e-06,5e-06,1e-06,2e-06,7e-06,2.8e-05,7e-06,7e-06,2e-06,5e-06,6e-06,1.2e-05,1.1e-05,1.1e-05,1.6e-05,1.2e-05,6e-06,5e-06,2e-06,1e-05,1.4e-05,1.4e-05,1.3e-05,1.1e-05,6e-06,2e-06,4e-06,5e-06,9e-06,1.3e-05,7e-06,1.1e-05,3e-06,1.2e-05,1.4e-05,5e-06,1.1e-05,7e-06,5e-06,7e-06,7e-06,3e-06,7e-06,0,3e-06,1e-05,3e-06,7e-06,5e-06,3e-06,4e-06,5e-06,1.2e-05,1.2e-05,1.1e-05,6e-06,8e-06,5e-06,5e-06,9e-06,8e-06,1.2e-05,4e-06,4e-06,1.8e-05,2.1e-05,2e-06,6e-06,2e-06,5e-06,1e-05,1e-06,8e-06,9e-06,1.3e-05,1e-05,8e-06,4e-06,3e-06,4e-06,9e-06,1.4e-05,8e-06,1.3e-05,6e-06,4e-06,6e-06,1.7e-05,1.8e-05,1e-05,5e-06,1.3e-05,1e-05,1e-06,5e-06,5e-06,1e-05,1e-05,1.5e-05
7e-06,1e-06,3e-06,1e-06,1e-06,2e-06,5e-06,5e-06,2e-06,4e-06,4e-06,3e-06,7e-06,4e-06,6e-06,4e-06,2e-06,2e-06,4e-06,4e-06,6e-06,7e-06,4e-06,3e-06,2e-06,4e-06,3e-06,2.3e-05,2.5e-05,1.6e-05,8e-06,5e-06,8e-06,9e-06,1e-06,7e-06,8e-06,3e-06,3e-06,7e-06,1e-06,1.1e-05,2e-06,5e-06,8e-06,5e-06,1e-06,6e-06,4e-06,1e-06,9e-06,2e-06,6e-06,5e-06,9e-06,9e-06,1.1e-05,8e-06,6e-06,3e-06,8e-06,2e-06,6e-06,4e-06,1.2e-05,8e-06,1e-05,3e-06,5e-06,3e-06,3e-06,5e-06,4e-06,5e-06,9e-06,3e-06,7e-06,7e-06,6e-06,6e-06,7e-06,1.1e-05,7e-06,4e-06,7e-06,2e-06,1.5e-05,6e-06,6e-06,8e-06,1e-05,4e-06,2e-06,4e-06,7e-06,2e-06,8e-06,4e-06,1e-06,5e-06,3e-06,5e-06,1.3e-05,1.6e-05,1e-05,1.6e-05,6e-06,6e-06,8e-06,1.1e-05,1.5e-05,1.6e-05,1e-05,1.2e-05,7e-06,1.6e-05,1.9e-05,6e-06,8e-06,2e-06,1.5e-05
3e-06,4e-06,0,2e-06,0,0,0,5e-06,4e-06,3e-06,4e-06,4e-06,4e-06,3e-06,5e-06,3e-06,1e-06,4e-06,2e-06,1e-06,3e-06,3e-06,7e-06,1.1e-05,7e-06,9e-06,4e-06,2.1e-05,2.3e-05,5e-06,2e-06,1e-06,5e-06,9e-06,6e-06,4e-06,7e-06,5e-06,6e-06,2e-06,3e-06,5e-06,1e-06,8e-06,1.3e-05,7e-06,3e-06,7e-06,6e-06,1e-06,1.1e-05,6e-06,3e-06,5e-06,7e-06,7e-06,5e-06,4e-06,3e-06,1e-05,6e-06,3e-06,4e-06,3e-06,1.2e-05,1e-05,6e-06,6e-06,5e-06,7e-06,6e-06,4e-06,6e-06,3e-06,3e-06,3e-06,8e-06,1.1e-05,6e-06,7e-06,6e-06,9e-06,1.1e-05,1.3e-05,3e-06,1e-05,3e-06,8e-06,3e-06,9e-06,3e-06,2e-06,4e-06,3e-06,1.1e-05,1e-05,6e-06,4e-06,1e-05,2e-06,8e-06,1.4e-05,7e-06,5e-06,5e-06,6e-06,6e-06,5e-06,1.2e-05,7e-06,9e-06,9e-06,3e-06,8e-06,6e-06,2e-05,1.2e-05,1.4e-05,8e-06,1.5e-05,5e-06
0,1e-06,5e-06,1e-06,2e-06,3e-06,4e-06,7e-06,1e-06,1e-06,4e-06,3e-06,1e-06,2e-06,2e-06,3e-06,5e-06,4e-06,7e-06,4e-06,5e-06,2e-06,8e-06,1.2e-05,8e-06,7e-06,7e-06,1.8e-05,1e-05,4e-06,9e-06,4e-06,3e-06,1e-06,6e-06,1e-06,4e-06,7e-06,3e-06,5e-06,1.1e-05,6e-06,5e-06,9e-06,7e-06,5e-06,4e-06,6e-06,1e-06,6e-06,1.4e-05,7e-06,6e-06,1e-06,1e-05,5e-06,1.3e-05,6e-06,9e-06,1.4e-05,9e-06,7e-06,0,1.1e-05,4e-06,8e-06,6e-06,7e-06,3e-06,1.3e-05,1.6e-05,1.5e-05,8e-06,6e-06,5e-06,8e-06,1.1e-05,7e-06,7e-06,8e-06,6e-06,1e-05,7e-06,1.9e-05,1.1e-05,1.3e-05,5e-06,5e-06,7e-06,1e-05,5e-06,9e-06,1.7e-05,1.1e-05,8e-06,5e-06,8e-06,8e-06,1.2e-05,5e-06,1.5e-05,1.1e-05,1.2e-05,1.2e-05,1e-06,4e-06,5e-06,5e-06,2e-05,6e-06,1.6e-05,6e-06,5e-06,9e-06,1.5e-05,1.3e-05,1.4e-05,1.4e-05,1.5e-05,1.5e-05,1.3e-05
2e-06,3e-06,7e-06,7e-06,2e-06,3e-06,3e-06,3e-06,3e-06,2e-06,3e-06,2e-06,4e-06,4e-06,4e-06,8e-06,4e-06,9e-06,8e-06,9e-06,5e-06,5e-06,5e-06,7e-06,1.2e-05,6e-06,2e-06,1.9e-05,2.8e-05,1.2e-05,1.6e-05,1.4e-05,1.2e-05,8e-06,1.3e-05,8e-06,7e-06,1.4e-05,1e-05,6e-06,1.7e-05,1.2e-05,3e-06,4e-06,9e-06,7e-06,6e-06,4e-06,2e-06,5e-06,1e-05,1.4e-05,7e-06,6e-06,9e-06,1e-05,1e-05,1.7e-05,1e-05,1.4e-05,1.3e-05,1e-05,7e-06,1e-05,1.1e-05,4e-06,1e-05,1.1e-05,7e-06,1.6e-05,6e-06,6e-06,1e-05,9e-06,9e-06,1.1e-05,1.2e-05,1.4e-05,1.5e-05,3e-06,9e-06,1.6e-05,1.5e-05,2.5e-05,6e-06,4e-06,8e-06,4e-06,1.1e-05,1.3e-05,1.4e-05,1e-05,8e-06,7e-06,8e-06,1e-05,2e-06,4e-06,1.7e-05,1.9e-05,1.4e-05,1.2e-05,9e-06,8e-06,1.2e-05,6e-06,8e-06,9e-06,1.5e-05,2.5e-05,1.8e-05,1.5e-05,7e-06,6e-06,7e-06,2.2e-05,4e-06,1e-05,1.9e-05,1.6e-05,1e-05
1e-05,3e-06,5e-06,5e-06,5e-06,9e-06,7e-06,6e-06,5e-06,1e-06,4e-06,2e-06,3e-06,6e-06,5e-06,1.4e-05,1.4e-05,1.4e-05,1.5e-05,5e-06,3e-06,3e-06,7e-06,4e-06,5e-06,6e-06,1e-06,1e-05,1.9e-05,2e-05,1.8e-05,5e-06,6e-06,2e-06,1.5e-05,1.2e-05,1.1e-05,1e-05,7e-06,7e-06,1.5e-05,1e-05,5e-06,1e-05,4e-06,8e-06,6e-06,3e-06,5e-06,3e-06,5e-06,9e-06,1.6e-05,1.4e-05,8e-06,1e-05,1.7e-05,1.6e-05,1.5e-05,1.6e-05,1.8e-05,2e-05,9e-06,9e-06,8e-06,2e-06,1e-05,2e-06,4e-06,1.1e-05,8e-06,3e-06,7e-06,2e-05,2e-05,1.2e-05,1e-05,1.2e-05,6e-06,5e-06,7e-06,9e-06,1.7e-05,7e-06,6e-06,9e-06,6e-06,1e-05,6e-06,1e-06,1.2e-05,1.5e-05,1.2e-05,3e-06,4e-06,1e-05,8e-06,9e-06,2.6e-05,1.7e-05,8e-06,1.2e-05,5e-06,1.1e-05,1.7e-05,1.3e-05,1.5e-05,5e-06,1e-05,1.1e-05,7e-06,1.1e-05,1.1e-05,8e-06,1.2e-05,1.5e-05,2e-05,6e-06,9e-06,7e-06,3e-06
1.7e-05,1.3e-05,5e-06,3e-06,1e-06,9e-06,4e-06,0,1e-05,9e-06,0,2e-06,1e-06,3e-06,5e-06,1e-05,8e-06,7e-06,1.3e-05,1.4e-05,9e-06,9e-06,9e-06,5e-06,3e-06,5e-06,8e-06,1.6e-05,1.4e-05,7e-06,4e-06,3e-06,7e-06,7e-06,1.1e-05,9e-06,4e-06,4e-06,2e-06,1e-05,7e-06,1e-06,6e-06,1.1e-05,2e-06,6e-06,8e-06,9e-06,7e-06,8e-06,4e-06,7e-06,1.5e-05,8e-06,4e-06,8e-06,1e-05,3e-06,1e-06,4e-06,1e-05,1e-05,6e-06,4e-06,1.5e-05,1.2e-05,1e-06,5e-06,1.1e-05,3e-06,1e-06,5e-06,7e-06,2e-05,7e-06,8e-06,1e-06,6e-06,7e-06,4e-06,4e-06,1e-05,3e-06,1.1e-05,5e-06,4e-06,1.1e-05,7e-06,2e-06,3e-06,6e-06,6e-06,9e-06,8e-06,5e-06,5e-06,1e-06,6e-06,1.5e-05,7e-06,4e-06,4e-06,5e-06,2e-06,8e-06,1.6e-05,0,3e-06,5e-06,1.5e-05,1e-05,4e-06,8e-06,7e-06,9e-06,2e-06,9e-06,9e-06,1.4e-05,1.3e-05,5e-06
1.3e-05,5e-06,1e-06,1e-06,4e-06,3e-06,1e-06,1e-06,6e-06,2e-06,4e-06,1e-06,1e-06,4e-06,7e-06,1.2e-05,7e-06,9e-06,4e-06,4e-06,2e-06,4e-06,3e-06,8e-06,8e-06,1e-06,4e-06,1e-05,1.1e-05,2e-06,6e-06,3e-06,6e-06,5e-06,6e-06,4e-06,4e-06,5e-06,4e-06,1e-05,8e-06,6e-06,7e-06,1.1e-05,1.2e-05,3e-06,1e-06,5e-06,2e-06,5e-06,2e-06,4e-06,1e-05,8e-06,6e-06,5e-06,9e-06,7e-06,4e-06,4e-06,9e-06,3e-06,2e-06,2e-06,1.2e-05,2e-06,3e-06,4e-06,7e-06,2e-06,4e-06,5e-06,3e-06,9e-06,6e-06,1.2e-05,9e-06,4e-06,3e-06,1e-06,4e-06,4e-06,8e-06,3e-06,9e-06,4e-06,6e-06,8e-06,2e-06,3e-06,6e-06,5e-06,5e-06,4e-06,5e-06,3e-06,8e-06,3e-06,1.2e-05,1.5e-05,1.5e-05,1.6e-05,2e-06,3e-06,5e-06,9e-06,8e-06,7e-06,9e-06,1.7e-05,9e-06,6e-06,5e-06,4e-06,1.5e-05,7e-06,9e-06,8e-06,6e-06,1e-05,3e-06
6e-06,4e-06,4e-06,3e-06,3e-06,3e-06,0,2e-06,2e-06,6e-06,3e-06,4e-06,2e-06,4e-06,6e-06,4e-06,2e-06,8e-06,6e-06,5e-06,5e-06,3e-06,1e-06,8e-06,2e-06,2e-06,5e-06,1e-05,9e-06,4e-06,4e-06,5e-06,2e-06,2e-06,3e-06,2e-06,2e-06,2e-06,1e-06,3e-06,3e-06,1e-06,5e-06,2e-06,6e-06,5e-06,3e-06,3e-06,3e-06,5e-06,5e-06,5e-06,6e-06,4e-06,4e-06,4e-06,8e-06,7e-06,4e-06,3e-06,4e-06,2e-06,3e-06,5e-06,5e-06,5e-06,1e-06,4e-06,5e-06,3e-06,4e-06,3e-06,1e-05,8e-06,3e-06,9e-06,5e-06,7e-06,4e-06,3e-06,8e-06,7e-06,3e-06,9e-06,6e-06,3e-06,5e-06,7e-06,3e-06,4e-06,4e-06,4e-06,6e-06,3e-06,4e-06,4e-06,9e-06,1e-05,6e-06,1.1e-05,4e-06,1.2e-05,8e-06,4e-06,5e-06,9e-06,4e-06,5e-06,3e-06,5e-06,4e-06,4e-06,9e-06,1e-05,7e-06,1.2e-05,1.1e-05,3e-06,3e-06,7e-06,6e-06
3e-06,1e-06,5e-06,2e-06,2e-06,6e-06,5e-06,5e-06,4e-06,4e-06,1e-06,1e-06,3e-06,0,5e-06,2e-06,2e-06,3e-06,2e-06,8e-06,1e-06,4e-06,2e-06,4e-06,2e-06,2e-06,5e-06,1.1e-05,2e-06,1e-05,8e-06,5e-06,1e-06,2e-06,5e-06,1e-06,2e-06,5e-06,3e-06,3e-06,2e-06,3e-06,4e-06,5e-06,5e-06,3e-06,2e-06,1e-06,1e-06,5e-06,5e-06,3e-06,2e-06,5e-06,3e-06,3e-06,8e-06,7e-06,6e-06,1e-06,5e-06,3e-06,3e-06,5e-06,7e-06,6e-06,5e-06,6e-06,4e-06,5e-06,5e-06,3e-06,7e-06,6e-06,5e-06,7e-06,6e-06,5e-06,4e-06,8e-06,3e-06,3e-06,7e-06,1.1e-05,8e-06,6e-06,2e-06,5e-06,1e-06,7e-06,7e-06,3e-06,7e-06,6e-06,1e-06,6e-06,5e-06,2e-06,7e-06,1.1e-05,1.1e-05,1.1e-05,7e-06,7e-06,7e-06,9e-06,1.5e-05,5e-06,2e-06,2e-06,7e-06,2e-06,5e-06,1e-05,8e-06,4e-06,2e-06,6e-06,7e-06,6e-06,3e-06
4e-06,3e-06,1e-06,5e-06,2e-06,4e-06,3e-06,6e-06,3e-06,2e-06,5e-06,4e-06,3e-06,1e-06,2e-06,1e-06,2e-06,4e-06,4e-06,5e-06,5e-06,9e-06,7e-06,4e-06,5e-06,5e-06,6e-06,1.7e-05,1.7e-05,1.1e-05,5e-06,1e-06,1e-06,2e-06,2e-06,4e-06,4e-06,5e-06,4e-06,2e-06,1e-06,2e-06,6e-06,6e-06,9e-06,1e-05,1.1e-05,9e-06,2e-06,3e-06,4e-06,4e-06,7e-06,9e-06,5e-06,4e-06,1e-05,8e-06,4e-06,4e-06,1e-06,7e-06,4e-06,1e-06,5e-06,7e-06,7e-06,1.1e-05,1e-05,8e-06,5e-06,5e-06,8e-06,1.5e-05,9e-06,3e-06,6e-06,5e-06,6e-06,1.5e-05,1.1e-05,5e-06,1.1e-05,1.5e-05,5e-06,2e-06,6e-06,6e-06,7e-06,7e-06,2e-06,8e-06,7e-06,1e-05,4e-06,9e-06,9e-06,6e-06,7e-06,1.1e-05,9e-06,1.1e-05,6e-06,7e-06,7e-06,2e-06,1e-05,5e-06,2e-06,5e-06,7e-06,6e-06,4e-06,7e-06,7e-06,1e-06,9e-06,8e-06,8e-06,1e-06,6e-06
3e-06,2e-06,1e-06,3e-06,3e-06,1e-06,4e-06,4e-06,2e-06,2e-06,4e-06,1e-06,1e-06,2e-06,2e-06,3e-06,1e-06,2e-06,4e-06,5e-06,3e-06,4e-06,3e-06,4e-06,2e-06,5e-06,2e-06,1.4e-05,2.3e-05,7e-06,7e-06,4e-06,1e-06,3e-06,6e-06,8e-06,1e-06,4e-06,7e-06,3e-06,1e-06,2e-06,4e-06,3e-06,2e-06,4e-06,6e-06,2e-06,3e-06,3e-06,5e-06,4e-06,6e-06,9e-06,2e-06,2e-06,1e-06,3e-06,2e-06,2e-06,4e-06,7e-06,6e-06,4e-06,2e-06,6e-06,4e-06,5e-06,2e-06,3e-06,4e-06,2e-06,8e-06,4e-06,2e-06,3e-06,0,1e-06,3e-06,9e-06,4e-06,6e-06,4e-06,1e-05,8e-06,3e-06,4e-06,5e-06,3e-06,2e-06,4e-06,6e-06,9e-06,6e-06,5e-06,7e-06,6e-06,2e-06,1e-06,4e-06,1e-06,1e-06,3e-06,5e-06,5e-06,3e-06,5e-06,6e-06,6e-06,1.1e-05,1e-06,1e-06,5e-06,5e-06,4e-06,6e-06,1.4e-05,4e-06,8e-06,1.1e-05,4e-06
0,2e-06,0,1e-06,3e-06,2e-06,3e-06,2e-06,2e-06,1e-06,4e-06,3e-06,3e-06,1e-06,1e-06,1e-06,1e-06,2e-06,0,2e-06,0,2e-06,2e-06,2e-06,3e-06,1e-06,1e-06,1.6e-05,1e-05,1e-05,4e-06,3e-06,1e-06,3e-06,3e-06,2e-06,1e-06,2e-06,1e-06,4e-06,2e-06,1e-06,0,3e-06,3e-06,1e-06,2e-06,0,2e-06,1e-06,2e-06,2e-06,4e-06,6e-06,2e-06,0,3e-06,0,2e-06,1e-06,4e-06,2e-06,2e-06,1e-06,4e-06,2e-06,2e-06,3e-06,4e-06,1e-06,3e-06,2e-06,3e-06,3e-06,1e-06,2e-06,4e-06,2e-06,3e-06,4e-06,5e-06,3e-06,3e-06,7e-06,5e-06,2e-06,3e-06,8e-06,5e-06,3e-06,4e-06,2e-06,4e-06,2e-06,1e-06,2e-06,3e-06,3e-06,3e-06,0,1e-06,2e-06,4e-06,5e-06,5e-06,3e-06,2e-06,3e-06,4e-06,7e-06,4e-06,3e-06,4e-06,4e-06,3e-06,2e-06,1e-05,7e-06,4e-06,5e-06,1e-06
1e-06,3e-06,1e-06,3e-06,2e-06,1e-06,2e-06,2e-06,2e-06,1e-06,2e-06,2e-06,2e-06,1e-06,1e-06,1e-06,1e-06,1e-06,3e-06,1e-06,0,1e-06,1e-06,1e-06,2e-06,1e-06,1e-06,1.6e-05,1.3e-05,2e-06,2e-06,3e-06,3e-06,1e-06,1e-06,3e-06,1e-06,0,2e-06,5e-06,2e-06,2e-06,2e-06,4e-06,3e-06,4e-06,2e-06,2e-06,2e-06,1e-06,2e-06,3e-06,4e-06,5e-06,3e-06,0,4e-06,1e-06,4e-06,1e-06,0,2e-06,3e-06,0,4e-06,0,2e-06,3e-06,2e-06,1e-06,2e-06,2e-06,2e-06,3e-06,3e-06,3e-06,3e-06,1e-06,3e-06,6e-06,2e-06,5e-06,2e-06,8e-06,1e-06,3e-06,2e-06,7e-06,4e-06,2e-06,1e-06,2e-06,4e-06,2e-06,1e-06,3e-06,4e-06,3e-06,2e-06,2e-06,2e-06,2e-06,5e-06,4e-06,3e-06,2e-06,2e-06,3e-06,3e-06,4e-06,1e-06,2e-06,3e-06,2e-06,3e-06,4e-06,6e-06,3e-06,3e-06,5e-06,3e-06
2e-06,2e-06,1e-06,2e-06,3e-06,0,2e-06,2e-06,2e-06,1e-06,2e-06,1e-06,3e-06,1e-06,0,1e-06,1e-06,2e-06,2e-06,0,0,2e-06,0,2e-06,2e-06,2e-06,2e-06,1.5e-05,2.3e-05,1.5e-05,9e-06,4e-06,1e-06,1e-06,3e-06,3e-06,2e-06,2e-06,4e-06,6e-06,4e-06,1e-06,3e-06,5e-06,2e-06,2e-06,5e-06,5e-06,4e-06,3e-06,2e-06,4e-06,4e-06,6e-06,3e-06,2e-06,3e-06,0,3e-06,3e-06,4e-06,3e-06,3e-06,1e-06,4e-06,2e-06,3e-06,1e-06,0,2e-06,1e-06,1e-06,2e-06,3e-06,3e-06,2e-06,4e-06,1e-06,3e-06,3e-06,7e-06,6e-06,3e-06,5e-06,2e-06,2e-06,2e-06,2e-06,2e-06,1e-06,1e-06,2e-06,2e-06,4e-06,1e-06,4e-06,2e-06,3e-06,1e-06,1e-06,2e-06,3e-06,3e-06,5e-06,4e-06,1e-06,2e-06,5e-06,3e-06,4e-06,4e-06,1e-06,1e-06,2e-06,3e-06,2e-06,4e-06,4e-06,3e-06,5e-06,2e-06
2e-06,3e-06,1e-06,1e-06,3e-06,1e-06,2e-06,2e-06,0,0,1e-06,1e-06,0,1e-06,1e-06,2e-06,1e-06,2e-06,0,2e-06,2e-06,1e-06,2e-06,3e-06,1e-06,2e-06,2e-06,1.7e-05,1.5e-05,5e-06,2e-06,3e-06,1e-06,2e-06,2e-06,2e-06,0,1e-06,3e-06,4e-06,2e-06,3e-06,2e-06,2e-06,2e-06,2e-06,5e-06,3e-06,2e-06,1e-06,1e-06,2e-06,2e-06,6e-06,4e-06,2e-06,1e-06,3e-06,1e-06,1e-06,3e-06,2e-06,2e-06,2e-06,7e-06,4e-06,3e-06,3e-06,2e-06,1e-06,1e-06,1e-06,2e-06,2e-06,3e-06,6e-06,2e-06,3e-06,3e-06,2e-06,3e-06,2e-06,0,6e-06,3e-06,1e-06,1e-06,5e-06,3e-06,1e-06,1e-06,2e-06,2e-06,3e-06,1e-06,3e-06,5e-06,2e-06,3e-06,1e-06,2e-06,3e-06,3e-06,5e-06,3e-06,4e-06,1e-06,3e-06,4e-06,5e-06,4e-06,2e-06,3e-06,3e-06,2e-06,5e-06,4e-06,1e-06,2e-06,6e-06,1e-06
2e-06,1e-06,1e-06,1e-06,3e-06,1e-06,2e-06,2e-06,1e-06,0,1e-06,1e-06,1e-06,1e-06,0,2e-06,1e-06,1e-06,0,1e-06,1e-06,1e-06,2e-06,2e-06,1e-06,1e-06,2e-06,1.7e-05,7e-06,3e-06,1e-06,2e-06,2e-06,2e-06,1e-06,2e-06,0,0,3e-06,4e-06,1e-06,1e-06,0,1e-06,0,1e-06,3e-06,2e-06,1e-06,0,1e-06,1e-06,2e-06,5e-06,4e-06,1e-06,4e-06,2e-06,2e-06,0,3e-06,0,1e-06,1e-06,5e-06,1e-06,3e-06,1e-06,3e-06,1e-06,0,1e-06,3e-06,1e-06,1e-06,3e-06,3e-06,1e-06,1e-06,2e-06,1e-06,4e-06,1e-06,6e-06,3e-06,1e-06,1e-06,5e-06,3e-06,0,1e-06,2e-06,2e-06,2e-06,1e-06,2e-06,3e-06,3e-06,3e-06,1e-06,2e-06,3e-06,4e-06,2e-06,1e-06,2e-06,1e-06,3e-06,3e-06,5e-06,3e-06,1e-06,0,3e-06,1e-06,2e-06,5e-06,2e-06,2e-06,4e-06,2e-06
2e-06,1e-06,0,1e-06,3e-06,1e-06,2e-06,2e-06,1e-06,1e-06,2e-06,1e-06,2e-06,1e-06,0,1e-06,1e-06,0,1e-06,0,1e-06,0,1e-06,1e-06,1e-06,0,1e-06,1.7e-05,9e-06,2e-06,0,1e-06,1e-06,2e-06,1e-06,1e-06,0,1e-06,3e-06,3e-06,0,1e-06,1e-06,1e-06,0,1e-06,3e-06,2e-06,1e-06,1e-06,1e-06,1e-06,3e-06,5e-06,2e-06,1e-06,3e-06,1e-06,2e-06,1e-06,2e-06,1e-06,1e-06,1e-06,4e-06,2e-06,3e-06,1e-06,0,0,0,1e-06,2e-06,2e-06,1e-06,3e-06,3e-06,0,1e-06,1e-06,0,3e-06,0,6e-06,2e-06,1e-06,1e-06,5e-06,2e-06,1e-06,1e-06,1e-06,1e-06,1e-06,1e-06,2e-06,2e-06,1e-06,2e-06,1e-06,1e-06,2e-06,5e-06,2e-06,1e-06,2e-06,2e-06,3e-06,3e-06,4e-06,2e-06,0,0,3e-06,0,2e-06,5e-06,1e-06,2e-06,4e-06,1e-06
2e-06,1e-06,0,1e-06,3e-06,1e-06,2e-06,2e-06,1e-06,1e-06,1e-06,1e-06,1e-06,1e-06,0,1e-06,1e-06,0,1e-06,0,1e-06,1e-06,2e-06,2e-06,0,0,1e-06,1.7e-05,9e-06,2e-06,2e-06,1e-06,1e-06,2e-06,1e-06,1e-06,1e-06,1e-06,3e-06,4e-06,1e-06,1e-06,0,2e-06,1e-06,1e-06,3e-06,2e-06,1e-06,0,1e-06,1e-06,3e-06,5e-06,2e-06,1e-06,4e-06,2e-06,2e-06,1e-06,1e-06,1e-06,1e-06,1e-06,4e-06,2e-06,3e-06,1e-06,1e-06,0,0,1e-06,2e-06,2e-06,1e-06,2e-06,3e-06,0,1e-06,0,2e-06,3e-06,0,6e-06,3e-06,2e-06,2e-06,5e-06,1e-06,0,0,1e-06,1e-06,2e-06,1e-06,2e-06,2e-06,2e-06,2e-06,0,1e-06,2e-06,3e-06,3e-06,1e-06,3e-06,2e-06,3e-06,2e-06,5e-06,2e-06,1e-06,0,2e-06,0,2e-06,5e-06,1e-06,1e-06,4e-06,1e-06
