1e-06,1e-06,1e-06,0,-0.002577,-0.018699,-0.009453,-0.001504,-0.001557,-0.018484,-0.126324,-0.189181,-0.175571,-0.196456,-0.207089,-0.204341,-0.142853,-0.084034,-0.03009,-0.007247,-0.004894,-0.001625,-0.001047,-0.001273,-0.001315,-6.8e-05,-0.000255,-0.000373
-2e-06,-2e-06,-1e-06,-2e-06,0.000799,0.005955,0.002327,-2.1e-05,-0.000995,-0.014037,-0.079246,-0.105385,-0.018353,-0.000398,-0.014648,-0.046489,-0.022769,-0.012625,-0.006416,-0.001437,0.001007,1.5e-05,0.000517,-0.001925,-0.003122,-0.000435,-0.000245,-0.000355
-2e-06,-3e-06,-2e-06,-2e-06,0.000641,0.003204,0.000726,-0.000244,-0.000535,-0.018387,-0.073304,-0.067802,-0.029513,-0.024307,-0.048142,-0.061444,-0.02919,-0.024465,-0.013512,-0.00422,-0.00206,-0.000766,-0.000317,-0.001687,-0.001988,-0.000423,-9.8e-05,-7.1e-05
0,-2e-06,-3e-06,0,-0.001575,-0.011278,-0.00508,-0.000451,-0.00042,-0.014163,-0.039168,-0.041984,-0.105586,-0.097655,-0.098298,-0.087127,-0.064574,-0.041164,-0.01751,-0.005583,-0.005445,-0.001504,-0.001355,-0.000537,0.000291,-0.000185,0.000135,0.000203
2e-06,-1e-06,-2e-06,0,0.001007,0.008986,0.005435,0.001318,0.001769,0.018764,0.132808,0.190495,0.135586,0.159503,0.198398,0.19609,0.128759,0.090882,0.036064,0.009064,0.004791,0.001678,0.000795,0.002046,0.002531,0.000243,0.000266,0.000323
2e-06,-1e-06,-2e-06,-1e-06,0.001708,0.011758,0.005723,0.000798,0.001198,0.021389,0.106329,0.178978,0.182283,0.159054,0.181569,0.196597,0.133785,0.077761,0.030614,0.008027,0.004777,0.001537,0.001018,0.001733,0.001504,5.6e-05,0.000102,8e-05
-1e-06,-3e-06,-3e-06,-3e-06,-0.00161,-0.011991,-0.005999,-0.001216,-0.001344,-0.005672,-0.101403,-0.157801,-0.123128,-0.161025,-0.180069,-0.148757,-0.108323,-0.075273,-0.025446,-0.006487,-0.004881,-0.001411,-0.00091,-0.000979,-0.001347,-0.000437,-0.000237,-0.000292
-2e-06,-2e-06,-2e-06,-2e-06,-0.000949,-0.005735,-0.002816,-0.00052,-0.001461,-0.00772,-0.097316,-0.198695,-0.133799,-0.121505,-0.142087,-0.15323,-0.112152,-0.058809,-0.018909,-0.003816,-0.001551,-0.000591,-6.7e-05,-0.001694,-0.002443,-0.000359,-0.00019,-2e-04
-2e-06,0,1e-06,1e-06,0.001026,0.006688,0.00248,0.000207,-0.000234,-0.002059,0.009998,0.017461,0.070609,0.081107,0.05964,0.026687,0.027388,0.018147,0.002861,0.000109,0.001711,0.000497,0.000639,-0.000761,-0.000902,5.2e-05,-3e-06,2.1e-05
0,2e-06,3e-06,3e-06,0.000302,-8.2e-05,-0.000578,5.8e-05,0.000579,-0.005397,0.010352,0.045938,-0.002466,-0.013952,-0.030249,-0.017845,-0.000165,-0.013282,-0.010956,-0.003798,-0.002624,-0.000757,-0.000844,-0.000227,0.000955,0.000308,0.000162,0.000182
2e-06,4e-06,4e-06,2e-06,-0.000591,-0.002938,-0.000349,0.000468,0.000944,0.000963,0.031759,0.046894,-0.035804,-0.015613,0.013452,0.028854,0.019483,0.024193,0.010567,0.003187,0.001,0.000163,-0.000443,0.000482,0.001352,0.000279,0.000159,0.000141
3e-06,4e-06,3e-06,1e-06,0.00054,0.005426,0.00307,0.000375,0.000484,0.008214,0.072707,0.137775,0.126738,0.123543,0.161335,0.150353,0.103016,0.07792,0.032742,0.008445,0.004979,0.001356,0.000916,0.000833,0.000483,2.6e-05,1.8e-05,3.7e-05
2e-06,3e-06,2e-06,0,7.7e-05,0.000252,-0.00024,-0.000636,-0.000679,-0.001532,-0.015998,0.016038,0.041742,-0.00064,-0.017844,-0.001555,0.002044,-0.020192,-0.005988,-0.000833,-0.000621,-0.000391,-5.1e-05,-0.000182,-0.000853,-0.00032,-0.000168,-0.000177
0,0,0,-1e-06,-0.000638,-0.005055,-0.002539,-0.000357,-0.00093,-0.007021,-0.085431,-0.177837,-0.146471,-0.12936,-0.157834,-0.14374,-0.112922,-0.080522,-0.027838,-0.006167,-0.003375,-0.000949,-0.000425,-0.000803,-0.001414,-0.000371,-0.000119,-0.000138
-2e-06,-2e-06,-2e-06,-1e-06,-5.6e-05,-0.000273,-0.000254,0.000327,-0.000447,-0.002162,-0.013697,-0.068105,-0.032853,0.007407,0.004821,-0.029747,-0.035604,-0.003751,-0.002075,-0.000951,0.000638,0.000529,0.000783,0.000113,-0.000358,-7.5e-05,2.7e-05,2e-05
-2e-06,-3e-06,-2e-06,-1e-06,0.000544,0.002799,0.000759,0.000167,0.000623,0.000585,0.046904,0.108773,0.087984,0.061827,0.056214,0.041609,0.042942,0.021645,0.000958,-0.002159,-0.001139,0.000169,9.3e-05,0.000579,0.001,0.000208,0.000102,1e-04
-2e-06,-3e-06,-3e-06,-2e-06,-0.000124,-0.00103,-0.000195,4.6e-05,0.000856,0.00183,0.028122,0.055356,-0.027922,-0.033348,-0.02222,0.009052,0.021941,0.005329,-0.000414,-0.00026,-0.000655,-0.000177,-0.000801,0.000168,0.000743,0.000135,5.8e-05,6.6e-05
0,-2e-06,-3e-06,-2e-06,-0.000228,-0.000254,0.000661,0.000113,0.000401,0.006489,0.028354,0.01197,-0.019643,0.014079,0.049999,0.054181,0.034266,0.044275,0.021526,0.006462,0.003688,0.000725,0.000261,0.000107,-0.000186,-1.9e-05,4.5e-05,8.8e-05
0,-1e-06,-2e-06,-2e-06,0.000259,0.002237,0.000858,-0.000327,-0.000733,0.006071,0.01911,0.036862,0.088032,0.068833,0.065108,0.042124,0.026245,0.015589,0.009274,0.002755,0.001028,-3.7e-05,0.000339,-0.000337,-0.001025,-0.000177,-0.000121,-8.6e-05
