0.000167,0.000205,0.000393,-0.000929,-0.000788,-6e-05,-0.000614,-0.000887,-0.000375,-0.000116,-0.000986,-0.000522,-2.7e-05,0.000103,0.000528,-0.000384,-0.000885,-0.001014,-5e-06,-0.000206,-8.7e-05,0.00049,-0.000218,0.000576,-5.5e-05,0.000547,4.7e-05,-8.6e-05,0.000251,0.000618,-9.9e-05,0.00034,0.001368,0.000347,0.000236,0.000353,0.000505,3.1e-05,1.3e-05,-0.000461,0.000354,0.000817,0.000568,-0.000176,-0.000576,-5e-06,-0.000269,-0.001173,-0.000687,-0.000113,3.9e-05,-0.00052,-0.000566,-0.000531,-0.000375,-0.000772,-0.000785,-0.000115,-0.000997,-0.000835,-0.00087,1.9e-05,0.000172,-2.4e-05,2e-05,-0.000663,-0.000446,0.000546,-0.000466,-0.000825,0.000299,-0.000244,-0.000782,-0.000503,0.000362,-0.000281,0.000734,-0.001024,-0.000403,-0.000204,-0.001731,-0.001061,-0.000192,0.000244,0.000632,-0.000891,-0.001501,-2.8e-05,-0.000365,0.000155,-2.5e-05,-0.00024,6.5e-05,-0.000496,-0.000318,4.9e-05,-0.000205,-0.000843,-0.000312,-6e-06,-0.000323,-0.001131,-0.000889,-0.000726,-0.000505,-0.000373,-0.001436,-0.000995,-0.000823,-0.000448,-0.000853,0.000156,0.000343,0.000921,0.000495,-2e-04,-0.000458,-7.2e-05,-6.6e-05,0.00048,0.000401
0.000489,-0.000397,-5e-04,4.3e-05,-1.9e-05,-0.000173,0.000546,0.000538,4e-04,-0.000233,5e-04,0.000526,0.000473,0.000254,-6.2e-05,-0.000175,-0.000789,-0.000848,-0.000308,-0.00021,-0.000812,-0.000197,0.000245,-0.000613,-0.000212,-0.000184,-0.000475,0.000365,0.000286,6.7e-05,0.000134,0.000335,1.9e-05,-2.7e-05,-0.000371,-0.000148,-0.000544,-0.000453,-0.000308,-4.5e-05,-0.000646,-0.000397,-0.001032,-0.000707,-0.000638,4e-06,-0.000379,-0.000503,-0.00066,-0.000167,-0.000291,0.000578,-0.000115,-0.000446,-0.000655,0.000217,-0.000211,-0.000764,4e-04,0.000265,-0.000382,0.000215,0.000331,-0.00169,-0.000915,0.000374,-0.000328,0.000158,0.000685,4.7e-05,-0.000774,-0.00052,-0.000375,-5.1e-05,-0.00045,1.2e-05,0.000292,0.000684,2.1e-05,-0.000494,0.000292,0.000272,0.001011,0.000428,-0.000314,-0.000387,0.000148,-0.000486,-0.00079,-0.001346,-0.000638,-0.000504,0.000271,0.00096,3e-05,-1.4e-05,-0.000695,0.000392,0.000656,0.000228,3e-05,0.00101,0.000877,0.000557,0.000839,-1.3e-05,0.000688,0.000501,0.000347,-0.000152,-7.3e-05,0.000376,0.000641,-0.001516,-0.00064,-0.00031,-0.000415,-0.000202,0.001167,0.000704,0.000285
-0.001036,-0.000252,-0.000486,-0.000419,-0.000325,-0.001316,-0.000295,-0.000471,-0.000526,-0.000307,-0.000568,0.00014,0.000318,-0.00037,0,-0.000487,6.8e-05,-6.8e-05,-0.000218,-0.000117,-0.000131,-0.000933,-0.000729,3e-04,-0.000607,-0.000764,7.5e-05,-0.00022,-0.000216,-7e-05,-0.000399,0.000111,-0.000658,-9e-05,-0.000356,-0.000608,-0.000263,0.000181,1.5e-05,5.5e-05,-0.000794,-0.000711,-0.001862,-0.000726,-7.5e-05,-0.000577,-0.000191,0.000293,-0.000236,1e-06,6.3e-05,-0.00033,-0.000163,-0.000781,-0.001159,-0.000944,-0.000381,-0.00027,-0.00048,0.000488,0.000778,-0.000408,-0.000118,0.000306,-0.000209,-0.000638,0.00039,-0.000203,-0.001231,-0.000586,-0.000944,-0.000364,-0.00034,-0.000577,-0.000441,-0.000428,4.9e-05,-0.000896,-0.001137,-0.000279,-4e-04,-0.00048,-0.000877,0.000397,-0.000556,-0.000324,-0.000243,-0.000483,-1e-06,-0.00037,-0.000627,-3e-06,-0.000759,-0.001794,-0.000893,-0.000504,-0.000301,-0.000809,-0.000563,-0.000432,-6.7e-05,-9.9e-05,-0.000874,-4.6e-05,-0.000472,-0.000329,-0.000572,-0.000294,-0.000724,-0.000704,-0.000658,-0.000295,-0.00121,-0.000815,0.000165,-0.001043,-0.000883,2.9e-05,-0.000424,-0.00075,-2e-04
-0.000173,-0.000191,-0.000409,-0.000226,0.000784,0.000295,1.6e-05,0.000306,-0.000527,-0.000613,-0.000275,-0.000634,-0.000764,-0.000808,-0.000779,-0.000266,6e-06,0.000666,0.000648,-0.000824,0.000147,-0.000276,0.000239,-0.000699,6.7e-05,-0.000204,-0.000569,-0.000858,-0.000797,-5e-06,0.000177,-0.001177,-0.000417,-0.000278,-0.000829,-8.6e-05,-0.000134,8.2e-05,-0.000113,-0.000204,-1.9e-05,0.000128,0.000386,0.000156,-0.000205,-0.000263,-0.000525,-0.000291,-0.000318,-0.000207,9.8e-05,0.000458,-0.000299,0.000243,0.000193,0.000571,0.000364,0.000104,9.7e-05,-0.000395,-3.1e-05,-0.000526,-0.000271,0.000519,0.000404,8.3e-05,0.000274,-0.000645,0.001193,0.00076,-1.9e-05,-0.000504,-9.8e-05,0.000408,0.000131,0.000184,0.000142,-0.000223,0.000341,0.00048,0.000392,-0.000286,-0.00048,-0.000238,0.000287,0.00083,0.000607,-0.00013,-0.000227,0.001151,0.000735,-0.000376,-0.000326,6e-06,0.000266,-7.2e-05,0.000315,4.4e-05,-0.000313,-0.000208,-3e-06,9.5e-05,-4.6e-05,-9e-06,-0.00057,-0.000569,-0.000301,-0.000284,0.000441,0.000583,0.000212,0.000153,-0.000161,0.000637,0.001043,0.000129,0.001088,0.001048,0.000566,-0.001091,-0.000283
-0.000817,-0.000194,0.00016,8.1e-05,-0.000665,-0.000351,0.000559,-0.00026,-4.2e-05,7.9e-05,4e-06,0.000396,-0.000207,-0.000117,-0.000129,0.000159,-0.000204,-0.000263,-0.000212,0.000363,0.000144,-0.000705,-0.000312,0.000551,0.000138,0.000334,-0.000328,-0.000366,-2.7e-05,0.000102,-0.000204,9.7e-05,-0.000607,-6e-05,-0.000127,-5.1e-05,-0.000242,-0.000175,8.8e-05,6.8e-05,0.000423,0.001033,0.000575,-0.000218,-0.000142,0.000123,0.000281,-0.000378,0.000583,0.000446,-0.000285,2.7e-05,0.000308,-7.4e-05,0.000283,-0.000322,-0.000169,-0.00015,0.000238,0.000532,-5.2e-05,-0.000207,0.000724,-4.4e-05,0.000812,-6e-06,-0.000532,0.000152,-0.000466,-0.000123,0.000527,6.7e-05,-0.000651,6.4e-05,0.000276,0.000675,-0.000444,-0.000386,-0.000836,-0.000516,-0.00045,0.000874,-0.000254,-0.000706,0.000328,-0.000525,-0.000515,-0.000191,0.000604,3.5e-05,-0.000283,0.000233,-0.000238,-0.000291,-0.000387,-0.000525,0.000294,-3.7e-05,-0.000222,-0.000406,-0.000511,-0.000208,-0.000411,0.000109,-0.000647,-0.000185,0.00041,0.00023,-0.000601,-0.00042,0.000201,-0.000213,-7e-04,-0.000882,-0.000472,-0.000318,-6.1e-05,0.000232,-0.000573,-0.000366,-0.00022
-0.000256,8e-05,-7.1e-05,0.000268,0.000174,0.000364,0.00011,-0.000421,0.000105,-0.000217,-0.000449,1.1e-05,1.5e-05,-7.8e-05,0.000212,0.00018,0.000235,-0.000425,-0.000542,0.000143,0.000138,8.4e-05,-8.4e-05,-0.000265,0.000189,-0.000149,-0.000211,-0.000671,-0.000361,0.000101,0.000359,-7.9e-05,-0.000491,-0.000993,-0.000238,-0.000645,-0.000226,-0.000176,-0.000167,-9.4e-05,-8.7e-05,-0.000415,0.000318,-0.000154,0.000357,0.000242,0.000619,2.2e-05,-0.000448,-0.000476,-0.000495,0.000328,-0.000241,-0.000676,0.00053,-3e-06,1.5e-05,-0.000206,-0.001013,-0.000877,-0.000416,3e-04,-0.000501,-0.00037,0.000399,0.000598,-0.000226,-7.3e-05,-0.000334,-0.000565,0.000319,6.1e-05,-0.000119,-0.000319,7e-06,0.000201,0.000282,-0.000459,-0.000148,-5.7e-05,0.000122,-0.000584,-5e-05,0.000103,0.000122,0.000109,0.000199,0.000307,-0.000997,-0.00011,-0.000243,2.9e-05,-0.000236,0.000289,0.000706,0.000271,-0.000129,0.000464,-0.000418,-0.000495,-4.6e-05,8e-04,0.000275,0.000404,0.000344,0.000224,0.000189,-0.000286,0.000198,0.000133,-0.000203,0.000593,0.000118,-0.000473,-0.000648,0.000496,0.00033,-0.000105,0.000147,-0.000192,-0.000205
-0.00019,-0.000225,-0.000448,-0.000588,0.000128,-0.000314,-0.000837,-0.000186,0.000184,0.000488,-9.4e-05,-0.000422,-0.000229,-6.5e-05,-0.000307,-0.000132,4.5e-05,0.000161,-0.000167,0.000334,-0.00041,0.000298,-3e-04,-0.000155,-0.000418,-0.000409,-0.00061,0.000167,-8.2e-05,-0.000294,-0.000484,-0.000125,-0.000353,-0.000502,-0.000103,-0.000343,0.000607,8.6e-05,0.000201,0.000148,0.00029,-0.000443,-0.000402,0.000317,4e-06,-0.00022,-0.000285,0.000186,0.000429,-0.000121,0.000117,-0.000712,-0.000335,-0.000136,-0.000744,-0.000207,-0.000495,-0.000138,0.000178,0.000532,0.000326,-0.000149,-0.000479,-0.000256,-0.00074,-0.001037,-0.000426,-0.000679,-0.00102,-0.000806,-0.000191,0.000435,0.000548,0.000215,-0.000187,-0.00072,-0.000536,-0.000158,0.000464,-0.000186,-0.000581,0.000125,0.000238,-0.000684,-0.000312,-0.000407,-0.00021,-0.000354,-0.000172,-0.000491,-0.000175,-0.000197,-8.5e-05,0.000396,-0.000354,-0.000111,-6e-06,-0.000364,0.000151,9.3e-05,-0.000768,-0.001031,-0.000568,-5.2e-05,-0.000311,-0.000194,-0.000456,4.4e-05,-0.00016,6.4e-05,0.000225,-0.000913,-0.000613,-0.000695,-0.000352,-0.000552,-0.000807,-0.000818,-0.000179,0.000242,-4.6e-05
0.000129,0.000138,-0.000208,0.000121,-0.000366,-0.000366,-3.3e-05,3e-05,-0.000182,-0.000114,0.000403,0,8.3e-05,-2e-05,-0.000356,-0.00015,0.000352,4.1e-05,0.000455,-1e-06,-3e-05,9.7e-05,0.000309,-6e-06,0.000165,-0.000426,-0.000217,-4e-06,0.000253,-0.00034,-0.000294,-5.7e-05,-8.9e-05,-0.000273,-0.000301,-0.00018,8e-06,-0.000502,-3.7e-05,-6e-06,-0.000131,7.4e-05,-7.6e-05,0.000583,-7.3e-05,-0.000338,0.000226,-0.000133,-7.5e-05,0.000161,0.000112,-3.8e-05,-5.1e-05,0.000165,0.000584,0.000334,0.000309,6.7e-05,-0.000454,-0.000541,-0.000503,-0.000404,-0.000244,-5.9e-05,-0.000116,0.000138,0.000191,-8.2e-05,4.7e-05,0.000484,-2.6e-05,-0.000366,-0.000106,0.000143,-2.1e-05,-4e-06,-0.000114,-0.000102,0.000228,-0.000265,-7.6e-05,-7.8e-05,-1e-04,0.000546,-0.000352,-4.9e-05,5.6e-05,0.000193,0.000224,0.000125,0.00038,-0.000204,-6e-06,0.000552,0.000539,0.000286,-0.000188,-0.000163,0.000246,-5.7e-05,0.000502,0.000332,0.000188,0.000112,0.000257,0.00024,0.000149,-0.000135,0.000228,8.1e-05,0.000279,0.000526,0.000341,0.000129,-0.000212,-5.1e-05,0.000234,0.000555,-0.00039,-0.000261,-0.000282
-9.6e-05,0.000252,0.000239,1.8e-05,6.6e-05,0.000523,-0.000199,-0.000161,0.000367,-0.000106,4e-05,-0.000116,0.000139,0.000146,-0.000368,-3.8e-05,-0.000267,0.000112,-0.000232,7.1e-05,-5.7e-05,-0.000447,-0.000196,0.000143,-6.1e-05,0.000172,0.000388,-9e-06,-5e-06,-2.5e-05,-0.000104,-0.000372,0.000215,0.000305,9.8e-05,0.000308,-0.000202,-8.2e-05,-0.000457,3.2e-05,4.1e-05,5.2e-05,-2e-06,-0.000211,0.000122,0.000196,-0.000125,0.000235,7.3e-05,0.000359,-4.6e-05,-4e-06,-0.000144,0.000262,-7.2e-05,2.5e-05,-8.7e-05,2.6e-05,0.000291,-7e-06,2.9e-05,0.000243,0.000119,-8e-06,0.000626,4.1e-05,0.000197,0.000348,0.000125,-0.000162,0.000373,-0.000188,-0.000258,-0.000263,0.000441,0.000232,4.6e-05,0.000294,0.000193,-0.000352,0.000526,0.000155,6.6e-05,-0.000178,4.6e-05,-0.000117,-6.6e-05,-6e-05,-8e-05,-2.4e-05,-3e-06,0.000212,0.000422,-0.000193,-0.000369,0.000158,0.000166,6.7e-05,-8.1e-05,0.000239,9e-06,-5.9e-05,-0.000123,-0.000518,-0.000125,3.5e-05,-0.000234,0.000176,0.000219,5.8e-05,1.2e-05,6.1e-05,0.000273,0.000511,0.000188,1.4e-05,-0.000236,-4.8e-05,-9.4e-05,-0.000118,-0.000226
4e-06,4.6e-05,-2.4e-05,-1.4e-05,0.000138,-0.000219,-2.6e-05,0.000256,7.6e-05,0.000108,0.000155,9.2e-05,-0.000243,6.8e-05,0.000311,-1.8e-05,-0.000331,-5.3e-05,-8e-06,-6.6e-05,0.000224,2.9e-05,-3e-05,-0.000248,-7e-05,0.000136,0.000223,0.000178,0.00021,-0.000167,8.4e-05,-0.000244,5.7e-05,0.000174,0.000437,0.000154,-7.3e-05,-9.1e-05,-4.6e-05,-0.000111,2.1e-05,5e-05,0.000304,-0.000297,9.3e-05,-0.00011,-4.2e-05,-0.000223,-9.3e-05,-0.000185,-2.2e-05,-0.000285,0.000262,8.8e-05,9.9e-05,9.6e-05,0.000147,-0.000217,0.000167,-5e-05,-0.000192,2.5e-05,6.4e-05,-9.8e-05,-0.000548,-4.7e-05,-0.000338,-0.000326,0.000296,-9.5e-05,-8.2e-05,6.9e-05,0.000469,3.8e-05,-0.000198,-0.00015,-0.000177,3.2e-05,0.000184,0.000365,-0.000173,-0.000333,-0.000272,0.000225,-0.000186,3.4e-05,0.000235,0.000106,0.000106,-0.000214,0.000201,-2.8e-05,-0.000253,-8e-05,-0.000153,9.6e-05,0.000141,0.000229,2.6e-05,2.8e-05,-1.5e-05,-0.000341,-8e-05,0.000352,-0.000212,-0.000225,8.3e-05,0.000119,-0.000256,-6.5e-05,-0.000133,-0.000288,1.9e-05,0.00012,-6.5e-05,0.000501,0.000127,-0.000352,9.4e-05,0.000259,9.1e-05
-0.000118,-0.000403,0.000124,1.9e-05,-0.000162,4.5e-05,9.7e-05,-0.000374,0.000116,-5e-05,-0.000236,2e-05,8.2e-05,-0.000108,-4e-06,8.5e-05,0.00016,4e-05,7.4e-05,0.000331,0.000188,0.000151,0.00012,-0.000289,2e-06,-2.3e-05,-6.7e-05,3.9e-05,-0.00024,8.7e-05,-7e-06,9.7e-05,-4.9e-05,0.000101,3.7e-05,0.000206,0.000279,0.000242,0.000159,-8.1e-05,-0.000141,4.7e-05,-0.000165,-0.000246,-0.000314,0.000127,-4.4e-05,-0.000192,1.9e-05,-0.000172,1.2e-05,2.7e-05,-0.00021,-0.000139,-0.000245,-0.000381,-0.000128,6.5e-05,-0.000153,0.000118,6.1e-05,-2.7e-05,0.000368,-9.2e-05,-7.1e-05,4e-06,-9.2e-05,0.000148,0.000107,1.3e-05,7.7e-05,-3.9e-05,-0.000136,-0.000156,9.9e-05,2.9e-05,0.000142,-0.000237,-4.7e-05,-0.000135,-0.000164,6.8e-05,0.000239,-0.000106,-0.000287,-6.8e-05,-0.000213,-0.000217,0.000174,9.1e-05,0.000107,-0.000214,-4.9e-05,9.9e-05,-3.1e-05,-0.000326,-2.6e-05,-0.000151,-0.000125,0.00013,0.000142,-0.000322,-5.3e-05,-0.000433,-4.3e-05,9.8e-05,-7.5e-05,-0.000208,0.000263,1e-06,-9.3e-05,-3.7e-05,-0.000357,-8e-06,0.000124,-0.000228,0.000163,-7.1e-05,0.000143,-1.1e-05,0.000227
0.000312,1.5e-05,0.000144,-1.4e-05,1.9e-05,-1.5e-05,5.1e-05,0.000107,-0.000294,-0.000103,-1e-05,0.000139,0.00012,5.4e-05,9.9e-05,-7.3e-05,7e-06,2.5e-05,3e-05,-0.000337,-7.6e-05,9.7e-05,6.9e-05,-0.000182,-6.9e-05,4.2e-05,-3e-06,6.4e-05,1e-04,0.000109,-1.7e-05,9.7e-05,6e-06,0.000145,-0.00011,-3.9e-05,-2.7e-05,7e-05,9e-06,3.9e-05,2.8e-05,9.1e-05,-0.000175,5.4e-05,-0.000118,-1.2e-05,7.6e-05,0.000113,-4.7e-05,0.000164,6.4e-05,9.9e-05,7.2e-05,3.9e-05,-1.5e-05,0.000138,0.000235,-2.2e-05,-0.000115,3.9e-05,-4e-05,-8.6e-05,-2.4e-05,7e-05,1.2e-05,-3e-05,9.8e-05,0.00014,-0.000134,5.2e-05,-0.000465,8e-06,-0.000187,-2e-06,1.5e-05,7e-06,6.9e-05,5.5e-05,4.2e-05,0.00037,9.7e-05,-0.000155,1.1e-05,9e-05,0.000241,7.7e-05,-2.4e-05,9e-05,-0.000209,-2.2e-05,-5.4e-05,0,-6e-06,-0.000146,-8.2e-05,6.9e-05,0.000123,-6e-06,-1.3e-05,-9.4e-05,-8.3e-05,8.5e-05,4.6e-05,0.000134,0.000208,-6.1e-05,0.000118,-2.3e-05,-0.000194,-2.7e-05,3.1e-05,5.4e-05,0.000155,0.000116,0.00013,-0.00014,-0.000168,-3.8e-05,-0.000304,5.1e-05,1.9e-05
-9.8e-05,7.2e-05,3.5e-05,1e-06,-0.000193,3.3e-05,3.7e-05,0.00021,0.000139,1.3e-05,1.5e-05,3.7e-05,3.5e-05,-2.7e-05,0.000152,4.8e-05,7.5e-05,-0.00012,2e-05,-7.1e-05,1.1e-05,-0.000114,-0.000133,0.000206,5.6e-05,1.4e-05,-9.9e-05,8.3e-05,4.7e-05,5.8e-05,6.4e-05,4e-06,-7.8e-05,-0.000151,0.000169,-4.6e-05,-0.000141,4.1e-05,-2.2e-05,-7.8e-05,7.8e-05,-7.7e-05,0.000181,0.000139,0.000146,6.6e-05,-0.00015,2.5e-05,7.5e-05,-0.000162,7.4e-05,0.000152,7.5e-05,9e-06,5.5e-05,-8.3e-05,-3.4e-05,6.5e-05,0.000147,-0.000182,9.4e-05,0.000251,-0.000132,0.00012,-5e-06,0,9.1e-05,0.000111,0.000171,-4.7e-05,0.000113,-0.000108,7e-05,0.000143,-1.5e-05,2.5e-05,-3.9e-05,7.5e-05,-6.8e-05,-1e-06,0.000113,0.00014,-7.5e-05,-8.8e-05,-6.5e-05,0.000145,2e-06,5.1e-05,0,5.9e-05,-3.8e-05,0.000144,0.000105,-0.000117,1.8e-05,6.8e-05,-1.2e-05,-2e-05,0.000127,2.6e-05,1e-04,0.000106,2.9e-05,-0.000104,-6.4e-05,4.3e-05,1e-06,0.000114,0.000139,2.3e-05,-5.5e-05,1.4e-05,-9.3e-05,-7.1e-05,6.1e-05,0.000127,4.8e-05,5e-05,5.4e-05,4e-06,-1e-06
0.000119,0.000116,-9e-06,-1.2e-05,5.8e-05,-0.000163,7e-06,1.4e-05,-9.6e-05,-5e-05,3.4e-05,0.000101,1.1e-05,3e-06,3.8e-05,-8.2e-05,9.4e-05,1e-05,-1.3e-05,0.000117,1.5e-05,-0.000115,-7e-06,7.1e-05,-1.2e-05,-5.9e-05,0.000192,-6.9e-05,-1.7e-05,0.000138,-1.8e-05,4.4e-05,0.000132,6.4e-05,-3.6e-05,3.8e-05,-9.8e-05,-1.9e-05,-4.7e-05,-6e-06,-4.2e-05,-2.2e-05,-0.000113,-3.4e-05,0.000126,-5e-06,-9e-06,0.000232,-5e-06,9e-06,-0.000147,-3.2e-05,3e-06,8e-05,-0.000221,1e-04,-0.000116,9e-06,-0.000114,8.3e-05,4.8e-05,-3.3e-05,6.8e-05,3.8e-05,-6.2e-05,1.3e-05,4.1e-05,-5.8e-05,-0.000174,0.000145,-3.8e-05,7.2e-05,6e-06,8.7e-05,-0.000129,-4.1e-05,-5.9e-05,7.4e-05,-0.000135,1.9e-05,1.2e-05,6.8e-05,-3e-06,-3.2e-05,0.000304,-9.8e-05,-3e-06,-0.000131,-2.2e-05,8.8e-05,1.7e-05,-5.2e-05,5.3e-05,-1e-04,-1.9e-05,0.000149,-6.8e-05,-5.1e-05,6.8e-05,-8.7e-05,-0.000113,0.000199,1.8e-05,-1e-05,8.7e-05,-3e-06,7.6e-05,-2.3e-05,-6.2e-05,-5.8e-05,8.5e-05,-9.4e-05,0.000124,-6.2e-05,-1e-05,6.5e-05,4.7e-05,8.7e-05,0.000144,1.4e-05,1.6e-05
-7.8e-05,4.3e-05,-6.4e-05,1.9e-05,0.000123,0.000133,2.9e-05,6e-06,3.7e-05,4e-06,6.3e-05,-7.1e-05,-8.8e-05,4.1e-05,-2.7e-05,4e-05,-6.9e-05,8.6e-05,-1.1e-05,-4.5e-05,-1.5e-05,-1.6e-05,7.8e-05,8.4e-05,1.9e-05,-8e-06,5.9e-05,-8.5e-05,1.1e-05,-0.000105,2.4e-05,-2.1e-05,5.9e-05,-4.7e-05,-1e-06,-2.9e-05,1.3e-05,1.2e-05,3.7e-05,4.2e-05,-5.6e-05,1.6e-05,1.6e-05,-0.00013,-8.1e-05,-1.6e-05,-8e-06,-4.3e-05,-1.6e-05,0.000115,-9.5e-05,1.3e-05,-4.9e-05,2.1e-05,0.000109,9e-06,-3.3e-05,-1.2e-05,3e-06,3.8e-05,2.3e-05,-2.1e-05,-1.6e-05,3.5e-05,0,2.4e-05,-7e-05,3.3e-05,2.2e-05,2.5e-05,-0.00017,-4.2e-05,0.000147,1.7e-05,-3.6e-05,4e-06,-1e-05,-1.5e-05,1.6e-05,1.8e-05,-2.1e-05,-3.1e-05,8.1e-05,0.000139,7e-06,4.7e-05,5.3e-05,-7.1e-05,1e-05,-1.9e-05,-0.000108,-1.6e-05,1e-05,6e-05,8.2e-05,-3.6e-05,-0.000112,1.6e-05,-0.000134,3.2e-05,0.000108,-3e-06,1.8e-05,0.000125,-5.4e-05,-1.1e-05,-4.1e-05,9.1e-05,-8.8e-05,2.5e-05,-4e-05,8.6e-05,3.1e-05,-1.1e-05,-3.9e-05,-0.000139,-8.3e-05,-5.1e-05,4.4e-05,5e-06,-1e-06
-3e-06,-2e-06,-5.2e-05,1e-06,-1.2e-05,-1.8e-05,-0.000111,-7e-05,-0.000112,-9e-06,-2.5e-05,-7.1e-05,3.6e-05,-1.3e-05,-2.9e-05,-2.8e-05,5e-05,2.2e-05,-4.1e-05,-8.9e-05,-5.5e-05,8e-05,-5.5e-05,3.3e-05,-1.7e-05,-1.3e-05,-2.8e-05,6.9e-05,6e-06,1.1e-05,-7e-06,2.1e-05,2.9e-05,6.6e-05,5e-06,3e-05,0.000105,-7e-05,4.6e-05,1.2e-05,-4.4e-05,-4.5e-05,2.9e-05,1.2e-05,-8.3e-05,8e-06,1.6e-05,-8.9e-05,-3.3e-05,-3.7e-05,0.000133,2.9e-05,3.4e-05,-1.4e-05,-2e-05,-2.9e-05,-4.7e-05,3.3e-05,6.9e-05,-2.2e-05,-8.5e-05,1.5e-05,-4.3e-05,-8.1e-05,0.000117,-2.5e-05,2e-06,-1.7e-05,0.000139,-0.000137,-2.5e-05,0.00013,-8.8e-05,-5.8e-05,2.1e-05,-2.7e-05,4.1e-05,-5.9e-05,-6.5e-05,-6.5e-05,0.000144,-3.2e-05,-1.2e-05,-8.6e-05,-7e-06,-6.1e-05,-4.8e-05,9.2e-05,9e-06,-1.4e-05,9.5e-05,8.5e-05,-4.3e-05,-5.5e-05,1.4e-05,-4e-06,-3e-06,-1.2e-05,-1e-05,4.5e-05,-5.3e-05,7.3e-05,6e-06,-4.7e-05,2.4e-05,0,4e-05,-2.2e-05,8.7e-05,-2.6e-05,4.2e-05,1.7e-05,-7.1e-05,4.6e-05,-2.2e-05,0,-3.7e-05,2.5e-05,-5.3e-05,2.2e-05,-1e-06
8e-06,-7e-06,-1.7e-05,-2.8e-05,-2e-06,5e-06,2.9e-05,-5e-05,-4.2e-05,8e-06,-3.3e-05,-1.6e-05,3e-06,-3.2e-05,-2.1e-05,6e-06,4.3e-05,1.8e-05,2.3e-05,1.6e-05,1.3e-05,-4.1e-05,1.5e-05,7e-06,9e-06,4e-05,-2.8e-05,2.2e-05,-3.2e-05,-5e-05,1.8e-05,1.6e-05,-1.2e-05,5e-05,2.4e-05,-2e-06,-2.7e-05,9e-06,7e-06,-1.3e-05,-1.9e-05,2.8e-05,-3e-06,9.6e-05,2.7e-05,-5.9e-05,-1.8e-05,-2.3e-05,1.1e-05,-3.4e-05,-1e-06,-5.8e-05,-2e-06,-5e-06,-1.1e-05,-7e-06,9.4e-05,-3.6e-05,1.1e-05,-3.5e-05,4.7e-05,2.2e-05,5.2e-05,-8e-05,-1.8e-05,1.8e-05,-4.7e-05,-1.8e-05,-1.5e-05,1.3e-05,9e-06,-5.7e-05,-6.9e-05,-2.3e-05,-8e-06,-1.3e-05,-9e-06,-1e-05,1.1e-05,-8e-06,-0.00013,8.1e-05,0,5.7e-05,-6e-06,-2.4e-05,-3.4e-05,7e-06,4.1e-05,-4e-05,-9.2e-05,1.8e-05,0,-5e-06,2.6e-05,-3.6e-05,-2.8e-05,5.9e-05,5e-05,1.7e-05,-6e-06,-2.5e-05,-1.2e-05,2.5e-05,6e-06,-1.3e-05,-2.4e-05,-2e-05,-4.5e-05,-8e-06,-1.3e-05,-2.1e-05,4.2e-05,-2e-06,-1e-06,1e-04,1.2e-05,-0.000108,-4.1e-05,-1.6e-05,-1.3e-05
9e-06,3.2e-05,3e-05,8e-06,-5e-06,-3.3e-05,0,2.8e-05,1e-05,-5e-06,-2.7e-05,2.6e-05,-2e-06,2.6e-05,1.3e-05,-2e-06,-3.8e-05,-2.6e-05,4e-06,3.9e-05,3.4e-05,-4e-05,2.4e-05,-6.4e-05,-2e-05,7e-06,3e-06,-8e-06,1.7e-05,-1.9e-05,-9e-06,-2.5e-05,-4e-06,3.6e-05,2.7e-05,-2.2e-05,-2.1e-05,-7e-06,-4.7e-05,0,-2.1e-05,2.3e-05,-5e-06,6.4e-05,1.7e-05,3.8e-05,2.5e-05,4.2e-05,-1.5e-05,-7e-06,2e-05,-2.3e-05,-6e-06,-5e-06,8e-06,0,2.1e-05,8e-06,-2.5e-05,2.1e-05,-5e-05,3.7e-05,7e-05,-5e-06,2.8e-05,-1.2e-05,5.7e-05,2.3e-05,4.2e-05,0,8.4e-05,4e-05,9e-05,4e-06,1.2e-05,-4e-06,-5e-06,3e-05,-5.1e-05,2.4e-05,-3.3e-05,-5.1e-05,-9e-06,-5.5e-05,-0.000107,8e-06,-3e-06,-1.9e-05,-1.6e-05,3e-06,1.4e-05,-4.2e-05,0,1e-05,2.9e-05,9e-06,3.3e-05,-2.8e-05,-9e-06,-3.8e-05,2.5e-05,-7.3e-05,-9e-06,8e-06,-1.9e-05,2.8e-05,-5e-06,-5e-06,2.4e-05,1.8e-05,9e-06,-3.4e-05,-4e-05,4.4e-05,4.1e-05,-2.5e-05,2.2e-05,4.8e-05,3.5e-05,2.3e-05,1.7e-05
1e-05,1.1e-05,1e-05,7e-06,-1.7e-05,2.1e-05,-1.1e-05,4.6e-05,-3.8e-05,1e-05,2.6e-05,-4e-06,3e-06,-5e-06,2.2e-05,9e-06,-3.5e-05,-2.1e-05,-4e-06,-4e-06,-5e-06,7e-06,-3.9e-05,7e-06,1.3e-05,-2.8e-05,-1.1e-05,-1.7e-05,1.3e-05,3.1e-05,2e-06,-3.1e-05,3e-06,-1.5e-05,-3e-05,-1e-06,0,3.2e-05,2.6e-05,8e-06,-2e-06,-1.4e-05,-1.1e-05,1.7e-05,-2.1e-05,-7e-06,3e-05,3.9e-05,1.3e-05,3e-05,-2.2e-05,1.1e-05,2e-05,4e-06,3.4e-05,2.4e-05,2.1e-05,-6e-06,-1.1e-05,2e-06,5.2e-05,-6.7e-05,-4.6e-05,2e-06,4.4e-05,8e-06,2.9e-05,4.1e-05,-4.3e-05,-4e-06,-3.9e-05,-4.2e-05,-4.1e-05,-1.3e-05,4e-05,2.3e-05,1.2e-05,2e-06,-5.9e-05,3.2e-05,5.5e-05,1.1e-05,-1e-06,2.6e-05,-9e-06,-1e-06,-2.6e-05,8e-06,-3.3e-05,-1.3e-05,-1.7e-05,-7e-06,2.1e-05,-2e-06,-1.1e-05,5e-06,6e-06,-9e-06,2e-05,6e-06,-2.1e-05,8e-06,8e-06,-1.6e-05,2.6e-05,-6e-06,-3e-06,-3e-06,-2.9e-05,-2.2e-05,-4e-06,7.1e-05,3.4e-05,-4.3e-05,3e-05,-5.2e-05,-1.7e-05,1.2e-05,2.2e-05,-1.3e-05,2.3e-05
0,2.4e-05,8e-06,-1.1e-05,2.7e-05,3e-06,5.2e-05,1.5e-05,-1.6e-05,-1e-06,2.6e-05,3e-05,-2.6e-05,-2e-06,0,-2e-06,-2e-05,1.3e-05,1e-05,-1.4e-05,0,1e-06,7e-06,8e-06,-7e-06,4.5e-05,1.4e-05,-3.6e-05,-1e-06,4e-06,9e-06,2.3e-05,2.1e-05,-9e-06,2e-06,-2.2e-05,3.8e-05,2.1e-05,2.2e-05,1e-05,6e-06,-1e-06,9e-06,-3.6e-05,-4e-06,1e-06,-4e-06,-1.1e-05,-1.2e-05,-2e-05,-2.9e-05,1.4e-05,-1.7e-05,1.5e-05,1.6e-05,1.4e-05,-2.4e-05,-5e-06,-1e-05,3.2e-05,-1.9e-05,2.7e-05,-1.7e-05,1.2e-05,-3.7e-05,-1.6e-05,5e-06,-2e-05,-3.5e-05,4.7e-05,7.9e-05,5e-05,3.8e-05,1.1e-05,-2.7e-05,-3e-06,-2e-06,1.6e-05,4.5e-05,2e-05,5.4e-05,3e-06,9e-06,-6e-06,-1.4e-05,3.9e-05,2.8e-05,-3e-06,2.2e-05,1.2e-05,-2.1e-05,3e-05,-2e-06,4.5e-05,-3e-06,1.8e-05,1.6e-05,1.2e-05,-3e-06,-1.1e-05,1.4e-05,-1.2e-05,6e-06,7e-06,-4.5e-05,-2e-06,1.6e-05,1.2e-05,-5e-06,2.1e-05,7e-06,-4e-05,1.2e-05,-7e-06,9e-06,8e-06,4e-05,4.7e-05,-4e-05,1.3e-05,3e-06
-7e-06,1e-05,-6e-06,3e-06,-4.3e-05,-3.1e-05,0,4e-06,8e-06,-1e-06,5e-06,2e-06,9e-06,3e-06,2e-05,-1.3e-05,-2.5e-05,6e-06,-1.4e-05,1.8e-05,-4e-06,2.3e-05,2.5e-05,-9e-06,1e-06,-3.7e-05,1.8e-05,1.5e-05,-9e-06,3e-05,-1.1e-05,3.4e-05,7e-06,-3.3e-05,-1e-06,-1.1e-05,9e-06,9e-06,-1.2e-05,0,4e-06,6e-06,-4e-06,-2.3e-05,1.5e-05,5e-06,1.6e-05,-3.2e-05,3e-06,8e-06,-3e-06,-1.9e-05,2.9e-05,8e-06,-1.8e-05,-6e-06,-3e-05,7e-06,1e-05,-3.7e-05,4e-06,5.7e-05,5e-06,3.6e-05,-2.4e-05,1.6e-05,-4.8e-05,-4e-06,0,1.5e-05,8e-06,-3.8e-05,-4e-05,-2e-05,1e-05,3e-06,-6e-06,-9e-06,-2.8e-05,2.7e-05,-1.4e-05,-4e-06,1.9e-05,1.8e-05,1.3e-05,-2e-06,6e-06,1.6e-05,-3.1e-05,1.3e-05,-8e-06,-7e-06,-1.1e-05,2.6e-05,-1.5e-05,-3.1e-05,-1.5e-05,7e-06,-4.3e-05,8e-06,-1.5e-05,-1.6e-05,-3e-06,-3.8e-05,1.5e-05,-1e-06,2e-06,1.8e-05,1.1e-05,-4e-06,-1.1e-05,-2.3e-05,-2.1e-05,-5e-06,-1.8e-05,6.1e-05,-1.6e-05,-1.3e-05,8e-06,-2e-06,-8e-06
1.1e-05,-2.2e-05,-1.4e-05,0,3e-05,2.4e-05,-7e-06,-3.6e-05,2.3e-05,3e-06,-1.4e-05,1.2e-05,1.4e-05,0,8e-06,6e-06,2.4e-05,1.2e-05,3e-06,1.9e-05,-1e-05,-3.1e-05,-2.5e-05,-2.2e-05,2e-06,6e-06,2.4e-05,7e-06,6e-06,5e-06,1.5e-05,-2.2e-05,1.3e-05,3.8e-05,5e-06,4e-06,-1.3e-05,-1.6e-05,-1e-06,-1.3e-05,1e-06,-1.7e-05,8e-06,2.5e-05,-1.6e-05,-2e-06,-6e-06,-6e-06,1e-06,3.3e-05,3.2e-05,4e-05,-2.4e-05,-5e-06,3.7e-05,-2e-05,8e-06,-3e-06,-5e-06,-7e-06,3.3e-05,-5.5e-05,-2.4e-05,0,-1.2e-05,-4e-06,9e-06,2.1e-05,1e-06,-3.3e-05,3.2e-05,1.5e-05,-6e-06,7e-06,0,4e-06,-1e-06,-9e-06,2.7e-05,-9e-06,-6e-06,-2.4e-05,-2.5e-05,-1.5e-05,3.7e-05,1.5e-05,-4e-06,-1.6e-05,3.3e-05,8e-06,2e-05,-2.4e-05,3e-06,-4e-06,-1.4e-05,-2.8e-05,-1.4e-05,-1.8e-05,1.1e-05,9e-06,2e-05,-1.3e-05,0,8e-06,3.1e-05,3e-06,1e-05,-1.1e-05,-2.2e-05,-3e-06,-5e-06,4.4e-05,1.1e-05,-6e-06,-2.4e-05,-3.8e-05,-9e-06,-1.8e-05,3e-05,1e-06,-1e-06
6e-06,-1.2e-05,-1.4e-05,5e-06,0,6e-06,-1.2e-05,0,-1e-06,0,-1.8e-05,-3.4e-05,-5e-06,-7e-06,-2e-06,-3e-06,-1e-06,3e-06,2e-06,1.3e-05,-1e-05,-2e-05,-1e-06,5e-06,-8e-06,-8e-06,-2.3e-05,-1.8e-05,-7e-06,-1.1e-05,-1e-05,3e-06,0,9e-06,-1.4e-05,-1.2e-05,-1.6e-05,-1e-06,-1.1e-05,-5e-06,1.1e-05,3e-06,-1.7e-05,1.6e-05,-2.1e-05,4e-06,8e-06,1e-05,1e-06,-3.2e-05,2e-06,1.6e-05,1.6e-05,-6e-06,-1.6e-05,8e-06,-7e-06,-3e-06,2.3e-05,1.3e-05,-1.9e-05,9e-06,-3e-06,-1.4e-05,-4e-06,-2e-06,-2e-06,-4e-06,4.1e-05,-2.6e-05,-3.2e-05,-2.1e-05,3.8e-05,2e-05,1.2e-05,-6e-06,-1e-06,-2e-06,0,-2.3e-05,5e-06,2.8e-05,1e-06,9e-06,1.1e-05,-2.5e-05,1e-06,1.2e-05,-8e-06,1.4e-05,-2e-05,1.9e-05,7e-06,8e-06,-1.2e-05,-9e-06,2e-06,2e-06,3.3e-05,-9e-06,-1.3e-05,4.7e-05,9e-06,-1e-05,-2.4e-05,3e-06,8e-06,-1e-05,3.2e-05,1.1e-05,1e-06,-3.1e-05,-2.6e-05,2.6e-05,-1.3e-05,-3e-05,5e-06,-3.4e-05,9e-06,-1e-06,3e-06
-1.1e-05,2.1e-05,-4e-06,-8e-06,-1.8e-05,-2.3e-05,1e-06,2.5e-05,-1.4e-05,-3e-06,2e-06,1e-06,-3e-06,7e-06,-2.3e-05,-2e-06,-6e-06,-7e-06,1e-06,-1.9e-05,0,1.9e-05,2e-05,1.4e-05,1.3e-05,1.3e-05,-2.1e-05,-2e-06,1.6e-05,0,1e-05,2e-06,-1e-06,3.9e-05,-6e-06,3e-06,1.5e-05,-2.1e-05,1.6e-05,3e-06,1e-06,9e-06,8e-06,-2.5e-05,1.6e-05,-1e-05,-2.6e-05,2.5e-05,1e-06,-2.7e-05,-1.6e-05,-3e-05,-6e-06,0,-7e-06,-7e-06,1.7e-05,3e-06,-6e-06,1.5e-05,2e-05,6e-06,3.6e-05,-1e-06,-2.2e-05,3e-06,3.1e-05,-1.5e-05,1.6e-05,8e-06,2.6e-05,2.6e-05,-2.8e-05,7e-06,-1e-05,-7e-06,0,8e-06,1e-06,-9e-06,-1.6e-05,-4e-06,1.2e-05,-1.7e-05,1.5e-05,-6e-06,-2.9e-05,-4e-06,8e-06,-1.4e-05,2e-05,1.4e-05,2e-06,2.1e-05,4e-06,1.3e-05,-2e-06,1.1e-05,-6e-06,-2e-06,1e-06,2.5e-05,1e-06,1e-05,1e-06,-5e-06,1e-06,5e-06,-2.3e-05,-8e-06,-2e-06,1.4e-05,2e-05,-1.4e-05,4e-06,3.4e-05,-2.2e-05,1.7e-05,-3.1e-05,5e-06,0
1.5e-05,9e-06,1e-06,1e-06,1.1e-05,1.6e-05,-1.4e-05,-3e-06,3.3e-05,0,1.1e-05,-6e-06,-1.6e-05,-1e-06,7e-06,-6e-06,6e-06,-6e-06,-2e-06,-6e-06,9e-06,-3e-06,-1.4e-05,8e-06,-1.3e-05,-6e-06,1.2e-05,-5e-06,-1.7e-05,-2.1e-05,-2e-06,9e-06,-4e-06,-9e-06,9e-06,-9e-06,1.5e-05,5e-06,4e-06,0,-1e-06,-4e-06,6e-06,-3.5e-05,2.1e-05,3e-06,1e-05,1.5e-05,-1e-06,4.2e-05,-3e-06,1e-06,9e-06,4e-06,5e-06,1.4e-05,-2e-06,-6e-06,-1.7e-05,-1.4e-05,-1.6e-05,1.5e-05,-7e-06,-2.1e-05,1.4e-05,-2e-06,-3e-06,1.2e-05,-1e-05,-5e-06,-2.5e-05,-2.1e-05,0,1e-06,1.1e-05,2e-06,4e-06,5e-06,3e-05,-4e-06,-1.3e-05,0,-2e-06,1.2e-05,1.5e-05,-1.3e-05,1.1e-05,-6e-06,-7e-06,1e-06,2e-06,-1.7e-05,9e-06,-1.4e-05,-6e-06,1.3e-05,2.1e-05,-8e-06,-1e-05,6e-06,8e-06,-5e-06,-4e-06,-7e-06,0,2e-06,-5e-06,-3e-06,8e-06,4e-06,0,-1.6e-05,-2e-06,1.1e-05,2.2e-05,2.2e-05,1.4e-05,3e-06,-7e-06,-2e-06,1e-06
-1.8e-05,-4e-06,5e-06,-1e-06,-1.5e-05,-9e-06,-7e-06,6e-06,1e-05,0,1.3e-05,-2e-06,1.3e-05,-1e-06,2e-06,1e-06,4e-06,-4e-06,1e-06,2.3e-05,1e-06,-4e-06,-2e-06,7e-06,1.1e-05,2e-06,1e-06,-3e-06,1e-05,3e-06,3e-06,-6e-06,1e-05,-1.1e-05,-1.3e-05,-6e-06,-8e-06,1e-06,-4e-06,-1e-06,2e-06,-1e-06,-1.4e-05,-1.4e-05,-1.2e-05,3e-06,-1.4e-05,-2.1e-05,2e-06,-1.3e-05,8e-06,0,-9e-06,0,-1.6e-05,-4e-06,1.7e-05,5e-06,6e-06,-9e-06,-1.3e-05,-1e-05,-2e-06,-1.7e-05,2.4e-05,2e-06,-5e-06,4e-06,-2.8e-05,1e-05,9e-06,1.8e-05,0,-9e-06,2e-06,4e-06,-1e-06,1e-06,-1.6e-05,4e-06,4.7e-05,6e-06,-3e-06,0,-3.2e-05,2e-06,6e-06,1e-06,-3e-06,-1.2e-05,-8e-06,0,-9e-06,-6e-06,1.6e-05,-1.8e-05,9e-06,2e-06,-9e-06,-1.2e-05,-8e-06,7e-06,3e-06,1.6e-05,5e-06,-1e-06,0,1.4e-05,-2e-06,5e-06,-3e-06,2.9e-05,-7e-06,-2e-05,1.5e-05,-3.4e-05,-2e-06,1.7e-05,2.6e-05,1e-06,0
1.7e-05,-2e-06,2e-06,-1e-06,1.8e-05,7e-06,2.8e-05,-1.1e-05,3e-06,-3e-06,-2e-06,8e-06,8e-06,3e-06,-1e-06,1e-06,9e-06,4e-06,3e-06,-8e-06,2e-06,-5e-06,8e-06,2e-06,-1e-05,-2e-06,8e-06,4e-06,2e-06,1e-06,1e-06,2e-06,2e-06,-2e-05,-2e-06,3e-06,-1.3e-05,1.2e-05,-3e-06,1e-06,-2e-06,8e-06,1.1e-05,1.2e-05,-1.7e-05,-6e-06,-5e-06,-1.6e-05,-2e-06,-8e-06,0,-7e-06,8e-06,1e-06,-5e-06,-2e-06,-1e-05,-3e-06,-1e-06,8e-06,1.4e-05,-2.4e-05,0,3e-06,-4e-06,-4e-06,-2.1e-05,-1.2e-05,-1.1e-05,1.4e-05,-4e-05,-9e-06,1.1e-05,-1e-05,-7e-06,-4e-06,2e-06,-8e-06,2.8e-05,1.8e-05,1e-06,-2e-06,-3e-06,-2e-06,-1e-06,1.2e-05,-6e-06,2e-06,-4e-06,-2e-06,1.7e-05,1.8e-05,-3e-06,-4e-06,2e-06,-3e-06,1.6e-05,-8e-06,-3e-06,7e-06,3e-06,-4e-06,3e-06,5e-06,4e-06,1e-06,0,-6e-06,2e-06,-5e-06,4e-06,-2.5e-05,1.6e-05,3e-06,-5e-06,-1.4e-05,8e-06,1e-06,0,-2e-06,4e-06
-1.2e-05,-3e-06,1e-06,0,8e-06,-1.1e-05,-3e-06,-1e-05,-9e-06,1e-06,-1.2e-05,0,-9e-06,-5e-06,1e-06,-6e-06,-9e-06,4e-06,-5e-06,-1.8e-05,2e-06,-1.7e-05,-4e-06,-4e-06,4e-06,6e-06,-1e-06,-7e-06,-1.1e-05,6e-06,-2e-06,-4e-06,2e-06,0,-6e-06,-6e-06,1e-06,5e-06,-1e-06,-1e-06,0,-6e-06,-3e-06,2.6e-05,6e-06,8e-06,0,-4e-06,4e-06,1.9e-05,-1e-06,-1.5e-05,1e-06,-3e-06,-5e-06,-5e-06,1e-06,-2e-06,-7e-06,5e-06,-1.7e-05,3.6e-05,-9e-06,-5e-06,8e-06,5e-06,6e-06,5e-06,-1e-06,-1.4e-05,1.5e-05,5e-06,-7e-06,0,-7e-06,2e-06,-4e-06,1e-06,1e-06,5e-06,-1.7e-05,-6e-06,3e-06,1.1e-05,-1.6e-05,4e-06,1.1e-05,-2e-06,4e-06,5e-06,-5e-06,-4e-06,1e-06,-1.7e-05,1e-05,-8e-06,-7e-06,1.5e-05,2e-05,3e-06,-3e-06,-2.2e-05,-3e-06,-6e-06,-9e-06,2e-06,-3e-06,-1e-06,7e-06,0,-1e-06,1e-06,-2.4e-05,-2e-06,-1e-05,3.5e-05,-2e-06,-1.1e-05,-1.2e-05,0,0
1.2e-05,0,-2e-06,0,-1.4e-05,8e-06,2e-06,1.5e-05,8e-06,0,-6e-06,1.1e-05,1e-06,3e-06,7e-06,1e-06,-1.1e-05,-2e-06,6e-06,-3e-06,-7e-06,1.1e-05,-4e-06,-1e-05,0,-1e-05,-6e-06,-6e-06,9e-06,8e-06,5e-06,2e-06,-1e-06,1.5e-05,0,5e-06,9e-06,2e-06,1.1e-05,1e-06,-1e-06,-5e-06,-2e-06,2e-06,8e-06,-5e-06,5e-06,1.6e-05,-3e-06,-1e-05,-8e-06,2.2e-05,-6e-06,-2e-06,-6e-06,5e-06,-1.1e-05,2e-06,1.6e-05,-2e-06,2.6e-05,-6e-06,-1.5e-05,6e-06,1.4e-05,-3e-06,1.2e-05,7e-06,1.2e-05,-1e-05,-2.1e-05,-3e-06,-1.1e-05,3e-06,7e-06,2e-06,1e-06,3e-06,-9e-06,1e-06,-1.7e-05,6e-06,4e-06,-2.2e-05,-1e-05,1.2e-05,-1.7e-05,-3e-06,6e-06,-2e-06,5e-06,-1.2e-05,-1e-06,-2e-06,3e-06,1e-05,0,-1.3e-05,6e-06,-4e-06,4e-06,-1.5e-05,1e-06,1.3e-05,5e-06,0,3e-06,-6e-06,-1.3e-05,0,2e-06,1.7e-05,2e-05,4e-06,-1.3e-05,2e-06,2e-06,-4e-06,-6e-06,3e-06,-4e-06
-7e-06,0,-5e-06,-2e-06,6e-06,0,3e-06,7e-06,1.2e-05,-2e-06,2e-06,-6e-06,-5e-06,1e-06,-2e-06,-2e-06,-3e-06,-1e-06,-2e-06,1.1e-05,0,5e-06,7e-06,1e-06,-2e-06,1e-06,-2e-06,2e-06,-2e-06,-1e-06,-6e-06,1.1e-05,-1e-06,1.6e-05,-1e-06,0,1e-06,-7e-06,-7e-06,0,0,7e-06,1e-06,-7e-06,-7e-06,4e-06,1e-06,1.1e-05,4e-06,-1.2e-05,1e-06,7e-06,1e-05,-1e-06,7e-06,1e-06,-6e-06,-5e-06,-6e-06,-1e-05,-7e-06,-2.2e-05,1.8e-05,1.4e-05,-5e-06,1e-06,1.1e-05,-6e-06,2.3e-05,7e-06,8e-06,6e-06,9e-06,1e-06,-8e-06,-2e-06,3e-06,2e-06,1.5e-05,-5e-06,1.3e-05,-2e-06,-5e-06,2.1e-05,1.3e-05,-9e-06,-2e-06,6e-06,-7e-06,9e-06,4e-06,7e-06,6e-06,-4e-06,-4e-06,4e-06,-1.4e-05,2e-06,-1.8e-05,1e-06,-4e-06,9e-06,4e-06,-2.2e-05,-4e-06,0,3e-06,1e-06,1.7e-05,-5e-06,-1e-06,-1.2e-05,-7e-06,2e-06,-4e-06,-3e-05,-2e-06,0,1.2e-05,-3e-06,1e-06
3e-06,5e-06,-1e-06,-1e-06,-6e-06,-3e-06,-1.1e-05,-1e-06,-2.4e-05,0,9e-06,-2e-06,5e-06,-3e-06,-3e-06,0,-3e-06,-3e-06,-2e-06,-6e-06,0,-1.8e-05,-2e-06,0,2e-06,8e-06,-5e-06,1e-06,-1e-06,1e-06,4e-06,-8e-06,0,7e-06,-1e-05,-1e-06,-4e-06,-2e-06,3e-06,2e-06,-2e-06,-1e-06,0,1e-06,-6e-06,-2e-06,2e-06,-7e-06,-5e-06,4e-06,8e-06,-1.2e-05,-1.1e-05,0,-4e-06,3e-06,9e-06,4e-06,-8e-06,2e-06,6e-06,8e-06,0,-3e-06,-1.3e-05,0,-9e-06,-4e-06,-1e-06,-2e-06,-1.2e-05,-4e-06,2e-06,1e-06,3e-06,-1e-06,-4e-06,-1e-06,-1.7e-05,-1.2e-05,3e-06,-6e-06,3e-06,-2.1e-05,1e-06,-3e-06,4e-06,-4e-06,6e-06,0,-1e-06,6e-06,-4e-06,-9e-06,4e-06,4e-06,-2e-06,6e-06,-4e-06,-2e-06,1e-06,4e-06,-1e-06,1.5e-05,0,-1e-06,2e-06,-1e-06,-1.3e-05,4e-06,2e-06,2e-06,1e-06,-5e-06,7e-06,3e-06,-9e-06,9e-06,5e-06,0,0
-1e-06,-3e-06,0,1e-06,-3e-06,-2e-06,-7e-06,-2e-06,3e-06,1e-06,3e-06,-6e-06,5e-06,2e-06,-2e-06,-3e-06,8e-06,-2e-06,3e-06,-4e-06,2e-06,0,-5e-06,2e-06,-3e-06,-8e-06,2e-06,-1e-06,-2e-06,-6e-06,-3e-06,0,2e-06,-9e-06,5e-06,2e-06,-6e-06,-6e-06,-4e-06,1e-06,0,-3e-06,1e-06,1.5e-05,3e-06,-1e-06,8e-06,-1.2e-05,4e-06,1.7e-05,3e-06,9e-06,1.1e-05,0,8e-06,-2e-06,1e-06,-1e-06,6e-06,6e-06,2e-06,1.2e-05,-1e-06,-5e-06,-4e-06,0,-7e-06,8e-06,-6e-06,0,1.4e-05,1e-06,4e-06,1e-06,-2e-06,2e-06,3e-06,-1e-06,0,-8e-06,3e-06,7e-06,-4e-06,2.2e-05,1.8e-05,-1.1e-05,-4e-06,4e-06,-5e-06,1e-06,-5e-06,-9e-06,-1e-06,3e-06,-1.4e-05,-8e-06,-5e-06,-3e-06,4e-06,0,3e-06,-5e-06,-1e-06,-1.3e-05,1.2e-05,1e-06,-1e-06,1e-05,6e-06,-1e-06,-1e-06,-3e-06,1e-05,3e-06,8e-06,3e-05,6e-06,-1e-06,-1.4e-05,-1e-06,0
3e-06,-2e-06,1e-06,0,1e-05,6e-06,0,-1.1e-05,-6e-06,-1e-06,-2e-06,-2e-06,-7e-06,-1e-06,0,1e-06,3e-06,3e-06,-2e-06,0,2e-06,-2e-06,5e-06,-3e-06,5e-06,6e-06,7e-06,-3e-06,2e-06,-2e-06,1e-06,-1e-06,0,-1.2e-05,-3e-06,-3e-06,6e-06,0,1e-06,-4e-06,-2e-06,5e-06,-2e-06,1.3e-05,-2e-06,3e-06,1e-06,-3e-06,-4e-06,-1e-05,-6e-06,3e-06,-1e-05,0,3e-06,-2e-06,1.3e-05,0,-4e-06,5e-06,-1.1e-05,-2e-06,2e-06,-4e-06,0,0,-4e-06,-2e-06,-1.9e-05,3e-06,2e-06,2e-06,-1.6e-05,0,5e-06,-1e-06,-2e-06,-1e-06,0,3e-06,8e-06,-3e-06,2e-06,-1.6e-05,-3e-06,-4e-06,6e-06,-4e-06,1e-06,-1e-06,6e-06,-2e-06,2e-06,6e-06,4e-06,-3e-06,4e-06,0,5e-06,1e-06,-2e-06,1e-05,3e-06,1e-06,-1.1e-05,0,1e-06,-8e-06,2e-06,-2e-06,-1e-06,1.3e-05,-1.7e-05,-6e-06,6e-06,-1.1e-05,-5e-06,-5e-06,2e-06,2e-06,1e-06
-4e-06,-4e-06,1e-06,-2e-06,-1.2e-05,-3e-06,7e-06,3e-06,9e-06,1e-06,-7e-06,4e-06,1e-06,-2e-06,1e-06,-1e-06,0,3e-06,1e-06,6e-06,0,1e-06,-1e-06,4e-06,-4e-06,-4e-06,-4e-06,-3e-06,-1e-06,-1e-06,0,8e-06,0,-1.1e-05,-1e-06,2e-06,2e-06,2e-06,7e-06,-1e-06,1e-06,1e-06,2e-06,-3e-06,-7e-06,-5e-06,0,7e-06,4e-06,-9e-06,-4e-06,-9e-06,8e-06,-1e-06,1e-06,0,-1e-05,1e-06,-3e-06,-1e-05,8e-06,-1.8e-05,4e-06,-1.4e-05,-1.2e-05,0,4e-06,-4e-06,-1.1e-05,-7e-06,2e-06,-3e-06,1e-05,1e-06,-5e-06,-2e-06,0,0,-1e-05,-1e-06,-1e-05,1e-06,5e-06,1.1e-05,0,5e-06,-3e-06,4e-06,-1e-06,-5e-06,-9e-06,1e-05,-3e-06,2e-06,-8e-06,3e-06,0,-4e-06,8e-06,0,1e-06,1.2e-05,0,5e-06,-2e-06,0,-2e-06,3e-06,-6e-06,3e-06,0,-1.8e-05,1.3e-05,2e-06,0,-2.3e-05,5e-06,-4e-06,8e-06,-2e-06,-2e-06
4e-06,4e-06,1e-06,-1e-06,1.2e-05,-2e-06,-2e-06,1.1e-05,-2.2e-05,0,-3e-06,-1e-06,-3e-06,3e-06,0,-2e-06,9e-06,1e-06,-1e-06,-1e-06,0,2e-06,-3e-06,-1e-06,3e-06,5e-06,-1e-06,1e-06,0,0,0,-6e-06,0,7e-06,0,0,-1e-06,5e-06,-7e-06,2e-06,-2e-06,-5e-06,-1e-06,-1.4e-05,1e-06,5e-06,-2e-06,1e-05,-5e-06,1.8e-05,2e-06,-1e-05,-6e-06,-1e-06,5e-06,0,1e-06,-2e-06,1e-05,0,-1.2e-05,1.1e-05,-1.5e-05,-5e-06,1e-06,1e-06,1.2e-05,4e-06,1e-05,-6e-06,8e-06,5e-06,3e-06,0,2e-06,1e-06,1e-06,1e-06,3e-06,7e-06,-1.8e-05,0,-7e-06,-8e-06,3e-06,3e-06,-7e-06,-4e-06,2e-06,0,4e-06,-1e-06,5e-06,4e-06,1e-06,9e-06,-2e-06,7e-06,-7e-06,1e-06,-1e-06,-1e-06,-2e-06,-8e-06,7e-06,1e-06,-2e-06,-6e-06,6e-06,-4e-06,0,1.3e-05,-7e-06,-1e-06,-6e-06,1.4e-05,2e-06,1e-06,0,1e-06,2e-06
-1e-06,0,-1e-06,1e-06,-4e-06,3e-06,9e-06,0,0,0,4e-06,6e-06,4e-06,-2e-06,0,-1e-06,-1e-06,-2e-06,2e-06,1e-06,-3e-06,-1.6e-05,2e-06,3e-06,-4e-06,-5e-06,-3e-06,2e-06,0,4e-06,2e-06,2e-06,0,6e-06,-1e-06,-2e-06,-5e-06,2e-06,1e-06,0,1e-06,1e-06,1e-06,-1.2e-05,5e-06,-3e-06,-1e-06,0,4e-06,-1.2e-05,4e-06,1.1e-05,4e-06,0,-6e-06,3e-06,-8e-06,1e-06,-4e-06,5e-06,6e-06,1.4e-05,6e-06,2e-06,7e-06,-1e-06,-3e-06,2e-06,1e-05,5e-06,-3e-06,-6e-06,-6e-06,-1e-06,-1e-06,1e-06,-3e-06,1e-06,-7e-06,8e-06,4e-06,4e-06,3e-06,1e-06,-1.1e-05,1.1e-05,2e-06,1e-06,-3e-06,-3e-06,-4e-06,-7e-06,0,7e-06,4e-06,0,-2e-06,-5e-06,-1.3e-05,0,1e-06,-5e-06,2e-06,1.3e-05,-1e-06,1e-06,-1e-06,3e-06,-9e-06,3e-06,0,-7e-06,-1e-06,1e-06,-6e-06,2e-05,-1e-06,3e-06,-5e-06,-3e-06,-1e-06
-2e-06,-1e-06,0,-1e-06,-6e-06,-1e-06,5e-06,-2e-06,3e-06,0,5e-06,-1e-06,4e-06,0,0,0,-1e-06,-3e-06,-2e-06,0,0,2e-06,1e-06,-2e-06,2e-06,1e-06,-1e-06,-1e-06,-2e-06,0,-1e-06,-1e-06,0,1.4e-05,2e-06,2e-06,-1e-06,1e-06,0,-1e-06,-1e-06,2e-06,0,0,-3e-06,2e-06,-4e-06,-9e-06,-4e-06,-7e-06,2e-06,0,-3e-06,0,8e-06,-2e-06,-1e-06,0,-6e-06,4e-06,-1e-06,-1.5e-05,2e-06,-3e-06,5e-06,1e-06,-3e-06,-4e-06,1.2e-05,3e-06,1.1e-05,7e-06,7e-06,-2e-06,1e-06,-1e-06,3e-06,-1e-06,-4e-06,-6e-06,1.3e-05,-8e-06,3e-06,5e-06,-2e-06,-2e-06,-1e-06,1e-06,3e-06,3e-06,2e-06,4e-06,-2e-06,3e-06,-1e-06,-2e-06,-5e-06,1e-06,7e-06,-1e-06,-2e-06,-1e-06,1e-06,-8e-06,1e-06,0,1e-06,0,1.1e-05,0,0,4e-06,6e-06,1e-06,-4e-06,-2e-05,1e-06,1.1e-05,-3e-06,3e-06,0
4e-06,-1e-06,0,0,7e-06,-2e-06,-1.1e-05,-4e-06,6e-06,0,2e-06,0,-7e-06,2e-06,2e-06,0,-3e-06,-1e-06,1e-06,5e-06,0,6e-06,-2e-06,2e-06,-1e-06,2e-06,3e-06,-2e-06,2e-06,3e-06,2e-06,1e-06,0,-4e-06,-3e-06,-3e-06,5e-06,-3e-06,3e-06,-1e-06,2e-06,-2e-06,-1e-06,3e-06,-6e-06,-1e-06,-2e-06,-7e-06,4e-06,2e-05,-4e-06,-7e-06,0,0,-9e-06,0,4e-06,-1e-06,4e-06,-5e-06,3e-06,-8e-06,-1e-06,5e-06,3e-06,0,-1e-05,1e-06,-1e-06,-2e-06,-1.4e-05,-8e-06,-1.4e-05,-1e-06,-1e-06,1e-06,-2e-06,-2e-06,3e-06,-2e-06,3e-06,7e-06,-5e-06,-6e-06,2e-06,0,1e-06,0,-1e-06,1e-06,-5e-06,5e-06,2e-06,2e-06,9e-06,-5e-06,0,0,8e-06,-1e-06,1e-06,-3e-06,-2e-06,7e-06,-3e-06,0,0,6e-06,-9e-06,-2e-06,0,-5e-06,-9e-06,-3e-06,1e-06,-1.4e-05,-3e-06,-6e-06,6e-06,-2e-06,1e-06
-4e-06,-1e-06,-1e-06,-1e-06,-7e-06,1e-06,-5e-06,-5e-06,-1.3e-05,-1e-06,-3e-06,-3e-06,1e-06,-3e-06,-3e-06,-2e-06,-8e-06,0,1e-06,-4e-06,0,-1e-05,1e-06,-4e-06,0,-1e-06,-2e-06,-1e-06,-1e-06,-3e-06,-1e-06,4e-06,0,-5e-06,3e-06,1e-06,1e-06,-2e-06,-2e-06,0,-1e-06,1e-06,1e-06,-1e-06,2e-06,0,-4e-06,1e-06,-4e-06,-7e-06,-3e-06,9e-06,3e-06,0,3e-06,-1e-06,1e-06,1e-06,0,-2e-06,5e-06,1.3e-05,-3e-06,5e-06,6e-06,0,5e-06,2e-06,-1.1e-05,-2e-06,1.3e-05,7e-06,1.5e-05,1e-06,2e-06,0,1e-06,1e-06,-3e-06,-3e-06,-7e-06,-5e-06,3e-06,9e-06,-2e-06,-8e-06,2e-06,1e-06,-1e-06,2e-06,5e-06,-6e-06,-4e-06,2e-06,-2e-06,0,-1e-06,1e-06,-1e-06,2e-06,0,-9e-06,1e-06,-1e-06,0,0,1e-06,-8e-06,3e-06,4e-06,0,2e-06,7e-06,2e-06,7e-06,2.2e-05,0,0,-1e-06,2e-06,-1e-06
4e-06,1e-06,0,1e-06,6e-06,0,-1e-06,8e-06,5e-06,0,-4e-06,-3e-06,0,1e-06,-1e-06,0,1e-06,1e-06,-1e-06,0,1e-06,0,1e-06,1e-06,1e-06,-2e-06,1e-06,1e-06,2e-06,0,1e-06,-3e-06,-1e-06,-1.6e-05,1e-06,-1e-06,-2e-06,-4e-06,-1e-06,1e-06,2e-06,3e-06,0,-6e-06,2e-06,1e-06,2e-06,8e-06,5e-06,-1.2e-05,2e-06,6e-06,-5e-06,-1e-06,0,2e-06,6e-06,-1e-06,-3e-06,2e-06,-1e-06,6e-06,9e-06,-5e-06,2e-06,-1e-06,4e-06,-2e-06,-1.1e-05,-4e-06,-1.4e-05,-6e-06,-3e-06,1e-06,-2e-06,-1e-06,0,1e-06,4e-06,-8e-06,-7e-06,2e-06,-2e-06,-1.1e-05,1e-06,-5e-06,-5e-06,-2e-06,0,2e-06,-5e-06,-3e-06,2e-06,-3e-06,3e-06,4e-06,6e-06,-1e-06,-2e-06,1e-06,0,-2e-06,3e-06,-2e-06,0,0,1e-06,5e-06,3e-06,-4e-06,0,6e-06,-3e-06,-2e-06,6e-06,8e-06,-2e-06,-1.1e-05,-2e-06,-2e-06,1e-06
-4e-06,-1e-06,0,-1e-06,1e-06,0,-3e-06,3e-06,6e-06,0,-2e-06,3e-06,2e-06,1e-06,1e-06,0,2e-06,1e-06,1e-06,2e-06,0,-3e-06,-1e-06,-2e-06,-3e-06,4e-06,0,1e-06,1e-06,-1e-06,0,0,0,-1e-06,0,-1e-06,-2e-06,0,2e-06,-1e-06,-1e-06,-2e-06,0,-2e-06,-3e-06,-2e-06,0,5e-06,-4e-06,1e-05,3e-06,-7e-06,7e-06,0,-6e-06,0,-3e-06,0,5e-06,4e-06,2e-06,-1.5e-05,-8e-06,-1e-06,-4e-06,0,9e-06,0,-6e-06,-4e-06,1.1e-05,8e-06,-1e-05,0,1e-06,0,-1e-06,0,4e-06,1e-06,-1e-05,-3e-06,0,1e-05,4e-06,0,-2e-06,4e-06,0,-1e-06,3e-06,5e-06,0,-2e-06,-1e-06,1e-06,-1e-06,-2e-06,-8e-06,-2e-06,0,6e-06,-2e-06,3e-06,2e-06,0,-1e-06,-6e-06,-7e-06,0,0,-1.4e-05,-1e-06,1e-06,2e-06,-2.3e-05,1e-06,2e-06,0,2e-06,0
5e-06,1e-06,0,0,-8e-06,-3e-06,3e-06,-3e-06,9e-06,0,2e-06,-3e-06,2e-06,-2e-06,1e-06,-1e-06,0,-1e-06,-1e-06,1e-06,1e-06,-6e-06,0,3e-06,4e-06,-2e-06,-2e-06,-1e-06,-4e-06,0,-1e-06,-4e-06,0,3e-06,3e-06,2e-06,3e-06,2e-06,-2e-06,-1e-06,2e-06,-1e-06,-1e-06,7e-06,-2e-06,2e-06,3e-06,-3e-06,4e-06,0,-1e-06,-5e-06,-8e-06,0,7e-06,1e-06,0,1e-06,0,-1e-06,-3e-06,-3e-06,1e-06,-3e-06,-5e-06,0,-9e-06,2e-06,8e-06,2e-06,-1.6e-05,-1e-05,1.1e-05,0,-2e-06,0,2e-06,-1e-06,0,6e-06,1e-06,6e-06,2e-06,-9e-06,-1e-06,2e-06,2e-06,-3e-06,0,0,2e-06,1e-06,-2e-06,-3e-06,-5e-06,0,5e-06,3e-06,0,0,0,3e-06,-1e-06,-6e-06,2e-06,0,-1e-06,4e-06,8e-06,3e-06,0,1.3e-05,6e-06,-1e-06,-4e-06,-3e-06,1e-06,2e-06,-1e-06,-2e-06,-1e-06
