-0.000548,-0.00067,-0.001215,-0.000902,-0.000382,-0.000734,-0.000612,-0.00057,-0.001009,-0.001646,-0.001375,-0.001151,-0.000697,-0.000228,-0.001146,-0.001991,-0.00088,-0.000547,-0.002126,-0.003751,-0.002234,-0.001063,-0.001527,-0.000122,-0.005565,-0.005033,-0.007719,-0.006882,-0.006406,-0.005032,-0.002559,-0.00096,-0.003019,-0.007462,-0.002337,0.000921,5e-06,0.00485,-0.006014,-0.02025,-0.010699,-0.010814,-0.016115,-0.020227,-0.018947,-0.0173,-0.011784,-0.01586,-0.014962,-0.008552,-0.006988,-0.005693,-0.011076,-0.013057,-0.011484,-0.013774,-0.008794,-0.009949,-0.014503,-0.016373,-0.005804,-0.017176,-0.012818,-0.01276,-0.010529,-0.011101,-0.01453,-0.005113,-0.006027,-0.012913,-0.007338,-0.006819,-0.00545,-0.003644,-0.007545,-0.005687,-0.004706,-0.005068,-0.007652,-0.00954,-0.005063,-0.004106,-0.002068,-0.000892,-0.004588,-0.002081,-0.001577,-0.003485,-0.00164,-0.001926,-0.001382,-0.000667,-0.000319,-0.000462,0.002682,-0.000638,-0.002018,-0.00083,-0.00017,-0.00017,-0.00015,-0.000462,-0.000662,-0.001092,-0.000886,-4.9e-05,-0.003473,-0.00208,-0.00052,0.000608,-0.000456,-5.4e-05,-0.000159,-0.002065,-0.000828,-0.000865,-0.000461,0.000747,0.000135,-0.000583,-0.000443
-0.000137,0.000659,0.000556,-0.000113,-0.000113,-4.9e-05,-3.4e-05,-0.000787,0.000201,0.000634,0.000448,0.000779,0.000512,0.000341,0.000585,0.001433,0.000607,-0.000276,0.000572,0.002197,0.001065,0.000208,0.000857,0.000578,0.001273,0.003262,0.000561,0.000396,0.002081,0.002942,0.00164,0.000219,0.000222,0.006107,0.004965,0.002783,0.001802,-0.006389,-0.006136,0.001665,0.00665,-8.3e-05,-0.010788,-0.002464,0.000544,-0.00111,-0.000902,-0.005396,-0.006168,-0.003295,-0.00148,-0.003259,-0.002763,0.001797,-0.004233,-0.002864,-0.00521,-0.004063,-0.000703,-0.002844,-0.001121,0.002251,0.002344,-0.00117,-0.002176,0.002765,0.003558,0.000784,-0.001421,0.001209,-0.002487,-0.000507,-0.001253,-0.00163,0.001899,0.00094,-0.000582,0.000703,-0.002322,-0.004311,-0.001672,-0.002049,0.000191,0.000331,0.000322,-0.000923,-0.001702,0.002096,0.001795,0.001267,0.000934,0.00046,0.001474,-0.001034,0.00099,-0.001447,0.000247,0.00029,0.00023,4e-04,0.000304,0.000604,7.3e-05,0.000425,0.000559,0.00073,0.001093,0.000248,0.000442,0.000446,6.3e-05,8e-05,0.000182,0.001182,0.00031,-4.1e-05,-2.9e-05,-0.000329,-0.000447,0.000325,-1e-04
-5.2e-05,-0.000211,-4.5e-05,0.000499,0.000188,-8.4e-05,0.000202,0.000375,2e-04,-0.000142,-0.000222,-0.000476,-0.000259,-1.9e-05,4.3e-05,-0.000806,-0.000768,6e-05,0.000205,-0.001574,-0.000535,-8.9e-05,-0.000409,0.000409,-0.003737,-0.004187,-0.000953,-0.000355,-0.000814,-0.002021,-0.000774,-0.000548,-0.000569,-0.003136,-0.001502,-0.001062,0.000254,-0.003037,-0.001731,0.000542,0.001913,-0.000766,0.010107,0.000973,-0.001843,-0.003783,-0.002889,-9e-05,-0.00073,-0.006036,-0.002974,-0.00109,-0.003371,-0.003787,-0.000295,0.00106,0.001516,-0.000805,-0.004163,0.004916,-0.000194,-0.00313,-0.003448,0.000469,0.001828,-0.00513,-0.001168,-0.002301,0.001685,0.000792,-0.005401,-0.00165,0.002044,-0.001855,-0.00354,-0.003502,0.00046,-0.002983,0.00146,0.00077,-0.000998,-0.000628,-0.000905,-0.000169,0.000228,-0.001098,0.000168,2e-04,-0.001442,-0.000723,5.1e-05,-0.000504,-0.000374,-9.9e-05,-0.001491,-0.000401,-0.001091,-0.000421,0.000713,0.000444,0.000314,-1.9e-05,0.00035,-0.000175,-3e-04,3.7e-05,-0.000243,0.000642,0.000428,0.000454,0.000128,0.000214,0.000119,-1.1e-05,-0.000282,-0.000156,-0.000269,-0.000206,0.000831,0.000208,0.000354
-3.6e-05,-0.000152,-0.00033,-0.000382,-0.000599,-0.000482,-0.000537,-0.000276,4.6e-05,1.4e-05,-0.000326,0.000504,0.00062,-0.000254,-0.000391,0.000226,0.000222,-4.4e-05,-0.000101,0.000214,-7.1e-05,0.000182,0.000441,0.000106,0.002239,0.002007,0.000781,-0.000117,-0.00134,0.000675,-1e-06,0.000221,-0.001113,0.002334,0.001559,-0.000386,-0.000388,-0.000357,-0.000691,0.003969,0.002593,-0.006794,-0.003785,-0.000675,-0.003,0.004415,0.005546,0.001762,0.00013,0.001635,-0.001345,-0.003168,0.00065,-0.000161,0.002061,0.001978,-0.001101,0.001961,0.001111,-0.004923,-0.002436,0.003678,0.002393,0.001548,0.003834,0.004615,0.005851,0.005118,0.00173,0.000484,0.004195,0.001936,-0.000261,-0.001108,0.002158,0.002895,0.001079,0.001776,-0.001262,-0.000201,0.001441,0.000699,-0.000263,0.000642,0.000581,0.000828,-0.000969,-0.001463,-0.000972,8.5e-05,-6.5e-05,-0.000143,-0.000147,0.000221,-0.001789,-0.001589,7e-06,-0.000139,-0.000131,-0.00033,0.000188,-0.000633,-0.000643,4.8e-05,0.00021,-0.000356,0.000212,-0.000365,-0.000171,-0.000227,0.000187,-0.000164,-0.000489,-0.000153,0.000248,0.000392,0.000233,0.000211,-0.000283,0.000171,0.000205
-0.000111,-2.2e-05,0.000129,0.000229,0.000191,0.000696,8.1e-05,-0.000111,-0.000636,-0.000374,0.000513,-0.000302,-0.000479,-0.000294,0.000226,-0.000165,-0.000575,-8.8e-05,0.000215,0.000262,0.000176,-0.00014,-0.000415,-0.000191,-0.001083,-0.000337,-0.000331,2.2e-05,0.001154,-7.3e-05,0.000231,-0.000319,0.000414,-0.00119,-0.00151,-0.001715,-0.001686,-0.00087,0.002231,-0.001091,0.000945,0.003614,0.002899,-0.000301,-0.001937,-0.004054,-0.004788,-0.003265,-0.001207,-0.000108,-0.003508,0.003045,-0.004333,-0.002856,-0.000777,-0.00163,-0.00013,0.001417,0.001999,0.00239,0.000419,-0.004335,-0.000909,0.000566,-0.001155,-0.00092,-0.003526,-0.003205,-0.000952,-0.001829,-0.001213,-0.002475,-0.000288,0.001931,-0.002105,-0.000581,-0.000225,-1e-04,0.000877,-0.00048,0.001077,0.00027,0.000174,-0.000167,-0.000699,0.000624,0.000368,0.000684,-0.000603,-3e-04,0.000554,-0.000453,-0.000295,0.000337,-0.000114,-8.2e-05,-0.00019,-2.8e-05,0.000243,-0.000111,-6.9e-05,-2.9e-05,0.00029,-0.000335,-0.000335,2.4e-05,0.000182,-2.9e-05,0.000542,-0.000103,2.6e-05,0.000335,4.3e-05,-0.000122,-0.000463,-8.7e-05,-0.000124,-4e-06,-0.000299,5.6e-05,-0.000278
-0.000292,-0.000344,4.5e-05,1.6e-05,-0.000137,-0.000212,-0.000459,1.4e-05,0.000405,0.00022,-0.000137,9.1e-05,-4e-06,6.6e-05,-6.4e-05,-0.000216,5e-05,-0.000599,-0.000375,0.000129,0.000114,-0.000113,-0.000168,0.000146,8.3e-05,0.000327,-0.000321,0.000345,-0.000605,-3.7e-05,-0.000299,-0.000141,-0.000717,-0.001122,-0.000873,-0.000742,-0.001044,0.000354,-0.001072,0.002568,-0.000384,-0.004885,-0.004549,0.004278,0.000348,0.003263,0.001477,-0.000893,0.002439,0.001375,-0.001241,-0.002683,0.004811,0.000791,0.003638,0.001354,0.005092,-0.002111,0.001673,-0.002022,-0.001423,0.00411,0.001733,0.002114,7.1e-05,-0.001979,0.002411,0.000454,0.001204,0.001605,0.001595,0.001923,0.000778,-0.00094,0.002414,0.000533,0.002013,-0.000713,-0.000489,-0.001329,0.000376,0.001156,0.000757,0.000581,-0.000633,-0.00041,0.000235,-0.000312,0.000694,-0.000334,-0.001062,0.000496,-0.000724,-0.000462,0.000115,0.000393,-0.000371,-3.6e-05,0.000265,-0.000185,3e-06,-0.000109,-4.2e-05,0.000293,8.9e-05,0.00017,7.3e-05,-0.000246,-0.000187,2.9e-05,-0.000295,-0.000772,-0.000319,0.000205,-5.4e-05,-0.000268,2.3e-05,-0.00012,0.000163,-0.000359,0.000102
-0.000135,-0.000353,-0.000417,-0.000165,-0.000284,-3.7e-05,0.000207,-0.000223,-0.00037,-0.000222,1.8e-05,-0.000191,-0.000168,-0.000372,0.000237,0.000137,-2e-05,5.3e-05,0.00035,-0.000418,-0.000354,-0.000152,-7.7e-05,-0.000117,0.000467,-0.000485,0.000296,-0.000284,0.000373,0.000264,0.000364,-0.000103,7.3e-05,0.001026,-0.000236,-0.000533,-0.000681,-0.000424,-8.2e-05,-0.000625,-0.001787,-0.003574,0.0021,-0.00064,1.9e-05,-0.001672,-0.001393,0.00024,0.000323,-0.001256,0.000474,-0.001866,0.001053,-0.000467,-0.001575,-0.000386,-0.003811,0.000959,-0.000745,0.003874,0.00323,0.000724,-0.004471,-0.003241,-0.003099,-0.000252,-0.001,-0.002637,-0.001396,0.000278,0.000646,-0.001449,-0.000966,0.001079,-5e-05,-0.001815,-0.000664,0.000604,0.00158,0.001435,-0.000607,-0.000563,-0.000155,-0.000893,-0.000356,-0.000964,-0.000506,-0.000209,-0.000698,0.000448,0.000934,-9.7e-05,0.000226,-0.000811,-0.000482,0.000471,0.000526,0.000236,5.2e-05,-0.000292,-0.000129,-0.000545,-0.00028,-0.000227,-5.6e-05,8.4e-05,0.000325,0.000219,0.000354,-4.9e-05,-0.00035,0.000259,-4e-05,-0.000622,-0.000463,-0.000187,9e-06,0.000312,0.000262,0.000119,-0.000157
0.000375,0.000341,0.000395,0.000134,0.000314,1.6e-05,-4e-05,0.000569,9e-06,8.2e-05,-7.8e-05,-2.4e-05,6.1e-05,0.000268,4.9e-05,0,-8e-05,0.000127,-8.7e-05,0.000207,0.000421,-0.000121,0.000136,0.000414,-0.000395,0.000751,-0.00092,0.000203,0.000311,-0.000109,-0.000491,-0.000232,-8.9e-05,-0.000438,-0.001227,-0.001292,-0.00104,-0.000519,-0.006768,0.000936,-0.00269,0.002649,7.4e-05,-0.001108,0.000245,0.002514,0.001396,0.003178,-0.001972,-0.00126,0.001533,0.000822,0.001743,0.001098,0.002923,2e-04,0.000204,-0.000489,-0.00101,-0.001579,-0.002966,-0.000145,0.001482,0.002696,0.003236,-0.000213,-0.001551,0.000999,-0.000953,-0.001589,-0.000628,-0.001276,-1e-05,-0.001614,-0.00147,0.000505,-9.6e-05,-0.000701,-0.002418,-0.000395,-0.000658,4e-04,-0.000359,-0.00041,-5e-05,0.000115,-0.000393,0.000507,0.000241,-0.000242,-0.000407,0.000153,-0.000107,2.6e-05,3.2e-05,-0.000117,0.000255,-2.4e-05,-0.000202,4.3e-05,-0.00012,0.000218,-0.000165,3e-05,-2.8e-05,-0.000249,0.000298,6.6e-05,-0.000248,-0.00037,-8.5e-05,4.6e-05,-0.000181,0.000215,0.000105,0.000259,0.000327,8.4e-05,4.7e-05,-0.000193,-8.4e-05
-0.000127,-5.2e-05,-0.000158,-0.000116,-0.000187,-2.7e-05,7.2e-05,-0.000191,-1.2e-05,-0.000149,0.000125,0.000147,-8.3e-05,-0.000394,-4.3e-05,-0.000163,-0.000116,0.000135,-0.00019,-0.000182,-0.000298,0.000249,-1e-04,-0.000174,0.000171,-8.8e-05,0.000497,-0.000316,-0.000128,-0.00018,-0.000289,0.000149,0.000112,-0.000181,0.000538,6.7e-05,-0.000153,-0.000227,2.1e-05,0.001398,0.000964,-0.000653,0.000326,-0.000162,0.000876,0.001348,-0.000739,-0.000501,5.1e-05,0.000154,0.000494,-0.000697,-0.001742,-0.00084,-0.000673,-0.000826,0.001024,0.000342,0.00228,0.001802,0.001334,-0.00175,0.000155,-0.001857,-0.00269,-0.001282,-9.6e-05,-0.001292,5e-04,0.000613,0.000537,0.000185,0.000919,0.001191,0.001118,8.9e-05,-0.000887,-0.000304,0.000398,-8.6e-05,0.000455,-0.001114,-0.000904,-0.000511,-0.000342,-0.000343,0.000162,0.000111,0.000521,6.1e-05,0.000264,0.000137,0.000332,-0.000281,-0.000185,-0.000738,-0.000103,-0.000331,-0.000149,-0.000155,-1.9e-05,-0.000253,-0.000481,7.1e-05,-0.000106,3.3e-05,-0.000328,-0.000149,-0.000122,-0.000531,-0.000285,-0.000337,9e-06,-0.000366,-0.00023,-0.000337,-0.000347,-0.000246,-0.000185,-0.000443,-0.000147
0.000106,-2e-05,0.000136,4.9e-05,-1.5e-05,7e-05,2.5e-05,9e-05,0.000134,0.000189,-3.1e-05,-0.000227,8.8e-05,0.000115,-0.000148,0.000179,0.000219,8.6e-05,0.000203,6.2e-05,3.3e-05,-5.8e-05,9.5e-05,-0.000139,7.6e-05,-0.00075,0.000176,0.000255,-0.000615,-7.3e-05,0.000319,-2.2e-05,-0.000263,0.000138,0.00049,-0.000835,0.000301,-0.000442,0.002271,0.001651,0.001032,-0.000497,-0.000383,0.000818,-0.003057,-9.6e-05,0.00047,0.001855,0.000558,0.001103,-0.001661,0.001325,-0.000753,0.000344,-0.000383,0.001032,0.000439,-0.000612,-0.000235,-0.001259,0.001241,0.001858,-0.000409,-0.000179,0.000487,0.000581,0.000506,0.001692,8.1e-05,-0.000271,-0.000221,0.001055,-0.00028,0.000189,-0.000401,0.000654,0.00064,-5.3e-05,-0.000949,6.9e-05,-6.9e-05,0.000311,0.000279,0.000253,-0.000225,-0.000285,0.000235,0.000178,-0.000292,0.000163,-0.000295,0.000143,0.000136,0.000247,0.000203,0.000826,0.00018,3.1e-05,4.1e-05,-0.000125,-0.000141,-0.000131,0.000135,-0.000176,9.9e-05,-0.000201,-2.6e-05,-5.7e-05,0.000261,2e-06,-7.2e-05,-0.000256,7e-06,3e-06,8.2e-05,9.2e-05,1.1e-05,-0.000207,5e-06,0.000122,0
-0.00018,-1.3e-05,1.3e-05,6.8e-05,5.2e-05,-1.6e-05,-6.6e-05,-7.9e-05,-2.1e-05,-5.3e-05,-3.2e-05,0.000307,6.7e-05,-4e-06,3.4e-05,-0.000222,-7e-05,-5.1e-05,2.4e-05,1.6e-05,1e-06,0.000111,7.8e-05,-9.4e-05,-0.000179,7.6e-05,0.000395,-0.000176,0.000365,0.00033,-0.000241,-0.000178,0.00049,4.3e-05,-0.000484,0.000605,-0.000194,-0.00057,-0.000427,-0.001633,-0.002675,-9.5e-05,-0.000464,0.001152,0.000787,-0.00068,-0.000722,-0.000194,-0.001327,0.000491,0.001137,0.000776,0.002422,-0.00012,-0.000383,-0.000712,-0.001528,-0.00019,-0.002537,-0.000258,-0.00278,-0.002134,-5.9e-05,-0.000322,-0.000287,1.6e-05,0.000125,-0.001781,-0.000555,0.000862,0.000107,-0.000383,-0.000394,-0.000488,0.000269,-0.001158,-0.000212,0.00018,0.000643,0.00041,0.001025,0.000887,3.8e-05,-0.000157,-0.00026,0.000207,0.000125,6e-05,0.000224,-6e-04,-1e-05,0.000162,-0.000202,0.000244,0.000217,-0.000329,-0.000251,0.000143,0.00011,-9.8e-05,1.8e-05,6.1e-05,1.8e-05,0.00022,-7.4e-05,0.000114,0,-0.000296,-0.000147,-0.000121,0.000242,-8.5e-05,-6.2e-05,2.3e-05,-4.1e-05,-2.6e-05,-3.5e-05,4e-05,-4.3e-05,-1e-04,6.9e-05
-7.2e-05,0.000149,6.9e-05,-5e-06,-5.5e-05,3.1e-05,5e-05,4.3e-05,-2.5e-05,4e-05,8.3e-05,-0.000105,-9.2e-05,7.8e-05,-0.000162,-6.8e-05,-6.1e-05,6.5e-05,-8.6e-05,-2.2e-05,-4.2e-05,-8.9e-05,-8.4e-05,6.4e-05,0.000375,1e-05,-0.000401,-0.000218,-0.000168,-0.000525,0.000367,0.000157,-0.000352,-0.000109,0.000284,-0.000256,0.000222,-0.000217,-0.00022,-0.004,0.000773,-0.000823,0.000298,0.000174,0.00184,-0.000797,8.7e-05,0.001248,0.000817,-0.000337,-0.000332,0.001486,-0.000604,-0.000645,-0.000802,0.000951,0.000569,-0.001796,0.000561,-0.001396,0.00049,5.4e-05,0.000848,-0.000369,0.000158,0.001009,-0.000769,0.000422,0.000339,0.00085,0.000411,0.000234,-9.1e-05,-0.00011,-0.000275,-2.3e-05,-0.000554,0.000156,-0.000134,-0.000264,-0.000432,2e-06,0.00058,0.000378,0.000482,0.000443,-0.000231,-4.2e-05,-0.000311,0.000418,-0.000222,-0.000253,3.7e-05,7.7e-05,-1.9e-05,4.7e-05,1e-05,-4.7e-05,-8.2e-05,-6e-06,-2.2e-05,-0.000151,-0.000126,6e-06,4.8e-05,-0.000166,2.1e-05,-0.000126,-0.000108,-5.1e-05,-0.000231,1.9e-05,-0.000127,2.9e-05,-0.000105,-5.3e-05,5e-06,-0.000167,-9e-06,-4.6e-05,-0.000206
-4.6e-05,2.7e-05,3.6e-05,-1.8e-05,-7e-06,2.3e-05,3.7e-05,-7.9e-05,4.5e-05,9e-05,-6e-05,5.4e-05,8.1e-05,-0.000102,0.000115,-4.6e-05,5.8e-05,-9.5e-05,-8.1e-05,7.9e-05,6.8e-05,8.3e-05,9.1e-05,3e-05,-0.000292,-8e-05,-0.000482,0.00053,-6.4e-05,0.000398,-1.5e-05,-0.000125,0.000313,0.000142,-1.7e-05,0.000402,-0.000307,-4.6e-05,0.001155,0.000295,-0.000819,8.1e-05,0.000837,-0.000793,-0.002645,0.000371,-0.000745,-0.002243,-0.00072,-7.3e-05,-0.000117,-0.000766,-0.000145,7.5e-05,-0.000823,-0.000657,4.4e-05,0.000761,-0.00039,0.000963,-0.001205,0.000935,-0.000659,0.001117,0.000774,-0.001516,-2.5e-05,9e-06,-0.000289,0.000411,1.3e-05,8.8e-05,-0.000325,0.00013,0.000528,0.000333,5.2e-05,-6e-06,0.000118,0.000154,-3.9e-05,-0.000409,-0.000376,-0.000179,0.000104,-2.3e-05,7.2e-05,-6.3e-05,6.6e-05,-0.000144,3.9e-05,0.000242,-0.00011,0,6.8e-05,-4.7e-05,6.9e-05,-0.000226,7.2e-05,5e-06,-2e-06,1.3e-05,7.9e-05,0.000116,-1.9e-05,5e-05,-8.3e-05,-7.8e-05,8.4e-05,-1.8e-05,8e-05,0.000107,0.000142,9e-05,2.5e-05,7.5e-05,-6e-05,4e-06,-2.8e-05,9.2e-05,6.5e-05
4.8e-05,-7.1e-05,-1.5e-05,0,7e-05,-5.1e-05,3.2e-05,-9.2e-05,6e-05,-7e-05,5.2e-05,-6.1e-05,-9e-06,4.5e-05,-0.000127,-3.1e-05,-5.1e-05,0.000124,-2.1e-05,-9e-05,-7e-06,-9.1e-05,-5.7e-05,-2.9e-05,0.000192,0.000144,4.9e-05,-0.000619,2.3e-05,-5.5e-05,-0.000165,6.4e-05,-0.000144,-5.6e-05,-0.000134,-0.000425,0.000199,9.9e-05,-0.000504,-0.000608,0.000484,0.000171,-0.000505,0.001125,0.001388,-0.000783,0.000137,0.000392,0.001053,-0.000619,-0.000361,0.000198,-0.000603,6.6e-05,-0.000416,0.000364,-0.000743,-0.000954,0.000291,-0.000129,0.000988,-0.001471,0.000261,-7.5e-05,-0.000449,0.000792,2e-04,0.000222,0.00017,-0.000508,-0.00043,0.000119,-0.000333,-0.000482,-0.000265,0.000117,-3e-05,-0.000147,5.3e-05,-9.2e-05,0.000207,6e-05,0.000153,-0.000197,0.000114,4.9e-05,0.00023,3e-05,-4.7e-05,3e-05,-0.00017,-7.3e-05,-2.8e-05,-7.7e-05,-4.8e-05,0.000115,3.4e-05,0.000394,-6.2e-05,-1e-05,1.9e-05,-2e-06,6.8e-05,9.1e-05,-2e-06,1e-05,-1.1e-05,5.6e-05,-9.3e-05,1.1e-05,-0.000114,3e-05,5.5e-05,1.4e-05,0.000104,-1.8e-05,7.7e-05,-1.1e-05,3.8e-05,-3.1e-05,1.7e-05
0.000101,2e-06,-5.9e-05,1.2e-05,2.5e-05,5e-05,3.2e-05,5.4e-05,-7.3e-05,1e-06,-1.4e-05,-3.2e-05,-3e-05,2e-05,8e-06,3.9e-05,4.1e-05,2.2e-05,0.000104,7e-05,-1.1e-05,4.2e-05,8e-06,-5.4e-05,-9e-06,4.2e-05,0.000369,0.000335,0.000216,0.000126,0.000101,-3e-06,5.3e-05,2.3e-05,1e-05,0.000131,7.5e-05,-3.9e-05,1.3e-05,0.001041,-0.000223,-0.000891,-0.000662,-0.000675,0.000494,0.000667,0.000151,0.000354,0.000112,9e-06,0.000766,-2e-06,-0.000873,-8.2e-05,-4.6e-05,-0.000291,0.000345,0.000365,0.000461,-0.000148,0.000584,0.001047,0.000229,-3.9e-05,0.000111,9.1e-05,1.6e-05,1.6e-05,9.5e-05,-3.1e-05,0.000183,-1e-04,0.000203,0.000355,0.000286,4.6e-05,0.000351,7.2e-05,-0.000293,0.000194,-0.000246,0.000177,-0.000125,4.2e-05,-7.3e-05,-2e-06,-0.000188,6e-06,-3.7e-05,7.9e-05,4.4e-05,2.2e-05,-3e-05,-0.000107,1.5e-05,-8.9e-05,8e-06,6.9e-05,5e-06,-3.3e-05,-4.3e-05,1.7e-05,-4.7e-05,-5.9e-05,5.5e-05,1e-06,-4.9e-05,-4.3e-05,1.5e-05,-4.3e-05,7e-05,-2.6e-05,-4.3e-05,5.1e-05,2.8e-05,-2e-06,-0.000105,4.3e-05,-4e-06,-2.1e-05,-2.6e-05
-8.3e-05,-1e-06,4.3e-05,-1e-05,-2.4e-05,-1.7e-05,-1.3e-05,-6e-05,-4e-05,6.5e-05,1.4e-05,7.9e-05,3e-06,-4.9e-05,2.1e-05,3.8e-05,9e-06,0,1e-06,-3.5e-05,5e-06,1.2e-05,1.6e-05,5.1e-05,-7.1e-05,-4.7e-05,-0.000127,-0.000203,-7.9e-05,-9e-05,-7.2e-05,8.2e-05,-1.4e-05,1.1e-05,0.000125,-0.000338,-6.8e-05,5.6e-05,-0.000498,0.000497,0.000331,-0.000246,1.4e-05,0.000303,-0.000991,-0.000249,-0.000106,0.000607,-0.00031,0.000289,-0.000528,0.000581,0.000657,-0.000358,-5.4e-05,-0.000148,2.9e-05,0.000134,-0.000292,-0.000506,-0.000503,-0.000194,-3.7e-05,0.000203,-0.000228,-0.000152,0.000143,-0.000286,-2e-05,0.000265,-0.000118,-2e-06,0.000384,-0.00012,-0.000303,-7.2e-05,-8.9e-05,-5e-05,0.000191,-0.000126,7.8e-05,5.5e-05,-1.9e-05,-3.7e-05,-8.2e-05,-7.9e-05,-6.2e-05,-2e-05,0.000105,-5.2e-05,-5.7e-05,-4.8e-05,-1.4e-05,1e-05,-1.2e-05,6.4e-05,-2.8e-05,-8.2e-05,7e-06,-3.8e-05,-1.4e-05,-2.7e-05,-3e-06,4.2e-05,-2.6e-05,-1.6e-05,6e-05,3.1e-05,2.1e-05,5.8e-05,-2.5e-05,-2.4e-05,-9e-06,-9.3e-05,1.5e-05,-4.3e-05,0.000113,-5.2e-05,8e-06,-3.6e-05,7.6e-05
-1.4e-05,1.6e-05,-1.7e-05,1e-06,1e-05,-1.4e-05,2e-06,4.6e-05,-1.1e-05,-5.3e-05,-2.5e-05,-6e-06,-6e-06,1.3e-05,5e-05,-3.5e-05,9e-06,-3.1e-05,4.2e-05,1.3e-05,1.4e-05,4e-05,-1.3e-05,3.7e-05,0.000109,2e-06,4.3e-05,0.000126,8e-06,5.4e-05,3.2e-05,-8.8e-05,7.6e-05,-1.1e-05,-3.6e-05,0.000243,7.5e-05,3.6e-05,0.000184,0.000181,0.000383,0.00085,-0.000449,-0.0011,0.000446,-0.000141,-2.4e-05,-0.000438,0.000562,-0.000254,7.7e-05,-3.5e-05,-0.000301,-0.000168,0.00017,5.3e-05,2.6e-05,0.000125,0.000357,0.000366,0.000422,3e-05,-0.000516,-0.000181,0.000244,0.000105,-7.5e-05,0.000222,5e-06,-0.000111,-0.00023,8.6e-05,1e-06,0.000162,-3.8e-05,9.3e-05,-0.000226,4.6e-05,-6.1e-05,0.000235,-4.6e-05,0.000111,3e-05,-2.2e-05,3.9e-05,1.9e-05,5.6e-05,-3e-06,-0.00012,1.3e-05,0.000169,7.1e-05,3e-06,2.2e-05,-1.5e-05,-6e-05,-1.4e-05,-0.00014,-3.3e-05,-1.3e-05,2e-05,-4.4e-05,-4.4e-05,-1.9e-05,2.8e-05,4.3e-05,-1.2e-05,-6e-05,-3.5e-05,-2.2e-05,4.9e-05,-3.7e-05,2.9e-05,3.3e-05,-2.6e-05,5e-06,-3.5e-05,1.8e-05,-2.9e-05,-5.9e-05,-1.8e-05
-2.6e-05,5.3e-05,-8e-06,8e-06,1e-06,1e-06,1.7e-05,-3.9e-05,4.9e-05,3.3e-05,1e-06,6e-06,2.1e-05,-1.8e-05,-2.1e-05,6e-06,6e-06,-1e-06,-3.9e-05,-2.2e-05,-1.5e-05,1e-05,-3e-06,9e-06,-8.2e-05,0.000129,-4.2e-05,5.8e-05,3.3e-05,-3e-06,2.8e-05,5e-05,-6.1e-05,4e-06,-2.3e-05,-0.000214,-0.00012,1.5e-05,0.000526,-3.1e-05,-0.000207,0.00021,-9.9e-05,8.5e-05,-0.000247,-0.000409,-0.000163,-0.000141,4e-06,0.000103,0.00034,-5.5e-05,0.000142,5.1e-05,0.00011,-0.000119,-0.000265,-0.000219,-0.000363,-0.000118,-9e-05,0.000196,0.000469,0.00028,-5.2e-05,-0.000181,1.3e-05,-0.000112,-5.1e-05,-9.1e-05,-5e-06,0.00013,2e-06,-1.6e-05,0.000164,-0.000217,0.000244,-2.5e-05,0.00012,-0.000137,9.3e-05,-0.000305,-7e-06,5.4e-05,1e-06,7.9e-05,2.9e-05,-4e-05,6.9e-05,-5e-06,-7.9e-05,-3.2e-05,2.1e-05,2e-05,1.8e-05,2.9e-05,1e-05,0,-2.1e-05,-1.5e-05,5e-06,2.6e-05,5e-06,3.1e-05,-3e-05,-4.1e-05,2.2e-05,1.6e-05,2.4e-05,-6.8e-05,-1.9e-05,2.9e-05,0,0,-2.5e-05,0,1.6e-05,-4.1e-05,9e-06,-1.8e-05,8e-06
1.3e-05,1.4e-05,-4e-06,1.1e-05,5e-06,1.7e-05,1.2e-05,4e-05,-1.1e-05,1e-05,-6e-06,-7e-06,-6e-06,1.6e-05,1.1e-05,3e-06,1.9e-05,-1.8e-05,1.9e-05,2.6e-05,2e-06,-2e-06,-1e-05,-2e-05,2.4e-05,-9e-05,1.4e-05,-0.000113,1.1e-05,-7.2e-05,-9e-06,-4.8e-05,5.1e-05,7e-06,-3.6e-05,0.000138,5.1e-05,1e-06,-0.00026,-0.000177,2.8e-05,-0.000681,-0.000124,0.000372,0.00031,4.5e-05,0.000172,-0.00049,2e-05,-7.3e-05,-0.000425,0.000119,-0.000349,-9.2e-05,0.000237,-0.000155,0.000192,9.2e-05,4.5e-05,0.00021,-9.3e-05,-0.00027,4e-05,-0.000244,4e-06,0.000146,0.000152,0.000162,2e-05,-0.000171,-0.000105,-1e-05,-6.4e-05,3.4e-05,-1e-04,0.000121,-4.8e-05,-4.3e-05,-0.00019,-3e-06,-5.7e-05,2.4e-05,-1.8e-05,3.7e-05,5e-05,2.3e-05,-4.6e-05,2e-05,-8.1e-05,-1.6e-05,6.5e-05,-6.1e-05,-5.3e-05,3.8e-05,-2.3e-05,4.1e-05,8e-06,-4.5e-05,2.5e-05,-1e-06,-7e-06,-5e-05,-2.2e-05,6e-06,1.4e-05,2.7e-05,-1.1e-05,-1.3e-05,-2.7e-05,-3e-06,-6e-06,-2.2e-05,-1.3e-05,6e-06,4e-06,-1e-06,-2.5e-05,3.4e-05,6e-06,1.9e-05,-2e-05
1.2e-05,-3.3e-05,-1e-06,3e-06,-1e-06,-2.1e-05,1e-05,-2.6e-05,-1.9e-05,-2.9e-05,7e-06,1.5e-05,0,-1.6e-05,0,-2.4e-05,-1.5e-05,3.5e-05,1e-06,-1e-06,1e-06,-1e-05,7e-06,-2.3e-05,3.6e-05,-1.5e-05,-4.5e-05,2.3e-05,-7.3e-05,0.000129,-3e-06,1.6e-05,-2.1e-05,-1e-05,5.4e-05,-0.000113,-2.1e-05,-2.2e-05,-5e-06,0.000437,-0.000208,0.000288,9.9e-05,-0.000374,-0.000391,0.000476,-6.4e-05,9.3e-05,-9.8e-05,-0.000143,1.2e-05,-0.000142,-6e-05,0.000111,0.000127,1.2e-05,0.000118,-5.1e-05,0.000187,-0.000218,8.6e-05,-9e-06,-2.5e-05,0.000147,-7.7e-05,0.000136,-0.000222,-0.000209,4e-06,8e-06,1.3e-05,-9.9e-05,0.000113,5.1e-05,6.5e-05,9.3e-05,-6e-06,7.1e-05,7.7e-05,7e-05,-7.6e-05,6.2e-05,-7.5e-05,-4e-06,-3.5e-05,3.2e-05,-1e-06,-1.1e-05,4.7e-05,3.8e-05,-4.8e-05,2.5e-05,3.3e-05,3e-06,3e-05,-6e-05,-5e-06,7.7e-05,-1.1e-05,-1.9e-05,-1.5e-05,3e-06,1.8e-05,-1e-06,2e-06,-1.8e-05,1.1e-05,1e-05,-1.5e-05,1e-06,8e-06,-1.6e-05,-3e-06,1.5e-05,1.1e-05,1.5e-05,2.8e-05,-1.9e-05,1e-06,-1.5e-05,-5e-06
2.9e-05,-1e-05,-7e-06,-1.3e-05,1.1e-05,5e-06,1e-06,3.9e-05,5e-06,3.2e-05,-1.4e-05,-2.8e-05,-8e-06,2.5e-05,1e-05,3.2e-05,1.2e-05,-1e-06,-2.1e-05,-2.3e-05,-2.1e-05,7e-06,-9e-06,8e-06,-7.4e-05,4.7e-05,-6.1e-05,-1e-06,6.5e-05,-0.000122,4.1e-05,1.2e-05,2.2e-05,1.3e-05,5e-06,-1e-06,-1.8e-05,0,0.000431,9.9e-05,0.000231,-3.5e-05,8.3e-05,0.000107,0.000386,-2.1e-05,4.3e-05,-8.4e-05,4.4e-05,5.6e-05,0.000178,-8.7e-05,0.000357,-0.00021,6.4e-05,3e-05,-0.000127,4.8e-05,-0.000246,0.000122,-4e-06,0.000104,-3.7e-05,-0.000326,-9e-06,-0.000133,-7.8e-05,0.00028,9e-06,5.3e-05,4.7e-05,0.00012,6.4e-05,5.5e-05,-9.4e-05,5e-06,-4.2e-05,-3.3e-05,-9.3e-05,2e-06,2.7e-05,6.2e-05,6e-05,-2.5e-05,4e-06,4.8e-05,5e-06,-2.6e-05,2.2e-05,-3.9e-05,1.3e-05,-3.1e-05,-1.4e-05,-1.6e-05,-1.1e-05,7e-06,-5e-06,-8.9e-05,3.1e-05,-1.5e-05,1.3e-05,1.3e-05,-1e-05,2.7e-05,-1.4e-05,-1e-06,8e-06,-3.8e-05,8e-06,0,-1.8e-05,-1.3e-05,2.9e-05,1.8e-05,9e-06,-1.4e-05,-1.8e-05,-1.2e-05,-7e-06,1.2e-05,-9e-06
-3.5e-05,1.7e-05,-1.3e-05,-4e-06,2e-06,7e-06,-4e-06,-3e-06,-3e-06,-1.5e-05,3e-06,1.1e-05,-3e-06,-3.1e-05,-1.2e-05,-1.4e-05,1.2e-05,-3e-06,-5e-06,1.8e-05,1.3e-05,-7e-06,-1e-06,2e-05,6.8e-05,-5.7e-05,6.8e-05,1e-06,2e-06,5.7e-05,-2.5e-05,-4e-05,-2e-05,-8e-06,-3.2e-05,-1.3e-05,2.4e-05,1.2e-05,-0.000326,8.4e-05,-4.3e-05,-0.000493,0.000142,8.3e-05,-0.000113,-3.5e-05,3.2e-05,0.000101,0.000251,7.4e-05,1.7e-05,-0.000199,-8.2e-05,-4.4e-05,0.000108,4.6e-05,-1.6e-05,-0.000121,0.000107,-0.000155,9.2e-05,-2.1e-05,0.000117,6.3e-05,4.4e-05,-5.8e-05,6.4e-05,-0.000213,-7.3e-05,4.2e-05,1e-06,1e-06,-2.9e-05,-0.000124,7e-05,-3.5e-05,-4.6e-05,1.2e-05,0.000146,1.6e-05,-1e-04,-6.6e-05,-2e-05,-5.7e-05,2.2e-05,-5e-06,5e-05,-6e-06,-4.4e-05,-1e-05,-1e-05,3e-05,-1e-05,-2.1e-05,-1.8e-05,1.1e-05,-9e-06,1.1e-05,-1.8e-05,-5e-06,0,-3e-05,3.7e-05,-1.5e-05,1e-06,9e-06,-3e-06,-1.3e-05,1.2e-05,-1.8e-05,1e-06,1.9e-05,-1.6e-05,1.1e-05,6e-06,4e-06,2e-06,-9e-06,1e-06,7e-06,-5e-06
-1.4e-05,1e-05,1.1e-05,7e-06,-3e-06,-1e-05,5e-06,8e-06,-6e-06,-7e-06,7e-06,-2e-06,3e-06,8e-06,-1e-05,-1.7e-05,-4e-06,-1.2e-05,1.9e-05,1e-06,1.2e-05,1.5e-05,9e-06,0,-4.1e-05,-6e-06,8.3e-05,-3e-05,-2.3e-05,1.3e-05,8e-06,3.3e-05,3.3e-05,-3e-06,3.9e-05,-4e-06,5.8e-05,-6e-06,1.5e-05,-0.000247,-7.6e-05,2.2e-05,-2.4e-05,-3.8e-05,-0.00044,-7.2e-05,-0.000147,-0.000112,-0.000195,-8.5e-05,-7.8e-05,-4.1e-05,0.000225,0,3.2e-05,7.1e-05,4e-05,-3.1e-05,-2.5e-05,8.7e-05,-5.1e-05,-0.000253,-0.000249,4.7e-05,1e-06,0.00016,-5e-06,0.000105,-2e-06,-0.00015,6.9e-05,5.2e-05,1.1e-05,0.000147,2.3e-05,-6e-05,6.7e-05,1.7e-05,-0.000134,2.9e-05,9.3e-05,1.4e-05,6.1e-05,1.1e-05,2e-05,-2.5e-05,-6.5e-05,1.5e-05,3.9e-05,5e-05,1e-05,-5.3e-05,2.2e-05,-1e-06,2e-05,0,-2e-06,2.2e-05,8e-06,2e-06,1e-06,0,-1.9e-05,-2e-06,3e-06,-1e-05,-9e-06,-7e-06,-1.2e-05,-4e-06,6e-06,5e-06,-1e-05,-1.3e-05,2e-06,-1e-05,5e-06,1e-05,2e-06,-1.8e-05,2.2e-05
-5e-06,-7e-06,-7e-06,0,1.9e-05,1e-06,5e-06,4e-06,-1.3e-05,1.6e-05,-6e-06,-1e-05,4e-06,9e-06,-8e-06,4e-06,1.3e-05,-2.3e-05,9e-06,-1e-06,-8e-06,-4e-06,-2e-06,-1.4e-05,-5e-06,4.2e-05,-3.9e-05,2.2e-05,-2e-06,-1e-05,-1.8e-05,-2e-05,-3.1e-05,1.2e-05,1.9e-05,-5.9e-05,-9.3e-05,-1.2e-05,3.3e-05,-0.000269,-7.7e-05,0.00045,8.1e-05,0.000182,0.000515,9.8e-05,7.1e-05,0.000192,-0.000145,1.8e-05,-3.1e-05,-7e-05,-0.00021,3.6e-05,5e-06,3e-06,1.7e-05,-0.000178,-5.2e-05,-8.3e-05,-0.000192,0.000254,1.6e-05,-1.5e-05,0.000105,-9.9e-05,1.5e-05,-4.2e-05,2.8e-05,-0.000115,-1e-06,-2.5e-05,-9.1e-05,-8.8e-05,-1e-04,3.1e-05,-4.2e-05,-2.4e-05,8.9e-05,-2e-06,3.3e-05,6.4e-05,-6e-05,-6e-06,-4e-06,-2e-06,1e-05,1.5e-05,-5e-05,-7.2e-05,-4.7e-05,2.8e-05,-1.3e-05,3e-06,-1.7e-05,-2.1e-05,5e-06,3.7e-05,-1.1e-05,-4e-06,-7e-06,-7e-06,-7e-06,-9e-06,-8e-06,4e-06,-4e-06,-8e-06,1e-05,1.2e-05,5e-06,1.1e-05,1.7e-05,8e-06,-6e-06,1e-06,-1.3e-05,-1.1e-05,-4e-06,-3e-06,-1.4e-05
1e-06,4e-06,-7e-06,-2e-06,-1.3e-05,4e-06,4e-06,-6e-06,1.8e-05,-1.7e-05,1e-06,3.1e-05,1e-06,-6e-06,1e-06,-8e-06,-5e-06,1.6e-05,-9e-06,-1.2e-05,0,-3e-06,-7e-06,-9e-06,3.4e-05,-2e-06,-6e-05,3e-06,2.8e-05,7e-06,1.1e-05,1e-05,3e-05,-1.2e-05,-5.7e-05,4e-05,3.9e-05,5e-06,-2.2e-05,-0.000373,0.000255,-0.000179,-2.8e-05,-0.000302,-0.000162,5.5e-05,-3.1e-05,-0.000107,0.000332,3.1e-05,4.2e-05,-1.7e-05,0.000102,-4.4e-05,-0.000143,6.5e-05,-9.2e-05,0,-3e-06,7.6e-05,8e-05,-0.000172,0.000204,0.00013,-0.000129,-2.8e-05,-1.6e-05,5.6e-05,1.4e-05,-1.1e-05,8e-06,1.3e-05,-5.8e-05,3.1e-05,8.7e-05,1.9e-05,9e-06,-1.1e-05,-0.000108,4e-06,-2.7e-05,4e-06,-4e-06,2.3e-05,-1.3e-05,-5e-06,4e-06,9e-06,4.9e-05,5.5e-05,-3e-06,-1e-06,5e-06,1.3e-05,2.1e-05,1.3e-05,-1e-06,-4.8e-05,1.2e-05,-1.6e-05,5e-06,-3e-06,-1.7e-05,-1.8e-05,3e-06,-2e-06,4e-06,-3e-06,1.3e-05,4e-06,8e-06,-1.5e-05,1e-06,-9e-06,0,1e-06,1.2e-05,1.5e-05,4e-06,-1.5e-05,1.3e-05
2.1e-05,-2e-06,8e-06,1e-06,7e-06,-3e-06,0,1e-05,4e-06,1e-05,2e-06,-2e-05,0,-1e-05,-1e-06,-1e-06,6e-06,8e-06,-1.4e-05,1.1e-05,0,1e-06,7e-06,1e-05,-4.7e-05,-3.2e-05,-4.5e-05,-1.8e-05,-1.4e-05,-4e-06,1.4e-05,-5e-06,-1.9e-05,3e-06,-1.2e-05,-6.4e-05,-3.1e-05,1.1e-05,0.00014,-4.9e-05,-0.000124,-0.000154,-7.8e-05,0.000144,-4e-05,-8.8e-05,-2.9e-05,-7.7e-05,-1.8e-05,5.2e-05,-1.6e-05,-6.7e-05,9.4e-05,-2e-05,-3.7e-05,0,4.3e-05,1.8e-05,-4e-05,-0.000119,0.000154,7.3e-05,-3e-05,-4.2e-05,6.5e-05,6.6e-05,2.6e-05,-1.3e-05,-2.5e-05,9.3e-05,4.9e-05,7.2e-05,-5.4e-05,-6e-06,-5.2e-05,-1.1e-05,4.4e-05,1.3e-05,8.5e-05,5e-06,2.5e-05,4.4e-05,-1.4e-05,3.1e-05,0,7e-06,2e-05,-7e-06,-3e-05,-1e-05,6e-06,-1.1e-05,3e-06,4e-06,-2.2e-05,-4e-06,0,6e-06,-8e-06,-5e-06,2e-06,-1.1e-05,1.2e-05,-6e-06,-7e-06,1e-06,-5e-06,-1.2e-05,-1.8e-05,-1.8e-05,-7e-06,-1.2e-05,-1e-06,0,5e-06,-5e-06,-1.2e-05,-1.5e-05,-2e-06,-1.6e-05,-4e-06
-5e-06,-5e-06,-1e-06,0,1e-06,-2e-06,-5e-06,-1.6e-05,-1e-05,2e-06,3e-06,-1e-06,-2e-06,6e-06,1e-06,1.4e-05,1e-06,1e-06,0,-3e-06,-1e-06,-1e-06,1e-06,1e-05,3.3e-05,3.8e-05,5.9e-05,5.1e-05,0,1.3e-05,-1.9e-05,8e-06,1.6e-05,7e-06,5.1e-05,2.9e-05,3.4e-05,-1e-06,-8.7e-05,0.000335,-5e-06,0.000227,-4.1e-05,6e-05,6.1e-05,2.2e-05,8.9e-05,-2.2e-05,-9.4e-05,-6.9e-05,3.8e-05,-6.4e-05,-6.5e-05,-7.9e-05,-5.1e-05,-1.5e-05,1e-05,5.1e-05,0.000118,3.6e-05,-0.000162,8.5e-05,-3.1e-05,-2e-06,-5.8e-05,-4e-06,4.6e-05,-6.8e-05,-1e-05,3e-05,-3.7e-05,-7.3e-05,1.7e-05,-2.2e-05,6.3e-05,1.7e-05,1.9e-05,-1.2e-05,-5.7e-05,3.4e-05,-3.5e-05,-8.7e-05,4e-05,-6e-06,6e-06,3e-05,-2.9e-05,-1.4e-05,2e-06,-1.1e-05,-2e-06,4e-06,-7e-06,-2e-06,1.1e-05,-1e-06,-3e-06,1.2e-05,-4e-06,-6e-06,1e-06,1e-06,-2.4e-05,-1.6e-05,3e-06,2e-06,4e-06,1e-06,1.7e-05,-7e-06,1e-06,0,-2e-06,4e-06,4e-06,1.3e-05,9e-06,7e-06,-1e-06,1e-05,-5e-06
-1.1e-05,8e-06,-1e-06,3e-06,0,3e-06,0,9e-06,-9e-06,-1.2e-05,-6e-06,3e-06,-1e-06,7e-06,3e-06,-1e-05,5e-06,-5e-06,1.6e-05,-2e-06,4e-06,-5e-06,-9e-06,-2e-06,-9e-06,9e-06,2e-05,-4.1e-05,1.1e-05,-4.3e-05,7e-06,-2.6e-05,-1.5e-05,-1.1e-05,-8e-06,-4.3e-05,1.7e-05,-7e-06,-1.7e-05,0.000152,3.9e-05,-0.00014,-7e-06,-0.000138,-1.6e-05,-1.4e-05,-6e-05,0.000154,-2.3e-05,-0.000117,8e-06,4.3e-05,5.7e-05,-3.6e-05,-4.5e-05,-4.1e-05,-9e-06,5e-06,-1.6e-05,-7.4e-05,0.00013,-0.000122,5.7e-05,1.8e-05,4.9e-05,-2e-05,-2.6e-05,8e-05,2.1e-05,-5.6e-05,6e-06,5.8e-05,4.4e-05,7e-06,-5.4e-05,-4e-06,-1e-06,8e-06,5.2e-05,-3.6e-05,2.9e-05,-3.6e-05,1.1e-05,-8e-06,1.1e-05,1.4e-05,1e-06,7e-06,2.2e-05,1.6e-05,2.3e-05,-1e-06,0,2e-06,3e-06,1.1e-05,-2e-06,-2e-06,2e-06,4e-06,-4e-06,3e-06,6e-06,3e-06,8e-06,-1e-06,-6e-06,-7e-06,-1.3e-05,7e-06,-6e-06,6e-06,-2e-06,7e-06,-2e-06,-1.4e-05,-2e-06,-4e-06,1e-06,0,8e-06
-1.4e-05,5e-06,0,-5e-06,0,0,1e-06,-2e-05,9e-06,9e-06,5e-06,-1.6e-05,-2e-06,-1.4e-05,1e-06,-2e-06,-3e-06,-1e-05,3e-06,5e-06,0,5e-06,5e-06,-7e-06,-1.8e-05,-3.6e-05,-2.9e-05,2.2e-05,6e-06,4.6e-05,7e-06,2.3e-05,1.7e-05,7e-06,-3.6e-05,3.5e-05,-5e-05,2e-06,0.000172,3.4e-05,1.5e-05,-0.000248,-3e-05,0.000179,-2.1e-05,-3e-06,-1e-05,8.3e-05,0.000129,7.9e-05,-6.7e-05,-1.4e-05,-0.000155,7e-06,-4e-06,-3.3e-05,6e-06,4.8e-05,-7.2e-05,9.3e-05,-9.2e-05,0.000117,-1.9e-05,-6e-05,-2.5e-05,3.6e-05,-1.3e-05,-5.1e-05,1.8e-05,-3.9e-05,7e-06,-7.4e-05,2.7e-05,2.2e-05,-1.5e-05,-4.6e-05,-1.6e-05,9e-06,-5e-05,5e-05,-3e-05,2.2e-05,-2.4e-05,-1.6e-05,-1e-06,-2e-06,1.8e-05,1.1e-05,-3.3e-05,-1.6e-05,-6e-06,2.5e-05,7e-06,-7e-06,-1.2e-05,-1.2e-05,2e-06,-2.9e-05,9e-06,-6e-06,1e-06,-2.2e-05,2e-06,-8e-06,-1e-05,-3e-06,6e-06,8e-06,-4e-06,-9e-06,7e-06,-1e-06,8e-06,3e-06,-3e-06,9e-06,5e-06,0,4e-06,-2e-06,-1e-05
1e-06,-9e-06,2e-06,-1e-06,6e-06,-2e-06,1e-06,8e-06,7e-06,-4e-06,-3e-06,2e-05,3e-06,8e-06,3e-06,4e-06,6e-06,-7e-06,-7e-06,-3e-06,-6e-06,-7e-06,1e-06,-5e-06,3.1e-05,2.9e-05,1e-05,8e-06,-1.8e-05,-1.9e-05,0,-1.5e-05,-1.7e-05,1e-06,3.8e-05,-5.4e-05,4.5e-05,6e-06,-0.000169,-0.000105,8e-06,7.5e-05,-1.2e-05,-0.000108,-5.5e-05,-3.1e-05,-3e-06,1.3e-05,0.000103,0.000117,-9e-06,7.6e-05,5.4e-05,2.6e-05,2.1e-05,-2e-06,3e-06,2e-06,9.5e-05,-5e-05,4.8e-05,-4.5e-05,-0.000116,3.2e-05,-9e-06,-1.3e-05,1e-06,6.5e-05,-1.7e-05,3.9e-05,-3.2e-05,6.9e-05,7e-06,-4.1e-05,7.2e-05,6e-06,1.3e-05,-8e-06,1.2e-05,-1.6e-05,7e-06,2.1e-05,-6e-06,-1.5e-05,-6e-06,0,5e-06,2e-06,3.3e-05,7e-06,-2e-06,-2.9e-05,-1.5e-05,0,1.4e-05,5e-06,1e-06,1.2e-05,-7e-06,-2e-06,1e-06,8e-06,1.6e-05,-1e-05,1e-05,6e-06,-2e-06,-9e-06,1e-05,-7e-06,-6e-06,-5e-06,-5e-06,2e-06,1e-06,-7e-06,-8e-06,-4e-06,-5e-06,1e-05,7e-06
6e-06,-4e-06,3e-06,4e-06,0,0,0,-1.2e-05,-1.1e-05,-4e-06,0,-8e-06,0,-5e-06,3e-06,-6e-06,-1e-06,1.1e-05,-4e-06,-2e-06,1e-06,2e-06,-5e-06,7e-06,-2.9e-05,-4e-06,6e-06,-2.5e-05,9e-06,-1.4e-05,-4e-06,4e-06,1.3e-05,-8e-06,6e-06,3.4e-05,-3e-05,-1e-06,1.3e-05,1.6e-05,-0.00015,0.000132,2.2e-05,8.6e-05,0.000131,2.2e-05,-2.5e-05,2.8e-05,-0.000155,-0.000134,4.4e-05,1e-05,-3.8e-05,-2.1e-05,2e-06,-4e-06,1.2e-05,1e-05,-3.5e-05,2.8e-05,1e-05,-3e-06,8.2e-05,-4.4e-05,6e-06,-4e-05,1.1e-05,-7.5e-05,-2e-05,7.3e-05,1.8e-05,-4.6e-05,1.3e-05,5.3e-05,-5.7e-05,3.9e-05,3e-06,-7e-06,-1.3e-05,-2e-06,2.1e-05,-4.2e-05,7e-06,3e-06,-2e-06,-1.1e-05,-1.6e-05,-8e-06,-3.4e-05,-3e-06,-3e-06,1.3e-05,1.7e-05,-4e-06,-1.1e-05,9e-06,1e-06,0,1.2e-05,-9e-06,-1e-06,-1e-06,-1.3e-05,-4e-06,-5e-06,-6e-06,4e-06,-3e-06,-1.1e-05,2e-06,5e-06,-3e-06,-1e-06,1e-06,2e-06,2e-06,9e-06,6e-06,-3e-06,-4e-06,-4e-06
1.2e-05,8e-06,-5e-06,0,-1e-06,2e-06,-3e-06,8e-06,-3e-06,4e-06,1e-06,5e-06,-1e-06,1e-06,0,4e-06,1e-06,4e-06,6e-06,1e-06,3e-06,-2e-06,3e-06,6e-06,1.2e-05,-2.6e-05,-1.4e-05,2.5e-05,0,2.8e-05,0,1.2e-05,-8e-06,8e-06,-2.9e-05,-4.8e-05,1.9e-05,-5e-06,7.2e-05,4.6e-05,0.000137,-0.000131,1.6e-05,1.3e-05,-6.8e-05,1.4e-05,4.2e-05,-5.5e-05,3.2e-05,3.3e-05,3.6e-05,5.4e-05,6e-06,-5.6e-05,8e-06,0,-2e-05,-2e-06,-6.1e-05,-5e-05,-7.1e-05,-2.1e-05,7.7e-05,-1e-06,-1.4e-05,4.7e-05,-8e-06,9.3e-05,1.7e-05,1.6e-05,-1.1e-05,-7e-06,1.4e-05,-3.6e-05,2.4e-05,-6e-06,-4.3e-05,1.1e-05,1.1e-05,-1e-06,-1.7e-05,-3.5e-05,2.6e-05,1.7e-05,3e-06,-1.5e-05,-7e-06,3e-06,3e-05,5e-06,1.8e-05,6e-06,-1e-05,4e-06,1.1e-05,-1.1e-05,1e-06,1.9e-05,-1.3e-05,-1e-06,-1e-06,-1.4e-05,0,-1e-05,4e-06,6e-06,-4e-06,-9e-06,4e-06,8e-06,-1e-06,1e-06,3e-06,-6e-06,3e-06,0,-6e-06,-9e-06,4e-06,-8e-06,1e-06
-6e-06,1e-06,5e-06,0,1e-06,-2e-06,-2e-06,-4e-06,8e-06,-3e-06,3e-06,-2e-06,0,0,-4e-06,0,3e-06,4e-06,0,6e-06,0,0,2e-06,-5e-06,8e-06,1.2e-05,-1.7e-05,-1.5e-05,-3e-06,-1.8e-05,-4e-06,-1.4e-05,5e-06,-3e-06,2e-06,2.4e-05,-2.3e-05,0,-5.4e-05,7.3e-05,-3.6e-05,0.000129,1.5e-05,-0.000137,-6.5e-05,-5.6e-05,-1.9e-05,1e-05,0.000122,0,-5.8e-05,7e-06,-2e-06,-4.8e-05,2.7e-05,2.7e-05,1e-05,-1.7e-05,4.5e-05,4.8e-05,9.9e-05,2.9e-05,-4.1e-05,-2e-06,5.6e-05,-1.8e-05,-2.3e-05,-7.3e-05,1.2e-05,-3.2e-05,-1.3e-05,3.2e-05,2.5e-05,1.7e-05,-1.6e-05,-4e-06,8e-06,-4e-06,3e-06,5e-06,1.2e-05,3.8e-05,-1.1e-05,1.2e-05,3e-06,5e-06,1.9e-05,0,-1.2e-05,-1e-06,-2.5e-05,0,2e-06,3e-06,-8e-06,4e-06,-1e-06,-3e-06,9e-06,0,1e-06,7e-06,-7e-06,-2e-06,1e-06,-5e-06,2e-06,-1e-06,7e-06,-3e-06,1e-06,7e-06,1e-06,-2e-06,0,-4e-06,4e-06,7e-06,3e-06,0,-1e-06
-7e-06,-3e-06,0,0,2e-06,-1e-06,0,6e-06,4e-06,1e-06,-2e-06,-6e-06,0,4e-06,-1e-06,-5e-06,-2e-06,-7e-06,-7e-06,-7e-06,3e-06,4e-06,-4e-06,-6e-06,-2.2e-05,1.4e-05,-4e-06,-1e-05,-2e-06,8e-06,1e-05,5e-06,-6e-06,-3e-06,2.1e-05,-3e-05,1.6e-05,4e-06,2.8e-05,1.7e-05,-4.9e-05,2.1e-05,-1e-06,0.000106,0.000139,2.3e-05,5e-06,-2.1e-05,-2.1e-05,7e-06,3.7e-05,7e-06,-5.8e-05,0,1.6e-05,2.2e-05,5e-06,-4.1e-05,-2.8e-05,-4e-05,-4e-05,-5.7e-05,-2.8e-05,-5e-06,-4.4e-05,-2.2e-05,-2e-06,3.8e-05,-1.4e-05,-2.7e-05,7e-06,-4.8e-05,2.2e-05,0,1.2e-05,-2e-06,-1.9e-05,-3e-06,-1.8e-05,0,-1.9e-05,2.2e-05,-6e-06,6e-06,4e-06,9e-06,-3e-06,-3e-06,-1.1e-05,-1e-06,2e-05,-3e-06,6e-06,3e-06,0,-2e-06,0,-1.5e-05,-6e-06,-1e-06,0,-3e-06,3e-06,-5e-06,-6e-06,2e-06,-2e-06,-2e-06,-8e-06,-1e-06,-3e-06,-2e-06,0,1e-06,0,7e-06,-4e-06,-5e-06,-4e-06,-7e-06,-2e-06
-9e-06,-2e-06,-1e-06,0,-1e-06,2e-06,0,2e-06,-8e-06,-1e-06,-2e-06,9e-06,-1e-06,-1e-05,-1e-06,2e-06,2e-06,-9e-06,-1e-06,-1e-06,-2e-06,-1e-06,2e-06,0,2.3e-05,-2e-05,4.1e-05,1.3e-05,8e-06,-1e-05,-5e-06,2e-06,7e-06,7e-06,-7e-06,2.2e-05,5e-06,0,6e-06,-6.5e-05,-1e-05,-0.000132,9e-06,-6.6e-05,-0.000124,-7e-06,-1.9e-05,4.3e-05,-6.8e-05,-1e-06,-1.6e-05,-1e-05,3.5e-05,1.3e-05,-2e-06,8e-06,-1.8e-05,3e-06,4.1e-05,3.7e-05,-1e-05,2.9e-05,5.6e-05,3.9e-05,3.4e-05,2.4e-05,3e-06,-3e-05,-1.8e-05,4.3e-05,-1.6e-05,5.9e-05,-9e-06,-9e-06,1.3e-05,-1.4e-05,1.7e-05,1e-06,1.4e-05,-2e-06,1.6e-05,2.7e-05,-5e-06,-1.1e-05,-7e-06,2e-06,-6e-06,0,2.5e-05,-8e-06,-2.2e-05,-6e-06,-1e-05,-2e-06,8e-06,4e-06,0,9e-06,1e-06,-5e-06,-1e-06,-8e-06,-1.2e-05,0,4e-06,0,2e-06,0,2e-06,-5e-06,-2e-06,-5e-06,-4e-06,2e-06,0,-1.1e-05,4e-06,3e-06,-3e-06,-1e-06,7e-06
1e-06,-1e-06,2e-06,2e-06,1e-06,-1e-06,1e-06,3e-06,-3e-06,-2e-06,3e-06,-1.1e-05,0,4e-06,0,-1e-06,1e-06,5e-06,5e-06,5e-06,-4e-06,1e-06,2e-06,5e-06,-1.3e-05,2e-06,-5e-06,-1.4e-05,-3e-06,2e-05,2e-06,-1e-05,-8e-06,-6e-06,-9e-06,-3e-05,3e-06,-3e-06,-2.4e-05,-7.4e-05,0.000101,-9.1e-05,-1e-06,-1.3e-05,1.1e-05,1.2e-05,-1.1e-05,-1e-06,-2.1e-05,-1.5e-05,-5e-06,-2.3e-05,-6e-06,-1e-05,-1.3e-05,7e-06,1e-06,-7e-06,-4.9e-05,-4.1e-05,2e-06,9e-06,-5.3e-05,-3e-05,-4.8e-05,2e-06,5e-06,2.4e-05,6e-06,5.6e-05,2e-06,-7.3e-05,-2.8e-05,6e-06,-3.5e-05,1.4e-05,-5e-06,-2e-06,-2.9e-05,1e-05,9e-06,-2.5e-05,1.1e-05,-1.1e-05,0,9e-06,-6e-06,-4e-06,-2.7e-05,1.3e-05,1.3e-05,1.7e-05,6e-06,-4e-06,-1e-05,-1e-05,0,4e-06,-3e-06,-6e-06,-1e-06,-1e-06,-1e-06,3e-06,-2e-06,0,-2e-06,-2e-06,3e-06,4e-06,1e-06,-5e-06,5e-06,2e-06,0,1.1e-05,-5e-06,-2e-06,4e-06,5e-06,-5e-06
8e-06,-1e-06,-1e-06,-2e-06,5e-06,-1e-06,-2e-06,5e-06,7e-06,2e-06,-1e-06,8e-06,1e-06,6e-06,-3e-06,-2e-06,1e-06,5e-06,7e-06,0,3e-06,-3e-06,-3e-06,2e-06,-2e-06,2.5e-05,-3.4e-05,8e-06,-2e-06,-2.4e-05,-1e-06,3e-06,7e-06,1e-06,-4e-06,8e-06,-2.6e-05,-1e-06,4.8e-05,-9.6e-05,-2.8e-05,6.1e-05,-2.1e-05,5e-05,7.3e-05,-4.3e-05,4e-05,3.6e-05,2.8e-05,1.8e-05,-2.5e-05,-1e-05,2.5e-05,-2.9e-05,-1.7e-05,-1.8e-05,1.6e-05,-8e-06,1.2e-05,2.2e-05,5e-06,-2.7e-05,-1.3e-05,4.2e-05,2.3e-05,-1.3e-05,4e-06,-7e-06,1.8e-05,1e-06,-1e-06,5.7e-05,-6.4e-05,8e-06,2.5e-05,-3e-06,-1.2e-05,-4e-06,3.7e-05,-1.4e-05,-1.7e-05,-1e-06,1e-06,-8e-06,-1e-06,5e-06,1.7e-05,-2e-06,2.6e-05,-1.2e-05,-1.3e-05,-1.4e-05,-1e-06,0,8e-06,8e-06,1e-06,-5e-06,3e-06,1e-06,1e-06,2e-06,0,0,-3e-06,-2e-06,-1e-06,-5e-06,-3e-06,-1e-06,0,2e-06,2e-06,2e-06,0,-8e-06,3e-06,2e-06,1e-06,-3e-06,4e-06
3e-06,4e-06,1e-06,-1e-06,-6e-06,1e-06,-2e-06,-1e-06,0,-1e-06,-2e-06,1e-06,0,-7e-06,0,2e-06,-1e-06,4e-06,-5e-06,-5e-06,2e-06,1e-06,1e-06,-4e-06,1.6e-05,-2.1e-05,0,-7e-06,1e-06,1.5e-05,-2e-06,6e-06,-6e-06,4e-06,1.8e-05,-1.5e-05,1.4e-05,2e-06,-4.9e-05,-4e-05,-5.6e-05,-5.3e-05,-1.6e-05,-9.3e-05,-4.3e-05,4.4e-05,-3.3e-05,-5.1e-05,7e-06,5e-06,3.4e-05,-1.7e-05,2e-06,-2.6e-05,-2.2e-05,-8e-06,-7e-06,5e-06,5.6e-05,-3.6e-05,-1.3e-05,3.9e-05,6.6e-05,-3.3e-05,0,1.6e-05,-1e-06,-1.5e-05,-6e-06,-5.2e-05,-1.2e-05,-4.1e-05,-1.9e-05,-2.5e-05,-1e-06,1.4e-05,3.1e-05,9e-06,-3.9e-05,1e-06,7e-06,1.7e-05,1e-06,0,7e-06,-1.1e-05,-4e-06,4e-06,-2.7e-05,1e-05,1.8e-05,2e-06,-5e-06,1e-06,-8e-06,-5e-06,0,-9e-06,1e-06,-1e-06,0,-6e-06,7e-06,6e-06,3e-06,3e-06,1e-06,-2e-06,-1e-06,-3e-06,0,3e-06,-7e-06,-2e-06,1e-06,5e-06,-1e-06,-5e-06,-3e-06,0,-4e-06
-3e-06,2e-06,-2e-06,2e-06,3e-06,0,0,5e-06,-7e-06,0,0,-5e-06,1e-06,-1e-06,1e-06,-2e-06,1e-06,2e-06,-7e-06,1e-06,-1e-06,0,1e-06,-3e-06,-1.9e-05,2e-06,1.2e-05,3e-06,4e-06,2e-06,4e-06,-1.3e-05,4e-06,-6e-06,-2e-06,5e-06,5e-06,1e-06,3e-06,2.7e-05,6.9e-05,1.9e-05,-2e-06,0.000107,-2e-05,4.2e-05,2.7e-05,-5e-06,-9.8e-05,-2.4e-05,-1.6e-05,-6e-06,-3e-06,-1.1e-05,-1.1e-05,-1.5e-05,-5e-06,5e-06,-6.3e-05,2.8e-05,2.5e-05,-1e-05,-8e-06,1.6e-05,1e-06,-9e-06,1.1e-05,3.5e-05,-2.4e-05,-2.7e-05,1.4e-05,7e-06,3e-06,3.1e-05,-6e-06,-2e-06,-2e-06,1e-06,4e-05,3e-06,-2e-06,1.8e-05,-3e-06,1.2e-05,-2e-06,-8e-06,-8e-06,1e-06,1.8e-05,2e-06,-2.6e-05,2e-06,7e-06,2e-06,7e-06,-1e-06,-1e-06,1e-05,4e-06,0,-1e-06,-5e-06,-7e-06,2e-06,-4e-06,-4e-06,0,-2e-06,3e-06,-3e-06,1e-06,3e-06,4e-06,-2e-06,1e-06,-2e-06,1e-06,5e-06,-1e-06,2e-06,1e-06
-9e-06,-4e-06,1e-06,0,-1e-06,-2e-06,0,-6e-06,0,0,2e-06,6e-06,0,4e-06,2e-06,0,-1e-06,-8e-06,2e-06,4e-06,0,1e-06,-3e-06,2e-06,1.3e-05,1.9e-05,1.2e-05,1e-06,-5e-06,-1.8e-05,-2e-06,1.4e-05,-5e-06,4e-06,-2.3e-05,-1.5e-05,-3e-06,-1e-06,3e-05,8.2e-05,1.9e-05,0.000141,3e-06,-5.4e-05,4.7e-05,-4e-06,-2.4e-05,-3.3e-05,9e-06,2.9e-05,1.5e-05,-8e-06,8e-06,-2.2e-05,4e-06,-5e-06,5e-06,-7e-06,2.4e-05,-2.9e-05,-1.2e-05,1e-06,-5.5e-05,-8e-06,1.3e-05,-1.9e-05,6e-06,-3.1e-05,9e-06,2.5e-05,-8e-06,7e-06,1.9e-05,-2.5e-05,0,-1.9e-05,3e-06,-8e-06,-5.1e-05,-1.1e-05,4e-06,-1.8e-05,1e-06,1e-05,-2e-06,-1e-06,-4e-06,-3e-06,3e-06,-1.1e-05,2.8e-05,1e-06,-4e-06,-1e-06,0,6e-06,0,-7e-06,-3e-06,-6e-06,0,6e-06,0,4e-06,2e-06,3e-06,1e-06,2e-06,-1e-06,6e-06,-1e-06,-5e-06,2e-06,-1e-06,-1e-06,-4e-06,1e-06,-4e-06,3e-06,-6e-06,1e-06
-4e-06,-3e-06,1e-06,0,-1e-06,1e-06,0,3e-06,9e-06,0,-2e-06,-4e-06,-1e-06,0,-1e-06,0,1e-06,-6e-06,5e-06,-4e-06,-2e-06,0,1e-06,4e-06,1e-06,-1.7e-05,-1.3e-05,-3e-06,4e-06,2.1e-05,1e-06,-6e-06,5e-06,0,2.7e-05,9e-06,1.3e-05,-1e-06,-2.2e-05,4.9e-05,-3.8e-05,-9.1e-05,-7e-06,-3.2e-05,-6.4e-05,-4.9e-05,-2e-05,-6e-06,4.9e-05,-2.7e-05,6e-06,2.1e-05,-3e-06,4e-06,1.1e-05,1e-06,3e-06,-2e-06,1.7e-05,3e-05,-1.9e-05,3e-06,4.2e-05,1e-06,-3e-05,1.6e-05,-9e-06,4.1e-05,1.6e-05,3.2e-05,4e-06,-3.3e-05,1.8e-05,8e-06,2e-06,6e-06,-1e-06,1e-06,4.7e-05,6e-06,-3e-06,-3.1e-05,-3e-06,3e-06,-7e-06,-4e-06,1.3e-05,0,-2.1e-05,9e-06,-2.3e-05,-3e-06,-3e-06,-1e-06,-7e-06,-7e-06,0,4e-06,4e-06,-2e-06,1e-06,-7e-06,0,5e-06,2e-06,-3e-06,-1e-06,-1e-06,-2e-06,-1e-06,1e-06,-3e-06,-4e-06,0,-1e-06,6e-06,-4e-06,4e-06,-1e-06,-1e-06,-3e-06
2e-06,1e-06,-2e-06,0,-1e-06,0,-1e-06,-8e-06,0,1e-06,0,-1e-06,-1e-06,-5e-06,1e-06,-2e-06,1e-06,6e-06,2e-06,0,0,-1e-06,2e-06,-1e-06,-1.3e-05,-7e-06,-1.2e-05,1e-05,0,-9e-06,-2e-06,-6e-06,-6e-06,-4e-06,7e-06,-2.3e-05,-3.5e-05,0,-1e-05,-2e-05,-5.5e-05,-3e-05,1.4e-05,6.6e-05,3.9e-05,-7e-06,3.9e-05,-1.5e-05,-8e-06,-2e-06,1.2e-05,4e-06,-6e-06,-1.6e-05,2e-05,4e-06,1e-06,-1.5e-05,-2e-05,-2.9e-05,3.9e-05,-3e-06,1.9e-05,4e-06,3.1e-05,2e-06,-6e-06,-5.5e-05,-7e-06,-1.9e-05,1.6e-05,4.9e-05,1e-06,5e-06,5e-06,1e-06,-1.7e-05,4e-06,-5e-05,-1.1e-05,-1.1e-05,1e-05,-4e-06,-8e-06,4e-06,3e-06,-1e-06,1e-06,2.5e-05,-6e-06,2e-05,-9e-06,8e-06,-1e-06,9e-06,6e-06,0,-3e-06,-8e-06,-3e-06,1e-06,-7e-06,0,5e-06,-5e-06,1e-06,2e-06,-2e-06,6e-06,-4e-06,-1e-06,0,1e-06,0,1e-06,-9e-06,3e-06,-3e-06,0,1e-06,4e-06
