-0.086217,-0.064068,-0.042314,-0.053387,-0.018053,-0.009538,-0.011414,-0.00584,-0.002246,-0.001637,-0.005242,-0.064363,-0.097623,-0.022606,-0.033711,-0.098246,-0.029914,-0.015674,-0.101533,-0.095345,-0.058516,-0.029671,-0.124177,-0.0725,-0.009342,-0.011552,-0.052448,-0.054073
-0.055303,-0.025351,-0.026452,-0.046145,-0.0121,-0.000992,-0.000785,-0.002959,-0.002204,-0.001565,-0.00482,-0.051092,-0.075482,-0.016556,-0.026165,-0.092029,-0.024625,-0.002618,-0.101022,-0.080668,-0.02607,-0.022722,-0.088562,-0.045988,-0.002536,-0.008033,-0.045111,-0.04493
0.031284,0.012504,0.002975,-0.001172,0.001704,-0.001564,-0.001126,0.001063,0.000114,7.9e-05,0.000196,0.009461,0.009356,-0.003631,-0.003586,-0.006151,-0.000479,-0.002226,0.012323,0.017315,0.018931,0.002635,0.016641,0.017276,-0.002304,-0.002621,-0.009876,-0.012826
0.079778,0.053941,0.038779,0.05161,0.014246,0.00605,0.003926,0.002517,0.002127,0.001583,0.005071,0.059997,0.092239,0.022984,0.028416,0.088222,0.025829,0.01214,0.108743,0.094239,0.041951,0.025855,0.108356,0.064342,0.005963,0.01054,0.053106,0.04746
0.014577,0.017639,0.023808,0.041651,0.011209,0.006785,0.006151,0.002077,0.001452,0.000982,0.003335,0.031242,0.05152,0.0182,0.026685,0.076982,0.020925,0.009023,0.056941,0.038523,0.000694,0.016198,0.070184,0.032336,0.008279,0.011018,0.049463,0.044331
-0.076282,-0.061708,-0.029797,-0.02456,-0.008691,-0.007109,-0.004681,-0.00154,-0.001194,-0.001,-0.002984,-0.042079,-0.069012,-0.015891,-0.01473,-0.035554,-0.013119,-0.014268,-0.068278,-0.070974,-0.047897,-0.017548,-0.073425,-0.050765,-0.00718,-0.007899,-0.034588,-0.032249
-0.038829,-0.024055,-0.030549,-0.051846,-0.014794,-0.005425,-0.004401,-0.002882,-0.001717,-0.001132,-0.003971,-0.044933,-0.06693,-0.017364,-0.024026,-0.075372,-0.020813,-0.004519,-0.082634,-0.059989,-0.005916,-0.018644,-0.090187,-0.047601,-0.006803,-0.010355,-0.047827,-0.037015
0.043902,0.037944,0.007438,-0.011284,-0.000895,0.002155,0.001142,0.000376,0.000142,0.000201,0.000338,0.008517,0.009625,-0.005349,-0.004667,-0.023912,-0.004013,0.005523,0.003851,0.02034,0.0367,0.003743,0.014105,0.02057,0.002137,-0.000796,-0.005797,0.005458
0.050168,0.024139,0.023146,0.036031,0.011387,0.001958,0.001104,0.00245,0.001252,0.00091,0.003526,0.045461,0.06295,0.011936,0.007912,0.02938,0.009266,0.002389,0.070996,0.056012,0.014419,0.015786,0.083836,0.050367,0.002215,0.004195,0.022121,0.023098
-0.003961,0.002672,0.012959,0.031623,0.00877,0.005202,0.004782,0.001007,0.000648,0.000485,0.001898,0.022106,0.044054,0.019632,0.015491,0.048985,0.013076,0.004204,0.044138,0.023208,-0.018067,0.010582,0.052198,0.016526,0.004491,0.008873,0.042004,0.024915
-0.052769,-0.03391,-0.013144,-0.008061,-0.00512,-0.000971,-0.000837,-0.001885,-0.000725,-0.000628,-0.002464,-0.031164,-0.036468,-0.002078,0.004483,0.011911,0.000837,-0.004195,-0.041009,-0.041187,-0.026807,-0.01211,-0.062264,-0.043429,0.000377,0.001092,0.001794,-0.015912
-0.01643,-0.025066,-0.018678,-0.0293,-0.010334,-0.007878,-0.007103,-0.001847,-0.000897,-0.000788,-0.003002,-0.034141,-0.056138,-0.014251,-0.012257,-0.033455,-0.009475,-0.006988,-0.063248,-0.043613,0.004618,-0.015955,-0.072248,-0.030306,-0.005867,-0.008692,-0.041719,-0.038238
0.042927,0.039866,0.002366,-0.019051,-0.001433,0.001457,0.002059,0.001093,0.000253,0.000197,0.00044,0.005783,-3.2e-05,-0.007861,-0.006104,-0.021605,-0.003952,0.005792,0.002368,0.016309,0.031113,0.002813,0.02151,0.028816,0.000889,-0.003171,-0.015902,0.003231
0.021295,0.024253,0.012492,0.014513,0.007562,0.004255,0.003897,0.002239,0.000904,0.000737,0.00282,0.026206,0.030599,0.000233,0.002235,0.001327,-0.000378,0.001517,0.050444,0.038978,0.003516,0.008205,0.040371,0.025168,0.003498,0.00237,0.010769,0.02838
-0.023469,-0.030641,0.005489,0.031758,0.005826,-0.000828,-0.000859,7.3e-05,0.000114,0.000206,0.001671,0.01291,0.022231,0.011074,0.001507,0.008534,0.002067,-0.001821,0.02948,0.00795,-0.026689,0.003961,0.011173,-0.0101,-0.001392,0.002736,0.017268,0.014963
-0.023119,-0.018982,-0.004606,0.003314,-0.002107,0.001958,0.001744,-0.001566,-0.000633,-0.000414,-0.001413,-0.010461,-0.002129,0.007602,0.003866,0.016761,0.006741,0.003287,-0.019057,-0.020935,-0.012732,0.001416,-0.00543,-0.018538,0.000741,0.00398,0.019071,-0.006572
0.003274,0.00806,-0.007255,-0.022838,-0.00606,-0.002185,-0.003268,-0.001609,-0.000477,-0.000542,-0.002658,-0.02091,-0.028058,-0.005314,0.00351,0.008257,0.001446,-0.004331,-0.037193,-0.01654,0.019709,-0.006364,-0.030699,-0.009421,-0.000426,-0.001818,-0.011485,-0.025906
0.022411,0.018115,-0.000205,-0.016257,-0.001958,-0.003463,-0.003698,0.000372,0.000378,3.9e-05,-0.000465,-0.004469,-0.017141,-0.009985,-0.001952,-0.009248,-0.004959,-0.001663,-0.003956,0.007102,0.020209,-0.006094,-0.010269,0.015752,-0.003122,-0.005464,-0.022966,-0.012383
0.00625,0.014312,0.005294,0.003343,0.002759,0.002676,0.004355,0.001888,0.00064,0.000504,0.001947,0.015961,0.013723,-0.007035,-0.005389,-0.017548,-0.005308,0.004851,0.026652,0.013034,-0.014346,0.001067,0.021876,0.019701,0.00184,7e-06,0.000607,0.020642
