0.05861,0.065934,0.068382,0.077513,0.099029,0.102786,0.090704,0.082908,0.079041,0.079783,0.084025,0.082473,0.080025,0.083563,0.078752,0.072973,0.079794,0.090857,0.092679,0.093931,0.09517,0.111722,0.118132,0.1036,0.113137,0.113527,0.086975,0.081805
0.079743,0.089972,0.094321,0.107225,0.137391,0.14309,0.12569,0.1142,0.106393,0.106788,0.115114,0.114671,0.112025,0.115959,0.107028,0.097994,0.10627,0.121273,0.12354,0.125589,0.128558,0.14988,0.15784,0.139175,0.153799,0.155877,0.119524,0.111843
0.117639,0.133207,0.142686,0.163363,0.208674,0.216406,0.189874,0.174407,0.16055,0.160309,0.175861,0.177202,0.174952,0.179648,0.162003,0.148355,0.159411,0.177356,0.17908,0.184365,0.193967,0.22271,0.230667,0.204947,0.22811,0.233475,0.181322,0.170467
0.145498,0.166188,0.184795,0.21462,0.269442,0.276084,0.245168,0.235886,0.220649,0.216814,0.236849,0.241582,0.243047,0.247279,0.219012,0.205562,0.220622,0.230757,0.22774,0.242246,0.268189,0.298482,0.295678,0.263662,0.291007,0.302967,0.245617,0.230382
0.150708,0.177359,0.207908,0.246155,0.297273,0.297678,0.275961,0.290218,0.281535,0.268694,0.284789,0.293667,0.303502,0.304286,0.267998,0.26349,0.284426,0.27409,0.264965,0.299207,0.353518,0.37432,0.341173,0.303483,0.326034,0.351749,0.30782,0.281021
0.153805,0.187831,0.223854,0.271735,0.321439,0.314476,0.305378,0.346358,0.350632,0.33227,0.336391,0.338148,0.355283,0.353547,0.317605,0.327491,0.35575,0.324831,0.314949,0.379983,0.464401,0.464261,0.385549,0.339317,0.359055,0.40298,0.373761,0.331238
0.180736,0.220636,0.255933,0.314911,0.37504,0.367875,0.36014,0.411891,0.428498,0.412018,0.411254,0.400411,0.410628,0.397434,0.357355,0.373974,0.420679,0.393783,0.382404,0.465102,0.560559,0.549102,0.441592,0.386005,0.411726,0.463334,0.433209,0.379905
0.213856,0.259789,0.296538,0.353567,0.408653,0.407671,0.402491,0.448685,0.471905,0.462195,0.463454,0.455514,0.459209,0.425098,0.375937,0.387143,0.453608,0.459029,0.447113,0.508935,0.574234,0.556815,0.45923,0.41504,0.453478,0.499796,0.461924,0.413862
0.237457,0.281613,0.312276,0.354177,0.389139,0.395514,0.401862,0.436843,0.46493,0.465219,0.46694,0.473221,0.478325,0.43449,0.392016,0.391229,0.460115,0.516442,0.513439,0.515637,0.517913,0.495556,0.436871,0.41987,0.461082,0.503478,0.471781,0.432885
0.251976,0.282651,0.306898,0.333591,0.358401,0.384756,0.402187,0.413986,0.451336,0.474985,0.478333,0.495806,0.498025,0.456558,0.443931,0.433741,0.485896,0.588786,0.606826,0.558981,0.497813,0.470982,0.446427,0.444515,0.474469,0.524975,0.519034,0.478295
0.270816,0.293378,0.313149,0.326909,0.355464,0.405543,0.442255,0.456611,0.503111,0.53149,0.528979,0.555859,0.566272,0.5199,0.520384,0.517135,0.548632,0.664712,0.711021,0.670116,0.577704,0.528953,0.506899,0.509217,0.537227,0.598553,0.615704,0.559267
0.271039,0.297737,0.320542,0.338078,0.377645,0.424803,0.472385,0.50631,0.559569,0.573657,0.562479,0.605279,0.621015,0.56782,0.583373,0.601493,0.602562,0.704059,0.791767,0.785223,0.68885,0.620692,0.569713,0.556553,0.592236,0.673311,0.702441,0.636285
0.239089,0.284258,0.321014,0.34388,0.38505,0.414271,0.451778,0.507121,0.592013,0.588207,0.55956,0.621974,0.630823,0.562804,0.579501,0.621604,0.612077,0.703684,0.858121,0.871392,0.770387,0.712055,0.611885,0.555785,0.610149,0.700992,0.708721,0.633636
0.207033,0.267868,0.302989,0.332042,0.377384,0.388893,0.402006,0.476152,0.597506,0.586061,0.541788,0.608764,0.609669,0.527713,0.548116,0.606343,0.597445,0.683089,0.84388,0.834696,0.76151,0.753284,0.636004,0.553223,0.619469,0.669147,0.62332,0.567896
0.221076,0.295477,0.30768,0.35265,0.431056,0.424456,0.413969,0.483553,0.577399,0.585789,0.54982,0.596622,0.608592,0.563591,0.68204,0.729295,0.635838,0.66691,0.724277,0.697958,0.729582,0.802505,0.725485,0.63825,0.722792,0.726467,0.591379,0.538512
0.323982,0.434118,0.412098,0.482213,0.631513,0.627779,0.612432,0.669905,0.724401,0.790069,0.778903,0.835881,0.854792,0.809505,1.098516,1.133169,0.847769,0.764247,0.700363,0.717075,0.905175,1.046736,1.052967,0.976601,1.053359,1.052223,0.830053,0.73149
0.488758,0.642111,0.609099,0.747712,0.988168,0.984426,0.973265,1.029887,1.076249,1.22294,1.2553,1.36602,1.328306,1.20339,1.731954,1.776004,1.293942,1.148616,0.997447,1.045188,1.377954,1.566287,1.629532,1.563824,1.626169,1.636928,1.319195,1.149909
0.640049,0.838342,0.845858,1.098475,1.400074,1.379025,1.398935,1.446348,1.450745,1.677708,1.801165,2.002689,1.861184,1.591948,2.361234,2.416264,1.804617,1.686673,1.449284,1.513241,1.9623,2.146889,2.267401,2.239337,2.251743,2.264217,1.890273,1.646827
0.705887,0.94061,1.042252,1.410562,1.690035,1.641768,1.728768,1.751976,1.663277,1.924186,2.170724,2.469052,2.226902,1.787915,2.649343,2.731405,2.146386,2.128142,1.812954,1.884989,2.369629,2.497004,2.674591,2.684607,2.603611,2.6196,2.282829,2.004225
0.66272,0.885553,1.088399,1.521388,1.722478,1.64165,1.770006,1.813023,1.727979,1.917135,2.175173,2.488472,2.195541,1.68031,2.366402,2.487059,2.126881,2.206578,1.891543,2.012856,2.399852,2.411349,2.5806,2.592344,2.460753,2.500165,2.266188,2.031715
0.612378,0.767702,0.988748,1.376437,1.498459,1.423615,1.513171,1.585225,1.658712,1.72475,1.82716,2.02466,1.748066,1.36691,1.765529,1.943536,1.850456,1.891957,1.753961,2.025511,2.248471,2.198259,2.221464,2.13642,2.017164,1.985566,1.877273,1.818693
0.554239,0.641651,0.804062,1.133924,1.254712,1.223185,1.293652,1.364188,1.565507,1.601242,1.477508,1.442014,1.268978,1.166895,1.427912,1.579765,1.491101,1.390055,1.473501,1.858683,2.021628,2.056994,1.932351,1.724157,1.607584,1.456092,1.54206,1.683393
0.43867,0.497073,0.591862,0.827598,0.945192,0.977115,1.123691,1.214539,1.381871,1.486402,1.306144,1.067724,0.97445,0.994127,1.080606,1.23476,1.20686,0.976513,1.07985,1.488216,1.650873,1.701352,1.588701,1.399038,1.26298,1.150524,1.413506,1.521458
0.300568,0.364899,0.430669,0.550784,0.612524,0.682196,0.83032,0.897346,1.00181,1.168129,1.042967,0.751199,0.715538,0.725059,0.644671,0.808992,0.905542,0.666132,0.697047,1.006574,1.118865,1.103748,1.043614,0.946397,0.843869,0.865123,1.157296,1.148673
0.205137,0.285765,0.349501,0.382664,0.384273,0.431074,0.500399,0.522749,0.577795,0.707413,0.65184,0.443676,0.428386,0.419368,0.335813,0.462945,0.552045,0.417333,0.40586,0.524642,0.56527,0.533949,0.508726,0.493639,0.479953,0.553046,0.716673,0.69418
0.151639,0.20236,0.269597,0.291604,0.270329,0.260472,0.262617,0.28157,0.306489,0.340936,0.34437,0.285041,0.260525,0.233285,0.224964,0.305022,0.316045,0.255882,0.242738,0.248745,0.238039,0.214216,0.235865,0.278214,0.28403,0.296814,0.342534,0.349475
0.129174,0.141132,0.191636,0.223492,0.212813,0.184208,0.178277,0.223365,0.222015,0.19055,0.192453,0.20139,0.203016,0.174355,0.183146,0.243235,0.235459,0.194885,0.168791,0.155771,0.165938,0.165161,0.206808,0.291853,0.269841,0.200151,0.211979,0.223496
0.100277,0.109969,0.150625,0.175618,0.162795,0.138804,0.152386,0.210125,0.202913,0.152479,0.132374,0.154353,0.162874,0.13191,0.163919,0.216998,0.196233,0.162817,0.132985,0.127833,0.155852,0.153509,0.198989,0.351488,0.351395,0.205453,0.166895,0.176021
0.071649,0.091111,0.115809,0.119279,0.112201,0.116285,0.135152,0.173668,0.164778,0.116173,0.09058,0.124943,0.139131,0.102499,0.148651,0.207477,0.174199,0.14067,0.122966,0.114727,0.13225,0.121883,0.186471,0.426869,0.448902,0.225501,0.137291,0.144206
0.060696,0.080181,0.08498,0.070124,0.071452,0.101307,0.119604,0.127139,0.122676,0.098675,0.075474,0.105234,0.128303,0.095023,0.129496,0.19212,0.172345,0.138516,0.11931,0.105213,0.11485,0.103501,0.180168,0.462016,0.487823,0.229115,0.120624,0.127891
0.060751,0.082738,0.08698,0.062493,0.055155,0.085673,0.110612,0.104569,0.102329,0.102887,0.082984,0.094646,0.126161,0.103535,0.118589,0.184026,0.179768,0.136389,0.10076,0.100479,0.126288,0.104297,0.157427,0.40225,0.430744,0.2171,0.126354,0.139541
0.067428,0.087927,0.092534,0.061141,0.047733,0.078628,0.10549,0.102831,0.096522,0.099711,0.085091,0.090694,0.134477,0.123479,0.111687,0.153869,0.156366,0.11132,0.07315,0.090932,0.125293,0.094386,0.118148,0.272433,0.29525,0.193544,0.148404,0.14599
0.07318,0.081477,0.081464,0.059559,0.05055,0.075577,0.094,0.093361,0.09213,0.092416,0.08075,0.093856,0.153802,0.155943,0.116102,0.113141,0.115312,0.083759,0.058998,0.081295,0.100774,0.070973,0.086831,0.152667,0.156743,0.154048,0.150005,0.126495
0.070063,0.062164,0.058431,0.054803,0.055544,0.068261,0.079332,0.077701,0.082032,0.097298,0.093183,0.113767,0.184767,0.190654,0.131749,0.095001,0.105998,0.092706,0.060826,0.063939,0.065312,0.048532,0.063127,0.078196,0.073947,0.108158,0.119637,0.08687
0.064464,0.055659,0.046362,0.048767,0.056063,0.056896,0.058403,0.055456,0.062459,0.101862,0.108453,0.131755,0.19859,0.19779,0.139646,0.103677,0.116971,0.105911,0.066951,0.051945,0.043827,0.041402,0.051753,0.052168,0.044901,0.068972,0.077065,0.056517
0.056894,0.061523,0.054491,0.050128,0.050371,0.043271,0.038196,0.037294,0.044947,0.09649,0.110621,0.128404,0.173137,0.162113,0.119549,0.099326,0.110602,0.109295,0.074771,0.045567,0.038842,0.043877,0.057336,0.059258,0.040084,0.044787,0.049092,0.04614
0.045432,0.059963,0.059015,0.05369,0.047339,0.034679,0.030784,0.033235,0.03577,0.087607,0.109614,0.106751,0.115672,0.10263,0.084847,0.078198,0.084138,0.099402,0.076598,0.036489,0.0353,0.050309,0.063542,0.062814,0.039258,0.0345,0.037904,0.038463
0.036858,0.047776,0.053121,0.050524,0.041862,0.026381,0.026055,0.03223,0.036237,0.080364,0.10384,0.077544,0.058396,0.060981,0.06769,0.055994,0.059062,0.085506,0.068247,0.028472,0.034563,0.054629,0.059868,0.057209,0.039668,0.026341,0.028033,0.027361
0.031286,0.032793,0.042818,0.041796,0.032412,0.021787,0.025551,0.030743,0.037151,0.067525,0.086431,0.055581,0.02896,0.048253,0.060019,0.038452,0.047046,0.071174,0.052279,0.024006,0.03745,0.052738,0.049222,0.051129,0.038021,0.024083,0.027826,0.022308
0.024709,0.025662,0.042728,0.039777,0.023337,0.020418,0.0281,0.032659,0.039884,0.054367,0.063571,0.042901,0.023709,0.043536,0.052517,0.035012,0.042125,0.051275,0.033394,0.018355,0.038924,0.04534,0.041177,0.054262,0.039077,0.030668,0.034938,0.025834
