-0.00155,-0.00189,-0.003117,-0.003271,-0.002429,-0.002503,-0.001148,-0.001203,-0.001813,-0.002513,-0.001801,-0.000754,-0.000886,-0.001236,-0.000828,-0.000582,-0.00074,-0.000588,-0.000386,-0.000417,-0.000601,-0.000758,-0.000799,-0.000794,-0.000719,-0.00077,-0.00058,-0.000504
-0.002206,-0.002777,-0.004322,-0.004167,-0.002851,-0.002575,-0.001273,-0.001401,-0.002343,-0.003298,-0.002151,-0.00104,-0.001234,-0.001701,-0.001189,-0.000961,-0.001225,-0.000952,-0.000602,-0.000821,-0.00084,-0.000964,-0.001366,-0.001364,-0.00116,-0.001079,-0.000876,-0.000767
-0.000553,-0.000658,-0.000561,-0.000175,1.5e-05,0.000449,9.4e-05,1.1e-05,-0.000179,-0.000205,0.000107,-0.000188,-0.000221,-0.000225,-0.000198,-0.000291,-0.000384,-0.000291,-0.000185,-0.000404,-0.000171,-9.3e-05,-0.000499,-0.000504,-0.000391,-0.00022,-0.000221,-0.00018
0.000697,0.00134,0.003114,0.003323,0.002025,0.001939,0.000786,0.000882,0.001545,0.002453,0.001714,0.000396,0.000568,0.00099,0.000668,0.000321,0.000542,0.000478,0.000211,0.000164,0.000321,0.000414,0.000417,0.000371,0.000357,0.000506,0.000426,0.000335
0.000437,0.001154,0.002622,0.002468,0.001168,0.00045,0.000105,0.000332,0.000926,0.001579,0.000785,0.000123,0.000348,0.000592,0.000414,0.000172,0.000522,0.000538,0.000208,0.000312,0.000164,7e-05,0.000429,0.00034,0.000326,0.000393,0.000392,0.000188
-8.5e-05,-0.000233,-0.00068,-0.000925,-0.000692,-0.001202,-0.00062,-0.000519,-0.000654,-0.001112,-0.001045,-0.000268,-0.000213,-0.000456,-0.000369,-0.000295,-0.000139,1.2e-05,1.4e-05,9.1e-05,-0.000126,-0.000297,-1e-04,-0.000167,-6.6e-05,-5e-05,-6.4e-05,-0.000242
8.5e-05,-0.000872,-0.002596,-0.002617,-0.001231,-0.000844,-0.000339,-0.000487,-0.00096,-0.001954,-0.001279,-0.000111,-0.000324,-0.00063,-0.000533,-0.000294,-0.000444,-0.000397,-8.1e-05,-0.000122,-8.4e-05,-0.000104,-0.000384,-0.000319,-0.000152,-0.000189,-0.000346,-0.000309
0.000366,-0.000247,-0.001278,-0.001106,-0.00031,0.000511,0.000484,0.000285,0.000153,-8.1e-05,0.000225,0.00033,1e-05,0.000135,0.000108,0.000243,-5e-06,-0.000253,-3.6e-05,-7.9e-05,0.000121,0.000256,-0.000152,6.1e-05,0.000105,-3.2e-05,-0.000208,6.7e-05
7.7e-05,0.000647,0.001249,0.001326,0.000707,0.00096,0.000728,0.00071,0.000963,0.001866,0.001409,0.000418,0.000308,0.000706,0.000666,0.000646,0.000579,0.000216,4.9e-05,0.000118,0.000127,0.000259,0.000305,0.000463,0.000269,6.2e-05,0.000114,0.000397
-0.000312,0.000804,0.002067,0.001865,0.000831,0.000317,0.000157,0.000235,0.000452,0.001436,0.000829,3.6e-05,0.000292,0.000411,0.000427,0.000406,0.000544,0.000442,0.000101,0.000185,-4.3e-05,3.1e-05,0.000536,0.000398,0.000142,1.2e-05,0.000284,0.000305
-8.8e-05,0.000199,0.000639,0.000326,0.000217,-0.000321,-0.000472,-0.000493,-0.00054,-0.000703,-0.000685,-0.000366,4.9e-05,-0.000279,-0.000283,-0.000213,-0.000125,0.000147,7.3e-05,2.4e-05,-0.000102,-5.4e-05,0.000295,-4.8e-05,-6.3e-05,-3.2e-05,0.000188,-6.4e-05
0.000356,-0.000518,-0.001147,-0.001196,-0.000425,-0.000378,-0.000456,-5e-04,-0.00073,-0.001931,-0.001282,-0.000357,-0.000183,-0.000564,-0.000601,-0.000539,-0.000712,-0.000353,-3.5e-05,-0.000149,2.8e-05,-9e-06,-0.000238,-0.000367,-0.000126,1.4e-05,-1.5e-05,-0.000297
6.4e-05,-0.000815,-0.001473,-0.001121,-0.000672,-0.000277,-9e-06,0.000119,-0.000118,-0.000986,-4e-04,-1.6e-05,-0.000253,-0.000254,-0.000224,-0.000306,-0.000592,-0.000499,-0.000129,-0.000106,0.000128,-7.1e-05,-0.000537,-0.000264,-1e-04,6.2e-05,-0.000128,-0.000201
-0.000741,-0.00053,-0.000354,3.7e-05,-0.000487,-0.000323,0.000169,0.000377,0.000331,0.000798,0.000751,0.000233,-0.00016,0.000208,0.000308,0.000101,9.3e-05,-0.000117,-0.000106,6.7e-05,5.2e-05,-0.00018,-0.00026,5.9e-05,-0.000125,2.9e-05,-0.000107,5.3e-05
-0.000697,0.000228,0.000867,0.00081,9.3e-05,-9.5e-05,-1e-06,-2.3e-05,0.000217,0.001434,0.000862,0.000172,2.1e-05,0.00035,0.000367,2e-04,0.000618,0.000381,1.6e-05,0.00013,-4.2e-05,-7e-05,0.000315,0.000241,-0.000141,-3.8e-05,-3.3e-05,0.000185
0.000538,0.00092,0.001058,0.000548,0.000737,0.000545,-7.1e-05,-0.000323,3.5e-05,0.000549,2.9e-05,-2.6e-05,0.000169,0.000113,-2e-06,1.5e-05,0.000491,0.000469,1e-04,1.7e-05,-4e-06,0.000192,0.000515,0.000153,-2.5e-05,-8.4e-05,5e-06,9.7e-05
0.00136,0.000742,0.000171,-0.000218,0.000701,0.000726,9.5e-05,-2e-05,0.000113,-0.000596,-0.000628,-0.000111,0.000162,-0.000187,-0.00027,-8e-05,-7.2e-05,8.7e-05,6.4e-05,-0.000128,9e-06,0.00021,6.2e-05,-7.2e-05,0.000157,-9.2e-05,-6e-06,-7.5e-05
0.000493,-0.000306,-0.000825,-0.000556,-0.000163,-6e-05,0.000191,0.000385,0.000128,-0.00079,-0.000409,-2.4e-05,3.4e-05,-0.000217,-0.000146,5.8e-05,-0.000439,-0.000314,-2.2e-05,-0.000167,-0.00016,-0.000102,-0.000534,-0.000216,0.000214,-4e-05,-1.5e-05,-0.000135
-0.000964,-0.001033,-0.000847,-8.2e-05,-0.000794,-0.000763,0.00011,0.000288,-0.000149,-0.000105,0.00025,0.000119,-2.2e-05,3.2e-05,0.000148,0.000192,-0.000278,-0.00031,-4e-05,-6.8e-05,-0.000275,-0.000292,-0.000554,-0.000144,0.000125,0.000103,2.5e-05,-3.1e-05
