0.040655,0.045746,0.047085,0.044288,0.039491,0.040109,0.04164,0.035561,0.034215,0.03803,0.038877,0.042219,0.045047,0.0416,0.040314,0.040881,0.037324,0.035739,0.036562,0.037043,0.036971,0.039514,0.03971,0.039915,0.040283,0.033744,0.030343,0.035231
0.052517,0.057989,0.058572,0.05491,0.050563,0.051408,0.051448,0.04432,0.043992,0.047799,0.04893,0.053075,0.055595,0.052688,0.0521,0.051607,0.046787,0.045833,0.047241,0.046698,0.046014,0.049563,0.050789,0.051841,0.052325,0.043495,0.03815,0.042938
0.073649,0.078609,0.076988,0.072807,0.070995,0.072443,0.069894,0.061296,0.062584,0.065737,0.067549,0.073407,0.074959,0.073489,0.074002,0.07047,0.063929,0.06447,0.066337,0.063265,0.06143,0.067709,0.07245,0.075249,0.074752,0.061922,0.052842,0.056653
0.093146,0.094317,0.090791,0.089342,0.091467,0.093519,0.090945,0.081842,0.082328,0.083751,0.086844,0.095207,0.095744,0.095905,0.09633,0.087551,0.079783,0.082292,0.084462,0.078114,0.074837,0.085356,0.097251,0.102083,0.096965,0.081264,0.069429,0.070203
0.108952,0.102847,0.10066,0.107539,0.112129,0.111975,0.112872,0.104986,0.100921,0.099813,0.106384,0.117665,0.115763,0.11493,0.114364,0.102032,0.092771,0.097049,0.101181,0.092414,0.087566,0.102686,0.123115,0.127633,0.11346,0.097409,0.087776,0.084512
0.119925,0.109965,0.110529,0.123209,0.126974,0.123251,0.130382,0.12643,0.116674,0.114154,0.125504,0.135551,0.126467,0.122627,0.123682,0.112432,0.100885,0.10679,0.114012,0.103114,0.096697,0.116116,0.14399,0.14615,0.122819,0.107446,0.103784,0.097325
0.119434,0.111934,0.112421,0.124082,0.127265,0.123703,0.135696,0.135912,0.123449,0.120933,0.13377,0.138046,0.121538,0.117187,0.124739,0.117415,0.10175,0.107946,0.117423,0.105458,0.09774,0.118177,0.148375,0.149286,0.122651,0.106627,0.108295,0.103459
0.109493,0.109739,0.107267,0.111655,0.112454,0.112912,0.125894,0.12948,0.123993,0.121213,0.124628,0.125612,0.112544,0.107846,0.11837,0.11498,0.097593,0.103097,0.11166,0.099124,0.092084,0.1101,0.135194,0.138741,0.116895,0.098491,0.099468,0.099542
0.0982,0.112249,0.109185,0.103847,0.096756,0.101161,0.117754,0.123464,0.129158,0.126037,0.112502,0.109768,0.106969,0.108916,0.121147,0.117585,0.097697,0.098287,0.105599,0.098576,0.094894,0.110345,0.13129,0.138445,0.120205,0.098645,0.093829,0.098255
0.107777,0.130344,0.126394,0.120033,0.110627,0.114545,0.132559,0.136157,0.144987,0.139394,0.114406,0.108268,0.115302,0.125363,0.136261,0.132523,0.113118,0.111174,0.116509,0.114381,0.114913,0.131328,0.153987,0.156557,0.1336,0.111365,0.103958,0.113335
0.138067,0.165077,0.165349,0.160512,0.151914,0.151119,0.158396,0.1593,0.166707,0.155854,0.134108,0.132687,0.146785,0.156126,0.157645,0.158827,0.144876,0.145312,0.149249,0.141643,0.139746,0.15518,0.188833,0.188902,0.15633,0.132879,0.122667,0.135959
0.182235,0.21349,0.22874,0.223613,0.209987,0.202534,0.191615,0.191353,0.203658,0.191338,0.176701,0.181557,0.199664,0.201054,0.189243,0.200501,0.191826,0.196615,0.205307,0.187382,0.176325,0.183603,0.233804,0.243142,0.200568,0.174969,0.164127,0.176229
0.249099,0.294863,0.332313,0.313683,0.281491,0.265163,0.239791,0.24186,0.269791,0.25931,0.242078,0.249664,0.270024,0.262533,0.23831,0.256228,0.24341,0.250593,0.279891,0.263015,0.240299,0.239204,0.309357,0.332057,0.271777,0.237455,0.232557,0.248901
0.328221,0.393242,0.444404,0.40074,0.350431,0.331095,0.297854,0.306845,0.353526,0.343439,0.310425,0.312303,0.337349,0.329182,0.299728,0.310916,0.285601,0.292383,0.343151,0.341181,0.312085,0.303157,0.395233,0.437674,0.357384,0.303449,0.301343,0.32847
0.371423,0.446483,0.495139,0.431232,0.380977,0.369931,0.333089,0.344733,0.405541,0.396905,0.341987,0.329253,0.362847,0.362741,0.329892,0.322223,0.28834,0.295427,0.357809,0.379805,0.354492,0.336486,0.434075,0.493912,0.408004,0.33499,0.331174,0.371388
0.34106,0.416003,0.442108,0.374554,0.351842,0.362095,0.322086,0.317741,0.373478,0.379083,0.323235,0.293669,0.330396,0.338871,0.310427,0.285659,0.245895,0.254301,0.308938,0.345282,0.339313,0.31091,0.377497,0.445756,0.384562,0.310132,0.311712,0.368172
0.262398,0.330835,0.334982,0.288281,0.290761,0.310142,0.274666,0.247448,0.271693,0.299107,0.279256,0.24193,0.270877,0.286237,0.261467,0.233778,0.20736,0.212372,0.234572,0.265691,0.283296,0.253721,0.274243,0.346087,0.328649,0.272343,0.28418,0.337296
0.20905,0.302706,0.29325,0.257451,0.287432,0.291004,0.248113,0.212853,0.198309,0.234605,0.255423,0.217223,0.228007,0.257975,0.234813,0.206621,0.209466,0.215225,0.216452,0.243368,0.264827,0.235867,0.231181,0.305363,0.31408,0.273051,0.279865,0.296255
0.193745,0.286203,0.267687,0.261973,0.317338,0.298035,0.247308,0.219395,0.193481,0.235255,0.273783,0.232783,0.227494,0.265209,0.245408,0.212121,0.224556,0.226164,0.217535,0.250027,0.273284,0.242627,0.2388,0.312996,0.315399,0.278227,0.27263,0.250687
0.179317,0.237247,0.212635,0.23654,0.305648,0.295255,0.252493,0.21983,0.19341,0.22708,0.262226,0.231378,0.222286,0.25274,0.241762,0.209835,0.214475,0.209342,0.196612,0.232099,0.259247,0.23601,0.249034,0.306787,0.281983,0.245283,0.232142,0.192345
0.163485,0.192548,0.175469,0.197726,0.244154,0.261568,0.248399,0.202142,0.175058,0.204381,0.217252,0.196429,0.201696,0.2138,0.20985,0.198111,0.192556,0.186887,0.190854,0.217208,0.229144,0.212657,0.244351,0.287584,0.251814,0.210493,0.182362,0.147713
0.166737,0.199227,0.191271,0.188738,0.20076,0.247186,0.289403,0.227384,0.177925,0.225449,0.221287,0.179747,0.189576,0.187499,0.186028,0.204699,0.201038,0.207083,0.236613,0.238465,0.216362,0.19683,0.252246,0.308095,0.275166,0.226963,0.185695,0.157402
0.191159,0.234383,0.233617,0.215639,0.202658,0.261818,0.357331,0.290153,0.211387,0.267894,0.260369,0.209766,0.217422,0.205249,0.197687,0.218942,0.21837,0.252947,0.302177,0.279489,0.230397,0.205088,0.280706,0.382829,0.368767,0.28641,0.222662,0.20453
0.224072,0.259639,0.276021,0.269383,0.230438,0.268884,0.387157,0.334348,0.249603,0.293078,0.272667,0.228135,0.242795,0.235225,0.22001,0.21977,0.222618,0.286875,0.333528,0.29621,0.242859,0.212307,0.28912,0.421126,0.430174,0.323041,0.242349,0.243057
0.238203,0.250979,0.295901,0.313654,0.250261,0.247167,0.341864,0.320357,0.262948,0.288128,0.259378,0.223139,0.239919,0.238428,0.226166,0.199636,0.192931,0.274038,0.313245,0.274815,0.232565,0.200618,0.266205,0.387831,0.399402,0.299797,0.223125,0.241016
0.212881,0.20625,0.269302,0.300531,0.226344,0.194056,0.251054,0.260456,0.23928,0.247981,0.216366,0.201152,0.216627,0.209824,0.204723,0.16803,0.152697,0.224739,0.281274,0.263148,0.21938,0.185021,0.228585,0.310835,0.302586,0.232613,0.190096,0.21355
0.169264,0.156573,0.201553,0.227898,0.178264,0.160534,0.202867,0.207586,0.191225,0.193124,0.164212,0.172573,0.190629,0.173488,0.165535,0.151435,0.138899,0.164838,0.227579,0.23454,0.182917,0.146022,0.176876,0.225217,0.198882,0.158862,0.162207,0.19541
0.143696,0.133443,0.142242,0.154069,0.151011,0.161642,0.193898,0.178515,0.136017,0.133191,0.119874,0.141879,0.173455,0.157919,0.135013,0.149732,0.149601,0.134543,0.173017,0.18874,0.137484,0.094812,0.121652,0.149737,0.131492,0.11125,0.132784,0.174681
0.125855,0.13347,0.117599,0.106495,0.137513,0.171878,0.187608,0.160662,0.113953,0.105493,0.10611,0.124927,0.148267,0.141785,0.122361,0.158526,0.162654,0.118623,0.129407,0.14449,0.109306,0.074526,0.105044,0.118257,0.091516,0.083135,0.107874,0.132995
0.099326,0.119321,0.101338,0.095394,0.138632,0.173911,0.192118,0.169362,0.121178,0.105331,0.121776,0.132879,0.128305,0.126782,0.118253,0.157391,0.163346,0.112335,0.105126,0.116349,0.100072,0.076869,0.098937,0.102751,0.078697,0.077866,0.097273,0.099394
0.071717,0.092007,0.085092,0.095417,0.126265,0.14951,0.188346,0.181442,0.127553,0.107111,0.140614,0.148139,0.114141,0.121513,0.120699,0.139403,0.151096,0.11314,0.104211,0.120946,0.106999,0.077241,0.093446,0.09709,0.076696,0.078954,0.092038,0.091971
0.058411,0.067059,0.06734,0.084248,0.101292,0.121898,0.172217,0.17502,0.118746,0.109278,0.155233,0.158055,0.107646,0.117474,0.113435,0.104931,0.122964,0.100161,0.095394,0.121799,0.110854,0.075343,0.09296,0.10076,0.076462,0.0738,0.078602,0.080975
0.061216,0.060003,0.058385,0.063267,0.076231,0.100494,0.138286,0.148699,0.101162,0.103077,0.148164,0.143894,0.102985,0.10666,0.094992,0.073246,0.091701,0.084486,0.081775,0.101622,0.098114,0.06888,0.082819,0.096546,0.079112,0.070378,0.067965,0.073731
0.072033,0.069199,0.062999,0.053698,0.060544,0.075732,0.094148,0.119356,0.096113,0.093915,0.119612,0.113023,0.093831,0.086169,0.074583,0.062763,0.082931,0.084508,0.073885,0.075862,0.074665,0.061431,0.065832,0.077522,0.077421,0.070028,0.069815,0.075411
0.075783,0.071409,0.070498,0.062255,0.054815,0.054555,0.068652,0.099131,0.096941,0.094692,0.103421,0.09731,0.081248,0.062283,0.054854,0.056573,0.081462,0.091337,0.074222,0.067603,0.058681,0.051089,0.048583,0.05747,0.06954,0.069702,0.079957,0.08013
0.076319,0.062025,0.067715,0.064542,0.045625,0.039484,0.061671,0.090781,0.092899,0.093433,0.09363,0.081636,0.063689,0.04879,0.041609,0.052282,0.078419,0.084931,0.066421,0.061113,0.046845,0.046107,0.049297,0.057909,0.063858,0.063662,0.080625,0.071433
0.074844,0.053967,0.055861,0.056684,0.042042,0.035061,0.055806,0.084631,0.092042,0.079844,0.069725,0.055439,0.040396,0.037448,0.035431,0.049024,0.068358,0.063537,0.055826,0.064308,0.048177,0.051718,0.059418,0.064204,0.062155,0.059081,0.0685,0.05256
0.077379,0.053035,0.040607,0.041714,0.039512,0.036245,0.043584,0.073808,0.089376,0.060067,0.044192,0.035305,0.026008,0.02774,0.031863,0.04247,0.050921,0.04819,0.052959,0.069925,0.057299,0.059927,0.06269,0.064023,0.065733,0.05377,0.048399,0.038897
0.080524,0.064389,0.041547,0.03356,0.034129,0.035092,0.03053,0.059556,0.079164,0.048992,0.038708,0.033579,0.026706,0.023831,0.029182,0.03204,0.036779,0.052951,0.062474,0.069325,0.065299,0.064482,0.056054,0.056054,0.067106,0.044944,0.032791,0.033359
0.074679,0.076248,0.050033,0.037573,0.032854,0.031282,0.02926,0.052943,0.068481,0.046065,0.037032,0.034358,0.032059,0.024171,0.025415,0.022678,0.036088,0.068172,0.067952,0.058633,0.06738,0.061073,0.046668,0.049465,0.062526,0.034875,0.020701,0.026245
