0.053592,0.053164,0.052247,0.143417,0.712966,1.313537,1.25445,1.104009,1.205511,1.226703,1.221337,1.168365,0.922505,0.673029,0.502942,0.362226,0.244363,0.215521,0.291602,0.279573,0.191945,0.156101,0.220414,0.291418,0.180858,0.113175,0.129583,0.092625
0.066636,0.066574,0.065784,0.175016,0.826034,1.515344,1.453141,1.272848,1.365376,1.352952,1.338202,1.317876,1.084871,0.830749,0.643539,0.460514,0.301025,0.261258,0.348356,0.339592,0.240468,0.190056,0.257196,0.341382,0.215071,0.140794,0.163189,0.114475
0.08663,0.087089,0.08669,0.224586,0.99548,1.813423,1.762474,1.55179,1.598665,1.494618,1.471942,1.534251,1.352597,1.11402,0.904682,0.637808,0.397757,0.334585,0.432267,0.43076,0.320853,0.243944,0.306243,0.410597,0.265823,0.186164,0.219474,0.149843
0.096965,0.096574,0.096008,0.249748,1.069281,1.965022,1.995708,1.818078,1.783288,1.571594,1.568174,1.699109,1.549714,1.337801,1.125573,0.78584,0.468405,0.374968,0.459418,0.466475,0.371642,0.276133,0.319164,0.433853,0.290027,0.211632,0.25245,0.170574
0.096213,0.092902,0.089495,0.245165,1.068297,2.000455,2.181736,2.098864,1.988599,1.747211,1.781443,1.889764,1.668661,1.409468,1.176843,0.815745,0.485429,0.37612,0.425902,0.432276,0.376773,0.28592,0.306432,0.420557,0.285231,0.200467,0.241213,0.167441
0.089856,0.087065,0.081097,0.231034,1.033589,1.968621,2.332198,2.395638,2.27323,2.055339,2.085393,2.135197,1.808142,1.384945,1.041316,0.712908,0.46096,0.379342,0.41321,0.409136,0.391471,0.310623,0.302698,0.40451,0.265875,0.166704,0.200831,0.146717
0.084083,0.084883,0.083556,0.235603,1.066436,2.056278,2.598294,2.83887,2.791785,2.592108,2.534294,2.512884,2.230504,1.673114,1.06006,0.689141,0.481542,0.442885,0.526259,0.511735,0.49646,0.399562,0.358847,0.454592,0.278479,0.151895,0.182073,0.134687
0.089729,0.096514,0.10689,0.291507,1.277667,2.486814,3.364002,3.903928,3.896078,3.684713,3.619746,3.542519,3.342844,2.627085,1.570368,0.997319,0.696157,0.64009,0.774179,0.718973,0.66765,0.53989,0.488824,0.621848,0.368096,0.18286,0.223602,0.159764
0.106283,0.119296,0.144015,0.378492,1.549949,3.143332,4.753951,5.894742,6.022765,5.836112,5.729759,5.595402,5.432949,4.306879,2.532791,1.624932,1.121891,0.951914,1.09731,0.973562,0.852487,0.685501,0.64529,0.836239,0.493357,0.244993,0.305001,0.209759
0.125916,0.139864,0.177612,0.466394,1.806438,3.848398,6.603611,8.770462,9.284792,9.329834,9.001286,8.532852,8.231369,6.416124,3.728935,2.435478,1.686268,1.306802,1.402785,1.212708,1.009612,0.80041,0.783941,1.013454,0.595118,0.307137,0.382096,0.257672
0.142992,0.153437,0.197039,0.522653,1.99847,4.519683,8.682863,12.015373,13.083483,13.690626,12.984365,11.859199,11.063018,8.331949,4.848136,3.223215,2.2249,1.579396,1.56362,1.390033,1.172311,0.912847,0.904358,1.129522,0.646581,0.358214,0.439799,0.28373
0.145788,0.156639,0.193758,0.517753,2.045648,4.929605,10.361623,14.505412,15.951754,17.183175,16.095871,14.373192,12.825204,9.298413,5.536759,3.662969,2.487554,1.661674,1.498266,1.403791,1.265356,0.998384,0.983485,1.167051,0.651932,0.386973,0.463452,0.287623
0.134998,0.149526,0.16633,0.467258,2.018485,4.888192,10.419424,14.483522,15.793459,17.183778,16.170013,14.409982,12.300605,8.655264,5.323926,3.424241,2.304628,1.520686,1.266646,1.25582,1.240895,1.016893,1.002389,1.156415,0.641622,0.384116,0.447117,0.269499
0.114634,0.130175,0.129996,0.426514,2.02703,4.461195,8.428544,11.382094,12.071336,12.882582,12.558144,11.56857,9.433302,6.36576,3.993153,2.502383,1.761828,1.213719,0.93754,0.955597,1.023042,0.894577,0.915563,1.041871,0.583587,0.347006,0.406407,0.2463
0.094109,0.104823,0.109688,0.439275,2.099009,4.073435,5.864855,7.097552,7.123927,7.123031,7.419039,7.350099,5.785442,3.7361,2.299477,1.422962,1.09175,0.808622,0.631215,0.657811,0.748665,0.740106,0.764651,0.801277,0.456189,0.295509,0.365247,0.233339
0.102584,0.105578,0.117256,0.523519,2.384455,4.336367,4.877618,4.707641,4.135909,3.551938,3.753344,3.961048,3.101423,2.020436,1.208217,0.763304,0.628932,0.523345,0.528384,0.593698,0.697961,0.743845,0.705668,0.678586,0.407876,0.34686,0.461896,0.28597
0.149312,0.153516,0.163397,0.698797,2.947542,5.22507,5.643152,4.708685,3.432844,2.786934,2.726604,2.631423,2.0901,1.460088,0.918043,0.59608,0.472825,0.444374,0.559008,0.665655,0.84344,0.905811,0.877556,0.914238,0.552831,0.477247,0.643182,0.379991
0.212103,0.227518,0.236224,1.012425,4.176236,6.860831,6.783002,5.490283,3.943743,3.073973,2.830755,2.608423,2.250423,1.849075,1.188087,0.718997,0.574175,0.534933,0.655424,0.812723,1.102401,1.163324,1.127753,1.232428,0.750395,0.624442,0.831533,0.47858
0.27258,0.303963,0.323166,1.392621,5.682846,8.993928,8.230678,6.579371,5.100332,3.91627,3.544982,3.405042,3.065976,2.75773,1.795345,0.982999,0.792062,0.699609,0.788759,0.988451,1.340731,1.357305,1.283212,1.427815,0.883122,0.721968,0.946547,0.541172
0.310639,0.35085,0.38879,1.647934,6.621715,10.541713,9.415153,7.490058,6.304142,5.037892,4.891485,5.072897,4.467561,3.959965,2.560248,1.29147,1.041077,0.846848,0.859633,1.069982,1.408199,1.385326,1.289688,1.411969,0.881897,0.727181,0.937409,0.541064
0.312803,0.347624,0.393706,1.585676,6.30712,10.359534,9.555116,8.03484,7.386111,6.294468,6.67492,7.394924,6.400621,5.261035,3.273089,1.570426,1.223258,0.888599,0.804103,1.006413,1.321553,1.330722,1.258266,1.310641,0.806146,0.629695,0.800758,0.486687
0.284755,0.300658,0.348564,1.234803,4.844076,8.450248,8.788716,8.173165,7.948873,7.319602,8.227472,9.645895,8.298132,6.168645,3.716679,1.783163,1.259554,0.790458,0.629545,0.819648,1.147875,1.272889,1.306759,1.349784,0.808202,0.489041,0.613971,0.413913
0.2312,0.234969,0.287699,0.877784,3.359137,6.13859,7.158694,7.299733,7.840312,7.878678,8.765061,10.655512,9.113362,6.079262,3.618959,1.843226,1.188757,0.675577,0.486513,0.667835,0.98511,1.144253,1.27051,1.353666,0.791628,0.358895,0.420101,0.31388
0.176106,0.193552,0.246213,0.737447,2.747275,4.589987,5.248411,5.660901,6.720926,7.240656,7.802194,9.611487,8.338481,5.181077,3.040881,1.675128,1.064899,0.618891,0.456874,0.656718,0.872011,0.912757,1.031286,1.112528,0.64093,0.250911,0.257486,0.211163
0.144884,0.169807,0.200376,0.61592,2.156914,3.488025,3.895957,4.178614,4.981476,5.421823,5.660415,6.94198,6.368325,3.842408,2.109879,1.233403,0.797156,0.513318,0.44691,0.710792,0.854883,0.737528,0.737013,0.744505,0.416919,0.16752,0.15463,0.1475
0.134956,0.158053,0.183286,0.453677,1.450155,2.641693,3.258136,3.368316,3.509811,3.740574,4.015531,4.419266,3.920562,2.409128,1.299285,0.852116,0.599959,0.401203,0.401897,0.74793,0.919771,0.672516,0.583391,0.578733,0.29993,0.122847,0.124735,0.125674
0.136177,0.164098,0.187912,0.339406,1.049702,2.193209,2.776878,2.842369,2.6962,2.803344,3.436761,3.177057,2.266686,1.561559,1.020131,0.828269,0.625034,0.359785,0.358395,0.761322,1.017775,0.681292,0.497833,0.522967,0.269195,0.107048,0.121306,0.129235
0.142574,0.170031,0.180142,0.310934,1.023818,2.091344,2.587692,2.826179,2.603704,2.29564,2.748412,2.480956,1.678719,1.270222,0.991265,0.932872,0.716348,0.383894,0.394494,0.813113,1.097668,0.740938,0.448163,0.432761,0.242248,0.12209,0.136148,0.137835
0.145027,0.165264,0.166076,0.31665,0.977644,1.817658,2.296495,2.77104,2.680301,2.079701,2.039261,1.93964,1.635746,1.346746,1.000343,0.924111,0.720042,0.395983,0.435022,0.834904,1.094124,0.764822,0.439074,0.397222,0.256044,0.158055,0.160522,0.144277
0.144506,0.154004,0.162878,0.330257,0.877911,1.499765,2.025511,2.520094,2.468049,1.986617,1.777825,1.593239,1.493292,1.296415,0.869523,0.739202,0.587602,0.368758,0.428521,0.729139,0.931292,0.700192,0.454239,0.433127,0.306251,0.187109,0.166319,0.138824
0.137544,0.154706,0.166386,0.327272,0.966795,1.650772,2.012527,2.254424,2.121574,1.782667,1.753488,1.629333,1.332,1.0524,0.716317,0.563839,0.441542,0.328228,0.364139,0.507217,0.655652,0.573158,0.467745,0.487327,0.342589,0.181776,0.138771,0.112021
0.119783,0.154053,0.171785,0.301014,1.128289,1.998234,2.195895,2.085294,1.67944,1.473461,1.700452,1.693492,1.223032,0.866822,0.68991,0.567588,0.420896,0.296819,0.285064,0.331092,0.482783,0.515283,0.46445,0.477176,0.317703,0.138394,0.096931,0.092897
0.099476,0.139037,0.153541,0.265446,1.264373,2.478675,2.579435,1.855874,1.235703,1.209318,1.636831,1.650479,1.114397,0.838337,0.675352,0.605825,0.480342,0.267833,0.213271,0.244066,0.394062,0.482936,0.442955,0.404302,0.242021,0.095909,0.071769,0.088779
0.071885,0.10327,0.119333,0.256127,1.314915,2.758776,2.749547,1.518275,0.991748,1.179058,1.518069,1.429422,0.972061,0.831843,0.625005,0.587635,0.506509,0.247702,0.179156,0.21972,0.316359,0.403781,0.399518,0.318582,0.169571,0.076133,0.071554,0.087756
0.054077,0.069708,0.094569,0.250384,1.226912,2.642372,2.611151,1.316004,0.992434,1.265655,1.361934,1.247919,0.934133,0.78051,0.606878,0.535172,0.46009,0.234848,0.181431,0.23249,0.256453,0.353567,0.373908,0.266628,0.139759,0.085877,0.093368,0.094046
0.044934,0.056557,0.090344,0.241731,1.143744,2.533723,2.521725,1.322315,1.109924,1.229027,1.05784,1.131068,0.998643,0.78364,0.642214,0.442164,0.343478,0.220272,0.223776,0.270101,0.26638,0.393998,0.391543,0.246361,0.12882,0.100326,0.122173,0.109628
0.051173,0.068486,0.101603,0.211725,1.029641,2.434928,2.350517,1.330182,1.174901,1.01318,0.729834,0.994545,0.99122,0.773432,0.632315,0.350307,0.243252,0.217596,0.273048,0.317957,0.317324,0.447738,0.436998,0.265116,0.127429,0.09867,0.140594,0.141568
0.062194,0.077878,0.105291,0.155411,0.828365,2.100684,1.966839,1.399316,1.208731,0.801021,0.694431,0.956929,0.873864,0.663137,0.527313,0.290165,0.208355,0.211199,0.283551,0.344818,0.387633,0.521459,0.530213,0.306403,0.123719,0.07983,0.134907,0.1688
0.06802,0.073016,0.101376,0.112854,0.609575,1.660298,1.589212,1.510604,1.39622,0.766261,0.702924,0.873853,0.808021,0.558524,0.379019,0.269203,0.232804,0.200115,0.239575,0.313573,0.437776,0.653336,0.631185,0.331167,0.123404,0.056022,0.106928,0.173114
0.071131,0.059136,0.09215,0.121578,0.507963,1.392948,1.472766,1.626667,1.76323,0.975132,0.746778,0.856468,0.793298,0.44004,0.272554,0.307166,0.25321,0.166343,0.165472,0.235794,0.441408,0.776064,0.664488,0.308865,0.123753,0.041334,0.075196,0.151773
