3.5e-05,1.4e-05,1.6e-05,1.9e-05,8e-06,1.3e-05,3.6e-05,1.8e-05,2.9e-05,3.6e-05,1.1e-05,1.3e-05,7e-06,1e-06,2.3e-05,1.6e-05,1.1e-05,2.1e-05,1.7e-05,0.000166,6.4e-05,6.1e-05,6.3e-05,0.000214,8.2e-05,0.000169,0.000664,0.00071,6.3e-05,0.000126,0.000775,0.000345,0.000539,0.000166,0.000557,0.000118,0.00072,0.000647,0.000152,0.000219,4e-05,5.7e-05,0.000518,0.000401,0.000304,0.000778,0.000333,0.000199,0.000285,0.000467,0.00089,0.000447,0.000364,1.3e-05,0.000141,0.000201,8.1e-05,0.000399,0.000111,6e-06,8.8e-05,0.00028,5.8e-05,0.000188,0.000156,6e-06,0.000119,5.8e-05,0.000114,5.1e-05,8e-06,6e-06,6e-06,6.6e-05,0.000107,5.8e-05,3.4e-05,0.000265,4.6e-05,1.3e-05,2e-04,0.000102,0.000121,4.5e-05,0.000248,2.6e-05,0.000221,0.000217,0.000482,0.000173,0.000122,0.000251,0.000331,0.000119,0.000224,8e-05,0.000265,9.7e-05,5.6e-05,2.1e-05,1.5e-05,4.6e-05,4.8e-05,2.8e-05,3.7e-05,1.8e-05,2.7e-05,0.000148,5.1e-05,4.1e-05,7e-06,3.3e-05,7.3e-05,2.2e-05,1.6e-05,4.2e-05,4e-05,1.5e-05,2.3e-05,1.4e-05,5.6e-05
6.2e-05,9.3e-05,8.7e-05,0.000123,6e-05,0.000105,0.000102,6e-05,3.7e-05,4.5e-05,3.3e-05,6.3e-05,7.9e-05,2.8e-05,3.3e-05,4.3e-05,3.8e-05,9.7e-05,0.000117,0.000345,0.000116,0.000228,0.00038,0.000928,0.001233,0.000519,0.001603,0.002126,0.001711,0.001396,0.001027,0.001466,3e-04,0.000526,0.000515,0.001559,0.002424,0.002452,0.001644,0.000786,0.000845,0.000325,7e-04,0.001305,0.001466,0.001663,0.001268,0.000788,0.0016,0.001338,0.002305,0.000331,0.000742,0.000599,0.000615,0.000859,0.000553,0.000962,0.00051,0.00019,0.000208,0.000288,0.000362,0.000834,0.000345,0.000441,0.000376,0.000172,0.000199,0.000185,5.3e-05,0.000175,0.000253,0.000253,0.000136,9.4e-05,0.000167,0.000372,0.00031,0.000269,0.000252,0.00032,0.000344,0.000249,0.000439,0.000258,0.000551,0.000929,0.001367,0.000855,0.000387,0.000838,0.001164,0.000674,0.000269,0.000257,0.000455,0.000327,0.000383,0.000228,0.000128,6.7e-05,0.000135,9.9e-05,0.000113,7.9e-05,2.8e-05,0.000265,6.2e-05,7.3e-05,7.9e-05,9.1e-05,0.000187,0.00018,5.8e-05,9.1e-05,0.000166,5.7e-05,4.4e-05,0.000109,9.5e-05
2.5e-05,6.6e-05,7.1e-05,7.1e-05,0.000132,2.5e-05,7.5e-05,3.2e-05,3.5e-05,5.4e-05,1.4e-05,0.000143,4.6e-05,9.5e-05,0.000128,0.000161,8.6e-05,0.000116,8.7e-05,0.000363,0.000118,0.000301,0.000979,0.00199,0.002338,0.001226,0.001962,0.003499,0.00292,0.002603,0.001935,0.00102,0.001607,0.000436,0.000916,0.002328,0.001128,0.00082,0.000267,0.002173,0.001346,0.001028,0.000789,0.000307,0.001341,0.002268,0.002222,0.00021,0.002337,0.00102,0.001815,0.002066,0.001297,0.001111,0.000407,0.000356,0.000369,0.001191,0.000939,0.000873,0.000779,0.000594,0.000574,0.000217,0.000304,0.000514,0.000419,0.000308,0.000467,0.00042,0.000225,0.000356,0.000278,1e-05,0.000211,5.8e-05,7.4e-05,0.000403,0.000473,2e-04,0.000346,0.000192,0.000155,8e-05,0.00066,0.000322,0.000489,0.000671,2e-04,0.000186,6.6e-05,0.001163,0.000488,0.000142,0.000148,2.7e-05,0.000715,0.000666,0.00017,4.7e-05,6e-05,6.5e-05,5.9e-05,9.3e-05,6.5e-05,0.000101,6e-05,0.000165,0.000117,0.000122,5e-05,0.000105,7.9e-05,0.000104,1e-04,7.5e-05,0.000191,0.000192,0.00013,7.7e-05,6e-05
3e-06,5.3e-05,9.6e-05,0.000139,0.000171,0.000115,6.1e-05,5.6e-05,3.7e-05,0.00017,0.000119,0.000234,0.000173,0.000192,6.4e-05,0.000113,0.000133,9.7e-05,0.000145,0.000478,0.000227,0.000314,0.001568,0.002753,0.001578,0.00096,0.001789,0.002873,0.004211,0.001431,0.000515,0.001704,0.001588,0.001055,0.002687,0.003323,0.001084,0.001274,0.00037,0.002107,0.000914,0.002344,0.001602,0.000672,0.00196,0.002876,0.001469,0.001809,0.001824,0.000918,0.002091,0.002286,0.000985,0.00077,0.001745,0.001327,0.000704,0.001079,0.000112,0.001172,0.000729,0.000595,0.000338,0.000157,0.000316,0.000257,0.000538,0.000875,7e-05,0.000391,0.000397,3.7e-05,0.000291,0.000174,5.6e-05,0.000239,0.000265,0.000388,0.000273,4.7e-05,0.000329,0.000458,0.000271,0.000137,0.000888,0.000244,0.000555,0.000797,0.000368,9.1e-05,0.000314,0.000609,0.000214,4.7e-05,0.000227,0.000247,0.001175,0.000737,0.000584,0.000259,0.000142,0.000125,9.8e-05,0.000167,0.000152,7.4e-05,8.2e-05,0.000248,0.000111,0.000117,7.5e-05,8.9e-05,2.1e-05,6e-05,2.5e-05,0.000115,0.000174,5.8e-05,9.8e-05,0.000106,7.2e-05
0.000106,7.5e-05,4.2e-05,0.00011,7.3e-05,5.6e-05,0.000181,0.000166,7.1e-05,0.000189,1.9e-05,0.000251,0.00018,7.3e-05,0.000214,0.000219,2.3e-05,3.6e-05,0.000103,0.000496,0.00032,0.000793,0.00148,0.002898,0.001386,0.000977,0.000339,0.001871,0.004024,0.001982,0.00225,0.001469,0.00102,0.002278,0.002539,0.002318,0.003097,0.001802,0.000491,0.000794,0.001956,0.001668,0.000669,0.001213,0.00264,0.002563,0.001993,0.002192,0.001752,0.002857,0.002807,0.001479,0.000521,0.000944,0.002666,0.001632,0.000914,0.000547,0.00034,0.000904,0.001006,0.000683,0.00036,0.001066,0.000614,0.000436,0.000717,0.000597,0.000619,0.000631,0.000354,0.000178,0.000283,0.000402,0.000248,0.000214,0.000177,0.000142,0.000148,0.000235,0.000318,0.001084,0.000746,0.000487,7e-04,0.000935,0.001708,0.000891,0.000342,0.00017,0.000312,0.000359,0.000243,0.000118,0.000212,0.000307,0.001321,0.000144,0.00025,0.000156,0.000111,1e-05,3.2e-05,7.6e-05,0.000137,4.5e-05,3e-05,0.000387,0.00017,0.000128,0.000112,8.2e-05,9.4e-05,8e-05,1.8e-05,0.00011,7.5e-05,8e-05,0.000158,0.000144,0.000147
0.000129,5.1e-05,3.9e-05,0.000163,7.8e-05,3.4e-05,0.000197,2.2e-05,3.8e-05,9.5e-05,9.1e-05,0.000243,5.8e-05,6.2e-05,0.00017,5.7e-05,0.000182,6e-05,0.00012,0.000491,0.000298,0.000681,0.001096,0.003215,0.001176,0.000244,0.000923,0.002006,0.00094,0.00295,0.001506,0.003437,0.000727,0.003262,0.002134,0.000577,0.003996,0.002362,0.002258,0.00299,0.00224,0.002237,0.002709,0.000823,0.002571,0.005552,0.001265,0.001037,0.004654,0.001274,0.00394,0.004954,0.001175,0.002312,0.003037,0.000603,0.002099,0.003202,0.000707,0.000819,0.000483,0.000381,0.000287,0.00119,0.00104,0.000224,0.000254,0.000634,0.00011,0.000704,0.000347,0.000185,0.00032,0.000315,0.000488,0.00018,0.000104,0.000286,0.000185,0.000328,0.000225,0.000942,0.000525,0.00031,0.000815,0.000893,0.000585,0.000198,2e-04,0.000277,0.000256,0.000762,0.000281,0.000116,0.000142,0.000349,0.001347,0.000727,0.000418,6.4e-05,8.8e-05,3.2e-05,3.1e-05,5.3e-05,0.000102,0.000113,1.2e-05,0.00036,0.000106,0.000115,0.000134,1.4e-05,2.2e-05,0.000132,0.00017,2.1e-05,6e-05,5e-05,7.4e-05,9e-05,0.000215
0.000165,7e-05,0.000133,0.000149,2e-05,6.5e-05,7.9e-05,0.000159,0.000173,8e-05,7.4e-05,0.000113,0.000103,9.2e-05,0.000246,0.000228,0.000242,0.000211,0.000108,0.000396,0.000545,0.000225,0.002425,0.007958,0.003638,0.001247,0.001121,0.006919,0.002179,0.004615,0.003545,0.003741,0.004235,0.003851,0.002047,0.003217,0.004693,0.004863,0.004421,0.005963,0.005845,0.005089,0.004686,0.003554,0.002657,0.002544,0.006569,0.004146,0.007839,0.005696,0.007186,0.008959,0.009692,0.00235,0.003068,0.003118,0.004267,0.001822,0.003451,0.001329,0.001757,0.002048,0.001148,0.001314,0.000753,0.000814,7.8e-05,0.001054,0.000902,0.001114,0.00068,0.000407,0.000155,0.000338,0.000402,0.000263,0.000169,0.000393,0.000123,0.000239,0.00025,0.000353,0.000312,0.000253,0.000472,0.000202,5.1e-05,0.000342,0.000543,0.000943,0.000507,0.00085,0.000451,0.000125,7.1e-05,0.000629,0.001473,0.001661,0.000811,0.00024,7.2e-05,0.000157,0.000137,0.000123,0.000119,6.1e-05,0.000103,0.000535,0.000228,0.00018,9.5e-05,0.00011,8.6e-05,0.00017,6.7e-05,0.000138,3.6e-05,7.9e-05,6.8e-05,0.000139,0.000182
0.000198,0.000125,0.000233,0.000158,0.000173,0.000214,5.8e-05,0.000134,9.4e-05,0.000232,0.000205,5.7e-05,0.000103,0.00013,0.000208,0.000181,0.000344,1.7e-05,9.3e-05,0.000615,0.000949,0.000841,0.006179,0.008475,0.004474,0.000758,0.000703,0.008092,0.007674,0.00649,0.003421,0.001387,0.002831,0.002874,0.004105,0.003936,0.009829,0.003948,0.003119,0.0014,0.001976,0.00189,0.005511,0.003238,0.001755,0.00267,0.009972,0.008233,0.001879,0.004441,0.001068,0.005237,0.0072,0.005992,0.003686,0.001592,0.002048,0.003552,0.00619,0.005253,0.001447,0.00142,0.000992,0.000573,0.000194,0.00075,0.001001,0.001006,0.001426,0.000503,0.000458,0.00015,0.000139,0.000188,0.00056,0.000485,0.000243,0.000579,0.000178,5.1e-05,0.000272,0.000549,0.000608,0.000507,0.000514,0.00056,0.001081,0.001186,0.000283,0.000816,0.00113,0.001255,0.000713,0.000237,3.3e-05,0.000714,0.000123,0.001813,0.001294,0.000561,0.00031,0.000177,1.2e-05,2.7e-05,8.5e-05,9.1e-05,2e-04,0.000546,0.000905,0.000586,0.000398,0.00015,6.3e-05,0.00021,0.000211,0.000237,0.000219,0.000122,5e-05,0.000119,9.9e-05
0.000129,6.1e-05,0.000295,0.000227,0.000131,0.000173,0.000262,8e-05,0.000144,0.000256,0.00033,0.000317,0.000219,0.000194,0.000142,9.2e-05,0.000375,0.000401,0.000262,0.000715,0.000988,0.001729,0.009735,0.014319,0.007979,0.003034,0.001882,0.007571,0.010864,0.00889,0.003165,0.00152,0.002463,0.002366,0.004493,0.003274,0.006659,0.005845,0.005469,0.002663,0.000901,0.002987,0.002847,0.002384,0.001519,0.001355,0.005781,0.000812,0.001579,0.001306,0.000555,0.003072,0.002206,0.001585,0.001498,0.001037,0.001677,0.003236,0.002838,0.00077,0.001458,0.000724,0.000171,0.000339,0.000123,0.00055,0.000325,0.001286,0.000455,0.000421,0.000719,0.000598,0.000415,0.000378,0.00072,0.00061,0.00045,0.000693,0.000593,0.000446,0.000305,0.001043,0.000864,0.000288,0.00053,0.000916,0.00194,4e-04,0.000599,0.000453,0.000872,0.000617,0.000402,0.000311,0.000162,0.000554,0.000866,0.002351,0.000949,0.000317,0.000166,0.000199,0.000243,0.000124,0.00016,0.000145,0.000208,0.000579,0.001964,0.000955,0.000377,5.2e-05,2.8e-05,0.000177,0.000212,0.000224,0.000208,0.000148,0.000111,0.000187,0.000178
5.5e-05,2.9e-05,0.000218,9.7e-05,4.2e-05,0.00013,0.000201,0.000205,0.00018,5.9e-05,0.000162,2.7e-05,7.8e-05,0.000115,0.000119,0.000135,0.000262,9.4e-05,5.3e-05,0.000481,0.00045,0.001007,0.008843,0.003305,0.002561,0.003404,0.000756,0.003228,0.003735,0.002891,0.005025,0.001839,0.004199,0.001315,0.004528,0.003093,0.003969,0.001296,0.00169,0.000572,0.000906,0.000726,0.002842,0.00054,0.001344,0.001428,0.000797,0.001421,0.000733,0.000809,0.001415,0.001274,0.000274,0.001677,0.001362,0.001298,0.001477,0.001132,0.000715,0.000815,0.000207,0.000248,0.000359,0.000504,0.000416,5.9e-05,0.000164,0.000837,0.000514,0.000271,0.000388,0.000127,0.000206,8.7e-05,0.000344,0.000219,0.000174,0.000914,0.000558,0.00028,0.000349,0.000644,0.000517,0.00043,0.000576,0.000534,0.001301,0.001456,0.000993,0.000867,0.000497,0.00095,0.000576,0.000254,0.000119,0.000279,0.001551,0.002309,0.001417,0.000603,2e-05,0.000137,0.000232,0.000113,0.00018,8.9e-05,0.000154,0.00049,0.002087,0.001325,0.000528,4.7e-05,7.6e-05,0.000143,7.8e-05,0.00022,0.000139,0.000174,5.5e-05,0.000161,8.4e-05
7.5e-05,5.7e-05,0.000139,9.1e-05,8e-06,8.5e-05,7e-05,0.000131,9.2e-05,6.4e-05,8.9e-05,9.2e-05,4.5e-05,9e-06,7e-05,3.7e-05,1e-04,8.5e-05,8.8e-05,0.000257,2e-04,0.000887,0.005749,0.001728,0.002529,0.000249,0.001349,0.003082,0.004717,0.005795,0.001374,0.001435,0.003389,0.001309,0.003894,0.001574,0.003491,0.001773,0.000452,0.000853,0.000255,7e-04,0.000563,0.001484,0.001073,0.001001,0.002105,0.001755,0.001337,0.002603,0.002202,0.001617,0.001153,0.00166,0.000189,0.000829,0.000702,0.001181,0.001355,0.000238,0.000384,0.000292,0.000501,0.000222,0.000491,0.000364,0.000245,0.000447,0.000227,8e-05,0.000203,0.000259,9.3e-05,0.000174,0.000307,0.000219,0.000291,0.000671,0.000361,0.000225,0.000125,0.000575,0.000325,0.000171,0.000252,0.000475,0.000835,0.001029,0.000398,0.000508,0.000829,0.000443,0.000168,4.5e-05,4.2e-05,0.000191,0.001622,0.000891,0.000393,0.000191,0.000187,7.8e-05,0.000187,0.000138,7e-05,4.1e-05,8.9e-05,0.000521,0.00127,0.000532,0.000221,9.9e-05,0.000102,9.3e-05,4.5e-05,0.000193,0.000119,9.1e-05,0.000102,4.4e-05,0.000111
3.1e-05,1.1e-05,5.1e-05,2.6e-05,5.4e-05,2.8e-05,7.3e-05,4.1e-05,1.2e-05,4.2e-05,1.3e-05,3.5e-05,4.4e-05,2e-05,4.7e-05,8.2e-05,0.000105,8.9e-05,5.7e-05,0.000264,0.000166,0.00111,0.002797,0.002404,0.002987,0.001394,0.000984,0.003403,0.005201,0.00075,0.001391,0.001044,0.000974,0.00164,0.002228,0.000485,0.002281,0.000717,0.001319,0.002197,0.000733,0.001719,0.001715,0.001985,0.002627,0.000407,0.001479,0.00195,0.000966,0.001688,0.001482,0.001042,0.001354,0.000327,0.000297,0.000899,0.000315,0.001306,0.001111,7.9e-05,9.3e-05,0.000318,0.000273,0.000468,0.000269,0.00026,0.000223,0.000225,0.000152,0.000204,0.00025,0.000235,0.000134,0.00012,0.000111,4.6e-05,0.000208,0.000829,0.000594,0.000344,0.000153,0.000621,0.000365,9.5e-05,0.000166,0.000418,0.000595,0.000113,8e-05,0.000219,0.000548,0.000319,0.000142,6.8e-05,2.1e-05,0.00015,0.001321,0.000285,0.00012,0.000102,7.5e-05,3.8e-05,8.2e-05,4.1e-05,8e-06,1.5e-05,4.5e-05,0.000461,0.000265,0.000215,0.000112,0.000203,0.000102,0.000113,7.8e-05,0.000131,3.8e-05,5.4e-05,1e-05,6.2e-05,8.2e-05
1.6e-05,2.2e-05,2.3e-05,2.3e-05,3.6e-05,2.7e-05,5.4e-05,2.5e-05,1.9e-05,1.6e-05,2.2e-05,3.2e-05,9e-06,8e-06,2.3e-05,0.000125,0.000106,1.3e-05,6.2e-05,0.000193,0.000109,0.001324,0.001584,0.003485,0.001901,0.001538,0.000306,0.004077,0.000588,0.000668,0.002176,0.001826,0.000797,0.002501,0.00228,0.001708,0.001202,0.002194,0.000987,0.001236,0.001212,0.001602,0.002743,0.000217,0.000891,0.000718,0.00228,0.002871,0.001599,0.001344,0.002557,0.000953,0.00084,0.001705,0.001258,0.001502,0.000118,0.001297,0.001783,0.000568,0.000555,0.000343,0.000339,0.000852,0.000332,0.00023,0.000132,0.000161,0.000179,0.000292,0.000423,0.000245,9e-05,0.000165,9.6e-05,7.3e-05,0.000263,0.000666,0.00035,9.6e-05,8.3e-05,0.000686,0.000294,0.00021,0.000195,0.000247,0.00038,0.000308,0.000197,0.000329,0.000768,0.000476,0.000271,8.9e-05,0.000161,8.3e-05,0.001007,0.000344,0.000101,9.7e-05,0.00014,7.1e-05,1e-04,3e-05,2.5e-05,1.1e-05,5.4e-05,0.000482,0.000348,7.5e-05,3.4e-05,0.000185,8.5e-05,5.6e-05,4.9e-05,0.000135,0.000106,5.3e-05,1.2e-05,5.6e-05,6.5e-05
1.3e-05,8e-06,1.8e-05,1.5e-05,5.6e-05,2.9e-05,2.9e-05,1.5e-05,3.6e-05,2e-05,5.2e-05,4.6e-05,1.8e-05,3.4e-05,5.8e-05,0.000101,1.7e-05,3.7e-05,4.4e-05,0.000187,9.2e-05,0.001318,0.001828,0.001988,0.000437,0.00043,0.001109,0.003077,0.001059,0.00258,0.002668,0.002082,0.002664,0.001604,0.002344,0.001299,0.003729,0.004024,0.003268,0.003565,0.001866,0.001714,0.003147,0.002384,0.001348,0.000409,0.003805,0.001927,0.002616,0.001021,0.001394,0.001713,0.003178,0.00162,0.002747,0.002206,0.00068,7.9e-05,0.003209,0.000744,0.000456,0.000289,0.000312,0.000925,0.000261,0.00026,0.000447,0.000129,0.000435,0.000718,0.000339,0.000356,0.000114,0.000102,0.000247,0.000141,0.000204,0.00091,0.000127,0.000145,7.1e-05,0.000786,0.000165,0.000171,4.1e-05,0.000339,0.000284,0.000183,0.000183,0.000533,0.000104,6.6e-05,2.2e-05,5.1e-05,0.000133,0.000189,0.001435,0.000377,0.000206,6e-05,4.5e-05,4.2e-05,8.5e-05,3.1e-05,6e-06,1.1e-05,1.9e-05,0.000488,7.8e-05,6.3e-05,6.9e-05,0.00014,3.6e-05,4.7e-05,1.4e-05,0.000128,1.2e-05,1.3e-05,1.1e-05,4e-05,4.2e-05
3.5e-05,2.3e-05,1.9e-05,5e-05,1.5e-05,7.6e-05,0.000102,3.9e-05,4.5e-05,4.3e-05,0.000103,9.1e-05,4.2e-05,6.7e-05,1.3e-05,0.000133,5.5e-05,5.9e-05,9.6e-05,0.000113,7.8e-05,0.001046,0.001916,0.002141,0.00264,0.001003,0.001044,0.00059,0.002334,0.002672,0.00431,0.003315,0.003454,0.003744,0.004606,0.005247,0.00212,0.002603,0.00508,0.004546,0.001378,0.004098,0.004073,0.002175,0.003321,0.000737,0.002962,0.005265,0.004662,0.005407,0.002734,0.003706,0.003105,0.002952,0.000825,0.002053,0.000727,0.000601,0.003696,0.002649,0.000376,0.000463,0.000946,0.0015,0.000838,0.000793,0.000816,0.000158,0.000542,0.000657,0.001049,0.000284,0.000468,0.000156,0.000472,9.1e-05,5.5e-05,0.000653,0.000371,0.000167,4.1e-05,0.00081,0.000466,9.1e-05,0.00015,0.000528,0.000774,0.000556,0.000238,0.000545,0.000512,2.9e-05,9.3e-05,0.000119,0.000198,0.000348,0.002272,0.00157,0.00059,0.000111,6.7e-05,4e-05,0.000178,0.000142,3e-05,3.8e-05,6.8e-05,0.000483,0.000567,0.00031,8.9e-05,0.000117,0.000132,4.9e-05,1e-05,0.000103,0.00012,6.9e-05,2.5e-05,3.7e-05,7.6e-05
6e-06,3e-06,1.4e-05,5.4e-05,4.2e-05,6.7e-05,6e-05,9.1e-05,2e-05,4.1e-05,5.4e-05,5.2e-05,4.9e-05,4.4e-05,3.6e-05,0.00014,5.6e-05,4.8e-05,2.9e-05,0.000157,8e-05,0.000744,0.000105,0.00195,0.000981,0.001419,0.001011,0.001977,0.004872,0.005474,0.002946,0.008053,0.006004,0.009361,0.0063,0.006162,0.003796,0.006098,0.008101,0.009175,0.006397,0.00728,0.007685,0.010054,0.005926,0.006285,0.003784,0.005299,0.00965,0.001267,0.007599,0.009288,0.007306,0.005243,0.003576,0.00339,0.003006,0.001416,0.002382,0.002908,0.002246,0.002049,0.001723,0.001299,0.001804,0.001615,0.000771,0.000455,0.000854,0.000354,0.001345,0.001339,0.001008,0.000481,0.000502,0.000555,0.00014,0.000919,0.000734,0.000529,0.000135,0.000601,0.000556,0.000495,0.000172,0.000573,0.000976,0.001277,0.000565,0.000377,0.000233,0.000444,0.000169,5.7e-05,1e-04,0.000445,0.002192,0.00147,0.000851,0.000283,6.2e-05,0.000135,0.000173,5.4e-05,4.5e-05,5.1e-05,0.000127,0.00056,0.000758,0.000366,0.000125,4.9e-05,8.7e-05,0.000135,5.7e-05,9.9e-05,0.00013,4.2e-05,5.2e-05,1.3e-05,7.7e-05
2.3e-05,1.9e-05,4.4e-05,6.6e-05,3.5e-05,2.1e-05,9.6e-05,7.9e-05,7.5e-05,3.4e-05,5.7e-05,6.9e-05,4.7e-05,6.5e-05,9e-05,0.000189,0.000161,0.000101,0.000145,0.000188,2e-04,0.001099,0.001647,0.001926,0.002252,0.001484,0.001805,0.000715,0.005069,0.006367,0.010083,0.010165,0.009466,0.007707,0.006149,0.003444,0.004859,0.006245,0.008137,0.009253,0.011092,0.010792,0.010517,0.009009,0.007607,0.008158,0.006947,0.009993,0.003118,0.007545,0.008077,0.000301,0.004161,0.007264,0.005966,0.006384,0.00939,0.006782,0.002718,0.000429,0.001484,0.00176,0.00276,0.003054,0.002497,0.001881,0.001182,0.001517,0.000176,0.00035,0.001496,0.000818,0.000277,0.000106,0.000403,0.000353,0.000368,0.001267,0.001155,0.00032,0.000536,0.000348,0.000482,0.000132,0.000614,0.000131,0.000936,0.001214,0.000715,0.000383,0.000176,0.00048,0.000359,0.000187,0.000189,0.000499,0.002361,0.000809,0.000262,4.8e-05,0.000115,3.1e-05,0.000126,7.2e-05,4.6e-05,5.8e-05,2.9e-05,0.000394,0.000647,0.000359,0.000174,7.1e-05,7e-06,0.000106,5.8e-05,7.4e-05,4.9e-05,6.5e-05,7.1e-05,5.3e-05,4.8e-05
4.8e-05,6.9e-05,3.4e-05,2e-05,4.4e-05,8.6e-05,2e-05,2.5e-05,5.9e-05,3.3e-05,5e-05,2.9e-05,5.2e-05,2.7e-05,1e-04,0.00021,9.1e-05,9.9e-05,0.000123,0.000223,0.000222,0.001,0.001441,0.003649,0.00302,0.001689,0.001705,0.002225,0.005393,0.002265,0.005883,0.003356,0.002785,0.003048,0.005112,0.007322,0.009054,0.006159,0.002175,0.002961,0.005232,0.00188,0.002443,0.004572,0.004622,0.008248,0.002548,0.0054,0.006281,0.007301,0.000704,0.00244,0.007107,0.006984,0.002025,0.003511,0.004563,0.000933,0.002193,0.002262,0.001452,0.000713,0.001963,0.002713,0.001148,0.001458,0.001404,0.001859,0.00183,0.00086,0.001168,0.000634,0.000395,0.000239,0.000306,0.000429,0.000174,0.000969,0.001234,0.000794,0.000304,0.000623,0.000337,0.000595,0.000553,0.000586,0.000541,0.000711,0.000314,0.000118,0.000216,0.000144,5.9e-05,0.000101,0.000168,0.000387,0.001676,0.001116,0.000508,0.000207,9.4e-05,0.000138,0.000115,5.6e-05,5.5e-05,9.2e-05,3e-05,0.000382,0.000576,0.000255,0.00015,3.4e-05,1.5e-05,6.7e-05,3.7e-05,6.8e-05,2.2e-05,3.7e-05,4.5e-05,6.5e-05,6.6e-05
6.8e-05,6.7e-05,9e-05,6.2e-05,3.8e-05,5.6e-05,4.1e-05,4.4e-05,5.8e-05,5e-05,6.2e-05,5e-06,4.6e-05,6.8e-05,0.000141,0.00022,0.000152,0.000128,2e-06,0.000249,0.000169,0.000905,0.000919,0.002684,0.000919,0.001082,0.000591,0.002474,0.003783,0.005608,0.003807,0.003656,0.004806,0.003357,0.001453,0.004389,0.002828,0.002043,0.002848,0.002151,0.002083,0.00322,0.00178,0.001187,0.004576,0.00198,0.00037,0.001286,0.002031,0.001663,0.002155,9e-04,0.004367,0.003937,0.003767,0.000749,0.003783,0.004128,0.002021,0.001318,0.001348,0.00075,0.000606,0.000834,0.000161,0.000641,0.001242,0.000617,0.000476,0.000936,0.000564,0.000185,0.000474,0.000408,0.000336,0.000657,0.000949,0.000726,0.001383,0.000694,0.000164,0.000349,0.000376,0.000424,0.000393,0.000278,0.000868,0.000674,0.00033,8.8e-05,6.2e-05,0.000285,0.000182,0.000126,5e-06,0.000259,0.001287,0.001052,0.000469,0.000201,5.5e-05,6.2e-05,4.5e-05,1.6e-05,8.8e-05,4.6e-05,7.4e-05,0.00039,0.00037,0.000264,0.000124,9.7e-05,5.2e-05,8.1e-05,8.6e-05,6.3e-05,6.5e-05,1.1e-05,2.4e-05,2.7e-05,0.000103
6.1e-05,7.5e-05,4.9e-05,2.7e-05,1.5e-05,4.7e-05,6.4e-05,6.9e-05,7e-05,4.2e-05,5.2e-05,5.5e-05,6e-05,8.4e-05,4.3e-05,3e-05,3.8e-05,8.1e-05,7.1e-05,0.000166,6.8e-05,0.000645,0.001807,0.002381,0.002376,0.000978,0.000741,0.000867,0.002606,0.002063,0.002211,0.00207,0.003209,0.00103,0.000632,0.003199,0.00147,0.002836,0.00309,0.001874,0.001652,0.001017,0.001071,0.00203,0.004453,0.003331,0.001759,0.001676,0.001323,0.001299,0.002044,0.003309,0.000812,0.002918,0.004639,0.002612,0.001743,0.002094,0.00174,0.001564,0.000875,0.00106,0.001829,0.001293,0.00012,0.000315,0.000412,4.8e-05,0.000458,0.000149,0.000256,0.000379,0.000556,0.000168,0.000303,0.000511,0.000889,0.001194,0.001445,0.000683,0.00015,0.000156,0.000207,0.000164,0.000468,0.000245,0.001066,0.000499,0.000228,4.4e-05,0.000119,0.00034,0.000224,0.000105,4.9e-05,9e-05,0.000971,0.001379,0.000793,0.000347,0.000151,9.5e-05,6.8e-05,3.4e-05,5.9e-05,0.000105,7.1e-05,0.000339,0.000525,0.000455,0.000207,5.2e-05,3.7e-05,0.000115,9.9e-05,5.9e-05,7.5e-05,7.2e-05,4.7e-05,1.4e-05,3.1e-05
2.5e-05,3.3e-05,4e-05,2.3e-05,1.8e-05,5.1e-05,3.3e-05,1.5e-05,1.6e-05,6.3e-05,6.4e-05,1.9e-05,3.8e-05,3.7e-05,6.1e-05,4.5e-05,5.1e-05,0.00011,1.5e-05,7.1e-05,0.000216,0.000644,0.001262,0.001066,0.001192,0.000725,0.000978,0.000479,0.001343,0.001493,0.001653,0.001322,0.001036,0.00132,0.000686,0.000661,0.000857,0.004167,0.001752,0.000458,0.001913,0.000829,0.000632,0.001313,0.002246,0.000344,0.003655,0.001681,0.001434,0.000738,0.000888,0.001878,0.000643,0.002389,0.001375,0.000724,0.001193,0.001782,0.000666,0.000762,0.000423,0.000481,0.001404,0.000191,0.000492,0.000493,0.000844,0.000398,0.000467,0.000462,0.000183,0.00013,0.000147,0.000255,0.000271,0.000195,0.000538,0.000505,0.000613,0.000275,0.00039,0.000174,8.8e-05,0.000318,0.000333,2.6e-05,0.001259,0.000899,0.000372,0.000102,4.8e-05,0.000178,9e-05,7e-05,5.2e-05,2.5e-05,0.001109,0.001335,0.00061,0.000129,7.3e-05,6.4e-05,9e-06,4.1e-05,3.8e-05,5.5e-05,3.7e-05,0.000294,0.000444,8.3e-05,4.5e-05,4e-05,6.6e-05,6.9e-05,3.3e-05,3.9e-05,8.5e-05,4.1e-05,3.6e-05,5.5e-05,5.8e-05
3e-05,2.8e-05,3.5e-05,1.9e-05,1.7e-05,3.1e-05,5.4e-05,3.5e-05,5.7e-05,6.4e-05,9.3e-05,5.1e-05,6.5e-05,3.6e-05,4.1e-05,4.5e-05,1.3e-05,8.2e-05,9.5e-05,5.6e-05,0.000233,0.000731,0.000511,0.001273,0.001703,0.000775,0.00087,0.001019,0.000483,0.001136,0.001664,0.001934,0.000958,0.001321,0.000557,0.002082,0.000857,0.002454,0.001499,0.000958,0.001119,0.001362,0.001434,0.000485,0.000826,0.001233,0.002867,0.001587,0.001633,0.000541,0.001713,0.000439,0.001337,0.001281,0.00073,0.000359,0.001122,0.000269,0.001213,0.000499,0.000516,0.000534,0.00032,0.000625,0.000543,6.9e-05,0.000532,0.000121,0.000368,0.000324,0.000244,0.000111,5.5e-05,0.000132,7.6e-05,0.000116,0.000221,0.000433,0.000509,0.000496,0.000119,0.000201,8.3e-05,0.000166,0.000223,3e-04,0.001379,0.000873,0.000431,0.000146,0.000142,0.000214,0.000103,8.4e-05,4.9e-05,3.5e-05,0.001226,0.000456,0.000286,5e-05,4.2e-05,4.3e-05,4.5e-05,3.7e-05,3e-05,5.4e-05,1e-05,0.000247,0.000143,0.000158,6.1e-05,5.9e-05,4.1e-05,7.3e-05,2.3e-05,1.9e-05,2.6e-05,4.3e-05,2.9e-05,2.7e-05,3.4e-05
2e-05,2.5e-05,2.1e-05,1e-05,8e-06,4e-06,9e-06,5e-06,1.8e-05,1.9e-05,4.1e-05,3.5e-05,7e-06,9e-06,1.5e-05,1.6e-05,1.1e-05,2.1e-05,2.5e-05,1.3e-05,5.4e-05,0.000281,0.000541,0.000415,0.000604,0.000173,0.000167,0.000758,0.000419,0.000458,0.000259,0.000553,0.000432,0.000225,0.000496,0.00048,0.000245,0.000825,0.000533,0.000484,0.000518,0.000441,0.000655,0.00039,0.000215,0.000266,0.000658,0.000223,0.000228,7.4e-05,0.000566,0.000435,0.00044,0.000214,0.000138,0.000141,0.000337,0.000101,0.000264,0.000124,0.000261,0.000164,7.3e-05,0.00016,9e-05,6.5e-05,0.000132,9.8e-05,8.9e-05,0.000101,7e-05,5.5e-05,2.8e-05,2.3e-05,8.5e-05,0.000123,4.3e-05,2.6e-05,0.000283,4e-05,0.000106,0.00019,0.000159,7e-05,4.7e-05,9.7e-05,0.000572,0.000291,0.000125,8.1e-05,5.9e-05,8.5e-05,2.1e-05,3e-06,1.5e-05,4.4e-05,0.000532,0.000358,0.000166,3.5e-05,2.1e-05,1.8e-05,2.2e-05,1.2e-05,7e-06,1.7e-05,1.7e-05,0.000119,9.1e-05,2.8e-05,1e-05,1.7e-05,5e-06,2.7e-05,2.1e-05,2.6e-05,1.8e-05,1.6e-05,8e-06,1.4e-05,2.1e-05
1.2e-05,1.1e-05,2e-05,1.9e-05,1.3e-05,1.1e-05,9e-06,8e-06,4e-06,1.7e-05,1.6e-05,1e-06,5e-06,1.1e-05,1.8e-05,1.5e-05,1.1e-05,1e-05,1.6e-05,8e-06,8e-06,0.000228,0.000283,0.000269,0.000394,0.000464,0.000351,0.000676,0.000166,0.000846,0.000922,0.000137,0.000241,0.000259,0.000777,7e-04,0.000172,0.000448,0.000345,0.000507,0.000587,9.5e-05,0.000943,0.000301,0.000301,0.000465,0.000768,0.000322,0.000277,0.000107,0.000281,0.000244,0.000611,0.000202,0.000223,0.000144,0.000418,4.1e-05,0.000213,0.000116,0.000156,0.000203,3.7e-05,0.000143,5e-05,3.3e-05,6.8e-05,4.4e-05,5.2e-05,9.2e-05,2.5e-05,1.6e-05,2.3e-05,1.3e-05,0.000127,4.4e-05,4.1e-05,4.8e-05,0.000139,0.000144,9.9e-05,0.000119,2.6e-05,4.5e-05,5.9e-05,9.5e-05,0.000365,0.000158,7.4e-05,4.3e-05,0.000107,3e-05,3.6e-05,1.4e-05,8e-06,3e-05,0.000402,0.000186,9.9e-05,3.3e-05,1.4e-05,2.1e-05,1.4e-05,7e-06,4e-06,1.7e-05,2.2e-05,8.8e-05,3.5e-05,2.6e-05,1.8e-05,3e-06,7e-06,3.3e-05,3.2e-05,5e-06,5e-06,1e-05,5e-06,1.8e-05,9e-06
1.1e-05,1.8e-05,3e-06,3e-06,1.9e-05,6e-06,6e-06,4e-06,1e-05,1.6e-05,1.5e-05,1.3e-05,7e-06,8e-06,1.8e-05,1.1e-05,5e-06,9e-06,3e-06,1.2e-05,3.5e-05,0.000199,0.000188,0.000471,0.000542,0.000119,7.6e-05,0.00024,0.000264,0.000725,0.00021,6.5e-05,0.000294,9.3e-05,0.000825,0.000231,0.000435,0.00084,0.000746,0.000339,0.000209,0.000318,0.000971,0.000445,0.000366,0.000306,0.000401,0.00036,0.000587,0.000543,0.000252,0.000127,0.000569,0.000207,0.000131,0.000155,0.000358,0.000187,0.000273,8.3e-05,0.000107,0.000169,8.8e-05,7.5e-05,2.7e-05,6.8e-05,7.2e-05,3.2e-05,4.7e-05,5e-05,1.3e-05,7e-06,3e-05,1.4e-05,0.000109,7.2e-05,4.8e-05,0.000114,0.00012,6.5e-05,0.000107,1e-05,4.4e-05,3.4e-05,4.7e-05,7.9e-05,0.00028,2.4e-05,1.4e-05,9e-06,5.3e-05,9e-06,1.3e-05,2e-05,8e-06,1.8e-05,0.000201,9.7e-05,1.9e-05,4e-06,1.4e-05,1.6e-05,9e-06,9e-06,9e-06,1.1e-05,7e-06,9.2e-05,5.3e-05,1.1e-05,1.1e-05,1.5e-05,1.9e-05,1.7e-05,9e-06,1e-06,2e-06,5e-06,8e-06,1.2e-05,1.6e-05
9e-06,1.6e-05,1.3e-05,5e-06,1.3e-05,1e-05,1e-05,8e-06,1e-05,5e-06,5e-06,1.3e-05,8e-06,9e-06,1.6e-05,1.6e-05,6e-06,1.1e-05,8e-06,2e-05,4.7e-05,0.000136,0.000462,0.000399,0.000216,2e-04,0.000125,0.000427,0.000135,9.4e-05,0.000296,0.000549,0.000339,0.000403,0.000349,0.00058,0.000405,0.000639,0.000179,0.000125,0.000812,0.000362,0.000487,0.000326,0.000453,0.000415,0.000251,0.000785,0.00024,0.000301,0.000205,0.000148,0.000688,0.000343,0.000152,0.000176,0.000167,3e-05,0.000224,0.000117,0.000157,9.9e-05,0.000104,2.9e-05,4e-05,4.9e-05,2.7e-05,1.9e-05,2.4e-05,4.8e-05,2.3e-05,2.9e-05,3.1e-05,3.1e-05,7.3e-05,1.1e-05,1e-04,0.000136,6.2e-05,4.3e-05,7.9e-05,5.9e-05,5.8e-05,3.8e-05,4.1e-05,4.1e-05,0.000208,5.1e-05,1.2e-05,1.9e-05,6.1e-05,2.4e-05,7e-06,1.2e-05,1.3e-05,2.8e-05,3e-06,6.6e-05,6.4e-05,1.9e-05,1.8e-05,1.7e-05,1.5e-05,1.3e-05,1.1e-05,7e-06,2e-06,7.3e-05,5.4e-05,1.8e-05,4e-06,1.9e-05,1.6e-05,2.7e-05,1.3e-05,1.2e-05,1.3e-05,5e-06,1.1e-05,1.2e-05,1.9e-05
9e-06,1e-05,5e-06,1.1e-05,1.3e-05,7e-06,1.4e-05,9e-06,4e-06,8e-06,5e-06,7e-06,1.1e-05,6e-06,1.3e-05,5e-06,8e-06,1.4e-05,6e-06,2.2e-05,4.2e-05,0.000182,0.000332,0.000337,0.000289,0.000147,0.000171,0.000744,0.000584,0.000109,0.000141,0.000723,0.000665,0.000557,0.000332,0.000403,0.000456,0.00025,6.1e-05,0.000304,0.000621,0.000491,0.000363,0.000254,0.000532,0.000231,0.000537,0.000345,0.000491,0.000559,9.8e-05,0.000229,0.000465,2.5e-05,5.7e-05,0.000225,0.000147,9.1e-05,0.000257,2.5e-05,0.000238,0.000187,7.7e-05,0.00016,0.000101,4.6e-05,5.1e-05,3.3e-05,4e-05,6.9e-05,3.8e-05,2.7e-05,2.9e-05,9e-06,7.1e-05,6.3e-05,7.6e-05,0.000135,5.2e-05,2.6e-05,9.5e-05,9.3e-05,6.6e-05,5e-06,4e-05,2.7e-05,0.000188,5.9e-05,2.5e-05,4.6e-05,4.7e-05,1e-05,1.8e-05,1.8e-05,1.6e-05,3.5e-05,0.000146,8e-05,5.4e-05,2.5e-05,1.2e-05,2.2e-05,1.3e-05,1.6e-05,6e-06,1e-05,1e-05,5.6e-05,2.3e-05,3.2e-05,6e-06,9e-06,4e-06,1.2e-05,3e-06,1.4e-05,1.5e-05,1.2e-05,5e-06,4e-06,1.5e-05
4e-06,1.6e-05,1.3e-05,1.4e-05,6e-06,1.2e-05,1.5e-05,1.8e-05,9e-06,1.6e-05,7e-06,6e-06,1.3e-05,9e-06,1.2e-05,1.9e-05,8e-06,2.4e-05,9e-06,2.1e-05,2e-05,0.000165,9.5e-05,0.000228,0.000208,8.7e-05,7.6e-05,0.000586,0.000267,0.000448,0.000291,0.000349,0.00038,0.000508,0.000396,0.000281,0.000501,0.000388,0.000118,0.000309,0.000266,0.000183,0.000446,0.00025,0.000338,0.000521,0.00036,0.000166,0.000416,0.000171,0.000172,0.00063,0.000512,0.000136,0.000104,0.000129,0.00025,0.00013,0.000114,6.3e-05,0.000242,8.5e-05,4.9e-05,5e-05,0.000147,6.5e-05,6e-06,5.6e-05,9.4e-05,8e-05,2.9e-05,3.3e-05,7e-06,3.2e-05,1.3e-05,2.6e-05,4.6e-05,5.2e-05,4.1e-05,1.8e-05,8.3e-05,0.000131,5.7e-05,2.2e-05,3.7e-05,9.3e-05,0.00019,6.7e-05,2.4e-05,3.2e-05,3.2e-05,1.4e-05,7e-06,1.1e-05,2.5e-05,1.9e-05,0.000212,0.00015,3.6e-05,2.3e-05,1.5e-05,2.8e-05,1.4e-05,3e-06,3e-06,2e-06,8e-06,5.8e-05,7.1e-05,2e-05,1.8e-05,2.3e-05,2e-05,1.5e-05,1e-05,1.7e-05,3e-06,4e-06,8e-06,1e-06,1.6e-05
9e-06,1.7e-05,8e-06,6e-06,1.4e-05,1.2e-05,2e-06,5e-06,1.2e-05,1.8e-05,7e-06,1.2e-05,1.6e-05,1.2e-05,1.9e-05,1.4e-05,4e-06,1.8e-05,2.1e-05,3e-05,5.8e-05,0.00014,0.000407,0.00031,0.000418,0.000236,0.000284,0.000258,0.000243,0.000292,0.000508,0.000104,0.000174,0.000135,0.000433,0.000531,0.000553,0.000305,0.000349,0.000288,0.000226,3.7e-05,0.000449,0.000214,6.8e-05,0.000137,6e-04,0.000326,0.000477,0.000378,0.000277,0.00064,0.000416,0.000297,0.000213,0.00023,0.000177,0.000194,0.00016,0.000153,0.000167,0.000222,4e-05,0.000117,0.000117,7.7e-05,0.000119,7.5e-05,9e-05,8.8e-05,4.7e-05,7.6e-05,5.5e-05,1.4e-05,3.3e-05,5.1e-05,5.8e-05,7.2e-05,3.5e-05,5.5e-05,5.6e-05,8.4e-05,3.6e-05,4.3e-05,5e-06,7.4e-05,0.000188,7e-05,4.5e-05,3.9e-05,3.4e-05,2.7e-05,2e-05,1.9e-05,1.1e-05,2.1e-05,0.000257,0.000212,7e-05,2.8e-05,2.9e-05,3.7e-05,1.2e-05,2e-06,8e-06,8e-06,1.4e-05,2.8e-05,5.6e-05,5.5e-05,1.2e-05,2.4e-05,2.4e-05,1.8e-05,8e-06,1.4e-05,8e-06,7e-06,1.1e-05,1.4e-05,2.2e-05
1e-05,1.1e-05,9e-06,1.3e-05,2.3e-05,3e-05,2.9e-05,1.8e-05,1e-05,2.6e-05,1.6e-05,1.5e-05,2.7e-05,1e-05,1.2e-05,2.1e-05,6e-06,3e-06,1.9e-05,4.9e-05,4.3e-05,0.000213,0.000403,0.000234,0.000287,0.00025,9.7e-05,0.00016,0.000222,0.000797,0.000591,0.000472,0.000456,0.000238,0.000462,0.000521,0.000445,8.9e-05,0.000228,0.00037,0.000347,0.000259,0.000479,0.000291,0.000484,0.000327,0.000236,0.000123,0.000235,0.000165,0.000473,0.000136,0.000207,0.000169,6.6e-05,0.00025,0.000511,0.000198,0.000238,2.6e-05,0.000106,3.4e-05,0.000169,0.000271,0.000132,0.000113,1e-04,4.2e-05,3.7e-05,4.4e-05,8.8e-05,6.5e-05,6.1e-05,3.2e-05,7e-06,5e-05,0.000108,4.9e-05,6.5e-05,3.1e-05,8.4e-05,4.6e-05,4.2e-05,4.9e-05,8e-06,4.6e-05,9.1e-05,6.8e-05,4.1e-05,3.4e-05,9e-06,3.2e-05,5e-06,1.6e-05,1.7e-05,1.6e-05,0.000248,3.6e-05,0.000107,4e-05,3.5e-05,8e-06,8e-06,9e-06,9e-06,1.4e-05,2.6e-05,3e-05,7e-05,2.6e-05,1.3e-05,3.8e-05,1.7e-05,3.6e-05,3e-05,3e-05,2.2e-05,3e-06,8e-06,1.8e-05,3.2e-05
1.3e-05,5e-06,1.1e-05,2.1e-05,1.8e-05,1.1e-05,1.8e-05,1e-05,8e-06,7e-06,3e-06,1e-05,5e-06,2e-06,4e-06,1.7e-05,4e-06,1.3e-05,3e-05,8e-06,4.2e-05,0.000191,0.00023,0.000399,0.000455,0.000329,0.000315,0.000285,0.000281,0.000548,0.000321,0.000291,0.000301,0.000229,0.000378,0.000237,0.000483,0.000501,0.000536,6.8e-05,0.000195,0.000289,0.000213,0.000179,0.000518,0.000152,0.000132,0.000495,0.00025,0.000289,0.00028,0.000358,0.000281,0.000168,0.000161,0.000204,0.000288,0.000452,0.000304,0.00014,6.2e-05,0.000222,0.000194,7e-05,0.000135,0.000146,0.000168,5.4e-05,5.7e-05,9e-05,0.00012,0.000149,6.4e-05,3.3e-05,3.8e-05,4.4e-05,5e-05,3.5e-05,0.000108,8.7e-05,8.4e-05,5.1e-05,6.4e-05,2.4e-05,4.9e-05,4.6e-05,4.6e-05,8.1e-05,4.7e-05,2.2e-05,6.2e-05,7e-06,1.6e-05,1.3e-05,1.8e-05,1.9e-05,0.000208,0.000127,0.000114,6.6e-05,2.6e-05,2.3e-05,1.6e-05,8e-06,6e-06,1e-06,1.7e-05,2.4e-05,5.6e-05,2.7e-05,1.6e-05,3.2e-05,1.8e-05,2.3e-05,2.9e-05,1.8e-05,6e-06,1.7e-05,2.1e-05,9e-06,1.4e-05
5e-06,3e-06,1.7e-05,9e-06,5e-06,1e-05,6e-06,7e-06,2e-06,8e-06,8e-06,4e-06,2e-06,2e-06,5e-06,1.6e-05,6e-06,9e-06,2.3e-05,3.5e-05,2.5e-05,0.000186,0.00011,0.000251,0.000688,0.000299,0.00044,0.000621,0.000268,0.000241,0.000409,9.3e-05,0.000115,9.6e-05,0.000412,0.000576,0.00039,0.000488,0.00014,0.000229,0.000195,0.00016,0.00026,2e-04,0.000251,0.000194,0.000239,0.000392,0.000434,0.000303,0.000336,0.000457,0.000456,0.000169,0.000167,0.000282,0.000245,0.000214,0.000338,0.000113,7.9e-05,0.00026,0.000435,0.00033,0.000309,0.000109,7.6e-05,6e-05,3.9e-05,6.5e-05,8.9e-05,5.5e-05,6e-06,3.8e-05,3.2e-05,3.3e-05,2e-05,7.6e-05,8.8e-05,3.4e-05,5.3e-05,9.9e-05,2.5e-05,6e-06,5.4e-05,8e-05,5.4e-05,5.3e-05,3.2e-05,1.3e-05,8.1e-05,4.5e-05,3.7e-05,3.3e-05,1.8e-05,1.9e-05,0.000205,0.00018,8.5e-05,4.3e-05,2.9e-05,1.6e-05,1.7e-05,2e-05,1.2e-05,2e-06,1e-05,3.4e-05,9.1e-05,6.4e-05,2.2e-05,2.8e-05,1.2e-05,7e-06,1.9e-05,2e-05,1.2e-05,1e-05,1e-05,9e-06,1.2e-05
1e-05,1.3e-05,2.4e-05,7e-06,1.3e-05,1.2e-05,4e-06,8e-06,1.3e-05,9e-06,1.2e-05,2.7e-05,1.7e-05,9e-06,1.6e-05,1.3e-05,3e-06,2.7e-05,1.5e-05,3.1e-05,7.8e-05,0.00019,7.9e-05,0.000264,0.000515,0.00052,0.000367,0.000492,0.000212,0.000459,0.000203,0.000227,0.000208,0.000112,0.000558,0.000317,0.00031,6.7e-05,0.000223,0.00029,0.000242,0.000116,0.000229,7.9e-05,0.000137,7.6e-05,0.000284,0.000241,0.000263,0.000141,0.000509,0.000275,7.2e-05,0.000197,0.000303,0.000261,0.000436,0.00031,0.000359,3e-04,0.000264,8.8e-05,0.000284,0.000122,0.000254,0.000234,7.1e-05,6.5e-05,3.2e-05,5.8e-05,5.8e-05,6.4e-05,6.2e-05,7e-05,5e-05,7e-05,5.4e-05,8.8e-05,0.000123,5.8e-05,5.3e-05,0.000149,0.000142,5.6e-05,4.8e-05,0.000115,0.000202,4e-05,9e-06,1.8e-05,5.9e-05,1.8e-05,2e-05,1.7e-05,1.7e-05,2.5e-05,0.000236,0.000115,5.9e-05,5e-05,1.2e-05,1.9e-05,2.3e-05,2.2e-05,1.5e-05,1.7e-05,1.3e-05,1.8e-05,0.000205,0.000101,3.7e-05,9e-06,7e-06,1.3e-05,4e-06,2.1e-05,2e-05,2.2e-05,1.5e-05,2.2e-05,2.1e-05
1.3e-05,1.5e-05,3e-06,5e-06,2.8e-05,5e-06,1.9e-05,5e-06,1.5e-05,1.8e-05,8e-06,2.6e-05,2.5e-05,1.1e-05,1.2e-05,1.7e-05,2.6e-05,5.1e-05,3.4e-05,4e-05,8.3e-05,0.000163,0.000156,0.000122,0.000523,0.000355,0.000255,0.000596,0.000358,0.000385,0.000246,0.000198,0.00025,0.000161,0.000466,0.000212,0.000411,0.000295,0.00023,0.000237,0.000247,0.000177,3.7e-05,0.000264,0.000215,4.8e-05,0.000385,0.00033,0.000248,0.000159,0.000428,0.000102,0.000307,0.000138,0.000154,0.000387,3.2e-05,0.000206,0.000121,1.6e-05,9.8e-05,7.1e-05,0.000107,9.6e-05,0.000203,0.000102,7.9e-05,5.4e-05,7.2e-05,7.7e-05,2.3e-05,1.2e-05,1.2e-05,4.6e-05,4.8e-05,3.2e-05,1.8e-05,7.9e-05,0.000191,0.000132,8.9e-05,8.8e-05,0.000111,8.1e-05,7.8e-05,6e-05,9.5e-05,3.4e-05,9e-06,7e-06,2.8e-05,1.2e-05,1.9e-05,2.3e-05,2.7e-05,3.2e-05,0.000311,0.000213,0.000124,3.8e-05,6.4e-05,2.1e-05,3.1e-05,3.8e-05,1.9e-05,1.6e-05,1e-05,3.6e-05,0.000246,0.000151,6.2e-05,1.1e-05,1.2e-05,1.5e-05,2e-05,1.4e-05,1.4e-05,1.3e-05,2.2e-05,2.5e-05,9e-06
2e-05,6e-06,3e-06,4e-06,2.4e-05,2.5e-05,3.9e-05,2.6e-05,1.5e-05,2e-05,2e-05,5e-06,2.1e-05,1.4e-05,7e-06,1e-05,2.6e-05,1.3e-05,2.1e-05,3.2e-05,0.000112,0.000233,0.000209,0.000204,0.000512,0.00017,0.000193,0.000624,0.000309,0.000344,0.000317,0.000354,6.2e-05,9.1e-05,0.000231,0.000203,0.000285,0.000229,0.000425,0.000146,0.000325,9.2e-05,0.000104,2.7e-05,0.000191,6e-06,0.000412,0.000178,0.000414,0.000272,9.2e-05,0.000285,7.8e-05,4.8e-05,1.6e-05,0.000168,0.00017,0.000141,9.3e-05,5.8e-05,8.5e-05,6.7e-05,6.4e-05,3.9e-05,6e-05,3.8e-05,4.1e-05,1.9e-05,2.3e-05,8.5e-05,1.8e-05,4.7e-05,3.1e-05,1.7e-05,4.3e-05,1.8e-05,4.2e-05,0.000123,0.00027,0.000122,5.4e-05,9.3e-05,2.7e-05,4.9e-05,1.5e-05,5.5e-05,0.00017,9.6e-05,5e-05,1.9e-05,3.1e-05,3.5e-05,2.9e-05,1.8e-05,7e-06,1.8e-05,0.000379,0.000225,9.5e-05,2.5e-05,3.8e-05,2.9e-05,1.9e-05,1.6e-05,8e-06,1e-05,6e-06,3.8e-05,0.000158,6.1e-05,1.7e-05,1.7e-05,8e-06,1.3e-05,2e-05,1.3e-05,1.5e-05,2.6e-05,3e-06,7e-06,2.2e-05
3e-06,3e-06,7e-06,1.3e-05,2e-06,1.3e-05,2.4e-05,8e-06,6e-06,1.8e-05,8e-06,1.1e-05,1.7e-05,3e-06,8e-06,2.5e-05,2.6e-05,2.2e-05,1.6e-05,2.7e-05,0.000113,0.000127,0.000285,7e-05,0.000149,0.000374,0.00039,0.000429,0.000314,0.000211,0.000144,0.000271,6.8e-05,0.000342,4.9e-05,0.000397,0.000444,0.000356,0.00013,0.000395,0.000256,0.000197,0.000244,0.000172,0.000298,0.000134,0.000237,0.000135,0.000444,0.000131,0.000157,0.000206,0.000152,5.2e-05,5.9e-05,0.000244,0.000149,0.000181,0.000219,0.000109,0.000186,6.8e-05,3.4e-05,4.7e-05,0.000107,6.8e-05,3.2e-05,1.3e-05,3.9e-05,7.8e-05,3e-05,4.2e-05,6.9e-05,3.7e-05,4.4e-05,1.5e-05,5.8e-05,6.2e-05,0.000223,9.5e-05,2.1e-05,5.9e-05,8.5e-05,2.3e-05,1.2e-05,3.8e-05,0.000129,6e-05,4.5e-05,7e-06,2.3e-05,5e-05,2.5e-05,1.6e-05,2.2e-05,2e-05,0.000383,0.000143,0,4.5e-05,8e-06,3e-06,2.2e-05,1.4e-05,2e-05,1.5e-05,1.5e-05,3.5e-05,4.8e-05,3.7e-05,1.1e-05,2.3e-05,3e-06,1.6e-05,1.6e-05,6e-06,5e-06,1e-05,1.6e-05,9e-06,1.1e-05
5e-06,3e-06,1.7e-05,8e-06,8e-06,4e-06,1.4e-05,1.3e-05,2e-05,5e-06,2e-06,1.3e-05,1e-06,1.5e-05,7e-06,1.6e-05,8e-06,1.1e-05,1.2e-05,3.1e-05,7.2e-05,0.000114,0.000271,0.000332,0.000272,7.7e-05,0.000275,0.000127,0.000117,0.000127,0.000238,0.000165,0.000273,0.000353,0.000403,0.000344,0.000235,0.000164,0.000378,0.000146,0.000153,0.000224,0.000322,6.4e-05,0.000146,0.000131,0.000198,0.000205,0.000319,0.000126,0.000255,0.000135,0.000144,8.1e-05,3.9e-05,0.000243,0.000117,0.000198,0.000132,0.000105,8.2e-05,5.9e-05,3.8e-05,3.8e-05,0.000119,3.5e-05,7.9e-05,7.4e-05,7.3e-05,7.6e-05,6.1e-05,4.2e-05,5.3e-05,6.7e-05,4.5e-05,4e-06,3.8e-05,0.000106,0.000233,0.000136,3.3e-05,4.1e-05,4.5e-05,5.7e-05,1.3e-05,1.1e-05,0.000137,6.2e-05,3.2e-05,2.9e-05,2.6e-05,1.4e-05,2.8e-05,2.8e-05,1.3e-05,1.9e-05,0.000339,0.000203,8.6e-05,2.3e-05,2e-05,3e-06,2.9e-05,9e-06,9e-06,7e-06,1.6e-05,2.5e-05,7.3e-05,3.5e-05,2e-05,2.6e-05,1.6e-05,2e-05,2.9e-05,2.9e-05,2e-05,1e-05,5e-06,1.4e-05,1.4e-05
3e-06,5e-06,1.9e-05,2.1e-05,6e-06,4e-06,5e-06,7e-06,1.1e-05,7e-06,6e-06,1.3e-05,0,9e-06,8e-06,1.2e-05,1.5e-05,1e-05,1.1e-05,3.4e-05,6.6e-05,7.8e-05,0.000206,0.00017,0.000497,0.000544,0.000364,3.7e-05,9.7e-05,0.00053,0.000237,0.000191,0.000111,0.000222,0.000245,7.3e-05,0.000285,2e-04,0.000468,0.000532,0.000545,0.000263,0.000266,0.000299,0.000302,9.8e-05,0.000439,0.000356,9.9e-05,0.00023,0.000269,4.8e-05,0.000245,0.000113,0.000135,9.7e-05,3.3e-05,0.000149,0.000199,1.4e-05,9e-05,7e-05,6.4e-05,8e-05,7.3e-05,7.4e-05,7.7e-05,5.5e-05,3.1e-05,2.8e-05,6e-06,1.1e-05,7e-06,5.1e-05,8e-06,8e-06,2.3e-05,7.5e-05,0.000194,0.000125,4.5e-05,5.4e-05,6e-05,2.3e-05,1.6e-05,6e-06,0.000124,6.6e-05,4.2e-05,1.7e-05,1.6e-05,4.5e-05,3.4e-05,4.5e-05,3.7e-05,3.1e-05,0.000265,0.000207,9.1e-05,2.6e-05,1.8e-05,1.6e-05,3.2e-05,2.4e-05,9e-06,7e-06,1.1e-05,4.1e-05,8.5e-05,3.2e-05,2.1e-05,8e-06,1.2e-05,1.3e-05,1.3e-05,5e-06,1.7e-05,1.3e-05,5e-06,2e-05,1.3e-05
5e-06,2e-06,1e-05,3e-06,3e-06,4e-06,4e-06,6e-06,1e-06,3e-06,6e-06,8e-06,8e-06,1e-05,6e-06,9e-06,9e-06,8e-06,4e-06,3.3e-05,4.2e-05,0.000103,0.000288,0.000132,0.000465,0.000537,0.000373,7.3e-05,1.3e-05,0.000388,0.00029,0.000349,0.000203,7.4e-05,0.000223,0.000198,0.00013,0.000211,0.000348,5.5e-05,0.000117,0.000121,0.000486,0.000238,0.000344,0.000406,8.5e-05,0.000392,0.000368,0.00018,7.4e-05,0.000181,0.000507,0.000231,6.6e-05,0.00014,0.000102,8.2e-05,2.7e-05,4.9e-05,0.000124,6.6e-05,6e-06,7.8e-05,4.5e-05,6.3e-05,3.5e-05,8e-06,1.4e-05,4.9e-05,2.8e-05,1.8e-05,2.3e-05,4.4e-05,4.1e-05,1.8e-05,3.7e-05,5.2e-05,0.000131,7.5e-05,7e-06,3.4e-05,5.7e-05,4.2e-05,2.3e-05,1.4e-05,0.000104,5.6e-05,2.8e-05,2.7e-05,3.3e-05,8e-06,1.9e-05,2.5e-05,1.2e-05,9e-06,0.000127,4e-05,3.6e-05,8e-06,1e-05,1.1e-05,1.6e-05,1.3e-05,4e-06,6e-06,1e-05,3.3e-05,6.4e-05,3.4e-05,8e-06,7e-06,7e-06,1e-05,1.3e-05,1.6e-05,9e-06,1e-06,2e-06,1.4e-05,1.6e-05
2e-06,4e-06,1e-06,4e-06,1e-06,3e-06,7e-06,4e-06,0,3e-06,2e-06,8e-06,6e-06,5e-06,3e-06,7e-06,9e-06,8e-06,7e-06,1.8e-05,1.5e-05,0.000107,0.000237,0.000217,0.000148,8.9e-05,0.000196,0.000101,8.7e-05,6.3e-05,0.000171,0.000221,3.8e-05,0.000124,0.000132,0.000234,0.000183,6.1e-05,0.00014,0.000117,9.7e-05,1e-04,0.000295,0.000233,0.000175,0.000194,0.000347,0.000307,0.000289,0.000126,7e-05,0.00011,0.000335,7.1e-05,8e-05,7.5e-05,0.000104,5.1e-05,3.9e-05,2.4e-05,0.000118,1e-05,3.9e-05,3.6e-05,2.3e-05,1.4e-05,3e-06,1e-05,7e-06,3.6e-05,1.3e-05,7e-06,1.7e-05,3e-06,8e-06,5e-06,2.3e-05,4.2e-05,4.5e-05,4e-05,2.9e-05,2.6e-05,5e-06,2e-05,8e-06,2.2e-05,0.000115,1.5e-05,1e-05,1.5e-05,3.6e-05,2.1e-05,1.1e-05,1.1e-05,6e-06,1e-05,1.1e-05,2.8e-05,1.6e-05,1.5e-05,9e-06,1.1e-05,4e-06,5e-06,6e-06,4e-06,2e-06,3.3e-05,1.8e-05,4e-06,2e-06,2e-06,6e-06,5e-06,7e-06,1e-05,4e-06,2e-06,3e-06,4e-06,1.2e-05
1e-06,3e-06,2e-06,3e-06,2e-06,1e-06,4e-06,2e-06,2e-06,3e-06,1e-06,5e-06,6e-06,2e-06,0,8e-06,9e-06,6e-06,7e-06,1.7e-05,4e-06,0.000118,0.000112,3.1e-05,0.000101,5.9e-05,0.000202,7.4e-05,0.000215,0.000239,9e-05,0.000147,6.6e-05,0.000126,0.000192,0.000257,9.2e-05,5.1e-05,3.1e-05,0.000133,0.000206,4.5e-05,0.000172,0.000136,6.6e-05,0.00024,0.000299,0.000147,0.000209,7.4e-05,8e-05,0.000199,0.000219,5.8e-05,4.7e-05,3.7e-05,5.4e-05,4.1e-05,5e-05,4.7e-05,8.1e-05,1.3e-05,4.4e-05,4.5e-05,1e-05,1.8e-05,4e-06,7e-06,1.2e-05,2.6e-05,6e-06,1e-05,1.3e-05,1.2e-05,6e-06,9e-06,1.3e-05,3.2e-05,1.4e-05,1.7e-05,2.1e-05,1.4e-05,1.6e-05,2.4e-05,1.2e-05,2.2e-05,0.000111,1.8e-05,2e-06,1.7e-05,2.6e-05,1e-05,9e-06,4e-06,4e-06,5e-06,4.9e-05,2.3e-05,3e-06,6e-06,5e-06,7e-06,3e-06,1e-06,3e-06,1e-06,4e-06,3.1e-05,2.9e-05,6e-06,1e-05,7e-06,4e-06,3e-06,8e-06,9e-06,2e-06,1e-06,2e-06,2e-06,1.2e-05
1e-06,3e-06,2e-06,3e-06,1e-06,0,4e-06,1e-06,2e-06,4e-06,1e-06,5e-06,4e-06,1e-06,0,8e-06,9e-06,4e-06,8e-06,1.9e-05,6e-06,0.000127,8.1e-05,3.4e-05,3.2e-05,9.5e-05,0.000186,4.7e-05,0.000181,0.00015,0.000144,0.000138,0.00011,0.000132,0.000237,0.000228,0.000113,9.2e-05,0.000128,8.2e-05,0.00018,3.7e-05,0.000226,0.000182,0.000118,0.00017,0.000332,0.000118,0.000247,2.7e-05,2.1e-05,0.000203,0.00024,3.3e-05,5.9e-05,6.7e-05,1.3e-05,1e-05,4.3e-05,4.2e-05,7.3e-05,5e-06,4e-05,4.6e-05,1e-05,2e-05,1e-06,2e-06,8e-06,2.4e-05,3e-06,9e-06,5e-06,7e-06,8e-06,9e-06,6e-06,2.6e-05,3.2e-05,2.6e-05,2.9e-05,4e-06,1.5e-05,2.4e-05,1e-05,1.4e-05,0.000105,1.8e-05,1e-06,1.6e-05,2e-05,1.4e-05,7e-06,4e-06,2e-06,5e-06,5.9e-05,1.7e-05,1.7e-05,5e-06,4e-06,8e-06,0,2e-06,3e-06,2e-06,3e-06,3e-05,2.6e-05,1e-06,3e-06,5e-06,3e-06,4e-06,6e-06,7e-06,1e-06,1e-06,3e-06,1e-06,1.1e-05
