Drug1.wav,Drug,0,3999
Drug10.wav,Drug,0,3999
Drug100.wav,Drug,0,3999
Drug101.wav,Drug,0,3999
Drug102.wav,Drug,0,3999
Drug103.wav,Drug,0,3999
Drug104.wav,Drug,0,3999
Drug105.wav,Drug,0,3999
Drug106.wav,Drug,0,3999
Drug107.wav,Drug,0,3999
Drug108.wav,Drug,0,3999
Drug109.wav,Drug,0,3999
Drug11.wav,Drug,0,3999
Drug110.wav,Drug,0,3999
Drug111.wav,Drug,0,3999
Drug112.wav,Drug,0,3999
Drug113.wav,Drug,0,3999
Drug114.wav,Drug,0,3999
Drug115.wav,Drug,0,3999
Drug116.wav,Drug,0,3999
Drug117.wav,Drug,0,3999
Drug118.wav,Drug,0,3999
Drug119.wav,Drug,0,3999
Drug12.wav,Drug,0,3999
Drug120.wav,Drug,0,3999
Drug121.wav,Drug,0,3999
Drug122.wav,Drug,0,3999
Drug123.wav,Drug,0,3999
Drug124.wav,Drug,0,3999
Drug125.wav,Drug,0,3999
Drug126.wav,Drug,0,3999
Drug127.wav,Drug,0,3999
Drug128.wav,Drug,0,3999
Drug129.wav,Drug,0,3999
Drug13.wav,Drug,0,3999
Drug130.wav,Drug,0,3999
Drug131.wav,Drug,0,3999
Drug132.wav,Drug,0,3999
Drug133.wav,Drug,0,3999
Drug134.wav,Drug,0,3999
Drug135.wav,Drug,0,3999
Drug136.wav,Drug,0,3999
Drug137.wav,Drug,0,3999
Drug138.wav,Drug,0,3999
Drug139.wav,Drug,0,3999
Drug14.wav,Drug,0,3999
Drug140.wav,Drug,0,3999
Drug141.wav,Drug,0,3999
Drug142.wav,Drug,0,3999
Drug143.wav,Drug,0,3999
Drug144.wav,Drug,0,3999
Drug145.wav,Drug,0,3999
Drug146.wav,Drug,0,3999
Drug147.wav,Drug,0,3999
Drug148.wav,Drug,0,3999
Drug149.wav,Drug,0,3999
Drug15.wav,Drug,0,3999
Drug150.wav,Drug,0,3999
Drug151.wav,Drug,0,3999
Drug152.wav,Drug,0,3999
Drug153.wav,Drug,0,3999
Drug154.wav,Drug,0,3999
Drug155.wav,Drug,0,3999
Drug156.wav,Drug,0,3999
Drug157.wav,Drug,0,3999
Drug158.wav,Drug,0,3999
Drug159.wav,Drug,0,3999
Drug16.wav,Drug,0,3999
Drug160.wav,Drug,0,3999
Drug161.wav,Drug,0,3999
Drug162.wav,Drug,0,3999
Drug163.wav,Drug,0,3999
Drug164.wav,Drug,0,3999
Drug165.wav,Drug,0,3999
Drug166.wav,Drug,0,3999
Drug167.wav,Drug,0,3999
Drug168.wav,Drug,0,3999
Drug169.wav,Drug,0,3999
Drug17.wav,Drug,0,3999
Drug170.wav,Drug,0,3999
Drug171.wav,Drug,0,3999
Drug172.wav,Drug,0,3999
Drug173.wav,Drug,0,3999
Drug174.wav,Drug,0,3999
Drug175.wav,Drug,0,3999
Drug176.wav,Drug,0,3999
Drug177.wav,Drug,0,3999
Drug178.wav,Drug,0,3999
Drug179.wav,Drug,0,3999
Drug18.wav,Drug,0,3999
Drug180.wav,Drug,0,3999
Drug181.wav,Drug,0,3999
Drug182.wav,Drug,0,3999
Drug183.wav,Drug,0,3999
Drug184.wav,Drug,0,3999
Drug185.wav,Drug,0,3999
Drug186.wav,Drug,0,3999
Drug187.wav,Drug,0,3999
Drug188.wav,Drug,0,3999
Drug189.wav,Drug,0,3999
Drug19.wav,Drug,0,3999
Drug190.wav,Drug,0,3999
Drug191.wav,Drug,0,3999
Drug192.wav,Drug,0,3999
Drug193.wav,Drug,0,3999
Drug194.wav,Drug,0,3999
Drug195.wav,Drug,0,3999
Drug196.wav,Drug,0,3999
Drug197.wav,Drug,0,3999
Drug198.wav,Drug,0,3999
Drug199.wav,Drug,0,3999
Drug2.wav,Drug,0,3999
Drug20.wav,Drug,0,3999
Drug200.wav,Drug,0,3999
Drug201.wav,Drug,0,3999
Drug202.wav,Drug,0,3999
Drug203.wav,Drug,0,3999
Drug204.wav,Drug,0,3999
Drug205.wav,Drug,0,3999
Drug206.wav,Drug,0,3999
Drug207.wav,Drug,0,3999
Drug208.wav,Drug,0,3999
Drug209.wav,Drug,0,3999
Drug21.wav,Drug,0,3999
Drug210.wav,Drug,0,3999
Drug211.wav,Drug,0,3999
Drug212.wav,Drug,0,3999
Drug213.wav,Drug,0,3999
Drug214.wav,Drug,0,3999
Drug215.wav,Drug,0,3999
Drug216.wav,Drug,0,3999
Drug217.wav,Drug,0,3999
Drug218.wav,Drug,0,3999
Drug219.wav,Drug,0,3999
Drug22.wav,Drug,0,3999
Drug220.wav,Drug,0,3999
Drug221.wav,Drug,0,3999
Drug222.wav,Drug,0,3999
Drug223.wav,Drug,0,3999
Drug224.wav,Drug,0,3999
Drug225.wav,Drug,0,3999
Drug226.wav,Drug,0,3999
Drug227.wav,Drug,0,3999
Drug228.wav,Drug,0,3999
Drug229.wav,Drug,0,3999
Drug23.wav,Drug,0,3999
Drug230.wav,Drug,0,3999
Drug231.wav,Drug,0,3999
Drug232.wav,Drug,0,3999
Drug233.wav,Drug,0,3999
Drug234.wav,Drug,0,3999
Drug235.wav,Drug,0,3999
Drug236.wav,Drug,0,3999
Drug237.wav,Drug,0,3999
Drug238.wav,Drug,0,3999
Drug239.wav,Drug,0,3999
Drug24.wav,Drug,0,3999
Drug240.wav,Drug,0,3999
Drug241.wav,Drug,0,3999
Drug242.wav,Drug,0,3999
Drug243.wav,Drug,0,3999
Drug244.wav,Drug,0,3999
Drug245.wav,Drug,0,3999
Drug246.wav,Drug,0,3999
Drug247.wav,Drug,0,3999
Drug248.wav,Drug,0,3999
Drug249.wav,Drug,0,3999
Drug25.wav,Drug,0,3999
Drug250.wav,Drug,0,3999
Drug251.wav,Drug,0,3999
Drug252.wav,Drug,0,3999
Drug253.wav,Drug,0,3999
Drug254.wav,Drug,0,3999
Drug255.wav,Drug,0,3999
Drug256.wav,Drug,0,3999
Drug257.wav,Drug,0,3999
Drug258.wav,Drug,0,3999
Drug259.wav,Drug,0,3999
Drug26.wav,Drug,0,3999
Drug260.wav,Drug,0,3999
Drug261.wav,Drug,0,3999
Drug262.wav,Drug,0,3999
Drug263.wav,Drug,0,3999
Drug264.wav,Drug,0,3999
Drug265.wav,Drug,0,3999
Drug266.wav,Drug,0,3999
Drug267.wav,Drug,0,3999
Drug268.wav,Drug,0,3999
Drug269.wav,Drug,0,3999
Drug27.wav,Drug,0,3999
Drug270.wav,Drug,0,3999
Drug271.wav,Drug,0,3999
Drug272.wav,Drug,0,3999
Drug273.wav,Drug,0,3999
Drug274.wav,Drug,0,3999
Drug275.wav,Drug,0,3999
Drug276.wav,Drug,0,3999
Drug277.wav,Drug,0,3999
Drug278.wav,Drug,0,3999
Drug279.wav,Drug,0,3999
Drug28.wav,Drug,0,3999
Drug280.wav,Drug,0,3999
Drug281.wav,Drug,0,3999
Drug282.wav,Drug,0,3999
Drug283.wav,Drug,0,3999
Drug284.wav,Drug,0,3999
Drug285.wav,Drug,0,3999
Drug286.wav,Drug,0,3999
Drug287.wav,Drug,0,3999
Drug288.wav,Drug,0,3999
Drug289.wav,Drug,0,3999
Drug29.wav,Drug,0,3999
Drug290.wav,Drug,0,3999
Drug291.wav,Drug,0,3999
Drug292.wav,Drug,0,3999
Drug293.wav,Drug,0,3999
Drug294.wav,Drug,0,3999
Drug295.wav,Drug,0,3999
Drug296.wav,Drug,0,3999
Drug297.wav,Drug,0,3999
Drug298.wav,Drug,0,3999
Drug299.wav,Drug,0,3999
Drug3.wav,Drug,0,3999
Drug30.wav,Drug,0,3999
Drug300.wav,Drug,0,3999
Drug301.wav,Drug,0,3999
Drug302.wav,Drug,0,3999
Drug303.wav,Drug,0,3999
Drug304.wav,Drug,0,3999
Drug305.wav,Drug,0,3999
Drug306.wav,Drug,0,3999
Drug307.wav,Drug,0,3999
Drug308.wav,Drug,0,3999
Drug309.wav,Drug,0,3999
Drug31.wav,Drug,0,3999
Drug310.wav,Drug,0,3999
Drug311.wav,Drug,0,3999
Drug312.wav,Drug,0,3999
Drug313.wav,Drug,0,3999
Drug314.wav,Drug,0,3999
Drug315.wav,Drug,0,3999
Drug316.wav,Drug,0,3999
Drug317.wav,Drug,0,3999
Drug318.wav,Drug,0,3999
Drug319.wav,Drug,0,3999
Drug32.wav,Drug,0,3999
Drug320.wav,Drug,0,3999
Drug321.wav,Drug,0,3999
Drug322.wav,Drug,0,3999
Drug323.wav,Drug,0,3999
Drug324.wav,Drug,0,3999
Drug325.wav,Drug,0,3999
Drug326.wav,Drug,0,3999
Drug327.wav,Drug,0,3999
Drug328.wav,Drug,0,3999
Drug329.wav,Drug,0,3999
Drug33.wav,Drug,0,3999
Drug330.wav,Drug,0,3999
Drug331.wav,Drug,0,3999
Drug332.wav,Drug,0,3999
Drug333.wav,Drug,0,3999
Drug334.wav,Drug,0,3999
Drug335.wav,Drug,0,3999
Drug336.wav,Drug,0,3999
Drug337.wav,Drug,0,3999
Drug338.wav,Drug,0,3999
Drug339.wav,Drug,0,3999
Drug34.wav,Drug,0,3999
Drug340.wav,Drug,0,3999
Drug341.wav,Drug,0,3999
Drug342.wav,Drug,0,3999
Drug343.wav,Drug,0,3999
Drug344.wav,Drug,0,3999
Drug345.wav,Drug,0,3999
Drug346.wav,Drug,0,3999
Drug347.wav,Drug,0,3999
Drug348.wav,Drug,0,3999
Drug349.wav,Drug,0,3999
Drug35.wav,Drug,0,3999
Drug350.wav,Drug,0,3999
Drug351.wav,Drug,0,3999
Drug352.wav,Drug,0,3999
Drug353.wav,Drug,0,3999
Drug354.wav,Drug,0,3999
Drug355.wav,Drug,0,3999
Drug356.wav,Drug,0,3999
Drug357.wav,Drug,0,3999
Drug358.wav,Drug,0,3999
Drug359.wav,Drug,0,3999
Drug36.wav,Drug,0,3999
Drug360.wav,Drug,0,3999
Drug361.wav,Drug,0,3999
Drug362.wav,Drug,0,3999
Drug363.wav,Drug,0,3999
Drug364.wav,Drug,0,3999
Drug365.wav,Drug,0,3999
Drug366.wav,Drug,0,3999
Drug367.wav,Drug,0,3999
Drug368.wav,Drug,0,3999
Drug369.wav,Drug,0,3999
Drug37.wav,Drug,0,3999
Drug370.wav,Drug,0,3999
Drug371.wav,Drug,0,3999
Drug372.wav,Drug,0,3999
Drug373.wav,Drug,0,3999
Drug374.wav,Drug,0,3999
Drug375.wav,Drug,0,3999
Drug376.wav,Drug,0,3999
Drug377.wav,Drug,0,3999
Drug378.wav,Drug,0,3999
Drug379.wav,Drug,0,3999
Drug38.wav,Drug,0,3999
Drug380.wav,Drug,0,3999
Drug381.wav,Drug,0,3999
Drug382.wav,Drug,0,3999
Drug383.wav,Drug,0,3999
Drug384.wav,Drug,0,3999
Drug385.wav,Drug,0,3999
Drug386.wav,Drug,0,3999
Drug387.wav,Drug,0,3999
Drug388.wav,Drug,0,3999
Drug389.wav,Drug,0,3999
Drug39.wav,Drug,0,3999
Drug390.wav,Drug,0,3999
Drug391.wav,Drug,0,3999
Drug392.wav,Drug,0,3999
Drug393.wav,Drug,0,3999
Drug394.wav,Drug,0,3999
Drug395.wav,Drug,0,3999
Drug396.wav,Drug,0,3999
Drug397.wav,Drug,0,3999
Drug398.wav,Drug,0,3999
Drug399.wav,Drug,0,3999
Drug4.wav,Drug,0,3999
Drug40.wav,Drug,0,3999
Drug400.wav,Drug,0,3999
Drug401.wav,Drug,0,3999
Drug402.wav,Drug,0,3999
Drug403.wav,Drug,0,3999
Drug404.wav,Drug,0,3999
Drug405.wav,Drug,0,3999
Drug406.wav,Drug,0,3999
Drug407.wav,Drug,0,3999
Drug408.wav,Drug,0,3999
Drug409.wav,Drug,0,3999
Drug41.wav,Drug,0,3999
Drug410.wav,Drug,0,3999
Drug411.wav,Drug,0,3999
Drug412.wav,Drug,0,3999
Drug413.wav,Drug,0,3999
Drug414.wav,Drug,0,3999
Drug415.wav,Drug,0,3999
Drug416.wav,Drug,0,3999
Drug417.wav,Drug,0,3999
Drug418.wav,Drug,0,3999
Drug419.wav,Drug,0,3999
Drug42.wav,Drug,0,3999
Drug420.wav,Drug,0,3999
Drug421.wav,Drug,0,3999
Drug422.wav,Drug,0,3999
Drug423.wav,Drug,0,3999
Drug424.wav,Drug,0,3999
Drug425.wav,Drug,0,3999
Drug426.wav,Drug,0,3999
Drug427.wav,Drug,0,3999
Drug428.wav,Drug,0,3999
Drug429.wav,Drug,0,3999
Drug43.wav,Drug,0,3999
Drug430.wav,Drug,0,3999
Drug431.wav,Drug,0,3999
Drug432.wav,Drug,0,3999
Drug433.wav,Drug,0,3999
Drug434.wav,Drug,0,3999
Drug435.wav,Drug,0,3999
Drug436.wav,Drug,0,3999
Drug437.wav,Drug,0,3999
Drug438.wav,Drug,0,3999
Drug439.wav,Drug,0,3999
Drug44.wav,Drug,0,3999
Drug440.wav,Drug,0,3999
Drug441.wav,Drug,0,3999
Drug442.wav,Drug,0,3999
Drug443.wav,Drug,0,3999
Drug444.wav,Drug,0,3999
Drug445.wav,Drug,0,3999
Drug446.wav,Drug,0,3999
Drug447.wav,Drug,0,3999
Drug448.wav,Drug,0,3999
Drug449.wav,Drug,0,3999
Drug45.wav,Drug,0,3999
Drug450.wav,Drug,0,3999
Drug451.wav,Drug,0,3999
Drug452.wav,Drug,0,3999
Drug453.wav,Drug,0,3999
Drug454.wav,Drug,0,3999
Drug455.wav,Drug,0,3999
Drug456.wav,Drug,0,3999
Drug457.wav,Drug,0,3999
Drug458.wav,Drug,0,3999
Drug459.wav,Drug,0,3999
Drug46.wav,Drug,0,3999
Drug460.wav,Drug,0,3999
Drug461.wav,Drug,0,3999
Drug462.wav,Drug,0,3999
Drug463.wav,Drug,0,3999
Drug464.wav,Drug,0,3999
Drug465.wav,Drug,0,3999
Drug466.wav,Drug,0,3999
Drug467.wav,Drug,0,3999
Drug468.wav,Drug,0,3999
Drug469.wav,Drug,0,3999
Drug47.wav,Drug,0,3999
Drug470.wav,Drug,0,3999
Drug471.wav,Drug,0,3999
Drug472.wav,Drug,0,3999
Drug473.wav,Drug,0,3999
Drug474.wav,Drug,0,3999
Drug475.wav,Drug,0,3999
Drug476.wav,Drug,0,3999
Drug477.wav,Drug,0,3999
Drug478.wav,Drug,0,3999
Drug479.wav,Drug,0,3999
Drug48.wav,Drug,0,3999
Drug480.wav,Drug,0,3999
Drug481.wav,Drug,0,3999
Drug482.wav,Drug,0,3999
Drug483.wav,Drug,0,3999
Drug484.wav,Drug,0,3999
Drug485.wav,Drug,0,3999
Drug486.wav,Drug,0,3999
Drug487.wav,Drug,0,3999
Drug488.wav,Drug,0,3999
Drug489.wav,Drug,0,3999
Drug49.wav,Drug,0,3999
Drug490.wav,Drug,0,3999
Drug491.wav,Drug,0,3999
Drug492.wav,Drug,0,3999
Drug493.wav,Drug,0,3999
Drug494.wav,Drug,0,3999
Drug495.wav,Drug,0,3999
Drug496.wav,Drug,0,3999
Drug497.wav,Drug,0,3999
Drug498.wav,Drug,0,3999
Drug499.wav,Drug,0,3999
Drug5.wav,Drug,0,3999
Drug50.wav,Drug,0,3999
Drug500.wav,Drug,0,3999
Drug51.wav,Drug,0,3999
Drug52.wav,Drug,0,3999
Drug53.wav,Drug,0,3999
Drug54.wav,Drug,0,3999
Drug55.wav,Drug,0,3999
Drug56.wav,Drug,0,3999
Drug57.wav,Drug,0,3999
Drug58.wav,Drug,0,3999
Drug59.wav,Drug,0,3999
Drug6.wav,Drug,0,3999
Drug60.wav,Drug,0,3999
Drug61.wav,Drug,0,3999
Drug62.wav,Drug,0,3999
Drug63.wav,Drug,0,3999
Drug64.wav,Drug,0,3999
Drug65.wav,Drug,0,3999
Drug66.wav,Drug,0,3999
Drug67.wav,Drug,0,3999
Drug68.wav,Drug,0,3999
Drug69.wav,Drug,0,3999
Drug7.wav,Drug,0,3999
Drug70.wav,Drug,0,3999
Drug71.wav,Drug,0,3999
Drug72.wav,Drug,0,3999
Drug73.wav,Drug,0,3999
Drug74.wav,Drug,0,3999
Drug75.wav,Drug,0,3999
Drug76.wav,Drug,0,3999
Drug77.wav,Drug,0,3999
Drug78.wav,Drug,0,3999
Drug79.wav,Drug,0,3999
Drug8.wav,Drug,0,3999
Drug80.wav,Drug,0,3999
Drug81.wav,Drug,0,3999
Drug82.wav,Drug,0,3999
Drug83.wav,Drug,0,3999
Drug84.wav,Drug,0,3999
Drug85.wav,Drug,0,3999
Drug86.wav,Drug,0,3999
Drug87.wav,Drug,0,3999
Drug88.wav,Drug,0,3999
Drug89.wav,Drug,0,3999
Drug9.wav,Drug,0,3999
Drug90.wav,Drug,0,3999
Drug91.wav,Drug,0,3999
Drug92.wav,Drug,0,3999
Drug93.wav,Drug,0,3999
Drug94.wav,Drug,0,3999
Drug95.wav,Drug,0,3999
Drug96.wav,Drug,0,3999
Drug97.wav,Drug,0,3999
Drug98.wav,Drug,0,3999
Drug99.wav,Drug,0,3999
Exhale1.wav,Exhale,0,3999
Exhale10.wav,Exhale,0,3999
Exhale100.wav,Exhale,0,3999
Exhale101.wav,Exhale,0,3999
Exhale102.wav,Exhale,0,3999
Exhale103.wav,Exhale,0,3999
Exhale104.wav,Exhale,0,3999
Exhale105.wav,Exhale,0,3999
Exhale106.wav,Exhale,0,3999
Exhale107.wav,Exhale,0,3999
Exhale108.wav,Exhale,0,3999
Exhale109.wav,Exhale,0,3999
Exhale11.wav,Exhale,0,3999
Exhale110.wav,Exhale,0,3999
Exhale111.wav,Exhale,0,3999
Exhale112.wav,Exhale,0,3999
Exhale113.wav,Exhale,0,3999
Exhale114.wav,Exhale,0,3999
Exhale115.wav,Exhale,0,3999
Exhale116.wav,Exhale,0,3999
Exhale117.wav,Exhale,0,3999
Exhale118.wav,Exhale,0,3999
Exhale119.wav,Exhale,0,3999
Exhale12.wav,Exhale,0,3999
Exhale120.wav,Exhale,0,3999
Exhale121.wav,Exhale,0,3999
Exhale122.wav,Exhale,0,3999
Exhale123.wav,Exhale,0,3999
Exhale124.wav,Exhale,0,3999
Exhale125.wav,Exhale,0,3999
Exhale126.wav,Exhale,0,3999
Exhale127.wav,Exhale,0,3999
Exhale128.wav,Exhale,0,3999
Exhale129.wav,Exhale,0,3999
Exhale13.wav,Exhale,0,3999
Exhale130.wav,Exhale,0,3999
Exhale131.wav,Exhale,0,3999
Exhale132.wav,Exhale,0,3999
Exhale133.wav,Exhale,0,3999
Exhale134.wav,Exhale,0,3999
Exhale135.wav,Exhale,0,3999
Exhale136.wav,Exhale,0,3999
Exhale137.wav,Exhale,0,3999
Exhale138.wav,Exhale,0,3999
Exhale139.wav,Exhale,0,3999
Exhale14.wav,Exhale,0,3999
Exhale140.wav,Exhale,0,3999
Exhale141.wav,Exhale,0,3999
Exhale142.wav,Exhale,0,3999
Exhale143.wav,Exhale,0,3999
Exhale144.wav,Exhale,0,3999
Exhale145.wav,Exhale,0,3999
Exhale146.wav,Exhale,0,3999
Exhale147.wav,Exhale,0,3999
Exhale148.wav,Exhale,0,3999
Exhale149.wav,Exhale,0,3999
Exhale15.wav,Exhale,0,3999
Exhale150.wav,Exhale,0,3999
Exhale151.wav,Exhale,0,3999
Exhale152.wav,Exhale,0,3999
Exhale153.wav,Exhale,0,3999
Exhale154.wav,Exhale,0,3999
Exhale155.wav,Exhale,0,3999
Exhale156.wav,Exhale,0,3999
Exhale157.wav,Exhale,0,3999
Exhale158.wav,Exhale,0,3999
Exhale159.wav,Exhale,0,3999
Exhale16.wav,Exhale,0,3999
Exhale160.wav,Exhale,0,3999
Exhale161.wav,Exhale,0,3999
Exhale162.wav,Exhale,0,3999
Exhale163.wav,Exhale,0,3999
Exhale164.wav,Exhale,0,3999
Exhale165.wav,Exhale,0,3999
Exhale166.wav,Exhale,0,3999
Exhale167.wav,Exhale,0,3999
Exhale168.wav,Exhale,0,3999
Exhale169.wav,Exhale,0,3999
Exhale17.wav,Exhale,0,3999
Exhale170.wav,Exhale,0,3999
Exhale171.wav,Exhale,0,3999
Exhale172.wav,Exhale,0,3999
Exhale173.wav,Exhale,0,3999
Exhale174.wav,Exhale,0,3999
Exhale175.wav,Exhale,0,3999
Exhale176.wav,Exhale,0,3999
Exhale177.wav,Exhale,0,3999
Exhale178.wav,Exhale,0,3999
Exhale179.wav,Exhale,0,3999
Exhale18.wav,Exhale,0,3999
Exhale180.wav,Exhale,0,3999
Exhale181.wav,Exhale,0,3999
Exhale182.wav,Exhale,0,3999
Exhale183.wav,Exhale,0,3999
Exhale184.wav,Exhale,0,3999
Exhale185.wav,Exhale,0,3999
Exhale186.wav,Exhale,0,3999
Exhale187.wav,Exhale,0,3999
Exhale188.wav,Exhale,0,3999
Exhale189.wav,Exhale,0,3999
Exhale19.wav,Exhale,0,3999
Exhale190.wav,Exhale,0,3999
Exhale191.wav,Exhale,0,3999
Exhale192.wav,Exhale,0,3999
Exhale193.wav,Exhale,0,3999
Exhale194.wav,Exhale,0,3999
Exhale195.wav,Exhale,0,3999
Exhale196.wav,Exhale,0,3999
Exhale197.wav,Exhale,0,3999
Exhale198.wav,Exhale,0,3999
Exhale199.wav,Exhale,0,3999
Exhale2.wav,Exhale,0,3999
Exhale20.wav,Exhale,0,3999
Exhale200.wav,Exhale,0,3999
Exhale201.wav,Exhale,0,3999
Exhale202.wav,Exhale,0,3999
Exhale203.wav,Exhale,0,3999
Exhale204.wav,Exhale,0,3999
Exhale205.wav,Exhale,0,3999
Exhale206.wav,Exhale,0,3999
Exhale207.wav,Exhale,0,3999
Exhale208.wav,Exhale,0,3999
Exhale209.wav,Exhale,0,3999
Exhale21.wav,Exhale,0,3999
Exhale210.wav,Exhale,0,3999
Exhale211.wav,Exhale,0,3999
Exhale212.wav,Exhale,0,3999
Exhale213.wav,Exhale,0,3999
Exhale214.wav,Exhale,0,3999
Exhale215.wav,Exhale,0,3999
Exhale216.wav,Exhale,0,3999
Exhale217.wav,Exhale,0,3999
Exhale218.wav,Exhale,0,3999
Exhale219.wav,Exhale,0,3999
Exhale22.wav,Exhale,0,3999
Exhale220.wav,Exhale,0,3999
Exhale221.wav,Exhale,0,3999
Exhale222.wav,Exhale,0,3999
Exhale223.wav,Exhale,0,3999
Exhale224.wav,Exhale,0,3999
Exhale225.wav,Exhale,0,3999
Exhale226.wav,Exhale,0,3999
Exhale227.wav,Exhale,0,3999
Exhale228.wav,Exhale,0,3999
Exhale229.wav,Exhale,0,3999
Exhale23.wav,Exhale,0,3999
Exhale230.wav,Exhale,0,3999
Exhale231.wav,Exhale,0,3999
Exhale232.wav,Exhale,0,3999
Exhale233.wav,Exhale,0,3999
Exhale234.wav,Exhale,0,3999
Exhale235.wav,Exhale,0,3999
Exhale236.wav,Exhale,0,3999
Exhale237.wav,Exhale,0,3999
Exhale238.wav,Exhale,0,3999
Exhale239.wav,Exhale,0,3999
Exhale24.wav,Exhale,0,3999
Exhale240.wav,Exhale,0,3999
Exhale241.wav,Exhale,0,3999
Exhale242.wav,Exhale,0,3999
Exhale243.wav,Exhale,0,3999
Exhale244.wav,Exhale,0,3999
Exhale245.wav,Exhale,0,3999
Exhale246.wav,Exhale,0,3999
Exhale247.wav,Exhale,0,3999
Exhale248.wav,Exhale,0,3999
Exhale249.wav,Exhale,0,3999
Exhale25.wav,Exhale,0,3999
Exhale250.wav,Exhale,0,3999
Exhale251.wav,Exhale,0,3999
Exhale252.wav,Exhale,0,3999
Exhale253.wav,Exhale,0,3999
Exhale254.wav,Exhale,0,3999
Exhale255.wav,Exhale,0,3999
Exhale256.wav,Exhale,0,3999
Exhale257.wav,Exhale,0,3999
Exhale258.wav,Exhale,0,3999
Exhale259.wav,Exhale,0,3999
Exhale26.wav,Exhale,0,3999
Exhale260.wav,Exhale,0,3999
Exhale261.wav,Exhale,0,3999
Exhale262.wav,Exhale,0,3999
Exhale263.wav,Exhale,0,3999
Exhale264.wav,Exhale,0,3999
Exhale265.wav,Exhale,0,3999
Exhale266.wav,Exhale,0,3999
Exhale267.wav,Exhale,0,3999
Exhale268.wav,Exhale,0,3999
Exhale269.wav,Exhale,0,3999
Exhale27.wav,Exhale,0,3999
Exhale270.wav,Exhale,0,3999
Exhale271.wav,Exhale,0,3999
Exhale272.wav,Exhale,0,3999
Exhale273.wav,Exhale,0,3999
Exhale274.wav,Exhale,0,3999
Exhale275.wav,Exhale,0,3999
Exhale276.wav,Exhale,0,3999
Exhale277.wav,Exhale,0,3999
Exhale278.wav,Exhale,0,3999
Exhale279.wav,Exhale,0,3999
Exhale28.wav,Exhale,0,3999
Exhale280.wav,Exhale,0,3999
Exhale281.wav,Exhale,0,3999
Exhale282.wav,Exhale,0,3999
Exhale283.wav,Exhale,0,3999
Exhale284.wav,Exhale,0,3999
Exhale285.wav,Exhale,0,3999
Exhale286.wav,Exhale,0,3999
Exhale287.wav,Exhale,0,3999
Exhale288.wav,Exhale,0,3999
Exhale289.wav,Exhale,0,3999
Exhale29.wav,Exhale,0,3999
Exhale290.wav,Exhale,0,3999
Exhale291.wav,Exhale,0,3999
Exhale292.wav,Exhale,0,3999
Exhale293.wav,Exhale,0,3999
Exhale294.wav,Exhale,0,3999
Exhale295.wav,Exhale,0,3999
Exhale296.wav,Exhale,0,3999
Exhale297.wav,Exhale,0,3999
Exhale298.wav,Exhale,0,3999
Exhale299.wav,Exhale,0,3999
Exhale3.wav,Exhale,0,3999
Exhale30.wav,Exhale,0,3999
Exhale300.wav,Exhale,0,3999
Exhale301.wav,Exhale,0,3999
Exhale302.wav,Exhale,0,3999
Exhale303.wav,Exhale,0,3999
Exhale304.wav,Exhale,0,3999
Exhale305.wav,Exhale,0,3999
Exhale306.wav,Exhale,0,3999
Exhale307.wav,Exhale,0,3999
Exhale308.wav,Exhale,0,3999
Exhale309.wav,Exhale,0,3999
Exhale31.wav,Exhale,0,3999
Exhale310.wav,Exhale,0,3999
Exhale311.wav,Exhale,0,3999
Exhale312.wav,Exhale,0,3999
Exhale313.wav,Exhale,0,3999
Exhale314.wav,Exhale,0,3999
Exhale315.wav,Exhale,0,3999
Exhale316.wav,Exhale,0,3999
Exhale317.wav,Exhale,0,3999
Exhale318.wav,Exhale,0,3999
Exhale319.wav,Exhale,0,3999
Exhale32.wav,Exhale,0,3999
Exhale320.wav,Exhale,0,3999
Exhale321.wav,Exhale,0,3999
Exhale322.wav,Exhale,0,3999
Exhale323.wav,Exhale,0,3999
Exhale324.wav,Exhale,0,3999
Exhale325.wav,Exhale,0,3999
Exhale326.wav,Exhale,0,3999
Exhale327.wav,Exhale,0,3999
Exhale328.wav,Exhale,0,3999
Exhale329.wav,Exhale,0,3999
Exhale33.wav,Exhale,0,3999
Exhale330.wav,Exhale,0,3999
Exhale331.wav,Exhale,0,3999
Exhale332.wav,Exhale,0,3999
Exhale333.wav,Exhale,0,3999
Exhale334.wav,Exhale,0,3999
Exhale335.wav,Exhale,0,3999
Exhale336.wav,Exhale,0,3999
Exhale337.wav,Exhale,0,3999
Exhale338.wav,Exhale,0,3999
Exhale339.wav,Exhale,0,3999
Exhale34.wav,Exhale,0,3999
Exhale340.wav,Exhale,0,3999
Exhale341.wav,Exhale,0,3999
Exhale342.wav,Exhale,0,3999
Exhale343.wav,Exhale,0,3999
Exhale344.wav,Exhale,0,3999
Exhale345.wav,Exhale,0,3999
Exhale346.wav,Exhale,0,3999
Exhale347.wav,Exhale,0,3999
Exhale348.wav,Exhale,0,3999
Exhale349.wav,Exhale,0,3999
Exhale35.wav,Exhale,0,3999
Exhale350.wav,Exhale,0,3999
Exhale351.wav,Exhale,0,3999
Exhale352.wav,Exhale,0,3999
Exhale353.wav,Exhale,0,3999
Exhale354.wav,Exhale,0,3999
Exhale355.wav,Exhale,0,3999
Exhale356.wav,Exhale,0,3999
Exhale357.wav,Exhale,0,3999
Exhale358.wav,Exhale,0,3999
Exhale359.wav,Exhale,0,3999
Exhale36.wav,Exhale,0,3999
Exhale360.wav,Exhale,0,3999
Exhale361.wav,Exhale,0,3999
Exhale362.wav,Exhale,0,3999
Exhale363.wav,Exhale,0,3999
Exhale364.wav,Exhale,0,3999
Exhale365.wav,Exhale,0,3999
Exhale366.wav,Exhale,0,3999
Exhale367.wav,Exhale,0,3999
Exhale368.wav,Exhale,0,3999
Exhale369.wav,Exhale,0,3999
Exhale37.wav,Exhale,0,3999
Exhale370.wav,Exhale,0,3999
Exhale371.wav,Exhale,0,3999
Exhale372.wav,Exhale,0,3999
Exhale373.wav,Exhale,0,3999
Exhale374.wav,Exhale,0,3999
Exhale375.wav,Exhale,0,3999
Exhale376.wav,Exhale,0,3999
Exhale377.wav,Exhale,0,3999
Exhale378.wav,Exhale,0,3999
Exhale379.wav,Exhale,0,3999
Exhale38.wav,Exhale,0,3999
Exhale380.wav,Exhale,0,3999
Exhale381.wav,Exhale,0,3999
Exhale382.wav,Exhale,0,3999
Exhale383.wav,Exhale,0,3999
Exhale384.wav,Exhale,0,3999
Exhale385.wav,Exhale,0,3999
Exhale386.wav,Exhale,0,3999
Exhale387.wav,Exhale,0,3999
Exhale388.wav,Exhale,0,3999
Exhale389.wav,Exhale,0,3999
Exhale39.wav,Exhale,0,3999
Exhale390.wav,Exhale,0,3999
Exhale391.wav,Exhale,0,3999
Exhale392.wav,Exhale,0,3999
Exhale393.wav,Exhale,0,3999
Exhale394.wav,Exhale,0,3999
Exhale395.wav,Exhale,0,3999
Exhale396.wav,Exhale,0,3999
Exhale397.wav,Exhale,0,3999
Exhale398.wav,Exhale,0,3999
Exhale399.wav,Exhale,0,3999
Exhale4.wav,Exhale,0,3999
Exhale40.wav,Exhale,0,3999
Exhale400.wav,Exhale,0,3999
Exhale401.wav,Exhale,0,3999
Exhale402.wav,Exhale,0,3999
Exhale403.wav,Exhale,0,3999
Exhale404.wav,Exhale,0,3999
Exhale405.wav,Exhale,0,3999
Exhale406.wav,Exhale,0,3999
Exhale407.wav,Exhale,0,3999
Exhale408.wav,Exhale,0,3999
Exhale409.wav,Exhale,0,3999
Exhale41.wav,Exhale,0,3999
Exhale410.wav,Exhale,0,3999
Exhale411.wav,Exhale,0,3999
Exhale412.wav,Exhale,0,3999
Exhale413.wav,Exhale,0,3999
Exhale414.wav,Exhale,0,3999
Exhale415.wav,Exhale,0,3999
Exhale416.wav,Exhale,0,3999
Exhale417.wav,Exhale,0,3999
Exhale418.wav,Exhale,0,3999
Exhale419.wav,Exhale,0,3999
Exhale42.wav,Exhale,0,3999
Exhale420.wav,Exhale,0,3999
Exhale421.wav,Exhale,0,3999
Exhale422.wav,Exhale,0,3999
Exhale423.wav,Exhale,0,3999
Exhale424.wav,Exhale,0,3999
Exhale425.wav,Exhale,0,3999
Exhale426.wav,Exhale,0,3999
Exhale427.wav,Exhale,0,3999
Exhale428.wav,Exhale,0,3999
Exhale429.wav,Exhale,0,3999
Exhale43.wav,Exhale,0,3999
Exhale430.wav,Exhale,0,3999
Exhale431.wav,Exhale,0,3999
Exhale432.wav,Exhale,0,3999
Exhale433.wav,Exhale,0,3999
Exhale434.wav,Exhale,0,3999
Exhale435.wav,Exhale,0,3999
Exhale436.wav,Exhale,0,3999
Exhale437.wav,Exhale,0,3999
Exhale438.wav,Exhale,0,3999
Exhale439.wav,Exhale,0,3999
Exhale44.wav,Exhale,0,3999
Exhale440.wav,Exhale,0,3999
Exhale441.wav,Exhale,0,3999
Exhale442.wav,Exhale,0,3999
Exhale443.wav,Exhale,0,3999
Exhale444.wav,Exhale,0,3999
Exhale445.wav,Exhale,0,3999
Exhale446.wav,Exhale,0,3999
Exhale447.wav,Exhale,0,3999
Exhale448.wav,Exhale,0,3999
Exhale449.wav,Exhale,0,3999
Exhale45.wav,Exhale,0,3999
Exhale450.wav,Exhale,0,3999
Exhale451.wav,Exhale,0,3999
Exhale452.wav,Exhale,0,3999
Exhale453.wav,Exhale,0,3999
Exhale454.wav,Exhale,0,3999
Exhale455.wav,Exhale,0,3999
Exhale456.wav,Exhale,0,3999
Exhale457.wav,Exhale,0,3999
Exhale458.wav,Exhale,0,3999
Exhale459.wav,Exhale,0,3999
Exhale46.wav,Exhale,0,3999
Exhale460.wav,Exhale,0,3999
Exhale461.wav,Exhale,0,3999
Exhale462.wav,Exhale,0,3999
Exhale463.wav,Exhale,0,3999
Exhale464.wav,Exhale,0,3999
Exhale465.wav,Exhale,0,3999
Exhale466.wav,Exhale,0,3999
Exhale467.wav,Exhale,0,3999
Exhale468.wav,Exhale,0,3999
Exhale469.wav,Exhale,0,3999
Exhale47.wav,Exhale,0,3999
Exhale470.wav,Exhale,0,3999
Exhale471.wav,Exhale,0,3999
Exhale472.wav,Exhale,0,3999
Exhale473.wav,Exhale,0,3999
Exhale474.wav,Exhale,0,3999
Exhale475.wav,Exhale,0,3999
Exhale476.wav,Exhale,0,3999
Exhale477.wav,Exhale,0,3999
Exhale478.wav,Exhale,0,3999
Exhale479.wav,Exhale,0,3999
Exhale48.wav,Exhale,0,3999
Exhale480.wav,Exhale,0,3999
Exhale481.wav,Exhale,0,3999
Exhale482.wav,Exhale,0,3999
Exhale483.wav,Exhale,0,3999
Exhale484.wav,Exhale,0,3999
Exhale485.wav,Exhale,0,3999
Exhale486.wav,Exhale,0,3999
Exhale487.wav,Exhale,0,3999
Exhale488.wav,Exhale,0,3999
Exhale489.wav,Exhale,0,3999
Exhale49.wav,Exhale,0,3999
Exhale490.wav,Exhale,0,3999
Exhale491.wav,Exhale,0,3999
Exhale492.wav,Exhale,0,3999
Exhale493.wav,Exhale,0,3999
Exhale494.wav,Exhale,0,3999
Exhale495.wav,Exhale,0,3999
Exhale496.wav,Exhale,0,3999
Exhale497.wav,Exhale,0,3999
Exhale498.wav,Exhale,0,3999
Exhale499.wav,Exhale,0,3999
Exhale5.wav,Exhale,0,3999
Exhale50.wav,Exhale,0,3999
Exhale500.wav,Exhale,0,3999
Exhale51.wav,Exhale,0,3999
Exhale52.wav,Exhale,0,3999
Exhale53.wav,Exhale,0,3999
Exhale54.wav,Exhale,0,3999
Exhale55.wav,Exhale,0,3999
Exhale56.wav,Exhale,0,3999
Exhale57.wav,Exhale,0,3999
Exhale58.wav,Exhale,0,3999
Exhale59.wav,Exhale,0,3999
Exhale6.wav,Exhale,0,3999
Exhale60.wav,Exhale,0,3999
Exhale61.wav,Exhale,0,3999
Exhale62.wav,Exhale,0,3999
Exhale63.wav,Exhale,0,3999
Exhale64.wav,Exhale,0,3999
Exhale65.wav,Exhale,0,3999
Exhale66.wav,Exhale,0,3999
Exhale67.wav,Exhale,0,3999
Exhale68.wav,Exhale,0,3999
Exhale69.wav,Exhale,0,3999
Exhale7.wav,Exhale,0,3999
Exhale70.wav,Exhale,0,3999
Exhale71.wav,Exhale,0,3999
Exhale72.wav,Exhale,0,3999
Exhale73.wav,Exhale,0,3999
Exhale74.wav,Exhale,0,3999
Exhale75.wav,Exhale,0,3999
Exhale76.wav,Exhale,0,3999
Exhale77.wav,Exhale,0,3999
Exhale78.wav,Exhale,0,3999
Exhale79.wav,Exhale,0,3999
Exhale8.wav,Exhale,0,3999
Exhale80.wav,Exhale,0,3999
Exhale81.wav,Exhale,0,3999
Exhale82.wav,Exhale,0,3999
Exhale83.wav,Exhale,0,3999
Exhale84.wav,Exhale,0,3999
Exhale85.wav,Exhale,0,3999
Exhale86.wav,Exhale,0,3999
Exhale87.wav,Exhale,0,3999
Exhale88.wav,Exhale,0,3999
Exhale89.wav,Exhale,0,3999
Exhale9.wav,Exhale,0,3999
Exhale90.wav,Exhale,0,3999
Exhale91.wav,Exhale,0,3999
Exhale92.wav,Exhale,0,3999
Exhale93.wav,Exhale,0,3999
Exhale94.wav,Exhale,0,3999
Exhale95.wav,Exhale,0,3999
Exhale96.wav,Exhale,0,3999
Exhale97.wav,Exhale,0,3999
Exhale98.wav,Exhale,0,3999
Exhale99.wav,Exhale,0,3999
Inhale1.wav,Inhale,0,3999
Inhale10.wav,Inhale,0,3999
Inhale100.wav,Inhale,0,3999
Inhale101.wav,Inhale,0,3999
Inhale102.wav,Inhale,0,3999
Inhale103.wav,Inhale,0,3999
Inhale104.wav,Inhale,0,3999
Inhale105.wav,Inhale,0,3999
Inhale106.wav,Inhale,0,3999
Inhale107.wav,Inhale,0,3999
Inhale108.wav,Inhale,0,3999
Inhale109.wav,Inhale,0,3999
Inhale11.wav,Inhale,0,3999
Inhale110.wav,Inhale,0,3999
Inhale111.wav,Inhale,0,3999
Inhale112.wav,Inhale,0,3999
Inhale113.wav,Inhale,0,3999
Inhale114.wav,Inhale,0,3999
Inhale115.wav,Inhale,0,3999
Inhale116.wav,Inhale,0,3999
Inhale117.wav,Inhale,0,3999
Inhale118.wav,Inhale,0,3999
Inhale119.wav,Inhale,0,3999
Inhale12.wav,Inhale,0,3999
Inhale120.wav,Inhale,0,3999
Inhale121.wav,Inhale,0,3999
Inhale122.wav,Inhale,0,3999
Inhale123.wav,Inhale,0,3999
Inhale124.wav,Inhale,0,3999
Inhale125.wav,Inhale,0,3999
Inhale126.wav,Inhale,0,3999
Inhale127.wav,Inhale,0,3999
Inhale128.wav,Inhale,0,3999
Inhale129.wav,Inhale,0,3999
Inhale13.wav,Inhale,0,3999
Inhale130.wav,Inhale,0,3999
Inhale131.wav,Inhale,0,3999
Inhale132.wav,Inhale,0,3999
Inhale133.wav,Inhale,0,3999
Inhale134.wav,Inhale,0,3999
Inhale135.wav,Inhale,0,3999
Inhale136.wav,Inhale,0,3999
Inhale137.wav,Inhale,0,3999
Inhale138.wav,Inhale,0,3999
Inhale139.wav,Inhale,0,3999
Inhale14.wav,Inhale,0,3999
Inhale140.wav,Inhale,0,3999
Inhale141.wav,Inhale,0,3999
Inhale142.wav,Inhale,0,3999
Inhale143.wav,Inhale,0,3999
Inhale144.wav,Inhale,0,3999
Inhale145.wav,Inhale,0,3999
Inhale146.wav,Inhale,0,3999
Inhale147.wav,Inhale,0,3999
Inhale148.wav,Inhale,0,3999
Inhale149.wav,Inhale,0,3999
Inhale15.wav,Inhale,0,3999
Inhale150.wav,Inhale,0,3999
Inhale151.wav,Inhale,0,3999
Inhale152.wav,Inhale,0,3999
Inhale153.wav,Inhale,0,3999
Inhale154.wav,Inhale,0,3999
Inhale155.wav,Inhale,0,3999
Inhale156.wav,Inhale,0,3999
Inhale157.wav,Inhale,0,3999
Inhale158.wav,Inhale,0,3999
Inhale159.wav,Inhale,0,3999
Inhale16.wav,Inhale,0,3999
Inhale160.wav,Inhale,0,3999
Inhale161.wav,Inhale,0,3999
Inhale162.wav,Inhale,0,3999
Inhale163.wav,Inhale,0,3999
Inhale164.wav,Inhale,0,3999
Inhale165.wav,Inhale,0,3999
Inhale166.wav,Inhale,0,3999
Inhale167.wav,Inhale,0,3999
Inhale168.wav,Inhale,0,3999
Inhale169.wav,Inhale,0,3999
Inhale17.wav,Inhale,0,3999
Inhale170.wav,Inhale,0,3999
Inhale171.wav,Inhale,0,3999
Inhale172.wav,Inhale,0,3999
Inhale173.wav,Inhale,0,3999
Inhale174.wav,Inhale,0,3999
Inhale175.wav,Inhale,0,3999
Inhale176.wav,Inhale,0,3999
Inhale177.wav,Inhale,0,3999
Inhale178.wav,Inhale,0,3999
Inhale179.wav,Inhale,0,3999
Inhale18.wav,Inhale,0,3999
Inhale180.wav,Inhale,0,3999
Inhale181.wav,Inhale,0,3999
Inhale182.wav,Inhale,0,3999
Inhale183.wav,Inhale,0,3999
Inhale184.wav,Inhale,0,3999
Inhale185.wav,Inhale,0,3999
Inhale186.wav,Inhale,0,3999
Inhale187.wav,Inhale,0,3999
Inhale188.wav,Inhale,0,3999
Inhale189.wav,Inhale,0,3999
Inhale19.wav,Inhale,0,3999
Inhale190.wav,Inhale,0,3999
Inhale191.wav,Inhale,0,3999
Inhale192.wav,Inhale,0,3999
Inhale193.wav,Inhale,0,3999
Inhale194.wav,Inhale,0,3999
Inhale195.wav,Inhale,0,3999
Inhale196.wav,Inhale,0,3999
Inhale197.wav,Inhale,0,3999
Inhale198.wav,Inhale,0,3999
Inhale199.wav,Inhale,0,3999
Inhale2.wav,Inhale,0,3999
Inhale20.wav,Inhale,0,3999
Inhale200.wav,Inhale,0,3999
Inhale201.wav,Inhale,0,3999
Inhale202.wav,Inhale,0,3999
Inhale203.wav,Inhale,0,3999
Inhale204.wav,Inhale,0,3999
Inhale205.wav,Inhale,0,3999
Inhale206.wav,Inhale,0,3999
Inhale207.wav,Inhale,0,3999
Inhale208.wav,Inhale,0,3999
Inhale209.wav,Inhale,0,3999
Inhale21.wav,Inhale,0,3999
Inhale210.wav,Inhale,0,3999
Inhale211.wav,Inhale,0,3999
Inhale212.wav,Inhale,0,3999
Inhale213.wav,Inhale,0,3999
Inhale214.wav,Inhale,0,3999
Inhale215.wav,Inhale,0,3999
Inhale216.wav,Inhale,0,3999
Inhale217.wav,Inhale,0,3999
Inhale218.wav,Inhale,0,3999
Inhale219.wav,Inhale,0,3999
Inhale22.wav,Inhale,0,3999
Inhale220.wav,Inhale,0,3999
Inhale221.wav,Inhale,0,3999
Inhale222.wav,Inhale,0,3999
Inhale223.wav,Inhale,0,3999
Inhale224.wav,Inhale,0,3999
Inhale225.wav,Inhale,0,3999
Inhale226.wav,Inhale,0,3999
Inhale227.wav,Inhale,0,3999
Inhale228.wav,Inhale,0,3999
Inhale229.wav,Inhale,0,3999
Inhale23.wav,Inhale,0,3999
Inhale230.wav,Inhale,0,3999
Inhale231.wav,Inhale,0,3999
Inhale232.wav,Inhale,0,3999
Inhale233.wav,Inhale,0,3999
Inhale234.wav,Inhale,0,3999
Inhale235.wav,Inhale,0,3999
Inhale236.wav,Inhale,0,3999
Inhale237.wav,Inhale,0,3999
Inhale238.wav,Inhale,0,3999
Inhale239.wav,Inhale,0,3999
Inhale24.wav,Inhale,0,3999
Inhale240.wav,Inhale,0,3999
Inhale241.wav,Inhale,0,3999
Inhale242.wav,Inhale,0,3999
Inhale243.wav,Inhale,0,3999
Inhale244.wav,Inhale,0,3999
Inhale245.wav,Inhale,0,3999
Inhale246.wav,Inhale,0,3999
Inhale247.wav,Inhale,0,3999
Inhale248.wav,Inhale,0,3999
Inhale249.wav,Inhale,0,3999
Inhale25.wav,Inhale,0,3999
Inhale250.wav,Inhale,0,3999
Inhale251.wav,Inhale,0,3999
Inhale252.wav,Inhale,0,3999
Inhale253.wav,Inhale,0,3999
Inhale254.wav,Inhale,0,3999
Inhale255.wav,Inhale,0,3999
Inhale256.wav,Inhale,0,3999
Inhale257.wav,Inhale,0,3999
Inhale258.wav,Inhale,0,3999
Inhale259.wav,Inhale,0,3999
Inhale26.wav,Inhale,0,3999
Inhale260.wav,Inhale,0,3999
Inhale261.wav,Inhale,0,3999
Inhale262.wav,Inhale,0,3999
Inhale263.wav,Inhale,0,3999
Inhale264.wav,Inhale,0,3999
Inhale265.wav,Inhale,0,3999
Inhale266.wav,Inhale,0,3999
Inhale267.wav,Inhale,0,3999
Inhale268.wav,Inhale,0,3999
Inhale269.wav,Inhale,0,3999
Inhale27.wav,Inhale,0,3999
Inhale270.wav,Inhale,0,3999
Inhale271.wav,Inhale,0,3999
Inhale272.wav,Inhale,0,3999
Inhale273.wav,Inhale,0,3999
Inhale274.wav,Inhale,0,3999
Inhale275.wav,Inhale,0,3999
Inhale276.wav,Inhale,0,3999
Inhale277.wav,Inhale,0,3999
Inhale278.wav,Inhale,0,3999
Inhale279.wav,Inhale,0,3999
Inhale28.wav,Inhale,0,3999
Inhale280.wav,Inhale,0,3999
Inhale281.wav,Inhale,0,3999
Inhale282.wav,Inhale,0,3999
Inhale283.wav,Inhale,0,3999
Inhale284.wav,Inhale,0,3999
Inhale285.wav,Inhale,0,3999
Inhale286.wav,Inhale,0,3999
Inhale287.wav,Inhale,0,3999
Inhale288.wav,Inhale,0,3999
Inhale289.wav,Inhale,0,3999
Inhale29.wav,Inhale,0,3999
Inhale290.wav,Inhale,0,3999
Inhale291.wav,Inhale,0,3999
Inhale292.wav,Inhale,0,3999
Inhale293.wav,Inhale,0,3999
Inhale294.wav,Inhale,0,3999
Inhale295.wav,Inhale,0,3999
Inhale296.wav,Inhale,0,3999
Inhale297.wav,Inhale,0,3999
Inhale298.wav,Inhale,0,3999
Inhale299.wav,Inhale,0,3999
Inhale3.wav,Inhale,0,3999
Inhale30.wav,Inhale,0,3999
Inhale300.wav,Inhale,0,3999
Inhale301.wav,Inhale,0,3999
Inhale302.wav,Inhale,0,3999
Inhale303.wav,Inhale,0,3999
Inhale304.wav,Inhale,0,3999
Inhale305.wav,Inhale,0,3999
Inhale306.wav,Inhale,0,3999
Inhale307.wav,Inhale,0,3999
Inhale308.wav,Inhale,0,3999
Inhale309.wav,Inhale,0,3999
Inhale31.wav,Inhale,0,3999
Inhale310.wav,Inhale,0,3999
Inhale311.wav,Inhale,0,3999
Inhale312.wav,Inhale,0,3999
Inhale313.wav,Inhale,0,3999
Inhale314.wav,Inhale,0,3999
Inhale315.wav,Inhale,0,3999
Inhale316.wav,Inhale,0,3999
Inhale317.wav,Inhale,0,3999
Inhale318.wav,Inhale,0,3999
Inhale319.wav,Inhale,0,3999
Inhale32.wav,Inhale,0,3999
Inhale320.wav,Inhale,0,3999
Inhale321.wav,Inhale,0,3999
Inhale322.wav,Inhale,0,3999
Inhale323.wav,Inhale,0,3999
Inhale324.wav,Inhale,0,3999
Inhale325.wav,Inhale,0,3999
Inhale326.wav,Inhale,0,3999
Inhale327.wav,Inhale,0,3999
Inhale328.wav,Inhale,0,3999
Inhale329.wav,Inhale,0,3999
Inhale33.wav,Inhale,0,3999
Inhale330.wav,Inhale,0,3999
Inhale331.wav,Inhale,0,3999
Inhale332.wav,Inhale,0,3999
Inhale333.wav,Inhale,0,3999
Inhale334.wav,Inhale,0,3999
Inhale335.wav,Inhale,0,3999
Inhale336.wav,Inhale,0,3999
Inhale337.wav,Inhale,0,3999
Inhale338.wav,Inhale,0,3999
Inhale339.wav,Inhale,0,3999
Inhale34.wav,Inhale,0,3999
Inhale340.wav,Inhale,0,3999
Inhale341.wav,Inhale,0,3999
Inhale342.wav,Inhale,0,3999
Inhale343.wav,Inhale,0,3999
Inhale344.wav,Inhale,0,3999
Inhale345.wav,Inhale,0,3999
Inhale346.wav,Inhale,0,3999
Inhale347.wav,Inhale,0,3999
Inhale348.wav,Inhale,0,3999
Inhale349.wav,Inhale,0,3999
Inhale35.wav,Inhale,0,3999
Inhale350.wav,Inhale,0,3999
Inhale351.wav,Inhale,0,3999
Inhale352.wav,Inhale,0,3999
Inhale353.wav,Inhale,0,3999
Inhale354.wav,Inhale,0,3999
Inhale355.wav,Inhale,0,3999
Inhale356.wav,Inhale,0,3999
Inhale357.wav,Inhale,0,3999
Inhale358.wav,Inhale,0,3999
Inhale359.wav,Inhale,0,3999
Inhale36.wav,Inhale,0,3999
Inhale360.wav,Inhale,0,3999
Inhale361.wav,Inhale,0,3999
Inhale362.wav,Inhale,0,3999
Inhale363.wav,Inhale,0,3999
Inhale364.wav,Inhale,0,3999
Inhale365.wav,Inhale,0,3999
Inhale366.wav,Inhale,0,3999
Inhale367.wav,Inhale,0,3999
Inhale368.wav,Inhale,0,3999
Inhale369.wav,Inhale,0,3999
Inhale37.wav,Inhale,0,3999
Inhale370.wav,Inhale,0,3999
Inhale371.wav,Inhale,0,3999
Inhale372.wav,Inhale,0,3999
Inhale373.wav,Inhale,0,3999
Inhale374.wav,Inhale,0,3999
Inhale375.wav,Inhale,0,3999
Inhale376.wav,Inhale,0,3999
Inhale377.wav,Inhale,0,3999
Inhale378.wav,Inhale,0,3999
Inhale379.wav,Inhale,0,3999
Inhale38.wav,Inhale,0,3999
Inhale380.wav,Inhale,0,3999
Inhale381.wav,Inhale,0,3999
Inhale382.wav,Inhale,0,3999
Inhale383.wav,Inhale,0,3999
Inhale384.wav,Inhale,0,3999
Inhale385.wav,Inhale,0,3999
Inhale386.wav,Inhale,0,3999
Inhale387.wav,Inhale,0,3999
Inhale388.wav,Inhale,0,3999
Inhale389.wav,Inhale,0,3999
Inhale39.wav,Inhale,0,3999
Inhale390.wav,Inhale,0,3999
Inhale391.wav,Inhale,0,3999
Inhale392.wav,Inhale,0,3999
Inhale393.wav,Inhale,0,3999
Inhale394.wav,Inhale,0,3999
Inhale395.wav,Inhale,0,3999
Inhale396.wav,Inhale,0,3999
Inhale397.wav,Inhale,0,3999
Inhale398.wav,Inhale,0,3999
Inhale399.wav,Inhale,0,3999
Inhale4.wav,Inhale,0,3999
Inhale40.wav,Inhale,0,3999
Inhale400.wav,Inhale,0,3999
Inhale401.wav,Inhale,0,3999
Inhale402.wav,Inhale,0,3999
Inhale403.wav,Inhale,0,3999
Inhale404.wav,Inhale,0,3999
Inhale405.wav,Inhale,0,3999
Inhale406.wav,Inhale,0,3999
Inhale407.wav,Inhale,0,3999
Inhale408.wav,Inhale,0,3999
Inhale409.wav,Inhale,0,3999
Inhale41.wav,Inhale,0,3999
Inhale410.wav,Inhale,0,3999
Inhale411.wav,Inhale,0,3999
Inhale412.wav,Inhale,0,3999
Inhale413.wav,Inhale,0,3999
Inhale414.wav,Inhale,0,3999
Inhale415.wav,Inhale,0,3999
Inhale416.wav,Inhale,0,3999
Inhale417.wav,Inhale,0,3999
Inhale418.wav,Inhale,0,3999
Inhale419.wav,Inhale,0,3999
Inhale42.wav,Inhale,0,3999
Inhale420.wav,Inhale,0,3999
Inhale421.wav,Inhale,0,3999
Inhale422.wav,Inhale,0,3999
Inhale423.wav,Inhale,0,3999
Inhale424.wav,Inhale,0,3999
Inhale425.wav,Inhale,0,3999
Inhale426.wav,Inhale,0,3999
Inhale427.wav,Inhale,0,3999
Inhale428.wav,Inhale,0,3999
Inhale429.wav,Inhale,0,3999
Inhale43.wav,Inhale,0,3999
Inhale430.wav,Inhale,0,3999
Inhale431.wav,Inhale,0,3999
Inhale432.wav,Inhale,0,3999
Inhale433.wav,Inhale,0,3999
Inhale434.wav,Inhale,0,3999
Inhale435.wav,Inhale,0,3999
Inhale436.wav,Inhale,0,3999
Inhale437.wav,Inhale,0,3999
Inhale438.wav,Inhale,0,3999
Inhale439.wav,Inhale,0,3999
Inhale44.wav,Inhale,0,3999
Inhale440.wav,Inhale,0,3999
Inhale441.wav,Inhale,0,3999
Inhale442.wav,Inhale,0,3999
Inhale443.wav,Inhale,0,3999
Inhale444.wav,Inhale,0,3999
Inhale445.wav,Inhale,0,3999
Inhale446.wav,Inhale,0,3999
Inhale447.wav,Inhale,0,3999
Inhale448.wav,Inhale,0,3999
Inhale449.wav,Inhale,0,3999
Inhale45.wav,Inhale,0,3999
Inhale450.wav,Inhale,0,3999
Inhale451.wav,Inhale,0,3999
Inhale452.wav,Inhale,0,3999
Inhale453.wav,Inhale,0,3999
Inhale454.wav,Inhale,0,3999
Inhale455.wav,Inhale,0,3999
Inhale456.wav,Inhale,0,3999
Inhale457.wav,Inhale,0,3999
Inhale458.wav,Inhale,0,3999
Inhale459.wav,Inhale,0,3999
Inhale46.wav,Inhale,0,3999
Inhale460.wav,Inhale,0,3999
Inhale461.wav,Inhale,0,3999
Inhale462.wav,Inhale,0,3999
Inhale463.wav,Inhale,0,3999
Inhale464.wav,Inhale,0,3999
Inhale465.wav,Inhale,0,3999
Inhale466.wav,Inhale,0,3999
Inhale467.wav,Inhale,0,3999
Inhale468.wav,Inhale,0,3999
Inhale469.wav,Inhale,0,3999
Inhale47.wav,Inhale,0,3999
Inhale470.wav,Inhale,0,3999
Inhale471.wav,Inhale,0,3999
Inhale472.wav,Inhale,0,3999
Inhale473.wav,Inhale,0,3999
Inhale474.wav,Inhale,0,3999
Inhale475.wav,Inhale,0,3999
Inhale476.wav,Inhale,0,3999
Inhale477.wav,Inhale,0,3999
Inhale478.wav,Inhale,0,3999
Inhale479.wav,Inhale,0,3999
Inhale48.wav,Inhale,0,3999
Inhale480.wav,Inhale,0,3999
Inhale481.wav,Inhale,0,3999
Inhale482.wav,Inhale,0,3999
Inhale483.wav,Inhale,0,3999
Inhale484.wav,Inhale,0,3999
Inhale485.wav,Inhale,0,3999
Inhale486.wav,Inhale,0,3999
Inhale487.wav,Inhale,0,3999
Inhale488.wav,Inhale,0,3999
Inhale489.wav,Inhale,0,3999
Inhale49.wav,Inhale,0,3999
Inhale490.wav,Inhale,0,3999
Inhale491.wav,Inhale,0,3999
Inhale492.wav,Inhale,0,3999
Inhale493.wav,Inhale,0,3999
Inhale494.wav,Inhale,0,3999
Inhale495.wav,Inhale,0,3999
Inhale496.wav,Inhale,0,3999
Inhale497.wav,Inhale,0,3999
Inhale498.wav,Inhale,0,3999
Inhale499.wav,Inhale,0,3999
Inhale5.wav,Inhale,0,3999
Inhale50.wav,Inhale,0,3999
Inhale500.wav,Inhale,0,3999
Inhale51.wav,Inhale,0,3999
Inhale52.wav,Inhale,0,3999
Inhale53.wav,Inhale,0,3999
Inhale54.wav,Inhale,0,3999
Inhale55.wav,Inhale,0,3999
Inhale56.wav,Inhale,0,3999
Inhale57.wav,Inhale,0,3999
Inhale58.wav,Inhale,0,3999
Inhale59.wav,Inhale,0,3999
Inhale6.wav,Inhale,0,3999
Inhale60.wav,Inhale,0,3999
Inhale61.wav,Inhale,0,3999
Inhale62.wav,Inhale,0,3999
Inhale63.wav,Inhale,0,3999
Inhale64.wav,Inhale,0,3999
Inhale65.wav,Inhale,0,3999
Inhale66.wav,Inhale,0,3999
Inhale67.wav,Inhale,0,3999
Inhale68.wav,Inhale,0,3999
Inhale69.wav,Inhale,0,3999
Inhale7.wav,Inhale,0,3999
Inhale70.wav,Inhale,0,3999
Inhale71.wav,Inhale,0,3999
Inhale72.wav,Inhale,0,3999
Inhale73.wav,Inhale,0,3999
Inhale74.wav,Inhale,0,3999
Inhale75.wav,Inhale,0,3999
Inhale76.wav,Inhale,0,3999
Inhale77.wav,Inhale,0,3999
Inhale78.wav,Inhale,0,3999
Inhale79.wav,Inhale,0,3999
Inhale8.wav,Inhale,0,3999
Inhale80.wav,Inhale,0,3999
Inhale81.wav,Inhale,0,3999
Inhale82.wav,Inhale,0,3999
Inhale83.wav,Inhale,0,3999
Inhale84.wav,Inhale,0,3999
Inhale85.wav,Inhale,0,3999
Inhale86.wav,Inhale,0,3999
Inhale87.wav,Inhale,0,3999
Inhale88.wav,Inhale,0,3999
Inhale89.wav,Inhale,0,3999
Inhale9.wav,Inhale,0,3999
Inhale90.wav,Inhale,0,3999
Inhale91.wav,Inhale,0,3999
Inhale92.wav,Inhale,0,3999
Inhale93.wav,Inhale,0,3999
Inhale94.wav,Inhale,0,3999
Inhale95.wav,Inhale,0,3999
Inhale96.wav,Inhale,0,3999
Inhale97.wav,Inhale,0,3999
Inhale98.wav,Inhale,0,3999
Inhale99.wav,Inhale,0,3999
Noise1.wav,Noise,0,3999
Noise10.wav,Noise,0,3999
Noise100.wav,Noise,0,3999
Noise101.wav,Noise,0,3999
Noise102.wav,Noise,0,3999
Noise103.wav,Noise,0,3999
Noise104.wav,Noise,0,3999
Noise105.wav,Noise,0,3999
Noise106.wav,Noise,0,3999
Noise107.wav,Noise,0,3999
Noise108.wav,Noise,0,3999
Noise109.wav,Noise,0,3999
Noise11.wav,Noise,0,3999
Noise110.wav,Noise,0,3999
Noise111.wav,Noise,0,3999
Noise112.wav,Noise,0,3999
Noise113.wav,Noise,0,3999
Noise114.wav,Noise,0,3999
Noise115.wav,Noise,0,3999
Noise116.wav,Noise,0,3999
Noise117.wav,Noise,0,3999
Noise118.wav,Noise,0,3999
Noise119.wav,Noise,0,3999
Noise12.wav,Noise,0,3999
Noise120.wav,Noise,0,3999
Noise121.wav,Noise,0,3999
Noise122.wav,Noise,0,3999
Noise123.wav,Noise,0,3999
Noise124.wav,Noise,0,3999
Noise125.wav,Noise,0,3999
Noise126.wav,Noise,0,3999
Noise127.wav,Noise,0,3999
Noise128.wav,Noise,0,3999
Noise129.wav,Noise,0,3999
Noise13.wav,Noise,0,3999
Noise130.wav,Noise,0,3999
Noise131.wav,Noise,0,3999
Noise132.wav,Noise,0,3999
Noise133.wav,Noise,0,3999
Noise134.wav,Noise,0,3999
Noise135.wav,Noise,0,3999
Noise136.wav,Noise,0,3999
Noise137.wav,Noise,0,3999
Noise138.wav,Noise,0,3999
Noise139.wav,Noise,0,3999
Noise14.wav,Noise,0,3999
Noise140.wav,Noise,0,3999
Noise141.wav,Noise,0,3999
Noise142.wav,Noise,0,3999
Noise143.wav,Noise,0,3999
Noise144.wav,Noise,0,3999
Noise145.wav,Noise,0,3999
Noise146.wav,Noise,0,3999
Noise147.wav,Noise,0,3999
Noise148.wav,Noise,0,3999
Noise149.wav,Noise,0,3999
Noise15.wav,Noise,0,3999
Noise150.wav,Noise,0,3999
Noise151.wav,Noise,0,3999
Noise152.wav,Noise,0,3999
Noise153.wav,Noise,0,3999
Noise154.wav,Noise,0,3999
Noise155.wav,Noise,0,3999
Noise156.wav,Noise,0,3999
Noise157.wav,Noise,0,3999
Noise158.wav,Noise,0,3999
Noise159.wav,Noise,0,3999
Noise16.wav,Noise,0,3999
Noise160.wav,Noise,0,3999
Noise161.wav,Noise,0,3999
Noise162.wav,Noise,0,3999
Noise163.wav,Noise,0,3999
Noise164.wav,Noise,0,3999
Noise165.wav,Noise,0,3999
Noise166.wav,Noise,0,3999
Noise167.wav,Noise,0,3999
Noise168.wav,Noise,0,3999
Noise169.wav,Noise,0,3999
Noise17.wav,Noise,0,3999
Noise170.wav,Noise,0,3999
Noise171.wav,Noise,0,3999
Noise172.wav,Noise,0,3999
Noise173.wav,Noise,0,3999
Noise174.wav,Noise,0,3999
Noise175.wav,Noise,0,3999
Noise176.wav,Noise,0,3999
Noise177.wav,Noise,0,3999
Noise178.wav,Noise,0,3999
Noise179.wav,Noise,0,3999
Noise18.wav,Noise,0,3999
Noise180.wav,Noise,0,3999
Noise181.wav,Noise,0,3999
Noise182.wav,Noise,0,3999
Noise183.wav,Noise,0,3999
Noise184.wav,Noise,0,3999
Noise185.wav,Noise,0,3999
Noise186.wav,Noise,0,3999
Noise187.wav,Noise,0,3999
Noise188.wav,Noise,0,3999
Noise189.wav,Noise,0,3999
Noise19.wav,Noise,0,3999
Noise190.wav,Noise,0,3999
Noise191.wav,Noise,0,3999
Noise192.wav,Noise,0,3999
Noise193.wav,Noise,0,3999
Noise194.wav,Noise,0,3999
Noise195.wav,Noise,0,3999
Noise196.wav,Noise,0,3999
Noise197.wav,Noise,0,3999
Noise198.wav,Noise,0,3999
Noise199.wav,Noise,0,3999
Noise2.wav,Noise,0,3999
Noise20.wav,Noise,0,3999
Noise200.wav,Noise,0,3999
Noise201.wav,Noise,0,3999
Noise202.wav,Noise,0,3999
Noise203.wav,Noise,0,3999
Noise204.wav,Noise,0,3999
Noise205.wav,Noise,0,3999
Noise206.wav,Noise,0,3999
Noise207.wav,Noise,0,3999
Noise208.wav,Noise,0,3999
Noise209.wav,Noise,0,3999
Noise21.wav,Noise,0,3999
Noise210.wav,Noise,0,3999
Noise211.wav,Noise,0,3999
Noise212.wav,Noise,0,3999
Noise213.wav,Noise,0,3999
Noise214.wav,Noise,0,3999
Noise215.wav,Noise,0,3999
Noise216.wav,Noise,0,3999
Noise217.wav,Noise,0,3999
Noise218.wav,Noise,0,3999
Noise219.wav,Noise,0,3999
Noise22.wav,Noise,0,3999
Noise220.wav,Noise,0,3999
Noise221.wav,Noise,0,3999
Noise222.wav,Noise,0,3999
Noise223.wav,Noise,0,3999
Noise224.wav,Noise,0,3999
Noise225.wav,Noise,0,3999
Noise226.wav,Noise,0,3999
Noise227.wav,Noise,0,3999
Noise228.wav,Noise,0,3999
Noise229.wav,Noise,0,3999
Noise23.wav,Noise,0,3999
Noise230.wav,Noise,0,3999
Noise231.wav,Noise,0,3999
Noise232.wav,Noise,0,3999
Noise233.wav,Noise,0,3999
Noise234.wav,Noise,0,3999
Noise235.wav,Noise,0,3999
Noise236.wav,Noise,0,3999
Noise237.wav,Noise,0,3999
Noise238.wav,Noise,0,3999
Noise239.wav,Noise,0,3999
Noise24.wav,Noise,0,3999
Noise240.wav,Noise,0,3999
Noise241.wav,Noise,0,3999
Noise242.wav,Noise,0,3999
Noise243.wav,Noise,0,3999
Noise244.wav,Noise,0,3999
Noise245.wav,Noise,0,3999
Noise246.wav,Noise,0,3999
Noise247.wav,Noise,0,3999
Noise248.wav,Noise,0,3999
Noise249.wav,Noise,0,3999
Noise25.wav,Noise,0,3999
Noise250.wav,Noise,0,3999
Noise251.wav,Noise,0,3999
Noise252.wav,Noise,0,3999
Noise253.wav,Noise,0,3999
Noise254.wav,Noise,0,3999
Noise255.wav,Noise,0,3999
Noise256.wav,Noise,0,3999
Noise257.wav,Noise,0,3999
Noise258.wav,Noise,0,3999
Noise259.wav,Noise,0,3999
Noise26.wav,Noise,0,3999
Noise260.wav,Noise,0,3999
Noise261.wav,Noise,0,3999
Noise262.wav,Noise,0,3999
Noise263.wav,Noise,0,3999
Noise264.wav,Noise,0,3999
Noise265.wav,Noise,0,3999
Noise266.wav,Noise,0,3999
Noise267.wav,Noise,0,3999
Noise268.wav,Noise,0,3999
Noise269.wav,Noise,0,3999
Noise27.wav,Noise,0,3999
Noise270.wav,Noise,0,3999
Noise271.wav,Noise,0,3999
Noise272.wav,Noise,0,3999
Noise273.wav,Noise,0,3999
Noise274.wav,Noise,0,3999
Noise275.wav,Noise,0,3999
Noise276.wav,Noise,0,3999
Noise277.wav,Noise,0,3999
Noise278.wav,Noise,0,3999
Noise279.wav,Noise,0,3999
Noise28.wav,Noise,0,3999
Noise280.wav,Noise,0,3999
Noise281.wav,Noise,0,3999
Noise282.wav,Noise,0,3999
Noise283.wav,Noise,0,3999
Noise284.wav,Noise,0,3999
Noise285.wav,Noise,0,3999
Noise286.wav,Noise,0,3999
Noise287.wav,Noise,0,3999
Noise288.wav,Noise,0,3999
Noise289.wav,Noise,0,3999
Noise29.wav,Noise,0,3999
Noise290.wav,Noise,0,3999
Noise291.wav,Noise,0,3999
Noise292.wav,Noise,0,3999
Noise293.wav,Noise,0,3999
Noise294.wav,Noise,0,3999
Noise295.wav,Noise,0,3999
Noise296.wav,Noise,0,3999
Noise297.wav,Noise,0,3999
Noise298.wav,Noise,0,3999
Noise299.wav,Noise,0,3999
Noise3.wav,Noise,0,3999
Noise30.wav,Noise,0,3999
Noise300.wav,Noise,0,3999
Noise301.wav,Noise,0,3999
Noise302.wav,Noise,0,3999
Noise303.wav,Noise,0,3999
Noise304.wav,Noise,0,3999
Noise305.wav,Noise,0,3999
Noise306.wav,Noise,0,3999
Noise307.wav,Noise,0,3999
Noise308.wav,Noise,0,3999
Noise309.wav,Noise,0,3999
Noise31.wav,Noise,0,3999
Noise310.wav,Noise,0,3999
Noise311.wav,Noise,0,3999
Noise312.wav,Noise,0,3999
Noise313.wav,Noise,0,3999
Noise314.wav,Noise,0,3999
Noise315.wav,Noise,0,3999
Noise316.wav,Noise,0,3999
Noise317.wav,Noise,0,3999
Noise318.wav,Noise,0,3999
Noise319.wav,Noise,0,3999
Noise32.wav,Noise,0,3999
Noise320.wav,Noise,0,3999
Noise321.wav,Noise,0,3999
Noise322.wav,Noise,0,3999
Noise323.wav,Noise,0,3999
Noise324.wav,Noise,0,3999
Noise325.wav,Noise,0,3999
Noise326.wav,Noise,0,3999
Noise327.wav,Noise,0,3999
Noise328.wav,Noise,0,3999
Noise329.wav,Noise,0,3999
Noise33.wav,Noise,0,3999
Noise330.wav,Noise,0,3999
Noise331.wav,Noise,0,3999
Noise332.wav,Noise,0,3999
Noise333.wav,Noise,0,3999
Noise334.wav,Noise,0,3999
Noise335.wav,Noise,0,3999
Noise336.wav,Noise,0,3999
Noise337.wav,Noise,0,3999
Noise338.wav,Noise,0,3999
Noise339.wav,Noise,0,3999
Noise34.wav,Noise,0,3999
Noise340.wav,Noise,0,3999
Noise341.wav,Noise,0,3999
Noise342.wav,Noise,0,3999
Noise343.wav,Noise,0,3999
Noise344.wav,Noise,0,3999
Noise345.wav,Noise,0,3999
Noise346.wav,Noise,0,3999
Noise347.wav,Noise,0,3999
Noise348.wav,Noise,0,3999
Noise349.wav,Noise,0,3999
Noise35.wav,Noise,0,3999
Noise350.wav,Noise,0,3999
Noise351.wav,Noise,0,3999
Noise352.wav,Noise,0,3999
Noise353.wav,Noise,0,3999
Noise354.wav,Noise,0,3999
Noise355.wav,Noise,0,3999
Noise356.wav,Noise,0,3999
Noise357.wav,Noise,0,3999
Noise358.wav,Noise,0,3999
Noise359.wav,Noise,0,3999
Noise36.wav,Noise,0,3999
Noise360.wav,Noise,0,3999
Noise361.wav,Noise,0,3999
Noise362.wav,Noise,0,3999
Noise363.wav,Noise,0,3999
Noise364.wav,Noise,0,3999
Noise365.wav,Noise,0,3999
Noise366.wav,Noise,0,3999
Noise367.wav,Noise,0,3999
Noise368.wav,Noise,0,3999
Noise369.wav,Noise,0,3999
Noise37.wav,Noise,0,3999
Noise370.wav,Noise,0,3999
Noise371.wav,Noise,0,3999
Noise372.wav,Noise,0,3999
Noise373.wav,Noise,0,3999
Noise374.wav,Noise,0,3999
Noise375.wav,Noise,0,3999
Noise376.wav,Noise,0,3999
Noise377.wav,Noise,0,3999
Noise378.wav,Noise,0,3999
Noise379.wav,Noise,0,3999
Noise38.wav,Noise,0,3999
Noise380.wav,Noise,0,3999
Noise381.wav,Noise,0,3999
Noise382.wav,Noise,0,3999
Noise383.wav,Noise,0,3999
Noise384.wav,Noise,0,3999
Noise385.wav,Noise,0,3999
Noise386.wav,Noise,0,3999
Noise387.wav,Noise,0,3999
Noise388.wav,Noise,0,3999
Noise389.wav,Noise,0,3999
Noise39.wav,Noise,0,3999
Noise390.wav,Noise,0,3999
Noise391.wav,Noise,0,3999
Noise392.wav,Noise,0,3999
Noise393.wav,Noise,0,3999
Noise394.wav,Noise,0,3999
Noise395.wav,Noise,0,3999
Noise396.wav,Noise,0,3999
Noise397.wav,Noise,0,3999
Noise398.wav,Noise,0,3999
Noise399.wav,Noise,0,3999
Noise4.wav,Noise,0,3999
Noise40.wav,Noise,0,3999
Noise400.wav,Noise,0,3999
Noise401.wav,Noise,0,3999
Noise402.wav,Noise,0,3999
Noise403.wav,Noise,0,3999
Noise404.wav,Noise,0,3999
Noise405.wav,Noise,0,3999
Noise406.wav,Noise,0,3999
Noise407.wav,Noise,0,3999
Noise408.wav,Noise,0,3999
Noise409.wav,Noise,0,3999
Noise41.wav,Noise,0,3999
Noise410.wav,Noise,0,3999
Noise411.wav,Noise,0,3999
Noise412.wav,Noise,0,3999
Noise413.wav,Noise,0,3999
Noise414.wav,Noise,0,3999
Noise415.wav,Noise,0,3999
Noise416.wav,Noise,0,3999
Noise417.wav,Noise,0,3999
Noise418.wav,Noise,0,3999
Noise419.wav,Noise,0,3999
Noise42.wav,Noise,0,3999
Noise420.wav,Noise,0,3999
Noise421.wav,Noise,0,3999
Noise422.wav,Noise,0,3999
Noise423.wav,Noise,0,3999
Noise424.wav,Noise,0,3999
Noise425.wav,Noise,0,3999
Noise426.wav,Noise,0,3999
Noise427.wav,Noise,0,3999
Noise428.wav,Noise,0,3999
Noise429.wav,Noise,0,3999
Noise43.wav,Noise,0,3999
Noise430.wav,Noise,0,3999
Noise431.wav,Noise,0,3999
Noise432.wav,Noise,0,3999
Noise433.wav,Noise,0,3999
Noise434.wav,Noise,0,3999
Noise435.wav,Noise,0,3999
Noise436.wav,Noise,0,3999
Noise437.wav,Noise,0,3999
Noise438.wav,Noise,0,3999
Noise439.wav,Noise,0,3999
Noise44.wav,Noise,0,3999
Noise440.wav,Noise,0,3999
Noise441.wav,Noise,0,3999
Noise442.wav,Noise,0,3999
Noise443.wav,Noise,0,3999
Noise444.wav,Noise,0,3999
Noise445.wav,Noise,0,3999
Noise446.wav,Noise,0,3999
Noise447.wav,Noise,0,3999
Noise448.wav,Noise,0,3999
Noise449.wav,Noise,0,3999
Noise45.wav,Noise,0,3999
Noise450.wav,Noise,0,3999
Noise451.wav,Noise,0,3999
Noise452.wav,Noise,0,3999
Noise453.wav,Noise,0,3999
Noise454.wav,Noise,0,3999
Noise455.wav,Noise,0,3999
Noise456.wav,Noise,0,3999
Noise457.wav,Noise,0,3999
Noise458.wav,Noise,0,3999
Noise459.wav,Noise,0,3999
Noise46.wav,Noise,0,3999
Noise460.wav,Noise,0,3999
Noise461.wav,Noise,0,3999
Noise462.wav,Noise,0,3999
Noise463.wav,Noise,0,3999
Noise464.wav,Noise,0,3999
Noise465.wav,Noise,0,3999
Noise466.wav,Noise,0,3999
Noise467.wav,Noise,0,3999
Noise468.wav,Noise,0,3999
Noise469.wav,Noise,0,3999
Noise47.wav,Noise,0,3999
Noise470.wav,Noise,0,3999
Noise471.wav,Noise,0,3999
Noise472.wav,Noise,0,3999
Noise473.wav,Noise,0,3999
Noise474.wav,Noise,0,3999
Noise475.wav,Noise,0,3999
Noise476.wav,Noise,0,3999
Noise477.wav,Noise,0,3999
Noise478.wav,Noise,0,3999
Noise479.wav,Noise,0,3999
Noise48.wav,Noise,0,3999
Noise480.wav,Noise,0,3999
Noise481.wav,Noise,0,3999
Noise482.wav,Noise,0,3999
Noise483.wav,Noise,0,3999
Noise484.wav,Noise,0,3999
Noise485.wav,Noise,0,3999
Noise486.wav,Noise,0,3999
Noise487.wav,Noise,0,3999
Noise488.wav,Noise,0,3999
Noise489.wav,Noise,0,3999
Noise49.wav,Noise,0,3999
Noise490.wav,Noise,0,3999
Noise491.wav,Noise,0,3999
Noise492.wav,Noise,0,3999
Noise493.wav,Noise,0,3999
Noise494.wav,Noise,0,3999
Noise495.wav,Noise,0,3999
Noise496.wav,Noise,0,3999
Noise497.wav,Noise,0,3999
Noise498.wav,Noise,0,3999
Noise499.wav,Noise,0,3999
Noise5.wav,Noise,0,3999
Noise50.wav,Noise,0,3999
Noise500.wav,Noise,0,3999
Noise51.wav,Noise,0,3999
Noise52.wav,Noise,0,3999
Noise53.wav,Noise,0,3999
Noise54.wav,Noise,0,3999
Noise55.wav,Noise,0,3999
Noise56.wav,Noise,0,3999
Noise57.wav,Noise,0,3999
Noise58.wav,Noise,0,3999
Noise59.wav,Noise,0,3999
Noise6.wav,Noise,0,3999
Noise60.wav,Noise,0,3999
Noise61.wav,Noise,0,3999
Noise62.wav,Noise,0,3999
Noise63.wav,Noise,0,3999
Noise64.wav,Noise,0,3999
Noise65.wav,Noise,0,3999
Noise66.wav,Noise,0,3999
Noise67.wav,Noise,0,3999
Noise68.wav,Noise,0,3999
Noise69.wav,Noise,0,3999
Noise7.wav,Noise,0,3999
Noise70.wav,Noise,0,3999
Noise71.wav,Noise,0,3999
Noise72.wav,Noise,0,3999
Noise73.wav,Noise,0,3999
Noise74.wav,Noise,0,3999
Noise75.wav,Noise,0,3999
Noise76.wav,Noise,0,3999
Noise77.wav,Noise,0,3999
Noise78.wav,Noise,0,3999
Noise79.wav,Noise,0,3999
Noise8.wav,Noise,0,3999
Noise80.wav,Noise,0,3999
Noise81.wav,Noise,0,3999
Noise82.wav,Noise,0,3999
Noise83.wav,Noise,0,3999
Noise84.wav,Noise,0,3999
Noise85.wav,Noise,0,3999
Noise86.wav,Noise,0,3999
Noise87.wav,Noise,0,3999
Noise88.wav,Noise,0,3999
Noise89.wav,Noise,0,3999
Noise9.wav,Noise,0,3999
Noise90.wav,Noise,0,3999
Noise91.wav,Noise,0,3999
Noise92.wav,Noise,0,3999
Noise93.wav,Noise,0,3999
Noise94.wav,Noise,0,3999
Noise95.wav,Noise,0,3999
Noise96.wav,Noise,0,3999
Noise97.wav,Noise,0,3999
Noise98.wav,Noise,0,3999
Noise99.wav,Noise,0,3999
