0.000159,1.1e-05,9.8e-05,7.5e-05,0.000107,4.6e-05,1.6e-05,6.1e-05,0.000106,3.9e-05,8.1e-05,0.000103,4.1e-05,3.4e-05,6.4e-05,0.000115,1.2e-05,0.000114,1e-05,4.5e-05,8.5e-05,7.1e-05,2.6e-05,8.7e-05,5.9e-05,3.9e-05,6.7e-05,5.6e-05,6.4e-05,1.5e-05,2e-06,7.2e-05,1e-05,1.1e-05,1.2e-05,4e-06,9e-06,7e-06,9.7e-05,5.6e-05,5.5e-05,0.000126,5.3e-05,5.6e-05,3e-06,7.8e-05,0.000121,0.000255,9.8e-05,4.7e-05,1.1e-05,4.5e-05,7.5e-05,2.3e-05,8.6e-05,1.7e-05,2.6e-05,4e-05,2.7e-05,2e-06,0.000199,4e-06,9.1e-05,1.5e-05,2.7e-05,8.7e-05,2.8e-05,7e-05,0.000121,5.5e-05,3.1e-05,0.000128,1.4e-05,0.000103,1.1e-05,8.9e-05,2.5e-05,6.6e-05,4.3e-05,6.5e-05,5.4e-05,9.7e-05,2.1e-05,4.9e-05,0.000106,1.4e-05,4.4e-05,8.9e-05,2.5e-05,1.8e-05,0.000144,3.1e-05,0.000152,2.6e-05,2.2e-05,1e-06,2.7e-05,9e-06,6.2e-05,2.2e-05,3.6e-05,2.2e-05,4.4e-05,1.5e-05,3e-05,6.6e-05,7.4e-05,2.8e-05,1.9e-05,4.7e-05,1.3e-05,0.000166,0.000114,1.5e-05,6.3e-05,0.000147,7.4e-05,0.000119,4.3e-05,5e-05,2.5e-05
0.000376,4.4e-05,0.000223,0.000186,0.000294,0.000132,9.5e-05,0.000258,0.000258,9e-05,0.000128,0.000229,7.2e-05,0.000111,0.000139,0.000289,5.4e-05,0.000221,9.4e-05,0.000166,0.000227,0.000172,4.6e-05,0.000222,0.000153,0.000164,0.000132,0.000128,0.000124,5.1e-05,2.5e-05,0.000151,7.2e-05,8.2e-05,6.4e-05,4e-06,3.6e-05,8.5e-05,0.000338,0.000236,0.000205,0.000327,3.4e-05,0.000144,8.3e-05,0.000107,0.000267,0.000587,0.000253,0.000218,0.000125,0.000135,0.000207,0.000127,0.000271,5.4e-05,4.9e-05,5.9e-05,4.8e-05,9.9e-05,0.000456,4.8e-05,0.000227,4e-05,0.000104,0.000197,9.7e-05,7.4e-05,0.000229,0.000139,8.4e-05,0.000314,8.1e-05,0.000215,6.8e-05,0.000176,7.5e-05,0.000149,6e-05,7e-05,0.000116,0.000179,3.3e-05,7.4e-05,0.000252,9.4e-05,6e-05,0.000215,0.000157,0.000118,0.000403,9.2e-05,0.000289,2.3e-05,3.8e-05,8.8e-05,7.4e-05,6.3e-05,0.000134,4e-06,5e-05,0.000121,0.000151,3.5e-05,8.4e-05,0.000231,0.000164,7e-05,7.1e-05,0.000123,0.000138,0.000406,0.000182,2.7e-05,0.000141,0.000314,0.000185,0.000238,0.000123,0.000132,0.000106
0.000343,8.1e-05,0.000137,0.000106,0.000273,0.000376,0.00036,0.000388,0.000557,0.000397,6.8e-05,0.000366,0.00026,0.000154,0.000225,0.00051,0.000202,0.000425,0.000262,4.4e-05,0.000196,0.000282,0.00027,0.000384,0.000196,0.000316,0.000235,0.000274,0.000263,0.000108,0.000116,0.000142,6.6e-05,0.000126,0.000107,0.000153,0.000154,0.000185,0.000298,0.000196,0.000283,0.000318,0.000142,0.000273,0.000134,0.000105,0.000194,0.00067,0.000401,0.000106,0.000237,0.000221,0.000512,3.7e-05,0.000222,0.00021,7.5e-05,0.000246,0.000143,0.000252,0.000651,0.000109,0.000388,0.000124,0.000232,0.000367,2.9e-05,5e-06,0.000345,0.000263,9.1e-05,0.000422,0.000306,0.000337,0.000164,8.7e-05,0.000172,0.000118,0.000143,0.000114,8.8e-05,9.4e-05,0.000217,1.9e-05,0.000535,8.4e-05,9e-05,0.000334,0.000251,0.000107,0.000524,0.000305,0.000456,0.000155,7.4e-05,0.000104,0.000226,0.000158,0.000243,0.000104,0.000321,5.9e-05,0.000178,0.000104,0.000141,0.000311,0.000116,0.000234,0.000131,5.3e-05,0.000319,0.000416,0.000443,0.000171,0.00034,0.000463,0.000293,0.000247,0.000253,0.000214,0.000153
0.000923,0.000333,0.000315,0.000318,0.000381,0.00028,0.000193,0.000578,0.00018,0.000601,0.000752,0.000686,0.000741,0.000538,0.000462,0.000857,0.000942,4.7e-05,4.8e-05,0.000346,0.000275,0.000526,0.000788,0.000359,0.000233,0.000612,0.001237,0.001052,0.000399,0.000911,0.000554,0.000326,4.6e-05,0.000591,0.000333,2.8e-05,0.000321,0.000549,0.000438,0.000701,0.000658,0.000747,0.000523,0.000485,0.00068,0.000551,0.000761,0.00111,0.000901,0.001076,0.000774,0.000697,0.001111,0.000925,0.000501,0.000742,0.000489,0.000183,0.000106,4e-04,0.000841,0.00061,0.000419,0.000323,8.7e-05,0.000832,0.000463,0.000135,0.000589,0.000656,0.000839,0.000926,0.000785,0.000863,0.000553,0.000311,0.000383,0.000707,0.000134,0.000337,8.3e-05,0.000203,0.000345,0.000499,0.000816,0.00076,0.000464,0.000334,0.000235,0.000352,0.000933,0.000743,0.000292,0.000403,0.000626,0.000478,0.00016,0.000347,0.000178,0.000433,0.000395,0.000258,0.000268,0.000386,0.00015,0.000441,0.000437,0.000506,0.000573,0.000277,0.000401,0.000943,0.000788,0.000577,0.000563,0.000588,0.001105,0.000949,0.000322,0.000333,0.000163
0.000822,0.00115,0.000277,0.000355,0.000576,0.000543,0.00031,0.000153,0.000371,0.000521,0.000196,0.000422,0.000513,0.000312,0.000158,0.00104,0.000739,0.000626,0.00057,0.000809,0.000643,0.001006,0.000556,0.000661,0.000543,0.000619,0.001398,0.001066,0.000804,0.001372,0.001107,0.000559,0.000398,0.00094,0.000632,0.000394,0.000392,0.000262,0.000187,0.000442,0.000634,0.000433,0.000466,0.000384,0.000693,0.000223,0.000457,0.001156,0.001759,0.000356,0.000421,9.4e-05,0.000742,0.000813,0.000564,0.001259,0.000728,0.000506,0.000683,0.000501,0.000428,0.000603,0.000882,0.000547,0.000339,0.000735,0.000606,0.000356,0.000177,0.000463,0.001212,0.000518,0.000549,0.000323,0.000528,0.00032,0.00068,0.000701,0.000556,0.000677,0.000526,0.000246,0.000118,0.000497,0.001117,0.001279,0.000676,0.000205,0.000589,0.000495,0.000694,6e-04,0.00061,0.000508,0.000458,0.000497,0.000573,0.000376,0.000534,0.000348,0.000346,0.000449,0.000232,0.000618,0.000448,0.000693,0.000611,0.000684,0.00071,0.000632,0.000254,0.00084,0.000456,0.000293,0.000241,0.000269,0.000908,9.6e-05,0.000605,0.000323,0.000258
0.000386,0.000445,0.000374,0.00055,0.000162,0.000464,0.000108,0.000503,0.000276,0.000819,0.000559,0.00037,0.000435,0.000605,0.00045,0.000662,0.000456,0.000237,0.000665,0.000284,7.5e-05,0.000456,0.00032,0.00059,0.000342,0.000569,0.000577,0.000302,0.000154,0.000543,0.000426,1.7e-05,0.000233,0.000601,0.000322,0.00018,0.000529,0.000563,8e-05,0.000198,0.000599,0.000366,6.6e-05,0.000289,0.000416,0.000594,0.000225,0.00028,0.000509,0.000416,0.000169,0.000441,0.000394,0.000313,0.000568,0.000595,0.000244,0.000183,0.000586,0.000151,0.000205,0.000306,0.000282,0.000144,0.000365,0.00039,0.000181,0.000492,0.000249,0.000202,0.00073,0.000568,0.000664,0.000604,5.1e-05,0.000283,0.000768,0.000335,0.000317,0.000169,0.00042,3.1e-05,7.5e-05,0.000693,2.7e-05,0.000719,0.000216,0.000197,0.000453,0.000229,0.00048,0.000237,7.5e-05,0.000187,0.000689,0.000231,0.000223,0.000299,7.8e-05,0.000306,2e-04,0.000302,1e-04,0.000616,0.000418,0.000315,0.000372,0.000856,0.000197,0.000489,0.000733,0.000308,0.000329,7.6e-05,0.000263,0.000171,0.000396,0.000393,0.000471,0.000233,0.000375
0.000508,0.000368,0.000445,0.000596,0.000579,0.000697,0.000468,0.000274,0.000566,0.000881,0.000187,0.000159,0.000504,0.000383,0.000215,0.000347,0.000285,0.000341,0.000511,0.000245,0.000389,0.000602,0.000366,0.000394,0.000169,0.00063,0.000439,0.000452,0.000114,0.000311,0.000349,0.000137,0.000359,0.000408,0.000469,6.4e-05,0.000435,0.000341,0.000529,0.000587,0.000446,0.000125,0.000385,0.000428,0.000494,0.000622,0.000122,0.000499,0.000425,0.000253,0.000153,0.000386,0.000341,0.000316,0.000911,0.000874,0.00063,0.000615,0.000653,0.000314,0.000453,0.000174,0.000223,0.000252,0.000787,0.000391,0.000156,0.000592,0.000166,0.000105,0.000388,0.000373,0.000281,0.000351,0.000181,0.000437,0.000776,0.000533,0.000296,0.000388,0.000266,0.000479,0.000314,0.000561,0.000117,0.000423,0.00043,0.00034,0.000163,0.000144,7.6e-05,0.000191,0.000209,0.000264,0.000284,2e-04,0.00042,0.000105,0.000202,0.000193,0.000269,0.000174,0.000425,0.000521,0.00016,0.000106,0.00054,0.000591,0.000451,0.000246,0.000109,0.000245,0.000393,0.000286,0.000337,0.000435,0.000245,9.7e-05,0.000342,0.000302,0.000417
0.000355,0.000613,0.000719,0.000809,0.000591,0.00061,0.000909,0.000823,0.000656,0.001555,0.001601,0.000792,0.000354,4e-04,0.000147,0.000145,0.000755,0.000406,0.000736,0.000236,0.000777,0.000744,0.000857,0.000605,0.000372,0.000898,0.000722,0.000431,0.000328,0.00101,0.000971,0.000801,0.000993,0.000967,0.000876,0.000557,0.000447,0.000124,0.000572,0.000959,0.001125,0.001146,0.000986,0.000872,0.001036,0.001159,0.000914,0.000785,0.001904,0.001506,0.000903,0.000751,0.000665,0.000453,0.000721,0.000516,0.000154,0.000462,0.001664,0.001283,0.000592,0.000555,7.8e-05,0.000595,0.001351,0.000928,0.00049,0.000741,0.000752,0.00037,0.000735,0.000397,0.000415,0.001373,0.000804,0.000833,0.000968,0.000364,0.000522,0.000314,0.00032,0.000748,0.000628,0.000683,0.000892,5e-04,0.000456,0.000711,0.000595,0.000298,0.000132,0.000409,0.000341,0.000331,0.000653,0.000659,0.001081,0.000553,0.000176,1e-04,0.000282,0.000402,0.000634,0.000335,0.000503,0.000572,0.000879,0.001187,0.001093,0.000821,0.000213,0.000457,0.000122,0.00077,0.000733,0.000862,0.000941,0.000518,0.000461,3.4e-05,0.00045
0.000384,0.001179,0.001955,0.001216,0.000164,0.000749,0.000476,0.001408,0.00198,0.001138,0.000245,0.000588,0.000769,0.000708,0.000606,0.000604,0.000862,0.000787,0.000813,0.001324,0.001726,0.001064,0.0017,0.000741,0.000756,0.001602,0.001661,0.00113,0.00144,0.000528,0.000746,0.000899,0.000706,0.001242,0.00109,0.000599,0.000129,0.000767,0.000921,5.9e-05,0.000565,0.000831,0.000463,0.000752,0.000618,0.000995,0.000386,0.000756,0.001942,0.001609,0.00053,0.000592,0.001341,0.000929,0.000983,0.001492,0.001377,9e-05,0.001661,0.001513,0.000363,0.00104,0.001001,0.000616,0.000626,0.001383,0.001159,0.001888,0.001539,0.001092,0.001369,0.001021,0.000895,0.001113,0.000899,0.000422,0.001379,0.001621,0.001514,0.001481,0.000314,0.000478,8.2e-05,0.000791,0.000459,0.000144,0.000277,0.000273,0.000313,0.000102,0.000155,0.000646,0.000425,0.000203,0.001237,0.001614,0.001497,0.000787,0.000311,0.000555,0.000598,0.000669,0.000259,1.6e-05,0.000517,0.000218,0.000362,0.000584,0.000656,0.000321,0.000811,0.000874,0.00062,0.000637,0.000791,4.8e-05,0.00055,0.000931,0.001205,0.0013,0.000917
0.000807,0.00118,0.000839,0.000773,0.000875,0.000558,0.000145,0.001413,0.000408,0.000387,0.00052,0.000789,0.000298,0.00023,0.00046,0.000518,0.000249,0.000465,0.000741,0.001048,0.00027,0.000491,0.001156,0.001058,0.001281,0.000782,0.000539,0.000332,0.001021,0.000247,0.000812,8.5e-05,0.000831,0.000438,0.000493,0.000687,0.000653,0.000854,0.000409,0.000476,0.000994,0.000153,0.000229,0.000554,0.000325,0.000797,0.000718,0.001413,0.000865,0.000794,0.000362,0.000344,0.000507,0.000537,0.000503,0.00096,0.00134,0.001457,0.000936,0.001019,0.000889,0.000506,0.000308,0.001469,0.00153,0.000337,0.000115,0.001342,0.000407,0.00022,0.000313,3e-04,0.000499,0.001176,0.000441,0.000816,0.000443,4e-04,0.000753,0.000523,0.001154,0.000284,0.00022,0.000776,0.000812,0.000373,0.00062,0.001019,0.000738,0.000489,0.000114,0.000653,0.000945,0.000537,0.001322,0.000455,0.000842,0.001026,0.00065,0.000717,0.00075,0.000901,0.000465,0.00034,0.000247,0.000205,0.000279,0.000787,0.000383,0.000566,0.000964,0.000373,0.000191,0.000532,9.8e-05,0.000585,0.000311,0.000657,0.000231,0.000825,0.000415
0.001124,0.000711,0.001332,0.000348,0.000355,0.000276,0.000367,0.00085,0.000952,0.00083,0.000856,0.000531,0.000555,0.000323,0.000411,0.000732,0.00031,0.000575,0.000211,0.00068,0.000766,0.000708,0.001301,0.000301,0.000666,0.000858,0.001037,0.000817,0.001155,0.001057,0.000485,0.000359,0.000601,0.000176,0.000135,0.000483,0.00025,0.001402,0.001527,0.001045,0.001264,0.000756,0.000411,0.000542,0.00053,0.00061,0.000417,0.001171,0.00023,0.000491,0.000382,0.000573,0.000567,0.000433,0.000841,0.000827,0.000574,0.000409,0.001088,0.001187,0.001238,0.000507,0.000159,0.001165,0.000997,0.000645,0.000528,0.000565,0.000371,0.000168,0.000155,0.000517,0.000338,0.000332,0.000763,0.000734,0.000421,0.000277,0.000525,0.000625,0.000982,0.000787,0.000617,0.000438,0.000661,0.000539,0.000291,0.001204,0.000814,0.000218,0.000156,0.000446,0.000697,0.000301,0.00119,0.000856,0.000794,0.001003,0.001198,0.000674,0.000617,0.000477,0.000346,0.000584,0.000659,0.00081,0.000313,0.000791,0.001034,0.000667,0.000538,0.000768,0.000683,0.000753,0.00048,0.000552,0.000401,0.000214,0.000289,0.000776,0.00054
0.000519,0.000806,0.000856,0.000883,0.000539,0.000848,0.000266,0.000113,0.000134,0.000364,0.000358,0.000854,0.000429,0.000598,0.000486,0.000113,0.000319,0.000274,0.000499,0.000572,0.000694,0.000255,0.000467,0.000494,0.00022,0.000415,0.000326,0.000324,0.000377,0.000621,0.000437,0.000407,0.000415,9.1e-05,0.000214,0.000202,4.7e-05,0.000916,0.000478,5.6e-05,0.000668,0.000418,0.000136,0.000273,0.000258,0.000739,0.000858,0.000276,0.000608,0.000437,0.00035,0.000511,0.000115,0.000288,0.000494,0.000402,0.000253,0.000505,0.000531,0.00084,0.000697,0.001,0.000649,0.000549,8.8e-05,0.000845,0.001168,0.000748,0.000204,0.000212,0.000407,0.000727,0.00033,0.000258,0.000608,0.000114,0.000154,0.000349,0.00054,0.000347,0.000778,0.000289,0.000235,0.000282,0.000411,7.4e-05,0.000277,0.000705,0.00066,0.000227,7.3e-05,0.000275,0.000284,4.6e-05,0.000639,0.000399,0.000544,0.000682,0.000414,0.000164,0.000556,0.00035,3e-04,0.000486,0.000986,0.000753,0.000241,0.000447,0.000515,0.000371,0.000294,0.000207,0.000316,0.000194,0.000248,0.000352,0.000503,0.000418,0.000383,4.2e-05,0.000387
5e-05,0.00044,0.000306,0.000291,0.000256,0.000488,0.000292,0.00038,0.000256,0.000317,0.000624,0.000441,0.000449,0.000344,0.000257,0.000228,0.000376,0.000135,0.000217,0.000654,7.8e-05,0.000388,0.000107,0.000237,0.000162,0.000231,0.000389,0.000235,3.5e-05,7.9e-05,7.8e-05,0.000377,0.00049,0.000144,0.00013,2.1e-05,0.000172,0.000153,0.000493,0.000126,0.000228,0.00035,0.00037,0.000181,0.000468,0.000163,0.000346,0.000376,0.000141,0.000219,0.000355,9.8e-05,0.000285,0.000299,0.000402,0.000162,0.000193,0.000368,0.000796,0.000323,0.000686,0.000264,8.1e-05,0.000234,0.000473,0.001105,0.000492,0.000123,0.000348,0.000155,0.000327,0.000617,0.00037,0.000134,0.000525,0.000345,0.000206,0.000553,0.000298,0.000442,0.000187,9.6e-05,0.000428,0.000187,0.000305,0.000235,0.000154,0.000518,0.000262,0.000429,7.4e-05,0.000403,0.000458,0.000158,0.000265,0.000525,0.000267,0.000273,0.000466,0.000352,0.000412,0.000465,0.000111,0.000349,0.000555,0.000261,0.000331,0.000204,0.000406,0.00024,0.00044,0.000174,0.000411,0.000248,0.000178,0.00038,0.00026,0.000341,0.000248,0.000185,0.000258
0.000495,0.000178,0.000512,0.000538,0.000927,0.00029,2e-04,0.000312,3e-04,0.000438,0.000712,0.00097,0.000521,0.000346,0.000208,0.000289,0.000514,0.000253,0.000318,0.000198,0.000281,0.000319,0.000413,0.000551,0.000304,0.00041,0.000525,0.000228,0.000364,0.000559,0.000361,0.000387,0.000378,0.000222,0.000243,0.000478,0.000124,0.000988,0.000408,0.000119,0.000637,0.000325,0.000363,0.000404,5e-04,0.000409,0.000155,0.000453,0.000178,0.000199,0.000435,0.000188,0.000567,0.000637,0.000418,0.000351,0.000492,0.000415,0.000593,0.000364,0.000123,0.000398,0.000486,0.000562,0.000632,0.000768,0.000381,0.000798,0.000119,0.000265,0.00029,0.000163,0.000525,0.000663,0.000294,0.000108,0.000516,0.000971,0.00037,0.000384,0.000444,0.000512,0.000701,0.000917,0.000281,0.00022,4e-05,0.001048,0.000979,0.00088,6e-04,0.000362,0.000391,0.000221,0.000373,0.000161,0.000362,0.000164,0.000296,0.000582,0.000714,0.000201,0.000177,0.000355,0.000631,0.000566,0.00063,0.000398,0.000572,0.000326,0.000734,0.000695,7.8e-05,0.000122,0.000346,0.000694,0.000342,0.000454,0.000571,0.000439,6.5e-05
0.00016,0.000439,0.000369,0.000416,0.000963,0.001076,0.000495,0.000394,0.000541,0.000592,0.001161,0.001081,0.000349,0.001143,0.000895,7.3e-05,0.000551,0.000631,9.4e-05,0.000797,0.000446,0.000859,0.000769,0.001144,0.000669,7e-05,0.000914,0.001031,0.000283,0.000342,0.000711,0.00094,0.000971,0.000324,0.000614,0.000316,0.000106,0.001496,0.000592,0.000608,0.001057,0.00082,0.000978,0.000705,0.00079,0.000795,0.000457,9.2e-05,0.00036,0.000109,0.000262,0.000944,0.000796,0.001249,0.001056,0.000129,0.001107,0.000758,0.000751,5.5e-05,0.000969,0.001186,0.000438,0.000528,0.000851,0.001033,0.000557,0.001542,0.001169,0.000504,0.000412,0.000296,0.00078,0.000804,0.000857,0.000359,0.00114,0.000719,0.001094,0.00031,0.000763,0.000766,0.001244,0.000179,0.00052,0.000442,0.000124,0.001451,0.000558,0.000459,3e-04,0.000671,0.001628,0.000486,0.000269,0.000303,0.00023,0.000393,0.000418,0.000465,0.000389,0.000848,0.00044,0.00097,0.001282,0.000767,0.000866,0.000488,0.000805,0.000728,0.000691,0.001144,0.000888,0.000118,0.000226,0.000485,0.000541,0.000438,0.000224,0.000161,0.000148
0.002274,0.001567,0.001193,0.00021,0.001046,0.00275,0.002182,0.00178,0.001854,0.001348,0.002045,0.00318,0.002381,0.002239,0.001326,0.001544,0.000921,0.000862,0.000455,0.001693,0.001721,0.001418,0.001697,0.001033,0.000734,0.000539,6e-04,0.000622,0.001394,0.001217,0.001036,0.000201,0.001934,0.001297,0.000959,0.000928,0.000623,0.00127,0.001694,0.000781,0.000921,0.001531,0.000634,0.001877,0.000762,0.000965,0.001958,0.001809,0.001097,0.000381,0.000179,0.00116,0.001254,0.00089,0.001024,0.001021,0.002206,0.001403,0.001089,0.000917,0.001578,0.000243,0.001632,0.001646,0.000181,0.002061,0.002375,0.000837,0.002163,0.001439,0.000522,0.000436,0.000585,0.00164,0.001511,0.000865,0.001352,0.001485,0.001963,0.00179,0.002061,0.001743,0.000158,0.001313,0.001658,0.001368,0.000844,0.001028,0.001339,0.001222,0.000317,0.000687,0.0013,0.001368,0.000731,0.000619,5e-04,0.00011,0.000822,0.000551,0.000322,0.000928,0.000595,0.001065,0.000346,0.00152,0.001394,0.001003,0.000597,0.000848,0.000363,0.00108,0.001638,0.001418,0.000773,0.000792,0.001363,0.001362,0.001263,0.001351,0.000671
0.001292,0.001069,0.000243,0.000408,0.000581,0.001873,0.002157,0.000575,0.00075,0.000658,0.001418,0.003323,0.003312,0.001857,0.001212,0.00168,0.001018,0.000982,0.000931,0.001887,0.000837,0.00213,0.001677,0.001137,0.00083,0.000691,0.000436,0.001243,0.001854,0.001596,0.000666,0.000444,0.001828,0.001618,0.00066,9.9e-05,0.000989,0.001315,0.001753,0.001684,0.001947,0.001078,0.001099,0.001883,0.001644,0.001265,0.001305,0.000946,0.000406,0.000436,0.000196,0.001188,0.001004,0.000696,0.000639,0.000724,0.001616,0.002235,0.001463,0.000922,0.001348,0.001382,0.001786,0.001559,0.001813,0.00329,0.00356,0.003853,0.001861,0.00158,0.00115,0.001108,0.000389,0.001611,0.000482,0.000485,0.00171,0.002711,0.000661,0.001239,0.001843,0.001786,0.001754,0.001943,0.001376,0.000287,0.00065,0.001362,0.001012,0.000941,0.000953,0.000576,0.001695,0.001983,0.001076,0.000965,0.000543,0.000567,0.000548,0.000567,0.001294,0.000808,0.000514,0.00137,0.00102,0.001534,0.002141,0.002622,0.002342,0.0012,0.000577,0.000685,0.00208,0.002374,0.002461,0.00277,0.001521,0.000319,0.000586,0.001118,0.000805
0.000451,0.000965,0.001245,0.000749,0.000342,0.001478,9.3e-05,0.000689,0.000247,0.000792,0.001029,0.00164,0.000171,0.000317,0.000742,0.000444,0.000907,0.000679,0.000526,0.000512,0.000988,0.00124,0.000133,0.000395,0.000447,0.000422,0.000378,0.000836,0.000597,0.000463,0.000477,0.000806,0.000575,0.000264,0.000229,0.000361,0.000802,0.000474,0.000663,0.000295,0.000497,0.000234,0.000526,0.000804,0.000461,0.000303,0.000729,1e-05,0.000485,0.00077,0.000616,0.000811,0.000432,0.000248,0.000337,0.000331,0.001409,0.000398,0.000243,0.00068,0.00054,0.000114,0.000663,0.00022,0.000628,0.001375,0.000523,0.001169,0.000847,0.001317,0.000345,0.000778,0.000899,0.001326,0.000774,0.000525,0.001038,0.001024,0.001309,0.000715,0.000976,0.000481,0.000557,0.000526,0.000388,0.00061,0.000434,0.000564,0.000705,0.000657,0.000484,0.000487,0.000708,0.000614,0.000597,0.000145,0.000153,0.000365,0.000649,0.000519,0.000967,0.000485,0.000479,0.000993,0.000411,0.000581,0.00091,0.001198,4.9e-05,0.000201,0.000348,0.000334,0.001132,0.000476,0.001004,0.001107,0.000374,0.000178,0.000191,0.000628,0.000503
0.000343,0.000628,0.000357,0.000448,0.001053,0.000386,6.5e-05,0.000488,0.000394,0.000659,0.001011,0.001191,0.000753,0.000543,0.00057,0.00042,0.000379,0.000307,0.000456,0.000377,0.000824,0.000574,0.000116,0.00037,0.000281,0.000333,0.000499,0.000808,0.000266,9.7e-05,0.000206,0.000497,0.000214,0.000299,0.000196,0.000305,0.000145,0.000415,0.000275,0.00036,0.000285,0.000357,0.000515,2.5e-05,0.00047,0.000231,0.000513,0.000223,0.000375,0.00053,0.000102,0.000229,0.000128,0.000124,0.000219,0.000415,0.000451,0.000785,0.000395,0.00071,0.000307,9e-05,0.000391,0.000452,0.00041,0.000695,0.000321,0.000272,0.000749,0.000342,0.000441,0.000324,0.000683,0.000142,0.000221,7e-05,0.00041,0.000594,0.000642,0.000658,0.000559,0.000357,0.000578,0.000182,0.000366,0.000393,0.000246,0.000716,0.000221,0.000521,9.8e-05,0.000158,0.000349,0.000255,0.000104,7.3e-05,0.000184,0.000244,0.000395,0.000777,0.000146,0.000145,0.00028,0.000764,0.000703,0.000161,0.000533,0.000671,0.000739,0.000363,0.000333,0.000425,0.000704,0.000576,0.000698,0.000111,0.000266,0.000397,0.000365,0.000369,0.00037
0.000333,0.000161,0.000122,0.000331,0.000443,0.000419,0.000274,0.000186,0.000513,0.000136,0.000184,0.000156,0.000345,0.000392,2.9e-05,0.000401,0.000131,0.000142,0.000311,0.000263,0.000247,0.000301,0.000109,0.000465,7.9e-05,0.000123,0.000292,0.00041,0.000288,0.000262,0.000139,0.00025,0.000106,0.00018,8.9e-05,0.000178,0.000226,0.00037,0.000236,0.000183,0.000495,0.000148,0.000166,3e-04,0.000171,0.000256,0.000434,0.000357,0.000154,2e-04,0.000245,9.4e-05,7.4e-05,0.000151,0.000471,0.000658,0.000187,0.000391,0.000106,0.000166,0.000193,0.000123,0.000504,0.000309,0.000372,0.000606,0.000616,0.000598,0.000638,0.000182,0.000142,2.5e-05,0.000281,0.000167,0.000258,0.000231,0.00043,0.000166,0.000763,6e-04,0.000275,0.000543,0.000502,0.000671,0.000141,0.00062,0.000197,0.00059,0.000638,0.000373,0.000131,0.000249,0.000511,0.000389,0.000165,0.00022,0.000191,0.000107,0.000234,0.000143,0.000218,0.000214,2.1e-05,0.00026,0.000221,0.000116,0.000372,0.000434,0.000384,0.000339,0.000112,0.000259,0.000441,9.1e-05,0.000232,0.000342,0.000233,0.000264,0.00024,0.000196,0.000173
0.000237,0.000332,0.000213,0.000274,0.000202,0.000336,8.8e-05,0.000166,0.000213,0.000127,0.000198,0.000198,0.000298,0.000457,0.000158,0.000483,0.000153,0.000265,0.000287,0.000142,0.000257,6.9e-05,0.000168,0.000188,0.000128,0.000122,0.000182,0.00039,0.000265,0.000101,0.000224,0.000177,0.000328,0.00014,9.3e-05,0.000187,0.000256,0.000159,6e-05,0.000114,0.000314,0.000254,0.000334,0.000102,0.000242,0.000228,9e-05,0.000232,0.000387,0.000193,0.000176,0.000136,0.000296,0.000236,0.000557,0.000189,0.000355,4.5e-05,0.000319,0.000318,0.000213,0.000278,0.00019,0.000333,0.000128,0.000522,0.000198,0.000307,0.000453,8.1e-05,0.000118,0.000187,0.000234,0.000234,8.9e-05,4.5e-05,0.000309,0.000236,0.000267,7.9e-05,0.000308,0.000364,0.000334,0.000264,0.000308,0.000261,0.000248,0.000233,0.000119,8.7e-05,0.000106,0.000245,0.000228,0.000149,0.000109,0.000316,0.000243,0.000128,0.000267,0.00035,0.000166,0.00024,9.8e-05,0.000107,0.000161,0.000182,0.000464,0.000236,0.000201,0.000336,0.00022,0.000174,0.000149,0.000313,0.00019,0.000344,0.000157,0.000237,0.000117,0.000156,0.000188
2.4e-05,0.000156,0.000113,0.000163,0.000353,0.00026,0.000192,9e-05,0.00027,0.00018,0.000277,0.000269,4.4e-05,0.000114,0.000164,0.000245,0.000153,0.000156,0.000177,0.000129,0.000184,0.00025,0.000142,0.000159,8.3e-05,7.1e-05,6.5e-05,0.000197,0.000196,0.000139,0.000125,0.000108,0.000135,2e-05,3.4e-05,0.000208,4.7e-05,0.000168,4.4e-05,0.000125,0.000181,3.9e-05,0.000237,0.000119,0.000199,0.000142,0.000219,3.8e-05,8.7e-05,9.9e-05,0.000106,0.00015,0.000301,0.000128,0.000329,0.000235,0.000149,0.000243,0.00021,0.000193,7.6e-05,0.00016,0.000158,8.4e-05,0.000101,0.000323,0.000249,0.000263,0.000271,0.000127,0.000144,0.000133,0.000316,0.00025,0.000151,9.7e-05,0.000176,0.00029,0.00037,0.000271,8.1e-05,0.000102,0.000252,0.000227,0.000174,0.00023,7.3e-05,0.000139,0.000198,7.3e-05,2.6e-05,0.000183,0.000161,8.4e-05,7.5e-05,0.000146,0.000138,9.5e-05,0.000151,0.000238,0.000147,0.000131,8.9e-05,0.000145,0.000156,0.000147,0.00027,0.000241,0.000296,7.7e-05,6.7e-05,6.4e-05,8.5e-05,0.000281,0.000355,0.000153,7.2e-05,2.4e-05,0.000103,1.5e-05,4.5e-05
6.2e-05,3.8e-05,3.1e-05,0.000105,0.000143,9.4e-05,8.3e-05,4.5e-05,1e-04,0.000116,6.5e-05,5.6e-05,6.5e-05,2e-05,3.5e-05,8.6e-05,9.9e-05,5.7e-05,6.1e-05,2.5e-05,7.1e-05,0.000108,4.8e-05,6.8e-05,5e-05,5.1e-05,2.1e-05,8.4e-05,0.000103,5.1e-05,1.1e-05,1.3e-05,1.6e-05,4.6e-05,9e-06,4.1e-05,1.6e-05,7.7e-05,3e-05,5.7e-05,4.7e-05,2.9e-05,0.000101,3.3e-05,5.3e-05,4.5e-05,0.000127,6.1e-05,3.9e-05,3e-05,2.3e-05,3.6e-05,6.6e-05,7e-05,4.7e-05,3.6e-05,0.000138,0.000147,6.3e-05,4.7e-05,1.5e-05,6.7e-05,6.1e-05,6.1e-05,8.5e-05,1e-04,7.6e-05,8.1e-05,9e-05,8.1e-05,2.6e-05,3.3e-05,7.5e-05,2.6e-05,1.8e-05,4.6e-05,9e-05,7.4e-05,0.000125,7.7e-05,3.8e-05,3.6e-05,0.000103,5.2e-05,5e-05,5.6e-05,4.2e-05,4.1e-05,9.1e-05,3.1e-05,2.6e-05,2.9e-05,7.3e-05,3.6e-05,7e-06,4.5e-05,5.6e-05,2.3e-05,4.8e-05,9.7e-05,2.8e-05,7e-05,5.9e-05,5.7e-05,4.5e-05,7.9e-05,8.9e-05,4.1e-05,8.5e-05,4.1e-05,4.8e-05,4.4e-05,5.7e-05,0.000127,0.000171,0.000102,1e-05,5.9e-05,3.4e-05,3.7e-05,4.2e-05
3.3e-05,3.9e-05,3.3e-05,7.5e-05,0.000118,0.000111,5e-05,2.8e-05,0.000103,8.6e-05,5.6e-05,9.6e-05,3.2e-05,4.1e-05,2.7e-05,8.5e-05,6.3e-05,4.1e-05,4.1e-05,1.4e-05,7.5e-05,8.9e-05,7.1e-05,8.3e-05,4.1e-05,1.4e-05,2.1e-05,9.3e-05,5.7e-05,1.6e-05,2.4e-05,2.5e-05,3.4e-05,2.7e-05,6e-06,5.2e-05,4.5e-05,9.6e-05,3.4e-05,1.3e-05,2.9e-05,5.4e-05,0.000113,4.6e-05,6.1e-05,6.1e-05,8.6e-05,5.2e-05,3.3e-05,3.8e-05,3.3e-05,2.5e-05,5.5e-05,6.3e-05,8.2e-05,4.8e-05,8.7e-05,8.8e-05,0.00013,7e-05,1.1e-05,6.1e-05,7.6e-05,5.4e-05,5.7e-05,0.000183,5.3e-05,7.3e-05,8.9e-05,5.9e-05,6.4e-05,4.8e-05,6.2e-05,9.4e-05,3.3e-05,4.8e-05,4e-05,7.4e-05,0.00015,0.000104,1.4e-05,2.6e-05,6.8e-05,4.4e-05,1e-05,4e-05,2.3e-05,1.7e-05,1.6e-05,7e-05,3e-05,8e-05,8.5e-05,4e-05,4.2e-05,1e-06,3.8e-05,8e-06,2.2e-05,8.4e-05,7.2e-05,7.5e-05,4.3e-05,1.7e-05,3.9e-05,2.1e-05,0.000114,4.6e-05,8.2e-05,2.2e-05,3.4e-05,5.4e-05,6.4e-05,9e-05,0.000149,6.1e-05,2.4e-05,2.4e-05,3.2e-05,3.3e-05,3.6e-05
2.8e-05,1e-04,5.3e-05,0.000111,7.7e-05,6.2e-05,8.7e-05,5.9e-05,0.000171,3.2e-05,9.3e-05,0.000122,3.4e-05,4.9e-05,7.6e-05,7.9e-05,9.7e-05,6.8e-05,4e-05,1.2e-05,4.6e-05,8.3e-05,8e-05,3.4e-05,5.1e-05,2.8e-05,2.7e-05,6.4e-05,3.7e-05,7.7e-05,3.1e-05,4.2e-05,5.6e-05,3.4e-05,2.5e-05,7.8e-05,1.4e-05,7.4e-05,8e-05,1.8e-05,5.9e-05,6.2e-05,2.3e-05,5.1e-05,4.4e-05,8.7e-05,0.000127,3.8e-05,2.1e-05,6e-05,5.4e-05,7.1e-05,7.4e-05,7.6e-05,2.7e-05,4.6e-05,8.7e-05,2.8e-05,4.1e-05,4.5e-05,2.1e-05,8.1e-05,2.4e-05,6.6e-05,2.2e-05,0.000125,5.3e-05,5.1e-05,6.3e-05,3.2e-05,5.6e-05,9.7e-05,6.5e-05,2.4e-05,6.6e-05,5.8e-05,8.8e-05,0.000121,0.000137,3.7e-05,3.8e-05,5.2e-05,6.9e-05,0.000109,4e-06,3.4e-05,3.6e-05,2.5e-05,8.8e-05,3.7e-05,6.9e-05,4.2e-05,5.7e-05,7e-06,2.6e-05,6.6e-05,2.2e-05,3.6e-05,8.1e-05,5.9e-05,6.7e-05,3.8e-05,6.4e-05,4e-05,3.3e-05,1.8e-05,6e-05,2.6e-05,5e-05,4.8e-05,4.2e-05,4.4e-05,8.5e-05,0.000106,0.000105,3.5e-05,1.5e-05,4e-05,4.4e-05,4.2e-05,3.5e-05
6e-06,8.6e-05,2.5e-05,0.000115,7.8e-05,0.000103,8.3e-05,7.6e-05,6.8e-05,6.9e-05,9.1e-05,5.5e-05,8.3e-05,8.8e-05,3.2e-05,5.8e-05,3.2e-05,9e-06,2.3e-05,4.4e-05,4.8e-05,8.9e-05,4e-05,6.5e-05,2.8e-05,4.6e-05,9.8e-05,0.000136,2e-05,7.8e-05,3.4e-05,4.5e-05,6.1e-05,3.2e-05,4.5e-05,3.6e-05,3.7e-05,8.1e-05,4.9e-05,7.7e-05,3.8e-05,5.4e-05,8.6e-05,7.4e-05,5.1e-05,6.1e-05,9e-05,4.1e-05,5.8e-05,4e-06,3.2e-05,4.9e-05,5e-06,2.8e-05,5.8e-05,5.1e-05,9.8e-05,2.8e-05,0.000158,0.00012,8.1e-05,2.8e-05,0.000124,4.8e-05,2e-05,1.4e-05,0.000136,0.000106,0.000113,8.8e-05,6.3e-05,5.2e-05,4.9e-05,3.7e-05,7.8e-05,3.2e-05,6.4e-05,0.000107,8.7e-05,0.000124,6.9e-05,4.3e-05,9.7e-05,8.1e-05,0.000107,6.3e-05,4.4e-05,5.1e-05,0.000104,4.4e-05,6.6e-05,6.8e-05,4e-05,3.4e-05,5.4e-05,9.1e-05,8.8e-05,2.5e-05,6e-05,7.7e-05,3.6e-05,3.6e-05,7.8e-05,3.3e-05,9e-06,3e-05,5.7e-05,4e-05,3.7e-05,3.9e-05,6e-05,4.2e-05,0.000106,2.4e-05,0.000112,7.6e-05,2.6e-05,5.4e-05,1.2e-05,6.2e-05,3e-06
1e-05,6e-05,6.2e-05,5.4e-05,6.6e-05,0.000126,5.5e-05,3.3e-05,5.7e-05,8.6e-05,6.6e-05,3.8e-05,7.1e-05,6.8e-05,3.3e-05,4.4e-05,4.8e-05,3.7e-05,2.2e-05,7e-06,6.5e-05,6.8e-05,4.8e-05,4.3e-05,2.4e-05,4.3e-05,9.2e-05,7.5e-05,2.6e-05,1e-05,3.8e-05,4.3e-05,3.6e-05,9e-06,4.9e-05,6.3e-05,2.1e-05,4.4e-05,2.8e-05,5.6e-05,4.5e-05,3.7e-05,8.5e-05,8e-05,0.000107,7.7e-05,0.000103,1.9e-05,2.6e-05,2.7e-05,3.1e-05,5e-05,2.5e-05,8.7e-05,8.4e-05,1.2e-05,3.5e-05,1.9e-05,0.000143,5.2e-05,1.8e-05,2.3e-05,7.5e-05,4.1e-05,1.2e-05,3.5e-05,9.7e-05,2.9e-05,0.000106,7.6e-05,2.4e-05,6.2e-05,3.7e-05,8.3e-05,3.5e-05,4e-05,7.1e-05,4.8e-05,4.3e-05,0.000102,2.2e-05,1.8e-05,9.6e-05,4e-05,6.2e-05,3.7e-05,2.1e-05,3.7e-05,0.000105,1e-05,2.5e-05,8.1e-05,4e-05,3.3e-05,5.3e-05,3e-05,4.2e-05,4e-05,7.3e-05,1.2e-05,4.9e-05,2.5e-05,6.1e-05,1.4e-05,4e-05,2.2e-05,5.4e-05,3.5e-05,6.3e-05,2.4e-05,5.4e-05,1.8e-05,5.1e-05,6e-05,9e-05,4.2e-05,2.4e-05,2.8e-05,3.7e-05,4.4e-05,1e-05
7e-06,5.1e-05,6e-05,8e-05,2.3e-05,7.7e-05,2.9e-05,4.7e-05,7.6e-05,4.6e-05,7.8e-05,4.5e-05,4.9e-05,2.9e-05,2.6e-05,3.1e-05,5.7e-05,4.1e-05,1.5e-05,3.2e-05,1.1e-05,6e-05,4e-05,2.7e-05,2.2e-05,3.3e-05,4.7e-05,7.7e-05,5e-05,2e-05,2e-05,9e-06,9e-06,4e-05,3.5e-05,2.2e-05,8e-06,5.4e-05,3.1e-05,3.2e-05,1.9e-05,5.3e-05,2.2e-05,7e-06,7.2e-05,8e-06,7.4e-05,2.3e-05,2.7e-05,4.9e-05,5.1e-05,5.3e-05,3.9e-05,5.9e-05,5.1e-05,2.6e-05,6e-05,3e-05,9.2e-05,6.1e-05,2.7e-05,8e-06,7.2e-05,2.6e-05,2.1e-05,2.8e-05,9e-05,3.7e-05,5.9e-05,4.1e-05,1e-05,2.7e-05,3.9e-05,8.2e-05,3.4e-05,3e-05,6e-05,4.1e-05,2.9e-05,6.1e-05,3.7e-05,2e-05,6e-05,3.4e-05,1.3e-05,2.6e-05,2.7e-05,5e-06,5e-05,5.1e-05,2e-05,5.6e-05,2.2e-05,3.9e-05,2.1e-05,3.1e-05,5.1e-05,2.7e-05,3.2e-05,1.9e-05,6.9e-05,1.9e-05,3.6e-05,2e-06,4e-05,2.8e-05,6.7e-05,4.3e-05,5.4e-05,3.9e-05,2.2e-05,2.7e-05,3.2e-05,6.2e-05,1e-04,3.9e-05,1.5e-05,3.4e-05,2.7e-05,2.2e-05,1.6e-05
1.2e-05,5e-05,9e-06,7.9e-05,4e-05,7.5e-05,3.8e-05,4.2e-05,3.7e-05,2.9e-05,7.2e-05,3.3e-05,7.1e-05,3.9e-05,3.9e-05,2.3e-05,2e-05,1.2e-05,3.4e-05,3.7e-05,4.1e-05,4.8e-05,4.2e-05,2.7e-05,1.9e-05,2.8e-05,4.9e-05,7.8e-05,6.1e-05,5e-06,1.8e-05,2.1e-05,4.1e-05,3.4e-05,7e-06,5.3e-05,9e-06,5.6e-05,6e-06,2.9e-05,1.5e-05,7e-06,3.1e-05,2.5e-05,6.7e-05,4.4e-05,7.4e-05,1.5e-05,2.9e-05,4.1e-05,4.2e-05,5.6e-05,4.1e-05,3.5e-05,5.9e-05,1.8e-05,5.6e-05,8.3e-05,9.2e-05,4.8e-05,1.2e-05,2e-06,5.7e-05,2.6e-05,1.9e-05,3.7e-05,4.3e-05,5.1e-05,4.9e-05,4.2e-05,2.1e-05,2.7e-05,2.2e-05,6.3e-05,1e-06,7e-06,5.7e-05,2e-05,3.4e-05,9.2e-05,2.8e-05,3e-05,4.7e-05,5.6e-05,6.7e-05,4.2e-05,4.7e-05,1.8e-05,2.6e-05,2.2e-05,3.5e-05,4.5e-05,2.2e-05,2.1e-05,4e-06,3.5e-05,7.8e-05,3.4e-05,2e-05,3.5e-05,4.8e-05,3.3e-05,5.2e-05,3e-05,4.3e-05,2e-05,9.6e-05,2.4e-05,3e-05,4.9e-05,5.2e-05,1.8e-05,2.8e-05,6.3e-05,0.000103,2.4e-05,7e-06,2.7e-05,3.1e-05,2.6e-05,1e-05
5.6e-05,7.5e-05,4e-05,5.1e-05,7.7e-05,7.5e-05,4.6e-05,4.4e-05,6.9e-05,4.1e-05,1.4e-05,1.9e-05,1.9e-05,2.8e-05,4.5e-05,1.1e-05,3e-05,1.3e-05,1.4e-05,2e-05,7.1e-05,8.4e-05,8.3e-05,2e-05,1.9e-05,2.7e-05,6.2e-05,0.000105,7.6e-05,1.1e-05,1.5e-05,2.3e-05,1.5e-05,2.5e-05,4.2e-05,9.9e-05,7.1e-05,5.2e-05,4e-05,2.4e-05,5.2e-05,4.8e-05,2.8e-05,7e-06,4.4e-05,1.7e-05,4.9e-05,4.8e-05,2.8e-05,5.1e-05,1.2e-05,4.7e-05,1.1e-05,3.4e-05,8.9e-05,6.9e-05,8.6e-05,0.000137,0.000129,4.2e-05,3.3e-05,4.7e-05,4.5e-05,5.7e-05,5.6e-05,4.5e-05,3.5e-05,3.4e-05,0.000111,5.8e-05,2.6e-05,2.1e-05,4.9e-05,5.4e-05,3.3e-05,3.3e-05,6.5e-05,4.2e-05,1.3e-05,3.7e-05,5.6e-05,5.2e-05,4.6e-05,3.1e-05,5e-05,7.6e-05,8e-06,1.8e-05,4.7e-05,1.9e-05,3.4e-05,5.6e-05,4.3e-05,1.5e-05,1.8e-05,2.5e-05,2.7e-05,3.5e-05,1.7e-05,3.9e-05,4.9e-05,4.4e-05,3.5e-05,5e-05,9e-06,2.6e-05,6.8e-05,1.4e-05,2.3e-05,5.8e-05,2.6e-05,2.1e-05,3.4e-05,6.3e-05,0.000108,4.3e-05,1.7e-05,1.8e-05,5.4e-05,7.1e-05,4.9e-05
5e-05,2.5e-05,2.1e-05,2.8e-05,8.5e-05,6.1e-05,7e-06,4.4e-05,7e-05,6.1e-05,8.3e-05,3.3e-05,7e-06,5.4e-05,4e-05,2.5e-05,5.9e-05,4.5e-05,4.7e-05,7.3e-05,0.000105,2.6e-05,9.5e-05,7.4e-05,5.2e-05,7.6e-05,3.9e-05,8e-05,2.9e-05,2.4e-05,4.2e-05,5.5e-05,4e-05,4e-05,3.9e-05,5.2e-05,2e-05,4.3e-05,5.2e-05,6.7e-05,5.4e-05,2.3e-05,4e-05,2.5e-05,6e-05,3e-06,6.5e-05,3.4e-05,4.1e-05,5.8e-05,2.9e-05,2.5e-05,2e-05,1.5e-05,8.9e-05,3.1e-05,4.2e-05,9.6e-05,0.00011,5.8e-05,1.6e-05,8e-05,0.00013,9.3e-05,3e-05,3e-05,4.6e-05,2.4e-05,0.000102,3e-05,5.2e-05,1.4e-05,5.6e-05,5.2e-05,5.9e-05,9e-06,6.3e-05,3.7e-05,4.2e-05,8.2e-05,8.2e-05,3.3e-05,3.3e-05,5e-05,1.3e-05,3.7e-05,6e-05,2.3e-05,4.2e-05,1.4e-05,4e-06,5.4e-05,2.2e-05,2e-05,3.5e-05,2.9e-05,9e-06,1.8e-05,4.5e-05,6e-06,3.5e-05,2.9e-05,4.5e-05,1.3e-05,2e-05,1.7e-05,8.2e-05,1.3e-05,3.1e-05,8.4e-05,6.1e-05,2.3e-05,6e-05,4.7e-05,8.6e-05,2.8e-05,1.6e-05,3e-05,7.9e-05,1.9e-05,1.4e-05
7.2e-05,2.5e-05,2.3e-05,4.7e-05,6.6e-05,8.7e-05,5.2e-05,3e-05,5.2e-05,5.5e-05,6.3e-05,9e-05,6e-05,3.3e-05,3.5e-05,2.6e-05,3.6e-05,6e-05,0.000103,0.000127,1e-05,0.000118,4.4e-05,2.5e-05,5.2e-05,3.3e-05,6.1e-05,5.5e-05,5.1e-05,4.9e-05,7.6e-05,7.9e-05,7.3e-05,4.4e-05,5.7e-05,6.5e-05,1.9e-05,2e-05,2.6e-05,0.000104,0.000118,3.4e-05,9.8e-05,5.3e-05,6.1e-05,3.7e-05,1.9e-05,3.5e-05,4.6e-05,8.4e-05,5.8e-05,5.6e-05,4.9e-05,6.6e-05,2.4e-05,8.3e-05,7.8e-05,6.1e-05,0.000118,3.6e-05,8.7e-05,8.6e-05,5.3e-05,9e-05,4.8e-05,3e-05,6.8e-05,7.6e-05,6e-06,7e-05,5e-05,6.1e-05,2.8e-05,0.000124,3.9e-05,5.3e-05,5.4e-05,1e-05,2.2e-05,6.1e-05,6.6e-05,7.2e-05,9.1e-05,2.9e-05,3.3e-05,2.2e-05,3.7e-05,3.3e-05,4.5e-05,3e-06,2.2e-05,6e-05,4.8e-05,1.1e-05,1.2e-05,3.1e-05,2.5e-05,5e-06,4.3e-05,4.6e-05,4.1e-05,3.7e-05,3e-05,2.9e-05,1.4e-05,6e-06,6e-05,3.8e-05,3.8e-05,8.8e-05,2.8e-05,2.2e-05,1.9e-05,7e-05,7.1e-05,4.2e-05,2.2e-05,3.1e-05,3.1e-05,4.8e-05,1.3e-05
5.7e-05,8e-05,5.6e-05,4e-05,3.5e-05,0.000109,0.000106,5.8e-05,2.1e-05,1.7e-05,5.1e-05,9.2e-05,6.4e-05,7e-05,9.2e-05,3.2e-05,5.1e-05,0.000114,2.5e-05,8.6e-05,0.000103,8.4e-05,4.8e-05,9.1e-05,9.6e-05,7.4e-05,0.000125,0.000151,0.000122,0.000115,8.4e-05,7.5e-05,0.000119,7.9e-05,2.2e-05,3.4e-05,1.5e-05,7.5e-05,2.4e-05,7.9e-05,1.9e-05,7.9e-05,0.000119,7.6e-05,6.9e-05,8.5e-05,0.000122,7.3e-05,3.3e-05,2.7e-05,1.3e-05,3.5e-05,8.3e-05,7.1e-05,5.3e-05,2.5e-05,7.3e-05,4.4e-05,9.2e-05,0.000107,8.6e-05,2.1e-05,7.2e-05,8.5e-05,2.5e-05,2.8e-05,4.1e-05,2.7e-05,8e-05,2.6e-05,8.2e-05,8.7e-05,8.5e-05,9.9e-05,3.2e-05,6e-05,0.000158,9.6e-05,5e-06,1.6e-05,3.4e-05,3.2e-05,9.1e-05,7e-05,4.3e-05,1.1e-05,5.2e-05,2.2e-05,7.3e-05,3.8e-05,4e-05,1.4e-05,2.1e-05,2.9e-05,2.8e-05,1.8e-05,1.1e-05,4.3e-05,4.1e-05,5.9e-05,0.000101,2.2e-05,2e-05,4.2e-05,3.4e-05,1.4e-05,2e-05,5.2e-05,9.5e-05,9e-06,0.000105,3.7e-05,3.4e-05,5.9e-05,6.3e-05,1.4e-05,6.2e-05,4.2e-05,6e-05,6.8e-05,1.6e-05
3.4e-05,5.8e-05,5.5e-05,1e-04,6.9e-05,0.000136,1.4e-05,2.6e-05,7.7e-05,6.5e-05,3e-06,5.3e-05,5.8e-05,6.8e-05,5.8e-05,0.000129,0.000133,4e-05,6.2e-05,3.3e-05,1.3e-05,6e-05,3e-06,8.1e-05,3e-05,4.8e-05,4.5e-05,6.8e-05,4.6e-05,0.000138,0.000106,4.6e-05,9.4e-05,4.6e-05,1.6e-05,1.5e-05,4.5e-05,0.000124,0.000105,2.8e-05,3e-05,6e-05,4e-06,2.9e-05,4.1e-05,8.4e-05,8.2e-05,3.6e-05,4.2e-05,4.9e-05,5.6e-05,4.5e-05,4.7e-05,1.7e-05,4.3e-05,2.8e-05,6.7e-05,7e-05,5.3e-05,5.2e-05,7e-05,3.3e-05,6.2e-05,5.4e-05,0.000115,7.5e-05,1.6e-05,7.5e-05,7e-05,4.5e-05,4.9e-05,2.9e-05,3.9e-05,3.5e-05,5e-05,0.000103,0.000139,7.4e-05,4e-05,4.7e-05,3.1e-05,6.4e-05,0.000118,4.2e-05,4.1e-05,4.3e-05,7.4e-05,6.7e-05,8e-05,4.6e-05,3.9e-05,9.5e-05,5.4e-05,3.8e-05,3e-05,1.7e-05,3.5e-05,5.8e-05,4.6e-05,2.1e-05,5.8e-05,7.5e-05,2e-05,2.8e-05,3.5e-05,6e-05,2.3e-05,0.000111,5.7e-05,4.4e-05,0.000125,9.5e-05,9e-06,6.9e-05,5.4e-05,2.1e-05,6.1e-05,7.8e-05,1.7e-05,5.8e-05,7.8e-05
1.9e-05,1.2e-05,3.2e-05,7.9e-05,8.1e-05,2.8e-05,6.3e-05,1.6e-05,7.6e-05,8.1e-05,6.5e-05,3e-05,3.8e-05,3.4e-05,2e-05,7.8e-05,4.2e-05,2.4e-05,3.6e-05,4e-05,3e-05,4.2e-05,2.7e-05,4.9e-05,1.1e-05,4.1e-05,2.1e-05,6.6e-05,2.5e-05,6.4e-05,5.4e-05,3.2e-05,3.6e-05,7e-06,1.7e-05,3e-05,2.7e-05,6.9e-05,3e-05,2.5e-05,2.3e-05,6.6e-05,4.9e-05,4.8e-05,2.4e-05,2.2e-05,0.000112,3.7e-05,1.4e-05,3.6e-05,1.6e-05,2.8e-05,4.9e-05,4.6e-05,3.7e-05,3.1e-05,2.2e-05,4e-05,1.5e-05,7.5e-05,2e-06,4e-05,3.5e-05,2.3e-05,7.9e-05,3.6e-05,1.1e-05,6.2e-05,4.2e-05,3.3e-05,3.6e-05,1.6e-05,3e-05,4.4e-05,1e-05,6.9e-05,1.8e-05,1.4e-05,1.6e-05,2e-05,2e-05,5.7e-05,2.4e-05,6.2e-05,7.4e-05,7.2e-05,5.5e-05,1.4e-05,3.4e-05,3.2e-05,3.2e-05,8.8e-05,3.5e-05,1.3e-05,3e-05,2.6e-05,4.2e-05,3.2e-05,1.8e-05,3.5e-05,6.9e-05,5.4e-05,3.2e-05,2.6e-05,3.5e-05,2.1e-05,7e-05,6.5e-05,6.8e-05,2.5e-05,4.8e-05,2.8e-05,4.3e-05,6.8e-05,9.9e-05,3.2e-05,3.3e-05,3e-06,2.8e-05,5.3e-05,3.8e-05
2.2e-05,2.9e-05,7e-06,7.6e-05,4.1e-05,1.4e-05,7e-06,1.4e-05,7.5e-05,2.5e-05,2.8e-05,1.3e-05,2.6e-05,2e-05,9e-06,3.7e-05,6.5e-05,2.2e-05,1.7e-05,2.8e-05,8e-06,4.4e-05,1.5e-05,3.7e-05,1.5e-05,2.5e-05,4e-05,6.7e-05,2.1e-05,6.7e-05,3.1e-05,2e-05,2.3e-05,2.1e-05,2.5e-05,2.6e-05,3.1e-05,1.9e-05,2.1e-05,2e-06,1.7e-05,6.2e-05,5e-06,3.8e-05,3e-06,1.2e-05,9.5e-05,1.2e-05,1.1e-05,4.2e-05,3.2e-05,1.7e-05,6.3e-05,3.7e-05,1.7e-05,2.3e-05,4.7e-05,4.9e-05,4.2e-05,4.7e-05,3.8e-05,4.4e-05,4.8e-05,2.3e-05,3e-05,1.6e-05,1.2e-05,2.8e-05,5.6e-05,3.1e-05,3.2e-05,1.6e-05,2.3e-05,3.1e-05,1.4e-05,4.5e-05,9e-06,3.6e-05,1.6e-05,3.7e-05,1.1e-05,3e-05,1.9e-05,3.6e-05,1.2e-05,3.9e-05,2.4e-05,3.3e-05,6.2e-05,1.7e-05,3.7e-05,4.8e-05,2.2e-05,8e-06,2.3e-05,1.4e-05,3.4e-05,1.5e-05,8e-06,1.9e-05,4.2e-05,8e-06,1e-05,9e-06,2.9e-05,1.7e-05,5.1e-05,2.8e-05,2.6e-05,1.5e-05,8e-06,9e-06,5e-06,2.4e-05,6.3e-05,2e-05,2.5e-05,2.7e-05,3.6e-05,2.9e-05,3e-06
3e-05,1.6e-05,8e-06,7.8e-05,5.7e-05,2.5e-05,2.5e-05,1.6e-05,5.6e-05,9e-06,1.6e-05,2.5e-05,3.3e-05,3.5e-05,2e-05,4e-05,3.7e-05,2.2e-05,2.1e-05,1.7e-05,1.7e-05,5.3e-05,1.6e-05,5.5e-05,1e-05,2.4e-05,3.9e-05,4.4e-05,3.9e-05,6.6e-05,3.2e-05,1.6e-05,1.6e-05,1.2e-05,3.3e-05,4.8e-05,2.1e-05,3e-05,1.3e-05,1e-06,2.1e-05,3.9e-05,1.8e-05,3.6e-05,1.6e-05,8e-06,9.8e-05,4.2e-05,2e-05,4.7e-05,9e-06,1.8e-05,3.2e-05,2e-05,3.4e-05,2e-05,3.7e-05,4.1e-05,5.8e-05,4.5e-05,1.1e-05,1.7e-05,4e-05,2.4e-05,2.9e-05,1.8e-05,1.1e-05,4.1e-05,4.5e-05,3.2e-05,2.9e-05,8e-06,9e-06,3e-05,1e-05,1.6e-05,2.8e-05,2.3e-05,2.6e-05,3.3e-05,1.2e-05,1.4e-05,3.6e-05,1.6e-05,2.8e-05,2.3e-05,1.4e-05,3.3e-05,2.7e-05,2.3e-05,5e-06,4.1e-05,2.4e-05,6e-06,1.5e-05,1e-06,3.3e-05,1.1e-05,1.2e-05,3.1e-05,3e-05,4e-06,8e-06,1e-05,1.4e-05,1.8e-05,6.3e-05,2.4e-05,3.2e-05,2.5e-05,1.2e-05,1.3e-05,2e-05,4.1e-05,6.9e-05,1.8e-05,1.9e-05,4e-06,4.4e-05,3.1e-05,6e-06
5e-05,3.5e-05,1.4e-05,6e-05,2.3e-05,2.1e-05,3.1e-05,6e-06,4.2e-05,3.8e-05,3.5e-05,3.5e-05,2.7e-05,2.6e-05,1.6e-05,1.5e-05,3.4e-05,1.8e-05,1.6e-05,5e-06,1.4e-05,5.9e-05,1.6e-05,4.3e-05,1e-05,1.8e-05,2.9e-05,5.4e-05,3.2e-05,2.1e-05,5e-05,1.7e-05,1e-05,1.7e-05,1.3e-05,3.2e-05,4.1e-05,1.5e-05,1.4e-05,2.1e-05,1e-05,3.9e-05,3.3e-05,2.5e-05,1.5e-05,1.8e-05,9.3e-05,3.6e-05,1.2e-05,1.9e-05,1.2e-05,7e-06,2.9e-05,3.4e-05,1.7e-05,1.8e-05,3e-05,5.3e-05,5.6e-05,3.6e-05,4e-05,9e-06,3e-05,2.2e-05,3e-06,1.7e-05,1.6e-05,4.1e-05,3.9e-05,2.7e-05,1.8e-05,1.3e-05,1e-05,2.5e-05,3e-06,2e-05,4.4e-05,4e-05,4.5e-05,4.4e-05,2.3e-05,2.3e-05,4.6e-05,3.5e-05,7.1e-05,5.3e-05,1.5e-05,1.9e-05,3.9e-05,1.1e-05,3e-06,4.8e-05,1.7e-05,1e-05,1.5e-05,1.8e-05,3.5e-05,1.4e-05,1.4e-05,1e-05,2.7e-05,1.2e-05,1.4e-05,1.2e-05,1.8e-05,1.9e-05,5.7e-05,4e-06,2.2e-05,3.8e-05,1.3e-05,1.3e-05,2.2e-05,4.4e-05,8e-05,4e-05,1.1e-05,1.3e-05,2.2e-05,3e-05,2e-06
1.8e-05,1e-05,7e-06,5.1e-05,4.6e-05,3.6e-05,2.1e-05,1.2e-05,4.4e-05,2.3e-05,2.8e-05,2.9e-05,3.3e-05,2.8e-05,9e-06,1.6e-05,4.3e-05,2.1e-05,4e-06,1e-06,1.3e-05,4.4e-05,1e-06,4.7e-05,1.3e-05,2.7e-05,2.4e-05,4e-05,2.2e-05,1.9e-05,3.3e-05,1.9e-05,1.9e-05,1.4e-05,1e-05,3.8e-05,2.6e-05,9e-06,1.7e-05,6e-06,2e-05,2.3e-05,3.5e-05,1.7e-05,2.1e-05,9e-06,9.2e-05,4e-05,1.1e-05,5e-06,4e-06,7e-06,3.3e-05,2.9e-05,2.7e-05,3.7e-05,1e-05,3.5e-05,4.2e-05,2.7e-05,2.6e-05,3.2e-05,5.1e-05,1.7e-05,1e-05,2.3e-05,2.1e-05,2.5e-05,4e-05,1.7e-05,9e-06,7e-06,6e-06,3.4e-05,2.2e-05,3e-05,2.8e-05,4.5e-05,2e-05,3.6e-05,1.7e-05,7e-06,5e-05,4.4e-05,4.2e-05,2.4e-05,4.5e-05,3.2e-05,4.7e-05,5e-06,1e-05,3.3e-05,1.4e-05,5e-06,1.5e-05,1.4e-05,1.5e-05,1.1e-05,3.1e-05,2e-05,1.5e-05,9e-06,2.5e-05,2.6e-05,1.1e-05,2e-05,7.5e-05,2.3e-05,2.2e-05,1.5e-05,1.9e-05,1.4e-05,2.6e-05,5.4e-05,7.2e-05,3.1e-05,1.3e-05,1.9e-05,3.6e-05,1.3e-05,8e-06
1.3e-05,2.2e-05,1.9e-05,4.3e-05,3.8e-05,3.4e-05,2.6e-05,1.5e-05,6.2e-05,2.3e-05,1.5e-05,3.5e-05,2.5e-05,2.8e-05,1.8e-05,2.3e-05,3.8e-05,2.3e-05,7e-06,5e-06,1.2e-05,3.8e-05,1.8e-05,4.9e-05,9e-06,2.8e-05,2.2e-05,4.9e-05,2.9e-05,3.4e-05,3.8e-05,2.3e-05,8e-06,1.2e-05,5e-06,2.7e-05,2.2e-05,1.2e-05,8e-06,0,2.6e-05,2.6e-05,2.3e-05,2e-05,2.8e-05,1.6e-05,8.6e-05,4e-05,2e-06,1.5e-05,3e-06,7e-06,3.6e-05,1.1e-05,2e-05,3.1e-05,2.1e-05,3.8e-05,5.4e-05,2.4e-05,1.4e-05,1.5e-05,3.6e-05,1e-05,1.3e-05,1.3e-05,1.3e-05,3.6e-05,3e-05,2.9e-05,1.5e-05,3e-06,7e-06,3.5e-05,1.3e-05,1.1e-05,3.8e-05,2.3e-05,1.2e-05,5.2e-05,6e-06,1.4e-05,4.5e-05,2.1e-05,2.2e-05,1.9e-05,2.3e-05,2.5e-05,3.8e-05,3e-06,5e-06,3.8e-05,1.4e-05,1e-05,2.4e-05,2e-06,1.8e-05,5e-06,2e-05,5e-06,1.6e-05,4e-06,2.2e-05,7e-06,1.5e-05,9e-06,6.5e-05,1.8e-05,2e-05,7e-06,7e-06,1e-06,2.5e-05,4.3e-05,6.3e-05,3e-05,1.2e-05,1.5e-05,3.2e-05,1.7e-05,7e-06
4e-06,1.2e-05,9e-06,4.6e-05,2.7e-05,1.7e-05,2e-05,6e-06,6.3e-05,1.3e-05,2.5e-05,3.2e-05,2e-05,2e-05,1.4e-05,2.1e-05,3.7e-05,2e-05,2e-06,6e-06,7e-06,4.1e-05,9e-06,4.3e-05,3e-06,2.2e-05,1.9e-05,4.7e-05,2.9e-05,2.4e-05,3.2e-05,1.6e-05,5e-06,1.8e-05,1.3e-05,2.5e-05,2.7e-05,2.1e-05,5e-06,8e-06,2.7e-05,2.8e-05,2.4e-05,2.6e-05,2.4e-05,1.4e-05,8.3e-05,4.1e-05,7e-06,1.3e-05,7e-06,5e-06,3.2e-05,1.9e-05,2.5e-05,2.3e-05,3.1e-05,3.6e-05,4.8e-05,2.7e-05,1.9e-05,1.8e-05,4e-05,5e-06,5e-06,1.3e-05,1.8e-05,3.9e-05,4.2e-05,2.2e-05,1.1e-05,8e-06,9e-06,3.4e-05,5e-06,1.2e-05,3.4e-05,3.1e-05,8e-06,3.2e-05,1.1e-05,2e-05,4.2e-05,2.5e-05,2.6e-05,1.5e-05,1.8e-05,1.1e-05,3.7e-05,5e-06,7e-06,3.8e-05,9e-06,3e-06,2.5e-05,3e-06,1.7e-05,5e-06,1.9e-05,1.2e-05,1.5e-05,6e-06,1.3e-05,9e-06,1.5e-05,1.2e-05,6.1e-05,1.2e-05,1.5e-05,1.2e-05,5e-06,3e-06,2e-05,3.7e-05,6.5e-05,1.9e-05,6e-06,1.6e-05,2.8e-05,2e-05,3e-06
7e-06,1e-05,7e-06,4.3e-05,3.7e-05,3.1e-05,2.1e-05,8e-06,5.6e-05,2.6e-05,2.4e-05,3.5e-05,1.8e-05,2e-05,1.6e-05,2.2e-05,3.6e-05,2e-05,3e-06,2e-06,1e-06,4.8e-05,1.2e-05,3.8e-05,5e-06,2.4e-05,2.4e-05,5.6e-05,2.6e-05,3.1e-05,2.9e-05,1.8e-05,9e-06,1.5e-05,8e-06,2.6e-05,1.8e-05,1.8e-05,1e-05,3e-06,2.1e-05,2.7e-05,2.6e-05,2.5e-05,2.4e-05,1.1e-05,7.5e-05,4.2e-05,3e-06,1.5e-05,7e-06,2e-06,3.2e-05,2.1e-05,2.5e-05,2.6e-05,2.6e-05,3.4e-05,5.2e-05,2.5e-05,2e-05,1.6e-05,3.6e-05,4e-06,7e-06,1.2e-05,7e-06,3.1e-05,4.2e-05,2.6e-05,7e-06,4e-06,1.1e-05,3.2e-05,6e-06,8e-06,2.7e-05,3.1e-05,1.6e-05,4.1e-05,7e-06,1.4e-05,3.6e-05,2e-05,2.3e-05,1.3e-05,2.1e-05,1.4e-05,4.2e-05,4e-06,1e-06,3.6e-05,1.2e-05,5e-06,1.6e-05,5e-06,1.5e-05,1e-06,1.8e-05,8e-06,1.2e-05,2e-06,1.2e-05,8e-06,1.4e-05,1e-05,5.8e-05,1.7e-05,1.9e-05,1.3e-05,4e-06,2e-06,2.2e-05,3.8e-05,6.7e-05,2.3e-05,8e-06,1.6e-05,3e-05,1.7e-05,5e-06
