4e-06,1.2e-05,-2e-06,-1e-06,-0.000134,-0.000246,-0.000152,-0.000138,-5.5e-05,5.7e-05,9.5e-05,0.000109,0.000119,0.000101,-1.6e-05,-3.3e-05,-7e-05,-0.000126,-9.6e-05,-6e-05,-1.9e-05,0,-3e-06,-2e-05,-4.3e-05,-2.1e-05,-1.1e-05,-2.1e-05
-1.7e-05,-5.1e-05,-8.4e-05,-7.6e-05,-0.000158,-0.000222,-6.3e-05,-3.3e-05,-0.000101,-0.000143,-0.000115,-0.000154,-0.00019,-0.000198,-0.000177,-9.6e-05,-9e-05,-0.000153,-0.000108,-7.1e-05,-3.6e-05,-4.7e-05,-4.1e-05,-4.4e-05,-6.1e-05,-3.1e-05,-3.2e-05,-6.2e-05
-1.6e-05,-3.8e-05,-7.3e-05,-6.7e-05,-3.1e-05,-4e-06,-0.000101,-7.2e-05,-5.8e-05,1.4e-05,3e-05,3.2e-05,6.3e-05,2e-05,-1.9e-05,-3e-06,0,-2e-05,8e-06,1e-05,-5e-06,-3.4e-05,-2.8e-05,-1.1e-05,-4e-06,-9e-06,-4.2e-05,-6.3e-05
3.1e-05,2.7e-05,1.9e-05,5.4e-05,0.000144,0.000202,1.6e-05,4.9e-05,3.1e-05,-2.7e-05,-7e-05,-0.000107,-9e-05,3.6e-05,0.000108,7.3e-05,9.7e-05,0.000114,8e-05,6.9e-05,3.7e-05,9e-06,1.1e-05,4.4e-05,6.4e-05,2.4e-05,-4e-06,0
3.7e-05,2e-05,6e-06,4.1e-05,0.000112,9.2e-05,0.000136,0.000171,0.000114,8.5e-05,0.000101,0.000148,0.000181,5.2e-05,0,2.7e-05,7.1e-05,8.7e-05,2.2e-05,4.1e-05,4.3e-05,2.5e-05,2.5e-05,5.4e-05,5.2e-05,2.2e-05,2.8e-05,5.4e-05
2e-06,-6e-06,2.6e-05,5.2e-05,-4.1e-05,-0.000171,-4.8e-05,-5e-05,-1.4e-05,-3.3e-05,-3.1e-05,-5.3e-05,-0.000102,-3.1e-05,-3.7e-05,-5.1e-05,-5.2e-05,-7.7e-05,-7.1e-05,-2.5e-05,2e-06,4e-06,0,6e-06,-3.1e-05,-2.8e-05,5e-06,3e-05
-2.3e-05,-4.7e-05,-2.1e-05,-3.4e-05,-5.4e-05,-0.000136,-0.000109,-0.000138,-7.4e-05,-4e-06,3.1e-05,6.2e-05,4.3e-05,-3.3e-05,-5.7e-05,-4.8e-05,-6.4e-05,-8.3e-05,-2.5e-05,-1.5e-05,-1.3e-05,-1e-05,-1.1e-05,-2.7e-05,-6.6e-05,-3.9e-05,-2e-06,2e-06
-2e-06,-1.4e-05,2e-06,-1.1e-05,7.6e-05,0.000152,0.000111,9.6e-05,3.4e-05,-2.5e-05,-5.6e-05,-6.4e-05,-6.4e-05,-8e-06,4e-05,1.2e-05,1.1e-05,3e-05,6.4e-05,4e-05,1.3e-05,-6e-06,-5e-06,-1e-05,-1e-05,-5e-06,5e-06,-6e-06
5e-06,1.1e-05,2e-05,2.2e-05,7.1e-05,0.000152,3.6e-05,3.3e-05,5.9e-05,0.000102,5.3e-05,3.7e-05,4.3e-05,7.4e-05,9.4e-05,5.1e-05,3.5e-05,5.8e-05,3.9e-05,2.6e-05,2.4e-05,-3e-06,-8e-06,1.5e-05,4.7e-05,6e-06,2e-06,-1.2e-05
1.7e-05,2.5e-05,-2e-06,7e-06,-2.2e-05,-6.5e-05,-7.5e-05,-4.7e-05,4e-06,-5e-05,-0.000118,-0.00011,-8.6e-05,-0.000114,-8.9e-05,-2e-05,-8e-06,5e-06,-5.1e-05,-3.4e-05,6e-06,-8e-06,-1.7e-05,1.9e-05,4.3e-05,0,1e-05,5e-06
2.7e-05,5.7e-05,4.4e-05,3.6e-05,-6e-05,-0.00012,2e-05,5.8e-05,6.9e-05,6.6e-05,7.9e-05,7.6e-05,8.4e-05,8.9e-05,3.9e-05,4e-06,-1.2e-05,-2.6e-05,-5.7e-05,-3.6e-05,-9e-06,-1.4e-05,-2.2e-05,4e-06,3e-06,-1e-06,9e-06,1.4e-05
1.3e-05,3.4e-05,1.2e-05,-4e-05,-6.4e-05,-3.7e-05,-1.6e-05,-5.2e-05,-5.2e-05,-0.000103,-8e-05,-5.8e-05,-7.1e-05,-0.00011,-8.8e-05,-5.1e-05,-4.2e-05,-4.4e-05,1.2e-05,1.5e-05,-8e-06,-1.2e-05,-1.4e-05,-1.1e-05,-3.4e-05,-3e-06,-8e-06,2e-06
1.8e-05,2.3e-05,2e-05,-2.8e-05,2.2e-05,0.000122,3.6e-05,-1e-05,-2.8e-05,2.4e-05,5.4e-05,3.8e-05,2.2e-05,5.1e-05,7e-05,2.8e-05,0,1.8e-05,7.1e-05,4.8e-05,6e-06,2e-06,1e-06,-9e-06,-2.6e-05,6e-06,-6e-06,-5e-06
-6e-06,-1.9e-05,-1.5e-05,-2.2e-05,5.4e-05,9.4e-05,7.8e-05,0.000116,1.6e-05,-3.3e-05,-1.2e-05,1.3e-05,2.8e-05,1.9e-05,7e-06,-5e-06,1e-06,3.2e-05,2.3e-05,1.8e-05,1.6e-05,9e-06,1e-06,2e-06,1.7e-05,7e-06,-7e-06,-1.6e-05
-1.5e-05,-4e-05,-3.3e-05,-8e-06,1e-06,-0.000108,-0.000101,-2.3e-05,-4e-06,8e-06,2e-05,8e-06,-3.3e-05,-8.1e-05,-7.7e-05,-3.8e-05,-3.7e-05,-2.3e-05,-5.1e-05,-3.5e-05,1.4e-05,1.1e-05,-3e-06,9e-06,3e-05,-6e-06,-8e-06,-2e-05
6e-06,-1.8e-05,2.1e-05,7.5e-05,3.4e-05,-8.2e-05,-0.00012,-9.7e-05,1e-06,0,-1.1e-05,-1e-06,4.8e-05,0.000112,4.9e-05,7e-06,-8e-06,-1.4e-05,-2.9e-05,-2.7e-05,1.1e-05,1.3e-05,4e-06,8e-06,9e-06,1e-06,1.3e-05,9e-06
1.1e-05,-3e-06,1.5e-05,4.8e-05,5e-05,6.3e-05,2e-05,-5e-06,1.2e-05,-1.8e-05,-7e-06,1.8e-05,-1.2e-05,-0.000101,-8.2e-05,-3.6e-05,0,1.1e-05,2.7e-05,2.1e-05,2e-06,7e-06,1.6e-05,3e-06,-1.4e-05,1.1e-05,1.5e-05,2.7e-05
3e-06,1.1e-05,1.6e-05,2.2e-05,-1.5e-05,7.9e-05,4.8e-05,-5e-06,4e-06,1.5e-05,1.7e-05,-1e-06,9e-06,0.000102,6.5e-05,1e-05,7e-06,1.9e-05,3.5e-05,3.5e-05,2e-06,9e-06,2e-05,-4e-06,-2.2e-05,5e-06,-3e-06,1.6e-05
-1.5e-05,-2.1e-05,-4.8e-05,-2.8e-05,-7.4e-05,-1.1e-05,4.3e-05,-1e-06,-2.6e-05,-2.7e-05,-3.1e-05,-3.8e-05,-7.9e-05,-0.000142,-7.4e-05,-2.7e-05,-2.9e-05,0,-2.2e-05,-4e-06,2e-06,7e-06,7e-06,-5e-06,-5e-06,-7e-06,-1.3e-05,4e-06
