-0.000767,-0.000433,-0.001347,-0.001077,-0.000958,-0.001241,-0.000474,-0.000985,-0.00117,-0.001185,-0.001356,-0.002056,-0.001724,-0.001562,-0.001315,-0.002043,-0.001591,-0.000896,-0.001687,-0.002541,-0.001868,-0.001061,-0.000469,-0.001697,-0.001607,-0.002779,-0.002566,-0.001718,-0.0014,-0.001327,-0.00206,-0.002531,-0.002774,-0.002576,-0.002589,-0.002074,-0.002152,-0.002144,-0.002029,-0.001119,-0.00177,-0.001562,-0.001577,-0.001894,-0.002577,-0.003439,-0.002531,-0.001731,-0.002366,-0.00403,-0.003743,-0.002041,-0.002096,-0.002928,-0.00276,-0.003055,-0.00248,-0.002731,-0.002871,-0.001823,-0.001883,-0.001941,-0.001473,-0.001216,-0.002032,-0.002324,-0.001635,-0.001569,-0.0019,-0.001384,-0.001515,-0.001705,-0.001946,-0.001498,-0.002067,-0.002048,-0.001508,-0.00128,-0.001515,-0.002694,-0.002781,-0.001766,-0.001241,-0.001307,-0.00087,-0.002045,-0.001958,-0.00248,-0.002865,-0.002909,-0.002214,-0.002256,-0.002008,-0.001278,-0.001904,-0.001622,-0.001902,-0.000806,-0.001971,-0.001667,-0.001461,-0.001405,-0.001229,-0.001072,-0.001649,-0.00266,-0.001852,-0.001242,-0.001317,-0.001017,-0.00199,-0.000822,-0.001116,-0.001637,-0.001392,-0.001614,-0.00132,-0.001592,-0.001535,-0.001422,-0.001034
0.00021,0.00033,0.000521,0.000342,0.000259,0.000466,0.000256,4.5e-05,0.000428,0.000595,0.000797,0.001134,0.000836,0.000602,0.00045,0.000159,0.000177,0.000308,0.000135,0.001167,0.000491,-5.9e-05,-9.5e-05,0.000938,0.000265,0.001927,0.001392,0.000452,2.8e-05,0.000613,0.000414,0.001549,0.001253,0.001123,0.001423,0.001096,0.000842,0.000596,0.000651,-0.000102,0.000314,0.000142,0.000139,0.000348,0.001503,0.001815,0.001295,0.000756,0.002113,0.001923,0.001952,0.000792,0.000978,0.001494,0.001019,0.00071,0.000817,0.001135,0.001385,0.000641,0.000458,0.001028,0.000658,0.000401,0.000773,0.000727,0.000804,0.000528,0.000372,0.000389,0.000358,3.3e-05,0.000387,0.000256,0.000807,0.00019,0.000668,-0.000103,0.000532,0.001181,0.000883,0.000762,0.000203,0.000278,-0.000307,0.000991,0.00095,0.000572,0.001396,0.000835,0.000505,0.001345,0.000908,-0.000172,-6.7e-05,0.000327,0.000992,6.9e-05,0.00029,0.000419,0.000421,0.000523,0.000305,0.000213,0.000926,0.001231,0.000846,5.1e-05,0.000794,0.000386,0.000885,0.000687,0.000395,6.2e-05,4.8e-05,0.000503,3.5e-05,1.3e-05,-0.000514,6.4e-05,-6e-06
-9e-05,-0.000291,-0.000348,-0.000465,-0.000265,-0.00027,-0.000234,0.000229,-0.000203,-0.000318,-0.000208,-0.000424,-0.00057,-0.00043,-0.000363,4.2e-05,0.000111,0.000146,8.1e-05,-0.000616,0.000239,-2.6e-05,0.000174,-0.000361,0.000205,-0.001007,-0.000885,-0.000405,0.00029,-0.000319,0.000101,-7.7e-05,-0.000363,-0.000323,-0.000614,-0.000263,-0.000535,0.000227,-0.000293,0.000162,0.000289,0.000312,-0.000542,-0.000294,-0.000835,-0.00075,-0.000609,-0.000396,-0.001471,-0.001149,-0.001103,-0.000139,-0.000355,-0.000341,-0.00059,0.000442,-6.1e-05,-0.000432,-0.000817,-6e-06,-2e-04,-0.001039,-0.000165,0.000224,-0.000114,0.00018,0.000111,0.000251,0.000151,5.2e-05,0.000303,0.000299,-0.000265,-0.00022,-0.000228,0.000781,0.000247,0.000404,-0.000304,-0.000503,-4e-04,-0.000213,-0.000126,4.2e-05,0.00044,-0.00071,-0.000765,-0.000579,-0.001203,-0.000145,0.000444,-0.000101,-0.000664,-2e-05,0.000647,0.000359,-0.000887,0.000179,0.001025,0.00033,4.4e-05,-6.6e-05,0.000194,0.000169,-0.000426,-0.00021,-0.000485,0.000328,-0.000169,-0.000563,-0.000439,-0.000506,-0.000311,0.000203,0.000664,0.000142,0.000563,0.000348,0.000701,-0.000341,-6.3e-05
0,1.7e-05,8.5e-05,0.000235,2.7e-05,0.000129,-5.7e-05,-0.000194,0.000121,-6.4e-05,-0.000639,0,0.000385,0.000153,-0.00037,-0.000384,-0.000399,-0.000338,-0.000201,9.1e-05,-0.000586,-0.000132,-0.000175,-0.00012,-0.000173,0.000753,0.000688,0.000125,-0.000397,-0.000331,-0.000595,-0.000645,-0.000425,0.000121,6.6e-05,-8.7e-05,-0.000677,-0.001007,-0.000213,-0.000112,4.9e-05,-0.000204,-0.000157,7.8e-05,0.000345,-0.000286,-0.000365,5.4e-05,0.000191,0.000548,-0.000365,-0.000184,0.000107,-0.00026,0.000442,-0.000965,-0.000651,4.9e-05,7.6e-05,-0.000422,2.8e-05,0.000449,0.000227,3.7e-05,-7e-06,-0.000195,-0.000401,-0.000581,-0.000142,9e-05,-0.000548,0.000161,2.4e-05,3.1e-05,0.000125,-0.001334,-4e-04,-0.000434,6.2e-05,1.1e-05,0.000555,0.000296,0.00011,-0.000342,-0.000305,5.7e-05,-0.000238,7.8e-05,0.000536,-0.00043,-0.000393,-0.000674,0.000108,-1.8e-05,-0.000595,-0.000448,0.000401,-0.000304,-0.001176,-0.000251,0.000237,-0.00027,-9.9e-05,-9.2e-05,7.4e-05,-0.000141,-0.000388,-0.000524,-0.000342,0.000289,-1.7e-05,-0.000146,-0.00033,-0.000321,-0.000625,-0.00074,-0.000685,-0.000112,-0.000354,0.000312,0.00016
0.000182,8e-06,6.8e-05,-1e-05,-5e-04,0.000163,0.00018,0.000128,2.2e-05,5.3e-05,0.000284,-0.000285,-0.000286,-0.000161,0.000621,0.000617,0.000577,0.000115,-6.7e-05,0.000258,0.000548,0.000246,0.000201,0.000434,0.000592,-0.000438,-0.000583,-0.000143,7.5e-05,0.000125,0.00059,0.000337,0.000484,-0.000129,-0.000279,-0.000237,0.000468,0.000996,0.000378,0.000341,-7.2e-05,-0.000423,0.000221,0.000114,0.000171,0.000661,0.000956,-0.00016,-9.9e-05,-0.000483,0.000655,0.000633,-0.000143,0.000576,4.3e-05,0.000575,0.000705,0.000296,2e-06,0.000283,2.7e-05,-0.000151,-0.000464,6.2e-05,-0.000309,2.7e-05,0.000222,0.000224,0.000106,-0.00023,0.000107,-0.000319,3.1e-05,0.000287,0.000218,0.000585,0.00049,-9.5e-05,-0.000156,0.000156,-0.000883,-0.000364,-6.6e-05,1.6e-05,0.000275,0.000117,0.000589,0.00025,0.000332,0.000771,0.000553,0.000304,0.000191,-0.000266,-0.000304,0.000293,0.000271,0.000477,0.000679,-0.00035,-0.000561,0.000334,-0.000161,6.9e-05,-0.000179,-4e-05,4e-04,0.000653,0.000363,-0.000175,-0.000122,-0.000286,0.00032,4.5e-05,0.00045,0.000892,0.00061,0.000124,0.000308,0,-0.000263
7.9e-05,0.000182,-3e-06,1.1e-05,0.000134,-0.000245,-0.000165,-0.000202,-1.5e-05,0.000236,-0.00029,0.000483,1.2e-05,0.000604,-0.000105,-0.000397,-0.000171,-3.4e-05,0.000349,0.000114,-0.000153,-0.000252,5e-06,-0.000435,-0.000485,-0.000158,1e-05,0.000147,-3.1e-05,6.8e-05,-0.000183,1.9e-05,-0.000692,0.000167,0.000373,0.000333,6.5e-05,-0.000731,-0.000268,-0.000297,9e-05,0.000136,-0.000233,-0.000365,-0.000303,-0.000786,-0.000976,0.000423,0.000401,0.000735,-0.000914,-0.000787,0.000244,-0.000568,0.000228,-0.000203,-0.000746,-0.000386,0.000458,-0.00029,-0.000355,-0.000106,-1.4e-05,-4.1e-05,0.000177,-6.8e-05,-0.00025,0.000202,-0.000141,8.9e-05,0.000125,0.000168,0.000146,-0.000218,-0.000463,-0.000124,-0.000448,-5e-05,2.6e-05,-0.000223,0.000779,0.000273,1.6e-05,-9.5e-05,-0.000326,-0.00014,-0.000588,-0.000323,0.000131,-0.00055,-0.000873,-0.000229,-5.5e-05,0.00014,0.000234,5.2e-05,-0.000163,-0.000126,-0.000129,0.000566,0.000464,-5e-05,0.000257,-7.4e-05,-0.00026,0.000158,-0.000194,-0.000513,-0.000236,0.00013,0.000203,0.000706,-0.000101,-7.2e-05,-0.000502,-0.000436,-0.000522,-0.000514,-0.000501,0.000141,5.6e-05
-0.000137,-2.7e-05,9.5e-05,-4.6e-05,0.000187,7.1e-05,-0.000355,0.000102,-5.6e-05,-0.000225,0.000255,-0.000424,-5.1e-05,-0.000531,1.4e-05,-8.1e-05,-0.000149,1.9e-05,-0.00012,-0.000394,-3.8e-05,0.000274,-0.000247,8.1e-05,2.6e-05,0.000361,-0.000108,-9.9e-05,0.000366,-4.3e-05,-8.7e-05,-2.4e-05,0.000539,-0.00037,-0.000307,-0.000408,0.000195,0.000574,0.000341,4.1e-05,-0.00024,8.1e-05,0.000387,0.000209,-7.6e-05,0.000865,0.000742,-8.8e-05,-0.000116,-0.000539,0.000934,0.000825,0.000257,0.000305,-0.000809,1e-05,0.000822,0.000121,-0.000245,0.000151,0.000273,0.000454,2.8e-05,-0.000165,-0.000285,-1.1e-05,-0.000254,-0.000202,0.000206,2.6e-05,-5.3e-05,-4.6e-05,6.7e-05,9.3e-05,7.4e-05,9e-06,0.000187,0.000115,0.000239,0.000305,-0.000314,-0.000252,-1.9e-05,-3.9e-05,-2e-06,0.000199,0.000377,0.000386,-0.000485,0.000149,0.000464,0.000194,0.000115,0.000173,0.000146,-0.000279,0.000234,-5e-06,-0.000182,-0.000412,-0.000453,1.5e-05,-0.000156,-6.8e-05,-6e-06,-0.000116,0.000295,0.00037,0.000217,-0.000119,-0.000223,-0.000666,-0.00021,-1.6e-05,0.000316,0.000135,0.000192,0.000356,0.000336,-0.000413,0.000116
-0.000102,-0.000143,-0.000271,-0.000234,-5e-05,-0.000184,0.000369,-1.5e-05,6.8e-05,0.000221,-0.000151,0.000207,0.000105,0.000162,-9.3e-05,0.000127,0.000146,-7.7e-05,-2.1e-05,0.000202,-3e-04,-0.000297,3.4e-05,7.9e-05,9.7e-05,-0.000161,-0.000139,-1.1e-05,-0.000475,-0.00014,-0.00024,-6.2e-05,-0.000102,0.000186,0.000253,8.7e-05,-0.000326,-0.000646,-0.000337,2.8e-05,0.000392,0.00019,-0.000103,0.000387,7.1e-05,-0.000491,-0.000338,-0.000137,0.000132,-7.2e-05,-0.000494,-0.000512,-0.000286,-6.9e-05,0.000696,0.000167,-0.000276,6.3e-05,0.000231,-3e-06,-0.000166,-0.000391,0.00025,-0.000166,-1.6e-05,-0.000176,0.000399,3.9e-05,-8.7e-05,-1e-04,-0.000119,-5.3e-05,-0.00029,-0.000165,0.000355,0.000142,-0.000168,-7e-06,2.9e-05,-3.4e-05,4.2e-05,0.000138,8e-06,6.1e-05,0.000122,-0.000102,-0.000252,-0.000195,9.9e-05,-0.000187,-0.000194,0.000153,-8.3e-05,-5.5e-05,0.000115,0.000305,-0.000127,-0.000196,-5.8e-05,0.000161,9.3e-05,-0.000212,2e-04,0.000208,0.000122,-0.000347,-0.000219,-0.000282,-0.000141,4.8e-05,2.9e-05,0.000399,0.000107,0.000242,-0.000109,6.6e-05,-5.9e-05,-0.00017,-0.000122,0.000441,0.000151
2.5e-05,0.000214,0.000203,0.000163,-6.3e-05,1.4e-05,-0.000296,-0.000112,-9e-05,-0.000109,7.3e-05,7.2e-05,-0.000216,-3.2e-05,9e-06,-1.5e-05,-0.000115,3.9e-05,2.3e-05,-0.000118,0.00039,0.000191,2.9e-05,-0.000171,-9.2e-05,-0.000313,0.00013,-9.9e-05,0.00029,8.5e-05,4.3e-05,-2.5e-05,4.6e-05,0.000121,-0.000159,2.7e-05,0.00026,4.7e-05,-4.9e-05,0.000112,-0.000246,-0.000373,-7.4e-05,-0.000414,2.8e-05,0.000201,-2.6e-05,-8.2e-05,-7.1e-05,0.000168,0.000326,0.00037,-4.2e-05,-5e-05,-0.000506,-0.000231,6.7e-05,-0.000178,-0.000334,8e-06,3.5e-05,0.000255,-0.000222,0.000244,5.7e-05,0.000362,-0.000284,0.000101,1.3e-05,3.3e-05,-0.000115,7e-05,0.000229,0.00023,-0.000291,-0.000131,-0.000198,-7e-05,-0.000125,-0.000129,6.8e-05,-0.000157,-0.000103,6.2e-05,-5e-06,7.6e-05,0.000262,-0.000197,9.1e-05,0.000175,-7.6e-05,-0.000334,-0.000133,-4e-05,-0.000211,-0.000182,1e-06,0.000118,0.000121,0.000297,9.6e-05,0.000273,4.2e-05,-0.000398,-8.6e-05,0.000477,9e-05,0.000261,-7.8e-05,5.3e-05,0.000115,-4.2e-05,-7.2e-05,-0.000223,-2.5e-05,-0.00014,-0.000101,4.7e-05,0.000114,-8.3e-05,-0.00012
6.2e-05,-3.8e-05,-0.000144,5.7e-05,-0.000104,-2.3e-05,0.00015,0.000179,0.000251,1.6e-05,-0.000154,-5.1e-05,0.000215,-0.000115,3.3e-05,0.000196,-4.1e-05,2.6e-05,-3.3e-05,0.000141,-0.000195,2.4e-05,0.000175,0.000105,-8.9e-05,0.000183,6e-05,0.000221,-0.000143,2e-05,-4.1e-05,-3e-05,-0.000131,-0.000262,2e-06,7e-05,-7.1e-05,2.2e-05,0.000227,-0.000142,-0.000193,0.000395,6.4e-05,0.000148,0.000101,-0.000166,0.00011,8.3e-05,6.5e-05,0.000129,-0.000357,-8.8e-05,2.8e-05,0.000161,0.00013,0.000381,-2e-05,0.000203,3.5e-05,3.5e-05,0.000122,-0.000123,0.000303,8e-06,-0.000106,-0.000321,4.9e-05,-0.000173,4.9e-05,-1e-06,0.000257,7.5e-05,-0.000107,-3.3e-05,0.000105,7e-06,0.000264,0.000198,3e-06,-9.1e-05,-0.000205,0.000134,7e-06,-1.4e-05,-0.000158,-4.2e-05,-0.000109,0.000109,-0.000128,0.000224,0.000348,0.000194,2.2e-05,-0.000122,-3.6e-05,-9e-05,9.4e-05,6.4e-05,5.8e-05,-0.000257,8e-06,-7.8e-05,-0.000196,0.000245,0.000111,-0.000392,0.000121,1.1e-05,4.4e-05,-5.4e-05,-0.000118,-2.9e-05,-6e-06,0.00019,5.4e-05,-4.6e-05,0.00014,-4.5e-05,-6.6e-05,-0.000139,-2e-06
-9.5e-05,8.2e-05,4.8e-05,-4e-05,0.000131,6.7e-05,-0.000327,-0.000205,-0.000188,8.6e-05,0.000155,0.000251,-4.3e-05,7.7e-05,5.7e-05,-7.4e-05,9.2e-05,-0.000368,-1.2e-05,-6.7e-05,9e-06,-9e-06,-0.000174,-5.9e-05,5.3e-05,-1.5e-05,-5.5e-05,-0.000115,0.000179,-0.000171,3.1e-05,0.000151,0.000139,0.000175,8.4e-05,-0.000111,-3.4e-05,0.00011,-8.2e-05,-2.9e-05,0.000216,-8.8e-05,-3e-05,-0.00021,-0.000171,1.8e-05,-0.000104,9.1e-05,-0.000144,-7.8e-05,0.000291,-1.4e-05,-5.5e-05,-3.4e-05,-9.8e-05,-0.000263,-1e-05,-0.000179,9.5e-05,-0.000154,-0.000213,2.3e-05,-0.000178,-4.1e-05,2.8e-05,5.5e-05,-0.000157,-6.8e-05,4.1e-05,3.4e-05,-0.000169,-9.7e-05,-3.7e-05,-4.7e-05,-0.000181,-4.1e-05,-8.1e-05,-1e-04,-9e-06,5.7e-05,0.00019,-2.7e-05,0.000128,-8.2e-05,4e-06,-5.7e-05,7.1e-05,-0.00011,4e-05,-0.00031,-0.000315,-0.000184,1e-06,0.000195,-4.9e-05,-2.9e-05,-0.000261,9.2e-05,-0.000164,0.00017,-0.000108,-3.8e-05,0.000145,6.3e-05,-0.000139,0.000231,-8.3e-05,-7e-05,-7.1e-05,7.9e-05,0.000104,0.000136,0.000124,-0.000133,-8.4e-05,-6.8e-05,-3.6e-05,6.9e-05,5.3e-05,0.000108,-0.000139
1.9e-05,-7e-06,-1.7e-05,5e-05,-6.3e-05,3.1e-05,0.000205,5.6e-05,8.3e-05,-3.9e-05,-8.3e-05,-0.000162,-0.000124,-0.000186,-9.5e-05,-6e-05,-8.7e-05,0.000485,6.5e-05,3e-06,3.3e-05,-9.7e-05,2.9e-05,1.6e-05,5e-05,0,-2.5e-05,0.000156,-0.000105,0.000203,0.00019,-0.000136,-5.2e-05,-0.000251,-6.4e-05,7.9e-05,-4.8e-05,-2.6e-05,2.7e-05,3.6e-05,-1.9e-05,-6.4e-05,-4.1e-05,0.000105,1e-04,1e-05,0.000103,-0.000239,0.000275,8.6e-05,-0.000125,5e-05,-1.1e-05,-5.4e-05,0.000267,0.000174,2.9e-05,0.000384,-4.9e-05,-0.000134,8.9e-05,-2.2e-05,-3.1e-05,0.000114,4.8e-05,9.3e-05,0.000207,0.000113,-1.5e-05,-2.6e-05,-1.5e-05,9e-05,7.6e-05,-2.3e-05,0.00016,6.8e-05,5.4e-05,-9e-06,-5.8e-05,9.4e-05,-0.000102,1.6e-05,-8.4e-05,0.000141,6.5e-05,-1.8e-05,-3.6e-05,8.4e-05,0.000106,0.000174,0.000147,0.000119,4.5e-05,7.2e-05,0.000111,0.000188,0.000203,-4.9e-05,8.4e-05,-8.3e-05,0.00017,-0.000129,-2.7e-05,-0.000182,2.8e-05,9.4e-05,-6e-05,1.7e-05,6.4e-05,-0.000128,-4.9e-05,-0.000146,-0.000166,5.1e-05,0.000133,0.000174,8.2e-05,-3.7e-05,2.3e-05,-0.000185,0.000204
-3.1e-05,-7.4e-05,-1.4e-05,-6e-05,4e-05,-1e-06,-0.000128,2.7e-05,-5.3e-05,-5.4e-05,2.3e-05,0.000105,-2.7e-05,8.2e-05,2e-05,3.4e-05,7.3e-05,-0.000267,-5.7e-05,-1.2e-05,1e-06,6.5e-05,5.9e-05,7.1e-05,-9e-06,8.6e-05,-2e-06,-0.000146,7e-05,-0.000102,-0.00024,0.000215,-6e-06,0.00025,5.3e-05,-6.3e-05,0.000275,-9e-06,3e-06,-3.1e-05,-3e-05,7.9e-05,2.6e-05,-0.000163,-1.2e-05,7.1e-05,-8.1e-05,0.000216,-0.000152,-7.6e-05,0.000156,-0.000198,-2.6e-05,-1.4e-05,-0.000306,-0.000224,6.6e-05,-0.000242,8.8e-05,9.9e-05,-3.2e-05,4.4e-05,0.000107,-9.8e-05,1.9e-05,-8.8e-05,-0.000193,-5.4e-05,4e-06,-0.000113,0.00014,0,-3e-06,3.7e-05,-0.000138,2.6e-05,-1.3e-05,-1.8e-05,6.3e-05,-4.2e-05,1.1e-05,1.7e-05,1.8e-05,-0.000158,2.8e-05,8.7e-05,-1e-05,-8.8e-05,-0.000108,-8.5e-05,-6.6e-05,1e-05,-1.3e-05,-4.6e-05,-7.9e-05,-8.7e-05,-0.000126,2e-06,-0.00016,1.1e-05,-0.000136,8.2e-05,7e-05,-1.7e-05,7.4e-05,-5.6e-05,2.2e-05,-7.1e-05,-6.3e-05,5.1e-05,-3.7e-05,-1.5e-05,8.5e-05,-0.000177,-5.6e-05,-0.000125,-5.6e-05,-4.4e-05,-3.8e-05,0.00015,-9.1e-05
3.3e-05,4.7e-05,-2.7e-05,-1e-06,-6.3e-05,-3e-05,0.000112,-2.9e-05,7e-06,5.7e-05,-3.8e-05,-3.7e-05,3.6e-05,1.4e-05,3.7e-05,-5.6e-05,2e-06,8.2e-05,-4.3e-05,-8.8e-05,1.3e-05,2.3e-05,-7.7e-05,1e-05,4e-05,-0.000102,-1.2e-05,5.8e-05,-0.000129,5.8e-05,0.000193,-0.000112,3e-06,-6.4e-05,-7.3e-05,3e-05,-0.000118,-3.8e-05,-5.1e-05,4.1e-05,9e-05,-1e-06,-3.8e-05,0.000127,-8.1e-05,-9.6e-05,4e-05,-0.000139,6e-06,-4.8e-05,-0.000161,9.1e-05,-8.8e-05,9e-06,0.000235,0.000127,-0.000117,5e-06,-5.1e-05,4e-06,1.2e-05,-5.6e-05,-4.2e-05,0.000126,-1.1e-05,1.9e-05,0.000141,-1.3e-05,-1.7e-05,7.4e-05,-2.8e-05,-4e-06,1.3e-05,-1.6e-05,0.000168,-4.1e-05,-2.5e-05,7e-05,-8.4e-05,3.6e-05,5.4e-05,-1.4e-05,-7e-06,0.000145,1.7e-05,-2.1e-05,4.4e-05,4.6e-05,-2.3e-05,1.7e-05,9e-05,-0.000102,2e-05,0,4.8e-05,1e-06,2e-05,1.1e-05,0.000143,-1e-06,-4e-05,-1e-06,-9.3e-05,5.1e-05,-2.4e-05,3.2e-05,1.4e-05,-2.4e-05,3.2e-05,-4e-05,6e-05,-7.6e-05,-4.9e-05,2.8e-05,1.9e-05,-4.6e-05,1.8e-05,5e-05,2.1e-05,-0.000141,-5.3e-05
-2.7e-05,-4.5e-05,2e-06,-1.8e-05,-8.7e-05,-4.5e-05,2.4e-05,-3e-06,-1.7e-05,-2.1e-05,1.3e-05,-1.7e-05,-7.6e-05,-3e-06,-8.3e-05,7.6e-05,-6e-06,-4.1e-05,3.5e-05,4e-05,1.5e-05,-2e-05,4.8e-05,-7.2e-05,5.3e-05,5.3e-05,2.7e-05,-0.000103,0.000118,-8.2e-05,-0.000123,-3.6e-05,-2e-05,4.6e-05,-1.7e-05,-1.9e-05,4.7e-05,4.8e-05,6e-06,1.3e-05,-0.000132,-7.9e-05,3.1e-05,3.5e-05,-2e-05,2.3e-05,-3.2e-05,6.7e-05,1.5e-05,-7e-06,6.1e-05,-4.7e-05,6.5e-05,-6e-06,-0.000155,-8e-05,7e-05,8.2e-05,7.5e-05,-1.6e-05,-3.8e-05,4e-05,7e-05,-0.000217,-5.4e-05,-1.4e-05,-9.8e-05,-4e-05,3.2e-05,-4.5e-05,-2.5e-05,1.3e-05,-2.2e-05,-2.5e-05,-9.6e-05,-8.9e-05,-4.4e-05,-4.4e-05,5.1e-05,1.7e-05,-2.4e-05,8e-06,3.8e-05,-9e-05,-1.1e-05,-2.7e-05,1.8e-05,-1.2e-05,1.7e-05,-1e-05,-3.6e-05,7.7e-05,-2.7e-05,-6.8e-05,-7.5e-05,3e-06,1.8e-05,-3.2e-05,-0.000123,-8.5e-05,5.3e-05,-4e-06,2.8e-05,2e-06,-3.4e-05,-4.9e-05,-8.3e-05,5.7e-05,-0.00011,-1.3e-05,-3.8e-05,7.3e-05,-2e-06,3e-06,4e-06,8.9e-05,-2.7e-05,1.4e-05,-2.1e-05,0.000161,3.6e-05
-1.1e-05,3.6e-05,-1.4e-05,3e-05,8.5e-05,1.3e-05,-1.6e-05,8e-06,-4e-06,1.8e-05,2e-06,9e-06,0.000145,3e-05,7.1e-05,-2.4e-05,8e-06,2.2e-05,2e-06,1.5e-05,-2.5e-05,-3e-06,-2.9e-05,2.1e-05,-5.1e-05,3.3e-05,9e-06,6.6e-05,-8e-05,6.6e-05,4.9e-05,6.1e-05,-3.5e-05,-6.7e-05,4e-05,1.7e-05,-2e-06,-4.5e-05,2.6e-05,2.2e-05,7.8e-05,9.1e-05,-1.2e-05,-9.4e-05,3e-05,1.3e-05,4.1e-05,-1e-05,-5.6e-05,-2e-05,-5.1e-05,7.2e-05,-2.4e-05,1.3e-05,4.8e-05,-4e-06,-9.2e-05,-3e-05,-6.8e-05,3.3e-05,3.3e-05,-2.6e-05,-3.5e-05,0.000112,-1e-05,3.1e-05,4.6e-05,2.8e-05,-2.7e-05,1.7e-05,-8e-06,1.1e-05,-5e-06,1.9e-05,-1.4e-05,9.7e-05,3.3e-05,-1e-06,-6e-06,-7.7e-05,-2.9e-05,-3.7e-05,-5.1e-05,5.6e-05,-1.1e-05,9e-06,-2.5e-05,3.8e-05,-7.2e-05,4.1e-05,-2e-05,-7.7e-05,8e-06,8.3e-05,2.1e-05,2e-06,-7.8e-05,-6e-06,8.1e-05,3.8e-05,-9.6e-05,2.5e-05,8e-06,-4.9e-05,1.7e-05,1.8e-05,4.4e-05,-4.9e-05,0.000104,1.4e-05,2.2e-05,-2.7e-05,1e-05,4.5e-05,-4e-05,1e-06,2.3e-05,-2.9e-05,1e-06,-4.9e-05,-2e-05
2e-05,-4.1e-05,6e-06,-7e-06,-5e-06,5e-06,-6e-06,-2.1e-05,2e-06,-1.1e-05,9e-06,5e-06,-6.3e-05,-2.1e-05,-7.1e-05,2.6e-05,-3.3e-05,8e-06,-2.6e-05,0,-8e-06,-1.6e-05,2e-05,-2e-06,3.9e-05,-5.5e-05,-2.3e-05,-5e-06,1.2e-05,-2.5e-05,-1.8e-05,-6.8e-05,1.7e-05,6e-06,-3.9e-05,-8e-06,2.6e-05,-1.2e-05,-3.3e-05,-3.3e-05,-2.9e-05,-7.7e-05,-1.3e-05,9.5e-05,-8e-06,3e-05,-2.9e-05,-6.1e-05,6.2e-05,3.6e-05,6.9e-05,-1.4e-05,-2e-05,-4e-06,-3.6e-05,2.3e-05,0.000131,-1.7e-05,-3.7e-05,-7e-06,-4e-06,3.3e-05,3e-06,-5.2e-05,8e-06,-5e-06,-4e-06,3.8e-05,-1.8e-05,3.4e-05,-5e-06,-1.4e-05,-4e-06,-1e-06,2.5e-05,-1.3e-05,3e-06,2.3e-05,2.5e-05,2e-06,3.3e-05,3.2e-05,2.6e-05,-3.6e-05,-1.2e-05,5e-06,4.2e-05,4e-06,5e-05,-1.5e-05,-4e-06,8.5e-05,3e-06,-3.7e-05,1e-06,-2.9e-05,4e-05,3.1e-05,-4.2e-05,-4.1e-05,7e-05,-1.8e-05,1.4e-05,3e-05,1e-06,2.4e-05,-9e-06,3.1e-05,-6.2e-05,-2.1e-05,-2.1e-05,-2.8e-05,-2.4e-05,-4.5e-05,-2.1e-05,-2.4e-05,1e-06,1.2e-05,3e-06,1.1e-05,8.6e-05
-2e-06,7e-06,-1.1e-05,-9e-06,-3.3e-05,5e-06,-2.6e-05,2e-06,1.3e-05,1.7e-05,-5e-06,-1.7e-05,1.6e-05,-1.2e-05,4.3e-05,-4.1e-05,1.4e-05,1.6e-05,1.7e-05,1.6e-05,3e-06,0,-2.7e-05,-1.4e-05,-4.6e-05,-2.6e-05,1.2e-05,-6e-06,-1.2e-05,1.4e-05,3.4e-05,4.6e-05,5.4e-05,2.9e-05,1.8e-05,1.5e-05,-4e-05,3e-05,1.8e-05,1.9e-05,-7e-06,3.6e-05,1.5e-05,-5.1e-05,9e-06,-1.7e-05,2.6e-05,7.9e-05,-8.2e-05,-1.9e-05,-3.8e-05,-3.3e-05,5.8e-05,-2e-05,1e-06,-1.1e-05,-7.8e-05,4.8e-05,2.6e-05,-3.9e-05,1e-05,-2e-05,-4.7e-05,2.3e-05,-1e-06,-2.4e-05,1.9e-05,-5.1e-05,1.1e-05,-4.8e-05,3.4e-05,3e-06,-3.2e-05,-1.1e-05,7e-06,-1e-06,2.5e-05,-3.8e-05,-1.2e-05,1.4e-05,-3.8e-05,-2e-06,-2.3e-05,1.7e-05,-2e-06,-8e-06,-1.6e-05,-5e-06,1e-06,-1.2e-05,-1e-06,-3.1e-05,-6e-06,1.1e-05,3.6e-05,4e-06,2.2e-05,-2.4e-05,2.9e-05,1.9e-05,-3e-06,1e-06,-2.7e-05,-1.8e-05,2e-06,-4.9e-05,1.6e-05,1.5e-05,4.3e-05,2.2e-05,1.2e-05,4.5e-05,1.6e-05,-5e-06,2.7e-05,2.4e-05,8e-06,-3e-06,-9e-06,2.4e-05,-4.7e-05
-1.3e-05,1e-06,1.7e-05,3.2e-05,2.3e-05,4e-06,2.6e-05,8e-06,-1.3e-05,-1.4e-05,-6e-06,-8e-06,-3e-05,2.1e-05,-3.9e-05,8e-06,-1.3e-05,-5.7e-05,-1.2e-05,-5e-06,-9e-06,1.2e-05,2.2e-05,2.5e-05,-1e-06,3.9e-05,-1.3e-05,1.4e-05,2.9e-05,-2.9e-05,3e-06,-2e-06,-4e-05,-1e-06,-6e-06,-3.7e-05,2.1e-05,3.4e-05,0,4e-06,3.5e-05,1e-05,4e-06,3.8e-05,3.3e-05,-7e-06,-1.6e-05,-3.3e-05,4.7e-05,-1e-06,1.3e-05,3.1e-05,-3.5e-05,4e-06,6.7e-05,2.1e-05,-9e-06,-5e-06,-4.3e-05,1.2e-05,-9e-06,1.3e-05,4.6e-05,3.2e-05,9e-06,1.5e-05,-1.7e-05,1.5e-05,-1.9e-05,2.9e-05,-3.5e-05,-9e-06,2.1e-05,7e-06,1.3e-05,-2.5e-05,-1e-05,2.8e-05,-1e-06,-2e-06,1.9e-05,1e-06,-2e-06,-1e-06,2e-05,-6e-06,7e-06,0,-1.2e-05,-3.3e-05,1.1e-05,9e-06,-6e-06,-5.6e-05,-3.4e-05,3.7e-05,-2.9e-05,5e-06,-3.9e-05,2e-06,-1e-06,0,-7e-06,9e-06,6e-06,4.3e-05,3e-06,2e-06,-1.6e-05,-1.2e-05,9e-06,-3.1e-05,-1.5e-05,-4e-06,-1.3e-05,-1.2e-05,-7e-06,-4e-06,-1.4e-05,-1.4e-05,-1e-05
6e-06,-1.5e-05,-1.4e-05,-3.7e-05,-2.1e-05,1e-06,-3.8e-05,-1.4e-05,7e-06,7e-06,7e-06,-8e-06,2.4e-05,-2.5e-05,3.5e-05,-1e-05,-3e-06,6.5e-05,1.4e-05,-1.6e-05,2.6e-05,-1.4e-05,-9e-06,-7e-06,7e-06,-1.7e-05,0,-3.1e-05,-2.1e-05,1.8e-05,-7e-06,-1.9e-05,3e-06,1.4e-05,-1.2e-05,2.4e-05,-2.8e-05,-1.3e-05,-1.5e-05,-3e-06,-3.5e-05,-2.5e-05,-3e-06,0,-1.3e-05,-9e-06,1e-05,8e-06,-5e-06,1.3e-05,-2.3e-05,-3e-05,2.1e-05,-1.3e-05,-7.7e-05,-5.4e-05,2.6e-05,-4.2e-05,5.2e-05,1.7e-05,6e-06,-1e-05,-1.9e-05,-1.4e-05,0,0,6e-06,9e-06,0,-2.9e-05,1.9e-05,-3e-06,-9e-06,-1e-06,-9e-06,1.5e-05,-5e-06,-6e-06,1.1e-05,2e-06,4e-06,1.8e-05,2e-05,-9e-06,-1.5e-05,6e-06,3e-06,-7e-06,2.4e-05,8e-06,-7e-06,-4.3e-05,0,6.8e-05,8e-06,-3.9e-05,2.9e-05,3e-06,1.7e-05,1e-06,-5e-06,8e-06,3e-06,-5e-06,5e-06,7e-06,-1.3e-05,-1.5e-05,7e-06,6e-06,-7e-06,1.8e-05,1.1e-05,6e-06,3.8e-05,-1.6e-05,2e-06,8e-06,1.7e-05,1e-05,-6e-06
3e-06,7e-06,6e-06,1.6e-05,1.4e-05,-1e-06,4.2e-05,6e-06,5e-06,-1e-06,-5e-06,-1.3e-05,-3.5e-05,-1.6e-05,-3.1e-05,7e-06,2.3e-05,-6.2e-05,-1e-05,1.3e-05,-2.9e-05,1e-05,3e-06,-1.1e-05,-1.1e-05,-2e-06,1e-05,3.3e-05,1.3e-05,-7e-06,2.2e-05,1.9e-05,1.4e-05,-2.7e-05,2e-05,-1.9e-05,1.9e-05,-5e-06,4e-06,1.4e-05,1.7e-05,-2e-05,1.3e-05,-3e-06,-3.1e-05,1.1e-05,-1.3e-05,-2.1e-05,-1.2e-05,-1.6e-05,1.9e-05,2.4e-05,2e-06,3e-06,5.6e-05,5.9e-05,1e-05,3.6e-05,-4.5e-05,-1.8e-05,-1e-06,6e-06,1.3e-05,-1.1e-05,-3.1e-05,-1.7e-05,-4e-06,-1.5e-05,1.7e-05,1e-05,5e-06,4e-06,-1.3e-05,6e-06,-2e-06,2e-06,3e-06,-6e-06,1.4e-05,5e-06,-3.6e-05,-2.5e-05,-7e-06,7e-06,2e-06,-3e-06,-2e-06,-3e-06,6e-06,3.1e-05,1.1e-05,5.3e-05,1.5e-05,-3e-05,-3e-06,1.1e-05,-6e-06,-4e-06,0,-1.4e-05,-8e-06,-2.4e-05,1.5e-05,-1e-06,-1e-06,-1.7e-05,2.5e-05,2.5e-05,-6e-06,0,-4e-06,-1.2e-05,-4e-06,1.3e-05,-8e-06,-1.7e-05,3e-06,1.1e-05,-1e-05,-3.1e-05,5e-06
-1.1e-05,2e-06,-5e-06,-6e-06,8e-06,-7e-06,-2.7e-05,-3e-06,-1.5e-05,-1.2e-05,1e-06,4e-06,3.7e-05,1.6e-05,3.6e-05,7e-06,-1.2e-05,4.4e-05,1.3e-05,-1.4e-05,2.6e-05,-1e-06,4e-06,1.7e-05,1.7e-05,1.9e-05,-4e-06,-3.8e-05,-6e-06,1e-05,-2.1e-05,-2e-06,-2e-06,1.4e-05,-1.8e-05,1.8e-05,-1.6e-05,-5e-06,1.9e-05,-1.8e-05,-3e-06,4.2e-05,-5e-06,-3e-05,7e-06,6e-06,5e-06,2.6e-05,1.5e-05,3e-06,1.3e-05,4e-06,-5e-06,8e-06,-2.3e-05,-1.6e-05,-3.4e-05,-1.7e-05,4.5e-05,-6e-06,-1.3e-05,-4e-06,-3e-06,2e-06,1.7e-05,1.6e-05,2e-06,1.4e-05,-1.2e-05,1.2e-05,-1e-06,-1.2e-05,2.9e-05,1e-06,-2.1e-05,-5e-06,-2e-05,-5e-06,-2.3e-05,1e-06,4.3e-05,5e-06,-1e-05,0,1e-05,1e-06,6e-06,-7e-06,-1.8e-05,-2.8e-05,-1.6e-05,-5e-06,-1.2e-05,6e-06,2.4e-05,1.8e-05,6e-06,-1e-06,7e-06,7e-06,1e-06,2.5e-05,-7e-06,3e-06,-1.4e-05,1e-05,6e-06,-5e-06,1.1e-05,0,6e-06,1.4e-05,3e-06,-1e-05,-1.8e-05,9e-06,-4e-06,-3e-06,0,3.2e-05,1.9e-05
0,3e-06,3e-06,3e-06,-2.1e-05,-6e-06,1e-05,-4e-06,1.9e-05,1.3e-05,-6e-06,-7e-06,-5e-06,-1.5e-05,-2.5e-05,-1e-06,1.2e-05,-8e-06,-8e-06,3e-06,-6e-06,-1.1e-05,-1e-05,-1.1e-05,-8e-06,-2e-05,6e-06,2.8e-05,1e-05,-4e-06,-7e-06,-6e-06,-1.1e-05,-6e-06,8e-06,-1.1e-05,-5e-06,1.1e-05,-2.2e-05,1.1e-05,-8e-06,-1.5e-05,2e-06,4e-06,1e-05,-5e-06,-8e-06,-1.7e-05,-1.8e-05,5e-06,-8e-06,-3e-06,-2e-06,-2e-06,-1e-06,1e-05,2.8e-05,7e-06,3e-06,-4e-06,6e-06,3e-06,-1.4e-05,-2e-06,1e-06,-4e-06,-4e-06,-7e-06,0,-1.8e-05,-1e-05,7e-06,-9e-06,2e-06,2.2e-05,7e-06,3e-06,1.7e-05,1e-05,-1e-06,-2.4e-05,4e-06,7e-06,0,8e-06,-4e-06,-4e-06,2e-06,-8e-06,2.7e-05,-9e-06,-2.2e-05,2e-06,-6e-06,-2e-05,1e-06,-4e-06,0,-8e-06,1.2e-05,-6e-06,-1.9e-05,0,-4e-06,1e-05,-1.2e-05,-1.9e-05,0,-1.5e-05,7e-06,-4e-06,0,5e-06,-3e-06,5e-06,-1e-05,7e-06,0,1e-06,-4.1e-05,-9e-06
5e-06,3e-06,-1e-06,-1e-06,8e-06,0,-6e-06,0,-1.2e-05,-4e-06,1e-05,8e-06,-7e-06,1.3e-05,1.6e-05,-3e-06,-8e-06,-1.1e-05,3e-06,9e-06,1.2e-05,1.5e-05,8e-06,-2e-06,5e-06,6e-06,-5e-06,-2.1e-05,0,-9e-06,-8e-06,-2e-06,1.1e-05,5e-06,3e-06,-1e-06,1e-05,-3e-06,1.4e-05,-1.3e-05,1.3e-05,-1.2e-05,7e-06,0,1e-06,-8e-06,7e-06,3e-06,1.5e-05,-6e-06,-1e-05,-1.2e-05,-4e-06,2e-06,-2.3e-05,-5e-06,-2.3e-05,-8e-06,-2.5e-05,7e-06,-1e-06,-3e-06,1e-05,-7e-06,-8e-06,4e-06,6e-06,-7e-06,1e-05,2.3e-05,1.2e-05,-3e-06,-8e-06,-3e-06,0,-1.2e-05,1.3e-05,-2.1e-05,-1.7e-05,-3e-06,3e-06,-9e-06,3e-06,-3e-06,-1.2e-05,5e-06,4e-06,-6e-06,1.8e-05,-1.6e-05,1.6e-05,6e-06,9e-06,-3.6e-05,3e-06,-2.2e-05,-1.1e-05,-1e-06,2e-06,-8e-06,3e-06,1.6e-05,-4e-06,1.2e-05,3e-06,4e-06,1.5e-05,2e-06,7e-06,-1e-05,5e-06,-1.5e-05,-1e-05,4e-06,-5e-06,1.1e-05,0,-3e-06,-2e-06,1.7e-05,-2.5e-05
-3e-06,-2e-06,-1e-06,6e-06,-3e-06,4e-06,1.5e-05,2e-06,1.1e-05,-4e-06,-6e-06,-2e-06,-8e-06,-1.6e-05,4e-06,-9e-06,-3e-06,4e-06,1e-06,-7e-06,-1.7e-05,-1.3e-05,-5e-06,9e-06,-1e-06,2.1e-05,-3e-06,1.8e-05,-4e-06,5e-06,1.4e-05,-2e-06,-2e-06,8e-06,-7e-06,1e-06,-9e-06,-1e-05,-2e-06,1.2e-05,-1.7e-05,1.2e-05,-4e-06,7e-06,-3e-06,1e-06,0,5e-06,-5e-06,7e-06,-3e-06,2e-05,3e-06,0,4e-05,1.6e-05,1.9e-05,1.4e-05,4e-05,-3e-06,0,2e-06,-2e-06,1.2e-05,-3e-06,-1e-05,-7e-06,8e-06,-6e-06,-2.3e-05,0,-7e-06,1e-05,2e-06,3e-06,5e-06,-9e-06,2e-05,9e-06,-3e-06,1.6e-05,1.1e-05,-4e-06,6e-06,-1e-06,8e-06,-3e-06,5e-06,1e-06,-5e-06,-2e-06,7e-06,-7e-06,5.2e-05,-1.1e-05,1e-06,1.6e-05,4e-06,8e-06,1.4e-05,1.5e-05,-1.7e-05,6e-06,-1.5e-05,0,-1e-06,3e-06,-3e-06,-4e-06,8e-06,-7e-06,1.7e-05,1e-06,0,1e-06,-1e-06,-2e-06,-3e-06,2e-06,2e-06,8e-06
1e-06,3e-06,-3e-06,-2e-06,6e-06,3e-06,-1e-05,-5e-06,-1.1e-05,4e-06,8e-06,-2e-06,5e-06,1.8e-05,-1.1e-05,4e-06,1e-06,3e-06,-2e-06,3e-06,1e-05,7e-06,6e-06,-9e-06,-5e-06,-2.1e-05,1e-06,-4e-06,4e-06,-1e-06,-1e-05,0,-1e-06,-1.3e-05,8e-06,1e-06,-7e-06,7e-06,-4e-06,-5e-06,1.4e-05,-8e-06,2e-06,5e-06,8e-06,9e-06,0,-1.8e-05,-1e-06,0,1.7e-05,-2.7e-05,-1e-06,-1e-06,-4.4e-05,-6e-06,-1.1e-05,-6e-06,-5.5e-05,2e-06,0,1e-06,1.3e-05,-8e-06,-8e-06,2e-06,0,-4e-06,2e-06,3e-06,-1e-05,5e-06,-8e-06,-2e-06,-8e-06,-3e-06,6e-06,-9e-06,6e-06,-2e-06,-2.6e-05,5e-06,-2e-06,-8e-06,-5e-06,-7e-06,-3e-06,-3e-06,-1.6e-05,-1.2e-05,1.3e-05,6e-06,-2e-06,-3.3e-05,1.7e-05,1.4e-05,-2.1e-05,-3e-06,-1.7e-05,-1.3e-05,-1.2e-05,1.5e-05,-3e-06,8e-06,-7e-06,-3e-06,-1e-05,-1.4e-05,4e-06,-5e-06,5e-06,-1.4e-05,1e-06,-1.1e-05,4e-06,1e-05,-1e-06,0,-3e-06,-4e-06,1.4e-05
-2e-06,2e-06,2e-06,-2e-06,1e-06,1e-06,3e-06,0,5e-06,-1e-06,-9e-06,4e-06,-6e-06,0,8e-06,-1e-06,-1e-05,-1e-06,1e-06,1e-06,-9e-06,1e-06,-7e-06,3e-06,8e-06,-5e-06,2e-06,1e-06,0,4e-06,1.9e-05,5e-06,-1e-06,9e-06,-9e-06,-4e-06,1e-06,1.2e-05,2e-06,5e-06,-1e-06,5e-06,2e-06,-1.3e-05,-7e-06,1e-06,1e-06,2.9e-05,8e-06,-4e-06,-4e-06,2e-05,3e-06,-1e-06,3.6e-05,-1.9e-05,5e-06,1e-06,2.6e-05,4e-06,-5e-06,0,-1.4e-05,2e-05,4e-06,6e-06,6e-06,4e-06,4e-06,2e-06,9e-06,-1e-06,-2e-06,-2e-06,0,1.2e-05,8e-06,0,-1.6e-05,-2e-06,2.2e-05,-4e-06,3e-06,5e-06,-6e-06,-5e-06,4e-06,4e-06,8e-06,1.2e-05,-1.4e-05,-1.9e-05,3e-06,1.3e-05,-5e-06,-1.1e-05,-1e-06,2e-06,9e-06,1.2e-05,2e-06,-1.4e-05,2e-06,2e-06,5e-06,1.3e-05,2e-06,5e-06,-6e-06,2e-06,-3e-06,7e-06,-2e-06,-5e-06,-1e-06,-1e-06,-3e-06,0,3e-06,1e-05,0
3e-06,-5e-06,-5e-06,1e-06,-1.3e-05,-1e-06,0,1e-06,-6e-06,0,6e-06,-2e-06,7e-06,-8e-06,-9e-06,4e-06,1.1e-05,3e-06,-6e-06,-5e-06,8e-06,-4e-06,7e-06,6e-06,-5e-06,1.8e-05,3e-06,0,0,-1e-05,-1.3e-05,0,1.5e-05,-8e-06,2e-06,5e-06,4e-06,-1e-06,1e-06,-3e-06,-1.3e-05,6e-06,-2e-06,8e-06,-7e-06,-3e-06,-2e-06,-2e-05,-8e-06,4e-06,4e-06,-1.1e-05,-8e-06,2e-06,-1.9e-05,1.6e-05,-4e-06,-1.4e-05,-6e-06,-5e-06,8e-06,-1e-06,7e-06,-2.2e-05,9e-06,-8e-06,-1e-06,-3e-06,-2e-06,-5e-06,-4e-06,-3e-06,5e-06,-2e-06,-4e-06,-1e-05,-1.9e-05,2e-06,4e-06,4e-06,-8e-06,0,-3e-06,-4e-06,4e-06,5e-06,-4e-06,0,1.1e-05,9e-06,4e-06,1.7e-05,-1e-06,-1.7e-05,1e-06,-1e-06,1.7e-05,-3e-06,-6e-06,-4e-06,0,1.7e-05,-1e-06,-4e-06,3e-06,-6e-06,-3e-06,-6e-06,4e-06,3e-06,3e-06,-1e-06,0,1e-06,-5e-06,6e-06,0,1e-06,1e-06,0,-1e-06
-1e-06,7e-06,5e-06,-2e-06,1e-05,-1e-06,-5e-06,-4e-06,7e-06,-2e-06,-6e-06,8e-06,1.3e-05,9e-06,8e-06,2e-06,-6e-06,-8e-06,5e-06,4e-06,-8e-06,5e-06,-3e-06,-5e-06,1e-06,-1e-05,-1e-06,-1.2e-05,-8e-06,9e-06,9e-06,-9e-06,-1.5e-05,1.1e-05,0,-3e-06,-1.2e-05,-1e-05,-1e-05,-2e-06,2.1e-05,-8e-06,2e-06,-7e-06,2e-06,-6e-06,1e-06,1e-06,4e-06,-4e-06,-1.7e-05,1.1e-05,4e-06,0,1.2e-05,-1.2e-05,3e-06,4e-06,-9e-06,0,-1e-06,1e-06,-1.3e-05,1.4e-05,-6e-06,3e-06,4e-06,-5e-06,2e-06,1.2e-05,7e-06,4e-06,-5e-06,2e-06,9e-06,-1e-06,5e-06,-2e-06,3e-06,5e-06,-8e-06,-6e-06,2e-06,3e-06,9e-06,-2e-06,-1e-06,2e-06,-1.6e-05,0,-1.5e-05,-7e-06,-3e-06,1.8e-05,-1e-05,5e-06,-1.8e-05,3e-06,1.3e-05,-4e-06,-9e-06,-1.6e-05,-2e-06,2e-06,-3e-06,-6e-06,0,3e-06,-2e-06,-6e-06,-2e-06,-3e-06,1e-06,2e-06,1.2e-05,-9e-06,-1e-06,0,-1e-06,1.3e-05,-1.4e-05
-3e-06,-5e-06,-4e-06,2e-06,-4e-06,-2e-06,0,2e-06,-1.1e-05,4e-06,6e-06,0,-1.2e-05,-8e-06,-1.2e-05,-3e-06,2e-06,2e-06,-3e-06,2e-06,8e-06,-4e-06,-1e-06,0,1e-06,-4e-06,0,1.2e-05,9e-06,-2e-06,-1.1e-05,1.1e-05,3e-06,-6e-06,1e-06,0,8e-06,2e-06,6e-06,3e-06,-1.8e-05,-7e-06,1e-06,1.9e-05,1e-06,3e-06,0,6e-06,3e-06,0,1.1e-05,-8e-06,0,4e-06,-8e-06,8e-06,-6e-06,-1e-06,2.5e-05,-3e-06,-3e-06,-1e-06,8e-06,-1.4e-05,-5e-06,3e-06,-8e-06,9e-06,0,-9e-06,-1.1e-05,-3e-06,4e-06,-2e-06,2e-06,0,9e-06,-1e-06,-1e-06,5e-06,1.8e-05,-3e-06,2e-06,-2e-06,0,-3e-06,2e-06,-1e-06,-2e-06,-4e-06,1.7e-05,-1e-06,1e-06,-5e-06,5e-06,1e-06,8e-06,-2e-06,-1.4e-05,1e-05,9e-06,8e-06,2e-06,-2e-06,-1e-06,7e-06,3e-06,6e-06,0,5e-06,-1e-06,2e-06,-1e-06,-5e-06,-7e-06,-4e-06,3e-06,-2e-06,0,-2.3e-05,7e-06
2e-06,4e-06,1e-06,-1e-06,0,-1e-06,6e-06,-1e-06,1.1e-05,-2e-06,-5e-06,3e-06,0,-1e-06,1.2e-05,-2e-06,6e-06,8e-06,0,-4e-06,-4e-06,-1e-06,3e-06,4e-06,-3e-06,1e-05,-3e-06,-1e-05,-5e-06,2e-06,4e-06,-4e-06,0,5e-06,1e-06,2e-06,0,4e-06,2e-06,-3e-06,7e-06,2e-05,-3e-06,-6e-06,0,3e-06,1e-06,-3e-06,-5e-06,3e-06,-2e-06,2e-06,0,-4e-06,0,-1.8e-05,1.4e-05,-4e-06,-2.8e-05,5e-06,2e-06,1e-06,1e-06,1e-05,-6e-06,-2e-06,6e-06,-4e-06,-1e-06,4e-06,5e-06,0,2e-06,1e-06,-5e-06,5e-06,-1.1e-05,3e-06,6e-06,-2e-06,-1.7e-05,4e-06,-3e-06,2e-06,-3e-06,3e-06,-5e-06,1e-06,8e-06,-4e-06,-9e-06,-4e-06,3e-06,1.1e-05,4e-06,-5e-06,9e-06,2e-06,6e-06,-1.7e-05,-8e-06,-6e-06,-1e-06,5e-06,-1e-06,-7e-06,-6e-06,1e-06,3e-06,-5e-06,-1e-06,-4e-06,1e-06,-5e-06,4e-06,-4e-06,0,0,1e-06,1.5e-05,7e-06
1e-06,-4e-06,-1e-06,4e-06,5e-06,0,-4e-06,-2e-06,-5e-06,-2e-06,5e-06,3e-06,-3e-06,1e-06,-1.2e-05,-1e-06,-6e-06,-1.2e-05,2e-06,7e-06,2e-06,6e-06,-3e-06,-6e-06,1e-06,-8e-06,1e-06,1.4e-05,3e-06,-1e-05,1e-06,-3e-06,4e-06,-3e-06,-4e-06,-6e-06,-3e-06,2e-06,-5e-06,4e-06,7e-06,-1.3e-05,3e-06,-5e-06,2e-06,0,-2e-06,0,5e-06,-5e-06,1.1e-05,2e-06,2e-06,1e-06,4e-06,1.4e-05,-1.5e-05,5e-06,3.3e-05,-2e-06,0,-2e-06,2e-06,-5e-06,2e-06,-1e-06,-6e-06,-4e-06,1e-06,-2e-06,4e-06,3e-06,-3e-06,0,-1e-06,-2e-06,9e-06,-1e-06,-5e-06,-4e-06,8e-06,1e-06,-1e-06,0,2e-06,4e-06,1e-06,-2e-06,-2e-06,1e-06,8e-06,1.2e-05,-2e-06,-2e-05,2e-06,7e-06,-1.1e-05,-1e-06,-2e-06,1.1e-05,1.4e-05,7e-06,4e-06,-6e-06,5e-06,-1e-06,3e-06,-2e-06,-2e-06,3e-06,2e-06,8e-06,1e-06,-2e-06,-7e-06,1e-06,2e-06,-1e-06,2e-06,-8e-06,1e-06
-2e-06,0,-1e-06,-5e-06,-9e-06,1e-06,2e-06,0,0,4e-06,-2e-06,-3e-06,4e-06,-5e-06,1e-05,3e-06,9e-06,1.2e-05,-3e-06,-5e-06,0,-7e-06,2e-06,2e-06,0,-1e-06,1e-06,-1.3e-05,-7e-06,9e-06,-2e-06,3e-06,-7e-06,-4e-06,4e-06,7e-06,-1e-06,-8e-06,6e-06,-2e-06,-1.6e-05,0,-1e-06,-3e-06,4e-06,-5e-06,1e-06,-1e-06,-3e-06,2e-06,-1.5e-05,-6e-06,-3e-06,-5e-06,-7e-06,-6e-06,7e-06,8e-06,-2.2e-05,-4e-06,-1e-06,2e-06,1e-06,4e-06,6e-06,-3e-06,6e-06,6e-06,-3e-06,-4e-06,-2e-06,-3e-06,2e-06,1e-06,-2e-06,-3e-06,7e-06,-2e-06,-1e-06,-2e-06,5e-06,3e-06,3e-06,-3e-06,1e-06,-1e-06,-1e-06,-1e-06,0,-5e-06,-5e-06,-8e-06,-1e-06,7e-06,-4e-06,-1e-06,9e-06,1e-06,3e-06,-5e-06,-1.3e-05,-5e-06,-4e-06,1e-06,-5e-06,2e-06,4e-06,2e-06,1e-06,0,-1e-06,-6e-06,-2e-06,3e-06,-3e-06,0,-3e-06,1e-06,-2e-06,-8e-06,-5e-06
-1e-06,0,2e-06,5e-06,6e-06,1e-06,-1e-06,-1e-06,0,-3e-06,2e-06,2e-06,-5e-06,2e-06,-8e-06,0,-7e-06,-1.1e-05,4e-06,-1e-06,1e-06,5e-06,-2e-06,2e-06,-2e-06,1e-05,0,8e-06,7e-06,-3e-06,8e-06,-3e-06,6e-06,8e-06,-1e-06,-4e-06,7e-06,5e-06,-1e-06,1e-06,1.6e-05,4e-06,0,-6e-06,-5e-06,0,-2e-06,2e-06,1e-06,1e-06,4e-06,9e-06,2e-06,2e-06,7e-06,0,-1e-06,-6e-06,5e-06,2e-06,1e-06,-1e-06,-4e-06,1e-06,-4e-06,4e-06,-5e-06,-2e-06,0,6e-06,-4e-06,2e-06,-1e-06,0,2e-06,2e-06,-1.4e-05,4e-06,6e-06,-1e-06,-1.4e-05,1e-06,-1e-06,2e-06,-5e-06,-4e-06,-1e-06,-1e-06,1e-06,1.2e-05,1e-06,-5e-06,2e-06,1.3e-05,-4e-06,-7e-06,1e-06,-1e-06,-7e-06,-1e-06,4e-06,3e-06,-1e-06,3e-06,2e-06,0,-5e-06,-1e-06,0,-2e-06,-1e-06,2e-06,-2e-06,0,2e-06,8e-06,-1e-06,2e-06,-1e-06,5e-06,-9e-06
1e-06,-2e-06,-1e-06,-6e-06,0,0,0,-2e-06,-2e-06,1e-06,-3e-06,-1e-06,1.3e-05,-3e-06,4e-06,2e-06,-1e-06,8e-06,-2e-06,4e-06,2e-06,-3e-06,3e-06,-3e-06,1e-06,-8e-06,2e-06,-8e-06,-1e-06,1e-06,-5e-06,3e-06,-2e-06,-6e-06,-1e-06,3e-06,-2e-06,3e-06,-2e-06,-2e-06,-9e-06,1e-06,1e-06,9e-06,0,1e-06,1e-06,-5e-06,1e-06,-3e-06,-5e-06,-6e-06,1e-06,0,-2e-06,3e-06,1e-06,1e-06,8e-06,0,0,1e-06,3e-06,-2e-06,-4e-06,-2e-06,6e-06,-1e-06,1e-06,-2e-06,3e-06,1e-06,-4e-06,0,3e-06,-1e-06,5e-06,-5e-06,-1e-06,2e-06,1.5e-05,-3e-06,-1e-06,-1e-06,-3e-06,0,-1e-06,-1e-06,-1e-06,-1e-06,-3e-06,6e-06,-2e-06,-1e-05,3e-06,1e-06,-6e-06,2e-06,4e-06,5e-06,2e-06,-5e-06,2e-06,-2e-06,0,1e-06,2e-06,-1e-06,0,3e-06,-1e-06,2e-06,2e-06,-1e-06,5e-06,1e-06,-1e-06,0,1e-06,-5e-06,7e-06
0,2e-06,-1e-06,4e-06,-3e-06,-1e-06,-1e-06,0,5e-06,0,1e-06,0,-9e-06,4e-06,-1e-06,-1e-06,1e-06,-6e-06,2e-06,-4e-06,-1e-06,-1e-06,-3e-06,1e-06,0,-4e-06,-2e-06,5e-06,4e-06,-3e-06,4e-06,2e-06,0,6e-06,1e-06,-4e-06,-2e-06,2e-06,2e-06,2e-06,1e-06,-7e-06,-1e-06,0,0,4e-06,1e-06,1e-05,-4e-06,3e-06,1.4e-05,2e-06,1e-06,2e-06,2e-06,4e-06,-1e-06,5e-06,-2.6e-05,0,2e-06,-1e-06,-3e-06,0,0,-2e-06,-4e-06,1e-06,-3e-06,0,1e-06,-2e-06,1e-06,0,0,2e-06,5e-06,5e-06,-2e-06,2e-06,-8e-06,-2e-06,0,0,3e-06,2e-06,0,0,4e-06,-2e-06,6e-06,4e-06,-1e-06,7e-06,2e-06,6e-06,2e-06,-2e-06,3e-06,-8e-06,-1.1e-05,4e-06,1e-06,-1e-06,1e-06,-2e-06,3e-06,3e-06,0,-4e-06,1e-06,-3e-06,-2e-06,-2e-06,1e-06,0,1e-06,0,0,7e-06,7e-06
-1e-06,-1e-06,1e-06,-2e-06,3e-06,-1e-06,1e-06,-1e-06,-3e-06,-1e-06,-1e-06,0,0,2e-06,1e-06,-1e-06,-5e-06,6e-06,0,2e-06,1e-06,4e-06,2e-06,1e-06,-1e-06,1.2e-05,-1e-06,-2e-06,-9e-06,3e-06,-5e-06,-6e-06,-3e-06,-5e-06,-3e-06,4e-06,1e-06,-8e-06,0,-1e-06,8e-06,9e-06,0,-2e-06,0,0,0,-1e-05,4e-06,0,-7e-06,0,0,0,-4e-06,4e-06,1e-06,-3e-06,3.1e-05,-2e-06,-1e-06,1e-06,5e-06,-2e-06,0,5e-06,3e-06,1e-06,1e-06,3e-06,-3e-06,2e-06,1e-06,1e-06,-4e-06,-2e-06,-1.3e-05,-3e-06,-3e-06,-1e-06,-4e-06,-3e-06,1e-06,0,1e-06,-1e-06,-1e-06,0,0,-7e-06,-3e-06,-4e-06,1e-06,-1.2e-05,2e-06,0,-1e-06,2e-06,-3e-06,5e-06,1.3e-05,2e-06,0,1e-06,-3e-06,0,-2e-06,-3e-06,0,2e-06,0,2e-06,1e-06,1e-06,0,0,1e-06,0,-1e-06,-6e-06,-2e-06
0,2e-06,-3e-06,0,-4e-06,0,2e-06,-1e-06,2e-06,2e-06,1e-06,-1e-06,-3e-06,-4e-06,0,-1e-06,1e-05,-7e-06,-1e-06,3e-06,-5e-06,-4e-06,-1e-06,-1e-06,3e-06,-6e-06,-1e-06,-3e-06,7e-06,-1e-06,0,3e-06,6e-06,1e-06,2e-06,-5e-06,5e-06,3e-06,-3e-06,1e-06,-1.5e-05,-6e-06,1e-06,-3e-06,0,-2e-06,1e-06,3e-06,-2e-06,-1e-06,1e-06,-1e-06,-1e-06,2e-06,7e-06,-4e-06,-5e-06,-2e-06,-2.4e-05,4e-06,-2e-06,0,-4e-06,2e-06,3e-06,-2e-06,-2e-06,1e-06,1e-06,-7e-06,2e-06,0,-1e-06,0,0,1e-06,6e-06,1e-06,2e-06,-2e-06,1.3e-05,1e-06,-1e-06,0,0,-1e-06,1e-06,0,-7e-06,0,2e-06,-4e-06,0,8e-06,-5e-06,-7e-06,-2e-06,-2e-06,0,-1e-06,-9e-06,-3e-06,-2e-06,-1e-06,0,2e-06,0,0,-1e-06,-1e-06,-1e-06,-2e-06,1e-06,0,-3e-06,2e-06,1e-06,-1e-06,-1e-06,1.4e-05,-5e-06
1e-06,-1e-06,2e-06,1e-06,4e-06,0,-5e-06,0,-1e-06,-1e-06,1e-06,0,7e-06,5e-06,0,1e-06,-4e-06,7e-06,1e-06,-5e-06,3e-06,3e-06,0,0,-1e-06,-6e-06,1e-06,4e-06,0,-1e-06,-2e-06,1e-06,-6e-06,0,0,5e-06,-4e-06,2e-06,2e-06,0,1.2e-05,0,-2e-06,0,2e-06,-3e-06,0,6e-06,0,2e-06,-9e-06,-1e-06,-1e-06,-3e-06,-1.1e-05,6e-06,8e-06,1e-06,1.5e-05,-2e-06,2e-06,0,-1e-06,-3e-06,-2e-06,-1e-06,1e-06,-3e-06,-2e-06,4e-06,-1e-06,-2e-06,1e-06,0,0,-3e-06,6e-06,0,4e-06,0,-1.5e-05,3e-06,1e-06,0,4e-06,2e-06,-1e-06,0,6e-06,3e-06,-2e-06,5e-06,0,6e-06,0,3e-06,-2e-06,2e-06,-1e-06,0,6e-06,0,1e-06,0,3e-06,-3e-06,2e-06,-2e-06,1e-06,0,0,2e-06,-1e-06,-2e-06,-4e-06,-7e-06,0,0,1e-06,-4e-06,-5e-06
1e-06,1e-06,-1e-06,-3e-06,-1e-06,0,6e-06,-1e-06,3e-06,0,0,-1e-06,-7e-06,0,2e-06,2e-06,1e-06,-9e-06,-1e-06,3e-06,-2e-06,-1e-06,1e-06,1e-06,1e-06,1.1e-05,1e-06,-5e-06,3e-06,0,1e-06,-2e-06,1e-06,-1e-06,-1e-06,-6e-06,-2e-06,3e-06,-2e-06,-2e-06,-6e-06,6e-06,1e-06,5e-06,2e-06,3e-06,0,-8e-06,0,-2e-06,1e-05,3e-06,0,1e-06,1e-05,-5e-06,-6e-06,3e-06,2e-06,-3e-06,0,0,-1e-06,7e-06,-2e-06,-3e-06,-1e-06,1e-06,2e-06,0,3e-06,2e-06,2e-06,0,1e-06,2e-06,-1.1e-05,0,-4e-06,2e-06,9e-06,1e-06,0,-1e-06,1e-06,0,1e-06,0,5e-06,3e-06,0,0,0,-5e-06,0,3e-06,3e-06,-2e-06,5e-06,2e-06,-2e-06,-1e-06,1e-06,2e-06,-1e-06,3e-06,-1e-06,-1e-06,-1e-06,1e-06,0,-1e-06,2e-06,-1e-06,4e-06,-3e-06,-1e-06,0,0,-2e-06,5e-06
-1e-06,0,0,3e-06,-2e-06,0,-7e-06,-1e-06,-7e-06,1e-06,1e-06,-1e-06,1e-05,-4e-06,-3e-06,0,1e-06,1e-05,0,-1e-06,6e-06,-1e-06,-2e-06,-2e-06,0,-4e-06,0,9e-06,-9e-06,1e-06,0,-1e-06,-1e-06,3e-06,1e-06,5e-06,4e-06,-7e-06,1e-06,1e-06,-2e-06,-5e-06,-1e-06,3e-06,-2e-06,2e-06,-1e-06,4e-06,-1e-06,1e-06,-2e-06,-2e-06,0,-2e-06,-7e-06,2e-06,3e-06,-5e-06,-1.2e-05,3e-06,-1e-06,0,-1e-06,-6e-06,-1e-06,1e-06,-1e-06,2e-06,0,-3e-06,-4e-06,0,-2e-06,0,2e-06,0,6e-06,-1e-06,-1e-06,1e-06,1e-06,1e-06,-2e-06,1e-06,-3e-06,-3e-06,-1e-06,0,-8e-06,4e-06,-2e-06,-2e-06,1e-06,-1e-05,5e-06,-2e-06,0,2e-06,-7e-06,-2e-06,-3e-06,4e-06,-2e-06,-3e-06,-1e-06,1e-06,0,0,1e-06,-1e-06,0,0,-1e-06,-1e-06,-1e-06,2e-06,0,0,-1e-06,6e-06,7e-06
0,0,2e-06,-4e-06,3e-06,0,7e-06,0,7e-06,0,-1e-06,0,-5e-06,2e-06,4e-06,0,-5e-06,-9e-06,-1e-06,-2e-06,-5e-06,2e-06,2e-06,2e-06,-2e-06,-6e-06,0,-1e-05,5e-06,1e-06,3e-06,2e-06,5e-06,-4e-06,-1e-06,-5e-06,2e-06,3e-06,1e-06,0,1.1e-05,-4e-06,0,-3e-06,0,-1e-06,2e-06,-1e-06,2e-06,2e-06,5e-06,1e-06,-1e-06,2e-06,4e-06,-7e-06,-2e-06,2e-06,2e-05,-1e-06,0,0,2e-06,5e-06,-1e-06,3e-06,2e-06,-1e-06,-1e-06,5e-06,0,-2e-06,-1e-06,-1e-06,0,1e-06,5e-06,2e-06,3e-06,-1e-06,-1.1e-05,-2e-06,1e-06,0,-2e-06,0,0,0,-3e-06,-4e-06,4e-06,-1e-06,0,9e-06,-3e-06,-1e-06,-2e-06,-3e-06,4e-06,0,7e-06,-3e-06,1e-06,0,-2e-06,-1e-06,0,3e-06,-1e-06,2e-06,0,2e-06,0,-1e-06,3e-06,3e-06,-1e-06,0,0,-8e-06,-3e-06
