0.095516,0.077803,0.042269,0.024698,0.020485,0.040781,0.063798,0.06641,0.090015,0.073048,0.033229,0.03779,0.050725,0.179752,0.586557,1.007924,1.074233,0.952201,0.839533,0.758402,0.792054,0.745171,0.56698,0.437215,0.303521,0.192513,0.183303,0.231751
0.113679,0.092206,0.050322,0.030376,0.025212,0.048645,0.075438,0.079482,0.109177,0.08825,0.040197,0.045572,0.062294,0.21742,0.7023,1.217009,1.293406,1.133704,0.99748,0.904482,0.952845,0.917987,0.723274,0.560887,0.387612,0.243933,0.229954,0.283913
0.138142,0.110815,0.061194,0.038823,0.03252,0.0612,0.092912,0.098598,0.138437,0.112286,0.052075,0.0582,0.081174,0.281541,0.894141,1.565606,1.668539,1.456618,1.285882,1.177926,1.247682,1.222205,0.997924,0.776452,0.530509,0.328211,0.303597,0.363413
0.141954,0.111235,0.062935,0.041894,0.036375,0.073902,0.107423,0.106713,0.14921,0.123051,0.060593,0.0675,0.094363,0.33812,1.06074,1.879645,2.04784,1.81393,1.618265,1.518213,1.565799,1.480779,1.225312,0.951455,0.637834,0.385827,0.34469,0.400374
0.132389,0.099668,0.058585,0.039855,0.037237,0.092283,0.126771,0.106679,0.141374,0.11956,0.065906,0.076847,0.107156,0.399206,1.2625,2.236043,2.447696,2.196022,2.001411,1.952551,1.983183,1.7291,1.354057,1.042529,0.687832,0.407892,0.350227,0.393402
0.150895,0.109315,0.064254,0.042889,0.043093,0.136104,0.181905,0.122955,0.138268,0.118369,0.078224,0.101955,0.14142,0.511279,1.551819,2.702766,2.978991,2.772335,2.65041,2.673401,2.699853,2.1921,1.57201,1.147389,0.724465,0.443688,0.372359,0.414389
0.223694,0.158066,0.090728,0.060679,0.060754,0.216982,0.291422,0.166091,0.143627,0.126148,0.108137,0.155202,0.208828,0.707287,2.018511,3.528946,4.055852,4.012728,3.953775,3.923565,3.935346,3.269593,2.359561,1.578701,0.932522,0.593056,0.473625,0.545012
0.327566,0.228146,0.130154,0.089197,0.086908,0.319902,0.431967,0.228401,0.171515,0.156035,0.153503,0.229946,0.299492,0.934634,2.649103,4.785397,5.751519,5.924932,5.922951,5.849272,5.876113,5.032686,3.713941,2.429291,1.426104,0.900127,0.664037,0.755637
0.414819,0.286352,0.163701,0.114593,0.10962,0.405863,0.551151,0.287272,0.212868,0.199408,0.199525,0.298219,0.378889,1.107183,3.51858,6.577605,7.906005,8.241757,8.260129,8.187193,8.275351,7.137358,5.203279,3.404743,2.096468,1.309582,0.902024,0.963107
0.423753,0.294348,0.171329,0.120964,0.115258,0.423714,0.576673,0.31018,0.250417,0.236884,0.221885,0.321937,0.401956,1.162116,4.593284,8.844403,10.4466,10.691303,10.550626,10.485173,10.482172,8.953291,6.228912,4.022076,2.682606,1.695562,1.132537,1.089514
0.34757,0.24912,0.148648,0.102394,0.10216,0.358742,0.480719,0.276147,0.256076,0.240865,0.206464,0.285878,0.356135,1.15559,5.697093,11.125152,13.016524,12.965326,12.499166,12.496645,12.154752,10.135839,6.558275,4.032262,2.971608,1.960136,1.319232,1.092453
0.275879,0.206198,0.120371,0.075858,0.080989,0.256184,0.327545,0.21082,0.239446,0.218487,0.17496,0.233694,0.289124,1.139012,6.30026,12.387204,14.468111,14.255695,13.771384,13.729266,12.874514,10.482006,6.411193,3.741579,2.954433,2.063374,1.421008,0.996982
0.246864,0.193231,0.109278,0.062129,0.064069,0.197409,0.245729,0.181696,0.252084,0.219512,0.150931,0.192344,0.242724,1.105944,5.787735,11.261878,13.305011,13.217324,13.454775,13.345122,11.448328,8.960762,5.385169,3.152352,2.553026,1.805752,1.26076,0.816255
0.229234,0.180674,0.106151,0.064224,0.059372,0.195704,0.257311,0.205163,0.303859,0.258648,0.141266,0.165308,0.226795,1.071468,4.301104,7.81757,9.450746,9.721859,10.617771,10.474775,8.223862,6.210084,3.686869,2.148235,1.711063,1.218912,0.881649,0.623548
0.237276,0.186305,0.111574,0.076294,0.067095,0.246369,0.349321,0.285254,0.431867,0.372032,0.173246,0.185508,0.262299,1.173468,3.240155,4.941204,5.704244,5.89804,6.679738,6.786469,5.715069,4.310723,2.316552,1.232704,0.886438,0.671916,0.576187,0.553552
0.304097,0.23763,0.130001,0.094503,0.088672,0.356162,0.528236,0.426327,0.64488,0.570078,0.254632,0.245707,0.330739,1.435006,3.367163,4.595649,4.66879,4.677242,4.936197,4.669736,4.619085,3.813027,2.086213,1.068217,0.607419,0.466794,0.505502,0.637558
0.410637,0.333182,0.173461,0.122604,0.122311,0.50522,0.760219,0.59795,0.893949,0.799563,0.350097,0.317859,0.402302,1.674451,3.764063,5.366324,5.632318,5.51894,5.266972,4.513945,4.895623,4.38334,2.645745,1.497785,0.779705,0.564414,0.614671,0.792308
0.479123,0.417302,0.22955,0.154021,0.153737,0.630549,0.949434,0.730898,1.076225,0.958403,0.409339,0.362258,0.430737,1.671334,3.931663,6.317739,7.120585,6.59973,5.89218,5.176386,5.938069,5.452688,3.405578,1.991742,1.010369,0.698073,0.728925,0.891947
0.45033,0.432137,0.264975,0.166187,0.162075,0.650007,0.971195,0.743007,1.083456,0.945104,0.389763,0.347432,0.386855,1.431958,3.848072,7.012125,8.289228,7.389322,6.499536,6.016555,6.669469,6.086698,3.995879,2.357671,1.130206,0.719642,0.740354,0.848323
0.357195,0.375046,0.260727,0.151761,0.138073,0.539607,0.796051,0.625575,0.926107,0.782508,0.310279,0.29426,0.311816,1.178342,3.825686,7.498233,9.071661,8.350886,7.305487,6.46384,6.503401,5.734774,4.021882,2.439099,1.07072,0.61335,0.639592,0.695383
0.273302,0.29254,0.221445,0.123983,0.100013,0.377723,0.544103,0.449485,0.692415,0.565307,0.221176,0.23529,0.239591,0.907888,3.801457,7.744514,9.096522,8.717999,7.871086,6.61596,5.987874,4.931535,3.532522,2.176511,0.896596,0.449038,0.469974,0.509252
0.187333,0.19955,0.157707,0.091056,0.067816,0.251918,0.358972,0.303513,0.486788,0.405876,0.179269,0.198837,0.195685,0.681115,3.486724,7.235065,8.027116,7.771553,7.318347,6.068036,5.186425,4.024811,2.73457,1.598063,0.680874,0.320012,0.302471,0.320812
0.116378,0.125227,0.105934,0.069858,0.054356,0.166991,0.235647,0.19785,0.303644,0.263594,0.13915,0.157817,0.167961,0.590549,2.961298,6.278323,7.094877,6.674709,5.979664,4.954957,4.354097,3.224607,1.89279,1.003427,0.481245,0.244038,0.226226,0.229645
0.075566,0.095169,0.096118,0.066772,0.051908,0.106745,0.145202,0.123897,0.163589,0.14541,0.094126,0.111236,0.132459,0.561672,2.550843,5.251972,6.217166,5.965225,4.995761,4.007299,3.609495,2.592852,1.475495,0.827302,0.408056,0.238475,0.234886,0.227792
0.055183,0.083674,0.089462,0.059916,0.047914,0.07815,0.10209,0.083825,0.086051,0.076295,0.059005,0.071519,0.095714,0.567793,2.332045,4.322025,4.900314,5.368322,4.79711,3.364323,2.943649,2.208326,1.360725,0.814352,0.397713,0.256218,0.232611,0.236101
0.048373,0.076438,0.073685,0.046479,0.044243,0.071157,0.084878,0.065307,0.06735,0.060496,0.042533,0.046884,0.073957,0.58401,2.279064,3.70899,3.634789,4.529066,4.515468,2.970675,2.497709,1.907904,1.293608,0.809717,0.414455,0.28036,0.224455,0.234676
0.045745,0.066676,0.059666,0.038121,0.04219,0.061403,0.06407,0.047321,0.053217,0.051641,0.035897,0.035174,0.070512,0.636572,2.632963,4.134265,3.430254,3.927493,4.102765,2.647635,2.195869,1.789541,1.273993,0.799094,0.440913,0.300235,0.215084,0.213091
0.046033,0.058457,0.052097,0.037559,0.038647,0.047379,0.048672,0.037407,0.043868,0.048294,0.034034,0.029088,0.072104,0.677074,2.864641,4.44913,3.406926,3.475061,3.683775,2.367859,2.005335,1.760487,1.202815,0.749437,0.4541,0.309514,0.197256,0.163399
0.053489,0.057569,0.04981,0.040579,0.035987,0.037111,0.042464,0.041997,0.04901,0.054877,0.041577,0.030839,0.067407,0.614059,2.547814,3.974398,3.238068,3.403589,3.491073,2.193239,1.820324,1.607287,1.086418,0.72431,0.449759,0.296539,0.176594,0.137315
0.065357,0.064943,0.052871,0.046211,0.039069,0.042973,0.05619,0.059666,0.064515,0.069371,0.055759,0.040696,0.061524,0.552425,1.991239,2.917761,2.76483,3.392627,3.395614,2.090765,1.693976,1.526494,1.020607,0.679044,0.417228,0.255537,0.15405,0.136215
0.081076,0.075331,0.05859,0.056853,0.049685,0.058185,0.07922,0.081307,0.080659,0.08333,0.072418,0.056037,0.065503,0.609603,1.953025,2.35435,2.256894,3.015212,3.026654,2.230326,1.807955,1.384138,0.862668,0.565768,0.360973,0.208806,0.140246,0.145409
0.091969,0.081526,0.064991,0.065244,0.057473,0.069839,0.094977,0.093401,0.092016,0.094631,0.083465,0.066306,0.072912,0.679346,2.211694,2.43022,1.86372,2.3487,2.475183,2.250102,1.878062,1.201459,0.719809,0.493385,0.325609,0.205451,0.148844,0.164294
0.084534,0.072124,0.061257,0.061622,0.053032,0.066979,0.09031,0.085315,0.089296,0.092456,0.078084,0.062575,0.068477,0.660975,2.209971,2.43763,1.587496,1.816249,2.002234,2.015771,1.697399,1.03114,0.741161,0.542603,0.337018,0.208267,0.149682,0.164673
0.059526,0.048798,0.044998,0.045817,0.037701,0.049226,0.066222,0.063454,0.078904,0.078506,0.056907,0.046088,0.053585,0.5401,1.840064,2.058118,1.363684,1.539162,1.727122,1.75952,1.436772,0.944868,0.791043,0.561501,0.359671,0.210877,0.132779,0.1376
0.035401,0.029645,0.031741,0.034767,0.027902,0.032141,0.046363,0.047848,0.071357,0.067346,0.035393,0.031318,0.042296,0.377182,1.363923,1.577072,1.182731,1.447785,1.681496,1.821588,1.542676,1.014149,0.715293,0.472027,0.360962,0.231907,0.127614,0.118688
0.027832,0.024212,0.032595,0.03801,0.030309,0.030514,0.046998,0.047045,0.063304,0.05642,0.024157,0.024947,0.039941,0.308678,1.171776,1.420754,1.133946,1.494797,1.679703,1.788043,1.634791,1.020161,0.538402,0.329021,0.330265,0.253015,0.142434,0.13318
0.027746,0.027333,0.035188,0.040644,0.034627,0.036684,0.050965,0.04823,0.054587,0.047091,0.022832,0.023505,0.039443,0.326706,1.187378,1.521729,1.304961,1.585177,1.525886,1.433003,1.443035,0.863802,0.380878,0.279035,0.314279,0.240942,0.149598,0.167283
0.029631,0.037295,0.037331,0.038643,0.036902,0.041629,0.048494,0.046065,0.050093,0.043143,0.025388,0.024023,0.037628,0.336326,1.342581,1.976435,1.776558,1.823108,1.435655,1.020845,1.017842,0.610269,0.29146,0.287304,0.280053,0.192613,0.13448,0.185446
0.037699,0.049778,0.040882,0.044117,0.048192,0.047349,0.042488,0.044817,0.059786,0.050335,0.028516,0.026201,0.037509,0.303881,1.457593,2.499359,2.267882,2.038277,1.622358,0.934627,0.626447,0.410724,0.298282,0.279188,0.213644,0.152999,0.112153,0.180923
0.050565,0.059315,0.044215,0.055709,0.067313,0.058717,0.041489,0.046871,0.069778,0.057335,0.031091,0.028987,0.037461,0.239893,1.443818,2.821158,2.451886,1.95273,1.744598,1.012581,0.500691,0.298581,0.318063,0.252789,0.155337,0.138073,0.125138,0.190441
