-0.000168,-4.1e-05,-4.1e-05,3.9e-05,-4.6e-05,-1.7e-05,6e-06,-0.000161,-9.3e-05,-2.4e-05,-4.1e-05,-5.1e-05,0.000196,4.2e-05,0.000161,5.9e-05,-5.3e-05,3e-05,2.1e-05,0.000229,8.2e-05,4.9e-05,-1.6e-05,9.3e-05,-4e-06,0.000102,-8.7e-05,1.9e-05,7e-05,0.000121,0.000158,7.3e-05,-7.3e-05,-6.6e-05,-7.1e-05,-2e-06,4e-05,6.8e-05,4e-06,-2.3e-05,-7e-06,-1e-05,-3.1e-05,-3.4e-05,-0.000152,-1e-06,2.8e-05,0.000129,6.8e-05,5.5e-05,-1.9e-05,0.000138,-2.8e-05,9.5e-05,4.4e-05,1.5e-05,3.8e-05,0.000147,6.4e-05,-5.8e-05,-0.000147,-8.4e-05,-7.7e-05,-9e-06,4.4e-05,5e-05,-3e-05,1.8e-05,0.000121,0.000186,0.000133,0.000115,0.000136,4.8e-05,0.000109,0.00014,-3.9e-05,7.4e-05,0.00012,1.8e-05,1.7e-05,5.5e-05,2e-05,0.000153,4e-06,0.000149,6e-06,0.000128,0.000274,0.000209,-4e-06,8.6e-05,-2.6e-05,1e-06,7e-05,0.000238,0.000238,5.5e-05,4e-05,3.6e-05,-7e-06,0,5e-05,0.000215,7.4e-05,4.6e-05,-1.2e-05,2.7e-05,3.1e-05,0.00011,0.000258,9e-05,3e-05,-2.1e-05,2e-04,0.000108,0.000101,5.4e-05,8e-05,-6e-06,5.1e-05
-1.4e-05,-3e-06,-2e-05,-6.6e-05,-0.000161,-3.8e-05,-8.4e-05,-3.9e-05,-4.7e-05,-0.00021,-3.8e-05,-0.000145,-4.5e-05,1.7e-05,-0.000173,-0.000245,-2.4e-05,2e-05,-6.8e-05,-8.9e-05,-0.000171,-4.2e-05,8.9e-05,-0.000214,-0.000132,-0.000181,-9.9e-05,3.4e-05,-2.3e-05,-5.6e-05,-2e-04,-0.000234,-6.4e-05,-1e-04,-8e-05,-0.000114,-4.1e-05,-0.000166,-9.1e-05,0.000133,-0.000115,-6.3e-05,-0.000218,-0.000114,-7e-06,-0.000176,-0.000213,-0.000122,-0.000113,2.9e-05,1.6e-05,-0.000284,-0.00013,-3.3e-05,-4.6e-05,-1.4e-05,-6.7e-05,-0.000109,-1e-04,1.2e-05,8.8e-05,-2.4e-05,-0.000136,-0.000157,-8.8e-05,-0.000379,-0.000152,-0.000175,2e-05,-0.000133,-0.000344,-0.000209,-0.000131,-0.000104,-5.6e-05,-1e-05,-0.000153,-0.000111,-0.000346,-0.000116,-9.4e-05,-0.000267,-0.000221,-0.000171,-4.5e-05,3e-06,-4e-06,-0.000113,-0.000177,-0.000343,-0.00012,-9.6e-05,6e-06,2.1e-05,-0.000103,-0.000116,-4e-05,-6.5e-05,-0.000127,-0.000161,-6.3e-05,-4.1e-05,-0.000129,-0.000132,-2.3e-05,-0.000119,-9.2e-05,-8.3e-05,-4.6e-05,-0.000153,-0.000255,-6.4e-05,-0.000107,-7.3e-05,-0.000249,-0.000451,-0.000262,-0.000233,-0.000198,-0.00011,-0.000149
-0.000107,-6.6e-05,-7.1e-05,-0.000134,0.000162,6.8e-05,-7.6e-05,-7.9e-05,0.000151,5.1e-05,-2e-06,0.000107,-0.000136,-0.000257,-0.000102,6.7e-05,5.4e-05,-5.1e-05,-0.000138,-0.00025,-0.000261,-8.5e-05,-6.9e-05,-0.000107,-2.4e-05,-0.000173,-0.000255,-5.1e-05,-0.000195,-0.000157,-0.000191,-3.1e-05,-0.000192,-0.000163,-6.6e-05,-2.9e-05,-0.000122,-8.6e-05,-0.000114,-7.6e-05,-9.1e-05,-0.00014,-6e-05,-3.2e-05,-5.4e-05,-1.2e-05,3.3e-05,-0.000104,-8e-05,-4.5e-05,-9.7e-05,-8.6e-05,-9.7e-05,-7.5e-05,-6.6e-05,-0.000218,-0.000136,-0.000155,-2.7e-05,2.8e-05,-2.9e-05,5e-06,0.000114,-3e-05,-0.000398,-0.000139,-1.3e-05,-7.5e-05,-8e-05,-0.000236,-2.3e-05,-6.2e-05,-7e-06,-0.000132,-0.000196,-0.000175,-0.00014,-6.3e-05,3.8e-05,-0.000115,-2.2e-05,-2.3e-05,3.9e-05,-0.000189,-6e-05,-9.4e-05,-3.3e-05,-0.000199,-0.000131,-0.00014,-0.000101,-0.000187,-0.000127,-4.4e-05,-1e-04,3.5e-05,-1.7e-05,4.1e-05,-6.9e-05,-0.000233,-6.8e-05,4.2e-05,-7.2e-05,-0.000237,-0.000124,-0.000133,-8e-06,-2.1e-05,-6e-06,-5.2e-05,-2e-04,-0.000154,-0.000143,4e-06,-0.000205,-0.000155,-6.6e-05,0.000115,-0.000205,-0.000156,-4.1e-05
3e-05,-9e-06,-1e-06,0.000126,-0.000127,-6.1e-05,4.1e-05,2.5e-05,-0.000138,-6.6e-05,-0.000103,-3.6e-05,-8e-05,5.9e-05,0.000189,0.000111,5.9e-05,9.2e-05,-6.3e-05,-5e-06,4.8e-05,-3.5e-05,1.8e-05,-0.000121,-1.2e-05,-4.2e-05,-1e-05,-1.9e-05,1.9e-05,-0.000163,-5.6e-05,2e-05,3e-05,8e-05,5.5e-05,-4.5e-05,1e-05,0.000136,2.5e-05,1.3e-05,9.1e-05,-7e-06,1e-04,0.000161,-8.5e-05,0.000141,5.1e-05,0.000103,2.7e-05,-7.5e-05,-1.7e-05,0.000173,5.8e-05,-2.5e-05,4.1e-05,5.6e-05,-6.5e-05,-6e-06,1.8e-05,-1.5e-05,1.1e-05,-0.000175,-9.9e-05,-9.4e-05,9e-05,0.000177,0.000128,3.7e-05,-3.5e-05,3.9e-05,8.4e-05,2.6e-05,-4.9e-05,-7.4e-05,-6.5e-05,-4.1e-05,6.3e-05,0.000163,0.000178,0.000239,7e-05,1.2e-05,9.9e-05,6.9e-05,1.3e-05,-5.6e-05,-6.5e-05,1.2e-05,-1.5e-05,0.000249,4.7e-05,4.6e-05,5.3e-05,7.4e-05,2.2e-05,-6.9e-05,-6.6e-05,4.3e-05,-6.1e-05,2.2e-05,-1e-06,-4.4e-05,2.4e-05,5.1e-05,9e-06,-7e-05,-9.1e-05,-4.5e-05,-2.8e-05,4.8e-05,-0.000103,5.1e-05,0.000167,0.000104,0.000198,0.000176,9.7e-05,-0.000144,7.1e-05,7.8e-05,5.1e-05
9.7e-05,-5e-06,0.000112,3.7e-05,-2.9e-05,5e-06,5.1e-05,5.1e-05,0.000122,0.000101,6.3e-05,-8e-06,-4.6e-05,0.000122,0.000101,-3.6e-05,-2.5e-05,-8.8e-05,5.1e-05,7.5e-05,0.000145,-1.9e-05,2e-06,7e-06,-5.1e-05,6e-05,8.6e-05,0.000106,2.6e-05,4.2e-05,0.00022,0.000119,0.000248,0.000112,8e-06,1.7e-05,5.5e-05,7e-06,6.7e-05,-2e-05,-2e-06,0.000164,8e-05,-1.6e-05,4.9e-05,-4.8e-05,-3.6e-05,2.5e-05,0.000142,-3.8e-05,8.1e-05,4.3e-05,-4.7e-05,1.6e-05,3e-05,0.000114,0.000103,1.2e-05,5.2e-05,4.6e-05,2.9e-05,9.6e-05,5.4e-05,0.000141,7.6e-05,8.1e-05,9e-05,9e-06,-6.3e-05,0.000138,0.000132,1.9e-05,4e-06,8.1e-05,6.6e-05,2.2e-05,0.000115,-0.00016,-4.1e-05,5.3e-05,4.5e-05,1.8e-05,-0.000105,7.6e-05,-3.2e-05,1.3e-05,4.1e-05,-4e-06,2.9e-05,1.1e-05,-1.6e-05,1e-06,3.9e-05,-4.9e-05,-3e-06,-2.6e-05,1.2e-05,-7.4e-05,1e-04,0.000122,4.5e-05,-4.3e-05,5.5e-05,0.000156,0.000112,9.1e-05,5.4e-05,4.3e-05,1.7e-05,2.9e-05,0.000154,8.1e-05,-2.4e-05,-4e-05,6e-06,8.1e-05,-5.6e-05,3.2e-05,-7e-06,9.5e-05,-5.4e-05
-4.8e-05,-4e-06,-1.7e-05,-2.4e-05,-2.5e-05,5e-05,4e-06,-6.2e-05,1.1e-05,-2.7e-05,-8.9e-05,-3.1e-05,6.1e-05,6e-05,-4e-05,-0.000139,1.2e-05,1.2e-05,9.4e-05,6e-06,2.2e-05,-2.2e-05,5.6e-05,0,6.9e-05,-7e-06,0.000106,-4.6e-05,1.7e-05,2.6e-05,-3.1e-05,2e-06,-5e-06,-4.2e-05,1.2e-05,3.2e-05,5.2e-05,-1.6e-05,-4.2e-05,3.5e-05,7.8e-05,5.7e-05,-1.4e-05,-4.5e-05,-1.9e-05,9e-05,-5.4e-05,-0.000156,-4.1e-05,2.9e-05,-9e-06,-3.8e-05,1.3e-05,-1.1e-05,0,2.3e-05,6.6e-05,-1e-06,0,-3.2e-05,-1.4e-05,-1.3e-05,4.5e-05,4.9e-05,5e-06,-8.3e-05,-1e-04,-1e-06,1.9e-05,0,-3.5e-05,0.000102,2.6e-05,6.6e-05,0.000116,0.000154,1.1e-05,-3.5e-05,-4.4e-05,-0.000111,-7e-05,-6.4e-05,-6.7e-05,-5.4e-05,3.4e-05,-6.4e-05,0.000101,4.6e-05,4.2e-05,3e-06,5.4e-05,2.9e-05,-2.7e-05,0.000128,2.5e-05,0.000141,-7.4e-05,-6e-06,-5.3e-05,-0.000169,-2.8e-05,5.1e-05,-9.6e-05,-0.000107,0.000121,5.2e-05,7.8e-05,4.4e-05,-7.3e-05,9.4e-05,-9e-06,3.1e-05,3.8e-05,5.8e-05,4.4e-05,-3.6e-05,3.7e-05,9.6e-05,6.4e-05,-0.000102,-2.4e-05
1.2e-05,3.4e-05,-3.2e-05,-3.5e-05,9.6e-05,-0.000125,-3.2e-05,-4.5e-05,-2.6e-05,-5.1e-05,1.4e-05,9e-06,-5.4e-05,9e-06,-0.000113,-6e-06,4.1e-05,8e-06,-2.7e-05,-5.9e-05,-6e-05,-8.4e-05,-4.1e-05,2.8e-05,-1e-05,2.3e-05,-7.3e-05,4.9e-05,1.5e-05,0.000101,3.6e-05,-8.3e-05,-0.00013,-8.1e-05,-1e-06,-9e-06,-2.2e-05,-3.8e-05,-8e-06,-1.1e-05,-2.6e-05,-8.2e-05,-0.000101,1.8e-05,1.6e-05,-7e-05,7.3e-05,2.4e-05,-9.8e-05,-3.4e-05,4e-06,-7e-06,1.5e-05,3.3e-05,-0.000111,-8.7e-05,-6.2e-05,-7e-05,4e-06,1.2e-05,4e-06,-4.2e-05,-3e-05,-7.9e-05,-4.1e-05,-0.000136,2.7e-05,6e-05,1e-04,-1.5e-05,-1e-04,1.8e-05,-7e-06,5.2e-05,-4.7e-05,-4.9e-05,-5.7e-05,1.7e-05,4.5e-05,-2.9e-05,-8.2e-05,3.1e-05,9.4e-05,2.2e-05,4.2e-05,-7.5e-05,5.9e-05,-1.7e-05,-6.4e-05,-6.9e-05,7.4e-05,-2.2e-05,-0.000117,-0.000101,1.1e-05,-3e-05,-0.00017,3.2e-05,-5e-06,-2e-06,-9e-06,-5.2e-05,-6e-06,-1.6e-05,3.6e-05,-7.9e-05,-9.8e-05,3.3e-05,-2.7e-05,2.8e-05,-7.8e-05,-0.000109,-8.8e-05,-1.4e-05,5e-06,-9e-05,0.000142,-3.6e-05,-2.3e-05,-6.8e-05,3.7e-05
-3.6e-05,-1.4e-05,-2.9e-05,3.6e-05,-4.1e-05,-3.4e-05,4e-06,3e-06,-3.8e-05,8.5e-05,0.000123,4.5e-05,-4.6e-05,-4.8e-05,-3.2e-05,3e-05,-8.2e-05,-1.2e-05,3e-06,-0.000108,-1e-05,6.4e-05,-1e-05,-1.6e-05,-5.2e-05,-2.5e-05,-1.1e-05,-0.000136,-2.3e-05,-4.8e-05,-5.5e-05,-0.000117,2.1e-05,-4.7e-05,-3.6e-05,-6e-06,-7.6e-05,-2e-06,4e-06,-1.8e-05,-3e-05,7e-06,-5e-06,-8e-06,3.3e-05,2.2e-05,4.7e-05,3.7e-05,-6.1e-05,-3.8e-05,-8e-05,8e-06,-1.5e-05,-2.9e-05,-5.7e-05,-5.5e-05,-1.7e-05,-7.1e-05,-5.4e-05,3.5e-05,2.4e-05,6e-06,2.2e-05,4.9e-05,-4.9e-05,1.5e-05,-8e-06,-5.2e-05,-5.2e-05,9e-06,-3.5e-05,-0.000103,-8.2e-05,-1.9e-05,-3.8e-05,-5.2e-05,-5.8e-05,1.9e-05,-1.1e-05,1.5e-05,1.3e-05,5.6e-05,1.9e-05,5.5e-05,-6e-06,-3e-06,-3.5e-05,-6e-05,-0.000134,-3.1e-05,3.7e-05,-3e-06,-1.7e-05,-6e-05,-2.8e-05,-4.6e-05,-1.6e-05,4.7e-05,4.3e-05,2.9e-05,4e-06,-2e-06,-4e-05,-4e-06,-8.2e-05,-5.1e-05,-3.1e-05,8e-06,9e-06,-4.7e-05,-4.8e-05,-0.000121,-2e-05,1.5e-05,1.1e-05,4.7e-05,-0.000119,-6e-05,-4.3e-05,1e-06,4.3e-05
-2e-06,-5e-05,-7e-06,1.7e-05,-3.6e-05,-7e-06,-2.1e-05,-1.7e-05,-3.1e-05,-5.4e-05,-7.9e-05,-3.1e-05,4.6e-05,-5.8e-05,4.2e-05,-2.4e-05,4e-06,-4.6e-05,4.8e-05,3.7e-05,5.1e-05,4.7e-05,-9e-06,1.3e-05,9e-06,-2.4e-05,-2e-06,-3.5e-05,3.5e-05,-5e-05,-6.2e-05,6.1e-05,6e-06,6.7e-05,-4.5e-05,2e-06,1.5e-05,1.5e-05,0,-2.7e-05,-1.8e-05,-2.1e-05,8.8e-05,4.3e-05,0,-3e-06,-0.00013,-4.9e-05,8e-06,-1.7e-05,-2.6e-05,1.1e-05,2.1e-05,-8.4e-05,3.9e-05,0,-1.2e-05,2.2e-05,-2.6e-05,-1e-06,-4.5e-05,-1.9e-05,-8.4e-05,-2e-06,-1.2e-05,5.5e-05,3e-06,-7.5e-05,-7e-05,-6.3e-05,1.8e-05,3e-05,1e-06,-5.4e-05,-6.2e-05,-3.4e-05,-1e-05,2e-06,-9.9e-05,-4.4e-05,2.6e-05,-1.1e-05,-1.3e-05,-7e-06,-6e-05,1e-05,-3.9e-05,-3.9e-05,-3.6e-05,0,-0.000128,-7e-05,3.1e-05,-2.3e-05,-3.4e-05,-2.4e-05,3.5e-05,-6e-06,-4.6e-05,4e-05,-2.7e-05,-1.9e-05,-2.3e-05,9e-06,-4e-05,-1.1e-05,-4.9e-05,-9.7e-05,1.1e-05,1.6e-05,7e-06,4e-06,5.9e-05,-2e-05,-3.8e-05,-3.5e-05,-0.000111,2e-06,2e-05,0.000104,-1.1e-05
0,-9e-06,-6e-06,1.5e-05,-5e-06,-1.5e-05,2.3e-05,1.4e-05,2.9e-05,4e-05,-2.1e-05,3.3e-05,-3.7e-05,-1e-05,7e-06,-3.5e-05,2.2e-05,-9e-06,-1.9e-05,3.5e-05,4e-06,7e-06,-3.4e-05,-3.3e-05,-2.7e-05,3.3e-05,-2.5e-05,6.2e-05,1.2e-05,-2.5e-05,-1.1e-05,9.5e-05,-1.3e-05,2.5e-05,5.7e-05,-1.3e-05,-2e-06,2.6e-05,4e-06,-2e-06,-7e-06,2.3e-05,-1.3e-05,-1.9e-05,-5.2e-05,-8e-06,2e-06,1.6e-05,-3.7e-05,-1.1e-05,7e-06,-2e-06,-1.5e-05,-1.3e-05,-2.7e-05,-9e-06,3.8e-05,3.4e-05,-2.3e-05,-3.6e-05,-1.2e-05,1.8e-05,1e-05,-1e-05,2.7e-05,4.5e-05,-5e-06,6.2e-05,1.7e-05,2e-06,1e-06,8e-05,6.2e-05,2.3e-05,6e-05,1.9e-05,5.5e-05,-5.4e-05,-5e-06,-7e-06,-8e-06,-1.3e-05,-5.2e-05,-5.7e-05,-5.3e-05,-2.2e-05,-3e-06,-1.9e-05,7e-05,1.4e-05,7.3e-05,-1e-05,5.5e-05,6e-06,3.5e-05,-8e-06,1.2e-05,-8e-06,-2e-05,1.4e-05,3.5e-05,-7.8e-05,1.5e-05,-1.6e-05,4.5e-05,-1.3e-05,1e-05,3.5e-05,1.6e-05,-2.2e-05,-3.1e-05,-9e-06,4e-06,2.2e-05,-1.4e-05,4e-06,3.4e-05,3.2e-05,0,-1.3e-05,-4.4e-05
5e-06,6e-05,4e-06,-2.6e-05,2.4e-05,2.4e-05,1.6e-05,-6e-06,-9e-06,3.4e-05,5e-06,9e-06,-1.1e-05,-7e-06,-5e-06,-1.8e-05,-7e-06,-3.3e-05,-3.1e-05,3.8e-05,1.1e-05,-7.4e-05,-2.8e-05,4e-06,8e-06,6.9e-05,5e-06,6e-05,5e-05,6.7e-05,3.1e-05,-5.6e-05,-8e-06,-8e-06,-3.6e-05,-3e-06,-1e-05,-1e-05,5e-06,-1e-06,0,-1.8e-05,-1.5e-05,4e-06,4.4e-05,1.1e-05,1.8e-05,3e-06,-3.7e-05,4e-05,8e-06,5e-06,8e-06,6e-05,2e-05,-2.5e-05,-4e-06,9e-06,1e-05,-3.2e-05,-2.1e-05,-1.3e-05,1.2e-05,2.6e-05,4e-06,-3.2e-05,-2.7e-05,3.8e-05,0,2.1e-05,-1e-06,1e-06,1e-06,2.4e-05,-1e-06,1.6e-05,2.3e-05,1.5e-05,4.2e-05,1e-06,-3.4e-05,-8e-06,-2.3e-05,1.6e-05,2.3e-05,4e-05,-5e-06,1.6e-05,1.2e-05,-1.9e-05,4.8e-05,4.2e-05,-3.3e-05,1e-06,-6e-06,-2.3e-05,1e-06,-4.5e-05,3.7e-05,-3.1e-05,-1.6e-05,1.1e-05,9e-06,-2.7e-05,-3.1e-05,5.3e-05,2e-06,-5e-06,-2.6e-05,0,2.4e-05,3.3e-05,-5.5e-05,-2.2e-05,3.1e-05,-1e-05,6.1e-05,-4.6e-05,8e-06,-1e-06,4.8e-05
-1.3e-05,-9e-06,4e-05,-9e-06,7e-06,1.7e-05,-5.6e-05,1.3e-05,-1.3e-05,-3.5e-05,-6e-06,-3.5e-05,4e-06,-1.3e-05,-2.9e-05,2e-05,-4e-05,-3.9e-05,2.9e-05,-5e-06,-2e-06,-7e-06,2e-06,3.7e-05,1e-06,-3.1e-05,4e-06,-2.8e-05,-5.3e-05,-3.3e-05,0,1.1e-05,-2.3e-05,1.4e-05,1.4e-05,3.8e-05,2e-05,-2.6e-05,-8e-06,1.6e-05,1.2e-05,-6e-06,-1.8e-05,2e-06,2.5e-05,5e-06,-1.2e-05,-2e-06,3.1e-05,-2.9e-05,6e-05,-4e-05,8e-06,-1.1e-05,-2.1e-05,6e-06,-3e-06,-1.6e-05,-2.8e-05,2e-05,-4e-06,1.4e-05,8e-06,1.5e-05,-1.1e-05,0,-1.2e-05,-4.4e-05,1.7e-05,6e-06,1.4e-05,-3.5e-05,-1.2e-05,-3.2e-05,8e-06,-3e-06,-2.6e-05,2.2e-05,2.3e-05,-1.3e-05,2.4e-05,8e-06,9e-06,1e-06,-1.1e-05,-1.9e-05,-2.6e-05,1.3e-05,-2.2e-05,-3.6e-05,-3.1e-05,7e-06,-4e-06,-1.7e-05,1.4e-05,-5e-06,-2.4e-05,3.3e-05,4.7e-05,2.7e-05,3e-06,2.7e-05,-1.1e-05,8e-06,-2.7e-05,4e-06,-9e-06,-6e-06,-1.3e-05,-4.8e-05,1.5e-05,0,-3.6e-05,6e-06,-2.1e-05,1.1e-05,3.9e-05,7.1e-05,-1e-05,4e-06,2e-05
1.6e-05,-2.2e-05,-1.5e-05,-2e-06,-2e-05,1.3e-05,1.8e-05,-4e-06,7e-06,1.1e-05,1.9e-05,-4e-06,1.6e-05,-7e-06,-2.5e-05,1.6e-05,-1e-06,5.1e-05,-1e-06,3e-05,-1.3e-05,1.4e-05,-1e-06,-5e-06,1e-06,-1.8e-05,-4e-06,-3e-06,-1.5e-05,0,1e-06,-3e-05,-3.1e-05,-7e-06,-9e-06,-3e-06,-4e-06,7e-06,-7e-06,4e-06,-1.2e-05,-1.6e-05,-1.3e-05,9e-06,-2.2e-05,-5e-06,3.5e-05,-2.8e-05,1.2e-05,3.6e-05,2e-05,1e-06,-1.5e-05,-1e-05,1.4e-05,-8e-06,6e-06,-1.1e-05,1.4e-05,1e-06,-1.3e-05,1.3e-05,2e-06,2e-06,9e-06,-2e-05,-4e-06,-2.2e-05,-1.3e-05,-1e-05,-1.3e-05,-4.1e-05,1.1e-05,-2e-05,2.4e-05,-4e-06,3e-06,9e-06,-1.2e-05,-5e-06,1.2e-05,3.5e-05,3e-06,1e-06,-1.3e-05,-3.8e-05,-4.3e-05,-3e-06,1.2e-05,-2e-06,-1.3e-05,-1.3e-05,3e-06,-2e-06,-1.3e-05,-6e-06,-4.8e-05,-1.9e-05,6e-06,-7e-06,0,5.4e-05,9e-06,-2.6e-05,-5e-06,-2.6e-05,0,-1.1e-05,-2.3e-05,-2.2e-05,-1.1e-05,4e-06,5e-06,-7e-06,-2.8e-05,-8e-06,-4.8e-05,-6e-06,-2e-06,-1.6e-05,8e-06
2e-06,-6e-06,-3e-06,-8e-06,-1.6e-05,-2.8e-05,2e-06,0,1.5e-05,-1.5e-05,-8e-06,1e-05,3e-06,2.3e-05,1e-06,-3e-06,2.4e-05,-2.6e-05,-2.2e-05,-1e-06,-2e-06,4e-06,2.6e-05,7e-06,4e-06,-2e-06,-6e-06,-3.3e-05,-2e-06,1e-05,-3e-06,-8e-06,1.8e-05,-2e-06,-6e-06,-2.2e-05,1e-05,-1.2e-05,7e-06,-7e-06,-2e-06,-4e-06,4e-06,-1.2e-05,-2.5e-05,-1.1e-05,-2.6e-05,2e-06,-1.2e-05,4e-06,-2.6e-05,-3e-06,1.5e-05,6e-06,-3.6e-05,1.7e-05,-8e-06,1e-06,-5e-06,-2e-06,-3e-06,-1e-06,3e-06,-2.7e-05,5e-06,1e-06,-9e-06,1.1e-05,1e-06,-6e-06,-9e-06,1.7e-05,-5e-06,1.2e-05,-1.1e-05,4e-06,-1.2e-05,-2e-06,3e-06,0,-2e-05,-2.7e-05,4e-06,2e-06,8e-06,-8e-06,2.6e-05,8e-06,-1e-06,5e-06,-1.3e-05,-3e-06,-1.9e-05,1.8e-05,6e-06,2e-06,2e-06,-4e-05,1.3e-05,-1e-05,-2e-06,-2.8e-05,-5e-06,2e-06,1.6e-05,-1.2e-05,-6e-06,-2.3e-05,-6e-06,1.9e-05,1e-05,5e-06,1e-05,-2e-06,-1.4e-05,-6e-06,3e-06,-4.6e-05,-3e-06,-1.5e-05,-4.8e-05
-1e-06,5e-06,2e-06,8e-06,1.1e-05,-8e-06,-2.3e-05,8e-06,-5e-06,1.4e-05,-1e-05,9e-06,-4e-06,4e-06,1.7e-05,-1.9e-05,2e-06,-5e-06,7e-06,-4e-06,-4e-06,8e-06,1.4e-05,-3e-06,-2e-06,-1.6e-05,1.1e-05,1.1e-05,7e-06,4e-06,2e-06,-6e-06,3.3e-05,-3e-06,2.1e-05,1e-06,-1.3e-05,9e-06,-3e-06,-5e-06,6e-06,-1.2e-05,-5e-06,7e-06,3.2e-05,9e-06,-6e-06,1.3e-05,3e-06,1.6e-05,6e-06,6e-06,-6e-06,-5e-06,6e-06,2.6e-05,-6e-06,6e-06,4e-06,2e-06,6e-06,0,6e-06,1e-06,-1e-06,1.4e-05,1e-05,6e-06,8e-06,4e-06,1e-06,3e-06,1.2e-05,-5e-06,-9e-06,-1.4e-05,2e-06,-2e-05,-5e-06,1.1e-05,1.3e-05,-2e-06,-3e-06,-6e-06,1.2e-05,2.5e-05,-8e-06,2e-06,-5e-06,9e-06,1e-06,0,4e-06,2.4e-05,-2e-06,-1.1e-05,2.6e-05,-8e-06,7e-06,2.1e-05,1e-05,-2.5e-05,-7e-06,1.5e-05,1e-05,1.7e-05,5e-06,1e-06,2.3e-05,-1e-06,3e-06,-1.3e-05,1.9e-05,1e-06,3e-06,7e-06,3.5e-05,-2.2e-05,-6e-06,3.7e-05,-4e-06
0,8e-06,5e-06,9e-06,1.1e-05,3e-06,2e-05,-7e-06,-4e-06,-1.9e-05,-5e-06,3e-06,1.3e-05,-3e-06,2e-05,-9e-06,-1.6e-05,8e-06,0,1e-06,-4e-06,-6e-06,-4e-06,8e-06,2e-06,-5e-06,4e-06,-5e-06,1e-06,1.4e-05,-3e-06,1.6e-05,-2e-05,-2e-06,1e-06,1e-05,1e-06,6e-06,4e-06,1.1e-05,7e-06,8e-06,1.5e-05,3e-06,-3e-06,-8e-06,1.1e-05,-1e-06,2e-06,-1.1e-05,-6e-06,1.3e-05,5e-06,8e-06,1.2e-05,-5e-06,1e-06,0,6e-06,-7e-06,8e-06,0,8e-06,-4e-06,8e-06,7e-06,7e-06,-2e-06,2e-06,-7e-06,-4e-06,-2.3e-05,0,0,1e-05,9e-06,4e-06,-8e-06,2e-06,8e-06,9e-06,2e-06,-2e-06,-6e-06,1e-06,1.1e-05,1.1e-05,-6e-06,6e-06,1e-06,8e-06,8e-06,1.8e-05,-7e-06,-1e-06,7e-06,2e-06,4e-06,-4e-06,-2e-06,-5e-06,2.3e-05,3.1e-05,-1.2e-05,-1.4e-05,-9e-06,-5e-06,1e-05,5e-06,1e-05,-2e-06,-3e-06,0,5e-06,1e-06,-3e-06,2e-06,3.4e-05,2e-06,2e-06,6e-06
4e-06,-4e-06,-1.2e-05,-8e-06,-4e-06,-1e-06,-6e-06,0,3e-06,1.2e-05,1.5e-05,-7e-06,-1e-06,9e-06,9e-06,4e-06,1e-06,-1e-06,-1.7e-05,5e-06,0,-8e-06,-1.4e-05,-1e-06,-3e-06,0,0,-6e-06,-2e-06,-8e-06,-2e-06,1.5e-05,7e-06,5e-06,4e-06,-6e-06,1e-06,-2e-06,0,-1e-06,1e-06,2e-06,-1e-06,-2e-06,-1e-06,3e-06,-3e-06,3e-06,-1.9e-05,5e-06,1e-06,2e-06,-2e-06,-2e-06,-3e-06,7e-06,-8e-06,1e-06,-1e-06,1e-06,-3e-06,1e-06,-8e-06,-7e-06,0,-2e-06,5e-06,-8e-06,0,5e-06,3e-06,3e-06,1e-06,7e-06,-6e-06,-3e-06,3e-06,1.6e-05,-5e-06,1e-06,-9e-06,6e-06,7e-06,7e-06,-1e-06,-8e-06,-1e-06,-2e-06,9e-06,6e-06,-1.6e-05,-6e-06,6e-06,-8e-06,-2e-06,-2e-06,0,1e-05,3e-06,-1.3e-05,1e-06,-1e-06,-7e-06,2e-06,9e-06,-1.1e-05,1e-06,-1e-05,-1e-05,2e-06,-6e-06,2e-06,2e-06,-2e-06,1e-06,0,-1.2e-05,9e-06,3e-06,-1.1e-05,6e-06
-7e-06,-1e-06,6e-06,4e-06,-6e-06,6e-06,7e-06,3e-06,3e-06,-1.3e-05,1e-06,-6e-06,-5e-06,-4e-06,-2e-06,1.1e-05,3e-06,1.2e-05,1e-06,0,-4e-06,-8e-06,-2e-06,0,3e-06,-5e-06,2e-06,1.7e-05,-1e-06,1e-06,-5e-06,5e-06,9e-06,0,2e-06,1e-06,-4e-06,4e-06,-1e-06,-7e-06,-3e-06,1e-06,-4e-06,8e-06,2e-06,-1e-06,-6e-06,-1e-06,-1e-05,9e-06,2e-06,4e-06,3e-06,-1.3e-05,0,0,4e-06,0,-6e-06,9e-06,-7e-06,-3e-06,-3e-06,0,5e-06,1e-06,2e-06,-2e-06,3e-06,-2e-06,4e-06,1.3e-05,1e-06,1e-06,-8e-06,2e-06,8e-06,2e-06,-4e-06,-4e-06,-2e-06,0,2e-06,-3e-06,-4e-06,9e-06,1.4e-05,-4e-06,5e-06,-3e-06,-1.3e-05,0,-8e-06,1e-06,-1e-06,0,-3e-06,8e-06,-5e-06,4e-06,-1e-06,-5e-06,2e-06,7e-06,9e-06,7e-06,0,2e-06,-4e-06,4e-06,3e-06,2e-06,-8e-06,0,1e-06,0,-1.4e-05,-1.5e-05,2e-06,1.2e-05,2e-06
3e-06,1e-06,1e-06,1e-06,-1e-06,4e-06,-3e-06,-1e-06,-3e-06,7e-06,-5e-06,3e-06,0,-5e-06,-9e-06,4e-06,4e-06,-1.1e-05,4e-06,6e-06,-2e-06,1.2e-05,-3e-06,-3e-06,-3e-06,3e-06,0,1.7e-05,4e-06,-2e-06,4e-06,-1.2e-05,-1.4e-05,2e-06,3e-06,0,5e-06,-6e-06,-2e-06,1e-06,2e-06,7e-06,0,-7e-06,-4e-06,0,-2e-06,-7e-06,5e-06,-5e-06,-1e-06,-6e-06,-3e-06,8e-06,-1e-06,-8e-06,-7e-06,-2e-06,0,0,0,3e-06,0,4e-06,3e-06,-5e-06,-3e-06,1.2e-05,-1e-06,-2e-06,1e-06,-1e-06,-3e-06,6e-06,7e-06,3e-06,3e-06,4e-06,-1e-06,-6e-06,1.1e-05,1e-06,0,-1e-06,-2e-06,-9e-06,-2e-06,-2e-06,0,-4e-06,1.3e-05,-1e-06,-4e-06,-6e-06,1e-06,0,-1.2e-05,-1.1e-05,-4e-06,-1.1e-05,2e-06,-1.1e-05,-1e-06,-1e-05,-3e-06,6e-06,-1e-06,7e-06,-3e-06,5e-06,-3e-06,8e-06,-8e-06,0,-3e-06,0,1.1e-05,0,-2e-06,-1.2e-05,-9e-06
-1e-06,7e-06,-1e-06,-4e-06,6e-06,3e-06,1e-06,0,-2e-06,-6e-06,-2e-06,4e-06,6e-06,-1e-06,-9e-06,-4e-06,-6e-06,-2e-06,-2e-06,-4e-06,0,5e-06,-3e-06,2e-06,1e-06,0,-2e-06,-1.2e-05,-8e-06,5e-06,-2e-06,-2e-06,-8e-06,-2e-06,-7e-06,1e-06,-2e-06,0,3e-06,3e-06,-4e-06,-5e-06,-2e-06,0,-1e-06,1e-06,-1e-06,4e-06,-2e-06,6e-06,9e-06,3e-06,3e-06,6e-06,-2e-06,-4e-06,6e-06,-3e-06,-5e-06,-8e-06,-3e-06,-1e-06,1e-06,-2e-06,-3e-06,-5e-06,-3e-06,-5e-06,2e-06,6e-06,-1e-06,-9e-06,-2e-06,2e-06,-2e-06,2e-06,-6e-06,-7e-06,5e-06,-5e-06,-4e-06,-4e-06,-7e-06,2e-06,-1e-06,1e-06,0,2e-06,-1e-06,-2e-06,3e-06,4e-06,0,-3e-06,0,-1e-06,-6e-06,-3e-06,0,-2e-06,-4e-06,5e-06,-4e-06,4e-06,-1.2e-05,-7e-06,-1e-06,0,-2e-06,-6e-06,0,1e-06,6e-06,-1e-06,6e-06,0,1.9e-05,1.8e-05,0,-3e-06,-2e-06
0,-3e-06,4e-06,4e-06,0,-4e-06,-2e-06,1e-06,3e-06,3e-06,-1e-06,0,-2e-06,-5e-06,-2e-06,-8e-06,0,2e-06,-4e-06,3e-06,0,-2e-06,-3e-06,0,-2e-06,-6e-06,-1e-06,-6e-06,3e-06,-6e-06,3e-06,-6e-06,8e-06,-4e-06,3e-06,-1e-06,2e-06,0,-2e-06,0,0,3e-06,2e-06,-1e-06,5e-06,-2e-06,2e-06,0,-2e-06,-4e-06,2e-06,-3e-06,-2e-06,-6e-06,-6e-06,1e-06,-3e-06,0,-1e-06,-1e-06,-1e-06,2e-06,3e-06,0,6e-06,4e-06,-4e-06,-5e-06,0,-1e-06,-2e-06,-1e-06,1e-06,-5e-06,3e-06,-2e-06,-3e-06,-4e-06,5e-06,-1e-06,-4e-06,-1e-06,-6e-06,0,-2e-06,1e-06,-6e-06,-2e-06,2e-06,-1e-06,-7e-06,-1e-06,-4e-06,-2e-06,1e-06,1e-06,8e-06,7e-06,1e-06,2e-06,4e-06,4e-06,2e-06,1e-06,2e-06,-1e-06,-3e-06,2e-06,6e-06,-1e-06,1e-06,4e-06,-1e-06,2e-06,-1e-06,-1e-06,-1.1e-05,-7e-06,0,3e-06,6e-06
3e-06,-7e-06,0,-1e-06,-3e-06,-4e-06,3e-06,0,3e-06,-3e-06,3e-06,1e-06,-4e-06,0,5e-06,2e-06,4e-06,-2e-06,5e-06,-2e-06,0,-4e-06,4e-06,1e-06,1e-06,-1e-06,0,-7e-06,2e-06,-1e-06,-2e-06,-2e-06,-3e-06,0,-4e-06,2e-06,1e-06,1e-06,1e-06,-2e-06,-1e-06,-2e-06,2e-06,-3e-06,-1e-06,3e-06,5e-06,-2e-06,7e-06,9e-06,-5e-06,2e-06,0,1e-06,1e-06,3e-06,1e-06,1e-06,0,1e-06,-1e-06,-1e-06,-2e-06,3e-06,2e-06,2e-06,-1e-06,1e-06,-1e-06,-3e-06,-3e-06,1.5e-05,-1e-06,1e-06,-4e-06,-1e-06,-2e-06,5e-06,0,3e-06,6e-06,1e-06,3e-06,-2e-06,-3e-06,4e-06,-1e-06,0,-2e-06,0,4e-06,-2e-06,2e-06,1e-05,-2e-06,-2e-06,4e-06,3e-06,-2e-06,-5e-06,-3e-06,1e-06,2e-06,-4e-06,1e-06,2e-06,0,-3e-06,4e-06,-4e-06,1e-06,-2e-06,1e-06,-3e-06,-2e-06,0,-7e-06,-8e-06,-2e-06,9e-06,1e-06
0,3e-06,-3e-06,0,-2e-06,-1e-06,-3e-06,-1e-06,-1e-06,4e-06,3e-06,-1e-06,7e-06,2e-06,6e-06,2e-06,-1e-06,0,2e-06,-3e-06,1e-06,-2e-06,3e-06,-1e-06,0,5e-06,-2e-06,2e-06,1e-06,2e-06,2e-06,7e-06,-5e-06,0,3e-06,-1e-06,-2e-06,0,-1e-06,1e-06,0,-2e-06,1e-06,4e-06,-6e-06,-2e-06,-5e-06,1e-06,2e-06,-4e-06,0,-1e-06,1e-06,1e-06,3e-06,3e-06,0,-1e-06,0,0,-2e-06,1e-06,2e-06,-1e-06,-2e-06,2e-06,-3e-06,4e-06,0,2e-06,-1e-06,-2e-06,1e-06,1e-06,1e-06,2e-06,0,0,-2e-06,3e-06,1e-06,1e-06,1e-06,4e-06,0,-3e-06,-2e-06,1e-06,0,0,0,1e-06,7e-06,5e-06,2e-06,-1e-06,-1e-06,1e-06,-2e-06,-1e-06,2e-06,7e-06,-1e-06,2e-06,-3e-06,-4e-06,-1e-06,-3e-06,-5e-06,-3e-06,-2e-06,-4e-06,-3e-06,3e-06,0,0,5e-06,1e-06,1e-06,-2e-06,-1e-06
0,3e-06,-1e-06,0,3e-06,-1e-06,-2e-06,0,-2e-06,-1e-06,-3e-06,-1e-06,-1e-06,0,3e-06,3e-06,-3e-06,1e-06,-4e-06,1e-06,2e-06,1e-06,2e-06,0,0,-1e-06,0,3e-06,0,1e-06,-2e-06,4e-06,7e-06,0,3e-06,-1e-06,1e-06,0,0,0,2e-06,0,0,-1e-06,2e-06,2e-06,-3e-06,0,-6e-06,1e-06,-4e-06,0,-1e-06,-1e-06,-1e-06,3e-06,0,0,2e-06,2e-06,-1e-06,-1e-06,1e-06,0,4e-06,-1e-06,2e-06,-1e-06,1e-06,1e-06,0,-6e-06,0,-3e-06,1e-06,-1e-06,2e-06,0,-1e-06,3e-06,-5e-06,-1e-06,1e-06,-2e-06,3e-06,4e-06,-2e-06,-2e-06,3e-06,1e-06,6e-06,-1e-06,1e-06,-3e-06,-1e-06,0,-1e-06,-6e-06,-2e-06,-1e-06,-1e-06,-9e-06,4e-06,-1e-06,-4e-06,-1e-06,0,2e-06,-4e-06,-1e-06,2e-06,0,-2e-06,-2e-06,-1e-06,0,7e-06,7e-06,-1e-06,-4e-06,-5e-06
2e-06,1e-06,2e-06,-2e-06,1e-06,2e-06,5e-06,0,2e-06,0,-4e-06,0,-2e-06,3e-06,-1e-06,-2e-06,0,0,2e-06,0,1e-06,1e-06,3e-06,-1e-06,0,2e-06,1e-06,0,-1e-06,-1e-06,1e-06,2e-06,1e-06,1e-06,-1e-06,0,-1e-06,-1e-06,1e-06,0,-1e-06,-1e-06,-3e-06,0,4e-06,-2e-06,3e-06,-2e-06,-4e-06,1e-06,-3e-06,0,0,3e-06,2e-06,6e-06,0,0,2e-06,-1e-06,3e-06,0,1e-06,2e-06,0,0,-1e-06,-4e-06,1e-06,-3e-06,1e-06,3e-06,-1e-06,-1e-06,-2e-06,-1e-06,2e-06,-2e-06,-1e-06,0,2e-06,-1e-06,-2e-06,-1e-06,1e-06,0,-3e-06,0,0,0,2e-06,1e-06,-4e-06,1e-06,0,0,-3e-06,-3e-06,-4e-06,-4e-06,0,-6e-06,0,-1e-06,4e-06,2e-06,0,-1e-06,0,-2e-06,-1e-06,-2e-06,1e-06,2e-06,0,0,1e-06,-7e-06,0,2e-06,3e-06
-1e-06,-4e-06,-2e-06,2e-06,-1e-06,3e-06,-4e-06,0,0,2e-06,3e-06,1e-06,1e-06,2e-06,-4e-06,-3e-06,3e-06,-2e-06,3e-06,-1e-06,0,4e-06,0,-1e-06,0,3e-06,0,3e-06,0,-1e-06,-2e-06,-4e-06,-4e-06,1e-06,4e-06,2e-06,0,-1e-06,0,0,2e-06,0,-1e-06,1e-06,-3e-06,1e-06,-1e-06,2e-06,-1e-06,1e-06,3e-06,-1e-06,0,-2e-06,-2e-06,-1e-06,0,0,-1e-06,-2e-06,1e-06,0,-1e-06,1e-06,0,-3e-06,3e-06,1e-06,0,2e-06,2e-06,3e-06,0,0,-2e-06,1e-06,1e-06,-1e-06,-2e-06,-2e-06,3e-06,-1e-06,-3e-06,2e-06,0,-5e-06,2e-06,-1e-06,0,0,-6e-06,-1e-06,-1e-06,-1e-06,0,0,-5e-06,3e-06,-2e-06,3e-06,0,6e-06,-1e-06,1e-06,5e-06,-2e-06,-1e-06,-5e-06,-1e-06,3e-06,-1e-06,3e-06,0,0,-1e-06,0,-1.2e-05,3e-06,0,-3e-06,3e-06
-1e-06,-1e-06,0,-1e-06,-2e-06,1e-06,-1e-06,0,-2e-06,-1e-06,2e-06,1e-06,1e-06,-1e-06,-2e-06,1e-06,0,3e-06,-3e-06,2e-06,1e-06,-2e-06,-2e-06,0,0,-1e-06,0,6e-06,0,0,1e-06,-3e-06,4e-06,0,-1e-06,-1e-06,0,1e-06,0,0,-1e-06,0,0,-2e-06,-2e-06,0,1e-06,-1e-06,-5e-06,1e-06,-1e-06,2e-06,-1e-06,-3e-06,0,-2e-06,0,0,0,1e-06,0,0,-1e-06,-1e-06,2e-06,1e-06,0,1e-06,-1e-06,0,0,-2e-06,-1e-06,-1e-06,2e-06,1e-06,0,3e-06,0,-1e-06,-4e-06,1e-06,3e-06,-1e-06,-1e-06,2e-06,2e-06,-2e-06,1e-06,0,1e-06,0,1e-06,-2e-06,0,1e-06,2e-06,0,-2e-06,-2e-06,0,5e-06,2e-06,-2e-06,-1e-06,0,0,2e-06,2e-06,1e-06,0,3e-06,4e-06,0,-1e-06,0,0,4e-06,-1e-06,-4e-06,1e-06
0,3e-06,2e-06,0,1e-06,-1e-06,5e-06,0,-1e-06,2e-06,-1e-06,1e-06,0,-1e-06,1e-06,2e-06,-3e-06,-2e-06,-1e-06,-2e-06,1e-06,-3e-06,-3e-06,0,0,1e-06,1e-06,-7e-06,-1e-06,1e-06,-1e-06,-2e-06,2e-06,-2e-06,1e-06,0,0,-1e-06,-1e-06,0,0,0,0,1e-06,2e-06,0,-1e-06,0,-3e-06,-3e-06,2e-06,0,1e-06,4e-06,-3e-06,1e-06,2e-06,0,-1e-06,3e-06,1e-06,0,0,0,-1e-06,0,3e-06,0,1e-06,-1e-06,-1e-06,-6e-06,0,0,0,-1e-06,-2e-06,0,1e-06,-1e-06,1e-06,0,2e-06,-1e-06,0,2e-06,1e-06,0,-1e-06,0,3e-06,1e-06,-1e-06,-3e-06,0,-1e-06,4e-06,-1e-06,-2e-06,0,0,-4e-06,-1e-06,2e-06,-1e-06,2e-06,-1e-06,0,3e-06,2e-06,1e-06,1e-06,0,1e-06,0,0,9e-06,-2e-06,1e-06,9e-06,-2e-06
-1e-06,1e-06,1e-06,1e-06,1e-06,-2e-06,-6e-06,0,2e-06,-2e-06,-1e-06,-1e-06,-2e-06,-1e-06,2e-06,1e-06,0,1e-06,3e-06,1e-06,0,0,-2e-06,0,0,0,0,-5e-06,1e-06,0,1e-06,2e-06,-5e-06,-1e-06,-1e-06,0,1e-06,1e-06,1e-06,0,0,1e-06,2e-06,0,0,1e-06,-2e-06,1e-06,4e-06,4e-06,2e-06,1e-06,0,0,1e-06,-4e-06,-2e-06,0,-2e-06,0,-1e-06,0,0,0,1e-06,1e-06,0,-3e-06,0,2e-06,-1e-06,2e-06,0,1e-06,-2e-06,0,-2e-06,0,1e-06,0,3e-06,-1e-06,1e-06,2e-06,0,0,1e-06,0,0,0,-3e-06,0,1e-06,0,0,1e-06,-1e-06,-2e-06,0,2e-06,0,-6e-06,1e-06,-1e-06,2e-06,-1e-06,0,0,-2e-06,1e-06,-1e-06,2e-06,-1e-06,0,0,0,0,-6e-06,-1e-06,0,-3e-06
0,-2e-06,-1e-06,-1e-06,0,-1e-06,5e-06,0,1e-06,2e-06,-1e-06,-1e-06,2e-06,-2e-06,2e-06,-2e-06,2e-06,0,-1e-06,0,0,2e-06,0,-1e-06,0,-1e-06,0,-1e-06,-1e-06,-1e-06,0,1e-06,1e-06,0,0,1e-06,-1e-06,0,-1e-06,1e-06,-2e-06,0,0,0,0,-1e-06,3e-06,0,2e-06,-2e-06,-2e-06,0,0,-3e-06,0,-2e-06,1e-06,0,0,-2e-06,-1e-06,1e-06,0,-1e-06,1e-06,0,1e-06,0,0,-1e-06,-1e-06,4e-06,0,0,1e-06,0,0,-1e-06,1e-06,1e-06,-1e-06,0,-2e-06,-1e-06,-1e-06,-1e-06,1e-06,-1e-06,1e-06,0,-3e-06,1e-06,2e-06,2e-06,0,-1e-06,-1e-06,-1e-06,1e-06,-2e-06,0,5e-06,1e-06,0,1e-06,-2e-06,-1e-06,1e-06,-3e-06,0,0,-2e-06,-1e-06,0,1e-06,0,-4e-06,4e-06,0,-5e-06,1e-06
1e-06,-2e-06,1e-06,0,-1e-06,-1e-06,-2e-06,0,-1e-06,-2e-06,0,0,1e-06,-1e-06,0,-2e-06,0,-2e-06,-2e-06,-1e-06,0,1e-06,1e-06,0,0,1e-06,0,3e-06,0,0,0,4e-06,2e-06,0,-1e-06,-1e-06,1e-06,0,1e-06,0,1e-06,0,0,1e-06,1e-06,1e-06,0,-1e-06,-1e-06,0,0,0,1e-06,1e-06,0,2e-06,-1e-06,0,-1e-06,0,0,-1e-06,0,0,-1e-06,0,-2e-06,1e-06,0,-1e-06,0,-4e-06,0,1e-06,0,0,1e-06,-1e-06,1e-06,0,-2e-06,-1e-06,-3e-06,-1e-06,-1e-06,1e-06,1e-06,1e-06,-1e-06,0,0,-1e-06,0,1e-06,0,0,-2e-06,3e-06,0,0,0,3e-06,0,2e-06,-4e-06,1e-06,0,-2e-06,0,0,0,-1e-06,-1e-06,-1e-06,-1e-06,0,-4e-06,3e-06,0,1e-06,1e-06
0,2e-06,0,0,0,1e-06,1e-06,0,0,2e-06,2e-06,1e-06,-2e-06,0,-2e-06,-1e-06,-1e-06,2e-06,1e-06,0,0,0,1e-06,0,0,0,0,4e-06,0,0,0,-2e-06,-4e-06,1e-06,0,0,0,0,-1e-06,-1e-06,-1e-06,1e-06,-1e-06,0,-1e-06,-1e-06,0,1e-06,1e-06,-1e-06,-2e-06,0,0,0,1e-06,1e-06,0,0,0,0,-1e-06,0,0,0,1e-06,-1e-06,-1e-06,0,0,1e-06,1e-06,-2e-06,0,0,0,0,1e-06,2e-06,-1e-06,0,2e-06,1e-06,1e-06,1e-06,0,-1e-06,-1e-06,-1e-06,0,0,0,0,-2e-06,0,0,0,-2e-06,1e-06,0,1e-06,1e-06,-1e-06,0,-2e-06,-3e-06,0,0,1e-06,0,-2e-06,0,-1e-06,1e-06,0,1e-06,0,5e-06,-5e-06,0,0,0
0,1e-06,-1e-06,0,1e-06,2e-06,-1e-06,0,1e-06,-2e-06,0,0,0,0,-2e-06,2e-06,0,-1e-06,1e-06,0,-1e-06,0,2e-06,0,0,-2e-06,0,1e-06,0,0,0,-2e-06,1e-06,0,0,0,-1e-06,-1e-06,1e-06,0,1e-06,-1e-06,0,-1e-06,-1e-06,1e-06,0,0,0,0,-1e-06,0,0,-1e-06,-1e-06,1e-06,0,0,0,1e-06,-1e-06,0,1e-06,-1e-06,0,0,-2e-06,-1e-06,0,0,0,2e-06,0,-1e-06,-1e-06,0,1e-06,1e-06,-1e-06,0,0,0,1e-06,0,0,0,-1e-06,0,1e-06,0,2e-06,0,-1e-06,0,0,-1e-06,0,-2e-06,1e-06,-2e-06,0,-1e-06,1e-06,0,1e-06,-2e-06,-1e-06,1e-06,1e-06,-1e-06,0,-1e-06,0,0,0,0,5e-06,-1e-06,0,-3e-06,-1e-06
1e-06,-1e-06,0,0,0,1e-06,0,0,0,1e-06,-2e-06,0,1e-06,1e-06,-1e-06,0,1e-06,0,-2e-06,0,-1e-06,-2e-06,1e-06,-1e-06,0,0,0,0,0,-1e-06,0,-2e-06,3e-06,0,0,0,1e-06,1e-06,0,1e-06,0,0,1e-06,0,1e-06,0,-1e-06,0,-4e-06,1e-06,2e-06,0,0,1e-06,0,2e-06,-1e-06,0,1e-06,1e-06,0,0,0,-1e-06,-1e-06,0,0,-1e-06,0,-1e-06,0,2e-06,0,0,1e-06,0,0,0,0,0,-1e-06,0,1e-06,-1e-06,0,1e-06,-1e-06,0,0,0,-1e-06,0,0,1e-06,0,0,3e-06,-1e-06,0,2e-06,0,-2e-06,-1e-06,1e-06,1e-06,0,0,-1e-06,2e-06,-1e-06,0,2e-06,1e-06,0,0,0,-6e-06,5e-06,0,3e-06,-1e-06
0,-1e-06,1e-06,0,-1e-06,0,0,0,-1e-06,-1e-06,0,-1e-06,0,1e-06,1e-06,0,0,1e-06,0,0,0,0,1e-06,0,0,0,0,1e-06,0,0,0,0,-2e-06,0,1e-06,0,0,0,0,0,0,-1e-06,0,0,0,0,1e-06,0,-3e-06,-3e-06,0,0,0,-1e-06,-1e-06,1e-06,1e-06,0,0,-1e-06,0,0,-1e-06,0,1e-06,0,0,1e-06,0,1e-06,0,-1e-06,0,0,0,0,-1e-06,0,0,0,1e-06,0,-2e-06,1e-06,0,0,0,-1e-06,0,0,-2e-06,0,0,-2e-06,0,0,0,0,1e-06,0,0,0,0,-2e-06,-2e-06,1e-06,-1e-06,0,0,-1e-06,0,1e-06,0,0,0,0,-3e-06,0,0,3e-06,1e-06
0,0,0,0,-1e-06,-1e-06,0,0,0,0,1e-06,0,-1e-06,0,2e-06,-2e-06,-1e-06,-1e-06,1e-06,-1e-06,0,1e-06,-1e-06,0,0,-1e-06,0,-4e-06,0,0,0,1e-06,0,-1e-06,-1e-06,0,0,0,0,-1e-06,1e-06,0,0,0,-1e-06,0,0,0,1e-06,2e-06,1e-06,0,0,-1e-06,1e-06,-1e-06,-1e-06,0,1e-06,-2e-06,0,0,0,0,-1e-06,1e-06,1e-06,0,0,0,-1e-06,-1e-06,0,-1e-06,0,0,-1e-06,-1e-06,0,0,1e-06,0,-2e-06,0,0,0,-1e-06,0,0,0,3e-06,-1e-06,1e-06,-1e-06,0,0,-2e-06,2e-06,1e-06,-1e-06,0,2e-06,0,2e-06,0,-1e-06,0,0,-2e-06,1e-06,0,1e-06,0,0,-1e-06,0,3e-06,-5e-06,0,-2e-06,1e-06
0,2e-06,0,0,0,-1e-06,1e-06,0,1e-06,0,0,0,1e-06,0,1e-06,0,0,1e-06,0,0,-1e-06,1e-06,-1e-06,0,0,0,0,-3e-06,0,0,0,2e-06,2e-06,0,1e-06,0,1e-06,0,0,0,-1e-06,0,0,1e-06,0,0,0,0,0,-1e-06,1e-06,0,0,2e-06,0,-1e-06,0,0,-1e-06,0,0,0,0,0,0,0,2e-06,-1e-06,0,-1e-06,0,3e-06,0,0,0,0,-1e-06,1e-06,1e-06,0,-1e-06,0,1e-06,-1e-06,0,1e-06,0,0,0,0,1e-06,1e-06,1e-06,0,0,0,-1e-06,0,0,1e-06,0,1e-06,0,0,3e-06,-1e-06,0,-1e-06,-1e-06,0,0,0,0,0,0,0,4e-06,2e-06,0,-2e-06,0
0,-1e-06,1e-06,0,0,0,-2e-06,0,0,0,0,0,1e-06,0,0,1e-06,0,0,-1e-06,0,0,-1e-06,-1e-06,0,0,0,0,2e-06,-1e-06,0,0,0,-2e-06,0,-1e-06,0,-1e-06,0,0,0,0,-1e-06,0,0,1e-06,0,-1e-06,0,-1e-06,1e-06,-2e-06,0,0,-1e-06,0,-1e-06,-1e-06,0,0,2e-06,0,0,0,0,0,0,1e-06,0,0,1e-06,0,1e-06,0,0,0,0,0,1e-06,1e-06,0,0,0,2e-06,1e-06,0,-1e-06,0,-1e-06,0,0,-1e-06,-1e-06,0,1e-06,0,0,-1e-06,-2e-06,0,0,0,-2e-06,0,-1e-06,1e-06,1e-06,0,0,0,1e-06,0,-1e-06,0,0,-1e-06,0,-1e-06,3e-06,0,1e-06,-1e-06
0,-1e-06,-1e-06,0,0,1e-06,1e-06,0,-1e-06,1e-06,0,0,-1e-06,-1e-06,-2e-06,0,0,0,1e-06,0,0,0,-1e-06,0,0,0,0,4e-06,1e-06,0,0,-1e-06,-1e-06,1e-06,0,0,0,0,0,0,0,0,0,0,0,0,1e-06,0,2e-06,-1e-06,0,0,0,-2e-06,0,-1e-06,1e-06,0,-1e-06,0,0,0,0,0,-1e-06,0,1e-06,1e-06,0,0,0,-2e-06,0,0,0,0,1e-06,0,0,0,1e-06,0,1e-06,0,0,0,1e-06,0,0,0,0,0,-1e-06,1e-06,0,0,0,-1e-06,1e-06,-1e-06,0,-2e-06,0,1e-06,-1e-06,-1e-06,0,0,0,1e-06,0,-1e-06,0,0,0,0,-6e-06,-2e-06,0,1e-06,0
0,0,-1e-06,0,0,1e-06,0,0,0,-1e-06,0,0,0,0,-2e-06,0,0,0,1e-06,0,0,0,-1e-06,0,0,1e-06,0,3e-06,0,0,0,-2e-06,2e-06,0,0,0,0,0,1e-06,0,0,0,0,0,0,0,0,0,1e-06,-1e-06,-1e-06,0,0,2e-06,0,-1e-06,0,0,0,-1e-06,0,0,0,0,0,0,0,0,0,-1e-06,1e-06,-1e-06,0,0,-1e-06,0,1e-06,0,0,0,0,0,-2e-06,-1e-06,0,0,0,-1e-06,0,0,0,0,-1e-06,0,0,0,1e-06,1e-06,0,0,0,3e-06,0,-1e-06,0,-1e-06,0,-1e-06,1e-06,0,0,-1e-06,0,0,0,0,2e-06,-2e-06,0,-2e-06,1e-06
0,1e-06,1e-06,0,0,0,-1e-06,0,1e-06,1e-06,1e-06,0,1e-06,0,0,-1e-06,0,0,-1e-06,0,0,-1e-06,1e-06,0,0,0,0,-1e-06,0,0,0,-1e-06,-1e-06,0,-1e-06,0,0,0,-1e-06,0,0,0,0,0,0,0,0,0,-2e-06,2e-06,0,0,0,0,0,1e-06,0,0,-1e-06,-1e-06,0,0,0,0,0,0,0,-1e-06,0,0,0,2e-06,0,0,1e-06,0,0,0,0,0,0,0,-2e-06,0,0,0,0,0,0,0,1e-06,0,0,1e-06,0,0,0,1e-06,0,-1e-06,0,3e-06,0,0,1e-06,0,0,1e-06,0,0,0,0,0,0,0,0,5e-06,4e-06,0,4e-06,1e-06
0,0,1e-06,0,0,-1e-06,3e-06,0,0,-1e-06,0,0,0,0,1e-06,0,0,0,0,0,1e-06,0,1e-06,0,0,0,0,-2e-06,0,0,0,1e-06,-1e-06,0,0,0,0,0,1e-06,0,0,1e-06,0,0,0,0,1e-06,0,-2e-06,-2e-06,1e-06,0,0,-1e-06,0,1e-06,0,0,1e-06,0,0,0,0,0,-1e-06,0,-2e-06,0,0,0,0,0,0,0,0,0,-1e-06,0,0,0,0,0,1e-06,0,0,0,-1e-06,0,0,0,0,1e-06,0,0,0,0,-1e-06,0,0,0,0,-1e-06,0,1e-06,-1e-06,0,0,1e-06,-1e-06,-1e-06,0,1e-06,0,0,0,0,-2e-06,0,0,1e-06,0
