-1e-06,-3.6e-05,-0.00069,-0.001003,-9.6e-05,-5e-06,0,-1e-06,0,3e-06,3e-06,0,1e-06,3e-06,3e-06,1e-06,0,0,1e-06,0,-2e-06,1e-06,3e-06,1e-06,2e-06,1e-06,0,0
0,1.6e-05,4.4e-05,-0.000344,-9.7e-05,-6e-06,-6e-06,-7e-06,-5e-06,-3e-06,-2e-06,-2e-06,-4e-06,-5e-06,-3e-06,-3e-06,-3e-06,-4e-06,-5e-06,-4e-06,-4e-06,-3e-06,-2e-06,-2e-06,-1e-06,-2e-06,-4e-06,-5e-06
-6e-06,-2.4e-05,-0.000738,-0.000883,-4e-05,8e-06,-4e-06,-5e-06,-5e-06,-6e-06,-4e-06,-2e-06,-5e-06,-9e-06,-6e-06,-4e-06,-3e-06,-4e-06,-6e-06,-5e-06,-5e-06,-5e-06,-5e-06,-2e-06,-3e-06,-3e-06,-5e-06,-5e-06
-2e-06,1e-05,0.00045,0.000778,0.000101,1.4e-05,-1e-06,-1e-06,-3e-06,-6e-06,-5e-06,-1e-06,-4e-06,-9e-06,-6e-06,-3e-06,-2e-06,-2e-06,-4e-06,-4e-06,-1e-06,-4e-06,-5e-06,-1e-06,-3e-06,-2e-06,-3e-06,-2e-06
-1e-06,3.9e-05,0.001178,0.001631,0.000136,3e-06,0,-1e-06,-3e-06,-6e-06,-5e-06,0,-3e-06,-7e-06,-5e-06,-3e-06,-1e-06,-1e-06,-3e-06,-2e-06,1e-06,-3e-06,-4e-06,-1e-06,-3e-06,-1e-06,0,1e-06
-7e-06,-4.1e-05,-0.000625,-0.000662,-3.4e-05,-1e-05,-3e-06,-4e-06,-4e-06,-5e-06,-5e-06,-2e-06,-2e-06,-3e-06,-4e-06,-3e-06,-2e-06,-1e-06,-2e-06,-2e-06,-1e-06,-3e-06,-4e-06,-1e-06,-2e-06,-1e-06,1e-06,3e-06
-2e-06,-7e-06,-0.000276,-0.000605,-8.4e-05,-4e-06,-2e-06,-2e-06,-2e-06,-2e-06,-2e-06,-2e-06,-1e-06,1e-06,-2e-06,-2e-06,-2e-06,-1e-06,-1e-06,-1e-06,0,0,-2e-06,-1e-06,-1e-06,0,2e-06,2e-06
2e-06,2.3e-05,-3.9e-05,-0.000314,-5.2e-05,8e-06,3e-06,3e-06,3e-06,3e-06,2e-06,0,2e-06,5e-06,1e-06,1e-06,0,1e-06,2e-06,2e-06,3e-06,3e-06,2e-06,1e-06,1e-06,2e-06,3e-06,1e-06
-1e-06,-1.9e-05,-0.000632,-0.000682,-1.1e-05,9e-06,4e-06,5e-06,5e-06,7e-06,5e-06,2e-06,4e-06,6e-06,3e-06,2e-06,1e-06,2e-06,3e-06,1e-06,2e-06,5e-06,4e-06,1e-06,3e-06,2e-06,2e-06,1e-06
1e-06,1.3e-05,0.00083,0.001212,0.000102,-2e-06,1e-06,3e-06,4e-06,6e-06,5e-06,3e-06,5e-06,6e-06,3e-06,2e-06,1e-06,1e-06,3e-06,0,0,4e-06,5e-06,2e-06,3e-06,1e-06,1e-06,1e-06
0,5e-06,0.000426,0.000728,6.4e-05,-1e-05,-4e-06,-1e-06,1e-06,3e-06,3e-06,2e-06,3e-06,3e-06,3e-06,1e-06,1e-06,0,1e-06,0,0,1e-06,3e-06,1e-06,1e-06,-1e-06,-1e-06,1e-06
-1e-06,-1.4e-05,-0.000472,-0.000607,-4.6e-05,-7e-06,-6e-06,-2e-06,-1e-06,0,1e-06,1e-06,1e-06,0,3e-06,0,1e-06,0,0,0,-1e-06,-1e-06,2e-06,1e-06,0,-2e-06,-2e-06,0
2e-06,9e-06,-1.9e-05,-0.000334,-7e-05,1e-06,-5e-06,-2e-06,-1e-06,-2e-06,-1e-06,0,-1e-06,-2e-06,2e-06,0,1e-06,1e-06,0,0,-2e-06,-3e-06,0,1e-06,-1e-06,-2e-06,-3e-06,-1e-06
-1e-06,-2e-06,-0.000246,-0.000436,-4.5e-05,2e-06,-2e-06,0,-1e-06,-4e-06,-4e-06,-1e-06,-2e-06,-3e-06,0,0,1e-06,1e-06,1e-06,2e-06,0,-2e-06,-2e-06,-1e-06,-2e-06,-2e-06,-2e-06,-2e-06
-2e-06,-1.2e-05,-0.000313,-0.000252,9e-06,-4e-06,1e-06,1e-06,-1e-06,-5e-06,-5e-06,-2e-06,-3e-06,-3e-06,-2e-06,-1e-06,1e-06,0,0,1e-06,0,-2e-06,-4e-06,-3e-06,-3e-06,-1e-06,-1e-06,-2e-06
0,1.5e-05,0.000774,0.001143,9.3e-05,-5e-06,2e-06,2e-06,-2e-06,-6e-06,-5e-06,-2e-06,-2e-06,-3e-06,-4e-06,-2e-06,0,0,-1e-06,0,1e-06,-1e-06,-5e-06,-3e-06,-3e-06,0,1e-06,0
-1e-06,-4e-06,8.5e-05,0.000245,3.1e-05,-3e-06,2e-06,1e-06,-2e-06,-4e-06,-2e-06,-1e-06,-2e-06,-2e-06,-4e-06,-2e-06,-1e-06,0,-1e-06,0,1e-06,0,-3e-06,-2e-06,-3e-06,0,2e-06,1e-06
1e-06,0,-0.000355,-0.000575,-5.3e-05,1e-06,-1e-06,-2e-06,0,0,0,-1e-06,0,0,-3e-06,-1e-06,-1e-06,0,-1e-06,-1e-06,-1e-06,0,-1e-06,-1e-06,-2e-06,0,3e-06,1e-06
0,4e-06,1.3e-05,-0.000234,-5.4e-05,1e-06,-4e-06,-4e-06,0,3e-06,2e-06,0,1e-06,1e-06,-1e-06,0,-2e-06,0,0,-2e-06,-2e-06,0,1e-06,0,0,0,1e-06,0
