-0.00051,-0.000527,-0.000559,-0.000549,-0.000677,-0.000777,-0.00059,-0.001112,-0.001012,-0.000745,-0.000487,-0.000465,-0.000424,-0.000251,-0.000333,-0.000387,-0.000477,-0.000456,-0.000347,-0.000386,-0.000398,-0.00047,-0.000263,-0.000228,-0.000306,-0.000227,-0.000255,-0.000223
-0.00021,-0.000218,-0.000139,-0.000266,-0.000302,-0.000385,-5.2e-05,-0.00044,-0.000505,-0.000261,-6e-06,-7.3e-05,-0.000271,-0.000123,-0.000169,-0.000224,-0.000246,-0.00036,-0.00025,-0.000204,-0.000281,-0.000369,-0.000124,-0.000121,-0.000162,-9.7e-05,-0.000141,-0.000153
-6.9e-05,-4.6e-05,-6.9e-05,-8.4e-05,2.6e-05,2.5e-05,4e-05,0.000486,0.000368,0.000235,7.4e-05,3.5e-05,6.5e-05,6.5e-05,0.000127,8.8e-05,0.000135,1.1e-05,-9e-06,8.1e-05,8.4e-05,0.000144,8.8e-05,2.9e-05,7.2e-05,3.6e-05,7.5e-05,5.8e-05
0.000109,9e-05,7.2e-05,0.000225,0.000237,0.000296,2.6e-05,0.00045,0.000529,0.000377,5.5e-05,0.000103,0.000247,0.000103,0.000163,0.000207,0.000272,0.000275,0.000174,0.000218,0.000268,0.000374,0.000134,0.000112,0.000184,0.000104,0.000148,0.000158
0.000406,0.000353,0.000426,0.000426,0.000387,0.000509,0.00035,8.6e-05,0.000153,0.000125,0.000211,0.000283,0.000175,3.4e-05,8e-06,0.000106,0.00015,0.000291,0.000223,0.000126,0.000135,0.000118,3.1e-05,9.7e-05,1e-04,8.8e-05,6.5e-05,7.4e-05
5.6e-05,7.1e-05,-1e-06,-0.000108,-2e-06,-1.8e-05,6e-06,-0.000387,-0.000387,-0.000329,-0.000116,-0.000133,-0.000159,-7e-05,-0.00014,-0.00019,-0.000243,-5.3e-05,-3.5e-05,-0.000224,-0.000182,-0.000254,-0.00013,-0.000112,-0.000197,-0.000102,-0.000108,-0.000115
-0.000354,-0.000351,-0.000498,-0.000435,-0.000512,-0.000696,-0.000463,-0.000409,-0.000516,-0.000466,-0.000342,-0.000357,-0.000249,-8.8e-05,-0.000118,-0.000221,-0.000319,-0.000361,-0.000251,-0.000219,-0.000217,-0.000247,-0.000102,-0.000146,-0.000186,-0.000147,-0.000168,-0.000157
-4e-06,-1e-05,9e-05,0.000112,-9.6e-05,-0.000139,1e-04,0.00042,0.000353,0.000324,0.000233,0.00018,0.000156,0.000113,0.000147,0.000196,0.000195,-4.6e-05,-9e-06,0.000208,0.000135,0.000136,0.000139,0.000127,0.000191,8.9e-05,4.8e-05,5.6e-05
-1.7e-05,7.6e-05,0.000166,0.000137,0.00026,0.000398,0.000197,0.000448,0.000528,0.000487,0.000226,0.000179,0.000175,8.8e-05,0.000184,0.00028,0.000289,0.000148,0.00011,0.000168,0.000162,0.000219,0.000105,0.000117,0.000172,0.000106,0.000175,0.000147
-9.1e-05,-5.9e-05,-4e-05,-4.2e-05,0.000123,0.000216,-8e-05,-0.000316,-0.000172,-0.00011,-0.000183,-0.000124,-0.000111,-9.8e-05,-9.6e-05,-7.9e-05,-5.4e-05,7.1e-05,3e-05,-0.000103,-6.5e-05,-4.7e-05,-0.000106,-7.2e-05,-9.4e-05,-3.8e-05,3.5e-05,1.5e-05
0.000185,5.6e-05,6.4e-05,3.9e-05,-1.2e-05,-1.9e-05,8e-06,-0.000568,-0.000528,-0.000404,-0.000118,-3.5e-05,-0.000166,-0.000134,-0.000212,-0.000261,-0.000194,1.5e-05,5e-06,-9.9e-05,-0.000121,-0.000152,-9.1e-05,-9.8e-05,-0.000136,-5e-05,-0.00013,-0.000102
0.000198,0.000107,-5.9e-05,-9.2e-05,-8.1e-05,-0.000153,2.7e-05,0.000136,-5.9e-05,-0.000168,2.4e-05,1.6e-05,2.6e-05,3.5e-05,0,-9.6e-05,-7.6e-05,-1.7e-05,-2.8e-05,-1e-05,0,1.3e-05,5.3e-05,-1.6e-05,-4.5e-05,-3.4e-05,-0.000112,-7.2e-05
-7.3e-05,5e-06,-6.4e-05,-3e-05,-1.8e-05,-0.000141,-6e-05,0.000613,0.00049,0.000339,0.000101,2.3e-05,0.000176,0.000153,0.00021,0.000159,0.000104,-3.2e-05,-2.6e-05,7.4e-05,0.000108,0.00013,9.7e-05,8.7e-05,0.000104,5.4e-05,0.000103,6.7e-05
-0.000153,-4.9e-05,0.000186,0.000242,2.5e-05,3.8e-05,5.6e-05,0.000164,0.000277,0.000282,0.000123,0.000113,0.000137,6.2e-05,8.9e-05,0.000216,0.000192,1.6e-05,3.3e-05,0.000113,6.4e-05,1.7e-05,1.4e-05,0.000121,0.000169,0.000108,0.000167,0.000119
-0.000198,-0.000143,-1.5e-05,-4e-05,-0.000109,6.4e-05,-5.6e-05,-0.000626,-0.000378,-0.00018,-1e-04,-0.000107,-0.000195,-0.00016,-0.000184,-6.9e-05,-6.4e-05,-4.2e-05,-1e-05,-8.6e-05,-0.000108,-0.000153,-0.000114,-6.1e-05,-7.5e-05,-6.2e-05,-5.8e-05,-2.5e-05
2.5e-05,-5e-06,-0.000199,-0.000224,3e-05,8.3e-05,-6.1e-05,-0.000269,-0.000287,-0.00024,-0.000186,-0.000168,-0.000209,-7.8e-05,-0.000125,-0.000204,-0.000201,-4.3e-05,-2.9e-05,-0.000117,-9.1e-05,-5.5e-05,-6.3e-05,-0.000169,-0.000192,-0.000116,-0.000153,-0.000121
0.000354,0.000216,6.9e-05,3e-05,0.000183,6.4e-05,0.000182,0.000471,0.000167,-1e-06,7.1e-05,0.00011,7.5e-05,9.1e-05,1e-04,-2e-05,7e-06,7.5e-05,5.2e-05,0.000111,0.000113,0.000152,8.9e-05,-7e-06,2.3e-05,3.8e-05,-2.5e-05,-3.4e-05
7.7e-05,3.2e-05,4.8e-05,5.8e-05,1e-06,-7.7e-05,3.6e-05,0.000238,0.000157,0.00012,0.000159,0.000175,0.000212,7e-05,0.000132,0.000151,0.000159,0.000104,1.6e-05,5.2e-05,8.4e-05,0.000115,7.5e-05,0.000111,0.000114,6e-05,7.2e-05,6.3e-05
-0.00027,-0.000207,-8.1e-05,-3e-06,-0.000168,-0.000167,-0.000232,-0.000299,-4.9e-05,9.2e-05,-2.2e-05,-3e-05,5.6e-05,-2.9e-05,-3.1e-05,7.7e-05,7e-06,-8.9e-05,-8.8e-05,-0.000128,-9.6e-05,-0.000107,-5.1e-05,5.3e-05,1.5e-05,-1.5e-05,6.5e-05,6.4e-05
