-0.006829,-0.006928,-0.008355,-0.005216,-0.004408,-0.00472,-0.004815,-0.004951,-0.005292,-0.004487,-0.004625,-0.004346,-0.006667,-0.006245,-0.005541,-0.003908,-0.00579,-0.009243,-0.00636,-0.007685,-0.011827,-0.009813,-0.003821,-0.004238,-0.005054,-0.006126,-0.006917,-0.006277
-0.003427,-0.004449,-0.004397,-0.001872,-0.001481,-0.00223,-0.004195,-0.004201,-0.003506,-0.002252,-0.003138,-0.002108,-0.003198,-0.004643,-0.004223,-0.003803,-0.002897,-0.002729,-0.002833,-0.001803,-0.006184,-0.006908,-0.003104,-0.003962,-0.004238,-0.002872,-0.005355,-0.004021
0.002206,0.002443,0.003621,0.002119,0.001728,0.001299,0.000467,5e-04,0.001626,0.001759,0.001432,0.001474,0.002108,0.001141,0.00053,-0.000992,4.2e-05,0.002489,0.001911,0.003848,0.005987,0.004109,0.000688,0.000585,0.000951,0.002594,0.001758,0.001748
0.002421,0.004211,0.003995,0.00068,2e-04,0.000771,0.002908,0.002342,0.002171,0.001311,0.00231,8e-04,0.001203,0.002406,0.001335,-0.000408,-0.002554,-0.00222,-4.1e-05,-0.000171,0.005686,0.005678,0.000499,0.001597,0.001907,0.001296,0.003924,0.00255
0.001296,0.001319,0.000427,-0.000762,-0.001082,6.6e-05,0.002179,0.001377,-0.000328,-0.000565,0.000489,-0.000371,-0.000165,0.000589,0.000405,-0.000234,-0.001735,-0.001619,-0.001483,-0.002247,-0.001845,-0.001761,-0.002215,-0.001012,-0.000632,-0.001239,0.001306,0.001049
-0.000581,-0.002651,-0.002497,-0.000941,-0.001057,-0.000639,-0.00091,-0.000727,-0.001749,-0.001234,-0.001438,-0.000692,-0.000466,-0.001033,-0.000249,0.000203,0.001128,0.001768,-0.000611,-0.000187,-0.005552,-0.006273,-0.002644,-0.002667,-0.002192,-0.001254,-0.002046,-0.000742
-0.003236,-0.003778,-0.003475,-0.001369,-0.000858,-0.001754,-0.003631,-0.002437,-0.000892,-0.001122,-0.002533,-0.001654,-0.001814,-0.001542,-0.001476,-0.000318,0.000127,-0.001422,-0.000766,-0.000906,-0.002886,-0.002052,0.000189,-0.001162,-0.001121,-0.001003,-0.003393,-0.00283
-0.000971,0.000705,0.001011,0.001032,0.001402,0.000461,-0.001436,-0.000508,0.001984,0.001087,1e-06,0.000156,5.2e-05,0.000538,-2.6e-05,0.000828,0.001563,2.6e-05,0.001267,-0.000122,0.003925,0.005402,0.003268,0.00172,0.001623,0.000474,-0.000368,-0.00109
0.003456,0.003931,0.004521,0.002875,0.002264,0.002848,0.002841,0.002674,0.002582,0.002342,0.003091,0.003071,0.003218,0.0021,0.002673,0.002676,0.005069,0.006831,0.004003,0.003437,0.005989,0.005835,0.002969,0.002665,0.002943,0.002586,0.003633,0.003303
0.002206,0.001094,0.000504,5.7e-05,-0.00055,0.000659,0.003262,0.002239,-0.000709,-0.000178,0.001693,0.00136,0.000869,0.000351,0.0017,0.001681,0.001819,0.002587,0.000765,0.001102,-0.001457,-0.001713,-0.000114,0.000996,0.000491,0.000843,0.002367,0.002602
-0.002305,-0.002467,-0.004095,-0.002509,-0.001466,-0.001664,0.000125,-0.000771,-0.002884,-0.002454,-0.002044,-0.002454,-0.002761,-0.001134,-0.001075,-0.000832,-0.003808,-0.006424,-0.003455,-0.003425,-0.005938,-0.005376,-0.001226,-0.000239,-0.002209,-0.00203,-0.001735,-0.001992
-0.002135,-0.001385,-0.000711,-4.5e-05,0.001227,-0.000216,-0.002156,-0.001877,-0.000326,8e-06,-0.001809,-0.001527,-0.000212,0.000318,-0.001153,-0.001693,-0.002527,-0.002764,-0.000832,-0.000217,0.000952,0.000373,0.000462,1.9e-05,-0.001018,-0.000318,-0.002171,-0.002498
0.00057,0.000768,0.002926,0.0015,0.000861,0.000144,-0.002407,-0.001378,0.001856,0.002444,0.001034,0.001236,0.002356,0.000535,-0.000651,-0.001627,-6.5e-05,0.003008,0.00189,0.003151,0.005465,0.004485,0.000446,-0.000377,0.001282,0.001878,-3e-06,0.000317
0.000644,4e-04,-0.000285,-0.001015,-0.002261,-0.001514,-0.000874,-0.000958,-0.000437,-6.3e-05,0.000966,0.000109,-0.001542,-0.002399,-0.002048,-0.001779,-0.002509,-0.002127,-0.001513,-0.001706,-0.001669,-0.00093,-0.002319,-0.001742,0.000406,-0.000762,0.000156,0.000486
0.000591,0.000213,-0.002066,-0.001142,-0.001026,6.2e-05,0.002273,0.000959,-0.001753,-0.002253,-0.000273,-0.000877,-0.003226,-0.002051,-0.000466,0.000196,-0.001634,-0.003537,-0.002342,-0.00351,-0.005808,-0.005638,-0.002851,-0.001022,-0.000865,-0.002184,5.4e-05,-0.000107
0.00115,0.000557,0.000925,0.001471,0.002133,0.002374,0.003038,0.002843,0.000953,-0.000338,-0.000255,0.000798,0.001643,0.002506,0.003262,0.002489,0.00335,0.004048,0.00226,0.002848,0.001378,-0.000727,0.000328,0.001302,0.00039,0.001207,0.001499,0.001305
-0.000808,-0.000237,0.001833,0.001191,0.001063,0.000429,-0.000483,0.001095,0.002583,0.00159,-0.000168,0.00106,0.003764,0.003731,0.002256,0.001483,0.00303,0.004033,0.002678,0.003853,0.00594,0.005277,0.002484,0.001255,0.000959,0.001909,0.000973,0.000841
-0.002763,-0.001374,-0.000999,-0.001292,-0.001619,-0.002057,-0.003466,-0.00238,-5e-05,0.000326,-0.000634,-0.000761,-0.000299,-0.000401,-0.002092,-0.000728,-0.00068,-0.002595,-0.001375,-0.002523,0.000275,0.002872,0.001236,-0.001133,-0.000811,-0.0017,-0.001625,-0.0018
0.00049,-0.000196,-0.001144,-0.000657,-0.000958,-0.000724,-0.001496,-0.002022,-0.002119,-0.000658,0.000402,-0.000454,-0.002537,-0.002961,-0.002373,-0.000607,0.000261,-0.001092,-0.001609,-0.003167,-0.004901,-0.002861,-0.000421,-0.001747,-0.001399,-0.001668,-0.001676,-0.001361
