1.1e-05,0,1.8e-05,8e-06,7e-06,7e-06,2.7e-05,2.2e-05,3.5e-05,3e-06,2e-06,4e-06,1.7e-05,2.6e-05,1.9e-05,2e-06,1.4e-05,1.7e-05,2.2e-05,1.4e-05,2e-05,2.7e-05,8e-06,8e-06,1.2e-05,4e-06,4e-06,1.3e-05,1.1e-05,3e-05,1.7e-05,3e-06,2.1e-05,1e-05,2.3e-05,5e-06,9e-06,6e-06,0,4e-06,1.4e-05,1e-06,3.2e-05,2.3e-05,1.7e-05,2.3e-05,1.6e-05,3e-06,1.3e-05,1e-05,1.5e-05,9e-06,9e-06,1.8e-05,5e-06,2e-06,8e-06,2.3e-05,3.3e-05,1.3e-05,2e-05,4e-06,1.6e-05,1.9e-05,4e-06,5.2e-05,2e-05,2.4e-05,2e-06,0,3.4e-05,1.2e-05,6e-06,1e-05,1e-05,4e-06,2.7e-05,5e-06,2.7e-05,4.4e-05,2.7e-05,1.8e-05,1e-06,3.5e-05,2.9e-05,5.6e-05,2.5e-05,7e-06,6e-06,2.3e-05,2e-05,1.1e-05,6e-06,5e-06,1.2e-05,9e-06,3e-06,4e-06,1e-06,7e-06,3e-06,1e-06,1.7e-05,1.1e-05,5e-06,1.9e-05,6e-06,8e-06,1.4e-05,1.2e-05,1e-06,1e-06,2e-05,1.4e-05,5e-06,1.2e-05,2.3e-05,1e-06,2.1e-05,5e-06,9e-06
3.7e-05,1e-05,5.8e-05,1.5e-05,5e-05,3.6e-05,5.7e-05,5.9e-05,6.4e-05,3.4e-05,2.9e-05,2.2e-05,4.2e-05,6e-05,5.2e-05,1.2e-05,1.7e-05,2.7e-05,7.8e-05,6.9e-05,6.7e-05,8.1e-05,1.5e-05,4.3e-05,3.4e-05,3.2e-05,3.6e-05,3e-05,4.1e-05,6.7e-05,2.2e-05,9e-06,5.9e-05,3.2e-05,4.7e-05,1.1e-05,6.7e-05,6.3e-05,2.3e-05,3e-05,2.5e-05,4.3e-05,7.6e-05,6.3e-05,7.3e-05,2.3e-05,2.9e-05,3.5e-05,4.2e-05,1.7e-05,2.7e-05,2.7e-05,4.8e-05,5.7e-05,2.6e-05,4.2e-05,1.6e-05,7.1e-05,0.000101,3.5e-05,1.7e-05,3e-05,4.6e-05,6.5e-05,5e-05,0.000125,4.3e-05,7e-05,5.3e-05,2.5e-05,7.8e-05,5.7e-05,4.4e-05,5.3e-05,5.7e-05,2.7e-05,4e-05,1.2e-05,7e-05,9.6e-05,7e-05,6.4e-05,3.2e-05,9.9e-05,7.3e-05,0.000123,7.1e-05,3.8e-05,3.1e-05,6.8e-05,3.7e-05,3.4e-05,3.7e-05,2.5e-05,6.7e-05,7.1e-05,6.6e-05,4.3e-05,1.2e-05,6.6e-05,7.1e-05,5.6e-05,4e-05,6.7e-05,4.8e-05,4e-05,2.9e-05,6.1e-05,5.1e-05,4.1e-05,2.7e-05,1.7e-05,6.7e-05,2e-05,4.4e-05,5.8e-05,9.6e-05,4.8e-05,4.4e-05,5.2e-05,2.3e-05
4.8e-05,4.9e-05,3.8e-05,3.1e-05,3.5e-05,4.1e-05,6.2e-05,4.5e-05,5.6e-05,9.7e-05,2.9e-05,1.9e-05,2.9e-05,3.7e-05,6.8e-05,4.1e-05,4.7e-05,4.1e-05,9.8e-05,2.5e-05,2.7e-05,5.7e-05,2.3e-05,6.6e-05,2e-05,3.6e-05,2.9e-05,3.6e-05,4.1e-05,4.7e-05,9.5e-05,5.7e-05,8.2e-05,4.5e-05,0.00011,3.7e-05,9.6e-05,6e-05,6.8e-05,1.7e-05,8e-06,6.3e-05,8e-05,7.2e-05,6.6e-05,2.9e-05,7.6e-05,0.000109,7.3e-05,5.6e-05,8.5e-05,4.3e-05,5.8e-05,4.9e-05,3.8e-05,9.9e-05,6.7e-05,7.4e-05,3.6e-05,0.000104,6e-05,8.4e-05,3.1e-05,5.5e-05,5.6e-05,0.000127,9.7e-05,9.9e-05,9.7e-05,6.8e-05,7e-06,4.4e-05,3.9e-05,0.000145,0.000105,5e-05,7.6e-05,1.1e-05,8.4e-05,0.000106,7.7e-05,6.1e-05,3.8e-05,0.00011,6.2e-05,6.4e-05,6.1e-05,4.2e-05,6.2e-05,9.2e-05,9.9e-05,5.4e-05,6.7e-05,6.5e-05,5.7e-05,9.2e-05,6.4e-05,3e-05,4.4e-05,9e-05,9.1e-05,2e-05,3.7e-05,5.9e-05,5.4e-05,6.4e-05,2e-05,8.8e-05,5.6e-05,4.9e-05,4.9e-05,4.7e-05,0.000108,6.6e-05,8.2e-05,1e-04,7.8e-05,2.8e-05,3.2e-05,5.8e-05,6.5e-05
9.6e-05,0.000102,2.6e-05,1.1e-05,1.8e-05,9.8e-05,3.6e-05,0.000102,5.3e-05,7.5e-05,0.000104,0.000102,9.6e-05,5.7e-05,7.1e-05,0.000102,2.6e-05,0.00013,0.000105,0.000134,5.8e-05,0.000119,9.8e-05,9.5e-05,4.9e-05,6.3e-05,7.7e-05,4.9e-05,5.6e-05,5.7e-05,0.000166,0.000113,5.8e-05,4.5e-05,0.000157,6.2e-05,2e-05,2.1e-05,8e-05,8.7e-05,3.5e-05,8.3e-05,8.7e-05,8e-05,7.9e-05,8.2e-05,0.000136,5.8e-05,0.000143,9.2e-05,2.9e-05,5.5e-05,6.2e-05,0.000105,4.3e-05,0.000174,9.2e-05,8e-05,0.000145,0.000104,0.000119,8.8e-05,2.8e-05,0.00011,1e-06,0.000119,0.000136,0.000108,4.3e-05,0.000163,0.000118,8.5e-05,1.8e-05,0.000135,0.000135,8e-06,4.5e-05,6.3e-05,6.9e-05,0.000201,9.2e-05,1.6e-05,6.5e-05,0.00011,6.8e-05,0.000153,0.000154,0.000158,3.6e-05,5.7e-05,9.5e-05,8.9e-05,5.6e-05,6.9e-05,0.00012,7.2e-05,0.000143,7e-05,8.1e-05,0.000106,5e-06,8.1e-05,1e-04,9.4e-05,1.8e-05,8.5e-05,0.000116,2e-05,6.2e-05,4.6e-05,1.9e-05,5.9e-05,8.3e-05,4.6e-05,7.7e-05,6.9e-05,5.4e-05,2.6e-05,1.5e-05,4.3e-05,7.7e-05
0.000139,6.5e-05,0.000113,2.1e-05,3.7e-05,9.4e-05,3.6e-05,6.5e-05,0.000118,7e-05,0.000108,0.000111,0.000129,0.000177,7.5e-05,0.000136,0.00018,0.000284,0.000143,0.000178,0.00013,0.000137,0.000111,8.7e-05,2.8e-05,6.5e-05,4.2e-05,5.3e-05,6.8e-05,0.000137,0.000216,0.000208,0.000177,0.000131,0.000109,0.00011,0.000103,6e-05,0.00011,5.1e-05,2.8e-05,7.8e-05,6.9e-05,2.1e-05,0.00015,9e-05,5.8e-05,5.6e-05,0.000142,0.00013,0.000109,0.000108,0.000148,0.000223,0.000146,0.000192,0.000151,0.000155,0.000125,0.000265,0.000313,0.000149,0.000131,0.000203,0.000126,0.000155,0.00015,0.000231,0.000118,0.000325,0.000146,0.000172,0.000176,0.000123,0.000226,0.000237,0.000236,0.000149,0.000135,0.000288,0.000255,0.000141,9.1e-05,0.000113,0.000121,0.000251,0.000301,0.000162,0.000165,9.4e-05,5.9e-05,3.2e-05,2.1e-05,8.6e-05,0.000115,0.000213,0.000274,0.000203,0.000156,9e-05,7.6e-05,5.1e-05,4.8e-05,5e-05,6.6e-05,0.000106,8.6e-05,0.000113,0.000188,0.000129,6.3e-05,5.9e-05,1e-04,0.00013,0.000133,0.00012,0.000137,0.000143,9.2e-05,9e-05,0.000193
3e-06,0.000104,6.8e-05,0.00018,0.000143,0.00015,9.5e-05,1.7e-05,0.000168,8.4e-05,8.6e-05,0.000262,2.8e-05,0.000101,0.000207,0.000163,3.7e-05,0.000151,0.000156,3.5e-05,6.6e-05,5.9e-05,3.1e-05,5.1e-05,0.000116,0.000146,7.3e-05,7.4e-05,8.9e-05,9.6e-05,3.1e-05,0.000121,8.4e-05,2e-05,7.2e-05,0.000117,7e-05,2.8e-05,5.7e-05,3.1e-05,2.2e-05,2.2e-05,2.9e-05,2.6e-05,9.8e-05,4.4e-05,1.8e-05,5e-05,8.2e-05,5.3e-05,6.7e-05,5.1e-05,6.5e-05,0.000109,0.000158,4.3e-05,6.8e-05,2.8e-05,4.6e-05,0.000206,0.000117,8.8e-05,0.000115,0.000282,0.000116,6.4e-05,7.5e-05,0.000116,0.000155,0.000308,0.000298,0.000147,0.000245,0.000161,6.8e-05,0.000195,0.000189,8.3e-05,0.000181,6.2e-05,8.7e-05,8e-05,0.000182,0.000189,0.000149,7.9e-05,8.4e-05,0.000118,0.000144,6.1e-05,4.9e-05,4.6e-05,4.2e-05,9.7e-05,1.6e-05,0.00012,6.8e-05,4e-05,0.000101,0.000129,3.5e-05,3.7e-05,2.6e-05,5.6e-05,1.1e-05,3.5e-05,3.5e-05,6.7e-05,0.000134,1e-04,5e-05,4e-05,2.3e-05,8.5e-05,5.8e-05,8.1e-05,5.9e-05,0.000134,6.3e-05,0.000199,0.000172
6e-05,9.7e-05,0.000245,0.000361,0.000109,9e-05,0.000162,0.000186,0.000294,0.000234,0.000134,0.000293,0.000251,9.3e-05,0.000138,8.6e-05,6.3e-05,0.000125,1.7e-05,9.2e-05,0.000145,0.000128,0.000124,0.000133,0.000165,3.1e-05,0.000152,0.000239,7.8e-05,5.2e-05,0.000117,7.4e-05,3.9e-05,7.7e-05,5.6e-05,4.8e-05,0.000172,0.000119,3.1e-05,7e-06,4.5e-05,2.5e-05,6e-05,6.5e-05,7.1e-05,7.6e-05,3.3e-05,9.5e-05,6e-05,9e-05,4.1e-05,4.6e-05,8.7e-05,4e-05,0.000127,0.000169,0.000157,0.000155,0.000177,0.000222,0.000322,0.000299,0.000254,0.000292,0.000237,0.000138,0.000114,0.000163,0.000134,0.000381,0.000139,0.00016,0.000146,0.000311,0.000321,0.000366,0.000444,0.000361,0.000294,0.000206,3.3e-05,1e-04,0.000268,0.00011,2.4e-05,0.000141,0.000156,0.000103,4.1e-05,0.000154,0.000149,9.4e-05,8.7e-05,9.1e-05,5.5e-05,4.8e-05,7.4e-05,6.8e-05,0.000113,4.6e-05,8.3e-05,6e-05,6.2e-05,8.3e-05,3.8e-05,3.4e-05,3.7e-05,3.4e-05,0.000116,7.7e-05,3.3e-05,3e-05,3.7e-05,6.9e-05,4.9e-05,6.1e-05,5e-05,0.000109,0.000129,0.000125,0.000156
0.000146,5.4e-05,0.000267,0.000258,0.000249,0.000147,0.000129,5.5e-05,0.000176,7.2e-05,0.00012,0.000277,0.000251,0.000141,8e-05,0.000117,0.000143,3.6e-05,5.8e-05,9.8e-05,6.6e-05,7.4e-05,5e-05,8.2e-05,4.8e-05,0.000116,7.7e-05,0.000207,0.000188,0.000114,0.000142,0.000173,0.000122,0.000142,0.000113,6.1e-05,9.9e-05,0.000123,7.5e-05,3.7e-05,5.2e-05,0.00012,2.9e-05,7.9e-05,9e-06,7e-05,7.9e-05,8.5e-05,3.9e-05,7.3e-05,0.000129,0.000103,0.000138,0.000114,7e-06,0.000131,0.000107,8.8e-05,5.3e-05,4.9e-05,0.000176,0.000219,4.8e-05,0.00025,0.00018,7.9e-05,0.00019,0.000108,6.5e-05,0.000179,0.000168,0.000199,0.000134,0.000266,0.000198,9e-05,0.000211,0.000232,0.000108,0.000141,0.000185,0.00011,0.00029,0.000265,0.000222,0.000192,0.000243,0.00012,0.000105,0.000209,5.7e-05,4.7e-05,0.000124,3e-05,7e-05,7.4e-05,4.5e-05,3.4e-05,2.9e-05,2.3e-05,6.3e-05,5.6e-05,2.3e-05,6.4e-05,5.5e-05,6.7e-05,5.5e-05,2.1e-05,9.8e-05,5.1e-05,8e-06,4.1e-05,5.1e-05,1.5e-05,8.5e-05,5.8e-05,2.1e-05,9.1e-05,4.8e-05,0.000118,0.000232
9.8e-05,0.000107,0.000207,5.8e-05,0.000138,0.000138,7.2e-05,8.6e-05,0.000136,9.7e-05,7.2e-05,0.000108,6.8e-05,4.7e-05,7.5e-05,6.5e-05,1e-04,9.7e-05,8.7e-05,6.2e-05,0.000106,4e-05,6.1e-05,7.4e-05,2.9e-05,7.4e-05,0.000145,4.7e-05,7.3e-05,2.6e-05,0.000124,3e-05,9.6e-05,8.7e-05,4.1e-05,8.4e-05,9.3e-05,2.2e-05,6e-06,2.4e-05,4.3e-05,9e-05,6.1e-05,5.3e-05,7.1e-05,8.8e-05,5.9e-05,3.1e-05,5.1e-05,5.5e-05,9.3e-05,4.8e-05,0.000108,2.6e-05,1.7e-05,0.000114,3.9e-05,0.00012,0.000115,9.2e-05,0.000158,7.3e-05,6.5e-05,0.000142,4.5e-05,0.00011,0.000139,0.000141,0.000127,7.7e-05,2.8e-05,7.7e-05,0.000128,9.9e-05,0.000105,7.7e-05,5.3e-05,7.2e-05,4.3e-05,9.6e-05,0.000149,8.3e-05,0.000249,7.5e-05,0.000157,9.7e-05,0.000156,9.6e-05,6.8e-05,0.000145,0.00014,4.4e-05,0.000131,0.000147,0.000148,0.00011,7.3e-05,6.8e-05,6.9e-05,1.3e-05,5.5e-05,0.000124,6.9e-05,8.1e-05,3.2e-05,8.3e-05,5.9e-05,3.4e-05,5.7e-05,2.9e-05,2.4e-05,4.3e-05,7.5e-05,0.000103,0.000122,9.5e-05,0.000116,7.9e-05,6.6e-05,6.1e-05,0.000129
3.4e-05,0.000107,5.9e-05,9e-05,4.5e-05,1.5e-05,4.5e-05,0.000125,0.000107,4.9e-05,6.6e-05,9.4e-05,7.2e-05,3.9e-05,5.5e-05,5.5e-05,7.1e-05,3.9e-05,1.2e-05,1.5e-05,9.2e-05,3.4e-05,4.4e-05,9e-06,4.9e-05,5.1e-05,6.5e-05,6.4e-05,1.7e-05,7e-05,8.4e-05,7.3e-05,7.4e-05,5.3e-05,6.9e-05,5.6e-05,3.2e-05,9e-06,3.5e-05,3.9e-05,5.6e-05,8.8e-05,5.2e-05,7e-05,6.4e-05,7.2e-05,2.8e-05,1e-05,7e-06,5e-06,4.9e-05,2.7e-05,7.7e-05,4.9e-05,2.6e-05,8.4e-05,6.7e-05,4.5e-05,7.3e-05,1.6e-05,6e-05,8.4e-05,5.1e-05,5.7e-05,7.9e-05,0.000147,1.7e-05,4.5e-05,7e-05,0.000134,0.00011,7.3e-05,4.8e-05,5.7e-05,6.4e-05,6.4e-05,6.4e-05,3.7e-05,5.9e-05,0.000102,6.6e-05,4.3e-05,0.000103,0.000119,5.9e-05,7.9e-05,3.4e-05,2.7e-05,6e-06,8.6e-05,2.5e-05,3.9e-05,7.2e-05,3.7e-05,2e-06,6.3e-05,6.5e-05,6.4e-05,5.9e-05,8.4e-05,9.5e-05,4.6e-05,4.7e-05,2e-05,4.6e-05,9e-05,4.5e-05,2.9e-05,1.1e-05,6.5e-05,3.4e-05,3.3e-05,9.3e-05,8.8e-05,3.6e-05,3e-05,5.5e-05,6.2e-05,7.9e-05,4.9e-05,9.3e-05
9.4e-05,0.000175,0.000142,8.2e-05,8.4e-05,8.7e-05,3.5e-05,5.8e-05,2.9e-05,3.1e-05,4e-06,5e-06,5.3e-05,5.7e-05,6.7e-05,4.1e-05,1.6e-05,5.8e-05,5.1e-05,4.9e-05,1.7e-05,3.2e-05,6.4e-05,6.1e-05,6.1e-05,3.9e-05,4.7e-05,1.9e-05,6.4e-05,6e-05,0.000101,1.2e-05,1.8e-05,4e-05,4.6e-05,3.7e-05,2.2e-05,5e-06,3.1e-05,5.6e-05,4.3e-05,1.7e-05,1.4e-05,2.8e-05,1.5e-05,3.7e-05,1.5e-05,1.1e-05,4e-06,2.7e-05,3.5e-05,3.8e-05,7.6e-05,1.8e-05,9e-06,5.2e-05,7.9e-05,7.8e-05,8.7e-05,7.3e-05,4.4e-05,0.000107,0.000104,4.2e-05,5.8e-05,4.1e-05,5.9e-05,5.2e-05,0.000146,9.6e-05,6.5e-05,3.1e-05,3.3e-05,3.9e-05,0.000125,6.6e-05,8.9e-05,6.6e-05,6.2e-05,4.2e-05,3.7e-05,7.5e-05,4.4e-05,4.6e-05,8.1e-05,7.4e-05,4.1e-05,2.8e-05,4.3e-05,2.8e-05,2.9e-05,3.4e-05,3.2e-05,3.3e-05,7.4e-05,5.2e-05,8.3e-05,5.6e-05,1.5e-05,5.4e-05,5.1e-05,9e-05,8.4e-05,5.2e-05,4.5e-05,4.9e-05,3.9e-05,4.2e-05,1.8e-05,4.1e-05,5.4e-05,7.9e-05,3.5e-05,3.6e-05,2.1e-05,4.1e-05,4.7e-05,7.5e-05,8.1e-05,4.4e-05,0.000104
3.2e-05,6.7e-05,7.1e-05,7.3e-05,3.8e-05,2e-05,3.8e-05,4e-06,3.7e-05,2.8e-05,2.5e-05,9e-06,2.5e-05,1.4e-05,2.7e-05,2.2e-05,1.8e-05,2.8e-05,2.2e-05,2.2e-05,2.7e-05,2.4e-05,2.8e-05,2.1e-05,2e-05,7e-06,4.1e-05,5.4e-05,4.7e-05,3e-05,2.6e-05,6.7e-05,1.8e-05,3.5e-05,2.8e-05,2.7e-05,2e-06,1.1e-05,4e-06,4.1e-05,1.7e-05,1.7e-05,2.1e-05,2e-05,1.3e-05,2e-05,1.9e-05,3e-06,8e-06,4.1e-05,4.5e-05,1.4e-05,1e-05,3.4e-05,3.9e-05,3.6e-05,8e-06,1.8e-05,3.7e-05,3.2e-05,4e-05,8.3e-05,4.5e-05,8.8e-05,3.5e-05,3.6e-05,3.8e-05,3.8e-05,0.000101,1.8e-05,4.5e-05,3.2e-05,2.7e-05,6.6e-05,6.2e-05,1.4e-05,2.2e-05,1.5e-05,1.2e-05,2.9e-05,2.6e-05,4.3e-05,3.9e-05,3e-05,2.3e-05,4.4e-05,1.2e-05,2.8e-05,3.5e-05,2.3e-05,3.7e-05,1.5e-05,1.4e-05,2.8e-05,6.3e-05,4.8e-05,3.5e-05,3e-05,7e-06,5.5e-05,1e-06,3.4e-05,2.1e-05,2.5e-05,5.6e-05,1.4e-05,2.2e-05,3.3e-05,2.7e-05,2.3e-05,3.3e-05,1.9e-05,1.2e-05,9e-06,2.7e-05,1.8e-05,3.3e-05,5.2e-05,1.3e-05,6.8e-05,8.7e-05
3.2e-05,2.3e-05,9.7e-05,5.3e-05,2.2e-05,1.3e-05,4.4e-05,7e-06,1.5e-05,3.6e-05,3.8e-05,2.4e-05,2e-06,1.5e-05,6e-06,5e-06,1.5e-05,3e-06,7e-06,1.3e-05,8e-06,1.4e-05,7e-06,2.5e-05,1.4e-05,8e-06,2.9e-05,2.6e-05,6.2e-05,1e-05,2.1e-05,5.8e-05,4.6e-05,3e-06,4e-05,6e-06,9e-06,1.5e-05,2.4e-05,3.2e-05,2.2e-05,4e-06,2e-06,3e-05,1.6e-05,8e-06,1.7e-05,1.7e-05,1.7e-05,4e-05,3.4e-05,1.2e-05,6e-06,2.9e-05,1.7e-05,3.1e-05,1.7e-05,1.3e-05,6.2e-05,3.5e-05,6.3e-05,4.7e-05,3.7e-05,2.5e-05,2.1e-05,2e-05,1.2e-05,3.1e-05,4.3e-05,8e-06,2.1e-05,1.4e-05,9e-06,7e-05,6.9e-05,1.9e-05,2.8e-05,1e-05,3e-05,2.2e-05,1e-05,2.4e-05,3.7e-05,1.4e-05,3.6e-05,1.6e-05,1.8e-05,2.6e-05,3.4e-05,1.8e-05,2.6e-05,3.7e-05,1.2e-05,1e-05,5e-05,2.6e-05,2.4e-05,2e-05,1e-05,4.3e-05,9e-06,7e-06,1e-05,1.8e-05,2.3e-05,1.2e-05,8e-06,2.2e-05,8e-06,1.9e-05,2e-05,2e-05,1e-05,1.5e-05,2.1e-05,1.3e-05,4.8e-05,4.5e-05,4.3e-05,6.9e-05,7e-06
3.1e-05,7.5e-05,9.7e-05,3.9e-05,2.2e-05,3.4e-05,3.1e-05,1.1e-05,4.4e-05,2.8e-05,3.2e-05,2.6e-05,2.2e-05,2.6e-05,2.4e-05,2.2e-05,2.1e-05,2.9e-05,1.8e-05,4e-06,8e-06,7e-06,1.8e-05,2.7e-05,2.8e-05,8e-06,2e-05,4.4e-05,6.2e-05,2.5e-05,1.1e-05,5.9e-05,3e-05,5e-06,1.4e-05,1e-05,1.1e-05,2e-05,2.2e-05,1.1e-05,2.5e-05,2.3e-05,2.2e-05,4e-06,2.7e-05,2.4e-05,2.5e-05,3e-05,2.6e-05,2.2e-05,3.2e-05,3.2e-05,3.4e-05,3.6e-05,1.4e-05,4.4e-05,6.9e-05,4.2e-05,9.1e-05,2.8e-05,6.6e-05,5.3e-05,2e-05,9.6e-05,6.8e-05,8.9e-05,7.9e-05,6.9e-05,0.000105,2e-05,7.2e-05,9e-06,2e-06,5.7e-05,6.4e-05,4.2e-05,3.1e-05,3.7e-05,2e-05,1.8e-05,3.2e-05,2.2e-05,2e-05,2.2e-05,3.4e-05,4.6e-05,2.3e-05,2.7e-05,3.5e-05,2.3e-05,4.9e-05,2e-06,3e-05,2.5e-05,5.6e-05,2.1e-05,1.1e-05,4.6e-05,2.9e-05,1.9e-05,1.3e-05,3.2e-05,3.1e-05,1.9e-05,2e-05,2.1e-05,1.7e-05,1.7e-05,1.9e-05,2.4e-05,2.1e-05,8e-06,7e-06,1.9e-05,3e-05,2.9e-05,1.7e-05,7.8e-05,7.8e-05,7.1e-05,2.4e-05
3.6e-05,6.5e-05,9.7e-05,8.7e-05,2.4e-05,1e-05,2e-06,7.5e-05,4e-05,3.3e-05,4.5e-05,3.5e-05,9e-06,2.4e-05,1.5e-05,3e-05,3.7e-05,3.4e-05,2.8e-05,3.5e-05,2.5e-05,2.2e-05,1.7e-05,5e-06,4.1e-05,3.3e-05,3.1e-05,1.7e-05,8.1e-05,3.4e-05,2.7e-05,6.8e-05,4.6e-05,1.8e-05,2.6e-05,3e-05,1.9e-05,9e-06,1.2e-05,5e-06,2.6e-05,1.9e-05,3.4e-05,1.9e-05,2.5e-05,4e-06,1.5e-05,8e-06,1.6e-05,1.5e-05,3.3e-05,3.6e-05,3e-05,2.1e-05,4.4e-05,5.2e-05,2.4e-05,1.4e-05,5.6e-05,7.9e-05,3.9e-05,8.9e-05,6.3e-05,0.000122,4.5e-05,9e-05,7.3e-05,3.1e-05,4.4e-05,4.3e-05,7.3e-05,0.000109,8.7e-05,4.6e-05,2.5e-05,4e-05,4.8e-05,4e-06,3.2e-05,4.7e-05,2.2e-05,1.5e-05,2.9e-05,2.6e-05,2.2e-05,3.1e-05,1.4e-05,2.8e-05,3.5e-05,5.8e-05,2.1e-05,4.1e-05,4.3e-05,2.1e-05,8.9e-05,3.8e-05,3.3e-05,1.7e-05,3e-05,7.6e-05,4.5e-05,4.3e-05,2.8e-05,2.9e-05,3.6e-05,2.7e-05,2e-05,2.9e-05,1.4e-05,1.3e-05,1e-05,3e-06,1.5e-05,2.1e-05,1.8e-05,1.6e-05,1.1e-05,7e-05,3.5e-05,4.2e-05,8e-06
2.7e-05,1.6e-05,2.3e-05,2.3e-05,1.7e-05,5.2e-05,4.9e-05,0.000108,5e-05,1.5e-05,2.8e-05,3.4e-05,3e-05,3.4e-05,2.5e-05,3e-05,1.8e-05,3.2e-05,1.2e-05,3.5e-05,1.8e-05,1.8e-05,2e-05,3.5e-05,2.5e-05,3.1e-05,6.4e-05,1e-05,8.6e-05,3.2e-05,3.7e-05,6.3e-05,6e-05,3.2e-05,3.7e-05,1.2e-05,1e-05,1.8e-05,2.6e-05,1.8e-05,1.6e-05,1.3e-05,2e-05,4.2e-05,2.5e-05,3.4e-05,1.3e-05,1.9e-05,8e-06,3e-06,3.1e-05,1.7e-05,3.7e-05,2e-05,2.5e-05,1.9e-05,7e-06,4e-06,1.8e-05,3.8e-05,7.5e-05,3.3e-05,3.8e-05,4.9e-05,4.8e-05,8.7e-05,2.2e-05,4.2e-05,5e-05,1.6e-05,1.3e-05,8.6e-05,7.7e-05,2e-06,0.00011,8.1e-05,5.8e-05,4.4e-05,9e-06,2.8e-05,3.6e-05,4.9e-05,1.9e-05,3.7e-05,1.8e-05,8e-06,3.6e-05,3.7e-05,8e-06,4.7e-05,2.9e-05,2.4e-05,2.5e-05,3.6e-05,6.3e-05,6.1e-05,3.7e-05,2.3e-05,4.2e-05,6e-05,3.2e-05,2.6e-05,2.8e-05,1.6e-05,1.8e-05,3.7e-05,2.9e-05,9e-06,1.8e-05,3e-05,8e-06,1.5e-05,6e-06,1e-05,1.8e-05,2e-06,2.7e-05,4.9e-05,1e-05,2.8e-05,2.1e-05
2.3e-05,5.2e-05,1.7e-05,2.4e-05,2.2e-05,6.2e-05,1.2e-05,0.000103,1.5e-05,2.8e-05,4.9e-05,1.2e-05,5.5e-05,3.8e-05,1e-05,5.1e-05,5e-06,3.1e-05,2.6e-05,3.9e-05,1.5e-05,2.4e-05,4.1e-05,4.8e-05,4.7e-05,1.4e-05,3.7e-05,2.7e-05,8.9e-05,5.6e-05,7e-06,0.000115,6.5e-05,2.5e-05,4.5e-05,2.1e-05,1.2e-05,3.1e-05,1.7e-05,1.2e-05,1.1e-05,1.9e-05,4e-06,4e-05,1.9e-05,1.5e-05,1.7e-05,2.3e-05,1.6e-05,2.5e-05,1.5e-05,1.3e-05,4.3e-05,1.6e-05,2.3e-05,1.4e-05,1.2e-05,3e-06,1.2e-05,1.5e-05,3.6e-05,1.8e-05,7e-06,1.4e-05,3.4e-05,8.1e-05,2.4e-05,3.3e-05,7.3e-05,3.5e-05,9.9e-05,0.000106,0.000123,0.000102,0.000116,5.7e-05,7.3e-05,3.5e-05,2.4e-05,4.1e-05,5.7e-05,2.5e-05,7e-06,5.6e-05,1.7e-05,2e-05,4.6e-05,7.6e-05,2.7e-05,7.6e-05,1.1e-05,6e-05,2.3e-05,4.3e-05,0.000142,6.8e-05,2.6e-05,2.8e-05,6.9e-05,3.4e-05,7e-05,2.9e-05,4.4e-05,3.9e-05,4.3e-05,5.4e-05,2.4e-05,2.7e-05,6e-06,1.5e-05,2.3e-05,1.8e-05,2.4e-05,1.6e-05,1.5e-05,4e-06,3.8e-05,2.7e-05,2.1e-05,3.6e-05,4e-06
4.5e-05,4.2e-05,7e-05,2.5e-05,2.7e-05,6e-05,1.9e-05,0.00012,0.000117,2.5e-05,6.4e-05,5.1e-05,3.3e-05,4e-05,2e-05,6.2e-05,4.3e-05,3.1e-05,2.1e-05,2.6e-05,3.3e-05,1.8e-05,3.8e-05,6.5e-05,3e-05,8e-06,0.000121,1.8e-05,1e-04,0.00013,4.1e-05,0.000186,0.000197,8.4e-05,4.1e-05,5.9e-05,3.3e-05,5.2e-05,1.3e-05,4.6e-05,1.4e-05,2.1e-05,3.2e-05,2.2e-05,1.6e-05,5.6e-05,3.3e-05,2.9e-05,3.8e-05,1.6e-05,2.7e-05,3.4e-05,3.6e-05,2e-05,3.4e-05,3.6e-05,1.5e-05,9e-06,3.4e-05,1.1e-05,2.7e-05,2.2e-05,2e-06,8e-05,3.2e-05,9.6e-05,8.8e-05,3.7e-05,6e-05,4e-05,0.00023,5.9e-05,0.000151,4.6e-05,0.000132,6.1e-05,3.2e-05,0.000112,7.4e-05,3.2e-05,1e-04,1.9e-05,6.4e-05,3.4e-05,0.00011,1.4e-05,2.4e-05,5.2e-05,4.9e-05,4.1e-05,0.000113,0.000111,7.4e-05,0.000114,0.000293,0.000307,0.000148,3.4e-05,6.8e-05,0.000127,0.000117,7.6e-05,2.9e-05,2.3e-05,4.7e-05,3.6e-05,3.5e-05,4.4e-05,4.6e-05,2.8e-05,3.7e-05,4.5e-05,7.3e-05,6.3e-05,4.2e-05,1e-05,4.4e-05,0.000103,4.8e-05,1.5e-05,1.9e-05
8.3e-05,6.4e-05,3.7e-05,6e-05,3.9e-05,0.000129,1e-04,0.000161,0.000239,0.000171,2.7e-05,7.7e-05,9.1e-05,8.8e-05,6.7e-05,3.8e-05,4.5e-05,6.3e-05,3.4e-05,2.9e-05,1.9e-05,1.4e-05,4.5e-05,0.00013,0.000163,9.1e-05,0.00021,0.000205,0.000111,0.000306,0.000246,0.000217,0.000475,0.000299,0.000137,6.6e-05,1.3e-05,3.4e-05,5.5e-05,5.9e-05,6.5e-05,4.7e-05,3.1e-05,6.9e-05,2.5e-05,9e-05,6.5e-05,5e-05,8.1e-05,6.8e-05,7.6e-05,2.8e-05,6.6e-05,3.2e-05,5.7e-05,9.2e-05,4.5e-05,1.7e-05,6.5e-05,5.5e-05,1e-05,3.7e-05,2.3e-05,0.000146,0.000104,0.00018,0.000241,0.000161,0.000264,0.00015,0.000366,0.000197,0.000192,0.000198,0.000191,0.000195,0.000199,0.000207,0.000102,7.1e-05,7.7e-05,8.6e-05,5.9e-05,8.9e-05,0.000124,0.000151,0.000103,3.8e-05,2.9e-05,3.2e-05,0.000119,5.5e-05,6.8e-05,0.000153,0.000243,0.000342,0.000318,0.000208,0.000141,0.000127,7.3e-05,0.000108,1e-04,8e-05,5.3e-05,2.2e-05,2.3e-05,4.1e-05,1.9e-05,9e-06,3.1e-05,6.1e-05,4.7e-05,4e-05,3.1e-05,2.8e-05,3.7e-05,9.5e-05,6.6e-05,2.9e-05,5.2e-05
7.5e-05,3.9e-05,6.9e-05,9.6e-05,8.2e-05,0.000171,8.6e-05,0.00012,0.000204,0.000114,0.000141,0.000145,7.1e-05,6e-05,2.6e-05,7.7e-05,6e-05,2.9e-05,3.2e-05,4.4e-05,2.1e-05,2.9e-05,6.1e-05,0.000126,0.000114,5.6e-05,0.000307,0.000314,6.9e-05,0.00038,0.000445,0.000485,0.000508,0.000264,0.000113,4.1e-05,4.7e-05,3.6e-05,8.3e-05,0.000135,8.2e-05,4.5e-05,6.6e-05,7.7e-05,8.9e-05,0.000124,6.5e-05,5.1e-05,5.8e-05,5.7e-05,2.5e-05,3.7e-05,2.6e-05,2.8e-05,1.6e-05,5.7e-05,3.5e-05,2.7e-05,6.7e-05,2.6e-05,5e-05,6.3e-05,7.6e-05,0.000155,8.3e-05,0.000146,0.000167,7e-05,0.000301,0.000199,0.000238,0.000199,0.000295,0.000276,0.000359,0.000308,0.000204,0.000177,7.8e-05,8.4e-05,7.5e-05,0.000118,0.00017,5.9e-05,0.000109,0.000233,5.6e-05,3.7e-05,6.9e-05,3.5e-05,9.1e-05,0.000122,0.000158,0.000226,0.000111,0.000133,0.000114,6.6e-05,3.9e-05,7.7e-05,6.6e-05,0.000142,6.9e-05,5.7e-05,5.4e-05,6.7e-05,9.9e-05,8.5e-05,8.4e-05,6.9e-05,1.9e-05,3.7e-05,5.5e-05,3.6e-05,6.3e-05,4.8e-05,5.7e-05,8.2e-05,7.6e-05,3.5e-05,6.9e-05
3.9e-05,3.5e-05,9.6e-05,5.7e-05,2.7e-05,0.000156,6.8e-05,0.000108,7.6e-05,4.3e-05,8.1e-05,5.3e-05,1.7e-05,2.4e-05,2e-06,4.8e-05,1.6e-05,1.6e-05,3.9e-05,2.5e-05,2.6e-05,2.1e-05,5.2e-05,5.6e-05,2.9e-05,2.1e-05,0.000231,1e-04,0.000149,0.000324,8.9e-05,0.000199,6.9e-05,2.4e-05,5.7e-05,4.4e-05,3.8e-05,5.6e-05,7.8e-05,8.7e-05,5.4e-05,2.3e-05,9e-05,1.7e-05,6.4e-05,6.2e-05,2.3e-05,2.7e-05,5.9e-05,9e-06,4.9e-05,2.4e-05,8e-06,8e-06,7e-06,3.8e-05,3.3e-05,1.5e-05,3.2e-05,2.4e-05,8.6e-05,6.9e-05,1.4e-05,6.8e-05,3.9e-05,0.000154,4.9e-05,1.3e-05,0.000188,6.5e-05,0.000201,0.000167,0.000226,0.000134,0.000226,0.000206,7e-05,8.9e-05,0.000101,1e-04,4.1e-05,9.7e-05,5e-05,7.3e-05,0.000138,0.000232,0.000212,0.000142,6.4e-05,4.4e-05,5.4e-05,9.8e-05,9.8e-05,0.00013,0.000116,6.4e-05,0.000112,5.3e-05,1e-05,3.9e-05,5.5e-05,5.1e-05,3.3e-05,1.3e-05,4.5e-05,4.1e-05,5e-05,4.4e-05,2.4e-05,1.5e-05,1.2e-05,2.9e-05,4.1e-05,9e-06,4.8e-05,2.2e-05,1e-05,5.3e-05,2e-05,5.5e-05,2.7e-05
1.6e-05,3.9e-05,5.8e-05,2e-05,3.8e-05,3.1e-05,4.5e-05,0.000108,3.2e-05,5e-06,4.6e-05,2.4e-05,3.6e-05,4.4e-05,2.2e-05,1.8e-05,3.1e-05,1.3e-05,2.7e-05,1.5e-05,1.7e-05,1.2e-05,2.9e-05,6.5e-05,1.3e-05,3.3e-05,7.5e-05,2.9e-05,0.000101,7.8e-05,2.7e-05,0.000155,7e-05,1.1e-05,5.8e-05,3.3e-05,3.4e-05,2e-05,9e-06,4.7e-05,4.1e-05,3e-05,6.6e-05,2.2e-05,2.6e-05,2e-05,1.3e-05,2.6e-05,2.6e-05,2.1e-05,4e-05,2e-06,3.1e-05,3.9e-05,1.6e-05,3e-05,6e-06,4e-06,3.4e-05,3.4e-05,6.6e-05,2.3e-05,9e-06,2.6e-05,4.5e-05,0.000177,5.4e-05,1.1e-05,3.3e-05,1.9e-05,0.000112,1.8e-05,0.000248,7.4e-05,0.000244,9.9e-05,0.000149,0.000135,3e-06,4.3e-05,0.000116,2.4e-05,7.6e-05,0.000106,0.000109,8e-05,5.4e-05,2.1e-05,3e-05,1.7e-05,6.9e-05,9e-06,5.3e-05,2.8e-05,3.6e-05,2e-05,3.1e-05,3.1e-05,2.6e-05,2.4e-05,2e-05,1.9e-05,1.3e-05,1.8e-05,2.3e-05,1e-05,4.5e-05,2.9e-05,3e-05,3.4e-05,1.7e-05,1.3e-05,2e-05,1.2e-05,2.4e-05,2.3e-05,2e-05,1.4e-05,2.6e-05,4.2e-05,1e-05
3.4e-05,1.1e-05,4.8e-05,4.5e-05,2.4e-05,4.5e-05,1.1e-05,4.7e-05,2.4e-05,1e-05,5e-06,1e-05,2e-05,1.9e-05,1.6e-05,9e-06,1.7e-05,1e-05,1.9e-05,1.1e-05,1.3e-05,1e-05,1.3e-05,2.9e-05,1.1e-05,2.2e-05,3.5e-05,1.2e-05,4.6e-05,7.9e-05,1e-05,6.5e-05,9e-06,6e-06,2.5e-05,6e-06,5e-06,1.9e-05,2e-05,2.4e-05,4e-06,8e-06,1.1e-05,1.7e-05,2.6e-05,9e-06,2e-05,1e-05,1e-05,5e-06,2e-06,1e-05,1.4e-05,1.1e-05,5e-06,8e-06,6e-06,1.2e-05,2.1e-05,6e-06,3.2e-05,2.4e-05,6e-06,4.4e-05,7e-06,7.7e-05,4.9e-05,1.7e-05,9e-05,1.6e-05,7.1e-05,2.9e-05,0.000118,4.3e-05,0.000115,3.8e-05,4e-05,3.4e-05,4.6e-05,5e-06,2.4e-05,3.4e-05,3.4e-05,3.9e-05,8.7e-05,3.8e-05,5.4e-05,2.1e-05,1.6e-05,2e-05,2.7e-05,2.9e-05,1e-05,7e-06,2.5e-05,3.1e-05,1.9e-05,1.7e-05,2.7e-05,2.8e-05,1.3e-05,9e-06,6e-06,1.5e-05,1.9e-05,8e-06,1.2e-05,8e-06,1.5e-05,1.1e-05,1.2e-05,9e-06,1.6e-05,3e-06,6e-06,7e-06,7e-06,1e-05,9e-06,2.3e-05,4e-06
3.6e-05,3.8e-05,6.6e-05,5.9e-05,1.8e-05,6.1e-05,5.1e-05,6.6e-05,4.9e-05,3.1e-05,2e-05,1.4e-05,5e-06,1.3e-05,8e-06,4e-06,1.9e-05,6e-06,2.1e-05,1.9e-05,6e-06,5e-06,2.5e-05,5e-06,1.7e-05,1.4e-05,9e-05,6e-05,2e-05,5.5e-05,6.8e-05,6.2e-05,4.8e-05,2.2e-05,2.5e-05,1.3e-05,1.8e-05,3.9e-05,1.5e-05,1.2e-05,2.1e-05,1.2e-05,1.5e-05,2.9e-05,1.6e-05,2e-05,4e-05,3.8e-05,2.8e-05,3.2e-05,1.6e-05,1.3e-05,1.4e-05,1.2e-05,5e-06,1.8e-05,1.1e-05,1.4e-05,2.8e-05,1.9e-05,2.1e-05,1.5e-05,1.7e-05,4.9e-05,4.3e-05,4.4e-05,6.7e-05,4.3e-05,0.000107,9.2e-05,0.000139,0.000108,6.2e-05,9e-05,5.5e-05,9.5e-05,0.000106,8.2e-05,5.7e-05,7.2e-05,5.8e-05,2.1e-05,8.1e-05,6.8e-05,8.2e-05,4.5e-05,9e-06,3.4e-05,1.4e-05,2.8e-05,1.7e-05,4.6e-05,1.8e-05,6e-06,6.5e-05,3.1e-05,2.2e-05,3e-05,2.1e-05,2.8e-05,2.5e-05,2.2e-05,2e-06,2e-06,4e-06,1.3e-05,6e-06,9e-06,1.2e-05,1.6e-05,9e-06,1.3e-05,1.3e-05,1.8e-05,1.3e-05,1.6e-05,1.2e-05,2.2e-05,1.8e-05,1.7e-05,3e-06
3.9e-05,3e-05,3.2e-05,1.8e-05,2.4e-05,3.6e-05,1.3e-05,4.1e-05,4.7e-05,1.4e-05,1.5e-05,8e-06,6e-06,7e-06,1e-06,4e-06,1e-05,8e-06,1.5e-05,1.1e-05,1.1e-05,1.2e-05,3.3e-05,1.4e-05,8e-06,1.1e-05,6.6e-05,1.3e-05,5.5e-05,4.3e-05,1.2e-05,2.9e-05,2e-05,1e-05,2.3e-05,2e-05,1.9e-05,3e-05,1.8e-05,1.9e-05,6e-06,6e-06,1e-05,1e-05,1.9e-05,1.9e-05,2e-05,1.5e-05,2e-06,3.2e-05,2.1e-05,5e-06,9e-06,1.5e-05,7e-06,2.2e-05,1e-05,1.2e-05,2.8e-05,6e-06,2.3e-05,1.6e-05,1.1e-05,2.9e-05,1.2e-05,5.7e-05,3.6e-05,6e-06,7.7e-05,2.7e-05,0.00012,0.000104,0.000111,0.000142,1e-04,0.000153,4.9e-05,0.000101,6.3e-05,9.3e-05,5e-05,5.7e-05,7.1e-05,0.000113,7.9e-05,7.8e-05,2.4e-05,3.2e-05,3.5e-05,2.9e-05,2.2e-05,4.3e-05,3.8e-05,4.7e-05,7.1e-05,3.1e-05,4e-05,4.9e-05,3.1e-05,1.2e-05,5e-06,1e-05,1.5e-05,8e-06,7e-06,1.5e-05,2.2e-05,4e-06,3e-06,1.3e-05,8e-06,1.7e-05,8e-06,1.5e-05,2.2e-05,7e-06,5e-06,1.9e-05,1.5e-05,1.7e-05,2e-06
2.9e-05,1.9e-05,3.2e-05,1.5e-05,7e-06,1.7e-05,2.1e-05,3e-05,2.3e-05,1.8e-05,2.8e-05,1.8e-05,2e-05,1.2e-05,5e-06,7e-06,2e-06,4e-06,2e-06,9e-06,9e-06,1.4e-05,1.7e-05,2.1e-05,6e-06,5e-06,1.2e-05,1.7e-05,4.3e-05,3.6e-05,2.2e-05,2.1e-05,1.7e-05,9e-06,3.2e-05,1.6e-05,1.4e-05,6e-06,8e-06,3.3e-05,4.3e-05,1.9e-05,2.2e-05,3.6e-05,2.3e-05,4.5e-05,8e-05,5.8e-05,3.9e-05,4.9e-05,3.1e-05,2.2e-05,1.4e-05,5e-06,1.2e-05,2.2e-05,1.2e-05,3e-06,1.7e-05,2e-05,2.3e-05,1.7e-05,1.8e-05,1.1e-05,2.9e-05,3e-05,2.5e-05,1.5e-05,3.6e-05,3.5e-05,0.000115,5.2e-05,9.5e-05,8.8e-05,0.000125,0.000141,0.000122,6.8e-05,5.3e-05,5e-05,8.8e-05,0.00011,7.3e-05,5e-05,2.9e-05,0.000115,0.000116,7.8e-05,3.9e-05,2.3e-05,1e-05,4e-05,1.6e-05,3.6e-05,5.7e-05,4.1e-05,3.9e-05,1.6e-05,4.8e-05,3.1e-05,9e-06,7e-06,7e-06,4e-06,5e-06,1.8e-05,2e-05,1.8e-05,7e-06,6e-06,9e-06,6e-06,5e-06,1.1e-05,4e-06,7e-06,6e-06,1.9e-05,5e-06,2.8e-05,2.4e-05
1.4e-05,2e-06,1.9e-05,1.2e-05,1e-05,1.2e-05,4e-06,3.2e-05,1.2e-05,1.1e-05,1.8e-05,6e-06,9e-06,2e-06,4e-06,5e-06,7e-06,5e-06,8e-06,3e-06,4e-06,1e-05,1.2e-05,7e-06,4e-06,7e-06,2.6e-05,9e-06,3.3e-05,4e-06,7e-06,1.1e-05,6e-06,6e-06,1e-05,5e-06,1.8e-05,7e-06,2e-05,4.5e-05,5.7e-05,4.3e-05,2.7e-05,9.6e-05,4.7e-05,3.2e-05,9.1e-05,3.5e-05,3.1e-05,2.5e-05,2.5e-05,1.7e-05,3e-05,2e-05,1.4e-05,9e-06,6e-06,1.9e-05,1.5e-05,1e-05,1.5e-05,1.7e-05,2.4e-05,1.8e-05,8e-06,2e-05,1.2e-05,9e-06,2.5e-05,1.2e-05,7.1e-05,2.1e-05,7.2e-05,1e-05,8.7e-05,4.3e-05,6.1e-05,1.7e-05,2.9e-05,2.9e-05,2.2e-05,4.2e-05,3.9e-05,4.7e-05,6.4e-05,7.9e-05,2e-05,2.3e-05,1.8e-05,1e-05,2.1e-05,5.8e-05,5e-05,3.9e-05,3.1e-05,1.7e-05,3e-05,1.3e-05,2.8e-05,2.3e-05,1.2e-05,9e-06,4e-06,4e-06,8e-06,1.5e-05,1.4e-05,4e-06,5e-06,4e-06,2e-06,5e-06,2e-06,1.3e-05,1.6e-05,9e-06,5e-06,1.2e-05,8e-06,2.7e-05,2.6e-05
6e-06,8e-06,1e-05,1.7e-05,7e-06,8e-06,7e-06,1.6e-05,1e-05,3e-06,1.1e-05,1.2e-05,1.3e-05,6e-06,3e-06,3e-06,5e-06,5e-06,5e-06,4e-06,6e-06,9e-06,1e-05,1.3e-05,6e-06,8e-06,2.1e-05,3e-06,2.5e-05,1.5e-05,7e-06,1.2e-05,1.4e-05,1.1e-05,1.6e-05,7e-06,1.8e-05,2.2e-05,2.9e-05,6.1e-05,3e-05,4.7e-05,3.5e-05,0.000113,7e-05,3.2e-05,9.2e-05,4.8e-05,4.4e-05,4.3e-05,5.9e-05,2e-05,1.3e-05,1.1e-05,1.1e-05,8e-06,2e-06,3e-05,2.6e-05,1.6e-05,9e-06,1.2e-05,1.7e-05,1.5e-05,7e-06,1.3e-05,1.7e-05,1.7e-05,1e-05,6e-06,2.3e-05,1.4e-05,5.1e-05,3.4e-05,5.9e-05,3.1e-05,3.8e-05,2.8e-05,1.2e-05,7e-06,1.7e-05,1.1e-05,3.8e-05,2.1e-05,4.3e-05,1e-05,8e-06,1e-05,1.6e-05,8e-06,2.8e-05,1.9e-05,3.2e-05,5e-06,5.8e-05,2.9e-05,2e-05,2.5e-05,2.4e-05,1.6e-05,9e-06,7e-06,2e-06,1e-06,2e-06,1.3e-05,1.1e-05,1.1e-05,7e-06,6e-06,6e-06,9e-06,5e-06,8e-06,1.2e-05,9e-06,9e-06,1e-05,8e-06,2.6e-05,6e-06
5e-06,1.2e-05,1.1e-05,6e-06,6e-06,4e-06,2e-06,1e-05,4e-06,6e-06,3e-06,5e-06,6e-06,2e-06,7e-06,3e-06,5e-06,5e-06,4e-06,1e-06,7e-06,9e-06,6e-06,4e-06,1e-06,3e-06,1.1e-05,5e-06,1.7e-05,6e-06,1.1e-05,1e-05,1.1e-05,1.2e-05,1.5e-05,7e-06,1.5e-05,2.8e-05,4e-05,2.2e-05,4.9e-05,1.6e-05,2.2e-05,9.6e-05,5.2e-05,5.4e-05,9.7e-05,5.4e-05,7e-06,4.7e-05,4.4e-05,3.8e-05,2.7e-05,1.2e-05,1e-05,8e-06,9e-06,3.6e-05,7e-06,1.1e-05,1.9e-05,2.7e-05,3e-06,8e-06,5e-06,1.3e-05,9e-06,7e-06,1.7e-05,1e-05,1.1e-05,1.5e-05,3.9e-05,4e-06,6.1e-05,1.3e-05,4.1e-05,8e-06,1e-05,1.5e-05,2.6e-05,1.7e-05,2.5e-05,5e-06,3.6e-05,2.2e-05,1.9e-05,1.2e-05,1.1e-05,5e-06,2e-05,5e-06,3.3e-05,2.1e-05,4.6e-05,2.2e-05,1.2e-05,8e-06,1.9e-05,1.2e-05,1.1e-05,5e-06,1e-06,3e-06,1e-05,7e-06,7e-06,1.2e-05,2e-06,1e-06,7e-06,3e-06,4e-06,8e-06,2e-06,6e-06,6e-06,8e-06,7e-06,1.1e-05,1e-06
2e-06,4e-06,8e-06,5e-06,4e-06,1e-05,4e-06,9e-06,1e-06,2e-06,1.1e-05,4e-06,1e-05,2e-06,6e-06,6e-06,5e-06,3e-06,5e-06,4e-06,7e-06,8e-06,2e-06,2e-06,1e-06,3e-06,1.4e-05,1e-06,1.2e-05,1.4e-05,9e-06,1.1e-05,1.2e-05,1e-05,1.1e-05,1e-06,1.3e-05,2.1e-05,2.6e-05,2.8e-05,2.5e-05,1.7e-05,3.7e-05,3.1e-05,1.8e-05,3.7e-05,3.2e-05,2.8e-05,9e-06,3e-05,1.3e-05,1.2e-05,1.4e-05,1.5e-05,9e-06,4e-06,1.1e-05,2.4e-05,1.8e-05,6e-06,1.6e-05,4e-06,1.2e-05,1.6e-05,1.4e-05,1.6e-05,1.3e-05,4e-06,1.3e-05,1.4e-05,1.7e-05,1e-05,1.1e-05,1.1e-05,4.3e-05,2.4e-05,2.6e-05,6e-06,1.7e-05,1.7e-05,1.1e-05,5e-06,1.6e-05,8e-06,2.2e-05,9e-06,1.8e-05,6e-06,1.2e-05,4e-06,6e-06,2.5e-05,4e-05,4.1e-05,3.5e-05,6e-06,2e-05,1.2e-05,1.2e-05,2e-05,2.3e-05,1.2e-05,7e-06,7e-06,2.7e-05,2.3e-05,1.8e-05,1.9e-05,1.6e-05,1e-05,1e-05,1e-05,5e-06,8e-06,7e-06,8e-06,5e-06,1.2e-05,4e-06,1.1e-05,7e-06
2e-06,6e-06,8e-06,5e-06,3e-06,4e-06,3e-06,2e-06,4e-06,3e-06,1e-05,5e-06,6e-06,2e-06,3e-06,2e-06,5e-06,4e-06,5e-06,2e-06,3e-06,5e-06,2e-06,5e-06,3e-06,2e-06,1.2e-05,3e-06,5e-06,9e-06,8e-06,5e-06,4e-06,1.1e-05,1.7e-05,2e-06,1.2e-05,1.4e-05,9e-06,1.5e-05,3.1e-05,1.5e-05,2.8e-05,3e-06,7e-06,2.4e-05,9e-06,2.2e-05,2.1e-05,7e-06,5e-06,6e-06,9e-06,1e-05,4e-06,7e-06,1.1e-05,6e-06,3e-06,2e-06,1.2e-05,1.6e-05,1.5e-05,3e-06,1.2e-05,5e-06,4e-06,8e-06,5e-06,1.1e-05,2.1e-05,9e-06,1.5e-05,1.1e-05,2.5e-05,1.4e-05,3.3e-05,3e-06,1.7e-05,1.5e-05,1.6e-05,7e-06,1e-05,8e-06,1.4e-05,1.2e-05,9e-06,8e-06,1.1e-05,5e-06,2.8e-05,1e-05,4.7e-05,1.9e-05,5.6e-05,1.2e-05,2.4e-05,1.9e-05,3.4e-05,1.5e-05,1.8e-05,1.6e-05,1.1e-05,1.3e-05,3.4e-05,1.6e-05,9e-06,2.1e-05,2e-05,1.2e-05,2e-06,2.1e-05,1.8e-05,7e-06,1e-06,9e-06,7e-06,1.2e-05,0,1.4e-05,6e-06
3e-06,6e-06,6e-06,3e-06,2e-06,6e-06,3e-06,9e-06,3e-06,2e-06,6e-06,2e-06,5e-06,2e-06,2e-06,3e-06,2e-06,3e-06,5e-06,2e-06,8e-06,5e-06,3e-06,6e-06,2e-06,3e-06,1.5e-05,6e-06,4e-06,1.2e-05,7e-06,7e-06,6e-06,1.5e-05,4e-05,1.4e-05,4e-06,1.5e-05,1e-05,2.2e-05,1.4e-05,1.3e-05,1.7e-05,1.6e-05,2.2e-05,3.1e-05,2.3e-05,2.1e-05,1.5e-05,6e-06,1.3e-05,1.1e-05,7e-06,6e-06,3e-06,6e-06,4e-06,7e-06,3e-06,3e-06,8e-06,1.8e-05,3e-06,1.3e-05,5e-06,1.3e-05,8e-06,6e-06,1.6e-05,3e-06,1.1e-05,7e-06,1e-05,9e-06,1.4e-05,1.6e-05,2e-05,9e-06,1e-05,1.1e-05,1.4e-05,5e-06,8e-06,9e-06,3e-06,1e-05,6e-06,7e-06,7e-06,5e-06,3.6e-05,1e-05,3.7e-05,8.9e-05,0.000149,0.000115,6.2e-05,3.5e-05,3e-05,1.4e-05,4e-06,1.5e-05,4e-06,8e-06,1.9e-05,1.1e-05,1e-05,2e-05,1.5e-05,1.1e-05,3e-06,2.3e-05,7e-06,6e-06,5e-06,7e-06,8e-06,8e-06,4e-06,1.1e-05,4e-06
3e-06,6e-06,5e-06,9e-06,3e-06,9e-06,6e-06,1.2e-05,1.2e-05,3e-06,7e-06,2e-06,8e-06,5e-06,4e-06,0,4e-06,2e-06,5e-06,2e-06,4e-06,7e-06,2e-06,7e-06,2e-06,4e-06,1.3e-05,1e-06,3e-06,6e-06,6e-06,3e-06,6e-06,1e-05,5.6e-05,4.3e-05,1.9e-05,1.9e-05,3.4e-05,2e-05,1.9e-05,2.3e-05,4e-06,1.4e-05,2.9e-05,4e-06,1.5e-05,2.3e-05,2.2e-05,3.1e-05,1.3e-05,1.9e-05,7e-06,4e-06,4e-06,6e-06,4e-06,1.5e-05,3e-06,6e-06,7e-06,1.9e-05,1.1e-05,1.5e-05,1.4e-05,1.6e-05,8e-06,6e-06,1.9e-05,1.5e-05,1.4e-05,1.8e-05,3.2e-05,1.1e-05,1.7e-05,5e-06,1.1e-05,6e-06,1.7e-05,1.5e-05,8e-06,4e-06,4e-06,4e-06,5e-06,1.2e-05,4e-06,1.2e-05,1e-05,1.2e-05,2.6e-05,3.2e-05,2.5e-05,6.9e-05,9.8e-05,3.3e-05,5.6e-05,6e-05,3.9e-05,1.6e-05,2.3e-05,7e-06,1.6e-05,1e-05,2.5e-05,2.3e-05,9e-06,1.7e-05,1.7e-05,4e-06,1.3e-05,8e-06,1.2e-05,5e-06,1e-06,4e-06,8e-06,2e-06,1e-06,1.3e-05,3e-06
4e-06,4e-06,1.1e-05,5e-06,3e-06,7e-06,2e-06,1.2e-05,1.8e-05,1e-05,5e-06,1e-06,6e-06,1e-06,2e-06,4e-06,6e-06,3e-06,6e-06,5e-06,4e-06,5e-06,1e-06,1e-05,2e-06,1e-06,1e-05,3e-06,5e-06,1.4e-05,3e-06,1.7e-05,1.1e-05,9e-06,4.1e-05,2.9e-05,8e-06,1.6e-05,2.2e-05,3.4e-05,1.5e-05,2e-05,2.3e-05,7e-06,2.2e-05,1.9e-05,1.1e-05,1.8e-05,7e-06,1.4e-05,1e-05,2.1e-05,1.3e-05,8e-06,1.2e-05,5e-06,7e-06,1.2e-05,8e-06,9e-06,1.2e-05,9e-06,1.1e-05,1.7e-05,1.1e-05,6e-06,9e-06,9e-06,5e-06,4e-06,2e-05,1.1e-05,2.4e-05,1.5e-05,2e-05,1e-05,1.2e-05,3e-06,1.8e-05,1.2e-05,1.8e-05,1.6e-05,8e-06,1e-05,1e-05,1e-06,1.2e-05,4e-06,7e-06,8e-06,1.9e-05,1.3e-05,2.6e-05,5.7e-05,1e-05,5.4e-05,4.2e-05,2.8e-05,2e-06,8e-06,1.9e-05,3.1e-05,3e-05,2.4e-05,2.2e-05,1.1e-05,9e-06,2.4e-05,1.8e-05,1e-05,1.1e-05,1.2e-05,5e-06,2e-06,6e-06,3e-06,7e-06,1.2e-05,3e-06,8e-06,8e-06
5e-06,9e-06,1.7e-05,4e-06,7e-06,1.3e-05,3e-06,1.8e-05,9e-06,9e-06,1.5e-05,9e-06,7e-06,5e-06,6e-06,5e-06,3e-06,6e-06,6e-06,6e-06,5e-06,5e-06,2e-06,1e-05,9e-06,6e-06,1.7e-05,6e-06,4e-06,1.1e-05,3e-06,2.2e-05,1.2e-05,1.6e-05,1.7e-05,1.4e-05,5e-06,7e-06,9e-06,1.8e-05,1.9e-05,8e-06,1.8e-05,3e-05,3e-06,5e-06,1.9e-05,9e-06,1e-05,9e-06,1.3e-05,2.2e-05,3e-06,1e-05,4e-06,4e-06,7e-06,6e-06,1.2e-05,2e-06,7e-06,6e-06,8e-06,1.1e-05,5e-06,7e-06,4e-06,1.4e-05,1.3e-05,9e-06,2.5e-05,1.3e-05,2.3e-05,1.8e-05,1.9e-05,3.1e-05,5e-06,1.2e-05,1.8e-05,5e-06,1.1e-05,1.2e-05,8e-06,1.7e-05,1.7e-05,1.1e-05,1.2e-05,1.5e-05,1.5e-05,1e-05,2e-06,2.5e-05,2.8e-05,5.4e-05,2.6e-05,3.4e-05,1e-05,2.2e-05,4.9e-05,7e-06,1.1e-05,2.8e-05,1.4e-05,1.4e-05,2.3e-05,2.1e-05,2.1e-05,9e-06,1.4e-05,2.2e-05,2.1e-05,1.3e-05,2e-06,1.1e-05,8e-06,1.3e-05,1.3e-05,1.6e-05,6e-06,6e-06,1.1e-05
7e-06,1.2e-05,1.4e-05,1.1e-05,1.4e-05,1.7e-05,2.1e-05,3.3e-05,2.4e-05,1.6e-05,1.5e-05,5e-06,1.1e-05,1.4e-05,1e-06,7e-06,3e-06,7e-06,4e-06,4e-06,5e-06,6e-06,4e-06,1e-05,9e-06,3e-06,2e-05,1e-05,8e-06,3.4e-05,2.3e-05,2.6e-05,2.2e-05,3.3e-05,1e-05,2.4e-05,2.2e-05,1.4e-05,1.3e-05,1.8e-05,1.1e-05,1.8e-05,1.9e-05,1.4e-05,3e-06,1.6e-05,2.1e-05,2.5e-05,2.6e-05,8e-06,1.3e-05,1.2e-05,1.5e-05,5e-06,8e-06,6e-06,6e-06,7e-06,5e-06,8e-06,1e-05,3e-06,7e-06,4e-06,4e-06,1.3e-05,1.2e-05,1.4e-05,3.2e-05,2.8e-05,4.6e-05,3.8e-05,5.5e-05,4e-05,1e-05,2.9e-05,3e-06,4.4e-05,2e-05,2.3e-05,2.4e-05,2e-05,1.4e-05,1.9e-05,2.7e-05,2.4e-05,1.2e-05,1.8e-05,2.2e-05,2.7e-05,2.1e-05,4.5e-05,5.5e-05,7.6e-05,7.4e-05,5.4e-05,5.9e-05,3e-05,3.6e-05,6.8e-05,2.5e-05,1.8e-05,3.1e-05,1.7e-05,1.5e-05,2.6e-05,2e-05,1.7e-05,7e-06,2.2e-05,7e-06,5e-06,1.2e-05,1.9e-05,1e-05,1.7e-05,1.2e-05,8e-06,6e-06,5e-06,1.2e-05
1.1e-05,4e-06,1.5e-05,1.7e-05,2e-06,2.5e-05,2.8e-05,7e-06,2.9e-05,1.9e-05,4e-06,1.8e-05,1.3e-05,5e-06,9e-06,4e-06,4e-06,3e-06,4e-06,4e-06,7e-06,2e-06,7e-06,1.3e-05,2e-06,2e-06,1.3e-05,2e-05,1.3e-05,4.5e-05,2.2e-05,1.3e-05,1.6e-05,7e-06,1.9e-05,4e-05,2.5e-05,1.3e-05,1e-05,1.1e-05,2.7e-05,2.4e-05,8e-06,1.1e-05,8e-06,2.7e-05,4.4e-05,3.2e-05,1.1e-05,9e-06,1.1e-05,4e-06,1.9e-05,1.8e-05,1.2e-05,3e-06,3e-06,6e-06,8e-06,7e-06,1.5e-05,1e-05,7e-06,1.1e-05,8e-06,1e-05,1.6e-05,8e-06,4.5e-05,3e-05,3.2e-05,6.5e-05,1.5e-05,8.4e-05,8.2e-05,0.000113,4.9e-05,7.4e-05,4.2e-05,3.3e-05,1.6e-05,3.5e-05,1.4e-05,3.1e-05,7e-06,2.8e-05,2.5e-05,1.1e-05,9e-06,1.1e-05,5e-06,2.7e-05,2.3e-05,0.000106,0.000132,0.000101,9.3e-05,6.1e-05,1.6e-05,7.8e-05,9e-05,2.8e-05,1e-05,2.6e-05,4e-05,2.6e-05,2.6e-05,2.3e-05,7e-06,2.9e-05,3.1e-05,1.3e-05,1.6e-05,1.4e-05,1.9e-05,5e-06,2.9e-05,3.8e-05,2.1e-05,1.4e-05,8e-06
1.1e-05,1.2e-05,7e-06,1e-06,8e-06,2.2e-05,1e-05,9e-06,2.1e-05,1.2e-05,5e-06,1.7e-05,1.1e-05,3e-06,5e-06,7e-06,7e-06,2e-06,4e-06,1e-06,7e-06,8e-06,6e-06,4e-06,1e-06,3e-06,1.1e-05,1.1e-05,7e-06,2.3e-05,1.3e-05,1.6e-05,2.5e-05,1.5e-05,2e-05,2.5e-05,2e-05,2.3e-05,1.8e-05,1.2e-05,2.2e-05,9e-06,1.7e-05,2.4e-05,3.1e-05,3.5e-05,6e-06,6e-06,1.9e-05,2.4e-05,2.9e-05,2.2e-05,5e-06,7e-06,1e-06,6e-06,8e-06,3e-06,5e-06,6e-06,1.5e-05,1.9e-05,9e-06,1.2e-05,8e-06,1.3e-05,1e-05,8e-06,3.4e-05,2.2e-05,3.4e-05,5.1e-05,4.9e-05,8.1e-05,4.2e-05,7e-05,7.4e-05,1.6e-05,4.7e-05,1.8e-05,4e-06,4.7e-05,4e-05,3.7e-05,3.8e-05,3.1e-05,1e-05,5e-06,5e-06,7e-06,1.1e-05,2.9e-05,4.4e-05,7.9e-05,9e-06,9.1e-05,2.3e-05,6.5e-05,9.4e-05,8.7e-05,5.8e-05,7.3e-05,4.6e-05,4e-06,3.5e-05,1.5e-05,1.7e-05,1.4e-05,8e-06,3.1e-05,3e-05,2e-05,6e-06,1.1e-05,1.5e-05,2.1e-05,1.1e-05,2e-05,2.8e-05,2.3e-05,6e-06
8e-06,5e-06,8e-06,9e-06,2e-06,1.1e-05,5e-06,5e-06,1.3e-05,8e-06,1e-05,7e-06,2e-06,2e-06,3e-06,3e-06,6e-06,3e-06,1e-06,2e-06,3e-06,7e-06,1e-06,5e-06,4e-06,1e-06,1.2e-05,5e-06,1e-05,9e-06,5e-06,1e-05,1.5e-05,1.1e-05,2.2e-05,7e-06,1.1e-05,2.6e-05,2.4e-05,1.5e-05,1.8e-05,6e-06,1.7e-05,2.1e-05,2.1e-05,1.8e-05,9e-06,7e-06,1.4e-05,2e-05,1e-05,1e-05,1.2e-05,6e-06,6e-06,4e-06,3e-06,6e-06,9e-06,5e-06,1e-05,1.4e-05,1e-05,1.4e-05,5e-06,1e-05,5e-06,7e-06,2.9e-05,1e-05,3.4e-05,1.5e-05,1.4e-05,3.9e-05,3.7e-05,4.6e-05,3e-05,4.4e-05,2.6e-05,2.3e-05,1.3e-05,2.2e-05,6e-06,2.3e-05,1e-05,1.3e-05,1.3e-05,1.2e-05,9e-06,1.2e-05,4e-06,2e-05,3.4e-05,3.3e-05,4.1e-05,6.6e-05,6.8e-05,2.7e-05,4.2e-05,4.2e-05,7.1e-05,4.7e-05,2.4e-05,4e-06,2.6e-05,2.7e-05,1.6e-05,1.9e-05,1.1e-05,2.7e-05,1.4e-05,1.4e-05,4e-06,1e-06,1.2e-05,1.4e-05,1.5e-05,1.8e-05,2e-05,5e-06,9e-06
1e-06,4e-06,7e-06,8e-06,2e-06,5e-06,3e-06,8e-06,5e-06,2e-06,6e-06,4e-06,3e-06,2e-06,1e-06,2e-06,4e-06,3e-06,3e-06,1e-06,4e-06,7e-06,2e-06,6e-06,4e-06,1e-06,1.1e-05,0,5e-06,5e-06,2e-06,6e-06,4e-06,3e-06,1.2e-05,7e-06,9e-06,1.3e-05,6e-06,7e-06,3e-06,3e-06,1e-05,7e-06,8e-06,1e-05,5e-06,1e-06,6e-06,1.3e-05,7e-06,3e-06,6e-06,6e-06,2e-06,2e-06,1e-06,6e-06,5e-06,2e-06,7e-06,1e-05,3e-06,6e-06,2e-06,6e-06,3e-06,7e-06,1.5e-05,2e-06,2.3e-05,4e-06,8e-06,8e-06,1.8e-05,1.9e-05,1.8e-05,1.7e-05,1.1e-05,1.2e-05,9e-06,7e-06,6e-06,3e-06,1.9e-05,5e-06,6e-06,3e-06,2e-06,4e-06,3e-06,9e-06,7e-06,2e-05,2.4e-05,3e-06,2e-05,3e-06,3.3e-05,2.1e-05,1.4e-05,1.3e-05,5e-06,6e-06,1.2e-05,9e-06,2e-06,5e-06,2e-06,1.2e-05,7e-06,1e-06,4e-06,1e-06,7e-06,4e-06,4e-06,1e-05,3e-06,8e-06,1e-06
1e-06,5e-06,6e-06,6e-06,1e-06,3e-06,2e-06,6e-06,4e-06,1e-06,5e-06,5e-06,2e-06,1e-06,1e-06,2e-06,3e-06,2e-06,2e-06,1e-06,4e-06,6e-06,3e-06,5e-06,3e-06,1e-06,1e-05,1e-06,5e-06,5e-06,2e-06,5e-06,3e-06,4e-06,5e-06,2e-06,8e-06,1e-05,5e-06,6e-06,4e-06,3e-06,9e-06,3e-06,7e-06,7e-06,4e-06,2e-06,7e-06,9e-06,4e-06,4e-06,6e-06,4e-06,1e-06,2e-06,1e-06,6e-06,1e-06,1e-06,4e-06,8e-06,3e-06,4e-06,2e-06,6e-06,3e-06,7e-06,1.2e-05,1e-06,1.7e-05,1e-06,5e-06,1.3e-05,2.2e-05,1.2e-05,1.4e-05,7e-06,8e-06,9e-06,6e-06,3e-06,5e-06,4e-06,1.8e-05,6e-06,6e-06,2e-06,0,3e-06,3e-06,2e-06,7e-06,1.4e-05,1.5e-05,1.3e-05,1.6e-05,6e-06,1.6e-05,8e-06,1.5e-05,5e-06,5e-06,8e-06,5e-06,5e-06,3e-06,1e-06,3e-06,6e-06,3e-06,3e-06,3e-06,2e-06,5e-06,1e-06,4e-06,7e-06,5e-06,9e-06,1e-06
0,5e-06,5e-06,5e-06,2e-06,2e-06,1e-06,5e-06,3e-06,1e-06,5e-06,4e-06,2e-06,1e-06,1e-06,2e-06,4e-06,2e-06,2e-06,1e-06,4e-06,6e-06,2e-06,5e-06,2e-06,1e-06,9e-06,0,6e-06,5e-06,1e-06,3e-06,3e-06,4e-06,3e-06,2e-06,7e-06,8e-06,4e-06,5e-06,4e-06,2e-06,7e-06,1e-06,8e-06,6e-06,2e-06,2e-06,6e-06,8e-06,4e-06,3e-06,6e-06,5e-06,2e-06,1e-06,1e-06,6e-06,1e-06,2e-06,4e-06,7e-06,3e-06,4e-06,1e-06,6e-06,3e-06,5e-06,1.1e-05,3e-06,1.4e-05,1e-06,3e-06,1.3e-05,2.1e-05,1.2e-05,1.1e-05,6e-06,9e-06,9e-06,5e-06,1e-06,5e-06,4e-06,1.5e-05,6e-06,4e-06,3e-06,1e-06,2e-06,3e-06,1e-06,5e-06,1.2e-05,9e-06,1.4e-05,1.4e-05,3e-06,1e-05,4e-06,9e-06,4e-06,5e-06,8e-06,4e-06,5e-06,2e-06,0,1e-06,5e-06,2e-06,3e-06,3e-06,2e-06,4e-06,1e-06,4e-06,4e-06,3e-06,9e-06,1e-06
