-3e-05,-0.000104,-0.000217,-3.7e-05,-0.000301,-0.001378,-0.000726,-0.012073,-0.047574,-0.125263,-0.175953,-0.167396,-0.162104,-0.140882,-0.122538,-0.076763,-0.055986,-0.025591,-0.015579,-0.004899,-0.002112,-0.001065,-0.001584,-0.002058,-0.000567,-0.00051,-8.6e-05,-0.000116
3.7e-05,-1.4e-05,-9.7e-05,4e-06,0.000472,0.00162,0.00023,-0.006784,0.006212,0.101359,0.114318,0.12612,0.136663,0.124075,0.125129,0.07781,0.062733,0.0264,0.017562,0.004063,0.001325,0.001311,0.000793,-0.000421,-6e-05,-8.2e-05,3.1e-05,1.1e-05
-7e-06,-3.3e-05,-9e-05,-1.8e-05,-0.000177,-0.000674,-0.00013,0.007619,0.019486,0.001842,0.000436,-0.000976,0.000446,-0.017257,-0.009493,-0.007387,-0.006668,-0.00127,-0.00043,-0.000574,-0.00032,-0.000228,0.000409,0.000842,0.000238,0.00013,7e-06,1.8e-05
-7e-06,1.8e-05,3.8e-05,4e-06,-0.000191,-0.000535,0.00011,0.009808,0.00392,-0.096395,-0.104715,-0.121111,-0.120142,-0.09899,-0.104942,-0.064055,-0.055443,-0.025666,-0.016483,-0.00379,-0.001278,-0.000396,0.001007,0.001387,0.000453,0.000351,1.4e-05,5.9e-05
1.9e-05,6.7e-05,0.000156,5.5e-05,0.000364,0.001496,0.000548,-0.00153,0.012647,0.098907,0.13038,0.117761,0.115722,0.114373,0.105827,0.067095,0.052718,0.021518,0.013822,0.004403,0.001854,0.001155,0.001186,0.000691,0.000235,0.000132,3.8e-05,3.3e-05
-2e-05,-6e-06,-3e-06,-3.6e-05,-0.000209,-0.000959,-0.000474,-0.010715,-0.021769,0.029093,0.024217,0.034494,0.033811,0.012131,0.025881,0.013849,0.015243,0.009944,0.005189,0.000688,0.000278,-0.000575,-0.001549,-0.001447,-0.000457,-0.000478,-5.6e-05,-8.6e-05
-5e-06,-1.8e-05,-5.8e-05,-1e-05,-0.000101,-0.000517,-0.000298,-0.003531,-0.033008,-0.138713,-0.179808,-0.155528,-0.145456,-0.116087,-0.1163,-0.06818,-0.055236,-0.026267,-0.018006,-0.005068,-0.001868,-0.000742,-0.000714,-0.000988,-0.000208,-0.000116,-2.8e-05,-1.4e-05
1.5e-05,-1.9e-05,-4.1e-05,2e-05,0.000257,0.001078,0.000382,0.00766,0.030208,0.046696,0.064572,0.067664,0.057127,0.068215,0.056555,0.027865,0.021893,0.0082,0.007548,0.002455,0.000828,0.000883,0.001146,0.001032,0.000368,0.000349,5.6e-05,6e-05
-7e-06,-1.1e-05,-1.8e-05,-3e-06,-0.000152,-0.00055,-7e-05,0.005224,0.031306,0.09421,0.124496,0.118526,0.101975,0.053214,0.060277,0.033529,0.025608,0.016409,0.012014,0.002927,0.000821,3e-06,0.000365,0.001206,0.000248,0.000146,1.7e-05,1.2e-05
0,2.2e-05,4.2e-05,2e-05,-4.6e-05,-0.000192,-2.9e-05,-0.005276,-0.032287,-0.09356,-0.114433,-0.11189,-0.101135,-0.095999,-0.099622,-0.043411,-0.036402,-0.017856,-0.014179,-0.003633,-0.001143,-0.000471,-0.000252,-0.000398,-0.000131,-9.8e-05,-2.4e-05,1e-05
1e-05,-1.9e-05,-3.5e-05,1e-06,0.00018,0.000716,0.000166,-0.006473,-0.020581,-0.008734,-0.019775,-0.030855,-0.024937,0.010458,0.009082,0.000247,0.003347,-0.001579,-0.001207,-0.000141,-2.1e-05,-3.4e-05,-0.00103,-0.001389,-0.000309,-0.000239,-2.1e-05,-3e-05
0,-1.2e-05,-1.1e-05,8e-06,-0.000112,-0.000595,-0.00024,0.001029,0.016505,0.079751,0.089315,0.089314,0.087159,0.063073,0.080054,0.032233,0.027791,0.018798,0.013039,0.002827,0.000912,-1.8e-05,-0.000668,-9.1e-05,3.2e-05,-6e-06,8e-06,-1.1e-05
1e-06,4e-05,9.8e-05,1.7e-05,-5.2e-05,-0.000213,-4.2e-05,0.004287,-0.001063,-0.071259,-0.079881,-0.058114,-0.044504,-0.043744,-0.060316,-0.019155,-0.017523,-0.010577,-0.008458,-0.002183,-0.000516,-9.3e-05,0.000626,0.000811,0.000264,0.000291,3.2e-05,3.7e-05
2e-06,1.9e-05,7.1e-05,2.6e-05,0.000141,0.000723,0.000335,0.000939,-0.004492,-0.031526,-0.027696,-0.036037,-0.034083,-0.001943,-0.021101,-0.011706,-0.011078,-0.011929,-0.006232,-0.001329,-0.000694,2.4e-05,7.6e-05,5e-05,-2.9e-05,3.4e-05,1e-06,-2e-06
-7e-06,-1e-05,-1.3e-05,-4e-06,-6.4e-05,-0.00026,-8.1e-05,-0.003265,0.003362,0.091248,0.109892,0.087616,0.077223,0.046327,0.067622,0.022517,0.017294,0.015332,0.012301,0.003104,0.000714,-3.4e-05,-0.000624,-0.000215,-9.7e-05,-0.000151,-1.5e-05,-3e-06
-5e-06,-2.6e-05,-7.1e-05,-1.9e-05,-4.9e-05,-0.000307,-0.000201,-0.002431,-0.015972,-0.032678,-0.047436,-0.036473,-0.030157,-0.048724,-0.040536,-0.007888,-0.003234,-0.00125,-0.003276,-0.00081,7.4e-05,-0.000235,-0.000424,-0.000406,-9.2e-05,-9.3e-05,-8e-06,1.7e-05
-4e-06,-4e-05,-9.3e-05,-3.5e-05,5.9e-05,0.000231,6e-06,0.001313,-0.007875,-0.061381,-0.075304,-0.074623,-0.069102,-0.024887,-0.033857,-0.013102,-0.011068,-0.013162,-0.009304,-0.002175,-0.000617,-0.000197,-0.000593,-0.000492,-8.7e-05,-3e-05,-6e-06,-1.6e-05
-4e-06,0,4e-06,9e-06,-3.9e-05,-0.000124,1.6e-05,0.002487,0.019128,0.063949,0.090234,0.080348,0.071709,0.060517,0.065445,0.017146,0.010591,0.012774,0.010367,0.002715,0.000598,0.000327,0.000261,0.000512,0.000201,0.000209,2.6e-05,-4e-06
-1e-05,1.5e-05,5.3e-05,3e-06,-1.4e-05,7.7e-05,0.000141,-0.000512,-0.002709,-0.004166,0.006401,0.027054,0.02291,-0.01382,-0.018762,0.000413,0.00624,0.006108,0.002489,0.000372,0.000224,2.2e-05,0.000311,0.000213,3.9e-05,8.6e-05,1e-05,3e-06
