6e-06,2e-05,2.8e-05,1.5e-05,0,3.4e-05,1.1e-05,0,9e-06,2.9e-05,2.4e-05,4e-06,1.3e-05,2.9e-05,1.4e-05,2e-06,1.5e-05,3e-06,1.7e-05,4e-06,2e-06,2e-06,1e-06,2.8e-05,2.6e-05,3e-05,1.8e-05,1e-06,7e-06,1.7e-05,9e-06,2.2e-05,3.4e-05,3e-06,1.9e-05,5.8e-05,4e-06,6.1e-05,8e-06,2e-06,2e-06,1.5e-05,2.4e-05,6e-06,2e-06,4e-06,5e-05,2.9e-05,2.8e-05,3.3e-05,6.7e-05,6e-06,1.6e-05,1.3e-05,4e-05,1.7e-05,1.6e-05,6e-06,8e-06,3e-06,6e-06,1e-06,1.2e-05,2.7e-05,2e-06,7e-06,6e-06,1.5e-05,2e-06,1.3e-05,2e-06,2.9e-05,2.3e-05,1.5e-05,2e-06,0,2.6e-05,1.9e-05,3e-06,2e-06,1.7e-05,5e-06,1.8e-05,2.7e-05,2.7e-05,2.3e-05,2.9e-05,6e-06,1.4e-05,3.7e-05,1.6e-05,1.2e-05,7e-06,2e-06,2.1e-05,4e-06,1e-06,1.5e-05,6e-06,8e-06,4e-06,7e-06,1.1e-05,6e-06,1.1e-05,8e-06,2.3e-05,1e-05,9e-06,7e-06,5e-06,7e-06,6e-06,1e-05,1.1e-05,8e-06,7e-06,1.5e-05,4e-06,1.3e-05,1.4e-05
1e-05,2e-05,6.1e-05,4.1e-05,4.2e-05,3.2e-05,5.2e-05,3.9e-05,4.1e-05,2.2e-05,3.9e-05,2.7e-05,3e-06,5.7e-05,2.8e-05,1.4e-05,2.6e-05,1.1e-05,4.4e-05,3e-05,3.3e-05,2.4e-05,1.7e-05,3.6e-05,5.4e-05,8.2e-05,5.9e-05,2.6e-05,1.4e-05,6.3e-05,5.4e-05,7.5e-05,4.3e-05,5.5e-05,4.1e-05,6.9e-05,2e-05,8.9e-05,3.2e-05,2.3e-05,9e-06,3.2e-05,3e-05,7e-06,2.4e-05,2.3e-05,0.000112,2.9e-05,3.3e-05,9.4e-05,9.5e-05,2.6e-05,5e-06,4.3e-05,8.6e-05,3e-05,4.7e-05,2.7e-05,2.5e-05,2.2e-05,1.3e-05,1.4e-05,3e-05,5.1e-05,2.7e-05,1.2e-05,1.9e-05,2.5e-05,2.3e-05,3.2e-05,1.8e-05,6.6e-05,2.3e-05,4.2e-05,1.8e-05,1.6e-05,7e-05,3.1e-05,4e-05,5.7e-05,3e-06,1.4e-05,1.3e-05,7.2e-05,3.7e-05,5.6e-05,5e-06,1.3e-05,2.2e-05,2.9e-05,4.8e-05,1.8e-05,1.4e-05,2.1e-05,4.6e-05,6.1e-05,2.6e-05,3e-05,4.2e-05,3.6e-05,1.9e-05,2.6e-05,2.2e-05,1.7e-05,3.8e-05,2.1e-05,3.7e-05,1e-05,2.9e-05,9e-06,1e-05,1.6e-05,3e-06,1e-05,1e-05,5e-06,2e-05,3.3e-05,4e-06,3.4e-05,6.1e-05
1.1e-05,4.3e-05,6.2e-05,4e-05,4.7e-05,6e-05,3e-05,5.1e-05,2.8e-05,3.1e-05,6e-05,4.4e-05,1.2e-05,5.6e-05,5.5e-05,3.6e-05,2.6e-05,6.4e-05,4.3e-05,3.5e-05,2.4e-05,2e-05,1.1e-05,7.2e-05,7e-05,9.6e-05,2.8e-05,1.3e-05,1.6e-05,5.8e-05,4.6e-05,6.3e-05,1.7e-05,3.2e-05,3.8e-05,0.000114,4.5e-05,0.000109,3.7e-05,2.1e-05,2.9e-05,3.9e-05,5.1e-05,2e-05,4.5e-05,2.8e-05,0.000101,9.5e-05,2.8e-05,9e-05,0.000101,2.1e-05,2.1e-05,6.5e-05,5e-05,6.4e-05,5.1e-05,5.4e-05,3.4e-05,2.6e-05,3.9e-05,3.1e-05,2e-05,6.2e-05,5.3e-05,3.4e-05,5e-05,3.3e-05,2.7e-05,1.2e-05,3.7e-05,9.1e-05,3.5e-05,4.5e-05,2.5e-05,8e-06,5e-05,2.3e-05,2.6e-05,3e-05,4e-06,2.5e-05,6.1e-05,3.2e-05,4.1e-05,2.9e-05,4.9e-05,3.6e-05,1.1e-05,2.9e-05,1.9e-05,5e-06,2.5e-05,1.4e-05,2.9e-05,5.5e-05,2.6e-05,3.5e-05,3.9e-05,3.8e-05,7e-06,9e-06,3.9e-05,3.8e-05,4.5e-05,1.4e-05,2.7e-05,1.8e-05,4e-05,2.9e-05,1.3e-05,3.8e-05,3.5e-05,2.2e-05,3.8e-05,2.4e-05,3.7e-05,8e-06,3e-06,3.9e-05,2.5e-05
2.7e-05,6.8e-05,9.9e-05,9.7e-05,3e-05,0.000136,0.000115,0.000114,2.3e-05,4e-05,4.5e-05,2.3e-05,4.6e-05,9e-06,2e-05,6.3e-05,2.6e-05,8.6e-05,2.1e-05,4.4e-05,1.3e-05,3.2e-05,2.6e-05,7.6e-05,0.000107,0.000144,4.6e-05,4.4e-05,4.1e-05,1.8e-05,7.5e-05,8e-05,5.9e-05,5e-05,6.8e-05,0.000145,3.5e-05,0.000115,3.8e-05,7e-05,8.5e-05,0.000146,2.7e-05,5.1e-05,5.6e-05,7e-06,0.000134,0.000103,8.3e-05,5.9e-05,7.9e-05,2.4e-05,4.7e-05,8.5e-05,7.7e-05,4.7e-05,5.1e-05,4.2e-05,2.2e-05,4.5e-05,8.1e-05,4.2e-05,2.2e-05,5.1e-05,6.1e-05,1.2e-05,3.8e-05,2.4e-05,3.6e-05,2.5e-05,4.9e-05,5.8e-05,7.3e-05,7.6e-05,4.6e-05,2e-06,3.3e-05,4.4e-05,5.4e-05,0.000113,4.1e-05,3.8e-05,8.5e-05,9.2e-05,6.2e-05,2.6e-05,6.9e-05,6e-05,3.7e-05,2.7e-05,6.4e-05,1.9e-05,3.8e-05,5.6e-05,6.4e-05,8e-06,2.1e-05,4.9e-05,6.6e-05,9e-06,4.6e-05,4.1e-05,6.6e-05,2.2e-05,1.9e-05,2.6e-05,2.9e-05,2.4e-05,3.5e-05,2.8e-05,2.7e-05,1.9e-05,3e-06,3.7e-05,2.6e-05,4.7e-05,5.1e-05,9.4e-05,5.9e-05,3.3e-05,5e-05
4.7e-05,6.5e-05,5.1e-05,0.000128,0.000137,0.000152,0.000136,5.2e-05,3.6e-05,6.1e-05,0.000124,8.6e-05,9.6e-05,0.000141,5.4e-05,5.9e-05,5.5e-05,9.5e-05,0.000135,1.8e-05,7.7e-05,7.3e-05,9.5e-05,0.000121,7.9e-05,0.000165,6.7e-05,9.2e-05,4e-05,6e-05,7.6e-05,8.8e-05,0.000106,7.8e-05,8.2e-05,0.000117,2.5e-05,0.000223,0.000121,0.000115,9.4e-05,0.000161,9.1e-05,8.4e-05,9e-05,5.7e-05,0.000161,0.000158,0.00012,0.000161,0.000188,3.3e-05,5e-06,5.6e-05,9e-05,3.9e-05,3e-05,0.000101,0.000113,4.4e-05,5.9e-05,5.3e-05,5e-05,1e-04,0.000166,9.4e-05,3.8e-05,2.8e-05,3.9e-05,4.8e-05,3e-05,0.000115,0.000121,4.3e-05,2.1e-05,8e-05,8.5e-05,2.8e-05,5.9e-05,0.000131,6.9e-05,6.3e-05,6.2e-05,4.9e-05,3.5e-05,3.6e-05,0.000117,7.1e-05,2.7e-05,2.8e-05,8.2e-05,7.4e-05,5e-05,5.8e-05,4.8e-05,4.6e-05,2.2e-05,5.3e-05,6.9e-05,4.1e-05,7e-05,1.5e-05,7.4e-05,4.4e-05,6e-06,1.7e-05,5.9e-05,4e-06,7.2e-05,2.1e-05,2.4e-05,6.6e-05,4.4e-05,1.4e-05,6.6e-05,8.6e-05,6.3e-05,8.8e-05,3e-06,5e-06,5.3e-05
0.000159,6.1e-05,8e-05,0.000117,0.000146,9.2e-05,0.000223,0.000277,0.00013,2e-05,0.000162,0.000288,0.000289,0.000111,0.000215,0.000167,9.3e-05,0.000185,2e-04,0.00017,0.000179,0.000247,0.000192,0.000114,0.000201,0.000269,0.000223,9.5e-05,0.000193,0.000228,0.000204,0.000345,0.000125,2.8e-05,6.8e-05,0.000235,0.000134,0.000244,0.000329,0.000372,0.000361,0.00017,0.000216,0.000165,0.000186,0.000144,0.000179,0.000244,0.000231,0.000107,0.000253,0.000235,0.000185,3.4e-05,0.000154,0.000202,6.4e-05,0.000134,0.000122,0.000207,0.000141,2.7e-05,0.000114,0.000237,0.000388,0.000174,2.7e-05,9.4e-05,0.000161,6.5e-05,0.000156,0.000231,9.1e-05,6.9e-05,1e-04,0.000192,0.000222,6.4e-05,6.3e-05,0.000188,0.000102,9.2e-05,0.000176,0.000156,7.2e-05,5.3e-05,0.000125,0.000141,9.6e-05,5.8e-05,5.6e-05,7.3e-05,7.2e-05,0.000114,0.000111,5e-05,4.7e-05,5.9e-05,9.4e-05,7.3e-05,8.3e-05,9.8e-05,0.00013,5.3e-05,5.5e-05,3.8e-05,4.6e-05,6.1e-05,3.8e-05,5.3e-05,2.4e-05,8e-05,7.5e-05,5.6e-05,6.5e-05,5.7e-05,0.000129,9.7e-05,3.5e-05,7e-06,5.1e-05
0.000149,0.000196,9.4e-05,0.000179,0.000315,0.000359,0.000151,0.000167,0.000153,0.000104,0.000227,0.000159,0.000122,0.000225,0.00021,0.000195,0.000168,8.1e-05,0.000133,1.5e-05,0.000238,0.000205,0.000104,0.000147,0.000284,0.000206,4e-05,0.000183,7.8e-05,0.000213,0.000247,0.000216,0.000102,0.00014,0.000158,0.000156,8.5e-05,0.000311,0.000307,0.000228,0.000139,0.000273,0.000382,0.000206,0.000144,0.000163,8e-05,9.2e-05,0.000175,0.00011,5.1e-05,0.000143,0.000225,0.000206,0.000156,9.1e-05,0.000132,9.8e-05,5.8e-05,0.00019,0.000256,0.000168,0.00015,0.000336,0.000263,0.000361,0.00031,0.000144,0.000131,7.4e-05,0.000261,8.9e-05,0.000252,0.000199,0.000244,0.00027,6.3e-05,0.000124,0.000115,3.5e-05,0.00015,8.3e-05,0.000134,9e-05,1e-04,9.5e-05,0.000148,7.7e-05,5.9e-05,3.3e-05,1.1e-05,8.9e-05,3.5e-05,6.3e-05,7.1e-05,0.000147,8.7e-05,3.4e-05,7.3e-05,1.4e-05,0.000109,1.6e-05,6.8e-05,8.4e-05,5.2e-05,0.000115,4.8e-05,4.2e-05,3.9e-05,6.3e-05,6.2e-05,3e-05,3.9e-05,3e-05,7.6e-05,6.5e-05,0.000119,5e-05,7.2e-05,6.5e-05,7.1e-05
0.000199,0.000253,0.000228,0.000159,0.000234,0.000347,0.000206,0.000172,0.000269,0.000105,0.000171,0.000221,3.4e-05,4.5e-05,0.000272,0.000217,4.4e-05,0.000105,4.4e-05,5.1e-05,0.000253,0.000165,0.000136,0.00019,6.8e-05,0.000117,3.2e-05,0.000114,0.00016,0.000221,0.000115,0.00032,0.000201,0.000183,0.000139,0.000149,7.6e-05,0.000222,0.000113,0.000212,0.00023,0.000206,0.00016,0.000129,6.8e-05,0.00023,8.2e-05,0.000142,0.000119,7.6e-05,0.000102,0.000123,0.000219,0.000151,2.8e-05,0.000126,0.000188,0.000153,4.7e-05,0.000107,0.000203,0.000117,4.8e-05,0.000163,1.7e-05,0.000304,6.6e-05,8.2e-05,4.6e-05,5.2e-05,0.00023,9.9e-05,0.000191,6.5e-05,0.000116,7.9e-05,0.000183,0.000165,0.000122,5.9e-05,0.000186,0.000206,0.000149,1.3e-05,4.6e-05,4.5e-05,0.000122,7.7e-05,5.6e-05,0.000103,7.1e-05,9.9e-05,7.9e-05,7.4e-05,7.5e-05,0.000122,6.6e-05,7.3e-05,0.00014,8.1e-05,0.000122,0.00012,0.00012,0.00016,0.000191,1.3e-05,8.4e-05,3.9e-05,3e-05,6.4e-05,1.6e-05,5e-05,0.000104,0.000118,0.000105,9.9e-05,2.3e-05,7e-05,7.4e-05,4.4e-05,9e-05
0.000126,8.5e-05,5.2e-05,5.6e-05,8.9e-05,0.00018,0.000184,0.000121,0.000215,0.000291,0.000109,8.8e-05,0.00011,8.9e-05,0.000253,7.2e-05,0.000114,7.5e-05,6.5e-05,0.000114,0.000166,0.000133,8.9e-05,0.000145,0.000111,0.000197,0.000149,9.9e-05,0.000172,7.8e-05,8.8e-05,0.000193,0.00029,0.000144,0.000186,0.000189,0.000136,5.2e-05,8.6e-05,0.000188,0.00018,0.000117,0.000216,0.000136,0.00014,7.4e-05,0.000196,0.000181,6.1e-05,5.4e-05,0.000187,2.1e-05,0.000146,0.000242,0.000246,5.8e-05,0.00011,3.8e-05,0.000111,3.4e-05,0.000178,7.4e-05,0.000143,0.000126,0.000114,0.000194,0.000256,0.000172,7.1e-05,0.000159,5.5e-05,4.7e-05,7.7e-05,0.00013,0.00015,5e-05,0.000216,2.4e-05,0.000145,0.000144,9e-05,7.5e-05,0.000123,8.3e-05,9e-05,1.2e-05,1e-04,3.9e-05,6.1e-05,9.7e-05,0.000112,0.000101,7.2e-05,0.000104,1.3e-05,9.2e-05,5.4e-05,0.000128,0.000112,5.7e-05,6.5e-05,5.4e-05,8.6e-05,6e-05,0.000104,0.000117,0.000163,0.000125,0.000135,5.2e-05,5.4e-05,0.000141,3.5e-05,7.8e-05,2.1e-05,5.5e-05,5e-05,6.9e-05,2.5e-05,9.2e-05,5.2e-05
9.4e-05,0.000106,6.2e-05,7e-05,0.000135,5.9e-05,4.6e-05,1.2e-05,0.000182,0.000195,0.000216,0.000135,5e-05,2.2e-05,9.6e-05,0.000127,0.000142,0.00013,0.000155,0.000149,0.000101,0.000111,7.4e-05,0.000132,8.9e-05,0.000172,0.000133,0.000152,2.1e-05,8e-05,0.000216,0.000207,6.8e-05,0.000129,0.000172,0.000306,0.00024,0.000233,0.000144,0.000172,6.5e-05,5e-05,0.000131,0.000184,0.00014,0.000111,0.000125,7.3e-05,5.6e-05,0.000138,0.000108,0.000112,6.9e-05,0.000208,6e-05,2.2e-05,6.1e-05,4.8e-05,0.000142,0.000194,0.000102,8.5e-05,0.000148,0.000129,0.000166,9.3e-05,0.000193,0.000195,0.000264,0.000216,0.000115,0.000111,2e-05,8.2e-05,0.000173,8.7e-05,0.000212,0.000205,9e-05,8.2e-05,0.000169,6.7e-05,0.000184,9e-05,8.5e-05,9.6e-05,7.8e-05,9e-06,7.5e-05,0.000116,5.9e-05,3.3e-05,0.000127,0.000146,0.000139,8.9e-05,7.5e-05,0.000127,5.6e-05,2.3e-05,3e-05,3.5e-05,4.8e-05,5.7e-05,4e-05,6.3e-05,0.000157,6.3e-05,5.3e-05,5.8e-05,7.4e-05,0.000183,0.000164,0.000134,4.8e-05,3.5e-05,3.4e-05,6.1e-05,8.7e-05,7.1e-05,4e-05
0.000165,8.7e-05,0.00013,0.000111,0.000125,8.4e-05,8e-06,2.9e-05,0.000126,2.4e-05,0.000192,0.000145,0.00017,0.000111,5.6e-05,0.000156,3.4e-05,9.7e-05,0.000111,0.000112,0.000174,0.000297,1e-04,6.6e-05,0.00015,0.000136,1e-05,0.000169,0.000109,8.5e-05,0.000175,0.000154,0.000187,8.4e-05,0.000104,7.8e-05,0.000109,0.000156,0.000129,1.6e-05,0.000138,3.8e-05,5.6e-05,5.4e-05,7.7e-05,6.3e-05,9.9e-05,8.1e-05,8.6e-05,0.000146,0.000132,2e-05,4.2e-05,0.000182,0.000172,6e-05,0.000117,8.6e-05,7.8e-05,0.000128,6.6e-05,5.5e-05,9.2e-05,3.6e-05,0.000101,5.7e-05,0.000117,9.6e-05,0.000108,8.6e-05,4.1e-05,5.8e-05,0.000104,0.000109,4.5e-05,5.4e-05,0.000173,0.000135,0.000147,0.000127,9.8e-05,0.000197,7.2e-05,5.7e-05,0.000128,5.8e-05,4.9e-05,9.4e-05,6.7e-05,9.9e-05,7.8e-05,5.6e-05,0.000101,5e-05,4.9e-05,2.4e-05,7.1e-05,4.9e-05,4.2e-05,1.7e-05,3.4e-05,1.8e-05,5.1e-05,9.1e-05,6e-05,7.1e-05,1e-04,4.8e-05,3.4e-05,4.3e-05,3.8e-05,7.8e-05,6.9e-05,6.4e-05,6.4e-05,2.9e-05,4e-06,7e-05,1.3e-05,3.9e-05,3.2e-05
3.2e-05,0.000111,9.3e-05,8.3e-05,0.000116,2.2e-05,1.8e-05,5e-06,3.1e-05,2.5e-05,5.9e-05,0.000139,5.1e-05,8.5e-05,0.000182,4.5e-05,9.7e-05,6.2e-05,0.000105,7.1e-05,0.000105,8.7e-05,1.4e-05,7.5e-05,5.7e-05,8.1e-05,1.7e-05,4.7e-05,8.8e-05,0.000112,4.3e-05,0.000192,2.6e-05,1.1e-05,2.1e-05,7.6e-05,0.000107,6e-05,3.1e-05,1.2e-05,7.6e-05,0.000103,4.5e-05,0.000152,7.7e-05,6.8e-05,7.6e-05,8.1e-05,7.2e-05,1e-04,7.3e-05,5.2e-05,8.2e-05,6.6e-05,6.4e-05,4.3e-05,8.7e-05,3.1e-05,9.1e-05,2.1e-05,6.4e-05,3.9e-05,6.7e-05,8.8e-05,1.6e-05,0.000119,5.4e-05,4.3e-05,7.3e-05,0.000112,7.9e-05,0.000101,5.8e-05,6.6e-05,4.3e-05,5.8e-05,4.6e-05,8.7e-05,9.4e-05,7.4e-05,3.2e-05,0.000121,1.7e-05,8.1e-05,6.8e-05,1.6e-05,1.1e-05,3.5e-05,2.3e-05,3e-05,3.9e-05,5.9e-05,3.5e-05,2.8e-05,9e-06,4.1e-05,4.5e-05,3.3e-05,2e-05,1.4e-05,3.3e-05,1.6e-05,6.5e-05,6.2e-05,1.8e-05,5e-05,7.9e-05,2.7e-05,2.2e-05,4.2e-05,2.7e-05,1.5e-05,1.2e-05,2.7e-05,4.1e-05,1.7e-05,4.7e-05,4.2e-05,4.7e-05,4.8e-05,2.2e-05
4.8e-05,7.4e-05,0.000117,6e-05,6.8e-05,0.000104,4.2e-05,3.1e-05,4.7e-05,3.6e-05,0.000133,0.000124,0.000121,4.1e-05,0.000161,6e-05,5.2e-05,2.8e-05,7.7e-05,2.1e-05,7.4e-05,8e-05,0.000101,0.000128,5.7e-05,8.1e-05,5e-06,0.000112,0.000108,6e-05,0.000113,0.000141,6e-05,0.000116,6e-05,6.5e-05,7.7e-05,3.1e-05,2.7e-05,3.6e-05,9e-05,0.000116,8.8e-05,0.000181,0.000121,0.000124,0.000143,5.6e-05,5.8e-05,6.3e-05,0.000112,9.6e-05,7.3e-05,6.2e-05,6.4e-05,2.4e-05,1.6e-05,4.3e-05,6.8e-05,4.7e-05,5.5e-05,1.7e-05,2.8e-05,0.000106,2.4e-05,0.000133,5e-05,6.2e-05,6.2e-05,0.00011,4.1e-05,0.000114,7.5e-05,1.6e-05,9.3e-05,5.3e-05,0.000114,5.3e-05,7.8e-05,5.2e-05,4.2e-05,9e-05,7e-05,6.9e-05,7.6e-05,3.3e-05,6.2e-05,3.6e-05,1.2e-05,3.8e-05,4.2e-05,6.6e-05,2.3e-05,4.9e-05,3e-05,2.4e-05,3.1e-05,3.4e-05,1.7e-05,2.3e-05,3.8e-05,2.4e-05,6.7e-05,6.2e-05,1.1e-05,5.3e-05,9e-05,3.5e-05,1.4e-05,3.2e-05,2e-05,1.4e-05,4e-06,1.4e-05,2.4e-05,6e-06,6.2e-05,5.2e-05,4.9e-05,5.2e-05,1.7e-05
0.000105,9.1e-05,0.000165,3.1e-05,9e-05,0.000217,0.000124,5e-05,8.2e-05,7.4e-05,0.000145,0.000226,0.00018,9.2e-05,0.000252,0.00014,8.3e-05,0.000107,0.000116,2.3e-05,2.5e-05,0.00018,0.000194,0.000135,2e-05,0.000106,1.4e-05,0.000181,9.7e-05,7.6e-05,0.000206,0.000197,1.9e-05,0.000126,5.5e-05,0.000117,1.6e-05,6.9e-05,3.4e-05,2.9e-05,0.000149,0.000128,0.000102,0.000153,0.000147,0.000146,0.000238,0.000101,7.2e-05,6.3e-05,0.000132,0.000168,0.000124,8.1e-05,0.000102,4.6e-05,0.000107,2.3e-05,8.6e-05,0.000106,0.000128,3e-05,5e-05,0.000176,7.8e-05,0.000168,6.4e-05,0.000101,0.000102,0.00011,0.000115,0.000161,9.2e-05,3.4e-05,0.000114,4.3e-05,0.000136,4e-05,0.000125,7.3e-05,5.1e-05,9.1e-05,0.000118,9.9e-05,0.000113,5.8e-05,7.1e-05,6.7e-05,4.6e-05,6.7e-05,3.7e-05,8.5e-05,1.7e-05,7.2e-05,6.3e-05,7.4e-05,5.2e-05,6.5e-05,4.8e-05,5.5e-05,7.4e-05,4.6e-05,0.000104,0.000118,1e-05,5.6e-05,0.000119,6.8e-05,5.3e-05,5.3e-05,2.8e-05,4e-05,2.4e-05,6e-05,2.4e-05,2.1e-05,0.000101,8.1e-05,8.6e-05,7.2e-05,3e-05
0.000216,0.000232,0.000266,0.000238,0.00038,0.000518,0.000267,0.000159,0.000203,0.000166,0.000231,0.000263,0.000548,0.000433,0.000472,0.00067,0.000334,0.000229,0.000293,0.000156,0.000112,0.00029,0.000389,0.000245,0.000335,0.000162,5.9e-05,0.000319,0.000127,4.5e-05,0.000338,6.1e-05,0.000329,9.9e-05,0.000106,0.000125,3.9e-05,8.5e-05,0.000177,8e-05,0.000126,2e-04,0.000114,0.000347,0.000347,0.000466,0.000499,0.000269,0.000162,0.000145,0.000183,0.000271,0.000116,0.000224,0.000308,3.9e-05,0.000199,0.000171,6.6e-05,0.000181,0.000353,0.000367,0.00031,0.000414,0.000365,4.9e-05,0.000175,0.000102,0.000174,0.000258,0.000124,0.000435,0.00032,9.2e-05,0.000169,0.000264,0.000347,0.000198,0.000203,0.000191,0.000111,0.000239,0.000306,0.000189,0.000266,0.000142,0.000169,0.00011,0.000198,0.000128,0.000143,0.000112,7.5e-05,0.00018,5.9e-05,0.000242,0.000126,0.000142,0.000184,4.1e-05,7.5e-05,0.00014,0.000118,0.000329,0.000192,0.000152,0.000206,0.000287,0.000168,8.2e-05,2.5e-05,7.7e-05,7e-05,2e-04,0.000232,8.6e-05,0.000163,0.000201,0.000155,7.9e-05,9.8e-05
0.000546,0.000348,0.000234,5e-04,0.000257,0.000911,0.000652,9.1e-05,0.000252,0.000106,0.000624,0.000302,0.000393,0.000589,0.000427,0.000654,0.000811,0.000611,0.000417,0.000404,0.000286,0.000204,0.000531,0.000382,0.000346,0.00061,0.000249,0.000257,0.000409,0.000288,0.000596,0.000427,0.000657,0.000704,0.000382,2.3e-05,0.000182,0.000165,0.000414,0.000598,0.000377,0.00037,9.6e-05,2e-04,0.00049,0.000233,0.000212,0.000431,0.000403,0.000385,0.000573,0.000574,0.000617,0.00058,0.000479,0.000329,0.000316,0.000329,0.000293,5.2e-05,0.000341,0.000556,0.000228,0.000202,0.000627,0.000704,0.000398,0.000219,0.000166,0.000412,0.000327,0.00052,0.000473,0.000404,4.9e-05,0.000309,5.8e-05,0.000363,0.000414,0.000289,0.000141,0.00026,0.000526,0.000317,0.000325,0.000456,0.000141,8.4e-05,0.000206,8.1e-05,7.8e-05,0.000143,0.000181,0.000152,0.000217,0.000332,0.000366,0.00014,0.00011,0.000111,0.000109,0.000182,8.8e-05,0.000345,0.00041,0.00028,0.000136,0.000489,0.000286,0.000103,1.2e-05,0.000134,0.000149,3e-04,0.000157,0.000131,0.000291,7.3e-05,0.000169,0.00024,9.7e-05
0.000111,0.000224,0.000317,0.000171,0.000655,0.000505,0.000484,0.000558,0.000225,0.00019,0.000951,0.000524,0.000186,0.000388,0.00026,0.000663,0.00064,0.000342,0.000348,0.000192,0.00021,0.000572,0.000743,0.000509,0.000729,0.000942,0.000671,0.000481,0.00039,0.000238,0.000454,0.000442,0.000435,0.000106,0.000167,0.000317,0.000363,0.000122,0.000494,0.000713,0.000466,0.000516,0.000308,0.000347,0.000245,0.000369,0.000464,0.000421,0.000485,8.8e-05,0.00046,0.000227,0.000194,0.00044,0.000315,0.000213,0.000131,0.000162,0.000247,7.1e-05,0.000467,0.000235,0.00011,0.000117,0.000357,0.000196,0.000217,0.000372,0.000227,0.000127,3e-04,0.000321,0.000339,0.000302,0.000208,0.000139,0.000309,0.000327,0.000245,0.000182,0.000165,0.000275,0.000213,0.000311,0.000245,0.00018,0.000244,0.000265,0.000265,9.4e-05,7.6e-05,0.00025,0.000162,0.00028,0.000269,3e-04,0.000195,0.000127,0.000194,0.000102,0.000151,5e-05,9.2e-05,0.000233,0.000116,0.000154,0.000204,0.000429,0.00025,8.5e-05,0.000155,0.000309,0.000235,0.000304,0.000142,0.000123,0.000262,0.000267,0.000184,0.000191,0.000388
0.000238,0.00052,2e-04,9.5e-05,0.000592,0.000345,0.000204,0.000207,0.000192,0.000218,0.000797,0.000496,0.000283,3e-04,0.000509,0.001024,4.3e-05,0.000179,0.000623,0.000286,0.000302,0.000445,0.000928,0.000381,0.000622,0.000712,0.000207,0.000258,0.000328,0.000252,0.000642,0.000402,0.000693,0.000567,0.000689,0.000811,0.00095,0.000625,0.000257,0.000625,0.000805,0.00096,0.000932,6e-04,0.00049,0.000462,0.000817,0.000444,0.000415,0.000263,0.000578,0.000604,0.000195,0.000303,0.00033,0.00032,0.000354,0.000312,0.00035,0.000351,0.000462,0.000544,0.000287,0.000108,0.000126,0.000102,0.000238,0.000486,0.000441,0.000223,0.000148,0.000157,0.000367,0.000296,0.000267,0.00024,8.9e-05,8.8e-05,0.000204,0.000291,9.9e-05,0.000182,0.000208,0.000181,0.000232,8.6e-05,1e-04,8.4e-05,0.000107,0.000119,0.000186,0.000493,0.000403,0.00025,0.000155,0.000169,0.000196,0.000151,0.000364,0.000161,0.000114,0.000183,0.000115,0.000164,0.000243,0.00012,0.000137,9.6e-05,4.1e-05,5.2e-05,0.00017,0.000261,0.000243,0.000413,0.000313,0.000104,0.000241,0.000311,0.000399,0.000313,0.00042
0.000362,0.000694,0.000403,0.000461,0.00047,0.000189,0.000103,5.7e-05,0.000208,0.000154,0.000836,0.00114,0.000937,0.000641,0.00022,0.000855,0.000912,0.000448,0.000579,0.000585,0.000562,0.00073,0.000581,0.000288,0.000324,0.000759,0.000812,0.000619,0.000604,0.000262,0.000532,0.000146,0.000299,0.000184,0.000673,0.000122,0.000328,9.9e-05,0.000321,0.00085,9.5e-05,0.001068,0.001012,0.000959,0.000774,9e-05,0.000464,0.000563,0.000342,0.00026,0.000347,0.000806,0.000516,0.000552,0.000111,0.000208,6.5e-05,0.000165,0.000132,0.000476,0.000469,0.000314,0.000356,0.000124,0.000286,0.000357,0.000352,0.000557,0.000396,0.000237,0.000193,0.00033,0.000224,8.6e-05,0.000172,7.3e-05,0.000113,0.000227,0.000367,0.000188,2e-04,0.000314,0.000267,8.5e-05,0.000277,0.000309,0.000159,0.000128,6.5e-05,0.000158,9.3e-05,0.000402,0.000241,0.000253,0.000215,5.6e-05,0.000166,0.000142,0.000294,0.000264,0.000167,0.000174,8.3e-05,0.000206,7.6e-05,5.9e-05,3.5e-05,9.6e-05,6.6e-05,0.000153,1e-04,0.000244,0.000311,0.000124,7.5e-05,3.4e-05,0.000185,0.000157,0.000178,8.6e-05,0.000139
0.000302,0.000455,0.000245,0.000413,0.000189,0.000305,0.000259,0.000144,0.000148,0.000342,0.000755,0.000516,0.000357,5.6e-05,0.000363,0.000398,0.00031,0.000438,0.000493,2.6e-05,0.000211,0.000151,0.000248,0.000111,8.2e-05,0.000233,0.000392,0.000359,8.2e-05,0.000157,0.000414,0.000561,0.000352,0.000454,0.000411,0.000448,0.00023,0.000169,0.000326,0.000351,0.000569,0.000478,6.2e-05,0.000445,0.000204,0.000397,0.000135,0.000282,5.2e-05,0.000179,0.000357,0.000338,0.000268,0.000523,0.000515,0.000268,0.00026,0.000216,0.000206,0.000337,0.000107,0.000194,0.000103,0.000243,0.000183,0.000247,9.6e-05,0.00034,5.2e-05,0.000165,0.000159,0.000302,0.000145,9.3e-05,4.1e-05,9.9e-05,0.000181,0.000203,0.00013,9.5e-05,0.000141,0.000128,0.000143,6.3e-05,0.000284,0.000288,0.000127,0.000104,6e-05,0.000213,0.000223,0.000235,0.000114,2.3e-05,0.000115,0.00011,8.6e-05,0.000132,0.000262,0.000102,6.8e-05,2.2e-05,5.9e-05,0.000124,7e-05,7.5e-05,0.000132,0.000134,3e-05,0.000132,9e-05,0.000174,5.6e-05,7.8e-05,9e-05,9.4e-05,0.000235,0.000148,0.000205,0.000166,6.3e-05
0.000186,0.000237,0.000184,0.000174,0.000168,0.000353,0.000126,9.6e-05,3.9e-05,0.000272,0.000366,0.000121,0.000279,0.00032,0.000335,9.5e-05,0.000227,8.6e-05,0.000105,6.1e-05,0.000103,0.000231,0.000292,0.000146,0.000174,0.000363,0.000571,0.000319,0.000187,0.000255,0.000512,0.000366,5.3e-05,0.000502,0.000263,0.000294,0.000366,0.000294,0.000144,0.000167,0.00018,0.000484,0.000263,0.000109,0.00011,0.000265,0.000141,0.000139,6e-05,9.9e-05,8.3e-05,0.000181,0.000239,0.000237,0.000152,0.000146,0.000205,0.000119,0.000299,4.7e-05,0.000104,0.000187,9.2e-05,0.000179,0.00012,0.000259,0.000215,6.3e-05,4e-05,7.5e-05,0.000264,6.4e-05,8.3e-05,6.7e-05,1.6e-05,5.6e-05,9.6e-05,5.1e-05,0.000112,4.1e-05,6.6e-05,0.00012,0.000165,0.000111,0.000133,5e-05,5.9e-05,7.9e-05,6.4e-05,0.000183,8.3e-05,5.2e-05,2.1e-05,4.2e-05,7.7e-05,6.1e-05,6.3e-05,6.4e-05,0.000185,0.000112,6.6e-05,9.6e-05,7.2e-05,6.2e-05,4.2e-05,0.000108,4.9e-05,9e-05,0.000121,2.7e-05,6.3e-05,2.9e-05,1e-04,8.9e-05,6e-05,5.3e-05,1e-04,0.000141,7.3e-05,7.2e-05,7.5e-05
0.000119,0.000104,0.000183,0.000228,0.000179,0.000266,0.000253,0.000172,0.000203,0.000264,0.000307,0.00012,0.000152,6.5e-05,0.000157,6.2e-05,0.000208,0.000306,0.000492,0.000326,0.000255,0.000145,0.000119,0.000119,0.000243,0.000343,2.4e-05,0.000173,0.000218,0.00012,0.000275,0.000142,0.00013,0.00018,9.4e-05,0.000258,0.000152,7e-05,3.5e-05,3.5e-05,7.4e-05,0.000124,0.000197,0.000219,0.00016,6.2e-05,0.00011,9.1e-05,0.000101,0.00021,2e-04,0.000186,0.000191,0.00011,0.000148,0.000149,2.9e-05,0.000174,0.000118,5.7e-05,6.9e-05,1.4e-05,9.7e-05,7.7e-05,4.1e-05,6.8e-05,0.000105,7.1e-05,6.7e-05,6.9e-05,0.00024,0.000157,8.6e-05,6.3e-05,8.9e-05,7.4e-05,1.6e-05,6.2e-05,2.6e-05,3.3e-05,5.5e-05,3.1e-05,2.7e-05,3.8e-05,0.000108,2.2e-05,3.6e-05,6.2e-05,6.8e-05,6e-05,3e-05,6.8e-05,9e-06,6.4e-05,2.7e-05,2.7e-05,5.4e-05,6.1e-05,2.2e-05,7.7e-05,8.7e-05,2.2e-05,4.8e-05,6e-05,1e-05,4.3e-05,4e-05,4.6e-05,0.000104,0.000119,5.9e-05,5.6e-05,0.000103,3.5e-05,4.1e-05,1.9e-05,3.1e-05,0.00014,7.7e-05,3.9e-05,0.000102
5.8e-05,3.1e-05,8e-05,1.4e-05,5.5e-05,9.9e-05,5.3e-05,3e-05,5.8e-05,2.6e-05,5.7e-05,4.2e-05,3.4e-05,2.7e-05,0.000114,5.3e-05,9.2e-05,0.000138,0.000101,1.9e-05,6.5e-05,0.00011,6.4e-05,8.6e-05,5e-06,5.4e-05,2e-05,9.4e-05,4.6e-05,3.9e-05,4.3e-05,1.9e-05,4.8e-05,5.3e-05,4.4e-05,2.6e-05,6.2e-05,7.5e-05,4.5e-05,4.5e-05,3.3e-05,7.9e-05,5.6e-05,4.9e-05,8.1e-05,9.5e-05,6.3e-05,5.7e-05,5.9e-05,5.7e-05,5.1e-05,6e-05,3.6e-05,2.5e-05,1e-05,6.1e-05,3.4e-05,5.3e-05,4.8e-05,1.9e-05,4e-05,1.9e-05,5.5e-05,4.5e-05,2.7e-05,1.8e-05,3.8e-05,2.6e-05,2.6e-05,5.9e-05,7.4e-05,6.9e-05,6.4e-05,2.3e-05,9e-06,2.6e-05,2.7e-05,4.1e-05,1.2e-05,1e-05,1.4e-05,1.1e-05,8e-06,3.4e-05,4.8e-05,1e-05,1e-05,4e-06,6e-06,1.2e-05,1.2e-05,2.1e-05,4e-06,2.1e-05,4e-06,1.3e-05,1.5e-05,1.5e-05,2.6e-05,3.6e-05,1.9e-05,1.4e-05,1e-06,7e-06,2.5e-05,2.2e-05,5e-06,8e-06,2.8e-05,1.7e-05,1.2e-05,2.3e-05,2.2e-05,2.5e-05,1e-05,1.3e-05,2.3e-05,1.7e-05,2.9e-05,2.8e-05,1.7e-05
1.5e-05,2.2e-05,2e-05,2e-05,2.5e-05,7.1e-05,3.8e-05,1.1e-05,1.7e-05,2.7e-05,7e-05,3.4e-05,7.3e-05,2.5e-05,0.000115,6e-05,5.8e-05,0.000113,4.3e-05,5.5e-05,4e-05,5.5e-05,4.3e-05,5.9e-05,2.3e-05,4.9e-05,3.9e-05,6.8e-05,3.3e-05,3e-06,1.4e-05,2.9e-05,3.2e-05,3e-05,3.4e-05,2.6e-05,1.5e-05,2.9e-05,4e-06,5e-06,2.2e-05,6.3e-05,5.1e-05,2.5e-05,4.6e-05,5.6e-05,6e-05,2.3e-05,3.2e-05,1.1e-05,4.9e-05,4.4e-05,5.1e-05,1.4e-05,2.7e-05,1.6e-05,4e-06,9e-06,4.4e-05,1.4e-05,4e-05,1.2e-05,1.3e-05,2e-05,1.6e-05,2.9e-05,3.2e-05,1.9e-05,2.2e-05,2e-05,1.9e-05,3.8e-05,2.1e-05,9e-06,1.8e-05,1.1e-05,1.9e-05,2.2e-05,1.6e-05,1.3e-05,1.2e-05,1.4e-05,2.3e-05,8e-06,3.2e-05,1.5e-05,1.3e-05,6e-06,9e-06,1.1e-05,6e-06,1e-05,1e-05,7e-06,7e-06,8e-06,5e-06,1.1e-05,6e-06,1.3e-05,9e-06,1.7e-05,2e-05,3.5e-05,1.1e-05,6e-06,2.4e-05,2.4e-05,5e-06,1.4e-05,6e-06,7e-06,1.2e-05,1e-05,7e-06,8e-06,1.5e-05,2.1e-05,1.3e-05,9e-06,5e-06
3.2e-05,1.7e-05,7.8e-05,3.2e-05,4.1e-05,6.2e-05,6.2e-05,3.5e-05,5e-05,2.3e-05,2.3e-05,4.2e-05,5.2e-05,0.000111,2.2e-05,1.9e-05,2.8e-05,6e-05,4e-05,3.4e-05,4.8e-05,0.000106,4.4e-05,4.9e-05,9e-05,9.5e-05,6.5e-05,2.8e-05,2.4e-05,4e-05,2.9e-05,2.7e-05,9e-06,5.8e-05,6e-06,3.3e-05,3.3e-05,1.7e-05,1.2e-05,2.5e-05,3.2e-05,8.1e-05,3.4e-05,3.5e-05,2.2e-05,5.1e-05,2.9e-05,2.9e-05,5.7e-05,3.7e-05,4.7e-05,3.7e-05,4.7e-05,3.2e-05,2.5e-05,1.5e-05,2.6e-05,1.9e-05,2.7e-05,2.4e-05,1.4e-05,4e-06,1.7e-05,3e-06,3e-05,2.7e-05,3.5e-05,2.4e-05,3.7e-05,1.2e-05,2.3e-05,1.8e-05,5e-06,2.1e-05,3.9e-05,2.4e-05,2.2e-05,2.4e-05,8e-06,1.2e-05,2.1e-05,2.9e-05,8e-06,2.1e-05,3e-05,9e-06,6e-06,1.4e-05,1.5e-05,8e-06,1.5e-05,1.6e-05,1.6e-05,1.9e-05,1e-05,1.7e-05,1.8e-05,1.5e-05,3e-06,1.1e-05,5e-06,3.2e-05,1.2e-05,2.9e-05,1.3e-05,9e-06,1.9e-05,1.9e-05,2.5e-05,1.7e-05,1.4e-05,8e-06,2.1e-05,3e-06,8e-06,2e-06,4e-06,2.4e-05,1.8e-05,1.6e-05,1.3e-05
6.3e-05,4.2e-05,8.7e-05,5.5e-05,4.6e-05,5.7e-05,9.3e-05,7.4e-05,3.5e-05,1.3e-05,1.7e-05,4.4e-05,4e-05,3.8e-05,5.7e-05,2.9e-05,3.4e-05,0.000117,7.1e-05,7.3e-05,7.1e-05,1.4e-05,1.4e-05,7.6e-05,9.8e-05,7.1e-05,1.9e-05,8.4e-05,2.5e-05,2.1e-05,2.4e-05,1.4e-05,1.1e-05,4.3e-05,4.6e-05,2.6e-05,3.2e-05,1.2e-05,1.6e-05,3.5e-05,3.3e-05,1.9e-05,2.6e-05,1.6e-05,3.1e-05,1e-05,5.3e-05,4e-05,5.8e-05,3.3e-05,4e-05,4.3e-05,6.2e-05,3.3e-05,3.1e-05,7e-06,5.3e-05,3.9e-05,3.6e-05,2.8e-05,4.6e-05,3.1e-05,2.1e-05,4.2e-05,4e-06,3.5e-05,3.5e-05,3.4e-05,3.5e-05,8e-06,1.6e-05,3.8e-05,2.9e-05,3.1e-05,8e-06,2.3e-05,1.7e-05,2.7e-05,3.7e-05,4.7e-05,2.4e-05,2.4e-05,1.3e-05,1.2e-05,1.1e-05,2e-05,1.3e-05,1.9e-05,7e-06,1e-05,2.6e-05,2.4e-05,2.3e-05,1.4e-05,6e-06,2.1e-05,4e-06,2e-05,1.4e-05,1.8e-05,4e-06,2.1e-05,1.7e-05,7e-06,4e-06,5e-06,4e-06,2.3e-05,1.4e-05,3e-06,1.3e-05,1.5e-05,6e-06,1.1e-05,1.2e-05,2e-05,9e-06,2e-05,9e-06,2.9e-05,2.1e-05
6.4e-05,2.7e-05,3.6e-05,6.4e-05,2.1e-05,6.2e-05,3e-05,4.4e-05,2e-06,9e-06,2.8e-05,1.3e-05,1.3e-05,1.3e-05,1e-05,3.7e-05,4.3e-05,0.000116,8e-05,1e-05,3e-05,4.2e-05,3.4e-05,6.8e-05,4.6e-05,5.5e-05,2.6e-05,5.1e-05,2.5e-05,5.5e-05,2e-05,3.1e-05,2.8e-05,3.1e-05,2.4e-05,2e-05,3.5e-05,2.6e-05,4.6e-05,1.2e-05,2.5e-05,7.5e-05,5.2e-05,8e-06,1.7e-05,5e-05,6.5e-05,2.9e-05,1.8e-05,2e-05,6e-06,8e-06,4.9e-05,2.3e-05,3e-05,1e-06,4.4e-05,2.2e-05,2.8e-05,1.9e-05,3.5e-05,6e-06,3.1e-05,8.5e-05,5.1e-05,1.7e-05,2.7e-05,1.8e-05,3.1e-05,2.2e-05,1.7e-05,2.2e-05,3.1e-05,2.2e-05,1.6e-05,5e-06,2e-05,1.4e-05,1.7e-05,2.7e-05,1.1e-05,1.5e-05,8e-06,1.4e-05,7e-06,3.3e-05,2.1e-05,1.9e-05,8e-06,1.1e-05,1.7e-05,2.7e-05,1.8e-05,1.1e-05,1.2e-05,1.3e-05,1.4e-05,2e-05,1.3e-05,1.7e-05,1.6e-05,1.5e-05,8e-06,1.9e-05,4e-06,1e-06,1.4e-05,1.7e-05,2.3e-05,1.8e-05,6e-06,9e-06,1.8e-05,1.4e-05,3e-06,1.2e-05,6e-06,1.4e-05,1.2e-05,1.8e-05,1.2e-05
2.6e-05,7.7e-05,5.1e-05,1.5e-05,1.3e-05,7.3e-05,5.7e-05,5.7e-05,2.1e-05,1.5e-05,6e-06,4.7e-05,1.6e-05,4.2e-05,2.5e-05,1.9e-05,2.4e-05,6.3e-05,7.4e-05,5.7e-05,1.8e-05,3.2e-05,4.1e-05,4e-05,4.5e-05,1.6e-05,1.7e-05,2.9e-05,4.1e-05,5.7e-05,4.3e-05,9e-06,1.8e-05,3.1e-05,5e-05,6e-06,4.3e-05,3.6e-05,1.2e-05,6e-06,4.1e-05,7.5e-05,3.2e-05,3.3e-05,3.8e-05,8.1e-05,6.1e-05,2.1e-05,1.1e-05,4.1e-05,2.4e-05,2.7e-05,3e-05,2.7e-05,4.5e-05,3.8e-05,3.8e-05,2e-05,3.5e-05,1.6e-05,1.8e-05,2.3e-05,6.5e-05,4.1e-05,7e-06,1.6e-05,3.2e-05,3.8e-05,5e-06,9e-06,3e-05,1.2e-05,2e-05,2.2e-05,1e-05,2.9e-05,2.1e-05,7e-06,1.5e-05,2.8e-05,2e-06,6e-06,2e-05,4e-06,1.9e-05,1.4e-05,1e-05,2.4e-05,1.1e-05,1.1e-05,2.1e-05,3e-05,1.1e-05,5e-06,1.7e-05,1.1e-05,1.1e-05,9e-06,4e-06,1.3e-05,1.3e-05,5e-06,1.7e-05,2.3e-05,1e-05,8e-06,1.8e-05,1e-05,1.2e-05,1e-05,9e-06,8e-06,1.9e-05,2e-05,1.3e-05,4e-06,1.4e-05,1.1e-05,2.4e-05,1.3e-05,1.5e-05
2.5e-05,8.9e-05,7.9e-05,4.5e-05,1.6e-05,5.7e-05,2.6e-05,2.2e-05,5.3e-05,7e-06,3.2e-05,3.5e-05,4.7e-05,6e-05,4.6e-05,3e-05,2.4e-05,5.4e-05,4.3e-05,2.9e-05,2.8e-05,3.6e-05,1.7e-05,2.6e-05,3.3e-05,5e-05,2.4e-05,3.1e-05,2.4e-05,5.3e-05,1.4e-05,3.1e-05,5.1e-05,7.1e-05,3.8e-05,3e-06,2.1e-05,1.3e-05,4e-05,1e-05,4.4e-05,4.8e-05,2.5e-05,2.1e-05,4.5e-05,6.8e-05,1.7e-05,4e-05,4e-05,9e-06,5.7e-05,6.1e-05,5e-05,1.4e-05,5.5e-05,3e-05,5e-05,5.2e-05,3.6e-05,1.4e-05,3.7e-05,2.3e-05,6.1e-05,8.7e-05,6.7e-05,3.1e-05,2.7e-05,1.3e-05,8e-06,4e-06,2.5e-05,4.5e-05,2.1e-05,3.4e-05,3e-05,3.2e-05,1.6e-05,1.2e-05,7e-06,1.3e-05,3.1e-05,9e-06,2e-05,1.1e-05,1.2e-05,5e-06,1.1e-05,1.8e-05,3.4e-05,1.1e-05,4e-06,1.4e-05,1.9e-05,3.5e-05,3e-06,1e-05,1.2e-05,2.1e-05,1.5e-05,5e-06,4e-06,8e-06,1.4e-05,2.8e-05,2e-06,4e-06,1.7e-05,1.4e-05,1.8e-05,5e-06,1.4e-05,1.4e-05,2e-06,3e-06,1e-05,1.3e-05,2.5e-05,2.6e-05,1e-05,7e-06,2e-05
7.3e-05,7.5e-05,4.2e-05,3e-05,5.3e-05,3e-05,1.4e-05,2.6e-05,3.9e-05,5.7e-05,8.3e-05,4.6e-05,5.2e-05,2.9e-05,3e-05,4.8e-05,5.8e-05,5.7e-05,3.6e-05,3.4e-05,8e-06,1.8e-05,1e-05,3.7e-05,9.1e-05,2.2e-05,6.5e-05,3.7e-05,6e-05,6.8e-05,7e-05,3.9e-05,5.5e-05,2.1e-05,3.1e-05,3.6e-05,3.4e-05,1.1e-05,6e-05,5e-05,4.7e-05,1.9e-05,8.5e-05,4.1e-05,3.2e-05,2.4e-05,6.7e-05,3.2e-05,0,5.6e-05,8.5e-05,7.9e-05,4.6e-05,3.2e-05,6.6e-05,4.5e-05,1.6e-05,1e-05,5.5e-05,3.2e-05,3.8e-05,4.7e-05,4.8e-05,2.3e-05,7e-06,1.4e-05,1.5e-05,5.4e-05,4.6e-05,2.5e-05,1.6e-05,3.2e-05,2e-05,3.6e-05,4e-06,4.1e-05,4.9e-05,2.8e-05,1.2e-05,1e-05,1.9e-05,2.2e-05,1.7e-05,2.8e-05,2.3e-05,2.3e-05,2.4e-05,3.1e-05,2.3e-05,2.5e-05,1.1e-05,1.9e-05,1.2e-05,2.7e-05,2.5e-05,1.8e-05,3.1e-05,2.9e-05,2.8e-05,1.2e-05,7e-06,2.1e-05,1.3e-05,2.2e-05,2.4e-05,1.2e-05,1.1e-05,2.4e-05,1.6e-05,4e-06,8e-06,7e-06,1e-05,6e-06,2e-05,8e-06,8e-06,2.3e-05,2.7e-05,2.4e-05,1.8e-05
3.4e-05,8e-06,3.7e-05,2.1e-05,2e-05,2.9e-05,4.1e-05,5.2e-05,1.5e-05,5.7e-05,3e-05,3.7e-05,5.2e-05,6.4e-05,2.5e-05,1.7e-05,1.5e-05,6.8e-05,3.9e-05,6e-05,7.7e-05,4.7e-05,2.6e-05,4.9e-05,5.9e-05,8.6e-05,8.3e-05,6.1e-05,6.4e-05,2.9e-05,5.2e-05,6.2e-05,7.6e-05,6.7e-05,2.9e-05,3.1e-05,2.1e-05,4.2e-05,4.7e-05,5.2e-05,1.9e-05,3.9e-05,4.7e-05,2.5e-05,1.6e-05,1.8e-05,7.2e-05,7.3e-05,3.8e-05,8.3e-05,5.6e-05,3.8e-05,6.6e-05,6.4e-05,6e-05,5.7e-05,4.1e-05,1.2e-05,8e-05,2.1e-05,4.8e-05,3.4e-05,1e-05,2.8e-05,1.5e-05,3.3e-05,4e-05,5.8e-05,1.9e-05,2.1e-05,1.7e-05,3.5e-05,5e-05,5e-05,5.9e-05,5e-05,1.5e-05,1.3e-05,2e-05,3.1e-05,2.1e-05,3e-05,3.8e-05,3.9e-05,2.6e-05,4.6e-05,3.7e-05,1.1e-05,1.3e-05,1.6e-05,1.4e-05,3.3e-05,2.9e-05,3.9e-05,4.7e-05,4.4e-05,3.3e-05,2.8e-05,2.3e-05,2.8e-05,2.6e-05,7e-06,1.3e-05,2.6e-05,4e-05,3.9e-05,2.8e-05,3.3e-05,1.7e-05,2.1e-05,2.6e-05,1.8e-05,9e-06,4e-06,1.8e-05,2.8e-05,4e-05,2.4e-05,7e-06,3e-06,1.5e-05
4.3e-05,1.7e-05,2.8e-05,1.6e-05,3.4e-05,1.5e-05,2.3e-05,3.2e-05,1.6e-05,5.8e-05,7.4e-05,6.7e-05,4.3e-05,1.4e-05,1.1e-05,1.9e-05,2.2e-05,6.6e-05,7e-06,1.6e-05,4.6e-05,1.7e-05,4e-06,2.5e-05,1.6e-05,4.7e-05,3e-05,4.2e-05,3.4e-05,6.1e-05,6e-06,1.4e-05,4e-05,4.6e-05,5.5e-05,4.1e-05,2.4e-05,2.3e-05,3.8e-05,4.2e-05,1.9e-05,4e-05,4e-05,2.4e-05,4.4e-05,6e-05,8.1e-05,2.8e-05,1.3e-05,4.8e-05,3.7e-05,4e-05,3.1e-05,3.9e-05,3.2e-05,6.2e-05,3.3e-05,2.5e-05,6.1e-05,5.2e-05,4.4e-05,4e-06,3.9e-05,4.5e-05,4.4e-05,1.4e-05,2.6e-05,3.3e-05,8e-06,3.5e-05,9e-06,2.3e-05,2.5e-05,1.1e-05,2.3e-05,1.2e-05,8e-06,1.3e-05,1.6e-05,2.1e-05,2.5e-05,1.3e-05,2.1e-05,8e-06,1.9e-05,3.4e-05,7e-06,1e-05,1.1e-05,3.1e-05,1.4e-05,2.5e-05,2.3e-05,2.2e-05,1.7e-05,1.8e-05,1.4e-05,2.1e-05,7e-06,1.5e-05,8e-06,1e-05,1.6e-05,1.6e-05,2.2e-05,7e-06,3e-06,3e-05,1.7e-05,1e-05,2.3e-05,1.3e-05,1.1e-05,1.2e-05,7e-06,1e-05,2.5e-05,7e-06,2.3e-05,1.4e-05,1.7e-05
6e-05,4.1e-05,2.3e-05,3.2e-05,3.3e-05,3.7e-05,5.6e-05,2.8e-05,6.1e-05,5e-05,6e-06,4e-05,4.8e-05,7.3e-05,3.4e-05,4.2e-05,7.4e-05,1.1e-05,4.2e-05,1.7e-05,3.3e-05,6.1e-05,2.4e-05,1.3e-05,1.2e-05,6e-05,9e-06,2.5e-05,4.3e-05,4.8e-05,3.5e-05,3e-05,5.1e-05,4e-05,3e-05,1.9e-05,1.7e-05,2.5e-05,4.4e-05,2.7e-05,2.1e-05,4.3e-05,4e-06,2e-05,2.4e-05,4.9e-05,3.5e-05,3.1e-05,3.1e-05,1.1e-05,4.9e-05,2.5e-05,3.8e-05,5.8e-05,5e-06,4.5e-05,3.7e-05,1.7e-05,3.7e-05,4e-05,2e-05,2.1e-05,2.4e-05,2.9e-05,3.6e-05,1.9e-05,1.2e-05,8e-06,3e-05,5.2e-05,3.7e-05,4.1e-05,6e-06,8e-06,1e-05,2.9e-05,2.2e-05,1.2e-05,1.4e-05,1.1e-05,1.8e-05,2.9e-05,2.7e-05,2.5e-05,1.7e-05,7e-06,5e-06,1.8e-05,1.3e-05,1.9e-05,1.4e-05,1.8e-05,5e-06,1.9e-05,1e-05,1.9e-05,1e-06,2.9e-05,1.2e-05,1.8e-05,1.9e-05,9e-06,5e-06,2.5e-05,5e-06,9e-06,5e-06,9e-06,1.3e-05,9e-06,2e-05,3e-06,1e-05,1.3e-05,1.3e-05,6e-06,2.1e-05,2e-05,3.5e-05,2.4e-05,2.1e-05
1.6e-05,7.1e-05,7.4e-05,3.2e-05,3.1e-05,5.2e-05,8.6e-05,5.5e-05,6.7e-05,1.8e-05,2.8e-05,5.2e-05,1.5e-05,5.5e-05,4.9e-05,9e-06,6.5e-05,0.000104,3.2e-05,1.6e-05,3.7e-05,5.2e-05,5e-05,3.5e-05,1.7e-05,3.8e-05,1.4e-05,2.9e-05,7.8e-05,3.2e-05,9e-06,3.4e-05,3.4e-05,5.2e-05,2e-05,4.7e-05,2.9e-05,2.4e-05,4.7e-05,1.3e-05,2.1e-05,3.3e-05,7e-06,1.8e-05,8e-06,5.8e-05,5.2e-05,3.5e-05,3.2e-05,3e-05,4.7e-05,6.1e-05,6.8e-05,8e-06,3.5e-05,1.9e-05,1.9e-05,3.5e-05,3.8e-05,2.8e-05,4e-06,3.8e-05,4.1e-05,2.4e-05,5.7e-05,3.9e-05,3.3e-05,1.6e-05,1.5e-05,4.7e-05,2.6e-05,4.7e-05,5.1e-05,3.5e-05,3.6e-05,3.2e-05,2.5e-05,1.4e-05,2.7e-05,2.5e-05,2.3e-05,3.9e-05,2.8e-05,2.5e-05,1e-05,1.1e-05,2e-06,1.5e-05,1e-05,1.8e-05,2.1e-05,1.5e-05,1.6e-05,2e-05,1.7e-05,1.5e-05,2.9e-05,4.9e-05,4.4e-05,1e-05,7e-06,5e-06,1.5e-05,2e-05,2.9e-05,1.5e-05,8e-06,1e-05,1.5e-05,1.7e-05,2e-05,1.8e-05,1.8e-05,1.9e-05,1.7e-05,1.8e-05,2.4e-05,1.8e-05,1.3e-05,7e-06,1.3e-05
5.7e-05,8.7e-05,1.9e-05,9e-06,5.1e-05,4.5e-05,3.4e-05,6.7e-05,8.5e-05,4.7e-05,3.3e-05,4.2e-05,3.4e-05,3.8e-05,1.5e-05,3.5e-05,2.7e-05,5.9e-05,3.2e-05,1.5e-05,4.8e-05,8.6e-05,4.2e-05,5e-05,3e-05,4e-05,3.6e-05,2.3e-05,4.4e-05,6e-05,4.1e-05,1.5e-05,4.9e-05,1.8e-05,3.8e-05,3.1e-05,2.7e-05,3.9e-05,3.9e-05,4.5e-05,7e-06,2e-05,7e-05,5.2e-05,3.4e-05,4.9e-05,3.5e-05,3.9e-05,5.1e-05,1.8e-05,2.2e-05,2e-05,1.6e-05,3.4e-05,4.2e-05,5.6e-05,6e-05,5.5e-05,1.8e-05,7e-06,1.9e-05,5.6e-05,2.2e-05,3.2e-05,2.3e-05,3.7e-05,3e-05,2.6e-05,1.4e-05,2.3e-05,2e-05,3.1e-05,2.3e-05,2e-05,4.3e-05,2.1e-05,2.7e-05,2.1e-05,2.7e-05,3.3e-05,1.7e-05,3.5e-05,1.3e-05,1e-05,1.8e-05,1.2e-05,1.2e-05,3e-06,5e-06,1.1e-05,1.1e-05,1.5e-05,1.2e-05,5e-06,1.5e-05,2e-05,1.4e-05,1.8e-05,2.4e-05,2.4e-05,2e-06,1.1e-05,2e-05,2.3e-05,2.1e-05,1.9e-05,1e-05,1.6e-05,5e-06,1.5e-05,3e-06,1.7e-05,5e-06,1.7e-05,7e-06,1.6e-05,8e-06,2.5e-05,7e-06,1.2e-05,1.3e-05
3.5e-05,3.6e-05,2.8e-05,1.6e-05,3.5e-05,4.7e-05,1.9e-05,3.8e-05,1.1e-05,3.1e-05,1.5e-05,2.5e-05,4e-06,2.9e-05,4.2e-05,2.4e-05,2.6e-05,5e-05,1.1e-05,1.3e-05,4.1e-05,1.9e-05,7e-06,1.5e-05,1e-05,5.1e-05,2.6e-05,1.4e-05,3.5e-05,5e-06,1e-05,2.8e-05,2.4e-05,1.9e-05,4e-05,4e-05,3.6e-05,1.4e-05,1.4e-05,4e-05,3.4e-05,1.5e-05,5.5e-05,1.3e-05,1.8e-05,3.1e-05,2.3e-05,3.3e-05,2.1e-05,3.7e-05,2.5e-05,1.9e-05,9e-06,2.9e-05,6e-06,4e-05,2.3e-05,3e-06,2e-06,3e-06,1.6e-05,3.3e-05,1.5e-05,3.8e-05,2.9e-05,2.1e-05,1.6e-05,1.5e-05,2.7e-05,1.6e-05,2.5e-05,3.3e-05,4e-06,1.2e-05,2.7e-05,2.3e-05,1.8e-05,2e-05,1.3e-05,2e-05,2e-05,2.5e-05,1.1e-05,1e-06,1.4e-05,1e-05,8e-06,6e-06,8e-06,9e-06,1e-06,2e-06,1.1e-05,6e-06,9e-06,3e-06,7e-06,1.6e-05,9e-06,9e-06,1.9e-05,2.1e-05,1.1e-05,3e-06,5e-06,1.4e-05,1.3e-05,7e-06,1.5e-05,3e-06,5e-06,8e-06,5e-06,1e-05,1.2e-05,1.4e-05,2e-05,1.3e-05,1e-05,1e-05,1.4e-05
2.8e-05,7e-06,5e-06,8e-06,1e-05,2.9e-05,1.6e-05,2.2e-05,1.1e-05,1.3e-05,4e-06,1.7e-05,1.4e-05,2e-05,2e-05,2.5e-05,3.6e-05,3e-05,1.3e-05,2e-06,1.7e-05,2.2e-05,1.7e-05,2.1e-05,2.3e-05,1.7e-05,1.9e-05,1.9e-05,3e-05,1.9e-05,1.3e-05,1.4e-05,1.8e-05,4e-06,8e-06,1.8e-05,2.1e-05,8e-06,1.7e-05,2.4e-05,4e-06,2.1e-05,2.2e-05,5e-06,2.1e-05,4.2e-05,4.1e-05,1.3e-05,1.8e-05,2.8e-05,2e-05,1.4e-05,1.2e-05,1.7e-05,1.2e-05,2.9e-05,1.1e-05,9e-06,9e-06,8e-06,1.6e-05,5e-06,9e-06,3e-05,1.2e-05,2e-05,1.7e-05,2.3e-05,9e-06,7e-06,2.2e-05,1.2e-05,2e-06,1.1e-05,4e-06,1.2e-05,1.4e-05,3e-06,1.1e-05,7e-06,6e-06,1.1e-05,6e-06,1.3e-05,1.1e-05,5e-06,5e-06,6e-06,6e-06,3e-06,2e-06,2e-06,7e-06,3e-06,1e-06,1.1e-05,8e-06,1.5e-05,2e-06,1.1e-05,1.1e-05,7e-06,6e-06,2e-06,2e-06,1.4e-05,4e-06,2e-06,1.4e-05,7e-06,8e-06,1.1e-05,7e-06,1.1e-05,1e-05,1.5e-05,9e-06,3e-06,1.1e-05,5e-06,1.2e-05
3.1e-05,1.2e-05,1.3e-05,1.4e-05,2.3e-05,2.4e-05,2.1e-05,2.4e-05,6e-06,3e-06,8e-06,4e-06,1.4e-05,1.9e-05,3.4e-05,2.8e-05,1.7e-05,4.5e-05,1.1e-05,5e-06,1.1e-05,1.4e-05,1.5e-05,1.9e-05,1.5e-05,7e-06,1.1e-05,1.9e-05,2.2e-05,1.4e-05,4e-06,6e-06,2.6e-05,3e-05,4e-06,1.2e-05,2e-05,8e-06,2.1e-05,1.5e-05,1.8e-05,2.4e-05,4.3e-05,1.1e-05,2.8e-05,4.4e-05,3e-05,1e-06,1.9e-05,1.7e-05,3e-06,9e-06,1.4e-05,9e-06,8e-06,1.5e-05,8e-06,1.7e-05,2.5e-05,1.9e-05,1.8e-05,2e-06,1.2e-05,2.5e-05,7e-06,5e-06,2.1e-05,1.1e-05,9e-06,2.6e-05,1.6e-05,1.2e-05,4e-06,1.6e-05,1.2e-05,5e-06,3e-06,3e-06,1.4e-05,6e-06,1.1e-05,1.8e-05,1.2e-05,2.2e-05,1.9e-05,1.1e-05,9e-06,3e-06,8e-06,4e-06,5e-06,5e-06,6e-06,1.1e-05,2e-06,6e-06,1e-06,1.2e-05,1.3e-05,1.5e-05,1.1e-05,6e-06,1.1e-05,1e-05,7e-06,1.4e-05,7e-06,8e-06,7e-06,5e-06,4e-06,1.2e-05,5e-06,8e-06,8e-06,2e-06,9e-06,6e-06,1.3e-05,4e-06,1e-05
7e-06,1.8e-05,8e-06,1.2e-05,3.1e-05,1.7e-05,1.2e-05,2.1e-05,2.4e-05,1.3e-05,2e-06,1.3e-05,1.4e-05,1.6e-05,4.1e-05,2.3e-05,1.1e-05,4e-05,7e-06,1.5e-05,2.3e-05,2.6e-05,1.4e-05,2.9e-05,2.8e-05,1.7e-05,1.3e-05,1.9e-05,1.8e-05,1.3e-05,5e-06,7e-06,1.4e-05,1.8e-05,4e-05,2.6e-05,1.1e-05,5e-06,1.2e-05,1.9e-05,2.5e-05,5.7e-05,1.1e-05,3.1e-05,3.3e-05,2.2e-05,3.7e-05,2.5e-05,1.6e-05,2.3e-05,1.3e-05,2e-06,2.6e-05,2.4e-05,4e-06,1.2e-05,1.6e-05,9e-06,2.2e-05,2.7e-05,1.7e-05,4e-06,1.8e-05,1.8e-05,1.7e-05,2.9e-05,2.2e-05,2.8e-05,1.2e-05,1.5e-05,1.7e-05,1.2e-05,2e-06,1.1e-05,5e-06,7e-06,1.4e-05,1e-05,3e-06,1.3e-05,1.3e-05,8e-06,1.6e-05,1.2e-05,3e-06,4e-06,6e-06,2e-06,5e-06,4e-06,5e-06,1e-05,5e-06,8e-06,9e-06,2e-06,2e-06,3e-06,1.1e-05,7e-06,5e-06,1e-06,9e-06,1e-06,6e-06,6e-06,1e-05,6e-06,5e-06,7e-06,1.2e-05,1e-05,1.2e-05,9e-06,7e-06,7e-06,1.4e-05,2e-06,1.3e-05,1.2e-05,2.1e-05
1.6e-05,7e-06,4e-06,7e-06,1.8e-05,2.2e-05,5e-06,6e-06,1.1e-05,8e-06,5e-06,6e-06,4e-06,1.3e-05,2.5e-05,2.4e-05,9e-06,4e-05,9e-06,4e-06,6e-06,1.3e-05,4e-06,1.4e-05,1.1e-05,1.7e-05,2e-06,2e-05,8e-06,4e-06,8e-06,5e-06,8e-06,2e-06,2.5e-05,1.2e-05,8e-06,6e-06,9e-06,9e-06,4e-06,3.3e-05,8e-06,1.1e-05,6e-06,2.6e-05,2e-05,2e-05,3e-06,3e-06,8e-06,8e-06,2.5e-05,7e-06,8e-06,8e-06,7e-06,8e-06,7e-06,8e-06,1.2e-05,1.4e-05,6e-06,1.1e-05,1.2e-05,2.6e-05,3e-06,1.8e-05,9e-06,1.4e-05,7e-06,1.7e-05,3e-06,6e-06,5e-06,3e-06,1e-05,4e-06,4e-06,9e-06,1e-06,5e-06,1.2e-05,2e-06,4e-06,3e-06,4e-06,2e-06,2e-06,2e-06,4e-06,5e-06,2e-06,6e-06,5e-06,4e-06,3e-06,7e-06,7e-06,4e-06,3e-06,4e-06,6e-06,2e-06,3e-06,3e-06,6e-06,3e-06,8e-06,2e-06,1e-05,3e-06,3e-06,8e-06,5e-06,2e-06,1.5e-05,1e-06,6e-06,3e-06,9e-06
1.3e-05,8e-06,2e-06,4e-06,1.8e-05,2e-05,8e-06,8e-06,1e-05,7e-06,3e-06,2e-06,4e-06,7e-06,1.7e-05,2e-05,1.1e-05,4e-05,7e-06,2e-06,3e-06,1.4e-05,6e-06,4e-06,9e-06,1.5e-05,2e-06,1.6e-05,2e-06,3e-06,4e-06,5e-06,6e-06,5e-06,2.1e-05,3e-06,9e-06,4e-06,7e-06,4e-06,3e-06,3e-05,1.6e-05,4e-06,2e-06,2.2e-05,2e-05,1.7e-05,2e-06,3e-06,6e-06,7e-06,1.7e-05,5e-06,2e-06,1.2e-05,4e-06,6e-06,5e-06,2e-06,8e-06,5e-06,8e-06,1.1e-05,1.2e-05,1.8e-05,6e-06,1.3e-05,8e-06,8e-06,1e-05,1.3e-05,2e-06,3e-06,3e-06,2e-06,8e-06,4e-06,6e-06,6e-06,5e-06,4e-06,1.2e-05,1e-06,5e-06,1e-06,4e-06,0,2e-06,3e-06,5e-06,2e-06,3e-06,4e-06,3e-06,3e-06,4e-06,8e-06,4e-06,3e-06,3e-06,2e-06,5e-06,3e-06,3e-06,1e-06,4e-06,5e-06,9e-06,3e-06,9e-06,2e-06,3e-06,8e-06,4e-06,4e-06,1.1e-05,5e-06,4e-06,2e-06,6e-06
1.4e-05,6e-06,5e-06,3e-06,1.7e-05,1.8e-05,6e-06,7e-06,1.1e-05,4e-06,3e-06,2e-06,1e-06,1.1e-05,1.9e-05,1.8e-05,1.1e-05,4e-05,9e-06,1e-06,5e-06,1.4e-05,3e-06,8e-06,7e-06,1.4e-05,4e-06,1.9e-05,3e-06,5e-06,3e-06,5e-06,2e-06,4e-06,2.1e-05,7e-06,8e-06,4e-06,7e-06,3e-06,1e-06,3.2e-05,1.6e-05,6e-06,2e-06,2.4e-05,1.9e-05,1.4e-05,4e-06,3e-06,4e-06,6e-06,1.6e-05,4e-06,3e-06,1.2e-05,6e-06,5e-06,5e-06,0,5e-06,6e-06,1e-05,1.2e-05,1.3e-05,1.6e-05,7e-06,1.4e-05,7e-06,6e-06,1.1e-05,1.5e-05,3e-06,3e-06,2e-06,2e-06,8e-06,6e-06,4e-06,5e-06,3e-06,5e-06,9e-06,2e-06,2e-06,3e-06,5e-06,2e-06,0,3e-06,3e-06,2e-06,3e-06,2e-06,3e-06,2e-06,2e-06,6e-06,4e-06,3e-06,3e-06,1e-06,5e-06,4e-06,1e-06,2e-06,5e-06,4e-06,8e-06,2e-06,7e-06,1e-06,1e-06,7e-06,3e-06,3e-06,1e-05,3e-06,4e-06,2e-06,7e-06
