-0.00102,-0.000801,-0.001072,-0.000663,-0.000596,-0.000383,-0.000367,-0.000304,-0.000353,-4e-04,-0.000607,-0.000647,-0.000822,-0.000945,-0.000741,-0.000878,-0.000654,-0.000575,-0.000703,-0.000667,-0.000529,-0.000254,-0.000489,-0.000557,-0.000727,-0.000764,-0.000557,-0.000514,-0.000677,-0.000769,-0.000564,-0.000605,-0.000617,-0.000316,-0.000572,-0.001084,-0.001066,-0.000756,-0.000461,-0.001232,-0.001018,-0.000558,-0.000611,-0.000519,-0.000493,-0.00058,-0.000583,-0.000654,-0.001265,-0.000816,-0.000877,-0.000773,-0.000867,-0.000766,-0.000876,-0.000498,-0.000817,-0.000577,-0.000882,-0.000719,-0.001001,-0.000736,-0.000337,-5e-04,-0.000211,-0.000337,-0.000712,-0.00072,-0.000671,-0.000652,-0.000494,-0.000406,-0.000561,-0.00089,-0.000578,-0.000609,-0.000639,-0.000564,-0.000695,-0.000515,-0.000419,-0.000509,-0.000907,-0.000598,-0.000204,-0.000864,-0.000654,-0.000393,-0.000593,-0.000693,-0.000687,-0.000374,-0.00086,-0.000544,-0.000394,-0.00031,-0.00034,-0.000762,-0.000519,-0.000666,-0.000741,-0.000704,-0.000482,-0.00061,-0.000644,-0.00062,-0.000643,-0.000896,-0.000639,-0.000566,-0.000717,-0.000462,-0.00048,-0.00013,-0.000335,-0.000378,-0.000219,-0.000631,-0.001156,-0.000832,-0.000256
0.000439,0.000113,0.000446,0.000157,9.4e-05,0.00018,5.9e-05,9.1e-05,0.000109,-3.1e-05,0.000229,-6e-06,0.000125,0.000477,0.000461,0.00032,9.2e-05,3.9e-05,0.000254,0.000285,-0.000222,-0.00034,-0.000118,4.3e-05,2.3e-05,8.1e-05,0.000149,6.4e-05,0.000113,5e-06,-0.000193,0.000155,0.000217,-0.000302,-0.000207,0.000105,0.000564,-8.5e-05,-2.7e-05,0.000747,0.000352,0.000264,-1.8e-05,-6.3e-05,-5.7e-05,0.000141,0.000177,0.000189,0.000467,0.00027,0.000173,0.000185,0.000107,-3.9e-05,0.000183,0.000201,8.9e-05,0.000281,0.000427,0.000344,0.000531,0.00016,5.4e-05,-0.000204,-0.000264,-0.000313,0.000176,0.000225,2.2e-05,0.000277,0.000191,7.5e-05,0.000289,0.000328,0.000301,0.000277,0.000227,6.6e-05,0.000126,-0.000253,0.000114,7.8e-05,0.000245,0.000306,-0.000215,0.000478,0.000184,0.000109,0.000114,0.000377,0.000133,0.000214,0.000435,0.000316,-0.000125,-4e-05,-0.00011,0.000391,0.000336,0.000433,0.000285,0.000453,0.000202,0.000308,0.00028,-0.00013,1.6e-05,0.000325,8.7e-05,0.000146,0.000488,0.000401,0.000101,0.000149,0.000307,0.000124,0.000325,0.000249,0.000465,0.000313,-0.000185
-0.000206,0.000116,-0.000247,-0.000161,-6.1e-05,-4.3e-05,-0.000425,-0.000173,-2.1e-05,3.5e-05,0.000107,-0.000239,0.00013,3.6e-05,-0.000223,3.8e-05,-0.000135,8e-06,-3.2e-05,0.000225,0.000393,0.000142,-5.4e-05,-2.6e-05,-8.1e-05,0.00013,-0.000104,-7.4e-05,0.000186,0.000202,2e-04,-7.1e-05,-0.000462,0.000181,0.000155,0.000432,9.3e-05,-0.000191,-0.000114,-0.00029,-0.000518,-0.000258,1.4e-05,-0.000174,-0.00013,-0.000123,-0.000307,-0.000118,-0.000231,3.8e-05,9.4e-05,-0.000111,8.1e-05,0.000293,-3.8e-05,-0.000257,-0.000112,-0.000218,-0.000116,-0.000174,-0.000328,3.3e-05,-0.000113,0.000283,-4.9e-05,0.000319,-0.000366,-0.000535,-0.000182,-0.000284,-0.000328,-0.000154,-0.000517,-0.000288,-0.000137,-9.9e-05,-0.000153,-0.000107,0.000176,-3.9e-05,-0.000125,9.6e-05,0.000256,-4e-06,3.3e-05,-9.5e-05,7.9e-05,4.6e-05,-0.000134,-0.000376,-0.000294,-0.000296,-0.000332,-0.000193,5.6e-05,0.000153,-7e-05,-0.000284,-0.000356,-9.1e-05,0.000185,-0.00019,-3.2e-05,-0.000117,-1e-05,1.5e-05,0.00021,-6.7e-05,-4.7e-05,3.6e-05,-0.000287,-0.000189,7.8e-05,-0.000141,-0.000297,-0.000209,-0.000213,-0.00028,-6.1e-05,2.6e-05,-0.000104
2.4e-05,-0.000233,-5e-06,-5.4e-05,-0.000152,-6e-05,-8.6e-05,6.5e-05,-0.000122,-1e-04,-0.000379,0.00012,-0.00019,-0.000155,0.000177,-8.9e-05,0.00026,-0.000144,-0.00026,-0.00037,-0.000295,-0.000105,2.5e-05,-0.000214,-4.3e-05,-0.000448,0.000117,0.000102,2.6e-05,-0.000132,-0.000115,0.000113,0.000407,-6.9e-05,-3.2e-05,-0.000279,-0.000403,0.000243,0.000229,-3.4e-05,8.4e-05,0.000116,0.000319,0.000324,0.000131,0.000159,0.000131,4.7e-05,-6.5e-05,9.5e-05,-1e-04,-1e-06,-0.000355,-7.8e-05,4.6e-05,0.000265,0.000216,-0.000166,-0.00014,-3e-05,0.000174,0.000165,0.000203,-0.00013,0.000165,-6.6e-05,8.4e-05,0.00044,0.000237,0.000256,2.1e-05,0.000127,0.00031,0.000129,0.000247,5.1e-05,6e-05,0.000261,-0.000204,0.000125,0.000125,-0.000282,-0.000424,-0.000192,-8.2e-05,-0.000289,-0.000181,-0.000289,1.8e-05,-0.000131,0.000161,-3.8e-05,1.6e-05,-6.3e-05,-0.000152,-0.000198,-6.3e-05,2.8e-05,0.000134,-0.000132,-0.000184,-8.3e-05,-0.000271,-4.7e-05,9.7e-05,-4.4e-05,-0.000126,-8e-05,-0.000124,-1.5e-05,6.2e-05,-6.1e-05,-5.6e-05,-0.000171,8.1e-05,3e-05,6.6e-05,-1.1e-05,-0.000124,-0.000115,-5.7e-05
-3e-06,0.000226,6.4e-05,0.00021,0.000109,-0.000133,5.5e-05,-7e-05,-0.000219,0.00012,0.000238,-8.7e-05,-9.2e-05,-6.4e-05,-0.000297,5.8e-05,-0.000277,-0.000124,4.7e-05,8.3e-05,1.4e-05,-0.000197,-0.000183,0.000274,0.000122,0.000222,4.5e-05,-4e-06,-6.6e-05,4.7e-05,-9.3e-05,-0.000151,-0.00015,-0.000117,-0.000189,-4.7e-05,0.00017,-0.000124,-0.000231,-0.000114,0.000129,7.9e-05,-7.7e-05,-0.000255,-0.000334,-0.000203,-9.2e-05,-0.000335,0.000101,-0.000231,-0.000312,-1.2e-05,8.8e-05,-0.000193,-0.000184,-0.000279,-4.9e-05,0.000103,2.2e-05,0.000188,5e-06,-0.000181,-0.000134,-5.2e-05,-4.7e-05,-7.8e-05,-1.5e-05,-0.000226,-6e-05,-0.000352,-7e-05,4e-05,-0.00018,-7.6e-05,-0.00015,8.7e-05,-0.00015,-0.000257,-4e-05,-0.000113,-0.000183,8.3e-05,0.000222,-3.2e-05,5e-06,0.000147,0.00013,0.000244,0.000135,-7e-06,-4.6e-05,-0.00017,-7e-05,8.4e-05,0.000111,0.000118,-5e-06,-7.2e-05,-0.000109,-0.00015,-0.000128,9.5e-05,0.000215,0.00012,-5.6e-05,-7e-06,-0.000187,1.9e-05,-8e-06,-6.6e-05,-0.000155,6.2e-05,-9e-06,-0.000184,-2.4e-05,7.5e-05,1.6e-05,1e-06,0.000118,1.8e-05,-2.2e-05
-7.2e-05,-0.000101,-0.000158,-4e-05,8.4e-05,5.5e-05,3.1e-05,7e-06,0.000162,-2.8e-05,-9.5e-05,2.4e-05,0.000189,0.000191,0.000205,-0.000144,0.000153,0.000105,-3.3e-05,3e-06,6.4e-05,0.000261,0.000371,-6e-06,-3.4e-05,-6.3e-05,-6.7e-05,-0.000297,3.7e-05,-2.5e-05,0.000255,9e-05,0.000141,0.00013,-5.6e-05,0.000169,3.1e-05,0.00025,0.000131,0.000148,0.000107,0.00024,-4e-06,0.000241,0.000207,7.6e-05,8e-05,0.000143,6.7e-05,0.000272,0.000287,8.7e-05,-3.3e-05,0.000315,0.00028,0.000257,-1.5e-05,1.9e-05,-0.000113,-0.000278,-0.000107,0.000101,-4.3e-05,4.7e-05,-0.00023,3.5e-05,-5.6e-05,0.00017,2.7e-05,0.00026,0.00036,-0.000107,0.000109,0.000233,6.4e-05,1.4e-05,0.00032,0.000213,0.000192,4e-05,-3.4e-05,2.3e-05,-0.000124,-0.000141,-8.4e-05,9e-05,2e-05,-7.2e-05,-0.000204,0.000114,-4.6e-05,-6e-06,0.000162,0.000233,-1.3e-05,0.000161,0.000101,-3e-06,0.000216,0.000205,1.4e-05,-7.2e-05,-1.6e-05,-0.000111,-7.2e-05,4.2e-05,0.000161,0.000129,1.8e-05,-1e-06,-6.1e-05,-2.7e-05,-7.6e-05,7.8e-05,2.4e-05,-8e-06,7.9e-05,6.8e-05,9.4e-05,0.000159,5.6e-05
-0.000135,7.1e-05,0.000124,-2.4e-05,-0.000148,-4e-05,4.8e-05,-1.9e-05,2.8e-05,-0.000218,4.1e-05,6e-06,5e-05,-5.8e-05,-0.000184,4.5e-05,-6.7e-05,-6e-06,-5.3e-05,-2.3e-05,-0.000101,-0.000117,-1e-06,-5e-06,-5.7e-05,9.6e-05,0.000149,0.000277,-1.5e-05,-0.000104,-0.000153,5e-05,-0.000112,3e-06,0.000399,8.5e-05,-0.000237,-0.000249,-0.00015,7e-06,-0.000213,-0.000271,-7e-05,5.5e-05,-0.00015,-5.1e-05,-0.000199,-0.00013,-1.3e-05,-0.000251,-0.000141,-0.00024,9e-05,-0.000234,-0.000186,2e-06,-0.000164,-8e-05,-3.1e-05,0.000177,7.2e-05,-4.4e-05,-9e-06,4.7e-05,0.000217,0.000137,8e-06,-2.4e-05,-0.000212,-0.000154,-0.000164,4.9e-05,-1e-05,-0.000102,-0.000145,-3.4e-05,-0.000121,-0.000109,-0.000102,9.2e-05,0.000396,0.000212,1e-05,0.000276,4.8e-05,-8.6e-05,-0.000106,-7.5e-05,5.3e-05,-6.4e-05,2.7e-05,0.000135,-8.8e-05,-0.000234,-7.2e-05,-0.000158,-0.000118,0.000122,9.8e-05,-5.8e-05,-0.00025,7.8e-05,1e-06,4.4e-05,2.5e-05,4.5e-05,7.5e-05,-0.000197,0.000164,0.000168,-2.3e-05,5.5e-05,-5.1e-05,-2.3e-05,0.000108,-5.9e-05,-8.9e-05,-0.000134,-0.000169,-0.000223,7.1e-05
3e-05,-0.000122,-2.3e-05,-0.000128,5.1e-05,-8e-06,6.8e-05,0.000194,3.1e-05,0.000105,6e-06,6.3e-05,-0.000104,-5.8e-05,-3.1e-05,-9.9e-05,-4.6e-05,-1e-04,9.1e-05,9.7e-05,8.2e-05,-0.000119,-0.000214,-0.000157,-8.7e-05,-1e-05,-0.000205,-0.000188,1.5e-05,2.9e-05,3.1e-05,-3.9e-05,5.3e-05,1e-06,-0.000262,-0.000135,0.000261,0.00011,-3.7e-05,2e-06,7.5e-05,8.9e-05,-0.000162,-0.000104,4.6e-05,-2.3e-05,0.000124,0.000212,-5.4e-05,0.000194,5.9e-05,-1.6e-05,-0.000114,-6.4e-05,-7.1e-05,-0.000239,0.000107,-0.000142,5.5e-05,9e-06,7.4e-05,0.000119,-1e-05,2.4e-05,-7e-06,-1.2e-05,0.000118,-0.000245,0.000243,7e-05,-3e-06,-8.3e-05,-9.1e-05,-0.000108,5.4e-05,-0.000134,-2.2e-05,8.5e-05,2.7e-05,-9.4e-05,-0.000234,-0.000203,-1.6e-05,-0.000268,-6.4e-05,0.000121,6.4e-05,7.5e-05,2.1e-05,-9.3e-05,-0.000124,-8.9e-05,0.000102,4.5e-05,2.1e-05,2e-06,5e-06,-6e-06,-7.8e-05,4.6e-05,0.000214,2.2e-05,5.1e-05,-9e-06,2.9e-05,-2.8e-05,-0.000192,2.8e-05,-0.000219,-0.000121,4.6e-05,-2e-05,0.000101,5e-05,-9.9e-05,-2e-06,1.8e-05,0.000125,3.6e-05,0.000121,-7e-05
1.6e-05,5.6e-05,-3e-05,7.4e-05,-8e-05,0.000105,-2.6e-05,-7.5e-05,-5.4e-05,-0.000133,-2.9e-05,-4.2e-05,7.1e-05,5.3e-05,-3e-06,0,6.8e-05,0.000105,3e-05,3.3e-05,3.5e-05,1.5e-05,3.5e-05,0.000116,8.3e-05,-3.1e-05,1.7e-05,9.3e-05,-6.2e-05,7.9e-05,4e-06,-2.7e-05,7e-06,-7.9e-05,0.000131,-4.8e-05,-0.000121,7.8e-05,5e-05,6e-06,-6.6e-05,-0.000115,5.8e-05,-0.000116,-5.6e-05,8.1e-05,-5.1e-05,-8.2e-05,6.4e-05,1e-06,3.5e-05,3.4e-05,-3.6e-05,4.5e-05,0.00014,0.000159,-5.8e-05,6.5e-05,-1e-06,-4.5e-05,-0.000104,-0.000157,-2.5e-05,-7.2e-05,-4.9e-05,-0.000148,-0.000129,0.000173,-0.000113,-1e-04,-0.000105,0.000125,5.9e-05,6.4e-05,-1e-05,-9e-06,4.4e-05,-5.5e-05,4.1e-05,5.1e-05,3.2e-05,1.5e-05,-3e-05,0.000127,9.9e-05,-1.5e-05,-1.4e-05,-1.4e-05,-6.5e-05,3.3e-05,0.000133,-7.4e-05,-6.3e-05,-2.3e-05,-1.2e-05,-1.1e-05,0.000123,3.6e-05,1e-05,-0.000139,-5.1e-05,1.2e-05,5e-06,3e-05,-0.000107,-5.1e-05,-1.3e-05,7.4e-05,0.000118,4e-05,-6.6e-05,-8.5e-05,-5.3e-05,-3.8e-05,1.2e-05,-0.000101,-7.9e-05,-8.2e-05,-1.8e-05,-4e-06,4.8e-05
7.2e-05,2.9e-05,7.8e-05,2.4e-05,7.8e-05,-3.6e-05,2.6e-05,7e-06,3.3e-05,0.000143,0,3e-05,3.8e-05,-3.7e-05,1.4e-05,2.1e-05,-2.3e-05,-5.9e-05,-7.1e-05,6e-06,-6e-06,4.3e-05,5.5e-05,-9.8e-05,-3.8e-05,-2.3e-05,2.2e-05,-0.000112,9e-06,-9.4e-05,-4.2e-05,5.8e-05,-2.1e-05,2.1e-05,-9.4e-05,6.5e-05,-4.9e-05,-0.00014,2.9e-05,5.6e-05,1.9e-05,6e-06,3.1e-05,2.7e-05,6.9e-05,-5.4e-05,4e-05,-1.4e-05,-0.000114,-0.000158,-1.9e-05,7e-05,0.000107,-6.6e-05,5.5e-05,-1e-05,2.6e-05,-5e-06,8e-06,-3.5e-05,5.1e-05,9.2e-05,7e-06,1.8e-05,5.5e-05,-3.8e-05,1.2e-05,9e-05,8.8e-05,6.6e-05,8e-05,-2.7e-05,3.4e-05,-1.2e-05,5.7e-05,8e-06,1.6e-05,9.6e-05,1.1e-05,1.8e-05,-6e-05,3.6e-05,0.000102,-1.1e-05,-3.1e-05,-4.6e-05,2.3e-05,-6.4e-05,0.00012,4e-05,2.6e-05,9.5e-05,8.1e-05,2e-06,-2.1e-05,5e-06,-3.8e-05,-4.2e-05,4.2e-05,7.2e-05,-1e-05,-4e-06,-2.3e-05,2e-05,5.7e-05,4.6e-05,-1.4e-05,-7e-05,2.5e-05,-1e-06,3.7e-05,-8.8e-05,2.3e-05,5.2e-05,-9.5e-05,3.1e-05,7.3e-05,7.7e-05,2.9e-05,1.6e-05,-6e-06
3.8e-05,-3.2e-05,-5.7e-05,-6.9e-05,-3e-06,1.3e-05,1.1e-05,-7.3e-05,-5e-05,3.5e-05,2.9e-05,-8.4e-05,-5e-05,-3.7e-05,3e-06,-2.5e-05,4.3e-05,3.7e-05,7.6e-05,9e-06,2.3e-05,6e-06,-5.4e-05,0.000108,2.8e-05,5e-05,-1.7e-05,5.7e-05,3e-05,3.8e-05,7.3e-05,-8.1e-05,-4e-05,4e-06,7e-05,-2.3e-05,0.000136,0.000121,-7e-06,-9.9e-05,-1e-06,3.7e-05,-1.5e-05,-1.1e-05,3.1e-05,-7.8e-05,-1.8e-05,4.9e-05,4.9e-05,5.4e-05,-4e-05,-3.7e-05,3.6e-05,0.000117,-6.8e-05,-3.1e-05,5.5e-05,2.1e-05,-5.6e-05,1.5e-05,2.5e-05,-5.2e-05,-5e-06,4.9e-05,-1.3e-05,0.000118,2.8e-05,-1.8e-05,-8.3e-05,2.4e-05,-9.7e-05,-1.2e-05,3e-05,7e-06,-2.6e-05,4.5e-05,2.2e-05,-0.000105,-0.000119,1.1e-05,3.7e-05,-4.9e-05,7e-06,-1.1e-05,-9e-06,-2.2e-05,-5.6e-05,9e-05,-7.3e-05,6.6e-05,-6e-06,0.000122,-6.3e-05,5.6e-05,-3e-06,-3.7e-05,1.5e-05,1.3e-05,-0.000128,-7.9e-05,-4.4e-05,1.5e-05,7.1e-05,7.4e-05,-5e-06,-1.9e-05,3e-06,1.6e-05,-0.000105,-3e-06,5.4e-05,2.6e-05,-7e-06,-2.1e-05,-6.2e-05,-2.4e-05,3.5e-05,7e-06,-4e-05,-4e-06,1.7e-05
-9.1e-05,0,6.8e-05,6.5e-05,-3.5e-05,-1.8e-05,-3.3e-05,2.6e-05,-1e-06,-3.5e-05,9e-05,3.3e-05,2.6e-05,-1.9e-05,-2.6e-05,4.8e-05,1.9e-05,-8e-06,-5.7e-05,-2.9e-05,-2.3e-05,-4e-05,6.2e-05,0,-4.1e-05,6e-06,9.5e-05,-3.3e-05,-7.2e-05,-1.4e-05,-8.1e-05,3.9e-05,5.2e-05,1e-05,-3.7e-05,2.7e-05,-2.1e-05,-5.1e-05,2.2e-05,4.8e-05,5e-06,-3.8e-05,-2.5e-05,4.6e-05,0,0.000109,1.6e-05,2.7e-05,6.9e-05,2.5e-05,0.000111,-1e-06,-7.8e-05,-8.2e-05,7.1e-05,9e-05,-5.6e-05,-4.4e-05,2.3e-05,-6.3e-05,-4.8e-05,3.4e-05,-7e-06,-6.4e-05,-3.1e-05,-8.3e-05,3.5e-05,-7e-06,1.6e-05,-2.1e-05,3.7e-05,-7e-05,-9.4e-05,3e-05,-1e-06,-1e-05,3.5e-05,-1.8e-05,7.4e-05,5e-06,-8e-06,4.8e-05,-7.2e-05,6.3e-05,1.6e-05,-1.5e-05,2.6e-05,-4.2e-05,-9e-06,-5.9e-05,2.6e-05,-0.00011,5.5e-05,1.9e-05,9e-06,-4e-06,1.2e-05,3e-05,3.7e-05,-1e-06,8.5e-05,2.3e-05,-0.000125,-4.3e-05,0,-2.4e-05,6.2e-05,-2e-05,6.4e-05,3.8e-05,-3.8e-05,-1.8e-05,-2.2e-05,-3.5e-05,2.9e-05,7e-06,-1.2e-05,-1e-05,2.6e-05,-2e-05,8e-06
9e-06,-5.6e-05,-5.3e-05,1e-06,5.5e-05,-1e-05,1.5e-05,-4.9e-05,6e-06,-4.1e-05,-2.3e-05,-1.8e-05,1e-05,8.2e-05,4.5e-05,-2.6e-05,1.3e-05,-2e-06,3.2e-05,1.2e-05,-1e-06,7.2e-05,-6e-06,-3.5e-05,2.1e-05,-3.7e-05,-4.3e-05,1e-05,7.4e-05,3e-05,2.6e-05,1.9e-05,2.7e-05,-1.4e-05,5e-05,3.9e-05,-6.2e-05,-5.6e-05,0,2.8e-05,2.5e-05,2.9e-05,1.8e-05,1.4e-05,2.1e-05,-4.9e-05,2.4e-05,-2.3e-05,-5.7e-05,3.8e-05,-6.2e-05,3.7e-05,4e-05,8.2e-05,-3.5e-05,-5e-05,2.3e-05,3.5e-05,-1.6e-05,-7e-06,-1.1e-05,-3.8e-05,-1e-06,3e-05,-2e-06,-1.8e-05,-2.8e-05,1.2e-05,4.7e-05,-3.1e-05,3.7e-05,7.2e-05,5.9e-05,-7e-06,3.1e-05,-3.8e-05,-4.6e-05,2e-05,-1.4e-05,0,-7e-06,1.3e-05,-4e-06,-3.8e-05,-1.8e-05,1.5e-05,-0.000108,-1e-06,2.8e-05,-5e-06,-6.1e-05,1.5e-05,-3.2e-05,-3.3e-05,-1e-05,1.3e-05,-5.3e-05,-4.4e-05,6.3e-05,3.1e-05,-6.7e-05,1e-06,3.7e-05,2e-06,3.8e-05,3e-06,-7.6e-05,-3.4e-05,2e-06,-4e-06,-1e-05,-3.3e-05,8e-06,-1.2e-05,3.3e-05,2e-05,-1e-06,-9e-06,-2.5e-05,3.1e-05,-1.1e-05
2.4e-05,3.6e-05,4.4e-05,4e-06,-3.8e-05,3.3e-05,-1.6e-05,4.1e-05,5.1e-05,3.3e-05,-5e-06,1.1e-05,-4.9e-05,-8.4e-05,-6.2e-05,-1.3e-05,2.1e-05,1e-05,-3e-06,-2.8e-05,0,-3.5e-05,3.4e-05,1.1e-05,-3.8e-05,-2.3e-05,-2.3e-05,2.2e-05,-5.3e-05,-3.2e-05,4e-06,-2.2e-05,-6e-06,-9e-06,-3.7e-05,-2e-05,8e-06,7.7e-05,-6.6e-05,-5.3e-05,-3.9e-05,-1.3e-05,-6e-06,-1.2e-05,-3.1e-05,8e-06,4e-06,-8e-06,4.1e-05,-3.7e-05,1.8e-05,-1.3e-05,-2.6e-05,-3.1e-05,-9e-06,-2.5e-05,-3.3e-05,-1.9e-05,5.4e-05,-8e-06,1.9e-05,1.9e-05,-1.1e-05,-4.1e-05,7e-06,4.9e-05,2.6e-05,-3.1e-05,-1e-06,3.4e-05,-1.1e-05,-3.3e-05,-4.3e-05,6e-06,-3.6e-05,8.4e-05,-3.7e-05,-3.4e-05,-2.2e-05,-1.1e-05,-3.2e-05,6e-06,1.5e-05,-1.9e-05,2.9e-05,-5.1e-05,1.8e-05,-2.1e-05,-1.9e-05,2.6e-05,4.3e-05,-4.4e-05,-1.7e-05,1e-05,4e-06,1.1e-05,4.7e-05,-2.8e-05,-3.8e-05,-2.3e-05,2.5e-05,-6e-06,-3e-06,1e-06,-2.7e-05,1.3e-05,3.2e-05,9e-06,-1.6e-05,-8e-06,-1.4e-05,4.6e-05,4.3e-05,1.2e-05,-4.9e-05,-1.1e-05,4e-06,1.9e-05,2.5e-05,-9e-06,-2e-06
-6.1e-05,-3e-06,-2.3e-05,-2.1e-05,3e-05,-8e-06,9e-06,-1.7e-05,1.5e-05,-5.6e-05,-1.9e-05,-1e-05,5.8e-05,3.5e-05,5e-06,4e-06,-1.1e-05,-8e-06,9e-06,2e-06,1.7e-05,-2.1e-05,1.8e-05,1e-06,1.3e-05,2.6e-05,2.1e-05,2e-06,3.4e-05,1.2e-05,1.6e-05,1.5e-05,-6e-06,2.5e-05,1.7e-05,1e-05,3.7e-05,-4.9e-05,4.1e-05,-3.9e-05,-1.4e-05,1e-05,5.4e-05,2.7e-05,-1e-06,3e-06,-2.7e-05,-1e-06,2e-06,-2e-06,2e-06,-4.8e-05,1.8e-05,-1.8e-05,1.3e-05,-4e-06,2e-06,1.1e-05,-4.9e-05,2.3e-05,1.3e-05,5e-06,6e-06,2.5e-05,1.9e-05,-2.1e-05,-1.5e-05,-6e-06,0,-7e-06,1e-05,6.7e-05,2.5e-05,-1.6e-05,3e-06,-4.5e-05,0,2.9e-05,-2.5e-05,-9e-06,2.1e-05,-8e-06,-5e-06,2.6e-05,-2.1e-05,4.8e-05,4.8e-05,3.5e-05,-5e-06,-1.8e-05,-8e-06,1.2e-05,2e-06,-5.1e-05,-1.3e-05,-7e-06,2.2e-05,5e-06,2.4e-05,2e-05,-2.5e-05,2e-05,1.6e-05,-6e-06,-2.3e-05,-3e-06,-2.4e-05,2.7e-05,-2e-06,-2e-06,2e-06,9e-06,1.6e-05,7e-06,2.7e-05,1.1e-05,8e-06,-2.2e-05,-2.1e-05,1e-05,1.2e-05
8e-05,1e-05,3e-06,-7e-06,-3.7e-05,-4e-06,4e-06,0,-4.4e-05,3.4e-05,2e-06,-2e-05,-4.3e-05,1.3e-05,4e-06,2.4e-05,0,1e-06,-1e-05,1.1e-05,-2e-06,2.2e-05,-1.8e-05,-4e-05,1.1e-05,-1.3e-05,-1.4e-05,-3.4e-05,-3e-05,1.6e-05,-2e-05,-1.3e-05,-6e-06,-8e-06,-4.1e-05,-2.4e-05,-2.8e-05,2.5e-05,-3.3e-05,4.5e-05,2e-05,-2e-06,-4.2e-05,1.2e-05,1e-06,8e-06,-1.1e-05,1.2e-05,-2e-06,-2.2e-05,-1.5e-05,4.1e-05,1e-06,2e-06,-3.3e-05,3.1e-05,9e-06,-1.7e-05,1.9e-05,4e-06,-5e-06,-1.3e-05,-6e-06,-1e-05,-2.1e-05,2.7e-05,1.8e-05,-2e-05,-6.2e-05,1e-06,1.1e-05,-2.6e-05,-3e-06,2.3e-05,4e-06,3.9e-05,-2e-06,-1.4e-05,2.6e-05,8e-06,0,-8e-06,7e-06,-3e-05,4e-06,-1.2e-05,-1e-06,-1.5e-05,3.4e-05,-2e-06,-3e-06,3.1e-05,2e-06,1.7e-05,8e-06,-2e-06,-5e-06,-2e-06,-3e-06,-6e-06,3.7e-05,-1.3e-05,-2.9e-05,-1e-06,-1.5e-05,4e-06,-7e-06,-9e-06,8e-06,0,9e-06,-8e-06,-6e-06,-1.3e-05,2.9e-05,8e-06,-5e-06,1.5e-05,1.8e-05,1.7e-05,0
-1e-05,-1e-06,-1.2e-05,8e-06,2.7e-05,0,-3e-06,8e-06,0,2.6e-05,-3e-06,1.5e-05,1.9e-05,-2.6e-05,-1.2e-05,-2.3e-05,-4e-06,8e-06,1e-05,-1.9e-05,0,-2.9e-05,2.4e-05,1.1e-05,-2e-06,-9e-06,-1.3e-05,8e-06,7e-06,-1.5e-05,2e-05,1e-05,-1.3e-05,-1.1e-05,3.9e-05,4e-06,6e-06,-7e-06,2.4e-05,-5e-06,-1.3e-05,-1.7e-05,-3e-06,-1e-06,2e-06,-2.5e-05,1.4e-05,-5e-06,-1.4e-05,-1.2e-05,2.1e-05,-1e-06,-8e-06,-7e-06,2e-05,-3.7e-05,0,1e-05,-1.9e-05,1.5e-05,3.3e-05,1.8e-05,8e-06,-3e-06,4e-06,-1.8e-05,-4e-06,2.1e-05,1.6e-05,-9e-06,0,1.8e-05,8e-06,-3e-05,-9e-06,-5.6e-05,-5e-06,-1.2e-05,1.3e-05,4e-06,1.2e-05,8e-06,1.8e-05,3.2e-05,6e-06,1.9e-05,3.3e-05,1.7e-05,-2.6e-05,-1e-05,1.3e-05,-3.9e-05,0,-3.7e-05,-9e-06,8e-06,2e-06,1e-06,7e-06,-2e-06,6e-06,-8e-06,1.5e-05,-7e-06,5e-06,-1e-06,5e-06,-5e-06,-1.7e-05,1.8e-05,-1.6e-05,1e-06,-5e-06,-8e-06,-1.6e-05,0,9e-06,-1e-05,0,2e-06,3e-06
-1.8e-05,3e-06,9e-06,-7e-06,-6e-06,-1.6e-05,-7e-06,1.1e-05,1.2e-05,0,1e-05,-4e-06,-1.2e-05,1.7e-05,3.2e-05,1.1e-05,-3e-06,-5e-06,0,3e-06,-3e-06,2.6e-05,-2.8e-05,1.2e-05,6e-06,0,2.3e-05,-1.6e-05,9e-06,1e-06,8e-06,5e-06,4e-06,-3e-06,-1.7e-05,-7e-06,2.1e-05,-1.1e-05,1.1e-05,-4e-06,-1.2e-05,7e-06,1.7e-05,-8e-06,7e-06,2e-05,-5e-06,-2e-06,0,1.9e-05,-1.8e-05,-1.3e-05,-4e-06,1.9e-05,-2e-05,1.4e-05,-4e-06,5e-06,1.8e-05,-1.8e-05,-1.2e-05,-1.2e-05,-4e-06,-5e-06,1.1e-05,-6e-06,-3e-06,2e-05,7e-06,4e-06,-5e-06,-3e-05,-4e-06,1.4e-05,2.1e-05,1.8e-05,-5e-06,1.1e-05,-8e-06,-1.6e-05,-9e-06,-1.4e-05,-1.5e-05,-2e-06,-1.4e-05,-1.5e-05,-4.5e-05,-2e-06,1e-06,1.8e-05,-2.2e-05,2.5e-05,-8e-06,2.9e-05,5e-06,-9e-06,-1.1e-05,-1.4e-05,2e-06,-3e-06,-4e-06,3e-06,0,4e-06,5e-06,5e-06,-2.2e-05,3e-06,2.8e-05,-2.1e-05,1.8e-05,-5e-06,4e-06,8e-06,-7e-06,-1.9e-05,4e-06,1.2e-05,-7e-06,-5e-06,-2e-06
8e-06,-7e-06,-1.9e-05,-6e-06,-6e-06,8e-06,4e-06,0,3e-06,-9e-06,-1.4e-05,6e-06,6e-06,-1.2e-05,-2.2e-05,-1.4e-05,-2e-06,-4e-06,-3e-06,-2e-06,1e-06,-1e-05,2e-06,-5e-06,-7e-06,-5e-06,-1.2e-05,1.3e-05,-3e-06,1e-06,-8e-06,-9e-06,2e-06,6e-06,-3e-06,-1e-06,-2.6e-05,2.3e-05,-1.4e-05,-8e-06,4e-06,-7e-06,-2.2e-05,-1e-05,-2e-06,3e-06,4e-06,-2e-06,-4e-06,2e-06,1e-05,1.3e-05,1.1e-05,-4e-06,-3e-06,-1.1e-05,2e-06,-1.8e-05,-1e-06,1.1e-05,2e-06,9e-06,-4e-06,7e-06,-1.3e-05,3e-06,5e-06,-3e-05,2e-06,1.1e-05,-9e-06,6e-06,-5e-06,-1.2e-05,-1.2e-05,2e-06,7e-06,5e-06,8e-06,5e-06,-4e-06,2e-06,-1.3e-05,-1.7e-05,1.6e-05,1.7e-05,3.6e-05,3e-06,1.3e-05,-3e-06,1.1e-05,-2e-06,8e-06,6e-06,3e-06,-4e-06,8e-06,-6e-06,-1e-05,-1e-05,-8e-06,-5e-06,-1e-05,-5e-06,4e-06,-1e-06,1.3e-05,-6e-06,-2.6e-05,9e-06,-6e-06,-6e-06,-4e-06,-4e-06,3e-06,1e-05,4e-06,-5e-06,1e-06,-1.2e-05,-4e-06
-1.5e-05,-2e-06,1.5e-05,1.9e-05,6e-06,-1e-06,1e-06,-2e-06,-7e-06,2e-06,1e-06,3e-06,-6e-06,7e-06,3e-06,1.3e-05,0,-2e-06,6e-06,-1e-06,3e-06,-3e-06,0,5e-06,-7e-06,6e-06,1.6e-05,0,0,-2e-06,5e-06,-1e-06,-1e-06,4e-06,-4e-06,1e-06,1e-05,-2.5e-05,1.3e-05,4e-06,2e-06,6e-06,1e-05,-1e-06,4e-06,3e-06,2e-06,-6e-06,-3e-06,-5e-06,-6e-06,-1.1e-05,4e-06,6e-06,8e-06,9e-06,6e-06,6e-06,1e-06,3e-06,1.4e-05,-7e-06,1e-06,4e-06,1.1e-05,3e-06,2e-06,-1e-06,1.7e-05,-1.2e-05,-1e-06,-6e-06,5e-06,1.4e-05,3e-06,-1.1e-05,2e-06,1e-05,-2e-06,6e-06,1.6e-05,-3e-06,1e-06,1.3e-05,-6e-06,-2e-06,-1.8e-05,-8e-06,-1.1e-05,-1.1e-05,-6e-06,-4e-06,-3e-06,-7e-06,-2e-06,-1e-06,-1e-05,1.1e-05,-6e-06,1.1e-05,-1e-06,1e-06,2e-06,-4e-06,6e-06,1e-06,8e-06,-5e-06,8e-06,-1e-05,-1.3e-05,-5e-06,1.5e-05,-1e-06,-1.5e-05,-3e-06,-7e-06,5e-06,1e-06,0,7e-06
3e-06,0,-1.5e-05,-7e-06,-4e-06,2e-06,-5e-06,4e-06,-1.6e-05,-2.1e-05,8e-06,-2e-06,1.1e-05,8e-06,-5e-06,-1e-06,-5e-06,-2e-06,2e-06,7e-06,-3e-06,-2e-06,-1e-05,8e-06,2e-06,-2e-06,-5e-06,-2e-06,1e-06,-2e-06,0,2e-06,1e-06,-5e-06,-5e-06,6e-06,9e-06,1.7e-05,-1.8e-05,1.6e-05,-3e-06,-2e-06,0,4e-06,-4e-06,-1.5e-05,-4e-06,7e-06,-1e-06,-1e-06,5e-06,8e-06,-1.2e-05,-3e-06,-1e-05,4e-06,-1.3e-05,-1e-06,-1.4e-05,-1e-06,-1.7e-05,7e-06,1e-06,-4e-06,2e-06,-1e-06,0,0,-2e-05,6e-06,6e-06,1.8e-05,-4e-06,-1.1e-05,-3e-06,9e-06,-3e-06,2e-06,9e-06,-7e-06,-5e-06,5e-06,-2e-06,0,-5e-06,-3e-06,5e-06,9e-06,-1e-06,8e-06,4e-06,-2e-06,3e-06,7e-06,1e-06,7e-06,2e-06,-1e-06,-1e-06,-1.2e-05,6e-06,-2e-06,5e-06,0,-1e-05,-3e-06,-9e-06,8e-06,5e-06,8e-06,7e-06,-1e-06,-6e-06,0,-3e-06,-1e-06,-5e-06,-1e-06,-1e-06,4e-06,-5e-06
1.6e-05,2e-06,9e-06,2e-06,7e-06,0,5e-06,-8e-06,1.2e-05,7e-06,-3e-06,3e-06,-1.2e-05,-2e-05,-9e-06,-5e-06,-2e-06,3e-06,-6e-06,0,2e-06,8e-06,1.3e-05,-4e-06,-7e-06,-8e-06,-1.2e-05,-4e-06,-4e-06,4e-06,2e-06,-2e-06,5e-06,0,1.3e-05,5e-06,-1.1e-05,-9e-06,0,-9e-06,-3e-06,1e-06,1.2e-05,-1e-06,-3e-06,1.2e-05,-2e-06,1e-06,7e-06,5e-06,-5e-06,-6e-06,0,-2e-06,7e-06,-1e-05,8e-06,-4e-06,1e-05,-7e-06,8e-06,-8e-06,-1e-06,-3e-06,-9e-06,-9e-06,-2e-06,-2e-05,-4e-06,-4e-06,-1.3e-05,-1.4e-05,-1e-06,1.1e-05,-5e-06,3e-06,5e-06,-4e-06,-9e-06,-1e-06,-2e-06,-4e-06,1.3e-05,-4e-06,6e-06,7e-06,1e-05,-5e-06,1.1e-05,-2e-06,1e-06,-1e-05,-2e-06,3e-06,-4e-06,-6e-06,4e-06,2e-06,-6e-06,4e-06,3e-06,-5e-06,1e-06,-1e-06,-2e-06,-1e-06,4e-06,0,-9e-06,4e-06,5e-06,-8e-06,4e-06,-3e-06,6e-06,9e-06,6e-06,-1e-06,-4e-06,1e-06,1e-06
-8e-06,1e-06,-1.1e-05,-3e-06,-9e-06,-7e-06,-1e-06,6e-06,2e-06,9e-06,-5e-06,0,7e-06,1.7e-05,1e-05,3e-06,-2e-06,-2e-06,6e-06,-5e-06,0,-6e-06,-4e-06,-1.5e-05,5e-06,2e-06,1e-06,0,4e-06,1e-06,-3e-06,2e-06,0,2e-06,-6e-06,-1e-06,-5e-06,1e-06,4e-06,-6e-06,-1e-06,8e-06,-5e-06,3e-06,1e-06,-8e-06,-1e-06,-4e-06,-3e-06,1e-06,2e-06,-3e-06,7e-06,-3e-06,-1e-06,7e-06,0,0,-2e-06,-1e-06,-4e-06,6e-06,1e-06,4e-06,2e-06,7e-06,4e-06,1.1e-05,1e-06,6e-06,9e-06,8e-06,4e-06,-5e-06,3e-06,3e-06,1e-06,-9e-06,7e-06,8e-06,-4e-06,3e-06,3e-06,6e-06,-3e-06,-1.3e-05,-1.1e-05,4e-06,-7e-06,3e-06,-5e-06,1.6e-05,1e-06,-1.5e-05,1e-06,6e-06,-7e-06,-3e-06,-6e-06,-3e-06,3e-06,4e-06,-4e-06,3e-06,1e-06,-1e-06,-7e-06,-6e-06,6e-06,-1.2e-05,-5e-06,-1e-06,-8e-06,6e-06,-7e-06,-6e-06,-1e-06,1e-06,3e-06,0,0
1.1e-05,-2e-06,7e-06,-2e-06,7e-06,6e-06,-1e-06,-6e-06,-4e-06,-2e-06,-5e-06,-2e-06,0,-9e-06,-7e-06,-5e-06,0,-1e-06,-3e-06,5e-06,-2e-06,-3e-06,0,1.3e-05,-2e-06,6e-06,0,2e-06,-4e-06,-3e-06,-1e-06,-1e-06,-3e-06,1e-06,0,-2e-06,1.8e-05,1.1e-05,0,7e-06,1e-06,-7e-06,5e-06,4e-06,-1e-06,4e-06,2e-06,-2e-06,2e-06,3e-06,-4e-06,9e-06,2e-06,1e-06,-5e-06,-2e-06,-4e-06,-1e-06,1e-05,-9e-06,-2e-06,-5e-06,-4e-06,0,3e-06,1e-06,0,1e-06,5e-06,-3e-06,9e-06,-1.3e-05,-3e-06,6e-06,2e-06,-5e-06,2e-06,1e-06,-5e-06,-2e-06,1e-06,0,-1e-05,-1e-05,0,8e-06,9e-06,-5e-06,1e-06,-4e-06,0,1e-06,3e-06,1.1e-05,-1e-06,-2e-06,2e-06,2e-06,1.3e-05,1e-06,-2e-06,-3e-06,-9e-06,1e-06,-3e-06,0,-1e-06,1e-06,0,7e-06,0,1.4e-05,3e-06,-8e-06,2e-06,7e-06,-3e-06,-4e-06,2e-06,-2e-06,-1e-06
-1.1e-05,-1e-06,-5e-06,0,-4e-06,-5e-06,2e-06,5e-06,-2e-06,5e-06,4e-06,3e-06,-2e-06,-1e-06,7e-06,6e-06,-1e-06,1e-06,4e-06,-2e-06,-1e-06,6e-06,4e-06,-6e-06,1e-06,-4e-06,-2e-06,2e-06,2e-06,-1e-06,2e-06,-1e-06,2e-06,-2e-06,-3e-06,-5e-06,-5e-06,-1.7e-05,7e-06,1e-06,0,1e-06,-1.3e-05,-2e-06,2e-06,2e-06,-3e-06,1e-06,2e-06,-1e-05,0,-2e-06,-7e-06,1e-06,7e-06,-4e-06,6e-06,2e-06,-7e-06,5e-06,3e-06,3e-06,4e-06,1e-06,-6e-06,0,0,4e-06,8e-06,-4e-06,-5e-06,1.1e-05,3e-06,-9e-06,1e-06,2e-06,0,0,-5e-06,-2e-06,4e-06,3e-06,-3e-06,7e-06,1e-06,-1.1e-05,-2e-05,6e-06,6e-06,0,1e-06,-4e-06,-1e-06,-9e-06,-1e-06,5e-06,-3e-06,9e-06,-5e-06,4e-06,-5e-06,1e-06,1.3e-05,0,1e-06,0,6e-06,3e-06,-4e-06,-5e-06,0,-3e-06,1e-06,-1e-06,1.1e-05,-2e-06,2e-06,2e-06,-3e-06,0,1e-06
-6e-06,-2e-06,6e-06,-5e-06,2e-06,5e-06,0,-6e-06,-2e-06,0,4e-06,-3e-06,3e-06,8e-06,-5e-06,-6e-06,0,-2e-06,-2e-06,2e-06,0,-1e-05,-8e-06,1e-06,1e-06,-1e-06,9e-06,-6e-06,-1e-06,1e-06,-3e-06,3e-06,-3e-06,-1e-06,5e-06,2e-06,-1.4e-05,1.4e-05,-3e-06,-1e-06,-3e-06,-4e-06,8e-06,2e-06,0,-1e-06,1e-06,3e-06,-4e-06,0,5e-06,-7e-06,1e-06,0,-4e-06,4e-06,-3e-06,-3e-06,0,1e-06,-5e-06,-1e-06,-1e-06,-4e-06,6e-06,2e-06,-1e-06,7e-06,-5e-06,6e-06,1e-06,-7e-06,-3e-06,5e-06,0,-7e-06,1e-06,-5e-06,1e-06,7e-06,-1e-06,-4e-06,0,2e-06,-3e-06,1.1e-05,3e-06,-7e-06,-8e-06,6e-06,-1e-06,-7e-06,2e-06,1e-05,0,-8e-06,0,-2e-06,1e-06,-6e-06,0,2e-06,-6e-06,0,3e-06,0,-1e-05,-4e-06,3e-06,4e-06,0,-3e-06,3e-06,4e-06,-2e-06,0,3e-06,-3e-06,1e-06,-2e-06,-1e-06
4e-06,3e-06,-4e-06,2e-06,-1e-06,0,0,3e-06,6e-06,-1.2e-05,-2e-06,1e-06,-2e-06,-6e-06,2e-06,8e-06,2e-06,0,-2e-06,0,0,8e-06,0,4e-06,-4e-06,1e-06,-5e-06,-2e-06,0,0,7e-06,-2e-06,-2e-06,1e-06,3e-06,-3e-06,1.3e-05,-6e-06,0,1e-06,1e-06,0,-1e-05,-3e-06,-1e-06,-3e-06,0,-2e-06,-1e-06,1e-06,-6e-06,4e-06,3e-06,4e-06,4e-06,-2e-06,1e-06,-5e-06,-2e-06,0,5e-06,0,-2e-06,2e-06,-2e-06,-6e-06,1e-06,-1e-05,-3e-06,-4e-06,1e-06,9e-06,1e-06,-3e-06,-1e-06,7e-06,0,4e-06,0,-2e-06,-4e-06,0,0,-6e-06,3e-06,-1e-05,6e-06,6e-06,2e-06,-4e-06,0,6e-06,-4e-06,-4e-06,-1e-06,4e-06,0,-4e-06,4e-06,5e-06,6e-06,-2e-06,2e-06,1e-06,1e-06,1e-06,4e-06,1e-06,1e-06,1e-06,0,4e-06,-2e-06,-4e-06,-3e-06,-3e-06,-3e-06,2e-06,1e-06,-1e-06,-1e-06
1e-06,-1e-06,5e-06,5e-06,-1e-06,-2e-06,0,-2e-06,-4e-06,1e-06,-2e-06,0,1e-06,3e-06,-6e-06,-9e-06,0,0,2e-06,-3e-06,-1e-06,-3e-06,-2e-06,3e-06,1e-06,0,3e-06,0,2e-06,0,-5e-06,1e-06,2e-06,-1e-06,2e-06,2e-06,-1e-06,-3e-06,-5e-06,-4e-06,2e-06,1e-06,7e-06,-3e-06,0,-1e-06,0,-2e-06,-1e-06,3e-06,5e-06,0,1e-06,-4e-06,1e-06,1e-06,1e-06,5e-06,4e-06,2e-06,-3e-06,1e-06,2e-06,0,2e-06,4e-06,-2e-06,0,-5e-06,4e-06,0,-7e-06,-1e-06,2e-06,-3e-06,-8e-06,-2e-06,-5e-06,2e-06,-2e-06,2e-06,1e-06,6e-06,2e-06,-1e-06,7e-06,6e-06,-4e-06,3e-06,1e-06,0,3e-06,3e-06,1e-06,-1e-06,-2e-06,-3e-06,-1e-06,3e-06,-4e-06,-1e-06,2e-06,-4e-06,0,-1e-06,-1e-06,1e-06,2e-06,-5e-06,-6e-06,0,-4e-06,-1e-06,3e-06,0,0,-2e-06,-3e-06,0,3e-06,2e-06
6e-06,1e-06,-3e-06,-3e-06,3e-06,1e-06,1e-06,5e-06,-1e-06,4e-06,0,-2e-06,1e-06,-2e-06,-3e-06,7e-06,0,-1e-06,-3e-06,1e-06,1e-06,-2e-06,-6e-06,-8e-06,-1e-06,0,1e-06,-1e-06,-2e-06,1e-06,4e-06,0,1e-06,0,-7e-06,0,-7e-06,7e-06,1e-06,-1e-06,-3e-06,-3e-06,1e-06,1e-06,-1e-06,6e-06,0,1e-06,0,4e-06,-5e-06,-2e-06,-3e-06,4e-06,-3e-06,3e-06,-2e-06,-4e-06,0,3e-06,1e-06,-2e-06,-1e-06,0,-2e-06,0,2e-06,4e-06,1e-05,-5e-06,-2e-06,5e-06,2e-06,-1e-06,0,7e-06,0,2e-06,-5e-06,5e-06,0,-1e-06,1e-06,0,0,-1e-06,4e-06,3e-06,-4e-06,-1e-06,-2e-06,-7e-06,-1e-06,3e-06,-1e-06,2e-06,2e-06,1e-06,-1e-06,2e-06,-1e-06,2e-06,3e-06,0,0,1e-06,-2e-06,-1e-06,7e-06,4e-06,3e-06,-2e-06,-4e-06,-3e-06,-2e-06,2e-06,1e-06,2e-06,-2e-06,1e-06,-2e-06
-2e-06,1e-06,3e-06,3e-06,-3e-06,-2e-06,-1e-06,-4e-06,3e-06,-1e-06,2e-06,2e-06,-1e-06,2e-06,9e-06,-5e-06,0,0,5e-06,2e-06,-1e-06,2e-06,4e-06,7e-06,-1e-06,0,-5e-06,5e-06,3e-06,0,-1e-06,-1e-06,1e-06,0,5e-06,5e-06,6e-06,-7e-06,-1e-06,3e-06,1e-06,5e-06,2e-06,-2e-06,0,-1e-06,-2e-06,1e-06,0,-8e-06,4e-06,1e-06,2e-06,-6e-06,4e-06,-4e-06,0,-2e-06,0,-2e-06,2e-06,3e-06,1e-06,-1e-06,0,-2e-06,0,-6e-06,4e-06,2e-06,-4e-06,-8e-06,-3e-06,2e-06,1e-06,-3e-06,-1e-06,6e-06,6e-06,-1e-06,3e-06,-1e-06,-3e-06,0,1e-06,1e-06,-6e-06,-3e-06,2e-06,1e-06,3e-06,5e-06,-2e-06,-8e-06,0,-4e-06,-2e-06,3e-06,-2e-06,-1e-06,-3e-06,-2e-06,1e-06,1e-06,-4e-06,-1e-06,3e-06,-1e-06,-7e-06,0,-2e-06,-2e-06,3e-06,0,-2e-06,-1e-06,0,-2e-06,2e-06,-1e-06,0
-1e-06,-1e-06,0,-2e-06,2e-06,2e-06,1e-06,2e-06,0,6e-06,-1e-06,-1e-06,-1e-06,1e-06,-6e-06,3e-06,0,0,-6e-06,-3e-06,-1e-06,0,-2e-06,-3e-06,0,-2e-06,0,-4e-06,-2e-06,-1e-06,1e-06,1e-06,0,0,-2e-06,0,1e-06,6e-06,1e-06,1e-06,0,0,-1e-06,1e-06,0,-2e-06,1e-06,1e-06,2e-06,3e-06,-1e-06,2e-06,-3e-06,2e-06,-2e-06,2e-06,1e-06,0,-2e-06,2e-06,-4e-06,-3e-06,0,0,2e-06,1e-06,0,7e-06,-5e-06,2e-06,2e-06,6e-06,1e-06,0,-1e-06,2e-06,-1e-06,-2e-06,1e-06,-4e-06,-3e-06,0,-2e-06,3e-06,-3e-06,1e-06,-3e-06,3e-06,2e-06,1e-06,-3e-06,-4e-06,1e-06,3e-06,0,4e-06,1e-06,-4e-06,1e-06,-2e-06,4e-06,2e-06,-3e-06,0,-2e-06,1e-06,-6e-06,0,2e-06,-1e-06,-2e-06,-1e-06,-1e-06,3e-06,-1e-06,4e-06,0,1e-06,1e-06,-2e-06,0
-1e-06,-1e-06,1e-06,-2e-06,-2e-06,0,0,0,0,-1e-06,-2e-06,0,2e-06,-3e-06,3e-06,-4e-06,-1e-06,0,3e-06,1e-06,2e-06,-1e-06,2e-06,-4e-06,-1e-06,1e-06,0,-1e-06,1e-06,0,-1e-06,-1e-06,0,0,5e-06,0,-7e-06,-3e-06,4e-06,-2e-06,0,1e-06,-3e-06,2e-06,0,2e-06,0,-1e-06,2e-06,-2e-06,-1e-06,0,5e-06,-1e-06,0,-3e-06,0,1e-06,0,-1e-06,2e-06,2e-06,-2e-06,1e-06,-3e-06,-2e-06,-1e-06,4e-06,-1e-06,-3e-06,3e-06,-5e-06,1e-06,-1e-06,4e-06,0,1e-06,5e-06,0,4e-06,-1e-06,1e-06,-2e-06,-4e-06,4e-06,-2e-06,0,-3e-06,-4e-06,-4e-06,2e-06,4e-06,-1e-06,1e-06,0,0,1e-06,-3e-06,-3e-06,3e-06,0,0,4e-06,0,2e-06,-1e-06,1e-06,0,1e-06,4e-06,3e-06,2e-06,3e-06,-4e-06,-1e-06,-3e-06,-1e-06,-2e-06,-1e-06,-1e-06,0
-4e-06,0,0,0,2e-06,-1e-06,0,0,-2e-06,-5e-06,0,1e-06,-1e-06,3e-06,-4e-06,1e-06,0,1e-06,-2e-06,-1e-06,0,-1e-06,4e-06,3e-06,1e-06,0,-1e-06,-2e-06,0,0,-1e-06,0,-1e-06,0,-5e-06,-3e-06,5e-06,0,-3e-06,-2e-06,-1e-06,-1e-06,0,0,1e-06,-2e-06,0,-1e-06,0,2e-06,2e-06,-1e-06,-4e-06,0,1e-06,2e-06,-1e-06,-2e-06,1e-06,-2e-06,-1e-06,-3e-06,1e-06,0,1e-06,3e-06,0,-3e-06,-6e-06,2e-06,-2e-06,7e-06,-2e-06,0,-2e-06,1e-06,0,0,0,-1e-06,2e-06,0,1e-06,1e-06,-2e-06,4e-06,1e-06,2e-06,2e-06,3e-06,-1e-06,0,1e-06,-4e-06,-1e-06,0,-1e-06,1e-06,2e-06,-2e-06,-2e-06,-1e-06,-2e-06,-1e-06,1e-06,0,2e-06,1e-06,-1e-06,-7e-06,0,1e-06,-3e-06,1e-06,2e-06,3e-06,1e-06,1e-06,0,2e-06,0
6e-06,0,0,-2e-06,-1e-06,1e-06,1e-06,-1e-06,2e-06,-1e-06,2e-06,-1e-06,-1e-06,-1e-06,1e-06,1e-06,1e-06,-1e-06,0,1e-06,0,3e-06,-3e-06,5e-06,-2e-06,-1e-06,3e-06,2e-06,-2e-06,0,2e-06,0,-1e-06,1e-06,-1e-06,2e-06,5e-06,2e-06,3e-06,2e-06,-1e-06,-2e-06,-2e-06,1e-06,-1e-06,-1e-06,1e-06,0,0,2e-06,-1e-06,-1e-06,1e-06,4e-06,-2e-06,0,1e-06,-2e-06,1e-06,0,-2e-06,2e-06,0,-1e-06,2e-06,-1e-06,0,0,4e-06,-2e-06,2e-06,-5e-06,-1e-06,-1e-06,0,-1e-06,0,-2e-06,1e-06,-3e-06,0,0,4e-06,2e-06,-1e-06,-6e-06,2e-06,-2e-06,1e-06,0,0,-6e-06,-2e-06,5e-06,0,-2e-06,1e-06,1e-06,-4e-06,2e-06,-2e-06,2e-06,0,0,1e-06,0,-4e-06,1e-06,1e-06,6e-06,-2e-06,1e-06,0,0,1e-06,0,1e-06,-1e-06,1e-06,1e-06,0
-1e-06,0,0,3e-06,-1e-06,-2e-06,-1e-06,1e-06,2e-06,1e-06,1e-06,1e-06,1e-06,0,1e-06,0,0,0,2e-06,1e-06,1e-06,-4e-06,4e-06,-6e-06,-1e-06,-2e-06,-1e-06,-2e-06,3e-06,0,-3e-06,-1e-06,0,-1e-06,-1e-06,-2e-06,-1e-05,-3e-06,-4e-06,3e-06,0,0,4e-06,0,0,5e-06,-1e-06,0,0,-4e-06,2e-06,0,-1e-06,-3e-06,2e-06,0,-1e-06,-1e-06,0,-1e-06,1e-06,-1e-06,-2e-06,1e-06,-3e-06,-1e-06,0,-1e-06,4e-06,2e-06,2e-06,4e-06,1e-06,1e-06,1e-06,-2e-06,1e-06,0,0,2e-06,0,0,0,-1e-06,2e-06,5e-06,3e-06,2e-06,-2e-06,-1e-06,2e-06,4e-06,1e-06,-1e-06,0,1e-06,-1e-06,1e-06,3e-06,-1e-06,2e-06,-2e-06,1e-06,0,0,0,2e-06,-1e-06,0,-3e-06,0,-2e-06,-2e-06,-1e-06,0,-2e-06,-1e-06,1e-06,0,0,-1e-06
1e-06,0,0,0,1e-06,0,0,0,-2e-06,-1e-06,-1e-06,0,-2e-06,-1e-06,-4e-06,0,0,0,-3e-06,-1e-06,0,2e-06,-2e-06,1e-06,0,1e-06,0,2e-06,-3e-06,0,1e-06,0,-1e-06,0,3e-06,1e-06,4e-06,4e-06,0,-2e-06,1e-06,-2e-06,0,-1e-06,0,-3e-06,0,0,-1e-06,2e-06,-2e-06,0,3e-06,3e-06,-1e-06,0,-1e-06,2e-06,-1e-06,-2e-06,-1e-06,1e-06,1e-06,0,1e-06,1e-06,0,-2e-06,1e-06,0,-1e-06,-5e-06,0,-2e-06,-3e-06,2e-06,0,-3e-06,-4e-06,0,-1e-06,0,-1e-06,0,-1e-06,-4e-06,-6e-06,-2e-06,2e-06,1e-06,-2e-06,-1e-06,-1e-06,0,0,0,0,-3e-06,0,0,1e-06,1e-06,-2e-06,0,-1e-06,0,-1e-06,0,-2e-06,0,0,2e-06,1e-06,1e-06,1e-06,1e-06,0,0,-1e-06,0,1e-06
2e-06,0,1e-06,0,-1e-06,1e-06,0,-2e-06,-1e-06,5e-06,0,0,2e-06,0,4e-06,-2e-06,0,0,2e-06,-1e-06,0,-1e-06,-2e-06,5e-06,-1e-06,0,1e-06,-4e-06,2e-06,0,-1e-06,0,0,1e-06,-1e-06,-2e-06,7e-06,-3e-06,-1e-06,-2e-06,-1e-06,1e-06,2e-06,0,0,1e-06,0,0,0,-1e-06,1e-06,0,-3e-06,-3e-06,-1e-06,-1e-06,1e-06,-3e-06,0,2e-06,0,-1e-06,0,1e-06,1e-06,-1e-06,-1e-06,1e-06,-2e-06,-2e-06,1e-06,5e-06,-1e-06,2e-06,2e-06,-2e-06,1e-06,-1e-06,1e-06,-3e-06,-1e-06,-1e-06,-2e-06,-1e-06,1e-06,2e-06,2e-06,2e-06,0,-1e-06,1e-06,1e-06,1e-06,1e-06,0,-2e-06,0,-1e-06,0,1e-06,0,0,4e-06,0,-1e-06,0,-1e-06,1e-06,1e-06,1e-06,0,2e-06,0,-2e-06,-1e-06,-2e-06,1e-06,0,0,-1e-06,0
-6e-06,0,-1e-06,1e-06,0,0,0,2e-06,0,0,0,1e-06,-1e-06,2e-06,-4e-06,2e-06,0,0,-2e-06,2e-06,0,-1e-06,2e-06,-5e-06,1e-06,-1e-06,-1e-06,2e-06,-1e-06,-1e-06,0,0,1e-06,0,-1e-06,3e-06,-7e-06,2e-06,1e-06,2e-06,0,1e-06,-1e-06,0,1e-06,-2e-06,0,0,0,3e-06,-1e-06,0,2e-06,1e-06,1e-06,1e-06,-1e-06,-1e-06,0,1e-06,1e-06,0,-1e-06,-1e-06,-3e-06,2e-06,0,-1e-06,-6e-06,2e-06,-1e-06,-4e-06,-1e-06,-2e-06,-1e-06,1e-06,1e-06,-2e-06,-1e-06,2e-06,2e-06,0,-1e-06,0,0,-2e-06,-7e-06,-2e-06,-1e-06,2e-06,-1e-06,-2e-06,0,-3e-06,0,0,0,3e-06,1e-06,-1e-06,-2e-06,-1e-06,-3e-06,0,1e-06,0,2e-06,0,1e-06,-2e-06,0,-4e-06,1e-06,0,-2e-06,2e-06,1e-06,0,1e-06,0,0
4e-06,0,1e-06,-2e-06,-1e-06,1e-06,0,-2e-06,2e-06,-3e-06,1e-06,-1e-06,0,-2e-06,2e-06,-2e-06,0,0,1e-06,-1e-06,0,2e-06,-4e-06,-1e-06,-1e-06,-1e-06,0,-4e-06,0,0,0,0,0,-1e-06,-4e-06,0,-2e-06,1e-06,1e-06,1e-06,0,1e-06,-2e-06,-1e-06,0,2e-06,0,1e-06,0,0,1e-06,2e-06,-2e-06,0,-1e-06,-1e-06,0,1e-06,1e-06,-1e-06,-1e-06,1e-06,1e-06,0,1e-06,-1e-06,0,1e-06,1e-06,-1e-06,-1e-06,5e-06,2e-06,3e-06,0,-1e-06,0,0,-1e-06,1e-06,0,0,2e-06,2e-06,-1e-06,0,5e-06,2e-06,1e-06,-2e-06,0,0,0,4e-06,0,0,1e-06,1e-06,1e-06,1e-06,-1e-06,1e-06,1e-06,0,1e-06,0,-4e-06,-1e-06,-2e-06,2e-06,0,-1e-06,0,1e-06,1e-06,0,-1e-06,-1e-06,-1e-06,0,1e-06
-1e-06,1e-06,-2e-06,0,1e-06,-1e-06,0,1e-06,-1e-06,0,-1e-06,0,0,1e-06,1e-06,2e-06,0,0,1e-06,1e-06,-1e-06,-2e-06,2e-06,2e-06,0,1e-06,0,4e-06,1e-06,0,-1e-06,0,0,0,4e-06,2e-06,7e-06,-2e-06,1e-06,-1e-06,0,1e-06,-2e-06,1e-06,0,0,0,0,0,-2e-06,0,-1e-06,2e-06,0,1e-06,1e-06,1e-06,0,-1e-06,2e-06,1e-06,-1e-06,-1e-06,-1e-06,0,0,0,2e-06,4e-06,0,0,-5e-06,-1e-06,-3e-06,1e-06,2e-06,0,-2e-06,0,-3e-06,0,0,2e-06,-1e-06,1e-06,1e-06,4e-06,-2e-06,0,0,1e-06,1e-06,1e-06,-4e-06,0,1e-06,-1e-06,-1e-06,1e-06,-1e-06,1e-06,0,0,0,0,0,1e-06,0,2e-06,1e-06,0,0,-1e-06,-1e-06,0,0,0,1e-06,0,1e-06,-1e-06
0,0,1e-06,1e-06,0,0,0,-2e-06,-2e-06,-1e-06,0,0,1e-06,0,-3e-06,-3e-06,0,0,-3e-06,-1e-06,1e-06,0,1e-06,-1e-06,0,0,0,-3e-06,-1e-06,0,1e-06,0,0,1e-06,1e-06,-3e-06,-3e-06,2e-06,-1e-06,-1e-06,-1e-06,-1e-06,1e-06,0,0,2e-06,0,0,0,0,-1e-06,0,-3e-06,2e-06,0,1e-06,0,-2e-06,0,-1e-06,0,1e-06,1e-06,1e-06,-1e-06,0,0,-2e-06,3e-06,0,0,4e-06,0,3e-06,-1e-06,-1e-06,0,0,2e-06,2e-06,0,0,1e-06,-1e-06,1e-06,-3e-06,-1e-06,2e-06,-1e-06,1e-06,0,-1e-06,-1e-06,2e-06,0,-1e-06,0,-2e-06,-2e-06,0,1e-06,-1e-06,0,0,0,0,0,1e-06,-2e-06,-3e-06,-1e-06,0,0,0,-1e-06,0,1e-06,-1e-06,1e-06,1e-06,1e-06
3e-06,0,-2e-06,-1e-06,0,0,0,3e-06,1e-06,0,0,-1e-06,-1e-06,-1e-06,2e-06,3e-06,0,0,3e-06,-1e-06,0,-1e-06,-2e-06,-3e-06,-1e-06,0,0,1e-06,2e-06,0,-2e-06,0,0,0,1e-06,1e-06,-4e-06,0,0,0,0,-1e-06,-1e-06,0,0,-1e-06,0,0,0,-1e-06,1e-06,0,3e-06,-2e-06,-1e-06,-1e-06,0,0,0,-1e-06,-1e-06,-2e-06,1e-06,-1e-06,1e-06,-1e-06,0,-2e-06,-1e-06,-1e-06,0,-4e-06,0,-3e-06,0,1e-06,-1e-06,3e-06,2e-06,2e-06,0,0,-1e-06,1e-06,-1e-06,4e-06,4e-06,-2e-06,1e-06,-1e-06,0,1e-06,1e-06,2e-06,-1e-06,1e-06,1e-06,0,2e-06,0,0,1e-06,2e-06,0,0,0,-2e-06,0,1e-06,5e-06,0,1e-06,0,0,0,-1e-06,0,1e-06,0,-1e-06,0
