0.011576,0.011163,0.009939,0.009566,0.011172,0.01244,0.011789,0.011609,0.011376,0.011539,0.012129,0.012563,0.012106,0.010878,0.010617,0.010478,0.010529,0.011966,0.013442,0.014768,0.014926,0.013536,0.014707,0.014743,0.014319,0.01434,0.011821,0.010565
0.014492,0.013823,0.012362,0.012071,0.013646,0.015073,0.014789,0.014832,0.014597,0.01438,0.014523,0.014882,0.014838,0.013412,0.012961,0.013181,0.013235,0.01501,0.016877,0.018064,0.018141,0.016829,0.017607,0.017339,0.017039,0.01694,0.014221,0.013041
0.020451,0.019208,0.017204,0.016916,0.018037,0.019551,0.020265,0.021162,0.02118,0.019976,0.018639,0.018667,0.019756,0.017987,0.016948,0.017896,0.018121,0.020772,0.023416,0.024153,0.023942,0.022672,0.022264,0.021482,0.021624,0.021301,0.018836,0.017999
0.028877,0.026467,0.023292,0.022428,0.022511,0.023711,0.025921,0.028923,0.029931,0.027438,0.023591,0.022663,0.025073,0.023017,0.02115,0.022752,0.023232,0.027061,0.030467,0.030471,0.029787,0.028565,0.026476,0.025131,0.026047,0.026229,0.025184,0.024645
0.040496,0.03649,0.031353,0.02932,0.028399,0.028842,0.032355,0.038131,0.040519,0.037574,0.031425,0.028573,0.031827,0.029901,0.027483,0.029199,0.029655,0.034878,0.039045,0.038425,0.036265,0.034534,0.032416,0.031298,0.033603,0.035393,0.035189,0.034182
0.053089,0.047398,0.040754,0.037748,0.035705,0.035221,0.040164,0.048169,0.050618,0.048295,0.041693,0.03695,0.040673,0.038637,0.035931,0.037888,0.038116,0.044958,0.050424,0.048859,0.043764,0.041256,0.040744,0.041063,0.045785,0.049029,0.04764,0.045385
0.06111,0.054917,0.048164,0.044543,0.041685,0.040175,0.045912,0.055119,0.057074,0.05531,0.049185,0.044207,0.04842,0.045981,0.043373,0.045476,0.045437,0.053813,0.060568,0.058302,0.051176,0.047815,0.048213,0.049722,0.05704,0.061615,0.058462,0.05566
0.061029,0.056488,0.051002,0.046589,0.043237,0.042198,0.048086,0.05535,0.05628,0.05507,0.049552,0.045834,0.04957,0.047039,0.045903,0.048434,0.049375,0.057655,0.063608,0.062921,0.056785,0.05151,0.05176,0.054093,0.062105,0.067509,0.063775,0.062307
0.056662,0.056608,0.05381,0.047282,0.043378,0.04543,0.051474,0.054356,0.053431,0.051544,0.046019,0.044368,0.047504,0.045167,0.046417,0.050601,0.052341,0.057262,0.061319,0.064939,0.062699,0.056305,0.056328,0.057965,0.062522,0.067014,0.06427,0.064841
0.062114,0.065091,0.063043,0.053143,0.047001,0.053444,0.063532,0.064129,0.060547,0.056508,0.050321,0.050659,0.052347,0.048505,0.052736,0.062298,0.064427,0.063629,0.066632,0.073398,0.073823,0.068309,0.069096,0.066777,0.06435,0.068277,0.068317,0.071733
0.079844,0.080694,0.074745,0.063143,0.053972,0.062893,0.080832,0.084067,0.076384,0.068283,0.06297,0.06752,0.06879,0.060531,0.063946,0.078871,0.081706,0.075385,0.078081,0.086,0.088694,0.085754,0.085827,0.07925,0.072624,0.076742,0.078288,0.084629
0.096949,0.092669,0.083669,0.07449,0.064217,0.072336,0.09671,0.104087,0.090546,0.078108,0.075401,0.087017,0.090294,0.07511,0.071576,0.088595,0.09543,0.087939,0.087634,0.091803,0.098039,0.099967,0.098273,0.091402,0.084771,0.086685,0.086821,0.094975
0.102283,0.097389,0.090001,0.08332,0.073861,0.081182,0.106785,0.117302,0.098094,0.081429,0.080588,0.097018,0.104467,0.084569,0.072772,0.08709,0.098872,0.096155,0.09242,0.088845,0.095421,0.102438,0.102321,0.098724,0.09426,0.094032,0.091296,0.099411
0.094937,0.09401,0.091248,0.086787,0.080029,0.085668,0.105126,0.116681,0.100582,0.08225,0.076707,0.092189,0.10414,0.085118,0.069774,0.081522,0.095963,0.096065,0.089459,0.080443,0.084215,0.092897,0.098184,0.099066,0.097222,0.098707,0.095229,0.099325
0.085229,0.089394,0.090852,0.088203,0.082982,0.08341,0.093821,0.101503,0.092793,0.080067,0.070026,0.077408,0.086454,0.07336,0.062892,0.07662,0.092318,0.089366,0.079785,0.070994,0.074307,0.081059,0.087859,0.091729,0.092903,0.095342,0.09145,0.09208
0.085244,0.089303,0.097831,0.098404,0.090157,0.083194,0.083621,0.084712,0.082308,0.081106,0.074567,0.072654,0.069565,0.059329,0.057025,0.071653,0.085146,0.078876,0.070109,0.068831,0.076266,0.082448,0.087528,0.088984,0.08861,0.085502,0.078258,0.079417
0.097829,0.097006,0.117593,0.122416,0.103479,0.092019,0.08969,0.083227,0.078162,0.087062,0.090385,0.08729,0.076402,0.06374,0.063336,0.071051,0.075534,0.068202,0.067801,0.080861,0.092252,0.097509,0.104314,0.097083,0.087407,0.080872,0.071543,0.072757
0.115224,0.111399,0.141241,0.148254,0.118175,0.103257,0.10366,0.095883,0.08928,0.100611,0.107065,0.101593,0.085397,0.073636,0.073293,0.070564,0.065624,0.061786,0.070525,0.095818,0.111897,0.111154,0.116043,0.106649,0.096382,0.087167,0.074274,0.079288
0.130587,0.126847,0.152816,0.160361,0.126512,0.107128,0.112112,0.10853,0.10403,0.113735,0.117634,0.108191,0.088473,0.079194,0.076716,0.067697,0.061312,0.06419,0.076358,0.102545,0.121634,0.113299,0.108141,0.102198,0.106813,0.100888,0.082512,0.090288
0.129821,0.131311,0.14854,0.154246,0.123917,0.104324,0.113656,0.112097,0.107128,0.117883,0.124927,0.108858,0.082962,0.079151,0.077946,0.066017,0.059916,0.067723,0.081006,0.100261,0.118368,0.111447,0.096877,0.089789,0.107735,0.108113,0.085707,0.093337
0.112088,0.116049,0.12583,0.128258,0.108149,0.094522,0.104385,0.09996,0.090444,0.100927,0.122868,0.112621,0.081563,0.086716,0.088305,0.069309,0.0598,0.066942,0.084717,0.101596,0.118316,0.121445,0.10482,0.089904,0.107329,0.111328,0.086978,0.091251
0.098095,0.101843,0.105339,0.102407,0.098859,0.088941,0.08597,0.078553,0.069247,0.076206,0.108307,0.109767,0.083181,0.100322,0.101025,0.072846,0.061757,0.065743,0.087734,0.10733,0.118622,0.127814,0.116635,0.099521,0.120872,0.126365,0.09449,0.093209
0.091705,0.097064,0.101748,0.09905,0.103799,0.093439,0.075654,0.068371,0.069192,0.074014,0.095557,0.09506,0.078671,0.105732,0.104317,0.07178,0.061336,0.062897,0.086048,0.104379,0.104689,0.112444,0.107553,0.09577,0.126793,0.134423,0.095435,0.094644
0.088836,0.089932,0.095399,0.095176,0.101204,0.09605,0.076666,0.070141,0.072669,0.070862,0.079269,0.073791,0.064031,0.093218,0.095675,0.065676,0.053331,0.054454,0.075696,0.091706,0.087596,0.08854,0.084664,0.081265,0.114195,0.124501,0.091207,0.091065
0.081209,0.074546,0.079719,0.07918,0.083499,0.083535,0.071592,0.068163,0.065045,0.056761,0.057553,0.05188,0.047866,0.066854,0.070643,0.052138,0.043913,0.049101,0.065612,0.075709,0.070349,0.06313,0.063782,0.070788,0.093995,0.106234,0.088455,0.083813
0.06389,0.055925,0.057774,0.057387,0.059512,0.058863,0.054822,0.056298,0.053103,0.043671,0.037627,0.033341,0.035129,0.042073,0.044479,0.040371,0.040173,0.046136,0.052715,0.057448,0.056647,0.048534,0.048984,0.05926,0.068807,0.077673,0.079841,0.074005
0.043752,0.041868,0.043733,0.041867,0.042347,0.042351,0.041534,0.046301,0.048528,0.037399,0.024858,0.019901,0.02445,0.031067,0.03547,0.036652,0.038785,0.040386,0.038897,0.04183,0.048616,0.047649,0.044658,0.051433,0.051608,0.053652,0.063532,0.062129
0.035422,0.03757,0.042245,0.038662,0.039764,0.041973,0.040369,0.048368,0.052419,0.038073,0.024919,0.020072,0.021551,0.026978,0.033479,0.035351,0.037317,0.035999,0.029077,0.030067,0.042157,0.050093,0.046281,0.048101,0.045126,0.040995,0.04737,0.051361
0.03786,0.041055,0.047917,0.041842,0.040644,0.047543,0.051414,0.058933,0.055609,0.041247,0.031507,0.028161,0.029811,0.032724,0.036336,0.035232,0.03506,0.03336,0.025676,0.025847,0.039371,0.053154,0.050819,0.046003,0.042933,0.039792,0.046805,0.054715
0.041909,0.046307,0.058853,0.051914,0.044445,0.054563,0.067068,0.070444,0.055699,0.042144,0.039137,0.040784,0.043561,0.041102,0.039334,0.03931,0.036605,0.032383,0.028084,0.030628,0.047969,0.064963,0.06295,0.052095,0.045901,0.045301,0.056738,0.063562
0.044605,0.050374,0.066496,0.06045,0.051098,0.065502,0.083357,0.078388,0.057401,0.046781,0.050273,0.057208,0.057272,0.04729,0.043686,0.050032,0.047203,0.039735,0.035717,0.038689,0.060356,0.081051,0.081542,0.069258,0.056977,0.050234,0.064317,0.071482
0.046463,0.048827,0.065123,0.065096,0.056545,0.072836,0.092454,0.083206,0.060423,0.051421,0.060418,0.07019,0.063851,0.049765,0.049348,0.059585,0.05623,0.046548,0.042946,0.0459,0.066027,0.087446,0.094267,0.084833,0.067539,0.053349,0.068455,0.089232
0.0461,0.044869,0.058797,0.061736,0.052201,0.064884,0.082807,0.076406,0.055813,0.046818,0.060258,0.071556,0.058494,0.043693,0.048261,0.059265,0.055786,0.045517,0.043559,0.045937,0.058442,0.076352,0.090032,0.086647,0.071243,0.062574,0.083805,0.132805
0.039828,0.036016,0.046349,0.050156,0.038973,0.043488,0.058399,0.059651,0.044403,0.035071,0.047794,0.061693,0.049016,0.036733,0.045543,0.056347,0.056037,0.04481,0.040298,0.040797,0.044612,0.05578,0.069676,0.074181,0.077176,0.094087,0.139605,0.231147
0.032794,0.02917,0.040937,0.046975,0.030337,0.024364,0.040082,0.051599,0.040611,0.02806,0.03324,0.055914,0.057114,0.047231,0.056738,0.071549,0.073476,0.052308,0.039755,0.040158,0.042687,0.048482,0.056745,0.075165,0.103258,0.147482,0.225303,0.376043
0.031443,0.032926,0.051261,0.056181,0.031403,0.017903,0.03227,0.046298,0.039317,0.029121,0.028913,0.05412,0.069711,0.063193,0.074069,0.093583,0.092686,0.060264,0.044003,0.0491,0.052508,0.054054,0.065457,0.096758,0.142051,0.207086,0.314689,0.528481
0.028924,0.035617,0.059498,0.062121,0.034632,0.017286,0.025321,0.035365,0.032072,0.028807,0.027273,0.05033,0.074921,0.071726,0.082024,0.103647,0.097043,0.059739,0.045732,0.056734,0.060232,0.060494,0.075556,0.111846,0.167764,0.242601,0.362929,0.615698
0.02646,0.033449,0.056748,0.056621,0.032728,0.018497,0.023453,0.025394,0.024378,0.025558,0.025127,0.042516,0.066956,0.065159,0.072431,0.091911,0.080453,0.047682,0.039154,0.054273,0.056555,0.057002,0.072596,0.10423,0.160177,0.227454,0.332039,0.573933
0.024725,0.026669,0.042825,0.040946,0.024777,0.018415,0.025078,0.021439,0.021914,0.022881,0.020336,0.029907,0.048259,0.045927,0.049482,0.063163,0.051294,0.033379,0.03033,0.041641,0.04179,0.042642,0.054736,0.074749,0.119026,0.164395,0.231665,0.414056
0.020731,0.017572,0.025245,0.023513,0.015708,0.017365,0.025301,0.021376,0.022545,0.024095,0.017723,0.018477,0.028881,0.02685,0.027751,0.033064,0.024688,0.022257,0.025395,0.028789,0.025314,0.027163,0.032166,0.040017,0.067346,0.088589,0.118809,0.224431
