5e-06,2.1e-05,3e-06,3e-05,1.7e-05,2e-05,2.3e-05,4e-06,2e-05,1e-06,2.3e-05,3e-05,2.6e-05,2e-06,8e-06,1.5e-05,1e-05,1e-06,1.6e-05,6e-06,5e-06,6e-06,8e-06,1.6e-05,7e-06,1e-06,2e-05,7e-06,6e-06,7e-06,5e-06,5e-06,2.1e-05,7e-06,2e-06,0,1.1e-05,1e-05,1.9e-05,1e-06,4e-06,7e-06,1e-05,7e-06,2e-06,1.1e-05,6e-06,3e-06,1e-06,6e-06,5e-06,1.8e-05,1.4e-05,6e-06,1.4e-05,8e-06,4e-06,3e-06,2e-05,2e-06,7e-06,2.1e-05,1.8e-05,1e-06,4e-06,1.2e-05,1.5e-05,3e-06,2e-06,1.1e-05,3e-06,6e-06,0,0,4e-06,1e-06,3e-06,2e-06,4.8e-05,8e-06,6e-06,1.8e-05,4e-06,1.4e-05,1e-06,1.8e-05,1.3e-05,2e-06,1.1e-05,3e-06,1.3e-05,9e-06,1.1e-05,8e-06,4.6e-05,6e-06,8e-06,1.8e-05,0.00025,0.000157,0.000482,0.000233,8e-06,8.9e-05,1.3e-05,1.4e-05,5.5e-05,0.000102,0.000289,0.00047,3e-06,4.1e-05,1.4e-05,1.3e-05,5.5e-05,2.2e-05,0.000433,0.000607,8.3e-05,0.000226,7.2e-05
4.3e-05,1e-05,3.8e-05,5.6e-05,2.1e-05,3.1e-05,8.8e-05,4.1e-05,4e-05,3.7e-05,8.4e-05,8.3e-05,0.000104,8.6e-05,8e-05,8e-06,3e-05,3.6e-05,9e-06,2.3e-05,9e-06,2.4e-05,3.1e-05,2.3e-05,2.8e-05,2.3e-05,1.7e-05,3.1e-05,4.2e-05,2.9e-05,3.4e-05,5e-05,4.6e-05,2.5e-05,2.1e-05,1.1e-05,1.1e-05,3e-06,3.4e-05,2.8e-05,2.2e-05,3e-05,1.6e-05,3e-05,1.6e-05,1.6e-05,2.2e-05,2e-05,1.7e-05,4.4e-05,2.1e-05,2.9e-05,4e-05,1.3e-05,2.4e-05,3.2e-05,2.7e-05,1.7e-05,3.9e-05,3.2e-05,3.6e-05,5.4e-05,1.5e-05,2.2e-05,3.3e-05,3.2e-05,1.8e-05,1.3e-05,1e-05,3.1e-05,1.5e-05,3e-06,9e-06,2.9e-05,3.3e-05,3.1e-05,6e-06,3.7e-05,6.7e-05,7.3e-05,6.3e-05,6e-05,5e-05,5.2e-05,7.1e-05,5.9e-05,1.7e-05,1.3e-05,5e-06,2.4e-05,3.6e-05,4.2e-05,9e-06,3.3e-05,0.000118,5.9e-05,6.9e-05,7e-06,0.000528,0.000513,0.001123,0.000712,0.000234,0.000466,0.000377,0.000282,0.000234,0.000591,0.001388,0.002077,0.000922,0.000367,9.9e-05,0.000102,0.000137,8.1e-05,0.00136,0.002465,0.001536,0.000816,0.000362
6.6e-05,6.3e-05,4e-05,3.1e-05,4.6e-05,3.1e-05,4.3e-05,2.3e-05,2.6e-05,4.4e-05,6.3e-05,0.000209,0.00018,3.8e-05,4.8e-05,6e-06,1.4e-05,2.6e-05,4.3e-05,4.1e-05,2.9e-05,2.2e-05,4e-05,3.2e-05,7e-06,4.3e-05,1.6e-05,5e-05,8e-06,7e-06,3.6e-05,2.2e-05,2.5e-05,4.4e-05,1.4e-05,1.4e-05,1.3e-05,1.6e-05,9e-06,1.2e-05,2.5e-05,2.4e-05,1.9e-05,1.9e-05,3e-05,1.7e-05,6e-06,2.2e-05,3.5e-05,3.5e-05,2e-05,3e-05,2e-06,2e-05,5e-05,3.9e-05,2.1e-05,2.6e-05,5e-06,5.2e-05,3.1e-05,5.4e-05,4.1e-05,2.2e-05,3.4e-05,5e-05,9e-06,2e-05,2.6e-05,2.7e-05,6.1e-05,2.8e-05,3.1e-05,6.6e-05,4.2e-05,1.1e-05,2.5e-05,4.1e-05,5.7e-05,5e-05,6e-06,8.3e-05,4.9e-05,3.7e-05,0.000113,5.5e-05,3.8e-05,2.5e-05,1.4e-05,3.3e-05,1e-05,7e-06,1.4e-05,5e-05,0.000166,0.000162,3.2e-05,2.3e-05,0.00058,0.001289,0.000992,0.001608,0.000932,0.000433,0.00017,0.000194,0.00022,0.000605,0.002237,0.001507,0.001191,0.000559,0.000134,0.00013,4.1e-05,4.8e-05,0.001913,0.004356,0.002457,0.000716,0.00026
8.2e-05,1.2e-05,4.7e-05,3.6e-05,4.8e-05,4.2e-05,1.1e-05,4.9e-05,2.2e-05,1.8e-05,4.8e-05,0.000424,0.000278,0.000158,7.5e-05,2.2e-05,1.8e-05,2.1e-05,4.6e-05,6.1e-05,2.1e-05,2.9e-05,8e-05,5.9e-05,7.7e-05,1.4e-05,5.7e-05,0.000108,3.8e-05,3.9e-05,5.2e-05,6.1e-05,2.7e-05,1.4e-05,3.3e-05,2.3e-05,5.5e-05,6.6e-05,5.3e-05,3.5e-05,3.7e-05,4.5e-05,3e-05,3.4e-05,4.7e-05,5.7e-05,1.9e-05,3.9e-05,1.7e-05,4.9e-05,4.9e-05,3.4e-05,4.2e-05,4.1e-05,8.4e-05,7.7e-05,6.7e-05,9e-05,6e-05,7e-05,5.1e-05,7e-05,3.4e-05,3.5e-05,4.8e-05,5e-05,4.6e-05,6.7e-05,3.8e-05,4.7e-05,3.8e-05,3.6e-05,5.8e-05,0.00013,7.4e-05,3.4e-05,3.2e-05,5.5e-05,5.2e-05,2.9e-05,2.2e-05,7.9e-05,4e-05,3.6e-05,8.2e-05,6.2e-05,3.9e-05,4.3e-05,4.8e-05,4.1e-05,3.4e-05,1.7e-05,2e-05,5e-05,0.000252,0.000201,0.000159,0.000102,0.000586,0.001769,0.002205,0.002228,0.001558,0.00133,0.000587,0.000129,0.000248,0.000643,0.002037,0.001434,0.001127,0.000519,0.000124,0.000101,0.000108,9.9e-05,0.002091,0.002914,0.001452,0.000831,0.000398
8e-05,4.4e-05,6.2e-05,4.5e-05,4.1e-05,3.7e-05,2.1e-05,8.3e-05,0.000103,2.2e-05,3.9e-05,0.000576,0.000329,0.000119,4e-05,1.4e-05,4.9e-05,1.8e-05,5.7e-05,6.7e-05,3.2e-05,4.3e-05,8.2e-05,5.1e-05,0.000102,5.5e-05,9.2e-05,0.000104,8.2e-05,4.5e-05,1.5e-05,8.2e-05,6.6e-05,6.2e-05,8.5e-05,6.6e-05,0.000113,6.6e-05,3.5e-05,3e-05,4.2e-05,3.3e-05,3.7e-05,0.000111,0.000115,3.1e-05,3.1e-05,3.1e-05,2.9e-05,4.9e-05,3.2e-05,6.1e-05,1.8e-05,2.9e-05,0.000119,6.2e-05,5.7e-05,5.8e-05,2.7e-05,3.3e-05,9e-05,6.9e-05,3.6e-05,1.6e-05,1.5e-05,8e-06,6.9e-05,4.6e-05,4.2e-05,4.3e-05,2.9e-05,6.4e-05,1.9e-05,0.000139,5.2e-05,2.7e-05,3.1e-05,3e-05,5.7e-05,2.9e-05,2.1e-05,3.3e-05,1.3e-05,6.8e-05,3.5e-05,2.4e-05,2.8e-05,9e-06,1.7e-05,1.6e-05,8e-06,1.2e-05,1.4e-05,1.8e-05,0.000249,0.00016,8.9e-05,0.000158,0.000271,0.001115,0.000879,0.001766,0.000563,0.000539,0.000263,7.4e-05,0.000132,0.000425,0.002115,0.002317,0.000985,0.000158,0.000118,8.7e-05,4.9e-05,3.1e-05,0.001896,0.000669,0.000296,0.000613,0.000383
7.9e-05,3.5e-05,0.000117,3.3e-05,7.5e-05,8.3e-05,0.000119,0.000156,8.9e-05,9.6e-05,9.8e-05,0.000706,0.000385,0.000201,6e-06,3.8e-05,8.9e-05,3.9e-05,3.2e-05,0.000153,0.000147,0.000109,2.8e-05,4.1e-05,9.7e-05,9.3e-05,8.9e-05,0.000214,0.00025,0.000134,6.4e-05,0.000116,9.8e-05,9e-05,0.000135,2e-05,0.000101,0.000196,0.000171,8.3e-05,3.4e-05,0.000102,0.000134,0.000155,0.00016,0.000103,8.1e-05,8.8e-05,3.4e-05,7.2e-05,5.6e-05,0.000107,9.2e-05,5.7e-05,0.000106,8.8e-05,2.3e-05,6.4e-05,7.2e-05,4.6e-05,0.000116,0.000214,0.000155,0.00011,7.9e-05,8.6e-05,0.000102,0.000116,0.000136,0.000103,0.000123,0.000108,5.3e-05,9.7e-05,6.8e-05,7.1e-05,9e-06,4e-05,8e-05,6.3e-05,2.7e-05,5.8e-05,4.2e-05,5.5e-05,5.2e-05,2.9e-05,1.7e-05,2.2e-05,2.4e-05,1.1e-05,2.3e-05,6e-06,2.7e-05,2.2e-05,0.00029,7.3e-05,6.6e-05,0.000132,0.000231,0.000428,0.000988,0.001374,0.001215,0.000432,0.000218,0.000155,0.00038,0.00039,0.001639,0.002191,0.000775,0.000186,0.000124,0.000144,0.000116,6.7e-05,0.001486,0.001728,0.001708,0.000721,0.000417
4.7e-05,2.2e-05,0.000143,0.000169,6.9e-05,0.000153,6.3e-05,5.5e-05,4.3e-05,0.000103,0.000173,0.000931,0.000252,0.000144,9e-05,7.7e-05,8.4e-05,7.2e-05,4e-05,0.000111,0.000173,9.5e-05,5.9e-05,5.4e-05,6.3e-05,0.000113,5.7e-05,0.00016,0.000185,6.7e-05,8.7e-05,0.000161,0.000115,9.1e-05,4.9e-05,9.5e-05,1.7e-05,9.7e-05,7.1e-05,3e-05,1.9e-05,0.000127,3.5e-05,7.6e-05,6.7e-05,3.4e-05,5.9e-05,5.2e-05,6.5e-05,0.00014,8.9e-05,0.000111,0.000149,8.5e-05,9.1e-05,5.1e-05,6.1e-05,9.9e-05,7.4e-05,9.6e-05,9.1e-05,0.000154,0.000111,7.9e-05,7e-05,6.2e-05,5.4e-05,4e-05,7.8e-05,0.000103,0.000125,8e-05,9.8e-05,0.000181,6.4e-05,7.2e-05,6.9e-05,1.4e-05,0.000166,6.4e-05,4.5e-05,0.000126,4.2e-05,4.5e-05,5.2e-05,3.2e-05,3.2e-05,3.2e-05,5.1e-05,4.4e-05,1e-05,1.6e-05,4.4e-05,5.3e-05,0.000272,0.000254,5.6e-05,0.000193,0.00111,0.000667,0.001453,0.000883,0.000954,0.001243,0.000553,9.6e-05,0.000465,0.000439,0.001368,0.001016,0.001033,0.000461,0.000145,0.00011,8.4e-05,0.000112,0.001445,0.003396,0.003891,0.000906,0.000167
8.8e-05,4.9e-05,0.000129,0.000128,0.000132,8.2e-05,9.6e-05,3.9e-05,8.8e-05,3.5e-05,8.4e-05,0.000886,0.000755,0.000274,8.9e-05,5.2e-05,0.000125,5.9e-05,4.7e-05,7.5e-05,5.6e-05,4.2e-05,4.1e-05,8.5e-05,9.4e-05,2e-05,3.2e-05,0.000129,1.5e-05,0.000109,0.000105,5.5e-05,0.000112,8.9e-05,8.7e-05,4e-05,2e-05,1.9e-05,1.1e-05,1.3e-05,2.3e-05,7.8e-05,0.000117,9.2e-05,3.6e-05,2.5e-05,5.2e-05,2e-05,3.7e-05,7e-05,1.6e-05,9.7e-05,4.3e-05,2.2e-05,0.000106,7.3e-05,9.8e-05,0.00017,5e-05,6.8e-05,7.4e-05,7.9e-05,3e-05,7.3e-05,1.7e-05,9.5e-05,0.000115,4.6e-05,4.1e-05,8e-05,0.000311,0.000209,0.000174,0.000336,0.000192,0.000111,2.9e-05,8.3e-05,0.000135,0.000154,2.8e-05,0.000157,9.8e-05,1.8e-05,0.000156,8.9e-05,5.6e-05,2.7e-05,3.5e-05,2e-05,1e-05,2.2e-05,4.1e-05,2e-05,0.000295,0.00033,0.000277,9.3e-05,0.001524,0.00164,0.00063,0.001858,0.000414,0.000736,0.000524,0.000103,0.000448,0.000303,0.001686,0.002826,0.002657,0.001263,0.000355,3.2e-05,7.3e-05,0.000101,0.001775,0.005053,0.002888,0.001984,0.001254
2.3e-05,8.8e-05,8.6e-05,4.8e-05,6.6e-05,0.000104,7.3e-05,2.7e-05,7.2e-05,9.6e-05,3.4e-05,0.000742,0.000766,0.000425,0.000166,5.4e-05,6.3e-05,4e-05,6.2e-05,3e-05,4.2e-05,4.9e-05,6.2e-05,4.4e-05,2.8e-05,3.8e-05,2.8e-05,7.1e-05,5.8e-05,0.000121,4e-05,2.3e-05,5.2e-05,4.5e-05,1.8e-05,2.2e-05,3.5e-05,5.2e-05,6.3e-05,7.7e-05,6.7e-05,1.6e-05,7.4e-05,3.2e-05,1.5e-05,3.2e-05,2e-05,3.6e-05,1.6e-05,4.2e-05,4.7e-05,8e-05,3.5e-05,5.3e-05,8.7e-05,4.6e-05,5.6e-05,0.000103,0.000102,5.9e-05,1.8e-05,1.6e-05,3.3e-05,2.9e-05,3.8e-05,5.9e-05,8.4e-05,9.5e-05,7.9e-05,2.8e-05,0.000357,0.000257,1.9e-05,0.00022,0.000163,4.2e-05,4.4e-05,0.00011,9e-05,0.000142,0.000117,0.000187,0.000154,8.6e-05,0.000175,0.000146,4.7e-05,3e-05,1e-05,1.2e-05,2.5e-05,4.4e-05,6.9e-05,7.6e-05,0.000211,7.1e-05,5.8e-05,0.00013,0.001493,0.001502,0.000628,0.002038,0.001549,0.000788,0.000624,0.000362,0.000478,0.000463,0.001341,0.003793,0.003166,0.001426,0.000336,5.1e-05,3e-05,0.000107,0.002332,0.004608,0.004459,0.004627,0.002328
1.6e-05,5.4e-05,4.3e-05,3e-05,4e-06,5.5e-05,3.2e-05,9e-06,7e-05,7e-06,8e-06,0.000559,0.000376,0.000117,4.8e-05,2.7e-05,1.7e-05,6e-06,2.4e-05,1.1e-05,6e-06,3.1e-05,2.7e-05,3.1e-05,3.6e-05,5.5e-05,4.9e-05,4.4e-05,2.3e-05,7.1e-05,3.5e-05,3.3e-05,3.9e-05,1.8e-05,5e-06,2.9e-05,5.9e-05,2.8e-05,3.2e-05,5.5e-05,2e-05,1.9e-05,3.8e-05,3.9e-05,1.3e-05,2.9e-05,1.5e-05,2.5e-05,3e-06,8e-06,2.1e-05,2.2e-05,5.1e-05,2.2e-05,4.7e-05,2.9e-05,4.3e-05,1.4e-05,3.4e-05,4.3e-05,6.2e-05,6.8e-05,5.8e-05,2.1e-05,2.4e-05,3e-05,5.5e-05,8e-06,2.6e-05,2.9e-05,0.00027,9.5e-05,6.4e-05,0.000108,2.2e-05,2.3e-05,3.5e-05,6.2e-05,5.6e-05,5.5e-05,4e-05,0.000151,8.9e-05,0.00011,0.000105,2.6e-05,2.5e-05,3.8e-05,1.5e-05,2.2e-05,8e-06,3.4e-05,1.4e-05,2.3e-05,0.00014,9.2e-05,3.3e-05,0.000115,0.001388,0.000802,0.000817,0.001524,0.000706,0.000298,0.000104,1.5e-05,0.000187,0.000379,0.000767,0.002884,0.0011,0.000499,9.5e-05,6.6e-05,6.7e-05,4.9e-05,0.002725,0.0031,0.003521,0.0032,0.00133
3.9e-05,3.1e-05,3.4e-05,1.9e-05,2.9e-05,4.1e-05,4.8e-05,2.1e-05,6.1e-05,4.7e-05,3.6e-05,0.000337,7.5e-05,6.3e-05,5.7e-05,1.5e-05,3e-06,4e-05,3e-05,2.1e-05,8e-06,2e-06,1e-05,2.2e-05,4.2e-05,3.3e-05,1.2e-05,2e-05,3.4e-05,7.8e-05,2.5e-05,2.6e-05,3e-05,2e-05,2.7e-05,2.6e-05,2.9e-05,4.5e-05,6e-06,5.5e-05,4.5e-05,1e-05,5.3e-05,5.3e-05,1.9e-05,2.3e-05,1.4e-05,2.2e-05,2.4e-05,1e-05,2.8e-05,3.5e-05,3.3e-05,3.9e-05,3.5e-05,3.1e-05,5.8e-05,3e-05,1.4e-05,5.1e-05,2.6e-05,6.9e-05,2e-05,1.9e-05,1.6e-05,1e-05,2.3e-05,3.1e-05,1.9e-05,2.2e-05,0.000117,4.2e-05,2.4e-05,3.3e-05,3e-06,1e-05,2.3e-05,4.8e-05,7.2e-05,1.7e-05,2.1e-05,0.00012,5.2e-05,9.5e-05,1.2e-05,1.8e-05,2e-05,6e-06,9e-06,3.3e-05,2.6e-05,1.4e-05,7e-06,2.5e-05,0.000103,7.2e-05,4.6e-05,8.3e-05,0.001312,0.000233,0.000795,0.001366,0.000372,0.000161,0.00015,0.000116,2.1e-05,0.000243,0.001049,0.001613,0.00032,7.7e-05,8.9e-05,4.5e-05,4.5e-05,6.7e-05,0.00281,0.004337,0.004793,0.001488,0.000587
4.2e-05,2.6e-05,3.5e-05,1.2e-05,5.2e-05,3.1e-05,1.5e-05,1.5e-05,5.5e-05,4.4e-05,5e-05,0.000106,2.6e-05,2.9e-05,3e-05,3.7e-05,4.8e-05,3.5e-05,3.1e-05,2.6e-05,2.4e-05,4.9e-05,4.5e-05,3.5e-05,4.9e-05,1.2e-05,1.1e-05,2.6e-05,3.9e-05,7.5e-05,2.4e-05,5.5e-05,5.5e-05,2.8e-05,4.7e-05,2.8e-05,1e-05,2.1e-05,1.5e-05,1.7e-05,2.5e-05,3.7e-05,3.5e-05,3e-05,5e-06,2e-05,1.6e-05,1.5e-05,2.5e-05,9e-06,2.2e-05,1e-05,2.3e-05,3e-05,2.7e-05,2.5e-05,6.1e-05,3.7e-05,3.7e-05,5.4e-05,5.4e-05,3.7e-05,5.1e-05,1e-05,4.7e-05,4.6e-05,2.2e-05,2e-05,2.5e-05,8e-06,4.3e-05,4.3e-05,3.1e-05,1.5e-05,2.1e-05,1.2e-05,1.2e-05,2.5e-05,5.6e-05,3.2e-05,1.5e-05,3.8e-05,3.9e-05,1e-04,2.2e-05,1.3e-05,1.4e-05,1.1e-05,2.3e-05,8e-06,1.6e-05,1.7e-05,1.5e-05,3.2e-05,3.5e-05,3e-05,1.7e-05,3.4e-05,0.001232,0.000425,0.000669,0.001799,0.001381,0.000951,0.000318,0.000126,0.000212,0.000276,0.000648,0.000867,0.000666,0.000211,3.4e-05,6.6e-05,2.1e-05,6.8e-05,0.002569,0.004517,0.001881,0.000625,0.000248
3.2e-05,2.9e-05,2.8e-05,2.2e-05,3e-05,1.8e-05,4.9e-05,2.4e-05,2.8e-05,3.8e-05,2.2e-05,0.000184,0.000121,8.9e-05,5.4e-05,5.7e-05,4e-06,1.9e-05,4.9e-05,5e-06,4.3e-05,2.4e-05,4.3e-05,2.8e-05,3.3e-05,2.9e-05,6e-06,1.3e-05,6.2e-05,0.000127,4e-05,6.7e-05,1.7e-05,5e-05,3.6e-05,3.3e-05,2.6e-05,3e-05,4.9e-05,1.1e-05,2.5e-05,4.1e-05,7.4e-05,9.2e-05,3.3e-05,2.3e-05,6e-06,3.1e-05,3.8e-05,3.1e-05,1.2e-05,1.4e-05,5.2e-05,2.6e-05,1.8e-05,3.6e-05,2e-05,2.8e-05,4e-05,2.3e-05,3.2e-05,2.8e-05,4.5e-05,6e-06,3.5e-05,3.4e-05,4e-05,3.4e-05,4.8e-05,3e-05,0.00011,3.7e-05,3.1e-05,4.7e-05,1.9e-05,1.2e-05,3e-05,1.7e-05,3.6e-05,6e-05,3.5e-05,5.8e-05,4.2e-05,0.000103,7.3e-05,4.2e-05,8e-06,3.4e-05,7e-06,2e-05,3e-05,3.4e-05,2.7e-05,1.9e-05,2.3e-05,3.1e-05,3e-06,5.3e-05,0.001031,0.00035,0.000628,0.001932,0.000975,0.00038,0.000244,0.000145,0.000117,0.000122,0.000171,0.000387,0.000361,0.000194,8e-05,2.9e-05,3.9e-05,0.000105,0.002286,0.002282,0.002095,0.001003,0.000306
0.000235,8.6e-05,1.7e-05,2.4e-05,1.3e-05,2.9e-05,5.2e-05,1.8e-05,3.3e-05,3e-05,2.3e-05,0.000284,9.4e-05,0.000149,0.000138,7.5e-05,4.8e-05,4.6e-05,4.6e-05,8.4e-05,5.8e-05,3.2e-05,3.2e-05,8.9e-05,0.000117,8.5e-05,6.8e-05,7.4e-05,2.6e-05,5.4e-05,9.1e-05,7.1e-05,0.00014,7.9e-05,8.8e-05,1.3e-05,4.8e-05,0.000109,7.5e-05,3.7e-05,4.2e-05,6.5e-05,4.9e-05,0.000107,5.3e-05,1.4e-05,1.8e-05,1e-05,6.1e-05,6.8e-05,6.2e-05,6e-06,3.5e-05,4.3e-05,4.5e-05,8e-05,8.5e-05,3.8e-05,7e-06,2.9e-05,1.3e-05,7.3e-05,8.7e-05,2.6e-05,5.1e-05,3.1e-05,9.1e-05,3.9e-05,6.2e-05,8.9e-05,5.9e-05,2e-05,4.6e-05,9.6e-05,5e-05,4.3e-05,4.7e-05,1.6e-05,4.3e-05,5.8e-05,6.2e-05,6.7e-05,1.9e-05,0.000115,6.1e-05,1.2e-05,3e-06,1.9e-05,1.4e-05,2.8e-05,2.8e-05,3.4e-05,1.4e-05,2.9e-05,5.1e-05,7e-06,2e-05,8.3e-05,0.001104,0.00071,0.000205,0.001658,0.000574,0.000144,6.5e-05,3.8e-05,7e-05,0.000229,0.000372,0.00081,0.000128,4.5e-05,1.2e-05,1.9e-05,5e-05,9e-05,0.001822,0.001588,0.000477,0.000404,0.000204
0.000175,0.000122,0.000103,0.000117,5.9e-05,1e-05,3.3e-05,4.3e-05,0.000109,7.6e-05,5.7e-05,0.000307,0.00034,8e-05,0.000124,5.9e-05,7.6e-05,9.1e-05,6.1e-05,0.000109,6.9e-05,3.2e-05,2.2e-05,7.9e-05,5.4e-05,0.000125,0.000107,3.1e-05,2.9e-05,2.3e-05,4.7e-05,0.000147,0.000119,0.000113,3.2e-05,6.9e-05,4.7e-05,6.5e-05,6.9e-05,1.5e-05,7.2e-05,1.9e-05,5.7e-05,4.6e-05,5.3e-05,3.8e-05,4.7e-05,2e-05,0.000104,3.5e-05,5.9e-05,7.2e-05,1.8e-05,1.6e-05,7.5e-05,0.000116,0.000158,8.8e-05,7.2e-05,3.6e-05,1.8e-05,6.8e-05,8.1e-05,0.00011,7.9e-05,7.9e-05,8.2e-05,2.1e-05,9.2e-05,9.2e-05,9e-05,8.5e-05,1.1e-05,8.6e-05,4e-05,3e-05,1.2e-05,4.3e-05,3.1e-05,3.7e-05,6.1e-05,3.5e-05,2.6e-05,0.000144,9.1e-05,4.5e-05,1.9e-05,1.2e-05,1e-05,3.7e-05,2.6e-05,6e-06,2.2e-05,3e-05,0.000118,4.1e-05,1.8e-05,5.6e-05,0.00116,0.000813,0.000752,0.001478,0.000952,0.000556,0.000217,6.7e-05,2.8e-05,0.000195,0.000203,0.000557,0.000212,9.4e-05,5.8e-05,3.3e-05,5.4e-05,8.7e-05,0.001675,0.001812,0.002276,0.001306,0.000469
0.000203,9.3e-05,5e-05,0.000108,0.000141,0.000117,8.6e-05,8e-05,0.000122,0.000135,0.000112,0.000372,0.000139,9.6e-05,4.8e-05,8.7e-05,9.4e-05,7.5e-05,0.000105,2.7e-05,5.4e-05,7.8e-05,4.1e-05,1e-04,0.000128,0.000157,0.000137,0.00011,8.4e-05,9.9e-05,0.000113,0.000149,6.9e-05,7.1e-05,5.5e-05,5.8e-05,2.7e-05,4.9e-05,5.3e-05,6.9e-05,8.9e-05,0.000132,6.8e-05,7.2e-05,2.4e-05,4.6e-05,4.9e-05,3.6e-05,0.000115,0.000192,0.000136,0.000138,0.000116,7.8e-05,9.2e-05,9.1e-05,0.000192,0.000173,3.9e-05,4.8e-05,7e-05,4.3e-05,9.8e-05,0.00013,0.00014,3.7e-05,1e-05,6.4e-05,9.8e-05,0.000161,4.9e-05,6.5e-05,9.2e-05,5.5e-05,1e-05,1.3e-05,5.1e-05,5.8e-05,5.2e-05,4.5e-05,1e-05,4.8e-05,5.6e-05,0.000123,0.000155,8.2e-05,5e-05,5.1e-05,3.6e-05,5e-05,4.5e-05,3.3e-05,3.1e-05,2e-05,0.000126,6.9e-05,4.9e-05,9.2e-05,0.001139,0.000324,0.000559,0.001849,0.001184,0.000297,0.000212,0.000191,0.00015,0.000126,0.000101,0.000416,0.00013,5.4e-05,5.5e-05,7.2e-05,7e-05,2.9e-05,0.001686,0.001267,0.000177,0.000296,0.000169
0.000238,0.000273,0.000166,0.000178,2.1e-05,7e-05,6.5e-05,9.1e-05,0.000115,6.6e-05,6.2e-05,0.000322,0.000273,0.000111,5.2e-05,7.5e-05,0.000132,0.000115,9.9e-05,0.000149,0.000134,0.000113,0.000164,3.9e-05,4.3e-05,0.00013,0.000133,0.000229,0.000187,9.1e-05,0.000179,0.000169,0.000134,4.3e-05,6.3e-05,3.6e-05,7e-05,0.00013,3.7e-05,0.000165,0.000101,9.2e-05,0.000102,0.000107,0.000123,0.000106,7.3e-05,9.2e-05,0.000156,0.000141,0.000146,3.2e-05,1.5e-05,4.4e-05,0.000184,0.000127,3.2e-05,4.8e-05,7.3e-05,1.1e-05,0.000103,4.9e-05,0.000144,8.8e-05,0.000172,5.1e-05,5.3e-05,4e-05,3.1e-05,0.000117,0.000104,6.4e-05,2.6e-05,3.2e-05,9.2e-05,9e-05,1e-04,3.5e-05,2.1e-05,4.4e-05,2e-06,8.8e-05,3.6e-05,0.000132,0.000153,6.8e-05,5.1e-05,3.1e-05,4.5e-05,1e-05,1.8e-05,5.2e-05,1.8e-05,2.2e-05,0.000159,0.000111,5.7e-05,0.000166,0.001009,0.00072,0.000584,0.002095,0.001585,0.000982,0.000244,0.000167,2.9e-05,0.000208,0.000275,0.000352,1.3e-05,4.6e-05,7.3e-05,6.7e-05,6.9e-05,0.000101,0.001755,0.00115,0.00135,0.000585,0.000258
0.000109,0.000147,4e-05,5.5e-05,0.000104,7.4e-05,0.000107,3.2e-05,5.2e-05,3.2e-05,3e-05,0.00034,0.000209,0.000156,6.8e-05,5.1e-05,0.000118,4.2e-05,0.000129,0.000121,0.000151,0.000168,0.000167,0.000137,8.5e-05,9.5e-05,5e-06,0.00013,2.9e-05,8.8e-05,0.000209,0.000261,0.000114,6.9e-05,1e-04,1e-04,0.000131,0.000138,0.000158,0.000151,0.000141,9.6e-05,0.000141,5.9e-05,0.000111,1.3e-05,7.4e-05,7.4e-05,6.1e-05,9.5e-05,2.5e-05,2.6e-05,4.5e-05,4.5e-05,0.000194,0.000121,0.000142,9.9e-05,2.4e-05,0.000126,8.7e-05,0.000106,9.7e-05,2.2e-05,0.000161,0.000187,0.000209,0.000106,6.7e-05,7.7e-05,6.2e-05,4.9e-05,6.9e-05,7.7e-05,9.6e-05,5.9e-05,1.1e-05,1.4e-05,3.1e-05,3.9e-05,3.4e-05,0.000114,8.2e-05,0.000176,0.000165,7.8e-05,3.8e-05,5.1e-05,2.2e-05,9e-06,4.2e-05,6.1e-05,7.3e-05,1.5e-05,0.000125,9.7e-05,4.9e-05,0.000105,0.000638,0.001608,0.001159,0.00177,5.5e-05,0.000606,0.000322,0.00017,7.7e-05,0.000202,0.000588,0.000808,0.000434,0.00014,4.9e-05,1.1e-05,4.6e-05,7e-05,0.001978,0.002193,0.000504,0.000522,0.00025
2.6e-05,6.2e-05,0.000145,4.6e-05,5.7e-05,7.5e-05,0.000149,0.000117,1e-04,8.5e-05,8.3e-05,0.000327,0.000139,0.000171,0.000104,5.8e-05,2e-04,0.000197,0.000248,0.000151,0.000126,9.3e-05,0.000185,9.2e-05,5.8e-05,6.3e-05,6.3e-05,3.1e-05,8.2e-05,5.4e-05,0.000178,0.000169,0.000141,6.6e-05,9.7e-05,8.7e-05,9.3e-05,0.000156,7.5e-05,0.000188,8.8e-05,5.9e-05,6.7e-05,8e-06,0.000116,0.000109,0.000134,8.6e-05,5.7e-05,7.2e-05,6.3e-05,1.1e-05,7.1e-05,4.6e-05,0.000178,0.000205,2.9e-05,4e-05,1.2e-05,0.000181,0.000222,0.000166,0.000134,3e-05,0.000127,0.000207,3.4e-05,5.6e-05,4.8e-05,0.000113,0.000157,0.000166,0.000125,3.8e-05,6e-06,2.6e-05,2.4e-05,3.5e-05,2.2e-05,5.5e-05,5.4e-05,7.1e-05,0.000121,0.000171,8.9e-05,5.3e-05,1.6e-05,3.9e-05,2.1e-05,9e-06,5e-05,7.1e-05,5.4e-05,5.2e-05,9.5e-05,7.5e-05,7.1e-05,8.8e-05,0.000449,0.002103,0.000514,0.00156,0.001435,8e-05,0.000124,0.000157,1e-04,9.5e-05,0.000539,8.8e-05,0.000131,6.8e-05,0,5.6e-05,5.5e-05,1.5e-05,0.00204,0.001825,0.001746,0.000645,0.000243
0.000118,0.00014,0.00027,0.000235,7.5e-05,0.000119,0.000265,7.5e-05,0.000106,4.6e-05,3.9e-05,0.000193,0.000116,0.000116,0.000145,0.000151,0.000161,6.6e-05,0.000142,4.1e-05,7.7e-05,0.000101,0.000225,0.000215,7e-05,9.9e-05,9.5e-05,5.7e-05,6.9e-05,3.7e-05,0.000191,0.000277,6.7e-05,4.3e-05,8.6e-05,0.000137,0.000104,3.8e-05,3.5e-05,0.000143,0.000108,5.7e-05,7.6e-05,9.6e-05,5.4e-05,6.1e-05,9.4e-05,5.9e-05,2e-05,2.5e-05,2.2e-05,5.8e-05,5.2e-05,3e-05,0.000133,0.000134,0.000122,0.000128,7.3e-05,0.00012,0.000118,6.6e-05,0.000176,0.000201,0.000164,9e-05,0.00016,0.000184,0.000151,8.8e-05,0.000147,0.000154,7e-05,3.1e-05,5.7e-05,6.1e-05,8.1e-05,4.4e-05,2.5e-05,2.2e-05,5.1e-05,3.2e-05,5e-05,0.00011,1e-04,7.3e-05,4.2e-05,4.6e-05,2.1e-05,2.1e-05,2.7e-05,1.6e-05,2.8e-05,3.5e-05,2.8e-05,2e-05,2.8e-05,0.000136,0.000377,0.002031,0.001414,0.00183,0.001093,0.000608,0.000257,0.000156,3.9e-05,4.8e-05,0.000465,0.00012,0.000111,7.8e-05,7.5e-05,8.1e-05,2.5e-05,4.6e-05,0.002015,0.001172,0.000117,0.000249,0.000115
0.000105,6.2e-05,0.000224,0.000176,0.000142,3.8e-05,0.000153,0.000151,0.000116,0.000103,4.8e-05,9.6e-05,4e-05,9.1e-05,2.7e-05,9.8e-05,0.000139,7.5e-05,8.5e-05,0.000164,0.000153,0.000102,0.000153,0.000229,0.000127,0.000104,0.000162,0.000239,0.000219,0.000201,0.000131,0.00013,0.000117,8.1e-05,6.4e-05,0.000126,7.3e-05,6.2e-05,6.6e-05,5.6e-05,7.7e-05,9.5e-05,5.7e-05,1.8e-05,2.2e-05,8.4e-05,2.1e-05,1.4e-05,1.6e-05,1.7e-05,2.7e-05,6.8e-05,9.9e-05,7e-05,5.8e-05,0.000107,0.000101,0.00014,8.3e-05,9.9e-05,0.000205,0.000225,0.000186,0.000103,8.9e-05,4.5e-05,0.000126,0.00014,6.7e-05,3.8e-05,0.000134,7.9e-05,4.4e-05,5e-05,9.4e-05,5.6e-05,4.8e-05,8.4e-05,4.8e-05,5.5e-05,3.8e-05,3.1e-05,1.6e-05,0.000113,0.000135,5.8e-05,1.4e-05,3.5e-05,3.6e-05,2.1e-05,3e-06,4.3e-05,4.6e-05,3e-05,6e-05,5e-05,1.6e-05,0.000125,0.000198,0.001631,0.000908,0.00139,0.000516,0.000335,0.000253,8e-05,7.1e-05,8.1e-05,0.000359,0.000395,0.000172,0.000125,3.1e-05,3.9e-05,3.4e-05,5.2e-05,0.001839,0.003829,0.003345,0.001306,0.00039
2.6e-05,7.8e-05,0.000142,8e-06,4e-05,3.1e-05,0.000103,0.000105,0.000161,0.000126,6.1e-05,8.1e-05,6.4e-05,7e-05,2.6e-05,5.8e-05,3.7e-05,2.4e-05,4.5e-05,0.000145,3.6e-05,8.7e-05,4.5e-05,0.000128,9.3e-05,4.9e-05,0.000141,0.000172,8.2e-05,2.7e-05,7.2e-05,5.3e-05,2.5e-05,7.7e-05,7.3e-05,7.5e-05,8e-06,1.7e-05,5.2e-05,7e-05,2.7e-05,5e-05,3.6e-05,3e-05,4.8e-05,0.000107,4.6e-05,2.4e-05,6e-06,6e-06,4.1e-05,7.4e-05,2.6e-05,4.1e-05,8.5e-05,6.4e-05,0.000108,1.3e-05,2.5e-05,3.9e-05,8.7e-05,9.6e-05,4.5e-05,5.1e-05,6.1e-05,3.6e-05,9.2e-05,5.3e-05,7.3e-05,7.3e-05,1.5e-05,3.5e-05,5.8e-05,2.9e-05,4.9e-05,1e-05,3.5e-05,5.7e-05,4.8e-05,5.8e-05,2.6e-05,3.1e-05,4.4e-05,0.000146,9.5e-05,5.4e-05,1.8e-05,2.9e-05,2.4e-05,2e-05,1.2e-05,4.1e-05,4.3e-05,3.1e-05,3.1e-05,5.2e-05,6.6e-05,3.2e-05,0.000284,0.001295,0.000331,0.00037,3.4e-05,7.5e-05,5.7e-05,4.9e-05,5e-05,5.5e-05,0.00018,0.000455,0.000221,4.7e-05,7.1e-05,2.1e-05,1.8e-05,3.9e-05,0.001515,0.003481,0.001375,0.00061,0.000385
2.9e-05,2.9e-05,4.4e-05,3.1e-05,1.7e-05,1e-05,4.2e-05,1.6e-05,3.4e-05,3.8e-05,5.3e-05,7.9e-05,3.8e-05,2.6e-05,4.5e-05,1.8e-05,3.5e-05,2.1e-05,1.6e-05,4.3e-05,2.4e-05,4.2e-05,3.6e-05,2.9e-05,4.1e-05,4.8e-05,2.7e-05,1.7e-05,4e-05,3.1e-05,1.2e-05,1.4e-05,1.3e-05,2.7e-05,2.3e-05,2.6e-05,2.8e-05,2.1e-05,2.6e-05,4.3e-05,2.9e-05,2.7e-05,1.4e-05,2.6e-05,4e-06,2.2e-05,2e-05,8e-06,2.1e-05,1.8e-05,1.5e-05,2.4e-05,3.6e-05,1.7e-05,4.1e-05,3.8e-05,1.4e-05,2.1e-05,8e-06,2.1e-05,2.9e-05,1.7e-05,1.1e-05,1.5e-05,1.3e-05,2.5e-05,3.8e-05,1.3e-05,6e-06,3e-06,1.5e-05,1.1e-05,1.8e-05,1.3e-05,1e-05,4e-06,1.9e-05,2e-06,1.3e-05,1.9e-05,6e-06,2.8e-05,2.8e-05,4.3e-05,2.3e-05,5e-06,3e-06,1.2e-05,6e-06,1.5e-05,5e-06,1e-05,1e-05,1.8e-05,1e-05,2.4e-05,1.1e-05,1.1e-05,0.000163,0.00042,0.00033,0.000403,0.000183,7.4e-05,4.4e-05,2.5e-05,4.2e-05,4.6e-05,4e-05,8.4e-05,5.5e-05,3e-05,1e-05,2.1e-05,1.2e-05,1.4e-05,0.00057,0.000617,0.000431,0.000112,9.5e-05
1.3e-05,2e-05,4.8e-05,2.2e-05,2.5e-05,3.4e-05,4.5e-05,1.9e-05,1.7e-05,3.2e-05,4e-06,6.9e-05,2.6e-05,6e-06,2.9e-05,2.4e-05,1.6e-05,9e-06,2.2e-05,5.1e-05,3.6e-05,5.2e-05,4e-06,2.6e-05,1.7e-05,3.1e-05,3.4e-05,9e-06,2.1e-05,9e-06,5e-06,1.2e-05,2e-05,2.9e-05,3.4e-05,3.3e-05,1.8e-05,1.2e-05,2.9e-05,2e-05,1.7e-05,1.8e-05,2e-05,1e-05,1.6e-05,6e-06,1.3e-05,1.8e-05,2.4e-05,9e-06,2.5e-05,1.2e-05,2.2e-05,2.1e-05,2.7e-05,1.4e-05,1e-05,5e-06,6e-06,1.2e-05,2.8e-05,4e-05,1.8e-05,1.8e-05,3.8e-05,7e-06,3e-06,3.1e-05,9e-06,1.5e-05,2e-05,4e-06,2.3e-05,2.8e-05,1.2e-05,8e-06,1e-05,7e-06,1.2e-05,1.1e-05,1.7e-05,2.5e-05,1e-05,4.9e-05,3.3e-05,2e-05,1.1e-05,3e-06,7e-06,1.6e-05,1.4e-05,1.5e-05,1.1e-05,1.2e-05,9e-06,1.3e-05,1e-05,1.6e-05,0.000169,0.000169,0.000159,0.000281,0.00018,5.4e-05,1.9e-05,1.4e-05,2.9e-05,1.5e-05,3.5e-05,8.1e-05,4.6e-05,2.2e-05,5e-06,1.2e-05,1.2e-05,2.4e-05,0.000342,0.000553,0.000132,0.000158,2.5e-05
1.1e-05,1.4e-05,1.4e-05,2.6e-05,1.7e-05,2.4e-05,1.7e-05,1e-06,1.5e-05,2.7e-05,2.3e-05,3.9e-05,2.9e-05,1.5e-05,1.9e-05,4e-06,6e-06,1.2e-05,2.8e-05,4.5e-05,2e-05,9e-06,2.6e-05,2e-06,1.3e-05,1.1e-05,2.5e-05,1e-05,7e-06,2.4e-05,1.1e-05,9e-06,1.8e-05,6e-06,1e-05,1.1e-05,1e-05,1.6e-05,2e-05,6e-06,1.7e-05,5e-06,1.5e-05,1e-06,1.8e-05,8e-06,8e-06,9e-06,1e-05,1e-05,1.2e-05,5e-06,2.1e-05,8e-06,6e-06,1.5e-05,1.9e-05,2.4e-05,1.6e-05,2e-05,3.8e-05,2.1e-05,4e-06,2.6e-05,2.2e-05,1.7e-05,2.1e-05,6e-06,1.6e-05,1.3e-05,1.6e-05,1.2e-05,1.6e-05,8e-06,1.6e-05,2e-06,6e-06,6e-06,1.7e-05,9e-06,1.3e-05,6e-06,6e-06,4e-05,3.3e-05,1.8e-05,8e-06,7e-06,2e-06,6e-06,5e-06,7e-06,7e-06,7e-06,7e-06,1e-05,7e-06,1.1e-05,0.000188,0.00016,0.000172,0.000188,3.4e-05,4.6e-05,2.5e-05,2e-05,1.4e-05,1.8e-05,4.2e-05,2.5e-05,5.1e-05,2e-05,1e-06,9e-06,1.8e-05,2e-05,0.000162,0.000494,0.000522,0.000169,4.6e-05
1.3e-05,8e-06,6e-06,2.1e-05,2.4e-05,9e-06,1.9e-05,1.8e-05,1.5e-05,1.7e-05,2.5e-05,3.6e-05,3e-05,1.1e-05,9e-06,1.1e-05,8e-06,1e-06,1.7e-05,1.8e-05,2.6e-05,2.1e-05,1.3e-05,1.8e-05,2.9e-05,1.8e-05,1.6e-05,5e-06,9e-06,7e-06,9e-06,5e-06,1.1e-05,1.4e-05,9e-06,3e-06,8e-06,1.2e-05,7e-06,7e-06,9e-06,1e-06,1.6e-05,8e-06,1.5e-05,6e-06,6e-06,7e-06,5e-06,7e-06,1e-05,2e-06,1.8e-05,1.1e-05,1.8e-05,2.2e-05,2.5e-05,2.7e-05,1.5e-05,1.9e-05,7e-06,1.2e-05,2.2e-05,4e-06,1.2e-05,1.3e-05,5e-06,4e-06,7e-06,1e-05,5e-06,1.2e-05,1.8e-05,1.2e-05,1.4e-05,6e-06,8e-06,6e-06,6e-06,9e-06,3e-06,1e-06,6e-06,3e-05,3.3e-05,1.4e-05,5e-06,6e-06,5e-06,4e-06,2e-06,2e-06,7e-06,3e-06,4e-06,1.1e-05,1.4e-05,2.3e-05,0.00022,0.000212,1.5e-05,0.000379,0.000208,5.5e-05,1.8e-05,7e-06,2.2e-05,1.6e-05,2.2e-05,9.2e-05,1.6e-05,1.2e-05,1.1e-05,1.8e-05,1e-05,1.6e-05,1.9e-05,0.000345,8.8e-05,7.9e-05,4.2e-05
1.8e-05,2.2e-05,2.1e-05,1e-05,9e-06,1.7e-05,1.3e-05,1.6e-05,2.2e-05,9e-06,1.5e-05,3e-05,1.9e-05,2e-05,1.2e-05,1.4e-05,5e-06,1.1e-05,1e-05,1.1e-05,2.3e-05,1.9e-05,1.3e-05,1.6e-05,1.2e-05,3e-06,4e-06,1.5e-05,1.6e-05,2.1e-05,1.6e-05,1e-05,2e-06,6e-06,9e-06,1.1e-05,4e-06,1.2e-05,5e-06,7e-06,9e-06,3e-06,1.4e-05,1.4e-05,4e-06,8e-06,8e-06,7e-06,1.1e-05,8e-06,1e-05,9e-06,6e-06,4e-06,1.1e-05,8e-06,1.5e-05,4e-06,1.1e-05,8e-06,1.9e-05,3e-06,1.3e-05,5e-06,1.1e-05,1.1e-05,1.5e-05,3e-06,2e-06,1.2e-05,0,6e-06,1.3e-05,1.6e-05,9e-06,4e-06,5e-06,3e-06,4e-06,7e-06,8e-06,3e-06,6e-06,2.9e-05,2.1e-05,1.2e-05,9e-06,1e-06,1e-06,4e-06,3e-06,9e-06,6e-06,4e-06,4e-06,7e-06,8e-06,9e-06,0.000198,0.000116,0.000145,0.000303,0.000141,3.2e-05,1.3e-05,1.5e-05,1e-05,6e-06,4.4e-05,5.8e-05,2.4e-05,1.3e-05,1.1e-05,1.3e-05,1e-05,8e-06,0.000143,0.000377,0.000158,3.3e-05,2.9e-05
9e-06,4e-06,9e-06,2e-06,1e-05,8e-06,8e-06,1e-05,1.7e-05,1e-05,2e-06,3.9e-05,1.3e-05,8e-06,1.4e-05,9e-06,4e-06,9e-06,8e-06,2e-05,1.7e-05,5e-06,4e-06,5e-06,1.1e-05,9e-06,7e-06,1.2e-05,5e-06,1.4e-05,9e-06,7e-06,6e-06,4e-06,9e-06,0,1e-06,3e-06,5e-06,3e-06,4e-06,4e-06,5e-06,1e-06,9e-06,5e-06,7e-06,4e-06,5e-06,3e-06,6e-06,2e-06,3e-06,7e-06,1.3e-05,4e-06,1.8e-05,9e-06,6e-06,4e-06,1.2e-05,9e-06,7e-06,6e-06,1.2e-05,7e-06,7e-06,2e-06,4e-06,8e-06,6e-06,3e-06,1.8e-05,5e-06,6e-06,4e-06,9e-06,9e-06,0,7e-06,7e-06,4e-06,5e-06,2.3e-05,8e-06,3e-06,5e-06,4e-06,3e-06,2e-06,0,1e-05,9e-06,5e-06,4e-06,3e-06,6e-06,1.4e-05,0.000153,3.7e-05,0.000115,0.000103,9.3e-05,8e-06,1.1e-05,1.3e-05,1.5e-05,2.4e-05,5.2e-05,7.5e-05,3e-05,1.1e-05,1.1e-05,7e-06,7e-06,9e-06,0.000227,0.000415,0.000398,0.000104,3e-06
0,4e-06,6e-06,7e-06,8e-06,1.3e-05,5e-06,1.4e-05,1e-05,2e-06,1e-05,3.2e-05,1e-05,2e-06,7e-06,8e-06,7e-06,6e-06,7e-06,1.3e-05,1e-05,4e-06,3e-06,3e-06,1.1e-05,1e-05,1.2e-05,1.1e-05,5e-06,1.1e-05,4e-06,8e-06,2e-06,7e-06,1e-05,1e-05,5e-06,7e-06,1e-06,6e-06,7e-06,4e-06,8e-06,8e-06,2e-06,2e-06,3e-06,2e-06,1e-06,1e-06,2e-06,9e-06,4e-06,4e-06,9e-06,5e-06,9e-06,2e-06,6e-06,4e-06,1e-05,6e-06,5e-06,7e-06,8e-06,5e-06,1.1e-05,2e-06,4e-06,6e-06,3e-06,7e-06,1.7e-05,4e-06,1e-05,4e-06,6e-06,5e-06,3e-06,6e-06,5e-06,2e-06,1e-06,1.9e-05,1e-06,5e-06,2e-06,3e-06,5e-06,3e-06,2e-06,2e-06,7e-06,8e-06,6e-06,5e-06,8e-06,3.1e-05,0.000108,6.5e-05,4.8e-05,0.000235,0.000146,1.5e-05,1e-05,5e-06,1.1e-05,2.7e-05,6.5e-05,8.5e-05,1.7e-05,6e-06,1.5e-05,2.8e-05,1.3e-05,7e-06,0.000248,0.000417,0.000171,8.7e-05,8e-06
6e-06,5e-06,8e-06,7e-06,9e-06,1.8e-05,4e-06,1e-05,4e-06,9e-06,2e-06,3.1e-05,6e-06,4e-06,2e-06,1e-05,1.2e-05,7e-06,7e-06,1.1e-05,8e-06,2e-06,4e-06,8e-06,8e-06,5e-06,8e-06,1e-06,2e-06,8e-06,9e-06,6e-06,5e-06,4e-06,8e-06,5e-06,1.2e-05,9e-06,0,9e-06,4e-06,2e-06,4e-06,8e-06,3e-06,2e-06,1e-06,1e-06,4e-06,3e-06,1e-06,6e-06,7e-06,3e-06,1.1e-05,3e-06,8e-06,1e-06,6e-06,1e-06,6e-06,4e-06,2e-06,6e-06,7e-06,4e-06,6e-06,3e-06,2e-06,3e-06,6e-06,1.1e-05,8e-06,4e-06,1e-05,5e-06,7e-06,3e-06,4e-06,7e-06,7e-06,6e-06,4e-06,1.4e-05,5e-06,9e-06,7e-06,4e-06,4e-06,1e-06,4e-06,8e-06,3e-06,6e-06,1e-05,5e-06,1.1e-05,2.6e-05,7.2e-05,0.000127,7.3e-05,0.000429,0.000203,4.2e-05,2e-05,6e-06,7e-06,2.6e-05,8.9e-05,2.1e-05,5e-06,1.1e-05,1.8e-05,1.9e-05,7e-06,1.4e-05,0.000271,0.000197,8.8e-05,1.4e-05,2.4e-05
1.7e-05,6e-06,7e-06,7e-06,1.1e-05,1.1e-05,1e-05,8e-06,1.3e-05,5e-06,5e-06,3.1e-05,2.3e-05,1.5e-05,8e-06,1.1e-05,8e-06,6e-06,5e-06,1.6e-05,2e-06,2e-06,5e-06,4e-06,7e-06,1e-05,4e-06,3e-06,5e-06,6e-06,5e-06,7e-06,4e-06,8e-06,8e-06,4e-06,3e-06,4e-06,1e-06,1e-05,6e-06,3e-06,3e-06,6e-06,7e-06,5e-06,6e-06,2e-06,2e-06,6e-06,4e-06,3e-06,4e-06,3e-06,1e-05,7e-06,9e-06,1e-06,8e-06,1e-06,5e-06,4e-06,9e-06,5e-06,1.1e-05,2e-06,1e-05,5e-06,3e-06,1e-06,2e-06,7e-06,1.4e-05,2e-06,8e-06,5e-06,3e-06,4e-06,2e-06,7e-06,3e-06,3e-06,4e-06,1.6e-05,1e-05,1e-06,4e-06,5e-06,3e-06,3e-06,3e-06,9e-06,2e-06,6e-06,6e-06,3e-06,8e-06,1.3e-05,3.4e-05,0.00015,0.000101,0.000353,0.000246,0.00011,2.6e-05,6e-06,2e-06,8e-06,0.000109,3.2e-05,2.6e-05,2.1e-05,2e-05,8e-06,3e-06,1.1e-05,0.00025,0.000171,0.000173,4e-05,1.4e-05
1.3e-05,1.1e-05,2e-06,3e-06,6e-06,6e-06,1.1e-05,9e-06,1.1e-05,1.1e-05,0,2.4e-05,1.2e-05,7e-06,6e-06,5e-06,9e-06,7e-06,7e-06,1.7e-05,4e-06,2e-06,6e-06,9e-06,4e-06,1.1e-05,6e-06,6e-06,1e-05,1e-06,5e-06,1e-05,6e-06,1e-06,4e-06,2e-06,4e-06,7e-06,2e-06,8e-06,1e-06,1e-06,8e-06,1e-06,4e-06,5e-06,3e-06,3e-06,3e-06,2e-06,2e-06,5e-06,2e-06,1e-06,7e-06,5e-06,8e-06,4e-06,6e-06,2e-06,8e-06,7e-06,7e-06,4e-06,8e-06,2e-06,9e-06,8e-06,3e-06,6e-06,4e-06,6e-06,9e-06,6e-06,6e-06,1e-06,8e-06,3e-06,6e-06,1e-05,5e-06,9e-06,3e-06,1.1e-05,9e-06,6e-06,3e-06,0,1e-06,2e-06,3e-06,7e-06,6e-06,2e-06,1.1e-05,5e-06,1e-06,8e-06,6.9e-05,8.1e-05,2.1e-05,9.8e-05,0.000142,2.5e-05,2e-05,2.3e-05,2.1e-05,7e-06,6.7e-05,0.000102,2.1e-05,6e-06,7e-06,3e-06,3e-06,8e-06,0.000227,0.000211,0.000285,6.9e-05,3.4e-05
1.2e-05,1.1e-05,8e-06,4e-06,6e-06,4e-06,5e-06,3e-06,1.5e-05,1.2e-05,4e-06,1.9e-05,1.7e-05,1.4e-05,3e-06,6e-06,5e-06,2e-06,7e-06,9e-06,1.1e-05,4e-06,5e-06,5e-06,1.1e-05,3e-06,4e-06,8e-06,5e-06,1.1e-05,9e-06,3e-06,4e-06,4e-06,5e-06,1e-06,7e-06,3e-06,4e-06,1e-06,9e-06,0,7e-06,3e-06,4e-06,3e-06,2e-06,2e-06,6e-06,3e-06,2e-06,3e-06,1e-06,3e-06,5e-06,1e-05,6e-06,5e-06,6e-06,1e-06,7e-06,7e-06,7e-06,5e-06,7e-06,4e-06,8e-06,6e-06,5e-06,7e-06,1e-06,6e-06,1.8e-05,2e-06,1e-05,5e-06,1e-05,9e-06,1.5e-05,3e-06,1.2e-05,1e-05,8e-06,7e-06,7e-06,5e-06,5e-06,1e-06,4e-06,3e-06,8e-06,6e-06,8e-06,6e-06,1.5e-05,1.7e-05,6e-06,9e-06,9.2e-05,2.3e-05,4.8e-05,0.000124,0.000125,6.7e-05,1.9e-05,2.5e-05,1.8e-05,2.4e-05,4e-05,4.3e-05,3.1e-05,2e-05,1.3e-05,1.3e-05,4e-06,7e-06,0.000193,0.000163,9.4e-05,7.5e-05,6.8e-05
8e-06,1.8e-05,1.4e-05,1.5e-05,7e-06,9e-06,6e-06,9e-06,1.4e-05,2.1e-05,1.6e-05,2.7e-05,2.4e-05,6e-06,9e-06,4e-06,4e-06,6e-06,2e-06,1e-05,7e-06,5e-06,1e-06,5e-06,9e-06,1e-06,9e-06,1.1e-05,6e-06,9e-06,5e-06,3e-06,5e-06,3e-06,3e-06,6e-06,1.2e-05,5e-06,3e-06,2e-06,6e-06,7e-06,1e-05,2e-06,8e-06,5e-06,1e-06,3e-06,5e-06,4e-06,2e-06,2e-06,3e-06,3e-06,4e-06,9e-06,6e-06,4e-06,6e-06,5e-06,0,5e-06,3e-06,9e-06,5e-06,3e-06,2e-06,5e-06,4e-06,4e-06,3e-06,7e-06,6e-06,5e-06,7e-06,6e-06,5e-06,2e-06,1.7e-05,1.3e-05,2.7e-05,1.6e-05,1e-05,7e-06,1.8e-05,1.4e-05,5e-06,7e-06,1e-05,9e-06,6e-06,7e-06,6e-06,8e-06,1.6e-05,1e-05,1.7e-05,1.3e-05,0.000112,0.000118,7.7e-05,0.000159,0.000133,0.000103,4.4e-05,1.9e-05,1.6e-05,1.3e-05,8.3e-05,3e-05,3e-06,8e-06,3e-06,1.5e-05,1.4e-05,6e-06,0.000151,0.00047,0.000323,0.000148,5.9e-05
8e-06,1.1e-05,9e-06,7e-06,1e-05,4e-06,1.2e-05,1.1e-05,6e-06,1.2e-05,1e-05,1.5e-05,1.4e-05,8e-06,8e-06,6e-06,3e-06,6e-06,6e-06,1.4e-05,6e-06,2e-06,1e-06,5e-06,4e-06,3e-06,6e-06,5e-06,3e-06,4e-06,3e-06,4e-06,5e-06,8e-06,2e-06,4e-06,1.1e-05,7e-06,8e-06,5e-06,4e-06,3e-06,3e-06,2e-06,3e-06,1e-06,4e-06,0,6e-06,8e-06,5e-06,4e-06,2e-06,2e-06,7e-06,8e-06,6e-06,7e-06,5e-06,4e-06,7e-06,4e-06,1e-06,4e-06,7e-06,1e-06,4e-06,5e-06,1e-06,7e-06,2e-06,6e-06,1.2e-05,4e-06,8e-06,1e-06,7e-06,7e-06,1.8e-05,1e-05,1.7e-05,1.2e-05,1e-05,5e-06,1.8e-05,9e-06,7e-06,5e-06,6e-06,2e-06,7e-06,9e-06,4e-06,9e-06,7e-06,9e-06,7e-06,2.4e-05,9.7e-05,0.00021,8.8e-05,6.5e-05,9.4e-05,3.5e-05,4.4e-05,1.3e-05,1.1e-05,1.7e-05,6e-05,8.1e-05,1.6e-05,4e-06,6e-06,9e-06,1.4e-05,9e-06,0.000105,0.000483,0.000356,0.000104,1.9e-05
4e-06,8e-06,8e-06,6e-06,7e-06,9e-06,1e-05,5e-06,4e-06,9e-06,8e-06,2e-05,2.9e-05,1.4e-05,4e-06,2e-06,3e-06,7e-06,4e-06,1.5e-05,2e-06,2e-06,1e-06,8e-06,1.1e-05,6e-06,5e-06,1e-06,2e-06,0,6e-06,6e-06,2e-06,6e-06,5e-06,3e-06,8e-06,5e-06,5e-06,3e-06,4e-06,2e-06,6e-06,6e-06,4e-06,5e-06,3e-06,2e-06,4e-06,4e-06,1e-06,3e-06,1e-06,2e-06,2e-06,8e-06,3e-06,1e-06,3e-06,3e-06,3e-06,3e-06,5e-06,8e-06,2e-06,5e-06,1e-06,2e-06,2e-06,4e-06,4e-06,6e-06,1.3e-05,4e-06,3e-06,4e-06,7e-06,5e-06,8e-06,5e-06,8e-06,4e-06,7e-06,4e-06,1.3e-05,7e-06,2e-06,2e-06,6e-06,9e-06,8e-06,3e-06,2e-06,3e-06,1e-05,5e-06,2e-06,1.7e-05,1e-04,0.000102,0.000118,0.000476,0.000298,0.000133,6.1e-05,1.8e-05,2.6e-05,2.9e-05,6e-05,3e-06,3e-05,1.1e-05,1.6e-05,1.3e-05,1.3e-05,4e-06,5.7e-05,0.000233,0.000137,2e-05,2.6e-05
3e-06,8e-06,1.3e-05,1e-05,4e-06,8e-06,1.2e-05,1.3e-05,1e-05,1.4e-05,1.8e-05,2.7e-05,2.4e-05,1.3e-05,4e-06,7e-06,5e-06,1e-05,1e-05,1.4e-05,5e-06,3e-06,4e-06,8e-06,2e-06,6e-06,5e-06,1e-05,5e-06,3e-06,5e-06,4e-06,5e-06,5e-06,4e-06,2e-06,5e-06,5e-06,2e-06,4e-06,4e-06,8e-06,8e-06,7e-06,2e-06,1e-06,2e-06,3e-06,3e-06,4e-06,4e-06,2e-06,1e-06,1e-06,7e-06,5e-06,4e-06,1e-06,2e-06,4e-06,5e-06,6e-06,5e-06,4e-06,4e-06,2e-06,4e-06,6e-06,5e-06,9e-06,4e-06,2e-06,8e-06,4e-06,8e-06,5e-06,2e-06,1e-06,4e-06,7e-06,8e-06,6e-06,1e-05,5e-06,6e-06,3e-06,0,0,3e-06,7e-06,5e-06,3e-06,0,4e-06,9e-06,3e-06,4e-06,4e-06,8.6e-05,0.00012,6.1e-05,0.000647,0.000411,0.000177,3.3e-05,1.7e-05,3.2e-05,7e-06,3.5e-05,0.000116,4.4e-05,1.1e-05,2.5e-05,2e-05,1.3e-05,1.2e-05,3.9e-05,0.000271,0.00018,7.5e-05,2.3e-05
1.6e-05,4e-06,1.2e-05,5e-06,5e-06,8e-06,4e-06,8e-06,9e-06,4e-06,4e-06,3.3e-05,1.2e-05,5e-06,1.1e-05,1.3e-05,5e-06,6e-06,7e-06,4e-06,3e-06,8e-06,4e-06,4e-06,7e-06,5e-06,4e-06,5e-06,1e-06,1e-06,1e-06,5e-06,4e-06,6e-06,6e-06,4e-06,3e-06,4e-06,5e-06,2e-06,3e-06,8e-06,9e-06,1e-05,5e-06,2e-06,6e-06,2e-06,3e-06,2e-06,2e-06,3e-06,2e-06,2e-06,1.1e-05,4e-06,4e-06,4e-06,6e-06,2e-06,4e-06,7e-06,5e-06,2e-06,3e-06,5e-06,7e-06,5e-06,1e-06,7e-06,2e-06,5e-06,1.1e-05,5e-06,1e-06,1e-06,2e-06,7e-06,1e-05,2e-06,6e-06,2e-06,1e-06,3e-06,5e-06,9e-06,5e-06,2e-06,1e-06,5e-06,3e-06,3e-06,2e-06,4e-06,6e-06,1e-06,3e-06,1.4e-05,7.5e-05,0.000239,0.000197,0.000599,0.000547,0.000265,7.2e-05,8e-06,1.7e-05,1.4e-05,2.4e-05,0.000116,4.7e-05,2.6e-05,9e-06,6e-06,6e-06,1.1e-05,0.000105,0.000466,0.000182,8.7e-05,7e-06
7e-06,7e-06,5e-06,8e-06,1e-06,5e-06,5e-06,2e-06,1e-05,2e-06,4e-06,3e-05,1e-05,2e-06,8e-06,1e-06,2e-06,4e-06,2e-06,1e-05,1e-06,5e-06,4e-06,2e-06,7e-06,6e-06,1e-06,3e-06,2e-06,2e-06,7e-06,2e-06,4e-06,4e-06,6e-06,4e-06,4e-06,2e-06,3e-06,3e-06,2e-06,3e-06,3e-06,4e-06,3e-06,4e-06,2e-06,2e-06,6e-06,3e-06,2e-06,3e-06,3e-06,3e-06,7e-06,5e-06,4e-06,3e-06,5e-06,3e-06,5e-06,5e-06,4e-06,2e-06,2e-06,5e-06,4e-06,3e-06,2e-06,5e-06,2e-06,6e-06,8e-06,4e-06,3e-06,1e-06,2e-06,7e-06,4e-06,4e-06,6e-06,3e-06,4e-06,4e-06,8e-06,4e-06,2e-06,2e-06,2e-06,2e-06,2e-06,2e-06,2e-06,0,5e-06,2e-06,6e-06,1.7e-05,6.6e-05,0.000206,0.000132,0.000549,0.000345,0.000127,3.8e-05,1.2e-05,3e-06,1e-06,2.7e-05,8.3e-05,1.7e-05,1.8e-05,9e-06,5e-06,3e-06,9e-06,0.00015,0.000247,0.000198,1.7e-05,3.7e-05
4e-06,4e-06,6e-06,5e-06,2e-06,4e-06,1e-06,0,1e-05,3e-06,6e-06,2.3e-05,6e-06,7e-06,7e-06,4e-06,1e-06,2e-06,2e-06,9e-06,1e-06,1e-06,2e-06,2e-06,4e-06,4e-06,2e-06,3e-06,0,0,7e-06,5e-06,4e-06,2e-06,3e-06,2e-06,4e-06,2e-06,2e-06,2e-06,1e-06,2e-06,4e-06,3e-06,2e-06,3e-06,3e-06,1e-06,3e-06,1e-06,2e-06,3e-06,2e-06,0,6e-06,3e-06,3e-06,3e-06,6e-06,2e-06,4e-06,4e-06,5e-06,2e-06,3e-06,3e-06,4e-06,2e-06,1e-06,6e-06,2e-06,4e-06,9e-06,2e-06,5e-06,1e-06,1e-06,5e-06,3e-06,2e-06,2e-06,3e-06,2e-06,3e-06,7e-06,1e-06,2e-06,2e-06,1e-06,1e-06,2e-06,4e-06,2e-06,2e-06,5e-06,1e-06,5e-06,1.1e-05,5.4e-05,0.000106,2.6e-05,0.000316,9.8e-05,2.8e-05,1e-05,1.6e-05,3e-06,4e-06,4.5e-05,4.8e-05,6e-06,6e-06,1e-06,7e-06,6e-06,3e-06,0.000182,7e-05,0.000141,3e-06,1.5e-05
2e-06,5e-06,5e-06,5e-06,1e-06,5e-06,2e-06,2e-06,1e-05,2e-06,4e-06,1.4e-05,2e-06,3e-06,5e-06,2e-06,1e-06,1e-06,2e-06,9e-06,1e-06,2e-06,2e-06,2e-06,6e-06,4e-06,3e-06,2e-06,2e-06,2e-06,5e-06,1e-06,2e-06,4e-06,3e-06,2e-06,3e-06,2e-06,2e-06,1e-06,1e-06,1e-06,4e-06,2e-06,0,0,3e-06,1e-06,3e-06,1e-06,1e-06,3e-06,1e-06,0,5e-06,4e-06,3e-06,1e-06,4e-06,1e-06,4e-06,4e-06,4e-06,3e-06,3e-06,3e-06,4e-06,2e-06,1e-06,4e-06,1e-06,3e-06,1e-05,2e-06,5e-06,1e-06,1e-06,4e-06,3e-06,1e-06,2e-06,2e-06,3e-06,2e-06,5e-06,1e-06,1e-06,1e-06,1e-06,0,1e-06,3e-06,1e-06,1e-06,4e-06,0,3e-06,1.1e-05,4.4e-05,3.7e-05,5e-06,0.000147,3.7e-05,1.2e-05,8e-06,1.1e-05,3e-06,5e-06,4.4e-05,5.8e-05,2e-06,7e-06,6e-06,5e-06,6e-06,2e-06,0.000186,0.000109,8.7e-05,1.2e-05,8e-06
1e-06,4e-06,5e-06,4e-06,2e-06,4e-06,1e-06,1e-06,9e-06,2e-06,4e-06,1.3e-05,4e-06,2e-06,2e-06,4e-06,1e-06,1e-06,0,1e-05,2e-06,1e-06,2e-06,1e-06,6e-06,5e-06,1e-06,3e-06,1e-06,1e-06,4e-06,3e-06,2e-06,5e-06,2e-06,2e-06,3e-06,3e-06,1e-06,1e-06,1e-06,1e-06,4e-06,2e-06,1e-06,1e-06,2e-06,1e-06,4e-06,1e-06,0,3e-06,1e-06,1e-06,5e-06,4e-06,4e-06,2e-06,4e-06,1e-06,4e-06,4e-06,3e-06,2e-06,3e-06,3e-06,4e-06,1e-06,1e-06,5e-06,1e-06,5e-06,8e-06,2e-06,5e-06,0,1e-06,4e-06,2e-06,1e-06,2e-06,2e-06,2e-06,2e-06,4e-06,1e-06,1e-06,1e-06,0,1e-06,1e-06,2e-06,1e-06,1e-06,4e-06,1e-06,3e-06,1e-05,4.1e-05,2.4e-05,9e-06,2.4e-05,6.5e-05,1.9e-05,6e-06,1e-05,1e-06,5e-06,3.8e-05,5.2e-05,3e-06,4e-06,2e-06,3e-06,6e-06,7e-06,0.000174,7.3e-05,0.000118,1e-06,2e-06
