-0.002407,-0.001279,-0.002425,-0.001908,-0.00301,-0.003467,-0.003894,-0.004037,-0.002447,-0.002383,-0.00187,-0.001585,-0.002646,-0.005822,-0.005854,-0.003542,-0.003363,-0.003217,-0.003155,-0.002902,-0.004241,-0.003463,-0.003083,-0.005904,-0.004235,-0.002311,-0.001659,-0.001136,-0.000577,-0.001851,-0.00229,-0.002137,-0.001926,-0.003037,-0.002433,-0.003341,-0.003239,-0.003607,-0.002018,-0.001777,-0.002712,-0.002045,-0.003022,-0.005632,-0.003532,-0.002862,-0.003255,-0.002706,-0.002819,-0.003307,-0.001004,-0.001172,-0.003175,-0.003974,-0.004089,-0.004113,-0.00292,-0.001724,-0.003867,-0.003763,-0.004256,-0.003022,-0.002451,-0.002384,-0.002245,-0.002356,-0.001958,-0.003625,-0.001225,-0.002482,-0.000803,-0.004353,-0.003092,-0.001066,-0.001952,-0.003647,-0.003295,-0.002385,-0.003128,-0.002407,-0.003198,-0.002364,-0.002323,-0.00122,-0.001447,-0.001054,-0.002197,-0.001919,-0.003218,-0.001847,-0.001408,-0.000954,-0.00218,-0.002391,-0.001577,-0.002904,-0.003734,-0.00274,-0.002944,-0.00261,-0.001825,-0.002628,-0.004227,-0.002601,-0.002831,-0.001747,-0.001732,-0.001422,-0.000996,-0.0012,-0.000608,-0.001473,-0.002497,-0.001833,-0.002063,-0.001897,-0.001783,-0.002985,-0.002738,-0.002641,-0.001905
-0.000533,-0.001423,4.5e-05,0.000889,0.000639,-0.000527,0.001397,0.002652,0.00019,-0.00122,-0.001494,-0.001055,-0.00035,0.002661,0.002367,-0.000838,-0.000576,-0.000619,0.000463,0.00018,0.001888,-0.001165,0.000809,0.001489,0.000216,3.7e-05,0.000332,-0.000163,-0.002252,-0.000778,-0.000905,-0.001717,-0.000661,0.001078,0.001664,0.000766,0.001448,0.001147,0.001116,-0.000646,0.000362,0.00012,0.000631,0.002804,-0.00046,-3e-05,0.00049,0.000875,0.000702,0.001245,-0.000966,-0.001112,0.001125,0.000806,0.001241,0.000548,-0.000437,0.000262,0.001372,0.001857,0.001585,0.001105,0.000609,0.000992,0.000259,-0.000481,-0.001194,1.5e-05,-0.001768,-0.000699,-0.000601,0.001469,0.002153,0.000283,0.000483,0.000694,9.3e-05,-9.3e-05,0.000746,0.000331,0.001141,0.000553,0.000598,0.000222,-0.000503,-0.001895,-0.000497,-2.8e-05,0.001442,0.001012,0.000469,0.000244,0.000113,-8e-06,0.000153,0.001682,0.001788,0.000511,0.000555,0.000204,1.5e-05,0.000173,0.001028,0.000526,0.002002,0.000625,8.1e-05,0.000761,-0.002609,-0.001578,6.3e-05,-0.002156,-0.000822,-0.000698,0.001048,-0.000932,-0.000575,-0.000223,-0.000598,-0.000609,-0.000294
-0.000204,-4.7e-05,2.1e-05,4e-05,-0.000476,0.000566,3.7e-05,-0.001641,-0.000821,0.000877,0.000461,-0.000644,-0.000465,-0.002136,-0.00051,0.000817,0.000326,0.000739,-5.8e-05,-0.000399,-0.001658,9.2e-05,2e-06,-0.001998,-0.001966,-0.000821,-8.8e-05,0.000352,0.001346,0.000902,0.001645,0.001163,0.000608,-0.000862,-0.000644,-0.001051,-0.000921,-0.001102,-0.001304,6e-05,-0.000914,1e-06,-0.000199,0.000107,-0.000124,-0.000771,-0.001279,-0.001289,-0.001076,-0.001441,-0.000405,0.000316,-0.000743,-0.000403,-0.000638,-0.000686,0.000889,-0.001043,-0.000524,-0.000843,-0.001817,-0.000149,-0.000715,-0.00085,-0.002499,-0.000724,-0.000873,2.8e-05,-0.000515,-0.000666,-0.001035,-0.000848,-0.001774,-0.002233,-0.001679,-0.000409,-0.000477,0.000471,-0.001643,-0.000232,-0.000622,-0.000972,-0.001441,-0.000539,-0.001163,-0.001164,-0.00067,-0.000383,-0.000827,-0.001395,-0.000152,-0.000554,0.000103,1.5e-05,0.000272,-0.001272,-0.000992,-0.000113,0.000158,0.000236,6.8e-05,-0.000202,-0.000304,-0.000518,-0.000606,-0.000833,-2.8e-05,-0.000928,0.001219,0.00099,-0.000497,0.000116,0.000109,0.000429,-0.000937,-0.000605,0.000306,-0.000109,-0.000972,0.000101,0.000524
0.000259,0.00166,0.000936,-0.000542,-0.00051,4.3e-05,-5.7e-05,0.001571,0.001956,0.001186,0.000309,0.001508,0.000452,0.001398,0.000589,0.000164,0.000536,-0.000564,-0.000284,0.000263,0.000638,0.000605,0.000433,0.002416,0.002227,0.000884,-0.000232,-0.000236,-0.00013,0.000465,-0.000998,-0.000326,-0.000425,0.000293,0.000312,0.000354,-9.4e-05,0.001006,-0.000498,9.9e-05,0.000327,0.000167,-0.000528,-0.000611,0.000745,0.001325,0.001548,0.000945,-0.000248,0.000996,0.000545,0.000685,0.000906,0.000927,-3.3e-05,0.0014,0.000104,8e-04,0.000101,-0.000574,0.002069,0.000156,0.00048,0.00011,0.002561,0.001357,0.000623,-0.000423,0.000462,0.001105,0.001276,0.000605,0.001108,0.001729,0.001154,0.000335,0.00072,-0.00024,0.000853,0.000256,0.000397,0.000643,0.001201,9.8e-05,0.001379,0.002502,0.001281,0.00038,0.000117,0.001274,0.000335,0.000488,0.000213,0.000392,-0.000491,0.00103,0.000353,-0.000114,-0.000542,-0.000293,-0.000214,0.000912,0.000938,0.00044,-0.000411,0.000912,0.000476,0.000517,0.001297,0.000474,-0.00018,0.000596,0.000849,0.000249,0.000821,0.001985,0.000665,0.001548,0.002216,0.000272,0.000679
-0.00073,-0.001617,-0.000325,0.000599,0.001383,0.000247,-0.000148,-0.002176,-0.001403,-0.001487,-0.000818,-0.001421,0.000248,-0.000571,-0.001249,-0.00099,-0.000845,0.000231,0.000176,0.000123,0.000118,-0.000695,-0.001419,-0.002251,-0.001402,-0.001166,0.000301,-0.000641,-0.000951,-0.000365,8e-06,-9.4e-05,-0.000715,0.000138,-0.000843,-0.000432,0.000644,-3.4e-05,0.001688,0.000991,0.000367,-0.000569,0.00042,-0.000217,-0.000943,-0.001838,-0.000537,0.000712,0.001723,-5.8e-05,7.6e-05,-0.000467,-0.000817,-0.001346,-0.000551,-0.001646,-0.001459,-0.000478,-0.000298,6.8e-05,-0.001016,-0.000292,-0.000145,0.000153,-0.000586,-0.000934,0.000641,0.000251,0.00015,5e-06,-0.000667,-0.000417,-0.00123,-0.000431,-0.00082,-0.000534,-0.000611,-0.000231,-0.000202,-0.00016,-0.000209,-0.00051,0.000161,0.000501,-0.000908,-0.001196,-9.1e-05,-0.000445,7.3e-05,-0.000931,-0.000229,-0.000186,-1.3e-05,-0.000497,-9.1e-05,-6e-06,-0.000479,6.8e-05,0.000643,-0.000612,-0.000553,-0.001079,-0.001399,-0.00037,-0.000353,-0.000716,-2.4e-05,-0.000136,-0.001386,-0.00038,1.4e-05,7.8e-05,-0.001658,-0.001407,-0.000735,-0.001555,-0.000616,-0.001345,-0.00189,-0.001098,-0.001119
0.000987,0.000268,-0.000119,-0.000516,-0.000879,-0.00092,-0.000122,0.001195,0.00089,4.6e-05,0.000299,0.000471,-0.000159,-2e-04,0.001761,0.000655,0.000748,0.000376,0.000925,-0.000217,-0.000613,0.000481,0.001248,0.001364,0.000902,0.001228,-0.000122,0.00028,-8.5e-05,-0.000493,-0.000399,0.000436,0.000972,0.000249,0.000154,0.000858,-0.000418,-0.000164,-0.000269,-0.00053,-0.000466,0.00023,5.1e-05,5.3e-05,0.001598,0.000954,-0.001039,-0.001395,-0.001596,-0.000121,0.000145,5.8e-05,0.000136,0.000804,0.000271,0.000816,0.000994,0.000567,0.000209,0.000505,0.000617,0.000271,2.5e-05,0.000508,-0.000349,0.000699,-0.000328,0.000224,0.000657,-6.8e-05,0.000696,0.000329,0.000682,0.000435,0.000543,6e-04,0.000726,0.00085,0.000147,0.000242,0.000282,-0.000176,-0.000514,-0.000716,0.000422,-3.6e-05,-0.000891,0.000168,0.000375,7e-05,-0.000203,0.000167,-0.000556,8.3e-05,0.000396,-2.7e-05,-5.3e-05,0.000258,1.9e-05,0.000502,0.000247,-4.6e-05,0.000705,-0.000149,0.000212,0.000557,-0.000307,0.000201,0.000434,-0.000152,5.7e-05,-0.000247,0.001581,0.001301,6.9e-05,0.000514,-0.000389,0.000586,0.000798,0.000986,0.000139
-0.000497,0.000604,-3.9e-05,0.000719,0.000552,0.000614,0.000216,0.000392,-0.000945,0.000209,0.000802,0.000837,-0.000399,0.00064,-0.001563,-0.00049,-6.2e-05,-0.000732,-0.000865,-9.8e-05,0.000236,-0.000432,-0.001076,-0.000489,-2.5e-05,-0.000483,0.000312,0.000269,0.000236,0.000381,0.000199,-0.000355,-0.000272,-0.000325,-0.000221,-0.000131,0.000419,0.000482,0.000322,-0.000575,0.000158,-0.000847,-0.000127,0.000574,-0.001407,1.2e-05,0.001481,0.000598,0.000439,3e-04,-2.7e-05,-0.000125,-4e-06,-0.000482,2.7e-05,0.000298,0.000661,2.1e-05,-0.000254,-0.000692,-0.00022,0.000366,4.3e-05,-0.000577,-0.000577,-0.000581,0.000419,-0.00027,-0.00057,-0.000295,-0.000678,0.000254,5e-06,-0.001073,-0.000201,0.000125,-0.000422,-0.00029,3.1e-05,-0.001016,4e-05,0.000908,0.000229,6.4e-05,0.000275,0.000123,8.1e-05,-7.1e-05,-0.000414,0.000117,-0.000116,-0.000134,0.000194,-2.8e-05,-0.000316,-0.000309,-2e-04,-0.000788,-0.000583,0.000463,0.000678,0.000516,-0.000252,0.000281,0.000217,-0.000415,-0.000403,-0.000333,-0.000688,0.000105,-0.000113,-0.000291,-5.6e-05,-0.000323,0.000265,-0.000267,0.000687,0.000427,-2.5e-05,0.000298,0.000784
-0.000216,-0.000639,0.000419,-0.000664,-0.000783,-0.00052,0.000116,-0.000267,0.000369,8e-06,-0.00069,-8.4e-05,0.000628,-0.000165,0.000834,0.000472,0.000434,0.000355,-0.00025,0.000429,0.00039,0.000294,0.001629,0.000305,0.000324,-0.000246,-0.000113,-0.000555,-7.9e-05,-0.000172,0.00026,-0.000176,0.000167,-1.1e-05,0.000386,-3e-06,-0.000243,-0.000545,-0.000476,0.00041,0.000444,0.000868,0.000357,-0.000546,-3e-05,0.000431,-0.000406,-0.000419,0.00042,-0.000373,0.000462,0.000274,0.000189,0.000222,-5.2e-05,-0.000493,-0.000997,-0.000515,0.000212,0.000798,-0.00016,-0.000598,-9.6e-05,0.000174,0.000731,0.001032,0.000304,0.000462,0.000513,0.000582,0.000632,-0.000303,-0.000154,0.000954,0.000507,-0.00047,0.000271,1.5e-05,-1.3e-05,0.00067,8.5e-05,-0.000829,-0.000433,0.000581,-0.000214,1e-05,0.000371,0.00041,0.000176,0.000138,0.000516,0.000134,-4.9e-05,0.00016,-0.00011,0.000409,0.000454,0.000783,6.8e-05,-0.000525,-0.000373,-0.000436,0.000207,0.000386,0.000206,-0.000414,0.000733,9.3e-05,0.000809,0.000431,3.3e-05,0.000284,-0.000539,-0.00035,-0.000678,0.00038,6.2e-05,-0.000461,0.00022,-0.000467,-0.000709
-1.8e-05,0.000744,-0.000177,0.000446,0.000597,0.000513,-0.000479,-0.000116,-0.000364,-0.000201,4.3e-05,-0.000979,-0.000586,4.7e-05,-0.000445,-0.000604,-0.000713,0.000286,0.000536,-0.000293,-0.000384,-0.000273,-0.000856,-0.000609,-0.000583,6e-06,-2.4e-05,0.000606,0.000403,-0.000221,-0.000393,0.000623,-0.00021,0.000123,-0.000113,0,0.000118,0.000229,-8e-06,0.000112,-0.000221,-0.000309,-0.000105,0.000385,0.000121,-0.000363,-0.000232,0.00041,-0.000271,-5.6e-05,-0.000442,-4.3e-05,-0.00065,-0.000225,5e-05,0.00066,0.000491,0.000643,0.00014,-0.000119,0.00043,0.000257,0.000389,-0.00031,-0.000394,-0.00106,-0.000569,0.000227,-0.000182,-0.000699,0.000253,-4e-06,-4.4e-05,-0.000523,-0.00069,0.000524,-0.000221,1.9e-05,0.000369,0.000263,-6e-05,0.000284,5.2e-05,-8e-05,0.000215,-0.000187,7.2e-05,-0.00023,-0.000169,-0.00048,-0.000539,-0.000398,0.000121,4.8e-05,8.3e-05,-0.000321,-0.000572,-0.000632,0.000157,5e-06,-0.000161,0.000186,-0.00017,-0.000946,-0.000694,0.000411,-0.000381,0.000388,-0.000381,-0.000358,0.000214,0.00017,-0.000257,4.8e-05,0.000469,-0.000303,-0.000566,-4.1e-05,-0.000378,-0.000321,0.000317
0.000139,-0.00031,-0.000293,-0.000714,-0.000362,-0.000532,0.000193,0.000124,0.00066,0.000293,-7.4e-05,0.000443,0.000258,-0.000343,0.000434,0.000399,0.000425,0,-0.000264,-0.000245,0.000114,0.000362,-0.000611,0.000576,0.00055,-0.000123,-0.000643,-0.000596,-6e-06,0.000227,0.000289,-0.000242,8e-06,1.9e-05,-0.00027,-0.000146,-0.000336,0.00056,4.7e-05,-0.000273,-7.1e-05,8.7e-05,2.4e-05,-0.000491,-2.3e-05,-0.000108,0.000709,-7.2e-05,0.000116,0.000177,1.1e-05,3.2e-05,0.000384,8e-05,-4.8e-05,-0.000155,-0.000128,-0.00048,-0.00024,0.000114,4.4e-05,-0.000204,-0.00037,0.00036,0.000136,0.000532,-0.000303,-0.000554,0.000198,0.000331,-0.000382,-0.000205,-4.7e-05,0.000504,0.000383,-0.000205,6.5e-05,-6.8e-05,-0.000312,-0.00034,-8.6e-05,-0.000204,-0.000176,-0.000235,-0.000156,0.00033,-0.000356,-0.000429,3e-05,0.000281,0.000488,0.000219,-1.3e-05,-0.000132,-6.9e-05,-0.000244,0.000186,0.000138,-0.000477,0.00011,-5e-05,-5e-06,7.7e-05,0.000467,0.000613,1.7e-05,0.000155,-0.00019,0.000113,-2.4e-05,-0.000145,-0.000102,0.000464,0.000309,-9.2e-05,0.000149,0.000441,0.000259,0.000207,0.000343,-0.000179
1.8e-05,-2.8e-05,0.000393,0.000539,3.5e-05,0.000362,-0.00026,-8e-05,-0.000293,-0.000255,0.000399,-3e-05,-0.000115,0.000279,-7.6e-05,-8e-06,1.8e-05,-0.000307,1e-04,4.9e-05,-2.1e-05,-3e-04,0.000378,7e-05,-0.000405,0.000371,0.000629,0.000362,-9.6e-05,-6.2e-05,1.6e-05,1.7e-05,5e-05,-0.000172,0.000147,9.4e-05,0.000265,-0.000622,-0.00026,1.5e-05,-1.7e-05,0.000228,-1e-04,0.000382,0.000252,0.00016,-0.000276,-0.000165,-0.000562,-0.000346,-0.000191,-8.1e-05,0.000343,4.1e-05,0.000164,-0.00012,0.000135,0.000183,9.9e-05,-0.000327,-0.000378,2e-06,0.000496,-0.00013,-1e-06,-0.000144,0.000755,0.000178,-0.000483,-6.4e-05,-0.000367,0.000383,0.000274,-0.000403,-0.000133,3.3e-05,-3.6e-05,-3.5e-05,-0.00015,9.9e-05,-8.1e-05,0.000419,0.000278,2.8e-05,4.5e-05,-0.000193,0.000231,0.000295,1.5e-05,0.000139,-0.000322,7.2e-05,-0.000102,7.9e-05,-0.000167,0.000217,-0.000228,0.00015,0.000253,7.1e-05,0.000307,-9.4e-05,-4e-06,-6.2e-05,-0.000337,0.00016,-0.000138,-0.000202,-0.000168,7.6e-05,-0.000209,0.000131,-1e-06,-0.000201,0.000315,0.000167,-2e-04,-8.7e-05,5.1e-05,-0.00018,6.1e-05
-9e-06,-9e-05,-0.000194,2.3e-05,0.00014,-0.000176,0.000274,7.7e-05,-7.8e-05,9.3e-05,-0.000415,-0.000112,0.000324,0.000204,-8e-06,-1.7e-05,-0.000441,9.5e-05,-0.000128,0.000348,6.8e-05,0.000182,0.00043,-0.000433,0.000153,-0.00024,-0.00015,-0.000184,-4e-05,0.000126,-0.000227,-4.2e-05,0.000148,0.000359,8.8e-05,-0.000124,-3.1e-05,0.000152,0.000249,-0.000242,-5.2e-05,-0.00028,4.8e-05,-0.00021,-0.000357,-6e-06,-0.000341,0.000313,0.000534,0.000234,0.000335,8.3e-05,-0.000337,-1.9e-05,-9.8e-05,5.3e-05,-0.000228,2.2e-05,-7.4e-05,0.000447,0.000406,0.000129,-0.000183,1.5e-05,-0.000285,-2.4e-05,-0.000327,1.8e-05,0.000227,0.000219,0.000368,-5.5e-05,-0.000105,0.000163,1.5e-05,-0.000228,8e-05,4.1e-05,7.2e-05,5.9e-05,0.000338,-0.000563,3e-05,0.000151,0.000178,5.1e-05,-8.5e-05,0.000105,6.6e-05,-5.4e-05,0.00033,2.5e-05,-1.1e-05,-8.1e-05,0.000339,-0.000202,0.000153,-0.000207,-9.4e-05,9.4e-05,-0.000197,-0.000213,-4.2e-05,-1.8e-05,4.9e-05,2.9e-05,0.000253,0.000152,0.000171,7.3e-05,0.000595,-7.3e-05,-0.000262,2.5e-05,-0.000303,-0.000152,0.000219,-4.2e-05,-0.000243,-0.000144,-0.000176
-9e-06,0.000243,2.2e-05,-0.000362,-8.4e-05,2.7e-05,-8.6e-05,-0.000116,4.2e-05,0.000172,0.000254,9.8e-05,-0.000291,-0.00037,4.6e-05,-0.000121,7.7e-05,-0.000103,-4.5e-05,-0.000135,-0.000132,-2.2e-05,-0.000448,-7.6e-05,8.8e-05,0.000137,-0.000142,-6.5e-05,3.8e-05,7.6e-05,0.000181,3e-06,-0.00017,-0.00028,-0.000184,-0.000128,0.000135,-6e-06,-0.000253,0.000105,0.000135,-4.7e-05,-0.000187,0.000363,0.000304,0.000173,0.000278,-0.000247,-0.000248,-1.4e-05,-1.4e-05,-0.000267,4e-05,-0.000128,4.8e-05,-0.000146,0.000148,-2.4e-05,-3.7e-05,-0.000229,-0.000301,-0.00013,-3.1e-05,3.3e-05,0.00025,-5.4e-05,8.4e-05,-7.2e-05,0.000168,-0.000214,6.3e-05,-3.6e-05,-0.000105,0.00018,-7.5e-05,0.000252,1.8e-05,1.1e-05,0.000223,-5.2e-05,-6.7e-05,0.000418,-0.000131,-6.9e-05,-0.000342,-0.000108,-5.5e-05,-4.4e-05,-2.6e-05,-0.000152,-0.000313,-6.7e-05,7e-05,9.4e-05,-0.000113,0.000221,-0.000115,9.3e-05,6e-06,-1e-04,-5.4e-05,0.000202,9.6e-05,1.4e-05,1.3e-05,-0.000191,-0.000287,-8.4e-05,8e-06,4.4e-05,-0.000362,0.000139,6e-05,2e-06,0.000115,0.00012,-0.000351,-0.00015,0.000133,-1e-05,0.00034
2.1e-05,-0.000129,-1.4e-05,7.6e-05,-4.4e-05,0.000165,-2.5e-05,7.2e-05,-0.000179,-0.000157,3.5e-05,-4.3e-05,-3.3e-05,0.000217,-0.000181,-4.6e-05,0.000131,4.7e-05,0.000199,-5.8e-05,7.7e-05,-6.3e-05,0.000215,0.000474,-3.3e-05,4.1e-05,-9.2e-05,0.000288,-4e-05,-6.9e-05,-5.8e-05,6e-05,-3.3e-05,-1.9e-05,-2.5e-05,4.4e-05,-4.6e-05,7.6e-05,0.000101,0.000107,-7.9e-05,5.1e-05,4.3e-05,-0.000209,-0.000171,-4.8e-05,-0.000157,-0.000153,0.000164,-4.9e-05,-0.000147,0.000179,9.7e-05,0.000256,6.2e-05,8.8e-05,-0.000242,-2.3e-05,8e-05,-8.8e-05,-0.000185,-2.2e-05,1.8e-05,-0.000131,1.3e-05,-5.3e-05,-3.4e-05,-4.2e-05,2.4e-05,0.000159,-8.4e-05,2.9e-05,-1.6e-05,-0.00025,4.6e-05,-8.2e-05,-0.000229,-4.4e-05,-0.000206,-5.5e-05,6e-06,-0.000207,6e-06,0.000148,8.5e-05,-2.1e-05,5.7e-05,-0.000104,6.8e-05,-2.4e-05,0.000181,5.8e-05,-2.3e-05,-1.9e-05,-5.3e-05,-1.6e-05,8e-06,-5.2e-05,2.5e-05,-2.4e-05,0.000139,0.000115,-4.4e-05,2.8e-05,0,7.6e-05,0.000233,0.000164,-0.000109,-0.000103,-9.4e-05,-8e-05,-7.7e-05,0.000127,-7.5e-05,-5.8e-05,0.000257,0.000204,-1e-06,0.000117,-0.000122
6.1e-05,9.3e-05,-0.00018,0.00025,-1e-05,-0.000115,5.1e-05,1e-05,0.000162,6.5e-05,2.2e-05,-6.3e-05,0.000132,-0.000139,1e-04,7e-05,-0.000129,-0.00014,-0.00011,7.5e-05,-3.8e-05,0.000108,-0.000211,-0.000251,4.3e-05,-0.000148,0.000194,-0.000121,8.5e-05,-9.9e-05,-4.8e-05,-0.000138,7.2e-05,5.2e-05,8.5e-05,-6e-06,-6.9e-05,-0.000211,-3e-05,2.7e-05,-6e-06,3e-06,-2.4e-05,-7.3e-05,0.000128,-1.9e-05,-1e-05,0.000135,-1e-04,5.4e-05,0.000128,-4.5e-05,-6e-05,-0.000107,1e-06,3.5e-05,0.000174,7.6e-05,-6e-05,1.2e-05,0.000187,5.4e-05,-3.6e-05,0.000123,-3.9e-05,7.3e-05,4e-05,0.000122,-5.8e-05,1.8e-05,6.2e-05,0.000183,4.8e-05,0.000234,-7e-06,-7e-06,0.000129,-7.8e-05,8.8e-05,0.000114,-3.4e-05,3.7e-05,3.9e-05,-7e-06,4.9e-05,3.2e-05,1.2e-05,5e-05,-6.6e-05,6.1e-05,-2e-06,-3.7e-05,7.3e-05,-1e-06,6.3e-05,-1.6e-05,9.5e-05,5e-06,-3e-05,0.000174,-0.00012,-1e-05,1.7e-05,3.6e-05,-8e-06,-7.8e-05,-1.3e-05,-0.00019,0.000155,1e-05,0.000163,-8.9e-05,0.00026,-9.6e-05,3.5e-05,-4.9e-05,-0.00021,-5.3e-05,-7.9e-05,5.9e-05,-9.6e-05
-0.00012,-9e-05,7.2e-05,-0.000215,0.000102,7.5e-05,-5.8e-05,-0.000124,-7.8e-05,-9.4e-05,-5.9e-05,5.2e-05,-0.000107,3.7e-05,-7.1e-05,-3.7e-05,5.4e-05,0.000191,7e-06,-8.7e-05,3.2e-05,-7.6e-05,-6.6e-05,0.000155,-6.8e-05,6.4e-05,-3.4e-05,-7.5e-05,-0.000105,1e-05,8.7e-05,1e-04,-2.6e-05,-2.8e-05,0.00011,2.4e-05,2.8e-05,0.00017,5.6e-05,-5e-06,-6e-05,1.2e-05,1.9e-05,4.9e-05,-3.1e-05,-1.8e-05,0.000214,-3.3e-05,6e-05,-2.9e-05,-6.5e-05,3.4e-05,0.000115,-5.2e-05,7e-06,-0.00015,-5.7e-05,-8.8e-05,8.3e-05,-1.7e-05,-8.9e-05,-1e-05,5.1e-05,-0.00014,3.2e-05,-5.1e-05,1.7e-05,-6.8e-05,-6e-05,-8.4e-05,-8.9e-05,-0.000137,6e-06,-0.000138,7.3e-05,-5.7e-05,-9.2e-05,6.8e-05,7e-06,-1.6e-05,-3.1e-05,-1.1e-05,-2.7e-05,-8.4e-05,-7e-06,-1.7e-05,-7.3e-05,-1.3e-05,-2.8e-05,-1.8e-05,-5.2e-05,-5e-06,-4e-05,2.1e-05,3.8e-05,-0.000104,-0.000112,1.6e-05,4.2e-05,-0.000117,-3.6e-05,-0.000101,1.7e-05,-4.9e-05,1e-06,2.6e-05,-8.9e-05,6e-05,-0.000114,9e-06,2.9e-05,0.000166,-6.9e-05,-1.2e-05,4.2e-05,-1.6e-05,0.000116,-4e-06,7.9e-05,-6.4e-05,-0.000102
4.2e-05,1.8e-05,7.3e-05,-1e-05,-2.5e-05,-7.7e-05,0.000107,2.9e-05,6.5e-05,3.5e-05,2.6e-05,9e-06,0.000108,6.6e-05,0.00015,8.4e-05,7.3e-05,-0.000124,-1e-05,1.4e-05,2e-05,4.7e-05,0.000281,-0.000117,-2.5e-05,-2.3e-05,-4e-06,4.4e-05,2.5e-05,1e-06,-4.4e-05,2.2e-05,2.7e-05,5.8e-05,-5.3e-05,-1.8e-05,-4.4e-05,-0.000112,-4.3e-05,-2.2e-05,-1.3e-05,1e-06,-5e-06,4.8e-05,-6.8e-05,2e-05,-0.00031,-0.000154,-3.8e-05,-3.1e-05,3.7e-05,-3e-06,-9.6e-05,2.3e-05,-2.5e-05,8.3e-05,1.5e-05,9e-06,-5.3e-05,5.3e-05,4.5e-05,4.3e-05,-2e-06,5e-05,-6.9e-05,5.8e-05,3e-06,-7.4e-05,5e-05,-2.1e-05,-2.5e-05,-0.000117,-4e-06,2.1e-05,-7.8e-05,0.000116,8.4e-05,7e-06,-1e-05,-4e-06,6e-06,-4.9e-05,-1.4e-05,2.1e-05,-2e-05,7e-06,7.5e-05,4e-05,7.7e-05,-1.8e-05,2.9e-05,-1.7e-05,-4.4e-05,-3.5e-05,-7.2e-05,0.000104,0.000119,-2.6e-05,-2.2e-05,-3e-06,0.000125,-1e-05,5.3e-05,4.1e-05,-4.7e-05,2.3e-05,3.2e-05,5.7e-05,0.000105,3.2e-05,-5.1e-05,-0.000124,-0.000104,2.3e-05,3.6e-05,1.6e-05,-1e-05,-3.4e-05,-3.7e-05,-1.4e-05,7.4e-05
-1.2e-05,-4.2e-05,3e-06,8.2e-05,-4.6e-05,3.2e-05,-5.7e-05,-1.7e-05,3.7e-05,6.5e-05,-5.4e-05,-3.3e-05,3.8e-05,-7.3e-05,-5.8e-05,-7.4e-05,-4.1e-05,7e-06,-2.1e-05,9.8e-05,-2e-05,-2.3e-05,-7.8e-05,-6.1e-05,2.4e-05,3.1e-05,4e-06,2e-06,-4.4e-05,3.1e-05,5e-06,-6.6e-05,-4.3e-05,-3.2e-05,1.3e-05,-4e-06,-3e-06,7.7e-05,1.6e-05,-2e-06,2.3e-05,1.3e-05,0,-6.4e-05,0.000106,3.8e-05,0.000119,0.000224,-7e-06,6.8e-05,-2e-05,-2e-05,-3e-05,-2e-05,2.9e-05,-6.9e-05,-2e-05,1e-05,-1e-05,-8e-05,8.8e-05,-2e-05,-9.2e-05,-1.7e-05,2.9e-05,-6.5e-05,-9.2e-05,6.6e-05,-7.3e-05,6.5e-05,2.1e-05,7.3e-05,-3e-06,3.4e-05,5.8e-05,-2.9e-05,-1.7e-05,6e-06,1e-06,4e-05,-9e-06,-4e-06,2.2e-05,4e-05,1e-05,-2.1e-05,-5.2e-05,3.3e-05,9e-06,2e-05,-1.4e-05,8e-06,4e-06,3.7e-05,1.9e-05,-1.4e-05,-0.000106,1.4e-05,-1.4e-05,1.6e-05,-2.2e-05,1e-05,-3.3e-05,-4.5e-05,3.1e-05,5.6e-05,-4.8e-05,-4.9e-05,-7.2e-05,-1.9e-05,-4e-06,4.5e-05,0.000122,3.1e-05,-5e-05,1.1e-05,1.5e-05,3.9e-05,-1.2e-05,2.7e-05,2.9e-05
2.5e-05,5e-05,-1.1e-05,-5.4e-05,5e-05,5.2e-05,4e-06,1.5e-05,-0.000109,-1.3e-05,5.5e-05,6.9e-05,-9.5e-05,8e-06,2e-06,2.8e-05,-2.7e-05,5.1e-05,3.8e-05,-5e-05,-1.8e-05,3.5e-05,-7.5e-05,0.000155,1e-06,4.5e-05,-6e-06,6.8e-05,2.4e-05,2.8e-05,-2e-06,3e-05,4.1e-05,7e-06,-2.7e-05,2.4e-05,-2.1e-05,-1.2e-05,4e-06,-1.4e-05,-5e-06,-7e-06,3.6e-05,-1.5e-05,-6.8e-05,-3.8e-05,-1.6e-05,-8.1e-05,4.9e-05,-2.9e-05,3.1e-05,-1e-06,7.1e-05,5.4e-05,5e-06,8e-06,2.5e-05,3.2e-05,-1.2e-05,2.5e-05,-0.000103,-2e-05,1.9e-05,-1.2e-05,-3e-06,2.7e-05,-6e-06,7e-06,4e-05,-2.6e-05,2.1e-05,4.5e-05,3.9e-05,-7.2e-05,-1.5e-05,-2.7e-05,2e-06,-1.7e-05,-8e-06,-4.5e-05,-1.8e-05,9.5e-05,1.8e-05,-3.4e-05,-3.6e-05,2.2e-05,9e-06,-0.000103,-1.2e-05,-4e-06,1.5e-05,1e-05,-1e-05,-1.7e-05,-1.4e-05,-1.4e-05,5e-06,-8e-06,1.1e-05,-3e-06,-5.1e-05,1.2e-05,1.7e-05,2.6e-05,5e-06,-1.6e-05,4.4e-05,3.1e-05,2.1e-05,-1.8e-05,2.1e-05,-6e-06,-9e-06,-5e-06,4e-06,5.6e-05,1.4e-05,-5e-06,3.5e-05,4.3e-05,3.2e-05
3e-06,-2.3e-05,-3.6e-05,3.5e-05,-2.3e-05,-4.9e-05,-1.2e-05,3.9e-05,7.9e-05,1.9e-05,-1.9e-05,-7e-05,4.4e-05,-8e-06,-1.3e-05,-3.9e-05,9.6e-05,-3.8e-05,-3.7e-05,-4.7e-05,1.3e-05,-3e-05,-9.5e-05,-9.4e-05,-3.4e-05,-5.2e-05,8e-06,-5.8e-05,-7e-06,-2.5e-05,-1.5e-05,-1.7e-05,-3.3e-05,2.2e-05,-1e-06,2e-06,3.4e-05,-1.8e-05,-4e-06,1.4e-05,1.4e-05,-4.7e-05,-1e-05,-2.7e-05,-3e-06,-1.8e-05,-1.4e-05,-1.9e-05,-7.9e-05,-8e-06,-6.1e-05,-1.8e-05,2e-05,-2e-05,9e-06,4.4e-05,-2.1e-05,-2.2e-05,3.2e-05,5.2e-05,7.6e-05,1.9e-05,5.8e-05,1.7e-05,8e-06,8e-06,4.3e-05,-5.7e-05,-2.8e-05,-3.5e-05,1.8e-05,-1.8e-05,-1.9e-05,5.3e-05,2.7e-05,-3e-06,2.2e-05,-3e-06,2.6e-05,1e-05,-1.2e-05,-9.2e-05,-7e-06,1.9e-05,2.6e-05,-1.9e-05,1.4e-05,2.3e-05,-7e-06,1.4e-05,-1.9e-05,9e-06,3.6e-05,8e-06,5.1e-05,-1e-06,2.4e-05,1.2e-05,-1.7e-05,2.8e-05,4.7e-05,1.7e-05,-1.4e-05,-2e-06,-8e-06,-2.8e-05,-2.7e-05,2e-05,-2e-06,1e-06,1.1e-05,-3.7e-05,-3.3e-05,-4.4e-05,-2.9e-05,-0.000108,-4.1e-05,9e-06,-2.1e-05,-6.6e-05,-7.6e-05
-2.9e-05,2.3e-05,4e-06,-4e-06,-6e-06,8.5e-05,4e-06,-5.8e-05,-5.6e-05,-4.3e-05,-2.6e-05,5.3e-05,3.8e-05,-1e-06,-8e-06,1.3e-05,-7.4e-05,2.9e-05,-8e-06,2.9e-05,1e-05,8e-06,0.000163,3e-05,2.2e-05,4e-05,2.7e-05,2.2e-05,0,-3e-06,3e-06,2.2e-05,1.9e-05,-6.1e-05,6.2e-05,0,-1e-06,2.1e-05,-3e-06,2.6e-05,-1.8e-05,2.7e-05,1.1e-05,7.2e-05,-2e-06,8e-06,1.3e-05,1.4e-05,5.2e-05,4.3e-05,2.7e-05,2e-05,-5.3e-05,-1.8e-05,-2e-05,-4.6e-05,4.2e-05,3e-06,-2e-06,-7.7e-05,-9e-06,-1.3e-05,-0.000115,-2e-05,-1e-06,-2e-06,-4.9e-05,5.5e-05,9e-06,7.5e-05,-6.9e-05,-3.1e-05,-2.6e-05,-7e-06,-3.3e-05,4.3e-05,-5.1e-05,0,6e-06,7e-06,1.7e-05,5.8e-05,6e-06,-1e-05,1.8e-05,1.6e-05,-7e-06,3.3e-05,1e-06,1.1e-05,5.3e-05,-1.3e-05,-3e-06,1.3e-05,-5.3e-05,-2.3e-05,-2.6e-05,-2.3e-05,4e-06,-2.5e-05,2.3e-05,-3.3e-05,1.4e-05,1e-06,-1.4e-05,1.2e-05,2.4e-05,-2.9e-05,-1e-05,2e-06,-5.2e-05,4e-05,-3e-05,3.4e-05,1.7e-05,5.3e-05,4.9e-05,-1.4e-05,5e-06,-2.3e-05,2.1e-05
3.1e-05,-3.7e-05,1.4e-05,4e-06,6e-06,-8.3e-05,1.2e-05,2.5e-05,3.7e-05,-7e-06,1.6e-05,-1.3e-05,-6e-05,1.8e-05,9e-06,-1.1e-05,-1.4e-05,-4.2e-05,2.8e-05,4.4e-05,-5e-06,1.3e-05,-9e-06,-9e-06,-1.6e-05,-2e-05,-3.6e-05,-9e-06,-1.4e-05,-6e-06,1.7e-05,-2.7e-05,-6e-06,3.6e-05,-2.7e-05,-6e-06,2.2e-05,2.6e-05,-9e-06,-3e-05,7e-06,5e-06,-9e-06,-4e-05,-3e-05,1.6e-05,4.9e-05,1.6e-05,-3.7e-05,-3.9e-05,1.5e-05,-8e-06,1.1e-05,2e-06,1.1e-05,3.2e-05,-4.6e-05,1.4e-05,-9e-06,7.5e-05,-3.8e-05,-7e-06,6.1e-05,2e-05,8e-06,-4e-06,1.2e-05,1e-05,-1.2e-05,-1e-05,4.4e-05,2.9e-05,2.8e-05,-8e-06,1e-05,-3.1e-05,5.4e-05,-9e-06,-3.1e-05,0,2e-06,-4.9e-05,-1.1e-05,-2.1e-05,-4.9e-05,-7e-06,-1e-05,0,0,-3.9e-05,-6.2e-05,-1e-05,1e-06,-2.4e-05,2.6e-05,3.7e-05,2.8e-05,1.3e-05,3e-06,-4.7e-05,-3.3e-05,1e-06,1.1e-05,-1e-06,2.3e-05,-5e-05,-8e-06,1.1e-05,3.1e-05,1.6e-05,6.1e-05,-3.3e-05,2.1e-05,4e-06,5e-06,-1.7e-05,-2.6e-05,-7e-06,2e-06,1e-05,1.2e-05
-1e-06,4e-06,1e-05,-5e-05,-7e-06,4.7e-05,-7e-06,8e-06,3e-06,3e-06,1.1e-05,-1e-06,3e-06,-3.9e-05,-2e-06,1.6e-05,3.5e-05,8.8e-05,-1.7e-05,-3e-05,3e-06,-3e-05,-6e-05,2.3e-05,1.2e-05,7e-06,-4.5e-05,1e-06,-9e-06,-1.3e-05,-7e-06,3e-06,4e-06,4e-06,-8e-06,-2e-06,-3.1e-05,-6.8e-05,2.8e-05,7e-06,-4e-06,1e-05,-3e-06,1.8e-05,7.1e-05,2e-06,-7.5e-05,-4.3e-05,3.9e-05,7e-06,-1.4e-05,1.5e-05,2.2e-05,4e-06,-8e-06,7e-06,2.7e-05,-2.5e-05,0,-3e-05,7.7e-05,0,-1.8e-05,-1.5e-05,-9e-06,3e-06,3e-06,-4e-05,1.1e-05,-1.2e-05,6e-06,3.2e-05,0,-2.4e-05,4e-06,-1.2e-05,-6.2e-05,1.8e-05,1.1e-05,9e-06,6e-06,6.2e-05,2e-06,0,4.4e-05,4e-06,2.2e-05,6e-06,-1e-05,7e-06,3.3e-05,1.6e-05,-2.7e-05,2.4e-05,7e-06,-1.5e-05,-2.2e-05,1e-06,-4e-06,6e-05,5e-06,5e-06,-9e-06,-1.2e-05,-8e-06,4.3e-05,-1.9e-05,-9e-06,-2.8e-05,2e-06,-1.5e-05,1.5e-05,2.6e-05,-3e-06,0,-4.5e-05,4.4e-05,3.2e-05,0,2.8e-05,2e-06
-5e-06,6e-06,6e-06,7.9e-05,-3e-06,-1.7e-05,-5e-06,-9e-06,-3.1e-05,2.1e-05,-1.2e-05,1e-06,4.7e-05,3.8e-05,2.7e-05,-1e-06,-2.4e-05,-8.8e-05,1.2e-05,-1.3e-05,-8e-06,3.6e-05,4.4e-05,-4.6e-05,7e-06,4e-06,7.1e-05,9e-06,-5e-06,3e-06,-8e-06,2.3e-05,-4e-06,-2.7e-05,-1.6e-05,-4e-06,1.2e-05,3.7e-05,-2.2e-05,-2e-06,1e-05,9e-06,-1.4e-05,-4e-05,-5.3e-05,-1.9e-05,6e-05,4.3e-05,-3.7e-05,1.3e-05,2e-06,-2e-05,-3.4e-05,7e-06,1e-05,-2.5e-05,1e-06,1.8e-05,-4e-06,3e-06,-4.5e-05,-3e-06,7e-06,7e-06,-8e-06,-1.1e-05,-4e-06,2.4e-05,3e-06,9e-06,-2e-05,-2.7e-05,1e-05,2.6e-05,-7e-06,1.1e-05,3.7e-05,0,2.3e-05,-1e-05,-1.4e-05,-7.6e-05,-8e-06,4.1e-05,-1.4e-05,-4e-06,-1.6e-05,-3.3e-05,2e-06,2.6e-05,-8e-06,-1.4e-05,6e-06,-1.3e-05,-2.8e-05,-5e-06,9e-06,-1.8e-05,7e-06,-1.5e-05,4e-06,4e-06,2e-06,2.8e-05,3e-06,1e-06,-2e-06,1.5e-05,2e-05,-1.2e-05,-5e-05,4e-06,-7e-06,-1.8e-05,0,5e-05,-5.8e-05,-2.5e-05,-3e-06,-1.6e-05,1.2e-05
-1.5e-05,1.5e-05,-6e-06,-3.2e-05,2.1e-05,9e-06,3e-06,8e-06,5.6e-05,1.6e-05,-7e-06,-2e-06,-2.3e-05,-1e-06,-2.9e-05,-1.2e-05,-2.8e-05,3.6e-05,-1.9e-05,1.6e-05,-6e-06,-2.8e-05,-8.1e-05,-7e-06,-3e-06,-1.5e-05,5e-06,-4e-06,6e-06,8e-06,1.1e-05,-1.8e-05,0,4e-05,1.6e-05,0,-4e-06,2.1e-05,1e-06,-9e-06,-1e-06,-1.7e-05,1e-06,2e-05,9e-06,-7e-06,-1.5e-05,-1.5e-05,3.4e-05,-3.3e-05,-7e-06,7e-06,2.9e-05,-6e-06,-1.3e-05,4.4e-05,-4e-06,3e-06,0,-3e-06,-1e-05,1.1e-05,-1.8e-05,5e-06,2.2e-05,1.9e-05,8e-06,1.5e-05,3e-06,1.3e-05,2.5e-05,-2.3e-05,3e-06,2e-06,8e-06,1.9e-05,-8e-06,-5e-06,-3.1e-05,9e-06,-1e-06,7e-05,5e-06,-3.3e-05,-6e-06,4e-06,-2e-06,9e-06,8e-06,-1.8e-05,-2e-06,0,-2e-06,3e-06,4e-06,9e-06,-3e-06,2.2e-05,-9e-06,-2.5e-05,-1.9e-05,7e-06,-1.1e-05,-1.6e-05,-8e-06,-9e-06,-5e-06,-1.1e-05,-2.2e-05,-8e-06,6.1e-05,-1.5e-05,-3.1e-05,1.8e-05,0,-9e-06,4.1e-05,-1e-06,-2e-06,-1.9e-05,-2.9e-05
1.3e-05,-1.4e-05,0,-3.4e-05,-1.6e-05,1.8e-05,8e-06,-4e-06,-6.2e-05,-1.6e-05,1.1e-05,-1e-06,3e-06,-1.2e-05,2.6e-05,2e-06,3.6e-05,-1.1e-05,-1e-06,-1.7e-05,3e-06,1.4e-05,3e-05,5e-05,9e-06,1.1e-05,-3.1e-05,-2e-06,1.2e-05,7e-06,-1.8e-05,-1e-06,5e-06,-2.5e-05,1.6e-05,-1e-05,-9e-06,-3.6e-05,1e-06,2.5e-05,-2e-06,5e-06,-9e-06,6e-06,1.3e-05,9e-06,-1.5e-05,2e-05,-1.8e-05,1.3e-05,1.8e-05,-1.3e-05,-2.4e-05,-5e-06,3e-06,-2.5e-05,-1e-05,-9e-06,4e-06,-2e-06,3.1e-05,6e-06,1.4e-05,-1.1e-05,-2.1e-05,-2.4e-05,1.5e-05,-2e-05,-8e-06,-3.4e-05,-1.4e-05,7e-06,-2.3e-05,-2.8e-05,-1.3e-05,-2.5e-05,-4e-06,-8e-06,1e-05,-1.7e-05,5e-06,-5.8e-05,6e-06,6e-06,1.6e-05,-5e-06,8e-06,9e-06,0,-3e-06,1e-06,3e-06,1.6e-05,1.1e-05,2.2e-05,-3e-06,-6e-06,-1.5e-05,7e-06,1.1e-05,1.1e-05,-9e-06,8e-06,-5e-06,2e-06,3.6e-05,3.9e-05,-1.2e-05,1.8e-05,1.4e-05,-1.6e-05,2e-05,8e-06,5e-06,-7e-06,1.1e-05,-3.2e-05,1e-05,6e-06,2.1e-05,-6e-06
7e-06,9e-06,-6e-06,2e-05,1e-06,-2.1e-05,0,-4e-06,3.3e-05,0,-2e-06,2e-06,1.8e-05,2.8e-05,-3.5e-05,-1.8e-05,-1e-06,2e-06,1.8e-05,6e-06,6e-06,-2e-06,9.7e-05,-4.3e-05,2e-06,5e-06,-1.7e-05,6e-06,-6e-06,5e-06,7e-06,1e-06,-1.1e-05,3e-06,-2.8e-05,2e-06,3e-06,1.7e-05,4e-06,-1.8e-05,-3e-06,-3e-05,-8e-06,4e-06,-1.9e-05,7e-06,3.9e-05,-3.4e-05,-4e-06,4e-06,-2.1e-05,2e-06,-5e-06,3e-06,-5e-06,9e-06,9e-06,0,-3e-06,2.2e-05,-5.7e-05,-3e-06,-8e-06,8e-06,1.6e-05,1.5e-05,-2.9e-05,0,1e-06,-4e-06,-5e-06,1.4e-05,1.8e-05,3.1e-05,2e-05,-3e-06,2.2e-05,7e-06,2e-06,5e-06,1e-06,4e-05,-2e-06,1e-06,-2.2e-05,-2e-06,-7e-06,9e-06,-4e-06,1.4e-05,1.2e-05,3e-06,-1e-06,-1.9e-05,-2.7e-05,-2e-06,1e-06,6e-06,-8e-06,-1.3e-05,1.9e-05,-2e-06,-6e-06,8e-06,5e-06,-4.7e-05,-2.5e-05,2.5e-05,-1.4e-05,8e-06,-1.8e-05,-1.8e-05,4.6e-05,-9e-06,0,-1.2e-05,3.5e-05,-1.1e-05,-7e-06,1.6e-05,1.6e-05
-6e-06,-1.8e-05,-4e-06,3.9e-05,5e-06,8e-06,2e-06,9e-06,-9e-06,-1.7e-05,-7e-06,5e-06,-1.8e-05,-3.5e-05,2.6e-05,1.4e-05,-2.5e-05,-2e-06,-1.6e-05,1.9e-05,-2e-06,-6e-06,-7e-05,4.2e-05,1e-06,-4e-06,3.2e-05,-8e-06,-1e-06,0,8e-06,6e-06,1.4e-05,8e-06,1.8e-05,-1e-06,7e-06,2e-06,-1e-05,1.7e-05,-1e-06,1.9e-05,4e-06,-9e-06,3.5e-05,-2e-06,-3.1e-05,2.5e-05,1.6e-05,-1.7e-05,1.8e-05,1.3e-05,3.7e-05,-4e-06,1e-06,1.1e-05,-1.1e-05,3e-06,-4e-06,-2.3e-05,2.3e-05,0,1.8e-05,-4e-06,-5e-06,-6e-06,2.8e-05,1.4e-05,3e-06,1.7e-05,-1e-06,-1e-06,3e-06,-1.8e-05,-1.8e-05,1.5e-05,-3.7e-05,9e-06,-3e-06,1.2e-05,4e-06,-1.3e-05,3e-06,-6e-06,1.9e-05,7e-06,1e-06,2e-06,2e-06,-6e-06,-1.5e-05,4e-06,-4e-06,1.8e-05,6e-06,3e-06,5e-06,-2e-06,3e-06,1.2e-05,-2.5e-05,3e-06,5e-06,-3e-06,-6e-06,1.6e-05,7e-06,-1.3e-05,1.3e-05,-8e-06,7e-06,1.3e-05,-3e-05,-9e-06,2e-06,6e-06,-2.4e-05,8e-06,4e-06,-6e-06,7e-06
-7e-06,1.5e-05,4e-06,-5.8e-05,3e-06,3e-06,-7e-06,-2e-06,-6e-06,1e-05,3e-06,-1.3e-05,7e-06,1.3e-05,-1.4e-05,-8e-06,3.6e-05,-1.1e-05,2e-06,-4e-06,0,8e-06,-5.8e-05,-2.8e-05,3e-06,0,-1.3e-05,7e-06,-1e-05,-1.2e-05,-1.1e-05,-1e-06,-8e-06,-2.2e-05,-1e-06,4e-06,-2e-06,-1e-05,5e-06,-1.9e-05,1e-06,1.4e-05,2e-06,-1.3e-05,-3.7e-05,-1.2e-05,1.1e-05,-2.4e-05,-1.6e-05,2.2e-05,-9e-06,-8e-06,-2.1e-05,5e-06,-6e-06,-2.7e-05,1.9e-05,-2e-06,0,7e-06,1.2e-05,-3e-06,-9e-06,3e-06,-6e-06,-3e-06,-2e-06,-1.3e-05,-3e-06,-4e-06,9e-06,-1.2e-05,-1.2e-05,1.2e-05,1.3e-05,9e-06,3.5e-05,-6e-06,7e-06,-1.1e-05,-2e-06,-5e-06,0,-2e-06,-7e-06,-9e-06,7e-06,-3.7e-05,0,-3e-06,4e-06,-5e-06,-1e-05,-1.2e-05,1.2e-05,9e-06,-4e-06,-2e-06,-4e-06,3e-06,-4e-06,-7e-06,-8e-06,-1e-06,-2e-06,-3e-06,6e-06,-1e-05,-9e-06,-8e-06,6e-06,-4e-06,-1.7e-05,1.1e-05,3e-06,-2e-06,-1e-06,-1e-06,1e-06,-2.3e-05,6e-06
7e-06,2e-06,-6e-06,2.9e-05,-7e-06,-1.7e-05,4e-06,-1.2e-05,2.9e-05,8e-06,1e-06,1.7e-05,-1e-06,5e-06,7e-06,9e-06,-3e-06,2.9e-05,-1e-06,-3.2e-05,-2e-06,-1e-05,5.6e-05,-3.4e-05,2e-06,0,1.6e-05,-1e-05,1e-05,-4e-06,1e-05,-5e-06,6e-06,2.8e-05,1e-06,1e-06,6e-06,4e-06,-2e-06,8e-06,1e-06,-8e-06,7e-06,7e-06,1.6e-05,3e-06,-6e-06,1e-05,1.4e-05,-2e-06,1e-06,4e-06,-1.2e-05,0,0,2.1e-05,-1.8e-05,1e-06,-1e-06,1e-05,-2.7e-05,-1e-06,-2e-06,-1e-06,1.1e-05,1.5e-05,-6e-06,-1.6e-05,4e-06,-1.1e-05,1e-06,6e-06,1.2e-05,2e-06,-7e-06,-2e-05,-3e-05,-4e-06,-1.4e-05,7e-06,2e-06,-2e-06,-2e-06,1.4e-05,-3e-06,6e-06,-5e-06,2.2e-05,-2e-06,4e-06,3e-06,1e-06,-1e-06,1e-06,-4e-06,-1.8e-05,-1e-06,3e-06,4e-06,-2.5e-05,2.8e-05,7e-06,-1e-06,1e-06,-1e-06,-1.4e-05,-1.7e-05,1.8e-05,3e-06,5e-06,4e-06,-3e-06,1.6e-05,7e-06,1e-06,-1.3e-05,8e-06,-8e-06,-6e-06,8e-06,-1.2e-05
6e-06,1e-06,5e-06,3e-06,0,3.7e-05,1e-06,1.5e-05,-4.2e-05,-3e-06,-4e-06,-1.9e-05,-4e-06,-8e-06,1.2e-05,-9e-06,-2e-05,-4.2e-05,2e-06,2.5e-05,-4e-06,1.1e-05,1.1e-05,6.3e-05,-3e-06,-5e-06,-1.4e-05,1.1e-05,-2e-06,0,-5e-06,6e-06,-1.2e-05,-1.3e-05,1e-06,2e-06,-6e-06,4e-06,-2e-06,1e-06,-2e-06,1.1e-05,2e-06,1.4e-05,9e-06,8e-06,-2e-06,-4e-06,-1.8e-05,-8e-06,-1e-06,-6e-06,9e-06,-4e-06,-2e-06,-1.5e-05,1e-06,0,3e-06,-9e-06,3.5e-05,1e-06,1.8e-05,-2e-06,-9e-06,-2.4e-05,6e-06,1.8e-05,-2e-06,2.5e-05,-9e-06,1.3e-05,-7e-06,-2.1e-05,1e-05,2e-06,1.8e-05,0,4e-06,-4e-06,3e-06,1.7e-05,-2e-06,-1.3e-05,5e-06,-4e-06,-4e-06,9e-06,-2e-06,-4e-06,-6e-06,-4e-06,6e-06,8e-06,-8e-06,8e-06,-1e-06,-2e-06,-5e-06,1.4e-05,-1e-05,3e-06,0,1e-06,4e-06,3.3e-05,8e-06,-6e-06,1e-06,5e-06,-1.6e-05,9e-06,4e-06,-1e-05,-4e-06,1.6e-05,-4e-06,1.4e-05,6e-06,9e-06,-1.9e-05
-7e-06,-8e-06,4e-06,-1.5e-05,1e-06,-4e-05,-2e-06,-7e-06,3.3e-05,4e-06,9e-06,1.4e-05,1e-05,1.5e-05,-1.9e-05,1e-06,1.7e-05,3e-05,5e-06,9e-06,-1e-06,-1e-05,1e-06,-2.9e-05,1e-06,8e-06,-4e-06,-9e-06,5e-06,4e-06,-4e-06,-1e-06,1.2e-05,1e-06,-2e-05,1e-06,0,-1.1e-05,5e-06,-6e-06,-1e-06,-1.2e-05,8e-06,-7e-06,-2e-05,1e-06,-1e-06,2.4e-05,2.1e-05,1.8e-05,3e-06,1e-06,1e-06,1e-06,1e-06,-3e-06,8e-06,3e-06,0,-5e-06,-1.3e-05,-1e-06,-1e-06,2e-06,5e-06,2.9e-05,6e-06,-1e-06,2e-06,3e-06,3e-06,-1e-06,-3e-06,3.1e-05,-7e-06,1.3e-05,-3e-06,2e-06,1.2e-05,-3e-06,1e-06,-2.4e-05,1e-06,-1e-06,-4e-06,1e-06,4e-06,-3e-06,2e-06,-2e-06,3e-06,3e-06,6e-06,-1.4e-05,-1e-06,1e-06,-4e-06,3e-06,7e-06,1e-05,-1.7e-05,-6e-06,-2e-06,-5e-06,-2e-06,-2.1e-05,-2e-06,-3e-06,-5e-06,0,7e-06,-1e-05,2e-06,-4e-06,0,1.1e-05,1.1e-05,-6e-06,-1e-06,-4e-06,1.7e-05
-4e-06,4e-06,-6e-06,7e-06,4e-06,3.5e-05,0,2e-06,-1.6e-05,-9e-06,-8e-06,-6e-06,3e-06,-1e-05,1.8e-05,-6e-06,3e-06,-1.8e-05,-1e-05,-1.7e-05,3e-06,8e-06,-9e-06,-1e-06,-6e-06,-5e-06,-5e-06,1.1e-05,-7e-06,8e-06,3e-06,1e-06,-3e-06,1.7e-05,1.5e-05,1e-06,3e-06,1.9e-05,-3e-06,1.4e-05,-1e-06,-4e-06,1e-06,-5e-06,1.7e-05,-6e-06,8e-06,-3.2e-05,-2.1e-05,-1.3e-05,2e-06,0,-6e-06,-3e-06,-5e-06,1.2e-05,0,-8e-06,-2e-06,9e-06,-9e-06,0,-2e-05,-1e-06,-2e-06,-2.8e-05,-1.6e-05,-1.3e-05,-1e-06,-2e-05,3e-06,-1.5e-05,7e-06,-1.9e-05,5e-06,-3e-06,-6e-06,2e-06,-1.5e-05,2e-06,-3e-06,2.1e-05,1e-06,1e-05,5e-06,-1e-06,-4e-06,4e-06,2e-06,6e-06,3e-06,-3e-06,0,1.3e-05,1.6e-05,-3e-06,7e-06,-4e-06,-7e-06,-1.4e-05,1.7e-05,1e-06,1e-06,6e-06,0,1.2e-05,1.9e-05,0,9e-06,-3e-06,1.1e-05,9e-06,-1.7e-05,8e-06,1e-06,-1e-05,-2.2e-05,-4e-06,-2e-06,-1.5e-05,5e-06
5e-06,-2e-06,-2e-06,1.2e-05,-7e-06,-2.9e-05,-4e-06,2e-06,-2e-06,3e-06,2e-06,1e-06,-1e-06,6e-06,-2.2e-05,0,-2.3e-05,1.8e-05,3e-06,1e-06,2e-06,-5e-06,-2.4e-05,1e-05,-1e-06,3e-06,2.5e-05,-1.1e-05,4e-06,2e-06,-2e-06,-2e-06,2e-06,-2.6e-05,4e-06,0,-9e-06,-1.2e-05,2e-06,-1.6e-05,2e-06,-3e-06,1e-06,-9e-06,-2.1e-05,-1e-06,-1.4e-05,1.8e-05,1.7e-05,-2e-06,-8e-06,2e-06,7e-06,1e-06,0,-1.7e-05,-4e-06,3e-06,-1e-06,-9e-06,2.2e-05,2e-06,2.1e-05,1e-06,0,2.4e-05,1.5e-05,1e-05,1e-06,5e-06,-4e-06,0,-1e-05,-1e-06,-3e-06,-1.4e-05,1.6e-05,0,3e-06,-1e-06,-2e-06,-2.3e-05,0,-1e-06,-5e-06,2e-06,2e-06,-2.3e-05,-3e-06,2e-06,-5e-06,0,-6e-06,-9e-06,-8e-06,2e-06,-8e-06,4e-06,7e-06,6e-06,2e-06,-3e-06,-4e-06,-1e-06,1e-06,-4e-06,-3.1e-05,4e-06,-1.1e-05,-3e-06,-2.1e-05,-5e-06,0,5e-06,-1e-06,3e-06,1.7e-05,7e-06,3e-06,5e-06,4e-06
3e-06,6e-06,-3e-06,-2.3e-05,1e-06,1.5e-05,3e-06,-9e-06,1.3e-05,1e-06,3e-06,-2e-06,-6e-06,-3e-06,1.8e-05,1e-06,1.2e-05,-1.7e-05,3e-06,8e-06,0,-1e-06,-3e-06,-1.1e-05,-2e-06,-1e-06,-2e-05,2e-06,-4e-06,-5e-06,1e-06,3e-06,-4e-06,1.6e-05,5e-06,-1e-06,4e-06,-3e-06,-1e-06,1.3e-05,0,3e-06,-3e-06,1.4e-05,1.6e-05,5e-06,1.4e-05,-5e-06,-1e-05,1e-05,7e-06,2e-06,-4e-06,2e-06,0,1.2e-05,2e-06,2e-06,1e-06,3e-06,-2e-05,0,1e-06,-3e-06,0,-1.5e-05,-1e-05,2e-06,-1e-06,5e-06,1e-06,9e-06,4e-06,8e-06,1e-06,8e-06,-2.4e-05,-2e-06,7e-06,4e-06,-1e-06,3.1e-05,0,-3e-06,4e-06,-3e-06,3e-06,1.3e-05,0,-8e-06,0,5e-06,-4e-06,1e-06,-1.2e-05,1e-06,5e-06,-2e-06,-6e-06,-1e-06,-1.4e-05,1e-06,2e-06,-5e-06,4e-06,-1.2e-05,1.9e-05,4e-06,1.2e-05,1e-06,1.8e-05,-2e-06,1.8e-05,-1e-05,1e-06,8e-06,-1e-05,-6e-06,-2e-06,1.3e-05,-9e-06
-4e-06,-5e-06,3e-06,4e-06,6e-06,-2e-06,0,7e-06,-2e-05,0,-1e-06,2e-06,0,-8e-06,-1e-05,-1e-06,6e-06,1.3e-05,-3e-06,-4e-06,-2e-06,5e-06,3.4e-05,3e-06,-4e-06,-6e-06,2e-06,0,4e-06,-4e-06,2e-06,1e-06,1e-06,-4e-06,-5e-06,-3e-06,1e-06,9e-06,2e-06,-1e-05,1e-06,9e-06,-5e-06,0,4e-06,1e-06,-1.2e-05,3e-06,5e-06,-1.4e-05,-5e-06,-1e-06,-6e-06,-1e-06,1e-06,-3e-06,-3e-06,-1e-06,0,2e-06,1e-05,2e-06,-1.9e-05,3e-06,0,6e-06,-4e-06,-8e-06,1e-06,-1.4e-05,5e-06,2e-06,3e-06,-8e-06,0,8e-06,2.4e-05,-3e-06,-5e-06,-4e-06,0,-3.1e-05,1e-06,2e-06,-2e-06,2e-06,-2e-06,1.1e-05,1e-06,2e-06,4e-06,-3e-06,0,6e-06,1.7e-05,-3e-06,-1e-06,-1e-06,5e-06,1e-06,9e-06,6e-06,-3e-06,4e-06,-1e-06,1.3e-05,-8e-06,-1.2e-05,-1.2e-05,2e-06,-4e-06,7e-06,0,-1e-06,1e-06,-1.8e-05,1.4e-05,3e-06,-1e-06,-2e-06,-1e-05
-2e-06,0,6e-06,2.4e-05,-3e-06,-4e-06,0,-1e-06,2.4e-05,0,-3e-06,-1e-06,4e-06,7e-06,8e-06,1e-06,-1.8e-05,-2e-06,0,-6e-06,-3e-06,-6e-06,2.4e-05,-4e-06,-1e-06,9e-06,2e-06,3e-06,-4e-06,-2e-06,0,-2e-06,2e-06,-1e-05,-1.8e-05,-1e-06,1e-06,-2e-06,0,6e-06,-2e-06,-1e-06,-5e-06,0,-1.7e-05,-4e-06,6e-06,-1.3e-05,-2e-06,6e-06,4e-06,-2e-06,1.5e-05,-1e-06,0,-6e-06,9e-06,0,0,-4e-06,6e-06,-1e-06,1.6e-05,-2e-06,2e-06,1e-06,3e-06,5e-06,-1e-06,-3e-06,-6e-06,-1e-05,-8e-06,8e-06,0,-7e-06,-2.1e-05,0,1e-06,1e-06,1e-06,2.8e-05,-1e-06,-2e-06,0,-1e-06,-2e-06,-7e-06,-1e-06,7e-06,-4e-06,2e-06,7e-06,-1e-05,2e-06,2e-06,-5e-06,3e-06,-5e-06,7e-06,6e-06,-4e-06,2e-06,-1e-06,-2e-06,-1.2e-05,5e-06,5e-06,9e-06,2e-06,-1.2e-05,-1e-05,-1.8e-05,7e-06,-1e-06,5e-06,-1.4e-05,1e-06,1e-06,-1e-05,6e-06
3e-06,-1e-06,-1e-06,-2.3e-05,-3e-06,6e-06,0,1e-06,-1.9e-05,-4e-06,4e-06,1e-06,-4e-06,-9e-06,-1e-06,-3e-06,1.2e-05,-1.1e-05,-3e-06,1.5e-05,-1e-06,6e-06,-5.5e-05,1.6e-05,-1e-06,-9e-06,4e-06,2e-06,4e-06,1e-06,-3e-06,1e-06,-3e-06,1.8e-05,1.5e-05,-2e-06,-1e-06,-8e-06,0,0,0,3e-06,-3e-06,-7e-06,1.6e-05,0,6e-06,2e-05,-1e-06,5e-06,-4e-06,0,-1.2e-05,-1e-06,-1e-06,1.3e-05,-3e-06,-1e-06,0,8e-06,-1.7e-05,-1e-06,-1e-06,-1e-06,-4e-06,-7e-06,1e-06,7e-06,0,1.8e-05,2e-06,1e-06,3e-06,-1.2e-05,2e-06,-7e-06,1.2e-05,4e-06,-2e-06,-1e-06,-1e-06,-2.9e-05,0,-3e-06,3e-06,-1e-06,1e-06,1e-06,-1e-06,-8e-06,4e-06,-2e-06,3e-06,1e-05,-1.9e-05,3e-06,6e-06,-3e-06,5e-06,-7e-06,-1.4e-05,-3e-06,-2e-06,0,0,1.3e-05,1e-06,1e-05,-6e-06,-3e-06,1.3e-05,9e-06,3e-06,3e-06,0,1e-06,4e-06,-5e-06,0,1e-06,1.1e-05
1e-06,4e-06,-1e-06,-4e-06,5e-06,-3e-06,-1e-06,0,7e-06,2e-06,-1e-06,3e-06,0,8e-06,-4e-06,0,8e-06,1.1e-05,4e-06,-6e-06,2e-06,-4e-06,-1.4e-05,-1.9e-05,0,7e-06,-1.1e-05,-2e-06,-4e-06,4e-06,2e-06,-1e-06,4e-06,-1.8e-05,2e-06,0,3e-06,1.1e-05,-1e-06,-3e-06,-1e-06,-6e-06,-1e-06,1e-06,-1.1e-05,2e-06,-1.2e-05,-1.2e-05,5e-06,-1.1e-05,2e-06,0,-4e-06,-1e-06,2e-06,-1.1e-05,-7e-06,0,1e-06,-1e-05,1.4e-05,-1e-06,-1.2e-05,3e-06,5e-06,1.1e-05,-1e-05,-4e-06,0,-1e-06,0,1e-05,1e-06,9e-06,-3e-06,1e-05,-1e-06,0,1e-06,-1e-06,0,2.6e-05,0,7e-06,-4e-06,2e-06,-1e-06,-1.6e-05,1e-06,-2e-06,-2e-06,1e-06,-1e-06,-8e-06,1.3e-05,-2e-06,-5e-06,2e-06,-5e-06,-2e-06,2e-06,2e-06,0,-1e-06,2e-06,-5e-06,-2e-06,-1.2e-05,2e-06,-3e-06,-5e-06,-6e-06,1.5e-05,-8e-06,-1e-06,7e-06,2e-06,5e-06,0,1.1e-05,-3e-06
-1e-06,-3e-06,-3e-06,1.7e-05,-1e-06,-9e-06,2e-06,-2e-06,2e-06,2e-06,0,-7e-06,8e-06,1e-06,5e-06,-3e-06,-1.6e-05,-8e-06,0,-1.2e-05,2e-06,1e-06,4.4e-05,1.7e-05,2e-06,-1e-06,1.3e-05,-5e-06,2e-06,3e-06,-2e-06,1e-06,-5e-06,1e-05,2e-06,-1e-06,-2e-06,-6e-06,1e-06,5e-06,1e-06,-6e-06,-2e-06,4e-06,8e-06,0,1.1e-05,5e-06,-1e-05,1.1e-05,0,1e-06,1.1e-05,1e-06,1e-06,7e-06,5e-06,1e-06,0,9e-06,-1e-05,0,9e-06,-3e-06,-3e-06,-1.3e-05,1.2e-05,-5e-06,-1e-06,-7e-06,1e-06,1e-06,-2e-06,2e-06,2e-06,4e-06,-6e-06,-3e-06,5e-06,3e-06,1e-06,-1.6e-05,1e-06,-2e-06,4e-06,-3e-06,1e-06,1.3e-05,1e-06,8e-06,0,0,-6e-06,2e-06,1e-06,-1e-06,3e-06,0,6e-06,7e-06,1.2e-05,0,1e-06,2e-06,-1e-06,0,5e-06,1e-06,3e-06,2e-06,2e-06,1e-06,-5e-06,-1e-06,1e-06,-8e-06,-2e-06,-2e-06,0,-3e-06,-4e-06
-2e-06,1e-06,-1e-06,-3e-06,-2e-06,1.8e-05,0,1e-06,-8e-06,2e-06,-1e-06,7e-06,-3e-06,-4e-06,-1e-05,1e-06,1e-05,1e-05,-4e-06,1.3e-05,1e-06,0,6e-06,-7e-06,2e-06,-5e-06,-7e-06,6e-06,-5e-06,1e-06,-1e-06,-1e-06,4e-06,3e-06,-2e-06,1e-06,0,0,0,-8e-06,0,1e-06,3e-06,3e-06,2e-06,-1e-06,-4e-06,-8e-06,1.2e-05,-1e-06,-3e-06,2e-06,-4e-06,0,1e-06,2e-06,4e-06,0,0,-1e-06,-2e-06,-1e-06,2e-06,1e-06,0,1.3e-05,-4e-06,4e-06,2e-06,1e-05,0,-1e-05,2e-06,-7e-06,-4e-06,-1e-05,1.3e-05,-2e-06,-6e-06,-1e-06,1e-06,7e-06,0,1e-06,-1e-06,2e-06,1e-06,1.1e-05,0,-5e-06,-3e-06,-2e-06,-2e-06,3e-06,-7e-06,1e-06,0,-1e-06,-6e-06,-1e-06,-1.1e-05,3e-06,-1e-06,0,-2e-06,5e-06,-1.7e-05,7e-06,-7e-06,6e-06,-1e-06,4e-06,-9e-06,8e-06,-1e-06,3e-06,5e-06,-2e-06,0,-1e-05,-9e-06
1e-06,-1e-06,2e-06,-1.7e-05,0,-2.6e-05,0,0,1.5e-05,-1e-06,2e-06,-6e-06,-8e-06,6e-06,1.2e-05,-1e-06,6e-06,-1.9e-05,1e-06,4e-06,-2e-06,-1e-06,-1.3e-05,-2.5e-05,1e-06,8e-06,2e-06,-9e-06,4e-06,-2e-06,3e-06,-1e-06,-5e-06,-1.4e-05,-9e-06,1e-06,0,2e-06,-2e-06,9e-06,0,2e-06,3e-06,-1e-06,-1.3e-05,0,-3e-06,1.1e-05,-1.2e-05,-8e-06,3e-06,1e-06,-1e-06,-1e-06,1e-06,-8e-06,-3e-06,1e-06,-1e-06,-8e-06,1.2e-05,1e-06,-1.4e-05,1e-06,4e-06,-1.2e-05,-4e-06,1e-06,-2e-06,1e-06,-4e-06,0,0,5e-06,4e-06,-2e-06,-1.8e-05,1e-06,-3e-06,0,-1e-06,-8e-06,0,-2e-06,-2e-06,-1e-06,-1e-06,-1.1e-05,0,-3e-06,5e-06,3e-06,1e-06,-8e-06,-1e-06,-2e-06,-4e-06,0,6e-06,-1e-06,-4e-06,0,2e-06,-1e-06,-1e-06,-1.1e-05,1.8e-05,-2e-06,1e-05,0,-7e-06,-7e-06,1e-06,0,-1e-06,9e-06,-9e-06,3e-06,0,-1e-06,4e-06
