0.131522,0.125426,0.149154,0.165872,0.162856,0.164336,0.178926,0.198884,0.186344,0.169192,0.189287,0.193384,0.151341,0.121491,0.112372,0.106213,0.107188,0.103201,0.102359,0.103051,0.101543,0.105503,0.118983,0.109737,0.080426,0.077003,0.085688,0.085831
0.181518,0.170325,0.201821,0.228083,0.225452,0.225487,0.247777,0.278267,0.260312,0.229098,0.251902,0.257347,0.197991,0.155495,0.143774,0.139763,0.145833,0.144118,0.143162,0.141735,0.140563,0.14798,0.164413,0.149671,0.110069,0.104765,0.1145,0.11341
0.277455,0.255944,0.30064,0.347792,0.348366,0.343698,0.379732,0.429337,0.39916,0.340025,0.366833,0.373648,0.28372,0.221297,0.204696,0.204225,0.22095,0.223915,0.222226,0.215681,0.216519,0.236361,0.258559,0.227878,0.166945,0.158338,0.170084,0.166777
0.369215,0.337402,0.388066,0.457069,0.4676,0.458428,0.503225,0.563115,0.520773,0.437237,0.462058,0.464785,0.352832,0.285048,0.266582,0.265548,0.293248,0.301066,0.295513,0.282607,0.290537,0.334075,0.360624,0.305457,0.22284,0.210664,0.222628,0.216979
0.422296,0.384328,0.426648,0.501298,0.523959,0.516003,0.560012,0.608587,0.554964,0.46752,0.487273,0.480554,0.366726,0.316914,0.304869,0.298091,0.329381,0.336388,0.32265,0.306454,0.326055,0.393297,0.41608,0.340728,0.25261,0.242004,0.250071,0.239902
0.418193,0.38327,0.402017,0.457508,0.493051,0.494189,0.5223,0.538139,0.481735,0.419628,0.432013,0.415399,0.322748,0.304653,0.311206,0.300581,0.31657,0.309469,0.291453,0.280601,0.304692,0.372867,0.383068,0.311586,0.244882,0.24435,0.246169,0.226837
0.391865,0.363341,0.353585,0.378466,0.428352,0.445367,0.447882,0.433422,0.389403,0.370406,0.373301,0.340416,0.283385,0.304301,0.339764,0.330371,0.313823,0.276353,0.248258,0.242466,0.259082,0.299296,0.305271,0.271587,0.229694,0.231704,0.234516,0.208435
0.43438,0.436596,0.402012,0.406938,0.4818,0.508521,0.481912,0.469053,0.455251,0.459971,0.450289,0.395764,0.369417,0.445727,0.532797,0.539013,0.488932,0.395538,0.309137,0.271395,0.263972,0.278205,0.325375,0.345554,0.288196,0.293342,0.318074,0.25765
0.68711,0.720998,0.650543,0.647462,0.78559,0.835847,0.777337,0.750946,0.733904,0.758242,0.746436,0.648293,0.621878,0.787335,0.973654,0.995131,0.89069,0.702897,0.512002,0.418821,0.392834,0.407169,0.531852,0.604482,0.486574,0.501265,0.564886,0.430072
1.088892,1.141067,1.019919,1.027795,1.269813,1.366091,1.271239,1.193943,1.141048,1.199278,1.189781,1.023142,0.986493,1.291042,1.633358,1.66867,1.472147,1.154861,0.835251,0.665206,0.623399,0.654179,0.874191,1.000171,0.790126,0.820389,0.947638,0.706996
1.474391,1.524263,1.34474,1.379684,1.74333,1.913372,1.794462,1.637211,1.518558,1.608298,1.600552,1.361691,1.319686,1.792484,2.324953,2.366966,2.049765,1.609421,1.179135,0.921946,0.86589,0.922148,1.234174,1.404022,1.092231,1.145372,1.366686,1.022107
1.621962,1.631022,1.403228,1.46768,1.917848,2.18166,2.06855,1.826848,1.635264,1.723167,1.710982,1.440446,1.405051,1.988342,2.650891,2.681285,2.270223,1.797951,1.35328,1.045765,0.989008,1.065839,1.405639,1.57642,1.208686,1.284701,1.600646,1.228643
1.405473,1.33896,1.103957,1.179445,1.602286,1.915387,1.837117,1.561343,1.351833,1.403081,1.386408,1.171136,1.147253,1.666497,2.277247,2.276869,1.881813,1.528321,1.207086,0.944728,0.902828,0.963252,1.223255,1.339302,1.017013,1.098643,1.435239,1.15138
1.004861,0.899249,0.715794,0.764633,1.008064,1.240498,1.212475,0.998748,0.860838,0.887905,0.905685,0.818049,0.763085,1.041441,1.433222,1.392149,1.132297,1.009637,0.869161,0.704402,0.677994,0.700722,0.833889,0.884423,0.688535,0.735103,0.956652,0.812904
0.946988,0.875109,0.779941,0.777206,0.740134,0.828542,0.906548,0.774787,0.686765,0.782168,0.901224,0.890201,0.756509,0.765923,0.944586,0.853771,0.691177,0.791813,0.780914,0.686947,0.665539,0.635256,0.710833,0.771631,0.661574,0.625102,0.661135,0.569104
1.369935,1.327516,1.242145,1.214271,1.058909,1.088006,1.188097,1.020752,0.941918,1.155179,1.360852,1.337986,1.119129,1.023694,1.182694,1.0748,0.907478,1.097553,1.092685,0.992879,0.974293,0.906589,0.987485,1.088295,0.978052,0.883021,0.851918,0.749157
1.838815,1.880793,1.842473,1.812904,1.610051,1.615835,1.673397,1.40875,1.343235,1.624335,1.892538,1.910301,1.648795,1.449603,1.572314,1.454063,1.284315,1.529438,1.489637,1.37699,1.387652,1.325819,1.414998,1.488722,1.360212,1.274752,1.278888,1.208098
2.176302,2.373129,2.398272,2.415539,2.293061,2.282808,2.201397,1.854786,1.825561,2.075493,2.351568,2.449267,2.273853,1.948719,1.90023,1.799082,1.658998,1.920873,1.841543,1.725523,1.748245,1.723597,1.832817,1.848071,1.682451,1.623151,1.776842,1.820233
2.533265,2.80532,2.817041,2.998152,3.131389,3.104606,2.750211,2.352476,2.365175,2.520055,2.737389,2.925731,3.074193,2.65474,2.283693,2.190193,2.026364,2.265773,2.188422,2.029189,1.969198,2.010037,2.216453,2.197619,1.914175,1.80935,2.192698,2.423661
3.107781,3.301087,3.159575,3.495789,3.877873,3.897604,3.209472,2.750358,2.926099,3.112875,3.196003,3.357107,3.935169,3.530337,2.770913,2.601231,2.386402,2.612491,2.549751,2.349195,2.209832,2.278667,2.60988,2.594057,2.100718,1.849914,2.367691,2.740065
3.57994,3.765337,3.404948,3.63144,4.105027,4.203741,3.238486,2.742685,3.169696,3.496599,3.446689,3.625085,4.602077,4.212151,3.112853,2.830546,2.5022,2.677047,2.689709,2.50371,2.318432,2.32649,2.684098,2.702366,2.117298,1.769847,2.222872,2.576228
3.527867,3.745104,3.366116,3.365239,3.720211,3.762771,2.749572,2.298544,2.820901,3.278465,3.133504,3.342368,4.588899,4.265678,3.055449,2.655416,2.180987,2.279974,2.402443,2.258502,2.02556,1.976952,2.215703,2.220472,1.730376,1.430936,1.78192,2.020761
2.824483,2.996051,2.897606,2.861654,2.962475,2.789661,2.012987,1.744932,2.165734,2.572899,2.359023,2.496683,3.580873,3.41603,2.619648,2.205967,1.660891,1.643657,1.718081,1.675323,1.490961,1.388936,1.42552,1.401225,1.139051,0.989736,1.248667,1.413455
1.852743,1.930897,2.071762,2.15006,2.118466,1.910079,1.566112,1.496509,1.637043,1.801229,1.645658,1.700025,2.24529,2.205901,2.016338,1.663328,1.116846,1.026891,1.091763,1.168931,1.084879,1.006065,0.918945,0.8213,0.753599,0.743547,0.856126,0.928993
1.297125,1.330776,1.361392,1.482719,1.596616,1.615981,1.538399,1.656222,1.544512,1.217461,1.190176,1.332456,1.476265,1.564783,1.659478,1.279908,0.804347,0.770534,0.876597,0.934651,0.845843,0.881842,0.814341,0.621967,0.627403,0.624239,0.579584,0.622992
1.249596,1.379846,1.246073,1.276833,1.398751,1.52295,1.602028,1.832002,1.613963,1.053003,1.169936,1.389805,1.388094,1.575022,1.604988,1.138176,0.755087,0.762053,0.878784,0.914795,0.783133,0.852229,0.903262,0.768979,0.752095,0.652231,0.519017,0.495951
1.537214,1.751125,1.391015,1.296083,1.432728,1.494454,1.560894,1.820491,1.713722,1.211366,1.348656,1.582672,1.591945,1.881087,1.849468,1.236705,0.884211,0.907687,0.907076,0.972726,0.920417,0.927454,1.007056,0.975742,0.911906,0.718165,0.557741,0.486025
1.684004,2.045909,1.639028,1.444946,1.545057,1.3934,1.36475,1.740718,1.919964,1.524827,1.500338,1.660068,1.758729,2.098601,2.046309,1.435299,1.164184,1.20601,0.989624,1.06316,1.181849,1.077966,1.050643,1.102778,1.088358,0.874108,0.636065,0.505036
1.548815,2.020929,1.831977,1.694997,1.683333,1.253422,1.26893,1.853052,2.093318,1.678482,1.452616,1.464052,1.666597,1.993852,1.865172,1.43757,1.374606,1.46548,1.135093,1.182519,1.365296,1.190073,1.096364,1.195679,1.256252,1.035917,0.678841,0.51987
1.466745,1.844201,1.798531,1.766843,1.622405,1.089725,1.211671,1.755146,1.882291,1.574123,1.276232,1.111398,1.279357,1.489603,1.324443,1.227755,1.403876,1.484042,1.198111,1.190126,1.303813,1.156138,1.112445,1.239599,1.294248,1.038575,0.655748,0.560994
1.453364,1.540841,1.428295,1.452786,1.244001,0.808505,1.015447,1.351047,1.346487,1.25281,1.058962,0.807576,0.808006,0.918952,0.881411,1.000078,1.223619,1.247527,1.110682,1.047654,1.045239,0.919839,0.963537,1.113866,1.07611,0.843294,0.567957,0.57175
1.390066,1.211018,0.927573,0.906411,0.754691,0.55288,0.835714,1.006374,1.012012,1.077642,0.905164,0.635901,0.574917,0.69059,0.846727,0.965636,0.988125,0.967682,0.946371,0.85444,0.750383,0.601301,0.682776,0.829422,0.712173,0.643977,0.563071,0.549957
1.080251,0.864078,0.579231,0.485829,0.476857,0.479753,0.684944,0.720159,0.796214,0.946711,0.77502,0.540382,0.54882,0.701796,0.927788,0.982445,0.756142,0.664999,0.738354,0.728257,0.540627,0.346489,0.448764,0.563237,0.434135,0.489268,0.57873,0.509779
0.746434,0.61926,0.405785,0.274486,0.404389,0.562517,0.625882,0.53378,0.583699,0.752076,0.691628,0.502977,0.557009,0.839779,1.065136,0.981142,0.588502,0.485508,0.590692,0.601753,0.459059,0.294279,0.389586,0.467568,0.320153,0.40628,0.539343,0.420033
0.648167,0.614437,0.408964,0.223501,0.404647,0.66096,0.629539,0.453912,0.455554,0.642974,0.705757,0.508809,0.553088,0.940474,1.144359,0.926623,0.49787,0.398966,0.49418,0.485183,0.424064,0.32854,0.370256,0.395512,0.289722,0.408297,0.479435,0.347073
0.629394,0.704808,0.519415,0.314087,0.432413,0.652043,0.564591,0.413279,0.408824,0.636877,0.814504,0.570438,0.531751,0.892204,1.057877,0.854658,0.509319,0.410426,0.430533,0.378314,0.379056,0.345095,0.312982,0.276089,0.247507,0.420649,0.443069,0.310359
0.647236,0.752295,0.615279,0.420447,0.413245,0.525071,0.476859,0.468104,0.485817,0.721455,0.902486,0.579722,0.444701,0.705758,0.908825,0.749943,0.473747,0.401043,0.338033,0.308013,0.368117,0.358445,0.28129,0.179037,0.218195,0.395464,0.402735,0.335736
0.714457,0.730085,0.617754,0.491496,0.415611,0.410353,0.415226,0.543209,0.612911,0.811756,0.94182,0.548548,0.325566,0.500966,0.805708,0.677913,0.419152,0.340323,0.28198,0.332787,0.415561,0.413672,0.302675,0.152512,0.220192,0.325825,0.315323,0.361241
0.716365,0.603196,0.500249,0.478999,0.457645,0.393697,0.395747,0.564811,0.719924,0.876959,0.956451,0.594103,0.263302,0.375182,0.658735,0.58629,0.373195,0.25254,0.269359,0.38448,0.462846,0.48901,0.347977,0.157105,0.212763,0.233268,0.212492,0.347794
0.607238,0.418562,0.32891,0.39545,0.504674,0.4496,0.355989,0.487734,0.744302,0.84626,0.859723,0.628574,0.283826,0.34408,0.517304,0.479288,0.332594,0.209939,0.288787,0.405395,0.43225,0.504054,0.375314,0.16656,0.187615,0.177964,0.18214,0.328757
