-0.000172,-0.000167,-6.5e-05,-4.8e-05,-0.000128,-0.000121,-0.00019,-0.00017,-0.00021,-0.000208,-0.000174,-0.000227,-0.000319,-0.000371,-0.000281,-0.000191,-0.000164,-0.000142,-0.000139,-9.2e-05,-7.3e-05,-8.5e-05,-0.000135,-0.000129,-0.000131,-0.000169,-0.000213,-0.000111
-0.000176,-0.000186,-0.00011,-0.000193,-0.00026,-0.000167,-0.000245,-0.00021,-0.000276,-0.000202,-0.000161,-0.000291,-0.000411,-0.000528,-0.000368,-0.000231,-0.000214,-0.000136,-0.000154,-0.000171,-0.000158,-0.000111,-0.00014,-0.000106,-8.7e-05,-0.000175,-0.000251,-0.000108
-8.1e-05,-0.000139,-0.000108,-0.000179,-0.000141,-3.7e-05,-4e-05,-9.5e-05,-6.8e-05,-1.5e-05,-8e-05,-7.5e-05,-0.000181,-0.000246,-0.00013,-9e-05,-0.000155,-0.000104,-1.4e-05,-9.9e-05,-0.000167,-0.000135,-0.000102,-0.000115,-0.000138,-0.000208,-0.000173,-9.9e-05
5e-05,2.6e-05,-3.8e-05,-2.6e-05,5.5e-05,9.6e-05,0.000157,3.3e-05,0.000121,0.000124,3.6e-05,0.000189,0.000189,0.000256,0.000214,0.000106,3.6e-05,2.4e-05,0.00014,4.7e-05,1.5e-05,5.3e-05,1.6e-05,-1.9e-05,1.2e-05,2.4e-05,5.8e-05,2.5e-05
-8e-06,4.8e-05,-1.7e-05,5.4e-05,6.7e-05,8e-06,8.4e-05,3.9e-05,6.9e-05,7e-06,1e-05,0.00018,0.000291,0.00039,0.000217,9.1e-05,7e-05,4.9e-05,0.00013,5.2e-05,6.2e-05,0.000133,2.2e-05,5.9e-05,0.000151,0.000218,0.000131,6.5e-05
-0.000158,-9.9e-05,-0.000113,-5.1e-05,-9.4e-05,-0.000176,-0.000186,-0.000126,-0.000157,-0.000228,-0.000163,-0.000102,-3e-06,2.1e-05,-0.000106,-9.6e-05,-8.2e-05,-7.8e-05,-4.1e-05,-5.6e-05,-4.7e-05,1e-05,-8.7e-05,-1.6e-05,1.9e-05,-1.6e-05,-0.000128,-0.000108
-6.1e-05,-3.6e-05,-9.4e-05,-0.000185,-0.000164,-0.00013,-0.000217,-0.00015,-0.000256,-0.000209,-0.00013,-0.000271,-0.000192,-0.000221,-0.000179,-8.6e-05,-7e-05,-7.4e-05,-0.000158,-1e-04,-6.2e-05,-5.3e-05,-4.9e-05,6e-06,-1.9e-05,-0.000139,-0.000183,-0.00012
0.000111,8.9e-05,-6e-06,-0.000196,-4.8e-05,7.7e-05,2.5e-05,8e-06,-0.000145,-2.7e-05,5.9e-05,-0.000122,-9.5e-05,-0.000154,-1.5e-05,6.1e-05,2.9e-05,1.4e-05,-8.5e-05,-4.6e-05,-4.6e-05,-7.7e-05,5.2e-05,7e-05,-4e-06,-7.1e-05,1.6e-05,2.8e-05
5.2e-05,9e-06,-4.3e-05,-9e-05,8e-05,0.000121,0.000127,8e-05,2.2e-05,6.3e-05,0.000141,9.5e-05,-2e-06,-2.9e-05,1.8e-05,4.6e-05,1.6e-05,5.7e-05,4.6e-05,1.7e-05,-3e-05,-7.1e-05,2.6e-05,2e-06,-9.2e-05,-9.5e-05,8.4e-05,2.9e-05
-9.5e-05,-6.5e-05,-7.4e-05,1.3e-05,3.8e-05,-3.1e-05,5e-06,9e-06,2.7e-05,-6e-06,7.5e-05,0.000108,-1e-05,4.6e-05,-2.1e-05,-7e-05,0,5.1e-05,1.3e-05,-1e-05,-3e-06,-2e-05,-3.9e-05,-7.7e-05,-0.000103,-1.9e-05,3.6e-05,-9.3e-05
-6.3e-05,-8e-06,-2.2e-05,7.5e-05,-7.1e-05,-0.000164,-0.000139,-9.9e-05,-8.8e-05,-0.000105,-5.2e-05,-5.8e-05,-9.8e-05,-1.3e-05,-8.9e-05,-0.00014,8e-06,-1.2e-05,-9.8e-05,-6.2e-05,4e-06,-1e-05,-6.6e-05,-0.000144,-8e-05,5.3e-05,-5e-05,-0.000177
4.6e-05,4.4e-05,6.7e-05,0.000115,-0.000104,-0.000152,-0.000162,-7.5e-05,-1.6e-05,-6e-06,-7.2e-05,-0.000164,-0.000114,-6.4e-05,-7.5e-05,-6.4e-05,1.7e-05,-4.1e-05,-0.00012,-5.2e-05,2.9e-05,-1.7e-05,-3.6e-05,-0.000107,-4.9e-05,-3.9e-05,-0.000127,-0.000145
5.1e-05,3.7e-05,0.000116,6.7e-05,-7.3e-05,-5.3e-05,-5.6e-05,5.9e-05,0.000112,0.000128,3e-05,-9.7e-05,5.1e-05,6.5e-05,7.9e-05,9.3e-05,4.7e-05,-3.2e-05,-0.000129,-4.5e-05,2.8e-05,2e-06,6.5e-05,5.1e-05,4.4e-05,-1.6e-05,-3.1e-05,-5.4e-05
-7.4e-05,-6.7e-05,3.7e-05,-2.4e-05,-2e-05,-4.2e-05,2.1e-05,7.6e-05,3.3e-05,3.7e-05,2.5e-05,-6e-06,0.000138,0.000114,8.4e-05,0.000116,3.1e-05,-3.8e-05,-0.00012,-7.1e-05,-3.2e-05,-9e-06,7.9e-05,5.2e-05,5.9e-05,9.5e-05,9e-05,1.2e-05
-0.000215,-0.000183,-7.9e-05,-6.5e-05,-4e-06,-0.000126,-2.7e-05,-6.6e-05,-0.000125,-0.000142,-0.000129,-6e-06,3.6e-05,-1.9e-05,-6.6e-05,-3.2e-05,-7.8e-05,-4.3e-05,-5.5e-05,-5.1e-05,-7.9e-05,-6.2e-05,-1.5e-05,-6.2e-05,-7.8e-05,1.2e-05,1.7e-05,-4.2e-05
-8.4e-05,-5.2e-05,-9e-06,2e-05,3e-05,-8.1e-05,-2.6e-05,-4.9e-05,-4e-06,7e-06,-7.6e-05,2e-06,-1.8e-05,-5.1e-05,-6.9e-05,-5.8e-05,-2.3e-05,-7e-06,3e-05,6.5e-05,1.2e-05,-1.8e-05,-9e-06,-1.9e-05,-5.5e-05,3.4e-05,1.6e-05,-3.7e-05
0.000143,0.000118,9.3e-05,9.5e-05,5.7e-05,5.5e-05,2.8e-05,4.1e-05,0.000183,0.000218,4e-05,-2.6e-05,-5.7e-05,-3.6e-05,-1.5e-05,-3e-05,3.4e-05,2.2e-05,3.4e-05,9.5e-05,8.3e-05,-4e-06,-1.5e-05,1.5e-05,3.3e-05,8e-05,7.1e-05,6.8e-05
0.000137,9e-05,2.6e-05,5e-05,-3e-06,6.2e-05,7e-06,-1.4e-05,7.4e-05,0.000118,1.1e-05,-9.4e-05,-9.9e-05,-2.9e-05,-2.9e-05,-2.8e-05,-8e-06,-1.3e-05,-2.9e-05,-5e-06,1.5e-05,-3.8e-05,-8.5e-05,-4e-05,-2e-05,-7.6e-05,-2.1e-05,6.4e-05
2.9e-05,2.3e-05,-5.2e-05,-3e-05,-6.9e-05,-5e-06,-3.6e-05,-5.1e-05,-0.000101,-1e-04,-4.2e-05,-6.6e-05,-3.8e-05,2.5e-05,-2.4e-05,1e-05,-1.6e-05,-6e-05,-8.1e-05,-8.9e-05,-7.5e-05,-7e-06,-6.5e-05,-3.3e-05,1.6e-05,-9.7e-05,-8.7e-05,3e-06
