-0.012455,-0.011696,-0.012507,-0.01599,-0.014084,-0.011486,-0.011863,-0.012324,-0.016202,-0.012082,-0.012046,-0.011386,-0.008595,-0.009151,-0.00827,-0.008891,-0.00991,-0.007689,-0.006533,-0.006865,-0.007485,-0.010395,-0.008602,-0.006054,-0.006774,-0.007136,-0.005056,-0.00363
-0.004871,-0.001329,-0.0012,-5e-04,-0.001822,0.002231,-0.001558,-0.001547,0.001308,-0.000249,-0.005051,-0.004046,-0.002446,-0.000655,0.000883,0.001566,-0.002384,-0.003255,-0.002508,-0.004568,-0.003789,-0.000818,0.001113,0.001045,0.002291,0.00135,-0.002374,-0.001425
0.003858,0.003364,0.002626,0.003165,0.003208,0.002611,0.004198,0.003322,0.004494,0.003218,0.004266,0.005089,0.002742,0.002098,0.002834,0.002173,0.003295,0.002497,0.002274,0.001515,0.001892,0.003064,0.002842,0.002058,0.001839,0.001327,0.001199,0.001351
0.003922,0.001011,-0.000219,-0.000747,0.001291,-0.002922,0.001415,0.000857,-0.002269,-0.001189,0.003978,0.003618,0.001636,-0.000504,-0.001953,-0.003667,0.000788,0.001353,0.001965,0.004085,0.002817,-0.000531,-0.002624,-0.002173,-0.00312,-0.002282,0.001752,0.000997
0.001388,0.002322,0.00497,0.007404,0.005377,0.004597,0.002302,0.00432,0.005263,0.002956,0.000509,-0.00116,0.001069,0.003208,0.000913,0.002034,0.000594,-0.000899,5.6e-05,0.00231,0.001494,0.002179,0.001195,0.000648,0.002064,0.00332,0.001307,2.4e-05
-0.005417,-0.00395,-0.000251,-0.000768,-0.003075,-0.000114,-0.002855,-0.001334,-0.000812,-0.001329,-0.004825,-0.005047,-0.002306,-0.000263,0.000272,0.00179,-0.001542,-0.001976,-0.002659,-0.002912,-0.002618,-0.001278,0.000643,0.000831,0.001284,0.000911,-0.0016,-0.00098
-0.005626,-0.006189,-0.008888,-0.013277,-0.010339,-0.008789,-0.006813,-0.008663,-0.011318,-0.007561,-0.004452,-0.001998,-0.003665,-0.006579,-0.003391,-0.00534,-0.003567,-0.000453,-0.001795,-0.004438,-0.003783,-0.006759,-0.004836,-0.002898,-0.004444,-0.005824,-0.002722,-0.001028
0.006262,0.006603,0.001548,0.002819,0.004842,0.004365,0.004537,0.002496,0.005107,0.004522,0.005031,0.006864,0.003423,0.001717,0.002689,0.001562,0.003209,0.003565,0.003198,0.001026,0.002348,0.003414,0.00233,0.001466,0.001816,0.001736,0.001697,0.001045
0.006979,0.006735,0.007469,0.011511,0.009772,0.008786,0.008349,0.008838,0.011436,0.008729,0.005899,0.004243,0.004838,0.007292,0.004126,0.006841,0.005573,0.002263,0.002589,0.004098,0.004553,0.009054,0.006838,0.004013,0.004672,0.005623,0.002983,0.001299
-0.004036,-0.006116,-0.002503,-0.003861,-0.00423,-0.006158,-0.004589,-0.002967,-0.007492,-0.005114,-0.003057,-0.006412,-0.003047,-0.001832,-0.004473,-0.003055,-0.00285,-0.002855,-0.002348,0.000964,-0.000865,-0.003049,-0.003412,-0.002585,-0.00386,-0.003257,-0.001224,-0.001085
-0.003745,-0.00323,-0.002039,-0.003257,-0.003273,-0.004171,-0.006175,-0.005158,-0.005522,-0.004591,-0.002805,-0.003674,-0.003437,-0.004354,-0.002514,-0.004211,-0.003902,-0.001791,-0.001603,-0.00144,-0.002466,-0.006083,-0.004758,-0.002586,-0.002477,-0.00281,-0.002165,-0.001092
0.003124,0.00486,0.004075,0.005418,0.003735,0.005938,0.003805,0.00312,0.008737,0.005717,0.003385,0.005757,0.002918,0.001932,0.005574,0.004602,0.002856,0.00241,0.002083,-0.000816,0.00079,0.00322,0.004537,0.00366,0.004778,0.003655,0.000656,0.00143
-2.4e-05,-0.000692,-0.00373,-0.004875,-0.003955,-0.002268,0.001941,-0.000117,-0.001738,-0.000773,-0.000273,0.001978,0.001123,-0.000305,-0.000177,-0.000434,2.3e-05,6.6e-05,0.000746,-0.001089,-0.000137,0.001272,0.001206,0.000173,-0.000579,-0.001184,0.000532,0.000904
-0.003032,-0.003135,-0.005133,-0.005362,-0.003186,-0.004272,-0.002616,-0.003005,-0.007873,-0.005667,-0.00469,-0.005111,-0.002959,-0.002257,-0.005399,-0.005798,-0.004285,-0.003274,-0.002037,-0.000714,-0.001875,-0.003691,-0.005031,-0.004236,-0.004322,-0.002978,-0.000377,-0.001508
0.000711,0.001908,0.006493,0.008305,0.006698,0.005796,0.001374,0.003747,0.005422,0.002871,-7.7e-05,-0.001849,9.4e-05,0.003621,0.001626,0.002931,0.001786,-3e-06,-0.001169,0.001574,0.000544,0.001139,0.00063,0.000952,0.00217,0.003514,0.000568,-0.000758
0.001603,0.000631,0.004852,0.002308,0.000754,0.00103,0.000655,0.002037,0.003749,0.002669,0.003644,0.003063,0.001764,0.001778,0.003292,0.004104,0.004389,0.003464,0.001054,0.001678,0.001663,0.001327,0.002522,0.002724,0.002056,0.001224,0.000377,0.001202
0.000541,-0.000536,-0.004658,-0.007244,-0.005717,-0.005278,-0.002694,-0.004473,-0.005182,-0.002814,0.001017,0.002553,-0.000607,-0.004864,-0.001974,-0.003644,-0.001366,0.001087,0.001453,-0.000737,3e-06,-0.002485,-0.001946,-0.001571,-0.002185,-0.003363,-0.000454,0.000613
0,0.001769,-0.002586,0.00133,0.001494,0.002642,0.001611,-0.000238,0.001594,0.001361,-0.001593,-0.000295,-1e-04,-0.000913,-0.000505,-0.000482,-0.002299,-0.002474,-0.000183,-0.001668,-0.000322,0.002148,0.001165,-0.000437,0.000695,0.001107,3e-06,-0.000663
-0.002626,-0.002021,7.8e-05,0.002998,0.002622,0.00224,0.002127,0.002802,0.002005,0.001557,-0.001737,-0.003321,0.000308,0.003686,0.001411,0.003393,0.000586,-0.001919,-0.001444,-0.000556,-0.000393,0.003238,0.00293,0.001888,0.001213,0.001619,-0.000146,-0.000529
