-0.011116,-0.011372,-0.007068,-0.011098,-0.012997,-0.011421,-0.009194,-0.008698,-0.010163,-0.011347,-0.010039,-0.010378,-0.010404,-0.011784,-0.009749,-0.006714,-0.008558,-0.015128,-0.011444,-0.010276,-0.011585,-0.015404,-0.015411,-0.010097,-0.005629,-0.006131,-0.011237,-0.014038
-0.00636,-0.004576,-0.000728,-0.001427,-0.001545,-0.003738,-0.007999,-0.003526,-0.004434,-0.004597,-0.002321,-0.005272,-0.00432,-0.004842,-0.00371,-0.004496,-0.002425,0.00036,-0.000231,0.000328,0.002805,0.007323,-0.001675,-0.002726,-0.001347,-0.000508,-0.004409,-0.011092
0.000838,0.001961,0.000854,0.001722,0.002786,0.000342,-0.00099,-0.000529,0.000504,0.000858,-0.000518,2.4e-05,0.001684,0.002533,0.002056,-0.000815,-0.001277,0.001476,0.00288,0.002053,0.002081,0.002902,0.002725,0.00295,0.00156,0.000907,0.004278,0.00325
0.005093,0.003708,-0.000627,-0.000609,5.2e-05,8e-05,0.004069,0.000388,0.002498,0.0027,-0.000486,0.00121,0.002356,0.003589,0.00244,0.001628,-0.002004,-0.004076,-0.000931,-0.001752,-0.005111,-0.01081,-0.001808,0.000641,0.000242,-0.002079,0.002264,0.008724
0.006619,0.00515,0.002403,0.0035,0.003858,0.003776,0.00379,0.004111,0.005752,0.006571,0.005904,0.002035,0.002168,0.002429,0.001206,0.002652,0.003782,0.006565,0.002908,0.003395,0.004141,0.006391,0.006195,0.001339,0.000495,0.001061,-0.000934,0.001766
-0.003197,-0.003018,-0.001428,-0.002354,-0.00292,-0.003256,-0.004397,-0.001808,-0.001094,-0.001015,-0.000706,-0.004507,-0.004925,-0.006079,-0.005432,-0.002588,6.6e-05,0.001272,-0.001391,-0.000599,0.001387,0.005337,0.001808,-0.000913,-0.001015,0.000951,-0.003101,-0.007994
-0.010422,-0.009779,-0.005931,-0.008625,-0.008891,-0.008802,-0.00767,-0.007944,-0.007999,-0.009332,-0.008725,-0.006261,-0.007174,-0.007616,-0.005808,-0.005537,-0.00628,-0.011273,-0.006674,-0.007319,-0.009558,-0.014799,-0.012359,-0.00508,-0.002163,-0.003426,-0.003288,-0.006487
0.000662,0.001373,0.002418,0.004062,0.005623,0.005128,0.002441,0.002154,0.001006,0.000845,0.002807,0.005895,0.005402,0.006807,0.006202,0.001845,0.002539,0.003934,0.004362,0.003431,0.003047,0.001171,-0.000975,0.001165,0.001961,0.000732,0.00397,0.005739
0.008666,0.008877,0.005886,0.008743,0.009266,0.011036,0.009378,0.008656,0.005973,0.007427,0.008365,0.008928,0.008986,0.00978,0.008042,0.006235,0.006961,0.010962,0.006786,0.007356,0.010305,0.015446,0.012206,0.005782,0.002388,0.00446,0.0066,0.009515
0.002044,0.000447,-0.001328,-0.002785,-0.005229,-0.001142,0.004223,0.001141,-0.000903,-0.000486,-0.001299,-0.000149,-0.001825,-0.00301,-0.002382,0.00202,-0.000758,-0.005806,-0.005054,-0.003908,-0.004851,-0.005752,0.000199,-0.001178,-0.001757,-0.000255,-0.002098,0.000864
-0.002521,-0.003352,-0.001597,-0.002366,-0.003823,-0.003775,-0.00202,-0.001985,-0.000936,-0.001771,-0.001842,-0.001552,-0.004444,-0.005766,-0.003924,-0.000847,-0.000421,-0.003189,-0.002552,-0.00242,-0.004574,-0.006682,-0.005076,-0.003048,-0.001231,-0.002783,-0.005895,-0.005556
-0.002431,-0.00051,0.002168,0.004284,0.005384,0.000272,-0.004672,-0.000278,0.001869,0.001371,0.000503,-0.000533,0.000331,0.000333,0.000881,-0.001662,0.00151,0.007574,0.005299,0.004248,0.006526,0.011072,0.00392,0.003395,0.002016,0.001231,0.001867,-0.003929
-0.00363,-0.002221,-0.001666,-0.002651,-0.001857,-0.00438,-0.005056,-0.003469,-0.003648,-0.004415,-0.005221,-0.004955,-0.000657,0.000413,1.1e-05,-0.003301,-0.006005,-0.005174,-0.002201,-0.003196,-0.001793,-0.002087,-0.00217,0.000463,-0.000323,2e-05,0.003016,-0.000898
0.000811,-0.000166,-0.002151,-0.004545,-0.00447,-0.002163,-1.6e-05,-0.002318,-0.003205,-0.003308,-0.001705,-0.00303,-0.000337,0.00078,-0.000302,-0.001074,-0.00499,-0.00877,-0.004918,-0.004193,-0.006022,-0.011351,-0.008013,-0.005315,-0.002078,-0.00248,-0.003303,0.000875
0.005901,0.00487,0.002171,0.003283,0.003687,0.005913,0.005072,0.003016,0.00387,0.005708,0.005931,0.002578,0.002414,0.002143,0.000764,0.002287,0.004259,0.006283,0.003817,0.005132,0.005307,0.007847,0.005245,6.7e-05,0.00025,0.000691,-0.001634,0.002205
0.00097,0.001415,5e-04,0.001363,0.001231,0.000608,0.001457,0.000229,0.002686,0.003933,0.000976,0.001444,-0.000733,-0.001899,-0.0017,0.000817,0.003243,0.004238,0.00285,0.002323,0.002399,0.005576,0.008165,0.004806,0.001556,0.00256,0.003632,0.001756
-0.004081,-0.003904,-0.002256,-0.002849,-0.002708,-0.005536,-0.004171,-0.003063,-0.000946,-0.002422,-0.003139,-0.000473,-0.002341,-0.002445,-0.001705,-0.001447,-0.000668,-0.003739,-0.002867,-0.003663,-0.005874,-0.010697,-0.005093,-0.000161,0.000546,-0.000882,0.000696,-0.000769
-0.00161,-0.002002,0.000363,0.001273,0.002067,0.001199,-0.002144,0.001422,-0.000111,-0.001455,0.00102,0.000465,0.001844,0.002261,0.001752,0.000119,0.001747,0.003283,-0.000261,0.00032,0.001675,0.000976,-0.004838,-0.002802,-0.000406,-0.001833,-0.002729,-0.002128
0.000652,0.000632,0.001102,0.000832,-0.000196,0.004058,0.002633,0.002844,-0.001974,-0.001648,0.000349,0.000676,0.002202,0.001255,0.001098,0.001481,0.000272,0.001584,0.000352,0.000586,0.003185,0.007392,0.002501,-6.2e-05,-0.00089,0.001371,0.000699,0.000432
