0.031748,0.04459,0.066879,0.09895,0.116736,0.149942,0.170417,0.162058,0.189329,0.169619,0.124252,0.132119,0.141299,0.13814,0.149646,0.168893,0.172352,0.145518,0.138853,0.156828,0.152926,0.157281,0.170785,0.167943,0.160951,0.197935,0.226295,0.18479
0.036864,0.051042,0.074508,0.110409,0.132201,0.168735,0.190988,0.186161,0.22273,0.197115,0.140894,0.151083,0.162479,0.159451,0.172622,0.193738,0.200576,0.172324,0.164389,0.185872,0.181224,0.184927,0.19964,0.197262,0.189738,0.229726,0.260651,0.215596
0.043391,0.059065,0.082424,0.121397,0.148121,0.18535,0.207617,0.213004,0.266735,0.233307,0.160488,0.172147,0.186252,0.184462,0.198957,0.220353,0.232308,0.205735,0.198497,0.225043,0.218433,0.219502,0.23505,0.235112,0.228446,0.267235,0.298972,0.255858
0.044183,0.059884,0.079999,0.114938,0.141501,0.169483,0.185377,0.204461,0.276105,0.243684,0.160111,0.164777,0.178083,0.181881,0.195678,0.209988,0.220629,0.205511,0.208461,0.236218,0.224968,0.221205,0.235372,0.239873,0.238766,0.262834,0.285209,0.26438
0.043585,0.059714,0.079118,0.109508,0.132444,0.148422,0.158868,0.184823,0.26755,0.249224,0.164219,0.156023,0.167813,0.180216,0.190408,0.19362,0.194265,0.191848,0.213408,0.247027,0.23057,0.215718,0.234362,0.251061,0.25671,0.259812,0.267091,0.274528
0.049463,0.068946,0.094498,0.130562,0.162524,0.180707,0.195031,0.213682,0.293972,0.294483,0.212397,0.1975,0.20848,0.221756,0.231516,0.232474,0.221027,0.222144,0.265083,0.3208,0.299214,0.256775,0.286885,0.340139,0.35301,0.34416,0.35727,0.373436
0.066906,0.09808,0.140014,0.198278,0.267782,0.300933,0.315861,0.322252,0.408009,0.422133,0.325745,0.319206,0.342304,0.340702,0.336846,0.343034,0.329164,0.331508,0.405647,0.489939,0.443585,0.361546,0.413386,0.541983,0.578398,0.574362,0.628759,0.63449
0.105235,0.159646,0.233932,0.334152,0.474584,0.540144,0.542202,0.509268,0.593979,0.632023,0.524093,0.544779,0.597885,0.562792,0.5268,0.554048,0.53989,0.547159,0.703913,0.840239,0.726146,0.565618,0.644351,0.925049,1.0304,1.053232,1.201302,1.174646
0.172405,0.263095,0.393795,0.569692,0.82308,0.933404,0.911545,0.802826,0.864319,0.94737,0.831065,0.889225,0.987011,0.910621,0.843,0.912463,0.883401,0.896966,1.229753,1.472331,1.227696,0.91847,1.031139,1.566513,1.808804,1.884756,2.178116,2.086855
0.264247,0.398775,0.610111,0.904599,1.299603,1.43944,1.393542,1.207629,1.229991,1.367651,1.226315,1.308637,1.460575,1.359233,1.278034,1.399115,1.330415,1.34677,1.952335,2.346121,1.900475,1.391228,1.561207,2.425217,2.844721,3.008255,3.492712,3.300893
0.358676,0.534644,0.828009,1.256046,1.761359,1.872806,1.810407,1.619199,1.634644,1.78346,1.55816,1.631639,1.849151,1.765726,1.7003,1.854043,1.731182,1.769098,2.663941,3.164682,2.48851,1.818991,2.069118,3.193663,3.756853,4.043773,4.696133,4.386169
0.412703,0.617538,0.949479,1.442651,1.938948,1.953937,1.898442,1.798358,1.812378,1.89145,1.59319,1.644385,1.937565,1.929197,1.881393,2.008052,1.870027,1.980151,2.995816,3.425659,2.607038,1.950823,2.266378,3.371615,3.939322,4.340754,5.019137,4.640615
0.387432,0.590992,0.88438,1.30824,1.654611,1.571979,1.547198,1.579236,1.581785,1.534603,1.273206,1.335369,1.645558,1.70168,1.653389,1.713375,1.625179,1.806035,2.638661,2.841139,2.100252,1.660003,1.972644,2.722102,3.123312,3.547159,4.063896,3.730482
0.309137,0.480645,0.668363,0.902581,1.051611,0.963828,0.976551,1.078136,1.094403,0.966536,0.803086,0.887201,1.138416,1.217546,1.157111,1.193694,1.209185,1.36366,1.809972,1.823043,1.359471,1.185366,1.403355,1.706203,1.891304,2.16997,2.417743,2.228703
0.255447,0.377162,0.449995,0.508912,0.554749,0.559057,0.610305,0.681222,0.723634,0.647056,0.571341,0.6382,0.791689,0.875957,0.838341,0.839111,0.876027,0.972984,1.17674,1.191228,1.02401,0.978401,1.061733,1.144357,1.217781,1.312624,1.396109,1.349153
0.260784,0.356907,0.410158,0.415388,0.436313,0.522627,0.607544,0.63343,0.663664,0.645198,0.640473,0.704822,0.873578,0.991158,0.963449,0.943788,0.923843,0.954152,1.062833,1.148293,1.202762,1.225035,1.232936,1.304611,1.381249,1.42218,1.537487,1.528722
0.337457,0.436761,0.519387,0.547287,0.552869,0.659795,0.738223,0.758964,0.827426,0.83236,0.853184,0.934457,1.196392,1.365403,1.26656,1.206005,1.205599,1.244242,1.240491,1.280649,1.530184,1.697236,1.63082,1.692988,1.828368,1.912248,2.123122,2.08113
0.480851,0.591645,0.67695,0.754596,0.792805,0.905301,0.945637,0.980798,1.185043,1.256485,1.224327,1.288911,1.611704,1.789616,1.582676,1.423712,1.455295,1.558614,1.395588,1.398373,1.939929,2.283226,2.181752,2.155925,2.175082,2.264151,2.594067,2.539688
0.67469,0.807596,0.872955,0.978721,1.071147,1.198357,1.152339,1.214653,1.655438,1.880072,1.780024,1.787028,2.060064,2.138758,1.901099,1.674553,1.688854,1.916094,1.666102,1.64853,2.360737,2.74207,2.764507,2.624018,2.298191,2.337355,2.796911,2.798174
0.84124,1.017023,1.06772,1.151256,1.265959,1.418467,1.284264,1.369213,2.040214,2.44712,2.314592,2.229613,2.361681,2.308091,2.106197,1.813923,1.809982,2.271604,2.055539,2.002383,2.705688,2.927978,3.122552,2.963956,2.315006,2.245686,2.879671,3.129175
0.865729,1.075022,1.139226,1.180085,1.267755,1.462415,1.351769,1.395726,2.04883,2.559094,2.495514,2.320928,2.349939,2.324241,2.133548,1.709189,1.691578,2.32078,2.200026,2.145147,2.792105,2.855187,3.125791,3.028996,2.30188,2.137026,2.837579,3.329443
0.707573,0.890152,0.956138,1.003409,1.116184,1.302568,1.259076,1.25556,1.623995,2.02893,2.076108,1.875289,1.865334,1.960198,1.862934,1.511362,1.480723,1.954826,1.910302,1.871352,2.387172,2.4773,2.70446,2.626142,2.066354,1.953587,2.538059,3.015756
0.489465,0.604455,0.643445,0.709869,0.83103,0.946935,0.983083,1.0024,1.078128,1.262962,1.352225,1.21911,1.221864,1.335439,1.36285,1.286199,1.229004,1.376075,1.461446,1.418739,1.614388,1.815903,1.987169,1.95909,1.690685,1.639934,1.945035,2.246211
0.35056,0.422111,0.489788,0.555852,0.596202,0.654526,0.782501,0.873361,0.867509,0.995621,1.04575,0.97968,0.990325,0.924493,0.99627,1.162143,1.050953,0.969697,1.199448,1.202836,1.088792,1.181819,1.217647,1.29555,1.444143,1.462123,1.443132,1.566345
0.276305,0.362342,0.550222,0.677974,0.650172,0.677188,0.881909,1.009126,1.021483,1.254232,1.248045,1.170373,1.168926,1.030955,1.085119,1.225744,0.999178,0.813023,1.14215,1.231739,1.109171,1.010456,0.914566,1.243844,1.675139,1.631835,1.508052,1.549183
0.214045,0.340853,0.643163,0.849845,0.781434,0.785534,1.04716,1.127071,1.142177,1.578946,1.619787,1.581186,1.538699,1.331139,1.380231,1.400351,1.011691,0.75491,1.1306,1.275911,1.326245,1.186304,1.063352,1.650088,2.074804,1.83005,1.783056,1.932715
0.182244,0.323083,0.642978,0.88877,0.806931,0.835561,1.161333,1.111983,1.081961,1.753354,1.874656,1.904177,1.887148,1.585509,1.640218,1.579625,1.038908,0.746286,1.168958,1.322892,1.478305,1.437775,1.432352,2.138081,2.321662,1.844605,1.976157,2.403024
0.162314,0.272573,0.520458,0.752936,0.704994,0.780595,1.122311,0.979844,0.89898,1.669112,1.836001,1.927427,1.965546,1.565603,1.61232,1.55306,1.052895,0.836064,1.215747,1.252432,1.346378,1.4428,1.662444,2.346909,2.222593,1.694713,1.928182,2.528691
0.129299,0.215983,0.384294,0.516376,0.498768,0.647246,0.902939,0.73137,0.643661,1.279902,1.497929,1.655092,1.653123,1.225719,1.317655,1.327714,1.017781,1.001522,1.324712,1.150627,1.018791,1.209007,1.649344,2.138227,1.715816,1.324949,1.566866,2.102728
0.095227,0.176938,0.292994,0.302974,0.29043,0.474593,0.621658,0.514028,0.456112,0.792211,1.021095,1.189221,1.135341,0.925763,1.121063,1.130119,0.933134,1.086574,1.390428,1.171249,0.907767,1.041628,1.535371,1.770244,1.286082,1.025964,1.115379,1.417216
0.09324,0.189141,0.281446,0.218285,0.216912,0.433798,0.55221,0.466953,0.395498,0.472562,0.613306,0.732404,0.70968,0.847267,1.036445,0.870065,0.717624,0.944103,1.206209,1.09018,0.900363,0.975223,1.311801,1.428397,1.206585,0.968373,0.845002,0.928699
0.099351,0.211629,0.293368,0.209957,0.240281,0.443272,0.547275,0.46485,0.3564,0.316958,0.418051,0.511478,0.432619,0.692347,0.878286,0.595153,0.46098,0.651862,0.818662,0.855034,0.872441,0.890318,0.973685,1.069285,1.066664,0.888087,0.628739,0.626955
0.096489,0.209856,0.281009,0.212108,0.267292,0.395253,0.436287,0.405323,0.322404,0.289935,0.395648,0.430674,0.301633,0.498525,0.691564,0.475416,0.391745,0.454182,0.496424,0.622849,0.776691,0.727805,0.637842,0.782169,0.823613,0.718685,0.505534,0.477158
0.088227,0.184514,0.244549,0.214215,0.258791,0.290285,0.261078,0.310297,0.309006,0.279808,0.341089,0.323666,0.226392,0.387795,0.56256,0.457904,0.418571,0.37467,0.369992,0.46601,0.603114,0.577922,0.471869,0.554509,0.522385,0.511243,0.492346,0.464537
0.085579,0.147124,0.187548,0.186648,0.212701,0.190834,0.138005,0.232043,0.283404,0.23933,0.243207,0.203327,0.150893,0.288363,0.461915,0.425914,0.374671,0.31853,0.325526,0.379909,0.457883,0.496039,0.47443,0.503457,0.424524,0.404275,0.491929,0.47723
0.077856,0.123493,0.152079,0.152904,0.180136,0.139423,0.119045,0.223842,0.257382,0.186085,0.155001,0.130271,0.09106,0.179925,0.322477,0.327381,0.26953,0.234204,0.277507,0.301237,0.337278,0.415442,0.484717,0.492989,0.407065,0.418097,0.506075,0.474531
0.058578,0.09213,0.112691,0.124254,0.165347,0.117686,0.113192,0.199227,0.229143,0.178523,0.10908,0.087432,0.071627,0.108891,0.190487,0.238934,0.203646,0.161908,0.228225,0.213173,0.244395,0.347361,0.449433,0.429931,0.347863,0.388226,0.451861,0.475119
0.046769,0.067938,0.079186,0.108533,0.143645,0.104011,0.102728,0.153504,0.192401,0.193236,0.123321,0.088301,0.07814,0.101801,0.155757,0.20624,0.202777,0.134142,0.170474,0.156838,0.196832,0.310276,0.370409,0.346674,0.290644,0.290652,0.330434,0.422851
0.048983,0.060179,0.052405,0.083621,0.107711,0.083079,0.082215,0.131984,0.176101,0.191306,0.148286,0.09919,0.089688,0.122834,0.176663,0.216104,0.213477,0.135813,0.133223,0.140956,0.187476,0.26277,0.253175,0.260002,0.232579,0.191662,0.233446,0.319219
0.050746,0.056324,0.039276,0.06124,0.069114,0.056955,0.066916,0.124366,0.148261,0.160139,0.151269,0.094681,0.098094,0.147907,0.180249,0.195682,0.203938,0.160075,0.147524,0.161506,0.201615,0.202621,0.160624,0.200739,0.163708,0.127879,0.171129,0.209932
