-2.5e-05,-7.1e-05,-0.001852,-0.002592,-0.00046,-0.000333,-0.000233,-0.000143,-8.8e-05,-0.000105,-0.000155,-0.000241,-0.000134,-1.2e-05,9e-06,1.7e-05,-1e-06,-9.6e-05,-0.00046,-0.000377,-0.00059,1.5e-05,-9.7e-05,-0.000269,-0.000118,-0.00016,-0.000343,-0.000136
1e-06,2.5e-05,0.002465,0.003482,0.000173,0.000176,0.000336,0.000306,0.000112,-6e-06,-0.000101,-0.000195,-0.000104,0,8e-06,1.5e-05,1.2e-05,-1e-06,-1.1e-05,0.000358,0.000873,0.000714,0.000514,0.000268,4.3e-05,-4e-06,-0.000171,-7.8e-05
1.6e-05,5e-06,-0.000733,-0.001068,2.1e-05,0.000223,0.000204,0.000241,0.000153,5.3e-05,-1e-05,-6.9e-05,-4.1e-05,-1e-06,2.3e-05,2.2e-05,1e-05,1.2e-05,3.7e-05,9.6e-05,0.000373,0.000282,9.7e-05,1.8e-05,7.4e-05,-9e-06,-9.9e-05,2.1e-05
6e-06,-9e-06,-0.001695,-0.002282,-4.8e-05,-0.000121,-0.000269,-0.000156,3.3e-05,8.7e-05,0.00014,0.000256,0.000153,1.5e-05,3.2e-05,2.8e-05,1.6e-05,3.5e-05,0.000151,-9.6e-05,-0.000688,-0.000181,-0.000165,-0.00012,0.000102,0.000221,0.000296,0.000148
2e-05,5.7e-05,0.002413,0.003494,0.000391,6.8e-05,2.8e-05,4.7e-05,7.5e-05,6.4e-05,0.000138,0.000255,0.000143,3.4e-05,3.1e-05,2.3e-05,1.8e-05,7.9e-05,0.000355,0.000276,0.000129,0.000182,0.000274,0.000251,0.000139,0.000261,0.000404,0.000174
0,-2.5e-05,-0.000466,-0.000736,-1.5e-05,0.000161,0.000174,0.000145,5e-05,-5.8e-05,-7.3e-05,-0.00013,-0.000106,-7e-06,9e-06,8e-06,0,-3.3e-05,-0.000223,-3.8e-05,0.000544,0.000246,6.2e-05,-5.4e-05,-4.3e-05,-0.000147,-0.000247,-6.7e-05
-1.8e-05,-4.5e-05,-0.001699,-0.002526,-0.000422,-0.000254,-0.000264,-0.00027,-0.00011,-6.7e-05,-0.000121,-0.00022,-0.000128,-2e-05,-6e-06,2e-06,5e-06,-8.7e-05,-0.000496,-0.000377,-0.000462,-0.000116,-0.000226,-0.000273,-9.4e-05,-0.000124,-0.000397,-0.000218
-7e-06,2.5e-05,0.001609,0.00234,-5.1e-05,-0.000207,-0.000214,-0.00027,-7.4e-05,2.1e-05,-3e-05,-0.000126,-5e-05,-4e-06,4e-06,6e-06,4e-06,1.1e-05,5.7e-05,-0.00016,-0.000581,-0.00018,6.4e-05,0.000106,4.4e-05,4.9e-05,-7e-05,-8.8e-05
1.9e-05,2.4e-05,4.3e-05,4.5e-05,0.000214,0.000295,0.000226,0.000157,0.000112,9.1e-05,6.6e-05,8.7e-05,5.7e-05,0,1.9e-05,1.3e-05,-4e-06,3.7e-05,0.000234,0.000162,0.000506,0.00025,0.000143,0.000137,0.000114,6e-05,0.000104,9.7e-05
7e-06,-9e-06,-0.001212,-0.001708,0.000145,0.000167,7.5e-05,5.1e-05,4.3e-05,4.5e-05,8.9e-05,0.000267,0.000153,1.1e-05,2.5e-05,2e-05,1.7e-05,2e-05,4.4e-05,0.000126,0.00019,0.000166,-5.8e-05,-6e-05,4.4e-05,0.000156,0.000288,0.000132
-1.5e-05,-1.2e-05,0.001122,0.00174,1.2e-05,-0.00028,-0.000254,-0.000311,-0.000176,-8.7e-05,-1.4e-05,3.3e-05,-7e-06,-2e-06,1.1e-05,1.2e-05,1.4e-05,3e-06,-5e-05,-0.000283,-0.000796,-0.000305,-6.1e-05,-6.4e-05,-8.8e-05,-3e-06,8.3e-05,-1.7e-05
-6e-06,-1.2e-05,-6.3e-05,-0.000181,-0.000186,-9.1e-05,5.3e-05,-7.6e-05,-0.000111,-5.3e-05,-5.5e-05,-0.000165,-0.00012,-1.6e-05,4e-06,5e-06,0,-3.1e-05,-0.000198,-0.000173,0.000152,8.2e-05,5.2e-05,1e-05,-3.8e-05,-0.000151,-0.000286,-0.00012
8e-06,0,-0.000991,-0.001575,-0.000144,0.000149,0.000255,0.000169,2.6e-05,3.9e-05,-2.2e-05,-0.000122,-4.9e-05,-9e-06,5e-06,7e-06,0,-3.6e-05,-0.000164,0.000152,0.000643,0.000295,-8e-06,2.5e-05,4.2e-05,-1.1e-05,-0.000143,-8e-05
-5e-06,1e-05,0.000836,0.001294,6.8e-05,-7.8e-05,-0.00011,-1e-04,-4.6e-05,3.6e-05,0,-3.7e-05,1.4e-05,-3e-06,1.2e-05,1.2e-05,2e-06,1.1e-05,0.000127,-8.9e-05,-0.000548,-0.00023,-7.5e-05,-1.4e-05,-2.3e-05,2.6e-05,6.1e-05,-1.6e-05
-1.7e-05,-1.4e-05,0.000139,0.000254,6.9e-05,-3.8e-05,-5.5e-05,-9e-05,-8.5e-05,-5e-06,2.8e-05,0.000145,7.6e-05,-1.1e-05,1e-05,1.5e-05,6e-06,2.2e-05,0.000162,-3.8e-05,-0.000222,-7.8e-05,1.3e-05,9e-06,-1.7e-05,1.6e-05,0.00013,6.7e-05
6e-06,0,-0.000605,-0.00097,5.8e-05,0.00017,0.000292,0.000222,-1e-05,-3.4e-05,2.2e-05,0.000129,3.1e-05,-2e-06,5e-06,1.2e-05,1.1e-05,8e-06,-1.4e-05,0.00025,0.000773,0.000302,3.9e-05,7e-05,1e-05,1.5e-05,0.000153,7.9e-05
1e-06,-4e-06,0.000357,0.000613,-8e-06,-9.4e-05,-7e-06,9e-06,-8.2e-05,-6.8e-05,-1.4e-05,-8.7e-05,-9.4e-05,-9e-06,-5e-06,7e-06,1e-06,-1.7e-05,-0.000111,-0.000104,-7.6e-05,-8.5e-05,-0.00013,-7.5e-05,-9.4e-05,-0.000107,-7.2e-05,-6.5e-05
-7e-06,-4e-06,3.9e-05,-2e-05,-2e-04,-0.000206,-0.00021,-0.000202,-0.000126,-7e-06,-1.2e-05,-0.00012,-6.2e-05,-7e-06,-1e-06,8e-06,6e-06,-2e-05,-8.6e-05,-0.000204,-0.000506,-0.000226,-7.5e-05,-5.4e-05,-4.9e-05,-7.2e-05,-0.000151,-8.3e-05
-1e-06,1e-06,-0.000315,-0.000599,-6.5e-05,0.00017,0.000183,0.000128,2.2e-05,5.1e-05,-8e-06,-5e-05,1e-05,3e-06,4e-06,1.1e-05,8e-06,9e-06,7.4e-05,0.000218,0.000437,0.000128,8.9e-05,0.000109,3.5e-05,1.2e-05,4e-05,2.8e-05
