0.045229,0.044138,0.046193,0.047969,0.050271,0.053298,0.051804,0.050581,0.050338,0.048491,0.046976,0.050098,0.055733,0.056004,0.053889,0.050862,0.047363,0.044889,0.041149,0.038813,0.040078,0.043425,0.049512,0.052418,0.05169,0.049323,0.049696,0.054008
0.055737,0.054552,0.055858,0.057969,0.06198,0.06594,0.064448,0.063199,0.06238,0.059294,0.057051,0.060519,0.06822,0.069843,0.066539,0.061795,0.057618,0.054732,0.050619,0.048237,0.048795,0.051642,0.058508,0.062296,0.062671,0.061014,0.061068,0.066409
0.073809,0.071949,0.070924,0.073737,0.081489,0.086563,0.085,0.084326,0.082286,0.076904,0.07442,0.078326,0.088321,0.09233,0.087085,0.079259,0.074043,0.070755,0.066841,0.065243,0.064543,0.065838,0.072528,0.07681,0.079439,0.080393,0.08001,0.086232
0.089509,0.086237,0.082463,0.086011,0.097068,0.10066,0.098849,0.100679,0.097362,0.090042,0.088854,0.092511,0.101717,0.107457,0.100817,0.091177,0.086388,0.083364,0.081136,0.082706,0.082844,0.081422,0.082927,0.083992,0.089439,0.095889,0.094951,0.098748
0.105281,0.099683,0.094073,0.099312,0.111423,0.110666,0.108041,0.114043,0.111315,0.103941,0.103817,0.1059,0.11203,0.117263,0.109494,0.100365,0.097538,0.096257,0.09735,0.102416,0.105881,0.102629,0.095294,0.089134,0.097385,0.109328,0.106567,0.106425
0.128142,0.121587,0.110049,0.115711,0.128731,0.127322,0.127419,0.137559,0.135358,0.128251,0.127371,0.12674,0.130937,0.133005,0.121281,0.112125,0.112582,0.115366,0.119673,0.124311,0.129527,0.128386,0.11577,0.104511,0.115861,0.127079,0.117309,0.117836
0.153666,0.152139,0.132998,0.13512,0.148694,0.150396,0.156586,0.171818,0.170691,0.163309,0.160479,0.154775,0.160682,0.162041,0.146463,0.134903,0.134853,0.138971,0.146424,0.149694,0.150029,0.153312,0.140949,0.129697,0.145679,0.151105,0.134651,0.139506
0.179218,0.181065,0.163265,0.166435,0.181527,0.17918,0.18496,0.208871,0.210692,0.204475,0.201504,0.182688,0.188184,0.198219,0.185549,0.170144,0.162934,0.160061,0.170532,0.178657,0.167879,0.17362,0.171195,0.166426,0.181988,0.173748,0.158093,0.169516
0.203846,0.206263,0.201148,0.211491,0.22797,0.211392,0.212675,0.250358,0.25246,0.247171,0.248862,0.210518,0.215524,0.246668,0.23761,0.214087,0.195062,0.174652,0.185388,0.211118,0.192408,0.194595,0.206871,0.214652,0.226573,0.196491,0.185368,0.203445
0.231616,0.232612,0.239492,0.253655,0.262591,0.231209,0.237027,0.294074,0.292934,0.282078,0.286364,0.232956,0.23861,0.288296,0.278505,0.250088,0.225896,0.188084,0.19815,0.241939,0.223669,0.221349,0.242159,0.263212,0.273249,0.225252,0.214147,0.22749
0.246732,0.244204,0.255479,0.267032,0.261203,0.227403,0.245055,0.308659,0.302085,0.277797,0.278992,0.233283,0.239433,0.2875,0.278523,0.257079,0.240585,0.197179,0.205156,0.253161,0.237091,0.228416,0.246373,0.277574,0.292201,0.241662,0.227373,0.227047
0.252872,0.251807,0.252146,0.248713,0.223287,0.194844,0.217394,0.266837,0.263638,0.235313,0.229196,0.203041,0.204764,0.235357,0.240475,0.236557,0.229677,0.192881,0.19303,0.228868,0.221693,0.213752,0.221341,0.248096,0.262222,0.224631,0.214626,0.208397
0.266037,0.272968,0.242427,0.214327,0.185602,0.166811,0.172173,0.190945,0.202471,0.194172,0.181969,0.161691,0.156251,0.167094,0.187602,0.212387,0.21471,0.179168,0.167258,0.189992,0.200905,0.207228,0.207241,0.213742,0.219211,0.199944,0.19355,0.187877
0.262499,0.282549,0.232206,0.179293,0.157015,0.156855,0.144124,0.134098,0.160775,0.179577,0.159808,0.131204,0.122756,0.126156,0.155114,0.201021,0.211232,0.172715,0.15447,0.175705,0.197141,0.212268,0.214032,0.203946,0.199309,0.185983,0.179278,0.178564
0.224518,0.24718,0.201228,0.153347,0.14772,0.156661,0.137992,0.126231,0.15938,0.181086,0.157604,0.122952,0.104887,0.119231,0.15638,0.190851,0.197589,0.174101,0.167714,0.179585,0.186976,0.201653,0.20466,0.187799,0.18316,0.180399,0.176897,0.173041
0.203246,0.231857,0.194419,0.162176,0.175611,0.185592,0.175024,0.172401,0.202758,0.218204,0.196165,0.154499,0.119618,0.149752,0.194263,0.191102,0.183676,0.195761,0.215399,0.203087,0.183681,0.198429,0.189701,0.169409,0.17466,0.201238,0.220118,0.197913
0.256235,0.308162,0.262797,0.221514,0.240044,0.250308,0.24768,0.251165,0.286183,0.303315,0.280391,0.230873,0.18239,0.220437,0.27337,0.243175,0.223071,0.257352,0.294087,0.270422,0.23258,0.255326,0.235355,0.197635,0.212948,0.279456,0.329354,0.284093
0.332625,0.390924,0.3355,0.289683,0.312955,0.328648,0.330206,0.340688,0.385262,0.39408,0.365576,0.321813,0.272686,0.303378,0.359515,0.324262,0.294533,0.329819,0.375808,0.3651,0.325525,0.357053,0.32465,0.250673,0.265226,0.368753,0.452027,0.395658
0.388784,0.420401,0.365567,0.331302,0.356168,0.379821,0.391162,0.414849,0.478314,0.468155,0.420979,0.401086,0.367396,0.380894,0.434962,0.407457,0.372459,0.39631,0.436227,0.449144,0.419765,0.442988,0.396958,0.293807,0.301357,0.415615,0.516877,0.468565
0.422099,0.409199,0.348762,0.336947,0.36732,0.408725,0.43833,0.46381,0.535314,0.498738,0.438539,0.454287,0.435912,0.458163,0.517313,0.477125,0.442965,0.474467,0.514601,0.530961,0.497882,0.491036,0.434438,0.341026,0.349719,0.424411,0.502423,0.47553
0.45151,0.415822,0.318878,0.316646,0.375632,0.444976,0.474836,0.471268,0.52975,0.48409,0.444447,0.485118,0.45984,0.515392,0.578033,0.500742,0.4818,0.551416,0.592648,0.575324,0.537221,0.503473,0.443553,0.393177,0.406698,0.424764,0.462951,0.460623
0.426498,0.406331,0.310208,0.306131,0.386276,0.46248,0.478998,0.444262,0.452438,0.429185,0.444587,0.49378,0.460475,0.524538,0.553627,0.440718,0.46167,0.577395,0.591282,0.524305,0.504308,0.484822,0.436166,0.409701,0.428564,0.437622,0.44375,0.447533
0.36699,0.3472,0.292222,0.303911,0.384686,0.434581,0.439603,0.416535,0.372387,0.373706,0.448054,0.469047,0.412423,0.478095,0.492218,0.366559,0.400347,0.525511,0.512205,0.44318,0.436854,0.40791,0.383735,0.393876,0.419021,0.429082,0.399876,0.404368
0.314957,0.274135,0.260943,0.29192,0.345951,0.364894,0.356139,0.352369,0.336893,0.376666,0.450549,0.414407,0.326355,0.383526,0.414187,0.318554,0.3342,0.427672,0.415977,0.386866,0.369576,0.334381,0.345942,0.369418,0.378087,0.38273,0.345489,0.355901
0.278247,0.257188,0.273678,0.294246,0.299729,0.297976,0.286479,0.27723,0.311967,0.386027,0.414649,0.336062,0.245318,0.285686,0.335152,0.287769,0.277583,0.321474,0.334028,0.350681,0.323121,0.302594,0.335583,0.3458,0.315318,0.321543,0.302467,0.298802
0.258371,0.267513,0.30464,0.318885,0.301731,0.319717,0.307644,0.254887,0.303986,0.387254,0.379866,0.326906,0.258947,0.266996,0.322716,0.298142,0.252829,0.268694,0.312976,0.333344,0.286621,0.268088,0.303157,0.322347,0.278379,0.265104,0.24701,0.240364
0.235581,0.26548,0.300366,0.317577,0.321723,0.363869,0.353293,0.27358,0.303831,0.390228,0.400827,0.374381,0.295544,0.287509,0.365723,0.336848,0.231833,0.223544,0.29645,0.343178,0.298459,0.235384,0.238196,0.282385,0.283401,0.253926,0.203883,0.198375
0.236699,0.254322,0.25629,0.274693,0.303362,0.346973,0.354235,0.289712,0.30131,0.367971,0.397119,0.384588,0.299178,0.297129,0.379796,0.347752,0.217804,0.193275,0.275869,0.331371,0.295765,0.215754,0.198939,0.248173,0.290635,0.265706,0.198717,0.199646
0.258841,0.236022,0.216058,0.243009,0.259389,0.268324,0.290653,0.278327,0.27901,0.296553,0.320637,0.323101,0.275842,0.278779,0.329524,0.317661,0.223871,0.184239,0.226847,0.266412,0.26815,0.226149,0.210197,0.237974,0.272951,0.242293,0.186342,0.230599
0.293373,0.222596,0.180144,0.241133,0.254259,0.216396,0.237729,0.272622,0.270674,0.245011,0.235375,0.246598,0.245585,0.235451,0.290792,0.312768,0.233919,0.18502,0.180014,0.197619,0.242115,0.251982,0.241506,0.219921,0.213691,0.201306,0.183907,0.282813
0.286719,0.212485,0.155434,0.223423,0.258663,0.229934,0.262313,0.300726,0.291397,0.269298,0.208081,0.196037,0.206867,0.198146,0.28778,0.307034,0.222948,0.192447,0.169566,0.155324,0.201444,0.245742,0.25177,0.197915,0.159825,0.187273,0.215351,0.32308
0.22512,0.193009,0.147986,0.199958,0.238829,0.238699,0.279417,0.29447,0.278652,0.282401,0.208228,0.173579,0.173471,0.178001,0.272658,0.258454,0.187517,0.192507,0.17386,0.123705,0.145152,0.220766,0.239767,0.176424,0.138876,0.179404,0.230343,0.30777
0.156281,0.168886,0.15246,0.192214,0.220205,0.230119,0.249391,0.249518,0.245301,0.260582,0.204674,0.16309,0.148946,0.176172,0.252885,0.211098,0.172743,0.188712,0.16401,0.110206,0.116977,0.195617,0.208774,0.158292,0.135867,0.167287,0.209356,0.232009
0.151094,0.186164,0.172684,0.217104,0.236714,0.232496,0.207186,0.193797,0.231008,0.237967,0.196333,0.160826,0.131881,0.191866,0.266535,0.207407,0.163959,0.166289,0.149039,0.112038,0.116234,0.181232,0.184096,0.152694,0.15764,0.169651,0.17534,0.151255
0.162533,0.208718,0.193556,0.23123,0.231504,0.216523,0.169849,0.168471,0.229511,0.20951,0.180467,0.152814,0.12234,0.203272,0.25528,0.19636,0.147538,0.132932,0.138832,0.123963,0.121273,0.164134,0.164455,0.142599,0.164304,0.180105,0.180639,0.141722
0.15947,0.201966,0.194482,0.216151,0.206052,0.179951,0.135284,0.154879,0.199781,0.172959,0.172835,0.14629,0.129058,0.21331,0.228484,0.178807,0.1445,0.116643,0.139134,0.146057,0.130543,0.137159,0.138186,0.133893,0.150848,0.184878,0.195366,0.154892
0.135981,0.172711,0.184696,0.187435,0.177105,0.160031,0.125614,0.141117,0.150076,0.13816,0.177883,0.171517,0.162949,0.211794,0.219361,0.195222,0.175006,0.153522,0.176891,0.182657,0.14794,0.123086,0.133711,0.146859,0.157767,0.178637,0.175511,0.146379
0.12443,0.167808,0.2209,0.18568,0.136236,0.144747,0.127425,0.13048,0.132281,0.132019,0.178053,0.198839,0.199234,0.189504,0.199599,0.225365,0.230391,0.210284,0.207058,0.220063,0.188374,0.145339,0.151424,0.185652,0.196292,0.159841,0.130518,0.126021
0.141427,0.184802,0.267199,0.190441,0.111447,0.136135,0.147752,0.159747,0.170901,0.17125,0.190357,0.21721,0.252578,0.193777,0.179878,0.226365,0.270017,0.25558,0.202799,0.235599,0.226148,0.160933,0.150899,0.21408,0.244474,0.168656,0.116733,0.11824
0.16899,0.221916,0.291276,0.203346,0.121242,0.160479,0.20009,0.220181,0.22798,0.207944,0.211353,0.250967,0.315368,0.236688,0.180828,0.192054,0.265317,0.26971,0.173527,0.219049,0.234804,0.146202,0.121941,0.213266,0.28876,0.21443,0.131085,0.104509
