0.000314,0.00021,0.000451,0.000189,-2e-06,0.00015,0.000161,0.000509,0.000331,0.000345,0.000116,0.000365,0.000129,0.000111,-0.007299,-0.01553,-0.011917,-0.0066,-0.003197,-0.002916,-0.006272,-0.003923,-0.00275,-0.003483,-3e-04,0.000988,-0.000699,0.0038,-0.006576,-0.014314,-0.016811,-0.023774,-0.014856,-0.009779,-0.016303,-0.007593,-0.0203,-0.021214,-0.022532,-0.020907,-0.016208,-0.010511,-0.01315,-0.007927,-0.0177,-0.010229,0.00115,-0.009404,-0.00764,-0.015729,-0.008749,-0.008388,-0.008144,-0.008853,-0.011108,-0.009158,-0.007202,-0.009743,-0.005587,-0.007886,0.001055,-0.004999,-0.005249,-0.003026,-0.003419,-0.002355,-0.002116,-0.005277,-0.005142,-0.002578,-0.000855,-0.000752,-0.000733,0.000259,0.000218,0.000255,-0.000501,-5e-04,-0.000507,-0.000418,-0.000525,0.001471,-0.001724,-0.001903,-0.001964,-0.002366,-0.001684,-0.000691,0.000421,0.001127,0.000175,-0.001117,-0.003544,-0.002008,-0.000421,-0.000114,0.000123,0.000123,0.000224,-0.000512,-0.001479,-0.000767,-0.000133,0.000278,0.00038,7.4e-05,0.000223,0.000337,0.000689,0.000623,9.6e-05,0.000187,-6e-06,-1e-06,0.000212,0.000145,-0.002862,-0.001913,-0.000768,-0.000226,0.000249
0.000166,0.000101,0.000186,0.000113,-2.7e-05,-6.5e-05,-0.000145,0.000238,0.00024,0.000312,0.000248,0.000251,0.000118,0.000111,0.002084,0.003289,0.006387,0.003863,0.000543,0.000509,0.003748,0.001111,0.000214,0.000969,0.000974,0.001055,-6.2e-05,-0.020771,-0.002604,-0.003274,-0.000677,0.001965,-0.001851,-0.005372,-0.00241,0.000903,-0.001575,7.8e-05,0.007935,-0.00259,-0.000112,0.000178,-0.01127,-0.000867,0.002262,0.000126,-0.004551,-0.009344,-0.007309,-0.004801,-0.007568,-0.003837,-0.001057,-0.002451,-0.003102,-0.000487,-0.004771,0.001128,-0.000868,-0.003642,-0.004961,-0.00163,-0.002436,-0.002471,-0.003909,-0.003522,-0.003083,-0.001815,0.000201,0.000206,-0.001076,-0.000589,-0.001126,-0.00021,-5.2e-05,-0.000658,1e-05,-0.00041,-0.000641,-6.8e-05,-0.00015,0.000197,-0.003228,0.000102,0.001156,-0.001019,0.000831,0.000438,-0.001366,-0.000291,0.000201,0.000105,0.001927,0.001278,0.000506,0.000422,0.000376,0.00016,0.000358,-0.000706,0.000811,0.000539,-7.2e-05,8.9e-05,0.000161,7.2e-05,0.000448,0.000257,0.000563,0.000463,0.000383,2.8e-05,8.4e-05,0.000149,9.6e-05,2.1e-05,-0.000608,-0.001212,-0.000427,-0.000103,2.4e-05
7e-05,9e-06,-4.9e-05,2.4e-05,1.8e-05,6e-06,-0.000182,-9.7e-05,-0.00013,2e-06,-3.1e-05,-0.000251,-5.7e-05,-0.000104,-0.001289,0.001078,-0.000371,-0.001019,-0.000556,-0.000168,-0.00279,-0.000595,-0.000442,-0.002532,-0.001897,-0.000251,0.000258,-0.003773,-0.004342,-0.0071,9e-06,0.00377,0.001893,-0.000539,-0.002334,-0.005109,0.002653,0.004774,-0.00488,-0.001076,-0.00432,-0.004579,0.004419,-0.005219,-0.001851,-0.001741,0.000919,0.001419,0.000729,0.000749,0.000755,-0.003504,-0.002484,-0.000415,-0.001302,-0.001737,-0.001803,-0.004582,0.000929,0.00438,0.002945,0.000313,-0.00044,-0.001846,0.002047,-0.000234,-0.001129,0.001764,0.00042,-6.6e-05,0.000188,-0.000264,-0.000448,-0.000226,-4.9e-05,-0.000226,-0.000627,0.000242,-0.000141,-0.000732,0.000342,-0.000415,-0.002811,-0.00358,-0.00156,-0.00099,-0.001776,-0.002164,0.000183,-0.00055,-0.00057,-0.000136,-0.000251,-0.000543,-0.000532,-0.000148,4.5e-05,6.1e-05,3.8e-05,0.000403,-0.000841,-0.000425,-0.000171,-6.8e-05,-0.000224,-5.2e-05,-6.6e-05,-0.00012,0.000287,0.000223,0.000268,-6.3e-05,-3.8e-05,-8.6e-05,-9.6e-05,2.4e-05,-0.000296,0.000235,0.000101,5.3e-05,-7.6e-05
7.5e-05,0.000128,1.9e-05,-5e-06,-7e-06,-4e-06,-9.6e-05,-6.6e-05,0.000137,1.1e-05,4.5e-05,-0.000174,-1.6e-05,0.000106,7.1e-05,-0.002959,-0.002249,-0.001152,-0.001671,-0.000931,-0.000613,1e-04,-0.000388,0.001011,-0.000142,-0.000271,-0.000414,-0.003604,2e-05,-0.001478,-0.002014,-0.002629,-0.006088,0.003189,-0.000257,0.002481,-0.006593,-0.007137,-0.000449,0.002477,-0.001948,0.001119,-0.005858,-0.000877,0.001839,8.2e-05,0.002067,0.003882,0.00185,0.001036,-0.005093,0.003037,0.001905,-0.00179,0.0019,0.00334,0.001706,0.000939,-0.004143,-0.002174,2e-04,-0.001287,-0.00028,-0.000506,-0.000545,-0.001748,-0.000416,-0.000782,0.000317,0.000644,-0.000119,0.001226,0.000969,0.000106,-0.000119,0.000256,1.9e-05,-0.00013,0.000384,0.00023,-0.000213,-0.000625,0.001279,0.001812,0.001087,0.000816,0.000624,8e-06,0.000867,0.000179,0.000399,-8.5e-05,-0.000581,-0.000273,-0.000281,-1.4e-05,0.000155,0.000166,2e-04,1.7e-05,0.000431,0.000245,0.000111,0.000274,1e-05,5.1e-05,0.000154,-5.5e-05,0.000244,-6.5e-05,9e-06,-9.9e-05,-6e-05,3e-05,-9.2e-05,1.4e-05,-0.000178,0.000447,0.000458,0.000157,-0.000141
1.7e-05,7.4e-05,1.8e-05,-4.6e-05,4.3e-05,0.00012,6e-05,5.1e-05,-1.5e-05,-5.2e-05,-4.6e-05,-0.000122,-7.8e-05,4.3e-05,0.00032,0.000672,0.002128,0.000809,0.000241,0.001227,0.001135,-0.000375,0.000447,-8.1e-05,-0.000557,-0.000449,-0.000154,0.000717,0.00564,0.006368,0.00441,-0.000488,0.003895,0.000482,0.00034,-0.00174,0.00094,0.005171,-0.000487,-0.006787,0.00182,-0.001305,-0.000115,-0.005501,-0.002347,0.000543,-0.000187,-0.00034,0.001108,0.001315,0.003588,0.001983,0.001337,0.002396,-0.001927,-0.002799,-0.000325,0.000707,-0.000282,0.001106,-0.002597,0.000944,0.000166,0.001774,0.001681,0.000497,0.001104,-0.000171,-0.00175,-0.00079,0.000338,-0.000198,0.000511,-3.2e-05,-0.000269,-0.000148,0.000356,3.5e-05,-3.4e-05,-2.8e-05,-0.000102,-0.000263,0.000791,-7e-06,-0.000126,-0.000515,-0.000705,-0.000128,-0.000189,0.000241,-0.000201,1.1e-05,0.000365,0.000347,4.4e-05,1e-06,3e-05,0.000102,-0.000159,-0.000241,8.8e-05,8.1e-05,3.4e-05,0.00015,-8e-06,5.9e-05,1.3e-05,1.4e-05,0.000262,-6.5e-05,9.9e-05,0.000126,0.000148,3e-05,2.8e-05,0.000183,-4.5e-05,-0.000712,-0.000298,2.9e-05,-6.1e-05
-7.6e-05,4.6e-05,-1.1e-05,-5.8e-05,-3.8e-05,-6.6e-05,0.000171,0.000182,-9.9e-05,-5.8e-05,-9.1e-05,8.3e-05,2.7e-05,8e-06,-2.5e-05,0.00085,-0.001514,-0.00072,0.000391,-0.001481,-0.001062,-7.5e-05,1.3e-05,-0.000292,0.000542,-0.000276,-0.000391,-0.000368,0.000917,-0.001194,0.000532,-0.000776,-0.004823,-0.002811,0.002077,0.000276,0.004589,-0.008063,-0.003914,0.006607,-0.001878,-0.003224,-0.000105,-0.003539,0.00383,0.00209,-0.003268,-0.000531,-0.003165,-0.000872,-0.000227,1.8e-05,-0.000287,-0.001928,-0.000593,-0.001588,0.001771,0.001748,0.001176,0.000227,0.002246,-0.000929,0.000109,-0.000256,-0.000887,0.001877,0.000237,0.000897,0.001601,0.000518,0.00031,-8.1e-05,-4.5e-05,0.000256,8.2e-05,-0.000181,3.4e-05,0.000123,-0.000265,0.000157,-9.8e-05,0.000107,0.000177,0.000515,0.000225,0.000355,0.000767,2.7e-05,-0.000591,-0.000156,-0.000249,-0.000303,-0.000767,-0.000195,0.000143,-0.000175,-0.000108,1e-06,-0.00016,-5.3e-05,0.000296,0.000262,0.000105,1e-05,9.9e-05,-2.9e-05,6.4e-05,-8.4e-05,-5.4e-05,-0.000308,-6e-05,-4e-06,0.000111,0.000163,-8.7e-05,5.7e-05,-0.000121,0.000166,-0.000122,-3.2e-05,3.5e-05
-6.9e-05,-4.1e-05,-9.1e-05,-0.000114,-7.1e-05,-6.2e-05,-4.8e-05,-8e-05,-0.000142,-2.4e-05,-8.7e-05,-9.3e-05,-4.9e-05,-2.8e-05,-6.5e-05,0.001114,0.000264,6e-06,-8e-05,0.001386,0.000635,-0.000841,7.2e-05,5.7e-05,-0.000175,-0.000346,-0.000591,0.00016,-0.000947,-0.001057,-0.002108,6e-04,0.001953,0.000336,0.001718,-3e-06,-0.006163,0.002067,0.004324,-0.006068,-0.002214,-0.000906,-0.00153,0.00307,-0.000512,0.00116,-0.000523,0.002096,0.002106,-0.002921,-8.8e-05,-0.001792,-0.000955,0.000958,-0.001488,-0.001912,-0.000194,0.000379,0.001499,0.000706,-0.001323,0.000156,0.000293,-0.000631,-0.000592,-0.002756,0.000977,5.8e-05,-0.000565,-0.00068,-0.000177,-0.000723,-0.000449,5.5e-05,-0.000414,-0.000395,-0.000252,3.8e-05,-2.8e-05,-0.000447,-0.000224,4.7e-05,4.3e-05,-7.4e-05,-0.001045,-0.000349,-6e-04,-0.000821,-0.00058,-0.000713,-0.000568,0.000207,0.000138,-6.6e-05,-8.1e-05,-8.9e-05,-0.000161,3.2e-05,-0.000145,-4.5e-05,-0.000337,-0.000206,-5.3e-05,-2e-04,-0.000106,-2.4e-05,1e-06,6e-06,-5.6e-05,-0.000247,-7.3e-05,-0.000115,-1e-05,-2.2e-05,-6.8e-05,9e-06,-2e-06,-0.000191,8.7e-05,-4.7e-05,-2.9e-05
-2.9e-05,-1.7e-05,-7.3e-05,-0.000136,-2.3e-05,8e-05,5.4e-05,-5.8e-05,-0.000225,-1.6e-05,-9.1e-05,-7.3e-05,4.3e-05,-6e-06,0.000111,-0.001236,-0.000295,-0.000253,0.000412,-0.000234,-0.000535,0.000646,-0.001092,-0.000175,-0.001224,-0.000291,-0.000183,0.000113,-0.004537,0.000818,-0.000858,0.001731,-0.002866,-0.002938,0.000877,-7.5e-05,0.002704,-0.000326,-0.005548,0.000703,0.002627,-0.000721,-0.001101,0.000229,0.000431,-0.00161,-0.001043,-0.002239,-0.001071,-0.000649,0.001593,0.000137,0.000751,-0.00233,0.002758,0.002311,-0.00169,0.000228,-0.000655,0.000587,-0.000209,0.000442,0.000613,0.000887,0.000669,0.001031,-0.001247,0.000357,8.4e-05,-7.7e-05,-0.000142,-0.000117,0.000286,-0.000331,-0.000479,-0.000358,9.9e-05,-3.9e-05,-0.000133,-1.6e-05,-0.00022,-0.000242,-0.000238,-0.000247,0.001175,0.000984,-8e-06,2e-05,-0.000169,-5.4e-05,-0.000103,-0.000208,0.000106,5.4e-05,1.5e-05,-2.1e-05,-0.000158,6.6e-05,-3.6e-05,-0.000213,3.3e-05,0.000172,3.8e-05,-6.8e-05,-7.6e-05,-4.1e-05,-1e-06,-0.000283,-0.000111,-0.000119,-4.1e-05,3.3e-05,-2.3e-05,5.9e-05,-6e-05,-5.1e-05,-1.9e-05,7.3e-05,0.000332,0.000113,1e-05
-2.3e-05,1e-05,-4e-05,-1e-04,-5.3e-05,-1.9e-05,-2.8e-05,-7.2e-05,-9.1e-05,-0.000106,-1.1e-05,-0.000109,-8e-05,-6.6e-05,-7.6e-05,-4.5e-05,-0.000273,-0.000287,6.1e-05,0.000523,0.000149,-0.000783,0.000247,-0.000233,-0.000299,3.5e-05,-0.000355,-0.000353,-0.004281,0.001283,-0.000395,-0.000866,0.002472,0.000205,-0.002235,0.000315,0.00054,-3.8e-05,0.002219,-0.00122,-0.002066,0.002255,0.002103,-0.000512,-0.002146,0.001602,0.000258,0.001549,-0.001694,0.000966,0.000801,-0.00085,-0.004239,-7.8e-05,-0.002611,-0.001216,0.001513,-0.000539,-0.000354,-0.001614,0.001044,-0.000286,0.00074,-0.000352,0.001163,0.000125,-0.000154,-0.000372,2.6e-05,-0.000106,0.000382,0.000194,2.8e-05,-0.000166,-0.000168,5e-06,0.000156,-0.000313,-7e-05,0.000102,0.000203,0.000306,-0.000169,2.1e-05,-0.000312,-0.000257,5.7e-05,-0.000146,0.000461,0.000395,7.3e-05,4.4e-05,-0.000201,0.000153,-0.000201,4e-05,-7.5e-05,-8.5e-05,2.9e-05,-0.000104,-2.4e-05,-0.000116,-2e-05,-9e-06,-8e-05,-1.6e-05,2.3e-05,-0.000187,-6.7e-05,-0.000146,-4.5e-05,-0.000126,-5e-05,-4.1e-05,4.1e-05,-5e-05,-2e-05,0.000138,-0.000252,1e-06,-3.2e-05
4e-05,1.7e-05,-3.9e-05,-2.1e-05,-1e-06,-1.2e-05,6.1e-05,-1.4e-05,-8e-06,-7.4e-05,-7.5e-05,-8.8e-05,2e-06,2.6e-05,0,0.000598,0.00057,0.00047,0.000472,0.00016,-0.000404,0.000727,6.5e-05,7.3e-05,0.000417,-0.000103,-3e-05,2.1e-05,0.003034,0.001313,0.004197,0.001645,-0.00016,0.000196,0.000726,-0.001184,0.000246,0.003007,-0.001771,-5.1e-05,0.000415,0.000296,0.000862,0.000947,0.001569,-6e-06,-1.4e-05,-0.000363,-0.00157,-0.000965,-0.000774,0.001445,0.00119,0.000933,0.002432,-4.4e-05,-0.000275,-0.000858,-0.001444,-0.000247,-0.001465,-0.00078,0.001655,-0.000238,0.000819,0.000255,0.000594,-1e-04,-0.000649,-3.4e-05,-5.4e-05,0.000418,-5.4e-05,-8.5e-05,0.000175,9.2e-05,-1e-06,2.7e-05,1.1e-05,0.000113,-1.5e-05,1.6e-05,-0.000181,-4.5e-05,7.5e-05,0.000103,0.000107,0.000439,-4.6e-05,-4e-05,5.9e-05,-0.000534,4.9e-05,-1.4e-05,0.000115,9.4e-05,-1.8e-05,-1.3e-05,-8e-05,-0.000162,-0.000179,2.7e-05,6.5e-05,-1.2e-05,4.8e-05,-0.00013,5.7e-05,-2.8e-05,-9e-06,-6.3e-05,2.2e-05,-2.2e-05,2e-05,3.2e-05,-4.1e-05,-1.5e-05,-5.6e-05,-4.9e-05,-0.000197,-6.6e-05,-5.5e-05
-1e-06,-8e-06,-2.2e-05,5.2e-05,1.4e-05,-3.7e-05,-8e-06,-7e-06,7.8e-05,-1.6e-05,-3.2e-05,-4.8e-05,-3.3e-05,-0.000102,2.8e-05,-0.000289,0.000344,-0.000115,-0.000568,-0.000212,9e-05,2e-06,-0.000549,0.000149,0.000188,0.000297,6.5e-05,-0.000271,0.000353,0.000296,-0.002145,-0.00085,0.001512,-0.001941,-3e-05,-0.000563,-0.001053,0.000791,0.001403,0.000918,0.000511,-0.002073,2e-06,-0.00201,-0.003831,-0.000138,0.000127,0.000935,0.000807,0.000927,0.000253,0.001514,0.001107,0.000497,0.001766,-0.001444,0.000892,0.000958,8.4e-05,-0.000236,0.001292,0.001226,-0.001433,-0.000509,-0.000745,-0.000513,-0.000391,-0.000977,0.00029,0.000289,-0.000164,-0.000174,-0.000156,1.9e-05,0,-0.000153,4.9e-05,0.000116,4.6e-05,-6.4e-05,0.00022,8.2e-05,0.000109,1.8e-05,-0.000896,-1.9e-05,-0.000252,0.000122,0.000138,-0.000135,-0.000204,0.000189,-8e-05,-7.4e-05,-4.6e-05,-4.5e-05,-2.9e-05,-0.000141,-5.6e-05,-2.4e-05,2e-06,0.000114,9e-06,4.3e-05,1.1e-05,-3.9e-05,1e-06,-4.6e-05,2e-06,-9.4e-05,-3.1e-05,-3.1e-05,-7.1e-05,3.5e-05,9e-06,-3.5e-05,-8.4e-05,8e-06,0.000198,5.1e-05,-9e-06
-3.3e-05,-1.7e-05,-1.3e-05,-1.1e-05,-6e-06,-2.8e-05,-3.8e-05,-4e-06,-2e-05,1.7e-05,-2.4e-05,-9e-06,-2e-05,-5.9e-05,-1.5e-05,-0.000233,-0.000425,0.000387,0.000263,-0.000106,-0.000116,-0.000364,-0.000174,-0.000267,-2.5e-05,-0.000289,0.00021,1.9e-05,0.000153,-0.001043,-0.000496,-0.000606,-0.002354,0.003495,-0.000944,0.001011,0.001056,-0.002957,0.000907,-0.001492,0.002067,0.001591,-0.001479,-0.000587,0.000525,0.002791,0.000122,-0.000937,0.000119,0.000602,-0.000332,-0.001756,-6.4e-05,0.000389,-0.001503,0.00063,-0.002096,-0.000907,0.000656,0.000425,0.00036,-0.000501,-0.000615,-0.000224,-0.000833,-0.000138,2.1e-05,0.000198,0.000114,0.000229,-2.4e-05,-0.000191,-4.8e-05,1.1e-05,3.2e-05,4.9e-05,1.3e-05,0.000173,5.6e-05,-1.6e-05,-0.000129,0.000108,-6.5e-05,-2e-06,0.000414,9.8e-05,5.2e-05,-0.000294,-3.5e-05,0.000169,8.5e-05,-0.000123,2.7e-05,-4e-06,-9.2e-05,-8.6e-05,1.6e-05,1.4e-05,-2.5e-05,3e-06,-3.4e-05,-5.4e-05,6.4e-05,-8e-06,-1.4e-05,-7.4e-05,-5e-05,7e-06,-3.6e-05,-7e-06,-7.1e-05,-2.9e-05,-1e-06,4e-06,-5.9e-05,-3.5e-05,-2.9e-05,-4.7e-05,-3e-06,-4.7e-05,4.5e-05
-5.2e-05,-6e-06,-1.2e-05,-2.6e-05,-1e-05,-2.6e-05,1.7e-05,0,-4.8e-05,3.3e-05,1e-06,-1.1e-05,8e-06,-2.6e-05,7e-06,0.000208,-0.000387,-0.000409,0.000161,-0.000101,9.4e-05,0.000147,0.000573,0.000158,-0.000142,3e-06,0.00022,-0.000252,0.001086,-0.00269,-0.000509,-9e-05,0.001056,-0.003266,0.000239,-0.00065,0.000237,0.001269,-0.001228,0.002244,-0.001025,-0.000594,0.000597,0.000826,-0.000595,-0.002024,0.000769,-0.000543,0.000707,0.000141,0.000337,-0.000658,0.001094,1e-04,-0.000418,-9.7e-05,0.000573,0.000368,-0.00011,-0.000554,1e-04,0.000179,0.00071,-0.000186,-0.000154,0.00071,9.5e-05,0.000286,-2.9e-05,-2e-05,-7.3e-05,1.3e-05,-5.1e-05,-0.00014,-9.9e-05,-1.3e-05,-7.4e-05,-0.000123,-0.000138,1.4e-05,-5.8e-05,-4.5e-05,1.6e-05,2e-05,0.000374,-0.000193,-0.000102,-0.000106,0.000229,1.6e-05,0.000163,-6.7e-05,-5.5e-05,-3.6e-05,0.000132,5e-05,1.7e-05,-3.5e-05,-2.9e-05,1.4e-05,-5e-06,-1.4e-05,-8.4e-05,-3.3e-05,9e-06,2e-05,-4.6e-05,-4.8e-05,-7.4e-05,-4.5e-05,-1.8e-05,2e-06,-3.1e-05,1.9e-05,-1.2e-05,1.4e-05,-8e-06,2e-05,0.000121,4.1e-05,-3.5e-05
1.7e-05,-1.2e-05,1e-06,-1.5e-05,-2e-05,-4e-06,-5e-06,1e-05,-2.9e-05,1.8e-05,2e-06,2.8e-05,-7e-06,4e-06,3.4e-05,0.000108,0.000278,0.000318,-0.000588,-0.000233,0.000192,-0.000252,6.4e-05,7.8e-05,0.000187,0.000154,-7.9e-05,-3.1e-05,0.000381,0.001878,0.000471,-9.5e-05,-0.000716,0.001598,-0.001298,-0.000318,-0.000841,-0.000217,0.00062,-0.001195,0.000642,0.00064,-0.000428,-0.000857,0.000949,0.000183,-0.000693,0.00014,3.7e-05,-0.001457,-8.2e-05,0.000522,-0.000554,0.000275,-0.000329,0.000454,8.7e-05,-6.3e-05,-0.000353,0.000977,0.000233,-6.4e-05,-0.000117,0.000369,5.5e-05,-0.000151,-0.000107,0.000173,7.4e-05,-0.000494,-0.000146,-0.000184,0.000123,6.1e-05,-8.2e-05,1.8e-05,5e-06,-6.7e-05,9e-05,-7.5e-05,2.6e-05,-5.7e-05,0.00011,3.7e-05,-0.000304,-0.000127,3.2e-05,0.000193,-6.4e-05,-8.7e-05,-0.000199,-9.3e-05,5.6e-05,-4.3e-05,3.9e-05,-3.6e-05,1.8e-05,2.8e-05,8e-06,7e-06,-3.8e-05,-4.5e-05,-4e-06,2e-06,5e-06,-1.1e-05,-2e-06,-3e-06,-2.1e-05,9e-06,-5e-06,2.8e-05,-1.7e-05,-3e-06,-1.8e-05,8e-06,2e-06,2.8e-05,-7.9e-05,-7.4e-05,-4.9e-05
1.6e-05,1.1e-05,0,0,9e-06,0,2e-06,0,-2.4e-05,-1.9e-05,-1.4e-05,1.7e-05,-6e-06,4.3e-05,-1.1e-05,-6.8e-05,-0.000101,-0.000166,0.000528,0.000222,-6.4e-05,0.000326,4.2e-05,-8.6e-05,-5.8e-05,3.4e-05,-0.000129,-4.3e-05,-0.000472,-0.000824,-0.00106,0.000366,0.000254,-0.00046,7.4e-05,-0.000302,0.000317,-0.000183,-5.9e-05,0.000742,-0.000437,-3.2e-05,0.000753,1.5e-05,-0.000165,-0.000246,-0.000901,-0.000134,-0.000353,0.000838,-0.000341,-2.9e-05,-0.000218,-0.000387,0.000721,0.000975,-0.000158,-2.1e-05,0.000144,-0.000543,-0.000361,-0.000258,-0.000443,0.000404,0.000313,0.000278,0.000104,-3.7e-05,1e-05,0.00026,-4.7e-05,4e-06,5.6e-05,2.8e-05,-4.5e-05,6.1e-05,0,-3e-06,-7.2e-05,4.8e-05,7.8e-05,-1.4e-05,1.2e-05,1.2e-05,0.000164,-0.000213,-7.4e-05,-0.000159,0.000178,1.3e-05,2.8e-05,0.000137,-2.8e-05,1.2e-05,2.8e-05,1e-04,2e-06,5e-06,-1e-06,-1.7e-05,1.5e-05,1.3e-05,3.2e-05,-3.9e-05,-1.7e-05,-2e-06,-1.1e-05,-3.2e-05,7e-06,-2.4e-05,1.5e-05,2.8e-05,-8e-06,4e-06,7e-06,1e-05,5e-06,-1.8e-05,1e-05,4.3e-05,2.8e-05
1.7e-05,0,-2e-06,-1.3e-05,4e-06,0,-1.3e-05,1e-06,2e-06,-1.3e-05,-9e-06,2e-06,-5e-06,2.5e-05,2.1e-05,-1.4e-05,0.000172,-2.8e-05,-0.000437,-0.000213,1.2e-05,-0.000156,-5.7e-05,2e-06,-0.000105,-0.000106,-0.000167,-1.2e-05,-0.000728,-0.000589,0.000166,-7e-05,-1.6e-05,0.000239,0.000604,-0.000223,0.000264,-0.00012,-0.001616,-0.000344,-0.000253,-0.000257,-0.000896,-0.000566,-0.000342,-0.000443,0.000473,-0.000141,0.000605,0.000185,-0.000605,-0.000457,-0.000113,0.000145,-0.000494,-0.00038,-0.000274,-0.000205,0.000145,-8.1e-05,0.000168,7.2e-05,0.000254,-0.000316,6.5e-05,-6e-05,-8e-06,5.9e-05,2.9e-05,0.000144,0.000141,9.5e-05,-5.7e-05,3.1e-05,2.9e-05,-1e-06,-1.8e-05,2.3e-05,7.6e-05,1.7e-05,-7.3e-05,-1.5e-05,6.5e-05,1e-05,-0.00017,0.00023,-2.8e-05,3.3e-05,-0.000146,1.1e-05,5.2e-05,5.5e-05,4.7e-05,1e-06,-4e-06,-4.9e-05,-3.2e-05,1.3e-05,-7e-06,-2e-06,7e-06,-5.1e-05,-1.6e-05,4e-06,4e-06,-8e-06,-1e-06,-1.6e-05,4e-06,-2.2e-05,-5e-06,-3e-06,6e-06,-1.7e-05,-8e-06,1e-05,-9e-06,-2e-06,-1e-05,1.7e-05,2.1e-05
3e-06,4e-06,-4e-06,-6e-06,-2e-06,1e-06,6e-06,-4e-06,1.4e-05,1e-06,-8e-06,0,-1e-06,4e-06,1.9e-05,2.2e-05,-0.000115,7.3e-05,1.6e-05,0.000139,2.7e-05,0.000105,2.7e-05,3.8e-05,1.3e-05,3e-06,5.2e-05,7.1e-05,-0.000783,0.00137,-0.000251,-0.000382,0.000223,-0.000111,-0.000515,0.000112,0.00031,0.00043,0.001372,-0.000177,0.000398,-0.000269,0.000337,-3e-05,0.000289,-0.000332,-0.000726,0.00012,-0.000276,-0.000121,0.000396,0.000318,-1.5e-05,-0.000424,0.000707,-0.000495,-0.000211,8.7e-05,-0.000355,0.000147,-0.000398,9.2e-05,-0.00043,0.000134,4.8e-05,0.000122,-6.6e-05,1.9e-05,-0.000125,-9.7e-05,-4.2e-05,5.8e-05,1.8e-05,-3.1e-05,1.6e-05,-2.1e-05,-5e-06,-7.3e-05,-3.7e-05,-1e-05,3.2e-05,5.5e-05,-1.2e-05,1e-06,7e-06,-1.1e-05,4.3e-05,0.000111,3.9e-05,-1.6e-05,-5.8e-05,0.000151,-2.7e-05,-2.9e-05,-9e-06,1e-06,-2.3e-05,1e-05,-8e-06,-1.5e-05,-2.4e-05,-6e-06,1.2e-05,2e-06,4e-06,-5e-06,0,-3.5e-05,1.9e-05,-2e-05,-6e-06,8e-06,5e-06,-9e-06,-5e-06,-3e-06,2e-06,-8e-06,-4.6e-05,8e-06,-1.2e-05
-1.2e-05,-3e-06,-2e-06,2e-06,-1e-06,9e-06,-4e-06,-6e-06,4e-06,5e-06,-1e-06,-3e-06,-2e-06,1e-06,-3e-06,0.000159,0.000226,1e-05,4.4e-05,1e-05,-6.7e-05,-0.000104,2e-05,-3.2e-05,8.8e-05,2.5e-05,2e-06,-4e-05,0.000345,-0.000516,6e-05,0.000266,-0.000397,0.000143,0.000404,0.000182,-0.000697,-0.000605,-0.000332,0.000159,3.5e-05,0.000193,8.3e-05,0.000644,0.000248,-0.000333,0.000227,-0.000204,-0.000265,0.000181,3.6e-05,-2.2e-05,2e-06,0.000221,-0.000526,-6.7e-05,0.000373,0.000126,-3.5e-05,6.8e-05,0.000282,-9.6e-05,-0.000165,9.9e-05,-8.6e-05,-0.000162,0.000229,0.000124,5.6e-05,1.4e-05,1.3e-05,1.5e-05,-1.7e-05,1e-06,-1e-06,-2.1e-05,1.1e-05,-2e-06,-2.4e-05,-2.6e-05,4e-06,-5.8e-05,6e-06,-1.8e-05,-4.2e-05,-1.9e-05,-3.5e-05,-1.3e-05,-1.6e-05,-1.3e-05,4e-06,-0.000119,-2.5e-05,-1.8e-05,4.7e-05,-1.3e-05,-2e-06,-3e-06,-7e-06,-2.4e-05,8e-06,2.3e-05,-6e-06,2e-06,-2e-06,-4e-06,2e-06,-1.4e-05,3e-06,-1.5e-05,-3e-06,-1.8e-05,-1e-06,1e-06,-1.3e-05,-3e-06,-2e-06,3e-06,4.1e-05,1.5e-05,-2.4e-05
-1e-05,0,-4e-06,6e-06,-1e-06,3e-06,-6e-06,2e-06,1.4e-05,-5e-06,-3e-06,-3e-06,-2e-06,-7e-06,2e-06,-8.3e-05,-0.000111,-1.6e-05,-9.9e-05,-3.4e-05,2e-06,5e-06,-0.000183,-8e-06,-2.9e-05,-4.9e-05,8.3e-05,5.1e-05,0.000284,-0.000216,3e-05,0.000151,0.000276,-0.000337,-1.1e-05,0.000217,0.000382,0.000296,-0.000208,-0.000225,0.000181,-0.000397,9.4e-05,-0.000197,-8.1e-05,0.000656,-5.4e-05,2e-04,-0.000101,-6.2e-05,-0.00012,0.000212,-6.4e-05,-0.000118,0.000243,-0.000193,-0.000173,1.6e-05,-6.3e-05,-4.8e-05,-9.7e-05,-8.2e-05,6.8e-05,-3.4e-05,-5e-05,2.7e-05,-0.000238,2e-06,-5.4e-05,-3.5e-05,2.7e-05,-1.6e-05,1.9e-05,2e-06,1.3e-05,-8e-06,-5e-06,-4.6e-05,1.6e-05,1.7e-05,1e-05,1.3e-05,-8e-06,-4e-06,0.000135,3e-05,6e-06,-1.1e-05,2.4e-05,2.1e-05,0,-4.2e-05,1.6e-05,4e-06,-1.6e-05,-7e-06,6e-06,5e-06,-4e-06,-1e-06,-4e-06,-8e-06,-9e-06,4e-06,0,-8e-06,1e-06,-1.4e-05,-7e-06,-1e-06,-9e-06,-6e-06,7e-06,-4e-06,-3e-06,-8e-06,-2e-06,1e-06,-3.2e-05,3e-06,1.7e-05
-4e-06,0,0,-3e-06,-3e-06,1e-06,0,1e-06,-1.2e-05,-5e-06,-2e-06,-8e-06,0,-4e-06,3e-06,-9.1e-05,-2.6e-05,-9e-06,3.1e-05,3.5e-05,2e-05,6.4e-05,0.00019,2.7e-05,-3.8e-05,5e-05,1.6e-05,-3.7e-05,9.5e-05,-0.000203,0.000135,-8e-06,-0.000338,0.000607,0.000121,1e-04,6.4e-05,-0.000265,0.000325,0.000143,-0.000374,0.000435,2.2e-05,-3e-05,1.6e-05,-0.000349,0.00019,-9.1e-05,-0.000171,-0.000132,1e-06,-0.000191,0.000152,0.000127,-0.000166,0.000175,-2.1e-05,-8.5e-05,0.000183,-0.000266,-2e-06,6.5e-05,8.7e-05,-0.000161,-0.000114,0.000153,6.1e-05,-4e-05,-2.7e-05,3.2e-05,2.5e-05,-3.7e-05,-3.2e-05,-6e-06,-1.9e-05,6e-06,-1.1e-05,7.5e-05,2e-06,3e-06,-2.3e-05,4e-06,-2.1e-05,-4e-06,3e-06,-6.6e-05,1e-05,-3e-05,-3e-06,-3e-06,3.2e-05,-1.7e-05,-1e-06,2e-06,-6e-06,2e-06,1.6e-05,-1.8e-05,-1e-06,-9e-06,-1.1e-05,3.3e-05,3e-06,2e-06,1e-06,-1e-05,-2e-06,-2e-06,-1.3e-05,-7e-06,-5e-06,-2e-06,2e-06,0,-8e-06,-7e-06,-1e-06,-1.3e-05,-3e-06,-3.1e-05,-4e-06
6e-06,-3e-06,-2e-06,-1.2e-05,-4e-06,1e-06,1e-06,-1e-06,-1.7e-05,2e-06,-5e-06,1e-06,-3e-06,0,-1e-06,6.2e-05,-0.000135,3e-06,1.1e-05,6.8e-05,-2.8e-05,-7.1e-05,-0.000117,-2.4e-05,1.2e-05,3e-06,-3e-05,2.5e-05,0.000347,0.000435,-5.7e-05,-0.000102,0.000393,-0.000431,0.000171,-9.4e-05,-0.000168,6.8e-05,-0.000336,-0.000195,0.000262,7.2e-05,-6.3e-05,-0.000341,5.9e-05,-0.000169,-0.000137,-0.000182,0.000109,-6.6e-05,0.000154,-0.000306,-6.6e-05,-7.4e-05,-0.000324,0.000109,2.1e-05,1.2e-05,7.3e-05,0.000188,3.6e-05,-3.4e-05,0.000108,0.000151,7.3e-05,-0.000116,8.4e-05,-3.6e-05,2e-05,1.2e-05,2.3e-05,-1.5e-05,2.1e-05,1.5e-05,-2.2e-05,3e-06,6e-06,-2.4e-05,2e-06,-2.7e-05,-2e-06,-9e-06,-1.6e-05,1e-06,-0.000114,7.8e-05,-1.2e-05,-1.9e-05,3.7e-05,-1.2e-05,-4.8e-05,3e-05,-4e-06,-3e-06,-6e-06,1.9e-05,1.2e-05,5e-06,2e-06,-2e-06,-6e-06,-7e-06,-1e-05,-4e-06,2e-06,-8e-06,2e-06,-1.1e-05,-4e-06,-1.1e-05,6e-06,-4e-06,-1e-06,-2e-06,1e-06,-4e-06,-3e-06,2e-06,5e-06,9e-06,5e-06
6e-06,3e-06,0,-9e-06,0,-2e-06,2e-06,0,-1.1e-05,4e-06,-2e-06,-2e-06,0,-6e-06,1e-06,6.1e-05,9.3e-05,2.7e-05,2.9e-05,-3.3e-05,1.4e-05,5.6e-05,0.000137,1.1e-05,3.7e-05,-1.7e-05,8e-06,-6e-06,0.00017,0.000247,0.000176,-0.000172,-0.000157,0.000274,5.7e-05,-8.9e-05,7e-05,0.000354,0.000192,0.000312,-0.000145,-5e-06,6e-05,-0.000106,-0.000206,0.000148,-2.9e-05,8.5e-05,0.000149,0.000199,-0.000165,0.000355,7.8e-05,0.000115,3e-05,-1.8e-05,8e-05,2.2e-05,-3.4e-05,-0.000114,-0.00014,-2.1e-05,-3.6e-05,-0.000194,3.5e-05,3.9e-05,-1.6e-05,-2.9e-05,-1e-06,-4e-06,-2e-06,2.3e-05,-2.6e-05,-2.4e-05,-2.7e-05,7e-06,-1e-06,3e-06,3e-06,2.2e-05,1.3e-05,-7e-06,1e-06,7e-06,1.2e-05,6e-06,5e-06,1.7e-05,-5.4e-05,-6e-06,4e-06,-2.3e-05,9e-06,9e-06,1.8e-05,4e-06,-5e-06,-1.5e-05,-3e-06,2e-06,1e-06,8e-06,7e-06,-9e-06,1e-06,-7e-06,4e-06,-8e-06,-4e-06,-8e-06,7e-06,1e-06,-8e-06,6e-06,-5e-06,0,-1e-06,3e-06,1.7e-05,-9e-06,-3e-06
5e-06,-1e-06,0,-2e-06,0,-3e-06,-3e-06,3e-06,-4e-06,5e-06,-3e-06,2e-06,0,-1e-06,1e-06,-7.3e-05,8e-05,-4e-06,-8.7e-05,7e-06,1.3e-05,-5.3e-05,-0.000103,4e-06,-1.2e-05,1.2e-05,-3.9e-05,2e-06,-0.000228,0.000157,-0.000132,5.9e-05,-1e-05,0.000114,-0.000161,1.7e-05,9e-05,-0.00021,8.6e-05,-0.000164,0.000123,-0.000289,-0.000261,0.000384,1e-04,-0.000105,-5.7e-05,-0.000107,-0.000153,2e-06,0,1.1e-05,-3e-06,-2.9e-05,1e-06,-1.3e-05,4.2e-05,1.1e-05,-0.000214,9.2e-05,0.000105,5.2e-05,-4.4e-05,2e-06,2.3e-05,-8.6e-05,-3e-05,1.3e-05,2.1e-05,-2.1e-05,1e-06,-1.1e-05,-5e-06,7e-06,-6e-06,8e-06,-6e-06,-3.7e-05,-7e-06,-3e-06,1.2e-05,-7e-06,-5e-06,2e-06,3.2e-05,1e-05,-1.2e-05,1.6e-05,1.3e-05,8e-06,1.3e-05,-3e-06,-1.1e-05,2e-06,0,-1.7e-05,-1e-05,8e-06,-4e-06,-7e-06,-3e-06,-7e-06,-4e-06,1e-06,-1e-06,-3e-06,0,-4e-06,8e-06,-5e-06,-3e-06,4e-06,-2e-06,-1e-06,1e-06,2e-06,-2e-06,-2e-06,7e-06,8e-06,-4e-06
-5e-06,2e-06,-1e-06,0,2e-06,-1e-06,3e-06,-1e-06,8e-06,-4e-06,0,1e-06,-2e-06,0,0,-1e-06,-2e-05,-4e-05,0.000132,8e-06,-5e-06,4.7e-05,5.6e-05,-1.2e-05,-4.3e-05,-1.1e-05,-2.2e-05,2e-06,-0.000263,0.000101,-1.4e-05,7e-05,-3.2e-05,-0.000416,3.2e-05,-3.8e-05,0.000112,-0.000203,-0.000324,0.000143,0.000134,-0.000181,0.000137,-9.8e-05,-0.000218,-1.9e-05,-1.8e-05,0.000111,-7.3e-05,1.2e-05,0.000212,-8.6e-05,-0.000172,-1.8e-05,0.000243,-3.3e-05,-0.00022,-2.5e-05,2.7e-05,1.1e-05,-6.3e-05,-6.6e-05,0.000118,-3.5e-05,-1.8e-05,0.000121,3e-06,9e-06,6e-06,3e-06,-2e-05,3.9e-05,6e-06,1e-06,1.3e-05,-1e-05,8e-06,1.4e-05,-1e-06,-1e-06,-1.2e-05,1.5e-05,-1e-06,1e-06,3.4e-05,2e-06,5e-06,-1e-05,-2.8e-05,0,-1.1e-05,-1.4e-05,-7e-06,-7e-06,-1.1e-05,-3e-06,-1.2e-05,-5e-06,0,-2e-06,-4e-06,4e-06,7e-06,0,-1e-06,-1e-06,-2e-06,-1.2e-05,4e-06,-9e-06,-6e-06,3e-06,-2e-06,1e-06,-6e-06,4e-06,0,-2e-06,-2.8e-05,-1e-06,2e-06
-6e-06,-2e-06,0,-3e-06,0,0,0,-2e-06,6e-06,-6e-06,-2e-06,2e-06,0,-1e-06,0,4.3e-05,-3.4e-05,5.4e-05,-6.4e-05,-1.7e-05,-3e-06,-2.7e-05,4.3e-05,6e-06,1.2e-05,-1e-06,-1.8e-05,-1.3e-05,-0.00022,-0.000531,3.1e-05,3.5e-05,-3.3e-05,0.000558,-0.000105,0.000112,-0.000351,0.000155,0.000128,-2.5e-05,-0.000193,0.000105,-0.000125,-0.000199,0.000205,0.000238,-4e-06,-4e-06,4e-06,6.4e-05,2.7e-05,3.7e-05,9.9e-05,8e-06,-0.000149,0.000118,-6e-06,8e-06,6.3e-05,-4.8e-05,-1.5e-05,-6e-06,5.4e-05,6.8e-05,-4.5e-05,-6.5e-05,-6e-06,-5e-06,1.3e-05,6.1e-05,-1.3e-05,-1.1e-05,1e-05,1e-06,1.3e-05,1e-06,6e-06,4e-06,4e-06,-1e-05,-8e-06,-2e-06,5e-06,-3e-06,-4.9e-05,-1.5e-05,3e-06,-7e-06,2.1e-05,-7e-06,-7e-06,3.5e-05,1.1e-05,1e-06,3e-06,4e-06,-5e-06,6e-06,0,-5e-06,4e-06,-6e-06,-7e-06,0,1e-06,-2e-06,-1e-06,-5e-06,0,2e-06,-3e-06,-1e-06,-4e-06,0,0,4e-06,-1e-06,-5e-06,8e-06,-4e-06,0
-2e-06,1e-06,0,-1e-06,-2e-06,-2e-06,1e-06,1e-06,4e-06,1e-06,-2e-06,0,-1e-06,5e-06,1e-06,9e-06,-2.9e-05,-1.4e-05,3.2e-05,0,8e-06,1e-05,-4.8e-05,7e-06,4.5e-05,6e-06,1.8e-05,1.1e-05,3.3e-05,0.000166,1e-06,-1.4e-05,-5e-06,-0.000533,-0.000113,8.3e-05,0.000189,-3.9e-05,-7.9e-05,-6e-06,-0.000163,0.000241,0.000215,-0.000172,-7.5e-05,2.4e-05,-6.1e-05,-6.3e-05,5e-06,-2.8e-05,-0.000172,-6.2e-05,-1.8e-05,-6.9e-05,0.000155,4e-05,3.5e-05,-5.8e-05,0.000152,1.7e-05,3.1e-05,2.4e-05,1.2e-05,-3.9e-05,1.5e-05,-1.4e-05,6.7e-05,-1.2e-05,1e-06,-3.4e-05,-2.4e-05,-2.5e-05,3e-06,0,-5e-06,-2e-06,-3e-06,0,-3e-06,7e-06,3e-06,-7e-06,9e-06,-2e-06,4.1e-05,1.7e-05,-1e-05,1.6e-05,-1.2e-05,1.2e-05,2e-06,-1e-06,-1e-06,7e-06,8e-06,2e-06,7e-06,1e-06,0,-7e-06,-1e-06,-1.1e-05,8e-06,5e-06,0,-1e-06,1e-06,-1.1e-05,-5e-06,-5e-06,1e-06,3e-06,-2e-06,0,-4e-06,1e-06,0,6e-06,6e-06,2e-06,6e-06
3e-06,0,-1e-06,0,-1e-06,0,-1e-06,1e-06,-2e-06,2e-06,-2e-06,-1e-06,0,3e-06,-1e-06,-2.8e-05,3.9e-05,8e-06,6.6e-05,-1e-06,-9e-06,-2e-05,-1.2e-05,-1e-05,-2.8e-05,9e-06,2.3e-05,-1e-05,0.000146,-1.4e-05,-1.8e-05,3e-05,7.2e-05,0.00035,2.4e-05,-6.2e-05,2.8e-05,-7e-06,0.000162,-2e-05,0.000184,-0.000104,-0.000108,1.4e-05,-0.000101,8.9e-05,0.000105,4.4e-05,8.2e-05,-7.3e-05,5.2e-05,1.1e-05,5.2e-05,6.9e-05,-0.000224,-5.1e-05,-3.2e-05,3e-05,-0.000147,1e-04,-6.4e-05,-7e-06,0.000101,5e-05,2.8e-05,1.4e-05,-2.8e-05,8e-06,-6e-06,-2.1e-05,1.7e-05,7e-06,0,0,-4e-06,-2e-06,1e-06,-1.2e-05,-2e-06,2e-06,6e-06,9e-06,-4e-06,0,-3.2e-05,-2.1e-05,6e-06,-3.3e-05,2.8e-05,9e-06,2e-05,8e-06,-5e-06,-4e-06,-2e-06,1e-05,7e-06,2e-06,-1e-06,-2e-06,-3e-06,1.5e-05,-7e-06,-2e-06,-1e-06,-3e-06,-1e-06,-1e-06,-1e-06,-8e-06,2e-06,-2e-06,3e-06,1e-06,1e-06,0,0,-1e-06,6e-06,0,-9e-06
5e-06,0,0,-3e-06,-2e-06,1e-06,1e-06,-1e-06,-9e-06,1e-06,-1e-06,0,-1e-06,1e-06,0,-1.6e-05,-5.4e-05,-2.9e-05,-8.5e-05,-1e-06,-1e-06,6e-06,6e-06,2e-06,-2.9e-05,-2.6e-05,8e-06,9e-06,9.9e-05,-0.000197,-1.4e-05,-2.8e-05,-4.4e-05,-0.000185,-9.5e-05,-6.8e-05,-8.5e-05,0.00022,6.7e-05,-0.000157,9.4e-05,-7.6e-05,0.000124,0.000178,-6.7e-05,-8.2e-05,-1.8e-05,3.7e-05,-7.2e-05,-1.2e-05,4.5e-05,1e-05,3.5e-05,-0.000106,8.5e-05,-3.6e-05,1.8e-05,-1e-06,-2.3e-05,-3.3e-05,8.2e-05,-1.5e-05,-6.6e-05,2.1e-05,-1.3e-05,-1.5e-05,-4.8e-05,5e-06,1e-05,-1e-06,-1.5e-05,-1.2e-05,3e-06,-5e-06,-1.6e-05,5e-06,3e-06,9e-06,-2e-06,-9e-06,-4e-06,-8e-06,-1e-06,0,-2.9e-05,-7e-06,-2e-06,5e-06,-2.7e-05,-1.5e-05,-3.4e-05,-2.1e-05,6e-06,-3e-06,-1.3e-05,-6e-06,4e-06,2e-06,0,-5e-06,0,-1.2e-05,4e-06,0,1e-06,-1e-06,0,-7e-06,-2e-06,-1e-06,2e-06,-3e-06,1e-06,-1e-06,-3e-06,-2e-06,-1e-06,-4e-06,0,-1e-06,1e-06
2e-06,1e-06,-1e-06,-7e-06,0,0,0,0,-5e-06,-1e-06,-1e-06,-1e-06,0,1e-06,0,1.8e-05,2e-05,4e-06,8.2e-05,-6e-06,7e-06,2.4e-05,-1e-06,5e-06,2e-05,8e-06,9e-06,-8e-06,0.000124,0.000237,3.9e-05,-1.6e-05,0.000102,5.1e-05,2.4e-05,-4.5e-05,1.5e-05,-4.1e-05,-0.000294,0.000121,-0.000208,-9.4e-05,-9.8e-05,4.3e-05,0.000113,7.3e-05,5.7e-05,-5.5e-05,-4.1e-05,6.4e-05,-2e-05,-5e-06,-6.6e-05,9.5e-05,-7.1e-05,-1e-04,-0.000165,4e-06,-6.9e-05,-4.3e-05,-8.5e-05,6e-06,-9.7e-05,-2.4e-05,-9e-06,1.9e-05,7e-05,1.7e-05,-9e-06,1.1e-05,8e-06,1.2e-05,-1.4e-05,7e-06,-1e-05,-4e-06,-3e-06,3e-06,2e-06,1e-05,-5e-06,6e-06,0,2e-06,5.9e-05,-2e-06,0,2.1e-05,1.6e-05,4e-06,1.7e-05,1.2e-05,-6e-06,2e-06,5e-06,-3e-06,2e-06,-4e-06,-2e-06,-2e-06,-1e-06,4e-06,0,-4e-06,0,-3e-06,0,-2e-06,1e-06,-4e-06,1e-06,1e-06,0,2e-06,0,-3e-06,0,-1e-06,-7e-06,9e-06,5e-06
-2e-06,-1e-06,0,-4e-06,0,0,-1e-06,1e-06,-4e-06,-1e-06,-1e-06,0,0,-3e-06,0,3.3e-05,2.2e-05,2.3e-05,-4.5e-05,-1e-06,-6e-06,-2.2e-05,-6e-06,-7e-06,1.6e-05,1.7e-05,-3.4e-05,3e-06,5.4e-05,2e-06,-5.4e-05,2e-06,-0.000108,-4.6e-05,3.8e-05,5e-06,6.8e-05,-4.5e-05,0.000113,-0.000133,0.000109,-8e-06,3.1e-05,-0.000182,-9e-06,1.5e-05,-4e-05,6.6e-05,1.6e-05,-6e-06,-4.8e-05,-3.4e-05,4e-05,-6.2e-05,-3.3e-05,-1.1e-05,0.000166,-1.7e-05,0.000125,4e-06,6.1e-05,-1e-05,2.6e-05,1.7e-05,-2e-06,-5.4e-05,-6.2e-05,0,-1e-06,1.9e-05,-1e-06,8e-06,1e-05,-5e-06,-6e-06,3e-06,-1e-06,6e-06,1e-06,-5e-06,7e-06,-3e-06,-2e-06,0,-1e-05,-6e-06,-2e-06,-1.1e-05,-1.6e-05,2e-06,-1e-06,-1e-06,-2e-06,-3e-06,7e-06,-3e-06,-5e-06,3e-06,-1e-06,-1e-06,-3e-06,-6e-06,-2e-06,1e-06,-1e-06,-2e-06,1e-06,-7e-06,4e-06,-4e-06,-1e-06,-2e-06,3e-06,-1e-06,-3e-06,-2e-06,-1e-06,0,1e-06,-2e-06,-3e-06
-5e-06,1e-06,0,-1e-06,0,0,0,-1e-06,4e-06,0,-1e-06,0,0,-1e-06,0,-4.1e-05,6.3e-05,-2e-06,1e-05,4e-06,0,8e-06,1.2e-05,3e-06,-1.6e-05,-1.5e-05,-5e-06,-1e-06,-0.000105,-0.000298,2.1e-05,-1.5e-05,1.5e-05,8.5e-05,1.7e-05,5.5e-05,2.2e-05,-4e-06,4.3e-05,8.2e-05,-5.6e-05,0.000119,-7.8e-05,-0.000178,2.7e-05,-0.000158,-4.8e-05,-4.9e-05,3.6e-05,1.8e-05,4.5e-05,9.3e-05,-4.9e-05,6e-05,0.000149,8.5e-05,-6.4e-05,1.1e-05,-4.5e-05,-3.7e-05,-1.2e-05,-3e-06,2.2e-05,-2.1e-05,1.5e-05,5.3e-05,4.3e-05,-4e-06,-4e-06,-8e-06,9e-06,3e-06,-7e-06,4e-06,5e-06,0,3e-06,-1.3e-05,-3e-06,-1e-06,1e-06,0,-7e-06,-1e-06,3e-06,1.2e-05,-1e-06,1.2e-05,9e-06,1e-06,-6e-06,1e-06,5e-06,-7e-06,-6e-06,0,-5e-06,-6e-06,1e-06,-3e-06,-1e-06,0,2e-06,-1e-06,1e-06,-4e-06,0,-2e-06,0,0,-4e-06,-1e-06,1e-06,1e-06,0,-1e-06,0,4e-06,-3e-06,-1e-06,-1e-06
-1e-06,-1e-06,0,1e-06,0,0,0,0,7e-06,2e-06,-1e-06,0,0,0,0,-1.5e-05,-4.2e-05,-9e-06,5e-06,2e-06,5e-06,-1.7e-05,-4e-06,1e-06,-1.5e-05,1e-06,-1.6e-05,-1e-06,-0.000133,7.1e-05,-3e-05,-6e-06,6e-06,-0.000185,5.7e-05,2.6e-05,-0.000139,-8.6e-05,-4e-05,-2.1e-05,-0.000104,3.8e-05,3.3e-05,8.3e-05,-4.4e-05,0.000136,1.6e-05,8.2e-05,-4.5e-05,1.8e-05,-2.7e-05,-8e-06,2.6e-05,-4.8e-05,-4e-06,3.8e-05,7.1e-05,-1.4e-05,4.8e-05,2.3e-05,-8e-06,1.2e-05,-2.3e-05,-2e-05,9e-06,-2.1e-05,-1.4e-05,-1e-06,5e-06,-6e-06,1e-05,-9e-06,5e-06,-4e-06,7e-06,-4e-06,-1e-06,-2e-06,1e-06,-1e-06,-6e-06,4e-06,-1e-06,-1e-06,-3.1e-05,-8e-06,2e-06,-6e-06,-3e-06,-7e-06,1e-06,-2e-05,-2e-06,1e-06,-4e-06,4e-06,-3e-06,4e-06,1e-06,-1e-06,1e-06,-1e-06,0,1e-06,0,-1e-06,0,-5e-06,0,-3e-06,-2e-06,2e-06,0,-1e-06,-2e-06,1e-06,0,-3e-06,9e-06,0,0
2e-06,1e-06,0,-1e-06,0,-1e-06,1e-06,1e-06,2e-06,0,-1e-06,-1e-06,-1e-06,-1e-06,0,4.6e-05,-4.2e-05,0,-1.2e-05,-6e-06,-4e-06,1.6e-05,2e-05,-3e-06,1.6e-05,6e-06,3e-06,3e-06,-7.5e-05,0.000108,3.8e-05,-7e-06,-3.5e-05,0.000257,2.7e-05,-1.8e-05,7.2e-05,3e-05,5.2e-05,8e-06,0.000107,-2.3e-05,-1.7e-05,9.2e-05,0,-6.3e-05,-5e-05,1.4e-05,-3e-06,-3.3e-05,-4e-05,-6e-05,-4.9e-05,5.5e-05,0.000111,1.1e-05,-8.2e-05,2.2e-05,-8.5e-05,-4.4e-05,2.3e-05,-6e-06,-1.4e-05,-3.1e-05,-1e-05,0,-4e-06,2e-06,-3e-06,-1.9e-05,3e-06,-2e-06,-8e-06,1e-06,1e-06,3e-06,-1e-06,2e-06,-2e-06,4e-06,-5e-06,-7e-06,0,-1e-06,1.1e-05,-2e-06,-2e-06,-8e-06,6e-06,1e-06,-2e-06,7e-06,-2e-06,4e-06,0,5e-06,-2e-06,-5e-06,-1e-06,-2e-06,-1e-06,0,0,3e-06,0,-2e-06,0,-4e-06,-2e-06,-4e-06,3e-06,1e-06,-2e-06,0,0,2e-06,0,-1e-06,-1e-06,-5e-06,0
4e-06,-1e-06,0,-2e-06,0,0,-1e-06,0,0,-2e-06,-1e-06,1e-06,0,0,0,-7e-06,-8e-06,-1e-06,0,9e-06,1e-06,0,-2.5e-05,3e-06,1.8e-05,1e-06,1.4e-05,-4e-06,1.9e-05,-1.4e-05,1e-06,3.3e-05,6.9e-05,-0.000236,1.9e-05,-3.5e-05,1.8e-05,9.3e-05,-0.000117,9.5e-05,5.8e-05,-7.4e-05,3.1e-05,2.1e-05,4.7e-05,-3.3e-05,-4.2e-05,-2.1e-05,-4.4e-05,-1.8e-05,2.2e-05,-6e-06,1.7e-05,-4.3e-05,-0.000115,-1.5e-05,1.8e-05,-1.2e-05,7.1e-05,5.8e-05,-1.4e-05,-1.1e-05,-3.8e-05,1.4e-05,-2e-06,-1.4e-05,-1.2e-05,1e-06,2e-06,2.1e-05,7e-06,-6e-06,7e-06,1e-06,-4e-06,-2e-06,2e-06,3e-06,2e-06,-2e-06,8e-06,8e-06,-1e-06,0,1.7e-05,5e-06,-1e-06,5e-06,-9e-06,2e-06,1e-05,2e-06,3e-06,-3e-06,5e-06,-5e-06,2e-06,4e-06,0,-4e-06,0,9e-06,-1e-06,-2e-06,0,0,0,-4e-06,-1e-06,1e-06,3e-06,-1e-06,0,0,-2e-06,2e-06,0,1e-06,-9e-06,-6e-06,1e-06
2e-06,0,0,-2e-06,-1e-06,0,1e-06,0,-6e-06,0,-1e-06,0,0,1e-06,0,-2.8e-05,3.5e-05,9e-06,-2.6e-05,-5e-06,3e-06,0,1.9e-05,-1e-06,-2.1e-05,-6e-06,-3e-06,3e-06,7.6e-05,0.000108,-9e-06,3.6e-05,-4.8e-05,0.000167,-1.2e-05,-2.6e-05,-2.4e-05,-5e-05,3.1e-05,-8.9e-05,-0.000109,-8.3e-05,8e-06,-0.000119,-1.8e-05,1.4e-05,5.9e-05,2.8e-05,-8e-06,1.1e-05,1.8e-05,4e-05,4.1e-05,9e-06,6e-05,-4.4e-05,6.8e-05,7e-06,-7.5e-05,-6.8e-05,2e-05,9e-06,-1.6e-05,-4.1e-05,-3e-06,1.1e-05,1.7e-05,-4e-06,4e-06,1.9e-05,-1.2e-05,0,-5e-06,-1e-06,-5e-06,-1e-06,-1e-06,2e-06,1e-06,-4e-06,0,-3e-06,-1e-06,1e-06,-1.6e-05,0,1e-06,-1e-06,1e-05,2e-06,-1.8e-05,1.2e-05,-3e-06,-2e-06,0,-4e-06,5e-06,-2e-06,0,-1e-06,1e-06,-7e-06,0,0,0,-1e-06,0,-4e-06,-1e-06,-2e-06,0,1e-06,0,-1e-06,0,1e-06,0,0,1e-06,2e-06,-1e-06
-2e-06,0,0,-3e-06,0,0,-1e-06,0,-5e-06,0,-1e-06,0,0,0,0,1e-05,8e-06,-6e-06,3e-05,3e-06,-3e-06,-3e-06,-1.2e-05,-2e-06,-1e-05,2e-06,1.5e-05,-3e-06,7.4e-05,-1.5e-05,-6e-06,-2.5e-05,1.2e-05,-2.4e-05,5e-06,1.9e-05,-2.6e-05,5e-06,0.000103,2.5e-05,-4.9e-05,3.4e-05,1.6e-05,-0.000132,3e-05,-4.7e-05,-1.1e-05,-1.1e-05,2.8e-05,2e-05,2.4e-05,-3e-06,-3.3e-05,2e-06,-0.000128,1.6e-05,-6.8e-05,-2.4e-05,5e-05,4.5e-05,-1.6e-05,0,4e-06,2.5e-05,-1e-05,1.3e-05,-5e-06,-4e-06,-7e-06,-3.2e-05,5e-06,1.4e-05,4e-06,1e-06,-8e-06,3e-06,-2e-06,-1e-05,-2e-06,7e-06,1e-06,-3e-06,3e-06,1e-06,2.3e-05,9e-06,0,-2e-06,-1.2e-05,-2e-06,1.2e-05,-9e-06,-1e-06,3e-06,-5e-06,2e-06,3e-06,2e-06,0,-3e-06,0,1.2e-05,0,-1e-06,0,0,0,-2e-06,2e-06,-2e-06,-2e-06,1e-06,-2e-06,0,-2e-06,0,0,0,5e-06,2e-06,-1e-06
-3e-06,0,0,-3e-06,0,0,1e-06,0,-2e-06,0,-1e-06,0,0,1e-06,0,1e-05,-1.3e-05,-9e-06,-4.3e-05,-1e-06,0,-1e-05,7e-06,3e-06,2e-05,-2e-06,-1.1e-05,3e-06,3.7e-05,-1.9e-05,2e-05,-1.2e-05,2.2e-05,-0.000107,-5.4e-05,3e-05,5.6e-05,6e-06,-3.8e-05,-1.6e-05,0.00012,1e-04,4e-06,5.6e-05,-2e-05,1.3e-05,1.7e-05,-4e-06,-2.5e-05,-2e-06,-3.8e-05,6e-06,5.1e-05,-1.3e-05,6.7e-05,3.1e-05,1.9e-05,2.2e-05,-6.1e-05,5e-05,5e-06,-1e-06,1.2e-05,7e-06,2e-06,-2.3e-05,1.4e-05,-6e-06,5e-06,-4e-06,-8e-06,-4e-06,2e-06,-2e-06,-8e-06,-3e-06,0,8e-06,0,-2e-06,-6e-06,5e-06,0,0,-1.1e-05,0,0,1e-06,9e-06,0,-6e-06,1e-06,3e-06,0,2e-06,0,2e-06,0,0,-2e-06,-1e-06,-3e-06,0,-2e-06,0,-2e-06,0,-4e-06,2e-06,-1e-06,-1e-06,-2e-06,0,-1e-06,0,-1e-06,0,-3e-06,4e-06,5e-06,2e-06
-2e-06,0,0,-2e-06,0,0,0,0,0,0,-1e-06,0,0,0,0,6e-06,7e-06,1.1e-05,3.4e-05,4e-06,1e-06,1.4e-05,-8e-06,-1e-06,4e-06,0,-2e-06,-1e-06,-1.2e-05,-8e-06,-1e-06,-1.8e-05,-5e-05,0.000206,-4e-06,1.4e-05,-3e-06,-4.1e-05,-2.9e-05,-5e-05,-4.7e-05,2e-05,-2.6e-05,6.3e-05,-1.5e-05,-6.4e-05,1.8e-05,3.4e-05,-2.1e-05,1e-05,-3e-06,1e-06,-5.1e-05,1.3e-05,-9e-06,0,-4.4e-05,-1.7e-05,0.000108,-4.2e-05,2.2e-05,3e-06,4e-05,2e-06,6e-06,9e-06,-1.5e-05,-1e-06,-5e-06,2e-05,-5e-06,3e-06,-2e-06,3e-06,2e-06,2e-06,0,-6e-06,1e-06,-2e-06,3e-06,-5e-06,-1e-06,-1e-06,-1.8e-05,-1e-06,-1e-06,3e-06,-2e-06,2e-06,0,-2e-06,-2e-06,-2e-06,1e-06,3e-06,-3e-06,0,1e-06,-1e-06,0,0,0,1e-06,0,-1e-06,0,-2e-06,0,-3e-06,-1e-06,1e-06,1e-06,1e-06,-2e-06,-2e-06,0,1e-06,-6e-06,2e-06,-2e-06
2e-06,0,0,0,0,0,0,0,5e-06,0,0,0,0,0,0,-1.4e-05,6e-06,-2e-06,-1.7e-05,-5e-06,-2e-06,-5e-06,1e-06,-2e-06,-2e-05,4e-06,-1.2e-05,0,-6.2e-05,6.9e-05,-1.8e-05,-1.1e-05,4.7e-05,-0.000229,-2.9e-05,-3e-06,-4.1e-05,-1.3e-05,-5.3e-05,-1.7e-05,0,-3.7e-05,-9e-06,2.2e-05,-3.4e-05,5.4e-05,2.3e-05,-5.7e-05,1.1e-05,-1e-05,8e-06,-3.1e-05,1.7e-05,-2.7e-05,1.6e-05,-1.4e-05,5e-05,2.3e-05,-5.7e-05,3.3e-05,-2.3e-05,4e-06,-7e-06,2e-06,9e-06,2e-06,-1.8e-05,0,1e-06,1.3e-05,2e-06,-3e-06,2e-06,-3e-06,7e-06,1e-06,0,9e-06,0,0,1e-06,5e-06,0,-1e-06,8e-06,2e-06,1e-06,-8e-06,1e-06,-4e-06,-1e-06,9e-06,-1e-06,2e-06,-2e-06,2e-06,-5e-06,1e-06,-1e-06,-3e-06,0,-3e-06,0,1e-06,0,-2e-06,0,-4e-06,-1e-06,-2e-06,1e-06,0,-1e-06,0,0,-2e-06,0,1e-06,-1e-06,-3e-06,3e-06
3e-06,0,0,0,0,0,1e-06,0,3e-06,0,0,0,0,0,0,-1.2e-05,-1.4e-05,4e-06,-3e-06,4e-06,0,4e-06,4e-06,3e-06,-4e-06,-5e-06,-9e-06,0,-6.5e-05,-9.2e-05,1e-06,2.4e-05,-9e-06,0.000192,-8e-06,-2.7e-05,1.2e-05,4.9e-05,5e-05,-2.9e-05,6.9e-05,-7.5e-05,-2.7e-05,-0.000107,1.8e-05,2.7e-05,-1e-05,3.4e-05,9e-06,-1.9e-05,2.5e-05,4.2e-05,7e-06,4.2e-05,8.6e-05,-5.7e-05,5e-06,-2.2e-05,2.5e-05,-1.2e-05,1.3e-05,-5e-06,-3.7e-05,1.4e-05,-1e-06,8e-06,3.2e-05,0,-3e-06,-2.2e-05,-5e-06,-9e-06,-4e-06,1e-06,5e-06,-1e-06,1e-06,-1e-05,0,3e-06,2e-06,-3e-06,2e-06,-1e-06,1e-05,-2e-06,0,4e-06,-1e-06,-1e-06,0,-7e-06,2e-06,1e-06,-1e-06,-5e-06,-3e-06,-2e-06,-1e-06,-1e-06,-1e-06,-1e-06,0,1e-06,0,-1e-06,0,-2e-06,-2e-06,-1e-06,2e-06,-1e-06,0,0,-2e-06,-1e-06,0,-1e-06,3e-06,1e-06,-1e-06
2e-06,0,0,-2e-06,0,0,-1e-06,1e-06,0,0,0,0,0,-1e-06,0,2.7e-05,-3.8e-05,-7e-06,2.5e-05,-4e-06,1e-06,-9e-06,-1e-06,-1e-06,2e-05,0,4e-06,-2e-06,-1.4e-05,3.4e-05,2.1e-05,1.1e-05,-1.9e-05,-0.000118,2.7e-05,-1.5e-05,3e-06,-1.5e-05,4.3e-05,1.9e-05,-9.5e-05,3e-06,2e-05,-9.6e-05,3.2e-05,-2.1e-05,-9e-06,-8e-06,8e-06,-2e-06,-2e-05,-3.7e-05,-3.1e-05,-4.5e-05,-6.8e-05,-1.4e-05,-7.1e-05,1.4e-05,-0.000112,4e-06,-1.3e-05,7e-06,1.2e-05,-1.6e-05,-8e-06,-1.2e-05,-1.7e-05,2e-06,-1e-06,-8e-06,-1e-06,2e-06,5e-06,1e-06,-4e-06,1e-06,1e-06,4e-06,-1e-06,-1e-06,-5e-06,-2e-06,-2e-06,0,1e-06,0,-1e-06,0,3e-06,1e-06,4e-06,0,-2e-06,-3e-06,2e-06,-1e-06,-1e-06,3e-06,0,-2e-06,0,3e-06,-1e-06,0,0,-2e-06,0,-4e-06,0,-1e-06,2e-06,1e-06,1e-06,1e-06,0,0,0,-1e-06,-1e-06,-2e-06,-2e-06
-2e-06,0,0,-3e-06,0,0,1e-06,0,-2e-06,0,-1e-06,0,0,-1e-06,0,6e-06,2.1e-05,-1e-06,-3.2e-05,3e-06,0,5e-06,-5e-06,-2e-06,1e-06,2e-06,-3e-06,2e-06,4.3e-05,9.2e-05,-9e-06,-2e-06,4.7e-05,4.9e-05,-8e-06,1.5e-05,2.6e-05,-6e-06,-4.5e-05,2.2e-05,-7e-06,3e-05,-5e-06,4.2e-05,2e-05,1.8e-05,-2.4e-05,-3.2e-05,6e-06,9e-06,-9e-06,-1.3e-05,3.7e-05,4.1e-05,3.5e-05,3.9e-05,6.8e-05,-1.1e-05,8.8e-05,-2.6e-05,2.1e-05,3e-06,2.3e-05,-2.5e-05,0,1e-06,1.9e-05,3e-06,3e-06,1.4e-05,7e-06,3e-06,-7e-06,-4e-06,-5e-06,-1e-06,0,-4e-06,0,-3e-06,4e-06,6e-06,0,0,-9e-06,-2e-06,1e-06,-5e-06,-6e-06,3e-06,-1.2e-05,-4e-06,-1e-06,-1e-06,0,2e-06,2e-06,-4e-06,0,-3e-06,0,-7e-06,0,-1e-06,0,-1e-06,0,-2e-06,0,-2e-06,-1e-06,1e-06,0,0,-2e-06,1e-06,0,-1e-06,0,-2e-06,3e-06
