-0.001832,-0.006916,-0.021438,-0.051547,-0.092557,-0.095083,-0.086167,-0.090325,-0.064063,-0.097285,-0.086934,-0.054664,-0.045725,-0.047842,-0.041623,-0.035203,-0.022224,-0.007578,-0.006073,-0.008155,-0.007134,-0.003929,-0.002504,-0.001993,-0.001702,-0.000876,-0.000457,-0.000275
0.000959,0.006269,0.021054,0.051753,0.088623,0.096831,0.08977,0.090944,0.068333,0.101067,0.094071,0.06245,0.059146,0.062419,0.044014,0.033501,0.021481,0.00752,0.005979,0.006291,0.005617,0.003299,0.002445,0.00168,0.001107,6e-04,0.00036,0.000191
0.000626,-6.8e-05,0.001846,0.011595,0.026658,0.017642,0.007675,0.012276,0.003485,0.016396,0.009463,-0.002331,-0.011166,-0.009245,6.5e-05,0.007266,0.004124,-0.000848,0.00063,0.002788,0.002737,0.001317,0.000537,0.000684,0.000859,0.000299,8.7e-05,6.5e-05
-0.001016,-0.004598,-0.018704,-0.053433,-0.096294,-0.093411,-0.083873,-0.091676,-0.065583,-0.100292,-0.089248,-0.053977,-0.046009,-0.048745,-0.039097,-0.035509,-0.022216,-0.006974,-0.00594,-0.007514,-0.006559,-0.003589,-0.002308,-0.001763,-0.001379,-0.000661,-0.000356,-0.000204
0.000257,0.003707,0.009295,0.021623,0.028263,0.037902,0.040085,0.039995,0.037536,0.04659,0.048726,0.037289,0.042485,0.044467,0.025469,0.014493,0.008911,0.005915,0.003245,0.001312,0.000868,0.000663,0.000877,0.000273,-0.000153,0.00015,0.00016,7.4e-05
0.00083,0.001248,0.009299,0.034605,0.071972,0.055681,0.045742,0.058382,0.036033,0.060822,0.0433,0.018897,0.009343,0.007806,0.016511,0.024583,0.014992,0.00322,0.003487,0.006422,0.005569,0.002984,0.001403,0.001329,0.001324,0.000487,0.000218,0.000141
-0.000609,-0.003118,-0.010418,-0.03706,-0.05936,-0.054774,-0.048378,-0.055892,-0.045358,-0.069779,-0.059616,-0.034097,-0.034807,-0.036736,-0.023062,-0.022801,-0.013089,-0.005974,-0.004136,-0.003219,-0.002909,-0.001753,-0.001282,-0.000694,-0.000304,-0.000329,-0.000238,-0.000143
-0.000501,0.001029,0.00026,-0.008062,-0.029349,-0.014487,-0.00615,-0.012969,-0.001392,-0.012548,0.001464,0.010511,0.021415,0.022221,0.001558,-0.00855,-0.005365,0.001385,6.7e-05,-0.003391,-0.003153,-0.001795,-0.000507,-0.000714,-0.00096,-0.000205,-3.8e-05,-3.5e-05
0.000481,0.000164,0.00401,0.032893,0.060943,0.040604,0.033934,0.046969,0.031601,0.059472,0.038511,0.009208,0.003055,0.003721,0.007938,0.020282,0.010948,0.0022,0.001753,0.002909,0.003316,0.001964,0.000934,0.000606,0.000426,0.000242,0.000143,0.000118
0.000506,0.000573,0.001452,-0.008544,-0.004194,0.000336,-0.003868,-0.011491,-0.016637,-0.020355,-0.016136,-0.005777,-0.016213,-0.015614,-0.001883,-0.003077,2.1e-05,-0.002204,-0.000523,0.001666,0.001274,0.000985,0.000286,0.000507,0.000712,8.9e-05,2e-06,-1e-05
-0.000553,0.000351,-0.003487,-0.02457,-0.05156,-0.030994,-0.028008,-0.037494,-0.019122,-0.038036,-0.020479,-0.002687,0.009396,0.011856,-0.003662,-0.015643,-0.009102,8.9e-05,-0.000896,-0.003559,-0.003679,-0.002368,-0.000879,-0.000673,-0.000612,-0.00021,-8.5e-05,-8.4e-05
-0.000427,-0.00253,-0.004917,0.01884,0.026998,0.002877,0.001113,0.019484,0.021998,0.034796,0.015907,-0.006811,-0.002635,-0.003958,-0.002972,0.009562,0.002728,0.001418,6.5e-05,-0.000438,0.00037,0.000146,-3.9e-05,-0.000316,-0.000426,-4.5e-05,2e-06,2.2e-05
0.000712,0.000969,0.00627,0.011463,0.032889,0.029314,0.030205,0.026689,0.00426,0.012563,0.008164,0.009712,-0.00094,-0.004864,0.008126,0.009926,0.007402,-0.000869,0.001192,0.003894,0.003163,0.002123,0.00083,0.000707,0.000659,0.000178,4.4e-05,5e-05
0.000234,0.002735,0.004283,-0.01992,-0.036377,-0.009069,-0.009751,-0.024052,-0.014429,-0.032026,-0.010343,0.011464,0.011992,0.014441,0.003701,-0.01068,-0.003642,0.000171,0.000449,-0.000174,-0.001237,-0.001014,-0.00029,6.7e-05,0.000229,0.000103,1.1e-05,6e-06
-0.000843,-0.003657,-0.01111,-0.001526,-0.012666,-0.029863,-0.029187,-0.015154,0.002159,0.003264,-0.009636,-0.024486,-0.014311,-0.013326,-0.013505,-0.004812,-0.006936,-0.000622,-0.002271,-0.003541,-0.001988,-0.001405,-0.000614,-0.000582,-0.000646,-0.000218,-2.8e-05,-2.9e-05
0.000145,0.000266,0.002999,0.018188,0.035207,0.022161,0.031058,0.032462,0.010962,0.024056,0.017561,0.006917,-0.001023,-0.002518,0.005252,0.010182,0.005799,-0.000258,0.000442,0.001188,0.001608,0.001495,0.000596,0.000133,-5.5e-05,-9.1e-05,-6e-06,-7e-06
0.000674,0.004114,0.010564,-0.008145,-0.007195,0.019614,0.014153,0.000984,-0.006066,-0.010902,0.003136,0.023188,0.017853,0.017678,0.008983,-0.000432,0.005008,0.001691,0.002413,0.002597,0.000663,0.000481,0.000159,0.000427,0.000592,0.000227,3.3e-05,3.2e-05
-0.000513,-0.00357,-0.010244,-0.011365,-0.025507,-0.031633,-0.039568,-0.034543,-0.008636,-0.016123,-0.020511,-0.027052,-0.0172,-0.013717,-0.012266,-0.008684,-0.007795,-0.000286,-0.002076,-0.002504,-0.001435,-0.00145,-0.000571,-0.000269,-9.1e-05,5.1e-05,0,-1.8e-05
-0.000252,-0.001371,-0.003086,0.014152,0.020295,-0.001499,0.006355,0.014946,0.007774,0.014486,0.008353,-0.003791,-0.004356,-0.007421,-0.000784,0.004136,-0.001095,-0.001572,-0.001318,-0.001564,4.9e-05,0.000209,0.000211,-0.000204,-0.000448,-0.000193,-5.1e-05,-3e-05
