0.049937,0.108255,0.351338,0.754188,1.023385,1.05966,1.098723,1.151567,1.05386,0.875092,0.700898,0.519247,0.373698,0.272701,0.192979,0.15456,0.135835,0.192923,0.288629,0.271623,0.24577,0.245135,0.217799,0.210408,0.252552,0.209369,0.113236,0.094978
0.060364,0.130768,0.421275,0.884963,1.1941,1.241003,1.252985,1.274213,1.170742,1.016861,0.86068,0.660925,0.477842,0.336927,0.234765,0.19204,0.170722,0.232592,0.341752,0.32928,0.303607,0.297824,0.259865,0.249311,0.299584,0.248866,0.137015,0.116699
0.075715,0.165948,0.531914,1.092537,1.477963,1.557768,1.511126,1.445518,1.355322,1.306415,1.198617,0.947791,0.680313,0.455365,0.307914,0.260959,0.236492,0.296352,0.416877,0.416,0.392465,0.374138,0.322291,0.308851,0.367548,0.305312,0.17143,0.148128
0.080176,0.184649,0.603911,1.233646,1.717702,1.885189,1.781293,1.607461,1.582432,1.721405,1.646555,1.268455,0.882769,0.567672,0.371637,0.319994,0.294499,0.336407,0.442064,0.45233,0.430207,0.400064,0.349549,0.336986,0.387809,0.319544,0.180731,0.15637
0.073235,0.181123,0.646011,1.395549,1.997775,2.218822,2.114741,1.919701,1.919746,2.155784,2.0601,1.507327,1.001687,0.63369,0.406942,0.345258,0.319816,0.348288,0.433098,0.440413,0.414869,0.385883,0.345403,0.331544,0.360293,0.291883,0.163571,0.1363
0.071258,0.168192,0.694667,1.666728,2.410748,2.560397,2.439975,2.360562,2.354872,2.474059,2.25581,1.5452,0.964332,0.605472,0.383657,0.319856,0.302855,0.370741,0.485358,0.460397,0.41169,0.393812,0.355752,0.338171,0.348109,0.269412,0.143652,0.112276
0.087044,0.166169,0.753222,2.040269,3.14009,3.329325,3.00515,2.864434,2.914412,2.884205,2.386985,1.492314,0.880452,0.547407,0.346662,0.302664,0.299506,0.466181,0.680342,0.588989,0.489381,0.480596,0.415439,0.393038,0.411112,0.300497,0.14769,0.113193
0.120856,0.19258,0.889747,2.66376,4.467252,5.05132,4.439217,3.91371,4.122885,4.178006,3.276162,1.95859,1.18111,0.717143,0.416815,0.384946,0.399049,0.689926,1.044559,0.843196,0.653284,0.668374,0.55597,0.497664,0.533409,0.387234,0.188453,0.145363
0.165868,0.247264,1.205911,3.906546,6.592535,7.621865,7.0187,6.104932,6.459703,6.813195,5.341756,3.153763,1.957061,1.175969,0.624339,0.568879,0.591456,1.003949,1.508357,1.183478,0.890806,0.935576,0.75006,0.615472,0.664269,0.492974,0.250549,0.202307
0.215141,0.328919,1.708595,5.781321,9.286991,10.486373,10.406037,9.346525,9.696969,10.389862,8.156418,4.752833,2.993419,1.818996,0.930702,0.813201,0.813906,1.294641,1.908032,1.514375,1.16435,1.246433,0.962479,0.705262,0.776482,0.595887,0.308694,0.262149
0.257439,0.416644,2.269287,7.873607,11.947775,12.742231,13.46996,12.833816,13.10634,13.845009,10.755879,6.220157,3.972254,2.460304,1.261321,1.053727,0.980404,1.427187,2.051559,1.68095,1.397632,1.549314,1.158262,0.77862,0.91639,0.713952,0.340472,0.297045
0.289832,0.48039,2.623099,9.191832,13.553041,13.606488,14.784301,15.099446,15.306832,15.441228,11.807287,6.91983,4.458624,2.7953,1.472186,1.196818,1.024606,1.356404,1.905976,1.634482,1.509522,1.717598,1.282398,0.854673,1.043969,0.811877,0.337548,0.2848
0.295341,0.482275,2.464826,8.527332,12.662534,12.396057,13.303876,14.415748,14.703106,13.901425,10.567953,6.531352,4.16391,2.564233,1.396042,1.117421,0.906833,1.115124,1.53388,1.379758,1.435128,1.669216,1.258862,0.86496,1.055247,0.821095,0.308029,0.241555
0.27441,0.430243,1.897451,6.191187,9.551836,9.706045,9.924291,10.971375,11.359298,10.064245,7.670916,5.083059,3.170132,1.859398,1.041345,0.819109,0.662691,0.800889,1.07908,0.994196,1.14101,1.408186,1.109294,0.78484,0.932308,0.726787,0.264479,0.192972
0.236943,0.362535,1.362733,3.918787,6.268292,6.731594,6.370777,6.815096,6.935694,5.699683,4.348902,3.119145,2.044429,1.175995,0.642883,0.477419,0.402292,0.50959,0.702671,0.68272,0.832404,1.135445,0.966949,0.65106,0.711119,0.563131,0.215258,0.144061
0.239095,0.342596,1.117198,2.990642,4.713832,4.690149,3.809075,3.88298,3.879123,3.179838,2.484883,1.802984,1.366689,0.847414,0.405505,0.283493,0.249124,0.353665,0.569833,0.623642,0.781686,1.113078,0.947467,0.550394,0.514148,0.422894,0.197492,0.133937
0.311318,0.42078,1.293394,3.300965,4.701609,4.06802,2.901191,2.893356,2.933427,2.518994,2.074545,1.539631,1.289628,0.851961,0.405931,0.298251,0.250075,0.367163,0.630884,0.71829,0.913842,1.274215,1.026025,0.546877,0.470834,0.406554,0.24042,0.17488
0.396044,0.543231,1.630777,4.088595,5.630934,4.73746,3.322858,3.222918,3.151848,2.629553,2.357169,1.946699,1.66501,1.097465,0.548293,0.410467,0.302558,0.442504,0.748825,0.872079,1.122246,1.472668,1.154565,0.6458,0.57338,0.509895,0.322292,0.230601
0.458348,0.645004,2.012349,5.121758,7.222982,6.503342,4.868139,4.443968,4.045006,3.212302,3.135098,2.857512,2.291173,1.37545,0.714558,0.565359,0.370891,0.509187,0.863961,1.078445,1.390334,1.691499,1.357162,0.833671,0.730117,0.643327,0.393737,0.267169
0.479683,0.685472,2.23518,5.752572,8.405633,8.442591,7.133167,6.370436,5.453541,4.511611,4.806956,4.474487,3.239131,1.674935,0.884927,0.741647,0.463637,0.581592,1.021923,1.326544,1.64004,1.892252,1.590772,1.051423,0.917753,0.785523,0.420504,0.262112
0.46144,0.694471,2.202437,5.568941,8.488594,9.881028,9.811766,9.312028,7.620092,6.28502,7.061196,6.607273,4.563015,2.12923,1.061205,0.903956,0.586754,0.665893,1.172363,1.486681,1.74764,2.014761,1.789069,1.227279,1.073849,0.889918,0.395792,0.220015
0.389526,0.635026,1.961014,4.632401,7.349315,10.324928,12.21425,12.77377,10.267287,8.071525,9.195174,8.623893,5.768083,2.528391,1.233254,1.0345,0.720024,0.738475,1.205033,1.418838,1.574507,1.993776,1.934067,1.322591,1.139386,0.926395,0.373581,0.194076
0.307605,0.53365,1.659089,3.62615,5.962857,9.644038,13.172604,15.074968,11.775962,8.579069,9.830211,9.293246,5.99147,2.548884,1.350071,1.077566,0.77986,0.729286,1.035763,1.137574,1.224501,1.827889,1.968525,1.339988,1.156935,0.922668,0.357208,0.189259
0.244062,0.457934,1.628087,3.353693,5.175297,7.999998,11.698939,14.365738,11.031719,7.297346,8.165409,7.900923,4.983198,2.219467,1.313069,0.940283,0.709066,0.639383,0.767469,0.842462,0.962803,1.681534,1.880318,1.192916,1.013398,0.799865,0.323749,0.192693
0.200265,0.374724,1.6399,3.531193,4.844502,6.05591,8.771518,10.912833,8.226659,5.11426,5.409163,5.409298,3.575277,1.866674,1.117531,0.727134,0.582826,0.533352,0.602536,0.664397,0.794212,1.423366,1.509894,0.850581,0.701363,0.557671,0.249162,0.175091
0.162153,0.274033,1.658794,3.840226,4.61443,4.530866,6.320729,7.461611,5.4069,3.789502,3.891686,3.607811,2.466911,1.441894,0.862209,0.605958,0.48248,0.455506,0.542061,0.568537,0.69752,1.066934,0.965726,0.495623,0.433207,0.359851,0.170567,0.139303
0.153547,0.215598,1.671088,3.833472,4.056365,3.618994,4.81377,5.287768,3.765371,3.10993,3.213597,2.51226,1.634493,0.982855,0.653613,0.533056,0.414221,0.395964,0.463144,0.505467,0.647944,0.798119,0.622821,0.361079,0.352364,0.282684,0.132092,0.111145
0.1546,0.195876,1.579982,3.349614,3.225756,3.041629,3.766318,4.091527,3.44252,3.096019,2.946649,1.957011,1.125049,0.682482,0.536791,0.442455,0.331454,0.344513,0.436635,0.506988,0.643786,0.758202,0.549293,0.305691,0.308943,0.241273,0.124018,0.109308
0.163439,0.189667,1.435991,2.763646,2.513305,2.540849,3.040794,3.585087,3.443053,2.916793,2.550195,1.616653,0.838552,0.565185,0.492582,0.347445,0.25416,0.311098,0.452181,0.522506,0.615095,0.7783,0.591042,0.286331,0.303833,0.27028,0.14842,0.127487
0.169961,0.188806,1.433837,2.739804,2.620816,2.421536,2.806122,3.631192,3.211756,2.214561,1.835263,1.212053,0.627786,0.526681,0.510193,0.33036,0.250826,0.296723,0.417776,0.507661,0.59961,0.761128,0.589839,0.277692,0.322651,0.320561,0.181189,0.152151
0.163093,0.174475,1.4249,2.931162,3.020358,2.462171,2.466664,3.102548,2.493102,1.498041,1.203743,0.861902,0.506346,0.492251,0.526133,0.375944,0.282587,0.264563,0.356866,0.458741,0.564752,0.662101,0.487938,0.269886,0.375122,0.365897,0.19307,0.160161
0.157581,0.144522,1.319918,3.010169,3.444849,2.814977,2.196439,2.191551,1.695974,1.092126,0.937038,0.805842,0.574025,0.49556,0.526813,0.421281,0.284224,0.229959,0.336896,0.408467,0.455541,0.490755,0.376204,0.272857,0.398951,0.36766,0.179205,0.147468
0.145829,0.129057,1.282064,3.130972,3.835522,3.091212,1.960203,1.780036,1.581612,1.167213,0.973505,0.820339,0.659906,0.524177,0.493424,0.393646,0.234419,0.197794,0.329117,0.364914,0.331092,0.354426,0.319782,0.26068,0.364949,0.333815,0.151675,0.126338
0.114261,0.123407,1.316397,3.137234,3.793975,2.99615,1.86529,1.869221,1.816541,1.290495,1.052195,0.857246,0.697866,0.547906,0.440688,0.309493,0.166789,0.168657,0.289547,0.312908,0.299441,0.3688,0.319775,0.217214,0.302577,0.285345,0.130045,0.105614
0.075874,0.123105,1.252919,2.699105,3.025944,2.41056,1.936237,2.184412,1.880897,1.14852,0.971194,0.878534,0.670336,0.544328,0.472474,0.308034,0.1524,0.151671,0.224713,0.266345,0.363698,0.467585,0.35212,0.194841,0.261464,0.237576,0.114261,0.092088
0.064444,0.134502,1.074704,1.960946,1.898074,1.64185,1.921776,2.270693,1.602551,0.794044,0.727435,0.782178,0.545432,0.462074,0.494361,0.3507,0.162995,0.139466,0.177382,0.231287,0.437864,0.565829,0.400389,0.213928,0.254998,0.217599,0.108999,0.098788
0.076581,0.144302,0.918977,1.656201,1.423877,1.321449,1.823423,1.962702,1.233459,0.595459,0.540505,0.641059,0.424703,0.347717,0.428037,0.375903,0.195118,0.137754,0.170534,0.240645,0.485389,0.589162,0.411994,0.242286,0.269772,0.224306,0.109294,0.108399
0.083313,0.146535,0.953173,1.942083,1.74597,1.377823,1.473111,1.464139,1.110995,0.743537,0.671824,0.623933,0.398782,0.299479,0.302747,0.349238,0.213211,0.121676,0.144729,0.231346,0.480038,0.569243,0.416296,0.252097,0.257068,0.224186,0.115683,0.109312
0.073214,0.131523,1.061947,2.285553,2.035322,1.323731,0.978312,0.997065,1.109576,0.976163,0.936223,0.722916,0.430395,0.300629,0.21023,0.278805,0.208221,0.105273,0.104687,0.201803,0.433206,0.636818,0.535734,0.27921,0.206548,0.198963,0.114194,0.094023
0.051135,0.116667,1.099715,2.395417,2.004025,1.054004,0.617064,0.674146,0.971568,1.127158,1.20284,0.861562,0.48943,0.304441,0.175491,0.205253,0.176683,0.088314,0.077737,0.194953,0.429888,0.753774,0.684396,0.325874,0.161425,0.151204,0.100503,0.071879
