0.053355,0.054248,0.059427,0.068316,0.069759,0.059774,0.054669,0.058746,0.055609,0.047797,0.051651,0.056842,0.052546,0.044615,0.046089,0.05224,0.049435,0.043447,0.045351,0.049492,0.050351,0.050407,0.053195,0.054902,0.047607,0.042531,0.043129,0.046521
0.065981,0.066892,0.073925,0.086233,0.086616,0.073264,0.068637,0.073694,0.068371,0.058933,0.063988,0.069574,0.065226,0.055062,0.053834,0.060577,0.059115,0.053969,0.058466,0.064462,0.064415,0.062704,0.065355,0.069321,0.060298,0.052297,0.054952,0.060662
0.087215,0.088622,0.099166,0.11636,0.113998,0.096688,0.094764,0.101095,0.091548,0.079324,0.08598,0.091702,0.087321,0.073187,0.066624,0.074594,0.075884,0.072946,0.082642,0.091357,0.089183,0.084847,0.087678,0.096138,0.08385,0.07036,0.077595,0.088097
0.102499,0.104747,0.117282,0.134456,0.130342,0.115629,0.118026,0.124263,0.112729,0.099395,0.105076,0.109727,0.105176,0.087373,0.076892,0.086237,0.089411,0.0895,0.103944,0.112519,0.107378,0.102346,0.105963,0.11791,0.104138,0.086985,0.09893,0.114972
0.113481,0.120099,0.127701,0.133483,0.131334,0.130668,0.135678,0.137961,0.130967,0.120824,0.120209,0.122727,0.119586,0.100831,0.091251,0.101032,0.103001,0.105328,0.119854,0.122503,0.114177,0.112121,0.117258,0.12727,0.115556,0.100417,0.112441,0.130299
0.146247,0.159834,0.149898,0.140877,0.152291,0.169598,0.169781,0.166142,0.168635,0.164769,0.156007,0.156661,0.157617,0.141572,0.136203,0.140564,0.134741,0.139994,0.153124,0.147176,0.133795,0.137144,0.147381,0.144897,0.130778,0.121803,0.128884,0.144541
0.230059,0.250759,0.219343,0.201093,0.237742,0.274177,0.267028,0.261701,0.273194,0.271113,0.252557,0.246585,0.247581,0.232456,0.233631,0.234529,0.216656,0.22208,0.238882,0.230692,0.20701,0.215406,0.237814,0.216574,0.188216,0.183305,0.190318,0.209874
0.380914,0.423233,0.369262,0.33772,0.405214,0.467473,0.46392,0.468408,0.475556,0.45953,0.434715,0.418344,0.410191,0.391175,0.406426,0.409838,0.36835,0.370589,0.398177,0.397142,0.359804,0.374868,0.424919,0.37798,0.316102,0.306422,0.313778,0.353932
0.637662,0.723553,0.627728,0.567956,0.676847,0.772326,0.781685,0.811489,0.793178,0.750213,0.732338,0.700132,0.673845,0.637611,0.677269,0.702285,0.618472,0.613841,0.659332,0.668703,0.611706,0.634807,0.73513,0.64882,0.524074,0.496787,0.499024,0.587742
0.99315,1.141145,0.989917,0.893102,1.045548,1.168836,1.199782,1.266132,1.195074,1.120524,1.12675,1.076439,1.038077,0.958687,1.021841,1.108212,0.969959,0.958521,1.030419,1.037044,0.950959,0.987245,1.16101,1.02575,0.809361,0.749992,0.738229,0.903772
1.338158,1.545136,1.35848,1.235971,1.40325,1.517453,1.570553,1.67458,1.543324,1.454129,1.494974,1.424195,1.392435,1.257544,1.324139,1.498618,1.30901,1.300368,1.414789,1.396277,1.268415,1.323811,1.585251,1.427196,1.122594,1.005175,0.96828,1.226807
1.470627,1.688533,1.517609,1.405793,1.537314,1.588887,1.650692,1.768093,1.610192,1.548712,1.615796,1.538319,1.531287,1.358485,1.397207,1.63019,1.422327,1.432049,1.60139,1.551763,1.377259,1.455636,1.779585,1.647163,1.310579,1.122516,1.063005,1.384416
1.260359,1.418824,1.304584,1.251079,1.322486,1.292685,1.336296,1.413703,1.277798,1.273752,1.356027,1.306413,1.313005,1.151602,1.152036,1.347079,1.175697,1.213327,1.414203,1.356454,1.166653,1.261639,1.566177,1.501727,1.22526,0.999448,0.950162,1.248041
0.874548,0.929602,0.853995,0.858879,0.912499,0.878257,0.884371,0.899212,0.833611,0.844712,0.895701,0.886104,0.878978,0.771553,0.736143,0.814573,0.746113,0.801887,0.941631,0.900518,0.785949,0.87317,1.060672,1.078374,0.928035,0.730739,0.700509,0.876071
0.720558,0.731049,0.691173,0.659186,0.720736,0.744883,0.705987,0.771473,0.820671,0.727373,0.666673,0.634299,0.643564,0.639575,0.537768,0.522731,0.559395,0.574168,0.612452,0.583044,0.574986,0.655781,0.693569,0.731196,0.70827,0.60844,0.58676,0.630163
0.891875,0.895822,0.927343,0.918262,1.006252,1.037983,0.966397,1.097137,1.213127,1.019574,0.856918,0.773195,0.83772,0.900742,0.716083,0.661723,0.730727,0.672827,0.664174,0.642164,0.671055,0.780718,0.768025,0.790791,0.838885,0.808189,0.766699,0.768712
1.160342,1.13078,1.217194,1.327302,1.483518,1.487522,1.361424,1.513694,1.679282,1.394583,1.186279,1.129752,1.213995,1.258452,1.003978,0.921032,0.981029,0.881973,0.874126,0.870866,0.874614,0.987946,1.015426,1.066085,1.124508,1.075522,0.964284,1.022723
1.381279,1.268004,1.45719,1.801508,2.012266,1.902625,1.752595,1.960002,2.101611,1.711297,1.620252,1.645373,1.557807,1.480848,1.269869,1.228285,1.23865,1.074886,1.062019,1.100499,1.077284,1.179452,1.281812,1.399147,1.455822,1.319338,1.062385,1.203846
1.564077,1.322949,1.691056,2.307023,2.57268,2.344622,2.21278,2.446833,2.438736,1.959049,2.118467,2.220866,1.732657,1.460215,1.498602,1.655984,1.602254,1.315357,1.220553,1.268554,1.281207,1.402235,1.581244,1.779123,1.844404,1.581001,1.118254,1.354431
1.800124,1.37811,1.875809,2.663194,3.02456,2.845544,2.764143,2.897642,2.787442,2.269688,2.493967,2.606395,1.748577,1.344446,1.690974,2.065503,1.981103,1.616301,1.428507,1.41975,1.481333,1.678412,1.961712,2.156581,2.132014,1.727703,1.149503,1.528061
1.87881,1.361673,1.833599,2.570469,3.001225,3.06607,3.078188,3.004093,2.932981,2.438594,2.424214,2.541177,1.708059,1.29933,1.746875,2.181926,2.147418,1.804523,1.536578,1.478301,1.626437,1.870312,2.209396,2.361339,2.14061,1.637986,1.116146,1.574804
1.755232,1.285481,1.651965,2.212314,2.547874,2.691643,2.724712,2.498495,2.530382,2.155143,1.852632,2.082281,1.618259,1.245309,1.587139,1.918498,1.985662,1.744101,1.376784,1.281346,1.54754,1.775267,2.051561,2.164209,1.867647,1.43186,1.034278,1.382159
1.445023,1.19727,1.455932,1.869263,1.983858,1.926827,1.887302,1.68124,1.751717,1.552022,1.253643,1.573457,1.465637,1.137107,1.253998,1.413944,1.548511,1.467834,1.110029,0.99028,1.342752,1.523326,1.608667,1.631379,1.398273,1.202501,0.959651,1.048779
1.139571,1.122513,1.25184,1.498278,1.494274,1.347066,1.201129,1.060398,1.153891,1.13666,1.077948,1.384285,1.316503,1.021082,1.056374,1.127634,1.150278,1.125412,0.961743,0.975889,1.301076,1.349048,1.284447,1.231072,1.028991,0.988126,0.928179,0.843742
0.953274,1.147401,1.305019,1.36038,1.200419,1.117387,0.987384,0.843991,0.950503,1.115526,1.261123,1.385587,1.167,1.010513,1.11044,1.235246,1.190896,1.080213,1.010595,1.154783,1.452166,1.347922,1.197868,1.066176,0.857904,0.907956,0.999415,0.898225
0.96845,1.343878,1.56304,1.469334,1.170084,1.078097,1.009445,0.953748,1.153297,1.417057,1.581763,1.497915,1.178378,1.174052,1.262293,1.370378,1.303733,1.119743,1.078841,1.271024,1.633137,1.523874,1.332706,1.11333,0.866326,0.999958,1.19884,1.076481
1.010902,1.453011,1.677646,1.523708,1.164402,1.039201,1.067945,1.09928,1.424682,1.782204,1.848609,1.62074,1.323881,1.390646,1.339931,1.293179,1.217578,1.033346,0.99924,1.174164,1.627567,1.680572,1.495308,1.206838,0.98509,1.240524,1.409568,1.178846
1.120425,1.471884,1.584351,1.42853,1.075746,0.9076,1.067349,1.147938,1.472483,1.876296,1.819535,1.537226,1.370541,1.458768,1.334673,1.090637,0.974782,0.887393,0.841588,0.963173,1.400344,1.550762,1.371243,1.108555,1.059768,1.372646,1.366686,1.032676
1.164547,1.325709,1.37309,1.261741,0.953309,0.737225,0.919498,0.9978,1.197198,1.526028,1.41071,1.189833,1.165158,1.21609,1.108457,0.801399,0.648894,0.647763,0.625229,0.808001,1.161181,1.180026,0.962918,0.812641,0.952354,1.204313,1.02244,0.702828
1.007785,0.966225,1.07555,1.14271,0.876522,0.600595,0.708011,0.765455,0.795537,0.911305,0.848232,0.822393,0.863572,0.851499,0.768888,0.542396,0.432069,0.451081,0.495759,0.680619,0.904246,0.79989,0.586172,0.573189,0.718706,0.810331,0.626704,0.447932
0.710695,0.577977,0.708887,0.909285,0.775161,0.526744,0.509181,0.578513,0.508247,0.428366,0.472755,0.614169,0.673063,0.674331,0.581465,0.39018,0.341832,0.324669,0.403335,0.536317,0.649369,0.555954,0.40624,0.495051,0.552447,0.509551,0.446291,0.369049
0.455558,0.387413,0.488953,0.639081,0.597646,0.441653,0.36198,0.482951,0.42873,0.275808,0.314828,0.500141,0.569753,0.559797,0.516415,0.373897,0.296202,0.252885,0.339967,0.433124,0.505613,0.434473,0.321461,0.428791,0.48357,0.445117,0.389033,0.325914
0.39125,0.377792,0.43714,0.499891,0.469588,0.411468,0.377119,0.474174,0.397304,0.240466,0.267593,0.39542,0.448044,0.427978,0.420023,0.380174,0.291944,0.225971,0.285108,0.344296,0.399424,0.351589,0.283079,0.352388,0.414667,0.399487,0.313057,0.277553
0.470314,0.461099,0.448456,0.452542,0.495986,0.490951,0.475188,0.516138,0.401655,0.276445,0.270546,0.296785,0.30055,0.291275,0.309533,0.345031,0.275125,0.212923,0.264906,0.270768,0.263723,0.248684,0.251834,0.300588,0.382386,0.383173,0.263192,0.235377
0.636331,0.665372,0.568011,0.465789,0.595561,0.655285,0.625369,0.628883,0.477986,0.351973,0.333316,0.330896,0.292802,0.284353,0.326693,0.356622,0.269803,0.226028,0.264789,0.215291,0.173917,0.168545,0.235955,0.313351,0.393254,0.400857,0.285234,0.24601
0.820122,0.882325,0.746209,0.5832,0.718799,0.807512,0.760693,0.723109,0.572086,0.447323,0.429253,0.442656,0.38423,0.328581,0.382347,0.404355,0.294606,0.246925,0.234483,0.180238,0.160713,0.146656,0.225766,0.341455,0.446688,0.465324,0.350162,0.284339
0.888244,0.978022,0.852561,0.661811,0.737107,0.831739,0.774011,0.680467,0.568867,0.486817,0.47939,0.51389,0.445872,0.363522,0.402983,0.398115,0.286631,0.231724,0.168635,0.128893,0.140733,0.136017,0.196349,0.317819,0.444069,0.470965,0.383238,0.288603
0.760793,0.864933,0.785219,0.608093,0.601197,0.680634,0.620844,0.495404,0.442341,0.4244,0.430062,0.486539,0.422654,0.339499,0.349855,0.315737,0.227948,0.176992,0.104003,0.080451,0.0992,0.104811,0.141825,0.239665,0.352711,0.38018,0.342537,0.239578
0.492006,0.588857,0.557975,0.430088,0.374862,0.427017,0.377418,0.26829,0.263604,0.284908,0.29584,0.361967,0.314982,0.248939,0.240495,0.210296,0.158799,0.117273,0.078013,0.064206,0.061555,0.078713,0.113471,0.166463,0.215087,0.234728,0.24075,0.166931
0.231593,0.300008,0.295328,0.229075,0.182979,0.205218,0.176505,0.107968,0.132382,0.147438,0.15343,0.206382,0.183263,0.139479,0.140247,0.154187,0.134893,0.102202,0.093513,0.070164,0.048041,0.060827,0.105934,0.120792,0.106852,0.114766,0.136984,0.116696
