4e-06,9.6e-05,6.6e-05,9.4e-05,6.2e-05,0.000101,2e-06,-5.1e-05,-7.7e-05,-0.000161,-0.000187,-3.9e-05,-0.00025,-0.000485,-0.000517,-0.000356,-0.000276,-0.000311,-0.000514,-0.000656,-0.000324,-0.000579,0.000529,-0.000337,-0.000489,-3.4e-05,0.000458,0.000539,0.000345,0.000148,-0.00024,0.000836,0.001985,0.001383,0.000504,-0.000779,-2e-06,-4.9e-05,0.001204,0.001725,0.00131,0.00028,0.000947,9.4e-05,0.000478,0.000465,5.3e-05,-0.000133,-5.1e-05,0.000545,0.000653,0.000673,0.000341,0.00062,0.00063,0.000619,0.000475,-2.2e-05,0.000255,4.1e-05,0.000172,-0.000239,0.000185,0.000313,0.000359,0.000115,0.000244,0.000401,0.000534,0.000495,0.00019,8e-05,2.3e-05,0.000114,0.000124,5.6e-05,8.4e-05,0.000117,0.000106,0.000192,0.000147,4.4e-05,6.2e-05,7.7e-05,5.4e-05,9.5e-05,0.000147,0.000111,0.000171,0.000133,0.000153,0.000133,4.2e-05,8.6e-05,0.000156,1e-04,7.3e-05,9e-06,-2.3e-05,-3.5e-05,5.2e-05,0.000102,0.000152,0.000107,4.9e-05,7.8e-05,8.1e-05,6.2e-05,2.6e-05,0.000104,0.000113,6.9e-05,8.5e-05,4.8e-05,5.9e-05,7.1e-05,8.9e-05,9.1e-05,0.000113,1.5e-05,4.1e-05
-5.3e-05,-0.000101,-0.000113,-6.4e-05,-9.8e-05,-9.5e-05,-0.000159,-0.000206,-0.000211,7.2e-05,-2.8e-05,-4e-05,-0.000178,-0.000169,-0.00013,-0.000177,-0.000664,-0.000229,-0.000405,-6e-06,-0.000163,-6.4e-05,-0.000822,-0.000908,-0.000574,-0.001173,-2.3e-05,-4.8e-05,-0.000265,-0.000284,-0.000569,-0.000593,1e-04,0.000776,0.000677,0.000338,-0.000123,-0.00033,0.000318,0.000615,-0.000303,-0.000135,8e-05,-8.1e-05,-0.000417,-0.000232,-0.000304,-0.000113,0.000166,-0.000212,0.000284,0.000455,-0.000143,7.7e-05,0.000227,0.000291,7.5e-05,-4.7e-05,1.7e-05,-5.7e-05,-0.00043,-0.000151,0.000448,0.000342,0.000228,6.9e-05,6.4e-05,-4e-06,-1.6e-05,3.5e-05,-1.5e-05,-5.4e-05,8.2e-05,0.00014,-2e-06,-0.000146,-9.4e-05,-0.000191,-1.5e-05,-7e-05,9.4e-05,-4.3e-05,-5.9e-05,-4.8e-05,-8e-06,-4.6e-05,1.6e-05,-4e-05,-9e-06,-6.4e-05,-7e-05,-7.5e-05,-0.000116,-7.3e-05,-3e-06,-0.000114,-4.5e-05,-8.9e-05,-3.6e-05,-1.6e-05,-3.5e-05,-2.4e-05,-8.6e-05,-7.7e-05,-0.000121,-0.000112,-0.00012,-9.9e-05,-8.2e-05,-7.8e-05,-6.3e-05,-2.4e-05,-7.9e-05,-6.4e-05,-3.5e-05,-3.7e-05,-2.6e-05,-4e-05,-4.3e-05,-8.5e-05,-6.4e-05
-5e-05,1.5e-05,-7.4e-05,-4.7e-05,-1.1e-05,-6.9e-05,-5.1e-05,9e-05,6.3e-05,7.2e-05,-4.7e-05,0.000104,0.000204,0.000337,0.000231,0.00014,0.000208,0.000288,0.00025,0.000197,1.2e-05,0.000298,0.000589,0.000439,0.000865,-4.3e-05,-0.000178,-4.8e-05,0.00052,0.001243,0.001196,0.000988,9.1e-05,-0.000552,3.8e-05,0.000743,7.4e-05,0.000531,0.000722,0.00026,0.000304,0.000173,0.000228,0.000591,0.000583,0.000763,0.000569,0.000291,0.000191,0.000408,0.000606,-1e-06,0.000385,-5.3e-05,-0.000273,-0.000143,0.000342,0.000241,-1.9e-05,0.000239,0.000165,-4e-06,-2.5e-05,0.000192,-0.000122,5.4e-05,0.000237,4.7e-05,-0.000272,-0.000108,-9.2e-05,-7.2e-05,1e-05,-7.2e-05,-0.000139,-3.5e-05,-7.3e-05,-3.5e-05,-2.9e-05,-8.6e-05,-9e-06,2.1e-05,-4.3e-05,-5.1e-05,-2.3e-05,-4.8e-05,-6.5e-05,-1.1e-05,-4.6e-05,-3.5e-05,-1.7e-05,-6.7e-05,-2.8e-05,-8e-06,-6.6e-05,-9.6e-05,-3.6e-05,-4.3e-05,-7.3e-05,-5.6e-05,-7.2e-05,-6.8e-05,-0.000117,-6.4e-05,-0.000107,-0.000113,-6.4e-05,-3.8e-05,-6.4e-05,-9.1e-05,-3.4e-05,-5.1e-05,-7.8e-05,-0.000124,-6.8e-05,-9.8e-05,-6e-05,-0.000103,-7.5e-05,-4.3e-05,-9.2e-05
-1.9e-05,8e-06,-5.3e-05,-4e-05,-1.4e-05,-2.1e-05,-8e-06,1.8e-05,-6.6e-05,-7.9e-05,-7.9e-05,-0.000161,-0.000336,-0.000481,-0.000373,-0.000197,-0.000244,-0.000164,-1.3e-05,-0.000199,-0.000229,-0.000236,0.000236,-0.000575,-0.00076,-0.000188,-0.000145,-0.000143,-0.000362,0.000138,-0.000182,-0.000513,-0.001159,-0.00137,-0.000294,-0.000562,-4e-06,-6e-04,-0.000328,-0.000124,-0.000536,-0.000824,3.5e-05,-0.000212,0.000617,-0.000234,6.6e-05,-5.4e-05,-5e-05,-0.000268,-6.3e-05,-0.000287,-0.000225,-0.000441,-0.000584,-1.2e-05,-0.000191,-0.000306,-0.000241,-0.000157,-0.000109,9.9e-05,0.000171,-9.2e-05,-0.00015,6.2e-05,-8.2e-05,-8.8e-05,-6.9e-05,-0.000191,-0.00013,-0.000115,3.5e-05,-7e-06,-3.1e-05,-0.00013,-7e-05,-4.3e-05,-0.000144,-6e-05,4.1e-05,3.9e-05,-7e-06,-2.8e-05,-3.2e-05,-3.1e-05,-8.1e-05,-0.00011,-5.1e-05,2.9e-05,5.6e-05,7e-06,-2.4e-05,-4.4e-05,-3e-05,-4.9e-05,-9e-06,-4.5e-05,-4.8e-05,-3.6e-05,-5.5e-05,-4.9e-05,-6.1e-05,-1.1e-05,-2.7e-05,-1.3e-05,5e-06,-1.4e-05,-3e-05,-2.3e-05,-2.6e-05,-2.1e-05,-1e-06,2.1e-05,-1.1e-05,-6.4e-05,-3.9e-05,-8.4e-05,-2.9e-05,-3.4e-05,2e-05
8.3e-05,4.5e-05,9.4e-05,0.000102,6e-05,8.7e-05,8.1e-05,2.2e-05,5.1e-05,3.2e-05,0.000142,0.000176,0.000181,0.000221,0.000246,5.5e-05,5.7e-05,-0.000154,0.000122,0.000248,0.000144,0.000266,-0.000413,-0.000523,-8e-06,-0.000185,-0.000187,-0.000895,0.000142,-0.000262,7.9e-05,-0.000347,-0.000908,-0.000772,-0.000232,3.3e-05,-1.5e-05,0.000196,-3.5e-05,-0.000154,-0.000745,-0.00064,-0.000188,-0.000406,6.6e-05,-0.000501,-0.000166,-0.000181,-0.000129,-0.000488,0.000131,-0.00045,-5.2e-05,-0.000188,-0.000333,0.000161,-0.000294,-2e-06,-2.5e-05,-0.000109,-0.000178,6.9e-05,-0.000149,-0.000302,-0.000109,-9.2e-05,1.1e-05,-3.6e-05,-4.6e-05,-0.00026,-0.000103,-1.9e-05,7.7e-05,-5.5e-05,2e-05,4.1e-05,4.8e-05,0.000126,8.5e-05,7e-06,7.7e-05,4.2e-05,8.6e-05,7.2e-05,3.8e-05,1e-06,3.2e-05,9.8e-05,0.000122,0.000156,0.000126,0.000113,9.1e-05,5.8e-05,7.1e-05,4.3e-05,7.5e-05,4.9e-05,9.4e-05,7.6e-05,8.5e-05,9e-05,4.7e-05,8.2e-05,9e-05,8.2e-05,9.2e-05,8.8e-05,6.5e-05,6.3e-05,8.1e-05,9.1e-05,8.1e-05,9.7e-05,0.000115,6.1e-05,8.5e-05,6.2e-05,9.4e-05,0.000108,9.5e-05
2.2e-05,3e-06,0,2.4e-05,1.4e-05,5.8e-05,6e-06,-5e-06,6.3e-05,4.1e-05,-6.9e-05,-1e-06,1.7e-05,5.7e-05,2.3e-05,-0.000214,0.000137,0.000493,-0.000204,-0.000173,8.1e-05,-0.000216,0.000261,0.00058,0.000364,0.000301,0.000106,-5.4e-05,3e-05,0.000222,0.000264,-2e-06,-0.000486,-0.000692,-0.000736,-0.000282,0.000302,0.000145,0.000364,-0.000564,-0.000513,0.000263,2.4e-05,-0.000182,-3.3e-05,0.000197,0.000165,6.7e-05,0.000167,-1.1e-05,0.000273,-5.6e-05,0.000141,-0.000181,-0.000232,0.00013,-0.000234,0.000176,-0.000174,-3.8e-05,8.8e-05,2.3e-05,4.2e-05,-0.000168,-0.000102,-9e-06,-3.6e-05,-0.000116,-0.000237,-0.00014,-0.000102,1.3e-05,-4.3e-05,1.2e-05,-4.2e-05,-4.8e-05,0.000122,3.1e-05,6e-06,-6.3e-05,-1.4e-05,-1.3e-05,2.7e-05,7.1e-05,-4e-06,-1e-06,1.1e-05,5.2e-05,2.6e-05,-5e-06,-1e-05,4e-05,4.7e-05,3.7e-05,-2e-05,3.8e-05,1.7e-05,2e-05,-9e-06,1.3e-05,-2.5e-05,4e-05,1.8e-05,4.1e-05,3.1e-05,1.1e-05,3.4e-05,2.8e-05,2.5e-05,1e-06,1.9e-05,2.3e-05,9e-06,1.8e-05,3.1e-05,6e-06,1.4e-05,9e-06,1.9e-05,4.1e-05,-1.6e-05
-1.5e-05,-1.5e-05,-4e-05,-2.2e-05,-5.5e-05,-2.6e-05,-3.3e-05,-9.1e-05,-0.000101,-4.8e-05,1.5e-05,-3.5e-05,0.00011,-6.7e-05,-7.4e-05,6.2e-05,6e-05,-0.000358,3.5e-05,-0.000152,-0.000171,2.5e-05,-9.9e-05,-0.00023,-0.000383,-0.000144,0.00026,4.3e-05,-0.000282,-0.000267,-8.7e-05,-4.3e-05,-0.000572,-0.000398,0.00012,7.9e-05,1.4e-05,-0.000212,-6.6e-05,-0.000494,-0.000267,-0.000103,-8.5e-05,-0.000252,0.000172,-9.8e-05,2.5e-05,4.2e-05,-2.8e-05,-5.1e-05,-0.000178,-4.5e-05,0.000186,4.8e-05,-5.2e-05,-1e-05,-8.2e-05,4e-05,9.7e-05,4.9e-05,-0.00012,6e-06,-0.000107,-0.000114,-0.000243,-0.000266,-8.3e-05,-0.000218,-0.00018,-7.9e-05,-0.000137,-0.000104,-3.7e-05,-6.8e-05,-2.6e-05,-6.7e-05,-8.4e-05,-6e-05,-2.2e-05,-8.4e-05,-8.5e-05,-7.4e-05,-4.6e-05,-3.5e-05,-4.2e-05,-9e-06,-5e-05,-1.8e-05,-2.2e-05,-2.7e-05,-7.7e-05,-4.2e-05,-1.9e-05,-5.6e-05,-4.4e-05,-9e-06,-5.8e-05,-1.6e-05,-1.9e-05,-1.5e-05,-3e-06,-3.3e-05,-3.3e-05,-2.7e-05,-4.6e-05,-5.7e-05,-4.7e-05,-5.6e-05,-9e-06,-2.7e-05,-5.2e-05,-1e-05,-3e-06,-2.2e-05,-1.7e-05,-3.5e-05,-4.7e-05,-3.8e-05,-2.9e-05,-3.5e-05,-3.6e-05
-3e-05,-1.1e-05,1.7e-05,-3.1e-05,-4e-05,-5e-06,-1.3e-05,1e-06,-1.1e-05,3.3e-05,-4.5e-05,6e-06,-3e-06,2.5e-05,2e-05,1.6e-05,-1e-06,-1.1e-05,1.1e-05,4.6e-05,8.5e-05,0.000177,-1.8e-05,-0.000212,-0.000337,-0.000132,0.000296,0.000223,-0.000329,-0.000145,0.000281,-0.000107,0.000314,-0.00012,-6.6e-05,-0.000434,-0.000114,-0.000302,0.000188,-0.000205,-0.000242,0.000128,-0.000417,-0.000357,-0.00028,-0.000434,-0.000241,-0.000273,-1.7e-05,3e-05,-0.000105,-0.000287,0.000103,-3.5e-05,-8.3e-05,-0.000265,-4.6e-05,3.6e-05,7e-05,-5.2e-05,-8.9e-05,3.9e-05,4e-05,-6e-05,-0.000176,-0.000105,-9.5e-05,-6.8e-05,-5.2e-05,2.8e-05,-3.7e-05,5.2e-05,-1e-05,-9e-06,-1.9e-05,-3.7e-05,-3.7e-05,-2.6e-05,-1e-06,-1.3e-05,-5.2e-05,-4.7e-05,-1.9e-05,3e-06,-1.1e-05,5e-06,-4.8e-05,-5.2e-05,0,-2.7e-05,-6.6e-05,-1.3e-05,-3e-05,-1.5e-05,-2.9e-05,-9e-06,-2.8e-05,-1e-05,-2.7e-05,-5e-06,-1.4e-05,-8e-06,-1.8e-05,-6.3e-05,-1.8e-05,-2.5e-05,-4.2e-05,-6e-06,-1.1e-05,-2.1e-05,-4.9e-05,-3e-06,-2.5e-05,-3.2e-05,-2.1e-05,-2.2e-05,-2.5e-05,-5e-06,-2.9e-05,-2.9e-05,-1.2e-05
-1e-05,0,5e-06,-2.9e-05,-2.7e-05,6e-06,-2.5e-05,-1.8e-05,1.9e-05,5.9e-05,-3.2e-05,-7.3e-05,-5.4e-05,-7.6e-05,-3.3e-05,-8.6e-05,-7e-05,-1.2e-05,-0.000172,-1.4e-05,-0.000169,-0.000109,-8.1e-05,0.000122,0.000134,0.000215,-0.000183,-0.000124,2e-05,-0.000166,0.000281,-0.000105,-0.000487,3.5e-05,-9.8e-05,-0.000148,0.000145,0.00015,-7.8e-05,-0.000111,-0.000125,0.000188,-8e-05,-5.1e-05,-0.000137,-0.000289,-6e-06,1.4e-05,0.000122,-5.6e-05,-0.000181,-1e-05,-4.5e-05,-7.9e-05,5.5e-05,-0.000191,-9.5e-05,-1.8e-05,-5.1e-05,-3.6e-05,-4.4e-05,3.2e-05,8.4e-05,-7e-06,-0.000101,2.6e-05,-5.3e-05,-1.8e-05,-4.9e-05,-2.1e-05,2.1e-05,-8e-06,-2e-05,-5.7e-05,-1.2e-05,3.8e-05,-3.4e-05,-5.7e-05,-2.8e-05,-6e-06,-3.3e-05,-3e-05,-1.9e-05,-1.4e-05,3.4e-05,0,-5.4e-05,-4.3e-05,-3.7e-05,-1.2e-05,-3.3e-05,2.4e-05,0,-1.3e-05,-2.9e-05,-2e-06,4e-06,3e-06,-1e-06,-1.2e-05,-1.4e-05,-2.7e-05,-9e-06,-3.3e-05,-1.1e-05,-6e-06,-8e-06,7e-06,-1.2e-05,-1.2e-05,-1.7e-05,-1.4e-05,6e-06,-1.8e-05,-1.1e-05,-2.3e-05,-3.6e-05,-4e-06,-4.9e-05,-2.4e-05,-8e-06
-2e-06,4.2e-05,0,1.8e-05,2.4e-05,1.1e-05,2.4e-05,1.4e-05,4.6e-05,-5.5e-05,7e-06,8.3e-05,3.4e-05,1e-04,1.9e-05,0.000184,4.9e-05,5e-05,0.000116,7.7e-05,3.9e-05,-3.7e-05,-0.000122,1.9e-05,-0.000105,6e-06,-0.000296,-6.7e-05,-0.000281,-0.000326,-3e-05,-6.1e-05,-9.8e-05,0.000109,6.4e-05,-0.000128,-0.00025,-0.000177,-0.00018,6.6e-05,-6e-05,0.000218,0.000162,6.9e-05,8.6e-05,0.000146,0.000106,7e-06,4.9e-05,-3.3e-05,-0.000498,-0.000168,-0.000263,4.1e-05,1e-06,-0.000157,-8.2e-05,0,-5.3e-05,-2.5e-05,-4e-06,2.5e-05,-0.000102,-1.3e-05,-4.9e-05,-7e-06,-0.000112,-8e-05,-8e-05,-4.5e-05,0.000143,3.6e-05,1e-05,4e-06,1.3e-05,7.3e-05,-2e-06,5e-06,3e-06,5.1e-05,-4e-06,1.7e-05,6e-06,-1e-06,4.2e-05,1.9e-05,3.4e-05,-5e-06,2.7e-05,3.2e-05,2.5e-05,4e-05,1.5e-05,2e-05,1.3e-05,2.8e-05,1.4e-05,2.3e-05,2.2e-05,2.4e-05,4e-05,2.8e-05,2.7e-05,3.9e-05,2.5e-05,3.3e-05,2.6e-05,2.9e-05,2.7e-05,1.7e-05,9e-06,2.7e-05,2.3e-05,2.2e-05,1.3e-05,2.6e-05,1.9e-05,2.4e-05,3.3e-05,2.7e-05,3e-05
4e-06,-6e-06,7e-06,-9e-06,6e-06,-2e-06,-8e-06,-7e-06,-5e-06,1.6e-05,-1.2e-05,-2.8e-05,9e-06,-2.4e-05,-8e-06,-7.9e-05,-6e-05,7.3e-05,1.5e-05,-1e-04,4.3e-05,-2.9e-05,2.7e-05,-0.000107,0.000308,8.1e-05,0.000207,2.5e-05,1e-04,1.7e-05,6.9e-05,-7e-06,0.000291,6.5e-05,-9.8e-05,-0.000127,2.5e-05,-2.8e-05,-0.000117,-6.9e-05,0.000121,4e-05,9.4e-05,-7.2e-05,-0.000141,-5.8e-05,-4.6e-05,-0.00014,5.8e-05,5.2e-05,2.6e-05,-0.00018,-0.000231,-0.000141,-4.3e-05,-1.5e-05,-0.000136,-6.7e-05,-0.000171,4.7e-05,-1.7e-05,9e-06,1.5e-05,2.9e-05,7e-06,5e-06,-3.6e-05,-2.4e-05,1e-05,2.4e-05,9.2e-05,2.4e-05,-1.7e-05,8e-06,0,2.2e-05,-1.7e-05,3.4e-05,-4e-06,1.9e-05,8e-06,-6e-06,-8e-06,-7e-06,7e-06,3e-06,6e-06,-1.8e-05,1.7e-05,-6e-06,-2.3e-05,5e-06,9e-06,6e-06,4e-06,-4e-06,2.4e-05,1.2e-05,1.4e-05,-3e-06,6e-06,-1.7e-05,3e-06,-9e-06,4e-06,1.4e-05,2e-06,2e-06,1.1e-05,5e-06,-2e-06,-4e-06,1e-05,-1.3e-05,5e-06,2.4e-05,4e-06,-1e-06,-2e-06,-1e-05,0
-6e-06,-2.2e-05,-3e-06,-1.1e-05,-6e-06,-1.6e-05,-7e-06,-2e-06,-5e-06,-1.8e-05,1e-05,1e-05,2.1e-05,1.5e-05,3e-06,-2.1e-05,-5e-05,-1.9e-05,-0.000148,5.8e-05,-3.1e-05,-5.9e-05,-0.000168,6.2e-05,6e-05,-2.7e-05,1e-05,-0.000138,9.5e-05,2.9e-05,7.4e-05,-5.8e-05,-0.000337,-0.000148,1.5e-05,0.000115,-5.1e-05,-7e-05,2e-06,-8.6e-05,1.4e-05,7.4e-05,0.000221,-6.1e-05,-7.3e-05,-7.9e-05,-6e-05,1.1e-05,-2.8e-05,3e-06,2.1e-05,2.5e-05,-0.000105,-0.000126,5e-05,5.7e-05,3e-06,-5.5e-05,-9.9e-05,-5.8e-05,5e-05,-3.5e-05,-3.3e-05,-3.2e-05,3.7e-05,1.3e-05,5e-06,2.8e-05,-1.4e-05,2.6e-05,4e-06,1.2e-05,1.2e-05,-2.4e-05,1.5e-05,-6e-06,-3e-05,-3e-05,4e-06,-3.8e-05,1.2e-05,-1.5e-05,-1.1e-05,-5e-06,-2e-06,-1.2e-05,-1.1e-05,-2.4e-05,-1.2e-05,0,-1e-06,-1.4e-05,-1.7e-05,-4e-06,-1.8e-05,-5e-06,9e-06,-1.1e-05,7e-06,0,-3e-06,2e-06,-3e-06,-1e-06,-1e-06,-6e-06,-9e-06,-6e-06,-1.1e-05,-4e-06,-4e-06,-1.1e-05,-4e-06,0,-8e-06,-8e-06,-2e-06,-9e-06,-8e-06,-7e-06,-2.2e-05
-6e-06,-6e-06,-7e-06,8e-06,-1.2e-05,-1.6e-05,0,5e-06,6e-06,1.4e-05,8e-06,-4.6e-05,-2.6e-05,-3e-06,5e-06,2.1e-05,2.6e-05,2.6e-05,1e-04,-1.2e-05,-3.4e-05,9.6e-05,7.3e-05,-2.1e-05,-1.8e-05,-4.6e-05,-0.000131,-2e-05,0.000152,-5.3e-05,-0.000117,-0.000147,2.6e-05,0.000117,6.2e-05,5.2e-05,-9.6e-05,-3.5e-05,4e-06,-8.3e-05,-9e-06,3.9e-05,8.5e-05,8.4e-05,-4.6e-05,-4e-06,1.5e-05,4.9e-05,-1.1e-05,-2e-05,8.2e-05,-1e-06,-6e-05,-0.000129,-3.2e-05,5.1e-05,2.1e-05,-3.1e-05,-3.7e-05,-4.9e-05,6.4e-05,6e-06,-4.1e-05,-4.1e-05,4.4e-05,-5.9e-05,5.2e-05,-2e-05,2e-05,-1e-06,-2.7e-05,-2.4e-05,2.2e-05,0,6e-06,-1.7e-05,8e-06,-1.4e-05,-3e-06,-1e-06,1.4e-05,3e-06,-3e-06,-6e-06,-8e-06,-8e-06,9e-06,-8e-06,-1.3e-05,3e-06,-1e-05,-1.1e-05,-4e-06,-1.1e-05,-4e-06,-4e-06,2e-06,-3e-06,-5e-06,0,-8e-06,2e-06,-2e-06,7e-06,-1.2e-05,-1e-06,3e-06,-1.3e-05,-1e-06,-3e-06,1e-06,-1.1e-05,-1e-06,-5e-06,-2e-06,-5e-06,3e-06,-7e-06,3e-06,1e-06,-1.3e-05
0,-3e-06,0,7e-06,-7e-06,-6e-06,4e-06,6e-06,1.1e-05,3e-06,-2.4e-05,2.3e-05,-2e-05,-4e-06,-1.5e-05,-2.7e-05,-6.1e-05,-3.5e-05,6e-06,-5.3e-05,-3e-06,-3e-05,2e-05,0.000102,-4e-05,-8.2e-05,0.000121,4.2e-05,-6.1e-05,-0.000106,-8e-05,-6.6e-05,4.6e-05,-1.4e-05,-6e-06,5.5e-05,-5.4e-05,4e-06,-6e-05,-7.9e-05,-4e-06,8.8e-05,-0.000109,-4.9e-05,-1e-05,1.9e-05,1e-05,4e-05,-4.9e-05,-7e-06,-6.8e-05,-3e-05,-5.1e-05,-1.8e-05,-1.9e-05,9.2e-05,5.8e-05,6e-06,-2.1e-05,7.2e-05,-2e-06,-2.8e-05,4.2e-05,1.9e-05,1.2e-05,2.4e-05,5e-06,-4e-06,2.5e-05,-2e-06,-3e-06,1e-05,1.4e-05,-1e-06,-6e-06,-8e-06,1e-05,-1e-05,0,-8e-06,7e-06,4e-06,-7e-06,1e-06,8e-06,-4e-06,4e-06,-1.8e-05,-8e-06,-1e-05,-1e-06,-1.3e-05,7e-06,-2e-06,0,-5e-06,-7e-06,1e-06,-2e-06,0,0,-2e-06,-1e-06,2e-06,-7e-06,1e-06,3e-06,-4e-06,1e-06,-2e-06,-1e-06,-8e-06,0,-2e-06,-2e-06,4e-06,1e-06,-9e-06,8e-06,-1.1e-05,-4e-06
-1e-06,6e-06,7e-06,-6e-06,2e-06,1e-06,-3e-06,-5e-06,4e-06,-1.2e-05,1e-06,-1.3e-05,1.4e-05,1e-05,7e-06,3.3e-05,4.3e-05,-3.2e-05,-2e-05,2.5e-05,1.6e-05,-8e-06,3e-05,-8.3e-05,8.4e-05,-1.1e-05,-0.000106,2.3e-05,-3.4e-05,3.6e-05,-0.000124,-1.2e-05,-4.3e-05,-2.7e-05,1.1e-05,1.2e-05,-5.5e-05,-6.2e-05,2.7e-05,-2e-05,-3.3e-05,-7e-06,-8.3e-05,3.4e-05,4.9e-05,3.2e-05,-1.3e-05,2e-05,5e-06,-2.2e-05,5.2e-05,7.2e-05,-2.2e-05,1.2e-05,2.7e-05,4.2e-05,1e-05,-7e-06,-6e-06,-5e-05,-7e-06,-2.2e-05,-7e-06,-7e-06,-2.6e-05,7e-06,5e-06,1.2e-05,-3.7e-05,-4e-06,1.6e-05,1.3e-05,2e-06,1.8e-05,1.5e-05,1e-06,2.4e-05,-8e-06,-3e-06,1e-05,3e-06,4e-06,4e-06,2e-06,1.3e-05,0,-8e-06,1e-05,-8e-06,5e-06,-5e-06,-3e-06,6e-06,-2e-06,1e-06,-4e-06,-3e-06,-2e-06,-2e-06,-2e-06,1e-06,3e-06,-2e-06,4e-06,6e-06,-2e-06,4e-06,0,2e-06,2e-06,-3e-06,-6e-06,0,3e-06,-1e-06,3e-06,4e-06,-2e-06,-4e-06,8e-06,-4e-06
-2e-06,3e-06,-2e-06,1e-06,0,1e-06,-1e-06,-2e-06,-1e-06,-7e-06,-3e-06,-4e-06,-2e-06,-4e-06,-4e-06,2.4e-05,8e-06,-1.9e-05,2.4e-05,1.8e-05,1e-06,-1.1e-05,2.7e-05,4.9e-05,-4.2e-05,2e-05,2.3e-05,-4.5e-05,-1.6e-05,-9e-06,-1.9e-05,-3.5e-05,-3.9e-05,-6e-06,1.1e-05,-4e-05,6.3e-05,-2e-05,-1.6e-05,2.8e-05,2.7e-05,1e-06,-5.2e-05,-1e-05,1e-06,-3.6e-05,-1.5e-05,-2.9e-05,-2.9e-05,-6e-06,1.6e-05,-4.1e-05,6e-06,4.3e-05,-1e-05,-1.7e-05,1.4e-05,-1.3e-05,-1e-05,1.6e-05,-1.1e-05,-1.5e-05,-1.1e-05,-8e-06,-3e-06,7e-06,-1.4e-05,5e-06,2.1e-05,0,1.8e-05,-1e-06,2e-06,1e-06,0,5e-06,0,-7e-06,4e-06,1e-06,-4e-06,-3e-06,-4e-06,0,1.2e-05,-1e-06,-6e-06,0,-8e-06,2e-06,-6e-06,-7e-06,-1e-06,-1e-06,0,-3e-06,-6e-06,0,-4e-06,1e-06,2e-06,7e-06,-1e-06,-5e-06,-4e-06,-1e-06,1e-06,-1e-06,-1e-06,0,-2e-06,-1e-06,-2e-06,-1e-06,-1e-06,1e-06,3e-06,-2e-06,-1e-06,2e-06,2e-06
-1e-06,-2e-06,-2e-06,1e-06,3e-06,0,0,-4e-06,5e-06,-9e-06,-7e-06,-2e-06,-8e-06,2e-06,-3e-06,-3e-05,1e-05,1.8e-05,-2.8e-05,-1.9e-05,-1e-06,-4e-06,-3.5e-05,-1.4e-05,2e-06,-2e-05,9.6e-05,-2.4e-05,-5.2e-05,3e-05,-3.8e-05,-2.6e-05,3.4e-05,5.1e-05,-4e-06,-2e-06,-6e-06,8e-06,2.7e-05,1.6e-05,2e-06,2.3e-05,-1.1e-05,-5.1e-05,2.9e-05,-1.4e-05,6e-06,-1e-06,-1.7e-05,-2e-06,-2.3e-05,8e-06,8e-06,-2.1e-05,9e-06,-2.5e-05,-2.3e-05,-1e-06,-4e-06,-1.8e-05,6e-06,-1.1e-05,-4e-06,1e-06,-1.8e-05,5e-06,-3e-06,-5e-06,-2e-06,1e-06,1.6e-05,7e-06,-7e-06,-6e-06,-1e-06,9e-06,3e-06,0,-3e-06,8e-06,-7e-06,0,-3e-06,3e-06,8e-06,-1e-06,-1e-06,-2e-06,3e-06,-4e-06,-4e-06,0,3e-06,0,3e-06,-3e-06,1e-06,0,-1e-06,1e-06,1e-06,-1e-06,1e-06,-3e-06,-1e-06,4e-06,0,2e-06,1e-06,0,0,3e-06,1e-06,-2e-06,1e-06,4e-06,0,0,-1e-06,4e-06,3e-06
0,-1e-06,4e-06,-1e-06,3e-06,2e-06,-2e-06,0,-2e-06,7e-06,2e-06,1.5e-05,-6e-06,-2e-06,2e-06,1.9e-05,4e-06,8e-06,-2.3e-05,8e-06,-2e-06,1.1e-05,1.3e-05,2e-05,1.2e-05,-9e-06,-3.7e-05,1.1e-05,-2.1e-05,0,1e-06,3e-06,-3.6e-05,-1.5e-05,2.6e-05,2e-05,2.5e-05,-1.7e-05,-1.1e-05,-1.6e-05,5e-06,1e-06,5e-06,-3e-06,-7e-06,2e-06,1e-06,-1.9e-05,-2.3e-05,7e-06,-4.5e-05,-2.1e-05,3.2e-05,0,-7e-06,-3.2e-05,1e-05,8e-06,9e-06,4e-06,-8e-06,-6e-06,0,8e-06,2e-06,-2e-05,3e-06,6e-06,-1.1e-05,2e-06,9e-06,6e-06,-5e-06,3e-06,7e-06,5e-06,-3e-06,1e-06,0,-6e-06,-1e-06,-2e-06,0,2e-06,0,-1e-06,2e-06,-1e-06,-2e-06,2e-06,0,0,3e-06,2e-06,-2e-06,-1e-06,3e-06,2e-06,0,0,0,-2e-06,0,3e-06,5e-06,0,0,3e-06,-1e-06,1e-06,0,1e-06,-1e-06,-1e-06,1e-06,2e-06,-1e-06,-1e-06,-3e-06,1e-06,0
-1e-06,-3e-06,-1e-06,-2e-06,1e-06,2e-06,1e-06,4e-06,-4e-06,5e-06,-2e-06,-5e-06,5e-06,6e-06,-3e-06,-7e-06,1.3e-05,6e-06,2.5e-05,4e-06,-1e-06,6e-06,-1.6e-05,-3.4e-05,7.6e-05,-2e-06,-3.3e-05,8e-06,3.3e-05,-7e-06,-1.5e-05,-8e-06,-4.2e-05,-1.2e-05,-1e-06,-1.3e-05,3.7e-05,-2.2e-05,4e-06,-2.3e-05,1e-06,-1.7e-05,2.1e-05,-1.3e-05,-1.8e-05,1e-06,-4e-06,-1.1e-05,-2e-06,-3e-06,-3.3e-05,-8e-06,1.1e-05,-2e-06,7e-06,-1.8e-05,3e-06,3e-06,5e-06,1.4e-05,2e-06,1e-06,8e-06,-2e-06,1e-06,1e-06,-2e-06,-2e-06,3e-06,-2e-06,-3e-06,3e-06,2e-06,-4e-06,-1e-06,-8e-06,-6e-06,2e-06,1e-06,1e-06,3e-06,-4e-06,0,0,-6e-06,0,-1e-06,4e-06,2e-06,2e-06,-1e-06,0,-2e-06,2e-06,-1e-06,-2e-06,4e-06,-1e-06,-1e-06,0,2e-06,3e-06,1e-06,-3e-06,1e-06,1e-06,-1e-06,1e-06,0,1e-06,-1e-06,2e-06,0,-1e-06,1e-06,4e-06,2e-06,-1e-06,1e-06,3e-06,0
0,-3e-06,-2e-06,0,-3e-06,0,-2e-06,3e-06,-2e-06,0,-3e-06,-3e-06,5e-06,-3e-06,-1e-06,-1e-05,-2e-06,3e-06,-8e-06,-3e-06,-7e-06,-4e-06,1e-05,1.7e-05,-1.1e-05,-5e-06,2.5e-05,8e-06,3.8e-05,-1e-05,-3e-06,-1e-06,7.7e-05,3e-06,-1.2e-05,3e-06,-2.9e-05,-2e-05,-7e-06,-2e-05,7e-06,-2.5e-05,3.4e-05,5e-06,-9e-06,-1.9e-05,-5e-06,1.6e-05,1.8e-05,-7e-06,-2e-06,1.3e-05,-1.5e-05,1e-06,1.5e-05,-3e-06,1e-05,-2e-06,-4e-06,-7e-06,8e-06,5e-06,-5e-06,-7e-06,9e-06,-1e-05,-3e-06,-8e-06,1e-06,-4e-06,-1.3e-05,-4e-06,2e-06,3e-06,1e-06,-3e-06,-6e-06,1e-06,1e-06,-4e-06,4e-06,-2e-06,-1e-06,-1e-06,-3e-06,-1e-06,-3e-06,-7e-06,1e-06,-3e-06,-1e-06,-1e-06,-2e-06,-2e-06,-1e-06,-2e-06,0,-1e-06,-1e-06,-1e-06,-3e-06,-3e-06,-1e-06,-1e-06,-2e-06,0,-3e-06,-2e-06,-2e-06,-1e-06,0,1e-06,-1e-06,-3e-06,0,-1e-06,-1e-06,-2e-06,-1e-06,-3e-06,-2e-06
-1e-06,0,2e-06,0,-2e-06,0,0,-1e-06,2e-06,-2e-06,2e-06,-2e-06,-6e-06,-2e-06,2e-06,1.7e-05,0,-7e-06,3e-06,-1e-05,8e-06,-1e-05,-6e-06,-3e-06,-2e-05,6e-06,2.2e-05,-2e-05,5e-06,-1.8e-05,1.8e-05,-1.7e-05,-6.1e-05,1.3e-05,2e-05,1.2e-05,2.2e-05,1e-06,-6e-06,-6e-06,2e-06,-1e-06,-7e-06,0,-1.5e-05,-2e-06,4e-06,0,-1.4e-05,-1e-06,1.4e-05,-2.2e-05,-2.2e-05,-3e-06,-9e-06,1.6e-05,-1.5e-05,0,-9e-06,-4e-06,1e-05,6e-06,8e-06,-8e-06,8e-06,5e-06,1e-06,3e-06,-6e-06,2e-06,-9e-06,7e-06,3e-06,-4e-06,2e-06,-4e-06,-5e-06,-4e-06,-1e-06,-1e-06,4e-06,2e-06,-1e-06,0,1e-06,0,2e-06,-5e-06,0,1e-06,2e-06,1e-06,-2e-06,0,-2e-06,1e-06,-1e-06,0,-2e-06,0,0,0,0,3e-06,0,-1e-06,0,0,-1e-06,0,0,1e-06,-1e-06,0,0,-1e-06,-1e-06,-1e-06,-1e-06,-2e-06,-1e-06
0,1e-06,0,1e-06,-1e-06,0,0,-1e-06,0,-4e-06,-3e-06,7e-06,1e-06,1e-06,-2e-06,-1e-06,-1e-06,-6e-06,1.5e-05,6e-06,-5e-06,2e-06,-2e-06,4e-06,-1.3e-05,5e-06,-2.6e-05,-7e-06,7e-06,-1e-06,2.1e-05,1e-06,-1e-05,1.4e-05,-9e-06,1e-05,-1.9e-05,-1e-05,9e-06,2e-06,-1e-06,-1.6e-05,-2.9e-05,-7e-06,3e-06,1.5e-05,3e-06,0,4e-06,3e-06,1.2e-05,-3e-06,-1.3e-05,-4e-06,1e-05,2.2e-05,-1e-06,1e-06,-1e-05,-4e-06,4e-06,7e-06,-9e-06,4e-06,-8e-06,8e-06,4e-06,5e-06,0,0,2e-06,-1e-06,3e-06,3e-06,0,3e-06,3e-06,-1e-06,1e-06,5e-06,2e-06,3e-06,0,-2e-06,3e-06,1e-06,1e-06,-3e-06,-2e-06,0,-2e-06,2e-06,-1e-06,-1e-06,0,0,-2e-06,0,-1e-06,-1e-06,0,0,0,1e-06,1e-06,0,1e-06,0,0,0,-1e-06,0,0,0,-1e-06,2e-06,2e-06,0,3e-06,-1e-06,1e-06
-1e-06,1e-06,-1e-06,0,0,0,1e-06,-2e-06,-3e-06,2e-06,-2e-06,-5e-06,1e-06,1e-06,2e-06,-3e-06,-8e-06,-1e-05,-2.1e-05,2e-06,-3e-06,0,6e-06,-1.5e-05,1.5e-05,1.3e-05,1e-05,3e-06,-9e-06,-1.9e-05,2e-05,-1e-05,1.6e-05,-1.6e-05,3e-06,6e-06,0,-1.9e-05,-8e-06,2e-06,4e-06,-2.2e-05,-1.9e-05,-1.2e-05,6e-06,3e-06,-5e-06,-2e-06,1e-06,1e-06,-1e-06,8e-06,-2e-05,-7e-06,7e-06,1.9e-05,-1e-06,-1e-06,-1e-05,9e-06,0,5e-06,-5e-06,4e-06,3e-06,-3e-06,6e-06,-3e-06,4e-06,-1e-06,8e-06,1e-06,-1e-06,1e-06,1e-06,1e-06,0,-1e-06,0,-1e-06,-2e-06,2e-06,0,0,0,0,-3e-06,1e-06,2e-06,-1e-06,-1e-06,1e-06,-1e-06,1e-06,1e-06,1e-06,-2e-06,0,-1e-06,0,1e-06,1e-06,0,0,-1e-06,0,0,0,0,0,-1e-06,0,0,0,0,1e-06,0,0,0,-1e-06,0
0,0,1e-06,1e-06,1e-06,0,0,0,0,2e-06,0,1e-06,6e-06,1e-06,1e-06,9e-06,-1e-06,7e-06,0,-2e-06,-2e-06,8e-06,-1.1e-05,1.2e-05,-6e-06,2e-06,0,2e-06,-1.7e-05,1.1e-05,1.5e-05,2e-06,-9e-06,0,1.2e-05,-4e-06,-1e-06,-1e-06,0,0,-1e-06,-1.7e-05,-1.3e-05,-2e-06,3e-06,-1.2e-05,0,2e-06,4e-06,-1e-06,-3e-06,-1.1e-05,-1.9e-05,-9e-06,-5e-06,1e-05,1.5e-05,-3e-06,-5e-06,-3e-06,1e-06,4e-06,1.1e-05,1e-06,-7e-06,1e-06,-2e-06,0,-5e-06,0,2e-06,2e-06,-1e-06,-1e-06,0,2e-06,2e-06,-2e-06,0,2e-06,-3e-06,0,-1e-06,-1e-06,-1e-06,0,-3e-06,-4e-06,-1e-06,1e-06,-2e-06,2e-06,0,-1e-06,-1e-06,0,-1e-06,0,-1e-06,0,-1e-06,-1e-06,0,-1e-06,0,0,1e-06,1e-06,-1e-06,0,0,-1e-06,0,1e-06,0,0,-1e-06,0,-2e-06,0,0
-1e-06,-1e-06,0,0,1e-06,0,0,0,-1e-06,3e-06,-2e-06,-2e-06,-3e-06,-2e-06,0,-1.2e-05,-5e-06,3e-06,6e-06,-1e-06,2e-06,-3e-06,1.4e-05,2e-06,-1e-06,7e-06,-2.3e-05,0,-2.5e-05,7e-06,4e-06,-8e-06,-1.4e-05,1.6e-05,-1.2e-05,-6e-06,-1.8e-05,-4e-06,-3e-06,-6e-06,4e-06,-2e-06,6e-06,-1.1e-05,3e-06,-9e-06,1e-06,1e-05,-2e-06,-2e-06,1.5e-05,6e-06,-1.3e-05,-6e-06,3e-06,-8e-06,0,-1e-06,-6e-06,-8e-06,-4e-06,2e-06,-4e-06,-6e-06,1e-06,-4e-06,-2e-06,3e-06,1e-06,-1e-06,-6e-06,1e-06,-1e-06,1e-06,0,-1e-06,2e-06,-1e-06,-1e-06,-2e-06,-2e-06,-1e-06,0,0,-3e-06,0,2e-06,0,0,0,0,0,1e-06,0,0,1e-06,1e-06,0,0,0,1e-06,1e-06,0,-1e-06,1e-06,0,1e-06,0,0,0,0,0,0,0,0,0,1e-06,0,1e-06,0,0
0,0,-1e-06,0,1e-06,-1e-06,0,0,-1e-06,-1e-06,-1e-06,4e-06,-2e-06,2e-06,1e-06,2e-06,-2e-06,6e-06,-1e-05,5e-06,4e-06,-3e-06,-6e-06,-2e-06,8e-06,-1e-06,2.9e-05,-6e-06,1.1e-05,1.1e-05,2e-06,-5e-06,1.5e-05,0,2e-06,1e-06,1.6e-05,-7e-06,7e-06,-7e-06,2e-06,-9e-06,1.4e-05,7e-06,1e-06,9e-06,0,-8e-06,0,-1e-06,-8e-06,-4e-06,0,-4e-06,4e-06,-1.3e-05,-1e-06,0,-5e-06,6e-06,-1e-06,0,-1e-06,1e-06,-2e-06,-5e-06,-2e-06,-1e-06,3e-06,1e-06,-8e-06,-2e-06,-3e-06,-2e-06,1e-06,-2e-06,2e-06,0,1e-06,1e-06,0,-3e-06,0,0,-4e-06,0,1e-06,0,1e-06,0,-1e-06,0,1e-06,0,0,0,2e-06,0,0,0,-1e-06,0,0,0,0,0,0,0,0,0,0,-1e-06,0,0,0,1e-06,0,0,0,2e-06,-1e-06
0,0,0,0,0,0,0,0,-2e-06,-4e-06,0,-2e-06,-1e-06,0,0,7e-06,1e-06,0,7e-06,-3e-06,-1e-06,-3e-06,4e-06,-3e-06,1.1e-05,-2e-06,2e-06,0,8e-06,-5e-06,-4e-06,-1e-06,-9e-06,-9e-06,7e-06,-4e-06,-1.7e-05,-1.4e-05,-5e-06,-5e-06,1e-06,-1.2e-05,1e-05,-8e-06,-3e-06,2e-06,-2e-06,-8e-06,8e-06,0,-1e-05,-3e-06,2e-06,1e-06,2e-06,-1.2e-05,-7e-06,-1e-06,-5e-06,-4e-06,1e-06,-2e-06,1e-06,2e-06,1e-06,2e-06,0,-3e-06,-6e-06,0,-7e-06,1e-06,0,3e-06,-1e-06,-2e-06,0,0,-1e-06,-2e-06,1e-06,-1e-06,0,1e-06,-1e-06,0,-2e-06,1e-06,0,1e-06,1e-06,-1e-06,0,0,-1e-06,0,1e-06,0,0,0,0,0,0,0,-1e-06,-1e-06,-1e-06,-1e-06,0,0,0,-1e-06,0,0,0,0,0,0,-1e-06,1e-06,-1e-06
0,0,1e-06,0,-1e-06,0,0,1e-06,0,0,-1e-06,-1e-06,4e-06,0,0,-6e-06,2e-06,-1e-06,3e-06,-3e-06,-3e-06,3e-06,-1e-06,5e-06,-5e-06,4e-06,-2.7e-05,-3e-06,1.2e-05,-1.1e-05,-4e-06,-3e-06,-2.7e-05,7e-06,-6e-06,2e-06,9e-06,-4e-06,2e-06,1e-06,1e-06,-5e-06,6e-06,0,1e-06,-8e-06,0,2e-06,-3e-06,2e-06,-1.2e-05,1e-06,1.2e-05,-2e-06,1e-06,-7e-06,1e-06,-1e-06,-2e-06,3e-06,4e-06,-3e-06,-2e-06,-1e-06,5e-06,1e-06,1e-06,4e-06,2e-06,0,-4e-06,1e-06,1e-06,-2e-06,0,0,-2e-06,-1e-06,0,2e-06,2e-06,0,0,0,1e-06,0,0,-2e-06,-1e-06,0,0,0,1e-06,0,0,0,0,0,0,0,0,-1e-06,0,-1e-06,0,0,-1e-06,0,0,0,0,0,0,-1e-06,0,-1e-06,0,0,1e-06,0,0
0,0,-1e-06,0,-1e-06,0,-1e-06,0,1e-06,1e-06,0,0,-1e-06,-1e-06,0,5e-06,2e-06,-3e-06,-1.1e-05,3e-06,0,2e-06,-4e-06,2e-06,-1.3e-05,-9e-06,1.7e-05,1e-06,1e-06,-6e-06,-8e-06,-3e-06,3.4e-05,8e-06,5e-06,1e-05,3e-06,-4e-06,0,1e-06,1e-06,6e-06,-5e-06,-5e-06,-1e-06,-6e-06,1e-06,-1e-06,1e-06,1e-06,3e-06,-8e-06,1e-06,-2e-06,5e-06,2e-06,3e-06,0,-2e-06,-2e-06,2e-06,-4e-06,-1e-06,-4e-06,-5e-06,4e-06,-1e-06,0,-1e-06,0,0,-3e-06,0,0,1e-06,0,-1e-06,0,0,0,2e-06,2e-06,0,0,1e-06,0,1e-06,0,0,0,0,-1e-06,0,0,0,0,-1e-06,0,0,0,-1e-06,0,0,1e-06,0,0,0,0,0,0,0,0,0,0,0,0,0,0,0,0,0
0,0,0,0,0,0,0,0,-1e-06,2e-06,-1e-06,1e-06,-2e-06,0,0,0,3e-06,-6e-06,6e-06,0,0,0,4e-06,-6e-06,-3e-06,5e-06,5e-06,1e-06,7e-06,-4e-06,-9e-06,-1e-06,-1.7e-05,-4e-06,1e-06,3e-06,-6e-06,-6e-06,-1e-06,1e-06,2e-06,0,-1e-05,-4e-06,-2e-06,7e-06,0,2e-06,-1e-06,-2e-06,6e-06,4e-06,-1e-06,-3e-06,6e-06,7e-06,5e-06,1e-06,-1e-06,-3e-06,2e-06,-3e-06,2e-06,0,5e-06,0,1e-06,-2e-06,-2e-06,-1e-06,2e-06,1e-06,2e-06,0,-1e-06,2e-06,-2e-06,-1e-06,1e-06,0,0,1e-06,0,0,-1e-06,0,0,-1e-06,0,0,0,0,0,0,0,0,-1e-06,0,0,0,1e-06,0,0,0,-1e-06,0,0,0,0,0,0,0,0,0,0,1e-06,-1e-06,0,-1e-06,0,0
0,0,0,0,0,0,0,-1e-06,0,0,-1e-06,0,-2e-06,1e-06,0,-6e-06,2e-06,2e-06,0,-3e-06,2e-06,-1e-06,-5e-06,2e-06,1e-06,-6e-06,-1.2e-05,-1e-06,-1.1e-05,5e-06,-7e-06,-3e-06,-9e-06,1e-06,-6e-06,-2e-06,1.4e-05,-8e-06,2e-06,-2e-06,1e-06,-3e-06,-4e-06,1e-06,2e-06,5e-06,-2e-06,2e-06,0,-1e-06,3e-06,0,1e-06,0,0,9e-06,-1e-06,0,-2e-06,5e-06,0,-3e-06,2e-06,2e-06,-5e-06,-4e-06,0,2e-06,2e-06,0,0,-1e-06,1e-06,0,1e-06,0,0,0,-1e-06,1e-06,-1e-06,1e-06,0,0,-1e-06,0,-1e-06,0,-1e-06,0,-1e-06,-1e-06,-1e-06,0,0,0,0,0,0,0,0,0,0,0,0,0,0,0,0,0,0,0,0,0,0,0,1e-06,0,1e-06,-1e-06,0
0,0,0,0,0,0,0,0,0,-2e-06,0,-3e-06,2e-06,-1e-06,0,5e-06,0,3e-06,-6e-06,2e-06,-1e-06,-1e-06,4e-06,-2e-06,5e-06,1e-06,8e-06,0,-1e-05,2e-06,-4e-06,0,7e-06,4e-06,6e-06,-1e-06,-1.2e-05,-2e-06,-2e-06,-2e-06,0,5e-06,-2e-06,-2e-06,-3e-06,-5e-06,0,2e-06,-2e-06,1e-06,1e-06,-5e-06,0,-2e-06,2e-06,8e-06,-3e-06,0,-3e-06,-2e-06,-1e-06,-1e-06,-4e-06,1e-06,2e-06,0,0,1e-06,0,0,-4e-06,-1e-06,-1e-06,1e-06,0,0,-1e-06,0,0,-2e-06,-2e-06,0,0,0,-1e-06,0,-1e-06,-2e-06,1e-06,0,-1e-06,0,-1e-06,0,0,0,0,0,0,0,0,0,0,0,0,0,0,0,0,0,0,0,0,0,0,0,0,0,0,-1e-06,0
0,0,0,0,0,0,0,0,0,-1e-06,-1e-06,3e-06,1e-06,0,0,-2e-06,1e-06,5e-06,8e-06,2e-06,-2e-06,1e-06,-2e-06,4e-06,-3e-06,-2e-06,1e-06,-2e-06,-3e-06,5e-06,-2e-06,-1e-06,-2e-06,4e-06,-1e-06,0,1e-05,-4e-06,1e-06,-2e-06,1e-06,8e-06,3e-06,-1e-06,1e-06,-4e-06,1e-06,0,-2e-06,1e-06,-4e-06,3e-06,-4e-06,-1e-06,5e-06,-1e-06,-2e-06,0,-3e-06,-2e-06,-1e-06,0,1e-06,-1e-06,-1e-06,-2e-06,0,-2e-06,-1e-06,0,-6e-06,-2e-06,0,-1e-06,-1e-06,-1e-06,1e-06,0,0,1e-06,-1e-06,-1e-06,0,0,0,0,2e-06,0,0,0,-1e-06,0,0,0,0,0,1e-06,0,0,0,0,0,0,0,0,0,0,0,0,0,0,0,0,0,0,0,0,0,0,0,0
0,0,1e-06,0,0,0,0,0,0,1e-06,-1e-06,-1e-06,-1e-06,0,0,-1e-06,-1e-06,-1e-06,-3e-06,-2e-06,1e-06,1e-06,1e-06,-7e-06,4e-06,0,-1.2e-05,0,4e-06,2e-06,2e-06,-2e-06,-6e-06,1e-06,-2e-06,1e-06,-5e-06,-6e-06,-1e-06,-1e-06,1e-06,5e-06,7e-06,-2e-06,1e-06,2e-06,0,-5e-06,2e-06,0,7e-06,-4e-06,-5e-06,-2e-06,0,-5e-06,3e-06,0,-2e-06,2e-06,-1e-06,1e-06,1e-06,0,-1e-06,2e-06,0,0,0,0,-3e-06,1e-06,-1e-06,1e-06,1e-06,0,1e-06,0,0,-1e-06,0,-1e-06,0,0,0,0,0,-1e-06,0,0,0,0,0,0,0,0,1e-06,0,0,0,0,0,0,0,0,0,0,0,0,0,0,0,0,0,0,0,0,0,1e-06,0,0
0,0,0,0,0,0,0,0,0,2e-06,0,1e-06,-1e-06,1e-06,0,5e-06,-2e-06,0,-6e-06,-1e-06,0,0,0,5e-06,-2e-06,1e-06,1e-05,1e-06,5e-06,-2e-06,4e-06,0,4e-06,-1e-06,4e-06,-1e-06,-4e-06,-7e-06,1e-06,0,0,-1e-06,3e-06,-3e-06,0,4e-06,-1e-06,1e-06,-2e-06,-1e-06,-2e-06,2e-06,-8e-06,-1e-06,0,-8e-06,4e-06,0,-2e-06,0,1e-06,2e-06,-2e-06,0,3e-06,2e-06,0,2e-06,-1e-06,0,1e-06,-1e-06,-1e-06,-1e-06,0,0,1e-06,0,0,1e-06,1e-06,0,0,0,1e-06,0,-1e-06,0,0,0,0,0,0,0,0,0,0,0,0,0,-1e-06,-1e-06,0,0,0,0,0,0,0,0,0,0,0,0,0,0,0,0,0,0,0
0,0,0,0,0,0,0,0,1e-06,1e-06,-1e-06,-3e-06,1e-06,0,0,-4e-06,-1e-06,-3e-06,7e-06,1e-06,1e-06,-1e-06,-3e-06,-2e-06,2e-06,-2e-06,5e-06,1e-06,4e-06,-5e-06,4e-06,-1e-06,3e-06,3e-06,-4e-06,-2e-06,7e-06,-4e-06,0,0,0,5e-06,0,-2e-06,3e-06,-4e-06,0,2e-06,0,-1e-06,-3e-06,0,-3e-06,-1e-06,5e-06,-5e-06,0,0,-2e-06,2e-06,1e-06,3e-06,2e-06,-1e-06,-3e-06,-1e-06,-1e-06,-1e-06,-2e-06,0,3e-06,0,0,1e-06,0,0,0,0,0,-1e-06,1e-06,0,0,0,0,0,0,-1e-06,0,0,1e-06,0,0,0,0,0,0,0,0,0,0,1e-06,0,0,0,0,0,0,0,0,0,0,0,0,0,0,0,0,0,0,0
0,0,0,0,0,0,0,0,0,-1e-06,-1e-06,3e-06,2e-06,0,0,0,-2e-06,-2e-06,-3e-06,0,-1e-06,-1e-06,4e-06,5e-06,-1.2e-05,3e-06,-1.4e-05,0,5e-06,-5e-06,4e-06,-1e-06,-2e-05,5e-06,1e-06,3e-06,-1.2e-05,-3e-06,0,0,1e-06,6e-06,-2e-06,0,-1e-06,-3e-06,0,-2e-06,0,0,-8e-06,-3e-06,1e-06,-2e-06,2e-06,0,-3e-06,0,-3e-06,-3e-06,1e-06,2e-06,1e-06,-1e-06,3e-06,0,0,-1e-06,0,0,2e-06,0,0,-1e-06,0,1e-06,0,0,0,1e-06,0,1e-06,0,0,0,0,1e-06,1e-06,0,0,0,0,1e-06,0,0,0,0,0,0,0,0,0,0,0,0,0,0,0,0,0,0,0,0,0,0,0,0,0,1e-06,1e-06,0
0,0,0,0,0,0,0,0,0,-2e-06,0,-2e-06,-1e-06,0,0,2e-06,-1e-06,0,-2e-06,-1e-06,-1e-06,0,-3e-06,-5e-06,4e-06,-2e-06,6e-06,-2e-06,-4e-06,2e-06,3e-06,-1e-06,1.6e-05,0,3e-06,1e-06,9e-06,-5e-06,-1e-06,-1e-06,1e-06,1e-06,-3e-06,-2e-06,0,1e-06,0,-1e-06,2e-06,1e-06,6e-06,1e-06,3e-06,-2e-06,2e-06,3e-06,-3e-06,0,-2e-06,1e-06,0,2e-06,-2e-06,1e-06,-3e-06,-1e-06,1e-06,2e-06,0,0,1e-06,-1e-06,1e-06,0,0,0,0,0,0,0,0,0,0,0,0,0,0,-1e-06,0,0,0,0,1e-06,0,0,0,0,0,0,0,0,0,0,0,0,0,0,0,0,0,0,0,0,0,0,0,0,0,0,1e-06,0
0,0,0,0,0,0,0,0,0,0,-1e-06,1e-06,-1e-06,0,0,-3e-06,0,2e-06,6e-06,1e-06,0,1e-06,1e-06,6e-06,2e-06,1e-06,7e-06,0,-4e-06,4e-06,1e-06,0,0,-1e-06,-4e-06,-2e-06,-6e-06,-4e-06,0,-1e-06,0,-2e-06,-1e-06,-1e-06,-1e-06,3e-06,0,1e-06,-2e-06,0,3e-06,-3e-06,-1e-06,-1e-06,4e-06,4e-06,1e-06,0,-2e-06,1e-06,-1e-06,1e-06,-1e-06,2e-06,1e-06,0,0,0,-1e-06,0,0,0,1e-06,0,0,0,-1e-06,0,0,0,-1e-06,0,0,0,0,0,-1e-06,1e-06,0,0,-1e-06,0,0,0,0,0,0,0,0,0,0,0,0,0,0,0,0,0,0,0,0,0,0,0,0,0,0,0,0,0,0
0,0,0,0,0,0,0,0,0,2e-06,-1e-06,-1e-06,0,0,0,3e-06,1e-06,3e-06,-6e-06,1e-06,0,0,0,-4e-06,8e-06,0,-1.2e-05,1e-06,-7e-06,3e-06,0,-2e-06,-1.4e-05,5e-06,3e-06,2e-06,1e-06,-4e-06,0,-1e-06,0,0,-1e-06,-3e-06,-1e-06,-1e-06,0,2e-06,0,-1e-06,0,1e-06,0,-1e-06,4e-06,5e-06,2e-06,0,-2e-06,0,-1e-06,0,2e-06,0,0,1e-06,0,-1e-06,1e-06,0,-1e-06,0,0,0,0,0,0,0,0,1e-06,-1e-06,0,0,0,1e-06,0,0,-1e-06,0,0,-1e-06,0,0,0,0,0,0,0,0,0,0,0,0,0,0,0,0,0,0,0,0,0,0,0,0,0,0,0,1e-06,0,0
0,0,0,0,0,0,0,0,0,1e-06,0,2e-06,2e-06,0,0,0,0,-1e-06,0,-1e-06,0,0,-1e-06,3e-06,-1e-05,-1e-06,6e-06,0,3e-06,1e-06,-2e-06,1e-06,6e-06,2e-06,0,2e-06,5e-06,-3e-06,0,0,0,1e-06,1e-06,-1e-06,1e-06,-4e-06,0,-1e-06,2e-06,-1e-06,-4e-06,1e-06,-2e-06,0,1e-06,0,2e-06,0,-2e-06,-1e-06,0,-1e-06,-1e-06,-1e-06,-2e-06,0,-1e-06,1e-06,0,0,0,0,0,0,0,0,0,0,0,-1e-06,0,0,0,0,0,0,1e-06,0,0,0,0,-1e-06,0,0,0,0,0,0,0,0,0,0,0,0,0,0,0,0,0,0,0,0,0,0,0,0,0,0,0,0,0
0,0,0,0,0,0,0,0,0,-1e-06,-1e-06,-1e-06,-1e-06,0,0,-3e-06,2e-06,-1e-06,4e-06,-1e-06,0,0,2e-06,-5e-06,4e-06,2e-06,6e-06,0,0,-3e-06,-3e-06,-2e-06,-1e-06,1e-06,-3e-06,-1e-06,-8e-06,-5e-06,0,0,1e-06,-1e-06,2e-06,-2e-06,0,1e-06,0,-2e-06,-1e-06,0,1e-06,-2e-06,0,-2e-06,1e-06,-3e-06,-2e-06,0,-2e-06,-1e-06,0,-2e-06,-2e-06,0,3e-06,0,0,1e-06,-1e-06,0,3e-06,-1e-06,0,-1e-06,0,1e-06,0,0,0,1e-06,1e-06,0,0,0,0,0,0,-1e-06,0,0,0,0,0,0,0,0,0,0,0,0,0,0,0,0,0,0,0,0,0,0,0,0,0,0,0,0,0,0,0,0,0
