-0.000168,-0.000204,-9.5e-05,-5.2e-05,-0.00013,-0.000127,-9.6e-05,-8.9e-05,-0.00019,-0.000212,-0.000187,-0.000144,-4.1e-05,-0.000122,-0.000221,-0.000126,-0.000146,-0.000191,-0.000263,-0.000247,-0.000187,-0.000213,-0.000185,-0.000104,-0.000109,-0.000145,-0.000266,-0.000192
-0.000179,-0.000152,-6.6e-05,-8.2e-05,-0.000163,-0.000239,-0.000194,-0.000112,-0.000206,-0.000309,-0.00029,-0.000298,-0.000116,-0.000197,-0.000382,-0.000188,-0.000171,-0.000308,-0.00039,-0.000323,-0.000274,-0.00024,-0.000206,-0.000133,-0.000114,-0.000195,-0.000276,-0.000254
-0.000102,-2.5e-05,-4e-05,-0.000122,-0.000153,-0.000181,-0.000134,-0.000135,-0.000126,-0.000214,-0.000242,-0.000213,-9e-05,-0.000165,-0.000244,-0.000152,-9.3e-05,-0.000117,-0.000153,-0.000167,-0.000139,-8.9e-05,-0.000113,-0.000139,-0.000133,-0.000107,-2.5e-05,-0.000123
4.2e-05,7.7e-05,2.5e-05,-3.8e-05,2.5e-05,3.9e-05,9e-05,9.3e-05,0.00014,5.9e-05,5.1e-05,8.5e-05,0.000114,0.000111,0.000108,-1e-06,8e-05,0.000194,0.000212,0.000154,0.000135,0.000128,7.3e-05,1e-06,4e-05,8.2e-05,0.000226,9.3e-05
9.2e-05,6.2e-05,5.6e-05,4.3e-05,9.9e-05,0.000114,0.000152,0.00019,0.000177,0.000115,0.000181,0.000204,0.000167,0.000227,0.000211,6.7e-05,0.000152,0.000251,0.000257,0.000235,0.000218,0.000117,0.000122,0.000138,0.000187,0.000125,0.000155,0.000102
-2.8e-05,-7.6e-05,-5.1e-05,-5.6e-05,-7.5e-05,-3.2e-05,-3.3e-05,-0.000104,-0.000162,-0.000111,-8e-06,1.5e-05,-4.5e-05,-4e-05,-9e-05,-9e-05,-2e-05,3e-06,-9e-06,-4.7e-05,1.1e-05,-9.7e-05,-5.7e-05,2.7e-05,2e-06,-2.2e-05,-0.000166,-0.000125
-0.000123,-0.000128,-7.4e-05,-8.2e-05,-9.9e-05,-9.1e-05,-0.000109,-0.000155,-0.00021,-0.000115,-4.6e-05,-0.000107,-0.00015,-0.000177,-0.000226,-0.000128,-0.000157,-0.000215,-0.000191,-0.000181,-0.000165,-0.000176,-0.000122,-5.3e-05,-0.00011,-9e-05,-0.000223,-0.000178
-6.2e-05,-4.7e-05,6e-06,3e-06,1.2e-05,-3.8e-05,-2.5e-05,2.5e-05,1.7e-05,5.1e-05,4e-06,-5.5e-05,-8.4e-05,-0.000106,-8.9e-05,2.3e-05,-0.000109,-0.000204,-0.000146,-4e-05,-0.000112,-4.8e-05,-3.6e-05,-3.4e-05,-6.8e-05,-3.4e-05,2.2e-05,-1.6e-05
5.8e-05,4.5e-05,-1.5e-05,-1.4e-05,-4e-06,-1.1e-05,3.3e-05,1.2e-05,7.2e-05,0.000101,-6.5e-05,1.2e-05,-5e-06,-6.3e-05,1.4e-05,0.000109,-1.5e-05,-4.6e-05,3e-06,6.4e-05,1.6e-05,8.7e-05,3e-05,-5.7e-05,-6.7e-05,-2.4e-05,0.000114,1e-04
7.6e-05,1.6e-05,-9.3e-05,-5.5e-05,1.2e-05,1.4e-05,2.8e-05,1.9e-05,3.8e-05,5.5e-05,-7.9e-05,3.7e-05,1.7e-05,3.7e-05,9.9e-05,9.7e-05,4.5e-05,7.3e-05,9.3e-05,6.4e-05,8.1e-05,8.7e-05,5.4e-05,-1.8e-05,-1e-06,-4.6e-05,1e-06,0.000116
-5e-06,-8.9e-05,-0.000139,-6.7e-05,2.2e-05,-2.3e-05,-2.7e-05,3.1e-05,-4.7e-05,-7.8e-05,-5.9e-05,-1.7e-05,-5.7e-05,5.6e-05,6.3e-05,-3e-05,1e-05,5.1e-05,6.2e-05,-6.2e-05,1.8e-05,-3e-06,7e-06,1e-06,2e-06,-4.2e-05,-0.000107,4.2e-05
-4e-05,-5e-05,-0.00011,-7.4e-05,-3.4e-05,-6.9e-05,-0.000108,-0.000106,-0.00017,-0.000161,-5.8e-05,-0.00012,-0.000163,-9.4e-05,-8.4e-05,-0.000157,-8.4e-05,-6.1e-05,-5.1e-05,-0.000244,-0.000137,-5.5e-05,-2.6e-05,-6.2e-05,-0.00013,-2.5e-05,-8.1e-05,-1.4e-05
-1e-05,3.3e-05,-1.3e-05,-7e-06,1.1e-05,-1.5e-05,-0.000128,-8.4e-05,-7.9e-05,-2.3e-05,3.2e-05,-0.00015,-0.00017,-0.000136,-0.000105,-9.5e-05,-9e-05,-0.000129,-0.000144,-0.00018,-0.000135,7e-06,5.1e-05,-3.7e-05,-0.000129,1.2e-05,7e-05,2.5e-05
-2.7e-05,-4.7e-05,1.1e-05,3.6e-05,1e-06,3.7e-05,-6e-05,-1.9e-05,6e-05,0.000113,3.9e-05,-9e-05,-7.7e-05,-4.8e-05,-2.5e-05,1.2e-05,-3.2e-05,-8.2e-05,-8.7e-05,6e-05,-4.3e-05,4.3e-05,5.6e-05,-5e-06,-7.3e-05,-1.1e-05,0.000102,1.1e-05
-7.7e-05,-0.000124,-3.6e-05,1.1e-05,-6.1e-05,4e-05,-3.6e-05,-0.000164,-7e-06,6.6e-05,-7e-05,-2.5e-05,-6.2e-05,-4e-05,4.2e-05,2.4e-05,-2.9e-05,-1.3e-05,3.7e-05,0.000137,-2.8e-05,-2.6e-05,-6.2e-05,-5e-05,-8.4e-05,-0.000101,-6.2e-05,-0.00012
-2.1e-05,4.5e-05,1.9e-05,3.1e-05,3.5e-05,7.5e-05,1.4e-05,-0.000139,-6e-06,4.2e-05,3e-06,5.3e-05,-3.3e-05,6.8e-05,0.000147,3.5e-05,6e-06,3.4e-05,0.000126,0.000125,2.9e-05,-1.6e-05,-6.5e-05,1.4e-05,4.4e-05,-3.3e-05,-0.000114,-0.000104
1.2e-05,0.000145,7.9e-05,2.6e-05,7.8e-05,5.1e-05,1.2e-05,-6.3e-05,-3.2e-05,-3.6e-05,7e-05,8.4e-05,-1.1e-05,9.7e-05,0.000116,8e-06,5.5e-05,1.3e-05,9.3e-05,5.7e-05,5e-05,2e-05,-2e-06,4.2e-05,9.3e-05,7.4e-05,-1.7e-05,-2e-06
-4e-05,-1.5e-05,1.4e-05,-1.6e-05,1.3e-05,-2.1e-05,-7.6e-05,-9e-05,-0.000112,-0.000139,9e-06,3.9e-05,-1.8e-05,-2.7e-05,-4.8e-05,-4e-05,1.9e-05,-6.1e-05,-7.5e-05,-0.000112,-2.7e-05,-1.7e-05,1e-06,-4.5e-05,-3e-05,4.1e-05,3.1e-05,2.1e-05
-1.3e-05,-0.000124,-3.4e-05,-2e-05,-1.1e-05,-6.7e-05,-0.000113,-3e-06,-1.5e-05,-4.1e-05,3.2e-05,-1.6e-05,1.7e-05,-3.5e-05,-0.000104,-4e-06,7e-06,-5.3e-05,-0.000137,-9e-05,-1.5e-05,-3.5e-05,-5e-06,-4.1e-05,-1.8e-05,-2.1e-05,2.5e-05,2.7e-05
