-8e-06,0.000133,8.7e-05,0.000278,0.000385,0.000317,0.00064,0.000297,0.000424,0.000278,0.000188,0.000185,0.000122,0.000107,-0.001286,-0.001036,-8.7e-05,9.2e-05,0.000122,0.000251,0.000278,-0.001968,-0.003512,-0.002484,-0.000735,-0.000731,-0.004293,-0.00168,-0.000714,-0.007381,-0.007817,0.001876,0.000822,-0.009133,-0.012218,-0.011913,-0.018222,-0.0147,-0.009595,-0.009961,-0.024146,-0.011359,-0.015343,-0.014492,-0.015912,-0.014541,-0.014571,-0.020033,-0.016946,-0.011595,-0.011852,-0.01662,-0.013222,-0.022007,-0.013685,-0.012946,-0.013036,-0.008016,-0.015883,-0.012483,-0.008589,-0.005647,-0.009757,-0.010615,-0.001616,-0.007874,-0.007367,-0.005635,-0.005405,-0.00456,-0.002596,-0.006125,-0.005005,-0.003654,-0.00214,-0.002127,-0.000491,-0.000358,-0.00064,-0.000267,0.003362,0.003031,-0.001474,-0.002131,-7.2e-05,0.000551,0.001878,0.001322,0.000879,1.1e-05,-4.3e-05,-4.9e-05,-0.000923,-0.000153,0.000554,0.000504,0.000399,0.000573,0.000257,0.000333,-4.3e-05,5.3e-05,6.3e-05,0.000279,0.000466,0.000474,0.000315,9.5e-05,0.000121,0.000141,-0.00085,-0.002182,-0.001031,5e-05,1e-04,0.00026,0.000222,6.6e-05,4.5e-05,-6.3e-05,0.000352
0.00014,7.3e-05,8.8e-05,-5.2e-05,-0.000105,1.3e-05,0.000235,7.8e-05,0.000278,1.8e-05,-7e-06,-2.2e-05,8.3e-05,9.2e-05,0.000464,0.000639,0.00064,0.000296,0.000457,0.000489,0.000426,-0.000132,0.001734,0.002054,0.000722,0.000129,0.00292,0.001317,0.00189,0.004152,0.003846,0.000239,0.001957,0.005291,-0.002617,-0.000836,0.004253,0.002539,-0.002477,0.000619,0.001826,0.004778,0.00239,0.000702,0.002032,0.001025,-0.007009,0.000252,-0.001626,-0.001842,0.001457,4.9e-05,-0.006055,0.005482,0.00346,-0.004256,0.001412,-0.004387,0.002612,-0.002715,-0.004023,-0.003951,-0.002207,0.000953,6.3e-05,0.000948,0.00211,0.00185,-0.000922,-0.000409,-0.001108,0.000866,0.000915,-0.00035,-0.000453,-0.000495,-5e-05,-0.000205,-0.00127,-1.4e-05,0.000161,0.000983,-0.000469,-0.001473,0.000241,-0.001854,0.000422,0.000753,0.000517,7e-04,0.000869,0.00036,-7.4e-05,8.3e-05,0.000601,0.000338,0.000502,0.000562,3e-04,0.000234,0.00042,0.000206,0.000161,0.000251,0.000145,0.000489,0.000131,0.00025,0.000308,0.000273,1.4e-05,0.000572,0.000225,0.000637,0.000241,0.00049,0.000392,0.000184,0.00025,0.000385,0.000265
0.000141,-5.3e-05,-0.000302,-0.000304,-9.8e-05,-8.6e-05,0.000112,9.2e-05,9.4e-05,-0.00012,2.5e-05,-0.00018,-4.4e-05,0.000151,-0.000387,-0.00072,-0.00013,0.000182,0.000178,-0.000102,-4.8e-05,-0.000135,-0.001002,-0.001167,-0.000757,0.000437,-0.001232,-0.001607,-0.001998,-0.002305,-0.001851,-0.002576,-0.001122,-0.004906,-0.004441,-0.002943,-0.010348,-0.007444,-0.003225,-0.005082,-0.001067,-0.005731,-0.009083,-0.002229,-0.000893,-0.006236,0.003808,-0.003168,0.00426,0.003921,0.00134,0.001652,-0.0035,-0.013613,-0.006545,0.00157,-0.001422,-0.002013,-0.001304,0.000402,-0.001843,-0.003422,-0.002537,-0.002632,-0.000995,-0.003947,-0.000922,0.000383,-0.000797,-0.002433,-0.000756,-0.000508,-0.001941,-0.000277,-0.000378,-0.000566,-0.000164,-0.000177,-0.000195,-0.001475,-0.003857,-0.001521,-0.00046,-0.001165,-0.000379,-0.000289,-0.000387,-2.3e-05,-0.000126,0.000153,-0.000244,-0.000324,-0.000241,-3.4e-05,0.000294,0.000365,0.000242,0.000128,0.00018,0.000178,6e-06,-0.000203,-8.3e-05,8.3e-05,4e-06,0.00025,0.000111,-0.00019,5.9e-05,3.1e-05,9e-05,0.000721,0.000453,0.000423,6e-05,0.000103,0.000202,7.9e-05,-4.8e-05,5.2e-05,-0.000265
-7.9e-05,-2.4e-05,4.7e-05,0.000114,1.1e-05,8.4e-05,-1e-05,-4.8e-05,-9e-06,2.4e-05,0.000144,-0.000104,-7.7e-05,7.5e-05,0.000237,0.000215,0.000122,-0.000134,0.000228,2.1e-05,-2.4e-05,-1.7e-05,0.001565,0.000713,0.000253,-0.000345,-0.000419,0.000297,5.9e-05,0.000779,0.001986,0.000456,0.00071,0.002488,3.2e-05,-0.000788,0.008919,0.002432,0.000902,0.003183,-0.002136,-0.000322,0.002916,-0.000217,-0.004455,0.000574,-0.003096,0.000506,-0.002439,-0.003644,-0.002412,-0.005754,0.003933,0.003677,0.003368,0.000896,-0.000436,0.003349,-0.001018,-0.006658,-0.004023,0.003305,0.000789,0.002593,-0.00052,0.003801,0.001509,0.000451,-0.000742,0.00045,0.000725,-0.00089,0.001529,0.000509,0.001035,-0.000361,-0.000322,-8.6e-05,0.000295,-0.000299,-0.001493,-0.000666,-0.000625,-0.00089,-0.001456,0.000376,-0.000277,-5.7e-05,-6.3e-05,0.000273,-8.4e-05,6.8e-05,0.000617,-0.000273,2e-06,5.8e-05,3.3e-05,8.5e-05,-8e-06,-0.000202,7.1e-05,0.000171,4e-05,0.000196,-0.000205,0.000226,0.000197,0.000116,-6.5e-05,-0.000102,9e-05,-0.000267,-0.000328,8.2e-05,5.5e-05,-2e-06,-7.3e-05,-6.2e-05,-0.000196,6.8e-05,-0.000183
3.4e-05,0.000172,9e-05,9.9e-05,0.000163,4.3e-05,-2.7e-05,6e-06,4.2e-05,-2.2e-05,3.2e-05,0.000117,0,-0.00019,-7.2e-05,-3.1e-05,1.1e-05,-1.3e-05,0.000251,-6.4e-05,-6.3e-05,5.6e-05,-0.000995,-0.000275,1e-05,-0.000308,0.000774,-0.001094,-0.000924,-0.000604,-0.001318,-0.000364,-0.002581,0.000433,-0.006962,0.003718,-0.003927,-0.002821,0.001466,-0.003516,-0.000576,-0.003222,-0.001592,-0.000486,-1e-05,-0.003131,0.000609,0.00332,-0.003138,0.002787,0.000598,0.008091,0.002138,0.00187,0.0026,0.001383,0.005719,0.000522,0.003698,6.4e-05,0.002524,-0.00231,0.003124,-0.000832,-0.000481,-0.003795,-0.001465,-0.000433,0.000802,0.001488,0.000667,-0.000108,-0.001528,-0.000855,-0.000341,0.000349,-0.000418,-0.000181,0.000353,-0.000755,-0.00115,-0.000904,-0.000973,0.001957,0.000693,8.2e-05,-0.000147,-6.7e-05,-8e-06,0.000133,-0.00023,0.000278,3.8e-05,-5.6e-05,7.3e-05,-0.000178,7e-06,3.3e-05,-8.2e-05,-0.000112,-1.9e-05,-7.1e-05,0.000131,2e-05,-0.000147,0.000108,-5.5e-05,-1.6e-05,-5.7e-05,-0.000119,-4.6e-05,0.000243,-3e-05,-3.4e-05,9e-05,-7.6e-05,-0.000119,-4.6e-05,-0.000118,5e-05,4.1e-05
1.1e-05,-0.000137,2.2e-05,4e-05,5.6e-05,-8e-06,-1.2e-05,-0.000161,8.4e-05,2.7e-05,-3.4e-05,-2.5e-05,1e-06,-5.8e-05,-1.8e-05,0.000213,9.4e-05,-0.000154,8.4e-05,-0.000208,-0.000127,0.000113,0.001482,-0.000245,-0.000146,4.8e-05,1.5e-05,0.000765,0.00049,-0.000729,0.002085,-0.000206,-0.000464,-0.000559,-0.003277,-0.00109,-0.003199,0.001267,-0.000135,-0.002173,0.000137,0.000894,-0.002009,-0.000552,-0.001538,0.001228,-0.001444,-6.6e-05,0.001242,-0.003947,-0.001222,-0.005308,0.000612,0.00067,-0.003047,0.001373,-0.00121,0.001769,0.00122,-0.000795,0.002584,-0.00207,-0.003657,-0.001126,-0.001547,0.001829,0.00081,0.000196,-0.001257,0.000358,-0.000633,0.000846,0.001249,0.000153,-0.000555,-0.000268,-3e-06,3.4e-05,0.000348,0.000251,0.000163,-0.00155,-0.001092,-0.000891,-0.000556,0.00038,0.000346,-0.000238,-0.000155,0.000215,-2e-04,1.1e-05,-8.3e-05,-0.000379,-0.00024,-0.000105,5.2e-05,-6.1e-05,-8.6e-05,-3.5e-05,-0.000224,3e-06,5.5e-05,-4.8e-05,-8.3e-05,7.8e-05,-0.000219,4e-05,-1.1e-05,-0.000142,-0.000172,-5.1e-05,0.000129,8.4e-05,-9.3e-05,0.000127,-6.7e-05,-0.000145,-0.000122,-4.8e-05,-7.2e-05
-7.1e-05,-2e-06,-3.6e-05,-7.5e-05,-0.000129,-4.3e-05,-5.3e-05,-0.000205,5e-05,9.4e-05,-2.2e-05,5e-05,6.8e-05,-5.5e-05,1.1e-05,-0.000202,-7.7e-05,-0.000244,-0.000156,3.9e-05,-7.5e-05,0.000148,-0.000239,-0.000271,-0.000406,-0.000428,-0.00035,-0.000663,-0.000993,-0.001046,-0.001107,3.9e-05,-0.000168,0.001349,0.002132,0.000641,0.001253,-0.001448,-0.001585,0.00052,-0.000311,-0.00204,-0.003917,-0.001037,-0.000334,-0.001471,0.00139,-0.002238,-0.00222,0.000292,0.000144,0.002251,-0.001637,-0.003898,0.000927,6e-06,-0.002115,0.000577,-0.000454,0.000968,-0.001428,-0.00028,-0.000135,0.001581,0.000729,0.000526,0.000364,0.000595,0.000765,-0.000776,0.000768,-0.000473,-0.000434,-0.000252,-0.000135,0.000409,-8.7e-05,0.000117,-5.6e-05,0.000174,0.000186,-0.000945,-0.000856,9.8e-05,0.000663,-0.000277,-0.000355,-0.000664,-0.000408,-0.000166,-0.000134,-3e-04,-0.000203,-0.000368,-0.000137,-0.000273,-3.4e-05,-0.000135,-0.000195,-0.000112,-0.000151,-0.000271,-4.7e-05,-0.000118,-5.4e-05,-8.8e-05,-0.000255,-6.4e-05,0.000108,-8.6e-05,-0.000306,-6.5e-05,-0.000187,-0.000106,-0.00027,-3.2e-05,-0.000244,-0.000169,-3.7e-05,-9.6e-05,-6.5e-05
4.5e-05,-7.6e-05,-0.000141,-0.000112,-0.000174,-5.4e-05,-0.000139,-2.4e-05,-1.3e-05,-1.7e-05,6.2e-05,-3.1e-05,-1.2e-05,-5.2e-05,-7.6e-05,3.3e-05,-0.000169,-0.000137,8e-06,-0.000133,-0.000114,-9.8e-05,-0.000476,-0.00023,-0.000102,-0.000214,6e-06,0.000367,0.00093,0.000641,0.000353,-0.001243,-0.000556,0.000771,0.000314,-0.000346,-0.001992,-0.002188,-0.000746,0.000961,0.000581,0.001888,0.001479,0.002168,0.001625,0.002493,-0.001248,0.000599,0.002339,-0.00159,-0.003209,-0.000532,-0.001624,0.001716,-0.004328,-0.000425,6.5e-05,0.000477,0.000199,9.9e-05,-0.001598,-0.000653,0.001346,-0.002084,0.000391,0.000541,-0.001214,0.000317,-0.000961,-0.000203,-0.00023,0.000534,-0.000284,-1.7e-05,3.4e-05,-0.00061,-0.000161,6.2e-05,3e-06,-3.9e-05,0.000183,-0.000465,0.000432,0.000178,0.000184,-0.00068,-0.000239,-0.000784,-0.000461,-0.000341,-1.9e-05,-0.000162,-0.000309,0.000121,-0.000156,-0.00025,-0.000185,-0.000196,-5.6e-05,-0.000147,-0.00015,-7e-05,-8.1e-05,-8.9e-05,-0.000155,-0.000113,-0.000106,-0.000137,-7.9e-05,-7.6e-05,-0.000118,-4.7e-05,-0.000208,-0.000172,-0.000246,-9.2e-05,-0.000183,-0.000171,-8.3e-05,-7.7e-05,-0.000114
-2.6e-05,-5e-05,-6e-06,-2e-05,-3.4e-05,-2.8e-05,-9.5e-05,8e-06,1e-05,-2.7e-05,-1.6e-05,7e-06,3.2e-05,6.1e-05,-1.2e-05,-6.8e-05,0.000176,-5e-06,-0.000118,-0.000162,-3.5e-05,-0.000174,0.000203,-1.5e-05,-0.000206,-0.000119,-0.000141,-0.000337,-0.00044,-0.000124,-0.000133,0.000847,-0.000155,-0.000172,-0.000691,0.00312,0.000591,0.001359,0.000865,0.000985,-0.001463,-0.00022,0.001161,-0.00146,-0.002052,-0.002245,0.001106,0.001736,-0.000637,-0.001211,-0.00079,0.000295,0.002941,0.001713,0.000908,-0.001154,-0.000409,-0.002969,-0.000463,0.000272,0.000308,0.002497,-0.000386,0.000714,-0.000237,0.000526,0.000331,-0.000909,0.000739,-0.000508,-6.4e-05,1.5e-05,0.000197,0.000182,0,0.000166,7.2e-05,1.3e-05,-9e-05,-0.000596,-0.000229,0.001299,0.000585,-6.3e-05,-0.000266,2.8e-05,-0.000145,-0.000308,-0.000316,-0.000225,-0.000301,-9e-06,7.7e-05,-1.9e-05,6e-05,-0.000169,-5.9e-05,-0.000222,-7.2e-05,-0.000161,-0.000191,-7.6e-05,-2.2e-05,-1.3e-05,-0.000113,-0.000132,-0.00018,2.2e-05,-4.6e-05,1.8e-05,1e-05,-2.5e-05,1e-06,-3.7e-05,-9.1e-05,-0.000102,-9e-05,-8.6e-05,-6.9e-05,-4.3e-05,-6.8e-05
7.7e-05,3.6e-05,-2.8e-05,-3e-06,4.7e-05,2.3e-05,2.5e-05,1.3e-05,-4.7e-05,-1.8e-05,-6.3e-05,6.4e-05,5.2e-05,-2.4e-05,0.000119,6.2e-05,9e-06,-5e-06,-8.6e-05,-0.000134,1.1e-05,-0.000152,-0.000202,0.000161,0.000105,0.00014,-0.000272,-9.9e-05,-5e-05,0.000408,0.000112,-0.000382,-0.000225,2.5e-05,-0.000332,-0.005809,0.000427,-0.001252,0.001064,-0.000406,0.000165,0.000116,0.00146,0.00082,0.003407,0.001877,-0.002742,-0.001886,0.00254,-0.001138,0.001673,-0.000681,-0.00153,-7e-05,0.001809,0.000841,-0.000292,0.003768,-0.001981,0.001997,-0.002167,4.8e-05,0.000985,-0.000543,4.1e-05,-0.001292,-0.000506,0.000771,-0.000907,0.000104,-6.4e-05,0.000419,-0.000644,-0.000145,0.000102,-0.000212,-4.7e-05,-0.000211,0.000119,0.000173,6.6e-05,0.000519,0.000481,-0.000405,-5.7e-05,-0.000405,-0.000132,5.5e-05,-6.1e-05,-0.000236,-0.000205,-0.000286,-8.3e-05,-0.000299,-2.9e-05,-0.000239,3e-06,-0.00014,-6.8e-05,4e-06,6.4e-05,-5.9e-05,-3.9e-05,-0.000105,-5.3e-05,-0.000191,-2e-05,3e-05,-0.000156,9.6e-05,3e-06,-6.1e-05,6e-05,7.9e-05,-0.000137,-5.3e-05,-2e-06,-1e-06,-2e-06,-1e-05,-5.3e-05
-2.9e-05,-3.7e-05,-8e-06,1.9e-05,-1.8e-05,-1.6e-05,2.2e-05,6e-06,-7e-05,2e-06,-5e-05,-2e-06,5e-06,3e-05,2.6e-05,-5.3e-05,5.4e-05,-3.8e-05,5.3e-05,-9.5e-05,-2e-05,-0.000113,9e-05,-4.1e-05,0.000104,-0.000114,3.9e-05,0.000203,0.000294,-0.000266,-0.000553,0.000369,0.000154,-0.000587,9.8e-05,-0.001305,-0.002048,0.00265,0.000154,-0.00104,0.000203,0.000731,-0.002308,-0.001004,-0.000526,-0.001014,-0.001,0.000328,-0.002242,0.001848,-0.002423,-0.001355,0.001912,-0.001095,-0.000166,0.00041,0.00022,0.000211,0.000412,0.00059,0.000701,0.000118,0.000824,0.00206,0.000539,0.000235,-0.000449,0.00023,0.000508,-0.000652,-0.000854,-0.000695,-6.3e-05,4.8e-05,-0.000213,0.000418,4.6e-05,-0.000155,-3.3e-05,8e-05,4.9e-05,-0.000203,0.000195,4.7e-05,-9.3e-05,0.000136,2.6e-05,4e-06,-0.000102,-8e-05,-0.000141,0.000122,-7.4e-05,-9.6e-05,-0.000218,-0.000146,-0.000118,-3.2e-05,-2.3e-05,-4e-06,3e-05,-5.4e-05,2.6e-05,-6.7e-05,1.6e-05,-1.3e-05,-0.000107,-6.2e-05,-7.1e-05,-5.6e-05,6.2e-05,-4.4e-05,8e-06,-3.9e-05,-1.2e-05,-3.6e-05,-5e-06,-4e-06,2.8e-05,2.7e-05,-5e-05
-2.6e-05,-3.8e-05,2.1e-05,-4.3e-05,-1.1e-05,-1.1e-05,-1.7e-05,-2e-05,-6.2e-05,6e-06,-9.1e-05,-4.4e-05,1e-05,-9e-06,4e-06,7e-06,7e-06,-1.4e-05,-6.8e-05,-1.9e-05,-5.3e-05,-0.000115,-4.6e-05,0.000115,-9.8e-05,1.7e-05,-5.8e-05,7.2e-05,-0.000229,-3.6e-05,2.9e-05,-0.000681,-0.000225,-0.000859,9.3e-05,0.001165,-0.000482,-0.001068,5.8e-05,0.000548,0.000487,0.000481,0.001419,-0.00028,0.001319,0.000541,-0.000387,0.000624,0.000627,-0.000174,0.000735,0.000408,-0.001174,0.001855,-0.000358,-0.001929,-0.000575,0.000236,0.000259,-0.000785,-9.9e-05,-0.000204,3.8e-05,0.000119,-0.000393,-0.000509,0.00117,-0.000667,-0.000298,0.000609,0.000432,0.000244,9.6e-05,-0.000166,-6.7e-05,-0.000307,-1.1e-05,-0.000274,-3.3e-05,2.8e-05,-3.7e-05,-0.00038,0.000288,-0.000121,0.00013,0.000331,2.9e-05,0.000142,-4.9e-05,-8.4e-05,-4.2e-05,-2.7e-05,-9.5e-05,2.7e-05,9e-05,2.6e-05,-3e-05,-2.6e-05,-1.7e-05,0,-6e-06,-2.8e-05,-5.3e-05,2.7e-05,-5.5e-05,4.4e-05,-4.4e-05,-1.8e-05,-4.9e-05,-3.8e-05,3.1e-05,-2.4e-05,-3e-06,-0.000106,-4.3e-05,-3.7e-05,-2.1e-05,1e-05,1.5e-05,-9e-06,-7.8e-05
-3.4e-05,2.6e-05,2e-05,-1.3e-05,-3e-05,4e-06,-1.4e-05,-4.7e-05,-8.6e-05,-1.3e-05,-2.9e-05,0,1.2e-05,5e-06,4.5e-05,8e-06,-1.4e-05,-5.3e-05,-1.5e-05,-1.3e-05,-1.2e-05,-4.7e-05,6.1e-05,-0.000117,-5e-06,-5.2e-05,-6.6e-05,-3.8e-05,0.000183,-0.000187,-0.00021,0.000444,0.000214,-0.000586,0.000225,0.001489,0.001825,-0.000407,-0.000146,0.000392,-0.000121,-0.000311,-0.001273,-0.000129,-0.000515,-8.7e-05,0.002822,-0.000432,-0.001249,0.000492,-3.9e-05,-0.001269,7e-05,-0.001301,0.001134,9.3e-05,0.000969,-0.000511,-0.001012,0.000224,0.000696,0.00075,-2.4e-05,-0.001114,0.000322,0.000138,-0.000168,-0.000163,0.000112,-0.000103,9.2e-05,-6.4e-05,-0.000121,0.000181,-0.000154,0.000121,6.1e-05,4.9e-05,-5.5e-05,-2.1e-05,-9e-06,-5.4e-05,0.000484,0.000114,0.000117,6.3e-05,2.9e-05,7.7e-05,-0.000128,-3.6e-05,7.7e-05,6.2e-05,2.4e-05,1.7e-05,2e-06,9.1e-05,-2.4e-05,-3.8e-05,-2e-06,-1.3e-05,-2.9e-05,5.6e-05,2.1e-05,1.8e-05,-2.4e-05,-2e-06,-1.5e-05,-3e-06,1e-06,-3e-05,1.7e-05,-2e-06,-2.9e-05,3.3e-05,-7e-06,3e-06,-3.5e-05,3.9e-05,6e-06,9e-06,-9e-06
5e-06,-3.3e-05,-5e-06,-6e-06,1.9e-05,5e-06,-6e-06,2.4e-05,-2.6e-05,-6e-06,-9e-06,2.1e-05,3e-06,-2.2e-05,-2.9e-05,-4.5e-05,-5e-05,-2e-06,1.4e-05,-5.7e-05,-2e-06,-6e-05,3.8e-05,1.9e-05,4.5e-05,5.9e-05,5.4e-05,7.2e-05,-3.8e-05,8.4e-05,8.4e-05,-0.000301,-0.000308,0.000345,0.00023,0.000619,-0.000801,-6.7e-05,0.000619,-0.000176,0.000109,-0.000147,0.000775,0.000871,-0.000226,-0.000141,-0.000997,-0.000548,0.000999,-0.000954,0.000223,0.00095,0.000547,0.000358,-0.000644,-0.000843,-0.000663,-0.000838,0.001307,0.000282,-7e-04,-0.000776,0.000311,0.000801,0.000265,3.7e-05,8.8e-05,-5.2e-05,-0.000395,-4.6e-05,-0.000147,0.000277,0.000194,-0.000153,0.000256,-8.7e-05,-2.5e-05,-8e-06,-6e-06,-6e-05,-8e-06,-0.000122,-0.000148,7.4e-05,1.6e-05,-7.4e-05,2.1e-05,-0.000186,0.000137,3.4e-05,-1e-06,-2.6e-05,-6e-05,1.2e-05,-1.2e-05,8e-06,8e-06,-1.5e-05,1.6e-05,-7e-06,-7e-06,-4e-06,-1.6e-05,2.3e-05,-1.3e-05,-2.1e-05,-1.9e-05,-5e-06,-3.1e-05,4e-05,1e-06,3.8e-05,-3e-05,-3.6e-05,-4e-06,-2.2e-05,-3.9e-05,2.4e-05,1.9e-05,4e-06,-7e-06
1.1e-05,8e-06,1.5e-05,0,-1.3e-05,2e-06,3e-06,1.8e-05,9e-06,1.2e-05,1.9e-05,4e-06,1e-06,-2.4e-05,9e-06,3.6e-05,3e-05,-8e-06,-4e-06,-1e-05,1.6e-05,2.4e-05,-0.000132,-7.9e-05,4.1e-05,9.2e-05,0.000105,6e-06,-6.3e-05,5e-06,3.2e-05,0.000279,0.000315,0.00014,1.5e-05,-0.001287,8.2e-05,-0.000726,0.000176,0.000384,-8.5e-05,-8.1e-05,0.000469,-0.000215,8.1e-05,0,0.000551,0.000462,-0.000135,0.000402,0.00035,0.000157,-0.000335,0.000254,-0.000609,0.000579,-0.000125,0.00079,-0.000291,0.000409,0.000407,0.00155,-0.00054,-0.000226,0.000104,-0.000531,-0.000691,-0.000158,0.000364,6.6e-05,0.000135,4.9e-05,-9.6e-05,-0.000143,-4.9e-05,0.000115,2.8e-05,-2.9e-05,-5.5e-05,1.6e-05,-1.3e-05,0.000248,-0.000246,9e-06,5.3e-05,-0.000116,-3.9e-05,-0.000117,0.00014,-4.1e-05,-1e-05,-6.7e-05,6.3e-05,-2.8e-05,-5e-06,1.7e-05,3.2e-05,-1e-05,-3e-06,-4e-06,-5e-06,5.6e-05,-3e-06,-1.5e-05,2.9e-05,8e-06,3.4e-05,-2.5e-05,-1.9e-05,5.2e-05,-1.4e-05,9e-06,6e-06,1.5e-05,-1.6e-05,3.4e-05,-2.1e-05,2.6e-05,-9e-06,-6e-06,2e-06
-1.1e-05,9e-06,-3e-06,3e-06,1.6e-05,-8e-06,-2e-06,4e-06,4e-06,2e-06,6e-06,9e-06,1e-06,1.6e-05,-8e-06,-7e-06,-4.2e-05,1e-06,3e-06,2e-06,5e-06,2.9e-05,2.1e-05,6.4e-05,-8.4e-05,-0.000123,-3.8e-05,-1e-05,6e-05,3.2e-05,-2.5e-05,-0.000213,-9.9e-05,-0.00013,0.000161,0.001158,0.000415,0.000743,-6.6e-05,-0.000706,0.000232,-0.000134,0.000595,0.000147,-0.000115,-8e-05,-0.000296,-0.000858,0.000293,-0.00057,0.000144,-7.1e-05,1.6e-05,-0.000387,0.000164,3.5e-05,0.000422,-0.000805,-0.000639,0.000315,0.000475,-0.001197,-0.000221,-0.000247,-0.000368,0.00022,0.000267,0.000309,-0.000197,-3.6e-05,5.9e-05,-8.9e-05,7.2e-05,0.000146,4.7e-05,-6.3e-05,-4.3e-05,2.6e-05,-4.1e-05,2.6e-05,-6e-06,0.000182,-9.7e-05,5e-06,7.9e-05,-5.4e-05,2.7e-05,-1.8e-05,3.1e-05,2e-05,8e-06,5.2e-05,8e-06,-6.1e-05,1.4e-05,-5.8e-05,0,3e-06,1.9e-05,-8e-06,0,4.7e-05,0,-6e-06,6e-06,4e-06,4e-06,3e-06,2.9e-05,2e-05,-9e-06,6e-06,9e-06,-4e-06,-2.5e-05,-2.5e-05,3e-06,-8e-06,1.1e-05,-5e-06,-2e-06
6e-06,-1e-05,-1.4e-05,2e-06,-3e-06,2e-06,-7e-06,-5e-06,6e-06,-2e-06,2e-06,-6e-06,-4e-06,2e-06,-1.5e-05,-6e-06,4e-05,-3.9e-05,-5e-06,-8e-06,-2e-06,9e-06,-7e-05,-5.6e-05,-2.1e-05,8.3e-05,-2e-06,4.6e-05,-5.2e-05,-6e-06,0.000211,0.000136,4e-05,0.000128,0.000201,-0.000652,-9.4e-05,8.7e-05,-0.000413,0.000129,4.9e-05,7e-05,-0.000761,-0.000204,4.9e-05,-9.3e-05,0.000341,-0.000219,-0.000391,0.000623,-0.00033,-0.000307,-1.4e-05,-5.5e-05,0.000349,0.000733,-0.000222,5.6e-05,1.4e-05,-0.000133,-0.000218,0.000575,0.000378,3.2e-05,-0.000136,-5.4e-05,-0.000183,5.3e-05,0.000207,-5e-05,-0.000108,-1.8e-05,-4.5e-05,2.5e-05,-5e-06,0.000119,2.8e-05,1.2e-05,-5.4e-05,-1.4e-05,2e-05,-2e-06,0.000254,2.7e-05,2.7e-05,-5.3e-05,-4.3e-05,0,-3.9e-05,-2.5e-05,-1e-06,-4.3e-05,1.9e-05,-4e-06,-1.6e-05,-1.5e-05,-7e-06,-1.4e-05,-1e-05,-7e-06,-3e-06,-2.4e-05,1e-06,0,-2e-05,-1.6e-05,-1.9e-05,-4e-06,1.7e-05,-1.1e-05,-2e-06,5e-06,-2e-06,-3e-06,-3.7e-05,3e-06,7e-06,-9e-06,2e-06,2e-06,6e-06
-5e-06,-1.1e-05,1e-06,6e-06,1e-05,-1e-06,5e-06,-4e-06,8e-06,-3e-06,-2e-06,5e-06,-1e-06,4e-06,1e-05,3e-06,-1.3e-05,5e-06,8e-06,-1.1e-05,-3e-06,1e-05,-4e-06,5.3e-05,4.7e-05,-4.3e-05,1.4e-05,-2.9e-05,5.5e-05,-8.3e-05,-8.5e-05,-0.000117,-2e-05,8.7e-05,4.2e-05,0.000513,0.000113,4.9e-05,0.000303,-0.000134,-0.000257,0.000132,-0.000147,5.1e-05,-0.000148,-0.000101,-0.000231,0.000511,3e-04,-0.000297,0.000256,0.000182,-2.1e-05,0.000239,-0.000305,-0.000417,-2.7e-05,-0.000499,0.000118,6e-05,-8.1e-05,-7e-05,-0.000184,-0.000303,4.8e-05,0.000147,0.000112,-4.2e-05,-0.000132,-5.1e-05,7.5e-05,-7.8e-05,-1.9e-05,3e-05,3.2e-05,-4.2e-05,-6e-06,-3.5e-05,-2.7e-05,-1.2e-05,-2.8e-05,-0.000191,0.000103,-5.4e-05,-7e-06,1.3e-05,-3e-06,4.5e-05,-6.1e-05,-1.5e-05,-1e-05,0,-2e-06,4.3e-05,1e-05,-3.6e-05,-1e-05,-1.8e-05,-4e-06,-7e-06,1.1e-05,-1.1e-05,-1e-06,-9e-06,-8e-06,-2.2e-05,-3.1e-05,-4e-06,1.5e-05,-4e-06,2.4e-05,-8e-06,-2e-06,2e-06,-2.6e-05,-4e-06,1e-06,7e-06,2e-06,4e-06,-1.4e-05
5e-06,1.1e-05,-2e-06,-8e-06,-6e-06,0,5e-06,-1.6e-05,6e-06,0,-3e-06,-1.1e-05,-2e-06,-4e-06,1e-06,9e-06,-9e-06,-1.8e-05,-1.8e-05,-2.1e-05,-3e-06,-2e-06,1.2e-05,-2.7e-05,-3.4e-05,-9e-06,-3e-05,-1e-06,-2.5e-05,-1.5e-05,6.1e-05,0.000101,1e-06,4.5e-05,3e-05,0.000297,-0.00049,0.000279,-0.000177,8.5e-05,-4.4e-05,1.3e-05,-5.4e-05,-0.000237,6.4e-05,-2.8e-05,-4.3e-05,-2.1e-05,-0.000282,0.000208,-0.000419,-0.000436,-8.8e-05,0.000199,0.000101,3e-04,9.5e-05,0.000319,-8e-05,-0.000131,-0.000127,-9e-05,-3.6e-05,0.000118,0.00012,-7.2e-05,-0.000157,7e-05,9e-05,0.000109,-2.1e-05,7.4e-05,0.000103,-1.2e-05,-4.7e-05,6.3e-05,3.7e-05,8e-06,1.9e-05,9e-06,-4e-06,-9.8e-05,1e-06,-5.3e-05,-2.3e-05,7e-06,1.4e-05,2.6e-05,-3.1e-05,-2.1e-05,-1.2e-05,1.7e-05,-2.1e-05,-1.6e-05,2e-06,-9e-06,-3e-06,-8e-06,-2e-06,0,3e-06,-2e-06,-4e-06,8e-06,1e-06,-1.1e-05,-1.2e-05,-6e-06,-2.2e-05,-1e-06,1.6e-05,-8e-06,0,4e-06,-1e-06,2e-06,-8e-06,5e-06,4e-06,4e-06,-7e-06
-9e-06,-1.5e-05,-3e-06,0,-2e-06,0,-2e-06,-1e-06,2e-06,3e-06,3e-06,-3e-06,0,-8e-06,-4e-06,-1.1e-05,9e-06,-4e-06,2e-06,-1.1e-05,-4e-06,-3e-06,-2.5e-05,6e-06,1.5e-05,-6e-06,-3.1e-05,1.5e-05,-1e-06,-4e-06,-7e-06,-0.00011,5e-06,4.4e-05,3.3e-05,-0.000971,4e-05,-0.000641,-4.2e-05,6.3e-05,-6.4e-05,-1.6e-05,-8.2e-05,0.000143,2.7e-05,-1e-04,-0.000246,-8.2e-05,3e-06,-0.000277,2.9e-05,7.2e-05,-0.000135,-6.1e-05,0.00014,-1.8e-05,0.000134,0.00021,-8.2e-05,-0.000189,-7e-06,0.000434,1.3e-05,0.000284,-5.6e-05,7.5e-05,0.000212,-4.6e-05,-5.3e-05,-0.000113,-3e-05,-3.8e-05,-0.000111,-1.1e-05,-1.3e-05,-9.9e-05,-3.4e-05,9e-06,3.7e-05,6e-06,1e-05,4.5e-05,-9.2e-05,3.3e-05,0,7.1e-05,-8e-06,3.2e-05,3e-06,-9e-06,-2.7e-05,-1.5e-05,-8e-06,-2.9e-05,-7e-06,-4e-06,-6e-06,-6e-06,2e-06,4e-06,-4e-06,-6e-06,3e-06,-4e-06,-1e-06,3e-06,-2.1e-05,-2e-06,-5e-06,9e-06,1e-05,-3e-06,1e-06,-1.9e-05,-7e-06,-7e-06,-1.7e-05,1.6e-05,8e-06,-2e-06,-7e-06
6e-06,4e-06,6e-06,-3e-06,-3e-06,0,-5e-06,1.1e-05,-5e-06,-1e-06,-6e-06,1e-06,-3e-06,2e-06,3e-06,-2e-06,-9e-06,-7e-06,2e-06,-1.1e-05,0,-1.1e-05,8.2e-05,-1e-06,-7e-06,1.6e-05,1.6e-05,-9e-06,1e-05,3e-05,-6.7e-05,9.7e-05,3.8e-05,0,-1.5e-05,-0.000326,4.9e-05,0.000196,0.000238,-0.000107,7.4e-05,-2.6e-05,0.000159,0.000106,-0.000128,5.6e-05,7e-05,0.000174,0.000128,0.00021,0.000237,0.000143,-0.000108,6.5e-05,4.4e-05,-0.00016,0.000104,-0.00026,0.000197,-2.8e-05,-3.5e-05,-0.000284,-0.000153,-0.000275,8.2e-05,9.1e-05,-4.8e-05,-7.4e-05,4.7e-05,5.8e-05,-4e-06,2e-06,6e-06,-7.3e-05,1.7e-05,5.8e-05,-9e-06,-6e-06,1.8e-05,-1e-06,-5e-06,9e-05,-0.000108,-4.6e-05,2.4e-05,3.1e-05,8e-06,-2.4e-05,-1e-05,-1e-05,-9e-06,1.2e-05,-1.1e-05,-8e-06,8e-06,-3e-06,-2e-06,-6e-06,4e-06,-4e-06,-1e-05,1.5e-05,0,-1e-06,-1.2e-05,1.2e-05,7e-06,8e-06,-5e-06,1.3e-05,-4e-06,1e-06,-1e-06,-3e-06,-4e-06,-6e-06,-1.3e-05,1.5e-05,4e-06,0,-5e-06
2e-06,2e-06,0,-4e-06,2e-06,1e-06,1e-06,7e-06,-3e-06,-2e-06,-7e-06,4e-06,-1e-06,-1e-06,-5e-06,4e-06,0,1e-06,-5e-06,-8e-06,2e-06,-9e-06,-2.8e-05,-4e-06,1.1e-05,1.7e-05,4e-06,-4e-06,-3.7e-05,1.2e-05,-4.1e-05,-5.7e-05,-1.4e-05,-6.3e-05,4.1e-05,0.000433,-0.000189,0.000127,-2e-06,3.5e-05,0.000126,-4.2e-05,0.000344,2.8e-05,-0.00014,1.5e-05,0.000152,6.3e-05,-7.5e-05,-0.000385,-0.000247,-6.3e-05,1.9e-05,0.000185,-5.1e-05,-1.7e-05,-0.000224,-2e-06,7.1e-05,3.9e-05,6.9e-05,6.8e-05,-3.7e-05,-1e-05,-2.4e-05,-5.9e-05,0.000156,7.5e-05,-8.1e-05,-5.4e-05,-5.7e-05,-6.1e-05,-5e-06,2.6e-05,7e-06,-3e-06,-6e-06,-2.9e-05,1.5e-05,-5e-06,-4e-06,4.5e-05,-5.7e-05,0,-1e-05,-1.7e-05,0,-6.1e-05,2.5e-05,0,1.6e-05,-9e-06,7e-06,-1e-05,-8e-06,1.6e-05,0,-2e-06,-4e-06,-2e-06,-6e-06,6e-06,2e-06,4e-06,0,9e-06,2e-06,-8e-06,2e-06,2e-06,-1.2e-05,2e-06,-2e-06,9e-06,-9e-06,2e-06,-3e-06,2e-06,2e-06,-1e-06,-6e-06
2e-06,-4e-06,3e-06,2e-06,0,-1e-06,2e-06,-3e-06,-4e-06,1e-06,-9e-06,-6e-06,0,5e-06,-3e-06,-3e-06,2e-06,-8e-06,6e-06,-5e-06,0,-9e-06,8e-06,0,-1.7e-05,-1e-05,-1.3e-05,1.2e-05,4.5e-05,-1.1e-05,3e-06,4.5e-05,-4.6e-05,-2e-05,2.8e-05,0.000485,0.000327,-7.1e-05,-9.3e-05,1.9e-05,6.4e-05,-2.5e-05,-0.000317,-0.000143,-4.7e-05,7.3e-05,-0.00012,-9.4e-05,4.8e-05,-8e-06,0.000133,1.5e-05,-1.1e-05,-0.000142,-0.000156,-0.00013,5.1e-05,6.6e-05,-5.3e-05,-0.000105,9e-05,-0.000107,0.000134,0,1.2e-05,3.9e-05,-0.000224,6e-06,4.5e-05,6.3e-05,4.8e-05,-2e-06,-6e-06,-2e-06,1e-06,3.8e-05,2.3e-05,-1.3e-05,-4e-06,-2e-06,-2e-06,2.5e-05,4.6e-05,1e-05,-1.5e-05,2e-05,-9e-06,-2.7e-05,3e-05,0,-1e-06,4e-06,-2e-06,-3e-06,0,0,3e-06,-1e-06,2e-06,-4e-06,1e-06,7e-06,-2e-06,-4e-06,-1e-06,-1e-06,-5e-06,-3e-06,-8e-06,0,-7e-06,3e-06,-4e-06,2e-06,-7e-06,4e-06,3e-06,4e-06,1e-06,-2e-06,-4e-06
-3e-06,1e-06,0,-3e-06,1e-06,1e-06,0,-2e-06,-5e-06,0,-7e-06,0,-1e-06,-1e-06,1e-06,2e-06,-4e-06,-7e-06,3e-06,-1.1e-05,-2e-06,-6e-06,9e-06,4e-06,1.1e-05,1e-06,1.4e-05,-4e-06,-2e-05,-2.8e-05,-4.5e-05,-3.5e-05,2.3e-05,-2.6e-05,2e-05,-0.000239,0.000293,0.000122,-2.6e-05,-0.00017,0,-2e-06,-0.000253,5.5e-05,0.000115,4.8e-05,0.000343,-9.3e-05,-0.00015,6.1e-05,-4.5e-05,-0.000115,-3.9e-05,-6.8e-05,7.3e-05,0.00019,-7.1e-05,8.2e-05,6.8e-05,0,-9e-05,-0.000151,-2.8e-05,8.6e-05,5.1e-05,-3.3e-05,4e-06,-5.7e-05,-5e-05,-3.2e-05,2.6e-05,-2.2e-05,1e-05,4e-05,-1.7e-05,-8.7e-05,4e-06,-1e-05,-1e-06,5e-06,1e-06,-6.9e-05,9e-06,1e-05,8e-06,-5.5e-05,8e-06,1e-05,-2e-06,2e-06,-4e-06,-6e-06,9e-06,1e-05,-2e-06,2e-06,-2e-06,-2e-06,0,3e-06,4e-06,1.3e-05,-1e-06,7e-06,4e-06,-4e-06,-2e-06,5e-06,-3e-06,-6e-06,3e-06,2e-06,-1e-06,4e-06,-1.4e-05,-2e-06,2e-06,-1e-06,5e-06,0,-2e-06
-3e-06,3e-06,-3e-06,2e-06,2e-06,-1e-06,-2e-06,-8e-06,-3e-06,1e-06,0,0,0,-2e-06,-2e-06,-5e-06,1e-05,-9e-06,-1e-06,-5e-06,-1e-06,0,-3.6e-05,0,-2.1e-05,-1.6e-05,1.3e-05,-1e-06,-1.5e-05,-2e-05,2e-05,4.7e-05,-3e-06,-2.9e-05,3.3e-05,7e-06,-0.000301,-0.000121,-9e-05,0.000111,-5.6e-05,3.2e-05,0.000203,-7e-06,-6e-06,5.3e-05,-0.000275,4e-05,0.000182,0.00026,-1.3e-05,0.000119,1e-05,0.000222,5.4e-05,-0.000233,-0.000128,-0.000159,-2.1e-05,-4.9e-05,0.000131,0.000124,-7.7e-05,8e-06,-7.3e-05,1.1e-05,-0.000114,3e-05,5.3e-05,2.7e-05,-8e-06,-4e-06,-2e-05,4e-06,3.2e-05,5.2e-05,-1.3e-05,0,-7e-06,1e-06,-1e-06,-8.7e-05,-2.7e-05,-2.3e-05,-2e-06,-6e-06,-2e-06,0,-1.8e-05,-2e-06,-6e-06,-1e-05,-3e-06,-1.3e-05,0,-1.3e-05,0,-2e-06,-1e-06,-3e-06,3e-06,-8e-06,-2e-06,-3e-06,-1e-05,-1e-06,-1.6e-05,-3e-06,-5e-06,-3e-06,7e-06,1e-06,2e-06,-1.5e-05,-1.6e-05,-4e-06,-3e-06,-3e-06,3e-06,1e-06,-2e-06
2e-06,-7e-06,1e-06,-1e-06,0,0,1e-06,-3e-06,-2e-06,0,2e-06,2e-06,1e-06,0,2e-06,6e-06,-1e-06,-2e-06,-1e-06,1e-06,1e-06,0,1.8e-05,-1.1e-05,3e-06,2.9e-05,-7e-06,1e-06,3e-05,0,3.6e-05,-5.8e-05,-9e-06,1.1e-05,2.4e-05,0.000211,8.8e-05,0.000146,-7e-06,-8.9e-05,-5.2e-05,1.5e-05,-6e-06,5.9e-05,1.1e-05,-5e-05,0.000146,-3.4e-05,-0.000113,-9.3e-05,6.1e-05,-0.000106,1.5e-05,-0.000154,-7.6e-05,0.000214,5.6e-05,0.000215,-0.000154,-0.000168,-1.7e-05,-1.9e-05,5.9e-05,-0.000108,5.5e-05,-2.7e-05,0.000105,2e-06,-3e-05,-2.5e-05,3.1e-05,4e-06,4.2e-05,-1.6e-05,-6e-06,-9e-06,1e-06,-1.1e-05,-7e-06,-4e-06,3e-06,2.4e-05,-5.9e-05,3.9e-05,5e-06,6e-06,-3e-06,3.2e-05,1e-06,-3e-06,-7e-06,1.4e-05,1e-06,-2.2e-05,1e-06,-1.9e-05,-1e-06,-3e-06,-2e-06,-1e-06,1e-06,6e-06,4e-06,-3e-06,-1e-06,-4e-06,-2e-06,-2e-06,8e-06,7e-06,8e-06,-1e-06,3e-06,6e-06,-6e-06,3e-06,-5e-06,6e-06,0,2e-06,-3e-06
-1e-06,5e-06,-1e-06,0,0,0,2e-06,7e-06,1e-06,-1e-06,5e-06,-1e-06,-1e-06,-2e-06,2e-06,-2e-06,-1e-05,-3e-06,-1e-06,-1e-05,0,2e-06,-3.1e-05,1.4e-05,1e-05,-2.6e-05,2e-06,1e-06,-3.3e-05,6e-06,-4e-06,4.9e-05,-2e-06,1.8e-05,-9e-06,-0.000386,-4e-06,-3.2e-05,6.6e-05,4.4e-05,-6.1e-05,1.7e-05,0.000138,-2.9e-05,3.6e-05,1.9e-05,-0.000165,-8.3e-05,6e-06,-3e-05,-4.1e-05,0.000183,-2.1e-05,-1.2e-05,3.6e-05,-0.00017,1.9e-05,-0.000252,1e-05,-9.1e-05,-5.2e-05,5e-06,-6.1e-05,3.6e-05,-7.7e-05,-6.5e-05,3.4e-05,-4.7e-05,8e-06,-1.9e-05,-1e-05,-3e-06,-2.7e-05,4.6e-05,8e-06,2.7e-05,-2e-06,1e-05,-1e-06,0,-3e-06,6.8e-05,-3e-05,-2.9e-05,-3e-06,-4e-06,3e-06,1.2e-05,-1e-06,-6e-06,4e-06,-1.3e-05,-3e-06,1e-06,2e-06,-6e-06,2e-06,-2e-06,4e-06,0,0,0,-2e-06,1e-06,0,-7e-06,-4e-06,0,0,5e-06,2e-06,-1e-06,-2e-06,2e-06,-4e-06,1e-06,-5e-06,2e-06,4e-06,0,-1e-06
2e-06,-2e-06,-3e-06,0,-2e-06,0,-1e-06,5e-06,2e-06,1e-06,1e-06,0,1e-06,1e-06,-1e-06,-2e-06,7e-06,-1e-06,-2e-06,-5e-06,0,2e-06,1.9e-05,-1.9e-05,-7e-06,1e-05,2e-06,0,9e-06,6e-06,5.8e-05,-4.4e-05,5e-06,-1.3e-05,-1.1e-05,0.000197,-0.000263,-0.000116,-2.5e-05,0.000119,-1.9e-05,-9e-06,-1.7e-05,9e-06,-3.7e-05,-4.7e-05,0.000123,9.3e-05,-0.000135,1.3e-05,-7.7e-05,-8e-05,6.7e-05,0.000102,7.8e-05,0.000156,4.3e-05,0.000221,2.2e-05,-1.5e-05,-2.4e-05,3.3e-05,7e-06,7.2e-05,3.8e-05,3.6e-05,5.9e-05,5.2e-05,6e-06,9e-06,-3.6e-05,1e-05,-1.3e-05,-6e-05,-1.5e-05,-5.4e-05,4e-06,-2e-05,0,1e-06,-3e-06,3.6e-05,3e-06,-4e-06,-5e-06,2.8e-05,-1e-06,-1.3e-05,-4e-06,-5e-06,1e-06,6e-06,0,4e-06,-7e-06,-2e-06,-1e-06,0,-3e-06,0,-4e-06,-6e-06,1e-06,-3e-06,2e-06,-1e-06,1e-06,1e-06,4e-06,1e-06,-2e-06,0,-2e-06,-2e-06,-5e-06,-2e-06,-4e-06,4e-06,2e-06,-1e-06,-3e-06
-2e-06,-2e-06,3e-06,-1e-06,1e-06,0,-1e-06,-1e-06,1e-06,0,1e-06,0,1e-06,-1e-06,1e-06,2e-06,-3e-06,-3e-06,-1e-06,-5e-06,0,1e-06,1e-05,2.1e-05,-3e-06,2e-06,-1.1e-05,-6e-06,8e-06,-1.1e-05,-1.6e-05,2.5e-05,2.8e-05,1.2e-05,1e-06,0.000255,0.000167,0.000129,4.2e-05,-8.6e-05,2.4e-05,-9e-06,-2e-05,2e-05,-7e-06,-5e-06,-6.5e-05,1.3e-05,0.000248,-4.3e-05,9.7e-05,6.2e-05,-5.2e-05,-5.9e-05,-9e-05,1e-05,-4.1e-05,-2.3e-05,-9e-06,3.5e-05,8e-06,-4.6e-05,8.9e-05,1e-05,-5.7e-05,-3.5e-05,-5.6e-05,-1.5e-05,-1.7e-05,1.2e-05,3e-06,-1.9e-05,3.4e-05,-2.5e-05,5e-06,4.4e-05,-4e-06,1e-06,3e-06,0,2e-06,-4e-06,-1.2e-05,0,-5e-06,1e-05,2e-06,-2.2e-05,-1e-06,-4e-06,-9e-06,3e-06,-1e-06,-9e-06,2e-06,6e-06,-3e-06,-1e-06,0,2e-06,-4e-06,6e-06,-3e-06,5e-06,-4e-06,4e-06,-4e-06,0,-5e-06,-3e-06,-6e-06,0,1e-06,2e-06,-4e-06,-1e-06,-1e-06,4e-06,1e-06,-1e-06,-1e-06
2e-06,2e-06,0,2e-06,-1e-06,0,0,-2e-06,1e-06,0,-1e-06,1e-06,0,0,0,0,-2e-06,-5e-06,2e-06,-6e-06,0,0,-1e-05,-1.3e-05,3e-06,-4e-06,-5e-06,4e-06,0,-1.7e-05,9e-06,-2.1e-05,-2.3e-05,1.6e-05,4e-06,-0.00039,1.1e-05,-4.2e-05,5e-06,1e-06,5.7e-05,-1.9e-05,-0.000138,-4.5e-05,-5e-05,1.1e-05,5e-05,-5.9e-05,-0.000147,-9.5e-05,-5.8e-05,-0.000122,6.4e-05,-4.7e-05,-2e-06,2.5e-05,6.9e-05,-0.000161,6.1e-05,3.6e-05,-1.2e-05,-4.7e-05,3.5e-05,-4.2e-05,4.1e-05,5e-06,4e-06,-2.9e-05,4e-06,1.6e-05,9e-06,1.8e-05,-1.3e-05,1.7e-05,-5e-06,-1.2e-05,5e-06,-8e-06,-4e-06,0,0,-3.5e-05,-6e-06,2e-06,3e-06,-3e-06,1e-06,-1.1e-05,-4e-06,-1e-06,-5e-06,-5e-06,0,-5e-06,8e-06,2e-06,1e-06,-2e-06,-1e-06,-3e-06,-1e-06,-3e-06,3e-06,-1e-06,-2e-06,5e-06,-4e-06,-3e-06,1e-06,-5e-06,-4e-06,0,2e-06,-3e-06,-5e-06,-1e-06,1e-06,-1e-06,3e-06,-1e-06,-3e-06
-2e-06,0,-1e-06,-2e-06,1e-06,0,2e-06,-5e-06,1e-06,0,-1e-06,-1e-06,0,1e-06,-1e-06,-2e-06,7e-06,-3e-06,1e-06,-3e-06,0,-1e-06,2.3e-05,1e-05,3e-06,3e-06,9e-06,1e-06,-2e-06,-1.4e-05,-1.4e-05,2.1e-05,-5e-06,-5e-06,1.5e-05,-0.000175,-5.3e-05,3.2e-05,-6.5e-05,-6.5e-05,5.8e-05,-1e-05,-9e-06,-4.4e-05,5.8e-05,-1e-06,-0.000115,4.8e-05,4.5e-05,2.4e-05,-2.4e-05,1.5e-05,4.5e-05,2.5e-05,2.3e-05,-7e-05,4.5e-05,0.000131,4.8e-05,-1.8e-05,-5e-05,6.8e-05,4e-06,-2.7e-05,2.1e-05,-2e-06,-1e-06,5.9e-05,-5e-06,-2.7e-05,-1e-06,1e-05,-5e-06,3e-06,3e-06,1.5e-05,0,-3e-06,-5e-06,-1e-06,-1e-06,-4.1e-05,-1.4e-05,-2.1e-05,-1e-06,-2e-06,-2e-06,-5e-06,5e-06,1e-06,-1e-06,4e-06,0,-5e-06,-9e-06,2e-06,-1e-06,-1e-06,3e-06,0,3e-06,3e-06,-2e-06,-1e-06,0,3e-06,-6e-06,1e-06,0,1e-06,1e-06,0,0,4e-06,-1e-05,2e-06,2e-06,3e-06,1e-06,0,-1e-06
0,-3e-06,2e-06,1e-06,-1e-06,0,0,-3e-06,0,0,-1e-06,1e-06,0,-1e-06,1e-06,1e-06,-7e-06,-3e-06,0,-1e-06,0,-1e-06,-1.8e-05,-6e-06,-1e-05,-7e-06,-2e-06,-2e-06,-8e-06,-3e-06,-2.5e-05,-1.6e-05,7e-06,6e-06,3e-06,0.000167,0.000207,3.1e-05,-4.9e-05,-1.3e-05,1.2e-05,8e-06,0.00011,3.2e-05,2.6e-05,1.8e-05,0.000146,-1.1e-05,-5.4e-05,7.3e-05,1.9e-05,-5.3e-05,-1.8e-05,3.1e-05,-2e-06,-8.7e-05,-0.000101,-0.00011,-1.3e-05,-3.4e-05,7.8e-05,-9.8e-05,2.3e-05,5e-05,-2.1e-05,-3e-06,-1.7e-05,-2e-05,2e-06,2.6e-05,-3e-06,1.9e-05,-5e-06,4.4e-05,2e-06,-2.8e-05,-1e-06,-4e-06,-5e-06,1e-06,-1e-06,-7e-06,9e-06,1.9e-05,1e-06,-2e-05,-2e-06,8e-06,2e-06,2e-06,-1e-06,-6e-06,-1e-06,-1e-05,3e-06,-3e-06,1e-06,0,-2e-06,0,2e-06,4e-06,2e-06,2e-06,1e-06,-1e-06,-3e-06,1e-06,-1e-06,3e-06,4e-06,1e-06,-1e-06,-2e-06,-9e-06,-1e-06,-1e-06,-1e-06,1e-06,1e-06,-2e-06
0,4e-06,-1e-06,-1e-06,1e-06,0,-1e-06,4e-06,0,1e-06,-2e-06,0,0,0,0,1e-06,4e-06,-1e-06,1e-06,-8e-06,0,-2e-06,9e-06,4e-06,3e-06,1e-05,-3e-06,0,1.5e-05,3e-06,-2e-05,2e-05,3e-06,3e-06,-1e-06,0.000281,-0.000111,-3.4e-05,7.7e-05,9.5e-05,-2.8e-05,6e-06,9e-06,5.2e-05,2e-05,1e-06,-6.2e-05,-4.9e-05,3e-06,-2e-06,1e-05,6.4e-05,4.4e-05,-6.8e-05,-1.9e-05,5.4e-05,-2.5e-05,9.9e-05,-2.8e-05,2.8e-05,3.1e-05,6.5e-05,-2e-05,3.7e-05,5.3e-05,2.1e-05,-3.6e-05,-2.3e-05,-1e-06,-2.3e-05,-2e-06,-3e-06,4e-06,-1e-06,3e-06,3.3e-05,-5e-06,-1e-05,1e-06,0,1e-06,3.2e-05,7e-06,-7e-06,-3e-06,-9e-06,2e-06,1e-05,4e-06,1e-06,2e-06,5e-06,0,1e-06,4e-06,-1e-06,0,0,0,0,1e-06,-1e-06,-3e-06,-3e-06,-2e-06,-3e-06,0,-2e-06,-1e-06,1e-06,4e-06,0,-1e-06,-2e-06,-4e-06,-2e-06,-4e-06,0,3e-06,1e-06,-1e-06
1e-06,-3e-06,-1e-06,0,-1e-06,0,0,5e-06,-1e-06,0,-1e-06,0,0,-1e-06,0,-3e-06,1e-06,-2e-06,-1e-06,-2e-06,0,-1e-06,-1.1e-05,-9e-06,0,0,6e-06,1e-06,-1.6e-05,2e-06,-8e-06,-1.2e-05,-3e-06,-1.1e-05,-4e-06,-0.000101,-4.7e-05,5e-05,4e-06,-3e-06,-4.8e-05,1.2e-05,-6.6e-05,-3e-06,5e-06,1.4e-05,5e-05,2.7e-05,-7e-06,1.9e-05,1.1e-05,2.6e-05,-2e-05,1e-05,7e-06,-9.9e-05,-2.2e-05,-8e-05,-7e-06,-1.7e-05,-3.8e-05,-1.7e-05,-2.6e-05,-4.4e-05,-5e-05,-2.1e-05,-1.8e-05,2.9e-05,1.4e-05,1.2e-05,8e-06,2e-06,-3e-06,-3e-05,4e-06,-1.9e-05,5e-06,-7e-06,3e-06,0,0,4.1e-05,3e-06,-6e-06,-3e-06,1e-06,0,1.5e-05,-3e-06,-1e-06,-2e-06,-5e-06,0,2e-06,-2e-06,-7e-06,0,0,1e-06,0,-1e-06,3e-06,1e-06,2e-06,-2e-06,-2e-06,-2e-06,0,-3e-06,0,2e-06,1e-06,0,1e-06,-4e-06,0,-4e-06,2e-06,1e-06,1e-06,-2e-06
0,0,1e-06,1e-06,0,0,1e-06,0,-1e-06,0,-2e-06,0,0,0,1e-06,2e-06,-5e-06,-1e-06,-1e-06,-3e-06,0,0,-8e-06,7e-06,-1e-06,-2e-06,3e-06,-1e-06,5e-06,-4e-06,-7e-06,1e-05,4e-06,0,2e-06,-3.1e-05,0.000103,-5.3e-05,3e-06,1.9e-05,-3.5e-05,2e-06,7.9e-05,-3.7e-05,-2.8e-05,-2.3e-05,-5.9e-05,1.2e-05,4.8e-05,-3.1e-05,-9e-06,-1.6e-05,3.7e-05,4.8e-05,2e-06,0.000118,-1.3e-05,4.1e-05,-5.1e-05,1.4e-05,2e-05,-2.8e-05,3.5e-05,-3.2e-05,4.5e-05,2.3e-05,5.6e-05,-1.4e-05,-1.8e-05,1e-06,5e-06,3e-06,-1.7e-05,7e-06,-6e-06,1.4e-05,0,-5e-06,2e-06,-1e-06,0,0,-6e-06,9e-06,4e-06,1e-06,0,-8e-06,3e-06,-2e-06,-5e-06,1e-06,0,-1e-05,-4e-06,-5e-06,1e-06,-1e-06,0,-2e-06,-2e-06,-2e-06,-2e-06,-1e-06,0,-2e-06,1e-06,1e-06,1e-06,-2e-06,-2e-06,0,1e-06,2e-06,-6e-06,3e-06,-2e-06,0,1e-06,0,-1e-06
-1e-06,2e-06,-1e-06,-1e-06,0,0,0,-3e-06,0,0,0,0,0,0,0,-1e-06,5e-06,-4e-06,0,-1e-06,0,0,1.4e-05,-5e-06,0,-5e-06,-3e-06,0,1.2e-05,-1e-05,1.2e-05,-9e-06,2e-06,0,-7e-06,-2.8e-05,-0.000155,4e-05,-1e-05,-4.5e-05,-8e-06,0,-9.7e-05,-1.9e-05,-1.2e-05,2.1e-05,2.9e-05,1e-06,-5.1e-05,-2.7e-05,-2.8e-05,1.5e-05,-3e-06,-4.3e-05,2e-05,-5.6e-05,2e-06,-2.5e-05,-2.4e-05,5.2e-05,2.2e-05,7.7e-05,-4e-06,3e-05,-5e-05,-1e-06,3.8e-05,-1.3e-05,2.3e-05,9e-06,-3e-06,7e-06,2.5e-05,-1.6e-05,0,-2.4e-05,-1e-06,-4e-06,3e-06,1e-06,0,-3.2e-05,-5e-06,-1e-06,0,1e-05,0,-1.8e-05,-4e-06,-2e-06,1e-06,4e-06,1e-06,-7e-06,5e-06,-4e-06,0,-1e-06,-1e-06,1e-06,-2e-06,-1e-06,3e-06,-1e-06,0,-2e-06,-6e-06,0,0,-1e-06,-4e-06,0,1e-06,0,-4e-06,-1e-06,1e-06,2e-06,1e-06,0,-1e-06
0,-1e-06,1e-06,1e-06,0,0,-1e-06,-3e-06,-1e-06,0,1e-06,0,0,0,0,1e-06,-1e-06,-2e-06,0,-6e-06,0,0,-1.4e-05,3e-06,2e-06,5e-06,0,-1e-06,-1.6e-05,-9e-06,2e-05,4e-06,-6e-06,-8e-06,-2e-06,-0.000101,3.8e-05,4.9e-05,-2.8e-05,-5.8e-05,1.4e-05,-8e-06,-2e-05,5e-05,-1.6e-05,-2.2e-05,-3e-06,8e-06,1.3e-05,-2.9e-05,5.7e-05,-4.5e-05,-1e-05,-3.4e-05,-2.5e-05,6.7e-05,1.5e-05,5.4e-05,2.6e-05,2.4e-05,6e-06,-6.3e-05,-1e-06,3.6e-05,2.2e-05,-9e-06,2.7e-05,2.4e-05,-2.9e-05,-1.7e-05,2e-06,4e-06,-1e-05,-4e-06,1e-06,3.3e-05,-4e-06,-2e-06,2e-06,0,-1e-06,-2.6e-05,1e-05,-1e-05,-1e-06,4e-06,0,-4e-06,-3e-06,-1e-06,-2e-06,-5e-06,0,0,-2e-06,-1e-06,0,0,0,-1e-06,-1e-06,0,-3e-06,2e-06,-1e-06,0,-3e-06,-1e-06,2e-06,1e-06,-3e-06,0,-1e-06,-2e-06,-4e-06,-2e-06,2e-06,1e-06,1e-06,-1e-06,-1e-06
0,-1e-06,1e-06,-1e-06,0,0,0,-3e-06,0,0,2e-06,0,0,0,0,-1e-06,-2e-06,-3e-06,0,-2e-06,0,0,1.6e-05,3e-06,-3e-06,0,-1e-06,1e-06,8e-06,-4e-06,1.2e-05,-9e-06,1e-06,3e-06,-5e-06,0.00018,8.8e-05,-4.7e-05,1.2e-05,4.3e-05,2.5e-05,-3e-06,0.000108,-1.7e-05,1e-05,-2e-06,-1e-06,-5e-06,4.5e-05,4.4e-05,3e-06,1e-06,1.1e-05,7.1e-05,-3e-06,2.6e-05,6.6e-05,-4.6e-05,3.2e-05,2.3e-05,-5.1e-05,4.9e-05,1.3e-05,-2.5e-05,-2.1e-05,-4e-06,-7.7e-05,-1.2e-05,2.7e-05,0,-7e-06,-2e-06,-1e-05,1.5e-05,5e-06,-2.4e-05,3e-06,-3e-06,2e-06,0,1e-06,-4e-06,1.8e-05,3e-06,-1e-06,-5e-06,0,4e-06,-2e-06,-1e-06,-2e-06,5e-06,0,-4e-06,-1e-06,5e-06,0,0,2e-06,0,1e-06,-2e-06,2e-06,-3e-06,-1e-06,3e-06,-3e-06,0,-2e-06,1e-06,0,0,-1e-06,0,-5e-06,1e-06,0,-1e-06,1e-06,0,-1e-06
1e-06,3e-06,-1e-06,1e-06,0,0,1e-06,2e-06,0,0,1e-06,-1e-06,0,0,0,0,4e-06,-1e-06,1e-06,-3e-06,0,0,-4e-06,-6e-06,2e-06,-5e-06,-4e-06,1e-06,-1e-06,0,2.1e-05,3e-06,-5e-06,2e-06,5e-06,-6e-06,-9.3e-05,3.7e-05,1.5e-05,0,2.8e-05,-2e-06,-4.7e-05,-9e-06,1.2e-05,-4e-06,-1e-05,-7e-06,-6.4e-05,-2e-06,-3.5e-05,-2.3e-05,-1.2e-05,-3.7e-05,2.3e-05,2.1e-05,-1.5e-05,1.5e-05,1.3e-05,1e-06,1.9e-05,-3e-05,-1e-05,-2.7e-05,-4e-06,-8e-06,-1.1e-05,-1.4e-05,-3e-05,7e-06,-8e-06,-1e-06,5e-06,-1.3e-05,-7e-06,1.2e-05,3e-06,0,0,0,0,1.4e-05,9e-06,4e-06,2e-06,-1e-06,1e-06,-1e-06,1e-06,0,-1e-06,-4e-06,0,-3e-06,1e-06,3e-06,0,0,-2e-06,-1e-06,2e-06,2e-06,-2e-06,2e-06,0,4e-06,-1e-06,1e-06,2e-06,1e-06,3e-06,0,0,2e-06,-9e-06,1e-06,-2e-06,0,0,0,-1e-06
0,-3e-06,1e-06,0,0,0,0,5e-06,0,0,0,0,0,0,0,2e-06,-3e-06,-1e-06,0,-3e-06,0,0,3e-06,7e-06,1e-06,3e-06,-1e-06,-2e-06,0,1e-06,-4e-06,-5e-06,4e-06,-4e-06,3e-06,-0.000145,7.8e-05,-3e-06,-1.6e-05,3.6e-05,2e-05,-2e-06,3e-06,-1.6e-05,1.4e-05,-1.2e-05,8e-06,-7e-06,4e-05,1.9e-05,2.5e-05,7.4e-05,-4e-06,-3.4e-05,-1.7e-05,3e-06,1.2e-05,1.3e-05,2.9e-05,-3.4e-05,2.4e-05,-7e-06,-2.9e-05,1e-06,1.7e-05,7e-06,-3e-05,2.8e-05,2.7e-05,-3e-06,1e-06,-1e-05,1e-05,2.8e-05,-2e-06,-1.9e-05,-1e-06,-1.3e-05,-2e-06,0,0,3.2e-05,-3e-06,-1.5e-05,0,-5e-06,-1e-06,8e-06,5e-06,0,-3e-06,1e-06,-1e-06,-2e-06,-2e-06,1e-06,0,0,0,0,2e-06,0,2e-06,0,-1e-06,1e-06,1e-06,0,-2e-06,-1e-06,3e-06,0,1e-06,0,-6e-06,0,-3e-06,-1e-06,1e-06,0,-1e-06
0,1e-06,0,-1e-06,0,0,-1e-06,1e-06,0,0,-1e-06,0,0,0,0,-2e-06,-1e-06,-1e-06,0,-3e-06,0,0,5e-06,-6e-06,-2e-06,-1e-06,3e-06,2e-06,4e-06,-3e-06,-2e-06,5e-06,2e-06,3e-06,5e-06,-5.2e-05,7e-06,7e-06,2.8e-05,1.1e-05,0,2e-06,9e-06,3.5e-05,2e-05,9e-06,-5e-06,4e-06,-5.6e-05,8e-06,2.2e-05,-4.9e-05,-2.3e-05,3.4e-05,-2e-06,-7.5e-05,3e-05,-4.7e-05,-2e-06,8e-06,-1.7e-05,1.2e-05,-2e-06,3.9e-05,-3e-05,-4e-06,5.2e-05,-1.3e-05,-2.5e-05,1.2e-05,7e-06,-3e-06,-1.1e-05,1.5e-05,3e-06,2.8e-05,-4e-06,1e-06,-2e-06,1e-06,0,1.2e-05,-3e-06,1e-05,-1e-06,-2e-06,-1e-06,8e-06,-3e-06,0,0,2e-06,0,-8e-06,2e-06,-3e-06,0,-1e-06,0,1e-06,0,-1e-06,-1e-06,-1e-06,0,-1e-06,-2e-06,-1e-06,2e-06,-1e-06,1e-06,0,0,-3e-06,-3e-06,-2e-06,-2e-06,0,1e-06,0,-1e-06
0,1e-06,-1e-06,1e-06,0,0,0,-3e-06,0,0,-1e-06,0,0,0,0,0,4e-06,-3e-06,0,-1e-06,0,0,-1.4e-05,4e-06,-3e-06,6e-06,1e-06,0,-6e-06,-7e-06,-1.5e-05,-3e-06,-3e-06,3e-06,-9e-06,4.6e-05,-7.6e-05,3.7e-05,5e-06,-4.1e-05,-2.3e-05,0,-2.4e-05,-5e-06,-2.5e-05,-4e-06,5e-06,5e-06,4e-05,3e-06,4e-06,2.7e-05,-9e-06,1.3e-05,1.7e-05,6.1e-05,-3.4e-05,0.000114,-2.4e-05,3e-05,1.4e-05,-1.1e-05,7e-06,4e-06,4.5e-05,-8e-06,-2.1e-05,-1.5e-05,2.5e-05,-1.2e-05,3e-06,-6e-06,-4e-06,-2.5e-05,2e-06,-2e-05,0,-6e-06,-1e-06,0,0,-1.5e-05,8e-06,-2e-06,0,8e-06,1e-06,-5e-06,2e-06,0,-1e-06,-5e-06,0,-5e-06,-1e-06,-4e-06,0,0,2e-06,-1e-06,-1e-06,1e-06,2e-06,2e-06,-1e-06,-2e-06,-2e-06,0,-3e-06,0,-2e-06,0,0,2e-06,-3e-06,0,1e-06,1e-06,0,0,-1e-06
