0.000345,0.000203,9e-05,0.001587,0.001302,1.5e-05,0.000164,0.000705,0.000924,0.00163,0.001327,0.00095,0.000896,0.000614,0.000249,0.000463,0.001589,0.000942,0.00021,0.000185,0.000286,0.000543,0.000204,-0.000199,-0.00011,-0.000218,-0.000126,6.1e-05
-0.000287,-0.000243,-0.000713,0.000143,0.000126,-0.000713,-0.000763,-0.000697,-2.7e-05,0.000111,0.000237,0.000344,0.000397,5.9e-05,-0.000574,-0.000368,0.000538,0.000149,-0.000151,-0.000444,-0.000253,0.000116,0.000172,-8.2e-05,-0.000195,-0.000264,8.5e-05,0.000123
-0.000557,-0.000334,-6e-04,-0.000391,-0.000347,-0.000747,-0.000977,-0.001185,-0.000314,-0.000447,-0.000162,1e-05,-0.000136,-6.2e-05,-0.000689,-0.000581,-0.000237,-0.000523,-0.000504,-0.00087,-0.000518,-0.000237,-0.000169,-0.000168,-0.000396,-0.000478,-0.000284,-0.000342
-0.000485,-0.000193,-3.8e-05,-4e-05,-7.5e-05,-0.000193,-0.000621,-0.000913,-4.8e-05,-0.000434,-0.000267,-6.9e-05,-0.000373,0.00018,-0.000245,-0.000187,-0.000433,-0.000801,-0.000581,-0.000735,-0.000313,-0.000341,-0.000344,-0.000192,-0.000361,-0.000374,-0.000376,-0.000407
-0.000233,-4.4e-05,0.000254,0.000469,0.000317,0.000315,-0.000277,-0.000546,0.000121,-0.000815,-0.000737,-0.000134,-0.00024,0.000469,0.000194,0.000262,-0.000365,-0.000835,-0.000373,-0.000152,0.000137,-0.000256,-7.4e-05,0.000145,7e-06,-2.3e-05,0.000292,0.000201
-0.000115,-0.00012,-6e-05,7.7e-05,-0.000223,0.000212,-0.000445,-0.000581,-0.00025,-0.001982,-0.001708,-0.000523,-0.000283,0.000308,0.000124,6.5e-05,-0.000623,-0.001022,-0.000431,2e-05,3.6e-05,-0.000498,-0.000351,-0.000283,-0.000377,-0.000809,-0.000212,-0.000309
-0.000133,-0.000241,-0.000301,-0.00054,-0.001142,-0.000136,-0.000505,-0.000373,-0.00043,-0.00258,-0.002064,-0.000612,-0.000309,-4.4e-05,-0.000155,-0.000291,-0.000701,-0.000908,-0.000458,-2e-06,-0.000198,-0.000619,-0.000507,-0.00075,-0.000756,-0.001201,-0.000881,-0.000669
-0.000151,-0.00024,8e-06,-0.00065,-0.001651,-0.000454,-0.000272,-1.8e-05,-0.000272,-0.00201,-0.001454,-0.000259,-0.000143,-0.000174,-0.000302,-0.000328,-0.000505,-0.000376,-0.000115,9.6e-05,-8.9e-05,-0.00029,-1.5e-05,-0.000311,-0.000286,-2.6e-05,-9e-05,0.000205
-0.000114,-0.000213,0.000445,-0.000703,-0.001871,-0.00064,-0.000116,1.6e-05,-0.000122,-0.001019,-0.000666,-9.3e-05,-0.000174,-0.000178,-0.000306,-0.000268,-0.00047,0.000104,0.000179,-3.9e-05,-1.6e-05,1.3e-05,6.8e-05,-2.4e-05,0.000132,0.001014,0.000619,0.000486
2.1e-05,-0.000225,0.000482,-0.000839,-0.001742,-0.000442,1.2e-05,-0.000108,-0.000101,-0.000288,-0.000174,-0.000234,-0.000449,-0.000184,-0.000167,-0.000213,-0.000516,0.000345,0.000243,-0.00024,-6.2e-05,0.000186,-0.000171,-0.000185,4.1e-05,0.000812,0.00016,-5e-05
0.000227,-0.000212,7.8e-05,-0.000951,-0.001278,-4.2e-05,5.3e-05,-0.000402,-0.000373,-0.00014,-5.5e-05,-0.000471,-0.000695,-0.000153,2.9e-05,-0.000222,-0.000675,0.000308,0.000306,-0.000139,-9.1e-05,0.000333,4.8e-05,8.2e-05,8.2e-05,0.00028,-0.00017,-0.000162
0.000375,-9.5e-05,-0.000341,-0.001209,-0.000984,0.000236,-4.5e-05,-0.000593,-0.000559,-0.000121,-1.1e-05,-0.000619,-8e-04,-0.000149,0.000182,-0.000333,-0.000952,0.000135,0.000342,9.7e-05,-0.000206,0.000244,0.000174,0.000337,0.00032,0.000231,3.2e-05,-0.000136
0.000323,2.1e-05,-0.000528,-0.001472,-0.000941,0.000279,-7.5e-05,-0.000301,-0.000283,0.00036,0.000353,-0.000538,-0.000826,-0.000305,0.000283,-0.000344,-0.001043,2e-06,0.000202,0.000241,-0.000339,-5.4e-05,-0.000154,-1e-04,0.000132,0.000183,-0.000148,-0.000373
6.3e-05,5.7e-05,-0.00052,-0.001407,-0.000713,8.9e-05,1.4e-05,0.000101,0.000108,0.000981,0.00082,-0.000324,-0.000682,-0.000418,0.000351,-0.000186,-0.000927,-0.000107,7.4e-05,0.000306,-0.000257,-0.000212,-0.000223,-0.000344,-1e-04,0.000171,-0.000182,-0.00016
-0.000234,9.8e-05,-0.000298,-0.000961,-0.000116,-2.1e-05,0.000279,0.000382,0.000338,0.001238,0.000964,-0.000136,-0.000282,-0.000261,0.000409,-3.1e-05,-0.000706,-0.000154,4.8e-05,0.000273,-1e-05,-0.000153,4.4e-05,4.7e-05,0.000117,0.000399,0.000353,0.000337
-0.000385,0.000117,-9e-05,-0.000359,0.000635,0.000127,0.000598,0.000559,0.000276,0.001011,0.000758,-3.5e-05,5.1e-05,-4.9e-05,0.000346,-4.4e-05,-0.000414,-0.000199,-0.000145,2.9e-05,7.1e-05,-0.000102,0.000124,0.000215,2.9e-05,-9.9e-05,0.000266,0.000207
-0.000386,6.9e-05,-0.000165,4.4e-05,0.001198,0.00024,0.000562,0.000322,-0.000184,0.000408,0.000331,-8.3e-05,0.000138,4.1e-05,5.4e-05,-0.000246,-0.000178,-0.000245,-0.000382,-0.000296,-9.4e-05,-0.00016,8.6e-05,0.000102,-0.000289,-0.000809,-0.000138,-8e-05
-0.000315,8.2e-05,-0.000191,0.000139,0.001293,0.000218,0.000212,-0.000289,-0.000656,-2.3e-05,-7.2e-05,-0.000241,0.000188,6e-05,-0.000294,-0.000472,-3.3e-05,-7.9e-05,-0.000341,-0.000441,-0.000238,-0.000241,4.4e-05,0.000121,-6.1e-05,-0.000428,6.1e-05,-3.7e-05
-0.00018,0.000132,-1.3e-05,0.000115,0.000945,0.000161,-0.000124,-0.000808,-0.000743,7.4e-05,-0.000235,-0.000378,0.000171,-6.6e-05,-0.000508,-0.00058,2.3e-05,0.000128,-0.00019,-0.000377,-0.000231,-0.000256,-0.000149,-2.8e-05,0.000122,0.000135,7.8e-05,-0.000284
