0.000447,0.000308,0.000637,0.000566,0.000131,0.000233,3e-04,0.000662,0.000349,6.8e-05,0.000322,0.000214,0.000461,0.000415,0.000271,0.000567,0.000267,0.000172,0.000289,-0.000555,-0.014156,-0.018951,-0.011257,-0.010719,-0.007869,-0.002185,-0.000909,-0.002136,-0.002789,-0.007101,-0.012514,-0.002662,-0.000145,0.012222,-0.004511,-0.016951,-0.015216,-0.014313,-0.023755,-0.016644,-0.020828,-0.01511,-0.016067,-0.013209,-0.010739,-0.008862,-0.007063,-0.008285,-0.007027,-0.011772,-0.016348,-0.023709,-0.012208,-0.01458,-0.014533,-0.007066,-0.010121,-0.016188,-0.014644,-0.014908,-0.01566,-0.015752,-0.011638,-0.007439,-0.004978,-0.005062,-0.007386,-0.003817,-0.003736,-0.004097,-0.004392,-0.002922,-0.001312,-0.001188,-0.001277,-0.000793,-0.000485,-0.004198,-0.001728,0.000138,0.00052,0.000117,-0.000549,-0.000777,3.9e-05,-0.005557,-0.001429,2e-06,0.000704,0.000591,-0.001181,-0.000655,0.001458,-0.000274,-0.001674,-0.000826,-0.000321,-0.000236,-0.001697,-0.001912,-0.001365,-0.001271,-0.000872,0.000205,-0.003056,-0.001375,-0.000248,-0.000143,-0.001693,-0.002463,-0.00128,-0.000446,-0.000114,-0.000376,0.000171,-0.000774,-0.00024,-0.000962,-0.000687,-0.000166,0.000367
-0.000125,9.6e-05,0.00049,7.8e-05,5.7e-05,0.00024,0.000251,0.000136,9.5e-05,2.9e-05,0.000289,0.000176,0.000318,1e-05,-7.1e-05,0.000144,0.000155,0.000276,0.00018,-1e-04,0.000498,0.006471,0.004977,0.005368,0.004694,0.000627,0.000999,0.001233,0.000711,0.002874,0.004318,0.004358,0.002828,-0.006493,-0.000644,0.011741,0.011208,0.000404,0.006996,0.00125,0.006614,0.0194,-0.008163,-0.004823,-0.003822,-0.001255,-0.004699,-0.005314,-0.004379,-0.004041,0.001563,0.000961,-0.003577,-0.001938,-0.00219,-0.007192,-0.004701,0.003157,0.002327,-0.005148,-0.004897,0.002893,0.000841,-7.5e-05,0.000518,0.002901,6e-05,2e-04,-0.000177,-0.001537,0.000141,-0.000555,-0.000262,-0.000843,-0.001132,-0.001196,-0.000561,0.00101,0.000572,-0.000735,-8.8e-05,-0.000199,0.000488,0.000687,-0.00099,0.002199,0.002137,0.000731,0.000648,-8.6e-05,0.000777,-0.000705,0.00022,0.000219,0.000366,2.5e-05,-1.9e-05,0.000426,-0.000168,0.001294,0.000783,0.00076,0.000259,0.000111,0.002639,0.001653,0.000562,0.000277,0.000636,0.000636,0.000313,-4.1e-05,0.000296,0.000403,0.000393,0.00087,0.000363,0.000617,0.000554,0.000392,0.000539
-0.000391,0.000171,0.00012,1.1e-05,-0.000289,-0.000316,-0.000412,-0.000179,-0.000106,-0.000128,7e-05,2e-05,0.000123,1.8e-05,-0.000258,-5.9e-05,0.000111,0.000121,-7e-05,-9.5e-05,0.001016,-0.004343,-0.002038,-0.001128,-0.003536,-0.001049,-0.001139,-0.00026,-0.000584,-0.00031,-8.4e-05,-0.005025,-0.001376,-0.007243,-0.003101,-0.009782,-0.012395,0.008756,-0.009742,-0.016625,-0.009707,-0.015186,-0.007518,-0.004941,-0.001097,-0.003276,-0.00348,-0.001858,-0.001991,0.000436,-0.003074,-0.000604,-0.005017,-0.00158,-0.001421,-0.0019,-0.004099,-0.008879,-0.001118,0.000814,0.00297,-0.004062,-0.004735,-0.002534,-0.000518,-0.002543,-0.002504,-0.00053,-0.00221,-6.7e-05,-0.001394,-2.3e-05,0.000128,-0.000338,-0.000429,-0.000334,-0.000593,0.000144,0.000698,0.000864,0.000407,0.000686,0.000181,-0.000346,-4.5e-05,-0.001941,-0.00205,-0.001175,-0.000556,-0.000799,-0.0019,2.5e-05,-0.001599,-0.000844,0.000374,0.000209,0.000117,-0.000316,-0.000155,-0.000674,-0.000483,-7.5e-05,-4.3e-05,-2e-06,-0.000745,-0.000506,2.9e-05,1.8e-05,-0.000396,0.000204,0.000351,0.000241,0.000236,-3.4e-05,9e-05,-0.000234,-0.000267,-0.000121,0.000211,1e-04,0.000167
-2.2e-05,6.3e-05,-0.000104,6e-06,-7.2e-05,0.000201,8.6e-05,0.000227,-9.2e-05,1.6e-05,0.000264,1.4e-05,-5e-05,5.3e-05,-0.000158,7.1e-05,3.4e-05,0.000169,1.5e-05,-3.4e-05,0.001184,-0.001607,-0.001284,0.000866,0.002039,0.001154,-0.000513,-9.7e-05,0.000285,-0.00018,-0.000238,0.000203,0.000568,0.0014,-0.006755,3e-04,0.00018,-0.006505,0.00329,0.011376,-0.003428,0.003073,0.006759,-0.000102,-0.003154,0.00283,0.001672,-0.000575,-0.001742,0.001458,0.005783,0.001681,0.00375,0.000129,-0.000185,0.002505,-0.00049,0.001698,0.002634,0.002464,-0.001052,0.004341,0.0056,0.001774,-0.000402,0.000542,0.002569,0.001498,-0.000455,0.000864,0.001765,0.001136,-0.000249,0.000195,0.000684,0.000196,0.000413,-0.000793,-0.000576,-0.000166,-0.000747,-0.000156,8.5e-05,6e-06,-0.000106,-0.000782,0.000346,0.00021,0.000457,-7e-05,-2.1e-05,0.000453,-0.001592,-0.000689,-0.000693,-0.000498,-0.000274,-0.000357,0.000206,-8.9e-05,0.000211,-0.000409,-0.000107,0.000351,0.000542,0.000192,0.000269,0.000132,6.8e-05,3.1e-05,6.6e-05,-4.7e-05,0.000117,0.000219,0.000183,-4e-05,-8e-05,-0.000101,-0.000197,-5.6e-05,8.9e-05
0.000112,0.000214,-0.000171,-0.000204,-3.3e-05,3.7e-05,2.5e-05,0.000198,7.7e-05,2.4e-05,-4.3e-05,1.8e-05,9.3e-05,-6.5e-05,4.8e-05,0.000125,3.6e-05,8e-06,-8e-06,4.8e-05,0.000458,0.001152,0.00117,-0.000497,-0.000515,-0.000567,-0.000571,-0.000387,-0.000633,0.000232,-0.002257,-0.003471,-0.000795,-0.001246,-0.00754,-0.007027,-0.004285,0.002162,-0.006798,0.001309,0.002159,-0.005666,-0.007087,-0.002417,0.001951,-0.001345,0.001219,0.000732,-0.002399,0.001245,-0.001885,-0.004607,0.000354,-0.000943,0.000729,-0.000471,-8.6e-05,-0.000493,-0.00121,0.000605,0.003535,-0.001135,-0.003756,-0.000108,-0.000384,-0.001133,-0.001841,0.000423,-0.000134,-0.000784,-0.001453,-0.000502,0.000246,0.000809,0.000485,-1.3e-05,-0.000113,0.000399,-0.000317,0.000248,0.000152,-9.8e-05,-0.000427,-0.000542,6.8e-05,0.000372,-0.000371,0.000207,0.00078,0.000138,0.000439,0.000513,-0.00061,-0.000262,0.000283,8.9e-05,0.000189,7.8e-05,0.00011,0.000331,-0.000173,0.000187,0.000104,0.00011,-0.000435,-0.000388,-0.000127,0,2.2e-05,-3e-05,4.2e-05,-0.00011,5e-05,-5.6e-05,-5.9e-05,-0.000181,-0.000135,-0.000335,6.5e-05,-0.000111,5.8e-05
8.6e-05,7.6e-05,-0.000178,-0.000159,0.000138,5.6e-05,6.7e-05,9.1e-05,0.000142,1.6e-05,-6.3e-05,-1.8e-05,5.6e-05,-8.8e-05,3.6e-05,-7.3e-05,-3.6e-05,-2.2e-05,6.4e-05,-2.5e-05,-0.000196,6e-05,-0.000133,-0.000214,0.000341,0.000317,-0.000601,0.000257,2.1e-05,-0.001049,0.000693,8.3e-05,0.000374,0.00025,0.000291,0.005167,0.005969,-0.004318,0.005734,0.00243,-0.00013,-0.001481,0.006209,-3.1e-05,-0.000213,-0.002195,-0.000747,1.3e-05,0.000532,0.002338,0.003099,0.001424,0.000491,0.000238,-0.004196,0.002446,0.002261,0.001208,0.00337,0.003661,-0.005235,-0.002157,0.000597,0.000986,6e-05,0.000834,0.000469,-0.001337,-0.001021,0.000472,0.000556,0.000636,-0.000161,-0.000168,-0.000159,7.6e-05,-0.000385,-3.9e-05,0.000544,-0.000918,-0.001136,0.000145,-0.000132,-0.00033,-0.00031,0.000495,-0.000847,-0.000585,-6.6e-05,-0.000114,6e-06,0.000565,0.000886,1.9e-05,-0.000175,-8e-06,6.2e-05,-7.4e-05,-0.000419,-0.000306,0.000184,-0.000168,-0.000154,0.000173,9e-06,5.2e-05,-0.000109,-7.9e-05,-0.000114,2.4e-05,0.000214,0.000234,7.3e-05,-4.7e-05,0.000148,-2.9e-05,2.6e-05,-1.5e-05,-0.000102,-2.5e-05,2.3e-05
-6.6e-05,-0.000184,-6e-06,-0.000197,1.7e-05,-0.000113,-0.000194,-8.3e-05,-1.3e-05,-7.8e-05,-0.000126,1.3e-05,-1e-06,-0.000205,-6.4e-05,-0.000136,-0.000233,-0.000127,-6.7e-05,-0.000113,-0.000403,0.002641,0.000601,0.000599,-0.000122,-0.00022,0.000124,0.000128,0.000829,0.000573,-3e-04,0.00072,-0.000393,-0.00141,0.004043,0.007722,-0.000167,-0.000748,-0.002496,-0.003193,-0.005031,-0.000752,-0.005809,0.004019,0.002561,0.001556,0.001589,-0.000913,0.002353,-5.4e-05,-0.002153,-0.002436,0.003416,-0.000446,0.001553,3.5e-05,-0.000233,0.000556,0.000217,-0.004827,0.002568,0.002726,-0.000919,0.000423,0.000116,0.001057,-0.000811,0.000536,0.001269,-0.000217,-0.000381,-0.000117,-0.000731,-0.00048,8.4e-05,-0.000146,8.6e-05,0.000236,8.4e-05,-9.8e-05,-0.000495,7.7e-05,-2.9e-05,5.3e-05,-0.000224,-0.000464,-0.000396,-0.001497,-0.000444,-0.000384,-0.000498,-0.000867,-0.000193,-0.000647,-0.00051,-2.7e-05,8.7e-05,0.000131,8.6e-05,-9.5e-05,6.1e-05,6.4e-05,-0.000127,-8.9e-05,-0.000285,-0.000112,-0.000107,-8.6e-05,2.6e-05,-0.000297,-1e-04,-3.1e-05,-7.4e-05,-1.5e-05,-6.6e-05,-8.8e-05,-0.000262,3e-05,0.000133,-4e-05,-6.9e-05
-2.8e-05,-0.000109,-0.000138,-0.000128,-6.6e-05,-4.6e-05,-9.6e-05,-0.000201,-0.000112,8e-06,7e-06,-0.00013,-0.000104,-0.000115,3.5e-05,-8.5e-05,-7e-06,-9.8e-05,-4.5e-05,-5.1e-05,-0.000259,-0.001532,-0.001107,-0.00054,-0.000165,0.000397,-8.5e-05,-0.000287,-0.000572,-0.000442,-0.000682,-0.002013,-0.000828,-8.7e-05,0.001423,-0.000858,0.001571,-0.001768,-0.006595,0.001009,0.000481,0.001026,0.004893,-0.001367,-0.001282,0.000297,0.002378,-0.000131,-0.000809,0.000204,-0.000801,0.000967,-0.002709,-0.000727,0.001404,-0.000576,-0.002278,0.00189,-0.001216,-0.000203,-0.001591,-0.002473,0.001102,-0.000495,0.000375,8.7e-05,0.000745,-0.000769,-0.000431,-0.000838,-0.000464,-0.000389,4e-05,-0.000315,0.000276,0.000257,0.000559,-0.000111,0.000155,0.000289,7.4e-05,0.00023,-0.000242,-0.00011,-0.000224,0.000122,0.000169,-0.000334,-0.000603,-0.00056,-0.000349,1.6e-05,-0.000708,-0.000521,-0.000227,-0.00038,1.7e-05,-4.2e-05,-0.00016,0.000209,-0.000134,-7.3e-05,0.000212,6e-06,3.5e-05,-0.00023,-0.000263,-3.3e-05,-2.7e-05,0.00016,-0.000123,-0.000156,-4e-05,-7.5e-05,-3.5e-05,-4.3e-05,-0.000102,3.6e-05,5.4e-05,2.2e-05,-3.1e-05
-2.5e-05,-1.2e-05,-4.8e-05,-6.1e-05,7e-06,-1e-06,-2.3e-05,-7.9e-05,-2.4e-05,9.2e-05,3.7e-05,-2.5e-05,-7.6e-05,-5.8e-05,4.1e-05,3.3e-05,3.7e-05,-8e-05,-6.6e-05,2.9e-05,4e-05,-0.000383,0.001013,0.00076,-0.000147,-0.000596,-0.000225,0.000698,0.000836,0.000125,0.000732,-6.1e-05,-0.000361,-0.000123,-0.00336,-0.001326,-0.002625,0.000702,0.004962,-0.002095,-0.002578,0.003629,-0.002174,-0.004828,0.003594,0.001376,1.3e-05,0.001112,-0.000539,0.001178,2.6e-05,-0.001623,-0.001189,0.00237,0.000335,-0.000495,-0.000749,0.001402,-0.000615,-0.002133,-0.000908,0.002289,-0.001149,-0.000517,0.000175,-0.000925,-2.3e-05,4.5e-05,0.000439,9.2e-05,-0.000223,0.00022,-0.000161,-0.000202,6.2e-05,-7.3e-05,-3.8e-05,-3.3e-05,-7.4e-05,-0.000309,-2.2e-05,0.00036,0.000133,-0.000107,-0.000203,0.00018,0.000552,0.000288,-1.4e-05,9.1e-05,-0.000358,-0.000304,-0.000158,-0.000186,-0.000205,2.1e-05,-0.000171,-6.6e-05,0.000203,0.000152,0.000353,6.4e-05,-7.7e-05,-6.3e-05,-3.2e-05,8.5e-05,-2.5e-05,-5.3e-05,-8e-06,-5.7e-05,0.000159,7e-05,-2e-05,-6e-05,-0.000129,-2.7e-05,-6.9e-05,5e-06,-9.6e-05,-0.000113,-1.5e-05
4.2e-05,9.7e-05,-0.000106,5.1e-05,3e-05,8.4e-05,1.7e-05,-2.1e-05,7e-06,7.6e-05,6.2e-05,5.5e-05,-7.4e-05,-5e-06,5.7e-05,0.000113,9e-06,-3.2e-05,-3.2e-05,9.3e-05,0.000216,0.000405,-0.000325,0.00048,0.000152,0.000567,-0.000211,-0.000256,-0.000251,0.000338,0.000377,0.000303,4.5e-05,-0.000739,0.000494,-0.000487,-0.000534,-0.002702,-0.002855,-0.000812,0.003431,-0.001601,0.001655,-0.000623,-0.004034,-0.001119,-0.000859,5e-06,0.00156,-0.003371,-0.000369,0.001782,0.001881,-0.000143,7.1e-05,0.001781,0.001991,-0.000655,-0.001409,0.000867,-4.4e-05,-0.000658,4.9e-05,0.000359,-0.000585,0.000415,4.7e-05,-0.000387,0.000227,-0.000154,0.00033,-0.000482,-0.000508,3.5e-05,-0.000205,-0.00014,-0.000245,0.000173,-1.7e-05,2e-05,-6.2e-05,-0.000292,-1.3e-05,2.3e-05,5e-06,0,0.000223,0.000145,0.000232,-4.8e-05,4.8e-05,0.000153,0.00023,0.000209,0.000255,-8.9e-05,-3.9e-05,6e-05,-5.6e-05,8.7e-05,-0.000158,-0.000109,7.2e-05,-6e-06,-0.00011,-0.000148,-0.000112,-9.9e-05,7.8e-05,5.1e-05,-5e-05,1.5e-05,2.1e-05,4.4e-05,-0.00013,-8.9e-05,-4e-06,1.6e-05,-1.6e-05,-0.000153,-1.4e-05
4.1e-05,3.4e-05,-3.4e-05,1.8e-05,-8.4e-05,5e-05,-3.5e-05,-2.7e-05,3.4e-05,7.6e-05,-2.1e-05,1.6e-05,-5.4e-05,5e-06,2.1e-05,4.8e-05,-1.7e-05,-3.5e-05,-1.4e-05,7.3e-05,9.9e-05,-0.00024,-0.000349,-0.001378,-5.8e-05,-0.000489,0.000183,-0.000713,0.000355,-0.00012,-0.000802,-0.000467,-0.000558,-0.000361,0.00084,-0.001013,-0.001284,0.004023,0.001988,0.001929,-0.001995,-0.000429,-0.000114,-0.000914,0.002889,-0.001167,-0.000379,-0.000422,-7e-05,-0.000936,-0.001014,-0.000442,-0.00179,0.001687,-0.0016,0.001683,-0.000685,-0.001028,-0.001234,-0.002346,0.000711,-0.000106,0.001001,0.000142,-0.000138,-0.00031,0.000316,0.000287,9.2e-05,0.000176,-7e-05,-0.000286,0.000504,0.000139,7.4e-05,-0.00014,7.9e-05,0.000126,-0.00015,0.000183,-0.000102,-6.8e-05,-0.000204,-3.9e-05,8.9e-05,-5e-05,-0.000395,-0.000429,4.4e-05,0.00014,-9.2e-05,-6.7e-05,4.7e-05,2.6e-05,4.9e-05,3.6e-05,-0.000159,-0.000144,0.000101,2.3e-05,0.000152,1.3e-05,-2e-06,2e-06,-3.7e-05,3.1e-05,-3e-06,-9.1e-05,-3e-06,7e-05,-6e-05,-2.1e-05,-4.1e-05,3.8e-05,8.1e-05,2.3e-05,2e-05,8.9e-05,9e-06,-8.3e-05,-2.5e-05
3.2e-05,-9e-06,2.3e-05,-3.8e-05,-3.5e-05,2e-05,-5.7e-05,-5.5e-05,-2.7e-05,-2e-05,-2e-05,0,-4.4e-05,-7.5e-05,0,-5e-06,-1.8e-05,-3.9e-05,-1.7e-05,4.3e-05,1.7e-05,0.000216,0.000258,0.0013,8.8e-05,0.000596,-0.000377,0.00018,-0.00042,-0.000139,0.000235,0.00016,0.000674,-0.00101,0.001393,-0.000689,-3.1e-05,-0.002606,-0.000592,-0.000706,0.001079,0.00264,6.8e-05,0.000914,-0.000226,2.7e-05,-0.000166,-0.00153,0.000379,0.000473,-0.000201,0.000784,0.001594,-0.001728,-0.001116,-0.001173,0.00077,0.00115,-0.000488,0.00211,-0.000441,-0.000395,-0.000879,-0.00015,-8.8e-05,0.000297,-0.000479,-0.00026,0.000175,-0.000249,9.7e-05,0.000257,-0.000532,9.5e-05,-8.9e-05,6.3e-05,1.5e-05,-0.000235,-5.1e-05,-0.000268,2.4e-05,-0.000404,-0.00022,-4.1e-05,6.4e-05,0.000227,-0.000132,0.000576,-0.000229,-0.000162,-8e-05,-0.000105,-0.000111,0.000611,0.000153,4e-05,0.000104,1.4e-05,-0.000162,4.7e-05,-0.000176,1e-04,4e-06,-2.1e-05,-3e-06,7.6e-05,5.4e-05,0,7.5e-05,-3.7e-05,9e-06,-4e-06,-8e-06,-5.2e-05,-8.3e-05,-4.9e-05,8.1e-05,-4.4e-05,-1.7e-05,-3.8e-05,2.7e-05
3.5e-05,3e-06,3.3e-05,7e-06,-4e-05,-6.1e-05,8e-06,-2.1e-05,1.8e-05,-4.1e-05,-5e-06,-1.3e-05,-1.1e-05,-2.3e-05,-1.3e-05,-9e-06,3.3e-05,-2.1e-05,6e-06,3.7e-05,-1.5e-05,-0.000278,0.000107,-0.00059,-0.000101,-0.000696,0.000338,2.8e-05,3.6e-05,-7.1e-05,3.3e-05,-0.000203,-0.000378,0.000288,-0.00052,-0.001119,0.001692,0.001851,-0.001406,-0.001132,-0.00133,0.001178,0.000353,0.002508,0.000331,0.000208,8e-05,-0.000341,-0.000132,0.001642,-0.000738,3.5e-05,-0.000879,0.001612,0.00042,0.00059,-0.00139,0.000764,0.000164,-0.000699,0.000684,2.9e-05,0.001173,0.000469,0.000351,-0.000172,-0.000297,0.000273,-0.000555,0.000432,0.000228,0.00024,0.000289,-1.4e-05,4.1e-05,-2.2e-05,2.5e-05,6.5e-05,0.000132,0.000226,-9e-06,-0.00015,-8.9e-05,-3.1e-05,9e-06,2e-06,4.2e-05,-0.000188,-2e-06,-5e-05,-7.5e-05,-7.7e-05,3e-06,-0.000762,-0.000265,5e-06,-7e-05,1.6e-05,-1.8e-05,-3.6e-05,-5.1e-05,-8.8e-05,4e-05,-2.9e-05,2.2e-05,-8.5e-05,-9.7e-05,-3.9e-05,1.6e-05,1.2e-05,-6.6e-05,-2.7e-05,-4.5e-05,-1.7e-05,-8.9e-05,2.1e-05,2.5e-05,0.000148,3.1e-05,1.6e-05,-7.6e-05
1.9e-05,-1.5e-05,-1.9e-05,-3.4e-05,-1.1e-05,-2.5e-05,1e-05,1e-06,-7e-06,2.4e-05,-7e-06,-1e-06,-3.6e-05,-2.7e-05,-1e-05,-2.4e-05,-6e-06,1.7e-05,-6e-06,2.5e-05,-5e-05,-1.5e-05,-0.000244,-0.000293,0.000157,0.000157,-0.000266,-4e-06,-0.00035,-7.8e-05,0.000105,-6.8e-05,-9.6e-05,-0.000181,-0.000752,0.000139,-0.000747,-0.002594,0.000309,0.001248,-0.000485,-0.00023,-0.000518,-0.000415,7.1e-05,-0.000181,0.00014,0.000182,-0.000435,-0.000633,0.000377,-0.000316,-0.00046,-0.000586,0.000133,-0.000466,0.000676,-0.000701,0.00075,-0.000472,-0.000784,0.000672,-0.000729,4.5e-05,-0.000368,-0.00013,0.000245,3e-05,0.000664,1.7e-05,2.1e-05,-0.00018,-0.000236,4.1e-05,-1.4e-05,-5.8e-05,5.6e-05,0.000164,-4.4e-05,-0.000161,-7.3e-05,4.2e-05,-0.000107,-6e-06,7e-05,-0.000108,5e-05,-9e-05,1.6e-05,9.7e-05,4.9e-05,-4.3e-05,9.4e-05,0.000298,8.8e-05,3.8e-05,1e-05,2.1e-05,-6e-06,1.6e-05,0.000105,6.9e-05,-6.1e-05,2.9e-05,2.2e-05,5e-06,0.00011,6e-05,2.6e-05,-1.4e-05,8.2e-05,5.4e-05,1e-06,2.1e-05,7e-06,-8e-06,0,-3.8e-05,1.1e-05,0,1.6e-05
8e-06,-1.4e-05,-2.7e-05,2e-05,-2.1e-05,-1.6e-05,1e-06,1e-06,8e-06,1.6e-05,-7e-06,1.1e-05,1.2e-05,6e-06,7e-06,-2.9e-05,1.5e-05,1e-06,7e-06,4.1e-05,-5.2e-05,-4e-06,0.000188,-0.000206,-0.000129,-2.3e-05,5.5e-05,2.7e-05,0.000128,-3e-05,-0.000113,5.1e-05,0.000228,0.000563,0.000256,-0.000297,0.000371,0.001265,-0.000245,-0.000756,0.001133,-0.001067,-0.000795,-0.000452,0.000493,0.000279,0.000179,0.000326,0.000149,-0.000119,0.001023,0.000621,0.000794,-2.3e-05,-0.00111,-0.000215,-0.000992,-0.000104,3.6e-05,0.000422,0.000532,-0.000415,-7.5e-05,-0.00026,-0.000299,-0.000138,4e-06,-4.3e-05,-9.4e-05,-9.7e-05,-2.1e-05,-4.9e-05,0.000169,-5.9e-05,-0.000134,1.8e-05,-0.000128,1.7e-05,-5.3e-05,0.000103,9e-06,4e-06,1e-06,2e-06,-1e-05,-1.5e-05,3.8e-05,-3.3e-05,-0.000185,3.2e-05,3.9e-05,1e-06,-2.8e-05,3e-06,-0.000117,3.7e-05,-2.2e-05,9e-06,-1.3e-05,-2.1e-05,7e-06,-2.6e-05,0.000104,4.5e-05,-2.8e-05,2.8e-05,-0.000136,2.8e-05,5.4e-05,-6e-06,-8e-06,-3e-05,-5e-06,-1.4e-05,-1.3e-05,-4e-06,5e-06,-6e-06,-8e-06,3e-05,-6e-06
-1e-05,2e-06,-2e-05,1e-06,-1.2e-05,-3.4e-05,1e-05,-1e-05,-1.8e-05,-7e-06,-1.1e-05,-1e-05,4e-06,3e-06,-6e-06,-3e-06,-2e-06,-1.5e-05,1.3e-05,1.6e-05,-2.5e-05,9.3e-05,-0.000176,-1.6e-05,-0.000101,-8.6e-05,5.8e-05,-5.8e-05,1.6e-05,4.2e-05,-4.7e-05,-0.000124,-8.1e-05,-0.000152,0.001071,0.000207,0.000643,-0.000717,0.000456,-0.000559,-0.00032,-0.000234,0.000132,0.00045,-0.000818,0.000293,-0.000188,-0.000255,0.000129,0.001023,8.4e-05,-5e-04,3.6e-05,0.000363,0.001157,0.000281,0.00036,9e-05,-0.000147,-0.000439,-0.000456,-0.000696,0.000157,0,0.000447,4.9e-05,3.4e-05,-5.9e-05,0.000222,0.000144,-9.1e-05,3.5e-05,-6.8e-05,-8.5e-05,5.8e-05,-7e-05,1.7e-05,-6e-05,5.6e-05,-3.1e-05,1.6e-05,-7.1e-05,6e-06,-3e-06,-2.2e-05,5.2e-05,-9e-06,-7.1e-05,9.9e-05,-5e-06,7e-06,9e-06,-6.2e-05,2.6e-05,5.7e-05,-2.8e-05,-9e-06,-1.8e-05,3.3e-05,-1.3e-05,-1.6e-05,-1.3e-05,-7.2e-05,-1.2e-05,-1.7e-05,1e-06,3.7e-05,2.8e-05,2e-05,-2e-06,1.8e-05,1.9e-05,5e-06,-7e-06,3.3e-05,5e-06,1e-05,-6e-06,9e-06,-1e-05,-1.1e-05
-7e-06,1.8e-05,1.5e-05,2e-06,2.1e-05,6e-06,-9e-06,-3e-06,6e-06,7e-06,-1e-05,-1e-05,9e-06,1.2e-05,-5e-06,2e-06,-1.7e-05,-6e-06,-3e-06,2.9e-05,1e-06,-0.000222,1e-05,0.00044,3.4e-05,7.2e-05,-7.5e-05,-3.9e-05,-5.2e-05,-2.8e-05,6.2e-05,7.3e-05,-6.9e-05,3.6e-05,-3.9e-05,0.000342,-0.000478,0.000627,0.000112,3e-04,0.000225,0.000377,6.2e-05,-0.000459,0.000496,-0.000318,0.000241,-0.000151,2.6e-05,3.1e-05,-4e-05,0.000454,6.2e-05,-0.000155,-0.000413,-0.000269,0.000326,-0.000559,0.000636,0.000353,0.000131,0.000203,-0.000275,-0.000165,-0.000171,4.7e-05,3.3e-05,-3.8e-05,-0.000128,-8e-05,0,-2.7e-05,0.000211,3.6e-05,-2.3e-05,-1e-05,-9e-06,-7e-06,5.7e-05,4.7e-05,-2.8e-05,-1.7e-05,6e-05,9e-06,-1.4e-05,-3.1e-05,-5.6e-05,-6.1e-05,6.1e-05,-2.6e-05,1.3e-05,2e-05,2.9e-05,-0.000119,1.2e-05,3.1e-05,4.3e-05,-3e-06,-6e-06,-4.6e-05,2.2e-05,-3.1e-05,1.9e-05,2.1e-05,-2e-06,3e-06,-8e-06,-3.6e-05,1.9e-05,8e-06,2e-06,-1.4e-05,-7e-06,1.9e-05,-5e-06,0,2.5e-05,-5e-06,1e-05,1e-06,1.5e-05
-7e-06,1.5e-05,-1e-06,5e-06,-5e-06,1.9e-05,-9e-06,-3e-06,-2e-06,-7e-06,-8e-06,1.3e-05,-1.3e-05,-5e-06,-7e-06,3e-06,-8e-06,-7e-06,1e-06,4e-06,1.3e-05,0.000232,5.4e-05,0.000218,-1e-06,-1.7e-05,3.3e-05,1.4e-05,-9e-06,-2.1e-05,-4.9e-05,-5.8e-05,2.5e-05,4.3e-05,-0.000439,0.000126,1e-04,-0.000497,-0.000286,-0.000337,-9.2e-05,0.000191,-0.000215,-0.000622,-0.000363,-9.7e-05,-9.8e-05,-0.000141,-0.000153,0.000119,-0.000289,-0.000503,-0.00029,0.000101,-3.9e-05,4.6e-05,-0.00012,0.000103,8e-05,-0.000373,0.000117,-0.000159,0.000415,7.5e-05,2.3e-05,-6.1e-05,-7.5e-05,-4.6e-05,-3.7e-05,3.8e-05,-2.7e-05,1e-05,-0.000165,-7.6e-05,2.5e-05,-3e-06,4.7e-05,3e-05,-3e-06,-8.3e-05,-1.7e-05,6.8e-05,5.9e-05,-1e-06,1.5e-05,-4.2e-05,-2e-05,9.2e-05,3.5e-05,-1.1e-05,-1e-05,2.7e-05,4.3e-05,0.000101,6.7e-05,-1.8e-05,3e-05,2.3e-05,-8e-06,-3e-06,-2.5e-05,5.7e-05,-7e-06,-7e-06,3e-06,-1.8e-05,-1.4e-05,1e-06,7e-06,-9e-06,-2e-06,1.1e-05,0,2e-06,-1.1e-05,-6e-06,3e-06,-7e-06,-3e-06,-9e-06,-1.3e-05
-5e-06,0,-5e-06,-9e-06,-4e-06,-4e-06,-1e-05,-6e-06,1e-06,-1.7e-05,3e-06,4e-06,-2e-06,-1.6e-05,-2e-06,-3e-06,4e-06,-5e-06,-3e-06,6e-06,1.4e-05,-0.00022,-0.000102,-0.000339,-5e-06,6.5e-05,-6e-05,5.4e-05,-4e-06,-1.1e-05,-6e-05,-0.000129,-2e-06,-1.4e-05,-0.000191,0.000351,1.7e-05,0.000576,0.000254,0.000163,-0.000327,5.1e-05,0.00033,-4.8e-05,-0.000149,2.3e-05,0.000136,-1e-05,0,-0.000296,-4.5e-05,1.8e-05,0.000341,-8.5e-05,0.000271,9.9e-05,2e-05,9.1e-05,-0.000227,5.8e-05,-0.000181,0.000269,-0.00018,3.4e-05,-0.000287,6.4e-05,-3.6e-05,2e-05,-3.8e-05,-8e-06,-1.4e-05,2.4e-05,-4.2e-05,3.5e-05,-1.3e-05,2e-05,-2e-05,7e-06,-2.1e-05,3.9e-05,1.1e-05,5.9e-05,-7e-05,-7e-06,8e-06,1.5e-05,8e-06,-1.2e-05,-3.8e-05,0,-9e-06,-1.8e-05,-2.1e-05,6.4e-05,-1.1e-05,-9e-06,-2.9e-05,-1.1e-05,-1.1e-05,-1.2e-05,2.5e-05,-2.7e-05,-8e-06,-2e-06,7e-06,-4e-06,1.1e-05,-2.2e-05,2e-06,-1.7e-05,-2e-06,-7e-06,0,-1e-05,1e-06,0,2.6e-05,-1e-06,1e-06,-6e-06,8e-06
-1e-06,-4e-06,-9e-06,-1e-06,7e-06,0,-1e-06,-5e-06,-4e-06,-1.6e-05,2e-06,-4e-06,-1e-06,-5e-06,-5e-06,-6e-06,1.2e-05,-1e-06,-1e-06,-4e-06,3e-06,0.000166,7.9e-05,-1e-06,2.9e-05,-0.000133,-4e-06,8e-05,3.4e-05,-1.2e-05,8.1e-05,4.9e-05,-4.3e-05,-6.5e-05,0.000417,0.000124,-0.000231,-0.00064,-0.000385,9e-05,-6.4e-05,-0.000624,-0.000514,-0.000407,-0.000645,0.000162,-2.3e-05,4.2e-05,-5.2e-05,-0.000159,-0.000114,0.000111,7.9e-05,-0.000489,-8.9e-05,-7.1e-05,0.000207,-9.8e-05,-0.000255,9e-06,-1e-05,-2.3e-05,0.000105,-5.1e-05,0.000265,-2.2e-05,2e-05,5.1e-05,-6e-06,0,2.4e-05,2.5e-05,4.6e-05,1.1e-05,-1.3e-05,-8e-06,-2e-06,-2.6e-05,1.5e-05,-3.2e-05,-1.4e-05,9e-06,-1.3e-05,1.1e-05,2e-05,2e-06,2.2e-05,3.7e-05,1.6e-05,-3.2e-05,-1.4e-05,-1.3e-05,-3.2e-05,-4.8e-05,-4.3e-05,2e-05,-9e-06,-6e-06,-1.4e-05,-7e-06,1.8e-05,2.4e-05,6e-06,-4e-06,-5e-06,2.1e-05,1e-06,2e-06,1e-06,4e-06,-3e-06,-4e-06,-2e-06,7e-06,-1e-05,-2e-06,1.5e-05,-1.2e-05,2e-06,-1.6e-05,-2e-06
-3e-06,-6e-06,1e-06,-5e-06,-2e-06,-3e-06,-2e-06,-1e-06,3e-06,-1e-06,2e-06,-4e-06,-6e-06,-1.3e-05,-3e-06,-7e-06,-1e-06,-2e-06,-2e-06,-1e-06,-1.2e-05,-0.000126,-1.7e-05,9e-05,2.6e-05,0.000106,-2.4e-05,-0.000116,6e-05,2.4e-05,0,-7.7e-05,3.7e-05,2.4e-05,0.000345,-9.8e-05,0.000146,0.000689,0.000266,0.000219,-0.000285,-4.5e-05,0.000272,0.000257,0.000484,0.000126,-5e-06,4.6e-05,-5.5e-05,-0.000289,-0.000107,-0.000169,-0.000292,0.000333,-0.000115,-6.8e-05,-2.7e-05,-0.000153,-0.000247,0.000138,0.00011,-0.000168,-3.3e-05,8.4e-05,-0.000155,1.9e-05,4.9e-05,-3.3e-05,-0.000133,6.8e-05,7e-06,-1.9e-05,5.4e-05,2.5e-05,1.7e-05,-1.6e-05,-1.6e-05,-1.8e-05,-4e-06,-8e-06,-1.4e-05,2.3e-05,-1e-06,2e-06,1.1e-05,-2.5e-05,1.7e-05,-7.1e-05,-2.1e-05,1.6e-05,-1.2e-05,-9e-06,1.2e-05,-9.5e-05,4e-06,-1.8e-05,1.7e-05,6e-06,1.1e-05,-3e-06,-1.5e-05,-2.7e-05,-1.1e-05,-1e-06,-7e-06,-1.2e-05,-1.3e-05,-3e-06,5e-06,-7e-06,-2.3e-05,-8e-06,2e-06,-3e-06,7e-06,1e-06,8e-06,-1e-06,-5e-06,-7e-06,-4e-06
0,-6e-06,5e-06,5e-06,-2e-06,-1e-05,0,0,0,3e-06,0,1e-06,-7e-06,6e-06,1e-06,-1e-06,1e-06,4e-06,-1e-06,-2e-06,-1.2e-05,9.3e-05,-2.1e-05,-0.000182,-2e-06,-8.9e-05,1.1e-05,-3.5e-05,-1e-05,-7e-06,-5.7e-05,-2.7e-05,2e-06,8e-06,-0.000247,0.000138,-0.000101,-0.000819,-0.000214,-9.2e-05,0.000435,0.000174,-0.000313,0.000253,-0.000276,-8.7e-05,-5.9e-05,3e-06,5.1e-05,2.7e-05,8.3e-05,0.000377,-2e-06,-0.000437,0.00017,-7.9e-05,-2.1e-05,9.6e-05,-2e-05,-0.000178,8e-05,0.000287,1e-05,3.2e-05,0.000121,2.6e-05,-2.7e-05,5e-06,0.000105,-2.3e-05,3.1e-05,-2.2e-05,-9.3e-05,-7e-06,2e-06,-1.5e-05,-9e-06,2e-05,7e-06,2.3e-05,5e-06,-3.6e-05,2e-06,-2e-06,9e-06,-3e-06,-1.1e-05,-2.4e-05,-2.6e-05,1e-05,1e-06,2e-06,2.1e-05,0.00016,-3.8e-05,4e-05,0,-3e-06,0,-5e-06,2.2e-05,2e-05,9e-06,0,-2e-06,7e-06,6e-06,5e-06,-2e-06,1e-06,2.7e-05,1.1e-05,-1e-06,-5e-06,-9e-06,-2e-06,9e-06,-5e-06,1e-06,-8e-06,-1e-06
-3e-06,-3e-06,1e-06,1e-06,-6e-06,2e-06,0,0,1e-06,1e-06,-4e-06,4e-06,2e-06,-1e-06,-1e-06,-1e-06,-4e-06,0,2e-06,-2e-06,-6e-06,-7.2e-05,6.9e-05,0.000243,-1e-05,7.2e-05,-6e-06,5.1e-05,4.7e-05,1e-05,-2e-06,1e-06,2.3e-05,-1e-06,-0.00033,-0.000136,4.2e-05,0.000846,6.3e-05,8.7e-05,-0.000525,0.000219,-8e-06,-5.8e-05,-0.000111,-0.00013,-3.4e-05,-6.5e-05,-9.8e-05,2e-04,2.4e-05,-0.000239,6.4e-05,0.000368,-0.000158,4.5e-05,-8.6e-05,0.000148,-0.00012,9.1e-05,-0.000171,-0.00022,6.3e-05,-6e-06,9e-06,-2.1e-05,6e-06,-1.3e-05,-4.3e-05,1.4e-05,-2e-06,2.5e-05,4.9e-05,-5e-06,2.5e-05,-4e-06,2.9e-05,7e-06,-1.2e-05,6e-06,-9e-06,-3e-06,1.2e-05,7e-06,3e-06,1.7e-05,-1.9e-05,2.4e-05,-5e-06,-1.1e-05,4e-06,-7e-06,-1.3e-05,-0.000158,2.4e-05,-1.6e-05,-2.3e-05,0,1e-06,-3e-06,-5e-06,-1.6e-05,-1.1e-05,-3e-06,2e-06,-1.2e-05,-1.5e-05,-5e-06,-2e-06,1e-05,-1.3e-05,5e-06,-2e-06,5e-06,-7e-06,0,1e-05,2e-06,2e-06,1e-06,4e-06
-1e-06,6e-06,-6e-06,0,-2e-06,6e-06,1e-06,-2e-06,-4e-06,1e-06,-3e-06,-2e-06,0,0,0,6e-06,-5e-06,-6e-06,-1e-06,-4e-06,5e-06,8.5e-05,-6.6e-05,-3.9e-05,-2e-05,-2.1e-05,-3e-06,1.1e-05,-5e-06,-1.6e-05,7e-06,-6.3e-05,-5.2e-05,-2.6e-05,0.00012,-0.000129,0.000155,-0.000714,3.6e-05,-8.5e-05,0.000349,-2.3e-05,0.000189,0.000117,0.000234,-2.1e-05,-2.2e-05,-6.7e-05,-8.5e-05,-5.3e-05,2.1e-05,0.000161,-7.6e-05,-0.000357,6.2e-05,-8.1e-05,-1.1e-05,1.2e-05,-1.3e-05,-7e-06,0.000251,2.5e-05,-0.000161,-3.3e-05,-5.2e-05,-3.8e-05,1.1e-05,-1.3e-05,-2.2e-05,7e-06,-1.7e-05,3.1e-05,-9e-06,4e-06,-2.2e-05,6e-06,-9e-06,-2.7e-05,-3e-06,-6e-06,-8e-06,-2.2e-05,-2.5e-05,-1e-06,-3e-06,-8e-06,-9e-06,-6.8e-05,1.8e-05,1e-06,-4e-06,2e-06,-1.4e-05,0.000129,-4e-06,1.1e-05,-2e-06,1e-06,-1e-06,3e-06,-3e-05,6e-06,-2e-06,3e-06,4e-06,4e-06,-4e-06,3e-06,-1e-06,-2e-06,7e-06,-1e-05,-1e-06,1e-06,9e-06,1e-06,8e-06,-1e-05,-1e-06,5e-06,-3e-06
-2e-06,7e-06,-3e-06,0,1e-06,3e-06,-3e-06,0,4e-06,-7e-06,1e-06,-3e-06,0,-2e-06,0,2e-06,-1e-06,-2e-06,1e-06,-5e-06,5e-06,-0.000112,-2.4e-05,-3.8e-05,-1e-06,9e-06,-1.7e-05,0,8e-06,3e-06,2e-06,1e-05,-1.1e-05,2.9e-05,0.000311,-8.4e-05,-9.8e-05,0.000627,-0.000123,-0.000264,-0.000215,-0.00027,-0.000191,1.4e-05,-5.5e-05,2e-06,5e-06,5.1e-05,-2.7e-05,-8.8e-05,-1e-06,-9.7e-05,4.6e-05,4e-06,4.7e-05,0.000105,0.000134,0,0.000194,-8.8e-05,-0.000172,0.000215,0.000122,-3.3e-05,4e-05,2e-05,-4.3e-05,-2e-06,-6.8e-05,-6e-06,-9e-06,-2.5e-05,8e-06,-3.1e-05,-1e-06,-3e-06,-1e-06,-1.5e-05,7e-06,1.5e-05,2e-06,4e-06,-9e-06,3e-06,4e-06,-1.1e-05,5e-06,5.1e-05,3.3e-05,-9e-06,1e-06,1e-05,1.3e-05,-4.5e-05,3.8e-05,8e-06,3e-06,-3e-06,-5e-06,6e-06,2e-06,-3e-06,-4e-06,1e-06,-1e-06,1.1e-05,1.4e-05,1.4e-05,-3e-06,-5e-06,-5e-06,2e-06,-1e-06,-3e-06,-8e-06,0,5e-06,2e-06,-2e-06,-3e-06,0
-1e-06,2e-06,0,-2e-06,-7e-06,2e-06,0,0,-2e-06,-3e-06,3e-06,3e-06,-3e-06,-7e-06,1e-06,2e-06,5e-06,0,0,-6e-06,5e-06,0.000103,6.3e-05,2.2e-05,1e-06,1.1e-05,1.2e-05,-1.2e-05,-1.6e-05,-1e-06,-1.2e-05,-2.5e-05,3.7e-05,8e-06,0,-8.9e-05,2.6e-05,-0.000612,0.000233,0.00014,-6.3e-05,-5e-05,0.000289,-0.000212,-0.000112,0.000109,6e-05,5.9e-05,-2.7e-05,2.6e-05,4.2e-05,-9.1e-05,3e-06,4.5e-05,-0.000144,-1.4e-05,-0.000126,8.4e-05,0.00013,3.6e-05,0.000165,-1e-04,-9e-05,3e-06,-7.6e-05,1.3e-05,4e-06,2.6e-05,-4.2e-05,0,-2e-05,-6e-06,-2.6e-05,1.2e-05,-1e-05,-6e-06,-1e-05,1.3e-05,-1.2e-05,-1.8e-05,-1e-06,-1.7e-05,-1.1e-05,3e-06,-1e-06,1.3e-05,1.3e-05,2.1e-05,-8e-06,0,0,-3e-06,1.5e-05,-8e-06,-1.9e-05,-9e-06,3e-06,4e-06,-3e-06,4e-06,7e-06,2e-06,4e-06,-2e-06,-4e-06,-9e-06,-2.4e-05,0,-3e-06,2e-06,0,6e-06,-1e-06,2e-06,5e-06,-1e-06,1e-05,-1e-06,2e-06,4e-06,0
-1e-06,-2e-06,5e-06,0,-2e-06,0,0,-1e-06,2e-06,4e-06,1e-06,2e-06,5e-06,-1e-06,0,-3e-06,3e-06,-1e-06,0,-5e-06,2e-06,-8.3e-05,-5.4e-05,-8.2e-05,-6e-06,-4.5e-05,-2.3e-05,-2e-05,-2.2e-05,-1e-06,-1.6e-05,-4e-05,-2.4e-05,7e-06,-0.00025,1.6e-05,6.8e-05,0.000495,-0.000267,-0.00015,-7.1e-05,0.000131,-9.4e-05,-0.000123,0.000302,5.6e-05,-5.1e-05,-5e-06,1.2e-05,0.000186,3.9e-05,7.6e-05,-3.9e-05,-0.000149,0.000126,-7e-05,0.000114,-1.4e-05,5.9e-05,-8.4e-05,-3.6e-05,0,5.6e-05,0,9.8e-05,-7e-06,2.2e-05,-2.2e-05,1.7e-05,-6e-06,-3e-06,7e-06,4.5e-05,-1.4e-05,-2e-06,-1.5e-05,8e-06,5e-06,9e-06,1.9e-05,-8e-06,-8e-06,-5e-06,1e-06,1e-05,2e-06,1e-06,-4.4e-05,-3.3e-05,-8e-06,-4e-06,-4e-06,-1.1e-05,1.6e-05,-2e-06,9e-06,1.7e-05,-1e-06,-1e-06,4e-06,5e-06,4e-06,0,2e-06,-2e-06,-2e-06,2.5e-05,1e-06,-3e-06,-2e-06,4e-06,-4e-06,4e-06,2e-06,-1e-06,0,7e-06,0,-1e-06,-4e-06,-1e-06
-1e-06,-3e-06,-1e-06,-1e-06,2e-06,-3e-06,0,-1e-06,-3e-06,2e-06,0,-2e-06,-3e-06,-3e-06,1e-06,0,-2e-06,0,0,-4e-06,-2e-06,6.2e-05,4.1e-05,-1e-05,1e-05,5.3e-05,3.1e-05,2e-06,0,3e-06,2.3e-05,-7e-06,-1.1e-05,-1.6e-05,-0.000117,1.4e-05,-9e-05,-0.000457,1.7e-05,-8.2e-05,-3.8e-05,8.4e-05,1.2e-05,-9.5e-05,-3e-06,-7.1e-05,4.2e-05,-3.1e-05,1.9e-05,1e-05,1e-06,-0.000139,7.7e-05,0.000154,2.2e-05,7.8e-05,-5.4e-05,-6.5e-05,8.6e-05,7e-06,8.8e-05,-9.6e-05,3.9e-05,-1.6e-05,-9.5e-05,1.6e-05,-7e-06,2.4e-05,3.2e-05,1.5e-05,1e-06,1e-06,-6e-05,1.3e-05,1.9e-05,-3e-06,-1e-06,-1.3e-05,-3e-06,-1.4e-05,0,-1.4e-05,1e-05,2e-06,5e-06,-7e-06,-8e-06,1e-05,2.4e-05,1e-06,-2e-06,-6e-06,-1e-05,1.3e-05,-1.4e-05,-4e-06,-9e-06,-2e-06,3e-06,2e-06,-3e-06,-8e-06,-6e-06,0,1e-06,2e-06,-1.5e-05,-9e-06,-2e-06,-1e-06,1e-06,-4e-06,-4e-06,-4e-06,-5e-06,0,5e-06,1e-06,1e-06,-1e-06,1e-06
2e-06,-4e-06,-3e-06,1e-06,-3e-06,-4e-06,-1e-06,0,4e-06,3e-06,-2e-06,-2e-06,0,2e-06,1e-06,-2e-06,-1e-06,0,-1e-06,-3e-06,-6e-06,-4.8e-05,-2.4e-05,5.5e-05,1.2e-05,-3.4e-05,-2.3e-05,9e-06,-1.7e-05,-2e-06,-1.2e-05,-4.6e-05,2.8e-05,6e-06,0.00021,1.8e-05,-3e-05,0.000443,7e-05,0.000153,1e-04,2.5e-05,3.1e-05,-2.2e-05,-0.000173,-4.2e-05,-1.9e-05,-3e-06,-3.3e-05,-0.000122,-3.2e-05,0.00013,-0.000121,4.3e-05,-9.5e-05,-6.5e-05,8.2e-05,5.8e-05,2.3e-05,3.8e-05,-6.8e-05,6e-06,-6e-05,3e-05,5.4e-05,-2.8e-05,2e-06,-4e-06,-1.4e-05,2e-06,1e-06,2e-06,5e-05,-3e-06,-7e-06,1e-06,7e-06,-7e-06,7e-06,9e-06,0,1.3e-05,6e-06,0,3e-06,1e-06,-3e-06,1e-06,-1.1e-05,-1e-06,-2e-06,5e-06,1.1e-05,-7e-06,-1.1e-05,4e-06,-1e-06,3e-06,0,2e-06,-1.6e-05,2e-06,6e-06,-1e-06,2e-06,0,5e-06,-5e-06,-2e-06,6e-06,-3e-06,6e-06,0,0,6e-06,0,2e-06,0,-1e-06,-2e-06,-3e-06
0,-2e-06,-1e-06,0,1e-06,1e-06,-1e-06,0,-2e-06,5e-06,-2e-06,1e-06,-2e-06,-2e-06,0,1e-06,-1e-06,0,1e-06,-2e-06,-1e-06,2.6e-05,-1.4e-05,-1.6e-05,-4e-06,1.4e-05,3e-06,2.6e-05,-2e-06,-2e-06,-2e-05,-7e-06,3e-06,4e-06,0.000144,4.3e-05,9.7e-05,-0.000382,-0.000112,-7.3e-05,-0.000172,-0.000175,-0.000118,5.8e-05,0.000154,-2.6e-05,-1.2e-05,-1.3e-05,1.7e-05,-5.4e-05,-2.3e-05,-7.3e-05,8.8e-05,2e-06,5.5e-05,2.3e-05,-7.7e-05,-8e-06,-5.5e-05,-5.5e-05,0.000148,0.000178,8.1e-05,3.5e-05,-5.6e-05,1.7e-05,3e-06,-1.3e-05,2.7e-05,-1e-06,1.2e-05,6e-06,-3.4e-05,0,1e-06,3e-06,-2e-06,1e-05,-9e-06,-1.6e-05,-5e-06,2e-05,-4e-06,2e-06,0,6e-06,2e-06,-3.2e-05,-1.3e-05,-3e-06,-3e-06,-2e-06,4e-06,-3.4e-05,1.1e-05,8e-06,2e-06,-1e-06,-1e-06,1e-06,4e-06,-3e-06,-7e-06,0,1e-06,6e-06,-8e-06,-8e-06,-2e-06,0,4e-06,-3e-06,2e-06,3e-06,-4e-06,-1e-06,5e-06,1e-06,1e-06,-4e-06,4e-06
1e-06,2e-06,2e-06,0,-1e-06,2e-06,0,0,1e-06,0,1e-06,2e-06,2e-06,0,0,0,-1e-06,0,-1e-06,-2e-06,1e-06,-2.2e-05,3.8e-05,2.2e-05,-8e-06,-1.7e-05,-5e-06,-9e-06,-2.1e-05,1e-06,1.3e-05,-1.3e-05,-2.9e-05,-4e-06,-0.000129,4.9e-05,-8.9e-05,0.000432,0.000113,-7e-05,0.000106,-4e-05,6e-05,7e-05,0.000103,3.7e-05,6e-06,-1e-05,7e-05,-3.2e-05,-3e-06,7.5e-05,7.1e-05,0.00016,4.6e-05,6e-06,4.5e-05,-6.4e-05,-0.000107,1.9e-05,-5.9e-05,-0.000145,-8.6e-05,1.4e-05,0.000107,5e-06,-1.7e-05,5e-06,-6e-06,5e-06,6e-06,1e-06,2.2e-05,1e-06,-3e-06,-4e-06,-9e-06,6e-06,0,1.5e-05,-3e-06,1.6e-05,-2e-06,1e-06,4e-06,-3e-06,4e-06,2e-05,2.2e-05,0,-1e-06,1e-06,-8e-06,3.8e-05,-4e-06,-4e-06,7e-06,0,0,2e-06,6e-06,8e-06,3e-06,0,-1e-06,-7e-06,4e-06,6e-06,-2e-06,-4e-06,-4e-06,5e-06,-2e-06,-2e-06,2e-06,0,0,1e-06,-1e-06,0,-3e-06
0,4e-06,2e-06,-1e-06,1e-06,0,0,0,-1e-06,-2e-06,1e-06,-1e-06,-3e-06,-2e-06,0,2e-06,1e-06,-1e-06,0,-2e-06,2e-06,2.5e-05,-2.2e-05,5.8e-05,-1e-06,3.8e-05,-4e-06,-2.7e-05,3e-06,-3e-06,0,-2.7e-05,1.3e-05,-2e-06,-0.000186,5.3e-05,1.8e-05,-0.000464,-0.00013,8.5e-05,-0.00013,9.9e-05,-3e-06,2.2e-05,-6.5e-05,7.5e-05,2.7e-05,1.6e-05,-2e-06,1.4e-05,-4e-06,-3.9e-05,-0.000182,-0.000153,-7.9e-05,-4e-06,-1.2e-05,-5e-06,-0.000117,1.2e-05,0.000112,-2.5e-05,3.9e-05,-3e-06,-9.9e-05,-1.1e-05,-2e-06,-4e-06,3.8e-05,0,-4e-06,-8e-06,-2.7e-05,-1e-05,1e-06,-9e-06,3e-06,-6e-06,6e-06,-1.7e-05,2e-06,-6e-06,-7e-06,-1e-06,-1e-06,-4e-06,3e-06,-1.2e-05,8e-06,-5e-06,0,0,-5e-06,1.7e-05,2e-05,8e-06,-1.2e-05,0,-2e-06,-1e-06,4e-06,-8e-06,2e-06,-1e-06,-1e-06,0,-7e-06,5e-06,-1e-06,2e-06,3e-06,-4e-06,-1e-06,0,1e-06,0,0,1e-06,2e-06,-2e-06,1e-06
0,2e-06,-1e-06,-1e-06,0,2e-06,-1e-06,0,2e-06,1e-06,0,-2e-06,0,-3e-06,0,-1e-06,2e-06,0,0,-1e-06,1e-06,-2.6e-05,-2.7e-05,-9.3e-05,-3e-06,-3.3e-05,4e-06,6e-06,4e-06,-1e-06,-1.4e-05,-3e-06,4e-06,3e-06,5.6e-05,-1e-05,2.1e-05,0.000443,7.6e-05,-2.4e-05,-3.4e-05,0.000104,-2.9e-05,2e-06,-6.8e-05,-1.1e-05,-2.6e-05,1.3e-05,9e-06,3.8e-05,0,-2.7e-05,5.6e-05,0.000212,7.4e-05,1.2e-05,8e-06,2.2e-05,-1.8e-05,-2.8e-05,-4.9e-05,3e-05,-1.2e-05,-2.1e-05,1.3e-05,-2e-06,7e-06,-1.6e-05,-3.2e-05,-6e-06,-2e-06,-3e-06,2.6e-05,7e-06,7e-06,-6e-06,3e-06,-4e-06,-3e-06,8e-06,-2e-06,3e-06,-3e-06,2e-06,1e-06,5e-06,2e-06,1.9e-05,-4e-06,0,-2e-06,2e-06,7e-06,-4.4e-05,-1.4e-05,0,6e-06,-1e-06,-1e-06,-1e-06,-3e-06,7e-06,0,0,0,3e-06,9e-06,4e-06,-1e-06,-1e-06,0,1e-06,1e-06,2e-06,-4e-06,0,2e-06,1e-06,-1e-06,1e-06,1e-06
0,-1e-06,-2e-06,1e-06,-3e-06,0,0,0,-1e-06,2e-06,0,1e-06,0,0,0,0,-1e-06,1e-06,0,-1e-06,2e-06,1.8e-05,5.1e-05,9e-06,-3e-06,9e-06,-7e-06,1e-05,1.1e-05,3e-06,4e-06,-3.2e-05,-1.8e-05,2e-06,0.000179,-6e-06,-3.8e-05,-0.000439,-4.3e-05,-5.2e-05,4.4e-05,-1e-05,8.6e-05,-3.2e-05,0.000139,-3.5e-05,-2.5e-05,-2.4e-05,1.9e-05,-4e-06,1e-06,3.9e-05,9.7e-05,-6.7e-05,-1e-06,8e-06,-3.7e-05,-2.1e-05,-2.7e-05,1.7e-05,5.2e-05,-5e-05,-1.6e-05,0,1e-06,-9e-06,9e-06,1.8e-05,2.4e-05,1e-06,-6e-06,1e-05,-1.8e-05,-1.1e-05,2e-06,0,-1e-06,7e-06,1e-06,6e-06,-4e-06,-1.1e-05,5e-06,1e-06,3e-06,0,-3e-06,-1e-05,-8e-06,0,-1e-06,-2e-06,2e-06,1.5e-05,1e-05,1e-06,-3e-06,1e-06,1e-06,-2e-06,2e-06,-4e-06,3e-06,0,1e-06,-2e-06,-9e-06,0,0,-2e-06,-4e-06,0,0,-1e-06,4e-06,0,0,-1e-06,0,0,-2e-06
0,-2e-06,0,0,2e-06,-3e-06,0,0,1e-06,1e-06,-1e-06,1e-06,1e-06,-3e-06,0,-2e-06,-2e-06,0,0,0,-1e-06,-1.1e-05,-5.4e-05,7e-06,3e-06,0,-2e-06,4e-06,8e-06,-2e-06,2e-06,-1.8e-05,7e-06,4e-06,1.7e-05,-5e-06,7.5e-05,0.000392,-5.9e-05,7.3e-05,-7.9e-05,-8.5e-05,-5.6e-05,-2.6e-05,-0.000167,-4.1e-05,1.3e-05,-2.2e-05,-3e-06,-1.6e-05,1.3e-05,-6e-05,-6.8e-05,0.000113,-5.2e-05,7e-06,5.2e-05,-2e-05,-2e-05,-6e-06,-3e-06,7.4e-05,3.2e-05,-3.1e-05,1.1e-05,1.1e-05,-7e-06,-5e-06,9e-06,-3e-06,-8e-06,6e-06,1.4e-05,1.1e-05,0,4e-06,1e-06,7e-06,-6e-06,-3e-06,1e-06,1e-05,-4e-06,0,1e-06,-3e-06,-4e-06,-1.6e-05,-1e-06,-4e-06,-1e-06,-3e-06,-6e-06,3e-05,-1.9e-05,2e-06,1e-06,-1e-06,1e-06,-1e-06,1e-06,2e-06,-4e-06,0,1e-06,3e-06,6e-06,-1e-06,0,4e-06,6e-06,1e-06,-1e-06,-1e-06,-3e-06,0,-1e-06,1e-06,-1e-06,0,2e-06
1e-06,-2e-06,1e-06,0,0,0,0,0,-1e-06,1e-06,-1e-06,-1e-06,-2e-06,2e-06,0,1e-06,0,-1e-06,0,0,-2e-06,2e-06,4.2e-05,-4e-06,5e-06,-5e-06,-2e-06,2e-06,8e-06,2e-06,2e-06,-9e-06,1e-05,-4e-06,-0.000171,-3.2e-05,-1e-04,-0.00037,0.000118,5.5e-05,4e-05,-3.6e-05,5e-06,-2.7e-05,8.9e-05,-9e-06,-1.6e-05,-5e-06,1.9e-05,3e-05,3e-06,0.000115,-5.9e-05,6e-06,3e-05,-3.9e-05,7e-06,2.1e-05,7.2e-05,-6e-06,1e-05,-3.8e-05,-4e-05,-1.1e-05,-1.6e-05,1.1e-05,-3e-06,-2e-06,3.3e-05,2e-06,-1e-06,-8e-06,-6e-06,-4e-06,-6e-06,-2e-06,-3e-06,-3e-06,6e-06,0,0,-1.2e-05,2e-06,2e-06,3e-06,2e-06,-1e-06,1.6e-05,-2e-06,2e-06,-1e-06,1e-06,-2e-06,-4.2e-05,4e-06,-1e-06,0,-1e-06,-1e-06,-1e-06,-3e-06,-2e-06,5e-06,0,0,-3e-06,-1e-06,0,0,1e-06,-4e-06,-1e-06,1e-06,1e-06,1e-06,0,-2e-06,-1e-06,0,-1e-06,0
0,-1e-06,0,0,-2e-06,0,0,0,2e-06,0,0,-1e-06,2e-06,-2e-06,0,0,1e-06,0,0,1e-06,-1e-06,7e-06,-1.9e-05,5e-05,2e-06,8e-06,1e-06,-7e-06,1e-05,-1e-06,-1e-05,-2.9e-05,3e-06,0,-7.3e-05,-7e-06,2.2e-05,0.000377,-0.000104,-5e-05,-9.5e-05,5e-05,1.9e-05,-4.9e-05,-3.3e-05,6.1e-05,-9e-06,-5e-06,1.3e-05,4.2e-05,-2e-06,-9.8e-05,6.3e-05,-5.4e-05,-3.6e-05,4.2e-05,-6e-06,-7e-06,7.6e-05,1e-06,-2e-06,1.9e-05,4.7e-05,2e-05,9e-06,-2e-06,1e-06,1.6e-05,-4e-06,-2e-06,1e-06,-1e-06,0,2e-06,0,-6e-06,-1e-06,-4e-06,-2e-06,6e-06,-3e-06,-2e-06,-3e-06,0,3e-06,1e-06,2e-06,-1.4e-05,-4e-06,-4e-06,-1e-06,1e-06,8e-06,3.3e-05,-3e-06,3e-06,3e-06,1e-06,-1e-06,-1e-06,-3e-06,4e-06,-1e-06,0,-1e-06,0,-6e-06,-1e-06,0,-3e-06,1e-06,-1e-06,0,1e-06,2e-06,0,-1e-06,1e-06,-1e-06,0,-1e-06
0,1e-06,-1e-06,0,0,0,0,0,-1e-06,-2e-06,0,0,0,0,0,1e-06,0,0,0,1e-06,1e-06,-1.2e-05,-9e-06,-5e-06,-1e-06,-6e-06,5e-06,-6e-06,6e-06,-3e-06,-8e-06,-1e-05,-1.6e-05,0,0.000132,-3.9e-05,3.7e-05,-0.000357,2.2e-05,5.3e-05,5.1e-05,3.9e-05,-8.3e-05,-2.4e-05,-5.4e-05,2.8e-05,3.2e-05,1.1e-05,-2.7e-05,8e-06,0,6.9e-05,3.9e-05,3.5e-05,2e-06,-1.3e-05,5e-06,-2.6e-05,6.5e-05,-2e-06,0,2.9e-05,-3.6e-05,4e-06,2.6e-05,-1.2e-05,-1.2e-05,-7e-06,2e-06,2e-06,3e-06,2e-06,-6e-06,-3e-06,-1e-06,-7e-06,2e-06,3e-06,1e-06,-7e-06,-1e-06,-1.3e-05,-5e-06,1e-06,0,-1e-06,1e-06,-1.3e-05,4e-06,1e-06,-1e-06,1e-06,2e-06,-3.1e-05,3e-06,1e-06,-4e-06,0,1e-06,-1e-06,7e-06,-1e-06,1e-06,0,-1e-06,4e-06,8e-06,1e-06,0,1e-06,-2e-06,2e-06,-1e-06,-1e-06,-4e-06,0,-3e-06,0,0,-1e-06,1e-06
0,3e-06,-1e-06,0,-1e-06,2e-06,0,0,1e-06,-1e-06,0,1e-06,0,-2e-06,0,0,0,0,0,1e-06,0,1.4e-05,2.5e-05,-3.9e-05,-3e-06,2e-06,-3e-06,-1e-06,-1e-06,3e-06,9e-06,-1.5e-05,0,0,0.000116,-9e-06,-7.8e-05,0.000343,-1.3e-05,3.6e-05,-5.2e-05,1.5e-05,6e-05,3.7e-05,-5.7e-05,-1.2e-05,-2e-06,2.5e-05,-1.3e-05,-6e-06,3e-06,-6.1e-05,-4.5e-05,-4.2e-05,3.9e-05,-1.4e-05,-9e-06,9e-06,3.3e-05,-2.3e-05,-1.1e-05,-9e-05,2.2e-05,2.4e-05,-5.5e-05,0,8e-06,-6e-06,-2.6e-05,-3e-06,6e-06,1e-06,1.9e-05,-4e-06,0,-2e-06,0,5e-06,-1e-06,2e-06,0,-2e-06,3e-06,1e-06,-1e-06,-1e-06,-2e-06,2.1e-05,6e-06,-2e-06,-2e-06,-1e-06,-7e-06,4.5e-05,7e-06,2e-06,3e-06,0,-1e-06,0,-1e-06,-1e-06,1e-06,0,0,-3e-06,-1.1e-05,-4e-06,0,0,0,0,0,1e-06,3e-06,0,-3e-06,0,-1e-06,0,0
0,2e-06,1e-06,0,0,1e-06,0,0,-1e-06,0,0,0,-2e-06,-2e-06,0,1e-06,0,0,0,1e-06,1e-06,-1.5e-05,-1.1e-05,1e-05,0,-1.2e-05,-4e-06,9e-06,1e-06,0,2e-06,-1.9e-05,7e-06,-1e-06,-8.4e-05,8e-06,1.8e-05,-0.000335,1.6e-05,-7.7e-05,-3.4e-05,-6.4e-05,-3.9e-05,1.9e-05,0.000191,-3.8e-05,-3.5e-05,-1.7e-05,8e-06,-2.2e-05,0,-2.5e-05,-1.5e-05,-3.2e-05,-4.4e-05,2.9e-05,4.5e-05,2.2e-05,-4e-06,1.1e-05,-9e-06,5.5e-05,-5e-06,-6e-06,3.9e-05,-1e-06,6e-06,9e-06,1e-05,3e-06,2e-06,-1e-06,-2e-05,0,2e-06,2e-06,0,-2e-06,-1e-06,-1e-06,-1e-06,1e-06,-1e-06,1e-06,3e-06,1e-06,-2e-06,-8e-06,1.1e-05,-2e-06,-1e-06,1e-06,1e-06,-4.7e-05,-6e-06,0,0,0,0,0,0,0,-1e-06,0,1e-06,0,9e-06,-4e-06,1e-06,-3e-06,-2e-06,-1e-06,0,0,-2e-06,0,-3e-06,0,0,-1e-06,-1e-06
0,0,1e-06,0,-1e-06,0,0,0,2e-06,-1e-06,0,-1e-06,2e-06,0,0,-1e-06,-1e-06,0,0,1e-06,1e-06,1.4e-05,-1.7e-05,-1.1e-05,-2e-06,1.8e-05,-2e-06,8e-06,-1e-05,1e-06,-4e-06,-1.1e-05,-1e-05,-2e-06,-0.000146,1.1e-05,1.6e-05,0.000344,-3e-06,2.2e-05,2.4e-05,-4.7e-05,2e-06,-6e-06,-0.000189,-3.2e-05,1.3e-05,-4.9e-05,0,-1.7e-05,-6e-06,6.3e-05,2.1e-05,3.8e-05,1.2e-05,-1.4e-05,-3.6e-05,-1.1e-05,-9e-06,-9e-06,8e-06,6.6e-05,-2.5e-05,-2e-06,-3.3e-05,8e-06,-4e-06,-7e-06,-1.7e-05,-5e-06,0,5e-06,1e-05,-5e-06,-2e-06,1e-06,-3e-06,-5e-06,3e-06,4e-06,-1e-06,1.1e-05,0,1e-06,1e-06,0,1e-06,-7e-06,-9e-06,0,-1e-06,1e-06,4e-06,3.3e-05,1.1e-05,4e-06,1e-06,0,1e-06,1e-06,-8e-06,-2e-06,0,0,0,0,-5e-06,-1e-06,1e-06,2e-06,4e-06,0,0,0,-1e-06,0,-3e-06,0,0,-2e-06,1e-06
0,-2e-06,0,0,-2e-06,-1e-06,0,0,-1e-06,-1e-06,0,0,-1e-06,-2e-06,0,0,0,0,0,1e-06,0,-1.4e-05,4.1e-05,-1.6e-05,1e-06,-1.1e-05,-5e-06,-5e-06,-2e-06,1e-06,-1e-06,-1.9e-05,-5e-06,2e-06,2.9e-05,1.8e-05,-2e-06,-0.000353,-7.4e-05,8e-06,-8e-05,2.6e-05,4.8e-05,-2.1e-05,5.1e-05,2e-05,9e-06,6e-06,-1.5e-05,4e-06,-1e-06,-8.6e-05,8e-06,-0.00014,3.3e-05,4e-06,3.2e-05,-5e-06,-4.9e-05,-1.4e-05,-4.6e-05,-6.4e-05,4e-05,5e-06,5e-05,2e-06,0,-6e-06,3e-06,0,-2e-06,-2e-06,-8e-06,7e-06,1e-06,-3e-06,3e-06,0,-4e-06,-9e-06,-1e-06,-1e-06,1e-06,1e-06,1e-06,-1e-06,1e-06,9e-06,-1.1e-05,-2e-06,-1e-06,0,1e-06,-1.1e-05,-1.6e-05,-3e-06,-2e-06,0,0,1e-06,1e-06,1e-06,-2e-06,0,0,-1e-06,3e-06,4e-06,1e-06,1e-06,-4e-06,3e-06,0,0,3e-06,0,-3e-06,0,1e-06,1e-06,0
