-0.00022,-0.000242,-0.00018,-0.000448,-0.009576,-0.014415,-0.003019,-0.000374,-0.004897,-0.098298,-0.234127,-0.190243,-0.161168,-0.140623,-0.143804,-0.140242,-0.10953,-0.052345,-0.012453,-0.004183,-0.005939,-0.034572,-0.034951,-0.006007,-0.00018,-4.6e-05,-1.1e-05,-7e-06
-0.000155,-0.000183,-0.000127,-0.000238,-0.004158,-0.00746,-0.002659,-0.000265,0.00306,0.010689,-0.033065,0.081214,0.16735,0.158515,0.159227,0.126196,0.101714,0.057033,0.012611,0.002713,0.000184,-0.025404,-0.019149,0.003055,2.5e-05,-4.5e-05,-1.3e-05,-5e-06
7.7e-05,8.9e-05,6.2e-05,0.000115,0.001682,0.003317,0.000551,2.8e-05,-0.000516,-0.004614,0.001822,-0.011496,-0.012221,-0.018357,-0.012616,-0.000929,-0.001625,-0.000517,-0.000605,7.7e-05,0.001692,0.011113,0.009088,0.000247,6.4e-05,1.3e-05,2.1e-05,3.7e-05
0.000192,0.000227,0.00016,0.00033,0.005313,0.008379,0.002109,0.000187,-0.004399,-0.034652,0.002619,-0.069054,-0.154165,-0.141651,-0.146364,-0.125014,-0.101465,-0.058213,-0.011758,-0.00169,0.000985,0.027371,0.021363,-0.00142,0.000159,6.1e-05,5.1e-05,5.3e-05
5.1e-05,5.7e-05,4e-05,0.000131,0.003832,0.004327,0.000861,0.000148,0.003278,0.064164,0.163456,0.163586,0.14656,0.134461,0.134324,0.117401,0.098211,0.047482,0.01136,0.003118,0.001628,0.006454,0.010915,0.003635,0.000152,5.4e-05,4.1e-05,1.6e-05
-0.000166,-0.000191,-0.000133,-0.000322,-0.006127,-0.008919,-0.001158,-0.000138,0.000687,0.022524,0.021221,0.01437,0.051329,0.039997,0.043541,0.052438,0.042692,0.025225,0.00376,-0.000849,-0.003392,-0.030318,-0.024419,-0.001697,-0.000226,-2.5e-05,0,-2.9e-05
-0.000121,-0.000141,-8.3e-05,-0.000178,-0.003416,-0.004041,-0.000927,-0.000152,-0.004719,-0.081358,-0.207363,-0.19284,-0.173711,-0.14559,-0.157695,-0.152903,-0.130125,-0.063279,-0.013952,-0.003424,-0.002977,-0.021016,-0.02377,-0.004342,-0.000107,-4.8e-05,-1e-05,-1.8e-05
7.9e-05,8.9e-05,7e-05,0.000215,0.005073,0.007408,0.000434,0.00016,0.002079,-0.004002,-0.030019,0.041328,0.066307,0.073176,0.076323,0.04047,0.035288,0.018811,0.0051,0.002727,0.003916,0.018861,0.014818,0.002088,0.000228,1.1e-05,1.6e-05,2.9e-05
0.000125,0.000151,9.2e-05,0.000148,0.000916,0.001101,0.000388,0.000144,0.003548,0.048452,0.123494,0.108718,0.096987,0.062451,0.081777,0.100135,0.08803,0.043021,0.00828,0.001723,0.002351,0.025927,0.027477,0.003253,0.000158,4.7e-05,2.8e-05,4.1e-05
9e-06,2e-05,0,-7e-05,-0.00314,-0.005309,-0.000284,-4.3e-05,-0.002562,-0.022221,0.003706,-0.058415,-0.123114,-0.120436,-0.131658,-0.097658,-0.085485,-0.047029,-0.00929,-0.002311,-0.002782,-0.000806,0.001978,-0.000179,7.4e-05,2.3e-05,1.2e-05,1.4e-05
-1e-04,-0.000116,-7.9e-05,-0.000139,0.000101,-0.000113,-8.6e-05,-5.9e-05,-0.001636,-0.009292,-0.014809,0.006374,0.014873,0.031703,0.024511,-0.005796,-0.003889,-0.003475,6.2e-05,5.6e-05,-0.001256,-0.017075,-0.017495,-0.001725,-2.6e-05,-1.9e-05,-1e-05,-8e-06
-5.4e-05,-7e-05,-2.8e-05,-2.5e-05,0.000868,0.002566,0.000296,5.5e-05,0.001698,0.034707,0.022985,0.037005,0.092458,0.076607,0.094392,0.087615,0.079098,0.045373,0.008463,0.001024,0.000856,-0.009948,-0.010608,-8.5e-05,-6.2e-05,-3.3e-05,-1.5e-05,1e-06
5.9e-05,6.3e-05,6.4e-05,0.000154,0.001516,0.002841,0.000187,1.5e-05,-0.000658,-0.010396,-0.049259,-0.086063,-0.092972,-0.085615,-0.095023,-0.072696,-0.071146,-0.032084,-0.006604,-0.001094,0.000533,0.00875,0.007049,0.000879,8.1e-05,0,-2e-06,1.8e-05
6.5e-05,8.2e-05,4e-05,6.1e-05,0.000381,-0.000596,-0.000285,-7.5e-05,-0.001515,-0.025505,-0.024333,0.004118,-0.010822,0.005174,-0.006955,-0.034304,-0.033304,-0.019887,-0.003802,0.000254,0.000613,0.011472,0.007976,-0.001554,3.3e-05,4.2e-05,1.3e-05,1.8e-05
-2e-06,5e-06,-2.6e-05,-0.000123,-0.002957,-0.00503,-0.000326,-3.8e-05,-0.000511,0.008287,0.073422,0.103653,0.103503,0.076526,0.094515,0.092139,0.092262,0.046105,0.008353,8e-04,-0.000551,-0.004488,-0.001737,-0.000587,-7e-05,3.5e-05,1.1e-05,1e-06
-4e-05,-5.6e-05,-3.8e-05,-7.7e-05,-0.000801,-0.000666,0.000282,-3.5e-05,-0.003647,-0.013018,0.008927,-0.031518,-0.060437,-0.066205,-0.065529,-0.021339,-0.021034,-0.011588,-0.001886,-0.001062,-0.001479,-0.011794,-0.00824,0.000776,-2.5e-05,-8e-06,-1.2e-05,-2e-05
-3.4e-05,-4.7e-05,-1.4e-05,4.1e-05,0.002842,0.004883,0.000449,-4.7e-05,-0.003454,-0.021828,-0.059314,-0.058551,-0.054687,-0.020579,-0.033062,-0.053556,-0.060578,-0.03294,-0.005273,-2e-05,0.000635,0.000492,-0.005494,-0.003134,-0.000152,-3.7e-05,-3e-05,-2.6e-05
1.9e-05,2.6e-05,3.1e-05,8.3e-05,0.000507,0.000699,-0.000169,-1.6e-05,0.001209,0.027308,0.002532,0.028513,0.078936,0.069549,0.080552,0.049178,0.054187,0.030548,0.005352,0.000897,0.001339,0.009117,0.005387,-0.001686,-0.000103,-1.3e-05,-2.1e-05,-1.6e-05
3.6e-05,5e-05,2.7e-05,5e-06,-0.001918,-0.003373,-0.000321,-1.7e-05,0.001046,0.021055,0.013331,-0.009017,-0.014125,-0.035597,-0.038955,-0.010923,-0.000201,0.003423,0.000309,-0.000653,-0.000847,0.004375,0.009275,0.003103,0.000144,2.1e-05,-2e-06,-1e-05
