-0.023977,-0.030907,-0.026115,-0.023304,-0.021787,-0.017957,-0.017474,-0.013943,-0.017865,-0.025053,-0.026129,-0.030359,-0.025702,-0.019205,-0.025133,-0.029303,-0.027874,-0.035943,-0.029815,-0.033388,-0.037761,-0.020855,-0.018811,-0.015563,-0.01951,-0.019474,-0.023374,-0.027128
-0.009498,-0.004765,-0.012594,-0.01752,-0.019746,-0.014797,-0.010641,-0.003387,-0.010354,-0.023221,-0.017173,-0.016744,-0.017521,-0.017516,-0.012826,-0.01549,-0.019379,-0.023702,-0.02452,-0.032957,-0.029005,-0.013524,-0.014018,-0.011187,-0.01517,-0.014483,-0.017588,-0.016985
0.006923,0.00566,0.004672,0.004716,0.001344,-0.000157,0.001859,0.001339,0.000568,0.000798,0.002084,0.009136,0.006877,5.9e-05,0.001629,0.005465,0.007205,0.009131,0.003623,0.004557,0.014803,0.005909,0.004074,0.003553,0.002119,0.001482,0.004074,0.011233
0.010587,0.006835,0.01239,0.016805,0.018295,0.012915,0.010695,0.004452,0.008742,0.018653,0.013235,0.014091,0.013176,0.014988,0.011574,0.016066,0.019573,0.023771,0.021149,0.031834,0.030647,0.012982,0.012295,0.009579,0.009439,0.010522,0.01621,0.018331
0.00407,0.013752,0.010668,0.007759,0.012115,0.009955,0.007765,0.008031,0.010395,0.012598,0.010589,-0.000396,-0.001529,0.011167,0.014232,0.014044,0.009106,0.010937,0.012164,0.01724,0.002492,0.00396,0.00439,0.002535,0.002841,0.007281,0.008285,0.000215
-0.013352,-0.012978,-0.011826,-0.01303,-0.011893,-0.008921,-0.009792,-0.005798,-0.006695,-0.011467,-0.011919,-0.018077,-0.014683,-0.009284,-0.010642,-0.012956,-0.01424,-0.018559,-0.014995,-0.019848,-0.025293,-0.011087,-0.009,-0.007548,-0.007733,-0.007319,-0.01267,-0.018268
-0.007928,-0.021655,-0.01706,-0.012986,-0.016165,-0.011085,-0.010257,-0.010897,-0.012619,-0.015907,-0.015983,-0.005255,-0.000868,-0.014033,-0.020167,-0.022329,-0.015799,-0.019568,-0.01825,-0.026723,-0.012526,-0.009292,-0.007383,-0.004544,-0.00341,-0.00923,-0.013536,-0.008364
0.016846,0.01815,0.009929,0.00724,0.003372,0.004824,0.008039,0.006084,0.006218,0.006597,0.011268,0.023147,0.019353,0.002374,0.008643,0.007965,0.007905,0.012047,0.009367,0.003891,0.016007,0.007768,0.005275,0.005278,0.010145,0.006509,0.007487,0.015603
0.009802,0.018297,0.014653,0.012445,0.013678,0.009484,0.009793,0.008545,0.010495,0.01554,0.016662,0.012571,0.008645,0.01154,0.017871,0.018171,0.013284,0.018883,0.019474,0.024241,0.015328,0.009713,0.005907,0.00403,0.006932,0.00898,0.013003,0.012825
-0.012466,-0.013417,-0.003718,0.001855,0.00768,0.002659,-0.002417,-0.003886,-0.0029,0.00217,-0.002969,-0.016551,-0.013088,0.007073,-0.000403,-0.001034,-0.001464,-0.0025,0.001689,0.013287,-0.003687,-0.001704,-0.000493,-0.001335,-0.00535,-0.001796,0.000519,-0.008686
-0.00865,-0.007,-0.006168,-0.006156,-0.004544,-0.004768,-0.007323,-0.0045,-0.005837,-0.010024,-0.008932,-0.011849,-0.010651,-0.002695,-0.006473,-0.00592,-0.005395,-0.009531,-0.011788,-0.010168,-0.008777,-0.003752,-0.000129,-8.3e-05,-0.005431,-0.004211,-0.005707,-0.011325
0.004371,0.002991,-0.00283,-0.008102,-0.013158,-0.008491,-0.004537,-0.00062,-0.003135,-0.010919,-0.005377,0.00696,0.003318,-0.01132,-0.006672,-0.002537,-0.000894,-0.004377,-0.011309,-0.020645,-0.001738,-0.000577,3.1e-05,0.000886,0.000102,-0.002283,-0.004765,0.002456
0.004024,-0.006406,-0.005306,-0.005083,-0.0076,-0.003243,0.001161,-0.001174,-0.00159,-0.002501,-0.004666,0.003629,0.002758,-0.008807,-0.007671,-0.006465,-0.002579,-0.004546,-0.004601,-0.009399,-0.00191,-0.004002,-0.005577,-0.003765,-0.002794,-0.004041,-0.003031,0.005585
0.001082,0.005125,0.003283,0.003098,0.00615,0.005243,0.005565,0.003277,0.006139,0.009949,0.004672,-0.005365,-0.004122,0.004298,0.005498,0.00027,-0.001469,0.002972,0.008969,0.012377,-0.003581,-0.002847,-0.004726,-0.004959,-0.004305,-7e-05,0.002441,-0.000279
-0.000962,0.011999,0.01076,0.009363,0.011573,0.006744,0.002947,0.004292,0.006492,0.011433,0.009925,-0.002841,-0.000375,0.012105,0.012314,0.009111,0.00388,0.012335,0.015225,0.019936,0.005726,0.005812,0.005144,0.002389,0.00433,0.006672,0.005976,-0.000397
-0.002443,-0.007411,0.000891,0.005752,0.005601,0.003054,-0.002247,-0.004544,-0.005013,-0.000711,-0.000263,0.004468,0.007994,0.005993,-0.001194,0.002203,0.003367,0.003183,0.001509,0.003228,0.011656,0.00607,0.008751,0.007636,0.00957,0.004239,0.001376,0.001372
0.002885,-0.006266,-0.006203,-0.00459,-0.005355,-0.0018,-0.001675,-0.004074,-0.005646,-0.008165,-0.003599,0.010673,0.008068,-0.005248,-0.006212,-0.002283,0.00112,-0.008259,-0.010836,-0.015171,-0.000353,-0.001607,0.001001,0.002682,0.004174,-0.000879,-0.00297,0.000252
0.003045,0.004831,-0.004544,-0.009947,-0.011286,-0.006309,0.000179,0.003718,0.001776,-0.006477,-0.001412,0.002271,-0.003181,-0.009817,-0.000574,-0.001767,-0.002494,-0.007541,-0.008678,-0.015154,-0.015776,-0.006738,-0.008583,-0.00609,-0.005385,-0.003716,-0.002999,-0.002439
-0.004931,-0.003551,-0.002444,-0.00188,-0.002614,-0.004399,-0.001616,0.001224,0.001249,-0.000897,-0.004023,-0.014297,-0.012389,-0.003088,-0.001412,-0.006224,-0.006514,-0.001514,-0.000123,0.00225,-0.008619,-0.003653,-0.00705,-0.006211,-0.009319,-0.004712,-0.001575,-0.004235
