9.4e-05,2.8e-05,1e-06,5.3e-05,6.9e-05,4.3e-05,3.6e-05,1.4e-05,2e-06,3.3e-05,6.4e-05,2.1e-05,7.2e-05,3.1e-05,0.000101,0.000109,7.7e-05,1.8e-05,9.9e-05,4.9e-05,7.5e-05,2e-05,9.9e-05,3.8e-05,4.5e-05,5.3e-05,2e-05,9.7e-05,0.000104,0,3.3e-05,0.000142,3.8e-05,1e-06,5.4e-05,7.9e-05,2.4e-05,4.4e-05,1.4e-05,8.9e-05,2.1e-05,3.2e-05,5.1e-05,1e-06,8e-06,6.5e-05,0.000131,8.3e-05,4.2e-05,4.6e-05,3.7e-05,2.7e-05,2e-06,5e-05,0.000113,2.7e-05,5e-06,1e-06,9e-06,2.6e-05,3.9e-05,3.6e-05,1e-06,1.7e-05,7e-06,9e-06,7.2e-05,8e-05,6e-06,4.4e-05,4.9e-05,4.6e-05,6.4e-05,6.5e-05,4.6e-05,1.3e-05,9.3e-05,5.9e-05,3.3e-05,5.3e-05,4.5e-05,1.7e-05,4e-05,7e-05,7.9e-05,3.8e-05,6.2e-05,1.5e-05,2.8e-05,4.5e-05,5.5e-05,5.4e-05,3e-05,3.2e-05,3.3e-05,7.6e-05,7e-05,5.5e-05,1.6e-05,3e-05,5e-06,3e-05,4e-06,6.1e-05,4.4e-05,9.5e-05,1.5e-05,2e-06,7.1e-05,0.000118,7.8e-05,2e-06,5e-05,2e-05,4.2e-05,1.7e-05,6.8e-05,9e-06,1e-05,1.9e-05,9e-06
0.000251,2.8e-05,6.2e-05,0.000156,0.000194,0.000172,8.7e-05,3.5e-05,3.9e-05,7.1e-05,0.000155,6.3e-05,0.00015,7.6e-05,0.000164,0.000204,7.5e-05,0.000112,0.000259,9.9e-05,8.6e-05,8.4e-05,0.000223,4.4e-05,0.000135,0.000158,2.4e-05,0.000197,0.000195,3.6e-05,8.6e-05,0.000259,0.000118,1.6e-05,0.000112,0.000146,8.3e-05,7.6e-05,1.8e-05,0.000149,8e-05,9.7e-05,0.000116,5.3e-05,3.9e-05,0.000103,0.00023,0.000163,8.8e-05,5.8e-05,7.1e-05,3.8e-05,1.3e-05,0.000115,0.000294,0.000111,2.8e-05,1.2e-05,2.1e-05,6.7e-05,0.000108,0.000106,7e-06,3.4e-05,5.6e-05,3e-05,0.000159,0.000136,1.9e-05,4.8e-05,6.5e-05,8.6e-05,0.000134,0.000153,0.000117,5.4e-05,0.000187,0.00012,5.3e-05,0.000119,0.000148,5.7e-05,0.000105,0.000125,0.00017,5.7e-05,0.000141,3.6e-05,6.5e-05,0.000125,0.000134,8.7e-05,7e-05,4.5e-05,9.1e-05,0.000127,0.000162,0.000121,4.2e-05,5.9e-05,3.6e-05,5.9e-05,2.5e-05,0.000112,8.6e-05,0.000206,1.7e-05,2e-05,0.000128,0.000266,0.000215,4.6e-05,0.000149,6.6e-05,9.2e-05,3.6e-05,0.000136,1.1e-05,4e-05,5.8e-05,3e-05
0.000251,3e-05,0.000142,5.6e-05,0.000152,0.000151,0.000124,4.8e-05,0.00013,3.6e-05,0.000152,7.4e-05,0.000147,5.6e-05,0.000217,0.00025,0.000124,6.7e-05,0.000309,0.000121,0.000119,8.4e-05,0.00018,0.000268,7.4e-05,0.000107,7.5e-05,0.000119,0.000133,6.4e-05,0.000158,0.000344,0.000185,6.6e-05,0.000162,0.000174,0.000113,7.3e-05,4.7e-05,0.000124,0.00014,0.000141,0.000178,8e-05,7.6e-05,0.000191,0.000306,0.000233,8e-05,6.7e-05,6.5e-05,6.9e-05,2.6e-05,0.000161,0.000267,9.7e-05,6e-05,3.8e-05,6.7e-05,3.6e-05,9.5e-05,0.000111,5.5e-05,0.000104,5.7e-05,3.9e-05,0.000163,0.00017,4.5e-05,7.8e-05,8.5e-05,8.5e-05,0.000121,0.00016,9.6e-05,3.7e-05,0.00021,0.000159,6.4e-05,0.000115,0.000188,4.5e-05,0.000132,0.00015,0.000161,0.000105,0.000135,6.2e-05,9.2e-05,0.000168,0.000127,8.7e-05,7.8e-05,0.000133,8.2e-05,0.000147,0.000186,9.6e-05,6.2e-05,0.000101,4e-05,9e-05,4.2e-05,0.00013,7.3e-05,0.000181,0.000131,9.5e-05,0.000293,0.000308,6.8e-05,0.000211,0.000198,0.000133,0.000235,0.000212,0.00028,0.000163,5.8e-05,5.9e-05,1.8e-05
0.000222,7.7e-05,0.000212,0.000326,0.000252,0.000223,7.6e-05,0.000121,0.000132,5.5e-05,0.00024,0.000123,0.000255,0.000298,0.000218,0.000274,0.00021,0.000157,0.000394,0.000136,0.00016,0.000166,0.000172,0.000248,0.000124,5.2e-05,0.00015,0.000167,0.000246,9.8e-05,6.8e-05,0.000332,0.000152,6.1e-05,0.000143,0.000169,7.1e-05,0.000127,7.1e-05,0.000196,0.000105,7.3e-05,0.000176,9.8e-05,0.000182,0.000152,0.000256,0.000243,0.000138,0.000127,2.2e-05,5.7e-05,0.000101,7.6e-05,0.000285,0.000118,0.000114,5.2e-05,0.000135,9.3e-05,0.000155,3e-05,5.1e-05,0.000181,0.000105,0.000106,0.000268,0.000124,5.8e-05,0.000104,6.1e-05,8.7e-05,0.000148,0.000211,9.1e-05,0.000122,0.000239,9.5e-05,6.6e-05,0.000114,0.000187,0.000189,0.000151,0.000169,0.000164,0.000129,0.000195,9.6e-05,4.1e-05,0.000181,0.000213,0.00011,8.8e-05,0.000161,0.000143,0.000124,0.000193,0.000163,8.4e-05,6.2e-05,3.7e-05,0.000107,5.4e-05,0.000163,0.000126,0.000112,0.000107,2.1e-05,0.000271,0.000104,9.8e-05,0.000144,0.000117,5e-05,0.00014,9.8e-05,0.000186,8.5e-05,5.5e-05,3.9e-05,6.7e-05
0.000313,0.000159,0.000198,0.000305,0.000257,0.00032,0.000176,0.000212,5.7e-05,0.000262,0.000235,6.2e-05,7.5e-05,0.000201,0.000387,0.000349,0.000215,0.000157,0.000302,0.000102,0.000218,0.000109,0.000312,0.000169,0.000118,0.000101,0.000203,0.000103,0.000254,0.00019,0.000135,0.000186,0.000203,9.3e-05,0.000172,0.00012,4.2e-05,0.000254,6.8e-05,0.000255,0.000131,0.000209,0.000128,3.6e-05,0.000203,0.000208,0.000238,0.000276,0.000147,0.000124,0.000118,7.8e-05,0.000123,0.000189,0.000415,0.000229,7.3e-05,0.000195,0.000261,0.00012,0.000297,8.8e-05,6.1e-05,0.000163,0.000105,2.4e-05,0.000361,0.00022,0.000188,0.000156,0.000173,0.00018,0.000149,0.000216,0.000258,0.000255,5.1e-05,0.00027,0.000122,0.000122,0.000124,7.7e-05,5.4e-05,0.00032,9.8e-05,0.00018,0.00011,0.000123,0.000168,4.3e-05,4.5e-05,0.000117,0.000162,0.000203,0.000109,0.000291,0.00024,0.000416,0.000177,0.000121,7.6e-05,0.000123,0.000138,6.7e-05,0.000263,0.000261,0.00013,9.6e-05,0.000206,0.000306,0.000223,0.00015,0.000232,0.000158,4.4e-05,0.000208,0.000224,6.7e-05,9e-05,0.000109,0.000205
0.00034,0.000233,0.000228,0.000313,0.000338,0.000251,0.000278,0.000142,0.000226,0.000286,8.8e-05,0.000234,0.000177,0.000218,0.000445,0.000241,0.00031,0.00022,0.000545,9.3e-05,0.000247,0.000281,0.000265,0.000368,0.000299,0.000364,0.000317,0.000385,0.000364,0.000106,0.000261,0.000351,0.000186,0.000106,0.000404,0.000248,0.000383,7.3e-05,0.000115,0.000476,7.4e-05,2e-04,0.000209,0.000162,5.4e-05,0.000179,0.000637,0.000161,0.00021,0.00011,0.000203,0.000346,0.000323,0.000273,0.000301,6e-05,0.000189,0.000344,0.000245,7.9e-05,0.000313,0.00017,0.000109,0.000206,0.000165,0.000236,0.000286,0.000204,0.000187,0.000388,0.000172,0.000303,0.000117,0.000388,0.000299,0.000129,0.000104,0.000326,8.8e-05,0.000226,0.000159,0.000174,7.8e-05,0.000405,0.000396,0.000124,0.000262,6.4e-05,0.000191,0.000171,0.000285,0.000242,0.000191,0.00021,0.000317,0.000392,0.000101,0.000416,8.4e-05,0.000151,8.5e-05,0.00016,0.000142,0.000295,0.000102,0.000191,0.000301,5.9e-05,0.00035,0.000244,0.000181,0.00022,0.000182,0.000126,0.00023,0.000455,0.000343,0.000173,4.4e-05,0.00021,0.000173
0.00036,0.000355,0.000563,0.000364,0.000192,0.000688,0.000807,0.000451,0.000234,0.000353,0.000313,0.000141,0.00011,0.00023,0.000934,0.000592,0.000502,0.000107,0.000603,0.000532,0.000494,0.000325,0.000971,0.000995,0.000382,0.000501,7.7e-05,0.000377,0.000399,0.000151,0.000455,0.000793,0.00035,0.000326,0.000595,0.000726,0.00093,0.000316,0.000206,0.000627,0.00018,0.000357,0.00025,0.000214,0.000521,0.000316,0.000829,0.000103,2.7e-05,0.000179,0.000112,0.000502,0.000287,0.000655,0.00053,0.000578,0.000416,0.000683,0.000449,2e-04,5e-04,0.000193,0.000191,0.000232,0.000477,0.000321,0.000305,0.000425,0.000333,0.000515,0.000324,0.00031,4e-04,0.000129,0.000307,0.000423,0.000103,0.000873,0.00022,0.000559,0.000519,0.000344,0.000406,0.000812,0.00035,0.000371,0.00041,0.000265,0.000421,0.000409,0.000833,0.000382,0.000329,0.000427,0.000322,0.000764,5e-05,0.000851,0.000567,9.3e-05,0.000447,0.000336,0.000541,0.00036,0.000416,0.000424,0.000367,0.000467,5.4e-05,0.000589,0.000234,0.000406,0.00042,0.000502,7.6e-05,0.000766,0.000279,0.000351,0.000113,0.000343,0.000502
0.000577,0.000449,0.00063,0.000893,0.000237,0.000791,0.000835,0.000631,0.000364,0.000684,0.000388,9.7e-05,0.000113,0.000559,0.001104,0.00156,0.001307,0.000389,0.000735,0.001436,0.000467,0.000493,0.001265,0.000284,0.001066,0.000998,0.000587,0.000946,0.000989,0.000602,0.000237,0.00117,0.000275,0.000476,0.000816,0.000479,0.001579,0.001431,0.000492,0.000894,0.000823,0.000194,0.000901,0.000373,0.001503,0.001577,0.001529,0.001528,0.000539,0.000358,0.000796,0.000123,0.001132,0.000437,0.001293,0.001243,0.000574,0.000738,0.000753,0.000328,0.000589,0.000317,5e-05,0.000282,0.000479,0.001216,0.001284,0.000808,0.000956,0.000754,0.000219,0.000356,0.000533,0.000115,0.000889,0.000386,0.000753,0.001153,0.000913,0.001054,0.000259,0.000179,0.000533,0.000811,0.001587,0.00054,0.000994,0.001119,0.000688,0.000446,0.000559,0.001202,0.001224,0.000857,0.000558,0.000512,0.001112,0.000603,0.001182,0.001094,0.001311,0.000634,0.000886,0.00143,0.000365,0.000854,0.000357,0.000614,0.000535,0.001049,6e-04,0.000197,0.000368,0.000918,0.001079,0.001134,0.000827,0.000886,0.00061,0.000461,0.000213
0.000679,0.001496,0.000483,0.00157,0.001317,0.000734,8.1e-05,0.001082,0.000506,0.001065,0.000639,0.00074,7.1e-05,0.001085,0.000623,0.000513,0.001418,0.001517,0.001533,0.001729,0.000992,0.000834,0.001259,0.001143,0.001504,0.001154,0.000719,0.001377,0.000251,0.000361,0.000673,0.001546,0.001592,0.001406,0.000788,0.000967,0.001783,0.001146,0.001118,0.00085,0.001094,0.00107,0.001388,0.001188,0.001599,0.000349,0.000259,0.001659,0.001687,9e-04,0.000834,0.000729,0.002054,0.001281,0.001927,0.001208,0.001091,0.000636,0.00096,0.001073,0.001332,0.001674,0.001048,0.000693,0.000108,0.001329,0.000927,0.00037,0.002304,0.001262,0.000134,0.000662,0.000883,0.000703,0.001009,0.000557,0.000963,0.002202,0.001993,0.000344,0.001328,0.000493,0.000824,0.001331,0.002381,0.00153,0.00134,0.001463,0.001262,0.00103,0.000463,0.00073,0.001031,0.001029,0.001064,0.000228,0.001499,0.001891,0.001153,6.3e-05,0.000978,0.000601,0.000955,0.000626,0.001397,0.000476,0.000808,0.000881,0.000832,0.000901,0.001226,0.000421,0.000117,0.000792,0.000479,0.001076,0.000562,0.000729,0.000325,0.001002,0.000603
0.000378,0.001815,0.001309,0.001101,0.001322,0.000401,0.000784,0.001918,0.002339,0.002304,0.001142,0.000858,0.000763,0.001634,0.00165,0.001004,0.001085,0.000593,0.000351,0.000574,0.000266,0.00034,0.001259,0.001201,0.000441,0.000181,0.000677,0.001891,0.00181,0.001302,0.001051,0.002534,0.002452,0.000716,0.000962,0.001487,0.000451,0.000196,0.000659,0.000584,0.000854,9.8e-05,0.000978,0.001604,0.002045,0.001946,0.001276,0.001641,0.001809,0.001205,0.001705,0.001013,0.001823,0.000545,0.001565,0.001063,0.001236,0.000751,0.001244,0.000533,0.001494,0.00177,0.000695,0.000391,0.000395,0.001305,0.001576,0.001099,0.002702,0.002021,0.001537,0.001287,0.001818,0.001515,0.002114,0.001328,0.001405,0.002078,0.000343,0.000957,0.001831,0.001427,0.000787,0.001274,0.000692,0.00097,6.2e-05,0.000644,0.000176,0.000535,0.00082,0.000208,0.000537,0.001036,0.000499,0.000864,0.00159,0.000521,0.000558,0.000378,0.001012,0.000979,0.000911,0.000645,0.001201,0.001262,0.001276,0.000431,0.00115,0.000656,0.001202,0.001029,0.000458,0.000518,0.0011,0.000698,8.6e-05,0.000713,0.000763,0.001297,0.000818
0.000889,0.001482,0.000814,0.001307,0.000884,0.001079,0.000871,0.00099,0.001432,0.000176,0.000135,0.000276,0.00025,0.000977,0.001186,0.001187,0.000334,0.00049,0.000573,0.00039,0.000228,0.000156,0.000548,0.000166,0.000291,0.000386,0.000801,0.000574,0.000929,0.000464,0.000364,0.001681,0.000518,0.000365,0.001014,0.000615,0.000769,5e-04,0.000654,0.000322,0.000249,0.000299,0.000923,0.000789,0.000438,0.000798,0.000972,0.000224,0.001033,0.000248,0.000867,0.001143,0.001491,0.001512,0.000766,0.000432,0.000311,0.000418,0.000345,0.000224,0.001248,0.000278,0.000502,0.000591,0.000143,0.000729,0.000952,0.001005,0.00103,0.000221,0.000505,0.00038,0.000887,0.000154,0.001148,0.000599,0.000567,0.000512,0.000616,0.000917,0.000575,0.00011,0.000685,0.00024,0.000832,0.000532,0.000285,0.000409,0.000282,0.000335,0.000617,0.000556,0.000252,0.000646,0.000386,0.000696,0.000421,0.000418,0.000141,0.000199,0.000413,0.000189,0.00046,0.000609,0.000221,0.000437,0.000224,0.00034,0.000584,0.000687,0.000214,0.00059,0.000334,0.000356,0.000552,0.000399,0.000609,2e-05,0.000518,0.000653,0.000303
0.000459,0.000467,0.000216,0.000535,0.000307,0.000361,0.00034,0.000788,0.000222,0.000371,0.000104,0.000111,0.000324,0.000469,0.000657,0.000493,0.000296,0.000376,0.000366,0.00015,0.000171,0.000206,0.000226,3.4e-05,0.000127,0.000485,0.000266,0.000408,0.000269,0.000237,0.000423,0.000592,0.000239,0.000157,0.000514,0.000158,0.000552,0.000137,0.00017,0.000139,0.00011,0.000128,0.000377,0.000464,0.000384,0.000318,0.000475,0.000402,0.000171,9.5e-05,0.000303,0.000703,0.000407,0.000575,0.000451,0.000157,0.000116,0.000395,0.00032,0.000262,0.000432,0.000217,0.000392,0.000337,0.00036,0.00031,0.000256,0.000451,0.000663,0.000213,0.000217,0.000452,0.000222,0.000332,0.00032,0.000119,0.000291,0.000291,0.000301,0.000266,0.000267,0.000217,0.000427,0.00031,0.000422,0.000222,0.000242,0.000197,9.5e-05,0.000122,0.000296,0.000344,0.000214,0.00026,0.000202,0.000144,0.000251,0.000105,0.000135,2.8e-05,0.000253,0.00017,9.1e-05,0.00032,0.000116,0.000203,0.00018,8e-05,0.000203,0.000187,0.000152,0.000182,0.000194,0.000133,0.000378,0.000198,0.000219,0.000131,0.000274,0.000188,7.6e-05
0.000184,0.000391,0.000121,0.000199,0.000189,0.000187,8.2e-05,0.000495,0.000223,0.000159,8.5e-05,7.4e-05,0.000203,0.000449,0.000493,0.000103,0.000185,0.000324,0.000285,0.000131,6.5e-05,9.2e-05,0.000175,0.000136,0.000212,0.000255,0.000218,0.000257,0.000198,9.9e-05,0.000322,0.000326,3.9e-05,0.000171,0.000364,0.00027,0.000165,4.4e-05,0.00026,6.9e-05,6.7e-05,9.7e-05,0.000259,0.000318,0.000123,0.000338,0.000258,0.000351,0.000109,8.7e-05,0.00025,0.000467,0.000426,0.000272,0.00031,0.00015,0.000159,7.1e-05,0.000161,0.000165,0.000241,8.7e-05,0.000123,3.3e-05,0.000187,0.000327,0.000214,0.000227,0.00031,0.000162,0.000105,0.00018,0.000154,0.000251,0.000288,2.7e-05,0.000322,0.000317,7.2e-05,0.00018,5.5e-05,3.9e-05,0.000221,0.000204,0.00027,3.1e-05,0.000145,0.000208,0.000159,0.000105,0.000199,0.000355,0.00012,0.000189,0.000176,0.000279,0.00013,0.000131,7.7e-05,3.8e-05,0.000269,0.000188,0.000186,0.000222,0.000137,0.000116,2e-04,7.4e-05,0.000165,7.9e-05,4.5e-05,6.7e-05,4.2e-05,1.8e-05,0.000269,0.00017,0.000132,7.6e-05,0.000147,0.000269,7.8e-05
0.000226,0.000479,0.000346,0.000349,0.000243,0.000137,0.000193,0.000393,0.000213,0.000179,5.5e-05,0.000191,5.4e-05,0.000308,0.000255,0.000102,8.7e-05,0.000432,0.000227,0.000157,0.000266,0.000216,0.000242,0.00023,0.000123,0.000204,9.5e-05,0.00016,0.000176,9.7e-05,0.000167,0.000353,8e-05,8.3e-05,0.00026,0.000274,0.000198,9.8e-05,0.000391,0.000375,0.000286,0.000227,0.000279,0.000433,0.000361,0.000296,0.000162,0.000238,0.000269,0.000365,0.000208,0.000248,0.000349,0.000306,0.00058,0.000209,0.000261,8.1e-05,0.000106,0.000128,0.000366,0.000127,5.8e-05,0.000223,6.6e-05,0.00047,0.000216,4.2e-05,0.000382,0.000234,0.000147,0.000283,0.000126,0.000135,0.000317,0.000271,0.000372,0.000332,0.000219,0.000199,0.000141,0.000127,8.2e-05,0.000149,2e-04,0.000195,0.00032,0.000346,0.000238,0.000147,0.000305,0.000357,0.000245,0.000166,0.000156,0.000176,5.9e-05,0.000335,0.000186,0.000101,0.000345,3.4e-05,0.000316,0.000234,3.2e-05,0.000112,0.000209,0.000346,0.000367,0.00013,2.1e-05,0.000195,0.000175,0.000133,0.000288,8e-05,3.7e-05,6.7e-05,0.000238,0.000157,0.000102
0.000121,0.00034,0.000366,0.000188,0.000105,0.000202,0.000218,0.000304,0.000346,5.7e-05,0.000197,0.000231,0.000123,0.000189,0.00029,0.000101,0.000202,0.000244,0.000324,0.000139,7.9e-05,0.000321,0.000406,0.000317,0.000273,0.000272,7.5e-05,0.000248,0.000108,0.000246,0.000177,0.00026,0.000323,0.000221,0.000197,0.000141,0.000197,0.000204,0.000197,0.000225,0.000126,0.000207,0.000245,0.000541,0.000206,0.00019,0.000358,0.000243,0.000277,0.000333,0.00038,0.000718,0.000377,0.000268,0.000355,0.000293,0.000125,0.000131,0.000105,0.000226,0.000452,0.000215,0.000265,0.000134,0.000195,0.00041,0.000596,0.00039,0.000132,0.000125,0.000126,0.000293,0.000168,0.000399,0.000152,0.000115,0.000194,0.000314,0.000204,7.5e-05,3.2e-05,0.000132,0.000103,5.9e-05,0.000145,0.00036,0.000544,0.000352,0.000221,0.00019,0.000302,2e-05,6.6e-05,0.000215,0.000235,8.9e-05,5.9e-05,0.000261,9.8e-05,6e-06,0.000434,0.000323,0.000324,0.00026,0.000139,0.000138,0.000225,0.00028,0.000385,0.00018,0.000287,0.000315,0.000183,0.000137,0.000132,0.000198,0.000122,4.7e-05,0.000198,7e-05,0.000152
0.000358,0.000352,0.000133,0.000326,0.000238,0.000241,0.000166,0.000136,0.000349,0.000175,0.000427,0.000299,0.000244,0.000256,0.000196,4.9e-05,0.000318,0.000321,0.000359,0.000253,0.000255,0.000235,0.000187,0.000286,8.5e-05,0.000224,0.00026,0.000403,0.000275,0.000338,0.000115,0.000227,0.000296,0.000167,0.000323,0.000245,0.000488,0.000105,8.5e-05,0.00018,0.000186,0.000165,0.000201,0.000272,0.000397,0.000418,0.000258,0.000151,0.000136,0.000492,0.000396,0.000296,0.000227,0.000178,0.00025,0.000161,4.7e-05,0.000194,0.000182,0.000403,9.1e-05,0.000182,0.000145,0.000197,0.000198,0.000343,6.3e-05,0.00025,0.000448,0.000219,7.2e-05,0.000196,0.000251,0.00037,0.000105,0.000239,0.000297,8.3e-05,0.000537,0.000507,0.000149,0.000208,0.000197,3.2e-05,0.000121,0.000225,0.000367,0.000352,0.000272,0.000289,0.000423,0.000362,0.000272,0.000313,0.000166,0.000207,0.000143,9e-05,0.00012,7.8e-05,0.000352,0.000276,9.5e-05,0.000281,0.000143,0.000296,0.000127,0.000367,0.000296,0.000222,0.00037,9e-05,6.2e-05,0.000251,7.6e-05,8.6e-05,9.6e-05,0.000159,0.000134,0.000226,0.000176
0.000434,0.000202,0.000315,0.000362,0.000267,0.000487,0.000313,0.000195,0.000319,0.000153,0.000268,0.000125,0.00016,0.000238,7.5e-05,0.000131,0.000312,0.000193,7.1e-05,4.5e-05,0.000172,0.000142,0.000317,6e-05,0.000323,0.000512,8.2e-05,0.000459,0.000162,0.000307,0.000274,0.000209,0.000198,0.000321,0.000108,0.000436,0.00035,0.000184,0.000104,0.000436,0.000292,0.000345,0.000662,0.000265,0.000183,0.000267,0.00026,0.000126,0.000196,0.000353,0.00036,0.000372,8.4e-05,0.000178,0.000282,0.000376,0.000327,0.000156,0.000128,0.000277,0.00023,7.6e-05,0.000176,6.8e-05,0.000279,2e-04,0.000109,0.000218,0.000318,0.00041,0.000206,0.000143,0.000424,0.000228,0.000303,4.3e-05,5.5e-05,9.4e-05,0.000384,3.5e-05,0.000276,0.000132,0.000294,0.000267,7.9e-05,7.1e-05,0.000318,0.000205,0.00029,0.000298,8e-05,1e-04,0.000231,0.000326,9e-05,0.000184,0.000431,0.000662,0.000272,7.5e-05,0.000274,0.000255,0.00017,0.000224,0.000211,0.000257,0.000181,0.000286,0.000309,9.6e-05,0.000157,0.000192,0.000241,0.000358,0.000312,0.000189,9e-05,0.000147,0.000112,0.000235,0.000229
0.000215,0.000311,0.000222,1.8e-05,0.00046,0.000375,0.000209,0.000167,0.00035,0.000104,0.000168,9.6e-05,7.4e-05,0.000229,0.00029,1e-04,0.000365,0.000339,0.000296,0.000196,0.000146,0.000209,0.000463,0.00057,0.000633,0.000461,0.000367,0.000384,0.000297,0.000212,0.000381,0.000424,0.000271,0.000231,0.000238,0.000319,0.000474,0.000269,0.000198,0.000392,0.000167,0.000164,0.000457,0.000355,0.000213,0.000291,0.000252,0.000346,0.000357,0.000361,0.000198,0.000481,0.00049,0.000219,0.000227,0.000245,0.000146,0.000278,0.000315,0.000274,0.000213,6.3e-05,0.000171,0.00019,0.000165,9.3e-05,0.000312,0.000161,0.000136,0.00026,0.000206,5.6e-05,0.000272,0.000143,9.3e-05,0.000176,0.000133,0.00016,0.000291,0.000268,0.000191,0.000106,0.000223,6.9e-05,0.000149,0.000378,0.000172,0.000553,0.000274,0.000166,0.000153,0.000145,0.000304,0.000231,0.000345,0.000163,0.000484,0.000306,0.000154,5.5e-05,0.000188,9.7e-05,0.000452,0.000307,0.000267,9.1e-05,0.00014,0.000109,0.00031,0.000535,0.000527,0.000294,0.000146,0.000188,0.000277,0.000176,0.000109,8.5e-05,8.3e-05,0.000148,0.000142
3.8e-05,0.000221,0.000179,0.000228,0.000371,0.000121,0.000183,0.000181,0.000198,0.000138,2.3e-05,5e-06,6.2e-05,6.3e-05,0.000233,0.000198,0.000302,4.9e-05,0.000105,0.00019,0.000137,1e-04,0.000142,0.000374,0.000122,0.000272,0.000316,0.000334,0.000289,3.1e-05,0.000288,0.000147,5.4e-05,0.000135,0.000228,0.000426,0.000568,0.000412,0.000375,0.000166,0.000204,8.5e-05,0.000403,0.000253,0.000199,2e-05,0.000167,0.000172,0.000236,0.000117,6.3e-05,0.000373,0.000124,6.6e-05,0.000259,0.000191,2.3e-05,7.9e-05,0.000232,5.8e-05,0.000356,0.000257,0.000343,0.000264,0.000223,0.000141,0.000181,0.000306,0.000239,0.000116,0.000161,0.000172,8.5e-05,0.000302,0.000106,8.3e-05,0.000176,0.000335,0.000174,7e-06,0.000139,7.5e-05,0.000118,0.000224,0.000308,0.000258,0.000235,0.00057,0.000333,0.000132,0.000112,0.000229,0.000268,0.000208,0.000329,0.000276,0.000172,0.000253,0.000235,0.000103,0.00026,0.000119,0.000324,0.000293,8.3e-05,8e-05,0.000159,0.000251,0.000164,0.000275,0.000139,9.3e-05,0.000154,0.000124,0.00013,4e-05,0.00011,5.5e-05,6.7e-05,0.000162,1.8e-05
8.3e-05,0.000152,0.000107,4.3e-05,0.000117,0.000142,0.000126,0.000127,0.000207,0.000201,5e-06,1.1e-05,4.4e-05,8.8e-05,0.000268,9.7e-05,3.9e-05,0.000167,0.000191,0.000136,0.000284,0.000282,7.4e-05,0.000361,0.000301,0.00021,0.000451,0.000161,0.000161,0.000261,0.000131,0.000121,7.7e-05,9.5e-05,0.000246,0.000137,0.000153,8.7e-05,0.000318,0.000313,0.000304,0.00024,0.000265,0.000146,1.9e-05,7.7e-05,0.000116,2.7e-05,0.000132,0.000272,9.8e-05,8.1e-05,0.000133,0.000101,0.000209,0.000291,0.000168,8.9e-05,6.8e-05,0.000154,3e-04,4.1e-05,0.000181,0.000107,0.00031,0.000243,0.000196,0.00024,4.9e-05,0.000175,7.8e-05,6.8e-05,0.000222,0.000389,0.000255,6.6e-05,0.000124,8.9e-05,5.1e-05,7e-05,0.000128,0.000239,0.00019,0.000209,0.000225,0.000357,0.000199,0.000193,0.000222,9.2e-05,0.00022,6.5e-05,0.000224,0.000259,0.000279,6.3e-05,6.6e-05,5.6e-05,0.000144,8.4e-05,0.000255,2e-04,6.5e-05,0.000159,0.000137,0.000259,7.2e-05,5.3e-05,0.000137,0.000297,0.000156,0.000153,0.000191,0.000162,1e-04,0.000117,6.2e-05,6.4e-05,0.000123,8.7e-05,0.000104
7.5e-05,8.3e-05,0.000186,0.000209,5.8e-05,7.4e-05,7.4e-05,0.000167,0.000287,8.1e-05,0.000138,7.1e-05,8.7e-05,0.00015,0.000153,0.000103,0.000148,9.8e-05,0.000134,0.000111,0.000105,1e-04,0.000152,0.000273,0.000118,0.00018,0.000185,0.000174,0.000221,0.00011,0.000126,4.8e-05,5.2e-05,2.3e-05,0.000181,3e-05,2.4e-05,0.000135,0.000161,0.00015,0.000118,0.000162,5.2e-05,0.000112,7.2e-05,0.000114,4.3e-05,9.6e-05,0.000126,0.000151,0.00013,0.000211,0.000115,0.000138,5.9e-05,0.000192,0.000154,0.000123,0.000104,0.000166,9.4e-05,8.7e-05,0.000101,9.1e-05,0.000183,0.000206,0.000228,4e-05,6.7e-05,0.000136,0.000161,0.000124,0.000101,0.000138,5.8e-05,4e-05,0.000151,0.000157,0.000109,0.000105,6.8e-05,0.000129,0.000116,0.000108,0.000116,0.000162,0.000112,0.000172,6.7e-05,0.000121,0.000112,0.00016,0.000117,0.000176,0.000117,0.000165,2.5e-05,9.1e-05,8.5e-05,4.6e-05,0.000211,9.6e-05,7.9e-05,0.00013,6.4e-05,0.000193,7.8e-05,6.5e-05,0.00011,0.000148,6.2e-05,9.9e-05,3.3e-05,1.6e-05,6.7e-05,3e-05,9.9e-05,9.1e-05,7.1e-05,4.4e-05,0.000126
6e-05,9e-05,1.5e-05,0.000213,0.000165,0.00012,4.7e-05,0.000112,0.000123,1.7e-05,0.000254,0.000181,2.6e-05,0.000192,0.000185,1.8e-05,0.000137,0.000199,8.2e-05,4.1e-05,0.000138,8e-05,5.4e-05,9.5e-05,0.000269,9.8e-05,0.00014,0.000229,0.000154,0.000157,0.000128,4.8e-05,1.1e-05,7.7e-05,0.000234,4.3e-05,8.6e-05,6.9e-05,5.9e-05,0.000124,0.000254,0.000149,0.000184,0.000102,6.4e-05,0.000127,5.9e-05,9.3e-05,2e-04,0.000117,7.7e-05,0.000133,0.000128,6e-05,0.000124,0.000141,0.000235,6.7e-05,0.00011,0.000138,0.000154,0.000145,0.000161,4.4e-05,0.000125,0.000105,0.000127,7.3e-05,5.7e-05,0.000154,5.1e-05,5.4e-05,3.8e-05,0.00016,0.000251,7.6e-05,1e-04,1e-05,0.000113,1.7e-05,8.4e-05,8.1e-05,6.5e-05,8.8e-05,0.000119,0.00014,6.3e-05,0.000156,0.00012,0.000175,0.000123,0.000132,0.000122,0.000126,9.8e-05,6.6e-05,7.6e-05,6.7e-05,9.7e-05,0.000161,7.6e-05,3.5e-05,8.7e-05,0.000144,0.000107,0.000199,0.000139,7.1e-05,8.8e-05,0.000146,9.4e-05,0.000107,5.5e-05,6.7e-05,8.7e-05,1.9e-05,7.6e-05,5e-06,9.9e-05,2.4e-05,0.000117
0.000107,8.8e-05,4.8e-05,6.9e-05,2.6e-05,6.8e-05,8.3e-05,1.5e-05,6.9e-05,4.4e-05,0.000123,0.000154,0.000133,9.5e-05,7.2e-05,5.2e-05,9.9e-05,6.3e-05,6.8e-05,8.2e-05,0.000126,0.000188,0.000172,4.8e-05,9.4e-05,5.6e-05,5.1e-05,6e-05,2.8e-05,1.7e-05,2.8e-05,4.2e-05,2.6e-05,6.5e-05,1e-04,0.000116,0.000129,3.7e-05,0.000117,1.8e-05,8.8e-05,2.7e-05,5.8e-05,4.5e-05,3.9e-05,4.3e-05,1.7e-05,5.2e-05,8.7e-05,5.5e-05,7e-05,5.8e-05,9.2e-05,0.000108,0.00011,5.2e-05,2.5e-05,6.2e-05,4.9e-05,6e-05,2.9e-05,0.000148,4.4e-05,9.8e-05,0.000147,1e-04,7.1e-05,5.6e-05,5e-05,5.5e-05,6.5e-05,9.6e-05,2.2e-05,4.9e-05,3.1e-05,9.2e-05,8.2e-05,4e-05,5.7e-05,5.4e-05,5.5e-05,8.3e-05,6.1e-05,3.4e-05,7.8e-05,4.1e-05,9e-05,4.4e-05,8e-06,3.3e-05,2.1e-05,5.2e-05,4e-06,1.6e-05,2.7e-05,8.8e-05,7.2e-05,2.1e-05,4.7e-05,8.5e-05,6e-05,8e-05,4.5e-05,2.1e-05,4.8e-05,8.7e-05,6.6e-05,3.4e-05,3.5e-05,5.7e-05,6.6e-05,2.7e-05,2e-06,5.5e-05,2.2e-05,1e-05,2.8e-05,4.5e-05,3.9e-05,2.3e-05,6.1e-05
0.000164,0.000177,0.000145,0.000139,4.6e-05,3.6e-05,6.3e-05,2.2e-05,4.1e-05,0.000113,0.000174,0.00011,8e-06,0.000212,0.000221,0.000159,0.000121,8.9e-05,6.6e-05,9.5e-05,4.1e-05,0.000147,0.000135,0.000124,8e-05,3.5e-05,3.8e-05,9.3e-05,8.2e-05,2e-05,5.8e-05,1.9e-05,5.7e-05,0.000112,4.6e-05,6.7e-05,0.000103,4.9e-05,0.000157,0.000181,5e-06,4e-05,3.8e-05,0.00011,2.8e-05,8.8e-05,5.3e-05,8.4e-05,8.4e-05,5.3e-05,9.9e-05,0.000101,0.000102,6.7e-05,5.5e-05,6.9e-05,1.4e-05,3.9e-05,8.6e-05,0.000119,7.5e-05,0.000112,9.1e-05,0.000149,4.4e-05,8.5e-05,6.5e-05,9.2e-05,6.7e-05,7.5e-05,3.2e-05,0.000108,7.3e-05,5.1e-05,8.5e-05,0.000116,9.3e-05,2.5e-05,4.8e-05,2.5e-05,2.6e-05,4.3e-05,7e-06,2.8e-05,4.2e-05,7.6e-05,8.4e-05,4.5e-05,4.3e-05,6.6e-05,6.6e-05,3.5e-05,4.2e-05,6.6e-05,3.3e-05,8.5e-05,3.9e-05,5.1e-05,3.8e-05,7.1e-05,8.7e-05,0.000129,0.000172,1e-04,4.8e-05,0.000128,4.3e-05,3.1e-05,4.2e-05,0.00011,6.5e-05,6.4e-05,1.5e-05,8.3e-05,8.1e-05,5.5e-05,5.2e-05,6.1e-05,7.7e-05,5.9e-05,4.5e-05
7.7e-05,0.00015,6.6e-05,8.6e-05,3e-05,2.1e-05,0.000146,0.000166,0.00012,0.000176,9.9e-05,9.8e-05,6.4e-05,0.000171,2.7e-05,1.9e-05,0.000103,0.000105,5.1e-05,8.6e-05,0.000128,2.8e-05,5.2e-05,2.9e-05,3.4e-05,6e-05,6.7e-05,0.00015,0.000152,0.000125,3.1e-05,0.000141,0.000172,9e-06,5.2e-05,2.4e-05,0.000188,0.000121,9.1e-05,0.000162,0.000164,0.000132,9.4e-05,9.9e-05,6.5e-05,9.6e-05,7.6e-05,0.000115,0.000104,9.4e-05,5.2e-05,8.8e-05,0.000112,0.000116,2.3e-05,3.6e-05,5.3e-05,7.4e-05,8.7e-05,5e-05,7.8e-05,6e-05,8.8e-05,6.6e-05,0.000185,5.2e-05,7e-06,3.9e-05,7.4e-05,3e-05,2.8e-05,0.000116,8e-05,2e-05,7.4e-05,3.8e-05,6.1e-05,4.7e-05,6.4e-05,5e-05,9e-06,8.1e-05,9.2e-05,5.7e-05,6.7e-05,8e-05,6.9e-05,3.1e-05,2.7e-05,0.000111,9e-05,3.5e-05,5.2e-05,0.000117,5.3e-05,9.6e-05,0.000105,5.5e-05,5.8e-05,3.1e-05,0.000123,0.000174,3.3e-05,4.1e-05,1.5e-05,0.000111,9.1e-05,9.3e-05,2.4e-05,8.6e-05,3.6e-05,7.4e-05,6.3e-05,9.5e-05,6.9e-05,2.4e-05,4.2e-05,7.6e-05,8.6e-05,7.1e-05,0.000114
0.000128,7.2e-05,6.7e-05,6.8e-05,8.4e-05,7e-05,0.00015,0.000132,0.000119,5e-06,6.1e-05,0.00011,5.2e-05,8.7e-05,9.3e-05,5.7e-05,6.2e-05,9.2e-05,7.1e-05,0.000147,0.000149,3.6e-05,2e-05,1.3e-05,1.5e-05,9.7e-05,4.8e-05,0.000114,3.5e-05,4.7e-05,8.4e-05,0.000119,7.6e-05,0.000126,0.000175,8.9e-05,0.000108,1e-04,5e-05,9.2e-05,2.7e-05,5.2e-05,0.000111,0.000189,8.7e-05,4.9e-05,4.3e-05,6.2e-05,0.000135,2.3e-05,0.000101,9.1e-05,8.5e-05,4.8e-05,6.4e-05,9e-06,5.4e-05,3.3e-05,1.7e-05,8e-05,1.6e-05,6.4e-05,7.1e-05,7.9e-05,0.000101,6.6e-05,5.7e-05,1.1e-05,2.7e-05,4.1e-05,6.2e-05,6.5e-05,6.3e-05,7.4e-05,4.8e-05,5.8e-05,7.4e-05,3.5e-05,2.8e-05,3.8e-05,1.4e-05,0.000113,7.7e-05,0.000116,9.9e-05,9.4e-05,4.6e-05,2.3e-05,3.1e-05,9.3e-05,5.4e-05,9.5e-05,0.000122,3.3e-05,5.6e-05,4.8e-05,0.000136,9.8e-05,0.000108,5.3e-05,0.000118,5e-06,6e-05,4.1e-05,3.2e-05,3e-05,1.4e-05,3.5e-05,4.5e-05,1.2e-05,8.7e-05,9.4e-05,5e-05,8e-05,6.9e-05,5.4e-05,7.4e-05,9.4e-05,4.8e-05,2.2e-05,8.1e-05
9.9e-05,0.000146,4.9e-05,2.1e-05,2.7e-05,7.1e-05,0.000138,0.00012,0.000128,6.2e-05,8.6e-05,7.8e-05,4.1e-05,4.5e-05,2.2e-05,2.9e-05,4.7e-05,7.4e-05,8.1e-05,0.000185,6.6e-05,8.5e-05,6e-05,5.4e-05,3.4e-05,6.2e-05,6.2e-05,3.8e-05,2.4e-05,1.8e-05,3.1e-05,6.1e-05,8.3e-05,3.2e-05,6.9e-05,2.7e-05,8.6e-05,9e-05,5.3e-05,4.3e-05,3.3e-05,4.4e-05,6.8e-05,8.2e-05,0.000179,0.000126,7.6e-05,5.2e-05,9.9e-05,9.2e-05,9.3e-05,6.5e-05,6.5e-05,7.7e-05,8.6e-05,6.5e-05,4.1e-05,3.2e-05,4.9e-05,4.8e-05,0.000118,2.4e-05,9e-06,6e-06,5.2e-05,3.9e-05,7.7e-05,6e-05,4.8e-05,5.2e-05,3.1e-05,3.1e-05,4.4e-05,2e-06,8.3e-05,7e-05,5e-06,1.5e-05,4e-05,1.8e-05,6e-05,0.000116,8.3e-05,0.000116,3e-05,5.4e-05,9.5e-05,2.2e-05,1.7e-05,9.5e-05,0.000117,0.00015,3.7e-05,4.2e-05,5.5e-05,7.7e-05,0.000129,7e-05,9.7e-05,3e-05,0.000101,5.8e-05,4.1e-05,2e-05,3.7e-05,3.7e-05,1.1e-05,4.5e-05,3.7e-05,2.5e-05,0.00011,9.5e-05,5.7e-05,3.6e-05,1.6e-05,5.1e-05,6.4e-05,2.8e-05,5.8e-05,8.9e-05,3.6e-05
9.3e-05,0.000132,8.9e-05,2.4e-05,4.7e-05,6.9e-05,0.000142,0.000115,5.2e-05,5e-05,7e-05,2.5e-05,1.6e-05,3.1e-05,1.8e-05,5.3e-05,6.1e-05,8.6e-05,6.2e-05,0.000146,7.7e-05,5.3e-05,1e-05,3.9e-05,4.6e-05,5.2e-05,2.3e-05,3.8e-05,5.5e-05,4.8e-05,9.4e-05,7.9e-05,4.4e-05,5.5e-05,6e-05,3.9e-05,6.9e-05,2.4e-05,3.2e-05,4.1e-05,1.9e-05,1.3e-05,3.7e-05,7.2e-05,9.9e-05,1.6e-05,6.6e-05,3.8e-05,9.7e-05,5e-05,2.9e-05,7.8e-05,2.2e-05,2.8e-05,5.4e-05,5.8e-05,6.2e-05,2.5e-05,5.1e-05,4.6e-05,8.8e-05,4.9e-05,3.8e-05,3.1e-05,3.9e-05,5.2e-05,1.2e-05,8e-06,3.9e-05,1.5e-05,3.4e-05,3.9e-05,8e-06,3.4e-05,6.7e-05,1.7e-05,1.1e-05,2.9e-05,4.8e-05,5.5e-05,3e-05,2.2e-05,4.3e-05,3.3e-05,4.5e-05,6.1e-05,3.9e-05,4.8e-05,5.7e-05,2.3e-05,4.5e-05,3.9e-05,3e-05,3e-05,3.1e-05,3.4e-05,3.7e-05,6.4e-05,1.3e-05,3.3e-05,6.4e-05,1.1e-05,4.4e-05,3e-05,5e-06,4.8e-05,3.3e-05,6.1e-05,4.7e-05,1.1e-05,7.9e-05,2.5e-05,3.7e-05,3.9e-05,4.5e-05,3.3e-05,2.1e-05,3.2e-05,1.7e-05,6.3e-05,3.2e-05
2.6e-05,4.5e-05,1.6e-05,3.8e-05,1.5e-05,3e-05,3.4e-05,7e-05,2.7e-05,5.7e-05,1.7e-05,4.2e-05,4.6e-05,7.5e-05,5e-05,7.6e-05,1.5e-05,5.6e-05,0.000111,2.4e-05,4.1e-05,7.4e-05,4.9e-05,2.3e-05,1e-05,1.1e-05,1.6e-05,5.4e-05,4.1e-05,9e-06,8.3e-05,3.5e-05,6.7e-05,1.7e-05,7.6e-05,4.7e-05,7.2e-05,1.7e-05,1.2e-05,4.6e-05,3.4e-05,3.6e-05,2.1e-05,2.7e-05,8.1e-05,3.8e-05,3.5e-05,4.1e-05,3.3e-05,4e-05,3.8e-05,1.6e-05,9e-06,2.4e-05,3.2e-05,2e-05,3.1e-05,3.5e-05,1.9e-05,4.6e-05,4.8e-05,3.1e-05,3.7e-05,2.9e-05,6.5e-05,6.4e-05,4.5e-05,3.4e-05,4.8e-05,2.9e-05,3.8e-05,2.1e-05,1.2e-05,5.2e-05,3.5e-05,4.5e-05,2.5e-05,2.8e-05,4.7e-05,4.2e-05,4.1e-05,2.1e-05,9e-06,2.6e-05,3.1e-05,4.1e-05,1.3e-05,4.9e-05,3.3e-05,1.9e-05,3e-05,3.7e-05,1.9e-05,1.8e-05,4e-05,1.3e-05,2.1e-05,1.3e-05,2.2e-05,1.7e-05,1.8e-05,6e-06,2.6e-05,3.1e-05,2.8e-05,5e-05,2.4e-05,2.2e-05,1.2e-05,2.5e-05,4.5e-05,1.9e-05,1.3e-05,2.4e-05,1.3e-05,2.5e-05,1.8e-05,2.8e-05,3.9e-05,2.4e-05,2.5e-05
3.4e-05,2e-05,1.9e-05,3.6e-05,3.1e-05,2.4e-05,2e-06,8.3e-05,1.8e-05,2.1e-05,1.6e-05,3.1e-05,4.2e-05,3.5e-05,9e-06,4.3e-05,2e-05,2.3e-05,7.5e-05,6.2e-05,5.2e-05,4.5e-05,3.6e-05,4.3e-05,2.1e-05,2.2e-05,4.4e-05,5.1e-05,1.1e-05,1e-05,5.5e-05,5.8e-05,3.9e-05,3.3e-05,3.9e-05,2.5e-05,4.3e-05,1.3e-05,2.6e-05,1.6e-05,2.9e-05,2.1e-05,9e-06,2.3e-05,6.3e-05,1.7e-05,4.2e-05,1.4e-05,5.2e-05,1.1e-05,3.2e-05,2.7e-05,7e-06,2.2e-05,1.9e-05,1.8e-05,2.2e-05,1.6e-05,3.4e-05,4.1e-05,5.3e-05,3.9e-05,1.3e-05,1.7e-05,2.5e-05,4.7e-05,6e-06,1.8e-05,3.2e-05,1.9e-05,1.8e-05,2.4e-05,4e-06,4.8e-05,3.3e-05,4e-05,8e-06,2.7e-05,4.6e-05,3.7e-05,1.2e-05,7e-06,6e-06,1.1e-05,2.7e-05,4.6e-05,2.8e-05,4.5e-05,8e-06,1.7e-05,9e-06,2.1e-05,6e-06,2.6e-05,1.5e-05,5e-06,2.7e-05,2.6e-05,1.1e-05,1.6e-05,8e-06,2.1e-05,4.3e-05,1.5e-05,2.1e-05,3.4e-05,7e-06,1.7e-05,1.2e-05,3.7e-05,1.8e-05,1.7e-05,1.2e-05,9e-06,2e-05,4.3e-05,2.2e-05,8e-06,2.1e-05,2e-05,1.4e-05
2.3e-05,7e-06,2.1e-05,1.4e-05,4.6e-05,5.4e-05,3.7e-05,8e-05,3.5e-05,2.6e-05,1.2e-05,2.3e-05,2.3e-05,4.5e-05,4.6e-05,4.3e-05,3.3e-05,1.2e-05,0.000103,3.7e-05,2.2e-05,5.1e-05,2.3e-05,3.1e-05,2.9e-05,5e-05,3e-05,6.2e-05,2.7e-05,9e-06,1.5e-05,7e-05,5.7e-05,3.6e-05,8e-06,1.8e-05,7e-06,3.3e-05,9e-06,7e-06,3e-06,3e-06,2.3e-05,2.7e-05,4.4e-05,3.4e-05,9e-06,2.7e-05,3.3e-05,2.8e-05,1.9e-05,2.1e-05,1.1e-05,2.4e-05,2.6e-05,1.4e-05,1e-05,2.1e-05,3.6e-05,3.4e-05,4.7e-05,2.7e-05,2.4e-05,9e-06,3.6e-05,4.8e-05,3.3e-05,1.7e-05,2e-05,2.7e-05,2.3e-05,1.7e-05,5e-06,3e-05,2.2e-05,1.6e-05,2e-06,3e-05,9e-06,2.5e-05,2e-05,5e-06,6e-06,1e-05,2e-05,2e-05,1.7e-05,3.5e-05,9e-06,2.2e-05,1.4e-05,3.2e-05,1.2e-05,3.2e-05,2e-06,8e-06,1.2e-05,2.5e-05,1.6e-05,3.1e-05,4.7e-05,2.3e-05,4.2e-05,3.3e-05,5e-06,4.8e-05,2.4e-05,6e-06,1.4e-05,1.1e-05,1.2e-05,9e-06,2.1e-05,7e-06,2.5e-05,4e-05,2.5e-05,6e-06,2.6e-05,2.9e-05,5e-06
5.2e-05,2.6e-05,4.1e-05,6.5e-05,6.1e-05,2.5e-05,2.8e-05,8.8e-05,1.3e-05,3.5e-05,3.3e-05,4e-05,3.2e-05,4e-05,6.1e-05,4.6e-05,7.3e-05,8.8e-05,0.000117,0.000107,5.6e-05,5.7e-05,2.1e-05,3.1e-05,2.1e-05,6.2e-05,5.8e-05,5.2e-05,2.1e-05,1.7e-05,2.1e-05,6.3e-05,1.2e-05,4.1e-05,1.7e-05,2.6e-05,1.1e-05,1.3e-05,1.6e-05,8e-06,2.1e-05,2.3e-05,2.6e-05,2.5e-05,5e-05,4.1e-05,1.7e-05,6e-06,3.8e-05,2.5e-05,1.1e-05,3.4e-05,3.3e-05,3.6e-05,1.2e-05,2.2e-05,1.8e-05,2.9e-05,4.5e-05,1.6e-05,3.2e-05,9e-06,9e-06,9e-06,2.6e-05,4.5e-05,1.2e-05,2.1e-05,1.5e-05,2e-05,2.7e-05,7e-06,3.1e-05,2.8e-05,2.3e-05,2.9e-05,2.2e-05,1.6e-05,1.4e-05,4.4e-05,4.5e-05,3.1e-05,1.2e-05,1.7e-05,3.4e-05,2.5e-05,1.8e-05,2.7e-05,1.6e-05,1.6e-05,1.4e-05,2.3e-05,1.2e-05,3.4e-05,4.2e-05,3.6e-05,9e-06,2.4e-05,3.1e-05,3.6e-05,2.5e-05,3.1e-05,4.6e-05,1.1e-05,2.3e-05,4.3e-05,1e-05,6e-06,1.3e-05,1.9e-05,1.2e-05,3e-05,1.3e-05,1.7e-05,2.6e-05,4.2e-05,2.6e-05,1.6e-05,2.6e-05,4.1e-05,1.9e-05
4.5e-05,5.7e-05,5.6e-05,7.7e-05,0.000109,0.000106,9.8e-05,0.000121,0.000128,5.2e-05,3.4e-05,2.8e-05,5.8e-05,7.9e-05,7.4e-05,7e-05,7.7e-05,4.6e-05,3.1e-05,2.6e-05,4e-05,7e-05,3.8e-05,4e-05,4e-06,3.8e-05,1.5e-05,1.9e-05,4e-05,3.7e-05,2.1e-05,2.8e-05,3.3e-05,3.2e-05,5.6e-05,1.8e-05,3.3e-05,3.3e-05,2.3e-05,1.9e-05,4.9e-05,4.3e-05,4.4e-05,1.4e-05,5.7e-05,3.4e-05,7.2e-05,3.6e-05,6e-05,7e-05,4e-05,1.5e-05,5.7e-05,5.6e-05,3.9e-05,4.2e-05,1.9e-05,4.1e-05,5.6e-05,5.3e-05,2.9e-05,1.2e-05,1.2e-05,2.1e-05,5.7e-05,3.5e-05,4.3e-05,3.9e-05,5e-06,2.2e-05,4.2e-05,3.7e-05,3.9e-05,2.8e-05,4.7e-05,1.5e-05,7e-06,2.8e-05,3.8e-05,2.7e-05,1.1e-05,2.4e-05,1.9e-05,4.3e-05,4.6e-05,3.1e-05,4.8e-05,1.4e-05,1.3e-05,1.2e-05,1.8e-05,1.3e-05,3e-05,1e-05,3e-05,2e-05,1.8e-05,3.4e-05,2.9e-05,2.1e-05,3.8e-05,1e-05,9e-06,4.1e-05,3.4e-05,3.7e-05,1.3e-05,1.6e-05,1.1e-05,4.8e-05,2.2e-05,4.5e-05,4.4e-05,1.8e-05,1.6e-05,3.4e-05,1.7e-05,2.4e-05,2.7e-05,3.2e-05,1.7e-05
6.8e-05,3.2e-05,1.2e-05,5e-05,5.8e-05,5.1e-05,5.1e-05,2.6e-05,5.4e-05,2.9e-05,4.4e-05,3.2e-05,3.2e-05,8e-06,4.6e-05,3.1e-05,2.6e-05,4.9e-05,7.5e-05,2.8e-05,3.7e-05,1.2e-05,9e-06,2e-06,2.6e-05,2.9e-05,1.5e-05,3.1e-05,4.6e-05,6.1e-05,3.3e-05,4.6e-05,2.4e-05,4.2e-05,3e-05,3.6e-05,5.9e-05,6e-06,9e-06,3.4e-05,4.3e-05,2.9e-05,1.6e-05,3e-05,5.1e-05,4.5e-05,3.9e-05,5.4e-05,6.3e-05,3.7e-05,6e-06,1.8e-05,3.8e-05,5e-06,1.1e-05,3e-05,4.8e-05,3e-06,1.4e-05,1.5e-05,5.4e-05,3.1e-05,2.6e-05,1.2e-05,5.7e-05,7.7e-05,6.4e-05,3e-05,6.5e-05,3.9e-05,3.4e-05,2.1e-05,1.6e-05,2.6e-05,3.5e-05,5e-06,2.4e-05,5.4e-05,4.2e-05,2.2e-05,4e-06,3.2e-05,3.6e-05,2.1e-05,8e-06,2.1e-05,3.6e-05,3.4e-05,2.8e-05,4e-05,1.5e-05,1.9e-05,1e-05,1.8e-05,4.1e-05,1.4e-05,1.2e-05,4e-05,1.3e-05,2.1e-05,5e-06,2.8e-05,4.4e-05,3.7e-05,2.1e-05,3.8e-05,3.8e-05,3e-05,4e-06,3.2e-05,1e-05,3.4e-05,2.4e-05,2e-05,2e-05,1.7e-05,1.7e-05,1.5e-05,4.3e-05,1.8e-05,2.3e-05
6e-05,3.7e-05,3.7e-05,4.8e-05,2.1e-05,1.6e-05,6.5e-05,6.1e-05,3.8e-05,1.5e-05,1.5e-05,2.2e-05,4.4e-05,2.9e-05,2.4e-05,1.2e-05,2.3e-05,2.8e-05,4.5e-05,3.8e-05,5.5e-05,1e-05,1.9e-05,2.4e-05,2.6e-05,1.5e-05,9e-06,4.2e-05,1.7e-05,2.6e-05,2.1e-05,3.1e-05,1.5e-05,3e-05,3.1e-05,1.1e-05,5e-05,4e-05,6e-06,3.7e-05,9e-06,1e-05,2.1e-05,3.4e-05,2.6e-05,2.3e-05,1.4e-05,2.6e-05,1.7e-05,4.7e-05,2.7e-05,6e-06,1.6e-05,2.7e-05,2.3e-05,1e-05,1.8e-05,1.1e-05,1.5e-05,2.2e-05,5.3e-05,1.2e-05,9e-06,2.1e-05,1.3e-05,2.1e-05,1.2e-05,4e-06,5.3e-05,1.2e-05,2.5e-05,2.8e-05,5.2e-05,2.4e-05,5e-05,2.7e-05,2.2e-05,2.7e-05,7e-06,3.5e-05,2.2e-05,4.8e-05,2.1e-05,2.3e-05,2.2e-05,2.6e-05,1.5e-05,2.1e-05,3e-05,1.4e-05,2.2e-05,2.2e-05,6e-06,2.2e-05,3.2e-05,7e-06,8e-06,3.1e-05,4e-06,1e-05,1.7e-05,1.1e-05,3.5e-05,2.9e-05,1.1e-05,7e-06,2.6e-05,2.1e-05,1.1e-05,1e-05,2.7e-05,4e-06,1.7e-05,1.3e-05,2.4e-05,1.4e-05,4e-06,6e-06,2.2e-05,2.1e-05,4e-06
1.7e-05,3e-06,2.8e-05,4.3e-05,2.5e-05,2.4e-05,3.1e-05,3.3e-05,5.5e-05,2.1e-05,6e-06,5e-06,2.7e-05,4.2e-05,2.8e-05,1.9e-05,3.4e-05,1.1e-05,2.5e-05,6e-06,4e-06,1.8e-05,1.4e-05,2.3e-05,2.2e-05,1.1e-05,5e-06,3.3e-05,3.3e-05,3.1e-05,2e-06,1.7e-05,9e-06,3.3e-05,1.8e-05,3.1e-05,2.9e-05,3.4e-05,2.9e-05,4.5e-05,1.7e-05,2.5e-05,2.2e-05,1.1e-05,1.9e-05,2.5e-05,1.3e-05,1.8e-05,4e-06,3.1e-05,2.6e-05,1.9e-05,1.8e-05,1.4e-05,6e-06,9e-06,5e-06,1.6e-05,2.7e-05,8e-06,5.8e-05,1.1e-05,8e-06,1e-05,1.4e-05,1.7e-05,5e-06,1.3e-05,2.7e-05,2.4e-05,8e-06,3.1e-05,2.1e-05,3.1e-05,3.3e-05,1.8e-05,1e-05,2.3e-05,4e-06,2.9e-05,1.5e-05,1.9e-05,1.7e-05,9e-06,1e-06,3.3e-05,8e-06,2.9e-05,2.3e-05,1e-05,4e-06,1.8e-05,5e-06,2e-05,1.8e-05,1.8e-05,2e-06,1.8e-05,9e-06,1.3e-05,2.1e-05,1.7e-05,2.6e-05,2.8e-05,9e-06,1.8e-05,1e-06,1e-06,9e-06,2e-05,1.3e-05,8e-06,1.4e-05,3e-06,2.5e-05,8e-06,1.6e-05,6e-06,2.2e-05,1.7e-05,1e-05
3e-06,1.5e-05,1.9e-05,2.5e-05,1.1e-05,1.3e-05,3.4e-05,2.6e-05,3.8e-05,1e-06,1.6e-05,6e-06,1.5e-05,2.9e-05,4e-05,1e-05,2.5e-05,3.7e-05,3.3e-05,2.4e-05,3.3e-05,3.2e-05,2.2e-05,1e-05,1.6e-05,1.2e-05,2e-05,3e-05,2.4e-05,1.4e-05,2.2e-05,4.8e-05,2.9e-05,1.2e-05,2.7e-05,1.5e-05,3.4e-05,1.5e-05,1.6e-05,1.1e-05,3e-06,1.6e-05,1.5e-05,1.5e-05,2.6e-05,3.7e-05,1e-06,2.1e-05,1.1e-05,1.7e-05,2.9e-05,2.3e-05,9e-06,1.8e-05,9e-06,1.1e-05,1.1e-05,7e-06,2e-05,1.5e-05,4.8e-05,4e-06,4e-06,1.6e-05,2e-05,1.8e-05,8e-06,1.1e-05,2.5e-05,1.4e-05,1e-05,2.1e-05,1.7e-05,3.1e-05,3.6e-05,1.8e-05,6e-06,9e-06,1.4e-05,2.1e-05,1e-05,1.5e-05,9e-06,4e-06,1.2e-05,7e-06,1.3e-05,1.3e-05,1.6e-05,1e-05,7e-06,1.8e-05,6e-06,1.5e-05,1.4e-05,7e-06,4e-06,2.9e-05,1.1e-05,1.5e-05,1.3e-05,2e-06,2e-05,2.5e-05,1.2e-05,1.3e-05,7e-06,8e-06,1.1e-05,2.9e-05,1.2e-05,3e-06,3e-06,8e-06,2.2e-05,1.1e-05,1.1e-05,0,3.1e-05,2.6e-05,1e-05
7e-06,6e-06,1.5e-05,1.9e-05,2.3e-05,1.8e-05,2.5e-05,2.4e-05,3.4e-05,5e-06,1.2e-05,1e-05,4e-06,3.1e-05,2e-05,1e-05,1.2e-05,1.5e-05,1.5e-05,2e-05,1.3e-05,2.9e-05,3e-06,1e-05,1e-05,1.4e-05,3.6e-05,1.7e-05,2.9e-05,1.6e-05,1.4e-05,5.3e-05,1e-05,1.2e-05,2.2e-05,2.1e-05,1.8e-05,8e-06,1.8e-05,2.8e-05,1.6e-05,5e-06,2.4e-05,1.7e-05,2.8e-05,3e-05,5e-06,8e-06,4e-06,2.7e-05,2.3e-05,2.7e-05,3e-06,8e-06,1.1e-05,9e-06,1.9e-05,1.6e-05,2.4e-05,1.4e-05,4.7e-05,6e-06,8e-06,1.2e-05,2.5e-05,1.8e-05,6e-06,1.2e-05,2.8e-05,7e-06,1.2e-05,1.6e-05,1.7e-05,2.9e-05,3.4e-05,2.1e-05,7e-06,4e-06,5e-06,1.6e-05,1e-05,1e-05,4e-06,4e-06,1.3e-05,2.1e-05,6e-06,1.5e-05,1.3e-05,1e-05,7e-06,2.1e-05,4e-06,1.6e-05,1.8e-05,1.3e-05,5e-06,3.4e-05,1.3e-05,1.7e-05,1.3e-05,1.3e-05,1e-05,1.7e-05,1.4e-05,2e-05,8e-06,1.7e-05,6e-06,1.8e-05,7e-06,4e-06,7e-06,6e-06,2.4e-05,1.9e-05,7e-06,2e-06,2.3e-05,1.9e-05,5e-06
8e-06,5e-06,2.1e-05,2.7e-05,1.9e-05,1.2e-05,2.8e-05,2.8e-05,3.3e-05,4e-06,3e-06,7e-06,2.3e-05,2.5e-05,2.6e-05,1.6e-05,3e-06,9e-06,2.1e-05,6e-06,1.5e-05,2.9e-05,1.4e-05,1.4e-05,4.5e-05,3.5e-05,9e-06,3.3e-05,2.9e-05,1e-05,2e-06,3.1e-05,2.1e-05,2.1e-05,3.8e-05,1e-05,3.5e-05,1.9e-05,1.5e-05,2.4e-05,5e-06,1.1e-05,2.6e-05,1.7e-05,2.8e-05,2.5e-05,4e-06,3e-06,7e-06,1.9e-05,1.1e-05,2.6e-05,3e-06,1e-06,8e-06,1.2e-05,1.7e-05,7e-06,1.8e-05,1.7e-05,4.7e-05,6e-06,6e-06,9e-06,2.1e-05,2.4e-05,8e-06,8e-06,2.4e-05,3e-06,1e-05,1.1e-05,1.7e-05,2.7e-05,3.1e-05,2.6e-05,8e-06,8e-06,5e-06,1.3e-05,2e-06,7e-06,5e-06,4e-06,2.2e-05,1.7e-05,9e-06,1.7e-05,1.7e-05,6e-06,4e-06,1.7e-05,0,1.6e-05,1.8e-05,1.3e-05,5e-06,2.9e-05,3e-06,6e-06,1.4e-05,5e-06,2e-05,1.1e-05,6e-06,2.3e-05,8e-06,1.3e-05,5e-06,1.8e-05,2e-06,2e-06,3e-06,5e-06,2.8e-05,1.3e-05,1.2e-05,7e-06,2.5e-05,1.6e-05,9e-06
8e-06,3e-06,1.5e-05,2.3e-05,2e-05,9e-06,1.9e-05,2.6e-05,2.7e-05,5e-06,2e-06,4e-06,1.5e-05,2.7e-05,2.6e-05,1.4e-05,3e-06,1.1e-05,2.1e-05,5e-06,1.5e-05,2.3e-05,8e-06,1.8e-05,2.8e-05,2.2e-05,5e-06,1.7e-05,1.4e-05,1.3e-05,1.4e-05,2.8e-05,1.1e-05,4e-06,2.4e-05,8e-06,3.5e-05,1e-05,6e-06,1.4e-05,3e-06,6e-06,1.5e-05,1.9e-05,2.2e-05,2.4e-05,2e-06,6e-06,1.3e-05,2e-05,1.5e-05,3.3e-05,1.4e-05,1.1e-05,6e-06,1e-06,1.9e-05,8e-06,1.5e-05,1e-05,4.3e-05,1e-05,5e-06,7e-06,1.8e-05,1.9e-05,4e-06,1e-05,2.4e-05,7e-06,3e-06,1.7e-05,1.5e-05,2.5e-05,2.7e-05,1.5e-05,4e-06,6e-06,7e-06,1e-05,8e-06,9e-06,2e-06,5e-06,2e-05,2e-05,7e-06,1.9e-05,1.4e-05,5e-06,4e-06,1.5e-05,7e-06,1.9e-05,1.4e-05,1e-05,6e-06,2.1e-05,5e-06,9e-06,1.1e-05,2e-06,2.4e-05,1.9e-05,1e-06,2.1e-05,5e-06,9e-06,3e-06,2.7e-05,6e-06,3e-06,3e-06,5e-06,2.3e-05,1.3e-05,1.2e-05,6e-06,2.1e-05,2.1e-05,7e-06
1e-05,2e-06,2.2e-05,2.1e-05,2.2e-05,8e-06,2.2e-05,2.6e-05,3.2e-05,5e-06,3e-06,3e-06,1e-05,2.3e-05,2.9e-05,1.2e-05,4e-06,8e-06,2e-05,2e-06,1.5e-05,1.9e-05,2e-06,9e-06,2.5e-05,1.7e-05,1e-05,2.4e-05,1e-05,1.2e-05,4e-06,2.6e-05,8e-06,1e-06,2.7e-05,8e-06,3.2e-05,1.7e-05,5e-06,1.8e-05,4e-06,9e-06,1.7e-05,1.4e-05,2.4e-05,2.2e-05,3e-06,8e-06,1.5e-05,1.8e-05,1.6e-05,2.6e-05,8e-06,0,4e-06,8e-06,1.9e-05,1e-05,1.5e-05,1.4e-05,4.5e-05,1.1e-05,3e-06,6e-06,1.9e-05,1.2e-05,6e-06,1.1e-05,2.1e-05,1.2e-05,6e-06,1.9e-05,1.4e-05,2.5e-05,2.6e-05,1.9e-05,5e-06,6e-06,6e-06,1.1e-05,5e-06,7e-06,3e-06,7e-06,1.9e-05,1.9e-05,8e-06,1.9e-05,1.7e-05,7e-06,2e-06,2.1e-05,5e-06,1.8e-05,1.8e-05,9e-06,4e-06,2.4e-05,6e-06,8e-06,1.4e-05,6e-06,1.7e-05,1.9e-05,1e-06,1.9e-05,4e-06,1e-05,1e-06,2.6e-05,2e-06,3e-06,3e-06,5e-06,2.4e-05,1.4e-05,1e-05,4e-06,2.1e-05,2e-05,2e-06
1e-05,3e-06,2e-05,2.2e-05,2e-05,8e-06,1.9e-05,3e-05,3.1e-05,6e-06,2e-06,3e-06,1e-05,2.3e-05,2.8e-05,1.4e-05,4e-06,1e-05,2.3e-05,2e-06,1.6e-05,2.1e-05,1e-06,1e-05,2.8e-05,1.4e-05,1.1e-05,2.1e-05,7e-06,6e-06,8e-06,2.7e-05,1.1e-05,4e-06,2.9e-05,6e-06,3.2e-05,1.3e-05,3e-06,1.7e-05,2e-06,5e-06,1.6e-05,1.4e-05,2.4e-05,2.4e-05,3e-06,7e-06,1.3e-05,2e-05,2e-05,2.7e-05,4e-06,4e-06,4e-06,8e-06,1.7e-05,1.1e-05,1.5e-05,1.3e-05,4.4e-05,8e-06,3e-06,7e-06,2.1e-05,1.2e-05,2e-06,1.2e-05,2e-05,8e-06,1e-06,1.9e-05,1.3e-05,2.4e-05,2.5e-05,1.8e-05,5e-06,5e-06,8e-06,1.4e-05,8e-06,5e-06,4e-06,5e-06,1.7e-05,1.9e-05,7e-06,1.7e-05,1.2e-05,7e-06,1e-06,2e-05,3e-06,1.8e-05,1.9e-05,1.1e-05,3e-06,2.3e-05,6e-06,8e-06,1.3e-05,4e-06,2e-05,2e-05,2e-06,1.8e-05,4e-06,1e-05,1e-06,2.6e-05,3e-06,1e-06,3e-06,5e-06,2.5e-05,1.3e-05,1e-05,4e-06,2.1e-05,1.7e-05,2e-06
