-0.015218,-0.008766,-0.007171,-0.008893,-0.01544,-0.009488,-0.00607,-0.005937,-0.008495,-0.007109,-0.005708,-0.006802,-0.009509,-0.010537,-0.006305,-0.004207,-0.004051,-0.003988,-0.002939,-0.002553,-0.002105,-0.002275,-0.002768,-0.002244,-0.003364,-0.002522,-0.002135,-0.001347
-0.009701,-0.003876,-0.002935,-0.00479,-0.009504,-0.005674,-0.003816,-0.003511,-0.005851,-0.005423,-0.002776,-0.002126,-0.005263,-0.007236,-0.003079,-0.003262,-0.003897,-0.002761,-0.001695,-0.001717,-0.001529,-0.000954,-0.001692,-0.002182,-0.002914,-0.002014,-0.001886,-0.001278
0.004043,0.00228,0.001252,0.003808,0.008489,0.003864,0.001236,0.001269,0.001915,0.000147,0.000429,0.001784,0.003349,0.002911,0.002262,0.000997,0.000528,0.001579,0.001378,0.001023,0.000581,0.000915,0.000997,3.5e-05,0.000423,0.000463,2.9e-05,-0.000393
0.008521,0.002328,0.000272,0.003567,0.009927,0.004589,0.002658,0.002261,0.004204,0.001656,6e-05,0.000864,0.004822,0.006638,0.002888,0.002757,0.002461,0.002028,0.001407,0.001371,0.001199,0.000633,0.001181,0.001318,0.002097,0.001193,0.000982,6.5e-05
0.004563,0.001772,0.000703,-0.002517,-0.004918,-0.001584,0.001195,0.000905,0.001456,0.000496,0.000275,0.001316,0.001379,0.003162,0.001052,0.00099,0.000171,-0.000999,-0.000698,-0.000399,0.000219,-0.00025,-0.000362,0.000704,0.001037,7.4e-05,0.00066,0.00034
-0.005792,-0.002039,-0.00081,-0.005537,-0.012295,-0.005819,-0.002452,-0.002424,-0.003513,-0.002421,-0.001474,-0.000865,-0.003855,-0.004428,-0.002503,-0.002195,-0.002497,-0.002543,-0.001603,-0.001313,-0.000851,-0.000845,-0.001411,-0.001023,-0.001648,-0.001198,-0.000653,-0.000127
-0.010151,-0.005245,-0.003153,-0.000349,-0.000294,-0.001921,-0.003222,-0.002934,-0.004054,-0.002347,-0.002235,-0.003357,-0.004459,-0.006708,-0.003515,-0.002563,-0.001432,-0.000384,-0.000247,-0.000147,-0.000588,-0.000495,-0.000592,-0.00149,-0.002382,-0.000795,-0.001213,-0.000585
0.00251,0.002055,0.001675,0.006871,0.013263,0.006134,0.002183,0.002539,0.002789,0.00387,0.003247,0.001832,0.002506,0.001528,0.001786,0.001107,0.002067,0.002386,0.001363,0.001197,0.000675,0.001088,0.001358,0.000482,0.000726,0.001119,0.000363,0.00042
0.011366,0.006811,0.004736,0.003611,0.006078,0.004778,0.003866,0.004047,0.005588,0.006048,0.005077,0.004182,0.004876,0.006545,0.004128,0.002925,0.002785,0.001553,0.000592,0.000383,0.000633,0.001016,0.00122,0.001855,0.00301,0.001527,0.001468,0.000977
0.002192,-0.00021,-0.000333,-0.004732,-0.009573,-0.003369,-0.000347,-0.000713,0.000173,5.5e-05,-0.000943,-0.00186,-0.000775,0.001218,-0.000756,0.000592,0.000467,-0.000867,-0.000764,-0.000821,-0.000457,-0.000939,-0.000667,0.000729,0.001138,1.1e-05,0.00048,8.4e-05
-0.006604,-0.004818,-0.002451,-0.003399,-0.007861,-0.00381,-0.002081,-0.002026,-0.002928,-0.004011,-0.003286,-0.002861,-0.002352,-0.002857,-0.002849,-0.00136,-0.001109,-0.000569,0.000104,1.6e-05,-0.000393,-0.000917,-0.00059,-0.000663,-0.00139,-0.000678,-0.000527,-0.000333
-0.003892,-0.000449,0.001061,0.00362,0.005937,0.002297,-2.1e-05,0.000465,-0.00101,-0.002261,-0.000196,0.001724,0.000328,-0.001614,0.000381,-0.000923,-0.001152,0.00088,0.001161,0.001031,0.000398,0.000897,0.000841,-0.000759,-0.001633,-0.000279,-0.000516,6e-05
-0.001217,0.00078,-0.000306,0.002328,0.007052,0.001831,-0.000313,-0.000688,-0.001473,-0.001397,-0.000583,-2.5e-05,-0.001296,-0.001791,0.000702,-0.000587,-0.001295,-0.000404,-0.000429,-0.000232,-5e-06,0.000534,6.5e-05,-0.000545,-0.000805,-0.000574,-0.000595,-0.00032
0.000681,-0.000585,-0.003008,-0.003791,-0.004269,-0.002986,-0.001039,-0.001952,-0.001835,-0.001035,-0.001728,-0.002257,-0.001649,-0.000582,-0.000771,-0.000129,-0.000876,-0.002096,-0.00176,-0.001479,-0.00062,-0.000914,-0.001411,-0.000146,0.000497,-0.000667,-0.00022,-0.00059
0.005726,0.001918,0.000619,-0.003082,-0.007221,-0.001815,0.000987,0.000672,0.002088,0.002098,0.00118,0.002073,0.003128,0.003812,0.000649,0.001134,0.000877,-0.000281,0.000129,-0.000111,0.000116,-0.000282,-0.000385,0.000609,0.001608,0.000478,0.00082,0.00017
0.003201,0.001246,0.002486,0.002143,0.001908,0.002253,0.001336,0.001656,0.003506,0.002936,0.001904,0.00252,0.002966,0.00283,0.000978,0.000903,0.001825,0.002221,0.001833,0.001508,0.000785,0.000669,0.001118,0.000447,0.000466,0.00098,0.000564,0.000322
-0.005262,-0.002773,-0.000925,0.003618,0.007895,0.002493,-0.000214,0.000356,-4.3e-05,0,-0.00035,-0.001798,-0.002216,-0.00249,-0.000725,-0.000637,0.00056,0.001118,0.000292,0.000633,0.000233,2e-04,0.000602,-0.000416,-0.001523,5.6e-05,-0.000629,-0.000117
-0.00463,-0.001426,-0.001376,0.000308,0.001797,-0.000452,-0.000777,-4.7e-05,-0.002269,-0.001195,-6.5e-05,-0.001565,-0.00278,-0.002994,-0.000522,-0.001054,-0.00114,-0.001617,-0.001819,-0.001287,-0.000596,-0.000275,-0.000562,-0.000476,-0.001028,-0.00064,-0.000601,7.1e-05
0.002836,0.002811,0.001684,-0.002764,-0.00673,-0.002176,-0.000437,-0.000509,-0.000875,0.000405,0.000891,0.000377,0.000259,0.000276,0.000515,0,-0.000795,-0.001351,-0.000976,-0.001188,-0.00057,-0.000124,-0.000539,0.000235,0.00104,-0.000194,0.000356,0.000363
