5e-06,9e-06,-1e-05,0,9e-06,-9e-06,-7e-06,-3.7e-05,-5.2e-05,-6.8e-05,-8.8e-05,-0.000136,-0.000308,-0.000577,-0.000505,-0.000119,-0.000126,-0.000116,3e-06,-4.9e-05,-0.000114,-0.000204,-0.000313,-0.000417,-0.000261,-1e-04,6.9e-05,7.3e-05
5e-06,7e-06,-1.1e-05,6e-06,2.4e-05,1.4e-05,2.8e-05,0.000103,7.6e-05,1e-05,7e-06,4.1e-05,0.000141,0.000372,0.000373,0.000201,0.000208,0.000323,0.000266,0.000103,7.7e-05,9.6e-05,0.000277,0.000739,0.000555,0.000191,0.000235,0.000537
0,2e-06,-2.1e-05,-1.2e-05,6e-06,-1.7e-05,-1.8e-05,-2.1e-05,-2.7e-05,-3.1e-05,-3.1e-05,-0.000157,-0.000228,-0.000193,-3e-06,-9.6e-05,-0.000134,-8.2e-05,5e-06,-7.7e-05,-0.000127,-0.000108,-8.5e-05,5.7e-05,4.3e-05,-0.000224,-3e-04,-0.000174
-2e-06,1e-06,-1.5e-05,-2.4e-05,-9e-06,-3.2e-05,-4.6e-05,-0.000103,-9.4e-05,-3.7e-05,-3.7e-05,-0.000206,-0.000466,-0.000687,-0.000452,-0.000321,-0.000401,-0.000483,-0.000193,-0.000157,-0.000224,-0.000292,-0.000348,-0.000609,-0.000509,-0.000471,-0.000565,-0.000761
8e-06,1.2e-05,2.2e-05,1.2e-05,2.1e-05,4e-05,2.5e-05,5.8e-05,5.8e-05,8.2e-05,0.000103,0.000181,0.000283,0.000454,0.000392,0.000154,0.000169,6.6e-05,0.000124,0.000125,0.000202,0.000153,0.000297,0.000613,0.000378,0.000127,4.4e-05,1e-05
5e-06,5e-06,1.5e-05,-1e-06,-2e-06,2.6e-05,2e-06,-1.2e-05,3e-06,1.3e-05,1.3e-05,0.00013,0.00024,0.000327,0.000177,1.8e-05,0.000164,6.4e-05,-5.4e-05,-2.9e-05,0.000104,9.7e-05,7.7e-05,0.000404,0.000293,8.6e-05,-5.3e-05,-0.000158
-9e-06,-1.2e-05,-2e-05,-3.9e-05,-3.6e-05,-3.3e-05,-5.2e-05,-0.000126,-1e-04,-9e-05,-0.000126,-7.9e-05,-0.00025,-0.000518,-0.000655,-0.000401,-0.000221,-0.000304,-0.000318,-0.000257,-0.000247,-0.000268,-0.000396,-0.000671,-0.000505,-0.000242,-0.000394,-0.000813
-9e-06,-1.5e-05,-1.2e-05,-1.4e-05,-2e-06,5e-06,1e-06,2.3e-05,2.4e-05,-6e-06,-1.8e-05,9.8e-05,0.000183,0.000201,-2.6e-05,-5.6e-05,0.000109,0.000133,4e-05,-1.1e-05,-4.9e-05,-4.7e-05,6.4e-05,7.9e-05,6.5e-05,0.000181,4.7e-05,-0.000173
-8e-06,-1.5e-05,-2e-06,1.1e-05,1.5e-05,1.8e-05,1.8e-05,3.9e-05,4.2e-05,2.6e-05,2.7e-05,6.2e-05,0.000285,0.00044,0.000328,0.000105,0.000289,0.000331,0.000131,2.5e-05,4.1e-05,9.6e-05,0.000125,4e-04,0.000409,0.00033,0.000146,6.8e-05
-1.3e-05,-2e-05,-1.1e-05,-8e-06,-1.4e-05,-3e-05,-2.1e-05,-6.8e-05,-5.1e-05,-2.7e-05,-6.1e-05,-0.000178,-0.000279,-0.000401,-0.000386,-0.000251,-0.000105,-0.000144,-0.000143,-0.000157,-0.000194,-0.000185,-0.000274,-0.000502,-0.000316,-0.00011,-0.000233,-0.000529
-9e-06,-1.5e-05,1e-06,-3e-06,0,-4e-06,-2e-06,1.2e-05,1.6e-05,1.1e-05,-2e-05,-5.9e-05,-0.000115,-0.000106,-0.000144,-0.000157,-0.000155,-8.4e-05,-3.2e-05,-1.8e-05,-0.00011,-0.000189,-2.1e-05,-0.000159,-0.000175,-0.000131,-7.6e-05,-0.000138
-2e-06,-8e-06,1.4e-05,1.5e-05,3e-05,3.8e-05,1.3e-05,4.5e-05,5.2e-05,3.7e-05,4e-05,7.9e-05,0.000173,0.000363,0.000429,7e-05,4e-06,0.000241,7.3e-05,3.8e-05,7.6e-05,6.4e-05,0.000211,0.000467,0.00036,-2.1e-05,5.4e-05,0.000419
-3e-06,-1e-05,1e-06,1e-06,1.8e-05,1.3e-05,-1.1e-05,-5.5e-05,-3.6e-05,-2.1e-05,-2.4e-05,-3.5e-05,-0.000188,-0.000276,-0.000118,-0.000138,-0.000163,1e-06,-8.7e-05,-0.00011,-3e-05,6.5e-05,-1.7e-05,-0.000154,-0.000145,-0.000365,-0.000251,8.1e-05
-4e-06,-1e-05,0,0,1.3e-05,1.7e-05,1e-06,-2.3e-05,-1.5e-05,-2.5e-05,-2e-05,2.6e-05,-0.000124,-0.000303,-0.000264,-0.000105,-0.000156,-6.8e-05,2.4e-05,2.8e-05,-3.5e-05,-3.7e-05,-1.3e-05,-0.000299,-0.000367,-0.000412,-0.000145,0.000186
-2e-06,-5e-06,1.2e-05,2.5e-05,2.5e-05,4.4e-05,2.4e-05,3.4e-05,3.2e-05,1.1e-05,6.2e-05,0.000165,0.000263,0.000311,0.000361,0.000216,0.000128,0.00024,0.000187,0.000175,0.000125,3.6e-05,8e-05,0.000233,0.000156,-4.2e-05,0.000159,0.000578
-2e-06,-5e-06,2e-06,1.7e-05,9e-06,1.2e-05,1.4e-05,-3.4e-05,-3.6e-05,-1.8e-05,1.6e-05,6e-06,3e-06,4.6e-05,9.9e-05,0.000117,8.8e-05,8.9e-05,2.6e-05,3.1e-05,5e-05,7.4e-05,-3.7e-05,-3.6e-05,-3.6e-05,-6.8e-05,2.3e-05,0.000112
-4e-06,-6e-06,-1.2e-05,-7e-06,-4e-06,-8e-06,5e-06,-3.9e-05,-4.3e-05,-4.2e-05,-4.4e-05,-0.000115,-0.000188,-2e-04,-0.000305,-2e-05,-5.8e-05,-0.000156,-4e-05,-7e-06,-7.8e-05,-2.8e-05,-2.5e-05,-0.000304,-0.000381,-0.000163,-1.9e-05,-0.000219
-1e-06,-4e-06,-5e-06,-4e-06,5e-06,1.6e-05,6e-06,2.2e-05,1.8e-05,-1.1e-05,2e-05,-5e-06,9.3e-05,0.000223,0.000218,0.000213,8.9e-05,1.4e-05,5.4e-05,3.7e-05,0,-5e-06,6.7e-05,0.00015,4e-05,3.1e-05,0.000101,4.8e-05
1e-06,-1e-06,0,1e-06,0,1.3e-05,2e-06,-1e-05,-9e-06,-5e-06,3.5e-05,-2.6e-05,0,0.000101,0.000242,0.000226,0.000135,-5.3e-05,-2.7e-05,-6.6e-05,-3e-06,8.6e-05,3.4e-05,0.000191,0.000107,-2.4e-05,-5.9e-05,-5.1e-05
