-9e-06,-2.6e-05,-0.000471,-0.000682,-0.000209,-0.000124,-6.5e-05,-2.9e-05,-3.1e-05,-1.3e-05,-6e-06,-1e-06,1e-06,2e-06,3e-06,3e-06,0,-1.3e-05,-2.1e-05,-2.2e-05,-5e-05,-0.001276,-0.00304,-0.002228,-0.00077,-0.000164,-0.000114,-9.1e-05
2e-06,-1.4e-05,-0.000365,-0.000561,-0.000212,-0.000145,-8.3e-05,-3.8e-05,-2.3e-05,-1e-05,-4e-06,3e-06,3e-06,0,1e-06,1e-06,2e-06,-2e-06,-3e-06,-8e-06,-2.5e-05,-0.001034,-0.002399,-0.001865,-0.000643,-0.000158,-0.000123,-0.000109
-3e-06,7e-06,0.000175,0.000208,-5e-05,-8.8e-05,-4.3e-05,-1.7e-05,-8e-06,-1e-05,0,1e-06,-2e-06,-1e-06,-1e-06,-1e-06,2e-06,5e-06,8e-06,1.1e-05,2.6e-05,0.000348,0.000918,0.000447,-1.8e-05,-7.5e-05,-1.2e-05,-4.3e-05
6e-06,2.1e-05,0.000388,0.000563,0.000131,3.6e-05,2.7e-05,1.9e-05,1.5e-05,2e-06,7e-06,5e-06,0,-1e-06,-1e-06,0,4e-06,7e-06,8e-06,1.4e-05,3.9e-05,0.001111,0.002658,0.001888,0.000495,1e-04,0.000112,7.8e-05
4e-06,4e-06,1.1e-05,8.4e-05,0.000123,6.3e-05,2.3e-05,1.5e-05,1.3e-05,7e-06,1e-06,4e-06,2e-06,0,-1e-06,1e-06,4e-06,8e-06,3e-06,1e-06,0,0.000355,0.000642,0.000604,0.000265,8.8e-05,7.6e-05,8.5e-05
-1.1e-05,-2.3e-05,-0.000348,-0.000433,-3.1e-05,-3e-05,-2.9e-05,-1.2e-05,-1.5e-05,-8e-06,-1.1e-05,-5e-06,-3e-06,-2e-06,-2e-06,-1e-06,-3e-06,-7e-06,-1.4e-05,-2e-05,-4.3e-05,-0.000872,-0.002039,-0.001221,-0.000313,-5.2e-05,-5.3e-05,-1.8e-05
-6e-06,-1.5e-05,-0.00015,-0.000212,-6.1e-05,-1e-05,-1e-06,-3e-06,-3e-06,-4e-06,-8e-06,-4e-06,-1e-06,-1e-06,-1e-06,0,-3e-06,-9e-06,-1.3e-05,-1.1e-05,-1.7e-05,-0.000716,-0.001333,-0.000713,-0.000146,-2.5e-05,-7.5e-05,-5.4e-05
3e-06,1.1e-05,0.000245,0.000292,5e-06,5.6e-05,4e-05,1.2e-05,1.8e-05,8e-06,3e-06,2e-06,1e-06,0,1e-06,2e-06,3e-06,1e-05,1.6e-05,1.9e-05,3.8e-05,0.000473,0.001272,0.000763,0.000311,6.1e-05,2.2e-05,4e-06
2e-06,1.5e-05,0.00025,0.000282,-3e-06,1e-05,1.4e-05,1e-06,2e-06,2e-06,7e-06,2e-06,0,1e-06,1e-06,1e-06,2e-06,1e-05,1.6e-05,1.4e-05,2.4e-05,0.000788,0.001436,0.000488,9.6e-05,3.1e-05,7.3e-05,4.6e-05
1e-06,-4e-06,-0.000105,-0.000154,-2.5e-05,-3.4e-05,-2.7e-05,-1.6e-05,-1.5e-05,-5e-06,2e-06,0,2e-06,1e-06,2e-06,2e-06,0,-4e-06,-9e-06,-1.1e-05,-2.1e-05,1.7e-05,-0.000607,-0.000717,-0.000292,-2.5e-05,2.4e-05,2.8e-05
-1e-06,-1.3e-05,-0.000275,-3e-04,7e-06,-1.9e-05,-3.3e-05,-1.9e-05,-1.4e-05,-4e-06,-5e-06,-2e-06,1e-06,1e-06,3e-06,2e-06,-3e-06,-1e-05,-1.3e-05,-1.1e-05,-2.6e-05,-0.000604,-0.001334,-0.000506,-0.000165,-3.3e-05,-3.9e-05,-2.7e-05
2e-06,-2e-06,-1.3e-05,6.1e-05,5.4e-05,1.4e-05,-1e-06,2e-06,5e-06,3e-06,-3e-06,-2e-06,1e-06,1e-06,3e-06,2e-06,-1e-06,-1e-06,4e-06,5e-06,7e-06,-0.00039,-0.000127,0.000596,0.000155,-2.8e-05,-6.1e-05,-6.1e-05
4e-06,9e-06,0.000231,0.000294,4.9e-05,4.8e-05,3.2e-05,1.9e-05,2.2e-05,1.2e-05,2e-06,0,1e-06,1e-06,2e-06,1e-06,1e-06,4e-06,8e-06,1e-05,2.4e-05,0.000263,0.000984,0.000798,0.000255,2.2e-05,-5e-06,-3.6e-05
1e-06,6e-06,7.6e-05,-3e-06,-5.4e-05,-9e-06,1e-06,0,2e-06,5e-06,3e-06,1e-06,-1e-06,-1e-06,0,-2e-06,-2e-06,1e-06,1e-06,-1e-06,0,0.000423,0.00034,-0.000357,-2.6e-05,9e-06,4e-05,1.3e-05
-6e-06,-9e-06,-0.000166,-0.000284,-0.000106,-8.3e-05,-4.4e-05,-2e-05,-1.9e-05,-1.1e-05,-4e-06,-3e-06,-2e-06,-3e-06,-3e-06,-4e-06,-5e-06,-4e-06,-6e-06,-1.2e-05,-2.8e-05,-1.6e-05,-0.000866,-0.001285,-0.000366,-5.9e-05,6e-06,1.5e-05
-6e-06,-1.2e-05,-0.000107,-9.7e-05,2e-06,-1.5e-05,-1.5e-05,-1.3e-05,-1.1e-05,-1.6e-05,-1.1e-05,-6e-06,-2e-06,-4e-06,-4e-06,-4e-06,-5e-06,-8e-06,-1.1e-05,-9e-06,-1.3e-05,-0.000228,-0.000359,-0.000154,-0.000107,-1.7e-05,-2.6e-05,1e-06
-5e-06,-4e-06,7.6e-05,0.000177,7.8e-05,6.5e-05,3.3e-05,1e-06,1e-06,-1.2e-05,-1e-05,-4e-06,-3e-06,-3e-06,-3e-06,-4e-06,-6e-06,-7e-06,-6e-06,2e-06,1.5e-05,-6.6e-05,0.000678,0.001231,0.000303,2.9e-05,-3.3e-05,-2.4e-05
-4e-06,-1e-06,8e-05,0.000126,3.6e-05,4.3e-05,3.4e-05,9e-06,9e-06,-2e-06,-2e-06,-2e-06,-2e-06,-3e-06,-3e-06,-3e-06,-3e-06,1e-06,6e-06,3e-06,1.2e-05,5.2e-05,0.00042,0.000583,0.000161,1.5e-05,-2e-05,-2.4e-05
-5e-06,-5e-06,-4.2e-05,-0.000114,-3.7e-05,-1.6e-05,1e-06,3e-06,7e-06,6e-06,2e-06,-1e-06,-2e-06,-3e-06,-2e-06,-2e-06,-3e-06,0,0,-8e-06,-1.7e-05,3e-06,-0.000565,-0.000808,-0.000146,9e-06,5e-06,0
