1.7e-05,0.000184,1.7e-05,0.000114,8.6e-05,7.9e-05,4.3e-05,0.00011,0.000197,7.5e-05,-4.5e-05,-2.6e-05,-4.3e-05,1.7e-05,2e-05,0.000148,4.7e-05,5.6e-05,3.7e-05,0.000177,0.000249,0.000164,6.5e-05,6.1e-05,3.8e-05,-0.004148,-0.003422,-0.001458,-0.000419,-0.000283,-0.000471,-0.002723,-0.004302,-0.003746,-0.00214,-0.004579,-0.007234,-0.029584,-0.023615,-0.017362,-0.010374,-0.003973,-0.001033,-0.000197,0.001386,0.009179,-0.000338,-0.006989,-0.009669,-0.00379,-0.005508,-0.007874,-0.0163,-0.015056,-0.017363,-0.011169,-0.009603,-0.007512,-0.029043,-0.02555,-0.016108,-0.012687,-0.015581,-0.014112,-0.019704,-0.021998,-0.009818,-0.013602,-0.021022,-0.013424,-0.010533,-0.008263,-0.012259,-0.006992,-0.010754,-0.010977,-0.012758,-0.011004,-0.009009,-0.006817,-0.005809,-0.00755,-0.005787,-0.01102,-0.006695,-0.00859,-0.007933,-0.003853,-0.002335,-0.001873,-0.001733,-0.000622,-0.000807,-0.002655,-0.000878,-0.002197,-0.001327,-0.005047,-0.001523,0.00012,0.000741,-0.00436,-0.003286,-0.002254,-0.000925,-1.7e-05,0.000591,0.000145,1.8e-05,0.000206,0.000128,0.000532,0.000237,-1.4e-05,-0.000128,-6.4e-05,-9.5e-05,-0.000956,-0.000893,-0.000163,-7e-05
4.3e-05,-2e-05,6.5e-05,-8.7e-05,-4.3e-05,0.000104,6.4e-05,4.1e-05,-8.1e-05,-7.2e-05,-6.9e-05,4.8e-05,-0.000133,-5.6e-05,-5.9e-05,9.8e-05,9e-06,-4.9e-05,0.000112,0.00014,1e-05,1.8e-05,-3.4e-05,-7.8e-05,-0.000197,0.002156,0.002156,0.000975,0.000104,4.3e-05,0.000192,0.001191,0.002845,0.000712,0.00043,0.001455,0.004851,0.005371,0.011254,0.009834,0.005557,0.002721,0.001391,0.001315,0.001083,-0.0113,-0.009648,-0.003694,0.002298,-0.000453,-0.000356,-0.008513,-0.004722,-0.004443,-0.002774,-0.002672,-0.000983,0.001362,0.004702,0.008303,0.004311,0.000148,-0.002103,-0.00055,-0.004808,0.002441,-0.004109,-0.003027,0.004881,0.002074,-0.00231,-0.002462,-0.001429,-0.00445,0.000661,-0.001601,0.001276,0.001921,0.001668,-0.001378,-0.000718,0.000665,-0.00362,-0.00169,0.001062,0.001716,-0.002284,-0.00111,-0.000949,0.000204,0.00028,0.000436,-0.001051,0.000831,0.000926,0.001604,0.00132,0.002931,-0.000954,4.5e-05,-0.001776,0.002035,0.001035,0.001062,0.000528,0.000216,0.000124,0.000393,0.000282,-1.3e-05,0.000256,0.000277,5.7e-05,0.000104,-4.4e-05,0.000115,0.000299,6.6e-05,0.000881,0.000456,0.000186
1.2e-05,-1.4e-05,-0.000109,-2.4e-05,-2.4e-05,-5.1e-05,-7.3e-05,8e-06,3.1e-05,-0.000137,-9e-05,-7.4e-05,5e-06,5.2e-05,-2.4e-05,2.9e-05,-3.5e-05,0.000152,4.4e-05,-1e-05,-6.5e-05,5e-05,7e-06,-6.7e-05,-4.3e-05,-0.000724,-0.001079,-0.000508,2e-06,0.000192,-4e-05,-0.001553,-0.003377,-0.000793,-0.00052,0.00072,-0.002362,-0.006853,-0.004541,-0.002689,-0.002228,0.001723,0.000722,0.000579,-0.000271,-0.003618,-0.005328,-0.000628,-0.000605,-0.007169,-0.004009,0.002669,-0.002725,0.000959,-0.000102,-0.003496,-0.00391,-0.004947,-0.006169,-0.005657,-0.006434,-0.006365,-0.00047,-0.000108,-0.004954,-0.003635,-0.001251,-0.000929,-0.004141,6.5e-05,-0.002666,-0.003218,-0.002378,-0.002319,-0.004014,-0.004542,-0.001594,-0.003979,-0.001539,-0.002148,-0.000515,-0.00158,0.001833,-0.002497,-0.002549,-0.000833,-0.000988,-0.002529,-0.002244,-0.001547,-0.000779,-0.000172,0.001323,3.8e-05,0.000254,0.000228,0.000246,-0.001117,0.000656,0.000631,-0.000441,0.00059,0.000204,-0.000676,-0.000287,0.000371,-5.6e-05,3.1e-05,0.00018,0.000247,0.000306,0.000185,-3.9e-05,0.000239,0.000152,0.000156,0.000107,3.3e-05,-0.000478,-0.000315,3.3e-05
3e-05,-3.5e-05,-9e-06,6.1e-05,1e-06,9.6e-05,8.3e-05,-1.5e-05,1.8e-05,-0.000126,-6.1e-05,2.3e-05,2.6e-05,0.000113,5.6e-05,-6.6e-05,8e-06,-2.2e-05,4.8e-05,-0.000101,1.2e-05,2.1e-05,2.3e-05,-1.1e-05,1e-05,1.8e-05,0.000132,8.9e-05,9e-06,-0.000334,-0.00034,0.000249,0.001068,-0.000207,0.000281,-0.000136,0.000871,0.000855,-0.002162,0.002074,-0.000186,-0.000465,-0.001064,-7.5e-05,-7.1e-05,-0.000657,-0.002523,-0.00144,-9.5e-05,-0.005547,-0.002463,0.000544,-0.000182,-0.00078,0.002303,0.003576,0.002507,-0.000595,0.003009,0.004981,0.002878,0.001333,0.003508,-0.002065,0.005673,0.006486,0.003861,0.00033,0.000157,0.000396,0.001103,0.000104,-0.002411,0.00065,0.001106,0.001371,-0.000163,0.000629,0.000284,0.001324,-0.000353,0.001138,-0.002244,0.000831,0.002411,0.00178,0.001436,0.002928,0.000647,0.000652,0.000575,0.000368,0.00072,-0.000294,0.000508,-0.000108,-0.000215,-0.000614,-0.000214,-0.00087,0.000351,0.000448,-0.001251,0.000237,-6.9e-05,-4.9e-05,-0.000376,-9.9e-05,0.000109,-0.000436,-0.000246,-0.000133,-0.000119,-3.7e-05,-0.000173,-0.000116,-5.9e-05,-0.000179,0.000252,0.000171,1.5e-05
9.9e-05,4.6e-05,7.5e-05,-6e-06,0.000125,2.1e-05,1.2e-05,-1.9e-05,-1e-05,-2.1e-05,9.6e-05,5.4e-05,5.5e-05,-3e-06,1e-06,4e-06,1.5e-05,1e-06,3.1e-05,5e-06,0.000135,0.000137,6e-06,-5.8e-05,1.2e-05,2.3e-05,0.000235,0.000277,-4.8e-05,9.9e-05,-0.000113,-0.000318,-0.000587,0.00071,0.000117,0.000117,0.000256,0.001934,-0.002509,-0.002339,0.000724,-0.000536,-0.001044,-0.000728,-0.001528,0.000429,0.000618,0.002575,0.003699,0.001991,-0.003562,-0.000637,0.002668,-0.001747,-0.000122,-0.00055,-0.00194,-0.001079,-0.00024,-0.008235,-0.003759,-0.00124,0.000925,0.006693,-0.001532,-0.006678,-0.001023,-0.001452,-0.001608,0.000475,-0.000209,-0.001919,-0.001439,-0.00193,0.002275,-0.000152,-0.001251,-0.003001,-0.001355,-0.001265,0.000909,0.000684,-0.00046,0.001142,-0.002515,-0.000317,0.001211,0.00124,-2.3e-05,-9e-04,-1.1e-05,0.000202,0.000274,-0.001544,-0.001179,-0.000457,0.000149,0.000382,-0.00122,-0.00119,-5.7e-05,-0.000385,-0.000345,-0.000466,-0.000314,0.000208,0.000146,0.000285,0.000139,3e-06,0.000194,0.000217,8.3e-05,0.000207,0.000167,0.000257,0.000137,5.6e-05,-7.2e-05,5e-05,3.1e-05
-4.6e-05,1.4e-05,2.1e-05,6.3e-05,7.9e-05,-2.7e-05,6.1e-05,-5e-06,-5.5e-05,5.2e-05,-0.000102,2.5e-05,-1.4e-05,-4.9e-05,0,1e-06,-1e-06,7.9e-05,6.7e-05,3.5e-05,-2.6e-05,2.8e-05,0.000166,8.3e-05,6e-05,4.1e-05,-0.000135,-4.5e-05,3e-06,-9.2e-05,0.000237,6.3e-05,0.000692,-0.000583,0.000357,-0.000108,-1.2e-05,-0.000374,0.003568,0.004348,0.001408,0.000523,-0.000942,-0.000971,-0.000324,-5e-04,-0.005699,-0.003026,-0.002163,-0.002663,-0.003007,-0.000281,0.00069,0.001807,-0.000827,-0.002365,0.002536,0.000357,-4.3e-05,0.0039,0.000541,0.002802,-0.003609,-0.005155,-0.002895,0.001363,-0.003196,0.004849,0.000752,-0.002155,0.001701,0.001686,0.001523,0.002202,0.002472,0.000833,0.001885,0.00452,0.001736,0.000305,-0.000956,-0.000692,-2.9e-05,-0.000335,0.002192,0.001732,-0.000328,-0.001595,0.000199,0.000414,0.000268,0.000177,-0.000268,-0.000466,-0.000913,-0.000211,2.9e-05,-0.000355,0.000454,-0.000109,-7.4e-05,0.000393,-2.2e-05,0.000309,-5.8e-05,-0.000204,-0.000121,-3.2e-05,-0.000144,-9.2e-05,-3.5e-05,-0.000189,-0.000156,5.6e-05,-0.000121,4e-06,-0.000153,-0.000112,-0.000212,3.2e-05,-4.3e-05
-6.8e-05,-2.8e-05,1e-05,-6.2e-05,-5.7e-05,-0.000159,-8.5e-05,-2e-06,-3.4e-05,-9e-06,-3.8e-05,-7.2e-05,3e-06,1e-06,2.9e-05,-3.6e-05,-4.6e-05,3.3e-05,2.7e-05,-7.1e-05,-6.1e-05,-8.5e-05,-5.3e-05,-6.1e-05,-0.000123,-0.000158,-2.2e-05,-0.00018,-7e-05,-6.1e-05,-0.000135,7.5e-05,-0.000307,0.000771,1.3e-05,-4.6e-05,-0.000248,0.001295,0.002056,-0.003705,-0.002965,0.000952,0.000557,-0.000301,-0.000571,0.000183,0.003124,-0.000991,-0.000799,0.003847,0.001874,8e-05,-0.002572,0.000295,-0.00089,0.001125,0.001166,-0.000294,-0.00044,-0.001892,-0.002186,0.000292,-0.000744,0.000672,0.003645,-0.00287,-0.000699,0.000205,0.002665,0.001611,0.001015,-0.000716,-1.1e-05,0.000359,-0.001906,-0.001521,-0.001695,-0.002287,9.1e-05,0.000877,0.002374,0.000588,-0.000754,0.000957,-0.000499,-0.001143,-5.9e-05,-0.000262,-7.2e-05,-0.000241,-0.000135,-0.000229,-0.00013,0.000203,-0.000668,-0.000547,0.000123,-0.00018,-0.000628,-0.000281,0.000389,-0.000183,0.000713,0.000238,-0.000113,-9.6e-05,-9.3e-05,-5.3e-05,-0.000106,-0.000101,-0.000228,-0.000175,1.1e-05,-0.00022,-0.000101,-3.6e-05,-8e-05,6.5e-05,-0.000205,-0.000222,3.8e-05
-3.9e-05,-3.7e-05,4e-06,-6.1e-05,3e-05,-4e-06,1.6e-05,-2.8e-05,-6.7e-05,-4e-05,-3.8e-05,-3.7e-05,-5.1e-05,-2.5e-05,2.5e-05,-3e-06,-2.4e-05,-3e-06,-1.6e-05,-0.000113,-8.4e-05,-0.000118,0,-6.2e-05,-7.5e-05,-0.000105,0.000143,0.000133,0,2e-06,3.7e-05,6.9e-05,0.000235,-0.000273,0.000156,0.000244,0.000587,-0.000175,0.000993,0.004517,0.00069,-0.001045,-0.001495,-0.000614,-8.2e-05,0.000179,-0.00139,-0.001879,-0.000179,-0.006307,-0.002248,-0.000428,0.002519,-0.000588,0.004157,0.00092,-0.000739,-0.000637,0.000284,0.002706,0.002572,-3e-05,-0.001746,0.001214,-0.001769,0.002019,-0.000373,-0.00167,-0.000774,-0.000705,0.0017,-0.000232,0.000683,0.001706,0.00061,0.001364,0.000612,0.000859,0.000457,-0.000271,0.000595,-0.000329,0.000676,-0.00205,-0.000661,0.002093,-0.000511,-5.7e-05,-0.000881,0.000158,0.000223,-0.000126,-0.000215,-0.000362,-0.001046,-0.000438,-0.000305,-0.000292,0.000273,0.000475,0.000402,0.00015,-0.000439,-0.000465,0.000141,-4e-06,-6.6e-05,-4e-05,-0.000186,-9e-05,-0.000101,-0.00011,-0.00015,4.3e-05,-3.4e-05,-1.3e-05,-5.4e-05,4.8e-05,-8e-06,-4.9e-05,-6.7e-05
1.3e-05,-3.4e-05,-7e-05,-3e-05,-6e-06,2.3e-05,2e-06,-4.7e-05,-2.8e-05,4.1e-05,3.9e-05,-3e-05,-2e-06,-6e-06,-3.8e-05,8e-06,-0.000114,-5e-05,3.4e-05,-6e-06,-4e-05,-1e-04,8e-06,-6e-06,1.5e-05,4.2e-05,-0.000109,6.4e-05,5.1e-05,-2.9e-05,-6.4e-05,4.1e-05,-4.8e-05,0.000617,-0.000122,-0.000213,-0.000299,7.2e-05,-0.001064,-0.00286,0.000615,0.000782,0.000425,-0.000355,-0.000406,-0.00014,0.000289,0.001064,0.000925,0.000593,-0.00092,-0.004505,0.000112,-0.005056,-0.005812,-0.001775,-0.000563,-0.000242,-0.001508,1e-06,-0.003063,0.000512,0.000582,-0.000417,0.001539,-0.001515,-8.9e-05,-0.000381,-0.001398,-0.001858,-0.00119,7.1e-05,0.000306,-5.3e-05,-0.001787,-0.000978,-0.000786,-0.000988,-0.000264,-4.7e-05,-0.000526,0.000371,-0.001221,-0.001023,0.000453,-0.002007,-0.000623,0.000213,0.000536,0.000227,3.1e-05,-6.3e-05,-0.000176,-0.000131,-0.000214,3.5e-05,-0.000248,3e-06,0.000218,-1.6e-05,0.000479,-0.000304,0.000254,-0.000268,-0.00028,-4.2e-05,-0.000252,-0.00012,-7.7e-05,-0.000145,-0.000176,-0.000197,-5.6e-05,-0.000103,-9.5e-05,-5.5e-05,-4.9e-05,-0.000101,-3.3e-05,-2.8e-05,-7.2e-05
-1.7e-05,-2.9e-05,-2.1e-05,3.4e-05,1e-05,5e-06,2.6e-05,-3.2e-05,-4e-06,2.2e-05,5.9e-05,4.5e-05,2.4e-05,-3e-06,-5e-05,-1.2e-05,-4e-06,-6e-06,4e-06,-1.1e-05,6e-06,3.9e-05,3.9e-05,1e-06,3.5e-05,4.6e-05,2e-06,-0.000163,-0.000132,-5.4e-05,-3.5e-05,-2.7e-05,-5e-05,-0.000919,-0.000182,0.000122,0.000138,0.000205,-0.000484,-0.002491,-0.0012,-0.000576,0.000274,-2.6e-05,0.000225,-0.001092,-0.000372,0.002567,-0.00045,0.000451,-0.000939,0.001864,-0.001151,0.001607,0.001302,0.000278,3.6e-05,0.000924,-3e-04,-0.002273,0.001823,-0.000994,0.000165,-0.001824,-0.000638,0.0014,0.000974,-0.000557,0.001406,0.001426,0.000223,-0.001549,0.000111,-0.001982,5e-05,0.000212,0.000263,0.000405,-1e-06,7.8e-05,-0.000311,-0.000426,0.001583,0.001637,-0.000405,-0.000442,-0.000382,4.2e-05,6.9e-05,3.6e-05,-0.000222,0.000202,-0.000268,-6e-06,0.000628,9.1e-05,-0.000359,0.000111,-1.9e-05,-9.1e-05,-4.1e-05,-0.000266,3.9e-05,-1.9e-05,7.6e-05,-4.1e-05,-5.4e-05,-1e-05,-4.7e-05,-5.2e-05,3.4e-05,5e-06,2.9e-05,-2.4e-05,4.8e-05,-4e-05,7.7e-05,5.4e-05,-1.7e-05,-0.00018,-3e-06
-1.4e-05,4.2e-05,-1.4e-05,7e-06,-1.3e-05,-6e-06,-1.4e-05,-1.7e-05,1.6e-05,4e-06,3.3e-05,-1.3e-05,-8e-06,-1e-05,1.7e-05,-4e-05,0,-5e-06,-4.4e-05,-4.3e-05,-1e-06,-5.9e-05,1.6e-05,-1.2e-05,4e-06,-2.7e-05,2.2e-05,9.2e-05,7e-06,6.2e-05,1e-06,-2.7e-05,2e-05,0.000263,0.00033,-0.000548,-0.000236,-0.000104,0.000406,0.000852,0.000168,-0.001121,-0.000596,0.000334,-0.000224,-0.000482,-0.000332,0.001552,-0.000691,0.001309,0.000626,-0.001353,0.00103,0.001413,0.001399,-0.000563,0.000596,-0.001048,-0.000546,0.001363,0.000103,0.000919,0.001707,-0.00026,0.001183,-0.001126,0.000119,0.000768,-0.001243,8.7e-05,0.000951,0.00041,0.000201,-0.000681,-0.00066,1.2e-05,-0.00029,0.000395,-0.001582,0.000146,0.000168,-0.000148,-0.000773,0.000551,0.000462,-0.000864,0.000373,0.000132,0.00034,0.000209,-0.000426,3.1e-05,1.3e-05,-5.5e-05,5.5e-05,0.000297,-0.000158,-0.000469,8.7e-05,9.1e-05,0.00075,-0.000115,0.000353,-0.000298,-0.000202,-4.8e-05,-9.8e-05,-3.6e-05,-0.000191,-1.2e-05,5e-06,-4.7e-05,-5.6e-05,-0.000146,-3e-06,-3.6e-05,-0.000108,0,2.9e-05,-7e-06,7e-06
-1.5e-05,-3.6e-05,-1.1e-05,-2e-05,-5e-06,-4.9e-05,-2.5e-05,-2e-06,1.3e-05,-9e-06,-3.3e-05,-1.8e-05,1.1e-05,-4e-06,-1e-05,1.4e-05,3.1e-05,-5e-06,2.9e-05,1.5e-05,-2.6e-05,-1.4e-05,-2.1e-05,-3e-06,7e-06,3e-06,3.1e-05,-7.2e-05,6e-05,-2e-06,-4.2e-05,5e-05,-4.2e-05,-0.000217,-0.000224,0.000127,0.000105,0.000219,-0.000419,-0.001451,-0.000458,0.000548,-0.000157,3.7e-05,0.000216,-0.000305,-0.000377,0.001003,0.000853,-0.002451,0.000147,0.002149,-0.000186,0.001196,0.000585,0.000328,-0.000258,-0.000254,3.2e-05,-0.000642,-7.8e-05,-0.002359,-0.00054,-0.001012,0.000114,0.000111,0.000102,-0.000607,0.001253,0.000364,0.000138,0.000335,0.000488,0.000434,0.00081,0.000643,0.00088,-0.000284,0.000495,-0.000242,-0.000331,-0.000362,0.000447,0.000242,-0.000969,0.001235,-0.000423,-0.000257,-0.000829,-0.000167,-0.000115,-0.000267,-2.1e-05,-1.8e-05,0.000255,-0.000386,-0.00013,0.00014,3.4e-05,7e-05,-0.000651,-0.000303,-0.000177,0.000148,0.000225,3.6e-05,3.4e-05,6e-06,-4e-05,-1.5e-05,2.4e-05,-6.3e-05,4.5e-05,-2.1e-05,-9.7e-05,-5e-06,1e-05,5.9e-05,1e-06,-6.7e-05,-4e-05
-2e-06,-1e-05,-1.7e-05,-3.2e-05,-2e-05,-2e-05,-2e-06,2e-06,-2.3e-05,1.6e-05,-8e-06,2.7e-05,-3e-05,6e-06,5e-06,0,1.1e-05,-2.3e-05,-3e-06,-2e-06,1e-05,-2.1e-05,-1.4e-05,-2e-05,-1.1e-05,0,-3.9e-05,6.4e-05,-4.7e-05,-1.8e-05,-2.4e-05,-1.5e-05,1.6e-05,0.000324,0.00025,0.000159,2.9e-05,6e-06,0.000112,0.001369,0.000737,-0.000558,-0.000495,-0.000358,3.9e-05,-0.000204,0.000515,-0.001101,0.001792,0.000965,-8.9e-05,0.002246,-0.001785,-0.001059,-4.1e-05,0.000512,0.000223,0.000527,-0.000685,0.000144,-0.000377,0.001884,0.000113,-0.000238,-0.00039,0.00136,-0.001159,-0.001231,-0.00093,-0.000589,-0.001348,-0.000329,0.000659,-8e-04,0.000202,-1e-06,-0.00023,0.000337,0.000298,-5.3e-05,0.000146,0.000381,-0.000574,2.7e-05,-0.000103,-0.000678,0.000435,-3.4e-05,7e-04,8.6e-05,0.000232,0.000138,4e-05,1.1e-05,-0.000114,0.000324,8.6e-05,3.3e-05,0.000106,-3e-05,-0.00034,-4e-06,0.00019,-2.2e-05,-0.000153,-3e-05,-6.6e-05,-6e-06,3e-05,-1.3e-05,-3.1e-05,-1e-06,-2.3e-05,1e-06,1.9e-05,-1.6e-05,-3.7e-05,-1e-05,-1.9e-05,3.7e-05,-7e-06
-7e-06,-1e-06,1.2e-05,-9e-06,-1e-05,0,3e-06,-6e-06,2e-06,0,-1e-06,1.1e-05,1.1e-05,4e-06,-1.1e-05,-8e-06,-9e-06,-1.8e-05,-2e-06,-1.6e-05,8e-06,-3e-06,-2.4e-05,1.7e-05,-1.2e-05,1.7e-05,3.3e-05,-6.1e-05,-2.3e-05,-2.4e-05,-6e-06,3e-05,1.9e-05,-0.000256,-0.000154,1.7e-05,-7e-06,-0.000243,-0.00055,-0.000481,-0.000479,-0.000428,0.000331,0.000319,-2.2e-05,-0.000133,-0.00028,-0.000379,0.000276,4.5e-05,-0.00083,0.000771,-0.000808,-0.000527,-0.000246,-0.000906,-0.000423,-3.6e-05,2.6e-05,-0.000125,0.000336,-0.00124,-0.000315,0.00151,-0.000225,-0.00098,0.001946,0.000113,0.000485,0.000887,0.000118,0.000817,-0.00058,-0.000261,9.2e-05,-0.000467,0.000136,-0.000422,-0.000446,0.000119,-0.000289,-8.7e-05,0.000216,-4.6e-05,0.000227,0.000321,-0.000174,-0.000197,0.000321,-3.8e-05,0.000211,-4.5e-05,4.9e-05,-2e-05,-2.3e-05,-0.000165,-6.1e-05,-8.6e-05,3.4e-05,0,7.6e-05,-3.5e-05,0.000227,6e-05,0.000101,0.000106,5.4e-05,-2.2e-05,2e-05,-1.3e-05,2e-06,1.2e-05,-1.2e-05,-2.5e-05,4e-06,-5e-06,-6e-06,-2.7e-05,1e-06,1.9e-05,1.6e-05
-1e-06,2e-06,-7e-06,-5e-06,1.1e-05,-6e-06,-3e-06,1e-06,-3e-06,-9e-06,-4e-06,1e-05,1.1e-05,1e-06,0,1e-06,-4e-06,-2.1e-05,-8e-06,0,-7e-06,-5e-06,-1.3e-05,-1e-05,9e-06,1.6e-05,2e-06,2.4e-05,5.6e-05,2.3e-05,1.7e-05,-7e-06,-3.7e-05,6.2e-05,0.000161,2e-05,-6.3e-05,4.8e-05,0.000113,-0.000265,0.000141,0.000221,-1e-05,-8.7e-05,3.8e-05,0.00012,0.000224,0.000679,-0.000413,0.00049,-2.8e-05,0.00077,0.000687,0.000397,0.000681,0.000463,0.000215,-0.000565,5e-06,-0.000801,-0.00045,-0.000535,-0.000384,0.000276,-7.8e-05,0.000551,-0.001529,0.000189,-0.000152,-0.000392,-5.6e-05,-0.00109,0.000467,0.000361,7.8e-05,0.000174,-0.000275,4.3e-05,0.00059,-6.8e-05,-0.000151,-0.000209,-6.3e-05,0.000117,-0.000114,3.7e-05,0.000209,-2.8e-05,-0.000352,4.5e-05,-3e-05,4.9e-05,-6.3e-05,3.3e-05,-6.3e-05,-5.5e-05,2.2e-05,4.2e-05,-1.4e-05,-5.1e-05,-0.000158,8.7e-05,-6.2e-05,0.000134,4.6e-05,-2.3e-05,1.6e-05,1.1e-05,6.6e-05,3.8e-05,-1.2e-05,1.3e-05,1.8e-05,4.6e-05,2.6e-05,2e-06,3.5e-05,1.1e-05,1.1e-05,3.7e-05,-2e-06
0,3e-06,1e-05,-5e-06,-3e-06,1.1e-05,0,3e-06,1e-05,2e-06,6e-06,-1e-06,-1.3e-05,-8e-06,1e-06,2e-06,0,-5e-06,2e-06,-1.4e-05,5e-06,-2e-06,-7e-06,3e-06,1e-06,2e-06,-1.4e-05,1.1e-05,-7.4e-05,-4e-06,-1.6e-05,5e-06,1e-06,-0.000105,-0.000194,-2.8e-05,-1.8e-05,3e-06,0.000188,0.001812,0.000192,0.000221,-0.000241,-0.000191,-6.8e-05,-2e-06,-1e-06,-2.6e-05,-0.001472,-0.001029,0.000437,-0.000569,-0.000426,-0.000304,-0.000102,-6.4e-05,0.000566,0.000115,0.000344,4.8e-05,-4.6e-05,-8.3e-05,0.000247,0.00014,0.000374,-0.000599,8.2e-05,0.000524,0.000692,0.000108,0.00012,0.00023,5.2e-05,0.00036,-0.000388,0.000224,0.00025,0.000143,-0.000411,0.000397,-0.000204,0.00019,-0.000235,-3.5e-05,0.000467,-3.7e-05,-0.000199,0.000119,8.3e-05,-9.5e-05,-7e-06,-5.9e-05,3.1e-05,3.6e-05,6.1e-05,-5.7e-05,0.000105,-4e-06,4.6e-05,4e-05,2.9e-05,8.6e-05,0,4e-06,-4.5e-05,-3e-05,4e-05,-4e-06,-1.3e-05,1.2e-05,9e-06,3.1e-05,-1e-05,4e-06,-4e-06,4e-06,-5e-06,-1.8e-05,3e-06,-1.6e-05,4e-06
-3e-06,-1.1e-05,0,6e-06,3e-06,1e-06,7e-06,0,4e-06,6e-06,1.1e-05,2e-06,5e-06,3e-06,1.5e-05,0,-1.5e-05,2e-06,4e-06,-1e-06,4e-06,-5e-06,-6e-06,0,1e-06,-2e-06,8e-06,8e-06,5.7e-05,1.6e-05,1.7e-05,7e-06,1.5e-05,0.000147,-7.1e-05,-0.000119,1e-06,-5.7e-05,-2.9e-05,-0.001177,-0.000194,-0.000204,0.000292,5.8e-05,4.5e-05,0.000115,-6e-06,0.000637,-0.001014,0.000117,0.000267,-0.00013,0.000605,4.6e-05,0.000743,-0.000474,-0.000443,0.000206,6.9e-05,-0.000512,0.000316,0.000658,-0.000235,-0.000129,-0.00013,-0.000266,0.000194,-0.000263,-0.000733,0.000231,-0.000141,-0.000127,0.000124,6e-05,1.7e-05,-0.000123,6.3e-05,-0.000466,0.000174,-0.000147,9.5e-05,-1.3e-05,0.000246,-0.000247,-0.000195,7.4e-05,0.000153,2.1e-05,8e-05,9e-06,-2.9e-05,4.4e-05,-5.7e-05,-2.3e-05,4.2e-05,0.000168,4.9e-05,8e-06,9e-06,0,-8e-06,3.6e-05,-5.5e-05,-1e-04,1.3e-05,9e-06,-3.2e-05,-5e-06,-5.1e-05,-7e-06,-1.4e-05,-8e-06,-6e-06,4e-06,7e-06,1e-06,4e-06,2e-05,1e-06,6e-06,-6e-06
1e-06,5e-06,6e-06,4e-06,6e-06,-5e-06,-6e-06,-3e-06,1e-06,0,-2e-06,-1.5e-05,2e-06,1e-06,-5e-06,-6e-06,-1.1e-05,5e-06,-4e-06,-1e-06,-6e-06,1e-06,2e-06,-3e-06,5e-06,0,0,-2.2e-05,-4.8e-05,-2.1e-05,-2e-06,-3e-06,-6e-06,-6e-05,2.9e-05,5e-05,-1.1e-05,-4.8e-05,-1e-05,0.000612,9.3e-05,3.5e-05,-0.000154,9.6e-05,-1.5e-05,5.2e-05,8.5e-05,-0.000344,0.000391,-0.000251,-0.000403,-0.000209,0.000705,-0.00065,-0.000803,5e-04,1.2e-05,-0.000158,2.6e-05,0.000273,0.000111,-0.000647,0.000254,-0.000139,-5e-05,5.7e-05,0.000199,0.000404,0.000347,-6e-05,6.9e-05,0.000233,6.8e-05,0.00011,-0.000155,0.000122,-0.000295,0.000164,0.000414,7.4e-05,0.000108,-5.1e-05,-0.000245,0.000128,-4.5e-05,1.4e-05,-0.000155,1.7e-05,-2.7e-05,3.8e-05,1.8e-05,1.8e-05,3e-05,-1.1e-05,7.6e-05,-0.000139,-3.6e-05,5e-06,-6e-06,2e-06,-7.6e-05,1.7e-05,0.000106,2.1e-05,-3.8e-05,-2e-05,-8e-06,-1e-06,-2.4e-05,-1.3e-05,-1.1e-05,-1.2e-05,1.2e-05,-1.9e-05,-1.3e-05,-3e-06,-3e-06,-7e-06,-3e-06,-1.1e-05,4e-06
-1e-06,-1e-06,-3e-06,0,-2e-06,-1.2e-05,1e-06,-6e-06,3e-06,-7e-06,-3e-06,0,0,2e-06,-1e-06,4e-06,5e-06,7e-06,-1e-06,-5e-06,1e-06,-3e-06,0,0,0,-4e-06,-1.8e-05,5e-06,2.5e-05,1e-06,-1.2e-05,2e-06,0,0.000101,-2.2e-05,8e-06,9e-06,-1.5e-05,-6.9e-05,-0.000816,-5.1e-05,-9.3e-05,-0.000136,-2.6e-05,9e-06,2.3e-05,4.4e-05,-0.000108,0.000422,0.000572,-0.000183,0.00023,-6e-05,5.2e-05,0.000242,-0.000221,0.000167,-0.000152,1.8e-05,2e-06,-0.000207,0.000102,-0.000281,-0.000403,-0.00025,0.000136,0.000187,-7e-05,-0.000335,-2.4e-05,-0.000212,-7.7e-05,8.1e-05,0.000216,-8.7e-05,-0.000116,-0.000136,-0.000133,7e-06,-2.5e-05,-2.7e-05,-1e-05,0.000298,0.000184,7.6e-05,6.6e-05,6.1e-05,7e-05,0.000104,-9.8e-05,1.1e-05,4e-06,-2.5e-05,4e-06,2.7e-05,6.6e-05,-4.4e-05,-2.3e-05,2.7e-05,-2e-05,-9e-06,-1.7e-05,-0.000133,-1e-05,3.7e-05,1.1e-05,-1.8e-05,1e-06,-1.6e-05,5e-06,1.9e-05,-3e-06,-1e-05,-1e-06,-2e-06,0,-1.6e-05,-4e-06,-5e-06,-2.2e-05,-4e-06
-2e-06,0,-2e-06,-3e-06,2e-06,-2e-06,-1e-06,-1e-06,-1e-06,2e-06,-6e-06,-2e-06,-1e-06,-1e-06,2e-06,-1e-06,2e-06,2e-06,5e-06,1e-06,-2e-06,-1.1e-05,6e-06,-7e-06,1e-06,-2e-06,-1e-06,5e-06,-1.7e-05,2e-06,7e-06,1e-06,5e-06,-0.000134,1.5e-05,-7e-06,2.8e-05,-1e-06,0.000175,0.000108,2.6e-05,0.000166,-2.5e-05,-3e-06,-1e-05,-5e-06,-3.3e-05,-0.000221,0.000209,-0.000678,0.00013,0.000129,-6e-05,0.000267,-8.6e-05,-6.5e-05,-0.00017,-4e-05,-3.5e-05,-0.000201,0.000117,9.8e-05,-0.00015,0.000164,7e-06,5.2e-05,-0.000242,0.000185,0.000251,-0.000213,3e-04,-3.9e-05,-3.5e-05,-3.8e-05,-7.6e-05,-0.000204,9.2e-05,8.1e-05,1e-06,7.9e-05,6e-06,1.9e-05,-0.000228,0.000105,-0.000119,-0.000237,-7.8e-05,-4.8e-05,-0.000163,-1.8e-05,-1e-05,-4.4e-05,0,-5e-06,-3.4e-05,-5.7e-05,-4.9e-05,-2.6e-05,-9e-06,-5e-06,4.7e-05,-2.9e-05,7.3e-05,-3.4e-05,-3.8e-05,1.1e-05,1.1e-05,-4e-06,3e-06,-5e-06,-2e-06,-6e-06,2e-06,-1.3e-05,-6e-06,-7e-06,1e-06,-3e-06,-4e-06,1.2e-05,2e-06
-1e-06,-2e-06,-3e-06,-5e-06,-1e-06,2e-06,-1e-06,0,-1e-06,2e-06,-2e-06,5e-06,-1e-06,-1e-06,-5e-06,-1e-06,6e-06,3e-06,-4e-06,-1e-06,-1e-06,1e-06,-2e-06,2e-06,-4e-06,2e-06,9e-06,-1.3e-05,0,5e-06,2e-06,-2e-06,-8e-06,2.6e-05,-1.5e-05,-1.2e-05,2e-06,-3e-06,-1.1e-05,0.000149,4e-06,9e-06,6.3e-05,1.6e-05,3e-06,5e-06,5.6e-05,-0.00011,0.000299,0.00011,0.00016,0.000476,0.000282,0.000166,-9.4e-05,0.000255,0.000153,0.000167,-0.00013,0.000125,4.3e-05,-5.9e-05,-0.000179,6.7e-05,7e-05,7.8e-05,0.000185,-5.9e-05,-0.000147,-4e-06,0.000252,-8.1e-05,-6e-06,7.8e-05,5.5e-05,9.9e-05,-8.4e-05,-5e-06,-0.000277,-8e-05,1e-06,3e-06,0.000207,-3e-06,0.000161,3.9e-05,2.9e-05,-4.5e-05,0.000171,8e-06,-2.6e-05,4e-06,1e-06,1.1e-05,-5.2e-05,6e-05,-3.4e-05,2.7e-05,5e-06,1.5e-05,5.3e-05,-3e-05,-0.000106,3e-06,2.9e-05,1.1e-05,-1.6e-05,2e-06,2.1e-05,2e-06,-9e-06,-6e-06,1e-06,-1.5e-05,-1e-06,-6e-06,4e-06,2e-06,5e-06,-1.4e-05,-5e-06
0,-3e-06,-3e-06,-2e-06,0,1e-06,3e-06,-1e-06,0,-3e-06,1e-06,6e-06,-2e-06,1e-06,1e-06,0,2e-06,-1e-06,0,-3e-06,2e-06,-3e-06,7e-06,-3e-06,0,3e-06,-5e-06,6e-06,4e-06,-3e-06,-7e-06,1e-06,8e-06,-4e-05,3.3e-05,-1.2e-05,-1e-05,1.2e-05,5.8e-05,-0.000564,-0.000107,-0.000144,-8.1e-05,-3.5e-05,2.1e-05,-1.3e-05,6e-06,0.000114,-0.00017,-1.1e-05,-9e-05,0.000241,-9e-06,-0.000207,-6.9e-05,5.3e-05,-2.1e-05,-9.3e-05,-0.000176,-0.000183,-2.5e-05,7.2e-05,0.000192,-0.000144,-5.6e-05,-0.00026,-4e-06,-7.1e-05,4e-05,4.7e-05,-9.1e-05,6.3e-05,-5.7e-05,3.4e-05,6.2e-05,3.3e-05,3.6e-05,-0.000107,-3.2e-05,3e-06,6.3e-05,-5.3e-05,-0.000187,-8.1e-05,-8.5e-05,-3.5e-05,-3.9e-05,2.1e-05,-5.2e-05,-7e-06,-2.3e-05,2.8e-05,9e-06,5e-06,2.5e-05,-6e-05,-5e-06,-2.3e-05,1e-06,0,8e-06,-2.3e-05,2.6e-05,-1.3e-05,-1.1e-05,-1.2e-05,1e-05,-2e-06,-5e-06,-8e-06,-2e-06,9e-06,-2e-06,4e-06,4e-06,2e-06,4e-06,-3e-06,2e-06,4e-06,2e-06
-1e-06,3e-06,-2e-06,0,-1e-06,4e-06,-3e-06,-1e-06,1e-06,-3e-06,4e-06,-1e-06,4e-06,-1e-06,1e-06,1e-06,-2e-06,-3e-06,2e-06,-1e-06,0,-1e-06,0,-1e-06,1e-06,1e-06,2e-06,8e-06,-1e-06,0,1e-06,0,-3e-06,8e-05,5.8e-05,-1e-06,2e-06,-1.7e-05,-8.2e-05,0.000548,0.000132,-5.1e-05,5.6e-05,7e-06,-3.2e-05,-1.3e-05,-1.3e-05,1.8e-05,-0.000428,0.000246,-2.8e-05,0.000106,-0.000213,-0.000307,-0.000189,-0.000242,-3.6e-05,1.5e-05,-0.000148,9.5e-05,6.6e-05,-2.8e-05,8.2e-05,8e-05,-7.3e-05,9.3e-05,7.7e-05,-0.000238,-6e-06,1e-06,-6e-06,-8.8e-05,-5.6e-05,-0.000161,2.5e-05,0,5e-05,7.5e-05,0.000122,5.3e-05,2.1e-05,-1.4e-05,0.00015,-5.2e-05,1.1e-05,6.7e-05,5.1e-05,-1.8e-05,-2.7e-05,1.9e-05,3e-06,-1.9e-05,5e-06,-4e-06,1.3e-05,2.9e-05,1.9e-05,-1e-05,-1.5e-05,-7e-06,0.000113,-8e-06,-3.5e-05,1.9e-05,6e-06,2e-06,-6e-06,0,-6e-06,1e-06,4e-06,0,3e-06,2e-06,1e-06,0,2e-06,0,-2e-06,2e-06,-2e-06
0,-2e-06,0,-1e-06,-2e-06,-3e-06,2e-06,0,1e-06,1e-06,1e-06,2e-06,-4e-06,0,-5e-06,0,-2e-06,-3e-06,0,-1e-06,-1e-06,-1e-06,2e-06,0,0,-1e-06,5e-06,-2e-06,-8e-06,2e-06,1e-06,-1e-06,-3e-06,-5.2e-05,-2.1e-05,1.6e-05,1.5e-05,9e-06,-1.2e-05,-0.000115,-5.9e-05,2.6e-05,-0.00012,6e-06,2.2e-05,-8e-06,6.1e-05,6.3e-05,-6.6e-05,-0.00039,-6.8e-05,-0.000158,0.000259,0.000149,0.000107,0.000333,5.4e-05,0,-6.5e-05,-3.5e-05,-3.8e-05,4e-06,0.00025,-1.4e-05,-6e-06,1e-04,-0.000177,4.5e-05,-3.3e-05,-6e-06,0.000132,0.000152,-4.9e-05,-4.6e-05,5.6e-05,3.4e-05,-1e-06,-0.000108,-8e-06,-5.4e-05,5.5e-05,2.9e-05,-0.000133,-1.2e-05,-4e-06,-9.8e-05,-3.8e-05,7e-06,1.8e-05,-1.9e-05,3.5e-05,-7e-06,0,0,3.1e-05,-3.7e-05,3e-06,1.3e-05,1e-05,-7e-06,-4.5e-05,0,-7e-06,3.8e-05,-2e-06,-4e-06,8e-06,-1e-06,2e-06,2e-06,-1e-06,0,-2e-06,1e-06,-6e-06,0,0,0,2e-06,5e-06,6e-06
0,0,1e-06,1e-06,0,-3e-06,-1e-06,0,1e-06,1e-06,1e-06,-2e-06,2e-06,0,3e-06,-2e-06,-3e-06,-1e-06,-1e-06,0,1e-06,1e-06,1e-06,-1e-06,2e-06,0,-8e-06,1e-06,4e-06,2e-06,-2e-06,1e-06,2e-06,9e-06,1e-06,1.5e-05,-3e-06,3e-06,3.5e-05,0.000153,-2.6e-05,-2.1e-05,1.3e-05,-2.1e-05,-1e-05,4e-06,-4.5e-05,-4.4e-05,0.000121,0.000124,5e-05,-0.000291,4e-05,-9e-05,-0.000166,-0.000196,-3e-05,-1.6e-05,1.8e-05,-5.7e-05,7.8e-05,-6.1e-05,1.3e-05,-7.8e-05,-4e-06,-0.000221,0.000253,3.3e-05,-6e-06,4.1e-05,2.4e-05,-6.4e-05,-4.6e-05,4e-06,-6.3e-05,-8.1e-05,4.9e-05,0.000175,-4.3e-05,2e-06,-3.1e-05,-1.4e-05,5.4e-05,-3.6e-05,-6.4e-05,0.000105,2.7e-05,1e-05,2.7e-05,-1.9e-05,4e-05,1.2e-05,-8e-06,-2e-06,5e-05,5.2e-05,1.1e-05,-1.3e-05,-7e-06,0,0,1.2e-05,-3.4e-05,-5e-06,1.4e-05,9e-06,-8e-06,0,-2e-06,0,-1e-06,1e-06,-1e-06,3e-06,3e-06,2e-06,-9e-06,0,-2e-06,1e-06,-5e-06
0,0,0,0,-1e-06,-3e-06,-1e-06,0,0,-3e-06,-3e-06,-2e-06,0,1e-06,1e-06,2e-06,-4e-06,-1e-06,0,0,0,0,-3e-06,-1e-06,0,0,-4e-06,0,-5e-06,-4e-06,2e-06,0,0,-3.1e-05,-2.3e-05,-2.1e-05,-1.2e-05,2.7e-05,-2.6e-05,0.000151,6.6e-05,6.2e-05,-2.9e-05,2.4e-05,-2e-06,-2e-06,4.8e-05,-8.3e-05,5.8e-05,-0.000111,3e-05,-0.000291,-0.000264,8.9e-05,0.000191,9.4e-05,1.1e-05,-2.7e-05,4.3e-05,6e-05,3.9e-05,-0.000147,-3.2e-05,0.000138,5.8e-05,0.000128,-0.000173,4.1e-05,1.5e-05,-6e-05,-6.2e-05,4.6e-05,-6.3e-05,3e-06,-6e-06,6.5e-05,6.2e-05,-0.00011,2.9e-05,-1.2e-05,-2.4e-05,-2.4e-05,-7e-06,-1.5e-05,9.7e-05,-9.9e-05,-1.3e-05,-1.8e-05,4.6e-05,0,0,0,0,-2e-06,-1.8e-05,-2.4e-05,1.5e-05,-5e-06,3e-06,3e-06,1.9e-05,1.5e-05,1.6e-05,-6e-06,-8e-06,-8e-06,6e-06,0,2e-06,-5e-06,-3e-06,1e-06,3e-06,6e-06,0,0,3e-06,0,-2e-06,-1e-06,-2e-06
-1e-06,-1e-06,2e-06,-2e-06,0,0,1e-06,-1e-06,0,-2e-06,-3e-06,-3e-06,-1e-06,0,-2e-06,-1e-06,-1e-06,0,1e-06,-1e-06,-1e-06,-2e-06,1e-06,-1e-06,0,-1e-06,4e-06,-3e-06,4e-06,0,-2e-06,0,-2e-06,5.1e-05,3.4e-05,2e-06,-3e-06,-5e-06,-1e-06,-0.000238,-3.8e-05,-5e-05,-1.8e-05,1.8e-05,8e-06,1e-06,-2.1e-05,-7.6e-05,8.2e-05,0.000252,-8e-05,-6.1e-05,7e-05,-1e-04,-0.000198,4e-06,3.6e-05,-3.1e-05,7.4e-05,-0.000127,4.8e-05,0.000116,-0.000208,0.00012,1.3e-05,-0.000335,3.1e-05,-1.8e-05,2e-06,7e-06,-1.3e-05,-0.000102,-5e-05,-2.7e-05,-9e-06,4.1e-05,-1.2e-05,-6.1e-05,-8.1e-05,2.4e-05,-2.8e-05,3e-06,-3.2e-05,4.1e-05,-3.6e-05,6.9e-05,-1e-06,-5e-06,-8.1e-05,5e-06,-2.3e-05,-7e-06,0,1e-06,-2.3e-05,-9e-06,1e-05,0,4e-06,0,-2.8e-05,1.2e-05,-2.2e-05,7e-06,-7e-06,6e-06,-2e-06,-1e-06,1e-06,1e-06,5e-06,-4e-06,-2e-06,0,0,0,0,0,1e-06,2e-06,6e-06
0,1e-06,1e-06,0,0,2e-06,0,-1e-06,0,1e-06,0,3e-06,1e-06,0,2e-06,0,1e-06,0,0,1e-06,0,-2e-06,-5e-06,-2e-06,-1e-06,0,-2e-06,-4e-06,-8e-06,1e-06,1e-06,0,1e-06,-6e-06,-2.3e-05,-6e-06,7e-06,2e-06,-4.4e-05,0.000214,2.2e-05,-3.5e-05,2.1e-05,-2.9e-05,-8e-06,9e-06,2.2e-05,-9.6e-05,6.3e-05,-0.000248,-6.3e-05,-1.4e-05,-2.2e-05,-0.000103,0.000196,-3e-06,-3.9e-05,0.000103,4.5e-05,4.3e-05,-0.000146,-0.000267,-9.4e-05,-9e-05,-5.2e-05,7.8e-05,-3.6e-05,-4.5e-05,-1.2e-05,3.1e-05,-0.000152,4.1e-05,-4.8e-05,2.5e-05,-1e-05,-3.7e-05,-5e-05,4e-05,4.3e-05,-3.3e-05,1.1e-05,1.5e-05,9.1e-05,3.1e-05,5.1e-05,-1.8e-05,-1.7e-05,-8e-06,-1.2e-05,8e-06,-1.9e-05,-6e-06,2e-06,2e-06,-7e-06,1.5e-05,-1e-05,-5e-06,-7e-06,-1e-06,-7e-06,7e-06,-2e-05,-1.6e-05,5e-06,-2e-06,-2e-06,0,-1.2e-05,1e-06,-1e-06,3e-06,1e-06,-6e-06,0,0,3e-06,0,0,-7e-06,-3e-06
0,-2e-06,0,-1e-06,0,1e-06,-1e-06,0,0,0,2e-06,-1e-06,-1e-06,0,0,0,2e-06,0,-2e-06,0,0,-1e-06,0,0,-1e-06,1e-06,-1e-06,3e-06,4e-06,1e-06,1e-06,0,0,1.7e-05,-1.6e-05,4e-06,-4e-06,-3e-06,4.5e-05,-0.000303,-9e-06,3.9e-05,-5.2e-05,2e-06,4e-06,2e-06,-1.2e-05,4.7e-05,-4.2e-05,6e-05,2.1e-05,0.000103,-0.000188,0.000112,-9e-06,-1.1e-05,-3.9e-05,-6.2e-05,6e-06,-7.3e-05,4.1e-05,9.9e-05,-7.7e-05,1.6e-05,3.1e-05,4.1e-05,3.7e-05,0.000183,3.6e-05,-1e-06,1.9e-05,5.8e-05,-5e-05,5.6e-05,-2e-05,2.9e-05,-2.9e-05,-2.2e-05,9.6e-05,5.2e-05,2e-06,-1.1e-05,-0.000114,1e-06,-1.4e-05,4.7e-05,3e-06,-9e-06,5.9e-05,7e-06,2e-06,1.3e-05,-1e-06,0,-1.2e-05,-8e-06,-2.5e-05,-3e-06,2e-06,3e-06,-1.8e-05,-1e-06,2.6e-05,-9e-06,-6e-06,-5e-06,-2e-06,0,-7e-06,2e-06,-3e-06,-2e-06,1e-06,-1e-06,1e-06,-1e-06,5e-06,0,1e-06,1e-06,-3e-06
0,1e-06,-1e-06,0,0,0,1e-06,0,1e-06,-2e-06,1e-06,1e-06,0,1e-06,-2e-06,1e-06,3e-06,1e-06,1e-06,-1e-06,-1e-06,0,-2e-06,-2e-06,0,0,6e-06,-4e-06,-6e-06,-1e-06,-2e-06,0,0,-3.2e-05,2.3e-05,6e-06,-4e-06,1.6e-05,-1.7e-05,-4.2e-05,-6e-06,2.5e-05,2.6e-05,8e-06,-1e-06,3e-06,2.8e-05,8.4e-05,-1.1e-05,-8.7e-05,-1.4e-05,9.6e-05,0.000118,-1.8e-05,1.2e-05,0.000108,8.3e-05,-2.3e-05,-4.7e-05,-3.5e-05,3.7e-05,-0.000125,5.9e-05,-7.7e-05,3.2e-05,7.5e-05,-2.2e-05,2.3e-05,-0.000102,3.8e-05,-2.2e-05,9e-06,-3.9e-05,1e-06,1.6e-05,-3.4e-05,3.1e-05,0.000119,1e-06,-4.5e-05,-1.7e-05,-9e-06,0.000131,-3.2e-05,-4.1e-05,-3.6e-05,-1e-05,2.6e-05,-4.3e-05,-1.5e-05,7e-06,6e-06,-3e-06,1e-06,5e-06,7e-06,-1.2e-05,0,-5e-06,-6e-06,-1e-05,-6e-06,4e-06,-5e-06,4e-06,8e-06,0,0,2e-06,-3e-06,-1e-06,0,-1e-06,-3e-06,-2e-06,-1e-06,-5e-06,0,1e-06,-3e-06,5e-06
0,0,0,1e-06,0,-3e-06,-1e-06,0,0,0,1e-06,1e-06,0,0,2e-06,0,0,0,1e-06,0,0,-1e-06,0,0,0,-1e-06,1e-06,0,3e-06,-1e-06,1e-06,0,-1e-06,7e-06,2e-06,1e-06,1e-06,-3e-06,6e-06,0.000186,2.4e-05,-1.2e-05,-4.4e-05,-8e-06,1e-06,-2e-06,-2.5e-05,5e-05,1.2e-05,0.000192,-1e-05,-3.8e-05,0.000176,-2.3e-05,3e-06,-0.00012,-3e-06,1.1e-05,-8.2e-05,5.8e-05,-2e-05,9.1e-05,8.5e-05,-8.6e-05,1.8e-05,8.7e-05,-5.6e-05,-7.4e-05,7.8e-05,-9e-06,1.9e-05,-7e-06,-2.2e-05,4.5e-05,3e-05,-3e-05,-1.6e-05,-0.000127,1.3e-05,-4e-06,-9e-06,1.3e-05,-0.000129,-4.4e-05,4.6e-05,-4e-06,3e-06,9e-06,1e-05,-7e-06,-5e-06,-2e-06,1e-06,-1e-06,3.2e-05,-1.2e-05,-1e-05,-9e-06,-1e-06,8e-06,-3.3e-05,-9e-06,-7e-06,-8e-06,-2e-06,-2e-06,3e-06,-1e-06,5e-06,0,0,0,1e-06,-5e-06,1e-06,-2e-06,-1e-06,0,0,2e-06,-4e-06
0,0,-1e-06,0,0,-1e-06,0,0,1e-06,1e-06,-1e-06,0,0,0,-1e-06,-1e-06,-1e-06,1e-06,-1e-06,0,0,1e-06,0,-1e-06,0,0,-3e-06,3e-06,-5e-06,0,1e-06,0,1e-06,-7e-06,0,-3e-06,6e-06,-2e-06,-1e-05,-0.000243,-5.3e-05,-3e-06,-2.7e-05,2e-06,-5e-06,5e-06,3e-05,-6.8e-05,-2.1e-05,-0.000193,-1.8e-05,-1.6e-05,-2.3e-05,-0.000123,-9.3e-05,0.000103,-7e-05,5.1e-05,-8.6e-05,-1.7e-05,-2e-06,-3.5e-05,0.000105,2.2e-05,1.1e-05,-0.000114,5.1e-05,-3.6e-05,-5.9e-05,-2.5e-05,-0.000112,-4e-05,-2.5e-05,1.4e-05,-1.5e-05,4.1e-05,-4.1e-05,3.6e-05,-8.3e-05,9e-06,-1.3e-05,2e-06,0.000116,-1.6e-05,-4.1e-05,2.3e-05,0,0,-1e-05,7e-06,-1.3e-05,-1.2e-05,1e-06,-1e-06,1e-06,1.4e-05,3e-06,-2e-06,2e-06,-3e-06,1.4e-05,-8e-06,-7e-06,1.3e-05,7e-06,3e-06,-3e-06,1e-06,8e-06,0,2e-06,1e-06,0,1e-06,-2e-06,1e-06,-2e-06,0,-1e-06,1e-06,2e-06
0,0,0,0,-1e-06,0,1e-06,0,-1e-06,-1e-06,-2e-06,0,0,-1e-06,-1e-06,1e-06,-1e-06,0,0,0,0,0,0,-1e-06,0,0,2e-06,-1e-06,5e-06,1e-06,-1e-06,0,-1e-06,1.9e-05,-1.9e-05,-5e-06,-4e-06,-5e-06,1e-06,0.000262,3.3e-05,-3.4e-05,-4e-06,2e-06,5e-06,-4e-06,-1.9e-05,-2.3e-05,-4.5e-05,6.1e-05,-5.9e-05,-0.000218,6.3e-05,1e-06,8.8e-05,-7.3e-05,4.8e-05,-1.7e-05,-6.6e-05,5.4e-05,3e-06,1.6e-05,1.9e-05,0.000101,-9e-06,-4.2e-05,-8.8e-05,-2e-06,4.8e-05,-2.7e-05,4.5e-05,-5e-06,-1.3e-05,-1.4e-05,6e-06,-2.8e-05,6e-06,1.1e-05,-1.9e-05,5e-06,5e-06,-5e-06,-0.00011,3e-06,4.9e-05,-2.3e-05,6e-06,1.2e-05,1.7e-05,5e-06,-2e-06,1e-05,3e-06,2e-06,-8e-06,-6e-06,1e-05,0,-2e-06,3e-06,-7e-06,-5e-06,2.9e-05,1.4e-05,-7e-06,-6e-06,2e-06,-1e-06,2e-06,2e-06,-1e-06,-1e-06,-1e-06,4e-06,0,0,0,0,0,1e-06,1e-06
0,-1e-06,0,0,0,1e-06,-1e-06,0,0,-1e-06,-1e-06,-2e-06,1e-06,1e-06,1e-06,-1e-06,-2e-06,0,0,0,0,0,2e-06,0,0,0,0,0,-5e-06,1e-06,0,0,0,-1e-05,-1e-06,2e-06,-3e-06,0,3.2e-05,-0.000133,2.3e-05,1e-05,1.2e-05,0,-1e-06,1e-06,2e-05,-3.9e-05,-3.1e-05,-7.3e-05,-7e-06,-0.000104,8e-05,1.2e-05,-5.2e-05,9e-06,-9e-06,-3.7e-05,-3.4e-05,-6.7e-05,-2.5e-05,2.8e-05,1.1e-05,-1.6e-05,-6e-06,-2.4e-05,8.2e-05,4.1e-05,-1e-05,3.3e-05,8.6e-05,4.1e-05,-2e-06,7e-06,2e-06,-4e-06,3e-05,1.1e-05,4.1e-05,-2.3e-05,1.5e-05,-2e-06,8.4e-05,9e-06,-1.6e-05,2.7e-05,-5e-06,-1.1e-05,-1.2e-05,5e-06,1e-05,2e-06,0,0,1e-06,-3e-06,1e-05,-6e-06,2e-06,-2e-06,2e-06,-1e-06,-5e-06,1e-06,6e-06,2e-06,-1e-06,0,-8e-06,-2e-06,0,2e-06,1e-06,2e-06,1e-06,0,4e-06,0,1e-06,1e-06,-1e-06
0,1e-06,0,-1e-06,0,1e-06,1e-06,0,0,1e-06,0,0,-1e-06,0,0,0,-1e-06,0,0,0,0,-1e-06,-1e-06,-2e-06,0,0,-2e-06,3e-06,2e-06,-1e-06,0,0,0,-5e-06,7e-06,4e-06,5e-06,-3e-06,-2.3e-05,0.000159,-4.1e-05,2.3e-05,-4.9e-05,4e-06,-1e-06,-1e-06,-9e-06,3.4e-05,2e-06,0.000152,5e-05,-0.000194,-0.000112,1.3e-05,6.7e-05,1e-05,-1.2e-05,3.9e-05,-8e-06,-4.8e-05,-1.7e-05,-2.3e-05,-1.8e-05,3.3e-05,2.7e-05,4.5e-05,-5.2e-05,-1.2e-05,1.3e-05,-1.5e-05,-1.9e-05,0,6e-06,-2e-06,-7e-06,1.6e-05,3.5e-05,5e-05,-5e-06,1.3e-05,3e-06,4e-06,-6.2e-05,1.7e-05,-1.5e-05,-2.7e-05,6e-06,-1.3e-05,-2.3e-05,-5e-06,1.3e-05,-1e-05,-1e-06,0,-8e-06,6e-06,5e-06,-1e-06,-1e-06,-1e-06,2.6e-05,3e-06,1.8e-05,2e-06,0,-2e-06,2e-06,0,-6e-06,-1e-06,1e-06,-1e-06,-1e-06,-1e-06,0,1e-06,0,0,0,-3e-06,0
0,0,0,0,-1e-06,-1e-06,-1e-06,0,0,1e-06,1e-06,-1e-06,1e-06,0,-1e-06,0,0,0,-1e-06,0,0,0,3e-06,0,0,0,2e-06,1e-06,-3e-06,0,-1e-06,0,-1e-06,-1.1e-05,-1e-05,1e-06,3e-06,-1e-06,8e-06,8.6e-05,2e-05,-2.4e-05,1.8e-05,-2e-06,2e-06,1e-06,1.1e-05,4.7e-05,4.6e-05,-0.000141,-4.4e-05,8e-06,-6.3e-05,1.9e-05,-0.000128,-1.5e-05,3.6e-05,-1.3e-05,1.7e-05,1.6e-05,2.8e-05,2.8e-05,-3.2e-05,0,5e-06,-4.7e-05,4.4e-05,-5.5e-05,-3.1e-05,-1e-06,6e-05,1e-05,5e-06,-1.2e-05,-1.9e-05,-1.6e-05,-2.5e-05,-0.000102,2e-05,1e-06,-5e-06,5e-06,4e-05,1.8e-05,2.2e-05,1.6e-05,-8e-06,0,1.7e-05,-8e-06,5e-06,1e-06,-1e-06,0,-5e-06,-2e-06,3e-06,-2e-06,0,2e-06,-1e-06,4e-06,-1.6e-05,2e-06,0,2e-06,-4e-06,0,-1e-06,-1e-06,0,0,0,3e-06,-2e-06,0,-1e-06,0,0,3e-06,2e-06
0,0,1e-06,0,0,-1e-06,0,0,0,-1e-06,1e-06,1e-06,0,-1e-06,1e-06,1e-06,0,-1e-06,0,0,0,0,-1e-06,-1e-06,0,0,2e-06,-1e-06,3e-06,0,1e-06,0,0,1.2e-05,-1e-06,1e-06,-3e-06,-4e-06,-1.9e-05,-0.000263,7e-06,6e-06,-1.7e-05,-6e-06,-2e-06,-1e-06,-1e-05,8e-06,5.5e-05,6.2e-05,-6.1e-05,1.8e-05,4.6e-05,-7.8e-05,7.9e-05,-2.7e-05,-5.4e-05,-5e-06,2.2e-05,4e-06,-2e-06,-7.5e-05,-1.7e-05,-8.9e-05,-1.6e-05,-3.1e-05,-1.1e-05,4e-06,2.3e-05,2.8e-05,1.2e-05,-8e-06,1.1e-05,-2.2e-05,3e-06,2.8e-05,-1.4e-05,5.8e-05,-3.2e-05,-2e-05,3e-06,-4e-06,-1e-05,3e-06,-3.9e-05,-3.2e-05,-1e-06,-4e-06,4e-06,6e-06,-6e-06,7e-06,0,-1e-06,1.6e-05,-1e-06,-5e-06,-4e-06,2e-06,-1e-06,9e-06,5e-06,9e-06,-6e-06,-4e-06,-1e-06,3e-06,-1e-06,3e-06,1e-06,-1e-06,0,0,-1e-06,1e-06,0,-3e-06,0,0,-2e-06,-1e-06
0,0,0,0,0,-1e-06,1e-06,0,0,0,0,0,0,0,-1e-06,0,1e-06,-1e-06,0,0,0,0,2e-06,0,0,0,-2e-06,0,-7e-06,1e-06,0,0,0,8e-06,-2e-06,-6e-06,-4e-06,-3e-06,1.4e-05,0.000175,2e-06,-3e-06,-3.9e-05,5e-06,0,0,1.4e-05,-1e-05,2.4e-05,-9.2e-05,4.5e-05,0.000126,-5.6e-05,1.4e-05,4e-06,6e-05,2.1e-05,-1.8e-05,1.3e-05,7.5e-05,-1e-06,2.1e-05,-2.7e-05,1.4e-05,-1.1e-05,-7.5e-05,2e-05,4.8e-05,-4.3e-05,-1e-06,2.2e-05,-5.3e-05,2e-05,3e-06,9e-06,9e-06,1.6e-05,-3.5e-05,-3.9e-05,2e-05,-1e-06,-4e-06,-1.5e-05,-1e-05,4.5e-05,2.7e-05,-6e-06,-1e-06,-8e-06,3e-06,-1.2e-05,1e-06,1e-06,0,1e-06,0,-7e-06,-3e-06,-1e-06,-1e-06,1.2e-05,4e-06,8e-06,-6e-06,2e-06,2e-06,-3e-06,0,5e-06,-2e-06,0,0,-1e-06,-4e-06,-1e-06,0,-1e-06,0,-1e-06,0,1e-06
0,0,0,1e-06,0,0,-1e-06,0,0,1e-06,-1e-06,1e-06,1e-06,0,0,0,1e-06,0,0,0,0,0,0,-1e-06,0,0,0,-1e-06,4e-06,-1e-06,0,0,-1e-06,3e-06,2.2e-05,2e-06,6e-06,-2e-06,-1e-06,-0.000176,-1.6e-05,0,1.8e-05,3e-06,2e-06,1e-06,-1e-05,-3.4e-05,-5e-05,0.000137,5e-06,0.000129,-2e-05,-3.6e-05,1.3e-05,-7e-05,2.6e-05,2.8e-05,-2e-06,-4.1e-05,-4e-06,-3.8e-05,-2.2e-05,3.8e-05,-1.2e-05,3e-06,-1e-05,1.9e-05,4.5e-05,-9e-06,8e-06,3.5e-05,2e-05,-3e-06,2e-06,-1.1e-05,2.4e-05,4.7e-05,4.7e-05,-6e-06,4e-06,7e-06,4.7e-05,-1.9e-05,-2.5e-05,-1.5e-05,1e-06,5e-06,1e-06,2e-06,-5e-06,-9e-06,0,1e-06,-8e-06,1e-06,-1e-05,-2e-06,0,0,-5e-06,2e-06,2e-06,-8e-06,-1e-06,-1e-06,2e-06,0,1e-06,-1e-06,0,-1e-06,0,-1e-06,0,-1e-06,1e-06,0,0,0,-2e-06
0,0,0,0,0,1e-06,1e-06,0,0,0,-1e-06,1e-06,-1e-06,0,1e-06,0,0,0,0,0,0,0,-1e-06,0,0,0,1e-06,-2e-06,-5e-06,0,1e-06,0,1e-06,-1e-05,2e-06,1e-06,0,3e-06,-5e-06,3.6e-05,-1.5e-05,9e-06,-1.9e-05,-7e-06,-2e-06,-1e-06,8e-06,1e-06,-8.5e-05,-0.000103,-6.3e-05,4.5e-05,9.3e-05,-1.6e-05,2.9e-05,6.1e-05,-4.2e-05,5e-06,-1.9e-05,-5.2e-05,0,-3.9e-05,-2.8e-05,-6e-06,8e-06,7e-05,-2.1e-05,-7e-06,-1.6e-05,-4e-06,1.9e-05,-8e-06,2.3e-05,-7e-06,4e-06,9e-06,-3.4e-05,-1.6e-05,2.6e-05,-6e-06,3e-06,3e-06,-6.8e-05,-1.2e-05,6e-06,6e-06,-5e-06,-2e-06,-1.8e-05,-3e-06,6e-06,0,-1e-06,0,4e-06,1e-06,-6e-06,-3e-06,-1e-06,1e-06,8e-06,0,-1.3e-05,-5e-06,-3e-06,-2e-06,-4e-06,0,-6e-06,0,1e-06,1e-06,0,0,1e-06,0,3e-06,0,0,-1e-06,2e-06
0,0,0,0,0,0,0,0,0,-1e-06,0,-1e-06,0,-1e-06,0,-1e-06,0,0,0,0,0,0,1e-06,-1e-06,0,0,-2e-06,0,2e-06,0,0,0,0,-4e-06,-1.4e-05,0,-3e-06,1e-06,8e-06,2.7e-05,2.9e-05,3e-06,-3e-06,3e-06,1e-06,2e-06,-5e-06,9e-06,-2.1e-05,4.6e-05,1.1e-05,6.6e-05,-2.9e-05,-7e-06,-8.1e-05,-2.6e-05,1.3e-05,-3.7e-05,-3.4e-05,-2.7e-05,1.5e-05,3.5e-05,1.7e-05,2.7e-05,0,1.6e-05,3.4e-05,-4.1e-05,2.2e-05,4e-06,-5.5e-05,3.3e-05,3e-05,9e-06,-3e-06,-7e-06,-4e-06,-7.1e-05,9e-06,3e-06,0,-6e-06,8.6e-05,5e-06,1.4e-05,-4e-06,4e-06,3e-06,1.7e-05,-5e-06,8e-06,8e-06,-1e-06,0,-6e-06,-1e-06,1e-06,-2e-06,-1e-06,0,-1.2e-05,-2e-06,5e-06,5e-06,5e-06,3e-06,5e-06,0,-2e-06,1e-06,0,-1e-06,0,-1e-06,0,0,1e-06,0,0,1e-06,-1e-06
0,0,0,0,0,0,0,0,0,0,1e-06,0,0,0,-1e-06,0,-1e-06,0,0,0,0,0,-2e-06,-1e-06,0,0,-1e-06,1e-06,-3e-06,1e-06,0,0,0,0,3e-06,2e-06,-2e-06,2e-06,-1.6e-05,-0.000119,4e-06,-1.9e-05,-3.1e-05,3e-06,0,-2e-06,1e-06,4e-06,4.9e-05,-9.9e-05,1.1e-05,-9.6e-05,-4.3e-05,-3.6e-05,6.3e-05,-7e-06,1e-05,9e-06,-4.3e-05,-7e-06,1e-05,-3.7e-05,2.3e-05,1e-05,-1.4e-05,-1.3e-05,-3.4e-05,9e-06,-1.6e-05,-1.2e-05,-4.7e-05,-1e-05,2.8e-05,4e-06,0,-1.4e-05,-4e-06,6.4e-05,-5e-06,1.4e-05,-2e-06,1e-06,-9.8e-05,1.5e-05,-3.6e-05,9e-06,-1e-06,2e-06,2e-06,3e-06,0,1e-06,1e-06,0,-2e-06,-9e-06,8e-06,-2e-06,2e-06,1e-06,-2e-06,-3e-06,-1e-06,6e-06,-2e-06,-4e-06,-3e-06,0,2e-06,0,0,0,0,0,-1e-06,0,-2e-06,0,0,-1e-06,-1e-06
