-0.004466,-0.006966,-0.006368,-0.008831,-0.007487,-0.005854,-0.001781,-0.003375,-0.009999,-0.009059,-0.009703,-0.006713,-0.005446,-0.006139,-0.007047,-0.004618,-0.004404,-0.006475,-0.005877,-0.004687,-0.005074,-0.006985,-0.005303,-0.006975,-0.006592,-0.004474,-0.006504,-0.007529,-0.007505,-0.005014,-0.006358,-0.003515,-0.003174,-0.007816,-0.003591,-0.003637,-0.004145,-0.007296,-0.003702,-0.002647,-0.007511,-0.006412,-0.006925,-0.00535,-0.005575,-0.01162,-0.004798,-0.011491,-0.009073,-0.00924,-0.006064,-0.004003,-0.007539,-0.004764,-0.005573,-0.004565,-0.003788,-0.005304,-0.002334,-0.000785,-0.001654,-0.006315,-0.005864,-0.004103,-0.007102,-0.004627,-0.005228,-0.004583,-0.00395,-0.002561,-0.004383,-0.003765,-0.003619,-0.002564,-0.008531,-0.008936,-0.005777,-0.005776,-0.003706,-0.006376,-0.003477,-0.003607,-0.005904,-0.005421,-0.004843,-0.002914,-0.002795,-0.004349,-0.002228,-0.003458,-0.003668,-0.002587,-0.001634,-0.004183,-0.004005,-0.004872,-0.005128,-0.004374,-0.005819,-0.002744,-0.002789,-0.003115,-0.002477,-0.004845,-0.004303,-0.002828,-0.001195,-0.001763,-0.001495,-0.001491,-0.000449,-0.002922,-0.004763,-0.003869,-0.000477,-0.002572,-0.001969,-0.002394,-0.004061,-0.003786,-0.001852
-0.000627,0.001883,-0.000159,0.000764,-0.000194,-0.001529,0.000135,-0.00421,0.002278,0.003639,0.002982,0.000654,-0.000471,0.001691,0.00308,0.001157,0.001643,0.001476,0.00151,0.000623,7.3e-05,0.001462,-0.000388,0.000729,0.002379,0.000882,-0.000368,-8.3e-05,0.00404,0.001828,-0.000627,-0.001378,-0.000938,0.002556,-0.001018,-0.003533,-0.002149,-0.000133,-0.002574,-0.004035,0.001397,0.000408,-0.000577,0.000192,-0.000134,0.006134,-0.003719,0.001514,0.000236,0.001138,0.001263,0.000729,0.003974,0.002306,-0.001514,-0.001323,-8e-05,0.000469,-0.004538,-0.003441,-0.001248,0.000831,0.001767,0.000631,0.002982,0.001382,0.001312,0.000822,-0.001542,-0.000402,0.00023,0.00087,-0.000499,0,0.001814,0.004486,0.000324,0.000248,0.000103,0.003155,0.002094,0.000877,-4.1e-05,0.000712,0.000583,0.000736,-0.000762,-0.000884,-0.001783,-0.000525,0.000775,-0.000414,-0.000196,3e-06,-0.002249,-0.000231,0.001374,0.000302,-0.000569,0.000117,-0.001128,-0.001676,-0.000435,0.000831,0.002514,-7.2e-05,-0.001487,-0.002078,-0.002704,-0.001682,-0.003116,-0.003345,8.1e-05,-0.002412,-0.002295,-0.001481,-0.000358,-0.001426,0.000553,0.001122,-0.001128
-0.002863,-0.003532,-0.000856,0.000553,0.000233,-0.000772,-0.003366,0.001434,-0.001343,-0.002909,-0.002696,0.000593,0.001604,0.001542,-0.001786,-0.001137,-0.001928,-0.001613,0.001198,0.000352,0.000994,-0.002038,-0.002282,-0.00036,-0.000996,-0.002049,-0.000682,-6e-05,-0.004233,-0.000946,0.000145,-0.003138,-0.001815,-0.000228,0.000627,-0.000266,-0.000389,0.00037,0.001972,0.001827,-0.000946,-0.001113,3e-04,-0.000591,-0.000849,-0.003466,-0.00019,0.000512,0.000409,0.000422,-0.002778,-0.000423,0.000916,-0.005113,-0.000303,0.000956,0.000315,-0.000398,2e-05,0.000334,-8.5e-05,-0.000149,-0.00168,4e-06,-0.00225,-0.001816,-0.000934,-0.001523,0.000877,-0.000753,-0.001987,-0.001846,-0.000721,-0.001919,-0.000694,-0.004066,-0.001084,-0.000967,-0.00123,-0.001101,-0.000702,-0.001874,-0.001066,-0.000751,0.000819,-0.001314,-0.000439,0.000375,0.000327,0.001574,-0.000466,0.000161,-0.001451,-0.001305,-0.000248,-0.001947,-0.002198,-0.000485,-0.000296,-0.000366,-0.000149,-0.000684,2.1e-05,-0.001077,-0.001959,-0.001517,-0.000331,0.001035,0.001696,-0.000565,0.001185,0.00166,-4e-04,0.000952,-0.000165,0.000315,-0.000933,0.000357,6.1e-05,0.000897,0.00049
0.003185,0.004154,0.00294,-0.001254,-0.00017,0.002382,0.002772,0.002249,0.000946,0.001649,0.001282,0.000391,-0.000558,-0.000346,0.000151,0.000113,0.000484,0.001205,-0.000957,0.000338,-0.000131,0.002293,0.00236,0.001349,0.000928,0.001982,0.000138,6.6e-05,0.001981,0.001346,0.00028,0.002856,0.002435,0.00012,-0.000852,0.003348,0.002485,0.00126,0.000529,0.001652,0.001387,0.000103,-9.5e-05,0.000109,0.00154,0.000821,0.003187,0.001532,0.001299,-0.000961,0.001194,0.000624,-0.00089,0.003033,0.00202,0.000386,0.00015,0.000156,0.001265,0.00135,0.001117,-0.000797,0.000934,-0.000352,0.001912,0.000959,0.000718,0.000929,0.000431,0.002052,0.001354,0.002623,0.002194,0.002779,0.001976,0.003216,0.001512,0.001329,0.000193,5.8e-05,-9e-05,0.001973,0.002373,0.000375,-0.000498,0.002146,0.000805,0.001147,0.002529,0.000348,0.000661,-0.001099,0.000624,0.00169,0.001135,0.002462,0.002496,0.001009,0.001934,0.001025,0.000891,0.001925,0.000826,0.001704,0.000443,0.001879,0.002029,-0.000351,-0.001056,0.001453,0.001431,0.000515,0.00034,-0.001083,0.000486,4.8e-05,0.000573,0.001249,2.7e-05,-0.00113,-8.1e-05
-0.002286,-0.001102,-0.002396,0.001122,0.000117,-0.001728,-0.000692,-0.000254,0.000134,-0.001582,0.000278,-0.000293,-0.001426,-0.000414,0.000435,0.000446,0.000195,-0.001166,-0.000281,-0.000926,0.00018,-0.000333,-0.000636,-0.001391,-0.001286,-0.001478,0.000696,-9.6e-05,-0.000496,-0.000646,0.000183,-0.000402,-0.001908,-0.000111,0.001243,-0.001156,-0.001046,-0.000727,-0.000227,-0.001106,-0.001071,0.003246,0.001925,-0.000329,0.000273,-0.000496,-0.002967,-0.002185,-0.002951,-0.000417,0.00033,-0.000158,-0.000506,-0.001399,-0.001727,-0.00039,-0.000321,9e-05,-0.000713,0.000366,0.000681,0.000474,-0.000276,6.3e-05,-0.000387,0.000737,0.000424,-0.001232,-0.00096,-0.001473,6.7e-05,-0.001777,-0.001542,-0.000534,-0.000725,-0.002714,-0.000562,-0.000706,-4.8e-05,-0.000446,0.000553,-0.001619,-0.002014,6.4e-05,0.000578,-0.001257,0.000271,-0.000863,-0.001729,-0.001359,0.000596,0.00125,-3.3e-05,-0.001222,0.000638,-0.000431,-0.000992,-0.001791,-0.002164,-0.00158,-0.000822,-0.001115,-0.000634,-0.001148,7.1e-05,-0.000668,-0.000764,-1.4e-05,-0.000211,-0.000882,-0.001067,-0.001025,4.4e-05,0.000738,-0.000315,0.000538,-0.000972,-0.001283,-0.000572,0.00056,-0.00022
-0.000377,-0.001488,0.000662,7.8e-05,-2.2e-05,0.001814,0.000859,-0.000758,-0.000208,0.002079,0.000268,-0.000262,0.000929,0.000676,-0.000546,0.000269,0.000656,0.000917,0.000366,0.000347,-0.001037,-0.00062,0.000353,0.002421,0.000551,0.000912,-0.000297,0.000215,0.00114,0.000484,-0.000365,0.001199,7.3e-05,0.000247,0.000196,-0.00082,-0.000729,-0.000978,-0.000353,-0.000236,-0.000336,-0.00328,-0.001488,0.000982,-0.001058,0.001062,0.0027,0.003064,0.004099,0.001889,-0.000178,-0.00015,0.000859,0.000365,0.000494,-0.000141,-5.2e-05,0.000128,0.000165,-0.000719,-0.000677,0.000156,0.001081,0.000154,0.000348,-0.000455,0.000249,0.001097,-0.000437,-0.000186,-0.000315,0.000529,0.000296,-0.000957,-0.000977,0.001585,-0.000386,3.2e-05,0.000604,-0.000316,-0.000558,0.000897,0.000874,-0.00029,-0.000278,0.000123,-0.000264,-0.000236,-3e-04,0.000839,-0.000902,-0.000619,-0.000343,-0.000409,-0.001288,7.7e-05,7.9e-05,0.001028,0.000749,0.000409,0.000617,-0.000348,-0.000377,-3.7e-05,0.000363,0.000185,-0.000477,0.000514,0.000343,-0.000249,-0.000934,-0.000149,-0.000736,0.000142,-0.000931,-0.000956,0.000918,0.00062,3e-05,-0.000922,-2e-05
0.001742,0.001,-0.00022,-0.000339,0.000832,-0.000998,-0.001768,-0.000858,3.4e-05,-0.000702,-0.000652,2e-04,0.000433,0.000319,0.000333,-0.000913,-0.000771,-0.000435,-0.000234,4.4e-05,0.000461,0.000323,-0.000568,-0.000789,0.000795,-0.00075,0.000422,-0.001215,-0.001293,-0.000169,0.000704,-0.000385,0.001218,-0.000219,-0.000315,0.000617,0.001218,0.000983,0.000833,0.000503,0.000663,0.001518,-0.000135,0.000243,0.000657,-0.000134,-0.001455,-0.001136,-0.001721,-0.001525,0.000322,0.000351,-0.001097,9.5e-05,0.000375,8.5e-05,0.00014,-0.000151,0.00047,0.000191,-0.000432,-0.000375,-0.000558,0.000147,-0.000909,0.000949,-0.000658,0.000393,0.001657,0.001178,-0.00056,-0.001439,0.000502,0.000757,0.002159,-0.000647,0.001484,0.000339,-0.000758,0.000262,0.000769,-0.000286,-0.000197,0.001089,0.000671,-0.000158,-4.2e-05,-8.1e-05,0.000324,1.4e-05,0.000417,0.000178,-0.000164,-0.000166,0.000298,-0.000336,-0.000268,0.000178,0.000402,0.000637,0.000118,0.001034,0.000128,-0.000445,-0.000473,-0.000741,0.000155,-0.000324,-0.000409,-1.9e-05,-3.8e-05,0.001566,0.000731,-0.001001,0.000378,0.000279,0.00035,-0.000113,0.000437,0.000993,-0.000116
-0.000266,0.000117,0.000936,-4.2e-05,-0.001549,0.000303,0.001373,0.000481,8.8e-05,-0.000131,6.6e-05,0.000244,-4e-04,-0.001312,0,0.001016,-0.000357,0.000497,-0.000183,0.000887,-3e-05,-0.000411,0.001147,-0.001245,-0.002134,3.6e-05,-0.000745,0.000983,0.001252,-0.000732,-0.000674,-0.000307,0.000386,9.4e-05,-0.000277,-0.000232,0.000401,7e-05,-0.000654,-0.000342,0.000635,-0.000443,0.000913,-0.00018,1.6e-05,-0.00057,0.000882,-0.000598,-0.00081,0.000576,-1.5e-05,-0.000729,-8e-05,0.00013,0.000208,0.000289,-0.000302,0.00046,-0.000173,-0.000167,-0.000102,-2e-04,-0.000791,-8.6e-05,0.000737,-0.001196,-0.000175,-0.000388,-0.000885,-0.000794,0.000797,0.001292,0.000205,-1.7e-05,-0.001643,-0.000123,-0.001178,7e-06,0.001083,5.3e-05,-0.000455,0.000251,-0.000427,-0.001281,-0.000871,0.000103,0.000208,0.000601,-3.8e-05,-0.000387,-0.000357,0.000485,1.4e-05,0.000712,0.000663,4e-05,0.001302,0.000739,-0.000117,-0.000294,0.000132,-0.00054,0.000232,0.000835,0.000146,0.000362,-5.4e-05,-9.1e-05,0.000272,7.8e-05,0.001016,-0.000631,0.000304,0.000178,0.001361,0.000204,-2.5e-05,4.4e-05,-0.000286,-0.000386,0.000549
-0.001017,0.000572,-0.001178,-0.000592,0.001177,0.000321,-5.2e-05,0.000363,0.000293,0.000306,0.000341,-0.00023,-0.000381,0.000957,4.3e-05,-0.00115,0.00013,-0.000378,-7.9e-05,-0.000835,-0.000184,0.000242,-0.00078,9.9e-05,0.001939,0.000574,0.000463,0.000745,-0.000827,0.000693,0.000754,-0.000384,-0.000565,-4.1e-05,-4.1e-05,0.000388,-0.000847,-0.000134,-0.000209,-0.000176,-0.001397,0.000236,-0.001118,-0.000446,0.000594,0.00057,-4.6e-05,-0.000311,0.000998,-0.000549,-0.000937,0.000543,0.000258,0.000213,0.000733,-0.000303,0.000253,-0.000644,-0.000263,0.000286,0.001087,0.000265,0.001366,0.000335,-0.000603,0.000236,0.001138,-0.000169,0.000647,0.000213,-0.000138,0.00016,-0.001143,0.000367,-8.3e-05,0.000623,0.000816,0.000332,9.7e-05,-1e-05,0.000307,0.000112,0.00052,0.000674,0.000431,-0.000278,-0.000421,-0.000328,-0.000339,-0.000747,-0.000294,-5.4e-05,0.000569,5.4e-05,-0.001147,0.000283,-0.000666,-0.001116,-0.000276,-1e-06,0.000244,0.000165,-9.2e-05,-0.000262,0.000184,0.000192,0.000124,0.000572,0.000262,-0.000137,-0.00052,-0.000287,-4e-04,0.000527,-0.00045,-0.000489,-0.000184,8.5e-05,0.000526,-9e-05,-0.000356
0.000747,-0.000744,0.000526,0.000613,-0.000763,-0.00064,-0.000564,-0.000185,-0.000873,-0.000434,-0.000411,9.3e-05,0.000619,-0.000808,9.8e-05,0.00024,0.000359,0.000462,0.000421,0.000795,0.000132,0.000113,-0.000297,0.000327,-0.000197,-0.000708,-0.00037,-0.001642,-7e-05,-3.6e-05,-0.000741,0.000709,-6.9e-05,-0.000578,0.000189,2.7e-05,0.000129,-0.000464,5.1e-05,3.2e-05,0.000491,-0.000993,0.000817,6.3e-05,-0.000644,0.000117,-0.001381,0.000309,-0.001244,0.000822,0.000885,-0.000353,0.000122,0.000352,-0.000651,0.000742,7.9e-05,-1.5e-05,2.3e-05,-0.000276,-0.000872,0.000193,-0.000888,-0.000561,0.000571,1.5e-05,-0.001138,-0.000277,-0.000712,-0.000207,-0.000516,-0.000502,0.000395,-0.000872,0.000342,-0.000405,-0.001667,-0.000595,-0.00033,-5.3e-05,-0.000768,0.000167,-0.000321,-0.000221,0.00022,0.00019,-0.000145,-0.000149,9e-05,0.000965,0.000287,-0.000504,-0.000301,-0.00026,0.000267,-0.000393,-0.000253,0.000523,0.000174,5.1e-05,-0.000683,7.9e-05,0.000415,-6.3e-05,-0.000555,-4e-04,-8.2e-05,0.000297,-0.000334,-4e-06,-6.5e-05,0.000121,0.000193,-0.000166,-9.6e-05,-3.2e-05,-0.000336,0.000269,-0.000566,0.00011,0.000419
0.000137,0.000847,0.000326,-0.000231,0.000553,0.000127,-0.00019,0.00022,0.000476,0.000372,0.00046,-0.000415,-0.000132,0.000212,0.000412,0.000432,-0.000446,-0.000582,-0.000163,-0.000242,-2.8e-05,-4.7e-05,0.000499,0.000602,-0.000232,0.00071,0.000148,0.000635,0.000337,0.000309,0.000279,-0.000227,-0.000548,0.000598,-0.000584,-0.000537,-0.000226,0.000369,0.000413,0.000239,0.000552,0.000728,-0.000491,0.000489,0.000292,-4.6e-05,0.00099,-0.000344,-2.1e-05,-0.000836,5e-06,0.00074,-7e-06,-3.2e-05,0.000388,-0.000612,-0.000116,0.000583,-0.000279,0.00015,-0.000394,0.000103,0.000173,0.000175,-0.000554,0.000258,0.000528,0.000488,0.000339,0.000305,0.000157,0.000403,0.000316,0.000728,0.000433,0.00063,0.00142,0.000426,-5.2e-05,-7.9e-05,0.000603,-2e-04,2.5e-05,0.000156,-0.000532,0.000294,-0.000129,-0.000141,0.000164,-0.000363,6.3e-05,-8.7e-05,-0.00017,-3.5e-05,0.000644,1.4e-05,-0.000481,-0.000134,-0.000128,6.4e-05,-0.000154,-0.000273,-0.000135,-5.7e-05,-7.6e-05,0.000339,-4.3e-05,-0.000593,4.9e-05,1e-04,0.000299,-3e-06,1.1e-05,-0.000156,-0.000255,0.000182,0.000587,-0.000131,0.000144,0.000173,-6.8e-05
-0.000289,-0.000718,-0.000254,0.000239,-4.8e-05,-0.000231,0.000557,-5.6e-05,0.000161,-0.000151,-0.000298,0.000785,0.000114,-0.000149,-0.000406,-0.000193,0.000447,0.000163,0.000109,-2.9e-05,0.000132,0.00018,-0.000264,-0.000394,7e-06,-0.000588,-1.1e-05,0.000177,-0.000634,-0.000283,-0.000194,-2.6e-05,0.000227,7.1e-05,0.000338,-0.000138,0.000196,0.000135,-0.000304,-0.000234,-0.00024,0.000244,0.00048,-0.000206,-0.000151,-0.000335,1e-06,0.000662,0.00097,0.000609,-0.000284,-0.000385,-0.00029,-0.00013,-5.4e-05,0.000551,-8e-06,-0.000366,0.000295,-7.7e-05,0.000873,-0.000158,-3.7e-05,-0.000128,0.00032,-0.000232,-8.7e-05,-0.000175,1e-04,-0.000118,0.000359,-0.00038,-0.000218,-0.000341,-0.000243,-0.000421,-0.000718,2.4e-05,0.000243,0.000382,-0.00034,0.000301,8.1e-05,5.7e-05,0.000109,-0.000492,0.000331,0.000116,-1.9e-05,0.000444,-0.000126,0.000225,0.000399,0.000101,0.000193,0.000287,0.000576,-7.6e-05,0.000161,-8.6e-05,0.000561,0.000382,-0.000266,0.000139,0.000338,3.1e-05,0.000335,-4.4e-05,-1e-06,-9.4e-05,0.000124,0.000269,-0.00016,0.000276,0.000424,0.000382,-3.9e-05,-0.000196,-0.000153,-0.000386,-0.000222
-0.000201,-9.4e-05,-0.000267,-0.00059,-3.7e-05,0.000448,-0.000208,-0.000146,0.000184,3.2e-05,0.000272,-0.000453,-0.000212,0.000374,0.000101,-6.9e-05,-0.000452,-2.6e-05,-0.00014,6.2e-05,0.000263,-0.000114,-0.000144,-2.4e-05,0.000242,-0.000112,9.5e-05,-0.000189,0.000414,-0.000192,0.000234,0.000313,0.000535,6.6e-05,9e-05,0.000478,0.000376,-0.000494,-0.000114,0.000106,-0.000137,-0.000374,-0.000411,-0.000115,-0.000486,0.000286,-0.000278,-0.000316,-0.000352,-0.000526,0.000142,-0.000109,0.000108,0.000109,-0.000372,-0.000399,0.000343,-0.000245,-0.000267,4.1e-05,-0.000457,-0.000288,-0.000276,3.3e-05,-3.2e-05,0.000184,-0.000483,-7.5e-05,-0.000283,-0.000124,-0.00057,0.000111,2e-06,-0.000132,-0.000219,-3.2e-05,0.000476,-0.000385,-0.000233,-0.00039,-0.000246,-0.000269,-0.000114,3e-06,0.000109,0.000237,-5.3e-05,5.6e-05,-9.1e-05,-0.000498,0.000183,-9.6e-05,-0.00033,7.4e-05,-0.000251,-0.000451,-0.000262,-0.000131,-0.00042,-0.000101,-0.000438,-0.000167,0.000211,-0.000182,-0.000123,-3e-05,2e-06,0.000184,-0.000137,0.000258,-0.000222,-0.000345,-0.000126,-5e-06,4.7e-05,-0.00038,-0.000292,-0.000194,0.000247,0.000159,0.000119
6.5e-05,0.000133,4.1e-05,0.000874,2.6e-05,-0.000254,4.5e-05,-0.000174,-0.000332,1.8e-05,-9.7e-05,0.000109,-1.5e-05,-4.7e-05,0.000101,0.000163,0.000434,8e-05,0.000102,-0.000335,-0.000198,-5e-05,3.3e-05,0.000256,-0.000505,0.000403,-1e-05,0.000231,0.000129,-0.000171,-0.000197,-0.00039,-0.000364,-0.000353,-4.3e-05,-0.00022,-0.000471,0.00044,8.5e-05,8.7e-05,0.000263,-0.000151,0.000344,-0.000107,0.000295,0.000184,0.000339,-1.2e-05,-2.2e-05,0.000527,1.9e-05,-9.9e-05,-3.4e-05,-0.000198,3.9e-05,-4.1e-05,-0.000421,0.00061,0.000141,-4.7e-05,5.5e-05,0.000394,0.000231,0.000112,-0.000101,-5e-05,0.000355,-9.5e-05,0.000234,-4e-05,0.000243,7.1e-05,-0.000111,1.1e-05,0.00031,0.000122,-0.000324,-2e-06,-6e-06,0.000189,0.000275,0.000153,9.2e-05,-7e-05,0.000132,0.000135,0.000165,9.4e-05,2.9e-05,0.000246,-0.000185,5e-06,3.9e-05,2.9e-05,6.9e-05,0.000251,0.000208,-3.6e-05,0.000452,0.000118,-2.6e-05,2.1e-05,-0.000129,-5.3e-05,4.7e-05,-0.000187,-0.000117,4e-05,-6.9e-05,-0.000194,0.000224,6.4e-05,0.000103,-0.000268,-0.000117,0.000202,5.2e-05,0.000161,-4e-06,0.000149,-0.000191
0.000311,7.6e-05,7.3e-05,-0.00025,4.5e-05,0.000147,0.000158,0.000107,4.8e-05,-1.5e-05,-7.1e-05,-0.000159,-2.3e-05,6.4e-05,-0.000138,-0.000124,-0.000205,-7e-05,-7.2e-05,0.000247,6e-05,3.3e-05,0.000138,-0.000211,0.000323,-0.000211,-4.5e-05,3.6e-05,-0.000142,0.000493,6.2e-05,0.000344,-0.000194,4e-05,-1.3e-05,0.000171,4.5e-05,-0.00023,0.000172,8.6e-05,-0.00022,0.00041,-0.000212,0.000211,0.00018,-0.000144,-0.000524,0.000217,-0.000108,-5.9e-05,-0.000109,0.000158,0.000336,9e-06,-5.2e-05,-1.2e-05,0.000184,-0.000358,6e-05,-2e-06,0.000232,-0.000178,-6e-06,-8.5e-05,5e-06,8.8e-05,0,0.00012,-2.5e-05,3.4e-05,-1.5e-05,1e-06,-3.9e-05,0.000266,4.1e-05,-7.3e-05,0.000247,0.000143,8.1e-05,-9.7e-05,-4.4e-05,0.000103,-0.000104,0.000194,-0.000418,-0.000183,-0.000171,8.7e-05,4.7e-05,-4e-06,0.000179,0.000183,-4e-05,-0.000116,-0.000242,-8e-06,-0.000107,0.00018,-0.000173,0.000106,0.000161,1.8e-05,6e-05,0.000135,-6.7e-05,0.000231,-6e-06,-0.000167,0.000257,-1.7e-05,4e-06,8.3e-05,-6.6e-05,0.000124,-9.5e-05,-0.000126,8e-05,-5e-06,4.6e-05,-0.000108,0.000116
-0.000126,-1e-05,8.1e-05,-0.000205,-9.4e-05,-6.5e-05,-0.000157,8.5e-05,-7.8e-05,-0.000138,0.000142,0.000168,0.000197,-8.7e-05,-1.6e-05,0.000107,-0.000104,2.6e-05,9.9e-05,-0.000138,-9e-06,-3.7e-05,-8.4e-05,-0.00021,-6.3e-05,0.000155,6.5e-05,-6.2e-05,-7.1e-05,-0.000314,-6.1e-05,-0.000364,0.000121,-2e-05,0.000107,8.6e-05,8.4e-05,0.000103,-8.6e-05,-0.000216,1e-05,-0.000199,0.000115,-5.3e-05,-0.000192,-3.6e-05,0.000578,-4e-04,0.000238,-0.000258,0.000171,-0.000135,-0.000137,2.7e-05,-7.8e-05,-0.000204,-6.6e-05,-4.5e-05,-7.8e-05,-9.6e-05,-4.6e-05,-0.000105,3.8e-05,5.3e-05,-5.1e-05,-0.000184,0.000115,6.1e-05,-6.7e-05,9.8e-05,3.8e-05,0.000117,0.000222,-0.000227,-6.9e-05,0.000114,-0.000137,-0.000146,-6.4e-05,2.1e-05,0.00023,-0.00018,0.000175,-0.000182,0.000334,1e-04,0.000103,-5.5e-05,1.3e-05,-8.3e-05,-0.000111,-3e-05,2.7e-05,9.2e-05,1.4e-05,2.2e-05,5.3e-05,8.2e-05,6.8e-05,-9.2e-05,8.1e-05,2.3e-05,8e-06,-7.3e-05,8.3e-05,-3.7e-05,-6.8e-05,1.3e-05,-3.1e-05,2e-05,-8.9e-05,4.9e-05,7.8e-05,6e-05,-1.6e-05,2.4e-05,-0.00012,7.6e-05,-4.5e-05,-5.8e-05,-5.7e-05
-9.5e-05,6e-06,-3e-06,6e-05,0.00014,1.2e-05,-1.7e-05,5.5e-05,0.000132,4e-06,-7.4e-05,-0.000168,-0.000184,0.000172,3.7e-05,-0.000102,0.000277,8e-05,-8.6e-05,4.6e-05,-6.1e-05,6e-06,9.3e-05,-2.3e-05,0.000246,0.000119,-8.4e-05,-0.000135,0.000229,0.000134,4.6e-05,7.3e-05,-9.6e-05,7.2e-05,-6.2e-05,-0.000247,8.4e-05,4.7e-05,-4.1e-05,3.1e-05,0.000206,-0.000105,-7.4e-05,2.2e-05,9e-06,4.1e-05,-0.000436,9.6e-05,-6.2e-05,0.000214,6.7e-05,0.000143,-0.000101,-4.5e-05,6.4e-05,0.000268,5e-05,7e-05,1e-05,3.1e-05,-0.00023,9.1e-05,0.000121,-5.4e-05,0.000138,0.000108,-3.8e-05,-4.3e-05,1.5e-05,-7e-05,-0.000128,-0.000125,-0.000172,4.7e-05,-0.000103,-7.2e-05,0.000274,9e-05,-6.4e-05,6.1e-05,-9.6e-05,6.1e-05,-0.000196,0.000119,-8.7e-05,-3.4e-05,-3.2e-05,-6.5e-05,1e-05,-2.4e-05,-4.5e-05,-0.000137,7.2e-05,-8.4e-05,7.7e-05,0.000137,6.1e-05,-7.9e-05,8e-06,-4.5e-05,-0.000169,-8.8e-05,-6.8e-05,6.3e-05,-1.6e-05,2.8e-05,-1e-05,8e-05,-3.1e-05,-6.3e-05,6.2e-05,-2e-06,-9e-06,-0.000125,8e-06,-1.3e-05,-9.6e-05,-0.000108,-3.4e-05,0.000126,1e-05
-2.6e-05,-0.000142,-0.000119,9.5e-05,-5.4e-05,7.3e-05,9.7e-05,6e-05,-3.2e-05,1e-04,8e-06,0.000176,6.7e-05,-2e-04,3e-06,4.5e-05,-0.000105,-6.7e-05,5.4e-05,-8.8e-05,2.3e-05,1.4e-05,-3e-05,0.000124,-0.000111,-0.000101,6.9e-05,0.000194,-5.3e-05,4.1e-05,-1.1e-05,0.000115,0.000146,0.000134,-1.1e-05,0.000174,0.000127,-8.9e-05,-5e-06,9.9e-05,-0.000267,0.00025,8.6e-05,-0.000105,6.1e-05,-5e-06,0.000239,9.4e-05,-0.000242,-6.7e-05,-0.00016,8.2e-05,-6.7e-05,-1e-05,-9.1e-05,-0.000106,-3.2e-05,3.3e-05,3.7e-05,-7e-06,-2.5e-05,9.4e-05,-0.000151,6.8e-05,-0.00011,-8.2e-05,-0.000118,8e-06,3.7e-05,4.4e-05,0.000104,9e-06,-1e-06,-8.5e-05,3.9e-05,-3.2e-05,-0.000253,-7.9e-05,3.5e-05,-4.3e-05,-1.4e-05,-7.6e-05,0.000142,-8e-05,3.6e-05,-6e-05,4.3e-05,-5.3e-05,-1.2e-05,7e-06,2.1e-05,0.000127,-5.2e-05,7e-06,-3e-06,-1.8e-05,4.6e-05,-3.9e-05,-6.4e-05,3.6e-05,0.000107,6.9e-05,3.5e-05,4.6e-05,1.7e-05,-2.8e-05,6.6e-05,-7.7e-05,-6e-05,8.2e-05,-0.000119,-1.9e-05,-5.8e-05,7e-05,0.000106,4.5e-05,5.3e-05,-1e-05,1.9e-05,-5.8e-05,-2e-05
7.9e-05,9.3e-05,0.000186,-1e-05,-3.4e-05,-9.4e-05,-1e-04,-1.1e-05,1e-05,-1.5e-05,2.7e-05,-0.000117,1.7e-05,7.3e-05,-3.6e-05,-2.2e-05,1.5e-05,7.7e-05,-4.3e-05,6.4e-05,2.1e-05,2.1e-05,0,6.3e-05,-9.1e-05,2e-05,-8.5e-05,-4.2e-05,-0.000192,-6.5e-05,2e-05,-0.000159,4.4e-05,-8.4e-05,-1.2e-05,1.1e-05,-0.000175,-3.2e-05,7.4e-05,-7.4e-05,0.00014,-0.000183,-7.3e-05,2.1e-05,-4.5e-05,-7.4e-05,-0.000112,5e-06,0.000158,6.4e-05,6.3e-05,-0.000152,0.00011,-6.4e-05,6.8e-05,7e-06,-2.2e-05,-1.6e-05,-1.7e-05,8.5e-05,0.000121,-8e-05,0.000116,-1.1e-05,2.5e-05,7.1e-05,0.000114,1e-06,-1.1e-05,-2.7e-05,-6e-05,1e-06,-6e-06,3.5e-05,4.6e-05,7e-05,6.2e-05,6.4e-05,-1.9e-05,-2.2e-05,-5.9e-05,8.1e-05,-9.8e-05,4.9e-05,-7.3e-05,3.4e-05,-7.5e-05,2.7e-05,-1.4e-05,7.1e-05,6.4e-05,-1.7e-05,-8e-06,3.4e-05,1.3e-05,-2e-05,2e-06,6.2e-05,4.7e-05,3e-06,-1.9e-05,-7.5e-05,-4e-06,-9.7e-05,-9.8e-05,1e-05,-1.8e-05,-7e-06,4.4e-05,-2e-06,6.1e-05,-1.5e-05,3.2e-05,7e-06,-4.1e-05,-5.5e-05,-3.4e-05,4.1e-05,1.3e-05,-1e-06,9e-06
3.5e-05,-1.7e-05,-0.000189,-5.6e-05,1e-05,9.6e-05,-3.6e-05,-6.4e-05,-5.7e-05,-2.5e-05,-8e-05,2.4e-05,-2.7e-05,-9.6e-05,8e-06,-4.2e-05,-3.8e-05,-7.9e-05,5.4e-05,-3.6e-05,-1.3e-05,-3.2e-05,1.2e-05,-4e-05,-6e-06,-4.9e-05,9.6e-05,-0.000153,0.000177,8e-06,6e-06,0.000133,-0.000168,-4e-06,-3.6e-05,-0.000124,-1.9e-05,0.000125,1.5e-05,1.1e-05,5.5e-05,6.2e-05,1.3e-05,0.000108,4.8e-05,-2e-06,2.4e-05,4.5e-05,-3.1e-05,-0.000107,7e-06,7.5e-05,3.5e-05,3.3e-05,5e-06,-3e-06,2.3e-05,-3e-06,4e-06,1.2e-05,2.3e-05,-4.9e-05,-2.8e-05,-2e-05,1.7e-05,-5e-05,-0.000145,5e-06,2.7e-05,2.8e-05,-1.2e-05,-3e-06,7e-05,-6e-06,-3e-06,-5.7e-05,-8.5e-05,3.6e-05,4e-06,3.2e-05,3e-05,-0.000106,8.7e-05,6e-06,6.3e-05,1.8e-05,2.2e-05,5.2e-05,7e-06,-4.1e-05,-7.7e-05,-5.1e-05,2.4e-05,-2e-05,2e-05,-6e-06,-0.000111,5.9e-05,-3.8e-05,-2.1e-05,4e-06,8.7e-05,-9e-06,-1.9e-05,8.3e-05,2.4e-05,3.6e-05,5.9e-05,-3e-06,-1.4e-05,-4.4e-05,5.5e-05,1.7e-05,-1.8e-05,-8.9e-05,6.9e-05,0.000129,-2.3e-05,1e-06,-1e-06,4.5e-05
-7.9e-05,1.8e-05,0.000106,4.6e-05,-5e-05,-0.000103,0.000142,-2.3e-05,5e-06,1.4e-05,5.3e-05,1.6e-05,3.3e-05,7.1e-05,-2.1e-05,9.9e-05,5e-06,6.3e-05,-3.1e-05,2.3e-05,5e-06,-3e-05,-7e-06,1.4e-05,9.9e-05,5.5e-05,-0.000102,0.000175,-6.5e-05,5.1e-05,-1.2e-05,-3.1e-05,4.6e-05,1.6e-05,1.3e-05,0.000124,7.3e-05,-1.8e-05,-6e-05,3.6e-05,-0.000149,1.2e-05,0,-8e-05,-4e-06,4e-05,2.2e-05,-0.000101,-6.5e-05,0.000115,-8e-05,-7.4e-05,-4.1e-05,3.5e-05,-3.6e-05,-9e-06,1.9e-05,-3.1e-05,-7e-06,-3e-06,-6.7e-05,3.2e-05,-7.7e-05,2.2e-05,-7e-06,5.7e-05,8.7e-05,1.7e-05,-8.1e-05,-1.8e-05,3.5e-05,6.6e-05,8e-06,3.5e-05,-4.9e-05,3.2e-05,0.000156,-6.5e-05,4.2e-05,-5e-06,6.6e-05,4.2e-05,-6.7e-05,-1.3e-05,3.6e-05,-2.8e-05,-1.8e-05,1e-05,5e-06,-4e-06,5.5e-05,0,-4.5e-05,-2.1e-05,4.6e-05,-5.7e-05,3.5e-05,-5.7e-05,3.3e-05,2e-06,0,-4.8e-05,-1e-06,7e-05,-4.4e-05,-5.9e-05,-3e-06,2.8e-05,1.5e-05,-2e-06,3.3e-05,-2e-06,-2.7e-05,-1.5e-05,2.8e-05,-6e-06,-4.7e-05,5.5e-05,-2.8e-05,-8e-06,-3.5e-05
-7e-06,4.1e-05,-6.5e-05,-4.7e-05,7.9e-05,3.2e-05,-0.00012,-1.9e-05,4.2e-05,4.6e-05,-1.7e-05,7e-06,-2.7e-05,-2.7e-05,1.2e-05,-6.5e-05,6.4e-05,-4.8e-05,4.3e-05,9.7e-05,0,1.6e-05,0,2.2e-05,-0.000117,-4.8e-05,0.000124,-6.4e-05,-8.4e-05,-1.9e-05,8e-06,-4.5e-05,7e-06,-1.2e-05,-2.3e-05,-5.6e-05,-3.5e-05,-8e-06,0,-2.4e-05,8.9e-05,6e-05,7e-06,5e-06,-7e-06,-5e-06,2.4e-05,9.8e-05,0.000109,-9.1e-05,3.3e-05,2.1e-05,-1.1e-05,-3e-05,5.9e-05,0.000106,-4e-05,2.7e-05,-5e-06,-4e-05,0.00013,5.5e-05,9.2e-05,-1.1e-05,-9e-06,-1.6e-05,5.2e-05,-3.8e-05,9.5e-05,3e-06,1.2e-05,-4e-05,-2.2e-05,-1.8e-05,1.8e-05,7e-06,-0.000176,5.9e-05,1.3e-05,-1.4e-05,-9.4e-05,-1.5e-05,2.1e-05,-1.6e-05,-5.6e-05,2.3e-05,4.8e-05,-8e-06,-1.5e-05,-3e-05,-9e-06,4.2e-05,4.9e-05,-3e-06,-8.1e-05,-1.9e-05,-1.3e-05,7e-06,-3.9e-05,2.2e-05,1.2e-05,1.1e-05,4e-06,1.4e-05,5.2e-05,4.7e-05,-9e-06,-5e-05,-5e-06,5e-06,-6e-06,-2.3e-05,3.2e-05,8e-06,1.5e-05,2e-06,-6.2e-05,9e-06,-7e-06,8e-06,3.8e-05
2.4e-05,-3e-05,4.1e-05,7.6e-05,-3.6e-05,1e-05,1e-05,2.8e-05,2.9e-05,-5.1e-05,-1.1e-05,-3.4e-05,-2.1e-05,1.2e-05,-6e-06,4.5e-05,-5.7e-05,4.6e-05,-4e-05,-8.9e-05,-5e-06,9e-06,-4.6e-05,-2.7e-05,7.6e-05,1.1e-05,-0.000132,-6.1e-05,3.6e-05,7e-06,6e-06,8.2e-05,2.9e-05,-6e-05,2.3e-05,-4.4e-05,2.7e-05,3.6e-05,2.3e-05,1.6e-05,2.3e-05,-0.000148,5e-06,-3.4e-05,-3.5e-05,-1.8e-05,-5.7e-05,-8.2e-05,5e-05,3.7e-05,1.1e-05,2.5e-05,2.3e-05,1.5e-05,-1.6e-05,-8.2e-05,9e-06,3.3e-05,2e-06,-2.1e-05,-6.9e-05,-4.5e-05,-7.6e-05,-1.6e-05,-1.2e-05,3.4e-05,-0.000117,9e-06,-4.9e-05,-1.5e-05,-4.1e-05,-1e-05,-4.3e-05,2.6e-05,2.1e-05,-1.2e-05,0.000121,-4.9e-05,-8e-06,2.2e-05,-1.7e-05,-4e-06,2.2e-05,2.7e-05,-2e-06,-3e-06,-1.3e-05,-3.6e-05,-1e-06,6.2e-05,-6e-06,-6.1e-05,-1.1e-05,1.5e-05,-1e-05,2.2e-05,3.6e-05,-4.5e-05,3.8e-05,-1.3e-05,-6e-06,-9e-06,-1.9e-05,-1.8e-05,-4.1e-05,-2e-06,-1.8e-05,-2.8e-05,-7e-06,-1.4e-05,-2e-06,-2e-05,-5e-06,2.4e-05,1.9e-05,-1.7e-05,8e-05,-3.1e-05,-6e-06,1.7e-05,-2.9e-05
5e-05,-3.5e-05,7e-06,-5.2e-05,-8e-06,-2.1e-05,0.000134,3e-05,-5.6e-05,5e-06,3.4e-05,-1.4e-05,2e-05,2e-06,-4e-06,-5.1e-05,3e-06,-3e-05,3.6e-05,8.5e-05,-7e-06,8e-06,1.6e-05,-3.9e-05,3.3e-05,2e-06,0.000112,0.000102,8.9e-05,-4.6e-05,1.4e-05,-9e-05,4.2e-05,2.4e-05,1.2e-05,6.7e-05,-1.6e-05,-8e-05,1.1e-05,-2.7e-05,-9.7e-05,0.000151,-7e-06,6.2e-05,2.7e-05,0,7.1e-05,-2.2e-05,-9.4e-05,1.7e-05,-1.3e-05,-2e-06,-1.9e-05,-5e-06,-7e-06,5.8e-05,5e-06,-4.5e-05,-1e-06,2e-06,-9.5e-05,-2.4e-05,-6e-06,2.5e-05,4.6e-05,-4e-05,7.1e-05,8e-06,-1.1e-05,3.3e-05,3e-05,-3e-06,3.1e-05,-3.6e-05,-8e-06,2.2e-05,-6.7e-05,5.1e-05,1.4e-05,-3.4e-05,6.3e-05,2.8e-05,-3.2e-05,-5e-05,1e-06,-2.3e-05,2e-06,7e-06,9e-06,-2e-05,-5e-06,1.7e-05,-1.8e-05,1.8e-05,-1.3e-05,-3.5e-05,-2.4e-05,2.4e-05,-1.3e-05,-1.5e-05,-2e-05,-1.5e-05,1.3e-05,6e-06,1.9e-05,1.8e-05,1e-06,3.9e-05,5e-06,1.6e-05,2e-06,6e-06,-1.8e-05,-3.7e-05,6e-06,-2.7e-05,-1.9e-05,-6e-06,1.3e-05,-5.3e-05,1.1e-05
-5.1e-05,6e-06,2e-05,-2.3e-05,-9e-06,4e-05,-9.8e-05,9e-06,-3.1e-05,1.3e-05,-2.3e-05,1.9e-05,1.5e-05,4.2e-05,9e-06,4.8e-05,4.7e-05,2.1e-05,-3.2e-05,-4.3e-05,1.1e-05,-1.3e-05,-1.2e-05,-6e-06,-7e-06,-2.8e-05,-1e-04,-3.4e-05,-7.6e-05,4e-06,-2.3e-05,5.1e-05,-6.2e-05,2.9e-05,-1.8e-05,-1.4e-05,-5e-05,4.4e-05,-2.1e-05,4e-05,7.4e-05,-9e-05,1.6e-05,-7e-06,0,1.9e-05,-7.1e-05,-3.3e-05,-2.1e-05,-4.1e-05,4.1e-05,2.5e-05,-2e-05,2.6e-05,2.4e-05,-5.9e-05,5e-06,1e-06,-1e-06,3.2e-05,8.3e-05,3.1e-05,3.7e-05,7e-06,-4.3e-05,2.4e-05,-1.1e-05,-6e-06,3.5e-05,-1.2e-05,0,-1.5e-05,2.2e-05,2.9e-05,-2.5e-05,-2.6e-05,9.1e-05,-4e-05,2e-05,2.1e-05,-4.5e-05,-4.9e-05,1.4e-05,4.5e-05,3.4e-05,-1.2e-05,-1.7e-05,8e-06,-1e-06,-1.2e-05,-1.2e-05,2.7e-05,3.3e-05,-6e-06,1.1e-05,4.8e-05,2e-06,3e-05,2.8e-05,6e-06,2.5e-05,1e-05,4e-06,-2.4e-05,-1.9e-05,-3.4e-05,-1.6e-05,1.4e-05,3e-06,-4e-06,-1.5e-05,6e-06,2e-05,2e-05,-3.8e-05,1.6e-05,-1.4e-05,-2e-06,1e-06,2.8e-05,-5e-06
-8e-06,-8e-06,-5.3e-05,4.6e-05,6e-06,-3e-05,-2e-05,-4e-06,2.9e-05,1.6e-05,-2e-06,-1.6e-05,-1.2e-05,-6e-05,4e-06,-3.6e-05,-1.9e-05,-7e-06,2.4e-05,-2.4e-05,-1.3e-05,0,5e-06,5.2e-05,-5.7e-05,1.7e-05,7.4e-05,-1.7e-05,-1.1e-05,4.3e-05,1.6e-05,6e-06,-1.7e-05,3.4e-05,1.3e-05,-3.8e-05,5.1e-05,9e-06,-2e-06,-4.3e-05,4e-06,6.2e-05,-2.3e-05,-2.6e-05,-7e-06,-7e-06,6.3e-05,7.1e-05,6.7e-05,1.8e-05,1.2e-05,-3e-06,6e-06,-9e-06,-2.2e-05,7.7e-05,-1.4e-05,1.9e-05,2e-06,1.5e-05,1.6e-05,2.1e-05,-5.1e-05,-2.5e-05,3e-05,-3e-05,-2.6e-05,8e-06,-1.3e-05,-7e-06,-2.4e-05,3.4e-05,-6e-06,-1e-05,6e-06,5e-06,-6.3e-05,4.1e-05,-2e-05,4e-06,5.6e-05,6.2e-05,-2e-06,-4.7e-05,-6.7e-05,5e-05,1.3e-05,1.5e-05,-8e-06,-1e-06,1.1e-05,-6e-06,-3.2e-05,7e-06,3.1e-05,5e-06,-2.5e-05,-3.6e-05,-1.3e-05,9e-06,-6e-06,1.8e-05,-8e-06,-3e-06,2.5e-05,2.1e-05,2.1e-05,-1.8e-05,-1e-06,-1.9e-05,4e-05,5e-06,-1.1e-05,1e-05,1.5e-05,-1.3e-05,0,-1.4e-05,0,2.1e-05,1e-06
2e-06,3.1e-05,-8e-06,2.2e-05,8e-06,2.6e-05,6.1e-05,-2.3e-05,3.1e-05,-2.1e-05,1.3e-05,5e-05,1.8e-05,5e-05,-4e-06,5e-06,-2.8e-05,-9e-06,-2e-05,4e-06,6e-06,2e-05,-6e-06,2.1e-05,4e-06,1e-06,-5.9e-05,6e-06,9.2e-05,-2.6e-05,-2e-05,-4.8e-05,2.3e-05,-2e-05,-5e-06,6.3e-05,9e-06,1e-06,4e-06,1.2e-05,-7.2e-05,-7.9e-05,1.6e-05,-8e-06,1.5e-05,-1.7e-05,-3.9e-05,1.1e-05,-3.2e-05,-8e-06,-3.3e-05,-5.4e-05,3.3e-05,-1.1e-05,6e-06,-7.8e-05,1e-05,9e-06,-5e-06,2e-06,-5.4e-05,-2.1e-05,5.8e-05,6e-06,-1.5e-05,2e-05,4.1e-05,-4e-06,-2e-05,-1.2e-05,1.5e-05,-2e-06,-2.1e-05,-4e-06,1.4e-05,5e-06,1.7e-05,-4.8e-05,1.7e-05,-9e-06,-2.8e-05,-5.4e-05,5e-06,2.4e-05,5.3e-05,-1.8e-05,-1e-05,-6e-06,-2e-06,1.9e-05,1.6e-05,-1.7e-05,1.1e-05,-1.2e-05,1.6e-05,-2e-06,3.5e-05,8e-06,7e-06,-1e-06,-9e-06,-2e-05,1.3e-05,3.8e-05,-2.4e-05,0,2e-06,-6e-06,-5e-06,2.7e-05,-3.1e-05,-1.7e-05,-5e-06,-2.6e-05,-1e-06,2.5e-05,-1.9e-05,3.6e-05,-1.1e-05,-2.5e-05,1.1e-05
2.1e-05,3e-06,3.9e-05,-6.4e-05,1e-05,-1.2e-05,-3.2e-05,-1e-05,-1.3e-05,-1.2e-05,-1.1e-05,-5.4e-05,-1.4e-05,-4.5e-05,5e-06,1.4e-05,1.6e-05,2.5e-05,1.5e-05,2.1e-05,3e-06,-1.2e-05,9e-06,-9e-06,-2e-06,3e-06,4.9e-05,2.3e-05,-6.2e-05,4e-06,2.7e-05,6.8e-05,1.4e-05,1e-06,-1.1e-05,-2.5e-05,-1.6e-05,-2e-06,1.7e-05,1.8e-05,7.4e-05,0.000101,-1.7e-05,1.4e-05,4e-06,1.1e-05,1.2e-05,-1.1e-05,-3.9e-05,1.7e-05,-3e-06,2.8e-05,7e-06,1.4e-05,-8e-06,3.5e-05,-3e-06,-3.9e-05,0,-1.4e-05,7e-06,-2.9e-05,-1.2e-05,1.4e-05,4e-06,-1.9e-05,-2.4e-05,-2e-06,1.8e-05,0,0,-8e-06,7e-06,-4e-06,3e-06,-7e-06,-2.5e-05,2.6e-05,-6e-06,4e-06,1.6e-05,4e-05,-1e-06,-8e-06,-1e-05,-2.4e-05,-1e-05,-2.4e-05,2e-06,-1e-06,-2.8e-05,2.3e-05,1.2e-05,-3e-06,2e-06,2.9e-05,1.6e-05,8e-06,-3e-06,-9e-06,-1e-06,1.9e-05,-4e-06,-2e-06,1.3e-05,-1.5e-05,9e-06,2.4e-05,5e-06,-2e-05,1.8e-05,7e-06,1.4e-05,1.2e-05,9e-06,-8e-06,2e-05,-1.4e-05,2e-06,-1.3e-05,-1.3e-05
4e-06,-5e-06,-2.5e-05,1.9e-05,-2.9e-05,0,-3.3e-05,-2e-06,-8e-06,7e-06,2e-06,3.5e-05,-5e-06,3.4e-05,3e-06,-1.1e-05,-4e-06,-2.6e-05,-9e-06,-1.1e-05,0,-2.4e-05,5e-06,-4e-06,4e-05,6e-06,-4.2e-05,-1.4e-05,1e-06,2.9e-05,-2.6e-05,-4.8e-05,1e-05,-5.3e-05,1e-05,-4.3e-05,2.3e-05,4e-06,-1.4e-05,-2.2e-05,-6e-06,-7.6e-05,2.1e-05,2.8e-05,-1.5e-05,1e-05,6e-06,1.9e-05,1.3e-05,-1.9e-05,-3e-06,-1.3e-05,-3.2e-05,6e-06,-1.2e-05,-2.9e-05,1.4e-05,3.2e-05,3e-06,-1.8e-05,3.8e-05,3.2e-05,-1.2e-05,-3e-06,1.4e-05,1.5e-05,3.5e-05,3e-06,0,9e-06,-8e-06,-2e-06,1.6e-05,1.3e-05,-1.1e-05,1.1e-05,3.8e-05,-2.1e-05,-9e-06,-4e-06,-8e-06,-2e-05,-1.4e-05,-8e-06,5e-06,3.7e-05,7e-06,-8e-06,0,-1.1e-05,2.1e-05,-2e-06,-2e-05,9e-06,-2.6e-05,-2.1e-05,-2e-06,1.1e-05,-2.1e-05,-4e-06,1.5e-05,-1.9e-05,-7e-06,-2.1e-05,-1e-05,1e-05,-3e-06,-2.7e-05,1e-06,1.2e-05,-1.8e-05,5e-06,-6e-06,1e-06,1.7e-05,2.2e-05,-6e-06,-6e-06,2e-06,3.1e-05,1.8e-05
-2.7e-05,-1.1e-05,3.6e-05,4.5e-05,1.5e-05,2e-06,1.3e-05,1.1e-05,-1.6e-05,9e-06,6e-06,-5.7e-05,7e-06,-2.8e-05,0,-7e-06,1.5e-05,3e-05,6e-06,-1e-05,-1e-06,1.8e-05,-1e-06,-3e-06,-1.6e-05,1.2e-05,3.3e-05,-2.5e-05,1e-05,-3.3e-05,2.1e-05,1e-05,-2.9e-05,2.3e-05,-5e-06,7.2e-05,-3e-05,-2.2e-05,-7e-06,1.2e-05,-5.8e-05,2.9e-05,-2.2e-05,-3.1e-05,4e-06,-6e-06,-1.1e-05,-1.7e-05,5.7e-05,1.4e-05,-1.2e-05,1.5e-05,-5e-06,0,1.1e-05,1.5e-05,-1.6e-05,-2.2e-05,-5e-06,1e-06,-1.3e-05,1.8e-05,4.6e-05,-1.3e-05,-1.9e-05,-3e-06,-3.2e-05,-2e-06,-5e-06,-1e-06,2e-06,-1.3e-05,3e-06,-1.6e-05,0,-7e-06,-4.9e-05,1.1e-05,-8e-06,1e-06,-6e-06,1e-05,2.3e-05,3e-06,-3.3e-05,-4.6e-05,7e-06,5e-06,3e-06,-1.5e-05,-3e-06,-2.5e-05,1.6e-05,-4e-06,4e-06,1e-06,-1.1e-05,-1.7e-05,1.1e-05,3e-06,-1.9e-05,5e-06,-2e-06,4e-06,8e-06,-1e-06,-5e-06,-4e-06,-1e-06,4e-06,5e-06,1.3e-05,-6e-06,1e-06,-3.4e-05,-2.1e-05,-1.2e-05,-2e-06,8e-06,-1e-05,-1.5e-05
1.8e-05,-1.6e-05,-4e-05,-4.1e-05,-9e-06,-4e-06,2.3e-05,1.5e-05,7e-06,-8e-06,-6e-06,6.7e-05,-1e-06,5e-06,4e-06,2.5e-05,-2.2e-05,-3.3e-05,-2e-06,1.7e-05,5e-06,1.3e-05,8e-06,-1.8e-05,1.3e-05,-2e-05,-2.1e-05,5.2e-05,4e-06,1.6e-05,-2.4e-05,1.9e-05,1e-06,2e-06,-1e-06,-4.9e-05,-3e-06,6e-06,3e-06,1e-06,5.6e-05,-1.2e-05,2.2e-05,2e-06,4e-06,-5e-06,1.3e-05,-7e-06,-2.9e-05,-9e-06,8e-06,1.5e-05,1.4e-05,-1.8e-05,-1.3e-05,8e-06,0,2.5e-05,1e-06,5e-06,-1.3e-05,-3e-05,-4.9e-05,6e-06,1.8e-05,1.3e-05,-1.1e-05,4e-06,-4e-06,-1e-06,9e-06,1.6e-05,-1.6e-05,5e-06,9e-06,0,2.7e-05,4e-06,-3e-06,3e-06,2.4e-05,-7e-06,-1.8e-05,-4e-06,3.2e-05,1.5e-05,6e-06,2.5e-05,1e-06,2.2e-05,-1.3e-05,1.5e-05,-7e-06,-3e-06,-1.3e-05,2e-06,-1.3e-05,1e-06,-1.2e-05,6e-06,9e-06,9e-06,1e-06,2e-06,-4e-06,1.2e-05,-1e-05,1.9e-05,-3e-06,-1.5e-05,2e-06,-1e-05,8e-06,-4e-06,6e-06,1.2e-05,9e-06,-9e-06,0,-6e-06,3e-06
-9e-06,1e-05,3.6e-05,3e-06,1.3e-05,-5e-06,-2.4e-05,0,2e-05,-2e-06,1e-06,-5e-05,-2e-06,6e-06,-2e-06,-1.5e-05,-4e-06,3.2e-05,0,-4.7e-05,-6e-06,-9e-06,-5e-06,-2e-05,-6e-06,7e-06,7e-06,-4e-05,-3.3e-05,-5e-06,2.1e-05,-3.1e-05,3e-06,2.8e-05,6e-06,-2e-06,3.6e-05,3e-06,9e-06,1e-06,-7e-06,1.7e-05,-1.8e-05,-2e-06,-6e-06,7e-06,-9e-06,-2.5e-05,-1.9e-05,2e-06,3e-06,4e-06,2.2e-05,9e-06,1e-06,-4.2e-05,2e-06,-1.3e-05,1e-06,1.4e-05,2.4e-05,-1.2e-05,1.7e-05,4e-06,-1e-05,-1.5e-05,2.6e-05,1e-06,5e-06,1e-06,-1.3e-05,3e-06,-1.2e-05,1e-06,0,2e-06,-1.2e-05,-1e-05,0,-1e-06,-5.1e-05,1e-06,6e-06,-1e-05,6e-06,2.8e-05,-5e-06,1.2e-05,-2e-06,-2e-06,8e-06,7e-06,-2e-06,-7e-06,-1e-06,-2.4e-05,2e-06,2e-06,7e-06,1e-06,1e-06,-6e-06,6e-06,-6e-06,3e-06,-2e-05,3e-06,1.4e-05,2e-06,1.1e-05,-3e-06,1e-06,-7e-06,1e-06,9e-06,-2.4e-05,-5e-06,1e-05,0,2e-06,-2e-06
6e-06,1.5e-05,-3.7e-05,6e-06,-3e-06,-4e-06,1.6e-05,-1e-06,0,1e-06,1e-06,3.8e-05,7e-06,-2e-06,1e-06,-3e-06,2.3e-05,-2.9e-05,1e-06,3.4e-05,1e-06,1e-06,2e-06,5e-06,-1.2e-05,1.4e-05,4e-06,-1.1e-05,7e-06,-7e-06,-1.8e-05,2.1e-05,3e-06,-1.1e-05,-5e-06,4.5e-05,-1.8e-05,-9e-06,-4e-06,-6e-06,-3.7e-05,-3e-05,1.4e-05,2.3e-05,1e-06,2e-06,6e-06,4e-06,7.4e-05,4e-06,1e-06,-3.1e-05,-1.2e-05,3e-06,8e-06,5e-05,0,-1.1e-05,-4e-06,-3e-06,-9e-06,3e-05,1.1e-05,-9e-06,7e-06,1.2e-05,-3.3e-05,-4e-06,6e-06,2e-06,6e-06,-4e-06,1.1e-05,3e-06,-5e-06,-3e-06,1.6e-05,1.7e-05,-5e-06,-3e-06,3.8e-05,1.4e-05,-1e-06,1.8e-05,-8e-06,-2.5e-05,1e-05,-6e-06,0,-1e-06,0,-1.5e-05,1e-05,0,8e-06,4e-06,1e-06,-3e-06,-2e-06,-7e-06,-1e-06,7e-06,2e-06,9e-06,0,1.1e-05,-1e-06,-1.8e-05,-2e-06,-7e-06,1.4e-05,-4e-06,0,6e-06,5e-06,9e-06,7e-06,1.3e-05,-4e-06,4e-06,-4e-06
-6e-06,1e-06,2.3e-05,1e-06,-7e-06,1.2e-05,1.7e-05,-1e-05,-2.1e-05,4e-06,-6e-06,-3.9e-05,-4e-06,-6e-06,1e-06,9e-06,-1.5e-05,2.7e-05,-5e-06,7e-06,1e-06,-8e-06,-8e-06,1.9e-05,-2e-05,-2.7e-05,-1.3e-05,3.6e-05,3.7e-05,1.1e-05,1.8e-05,-4e-06,1e-05,2.1e-05,2e-06,-4.7e-05,-1.3e-05,9e-06,-4e-06,-4e-06,4.7e-05,1.7e-05,-1.5e-05,-1e-05,2e-06,-6e-06,-9e-06,2.2e-05,-7.3e-05,-5e-06,8e-06,1.9e-05,-2e-05,-4e-06,-8e-06,-3.7e-05,1e-06,8e-06,2e-06,-6e-06,-3.1e-05,5e-06,-4.2e-05,6e-06,-1e-05,-1.5e-05,3.7e-05,-3e-06,-1.7e-05,-3e-06,2e-06,3e-06,1e-06,-7e-06,-2e-06,3e-06,-1.8e-05,-1.7e-05,1e-05,2e-06,-1.4e-05,-2.4e-05,0,-2.2e-05,-1.2e-05,8e-06,-5e-06,-1.9e-05,1e-06,-1e-05,-4e-06,1e-06,-1.6e-05,2e-06,1.2e-05,-1e-06,6e-06,1.1e-05,9e-06,0,-3e-06,-4e-06,-1e-06,4e-06,-2e-06,2e-06,3e-06,-1.1e-05,3e-06,3e-06,-1.8e-05,7e-06,7e-06,-1.1e-05,-3e-06,-4e-06,4e-06,-1e-05,1e-06,3e-06,7e-06
-1e-06,4e-06,-2.5e-05,2e-06,2e-06,-9e-06,-1.3e-05,-6e-06,-2e-06,-3e-06,5e-06,3.1e-05,1e-06,1.3e-05,-1e-06,-8e-06,2e-06,-1.8e-05,4e-06,-2e-06,0,7e-06,3e-06,7e-06,2.4e-05,1.9e-05,1.6e-05,-2.4e-05,-4.3e-05,-1e-06,-1.6e-05,-1e-05,-7e-06,-2.7e-05,1e-06,1.1e-05,2e-06,1e-06,0,1.6e-05,-1.6e-05,7e-06,1.6e-05,-1.5e-05,-1e-06,1e-06,1.9e-05,6e-06,-2e-05,2e-06,2e-06,-2.7e-05,-1e-06,-4e-06,6e-06,3.2e-05,3e-06,1.5e-05,1e-06,-1.2e-05,1.4e-05,-2.2e-05,3.7e-05,7e-06,1.2e-05,9e-06,0,3e-06,1.1e-05,4e-06,-3e-06,-1.4e-05,-1e-06,6e-06,4e-06,0,2.2e-05,1.5e-05,-1e-06,-1e-06,-1e-05,2.2e-05,8e-06,1.9e-05,7e-06,-5e-06,-1e-06,-1.7e-05,0,1e-05,1.1e-05,1.5e-05,1.4e-05,4e-06,2e-06,-1.2e-05,-1.1e-05,-1.6e-05,-4e-06,5e-06,6e-06,-6e-06,-3e-06,-1e-05,2e-06,-7e-06,4e-06,1.1e-05,-3e-06,5e-06,1.4e-05,-4e-06,-4e-06,5e-06,-8e-06,1.2e-05,-1.6e-05,0,0,-4e-06,-3e-06
1e-05,-1.3e-05,2.7e-05,-1e-06,1e-06,1.1e-05,-3e-06,3e-06,1.6e-05,1e-06,1e-06,-1.1e-05,5e-06,-1.4e-05,-3e-06,6e-06,-8e-06,1e-05,-5e-06,-1e-06,-2e-06,3e-06,-5e-06,2e-06,-2e-06,-5e-06,-2e-05,-1e-06,3.1e-05,-4e-06,1.3e-05,1.6e-05,-1.3e-05,4e-06,-3e-06,2.7e-05,2e-06,1e-06,3e-06,-1.9e-05,-2.9e-05,-2.7e-05,-1.2e-05,1e-05,-1e-06,3e-06,-3e-05,7e-06,4.8e-05,-2e-06,-4e-06,2.3e-05,9e-06,-6e-06,2e-06,-2.5e-05,-1e-06,-2.1e-05,-4e-06,5e-06,1.7e-05,-1e-05,-1.8e-05,-9e-06,-1e-05,-1.1e-05,-2.5e-05,4e-06,5e-06,2e-06,-1e-06,7e-06,-8e-06,-1e-06,1e-06,1e-06,-1.6e-05,-1.1e-05,-2e-06,2e-06,2.4e-05,-1.7e-05,-1.9e-05,-9e-06,9e-06,3e-06,-1.2e-05,5e-06,-1e-06,1e-06,-9e-06,-1.2e-05,-4e-06,0,-4e-06,2e-05,2e-06,1e-06,3e-06,1e-06,-3e-06,5e-06,-3e-06,3e-06,-2e-06,1e-06,-2e-06,7e-06,3e-06,-3e-06,-1.3e-05,-4e-06,-1e-06,2e-06,1e-06,3e-06,1.1e-05,1e-06,1e-06,-9e-06,9e-06
-5e-06,-7e-06,-1e-06,-1.2e-05,2e-06,-7e-06,2.1e-05,1e-06,4e-06,1.1e-05,-4e-06,1e-06,-6e-06,1.9e-05,2e-06,-1.1e-05,1.2e-05,-3e-06,6e-06,-2e-06,3e-06,-1.3e-05,0,-1e-06,1.6e-05,-1.2e-05,2.6e-05,2e-05,-1e-05,7e-06,-1.3e-05,-9e-06,1e-05,-2.3e-05,4e-06,-3.1e-05,1.8e-05,-7e-06,4e-06,8e-06,4.7e-05,2.7e-05,7e-06,4e-06,3e-06,-1e-06,3.9e-05,-1e-06,-2.2e-05,7e-06,-5e-06,5e-06,7e-06,1.6e-05,-1e-06,1.7e-05,0,4e-06,3e-06,3e-06,-1.1e-05,2.5e-05,-6e-06,-2e-06,3e-06,8e-06,1.3e-05,-1e-06,-9e-06,3e-06,6e-06,7e-06,2e-06,1e-06,-5e-06,0,6e-06,1e-05,9e-06,-2e-06,-1.5e-05,1.5e-05,2.1e-05,2e-06,-1.9e-05,-5e-06,7e-06,1.4e-05,0,-4e-06,5e-06,-1e-06,-7e-06,-6e-06,-2e-06,0,4e-06,1e-05,0,-3e-06,-1e-06,1e-06,0,4e-06,4e-06,4e-06,2e-06,-7e-06,-4e-06,-3e-06,1.3e-05,-4e-06,4e-06,-4e-06,-3e-06,-1e-06,7e-06,-8e-06,-2e-06,1e-05,-9e-06
-8e-06,2e-06,-8e-06,1.3e-05,1e-06,4e-06,-3.2e-05,8e-06,-1e-05,-6e-06,3e-06,5e-06,-1e-06,-2e-05,-1e-06,1.9e-05,4e-06,-4e-06,-7e-06,-8e-06,-2e-06,4e-06,0,-6e-06,-1e-06,1.5e-05,-3.2e-05,-1.6e-05,6e-06,-5e-06,1.5e-05,-4e-06,5e-06,1.5e-05,-2e-06,5e-06,-8e-06,0,-6e-06,5e-06,-1.8e-05,-2.5e-05,-4e-06,4e-06,-3e-06,-2e-06,-4.3e-05,-6e-06,4e-06,-7e-06,-1e-06,-4e-06,0,-8e-06,4e-06,7e-06,-2e-06,8e-06,-1e-06,1.3e-05,3e-06,6e-06,3.1e-05,8e-06,2e-06,-4e-06,-8e-06,-4e-06,1e-06,-2e-06,-5e-06,-4e-06,4e-06,-3e-06,-1e-06,-1e-06,-8e-06,-4e-06,0,-1e-06,1.3e-05,-1.3e-05,-1.4e-05,5e-06,1e-05,8e-06,-4e-06,1.4e-05,0,-1e-06,2e-06,9e-06,1.5e-05,2e-06,-1e-05,3e-06,8e-06,-3e-06,-6e-06,0,4e-06,-1e-06,2e-06,-8e-06,-7e-06,5e-06,-1e-06,-1e-06,5e-06,3e-06,-7e-06,4e-06,-3e-06,4e-06,1.2e-05,0,-7e-06,7e-06,-2e-06,4e-06,4e-06
-3e-06,1e-06,1e-05,5e-06,-5e-06,0,-1.5e-05,-3e-06,-5e-06,-1e-06,-1e-06,-2.8e-05,3e-06,1.5e-05,-2e-06,-2e-05,-1.6e-05,1.1e-05,7e-06,1e-06,0,1.1e-05,-1e-06,-1.2e-05,-1.2e-05,-1.3e-05,4e-05,3e-06,-8e-06,-1e-06,-1.2e-05,1.3e-05,-8e-06,-5e-06,-1e-06,2.7e-05,-1.5e-05,-2e-06,0,-5e-06,-2.8e-05,3.4e-05,3e-06,-1.6e-05,0,1e-06,4.1e-05,-1.1e-05,-9e-06,0,0,4e-06,-1e-06,-3e-06,-3e-06,-1.4e-05,2e-06,-8e-06,-3e-06,-9e-06,9e-06,-2.6e-05,-3.2e-05,-2e-06,-8e-06,9e-06,1.3e-05,-3e-06,5e-06,1e-06,1e-06,5e-06,3e-06,3e-06,2e-06,0,3e-06,-1e-06,3e-06,2e-06,-9e-06,4e-06,7e-06,-6e-06,-1e-06,7e-06,4e-06,-3e-06,-1e-06,-1e-06,-7e-06,1e-06,-1.2e-05,1e-06,1e-06,1.7e-05,1e-06,-4e-06,-2e-06,3e-06,-3e-06,4e-06,1e-06,1e-06,6e-06,-9e-06,-4e-06,9e-06,-5e-06,-4e-06,-1e-06,1e-06,0,-2e-06,-6e-06,-1.1e-05,7e-06,2e-06,0,-1.2e-05,-2e-06
8e-06,1.1e-05,-2.9e-05,-2e-05,1e-06,-6e-06,4.6e-05,0,3e-06,-4e-06,-1e-06,4.1e-05,-2e-06,-6e-06,1e-06,1.5e-05,6e-06,-1.6e-05,-7e-06,2e-05,0,-6e-06,2e-06,-7e-06,-1e-05,5e-06,-4.3e-05,2e-06,3e-06,3e-06,1.2e-05,-1.2e-05,8e-06,3.3e-05,3e-06,-3.6e-05,8e-06,3e-06,0,1e-06,4.1e-05,-4.7e-05,-4e-06,4e-06,0,1e-06,-3.3e-05,-1.2e-05,4.8e-05,4e-06,-1e-06,-1.5e-05,-5e-06,2e-06,4e-06,1e-05,-2e-06,9e-06,4e-06,-2e-06,-9e-06,-1e-06,2.5e-05,-5e-06,1.1e-05,-6e-06,-6e-06,4e-06,-3e-06,-1e-06,2e-06,-5e-06,-6e-06,-3e-06,1e-06,0,-4e-06,3e-06,1e-06,-2e-06,1.2e-05,5e-06,-5e-06,3e-06,7e-06,-2e-05,-5e-06,-1.2e-05,0,9e-06,3e-06,-1.3e-05,4e-06,-3e-06,4e-06,-1e-05,-3e-06,1e-06,-1e-06,-1e-06,1e-06,-8e-06,-1e-06,9e-06,-6e-06,1e-06,-1e-06,-4e-06,5e-06,3e-06,6e-06,0,3e-06,1e-06,-2e-06,3e-06,-8e-06,-4e-06,0,0,-3e-06
2e-06,1e-06,2.8e-05,1.4e-05,3e-06,7e-06,-3.6e-05,-2e-06,8e-06,8e-06,1e-06,-3.5e-05,2e-06,-1e-06,0,-7e-06,7e-06,2.1e-05,8e-06,-9e-06,0,-6e-06,-2e-06,3e-06,2e-06,5e-06,4.4e-05,-1e-06,1e-05,-1e-06,-1.3e-05,1e-06,-5e-06,-1.1e-05,-1e-06,1e-05,1e-05,3e-06,4e-06,1e-06,-1.7e-05,5.4e-05,2e-06,9e-06,1e-06,-1e-06,2.3e-05,6e-06,-1.7e-05,-1e-06,1e-06,-3e-06,-7e-06,3e-06,0,-1.2e-05,-1e-06,-1.1e-05,-2e-06,-1e-05,-5e-06,2.4e-05,0,5e-06,-1e-05,6e-06,-5e-06,4e-06,3e-06,-2e-06,-2e-06,-3e-06,-1e-06,1e-06,-2e-06,0,2e-06,-8e-06,-3e-06,1e-06,1e-06,-9e-06,2e-06,7e-06,-1.8e-05,7e-06,8e-06,-7e-06,0,-1.1e-05,2e-06,1e-05,4e-06,2e-06,0,0,-5e-06,0,2e-06,-3e-06,-2e-06,2e-06,1e-06,-2e-06,8e-06,4e-06,1e-06,-1.1e-05,-5e-06,2e-06,-1.2e-05,-3e-06,-2e-06,0,1e-06,-1e-05,7e-06,0,3e-06,1e-05,6e-06
2e-06,-7e-06,-1.9e-05,4e-06,-4e-06,-6e-06,-1.3e-05,-2e-06,-1e-06,-4e-06,-1e-06,4.5e-05,1e-06,2e-06,-1e-06,3e-06,-1e-06,-2.6e-05,-8e-06,0,-1e-06,5e-06,4e-06,9e-06,0,-7e-06,-4.3e-05,-3e-06,-2.6e-05,1e-06,1.3e-05,1.1e-05,-1.1e-05,5e-06,-1e-06,2.8e-05,-2e-06,-1e-06,-4e-06,2e-06,-2.1e-05,-4.7e-05,1e-06,0,-2e-06,0,-1.5e-05,3e-06,-4.8e-05,2e-06,2e-06,1.1e-05,4e-06,7e-06,-3e-06,1.4e-05,-1e-06,9e-06,-2e-06,9e-06,3e-06,0,-2.8e-05,2e-06,4e-06,-8e-06,1.5e-05,-2e-06,-2e-06,-1e-06,-2e-06,5e-06,2e-06,-1e-06,-1e-06,0,-4e-06,1e-05,0,0,-2.6e-05,1.1e-05,5e-06,-1e-05,1.2e-05,1e-05,-5e-06,3e-06,0,9e-06,-7e-06,4e-06,-8e-06,-1e-06,-1e-06,0,-1e-06,-3e-06,-2e-06,0,4e-06,0,0,-4e-06,-7e-06,4e-06,-1e-06,2e-06,6e-06,-6e-06,1.3e-05,2e-06,-1e-06,-3e-06,-8e-06,1.5e-05,9e-06,4e-06,-1e-06,0,-5e-06
