-0.001078,-0.001183,-0.001013,-0.000606,-0.000631,-0.000424,-0.000431,-0.000413,-0.000552,-0.000418,-0.000241,-0.000543,-0.000587,-0.000341,-0.000359,-0.000424,-0.000295,-0.000308,-0.000579,-0.000456,-0.00026,-0.000237,-0.000245,-0.000294,-0.000271,-0.000243,-0.000216,-0.000202
0.000496,0.000189,7.9e-05,4.2e-05,-0.000163,-0.000397,-1.5e-05,0.000225,0.000395,0.00016,-9.3e-05,-4.5e-05,-0.000276,-0.000187,-0.000171,-9.2e-05,-4.7e-05,4.4e-05,0.000371,0.000228,3e-06,8e-05,0.000103,8.6e-05,1.9e-05,1e-04,1.4e-05,-1.2e-05
0.000127,2.1e-05,-0.000255,-0.000198,-8.5e-05,-0.000382,-0.000211,-9.8e-05,-0.000117,-6.1e-05,-0.000202,-0.000168,-0.000232,-0.000285,-0.000408,-0.000332,-0.000145,-1.3e-05,0.000103,-1.3e-05,-0.000122,-6.6e-05,-4.4e-05,-8.3e-05,-9.9e-05,-6.7e-05,-0.000104,-0.000149
-0.000873,-0.000777,-0.001064,-0.00073,-0.000253,-0.000375,-0.000585,-0.000648,-0.000848,-0.000477,-0.00035,-0.000429,-0.000298,-0.000381,-0.000641,-0.000699,-0.000357,-0.000271,-0.00061,-0.000577,-0.000392,-0.000355,-0.000368,-0.000415,-0.000368,-0.000372,-0.000307,-0.000375
0.000575,0.000563,0.00028,2.8e-05,0.000163,-3.3e-05,5.2e-05,9.7e-05,0.000246,0.00016,2.9e-05,0.000273,0.000264,0.00011,2.3e-05,3e-06,4.6e-05,7.4e-05,0.000174,9e-05,-3e-06,1.1e-05,-2.6e-05,2.1e-05,1.6e-05,4.4e-05,5.9e-05,-3.8e-05
0.000744,0.000661,0.00059,0.000247,-6e-06,-0.000299,0.000162,0.000317,0.000396,0.000246,0.000131,0.000239,7e-05,0.000148,0.00026,0.000296,0.000117,0.000141,0.000362,0.000299,0.00016,0.000108,5.3e-05,0.000141,0.000178,0.000149,0.000175,0.000102
-0.001001,-0.000957,-0.000666,-0.000311,-0.000476,-0.000713,-0.000527,-0.000379,-0.000621,-0.000415,-0.000227,-0.000558,-0.000648,-0.000311,-0.000192,-0.000208,-0.000293,-0.000292,-0.000538,-0.000408,-0.000226,-0.000285,-0.000312,-0.00026,-0.000154,-0.000273,-0.000185,-0.000178
-0.000205,-8.5e-05,0.000253,0.000379,0.000242,9.5e-05,-8.1e-05,4.4e-05,7.6e-05,-1.3e-05,-4.3e-05,-8e-05,-2.4e-05,6.3e-05,0.000192,0.000162,-5.6e-05,-9.8e-05,-6.5e-05,-3.2e-05,-4.8e-05,-3.9e-05,-3e-06,5.8e-05,6.9e-05,2.1e-05,-1e-05,2.9e-05
0.001015,0.001133,0.001204,0.000733,7e-04,0.000918,0.000647,0.000516,0.000672,0.000437,0.000267,0.000536,0.000739,0.000506,0.000656,0.00069,0.000316,0.000272,0.000623,0.000536,0.000306,0.000333,0.000383,0.000421,0.000364,0.000382,0.000254,0.000287
-0.000319,-0.000201,-0.000154,-0.000179,9e-06,0.000665,0.00026,-0.000161,-0.000335,-0.000126,0.000105,4.5e-05,0.000278,0.000145,0.000173,0.00016,7.8e-05,2.6e-05,-0.000168,-9.4e-05,3.4e-05,3.9e-05,6.6e-05,-3e-06,-3.1e-05,-1e-05,-1.6e-05,3.1e-05
-0.000616,-0.000675,-0.00062,-0.000364,-0.000277,0.000261,2.4e-05,-0.000232,-0.000237,-0.000133,6.9e-05,-4.4e-05,-5.3e-05,-7.8e-05,-0.000157,-0.000194,3e-05,-7.8e-05,-0.000387,-0.000283,-7.6e-05,-7.2e-05,-7e-05,-0.000152,-0.000213,-0.000143,-0.000118,-7.8e-05
0.00068,0.000447,0.000327,0.00019,-1.5e-05,3.9e-05,0.000327,0.000388,0.000608,0.000368,0.000204,0.000293,5.4e-05,1.3e-05,-7.2e-05,7e-06,0.000236,0.000192,0.000378,0.000334,0.000251,0.000209,0.000157,0.000139,9.4e-05,0.000161,0.000105,0.000107
-9e-06,-0.000171,-0.000305,-0.000173,-0.000199,-0.000362,-8.5e-05,3e-06,-0.000148,-7e-05,-3e-05,-0.00019,-0.000357,-0.000293,-0.000435,-0.000344,-5.3e-05,3.1e-05,6.7e-05,7.4e-05,9.4e-05,3.6e-05,-4.8e-05,-6.8e-05,-1e-05,-7.3e-05,-4.6e-05,-3.6e-05
-0.000756,-0.000772,-0.000799,-0.000392,-0.000171,-0.000346,-0.000503,-0.000396,-0.000533,-0.000402,-0.000247,-0.000363,-0.000321,-0.000348,-0.000562,-6e-04,-0.000295,-0.000235,-0.000424,-0.000371,-0.000245,-0.000214,-0.000268,-0.00027,-0.000221,-0.000262,-0.000198,-2e-04
0.000484,0.000538,0.000394,0.000163,0.000263,1.3e-05,-3.6e-05,0.00014,0.000393,0.000157,-8.7e-05,0.000271,0.000423,0.000193,8.7e-05,2.1e-05,2e-06,1e-06,0.000197,0.000103,-3.4e-05,2.9e-05,1.6e-05,5.6e-05,3.2e-05,0.000136,8.4e-05,1.9e-05
0.000468,0.000649,0.000529,0.000163,9.9e-05,-0.000177,0.000104,0.000124,0.000128,0.000141,-2.4e-05,0.000162,0.00024,0.000261,0.00037,0.000347,8e-05,0.000146,0.000316,0.00021,8e-05,6.9e-05,9.4e-05,9.3e-05,0.000115,0.000146,0.000146,0.000132
-0.000734,-0.000515,-0.000291,-0.000112,-0.000237,-0.000482,-0.000323,-0.000311,-0.00053,-0.000263,-0.00011,-0.000365,-0.000496,-9e-05,0.000153,9.7e-05,-0.000122,-6.4e-05,-0.000311,-0.000274,-0.000171,-0.000206,-0.000135,-0.000154,-0.000109,-0.000166,-5e-05,1.2e-05
-4.3e-05,-4.8e-05,0.00017,0.000163,8e-06,-0.000179,-0.000157,5.1e-05,0.000213,9.5e-05,-1.7e-05,-0.000116,-0.000293,1.5e-05,0.000263,0.00023,6e-06,-6.1e-05,-8.9e-05,-6.1e-05,-8.3e-05,-6.5e-05,-2.1e-05,3e-05,3.4e-05,4.4e-05,2.2e-05,3.4e-05
0.00066,0.000526,0.000445,0.00022,0.000187,0.000238,0.000223,0.000282,0.000382,0.00024,7.8e-05,9.7e-05,0.000154,0.000154,0.000272,0.000345,0.000125,9.1e-05,0.000291,0.000264,0.000157,0.000167,0.000168,0.000205,0.000228,0.000194,7.8e-05,7.6e-05
