-0.007483,-0.009005,-0.005111,-0.008622,-0.013553,-0.010959,-0.008243,-0.007634,-0.007999,-0.0063,-0.009275,-0.01043,-0.006835,-0.005474,-0.009209,-0.010714,-0.010113,-0.012108,-0.005149,-0.009081,-0.012042,-0.008445,-0.007587,-0.003963,-0.006772,-0.007017,-0.008035,-0.006917,-0.012071,-0.008125,-0.008799,-0.00782,-0.009509,-0.009951,-0.006326,-0.007164,-0.010271,-0.005301,-0.008812,-0.005947,-0.011284,-0.007707,-0.004456,-0.005685,-0.006107,-0.003923,-0.008202,-0.004515,-0.005609,-0.006642,-0.008969,-0.006983,-0.003568,-0.002405,-0.005851,-0.008168,-0.007544,-0.007173,-0.005176,-0.004917,-0.002611,-0.005785,-0.004165,-0.001999,-0.003873,-0.007797,-0.010486,-0.008664,-0.005053,-0.009604,-0.007673,-0.006648,-0.009425,-0.009199,-0.004745,-0.002665,-0.005534,-0.007088,-0.008079,-0.00717,-0.004752,-0.005931,-0.004885,-0.006196,-0.006116,-0.001911,-0.003111,-0.007108,-0.003917,-0.00552,-0.003507,-0.002593,-0.003838,-0.004909,-0.00446,-0.006408,-0.005599,-0.003827,-0.002823,-0.002247,-0.006809,-0.007578,-0.005506,-0.003705,-0.004876,-0.007343,-0.006584,-0.005903,-0.00478,-0.003161,-0.002638,-0.003224,-0.003574,-0.004323,-0.007,-0.005911,-0.003647,-0.003555,-0.00363,-0.003383,-0.005162
-0.000901,0.002859,0.002928,0.001313,0.003356,0.001453,0.001374,-0.001057,-0.002872,-0.000912,0.005451,0.003834,-0.002217,-0.002737,-4.3e-05,0.001551,0.001393,0.002689,0.000126,0.000345,0.006113,0.002421,0.002377,-0.000545,0.001035,-0.000861,0.004555,0.003719,0.006847,0.004571,0.00067,0.002889,0.0042,0.003028,0.002023,0.003793,0.005348,0.002713,0.005271,0.000963,0.004418,0.001952,-0.001716,-0.000202,-0.000165,0.000935,-0.001441,-0.001739,0.002636,0.003628,0.001332,-0.00101,-0.002552,-0.001641,0.001152,0.001682,-0.002471,0.000309,0.000926,0.000845,0.002168,0.000631,-0.001116,-0.001649,-0.001689,0.000843,0.004395,0.002806,0.002253,0.003084,0.003344,0.002654,0.002943,0.004589,0.000502,-0.002498,-0.000895,0.000365,0.000581,0.000781,0.002373,0.003228,0.000124,0.004321,0.001794,-8.5e-05,-0.000598,0.002536,-0.001673,-0.000823,-0.000583,0.000338,-0.00088,-0.000793,0.001396,0.002905,0.003944,0.002218,0.001715,-0.002115,0.002077,0.003503,0.000759,0.000778,0.000521,0.003594,0.000847,-0.000217,-0.000913,-0.000284,-0.001115,0.001398,0.001363,0.000106,0.001121,-0.000646,-0.001605,-0.001745,-0.001691,-0.00397,-0.001386
0.0031,-0.001963,-0.003315,-0.001947,0.003404,0.002042,0.001518,0.002759,0.002732,0.000693,-0.004433,-0.001776,5.7e-05,0.001289,-0.001299,0.002258,0.001289,0.001012,0.001265,0.000904,-0.004837,-0.004381,-0.001951,-0.001059,-0.001446,-0.000253,-0.002457,-0.00463,-0.004823,-0.004154,-0.000212,-0.002461,-0.003284,0.000735,0.000315,-0.004431,-0.004902,-0.003851,-0.003774,-0.001448,-0.004534,-0.001121,-0.001337,0.000695,0.000839,-0.001459,0.00124,0.001053,-0.001586,-0.003292,-0.000755,0.002536,0.001928,-0.002161,-0.002329,-0.00184,0.002784,0.000314,-0.00078,-0.001639,-0.003532,-0.002119,-0.000393,-0.00046,0.001586,-0.00087,-0.003982,-0.001663,-0.003571,-0.002025,-0.001387,-0.003188,-0.000504,-0.003865,-0.001542,-0.000812,-0.000565,0.000693,0.000408,0.001168,6e-06,-0.002882,-0.000159,-0.002218,-0.000111,-0.000499,-0.001059,-0.001289,-0.000426,-0.000274,-0.001088,-0.000925,-0.000245,0.000524,-0.000659,-0.00054,-0.002399,-0.003186,-0.002151,-0.001396,-0.000529,-0.002082,-0.001619,2.8e-05,0.00035,-0.003137,-0.00126,-0.001053,0.001699,0.001792,0.000285,-0.002289,-0.001288,0.000329,-0.001254,0.000885,0.000737,0.002066,0.001533,2.1e-05,0.000426
-0.001496,0.003029,0.000938,0.002388,-0.00284,-0.003341,-0.002179,-0.001698,-0.003596,-0.00212,0.000637,0.001552,0.001867,-0.001018,0.004149,-0.000936,0.000485,-0.000547,0.000795,0.001794,0.004196,0.002581,0.000793,0.001808,0.002195,0.001967,0.003768,0.005084,0.00262,0.003862,0.000388,0.003,0.00326,-7.3e-05,-0.000282,0.002029,0.00436,0.002832,0.002475,0.002755,0.002282,-0.000401,0.001685,0.002117,0.001455,0.000867,0.001404,0.000201,0.001249,0.000654,0.002548,0.000787,0.00066,0.002642,0.002587,0.004,-0.000496,0.001741,-6e-05,0.000454,0.002349,0.003129,0.002829,0.002351,0.001728,0.001798,0.004353,0.001391,0.003458,0.002957,0.001241,0.002565,0.001243,0.00385,0.002781,0.002997,0.002124,-0.001032,0.000802,-0.00096,0.000126,0.000634,0.000517,0.000128,-0.000137,-0.000235,0.001646,0.000381,0.002139,0.001421,0.001939,0.001258,0.000417,0.000671,0.000689,0.000118,0.001475,0.002653,0.002763,0.001388,0.000353,0.001736,0.001653,0.000354,-0.000621,0.000944,0.001109,0.000982,-0.001029,-0.001551,-3.3e-05,0.000724,0.000205,0.000288,0.001122,-0.000307,-0.000123,-0.000138,0.000496,0.001993,5.9e-05
-0.001192,-0.002598,-0.001205,-0.00197,0.001627,0.000282,0.001007,-0.000451,0.002927,-0.000671,0.000593,-0.000997,-0.00091,-0.000477,-0.002072,-0.001989,-0.002556,-0.000184,-0.002484,-0.002149,-0.004337,-0.003086,-0.00122,-0.000727,-0.001932,-0.00044,-0.003838,-0.004281,-0.002162,-0.002092,-0.001519,-0.002317,-0.002901,-0.003356,-0.00134,0.000233,-0.003025,-0.002916,-0.001455,-0.001277,-0.001776,0.000796,-0.001296,-0.002915,-0.002857,-0.000918,-0.00229,-0.000125,0.000125,0,-0.001459,-0.004062,-0.000244,-0.000504,0.001042,-0.00168,-0.000344,-0.001757,-5.9e-05,0.000488,0.000393,-0.003227,-0.004212,-0.00178,-0.001743,-0.002591,-0.00313,-0.002102,-0.002128,-0.002774,-0.000684,-0.001938,-0.002274,-0.002102,-0.001972,-0.000817,-0.000286,0.000837,-0.000917,-5.6e-05,-0.001066,-0.00081,-0.000712,0.000343,0.000508,5.1e-05,6.2e-05,-0.00135,-0.000609,-0.001436,-0.002162,-0.000256,0.00111,-0.002518,-0.001927,-0.001678,-0.001527,-0.001653,-0.002493,7e-05,-0.000388,-0.001762,-0.001286,-0.000808,0.000943,0.001095,-0.001198,0.000544,-0.00011,0,-9.9e-05,0.000596,-0.00049,-0.001321,-0.000639,0.000135,0.00037,-0.000543,-0.001147,-0.00027,0.001079
0.000713,0.000367,9e-05,-9.3e-05,-0.002041,0.001945,0.000337,0.000486,0.001418,0.003764,0.001916,-0.00076,0.000616,0.000748,-0.001311,0.000834,0.002845,-0.000792,0.000341,0.000405,0.002052,0.002692,0.000635,0.001308,0.001751,0.000172,0.001087,0.001744,0.00146,0.000801,0.000714,0.00106,0.002682,0.003465,0.001525,2.3e-05,0.001237,0.002323,0.001126,0.000346,0.002502,-0.000411,0.000992,0.000757,0.001305,0.000689,6e-04,-0.000146,-0.000773,0.000627,-0.000244,0.002291,-0.000241,-0.00091,-0.002005,-0.000238,-0.000507,0.000193,-0.000221,0.000499,-0.000701,0.001219,0.001851,-3.1e-05,-0.001561,0.000817,0.001384,0.001651,0.000822,0.001033,-0.000671,0.00136,0.002114,-0.000876,0.001399,-0.000536,-0.000988,0.000265,0.001514,0.001985,0.002304,0.000655,0.000429,0.00092,0.000354,0.001151,-0.000358,0.002092,-0.00063,0.000108,0.00048,-0.000683,-0.000451,0.001501,0.001402,0.001529,0.000126,0.000336,0.000232,-0.00014,0.001557,0.001321,-0.000444,0.000489,-0.000138,-0.000225,0.001062,0.00012,0.000464,0.001341,0.000295,0.000322,-0.000182,-7.8e-05,0.00087,0.000208,-0.000391,0.000533,9e-06,-0.001646,-0.00158
-0.000368,0.000724,0.002434,0.001226,0.001404,-0.000781,-0.001442,-0.000433,-0.001688,-0.001347,-0.001025,0.001361,0.000701,0.001868,0.001823,0.00027,-0.000595,0.001397,0.000936,0.001183,0.000204,-0.00049,0.001424,-0.000831,-0.000939,-4e-05,-0.00034,0.000558,-0.00013,0.000447,0.000896,0.000936,-0.000909,-0.001488,-0.000843,-0.000429,-4.5e-05,-0.001894,-4e-05,-0.000687,-0.001514,-0.00035,0.000383,0.001832,0.000905,-8.1e-05,-0.000416,-0.000575,0.000134,-0.000315,0.001094,0.000663,0.000606,0.000162,-1.9e-05,-0.000492,0.001635,0.00019,-0.000247,-0.000824,-4.2e-05,0.000901,0.00036,0.000703,0.001927,8e-04,0.000191,-0.000474,0.000268,0.000411,0.000799,-0.000222,-0.000904,0.001806,-9.6e-05,0.000461,0.000829,-2.4e-05,-0.001774,-0.002799,-0.002003,-0.000219,-0.000639,-0.000664,-0.001499,-0.000691,-0.000935,-0.000919,0.000414,0.001363,0.001387,0.001062,0.000242,0.000357,-6.7e-05,0.000285,8.1e-05,0.000721,0.000288,0.000343,0.00015,-0.001016,0.001441,0.000406,0.000153,-0.000463,0.000231,0.000133,-0.000746,-0.000324,-0.000417,-0.000717,0.001244,0.001194,-0.000318,-0.000391,0.000292,-0.000973,0.000632,0.001229,0.001073
0.000542,-0.001136,-0.002649,-0.001285,-0.001459,0.000306,0.002382,0.001035,-0.000377,-0.001302,0.000287,-0.000666,-0.000911,-0.000631,-0.000441,0.000274,0.00059,-0.000622,-0.000227,-0.001666,-0.000154,-0.000165,-0.000986,-0.000486,0.000331,-0.00092,-0.000618,-0.000304,-0.000547,-0.001297,-0.001638,-0.002259,0.000269,0.000987,0.000443,0.000923,8.3e-05,0.00137,-0.000162,0.001267,0.000233,-5.6e-05,-0.000536,-0.002303,-0.001331,4.4e-05,0.000357,0.001197,0.001023,6e-05,-9.2e-05,-0.000971,-0.000176,0.000795,0.000755,-0.000168,-0.001061,0.000182,0.000565,0.000519,0.000355,-0.001135,-0.000349,-0.000614,-0.000611,-0.000477,-0.000755,7.6e-05,0.00041,-0.000109,-0.001241,0.000175,0.001023,-9.4e-05,-0.000925,-0.000144,0.000325,-0.000583,0.000523,0.001383,0.000311,0.000955,0.000429,-0.000521,0.001451,-7.7e-05,0.000298,0.000149,-0.000203,-0.000872,-0.000515,-0.000309,-0.000458,2.9e-05,-0.000554,0.000535,0.00052,-0.001129,-0.000178,-0.00023,-0.001199,0.000324,-0.00161,-0.001473,-0.001318,0.000268,-0.000147,2.9e-05,0.000539,-0.000862,-0.000311,0.000248,-0.000687,-0.000164,-0.000768,0.000869,-0.000166,0.000532,-0.000369,0.000164,7.8e-05
0.000256,0.001294,0.001679,0.000395,0.001116,0.000181,-0.002131,-0.000147,0.001236,0.001141,-0.000785,0.000675,0.000436,-0.000467,-0.000479,-0.001272,-0.001647,-0.000772,-0.000749,0.000447,0.000476,0.000153,-0.000173,0.000524,0.000172,0.001591,0.001329,0.00035,6e-04,0.001158,0.001027,0.000589,-0.001647,-0.001293,-0.000715,0.000339,-0.000267,-0.000263,-0.000323,-0.001419,-0.000265,0.00116,0.001204,0.000919,0.000384,-0.000326,0.00022,-0.000404,-0.000456,0.000646,0.000339,0.000451,-0.001154,-0.000101,-0.00028,0.001085,-4.4e-05,0.000173,-0.001105,-0.000125,-3e-04,-0.000164,0.000541,0.000341,-0.000202,5.2e-05,-0.000385,-0.000161,-0.000753,0.000215,0.00213,-0.00066,-0.000741,-0.000642,0.000136,-0.000437,-0.000422,-0.000549,0.000362,0.000236,0.00041,-0.00081,-0.000144,0.000283,-0.000262,0.000557,0.000956,-0.000529,-8.3e-05,7.1e-05,-0.000141,-0.000333,0.000216,-0.000652,0.000404,-0.001,-0.001003,0.001469,0.000462,8.8e-05,-0.000653,0.000159,0.001816,0.000682,0.000747,-0.00058,0.000125,-7e-05,3.5e-05,0.000623,0.000838,-0.000365,0.000182,0.000137,0.001058,-9e-04,-0.000156,0.000177,-0.000126,-0.000867,-0.000419
-0.00077,-0.000868,0.000154,-7.2e-05,-0.000905,0.000484,9e-06,-0.001247,-1.3e-05,-0.000579,-0.000586,-0.00028,-0.000603,0.000497,0.000205,-0.000216,0.001459,0.001208,0.00091,0.000561,-0.000465,0.000668,-0.000926,-0.000368,0.00036,-0.001159,-0.000546,0.000183,-0.000407,-0.000536,-0.000511,-0.000712,0.001487,0.000716,0.000865,-0.00098,-0.000355,-0.000186,-0.000562,0.000724,0.000891,-0.001049,-0.001763,-0.001008,0.000268,-9.6e-05,-1e-04,0.000231,-0.000264,-0.000363,-0.000371,-0.001024,0.00105,-0.000458,0.000244,-0.001537,-0.000766,-0.000634,0.001167,-0.000142,0.000545,0.000525,0.000152,0.000452,0.000171,-0.000114,0.001014,-3e-05,-0.000237,-0.000243,-0.001404,-4e-06,0.000303,0.000264,0.000467,0.00067,-0.000147,0.000799,-0.000171,-0.00023,-8.5e-05,0.000485,-4.5e-05,0.000759,-3e-05,-0.000196,-0.000508,0.000445,0.000635,6.6e-05,-5.2e-05,0.000208,-0.000827,0.000179,-5e-06,0.000547,0.000597,-0.001075,-0.000164,-0.000562,0.000477,0.000382,-0.000998,-0.000351,0.000507,0.000267,-0.000611,-0.000151,0.000132,-8.8e-05,-7.6e-05,0.000132,-0.000314,-0.000396,-0.000257,0.001195,0.000175,-8.1e-05,2.4e-05,0.000548,0.000184
0.000206,0.00086,-0.000801,0.000164,0.001444,-0.000431,0.000307,0.000339,-0.000985,0.000367,0.000256,-0.000791,0.00063,-0.000534,-0.000215,0.001286,-0.00114,-0.000356,0.000472,-0.000735,-0.000295,-0.001078,8e-04,5.2e-05,0.000214,-4e-05,0.00079,-0.000668,-0.000116,0.000302,0.000666,0.000845,9.6e-05,-0.000409,-0.000329,0.000316,0.000176,-0.00035,0.000402,-0.000153,-0.000906,0.000592,0.000507,0.000779,0.000261,0.000466,1.3e-05,0.000143,0.000543,0.00019,-0.000343,0.001205,0.000395,0.000673,0.000181,0.000198,0.000744,0.000162,-0.000156,-6.2e-05,-0.00055,0.000218,-0.000352,-1e-04,0.000148,0.000101,9.9e-05,0.000577,0.000802,0.000136,0.000555,0.001029,5.5e-05,0.000107,0.000124,-0.000541,0.000198,3.8e-05,0.000348,-0.000326,-0.000253,-3.2e-05,0.000452,-0.001018,-0.000266,-0.000335,-0.000265,0.00032,-0.000524,0.000157,1.2e-05,0.000449,6e-04,0.000226,-0.000106,-0.000203,-6.1e-05,-2e-05,-9.9e-05,0.000525,0.001102,-0.000169,0.000188,0.000124,-0.000649,6.8e-05,0.000122,-0.000416,-0.000353,-3.7e-05,-0.000422,6e-05,7.3e-05,-3.5e-05,-0.000238,-0.001082,-0.000226,0.000112,-0.000321,0.000391,0.000128
0.000429,0.000154,-7.3e-05,-3.1e-05,-0.000733,-0.000284,2.2e-05,0.001001,0.000493,0.000166,0.001177,-1.4e-05,-0.00043,0.000451,-6.5e-05,-0.00032,0.000274,-0.000202,-0.000788,0.000308,4e-04,0.000349,-0.000675,0.000256,-0.000631,0.00033,-0.000465,0.000526,8.4e-05,-8.8e-05,-0.000615,-7.8e-05,-0.000662,0.000227,-0.000269,-0.000208,1e-04,0.000285,-0.000285,-0.000536,0.000212,-0.000378,0.000442,0.000229,-0.000678,-0.000483,-0.000165,-0.000342,-0.000587,0.00019,0.000112,-0.000383,-0.000642,2.8e-05,-9e-05,0.000942,-7.8e-05,0.000549,-0.000193,0.000235,2.7e-05,-0.000299,1.7e-05,-0.000341,-0.000223,0.000347,-0.000327,-0.00053,-0.000781,-0.000296,0.000248,-0.000765,-0.00034,-0.000499,-0.000464,0.000148,0.000104,-0.000436,-0.000712,0.000577,0.000413,-7.2e-05,-0.000109,0.000552,0.000209,0.000326,0.000346,-0.000155,8.2e-05,0.000341,9.5e-05,-0.000488,-1e-06,-8.5e-05,0.000103,-4.4e-05,0.000255,0.000117,-1e-06,-0.000333,-0.000869,-0.000437,-1.8e-05,0.000193,0.000299,0.00014,0.00062,0.000827,0.000257,0.000223,0.000317,-4e-06,0.000249,0.000351,-3.9e-05,8.4e-05,-1.6e-05,-0.000582,0.000334,-0.00053,-0.000174
-0.000306,-0.000509,0.000522,0.000409,-0.000363,-0.000443,0.000632,-0.00088,1e-05,-9.1e-05,-0.001019,0.000343,0.000443,-0.000622,0.000162,-0.000364,-0.000158,-1.2e-05,0.000104,-0.000149,0.000132,0.000171,0.000926,-3.2e-05,0.00023,-2.9e-05,-0.000401,-0.000582,0.000123,0.000134,0.000521,5.3e-05,0.000481,8.8e-05,9.6e-05,5e-06,-4.3e-05,0.000307,0.000229,0.000356,0.000192,0.00014,-7.8e-05,-0.000141,0.000281,0.000241,3.8e-05,0.000495,0.000481,-0.000337,1.8e-05,0.000147,-2.1e-05,-0.000657,-0.000276,-0.000203,0.000112,-0.00026,-0.000165,-0.00024,0.000328,0.000256,0.000237,0.000314,0.000112,-0.000303,2.4e-05,-0.000379,0.00028,0.000181,-0.000274,-0.000114,8.7e-05,0.000559,0.000162,0.000125,-4.6e-05,4.4e-05,0.000391,-0.000284,-0.000622,-3.3e-05,-0.000203,-0.000322,-1.7e-05,-0.000453,-0.000481,-0.000325,-0.000172,-0.000494,-6.4e-05,-0.000475,-0.000211,9.2e-05,3.5e-05,0.000302,5.1e-05,9.7e-05,6.5e-05,0.000179,5e-05,0.000172,0.000458,0.000195,-2.3e-05,-0.000348,-0.000389,-0.000682,-9e-05,-0.000532,-0.000121,0.000198,5.6e-05,-0.000216,7.5e-05,0.000255,0.000296,0.000251,-5.2e-05,7.9e-05,4.9e-05
1.6e-05,-7.6e-05,-8.5e-05,-0.000668,0.000528,0.000379,-0.000876,0.000404,0.000173,7.3e-05,7.6e-05,3.4e-05,-0.000348,0.000287,0.000293,0.000508,0.000447,0.000137,-0.000114,8.4e-05,0.000117,5.7e-05,-0.000576,-0.000416,-0.000247,-0.000257,0.000272,-6e-06,1e-06,-0.000257,-1.6e-05,-3.3e-05,-0.000374,-2.6e-05,0.000332,-0.00022,-0.000117,-0.000247,0.000109,0.000119,-0.000162,-0.000104,0.000134,-0.00027,-0.000384,3.4e-05,5.6e-05,-0.000105,-0.000195,0.000239,-0.000139,0.000114,0.000295,0.000535,0.000112,-1.8e-05,-0.000273,0.000158,0.000328,-3.5e-05,-0.000244,-0.000204,6.7e-05,-0.000305,0.000238,0.000125,-9e-06,0.000541,-0.000178,-0.000304,-0.000427,0.000311,8.9e-05,-0.000156,1e-04,-5.9e-05,-0.000181,0.000278,5.9e-05,-0.000194,0.000211,0.000106,8.8e-05,0.000257,-0.000157,0.000321,3.5e-05,0.000109,3.9e-05,0.00013,-9.2e-05,0.000233,0.000482,-0.000132,-4.3e-05,-0.000314,-9.7e-05,-0.000352,-1.7e-05,0.000101,7.1e-05,6.3e-05,-0.000604,-1.6e-05,0.000247,5.4e-05,7.6e-05,0.000412,6.9e-05,0.000134,-7.8e-05,-8.7e-05,-0.000245,0.000177,-6.8e-05,5.3e-05,-0.000314,0.000159,-1.2e-05,0.000338,4.4e-05
-9.7e-05,-3.2e-05,-9.5e-05,4e-04,-0.000113,0.000194,0.000687,-0.000191,-0.000304,-0.00018,0.000193,0.000316,0.000233,0.000109,5.5e-05,-5.8e-05,-0.000182,-0.000116,0.000209,1.9e-05,-0.000307,-0.000226,0.000254,0.000109,-0.000112,4.6e-05,7.4e-05,0.00024,0.000131,0.000118,-8.4e-05,0.000231,-0.000115,-2.3e-05,-0.000304,0.000564,0.000237,0.000215,9e-06,0.000203,0.000107,0.000232,-3.4e-05,0.000123,0.000431,-0.000132,5.3e-05,-0.000204,-0.000123,0.000119,2.6e-05,-0.000136,-0.000244,-7.2e-05,-0.000213,-0.000211,0.000421,-0.000408,-2.1e-05,0.000131,-2.3e-05,0.000363,-0.000135,-0.00011,-0.000507,-7e-05,-0.000248,-0.000304,0.000243,0.000323,0.000627,-3.5e-05,-7e-05,-1.2e-05,-0.000121,-5.1e-05,-5.2e-05,-0.000126,-0.000204,0.000149,0.000203,-2.6e-05,-0.000153,-0.000114,5.7e-05,-0.00011,0.000182,0.000207,8e-05,-0.000109,4.9e-05,0.000209,-0.000311,0.000216,-0.000353,0.000105,-8.2e-05,0.000222,-4.7e-05,-0.000115,8.6e-05,5.5e-05,0.000377,-0.000304,-0.00018,0.000258,2.4e-05,-0.000255,-1.7e-05,0.000363,8.9e-05,-2.7e-05,0.000144,-0.000153,3e-06,7.5e-05,0.000282,4.5e-05,-2.6e-05,-0.000211,-0.000123
0.000138,8e-05,-1.2e-05,-0.000115,9.1e-05,-0.000178,0.000121,-0.000132,-2.6e-05,0.000114,-3.9e-05,-8.9e-05,-0.000161,-0.000134,-0.00014,-6.6e-05,-0.000153,0.000183,-9e-06,-1.1e-05,-7.4e-05,6.5e-05,-3.1e-05,-0.000273,0.000151,-3.7e-05,-4.8e-05,-7.2e-05,-7.7e-05,-0.000227,1.3e-05,-0.000177,-6.5e-05,-0.000143,0.000182,-0.000299,-1.5e-05,-0.000142,5.6e-05,-7.2e-05,3.9e-05,-0.000175,-0.000125,5.2e-05,-0.000152,0.000108,-1.7e-05,-1.7e-05,-0.000179,-0.000396,-2.1e-05,0.000291,0.000138,-0.000171,0.000188,-0.000202,-9.4e-05,0.000108,-9.8e-05,6.3e-05,0.000299,-0.000257,-6e-05,0.000173,0.000353,-3.1e-05,5e-06,0.000161,-5.6e-05,-6.5e-05,-0.00029,-0.000313,-3e-05,8.6e-05,8.5e-05,-2.8e-05,0.000243,-6.5e-05,0.000148,0.000104,-9.7e-05,-2.3e-05,1.2e-05,4.4e-05,4.3e-05,-2.6e-05,4.3e-05,-0.000125,-8.1e-05,9e-05,-3.3e-05,1e-05,-4.8e-05,-0.000107,0.00032,-8.1e-05,3.4e-05,-0.000229,4.7e-05,0.000121,-0.000216,-2.9e-05,-0.000286,0.000198,0.000132,-0.000199,-0.000158,0.000125,0.000178,-0.000134,-4.6e-05,6.9e-05,-4.5e-05,2.6e-05,0.000119,-0.000141,-0.000117,-0.000216,-8e-05,7.8e-05,9.8e-05
-0.000131,4.4e-05,0.000235,2.1e-05,2e-05,-0.000164,-0.000454,0.000254,0.000176,-9.1e-05,2.6e-05,-0.000231,0.000264,0.000109,-0.000228,2.4e-05,0.000196,-0.000138,-8.7e-05,4.9e-05,0.000224,9.2e-05,0.000181,0.000209,-3.9e-05,0.000125,3.8e-05,0.000128,1.7e-05,0.000279,0.000259,3.9e-05,0.000106,0.000183,-0.000267,-0.000142,-9.6e-05,-3.4e-05,-0.000153,-3.5e-05,1.7e-05,1.2e-05,0.000119,-7.1e-05,-5.8e-05,-4.6e-05,0,5e-06,0.000197,9.7e-05,2.3e-05,-0.000102,-8.1e-05,0.000152,-8e-06,0.000321,2.8e-05,-2.2e-05,-4.9e-05,-0.000158,-0.00032,-9e-06,-4.1e-05,-7.3e-05,-0.000255,4.6e-05,0.000121,8.2e-05,2.9e-05,-0.000118,1.9e-05,0.000353,-0.000104,-5.7e-05,5.3e-05,-0.000116,-0.00022,4e-06,-0.000149,2.3e-05,-1e-04,-6.4e-05,2.4e-05,6.3e-05,-7e-05,5.3e-05,-5.9e-05,0,6.8e-05,-9.1e-05,8e-06,-3.8e-05,-7e-06,-6.1e-05,2.1e-05,3.8e-05,6.5e-05,0.000237,0.000108,2e-06,-3e-05,4e-05,0.000357,-6.4e-05,6.1e-05,-4.6e-05,0.000205,4.2e-05,-0.000153,-0.000162,7.2e-05,-4.2e-05,5.3e-05,-1.7e-05,-1.5e-05,0.000152,-3.8e-05,-2.4e-05,0.000155,7.5e-05,-5.4e-05
0.000205,-5e-05,-7.1e-05,3e-05,-1.7e-05,0.000113,0.000129,-0.00019,1.8e-05,4.7e-05,-5.3e-05,1.2e-05,-0.000267,-0.000198,0.000171,-0.000172,-7.8e-05,6.3e-05,-5.5e-05,-4e-06,-3.2e-05,-5.8e-05,-0.000275,-4.3e-05,5.8e-05,-0.00012,-5.5e-05,-0.000114,-1.5e-05,-8.9e-05,-0.000215,-7e-05,1.6e-05,-0.00011,0.000169,0.000133,7.6e-05,6.8e-05,2.1e-05,-3.8e-05,-6e-06,9.9e-05,-0.000116,-0.000155,9.4e-05,8.1e-05,-2.8e-05,0.00012,4e-06,0.000292,5.4e-05,-0.000126,-0.000117,-6.4e-05,2.3e-05,-7.8e-05,-0.00021,-9.9e-05,-9.4e-05,5.3e-05,0.000172,-4.4e-05,8.6e-05,0.000117,0.000224,-5.9e-05,7.6e-05,-0.000168,-8.9e-05,6.6e-05,0.000155,-0.000221,0.000161,-6.2e-05,-6e-05,0.000139,6.5e-05,3.3e-05,0.000125,-0.000277,1.1e-05,6.1e-05,1.1e-05,-5.9e-05,-2.2e-05,1.4e-05,2.2e-05,1e-06,-7.1e-05,1.2e-05,6.1e-05,-3.2e-05,0.000112,-3e-05,-1.8e-05,0,-3.7e-05,-9.6e-05,-0.00018,-6.2e-05,0.000146,-7.8e-05,-0.000147,-3.2e-05,-0.000164,0.000147,-2.5e-05,-0.000138,8.9e-05,0.000123,-5.3e-05,-3.9e-05,-6e-05,2.9e-05,-0.000101,-0.000215,8.3e-05,0.000101,-1.4e-05,-0.000178,-9e-06
-0.000174,-3e-05,-0.000229,-9.6e-05,-0.000218,4.9e-05,1e-06,1.2e-05,-3.9e-05,9e-06,2.6e-05,0.000113,0.000233,0.000173,2e-06,-1.2e-05,0.000101,-0.000143,-3.2e-05,0,-4e-05,-5e-06,5.8e-05,0.00014,-0.000118,0.000168,0.000129,-2.6e-05,-0.000122,-1.1e-05,0.000234,3.8e-05,6e-06,3e-05,-7.5e-05,0.000114,-7e-05,3.1e-05,0,-4.9e-05,-7.1e-05,-9.8e-05,9e-06,0.000187,5e-05,1.5e-05,-2.1e-05,-6.3e-05,-7.2e-05,-0.000266,6e-06,7.2e-05,0.000192,6e-06,-4.1e-05,9.6e-05,2.7e-05,0.000177,0.000375,5.3e-05,-9.7e-05,8.9e-05,-2.7e-05,-0.000102,-0.000112,-2.4e-05,-4.3e-05,2.1e-05,1e-05,-2.8e-05,-4.8e-05,0.000131,-6.5e-05,7.8e-05,-3.8e-05,-1e-05,4e-06,-2.6e-05,-2.1e-05,0.000229,0.000135,-4.2e-05,3.8e-05,-3.7e-05,7.1e-05,-7.2e-05,-1.2e-05,8.7e-05,5e-05,2.8e-05,-6.8e-05,-6.4e-05,-6e-05,5.5e-05,-5.7e-05,-6.3e-05,1.9e-05,2e-06,9.7e-05,8.3e-05,6.1e-05,-2.4e-05,-7.8e-05,7.3e-05,1e-05,-7e-06,-0.000117,0.000161,-9.2e-05,2.9e-05,-8.8e-05,0,-4.4e-05,-6e-06,-3e-06,0.000192,-0.000109,-7.5e-05,-3.9e-05,6.9e-05,6e-06
7.7e-05,-1.1e-05,0.000229,5e-05,0.000279,8.5e-05,2.4e-05,6.2e-05,-1.7e-05,-4.5e-05,-1e-05,-3e-06,-0.000193,-8.5e-05,-1.8e-05,0.000119,-0.000197,0.000133,0.000103,-4.8e-05,-5.6e-05,-3.8e-05,-0.000251,-7.7e-05,-5e-06,-8.6e-05,-9.5e-05,0.000107,7.5e-05,0,-0.000191,2.2e-05,2.2e-05,4.5e-05,0.000118,-0.00017,-3.9e-05,-8.6e-05,2.3e-05,1e-04,4.1e-05,1.1e-05,4.1e-05,9e-05,-8.2e-05,-0.000154,6e-06,2.6e-05,-1e-05,9e-06,-7e-06,-5e-05,2e-06,0,-1e-06,-8.7e-05,-2.2e-05,-2.8e-05,-0.000297,-2.6e-05,4.7e-05,-2.9e-05,-2.9e-05,-6.2e-05,8.5e-05,2.6e-05,-5.9e-05,0.000126,1e-06,6.4e-05,-0.000124,-8e-06,3.6e-05,0,4.4e-05,-3.4e-05,1.1e-05,-5.2e-05,-5.4e-05,-1.1e-05,-0.000118,-6.7e-05,-7.4e-05,8.5e-05,1.4e-05,7.8e-05,0,-5.8e-05,-4.9e-05,1.6e-05,3.7e-05,1.2e-05,0.000108,5.2e-05,4.6e-05,0.000119,-6e-05,7.9e-05,2.8e-05,-9.1e-05,-2.3e-05,4e-05,2e-06,-3.6e-05,-1.9e-05,-9.1e-05,0.000128,-0.000167,3.3e-05,1.6e-05,9.3e-05,1.2e-05,1.9e-05,-2.6e-05,4.3e-05,-0.000117,5e-05,-4e-06,2e-06,4.8e-05,8e-06
-0.000107,2e-05,-4.9e-05,3.5e-05,-0.000223,-0.000149,-0.000178,-6.9e-05,-2.1e-05,0.000107,8.5e-05,6e-05,0.000111,8.5e-05,1.7e-05,-3.2e-05,0.000122,-1.2e-05,-0.000106,3.3e-05,-1.7e-05,0.00012,0.000324,8.1e-05,5.7e-05,-2e-05,-3.4e-05,-8e-05,-5.3e-05,5.7e-05,9.5e-05,2.5e-05,3.3e-05,-5.3e-05,-0.00016,7.6e-05,5.2e-05,1.2e-05,-2.4e-05,-7e-05,3e-05,5.8e-05,-9.7e-05,3e-06,5e-05,0.000101,1.7e-05,-0.000164,1e-06,0.00014,0,0.00011,-0.00021,5.9e-05,-6.4e-05,-2e-05,6.8e-05,-3.8e-05,-1.5e-05,-8e-06,4.3e-05,-3.8e-05,1.5e-05,0.000109,-9.6e-05,-2.7e-05,1.5e-05,-0.000129,1.2e-05,-3.7e-05,0.000124,-8.5e-05,-9e-06,-5.8e-05,-4.8e-05,7.4e-05,1.7e-05,4.4e-05,7.5e-05,-0.000104,-2.5e-05,7.1e-05,-6e-06,-1.8e-05,-2.4e-05,-4.9e-05,-1.6e-05,-3.5e-05,6e-05,-2.4e-05,2.6e-05,6.1e-05,-3.4e-05,-1.9e-05,2.8e-05,-7.3e-05,8.2e-05,-5.9e-05,-4.9e-05,2.6e-05,-7.7e-05,2.1e-05,0.000121,4.8e-05,8.6e-05,6.4e-05,-9.7e-05,0.000108,5.1e-05,-9.1e-05,-1.6e-05,-4e-06,6.4e-05,2.1e-05,3e-06,7e-05,1.3e-05,0.000125,-5e-06,-9.4e-05,-1.4e-05
0.000118,-1e-06,-3.4e-05,-5.2e-05,0.00018,8.7e-05,0.000136,8.6e-05,3.7e-05,-9.9e-05,-1e-05,-5.2e-05,-5.4e-05,-9.5e-05,-8.3e-05,-4.4e-05,-9e-06,3e-06,7.1e-05,-5e-06,9.3e-05,-0.000112,-0.000183,-0.000104,-5e-06,1.3e-05,7e-05,4.1e-05,3.9e-05,-3.6e-05,-5e-05,-1.5e-05,-4e-05,8.6e-05,0.000119,7.2e-05,-3.9e-05,3.1e-05,2.3e-05,3.8e-05,-1.8e-05,-1.1e-05,0.000139,-7.1e-05,-4.4e-05,4.6e-05,1.4e-05,0.000169,2e-06,-7.9e-05,-8e-06,-3.8e-05,0.000176,-4.2e-05,5e-05,-1.6e-05,-5.3e-05,-6.6e-05,0.000103,-7e-06,-6.7e-05,3.9e-05,-2.7e-05,-4.6e-05,4.5e-05,1e-05,-2.3e-05,9.7e-05,-3.3e-05,-5e-06,-6.1e-05,7.3e-05,-2.5e-05,3.1e-05,1.2e-05,-6.2e-05,-2.6e-05,4.5e-05,-5.2e-05,3.8e-05,0.00011,-1.4e-05,-1.3e-05,-4.1e-05,-2.5e-05,-4.1e-05,4.2e-05,2.6e-05,-4.4e-05,-2.2e-05,-2.9e-05,3.7e-05,-7e-06,-7.1e-05,-7.5e-05,-2.3e-05,-2.8e-05,-2.7e-05,1e-06,1.3e-05,3.1e-05,2.2e-05,-0.000139,1.6e-05,-8.2e-05,3.8e-05,4.3e-05,-0.000101,-4.9e-05,8e-06,-1.8e-05,1.8e-05,-2.1e-05,-1.6e-05,-6e-06,-3.1e-05,-4.6e-05,-3.9e-05,1.7e-05,5.4e-05,9e-06
-6.3e-05,1.4e-05,-6.3e-05,2.3e-05,-0.000102,-1.4e-05,2e-05,-1.4e-05,2.6e-05,4.4e-05,-0.00011,-8.1e-05,-4e-06,4.6e-05,6e-06,4.9e-05,-2.2e-05,1.5e-05,-1.9e-05,-2.6e-05,-2.1e-05,2.8e-05,0.000114,5.1e-05,1.7e-05,-9e-06,-7.5e-05,2.5e-05,1.5e-05,-1.7e-05,2e-06,3.5e-05,2.5e-05,-9.1e-05,-6.8e-05,-8.1e-05,2.6e-05,-2.7e-05,-6e-06,-7e-06,-1.6e-05,-4.9e-05,-7.7e-05,-7.6e-05,6.3e-05,-0.000111,-1.1e-05,-6.8e-05,3.3e-05,-1.6e-05,-3e-06,-6.8e-05,-8.7e-05,-4.3e-05,1.9e-05,-6e-06,6e-05,4e-05,-4.6e-05,5e-06,1.3e-05,-3e-06,6e-06,-2e-06,-1e-06,-3e-06,-1.6e-05,-4.9e-05,1e-05,-3e-06,2.7e-05,-2.7e-05,5.1e-05,1.7e-05,-2e-06,1e-05,2.4e-05,-4e-05,4.2e-05,1.2e-05,-2e-05,-3.1e-05,-2.1e-05,4e-05,2.4e-05,9.6e-05,9e-06,1.8e-05,6e-05,1.1e-05,2e-05,-4.3e-05,-1.1e-05,-2.4e-05,-3e-06,3.8e-05,2e-05,0.000106,3.6e-05,-3.1e-05,6.1e-05,-4.6e-05,0.000103,-7.9e-05,3.3e-05,-6.7e-05,4.5e-05,7.2e-05,7.6e-05,4.2e-05,1.7e-05,-8e-06,-2.3e-05,3.2e-05,1e-06,-2.6e-05,4.7e-05,-0.000119,7e-06,1e-05,-1.7e-05
6e-05,0,6.3e-05,5e-06,0.000123,7.1e-05,-2.7e-05,-5.8e-05,-7.3e-05,-2.5e-05,3.7e-05,4.7e-05,-8e-06,3e-06,8.3e-05,-2.7e-05,-1.4e-05,-4.6e-05,-3e-06,2.3e-05,-2.5e-05,8e-06,-2.4e-05,-7.9e-05,-9e-06,1e-05,5.7e-05,-9.2e-05,-2e-06,6e-06,-5.9e-05,-7e-06,-3.5e-05,3.7e-05,4.1e-05,-1.9e-05,3.1e-05,2.9e-05,6.3e-05,3e-06,1.7e-05,5.3e-05,9e-06,0.000113,1.2e-05,0,-1.7e-05,-8e-06,-2e-06,3.4e-05,0,2.3e-05,2e-05,7.5e-05,3e-05,3.1e-05,7e-06,1.9e-05,3.4e-05,-1e-06,6e-05,1.8e-05,1.7e-05,4.1e-05,-3e-06,-1.4e-05,2e-05,-3e-06,4.2e-05,2.1e-05,-2.6e-05,4.7e-05,-3e-05,-4.7e-05,-8e-06,3.6e-05,-2e-06,-3e-05,-3.8e-05,5e-05,-6.6e-05,2.6e-05,6.5e-05,-5e-06,2e-06,-0.000103,-3.8e-05,4e-06,-4.4e-05,6e-06,-2.3e-05,-9e-06,2.6e-05,6.7e-05,5.9e-05,4e-06,-5.4e-05,-8.3e-05,-2.4e-05,5.3e-05,-6.2e-05,-3e-06,-0.000102,6.1e-05,2e-06,-7e-06,-9.6e-05,-2.4e-05,-9e-05,-3.9e-05,-3e-06,-1.2e-05,-2.3e-05,-3.1e-05,-1.5e-05,2.1e-05,-2.3e-05,3.4e-05,-3.5e-05,-2.1e-05,6e-06
-6.2e-05,0,3.5e-05,-2.5e-05,-0.000185,-0.00013,-8e-06,4.4e-05,-1.5e-05,1.3e-05,9.2e-05,5.6e-05,2.7e-05,-1.8e-05,1.3e-05,1.2e-05,2.5e-05,4e-06,3e-05,2e-06,-2e-06,3.9e-05,1.8e-05,4.5e-05,2.8e-05,-2e-06,-2.7e-05,8e-05,-1e-06,2.8e-05,6.3e-05,-2.5e-05,1.1e-05,8e-06,-7e-06,6.5e-05,-1.7e-05,-4.5e-05,-4.7e-05,8e-06,1.2e-05,-6e-06,2.1e-05,-3.5e-05,-9.5e-05,6.4e-05,-1e-06,4.6e-05,-3.6e-05,-1.5e-05,-1.2e-05,1.5e-05,3.4e-05,-4.7e-05,-6e-06,1.7e-05,4.1e-05,-1.8e-05,-6.8e-05,1.2e-05,-9.7e-05,-3.5e-05,5e-06,-5e-05,9e-06,1.3e-05,3.6e-05,1.4e-05,-5.1e-05,-2e-05,2.4e-05,-0.000112,2.3e-05,3.4e-05,1.9e-05,-5.8e-05,-2.4e-05,3.2e-05,-8e-06,-0.000106,4e-06,5e-06,-2.5e-05,-3.5e-05,-8e-06,8.4e-05,1e-06,-4.2e-05,1.8e-05,8e-06,-7e-06,-1.2e-05,-7.2e-05,-4.9e-05,-2.5e-05,-1.4e-05,1.9e-05,2.8e-05,-7e-06,-3.6e-05,-4.2e-05,-4e-06,8.9e-05,-3e-05,9e-06,5.6e-05,4.9e-05,1.1e-05,2.6e-05,2.3e-05,2.9e-05,1.7e-05,3.3e-05,2.1e-05,-1e-05,-1.5e-05,-5e-06,8.1e-05,-4e-06,-2.3e-05,1.2e-05
3.8e-05,1.1e-05,-1.7e-05,2.4e-05,0.000122,5.4e-05,-1.3e-05,-3.7e-05,4.9e-05,2.7e-05,-7.9e-05,-6e-06,-2.9e-05,1.7e-05,-2.2e-05,-2e-06,2.7e-05,6e-06,-6.6e-05,-1e-06,-1.5e-05,-6.5e-05,-7e-06,2.1e-05,-2.3e-05,5e-06,7e-06,-3.2e-05,1.4e-05,1e-06,-7.9e-05,7e-06,2e-05,-9e-06,-1.1e-05,-2.7e-05,2.5e-05,4.5e-05,1.3e-05,-2e-06,-1e-05,-2.8e-05,-3.3e-05,-3.2e-05,2.9e-05,-7e-06,1e-06,-4.1e-05,1e-05,-1.1e-05,-7e-06,7e-06,-2e-05,-1.7e-05,-3.1e-05,-1.1e-05,-3.4e-05,-6.6e-05,4.6e-05,-3e-06,7e-05,1.1e-05,-1.9e-05,5.4e-05,-2.1e-05,-1.2e-05,1.4e-05,-2e-06,1.9e-05,4e-06,3e-06,9.2e-05,-3.2e-05,2e-05,3e-06,2.4e-05,2.6e-05,1.6e-05,4.4e-05,7.3e-05,4e-05,-1.8e-05,1.5e-05,-4e-06,1.2e-05,-1.5e-05,5e-06,2.5e-05,6e-06,1.6e-05,3.1e-05,8e-06,3.4e-05,2e-05,1.7e-05,-3e-06,1.2e-05,7e-06,1.6e-05,1.1e-05,6.9e-05,1.5e-05,-5.6e-05,-1.1e-05,-3.6e-05,-1.7e-05,1.8e-05,-6e-06,-2.4e-05,7e-06,-4.9e-05,-7e-06,9e-06,-2.5e-05,1.4e-05,4.8e-05,2.8e-05,-1.9e-05,-5e-06,4.3e-05,-1e-05
-4.4e-05,-2.3e-05,-0.000119,-5e-06,-6.6e-05,-2.3e-05,9.8e-05,4.3e-05,2.1e-05,-5.7e-05,-1e-05,9e-06,4.9e-05,-3.5e-05,-2.9e-05,-1.1e-05,-4.1e-05,1e-05,6.6e-05,6e-06,2.7e-05,1.4e-05,6.7e-05,-1.9e-05,-2.2e-05,1.6e-05,5.4e-05,2e-06,-4.1e-05,-2.3e-05,5.2e-05,-1.4e-05,-3.7e-05,2.9e-05,-5e-06,-3.3e-05,-1.5e-05,-4.3e-05,-2.4e-05,1.4e-05,-3e-06,1.4e-05,2.5e-05,2e-06,3.4e-05,-5e-05,7e-06,2.4e-05,3.8e-05,-7e-06,5e-06,-1.2e-05,-4.3e-05,5.3e-05,-2.7e-05,3.2e-05,-1.3e-05,9.2e-05,1.3e-05,1e-06,-1e-05,6e-06,1.1e-05,-4.6e-05,2.6e-05,-5e-06,-2.8e-05,-1e-05,-2e-06,8e-06,-3.2e-05,-1.7e-05,6e-06,-5.4e-05,-7e-06,1.2e-05,-2e-06,-1.3e-05,-4.1e-05,1.7e-05,1e-06,1.6e-05,-1e-06,2.3e-05,0,-4.5e-05,8e-06,7e-06,-2.2e-05,0,-2.3e-05,2.4e-05,3.3e-05,-1.9e-05,-8e-06,6e-06,6e-06,-6e-06,-2e-06,-1e-06,1.9e-05,7e-06,1.2e-05,2.8e-05,2e-06,-3.5e-05,-5.4e-05,7e-06,1.6e-05,-1.7e-05,2e-06,-3e-06,-9e-06,2.3e-05,1.1e-05,-4.9e-05,-4.6e-05,-4.7e-05,4e-06,-3.1e-05,1e-06
5.5e-05,6e-06,0.000176,-1.3e-05,5.3e-05,6.6e-05,-0.000135,-4e-06,-3.3e-05,3.8e-05,4.3e-05,-3.7e-05,-3.9e-05,4e-05,-3.6e-05,4e-06,-2e-06,-1.1e-05,-5.7e-05,-1.5e-05,4e-06,3.3e-05,-0.00016,3.6e-05,3.4e-05,-3.7e-05,-6.7e-05,1.9e-05,2.5e-05,-9e-06,-4.9e-05,8e-06,1.7e-05,-6.5e-05,2.1e-05,1.3e-05,-3.2e-05,1.6e-05,6e-06,-2.7e-05,6e-06,2.4e-05,0,2.8e-05,-4.1e-05,3e-05,6e-06,2.1e-05,-3.4e-05,1.2e-05,1e-06,-5.8e-05,8.9e-05,-3.6e-05,1e-05,-5e-06,-1.9e-05,5e-06,3.9e-05,2e-06,-3.9e-05,2e-06,-9e-06,-1.5e-05,-3.3e-05,6e-06,-2e-05,7e-06,-1e-06,-1.5e-05,2.4e-05,-1.1e-05,9e-06,2.8e-05,-3e-06,-4.1e-05,-1e-05,-1.8e-05,2.5e-05,-5.5e-05,-2.8e-05,7e-06,-4.2e-05,9e-06,-8e-06,5.4e-05,0,0,3.5e-05,-3e-06,-2e-06,1.7e-05,-5.3e-05,2.9e-05,1.9e-05,-1.3e-05,1e-06,8e-06,-1.2e-05,-2.8e-05,-3e-05,0,-2.1e-05,-2.7e-05,2.2e-05,4.2e-05,7e-05,3e-06,8e-06,6.2e-05,3.2e-05,6e-06,-1.9e-05,-1.2e-05,-1.5e-05,4e-05,4.3e-05,3.7e-05,2.9e-05,7e-06,3e-06
-3.7e-05,3e-06,-9.1e-05,1.2e-05,-1.9e-05,-6.2e-05,1.6e-05,-5.7e-05,-4.3e-05,-1.7e-05,-1e-05,-3.1e-05,2.7e-05,-2.8e-05,2.7e-05,-8e-06,1.4e-05,3.1e-05,5.9e-05,5e-06,-1.6e-05,-1.7e-05,8.2e-05,-2.1e-05,-4e-06,2.5e-05,2.6e-05,-2.8e-05,-1.9e-05,2.9e-05,4.5e-05,1.4e-05,-8e-06,5.5e-05,-1.4e-05,3.2e-05,1.3e-05,2.4e-05,-4e-06,1e-05,-4e-06,-4e-05,-2.9e-05,4.1e-05,4.4e-05,3.1e-05,-5e-06,-5.8e-05,-1.6e-05,4e-06,4e-06,2.3e-05,-6e-05,4e-06,1.5e-05,-8e-06,3e-06,-1.4e-05,-0.000125,-7e-06,5.1e-05,-6e-06,1.1e-05,4.8e-05,4.4e-05,-5e-06,1e-06,-1e-06,2e-05,2e-05,2.4e-05,-6e-06,-7e-06,1.6e-05,1.8e-05,3.9e-05,0,6e-06,-1.4e-05,9e-06,1.9e-05,-8e-06,3e-05,-1.6e-05,-1.1e-05,-4.6e-05,1e-06,-2.1e-05,-3.6e-05,9e-06,1e-05,-2.2e-05,4.6e-05,8e-06,-3.3e-05,2e-05,-3.2e-05,0,4e-06,2.4e-05,-2.1e-05,-1e-06,3.7e-05,1e-05,-2.2e-05,6e-06,-5.1e-05,-2e-05,-6e-06,-2.9e-05,-1.6e-05,-6e-06,8e-06,8e-06,-8e-06,-4.2e-05,-3.4e-05,-9e-06,-1.3e-05,2e-06,-5e-06
1.2e-05,0,1e-06,-1e-05,3.6e-05,0,1e-04,8.3e-05,6.1e-05,2.6e-05,-5e-06,2.5e-05,-1.9e-05,1.8e-05,3.5e-05,7e-06,1.9e-05,-3.3e-05,-4.6e-05,9e-06,-1e-06,-8e-06,-8.3e-05,6e-06,2e-06,-9e-06,-2.4e-05,2.3e-05,-1e-06,-5e-06,-3.1e-05,-1e-05,1.4e-05,-2.3e-05,-5e-06,-4e-05,-1.3e-05,-3.9e-05,-3e-06,-5e-06,6e-06,1.9e-05,2.9e-05,-1.9e-05,-4e-05,-2.7e-05,-6e-06,6.7e-05,3.1e-05,-1.2e-05,5e-06,2.5e-05,-1.6e-05,1.3e-05,1.4e-05,-3.1e-05,-3e-06,-2.8e-05,7.8e-05,-3e-06,-2.5e-05,-7e-06,6e-06,-2e-05,-4.5e-05,6e-06,2e-06,1.9e-05,-2.3e-05,-2.2e-05,-6.6e-05,7e-06,8e-06,-3.4e-05,-1.2e-05,-1.2e-05,4e-06,1.1e-05,-2e-06,1.6e-05,-5e-06,-6e-06,-1.8e-05,1e-05,2.1e-05,3e-06,4e-06,8e-06,3.5e-05,-1.2e-05,-1.2e-05,-3e-06,-3e-06,-2.7e-05,-1.1e-05,-4e-06,2.5e-05,-1.3e-05,1.3e-05,-1.7e-05,1.9e-05,-1.7e-05,-5e-05,1.4e-05,1.7e-05,-3.7e-05,-7e-06,3e-05,-2.2e-05,-3.5e-05,-5e-06,0,1.6e-05,-1e-05,1e-05,2.6e-05,1.8e-05,-3.8e-05,0,3e-06,5e-06
-1.6e-05,7e-06,-2.8e-05,1e-05,-7.1e-05,-1.1e-05,-9e-05,-6.9e-05,4e-06,-1.5e-05,9e-06,2e-05,8e-06,-1.8e-05,-1.1e-05,-1.2e-05,-2.5e-05,1.5e-05,2.1e-05,-6e-06,-1.3e-05,-1.1e-05,7.5e-05,-1.8e-05,-1.3e-05,-3e-06,-7e-06,-1e-05,1e-05,-1.7e-05,2.3e-05,8e-06,-1.1e-05,1.3e-05,1.6e-05,-1e-05,-7e-06,1.7e-05,9e-06,-3e-06,-1.1e-05,7e-06,-2.1e-05,-6.7e-05,2e-05,-2e-05,-4e-06,-4.3e-05,7e-06,1.7e-05,-2e-06,-1.3e-05,4.4e-05,-1e-05,1.2e-05,-1.7e-05,-4e-06,-1.9e-05,2.5e-05,1.1e-05,-1.8e-05,1.4e-05,-1.2e-05,0,3.6e-05,1e-06,3e-06,-3.1e-05,4e-06,1.4e-05,4e-05,1.1e-05,-1e-05,1.9e-05,3e-06,-2.3e-05,6e-06,-4e-06,2e-05,2.7e-05,-6e-06,1.1e-05,1.2e-05,2.7e-05,3e-06,3.3e-05,-9e-06,1.7e-05,-3.4e-05,3e-06,1.7e-05,0,-2.8e-05,0,3.7e-05,-1.2e-05,-1.4e-05,2.7e-05,-1.4e-05,5e-06,1.7e-05,7e-06,2.3e-05,-2.6e-05,-1.7e-05,1.8e-05,5.8e-05,-4.9e-05,1e-06,3e-05,3e-06,1e-05,-1e-06,6e-06,6e-06,-7e-06,-4e-06,3.4e-05,2e-06,-1.4e-05,-1e-06
2.8e-05,-7e-06,9.8e-05,3e-06,3.4e-05,4.5e-05,2.2e-05,3.1e-05,-1.5e-05,-1.9e-05,-1e-05,0,-1.6e-05,1.5e-05,-6e-06,2.8e-05,-1.7e-05,-1.5e-05,2e-06,1e-06,1.7e-05,3.9e-05,-1.8e-05,7e-06,-6e-06,1.4e-05,4.8e-05,-2e-06,-5e-06,5e-06,-2e-05,4e-06,5e-06,0,-2e-05,3.9e-05,2.4e-05,2e-06,1.4e-05,1.2e-05,9e-06,-1.4e-05,1.2e-05,5.5e-05,1.8e-05,2.6e-05,2e-06,2.9e-05,-2.8e-05,-2e-06,1e-06,2e-06,-2.1e-05,2e-06,-1.8e-05,3e-05,1.4e-05,2.6e-05,-6.9e-05,2e-06,4.7e-05,-1e-06,-1e-06,7e-06,-3.5e-05,-5e-06,1.5e-05,1.5e-05,-7e-06,1e-06,2.4e-05,-2.6e-05,2e-06,1.2e-05,-4e-06,3.8e-05,-1.5e-05,-7e-06,-2.5e-05,-5.7e-05,3e-06,2e-06,2e-05,-2.6e-05,-9e-06,-3.2e-05,-7e-06,-1e-05,2.7e-05,-9e-06,-5e-06,-1e-06,1.1e-05,1.9e-05,-1.2e-05,3e-06,2.7e-05,-2.5e-05,1e-05,1.7e-05,-1.2e-05,4e-06,-9e-06,1.9e-05,2.6e-05,2.1e-05,-6.2e-05,5.4e-05,-2.2e-05,-3e-06,1.4e-05,-3e-06,-1.8e-05,0,-7e-06,2e-06,0,2.6e-05,-4e-06,2.4e-05,-5e-06
-2.1e-05,-1e-06,-7.7e-05,-1.2e-05,1.4e-05,-5e-06,-2e-06,1.6e-05,-4.1e-05,2.5e-05,-1.3e-05,0,1.9e-05,-2e-06,-3e-05,-1.2e-05,2.2e-05,9e-06,-2.4e-05,-2e-06,6e-06,-3e-05,1.9e-05,-8e-06,9e-06,-9e-06,-3.9e-05,1.6e-05,8e-06,1.2e-05,1.8e-05,-1.1e-05,7e-06,-2.6e-05,2.5e-05,-1.4e-05,-4e-06,7e-06,-1.3e-05,-5e-06,-5e-06,-3e-06,1.4e-05,-3.6e-05,-3.7e-05,5e-06,5e-06,-2.5e-05,4e-06,-1.4e-05,3e-06,-3.2e-05,-4e-06,-8e-06,-1.2e-05,0,6e-06,-1.2e-05,6.4e-05,-6e-06,-3.6e-05,-5e-06,6e-06,-1.9e-05,3.7e-05,4e-06,8e-06,0,1.2e-05,-5e-06,-5.7e-05,4.2e-05,6e-06,-2.8e-05,-2e-06,-2.5e-05,9e-06,6e-06,1.5e-05,2e-05,1e-06,-1.1e-05,-2.6e-05,-1.2e-05,-2e-06,1.8e-05,9e-06,-7e-06,-3e-05,2e-06,-1.3e-05,-9e-06,1.3e-05,2.7e-05,0,1e-06,-3.3e-05,5e-06,-6e-06,-2.3e-05,-2.2e-05,8e-06,1.2e-05,-1.4e-05,-2.9e-05,-2.9e-05,3.1e-05,-5.8e-05,2.6e-05,-2.4e-05,-7e-06,-1e-05,2e-06,0,-3e-06,2e-06,-2e-06,-2e-05,9e-06,-2.1e-05,5e-06
1.7e-05,1e-06,8e-06,1.1e-05,-3.9e-05,-1.6e-05,2.2e-05,-4.8e-05,4.3e-05,-1.5e-05,2.2e-05,-1.9e-05,-2.5e-05,-5e-06,7e-06,-1.3e-05,1e-05,2e-06,3.6e-05,-3e-06,-1.1e-05,3e-06,-3.3e-05,2e-05,-1e-06,1e-05,3.7e-05,-2.4e-05,7e-06,0,-2.9e-05,3e-06,-8e-06,3.4e-05,-2.5e-05,-1.8e-05,3e-06,-2.8e-05,8e-06,3e-06,0,2e-05,-2.1e-05,5.2e-05,1.7e-05,-2.3e-05,1e-06,2.6e-05,1.3e-05,1.9e-05,-3e-06,1.9e-05,3.1e-05,1.5e-05,-8e-06,2.8e-05,2.1e-05,2.2e-05,-5.5e-05,-2e-06,-1e-06,2e-06,-4e-06,2.1e-05,-3e-05,0,-7e-06,-1.2e-05,-5e-06,8e-06,3.3e-05,-5.9e-05,-1e-06,1.4e-05,-5e-06,-5e-06,0,2e-06,-6e-06,2.4e-05,1e-06,2e-06,1.9e-05,1.3e-05,3e-06,1.5e-05,4e-06,-3e-06,2.4e-05,3e-06,1.5e-05,1.4e-05,-3.2e-05,-3.3e-05,-1e-06,6e-06,1.5e-05,1.1e-05,-7e-06,2.6e-05,1.4e-05,-4e-06,-1.6e-05,-1e-06,2.2e-05,0,1.4e-05,5.2e-05,-2e-06,1.5e-05,-1.9e-05,4e-06,1e-05,3e-06,3e-06,-9e-06,9e-06,-2.5e-05,-4e-06,7e-06,-1e-06
-1.2e-05,-1e-06,-3.3e-05,-7e-06,5.8e-05,-1.9e-05,-2e-06,3.3e-05,1.2e-05,1.7e-05,8e-06,-6e-06,3e-05,6e-06,4.5e-05,8e-06,-1.6e-05,2e-06,-4.3e-05,5e-06,-6e-06,-2e-06,7.5e-05,-1.3e-05,-8e-06,-1.2e-05,-1.8e-05,2e-05,-9e-06,-1.1e-05,1.9e-05,-2e-06,3e-06,-2.3e-05,2e-05,2.6e-05,1.2e-05,4e-05,-1.2e-05,-4e-06,2e-06,-1.8e-05,1.5e-05,-5.1e-05,1.9e-05,6e-06,-2e-06,-1.4e-05,-4e-06,-1e-05,-1e-06,1.9e-05,-4.2e-05,-1.3e-05,4e-06,-2.3e-05,-1.5e-05,0,4.5e-05,1e-06,3.1e-05,2e-06,0,-1.8e-05,2.2e-05,-1e-06,-1.1e-05,2.7e-05,-1e-06,-1.6e-05,2.2e-05,6e-05,3e-06,1e-05,7e-06,3.5e-05,1e-06,-5e-06,2e-06,-1.8e-05,4e-06,9e-06,-2e-05,-2e-06,2e-06,-4.3e-05,-4e-06,1.8e-05,-2.2e-05,-4e-06,-4e-06,5e-06,2.8e-05,2e-06,9e-06,-6e-06,-1e-05,-1.4e-05,1.6e-05,-1.3e-05,2.4e-05,-5e-06,9e-06,1.7e-05,-7e-06,2.4e-05,-5e-05,-3.1e-05,0,8e-06,1.5e-05,0,7e-06,-7e-06,2e-06,8e-06,-1.5e-05,1.3e-05,-3e-06,0,-3e-06
-5e-06,3e-06,0.000114,1e-06,-3.8e-05,2.5e-05,-4e-05,3e-06,-1.2e-05,-1.8e-05,-2.7e-05,1.6e-05,-2.1e-05,-1.2e-05,-7e-06,6e-06,-3e-06,-2e-06,4.4e-05,1e-06,0,2.3e-05,-6.8e-05,8e-06,3e-06,1e-06,-2e-05,-5e-06,7e-06,-3e-06,-3.2e-05,-5e-06,-9e-06,1.9e-05,-2.1e-05,2e-06,-1.3e-05,-3e-05,7e-06,3e-06,-2e-06,1e-06,-8e-06,2.7e-05,-1.9e-05,2e-05,-3e-06,-6e-06,5e-06,-1.3e-05,0,-1.8e-05,2e-05,-2e-06,1.1e-05,-1.2e-05,7e-06,-1e-05,1e-06,0,-3.8e-05,-1e-06,5e-06,1e-06,-1.5e-05,1e-06,-6e-06,-2.1e-05,4e-06,1.7e-05,-4.5e-05,-3.7e-05,-5e-06,-1.6e-05,0,-3.4e-05,-4e-06,0,6e-06,-1e-05,-3e-06,-1.1e-05,-4e-06,-1.9e-05,0,3.2e-05,-1e-06,-8e-06,1.3e-05,-1e-06,-2e-06,-7e-06,2e-06,-1e-06,-4e-06,2e-06,1.8e-05,-1e-06,-9e-06,-1e-06,-1.3e-05,0,-3e-06,-9e-06,3e-06,-1.5e-05,5.2e-05,1e-05,5e-06,1.1e-05,1.1e-05,1e-06,-9e-06,8e-06,1e-06,-1.1e-05,1.2e-05,8e-06,1e-06,1e-05,4e-06
-3e-06,-1e-06,-0.000118,2e-06,1.6e-05,2e-05,4.7e-05,-2.5e-05,-3e-05,2e-06,3e-06,6e-06,1.6e-05,1.6e-05,-1.5e-05,6e-06,1.5e-05,-4e-06,-3.2e-05,-1e-06,6e-06,-2.2e-05,4.6e-05,1e-06,1.1e-05,2e-06,2.7e-05,-1.1e-05,-7e-06,9e-06,1.9e-05,7e-06,3e-06,-2.1e-05,3.2e-05,-1.4e-05,-2e-06,5e-06,-5e-06,0,2e-06,1.1e-05,-6e-06,9e-06,4e-06,-1.2e-05,-1e-06,1.1e-05,-5e-06,2.6e-05,-3e-06,8e-06,7e-06,1.8e-05,1.8e-05,7e-06,-2.2e-05,-1.4e-05,-3e-05,1e-06,2.2e-05,2e-06,-9e-06,2.1e-05,2e-06,-3e-06,2e-06,-6e-06,2e-06,-8e-06,1.2e-05,8e-06,2e-06,5e-06,-2e-06,1.6e-05,1e-06,5e-06,-1.6e-05,4e-06,-8e-06,-3e-06,1.6e-05,1.1e-05,0,-1.1e-05,-1e-06,-7e-06,-4e-06,-3e-06,4e-06,-1.4e-05,-1.6e-05,2.9e-05,-1.8e-05,-1e-06,-4e-06,8e-06,-8e-06,1.3e-05,-2.1e-05,0,1.4e-05,2e-06,-5e-06,-1.2e-05,-1.2e-05,1e-05,-2.8e-05,-1.9e-05,-1.3e-05,5e-06,-1e-05,-7e-06,0,1.4e-05,-1e-06,-9e-06,-3e-06,-2.1e-05,-4e-06
1.7e-05,0,5.2e-05,-2e-06,-4.4e-05,-1.9e-05,-1.7e-05,2.4e-05,1.6e-05,1.4e-05,2.2e-05,1e-06,-6e-06,-1e-05,-1.8e-05,-1e-05,1e-06,0,1.8e-05,-1e-06,6e-06,-5e-06,-6.5e-05,-1.4e-05,-7e-06,-5e-06,-3.7e-05,2e-05,-4e-06,4e-06,-2.1e-05,-2e-06,3e-06,9e-06,-3.5e-05,6e-06,-1e-06,1.2e-05,-2e-06,-1e-06,-4e-06,-7e-06,1.4e-05,0,-6e-06,-1.1e-05,1e-06,-2e-05,-8e-06,-1.2e-05,0,-1.6e-05,-8e-06,-2e-05,-7e-06,-1.1e-05,1.2e-05,2e-05,-1e-05,7e-06,6e-06,-6e-06,3e-06,-9e-06,8e-06,0,3e-06,1.9e-05,-4e-06,5e-06,2.2e-05,3e-06,1e-06,8e-06,5e-06,1.5e-05,3e-06,-1e-06,1.5e-05,2.4e-05,2e-06,1.2e-05,-2e-05,1.8e-05,2e-06,-2.1e-05,-1e-06,0,-8e-06,-1e-06,-7e-06,1e-06,9e-06,-5e-06,1.6e-05,1e-06,-1e-05,-9e-06,2e-05,-2e-05,1e-05,4e-06,-1.2e-05,6e-06,-2e-06,2e-05,-3.3e-05,-2.2e-05,2.2e-05,-1e-06,-2e-06,-5e-06,7e-06,9e-06,-4e-06,-8e-06,-1.3e-05,1.8e-05,0,1.8e-05,0
-1e-06,0,-2.7e-05,1e-06,7.3e-05,-2e-05,-7e-06,-1.1e-05,2.4e-05,-1.3e-05,-1e-05,-4e-06,-1e-06,3e-06,-1.4e-05,-9e-06,-1.7e-05,0,-3e-06,0,-1.1e-05,1.8e-05,1.3e-05,1.3e-05,-1e-05,5e-06,3.9e-05,-1.9e-05,3e-06,-1.2e-05,1.5e-05,-1e-06,-1e-06,7e-06,3e-05,5e-06,-1.3e-05,-1e-05,5e-06,0,3e-06,-6e-06,-1.4e-05,-2.5e-05,0,1.1e-05,2e-06,2.9e-05,1.1e-05,-1.2e-05,1e-06,1.6e-05,-1.1e-05,1e-05,-9e-06,2.9e-05,-2.2e-05,3e-06,5e-05,-4e-06,-2.9e-05,4e-06,4e-06,-7e-06,-1.2e-05,0,4e-06,-1.7e-05,-3e-06,-7e-06,-2.6e-05,-5e-06,0,-1.1e-05,-1e-06,-3.3e-05,-2e-06,-6e-06,-8e-06,-2.4e-05,8e-06,-6e-06,2.2e-05,-5e-06,-4e-06,4.3e-05,-1e-06,1e-05,1.6e-05,1e-06,5e-06,1e-06,7e-06,-2.4e-05,1e-06,3e-06,4e-06,8e-06,-6e-06,1.5e-05,1.6e-05,0,2e-06,-1.2e-05,1.3e-05,-2e-06,5.1e-05,2.9e-05,-1.2e-05,2.1e-05,5e-06,-2e-06,8e-06,-9e-06,-2e-06,4e-06,1.9e-05,-4e-06,-1e-06,-7e-06,4e-06
-1.5e-05,-1e-06,7.6e-05,1e-06,-8.1e-05,6e-06,-3e-06,-9e-06,-1e-05,6e-06,-1e-05,-1.1e-05,3e-06,1e-06,3.2e-05,6e-06,1e-06,7e-06,-1.6e-05,1e-06,2e-06,-4e-06,-2e-05,-1.9e-05,1e-05,3e-06,-8e-06,9e-06,-4e-06,3e-06,-9e-06,5e-06,1e-06,-1.1e-05,-2.9e-05,-4e-06,6e-06,4e-06,1e-06,-5e-06,0,1.3e-05,8e-06,1.6e-05,1.3e-05,2e-06,1e-06,-9e-06,9e-06,2.6e-05,-2e-06,5e-06,2e-05,2e-06,-1.2e-05,-4e-06,1.5e-05,-7e-06,-2.3e-05,-5e-06,2.7e-05,0,-4e-06,-3e-06,1.7e-05,-2e-06,5e-06,1e-05,3e-06,-1e-06,1.2e-05,1.8e-05,1e-06,5e-06,2e-06,2.8e-05,-4e-06,0,2e-06,-4e-06,0,-6e-06,-9e-06,-7e-06,-2e-06,-2.8e-05,3e-06,1e-06,-2.2e-05,0,0,1.1e-05,-2.1e-05,6e-06,0,-3e-06,-7e-06,-8e-06,-1.8e-05,-7e-06,-5e-06,-1e-06,4e-06,1e-05,-1.3e-05,-1.9e-05,-3.7e-05,-2.9e-05,2.1e-05,-2.2e-05,4e-06,7e-06,-2e-06,9e-06,4e-06,-4e-06,-1.2e-05,-1.5e-05,-3e-06,4e-06,-4e-06
9e-06,0,-0.000108,0,8.6e-05,3.1e-05,9e-06,2.5e-05,-2.1e-05,-3e-06,7e-06,-1e-06,-3e-06,-4e-06,1.7e-05,1.3e-05,1.4e-05,-5e-06,3e-05,1e-06,0,-5e-06,4.4e-05,1.7e-05,2e-06,-5e-06,-1.2e-05,4e-06,2e-06,7e-06,2.3e-05,-3e-06,2e-06,9e-06,3.1e-05,-1e-06,0,-7e-06,-2e-06,1e-06,-3e-06,-6e-06,3e-06,-2.8e-05,-1.2e-05,-1e-05,-1e-06,-2e-05,-1.6e-05,-1.3e-05,1e-06,-9e-06,-5e-06,-9e-06,-2e-06,-5e-06,-1.7e-05,-2.1e-05,-3.1e-05,1e-06,-3e-06,-4e-06,2e-06,3e-06,-2.4e-05,0,1e-06,3e-06,1e-06,1e-05,3e-06,-3.4e-05,-4e-06,2e-06,-3e-06,-6e-06,6e-06,7e-06,3e-06,2e-05,-1e-05,7e-06,-6e-06,1.3e-05,7e-06,4e-06,2e-06,-1.3e-05,2.6e-05,1e-06,-3e-06,5e-06,8e-06,3e-06,7e-06,1e-06,2.3e-05,5e-06,1.7e-05,-6e-06,-1.5e-05,-2e-06,3e-06,-4e-06,1.1e-05,1.5e-05,3e-06,2.3e-05,4e-06,-6e-06,-1.1e-05,0,-7e-06,-9e-06,5e-06,-1e-06,-4e-06,1e-06,1e-06,-1e-05,0
-2e-06,0,6.1e-05,0,-6.5e-05,-8e-06,2.2e-05,-2.6e-05,0,-3e-06,2e-06,7e-06,0,8e-06,-1.3e-05,-1e-06,1e-06,7e-06,-4e-05,0,1e-06,-1.2e-05,-4.6e-05,-9e-06,-2e-06,7e-06,2.6e-05,-1.5e-05,4e-06,-1e-06,-1e-05,-1e-06,-1e-06,-1.5e-05,-2.7e-05,-3e-06,-2e-06,1.7e-05,3e-06,1e-06,3e-06,-6e-06,-1.2e-05,5.6e-05,-6e-06,0,-1e-06,3.3e-05,-5e-06,-1.4e-05,2e-06,1.2e-05,-7e-06,8e-06,4e-06,5e-06,2.5e-05,7e-06,5.5e-05,1e-06,-2.4e-05,3e-06,3e-06,8e-06,2.7e-05,-1e-06,-4e-06,-1.6e-05,2e-06,-1e-05,-5e-06,3.7e-05,3e-06,-4e-06,3e-06,-2.2e-05,-3e-06,0,-1e-05,-4e-06,3e-06,3e-06,1.6e-05,0,-2e-06,2.3e-05,-1e-06,4e-06,-2.5e-05,4e-06,3e-06,-1e-06,1.6e-05,7e-06,-1.1e-05,0,-2.1e-05,5e-06,6e-06,1.5e-05,1e-06,0,-2e-06,-5e-06,-1.5e-05,8e-06,3.5e-05,-1.7e-05,-7e-06,1.7e-05,-4e-06,-4e-06,0,1e-05,-1e-06,2e-06,2e-05,3e-06,3e-06,1.6e-05,3e-06
