0.048606,0.051321,0.054462,0.045844,0.045859,0.051138,0.045464,0.050059,0.065061,0.072451,0.071654,0.069533,0.071686,0.074996,0.077081,0.077368,0.069455,0.0618,0.053025,0.046071,0.051633,0.052377,0.045327,0.044601,0.051098,0.054145,0.05384,0.052355
0.060206,0.061815,0.064776,0.055355,0.055848,0.061669,0.05455,0.06154,0.081731,0.09296,0.093025,0.090477,0.092462,0.094864,0.096048,0.095681,0.086726,0.076861,0.065464,0.057804,0.065032,0.066414,0.057869,0.057232,0.06465,0.066512,0.065621,0.065641
0.079128,0.078182,0.080827,0.071002,0.071647,0.077926,0.068847,0.079871,0.109792,0.129274,0.131403,0.128199,0.129464,0.128908,0.127021,0.124822,0.115593,0.102547,0.087064,0.079585,0.089135,0.090591,0.079554,0.079297,0.086938,0.08538,0.084172,0.088304
0.091734,0.087984,0.090257,0.083291,0.082774,0.087088,0.077126,0.091293,0.130852,0.160178,0.163979,0.158889,0.158176,0.153701,0.148795,0.144773,0.136376,0.121297,0.104781,0.100376,0.109236,0.108184,0.096033,0.096616,0.100956,0.093838,0.094805,0.106404
0.099567,0.096104,0.098174,0.094539,0.090981,0.090544,0.082043,0.100372,0.14605,0.178241,0.179768,0.170812,0.168964,0.166822,0.161062,0.153204,0.144311,0.128188,0.115918,0.118507,0.123492,0.116694,0.10433,0.105824,0.105929,0.094954,0.100105,0.118523
0.109472,0.110893,0.115522,0.11216,0.105563,0.101327,0.096161,0.121291,0.167377,0.188135,0.182472,0.169383,0.167563,0.176365,0.171031,0.156254,0.14635,0.129843,0.120915,0.129697,0.13305,0.123036,0.110217,0.11029,0.11222,0.105265,0.11416,0.133615
0.125893,0.128246,0.136925,0.136894,0.132262,0.128579,0.127218,0.155007,0.192184,0.195588,0.182441,0.163828,0.161369,0.188033,0.191132,0.170589,0.155331,0.13659,0.126868,0.135992,0.142747,0.135388,0.121593,0.117405,0.123359,0.12703,0.142204,0.160577
0.145765,0.143216,0.15388,0.161548,0.169077,0.17448,0.17378,0.191776,0.210277,0.199863,0.182549,0.170062,0.17622,0.21277,0.224438,0.200143,0.180384,0.161618,0.148288,0.152439,0.160549,0.153506,0.138817,0.134615,0.146998,0.161909,0.179792,0.194164
0.16555,0.154086,0.166186,0.188126,0.21621,0.236368,0.231153,0.226102,0.21708,0.202776,0.193204,0.199283,0.219512,0.252386,0.265726,0.234065,0.206593,0.189267,0.181392,0.186618,0.191785,0.181663,0.167078,0.168655,0.186716,0.206189,0.220949,0.225982
0.180946,0.166316,0.181458,0.215132,0.257004,0.289666,0.281916,0.254601,0.225444,0.21262,0.215803,0.246212,0.279027,0.301186,0.306467,0.267336,0.237029,0.214832,0.211626,0.224236,0.228298,0.212556,0.194081,0.203983,0.231441,0.24999,0.255339,0.250123
0.186499,0.175117,0.192842,0.227036,0.263897,0.298915,0.29633,0.266184,0.233415,0.215257,0.224786,0.273993,0.315052,0.330324,0.320912,0.275002,0.248282,0.226447,0.228538,0.245881,0.2505,0.229954,0.204413,0.220954,0.255965,0.265526,0.257066,0.247974
0.174755,0.165945,0.179907,0.203671,0.227178,0.256943,0.259936,0.240456,0.214557,0.192829,0.200837,0.248525,0.286519,0.295943,0.279097,0.23862,0.220455,0.210902,0.22356,0.235825,0.232027,0.217424,0.196226,0.214039,0.246407,0.243829,0.225182,0.219909
0.15138,0.144738,0.159078,0.167992,0.169722,0.190301,0.200615,0.19033,0.17775,0.169705,0.170773,0.19257,0.212177,0.209639,0.199417,0.182437,0.172873,0.180312,0.201656,0.203441,0.191248,0.187309,0.179003,0.190775,0.206432,0.19849,0.19098,0.198856
0.132029,0.128613,0.146602,0.149004,0.135787,0.136952,0.146297,0.148041,0.150939,0.160051,0.160758,0.163528,0.161303,0.14104,0.134886,0.138104,0.136761,0.155796,0.176993,0.176894,0.17015,0.16739,0.160077,0.157204,0.16233,0.161396,0.171658,0.188808
0.118392,0.12139,0.143952,0.151854,0.138425,0.130672,0.13327,0.144629,0.164135,0.176974,0.171923,0.160483,0.150273,0.138583,0.132688,0.121226,0.11704,0.140152,0.152022,0.156032,0.161518,0.161954,0.159511,0.145887,0.152627,0.159475,0.163906,0.176677
0.137043,0.149073,0.168521,0.171393,0.158511,0.15751,0.159079,0.184961,0.229183,0.239163,0.218674,0.191976,0.179801,0.180151,0.165201,0.13121,0.121305,0.138869,0.146516,0.153832,0.172904,0.200462,0.212455,0.195425,0.213728,0.218992,0.190837,0.178225
0.19892,0.217061,0.240567,0.22733,0.20187,0.21635,0.225565,0.273132,0.343862,0.342789,0.309199,0.276151,0.258659,0.255936,0.226173,0.171336,0.153969,0.176589,0.186559,0.192745,0.226698,0.286444,0.31591,0.297534,0.330421,0.335573,0.284214,0.244722
0.286,0.3002,0.323693,0.294008,0.266343,0.299638,0.310017,0.378615,0.462566,0.441454,0.408202,0.378174,0.350138,0.336082,0.297096,0.225212,0.201591,0.239373,0.249628,0.253535,0.301364,0.379112,0.425431,0.427573,0.47155,0.461795,0.400577,0.357276
0.378899,0.372184,0.373469,0.338058,0.345317,0.389836,0.376685,0.448707,0.522899,0.491897,0.476008,0.454718,0.415513,0.38726,0.351281,0.275462,0.25156,0.303292,0.310234,0.315116,0.3722,0.439805,0.499599,0.548704,0.587279,0.545123,0.489009,0.463624
0.450389,0.418731,0.374165,0.33775,0.401425,0.450613,0.411317,0.453926,0.493359,0.47109,0.485687,0.485802,0.441921,0.414251,0.395609,0.322492,0.292551,0.345737,0.368471,0.379705,0.417966,0.445621,0.51406,0.606795,0.609262,0.535643,0.509493,0.521794
0.504753,0.445715,0.353465,0.313386,0.404771,0.437123,0.395477,0.421997,0.436358,0.414523,0.432069,0.446825,0.422283,0.42675,0.427886,0.366464,0.327005,0.358234,0.396622,0.413448,0.427145,0.408956,0.453999,0.552143,0.521328,0.449442,0.455011,0.502567
0.520128,0.466719,0.339381,0.278272,0.359883,0.392142,0.389517,0.415841,0.411793,0.378145,0.370992,0.37116,0.361783,0.390576,0.40412,0.380871,0.346316,0.352715,0.395812,0.402901,0.411248,0.381869,0.397815,0.4602,0.418898,0.386534,0.381288,0.420318
0.45851,0.440737,0.330967,0.252813,0.319192,0.399433,0.441863,0.427627,0.380544,0.339213,0.351609,0.351966,0.322999,0.336028,0.363665,0.383874,0.345022,0.349117,0.393862,0.378541,0.404003,0.388007,0.388752,0.406347,0.327147,0.301398,0.294887,0.327983
0.345974,0.352172,0.293543,0.23878,0.305938,0.434866,0.509414,0.45934,0.349136,0.283525,0.333891,0.370275,0.352402,0.350216,0.378823,0.407562,0.345976,0.357566,0.408966,0.387468,0.420617,0.386254,0.378407,0.379366,0.253066,0.207078,0.217424,0.265362
0.272111,0.296306,0.277949,0.244769,0.312726,0.441488,0.504418,0.444041,0.328345,0.287856,0.377568,0.431759,0.427708,0.418037,0.418564,0.417412,0.344685,0.353011,0.403013,0.400539,0.421322,0.351039,0.328586,0.354397,0.243097,0.187099,0.203277,0.23541
0.270202,0.315389,0.312415,0.268597,0.345678,0.432456,0.434255,0.412333,0.36669,0.357951,0.497173,0.570288,0.578722,0.589862,0.517077,0.420371,0.332602,0.349979,0.405348,0.416551,0.410911,0.332633,0.316183,0.354413,0.274682,0.244747,0.249835,0.223143
0.285329,0.314151,0.340796,0.304862,0.420396,0.486747,0.41019,0.424529,0.449467,0.462705,0.688673,0.811642,0.794329,0.824676,0.682551,0.479284,0.391264,0.40359,0.435187,0.457037,0.436923,0.377848,0.386615,0.395374,0.315015,0.324622,0.331498,0.260627
0.282552,0.265535,0.315528,0.310661,0.464891,0.531214,0.397784,0.42466,0.48849,0.539331,0.872118,1.062574,0.984021,1.000156,0.820763,0.566089,0.50382,0.471029,0.468635,0.508144,0.480507,0.438254,0.44199,0.385218,0.305334,0.367958,0.392055,0.307933
0.254942,0.213902,0.265767,0.288419,0.440097,0.502751,0.370921,0.365536,0.415817,0.507932,0.898666,1.15936,1.054279,1.034665,0.879801,0.656926,0.606057,0.491482,0.474392,0.532823,0.488774,0.470836,0.465443,0.344918,0.256711,0.344004,0.395001,0.330748
0.211697,0.192516,0.243836,0.244327,0.329231,0.374957,0.31232,0.281435,0.276066,0.370398,0.707287,0.993918,0.977512,0.931631,0.810061,0.674287,0.611395,0.434914,0.404965,0.451339,0.389598,0.419234,0.463771,0.337798,0.230102,0.296065,0.37745,0.349193
0.207311,0.195928,0.243772,0.199855,0.214152,0.235347,0.220185,0.203008,0.168016,0.226813,0.434407,0.644952,0.704609,0.661739,0.590059,0.551339,0.501781,0.375213,0.338259,0.318973,0.246145,0.300064,0.411826,0.346167,0.228478,0.255951,0.339902,0.32977
0.217886,0.228363,0.268636,0.184658,0.186016,0.205448,0.159509,0.147846,0.127822,0.164165,0.27709,0.345268,0.375741,0.356193,0.343525,0.363874,0.333067,0.292362,0.283891,0.234265,0.158603,0.188719,0.301747,0.29399,0.195513,0.190673,0.253268,0.270946
0.205204,0.235211,0.255773,0.17489,0.186367,0.208032,0.132351,0.112451,0.141187,0.179574,0.243819,0.235177,0.208563,0.200184,0.222649,0.25696,0.238231,0.213181,0.198819,0.168884,0.127549,0.150878,0.22119,0.209827,0.143612,0.1491,0.188836,0.210581
0.17303,0.19737,0.203557,0.158333,0.167141,0.186159,0.119663,0.105532,0.167122,0.226233,0.260937,0.241901,0.183424,0.160608,0.186802,0.210549,0.203447,0.165619,0.126764,0.117338,0.120029,0.142827,0.17949,0.166436,0.13312,0.149376,0.156614,0.155855
0.160331,0.142214,0.142015,0.134956,0.148195,0.166517,0.11469,0.108797,0.17962,0.268104,0.29799,0.253789,0.156691,0.124793,0.155936,0.159104,0.171831,0.155393,0.109287,0.094289,0.10443,0.123953,0.161934,0.157632,0.145154,0.150343,0.137077,0.151676
0.180143,0.125838,0.11543,0.1203,0.151745,0.160685,0.115427,0.103195,0.163327,0.281674,0.32799,0.249817,0.129583,0.100067,0.138438,0.129574,0.150669,0.165169,0.120242,0.105584,0.109945,0.120641,0.162002,0.154543,0.147906,0.140835,0.124757,0.177913
0.199533,0.128473,0.134301,0.149489,0.16677,0.14631,0.116281,0.092348,0.149585,0.278471,0.307875,0.212685,0.105056,0.111267,0.149866,0.133652,0.149027,0.16627,0.139511,0.142358,0.140596,0.131857,0.155258,0.154478,0.14373,0.149429,0.160423,0.208319
0.215033,0.131153,0.158005,0.180456,0.171465,0.140063,0.125618,0.093295,0.154989,0.274818,0.270522,0.16117,0.074104,0.122487,0.16774,0.152225,0.168343,0.168664,0.163635,0.175056,0.160725,0.139065,0.135172,0.139734,0.118227,0.154377,0.208245,0.213022
0.216404,0.125247,0.16007,0.183333,0.152181,0.148298,0.145117,0.11324,0.163893,0.270084,0.269217,0.137657,0.054666,0.121064,0.185595,0.182102,0.197035,0.167485,0.17639,0.183975,0.152284,0.132851,0.128606,0.122509,0.08133,0.148353,0.244597,0.191969
0.187414,0.100508,0.134691,0.152043,0.118013,0.158876,0.163131,0.147631,0.165654,0.241958,0.255574,0.128045,0.064797,0.12343,0.184721,0.193116,0.202605,0.168403,0.187476,0.172924,0.124314,0.11223,0.129299,0.122231,0.076681,0.162099,0.274459,0.185866
