-0.00017,-0.000109,-0.000118,-0.000232,-0.000247,-0.000183,-0.000124,-0.00011,-9.8e-05,-0.000136,-0.000106,-0.000152,-0.000128,-8.4e-05,-0.000142,-0.000208,-0.000178,-0.000127,-0.000124,-6.9e-05,-5.2e-05,-8.6e-05,-0.000155,-0.000272,-0.000234,-0.000184,-0.00018,-0.000205
-0.000225,-0.000138,-0.000101,-0.000288,-0.000352,-0.000281,-0.000146,-0.000224,-0.000174,-0.000202,-0.000131,-0.000116,-0.000143,-0.000112,-0.000202,-0.000371,-0.000249,-0.000147,-0.000168,-6.9e-05,-7.4e-05,-7.7e-05,-0.000146,-0.000334,-0.00029,-0.000194,-0.000273,-0.000314
-0.000154,-0.000153,-0.000144,-0.000177,-0.00018,-0.000198,-0.000144,-0.00024,-0.00023,-0.000189,-0.000199,-0.000116,-0.000155,-0.000182,-0.000173,-0.000242,-0.000175,-0.000163,-0.000152,-0.000123,-0.000137,-0.000117,-0.00015,-0.000174,-0.000147,-0.000108,-0.000186,-0.000206
9.3e-05,9e-06,1.2e-05,0.000138,0.000153,8.6e-05,3.5e-05,-1.2e-05,-2.5e-05,2e-05,-8.1e-05,7e-06,-3e-06,-7.3e-05,2.1e-05,5.4e-05,2.3e-05,0,1.8e-05,-2.9e-05,-2.1e-05,-5e-06,5e-05,0.000224,0.000196,0.000129,8.5e-05,7.4e-05
0.000203,0.000137,0.000165,0.000247,0.000219,0.000199,0.000144,0.000146,0.000121,0.000168,0.000109,0.000123,0.000119,2.4e-05,0.000107,0.000108,3.4e-05,6.5e-05,9.1e-05,6.1e-05,9.8e-05,9.7e-05,0.00017,0.000347,0.000271,0.000195,0.000207,0.000184
-4.3e-05,-5e-06,-1e-06,-6.8e-05,-5.7e-05,1.6e-05,3.4e-05,8.9e-05,4.1e-05,7.6e-05,6.9e-05,-9e-06,2.1e-05,-3.9e-05,-4.6e-05,-7.3e-05,-0.000146,-0.000109,-5.7e-05,-3.8e-05,-9e-06,-2.4e-05,-2.1e-05,0,-6.5e-05,-5.7e-05,4.5e-05,3e-05
-0.000184,-9.5e-05,-6.3e-05,-2e-04,-0.000179,-9.6e-05,-3.5e-05,2.7e-05,1.2e-05,-1.3e-05,3.3e-05,-6.3e-05,0,2.4e-05,-8.1e-05,-7.7e-05,-6.9e-05,-8.9e-05,-0.000101,-6.1e-05,-4.9e-05,-7.9e-05,-9.6e-05,-0.000252,-0.000253,-0.00016,-9.1e-05,-6.5e-05
-5.4e-05,-2.6e-05,1.2e-05,-2.6e-05,-4.1e-05,-3.9e-05,-1.7e-05,-1.7e-05,-3e-06,-6e-05,5.6e-05,3.3e-05,3.9e-05,0.000131,3.9e-05,0.000128,0.000178,6.6e-05,1.5e-05,2.3e-05,-2.7e-05,-4.2e-05,-1.9e-05,-0.000223,-0.000183,-6.4e-05,-9.7e-05,-3.1e-05
4.4e-05,-7e-06,-3.9e-05,9.2e-05,8.4e-05,4.1e-05,-2.6e-05,-4.1e-05,-4e-05,-9.4e-05,-2.4e-05,3.1e-05,-1.6e-05,5.6e-05,7.5e-05,0.000232,0.000194,6.8e-05,9.2e-05,3e-05,-7.2e-05,-3.5e-05,-8e-06,-7.9e-05,-6.9e-05,-2.7e-05,-6e-05,-1.2e-05
8.9e-05,2.4e-05,-5e-05,0.000107,7.5e-05,5.7e-05,-2.8e-05,-3.7e-05,-1e-06,-1.6e-05,-7.3e-05,-1e-05,-1.1e-05,-1.1e-05,3.9e-05,7e-05,-1e-06,3e-05,8.4e-05,4e-06,-4e-05,1.8e-05,3.8e-05,0.000149,9.5e-05,2.1e-05,1e-05,4e-06
5.4e-05,5.8e-05,-2.9e-05,-1.4e-05,-2.4e-05,1.2e-05,1.9e-05,-2.8e-05,1e-05,5.7e-05,-4.9e-05,-6e-06,1.2e-05,-3.5e-05,-6e-06,-0.000184,-0.00018,3e-06,1.8e-05,-2.3e-05,-2.2e-05,2.3e-05,4.3e-05,0.000183,0.00013,4.5e-05,4e-05,-8e-06
-0.000103,-1.2e-05,-5.6e-05,-0.000156,-7.7e-05,-9.1e-05,-1.1e-05,-3.6e-05,-5.4e-05,2.1e-05,-5.4e-05,-3.4e-05,-4e-05,-9.3e-05,-7.5e-05,-0.000265,-0.000204,-7.8e-05,-9.4e-05,-8.2e-05,-8.6e-05,-4.8e-05,-5.8e-05,-3.3e-05,0,-8e-06,-1.2e-05,-5.7e-05
-0.000119,-4.4e-05,-7e-06,-9.2e-05,1.1e-05,-0.000105,-2.8e-05,-2.3e-05,-5.7e-05,-1e-06,-5e-06,-3e-05,-4.1e-05,-2.5e-05,-3.9e-05,-7.8e-05,0,-5.3e-05,-0.000106,-3.5e-05,-5.7e-05,-3.3e-05,-3.9e-05,-0.000119,-3.4e-05,-2e-06,-4.7e-05,-5.7e-05
3.2e-05,1.7e-05,5.1e-05,6.1e-05,9.3e-05,-1.6e-05,7e-06,2e-06,-4.5e-05,-3.4e-05,6.5e-05,1.5e-05,-4.5e-05,2.3e-05,4e-05,0.00014,0.000171,2.5e-05,-1.2e-05,5.5e-05,-9e-06,-1.2e-05,2.8e-05,-7.5e-05,-4e-05,-5e-06,-2.9e-05,-2e-06
4.3e-05,2e-06,5e-06,6.6e-05,2e-06,-1.1e-05,-3.2e-05,-3.1e-05,-8.2e-05,-9.2e-05,1.2e-05,-2.4e-05,-6.7e-05,-4.3e-05,-1e-05,0.000135,7.1e-05,-3.2e-05,5e-06,2.9e-05,-9e-06,-2e-05,-7e-06,-2.7e-05,-5.5e-05,-6.5e-05,5e-06,3.2e-05
-2e-06,-2.4e-05,-2.6e-05,-2e-05,-0.000104,2e-06,-9e-06,-1.3e-05,-7e-06,-1.3e-05,-2.4e-05,-2.1e-05,5e-05,2.3e-05,-3.3e-05,3.7e-05,-1e-05,1.6e-05,3.1e-05,3.9e-05,8e-05,7.2e-05,3.2e-05,0.000132,6.4e-05,-1.9e-05,0.000104,0.00012
4e-06,8e-06,-1.5e-05,-7.2e-05,-0.000106,2.4e-05,2.8e-05,-1e-06,6e-05,6.9e-05,-2e-06,3.5e-05,0.000105,6.9e-05,6e-06,-3.1e-05,-2e-06,9.5e-05,3.1e-05,-1e-06,6.7e-05,7.3e-05,3.9e-05,0.000132,0.000127,5.9e-05,0.000135,0.000143
-3.1e-05,-8e-06,-7e-06,-4.1e-05,-2.3e-05,-1e-06,-2e-05,-1.3e-05,2.6e-05,3.9e-05,4e-06,2.4e-05,1.8e-05,-1e-06,1.9e-05,-1.3e-05,-2e-05,-5e-06,-3.7e-05,-5.8e-05,-2.8e-05,4e-06,-2.6e-05,-2.9e-05,7.2e-05,5.3e-05,1.5e-05,7e-06
2.1e-05,-2e-06,1.8e-05,2.8e-05,8.2e-05,2.4e-05,-1.9e-05,3.8e-05,4e-05,1.8e-05,2.7e-05,-1e-06,-3.1e-05,-1.2e-05,4.4e-05,5.7e-05,-7e-06,-6.4e-05,-2.4e-05,-3e-06,-2.8e-05,-4e-06,-1.3e-05,-7.6e-05,-3e-06,-7e-06,-0.000116,-0.000102
