-0.000774,-0.001051,-0.000781,-0.001341,-0.00178,-0.000888,-0.000971,-0.000835,-0.000885,-0.001082,-0.000841,-0.000458,-0.000343,-0.000224,-0.000252,-0.000159,-8.4e-05,-9.6e-05,-0.000104,-8.8e-05,-7.3e-05,-4.1e-05,-0.000208,-0.000299,-0.000231,-0.000158,-0.000102,-6.4e-05
-0.000594,-0.000821,-0.000318,-0.00068,-0.000693,0.000133,-0.000196,-0.000414,-0.000608,-0.001009,-0.001164,-0.000743,-0.000479,-0.000299,-0.000258,-0.000289,-0.000343,-0.000291,-0.000218,-0.000145,-0.000176,-0.000209,-0.000314,-0.000452,-0.000446,-0.000363,-0.000254,-0.000164
-0.000306,-0.000336,-0.000692,-0.00017,8.8e-05,-0.000785,-0.000945,-0.000852,-0.000339,-0.000241,-0.000507,-0.000479,-0.000405,-0.000351,-0.000202,-0.000322,-0.000391,-0.000305,-0.000286,-0.000251,-0.000205,-0.000229,-0.000131,-0.000194,-0.000275,-0.000326,-0.000214,-0.000154
0.000294,0.000613,0.000148,0.000855,0.001304,0.000262,0.000204,0.000266,0.000496,0.00056,0.000307,0.000113,9.4e-05,-1.5e-05,0.000114,-7.8e-05,-0.00022,-0.000186,-0.000144,-9.4e-05,-6.7e-05,-0.00011,0.00011,0.000183,9.9e-05,-3.5e-05,1e-06,-4.1e-05
0.000616,0.000831,0.000891,0.000543,0.000481,0.001012,0.001386,0.001203,0.000424,5.9e-05,4.2e-05,9.2e-05,0.000256,0.000153,0.00019,9e-06,-0.000103,-0.000109,-1e-05,6.9e-05,-1.7e-05,-6e-05,8.6e-05,0.000222,0.00025,0.000173,8.8e-05,-2.5e-05
-0.000183,-0.000287,-2e-06,-0.000941,-0.001714,-0.000711,-0.000234,-0.000145,-0.000656,-0.000927,-0.000661,-0.000415,-0.000192,-0.000147,-0.000164,-0.000141,-7.7e-05,-0.000105,-4.4e-05,-2.5e-05,-6e-05,-4.1e-05,-0.000151,-0.000102,7.6e-05,6.6e-05,-5.8e-05,-0.000204
-0.000514,-0.000499,-0.000194,-0.000164,-0.000234,-0.000154,-0.000385,-0.000334,-0.000148,-4.8e-05,-9e-05,-0.000207,-0.000172,-6.3e-05,-0.000129,2.2e-05,0.000109,8e-05,6.9e-05,4.8e-05,5.9e-05,7e-05,-0.000132,-0.000225,-8.4e-05,-5.7e-05,-0.000179,-0.000195
9.6e-05,0.000111,8.2e-05,0.000876,0.001378,0.000451,5.8e-05,-0.000148,0.000445,0.001023,0.000769,0.000381,0.000154,0.000125,4.4e-05,0.000233,0.000309,0.000283,0.000191,0.000139,0.000165,0.000159,0.000108,1e-06,-4.9e-05,-9e-06,-8.1e-05,2e-05
0.00011,-9.6e-05,-0.00046,-0.000229,4.4e-05,-0.000635,-0.000823,-0.000722,-3.1e-05,0.000523,0.00068,0.000547,0.000179,9.4e-05,1.4e-05,0.000207,0.000315,0.000245,0.000116,4.9e-05,0.000128,0.000142,0.000189,0.00012,-5e-06,5.3e-05,4e-05,7.5e-05
-0.000101,-0.000266,-0.000323,-0.00068,-0.000583,0.000131,8.2e-05,0.000242,1.9e-05,-0.000205,0.000185,0.000404,0.000262,0.000236,0.000101,0.000123,0.000143,7.3e-05,4.3e-05,2.5e-05,3.3e-05,2.9e-05,7.5e-05,0.000137,3.1e-05,7.9e-05,0.000118,6.2e-05
3.7e-05,4.6e-05,0.000171,-0.000317,-0.000609,0.000351,0.000765,0.000745,-1.5e-05,-0.000489,-0.000272,-9.4e-05,4.8e-05,0.000134,7.7e-05,-4.9e-05,-9.1e-05,-6.4e-05,-2.6e-05,-3.4e-05,-6.7e-05,-7.9e-05,-0.000114,4.7e-05,3e-06,1.1e-05,0.000139,9.9e-05
0.000126,0.000391,0.000362,0.000407,0.000119,-0.000233,0.000105,0.000121,2e-05,-1.7e-05,-0.000157,-0.000376,-0.000238,-0.000109,2e-06,-0.00014,-0.00022,-0.000107,-7.3e-05,-0.000129,-9.2e-05,-8.3e-05,-0.000139,-3.6e-05,-1e-05,-9.4e-05,5.5e-05,0.000103
0.000227,0.00048,0.000426,0.001078,0.001325,0.000477,0.000364,0.000196,0.000341,0.000415,-1.2e-05,-0.00032,-0.000208,-0.000178,1e-05,-0.000104,-0.000245,-0.000159,-9.5e-05,-6.8e-05,-8.9e-05,-0.000132,-5e-05,-3.6e-05,-4e-06,-1e-04,1e-05,0.000118
6.5e-05,-1e-04,-8.7e-05,-7.8e-05,-8.1e-05,-9.1e-05,-0.000197,-0.000389,-0.000369,-0.000424,-0.000558,-0.000296,-0.000163,-0.000202,-4.2e-05,-9.2e-05,-0.000206,-0.000216,-0.000118,3e-06,-7.9e-05,-0.000144,3.9e-05,4.2e-05,5.4e-05,3.8e-05,2.1e-05,9.4e-05
-0.000503,-0.000864,-0.000609,-0.001286,-0.00148,-0.000757,-0.001053,-0.000889,-0.000734,-0.00106,-0.000895,-0.000264,-0.000183,-0.000233,-0.000217,-0.000166,-0.000145,-0.000223,-0.000159,-6.4e-05,-0.000107,-0.000126,-2.3e-05,-5.9e-05,-3.7e-05,6.1e-05,-6.8e-05,-9.9e-05
-0.000467,-0.000591,-0.00036,-0.000353,-0.000151,0.000222,-9.7e-05,8.9e-05,0.000153,-7.7e-05,-0.000127,3.1e-05,7.8e-05,8e-05,-4.8e-05,-4.5e-05,2.2e-05,9e-06,-1e-06,9e-06,-2e-05,-1.4e-05,-4.2e-05,-5.5e-05,-4e-05,3.5e-05,-0.000122,-0.000174
0.000184,0.000398,0.000156,0.00071,0.000847,0.000216,0.00045,0.000426,0.000607,0.000938,0.000796,0.000341,0.000235,0.00023,0.000148,0.000134,0.000203,0.00024,0.000117,4.2e-05,0.000103,0.000126,2.6e-05,-4e-06,-3.8e-05,-6e-06,-8.9e-05,-0.00015
0.000329,0.000632,0.000352,0.000658,0.000643,2.4e-05,0.000346,0.000264,0.000423,0.000934,0.001023,0.000436,0.000175,0.000115,0.000111,0.000196,0.000287,0.000303,0.000133,1.4e-05,0.000135,0.000145,6.4e-05,2e-06,1.8e-05,-2.8e-05,-7.7e-05,-0.000139
0.000194,0.000159,0.00026,-4e-05,-9.8e-05,0.000388,0.000545,0.000347,-0.000158,1.6e-05,0.000372,0.000282,8.1e-05,6.1e-05,2.4e-05,0.000122,0.000199,0.000136,0.000119,5.9e-05,9.4e-05,6.9e-05,2.5e-05,3e-06,7.7e-05,-4e-06,-6.8e-05,-0.000152
