3.9e-05,2e-06,3.6e-05,7e-06,2e-06,2.7e-05,1.8e-05,4e-06,2e-05,4e-05,1.1e-05,2.8e-05,2e-06,6e-06,1.6e-05,1.8e-05,7e-06,1e-06,1.9e-05,9e-06,1.1e-05,3.1e-05,1e-05,3.9e-05,3.9e-05,2e-06,3.6e-05,4.6e-05,7e-06,0.000117,4.7e-05,7e-06,3.5e-05,0.000612,1.2e-05,3e-06,0.000117,0.000241,0.000281,0.000127,0.000352,0.000834,0.000463,0.001232,6.3e-05,0.000447,0.000268,0.000216,1.1e-05,0.00025,0.000467,1.6e-05,0.000555,0.000333,0.000112,1e-06,0.000761,0.000654,0.000762,7.6e-05,9.1e-05,0.000157,0.000289,0.000334,0.00045,1.7e-05,0.000111,6.6e-05,7.8e-05,1.6e-05,9.4e-05,3.2e-05,0.000133,9.5e-05,6.4e-05,0.000115,3e-06,9.8e-05,6.6e-05,7e-06,6e-05,3.4e-05,4e-06,0.000116,9.8e-05,8.2e-05,1.6e-05,8.9e-05,2e-06,2.9e-05,1.1e-05,0.000365,0.000237,0.000215,0.000153,0.000177,5.7e-05,0.000371,1.3e-05,0.000209,2.4e-05,6e-05,4.9e-05,2.7e-05,1.5e-05,2.3e-05,7e-06,0.000156,7.2e-05,1e-06,6.9e-05,2.4e-05,5.1e-05,3.6e-05,2.3e-05,1.4e-05,8.5e-05,4.5e-05,4.1e-05,1.5e-05,4.9e-05
0.000114,0.000148,0.000128,6.8e-05,4.1e-05,2.9e-05,6.6e-05,4.6e-05,4.6e-05,0.000101,7.3e-05,9.4e-05,7.9e-05,4e-05,7e-06,6.7e-05,5.1e-05,5.9e-05,3.8e-05,4.1e-05,5e-05,8.2e-05,8.8e-05,5.9e-05,0.000135,0.000115,9.2e-05,0.000148,0.000156,0.000148,0.000233,0.000149,0.000195,0.001234,0.000153,0.000184,0.000103,0.000463,0.000926,0.000961,0.002185,0.002628,0.001817,0.002013,0.001673,0.001292,0.001222,0.000675,0.000906,0.000447,0.000962,0.000851,0.000989,0.000382,0.000241,0.000887,0.001685,0.001408,0.001784,0.000814,0.000641,0.000808,0.001045,0.001136,0.000265,0.000422,0.000754,0.000412,0.000129,0.000375,0.000373,0.000111,0.000133,0.000238,0.000207,0.000155,8.1e-05,0.000103,0.000225,0.00027,0.000439,0.000191,6.5e-05,0.000194,0.000423,0.000265,0.000142,0.000209,0.000198,0.000183,6.1e-05,0.000674,3.4e-05,0.000608,0.00075,0.000491,0.000343,0.000254,0.000486,4e-04,0.000375,0.000273,0.000138,0.000244,7.3e-05,6.2e-05,8.2e-05,0.000244,0.000241,0.000166,0.000121,9e-05,9e-05,6.9e-05,8e-05,8.7e-05,0.000181,0.000237,0.000149,0.000108,1.3e-05
3.8e-05,9.9e-05,5.3e-05,6.7e-05,6.9e-05,4.4e-05,3.2e-05,1.2e-05,4e-06,5.6e-05,2.2e-05,7e-05,7e-06,1.7e-05,8e-06,7.5e-05,4.5e-05,3.7e-05,4.7e-05,3.3e-05,4.7e-05,3.4e-05,2.8e-05,9e-06,7.9e-05,4.6e-05,6e-05,4.4e-05,9.4e-05,0.000266,0.000698,0.000432,0.000403,0.002129,0.000492,0.000305,0.000512,0.000421,0.000803,0.000647,0.00297,0.001113,0.002411,0.003107,0.002598,0.001167,0.001173,0.001937,0.001438,0.001009,0.001297,0.000459,0.002446,0.001515,0.000891,0.001389,0.001531,0.000714,0.002574,0.001418,0.001344,0.000843,0.000757,0.000309,0.000222,0.00089,0.000417,0.000215,0.000488,0.00097,0.000626,8.4e-05,0.000126,0.000324,0.000875,0.000736,0.000437,0.000195,0.000144,6e-05,0.00043,0.000147,0.000144,5.5e-05,0.000737,0.000601,0.000353,0.000169,0.00013,0.000243,0.000104,0.00057,0.000786,0.000335,0.000165,0.000104,0.000373,0.000857,0.000747,0.000292,0.000273,0.00013,0.000168,0.000262,0.000132,8.4e-05,3.9e-05,0.00013,0.000215,0.000142,4.2e-05,2.1e-05,3.9e-05,4.8e-05,3.7e-05,6.3e-05,2.1e-05,0.000102,2.5e-05,7e-06,3.2e-05
8e-06,7e-05,2.1e-05,9.4e-05,7.6e-05,7.2e-05,6.3e-05,5e-05,3.9e-05,2.5e-05,7.4e-05,4.5e-05,6.2e-05,6.3e-05,2.6e-05,6.4e-05,3.3e-05,3.7e-05,4e-05,3.3e-05,3.8e-05,4.4e-05,5.8e-05,3.2e-05,3.9e-05,3.7e-05,5.2e-05,5.4e-05,8.2e-05,0.000312,0.000906,0.000117,0.000958,0.002808,0.000893,0.000446,0.000816,0.000398,0.000971,0.000647,0.004026,0.002148,0.002329,0.001431,0.001705,0.000872,0.001972,0.000238,0.001631,0.000978,0.001216,0.000945,0.003352,0.001027,0.000936,0.000579,0.00118,0.002033,0.003097,0.002671,0.001307,0.000786,0.000622,0.001121,0.000631,0.00187,0.001818,0.001295,0.001484,0.000773,0.000453,0.000844,0.000489,0.000616,0.000766,0.000828,0.000275,0.000352,0.000222,0.000165,0.000282,0.000241,0.000353,0.000417,0.000972,0.000553,5.7e-05,0.000117,9.8e-05,0.000237,0.000177,0.000563,0.001308,8e-04,0.000222,6.9e-05,0.000502,0.00137,0.000751,0.000279,0.000157,0.000247,0.000425,0.00022,6.1e-05,3.3e-05,5.1e-05,0.000168,0.00053,0.000154,4.8e-05,0.000103,6.7e-05,3.3e-05,6.1e-05,2.5e-05,4.3e-05,4e-05,5.7e-05,1.8e-05,2.6e-05
3.7e-05,4.4e-05,3.9e-05,5.8e-05,2.4e-05,4.2e-05,3.4e-05,2.4e-05,3e-05,4.9e-05,4.6e-05,1.9e-05,4.3e-05,2.2e-05,3.1e-05,2.4e-05,1.7e-05,1.6e-05,1.7e-05,3.3e-05,3.1e-05,1.9e-05,2.9e-05,1.3e-05,1.5e-05,5e-06,4.9e-05,3.6e-05,6.9e-05,0.000454,0.000291,0.000574,0.001682,0.00246,0.000434,0.000517,0.00078,0.000593,0.001283,0.000982,0.00564,0.00312,0.003273,0.001203,0.003331,0.002686,0.001804,0.000611,0.002668,0.003679,0.003963,0.002265,0.00309,0.002114,0.000795,0.001062,0.000595,0.001515,0.002886,0.000711,0.001919,0.000314,0.00073,0.001119,0.000503,0.002312,0.001614,0.000951,0.000515,0.000754,0.000675,0.001165,0.000812,0.000212,0.000679,0.000607,0.000116,0.000518,0.000486,0.000335,0.000262,0.00023,0.000135,0.00032,0.000775,0.000519,0.000352,0.000313,0.000183,0.000142,0.000143,0.000473,0.002042,0.001794,0.000604,0.000106,0.000518,0.001745,0.000988,0.000357,7.7e-05,0.000146,0.000347,8.5e-05,5.6e-05,3.3e-05,1.1e-05,0.000365,0.00069,0.000418,0.000213,6.2e-05,3e-05,5.8e-05,3.1e-05,2.7e-05,7e-05,3.7e-05,3.8e-05,3e-05,1e-05
1.3e-05,2.2e-05,4.5e-05,5.8e-05,3.1e-05,3.4e-05,3e-05,1.8e-05,2.5e-05,1e-05,5.2e-05,3.9e-05,1.2e-05,4.6e-05,2e-05,2.2e-05,4.5e-05,2.6e-05,1.3e-05,1.8e-05,2.1e-05,2.5e-05,2.2e-05,7e-06,2.6e-05,3.7e-05,3.7e-05,3e-05,3.2e-05,0.000449,0.000331,0.000372,0.003284,0.005096,0.001644,0.000209,0.000112,0.000375,0.001072,0.000733,0.00565,0.002131,0.000893,0.00674,0.001665,0.003433,0.002581,0.002284,0.003042,0.002824,0.002196,0.001136,0.000949,0.001687,0.001744,0.001981,0.002417,0.000995,0.001629,0.000655,0.001165,0.001426,0.00122,0.00116,0.001209,0.001216,0.000274,0.000297,0.000902,0.001361,0.000246,0.000979,0.000128,0.000433,0.000208,0.000855,0.000782,0.000166,0.000591,0.000715,0.000236,0.000149,2e-04,0.000406,0.000459,0.000125,0.000117,0.000377,0.000338,0.000101,0.000204,0.000239,0.002781,0.001443,0.000673,0.00014,3e-04,0.001825,0.000707,0.000441,0.000117,6.4e-05,0.00056,0.000312,0.000102,1e-05,1.8e-05,0.000876,0.000466,0.000298,8.7e-05,3.8e-05,8e-05,4.1e-05,1.5e-05,3.5e-05,5.8e-05,2.7e-05,3.5e-05,2.8e-05,1e-05
5.4e-05,1.6e-05,5.4e-05,1.8e-05,4.7e-05,1.6e-05,4.6e-05,6e-06,3e-05,3.6e-05,7.1e-05,1.5e-05,5.1e-05,6.2e-05,4e-05,4.8e-05,5.4e-05,5e-05,4.7e-05,4.4e-05,5.5e-05,7e-06,1.2e-05,2.4e-05,3.7e-05,7.3e-05,2.2e-05,8.8e-05,3.2e-05,0.000483,0.001118,0.000535,0.003608,0.002438,0.003037,0.001646,0.000698,0.000377,0.00043,0.00113,0.004323,0.00381,0.00347,0.01155,0.008807,0.005237,0.00288,0.003226,0.003823,0.004943,0.00595,0.004949,0.005271,0.002249,0.001243,0.000851,0.004697,0.001579,0.003756,0.001246,0.002591,0.000843,0.001377,0.001665,0.002151,9.2e-05,0.001996,0.001303,0.000762,0.001245,0.000798,0.001534,0.001492,0.000968,0.000538,0.000754,0.000668,0.000757,0.001379,0.001127,0.000602,0.000604,0.000394,0.000522,0.000337,0.000574,0.000422,0.000487,0.000154,0.000176,0.000221,0.000205,0.002889,0.000749,0.000753,0.000293,0.000313,0.001524,0.000791,0.00043,0.000429,0.000232,0.000627,0.000347,0.000268,7.4e-05,4.5e-05,0.001523,0.000442,0.000133,0.000112,3e-06,7.7e-05,9.7e-05,0.000107,6.4e-05,4.9e-05,8.8e-05,2.3e-05,1.6e-05,4.3e-05
4.5e-05,4.3e-05,6.8e-05,5e-05,6.2e-05,2.9e-05,3.6e-05,7.5e-05,3.7e-05,3.5e-05,6.5e-05,2.5e-05,6.7e-05,2.2e-05,8e-06,4.4e-05,1e-05,5e-05,4e-06,3e-05,2.8e-05,3.2e-05,3.8e-05,3.8e-05,7.5e-05,0.000148,0.000101,0.000148,0.000206,0.000495,0.002456,0.001459,0.002883,0.008167,0.009431,0.004105,0.000815,0.000602,0.000429,0.00123,0.004368,0.003887,0.006047,0.016146,0.008613,0.005799,0.010312,0.006244,0.005688,0.005312,0.005188,0.00158,0.006116,0.004596,0.003443,0.001186,0.004589,0.004901,0.00583,0.005232,0.001847,0.000628,0.003233,0.003269,0.000118,0.002358,0.001362,0.001354,0.000821,0.000757,0.000929,0.001408,0.001377,0.002342,0.001249,0.000639,0.000645,0.000559,0.00149,0.000616,0.000552,0.000334,0.000371,0.001158,0.00103,0.00016,0.000228,0.000474,0.000522,6.2e-05,5.8e-05,0.000367,0.002157,0.003811,0.001444,0.000333,0.00021,0.001332,0.001576,0.00066,0.000495,0.00019,0.000539,0.000425,0.000169,8.6e-05,0.000112,0.002148,0.001187,0.000347,0.000173,0.000102,3.4e-05,6e-05,3e-05,5e-05,4.8e-05,5.1e-05,8.6e-05,4.3e-05,3.2e-05
5e-06,2.9e-05,4.6e-05,2.8e-05,6.7e-05,6.3e-05,4.2e-05,0.000123,9.2e-05,5.8e-05,0.000109,8.2e-05,1.4e-05,2e-05,1.4e-05,5.1e-05,1.8e-05,6.3e-05,4.4e-05,5.8e-05,7.8e-05,4.6e-05,7.6e-05,4.6e-05,0.000157,0.000216,0.00012,7.1e-05,0.000137,0.000197,0.00259,0.002167,0.002829,0.007383,0.012366,0.006847,0.001827,0.000128,4e-04,0.000829,0.002166,0.00145,0.002963,0.008651,0.006151,0.009873,0.004849,0.002609,0.005135,0.001745,0.003114,0.003534,0.00424,0.003512,0.002534,0.003142,0.002709,0.00235,0.000654,0.004791,0.004389,0.002372,0.003377,0.004343,0.003392,0.003641,0.003409,0.001615,9e-04,0.000522,0.001885,0.002089,0.001267,0.001914,0.00184,0.001103,0.000278,0.000397,0.001024,0.001676,0.000999,0.000793,0.000751,0.000648,0.001327,0.000987,0.000597,0.000374,0.000322,0.000349,0.000263,0.00034,0.00132,0.003254,0.00219,0.000851,0.000234,0.000767,0.001321,0.000763,0.000343,0.000375,0.000204,0.000178,0.000243,0.000175,0.000146,0.00243,0.002459,0.001416,0.000518,0.000104,3.7e-05,6.4e-05,6.4e-05,1.4e-05,1.9e-05,8.5e-05,6.7e-05,7.1e-05,5.7e-05
5.1e-05,1.2e-05,8.7e-05,6.7e-05,6.1e-05,0.000101,6.9e-05,0.000111,3e-05,5.1e-05,0.000132,8.5e-05,6.3e-05,1.3e-05,1.4e-05,1.8e-05,3.1e-05,5.9e-05,8.2e-05,0.000113,0.000135,7.2e-05,0.000111,0.00012,0.000178,6.5e-05,0.000106,0.000144,0.000244,0.000415,0.001849,0.000607,0.001528,0.005004,0.006972,0.003044,0.001088,0.000278,0.000249,0.000309,0.001991,0.000608,0.003242,0.000885,0.002625,0.003559,0.000465,0.002286,0.002165,0.001488,0.001377,0.001365,0.003097,0.000992,0.002813,0.001426,0.00227,0.000871,0.001216,0.004558,0.003473,0.001601,0.002697,0.001312,0.000555,0.001976,0.002338,0.001929,0.000467,0.000736,0.002692,0.001446,6.7e-05,0.001078,0.000607,0.000212,0.000336,0.000264,0.000529,0.001002,0.00024,0.000294,0.000245,0.000765,0.000976,0.000263,0.000185,0.00025,0.000174,0.000134,0.000137,0.000325,0.000481,0.001129,0.000454,0.000207,0.000291,4e-04,0.000881,0.000337,0.000134,3e-05,0.000168,0.00012,0.000148,8e-05,0.000112,0.002195,0.00131,0.000382,0.000215,2.6e-05,2.8e-05,3e-05,6.5e-05,9e-05,7.8e-05,0.000114,8.6e-05,0.000105,4.4e-05
3.3e-05,4.6e-05,4.6e-05,3.9e-05,8.9e-05,6.1e-05,2.7e-05,6.6e-05,5.2e-05,6.4e-05,0.000101,8.7e-05,4.5e-05,4.8e-05,4.3e-05,3.2e-05,4e-05,7e-05,8e-06,7.5e-05,4.1e-05,4.1e-05,8.5e-05,0.000128,8.9e-05,0.000121,0.000109,3.1e-05,0.000154,0.00031,0.00098,0.000421,0.002197,0.004496,0.002134,0.001395,0.000612,9.5e-05,0.000498,6.8e-05,0.001942,0.001944,0.002322,0.002151,0.001703,0.002622,0.002308,0.001464,0.000784,0.00113,1e-04,0.001818,0.002023,0.001875,0.001767,0.001512,0.002512,0.002205,0.001958,0.002178,0.001599,0.000198,0.001836,0.001996,0.000905,0.001314,0.00043,0.000892,0.000789,0.00106,0.001206,0.000446,0.000338,0.000935,0.000512,0.000319,0.000375,8e-05,0.000282,0.000325,0.000422,0.00018,0.000256,0.000802,0.00044,0.000203,0.000154,0.000107,8.2e-05,0.000138,0.000292,0.000415,0.000259,0.000182,0.000392,0.000391,0.000502,0.000536,0.000226,0.000208,9.8e-05,0.000126,0.000333,0.000495,0.000319,0.000132,3.1e-05,0.001581,0.000931,0.000668,0.000281,0.000131,0.000122,3.7e-05,9e-05,0.000146,7.4e-05,0.000111,0.000169,5e-05,2e-05
3.6e-05,1.6e-05,2.5e-05,9e-06,4.9e-05,1.6e-05,2e-05,2.7e-05,2.3e-05,4.1e-05,3.4e-05,5.3e-05,4.7e-05,1.9e-05,2.1e-05,1.9e-05,4.5e-05,2.3e-05,1.6e-05,4.2e-05,1.6e-05,1.3e-05,8.9e-05,3e-05,5.2e-05,3e-05,5.6e-05,1.9e-05,9.8e-05,0.000242,0.000326,0.000262,0.001831,0.003126,0.000584,0.000356,0.000367,0.000357,0.000223,0.000348,0.002495,0.000408,0.001834,0.001777,0.001008,4e-04,0.001937,0.001949,0.001708,0.001643,0.000784,0.001848,0.000454,0.000904,0.001137,0.001651,0.001907,0.000561,0.001456,0.001137,0.003191,0.001279,0.001723,0.001806,0.001722,0.002122,0.000896,0.000987,0.000813,0.000594,0.001746,0.000588,0.00031,0.000718,0.000231,9.2e-05,0.000207,7.7e-05,0.00043,0.00036,4.3e-05,9.8e-05,0.000173,0.000686,0.000379,0.000208,8.2e-05,8.6e-05,9.4e-05,1e-04,0.00016,0.00044,0.000814,0.001418,0.000537,0.000123,0.000236,0.000714,0.000221,9.6e-05,6.3e-05,0.000101,0.000355,0.000141,2.3e-05,1.3e-05,7.4e-05,0.000814,7e-04,0.000176,6e-05,7.9e-05,3.5e-05,2e-05,6.8e-05,6.9e-05,4.8e-05,0.000101,3.1e-05,4.4e-05,6e-06
1.8e-05,3.9e-05,2.2e-05,1.2e-05,4.1e-05,1.3e-05,1.7e-05,1.3e-05,4e-06,1e-05,1.8e-05,2.4e-05,1.8e-05,4.4e-05,2e-05,2.4e-05,1.7e-05,3.1e-05,3.6e-05,6.9e-05,4.2e-05,3.4e-05,7.2e-05,3.1e-05,3.8e-05,8.5e-05,9.4e-05,2.7e-05,2.1e-05,0.000138,2e-04,0.000208,0.000555,0.002696,0.000807,0.000287,0.000415,0.000549,0.000395,0.000366,0.002811,0.003837,0.002218,0.00135,0.0011,0.00217,0.003606,0.002522,0.000951,0.000154,0.000861,0.001977,0.0013,0.00136,0.002132,0.001297,0.001033,0.001427,0.001403,0.000799,0.004181,0.001122,0.001291,0.001927,0.000557,0.001106,0.000478,0.001086,0.000513,7.1e-05,0.001414,0.000452,0.000299,0.000435,0.000366,0.000256,0.000256,5.2e-05,0.000536,0.000391,0.000219,8.6e-05,0.000121,0.000436,0.000191,0.000147,0.000227,0.00018,0.000146,2.8e-05,5.5e-05,0.000225,0.00084,0.000734,0.00048,3.8e-05,6.4e-05,0.000734,0.000397,0.000229,0.000127,0.00015,0.000322,0.000285,0.000171,3.2e-05,3.9e-05,0.000617,0.00033,0.000181,5.8e-05,8.6e-05,6.9e-05,4.5e-05,4.1e-05,8.1e-05,4.2e-05,6.3e-05,3.7e-05,2.8e-05,4.1e-05
9e-06,3.6e-05,4.3e-05,1.1e-05,6.1e-05,3e-05,1.9e-05,2.8e-05,2e-05,1.9e-05,1.4e-05,4e-06,1.3e-05,2.6e-05,3.2e-05,1.7e-05,2.3e-05,3.5e-05,1.9e-05,5.3e-05,2.8e-05,2.3e-05,6.2e-05,3.5e-05,3.4e-05,5e-05,3.4e-05,4.2e-05,5.9e-05,0.000161,0.000234,0.000341,0.001134,0.002529,0.001196,0.000746,0.000558,0.00027,0.000222,0.000161,0.00333,0.002755,0.003263,0.000926,0.002385,0.003511,0.001933,0.00372,0.001047,0.000163,0.001348,0.002769,0.001648,0.003968,0.002094,0.0032,0.000831,0.00059,0.001607,0.001088,0.003698,0.003454,0.002464,0.001843,0.00156,0.001764,0.00064,0.000772,0.000666,0.000541,0.001099,0.001186,0.000455,0.000483,0.000193,0.000165,0.000423,0.000112,0.000501,0.000123,0.00046,0.000233,0.000155,0.000274,0.000192,0.000167,0.000174,8.4e-05,0.000206,0.000146,0.000116,0.000209,0.000917,0.000165,9.7e-05,3.1e-05,0.00013,0.000697,0.000245,0.000124,5.8e-05,1.5e-05,0.000377,0.00037,0.000151,2.4e-05,4.1e-05,0.000998,0.00044,6.9e-05,7e-05,8.6e-05,3.8e-05,7e-06,2.8e-05,3.4e-05,1.5e-05,2.1e-05,4e-06,2.1e-05,2e-05
2.1e-05,1.2e-05,2.8e-05,4.1e-05,4.5e-05,3.9e-05,3.4e-05,5.2e-05,1.9e-05,2e-05,8e-06,2.1e-05,1.7e-05,1.6e-05,3e-05,4.7e-05,4e-05,4.1e-05,5.2e-05,1.3e-05,3.9e-05,4.1e-05,2.9e-05,3e-05,2.4e-05,2.3e-05,4.3e-05,5.1e-05,8.1e-05,0.000144,0.000337,8.6e-05,0.001771,0.001914,0.001599,0.000495,0.000472,0.000474,0.000133,0.000408,0.003441,0.004187,0.003106,0.002037,0.002448,0.004425,0.003317,0.004241,0.00226,0.002922,0.001392,0.003253,0.003162,0.003463,0.003636,0.001296,0.002489,0.002303,0.003354,0.001611,0.00263,0.001409,0.002422,0.005631,0.003858,0.003536,0.002376,0.002292,0.003242,0.000454,0.001709,0.000679,0.000929,2e-04,0.000542,0.000479,0.000673,0.000937,0.001339,0.000953,0.000288,0.000292,0.000354,0.000122,6e-06,0.000109,0.000109,0.000126,0.000204,0.000127,0.000209,0.000249,0.001075,9.5e-05,5.1e-05,8.2e-05,0.000208,0.000544,0.000465,0.000199,6.6e-05,5.7e-05,0.000416,0.000513,0.000216,5e-05,6.5e-05,0.001101,0.000975,0.000493,0.000118,3.4e-05,6e-06,2.5e-05,2.9e-05,3.2e-05,2.3e-05,2.9e-05,2.9e-05,5.1e-05,2.5e-05
1.5e-05,2.1e-05,1.4e-05,3.3e-05,2.8e-05,5.7e-05,8e-05,2e-05,2.5e-05,2.4e-05,2.1e-05,2e-05,4.4e-05,4.6e-05,5.4e-05,2.2e-05,4.6e-05,5.6e-05,2.7e-05,2.3e-05,3.8e-05,3.4e-05,3.4e-05,2.3e-05,1e-05,2.4e-05,3.7e-05,4.2e-05,0.000108,0.000181,0.000343,0.000205,0.001028,0.000911,0.002041,0.001471,0.00063,0.000604,0.000461,0.000559,0.00326,0.009054,0.002746,0.002461,0.005982,0.007375,0.000662,0.007524,0.009328,0.001371,0.002693,0.006423,0.005197,0.007539,0.001631,0.002797,0.005434,0.003784,0.003531,0.001919,0.006436,0.004962,0.001995,0.008451,0.00399,0.001943,0.003935,0.002654,0.004014,0.003184,0.001451,0.002853,0.002064,0.001052,0.001384,0.001119,0.000448,0.001042,0.001654,0.001098,0.000206,4e-06,0.000292,0.000331,0.000744,0.000393,0.000402,0.000103,0.000401,0.000336,9.7e-05,2e-05,0.001116,0.00121,0.000418,5.2e-05,6.2e-05,5.2e-05,0.000279,6.6e-05,6.4e-05,9.8e-05,0.000374,0.000172,0.000161,7.7e-05,8.4e-05,0.00088,0.000573,0.000418,0.000154,4.8e-05,2.8e-05,3.5e-05,2.6e-05,6.4e-05,6.9e-05,3.4e-05,4.2e-05,3.8e-05,5e-05
1.4e-05,3.2e-05,4.4e-05,3.5e-05,1.6e-05,4.8e-05,3.6e-05,2.3e-05,2.3e-05,5.7e-05,4.7e-05,4.1e-05,2.8e-05,4.5e-05,1.5e-05,4.2e-05,1.8e-05,2.9e-05,4.3e-05,9e-06,1.4e-05,3.7e-05,3.4e-05,1.9e-05,2.8e-05,1.1e-05,5e-05,4e-05,8.7e-05,0.000171,9.2e-05,0.000129,0.000867,0.003386,0.001455,0.001372,0.000545,0.000681,0.000715,0.000207,0.002675,0.007888,0.010961,0.006091,0.008689,0.003833,0.007839,0.011037,0.008449,0.010467,0.008929,0.004689,0.005214,0.005491,0.008761,0.006736,0.008643,0.005589,0.004589,0.004647,0.007488,0.011612,0.004944,0.007267,0.011582,0.006636,0.004489,0.004671,0.006623,0.003768,0.003515,0.005367,0.002544,0.000904,0.001995,0.001858,0.001474,0.000932,0.002834,0.003973,0.002622,0.000872,0.000407,0.000731,0.001321,0.001072,0.000571,0.000155,0.000418,0.000401,0.000343,0.00049,0.001295,0.002022,0.001369,0.000447,0.00022,0.000449,0.000378,0.000302,0.000139,6.7e-05,0.000379,0.000255,0.000149,0.000213,0.000149,0.000678,0.000808,0.000502,0.000223,9.6e-05,8.4e-05,5.4e-05,1.9e-05,6.4e-05,3e-05,7.4e-05,4.6e-05,1.2e-05,3.9e-05
3.6e-05,3.7e-05,4.7e-05,5e-05,1.5e-05,5.6e-05,2.1e-05,7e-06,2.4e-05,3.7e-05,4.1e-05,1.7e-05,3.9e-05,1.9e-05,3.9e-05,8e-06,1.2e-05,1.7e-05,3.8e-05,3.7e-05,1.1e-05,3.5e-05,4e-06,2.9e-05,2.6e-05,4.9e-05,9e-06,2.9e-05,0.000102,0.000111,0.000141,0.00021,0.001758,0.00294,0.002897,0.001031,0.00035,0.000478,0.000654,0.000504,0.002304,0.00438,0.006059,0.003805,0.004565,0.004721,0.008467,0.005032,0.004725,0.007954,0.004036,0.008596,0.008003,0.009153,0.006382,0.007346,0.007263,0.002641,0.005438,0.008556,0.007266,0.004311,0.0096,0.001395,0.006433,0.004474,0.001418,0.005385,0.00983,0.004876,0.004362,0.002834,0.002007,0.002406,0.002334,0.001974,0.002273,0.001509,0.001533,0.003117,0.002591,0.001506,0.001083,0.001573,0.001617,0.00097,0.000234,0.00041,0.000462,0.000256,0.000288,0.000407,0.000961,0.001753,0.000469,0.000102,0.000103,0.001031,0.000758,0.00029,7.7e-05,4.2e-05,0.000301,0.000214,0.000136,0.000159,6.2e-05,0.000873,0.001191,0.000485,0.000156,0.000125,0.000122,6.8e-05,2.9e-05,6e-05,2.8e-05,9.5e-05,9.8e-05,4.5e-05,4.1e-05
3.9e-05,1.4e-05,4.1e-05,4e-05,3.3e-05,4.6e-05,2.7e-05,1e-05,1.5e-05,4.6e-05,5.6e-05,5.1e-05,3.8e-05,2.1e-05,1.7e-05,3.3e-05,8e-06,1.8e-05,1.7e-05,1.7e-05,2.4e-05,4.4e-05,5e-05,3e-05,1.4e-05,6.3e-05,6.2e-05,5.2e-05,3.4e-05,0.000182,0.000148,0.000272,0.002292,0.003962,0.00029,0.00053,0.001122,0.001088,0.000847,0.000286,0.002066,0.001996,0.003305,0.00248,0.002408,0.003904,0.003305,0.001057,0.003073,0.002256,0.003557,0.005014,0.004602,0.002286,0.00584,0.009077,0.003361,0.001817,0.006948,0.004443,0.001455,0.004218,0.005792,0.006617,0.000565,0.002714,0.003523,0.006418,0.002451,0.002829,0.002931,0.003112,0.001279,0.001044,0.002919,0.001341,0.00184,0.001274,0.000465,0.00141,0.001008,0.000393,0.000615,0.000501,0.002141,0.000814,0.00027,0.000119,0.000193,0.000106,0.000235,7.7e-05,0.000979,0.001302,0.000754,0.000171,0.000115,0.001485,0.001134,0.000406,6.8e-05,5e-05,0.000321,0.000167,0.000117,4.1e-05,7.7e-05,0.001304,0.000372,0.000165,1.9e-05,8.4e-05,3.7e-05,2.7e-05,5.9e-05,5.4e-05,4.3e-05,9.3e-05,5.1e-05,3e-05,4.3e-05
4.2e-05,3.7e-05,4.9e-05,3e-06,1.7e-05,1.4e-05,2.1e-05,2.9e-05,2.2e-05,4.1e-05,4e-05,3.4e-05,4.3e-05,5.1e-05,5.7e-05,4e-05,4.2e-05,2.9e-05,1e-05,2.9e-05,7e-06,4.1e-05,4.5e-05,2.3e-05,2e-05,4.5e-05,1.2e-05,3e-05,4.2e-05,0.000109,0.000257,0.000244,0.001634,0.002128,0.002886,0.001331,0.000968,0.000439,0.000589,0.000337,0.00183,0.000286,0.001487,0.001585,0.00112,0.002251,0.001875,0.000646,0.003536,0.003181,0.005847,0.003585,0.002288,0.001018,0.001954,0.00305,0.002522,0.003789,0.005544,0.005713,0.001695,0.001189,0.003869,0.001467,0.002367,0.001333,0.003262,0.003061,0.002406,0.002786,0.003111,0.001641,0.001742,0.000384,0.001121,0.000728,0.001311,0.001446,0.001139,0.000679,0.001005,0.000922,0.000377,0.000184,0.001459,0.001123,0.000635,0.000248,0.000106,0.000235,0.000505,0.000331,0.000929,0.000704,0.000439,0.000138,0.000222,0.001599,0.001326,0.000683,0.000249,5.2e-05,0.00036,0.000417,0.000133,0.00012,4.9e-05,0.001403,0.000535,0.000218,8.4e-05,3.7e-05,6.2e-05,2.4e-05,7.3e-05,4.1e-05,5.5e-05,0.000115,4.7e-05,1.8e-05,3.1e-05
4e-06,1.8e-05,1.3e-05,1.3e-05,1.1e-05,2e-05,2.6e-05,2.2e-05,2.5e-05,2.6e-05,5e-05,6.2e-05,6.1e-05,3.6e-05,2.7e-05,2.6e-05,4.3e-05,1.8e-05,1.6e-05,2.8e-05,4.2e-05,5.2e-05,6e-05,5.1e-05,6.2e-05,6.2e-05,3.9e-05,8e-06,2.2e-05,5.7e-05,0.00014,3.8e-05,0.000975,0.00074,0.000804,0.000426,0.000479,0.000595,8.8e-05,0.000166,0.001394,0.001302,0.000884,0.001222,0.001313,0.001481,0.000658,0.001203,0.001646,0.002127,0.003414,0.001229,0.00215,0.001192,0.00043,0.001324,0.002076,0.001599,0.001137,0.000954,0.001744,0.002007,0.001991,0.001204,0.002008,0.002801,0.00262,0.00117,0.002164,0.001156,0.000897,0.00159,0.001573,0.001176,0.000924,0.000404,0.000607,0.000406,0.000116,0.000219,0.000479,0.000564,0.000182,0.000548,0.000656,0.000346,0.000115,5.1e-05,3.7e-05,0.000215,0.000304,0.00024,6e-04,0.000155,6.6e-05,0.000177,0.000188,0.001745,0.000781,0.000326,9.2e-05,5.5e-05,0.000327,0.000333,0.000242,0.000152,0.000102,0.001277,0.000965,0.000441,0.000131,8.1e-05,2.9e-05,1.4e-05,7.2e-05,0.000108,0.000132,3.2e-05,3.2e-05,1.7e-05,2.2e-05
1.2e-05,2e-05,1.8e-05,1e-05,1.5e-05,1e-05,5e-06,2.5e-05,7e-06,1.3e-05,4.4e-05,1.8e-05,1.8e-05,1.8e-05,6e-06,2.2e-05,2.6e-05,1.1e-05,2.5e-05,3.8e-05,2.5e-05,1.2e-05,3.5e-05,1.9e-05,2.8e-05,4.7e-05,3.7e-05,2.1e-05,2.3e-05,7.3e-05,0.000118,9.1e-05,0.000523,0.001743,0.00084,3e-04,0.000414,0.000642,0.000221,9.7e-05,0.001262,0.000903,0.000535,0.002247,0.001624,0.000511,0.001023,0.000163,0.000971,0.001666,0.001815,0.00044,0.00151,0.001356,0.001598,0.002393,0.000343,0.00067,0.001848,0.00276,0.00208,0.001574,0.001283,0.000654,0.000858,0.002822,0.001095,0.002881,0.000586,0.000604,0.000645,0.000885,0.000316,0.000634,0.000535,0.000547,0.000241,0.000188,0.000258,0.000239,0.000538,0.000213,0.000146,0.000602,0.000266,0.000206,0.000144,6e-05,5.6e-05,0.000101,0.000137,0.000211,0.00056,0.000171,7.6e-05,5.6e-05,6.5e-05,0.00148,0.000612,0.000232,8e-05,9.1e-05,0.000294,0.000146,4.7e-05,2.1e-05,5.8e-05,0.001131,0.00096,0.000381,4.8e-05,8e-06,3.4e-05,1.7e-05,6e-05,6.6e-05,3.7e-05,1.9e-05,2.4e-05,2.8e-05,3.8e-05
8e-06,8e-06,3e-06,6e-06,1e-05,4e-06,6e-06,9e-06,5e-06,5e-06,1.5e-05,3e-06,6e-06,1.7e-05,1.7e-05,1e-06,1e-05,4e-06,6e-06,1.4e-05,1.2e-05,2e-06,1.4e-05,5e-06,1.2e-05,1e-05,9e-06,8e-06,9e-06,3.8e-05,3.5e-05,2.2e-05,0.000265,0.000799,0.000289,1e-04,9.1e-05,0.000131,7.1e-05,8.5e-05,0.000463,0.000375,0.000215,0.00073,0.000541,7.1e-05,0.000383,0.000607,0.000613,0.000712,0.00032,0.00025,0.000335,0.000223,0.000559,0.000252,0.000428,0.000803,0.000508,0.000491,0.000381,0.000578,0.000148,0.000812,0.000537,0.000936,0.000893,0.000443,0.000447,0.000461,0.000127,0.000354,0.000245,0.000173,0.000236,0.000109,5.2e-05,0.000119,0.000139,0.000164,5e-05,6.2e-05,4.4e-05,0.000153,9e-05,5.1e-05,6.6e-05,4e-05,3.9e-05,4.1e-05,6e-06,5.7e-05,0.000231,4.3e-05,5.7e-05,1.9e-05,2.4e-05,0.000576,0.000318,0.000128,5.3e-05,3.6e-05,0.000188,0.000106,2.5e-05,4e-06,2.6e-05,0.00044,0.000193,0.000105,1.6e-05,2.8e-05,1.2e-05,1.6e-05,3.6e-05,7e-06,1.6e-05,1.4e-05,1e-05,1e-05,1.2e-05
4e-06,7e-06,2e-06,5e-06,3e-06,3e-06,1e-05,6e-06,2e-06,5e-06,9e-06,6e-06,6e-06,1.1e-05,3e-06,9e-06,1.1e-05,6e-06,2e-06,4e-06,8e-06,4e-06,8e-06,6e-06,6e-06,1.2e-05,1.4e-05,9e-06,1.8e-05,1.8e-05,1.3e-05,2.3e-05,0.000286,0.000798,0.000236,7.8e-05,0.000108,1e-04,8.6e-05,2.5e-05,0.000245,0.000577,0.000464,0.00069,0.000573,0.000136,0.000321,4e-04,0.000146,0.000454,0.000459,0.000243,0.000303,0.00027,0.000776,0.000578,0.000569,0.000395,0.000764,0.000285,0.000398,0.000485,1.4e-05,0.000286,0.000619,5.1e-05,0.000639,0.00069,0.000439,3.4e-05,0.000105,0.000278,0.000104,4.4e-05,6.4e-05,0.000128,0.000107,3.5e-05,0.000109,9.7e-05,5.1e-05,4e-06,6.9e-05,7.4e-05,7.3e-05,3.3e-05,4e-05,7e-06,3e-06,4.1e-05,2.2e-05,5.1e-05,0.000168,6.7e-05,3.4e-05,2.9e-05,2.6e-05,0.000342,0.000225,9.1e-05,4e-05,1.9e-05,0.000184,9.7e-05,5.4e-05,2.6e-05,2e-05,0.000293,2e-04,6.9e-05,1.9e-05,1.5e-05,7e-06,1.1e-05,2e-05,7e-06,8e-06,5e-06,8e-06,3e-06,1.1e-05
4e-06,3e-06,6e-06,5e-06,4e-06,3e-06,8e-06,4e-06,5e-06,4e-06,1e-05,6e-06,4e-06,1e-06,6e-06,7e-06,1e-06,8e-06,4e-06,6e-06,9e-06,5e-06,3e-06,8e-06,6e-06,1.4e-05,5e-06,4e-06,1.1e-05,1.7e-05,6e-06,2.8e-05,0.000223,0.000277,0.000443,0.000184,1.9e-05,8.7e-05,4.1e-05,5.8e-05,8e-05,0.000289,0.00015,0.000897,0.000692,0.000414,0.000322,0.000542,0.000368,0.000223,7e-04,0.00052,0.000219,8.6e-05,0.000534,0.000301,0.000313,0.000184,5e-04,0.000464,0.000129,0.000396,0.000249,0.000282,0.000382,0.000272,0.000286,0.000608,0.000267,0.000224,0.00019,0.000173,0.00019,9.1e-05,0.000106,5.2e-05,5.1e-05,8.8e-05,9.4e-05,1.5e-05,7.3e-05,3e-05,2.4e-05,6.1e-05,3e-05,8e-06,4e-06,2.5e-05,1.8e-05,3.3e-05,3.3e-05,5.8e-05,0.000146,5.6e-05,3.3e-05,9e-06,1.8e-05,0.00012,5.9e-05,1.6e-05,7e-06,9e-06,0.000155,6e-05,3e-05,1.6e-05,1.9e-05,0.000201,8.2e-05,4.2e-05,1.9e-05,2e-05,1.8e-05,1.6e-05,5e-06,1e-05,3e-06,4e-06,6e-06,2e-06,5e-06
1e-06,5e-06,1e-06,2e-06,6e-06,4e-06,6e-06,2e-06,5e-06,1e-06,5e-06,4e-06,3e-06,1e-06,4e-06,5e-06,6e-06,1.1e-05,6e-06,5e-06,6e-06,7e-06,1e-05,6e-06,3e-06,1.2e-05,1.4e-05,1e-06,8e-06,1.2e-05,2.2e-05,9e-06,0.000199,0.000162,0.000278,0.000181,6.8e-05,5e-05,4.5e-05,3.1e-05,0.000179,0.000312,0.000262,0.000749,0.000481,0.000584,0.00033,0.00019,0.000258,0.000183,0.000598,0.000307,0.00053,0.000308,0.000581,3e-04,0.000715,0.000253,0.000449,0.000713,0.000379,0.000475,0.000243,4.2e-05,3.4e-05,0.000161,0.000398,0.000464,0.000262,0.000269,0.000127,0.000141,0.000168,9.1e-05,6.4e-05,6.1e-05,3.3e-05,7.7e-05,9e-05,5.2e-05,3.4e-05,1.7e-05,3.7e-05,4.9e-05,1.7e-05,8e-06,2.1e-05,2.2e-05,2.2e-05,2.8e-05,1.7e-05,3.3e-05,0.000114,9e-06,3.6e-05,3.6e-05,2.2e-05,4.5e-05,8.5e-05,3e-05,1.1e-05,1.5e-05,0.000139,5.2e-05,2.1e-05,8e-06,1.1e-05,0.00017,0.000142,7.6e-05,2.3e-05,1.3e-05,1.2e-05,2e-06,4e-06,3e-06,2e-06,5e-06,7e-06,3e-06,4e-06
0,6e-06,5e-06,1e-06,6e-06,2e-06,4e-06,5e-06,2e-06,5e-06,5e-06,4e-06,3e-06,3e-06,5e-06,8e-06,3e-06,3e-06,1e-06,3e-06,4e-06,8e-06,7e-06,9e-06,7e-06,4e-06,4e-06,1e-06,8e-06,8e-06,4e-05,2.4e-05,2e-04,0.000284,0.000105,7.3e-05,4.4e-05,7e-06,4.5e-05,7.3e-05,0.000358,0.000166,0.000137,5.7e-05,0.000589,0.000796,0.000673,0.000336,9.6e-05,0.000142,0.000461,0.000571,0.000765,0.000555,0.000498,0.000321,0.000679,0.000629,0.000545,0.000486,0.000291,0.000315,0.000166,0.000324,0.000223,0.000203,0.000236,0.000295,0.000335,3.2e-05,2.7e-05,8.8e-05,0.00011,7.8e-05,5.1e-05,7.2e-05,7.5e-05,6e-05,0.000101,1.7e-05,3.9e-05,2.6e-05,4.4e-05,3.8e-05,1e-05,1.6e-05,1.6e-05,1e-06,2.5e-05,2.8e-05,9e-06,4e-05,1e-04,2.4e-05,4.5e-05,1.4e-05,3.5e-05,0.000118,2.4e-05,1.6e-05,7e-06,1.3e-05,0.000105,4.6e-05,1.9e-05,6e-06,4e-06,0.000195,7.1e-05,2.3e-05,1.1e-05,9e-06,2e-05,1.2e-05,2e-06,6e-06,2e-06,6e-06,5e-06,4e-06,5e-06
0,9e-06,7e-06,5e-06,3e-06,3e-06,6e-06,6e-06,2e-06,5e-06,7e-06,3e-06,2e-06,4e-06,3e-06,8e-06,4e-06,6e-06,1e-06,5e-06,4e-06,6e-06,7e-06,3e-06,5e-06,4e-06,9e-06,1e-06,1.5e-05,1.7e-05,2.7e-05,1.9e-05,0.000163,0.000351,0.00022,0.000168,5.2e-05,1.8e-05,4.7e-05,7e-06,0.000406,0.000341,0.000401,0.000694,0.000623,0.000384,0.00051,0.000529,0.000556,0.000553,0.000383,0.000359,0.000335,0.000183,0.000442,0.000378,0.000415,0.000294,5.8e-05,0.000145,0.000357,0.000463,0.000445,0.000413,0.000289,0.000372,0.000342,0.000194,0.000281,0.000247,3.4e-05,5.4e-05,0.000174,6.8e-05,0.000106,7e-05,5.5e-05,1.6e-05,5.9e-05,1e-05,3.7e-05,2.5e-05,3.4e-05,3.9e-05,8e-06,1.9e-05,5e-06,2.3e-05,2.4e-05,8e-06,1.8e-05,3.1e-05,7.7e-05,3.5e-05,2.9e-05,9e-06,3e-05,8.4e-05,3.2e-05,7e-06,2.2e-05,1e-05,6.3e-05,3.8e-05,2.8e-05,8e-06,1.5e-05,0.000196,6.6e-05,1.9e-05,1.9e-05,7e-06,1.3e-05,6e-06,4e-06,6e-06,6e-06,9e-06,5e-06,5e-06,5e-06
6e-06,7e-06,5e-06,5e-06,2e-06,5e-06,8e-06,5e-06,5e-06,8e-06,8e-06,1e-05,5e-06,6e-06,6e-06,2e-06,5e-06,7e-06,6e-06,5e-06,5e-06,6e-06,1e-05,1.4e-05,6e-06,5e-06,6e-06,4e-06,2.3e-05,1.6e-05,8e-06,2.3e-05,0.000101,0.000538,0.000247,0.000131,4e-05,7.3e-05,7.5e-05,1.6e-05,0.000416,0.000147,0.000377,0.000125,0.000465,5e-04,3.3e-05,0.000193,0.000425,0.000406,0.000288,0.000422,0.000171,0.000522,0.00028,0.000218,0.000289,0.000482,0.000272,0.000403,0.000333,0.000254,0.00053,0.000308,0.000317,6.5e-05,0.00032,0.000288,0.000149,0.000125,0.000133,0.000107,0.000143,0.000122,5.8e-05,0.000161,3.7e-05,0.000111,6.8e-05,6.9e-05,4.2e-05,8e-06,2.8e-05,3.3e-05,7.7e-05,7.2e-05,5.2e-05,2.2e-05,4.2e-05,2.5e-05,2.7e-05,5.1e-05,5.4e-05,4.1e-05,4.5e-05,4.3e-05,1.9e-05,3.7e-05,3.8e-05,1.2e-05,2.1e-05,2.6e-05,7.1e-05,2.4e-05,2.6e-05,1.2e-05,1.8e-05,0.000154,0.00015,6.6e-05,1.2e-05,8e-06,1.2e-05,8e-06,3e-06,6e-06,7e-06,8e-06,9e-06,5e-06,5e-06
1.5e-05,8e-06,9e-06,1.5e-05,9e-06,3e-06,3e-06,1.1e-05,6e-06,4e-06,8e-06,1.4e-05,1.3e-05,7e-06,5e-06,4e-06,1e-05,1.5e-05,1.2e-05,5e-06,5e-06,9e-06,8e-06,1.1e-05,6e-06,4e-06,1.2e-05,7e-06,2.1e-05,3e-05,4.1e-05,4e-05,5.6e-05,0.000415,0.00016,0.000139,8.9e-05,9.5e-05,4.3e-05,2e-05,0.000341,0.000182,0.000326,0.000328,0.000165,0.000332,0.000292,0.000244,0.000183,0.000253,0.000293,0.000256,0.000412,0.000205,0.000524,0.000307,0.000164,0.000649,0.000459,0.000608,0.000361,0.000102,0.00048,0.000267,0.000317,0.000108,4.4e-05,0.000219,0.000172,6.8e-05,0.000102,0.000113,8.4e-05,0.000127,0.000138,0.000218,0.000139,0.000191,0.000156,5.6e-05,2.2e-05,2.1e-05,4.1e-05,8.3e-05,0.000134,5.2e-05,3e-06,3.4e-05,3.8e-05,1.2e-05,3.6e-05,1.1e-05,9.4e-05,9.2e-05,7.4e-05,3.2e-05,2e-05,3.2e-05,1.2e-05,3.5e-05,1.3e-05,2e-05,7e-05,6.2e-05,3.2e-05,1.5e-05,1e-05,4.2e-05,0.000125,5.1e-05,1.7e-05,1e-06,9e-06,1.2e-05,1.1e-05,8e-06,1e-05,2e-05,2.3e-05,9e-06,9e-06
3e-06,6e-06,2e-06,1.3e-05,9e-06,1e-06,5e-06,1e-05,5e-06,5e-06,4e-06,9e-06,6e-06,7e-06,1e-06,0,8e-06,3e-06,4e-06,7e-06,1e-05,6e-06,7e-06,4e-06,4e-06,1.3e-05,5e-06,4e-06,1.4e-05,1e-05,2.2e-05,3.1e-05,8.8e-05,0.000257,6.3e-05,9e-05,7.4e-05,0.000244,0.000163,3e-05,0.000272,0.00011,0.000189,0.00032,0.000379,0.000496,0.000119,0.000178,0.000171,0.000394,0.000396,0.000257,0.000308,0.00017,0.000406,0.000345,2.7e-05,0.000318,0.000314,0.000245,0.000233,0.000283,0.000339,0.000195,0.000157,0.000147,0.000124,9.2e-05,0.000115,0.000221,7e-05,8.2e-05,0.000114,9.6e-05,0.000133,4.7e-05,4.3e-05,5.9e-05,0.000133,0.000117,0.000109,3.9e-05,4.9e-05,3e-05,0.000106,6.4e-05,4e-05,4.3e-05,6.7e-05,7.6e-05,5.5e-05,4.2e-05,0.000166,9.6e-05,2.9e-05,2.5e-05,3.3e-05,8.9e-05,5.3e-05,5.3e-05,9e-06,1.6e-05,8.2e-05,7.1e-05,4e-05,1.9e-05,1.4e-05,6.2e-05,6.3e-05,4.9e-05,9e-06,1.4e-05,2e-06,5e-06,4e-06,1.1e-05,8e-06,1e-05,4e-06,1.4e-05,1.8e-05
1.2e-05,7e-06,5e-06,9e-06,9e-06,6e-06,6e-06,1.1e-05,6e-06,4e-06,1.4e-05,7e-06,6e-06,8e-06,1e-06,2e-06,4e-06,1e-06,5e-06,1e-06,4e-06,7e-06,1.1e-05,7e-06,7e-06,9e-06,1e-05,9e-06,4e-06,8e-06,6e-06,5.7e-05,0.000174,0.000326,4.9e-05,3.5e-05,6.5e-05,0.000252,6.7e-05,9e-05,0.000176,0.000155,8.3e-05,0.000221,0.000713,0.000166,0.000307,3e-04,4.5e-05,0.000462,0.00028,0.000118,0.000395,0.000135,0.000255,0.000333,0.000146,0.000245,0.000398,0.00042,0.000168,0.000216,0.000233,0.000247,0.000129,0.000162,0.000375,0.000352,0.000259,0.000273,0.000319,0.000308,0.000242,0.000104,0.000129,5.2e-05,1.6e-05,3.3e-05,0.000124,0.000141,6.6e-05,5.9e-05,4.8e-05,8.8e-05,0.000121,4.1e-05,3.9e-05,7.6e-05,1.2e-05,4e-05,2e-05,2.4e-05,0.00025,0.000103,5.4e-05,4.3e-05,2.7e-05,0.000126,1.8e-05,3.7e-05,4.2e-05,3.5e-05,0.000135,7.8e-05,2.9e-05,1e-05,1.5e-05,0.00016,8.9e-05,2.9e-05,1.2e-05,3.4e-05,1.3e-05,5e-06,6e-06,3e-06,7e-06,1.4e-05,8e-06,1.5e-05,3e-06
5e-06,5e-06,3e-06,2e-06,8e-06,4e-06,6e-06,6e-06,5e-06,3e-06,1.1e-05,1e-06,4e-06,2e-06,6e-06,4e-06,6e-06,4e-06,7e-06,2e-06,6e-06,1e-06,7e-06,4e-06,5e-06,3e-06,1.1e-05,5e-06,6e-06,2.8e-05,7e-06,5.3e-05,0.000373,0.000361,0.000193,0.000139,0.000184,0.000238,0.000177,0.000143,0.000258,8.4e-05,0.000213,0.000192,0.00037,0.00032,0.000387,0.000114,5.5e-05,0.000351,0.00033,0.000195,0.000389,0.000156,0.000279,0.000104,0.000111,0.000275,0.000166,0.000478,0.00021,0.000293,8.2e-05,0.000179,0.000181,0.000117,0.00024,0.000256,0.000141,0.00022,0.00013,6e-05,7.5e-05,0.000211,0.000108,0.000104,1.1e-05,7.5e-05,5.9e-05,0.000111,7.1e-05,0.000145,9.9e-05,5.6e-05,0.000147,0.000106,2.1e-05,2.5e-05,2.3e-05,3.3e-05,1.4e-05,3.5e-05,0.000297,7.5e-05,1.9e-05,4.5e-05,4.3e-05,0.000105,7.6e-05,4.9e-05,5e-05,2.2e-05,0.000138,0.000171,7.6e-05,2.7e-05,1.5e-05,0.000213,0.000149,5.9e-05,3e-06,1.9e-05,1.6e-05,5e-06,7e-06,3e-06,4e-06,8e-06,4e-06,1.5e-05,1.5e-05
6e-06,5e-06,8e-06,6e-06,4e-06,3e-06,5e-06,0,1e-06,4e-06,6e-06,2e-06,4e-06,3e-06,3e-06,1e-06,7e-06,5e-06,5e-06,7e-06,7e-06,9e-06,8e-06,1e-06,2e-06,1e-05,1.5e-05,1.7e-05,1.1e-05,3.1e-05,2.2e-05,6.5e-05,0.000441,0.00046,0.000275,0.000226,9.2e-05,0.000174,0.000128,4.5e-05,0.000188,0.000155,0.00017,8.2e-05,0.000357,0.000119,0.000293,0.000165,0.000128,0.000124,0.000175,0.000222,0.000355,0.000142,0.000164,0.000277,6.1e-05,0.000174,0.000183,0.000171,5.3e-05,0.000171,7.3e-05,0.000101,0.00015,0.000107,0.000223,2e-04,0.000131,0.000165,0.000215,0.000257,8.5e-05,4.4e-05,7.1e-05,0.000181,0.000127,0.000121,0.000136,8.2e-05,9e-05,0.000146,0.00011,0.000153,0.000143,0.000119,6.3e-05,1.3e-05,1.9e-05,6.7e-05,1.8e-05,3.2e-05,0.000289,0.00028,0.000209,5.6e-05,5.9e-05,7.2e-05,2.7e-05,1.5e-05,3.3e-05,2.1e-05,0.00013,0.000191,0.000111,4.3e-05,3.5e-05,0.000229,0.000225,0.000111,2.1e-05,2.4e-05,1.6e-05,9e-06,1e-05,1.2e-05,1.1e-05,7e-06,1e-05,2e-05,4e-06
2e-06,0,7e-06,2e-06,3e-06,1e-06,7e-06,4e-06,2e-06,6e-06,1.4e-05,8e-06,1e-06,2e-06,2e-06,1e-06,7e-06,6e-06,6e-06,5e-06,7e-06,7e-06,7e-06,5e-06,3e-06,1e-05,1.1e-05,1.7e-05,2.1e-05,1.8e-05,1.7e-05,8.1e-05,0.000423,0.000362,0.000297,0.000129,0.00021,5.7e-05,5.3e-05,2.5e-05,0.000151,9.7e-05,9.4e-05,0.000308,0.000357,0.000175,0.000298,0.000235,0.000235,0.000143,0.000341,0.000209,0.000367,0.000126,0.00023,0.000312,4.3e-05,0.00027,0.000189,0.000422,0.000134,0.000153,0.000135,0.00013,0.000189,0.000191,0.000198,0.000314,0.000284,0.000194,0.000133,0.000123,0.000118,0.000129,0.000171,8.9e-05,8.6e-05,1e-05,1e-04,0.000117,0.000143,4.4e-05,8e-05,5e-05,0.000122,8.5e-05,3e-05,2.8e-05,1.1e-05,4.5e-05,2.3e-05,3.3e-05,0.000222,0.000201,5.2e-05,2.9e-05,6.8e-05,8e-05,8.4e-05,4.8e-05,3.1e-05,2.1e-05,0.000133,0.000122,4.2e-05,1.4e-05,3.2e-05,0.000231,0.000218,9.6e-05,1.2e-05,3.2e-05,2.8e-05,1.4e-05,4e-06,1.6e-05,8e-06,4e-06,3e-06,1.2e-05,1.3e-05
2e-06,2e-06,6e-06,2e-06,4e-06,0,6e-06,1e-06,4e-06,3e-06,1.1e-05,3e-06,1e-06,2e-06,3e-06,1e-06,4e-06,3e-06,2e-06,3e-06,2e-06,3e-06,5e-06,3e-06,2e-06,4e-06,1e-05,4e-06,2e-05,8e-06,3.7e-05,4.2e-05,0.000349,0.000463,0.000322,0.000151,0.000203,6.4e-05,0.000152,0.000101,0.000141,0.000146,5.5e-05,0.000318,0.000493,0.000201,0.000118,0.000174,0.000287,0.000237,0.000217,0.000114,0.000273,0.000153,0.000323,0.000104,6.5e-05,0.000258,0.000249,0.000353,5.3e-05,0.000138,0.000163,0.00019,7.8e-05,0.000313,0.000274,0.000171,0.000172,0.000142,8e-05,7.1e-05,0.000127,0.000107,0.000102,2.6e-05,1.4e-05,4.9e-05,2.3e-05,1.4e-05,3.9e-05,5.2e-05,2.7e-05,3.1e-05,0.000126,1.7e-05,3.6e-05,9e-06,1.6e-05,2.1e-05,1.8e-05,4.4e-05,0.000165,3.9e-05,5.6e-05,2.1e-05,7.9e-05,6.7e-05,6.5e-05,2.3e-05,2.9e-05,5e-06,0.000118,4.9e-05,2.4e-05,2.1e-05,1.7e-05,0.000153,8.6e-05,4.9e-05,1e-05,1e-05,1.7e-05,9e-06,8e-06,6e-06,2e-06,4e-06,6e-06,0,6e-06
2e-06,3e-06,4e-06,0,3e-06,2e-06,3e-06,3e-06,3e-06,4e-06,8e-06,5e-06,4e-06,5e-06,3e-06,2e-06,3e-06,2e-06,2e-06,5e-06,3e-06,3e-06,1.1e-05,7e-06,2e-06,7e-06,6e-06,1e-06,1.5e-05,5e-06,2.9e-05,3.5e-05,0.000139,0.000206,4.1e-05,0.000193,6.3e-05,0.000169,0.000243,0.000127,0.000193,0.000146,8.9e-05,0.000322,0.000357,0.000246,6.2e-05,1.7e-05,0.000201,0.00018,7.5e-05,0.000222,0.000384,0.000143,8.5e-05,0.000199,0.000173,0.000295,0.000293,0.000231,0.000143,0.000136,0.000147,0.00019,0.000162,0.000285,0.000319,0.000278,0.000153,0.000129,0.000171,0.000163,0.000132,0.000121,4.7e-05,4.9e-05,2.4e-05,5e-05,0.000111,2.8e-05,2e-05,0.000132,8.5e-05,1.2e-05,0.000122,0.000111,5.7e-05,7e-06,1.7e-05,2.1e-05,1.8e-05,5e-05,0.000221,0.000222,3.5e-05,1.5e-05,6.6e-05,0.000109,9.4e-05,5.9e-05,8e-06,8e-06,9.3e-05,3.9e-05,1.9e-05,1e-05,1.4e-05,0.000117,6.4e-05,4.5e-05,1.4e-05,1.5e-05,7e-06,3e-06,1.1e-05,9e-06,1e-06,3e-06,4e-06,7e-06,3e-06
1e-06,3e-06,2e-06,2e-06,3e-06,3e-06,4e-06,3e-06,1e-06,2e-06,4e-06,2e-06,2e-06,2e-06,3e-06,0,1e-06,3e-06,1e-06,3e-06,2e-06,3e-06,7e-06,7e-06,4e-06,5e-06,4e-06,2e-06,6e-06,5e-06,8e-06,1.6e-05,1.3e-05,0.000172,0.000139,0.000262,0.000142,0.000143,0.000138,0.000133,0.000184,5.3e-05,0.000309,5e-04,0.000362,0.000185,6.2e-05,4.7e-05,0.000115,0.000468,0.000396,0.000224,0.000505,0.000173,0.000375,0.000264,0.00042,8.2e-05,0.000333,0.00029,0.000184,0.000267,0.00015,9.5e-05,0.000211,0.000188,0.000249,0.000206,4e-05,0.00015,9.4e-05,1.1e-05,0.000155,0.000166,0.000177,7.1e-05,1.7e-05,7e-05,0.000152,0.000152,0.000103,0.000142,0.000101,8.5e-05,0.000109,0.000129,7.5e-05,2.2e-05,2.1e-05,2.7e-05,2.6e-05,7.6e-05,0.000181,0.000157,0.000124,6e-05,5.8e-05,0.000137,5e-05,3.4e-05,1.3e-05,1e-06,7.6e-05,8.5e-05,5.1e-05,1.2e-05,9e-06,8.1e-05,0.000112,5.5e-05,1.2e-05,5e-06,6e-06,3e-06,8e-06,3e-06,2e-06,3e-06,2e-06,4e-06,5e-06
4e-06,1e-06,2e-06,1e-06,2e-06,3e-06,1e-06,4e-06,3e-06,1e-06,7e-06,0,1e-06,2e-06,2e-06,1e-06,1e-06,2e-06,1e-06,1e-06,3e-06,2e-06,5e-06,4e-06,2e-06,2e-06,5e-06,2e-06,5e-06,2e-06,1.9e-05,1.5e-05,7.4e-05,0.000165,6e-05,8.7e-05,5.3e-05,0.000124,2.7e-05,4.2e-05,0.000243,0.000222,0.000263,0.000336,0.000303,5.1e-05,9.4e-05,9.2e-05,0.000239,0.000215,0.00025,0.000243,0.000169,0.000238,0.000351,0.000253,0.000376,0.000311,0.000497,9e-05,7.7e-05,0.000172,0.000186,0.000113,0.000132,7.4e-05,0.00026,0.000103,8.4e-05,0.000164,0.000152,0.000108,0.000129,9e-05,0.000136,6.2e-05,2.5e-05,3.5e-05,3.2e-05,2.8e-05,1.8e-05,7.1e-05,2.9e-05,3.4e-05,6.1e-05,6e-05,2.8e-05,1.9e-05,1.7e-05,1.1e-05,1.4e-05,8.1e-05,8.3e-05,7e-05,4.6e-05,2.2e-05,2.6e-05,0.000149,7.3e-05,3.6e-05,2.5e-05,1.4e-05,7.5e-05,8.5e-05,4.6e-05,1.3e-05,6e-06,5.4e-05,0.000134,5.5e-05,2.6e-05,1.1e-05,2e-06,0,6e-06,6e-06,2e-06,1e-06,2e-06,1e-06,3e-06
3e-06,1e-06,2e-06,1e-06,2e-06,2e-06,2e-06,3e-06,1e-06,1e-06,5e-06,1e-06,0,2e-06,2e-06,1e-06,1e-06,2e-06,1e-06,1e-06,1e-06,1e-06,5e-06,1e-06,1e-06,3e-06,3e-06,2e-06,9e-06,4e-06,2e-05,1.8e-05,7.5e-05,7.6e-05,8.7e-05,3.2e-05,1.1e-05,6.3e-05,6e-06,2.6e-05,0.000227,0.00017,0.000127,0.000293,6.8e-05,5.9e-05,0.000104,0.00024,0.000153,0.00011,0.000312,0.000309,0.000241,8.8e-05,8.9e-05,8.8e-05,0.000211,0.000119,0.000391,0.000242,0.000107,0.000133,0.000191,0.000156,6.7e-05,3.2e-05,0.000243,0.000195,0.000147,4.7e-05,6.4e-05,3.5e-05,9.3e-05,2.1e-05,4.6e-05,2.3e-05,9e-06,2.2e-05,1.7e-05,3.4e-05,3e-06,2.5e-05,7e-06,1.6e-05,5.1e-05,3.1e-05,1.3e-05,1.1e-05,6e-06,1.9e-05,1.5e-05,5.3e-05,7.7e-05,6.7e-05,1.1e-05,2.4e-05,1.6e-05,7.6e-05,2.2e-05,7e-06,7e-06,1.2e-05,4.1e-05,2.4e-05,3e-06,8e-06,9e-06,3e-05,4.2e-05,2.7e-05,2e-05,8e-06,4e-06,4e-06,6e-06,6e-06,3e-06,4e-06,2e-06,1e-06,2e-06
2e-06,2e-06,2e-06,1e-06,3e-06,2e-06,2e-06,2e-06,1e-06,0,6e-06,1e-06,1e-06,1e-06,3e-06,1e-06,1e-06,2e-06,1e-06,1e-06,1e-06,1e-06,3e-06,1e-06,0,4e-06,4e-06,1e-06,8e-06,1e-06,1.1e-05,1.6e-05,7.8e-05,0.000141,5.2e-05,2e-05,1.3e-05,6.5e-05,1.2e-05,6e-06,0.00024,1.4e-05,0.000175,0.000386,0.00027,0.000231,0.000292,0.000181,9.8e-05,0.000122,0.000101,0.000229,0.000238,0.000106,0.000204,9.3e-05,8e-05,0.000135,0.000251,9.3e-05,3.6e-05,0.000166,0.000165,8.8e-05,6.8e-05,1.9e-05,0.000231,0.000202,9.3e-05,6.5e-05,5.5e-05,5.1e-05,7.1e-05,1.3e-05,4.4e-05,9e-06,1.3e-05,1e-05,2.3e-05,9e-06,3e-06,1.9e-05,2e-06,1.3e-05,3.3e-05,3e-06,1.1e-05,1e-05,8e-06,1.6e-05,1.9e-05,4.6e-05,6.5e-05,3.3e-05,2.2e-05,2e-06,1e-05,4.7e-05,1.3e-05,1.2e-05,8e-06,1.2e-05,3.4e-05,9e-06,5e-06,5e-06,3e-06,6e-06,3.4e-05,3e-06,6e-06,4e-06,8e-06,5e-06,5e-06,7e-06,1e-06,3e-06,1e-06,1e-06,4e-06
2e-06,2e-06,2e-06,1e-06,3e-06,2e-06,2e-06,2e-06,1e-06,1e-06,6e-06,1e-06,1e-06,2e-06,2e-06,0,2e-06,2e-06,1e-06,1e-06,1e-06,1e-06,3e-06,1e-06,1e-06,4e-06,4e-06,1e-06,7e-06,1e-06,1.4e-05,1.4e-05,5.3e-05,0.000155,2.5e-05,4.3e-05,1.8e-05,4.7e-05,1.6e-05,9e-06,0.000248,7.8e-05,0.000217,0.000266,0.000271,0.000169,0.000159,0.000134,7e-05,0.000179,0.000187,0.000246,0.000231,0.00012,0.000134,0.000106,6.7e-05,8.8e-05,0.000284,0.000234,6.3e-05,0.000189,0.000131,0.000139,9.9e-05,5.3e-05,0.000241,0.000197,8.9e-05,6.7e-05,4e-05,3.6e-05,7.1e-05,3e-06,5.6e-05,1.7e-05,1.3e-05,1.4e-05,2.7e-05,1.4e-05,5e-06,1.6e-05,8e-06,1.7e-05,1.9e-05,1e-05,6e-06,7e-06,4e-06,1.5e-05,1.5e-05,4.4e-05,5.1e-05,3.5e-05,2.3e-05,7e-06,8e-06,4.8e-05,6e-06,7e-06,3e-06,9e-06,2.3e-05,7e-06,3e-06,6e-06,1e-06,9e-06,2.4e-05,4e-06,3e-06,4e-06,2e-06,1e-06,6e-06,5e-06,1e-06,2e-06,2e-06,1e-06,3e-06
