0.089367,0.104995,0.05064,0.058889,0.227649,0.464594,0.543195,0.665855,0.790526,0.694998,0.548096,0.49211,0.620876,0.678931,0.625828,0.503452,0.27483,0.16896,0.148545,0.126817,0.093137,0.075581,0.070773,0.061594,0.05503,0.043715,0.035796,0.033319
0.104024,0.121193,0.05855,0.068415,0.26621,0.54245,0.6144,0.722938,0.861364,0.773455,0.629008,0.578048,0.737798,0.811391,0.740393,0.585499,0.321528,0.203435,0.177677,0.15164,0.112789,0.09197,0.085292,0.074735,0.066673,0.052671,0.042528,0.039461
0.131629,0.149358,0.070706,0.082029,0.320035,0.648047,0.705384,0.796177,0.969452,0.903353,0.766208,0.737332,0.949549,1.043771,0.924116,0.696464,0.38915,0.261453,0.224598,0.190446,0.144821,0.119267,0.109019,0.096611,0.085591,0.066722,0.052574,0.048681
0.15917,0.174472,0.0791,0.086769,0.335513,0.675602,0.737802,0.86517,1.127617,1.091706,0.942848,0.94158,1.159712,1.238103,1.036884,0.717522,0.417148,0.308775,0.261208,0.218789,0.169094,0.13936,0.124823,0.111708,0.09752,0.074593,0.057895,0.054217
0.193901,0.207188,0.089446,0.08584,0.320675,0.651165,0.750627,1.001419,1.429616,1.418851,1.22404,1.230651,1.386372,1.390895,1.094526,0.698297,0.428871,0.343619,0.283975,0.229703,0.177928,0.146661,0.128231,0.115163,0.100296,0.076965,0.059582,0.056408
0.241412,0.255631,0.107061,0.089504,0.307406,0.646231,0.836146,1.271794,1.89257,1.95104,1.725712,1.722665,1.776987,1.610504,1.189253,0.72949,0.45137,0.351001,0.280382,0.219309,0.169008,0.141282,0.123887,0.113823,0.102809,0.081834,0.062842,0.058978
0.313412,0.327363,0.130516,0.102515,0.337552,0.772585,1.151543,1.815358,2.638873,2.854673,2.704225,2.743644,2.617488,2.131159,1.530981,0.925548,0.522634,0.351938,0.265045,0.207139,0.164338,0.143839,0.133696,0.128353,0.12115,0.101039,0.076323,0.069595
0.422719,0.432638,0.163219,0.122449,0.423966,1.085061,1.851641,2.995243,4.156113,4.532485,4.561403,4.806874,4.419492,3.449845,2.569303,1.579322,0.836918,0.506488,0.351952,0.277737,0.229596,0.201266,0.18863,0.187682,0.182726,0.152818,0.114756,0.102565
0.525359,0.530664,0.198388,0.14543,0.53876,1.532796,3.011771,5.15034,6.962791,7.463951,7.633655,8.181686,7.474546,5.851985,4.518428,2.843538,1.488059,0.867094,0.577958,0.4549,0.378085,0.31643,0.290345,0.297543,0.295123,0.244387,0.182022,0.159574
0.596022,0.59353,0.225374,0.167012,0.677829,2.091182,4.622756,8.269637,10.922531,11.496783,11.704466,12.442848,11.356701,9.052912,7.228387,4.642972,2.411274,1.386843,0.909056,0.699199,0.577711,0.461747,0.413444,0.441029,0.446173,0.35892,0.261402,0.226275
0.658073,0.641174,0.243754,0.182508,0.864576,2.773318,6.525778,11.835561,14.99772,15.337042,15.443787,16.045628,14.747541,12.179984,9.971563,6.473439,3.351855,1.927559,1.254884,0.936548,0.762735,0.586057,0.51761,0.583562,0.603658,0.46786,0.32864,0.280591
0.666037,0.636883,0.250564,0.187058,1.01171,3.285095,7.936727,14.353767,17.171185,16.859601,16.837389,16.828697,15.717712,13.707274,11.273427,7.270497,3.773036,2.213316,1.449642,1.040196,0.835848,0.635653,0.563179,0.667342,0.692783,0.516966,0.355901,0.303348
0.650863,0.613547,0.242398,0.183191,1.011219,3.190719,7.730599,13.822207,15.559604,14.917044,15.166818,14.182441,13.366855,12.432754,9.909558,6.181176,3.261387,2.025592,1.354039,0.916447,0.736504,0.605528,0.538704,0.618447,0.628345,0.465732,0.33012,0.289946
0.596147,0.562956,0.220859,0.175078,0.83421,2.453792,5.781738,9.988005,10.593548,10.442492,11.385235,9.828882,8.961461,8.78106,6.537459,3.783765,2.094008,1.438706,1.001622,0.641912,0.529702,0.502015,0.439309,0.442474,0.436396,0.344625,0.259578,0.233638
0.523551,0.510647,0.195795,0.150748,0.601969,1.654517,3.566786,5.554333,5.609776,6.143441,7.123411,5.59352,4.820619,4.934822,3.401551,1.773273,1.045293,0.79775,0.591399,0.396206,0.350522,0.346346,0.287215,0.25498,0.259046,0.229997,0.174725,0.162215
0.509449,0.519809,0.192492,0.130352,0.528605,1.368694,2.369609,3.041516,3.002463,3.598013,4.014153,2.906584,2.478666,2.60654,1.782177,0.882604,0.501444,0.376014,0.29563,0.233735,0.210482,0.18938,0.153684,0.138611,0.156423,0.152096,0.11098,0.107463
0.58624,0.609924,0.223735,0.137657,0.585023,1.430797,2.047703,2.333944,2.471917,3.034544,2.987065,2.10339,1.917616,1.928296,1.289522,0.596768,0.325252,0.212004,0.153278,0.130842,0.109007,0.091362,0.083279,0.078898,0.085522,0.088112,0.068789,0.080579
0.798301,0.828222,0.29214,0.161527,0.647201,1.601529,2.122598,2.360539,2.838944,3.359311,2.991018,2.179881,2.05078,2.029835,1.390804,0.66045,0.387427,0.256487,0.160273,0.119182,0.090575,0.074969,0.079747,0.072575,0.061381,0.060081,0.055521,0.085966
1.094797,1.139418,0.381399,0.184021,0.67927,1.782734,2.344992,2.781993,3.673309,3.78351,3.032148,2.469452,2.580598,2.611399,1.807102,0.943134,0.589168,0.397878,0.250346,0.179641,0.12573,0.098748,0.104947,0.094197,0.07592,0.069932,0.065748,0.110872
1.481249,1.556833,0.479645,0.185839,0.647695,1.881871,2.682949,3.448527,4.581313,4.169184,3.02139,2.682263,3.109576,3.168841,2.185271,1.280029,0.838505,0.568765,0.371865,0.265639,0.170783,0.125738,0.136814,0.131075,0.106983,0.091913,0.086121,0.147221
1.840388,1.93885,0.55435,0.173571,0.592346,1.874539,2.932338,3.936958,5.10577,4.480511,3.163205,2.814274,3.38889,3.40315,2.381643,1.596592,1.048691,0.716316,0.493488,0.344441,0.206272,0.143163,0.162749,0.171771,0.143739,0.120674,0.118424,0.185261
2.000883,2.072168,0.551582,0.151075,0.521755,1.689204,2.882259,3.924841,4.976126,4.606359,3.39633,2.924868,3.467159,3.326011,2.403853,1.771487,1.104138,0.773464,0.561016,0.380431,0.226751,0.151646,0.17089,0.199421,0.175579,0.147004,0.149691,0.201795
1.823879,1.828582,0.458406,0.125486,0.430365,1.331179,2.528271,3.494801,4.29684,4.182566,3.181009,2.741314,3.20134,2.913091,2.204698,1.685964,0.983225,0.742834,0.541384,0.350887,0.225913,0.157112,0.163085,0.207208,0.191725,0.158048,0.16898,0.189263
1.383012,1.328655,0.333419,0.114468,0.365656,1.064637,2.174417,3.012398,3.512715,3.325136,2.557928,2.398244,2.724395,2.378042,1.872335,1.373653,0.761252,0.641544,0.458196,0.287908,0.208246,0.159764,0.154882,0.202675,0.186438,0.150254,0.177988,0.175067
0.923075,0.850944,0.239176,0.117439,0.35334,1.004065,2.061439,2.717482,2.949108,2.704822,2.197448,2.099476,2.067173,1.820793,1.508858,1.005997,0.525849,0.46635,0.33154,0.214493,0.177274,0.151038,0.146944,0.186762,0.169202,0.146788,0.186746,0.171775
0.624485,0.564467,0.185548,0.110366,0.336464,0.973074,2.034229,2.730357,2.927535,2.555967,1.987673,1.86045,1.768412,1.661152,1.348786,0.798577,0.426898,0.354675,0.23892,0.167556,0.145394,0.133396,0.140916,0.158877,0.141232,0.140436,0.170994,0.151087
0.545137,0.490767,0.145643,0.085313,0.29384,0.949887,2.088534,2.84075,3.083413,2.484664,1.554122,1.510757,1.766305,1.731048,1.187335,0.642665,0.44159,0.373508,0.249501,0.164516,0.122559,0.110515,0.122432,0.120808,0.10354,0.111725,0.124004,0.122365
0.51008,0.459063,0.11507,0.05593,0.248343,0.890941,2.050196,2.746338,2.871047,2.127137,1.027583,1.083516,1.628914,1.593681,0.904517,0.490742,0.436129,0.363894,0.257453,0.177375,0.120751,0.090706,0.087911,0.083373,0.074639,0.074711,0.072616,0.094029
0.444352,0.406099,0.102866,0.042322,0.249625,0.879767,1.953288,2.373531,2.15407,1.60075,0.857488,0.8713,1.262413,1.204191,0.675176,0.456133,0.436964,0.317644,0.226562,0.171685,0.129855,0.093259,0.063812,0.054433,0.054767,0.049329,0.044913,0.077282
0.341646,0.316875,0.092073,0.041172,0.272793,0.870117,1.888908,2.143634,1.506444,1.110121,0.835691,0.743688,0.856492,0.89008,0.604927,0.466647,0.450048,0.298016,0.190716,0.152796,0.136752,0.105286,0.063297,0.044027,0.044306,0.039503,0.035557,0.06709
0.236982,0.218185,0.079137,0.046874,0.284262,0.860777,1.966862,2.234641,1.363032,1.040074,0.935785,0.681385,0.680488,0.759216,0.5699,0.450833,0.419908,0.276636,0.170019,0.139958,0.134217,0.104977,0.065821,0.042441,0.043574,0.044433,0.039891,0.061535
0.177651,0.153647,0.06924,0.052204,0.272942,0.876452,2.164252,2.481975,1.440898,1.077116,1.03045,0.744468,0.652659,0.629185,0.472998,0.412508,0.360931,0.226662,0.152087,0.146998,0.137279,0.098534,0.067554,0.045685,0.048206,0.051971,0.044744,0.063389
0.173924,0.147995,0.068922,0.059488,0.244193,0.801117,2.187663,2.580198,1.388896,0.930718,0.977118,0.82386,0.680735,0.55433,0.376185,0.324915,0.273056,0.163683,0.121579,0.144276,0.129527,0.083169,0.061204,0.043412,0.045946,0.050489,0.041455,0.065666
0.191552,0.178585,0.076915,0.063461,0.226667,0.681281,1.97712,2.42065,1.29918,0.715819,0.794272,0.810148,0.653806,0.494798,0.343821,0.254824,0.196188,0.139731,0.104639,0.125308,0.105449,0.062881,0.047957,0.036956,0.03617,0.040024,0.034315,0.063027
0.206125,0.20615,0.081234,0.061126,0.217229,0.637787,1.809004,2.335701,1.324268,0.625594,0.734466,0.757814,0.551107,0.450677,0.351323,0.224455,0.156919,0.129021,0.094155,0.098506,0.076196,0.047475,0.041659,0.037665,0.031062,0.034466,0.034043,0.059379
0.209901,0.212837,0.081635,0.057884,0.200458,0.656832,1.766374,2.302489,1.381361,0.701991,0.785833,0.669761,0.520848,0.529246,0.394448,0.217641,0.156334,0.129765,0.081129,0.072722,0.056928,0.037123,0.041254,0.041694,0.03258,0.036369,0.036587,0.05479
0.195994,0.196556,0.07397,0.050038,0.166311,0.630189,1.597183,1.973911,1.320672,0.823126,0.779294,0.582238,0.553233,0.659288,0.493152,0.24552,0.178112,0.135249,0.06682,0.048554,0.03956,0.034673,0.042752,0.038979,0.029312,0.033862,0.035027,0.049092
0.180711,0.185654,0.067759,0.041487,0.125659,0.513449,1.232228,1.413392,1.081382,0.843849,0.672217,0.462652,0.532941,0.725335,0.584084,0.280517,0.188835,0.126398,0.057175,0.035659,0.029877,0.038279,0.040858,0.029175,0.022119,0.028212,0.031562,0.043051
0.169613,0.1771,0.062524,0.036447,0.103095,0.351532,0.860449,1.07695,0.804995,0.708558,0.570534,0.453098,0.479527,0.668483,0.602599,0.290609,0.169125,0.100285,0.055364,0.041445,0.031569,0.038436,0.034617,0.019317,0.016845,0.023862,0.027605,0.036133
0.155462,0.155005,0.048032,0.030275,0.086758,0.223205,0.714662,0.971283,0.606205,0.49252,0.54138,0.526392,0.41547,0.545841,0.522873,0.252373,0.124394,0.07011,0.054466,0.047464,0.034025,0.033886,0.02995,0.018893,0.01479,0.019915,0.023255,0.029113
