1.1e-05,5e-06,5e-06,1.7e-05,1.4e-05,1e-05,7e-06,2.8e-05,1.1e-05,1.1e-05,1.8e-05,2e-06,1.5e-05,1.8e-05,7e-06,5e-06,8e-06,1.3e-05,8e-06,5e-06,7e-06,1.2e-05,3e-06,6e-06,5.5e-05,0.000295,9.4e-05,0.000297,8.9e-05,0.000137,2.3e-05,0.000673,0.000535,0.000498,0.001336,0.000382,0.000791,0.000111,0.001219,0.000155,0.000459,0.000239,0.000305,7.7e-05,8.8e-05,0.000205,8.8e-05,0.000466,0.000309,0.000297,0.000113,0.000563,0.000219,0.000186,0.000172,9.5e-05,0.000485,0.000543,0.00027,0.000274,0.000116,0.000657,1.7e-05,0.000347,7.7e-05,0.000173,0.000126,0.000272,3.7e-05,0.000213,5e-05,6e-06,4.4e-05,5.5e-05,1.6e-05,5e-05,0.000133,4e-06,4.2e-05,8.4e-05,1.4e-05,4.9e-05,5e-06,2.4e-05,6.5e-05,5.3e-05,9e-06,3e-05,2.9e-05,8.4e-05,1.1e-05,5e-05,1.3e-05,0.000456,0.00013,7.6e-05,0.000185,9e-06,0.000129,1.3e-05,0.000139,4.9e-05,7e-05,5.6e-05,3.9e-05,6.8e-05,2e-06,0.000204,5e-06,4.6e-05,2.5e-05,9.6e-05,5.5e-05,6e-05,3.7e-05,1.7e-05,4e-05,1.5e-05,1e-06,8.2e-05,0.000179
9e-06,2.8e-05,4.4e-05,5.1e-05,6.6e-05,4.3e-05,2.5e-05,2.5e-05,2.4e-05,5.4e-05,2e-05,1.3e-05,3.4e-05,5.8e-05,3.4e-05,3e-05,1.3e-05,4.1e-05,4.8e-05,3.3e-05,4.1e-05,2.2e-05,2.9e-05,3.3e-05,0.000243,0.000711,0.000472,0.000277,0.00053,0.000221,7.6e-05,0.001225,0.002319,0.000937,0.002484,0.002215,0.001161,0.003444,0.003656,0.003247,0.001146,5.4e-05,0.000147,0.000555,0.000602,0.000959,0.000219,0.001726,0.000759,0.000451,0.000887,0.001042,0.000229,0.000214,0.00031,0.001025,0.000962,0.000223,0.000739,0.000398,0.000525,0.001023,0.000694,0.000337,0.000419,7.6e-05,6.8e-05,0.000584,0.000532,0.000163,0.000179,9.6e-05,0.000224,0.000109,7.1e-05,3.9e-05,0.000337,2.9e-05,7.5e-05,2e-04,0.000187,8.8e-05,9.3e-05,7.7e-05,0.000155,0.00021,0.000105,0.000127,8.7e-05,0.00017,6.5e-05,7.8e-05,8.2e-05,0.000869,0.000183,0.000447,0.000594,0.000682,0.000451,0.000467,0.000347,0.00022,7.6e-05,6.5e-05,0.000107,4.6e-05,0.000143,0.000586,0.000259,0.000189,0.000132,0.000305,0.000122,0.000178,9.4e-05,7.1e-05,4.1e-05,2.8e-05,1.4e-05,0.000209,0.000364
2.9e-05,6.4e-05,2.8e-05,4.7e-05,3.9e-05,3.4e-05,2e-06,2.9e-05,2.4e-05,4e-05,2.8e-05,4.5e-05,1.5e-05,2e-05,4.3e-05,1.5e-05,2.9e-05,2.3e-05,8e-06,1.5e-05,4.3e-05,2.7e-05,2e-05,2.9e-05,0.00043,0.000487,0.00144,0.000795,0.00061,0.000171,0.000214,0.00099,0.002873,0.003855,0.0041,0.004271,0.004573,0.002068,0.001374,0.001601,0.000319,0.000911,0.002107,0.000747,0.000728,0.001019,0.001525,0.001089,0.000489,0.000783,0.000701,0.000676,0.000725,0.000398,0.000476,0.001265,0.000488,0.000331,0.000749,0.000326,0.000607,0.000829,0.000944,0.000849,0.000682,0.000829,0.000908,0.000539,0.000267,0.000162,0.000123,0.000188,0.000485,0.000307,0.000129,0.000119,0.00053,2e-04,4.5e-05,0.000122,4.9e-05,6.1e-05,7.8e-05,5.3e-05,9.2e-05,6e-05,0.000107,3.9e-05,2e-05,8e-05,0.000153,0.000159,0.000143,0.000887,0.00087,0.000474,0.000302,0.000319,9.3e-05,0.000343,0.000203,0.000125,3.8e-05,6.1e-05,3e-05,2.7e-05,0.000174,0.000665,0.000541,0.000195,7.3e-05,0.000262,0.000211,0.00011,5.5e-05,9.4e-05,0.000114,4.8e-05,1.3e-05,0.000259,0.000399
5.9e-05,6.7e-05,9.8e-05,5.7e-05,6.1e-05,7e-05,5.1e-05,4.8e-05,3.7e-05,4.7e-05,3.9e-05,4.8e-05,4.1e-05,2.3e-05,9e-06,2.8e-05,5.4e-05,5.8e-05,4.7e-05,4.3e-05,7e-05,5.4e-05,5.6e-05,3e-05,0.000543,0.000803,0.002046,0.000837,0.000186,0.000235,0.000384,0.000723,0.002268,0.0027,0.00062,0.005259,0.002486,0.004824,0.002657,0.00122,0.001076,0.00235,0.001186,0.001119,0.000325,0.000616,0.001484,0.002442,0.00154,0.000912,0.000524,0.001773,0.000847,0.002256,0.001479,0.001278,0.001481,0.001111,0.001412,0.000897,0.000708,0.000735,0.000482,0.001314,0.000786,0.000534,0.001178,0.000794,0.000553,0.000729,0.000451,0.000221,0.000383,0.000205,0.000229,0.000181,0.000331,0.000147,8e-05,0.000254,0.000183,0.000141,7.5e-05,5.1e-05,0.000114,5.6e-05,0.000134,0.00012,0.000133,6.1e-05,0.000135,0.00023,0.000215,0.000615,0.000939,0.000351,0.000498,0.000429,0.000248,9.3e-05,0.000261,0.000206,0.00017,7e-06,4.7e-05,7.5e-05,0.000171,0.000669,0.000388,0.000265,9.4e-05,0.000346,0.000495,0.000193,6.8e-05,2.8e-05,8.9e-05,4.8e-05,4.7e-05,0.000238,0.000381
2.4e-05,2.7e-05,4.1e-05,1.4e-05,3.2e-05,3.9e-05,1.4e-05,5.7e-05,2.4e-05,5e-06,2.1e-05,4.8e-05,2.8e-05,2.5e-05,2.3e-05,2.3e-05,2.2e-05,2.1e-05,2.9e-05,3.1e-05,1.9e-05,2.4e-05,1.5e-05,3.9e-05,0.000599,0.000532,0.001752,0.001266,0.00098,0.000456,0.000527,9e-04,0.002926,0.005551,0.004196,0.004281,0.002597,0.004058,0.000502,0.001385,0.000884,0.002157,0.003039,0.001435,0.001187,0.001467,0.000367,0.001304,0.000745,0.001499,0.001996,0.001271,0.00214,0.004137,0.000816,0.002565,0.002096,0.000461,0.002254,0.002664,0.001299,0.000595,0.000242,0.001254,0.000385,0.000439,0.00082,0.000408,0.000403,3e-04,0.000493,0.000349,5e-04,0.000154,0.000318,0.000149,0.000218,0.000261,0.000301,0.000221,0.000166,9.3e-05,8.4e-05,0.000122,9e-05,8.4e-05,0.000172,5.7e-05,0.000207,0.000267,0.000205,0.000203,0.000248,0.00058,0.001399,0.001396,0.000923,0.000348,0.00013,0.000568,0.000494,0.000257,7.9e-05,6.1e-05,1e-04,6.4e-05,6.9e-05,0.000346,0.000245,2.7e-05,6e-06,0.000501,0.000628,0.00026,9.6e-05,3.3e-05,7e-05,9e-06,4.9e-05,0.000228,0.000344
2.7e-05,1.9e-05,3.9e-05,3.6e-05,4.2e-05,6e-06,6e-06,5.3e-05,3.5e-05,4e-06,2e-06,1.9e-05,5e-06,2.2e-05,4.3e-05,1.1e-05,1.5e-05,4.4e-05,3.1e-05,2.6e-05,1.2e-05,1.8e-05,3.8e-05,0.000106,0.000547,0.001023,0.000897,0.000427,0.000656,0.000172,0.000504,0.000423,0.002116,0.006269,0.003407,0.005091,0.00671,0.003008,0.001926,0.003098,0.000948,0.002518,0.003944,0.001781,0.001341,0.000187,0.000598,0.000383,0.001696,0.002414,0.003044,0.001355,0.004091,0.002072,0.002185,0.003702,0.00347,0.002054,0.001666,0.001404,0.000837,0.000937,0.001405,0.000254,0.000281,0.000616,0.000994,0.000466,2e-04,0.000212,0.000402,0.00017,0.000326,0.000193,0.000253,0.000182,0.000218,0.00031,0.00023,6.2e-05,0.00012,0.000179,3.6e-05,7.1e-05,7.5e-05,2.7e-05,0.000233,0.000144,0.000342,4.3e-05,0.000201,0.000266,0.000154,0.000406,0.002255,0.000205,0.000335,0.000329,0.000172,0.00071,0.000185,4.9e-05,6.7e-05,5.1e-05,7.7e-05,7.9e-05,9.3e-05,0.000494,0.000272,9.7e-05,5.1e-05,0.000921,0.000517,0.000308,0.000111,3.5e-05,6.6e-05,7e-06,5.1e-05,0.000185,0.000577
4.4e-05,1.8e-05,5.6e-05,6.5e-05,2.2e-05,3.1e-05,1.1e-05,4.8e-05,5.9e-05,5.3e-05,3.7e-05,3.5e-05,3e-05,4.1e-05,4.9e-05,2.8e-05,2.5e-05,3.9e-05,3.6e-05,3.8e-05,3.6e-05,1.5e-05,3.6e-05,0.000124,0.000597,0.001333,0.000646,0.000669,0.000944,0.001007,0.000459,0.000477,0.001904,0.003767,0.003521,0.00793,0.005483,0.001548,0.00274,0.00608,0.006404,0.006449,0.003025,0.002581,0.003597,0.003082,0.001484,0.000886,0.002074,0.001079,0.001685,0.001932,0.00365,0.004515,0.000925,0.003322,0.00242,0.00245,0.004088,0.00099,0.00134,0.001478,0.002393,0.001241,0.00044,0.000782,0.001591,0.001174,0.000468,0.000302,0.000401,0.000158,0.000221,0.000165,7.5e-05,0.000106,0.000148,5.8e-05,0.000112,0.000245,0.000109,0.000184,0.000164,6.5e-05,2.9e-05,0.000114,0.000227,0.000177,0.000528,0.000368,0.000478,0.000158,0.000116,0.000632,0.002382,0.00232,0.001313,0.000313,0.000201,0.000451,0.000735,0.000563,0.000281,0.000166,8.5e-05,7.2e-05,0.000147,0.000914,0.000506,0.000227,8.7e-05,0.001449,0.00047,0.000176,3.5e-05,5.2e-05,5.6e-05,1.9e-05,2.7e-05,0.000195,0.001103
1.8e-05,5.6e-05,2.2e-05,6e-06,2.2e-05,3.3e-05,3.1e-05,4.3e-05,3.3e-05,1.8e-05,5.5e-05,0.000146,2.9e-05,2.8e-05,2.7e-05,6.9e-05,3.4e-05,3.9e-05,2.7e-05,3.9e-05,3.6e-05,6.9e-05,2.4e-05,0.000178,0.000566,0.00116,0.004493,0.001867,0.000541,0.000329,0.000632,0.000438,0.001781,0.005061,0.001789,0.008284,0.005354,0.002573,0.000712,0.003793,0.002194,0.003888,0.005231,0.004491,0.000923,0.001706,0.002475,0.002442,0.001216,0.00299,0.002919,0.002795,0.005644,0.003821,0.006043,0.004412,0.008449,0.002265,0.003474,0.003954,0.002792,0.002703,0.000208,0.000897,0.000417,0.001068,0.00143,0.000187,0.00064,0.000557,0.000366,0.000429,0.000522,0.000643,0.000485,0.000325,9.1e-05,4e-04,0.000256,0.000285,0.000178,0.000238,7.2e-05,0.00019,0.00021,0.000204,0.000463,0.000132,0.000628,0.000187,0.000443,0.000232,0.000134,0.000611,0.000836,0.002721,0.00115,3.2e-05,0.000291,0.000192,0.000585,0.000316,8.2e-05,0.000103,0.000145,0.000125,7.3e-05,0.001061,0.000722,0.000154,0.000105,0.001785,0.001168,0.000346,0.000112,5e-05,4.5e-05,9e-05,6.3e-05,0.000124,0.001069
7.1e-05,2.9e-05,5.1e-05,4.3e-05,3.5e-05,4.2e-05,3.5e-05,6.4e-05,1.5e-05,3.2e-05,4.3e-05,0.000172,0.000152,6.3e-05,2.7e-05,9.9e-05,6.7e-05,5.4e-05,4.8e-05,6.6e-05,2.4e-05,7.3e-05,7.5e-05,0.000161,0.000856,0.000943,0.007657,0.005696,0.003204,0.001188,0.00112,0.000311,0.000892,0.004502,0.005025,0.010093,0.014244,0.014138,0.010114,0.004789,0.002443,0.004643,0.002571,0.000996,0.001732,0.000965,0.003121,0.006196,0.005016,0.002757,0.002503,0.000874,0.003325,0.00319,0.007651,0.006351,0.007542,0.006133,0.000981,0.004931,0.001982,0.000589,0.001677,0.001796,0.002062,0.002311,0.000691,0.000249,0.000738,0.000944,0.00017,0.000249,0.000537,0.000486,0.000325,0.000116,0.000349,0.000908,0.000848,0.000683,0.000548,0.000433,0.00027,0.000308,0.000266,0.00014,0.000477,0.000343,0.000783,0.000817,0.000591,0.000369,0.000334,0.000353,0.000602,0.002515,0.001451,7e-04,0.000271,0.000345,0.000605,0.000335,0.000111,0.000144,7.9e-05,3.2e-05,0.000204,0.000924,0.001123,0.000652,0.000275,0.001799,0.001838,0.001185,0.000506,3.7e-05,0.000123,0.000209,5.7e-05,0.000172,0.000839
7.8e-05,5.8e-05,7.5e-05,3.9e-05,1.7e-05,1.4e-05,3.6e-05,4e-05,6.2e-05,6.2e-05,5.7e-05,0.000106,0.000113,4.9e-05,3.1e-05,0.000126,0.000136,1.9e-05,1.1e-05,8.4e-05,8.4e-05,9e-05,3.9e-05,9.7e-05,0.000914,0.000907,0.008561,0.004923,0.001898,0.000279,0.000836,0.000393,0.000518,0.003489,0.00586,0.00262,0.006022,0.006408,0.001369,0.003394,0.00216,0.002795,0.001363,0.001314,0.00113,0.000659,0.001612,0.003663,0.004704,0.004237,0.002417,0.002354,0.002569,0.002827,0.004515,0.001331,0.004452,0.001627,0.002549,0.002521,0.002481,0.000687,0.001292,0.000402,0.000861,0.000537,0.000707,0.000486,0.000442,0.000162,0.000508,0.000339,0.000341,0.000168,0.000254,0.000232,0.000292,0.000824,0.000667,0.000398,0.000138,0.000149,6.5e-05,0.000163,9.2e-05,0.000149,0.000487,0.000322,0.000536,0.000524,0.000515,0.000167,0.000412,0.000257,0.001756,0.00199,0.001281,0.000523,0.000301,0.000164,0.000523,0.000287,5.6e-05,3.4e-05,0.000141,0.000173,0.000328,0.000837,0.000437,0.000384,0.000301,0.001555,0.000289,0.000388,0.000194,0.000171,0.000109,0.000145,0.000153,0.000269,0.001069
0.000105,4.6e-05,6.6e-05,6.8e-05,4.1e-05,2.4e-05,2e-05,5.3e-05,7.6e-05,1.6e-05,1e-05,6.4e-05,2.5e-05,2.7e-05,3.2e-05,0.000119,3.9e-05,8.9e-05,4.9e-05,8e-05,1.3e-05,3.2e-05,2.4e-05,1.9e-05,0.0012,0.003302,0.006065,0.002597,0.000992,8.8e-05,0.000709,0.001399,0.000572,0.001585,0.003572,0.003677,0.003149,0.00456,0.004662,0.002538,0.002014,0.002168,0.001863,0.001495,0.00079,0.000653,0.001081,0.001399,0.001748,0.001601,0.001382,0.000758,0.00216,0.002661,0.001441,0.001441,0.001357,0.000579,0.001083,0.001182,0.001019,0.001937,0.000368,0.000413,0.000361,0.000427,0.001158,0.00022,0.000148,0.000196,0.000141,0.000106,8.4e-05,6.3e-05,0.000135,0.000129,0.00021,0.000307,1e-04,0.000171,6.3e-05,8.1e-05,8e-05,0.000113,0.000235,3.9e-05,0.000331,0.000113,0.000487,0.000178,0.000371,0.000247,0.000364,0.000371,0.002403,0.001895,0.000763,0.00034,0.000223,0.000382,0.000268,0.000239,0.000139,0.000153,0.000168,0.000216,0.000326,0.000155,0.000916,6e-04,0.000131,0.000799,0.000957,0.000393,9.3e-05,0.000189,0.00011,0.000103,4.7e-05,0.000312,0.001291
6.2e-05,9.9e-05,2.2e-05,3.8e-05,1.7e-05,6e-06,8e-06,5e-05,6.6e-05,6.7e-05,3.2e-05,4e-06,3.6e-05,3.4e-05,4.3e-05,7e-05,7.6e-05,5.5e-05,4.2e-05,2.2e-05,4.6e-05,1.3e-05,1.6e-05,1.2e-05,0.001481,0.004766,0.002666,0.000588,0.000308,0.000152,0.000881,0.001821,0.00194,0.001609,0.003277,0.001888,0.004361,0.002494,0.003188,0.00272,0.002794,0.000534,0.000333,0.000669,0.00144,0.001499,0.001016,0.002638,0.001933,0.001695,0.001119,0.001307,0.00085,0.000532,0.003189,0.001839,0.002714,0.001321,0.001987,0.002689,0.001206,0.001037,0.000428,0.000316,0.000256,0.000632,0.000177,0.000296,7.5e-05,2.8e-05,0.000109,0.000161,0.000129,3.9e-05,8.9e-05,5.8e-05,0.000124,0.000365,0.000117,9.1e-05,6.3e-05,8e-05,8.1e-05,7.7e-05,0.000199,0.000136,4.3e-05,3.9e-05,0.000303,2.6e-05,0.000252,5.8e-05,0.000311,0.000343,0.002416,0.002364,0.001437,0.000442,0.000183,0.000358,0.000299,8.8e-05,7.7e-05,0.000163,2.8e-05,0.000137,0.000305,0.000144,0.00059,0.000152,5.3e-05,0.000438,0.000743,0.00048,0.00024,9e-06,1.2e-05,3.7e-05,5.5e-05,0.000296,0.000677
6.1e-05,3.8e-05,3e-05,2.2e-05,7e-06,2.9e-05,3.9e-05,8.4e-05,2.1e-05,4e-05,3.8e-05,3.3e-05,8e-06,1.3e-05,3.7e-05,6.3e-05,2.8e-05,6.6e-05,1.3e-05,4e-06,5e-06,1.6e-05,8e-06,1.9e-05,0.001717,0.002199,0.001844,0.0015,0.000292,0.000137,0.000844,0.000956,0.001455,0.001021,0.002993,0.001409,0.005054,0.00161,0.002014,0.002321,0.001063,0.002065,0.001881,0.000318,0.001764,0.000969,0.001379,0.001426,0.004006,0.002602,0.003245,0.001659,0.001176,0.002634,0.001934,0.001053,0.003614,0.002207,0.000971,0.002084,0.002959,0.00193,0.000574,0.000223,0.000284,0.000787,0.000511,0.00016,0.000201,0.000103,0.000222,0.000145,0.000107,6.4e-05,8.9e-05,7.8e-05,0.00013,0.000389,0.000188,0.000161,1.4e-05,4.6e-05,2.8e-05,9.7e-05,0.000195,6.3e-05,0.000105,3.9e-05,0.000129,0.000244,0.00015,0.000191,5.7e-05,0.000128,0.002101,0.000818,0.000266,0.000199,0.000181,0.00029,0.00019,0.000106,0.000106,5.6e-05,9.8e-05,3.8e-05,0.000209,0.000452,0.000438,0.00025,0.000102,0.000787,0.00049,0.000185,4.1e-05,3.6e-05,4.1e-05,3.9e-05,8.5e-05,0.000151,0.000121
2.8e-05,2.1e-05,1.3e-05,4e-06,9e-06,3.3e-05,2.1e-05,9.5e-05,5.2e-05,1.2e-05,4.7e-05,5.1e-05,4e-05,1.3e-05,2.9e-05,4e-05,1.6e-05,4.8e-05,4.3e-05,1.6e-05,4.1e-05,1.4e-05,7e-06,3.7e-05,0.001771,0.00342,0.001311,0.00076,0.000229,0.000299,0.000504,0.000138,0.002362,0.001943,0.004622,0.002256,0.000851,0.000481,0.001769,0.00081,0.00076,0.002019,0.00051,0.000839,0.003338,0.00232,0.002931,0.001484,0.004777,0.0033,0.003054,0.00119,0.002787,0.001559,0.000504,0.001187,0.003636,0.001934,0.002567,0.002397,0.001837,0.000481,0.000931,0.00027,0.000552,0.000482,0.001144,0.000846,0.00043,0.00023,0.000179,0.000212,0.000194,0.000131,0.000106,7.9e-05,0.000151,0.000154,3e-05,3.4e-05,4.9e-05,5.7e-05,8.8e-05,8.1e-05,0.000226,0.000155,0.000113,4.4e-05,8.4e-05,0.00022,0.000169,0.000128,0.000115,0.000325,0.001549,0.000424,0.000431,0.000106,0.000115,0.000236,7.7e-05,8.4e-05,1e-05,3.8e-05,5.3e-05,9.4e-05,0.000114,0.000767,0.000647,0.000294,0.00016,0.001051,0.000496,0.000143,9e-05,3.8e-05,3.4e-05,2.8e-05,6.7e-05,0.000193,0.000455
5.8e-05,5e-05,3e-06,1.2e-05,2.3e-05,4.4e-05,3.2e-05,9.6e-05,7.7e-05,4.4e-05,4.4e-05,9e-05,2.8e-05,1.6e-05,2.8e-05,1.1e-05,1.1e-05,6e-05,3.5e-05,1e-05,5.6e-05,1.2e-05,8e-06,5.5e-05,0.00177,0.004416,0.002373,0.000604,0.000258,0.000206,0.00063,0.000375,0.003278,0.002438,0.00539,0.005141,0.005594,0.001008,0.003175,0.003195,0.003251,0.002778,0.002027,0.001375,0.005297,0.000199,0.002644,0.000653,0.003806,0.003494,0.003901,0.000845,0.000765,0.002565,0.004585,0.003289,0.005146,0.003157,0.004389,0.00155,0.002551,0.002015,0.002758,0.0013,0.000977,0.000482,0.001398,0.000848,0.000526,0.000286,0.000645,0.000216,0.000326,0.000277,0.000476,0.000258,0.000307,0.00019,9.2e-05,0.000214,0.000101,0.00014,0.000129,3.8e-05,0.000231,0.000111,2.2e-05,0.000143,0.000151,0.000242,0.000375,2e-04,8.7e-05,0.00041,0.001428,0.000539,0.00024,0.000251,8.4e-05,0.000235,3.4e-05,1.6e-05,8.2e-05,7.8e-05,7.3e-05,0.000155,0.000184,0.000909,0.000995,0.000366,0.000197,0.001091,0.000749,0.000321,8.6e-05,6.1e-05,7.5e-05,5.5e-05,0.000107,0.000125,0.000398
2.1e-05,6e-06,4.1e-05,9e-06,2.7e-05,2.8e-05,2e-05,6.5e-05,6.1e-05,3.3e-05,2.8e-05,9e-05,7e-05,6e-05,4.7e-05,2.6e-05,2.7e-05,5.1e-05,4.5e-05,6.3e-05,7.6e-05,4.8e-05,2.9e-05,2.9e-05,0.001586,0.001071,0.001108,0.000908,0.000288,0.000313,0.000123,0.000773,0.003811,0.004989,0.007484,0.009775,0.002612,0.003983,0.004002,0.005873,0.009897,0.002533,0.001188,0.004794,0.005679,0.004365,0.004057,0.005289,0.002793,0.001139,0.004617,0.004817,0.003223,0.002819,0.006622,0.00328,0.005063,0.008242,0.000694,0.005823,0.005597,0.00296,0.003116,0.000617,0.000761,0.002503,0.002646,0.002581,0.001074,0.000675,0.000583,0.000581,0.000947,0.000867,0.000438,5e-04,0.000218,0.000535,0.000274,0.000441,0.00021,0.000157,0.000309,0.00031,0.000279,0.00033,0.000202,0.000149,0.000212,6e-05,0.000323,0.000516,0.00025,0.000402,0.001837,0.000211,0.000289,0.000155,9e-05,0.00031,0.000218,0.000165,0.000199,4e-05,8.3e-05,0.000228,0.000112,0.001016,0.000406,0.000393,0.000208,0.00088,0.000696,0.000409,0.000197,4.5e-05,4.1e-05,5.8e-05,0.000151,0.000213,0.000489
9e-06,9e-06,3.8e-05,4.4e-05,2.9e-05,3.3e-05,3e-05,6.1e-05,9e-05,4.2e-05,4.5e-05,7.5e-05,1e-06,4.8e-05,4.8e-05,8.2e-05,6.3e-05,4.9e-05,3.3e-05,5.1e-05,8e-06,1.2e-05,8e-06,1.8e-05,0.001399,0.002598,0.001459,0.000163,0.000298,0.000111,0.000269,0.001256,0.004458,0.007572,0.006318,0.000708,0.004177,0.006014,0.004516,0.006666,0.009741,0.011544,0.009775,0.005126,0.009867,0.009283,0.003619,0.005623,0.008293,0.007803,0.004253,0.008207,0.007616,0.006035,0.006449,0.00347,0.003819,0.006602,0.008906,0.004433,0.002498,0.002647,0.001864,0.002402,0.001479,0.00412,0.004149,0.000624,0.001327,0.000688,0.001472,0.001305,0.00053,0.001392,0.001633,0.001076,0.001139,0.000921,0.00047,0.000753,0.000605,3e-04,0.000321,0.000129,0.00056,0.000977,0.001043,0.000743,0.000665,0.000167,0.000238,0.000375,0.000354,0.000156,0.001779,0.00124,0.00076,0.000608,0.000296,0.000364,0.00043,0.000251,0.000102,8.3e-05,8.3e-05,9.7e-05,0.000176,0.000967,0.000503,0.000375,4.6e-05,0.000972,0.000388,3e-04,0.000109,8e-05,2.5e-05,1.7e-05,9e-05,9.9e-05,0.000514
1.2e-05,3e-06,2e-05,8e-06,3.7e-05,1.7e-05,3.4e-05,7.1e-05,6.4e-05,4.3e-05,5.6e-05,0.000138,0.000104,8.9e-05,4.9e-05,9.7e-05,3.8e-05,3.8e-05,2.8e-05,2.9e-05,5.6e-05,3.5e-05,2.1e-05,3.7e-05,0.001115,0.003138,0.002505,0.001682,0.000678,0.000295,0.000199,0.001434,0.002597,0.001803,0.00176,0.002565,0.002655,0.003509,0.003478,0.002682,0.002715,0.005189,0.007808,0.011068,0.004841,0.003865,0.002269,0.006533,0.002519,0.002939,0.005218,0.007835,0.007148,0.00168,0.004071,0.005604,0.003268,0.001594,0.005515,0.006195,0.005761,0.004724,0.002289,0.004401,0.002809,0.004068,0.001913,0.002745,0.001055,0.00095,0.001495,0.000389,0.001062,0.00052,0.000718,0.000847,0.000669,0.000815,0.000684,0.000414,0.000213,0.000156,0.000142,0.000268,0.000382,0.000646,0.000483,0.000246,0.000351,0.00046,0.000398,0.000596,0.000243,0.000238,0.001697,0.001902,0.001099,0.000447,0.000358,0.000505,0.000275,0.000148,6.9e-05,4.4e-05,8.8e-05,2e-05,0.000215,0.000968,0.000592,0.000228,6.7e-05,0.001472,0.000995,0.000439,9.7e-05,1.4e-05,4.4e-05,8.4e-05,2.6e-05,0.000181,0.000678
3.4e-05,3.2e-05,3.4e-05,2e-05,4.6e-05,2.7e-05,9e-06,3.4e-05,2.2e-05,2.4e-05,5.9e-05,0.000134,4.7e-05,5.3e-05,5.5e-05,5.7e-05,5.2e-05,3.7e-05,1.8e-05,4.9e-05,4.5e-05,6.3e-05,3.3e-05,6.5e-05,0.000726,0.002518,0.002809,0.000946,0.000487,0.000171,0.000423,0.001195,0.002405,0.002207,0.003399,0.002613,0.0014,0.003274,0.004685,0.006255,0.004413,0.000795,0.005115,0.001941,0.00169,0.005639,0.004288,0.002488,0.000364,0.004445,0.002433,0.002112,0.00306,0.004236,0.000588,0.007356,0.005885,0.001378,0.001735,0.00438,0.006465,0.001101,0.006597,0.008384,0.002956,0.0021,0.004551,0.003798,0.001861,0.001303,0.000758,0.000483,0.000672,0.000585,0.000908,0.001075,0.000382,0.001037,0.001097,0.000511,8.6e-05,6.7e-05,0.000137,0.000158,0.000227,0.000243,0.000271,7.4e-05,0.000285,0.000389,0.000698,0.000141,0.000238,5.9e-05,0.001095,0.001146,0.000241,0.000254,3.7e-05,0.000326,0.000266,0.000162,7.5e-05,2.6e-05,0.000146,5.7e-05,0.000244,0.000866,0.000528,0.000268,0.000189,0.001916,0.000883,0.000279,5.2e-05,5.7e-05,4.4e-05,0.000134,0.000189,0.000152,0.000905
5.3e-05,2.7e-05,5.3e-05,2.7e-05,4.4e-05,3.5e-05,1.2e-05,3.5e-05,1.4e-05,4.2e-05,8e-06,9.1e-05,5.6e-05,3.3e-05,2.9e-05,4.7e-05,3.7e-05,3.2e-05,6.1e-05,5e-05,4.9e-05,5.5e-05,2.3e-05,6.7e-05,0.00044,0.000662,0.000689,0.000326,0.000399,0.000189,0.000237,0.000182,0.002955,0.003497,0.001485,0.000847,0.002386,0.001602,0.005634,0.004172,0.001211,0.000823,0.002013,0.002047,0.003231,0.002624,0.003508,0.002722,0.005218,0.005923,0.007713,0.006023,0.003796,0.005577,0.003843,0.004931,0.004353,0.00452,0.00538,0.003686,0.003256,0.005376,0.007487,0.002525,0.002916,0.003897,0.005984,0.002993,0.001098,0.000752,0.000241,0.000612,0.000364,0.000293,0.000957,0.000592,0.000864,0.00113,0.000384,0.000134,0.00032,0.000163,0.000123,0.000244,0.000316,0.000195,0.000171,0.000104,0.000102,8.5e-05,0.000557,0.000308,0.000348,0.00019,0.000522,0.000179,0.000447,0.000154,3.8e-05,0.000153,0.000103,0.00017,0.000187,0.000127,0.000183,0.000198,0.000151,0.000439,0.000765,0.000324,0.000276,0.001947,0.001322,0.000515,7.7e-05,4.1e-05,7.3e-05,0.00013,0.00011,0.000251,0.001076
9e-05,6.4e-05,6.1e-05,3.4e-05,4.7e-05,2.7e-05,3.5e-05,6.3e-05,5.4e-05,2.6e-05,5.3e-05,8.8e-05,6.7e-05,6.7e-05,2.7e-05,8.8e-05,4.7e-05,1.6e-05,7.4e-05,5.3e-05,7.7e-05,4e-05,1.1e-05,5e-05,0.000201,0.001967,0.000962,0.000753,0.000158,0.000285,0.000204,0.000628,0.00278,0.002215,0.003434,0.002149,0.001848,0.00291,0.004059,0.001045,0.001322,0.002373,0.002556,0.001944,0.001776,0.003906,0.006674,0.003876,0.004864,0.002583,0.004079,0.00269,0.000857,0.002694,0.002072,0.00404,0.000562,0.003741,0.004672,0.001159,0.001484,0.00326,0.001884,0.000126,0.001216,0.002358,0.002173,0.001074,0.001251,9.9e-05,0.000166,0.00067,0.000981,0.000231,0.000488,0.000318,0.000357,0.000424,0.000366,5.1e-05,0.000209,8.4e-05,3.5e-05,0.000113,5.9e-05,7e-05,0.000113,0.00015,0.000215,0.000187,0.000312,0.000256,0.00022,0.000137,0.000274,0.000455,0.000643,0.000266,0.000196,0.000161,0.000253,0.000201,1.9e-05,7.8e-05,0.000176,0.000153,0.000287,0.000495,0.000529,0.000266,0.000301,0.001592,0.001158,0.000554,7.2e-05,3.3e-05,0.000114,6.8e-05,0.000178,0.000285,0.000792
4.7e-05,2.6e-05,4.5e-05,1e-05,3.9e-05,2.7e-05,3.4e-05,4.8e-05,4.8e-05,5.2e-05,2.6e-05,7.9e-05,2e-05,5e-05,4.2e-05,0.000102,7.8e-05,3.8e-05,7.2e-05,8.8e-05,6.1e-05,2.6e-05,2.3e-05,3.1e-05,9.6e-05,0.002356,0.002774,0.001098,0.000185,0.000162,0.000437,0.000455,0.001221,0.002432,0.001598,0.000963,0.000135,0.001666,0.001631,0.002923,0.001486,0.001906,0.000627,0.00177,0.001821,0.00249,0.004226,0.002423,0.001458,0.003112,0.001654,0.002145,0.002662,8.6e-05,0.001357,0.001371,0.000205,0.002038,0.001558,0.001125,0.000684,0.00195,0.00213,0.000433,7.6e-05,0.001939,0.000801,0.001292,0.001123,0.000869,0.00059,0.00041,0.000553,0.000555,0.000247,0.000138,0.000335,0.00012,0.000124,0.000147,0.000181,0.000207,0.000178,0.000125,0.000149,2.2e-05,0.000148,4e-05,0.000216,0.000162,0.000199,9.4e-05,0.000147,2e-05,0.000196,0.000191,0.000187,0.000247,7.8e-05,4.5e-05,0.000228,5.4e-05,5e-05,4.3e-05,0.000112,4e-05,0.000172,0.00042,6.7e-05,5.4e-05,0.000169,0.001526,0.000983,0.000462,7.6e-05,4e-05,0.000148,6.4e-05,0.000114,0.000151,0.000729
1.7e-05,6e-06,1.5e-05,1.7e-05,1e-05,1.7e-05,1.6e-05,1.3e-05,1.4e-05,1.8e-05,2e-05,2.6e-05,2.3e-05,6e-06,9e-06,2.7e-05,1.3e-05,4e-06,1.4e-05,2e-05,1e-05,4e-06,1.8e-05,2e-05,9.9e-05,0.000685,0.00082,0.000546,0.00022,0.000149,0.000169,0.000285,0.000283,0.000115,0.000945,0.00079,0.000797,0.001331,0.000486,0.001,0.000125,0.000979,0.000715,0.000776,0.000423,0.001214,0.001618,0.000285,0.00038,0.000942,0.000633,0.00073,0.00101,0.000916,0.000734,0.000413,0.000419,0.000466,0.000189,0.000386,0.000771,0.00078,0.000322,0.000581,0.000654,0.000829,0.000459,0.000209,5.4e-05,5.3e-05,2.7e-05,6.3e-05,8.5e-05,0.000127,0.00013,5.5e-05,0.000132,9.3e-05,3.8e-05,8.5e-05,3.1e-05,4.5e-05,6.1e-05,4.2e-05,5.8e-05,4.4e-05,6.3e-05,2.7e-05,9.8e-05,7.1e-05,5.2e-05,1.3e-05,4.8e-05,7.6e-05,9.8e-05,4.9e-05,1e-04,3.8e-05,4.7e-05,5.3e-05,5.8e-05,4.8e-05,3.9e-05,3.1e-05,4.3e-05,2.3e-05,4.6e-05,0.000227,0.000137,9.6e-05,5.4e-05,0.000559,0.000221,8.9e-05,7e-06,4e-05,3.9e-05,1.7e-05,2.3e-05,4.1e-05,0.000311
3e-06,2e-06,1.1e-05,5e-06,6e-06,1e-05,1.3e-05,2.1e-05,4e-06,1.1e-05,1.8e-05,2.7e-05,6e-06,2e-06,3e-06,1.1e-05,7e-06,5e-06,1.2e-05,1.1e-05,1.1e-05,8e-06,8e-06,2e-06,0.00014,0.000117,5e-04,0.000268,8.6e-05,6.1e-05,0.000218,0.000105,0.000134,0.000383,0.000125,0.000551,0.000282,0.001017,0.000982,0.000222,0.000461,0.000715,0.000119,0.000383,0.000308,0.000861,0.001536,0.001079,0.000563,0.001005,0.000792,0.000451,0.00018,0.000845,0.000628,0.000386,0.000569,8.6e-05,0.000931,0.000846,0.00034,4.2e-05,0.000379,0.000536,0.000301,0.000422,0.000125,6.5e-05,7.6e-05,9.5e-05,1.6e-05,8.5e-05,6.2e-05,0.000107,4.6e-05,3.7e-05,0.000121,3.2e-05,1.6e-05,6.2e-05,2.3e-05,4.3e-05,1.3e-05,2.7e-05,3.8e-05,1.5e-05,5.1e-05,4.3e-05,0.000105,3.4e-05,4e-06,1.8e-05,3.3e-05,1e-05,3.9e-05,5.4e-05,4.7e-05,5.5e-05,5.3e-05,4.3e-05,3.9e-05,1.1e-05,2e-05,1.3e-05,4.2e-05,1e-05,4.5e-05,0.000269,0.000264,8.2e-05,3.7e-05,0.00036,0.000179,4.7e-05,2.6e-05,1.1e-05,2.8e-05,2.1e-05,7e-06,6.4e-05,0.000183
6e-06,3e-06,5e-06,5e-06,6e-06,1e-06,3e-06,7e-06,1e-05,7e-06,1.4e-05,1.1e-05,1.6e-05,6e-06,8e-06,5e-06,5e-06,7e-06,1.5e-05,1e-05,1e-05,2e-06,4e-06,6e-06,0.000153,0.000315,0.000394,0.000201,0.000107,5.7e-05,0.000167,0.000424,0.000356,0.000326,0.000365,0.000718,0.000612,0.000883,0.000905,0.001083,0.000627,0.000849,0.000616,0.00017,0.000182,0.000754,0.000504,0.000292,0.000311,0.000636,6e-04,0.000486,0.000472,0.000393,0.000454,0.000477,0.000301,0.000338,0.000798,0.000241,0.00028,0.000377,0.00041,0.00034,0.000246,0.000296,1e-04,5.7e-05,9.5e-05,4.1e-05,4.9e-05,9.1e-05,7e-05,3.7e-05,3.2e-05,2.6e-05,9e-05,4.7e-05,4.3e-05,3e-05,5.3e-05,1.5e-05,7e-06,2.4e-05,1.7e-05,1e-05,3.8e-05,1.3e-05,8.6e-05,5.1e-05,3.6e-05,1.4e-05,1.4e-05,1.8e-05,5.8e-05,3e-05,6.1e-05,1.3e-05,4e-05,9.5e-05,5.7e-05,1.6e-05,2.3e-05,2.6e-05,2.2e-05,1.6e-05,2e-05,0.000187,0.000163,9.6e-05,4.9e-05,0.000188,5.3e-05,3.8e-05,2e-05,1.9e-05,1.7e-05,1.6e-05,4e-06,6e-05,9e-05
2e-06,2e-06,5e-06,5e-06,7e-06,5e-06,3e-06,7e-06,4e-06,2e-06,1.1e-05,9e-06,6e-06,5e-06,1.1e-05,1e-06,5e-06,9e-06,1e-05,6e-06,4e-06,8e-06,3e-06,8e-06,0.000152,0.000339,4.7e-05,8.7e-05,7.4e-05,4.8e-05,0.000156,0.000298,0.000173,0.000109,0.000247,0.000384,0.000458,0.000197,0.000426,0.000443,0.000152,0.000313,0.000171,0.000205,0.000373,0.000354,0.00021,0.001056,0.000641,0.000226,0.00013,0.00042,0.00048,0.000586,0.00083,0.000526,8.1e-05,0.000602,0.000906,0.000664,0.000383,0.000119,0.000423,0.000139,5.7e-05,1e-04,0.000157,4.1e-05,3.9e-05,1.8e-05,2.7e-05,6.2e-05,5.9e-05,1.3e-05,8.2e-05,2.4e-05,0.000131,5.2e-05,2.5e-05,4.3e-05,3.5e-05,2e-05,1e-06,3.7e-05,1e-05,1.6e-05,3.4e-05,7e-06,5.6e-05,1.8e-05,3e-05,5e-06,6e-06,2.4e-05,1e-04,4.6e-05,1.8e-05,1.8e-05,1.7e-05,6.1e-05,3.2e-05,2.6e-05,2.1e-05,1.6e-05,3.2e-05,5e-06,1.5e-05,9.8e-05,8.3e-05,3.1e-05,4.2e-05,6e-05,9.3e-05,4.2e-05,1.8e-05,2.4e-05,1e-05,2e-05,1.4e-05,6.1e-05,5.3e-05
4e-06,2e-06,1e-06,3e-06,6e-06,2e-06,3e-06,3e-06,8e-06,1e-06,8e-06,3e-06,1.1e-05,4e-06,9e-06,7e-06,8e-06,2e-06,3e-06,9e-06,5e-06,4e-06,7e-06,4e-06,0.000151,3.9e-05,0.000111,2.5e-05,6.5e-05,5.8e-05,0.000102,0.00013,0.000308,0.000285,0.000315,0.000302,0.000442,0.000508,0.000208,0.000358,0.000193,0.000127,0.000524,0.000253,0.000361,0.00058,0.000434,0.001126,0.00055,0.000147,0.000169,0.000545,0.000414,4e-04,0.000462,0.000207,0.000127,0.000604,0.000159,0.000221,0.000149,0.000179,0.000343,2.9e-05,0.000182,0.000248,3e-05,6.7e-05,3.9e-05,2.7e-05,2.6e-05,5.5e-05,6.3e-05,4.2e-05,4.2e-05,5e-05,0.000105,2.1e-05,3.2e-05,1.3e-05,1.2e-05,8e-06,3e-06,2.8e-05,3.2e-05,1e-05,2.4e-05,3e-05,2.4e-05,4.2e-05,1.7e-05,5e-06,1.1e-05,1.9e-05,0.000128,3.4e-05,4.8e-05,2.1e-05,1.7e-05,0.000102,7.9e-05,2.3e-05,6e-06,1.3e-05,1.7e-05,2.7e-05,1.7e-05,6.2e-05,6.1e-05,7e-06,3.5e-05,6.4e-05,2e-05,2.5e-05,7e-06,8e-06,1.4e-05,6e-06,1.5e-05,6.4e-05,5.6e-05
1e-06,2e-06,4e-06,5e-06,3e-06,5e-06,5e-06,2e-06,5e-06,8e-06,6e-06,7e-06,1.1e-05,4e-06,1.1e-05,6e-06,4e-06,6e-06,4e-06,8e-06,3e-06,3e-06,6e-06,4e-06,0.000159,0.000293,0.000376,0.000126,1.4e-05,1.7e-05,9.5e-05,4.2e-05,7.3e-05,0.000115,0.000182,0.000403,0.000778,0.000837,0.000677,0.000467,1.8e-05,0.000173,0.00054,0.000591,0.000432,0.000246,0.000514,0.000773,0.000593,0.00032,0.000224,0.000346,0.000351,8.8e-05,0.000363,0.00017,0.000196,0.00031,0.000451,0.000365,2.4e-05,0.00011,0.000306,7.5e-05,0.000106,0.00026,3.6e-05,5.6e-05,8e-06,1.9e-05,1.5e-05,5.2e-05,3.5e-05,4.5e-05,4.3e-05,3.5e-05,0.000117,2.3e-05,4.9e-05,3.4e-05,1.2e-05,6e-06,1e-05,2e-05,3e-05,1.7e-05,2.1e-05,1.7e-05,3.8e-05,1.3e-05,3.3e-05,1.6e-05,1.9e-05,2.8e-05,9.4e-05,2.7e-05,9.7e-05,7.8e-05,3.9e-05,8.5e-05,3.2e-05,2.1e-05,1.5e-05,1e-05,1.2e-05,4e-06,6e-06,0.000108,9.7e-05,7.8e-05,5.2e-05,5.7e-05,8e-06,3e-06,1.2e-05,1.7e-05,1e-06,7e-06,1.6e-05,6.4e-05,5.1e-05
3e-06,2e-06,6e-06,1e-05,6e-06,4e-06,6e-06,1e-05,8e-06,1e-06,7e-06,8e-06,5e-06,7e-06,6e-06,4e-06,6e-06,3e-06,4e-06,1.4e-05,2e-06,3e-06,5e-06,3e-06,0.000185,0.000341,0.00011,7.7e-05,4e-05,1.1e-05,5.1e-05,9.5e-05,2.3e-05,0.000407,0.000415,0.000729,0.000911,0.000236,0.000364,0.000431,0.00015,0.000361,0.000557,0.000207,0.000348,0.000229,0.000416,0.000492,9.2e-05,0.000156,0.000136,0.000255,0.00011,0.00016,0.000204,0.000291,0.000266,0.000227,0.000315,0.000186,0.000114,3.8e-05,0.00021,0.000242,9.9e-05,0.000155,0.000149,8.6e-05,6.6e-05,1.5e-05,6.2e-05,8.7e-05,7.2e-05,7.7e-05,2.5e-05,3.9e-05,0.000102,2.5e-05,3.5e-05,2.2e-05,2.5e-05,1.7e-05,2.2e-05,1e-05,3e-05,1.3e-05,2.6e-05,7e-06,5.8e-05,3.8e-05,2.7e-05,4e-06,1.3e-05,6.5e-05,3.2e-05,8.8e-05,0.000104,8e-06,1.9e-05,5.9e-05,6.4e-05,2.5e-05,6e-06,1.2e-05,2.4e-05,7e-06,2.1e-05,0.000133,7.5e-05,1.9e-05,9e-06,5e-05,5.9e-05,2.4e-05,1.7e-05,1.1e-05,2.7e-05,1.9e-05,5e-06,6.8e-05,1.7e-05
3e-06,3e-06,6e-06,4e-06,2e-06,6e-06,5e-06,9e-06,5e-06,4e-06,4e-06,5e-06,9e-06,5e-06,7e-06,7e-06,6e-06,1.2e-05,4e-06,3e-06,9e-06,6e-06,5e-06,4e-06,0.000215,0.000101,0.000139,0.000115,4.2e-05,2.8e-05,1.3e-05,0.000134,0.000301,5e-04,0.000258,0.000489,4.9e-05,0.00024,0.000308,0.000465,0.000279,0.000151,0.000392,0.000387,0.000195,0.000286,0.000319,0.000692,0.000541,0.000215,0.000213,0.000267,0.000133,0.000433,0.000107,0.000226,0.00018,7.8e-05,0.000401,2e-04,0.000165,6.9e-05,0.000219,0.000164,0.000226,0.000127,0.000152,5.8e-05,4.4e-05,4.4e-05,8.8e-05,3.3e-05,6.9e-05,0.000102,0.000131,6.4e-05,8.9e-05,7.6e-05,6.4e-05,4.4e-05,4.3e-05,1.2e-05,1.2e-05,2.3e-05,2.7e-05,2.8e-05,1.4e-05,3.4e-05,5.7e-05,3.6e-05,3.2e-05,1.5e-05,1.8e-05,7.2e-05,7.6e-05,0.000182,9.5e-05,5.6e-05,0.000101,9.2e-05,8e-06,9e-06,8e-06,2.1e-05,2e-05,7e-06,2.6e-05,9.8e-05,2.1e-05,2.4e-05,1.1e-05,1.5e-05,5.9e-05,2.7e-05,1.1e-05,1.4e-05,2.2e-05,7e-06,6e-06,6e-05,7.2e-05
4e-06,4e-06,8e-06,7e-06,6e-06,5e-06,9e-06,1e-06,6e-06,5e-06,3e-06,7e-06,1.7e-05,9e-06,5e-06,4e-06,4e-06,9e-06,1.5e-05,9e-06,1e-05,6e-06,3e-06,3e-06,0.000234,0.000242,0.00012,0.000126,5.7e-05,3.4e-05,6.6e-05,0.000198,0.000352,0.00041,0.000558,0.00027,6.3e-05,0.000117,0.000142,0.000188,0.000198,8.7e-05,0.000328,0.00026,0.000113,0.00027,0.000152,0.000282,0.000162,0.000222,0.000377,0.000265,0.000163,0.000383,0.000403,9.4e-05,0.000363,0.000274,0.000119,0.000122,0.000138,0.000298,0.000145,0.000129,0.000252,0.000271,8.5e-05,9.8e-05,9e-05,0.000117,4e-05,2.9e-05,3.6e-05,2.4e-05,8.9e-05,4.6e-05,7.6e-05,0.000107,4.8e-05,3.6e-05,5e-06,2.2e-05,5e-06,8e-06,8e-06,1.2e-05,3e-05,3e-05,1.3e-05,1.6e-05,4e-05,4e-05,3.3e-05,8.1e-05,0.000153,0.000144,4e-05,1.5e-05,9.1e-05,6e-05,4.6e-05,1.6e-05,8e-06,1e-05,2.7e-05,2.4e-05,3.3e-05,0.000136,6.3e-05,2.6e-05,1e-06,8.5e-05,0.000107,3.7e-05,1.4e-05,7e-06,1.8e-05,8e-06,5e-06,4.7e-05,0.000136
3e-06,3e-06,5e-06,5e-06,8e-06,7e-06,7e-06,5e-06,1e-05,3e-06,8e-06,4e-06,9e-06,1.1e-05,9e-06,1e-05,1e-05,5e-06,8e-06,6e-06,4e-06,2e-06,7e-06,2e-06,0.000247,0.000169,0.000276,8.1e-05,2.7e-05,3.4e-05,3.9e-05,0.000205,0.00023,9.3e-05,0.000445,0.000394,0.000371,7e-05,0.000183,0.000505,0.000113,0.000118,0.000128,0.00029,0.000194,0.000396,0.000297,0.000311,0.000282,0.000188,0.000183,7.7e-05,0.000104,0.000228,0.000148,0.000173,0.000303,8.9e-05,0.000175,0.000375,0.000197,0.000203,0.000321,2.7e-05,0.000116,7.9e-05,0.000207,0.000109,7.8e-05,0.000104,6e-05,3.5e-05,1.8e-05,3.7e-05,8.3e-05,7e-06,1.5e-05,4.3e-05,9.1e-05,3.2e-05,2e-05,3e-05,2.7e-05,2.1e-05,1.2e-05,2.1e-05,2.7e-05,1.8e-05,3e-06,2.8e-05,1.5e-05,2.5e-05,9e-06,3.9e-05,0.000136,1.3e-05,5.7e-05,1.2e-05,5e-05,6.8e-05,5.6e-05,2e-05,5e-06,1.3e-05,6e-06,1.1e-05,4.2e-05,0.000253,0.000121,4.9e-05,2.4e-05,0.000141,6.3e-05,5.1e-05,3.3e-05,2e-05,1.3e-05,1.4e-05,1.1e-05,5.2e-05,0.000155
5e-06,2e-06,8e-06,5e-06,1.4e-05,1.2e-05,1.1e-05,3e-06,1e-05,8e-06,8e-06,3e-06,7e-06,4e-06,3e-06,1.2e-05,2.1e-05,1.3e-05,5e-06,6e-06,1e-05,7e-06,4e-06,3e-06,0.000253,0.000195,0.000332,0.000172,9.2e-05,5.7e-05,7.2e-05,0.000209,0.000233,0.000248,0.000277,0.000298,0.000566,0.000579,0.000469,0.000561,0.000183,0.000187,7.1e-05,0.000232,0.000233,0.000324,0.000126,0.000201,7.7e-05,0.000133,1.2e-05,0.000162,0.000172,0.000111,0.000197,0.000248,0.000142,3.8e-05,0.000245,0.000294,4e-06,0.000167,0.000268,8.1e-05,0.000152,3.4e-05,0.000216,0.000112,0.00011,6.7e-05,5.4e-05,2.8e-05,2.5e-05,1e-05,8.5e-05,4.7e-05,3.8e-05,3.6e-05,8.3e-05,5.5e-05,6e-06,1.4e-05,1.8e-05,2.1e-05,1.8e-05,3e-06,2.2e-05,3.7e-05,1.3e-05,2.3e-05,3.1e-05,1.2e-05,1.3e-05,2.2e-05,9.7e-05,1.6e-05,5.9e-05,8.1e-05,7.7e-05,1e-05,2.3e-05,1.6e-05,5e-06,9e-06,6e-06,3e-06,4.5e-05,0.000291,0.000145,6.9e-05,2.8e-05,0.000187,7.8e-05,6.6e-05,2.6e-05,1.4e-05,1.2e-05,1.6e-05,1.1e-05,4.6e-05,0.000146
3e-06,2e-06,1.1e-05,1.1e-05,2e-05,1.3e-05,8e-06,3e-06,8e-06,6e-06,8e-06,4e-06,2e-06,4e-06,6e-06,1.6e-05,9e-06,5e-06,2e-06,0,7e-06,6e-06,8e-06,4e-06,0.000245,0.000191,0.000278,6.4e-05,5.9e-05,1.3e-05,4.6e-05,0.000151,0.000283,0.000145,0.000182,0.000413,0.000273,0.000337,0.000168,0.000399,0.000232,0.000303,0.000104,0.000127,0.00032,0.000391,0.000129,0.000144,0.000365,0.000192,5.3e-05,5.6e-05,0.000111,4e-05,0.000236,0.000344,0.000152,7e-05,0.000272,0.000107,6.9e-05,0.000253,0.000139,0.000129,0.000162,4.3e-05,0.000185,8.3e-05,0.000103,0.000116,7.6e-05,7.1e-05,5.3e-05,2.6e-05,0.000113,7e-05,4e-05,9.2e-05,5e-06,3.5e-05,1.6e-05,1.9e-05,1.1e-05,1e-06,3e-05,1.3e-05,1.3e-05,3.2e-05,6e-06,7e-06,3.6e-05,1.2e-05,9e-06,3e-05,5.1e-05,0.000132,0.000145,3.7e-05,2.8e-05,6.2e-05,3.8e-05,1.4e-05,3.2e-05,1.2e-05,2.5e-05,2.1e-05,2.7e-05,0.000375,0.000313,0.00013,3.3e-05,0.00015,8.8e-05,1.1e-05,7e-06,2.7e-05,4e-05,2.5e-05,7e-06,5.6e-05,0.000188
7e-06,5e-06,8e-06,9e-06,1.1e-05,2e-06,5e-06,1e-05,1.2e-05,8e-06,3e-06,5e-06,8e-06,1.2e-05,6e-06,2.5e-05,1.7e-05,1.4e-05,4e-06,4e-06,3e-06,7e-06,1.4e-05,1.4e-05,0.000225,0.000119,0.000132,0.000164,8e-05,3.5e-05,4.8e-05,0.00012,0.000304,0.00052,0.000277,0.000351,0.000306,0.000463,0.00031,6.7e-05,8.8e-05,0.000183,6.4e-05,0.000161,0.000244,0.000315,0.000109,0.00013,0.00037,0.000292,8.8e-05,0.000112,8.7e-05,0.000165,2e-04,0.000111,0.000425,0.000188,0.000251,0.000296,0.000194,0.000305,0.00032,0.000109,0.000116,0.000295,9.3e-05,4.2e-05,4.7e-05,1.2e-05,2.9e-05,3.6e-05,1.8e-05,6.7e-05,5.2e-05,3e-05,1.7e-05,8.5e-05,8.6e-05,7.5e-05,4.6e-05,4.4e-05,3e-05,8e-06,2.5e-05,3.6e-05,9e-06,2.9e-05,4.7e-05,2.7e-05,1.5e-05,3.9e-05,3e-05,9e-06,0.000135,0.000111,0.000105,9.1e-05,4.1e-05,5.5e-05,6.3e-05,5.3e-05,4.1e-05,1.5e-05,2.7e-05,4.2e-05,3.6e-05,0.000351,0.000376,0.000185,4.4e-05,0.000107,7e-05,4.8e-05,1.8e-05,2.7e-05,3.8e-05,1.3e-05,2.3e-05,7.2e-05,0.000225
3e-06,4e-06,8e-06,8e-06,1.1e-05,1.2e-05,3e-06,7e-06,4e-06,1e-05,1.1e-05,7e-06,7e-06,1e-05,5e-06,2.3e-05,7e-06,6e-06,1.1e-05,7e-06,8e-06,1.2e-05,3e-06,2e-06,0.000215,0.000206,0.000352,0.000207,7.3e-05,1.3e-05,4e-05,0.000124,0.000157,4e-04,0.000198,0.000249,9.4e-05,0.000201,0.000333,0.000253,7.5e-05,7.8e-05,9.4e-05,0.000197,0.000216,0.00028,0.000334,0.000267,0.000218,0.000219,0.000113,0.000183,9.3e-05,0.000135,0.000125,0.000158,0.000418,0.000382,0.000178,0.000429,0.000121,5.7e-05,0.000308,0.00013,0.000175,0.000143,6.4e-05,5e-05,4.5e-05,6.2e-05,5.7e-05,1.6e-05,8e-06,3.4e-05,2.2e-05,1.9e-05,5.1e-05,6.4e-05,8e-06,1.3e-05,1e-05,1.9e-05,1.4e-05,2.5e-05,4.9e-05,4.7e-05,4.1e-05,1.4e-05,3.6e-05,2.4e-05,3.4e-05,3.4e-05,3.9e-05,3.5e-05,0.000182,8.5e-05,8.4e-05,5.6e-05,1.5e-05,3.6e-05,8.4e-05,2.5e-05,4e-06,1e-05,1.3e-05,2.1e-05,1.7e-05,0.000342,0.000329,0.00016,4.2e-05,8e-05,7.7e-05,4.7e-05,2.7e-05,3e-05,7e-06,1.2e-05,2.5e-05,4.9e-05,0.000218
4e-06,2e-06,1e-06,7e-06,1e-05,8e-06,5e-06,6e-06,8e-06,9e-06,6e-06,5e-06,9e-06,3e-06,4e-06,2e-05,2e-05,9e-06,3e-06,7e-06,8e-06,4e-06,3e-06,6e-06,2e-04,0.000134,0.000301,0.000143,0.000116,4.4e-05,1.7e-05,0.000177,0.000297,0.000272,0.000144,0.000265,0.000242,0.000177,0.000255,7.8e-05,0.000237,0.000271,0.000179,0.000188,8.6e-05,0.000199,0.000312,0.000132,0.000227,0.000288,4e-05,0.000103,5.9e-05,0.000208,0.000132,0.000136,0.000308,0.000133,0.000218,0.00019,1e-04,0.000164,0.000243,0.000108,0.000165,0.000152,6e-05,5.7e-05,1.4e-05,4.3e-05,8.3e-05,2.8e-05,3.1e-05,6e-05,5.9e-05,4.3e-05,4.1e-05,6.2e-05,5.2e-05,2.3e-05,1.7e-05,1.5e-05,1.9e-05,3.1e-05,2.4e-05,1.6e-05,1.7e-05,2.2e-05,2.5e-05,2.7e-05,4.7e-05,5.6e-05,4.3e-05,4.2e-05,0.000267,8.8e-05,0.000102,5.4e-05,3e-05,1.2e-05,4.2e-05,1.6e-05,1.5e-05,1.5e-05,1e-05,1.5e-05,9e-06,0.000271,0.00016,5.9e-05,1.7e-05,7.8e-05,7.2e-05,4e-05,7e-06,1.3e-05,1.4e-05,1.3e-05,7e-06,4.2e-05,0.00014
3e-06,5e-06,8e-06,4e-06,0,6e-06,7e-06,3e-06,5e-06,8e-06,1.4e-05,1.1e-05,1.7e-05,8e-06,7e-06,1.8e-05,7e-06,4e-06,3e-06,4e-06,3e-06,9e-06,7e-06,4e-06,0.000177,0.000121,0.000239,0.000115,0.000125,7e-05,7.1e-05,0.000258,0.000123,0.00016,0.000279,0.000197,0.00013,9.9e-05,0.000165,0.000115,0.000245,0.00013,0.000152,0.000272,8e-05,0.000273,0.000258,0.000306,0.000114,0.000176,3.4e-05,0.000101,0.000121,0.00013,0.000125,7e-05,0.00017,0.00013,0.000329,0.000198,8.9e-05,0.000165,0.000155,0.000108,0.000213,4.2e-05,0.000125,3.4e-05,3.8e-05,8.1e-05,6.2e-05,7.4e-05,8.8e-05,8.6e-05,0.000126,4.3e-05,4.6e-05,0.000122,0.000102,8e-05,5.1e-05,2.1e-05,2.1e-05,5.2e-05,2.9e-05,2.3e-05,1e-05,2.2e-05,6e-05,3.5e-05,7.5e-05,6.8e-05,3.8e-05,3.3e-05,0.000278,0.000147,8.8e-05,1.7e-05,3e-05,1.9e-05,2.3e-05,1.2e-05,2.4e-05,1.4e-05,8e-06,4e-06,1.5e-05,0.00021,2.1e-05,3.4e-05,2.5e-05,3.4e-05,5.5e-05,2.2e-05,1.5e-05,1.9e-05,8e-06,6e-06,4e-06,5.4e-05,5.4e-05
9e-06,9e-06,7e-06,8e-06,5e-06,8e-06,2e-06,2e-06,2e-06,1.1e-05,6e-06,1.2e-05,2e-05,1.5e-05,7e-06,9e-06,1.3e-05,6e-06,0,4e-06,2e-06,5e-06,2e-06,2e-06,0.000145,0.000102,0.000152,0.000148,6.4e-05,3.1e-05,6.8e-05,0.000242,0.000264,1.9e-05,0.000249,0.000231,0.000416,0.000592,0.000346,0.000183,0.00034,0.000428,7e-05,9e-05,0.000187,0.000134,0.000326,0.000228,0.000133,0.000288,4.1e-05,0.000156,0.000211,0.000207,5.8e-05,0.000236,4.6e-05,9.7e-05,0.000252,0.000129,0.00015,0.000121,0.000131,0.000151,0.000194,0.000151,8.8e-05,0.000116,0.000131,2e-05,8.3e-05,6.3e-05,5.1e-05,6.2e-05,6.3e-05,8.1e-05,6.4e-05,0.000118,8.1e-05,2.7e-05,2.3e-05,1.9e-05,3.5e-05,4.1e-05,7e-06,2.1e-05,2.9e-05,1.7e-05,4.5e-05,2.6e-05,5.4e-05,3.3e-05,1.1e-05,3.8e-05,2e-04,0.000138,8.2e-05,6.2e-05,4.8e-05,3.2e-05,5.2e-05,5e-06,1.8e-05,1.7e-05,1.4e-05,8e-06,1.7e-05,0.000157,9.3e-05,6.7e-05,1.4e-05,1e-05,4.9e-05,1.3e-05,1.2e-05,1e-06,1e-06,3e-06,4e-06,5.5e-05,2.6e-05
5e-06,4e-06,1e-06,2e-06,4e-06,4e-06,3e-06,1e-06,2e-06,7e-06,3e-06,8e-06,2e-06,4e-06,1e-06,7e-06,2e-06,1e-06,3e-06,2e-06,4e-06,5e-06,4e-06,1e-06,0.000118,0.000104,0.000145,2e-05,2.9e-05,3.1e-05,3.7e-05,2e-04,5.4e-05,0.000193,0.000281,0.000179,0.000367,0.000284,8.7e-05,0.000356,3.2e-05,0.000274,0.000142,0.000201,0.000159,0.000123,0.000149,1e-04,0.000299,0.000171,0.000123,8.7e-05,0.000103,3.5e-05,0.000216,9.3e-05,0.000102,7.3e-05,0.000296,0.000222,6e-06,8.9e-05,0.000179,0.000101,2e-05,1.5e-05,3.9e-05,4.6e-05,4.5e-05,4.9e-05,5.8e-05,4.7e-05,2.1e-05,1e-05,1.7e-05,2.7e-05,3.6e-05,6e-05,2.6e-05,2.9e-05,2.2e-05,2e-06,2.2e-05,9e-06,1.9e-05,9e-06,1.8e-05,7e-06,2.7e-05,3e-06,2.3e-05,9e-06,4e-06,4.6e-05,0.000142,4.7e-05,3.8e-05,4e-05,3.2e-05,1.5e-05,3.8e-05,1.6e-05,8e-06,6e-06,6e-06,4e-06,1.3e-05,9.7e-05,7.2e-05,3.1e-05,1.3e-05,2.6e-05,2e-05,5e-06,9e-06,7e-06,2e-06,1e-06,3e-06,5.1e-05,3.7e-05
2e-06,2e-06,0,1e-06,5e-06,3e-06,1e-06,0,1e-06,4e-06,3e-06,4e-06,5e-06,2e-06,1e-06,5e-06,5e-06,0,2e-06,1e-06,2e-06,1e-06,2e-06,3e-06,9.9e-05,5.1e-05,8e-05,4.4e-05,2.1e-05,3e-06,3.5e-05,0.000149,0.000109,0.000249,0.000135,3.7e-05,0.000323,0.000102,5.9e-05,0.000275,4.8e-05,0.000186,0.000163,0.000216,0.000164,0.000151,0.000184,0.00012,0.000157,0.000125,4.1e-05,6.9e-05,6.7e-05,3.6e-05,0.000245,0.000152,1.8e-05,6.6e-05,0.000205,0.00022,6.5e-05,6.1e-05,0.000211,7.6e-05,5.3e-05,3.4e-05,2.5e-05,3.9e-05,3.6e-05,9e-06,1.7e-05,3.8e-05,2e-05,1.3e-05,1.6e-05,9e-06,3.2e-05,2.4e-05,4e-06,1.3e-05,9e-06,1e-05,7e-06,1.2e-05,1e-05,7e-06,1.3e-05,1e-06,2.5e-05,4e-06,1.1e-05,1e-06,3e-06,3.4e-05,0.000108,1.2e-05,3.7e-05,1.7e-05,2.3e-05,1.1e-05,2.8e-05,6e-06,5e-06,4e-06,2e-06,3e-06,8e-06,5.5e-05,2e-05,5e-06,1.3e-05,3.7e-05,2.5e-05,1e-05,6e-06,4e-06,4e-06,2e-06,3e-06,5.2e-05,3.6e-05
2e-06,2e-06,1e-06,1e-06,4e-06,2e-06,1e-06,1e-06,1e-06,4e-06,4e-06,3e-06,2e-06,1e-06,2e-06,3e-06,3e-06,0,2e-06,1e-06,2e-06,0,2e-06,3e-06,9.2e-05,4.6e-05,7.4e-05,6e-05,1.1e-05,7e-06,3.8e-05,0.000114,7.7e-05,1e-04,0.000174,6e-05,0.000287,0.000187,5.7e-05,0.000202,5.3e-05,8.7e-05,8.7e-05,0.000213,0.000112,0.00018,0.000195,0.000222,0.000266,0.000154,5.5e-05,6.3e-05,2e-05,8.9e-05,0.000145,9.3e-05,6.8e-05,4.3e-05,0.000202,0.000179,4.1e-05,5.2e-05,0.000209,5.1e-05,6.1e-05,2.5e-05,1.2e-05,8e-06,1.5e-05,1.5e-05,1.4e-05,3.9e-05,1.4e-05,1.1e-05,2e-05,7e-06,3.2e-05,1.4e-05,4e-06,1.9e-05,4e-06,6e-06,5e-06,1.3e-05,1.2e-05,9e-06,8e-06,1e-06,2.4e-05,3e-06,6e-06,2e-06,5e-06,3.5e-05,0.000108,8e-06,3.6e-05,9e-06,1.5e-05,5e-06,2.8e-05,3e-06,1e-06,3e-06,2e-06,1e-06,7e-06,2.8e-05,1.7e-05,2e-06,8e-06,4.1e-05,1.3e-05,9e-06,6e-06,3e-06,4e-06,2e-06,2e-06,5.7e-05,2.1e-05
