0.044198,0.033367,0.029058,0.038551,0.077145,0.086863,0.056928,0.037438,0.030091,0.032452,0.02679,0.023398,0.032258,0.033386,0.025076,0.019113,0.017869,0.016842,0.021312,0.045361,0.055967,0.067176,0.074034,0.052291,0.035645,0.031662,0.047822,0.073868
0.052479,0.038497,0.03231,0.044435,0.094404,0.10833,0.071491,0.04716,0.036994,0.03837,0.031129,0.027367,0.03823,0.039415,0.029109,0.021986,0.020564,0.019415,0.025124,0.05352,0.066511,0.079594,0.087365,0.062005,0.041489,0.036246,0.056017,0.087181
0.064083,0.044955,0.035235,0.05205,0.121954,0.144935,0.09793,0.06467,0.048828,0.047789,0.037675,0.033309,0.047046,0.048146,0.034946,0.026323,0.024273,0.02272,0.030369,0.065145,0.082655,0.097287,0.105038,0.075395,0.049158,0.041836,0.067315,0.105483
0.065952,0.044072,0.032335,0.05243,0.134588,0.167354,0.118738,0.079371,0.058845,0.0541,0.040332,0.035408,0.051014,0.05275,0.038728,0.029657,0.026064,0.023305,0.032203,0.07109,0.093167,0.104604,0.108626,0.079704,0.05097,0.042219,0.069912,0.108273
0.05913,0.037295,0.027446,0.048647,0.125907,0.161203,0.121643,0.08531,0.066043,0.056565,0.037725,0.033456,0.051638,0.05662,0.042948,0.032418,0.02669,0.021988,0.031456,0.074891,0.103413,0.106156,0.103451,0.081674,0.052201,0.039534,0.0641,0.097791
0.054183,0.032497,0.027303,0.049681,0.112338,0.142303,0.114019,0.087191,0.072301,0.05613,0.034067,0.035155,0.059956,0.070484,0.052673,0.035062,0.028552,0.022573,0.032226,0.086606,0.125862,0.114671,0.106003,0.100591,0.068502,0.042523,0.063401,0.097684
0.055406,0.035214,0.03419,0.054681,0.115128,0.152433,0.128995,0.10635,0.08777,0.060049,0.038059,0.049492,0.090791,0.110121,0.077641,0.041631,0.032259,0.02563,0.035391,0.106416,0.161092,0.138811,0.131929,0.150926,0.109974,0.057545,0.08095,0.130285
0.06649,0.045071,0.044876,0.061913,0.139566,0.202305,0.179356,0.155206,0.12411,0.077786,0.053522,0.078375,0.146436,0.174514,0.118132,0.057323,0.040096,0.030988,0.042935,0.138194,0.210261,0.173505,0.177521,0.231736,0.175831,0.087153,0.114419,0.181404
0.088694,0.060936,0.055631,0.071688,0.181208,0.271361,0.241547,0.216837,0.174615,0.108209,0.077611,0.115826,0.212203,0.241424,0.157229,0.076311,0.051742,0.039986,0.054769,0.172227,0.256575,0.204644,0.224945,0.317717,0.249096,0.126302,0.150873,0.225691
0.118767,0.080291,0.064384,0.081687,0.220016,0.321844,0.280651,0.259769,0.217867,0.143537,0.10662,0.15085,0.259761,0.275038,0.17221,0.088642,0.063567,0.052491,0.065372,0.195793,0.288754,0.222381,0.245649,0.357996,0.292935,0.163152,0.179981,0.246747
0.155325,0.103076,0.074343,0.093802,0.239772,0.329616,0.276372,0.25754,0.231434,0.172698,0.132281,0.170741,0.264687,0.252135,0.154901,0.092838,0.075312,0.067239,0.071016,0.197821,0.28895,0.216566,0.225638,0.31832,0.275525,0.18188,0.198407,0.251014
0.193867,0.12991,0.08764,0.107052,0.237775,0.305068,0.242601,0.216767,0.220969,0.197406,0.149314,0.166962,0.227385,0.190614,0.120839,0.091481,0.085394,0.079471,0.071347,0.177269,0.251943,0.185889,0.176467,0.221149,0.20407,0.17826,0.218293,0.261152
0.214797,0.146944,0.094618,0.110907,0.208015,0.248785,0.19617,0.16789,0.194912,0.209455,0.154217,0.138743,0.16978,0.134689,0.092669,0.081424,0.084257,0.080147,0.065494,0.135286,0.185355,0.145257,0.134376,0.139143,0.129547,0.158225,0.238614,0.283678
0.19464,0.134537,0.084885,0.099833,0.170004,0.195554,0.156273,0.129017,0.161561,0.194767,0.140725,0.105209,0.125039,0.103633,0.073651,0.063945,0.067873,0.065104,0.056452,0.104935,0.139805,0.11926,0.111675,0.104798,0.091147,0.135137,0.239452,0.295594
0.153356,0.100939,0.065358,0.082009,0.151252,0.184072,0.13699,0.101915,0.137268,0.168132,0.121568,0.089681,0.106449,0.094936,0.068445,0.054506,0.051971,0.046453,0.048931,0.098423,0.133384,0.114692,0.099836,0.093989,0.080326,0.114747,0.219563,0.3015
0.157412,0.096052,0.060862,0.074524,0.158869,0.211078,0.148578,0.098919,0.142514,0.167229,0.116611,0.091916,0.122571,0.124442,0.089678,0.067249,0.058393,0.049083,0.05771,0.114134,0.156895,0.132719,0.104189,0.106726,0.098235,0.116677,0.219264,0.342169
0.207207,0.123286,0.075715,0.089458,0.184202,0.245641,0.184861,0.136037,0.199033,0.21749,0.135678,0.110672,0.170075,0.182089,0.131685,0.100771,0.085876,0.070152,0.080034,0.150336,0.20593,0.171205,0.129217,0.144023,0.138879,0.150906,0.270488,0.434719
0.262887,0.154015,0.090654,0.107491,0.206924,0.266024,0.222651,0.194837,0.269242,0.27673,0.164609,0.134508,0.22439,0.243322,0.174846,0.136018,0.113814,0.090918,0.102163,0.19373,0.266463,0.219686,0.167795,0.193461,0.182307,0.184615,0.325985,0.557267
0.307311,0.174847,0.096659,0.120876,0.238573,0.292961,0.257769,0.253517,0.309006,0.296018,0.181164,0.154835,0.267268,0.285416,0.199316,0.154594,0.126307,0.100714,0.116821,0.223807,0.303781,0.252997,0.202462,0.230508,0.206379,0.197322,0.35173,0.665299
0.337192,0.187249,0.095369,0.126455,0.274777,0.329185,0.280446,0.284645,0.292075,0.252897,0.170729,0.160101,0.277722,0.292744,0.195826,0.148076,0.121438,0.101683,0.126355,0.232959,0.298739,0.25568,0.221321,0.234519,0.195219,0.182859,0.338469,0.711133
0.346005,0.193598,0.092733,0.119588,0.283646,0.347126,0.276298,0.264822,0.233306,0.183933,0.145471,0.143856,0.241617,0.265111,0.177386,0.127675,0.112726,0.101937,0.128626,0.216917,0.253993,0.226792,0.212179,0.19993,0.151599,0.146669,0.289504,0.655787
0.317624,0.185725,0.085843,0.098446,0.249053,0.322386,0.238999,0.200866,0.176051,0.140651,0.114856,0.113258,0.179306,0.210319,0.152544,0.103129,0.090976,0.086915,0.1128,0.176112,0.195502,0.181793,0.178697,0.171913,0.127625,0.11306,0.222031,0.499722
0.260363,0.167094,0.079837,0.07388,0.189358,0.24868,0.173577,0.137414,0.148521,0.129614,0.087772,0.089767,0.131603,0.151524,0.126705,0.084887,0.062147,0.060147,0.082705,0.137511,0.162717,0.144747,0.135064,0.155599,0.12873,0.090353,0.172019,0.344445
0.240511,0.153718,0.078018,0.060641,0.134166,0.165403,0.116132,0.115986,0.151668,0.129914,0.071379,0.072977,0.109336,0.117014,0.102791,0.070028,0.044545,0.044744,0.061423,0.118653,0.154683,0.123972,0.10334,0.141841,0.126746,0.072004,0.127762,0.243366
0.240654,0.148978,0.079465,0.057331,0.105348,0.127159,0.099018,0.130685,0.163566,0.122849,0.064939,0.063748,0.095735,0.095494,0.081109,0.057673,0.036974,0.037521,0.050324,0.104277,0.139747,0.107502,0.083315,0.116089,0.10621,0.058314,0.098331,0.176317
0.239443,0.154222,0.084118,0.059255,0.081589,0.09462,0.090018,0.152301,0.17375,0.107459,0.056565,0.050817,0.069857,0.070381,0.060584,0.046733,0.035331,0.033109,0.042251,0.080257,0.101878,0.08127,0.060663,0.07502,0.071469,0.048545,0.080893,0.124848
0.245283,0.167826,0.090597,0.063041,0.065978,0.070231,0.083518,0.163637,0.178299,0.097616,0.047195,0.037116,0.044874,0.051298,0.045605,0.03811,0.037185,0.032563,0.03616,0.056084,0.060144,0.049812,0.042441,0.049335,0.049569,0.045703,0.074625,0.09866
0.250355,0.185729,0.108327,0.070372,0.053753,0.056618,0.081419,0.151588,0.154613,0.085922,0.043441,0.032037,0.036804,0.045377,0.039976,0.033648,0.040917,0.038209,0.032958,0.04114,0.041788,0.040546,0.042106,0.048039,0.048759,0.04967,0.072127,0.079218
0.243236,0.187772,0.124375,0.082316,0.049555,0.053716,0.087382,0.131657,0.115823,0.07584,0.051388,0.037928,0.040966,0.048204,0.04473,0.035909,0.04717,0.052118,0.040117,0.038591,0.042112,0.050363,0.053803,0.057612,0.057795,0.05733,0.074817,0.069254
0.228236,0.181946,0.128661,0.086671,0.053095,0.063468,0.106594,0.14784,0.122784,0.090519,0.07199,0.052889,0.047798,0.05204,0.053492,0.041664,0.05402,0.068294,0.056415,0.047874,0.051858,0.067299,0.070302,0.074581,0.072619,0.068778,0.085497,0.073695
0.218116,0.17037,0.11252,0.077982,0.061263,0.081417,0.137142,0.186936,0.165172,0.132965,0.105931,0.07398,0.05485,0.054606,0.059368,0.046289,0.057809,0.080377,0.074082,0.061613,0.066208,0.088367,0.089884,0.09711,0.092986,0.077918,0.086254,0.06903
0.246644,0.185675,0.098117,0.073583,0.078184,0.099988,0.169111,0.240807,0.230479,0.184972,0.137077,0.090311,0.05891,0.053271,0.056311,0.046424,0.057537,0.083084,0.084731,0.07112,0.076827,0.105139,0.105705,0.117666,0.115052,0.08179,0.07356,0.05644
0.321435,0.268547,0.127676,0.089588,0.103495,0.111673,0.184612,0.294339,0.31085,0.234339,0.146839,0.090003,0.052944,0.04617,0.049614,0.043212,0.053598,0.076127,0.080396,0.066352,0.072021,0.102189,0.108253,0.127976,0.129155,0.091256,0.065367,0.045663
0.408726,0.385356,0.190271,0.127799,0.128387,0.112322,0.173191,0.305894,0.367283,0.266162,0.126862,0.07211,0.039105,0.037193,0.04711,0.042363,0.058951,0.073782,0.063351,0.048704,0.054507,0.080357,0.096968,0.126891,0.134384,0.106694,0.063916,0.036236
0.486179,0.498515,0.256434,0.17878,0.147747,0.115929,0.160106,0.267099,0.36815,0.273774,0.097185,0.056266,0.030805,0.030102,0.047856,0.049442,0.072629,0.07981,0.049343,0.032503,0.044032,0.066738,0.081979,0.111636,0.137819,0.121877,0.068124,0.037143
0.575237,0.574798,0.29676,0.22403,0.161496,0.132476,0.161874,0.219779,0.330968,0.265702,0.091745,0.057107,0.031946,0.02847,0.0462,0.053672,0.085909,0.092307,0.051277,0.028724,0.040139,0.063633,0.074413,0.088366,0.129432,0.121775,0.068421,0.040164
0.658542,0.608339,0.320425,0.236917,0.176294,0.164928,0.172822,0.205999,0.303735,0.237211,0.099913,0.068313,0.034159,0.025042,0.037168,0.048894,0.091789,0.111859,0.067429,0.036113,0.046317,0.063926,0.064209,0.077496,0.120733,0.112302,0.070958,0.043801
0.670566,0.601725,0.33894,0.204492,0.167936,0.186547,0.19403,0.211691,0.281693,0.21275,0.129087,0.088943,0.036854,0.019543,0.029259,0.046175,0.101837,0.135693,0.081859,0.045392,0.057198,0.067897,0.064651,0.084908,0.11393,0.104336,0.079543,0.047328
0.594549,0.534682,0.33061,0.167995,0.152472,0.184433,0.200947,0.224968,0.283643,0.21637,0.178864,0.118256,0.040552,0.018869,0.031424,0.055058,0.124762,0.159129,0.085942,0.052223,0.0628,0.068028,0.072494,0.100304,0.116343,0.096051,0.077469,0.048284
0.5344,0.496315,0.329112,0.182987,0.158388,0.18051,0.201726,0.234332,0.27794,0.238062,0.232861,0.149164,0.052144,0.023942,0.036004,0.069694,0.144297,0.176258,0.08546,0.060733,0.059979,0.061761,0.075166,0.109158,0.135703,0.09831,0.063244,0.042593
