0.0886,0.219985,0.30824,0.607095,0.938108,0.808534,0.607656,0.628619,0.584532,0.388662,0.215536,0.167505,0.187866,0.14766,0.087138,0.081153,0.121758,0.224136,0.347381,0.300821,0.127344,0.063691,0.073819,0.074111,0.055067,0.032811,0.025708,0.057708
0.10766,0.264474,0.363802,0.689101,1.046865,0.893053,0.673336,0.703894,0.65049,0.43346,0.246456,0.1887,0.2112,0.170433,0.103882,0.098053,0.146384,0.260037,0.399724,0.348667,0.148274,0.074573,0.087634,0.087812,0.064311,0.03878,0.031155,0.068392
0.138371,0.332297,0.442666,0.791873,1.178854,0.996131,0.759352,0.791758,0.709231,0.474877,0.280985,0.209083,0.234191,0.197958,0.126761,0.123086,0.183605,0.311375,0.471942,0.411995,0.176134,0.092736,0.110819,0.108671,0.077353,0.048349,0.040811,0.084275
0.157383,0.366578,0.470852,0.790398,1.180272,1.038177,0.820266,0.791634,0.657738,0.44948,0.275673,0.197423,0.219042,0.195422,0.131137,0.131886,0.199544,0.330896,0.490301,0.41733,0.181084,0.111586,0.132297,0.120306,0.082568,0.055903,0.049665,0.092418
0.157601,0.355163,0.455531,0.734946,1.138767,1.12165,0.942589,0.787843,0.56865,0.389468,0.247043,0.179027,0.204975,0.187066,0.120162,0.119977,0.186253,0.326069,0.472264,0.3758,0.167648,0.129197,0.149001,0.123818,0.082674,0.061883,0.05659,0.098249
0.151285,0.339971,0.458019,0.764726,1.2694,1.422317,1.243514,0.913739,0.561125,0.360877,0.235358,0.180704,0.229296,0.204626,0.113372,0.106954,0.179237,0.362688,0.519385,0.376578,0.16352,0.14011,0.159735,0.129184,0.084535,0.066002,0.06128,0.121524
0.167038,0.400468,0.563521,0.992031,1.770859,2.183024,1.950399,1.315774,0.746615,0.471705,0.29278,0.21746,0.296605,0.26191,0.137468,0.131105,0.234714,0.501936,0.685251,0.453477,0.177542,0.147554,0.173032,0.146952,0.09621,0.07414,0.06965,0.168233
0.212328,0.52135,0.743035,1.399586,2.693109,3.597059,3.406434,2.266225,1.233508,0.786302,0.465344,0.321861,0.417955,0.362309,0.20586,0.19913,0.344128,0.723457,0.929652,0.572089,0.211166,0.179405,0.218862,0.194327,0.128648,0.097612,0.093094,0.244188
0.283287,0.678079,0.940995,1.890227,4.055147,5.895903,5.885153,3.920081,2.079824,1.340518,0.761759,0.483257,0.567334,0.481383,0.315011,0.30247,0.470336,0.949277,1.158517,0.683822,0.250314,0.223758,0.283305,0.254987,0.17115,0.132513,0.128745,0.336328
0.352522,0.821204,1.109566,2.398746,5.902782,9.277736,9.450464,6.199315,3.232128,2.092622,1.150068,0.676004,0.719503,0.604098,0.456314,0.425074,0.559827,1.078347,1.274398,0.734737,0.268158,0.252394,0.333065,0.302764,0.209768,0.170116,0.170598,0.439773
0.409594,0.91308,1.173746,2.776645,7.991244,13.194356,13.231577,8.470964,4.376066,2.810783,1.510666,0.845064,0.845876,0.70465,0.583657,0.533032,0.58747,1.088894,1.285766,0.736167,0.263914,0.25796,0.342827,0.313575,0.23462,0.201519,0.205811,0.522603
0.438776,0.912435,1.098372,2.895581,9.395463,15.676425,15.134214,9.448229,4.879454,3.07559,1.62685,0.902161,0.931105,0.77043,0.624745,0.564997,0.55627,1.069662,1.350538,0.78967,0.262171,0.24416,0.302138,0.278207,0.236946,0.210269,0.213708,0.521319
0.459287,0.891629,0.98503,2.740077,9.12773,14.717279,13.398904,8.158993,4.267146,2.627551,1.368721,0.76835,0.882024,0.737461,0.53576,0.491063,0.498155,0.991939,1.31283,0.788536,0.251368,0.206045,0.227651,0.215128,0.205506,0.180745,0.184223,0.427987
0.485069,0.927447,0.900738,2.322487,7.295507,10.775101,8.833978,5.189946,2.855254,1.739006,0.879224,0.501495,0.683642,0.595868,0.369223,0.355608,0.439651,0.858642,1.139431,0.726945,0.243847,0.159267,0.165453,0.158699,0.147058,0.123763,0.132014,0.306449
0.496016,1.000917,0.904149,1.936196,5.108433,6.426845,4.489855,2.55566,1.539888,0.915155,0.451361,0.283378,0.467295,0.424998,0.223871,0.247214,0.410642,0.749088,0.990817,0.705148,0.26326,0.135151,0.13537,0.120771,0.091656,0.073027,0.091469,0.211557
0.532269,1.187181,1.090089,1.998474,4.201481,4.276532,2.47862,1.336985,0.794784,0.430215,0.229343,0.217053,0.441458,0.403806,0.169047,0.209772,0.436593,0.756658,1.033891,0.816214,0.323797,0.154752,0.15003,0.113,0.068036,0.057007,0.092586,0.219352
0.681173,1.605567,1.519409,2.483944,4.398882,3.808942,2.107396,1.3099,0.758156,0.364492,0.20659,0.240496,0.539531,0.493385,0.183027,0.217922,0.468147,0.830799,1.171157,0.957179,0.40599,0.21347,0.201093,0.134579,0.073812,0.066035,0.121703,0.318089
0.962222,2.223583,2.0514,3.051899,4.756542,3.654287,2.091416,1.566969,0.936944,0.425256,0.240166,0.28052,0.62994,0.577559,0.215909,0.258632,0.522688,0.874891,1.213506,1.007666,0.467749,0.283316,0.250254,0.156895,0.088643,0.080091,0.153453,0.450959
1.199449,2.68127,2.430231,3.425083,4.89184,3.566215,2.211697,1.839512,1.126162,0.484599,0.264,0.292001,0.630499,0.58619,0.2517,0.3406,0.660818,0.950456,1.170649,0.946624,0.473134,0.329311,0.267789,0.157479,0.098235,0.093335,0.17686,0.581355
1.262533,2.769669,2.547124,3.404719,4.586796,3.431574,2.486817,2.223158,1.33396,0.547782,0.281503,0.259435,0.523004,0.502079,0.268577,0.411419,0.797262,1.075183,1.250328,0.979058,0.469127,0.32553,0.240336,0.133908,0.094273,0.100076,0.190391,0.680417
1.131692,2.496184,2.364122,2.902658,3.819685,3.186597,2.785062,2.615207,1.563907,0.671373,0.319417,0.227782,0.437722,0.432889,0.272629,0.431442,0.864686,1.216883,1.393218,1.051735,0.468333,0.276401,0.180621,0.102283,0.080135,0.092964,0.184803,0.736075
0.890455,1.996298,1.957604,2.25064,2.953433,2.789948,2.765738,2.620269,1.598546,0.758532,0.353579,0.218062,0.39383,0.386627,0.269994,0.39583,0.814966,1.298977,1.44722,0.991661,0.430039,0.222468,0.125203,0.075773,0.05993,0.071982,0.156477,0.756665
0.60525,1.358042,1.384677,1.655928,2.276428,2.340755,2.410857,2.185681,1.325574,0.703301,0.339107,0.198887,0.321901,0.302763,0.245325,0.349996,0.694041,1.229151,1.334952,0.807457,0.337209,0.167224,0.090089,0.062115,0.044789,0.048306,0.116871,0.717535
0.34267,0.745716,0.818877,1.244213,1.938653,2.042916,1.970221,1.668463,1.007921,0.567619,0.278001,0.173183,0.258373,0.223631,0.198551,0.296282,0.576041,1.082603,1.129148,0.614657,0.244724,0.11247,0.068888,0.058502,0.042395,0.036163,0.084631,0.602928
0.168685,0.353136,0.480527,1.014017,1.783577,1.852054,1.566318,1.34112,0.909134,0.497919,0.226534,0.157984,0.241595,0.200609,0.157451,0.237617,0.485021,0.952004,0.987511,0.539564,0.213419,0.082204,0.057318,0.057775,0.044501,0.037162,0.072478,0.445641
0.105608,0.225278,0.419246,0.928747,1.643297,1.702058,1.300177,1.097387,0.847201,0.509101,0.221834,0.155133,0.246335,0.203644,0.138739,0.217061,0.426047,0.825599,0.884004,0.499257,0.205289,0.083248,0.05536,0.053347,0.044432,0.045399,0.073813,0.324182
0.112827,0.230598,0.449551,0.975694,1.577085,1.604968,1.267289,0.985962,0.728929,0.467305,0.209057,0.157409,0.249916,0.20401,0.13519,0.207532,0.37426,0.704814,0.749497,0.402212,0.166851,0.084288,0.053345,0.044395,0.039418,0.049266,0.071797,0.291028
0.149227,0.294378,0.481878,0.989313,1.43757,1.411678,1.197059,0.891547,0.59009,0.370767,0.180548,0.171944,0.272886,0.217592,0.132126,0.180117,0.319008,0.675251,0.71167,0.332852,0.133379,0.0871,0.054916,0.036986,0.033007,0.04739,0.070154,0.274039
0.191879,0.366368,0.496231,0.977414,1.390654,1.305018,1.062057,0.754762,0.442589,0.251673,0.153004,0.186538,0.2905,0.223517,0.130756,0.164493,0.285133,0.714852,0.82624,0.401967,0.150094,0.102485,0.066583,0.041087,0.035305,0.045284,0.071851,0.255593
0.228982,0.425134,0.478667,0.986532,1.570314,1.396293,0.957138,0.636867,0.364925,0.212411,0.15557,0.179105,0.264211,0.204705,0.128802,0.166098,0.286743,0.730902,0.88779,0.471495,0.179953,0.116508,0.079949,0.054108,0.04648,0.047396,0.082107,0.236525
0.245399,0.437403,0.48122,1.095994,1.83314,1.59061,0.969974,0.576665,0.366256,0.262603,0.172622,0.149355,0.200738,0.166157,0.120462,0.164767,0.275111,0.639944,0.791114,0.475509,0.208087,0.120089,0.089641,0.072177,0.062865,0.060765,0.106038,0.222238
0.240505,0.401,0.494899,1.228677,1.947334,1.647593,0.977913,0.589148,0.427752,0.33984,0.196041,0.124794,0.15271,0.136202,0.102544,0.14125,0.234893,0.487077,0.622366,0.455223,0.226422,0.107146,0.084876,0.080872,0.072913,0.071137,0.123294,0.215748
0.236502,0.368289,0.459503,1.25838,2.004618,1.544911,0.807637,0.57982,0.487186,0.383465,0.202401,0.118612,0.149108,0.129866,0.092663,0.126022,0.201572,0.400514,0.580303,0.475066,0.230748,0.09084,0.06818,0.070218,0.06682,0.066802,0.116467,0.220115
0.228381,0.354873,0.390217,1.117971,1.925681,1.328883,0.549462,0.488971,0.448566,0.350408,0.188172,0.118639,0.156052,0.134868,0.096955,0.134838,0.184743,0.356026,0.606626,0.525352,0.228495,0.068723,0.044494,0.044594,0.046672,0.049803,0.087192,0.192481
0.202121,0.330077,0.344304,0.901938,1.678087,1.161839,0.43262,0.385507,0.329353,0.255525,0.143837,0.111072,0.158312,0.13758,0.106194,0.14166,0.195962,0.357091,0.622361,0.587193,0.247065,0.056923,0.027582,0.021167,0.029569,0.039947,0.061693,0.15153
0.169677,0.293344,0.307995,0.792724,1.443699,1.050288,0.450688,0.342483,0.276567,0.206356,0.101928,0.0959,0.159901,0.144913,0.11598,0.151005,0.21897,0.34106,0.561762,0.590019,0.275352,0.063383,0.0228,0.015216,0.026071,0.037075,0.05151,0.139248
0.143893,0.246161,0.248584,0.717766,1.194946,0.856164,0.454278,0.334177,0.273786,0.21485,0.095415,0.074635,0.148947,0.142293,0.109019,0.145104,0.219187,0.293172,0.429774,0.496087,0.26471,0.065742,0.023357,0.017203,0.027026,0.03388,0.04668,0.126768
0.132758,0.208633,0.186121,0.575323,0.95107,0.666625,0.436719,0.327172,0.240407,0.210383,0.107845,0.063145,0.128752,0.12331,0.083574,0.113498,0.187921,0.267953,0.326508,0.361243,0.209175,0.056237,0.023439,0.020766,0.032128,0.032373,0.037754,0.104267
0.121748,0.191964,0.145498,0.4902,0.969116,0.741069,0.486796,0.381439,0.219311,0.180752,0.11761,0.076468,0.136372,0.113874,0.068279,0.083692,0.140714,0.246872,0.303518,0.278933,0.145755,0.045609,0.024811,0.025053,0.036425,0.029729,0.030496,0.092932
0.117461,0.181352,0.122354,0.535764,1.118812,0.863551,0.536312,0.436093,0.222106,0.141637,0.113705,0.094078,0.164543,0.134345,0.080901,0.089684,0.119643,0.215181,0.253942,0.230482,0.128755,0.043264,0.028741,0.031901,0.040649,0.029885,0.032084,0.086287
