-0.007181,-0.007366,-0.007768,-0.005548,-0.00536,-0.006659,-0.006179,-0.007762,-0.011434,-0.010701,-0.01122,-0.008334,-0.008924,-0.012267,-0.009268,-0.007421,-0.009916,-0.008534,-0.009099,-0.008989,-0.010533,-0.008088,-0.007732,-0.00757,-0.009019,-0.009608,-0.008189,-0.0107
-0.003907,-0.001496,-0.002552,-0.004017,-0.003585,-0.003629,-0.002281,-0.00163,-0.006838,-0.00558,-0.003818,-0.002638,-0.002955,-0.004805,-0.000774,-4.6e-05,7e-06,0.001483,-0.001675,-0.001944,-0.00372,-0.002244,-0.003306,-0.004078,-0.006121,-0.00399,4.9e-05,0.004172
-0.001147,-0.000403,5.9e-05,-0.000631,-0.000537,0.000225,-0.00068,0.000326,0.001173,0.000228,0.000489,-0.000927,7.9e-05,-0.000592,0.000647,0.000143,0.00081,0.000682,0.001106,0.001262,0.000701,-9.1e-05,-0.000163,0.000555,0.001486,0.002072,0.001011,0.001085
-0.000668,-0.001904,-0.000334,0.001129,-0.000305,0.000307,-0.0015,-0.001678,0.004878,0.003375,0.000176,-0.001463,0.000335,0.001286,-0.001397,-0.0021,-0.002553,-0.003788,0.000628,0.001056,0.001551,-0.001583,0.000243,0.002497,0.00453,0.001432,-0.002245,-0.006709
0.003407,0.00412,0.004654,0.00296,0.001199,0.001548,0.001596,0.001514,0.004212,0.005478,0.003955,0.003774,0.004612,0.008533,0.004795,0.003627,0.004503,0.003924,0.004576,0.004931,0.006233,0.002452,0.002771,0.003388,0.002232,7e-06,0.002576,0.005621
0.001615,0.002201,0.002547,0.000581,0.000367,-0.000588,-0.000545,-0.000431,-0.004221,-0.002591,-0.00072,0.001066,3e-06,0.000765,0.000631,0.000395,0.000903,0.002118,-0.000791,-0.000531,3.8e-05,0.000129,-0.000682,-0.00165,-0.004405,-0.003798,0.000443,0.003739
-0.003767,-0.005562,-0.005859,-0.003518,-0.002472,-0.004186,-0.004568,-0.003852,-0.007389,-0.00829,-0.006674,-0.00471,-0.006559,-0.0108,-0.007504,-0.005702,-0.00762,-0.006848,-0.007662,-0.008465,-0.009654,-0.004815,-0.004119,-0.005078,-0.005709,-0.003511,-0.005013,-0.009328
0.000423,-3e-05,-0.002771,-0.001384,-0.000443,-0.000316,0.00123,0.002875,0.002435,0.000853,0.002214,0.001513,0.001055,-0.000388,0.001668,0.002424,0.001589,-0.000276,0.000215,-0.000493,-0.001227,0.001897,0.001559,0.000524,0.002341,0.005027,0.001823,0.001528
0.004608,0.005337,0.003751,0.002155,0.002088,0.004095,0.005612,0.005365,0.006267,0.005916,0.007223,0.005037,0.006228,0.008646,0.006858,0.005121,0.006874,0.005146,0.005417,0.006983,0.00833,0.006171,0.003839,0.003743,0.006356,0.005997,0.004759,0.008225
-0.00094,-0.001639,0.000549,0.000834,9.8e-05,0.001481,0.000729,-0.001936,-0.000264,0.000523,-0.001535,-0.001849,-0.00092,0.000536,-0.003329,-0.004422,-0.003255,-0.002329,-0.001182,0.000795,0.00203,-0.000817,-0.000544,0.00108,0.001704,-0.002647,-0.003134,-0.006229
-0.003557,-0.003189,-0.001228,-0.000869,-0.001599,-0.001131,-0.00116,-0.001963,-0.001626,-0.000958,-0.003409,-0.00312,-0.003177,-0.002147,-0.003474,-0.003345,-0.003729,-0.00226,-0.002116,-0.00244,-0.00322,-0.003146,-0.000567,0.000119,-0.002355,-0.003855,-0.002987,-0.004944
2e-04,0.001556,0.001418,-0.000634,-0.000371,-0.000694,0.000277,0.00197,-0.000218,-0.000772,-0.00011,-0.000537,-0.000497,-0.000262,0.003057,0.003081,0.002591,0.003141,0.00072,-0.000638,-0.0018,-0.000452,0.000323,-0.000672,-0.002827,0.001159,0.002429,0.006043
-0.000158,-0.001654,-0.001643,-0.001149,2.5e-05,-0.00189,-0.002859,-0.002417,-0.00281,-0.003441,-0.003703,-0.002927,-0.002677,-0.005855,-0.002041,-0.000587,-0.001162,-0.000885,-0.001718,-0.002741,-0.003375,-0.002373,-0.002568,-0.002884,-0.002033,8.8e-05,-0.000695,-0.001663
-0.000741,-0.002116,-0.002843,-0.000412,0.000176,-0.001348,-0.002943,-0.00405,-0.001345,-0.00022,-0.001444,-0.000123,-2.3e-05,-0.002396,-0.002853,-0.001056,-0.001631,-0.002224,0.00058,0.000336,-0.000157,-0.000991,-0.00158,-0.001021,0.000804,-0.002115,-0.002406,-0.004363
0.002527,0.004642,0.003194,0.001795,0.001046,0.002498,0.002195,0.001892,0.002751,0.0042,0.006191,0.005107,0.005426,0.008268,0.00464,0.003243,0.003931,0.002896,0.004364,0.005532,0.006638,0.004175,0.002118,0.00221,0.002626,0.000261,0.001969,0.00577
0.00128,0.002503,0.003504,0.00113,0.000313,0.002611,0.0021,0.002838,0.002119,0.00161,0.003358,0.001496,0.001074,0.004168,0.001684,-0.00056,0.000687,0.001119,-0.000394,0.000227,0.00192,0.001933,0.001552,0.001315,0.000158,0.001312,0.001656,0.00161
-0.002414,-0.003311,-0.002435,-0.001256,-0.000952,-0.001314,-0.001116,-0.000368,-0.000254,-0.001777,-0.002617,-0.001944,-0.003916,-0.004239,-0.00317,-0.002542,-0.002969,-0.002626,-0.003472,-0.00477,-0.005914,-0.002478,-0.000171,-0.00086,-0.002234,0.000391,-0.000912,-0.004995
-0.000506,-0.000174,-0.00247,-0.001012,-0.000706,-0.002763,-0.00012,0.000172,-0.001936,-0.002163,-0.001388,0.000628,-0.000321,-0.001777,0.001606,0.002694,0.001173,0.000158,4e-06,-0.00057,-0.002415,-0.000938,-0.000268,-0.001041,-0.00076,0.000977,0.000789,0.002579
0.001357,0.00121,0.000716,0.000839,0.000547,-0.000458,0.00101,0.000785,-0.002128,-0.001217,-0.000589,0.000297,0.001577,-0.000773,0.001043,0.001234,0.001015,0.001486,0.001382,0.002144,0.003301,0.000844,-0.000458,0.000254,0.001998,0.000265,0.000704,0.002677
