3.3e-05,6.4e-05,2.6e-05,0.000142,4e-04,0.000355,0.000257,0.000143,0.000579,0.000285,-0.000116,-9.5e-05,4.3e-05,0.000146,0.000202,0.00019,0.000328,0.000365,0.000492,0.000433,0.000261,7.4e-05,0.000222,0.000313,0.00032,7.4e-05,0.000246,0.000267,0.000174,0.00025,0.000165,0.000113,0.000284,0.000225,0.000305,0.000115,-4.6e-05,0.000326,0.000379,0.000335,0.000146,8e-05,0.000228,0.000208,0.000185,0.00011,0.000114,0.00032,0.000255,0.000328,0.000149,5.4e-05,0.000221,0.000252,0.000272,1.2e-05,0.000109,0.000256,0.000138,0.000162,-0.013382,-0.01258,-0.007372,-0.004126,-0.002334,-0.001539,-0.000701,-0.000878,-0.00248,-0.00185,0.000373,-0.000921,-5.2e-05,-0.000917,-0.000597,-8.9e-05,-0.000664,-0.001153,-0.000309,-0.000157,-0.000337,-8.4e-05,6.7e-05,-0.000135,-0.000128,-0.000417,1.8e-05,0.00029,4.6e-05,-7e-06,-0.000148,0.000192,0.000127,0.000544,8.2e-05,1.3e-05,4.2e-05,0.000211,0.000258,6.6e-05,-3.6e-05,0.000357,0.00025,0.000158,0.000208,0.000232,0.000205,0.000246,0.000235,0.000149,0.000213,0.000361,0.00011,-4.7e-05,-1.8e-05,2e-05,0.000294,0.000144,-9.8e-05,0.000222,0.000252
-7.1e-05,2.6e-05,-8.2e-05,0.000105,9.6e-05,7.3e-05,0.000114,5.6e-05,0.000211,9.8e-05,0.000179,0.000131,0.000102,0.000117,0.000191,-3.4e-05,-4.1e-05,6e-06,2.1e-05,0.000252,0.000166,5.6e-05,0.000298,0.000101,3e-04,0.000138,-0.000108,4.5e-05,0.000114,0.000258,0.000113,7.3e-05,0.000171,3.6e-05,0.00014,1.6e-05,2.2e-05,0.000233,0.000137,0.000157,5.7e-05,-7.2e-05,0.000171,0.000222,0.000205,0.000114,-4.7e-05,0.000112,0.000116,0.000292,0.000139,-0.000137,8.6e-05,0.000161,7.1e-05,1.3e-05,0.000166,0.000463,0.000296,0.000128,0.004597,0.004079,0.001334,0.001823,0.001845,0.000733,-0.000232,-0.001012,-9.2e-05,0.000251,-1e-04,0.000283,0.000471,0.000964,0.00065,-4e-05,0.000536,0.00042,-0.000636,-0.000188,0.000786,-0.000431,0.000281,0.00016,-0.000298,0.000369,0.000353,7.4e-05,0.000509,4e-04,3.4e-05,0.00065,0.000161,0.000395,0.000364,0.000194,0.000223,0.000235,0.000134,-0.000391,-6.5e-05,0.00015,6e-06,9e-05,7.4e-05,0.000129,0.000258,0.000131,5.8e-05,-0.000133,-8.1e-05,0.000278,0.000193,0.000135,4.2e-05,2.8e-05,0.000199,0.000193,0.000149,0.000145,7.3e-05
1e-05,0.000149,-0.000152,0.000108,0.000182,-6e-06,0.00011,0.000166,-4e-05,0.000195,5.1e-05,1.5e-05,5.8e-05,3.7e-05,0.000128,-4e-05,-9.7e-05,-6.1e-05,-1.9e-05,0.000259,1e-05,3.4e-05,0.000108,6.9e-05,0.000182,9.6e-05,-9.9e-05,6e-06,1.9e-05,4.4e-05,-8.1e-05,-2e-04,4.4e-05,-2.9e-05,0.000134,4.1e-05,-4.9e-05,0.000103,-9e-05,1.2e-05,-1.9e-05,-0.000166,5.2e-05,-1.9e-05,0.000147,1e-05,-0.000148,0.000135,6.6e-05,0.000193,7.1e-05,-1.2e-05,3.7e-05,-0.00012,4e-06,-8.6e-05,-0.000213,2.3e-05,0.000155,-1.1e-05,-0.002428,0.000208,-0.001963,-0.002561,-0.003442,-0.001057,-0.000843,0.000162,0.000239,0.000551,-0.000487,-0.001236,-0.000702,-0.001241,-0.000427,-0.000568,-0.000884,-0.000149,-0.000357,5.5e-05,-5e-06,0.000399,4.8e-05,-0.000447,-0.000563,-0.000728,-0.000176,-0.000524,-0.000344,-0.000497,-0.000416,-0.000495,-0.000318,-0.000215,-0.000162,-0.000203,-0.000221,-0.000163,8.7e-05,3.3e-05,-5.8e-05,6e-06,-7e-05,-7e-05,-0.000182,-8.7e-05,6.5e-05,-2e-05,-2e-06,-5.1e-05,-1.9e-05,2.1e-05,7e-06,-7.9e-05,-2e-06,-1.1e-05,-1e-04,-0.000145,-9.3e-05,-4e-06,5.1e-05
0.000343,0.000193,0.000145,-5.7e-05,2.4e-05,-0.000138,0.000215,4.3e-05,-6.2e-05,1.7e-05,0.000165,9.8e-05,7.3e-05,6e-06,0.000105,0.000132,0.000118,0.00016,4.4e-05,0.000163,-5.2e-05,4.1e-05,9.2e-05,2.2e-05,0.00017,3.5e-05,5.8e-05,0.000148,-3e-06,9.4e-05,-1.5e-05,-4.2e-05,0.000137,1e-04,0.000152,5e-05,4.3e-05,0.000153,-4.9e-05,8.5e-05,5e-06,-8.4e-05,6.1e-05,-8.9e-05,8.4e-05,4e-05,-4.6e-05,1.9e-05,-1.5e-05,6.8e-05,-1e-06,3e-05,5.4e-05,-0.000137,1e-06,9e-06,-3.4e-05,2.9e-05,9e-05,-4.3e-05,-0.000171,-0.001401,0.002165,0.000253,-0.000216,-0.000235,-0.000344,-0.000917,-0.00058,-4.3e-05,-0.00098,-6.7e-05,-0.000764,-0.000189,1.8e-05,6.3e-05,-0.000523,-0.000512,-0.000667,-0.000165,-0.000436,-0.000563,-0.000846,-0.000129,6.9e-05,-5.2e-05,-0.00026,-0.000127,-5.8e-05,4.1e-05,-2e-04,6.1e-05,9.9e-05,0.00011,4e-05,2.6e-05,6.2e-05,-0.000103,-0.000228,0.000156,0.00012,-5.5e-05,-0.000173,5.2e-05,-9.7e-05,-7.9e-05,9.5e-05,-2.6e-05,5.5e-05,4.5e-05,-1.1e-05,4e-06,-7.6e-05,-4e-06,5.3e-05,5.5e-05,-8.2e-05,0.000121,4e-05,-3.3e-05,0.000101
-0.000101,-0.000164,0.00011,0.000132,0.000172,-8.5e-05,6.1e-05,1e-06,-0.000128,6.8e-05,-5.4e-05,6e-06,6.9e-05,-7.9e-05,2.8e-05,-1.4e-05,0.00013,0.000155,-6.8e-05,0.000136,-7.9e-05,0,2.4e-05,-7.1e-05,7.2e-05,9.4e-05,0.000153,0.000157,-8.9e-05,2.4e-05,4.1e-05,1.7e-05,6e-05,-2.7e-05,0.000111,0.000105,3.8e-05,-1.6e-05,-0.000114,0.000101,0.000121,0.000151,0.000108,2e-05,8.6e-05,6.3e-05,4e-06,9.9e-05,9.5e-05,6.8e-05,6.7e-05,7.7e-05,9.8e-05,5e-05,0.000139,0.000205,0,8e-06,1.2e-05,2.9e-05,0.000312,-0.002547,-0.002955,-0.002493,-0.002393,-0.000571,0.000703,0.000402,-0.001039,-0.001041,-0.001164,-0.00047,-0.000207,-0.000288,-0.000696,-0.0012,-0.000474,-0.000234,0.000541,8.4e-05,1.1e-05,0.000269,0.000156,-0.000316,-0.00058,-0.000439,-7.3e-05,0.000177,-0.000151,-0.000191,0.00017,-5.8e-05,0.000142,6.7e-05,1.6e-05,-4.3e-05,0.000202,-0.000123,-0.000175,0.000135,-9.9e-05,1e-06,7.6e-05,0.000155,0.000167,-0.00011,2.2e-05,-3.1e-05,-9e-06,5.9e-05,-2.3e-05,-9.7e-05,0,8e-05,0.000121,0.000108,-1.5e-05,3e-06,1e-06,5.1e-05,7.1e-05
-3.9e-05,0.000158,-7e-06,-0.000144,0.000139,2.2e-05,2.1e-05,7.3e-05,-8.6e-05,1.5e-05,-1.2e-05,1e-06,9.8e-05,-6.4e-05,-8.3e-05,-5.6e-05,5.8e-05,5.3e-05,-2.6e-05,7.8e-05,2.5e-05,5.8e-05,6.4e-05,-9.7e-05,-1.5e-05,-8.1e-05,1.7e-05,1e-05,-7e-06,-2e-05,2.9e-05,0.000145,3e-06,-4.1e-05,3e-05,-4e-05,4.1e-05,1e-05,4e-06,0.000111,-1.1e-05,7e-06,9.7e-05,-3.6e-05,-0.000139,5.9e-05,8.5e-05,1.2e-05,-9.3e-05,-8.6e-05,-5.5e-05,-4e-06,2.9e-05,-1.2e-05,8.6e-05,-2.7e-05,0.000147,-8.6e-05,-1.2e-05,-7.2e-05,-0.000364,0.002081,-3e-04,0.000677,0.001973,-0.000146,-0.000105,0.000559,0.001282,0.000444,0.000266,-4.2e-05,5.9e-05,0.000415,0.000322,0.000339,0.000142,-3.1e-05,0.000147,0.000534,-0.000413,-8e-05,7.6e-05,0.000112,0.000391,0.00059,-0.000236,0.000353,-0.000167,7.3e-05,0.000125,0.000286,-0.000225,0.000191,-0.00011,0.000183,0.000207,-9.8e-05,-0.000126,0.000125,8.7e-05,-2.8e-05,2e-05,5e-06,9.2e-05,-6.6e-05,2.2e-05,-2.4e-05,-4e-05,1.7e-05,-1.1e-05,-5.8e-05,1e-06,1e-06,0.000103,5.6e-05,2.7e-05,-3.4e-05,5e-05,6.4e-05,-4.9e-05
-2.6e-05,6.2e-05,4.6e-05,-0.000151,1.2e-05,-3.4e-05,-6.9e-05,3.9e-05,1e-06,-0.000139,2e-06,7.3e-05,-2e-06,-3.7e-05,8e-06,-6.3e-05,-0.000108,5.2e-05,-0.000125,-9e-05,-5.4e-05,2.7e-05,2e-05,-4.1e-05,-4.3e-05,-0.000111,7.1e-05,-3.9e-05,-7.2e-05,-5.5e-05,-2.6e-05,4e-05,-3e-06,-0.000125,-0.000101,-3.1e-05,-3.2e-05,-6.8e-05,-0.000116,-6.4e-05,-9e-05,4e-05,-3.4e-05,4.2e-05,-4.6e-05,-4.4e-05,-7e-06,-7.3e-05,-2.7e-05,-4e-05,4.7e-05,-3.2e-05,-0.000101,-3.6e-05,-4.3e-05,-0.000106,-3.2e-05,-0.000156,-4.5e-05,-8.6e-05,-5.9e-05,-0.001621,-0.000194,0.001496,-0.000445,-0.001098,0.000184,-0.000831,-0.00025,0.000248,0.000362,0.000205,2.1e-05,0.000451,-4.7e-05,0.000169,0.000141,-0.000562,-0.00018,-0.000317,7e-05,0.000297,-0.000119,-0.000145,0.000113,0.000148,-0.00013,-0.000258,3.5e-05,-6e-06,0.000117,4.4e-05,-9e-05,2.8e-05,-0.000243,-9.9e-05,2.2e-05,0.000141,-0.000123,-2.8e-05,-4.6e-05,-1.7e-05,-8.7e-05,-1.2e-05,-2e-05,-4.5e-05,-0.000103,-2.7e-05,-6.9e-05,-7.8e-05,2e-06,-4e-05,2.9e-05,2.6e-05,-1.5e-05,-3.7e-05,-2e-05,-0.000138,-8.4e-05,-4.3e-05,-4.6e-05
-0.000132,-5.6e-05,5.5e-05,-2.3e-05,1.1e-05,-6.8e-05,-6.9e-05,7.7e-05,-1.4e-05,-0.000122,-0.000175,-3.6e-05,0,-5e-06,-6.1e-05,-4.6e-05,-1.4e-05,-2.1e-05,-0.000124,-0.000112,-9e-05,2e-06,-4.5e-05,-0.000145,-3.5e-05,-8.5e-05,-4.9e-05,-4e-06,-5.3e-05,-4.9e-05,-9.2e-05,-5.4e-05,-8.3e-05,-5.3e-05,-8.5e-05,1.9e-05,-1.9e-05,-1.4e-05,-0.00011,-0.000123,-6.2e-05,-3.7e-05,-0.000107,-6.9e-05,-5.1e-05,-2.4e-05,2e-05,-8.2e-05,-4.1e-05,-8.9e-05,1.2e-05,-2.6e-05,-1e-05,-0.000108,-8.8e-05,-5.9e-05,-1.2e-05,-7.9e-05,-5.6e-05,-5.5e-05,2.1e-05,0.000298,-0.000847,-0.001922,0.000491,0.000265,-0.00068,0.000167,0.000752,1.7e-05,4.9e-05,0.000651,0.000121,7.6e-05,0.00034,8.7e-05,-2.4e-05,0.000364,0.000206,0.000185,-0.000185,0.000173,0.000445,0.00037,0.000151,-6.9e-05,7.7e-05,-5.4e-05,-0.000112,9.1e-05,-0.00018,-0.000115,-0.000161,-0.000167,-7e-05,8.5e-05,6e-05,2e-05,-0.000101,4.9e-05,-2.6e-05,-5.2e-05,-5.8e-05,-5e-05,1.9e-05,-2.6e-05,-7.3e-05,-0.000131,-0.00012,-2.4e-05,-3.1e-05,-7.2e-05,5.5e-05,-2.8e-05,-1.8e-05,2.4e-05,-5e-05,-9.2e-05,-3e-05,2.5e-05,-5e-06
-0.000103,2.7e-05,-7.5e-05,5.3e-05,1.1e-05,-3.1e-05,4e-06,7.9e-05,-4.6e-05,-1.2e-05,-0.000112,5.3e-05,1e-05,-1.3e-05,1.6e-05,-6.1e-05,8e-06,5.2e-05,-4e-05,-1.2e-05,-1.5e-05,-2e-06,7.3e-05,-7.7e-05,-5.9e-05,-6.5e-05,-1e-06,2e-05,-2.5e-05,-1.3e-05,-5.7e-05,1e-06,1.3e-05,-1.1e-05,-1.4e-05,2e-06,-2e-06,3.8e-05,-6e-05,-4.5e-05,4e-06,9e-06,-2.4e-05,-4.3e-05,-3e-05,-5.2e-05,-2.8e-05,6e-06,1.9e-05,-5.3e-05,-5e-06,2.1e-05,4.5e-05,-5.2e-05,-9.1e-05,-2.2e-05,-2e-05,3.7e-05,-3.7e-05,-5.1e-05,-0.000253,0.000603,0.001438,0.000812,0.000205,0.00055,0.000449,-0.000285,-1.4e-05,-0.000233,0.000199,-3.4e-05,0.000195,-1.1e-05,-2.4e-05,2.8e-05,0.000365,0.000306,0.000116,-9.5e-05,0.000239,3.3e-05,-0.000423,0.000114,-2.1e-05,-0.000108,1.9e-05,-9.8e-05,0.000116,0.00027,0.000153,-2.2e-05,2.9e-05,2.4e-05,-7.9e-05,5.3e-05,-8e-05,-5.6e-05,4.2e-05,4.2e-05,-0.000113,-2.2e-05,-3.9e-05,5.3e-05,4.9e-05,1.5e-05,-5e-06,-8.3e-05,2e-05,2e-06,4e-06,-9e-06,8e-06,-4.7e-05,2.5e-05,9.5e-05,-2e-06,-2e-06,-6e-05,-1.7e-05,-2e-06
-2.4e-05,9.7e-05,7.2e-05,1.4e-05,-2e-06,-3.4e-05,-2e-05,5.2e-05,1.3e-05,4e-05,-6.1e-05,3.6e-05,-7e-06,-6.5e-05,-4.2e-05,-7.7e-05,-4e-05,1.3e-05,5.8e-05,-1.5e-05,-3.1e-05,-3.3e-05,-1.9e-05,-3.6e-05,-7e-06,-3.7e-05,2.9e-05,3.9e-05,-3.2e-05,-2.5e-05,-6.3e-05,-2.1e-05,3.7e-05,-5.6e-05,-3.3e-05,1.3e-05,5.4e-05,-1.6e-05,-1.8e-05,-6.8e-05,-2.2e-05,3e-05,1.1e-05,-4.6e-05,-2e-05,-4e-06,-1.9e-05,4e-06,6e-06,-5e-05,-1.3e-05,-1e-06,-1.6e-05,-1e-05,-4.3e-05,7e-06,0.000109,2.5e-05,-9e-06,-4.9e-05,-0.000102,-0.000715,-6.1e-05,0.000377,4.3e-05,0.00027,-0.000196,0.000185,-0.000278,0.00037,0.000244,-0.000322,-0.000129,-0.000112,-0.000302,-7.3e-05,-7.1e-05,5.8e-05,-4.3e-05,-0.000164,4.6e-05,0.000101,-8.3e-05,-3.8e-05,2e-05,-2.7e-05,0.000242,-0.000196,-5.2e-05,0.000122,-0.000118,-8.6e-05,9.2e-05,-9e-06,3.6e-05,-4e-06,-1.4e-05,-8.3e-05,5.1e-05,1.3e-05,-1e-05,0,-5.1e-05,9.2e-05,6e-05,2.4e-05,5e-06,-4.1e-05,1.5e-05,-2.3e-05,1.5e-05,5.2e-05,3.2e-05,-7.3e-05,-1.2e-05,1.4e-05,-3e-06,1.9e-05,3e-06,4.2e-05,5.2e-05
-5e-05,2.7e-05,8e-06,-6.4e-05,-5e-06,-3.2e-05,-6.4e-05,5e-06,-3.1e-05,3e-06,-3.7e-05,-2.7e-05,7.3e-05,-2.9e-05,-3e-06,-7e-06,-5.5e-05,-9e-06,-1.3e-05,-1.4e-05,1.9e-05,-4.7e-05,1.3e-05,-2e-05,-3.6e-05,-2.5e-05,-2.8e-05,5.2e-05,-3.8e-05,-4e-06,-1.5e-05,-1.5e-05,5.3e-05,-3.1e-05,-7e-06,-1.1e-05,-5e-06,2.3e-05,4e-06,-3.2e-05,-1.9e-05,-1.5e-05,6.3e-05,1e-05,-5.3e-05,-1.9e-05,6e-06,2.5e-05,-8.1e-05,-3.7e-05,1e-05,3e-05,1.4e-05,1.1e-05,-2.3e-05,-8e-06,2.1e-05,2.4e-05,-1e-05,-2.7e-05,1.2e-05,0.00045,0.000288,0.001139,1.7e-05,2.9e-05,-0.00049,-0.000125,-0.000128,-0.000535,-0.000166,-6.2e-05,-0.000429,-5.4e-05,-0.000277,-5.8e-05,-8.9e-05,0.000111,-0.000112,0.000173,-0.000263,-7.5e-05,4.1e-05,-1.8e-05,-8.3e-05,-0.000113,-9.9e-05,-0.000158,-9.6e-05,4.4e-05,4.2e-05,5.7e-05,3e-05,-5.4e-05,-4.4e-05,-6.4e-05,2e-05,-2.7e-05,-1.8e-05,-1.5e-05,-1e-06,2.7e-05,-5e-06,1.4e-05,-6e-06,-5.9e-05,3.1e-05,-6.1e-05,-2.1e-05,0,3.8e-05,8e-06,4e-06,-2.6e-05,-1.1e-05,1e-05,-1.7e-05,1.9e-05,-1.1e-05,2.5e-05,-1e-05
1.3e-05,-7.1e-05,-6.1e-05,-1.3e-05,-9.9e-05,-2.6e-05,-4.5e-05,2.1e-05,-3.5e-05,8e-06,3e-05,-9e-06,-3.8e-05,-1.4e-05,1.3e-05,-2.8e-05,-6e-06,7e-06,-9.9e-05,-1.7e-05,1.4e-05,-4e-05,2.5e-05,-2e-05,-2.2e-05,-1.4e-05,-4e-05,-1.7e-05,-2.9e-05,-6e-06,-2.3e-05,-3.1e-05,-1.2e-05,-3.5e-05,-3.3e-05,-2.5e-05,-8e-06,-1.9e-05,-1.5e-05,-1e-05,-4.8e-05,-4.7e-05,2e-06,6e-06,-1.1e-05,-2.6e-05,-1.2e-05,2e-06,1.5e-05,-1.9e-05,1.7e-05,1.8e-05,-2e-06,-1e-06,-2.6e-05,-3.7e-05,-2e-05,-2.8e-05,2.1e-05,8e-06,-9.3e-05,-0.000224,-0.000217,-0.001053,-0.000384,-0.000166,-0.000239,0.000147,1.7e-05,6.1e-05,0.000104,0.000309,-0.000129,-0.000119,1.1e-05,5.3e-05,-6e-05,-1.1e-05,-0.000214,-0.000185,-9e-05,-1.1e-05,-0.000173,-0.000162,-2.1e-05,-2.3e-05,-0.000156,-0.000109,-0.000174,-4.7e-05,-8.4e-05,-2.9e-05,-3.4e-05,-8.7e-05,-2.7e-05,-0.000126,-1.2e-05,-1.9e-05,-1.6e-05,1.8e-05,1.5e-05,2.8e-05,-2.6e-05,-5.2e-05,-1.6e-05,-3.5e-05,0,-4e-05,-3.4e-05,-1.3e-05,2.7e-05,-4.2e-05,0,-3.1e-05,6e-06,-1.7e-05,-2.8e-05,6e-06,-3.5e-05,9e-06,-1.3e-05
-2.6e-05,-2.9e-05,3e-05,-3.4e-05,-3.4e-05,-1.9e-05,1.5e-05,1.7e-05,-2.6e-05,2.4e-05,-4.5e-05,-4.9e-05,2.3e-05,-5e-06,-8e-06,9e-06,-1.7e-05,-1.1e-05,-3.7e-05,2e-06,-6e-06,-3.6e-05,7e-06,-1e-05,-1.7e-05,-1e-06,-5.2e-05,6e-06,3.3e-05,-2.9e-05,-1.9e-05,-2.9e-05,-1.1e-05,7e-06,4e-06,1e-05,1.2e-05,-1.9e-05,-9e-06,0,-4.5e-05,-2.1e-05,0,5e-06,-1.5e-05,1.8e-05,-2.5e-05,-6e-06,2e-05,-9e-06,-1.8e-05,2.2e-05,-1.2e-05,-1.5e-05,-4e-06,-2.2e-05,1.2e-05,-3.9e-05,6e-06,-3.9e-05,-5e-05,4.9e-05,4.4e-05,0.000548,0.000706,-1.4e-05,0.000214,-0.000235,3.3e-05,2.9e-05,-0.00017,-0.000462,4.9e-05,-2.4e-05,-2.2e-05,-5.7e-05,0.000102,-0.00012,-5.3e-05,9.1e-05,8.9e-05,-7e-05,-6.5e-05,0.000132,-0.000138,-4e-06,-5.8e-05,2e-06,0.000136,6e-06,-1.5e-05,4e-05,-6.7e-05,-7e-05,-7.7e-05,-4.7e-05,1.6e-05,2.5e-05,-2.3e-05,0,-3e-05,-0.000142,0,-6.3e-05,1.7e-05,-1.3e-05,-2.4e-05,-1.1e-05,-1.8e-05,-1.2e-05,7e-06,-8e-06,-1.7e-05,-2.3e-05,-1.6e-05,-6e-06,-1e-05,-1.2e-05,-3.1e-05,-2.7e-05,1.1e-05
-3.1e-05,-1.6e-05,2.8e-05,-3.5e-05,2.7e-05,-8e-06,-1.4e-05,-1e-05,-3.2e-05,-2.3e-05,-2.7e-05,-2.3e-05,2e-05,-5e-06,-8e-06,-1e-05,-2.5e-05,-1e-05,-1.2e-05,-1.1e-05,-7e-06,-2.5e-05,-3e-06,-3.8e-05,-1e-06,-7e-06,-3.6e-05,-1.2e-05,-4e-06,1e-06,9e-06,-2.4e-05,-2.8e-05,2e-06,-1.4e-05,-6e-06,-6e-06,5e-06,-1.9e-05,1e-06,4e-06,-2.2e-05,-1.5e-05,0,0,1.4e-05,-3.2e-05,-2.3e-05,5e-06,-1.2e-05,1e-06,-1.2e-05,-1e-05,-4e-06,-5e-06,-1e-05,-4e-06,-2e-05,1.8e-05,1.5e-05,3.2e-05,4.7e-05,0.000241,-0.000376,-0.000371,-0.000193,-3.5e-05,0.00021,-9.5e-05,-8.4e-05,0.000156,0.000297,0.000176,2.3e-05,0.000109,6.5e-05,-5.2e-05,2.4e-05,6.6e-05,4.4e-05,6.6e-05,-0.000124,1.9e-05,5e-05,2.6e-05,6e-06,6.7e-05,-7e-06,-5.4e-05,1.3e-05,-1.3e-05,-1.1e-05,-1.4e-05,8e-06,1.6e-05,-6.3e-05,1.2e-05,-1.5e-05,-2.4e-05,-2.4e-05,-3.3e-05,5e-05,-2.7e-05,-5.2e-05,-2e-06,6e-06,-1e-05,-1.1e-05,9e-06,1e-05,-1e-05,1.9e-05,0,-9e-06,-6e-06,3e-06,-2e-05,-1.9e-05,5e-06,-2.1e-05,-1.6e-05
1e-05,-1.7e-05,-2e-05,1.1e-05,1.3e-05,-6e-06,2.1e-05,-2.9e-05,-1e-05,-2.8e-05,-1e-05,-1.4e-05,1.6e-05,1e-06,-1e-05,4e-06,-4e-06,-7e-06,-1e-06,4e-06,8e-06,-1e-05,-1.1e-05,-2.5e-05,5e-06,-7e-06,-1.9e-05,-2e-05,-3.3e-05,4e-06,9e-06,-3.3e-05,-1.1e-05,1.7e-05,-6e-06,3e-06,-9e-06,2e-06,-9e-06,9e-06,9e-06,-1.9e-05,-1.9e-05,1e-06,4e-06,1.5e-05,-1.8e-05,-1.1e-05,2e-06,1e-06,-1e-05,-7e-06,-3e-06,-1e-06,7e-06,8e-06,1e-05,1.6e-05,-5e-06,-1.5e-05,-3.9e-05,-0.000174,-4e-05,0.000443,-0.000256,7.5e-05,0.000238,-3.4e-05,-0.000122,0.000115,-5e-06,-0.000167,-2.2e-05,-4.6e-05,-3.5e-05,2.6e-05,1.5e-05,5.8e-05,7e-06,2.4e-05,-1e-06,2.5e-05,9e-06,-6.8e-05,-3.5e-05,3.1e-05,8e-06,7.1e-05,3.7e-05,3.5e-05,1e-06,1.4e-05,-1.1e-05,-3e-06,-3.7e-05,-1e-05,2.2e-05,-9e-06,8e-06,-4e-06,-2.2e-05,4.7e-05,6e-06,-4.3e-05,1.6e-05,-1.4e-05,-6e-06,7e-06,-2e-06,1e-06,1.1e-05,1.2e-05,-5e-06,6e-06,-9e-06,1.5e-05,5e-06,-6e-06,-1e-06,-1.2e-05,1.3e-05
-6e-06,-2e-05,3e-06,2.1e-05,-1e-05,0,2e-06,-3.2e-05,-1e-05,-2e-06,-3e-06,-8e-06,-1.5e-05,-3.4e-05,3e-06,0,1e-05,-7e-06,-1.5e-05,1e-06,0,-5e-06,-1.3e-05,6e-06,4e-06,-1.8e-05,-2.7e-05,1e-06,-2.4e-05,0,-3e-06,-1.7e-05,-3e-06,-1.5e-05,-1e-05,-1e-06,-1.5e-05,5e-06,-1e-05,5e-06,7e-06,-1.3e-05,-1.1e-05,-5e-06,-7e-06,-7e-06,-4e-06,-8e-06,5e-06,-8e-06,0,-4e-06,-4e-06,-9e-06,-3e-06,1.9e-05,-1.2e-05,6e-06,-2.5e-05,-1e-05,-1.2e-05,0.000232,-8e-06,-0.000436,0.000264,7.2e-05,3.3e-05,3e-05,-2.8e-05,-9.2e-05,2.3e-05,1.5e-05,7e-06,1e-05,0,2e-05,-2.7e-05,-9e-06,6.9e-05,-3e-06,-2.4e-05,1.2e-05,-1.6e-05,1.5e-05,2.1e-05,-7e-06,2.8e-05,4.6e-05,2e-06,-1.1e-05,-4e-05,7e-06,3.7e-05,1.2e-05,1.6e-05,-5e-06,3e-06,-1.2e-05,1.6e-05,-2e-05,-2.6e-05,-2.1e-05,-8e-06,0,1.4e-05,-1.9e-05,-1e-06,1e-06,8e-06,-1e-06,-4e-06,-9e-06,-8e-06,-2e-06,7e-06,-2e-06,-4e-06,0,-6e-06,-6e-06,-1e-06
-4e-06,-1.3e-05,-7e-06,-1.9e-05,7e-06,-3e-06,-1.4e-05,-2.4e-05,-1.4e-05,1e-05,4e-06,-5e-06,6e-06,3e-06,2e-06,-1.2e-05,-4e-06,-1e-06,-1.4e-05,-1.1e-05,-3e-06,3e-06,1e-06,-1.8e-05,-3e-06,-1e-06,-7e-06,-7e-06,4e-06,-4e-06,2e-06,-3e-06,6e-06,-2e-05,0,4e-06,-4e-06,-1.4e-05,-7e-06,-8e-06,1.5e-05,-1.2e-05,-1.6e-05,-4e-06,-1.5e-05,2e-06,-1.4e-05,5e-06,-1.4e-05,-6e-06,1e-06,-7e-06,-4e-06,-7e-06,-2e-06,4e-06,-3e-06,-3e-06,-6e-06,-7e-06,1.6e-05,-9e-05,9.4e-05,7.2e-05,3.1e-05,4.9e-05,2.9e-05,-4.9e-05,1e-05,-2.8e-05,-4.1e-05,-7e-06,5.3e-05,-4e-05,2.2e-05,4e-06,1.8e-05,2e-06,3.3e-05,2.2e-05,-4.1e-05,-1.3e-05,1.2e-05,-3.1e-05,-1.2e-05,-4e-06,-1e-06,-3e-05,-7e-06,-3e-05,6e-06,-1.7e-05,7e-06,8e-06,-1.4e-05,8e-06,-2e-05,3e-06,6e-06,-1.2e-05,-1.5e-05,-1.1e-05,-1e-06,8e-06,-7e-06,-9e-06,4e-06,-9e-06,5e-06,2e-06,-2e-06,-9e-06,6e-06,1e-06,-1e-06,-1e-06,-5e-06,4e-06,-4e-06,-1.1e-05,0
-9e-06,1e-05,-8e-06,-8e-06,6e-06,-4e-06,-5e-06,-5e-06,-4e-06,5e-06,-2.3e-05,-7e-06,-1.8e-05,0,4e-06,-6e-06,0,0,0,-5e-06,-6e-06,8e-06,-7e-06,-1e-05,-2e-06,-8e-06,1.3e-05,7e-06,-5e-06,2e-06,-6e-06,-3e-06,8e-06,-1.2e-05,3e-06,-6e-06,1e-06,2e-06,-2e-06,-1.3e-05,5e-06,-6e-06,6e-06,-3e-06,-2e-06,-6e-06,-2e-06,2e-06,0,-5e-06,-4e-06,-1e-06,-3e-06,4e-06,-5e-06,1e-05,9e-06,-3e-06,3e-06,-4e-06,-2.2e-05,-1.2e-05,-5.6e-05,6.5e-05,-3.7e-05,1.7e-05,-2.7e-05,7e-05,7.5e-05,7.6e-05,0,7e-05,9e-06,2.6e-05,2.8e-05,-2.3e-05,-1.1e-05,-6e-06,3.1e-05,-1.3e-05,1.3e-05,-2.9e-05,0,7e-06,-2.3e-05,1.4e-05,-4.4e-05,-1.8e-05,3e-06,-2.9e-05,-2.5e-05,7e-06,1.6e-05,1.4e-05,5e-06,-1e-06,-1.6e-05,1e-06,-4e-06,-9e-06,-1e-05,9e-06,-8e-06,1.4e-05,-8e-06,-1e-06,6e-06,-1e-05,-3e-06,-1e-06,1e-06,4e-06,-5e-06,1e-06,-1e-06,-1.6e-05,3e-06,1.1e-05,4e-06,-6e-06,-3e-06
-1.2e-05,2e-06,5e-06,-7e-06,2e-06,-5e-06,-1.2e-05,1e-06,-3e-06,5e-06,-5e-06,1e-06,1e-06,-6e-06,-3e-06,-7e-06,5e-06,0,-1.2e-05,0,7e-06,8e-06,5e-06,-9e-06,-6e-06,-1e-06,4e-06,-3e-06,-1e-05,0,-6e-06,0,7e-06,-2e-06,-1e-06,2e-06,0,-6e-06,-5e-06,-3e-06,-1.2e-05,1e-06,1e-05,0,0,-5e-06,1e-06,4e-06,1e-06,1e-06,0,4e-06,4e-06,-1e-06,-7e-06,-5e-06,-2e-06,-9e-06,1.2e-05,-1e-05,-1.6e-05,6.9e-05,8.4e-05,3.6e-05,-0.000101,-0.000115,-2.9e-05,-1e-05,-4.3e-05,-6e-06,2e-05,-4.3e-05,-2.4e-05,-2.2e-05,2.5e-05,2.6e-05,-5e-06,-2.5e-05,-3e-06,-1e-06,-1e-05,1.2e-05,-1e-06,-1e-05,2.7e-05,-1.2e-05,1.6e-05,-1.3e-05,7e-06,-2.2e-05,9e-06,-1e-06,-1.4e-05,-8e-06,-2.2e-05,6e-06,-1.4e-05,-6e-06,-1.6e-05,4e-06,-4e-06,-3e-06,-6e-06,1e-06,-4e-06,-8e-06,4e-06,-1.2e-05,-4e-06,-2e-06,-2e-06,2e-06,0,-8e-06,1e-06,-1e-06,-3e-06,3e-06,-7e-06,3e-06,2e-06
-4e-06,-4e-06,0,-7e-06,-7e-06,-2e-06,2e-06,-2e-06,-6e-06,4e-06,-2e-06,8e-06,-1e-05,-3e-06,1e-06,-3e-06,-3e-06,5e-06,-1.4e-05,4e-06,1e-06,4e-06,3e-06,-7e-06,0,2e-06,1e-05,4e-06,-2e-06,-5e-06,-5e-06,4e-06,-7e-06,-2e-06,4e-06,0,1e-06,2e-06,-4e-06,-8e-06,-6e-06,0,7e-06,2e-06,2e-06,-7e-06,1e-06,-1e-06,2e-06,-3e-06,0,1e-06,-5e-06,-3e-06,-4e-06,-1.1e-05,-1.2e-05,-9e-06,3e-06,0,7e-06,-0.000111,4.5e-05,-0.000145,3.8e-05,3.1e-05,-2e-05,-8e-06,1.4e-05,2e-06,-1.4e-05,0,3.1e-05,3.2e-05,-2.1e-05,1.4e-05,9e-06,-1.4e-05,3.6e-05,-2.4e-05,4.6e-05,1.6e-05,4e-06,2.8e-05,-2e-06,-8e-06,-1.3e-05,-3.7e-05,-5e-06,-1.4e-05,-1.1e-05,-8e-06,-2.2e-05,-3e-06,1e-06,1.9e-05,-8e-06,-7e-06,7e-06,5e-06,-1e-06,-1e-06,-1e-06,-1e-06,-3e-06,-3e-06,-5e-06,-1.2e-05,-4e-06,-3e-06,4e-06,-5e-06,0,-2e-06,1e-06,-1e-05,-2e-06,-5e-06,-1e-05,-1e-06,-4e-06
-7e-06,0,-9e-06,0,2e-06,-4e-06,6e-06,-1e-06,0,-4e-06,-9e-06,3e-06,3e-06,-5e-06,-3e-06,-1e-06,-5e-06,-2e-06,-3e-06,-1e-06,-5e-06,-1e-06,-2e-06,-6e-06,-2e-06,1e-06,7e-06,-6e-06,-1e-06,1e-06,-4e-06,5e-06,-6e-06,1e-06,-4e-06,-2e-06,5e-06,1e-06,-4e-06,-3e-06,-1e-06,4e-06,-1e-06,0,2e-06,3e-06,0,-3e-06,4e-06,-1e-06,2e-06,2e-06,1e-06,-2e-06,-4e-06,-3e-06,1e-06,-1e-06,-3e-06,-4e-06,-1.8e-05,6e-05,-6.8e-05,-4.2e-05,0.000116,1.7e-05,-4e-06,8e-06,1.8e-05,1.5e-05,1.4e-05,4.2e-05,4e-06,-2.2e-05,-3.2e-05,-9e-06,1e-06,2.8e-05,-1.1e-05,1.5e-05,1e-06,2.2e-05,-4e-06,-2.7e-05,1.1e-05,-1.3e-05,2.8e-05,-4.2e-05,8e-06,-2e-06,1e-06,6e-06,2e-06,-4e-06,-1.2e-05,3e-06,-3e-06,1e-06,-1e-06,6e-06,1e-06,0,-5e-06,-3e-06,-4e-06,-2e-06,-7e-06,-7e-06,-2e-06,1e-06,-4e-06,2e-06,1e-06,-6e-06,-1e-06,7e-06,0,-4e-06,-4e-06,-1e-06,2e-06
-3e-06,1.1e-05,1.4e-05,9e-06,1e-06,-2e-06,-2e-06,1e-06,-3e-06,-9e-06,-3e-06,9e-06,4e-06,-4e-06,2e-06,-3e-06,0,4e-06,3e-06,3e-06,1e-06,-4e-06,0,-7e-06,2e-06,-5e-06,1e-06,1e-06,-7e-06,2e-06,-1e-06,1e-06,-4e-06,-2e-06,-3e-06,3e-06,1e-06,2e-06,-4e-06,5e-06,-3e-06,4e-06,-3e-06,-1e-06,-4e-06,5e-06,0,-4e-06,-8e-06,-2e-06,1e-06,-3e-06,2e-06,1e-06,1e-06,-4e-06,8e-06,1.1e-05,2e-06,-5e-06,-1.3e-05,3e-06,3.9e-05,-6.2e-05,-0.000112,-6e-06,-3.7e-05,7e-06,6.3e-05,-3.5e-05,-2.5e-05,-5e-06,-4.3e-05,2e-06,-1.6e-05,2e-06,-1.3e-05,1.4e-05,3e-06,-1.1e-05,-3.7e-05,-1e-06,-3e-05,-1.1e-05,2e-06,-7e-06,8e-06,-4e-06,-1.4e-05,-2e-06,3e-06,-2e-06,-7e-06,1e-06,-2e-06,5e-06,1e-06,-1e-06,2e-06,5e-06,-1e-05,-2e-06,-5e-06,5e-06,-1e-06,-4e-06,0,-5e-06,4e-06,-2e-06,1e-06,4e-06,0,-7e-06,1e-06,6e-06,0,-3e-06,-1e-06,0,4e-06
-1e-06,9e-06,-6e-06,2e-06,-3e-06,-2e-06,2e-06,9e-06,-2e-06,-5e-06,-1e-05,3e-06,1e-06,0,-2e-06,1e-06,-1e-06,-1e-06,-2e-06,1e-06,2e-06,-6e-06,-1e-06,-6e-06,-1e-06,-2e-06,2e-06,-1e-06,-6e-06,-3e-06,0,-3e-06,0,-4e-06,-4e-06,-2e-06,-4e-06,0,-3e-06,4e-06,-1e-06,1e-06,-4e-06,1e-06,-5e-06,-1e-06,0,-1e-06,3e-06,-1e-06,-1e-06,-2e-06,0,-1e-06,0,1e-06,-6e-06,3e-06,-5e-06,-1e-06,3e-06,-1.8e-05,-1.9e-05,0.00016,-6e-06,4.1e-05,1.7e-05,8e-06,1.5e-05,2.3e-05,4e-05,-4e-05,0,8e-06,1.5e-05,-1.2e-05,4e-06,-1.7e-05,-2.6e-05,-7e-06,-9e-06,9e-06,2e-05,1.4e-05,-2e-06,-3e-06,-1.4e-05,-9e-06,0,-8e-06,-3e-06,2e-06,1.8e-05,-4e-06,0,-9e-06,9e-06,1e-06,1e-06,4e-06,-6e-06,1e-06,3e-06,8e-06,1e-06,-5e-06,0,-4e-06,0,1e-06,-2e-06,-1e-06,1e-06,-1e-06,-1e-06,0,0,-1e-06,-2e-06,2e-06,-4e-06
-1e-06,-3e-06,-1e-06,-8e-06,-4e-06,-3e-06,-1e-06,8e-06,0,4e-06,-2e-06,0,1e-06,-2e-06,3e-06,-2e-06,-3e-06,0,-8e-06,-3e-06,0,-7e-06,1e-06,-5e-06,1e-06,-5e-06,-6e-06,-2e-06,2e-06,1e-06,0,-2e-06,4e-06,-3e-06,0,0,-1e-06,-3e-06,-3e-06,3e-06,4e-06,0,-5e-06,-1e-06,0,4e-06,-2e-06,1e-06,2e-06,-1e-06,0,-3e-06,-1e-06,-2e-06,2e-06,3e-06,-2e-06,-2e-06,-3e-06,-3e-06,-1.2e-05,5e-05,1.4e-05,-8.5e-05,5.5e-05,-1.6e-05,2e-06,-1.6e-05,-2.5e-05,4e-06,-5.3e-05,7.8e-05,2.5e-05,-1.1e-05,5e-06,1.4e-05,3e-06,5e-06,-2e-06,2.6e-05,1.6e-05,4e-06,-1.4e-05,-1.6e-05,3e-06,-5e-06,-1.2e-05,-5e-06,1e-06,-5e-06,-2e-06,1e-06,2e-06,-5e-06,-3e-06,-7e-06,8e-06,-1e-06,3e-06,3e-06,-6e-06,4e-06,-7e-06,7e-06,0,-2e-06,3e-06,-3e-06,1e-06,0,0,-4e-06,0,-3e-06,1e-06,-1e-06,0,3e-06,-4e-06,1e-06,3e-06
0,-3e-06,5e-06,-6e-06,-1e-06,0,-3e-06,7e-06,-3e-06,4e-06,2e-06,-2e-06,-1e-06,0,-1e-06,-1e-06,0,1e-06,-4e-06,-4e-06,-2e-06,-6e-06,0,-3e-06,-1e-06,-3e-06,-6e-06,7e-06,-2e-06,1e-06,1e-06,-2e-06,4e-06,-2e-06,1e-06,0,1e-06,0,-3e-06,-1e-06,-3e-06,-1e-06,-1e-06,0,-1e-06,1e-06,-1e-06,2e-06,-3e-06,-1e-06,1e-06,0,2e-06,-1e-06,0,2e-06,2e-06,-5e-06,0,-3e-06,-1e-05,-7.8e-05,3.7e-05,-8.9e-05,-1e-05,-2.7e-05,2.2e-05,2.2e-05,-1.8e-05,-1.3e-05,2.4e-05,-5.2e-05,-2e-06,7e-06,4e-06,3e-06,3e-06,-1.4e-05,-2e-05,-1.7e-05,9e-06,-1e-06,-5e-06,2.4e-05,-4e-06,0,-1e-06,1.3e-05,8e-06,3e-06,-1e-06,-2e-06,3e-06,1e-06,-6e-06,-1.5e-05,5e-06,-5e-06,-7e-06,-1e-06,-8e-06,-1e-06,1e-06,0,-2e-06,0,2e-06,-4e-06,-1e-06,0,-1e-06,-1e-06,-1e-06,0,-1e-06,0,-1e-06,3e-06,-1e-06,0,-2e-06
-4e-06,0,-2e-06,0,4e-06,-2e-06,2e-06,2e-06,-1e-06,2e-06,-5e-06,-4e-06,0,-5e-06,0,-2e-06,1e-06,-1e-06,-2e-06,0,0,-4e-06,-1e-06,-5e-06,0,0,-3e-06,-1e-06,-7e-06,-1e-06,0,-5e-06,1e-06,-1e-06,0,-1e-06,2e-06,-1e-06,-2e-06,1e-06,-2e-06,-4e-06,3e-06,0,3e-06,1e-06,-2e-06,1e-06,1e-06,-1e-06,0,1e-06,0,0,0,0,3e-06,-3e-06,2e-06,-3e-06,2e-06,4e-05,-2.6e-05,2.1e-05,-3.2e-05,-5e-06,1e-05,-1.8e-05,5e-06,9e-06,7e-06,-1.4e-05,-9e-06,-9e-06,-8e-06,-9e-06,-5e-06,-3e-06,8e-06,1e-05,4e-06,-2e-06,5e-06,-1.2e-05,-6e-06,3e-06,1.2e-05,8e-06,-8e-06,7e-06,-4e-06,1e-06,-1.3e-05,1e-06,-1e-06,-9e-06,1e-06,2e-06,-1e-06,0,-1e-06,-1.1e-05,-3e-06,-6e-06,1e-06,-2e-06,1e-06,-4e-06,-2e-06,1e-06,1e-06,4e-06,2e-06,2e-06,0,0,0,1e-06,0,1e-06,0
-4e-06,1e-06,-3e-06,0,1e-06,-2e-06,0,2e-06,0,1e-06,-3e-06,-3e-06,-1e-06,-1e-06,0,-2e-06,0,0,-2e-06,2e-06,2e-06,-2e-06,3e-06,-4e-06,0,1e-06,-7e-06,1e-06,-3e-06,0,-1e-06,-5e-06,-1e-06,-2e-06,2e-06,0,1e-06,1e-06,-2e-06,-3e-06,2e-06,-4e-06,5e-06,-1e-06,1e-06,-5e-06,-3e-06,0,2e-06,0,0,2e-06,-1e-06,-1e-06,0,-1e-06,-2e-06,-1e-06,1e-06,0,-9e-06,-4e-06,-2e-06,0.000116,7e-06,-7e-06,1.4e-05,2.1e-05,9e-06,-1.1e-05,-1.9e-05,5e-05,5e-06,1.3e-05,0,4e-06,0,9e-06,-9e-06,3e-06,-1e-05,-3e-06,-8e-06,-5e-06,1e-06,1e-06,-5e-06,3e-06,7e-06,8e-06,-4e-06,0,-1e-06,-1e-06,-3e-06,-4e-06,-2e-06,1e-06,1e-06,-2e-06,-5e-06,1e-05,1e-06,-9e-06,2e-06,-3e-06,-2e-06,-4e-06,0,-1e-06,-1e-06,1e-06,-2e-06,-2e-06,0,3e-06,0,-1e-06,-2e-06,0,0
-3e-06,-5e-06,4e-06,2e-06,-1e-06,0,-1e-06,0,-2e-06,-1e-06,-4e-06,-2e-06,-4e-06,0,-1e-06,0,0,0,-3e-06,1e-06,-1e-06,1e-06,-1e-06,-3e-06,0,1e-06,-3e-06,-1e-06,3e-06,0,-1e-06,-3e-06,-4e-06,-1e-06,-1e-06,0,2e-06,2e-06,-2e-06,-5e-06,1e-06,-5e-06,3e-06,1e-06,-2e-06,-1e-06,-2e-06,-1e-06,-4e-06,-1e-06,-1e-06,1e-06,0,-1e-06,-2e-06,0,-3e-06,3e-06,1e-06,-4e-06,-8e-06,-1e-05,-2.4e-05,-8.3e-05,3.3e-05,3.6e-05,-5e-06,-2.3e-05,-2e-05,-4e-06,1.3e-05,-3e-05,8e-06,-1.3e-05,8e-06,-5e-06,2e-06,6e-06,1.5e-05,-8e-06,-6e-06,-4e-06,6e-06,7e-06,-6e-06,-1e-06,1.1e-05,-1e-05,-5e-06,7e-06,-3e-06,0,-6e-06,0,-5e-06,-3e-06,-3e-06,-1e-06,2e-06,-2e-06,-4e-06,2e-06,-4e-06,-6e-06,-1e-06,-3e-06,-3e-06,-4e-06,1e-06,1e-06,1e-06,-3e-06,1e-06,1e-06,-1e-06,2e-06,0,-2e-06,-3e-06,0,1e-06
-3e-06,-4e-06,-4e-06,4e-06,1e-06,-1e-06,1e-06,1e-06,0,-4e-06,-3e-06,-2e-06,4e-06,-2e-06,0,-2e-06,1e-06,-1e-06,-2e-06,1e-06,0,2e-06,0,-3e-06,0,1e-06,-1e-06,-1e-06,0,0,-1e-06,-2e-06,-3e-06,-2e-06,0,0,1e-06,-2e-06,-2e-06,-1e-06,-1e-06,-5e-06,-1e-06,1e-06,-2e-06,0,-2e-06,-2e-06,1e-06,0,0,1e-06,1e-06,0,-1e-06,0,3e-06,2e-06,1e-06,-1e-06,0,3.6e-05,8e-06,-1.9e-05,-1.6e-05,1e-06,-4e-06,2.6e-05,-3.3e-05,8e-06,-4e-06,-9e-06,-1e-06,0,5e-06,6e-06,-2e-06,1e-06,-2e-06,6e-06,2e-06,-4e-06,-4e-06,-5e-06,0,0,-1.1e-05,-1e-06,3e-06,5e-06,-7e-06,0,5e-06,2e-06,3e-06,0,-4e-06,-1e-06,2e-06,-2e-06,-2e-06,-6e-06,-1e-06,-2e-06,0,0,-1e-06,-5e-06,0,-1e-06,-1e-06,0,0,-1e-06,0,2e-06,0,-2e-06,-1e-06,-1e-06,0
0,2e-06,1e-06,-3e-06,1e-06,-1e-06,-2e-06,-1e-06,0,-3e-06,-1e-06,-2e-06,-1e-06,1e-06,-1e-06,-1e-06,0,1e-06,0,1e-06,0,3e-06,0,-3e-06,0,-2e-06,-1e-06,-2e-06,-6e-06,-1e-06,-1e-06,-3e-06,0,-1e-06,-2e-06,-1e-06,-2e-06,2e-06,-2e-06,1e-06,2e-06,-4e-06,-2e-06,-1e-06,-1e-06,-1e-06,-1e-06,0,2e-06,0,1e-06,-1e-06,-2e-06,0,-1e-06,0,3e-06,1e-06,2e-06,-1e-06,-7e-06,-3.7e-05,3.6e-05,3e-05,-2.9e-05,-1.4e-05,-1e-05,-2e-05,-1.3e-05,-5e-06,2e-06,8e-06,-5e-06,7e-06,0,-1e-06,0,-1e-05,1.5e-05,-9e-06,-1e-06,-4e-06,4e-06,8e-06,-5e-06,1e-06,-1e-06,-1.4e-05,-2e-06,3e-06,0,0,8e-06,0,-4e-06,2e-06,-3e-06,0,-3e-06,-2e-06,-4e-06,0,0,2e-06,1e-06,-2e-06,1e-06,-4e-06,1e-06,1e-06,1e-06,1e-06,0,-2e-06,0,-4e-06,0,0,-1e-06,0,0
0,1e-06,2e-06,-6e-06,-1e-06,0,0,-3e-06,-1e-06,1e-06,-5e-06,-2e-06,2e-06,-2e-06,1e-06,0,-1e-06,-1e-06,-3e-06,-1e-06,0,3e-06,0,-2e-06,0,-2e-06,3e-06,1e-06,-2e-06,1e-06,0,-1e-06,2e-06,0,-1e-06,1e-06,-3e-06,-3e-06,-1e-06,-1e-06,-1e-06,-3e-06,-3e-06,1e-06,1e-06,0,-1e-06,0,-1e-06,0,-1e-06,-1e-06,0,0,0,0,-3e-06,-2e-06,-3e-06,-2e-06,-7e-06,3e-06,-4.4e-05,3.9e-05,3.2e-05,-1e-05,-2e-06,1.8e-05,9e-06,5e-06,-9e-06,1.7e-05,5e-06,-6e-06,-7e-06,-5e-06,2e-06,5e-06,-4e-06,6e-06,1.1e-05,-1e-06,-7e-06,-5e-06,-1e-06,-1e-06,0,-1.4e-05,2e-06,3e-06,-7e-06,1e-06,-1e-06,0,-1e-06,6e-06,0,-1e-06,1e-06,-1e-06,-5e-06,3e-06,-3e-06,2e-06,0,-1e-06,1e-06,-3e-06,-1e-06,0,-1e-06,0,0,0,0,-2e-06,0,1e-06,-2e-06,0,0
-1e-06,-2e-06,-2e-06,-1e-06,-1e-06,-2e-06,1e-06,-5e-06,0,3e-06,-2e-06,0,-1e-06,-2e-06,0,0,0,0,-3e-06,-2e-06,1e-06,2e-06,0,-3e-06,0,-3e-06,2e-06,1e-06,2e-06,0,0,1e-06,3e-06,0,0,-1e-06,-1e-06,2e-06,-1e-06,2e-06,-3e-06,-1e-06,-2e-06,0,2e-06,1e-06,0,1e-06,2e-06,0,1e-06,-1e-06,1e-06,0,0,-1e-06,-3e-06,-2e-06,-3e-06,-2e-06,-1e-06,8e-06,-6e-06,-1e-06,6e-06,-5e-06,-5e-06,-1.5e-05,1.2e-05,2e-06,9e-06,-3.5e-05,3e-06,6e-06,-3e-06,4e-06,0,-7e-06,1.1e-05,-3e-06,0,-1e-06,2e-06,5e-06,1e-06,-3e-06,-1e-06,-4e-06,0,3e-06,-1e-06,0,1e-06,-1e-06,-2e-06,3e-06,2e-06,2e-06,-2e-06,-1e-06,-3e-06,-2e-06,-1e-06,1e-06,-1e-06,-1e-06,2e-06,-3e-06,0,0,0,-1e-06,-1e-06,-3e-06,1e-06,-1e-06,0,2e-06,-3e-06,0,-2e-06
0,-3e-06,0,3e-06,0,0,0,-2e-06,-1e-06,2e-06,-1e-06,1e-06,3e-06,1e-06,0,-1e-06,0,1e-06,-1e-06,-1e-06,0,1e-06,-1e-06,-2e-06,0,-1e-06,2e-06,0,-2e-06,-1e-06,0,0,1e-06,-1e-06,0,0,0,0,-1e-06,1e-06,0,0,0,-1e-06,0,3e-06,0,0,-3e-06,0,-1e-06,0,-1e-06,0,0,0,4e-06,-1e-06,0,0,-5e-06,-1.8e-05,1.3e-05,-4.4e-05,-2e-05,1e-06,1e-06,1.3e-05,-3e-06,-6e-06,-5e-06,1.8e-05,-8e-06,-3e-06,1e-06,-2e-06,-1e-06,6e-06,-7e-06,-3e-06,-8e-06,1e-06,3e-06,-7e-06,0,-2e-06,9e-06,-4e-06,0,2e-06,-2e-06,0,-8e-06,1e-06,-1e-06,4e-06,3e-06,-2e-06,0,0,-5e-06,0,0,-1e-06,0,-1e-06,0,-3e-06,0,0,0,0,1e-06,-1e-06,0,0,0,0,-1e-06,0,1e-06
-2e-06,2e-06,2e-06,1e-06,1e-06,0,1e-06,-1e-06,-1e-06,0,-2e-06,2e-06,-3e-06,-1e-06,-1e-06,-1e-06,-1e-06,-1e-06,0,1e-06,0,-1e-06,1e-06,-2e-06,0,0,2e-06,1e-06,-4e-06,1e-06,0,0,-1e-06,-1e-06,1e-06,1e-06,0,0,-1e-06,1e-06,1e-06,1e-06,2e-06,1e-06,-1e-06,-1e-06,0,1e-06,1e-06,0,1e-06,0,-1e-06,0,1e-06,-1e-06,1e-06,2e-06,1e-06,-2e-06,-6e-06,2.8e-05,-5e-06,8e-06,1e-06,5e-06,1e-06,-1e-05,-3e-06,5e-06,9e-06,1.8e-05,-1e-06,3e-06,4e-06,2e-06,0,6e-06,5e-06,9e-06,-4e-06,1e-06,-9e-06,3e-06,2e-06,0,-4e-06,-2e-06,-2e-06,0,-1e-06,0,0,0,-4e-06,2e-06,2e-06,0,0,1e-06,-3e-06,1e-06,-2e-06,-1e-06,1e-06,-2e-06,-1e-06,-2e-06,0,-1e-06,0,1e-06,-1e-06,0,0,1e-06,0,0,-1e-06,0,-1e-06
-2e-06,3e-06,-3e-06,1e-06,-1e-06,-1e-06,0,0,0,-1e-06,-1e-06,3e-06,2e-06,0,0,0,0,1e-06,-1e-06,0,0,-2e-06,0,-2e-06,0,2e-06,0,-1e-06,0,0,0,1e-06,-2e-06,-1e-06,-1e-06,-1e-06,1e-06,1e-06,-1e-06,-2e-06,-2e-06,2e-06,3e-06,0,-1e-06,1e-06,0,-1e-06,1e-06,0,0,1e-06,1e-06,0,0,0,-3e-06,1e-06,2e-06,-1e-06,-1e-06,-2.3e-05,1.1e-05,5e-05,6e-06,1.8e-05,4e-06,6e-06,1.2e-05,0,-1e-05,-2.9e-05,7e-06,-2e-06,-2e-06,-1e-06,1e-06,-3e-06,-1.1e-05,-7e-06,3e-06,3e-06,4e-06,5e-06,-1e-06,0,1e-06,-2e-06,2e-06,-2e-06,-1e-06,0,-2e-06,-1e-06,1e-06,-2e-06,1e-06,0,2e-06,1e-06,-1e-06,-1e-06,0,1e-06,0,-1e-06,-1e-06,-3e-06,1e-06,1e-06,0,0,1e-06,-2e-06,0,2e-06,0,-1e-06,-2e-06,0,1e-06
-1e-06,0,1e-06,0,0,0,-1e-06,-1e-06,0,-2e-06,-4e-06,1e-06,-3e-06,-1e-06,0,-1e-06,0,0,-2e-06,0,0,-3e-06,-1e-06,-2e-06,0,1e-06,0,-1e-06,1e-06,-1e-06,0,1e-06,-2e-06,-1e-06,1e-06,0,1e-06,-2e-06,-1e-06,1e-06,1e-06,2e-06,1e-06,0,0,-1e-06,0,0,-2e-06,0,0,0,0,0,0,1e-06,0,0,1e-06,-1e-06,-4e-06,0,-2.3e-05,-5e-06,1.6e-05,-5e-06,2e-06,-4e-06,2e-05,-2e-06,8e-06,3e-06,0,1e-06,-1e-06,-2e-06,1e-06,1e-06,2e-06,2e-06,4e-06,1e-06,1e-06,-7e-06,1e-06,-1e-06,-5e-06,5e-06,-1e-06,-3e-06,0,0,6e-06,0,-2e-06,-4e-06,0,0,-2e-06,1e-06,-4e-06,0,-2e-06,3e-06,0,-1e-06,-1e-06,-3e-06,0,-1e-06,0,-1e-06,0,1e-06,0,-2e-06,0,-1e-06,-2e-06,0,0
-2e-06,-1e-06,0,-3e-06,0,0,0,-1e-06,0,-2e-06,-2e-06,1e-06,2e-06,-1e-06,0,-1e-06,0,0,-1e-06,1e-06,0,-3e-06,1e-06,-2e-06,0,0,-1e-06,0,-4e-06,0,0,-1e-06,-1e-06,-1e-06,-1e-06,0,0,1e-06,-1e-06,-2e-06,2e-06,1e-06,0,1e-06,1e-06,0,0,-1e-06,1e-06,0,0,0,-1e-06,0,-1e-06,0,2e-06,-1e-06,0,-2e-06,-5e-06,1e-05,-7e-06,-3.7e-05,-2.4e-05,-1.1e-05,3e-06,2e-06,1.1e-05,1e-06,-3e-06,3.4e-05,-4e-06,0,-2e-06,3e-06,-1e-06,-6e-06,-1e-05,5e-06,1e-06,1e-06,-5e-06,8e-06,1e-06,-1e-06,4e-06,-2e-06,2e-06,-2e-06,-3e-06,-1e-06,2e-06,1e-06,-1e-06,-4e-06,-2e-06,0,0,1e-06,-2e-06,1e-06,1e-06,3e-06,0,-1e-06,0,-3e-06,0,0,0,0,0,0,0,-1e-06,0,0,-1e-06,0,0
0,1e-06,-1e-06,-2e-06,1e-06,-1e-06,0,0,0,0,-1e-06,1e-06,-1e-06,0,0,-1e-06,0,1e-06,-1e-06,0,-1e-06,-2e-06,0,-2e-06,0,-1e-06,-2e-06,0,-3e-06,0,0,-1e-06,1e-06,0,0,0,-1e-06,-1e-06,-1e-06,-1e-06,-2e-06,1e-06,-2e-06,0,1e-06,-1e-06,0,1e-06,1e-06,0,0,-1e-06,1e-06,0,0,1e-06,1e-06,0,-1e-06,-1e-06,-2e-06,-2e-05,1.9e-05,-3e-06,5e-06,-4e-06,0,1e-06,-4e-06,-3e-06,-6e-06,-3.7e-05,1e-06,-2e-06,3e-06,-3e-06,0,2e-06,4e-06,-8e-06,-4e-06,1e-06,3e-06,-7e-06,0,1e-06,-1e-06,-3e-06,-1e-06,-1e-06,1e-06,0,1e-06,0,-1e-06,-3e-06,-2e-06,1e-06,0,1e-06,-3e-06,-1e-06,-3e-06,1e-06,0,-1e-06,1e-06,-3e-06,0,0,-1e-06,1e-06,0,-1e-06,-1e-06,-1e-06,0,1e-06,-1e-06,0,0
0,2e-06,0,2e-06,0,0,0,1e-06,-1e-06,2e-06,-2e-06,0,1e-06,-1e-06,0,0,0,-1e-06,-1e-06,-1e-06,0,-1e-06,0,-2e-06,0,-2e-06,0,0,2e-06,0,0,0,2e-06,-1e-06,0,0,-1e-06,1e-06,-1e-06,0,0,0,-2e-06,0,-1e-06,-1e-06,0,0,-2e-06,0,0,-1e-06,0,0,-1e-06,0,-2e-06,-1e-06,-2e-06,-1e-06,-3e-06,2.2e-05,-4e-06,2.9e-05,1.1e-05,0,0,-4e-06,-4e-06,0,1e-05,1e-05,2e-06,3e-06,1e-06,1e-06,0,-1e-06,-7e-06,5e-06,0,1e-06,-2e-06,2e-06,0,1e-06,1e-06,-1e-06,0,-1e-06,-4e-06,0,-3e-06,0,-1e-06,-3e-06,-2e-06,-2e-06,0,0,-4e-06,-1e-06,1e-06,-1e-06,-1e-06,-1e-06,1e-06,-3e-06,0,0,1e-06,0,0,1e-06,1e-06,2e-06,0,1e-06,-2e-06,0,0
-1e-06,-1e-06,0,3e-06,0,-1e-06,0,2e-06,0,2e-06,-1e-06,0,0,0,0,0,0,0,-1e-06,-1e-06,0,0,0,-1e-06,0,-2e-06,-1e-06,1e-06,0,-1e-06,0,-1e-06,1e-06,-1e-06,0,0,-1e-06,0,-1e-06,1e-06,1e-06,-2e-06,-2e-06,1e-06,-1e-06,1e-06,0,1e-06,1e-06,0,0,-1e-06,-1e-06,0,0,0,-1e-06,1e-06,0,-1e-06,-5e-06,-1.3e-05,2e-06,1.4e-05,-5e-06,1.2e-05,-2e-06,5e-06,2e-06,1e-06,-5e-06,1.6e-05,0,-4e-06,0,-1e-06,0,3e-06,6e-06,-2e-06,1e-06,0,-1e-06,3e-06,-1e-06,-1e-06,1e-06,-3e-06,0,-1e-06,1e-06,0,-4e-06,0,-3e-06,-1e-06,-1e-06,2e-06,1e-06,0,-2e-06,2e-06,-1e-06,-3e-06,0,-1e-06,1e-06,-3e-06,0,0,0,0,0,-1e-06,0,0,0,1e-06,-1e-06,0,0
-1e-06,-2e-06,-1e-06,0,0,0,0,1e-06,0,0,-2e-06,-1e-06,0,-1e-06,0,-1e-06,0,0,-1e-06,0,0,1e-06,0,-2e-06,0,0,0,0,-4e-06,0,0,-2e-06,0,-1e-06,1e-06,0,0,-1e-06,-1e-06,-1e-06,-1e-06,-2e-06,0,0,-1e-06,0,-1e-06,-1e-06,1e-06,0,0,0,1e-06,0,0,0,3e-06,1e-06,1e-06,-1e-06,-2e-06,-4e-06,-1.4e-05,-4.3e-05,-2e-06,1e-06,0,-6e-06,2e-06,-1e-06,3e-06,-1.4e-05,-2e-06,0,-2e-06,-1e-06,0,2e-06,-4e-06,-2e-06,-1e-06,-1e-06,3e-06,-3e-06,-2e-06,-1e-06,-3e-06,-5e-06,1e-06,0,-4e-06,0,1e-06,0,0,2e-06,1e-06,-1e-06,-1e-06,-1e-06,-3e-06,-1e-06,-1e-06,-2e-06,0,-1e-06,0,-3e-06,0,0,0,0,0,-1e-06,0,2e-06,0,0,-1e-06,0,0
-1e-06,0,1e-06,-1e-06,0,0,0,1e-06,-1e-06,-1e-06,-2e-06,-2e-06,0,-1e-06,0,0,0,-1e-06,-1e-06,0,0,2e-06,0,-2e-06,0,1e-06,1e-06,0,-1e-06,0,0,-1e-06,-1e-06,0,-1e-06,-1e-06,1e-06,1e-06,-1e-06,1e-06,-1e-06,-3e-06,2e-06,0,0,1e-06,-1e-06,0,-2e-06,0,0,1e-06,0,0,0,0,1e-06,1e-06,0,0,-3e-06,1.1e-05,-5e-06,-6e-06,-7e-06,-1.1e-05,-1e-06,7e-06,-1e-05,0,-4e-06,-1e-05,0,1e-06,0,2e-06,0,-4e-06,9e-06,4e-06,1e-06,-1e-06,-2e-06,4e-06,0,0,4e-06,-5e-06,-1e-06,0,-1e-06,0,-1e-06,0,-1e-06,2e-06,2e-06,0,0,-1e-06,-3e-06,-1e-06,-1e-06,0,0,-1e-06,-1e-06,-2e-06,0,1e-06,-1e-06,0,1e-06,0,0,0,0,-1e-06,-1e-06,0,1e-06
