0.099453,0.096629,0.083741,0.075621,0.070918,0.07469,0.079278,0.079512,0.079353,0.076748,0.07085,0.07433,0.084803,0.092213,0.09462,0.086094,0.071143,0.065761,0.070848,0.077656,0.07488,0.064802,0.069845,0.077354,0.072745,0.066966,0.067536,0.068425
0.134076,0.129774,0.109377,0.095566,0.08798,0.094196,0.103827,0.106157,0.10786,0.104998,0.095234,0.100991,0.116572,0.127008,0.131283,0.11955,0.096995,0.088945,0.096583,0.10312,0.098755,0.087498,0.09449,0.104725,0.098854,0.090448,0.090146,0.09117
0.195336,0.187985,0.154006,0.130761,0.118318,0.128897,0.148243,0.154509,0.159752,0.156563,0.139713,0.150463,0.176497,0.193372,0.20016,0.182155,0.145698,0.133021,0.146748,0.15372,0.146268,0.131785,0.14233,0.157232,0.147007,0.132832,0.131909,0.134287
0.234447,0.224632,0.182486,0.155748,0.13985,0.15266,0.181527,0.191472,0.199453,0.19745,0.176464,0.192367,0.227243,0.251531,0.261008,0.236999,0.188643,0.171751,0.192653,0.20235,0.192349,0.174184,0.186374,0.203576,0.187114,0.167498,0.16825,0.173624
0.218814,0.210725,0.175157,0.155428,0.141613,0.154285,0.185457,0.195436,0.201025,0.200833,0.185587,0.205993,0.240377,0.268011,0.279002,0.25161,0.202027,0.184851,0.208313,0.219554,0.210608,0.19377,0.203326,0.216538,0.194312,0.174283,0.179823,0.187201
0.160017,0.15835,0.14556,0.140658,0.133653,0.14813,0.171264,0.170081,0.165493,0.167697,0.169444,0.1927,0.213978,0.239373,0.249936,0.218742,0.179973,0.16888,0.185652,0.190575,0.1855,0.180178,0.18537,0.190339,0.169408,0.159169,0.168632,0.172944
0.139528,0.136237,0.13869,0.144431,0.140849,0.15763,0.164679,0.145,0.137611,0.149291,0.163071,0.179107,0.186178,0.212173,0.223086,0.182519,0.151209,0.147236,0.151243,0.148314,0.149625,0.16079,0.165118,0.158599,0.14336,0.148443,0.158482,0.157577
0.20475,0.197486,0.200835,0.211271,0.196196,0.208772,0.202772,0.164928,0.154735,0.163744,0.179924,0.187294,0.18706,0.227312,0.249625,0.205878,0.172055,0.159664,0.148009,0.153679,0.168801,0.189386,0.194716,0.165574,0.14962,0.16655,0.171144,0.170002
0.365763,0.358813,0.371548,0.396071,0.341738,0.347353,0.33987,0.269475,0.234393,0.22669,0.262063,0.28001,0.274053,0.348864,0.405237,0.353962,0.290558,0.236433,0.20288,0.23708,0.283815,0.325773,0.335117,0.252078,0.221308,0.263233,0.263508,0.267327
0.645842,0.646468,0.692786,0.754915,0.627926,0.626933,0.627113,0.483775,0.386794,0.352238,0.44282,0.505467,0.491102,0.632449,0.750622,0.665722,0.539352,0.412389,0.333152,0.405284,0.518303,0.615586,0.632524,0.449755,0.386227,0.474321,0.472412,0.476367
1.054348,1.077898,1.195054,1.323051,1.080759,1.066483,1.079549,0.801421,0.599977,0.537355,0.72307,0.860951,0.833259,1.087612,1.30683,1.168671,0.945439,0.700018,0.536218,0.654245,0.875769,1.073818,1.108746,0.772973,0.653616,0.808032,0.807652,0.82258
1.515654,1.571644,1.794222,2.012346,1.638418,1.605472,1.62634,1.151223,0.81823,0.751293,1.062022,1.287322,1.240306,1.647333,1.99565,1.796993,1.458774,1.055189,0.778248,0.939555,1.290487,1.626157,1.693944,1.187156,0.997949,1.204942,1.205238,1.257517
1.804198,1.883837,2.212279,2.510632,2.062553,2.019204,2.032714,1.368633,0.930069,0.908225,1.327109,1.603675,1.544775,2.084325,2.525467,2.286805,1.871004,1.329886,0.969371,1.154887,1.582349,2.0276,2.131828,1.522237,1.28186,1.484166,1.488551,1.607824
1.674186,1.747893,2.10929,2.417518,2.03877,2.011095,1.999186,1.307684,0.876358,0.907003,1.321566,1.585569,1.556169,2.097339,2.495466,2.264659,1.878074,1.325994,0.993329,1.181741,1.556499,1.974335,2.083847,1.532664,1.299317,1.426288,1.451449,1.636193
1.212629,1.234456,1.498797,1.713885,1.549342,1.551665,1.489781,1.027629,0.768095,0.780069,1.017335,1.210604,1.244389,1.612029,1.82064,1.641793,1.407576,1.042592,0.853093,0.99556,1.191176,1.431428,1.504019,1.161321,1.002397,1.034354,1.077618,1.285505
0.983353,0.90619,1.011484,1.110309,1.153701,1.112902,0.971507,0.867308,0.820468,0.7237,0.765831,0.897813,0.899787,0.98421,1.019624,0.909142,0.90289,0.860196,0.786427,0.809316,0.787714,0.827171,0.893573,0.800226,0.747069,0.708811,0.711238,0.875826
1.189035,1.063579,1.122916,1.146064,1.250846,1.199612,1.024087,1.061934,1.067396,0.866247,0.877374,0.984795,0.852877,0.777094,0.804467,0.734119,0.801684,0.934201,0.904421,0.841688,0.72168,0.736171,0.897401,0.901258,0.839779,0.750744,0.696074,0.804768
1.451583,1.383642,1.432034,1.295398,1.370069,1.452659,1.296111,1.320167,1.337355,1.102896,1.119621,1.207529,1.013788,0.904559,0.911277,0.882971,0.969847,1.101948,1.072575,0.969525,0.882791,0.95347,1.137972,1.160879,1.04454,0.940682,0.942824,1.010568
1.726223,1.708848,1.647673,1.35906,1.366225,1.577081,1.482042,1.449492,1.491805,1.309572,1.275437,1.301561,1.134363,1.024625,0.971245,1.041709,1.191248,1.267229,1.243197,1.11246,1.095247,1.224861,1.337905,1.360059,1.239649,1.157609,1.206486,1.188644
2.011104,2.066971,1.76341,1.318379,1.252917,1.528012,1.525384,1.422074,1.498067,1.408595,1.25535,1.211318,1.194502,1.11778,0.956295,1.124107,1.400363,1.417402,1.370384,1.267157,1.339833,1.469831,1.445863,1.437063,1.346663,1.288782,1.309581,1.200987
2.100782,2.239624,1.682591,1.127936,1.044359,1.334422,1.460907,1.361501,1.436268,1.378923,1.134136,1.097528,1.26702,1.219317,0.907918,1.084426,1.442153,1.433483,1.361691,1.324509,1.475274,1.54391,1.425055,1.408854,1.351861,1.272498,1.199175,1.062371
1.908729,2.063209,1.386522,0.899496,0.864725,1.045421,1.187906,1.215954,1.342022,1.23826,0.952813,0.991731,1.286756,1.254444,0.869192,0.969263,1.267448,1.252551,1.191065,1.217985,1.367108,1.340569,1.244578,1.2756,1.217101,1.148676,1.048826,0.958596
1.415919,1.562441,1.04553,0.729936,0.704005,0.750811,0.788761,0.907718,1.084853,0.980461,0.746623,0.816771,1.125024,1.136242,0.828717,0.847014,1.007179,0.958202,0.908825,0.962799,1.073265,1.031692,0.973751,1.048779,0.997713,0.966218,0.930466,0.863107
0.944306,1.027888,0.806718,0.646209,0.590747,0.585341,0.520251,0.583567,0.759945,0.727925,0.57694,0.600784,0.800918,0.853303,0.731453,0.772547,0.80061,0.654841,0.627352,0.729217,0.826441,0.805467,0.696248,0.753619,0.776554,0.815585,0.897964,0.794156
0.741613,0.819593,0.825168,0.717448,0.587774,0.547987,0.459163,0.451301,0.572193,0.601437,0.516969,0.474737,0.533067,0.5747,0.631004,0.743521,0.682051,0.500776,0.526542,0.637633,0.655095,0.639288,0.539774,0.559241,0.628381,0.714247,0.846839,0.75805
0.765951,0.865137,0.95796,0.850601,0.656546,0.567326,0.447485,0.440714,0.568073,0.62722,0.557425,0.473449,0.497713,0.51544,0.632207,0.792807,0.64842,0.47459,0.580013,0.67593,0.593639,0.575119,0.568716,0.553616,0.551183,0.59236,0.706861,0.759168
0.826904,0.975186,1.170721,1.072196,0.767192,0.637716,0.486121,0.512014,0.711158,0.775309,0.664207,0.525039,0.533476,0.555315,0.680439,0.854271,0.683331,0.522799,0.702032,0.780542,0.638214,0.628883,0.678227,0.65232,0.541531,0.532069,0.691691,0.890888
0.953627,1.195662,1.424879,1.29141,0.877811,0.718001,0.5823,0.662635,0.921369,0.974,0.818538,0.659334,0.658828,0.663729,0.768309,0.975989,0.880083,0.691515,0.845839,0.879529,0.688825,0.668757,0.753647,0.817448,0.640464,0.612977,0.894243,1.102829
1.078564,1.314748,1.468106,1.323164,0.956969,0.795767,0.655777,0.783854,1.050253,1.067317,0.892315,0.776867,0.830707,0.791999,0.803319,1.013395,1.039729,0.863993,0.933087,0.962622,0.802094,0.748187,0.851208,0.975523,0.746667,0.707404,1.044198,1.143263
1.006363,1.178629,1.228398,1.157492,0.998804,0.839841,0.650751,0.772092,0.963134,0.956363,0.847976,0.803632,0.894137,0.809649,0.693211,0.843951,0.995964,0.909753,0.869463,0.902063,0.88567,0.868438,0.939684,0.994211,0.732072,0.705475,0.990417,0.945262
0.773419,0.918986,0.938292,0.943083,0.928126,0.759787,0.577526,0.627428,0.686869,0.752864,0.848555,0.784583,0.79529,0.754018,0.577484,0.594359,0.755102,0.799039,0.70922,0.698433,0.842284,0.8978,0.881596,0.825333,0.631023,0.638256,0.757521,0.665952
0.63181,0.735191,0.703644,0.681058,0.683158,0.575384,0.461209,0.448483,0.521733,0.667373,0.816023,0.689347,0.625459,0.696484,0.603163,0.510792,0.530913,0.577188,0.489084,0.445458,0.649839,0.763927,0.67766,0.595359,0.547226,0.549847,0.554757,0.501085
0.557824,0.551448,0.505925,0.447431,0.39234,0.373988,0.374392,0.362099,0.504733,0.654795,0.682214,0.521589,0.426088,0.561252,0.597653,0.508798,0.432642,0.391848,0.333805,0.298462,0.432325,0.55769,0.47559,0.389943,0.430143,0.47145,0.482844,0.427741
0.477032,0.400247,0.300477,0.261316,0.221207,0.220713,0.279547,0.326898,0.471785,0.57388,0.506324,0.354014,0.24787,0.361448,0.479217,0.468675,0.412218,0.304227,0.241327,0.218919,0.315223,0.414538,0.340066,0.30975,0.324997,0.35333,0.410381,0.374146
0.327426,0.262856,0.15718,0.15781,0.16521,0.179153,0.20956,0.257294,0.361806,0.453841,0.37051,0.230659,0.164513,0.206156,0.304695,0.34219,0.346843,0.271337,0.209109,0.200629,0.266164,0.315155,0.239132,0.255554,0.244837,0.21347,0.287849,0.287614
0.174543,0.166796,0.117206,0.135115,0.168293,0.197334,0.179861,0.170885,0.216641,0.288341,0.2338,0.158872,0.148888,0.149102,0.196181,0.204518,0.239173,0.234687,0.189092,0.171231,0.201955,0.229948,0.182123,0.204658,0.195548,0.14814,0.176847,0.183946
0.094519,0.106804,0.098773,0.113701,0.1549,0.219071,0.207089,0.13988,0.11846,0.149935,0.137167,0.130053,0.132798,0.119139,0.128044,0.122883,0.155223,0.17177,0.159726,0.14951,0.149475,0.159619,0.160028,0.180042,0.181668,0.144989,0.123927,0.148453
0.079956,0.082554,0.080585,0.084483,0.116696,0.211111,0.228695,0.134907,0.070829,0.089455,0.096962,0.106367,0.108446,0.084886,0.093545,0.098373,0.097431,0.102231,0.12192,0.140089,0.125903,0.121161,0.146471,0.14487,0.15096,0.142387,0.106708,0.138698
0.075282,0.075734,0.067692,0.06242,0.076465,0.169534,0.21301,0.129569,0.058095,0.082542,0.094053,0.098967,0.096702,0.069223,0.091718,0.091158,0.058466,0.056036,0.083914,0.113216,0.110619,0.115133,0.127731,0.098583,0.10073,0.124168,0.103867,0.127617
0.06574,0.069203,0.063636,0.05411,0.049946,0.115634,0.16189,0.10841,0.055411,0.081993,0.090943,0.098531,0.091229,0.064237,0.086585,0.093886,0.060625,0.046773,0.05828,0.077489,0.088653,0.098765,0.101465,0.065632,0.055452,0.09126,0.109542,0.114202
