0.143232,0.134799,0.141278,0.162783,0.174617,0.146459,0.134712,0.144804,0.144925,0.148212,0.1397,0.112471,0.106663,0.112641,0.115324,0.139916,0.160196,0.13597,0.105189,0.105391,0.113857,0.11019,0.118034,0.133092,0.132511,0.12517,0.119401,0.133238
0.169193,0.160528,0.168749,0.194611,0.206708,0.171581,0.160401,0.173409,0.172546,0.175768,0.164698,0.134472,0.130077,0.139133,0.143292,0.168543,0.18918,0.161813,0.127934,0.12927,0.141082,0.140261,0.150325,0.16624,0.166127,0.158533,0.153874,0.175301
0.206675,0.197491,0.208919,0.239247,0.248123,0.205261,0.197849,0.214451,0.213105,0.216705,0.200819,0.16886,0.167799,0.181395,0.188263,0.2102,0.229918,0.201279,0.165632,0.169718,0.186569,0.19288,0.206733,0.221731,0.221128,0.213692,0.216251,0.250384
0.224671,0.213144,0.22693,0.254597,0.252585,0.213953,0.21405,0.229269,0.228913,0.232982,0.214883,0.188444,0.191447,0.207599,0.217726,0.227794,0.241305,0.221413,0.193592,0.202812,0.221211,0.232558,0.247165,0.259288,0.25646,0.250734,0.268837,0.310044
0.232752,0.219119,0.236743,0.258582,0.239721,0.2124,0.219242,0.227133,0.228541,0.234221,0.218618,0.199942,0.20349,0.221124,0.23512,0.231921,0.236364,0.228249,0.212459,0.225802,0.236887,0.2449,0.257548,0.270479,0.266186,0.25951,0.289284,0.32551
0.268741,0.269194,0.28875,0.297256,0.268172,0.24126,0.243074,0.235976,0.233434,0.24961,0.242889,0.227966,0.229545,0.247149,0.264796,0.260225,0.258524,0.248571,0.235301,0.247597,0.245924,0.24589,0.260562,0.282686,0.281163,0.265786,0.282713,0.299123
0.348651,0.400192,0.428708,0.395847,0.358553,0.324977,0.315412,0.295781,0.290389,0.328936,0.315784,0.289383,0.304926,0.332395,0.342434,0.330892,0.332375,0.304569,0.278829,0.291435,0.284337,0.286827,0.314308,0.336176,0.322594,0.301867,0.311459,0.320047
0.564308,0.693841,0.738171,0.642848,0.584529,0.51603,0.47853,0.460431,0.464449,0.545686,0.495826,0.43066,0.488951,0.545325,0.534445,0.513619,0.530188,0.455638,0.401257,0.414887,0.402796,0.430484,0.506335,0.515455,0.454533,0.433883,0.47499,0.515532
0.989274,1.234118,1.306773,1.134395,1.030812,0.868074,0.792597,0.795016,0.812417,0.961558,0.847289,0.724009,0.856376,0.957763,0.914674,0.88306,0.926717,0.766628,0.650524,0.674612,0.660958,0.726019,0.888338,0.902767,0.777727,0.753003,0.849505,0.938828
1.604411,1.999414,2.111034,1.853254,1.688949,1.370439,1.254549,1.285805,1.299106,1.532657,1.33692,1.149867,1.390537,1.560804,1.478189,1.424412,1.501304,1.215082,0.999133,1.046303,1.042391,1.171479,1.463189,1.497718,1.300814,1.269884,1.434445,1.580013
2.228633,2.769025,2.915921,2.590153,2.370622,1.866653,1.730097,1.799771,1.769476,2.05743,1.782919,1.562422,1.936538,2.195464,2.071012,1.978913,2.098827,1.687625,1.354959,1.428874,1.436638,1.657586,2.111042,2.163551,1.897911,1.862721,2.090625,2.283496
2.504513,3.101423,3.256615,2.919477,2.685357,2.068352,1.968866,2.078274,1.958604,2.213189,1.920536,1.731854,2.202706,2.529778,2.370949,2.2412,2.404497,1.96097,1.552263,1.629986,1.639923,1.939265,2.511092,2.562157,2.277496,2.25115,2.503462,2.707631
2.179674,2.67608,2.783554,2.499914,2.311747,1.774983,1.787956,1.92626,1.71945,1.846901,1.648022,1.532243,1.944659,2.254296,2.103268,1.988444,2.163053,1.827288,1.455819,1.497267,1.485714,1.777764,2.315075,2.33903,2.133886,2.14556,2.338768,2.48749
1.516717,1.750637,1.757575,1.579713,1.489577,1.217724,1.337145,1.442252,1.224191,1.221669,1.200773,1.171529,1.345609,1.507172,1.399323,1.343365,1.485938,1.374,1.162199,1.141349,1.118674,1.301708,1.607511,1.587839,1.533641,1.587641,1.654084,1.723775
0.994405,1.006136,1.022323,1.036964,1.046128,0.978162,1.064589,1.041882,0.860921,0.828973,0.931576,0.982229,0.95926,0.935787,0.89091,0.90072,0.950221,0.991845,0.94186,0.860928,0.857453,0.941005,1.018391,1.017632,1.033494,1.09562,1.100271,1.092654
0.82749,0.824611,0.919882,1.050765,1.076096,1.063202,1.113596,0.971401,0.753049,0.808644,1.025888,1.047903,1.00213,0.973842,0.920967,0.925611,0.931283,1.013251,1.007999,0.839938,0.778167,0.86411,0.919468,0.962,0.926631,0.963318,1.010259,0.971425
0.927814,0.956144,1.088378,1.253009,1.296384,1.268605,1.294068,1.102031,0.828733,0.942039,1.26736,1.222996,1.201492,1.327855,1.243078,1.181439,1.16614,1.199005,1.232906,1.075667,0.93018,1.005426,1.078384,1.160184,1.093956,1.061091,1.121214,1.082551
1.27641,1.276656,1.324099,1.439731,1.567512,1.550828,1.532254,1.345827,1.036731,1.109931,1.461165,1.434271,1.497602,1.777208,1.66972,1.520417,1.419673,1.389286,1.535287,1.43369,1.172742,1.209575,1.302888,1.370793,1.285728,1.215085,1.224911,1.17633
1.680083,1.608425,1.538841,1.604975,1.836999,1.860362,1.795868,1.673049,1.359661,1.247419,1.470535,1.573475,1.850427,2.210626,2.062664,1.813523,1.586098,1.524009,1.817436,1.873213,1.526379,1.425209,1.517693,1.501557,1.414975,1.413112,1.339369,1.254652
2.038726,1.850644,1.658857,1.777683,2.119697,2.130837,1.972905,1.937928,1.730842,1.4377,1.443817,1.684921,2.187247,2.508747,2.276228,1.965026,1.666416,1.549101,1.896286,2.160466,1.831697,1.609714,1.706134,1.596822,1.506518,1.616638,1.523057,1.378152
2.141096,1.917862,1.633869,1.724663,2.129735,2.138986,1.882792,1.947212,1.925631,1.552335,1.424225,1.765749,2.273839,2.426593,2.164673,1.855375,1.596963,1.479319,1.75619,2.097511,1.864599,1.676591,1.762814,1.644598,1.606007,1.779925,1.763547,1.586123
1.809972,1.687706,1.42021,1.366725,1.689986,1.715711,1.463425,1.593771,1.746284,1.476419,1.33624,1.681144,1.978843,1.887664,1.662006,1.435146,1.311207,1.277158,1.401548,1.638752,1.548271,1.451374,1.478549,1.439099,1.486167,1.672028,1.768464,1.601664
1.322877,1.282879,1.063718,0.968785,1.1534,1.136254,1.005438,1.112642,1.239212,1.14462,1.079213,1.344092,1.45264,1.228162,1.058617,0.9855,1.006543,1.006701,1.00097,1.126617,1.133249,1.071945,1.068677,1.128895,1.189064,1.28976,1.433675,1.375675
1.004589,0.939545,0.815252,0.900428,1.012159,0.839043,0.727775,0.759245,0.761444,0.768152,0.857765,1.035386,1.010923,0.835274,0.745888,0.820774,1.001941,1.016069,0.970815,1.016884,0.920409,0.800123,0.87909,1.01765,1.027636,0.960574,1.027745,1.173346
0.91669,0.870144,0.828981,1.077951,1.193587,0.910865,0.727855,0.658308,0.628126,0.724851,0.896029,1.016969,0.948091,0.850813,0.76962,0.844009,1.13452,1.208299,1.212083,1.245069,0.978408,0.752759,0.947271,1.146103,1.084735,0.884849,0.936346,1.23623
1.058072,1.055373,1.052542,1.333846,1.40104,1.038781,0.77858,0.622968,0.593309,0.768249,1.055715,1.225273,1.098313,0.923394,0.840852,0.975276,1.303606,1.438227,1.586914,1.629627,1.141773,0.889975,1.245836,1.486072,1.332088,0.942118,1.041627,1.479762
1.272441,1.213732,1.212017,1.526239,1.524431,1.09449,0.800936,0.594195,0.536185,0.767392,1.25677,1.508837,1.25677,0.905787,0.829101,1.211169,1.667034,1.759802,1.890804,1.884174,1.263114,1.095323,1.542414,1.729336,1.528259,0.999564,1.14334,1.715325
1.410621,1.191278,1.152865,1.487784,1.462317,1.101134,0.882526,0.65544,0.53286,0.709987,1.281244,1.559252,1.234708,0.814967,0.752324,1.351024,1.898504,1.872537,1.876436,1.808888,1.253987,1.250844,1.707178,1.74046,1.491559,0.952993,1.076173,1.696124
1.262275,0.965681,0.943753,1.216883,1.150677,0.968714,0.903677,0.689404,0.514151,0.58606,1.041996,1.24461,1.012595,0.77728,0.761172,1.287378,1.701142,1.582439,1.534213,1.413523,1.057737,1.227394,1.606912,1.460992,1.185623,0.814505,0.855678,1.364037
0.850062,0.632801,0.654298,0.788575,0.683491,0.673947,0.765834,0.626976,0.474408,0.507261,0.709231,0.775823,0.717153,0.699396,0.73292,0.980534,1.13295,1.00556,0.984008,0.90293,0.742797,0.939863,1.172298,0.955812,0.770144,0.671839,0.676415,1.011496
0.434499,0.370811,0.413431,0.40648,0.331635,0.398328,0.54642,0.540295,0.454242,0.429364,0.469534,0.539075,0.534145,0.591421,0.626273,0.624157,0.636385,0.570814,0.546784,0.528079,0.486982,0.566514,0.682019,0.549355,0.516798,0.596222,0.555898,0.72293
0.330692,0.292041,0.30459,0.25555,0.238696,0.284757,0.357545,0.44911,0.438643,0.338376,0.396341,0.499604,0.403688,0.451625,0.503296,0.510889,0.571631,0.471693,0.353034,0.310912,0.372458,0.420021,0.470972,0.44044,0.453653,0.502324,0.416781,0.456079
0.378413,0.302401,0.300761,0.245824,0.223251,0.218466,0.2453,0.382686,0.385163,0.246435,0.348409,0.464502,0.352782,0.37957,0.439635,0.495972,0.546055,0.421902,0.282777,0.209224,0.301264,0.368938,0.355493,0.383279,0.409909,0.375806,0.296137,0.313261
0.424726,0.293048,0.271239,0.227577,0.185593,0.190232,0.227993,0.323865,0.308207,0.181867,0.29097,0.408405,0.339764,0.332212,0.343679,0.407157,0.418369,0.309652,0.205944,0.146922,0.21995,0.314986,0.293675,0.319944,0.370925,0.28458,0.204464,0.236321
0.426317,0.257292,0.214561,0.202166,0.167738,0.191088,0.222386,0.266941,0.225686,0.144326,0.278845,0.40996,0.346601,0.269839,0.2481,0.28674,0.253423,0.187188,0.152988,0.141842,0.178798,0.293108,0.300114,0.269158,0.323945,0.234895,0.151967,0.183388
0.379767,0.221168,0.153596,0.169541,0.184078,0.210913,0.21276,0.226561,0.153145,0.118145,0.28077,0.387898,0.31086,0.229633,0.239718,0.238958,0.18101,0.154105,0.139364,0.155579,0.182827,0.298087,0.344375,0.281534,0.277724,0.206095,0.147853,0.166649
0.303126,0.180955,0.103814,0.122911,0.191514,0.239294,0.198473,0.171475,0.09727,0.095854,0.248917,0.302524,0.232336,0.219899,0.255912,0.216695,0.156934,0.141147,0.13396,0.166469,0.198004,0.323842,0.385072,0.291863,0.221505,0.174593,0.166572,0.174077
0.240348,0.139536,0.082257,0.088604,0.175318,0.238676,0.172573,0.124751,0.075621,0.082056,0.188372,0.194902,0.146322,0.190806,0.240315,0.17948,0.121972,0.119551,0.122268,0.154237,0.192449,0.323448,0.371068,0.258874,0.175751,0.164967,0.177973,0.178476
0.199498,0.108537,0.097155,0.092399,0.146355,0.197982,0.157587,0.119284,0.085051,0.080671,0.145655,0.159956,0.132063,0.155918,0.189729,0.160287,0.109212,0.113189,0.109852,0.115365,0.151737,0.267716,0.294219,0.198144,0.162309,0.167664,0.160189,0.153975
0.174367,0.106447,0.116381,0.104627,0.106969,0.13542,0.127885,0.123593,0.109343,0.099515,0.159459,0.186362,0.157567,0.133734,0.127327,0.143081,0.12963,0.110031,0.093724,0.079091,0.094897,0.175726,0.204583,0.153856,0.136575,0.149628,0.119053,0.105783
