-0.001551,-0.002135,-0.002108,-0.001354,-0.001686,-0.001834,-0.003227,-0.00207,-0.002468,-0.002257,-0.002299,-0.002817,-0.003111,-0.003068,-0.002731,-0.002082,-0.002336,-0.002123,-0.001785,-0.002637,-0.002146,-0.00136,-0.001493,-0.00137,-0.001503,-0.001219,-0.001256,-0.001629
-0.000967,-0.001225,-0.000188,-0.000281,-0.001361,-0.001328,-0.001719,-0.00134,-0.001796,-0.001254,-0.000722,-0.001614,-0.001538,0.000213,0.00084,-0.000179,-0.000713,-0.000567,-0.001101,-0.002426,-0.001927,-0.001101,-0.001392,-0.001033,-0.00084,-0.000633,-0.000792,-0.000998
-0.001179,-0.000673,-0.00046,-0.000263,-0.000602,-0.000715,-0.001068,-0.001096,-0.001163,-0.001288,-0.000482,-0.000507,-0.000404,-0.000359,-2.4e-05,0.000122,0.000108,0.000234,-1e-05,-0.00056,-0.00066,-0.000542,-0.000264,-0.000335,-0.000679,-0.000347,-5.6e-05,-7.9e-05
-0.00092,-0.000102,-0.000849,-0.000365,0.000375,0.00012,-8e-05,-0.000549,-0.000148,-0.000787,-0.000226,0.000505,0.000293,-0.001309,-0.001313,-0.000277,0.000225,0.000373,0.000526,0.00077,0.000621,0.000302,0.000783,0.000275,-0.000476,-0.000274,0.00028,0.000547
0.000813,0.001276,0.001157,0.000621,0.000945,0.001082,0.002585,0.001261,0.001909,0.001614,0.001609,0.001931,0.001764,0.002072,0.001822,0.000723,0.001072,0.001141,0.000698,0.000928,0.001182,0.000939,0.000788,0.000724,0.000916,0.000353,0.000363,0.000904
0.000357,6e-06,0.000121,0.000139,-0.00036,-0.000319,0.000296,0.000302,0.000309,0.00029,0.000108,-0.000143,-7.7e-05,0.000896,0.000498,-0.000354,-0.000292,-0.000275,-0.000348,-0.000693,-0.000535,-0.000128,-0.000531,-0.000122,0.000532,9e-06,-0.000316,-0.000256
-0.000684,-0.001546,-0.001729,-0.000615,-0.000929,-0.001288,-0.002796,-0.000952,-0.002077,-0.001873,-0.001812,-0.002115,-0.001916,-0.002328,-0.002557,-0.001227,-0.00151,-0.00172,-0.000883,-0.001172,-0.001418,-0.000783,-0.00088,-0.000601,-0.000564,-0.000322,-0.000452,-0.001067
0.000797,0.000474,0.000656,0.000373,0.000512,0.000589,0.000372,0.001176,0.000281,0.000606,0.000432,0.000365,0.00066,0.000613,0.000576,0.000982,0.000509,0.000226,0.000468,0.00118,0.000737,0.00029,0.000365,0.000414,0.000495,0.000665,0.000488,8.7e-05
0.001561,0.001885,0.001888,0.000675,0.001118,0.001468,0.002441,0.001732,0.002414,0.00234,0.00146,0.001858,0.001899,0.001851,0.001853,0.001224,0.00134,0.001476,0.001084,0.002414,0.001973,0.000778,0.000945,0.000593,0.000889,0.000805,0.000603,0.000809
2.8e-05,0.000139,-0.000382,-4e-04,0.000248,0.000299,4e-05,-0.000618,0.000727,0.000531,-0.000356,8.1e-05,-0.000456,-0.001625,-0.00132,-0.000881,-0.000373,-0.000133,-0.000181,0.000336,0.000508,0.000106,0.000272,-0.000317,-0.000609,-0.000308,-0.000137,8.9e-05
-0.000532,-0.000834,-0.000555,-0.000321,-0.000407,-0.000202,-0.000245,-0.001,-0.000418,-0.000168,-0.000153,-0.000532,-0.00089,-0.000623,-0.000161,-0.000345,-0.000392,-0.00062,-0.000855,-0.001673,-0.000865,-0.000264,-0.000388,-0.000321,-0.000697,-0.000463,-0.000227,-0.000204
-3e-04,-0.000462,0.000387,0.000367,-0.000519,-0.000403,-6.6e-05,-0.000508,-0.000946,-0.000559,0.000343,-0.000506,-1.4e-05,0.001741,0.001785,0.00069,0.000338,0.000122,-0.000255,-0.00149,-0.001265,-0.000335,-0.000534,9.1e-05,7.3e-05,-6.7e-05,-0.000109,-4.1e-05
-0.001352,-0.000975,-0.001027,-0.00031,-0.000582,-0.001055,-0.002142,-0.001324,-0.002489,-0.002379,-0.001179,-0.001413,-0.001042,-0.000961,-0.001146,-0.000631,-0.000749,-0.000474,-0.000112,-0.000806,-0.001204,-0.000514,-0.00035,-0.000154,-0.00047,-0.000465,-0.000421,-0.000422
-0.001153,-0.000463,-0.000862,-0.000619,-0.000197,-0.000573,-0.000951,-0.000215,-0.001046,-0.001363,-0.000711,-0.000119,-0.000452,-0.001318,-0.001446,-0.000648,-0.000675,-0.00032,-3.9e-05,1.1e-05,0.000163,-9.4e-05,0.000123,-0.000122,-0.000227,-0.000352,-0.000166,-0.000215
0.000922,0.001259,0.001256,0.000398,0.000508,0.000467,0.001945,0.001792,0.002406,0.001713,0.001256,0.002086,0.001978,0.00189,0.00157,0.00086,0.001001,0.001091,0.000735,0.001331,0.001606,0.000564,0.000431,0.00026,0.001055,0.00057,0.000556,0.000693
0.001093,0.000728,0.000467,0.000495,0.000363,0.000318,0.000709,0.00091,0.001913,0.001405,0.00051,0.000885,0.001122,0.00056,0.000312,0.000381,0.000679,0.000365,0.000559,0.001288,0.000751,0.000206,6.3e-05,6e-05,0.000531,0.000475,0.000365,0.000365
0.000202,-0.000461,-0.000694,2.7e-05,-4.1e-05,0.00025,-0.00041,-0.000139,-0.000309,-0.00017,-0.000566,-0.001015,-0.001011,-0.001448,-0.001193,-0.000343,-0.00041,-0.000899,-0.000362,-2.6e-05,-0.000618,-0.000252,-0.000279,-8e-05,-0.000491,-8.4e-05,-0.000291,-0.000556
0.000544,0.000173,0.000458,0.000191,0.000108,0.00067,0.000768,0.000171,-0.000395,0.000272,0.000209,-0.00061,-0.000633,0.000563,0.00088,0.000198,-0.000172,-8.1e-05,-0.000329,-0.000423,-0.000415,7.8e-05,-1.9e-05,0.000156,-4.5e-05,9.2e-05,-3e-04,-0.000349
0.000113,0.000268,0.000273,-0.000188,-1.2e-05,0.000178,-0.000238,-0.000755,-0.000717,2.5e-05,-2.9e-05,-0.000299,-0.000396,0.000207,0.000286,-0.000202,-0.000184,0.000325,-9e-05,-0.000277,3e-05,0.000171,0.000299,-2.3e-05,-6.6e-05,4.3e-05,2.6e-05,0.000147
