-0.010786,-0.009724,-0.006805,-0.005981,-0.006014,-0.006387,-0.005923,-0.006873,-0.00663,-0.005907,-0.004315,-0.003928,-0.004621,-0.005001,-0.00357,-0.005055,-0.006447,-0.006759,-0.004593,-0.004517,-0.00493,-0.004201,-0.004353,-0.004659,-0.004461,-0.003655,-0.00428,-0.006569
-0.003945,-0.00432,-0.002268,-0.001398,-0.002063,-0.001908,0.001432,0.002311,-0.000714,-0.001126,-0.001877,-0.002034,-0.003842,-0.003762,-0.001815,6.3e-05,-0.001668,-0.003291,-0.002312,-0.002503,-0.001546,-0.000979,-0.003008,-0.001934,-0.001913,-0.001718,-0.001304,-0.001321
0.000489,0.001379,0.001823,0.001321,0.001616,0.001395,0.000819,0.001013,0.000919,0.000974,0.000728,0.000226,-0.000369,-0.000681,-0.000476,-0.000221,0.000251,0.000667,-2.4e-05,-3.1e-05,-0.000158,-9.9e-05,-0.000477,-0.000163,-0.000165,-0.000167,-0.000357,0.001006
0.001434,0.002718,0.001113,-0.000415,0.001237,0.001429,-0.001863,-0.00308,3e-05,0.000216,0.001337,0.001337,0.002979,0.002663,0.001107,-0.001601,0.000433,0.002758,0.001837,0.00193,0.000672,0.000516,0.002484,0.001443,0.001268,0.001041,-8.3e-05,0.000142
0.006685,0.004833,0.001081,-2.3e-05,0.000503,0.001619,0.002814,0.003832,0.003644,0.00209,0.001147,0.001808,0.00347,0.003742,0.002299,0.002608,0.003556,0.004052,0.003256,0.00295,0.002912,0.002631,0.003436,0.002998,0.001956,0.001609,0.001946,0.001109
0.000241,-0.000992,-0.001529,-0.001017,-0.001946,-0.002164,0.000168,0.001578,0.000139,-0.000722,-0.001736,-0.000945,-0.001088,-0.001136,-0.000803,0.00085,-0.000101,-0.001167,-0.000418,-0.000636,-5.1e-05,-4.8e-05,-0.000998,-0.00086,-0.001165,-0.001016,3.2e-05,-0.000687
-0.010386,-0.008183,-0.003487,-0.001467,-0.001989,-0.003374,-0.004816,-0.006533,-0.005793,-0.004148,-0.002597,-0.002577,-0.004107,-0.004428,-0.002873,-0.003552,-0.005546,-0.006279,-0.004201,-0.004032,-0.003891,-0.003106,-0.003826,-0.003745,-0.001897,-0.001888,-0.002583,-0.001937
-0.000651,-2.2e-05,0.002837,0.003475,0.003392,0.003381,0.001909,0.00093,0.000475,0.001745,0.002054,0.000958,-0.000795,-0.000755,0.00012,0.000706,2.5e-05,-0.000466,-0.000776,-0.000523,-0.000239,-0.000383,-0.000972,-0.000106,0.001399,0.001305,0.000924,0.00249
0.009818,0.007743,0.004531,0.003275,0.003195,0.004122,0.004493,0.006189,0.005254,0.004986,0.003573,0.002475,0.002616,0.003153,0.00246,0.003466,0.005386,0.00541,0.003179,0.003645,0.003912,0.002233,0.001933,0.00285,0.001869,0.001751,0.002655,0.003215
0.001814,0.001286,-0.002276,-0.003244,-0.003171,-0.003062,-0.002842,-0.002707,-0.001066,-0.001439,-0.000867,-0.000406,0.002103,0.002519,0.000903,-0.001281,0.000419,0.001484,0.001413,0.001752,0.000912,0.000643,0.002081,0.00127,-0.000691,-0.000481,-0.000407,-0.002696
-0.004344,-0.00357,-0.003239,-0.002331,-0.002821,-0.003474,-0.002265,-0.00293,-0.002663,-0.003556,-0.002702,-0.001339,-3.6e-05,-0.000162,-0.000851,-0.00176,-0.002664,-0.002362,-0.001123,-0.001925,-0.002354,-0.000884,0.00068,-0.000511,-0.001464,-0.001056,-0.001178,-0.003162
-0.000981,-0.000503,0.002157,0.003189,0.002631,0.001911,0.00299,0.003693,0.001622,0.000935,-0.00018,1.6e-05,-0.001712,-0.002004,-0.000609,0.001994,0.000226,-0.000989,-0.000923,-0.001878,-0.000753,6.5e-05,-0.001151,-0.000983,-2.1e-05,-0.00023,0.000437,0.002625
-0.003002,-0.001779,0.000611,9.2e-05,0.001397,0.001729,-0.000308,-0.001113,-0.000765,0.000673,0.000753,-0.000246,-0.002139,-0.002504,-0.000671,-0.000126,-0.000806,-0.001276,-0.001234,-0.000794,-0.000727,-0.000529,-0.002279,-0.001924,1.9e-05,-0.00012,-0.001143,0.000859
-0.002028,-0.00194,-0.002539,-0.003936,-0.00237,-0.000773,-0.00212,-0.003378,-0.001954,-0.000858,0.000244,-0.00026,-0.000291,-0.000625,-0.00029,-0.002274,-0.00132,-0.000262,-0.000342,0.000475,-0.000793,-0.001535,-0.000917,-0.000687,-0.000475,-0.000157,-0.001863,-0.0035
0.006822,0.004414,0.000564,-0.000106,-0.001069,-0.000449,0.00205,0.003763,0.003029,0.001529,0.000441,0.001034,0.002401,0.002635,0.001239,0.000953,0.003038,0.003838,0.002736,0.002868,0.002943,0.001329,0.002161,0.002694,0.000856,0.000777,0.002068,0.00091
0.003701,0.003218,0.001394,0.002421,0.000765,-0.000738,0.000295,0.001255,0.001202,0.000285,-0.000417,0.000322,0.002087,0.002577,0.000442,0.000834,0.001284,0.001032,0.00116,0.000926,0.001821,0.00222,0.002317,0.00172,0.00104,0.000489,0.002066,0.003175
-0.005691,-0.003477,-7e-06,0.001045,0.001535,0.000364,-0.002181,-0.004225,-0.002965,-0.002036,-0.000662,-0.000648,-0.000607,-0.000591,-0.001105,-0.001422,-0.003374,-0.003958,-0.002381,-0.00275,-0.002545,-0.001004,-0.000567,-0.00158,0.000153,-0.000168,-0.000774,-7.7e-05
-0.002662,-0.002618,0.000603,0.000544,0.00174,0.002458,0.001566,0.001493,0.000515,0.000667,0.000759,-7.9e-05,-0.002247,-0.002241,-0.000403,0.000659,-0.00075,-0.001408,-0.00133,-0.001595,-0.001335,-0.001373,-0.00216,-0.00138,-0.000417,-0.000345,-0.000841,-0.000879
0.002392,0.000916,-0.000418,-0.000704,-0.000894,-0.000285,0.001049,0.002838,0.001573,0.001631,0.000694,-6.9e-05,-0.001278,-0.001285,0.000327,0.001575,0.002146,0.002157,0.001035,0.001495,0.001166,0.000381,-0.001175,-1e-04,-0.001261,-0.000407,-0.000478,-0.001193
