-0.000189,-0.000267,-0.000303,-0.000343,-0.000206,-0.000194,-0.000148,-0.000232,-0.000213,-0.000174,-0.000201,-0.000198,-0.000141,-0.000153,-0.000157,-0.000154,-0.000134,-0.000162,-0.000136,-0.000153,-0.000178,-0.000159,-9.8e-05,-0.000161,-0.00019,-0.000132,-0.000135,-0.000116
-0.000156,-0.000264,-0.000321,-0.000413,-0.000228,-0.00017,-0.000162,-0.000264,-0.000257,-0.000173,-0.000183,-0.000211,-0.000174,-0.000154,-0.000186,-0.000178,-0.000153,-0.000204,-0.000155,-0.000136,-0.000151,-0.000136,-7.7e-05,-0.000184,-0.000231,-0.000128,-0.000137,-0.000105
8e-06,1.2e-05,4e-06,-4.9e-05,-4.7e-05,2.4e-05,-2.7e-05,-2.2e-05,-5.2e-05,-1.9e-05,1.6e-05,-1.2e-05,-4.2e-05,-1.4e-05,-4.1e-05,-3.2e-05,-2.7e-05,-5.5e-05,-2.9e-05,2.4e-05,5.2e-05,8e-06,-1e-06,-1.7e-05,-3.7e-05,4e-06,-6e-06,8e-06
6.5e-05,0.000167,0.000235,0.000262,0.000113,0.00011,6.7e-05,0.000175,0.000149,0.000129,0.000152,0.000139,8.7e-05,9.4e-05,0.000102,9.2e-05,7.7e-05,8.7e-05,6.3e-05,0.000108,0.000137,8.4e-05,3.7e-05,0.000149,0.000176,1e-04,9.6e-05,8.5e-05
2.8e-05,5.2e-05,1e-04,0.000177,0.000103,3.9e-05,5.8e-05,0.000135,0.00016,0.000106,7.1e-05,0.000101,1e-04,9e-05,8.8e-05,8.5e-05,7.9e-05,0.000113,5.6e-05,1.9e-05,-2e-06,4e-05,3.1e-05,0.000111,0.000154,6.6e-05,7.2e-05,4.6e-05
-2.2e-05,-9.6e-05,-0.000119,-8.9e-05,3e-06,-4.4e-05,2e-06,-3.8e-05,-3e-06,-1.6e-05,-6.6e-05,-4.4e-05,2e-06,-7e-06,-1.4e-05,-4e-06,5e-06,2.8e-05,-6e-06,-8.4e-05,-0.000136,-2.3e-05,-3e-06,-5.5e-05,-3.8e-05,-3.7e-05,-2.5e-05,-3.7e-05
-6.4e-05,-7.7e-05,-0.000101,-0.000158,-4.6e-05,-4.4e-05,-3.4e-05,-0.00012,-0.000145,-9.5e-05,-8.8e-05,-0.000119,-8.1e-05,-9e-05,-6.2e-05,-6.4e-05,-6.5e-05,-7.8e-05,-4.1e-05,-4.7e-05,-7.9e-05,-5.3e-05,-4.5e-05,-0.00014,-0.000166,-9.6e-05,-8.1e-05,-6.1e-05
-4.6e-05,2.1e-05,2.3e-05,-2.3e-05,-3.6e-05,-2e-06,-3.8e-05,-6.5e-05,-0.000109,-8.9e-05,-3.3e-05,-4.7e-05,-4.8e-05,-5.4e-05,-3.1e-05,-4.6e-05,-6.8e-05,-9e-05,-1.9e-05,4.8e-05,6.2e-05,-5e-05,-4.3e-05,-6.7e-05,-0.000116,-5.4e-05,-4e-05,-1.8e-05
6e-05,7.6e-05,5.9e-05,9.6e-05,1e-05,1.4e-05,-2.2e-05,2.1e-05,5.3e-05,3.6e-05,6e-05,9.3e-05,5.1e-05,6.6e-05,4.4e-05,1.9e-05,0,9e-06,1.4e-05,7e-05,0.00011,2.4e-05,3e-05,8.8e-05,7.7e-05,5.9e-05,5.1e-05,4.5e-05
9.2e-05,1.6e-05,-2.8e-05,3.5e-05,3e-06,-3.8e-05,-2.1e-05,4.5e-05,0.000115,9.2e-05,5.8e-05,0.000113,6.5e-05,6.4e-05,2.8e-05,2.8e-05,4.8e-05,7.2e-05,-3e-06,-2.3e-05,1e-06,5.2e-05,5.5e-05,0.000106,0.000145,8.9e-05,5.9e-05,3.5e-05
-2.5e-05,-5.4e-05,-5.1e-05,-6.6e-05,-3.4e-05,-6.6e-05,-1.5e-05,1.3e-05,1.4e-05,1e-05,-1.6e-05,-2e-06,-1.8e-05,-5.6e-05,-6.2e-05,-2.7e-05,2e-05,1.1e-05,-3.1e-05,-8.6e-05,-8.6e-05,2e-06,-8e-06,-2.3e-05,9e-06,-4e-06,-8e-06,-2.2e-05
-6.6e-05,1.6e-05,7.4e-05,-1.7e-05,1.3e-05,4.6e-05,6e-05,3e-06,-8e-05,-4.7e-05,-2.6e-05,-9.2e-05,-6.9e-05,-7.4e-05,-4.2e-05,-1.7e-05,-4e-06,-4.4e-05,9e-06,-1e-06,-3e-06,7e-06,-3.7e-05,-9.3e-05,-9.8e-05,-6.2e-05,-2.4e-05,-1e-05
1.6e-05,5.6e-05,8.5e-05,5.5e-05,5.3e-05,0.00013,9.7e-05,0,-6.7e-05,-5.1e-05,-2.4e-05,-9e-05,-5.4e-05,8e-06,5e-05,4.4e-05,3e-06,-1e-05,6.1e-05,7.6e-05,8.4e-05,2.1e-05,-9e-06,-4.8e-05,-7.8e-05,-4e-05,-1.4e-05,1.5e-05
5.9e-05,-2.2e-05,-4e-05,4.3e-05,2.1e-05,2.5e-05,1.5e-05,-1.4e-05,3.6e-05,1.3e-05,-6e-06,-9e-06,-1e-06,5.5e-05,9.7e-05,6.9e-05,9e-06,5.1e-05,4.9e-05,4.8e-05,5e-05,-6e-06,1.7e-05,5.7e-05,3.7e-05,1.4e-05,-1e-05,3e-06
-3e-06,-9.1e-05,-0.000118,-2.3e-05,-3.9e-05,-0.000126,-8.6e-05,-1e-05,9.8e-05,5.5e-05,1.9e-05,7.2e-05,4.6e-05,1.1e-05,2.5e-05,5e-06,-6e-06,5.1e-05,-9e-06,-2.9e-05,-4.5e-05,-3.3e-05,1.4e-05,8.8e-05,9.7e-05,3.4e-05,-3e-06,-1.7e-05
-5.6e-05,-3.8e-05,-5.3e-05,-5.4e-05,-5.2e-05,-0.000106,-8.2e-05,1.5e-05,3.6e-05,6e-06,1.3e-05,8e-05,4.6e-05,-5.5e-05,-8.7e-05,-7.1e-05,-2.3e-05,-4e-06,-4.6e-05,-6.1e-05,-7.7e-05,-9e-06,3e-06,3e-06,2.7e-05,1.3e-05,3e-06,-1.7e-05
-3.9e-05,8.8e-05,8.5e-05,-2.2e-05,4e-06,4.5e-05,-5e-06,1.9e-05,-6.3e-05,-2.9e-05,0,1e-05,-6e-06,-5.3e-05,-9e-05,-6.2e-05,-1.5e-05,-5.5e-05,-4.2e-05,-1.3e-05,-4e-06,4.2e-05,4e-06,-6.4e-05,-4.6e-05,0,1.8e-05,1e-05
-2e-05,7.5e-05,6.4e-05,-2.4e-05,2.5e-05,0.000101,3.3e-05,-2.9e-05,-0.000105,-5.7e-05,-4.6e-05,-9e-05,-6.7e-05,-9e-06,-2.8e-05,-8e-06,-1e-05,-7.1e-05,-2.7e-05,1.7e-05,3.2e-05,1e-06,-1.5e-05,-5.9e-05,-7.2e-05,-2e-05,7e-06,1.5e-05
3e-06,-6.3e-05,-5.3e-05,-1.4e-05,8e-06,1.7e-05,2.3e-05,-6.3e-05,-5.5e-05,-4.1e-05,-3.1e-05,-8.5e-05,-4.9e-05,4.1e-05,4.3e-05,3.9e-05,-9e-06,-3.6e-05,-6e-06,0,-1e-06,-5.5e-05,-2.4e-05,1.4e-05,-1.9e-05,-2.7e-05,-2.2e-05,-3e-06
