0.000184,1.9e-05,-2.2e-05,-4e-05,-0.000101,-0.000414,-0.000133,0.001214,0.00072,0.000562,0.001297,0.00089,-9.8e-05,-0.000594,-0.00018,4.3e-05,-0.00051,-0.002194,-0.000628,-5.6e-05,-4.6e-05,3e-04,0.001251,0.000602,-7.6e-05,-0.000638,-0.000129,4.4e-05
0.000322,0.000144,6e-06,-1.2e-05,-4.7e-05,-0.000174,9.8e-05,0.000958,0.000377,0.000371,0.000977,0.000684,0.000188,-4.8e-05,-2.9e-05,0.000141,0.000482,0.001206,0.000188,5.1e-05,8.9e-05,0.000249,0.000864,0.000502,8.6e-05,-0.000258,1.2e-05,0.000303
0.000162,4.4e-05,2.4e-05,2.9e-05,4.6e-05,-8e-06,0.00022,0.000635,0,0.000131,0.000595,4e-04,1.3e-05,-3.3e-05,1.3e-05,3.9e-05,-0.000349,-0.001474,-0.000316,-3.7e-05,-4.3e-05,7.8e-05,0.000522,0.00037,0.000194,0.00026,0.000132,0.000145
0.000188,7.4e-05,4.6e-05,6.1e-05,0.000111,8.3e-05,0.000241,0.000391,-0.00022,-3.5e-05,0.000246,0.000153,0.000165,0.000356,0.000163,6.3e-05,-9.1e-05,-0.000513,-2.9e-05,9.1e-05,6.6e-05,2e-06,5.1e-05,0.000148,0.000199,0.000433,0.000254,0.000137
0.000274,0.000136,2.4e-05,2e-05,2.1e-05,5.1e-05,0.000133,0.00017,-0.00034,-0.000175,-5.7e-05,-5.5e-05,0.000297,0.000515,0.000234,0.000109,0.000861,0.003132,0.000813,8.1e-05,0.000153,-2e-05,-0.000729,-0.000281,0.000161,0.000252,0.000213,0.000289
4.7e-05,-4.6e-05,-4.3e-05,-5.8e-05,-0.000112,-0.000222,-0.000302,-6.3e-05,-0.000367,-0.000265,-0.000278,-0.000258,-0.000225,-0.000448,-0.000108,-3.6e-05,-0.000221,-0.000644,-0.000204,-0.000111,-9.3e-05,-0.00023,-0.001539,-0.000808,-2.6e-05,-0.000191,-0.000152,-0.000164
9e-05,4e-06,-1.2e-05,-1.5e-05,-2.6e-05,-0.000105,-0.000183,-0.000119,-0.000225,-0.000249,-0.00038,-0.000354,-0.000186,-0.000516,-0.000227,5e-06,-0.000407,-0.001838,-0.000555,-1.5e-05,-7.2e-05,-0.000297,-0.001544,-0.000762,-5.9e-05,-0.000181,-0.000153,-0.000188
0.000215,0.000122,4e-05,4.8e-05,7.3e-05,2e-04,0.000278,-0.000123,-5.6e-05,-2e-04,-0.000392,-0.000384,0.000191,0.000303,2.7e-05,7.2e-05,0.000395,0.001113,0.000277,4.8e-05,7.3e-05,-0.000173,-0.001156,-0.000387,7.3e-05,0.000178,9.4e-05,0.000219
5.1e-05,-1.1e-05,1.1e-05,2.5e-05,3.3e-05,0.000173,0.000251,-0.000192,9.7e-05,-0.000107,-0.000322,-0.000394,8.5e-05,0.000413,0.000158,-1.6e-05,-0.000106,-0.000268,3.7e-05,8e-06,3e-05,-0.000156,-0.001134,-0.000366,0.000114,0.000341,0.000107,2.5e-05
8.1e-05,-8e-06,-1.3e-05,-4e-06,-2.3e-05,2.6e-05,-7.2e-05,-0.000301,2e-04,-1e-06,-0.000212,-0.000347,-8e-06,0.000131,0.00011,2.8e-05,-0.000159,-0.000651,-0.000126,3.1e-05,4.1e-05,-0.00021,-0.001175,-0.000457,3.5e-05,0.000121,4.3e-05,-1.2e-05
0.000121,3.5e-05,-2.5e-05,-2.8e-05,-6.2e-05,-0.000149,-0.000419,-0.000465,0.000177,6.2e-05,-1e-04,-0.000283,-0.000131,-0.000225,-3.7e-05,2.2e-05,0.00042,0.001548,0.000354,-2.6e-05,1.2e-05,-0.000207,-0.000871,-0.000265,-8.5e-05,-0.000308,-9.2e-05,9.9e-05
-6e-06,-4.6e-05,-2.3e-05,-1.2e-05,-5e-06,-0.000183,-5e-04,-0.000566,0.000101,0.000117,1.1e-05,-0.000208,-0.000226,-0.000377,-0.000119,-2.4e-05,-4.3e-05,-0.00019,-8.7e-05,-5.1e-05,-9.9e-05,-0.000152,-0.000234,0.000118,-3.4e-05,-0.000234,-0.00014,2.2e-05
6.8e-05,1.4e-05,1.6e-05,3.6e-05,6.4e-05,5.1e-05,-0.000158,-0.000622,-2.3e-05,0.000138,7.5e-05,-0.000121,3.5e-05,3.8e-05,-5e-05,3e-05,-0.000304,-0.001559,-0.000429,9e-06,-3.9e-05,-5.8e-05,0.000366,0.000415,0.000127,0.000242,2.4e-05,9.2e-05
0.000116,4.9e-05,8e-06,1.8e-05,7e-06,0.000169,7e-05,-0.000698,-0.00017,0.000124,9.4e-05,-6.2e-05,0.000189,0.000354,5.3e-05,2.3e-05,0.000193,0.000578,0.000174,3.2e-05,5.5e-05,4.2e-05,0.000547,0.000444,0.000199,0.000363,0.000107,0.000263
-9e-06,-6.2e-05,-3.6e-05,-3e-05,-5.5e-05,-4.8e-05,-0.000292,-0.000773,-0.00029,9.8e-05,7.1e-05,-3.2e-05,1.6e-05,0.000106,0.000113,2e-06,0.000101,0.000628,0.000222,-2.4e-05,-1.8e-05,7.9e-05,0.000473,0.000297,7.5e-05,-4.4e-05,-4.4e-05,2.8e-05
3.4e-05,-3.2e-05,-2.7e-05,-2.2e-05,-2e-05,-0.000142,-0.000523,-0.000794,-0.000379,4.6e-05,-1e-05,-1.4e-05,-4.1e-05,-0.000144,7.9e-05,4.8e-05,-0.000111,-0.000475,-0.000133,-3.5e-05,-1.8e-05,5.9e-05,0.000551,3e-04,-4.2e-05,-0.000363,-0.000106,6e-05
7.2e-05,1.7e-05,-8e-06,-6e-06,1.3e-05,2.4e-05,-0.000196,-0.000722,-0.000415,-1.5e-05,-0.000118,-1.9e-05,-6.4e-05,-0.000221,-5e-05,7e-06,0.000152,0.000464,7.8e-05,-7e-06,-7e-06,3.7e-05,0.000686,0.000379,-2e-06,-0.000177,-5.9e-05,0.000217
2e-06,-2.9e-05,-7e-06,5e-06,2.2e-05,0.000113,3.8e-05,-0.000589,-0.000372,-6.3e-05,-0.000233,-2.5e-05,2.2e-05,-4e-06,-3.4e-05,0,2.6e-05,3e-05,-6e-06,-2.5e-05,-8e-05,2.7e-05,0.000562,0.000257,8.2e-05,0.000132,-2.1e-05,5.3e-05
3.9e-05,-1.2e-05,-5e-06,7e-06,-9e-06,5.7e-05,-9e-06,-0.000463,-0.000281,-0.000103,-0.000347,-3.3e-05,0.000169,0.000306,7.7e-05,2.9e-05,-0.000192,-0.000972,-0.000261,0,-8e-06,1.6e-05,0.000169,-5e-05,6.5e-05,0.000163,1.7e-05,2e-06
