0.024896,0.022587,0.026383,0.027601,0.024576,0.024782,0.021284,0.01585,0.017001,0.019017,0.018003,0.016241,0.017899,0.019947,0.018818,0.020415,0.020853,0.019327,0.019131,0.018053,0.015007,0.012521,0.012606,0.012287,0.011747,0.012755,0.014347,0.01313
0.030741,0.028051,0.03299,0.03441,0.030712,0.031025,0.026624,0.02002,0.021503,0.023898,0.022668,0.020419,0.022431,0.025048,0.023574,0.025684,0.026589,0.024584,0.023942,0.022472,0.018599,0.01538,0.015619,0.015455,0.014907,0.016185,0.018166,0.016624
0.039376,0.036493,0.043116,0.044669,0.039892,0.040256,0.034884,0.027031,0.028782,0.031514,0.030015,0.026988,0.02934,0.032872,0.030927,0.033694,0.035478,0.032589,0.031027,0.029157,0.024182,0.019866,0.020242,0.020388,0.019893,0.021529,0.02398,0.022021
0.042665,0.040546,0.047109,0.048163,0.043357,0.043403,0.039131,0.03261,0.033304,0.03531,0.033793,0.030251,0.032033,0.0357,0.034008,0.036874,0.039262,0.035763,0.033374,0.032008,0.027126,0.022312,0.022439,0.022779,0.022413,0.023808,0.025811,0.023886
0.042545,0.041296,0.044607,0.044958,0.042163,0.041541,0.041311,0.0386,0.03597,0.036185,0.034459,0.030209,0.030369,0.032877,0.032256,0.035165,0.038127,0.034891,0.03192,0.031699,0.027646,0.022724,0.023031,0.02398,0.023366,0.023229,0.023435,0.021817
0.047307,0.046613,0.04592,0.046064,0.046815,0.046451,0.050026,0.048662,0.041703,0.040923,0.038381,0.03264,0.031295,0.032653,0.033173,0.036741,0.040881,0.037517,0.033118,0.033781,0.030219,0.024669,0.026765,0.02961,0.027307,0.025063,0.023675,0.021573
0.056988,0.056358,0.052657,0.052407,0.05527,0.055464,0.060208,0.057372,0.048115,0.047494,0.043448,0.037257,0.036797,0.037522,0.036708,0.040508,0.047743,0.043726,0.036843,0.03879,0.035991,0.029613,0.033287,0.037592,0.032913,0.029167,0.027961,0.025371
0.058624,0.059166,0.054682,0.054078,0.057009,0.056801,0.060235,0.056531,0.048387,0.048269,0.043582,0.038319,0.039005,0.038579,0.035294,0.03819,0.047917,0.045049,0.037148,0.039192,0.037688,0.032456,0.036509,0.040671,0.034625,0.030236,0.029696,0.027503
0.050413,0.050993,0.047942,0.047773,0.049035,0.047148,0.047631,0.045243,0.041219,0.041199,0.038852,0.037659,0.039124,0.036797,0.031609,0.032574,0.040218,0.039706,0.034108,0.033931,0.033285,0.031163,0.033536,0.035821,0.030868,0.026888,0.026331,0.025195
0.046201,0.044223,0.04289,0.044743,0.04594,0.042376,0.03852,0.036714,0.035911,0.03536,0.037264,0.042312,0.046358,0.042458,0.035588,0.034085,0.035298,0.036958,0.035554,0.032812,0.033075,0.03288,0.030504,0.030097,0.029547,0.027017,0.024478,0.023954
0.057943,0.053282,0.051434,0.057651,0.063007,0.056936,0.048185,0.044512,0.044567,0.044066,0.046235,0.055455,0.06552,0.059241,0.048394,0.045768,0.042885,0.044518,0.04482,0.042807,0.045655,0.045053,0.037767,0.035629,0.038701,0.037844,0.033571,0.031306
0.083191,0.073702,0.073285,0.086899,0.097886,0.087197,0.070625,0.064554,0.066059,0.064769,0.063833,0.079844,0.100847,0.089446,0.070797,0.065113,0.058373,0.060214,0.062587,0.063862,0.070385,0.067106,0.054375,0.052733,0.059697,0.060853,0.054343,0.046151
0.118083,0.101874,0.10618,0.130389,0.149257,0.132555,0.10363,0.094183,0.097537,0.093363,0.090407,0.118089,0.15417,0.136464,0.105817,0.090748,0.077017,0.082223,0.089945,0.096296,0.106271,0.096821,0.076643,0.077513,0.089673,0.094298,0.086708,0.070891
0.155047,0.135199,0.145794,0.179602,0.204617,0.183411,0.142494,0.128582,0.130123,0.12112,0.121259,0.162541,0.21483,0.193017,0.148432,0.120035,0.096633,0.105947,0.119661,0.131755,0.145893,0.128163,0.100228,0.104904,0.12079,0.128996,0.124867,0.103665
0.186398,0.168254,0.178634,0.213777,0.238175,0.218729,0.175944,0.159865,0.151933,0.133621,0.143148,0.191852,0.249702,0.231957,0.182479,0.145737,0.116462,0.126153,0.138416,0.1519,0.16882,0.144188,0.11413,0.126303,0.141088,0.147613,0.151729,0.132863
0.208638,0.192553,0.191678,0.216617,0.236569,0.23176,0.20142,0.183411,0.158142,0.130753,0.151848,0.190235,0.231742,0.228103,0.190914,0.157353,0.133549,0.138213,0.139981,0.148666,0.161784,0.137972,0.118063,0.142393,0.151552,0.144205,0.151666,0.143817
0.235853,0.205311,0.184504,0.193561,0.215572,0.236627,0.227131,0.202998,0.162194,0.139358,0.170039,0.183308,0.189652,0.204758,0.194522,0.163731,0.145691,0.150842,0.155207,0.155596,0.148318,0.124745,0.118105,0.158389,0.163629,0.13178,0.131102,0.138063
0.255547,0.215068,0.171684,0.159924,0.190173,0.241285,0.254473,0.219594,0.164719,0.152044,0.192705,0.187404,0.167592,0.199189,0.208416,0.170933,0.149573,0.164073,0.183796,0.178099,0.149496,0.117383,0.116451,0.168744,0.173786,0.129063,0.121507,0.13335
0.247145,0.220311,0.176344,0.14404,0.169968,0.229366,0.250339,0.217034,0.163809,0.157372,0.190728,0.17508,0.160712,0.205699,0.219803,0.175185,0.141063,0.16043,0.191376,0.185359,0.149969,0.111533,0.110378,0.158553,0.162136,0.12113,0.117552,0.12897
0.201685,0.201447,0.180659,0.135637,0.144965,0.190634,0.198845,0.177917,0.141955,0.136148,0.154024,0.13918,0.14299,0.184194,0.191487,0.155208,0.122693,0.134351,0.161031,0.161465,0.139328,0.104474,0.093146,0.122418,0.12699,0.101604,0.103382,0.11354
0.150696,0.169999,0.171834,0.127617,0.12139,0.139686,0.12652,0.116451,0.10359,0.100269,0.10895,0.105359,0.123083,0.145502,0.138013,0.11978,0.104285,0.105136,0.12355,0.127809,0.114348,0.090543,0.073822,0.08325,0.084393,0.073593,0.082279,0.092727
0.117807,0.138832,0.13989,0.104927,0.100357,0.114419,0.098171,0.082926,0.080857,0.076811,0.077993,0.088611,0.109694,0.112325,0.092958,0.087631,0.087294,0.084558,0.094731,0.097176,0.089995,0.082078,0.066543,0.061954,0.059154,0.054096,0.065821,0.079084
0.101063,0.112216,0.097895,0.075914,0.086969,0.108053,0.094939,0.073273,0.076705,0.069355,0.060076,0.079638,0.097358,0.083821,0.061694,0.0646,0.07565,0.075152,0.074678,0.073951,0.073741,0.075659,0.065558,0.054644,0.050962,0.045722,0.049944,0.065113
0.095569,0.097057,0.077572,0.06376,0.076718,0.095034,0.084834,0.070113,0.080009,0.067789,0.056241,0.077047,0.079554,0.057767,0.046873,0.054728,0.061481,0.061576,0.058235,0.054798,0.05971,0.066983,0.063183,0.053085,0.047049,0.039603,0.034571,0.048944
0.085373,0.080245,0.07061,0.059049,0.058808,0.067205,0.06578,0.062739,0.071934,0.059995,0.055675,0.072416,0.063334,0.044258,0.044939,0.051508,0.047425,0.046456,0.046027,0.044392,0.050645,0.055677,0.054337,0.048869,0.0418,0.034028,0.027251,0.039009
0.072728,0.062422,0.060484,0.052261,0.044136,0.045915,0.0496,0.049931,0.05316,0.044751,0.045998,0.059654,0.051382,0.039274,0.044331,0.048599,0.04097,0.038539,0.037627,0.03738,0.03962,0.040177,0.045036,0.043507,0.032587,0.025419,0.023378,0.031146
0.065201,0.054968,0.052112,0.048147,0.038728,0.039897,0.045478,0.040562,0.039175,0.036011,0.034478,0.041763,0.038447,0.032406,0.038152,0.042488,0.040614,0.042168,0.039065,0.034538,0.031623,0.031042,0.040216,0.038373,0.025338,0.021814,0.022429,0.024045
0.059787,0.056963,0.054522,0.048838,0.038555,0.038815,0.044883,0.041687,0.041524,0.040453,0.034278,0.032908,0.030561,0.028088,0.034201,0.038625,0.042459,0.049114,0.04692,0.040193,0.036041,0.035372,0.039326,0.034552,0.024698,0.02496,0.025759,0.024018
0.059458,0.062738,0.060086,0.047413,0.039385,0.041797,0.043676,0.046303,0.056189,0.056805,0.044548,0.036622,0.033422,0.031646,0.037188,0.038355,0.041807,0.05036,0.052387,0.050924,0.046382,0.043093,0.039473,0.033969,0.028523,0.028859,0.031708,0.031379
0.06396,0.065811,0.059372,0.045444,0.042919,0.047171,0.042655,0.049447,0.070342,0.075664,0.05812,0.046086,0.04482,0.042071,0.043579,0.039172,0.042169,0.051943,0.055188,0.06124,0.062419,0.058676,0.049667,0.039818,0.03288,0.033375,0.04079,0.044755
0.065915,0.061256,0.049812,0.043223,0.048588,0.049532,0.040222,0.04824,0.073309,0.087173,0.073742,0.06064,0.060358,0.055038,0.053269,0.046681,0.051364,0.061868,0.059963,0.065607,0.0772,0.080162,0.067206,0.049192,0.037964,0.041194,0.053217,0.062177
0.059417,0.05001,0.03927,0.042184,0.054125,0.047448,0.035981,0.044228,0.066298,0.084866,0.080586,0.07034,0.071462,0.065179,0.060704,0.053623,0.060377,0.07208,0.065284,0.062087,0.081051,0.093768,0.077409,0.053237,0.0409,0.047626,0.061918,0.074001
0.053022,0.040835,0.036066,0.046091,0.057947,0.043774,0.031481,0.039174,0.05748,0.071406,0.071867,0.06621,0.068205,0.063047,0.059253,0.057299,0.061508,0.068883,0.059803,0.052391,0.073849,0.088404,0.070694,0.046073,0.036322,0.045826,0.059489,0.07061
0.044802,0.033658,0.037027,0.049696,0.054946,0.03859,0.028285,0.030601,0.04582,0.054658,0.05343,0.049652,0.050788,0.048467,0.049066,0.054099,0.052181,0.05218,0.044273,0.042486,0.06073,0.066677,0.050861,0.031226,0.025118,0.034989,0.045552,0.051707
0.036691,0.031332,0.040556,0.04902,0.050179,0.039494,0.030066,0.025716,0.041563,0.054415,0.043486,0.034447,0.033099,0.03684,0.042876,0.048117,0.04597,0.042601,0.03329,0.034639,0.048113,0.048095,0.03642,0.022839,0.016916,0.025849,0.033531,0.030327
0.034444,0.032309,0.039785,0.04257,0.048915,0.043573,0.029305,0.024298,0.041349,0.055252,0.037936,0.024262,0.023283,0.030204,0.036267,0.039452,0.046333,0.043452,0.028463,0.026305,0.036587,0.035136,0.026276,0.019156,0.014913,0.025545,0.031329,0.019654
0.033866,0.032992,0.032231,0.031586,0.044497,0.042392,0.023448,0.020679,0.039364,0.051042,0.033267,0.020444,0.01792,0.022354,0.028184,0.031018,0.041307,0.039753,0.023809,0.019204,0.022741,0.020736,0.018313,0.017189,0.015151,0.028106,0.030119,0.018427
0.037393,0.030822,0.021775,0.025371,0.040421,0.038118,0.018424,0.017316,0.038753,0.042116,0.024958,0.018422,0.01356,0.013888,0.021985,0.024287,0.031452,0.035285,0.021678,0.013538,0.012536,0.01146,0.015458,0.017271,0.015739,0.027599,0.029077,0.021336
0.039872,0.026143,0.017741,0.025774,0.034896,0.032448,0.017007,0.015854,0.036023,0.031865,0.01809,0.016538,0.012038,0.010406,0.018256,0.017781,0.020532,0.031245,0.021376,0.011012,0.012334,0.01202,0.015163,0.016017,0.014121,0.022871,0.025095,0.022568
0.035848,0.020569,0.017835,0.029101,0.030487,0.02821,0.018413,0.019981,0.032243,0.022839,0.013839,0.013669,0.012451,0.011853,0.018471,0.01631,0.014009,0.025204,0.020275,0.010575,0.014488,0.014261,0.014109,0.014611,0.011438,0.016261,0.019507,0.020392
