-0.01099,-0.004818,-0.003286,-0.002193,-0.00175,-0.000959,-0.000429,-0.000275,-0.00018,-0.000158,-0.000145,-0.000103,-8.3e-05,-2.8e-05,-2e-05,-3.2e-05,-3.1e-05,-0.000113,-0.000713,-0.000476,-0.000354,-0.007176,-0.025268,-0.013482,-0.011299,-0.001581,-0.005305,-0.021931
0.014425,0.00579,0.00357,0.002067,0.001669,0.001135,0.000601,0.000398,0.000247,0.00018,0.000137,0.000131,0.000106,2.9e-05,0,1.8e-05,1.7e-05,-7e-05,-0.000947,-0.000714,-0.003988,0.002476,0.015844,-0.002903,-0.010341,-0.00151,-0.003163,-0.015112
-0.003297,-0.001349,-0.000378,-0.000336,-0.000296,-0.000115,-0.000122,-0.000121,-8.2e-05,-2.8e-05,-9e-06,-1.9e-05,-1.2e-05,-9e-06,-1e-05,-9e-06,-1.2e-05,-8.1e-05,-0.00049,-0.000327,-0.001921,-0.007928,-0.01211,0.000862,0.002785,0.000483,0.002635,0.010403
-0.010894,-0.005,-0.003299,-0.001799,-0.001404,-0.001026,-0.000518,-0.000312,-0.000192,-0.00016,-0.000131,-0.000122,-0.000101,-2.9e-05,-1.1e-05,-1.7e-05,-1.6e-05,-1.6e-05,6.5e-05,6.5e-05,0.000997,0.004514,0.003954,0.00413,0.008848,0.001366,0.004261,0.019068
0.012067,0.0055,0.003249,0.002249,0.001796,0.000956,0.000502,0.000348,0.000238,0.000169,0.000139,0.000109,8.5e-05,3.1e-05,2.3e-05,3e-05,3.1e-05,0.000109,0.000458,0.000192,0.000293,0.00144,-0.003211,0.000779,0.005645,0.000736,-0.000307,0.00047
0.000628,0.000888,0.001051,0.00044,0.000268,0.000278,6.2e-05,-2e-06,1e-06,3.6e-05,4.3e-05,3.4e-05,3.3e-05,8e-06,1.1e-05,1e-06,-5e-06,3.6e-05,0.000422,9e-06,-0.00257,-0.014851,-0.036208,-0.010013,-0.005201,-0.000895,-0.004048,-0.016496
-0.010444,-0.005217,-0.003647,-0.002339,-0.00186,-0.001088,-0.000515,-0.00029,-0.000189,-0.000179,-0.000176,-0.000123,-1e-04,-2.9e-05,-1.4e-05,-2.5e-05,-2.2e-05,-7e-06,0.000249,-5.7e-05,-0.002683,0.000137,0.003907,-0.004313,-0.007524,-0.001122,-0.000689,-0.005477
0.006576,0.002861,0.001243,0.000844,0.000715,0.000451,0.000344,0.000243,0.000155,8.2e-05,5.5e-05,5.8e-05,4.4e-05,1.6e-05,2e-06,1.6e-05,2e-05,3.3e-05,3.9e-05,-2.9e-05,-0.000964,-0.002554,-0.002328,1.1e-05,-0.000688,-6.7e-05,0.002694,0.009619
0.002667,0.00172,0.001971,0.001002,0.00078,0.000554,0.000184,5.1e-05,2.2e-05,8.1e-05,0.00011,6.2e-05,5.5e-05,1e-05,1e-06,6e-06,1e-06,-5.2e-05,-0.000467,-0.000323,-0.001253,-0.009347,-0.023922,-0.00149,0.006062,0.000937,0.000713,0.005253
-0.006146,-0.003755,-0.002219,-0.001133,-0.000893,-0.000692,-0.000413,-0.000238,-0.000157,-0.000116,-1e-04,-9.6e-05,-8.3e-05,-2.5e-05,-1.3e-05,-1.6e-05,-1.6e-05,-7.1e-05,-0.000489,-0.000436,-0.00366,0.001269,0.005685,0.001063,0.003429,0.000479,-0.00144,-0.003781
0.002537,0.001486,-2e-06,0.000258,0.000262,6.1e-05,0.000146,0.000127,9.4e-05,2.5e-05,0,1.6e-05,7e-06,6e-06,2e-06,6e-06,1.1e-05,1.4e-05,-3.4e-05,-0.000255,-0.005556,-0.006423,-3.2e-05,0.000452,-0.002532,-0.000451,-0.001033,-0.004229
0.002528,0.002155,0.001828,0.000692,0.000563,0.000545,0.000232,8e-05,5.2e-05,8.1e-05,8.9e-05,7.8e-05,7.5e-05,1.8e-05,1.1e-05,8e-06,2e-06,1.1e-05,0.000164,-9.2e-05,-0.00419,-0.001107,0.016355,0.003906,-0.004583,-8e-04,0.001017,0.002302
-0.003039,-0.002852,-0.001536,-0.001039,-0.000758,-0.000458,-0.000304,-0.000152,-0.000108,-8.1e-05,-8.4e-05,-6.5e-05,-5e-05,-1.3e-05,-1e-06,-7e-06,-9e-06,1e-05,8.8e-05,-1.3e-05,-0.000322,0.005936,0.017506,0.001549,-0.00151,-0.000216,0.001436,0.004001
-0.000272,0.000108,-0.00085,-0.000228,-0.000159,-0.00018,4e-05,6.1e-05,4.2e-05,-1.8e-05,-2.9e-05,-1.8e-05,-2.8e-05,-1e-06,1e-06,6e-06,1.4e-05,4.4e-05,0.000174,0.000239,0.0027,-0.00596,-0.024772,-0.005435,0.002177,0.000442,-0.001079,-0.003629
0.001793,0.00229,0.001993,0.000947,0.00075,0.000532,0.000239,8.7e-05,6.1e-05,8.6e-05,0.000114,7.4e-05,6.7e-05,1.7e-05,6e-06,7e-06,9e-06,1.4e-05,0.000274,0.000485,0.003558,0.006348,0.013674,0.005805,0.004398,0.000734,-0.002017,-0.005629
-0.000137,-0.001708,-0.000304,-0.000111,-2.7e-05,-0.000112,-0.000182,-9.4e-05,-7.4e-05,-3.5e-05,-3.4e-05,-3.5e-05,-2.3e-05,-1.1e-05,-8e-06,-8e-06,-1e-05,-5e-06,6.4e-05,0.000271,0.003144,0.011703,0.02943,0.007659,0.001312,0.000184,0.001046,0.004719
-0.001296,-0.000557,-0.001446,-0.000538,-0.000497,-0.000371,-6.4e-05,-1.6e-05,-8e-06,-5.7e-05,-7.8e-05,-4.5e-05,-5.2e-05,-1.5e-05,-1.1e-05,-8e-06,-8e-06,-2e-05,-0.000356,-0.000206,0.002033,-0.003097,-0.016685,-0.005979,-0.003943,-0.000628,0.002178,0.007247
-0.00018,0.001503,0.001071,0.000306,0.000183,0.000271,0.000162,4.3e-05,4.5e-05,4.7e-05,5.7e-05,5.4e-05,5.1e-05,1.2e-05,3e-06,-2e-06,-5e-06,-5.9e-05,-0.000495,-0.000295,0.000899,0.002189,-0.000651,-0.003732,-0.00431,-0.000644,-0.00022,-0.002479
0.001555,-0.001251,0.000323,0.000158,0.000235,0.000104,-8.4e-05,-3.8e-05,-3.3e-05,7e-06,2e-06,-6e-06,1e-05,1e-06,5e-06,3e-06,-1e-06,-2e-05,-6e-05,3.2e-05,9e-05,0.000501,0.00279,0.000915,0.001175,0.000236,-0.002055,-0.008313
