0.010121,0.010556,0.010014,0.009393,0.010634,0.056876,0.240647,0.261163,0.195419,0.35516,0.361173,0.268986,0.471608,1.043717,1.32728,1.064003,0.864718,0.780952,0.841617,0.978242,1.020838,1.065131,0.89902,0.464428,0.168119,0.184439,0.400594,0.336449
0.012016,0.012318,0.011898,0.011241,0.012781,0.064069,0.263767,0.287188,0.226735,0.412587,0.415588,0.308429,0.534086,1.176138,1.501273,1.195889,0.952249,0.850816,0.921359,1.074898,1.123719,1.180274,1.001409,0.522799,0.19119,0.207169,0.445465,0.373639
0.015676,0.015346,0.015066,0.014534,0.016632,0.073201,0.28521,0.313001,0.268962,0.486773,0.483059,0.356854,0.621893,1.359419,1.73291,1.37331,1.062977,0.930205,1.00651,1.163919,1.205403,1.282673,1.097692,0.578106,0.21623,0.228893,0.482462,0.403863
0.021328,0.019763,0.019065,0.018707,0.02094,0.077605,0.279868,0.307265,0.278435,0.491136,0.479752,0.35697,0.679403,1.506979,1.886878,1.494001,1.147016,0.985369,1.045164,1.147733,1.123876,1.193161,1.025664,0.533738,0.203751,0.209624,0.428754,0.360523
0.034231,0.031289,0.029617,0.028444,0.028949,0.081686,0.269216,0.292898,0.263565,0.447434,0.434278,0.335056,0.742198,1.670809,2.062503,1.701633,1.383982,1.195865,1.190088,1.183164,1.050472,1.086879,0.926535,0.45853,0.173792,0.180092,0.35083,0.293803
0.063289,0.059315,0.056498,0.053279,0.050591,0.105996,0.311136,0.324801,0.265309,0.430369,0.424799,0.359285,0.858384,1.845884,2.283892,2.072458,1.81978,1.60711,1.483312,1.317212,1.11542,1.120664,0.913809,0.423076,0.162729,0.182704,0.31752,0.249543
0.116536,0.110696,0.106442,0.100763,0.094543,0.172231,0.46992,0.463058,0.344016,0.567893,0.543634,0.448184,1.079516,2.175665,2.79011,2.793229,2.558867,2.351511,2.136033,1.808742,1.517425,1.399886,1.035968,0.469508,0.198889,0.229317,0.368204,0.268404
0.193679,0.185798,0.180769,0.173838,0.164645,0.283457,0.738812,0.702794,0.502813,0.850436,0.784184,0.609623,1.502669,3.031154,4.071786,4.293543,4.087207,3.922014,3.567579,2.981623,2.49397,2.156916,1.499575,0.693114,0.291746,0.316644,0.495752,0.347832
0.273717,0.26581,0.263664,0.259947,0.250527,0.428611,1.094128,1.017977,0.704958,1.19982,1.067764,0.799649,2.256841,4.748636,6.324874,6.753972,6.797474,6.787656,6.181569,5.049861,4.131499,3.339392,2.214857,1.071464,0.436995,0.424024,0.639337,0.442566
0.311906,0.309153,0.317575,0.324106,0.317597,0.560847,1.446785,1.332421,0.88994,1.508545,1.296633,0.964303,3.309498,7.26415,9.477799,10.097711,10.513858,10.775227,9.907943,8.005568,6.365596,4.687698,2.905709,1.497075,0.609732,0.506558,0.717392,0.504205
0.273101,0.284015,0.307246,0.324148,0.320628,0.612968,1.66295,1.537303,0.99818,1.670709,1.396659,1.085131,4.464394,10.054504,12.8383,13.540193,14.228573,14.810925,13.889215,11.198893,8.765841,6.002689,3.421973,1.852562,0.765064,0.52303,0.674904,0.497768
0.182743,0.204929,0.238988,0.258931,0.253232,0.542824,1.578568,1.483196,1.007822,1.665072,1.373145,1.215506,5.500184,12.25953,15.140413,15.750937,16.322416,16.979228,16.27325,13.092265,10.185947,6.707501,3.548539,1.960884,0.841085,0.489876,0.545619,0.423342
0.113196,0.128258,0.157541,0.172294,0.163931,0.386985,1.190281,1.152219,0.909033,1.47586,1.202371,1.253038,5.874828,12.646848,14.813574,14.889864,14.924741,15.261549,14.891818,12.080649,9.396604,6.108771,3.186023,1.776058,0.804156,0.443981,0.400211,0.310765
0.072323,0.07909,0.094387,0.101201,0.099576,0.244965,0.755172,0.759351,0.796736,1.324785,1.067121,1.114719,4.941566,10.209335,11.357834,10.806918,10.240324,10.053292,9.873205,8.21548,6.449877,4.279767,2.351833,1.309262,0.662602,0.3975,0.305075,0.224373
0.039963,0.041698,0.048076,0.050054,0.057048,0.199774,0.657413,0.666722,0.766753,1.323597,1.096276,0.910411,3.192744,6.278826,6.867776,6.191922,5.284365,4.72042,4.551913,3.994158,3.255938,2.398859,1.488011,0.833283,0.57909,0.409685,0.283447,0.202913
0.027453,0.025564,0.026789,0.026603,0.041719,0.235564,0.83484,0.840376,0.796425,1.337187,1.200541,0.872236,2.277464,4.148132,4.382719,3.833751,2.998193,2.327336,1.958633,1.713595,1.549373,1.490179,1.076162,0.631167,0.647018,0.494136,0.333997,0.256112
0.030287,0.025085,0.023156,0.021749,0.044914,0.338369,1.274232,1.267434,0.901941,1.409506,1.366321,1.039852,2.339911,3.876886,3.876098,3.471169,2.87151,2.207427,1.601638,1.357245,1.430872,1.546415,1.091483,0.663768,0.813916,0.642521,0.431651,0.329731
0.037365,0.030321,0.027973,0.024489,0.054273,0.463227,1.813043,1.791814,1.128084,1.71166,1.617712,1.207695,2.654366,4.294714,4.302255,3.946848,3.497446,2.68929,1.834241,1.605201,1.852196,1.986774,1.292317,0.797739,0.975095,0.781683,0.520121,0.385354
0.04641,0.039782,0.03805,0.031425,0.062335,0.554116,2.226144,2.184556,1.312798,2.05371,1.871928,1.293808,3.083332,5.166928,5.185987,4.861297,4.608012,3.615147,2.471172,2.123343,2.516225,2.644678,1.628911,0.968404,1.083744,0.871926,0.579808,0.435067
0.055469,0.051143,0.048266,0.040094,0.069235,0.568393,2.302715,2.239282,1.328182,2.256874,2.093219,1.318079,3.196254,5.835569,6.34692,6.263283,6.028061,4.724352,3.268378,2.693741,3.160785,3.233418,1.951249,1.15001,1.160174,0.920629,0.617209,0.485384
0.059907,0.057483,0.052876,0.049461,0.077369,0.510506,2.044477,1.973291,1.161021,2.115401,2.012524,1.205656,3.073742,6.240252,7.330013,7.329441,6.834792,5.317417,3.857274,3.045119,3.347271,3.290814,1.99946,1.248072,1.130069,0.872313,0.632647,0.512934
0.055715,0.056328,0.05153,0.05794,0.08799,0.432302,1.680065,1.616569,0.888742,1.59607,1.546888,0.995623,2.932329,6.700416,7.975233,7.19922,6.169124,4.975625,4.160481,3.227135,2.99662,2.710951,1.716306,1.156736,0.941554,0.715762,0.596283,0.473722
0.051366,0.054963,0.05402,0.071164,0.101269,0.364683,1.3453,1.305507,0.63636,0.974693,0.970466,0.789881,3.20779,8.052785,8.787773,6.010939,4.355521,3.845312,3.939685,3.259358,2.425622,1.868376,1.276931,0.912214,0.717968,0.559154,0.495216,0.362467
0.054546,0.058805,0.061117,0.080834,0.106876,0.323277,1.022846,0.974533,0.525695,0.664717,0.603834,0.663537,3.492942,8.905672,8.716417,4.487115,3.112874,3.097024,3.303798,2.932158,1.913365,1.22844,0.884686,0.640653,0.520804,0.438911,0.388803,0.261396
0.052382,0.056759,0.06339,0.075982,0.08994,0.282465,0.742693,0.676816,0.485773,0.580724,0.445609,0.636107,3.522847,8.223553,7.456267,3.586645,2.672135,2.827107,2.824125,2.403905,1.6324,1.077556,0.806061,0.576905,0.425121,0.380225,0.350688,0.238287
0.043265,0.046509,0.056807,0.060214,0.059259,0.228662,0.534283,0.468769,0.447131,0.541096,0.359516,0.593332,2.996137,6.107094,5.592185,3.398597,2.671773,2.619506,2.385876,1.819854,1.415017,1.116861,0.839042,0.590753,0.414578,0.381265,0.35293,0.234473
0.033222,0.033631,0.043607,0.043501,0.038245,0.185142,0.418803,0.363048,0.401341,0.495407,0.322636,0.585701,2.367235,4.069793,3.98585,3.390814,2.800581,2.238115,1.797091,1.386413,1.28009,1.158322,0.850987,0.545627,0.375563,0.346208,0.306651,0.203671
0.030929,0.028515,0.032313,0.033791,0.037426,0.16674,0.365851,0.314917,0.35457,0.458866,0.321293,0.612162,2.169687,3.152752,3.045311,3.14933,2.600812,1.794199,1.559874,1.347933,1.175799,1.073438,0.792559,0.504347,0.369977,0.311303,0.232013,0.160491
0.040399,0.032566,0.029542,0.033491,0.045804,0.152561,0.321551,0.300087,0.3366,0.423942,0.346569,0.655651,2.23734,3.002853,2.436316,2.410042,2.021446,1.588849,1.798759,1.538808,1.0573,1.000642,0.816003,0.510809,0.386625,0.316078,0.204197,0.134377
0.055069,0.044299,0.038891,0.042262,0.058207,0.145054,0.293112,0.296317,0.323265,0.369201,0.354707,0.680253,2.276792,3.124805,2.209591,1.610436,1.280956,1.353204,1.909344,1.66495,1.055627,1.00917,0.8932,0.577749,0.421301,0.367256,0.244294,0.143689
0.070493,0.060986,0.053733,0.056259,0.072558,0.147291,0.276118,0.271575,0.290658,0.325209,0.356554,0.710052,2.149962,3.229088,2.475685,1.389451,0.96159,1.224612,1.74479,1.544557,1.013306,0.905423,0.826055,0.595173,0.447065,0.413169,0.289168,0.166787
0.078724,0.072835,0.063926,0.065533,0.079517,0.135955,0.232445,0.208782,0.240909,0.30173,0.346486,0.702791,1.907293,3.182884,2.773468,1.461208,0.959008,1.104545,1.402235,1.384942,1.015285,0.703999,0.598435,0.499475,0.423201,0.432701,0.327555,0.193045
0.073555,0.069203,0.060287,0.060582,0.070188,0.108164,0.173306,0.145166,0.197663,0.274089,0.320951,0.647238,1.710186,3.135834,2.80521,1.404326,0.897417,0.892776,1.103495,1.278093,1.014419,0.530389,0.359178,0.338156,0.353668,0.409061,0.331184,0.195483
0.053496,0.049171,0.043219,0.042989,0.049018,0.093517,0.15678,0.124882,0.188705,0.26145,0.290039,0.550443,1.579198,2.911872,2.424875,1.214632,0.836707,0.73243,0.906983,1.100927,0.861644,0.401371,0.257971,0.255998,0.304954,0.338629,0.286217,0.168816
0.030616,0.025827,0.026721,0.02961,0.032943,0.092772,0.164492,0.120729,0.178831,0.250433,0.253326,0.463929,1.685777,2.750665,1.823155,0.919424,0.807846,0.70015,0.747782,0.856105,0.63916,0.356975,0.288995,0.24672,0.265513,0.259937,0.234393,0.146855
0.023417,0.016466,0.021343,0.02813,0.029964,0.091292,0.161969,0.121964,0.160252,0.222135,0.22334,0.417256,1.773731,2.517153,1.406951,0.783154,0.705245,0.660393,0.702025,0.723261,0.504509,0.360193,0.363773,0.273055,0.241691,0.218303,0.1912,0.125207
0.022905,0.015072,0.023116,0.029331,0.030008,0.081086,0.136182,0.11667,0.139473,0.186839,0.211255,0.388223,1.691118,2.118062,1.104042,0.754833,0.610092,0.657487,0.697189,0.570462,0.375528,0.340236,0.394788,0.304847,0.253047,0.204069,0.154601,0.096823
0.020139,0.015349,0.026129,0.028709,0.027142,0.067706,0.106266,0.102124,0.129144,0.154775,0.19253,0.369199,1.486643,1.686535,0.864768,0.706215,0.539347,0.607354,0.625122,0.414433,0.278195,0.302415,0.347841,0.29194,0.253656,0.213017,0.15104,0.084056
0.020761,0.017705,0.027314,0.028696,0.023832,0.06645,0.103224,0.089365,0.125795,0.134694,0.183341,0.370004,1.269431,1.477106,0.852954,0.708003,0.546331,0.495443,0.54474,0.374487,0.231054,0.251817,0.249848,0.225335,0.222327,0.229875,0.173862,0.089066
0.024704,0.022771,0.028642,0.030853,0.025077,0.070224,0.110163,0.085448,0.114116,0.129006,0.187603,0.392336,1.054047,1.340509,0.918242,0.673657,0.598111,0.476959,0.472501,0.394386,0.263982,0.252411,0.17652,0.168732,0.211261,0.243529,0.185043,0.086714
