5.6e-05,0.000192,0.000142,6.3e-05,5.8e-05,0.000103,2.8e-05,0.000135,0.000103,2.3e-05,2.2e-05,3.8e-05,7.6e-05,5.4e-05,9.1e-05,5e-05,0.000103,0.000155,0.000103,4e-05,9.7e-05,-1.1e-05,0,2.5e-05,0.000142,9.1e-05,-2.2e-05,8.1e-05,5.4e-05,3e-05,0.000116,-6.5e-05,-2.7e-05,8.2e-05,3.7e-05,-3e-05,-8.4e-05,7.9e-05,6e-05,0.000182,4.1e-05,0.000114,6.2e-05,5.7e-05,0.000126,0.000255,8.8e-05,0.000153,4.1e-05,0.000223,0.000167,6e-06,4.3e-05,9.1e-05,-5e-06,0.000219,0.000136,6.1e-05,9.1e-05,0.000141,0.000218,0.000114,-4.1e-05,7e-05,7.3e-05,0.000107,4.7e-05,5.6e-05,4.5e-05,0.000141,7.5e-05,0.000111,-3.1e-05,-4.9e-05,-8e-06,7e-05,5.7e-05,0.000107,1.9e-05,-2.4e-05,0.00014,8.5e-05,0.00019,0.000141,0.000159,6e-05,1.1e-05,0.000167,3.4e-05,0.000251,0.000351,0.000422,0.000297,0.000195,6.9e-05,9.3e-05,8.8e-05,0.000106,0.000103,0.000192,6.5e-05,0.000217,0.00025,0.000105,0.000292,0.000155,0.000214,0.000228,0.000148,0.00014,0.000479,0.000431,0.000488,0.000547,0.000379,0.000311,0.00018,5.2e-05,0.000226,0.000206,0.000136
-0.000141,-1.4e-05,-4.3e-05,-5.6e-05,-4.5e-05,-6.4e-05,9e-06,-0.000187,-0.00016,-5.4e-05,-1.4e-05,-4.3e-05,-0.000121,-0.000204,-3.8e-05,-2.1e-05,-0.000201,-0.000211,-9.7e-05,-0.000138,-0.000207,-0.000121,-0.000172,-0.000132,-0.000222,-8.9e-05,-7e-06,-8.2e-05,-0.000146,5.7e-05,4e-06,-0.000114,-6.2e-05,-7.8e-05,-0.000104,-0.00011,-8.9e-05,-4.8e-05,-0.000119,-0.000318,-0.000215,-2.7e-05,-0.000147,-6.7e-05,-0.000174,-0.000103,-4.5e-05,-3.3e-05,-0.000146,-9.3e-05,-0.000197,-0.000108,-1.3e-05,-0.000102,-9.6e-05,-0.00012,-0.000273,-0.000132,-0.000126,-0.000209,-0.000223,-0.000197,-4.9e-05,-3.7e-05,-0.000127,-9.3e-05,-0.000117,-0.00014,-0.000104,-8.5e-05,-8.2e-05,1.5e-05,-0.000123,-4e-06,-3.2e-05,-4.9e-05,-3.7e-05,-7.9e-05,-6.8e-05,8e-06,1.1e-05,2.7e-05,-0.000224,-0.000202,-0.000181,-6.7e-05,-0.000309,-7.7e-05,-0.000396,-0.000186,9.5e-05,0.000179,-0.000113,-5.4e-05,-0.000123,-5.8e-05,-0.000227,-0.000181,-3.2e-05,-0.000125,2.3e-05,9.7e-05,-0.000118,2e-05,6.6e-05,-8.7e-05,-0.000108,-4.6e-05,2.3e-05,-1.5e-05,6.7e-05,0.000152,0.000374,0.000208,0.000202,5.3e-05,-0.000144,-9.9e-05,-9.7e-05,-3.1e-05,-6.2e-05
-6.2e-05,-8.4e-05,2e-05,-5e-06,-3.3e-05,4.8e-05,3.6e-05,-0.000159,-4e-05,-4.5e-05,-5.3e-05,-0.000133,-1.6e-05,7e-05,7.6e-05,3.6e-05,0.000165,1e-06,-8e-06,3.2e-05,8e-06,-8e-06,-2.5e-05,3.2e-05,-0.00012,-4.6e-05,-6.2e-05,-0.000141,-7e-06,-5.1e-05,-2.1e-05,1.7e-05,3.2e-05,1.8e-05,-0.000133,-2e-05,0.00017,0.000219,5e-06,-0.000125,-5.2e-05,-2.3e-05,2e-05,-7e-05,-3.8e-05,-3e-05,-9e-05,-9e-05,-7.7e-05,3.7e-05,-6.3e-05,-1.1e-05,-5.3e-05,-5.2e-05,4.4e-05,6.7e-05,-1e-04,-3.3e-05,-7e-06,-5.4e-05,-8.3e-05,-3e-06,2.6e-05,9.6e-05,-1.3e-05,-3.4e-05,-3.7e-05,-2.4e-05,-4e-05,2.2e-05,-0.000117,-5.6e-05,-4.1e-05,5.7e-05,-1.9e-05,-3.4e-05,2.7e-05,-0.000108,-3.6e-05,4e-06,-0.000155,-5.8e-05,-6.1e-05,8.7e-05,-2.2e-05,-9.7e-05,0.000133,9.1e-05,0.000163,-3e-06,0.000118,0.000106,0.000149,0.00019,0,7e-06,-0.000119,-6e-06,1.2e-05,-7.3e-05,1.3e-05,-1.6e-05,-4.9e-05,-6e-06,5e-06,-4.3e-05,-0.000111,-6.7e-05,-0.000114,-5.2e-05,-0.000142,-0.000137,0.000135,0.000117,0.00011,6.1e-05,6.2e-05,3.4e-05,-7.5e-05,0.000137,7e-05
6.5e-05,-0.000145,6e-06,-7e-05,-0.000103,-0.000122,-5.6e-05,-2.5e-05,-6.7e-05,-5.1e-05,-1.7e-05,-8e-05,5.9e-05,-2e-06,7.1e-05,4.9e-05,7.2e-05,-0.000102,-4.4e-05,6e-06,2.6e-05,-3.9e-05,-6.5e-05,-6e-05,3.8e-05,3.1e-05,-6e-06,-2.7e-05,0,-4.8e-05,-1.5e-05,-7.1e-05,-1e-06,-3.8e-05,-3.8e-05,6.2e-05,-0.000103,-0.000131,-4.3e-05,-4.6e-05,-2e-06,3.6e-05,9e-05,3e-06,0.000108,-1.3e-05,-3.6e-05,-4.2e-05,-3e-06,-2e-05,6.1e-05,2.8e-05,-4.5e-05,2.9e-05,-8.1e-05,-0.000105,6.8e-05,5e-05,-6.2e-05,-2.8e-05,-7.2e-05,-0.000119,-9.7e-05,-4.4e-05,-9.1e-05,-9.8e-05,2.5e-05,4.4e-05,-4.9e-05,-5.5e-05,-7.2e-05,8e-06,-9.7e-05,-0.000105,-6.8e-05,0.000113,6e-05,3.9e-05,-3e-05,2.5e-05,-7.9e-05,-6.3e-05,5.5e-05,-9.9e-05,-9.3e-05,5.6e-05,-4e-06,-6.8e-05,7.7e-05,-1e-05,0.000108,-6.3e-05,0.00011,-2.8e-05,1e-04,2.1e-05,1.1e-05,3.6e-05,-1.8e-05,-2.4e-05,-5.4e-05,-0.000201,7.5e-05,-4.7e-05,-7.5e-05,5.2e-05,-9.3e-05,5.2e-05,-8e-06,-6.1e-05,-1.1e-05,-0.000154,9.1e-05,0.000181,3e-05,9.1e-05,6.6e-05,-1.2e-05,-6.5e-05,7.7e-05,6e-05
8e-05,5.2e-05,-6.4e-05,-4.1e-05,-5e-06,4.4e-05,2.2e-05,5e-06,1.7e-05,0.000115,8.7e-05,5.1e-05,-6e-06,3.7e-05,-4.6e-05,-8.5e-05,-6.1e-05,-6.6e-05,9.8e-05,-4.4e-05,-4.4e-05,3.5e-05,5.6e-05,3.3e-05,1.6e-05,7e-05,4.6e-05,-4.4e-05,3.5e-05,-1e-05,-7.1e-05,-4.4e-05,-6e-05,-7.2e-05,7e-06,-2.4e-05,-6.3e-05,-6e-06,-3.6e-05,8.2e-05,0.000105,3e-05,-1.1e-05,-1.3e-05,8e-06,-6.6e-05,1.1e-05,5.4e-05,3.1e-05,-7.4e-05,-7.6e-05,1.2e-05,-3.9e-05,9e-06,3.1e-05,-3.1e-05,8.8e-05,-1.2e-05,-2.9e-05,-2.6e-05,0.00015,-1.7e-05,6.8e-05,-3.5e-05,2.6e-05,7.7e-05,5.1e-05,2.5e-05,3.3e-05,9e-06,4.1e-05,4.7e-05,-1e-06,8.2e-05,3.6e-05,8.3e-05,-4e-05,-3e-06,3.6e-05,2.7e-05,1.8e-05,-5.5e-05,6.6e-05,-3.1e-05,-1.2e-05,-4e-06,-7.9e-05,-1.2e-05,-7e-06,-6.9e-05,7.2e-05,-9.6e-05,7.9e-05,-1.7e-05,3.5e-05,1e-06,5e-06,9.9e-05,-6e-06,-1.6e-05,-6.1e-05,-4.8e-05,4.2e-05,-3.7e-05,-2.4e-05,-4e-06,-0.000108,6e-06,4.2e-05,3.3e-05,7.1e-05,-0.000155,8e-05,-3.7e-05,9e-06,-3e-06,-5.4e-05,-2.4e-05,2.4e-05,-6.1e-05,-5.5e-05
-4.2e-05,-1e-05,-5.5e-05,-9e-06,7e-05,4.8e-05,3e-06,-4e-05,1.6e-05,6.8e-05,9.1e-05,4.5e-05,5.4e-05,3.2e-05,5.4e-05,4.8e-05,3e-06,8.5e-05,9e-05,-7e-06,3.6e-05,0.000112,6.8e-05,3.7e-05,7.8e-05,3.5e-05,6.8e-05,6e-06,5.2e-05,4.6e-05,-1.1e-05,0,1.2e-05,5.3e-05,5.9e-05,2.4e-05,3.4e-05,2.6e-05,6.3e-05,3.4e-05,-3.4e-05,1.8e-05,-7.8e-05,-1.7e-05,3.8e-05,8.1e-05,6.7e-05,-2.4e-05,2.1e-05,0.000113,-2e-06,3.2e-05,1.1e-05,-3.6e-05,-8e-06,1.9e-05,-3.7e-05,3.8e-05,-2e-05,-4.6e-05,6.1e-05,5.1e-05,-3e-05,2.4e-05,-5e-06,-3.2e-05,4.5e-05,5.1e-05,5.5e-05,4.8e-05,3.6e-05,-1.5e-05,4.2e-05,-7e-06,-3.3e-05,3e-06,-5.7e-05,-7e-05,4.5e-05,-4e-06,3.6e-05,-1.7e-05,1.9e-05,0.000168,6.1e-05,-1e-06,2.2e-05,4e-05,-8.7e-05,0,4.4e-05,-0.00019,-6.6e-05,1e-05,-4.7e-05,-4.6e-05,6e-06,-3.3e-05,-7.2e-05,1.9e-05,-3.3e-05,-5.6e-05,-1e-06,5.2e-05,-3.5e-05,-5.3e-05,3e-05,3.7e-05,-4.5e-05,-0.000127,-5.5e-05,-0.000183,1.6e-05,-0.000168,-4.7e-05,-0.00013,-4.6e-05,6.6e-05,-4.3e-05,-6.4e-05,-1.7e-05
-1.2e-05,-1.1e-05,-6e-05,6.4e-05,-2.7e-05,-7.7e-05,-9.9e-05,7e-06,-8.7e-05,-5.3e-05,-7.2e-05,1.9e-05,0,-5.6e-05,-4.5e-05,4.5e-05,-7e-06,3.3e-05,-5.9e-05,-5.2e-05,-1.1e-05,-4.1e-05,-3.5e-05,-5.6e-05,1.5e-05,-6.6e-05,2.1e-05,-4.6e-05,-8.7e-05,-7.7e-05,-9.1e-05,-1.4e-05,5.7e-05,2.9e-05,1e-05,-3.2e-05,3.5e-05,-9e-05,-7.6e-05,-0.000107,-3.8e-05,2.5e-05,-1.1e-05,-2.4e-05,8e-06,-4.6e-05,-5.2e-05,-1.8e-05,-2.5e-05,-3.7e-05,-1e-05,-2.2e-05,7.4e-05,-1.4e-05,-5.1e-05,-3.6e-05,-1.4e-05,5.9e-05,4e-05,-3.5e-05,-2.5e-05,-0.000111,-5.5e-05,-1.8e-05,5e-06,-6e-05,-6.9e-05,-2.1e-05,-5.9e-05,-7.3e-05,-3.8e-05,-6.3e-05,-6e-06,2e-06,1.9e-05,-2.1e-05,-1.5e-05,1e-05,2.1e-05,-3.5e-05,4e-06,1.3e-05,3.1e-05,-5.4e-05,-1.1e-05,9.3e-05,2.7e-05,-3.9e-05,-2e-06,5e-06,1e-05,-1.6e-05,-2e-06,-0.000132,-1.8e-05,6.1e-05,6.9e-05,-0.000125,0,5.8e-05,-6.7e-05,-4.5e-05,6.1e-05,2.7e-05,-9.6e-05,-0.000107,2.5e-05,-7.9e-05,-0.000122,-0.000104,-0.000108,-3.3e-05,-3.4e-05,-0.000174,-0.000113,-0.000114,4.6e-05,-3e-06,-4.7e-05,4.2e-05,-9e-06
-3e-05,-5.1e-05,1.7e-05,-1.6e-05,-4.7e-05,-5.4e-05,1e-06,-2.8e-05,-0.00011,-2.5e-05,1.3e-05,8e-06,-3e-06,-5.4e-05,-7e-05,1.2e-05,-5.9e-05,-9.6e-05,-2.2e-05,-1.8e-05,-8.4e-05,-7.9e-05,-1.5e-05,-7e-05,-5.4e-05,-3.8e-05,-2.7e-05,-2.9e-05,-2e-05,-3.2e-05,-7e-05,-1.7e-05,-8.8e-05,-1.5e-05,-2.3e-05,2e-06,-6.5e-05,-2.8e-05,-2.2e-05,1.4e-05,-1.3e-05,-1.4e-05,-2.7e-05,-3.6e-05,-9e-06,-0.000118,-7.6e-05,0,-3.9e-05,-6.3e-05,-4.2e-05,-7.9e-05,-6e-05,-5.4e-05,4.6e-05,-9e-06,2e-05,-1.3e-05,-2.8e-05,-7.5e-05,-3.2e-05,-8.6e-05,-8e-06,3.3e-05,-6e-06,-5.1e-05,-3.9e-05,-7.8e-05,-5.7e-05,-5e-05,1.2e-05,-5.4e-05,1.1e-05,-7e-06,-4.3e-05,6e-06,1.8e-05,-1.8e-05,-6.8e-05,-1.7e-05,-1e-05,8e-06,1.8e-05,-6e-05,-4.2e-05,6.2e-05,3.1e-05,1.1e-05,-5e-06,-2.2e-05,-3.7e-05,-3.5e-05,-5.2e-05,-2.5e-05,-8.7e-05,-3.5e-05,2.7e-05,5e-05,-5e-06,2.7e-05,-1.8e-05,-4.7e-05,-6e-06,-7e-06,-3.9e-05,-5.5e-05,-8.6e-05,1.6e-05,-4.8e-05,5e-06,-4.6e-05,-3.3e-05,-8.5e-05,-0.000182,-3.2e-05,-5.3e-05,-8e-06,-1.4e-05,-2.6e-05,-6e-06,-4.6e-05
-3.5e-05,-3e-05,2.3e-05,-1e-06,-3.4e-05,-2.5e-05,5e-06,2.5e-05,8e-06,-2.9e-05,-1.5e-05,-2.4e-05,-1.5e-05,7.7e-05,2.9e-05,7.1e-05,2.3e-05,0.000105,-1.1e-05,1.7e-05,-7e-06,4e-05,-7e-06,4.9e-05,-2.2e-05,5.2e-05,2.2e-05,-9e-06,5.1e-05,3.9e-05,-1.9e-05,3.8e-05,6.8e-05,1.1e-05,4e-06,5e-06,4.2e-05,2.8e-05,-1.6e-05,4.8e-05,2.2e-05,-3.4e-05,-1.7e-05,3.6e-05,-1.1e-05,-2e-05,-2.7e-05,4.7e-05,1.6e-05,-2.6e-05,-5e-06,-1e-06,-3e-05,-6e-06,6.6e-05,1.7e-05,-5.1e-05,-6.5e-05,-5.7e-05,3.2e-05,2.1e-05,2.5e-05,6e-06,1.2e-05,1e-05,8e-06,-6e-06,-1.1e-05,0,-1.2e-05,-4e-06,1.1e-05,1.4e-05,-1.8e-05,2.3e-05,-1.1e-05,-2.8e-05,-6.1e-05,-2.6e-05,6e-06,1.4e-05,5e-06,1.4e-05,-2.8e-05,-2e-05,-2e-05,-3.5e-05,5.1e-05,1.1e-05,1.3e-05,-7.8e-05,-5.4e-05,-5.3e-05,-1.1e-05,-6e-06,1.9e-05,-4e-05,7.4e-05,1.1e-05,-4.2e-05,9.2e-05,-3.2e-05,-6e-05,-3e-06,-1.3e-05,-5.7e-05,-4.3e-05,-5.3e-05,2e-05,3.4e-05,-3.4e-05,-1.2e-05,-0.00012,-6.9e-05,-8e-05,-5.6e-05,-3.9e-05,1e-05,-2.8e-05,1e-06,-5.6e-05
1.1e-05,4.9e-05,4.2e-05,7e-05,-8e-06,-3e-06,5e-06,2.7e-05,7.9e-05,-5e-06,3e-05,9e-06,-1.6e-05,8e-06,-2.5e-05,1e-05,6e-06,5.1e-05,-1.7e-05,-1.5e-05,2.6e-05,-1e-05,5e-06,4e-06,2.6e-05,4.5e-05,2.5e-05,1.7e-05,4.7e-05,-1.9e-05,1.5e-05,0,1.9e-05,4.8e-05,-5e-06,-4.4e-05,-1.2e-05,-5e-06,-2.1e-05,4e-06,-8e-06,9e-06,1.5e-05,1.3e-05,2.7e-05,5.5e-05,-1.5e-05,1.8e-05,1.3e-05,4.5e-05,1.4e-05,8.2e-05,1.4e-05,4.2e-05,-1.5e-05,1.9e-05,3.1e-05,2.3e-05,2.3e-05,6.1e-05,-1.4e-05,2.5e-05,-2.6e-05,-1.5e-05,-1.7e-05,6e-05,-4e-06,2.7e-05,1e-06,1.5e-05,3e-06,2.1e-05,3.6e-05,1.6e-05,-3e-06,3.3e-05,-3.8e-05,-4e-06,1.6e-05,3.8e-05,4.2e-05,5e-06,-1.1e-05,9.7e-05,3.2e-05,-0.000105,-2e-05,1.3e-05,5e-05,7e-06,-5.4e-05,-7.3e-05,-7.2e-05,-3.9e-05,1.8e-05,3.3e-05,3e-06,-3e-06,-1.6e-05,-1e-06,-3e-06,1.1e-05,-5.8e-05,-4.9e-05,-4e-06,1.3e-05,5.3e-05,-1e-06,9e-06,3.5e-05,3.6e-05,-3.8e-05,-8.1e-05,-2.3e-05,-8.6e-05,-3.1e-05,-6.4e-05,1.9e-05,9e-06,-5.1e-05,-2.2e-05
2e-05,1.1e-05,4e-06,6e-06,-2.6e-05,-3e-06,-1e-06,1e-06,4e-06,-7e-06,1.9e-05,2.9e-05,-1e-06,6e-06,7e-06,-1.4e-05,-1e-06,-1.2e-05,1.5e-05,3.1e-05,-1.1e-05,-2.6e-05,3.3e-05,1.9e-05,-1.7e-05,-1.3e-05,-4e-06,-1e-06,1.7e-05,3.7e-05,3e-05,2.4e-05,-1e-06,-1.3e-05,-1.6e-05,-3e-06,1.4e-05,-6e-06,-1.1e-05,4.6e-05,1.7e-05,8.3e-05,-2e-06,-1.1e-05,2.1e-05,1.3e-05,-4e-06,-1.3e-05,-9e-06,5.6e-05,3e-06,-8e-06,-1.4e-05,-3e-06,1.5e-05,2.9e-05,-1.1e-05,3.7e-05,1.4e-05,-7e-06,-1.8e-05,4.6e-05,1.7e-05,3.9e-05,1.3e-05,-2.5e-05,-1e-06,-6e-06,-6e-06,2e-05,4.1e-05,1e-05,-1.3e-05,0,-8e-06,-1.9e-05,-6e-06,2.6e-05,-2.5e-05,-1.1e-05,-6e-06,-1.2e-05,-1.5e-05,3e-06,1.2e-05,1.9e-05,6e-06,-4.1e-05,-1.8e-05,-2.8e-05,6.7e-05,-3.9e-05,-6e-06,-9.1e-05,-7.3e-05,2.7e-05,3.6e-05,1e-06,1e-05,1e-06,-3.5e-05,3.7e-05,-4.2e-05,-2.6e-05,4.2e-05,0,6.3e-05,4.2e-05,3.8e-05,-4e-06,-2.8e-05,-2.2e-05,-2.7e-05,-2.1e-05,5e-06,-6.5e-05,-9e-06,4e-06,1.9e-05,-4e-06,-8e-06
-1.9e-05,-1e-06,-3.2e-05,-1.8e-05,8e-06,-2e-06,-2.5e-05,-2e-06,9e-06,-1.9e-05,-1e-05,3.6e-05,3e-06,-2.5e-05,-1.8e-05,1.7e-05,-1.2e-05,3e-06,3.2e-05,1.2e-05,0,-4e-06,9e-06,-3e-06,-2.1e-05,1.9e-05,-4e-06,1e-06,4e-06,-3e-06,9e-06,1e-06,-1.1e-05,8e-06,1.5e-05,1.6e-05,-3e-06,9e-06,1.6e-05,1.3e-05,-4e-06,-2.2e-05,-4e-06,-3e-06,-2.6e-05,-1.5e-05,2.7e-05,-4.2e-05,-1.1e-05,1.4e-05,0,-2.4e-05,-8e-06,1e-06,2.6e-05,-2.4e-05,-1.4e-05,1.4e-05,1e-06,-1.2e-05,5e-06,5e-06,7e-06,-2e-05,-1.4e-05,2e-05,-2e-06,-8e-06,1.5e-05,0,-1.3e-05,2.4e-05,7e-06,1.3e-05,3.1e-05,7e-06,6e-06,-1.6e-05,-2.6e-05,-2.5e-05,-8e-06,2e-06,-6.3e-05,-2e-06,-2.2e-05,-5e-06,3e-05,-1.9e-05,-2.3e-05,-2.6e-05,2.2e-05,-1.6e-05,1.8e-05,-4.5e-05,6e-06,2.3e-05,-6e-06,-1.3e-05,1.3e-05,-6e-06,-2.9e-05,-3e-06,-2e-05,-2.8e-05,-1e-05,-9e-06,3.2e-05,1.8e-05,-6e-06,-1.2e-05,2.1e-05,1.8e-05,9.1e-05,-1.3e-05,2.5e-05,-3e-05,-7e-06,3e-05,-3.3e-05,1.7e-05,1.3e-05
-1.3e-05,-2.1e-05,4e-06,-2.1e-05,2e-05,-1.5e-05,6e-06,-3e-06,5e-06,-3.2e-05,0,-2.9e-05,-1e-05,-1e-06,-4e-06,2.3e-05,-2.2e-05,7e-06,-1.6e-05,-1.5e-05,-1.6e-05,0,-2.4e-05,-2e-05,-1.5e-05,-1.3e-05,-1e-05,-4e-06,5e-06,-1.4e-05,-2.9e-05,0,-2.3e-05,-7e-06,-1e-05,4e-06,6e-06,-1e-05,-2.4e-05,-3.3e-05,0,-5.2e-05,-2.3e-05,2e-06,1e-06,-1e-06,-1.7e-05,-2.9e-05,3e-06,-1.1e-05,-7e-06,2e-06,-1.8e-05,-1.8e-05,1e-06,-4.7e-05,9e-06,0,-9e-06,-4e-06,-1.8e-05,-1.2e-05,0,-4e-06,1e-06,7e-06,1.3e-05,2e-06,-7e-06,-1.3e-05,-2e-06,-8e-06,-1.5e-05,-5e-06,-1.3e-05,-1.3e-05,1e-06,-6e-06,3e-06,-1.2e-05,1.1e-05,8e-06,-2.1e-05,1.9e-05,-3e-06,-1.3e-05,-6e-06,1.4e-05,3e-05,-1.5e-05,-4.4e-05,9e-06,1.3e-05,-3.4e-05,3.8e-05,2.2e-05,-8e-06,-2.7e-05,-5e-06,-7e-06,6e-06,-3e-06,2e-06,0,-3.9e-05,1.3e-05,-1.9e-05,-6e-06,1e-06,1.6e-05,3.1e-05,1.1e-05,7e-06,-3.5e-05,5e-06,1.4e-05,-4e-06,3.2e-05,-1.3e-05,-1e-06,1e-05
2e-06,3e-05,1.5e-05,-1e-05,-8e-06,-5e-06,1e-06,-3e-06,-9e-06,9e-06,-1.6e-05,1.1e-05,-2e-06,-4e-06,2e-06,-2.2e-05,-1.8e-05,-1e-06,2.3e-05,-3e-06,1.5e-05,-1.7e-05,8e-06,2e-06,4e-06,-3.4e-05,-1.5e-05,1e-06,-9e-06,-7e-06,2e-06,7e-06,8e-06,-2.1e-05,6e-06,-2e-06,9e-06,-8e-06,8e-06,0,0,-6e-06,0,0,1e-05,2e-06,-6e-06,-1.1e-05,-6e-06,-1.3e-05,0,-7e-06,-1.9e-05,-3e-06,-6e-06,4e-06,6e-06,9e-06,-8e-06,6e-06,2e-06,-5e-06,-5e-06,-2.1e-05,-4e-06,-2.1e-05,2e-06,-4e-06,-8e-06,7e-06,2e-06,-1.7e-05,-1e-06,3e-06,-2e-05,-1.2e-05,-8e-06,-1e-06,-4e-06,-5e-06,-1e-05,-8e-06,-1.2e-05,2.2e-05,2e-06,3.2e-05,2.6e-05,6e-06,-2e-05,3e-06,2.6e-05,-1e-06,4e-06,-6e-06,-1.9e-05,2e-06,-3e-06,-2.8e-05,-2.8e-05,-1.6e-05,-1e-06,-7e-06,-9e-06,0,-1.4e-05,-1.7e-05,1.8e-05,-2e-06,-2.2e-05,1.9e-05,1.6e-05,-6e-06,2e-06,-1.9e-05,4e-06,-1.1e-05,-7e-06,1.2e-05,1.2e-05,1.1e-05,2e-06
-6e-06,-5e-06,1e-05,1.7e-05,8e-06,-6e-06,6e-06,1.7e-05,-1.1e-05,2.3e-05,-7e-06,4e-06,3e-06,1e-06,0,-1.4e-05,-3e-06,-3e-06,1.9e-05,-1e-05,9e-06,6e-06,5e-06,3e-06,4e-06,-1e-06,4e-06,5e-06,1e-06,-1.4e-05,1.8e-05,4e-06,2e-06,8e-06,9e-06,6e-06,-7e-06,0,4e-06,-2.2e-05,1e-06,2e-06,4e-06,-1e-06,-5e-06,-1.2e-05,7e-06,-7e-06,5e-06,8e-06,0,-1.2e-05,-1.1e-05,-5e-06,4e-06,5e-06,-3e-06,-8e-06,-1e-06,-2e-06,1.8e-05,-6e-06,2e-06,-2.1e-05,2e-06,0,2e-06,9e-06,1e-06,1.1e-05,5e-06,0,-7e-06,-4e-06,1e-05,-4e-06,-1.4e-05,5e-06,-8e-06,1e-06,7e-06,-2e-06,1.5e-05,-1.3e-05,-4e-06,-2.5e-05,2e-06,-7e-06,-1e-05,-4e-06,1e-05,3e-06,-3e-06,1e-05,6e-06,3e-06,6e-06,1.5e-05,6e-06,0,1e-06,-2e-05,1.2e-05,-1e-06,1e-05,3e-06,-2e-06,1e-05,-3e-06,-6e-06,7e-06,-7e-06,-3e-06,-2e-06,-1e-06,-1.1e-05,3e-06,-7e-06,-1e-05,-1.8e-05,-4e-06
-5e-06,-1.2e-05,-3e-06,-2e-06,1.1e-05,-4e-06,-3e-06,-6e-06,-1e-05,5e-06,-8e-06,7e-06,-3e-06,4e-06,3e-06,-1.4e-05,7e-06,-6e-06,-1e-05,1e-06,-9e-06,7e-06,-1.1e-05,2e-06,3e-06,2e-06,7e-06,1e-06,-2e-06,1e-06,-7e-06,3e-06,-1.2e-05,4e-06,1e-06,-2e-06,-1.2e-05,1e-05,-3e-06,-1.1e-05,0,1.4e-05,-7e-06,3e-06,-2e-06,-7e-06,3e-06,2e-06,-3e-06,-4e-06,-7e-06,1e-06,4e-06,4e-06,0,-5e-06,9e-06,3e-06,1e-06,8e-06,4e-06,-6e-06,0,1.1e-05,-3e-06,6e-06,1e-06,-1.3e-05,4e-06,4e-06,-2e-06,-5e-06,-1e-06,2e-06,-1e-06,-1.1e-05,-3e-06,5e-06,3e-06,-1e-06,3e-06,-1e-06,1e-05,-2e-05,-7e-06,-5e-06,5e-06,-2e-06,1.2e-05,-1e-06,-1e-05,-1.4e-05,-9e-06,7e-06,-1e-05,-2e-06,5e-06,1.9e-05,2e-06,6e-06,1.7e-05,6e-06,9e-06,1.7e-05,-2e-06,-5e-06,0,-4e-06,4e-06,7e-06,-4e-06,-1e-05,-4e-06,2.1e-05,-8e-06,-7e-06,1.1e-05,-8e-06,-1.1e-05,-9e-06,-9e-06
-3e-06,9e-06,-3e-06,-9e-06,-3e-06,1e-06,2e-06,1e-06,6e-06,7e-06,-4e-06,5e-06,1e-06,9e-06,-2e-06,2e-06,2e-06,1.1e-05,-1e-05,0,0,4e-06,-5e-06,3e-06,3e-06,-1e-06,2e-06,2e-06,1e-06,-3e-06,4e-06,4e-06,6e-06,6e-06,4e-06,-8e-06,1e-06,-2e-06,-3e-06,-5e-06,-1e-06,-4e-06,-2e-06,2e-06,-5e-06,1e-06,-6e-06,2e-06,-1e-06,-4e-06,0,7e-06,1e-06,1e-06,-1.3e-05,-5e-06,-7e-06,-1.3e-05,-1e-06,9e-06,-2e-06,4e-06,-3e-06,6e-06,3e-06,-1e-06,-3e-06,3e-06,-7e-06,0,0,4e-06,-2e-06,-3e-06,0,9e-06,0,-2e-06,5e-06,8e-06,-5e-06,-1e-06,9e-06,0,-2e-06,2.6e-05,-3e-06,2e-06,5e-06,-3e-06,-1.5e-05,-1.9e-05,-3e-06,6e-06,-6e-06,-2e-06,3e-06,-4e-06,7e-06,0,-7e-06,8e-06,8e-06,-3e-06,-1e-06,-2e-06,-4e-06,0,6e-06,-1e-06,-7e-06,5e-06,-9e-06,1.9e-05,-6e-06,-1.3e-05,1.2e-05,0,4e-06,1e-05,-4e-06
-6e-06,1e-05,-5e-06,3e-06,-1.1e-05,5e-06,-4e-06,6e-06,6e-06,9e-06,-1e-06,-3e-06,1e-06,-4e-06,-5e-06,0,-1e-06,-1.2e-05,4e-06,7e-06,-2e-06,-3e-06,4e-06,1e-06,1e-06,1e-06,4e-06,1e-06,-2e-06,2e-06,-4e-06,1e-06,-5e-06,-2e-06,2e-06,2e-06,7e-06,-5e-06,-1e-06,-4e-06,2e-06,-2e-06,-1e-06,-4e-06,4e-06,8e-06,-7e-06,-6e-06,1e-06,1e-06,-2e-06,1.2e-05,-3e-06,4e-06,-1e-06,0,-4e-06,-9e-06,1e-06,-4e-06,4e-06,6e-06,1e-06,-1e-06,-2e-06,3e-06,-2e-06,4e-06,0,5e-06,3e-06,6e-06,0,0,4e-06,-3e-06,4e-06,-2e-06,2e-06,0,4e-06,0,6e-06,-1e-06,2e-06,-1e-06,1e-06,-7e-06,1e-06,-1e-06,-6e-06,5e-06,-6e-06,-2e-05,6e-06,-5e-06,1e-06,1e-06,0,0,-1.1e-05,-7e-06,7e-06,8e-06,6e-06,-4e-06,2e-06,0,1e-06,-6e-06,1e-06,-1e-06,-1.3e-05,-9e-06,3e-06,-9e-06,-2e-06,-6e-06,-5e-06,3e-06,-6e-06
1e-06,-7e-06,-2e-06,-1e-06,-1e-06,-1e-06,-2e-06,-2e-06,-1e-06,-6e-06,1e-06,1e-06,-2e-06,-1e-06,1e-06,-9e-06,-3e-06,-6e-06,-3e-06,-2e-06,1e-06,1e-06,0,-2e-06,2e-06,5e-06,2e-06,0,-5e-06,0,3e-06,1e-06,0,-2e-06,2e-06,-1e-06,4e-06,2e-06,2e-06,-4e-06,-2e-06,4e-06,-2e-06,0,-3e-06,-1e-06,7e-06,-2e-06,-1e-06,7e-06,-1e-06,-5e-06,-3e-06,-2e-06,1e-06,-1e-06,5e-06,3e-06,1e-06,-3e-06,2e-06,4e-06,0,-1.4e-05,1e-06,-1e-06,-4e-06,-4e-06,2e-06,3e-06,-4e-06,0,-3e-06,0,-1e-06,5e-06,-1e-06,0,-4e-06,-5e-06,-4e-06,0,5e-06,-3e-06,-2e-06,-1e-06,-2e-06,-1e-06,0,-2e-06,0,5e-06,-1e-06,-7e-06,-6e-06,-2e-06,2e-06,-5e-06,0,1e-06,-1e-06,-1e-06,-3e-06,-2e-06,-2e-06,1e-06,1.2e-05,0,3e-06,4e-06,0,-6e-06,-3e-06,-1.2e-05,-2e-06,-1e-06,-3e-06,-4e-06,-7e-06,2e-06,0
2e-06,-1e-06,4e-06,-1e-06,4e-06,-4e-06,1e-06,2e-06,-2e-06,-9e-06,4e-06,0,1e-06,-5e-06,-4e-06,1e-06,-3e-06,-6e-06,-7e-06,0,-2e-06,1e-06,-3e-06,-3e-06,-3e-06,0,1e-06,0,-2e-06,-3e-06,-1e-06,0,-2e-06,2e-06,-1e-06,-2e-06,-7e-06,1e-06,-6e-06,-6e-06,1e-06,7e-06,0,0,2e-06,-5e-06,-3e-06,2e-06,2e-06,0,-1e-06,-7e-06,1e-06,-3e-06,-6e-06,-3e-06,-6e-06,1e-06,1e-06,0,-4e-06,-3e-06,-2e-06,4e-06,-2e-06,2e-06,1e-06,2e-06,1e-06,-4e-06,2e-06,1e-06,-1e-06,0,2e-06,2e-06,-4e-06,0,-3e-06,-3e-06,-1e-06,-1e-06,3e-06,-8e-06,-2e-06,-4e-06,-1e-06,5e-06,-7e-06,1e-06,9e-06,-6e-06,0,-9e-06,5e-06,-2e-06,3e-06,-8e-06,-3e-06,1e-06,9e-06,6e-06,-5e-06,0,-4e-06,-1e-06,-1e-06,0,-3e-06,6e-06,2e-06,-3e-06,6e-06,-1.6e-05,0,-3e-06,-5e-06,-2e-06,1e-06,-7e-06,2e-06
-2e-06,2e-06,4e-06,-1e-06,-2e-06,-1e-06,1e-06,2e-06,-1e-06,-2e-06,0,-1e-06,-1e-06,4e-06,3e-06,-5e-06,-2e-06,4e-06,4e-06,-1e-06,-2e-06,-7e-06,1e-06,0,-2e-06,-1e-05,-1e-06,0,-4e-06,-2e-06,-3e-06,0,-2e-06,1e-06,1e-06,1e-06,-1e-06,-3e-06,2e-06,-1e-06,-1e-06,-8e-06,-2e-06,0,-2e-06,1e-06,-4e-06,1e-06,0,-5e-06,-2e-06,1e-06,1e-06,-1e-06,-7e-06,0,1e-06,1e-06,0,1e-06,-2e-06,-3e-06,-1e-06,4e-06,1e-06,-1e-06,1e-06,-2e-06,-4e-06,-2e-06,0,-5e-06,0,0,-4e-06,0,-4e-06,0,0,0,1e-06,-1e-06,0,4e-06,-1e-06,1e-06,-1e-06,2e-06,0,-2e-06,7e-06,-6e-06,3e-06,-1e-06,6e-06,-2e-06,0,1e-06,2e-06,1e-06,2e-06,-5e-06,-3e-06,0,-1e-06,-3e-06,-5e-06,2e-06,-5e-06,-1e-06,4e-06,-3e-06,1.1e-05,-7e-06,3e-06,-6e-06,0,0,-4e-06,-3e-06,3e-06
0,1e-06,-1e-06,-1e-06,-3e-06,0,1e-06,-1e-06,-5e-06,-3e-06,2e-06,-4e-06,1e-06,-2e-06,0,5e-06,1e-06,-5e-06,4e-06,-2e-06,4e-06,-4e-06,0,0,-1e-06,0,0,1e-06,-1e-06,0,2e-06,0,7e-06,0,0,2e-06,3e-06,1e-06,-2e-06,-2e-06,1e-06,-8e-06,-1e-06,1e-06,2e-06,3e-06,2e-06,3e-06,0,-1e-06,0,0,-3e-06,0,2e-06,2e-06,3e-06,0,-1e-06,3e-06,1e-06,-1e-06,1e-06,0,-1e-06,-3e-06,2e-06,2e-06,1e-06,3e-06,-3e-06,-3e-06,1e-06,-1e-06,-1e-06,-3e-06,0,-1e-06,-3e-06,2e-06,-3e-06,0,-3e-06,3e-06,1e-06,-3e-06,0,-4e-06,0,0,-8e-06,-4e-06,3e-06,-7e-06,-8e-06,-3e-06,-1e-06,8e-06,-1e-06,0,-5e-06,-4e-06,-5e-06,-4e-06,-1e-06,2e-06,-2e-06,-2e-06,-1e-06,1e-06,0,-1e-06,7e-06,6e-06,1e-06,-3e-06,0,-3e-06,-3e-06,3e-06,2e-06
-1e-06,0,-3e-06,7e-06,4e-06,-4e-06,-1e-06,3e-06,-4e-06,-3e-06,1e-06,-2e-06,0,3e-06,0,4e-06,3e-06,-4e-06,-1e-06,0,0,1e-06,-1e-06,2e-06,-1e-06,6e-06,1e-06,0,1e-06,0,0,0,-2e-06,0,0,0,2e-06,2e-06,1e-06,1e-06,-2e-06,9e-06,0,-1e-06,-1e-06,-3e-06,1e-06,0,1e-06,0,0,-2e-06,-4e-06,1e-06,-3e-06,1e-06,-2e-06,1e-06,0,0,-2e-06,-1e-06,0,2e-06,1e-06,2e-06,2e-06,-1e-06,0,2e-06,0,2e-06,0,1e-06,1e-06,1e-06,2e-06,0,-5e-06,1e-06,2e-06,0,-5e-06,-3e-06,-1e-06,0,0,-2e-06,2e-06,-2e-06,2e-06,0,0,-3e-06,3e-06,-3e-06,0,4e-06,2e-06,-1e-06,1e-06,2e-06,-1e-06,0,1e-06,-5e-06,1e-06,-1e-06,4e-06,0,-1e-06,2e-06,-4e-06,7e-06,-1e-06,-5e-06,-1e-06,-3e-06,2e-06,4e-06,0
-2e-06,-3e-06,-2e-06,0,4e-06,-1e-06,0,-1e-06,1e-06,3e-06,1e-06,-1e-06,-1e-06,0,1e-06,2e-06,1e-06,1e-06,0,1e-06,-1e-06,0,0,1e-06,-1e-06,-1e-06,-2e-06,1e-06,1e-06,0,1e-06,-1e-06,-1e-06,2e-06,1e-06,1e-06,-3e-06,0,-2e-06,2e-06,1e-06,4e-06,-2e-06,1e-06,0,-3e-06,-1e-06,-1e-06,-1e-06,1e-06,-1e-06,2e-06,0,0,-3e-06,-1e-06,1e-06,-1e-06,0,1e-06,-1e-06,0,-1e-06,-3e-06,-1e-06,2e-06,0,-1e-06,-1e-06,0,1e-06,-1e-06,1e-06,-1e-06,-2e-06,-3e-06,-1e-06,1e-06,-1e-06,2e-06,1e-06,1e-06,-5e-06,-7e-06,-1e-06,0,0,3e-06,4e-06,0,7e-06,4e-06,0,-6e-06,1e-06,-1e-06,-1e-06,-2e-06,-2e-06,0,-1e-06,2e-06,0,-3e-06,2e-06,2e-06,0,0,-1e-06,-3e-06,0,-4e-06,-7e-06,8e-06,0,-2e-06,-1e-06,-2e-06,-3e-06,2e-06,-3e-06
-1e-06,2e-06,0,-5e-06,-3e-06,2e-06,-2e-06,0,3e-06,2e-06,0,0,0,1e-06,-3e-06,1e-06,-1e-06,1e-06,2e-06,2e-06,0,-2e-06,0,-1e-06,0,2e-06,-3e-06,0,1e-06,0,-2e-06,-1e-06,2e-06,-1e-06,-1e-06,0,-1e-06,-2e-06,1e-06,2e-06,-1e-06,-3e-06,0,-1e-06,-1e-06,3e-06,-3e-06,-3e-06,0,-1e-06,0,3e-06,0,0,1e-06,-1e-06,2e-06,0,0,0,2e-06,2e-06,0,4e-06,0,-2e-06,0,1e-06,-1e-06,0,0,3e-06,1e-06,1e-06,2e-06,2e-06,-3e-06,0,1e-06,-1e-06,-2e-06,-1e-06,-4e-06,4e-06,0,-9e-06,-1e-06,0,0,-1e-06,-7e-06,-2e-06,-3e-06,-4e-06,-5e-06,-1e-06,-1e-06,-1e-06,1e-06,0,-3e-06,0,1e-06,2e-06,0,-3e-06,-3e-06,0,1e-06,3e-06,0,-2e-06,0,-2e-06,-1e-06,-1e-06,1e-06,-2e-06,-3e-06,-4e-06,-3e-06
-1e-06,2e-06,2e-06,2e-06,-1e-06,0,1e-06,2e-06,0,2e-06,1e-06,-3e-06,0,-3e-06,1e-06,-1e-06,-2e-06,-2e-06,-3e-06,0,-1e-06,2e-06,0,0,0,5e-06,-1e-06,0,0,1e-06,-1e-06,-1e-06,-1e-06,0,1e-06,-1e-06,1e-06,0,-1e-06,2e-06,1e-06,-3e-06,-1e-06,-1e-06,1e-06,1e-06,1e-06,0,0,0,-1e-06,1e-06,-3e-06,-1e-06,2e-06,0,-4e-06,-2e-06,-1e-06,-1e-06,1e-06,1e-06,0,-2e-06,0,0,-2e-06,1e-06,1e-06,0,-1e-06,2e-06,1e-06,-1e-06,2e-06,0,-1e-06,-1e-06,-1e-06,-1e-06,1e-06,0,-2e-06,3e-06,0,5e-06,-2e-06,0,-3e-06,0,-5e-06,-4e-06,-1e-06,-1e-06,3e-06,0,-1e-06,-4e-06,0,0,1e-06,-1e-06,2e-06,0,-2e-06,1e-06,-1e-06,-1e-06,1e-06,1e-06,0,0,-2e-06,-8e-06,-1e-06,-3e-06,2e-06,-2e-06,2e-06,-3e-06,-1e-06
-1e-06,-1e-06,1e-06,1e-06,2e-06,-2e-06,0,-2e-06,-1e-06,3e-06,-1e-06,0,0,0,-1e-06,4e-06,-1e-06,0,-2e-06,0,1e-06,3e-06,1e-06,-1e-06,0,-3e-06,0,0,0,-1e-06,1e-06,-1e-06,2e-06,-2e-06,0,-1e-06,1e-06,1e-06,-1e-06,1e-06,-1e-06,-2e-06,-1e-06,1e-06,-1e-06,-2e-06,0,-1e-06,0,1e-06,0,-4e-06,-3e-06,0,-1e-06,1e-06,2e-06,0,0,1e-06,0,0,-1e-06,1e-06,0,1e-06,0,-1e-06,0,0,1e-06,-2e-06,0,1e-06,-4e-06,-1e-06,0,0,-1e-06,-2e-06,1e-06,0,1e-06,-3e-06,0,3e-06,-1e-06,0,0,-1e-06,2e-06,-3e-06,-1e-06,1e-06,-2e-06,0,-1e-06,-3e-06,0,0,5e-06,-2e-06,2e-06,1e-06,0,-1e-06,2e-06,0,-1e-06,-1e-06,0,-1e-06,-3e-06,-7e-06,1e-06,-1e-06,1e-06,0,-2e-06,2e-06,-1e-06
0,-3e-06,0,1e-06,-1e-06,-1e-06,0,1e-06,-1e-06,2e-06,-1e-06,0,0,0,0,1e-06,0,2e-06,1e-06,-1e-06,-1e-06,0,0,0,1e-06,-5e-06,0,0,0,-1e-06,0,-1e-06,-1e-06,1e-06,0,0,-1e-06,-1e-06,-1e-06,0,1e-06,3e-06,-1e-06,0,1e-06,-1e-06,-2e-06,0,0,0,0,-2e-06,-2e-06,-1e-06,1e-06,0,0,2e-06,0,0,1e-06,-1e-06,0,-3e-06,0,-1e-06,0,0,-1e-06,-1e-06,-1e-06,0,0,0,1e-06,1e-06,0,0,1e-06,1e-06,-1e-06,0,2e-06,-1e-06,0,-2e-06,-2e-06,1e-06,-2e-06,0,2e-06,1e-06,1e-06,1e-06,0,1e-06,0,3e-06,-1e-06,0,-1e-06,1e-06,1e-06,1e-06,0,-1e-06,-1e-06,1e-06,-3e-06,1e-06,0,0,1e-06,-2e-06,1e-06,-2e-06,0,2e-06,-3e-06,2e-06,1e-06
0,3e-06,-1e-06,-1e-06,-3e-06,0,0,0,-1e-06,-1e-06,-1e-06,0,0,1e-06,1e-06,1e-06,1e-06,2e-06,0,-1e-06,0,-1e-06,0,0,0,0,0,0,1e-06,0,0,-1e-06,0,1e-06,0,0,-1e-06,0,-1e-06,1e-06,-1e-06,0,-1e-06,0,-1e-06,1e-06,0,-1e-06,-1e-06,0,0,1e-06,0,0,4e-06,-1e-06,-2e-06,2e-06,0,1e-06,1e-06,-1e-06,0,0,0,0,0,0,0,0,0,-2e-06,0,0,1e-06,-2e-06,-1e-06,0,1e-06,1e-06,1e-06,0,3e-06,4e-06,0,3e-06,0,-2e-06,2e-06,-1e-06,1e-06,1e-06,1e-06,-5e-06,3e-06,0,0,3e-06,1e-06,0,-5e-06,1e-06,0,0,-1e-06,0,-1e-06,-1e-06,1e-06,-1e-06,0,-1e-06,3e-06,5e-06,-1e-06,-2e-06,-1e-06,1e-06,1e-06,1e-06,1e-06
-1e-06,2e-06,0,-2e-06,1e-06,-1e-06,0,-1e-06,-2e-06,0,0,1e-06,0,-1e-06,-1e-06,-2e-06,1e-06,-1e-06,0,0,1e-06,1e-06,0,0,0,1e-06,2e-06,0,1e-06,0,0,-1e-06,1e-06,-1e-06,0,0,1e-06,1e-06,0,0,0,-3e-06,-1e-06,0,1e-06,1e-06,0,0,0,-1e-06,0,1e-06,-1e-06,0,0,0,2e-06,1e-06,0,0,-1e-06,0,-1e-06,2e-06,0,0,1e-06,0,0,0,1e-06,-1e-06,0,0,-1e-06,1e-06,-1e-06,0,-1e-06,1e-06,0,0,2e-06,2e-06,0,-2e-06,-2e-06,0,2e-06,0,0,0,1e-06,-3e-06,-2e-06,1e-06,-1e-06,1e-06,-1e-06,0,1e-06,-2e-06,-1e-06,1e-06,0,-1e-06,-2e-06,1e-06,1e-06,-1e-06,0,-2e-06,3e-06,7e-06,1e-06,-1e-06,0,2e-06,-1e-06,-3e-06,1e-06
-1e-06,-2e-06,0,2e-06,2e-06,-1e-06,0,1e-06,0,-1e-06,-1e-06,-1e-06,0,1e-06,1e-06,-1e-06,0,2e-06,2e-06,0,0,0,1e-06,0,0,-1e-06,1e-06,0,1e-06,-1e-06,1e-06,-1e-06,-2e-06,0,0,0,1e-06,-1e-06,-1e-06,-1e-06,0,-1e-06,0,0,-1e-06,-1e-06,-1e-06,-1e-06,0,0,0,0,-2e-06,0,1e-06,0,0,1e-06,0,0,0,0,0,-1e-06,0,0,0,0,-1e-06,0,-1e-06,1e-06,0,0,1e-06,-1e-06,-1e-06,0,-2e-06,0,0,0,2e-06,-3e-06,0,0,0,1e-06,0,0,-1e-06,-3e-06,1e-06,-5e-06,1e-06,0,0,-1e-06,1e-06,0,3e-06,0,-1e-06,-1e-06,1e-06,1e-06,1e-06,0,-1e-06,2e-06,0,0,1e-06,2e-06,0,-1e-06,0,1e-06,-2e-06,-2e-06,0
-1e-06,-1e-06,1e-06,0,-1e-06,0,-1e-06,-1e-06,2e-06,-3e-06,-1e-06,1e-06,0,-1e-06,-1e-06,0,-1e-06,2e-06,1e-06,0,0,-2e-06,-1e-06,0,0,1e-06,1e-06,0,0,0,0,-1e-06,0,-1e-06,0,0,-1e-06,-1e-06,0,-1e-06,0,4e-06,0,0,0,-1e-06,0,0,0,1e-06,0,1e-06,-1e-06,0,2e-06,0,-1e-06,0,0,0,0,0,0,1e-06,0,0,1e-06,-1e-06,0,0,0,0,0,0,0,1e-06,0,0,-1e-06,-1e-06,1e-06,0,1e-06,0,0,2e-06,-1e-06,1e-06,-1e-06,0,0,-1e-06,0,-1e-06,0,1e-06,0,-1e-06,-1e-06,0,-1e-06,1e-06,-1e-06,0,-1e-06,-2e-06,0,0,1e-06,0,0,-1e-06,-1e-06,-3e-06,-1e-06,-1e-06,0,2e-06,1e-06,1e-06,0
-1e-06,2e-06,1e-06,-2e-06,-1e-06,0,1e-06,-1e-06,1e-06,-1e-06,1e-06,0,0,0,0,0,-1e-06,1e-06,-1e-06,1e-06,0,-1e-06,0,-1e-06,0,2e-06,0,0,0,1e-06,0,0,0,1e-06,0,0,0,0,-1e-06,0,0,1e-06,0,0,0,1e-06,0,0,0,0,0,1e-06,0,0,1e-06,0,2e-06,0,0,0,0,1e-06,0,-3e-06,0,0,0,1e-06,0,0,1e-06,1e-06,0,0,0,0,1e-06,0,-1e-06,0,-1e-06,0,0,2e-06,0,-1e-06,0,-1e-06,-1e-06,0,2e-06,0,0,-1e-06,-3e-06,0,0,-2e-06,0,0,0,-1e-06,-1e-06,-1e-06,-1e-06,1e-06,-1e-06,0,1e-06,-1e-06,0,-1e-06,-3e-06,-7e-06,0,-2e-06,-1e-06,1e-06,-1e-06,2e-06,-1e-06
0,0,0,0,2e-06,-1e-06,0,1e-06,-1e-06,0,0,0,0,-1e-06,0,0,0,-1e-06,0,0,0,0,0,0,0,-2e-06,0,0,0,-1e-06,0,0,0,-1e-06,0,0,1e-06,0,0,-1e-06,0,-4e-06,0,0,0,1e-06,-1e-06,0,0,0,0,-1e-06,-1e-06,0,0,0,-1e-06,-1e-06,0,0,0,0,0,1e-06,0,0,0,0,0,0,0,0,0,0,0,1e-06,0,0,-1e-06,-1e-06,0,0,-1e-06,1e-06,0,-2e-06,0,0,-1e-06,0,-2e-06,1e-06,-1e-06,0,1e-06,1e-06,0,0,-1e-06,0,2e-06,-1e-06,0,0,0,-2e-06,0,0,-2e-06,1e-06,0,0,-1e-06,-3e-06,0,-1e-06,0,0,-2e-06,1e-06,-1e-06
0,-2e-06,-1e-06,1e-06,0,-1e-06,0,-1e-06,-1e-06,0,1e-06,0,0,1e-06,-1e-06,-2e-06,0,2e-06,0,0,0,0,0,0,0,-3e-06,-1e-06,0,0,0,0,0,1e-06,0,0,0,0,0,-1e-06,-1e-06,0,-1e-06,0,0,0,-2e-06,-1e-06,0,0,0,0,-1e-06,-1e-06,0,0,0,-1e-06,-1e-06,0,0,0,0,0,0,0,0,-1e-06,0,0,0,0,-1e-06,0,0,-1e-06,-1e-06,-1e-06,0,-1e-06,1e-06,1e-06,0,-2e-06,-2e-06,0,-1e-06,0,0,1e-06,0,-3e-06,0,0,-2e-06,0,0,0,2e-06,1e-06,0,-1e-06,1e-06,0,0,0,1e-06,0,0,-1e-06,-1e-06,0,-1e-06,2e-06,1e-06,-1e-06,-1e-06,0,1e-06,1e-06,-2e-06,0
0,0,0,0,-2e-06,0,0,0,0,1e-06,0,0,0,0,1e-06,0,1e-06,0,-1e-06,0,-1e-06,0,0,0,0,1e-06,-1e-06,0,0,1e-06,0,0,-1e-06,0,0,0,-1e-06,0,0,-1e-06,0,2e-06,0,0,0,-1e-06,0,0,0,0,0,0,-1e-06,0,1e-06,0,1e-06,0,0,0,0,-1e-06,0,1e-06,0,-1e-06,0,0,0,0,0,0,0,0,1e-06,0,-1e-06,0,0,0,-1e-06,0,-2e-06,0,0,1e-06,0,0,1e-06,0,2e-06,-1e-06,0,-2e-06,-1e-06,0,0,1e-06,0,0,-3e-06,0,0,0,0,-1e-06,0,0,1e-06,-1e-06,0,0,-1e-06,5e-06,0,-1e-06,1e-06,1e-06,-1e-06,-2e-06,0
0,1e-06,1e-06,-1e-06,1e-06,0,0,0,-1e-06,2e-06,1e-06,0,0,1e-06,-1e-06,-1e-06,0,0,0,0,0,1e-06,0,0,0,0,0,0,0,0,0,0,0,0,0,0,0,0,-1e-06,-1e-06,0,2e-06,-1e-06,0,0,1e-06,0,0,0,0,0,1e-06,-1e-06,0,-1e-06,0,-1e-06,0,0,0,0,0,0,-1e-06,-1e-06,1e-06,0,0,0,0,0,-1e-06,0,0,0,-1e-06,0,0,0,1e-06,1e-06,0,-2e-06,2e-06,0,-1e-06,1e-06,0,1e-06,0,2e-06,-1e-06,0,-2e-06,1e-06,0,0,0,1e-06,0,1e-06,-1e-06,1e-06,1e-06,0,0,0,0,0,1e-06,0,0,0,4e-06,1e-06,-1e-06,0,0,-1e-06,1e-06,0
0,1e-06,0,-1e-06,1e-06,0,0,-1e-06,0,1e-06,0,0,0,-1e-06,0,1e-06,0,-1e-06,1e-06,0,0,2e-06,0,0,0,-1e-06,-1e-06,0,0,-1e-06,0,0,0,0,0,0,0,0,0,-1e-06,0,-1e-06,0,0,0,0,-1e-06,0,0,0,0,0,-1e-06,0,0,0,0,0,0,0,0,0,0,0,0,0,0,0,0,0,0,0,0,0,-1e-06,0,0,0,0,0,0,0,-1e-06,1e-06,0,0,0,0,0,0,-1e-06,0,1e-06,-1e-06,0,0,0,0,-1e-06,0,2e-06,0,1e-06,0,0,0,0,0,-1e-06,0,0,-1e-06,2e-06,0,0,-1e-06,0,0,0,2e-06,0
0,-1e-06,0,1e-06,-1e-06,0,0,1e-06,1e-06,0,0,0,0,0,0,0,-1e-06,1e-06,0,0,0,0,0,0,0,2e-06,-1e-06,0,0,0,0,0,0,0,0,0,0,0,0,0,0,-2e-06,0,0,0,-1e-06,0,0,0,0,0,0,-1e-06,0,0,0,1e-06,0,0,0,0,0,0,1e-06,0,0,1e-06,0,0,0,0,1e-06,0,0,1e-06,1e-06,0,0,0,-1e-06,-1e-06,0,0,-2e-06,0,1e-06,1e-06,1e-06,-1e-06,0,-1e-06,0,0,0,0,-1e-06,0,-1e-06,0,0,-2e-06,0,0,0,0,-1e-06,1e-06,0,1e-06,-1e-06,0,0,1e-06,-4e-06,0,-1e-06,0,0,0,1e-06,0
0,-1e-06,0,0,-1e-06,0,0,-1e-06,1e-06,0,1e-06,0,0,-1e-06,0,-1e-06,-1e-06,0,0,1e-06,0,0,0,0,0,2e-06,0,0,0,0,0,0,0,0,0,0,0,0,0,1e-06,-1e-06,0,0,0,0,0,0,0,0,0,0,0,-1e-06,0,0,0,-1e-06,0,0,0,0,0,0,-1e-06,0,0,0,0,0,0,0,0,0,0,-1e-06,0,-1e-06,0,0,0,1e-06,0,0,-1e-06,0,-1e-06,0,-1e-06,-1e-06,0,1e-06,0,0,-1e-06,0,0,0,-1e-06,0,0,-2e-06,0,0,0,0,0,0,0,1e-06,1e-06,0,-1e-06,-1e-06,-5e-06,0,-1e-06,0,-1e-06,-1e-06,-2e-06,0
0,2e-06,-1e-06,-1e-06,2e-06,0,0,0,0,-1e-06,-1e-06,0,0,0,0,0,0,-1e-06,1e-06,0,0,0,0,0,0,-1e-06,1e-06,0,0,-1e-06,0,0,0,-1e-06,0,0,0,0,0,0,1e-06,2e-06,0,0,0,1e-06,-1e-06,0,0,0,0,1e-06,-1e-06,0,-1e-06,0,0,0,0,0,0,0,0,0,-1e-06,0,0,0,0,0,0,0,0,0,0,1e-06,0,0,-1e-06,0,0,0,1e-06,2e-06,0,1e-06,0,0,0,0,1e-06,0,0,0,0,-1e-06,0,0,1e-06,0,2e-06,0,0,0,0,-1e-06,0,0,-1e-06,0,0,-1e-06,0,-2e-06,0,-1e-06,0,-1e-06,0,-2e-06,0
0,0,0,0,0,0,0,0,-1e-06,-1e-06,0,0,0,0,0,0,0,-1e-06,0,0,0,-1e-06,0,0,0,-1e-06,1e-06,0,0,0,0,0,0,0,0,0,0,0,-1e-06,1e-06,-1e-06,0,0,0,0,0,0,0,0,0,0,0,-1e-06,0,-1e-06,0,1e-06,0,0,0,0,0,0,-1e-06,0,0,0,0,0,0,0,0,0,0,0,-1e-06,0,0,-1e-06,1e-06,-1e-06,0,1e-06,0,0,1e-06,1e-06,0,0,0,-1e-06,0,0,-2e-06,0,0,0,1e-06,0,0,1e-06,0,0,0,0,1e-06,0,0,0,-1e-06,0,0,0,3e-06,0,-1e-06,0,-1e-06,0,1e-06,0
