0.021443,0.033032,0.034591,0.078739,0.190656,0.285216,0.456992,0.723227,1.013086,0.888836,0.59963,0.664388,0.668598,0.641451,0.634766,0.649869,0.705833,0.539851,0.292017,0.184553,0.157686,0.134613,0.112064,0.103085,0.085463,0.072594,0.070937,0.069219
0.026271,0.039669,0.041104,0.093703,0.22315,0.331926,0.519058,0.803642,1.132918,1.009692,0.700789,0.779026,0.761015,0.723503,0.762621,0.798955,0.826901,0.616647,0.335874,0.217096,0.183479,0.155082,0.127819,0.116765,0.101184,0.08863,0.086535,0.083049
0.034365,0.050595,0.05137,0.11607,0.267818,0.396978,0.610233,0.909972,1.286834,1.189453,0.87961,0.979003,0.915387,0.850256,0.972308,1.05028,1.006519,0.714065,0.39445,0.264281,0.217523,0.181092,0.147277,0.133547,0.126017,0.115356,0.111813,0.104677
0.039255,0.057657,0.05726,0.127411,0.282319,0.414025,0.666,0.974462,1.319615,1.274273,1.062169,1.203022,1.101732,0.981896,1.141897,1.239926,1.097826,0.733354,0.419331,0.29121,0.224835,0.183277,0.148515,0.137177,0.143319,0.134407,0.128206,0.116841
0.039839,0.059769,0.057981,0.125001,0.269904,0.393445,0.729788,1.116766,1.391216,1.366884,1.259018,1.431524,1.358881,1.202375,1.271475,1.304509,1.102587,0.709244,0.419684,0.298945,0.212527,0.171256,0.140319,0.130991,0.144636,0.136893,0.128839,0.115012
0.041025,0.06115,0.057057,0.125871,0.275677,0.40424,0.890819,1.438027,1.664132,1.635762,1.549384,1.717143,1.765885,1.579041,1.375617,1.219744,1.023572,0.670277,0.394752,0.287554,0.196861,0.162662,0.142198,0.127816,0.132952,0.127387,0.118701,0.10346
0.04682,0.067199,0.060941,0.156676,0.351598,0.543488,1.333662,2.111331,2.255666,2.264678,2.281925,2.50341,2.611687,2.242135,1.620336,1.22609,1.119865,0.814918,0.463096,0.338557,0.227999,0.179839,0.175518,0.160406,0.145416,0.138112,0.129239,0.11176
0.058854,0.07992,0.070855,0.204685,0.465137,0.813351,2.276644,3.580713,3.593573,3.637692,3.952559,4.347458,4.330008,3.591923,2.511436,1.845714,1.792882,1.364779,0.778297,0.584191,0.373508,0.268872,0.285908,0.275839,0.236834,0.216297,0.198276,0.170411
0.074389,0.097189,0.084028,0.243341,0.55611,1.166297,3.814293,6.172536,6.104274,6.201216,6.936669,7.446287,7.157146,5.96437,4.242997,3.127211,3.035866,2.281021,1.33407,1.044884,0.658356,0.463933,0.501676,0.477207,0.402482,0.364861,0.326582,0.279086
0.090408,0.120449,0.104022,0.285144,0.657265,1.568336,5.785,9.827934,9.832041,9.942105,11.104136,11.503992,10.914509,9.347628,6.726132,4.908169,4.639435,3.375175,2.04751,1.691562,1.065295,0.743011,0.803219,0.743498,0.618163,0.562456,0.493409,0.42302
0.10322,0.147164,0.127398,0.36441,0.855878,1.954676,7.593988,13.629,13.949055,13.947675,15.270757,15.233379,14.687924,13.212407,9.518084,6.765543,6.177202,4.35131,2.732602,2.351873,1.481391,1.028976,1.108402,0.996385,0.820938,0.749428,0.641056,0.557755
0.111654,0.173512,0.152312,0.431534,1.02196,2.089211,8.248569,15.672718,16.702079,16.471301,17.251489,16.627755,16.65533,15.881338,11.446428,7.863266,7.007133,4.891124,3.121168,2.680638,1.681468,1.175955,1.266948,1.1193,0.923876,0.840644,0.694537,0.616967
0.123264,0.206383,0.183524,0.442434,1.036972,1.841564,7.258678,14.485246,16.27498,15.887226,15.431238,14.241219,14.877767,15.042988,10.948524,7.332748,6.435908,4.498273,2.852232,2.371292,1.493958,1.06963,1.16843,1.044362,0.868325,0.772822,0.607254,0.542578
0.134216,0.247263,0.220572,0.378754,0.843932,1.342935,5.065936,10.352479,12.504578,12.271844,10.728402,9.461895,10.172443,10.528953,7.772124,5.25112,4.611996,3.246628,1.99068,1.556384,1.016909,0.767693,0.843384,0.765535,0.631845,0.546479,0.418232,0.367322
0.137274,0.28613,0.252563,0.279788,0.573072,0.918168,3.012072,5.782554,7.385643,7.506201,6.04655,5.341155,5.876317,5.579388,3.923827,2.78352,2.551771,1.877603,1.078981,0.741733,0.518274,0.434532,0.46408,0.412608,0.330306,0.284235,0.232977,0.201076
0.149419,0.346542,0.297092,0.272347,0.562396,0.74892,1.780636,3.010732,3.905275,4.358356,3.400255,2.972719,3.424202,2.793503,1.719242,1.326408,1.206023,0.894672,0.505802,0.304313,0.223774,0.208022,0.212253,0.180909,0.135942,0.124837,0.125857,0.107164
0.187198,0.485059,0.412445,0.388122,0.836087,0.857993,1.317677,2.222282,3.008886,3.361581,2.52082,2.239674,2.766933,2.315159,1.405846,1.008082,0.782758,0.495516,0.295428,0.190686,0.130243,0.119591,0.114538,0.092389,0.07279,0.076513,0.085315,0.072268
0.249247,0.700805,0.596776,0.547711,1.210883,1.105924,1.275364,2.338594,3.134434,3.148957,2.450382,2.405565,2.859363,2.611261,1.868742,1.322053,0.959745,0.55969,0.350181,0.258316,0.155359,0.122705,0.113366,0.09638,0.083658,0.085802,0.085552,0.072305
0.304891,0.898123,0.766914,0.686401,1.548296,1.348042,1.419941,2.825123,3.552628,3.086974,2.481374,2.765096,3.206292,3.039683,2.433118,1.807678,1.301761,0.754433,0.503577,0.387733,0.213663,0.145962,0.13881,0.134885,0.122456,0.113055,0.099745,0.087577
0.324662,0.965518,0.827953,0.741848,1.692937,1.443928,1.553011,3.374217,4.136175,3.228131,2.622559,3.004094,3.37662,3.381786,2.969379,2.374911,1.69624,0.961459,0.679026,0.52969,0.277858,0.176079,0.174075,0.186983,0.172134,0.1485,0.127859,0.117505
0.292954,0.840517,0.725723,0.665211,1.514246,1.347586,1.731622,3.745339,4.448571,3.4603,2.900338,3.046005,3.33001,3.549668,3.300752,2.812534,1.993634,1.112874,0.798343,0.616104,0.331123,0.220341,0.215202,0.234218,0.214419,0.177982,0.162571,0.16007
0.240626,0.622674,0.535681,0.484022,1.065017,1.101362,1.954455,3.790631,4.335585,3.550177,2.98846,2.828794,3.01921,3.39349,3.318811,2.932723,2.050958,1.165653,0.793138,0.587389,0.349182,0.256213,0.237045,0.249732,0.231705,0.190139,0.184812,0.192627
0.216416,0.490996,0.402525,0.2976,0.591654,0.857284,2.032861,3.50807,4.005607,3.377864,2.712867,2.546638,2.777341,3.170042,3.044166,2.622704,1.870763,1.103131,0.659376,0.456693,0.329065,0.267964,0.221894,0.226026,0.225212,0.191986,0.191195,0.197987
0.19227,0.38283,0.302151,0.19202,0.337707,0.749938,1.889344,2.933362,3.409112,2.939081,2.310705,2.383612,2.539863,2.676634,2.410692,1.98241,1.525499,0.947183,0.520795,0.354606,0.306765,0.266945,0.198018,0.192428,0.205324,0.185683,0.178554,0.174175
0.166872,0.293428,0.231611,0.172562,0.303273,0.767216,1.735188,2.471893,2.881801,2.593312,2.165171,2.2251,2.036381,1.9397,1.816989,1.59512,1.330873,0.852277,0.472816,0.344346,0.314402,0.263942,0.1772,0.164466,0.186271,0.180569,0.159096,0.137235
0.157446,0.286961,0.234022,0.17797,0.300031,0.781379,1.716285,2.361142,2.739848,2.600861,2.330972,2.083284,1.503435,1.476607,1.626023,1.56214,1.285914,0.799946,0.449472,0.313287,0.299541,0.25019,0.150091,0.133417,0.167766,0.165856,0.134876,0.102634
0.149917,0.275939,0.227193,0.166482,0.273865,0.731413,1.580839,2.124962,2.644533,2.722855,2.324273,1.80035,1.285854,1.497276,1.620853,1.468054,1.169912,0.705484,0.405424,0.263266,0.250586,0.207114,0.11434,0.096283,0.131798,0.132637,0.105567,0.080791
0.142889,0.249899,0.198957,0.138739,0.240771,0.635356,1.246241,1.663398,2.386531,2.566745,1.98686,1.477142,1.302683,1.570271,1.476003,1.322087,1.130685,0.681226,0.360375,0.212096,0.183493,0.151628,0.093584,0.071855,0.085972,0.08633,0.072467,0.063903
0.125593,0.201918,0.158268,0.114263,0.222486,0.536667,0.964042,1.470951,2.280407,2.269662,1.672679,1.364238,1.439053,1.605526,1.326992,1.238161,1.101639,0.666714,0.326765,0.189731,0.144959,0.117212,0.084121,0.064433,0.064328,0.064276,0.058323,0.057266
0.111044,0.142121,0.110214,0.100258,0.218047,0.532397,0.98656,1.53023,2.0023,1.794971,1.497798,1.364685,1.484651,1.563711,1.163607,1.020591,0.913288,0.606393,0.338886,0.214532,0.153698,0.126115,0.090185,0.064599,0.067,0.066724,0.056456,0.057783
0.10323,0.098921,0.077735,0.102622,0.228185,0.610695,1.272199,1.684995,1.552956,1.318672,1.373906,1.241602,1.26271,1.341347,0.9388,0.724882,0.673506,0.517259,0.391033,0.274372,0.179596,0.143485,0.094579,0.066694,0.073652,0.069366,0.057337,0.064294
0.097493,0.081463,0.062853,0.106668,0.248878,0.696134,1.575668,1.843781,1.452782,1.301147,1.291037,0.987016,0.884018,0.998896,0.690351,0.511747,0.537624,0.477102,0.441286,0.331467,0.200045,0.148352,0.097757,0.0707,0.074022,0.066268,0.05726,0.070643
0.088647,0.077566,0.053378,0.099021,0.255334,0.783441,1.823996,2.009248,1.53652,1.393876,1.127057,0.716909,0.649268,0.841515,0.598715,0.443213,0.571748,0.577319,0.481959,0.338372,0.194259,0.14379,0.1053,0.076973,0.071062,0.0637,0.056185,0.06574
0.080907,0.070891,0.044514,0.084613,0.237792,0.822554,1.882639,2.131342,1.796374,1.429623,0.831476,0.528087,0.651691,0.804898,0.563689,0.470325,0.644067,0.657947,0.468705,0.29995,0.170519,0.132721,0.106652,0.08825,0.077049,0.057883,0.046522,0.051511
0.067844,0.057399,0.037736,0.089843,0.23404,0.820896,1.73526,1.991844,2.008532,1.490745,0.670729,0.506888,0.680758,0.716167,0.529805,0.498909,0.640557,0.661436,0.459633,0.264731,0.138377,0.103319,0.088919,0.091615,0.082342,0.051382,0.03677,0.042003
0.049805,0.040496,0.027394,0.097625,0.274142,0.878569,1.665002,1.777664,1.941751,1.509607,0.659856,0.563029,0.654513,0.558201,0.452097,0.443896,0.51731,0.55716,0.41347,0.215148,0.105931,0.076726,0.059204,0.081029,0.077462,0.040572,0.028645,0.033587
0.046629,0.03478,0.017941,0.097979,0.330662,0.923257,1.679233,1.578417,1.548674,1.299764,0.617743,0.634584,0.635444,0.407467,0.317831,0.341361,0.41827,0.423019,0.305591,0.160709,0.083579,0.065565,0.047744,0.071122,0.067819,0.032319,0.022429,0.023736
0.053092,0.03306,0.012377,0.098822,0.373938,0.892928,1.594608,1.317326,1.01972,0.980121,0.60837,0.719331,0.654298,0.321703,0.198791,0.309206,0.426706,0.335354,0.19839,0.120489,0.074827,0.068464,0.056934,0.066302,0.05906,0.034277,0.023337,0.018224
0.055782,0.029606,0.010279,0.105557,0.392573,0.880861,1.553348,1.198554,0.651193,0.72366,0.62239,0.747576,0.628965,0.255861,0.18395,0.336539,0.414376,0.284621,0.165452,0.123674,0.080625,0.066294,0.061118,0.05497,0.046393,0.035217,0.026688,0.021437
0.051065,0.022979,0.009598,0.106926,0.379576,0.880343,1.602713,1.206399,0.528511,0.674962,0.700213,0.704284,0.576904,0.243401,0.260156,0.370555,0.341356,0.210485,0.14608,0.152821,0.091018,0.054888,0.054341,0.043226,0.040963,0.033703,0.027877,0.026649
