-0.001906,-0.00459,-0.002569,-0.004825,-0.002798,-0.002588,-0.003027,-0.003151,-0.003448,-0.006108,-0.003392,-0.003313,-0.001453,-0.000367,-0.000525,-0.003393,-0.002979,-0.002746,-0.005919,-0.008179,-0.003294,-0.004841,-0.004638,-0.006007,-0.00552,-0.00431,-0.004458,-0.005611,-0.002571,-0.001797,-0.00295,-0.005742,-0.006826,-0.003727,-0.007364,-0.005556,-0.000601,-0.003956,-0.008315,-0.008077,-0.006123,-0.004658,-0.004554,-0.010011,-0.006062,-0.00731,-0.003883,-0.010195,-0.004509,-0.004834,-0.010246,-0.004369,-0.004943,-0.007174,-0.008007,-0.005472,-0.005329,-0.003831,-0.004964,-0.002749,-0.007217,-0.005535,-0.007531,-0.006183,-0.008258,-0.006177,-0.00439,-0.004789,-0.004579,-0.006508,-0.005479,-0.005753,-0.002201,-0.00695,-0.005154,-0.005255,-0.006902,-0.011161,-0.00874,-0.004073,-0.004132,-0.004364,-0.002877,-0.003615,-0.005624,-0.00865,-0.006538,-0.005666,-0.004921,-0.006463,-0.004027,-0.007846,-0.00831,-0.003503,-0.00426,-0.006259,-0.0037,-0.004545,-0.005446,-0.00294,-0.002386,-0.001949,-0.001252,-0.003812,-0.005427,-0.007529,-0.00634,-0.006317,-0.009677,-0.007186,-0.008427,-0.006723,-0.003172,-0.002021,-0.005787,-0.007533,-0.006406,-0.012153,-0.005762,-0.006265,-0.00514
-0.001864,0.000456,0.000467,0.001505,-0.001236,-0.000907,-0.001468,0.000925,-0.000828,0.002612,0.000664,-0.000393,-0.000819,-0.001032,-0.002125,-0.002052,-0.002407,-0.00062,0.001044,0.003141,-0.000629,-0.000827,0.000272,-0.001083,0.000854,-0.00031,0.000449,-0.002293,-0.002335,-0.004277,0.000547,0.000947,0.002687,0.000529,0.000478,-0.001712,-0.000821,-0.000278,0.003425,0.002166,-0.000775,0.00095,0.000726,0.00075,-0.00217,-0.003171,-0.001515,0.000641,-0.000397,-0.002658,0.003379,-0.006806,-0.005177,-0.001113,-0.002388,-0.001152,0.000319,-0.001622,-0.001967,-0.004051,-0.000979,-0.00226,4.8e-05,-0.000386,0.000488,0.001088,-0.000745,-0.003584,-0.005061,-0.001054,0.001881,0.000314,-0.002,-0.003117,-0.000143,-0.00439,-0.002757,-0.000352,4.2e-05,6.2e-05,-0.000757,2.1e-05,0.000116,-0.000263,0.000518,0.003523,0.002265,0.00032,-0.000178,-0.001055,0.001003,-0.001286,0.001701,-0.000673,0.001318,0.000238,0.001259,0.000717,-0.002035,-0.001543,-0.003384,-0.005221,-0.003574,0.000792,-0.000973,0.002767,0.001964,0.003504,0.003087,-4.1e-05,-0.002659,-0.000985,-0.001701,-0.000994,-0.002003,0.002173,0.00195,0.003453,0.001107,0.000535,0.000221
0.001237,0.00065,-0.001043,-0.002611,-0.000523,0.001023,0.000605,-0.00153,-0.001076,-0.002546,-0.002647,-0.000809,-0.000359,-0.00011,0.000305,0.000308,0.001935,0.001144,-0.000758,-0.002048,-0.000877,0.000355,-0.001486,0.00121,-0.000489,0.000624,-0.002168,0.001446,0.001478,0.002823,-7.8e-05,-0.002843,-0.002058,-0.000353,0.000282,0.000946,-0.000644,-0.000688,-0.002215,-0.000816,0.001191,-0.001787,-0.001935,-0.001047,-0.000702,-0.000653,-0.000871,-0.000637,0.000235,0.002788,-0.00417,-0.001529,0.000263,0.000338,0.000164,-0.000314,0.001794,-0.001384,-0.000969,-0.000199,0.000158,0.003177,0.001185,-0.001725,-0.003922,-0.001485,-0.00093,-0.000805,0.001497,0.000197,-0.002749,-0.001176,-0.000492,3e-04,0.000476,0.000421,0.001181,0.001127,0.001407,-0.002503,-0.000673,3e-04,-0.001073,9.8e-05,-0.000802,-0.001684,-0.000268,-8.8e-05,0.00031,-0.000836,-0.002782,-0.002197,-0.002734,-0.001481,-0.002014,-0.003256,-0.001312,-0.002998,-0.004846,-0.002088,-0.001796,-0.001659,-0.001152,-0.001974,0.000247,-0.003651,-0.004089,-0.004055,-0.005293,-0.002358,0.002808,-0.000148,-0.002121,-0.003058,-0.002563,-0.001679,-0.000546,-0.004039,-0.00508,-0.007247,-0.003651
0.000251,-0.000127,0.000808,0.001942,0.001958,0.000579,0.001034,0.00233,0.002595,0.002446,0.003466,0.002087,0.001214,0.000666,0.000481,0.001267,-7.9e-05,-0.00135,0.002996,0.001081,0.000781,0.001416,0.003393,0.001551,0.001614,0.000511,0.002705,0.000949,0.000919,0.001136,-0.000425,0.001148,0.001758,0.001922,-0.001445,0.000571,0.000826,0.002214,0.001167,-0.000833,0.000347,0.001336,-0.000696,0.002965,0.001897,0.001669,0.003134,0.003588,0.001897,0.000858,0.001671,0.005239,0.004294,0.000109,0.001419,0.000918,-0.000571,-0.000144,0.002712,0.000948,0.001765,-0.001687,-0.00147,0.002737,0.004855,0.001416,0.001243,0.002015,0.001612,0.00361,0.003083,0.002873,0.0018,0.003072,0.000805,0.002643,0.002594,0.002197,0.000444,0.00189,0.001881,0.000109,0.000742,0.000522,0.001943,-0.001383,0.001652,-0.000168,-0.000454,0.003497,0.003073,0.002646,0.001749,0.001337,0.000663,0.002278,0.001938,0.000775,0.00536,0.001936,0.003588,0.002799,0.001177,0.000707,0.000336,0.003195,0.002958,-0.000105,0.003837,0.00153,-0.001936,-0.000425,0.00208,0.003802,0.003241,0.00123,-0.000301,0.00307,0.003107,0.002918,0.00144
-0.001318,-0.00069,0.000219,-3.3e-05,-0.001154,-0.002008,-0.001097,-0.001111,-0.00058,-0.00124,-0.001491,-0.000815,-0.000279,-0.000599,0.000468,0.000155,-0.000936,0.000886,-0.003289,0.000289,-0.001317,0.000282,-0.002449,-0.002171,0.000359,-0.000124,-0.001318,-0.001264,-0.00104,-0.00149,0.000206,0.000614,-0.000577,-0.001822,0.001364,-0.000904,-0.001884,-0.000256,4e-05,0.001852,-0.000132,0.001674,0.001684,-0.001082,-0.000183,-0.000236,-0.000686,-0.002986,-0.003269,-0.001834,-0.000142,-0.00246,-0.002622,0.000647,0.000924,-0.001673,-0.000236,0.000229,-0.001866,0.000745,0.001063,-0.000535,0.000966,-0.001631,-0.001685,-0.001022,-0.000924,0.001505,-0.000185,-0.001999,-0.000772,-0.00083,-0.000806,-0.002023,-4.1e-05,-0.001367,-0.002664,-0.001744,-0.003326,-0.000889,0.000562,0.000153,0.000699,0.001083,-0.000961,0.000885,-0.002808,0.000187,0.001563,-0.00166,-0.001238,0.00109,0.00029,0.000457,0.000513,-0.000118,-0.001051,-0.000122,1.3e-05,-0.000913,-0.000944,0.000708,-0.000449,-0.000608,-7.7e-05,-0.002439,-0.002237,0.000904,-0.000505,0.000121,0.00185,0.000814,-0.001311,-0.002179,0.000632,0.001471,0.000906,-0.000592,0.000854,0.001545,0.000329
0.00024,0.000298,0.000281,8.7e-05,0.000663,0.001286,-0.000379,-0.00016,-0.001352,0.000586,0.000715,-0.000185,-0.000988,-0.000358,-0.001066,-0.000204,0.001113,-0.000815,0.000519,-0.000352,0.001947,-0.000834,0.000423,0.000237,-0.001408,-0.00114,0.000149,0.000549,0.000622,0.000693,5e-06,-8e-05,-0.000232,0.000633,-0.001037,-5e-04,0.000971,-0.00102,-0.001575,-0.001218,-0.00068,-0.00106,-0.000672,-0.000298,0.000537,-0.000469,-0.001157,0.00184,0.003595,0.000488,-0.000208,0.002214,0.00106,-0.000375,-0.002245,-0.000435,-0.000719,-0.001148,-0.000768,-0.002817,-0.003883,-0.000155,0.000646,0.000815,0.000225,-4e-06,-0.001133,-0.002858,-0.001705,-0.000902,-0.000444,-0.000837,-0.000735,0.000722,-0.000402,-0.000195,0.001421,0.000765,0.002245,0.002204,-0.000421,-0.000999,0.001239,-0.001563,0.000477,9.7e-05,0.001643,-0.000172,-0.001879,-0.000154,0.00146,-0.000374,0.001226,0.000451,-0.001444,0.000912,0.000883,0.000553,-6.1e-05,0.002558,-0.00169,-0.000255,0.000162,0.00243,0.001274,0.001838,0.002309,-0.000577,-0.000998,-0.00099,0.00042,0.001698,0.002166,0.002425,-0.000139,0.000594,-0.001142,-0.000917,0.001134,0.001417,0.003036
0.000737,0.000282,-0.001246,-0.000659,-0.000162,0.000234,0.000379,0.000252,0.001324,-0.000459,-5.7e-05,0.000407,0.000897,0.000869,0.000408,-0.000103,6.5e-05,0.000163,0.000551,-0.000231,-0.000249,0.000419,0.000259,0.000917,0.001015,0.000231,0.000598,-0.000216,-0.001659,-4.3e-05,-0.000598,1.4e-05,5.8e-05,-0.000762,0.000814,0.000779,0.001292,0.00055,0.001487,0.000312,0.000474,0.000409,-0.000424,0.000223,0.000495,0.000973,0.000213,-0.001361,-0.002023,-0.000615,0.001403,-0.001351,-0.000976,0.000631,0.002385,0.001734,0.000258,0.000653,-0.001111,0.001162,0.002101,0.000913,-7.2e-05,-0.001352,-0.001539,-0.000786,0.001128,0.001926,0.002415,0.001256,0.000132,0.000543,0.001007,-0.000251,0.000866,0.000714,0.001071,5.6e-05,0.000253,-0.000812,-0.000105,0.001273,-0.000377,0.000857,0.000238,0.000318,0.001687,0.000309,0.000948,0.000359,-0.001434,0.000117,-0.001606,-0.00127,0.001453,-0.000945,-0.000711,0.000298,-0.001629,-0.001146,0.000268,-0.000324,0.001285,-0.000128,-0.001109,-0.000532,-0.001375,0.001138,0.001054,0.002561,-0.001941,-0.001702,-0.000137,-0.001052,-0.000915,-0.000535,2.8e-05,-0.000852,-0.002712,-0.002231,-0.000842
-0.000693,-0.000469,0.00103,0.000242,-0.000254,-0.000427,0.000275,-0.000189,-0.000734,-0.000152,-0.000314,-0.000456,8e-05,-0.000332,0.00044,0.000245,-0.000731,0.000252,-0.000478,0.000188,-0.000611,-0.000332,-0.00067,-0.000719,-0.000856,-0.000268,-0.000231,4.1e-05,0.000362,-0.000145,0.000523,-0.000638,-0.00012,0.001498,0.000111,0.000532,-0.001847,-0.000583,-0.000293,-0.000853,-0.000222,0.000216,-0.000325,-0.001178,-0.001147,-0.000959,0.00187,0.000518,3.2e-05,0.000246,-0.00151,0.001119,7.2e-05,-0.000808,-0.000892,-0.000781,0.00089,0.00021,0.000557,0.00071,-0.000224,0.000104,0.000457,0.000607,0.001355,-0.000568,-0.000679,-0.000788,-0.000616,-0.000357,5.9e-05,-0.000671,-0.000392,0.000556,-0.000595,-0.001789,-0.000396,0.000197,0.000198,0.000176,-0.000717,-0.000651,0.000349,0.001,-0.000288,0.000225,-0.001923,-0.000249,0.000989,-0.00036,0.000364,-0.000263,-0.00039,0.000296,-3e-06,-0.000613,-0.000693,-0.000534,0.000211,-0.000786,0.000262,0.000745,-0.001614,-0.001405,-0.000385,-0.000937,0.000674,-6e-06,0.000152,-0.001738,0.000436,-0.000871,-0.000629,-0.000659,-9.2e-05,-0.001154,-6e-04,0.001103,0.001112,0.001022,-0.001714
9.3e-05,0.000141,-0.000325,-8e-06,0.000414,0.000382,-0.00026,-0.000305,0.000669,0.00013,0.000315,0.000297,-0.000514,8.9e-05,-0.000352,-0.000263,-0.00015,0.000219,0.001033,7.3e-05,0.001156,0.000547,-2.1e-05,-4.1e-05,0.000218,0.000838,-0.000516,-0.000436,0.001595,0.000478,0.000101,0.000845,-3.3e-05,-0.001427,-0.000248,-0.000931,-0.00029,-0.000386,-0.000263,0.00071,-0.000135,-1.9e-05,0.00059,0.001282,-0.000743,-0.000337,-0.000946,-0.000708,0.000348,0.000937,8.7e-05,-0.000282,-0.000911,-0.001083,-0.000218,-0.000299,0.000427,8.6e-05,0.000155,0.000161,0.000302,-0.000217,-0.00146,0.000144,-0.000314,0.001075,0.000252,-0.000282,-0.000555,-0.001501,0.00087,0.000583,-0.000146,-0.000569,-0.000765,0.000306,-0.000701,-0.00129,-0.000885,-3.4e-05,0.000369,0.000366,-0.000857,-0.001333,-0.00026,-0.000738,-0.000401,-0.000347,-0.000771,0.000195,0.000299,-0.000416,0.000139,-0.000221,-0.000443,0.000643,-0.000492,-0.000111,0.00017,-0.000714,0.000215,-0.000593,0.000391,0.000174,0.000113,0.000261,-0.000485,0.000725,-0.000984,0.000186,-0.000235,0.001323,-0.000595,2.3e-05,-0.000175,-0.000273,0.000657,0.000693,-0.000167,0.00011,-0.000509
1.1e-05,0.000536,-0.000282,0.000177,-0.000656,-0.000395,0.000545,7e-05,-0.000608,-1.3e-05,-0.000106,-0.000295,5e-06,-3.9e-05,3.7e-05,-0.000277,0.000455,-0.000438,-0.000951,-0.000678,-0.000905,-0.00036,0.001302,-9.8e-05,-9e-06,-0.000884,0.000665,0.000305,-0.00049,-0.000523,-0.000453,-0.000442,8.3e-05,0.000944,-0.00043,0.000118,0.000729,0.001145,0.000737,0.000198,-0.000317,-0.001047,0.000574,-0.000787,0.000788,0.001212,-0.000979,0.000457,5.6e-05,-0.000756,0.001159,0.000435,0.000749,0.000871,0.000558,0.000527,-0.000767,-0.000562,0.000496,-0.000957,-6.2e-05,0.000486,0.000542,-0.000324,0.000749,-0.000232,0.000192,0.001224,-0.000111,0.001363,-0.000615,-0.000434,-0.000353,-0.000628,0.000512,0.000799,0.000688,0.001018,0.00048,-0.000523,3.4e-05,-0.001098,0.000549,-0.000366,0.000831,0.000442,0.000897,0.000601,0.000136,-0.000217,-9.1e-05,5.8e-05,0.000348,0.00046,0.000103,0.000467,0.00106,0.000863,-0.000126,0.000693,0.000855,0.000337,-9.9e-05,-3.3e-05,0.000245,0.000249,-0.000129,-0.001423,0.000406,2.3e-05,0.000313,-0.000405,8.2e-05,-4e-05,0.000631,0.000897,0.000731,-0.000665,-5e-06,-0.000279,0.000893
0.000451,-0.000205,0.000767,-1.4e-05,0.000567,0.000439,-0.000539,0.000136,0.000488,0.000152,-5.4e-05,0.000232,0.00028,9.5e-05,8.1e-05,0.00041,0.000132,0.000274,0.000317,0.000687,0.000629,-7e-06,-0.000974,-0.000405,-5.5e-05,0.000361,0.000473,4e-05,-0.000569,-0.000149,0.000469,0.000204,0.000263,-0.000624,0.000567,7.2e-05,-2.6e-05,-0.000508,-0.00013,-0.000751,0.000582,0.001169,0.000101,-0.000228,-0.000264,-0.000813,0.000602,0.001257,-0.000361,-0.000496,-0.001051,-0.000159,0.000147,0.000938,-0.000121,0.000323,0.001371,7.2e-05,0.00016,0.001181,-0.000245,-0.000159,0.000939,0.000491,-3e-05,-0.000435,1.7e-05,-0.000801,0.000101,0.000243,0.000189,0.000365,0.000265,0.000706,0.000329,6.7e-05,-1.6e-05,-6.5e-05,0.000125,0.000304,-0.000406,0.000119,-0.00072,-0.000286,-0.000332,-0.00028,-0.000672,-0.000461,-0.000239,7.7e-05,-0.000465,-0.000968,-0.000123,-0.000137,0.000125,0.000137,-0.000383,-0.000175,0.000943,0.000778,-0.000697,-0.00029,0.000645,-0.000102,7.7e-05,0.000177,0.00057,0.000224,-0.000189,-6.5e-05,0.000361,-0.000301,0.000373,0.000558,-0.000199,3.1e-05,0.000219,3.2e-05,0.000131,0.000263,0.00025
-0.000358,-0.000186,-0.000232,-2.1e-05,-0.000138,-0.000333,-6.2e-05,6.2e-05,-0.000208,-0.000263,-4.5e-05,-0.000151,-2.3e-05,3e-06,5.7e-05,-0.000123,-0.000416,-0.000203,-7e-06,-0.000237,-0.000567,0.000179,0.000384,0.00031,0.00022,0.000181,-0.000579,-0.000117,0.000117,0.000372,-7.9e-05,-0.000318,-8.2e-05,0.000436,-0.000566,-0.000101,0.000107,8.2e-05,-0.000388,4.1e-05,-0.000303,-0.000724,-0.000366,0.000265,0.000371,0.000125,-3e-06,-0.001376,0.000166,0.001164,0.000551,-0.000198,-7.9e-05,-0.001404,-0.000531,-0.000504,-0.00142,-2.6e-05,-0.000323,-9e-06,0.000607,-0.000508,-0.00152,-1.5e-05,-8.2e-05,-0.000321,0.000464,9.5e-05,-6e-05,-2.1e-05,1e-05,0.000482,0.000379,-5.6e-05,-0.000171,-0.00033,-0.000108,-0.000447,-0.000259,-0.000148,0.000323,-0.000115,-9.5e-05,-8.2e-05,-1.6e-05,1.5e-05,0.000529,0.000435,1.1e-05,2.1e-05,0.000258,0.00134,0.000231,-0.000451,-1e-04,-0.000703,0.000311,6.3e-05,-0.000383,-0.000824,-0.000483,4.1e-05,-0.00022,-0.000245,-3.6e-05,-0.00029,-0.000326,-0.000307,0.000424,0.000667,-0.000439,0.000252,0.000107,-4.4e-05,-0.000227,-0.000409,-0.000506,-4.4e-05,-0.000449,-0.000465,-5.5e-05
0.000183,-4.8e-05,-9e-06,-6.2e-05,-1e-05,5.4e-05,0.000131,-4.3e-05,0.000168,0.000238,-0.000264,1.4e-05,-0.000132,-0.00022,-0.000147,-1.2e-05,3.7e-05,-8.5e-05,-0.000195,0.000196,0.000343,-0.000645,-0.000204,0.000237,-0.000134,-0.000251,0.000336,0.00012,0.00041,-0.00021,-0.000251,0.000487,-6.3e-05,-1.8e-05,0.000332,2.1e-05,-0.000304,-0.000211,-3.9e-05,0.000523,0.000156,-0.000265,0.000294,-4.2e-05,-0.000212,-0.000204,-7e-06,6.9e-05,0.000201,-0.000497,3.6e-05,0.000241,7.5e-05,-6.8e-05,0.000172,-0.000135,0.000117,9.7e-05,0.000127,0.000264,-0.000448,-4.1e-05,0.00051,-0.000448,-1.8e-05,0.000954,-0.000377,0.000458,3e-06,-0.000649,-3.2e-05,-0.000626,-0.000392,-7.6e-05,-3.7e-05,-5.3e-05,-0.000291,0.000215,7.7e-05,4.4e-05,0.000133,0.000492,0.000132,-0.00014,0.000237,0.000126,-0.000303,-0.00056,-0.000164,6.1e-05,6.6e-05,-0.000219,-4.3e-05,0.000199,0.000372,0.00037,-0.000299,-0.000651,-5.1e-05,-0.000469,6.5e-05,-9e-05,-9.9e-05,0.000146,-0.000307,2.8e-05,-2.1e-05,0.000304,-3e-04,-0.000369,0.000275,0.000151,-0.000762,-0.000134,0.000239,-0.000471,-0.000337,-0.000115,0.000336,0.000325,-4.2e-05
-0.000273,0.000182,0.000143,-7.8e-05,-0.000155,-9.3e-05,0.00014,0.000159,-7.4e-05,-0.000157,0.000224,5.7e-05,0.000138,0.000154,3e-06,6.3e-05,9.9e-05,7.3e-05,0.000448,0,-5.5e-05,0.00055,8.9e-05,-0.000115,0.000157,0.000191,-0.000422,-9.1e-05,-0.000263,-0.000393,0.000135,-0.000232,1.5e-05,-0.00012,-6.9e-05,-1.4e-05,0.000655,0.000493,0.000163,-0.000124,-0.000319,0.000366,-5.9e-05,-0.000223,5.8e-05,0.000128,-2.7e-05,0.000187,8.9e-05,0.000158,-0.000278,-0.000193,-0.000231,0.000554,0.000427,-0.000166,0.000416,-6.4e-05,-7.7e-05,-0.000391,-0.000173,0.000321,0.000199,-8.2e-05,0.000307,-0.000362,0.000268,-3e-04,0.000174,0.000269,-0.000227,-7.9e-05,0.000246,-1.5e-05,-2.4e-05,-7e-05,-0.000164,0.000276,6.9e-05,0.000223,-0.000474,-5.4e-05,7.1e-05,0.000491,8e-05,-0.000127,-9.6e-05,0.000298,0.000127,-9.7e-05,-0.000128,-3.2e-05,1e-05,0.000358,-0.00019,0.000138,-0.000175,0.000276,-0.000128,0.000454,0.00039,0.000134,-5.7e-05,-0.000118,-0.000188,-3.2e-05,0.000153,7.8e-05,0.000385,-0.000386,-0.000799,0.000189,0.000524,5.4e-05,-5.1e-05,0.000757,0.000365,-0.000125,2.1e-05,-7.6e-05,0.000117
0.000163,-6e-06,-0.000283,0.000183,0.000127,0.00016,7.3e-05,-0.000193,9.7e-05,9.9e-05,-2e-05,1.5e-05,-0.000102,8.1e-05,2.8e-05,-1.5e-05,6.5e-05,0.000259,-0.000205,-0.000175,-9e-06,-0.000296,9.2e-05,-7.5e-05,-0.000143,-0.000105,0.000234,8.5e-05,5.8e-05,0.000555,0.00016,-0.000207,3.4e-05,0.000169,-4.1e-05,-1.9e-05,3.9e-05,-0.000286,4e-06,-0.00018,0.000103,-0.000255,-0.000156,0.000201,0.000468,6.6e-05,-0.000147,0.000218,-0.000354,-0.000448,9.8e-05,7.4e-05,0.000237,-0.000226,-0.000229,0.000158,-0.000129,0.000144,0.000211,-7.3e-05,4.1e-05,-0.000117,-0.000167,0.000466,-0.00036,0.000102,-0.000268,0.000204,-0.000133,-5.5e-05,0.000366,0.000144,-0.000268,-9e-06,8.9e-05,0.000185,3.8e-05,-1.4e-05,-9e-06,-0.000143,0.000254,-0.000267,6.4e-05,-9.9e-05,-0.00024,-2.6e-05,0.000374,-2.5e-05,-7.1e-05,0.000455,3.1e-05,-5.5e-05,-0.000128,-0.000302,-0.000263,-0.000517,0.000358,-6.1e-05,-2.1e-05,0.000186,-3.1e-05,1.7e-05,0.000208,0.000103,7.9e-05,-6e-06,-0.000162,-0.000205,-0.000283,0.00039,0.000931,-0.00018,-1.1e-05,-0.000241,-2.1e-05,-0.000326,-4.8e-05,7e-06,-0.000212,-0.000117,4.9e-05
4e-06,-6.6e-05,3.8e-05,1.4e-05,-9e-06,-2.4e-05,-0.000109,-1.4e-05,-0.000205,-6.3e-05,-3.2e-05,-5.1e-05,0.000133,-5.9e-05,3e-06,1.2e-05,-6.7e-05,-0.000351,9e-06,9.2e-05,-0.000251,0.000172,5.9e-05,-0.000155,4.8e-05,-0.000101,-6.1e-05,5e-05,0.000145,-4.2e-05,-0.000151,0.000354,-0.000138,-0.000379,-5.3e-05,-6.1e-05,-0.000471,0.00011,-0.000109,0.000185,0.000234,0.000243,4.8e-05,3e-05,-0.000205,5.1e-05,-0.000107,-0.000153,0.000221,0.000196,4.7e-05,-0.000159,8.5e-05,0.000104,-0.00044,7.3e-05,0.000144,-8.3e-05,0.000146,-0.00022,7.8e-05,8.3e-05,-0.000121,-0.000128,0.000157,6.5e-05,0.000416,-0.000105,4.1e-05,0.000237,-0.000158,-0.000164,0.000233,0.000165,-3.6e-05,1.1e-05,3.4e-05,3.5e-05,6.6e-05,0.000109,0.000134,-2.6e-05,-0.000216,-5e-06,-0.00026,-4.7e-05,-0.000262,1.7e-05,-1.5e-05,-0.000113,1.2e-05,0.000103,4.9e-05,0.000248,9.9e-05,0.000207,7.6e-05,3.2e-05,-0.000218,-0.000117,0.000256,-4e-05,-0.000169,6.3e-05,0.000449,0.000242,5.2e-05,8.5e-05,8.3e-05,-1.5e-05,-0.000485,0.000144,-1e-04,0.000135,0.000121,8.9e-05,-9e-06,-1e-06,0.000317,1.7e-05,-0.000204
-3.1e-05,-4.5e-05,4.8e-05,-8.6e-05,-4e-06,-3e-05,-9e-06,8.5e-05,8.9e-05,0.000103,-2.6e-05,3.7e-05,-5.6e-05,-2.3e-05,1.5e-05,-1.4e-05,-7.6e-05,1.2e-05,3.7e-05,-3.4e-05,0.000224,-4.7e-05,-0.000137,9.8e-05,-4.7e-05,0.000134,-0.000154,-4e-05,-0.000102,0.000138,-4.5e-05,-0.000144,9e-06,0.000204,6.1e-05,0.000129,0.000127,-3.3e-05,0.000102,5.6e-05,-0.000115,-6.7e-05,2.8e-05,-5.3e-05,6.1e-05,-0.000228,0.000444,-0.000157,4.3e-05,-2.8e-05,-0.000116,0.000214,-0.000176,-0.000187,0.000275,-2.7e-05,-0.000317,-2.5e-05,3.3e-05,0.000231,-8.3e-05,-0.000224,-1e-06,-0.000117,1.7e-05,-0.000141,-0.000188,-4.4e-05,0.000135,-0.000159,-0.000141,9.3e-05,-0.000143,-9.9e-05,-7.3e-05,-0.000126,9.7e-05,-2.5e-05,-0.000147,-6.2e-05,-0.000192,0.000234,0.000231,1e-04,2.7e-05,3.5e-05,-0.000154,-5.3e-05,-5.4e-05,-0.000156,-6e-06,-0.000151,3e-06,-0.000242,-4.6e-05,0.000138,-8.2e-05,-0.000149,0.000247,-7.3e-05,-0.00035,-2e-06,6e-05,4.9e-05,-8.9e-05,-0.000221,-2.1e-05,-0.000104,-3.4e-05,-0.000149,0.000175,1.8e-05,7.3e-05,-3.3e-05,-3.6e-05,-0.000155,9.4e-05,0.000101,-0.000488,-6.8e-05,3.3e-05
-6e-05,3.8e-05,-4e-06,2.4e-05,2.7e-05,-4e-05,-3.6e-05,-6.5e-05,-0.00012,-6.8e-05,4.8e-05,-6e-05,1.8e-05,-1e-05,-4.6e-05,-1.5e-05,0.000171,0.000191,-0.000129,6e-06,-0.000165,4.9e-05,3e-06,2.7e-05,3.7e-05,-6.4e-05,3.4e-05,5.1e-05,-0.000107,-0.000267,2.8e-05,-1.9e-05,2.3e-05,-4e-06,-6.7e-05,-0.000117,0.000146,1.7e-05,-2.1e-05,-0.000179,-8.1e-05,0.000108,-1.7e-05,2.2e-05,-0.000136,0.000143,-0.000188,0.000219,-0.000199,1.8e-05,0.000171,-0.000232,4.3e-05,1.6e-05,-6e-06,-6.7e-05,0.000202,3.6e-05,-7e-06,-0.000113,0.00012,0.000198,0.00029,0.000171,-0.000163,-0.000168,0.000104,-5.1e-05,1.1e-05,-2.2e-05,1.7e-05,0.000111,9.1e-05,1e-05,-1.3e-05,4.8e-05,-8.4e-05,0.000153,4e-06,-2e-05,0.000146,-0.000232,-9.8e-05,4.9e-05,5.7e-05,-5.3e-05,0.000248,6e-05,0.000178,0.000121,-4.4e-05,-1e-06,5.6e-05,9.7e-05,7.1e-05,-5.2e-05,-0.000201,8e-05,7.6e-05,0.000138,9.1e-05,-5e-05,-9.1e-05,3.3e-05,-1.7e-05,3.2e-05,-7e-06,0.000247,-1.5e-05,7.8e-05,-1.6e-05,-0.000215,-5.8e-05,-2.4e-05,-8e-06,0.000315,-2.4e-05,-6.8e-05,2e-04,0.00011,0.000118
1.6e-05,3e-05,-3.2e-05,6e-06,-4e-05,6.9e-05,0.000125,4.9e-05,6.1e-05,2.3e-05,-1.6e-05,7.4e-05,-4e-05,-8e-06,3e-05,7e-06,-2.4e-05,-2.3e-05,0.000155,-4.1e-05,8.2e-05,-0.00011,2e-06,8e-06,-6.2e-05,-1.3e-05,2.9e-05,-3.2e-05,3.5e-05,9.4e-05,-2.2e-05,5.2e-05,1.8e-05,6.4e-05,5.4e-05,9.7e-05,-0.000123,4.4e-05,-4.6e-05,-1.8e-05,4.1e-05,-0.000154,-9.7e-05,1.7e-05,6.8e-05,-5.4e-05,-0.000113,-2e-05,7e-06,6.3e-05,-0.00026,0.000127,-6e-05,0.000212,-3e-06,-1.1e-05,-7.7e-05,-8.5e-05,-0.000103,1e-06,-0.000233,6.2e-05,-0.000204,-0.000147,0.000158,0.000273,-0.000153,6.1e-05,5.6e-05,6.5e-05,8.4e-05,-0.000106,-8.3e-05,2.9e-05,4.8e-05,3.7e-05,-3.2e-05,-6.8e-05,3.9e-05,4.6e-05,-9.9e-05,0.000183,0.000113,-2.9e-05,-1.5e-05,-2.4e-05,-0.000117,-5e-05,-5.6e-05,-0.000142,0.000112,1.6e-05,2.9e-05,-5e-06,8e-06,-5.8e-05,0.00014,-3.6e-05,-0.000138,0.00015,3.2e-05,2.9e-05,8e-05,-3.4e-05,-1.9e-05,2.5e-05,2.7e-05,-0.000197,-7.5e-05,-8.5e-05,3.5e-05,5.2e-05,2.7e-05,9.5e-05,-4.6e-05,-0.000196,-0.000125,8.5e-05,8.6e-05,-0.000108,-0.000168
2.2e-05,-1.3e-05,5.2e-05,-8e-06,3.2e-05,-3.5e-05,-3.7e-05,5e-06,-1.9e-05,-8e-06,2.8e-05,-2e-06,6.4e-05,3.7e-05,3e-06,2.3e-05,-3.2e-05,-4.6e-05,-0.00011,8.8e-05,-1.2e-05,3.3e-05,-7e-05,-3.5e-05,7.1e-05,7.1e-05,4e-06,2.2e-05,0.000141,-9e-06,3.4e-05,-3.1e-05,6e-06,-1.4e-05,-1.5e-05,-3.7e-05,1.1e-05,-0.000124,3.5e-05,0.000125,-6e-06,6.2e-05,3.3e-05,8e-06,2e-06,3.5e-05,0.00013,-2e-06,-1.4e-05,-3.6e-05,0.000151,-4.9e-05,-6e-06,-5.1e-05,2.5e-05,0.000113,0.000131,7.6e-05,3.6e-05,-0.000107,2.1e-05,-3.6e-05,5.8e-05,-3.8e-05,-0.000156,8.3e-05,0.000107,-0.000184,-7e-06,0.000115,-6.1e-05,8e-05,6.7e-05,-7.9e-05,-5.6e-05,-9.9e-05,-2.3e-05,-0.000153,3e-05,1e-05,-6.3e-05,-6.9e-05,-5.8e-05,-5.7e-05,-1.9e-05,2.7e-05,6.8e-05,-9e-06,6.6e-05,4.9e-05,-8.2e-05,-6.4e-05,-2.5e-05,-3.7e-05,-3.9e-05,-4.2e-05,-6.8e-05,0.000118,0.000206,-0.000184,1.5e-05,7e-06,-6e-06,1.4e-05,-5.1e-05,-7.6e-05,-4.7e-05,0.000149,7e-06,0.000103,-3.6e-05,4.6e-05,4.9e-05,-9.1e-05,-2.1e-05,-9.2e-05,3.4e-05,-3.4e-05,-0.000183,5.8e-05,-9e-06
3.9e-05,2e-06,1e-05,-2.8e-05,-1.7e-05,1.1e-05,-4.8e-05,-1.3e-05,5e-05,-2e-05,-3.5e-05,-3e-06,-5.6e-05,-1e-06,-9e-06,7e-06,-8.3e-05,9.4e-05,6e-06,-4.7e-05,-5e-06,1.2e-05,0.000113,-1e-06,-6.1e-05,-3.7e-05,-1.4e-05,3e-06,-0.000116,-2e-06,1.7e-05,-2e-05,7e-06,-7.5e-05,1.4e-05,1.2e-05,-4.4e-05,5.5e-05,7.4e-05,-3.1e-05,5.5e-05,3.7e-05,1.4e-05,3e-05,-4.1e-05,-2.3e-05,-3.5e-05,-0.000145,0.000182,-2.5e-05,8.5e-05,-2.6e-05,4.2e-05,-0.000268,-6.9e-05,-8.6e-05,-3e-05,-4.1e-05,3.1e-05,6.4e-05,5.1e-05,2.2e-05,-0.000121,6e-05,2e-06,-0.000114,-7.4e-05,0.000128,-3.6e-05,-0.00012,9.4e-05,-2.7e-05,-1.2e-05,4.9e-05,6e-05,7.9e-05,0.00012,0.000107,-1.7e-05,-7.6e-05,0.000119,-7.6e-05,2.3e-05,-7e-05,1.9e-05,-1.1e-05,2e-06,2.2e-05,-2.4e-05,6.7e-05,4.5e-05,0.000106,-2e-06,3e-06,-4.7e-05,9.6e-05,6.2e-05,-0.000122,-0.000152,-0.000152,-1.1e-05,-1.6e-05,-4.1e-05,-5e-06,-7.5e-05,4.7e-05,4.1e-05,-0.000109,4.3e-05,4.8e-05,-7e-05,9e-06,-4.7e-05,-3.1e-05,2.9e-05,0.000113,-2.5e-05,-7.3e-05,0.000123,2.9e-05,9.7e-05
-7.2e-05,3e-06,-9.4e-05,2.6e-05,9e-06,-4.5e-05,1.8e-05,2.5e-05,-7.1e-05,3.9e-05,2.5e-05,-3.1e-05,5.2e-05,-3.4e-05,1e-06,-2e-05,9.4e-05,-0.000145,9e-06,1.6e-05,4.6e-05,1.2e-05,-9.5e-05,-1.7e-05,4.4e-05,-1e-05,-1.2e-05,-1.6e-05,-2.8e-05,-3.1e-05,-6.7e-05,-5.8e-05,2e-06,-1e-06,-3.1e-05,-1.3e-05,7.5e-05,-2.4e-05,-4.3e-05,-5.5e-05,-5.2e-05,-8.7e-05,-3.3e-05,-3.2e-05,1.4e-05,2.7e-05,-4.7e-05,0.000104,-0.000204,-5e-06,-0.000149,8.5e-05,-0.000102,0.000234,-2.2e-05,-7e-05,-7.8e-05,-1.8e-05,6.3e-05,-7.1e-05,5.5e-05,-0.000118,6.7e-05,9e-06,2.3e-05,-7.5e-05,6.1e-05,-4.2e-05,4.7e-05,-7e-06,1.1e-05,-3.2e-05,2e-05,-1.4e-05,-4.4e-05,-9e-06,1.2e-05,-1.3e-05,-4.6e-05,2.3e-05,-0.000104,2.6e-05,-9.6e-05,-3.7e-05,1e-05,5e-06,-0.000145,-2.4e-05,0,-7.2e-05,-2.5e-05,-2.4e-05,-5.4e-05,3.8e-05,0.000118,-6e-05,-5.5e-05,3.9e-05,-5.9e-05,9.8e-05,3.6e-05,1e-05,2e-05,-4e-05,5.5e-05,-2.5e-05,-2.8e-05,0.000117,-7.3e-05,-8.9e-05,9e-05,-7.7e-05,-6e-06,6e-06,-1.4e-05,9e-06,2e-05,8.8e-05,-7.7e-05,-4.6e-05,1.1e-05
4.7e-05,-1e-05,9.7e-05,1.6e-05,-3e-06,5.9e-05,-6e-06,-3.4e-05,4.4e-05,-2.9e-05,1.7e-05,0,-4.5e-05,4e-05,6e-06,-8e-06,3e-06,8e-06,-4.6e-05,3.8e-05,-2.4e-05,-4e-06,0.000108,2e-06,-9e-06,-1e-06,1.5e-05,3e-05,5.4e-05,5.2e-05,1.5e-05,8.4e-05,-3e-05,3.2e-05,2.5e-05,-2.3e-05,1e-05,6e-06,-1.8e-05,3.5e-05,0,4.5e-05,-3.4e-05,2.1e-05,4.2e-05,-4.1e-05,5.8e-05,1e-06,5.8e-05,7.7e-05,0.000101,-9.2e-05,5.4e-05,5.7e-05,5.4e-05,2.8e-05,0.000106,2.2e-05,3.3e-05,5.2e-05,0,0.000141,0.000146,1.4e-05,-4.9e-05,7.2e-05,-2.2e-05,-1e-05,-1e-06,-3.3e-05,-0.00012,6e-06,-1.4e-05,-4e-06,1e-05,-1.8e-05,-2e-06,-3.6e-05,2e-06,-5e-06,4.1e-05,0.000102,1.5e-05,4.4e-05,-2.6e-05,-1.2e-05,0.000149,5.1e-05,-3.8e-05,2.2e-05,-1e-05,0.000105,2e-06,-5.6e-05,-4.1e-05,-3.6e-05,2e-06,-2.7e-05,5.9e-05,0.000107,-5e-06,1.1e-05,3.8e-05,0,3e-05,0,-3e-06,-0.000127,3.9e-05,-1.4e-05,-4e-05,2.8e-05,5.2e-05,2.2e-05,1.2e-05,3e-05,5.8e-05,-1.1e-05,1.6e-05,2.6e-05,-3.7e-05
-7e-06,-1.7e-05,-2e-05,-2.7e-05,-1.1e-05,2e-06,-1.1e-05,1e-05,-4.2e-05,2.2e-05,-3.9e-05,9e-06,1.9e-05,-2.4e-05,-7e-06,2e-06,-3e-05,9e-05,9.2e-05,-6.3e-05,-3e-05,-5.6e-05,-8.7e-05,-2.1e-05,-5e-06,3e-06,2e-05,-1.4e-05,-3.8e-05,-3e-05,4.8e-05,-9.1e-05,-9e-06,6e-06,-3.6e-05,5.7e-05,-5.6e-05,5e-06,2.4e-05,4.2e-05,-6e-06,6e-06,3.1e-05,1.2e-05,1.3e-05,8e-05,-8e-06,-5e-06,3.9e-05,-9.5e-05,-3.1e-05,8e-05,3.5e-05,-0.000152,-1.9e-05,6.9e-05,-7.1e-05,1.5e-05,-2e-05,-6.9e-05,-1.5e-05,-0.00012,-0.000199,-4.2e-05,-2.2e-05,8e-06,-8e-06,-4e-06,-4.3e-05,1.1e-05,2.8e-05,-2.4e-05,-1.3e-05,2e-06,6e-06,2.5e-05,-1.4e-05,-5e-06,2.1e-05,2.8e-05,6.7e-05,-6.1e-05,-3.8e-05,1e-05,-2e-06,6e-06,4e-06,-4.8e-05,2.5e-05,-6e-06,3.9e-05,-9.4e-05,2.8e-05,5.1e-05,-7e-06,5.7e-05,0.000143,4.2e-05,0,-6.2e-05,1e-06,-6e-06,-5.3e-05,8e-06,3e-05,2.3e-05,3.1e-05,7.4e-05,0,0.000101,6.2e-05,7.5e-05,-3.1e-05,3.3e-05,1.1e-05,-0.000147,-2.5e-05,-7e-06,7.1e-05,5e-06,-4.5e-05
3e-05,2.1e-05,-7.8e-05,7e-06,1.8e-05,-5e-06,2.2e-05,3e-06,3.8e-05,-1.2e-05,1.4e-05,1.2e-05,1e-06,-1e-06,4e-06,7e-06,-2.4e-05,-4.4e-05,-6e-05,3e-06,7.4e-05,3.3e-05,2.1e-05,-1.6e-05,9e-06,3e-06,-2.2e-05,1.2e-05,1.3e-05,1.5e-05,-3.2e-05,5.8e-05,-1.7e-05,4.8e-05,2.9e-05,-4.3e-05,1.2e-05,1e-05,-2.1e-05,-4.9e-05,4e-05,-5.2e-05,2.1e-05,-3e-06,-1.3e-05,-7.8e-05,-4.3e-05,-5.6e-05,-3.6e-05,4.4e-05,-5.2e-05,-5.8e-05,5.2e-05,-3e-05,-1.4e-05,2e-05,-7e-06,-8e-06,-1.5e-05,4e-05,-4.8e-05,9.3e-05,7.8e-05,2.5e-05,2.5e-05,1.9e-05,-8e-06,-2.2e-05,-3e-06,4.7e-05,8.3e-05,-1e-06,1.6e-05,-2.4e-05,-6e-06,-1.9e-05,-3.7e-05,-3.2e-05,1.4e-05,-2.5e-05,-0.000107,-2e-06,3.5e-05,3.3e-05,3.4e-05,-6e-06,-0.000104,2.9e-05,-4e-06,-2.2e-05,-4.3e-05,2.2e-05,1.2e-05,-2.9e-05,-2e-06,3.6e-05,-8.4e-05,-4.1e-05,2.3e-05,-9.9e-05,1.8e-05,-2e-06,3.1e-05,-3e-06,-2.3e-05,-1.2e-05,-3.7e-05,-6.5e-05,-2e-06,-3.5e-05,2e-06,-9.7e-05,8e-06,-4e-05,-7e-06,0.000151,-9.1e-05,1.4e-05,-6.6e-05,-2e-06,2.4e-05
-3.2e-05,1.7e-05,8.8e-05,-7e-06,-1.1e-05,-4e-05,1.2e-05,-1.7e-05,-3e-06,9e-06,9e-06,-2e-05,8e-06,5e-06,1e-06,3e-06,3e-06,-3.5e-05,9e-06,1.9e-05,-6.6e-05,-4.5e-05,-1.4e-05,8e-06,-2e-06,-8e-06,1.2e-05,0,3.7e-05,-4.3e-05,-1.6e-05,2.2e-05,4e-06,-7.7e-05,-1.5e-05,3.4e-05,1.8e-05,-4e-05,-7e-06,-1.6e-05,1.1e-05,6.3e-05,-3.1e-05,1.5e-05,-2e-06,4.3e-05,2.1e-05,-4.3e-05,1.4e-05,-7.8e-05,0.000109,3e-05,-3.1e-05,6.2e-05,1.5e-05,-6.9e-05,6.2e-05,-1.3e-05,-2.9e-05,-1e-05,3.8e-05,-7.5e-05,5.9e-05,-3.1e-05,-5e-06,1.1e-05,-4e-06,3.4e-05,-1e-06,-7.1e-05,-4.7e-05,4.3e-05,-1.4e-05,3.9e-05,1.4e-05,4e-06,3.3e-05,1.7e-05,-1.2e-05,8e-06,7e-05,-1.2e-05,1.6e-05,-3.1e-05,7e-06,1e-05,7.4e-05,-3.9e-05,-4.4e-05,9e-06,4.2e-05,-3.8e-05,8e-06,1.8e-05,7e-06,-2.3e-05,-5.1e-05,2e-05,4e-05,6.5e-05,-5.5e-05,-1.4e-05,-1.1e-05,2e-06,-1.5e-05,-1.1e-05,2.2e-05,7.2e-05,-2.4e-05,-1.5e-05,-5e-05,1.1e-05,-1.1e-05,1.5e-05,1e-06,3e-06,6.8e-05,-4.2e-05,3e-06,6e-06,4.8e-05
-9e-06,-4e-06,-2.3e-05,-1.1e-05,2e-06,8e-06,-3.4e-05,2.6e-05,2e-05,-5e-06,-1e-05,6e-06,-1.4e-05,-4e-06,-6e-06,-5e-06,6.2e-05,8.7e-05,1.5e-05,-3e-06,5.6e-05,4.8e-05,2.9e-05,-3e-06,-5e-06,-5e-06,-7e-06,-1e-06,1.2e-05,5.1e-05,3.4e-05,-3.1e-05,3.2e-05,2.1e-05,-1e-06,-3.2e-05,6e-06,3.3e-05,2.8e-05,3.2e-05,-5.6e-05,-2.9e-05,3e-06,-9e-06,-2.1e-05,-1.6e-05,1e-06,0.000118,-3.7e-05,9.4e-05,-8.8e-05,-2.9e-05,-4.1e-05,4e-06,1e-05,-8e-06,-3.9e-05,-3e-06,1.8e-05,5.8e-05,-3e-06,3.6e-05,-3e-06,1e-06,-8e-06,-1.2e-05,1e-05,-1e-06,2.9e-05,7e-05,-2.6e-05,-2.5e-05,1.9e-05,-2e-05,-1e-06,5e-06,-3.4e-05,6e-06,2e-06,1.8e-05,2e-06,2e-05,-8e-06,1.4e-05,-1.7e-05,-1e-06,-1.9e-05,4.3e-05,3.2e-05,1.3e-05,-3e-05,-1.9e-05,7e-06,1.4e-05,-3.5e-05,-6.9e-05,-6e-06,-1.4e-05,2e-05,8.9e-05,3.8e-05,1.2e-05,7e-06,0,-8e-06,1e-05,3e-06,-3.3e-05,3.2e-05,0,-5e-06,4.8e-05,4e-06,-1.6e-05,0,-4e-05,7e-06,0,1.8e-05,-3e-06,-2.7e-05
1e-06,-2.1e-05,-1.8e-05,1.8e-05,5e-06,2.1e-05,1.4e-05,-8e-06,-2e-05,-9e-06,2e-06,0,7e-06,6e-06,7e-06,4e-06,-6e-05,-4.7e-05,-3.1e-05,-2e-06,-5.3e-05,-4e-06,-1.4e-05,1e-06,-7e-06,1.4e-05,7e-06,7e-06,-4.7e-05,-9e-06,-3e-06,2.5e-05,1e-06,2e-06,-1.3e-05,4e-06,-1.3e-05,-3.7e-05,-5e-06,3e-06,-7e-06,3e-06,1.9e-05,-1.2e-05,3.3e-05,2.6e-05,5e-06,-6.2e-05,7.3e-05,-2.7e-05,1.7e-05,3e-05,1.5e-05,3.5e-05,-2.9e-05,3.2e-05,1.6e-05,5e-06,1.9e-05,-4.6e-05,1.6e-05,3e-06,-4.7e-05,3.7e-05,1.4e-05,-5.4e-05,-3.1e-05,-1e-05,1e-06,-1.8e-05,3.4e-05,9e-06,-2.2e-05,-2e-06,-2.1e-05,-2.2e-05,2e-06,-1e-05,6e-06,-6e-06,-6.3e-05,-2.3e-05,4.7e-05,3.8e-05,1e-06,-6e-06,-2e-05,-3.8e-05,-2.9e-05,-1.9e-05,1.8e-05,7e-06,-1.2e-05,-1.5e-05,6.4e-05,7.2e-05,5.8e-05,2.7e-05,-8.9e-05,-4.9e-05,-2.3e-05,-1e-06,-1e-06,8e-06,-1.5e-05,6e-06,-1.9e-05,7e-06,-2.9e-05,-2e-06,1.7e-05,-2.3e-05,8e-06,1.6e-05,0,-6.4e-05,-1.4e-05,2.1e-05,8e-06,-2e-06,-2.4e-05
1.6e-05,0,2.8e-05,-3e-06,-1.2e-05,1.1e-05,-2.1e-05,-1e-06,2.7e-05,1.1e-05,5e-06,3e-06,-1e-06,6e-06,-4e-06,7e-06,-1e-06,-2.1e-05,4.2e-05,-9e-06,3.5e-05,6e-06,-2e-06,-1e-05,1.1e-05,-1.9e-05,1.4e-05,-5e-06,-1.3e-05,1.2e-05,-1.4e-05,-2.5e-05,-4e-06,2.4e-05,8e-06,7e-06,-4.6e-05,3e-05,-1.5e-05,-3.1e-05,3.1e-05,8e-06,-2e-06,1e-05,-4.2e-05,-2.1e-05,1.8e-05,2.9e-05,-5.6e-05,-4e-06,3.4e-05,-2.8e-05,-7e-06,-0.000101,5e-06,1.7e-05,-4.4e-05,9e-06,7e-06,1.9e-05,8e-06,-4e-05,-1.5e-05,-2e-05,1e-06,2e-05,4e-05,-4e-06,-1e-05,4.5e-05,-2e-06,0,1.7e-05,1.2e-05,9e-06,1.7e-05,-8e-06,1.9e-05,-6e-06,-1.1e-05,7.1e-05,2.6e-05,-1.6e-05,-1.4e-05,1.7e-05,-2e-06,5.6e-05,3.3e-05,2.1e-05,6e-06,-2.4e-05,1.1e-05,-2.1e-05,3e-06,-2.7e-05,6e-06,-2.2e-05,-9e-06,2.4e-05,-7.7e-05,-1e-05,-1e-05,-1.4e-05,1e-06,1.8e-05,-1.9e-05,1.9e-05,-1.3e-05,-1.8e-05,1.4e-05,-1.9e-05,-3.5e-05,-1.1e-05,1.5e-05,2e-06,4.1e-05,1.6e-05,-2.4e-05,-5e-06,-8e-06,3e-05
-1.2e-05,1.3e-05,-2e-05,-1.3e-05,1.9e-05,-2.3e-05,2.9e-05,5e-06,-3.2e-05,-3e-06,-8e-06,-1e-06,-7e-06,-1.4e-05,0,1e-06,6e-06,5.1e-05,-2.9e-05,1.6e-05,-1.7e-05,-2.4e-05,8e-06,-9e-06,-1.1e-05,1.9e-05,-2.7e-05,6e-06,3.3e-05,-1e-05,1.3e-05,3.2e-05,7e-06,1e-05,-1.3e-05,-8e-06,6.4e-05,1.5e-05,6e-06,1.6e-05,1.5e-05,1e-06,-1.1e-05,-4e-06,1.7e-05,4e-06,-2.6e-05,-4.7e-05,-1e-05,4e-06,-6.4e-05,2.3e-05,4.3e-05,-1e-06,3.4e-05,-3.6e-05,2.2e-05,-4e-06,-3e-06,-1.7e-05,-1.6e-05,6.1e-05,8.2e-05,2e-06,4e-06,5e-05,-3.8e-05,3.2e-05,3e-06,-5.4e-05,-3.8e-05,-2.6e-05,-1.5e-05,-1.1e-05,1.8e-05,2.1e-05,-2e-06,4e-06,-8e-06,9e-06,-3.1e-05,-2.3e-05,3.5e-05,-2.5e-05,-2e-06,0,-6.1e-05,-2e-05,-1.2e-05,7e-06,2.2e-05,2.6e-05,-3e-06,-6e-06,-1e-05,-6.2e-05,-9e-06,5e-06,-1.7e-05,4.5e-05,3e-05,1e-06,1.7e-05,-7e-06,4.5e-05,1.4e-05,-1.1e-05,1e-05,1.8e-05,1e-05,4.3e-05,1.5e-05,1e-06,-2.6e-05,-4e-06,5.2e-05,1.3e-05,1e-05,-1.4e-05,1.5e-05,2e-06
-2e-06,4e-06,-2e-06,8e-06,-2e-05,2e-06,1.7e-05,-1.2e-05,1.9e-05,5e-06,8e-06,2e-06,1.5e-05,3e-06,1e-06,-5e-06,3.4e-05,-2.7e-05,8e-06,0,6e-06,3e-06,-1.6e-05,-4e-06,9e-06,-9e-06,1.4e-05,-1e-06,-1e-05,-7e-06,-4e-06,-4.2e-05,-1.9e-05,-5.8e-05,1e-05,1.4e-05,3e-06,-2e-05,3e-06,2.3e-05,-3e-06,-5e-06,6e-06,-1e-06,-1e-06,-1.5e-05,-1.7e-05,6.6e-05,3.4e-05,-2.9e-05,5.9e-05,-8e-06,-4.5e-05,0.000119,-1.7e-05,-3.3e-05,1.8e-05,-4e-06,-2.6e-05,3.6e-05,-1.6e-05,-6.8e-05,-7.6e-05,-1.1e-05,2.8e-05,9e-06,3.2e-05,-1.1e-05,1.5e-05,-9e-06,4.1e-05,2e-05,1.7e-05,7e-06,-1.3e-05,-3.1e-05,2.3e-05,-1.3e-05,5e-06,2e-06,-2.6e-05,-1.5e-05,-5.5e-05,-3e-06,-1.8e-05,6e-06,1.6e-05,1.4e-05,3.6e-05,-1.1e-05,2e-06,2e-06,2e-06,1.7e-05,1.5e-05,3.1e-05,-2.3e-05,-1.3e-05,-1.3e-05,7e-05,3.1e-05,0,-4e-06,3e-06,8e-06,6e-06,3e-06,-3e-06,1e-06,-4.1e-05,-4.5e-05,4.6e-05,1e-05,1.1e-05,1e-06,-7.6e-05,-4.3e-05,1.6e-05,1.7e-05,-1.4e-05,-1.7e-05
-4e-06,-5e-06,6e-06,2e-06,1.8e-05,7e-06,-4.6e-05,7e-06,-9e-06,-9e-06,-1.1e-05,5e-06,-1.6e-05,3e-06,0,-4e-06,-2e-05,-4.2e-05,2e-06,1e-06,-1.5e-05,-1e-05,1.7e-05,3e-06,-5e-06,2e-06,-1e-06,-2e-06,1e-06,-1.9e-05,-6e-06,1e-05,-1.9e-05,4.1e-05,-6e-06,-2.8e-05,-5.9e-05,1.7e-05,-9e-06,-2.4e-05,-3.4e-05,-1e-06,1.3e-05,2e-06,-2e-06,1.8e-05,4.4e-05,-4e-06,0,3.5e-05,-1.1e-05,-2e-05,-1.1e-05,-5.6e-05,-1.6e-05,4.9e-05,2e-06,3e-06,-1.4e-05,-1.4e-05,3e-06,7.4e-05,1.4e-05,1.3e-05,-1e-06,-4.5e-05,-2.9e-05,1e-06,1.5e-05,-1.7e-05,5e-06,0,-1.7e-05,-4e-06,2e-06,-1e-06,-3.2e-05,-6e-06,1.6e-05,1e-06,6.1e-05,2e-05,1.8e-05,-1.6e-05,-6e-06,-1e-06,4.3e-05,-1.3e-05,-1.8e-05,2.1e-05,-1.6e-05,2.4e-05,1.4e-05,-4e-06,-7e-06,2.7e-05,2e-05,6e-06,5.2e-05,-3.4e-05,-3.3e-05,7e-06,-1.1e-05,2e-06,-1.5e-05,-1.9e-05,4e-06,3e-06,-1.6e-05,1.1e-05,6.5e-05,-4.4e-05,-1e-05,-1e-05,-4e-06,-1.5e-05,2.1e-05,-1.9e-05,-2.3e-05,-1e-06,2e-06
1.8e-05,0,8e-06,-1.1e-05,-1.6e-05,1.1e-05,2e-05,-5e-06,5e-06,7e-06,7e-06,1e-06,1.1e-05,-4e-06,0,1e-06,-1.9e-05,4.2e-05,-1.8e-05,-2.1e-05,2.1e-05,1e-05,-2.7e-05,-6e-06,7e-06,-2e-06,-5e-06,4e-06,8e-06,1.6e-05,1.5e-05,2e-05,6e-06,-3.8e-05,3e-06,1.7e-05,3e-05,-1.8e-05,5e-06,-1.1e-05,1.4e-05,1.6e-05,-9e-06,-2e-06,2.2e-05,0,-6e-06,-6.4e-05,-1.2e-05,-1.7e-05,-3e-05,3.5e-05,1.5e-05,-9.3e-05,1.4e-05,3.5e-05,0,-4e-06,-2e-06,1.3e-05,4e-06,-6.9e-05,-1e-06,-1e-05,1e-06,-4e-06,2.4e-05,-6e-06,-1.2e-05,2.7e-05,-3.1e-05,-1e-05,1.4e-05,-1e-06,-1.6e-05,1.3e-05,1.8e-05,6e-06,1e-06,-1.5e-05,-5.3e-05,1.4e-05,-4.1e-05,1e-06,8e-06,-2e-06,-5.8e-05,5e-06,1.7e-05,-2e-06,1.6e-05,-2.9e-05,1.1e-05,-3e-06,-1e-05,-6e-06,6.1e-05,6e-06,9e-06,-7.1e-05,-1e-05,-1e-06,9e-06,-2e-06,-2.8e-05,1.5e-05,-1e-05,1e-05,1.3e-05,2.8e-05,-8.1e-05,-2e-05,7e-06,1e-05,1e-06,5.8e-05,-5e-06,6e-06,4e-05,1e-05,8e-06
-3e-06,1e-06,-2.1e-05,4e-06,1.2e-05,-2.4e-05,3e-06,2e-06,-1.1e-05,-3e-06,1e-06,-4e-06,-8e-06,4e-06,1e-06,2e-06,1.5e-05,0,2.8e-05,1.3e-05,-1.3e-05,7e-06,3.6e-05,-5e-06,-7e-06,3e-06,4e-06,-4e-06,-4e-06,5e-06,-7e-06,-1.8e-05,8e-06,6e-05,-5e-06,-1.4e-05,2.3e-05,2e-06,6e-06,2.7e-05,2.5e-05,-3.1e-05,-5e-06,-2e-06,-2.8e-05,-1.6e-05,-3.3e-05,5.4e-05,-1e-06,1.7e-05,4.1e-05,-4.7e-05,3e-06,5.7e-05,-1e-06,-3.1e-05,-4.2e-05,-9e-06,1.2e-05,-2.9e-05,1e-05,5.4e-05,-1e-06,5e-06,2.9e-05,1.7e-05,-2.4e-05,5e-06,-9e-06,-9e-06,7e-06,1.2e-05,-1.5e-05,2e-06,1.8e-05,-8e-06,-5e-06,1.5e-05,-1.5e-05,4e-06,4e-06,-8e-06,2.1e-05,3.7e-05,3e-06,-3e-06,1.8e-05,-3e-06,-7e-06,-8e-06,-2.4e-05,2e-06,-3e-06,3e-06,2.9e-05,-3.9e-05,-6.8e-05,-3e-06,-5e-06,1.6e-05,-5e-06,-6e-06,-2e-06,0,-2e-05,-3e-06,1.3e-05,-1.4e-05,8e-06,-2.5e-05,5.1e-05,5.1e-05,-2e-06,7e-06,4e-06,2.7e-05,0,4e-06,-2.5e-05,-8e-06,3e-06
-3e-06,-3e-06,1.4e-05,1.1e-05,-9e-06,0,-1.3e-05,3e-06,8e-06,-2e-06,-7e-06,0,8e-06,0,0,1e-06,7e-06,-1.5e-05,-2e-05,7e-06,3e-06,-1e-06,-2.5e-05,-4e-06,8e-06,-1.4e-05,-5e-06,4e-06,-2.4e-05,1.3e-05,-1.8e-05,1.1e-05,8e-06,-4.8e-05,4e-06,1.3e-05,-1.7e-05,9e-06,-9e-06,-3e-06,-1.1e-05,2.2e-05,9e-06,0,2.2e-05,5e-06,2.1e-05,-2.7e-05,2e-06,-2.9e-05,-3.6e-05,4.6e-05,6e-06,4.7e-05,-6e-06,-3.5e-05,3.6e-05,1.1e-05,6e-06,2.4e-05,-8e-06,-3.3e-05,2.3e-05,1.1e-05,-1.7e-05,2e-06,2.1e-05,9e-06,-8e-06,2.5e-05,1.5e-05,-4e-06,1.1e-05,-7e-06,1.1e-05,5e-06,1.9e-05,-1e-06,-1.1e-05,1e-05,4.4e-05,-2e-06,-2.2e-05,-1.8e-05,-5e-06,2e-06,2.6e-05,4e-06,7e-06,2e-06,3.1e-05,-3.3e-05,-6e-06,3e-06,-1.5e-05,1.9e-05,2e-06,-4e-06,-2.1e-05,7e-05,-4e-06,0,-7e-06,0,5e-06,-9e-06,-1e-05,1e-05,-1.4e-05,-1e-06,-4.5e-05,-9e-06,-7e-06,-1.1e-05,-3e-06,-4.3e-05,2.5e-05,-5e-06,-2.3e-05,-2e-06,-8e-06
-5e-06,-1e-06,1.1e-05,-9e-06,7e-06,9e-06,2.2e-05,-3e-06,-1.6e-05,1e-06,5e-06,-2e-06,-9e-06,-3e-06,-1e-06,-1e-06,1e-05,2.9e-05,7e-06,-1.7e-05,0,-1e-06,1.3e-05,-3e-06,-7e-06,2e-05,1e-06,-3e-06,1.3e-05,-3.3e-05,1.3e-05,-8e-06,1e-05,2.2e-05,-5e-06,-1e-06,-9e-06,-3e-06,-1e-06,-2.6e-05,-2.1e-05,6e-06,3e-06,0,-1.2e-05,-5e-06,8e-06,5.5e-05,1.6e-05,1.4e-05,2.1e-05,-3e-05,-1e-05,-4.4e-05,7e-06,1.3e-05,-7e-06,1.1e-05,-9e-06,-5e-06,-8e-06,2.1e-05,-5.8e-05,-2.1e-05,8e-06,6e-06,-1e-05,-1.4e-05,-1e-06,-5e-06,-1.3e-05,-9e-06,-5e-06,6e-06,-1.7e-05,3e-06,1.3e-05,-1.2e-05,9e-06,-8e-06,-5.6e-05,-1.1e-05,1.3e-05,-1.1e-05,1e-06,2e-06,-3.7e-05,3e-06,-1e-05,-4e-06,-1.6e-05,8e-06,-8e-06,-4e-06,-2e-05,2.7e-05,2.9e-05,2e-06,9e-06,-1.8e-05,1.4e-05,3e-06,9e-06,4e-06,2.2e-05,1.1e-05,2e-06,-2.1e-05,6e-06,8e-06,4.1e-05,-3.6e-05,1.2e-05,4e-06,4e-06,-2.2e-05,5e-06,2e-06,4.4e-05,6e-06,-2e-06
2e-06,6e-06,-3.4e-05,-5e-06,-7e-06,2e-05,-9e-06,5e-06,1.7e-05,1e-06,0,0,9e-06,4e-06,1e-06,-1e-06,-3.6e-05,1e-06,5e-06,1e-05,-3e-06,-1.2e-05,-1.1e-05,1e-06,1e-06,-1.7e-05,4e-06,1e-06,1.8e-05,2.2e-05,1.1e-05,1.8e-05,5e-06,-1.9e-05,6e-06,-6e-06,9e-06,-5e-06,7e-06,1.2e-05,-1e-06,-2.4e-05,-9e-06,0,2e-06,1.2e-05,-1.4e-05,-6.5e-05,-3.3e-05,-8e-06,1.2e-05,1.5e-05,-2e-06,-1.9e-05,-3e-06,3.2e-05,4e-06,-1.3e-05,-1.2e-05,1.1e-05,2e-06,-5e-06,3.6e-05,1.8e-05,8e-06,6e-06,3e-06,-2e-06,0,1e-05,-3e-06,1.2e-05,-1e-06,-1e-06,-8e-06,-1.2e-05,-2.2e-05,-2e-06,1.4e-05,-1e-06,3.1e-05,2e-06,1e-05,2.2e-05,4e-06,1e-06,2.5e-05,-6e-06,-1e-05,-2e-06,1e-06,-2e-06,-7e-06,4e-06,2.8e-05,-3.1e-05,2e-06,6e-06,-4.6e-05,-6.3e-05,1.4e-05,0,-7e-06,-1e-06,1.8e-05,-4e-06,7e-06,2.4e-05,6e-06,-7e-06,-1.2e-05,1.4e-05,-8e-06,-3e-06,0,5.4e-05,-5.3e-05,-2e-06,-2.6e-05,0,1e-05
0,4e-06,3.1e-05,1.2e-05,7e-06,-1.4e-05,-1.6e-05,-4e-06,-1e-05,2e-06,-6e-06,-2e-06,-8e-06,-3e-06,-1e-06,2e-06,1.5e-05,-3.5e-05,-1.7e-05,4e-06,9e-06,8e-06,7e-06,-4e-06,2e-06,1e-05,0,-1e-06,-8e-06,-8e-06,-1.4e-05,-2e-05,-1.1e-05,1.1e-05,-3e-06,-1e-06,7e-06,4e-06,-4e-06,2.2e-05,1.6e-05,2.2e-05,0,3e-06,1e-06,-1.2e-05,0,2.8e-05,2.4e-05,2.5e-05,-4e-05,1e-06,2.3e-05,-1.1e-05,-9e-06,-1.2e-05,6e-06,-8e-06,-1e-05,-2.4e-05,1e-06,-1.5e-05,0,-1e-05,-1e-05,-1.9e-05,2e-06,2e-06,-9e-06,-8e-06,2e-05,-1.3e-05,5e-06,-5e-06,1e-05,7e-06,7e-06,1e-06,-2e-06,4e-06,1.6e-05,1.2e-05,1e-05,-5e-06,-2e-06,-2e-06,-2e-06,1e-05,4e-06,0,-3e-06,1.2e-05,4e-06,-1.4e-05,-8e-06,-8e-06,-2.1e-05,-6e-06,2.5e-05,1.9e-05,4e-06,0,6e-06,-2e-06,-1e-06,-1e-06,-1.2e-05,-1.2e-05,-1.8e-05,1e-05,1.8e-05,3.3e-05,-2e-06,8e-06,-4e-06,4e-06,2e-05,1e-06,1e-06,-2e-06,-1e-06
-4e-06,-4e-06,2e-06,-4e-06,-7e-06,-1.1e-05,1.9e-05,0,5e-06,-4e-06,6e-06,0,6e-06,0,0,2e-06,1.8e-05,7e-06,2.1e-05,-7e-06,-5e-06,-1e-06,0,-7e-06,-4e-06,-4e-06,-5e-06,-1e-06,0,1.2e-05,-5e-06,3e-06,-1.3e-05,1.9e-05,2e-06,-3e-06,-9e-06,-1.1e-05,-1e-06,-2e-05,1.1e-05,-2e-06,7e-06,-2e-06,-9e-06,1e-06,1.2e-05,8e-06,-1e-06,-9e-06,3.4e-05,-1.2e-05,7e-06,4.4e-05,6e-06,-2.8e-05,-3e-06,9e-06,2e-06,7e-06,-1e-06,2e-05,5e-06,4e-06,3e-06,-9e-06,-5e-06,4e-06,-4e-06,-2.6e-05,-1e-05,5e-06,-9e-06,4e-06,1e-05,5e-06,-1.2e-05,-3e-06,-1.1e-05,1e-06,-5e-05,-2e-06,2.8e-05,-8e-06,-5e-06,-1e-06,-2.7e-05,-1.4e-05,-1.2e-05,2e-06,6e-06,2.3e-05,9e-06,1.8e-05,-3e-06,2e-05,-9e-06,1e-06,2.8e-05,5.8e-05,-1.2e-05,-4e-06,-5e-06,2e-06,-2.2e-05,3e-06,1.1e-05,1.2e-05,-6e-06,1e-06,-2.5e-05,-2.6e-05,8e-06,-4e-06,3e-06,-5.5e-05,1.8e-05,1e-06,1.1e-05,2e-06,-1.1e-05
-3e-06,-5e-06,-2.9e-05,-1e-05,8e-06,0,-1.3e-05,1e-06,-6e-06,2e-06,-1e-06,-1e-06,-3e-06,3e-06,0,-1e-06,-1e-05,1.5e-05,-1.1e-05,-1e-06,-8e-06,1e-05,-5e-06,-4e-06,1e-06,5e-06,5e-06,-1e-06,2e-06,-1.8e-05,1.1e-05,1.2e-05,1e-06,-3.1e-05,-5e-06,7e-06,2e-06,8e-06,4e-06,-1.4e-05,-4e-06,-1.5e-05,0,0,1e-05,-6e-06,-6e-06,-2e-05,-9e-06,-8e-06,-1.4e-05,1.6e-05,-2.2e-05,2.2e-05,7e-06,1e-05,-9e-06,2e-06,6e-06,-4e-06,2e-06,-2.8e-05,-1e-05,3e-06,-7e-06,1.7e-05,8e-06,-2e-06,0,7e-06,-1.3e-05,3e-06,1e-05,-1e-06,-4e-06,-6e-06,1.3e-05,6e-06,-2e-06,-2e-06,4.5e-05,-9e-06,-2e-05,1.3e-05,1e-06,1e-06,3.7e-05,1.5e-05,1e-05,-5e-06,3e-06,-1e-06,6e-06,-1.4e-05,1.1e-05,1.7e-05,-7e-06,-4e-06,-1.3e-05,-7e-06,-1.7e-05,2e-06,4e-06,-1e-06,-1.6e-05,-1e-06,-4e-06,-1.6e-05,1.4e-05,-1.5e-05,9e-06,-2.4e-05,-7e-06,0,-2e-06,-3e-06,-1e-05,-7e-06,-2.2e-05,0,5e-06
2e-06,1e-06,2.1e-05,1.2e-05,-9e-06,1.5e-05,8e-06,-2e-06,7e-06,0,-2e-06,-1e-06,2e-06,0,0,-2e-06,-1.1e-05,-1.5e-05,-2e-06,4e-06,2.3e-05,1e-06,1.1e-05,-3e-06,-1e-06,-1e-05,0,0,-9e-06,1.9e-05,1e-06,-1.6e-05,-5e-06,3e-05,2e-06,-2e-06,1e-06,2e-06,-3e-06,2.5e-05,-1.8e-05,1.5e-05,-6e-06,0,-5e-06,1.5e-05,-6e-06,2e-05,1.5e-05,8e-06,-4e-06,-1.6e-05,-1.2e-05,-7.1e-05,-6e-06,3.6e-05,-8e-06,-5e-06,4e-06,2e-05,2e-06,3.4e-05,0,-7e-06,-7e-06,1.3e-05,-1e-05,-6e-06,2e-06,-1e-05,1.6e-05,2e-06,-7e-06,0,-1.1e-05,-1e-06,6e-06,6e-06,7e-06,1e-06,-1e-05,-6e-06,1.3e-05,-1.7e-05,6e-06,1e-06,-1.3e-05,-1.7e-05,-5e-06,2e-06,-1.3e-05,8e-06,3e-06,4e-06,-1e-05,-2.9e-05,2.2e-05,6e-06,2.4e-05,-6e-05,-5e-06,3e-06,-4e-06,-1e-06,1e-06,-1e-06,-3e-06,1.3e-05,-1.1e-05,1.3e-05,-2.2e-05,3.8e-05,1e-06,2e-06,-1e-06,4.2e-05,3e-06,2e-06,1.9e-05,-1e-06,9e-06
2e-06,1e-06,5e-06,4e-06,1e-05,-1e-06,1.6e-05,1e-06,-8e-06,1e-06,4e-06,2e-06,-2e-06,0,0,0,-4e-06,-3e-06,1.2e-05,2e-06,-3e-05,2e-06,-9e-06,-3e-06,2e-06,1.4e-05,-2e-06,-1e-06,1e-06,-1.1e-05,-3e-06,1e-05,4e-06,-4.2e-05,-4e-06,4e-06,-5e-06,-4e-06,-2e-06,4e-06,-2e-06,1e-06,0,-1e-06,4e-06,-1e-05,5e-06,-4.6e-05,-3.2e-05,-1.7e-05,2.3e-05,1.7e-05,0,-2.1e-05,-3e-06,-3e-06,8e-06,0,-5e-06,-1.4e-05,0,-3.5e-05,3.2e-05,9e-06,-6e-06,-8e-06,1.4e-05,1e-06,3e-06,2.2e-05,1e-06,-7e-06,6e-06,2e-06,-7e-06,3e-06,-1.3e-05,-2e-06,1e-06,-1e-06,-3.1e-05,7e-06,-3.6e-05,-1e-05,0,0,-2.1e-05,1.7e-05,1.9e-05,6e-06,1.8e-05,-2e-05,-5e-06,-4e-06,-1.3e-05,-1.3e-05,2.5e-05,-5e-06,-1.3e-05,0,1.6e-05,-2e-06,6e-06,0,9e-06,0,8e-06,-1.7e-05,-2e-06,5e-06,3.1e-05,7e-06,6e-06,-7e-06,3e-06,1.2e-05,1.1e-05,3e-06,9e-06,1e-06,-3e-06
