0.000612,1.7e-05,-0.000106,-0.000102,6.4e-05,0.000426,-8e-05,0.000245,0.000658,0.000425,5.2e-05,-1.8e-05,-0.000373,0.000379,0.000651,0.000213,0.000538,0.000311,-0.000139,3.3e-05,1.7e-05,-0.000347,-0.000534,-0.001487,-0.000837,-0.000426,-0.000255,-0.000747,-0.000796,-5.7e-05,0.00013,-0.000562,-0.000612,-0.00073,-9.6e-05,-0.00051,-0.000536,-0.000378,0.000505,0.00025,-3.4e-05,-0.000101,0.000432,0.000523,0.000129,-2.9e-05,0.000427,0.000434,0.000407,0.000212,-3.8e-05,-1.8e-05,1.4e-05,0.000297,-9e-06,-0.000112,-0.000288,0.000191,0.000299,-8.1e-05,-0.000653,-0.00065,-0.000599,-0.000164,-0.000382,-8.6e-05,-0.000147,-3.6e-05,0.00042,-1.6e-05,1.1e-05,-0.001742,-0.00097,-0.000432,-0.000347,4.8e-05,-0.000272,-0.000696,-0.000462,-0.000847,-0.000287,0.000164,8.5e-05,-9e-05,0.000162,0.000306,-0.00027,-0.000277,9e-05,0.000806,0.000544,-0.000128,-0.000305,0.000268,0.000587,2.9e-05,0.000479,3.9e-05,-0.000429,6.3e-05,-5.5e-05,0.00016,-0.00038,0.000126,0.000326,-1.6e-05,8.6e-05,0.00015,0.000207,-8.1e-05,-0.000101,0.000341,5e-05,-2.2e-05,9.6e-05,0.000584,-0.000143,6e-05,-0.000319,-0.000499,-0.000143
-0.000332,-0.000245,0.000263,0.000265,0.000427,0.000399,0.000292,6.1e-05,0.000483,-0.000255,-6.8e-05,0.000365,0.00028,-0.001004,8.4e-05,-0.000377,0.000297,0.000394,0.000242,0.000496,0.000173,7.4e-05,-8.7e-05,0.000761,0.000649,0.000501,-0.00042,-0.00049,-4.8e-05,-0.00028,3.5e-05,-6e-05,0.00068,0.000404,0.000675,0.000463,0.000542,1.4e-05,-0.000564,-0.000151,0.000372,2e-04,2e-06,-0.000135,6e-06,0.000223,-0.000132,-0.000218,-0.000112,-0.000727,-0.000117,-1.2e-05,-5.3e-05,-0.000347,2.7e-05,0.000251,2e-06,-0.000248,-0.000117,-0.000275,0.000403,4.2e-05,-7.7e-05,3.1e-05,5.8e-05,0.000191,0.000591,0.000394,0.000166,0.000444,7.6e-05,0.000826,0.000663,0.000234,0.000143,-0.000131,-0.000115,0.000412,1e-06,0.000393,0.000114,0.000311,0.000556,0.000419,0.000218,9.4e-05,0.00061,-1.1e-05,9.1e-05,8.7e-05,-0.000492,-0.000134,-0.000302,0.000363,0.000245,0.000166,-1.3e-05,3e-06,0.000586,0.000273,0.00035,0.00025,0.000519,0.000197,0.000184,0.00015,-0.000193,-0.000208,0.00033,-0.000118,0.000151,-0.000603,-0.000218,0.000516,-0.000122,1e-05,-0.000103,0.000129,0.000103,0.000309,-0.00043
-5.3e-05,0.000104,0.00016,6.9e-05,3.1e-05,-0.000226,0.000217,-0.00069,-0.000239,-2.6e-05,-0.000391,-0.00023,-1.3e-05,0.000483,9e-05,0.000395,0.000215,-0.00081,0.000115,-3e-05,0.000323,0.000649,0.000232,-4.8e-05,0.000331,-3.9e-05,-0.000529,-4.7e-05,-3e-06,0.000311,0.000337,0.000446,8e-06,-0.000196,9.5e-05,-0.000263,-5.7e-05,0.000174,0.000393,-0.000359,-0.000218,-0.000167,-0.000146,0.000285,0.000201,0.000202,0.000221,6.8e-05,3.7e-05,6.7e-05,0.000244,0.000218,0.000175,5.5e-05,-8.7e-05,0.000194,0.000221,-0.000304,2.5e-05,0.000322,-0.000138,0.000196,-1e-04,-0.000604,-0.000264,7.2e-05,-0.000326,-0.000312,-0.000261,0.000119,-0.000185,-0.000414,-5.1e-05,-0.000159,-0.000151,-0.00021,5.6e-05,-0.000113,0.000525,2.6e-05,0.000395,2e-05,9.9e-05,0.000182,-7e-05,0.000338,0.000199,2.3e-05,4e-06,-0.000289,0.000146,3.5e-05,-5.4e-05,-0.000377,0.000464,2.6e-05,8.1e-05,0.000222,0.000127,-0.000339,-0.000356,-0.000368,-0.000498,8.4e-05,-0.000369,-0.000193,-0.000222,0.000124,2.4e-05,-2e-06,-5.1e-05,0.000228,0.000186,-0.000148,0.000194,0.000344,2.4e-05,0.00021,-7.7e-05,0.000233,-6.1e-05
-3.7e-05,3.3e-05,9.9e-05,-0.000195,0.000108,-0.000153,-0.000293,2.2e-05,-0.000255,-0.00013,-8.5e-05,2.5e-05,3.1e-05,0.000147,-0.000251,-0.000301,0.000134,0.000307,-0.000106,-0.000132,0.000253,-0.000101,-0.000228,0.00028,-0.000291,-0.000725,-2.5e-05,-0.000158,0.000315,-0.000723,-0.000275,-4e-06,-0.00021,-0.000128,-0.000334,-3e-06,0.000438,3.1e-05,-5.9e-05,0.000216,0.000309,0.000397,-0.000202,-7.6e-05,-0.000328,-0.000391,-0.000101,-0.000107,-0.00011,0.000359,-8.7e-05,-0.00019,-0.00043,-0.000375,-3.4e-05,-3.9e-05,0.000157,-0.000445,-0.000475,-0.000408,-0.000203,9.7e-05,1.9e-05,-0.000184,1.2e-05,-0.000115,-0.00031,-9.6e-05,-0.000211,-2.1e-05,-0.000377,9.2e-05,-0.000545,0.000285,7.6e-05,-3.8e-05,-0.000346,-0.00035,-0.00033,-8.6e-05,-0.000369,-0.000381,0.000229,4.5e-05,0.000126,-0.000173,0.000262,8.6e-05,2e-05,-0.000417,-0.000536,-3.1e-05,0.00026,5.2e-05,-0.000419,-0.000139,-2.9e-05,-3.2e-05,0.000286,9.5e-05,5e-04,0.000469,0.000315,1.3e-05,-0.00058,-0.000228,-4.3e-05,-4.7e-05,-1.6e-05,7.9e-05,0.000133,0.000401,0.000177,2.6e-05,-0.000192,-0.000126,0.000274,8.8e-05,-0.000579,-0.000359,-0.000166
-0.000364,-0.00025,0.000175,-0.00015,0.000172,5.3e-05,0.000204,0.000197,-0.000313,0.000162,4e-04,0.000207,0.000157,0.000217,-0.000219,-0.000148,-0.000491,-0.000414,-4.2e-05,-0.000403,-0.00016,-0.000465,-0.000897,-0.000695,0.00018,0.000444,0.000501,0.000455,0.000134,7.7e-05,0.000235,-0.000139,0.000188,0.000263,0.000121,9.7e-05,-5.3e-05,0.000154,-0.000149,0,-0.000326,-0.000157,-7.4e-05,-0.000189,-0.000299,0.000142,-0.000176,-0.000186,-0.000339,-0.000465,0.000164,-0.000348,-0.000452,-9.8e-05,-0.000155,-9.4e-05,-0.000242,7.8e-05,-0.000282,-4.9e-05,0.000327,-0.000621,-5e-06,3.8e-05,0.000156,2.1e-05,-0.000251,-0.00041,-0.000174,0.000176,-1.6e-05,-7e-05,0.000263,-0.000249,5.6e-05,0.000169,0.000135,3.4e-05,0.000262,-0.000195,0.000288,-3.1e-05,0.000202,-8e-06,0.000176,-0.000462,-8.9e-05,-2.6e-05,2.6e-05,0.000156,-0.000193,-0.000286,-0.000323,-6.5e-05,-0.000197,-0.000149,0.000226,-0.00012,7e-05,-0.000358,-0.000258,-4.3e-05,-0.000192,-0.000187,4.7e-05,0.000152,0.000111,-0.000256,-9.8e-05,-1e-06,0.000311,-0.000159,0.000164,-0.000341,5.1e-05,-0.00013,-5.1e-05,-6.8e-05,-0.000321,0.000272,0.000488
-8.1e-05,-4e-06,0.000164,9.8e-05,2.4e-05,-4.3e-05,-8e-05,3.1e-05,4.4e-05,-0.000535,0.000243,0.000397,0.000178,-8.4e-05,0.000228,-4.1e-05,-2.7e-05,-0.000324,0.000173,-6.5e-05,-7.2e-05,0.000214,0.00011,0.000719,0.000356,-0.000564,0.00015,-0.000748,-0.000436,0.00015,-0.000416,-5e-05,-0.000116,-7.7e-05,4.8e-05,-3e-06,0.000332,-0.000225,3.9e-05,-0.000224,-0.000273,-0.000137,-0.000111,0.000188,7.1e-05,-0.000103,-4.5e-05,4.8e-05,-0.000121,0.000332,5.6e-05,-0.000251,0.00027,0.000459,0.000267,0.000233,4.9e-05,4.7e-05,-1.9e-05,-0.000192,-0.000358,0.000105,-1.1e-05,0.000295,0.000127,-8.2e-05,1.1e-05,8e-06,-0.000287,-8.4e-05,5e-05,-0.000105,-0.000278,-0.000155,-4.6e-05,-7.6e-05,0.000161,0.000161,-5.5e-05,2.9e-05,-0.000134,-0.00016,3.5e-05,-0.000288,5.8e-05,1e-06,0.000263,-0.000109,-5e-06,2e-05,-0.000173,-0.000209,0.00018,0.000252,-0.000224,-0.000479,-0.000127,7.9e-05,0.000228,0.000304,0.00012,-0.000204,-1.8e-05,8.6e-05,-4.7e-05,-0.000115,-5.2e-05,2e-04,-5.1e-05,-0.000222,-5.3e-05,-8.4e-05,0.000119,-1.3e-05,1.8e-05,-0.000378,-0.000283,-0.000182,-1.6e-05,-0.000161,-0.000431
5.1e-05,-0.000166,-4.9e-05,-8.6e-05,-0.000114,-9.3e-05,-0.000284,3.3e-05,0.00015,-0.000307,-0.000123,-0.000322,-0.000153,-1.1e-05,-4.2e-05,0.000197,0.000416,1.7e-05,0.000248,-0.000197,-0.000208,-0.000213,-7.9e-05,-0.000195,-0.000392,-0.000179,-1.8e-05,-7.8e-05,0.000273,-4e-05,-0.000518,-0.000375,-0.000169,-4.6e-05,8e-06,-0.000447,-0.000404,0.000259,-9.2e-05,-0.000211,0.00014,-0.000227,-1.9e-05,-0.000224,-0.000384,0.000203,2.3e-05,0.000274,0.000216,-2e-04,-0.000331,-1.1e-05,-0.000512,-0.000235,-0.000166,-0.00016,-2.1e-05,-0.000315,-4.6e-05,-0.000144,-0.000257,-0.000126,-2e-06,-0.000404,-0.000315,-0.000231,2.1e-05,-0.000304,-8.7e-05,-0.000228,-4.1e-05,-0.000221,0.000254,4.9e-05,-0.000129,0.000204,-0.000244,-0.000154,-0.000255,-0.000261,3.3e-05,-6.2e-05,-3.2e-05,-2.1e-05,7.8e-05,-3.3e-05,-3.4e-05,-7e-05,0.000191,-0.000291,0.000114,0.000286,1.1e-05,-5.4e-05,7.7e-05,-2e-06,-1e-06,-0.000157,-0.000168,-0.000382,9.7e-05,5.1e-05,6.4e-05,-0.000187,-0.000269,-4.7e-05,7.8e-05,4.4e-05,0.000249,-0.000125,-0.000149,-9e-05,-0.00013,-6.2e-05,9.6e-05,0.000211,0.000146,4e-05,2.5e-05,-0.000101,0.000232
4.3e-05,-0.000538,-0.000181,1.7e-05,-4.8e-05,-0.000229,-0.000201,-0.000101,4.5e-05,-0.000103,-0.000321,-0.000259,-1.8e-05,-0.000127,-0.000343,-6.4e-05,-0.00015,0.000129,-6.8e-05,-7.7e-05,-0.000108,-0.000171,-0.000358,-0.000163,0.000372,-5.9e-05,0.00019,1.9e-05,0.000313,-0.000117,0.000103,2.4e-05,8.9e-05,-5.6e-05,-0.000172,-6.5e-05,8.4e-05,3.4e-05,3.6e-05,0.000303,0.000235,0.000213,-0.00024,-0.00028,0.000234,0.000271,5e-05,5.5e-05,-9.8e-05,-0.000317,-6.2e-05,-0.000143,8e-05,0.000164,-7.5e-05,4.9e-05,-0.000105,6.1e-05,0.000287,-0.000124,0.000101,-0.000256,6e-05,-2.4e-05,9.6e-05,0.000188,8e-06,0.000165,-0.000108,-0.000336,-1.6e-05,9.1e-05,-0.000119,-7.1e-05,6.7e-05,-2.4e-05,-7.2e-05,-0.000132,0.000154,7.9e-05,0.000396,-6e-06,-0.000162,-0.000264,0.000121,-6.8e-05,-0.000142,-1.7e-05,2.8e-05,1e-06,0.000119,-1.8e-05,-1.8e-05,-9.3e-05,6.8e-05,-2.5e-05,5.9e-05,-0.00021,3.2e-05,-2.9e-05,5.9e-05,-0.000148,-2.8e-05,0.000232,0.00014,-0.00027,-8.9e-05,6.5e-05,-0.000317,-0.000165,2.1e-05,1.5e-05,3.2e-05,-9e-05,4.9e-05,0.000187,-0.000225,-0.000195,-0.00014,3e-05,9.9e-05
-4.1e-05,-6.2e-05,-7.9e-05,-0.00019,0.000108,-3.9e-05,7e-06,0.000111,-1e-04,-9.7e-05,0.00011,-0.000192,-4.1e-05,-0.000152,-0.000218,-5.3e-05,-0.000107,-3.5e-05,-0.000121,5.3e-05,-0.000237,-0.000125,-4.7e-05,-4.5e-05,-8e-05,6.3e-05,-0.000239,0.000281,-7.7e-05,-3.1e-05,-9.8e-05,-0.000135,-0.000149,8e-05,9.7e-05,-0.000138,0.000121,-4.2e-05,-0.00023,0.000277,0.000104,-9.5e-05,-0.000125,-8.1e-05,-8.9e-05,7.5e-05,-7e-05,0.000154,3e-06,-4.5e-05,-3e-05,-6.5e-05,0.000101,0.000155,-0.000144,-8e-06,-0.000111,5.4e-05,8.5e-05,-4.7e-05,-0.000158,2e-04,5.5e-05,0.000117,-0.000151,-2.3e-05,0.000241,0.000124,1e-05,2.6e-05,1e-06,0.000147,6e-05,6.3e-05,-0.000203,-0.000299,-7.7e-05,-9.8e-05,-4.2e-05,-2.7e-05,-2.8e-05,1.6e-05,-5e-06,-8.6e-05,1.2e-05,-9e-05,4e-05,-0.000106,-0.000207,-0.000181,-0.000259,-0.000278,-6e-05,7e-06,-3.1e-05,-7.9e-05,-0.000114,-9.5e-05,3.7e-05,-6.2e-05,-0.000104,-7.4e-05,0.000183,-0.00014,-8.5e-05,-2.4e-05,2.7e-05,-0.000164,-0.000209,-0.000143,-3.7e-05,-4.8e-05,0.00015,0.000113,2e-04,-0.000157,-8.7e-05,0.000114,0.000113,-0.000158,-4.2e-05
0.000101,0.000251,-1.3e-05,1.2e-05,-0.000103,-0.000198,8.2e-05,-7.2e-05,-7e-05,0.000119,-0.000123,0.000115,2.5e-05,2.6e-05,3.1e-05,9e-05,-0.000153,-4.3e-05,-0.00016,-0.000102,0.000179,-3.7e-05,5e-05,-0.000241,-0.00027,-1.3e-05,0.000111,1.2e-05,-6e-06,0.000168,0.00015,1e-04,-0.000148,-0.000119,0.000127,1.4e-05,-0.000156,-9.7e-05,-4.7e-05,-8e-05,-0.000134,-4e-05,0.000118,-3e-05,-9.3e-05,-5.9e-05,-7.4e-05,3.1e-05,3.1e-05,2.8e-05,-5e-05,-2.9e-05,0.000129,-9.6e-05,-8.6e-05,-3.7e-05,-0.00014,-8.6e-05,-0.000112,0.00016,-2.1e-05,8.6e-05,-0.000137,-4.8e-05,4.7e-05,-5.5e-05,-8.3e-05,-1.2e-05,1.1e-05,-8.8e-05,-8.7e-05,-4.4e-05,-1.4e-05,-0.000123,2.6e-05,5.9e-05,6.2e-05,-4.9e-05,5.3e-05,-0.000102,-0.000198,-6.6e-05,-8.6e-05,-1.9e-05,-4.3e-05,-4.9e-05,-9.2e-05,-4.9e-05,2.5e-05,-2.4e-05,-3e-05,9.7e-05,9e-05,5.7e-05,-4.3e-05,4.8e-05,-0.000174,-0.000118,-8e-05,-9.3e-05,1.9e-05,-0.000226,-7.6e-05,0.000135,2.5e-05,-4.6e-05,2e-06,3.9e-05,-6e-05,7e-06,-3.1e-05,-0.000127,-0.000101,-0.000182,1.4e-05,4.1e-05,8.8e-05,-0.000169,-5.8e-05,-5.5e-05,0.000293
-6.5e-05,8e-06,-1.1e-05,-0.000144,-5e-05,-3.9e-05,-1.5e-05,-0.000102,4.4e-05,5.3e-05,-0.000116,-0.000105,-7.9e-05,-6.7e-05,6.7e-05,-8.5e-05,-0.000103,-3.1e-05,-0.000137,2e-05,-0.00015,-0.00018,-0.000122,-0.000118,0.000126,-2.8e-05,-0.000134,-8.6e-05,1.9e-05,-0.000217,0.000127,-5.4e-05,1.9e-05,4.3e-05,-0.000106,9.9e-05,-0.000127,9.3e-05,4.7e-05,1.6e-05,-0.000114,7.8e-05,3.1e-05,3.8e-05,-4.3e-05,4e-06,-2.7e-05,-0.000143,-6.3e-05,9.5e-05,-4e-05,-1.8e-05,-1.1e-05,0.000123,1e-05,-0.00015,-0.000104,-2.7e-05,-7e-06,2.1e-05,8.5e-05,8.2e-05,0.000111,5.5e-05,-1.9e-05,-5.5e-05,0.000124,8e-06,6.1e-05,-2e-05,0.000166,2e-05,0.000153,-1e-05,-0.000121,2.8e-05,-5.1e-05,0.000144,-0.000124,0.000112,0.000134,4.3e-05,-3.8e-05,-3e-06,-1e-05,-2.1e-05,-0.000132,7.9e-05,-7e-05,-1.7e-05,6.6e-05,-6.9e-05,-6e-06,-9e-05,-9.9e-05,-2.8e-05,-0.000121,0.000105,-2.1e-05,-1.7e-05,-0.000173,9e-06,-2e-06,-0.000156,-5.6e-05,0.000128,6.6e-05,-1.6e-05,-2.6e-05,0.000101,-6.1e-05,-8.9e-05,-9e-05,-9.8e-05,-5.9e-05,-0.000206,5e-05,-0.00011,6e-05,5e-05,-0.000139
-0.000102,-5e-05,-4.7e-05,7e-06,3.6e-05,-0.000113,-3.2e-05,-0.000119,-3e-05,4.4e-05,-0.000129,2.7e-05,5.7e-05,5.2e-05,-6.4e-05,-8.5e-05,-0.000131,-6.9e-05,-8e-05,-0.000135,0.000123,-7.1e-05,2.5e-05,-8.4e-05,-8.6e-05,-1.8e-05,-0.000107,-0.000141,8.3e-05,-4.8e-05,-0.00011,-3.5e-05,-4e-06,2e-05,-5.2e-05,-0.000105,-9.2e-05,-2.7e-05,-8.4e-05,8.9e-05,7.4e-05,-6e-06,-5.5e-05,-1.6e-05,0.00019,-0.000148,-8e-05,5.5e-05,-0.000101,1.5e-05,-8e-06,-0.000154,-4.6e-05,1e-05,0.000122,4.7e-05,5.4e-05,9.2e-05,6e-05,2.9e-05,-2e-05,-3.7e-05,-0.000145,-3e-06,2.6e-05,1e-06,5.9e-05,-2.4e-05,3e-06,6.3e-05,6e-05,-2.3e-05,-6.9e-05,-3.5e-05,0.000104,-7.1e-05,-3.3e-05,2.6e-05,3.4e-05,-5.5e-05,-8.7e-05,-0.000156,5.9e-05,-7.8e-05,-0.000123,-9.8e-05,4.6e-05,-2.6e-05,1.9e-05,-1.6e-05,2.4e-05,9.6e-05,-0.00017,3.2e-05,6.8e-05,1.3e-05,3.7e-05,-0.00013,3.5e-05,-9e-06,6.3e-05,-6.3e-05,-7.8e-05,2.8e-05,1e-05,-2.1e-05,-8.8e-05,1.2e-05,-1.9e-05,-3.5e-05,-2.6e-05,3.3e-05,2.8e-05,0.000141,-4.5e-05,-1e-05,3.7e-05,4e-05,4.3e-05,9.2e-05,2.3e-05
-3.5e-05,1.9e-05,-4.7e-05,-1e-05,-1e-04,4.2e-05,-6e-05,-0.000184,-6.5e-05,-0.000163,4.2e-05,-4.4e-05,-3.9e-05,-9.5e-05,1e-06,0.000158,5.6e-05,2.3e-05,-0.000159,-0.000114,-4.1e-05,-3.7e-05,-3e-06,2.4e-05,-6e-06,1.7e-05,1.1e-05,-3.3e-05,1.9e-05,6.8e-05,-7.5e-05,6.2e-05,-2.2e-05,-1.6e-05,-1e-04,-8e-06,-0.000106,5.1e-05,4.2e-05,-5.7e-05,-8.2e-05,1.1e-05,-8e-06,5.3e-05,-4.2e-05,-1.4e-05,-4e-06,-6.6e-05,-1.3e-05,8.9e-05,-9.5e-05,9.2e-05,0.000117,-0.000141,-3.4e-05,5.1e-05,-5.1e-05,1.7e-05,4.8e-05,-5.5e-05,3e-06,-1.8e-05,-4e-06,0.000104,-6.7e-05,-1e-05,-3.4e-05,-6e-06,5.5e-05,5.1e-05,1.7e-05,-6.7e-05,-1e-05,2.4e-05,-2.5e-05,-6.9e-05,5.4e-05,-6e-06,-1.4e-05,3.3e-05,-6e-05,-1e-05,-4.7e-05,-6.2e-05,-6.8e-05,-5.6e-05,-3.3e-05,-3.1e-05,-4.9e-05,1.5e-05,-3e-06,4.7e-05,3.5e-05,1.5e-05,4.1e-05,-2e-05,0,2e-05,-0.000112,-7.6e-05,-2.8e-05,-2e-05,5.8e-05,-4.6e-05,-5e-05,1.1e-05,-0.000149,2e-06,7.9e-05,-9e-05,-6.4e-05,-2e-06,-1e-06,-4.2e-05,-5.1e-05,-6.1e-05,-5.6e-05,-3.4e-05,3.9e-05,-2e-05,-7.5e-05
2e-05,1.5e-05,-2e-05,-1.3e-05,2.1e-05,-4.1e-05,2.1e-05,-3.6e-05,2.1e-05,-7e-06,5.6e-05,-7.2e-05,2.6e-05,0,-8e-06,-4.9e-05,1.1e-05,2.5e-05,7.9e-05,-9.3e-05,-4e-05,5.6e-05,6e-06,-3.3e-05,-3.5e-05,-9e-05,-6.5e-05,-4e-05,-0.00019,2.6e-05,3.1e-05,-2.4e-05,6e-06,5.2e-05,-1e-06,3e-05,1.1e-05,-7.4e-05,-6.8e-05,3.5e-05,-0.000133,-5.2e-05,6.5e-05,-1e-05,2.5e-05,-0.000102,-2.3e-05,1.3e-05,-5e-06,-7.5e-05,8e-06,-3e-06,-5.9e-05,7.6e-05,-5e-06,-1e-06,3.1e-05,-4e-06,-1.3e-05,-6.9e-05,4.2e-05,8.4e-05,6.2e-05,-3.6e-05,3.8e-05,2.3e-05,3.6e-05,-5.8e-05,-6.5e-05,-5e-06,-2.7e-05,3.2e-05,-4.2e-05,-1e-05,2.7e-05,6e-06,-4.2e-05,1.1e-05,2.7e-05,-2.6e-05,2e-06,-3e-06,5.9e-05,-2e-06,-2e-05,-2.1e-05,3.9e-05,3.2e-05,-2.7e-05,-9.2e-05,-4.7e-05,2.9e-05,3.3e-05,-5e-06,-2.5e-05,-6e-06,2.4e-05,-2.6e-05,-8.9e-05,0,-3e-05,4.3e-05,-2e-05,-0.000142,4e-06,4e-06,-5.1e-05,-5.6e-05,-3.6e-05,3.7e-05,-1.9e-05,1.3e-05,-5.7e-05,-6.7e-05,3.8e-05,-2.5e-05,-2.7e-05,5.2e-05,-0.000109,6.4e-05,-6.9e-05
-9e-06,-9.5e-05,1e-05,-2.1e-05,2e-06,1.6e-05,-2.3e-05,7e-06,-6.1e-05,-5.8e-05,1e-06,-9e-06,-9e-06,-3e-06,6.7e-05,-3e-05,-2.1e-05,1e-05,5e-06,6.7e-05,-7e-06,-2e-06,-1.5e-05,9e-06,4.6e-05,-6e-06,7.9e-05,0.000167,-3.2e-05,-9.4e-05,2.5e-05,4.5e-05,4.9e-05,-8.5e-05,-4.8e-05,-8.9e-05,4.6e-05,-3.1e-05,5.3e-05,5.7e-05,-6.1e-05,-8e-06,-6.5e-05,2.8e-05,-1.3e-05,1e-06,1.2e-05,-2.3e-05,-2.5e-05,-2.1e-05,2.5e-05,-3e-05,6.9e-05,-4.5e-05,-2e-06,-3.7e-05,2e-06,2.1e-05,-3.6e-05,8e-06,-1e-05,8.1e-05,-1.1e-05,-6e-06,-3e-06,2.8e-05,-4.1e-05,3.6e-05,-1.2e-05,-4.3e-05,-1.7e-05,3.7e-05,1.5e-05,3.1e-05,3.3e-05,-1.3e-05,-2.6e-05,-2.7e-05,1.5e-05,-1.1e-05,-3.6e-05,-5e-06,-9e-06,-4e-06,-2.9e-05,-1.6e-05,-9e-06,-1.3e-05,7e-06,-6e-06,1.9e-05,-5e-06,2.1e-05,-2.3e-05,-1.3e-05,-3.9e-05,5.1e-05,-1.3e-05,-1.2e-05,-1.7e-05,0,-1e-06,1.4e-05,3e-05,7e-06,1.8e-05,-1e-05,7e-06,5.2e-05,-3e-06,3.6e-05,-1.6e-05,5e-06,1.5e-05,-1.6e-05,-6.2e-05,-2.4e-05,2.7e-05,8.7e-05,-2.2e-05,-5.6e-05
1.8e-05,-6.3e-05,1.7e-05,-5e-06,7e-06,2e-06,1.7e-05,-1e-05,6.1e-05,4.1e-05,5.8e-05,-4.7e-05,-3.2e-05,2.1e-05,-3.9e-05,-1e-05,3.3e-05,5e-06,4.9e-05,6.1e-05,-3.3e-05,2.4e-05,2.3e-05,5.4e-05,-3e-05,8.6e-05,-4.6e-05,-2.9e-05,-4e-05,-1e-05,-3.6e-05,-1.7e-05,-7e-06,6.6e-05,2e-05,-9e-06,4.8e-05,6.8e-05,-5.3e-05,-3.3e-05,4e-06,-6e-06,-5e-06,-1e-06,6e-06,-1.5e-05,-6e-06,-5.1e-05,8e-06,-4.8e-05,1.9e-05,7e-06,4.2e-05,5e-06,-4.5e-05,8e-06,-2e-06,1.7e-05,-6e-06,-4e-06,-1.6e-05,-7e-06,6e-06,7e-06,-8e-06,-4.6e-05,1.7e-05,-1.1e-05,1e-05,7e-06,3.3e-05,-2.2e-05,-9e-06,-4.9e-05,-3.8e-05,1e-06,2.4e-05,1.8e-05,2e-05,1.4e-05,-3.8e-05,-3e-05,-2.1e-05,2.1e-05,1e-05,-8e-06,1.7e-05,-9e-06,3.2e-05,6e-06,1e-05,9e-06,3.9e-05,8e-06,-2e-05,1.6e-05,7e-06,-3.2e-05,2.2e-05,-3.8e-05,-1.3e-05,-9e-06,-3.5e-05,-1.6e-05,-1.3e-05,-5.4e-05,1.6e-05,-1.4e-05,-3e-05,0,3.8e-05,2e-05,-4e-06,1.3e-05,-3.8e-05,3e-05,-2e-06,-3.8e-05,4.3e-05,6e-06,3.6e-05
-3e-06,2.5e-05,1.1e-05,2.3e-05,-8e-06,-1e-05,1.6e-05,1.2e-05,-3.5e-05,-1e-06,4.2e-05,5e-06,2.7e-05,-2.6e-05,-2e-06,-1.6e-05,7e-06,-1.1e-05,2.6e-05,-5.6e-05,-1e-06,-5.7e-05,2.7e-05,-8e-06,-2.7e-05,-8e-05,6.6e-05,2.2e-05,3.4e-05,3.8e-05,8.6e-05,-2.5e-05,4e-06,-4e-05,5e-06,1e-05,1.5e-05,3e-06,3e-05,-4.5e-05,3e-06,1.5e-05,-1e-05,3e-06,-3e-06,1.5e-05,1.2e-05,8e-06,-1.1e-05,3e-06,1.8e-05,-1.6e-05,2e-05,-3.7e-05,-2.3e-05,1.2e-05,-1.7e-05,-1e-05,1e-05,2.1e-05,1.2e-05,-3.1e-05,2.8e-05,6e-06,4e-06,-4e-06,2.5e-05,-2.6e-05,3e-06,-3.6e-05,-4.3e-05,1.4e-05,1.2e-05,7e-06,2e-05,-1.3e-05,3e-06,-2.6e-05,-3.6e-05,-1e-05,3.4e-05,-5e-06,-1e-05,-5e-06,1.1e-05,-2.5e-05,-9e-06,8e-06,-2e-05,-1.3e-05,1.1e-05,-1e-06,-2.3e-05,1.9e-05,3e-05,9e-06,-2e-05,-3.2e-05,3.5e-05,1.1e-05,-1e-06,2.4e-05,-1e-05,7e-05,2e-06,3e-06,1.7e-05,1.9e-05,-2e-05,4.3e-05,-3e-06,0,-3e-06,4e-06,-2.8e-05,-3e-06,1.5e-05,-4e-06,-4.3e-05,-1.5e-05,-3e-05
-5e-06,5.4e-05,1.1e-05,-1.8e-05,-1.7e-05,-1.3e-05,1.3e-05,2.1e-05,1.4e-05,1.4e-05,-2.7e-05,-3e-06,-2.2e-05,6e-06,7e-06,3.8e-05,-2.4e-05,-8e-06,5e-06,-1.3e-05,5e-06,2e-06,-1e-06,7e-06,5.9e-05,2.4e-05,-5e-06,-4.8e-05,5.9e-05,2.9e-05,-2e-05,-1.4e-05,-9e-06,2e-05,4e-06,-2.3e-05,-1.4e-05,-1.1e-05,-1.9e-05,-5e-06,1.1e-05,1.2e-05,1.4e-05,5e-06,3.5e-05,-4.3e-05,-1e-06,-1.9e-05,2e-06,1.1e-05,-7e-06,1.5e-05,-9e-06,-5e-06,-4.5e-05,0,-2.1e-05,3e-06,-2e-06,-1.2e-05,-1.5e-05,4.7e-05,-5e-06,-1.4e-05,2e-06,-8e-06,-2.8e-05,-6e-06,-2e-06,-7e-06,9e-06,-2.3e-05,-2.7e-05,-1.4e-05,-3.8e-05,7e-06,-1.2e-05,-8e-06,0,1.2e-05,1.1e-05,1e-06,-1e-05,-1.4e-05,6e-06,-1e-06,-1.4e-05,-7e-06,1.2e-05,-1.2e-05,-1.6e-05,2.2e-05,1.5e-05,-3.1e-05,2e-06,-1.7e-05,1e-05,2e-05,0,-1.7e-05,2.1e-05,-4.2e-05,-1.6e-05,-5.1e-05,2e-06,1.2e-05,1.2e-05,-1.7e-05,-1.1e-05,-2.7e-05,2e-06,1.3e-05,1.3e-05,-1.6e-05,4e-06,2.1e-05,1.7e-05,-2.7e-05,-1.5e-05,2.8e-05,5e-06
-2e-06,-1e-06,5e-06,-1e-06,1.6e-05,-6e-06,-1.3e-05,1.3e-05,-1.4e-05,-1.3e-05,-2.7e-05,2e-05,6e-06,-5e-06,2.4e-05,-1.1e-05,2.3e-05,1e-05,1.4e-05,-3e-06,1.5e-05,-2.8e-05,-1.5e-05,-4.8e-05,-4e-05,-1.7e-05,1.8e-05,-8e-06,-4.4e-05,-5.5e-05,-2.2e-05,8e-06,-1.9e-05,-9e-06,-1.8e-05,2.2e-05,-2e-05,-1.9e-05,0,2e-06,-1.5e-05,-9e-06,5e-06,-9e-06,-3e-06,5.5e-05,6e-06,3e-06,1e-06,1.2e-05,-1.4e-05,1.1e-05,-3e-06,1.6e-05,2e-06,-4e-06,4e-06,2e-05,2.5e-05,4e-06,-1e-05,-1.8e-05,-4e-06,-1.3e-05,1e-06,2.1e-05,-5e-06,-8e-06,8e-06,2.2e-05,-5e-06,-2.3e-05,1.8e-05,2.3e-05,2.2e-05,0,-6e-06,3.1e-05,6e-06,-1.1e-05,-7e-06,-5e-06,-5e-06,-1.7e-05,2e-05,-1.4e-05,-1e-05,-6e-06,-1.6e-05,1.1e-05,-9e-06,-8e-06,-4e-06,-4e-06,3e-06,-3e-06,-2.2e-05,-6e-06,2e-05,-8e-06,-2e-05,7e-06,4e-06,1.7e-05,0,5e-06,1.8e-05,1e-06,-2e-06,9e-06,-2e-06,4e-06,1e-05,-2e-06,8e-06,-3e-06,1e-05,5e-06,1.4e-05,-3.1e-05,6e-06
2e-06,-3.3e-05,-1.2e-05,-2.2e-05,-1.6e-05,-1.6e-05,-1.9e-05,-7e-06,2e-05,-2.9e-05,-4e-06,-1e-05,9e-06,-7e-06,-1.4e-05,-1.9e-05,-1.9e-05,3e-06,-2.3e-05,0,-5e-06,-7e-06,1.1e-05,-1e-05,7e-06,1e-06,-1e-06,-7e-06,-6e-06,6e-06,-1.9e-05,1e-06,-6e-06,6e-06,0,-7e-06,-1e-05,-7e-06,5e-06,-2.7e-05,-1.3e-05,-1e-06,-1.7e-05,1.2e-05,-2.5e-05,2.1e-05,-5e-06,9e-06,-7e-06,2.7e-05,-2.7e-05,-2e-05,4.5e-05,-3.2e-05,9e-06,0,-1.2e-05,-4e-06,-3.8e-05,-2.4e-05,2.4e-05,1.1e-05,2.1e-05,3.6e-05,-1e-05,-3e-06,-1.4e-05,-2e-06,-7e-06,2.7e-05,-5e-06,1.8e-05,-5e-06,-1.8e-05,-2e-05,1.2e-05,8e-06,1.2e-05,1.4e-05,1e-06,1.3e-05,-1.8e-05,1.1e-05,-1.6e-05,1.2e-05,8e-06,-5e-06,7e-06,1.2e-05,-1e-05,1e-05,2e-06,-7e-06,1.3e-05,-2.1e-05,-5e-06,-1.8e-05,-9e-06,-1e-05,-1.1e-05,1.1e-05,-1.6e-05,6e-06,-1.2e-05,-5e-06,-6e-06,-2e-06,-3e-06,-9e-06,-1.2e-05,-2.5e-05,-1.5e-05,-4e-06,0,8e-06,-1.4e-05,-1e-06,1.6e-05,1.5e-05,2e-05,-2e-06
2e-06,0,-1.7e-05,5e-06,3e-06,2e-06,2e-06,5e-06,-1.4e-05,-9e-06,-1.3e-05,5e-06,-9e-06,9e-06,-9e-06,8e-06,-8e-06,-6e-06,-2.4e-05,-1e-05,9e-06,-1.4e-05,7e-06,-2.1e-05,1e-06,-1.4e-05,-6e-06,5.3e-05,1.2e-05,3e-05,1.8e-05,9e-06,1.2e-05,5e-06,1.3e-05,-7e-06,-3e-06,1.4e-05,-1.2e-05,1.5e-05,3e-06,-7e-06,-3e-06,-3e-06,2.3e-05,1.9e-05,2e-06,-7e-06,1e-06,-3e-06,-3e-06,3e-06,-7e-06,2.4e-05,-1e-06,-4e-06,1e-06,2e-06,-1e-06,-5e-06,-6e-06,2.1e-05,-4e-06,-2.5e-05,9e-06,4e-06,3e-06,-7e-06,-4e-06,1e-06,1e-05,8e-06,3e-06,4e-06,1.4e-05,-1.7e-05,-3e-06,-2e-06,-2e-06,2e-06,9e-06,9e-06,-5e-06,-6e-06,2e-06,-2.4e-05,2e-06,-3e-06,0,-8e-06,6e-06,1e-05,-6e-06,-1e-06,3e-06,-9e-06,3e-06,-1.6e-05,-1.4e-05,-1.5e-05,-7e-06,-6e-06,-2e-06,5e-06,5e-06,1.8e-05,-3e-06,3e-06,1.6e-05,-1.2e-05,-8e-06,0,-1e-06,-1.5e-05,7e-06,-4e-06,-1.6e-05,-1.3e-05,-8e-06,-3e-06,1.8e-05
1e-06,-1.2e-05,-8e-06,-9e-06,1.1e-05,-1.4e-05,3e-06,-6e-06,1e-05,-1.5e-05,-1.8e-05,-1.4e-05,1.1e-05,-1.2e-05,1e-05,3e-06,6e-06,2e-06,-4.2e-05,5e-06,-3.2e-05,-1.3e-05,-1e-06,-2.7e-05,-4e-06,9e-06,-6e-06,-8e-06,2.4e-05,-1.4e-05,-1.4e-05,6e-06,4e-06,-1.9e-05,2e-06,-1e-05,4e-06,1.1e-05,1.3e-05,6e-06,2e-05,6e-06,1.3e-05,6e-06,4e-06,0,-7e-06,1.2e-05,0,-2e-06,-5e-06,2e-06,1.7e-05,-7e-06,8e-06,-8e-06,1e-06,1e-05,5e-06,-9e-06,-4e-06,-1.4e-05,-1.5e-05,-2e-06,-4e-06,-9e-06,-1e-06,-5e-06,1e-06,-5e-06,-1.3e-05,-3e-06,-1.1e-05,-1e-05,-1e-06,6e-06,-9e-06,2e-06,1e-06,-3e-06,-7e-06,-1.5e-05,2e-05,6e-06,-1e-06,-1e-06,-2e-06,-1e-06,-7e-06,3e-06,0,5e-06,4e-06,-8e-06,5e-06,9e-06,-2e-06,-1e-05,-3e-06,1e-06,-2e-06,3e-06,-8e-06,1.3e-05,-4e-06,-1.2e-05,2e-06,1e-06,-6e-06,-2e-06,9e-06,-6e-06,1e-06,2e-05,4e-06,1.1e-05,-9e-06,2e-06,-1e-05,1.7e-05,1.3e-05
-3e-06,-3.3e-05,1e-06,1e-06,-1.2e-05,3e-06,3e-06,-3e-05,-1.6e-05,1.4e-05,-2e-06,-9e-06,-9e-06,5e-06,9e-06,-7e-06,-7e-06,-1e-06,-3e-06,-1.3e-05,9e-06,2e-06,3e-06,6e-06,2e-06,-1.1e-05,-2e-05,1e-05,2.7e-05,-2.6e-05,3.9e-05,-5e-06,-6e-06,1.9e-05,-1.2e-05,-8e-06,-8e-06,-1.5e-05,-2e-05,-3.2e-05,7e-06,-1e-06,-7e-06,2e-06,6e-06,1.1e-05,0,1.1e-05,-5e-06,-2.2e-05,1.2e-05,-8e-06,0,3e-06,-8e-06,8e-06,-3e-06,4e-06,9e-06,5e-06,9e-06,2.5e-05,1.2e-05,1.1e-05,0,-1.1e-05,-1.5e-05,5e-06,-1e-06,-8e-06,-3e-06,3e-06,9e-06,-1e-06,7e-06,-7e-06,1e-06,-3e-06,-1.1e-05,2e-06,1.4e-05,5e-06,-4e-06,3e-06,-5e-06,-6e-06,3e-06,0,-1e-05,-6e-06,-1e-05,1.7e-05,-1.2e-05,2e-06,9e-06,-8e-06,-1e-06,1e-06,-4e-06,-1.6e-05,8e-06,-6e-06,2e-06,-1.7e-05,-1e-06,1e-06,0,-6e-06,7e-06,7e-06,-5e-06,4e-06,-4e-06,-1e-06,1e-06,-7e-06,-1e-06,-5e-06,5e-06,-1.7e-05,1.4e-05
-1e-06,-1e-05,4e-06,-1.1e-05,2e-06,-5e-06,2e-06,-1.4e-05,1.6e-05,-3e-06,2.1e-05,-5e-06,2e-06,-1e-06,-1e-06,1.1e-05,0,-2e-06,-1.6e-05,-5e-06,-1.5e-05,-1.5e-05,4e-06,-9e-06,-6e-06,1.3e-05,-1e-06,-2.8e-05,-5e-06,2e-05,-7e-06,-6e-06,2e-06,-1e-05,7e-06,-3e-06,-9e-06,-5e-06,1.6e-05,4e-06,-1.2e-05,-1e-06,-1.8e-05,-1e-06,-1.1e-05,-1.1e-05,-4e-06,0,-1e-06,-4e-06,5e-06,6e-06,8e-06,8e-06,-1e-05,1e-05,3e-06,-4e-06,4e-06,1e-06,-5e-06,-2.3e-05,0,-1.1e-05,-1e-06,1e-05,7e-06,-1.4e-05,-3e-06,-1.2e-05,3e-06,-8e-06,-2e-06,6e-06,3e-06,5e-06,2e-06,6e-06,2e-06,-5e-06,-1e-06,-1.4e-05,-4e-06,0,-1.2e-05,-7e-06,7e-06,1e-06,9e-06,-3e-06,3e-06,-8e-06,-6e-06,6e-06,-5e-06,-6e-06,1.4e-05,-2.2e-05,3e-06,-5e-06,-1.2e-05,8e-06,2e-06,1.4e-05,1e-06,-4e-06,-1e-06,3e-06,4e-06,1.4e-05,0,4e-06,0,-1.8e-05,1e-06,-2e-06,6e-06,-2e-06,1e-06,1.2e-05,7e-06
-2e-06,2.5e-05,5e-06,0,1e-06,1e-06,4e-06,-1.9e-05,-1.2e-05,6e-06,4e-06,-5e-06,2e-06,-1e-06,-1.2e-05,-8e-06,5e-06,7e-06,1.1e-05,-4e-06,1.4e-05,4e-06,2e-06,2.1e-05,9e-06,-2.7e-05,-1.4e-05,-9e-06,-4e-06,9e-06,-1e-05,-6e-06,2e-06,1e-06,1e-06,-4e-06,-7e-06,6e-06,-1.4e-05,1.2e-05,-9e-06,2e-06,1.6e-05,2e-06,9e-06,5e-06,0,9e-06,-1e-06,-3e-06,0,-1e-06,-1e-06,-2e-06,-1e-05,-7e-06,-2e-06,8e-06,-1.7e-05,0,-6e-06,-1.7e-05,-1.4e-05,-1e-06,4e-06,7e-06,-8e-06,-1e-06,6e-06,-1.3e-05,-6e-06,-1e-05,5e-06,-2e-06,-7e-06,-1.1e-05,-4e-06,-4e-06,2e-06,4e-06,-1.6e-05,-3e-06,-2e-06,-8e-06,-8e-06,0,2e-06,-4e-06,-3e-06,-2e-06,4e-06,-2e-06,2e-06,0,-9e-06,3e-06,3e-06,-2e-06,2e-06,-4e-06,6e-06,-2e-06,5e-06,-2e-05,1e-06,-4e-06,-9e-06,-2e-06,-6e-06,-1e-05,9e-06,-2e-06,-2e-06,5e-06,6e-06,-8e-06,9e-06,1.3e-05,1e-06,-1.1e-05,4e-06
1e-06,1.8e-05,5e-06,1e-06,-2e-06,-4e-06,-4e-06,-2.2e-05,9e-06,-1.3e-05,1e-06,5e-06,-4e-06,-3e-06,8e-06,-2e-06,-2e-06,-4e-06,8e-06,-1.1e-05,5e-06,-9e-06,3e-06,-2e-06,-1e-05,1.3e-05,7e-06,2e-06,0,-1e-05,-5e-06,8e-06,0,4e-06,-7e-06,5e-06,3e-06,6e-06,1e-05,-3e-06,0,0,-3e-06,-1e-06,-8e-06,-1e-05,-1e-06,-3e-06,-1e-06,8e-06,-3e-06,-5e-06,-5e-06,5e-06,-1.4e-05,-8e-06,0,0,3e-06,-6e-06,7e-06,1.8e-05,1.5e-05,-7e-06,-4e-06,0,2e-06,5e-06,-2e-06,9e-06,6e-06,6e-06,-6e-06,-6e-06,5e-06,7e-06,-2e-06,-3e-06,4e-06,0,1e-06,4e-06,-7e-06,-9e-06,-3e-06,-1.4e-05,-1e-06,2e-06,2e-06,1e-06,2e-06,5e-06,-1e-06,-8e-06,2e-06,-5e-06,0,-7e-06,1e-06,-1.1e-05,-1e-06,-1e-06,1e-06,1.3e-05,-4e-06,6e-06,-1.2e-05,4e-06,-4e-06,5e-06,-1e-06,5e-06,-1e-06,5e-06,1e-06,-3e-06,4e-06,-6e-06,-4e-06,5e-06,-7e-06
2e-06,-1.4e-05,2e-06,-2e-06,1e-06,0,-7e-06,-2e-06,-1.2e-05,-7e-06,1.2e-05,0,2e-06,2e-06,6e-06,5e-06,-1e-06,0,1.8e-05,-4e-06,2e-06,-1e-06,3e-06,2e-06,3e-06,-3e-06,-1e-06,2.5e-05,5e-06,-1.8e-05,0,-1e-06,-3e-06,-2e-06,-3e-06,-1e-06,1.5e-05,-1e-06,-6e-06,0,2e-06,-1e-06,-1e-06,0,1.1e-05,-1.1e-05,2e-06,-3e-06,0,8e-06,-5e-06,-2e-06,1.8e-05,1e-06,-3e-06,4e-06,-5e-06,-1e-06,1e-06,-7e-06,-1e-06,2e-06,0,1.1e-05,-2e-06,-6e-06,2e-06,-7e-06,-1e-06,1.3e-05,-9e-06,7e-06,2e-06,1e-05,-1.2e-05,-7e-06,-3e-06,1e-05,2e-06,-1e-06,4e-06,-6e-06,0,-4e-06,-6e-06,5e-06,-2e-06,-1e-06,-4e-06,-3e-06,-3e-06,3e-06,1.6e-05,5e-06,3e-06,-4e-06,-1e-06,3e-06,-5e-06,-3e-06,-6e-06,1e-06,-2e-06,-1e-05,1e-06,-2e-06,-7e-06,-4e-06,0,-8e-06,-4e-06,-4e-06,3e-06,-1e-06,-2e-06,4e-06,-2e-06,-3e-06,-2e-06,-6e-06,-5e-06
-3e-06,-1.8e-05,-3e-06,-4e-06,-2e-06,-4e-06,0,-3e-06,9e-06,-7e-06,2e-06,1e-06,-2e-06,-1e-06,-3e-06,-4e-06,3e-06,2e-06,1.7e-05,7e-06,-3e-06,-1.3e-05,0,1e-06,6e-06,-7e-06,8e-06,1e-06,-1.3e-05,2.2e-05,-1.1e-05,4e-06,-1e-06,-1e-06,7e-06,-7e-06,7e-06,-5e-06,2e-06,1e-05,0,-2e-06,-7e-06,2e-06,1e-06,-1e-05,0,1e-06,-2e-06,6e-06,-2e-06,-2e-06,-9e-06,-1e-06,0,6e-06,-1e-06,2e-06,7e-06,-2e-06,-5e-06,-5e-06,-1e-05,-1.1e-05,3e-06,-1e-06,-4e-06,4e-06,1e-06,6e-06,6e-06,-2e-06,0,-1.5e-05,8e-06,5e-06,6e-06,6e-06,-5e-06,-1e-06,-9e-06,-6e-06,-1e-06,1e-06,2e-06,-1e-05,-3e-06,-1e-06,-1e-06,-1e-06,-2e-06,-1e-06,-3e-06,4e-06,5e-06,4e-06,-2e-06,-8e-06,-6e-06,-5e-06,8e-06,-8e-06,-3e-06,3e-06,0,2e-06,-3e-06,2e-06,-5e-06,-3e-06,7e-06,4e-06,-2e-06,-4e-06,-6e-06,2e-06,-5e-06,-2e-06,-1e-06,7e-06,-8e-06
1e-06,-5e-06,-5e-06,-5e-06,5e-06,0,4e-06,-1e-06,-2e-06,-2e-06,-8e-06,-2e-06,2e-06,-2e-06,-7e-06,6e-06,1e-06,-4e-06,2e-06,1e-06,-7e-06,-1.1e-05,2e-06,-1.4e-05,-9e-06,-1e-06,6e-06,6e-06,-1.6e-05,2e-06,1.8e-05,-2e-06,0,-1e-06,-1e-06,1e-06,4e-06,-4e-06,-1e-06,-3e-06,-5e-06,1e-06,3e-06,0,-1e-06,1e-06,1e-06,-6e-06,-1e-06,1e-06,-1e-06,1e-06,6e-06,4e-06,1e-06,-2e-06,0,3e-06,3e-06,-3e-06,7e-06,-5e-06,1.1e-05,0,0,-2e-06,4e-06,-5e-06,-1e-06,2e-06,0,-1e-06,2e-06,6e-06,-7e-06,-4e-06,-9e-06,3e-06,-1e-06,0,2e-06,0,2e-06,2e-06,4e-06,3e-06,-1e-06,0,5e-06,-1e-06,1e-06,0,2e-06,-6e-06,-5e-06,-5e-06,-5e-06,-1.1e-05,3e-06,-8e-06,-4e-06,3e-06,1e-06,0,-1e-06,2e-06,1e-06,-1e-06,4e-06,4e-06,2e-06,-3e-06,1e-06,-3e-06,-3e-06,-3e-06,-6e-06,-5e-06,3e-06,-5e-06,-5e-06
0,-5e-06,-2e-06,-1e-06,-5e-06,-3e-06,3e-06,7e-06,1e-06,5e-06,-7e-06,0,-1e-06,4e-06,4e-06,-2e-06,-4e-06,2e-06,1e-06,-1e-05,-3e-06,-6e-06,4e-06,2e-06,7e-06,6e-06,4e-06,-1.6e-05,-1.1e-05,-1.5e-05,6e-06,2e-06,4e-06,0,-3e-06,-6e-06,-7e-06,6e-06,-3e-06,-8e-06,-5e-06,-1e-06,4e-06,1e-06,-8e-06,-5e-06,-1e-06,1e-06,0,-7e-06,4e-06,2e-06,-1e-05,-7e-06,4e-06,-3e-06,-1e-06,-3e-06,-7e-06,0,-2e-06,-7e-06,1e-06,4e-06,-3e-06,3e-06,0,0,-2e-06,0,-1e-06,-3e-06,-3e-06,6e-06,7e-06,3e-06,3e-06,-4e-06,-2e-06,2e-06,3e-06,-2e-06,6e-06,1e-06,1e-06,-8e-06,-2e-06,1e-06,0,-1e-06,3e-06,-5e-06,1e-06,1e-06,-4e-06,-1e-06,-3e-06,-2e-06,5e-06,-3e-06,-2e-06,-4e-06,1e-06,-1e-06,0,-5e-06,3e-06,1e-06,0,-2e-06,-6e-06,0,3e-06,5e-06,-1e-06,-1e-06,-2e-06,6e-06,-1e-06,3e-06,-7e-06
0,-1.2e-05,0,-1e-06,0,0,-1e-06,5e-06,-2e-06,-3e-06,0,-7e-06,1e-06,-5e-06,5e-06,-4e-06,3e-06,2e-06,-1.5e-05,-7e-06,-2e-06,-4e-06,0,-1.7e-05,-4e-06,-1e-05,5e-06,-6e-06,-1e-06,-2e-06,-9e-06,-4e-06,0,3e-06,0,-4e-06,-1e-05,4e-06,5e-06,1.1e-05,1e-06,2e-06,-5e-06,0,7e-06,3e-06,0,-5e-06,-1e-06,-5e-06,-3e-06,-3e-06,7e-06,3e-06,-4e-06,0,-1e-06,1e-06,-4e-06,0,-3e-06,-4e-06,-1e-05,-3e-06,1e-06,5e-06,2e-06,1e-06,2e-06,-9e-06,2e-06,-6e-06,0,-1.1e-05,-2e-06,-5e-06,-3e-06,0,5e-06,-2e-06,-5e-06,0,-1e-06,-3e-06,7e-06,-1e-06,1e-06,-1e-06,-3e-06,-1e-06,-1e-06,5e-06,-6e-06,2e-06,1e-06,1e-06,1e-06,-7e-06,3e-06,-6e-06,6e-06,-2e-06,1e-06,5e-06,0,5e-06,5e-06,0,0,6e-06,0,0,-2e-06,-3e-06,0,-1e-06,3e-06,1e-06,-5e-06,-1e-06,-6e-06
-1e-06,2e-06,1e-06,0,5e-06,-3e-06,0,1e-06,0,2e-06,-3e-06,1e-06,-1e-06,4e-06,-2e-06,2e-06,-2e-06,-2e-06,-8e-06,0,7e-06,-1e-06,1e-06,1e-06,3e-06,3e-06,-3e-06,0,1.1e-05,1.4e-05,0,2e-06,-4e-06,-6e-06,4e-06,3e-06,-4e-06,-3e-06,-6e-06,5e-06,3e-06,0,-4e-06,0,4e-06,1e-06,-1e-06,-3e-06,-1e-06,-5e-06,0,-1e-06,-4e-06,0,-3e-06,1e-06,1e-06,3e-06,6e-06,-2e-06,3e-06,7e-06,1e-05,0,2e-06,-3e-06,1e-06,-6e-06,-1e-06,-1e-05,-3e-06,2e-06,0,8e-06,0,5e-06,0,4e-06,0,0,4e-06,-8e-06,1e-06,-4e-06,3e-06,-1e-06,2e-06,0,0,-1e-06,-1e-06,3e-06,1e-06,0,3e-06,-5e-06,1e-06,-4e-06,2e-06,-6e-06,-6e-06,6e-06,-1e-06,-7e-06,-1e-06,-4e-06,3e-06,-2e-06,3e-06,-2e-06,0,-2e-06,1e-06,1e-06,0,1e-06,5e-06,-1e-06,0,1e-06,0
1e-06,1.7e-05,1e-06,-5e-06,-6e-06,0,-1e-06,-1e-06,2e-06,-9e-06,-5e-06,-1e-06,1e-06,-3e-06,-5e-06,2e-06,-3e-06,1e-06,-1.8e-05,2e-06,-1e-06,-7e-06,3e-06,-4e-06,-3e-06,-1e-06,1e-06,1.2e-05,-4e-06,-2e-06,-1e-06,1e-06,0,7e-06,-1e-06,-4e-06,0,-3e-06,6e-06,-8e-06,1e-06,-1e-06,3e-06,-1e-06,-4e-06,4e-06,0,4e-06,0,1e-06,-2e-06,0,-5e-06,-7e-06,-5e-06,0,0,-3e-06,0,-3e-06,-1e-06,-1e-05,-2e-06,-4e-06,-2e-06,-4e-06,-2e-06,5e-06,-1e-06,-1e-06,2e-06,5e-06,1e-06,-3e-06,3e-06,-3e-06,-1e-06,0,3e-06,0,6e-06,3e-06,-1e-06,-3e-06,0,-4e-06,1e-06,0,0,1e-06,-1e-06,-4e-06,-5e-06,-2e-06,3e-06,1e-06,1e-06,-9e-06,-1e-06,-2e-06,3e-06,-7e-06,-1e-06,5e-06,0,-2e-06,-1e-06,1e-06,-1e-06,-1e-06,-6e-06,3e-06,2e-06,2e-06,0,3e-06,4e-06,-1e-06,3e-06,-2e-06,-1e-06
0,1e-06,1e-06,0,4e-06,-2e-06,-2e-06,-2e-06,-1e-06,0,4e-06,0,-2e-06,2e-06,1e-06,-2e-06,4e-06,0,-4e-06,-3e-06,6e-06,-5e-06,1e-06,-1e-06,1e-06,-2e-06,-6e-06,5e-06,0,-1.3e-05,-8e-06,1e-06,2e-06,-5e-06,-3e-06,0,7e-06,0,-6e-06,3e-06,-2e-06,1e-06,4e-06,0,-1e-06,5e-06,-1e-06,-3e-06,0,4e-06,-2e-06,-1e-06,5e-06,6e-06,-8e-06,2e-06,0,0,6e-06,-3e-06,-4e-06,2e-06,-7e-06,6e-06,-1e-06,0,4e-06,-5e-06,1e-06,6e-06,1e-06,-1e-06,-1e-06,-6e-06,-5e-06,1e-06,-4e-06,-1e-06,-5e-06,0,-4e-06,-3e-06,-4e-06,-1e-06,1e-06,1e-06,1e-06,-1e-06,1e-06,-1e-06,3e-06,-3e-06,0,0,-4e-06,-1e-06,3e-06,-2e-06,-3e-06,-7e-06,2e-06,7e-06,0,-4e-06,1e-06,6e-06,-1e-06,-1e-06,-2e-06,-4e-06,0,-2e-06,-2e-06,-6e-06,1e-06,-3e-06,0,-4e-06,-1e-06,0,3e-06
-1e-06,-1.8e-05,0,-1e-06,0,1e-06,0,-9e-06,1e-06,-6e-06,5e-06,2e-06,-2e-06,-2e-06,6e-06,1e-06,-2e-06,-2e-06,-5e-06,-4e-06,-7e-06,-6e-06,1e-06,7e-06,2e-06,2e-06,-1e-06,3e-06,4e-06,6e-06,6e-06,-2e-06,0,1e-06,1e-06,0,1e-06,3e-06,5e-06,3e-06,-1e-06,-1e-06,-7e-06,-1e-06,1e-06,2e-06,0,3e-06,0,4e-06,2e-06,0,-6e-06,-5e-06,-3e-06,0,-1e-06,2e-06,-9e-06,-3e-06,4e-06,8e-06,7e-06,-4e-06,2e-06,3e-06,-1e-06,-1e-06,0,6e-06,-2e-06,-1e-06,-1e-06,1.2e-05,4e-06,-2e-06,5e-06,1e-06,0,0,1e-06,-2e-06,0,1e-06,-2e-06,-7e-06,1e-06,0,1e-06,-1e-06,-1e-06,-1e-06,-1e-06,3e-06,0,-3e-06,1e-06,-1e-06,-3e-06,-2e-06,-5e-06,-3e-06,0,3e-06,-1e-06,-4e-06,0,1e-06,0,1e-06,6e-06,3e-06,0,2e-06,1e-06,-1e-06,-3e-06,3e-06,-3e-06,2e-06,7e-06
1e-06,-1.3e-05,-1e-06,-1e-06,-2e-06,-2e-06,3e-06,-1e-05,-3e-06,3e-06,0,-1e-06,3e-06,1e-06,-2e-06,-2e-06,-2e-06,3e-06,9e-06,-2e-06,0,-4e-06,2e-06,-6e-06,-6e-06,-5e-06,-4e-06,-9e-06,5e-06,9e-06,7e-06,0,-1e-06,1e-06,3e-06,-3e-06,-3e-06,2e-06,-4e-06,-5e-06,2e-06,1e-06,0,0,1e-06,1e-06,0,1e-06,0,4e-06,2e-06,0,0,1e-06,-4e-06,-4e-06,0,-1e-06,0,-1e-06,0,-1.4e-05,0,-1e-06,0,0,1e-06,1e-06,-1e-06,6e-06,3e-06,-1e-06,0,-1.2e-05,-5e-06,3e-06,-7e-06,4e-06,-1e-06,-1e-06,3e-06,-2e-06,-2e-06,1e-06,-4e-06,3e-06,-1e-06,0,-3e-06,0,0,2e-06,0,-2e-06,-1e-06,1e-06,-1e-06,-7e-06,0,-5e-06,4e-06,-1e-06,0,-1e-06,0,2e-06,-1e-06,-1e-06,-2e-06,1e-06,0,-1e-06,1e-06,4e-06,1e-06,0,-4e-06,1e-06,0,-2e-06,6e-06
0,0,-1e-06,-1e-06,1e-06,0,2e-06,-8e-06,4e-06,0,1e-06,0,-3e-06,-1e-06,-5e-06,0,4e-06,-1e-06,1e-05,-1e-06,-4e-06,-5e-06,1e-06,8e-06,5e-06,3e-06,0,-5e-06,1.2e-05,-7e-06,-5e-06,0,0,-3e-06,-2e-06,-2e-06,-1e-06,-2e-06,2e-06,0,1e-06,0,2e-06,1e-06,-1e-06,2e-06,0,1e-06,0,-1e-06,1e-06,-1e-06,-7e-06,0,0,0,-1e-06,-2e-06,4e-06,0,-3e-06,3e-06,-7e-06,1e-06,-1e-06,0,1e-06,-5e-06,1e-06,3e-06,-3e-06,-4e-06,1e-06,3e-06,4e-06,-2e-06,4e-06,3e-06,4e-06,1e-06,-3e-06,-2e-06,2e-06,0,-2e-06,-5e-06,-1e-06,0,2e-06,-1e-06,-2e-06,0,2e-06,-1e-06,3e-06,-2e-06,0,-4e-06,1e-06,-5e-06,-1e-06,2e-06,0,0,0,1e-06,-2e-06,1e-06,1e-06,-1e-06,-1e-06,0,-2e-06,-1e-06,1e-06,1e-06,-2e-06,-1e-06,2e-06,2e-06,4e-06
0,0,0,-2e-06,-1e-06,-1e-06,0,-1e-05,-3e-06,-1e-06,2e-06,-1e-06,4e-06,0,1e-06,2e-06,-2e-06,-1e-06,1e-05,-3e-06,0,-4e-06,0,-7e-06,-3e-06,-2e-06,-1e-06,-1e-06,0,-8e-06,2e-06,-1e-06,0,4e-06,-2e-06,-1e-06,-2e-06,-2e-06,0,6e-06,-1e-06,1e-06,2e-06,0,3e-06,1e-06,0,2e-06,0,-3e-06,0,-1e-06,4e-06,-2e-06,2e-06,3e-06,-1e-06,2e-06,-2e-06,-2e-06,3e-06,1e-06,5e-06,2e-06,1e-06,-2e-06,-2e-06,3e-06,0,-4e-06,3e-06,0,0,7e-06,-2e-06,1e-06,-4e-06,-2e-06,0,0,1e-06,1e-06,2e-06,-2e-06,-3e-06,0,-1e-06,0,1e-06,-1e-06,2e-06,-3e-06,2e-06,2e-06,0,-2e-06,-2e-06,-6e-06,0,-2e-06,-2e-06,-4e-06,-1e-06,0,0,-2e-06,-2e-06,0,1e-06,2e-06,4e-06,0,0,-2e-06,0,0,2e-06,1e-06,-2e-06,-2e-06,4e-06
0,-3e-06,1e-06,0,3e-06,0,-1e-06,-6e-06,4e-06,-1e-06,-1e-06,-2e-06,-2e-06,1e-06,4e-06,-1e-06,-1e-06,2e-06,1e-05,-2e-06,3e-06,-5e-06,2e-06,1e-06,0,-1e-06,0,6e-06,0,1e-05,0,2e-06,0,-4e-06,3e-06,-1e-06,5e-06,1e-06,-1e-06,-3e-06,0,-1e-06,-5e-06,1e-06,-4e-06,-3e-06,0,0,0,-4e-06,-1e-06,0,-4e-06,3e-06,-2e-06,1e-06,0,-1e-06,6e-06,-2e-06,0,-1e-06,1e-06,-1e-06,0,-1e-06,1e-06,-4e-06,-1e-06,-9e-06,-2e-06,3e-06,-1e-06,-1.2e-05,2e-06,-1e-06,0,-2e-06,0,-1e-06,2e-06,-4e-06,1e-06,-2e-06,-2e-06,-3e-06,-1e-06,0,0,0,0,-3e-06,3e-06,-1e-06,-1e-06,0,-1e-06,-2e-06,1e-06,-6e-06,4e-06,1e-06,0,-2e-06,0,2e-06,-3e-06,0,-1e-06,-1e-06,-1e-06,-1e-06,1e-06,-1e-06,0,1e-06,4e-06,-2e-06,-1e-06,3e-06,1e-06
0,4e-06,0,-1e-06,-3e-06,-1e-06,-1e-06,-2e-06,-6e-06,-6e-06,-2e-06,0,0,-2e-06,0,0,2e-06,-2e-06,-1e-06,-1e-06,2e-06,-6e-06,2e-06,-2e-06,1e-06,-1e-06,2e-06,6e-06,0,3e-06,-8e-06,-2e-06,0,2e-06,1e-06,-1e-06,4e-06,1e-06,3e-06,-6e-06,-1e-06,0,-1e-06,0,0,1e-06,0,1e-06,0,-3e-06,-3e-06,-1e-06,-5e-06,-2e-06,0,-2e-06,0,-2e-06,-6e-06,-3e-06,-3e-06,8e-06,-5e-06,-2e-06,-1e-06,2e-06,-1e-06,0,1e-06,-6e-06,0,1e-06,1e-06,9e-06,1e-06,2e-06,0,1e-06,-3e-06,0,-3e-06,-2e-06,1e-06,-2e-06,1e-06,-2e-06,0,-1e-06,-1e-06,0,0,1e-06,0,0,-1e-06,-2e-06,0,-5e-06,0,-3e-06,-3e-06,0,0,2e-06,0,-2e-06,-2e-06,0,1e-06,-1e-06,-4e-06,1e-06,-1e-06,3e-06,-1e-06,-2e-06,3e-06,1e-06,0,-4e-06,-2e-06
0,7e-06,0,0,1e-06,0,-1e-06,0,6e-06,1e-06,0,0,1e-06,2e-06,-5e-06,0,-1e-06,1e-06,-1e-06,0,3e-06,-5e-06,1e-06,-6e-06,-2e-06,2e-06,0,4e-06,-3e-06,-9e-06,3e-06,1e-06,-1e-06,-1e-06,-3e-06,-1e-06,1e-06,1e-06,-4e-06,4e-06,0,1e-06,4e-06,0,1e-06,-3e-06,0,-1e-06,0,1e-06,0,0,3e-06,1e-06,-3e-06,-2e-06,0,0,-3e-06,-2e-06,2e-06,-5e-06,4e-06,4e-06,0,1e-06,0,1e-06,-1e-06,0,0,1e-06,0,0,-2e-06,-2e-06,-4e-06,2e-06,-1e-06,0,1e-06,1e-06,0,-1e-06,1e-06,1e-06,0,0,0,-1e-06,-2e-06,1e-06,0,0,-1e-06,-1e-06,0,-7e-06,-1e-06,-4e-06,0,-3e-06,0,-2e-06,0,0,0,-1e-06,0,-1e-06,2e-06,-1e-06,0,0,0,1e-06,1e-06,1e-06,0,4e-06,-3e-06
0,-7e-06,0,-3e-06,2e-06,-1e-06,0,2e-06,-6e-06,-4e-06,1e-06,-1e-06,-3e-06,-3e-06,1e-06,-1e-06,-1e-06,1e-06,-1.3e-05,-2e-06,-4e-06,-4e-06,1e-06,5e-06,2e-06,-6e-06,2e-06,-5e-06,-3e-06,-3e-06,4e-06,-2e-06,0,0,-1e-06,0,-3e-06,0,5e-06,2e-06,0,-1e-06,-1e-06,0,3e-06,-1e-06,0,-1e-06,0,2e-06,2e-06,0,-6e-06,1e-06,-5e-06,1e-06,0,1e-06,4e-06,-1e-06,2e-06,-2e-06,3e-06,-1e-06,1e-06,0,1e-06,-4e-06,-1e-06,5e-06,-1e-06,-1e-06,1e-06,-9e-06,3e-06,1e-06,4e-06,1e-06,0,0,1e-06,-4e-06,-3e-06,0,2e-06,-5e-06,1e-06,0,-1e-06,0,1e-06,-1e-06,-2e-06,-1e-06,1e-06,0,0,-2e-06,0,-5e-06,2e-06,5e-06,0,2e-06,0,3e-06,2e-06,1e-06,-1e-06,1e-06,1e-06,1e-06,1e-06,-2e-06,-1e-06,-1e-06,-2e-06,-1e-06,-1e-06,-3e-06,-4e-06
