0.000178,5e-04,0.000131,0.000484,0.000284,0.000971,0.000805,0.000793,0.000279,0.000322,2.9e-05,0.000351,0.000644,0.000602,0.000173,0.000852,0.000714,0.001064,0.000512,0.000471,0.000171,-0.001865,-0.004089,-0.013368,-0.007633,-0.009603,-0.008621,-0.001347,-0.005976,-0.003204,-0.002407,-0.002799,-0.003244,-0.002942,-0.001501,-0.000996,0.002584,-0.008335,-0.010457,-0.02185,-0.024744,-0.031089,-0.022059,-0.010375,-0.021229,-0.015717,-0.013222,-0.020836,-0.019173,-0.01391,-0.009546,-0.013976,-0.017513,-0.018879,-0.024606,-0.012509,-0.013219,-0.009217,-0.014493,-0.014656,-0.0128,-0.013697,-0.011468,-0.009084,-0.00889,-0.012736,-0.014495,-0.005447,-0.004928,-0.017779,-0.010935,-0.007729,-0.010343,-0.009027,-0.006315,-0.002808,-0.001528,-0.001423,-0.001585,-0.000384,-0.000597,-0.000463,-0.000368,-0.000159,-0.000252,-0.002056,-0.000831,-5e-06,0.000248,0.000244,0.000309,-0.00123,0.000527,0.000783,-0.002968,-0.002983,-0.001503,-0.000754,0.001828,-5.9e-05,-0.000416,-2.8e-05,-0.000124,0.000287,0.000389,-0.003892,-0.001807,-0.000448,-0.000246,-0.000323,-0.000391,-0.000277,-0.001385,-0.004531,-0.003929,-0.001897,-0.00045,-9.3e-05,-0.000404,-0.000224,-0.00039
0.000266,0.000333,0.000191,0.000568,0.000475,0.00078,0.00044,0.00061,0.000373,0.000137,0.000105,0.000189,0.00041,0.000389,9.5e-05,0.000453,0.000346,0.000808,3e-04,0.000147,0.000344,0.001156,0.002465,0.006971,0.00238,0.002599,0.005656,0.00206,0.003372,0.001579,-0.001048,-3.5e-05,0.00091,9.1e-05,0.000356,0.000453,-0.015439,-0.016998,-0.005454,-0.002893,-0.000194,0.002445,-0.000971,0.001882,-0.002966,-0.004445,-0.00289,0.000259,0.004373,-0.00235,-0.002355,0.001559,-0.004581,-0.002605,0.000758,6.7e-05,-0.002883,-0.002489,-0.005285,-0.00299,-0.003324,-0.005196,-0.004633,-0.000663,-0.003306,0.000499,-0.001639,-0.001115,-0.001219,-0.001305,-0.001793,-0.000201,0.005371,0.004499,0.000728,4.6e-05,-0.000618,-0.001356,-0.000463,-0.000644,-0.000213,-0.000615,-7.2e-05,-0.000187,-0.000244,0.000739,0.000895,0.00073,1e-05,-0.000179,-1e-05,-0.001797,-0.003407,-0.001199,-0.00116,0.001151,7e-04,0.000425,0.000508,0.001157,0.001072,0.000798,0.000602,0.000254,-0.000493,0.001399,0.000888,0.00014,-9e-06,-8.6e-05,-3.1e-05,0.000119,0.000588,0.001279,0.001733,0.000729,2.3e-05,4e-06,0.000193,0.000268,9.9e-05
6.9e-05,0.000143,6.2e-05,0.000189,0.000161,0.000422,0.000127,0.000474,0.000386,0.000235,9.4e-05,9.8e-05,-0.00021,0.000158,0.000172,0.000191,0.000408,0.000681,0.000352,0.000283,0.000104,0.000716,-0.000473,-0.003243,-0.00211,-0.000175,-0.003286,-0.000206,-0.000974,-0.00035,-0.001013,-0.000254,0.000146,0.000904,0.000158,0.001355,-0.001743,0.001531,-0.004024,-0.002132,-0.003529,-0.011006,-0.000334,-0.012271,-0.004683,0.000961,-0.003855,0.000487,-0.006129,-0.000483,-0.00312,-0.004496,-0.002521,-0.003264,-0.00461,-0.004264,-0.002783,-0.00224,-0.002631,0.000131,0.003246,0.002337,0.000726,-0.002309,-0.000855,0.001319,0.002731,0.001261,0.000383,0.003194,0.005218,-0.000569,-0.00256,-0.003003,-0.002466,-0.000454,-7.7e-05,0.000116,-3e-06,-0.00109,-0.000725,-0.000123,-0.000166,-6e-05,-0.000513,-0.000481,-0.000255,-0.000324,0.000278,0.000313,0.000104,-5.1e-05,0.000475,0.000361,-0.000343,-0.001295,-0.000701,-0.001211,-0.001685,-0.000857,-4.6e-05,-0.000344,-6.7e-05,-1e-05,0.000114,0.000619,0.00069,0.000476,5.6e-05,1.3e-05,-0.000113,-0.000126,4.9e-05,-0.000411,0.00022,0.000248,2.7e-05,-0.000119,-0.000109,-4.5e-05,-1.8e-05
-4.3e-05,8e-05,2.6e-05,0.00023,1.3e-05,0.000191,5e-06,0.000219,2.1e-05,-0.000228,-6.4e-05,9.8e-05,-0.000226,9.7e-05,1.4e-05,-8e-06,-0.000109,-2.7e-05,2.7e-05,-0.000132,7.9e-05,-0.000353,-0.001181,-0.000432,0.001708,0.000122,0.00274,0.001917,-0.001136,-0.000277,0.000244,-0.000419,-0.000344,-9.6e-05,8.5e-05,-0.000427,-0.000344,0.000488,-0.004232,-0.003128,-0.003343,0.009956,-0.002041,-0.004843,0.001631,0.002984,0.003569,0.002092,0.000767,0.005413,7.7e-05,0.002312,0.00531,0.008462,0.00248,0.001129,0.002594,0.004029,0.000105,0.000351,-0.002785,0.00188,0.001302,0.004918,-0.002257,0.002305,0.000773,-0.000915,0.001873,0.000408,0.000689,0.000573,0.000462,0.001256,0.002668,0.000768,-0.000141,-0.001123,-0.000662,0.00061,0.00039,0.000129,0.000166,7.1e-05,0.000581,2.1e-05,9.6e-05,-0.000184,0.000222,-0.000266,-2.8e-05,0.000163,-0.000882,-0.000322,-0.000602,-0.00065,0.000373,-0.001237,-0.001474,-0.000698,-0.000579,-0.000388,0.000256,0.000219,-9.3e-05,0.000121,1e-05,-0.000119,3.2e-05,0.000208,-0.000194,-0.000208,-0.000311,0.000493,-0.000473,-0.000493,-0.00016,-0.000132,-8e-05,-0.000256,6e-06
-5.2e-05,-6.2e-05,-0.000174,-5.1e-05,-0.000177,-0.000117,3.6e-05,0.000248,0.000196,-8.7e-05,0.000152,0.000102,-0.000203,0.000128,6e-05,8.2e-05,-4e-06,8.6e-05,2e-05,-1.5e-05,0.000187,-0.000506,0.001681,0.000447,-0.000519,-0.000829,-0.001577,-0.000677,-0.000516,-0.000445,-0.001081,-0.000707,-4.7e-05,9e-05,-0.000446,0.000637,-0.00083,-0.002545,-0.001676,0.001918,0.001008,0.000411,-0.000792,0.005118,0.000128,-0.000341,0.000574,-0.000364,5e-06,-0.000233,-0.000166,-5.3e-05,-0.000264,-0.006623,-0.001932,-0.006192,-3.2e-05,-0.003709,-0.000206,0.001782,-0.001694,-0.002325,-0.000157,-0.003162,0.001117,-0.006314,-0.003892,-0.001414,-1.1e-05,0.000317,-0.001596,-0.000735,0.001459,-0.002754,-0.00091,0.000239,0.000522,0.000713,0.00052,-7e-05,-0.00041,6.2e-05,0.000442,0.000246,-6.1e-05,-0.000606,2e-04,-0.000169,-2e-06,0.000243,-4.2e-05,0.000213,0.000125,0.000255,-0.00036,4e-04,0.000244,0.000412,0.000463,-0.000382,0.000332,-0.000158,-0.000164,-0.000134,-0.000182,-0.000248,-0.00018,-0.000287,-2e-05,-3.7e-05,2e-06,0.000167,8.7e-05,-0.000109,9.3e-05,0.000187,4.1e-05,0.000136,-0.00012,9.7e-05,8e-05
-0.000123,-1e-05,-5.8e-05,0.000133,6.2e-05,0.000136,-0.000103,-2.9e-05,-3.7e-05,6e-06,-3.1e-05,7.6e-05,4e-06,5.1e-05,8.8e-05,0.000113,-0.000144,-0.000231,-5.6e-05,0.000114,0.000217,-0.000189,-0.001044,0.000146,-0.001013,0.000799,0.000537,0.000598,-0.000471,6.4e-05,0.000244,5.8e-05,0.000198,0.000715,-0.000697,0.000172,-0.000642,0.005405,0.004326,0.001827,0.004596,-5e-04,-0.001517,-0.0065,-0.00242,-0.00157,-0.000267,0.002348,0.001998,0.000941,-0.001162,0.001643,0.001327,0.00509,0.002583,0.004439,0.003589,0.003199,-0.000946,-0.000678,0.004488,0.002549,-0.002192,0.001013,0.000463,0.006194,0.002847,-0.000538,-0.000698,-0.000985,-0.001999,-0.002018,0.000152,0.000979,-0.000165,-4.1e-05,-1.8e-05,0.001109,0.000434,0.000247,9e-04,0.000265,0.000348,1.8e-05,0.00049,-0.000336,-9.9e-05,-9.8e-05,0.000256,-6.1e-05,-4.9e-05,0.000225,-0.000495,-8.6e-05,-0.000185,0.000716,0.000342,0.000217,-0.000336,-0.000264,-0.000422,-0.000143,6.9e-05,-0.000104,-0.000265,0.000207,-0.00014,-8.5e-05,-0.000109,0.000273,0.000125,9.8e-05,-3e-05,0.000434,0.000195,0.000224,0.000102,1e-06,1.8e-05,-4.5e-05,-0.000102
-0.000185,-0.000107,-0.000223,-7.5e-05,-0.000168,-0.000162,-0.000195,-0.000146,-4.2e-05,-0.000131,1.3e-05,-0.000109,-0.000126,-0.000241,-5.4e-05,-8.6e-05,-0.000108,-0.000251,-0.000134,-7e-06,3e-05,5e-06,0.000735,-0.000448,-8.9e-05,-0.0011,-0.000628,-0.000247,0.000229,0.000253,0.000102,-0.000698,-0.000215,-0.000816,0.000679,-0.000119,0.000276,-0.004284,-0.00212,-0.003127,-0.007527,-0.002081,0.003566,0.002589,-0.001166,0.002999,0.000719,-0.00124,-0.001763,-0.002954,-0.002089,-0.00141,-0.001921,-0.001086,-0.001912,0.000859,-0.003487,-0.000467,0.001377,-0.001586,-0.001115,-0.001694,0.001523,0.000292,0.000546,-0.002251,-0.002612,0.001133,0.00071,0.00174,0.002996,0.001293,-0.000771,0.000299,-0.000301,-5e-04,-0.000448,-0.000296,-0.000431,-0.000727,-0.000182,-0.000302,-0.000297,5.4e-05,0.000348,-3.1e-05,8.8e-05,-0.000336,-0.000212,-0.000308,-0.000367,-0.000198,-0.000497,-0.000891,7.9e-05,0.000188,-0.000543,-0.000364,-0.001022,-0.000842,-0.000386,0.000161,-0.000224,-0.000115,-0.000259,-0.000116,-0.000189,-9.1e-05,-0.000202,-0.000133,-0.00011,-0.00022,-6.7e-05,-0.000128,-0.000299,-0.000496,-0.000228,-0.000111,-6.1e-05,-5e-05,-2.7e-05
-3.1e-05,-8.2e-05,-6.4e-05,8e-05,6.1e-05,-7.7e-05,-2e-04,-0.000245,-5e-05,-0.000112,5.1e-05,0.000101,-6e-05,-0.000137,-0.00015,5e-06,-5e-06,-0.000109,3.8e-05,-3.6e-05,7.4e-05,1.2e-05,-0.001818,0.000852,0.00185,0.000602,0.00042,-0.000453,-0.000772,-0.002097,-4e-06,0.000577,0.000206,0.000446,-0.000481,0.000166,-0.000659,0.00044,-0.001898,-0.002311,0.00569,0.000349,0.000143,-0.003484,-0.001131,-0.000659,0.000488,0.000194,0.000451,0.003513,-0.001239,3.6e-05,0.000334,0.000532,-0.000315,0.000544,0.002404,-0.000327,0.0037,0.004273,0.000462,0.000173,-0.001335,-0.001617,0.000354,-0.000475,0.001729,6.9e-05,-0.001394,-0.001366,-0.00169,-0.002172,0.000127,0.000159,0.000885,-0.000273,6.2e-05,-0.00025,0.000389,1.5e-05,-0.000403,-0.000225,-0.000185,-3.3e-05,9e-06,0.000257,0,-0.000227,-0.000107,-0.000128,-0.000213,-0.000206,-6e-06,-0.000396,-0.000429,-1.5e-05,-0.000287,-0.000316,-0.000217,0.00021,-0.000146,-0.000363,-0.000151,-0.00028,-9.7e-05,-0.000166,-0.000424,-0.000298,8.2e-05,-5.6e-05,-0.000142,-0.00013,0.000132,-4e-06,-4.7e-05,0.000158,-7e-06,-5.7e-05,2e-05,5.5e-05,5e-05
-6.4e-05,-0.000129,-4.4e-05,-4.2e-05,-5.1e-05,-0.000162,-0.000169,-0.000186,-0.000112,-0.000108,-2e-05,-1.4e-05,-5.5e-05,-5.4e-05,-0.000145,-1.2e-05,-4.2e-05,-0.000202,-8.2e-05,-0.000113,-5e-05,-0.000131,0.00052,-0.000791,-0.001341,-0.000511,-0.000885,0.000214,0.000404,0.000974,0.000155,9.9e-05,0.001019,0.000299,7.8e-05,0.000172,-0.000229,-6.5e-05,-0.000563,0.00226,0.001236,0.001741,-0.000649,0.002619,0.004072,-0.000161,0.001226,-0.00054,-0.002719,-0.001622,0.002129,-0.001056,-0.001575,-0.001807,-0.003255,-0.001518,-0.002769,-0.000934,-0.000329,-0.00506,-0.002574,-0.000201,-0.000118,-0.000935,-0.000484,-0.001334,0.000716,-0.001149,0.000115,0.000201,-0.000136,0.001999,-0.000661,0.000222,-0.001563,0.000274,8.2e-05,0.00045,-0.000231,-4.9e-05,-0.000207,-8e-06,8.8e-05,-0.000413,-0.000186,8.3e-05,-0.000198,-0.000107,-8.6e-05,-0.000128,9.5e-05,0.000107,0.000125,0.000317,-1.7e-05,-0.000128,0.00015,7.7e-05,-6.1e-05,-0.000143,-0.000215,-0.000218,3e-06,5.4e-05,-6.4e-05,-5.4e-05,0.000105,-5.6e-05,-9.7e-05,7.1e-05,4.8e-05,1.4e-05,-0.000124,3.4e-05,-0.000124,-9e-06,5e-05,-5.1e-05,3.3e-05,-6e-06,2.1e-05
6e-06,-2.9e-05,-5.5e-05,-0.000109,-4.1e-05,-0.000125,1.2e-05,-0.000138,-3.1e-05,-6.5e-05,9e-05,6.6e-05,-3.4e-05,0,-5.9e-05,-2.2e-05,5.3e-05,-0.000102,3.1e-05,-0.000118,-7.7e-05,-9.7e-05,0.000146,0.000249,0.000436,0.000499,0.00021,0.00028,-0.000394,-0.000826,-4.2e-05,-7.4e-05,-0.001067,-0.000393,-0.000233,-0.000391,0,-1.1e-05,-0.003941,-0.002578,0.001787,0.002098,-0.000844,-0.000863,0.000177,-0.00268,-0.00285,6.2e-05,0.004351,0.00014,-0.001364,-0.001875,-0.000236,0.000948,0.00548,0.001382,0.000247,0.000351,-0.001191,0.001706,0.000739,0.00087,0.001739,-0.000106,-0.000231,-0.001452,-0.00214,0.001087,0.000402,-0.00105,0.000947,0.000135,0.000494,-2e-06,0.001053,-5.2e-05,-0.000142,-4.8e-05,9e-06,-9.4e-05,0.000124,-3.5e-05,-0.000142,-0.000429,0.000168,-0.000234,-0.000136,5e-06,-0.000137,-0.000104,7.5e-05,-0.000135,0.000123,0.000197,0.000273,-1.5e-05,-0.000487,0.000131,7.5e-05,0.000237,3.2e-05,-3.5e-05,-0.00013,-0.000225,-0.000165,-0.000103,-0.000209,-0.000237,-0.000135,2.8e-05,6.5e-05,-9.5e-05,-2.1e-05,-2.3e-05,0.00016,-0.000117,-9.2e-05,5.5e-05,-3.2e-05,5e-05,3e-05
-1.9e-05,-1.4e-05,-4e-06,-9.7e-05,-2.3e-05,-5.5e-05,-3.5e-05,-4e-05,-6.2e-05,-2.5e-05,1.2e-05,-2.2e-05,-1.4e-05,5e-05,-3.3e-05,-8e-06,-3.9e-05,-8.6e-05,2.3e-05,-0.000118,3.3e-05,-6.2e-05,0.000217,-0.000124,0.000256,0.00025,9.8e-05,-0.000207,0.000297,0.000192,0.000342,-1e-05,0.000211,-4.5e-05,0.000113,-0.000296,-0.000116,-0.000191,0.00508,0.001409,-0.001756,-0.003397,-2.7e-05,0.001018,-0.000719,-0.000855,0.002323,0.001147,-0.001058,-0.000774,0.001263,0.000278,0.00037,0.000564,-0.002804,-0.00027,-0.002651,2e-04,-0.000187,0.00013,0.000581,0.000153,-0.00075,0.000739,-0.000482,0.001309,0.001505,6e-05,0.000336,0.00016,-0.000439,-1.3e-05,-0.000849,0.000536,-7.4e-05,-0.000187,-0.000107,0.000235,0.000143,0.000327,-0.000218,0.000158,5.9e-05,3.9e-05,-0.00011,-2.4e-05,-4e-05,4.3e-05,2.4e-05,-6e-05,0.000132,8.8e-05,9.6e-05,2.9e-05,0.000241,-8.6e-05,0.000736,0.000164,-5e-05,-9.7e-05,-0.000132,-0.000278,5e-05,-2.1e-05,5.2e-05,4e-05,0.000115,-3.6e-05,9e-05,0.00011,-5e-05,3.8e-05,9.1e-05,-0.000133,-5e-05,0.000126,3.8e-05,8e-06,-1.1e-05,3.6e-05,4e-06
-9e-06,1.4e-05,-7e-06,-6.9e-05,1.2e-05,-2.8e-05,-4.3e-05,-5.6e-05,-1e-05,-4.8e-05,-3.2e-05,-3e-06,-2.3e-05,4e-06,-5.9e-05,-5.5e-05,-5.3e-05,-1.3e-05,-5.2e-05,-0.000126,-3.3e-05,-2.8e-05,-0.000131,0.000104,-0.000273,-5e-06,-0.00016,-0.00038,-0.000204,0.00031,-0.000265,3.9e-05,-0.000196,-1.1e-05,-0.000178,6.9e-05,-0.000356,5e-06,0.003334,0.000191,-0.000286,0.001447,0.00152,0.001299,0.00011,0.001197,0.000907,-0.00111,0.000136,0.000887,-0.000705,-3.9e-05,0.00061,-0.000334,-7.8e-05,6.3e-05,0.00184,0.001497,0.000918,0.000608,-0.000419,-0.000346,0.000388,-0.000352,0.00129,0.001288,-0.000242,0.00062,-0.000101,0.000465,-6.1e-05,-0.001225,9e-04,-0.000563,-0.000415,0.000353,-0.000387,-0.000485,0.000205,-3.4e-05,-0.000108,0.000123,0,5e-06,4.4e-05,-0.000211,3e-05,-0.000261,-4.2e-05,2e-05,9e-06,-6.7e-05,2.1e-05,5e-05,0.000295,-6.6e-05,-0.000202,0.000239,-2.3e-05,-0.000129,-0.000207,-4.6e-05,-6e-05,-3.4e-05,-7.3e-05,-1.2e-05,-6.4e-05,0.000105,-5.6e-05,1e-05,3.7e-05,-2.5e-05,-7.3e-05,-3.4e-05,8.4e-05,-7.8e-05,-3.2e-05,-7.6e-05,5e-06,1.5e-05,9e-06
-1.8e-05,9e-06,-3e-06,-2.3e-05,-3.5e-05,-4.3e-05,-2.7e-05,-4e-05,1.1e-05,-4.7e-05,3e-06,7.8e-05,-3.2e-05,9e-06,-3.8e-05,-7.9e-05,2.6e-05,-2e-05,3e-05,-8.6e-05,-8e-06,-8.2e-05,0.000269,-0.000124,3e-05,-0.000727,-7.4e-05,-0.000113,-0.000109,-5.6e-05,0.000978,-1.7e-05,0.000197,0.000123,-1e-04,7.3e-05,2.4e-05,-1e-05,-0.002662,0.000397,-0.001416,-0.000393,-0.000882,0.00102,0.000676,0.000959,-0.001074,-0.000783,7.5e-05,-0.00012,0.002478,4.7e-05,6.2e-05,-2e-05,0.000572,0.001136,0.000966,-0.001706,0.000128,-0.000297,-0.001095,0.000106,-9.8e-05,-8e-05,-0.000991,-0.000105,-2e-06,-0.00119,-0.00051,-0.000274,-0.000225,0.000836,-0.000861,0.000349,0.000644,-0.000416,0.000114,0.000214,-0.000194,3.7e-05,-2.8e-05,-0.000328,3e-05,4.9e-05,-5.3e-05,-7.2e-05,1.5e-05,-3e-06,-6.5e-05,-4e-05,-6.8e-05,-3.1e-05,-3e-06,6.1e-05,-2.5e-05,-0.000121,-0.000179,-0.000206,-1.8e-05,0.000126,0.000104,-0.000126,-5.7e-05,6.7e-05,6.9e-05,-5.1e-05,3e-05,-0.000104,-2.2e-05,9e-06,-6.1e-05,1.5e-05,3.2e-05,-3e-05,-2.7e-05,3.9e-05,2.1e-05,4.1e-05,2.9e-05,-3.5e-05,-5e-05
-1.3e-05,3.3e-05,-1.9e-05,9e-06,-2.8e-05,1.2e-05,1.5e-05,-4.3e-05,2.5e-05,-3e-06,-1.8e-05,9e-06,-9e-06,-2.3e-05,2e-06,-5e-05,-8e-06,-1.1e-05,-1.3e-05,-4.4e-05,-2.2e-05,-3.9e-05,-8.1e-05,-0.000151,0.00013,0.000771,0.000132,-4.1e-05,0.000133,0.000118,-0.000654,-5.8e-05,-0.000366,6.1e-05,2.4e-05,-9.7e-05,-5e-06,-1.2e-05,0.000818,-1.4e-05,-0.000888,-0.001614,0.000162,-0.002479,0.001014,0.001027,0.001204,0.000326,0.000856,-0.000602,-0.001348,0.000101,-0.000542,-7.1e-05,-0.000555,-0.001102,-0.000557,-0.000202,0.000234,-0.000415,0.000594,-0.000212,-0.000604,3.1e-05,-2.5e-05,-8.5e-05,-0.000512,0.000641,0.000698,0.000163,0.000193,-9.5e-05,0.000786,-0.00053,-0.000133,0.000326,0.000166,-6.2e-05,3.2e-05,-6.5e-05,0.000116,-0.000145,-0.000107,3.3e-05,-0.000131,4e-06,2.6e-05,-1.5e-05,1.4e-05,3.4e-05,0,6.1e-05,-2.6e-05,-6e-06,-0.000742,-0.000121,3.2e-05,1.6e-05,3.1e-05,6.9e-05,5e-06,-4.5e-05,2e-05,5.2e-05,2.4e-05,2.6e-05,-2e-05,9e-05,5.3e-05,5.5e-05,-2.3e-05,-9e-06,-4.2e-05,-1e-05,5.3e-05,-7.4e-05,4.7e-05,3.2e-05,1.5e-05,-7e-06,9e-06
6e-06,2.8e-05,3e-06,7e-06,1.8e-05,-1.7e-05,-6e-06,-5e-06,5e-06,-3e-06,-2e-05,6e-05,-5e-06,-2.3e-05,3.6e-05,-1.8e-05,2e-06,-9e-06,-1e-06,-6e-06,-3e-06,-4e-06,7.7e-05,-4e-06,-0.00011,-0.000739,9e-06,0.000124,-8.3e-05,1e-06,0.00011,3e-05,0.00018,2.2e-05,0.000102,0.000141,-0.000102,-9.7e-05,0.000633,-0.00064,0.000234,0.000727,-0.000701,0.001467,-0.001023,-0.00028,-0.000736,-0.000249,-0.000711,0.000475,0.000376,0.000157,0.000332,0.000145,0.000428,-0.000358,0.000436,-0.000344,-0.00062,0.000303,0.000207,-0.000434,0.000404,0.000789,3e-05,0.000163,-0.000437,-0.000295,-0.000589,1.4e-05,-0.000102,8e-06,5.9e-05,0.000347,6.2e-05,-0.000231,0,-1.4e-05,-2.6e-05,-0.000141,0.000104,1.9e-05,7.3e-05,-5e-05,-1.4e-05,2.9e-05,-9e-06,3e-06,5.1e-05,-5.2e-05,4.9e-05,6e-06,-1.7e-05,-2.2e-05,0.000507,7e-06,-0.000173,-8.7e-05,4.1e-05,-0.00012,5.3e-05,-3e-06,-5.1e-05,2.8e-05,-1.1e-05,-2.2e-05,9e-06,8.5e-05,-3.8e-05,-6.4e-05,1.4e-05,1e-05,1.2e-05,6.4e-05,-4.5e-05,4e-05,-7.3e-05,-4.7e-05,-2.3e-05,2e-06,-1e-06
-4e-06,8e-06,1.4e-05,3e-06,1.2e-05,-5e-06,1.2e-05,2e-06,1e-06,-1e-05,-2e-06,1.1e-05,-9e-06,-2e-06,2e-05,-9e-06,-9e-06,-3.2e-05,-4e-06,6e-06,-1.8e-05,-1.2e-05,-0.000204,-6e-06,1.4e-05,-5e-06,1.9e-05,-0.000155,2e-06,-0.000133,0.000124,2.6e-05,-9.6e-05,-3.9e-05,-8.6e-05,2e-06,9.9e-05,-5.5e-05,0.000286,0.000569,0.000113,-0.000885,0.000552,0.000435,0.001156,-0.000254,0.000207,-0.000156,0.000661,6e-06,-0.000241,-0.000306,6.6e-05,-0.000217,-0.000619,0.000326,0.000399,3e-04,-0.000189,-0.000175,2.5e-05,0.000286,-0.000113,-0.000494,0.000111,-0.000217,0.000466,0.000307,0.000177,-9.9e-05,-3.4e-05,0.000321,1.2e-05,-0.000223,-1.6e-05,0.000211,-0.000154,-0.000102,3.3e-05,4.1e-05,-7.3e-05,-1e-05,-5e-05,6e-06,-8.8e-05,-4.5e-05,-9e-06,-3.1e-05,-1.9e-05,4.1e-05,4.9e-05,3.9e-05,9e-06,4.6e-05,8.9e-05,2.3e-05,7.9e-05,9.1e-05,0,1e-04,-2.5e-05,0.000119,5e-06,-2.1e-05,2.9e-05,2.6e-05,-3.3e-05,-9.1e-05,9e-06,-3.2e-05,1e-06,-4e-06,1.7e-05,5e-06,1.1e-05,-1.2e-05,3.2e-05,3.5e-05,-8e-06,9e-06,-1.4e-05
-2e-06,-8e-06,-1.8e-05,7e-06,4e-06,-5e-06,-1.2e-05,-1.7e-05,-5e-06,-1.4e-05,-9e-06,-1.9e-05,-1.9e-05,-5e-06,-5e-06,-1.3e-05,2e-06,-1.8e-05,-2e-06,1e-05,-8e-06,0,0.000111,1.8e-05,6.4e-05,0.000259,-0.000108,2.9e-05,-4.3e-05,5.2e-05,-0.000104,-9e-06,4e-06,5e-06,2.4e-05,-2e-06,-5.5e-05,0.000121,-0.001206,0.000525,-0.000297,-6e-06,0.000447,-5.1e-05,-0.00046,8.6e-05,-0.00052,-3.9e-05,-0.00073,-0.000147,0.000126,0.000575,0.000488,0.000132,0.00022,-0.000288,0.000247,0.000595,9e-05,0.000584,-0.000207,8.7e-05,-0.000118,0.000335,-9.7e-05,6.5e-05,-0.000187,-0.000374,0.000138,3.2e-05,7e-06,0.000206,-0.000208,2.2e-05,-0.000152,-2.2e-05,6.4e-05,-4.5e-05,-0.000109,5e-06,7.6e-05,-4e-05,2.5e-05,3.4e-05,8e-06,-1.5e-05,-2.2e-05,1.6e-05,-4e-06,-2.9e-05,3.5e-05,1e-06,1.5e-05,6e-06,-0.000189,4.2e-05,7.5e-05,4.9e-05,6e-06,-5.3e-05,-4.2e-05,3.2e-05,1.2e-05,-1.2e-05,1.5e-05,-1.4e-05,1e-05,-3.5e-05,-1.8e-05,-1.8e-05,-1.5e-05,-6e-06,1e-06,1.3e-05,-2.2e-05,9e-06,-1.2e-05,6e-06,1.3e-05,0,4e-06
-7e-06,-7e-06,-1e-06,2e-06,-6e-06,-8e-06,1e-05,-8e-06,-1.4e-05,-1.3e-05,-1.1e-05,-1e-05,-3e-06,1.2e-05,-8e-06,-3e-06,-3e-06,2e-06,-2e-06,2e-06,3e-06,-1.4e-05,4.6e-05,-2e-06,-3.2e-05,-6.2e-05,2.9e-05,6.4e-05,-7e-06,-0.000156,0.000111,-1.7e-05,4.2e-05,-5.8e-05,-1.5e-05,-2.5e-05,-3e-06,-0.000135,0.000275,-0.000826,-1.7e-05,0.001395,-0.00041,-9.1e-05,-0.000725,0.000104,-0.000147,0.000125,0.000277,0.000387,0.000115,-0.000289,0.000253,-0.000208,0.000444,8.6e-05,-0.000615,-0.000573,0.000352,-0.000272,-9.8e-05,-4.3e-05,0.000204,-0.000111,-7e-05,-0.000178,0.000516,0.000278,-8.7e-05,-0.000134,-2.7e-05,-0.00037,0.000161,-9.7e-05,-1.6e-05,-0.000115,2.2e-05,4e-05,1e-05,3.4e-05,4e-06,2.5e-05,-1.8e-05,-1e-05,0,-2.9e-05,-2.3e-05,-1.5e-05,-1.6e-05,-5e-06,1.2e-05,3e-06,5e-06,6e-06,3.4e-05,4.3e-05,-7e-06,-4.5e-05,-7e-06,2.5e-05,-1.3e-05,-1.6e-05,-2.6e-05,-3.1e-05,8e-06,-9e-06,1.5e-05,1.8e-05,-4e-06,-1.3e-05,7e-06,4e-06,-1.4e-05,1e-05,1.9e-05,-1.7e-05,1.4e-05,-6e-06,1e-06,-9e-06,0
-4e-06,-1e-06,-4e-06,2e-06,-1e-06,-7e-06,-5e-06,-4e-06,-3e-06,-6e-06,5e-06,-2e-06,-4e-06,8e-06,-1.5e-05,4e-06,6e-06,3e-06,1e-06,-5e-06,-3e-06,-1.1e-05,2.2e-05,1e-06,2.8e-05,0.000114,-3.4e-05,1.7e-05,-4.5e-05,0.000133,-8.7e-05,8e-06,9.2e-05,-7e-06,-6.3e-05,1.1e-05,-1e-06,0.000152,0.000513,-1.1e-05,0.000791,-0.000435,-0.000371,0.000452,0.000589,-3e-05,-0.000304,0.000157,7.1e-05,0.000169,0.000255,-0.000215,0.000102,-4.1e-05,-0.000325,-0.000162,6.8e-05,8.8e-05,-0.000224,-5.8e-05,0.000101,-7.8e-05,-5.7e-05,1e-04,4.2e-05,-2.2e-05,-0.000266,-0.000124,0.000192,-5.3e-05,0.000141,6e-05,-0.000182,-5e-05,-2e-06,0.000118,-9.9e-05,-6.5e-05,1.6e-05,-3.7e-05,-5.1e-05,3.6e-05,2e-05,-2.8e-05,1e-06,-4.9e-05,-1.4e-05,-9e-06,-5e-06,-1.4e-05,-2.9e-05,-1.2e-05,3e-06,5e-06,3.6e-05,3.4e-05,5.6e-05,3.8e-05,1.3e-05,-2.3e-05,-1e-06,-2.3e-05,7e-06,1.5e-05,0,6e-06,-1.4e-05,-1.7e-05,-1.2e-05,-1e-05,-3e-06,-1.3e-05,-1.1e-05,4e-06,1e-06,2.2e-05,-4e-06,-3e-06,-1e-06,-4e-06,-5e-06
-4e-06,6e-06,-4e-06,-3e-06,-1e-06,-5e-06,-1.1e-05,-1.2e-05,1e-06,-1.1e-05,-6e-06,-6e-06,-7e-06,5e-06,-2.1e-05,0,-1e-06,-1.5e-05,2e-06,-1.1e-05,8e-06,1e-06,2e-06,-2.2e-05,-2.9e-05,-0.000107,1e-05,-2.8e-05,3.1e-05,4.4e-05,-2e-06,2e-06,1e-06,-1.2e-05,5.5e-05,-8e-06,9e-06,-5.3e-05,0.000116,0.000371,-0.000467,0.000283,0.000314,-0.000282,-0.000567,-0.000205,-5.1e-05,3.6e-05,-0.000176,6.3e-05,-0.00018,-0.000208,0.000149,0.000136,-0.000204,7.6e-05,-9.9e-05,-6.2e-05,-0.000264,6.1e-05,0.000268,0.000159,-4.5e-05,-0.000154,-1e-04,0.00015,-1.9e-05,0.00026,-1e-05,6.4e-05,-3.9e-05,1.8e-05,3e-06,0.000108,4.6e-05,-0.000101,5.3e-05,-3.4e-05,3e-06,5.6e-05,-5.1e-05,6e-06,-2.4e-05,-2.7e-05,3.1e-05,-2e-06,-3e-06,-3.6e-05,-1.1e-05,8e-06,-7e-06,-4e-06,-8e-06,1.4e-05,2.4e-05,2.5e-05,-3e-06,3e-06,-3e-06,1.6e-05,-2.5e-05,-6e-06,-5e-06,-4e-06,1e-06,-1.1e-05,2e-06,9e-06,1.1e-05,2e-06,-3e-06,1e-06,5e-06,3e-06,6e-06,-1.1e-05,-3e-06,8e-06,-1e-06,-1e-06,0
-1e-06,4e-06,0,-8e-06,0,1e-06,-1e-06,-7e-06,5e-06,-1e-05,0,1e-06,-5e-06,-8e-06,-1.8e-05,-2e-06,0,-1e-06,-3e-06,-1.8e-05,4e-06,0,2.5e-05,-9e-06,2.9e-05,2.9e-05,4.4e-05,-9e-06,-6e-05,4.5e-05,5.1e-05,8e-06,-3.3e-05,3e-06,6e-06,-0.000109,-1.6e-05,1.8e-05,0.00081,-5.8e-05,0.000901,0.000247,0.000155,0.000193,0.000552,-4.8e-05,0.000161,4.4e-05,0.000104,-0.000318,0.000217,-1.3e-05,4.3e-05,-0.000163,0.000378,0.000174,-8.6e-05,2.1e-05,-0.000109,-0.000136,-0.000113,-9.5e-05,0.00011,-0.000155,1.4e-05,-0.000101,-0.000105,-0.00012,-6.1e-05,1e-06,-2e-05,5.4e-05,4.6e-05,-0.000107,4.2e-05,3e-06,-3e-06,3.1e-05,-1.1e-05,-2.4e-05,-2.4e-05,-3.9e-05,8e-06,5e-06,-7e-06,3e-06,8e-06,-2e-06,-3e-06,-5e-06,7e-06,2e-06,-1e-06,-2e-06,-2.5e-05,1.3e-05,-3.8e-05,7e-06,9e-06,6e-06,6e-06,-6e-06,-1.3e-05,1e-05,5e-06,1.5e-05,1e-05,-1e-05,-1.1e-05,7e-06,-1e-06,3e-06,-3e-06,-6e-06,3e-06,-9e-06,-1e-06,-2e-06,-2e-06,1e-06,-2e-06
1e-06,0,-1e-06,-6e-06,4e-06,-2e-06,6e-06,-3e-06,-1e-06,-4e-06,8e-06,5e-06,-3e-06,-6e-06,-2e-06,1e-06,-2e-06,-1e-06,1e-06,-1.7e-05,4e-06,-3e-06,-1.7e-05,7e-06,-1.8e-05,-5e-05,2e-06,-1.8e-05,2e-05,2.2e-05,-6.5e-05,-1.5e-05,2.4e-05,-1e-05,-3.8e-05,5.3e-05,-1e-06,-7e-06,-0.000534,-0.000183,-1.6e-05,-0.000393,3.7e-05,-0.000183,-0.000543,9.7e-05,0.000207,5.3e-05,-3.1e-05,0.000157,-0.000274,6e-06,1.6e-05,3e-05,-0.000218,-0.000239,0.000152,9.9e-05,3.8e-05,5e-06,-2.6e-05,-9.8e-05,-0.000134,0.000286,2.4e-05,0.000176,0.000101,-6.4e-05,3.5e-05,6.4e-05,9e-06,-0.000121,-1e-06,9.6e-05,1.8e-05,2.3e-05,-5e-06,4e-05,1.5e-05,-2.3e-05,4.4e-05,-1.4e-05,1.2e-05,0,2.4e-05,-6e-06,1.6e-05,-9e-06,2e-06,1e-06,8e-06,-1e-06,4e-06,-1.2e-05,-5.3e-05,-1e-06,-5.7e-05,-3.1e-05,1e-05,-1.9e-05,2.4e-05,-1.5e-05,7e-06,2e-06,0,-1.1e-05,-1.7e-05,3e-06,0,-1e-06,-4e-06,-4e-06,5e-06,-6e-06,-3e-06,0,6e-06,4e-06,0,-2e-06,5e-06
-2e-06,6e-06,-1e-06,-2e-06,-4e-06,-1e-06,-4e-06,-1e-06,5e-06,-4e-06,-1e-06,-5e-06,0,-3e-06,1.1e-05,0,-3e-06,-5e-06,-1e-06,-1.4e-05,-1e-06,-4e-06,-1.7e-05,-1e-06,-2e-06,-1.8e-05,2e-05,2.5e-05,-3.5e-05,-4.4e-05,1.7e-05,-1.5e-05,1.7e-05,1e-05,5e-06,1.5e-05,7e-06,-2.9e-05,-0.000784,2.2e-05,0.000191,0.000483,-8.6e-05,0.000278,7.3e-05,0.000274,-0.000681,2.5e-05,4.3e-05,-0.000101,0.000487,-0.000112,-2.3e-05,1.1e-05,3.4e-05,9e-06,-0.000131,-8.7e-05,-2.2e-05,-9.5e-05,-4.2e-05,-3.6e-05,-5.6e-05,-9.8e-05,4.1e-05,1.1e-05,7.4e-05,2.9e-05,-6.6e-05,4e-05,5.6e-05,0.000312,5.3e-05,-6.6e-05,-8e-06,3.4e-05,-2e-05,9e-06,1.1e-05,2e-05,-2.4e-05,-1.6e-05,-2.3e-05,2e-06,9e-06,-9e-06,9e-06,-1.2e-05,2e-06,-1e-06,1.5e-05,4e-06,-3e-06,6e-06,1.6e-05,-1.7e-05,5e-06,2e-05,3e-06,9e-06,-5.2e-05,-3.4e-05,-1.1e-05,3e-06,7e-06,3e-06,4e-06,1.3e-05,-8e-06,-5e-06,7e-06,5e-06,-1e-06,-4e-06,-3e-06,4e-06,-1.1e-05,7e-06,3e-06,0,0
-1e-06,1e-06,-2e-06,1e-06,-2e-06,-2e-06,-2e-06,0,3e-06,-5e-06,1e-06,-1e-06,-5e-06,-1e-06,1e-05,-2e-06,2e-06,0,-1e-06,-1.1e-05,-1e-06,-4e-06,-1.8e-05,3e-06,1.1e-05,7.3e-05,-3.7e-05,-3.6e-05,7e-06,-9e-06,-3.7e-05,-5e-06,-3.4e-05,1.9e-05,-1.8e-05,9e-06,-8e-06,2.2e-05,0.000718,1.3e-05,-0.000394,-0.00021,-0.000284,-0.000195,2e-06,0.00014,0.00071,-5e-05,-0.000156,1.3e-05,-0.000171,0.000114,-1e-06,-2e-05,-5e-06,7.5e-05,0.000234,2.3e-05,8.7e-05,-0.000103,7e-06,-1.7e-05,0.000141,-2.3e-05,-1.5e-05,1.8e-05,-5.2e-05,9e-06,6.7e-05,-4.4e-05,-9.3e-05,-2.7e-05,-7.2e-05,5.5e-05,-3.2e-05,-4.3e-05,1e-05,-2.2e-05,-1.5e-05,-3.9e-05,-1e-06,2.2e-05,1.8e-05,4e-06,-7e-06,-1e-05,0,-1.6e-05,2e-06,3e-06,1e-05,0,1e-06,-5e-06,4.8e-05,-2.8e-05,3.5e-05,-9e-06,0,4e-06,2.7e-05,5e-06,2e-06,1e-06,3e-06,3e-06,2e-06,-2.1e-05,1.1e-05,-5e-06,-6e-06,-7e-06,-2e-06,-4e-06,-9e-06,3e-06,7e-06,-5e-06,1e-06,1e-06,0
-2e-06,-2e-06,-3e-06,2e-06,2e-06,1e-06,4e-06,0,-4e-06,-6e-06,4e-06,0,-2e-06,2e-06,4e-06,-2e-06,2e-06,0,1e-06,-5e-06,-2e-06,0,1e-05,-1.6e-05,-3e-06,3.3e-05,-8e-06,-2e-06,-2.2e-05,-2.6e-05,3.5e-05,1e-06,5e-06,3e-06,1.8e-05,1e-06,-2e-06,-3e-06,-1e-06,-0.00013,0.000282,-0.000109,0.000121,-1e-05,-0.000306,-0.000128,-0.000297,-0.000117,0.000182,7.4e-05,0.000225,-3.1e-05,2.6e-05,5e-06,-6.8e-05,5.2e-05,0.000158,-2.3e-05,-0.000139,0.000162,5.9e-05,7.5e-05,-0.000134,-9.6e-05,4.4e-05,-2.8e-05,5.1e-05,2.7e-05,1.9e-05,1.5e-05,2.4e-05,-0.000192,7.5e-05,-3.2e-05,-3e-05,4.4e-05,-3e-06,3.6e-05,1.8e-05,2.4e-05,1.7e-05,4e-06,-1.3e-05,-9e-06,3e-06,-2.7e-05,-6e-06,-5e-06,1e-06,-2e-06,-9e-06,2e-06,-2e-06,5e-06,-2e-06,-2.5e-05,5e-06,6e-06,0,-8e-06,-1.3e-05,1.1e-05,2e-06,2e-06,2e-06,-5e-06,-2e-06,-9e-06,-1.9e-05,5e-06,1e-06,6e-06,7e-06,-1e-06,5e-06,-1e-05,2e-06,6e-06,-2e-06,-1e-06,2e-06
-1e-06,-1e-06,-1e-06,0,2e-06,-1e-06,-4e-06,-4e-06,-2e-06,-4e-06,-2e-06,0,-1e-06,6e-06,1e-06,-1e-06,-1e-06,-3e-06,0,-2e-06,-4e-06,0,3.2e-05,-1.5e-05,3e-06,-7.3e-05,-1.1e-05,5.1e-05,-4e-06,-1.6e-05,-4.2e-05,4e-06,-3.3e-05,4e-06,-8e-06,3.1e-05,4e-06,-9e-06,-0.000144,5.7e-05,-0.000181,0.00035,0.000218,9.6e-05,0.000296,-0.000152,0.000228,-4.7e-05,-0.000276,-4.1e-05,-0.000244,1.8e-05,4.4e-05,5e-06,0.000226,-6.5e-05,-8.4e-05,4.3e-05,-7e-05,-9.5e-05,-8.8e-05,4.3e-05,6.2e-05,0.000125,-2.6e-05,-0.000169,-3.8e-05,1.7e-05,8e-06,-1.9e-05,-1.9e-05,4e-05,-9.5e-05,-2e-06,-1.3e-05,-1.6e-05,4e-06,1.6e-05,-7e-06,0,2e-05,5e-06,1.4e-05,2e-06,0,-1.8e-05,-1.3e-05,-4e-06,0,-4e-06,-7e-06,1e-06,-2e-06,1e-06,-1.2e-05,-1.1e-05,1.3e-05,7e-06,1e-06,5e-06,1e-05,-6e-06,-6e-06,-2e-06,3e-06,8e-06,-2e-06,3e-06,7e-06,4e-06,-2e-06,-7e-06,-3e-06,3e-06,-3e-06,1.1e-05,0,1e-06,-2e-06,-1e-06,-4e-06
-1e-06,-1e-06,0,0,-2e-06,0,2e-06,-1e-06,-1e-06,-1e-06,1e-06,-2e-06,-1e-06,0,-1e-06,-1e-06,0,-4e-06,-1e-06,1e-06,0,-2e-06,-2.2e-05,-2e-06,-2.3e-05,2.4e-05,2.2e-05,-3.1e-05,-1.4e-05,6.9e-05,-5e-06,-2e-06,-8e-06,-1e-05,-4e-06,-8e-06,-4e-06,1.2e-05,-0.000303,1e-05,-5.3e-05,-0.00043,1.2e-05,5.3e-05,-0.000268,-6.8e-05,-0.000105,1.9e-05,0.000262,1.8e-05,0.000152,2.5e-05,2.5e-05,1.4e-05,-0.000156,9e-06,-6.8e-05,5.3e-05,9e-05,3.4e-05,-1.5e-05,5.8e-05,-1e-06,1e-05,3e-05,-1e-05,-1e-05,6e-06,-4e-06,-2.7e-05,1.1e-05,0.000112,7.1e-05,4.7e-05,1e-05,2e-06,1.3e-05,-1.1e-05,5e-06,-4e-06,2e-06,-1.5e-05,-1.3e-05,9e-06,-1.3e-05,-3e-06,-4e-06,0,-3e-06,1e-06,-7e-06,0,6e-06,1e-06,-1.6e-05,-3e-06,-4e-06,-7e-06,2e-06,-1e-06,-1.4e-05,-2e-06,4e-06,-2e-06,0,-7e-06,7e-06,-8e-06,-1e-06,6e-06,1e-06,3e-06,-7e-06,2e-06,1e-05,-6e-06,-1e-06,-3e-06,0,0,1e-06
0,0,-2e-06,1e-06,-1e-06,-3e-06,-3e-06,-3e-06,0,-4e-06,1e-06,-1e-06,-2e-06,-1e-06,-6e-06,-1e-06,-1e-06,5e-06,0,2e-06,-2e-06,-1e-06,2e-05,3e-06,3.3e-05,-3e-05,-7e-06,1e-06,-7e-06,-1.1e-05,2.8e-05,-3e-06,-6e-06,-9e-06,1.2e-05,-2.7e-05,0,-7e-06,0.000441,-7.7e-05,3.6e-05,-1.7e-05,-0.000219,-0.000282,0.000135,2.9e-05,0.000109,-3.6e-05,-0.000171,-8.7e-05,-3.3e-05,-9.4e-05,3e-06,-3.8e-05,-7e-05,2.7e-05,5.1e-05,-0.000108,9.6e-05,-9.5e-05,-8e-06,6.2e-05,-1.3e-05,-4.2e-05,1.8e-05,7.9e-05,2e-06,-3.4e-05,-7.6e-05,1.9e-05,2.1e-05,-5.4e-05,-7.1e-05,-2.5e-05,7e-06,-3e-05,-2.5e-05,-7e-06,-1.4e-05,1.3e-05,-2.5e-05,-1e-06,9e-06,-7e-06,5e-06,-4e-06,-4e-06,-1.3e-05,-1e-06,-1e-06,-2e-06,0,3e-06,-3e-06,-3e-06,-1e-06,0,1e-05,-1e-06,-1e-06,9e-06,6e-06,-4e-06,-7e-06,1e-06,5e-06,-5e-06,3e-06,-7e-06,9e-06,-3e-06,-1e-06,0,2e-06,-3e-06,3e-06,-9e-06,2e-06,2e-06,-1e-06,0
0,2e-06,-1e-06,1e-06,2e-06,0,1e-06,0,-2e-06,-5e-06,-2e-06,-2e-06,-2e-06,-3e-06,-9e-06,0,0,-2e-06,0,-1e-06,1e-06,-1e-06,-1.7e-05,-4e-06,-2.5e-05,2.1e-05,-4e-06,-1.2e-05,-1.2e-05,5.3e-05,-3.4e-05,-2e-06,2.2e-05,-6e-06,-2.3e-05,1.3e-05,1e-06,2e-06,-4.6e-05,-2.5e-05,-0.000139,5.7e-05,5e-05,0.000196,-0.000179,4.8e-05,1.2e-05,-9e-06,9.6e-05,6.4e-05,7.9e-05,-7e-05,-2.1e-05,2.2e-05,0.000151,3.7e-05,-9.3e-05,-5.1e-05,-7e-06,0.000142,6.6e-05,-3.1e-05,-3.6e-05,-7e-06,-7e-06,7.6e-05,-5.4e-05,2.7e-05,3.1e-05,-1.6e-05,-2.7e-05,4.8e-05,5.1e-05,4.5e-05,8e-06,2.4e-05,1.5e-05,-1e-06,1.7e-05,-1.3e-05,2e-05,-4e-06,-5e-06,0,-7e-06,-4e-06,6e-06,1e-06,1e-06,1e-06,1e-05,0,-1e-06,-2e-06,3.6e-05,5e-06,-1.9e-05,-2.3e-05,0,2e-06,-1.8e-05,-6e-06,-2e-06,6e-06,2e-06,0,-4e-06,7e-06,5e-06,3e-06,0,-1e-06,3e-06,2e-06,5e-06,-6e-06,1e-05,5e-06,0,2e-06,0
-1e-06,-1e-06,0,1e-06,0,1e-06,0,-2e-06,4e-06,-2e-06,0,1e-06,0,-1e-06,-6e-06,0,0,-2e-06,0,-1e-06,1e-06,1e-06,1e-05,-7e-06,1e-06,4.2e-05,1.3e-05,2.2e-05,-3e-06,-1.8e-05,1.6e-05,2e-06,3e-06,2e-06,5e-06,-3e-06,-1e-06,9e-06,-0.000199,6e-06,-0.000126,-0.000239,2e-05,-1.9e-05,-5.5e-05,-3.3e-05,5.6e-05,1.9e-05,-7.8e-05,2.3e-05,-4.6e-05,-3.4e-05,-1.8e-05,0,-9.2e-05,1.8e-05,-0.000185,8.3e-05,2.9e-05,-7.1e-05,-1.9e-05,-8.2e-05,5.5e-05,3.2e-05,-3e-05,-5e-06,4.4e-05,-1.6e-05,-3.5e-05,2.1e-05,2.4e-05,0,-4.6e-05,-5.1e-05,1.9e-05,6e-06,-2e-06,1.5e-05,-1.3e-05,1.1e-05,3e-06,-9e-06,6e-06,-3e-06,-1e-05,-5e-06,5e-06,-1.1e-05,-3e-06,-4e-06,6e-06,-1e-06,-3e-06,1e-06,-2.1e-05,1.5e-05,-1.5e-05,1.7e-05,-3e-06,-4e-06,1.1e-05,-2e-06,4e-06,0,0,-3e-06,2e-06,-1.2e-05,-7e-06,0,1e-06,2e-06,2e-06,0,-6e-06,5e-06,-3e-06,-3e-06,-1e-06,0,1e-06
-1e-06,0,-2e-06,-1e-06,-1e-06,-1e-06,1e-06,1e-06,2e-06,-2e-06,0,0,-1e-06,-1e-06,-1e-06,0,1e-06,0,0,-4e-06,1e-06,0,-2.5e-05,-2e-06,2.1e-05,-6.5e-05,-1e-05,-1.9e-05,-1.1e-05,-1.8e-05,-7e-06,3e-06,-6e-06,7e-06,1.5e-05,-3.4e-05,0,-1.4e-05,0.000103,-4e-06,-0.000181,0.000269,4.2e-05,-8.7e-05,8.3e-05,-4.5e-05,-7.2e-05,2.8e-05,0.00012,-9.6e-05,2.4e-05,-6e-06,-8e-06,-2.6e-05,1.2e-05,-5.7e-05,0.000126,3.7e-05,-1e-05,8.2e-05,-8e-06,-5.4e-05,-8.6e-05,4e-06,-2e-05,-2.8e-05,-2.4e-05,-4e-06,1.1e-05,1.8e-05,-3e-06,5.3e-05,4.4e-05,2.4e-05,-1.1e-05,-4e-05,-5e-06,-2.8e-05,6e-06,-1.4e-05,-2.4e-05,-3e-06,-7e-06,-1e-06,1.2e-05,-1.3e-05,6e-06,-1e-05,2e-06,2e-06,-1e-06,0,-3e-06,2e-06,-1.5e-05,1.9e-05,3e-06,-5e-06,1e-06,6e-06,-1.1e-05,-7e-06,-5e-06,3e-06,1e-06,4e-06,-1e-06,-1e-06,0,-4e-06,-3e-06,-3e-06,-1e-06,0,1e-06,0,1e-06,2e-06,-1e-06,0,-1e-06
-1e-06,2e-06,-1e-06,-1e-06,-1e-06,0,-3e-06,0,-1e-06,-3e-06,-2e-06,1e-06,-1e-06,2e-06,2e-06,0,0,0,0,-4e-06,1e-06,-1e-06,1.7e-05,1e-06,-2.5e-05,3.5e-05,1e-05,1.3e-05,-9e-06,-5e-06,-4e-06,0,1.9e-05,1e-06,-1.7e-05,1.1e-05,1e-06,4e-06,-0.000172,-1.3e-05,0.000183,-5.7e-05,2.5e-05,2.2e-05,-9e-05,4.3e-05,9.8e-05,3.4e-05,-0.000146,5e-06,-8.3e-05,-2.7e-05,-1.2e-05,1.4e-05,1.2e-05,8e-06,6.4e-05,5e-06,4e-05,1.3e-05,-2.6e-05,1e-05,5.6e-05,-3.5e-05,3e-06,2.6e-05,7.4e-05,-3e-06,2.6e-05,-1e-05,1.3e-05,-4.6e-05,-4.2e-05,-1.5e-05,-3e-06,5.5e-05,-2e-06,-7e-06,-4e-06,6e-06,-1.3e-05,1.4e-05,2e-06,0,-1e-05,-1.4e-05,0,-5e-06,-1e-06,2e-06,-3e-06,0,1e-06,-1e-06,2.1e-05,1.3e-05,2.7e-05,5e-06,-1e-06,-5e-06,-2e-06,-1e-05,1e-06,2e-06,0,-5e-06,-1e-06,2e-06,0,-5e-06,2e-06,2e-06,-2e-06,-1e-06,-6e-06,-4e-06,-2e-06,3e-06,1e-06,-2e-06,0
0,-1e-06,0,-1e-06,0,-1e-06,3e-06,0,0,-4e-06,1e-06,2e-06,-1e-06,2e-06,4e-06,0,0,-2e-06,0,-5e-06,0,0,-1.1e-05,1e-06,1.2e-05,-3.6e-05,-8e-06,-9e-06,-5e-06,-2.3e-05,2e-05,-1e-06,3e-06,4e-06,6e-06,1.7e-05,0,-7e-06,5.2e-05,-5.3e-05,-0.000132,-6.3e-05,-6.6e-05,4e-05,0.000117,7.8e-05,-0.000223,1.7e-05,0.000137,4.5e-05,0.000115,-3.6e-05,-2e-06,5e-06,-2.5e-05,-1.8e-05,-5.5e-05,-4.6e-05,9.9e-05,-0.000111,4.2e-05,-2e-06,-4.9e-05,3.6e-05,-2e-06,5.4e-05,-3.6e-05,2.2e-05,-1.1e-05,4e-06,-3.3e-05,-5.5e-05,4e-05,3e-06,1e-06,-4e-05,1e-05,-3e-06,4e-06,-2e-06,3e-06,3e-06,4e-06,-1e-06,3e-06,-7e-06,-2e-06,-5e-06,2e-06,-2e-06,-8e-06,0,2e-06,-1e-06,5e-06,3e-06,3e-06,-8e-06,1e-06,2e-06,9e-06,-8e-06,2e-06,-2e-06,0,4e-06,3e-06,-6e-06,-2e-06,-1e-06,-3e-06,-2e-06,-2e-06,-1e-06,3e-06,4e-06,1e-06,-1e-06,0,2e-06,0
0,0,-1e-06,0,0,1e-06,-1e-06,-1e-06,1e-06,-2e-06,0,-1e-06,-1e-06,1e-06,5e-06,0,0,0,0,-4e-06,1e-06,0,2.4e-05,-6e-06,-1e-06,1.9e-05,0,5e-06,-9e-06,2.6e-05,-2.3e-05,0,1.1e-05,4e-06,5e-06,1.4e-05,-1e-06,0,0.000128,1.1e-05,0.000201,0.000226,-6.5e-05,-7.7e-05,-6.4e-05,1.7e-05,0.000231,-1e-06,-8.9e-05,-6e-06,-6.2e-05,-9e-06,8e-06,-2.3e-05,6.2e-05,1e-06,0.000133,-3.7e-05,7e-06,0.000135,3.8e-05,1.8e-05,3.5e-05,-4.2e-05,0,-5.2e-05,-1.7e-05,-1.6e-05,2.6e-05,-1.3e-05,1.2e-05,4.2e-05,-2e-05,1.2e-05,-1.6e-05,1.8e-05,-5e-06,5e-06,-3e-06,-3e-06,1.2e-05,-2e-06,-8e-06,0,5e-06,-5e-06,-3e-06,-2e-06,-1e-06,-3e-06,-1e-06,0,0,2e-06,-7e-06,-3e-06,-1.7e-05,5e-06,-2e-06,-3e-06,-1.2e-05,-1e-06,-5e-06,-1e-06,0,-2e-06,0,-2e-06,0,-2e-06,1e-06,0,2e-06,-1e-06,0,-3e-06,1e-06,0,0,-2e-06,0
0,0,-1e-06,1e-06,0,0,-1e-06,-1e-06,-1e-06,-1e-06,-1e-06,1e-06,0,-1e-06,4e-06,0,0,2e-06,0,-3e-06,-1e-06,0,-2.4e-05,-4e-06,-1e-06,1.5e-05,-1e-06,1e-05,-6e-06,1.9e-05,1.2e-05,1e-06,-1.2e-05,1e-06,-1.4e-05,-1.9e-05,1e-06,1e-05,-0.000164,7e-06,8.1e-05,-0.000121,0.000105,3.6e-05,4.3e-05,-6.6e-05,-0.000224,2e-06,7e-06,4.7e-05,5.9e-05,1.9e-05,1.3e-05,1.7e-05,-4.8e-05,3.1e-05,1.2e-05,3.2e-05,-2.9e-05,-9.2e-05,-1.6e-05,4.8e-05,-2.8e-05,3.9e-05,5e-06,-9.4e-05,-1.2e-05,3e-05,-1.2e-05,-1.8e-05,-4e-06,5.1e-05,-1e-06,-2.1e-05,1e-06,-9e-06,-6e-06,-1.3e-05,6e-06,7e-06,-8e-06,-7e-06,5e-06,-2e-06,-3e-06,-6e-06,-5e-06,-6e-06,0,3e-06,4e-06,0,0,-2e-06,-1e-05,-6e-06,9e-06,0,1e-06,2e-06,1e-06,-2e-06,4e-06,0,0,-1e-06,-2e-06,-2e-06,-3e-06,1e-06,-1e-06,1e-06,1e-06,0,3e-06,2e-06,-1e-06,3e-06,0,1e-06,1e-06
0,-1e-06,0,0,0,-1e-06,1e-06,-1e-06,-2e-06,-2e-06,1e-06,-1e-06,-1e-06,-1e-06,0,0,0,-3e-06,0,-1e-06,0,0,2.1e-05,-1e-06,-1e-06,-3e-06,-1e-05,-1.3e-05,-9e-06,2e-06,6e-06,1e-06,1e-06,-1e-06,5e-06,3.2e-05,0,-3e-06,-1.7e-05,-6.6e-05,0.000143,6.6e-05,3.6e-05,-2.8e-05,2.5e-05,-9.5e-05,6.2e-05,-3e-06,6.4e-05,2.1e-05,-0.000151,1.3e-05,1e-05,1.8e-05,-2.8e-05,-2.5e-05,3e-05,2.4e-05,5e-06,1.2e-05,-3.7e-05,1.2e-05,2.7e-05,-3.9e-05,-9e-06,-1.7e-05,-5e-06,-1.8e-05,-1.2e-05,4e-06,7e-06,-3.7e-05,-3e-06,2e-05,6e-06,1.1e-05,6e-06,-2e-06,-4e-06,-8e-06,1e-06,-3e-06,-1e-06,1e-06,5e-06,-3e-06,-3e-06,-4e-06,1e-06,-1e-06,2e-06,0,-1e-06,1e-06,2e-06,-9e-06,-6e-06,-3e-06,0,-1e-06,2e-06,-3e-06,-2e-06,-1e-06,0,2e-06,0,-5e-06,2e-06,2e-06,-1e-06,-2e-06,-1e-06,0,1e-06,-4e-06,-1e-06,0,0,0,0
-1e-06,1e-06,-1e-06,0,-1e-06,0,-1e-06,0,1e-06,-3e-06,0,0,-1e-06,-1e-06,-4e-06,0,0,0,0,-1e-06,-1e-06,0,-1.9e-05,2e-06,1e-06,1.8e-05,7e-06,1e-06,-5e-06,2.5e-05,-8e-06,-2e-06,-1.2e-05,-5e-06,2e-06,-1.8e-05,0,1e-06,4.5e-05,-1.1e-05,-1.8e-05,3.2e-05,-9.1e-05,4.6e-05,7e-06,2e-06,-3e-06,-2.7e-05,-8.6e-05,-3.2e-05,8.7e-05,-1.3e-05,-8e-06,-2.4e-05,4.9e-05,7e-06,-6e-05,1.6e-05,6e-06,-4.2e-05,-3.2e-05,-3e-06,-4.3e-05,2.2e-05,1e-05,4.1e-05,4e-05,-1.1e-05,7e-06,-5e-06,-6e-06,1.3e-05,2e-06,-2.6e-05,-4e-06,-5e-06,-1e-06,8e-06,-2e-06,8e-06,1.8e-05,-3e-06,-2e-06,3e-06,0,-7e-06,1e-06,0,-2e-06,-2e-06,4e-06,0,0,-2e-06,1.2e-05,-1.2e-05,-2.1e-05,3e-06,0,-2e-06,0,-4e-06,-2e-06,1e-06,0,-4e-06,0,-1e-06,-3e-06,-1e-06,0,3e-06,1e-06,1e-06,0,3e-06,3e-06,0,0,0,0
0,0,0,0,0,0,1e-06,0,1e-06,-2e-06,0,0,0,0,-6e-06,0,0,2e-06,0,0,0,0,1.6e-05,-4e-06,4e-06,-3.6e-05,-1e-06,6e-06,-8e-06,-2.5e-05,6e-06,-2e-06,0,-5e-06,-1e-06,-1.1e-05,0,-2e-06,0.000139,2.9e-05,0.000103,-9.9e-05,1.6e-05,-4.9e-05,5.7e-05,6.2e-05,-2.1e-05,-1.3e-05,6.9e-05,-2.1e-05,-6.7e-05,-9.3e-05,-1.8e-05,1.8e-05,1e-05,-9e-06,-7e-05,-4.3e-05,1.7e-05,4.6e-05,3.3e-05,-2.1e-05,4.4e-05,-1e-06,2.5e-05,6.6e-05,-5e-06,-2e-06,-2e-06,2e-06,3e-06,4e-05,9e-06,1.5e-05,1.2e-05,-7e-06,-1e-06,5e-06,4e-06,-6e-06,3e-06,1e-06,0,-2e-06,-1e-06,-9e-06,2e-06,-8e-06,0,0,0,0,1e-06,0,-3e-06,-1.2e-05,1.1e-05,-4e-06,0,2e-06,-6e-06,-3e-06,4e-06,0,0,4e-06,-1e-06,-1e-06,-2e-06,-1e-06,0,-2e-06,1e-06,0,-1e-06,0,-1e-06,2e-06,0,0,0
0,-1e-06,0,0,1e-06,0,0,0,0,-1e-06,1e-06,0,0,1e-06,-4e-06,0,0,-1e-06,0,0,0,0,-2e-05,-3e-06,-7e-06,6e-06,6e-06,-5e-06,-5e-06,4e-06,-3e-06,-1e-06,-5e-06,-4e-06,0,-8e-06,0,-3e-06,-0.000155,-5e-05,1.7e-05,0.000152,1.1e-05,-1.6e-05,-6e-06,4.2e-05,0,-6e-06,-4.3e-05,-2.4e-05,3.4e-05,-2.2e-05,-2.6e-05,2e-06,-5e-05,5e-06,-3.6e-05,-1.4e-05,1.2e-05,-3.8e-05,1.5e-05,-1.9e-05,-6.2e-05,-7e-06,-1e-06,1.4e-05,4e-06,3e-05,2.3e-05,1.6e-05,9e-06,-3.1e-05,-1.7e-05,-8e-06,4e-06,1.1e-05,-1e-06,-8e-06,-4e-06,2e-06,-1.6e-05,2e-06,2e-06,1e-06,2e-06,-7e-06,4e-06,-6e-06,1e-06,1e-06,-5e-06,0,-1e-06,1e-06,-8e-06,-7e-06,7e-06,3e-06,0,-1e-06,8e-06,0,-4e-06,2e-06,0,-2e-06,1e-06,-1e-06,1e-06,-4e-06,0,1e-06,-1e-06,0,-3e-06,-2e-06,-1e-06,1e-06,0,0,0
0,1e-06,-1e-06,0,0,0,0,0,0,-2e-06,0,0,-1e-06,1e-06,-2e-06,0,0,-1e-06,0,-1e-06,0,0,1.8e-05,-2e-06,7e-06,1.6e-05,2e-06,1e-06,-8e-06,-1.6e-05,4e-06,1e-06,-1e-06,-1e-06,-1e-06,1.4e-05,0,5e-06,-4.5e-05,-3e-06,-0.000141,-9.9e-05,-1.4e-05,6.7e-05,2e-05,-4e-05,5.2e-05,-6e-06,5e-05,3.9e-05,-6e-05,1.2e-05,-2.4e-05,-1.1e-05,1.7e-05,1e-06,1.9e-05,2.5e-05,-6.3e-05,2.1e-05,-1e-05,-2.7e-05,4.9e-05,2.4e-05,-8e-06,6e-06,-1.8e-05,-3.2e-05,-2e-06,-1e-06,-4e-06,-5.9e-05,2.5e-05,4e-06,0,-1.7e-05,2e-06,3e-06,-2e-06,0,-7e-06,4e-06,-3e-06,0,-1e-06,-6e-06,4e-06,-6e-06,-1e-06,0,-2e-06,0,-1e-06,0,2e-06,1e-06,1.2e-05,-5e-06,0,-2e-06,-1e-05,-3e-06,2e-06,-1e-06,0,0,1e-06,2e-06,-3e-06,0,-1e-06,-1e-06,-2e-06,0,1e-06,1e-06,0,1e-06,-1e-06,0,0
0,0,0,0,-1e-06,-1e-06,-1e-06,0,1e-06,-3e-06,0,0,-1e-06,0,0,0,0,1e-06,0,-2e-06,0,0,-1.6e-05,2e-06,-1e-06,-1e-06,-4e-06,-3e-06,-5e-06,-1e-06,0,1e-06,1e-06,3e-06,-3e-06,-1.7e-05,0,1e-06,4.1e-05,-4e-06,5.8e-05,-4.1e-05,3.9e-05,-2.9e-05,-1.1e-05,-4.2e-05,-8.1e-05,3e-06,-8.1e-05,-7e-06,8e-06,-1.1e-05,-2.2e-05,1.5e-05,3.3e-05,-1.1e-05,-1.9e-05,2.1e-05,-3.7e-05,9e-06,-2.7e-05,-1.7e-05,-4.7e-05,-3.5e-05,-8e-06,6e-06,-1.4e-05,2e-05,-6e-06,3e-06,9e-06,5.4e-05,-2.4e-05,1e-05,1e-06,1.4e-05,-3e-06,6e-06,-1e-06,-3e-06,1.1e-05,1e-06,0,-1e-06,-2e-06,-7e-06,-1e-06,-2e-06,1e-06,-1e-06,-2e-06,0,-1e-06,1e-06,6e-06,7e-06,-4e-06,9e-06,1e-06,2e-06,4e-06,-6e-06,0,0,0,1e-06,-1e-06,-5e-06,1e-06,0,0,-1e-06,-2e-06,0,-2e-06,-1e-06,0,0,0,-1e-06,0
0,-1e-06,0,0,0,0,2e-06,0,0,-2e-06,0,1e-06,0,-1e-06,4e-06,0,0,1e-06,0,-2e-06,0,0,2e-05,-3e-06,-4e-06,-7e-06,0,6e-06,-8e-06,2e-05,-5e-06,0,6e-06,3e-06,0,3e-06,0,-2e-06,-2.2e-05,-1.3e-05,-0.000119,7.6e-05,3e-05,-5.4e-05,1e-06,4e-06,0.000123,1.5e-05,0.00012,-3.7e-05,-5.2e-05,-3e-06,-2.2e-05,-2e-06,-1.9e-05,7e-06,-3.4e-05,0,-8e-06,-4.8e-05,1e-05,2.9e-05,3.5e-05,2.9e-05,1e-06,-3e-05,1.9e-05,-8e-06,3e-06,0,-2.1e-05,2.9e-05,2.4e-05,-1.5e-05,-6e-06,-1e-05,2e-06,8e-06,7e-06,6e-06,0,-3e-06,4e-06,0,0,-6e-06,-2e-06,-2e-06,-1e-06,-1e-06,1e-06,0,1e-06,0,-2e-06,9e-06,-1.2e-05,-6e-06,0,0,0,-4e-06,-3e-06,0,0,-3e-06,-1e-06,-4e-06,-1e-06,3e-06,-1e-06,1e-06,1e-06,0,4e-06,3e-06,2e-06,1e-06,0,1e-06,0
