0.036584,0.07537,0.246511,0.482184,0.674453,0.864555,1.005465,1.109441,1.258207,1.395487,1.466503,1.401247,1.530557,1.687437,1.565192,1.480585,1.464181,1.50624,1.412089,1.277184,1.391093,1.463742,1.363816,1.353093,1.493331,1.590899,1.80982,1.876319
0.042649,0.088257,0.276697,0.554753,0.798181,1.027532,1.230935,1.358421,1.473888,1.629712,1.743971,1.661391,1.784875,1.951888,1.806266,1.711113,1.704058,1.758633,1.646389,1.520273,1.682436,1.775936,1.62146,1.568745,1.75768,1.861459,2.059446,2.151828
0.052347,0.110402,0.324977,0.678291,1.011041,1.291552,1.595514,1.765596,1.799994,1.967223,2.164831,2.08298,2.207054,2.371125,2.160233,2.031013,2.056151,2.144403,2.001037,1.926283,2.206023,2.314476,2.042256,1.909001,2.167858,2.263242,2.385067,2.522181
0.05916,0.128604,0.362107,0.766578,1.15826,1.458428,1.812291,2.007951,1.952405,2.100554,2.379757,2.375613,2.501522,2.588456,2.291453,2.102095,2.19657,2.376026,2.224398,2.232831,2.641496,2.724782,2.347993,2.170425,2.421848,2.473629,2.488507,2.598966
0.063695,0.141776,0.385041,0.777626,1.174772,1.504687,1.83167,2.032379,1.934104,1.980572,2.28588,2.450135,2.548404,2.515148,2.267993,2.059133,2.190626,2.426346,2.307628,2.388065,2.79535,2.843435,2.497242,2.353136,2.504386,2.56143,2.579484,2.525453
0.070524,0.156373,0.397543,0.730598,1.088971,1.464891,1.769386,1.972252,1.871612,1.776952,2.086843,2.466444,2.486374,2.364865,2.290245,2.125482,2.231804,2.367757,2.272724,2.406949,2.671463,2.68556,2.500056,2.448197,2.492564,2.602535,2.734319,2.568463
0.091661,0.202584,0.45355,0.777503,1.154973,1.562843,1.886291,2.049781,1.927269,1.820611,2.125732,2.555556,2.448977,2.314462,2.494559,2.479211,2.453558,2.456039,2.475318,2.628291,2.728057,2.694508,2.61105,2.59679,2.597339,2.806382,3.022118,2.808895
0.142914,0.321214,0.614272,1.010137,1.544252,1.996726,2.341051,2.509999,2.366048,2.365233,2.614677,2.790883,2.61498,2.572762,2.942595,3.113613,2.973163,3.008635,3.129207,3.092203,3.20333,3.314246,3.156354,2.991017,2.958656,3.243871,3.478927,3.264256
0.220168,0.492593,0.840272,1.353457,2.111826,2.58955,2.896471,3.165643,3.129182,3.283609,3.450846,3.274573,3.10746,3.182857,3.534691,3.852262,3.810489,3.919523,3.914439,3.499562,3.788473,4.224543,3.884331,3.475022,3.464545,3.767456,3.92775,3.848567
0.296952,0.65553,1.080833,1.781897,2.768476,3.162014,3.253141,3.593301,3.87254,4.287945,4.285409,3.787844,3.776321,3.991345,4.124705,4.467637,4.740932,4.896565,4.616388,3.900131,4.444335,5.044476,4.378875,3.802774,3.913803,4.204961,4.140126,4.18263
0.324412,0.721004,1.208373,2.122959,3.310906,3.536043,3.287834,3.64669,4.397415,5.096171,4.821607,4.134941,4.442677,4.838082,4.631043,4.722105,5.369211,5.670373,5.265308,4.634848,5.274375,5.484976,4.427268,4.024608,4.359962,4.503908,4.22647,4.316827
0.277395,0.653613,1.186626,2.278174,3.542787,3.601671,3.196512,3.725909,4.916697,5.634576,4.955368,4.281573,4.895722,5.283766,4.758165,4.505173,5.436813,5.927878,5.575643,5.313172,5.895912,5.618149,4.392923,4.324998,4.877683,4.74392,4.337772,4.448676
0.209713,0.515444,1.053666,2.175256,3.336304,3.338957,3.116851,3.854626,5.049583,5.616473,4.823074,4.345853,5.039634,5.13498,4.591191,4.34106,5.146985,5.55941,5.221255,5.172314,5.733965,5.5059,4.515525,4.618255,5.265246,4.877376,4.463845,4.701725
0.205626,0.446337,0.940777,1.8917,2.801466,2.860068,2.839032,3.472534,4.340381,4.844358,4.286795,4.03516,4.625454,4.517562,4.296896,4.27165,4.462856,4.679071,4.540092,4.382066,4.760949,5.12005,4.886112,4.800395,5.283435,4.839122,4.424674,4.841635
0.294455,0.562899,1.144158,2.005469,2.789855,3.10932,3.186476,3.222288,3.475781,3.83299,3.724411,3.999215,4.301932,4.100552,4.443003,4.718349,4.38683,4.450514,4.514998,4.287733,4.86467,6.019037,6.411247,5.645446,5.687683,5.344358,4.616945,5.080862
0.514523,0.958407,1.787755,2.820543,3.834202,4.504311,4.622251,4.045724,3.872477,4.210126,4.508177,5.488422,5.571416,5.132994,5.628396,5.983129,5.737965,5.990234,6.176508,6.030674,7.12435,8.60979,9.002483,7.845094,7.652383,7.113454,5.695639,6.262069
0.912766,1.709571,2.814509,4.015367,5.377743,6.678051,7.068726,5.983832,5.360151,5.665886,6.780804,8.883383,8.850622,8.330029,8.713385,8.379986,7.905775,8.467949,9.174288,9.256519,10.316036,11.351422,11.547317,10.931741,10.854973,9.655477,7.675371,8.534998
1.50201,2.807468,4.072453,5.22155,7.070464,9.637804,10.900853,9.140912,7.220223,7.062105,9.861283,13.948734,13.71857,13.199159,13.771355,12.48149,10.928602,11.166502,12.829794,13.519475,13.623817,13.268756,13.184089,14.286502,14.581224,12.377746,10.771933,11.920404
2.15918,4.016868,5.327151,6.290239,8.89845,13.163081,15.940551,13.713692,9.640486,8.425967,13.296441,19.42941,18.653828,18.270148,19.446797,17.709847,14.77544,13.751202,16.600528,18.623731,17.184391,14.64613,14.23969,17.795393,18.692576,15.89728,15.224861,15.536528
2.563339,4.760984,6.192853,6.987141,9.971144,15.488929,20.138599,18.686684,13.055081,10.463607,16.186684,22.848696,21.321827,21.060202,22.843805,21.717297,18.718069,16.254259,19.540016,23.280635,20.467072,15.907589,15.694885,21.296595,22.944105,20.3099,19.866785,18.599166
2.424071,4.520226,6.565101,7.64199,9.81934,14.958837,20.807883,21.539484,16.641986,13.408855,17.463399,22.157709,20.412696,20.183172,21.942382,22.170568,20.761216,18.344005,21.288349,25.491048,22.182119,17.590054,18.048398,22.919904,24.66519,23.240705,22.778127,20.826211
1.919801,3.702447,6.355778,7.896488,8.98594,12.671187,17.856255,20.470412,18.584215,16.079598,16.549725,17.801264,16.783852,16.450595,17.7105,18.948457,19.320895,18.296044,20.001463,23.206974,21.122207,18.59939,19.601938,21.360396,22.112265,22.638102,22.984662,21.820819
1.645554,3.026686,5.63339,7.853274,8.825081,11.207924,14.812067,17.440715,18.548793,17.339858,14.510245,13.955968,14.601639,13.552845,14.384357,16.529958,17.407274,16.770317,16.095286,17.741584,17.788964,18.075761,19.947265,19.188651,18.029785,19.336398,21.291082,21.360559
1.940354,2.961151,4.78,7.50068,9.218374,10.740526,12.931387,14.93532,17.498689,17.172266,12.90083,11.6781,13.677841,13.066487,14.394411,17.60868,18.530384,16.400344,12.687713,12.765696,14.400646,16.517237,19.454403,18.388085,15.589074,16.234479,18.335179,18.754947
2.406639,3.296359,4.522605,7.598571,9.737775,10.383269,11.624423,13.775273,16.435328,15.556149,11.824673,10.710912,12.254647,11.754744,13.902813,17.678652,18.512726,15.658146,10.917207,10.819727,13.056992,15.449946,18.806624,18.070033,14.295354,14.701244,15.656497,16.158493
2.560932,3.469446,4.516752,7.930256,9.71554,9.447642,9.869364,12.528975,15.416076,13.477153,10.849713,10.563957,10.5174,9.366527,11.634811,14.649151,15.110272,12.817675,9.0818,9.326275,11.513995,13.895814,17.002617,15.772643,12.36002,13.350174,13.530152,14.958436
2.137593,3.005228,4.066285,7.406964,8.649001,7.849732,7.697433,9.838651,12.495,10.828532,9.079302,9.083617,7.918851,6.890468,8.810651,10.484336,10.644499,9.448097,7.376665,7.652128,9.208393,10.796203,12.682051,11.79215,10.942749,11.985206,11.906369,14.103563
1.356669,2.145855,3.193572,5.541663,6.379605,6.149676,5.96297,6.833808,8.316194,7.246392,6.184199,6.499699,5.754434,5.242048,6.129783,6.672494,6.830076,6.475375,6.194903,6.205731,6.660743,7.380805,7.702343,7.749131,9.44024,10.323878,10.374697,12.375338
0.841833,1.479064,2.366488,3.477162,4.037711,4.357837,4.242643,4.637313,5.806235,4.919084,4.017676,4.586864,4.356308,4.301107,4.927209,4.942575,4.905102,5.091687,5.640057,5.184105,5.14061,5.536645,5.234855,5.811691,7.566236,7.925101,8.449718,9.855168
0.733955,1.332215,2.137955,2.768988,2.791579,2.750721,2.846182,3.685104,4.803992,3.871842,3.012045,3.55188,3.714371,4.153012,4.305845,3.872983,4.006411,4.239091,4.860939,4.477773,4.208395,4.208548,3.822116,4.551287,5.589429,5.930635,6.332045,6.720689
0.78194,1.440263,2.244626,3.013547,2.781447,2.060057,2.236035,3.29583,3.811629,2.994687,2.413984,2.885295,3.469725,4.132128,3.872104,3.363342,3.756078,3.522263,3.588555,3.708307,3.928495,3.74309,2.848561,3.456731,4.55972,4.909489,4.680965,4.46063
0.765058,1.408626,2.164356,2.921655,2.725808,1.987502,2.114722,2.664127,2.787752,2.40468,2.269449,2.970067,3.36848,3.587058,3.319422,3.169687,3.836745,3.366681,2.714087,3.003112,4.223529,4.424348,2.898034,3.049567,4.697048,4.947889,3.712519,3.324733
0.7331,1.185073,1.862721,2.386802,2.375208,2.115209,2.024799,1.943358,2.160897,2.296946,2.397601,2.929145,3.023283,3.12473,3.080637,3.23925,3.626358,3.262297,2.529534,2.575815,4.176959,4.869651,3.642575,3.540001,5.041364,4.741151,3.218322,3.114744
0.728558,0.886502,1.307575,1.606234,1.763038,2.063116,1.985195,1.569621,1.784879,2.283407,2.487171,2.450921,2.472398,3.359165,3.63393,3.466002,3.112948,2.901996,2.69733,2.422497,3.572887,4.564598,4.211097,3.880676,4.73432,3.963545,2.764228,3.035763
0.716554,0.732535,0.840098,1.208583,1.667464,2.058955,1.978523,1.682226,1.744637,2.506358,2.729159,1.923862,2.094508,3.839019,4.148676,3.278631,2.515222,2.626588,2.996349,2.898584,3.47471,4.133361,4.224269,3.814536,4.295519,3.549019,2.698229,2.700516
0.692276,0.772074,0.854423,1.264497,2.046462,2.301876,2.092028,2.026607,1.975716,2.989532,3.143168,1.841005,1.925756,3.889447,4.18323,2.88242,2.033928,2.302422,3.010241,3.538064,3.917634,3.820063,3.782338,3.662381,4.502604,4.058205,2.755587,2.45681
0.74866,0.810175,0.994383,1.57018,2.386747,2.390166,2.238646,2.33316,2.232253,3.313361,3.272621,1.783098,1.606733,3.270731,3.7817,2.582745,1.799932,2.090173,2.938189,4.040246,4.407482,3.728805,3.459535,3.647254,4.853717,4.673341,2.929467,2.865961
0.776813,0.780882,1.090943,1.883481,2.38637,2.124874,2.184893,2.33976,2.162634,3.14148,2.827807,1.482078,1.18605,2.324999,2.904641,2.013297,1.573836,1.965676,3.051232,4.152254,4.591675,3.851881,3.233667,3.981539,5.135487,5.022162,3.747819,3.844757
0.734832,0.782707,1.299992,2.051345,1.945845,1.741262,2.172221,2.256601,1.897906,2.578575,2.207907,1.179359,1.048213,1.731985,2.138519,1.611685,1.404422,1.904808,3.142457,3.617445,4.226081,3.917287,3.134321,4.483171,4.952588,4.747928,4.575794,4.71553
0.737146,0.91396,1.576474,1.98124,1.27706,1.284157,2.069255,2.275181,1.784572,2.166244,2.150676,1.291842,1.109168,1.392318,1.814883,1.840158,1.455276,2.21577,3.31843,2.737996,3.694426,4.433508,3.918153,5.07814,4.625449,4.264011,4.840896,5.124339
