3.2e-05,1.1e-05,3.6e-05,2.9e-05,2.6e-05,2.1e-05,6e-06,1e-06,7e-06,2e-06,4e-06,1.9e-05,7e-06,1.8e-05,7e-06,5e-06,2e-06,1.3e-05,1e-06,1e-06,1.3e-05,3e-06,3.4e-05,1e-06,4.1e-05,0.000296,3.6e-05,6e-06,7e-05,7.8e-05,2.5e-05,0.000168,2.8e-05,7.3e-05,2.8e-05,8e-05,0.000113,2.7e-05,1.3e-05,0.000416,0.000718,2.5e-05,0.00012,0.000626,0.000354,0.000321,0.000379,0.000117,5e-05,0.000369,0.000435,0.00035,0.000503,0.000126,8.5e-05,0.000142,0.00021,3.8e-05,6.8e-05,0.000134,5.6e-05,0.000339,0.000319,0.00029,0.000119,2e-05,0.000362,0.000152,1.9e-05,0.000319,6.7e-05,0.000166,0.000216,3.9e-05,7.1e-05,2.2e-05,5.8e-05,4.2e-05,7.7e-05,6.8e-05,3.8e-05,2.8e-05,8.6e-05,0.000101,9.7e-05,0.000106,0.00012,2.4e-05,5.5e-05,8.4e-05,5.5e-05,1.1e-05,2.1e-05,0.000102,1.2e-05,5e-06,9e-06,5.3e-05,4e-06,2.7e-05,1.7e-05,9e-06,1.6e-05,3.2e-05,1e-05,1.2e-05,2.4e-05,2e-06,6e-06,4e-06,2.6e-05,6e-06,1.2e-05,0,1.5e-05,9e-06,0,1.2e-05,1.6e-05,1.6e-05,2.2e-05
6.6e-05,7.8e-05,7.7e-05,2.7e-05,6.8e-05,6.6e-05,6.9e-05,3.9e-05,1.2e-05,1.2e-05,3e-05,4.4e-05,2.6e-05,3.3e-05,3.8e-05,4.9e-05,2.3e-05,2.5e-05,2.1e-05,1.9e-05,2.8e-05,1.3e-05,7.1e-05,7.6e-05,9.9e-05,0.000756,0.000235,0.000111,0.000185,0.00011,0.000175,0.000282,0.000189,0.000134,0.000146,0.00023,0.000451,0.000188,4.5e-05,0.001612,0.000569,0.002512,0.001102,0.000871,0.000626,0.001032,0.000474,0.000546,0.001388,0.001395,0.000132,0.000923,0.000298,6.1e-05,0.000287,0.000602,0.000449,0.000532,0.00051,6e-06,0.000368,0.000509,0.000656,0.000688,0.000774,0.00067,0.000729,0.000693,0.000691,0.000743,0.000404,3.6e-05,0.00043,0.000219,0.000138,0.000236,9.2e-05,0.000102,0.00018,0.000265,0.000159,0.000122,0.000155,0.000258,0.000259,0.000124,0.000219,0.000228,3.1e-05,0.000234,0.000247,0.00022,0.000181,0.000107,0.000223,0.000163,0.000334,0.000294,0.000176,8.6e-05,6.1e-05,3.6e-05,7.2e-05,8.3e-05,7.9e-05,9.4e-05,7.3e-05,1.8e-05,3.4e-05,4.5e-05,5.5e-05,5.6e-05,4e-05,2.5e-05,2.8e-05,1.1e-05,1.3e-05,1.7e-05,1.7e-05,5.8e-05,3.8e-05
5.7e-05,1.8e-05,2.4e-05,2.5e-05,1.9e-05,5.2e-05,1.5e-05,1.2e-05,2.6e-05,3.4e-05,2.3e-05,1.8e-05,1.9e-05,2.1e-05,3.8e-05,2e-05,4e-05,1.6e-05,5e-06,5.6e-05,7.2e-05,2.3e-05,4.4e-05,0.000115,0.000237,0.000761,0.000401,0.00027,0.000264,9.7e-05,0.000117,0.000202,0.000332,0.000362,0.000294,1.9e-05,0.000233,0.000211,0.000154,0.003278,0.00332,0.001373,0.000977,0.000458,0.001673,0.002545,0.001608,0.001564,0.002773,0.000767,0.000204,0.000769,0.000859,0.000829,0.00045,0.001361,0.000584,0.000149,0.000277,0.000819,0.001109,0.000799,0.000848,0.000642,0.000637,0.000484,0.000709,0.000962,0.000621,0.000407,0.001015,0.000364,0.000229,0.000293,4e-04,0.000831,0.000812,0.000559,8.2e-05,0.000189,0.000308,5.4e-05,0.000118,0.00039,7.7e-05,0.000218,0.00021,4.5e-05,0.000219,0.000442,0.000532,0.000229,4.3e-05,0.00022,0.000291,0.000348,0.000316,0.000199,0.000116,5e-05,5.6e-05,0.000122,4.9e-05,5e-05,4.6e-05,0.000105,8.3e-05,6.1e-05,1.5e-05,3.4e-05,8e-06,1.4e-05,4e-05,2.1e-05,1.6e-05,3.1e-05,4.2e-05,1.1e-05,1.3e-05,5.6e-05,2.7e-05
3.9e-05,4.6e-05,3.8e-05,5.8e-05,6.8e-05,4.2e-05,5.1e-05,2.9e-05,3.3e-05,2.4e-05,4.8e-05,3.8e-05,6.7e-05,7.4e-05,4.7e-05,4.3e-05,4.4e-05,3.6e-05,4.6e-05,8.7e-05,0.000106,1.2e-05,4.9e-05,6.9e-05,0.000455,0.001248,0.000686,0.000302,0.000291,0.000145,0.000171,0.000386,0.000284,0.000135,0.000294,0.00032,0.000198,9.4e-05,0.000159,0.00545,0.003476,0.003625,0.002442,0.001373,0.001597,0.001163,0.001124,0.002021,0.001488,0.000628,0.000849,0.001123,0.001172,0.000987,0.001567,0.000398,0.000629,0.000409,0.000107,0.001422,0.000355,0.000307,0.000941,0.001382,0.000359,0.00081,0.001046,0.000416,0.000318,6.9e-05,0.000231,0.000512,0.000226,0.000404,0.000802,0.000634,0.000106,0.000204,0.00017,4.1e-05,0.000532,0.000453,0.000322,0.000323,0.00013,0.000294,0.000545,0.000312,0.000147,0.000229,0.000783,0.000557,0.000197,0.000408,0.000273,0.000396,0.000593,0.000268,9.4e-05,3.7e-05,6e-05,0.000133,7.4e-05,1.8e-05,5.5e-05,9.4e-05,2.4e-05,2.6e-05,3.6e-05,5e-05,4.5e-05,2.7e-05,4.5e-05,5.6e-05,3.5e-05,4e-05,5.2e-05,4.9e-05,4.6e-05,4.1e-05,4.1e-05
1.2e-05,2.2e-05,1.2e-05,3.3e-05,2.3e-05,2.6e-05,1.8e-05,1.9e-05,2.2e-05,8e-06,2.5e-05,2.8e-05,5.2e-05,2.1e-05,1.7e-05,1e-05,2.5e-05,1e-05,2.2e-05,3.2e-05,0.000142,0.000123,0.000114,6e-05,0.000417,0.001287,0.000382,0.00022,0.000222,0.000287,3.2e-05,0.000428,0.000199,0.000226,0.000217,7.5e-05,9.9e-05,5.8e-05,0.000235,0.006724,0.002914,0.003186,0.002817,0.001054,0.003981,0.004013,0.003875,0.001313,0.000218,0.000977,0.001442,0.00128,0.002115,0.002409,0.000488,0.000813,0.001305,0.001597,0.001223,0.001845,0.001801,0.001709,0.001582,0.000935,0.001438,0.000814,0.001266,0.001257,0.000821,0.001042,0.000543,0.00075,0.000741,0.000747,0.000735,0.000766,0.000681,0.000755,0.000376,0.00038,0.00028,9e-05,0.000149,0.000675,0.000283,0.000106,0.000142,0.00013,3.3e-05,0.000104,0.000573,0.000314,0.000135,0.000539,0.000114,0.000205,0.000479,0.000189,4.5e-05,6.8e-05,2.2e-05,0.00019,2.6e-05,5e-06,2.6e-05,0.000169,5.1e-05,8e-06,1.2e-05,2.5e-05,3.6e-05,2.2e-05,4e-05,1.7e-05,1.8e-05,3e-06,3.4e-05,8e-06,3e-05,1.5e-05,3e-06
2e-05,1.8e-05,1.2e-05,4e-06,2.8e-05,3.1e-05,4e-05,1e-05,2.2e-05,1.5e-05,1.8e-05,2.7e-05,5.3e-05,2.6e-05,1.8e-05,5e-06,2.7e-05,2.6e-05,1.4e-05,3.1e-05,0.000106,9.7e-05,4.2e-05,5.1e-05,0.000458,0.001331,0.001036,0.000241,0.000167,0.000204,0.000182,0.000248,0.000412,0.000194,7e-05,0.000141,0.000269,0.000127,0.000241,0.00657,0.004523,0.001668,0.00287,0.002454,0.005639,0.002106,0.003074,0.003429,0.001465,0.000871,0.001243,0.00112,0.003827,0.003526,0.001729,0.001643,0.001685,3.2e-05,0.000342,0.001032,0.001048,0.000248,0.000392,0.001806,0.003003,0.000646,0.000397,0.000398,0.000948,0.002116,0.002597,0.001765,0.00068,0.000568,0.000331,0.00064,0.000413,0.000781,0.00044,0.000383,0.000467,0.000293,0.000237,0.000278,0.000243,0.000329,0.000296,0.000182,0.000106,7.8e-05,0.000461,0.000289,0.000108,0.000237,0.000197,0.000232,0.00044,0.000303,0.000173,0.00017,7.4e-05,0.00019,0.000109,6.4e-05,4.3e-05,0.000235,0.000137,5.5e-05,1e-05,1.8e-05,3.9e-05,2e-05,1.3e-05,1.9e-05,4.4e-05,5.1e-05,1.3e-05,5e-06,2.3e-05,2.2e-05,1.2e-05
2.3e-05,2.5e-05,1.6e-05,2.8e-05,4e-05,2.8e-05,3.5e-05,3.4e-05,1.4e-05,2.2e-05,3e-05,4.5e-05,9e-06,2.1e-05,1.6e-05,1.8e-05,5.4e-05,1.6e-05,4.5e-05,4.3e-05,3e-05,4.3e-05,1e-05,3.3e-05,0.000444,0.001489,0.000649,0.000211,0.000363,0.000654,9.5e-05,0.000642,0.000292,0.000314,7e-05,0.000112,8.8e-05,9.4e-05,0.000304,0.005246,0.002323,0.004853,0.005929,0.004966,0.009711,0.007685,0.00284,0.00241,0.004495,0.002797,0.001209,0.000444,0.003508,0.001758,0.000814,0.002775,0.000277,0.00063,0.001957,0.000779,0.001091,0.002294,0.002114,0.002442,0.002712,0.002187,0.000869,0.001974,0.002984,0.000601,0.001355,0.000821,0.000378,0.00076,0.000697,0.000357,0.001118,8.1e-05,0.00056,0.000514,0.000728,0.000686,0.000218,0.000423,0.000117,0.000226,0.000363,0.000218,8.6e-05,0.000203,0.000397,0.000151,0.000176,0.000342,0.00017,0.000277,0.000495,0.000208,0.000144,4.7e-05,3.6e-05,0.000141,0.000121,7.5e-05,2.9e-05,0.000257,0.000156,8.8e-05,2.3e-05,2.8e-05,5e-05,4.4e-05,1.6e-05,1.8e-05,2e-05,3.3e-05,2.3e-05,7e-06,4e-06,2.6e-05,4.4e-05
1.2e-05,1.8e-05,8e-06,2.2e-05,4e-05,2.8e-05,3.3e-05,2.5e-05,2.4e-05,1.8e-05,7e-06,2e-05,3.3e-05,4.2e-05,1.9e-05,2e-05,4.2e-05,5.1e-05,6.7e-05,5e-05,0.000242,0.00019,7.2e-05,4.1e-05,0.000557,0.000845,0.004659,0.002249,0.000681,0.000658,0.000631,0.001385,0.001009,0.000455,0.000178,0.000118,0.00034,0.000327,0.000271,0.003093,0.003134,0.007753,0.012382,0.005819,0.009706,0.006117,0.005387,0.002483,0.005659,0.002349,0.002585,0.002412,0.004521,0.001848,0.003756,0.000372,0.002159,0.001157,0.003353,0.00347,0.00274,0.001687,0.001474,0.000461,0.000508,0.001373,0.002196,0.003003,0.004601,0.003951,0.002497,0.00203,0.000785,0.000675,0.000478,0.000558,0.001367,0.001537,0.001146,0.000649,0.001038,0.000597,0.00041,0.000846,0.00051,0.000205,0.000379,0.000284,0.000108,0.000227,0.000348,0.000309,0.000325,0.000676,0.000308,0.00025,0.000812,0.000492,0.000136,6.1e-05,6.7e-05,0.000135,0.000312,0.000137,2.9e-05,0.000305,0.000393,0.000195,6.2e-05,2.8e-05,4.3e-05,3.7e-05,3e-05,3.7e-05,3.1e-05,4.2e-05,1.2e-05,2.6e-05,3e-05,3.1e-05,1e-05
1.5e-05,1.2e-05,1.4e-05,9e-06,4.3e-05,2.7e-05,7e-06,7e-06,1.3e-05,7e-06,8e-06,1.4e-05,2.3e-05,1e-05,1.8e-05,1.4e-05,3e-05,3.1e-05,1.3e-05,4e-05,0.000411,0.000494,0.000287,0.000146,0.00082,0.001904,0.007648,0.004542,0.001493,0.000779,0.000664,0.001181,0.00094,0.000454,0.000348,0.00012,0.000358,0.000474,0.000448,0.002708,0.001401,0.00529,0.005196,0.002869,0.005051,0.009262,0.005396,0.006453,0.000672,0.001273,0.003934,0.001829,0.001969,0.001779,0.004626,0.003439,0.002495,0.001343,0.002085,0.002061,0.001351,0.002648,0.002003,0.001009,0.000398,0.001298,0.001361,0.002568,0.002041,0.000892,0.000563,0.001029,0.000971,0.000794,0.000328,0.000473,0.001662,0.00177,0.000874,0.000218,0.000205,0.000183,0.000229,0.000581,0.000386,9.8e-05,0.00025,0.000201,0.000132,2e-04,0.000464,0.00026,0.000716,0.000708,0.000748,0.000379,0.000648,0.000399,0.000261,0.000139,7.4e-05,0.000228,0.000247,0.000155,0.000102,0.000244,0.000445,0.000218,8.3e-05,1.6e-05,2.2e-05,1.9e-05,1.6e-05,2.7e-05,9e-06,1.4e-05,3.3e-05,3e-05,1.9e-05,2.3e-05,1.2e-05
7e-06,9e-06,1e-05,1.6e-05,3.3e-05,6e-06,4e-06,5e-06,6e-06,7e-06,8e-06,6e-06,2.2e-05,1.9e-05,8e-06,9e-06,6e-06,2e-05,1.4e-05,3.2e-05,0.000441,0.000185,6.2e-05,6.6e-05,0.000823,0.002842,0.00748,0.004342,0.001802,7e-04,8.9e-05,0.000897,0.000234,5.5e-05,0.000215,7.5e-05,0.000287,0.000182,0.000289,0.002476,0.001577,0.00215,0.001866,0.000844,0.002969,0.003942,0.001092,0.004027,0.002782,0.001063,0.001994,0.000614,0.00107,0.000992,0.002407,0.003287,0.001536,0.001335,0.001677,0.001019,0.000235,0.001176,0.000833,0.000814,0.00068,0.001288,0.001566,0.000412,0.000915,0.000536,0.000918,0.000287,0.000176,0.000461,0.000124,0.000171,0.000991,0.000423,0.000102,4e-04,0.000101,8.4e-05,0.000149,0.000138,0.000412,0.000133,0.000215,2.2e-05,9.7e-05,2.9e-05,0.000197,0.00018,0.000762,0.001165,0.000469,0.00021,0.000552,0.000338,0.000216,0.000118,6.4e-05,0.000367,0.000451,0.000207,7.3e-05,0.000223,0.000297,0.000214,0.000122,5.2e-05,3.3e-05,1.5e-05,2.5e-05,3e-05,2e-05,1.5e-05,2.3e-05,2.2e-05,1.3e-05,1.9e-05,2.2e-05
7e-06,1.4e-05,1.1e-05,1.3e-05,1.7e-05,7e-06,5e-06,4e-06,8e-06,6e-06,7e-06,1e-05,6e-06,1.3e-05,9e-06,5e-06,8e-06,4e-06,9e-06,2.7e-05,0.000265,0.00019,5.2e-05,0.000109,0.000636,0.001986,0.002552,0.000771,0.000538,0.000354,9.3e-05,0.000511,0.000511,0.000262,9.1e-05,0.000138,0.000233,0.00013,0.000192,0.002235,0.002033,0.003005,0.003138,0.000785,0.000663,0.001469,0.000413,0.002018,0.001156,0.001579,0.002002,0.000781,0.000833,0.001385,0.00084,0.001014,0.000608,0.001178,0.001383,0.000729,2e-04,0.000168,0.00137,0.000328,0.00054,0.000305,0.00181,0.001658,0.000357,0.000407,0.000471,0.000146,0.000132,0.000107,0.000452,0.000138,0.000563,0.000429,8.8e-05,0.000273,0.000148,0.000148,0.000107,0.000178,0.000314,0.000166,0.000218,0.000162,1e-05,7e-05,5.3e-05,0.000103,0.000527,0.00017,0.000254,0.000219,0.000102,4.9e-05,9.2e-05,4.8e-05,2.6e-05,0.000392,0.000415,0.00021,5.6e-05,0.000125,0.000306,0.000143,3.3e-05,2.9e-05,2.4e-05,8e-06,1.5e-05,2.8e-05,1.7e-05,1.5e-05,8e-06,9e-06,2e-05,2.4e-05,1.7e-05
1.4e-05,3e-06,1.4e-05,9e-06,2.2e-05,1.1e-05,6e-06,5e-06,3e-06,9e-06,1.2e-05,1e-05,1.3e-05,1.9e-05,1e-05,6e-06,6e-06,1.4e-05,1.5e-05,3e-05,0.00022,0.000127,4.1e-05,0.000144,0.000342,0.001767,0.001,7.7e-05,0.000503,0.000368,0.000103,0.000234,0.000213,0.000242,6.5e-05,6.7e-05,0.000198,9.4e-05,0.000129,0.002247,0.000772,0.002991,0.001122,0.000553,0.000952,0.001442,0.00055,0.003764,0.002263,0.000698,0.002424,0.000945,0.00047,0.001518,0.001702,0.000975,0.000599,0.001234,0.001814,0.000969,0.000205,0.000323,0.001147,0.000448,0.000249,0.00084,0.000664,0.001201,0.000139,0.000501,0.000701,3.4e-05,0.000226,0.000376,0.000374,6.1e-05,0.000409,0.000305,0.000109,0.000315,0.000117,0.000161,0.000233,0.000266,9.5e-05,0.000108,7.8e-05,0.000105,6.4e-05,4.2e-05,0.00024,0.000131,0.000291,0.000142,0.00013,0.000153,5.6e-05,7.5e-05,1.9e-05,1e-06,2.9e-05,0.000377,0.000207,8e-05,3.5e-05,5.1e-05,0.000136,7.9e-05,1.8e-05,2e-05,7e-06,1e-06,8e-06,6e-06,8e-06,1.8e-05,1.7e-05,9e-06,1.9e-05,2.3e-05,3e-06
5e-06,6e-06,9e-06,1e-05,1.8e-05,1.1e-05,6e-06,8e-06,1.1e-05,9e-06,5e-06,1e-05,6e-06,9e-06,1.2e-05,1.1e-05,1.1e-05,8e-06,1.3e-05,1.6e-05,0.000379,0.000135,5.3e-05,0.000177,0.000158,0.001201,0.001077,0.000436,0.000326,0.000141,5e-05,6.1e-05,0.000242,0.000152,0.000105,6.4e-05,0.000129,3.4e-05,0.000127,0.002269,0.003517,0.002222,0.001599,0.000694,0.002916,0.002847,0.000454,0.003563,0.001143,0.001817,0.002159,0.001335,0.002685,0.00469,0.001287,0.000769,0.000584,0.001523,0.002224,0.001032,0.000184,0.00106,0.000699,0.001782,0.000793,0.001182,0.001297,0.000959,0.001202,0.000454,0.000411,0.000237,0.000327,0.000518,0.000423,0.000251,7e-04,0.000221,0.000294,0.000302,0.000199,0.000144,0.000189,0.000237,0.000409,6.4e-05,0.000174,0.000115,5.1e-05,1e-05,0.000212,4.1e-05,9.6e-05,0.000528,0.000132,0.00013,0.00018,4.3e-05,5.7e-05,4e-05,4.9e-05,0.000313,0.000131,5.7e-05,4.8e-05,0.000103,0.000103,5.8e-05,8e-06,5e-06,1e-05,7e-06,1e-05,1.4e-05,1.8e-05,7e-06,1.2e-05,2.2e-05,3e-06,5e-06,1.6e-05
0,6e-06,5e-06,1e-05,1.1e-05,2e-06,7e-06,3e-06,9e-06,1.4e-05,3e-06,8e-06,6e-06,1.2e-05,3e-06,1.1e-05,8e-06,1e-05,4e-06,1.5e-05,0.000417,0.000225,8.1e-05,2e-04,0.000229,0.00091,0.000449,0.000214,0.00025,0.000264,6.5e-05,2e-04,0.000209,0.000214,0.000218,0.000152,4.8e-05,7.2e-05,6.4e-05,0.002493,0.002532,0.000308,0.002602,0.002508,0.003932,0.002547,0.000596,0.001252,0.00276,0.001778,0.002007,0.001672,0.00427,0.003714,0.001961,0.003285,0.00176,0.002542,0.000927,0.000737,0.001226,0.0011,0.001113,0.001042,0.001202,0.000825,0.001518,0.000809,0.001226,0.001658,0.001789,0.000836,0.000794,0.00091,0.000432,3e-04,0.001259,0.000547,0.000118,0.000432,0.000273,0.000265,0.000332,0.000578,0.000417,0.000264,0.000262,0.000137,5.9e-05,7.3e-05,0.000165,0.000136,0.000154,0.000794,0.000708,0.000148,8.1e-05,4.2e-05,0.00011,1.8e-05,3.1e-05,0.000185,4.1e-05,2.7e-05,1.9e-05,0.000141,0.000163,4.9e-05,7e-06,3.7e-05,1.2e-05,6e-06,1.2e-05,8e-06,1.3e-05,1.1e-05,7e-06,1.3e-05,1.2e-05,1.2e-05,2e-05
7e-06,5e-06,3e-06,9e-06,1.6e-05,2.3e-05,1.3e-05,1.6e-05,1.3e-05,1.1e-05,1.4e-05,1.2e-05,1.4e-05,1.4e-05,1.3e-05,5e-06,5e-06,8e-06,9e-06,2.1e-05,0.000434,0.000287,0.000108,0.000231,0.000416,0.000629,0.000442,0.000365,0.000204,0.000122,0.00014,0.000146,0.000173,0.000104,0.000427,0.000213,0.000161,0.00013,3.7e-05,0.002587,0.003396,0.001392,0.002138,0.001623,0.002867,0.002803,0.003927,0.005692,0.005299,0.003447,0.000955,0.001344,0.004047,0.007821,0.004029,0.004768,0.004259,0.001876,0.001237,0.003092,0.003744,0.003298,0.002999,0.001391,0.000349,9e-04,0.003199,0.001934,0.000624,0.001093,0.000928,0.000247,0.001001,0.001293,0.000882,0.000105,0.001234,0.000785,0.000465,0.000403,0.000163,0.000182,0.000399,0.000898,0.000369,0.000659,0.000208,0.000297,9.7e-05,0.000126,0.000427,0.000198,0.000141,0.000526,0.000171,0.000205,0.000109,5e-06,9.2e-05,5.1e-05,1.3e-05,9.3e-05,0.00012,5.6e-05,3.9e-05,0.000186,0.000158,0.000112,5.6e-05,1.9e-05,1.9e-05,2e-06,2e-05,1.3e-05,2.5e-05,1.6e-05,1.4e-05,1.1e-05,1.3e-05,1.3e-05,9e-06
1e-05,5e-06,7e-06,7e-06,5e-06,2.4e-05,1.6e-05,1.7e-05,1.6e-05,2e-05,7e-06,2.9e-05,1e-05,7e-06,4e-06,5e-06,4e-06,1e-05,2e-05,2.3e-05,0.000479,0.000186,8.7e-05,0.000243,0.001227,0.001501,0.000681,0.000321,0.000162,0.000219,0.000143,0.000159,0.000154,0.000209,0.000307,0.000135,0.000111,5.7e-05,0.000119,0.002701,0.008852,0.004583,0.003172,0.006364,0.003458,0.000931,0.004287,0.005621,0.001713,0.003685,0.004084,0.003776,0.006294,0.004594,0.006532,0.008712,0.001246,0.000745,0.003709,0.00547,0.002953,0.002881,0.003503,0.003692,0.000817,0.004115,0.00538,0.000995,0.002125,0.001683,0.000925,0.001648,0.000887,0.003455,0.001135,0.001703,0.002017,0.000727,0.000467,0.000527,0.000854,0.000398,0.000487,0.001445,0.000953,0.000776,0.001453,0.000584,0.00016,0.00029,0.00061,0.000329,9.3e-05,0.000301,0.000556,0.000275,0.000113,2.5e-05,3.7e-05,1e-05,1.9e-05,3.6e-05,0.000172,0.000109,3.5e-05,0.000207,0.000177,7.9e-05,2.3e-05,1.4e-05,1.5e-05,8e-06,1.8e-05,1.9e-05,1.9e-05,9e-06,2.1e-05,1.3e-05,2.8e-05,1e-05,3e-05
1.8e-05,1.7e-05,5e-06,9e-06,8e-06,1.3e-05,1.1e-05,8e-06,1.2e-05,2.8e-05,2.2e-05,1.5e-05,2.6e-05,1.7e-05,3e-06,1e-05,6e-06,9e-06,2.3e-05,2.6e-05,0.000457,0.000284,0.000149,0.00026,0.001807,0.000192,0.000789,0.000307,0.00051,0.000157,0.00011,0.00021,0.000348,0.000131,0.000154,0.000133,5.7e-05,8.1e-05,2.8e-05,0.002717,0.008384,0.00723,0.005556,0.005447,0.006238,0.006499,0.007696,0.00712,0.007681,0.010275,0.010995,0.010866,0.005921,0.002089,0.005032,0.005147,0.009603,0.006901,0.004977,0.008751,0.004729,0.006863,0.008305,0.010233,0.007397,0.005007,0.010245,0.010673,0.007379,0.001942,0.002162,0.001259,0.002823,0.00422,0.004725,0.003572,0.003551,0.002939,0.001673,0.001369,0.002213,0.001734,0.001592,0.002844,0.003192,0.002586,0.000594,0.001275,0.000892,0.000343,0.000362,0.000244,0.000243,0.000738,0.000403,0.00024,0.000134,2.4e-05,9e-05,4.1e-05,5e-05,8.1e-05,0.000195,8.3e-05,1.7e-05,0.000209,0.000186,8.8e-05,3.8e-05,2.9e-05,4e-06,9e-06,9e-06,3e-05,4.2e-05,1.3e-05,2.4e-05,2.8e-05,1.3e-05,2.3e-05,2.8e-05
1e-06,3e-06,4e-06,7e-06,1.6e-05,1.2e-05,1.2e-05,1.3e-05,1.7e-05,2.4e-05,1e-05,1.5e-05,1.2e-05,6e-06,3e-06,9e-06,1.7e-05,9e-06,1.7e-05,1.6e-05,0.000334,0.000214,7.4e-05,0.000252,0.002293,0.0017,0.001011,0.000479,0.000614,0.00027,0.00015,9e-05,0.000321,0.000228,6.6e-05,3.8e-05,4.4e-05,3.8e-05,6e-05,0.002292,0.00432,0.005693,0.004522,0.008455,0.002613,0.005599,0.004258,0.004765,0.004564,0.008337,0.007362,0.003554,0.003015,0.003017,0.003981,0.00308,0.008063,0.010236,0.011246,0.008467,0.008765,0.001689,0.009044,0.009005,0.00408,0.007247,0.005238,0.004711,0.002731,0.000922,0.002518,0.002029,0.003697,0.001764,0.003351,0.00432,0.004296,0.002628,0.001382,0.000426,0.001892,0.000737,0.00077,0.001618,0.001318,0.000861,0.001699,0.001068,0.000353,0.000149,0.000149,0.000175,0.000145,0.000647,0.000571,0.000469,0.000183,7.9e-05,4.1e-05,6.6e-05,9.6e-05,5.1e-05,0.000125,0.000118,5.6e-05,0.000223,0.000131,4.2e-05,9e-06,4e-05,3.9e-05,1.3e-05,2.1e-05,3.6e-05,4e-06,3e-05,3.4e-05,1.4e-05,1.2e-05,3.4e-05,3.3e-05
2e-06,9e-06,6e-06,8e-06,1.4e-05,6e-06,5e-06,8e-06,3e-06,1.5e-05,8e-06,1.3e-05,4e-06,1.1e-05,5e-06,7e-06,1.4e-05,1e-05,1.1e-05,1.6e-05,0.000242,9.2e-05,2.1e-05,0.00024,0.002429,0.001342,0.00078,0.000333,0.000348,0.000418,0.000141,0.000211,0.000537,0.000427,0.000202,0.00012,0.000149,8.3e-05,7.5e-05,0.001519,0.002566,0.003644,0.002058,0.003253,0.001767,0.003602,0.003368,0.002401,0.007454,0.003966,0.001038,0.005451,0.00432,0.002302,0.003839,0.004486,0.003265,0.005031,0.001718,0.001474,0.003682,0.005112,0.003264,0.003215,0.002376,0.006403,0.00289,0.004145,0.002855,0.001265,0.001223,0.001165,0.001927,0.003291,0.000961,0.00196,0.001146,0.000389,0.000351,0.000753,0.000678,0.00069,0.000295,0.001073,0.000667,0.000657,0.001009,0.000412,0.000185,0.000111,0.000304,0.000157,0.000124,0.000471,0.000769,0.000536,0.000272,9.7e-05,0.000111,7.5e-05,5.2e-05,0.000104,6.5e-05,6.2e-05,5.5e-05,0.000232,0.000112,5.6e-05,3e-05,3.7e-05,3.1e-05,2e-05,2.3e-05,9e-06,1.7e-05,2.9e-05,9e-06,1.8e-05,1.5e-05,1.8e-05,2e-05
3e-06,1.5e-05,1.9e-05,1.4e-05,1.1e-05,1.4e-05,1e-05,5e-06,4e-06,8e-06,7e-06,9e-06,5e-06,1.9e-05,1e-05,9e-06,7e-06,6e-06,1.6e-05,2.4e-05,0.000276,0.000172,6.2e-05,0.000257,0.001812,0.001375,0.00062,0.000313,0.000228,7.4e-05,5.8e-05,0.00031,0.000283,0.000399,3.8e-05,4e-05,0.000155,8.8e-05,0.000115,0.000857,0.000464,0.003115,0.002287,0.002145,0.001346,0.002436,0.003057,0.002228,0.003311,0.003429,0.001962,0.00397,0.003078,0.002952,0.001927,0.00308,0.002667,0.003132,0.003769,0.00332,0.001491,0.002708,0.000944,0.001851,0.003249,0.000455,0.001272,0.001439,0.001491,0.001448,3.8e-05,0.000511,0.00102,0.00073,0.001067,0.001495,0.00106,0.000795,5.6e-05,9e-06,0.000479,0.000601,0.000487,0.000933,0.000982,0.000541,0.00049,0.00037,0.00024,0.000208,0.000482,0.000252,0.000101,0.000436,0.001189,0.000733,0.000313,7.8e-05,6e-05,6.9e-05,8.3e-05,7.5e-05,6.6e-05,5.6e-05,2.4e-05,0.000153,6.9e-05,6.1e-05,2.8e-05,8e-06,5e-06,9e-06,1.1e-05,5e-06,1e-05,1.4e-05,1.2e-05,6e-06,5e-06,1.8e-05,1.2e-05
9e-06,5e-06,1e-05,3e-06,1e-05,8e-06,1.5e-05,9e-06,5e-06,5e-06,9e-06,1.1e-05,1.1e-05,1.2e-05,1.3e-05,1.4e-05,1.3e-05,1.2e-05,7e-06,3.1e-05,0.000312,0.000193,6.9e-05,0.000256,0.000763,0.000505,0.000513,4.7e-05,9.2e-05,8.5e-05,9.9e-05,0.000396,0.000289,0.000393,0.00035,0.000163,0.000107,0.00013,1.5e-05,0.000337,0.000636,0.000948,0.001761,0.002592,0.001586,0.001152,0.001132,0.00267,0.001467,0.001388,0.000272,0.001665,0.000836,0.001996,0.003309,0.001025,0.002241,0.002442,0.001689,0.000686,0.001102,0.001635,0.001391,0.001228,0.001958,0.001571,0.001237,0.000843,0.001548,0.001986,0.001249,0.000997,0.00051,0.00061,0.000363,0.000425,0.000611,0.000521,0.000393,0.000392,0.000222,0.000458,0.000258,0.000489,0.000412,0.000274,0.000264,0.000195,7e-05,8.1e-05,0.000487,0.000266,8.4e-05,0.000567,0.001112,0.000507,0.000243,6.2e-05,4.8e-05,4e-05,1.1e-05,0.000106,6.8e-05,5.6e-05,3e-06,9.8e-05,6.4e-05,1.4e-05,1.7e-05,2.7e-05,2.6e-05,1e-05,1.4e-05,9e-06,4e-06,1e-05,1.1e-05,1.4e-05,1.4e-05,2.2e-05,2e-05
3e-06,3e-06,6e-06,8e-06,1.3e-05,6e-06,8e-06,7e-06,1.1e-05,5e-06,5e-06,1e-05,4e-06,8e-06,4e-06,3e-06,6e-06,1.2e-05,1.1e-05,2e-05,0.000247,8.7e-05,2.2e-05,0.000247,6.3e-05,0.000268,0.000212,0.000137,3.3e-05,3.6e-05,0.000111,0.000416,0.00029,0.000336,0.00034,0.000187,0.000135,3.6e-05,2.8e-05,0.000122,0.00047,0.001547,0.001861,0.000776,0.00118,0.000649,0.002356,0.001459,0.000427,0.000897,0.00012,0.001808,0.001592,0.000357,0.002392,0.002016,0.001193,0.000924,0.001921,0.001592,0.001343,0.001774,0.001585,0.000636,0.000704,0.001327,0.00108,0.000625,0.000534,0.000577,0.000197,0.000537,8.1e-05,0.000233,0.000666,0.000149,0.000578,0.000112,8e-05,0.000319,0.000204,8.6e-05,0.000152,0.000256,0.000212,0.000236,0.000184,2.8e-05,0.00011,4.5e-05,0.000357,0.000219,0.000143,0.000588,0.000469,0.000299,2e-04,9.1e-05,6e-05,1.1e-05,1.9e-05,0.000106,8.1e-05,5e-06,4.2e-05,6.1e-05,1e-05,1.4e-05,2.5e-05,3e-05,6e-06,9e-06,1.5e-05,6e-06,9e-06,4e-06,8e-06,1.7e-05,8e-06,1e-05,1e-05
2e-06,1e-06,3e-06,3e-06,2e-06,1e-06,0,2e-06,3e-06,3e-06,1e-06,2e-06,2e-06,2e-06,1e-06,3e-06,1e-06,1e-06,8e-06,1e-05,6.7e-05,5.1e-05,2.4e-05,0.000106,4.7e-05,0.000172,0.000137,4.8e-05,4.9e-05,1.3e-05,5.2e-05,0.000157,7.9e-05,0.000103,0.000135,5.2e-05,2.5e-05,9e-06,1.4e-05,9.9e-05,0.000477,7.8e-05,0.000454,0.000672,0.00018,0.000287,0.000476,0.000909,0.000661,0.000542,0.00028,0.000387,0.000206,0.000362,0.000709,0.00018,0.000411,0.000152,0.000223,0.000316,0.000234,0.000364,0.000353,0.000406,0.000302,0.000333,9.3e-05,0.00025,8.6e-05,0.000181,0.000131,0.00015,5.9e-05,8.6e-05,5.6e-05,0.00014,0.000213,0.000143,7.7e-05,0.000113,9.4e-05,3.5e-05,8.6e-05,0.000128,2e-05,3.8e-05,0.000119,3.3e-05,5e-05,3.6e-05,0.000123,6e-05,2.4e-05,0.000141,0.000253,8.7e-05,4.8e-05,6e-06,8e-06,5e-06,9e-06,6.2e-05,3.9e-05,1.3e-05,1e-05,1.8e-05,8e-06,8e-06,7e-06,5e-06,8e-06,4e-06,7e-06,4e-06,3e-06,1e-06,6e-06,4e-06,3e-06,1e-06,8e-06
1e-06,3e-06,4e-06,3e-06,2e-06,2e-06,1e-06,1e-06,1e-06,3e-06,3e-06,1e-06,2e-06,4e-06,2e-06,4e-06,3e-06,4e-06,7e-06,7e-06,6e-05,2.1e-05,1.1e-05,0.000103,8.6e-05,0.000313,7.1e-05,7e-05,4.2e-05,3.3e-05,5.9e-05,5.7e-05,3.9e-05,7.2e-05,6.2e-05,7.7e-05,3.4e-05,2.6e-05,2.7e-05,9.5e-05,0.000165,0.000588,0.000677,0.000191,0.000192,0.000513,0.000347,0.00077,0.000618,5e-04,0.000128,0.000467,0.000337,0.000467,0.00064,0.000385,0.000422,0.000308,0.000446,0.000129,0.000271,0.000295,0.000199,0.000357,0.000328,0.000307,0.000328,0.000496,6.1e-05,0.000179,0.00011,0.000103,2.1e-05,9.5e-05,0.00015,0.000109,0.000149,7.9e-05,4e-06,0.000101,5.2e-05,6.9e-05,3.6e-05,8.7e-05,3.1e-05,1.1e-05,8.2e-05,1.6e-05,1.8e-05,5.9e-05,9.5e-05,3.9e-05,1e-05,9.3e-05,0.000198,9.5e-05,4.6e-05,1.3e-05,2.5e-05,8e-06,7e-06,7.8e-05,5e-05,2.4e-05,1.1e-05,2e-05,2e-06,6e-06,1e-06,2e-06,7e-06,5e-06,5e-06,6e-06,4e-06,5e-06,3e-06,6e-06,4e-06,6e-06,8e-06
1e-06,3e-06,1e-06,3e-06,2e-06,2e-06,1e-06,1e-06,2e-06,2e-06,1e-06,4e-06,1e-06,2e-06,2e-06,2e-06,0,3e-06,4e-06,1e-05,5.7e-05,3.3e-05,1.6e-05,9e-05,6.4e-05,0.000317,0.000172,6.6e-05,4.5e-05,2.6e-05,5.8e-05,4.8e-05,4.5e-05,6.2e-05,4e-05,2.4e-05,2.8e-05,3.8e-05,3.5e-05,0.000157,0.000407,0.000805,0.00033,0.000358,0.000155,0.00013,0.000688,0.000304,0.000452,0.000478,0.000283,0.000412,0.000304,0.000326,0.000473,0.00023,0.000232,0.00043,0.000248,0.000359,0.000249,0.000236,0.000218,0.000167,0.000142,0.000325,0.00025,0.000341,3.1e-05,0.000159,5.8e-05,8.9e-05,2.7e-05,0.000133,4.9e-05,9e-05,4.9e-05,0.000119,5.2e-05,0.000127,9.7e-05,5.9e-05,5.6e-05,8.9e-05,3.4e-05,4.9e-05,9.1e-05,3.8e-05,1.8e-05,4.6e-05,3.9e-05,2e-05,5e-06,0.000155,0.000152,9.3e-05,5.2e-05,2.6e-05,1.3e-05,9e-06,8e-06,8e-05,4.9e-05,2.9e-05,1.2e-05,2.5e-05,6e-06,6e-06,8e-06,3e-06,3e-06,2e-06,4e-06,4e-06,0,4e-06,1e-06,3e-06,0,6e-06,2e-06
0,1e-06,2e-06,3e-06,1e-06,2e-06,1e-06,2e-06,2e-06,3e-06,0,2e-06,3e-06,3e-06,2e-06,1e-06,1e-06,2e-06,5e-06,7e-06,2.4e-05,6e-06,7e-06,9.3e-05,0.000103,0.000318,5.9e-05,2.3e-05,3.9e-05,2.1e-05,6.4e-05,4.7e-05,1.9e-05,4e-05,5.2e-05,3.5e-05,4.1e-05,2.6e-05,1e-05,0.000226,0.000386,0.000252,0.000168,0.000136,2e-04,0.000281,0.000408,0.000534,0.000406,0.000205,0.000719,0.000386,0.00011,0.000223,0.00023,0.000778,0.000478,0.000351,0.00018,0.000463,0.000159,0.000308,8.5e-05,0.000277,0.000253,0.000231,3.5e-05,0.000203,9e-05,6.8e-05,7.7e-05,6.7e-05,2.1e-05,0.000125,9.4e-05,0.000118,0.000119,0.000104,4e-05,9.3e-05,9.2e-05,1.1e-05,2.1e-05,9.9e-05,5e-05,4.6e-05,3.4e-05,5.4e-05,2.9e-05,2.5e-05,2.8e-05,2.6e-05,1e-05,0.000127,0.000212,7.3e-05,5.3e-05,1.6e-05,2.8e-05,2.3e-05,6e-06,7.7e-05,3.1e-05,1.9e-05,3e-06,3e-05,2.3e-05,9e-06,5e-06,4e-06,1e-06,3e-06,3e-06,2e-06,3e-06,4e-06,3e-06,2e-06,2e-06,5e-06,2e-06
2e-06,2e-06,1e-06,2e-06,4e-06,2e-06,2e-06,1e-06,0,1e-06,2e-06,1e-06,3e-06,1e-06,2e-06,0,1e-06,4e-06,4e-06,7e-06,2.3e-05,6e-06,1.1e-05,7.1e-05,0.000146,0.000216,6.3e-05,7.4e-05,4.7e-05,1.8e-05,4.2e-05,2.7e-05,2e-05,3.6e-05,5.9e-05,2.2e-05,4.1e-05,1.5e-05,1.5e-05,0.000297,0.000373,0.000647,0.000361,0.000501,0.000435,0.000396,7.7e-05,0.000148,0.000216,0.000314,0.000556,0.000156,0.00015,0.00016,0.000391,0.000306,0.000233,0.000638,0.000329,0.000556,0.00027,3e-05,0.000202,0.000276,0.000302,0.000402,0.000395,0.000479,0.000126,7.9e-05,3e-05,8.2e-05,3.6e-05,0.000119,3.9e-05,8.9e-05,8.9e-05,7.2e-05,3.5e-05,5.8e-05,6.4e-05,2.8e-05,2.1e-05,0.000119,2.7e-05,2.7e-05,2.1e-05,2.2e-05,1.4e-05,1.2e-05,3.5e-05,9e-06,1.1e-05,8.7e-05,0.00017,8e-05,3.7e-05,1.3e-05,1.6e-05,7e-06,8e-06,7.2e-05,3.7e-05,1.5e-05,6e-06,1.8e-05,1.5e-05,6e-06,3e-06,1e-06,2e-06,0,3e-06,2e-06,4e-06,2e-06,2e-06,2e-06,5e-06,2e-06,2e-06
2e-06,2e-06,3e-06,1e-06,3e-06,1e-06,2e-06,1e-06,1e-06,1e-06,3e-06,2e-06,3e-06,2e-06,1e-06,1e-06,0,4e-06,4e-06,5e-06,4.3e-05,2e-05,1.4e-05,7e-05,8.8e-05,0.000116,9.8e-05,3.3e-05,4.9e-05,2e-05,2.8e-05,1.3e-05,4.6e-05,2e-05,6.8e-05,3.6e-05,3e-05,7e-06,1.8e-05,0.000307,0.00038,0.000751,9.5e-05,0.00027,0.000409,0.000754,0.000286,0.000413,0.000157,9e-05,0.000144,0.000352,0.000118,0.000288,0.000381,0.000252,0.000348,0.000434,0.000367,0.000294,0.000177,0.000211,0.000126,7e-05,0.000169,0.000515,0.000154,0.000209,0.000152,3.4e-05,9.5e-05,0.000139,2.4e-05,0.00011,4.3e-05,0.000121,0.000125,6.8e-05,5.2e-05,8.9e-05,8.1e-05,2.3e-05,2.5e-05,0.000114,2.1e-05,2.5e-05,1.8e-05,1e-05,5e-06,2.2e-05,2.9e-05,9e-06,9e-06,0.000134,0.000217,0.000152,5.6e-05,2.3e-05,1e-05,7e-06,2e-06,5.3e-05,2.4e-05,8e-06,1.3e-05,1.6e-05,1.9e-05,1.1e-05,7e-06,2e-06,3e-06,2e-06,4e-06,5e-06,2e-06,3e-06,1e-06,2e-06,4e-06,4e-06,1e-06
2e-06,1e-06,2e-06,2e-06,1e-06,3e-06,2e-06,2e-06,1e-06,1e-06,3e-06,3e-06,2e-06,3e-06,1e-06,1e-06,1e-06,5e-06,1e-06,7e-06,3.3e-05,2.3e-05,1e-05,7e-05,2.9e-05,0.000271,8.8e-05,5.7e-05,1.7e-05,8e-06,3.9e-05,1e-06,4.7e-05,6.8e-05,6.3e-05,3.9e-05,2e-05,1.2e-05,1.6e-05,0.000275,0.000452,0.000527,0.000533,0.000581,0.000233,0.000595,4.8e-05,0.000256,0.000355,0.000326,0.000315,0.000226,0.000173,0.000425,0.000401,0.000241,0.000444,0.000404,0.000119,0.00027,5.4e-05,0.000292,0.000232,5.8e-05,0.000141,8.6e-05,0.00024,0.000233,6.6e-05,0.000182,8.2e-05,9.1e-05,6.6e-05,4.6e-05,1.2e-05,0.000195,0.000218,4.6e-05,6e-05,2.8e-05,0.000107,8.9e-05,1e-05,9.3e-05,0.000132,1.6e-05,4.5e-05,2.3e-05,3e-06,2.6e-05,3.9e-05,2.4e-05,1e-06,0.000108,0.000241,7.3e-05,3.3e-05,1.6e-05,1.7e-05,9e-06,3e-06,3.1e-05,2.8e-05,7e-06,8e-06,7e-06,1e-05,6e-06,4e-06,5e-06,6e-06,1e-06,6e-06,1e-06,3e-06,3e-06,1e-06,3e-06,3e-06,3e-06,3e-06
2e-06,2e-06,1e-06,3e-06,3e-06,1e-06,4e-06,1e-06,1e-06,1e-06,2e-06,1e-06,1e-06,4e-06,4e-06,2e-06,2e-06,4e-06,5e-06,1e-05,2e-05,1.3e-05,0,6.8e-05,4e-05,0.000273,0.000115,6.1e-05,3.4e-05,1.9e-05,5.9e-05,1.5e-05,2.1e-05,2.9e-05,1.9e-05,8e-06,2.5e-05,1.1e-05,1.7e-05,0.000213,0.000496,0.000337,0.000375,0.000115,0.000414,0.000286,0.000444,0.000384,0.000441,0.000278,0.00012,0.000182,0.000172,0.000196,0.000268,0.000436,0.00028,0.000308,0.000282,4.5e-05,0.000115,0.000318,6.5e-05,8.8e-05,0.000176,0.00027,0.000351,0.000215,1.6e-05,0.000178,6.3e-05,2.9e-05,0.000111,0.000159,0.000131,0.000219,0.000372,0.000241,0.000121,9e-06,8.5e-05,0.000141,0.000147,0.00017,3.6e-05,3.6e-05,7.9e-05,4.7e-05,3.6e-05,2.1e-05,2.6e-05,2.1e-05,2e-06,6.6e-05,0.000216,0.000165,7e-05,2e-05,1.9e-05,1.3e-05,1.3e-05,2.9e-05,2e-05,1.3e-05,6e-06,1.5e-05,1.2e-05,9e-06,4e-06,4e-06,7e-06,8e-06,5e-06,5e-06,3e-06,2e-06,3e-06,5e-06,4e-06,6e-06,8e-06
3e-06,2e-06,1e-06,3e-06,3e-06,2e-06,3e-06,4e-06,2e-06,1e-06,2e-06,2e-06,2e-06,3e-06,3e-06,4e-06,5e-06,3e-06,5e-06,7e-06,1.2e-05,1.1e-05,6e-06,6.5e-05,3.7e-05,0.000218,6.1e-05,2e-05,1.1e-05,1.7e-05,4.8e-05,2.4e-05,1.5e-05,2.4e-05,4.5e-05,3.3e-05,2.1e-05,1.1e-05,4e-06,0.000118,0.000385,0.000102,0.000189,0.00019,0.000635,0.000574,0.000449,0.000195,0.000347,0.000206,0.000161,0.000168,0.000104,0.000176,0.000244,0.000211,0.000147,0.000251,0.000344,0.000265,0.000193,0.000176,0.000106,0.000156,0.000288,0.000322,0.000133,0.000313,0.000162,0.00014,0.000142,0.000148,4.8e-05,9.4e-05,0.000147,5.3e-05,0.000121,0.000165,5.9e-05,9.5e-05,6.7e-05,5.2e-05,4.9e-05,0.000116,0.000137,7e-05,5.3e-05,3.3e-05,6e-06,3.3e-05,9e-06,2.6e-05,1.6e-05,5.9e-05,0.000209,0.000127,2.4e-05,7e-06,1.1e-05,6e-06,6e-06,1.6e-05,1.3e-05,8e-06,8e-06,1.9e-05,1.3e-05,1e-05,4e-06,1e-06,3e-06,3e-06,4e-06,4e-06,5e-06,4e-06,2e-06,3e-06,1e-06,4e-06,4e-06
1e-06,2e-06,2e-06,2e-06,0,0,3e-06,0,1e-06,2e-06,1e-06,1e-06,1e-06,1e-06,2e-06,3e-06,4e-06,3e-06,5e-06,6e-06,1.6e-05,1.4e-05,7e-06,5.6e-05,5.3e-05,0.000131,0.000121,1.8e-05,1.1e-05,3e-05,2e-05,2e-05,3e-05,2.4e-05,7.9e-05,5.3e-05,3.2e-05,1.9e-05,9e-06,9.2e-05,0.000453,5.1e-05,0.000341,0.000211,0.000539,9.7e-05,0.00018,0.00021,9.8e-05,0.000327,0.000272,0.000141,0.000102,0.000377,0.000396,0.000238,0.000347,0.000226,0.000251,3.9e-05,6.6e-05,0.000198,0.000155,9.5e-05,0.000331,0.000145,0.000116,0.000257,0.00015,0.000114,0.000159,5.1e-05,4.5e-05,6.5e-05,0.000143,0.000108,5.2e-05,9e-05,3.6e-05,0.000179,5.5e-05,7.8e-05,1.2e-05,0.000117,7.5e-05,8.3e-05,7.6e-05,1.3e-05,1.5e-05,1.6e-05,2.8e-05,3.2e-05,1.5e-05,5.3e-05,0.000193,4.1e-05,4.3e-05,4.3e-05,2.3e-05,4e-06,4e-06,1.5e-05,2.1e-05,9e-06,5e-06,2.3e-05,1.3e-05,1e-06,3e-06,4e-06,2e-06,4e-06,6e-06,2e-06,2e-06,0,1e-06,2e-06,1e-06,3e-06,0
1e-06,1e-06,1e-06,2e-06,2e-06,1e-06,2e-06,3e-06,2e-06,2e-06,3e-06,2e-06,1e-06,0,1e-06,1e-06,4e-06,1e-06,3e-06,6e-06,3.2e-05,1e-05,6e-06,5.7e-05,7e-05,0.000118,3.6e-05,4.5e-05,3.4e-05,3.4e-05,5.1e-05,9e-06,3.8e-05,2.2e-05,5.9e-05,4e-05,3.3e-05,8e-06,2.6e-05,0.000131,0.000389,0.000369,0.000175,0.00015,0.000377,0.000249,0.000299,0.000127,0.000337,0.000276,0.000221,8e-05,7.7e-05,0.000305,0.000245,0.000283,0.00025,0.000244,0.000155,0.000106,7.9e-05,0.00027,3.6e-05,9e-05,0.000288,0.000485,2.9e-05,0.000322,5.6e-05,6.1e-05,0.000137,8.7e-05,7.5e-05,8.8e-05,5e-05,0.000105,6e-06,6.8e-05,3.4e-05,0.000172,0.000127,0.000115,6.2e-05,0.000123,3.3e-05,6.9e-05,7.7e-05,7.3e-05,4.6e-05,3.7e-05,3.4e-05,9e-06,1.1e-05,4.3e-05,0.000218,0.000162,4.6e-05,3.7e-05,2.9e-05,1.7e-05,9e-06,3.3e-05,3.1e-05,1.6e-05,5e-06,1.5e-05,1.7e-05,9e-06,2e-06,7e-06,1e-06,3e-06,1e-06,1e-06,3e-06,3e-06,1e-06,5e-06,3e-06,3e-06,3e-06
2e-06,2e-06,1e-06,3e-06,0,1e-06,1e-06,2e-06,3e-06,2e-06,3e-06,3e-06,2e-06,1e-06,0,1e-06,3e-06,2e-06,1e-06,7e-06,2.8e-05,1.8e-05,6e-06,6.2e-05,0.000261,0.000255,0.000186,3.6e-05,1.2e-05,1.3e-05,1.1e-05,3.6e-05,4e-05,7.5e-05,7.5e-05,4.2e-05,4.3e-05,4.7e-05,4.8e-05,0.000154,0.000221,0.000336,0.000195,0.000274,0.000644,0.000334,0.000349,0.000253,0.00019,0.000236,0.000232,9.2e-05,8.7e-05,0.000214,0.000275,0.000355,0.000224,0.000234,0.000156,0.000136,5.4e-05,0.00031,0.000104,8.7e-05,0.000159,0.000129,0.000227,0.000202,0.000145,6.6e-05,6.5e-05,8.5e-05,7.1e-05,5.8e-05,9.3e-05,5.6e-05,7.1e-05,7.5e-05,3.8e-05,0.000131,4.8e-05,1.9e-05,3.3e-05,0.000113,5.2e-05,9e-06,2.8e-05,4.1e-05,1.2e-05,2.4e-05,1.8e-05,2.1e-05,2.6e-05,9.7e-05,0.000287,0.000282,0.00011,1.5e-05,3.5e-05,2.2e-05,2e-06,4.3e-05,4.1e-05,1.8e-05,2e-06,1.3e-05,2.3e-05,1.2e-05,3e-06,4e-06,5e-06,4e-06,5e-06,1e-06,3e-06,1e-06,4e-06,7e-06,3e-06,3e-06,3e-06
1e-06,3e-06,1e-06,4e-06,3e-06,1e-06,3e-06,1e-06,3e-06,2e-06,1e-06,1e-06,2e-06,2e-06,3e-06,2e-06,2e-06,2e-06,1e-06,8e-06,1.4e-05,1e-05,7e-06,7.1e-05,0.000367,0.000324,0.000132,2e-05,3.4e-05,3.5e-05,5.4e-05,3.4e-05,2.5e-05,5.4e-05,2e-04,8.1e-05,2.7e-05,1.7e-05,1.4e-05,0.000193,0.000275,6.9e-05,0.000421,3e-06,0.000605,0.000466,0.000187,4.9e-05,0.000249,0.000212,0.00028,5.3e-05,9e-06,0.000119,0.000233,0.000315,0.000355,0.000235,0.000174,0.000154,6.4e-05,0.000247,7.1e-05,0.000111,7.5e-05,0.000118,0.000268,0.00033,0.000168,1e-04,7.9e-05,0.000222,8.5e-05,6.8e-05,0.000168,9.5e-05,1.9e-05,0.000101,4.5e-05,0.000106,7.5e-05,3e-05,5.9e-05,9.8e-05,4.5e-05,3.5e-05,4.6e-05,5e-06,2.4e-05,3e-05,9.1e-05,5e-05,1e-05,0.000104,0.000481,0.000146,5.9e-05,1.9e-05,2.1e-05,2.4e-05,1.9e-05,5.5e-05,3.7e-05,1.4e-05,2e-06,1.4e-05,1.7e-05,7e-06,4e-06,5e-06,4e-06,4e-06,2e-06,5e-06,3e-06,2e-06,3e-06,4e-06,2e-06,5e-06,4e-06
1e-06,0,2e-06,5e-06,2e-06,2e-06,3e-06,2e-06,2e-06,1e-06,0,1e-06,2e-06,2e-06,2e-06,2e-06,1e-06,1e-06,2e-06,8e-06,2.4e-05,1.1e-05,1.2e-05,6.1e-05,0.000283,0.000244,7.3e-05,1.1e-05,4.2e-05,5.2e-05,3.7e-05,3e-05,2e-05,5.9e-05,0.000266,0.000189,8.8e-05,2.2e-05,1.2e-05,0.00022,0.00024,0.000325,0.000455,0.000372,0.000502,0.000499,0.000544,0.00035,0.00022,0.000121,0.000178,0.000252,0.000157,0.000252,0.000417,0.000347,9.9e-05,0.000262,0.000148,0.000213,0.000177,0.00024,0.000107,0.00014,0.000102,0.000285,0.000247,0.000215,0.000276,0.000313,0.000183,0.000281,8.6e-05,2.1e-05,0.000179,4.9e-05,0.000246,6.5e-05,3.4e-05,0.000167,0.000219,0.000224,7e-05,0.000112,9.4e-05,0.000115,2.7e-05,3.8e-05,4.7e-05,4.3e-05,0.000105,5.8e-05,2.6e-05,9e-05,0.00065,0.000361,0.000158,3.7e-05,4e-06,7e-06,1.4e-05,5.3e-05,2.7e-05,1.6e-05,4e-06,1.4e-05,4e-06,4e-06,4e-06,1e-06,3e-06,1e-06,2e-06,5e-06,9e-06,3e-06,1e-06,4e-06,3e-06,3e-06,2e-06
2e-06,2e-06,1e-06,1e-06,2e-06,2e-06,5e-06,4e-06,1e-06,1e-06,2e-06,1e-06,2e-06,1e-06,2e-06,2e-06,2e-06,1e-06,2e-06,9e-06,3.2e-05,1.3e-05,9e-06,6e-05,0.000161,0.000218,0.000127,4.8e-05,6.3e-05,5.1e-05,7e-05,2.1e-05,2.8e-05,4.4e-05,0.000211,0.000122,1.8e-05,4.1e-05,3e-05,0.000239,0.000144,0.000106,0.000778,0.000479,0.000798,0.000764,0.000194,0.000406,0.000284,0.000159,0.000198,0.000103,8e-05,0.000474,0.000115,0.000419,0.000234,0.000173,3.8e-05,1.5e-05,0.000253,0.000459,0.000172,0.000108,9.4e-05,0.000121,0.000296,0.000283,0.000168,0.000193,9.9e-05,0.000266,0.000283,0.000129,0.000147,0.000214,0.000424,0.000327,0.000135,0.000181,0.000133,9.5e-05,8.1e-05,0.000137,7.8e-05,1.8e-05,7.4e-05,0.000111,3.5e-05,7.1e-05,7.1e-05,2.7e-05,1.5e-05,2.8e-05,0.000694,0.000436,2e-04,3.1e-05,4e-06,7e-06,2e-05,6.2e-05,3.2e-05,1.4e-05,8e-06,9e-06,5e-06,4e-06,3e-06,3e-06,5e-06,3e-06,0,3e-06,5e-06,5e-06,4e-06,4e-06,2e-06,5e-06,4e-06
1e-06,3e-06,2e-06,2e-06,2e-06,1e-06,3e-06,2e-06,1e-06,2e-06,2e-06,2e-06,2e-06,2e-06,2e-06,3e-06,1e-06,2e-06,1e-06,6e-06,1.9e-05,1.8e-05,1.2e-05,5.1e-05,0.000144,8.7e-05,4.6e-05,1e-05,5.1e-05,4.3e-05,4.5e-05,9e-06,3.9e-05,1.9e-05,0.000172,0.000107,6.9e-05,5e-06,6e-06,2e-04,0.00023,0.000354,0.001098,0.000644,0.000826,0.001089,0.00043,2.7e-05,0.000277,0.000217,0.000143,0.000227,7.4e-05,0.000527,0.000318,0.000172,0.000236,0.000225,3.3e-05,4.8e-05,0.000324,0.000159,7.2e-05,0.000106,0.000113,0.000154,0.000104,0.000161,0.000186,0.000226,0.000215,9.4e-05,0.000146,6.6e-05,0.000216,0.000289,0.000138,0.000161,6.9e-05,2.5e-05,9.9e-05,0.000151,0.000101,1e-04,7.7e-05,6.2e-05,7.7e-05,7.5e-05,8.5e-05,6.8e-05,8.9e-05,5.6e-05,2.7e-05,2.9e-05,0.000668,0.000421,0.000158,3.1e-05,2.5e-05,1.2e-05,2.1e-05,3.7e-05,1.1e-05,1e-05,1.3e-05,9e-06,1.6e-05,1.2e-05,8e-06,1e-06,2e-06,1e-06,2e-06,2e-06,6e-06,3e-06,0,2e-06,1e-06,4e-06,2e-06
2e-06,0,1e-06,1e-06,1e-06,1e-06,1e-06,1e-06,1e-06,1e-06,1e-06,2e-06,1e-06,2e-06,1e-06,0,1e-06,2e-06,1e-06,4e-06,7e-06,6e-06,3e-06,5.4e-05,0.000105,0.000166,4.4e-05,3.2e-05,5.9e-05,1.9e-05,2.9e-05,1.9e-05,2.5e-05,6e-06,9.4e-05,3.7e-05,2.4e-05,1.6e-05,8e-06,0.000145,8.4e-05,0.000428,0.000485,0.000189,0.000572,0.000425,0.000436,0.000281,0.000129,8.9e-05,8.4e-05,0.000254,0.000183,0.000338,0.00023,0.000135,0.000262,0.000135,0.000107,0.000115,0.000421,0.000411,0.000147,0.000204,6e-05,8.1e-05,0.000117,0.000189,0.00027,1e-04,3.1e-05,0.000135,3.1e-05,5.9e-05,0.000147,7e-05,0.000121,8e-06,5.4e-05,9.2e-05,6.7e-05,0.000151,0.00012,0.000127,4.6e-05,4.2e-05,3.8e-05,2.2e-05,2.9e-05,2.9e-05,3.8e-05,2.7e-05,7e-06,4.1e-05,0.000439,0.000301,0.000118,1.7e-05,2.1e-05,9e-06,8e-06,2.3e-05,4e-06,1.1e-05,6e-06,4e-06,8e-06,2e-06,3e-06,5e-06,3e-06,2e-06,3e-06,2e-06,2e-06,2e-06,1e-06,3e-06,1e-06,1e-06,1e-06
1e-06,0,1e-06,0,1e-06,1e-06,1e-06,1e-06,0,0,1e-06,1e-06,0,2e-06,1e-06,1e-06,1e-06,0,1e-06,5e-06,3e-06,1e-06,3e-06,5.2e-05,2.8e-05,0.000154,4.6e-05,2.7e-05,2.8e-05,9e-06,3.8e-05,1e-05,1.1e-05,1.5e-05,4.5e-05,1.5e-05,2e-06,2e-06,3e-06,8.9e-05,0.000196,0.000486,8.8e-05,0.000128,0.000227,0.000259,0.000318,3e-04,0.00011,0.000176,0.000155,0.000131,0.000108,0.000117,5.8e-05,0.000206,0.000197,8.1e-05,0.000164,0.000148,0.000214,0.000153,7e-05,0.000206,0.000158,0.000141,9.8e-05,7.6e-05,9.4e-05,0.000107,8.9e-05,4.5e-05,6e-06,4.9e-05,6.8e-05,6.6e-05,0.000116,2.6e-05,4.5e-05,6.3e-05,4.6e-05,5.7e-05,1.8e-05,6.4e-05,1.7e-05,2.2e-05,4.7e-05,1.7e-05,1.1e-05,1.9e-05,1.5e-05,8e-06,6e-06,5e-05,0.000202,6.2e-05,4.7e-05,1.5e-05,1.1e-05,6e-06,6e-06,1.9e-05,4e-06,7e-06,6e-06,6e-06,1e-06,2e-06,1e-06,3e-06,2e-06,1e-06,2e-06,1e-06,1e-06,1e-06,1e-06,2e-06,1e-06,1e-06,1e-06
1e-06,1e-06,0,0,1e-06,0,1e-06,0,0,0,1e-06,1e-06,0,2e-06,0,1e-06,1e-06,1e-06,1e-06,5e-06,1e-06,2e-06,3e-06,5e-05,3e-05,0.000146,6.9e-05,4e-06,1.3e-05,8e-06,3.1e-05,5e-06,1.1e-05,4e-06,2.2e-05,6e-06,4e-06,3e-06,4e-06,5.2e-05,0.000127,0.000465,4.3e-05,0.000113,5.4e-05,0.000214,0.000126,0.000133,0.000237,0.000225,2.8e-05,0.000261,3.7e-05,0.000161,8.7e-05,0.000131,0.000142,0.000173,4.6e-05,0.000158,0.000236,0.000209,0.000107,8.3e-05,0.000109,9.3e-05,0.00013,7.6e-05,6.7e-05,5.1e-05,5.7e-05,4.6e-05,7e-06,5.3e-05,3.9e-05,5.3e-05,8e-05,3e-05,3.9e-05,4.6e-05,2.1e-05,3.8e-05,2.5e-05,7.2e-05,1.9e-05,9e-06,3.3e-05,1e-05,1.3e-05,2e-05,6e-06,2e-06,4e-06,4.6e-05,6.5e-05,1e-05,1.3e-05,3e-06,2e-06,3e-06,5e-06,1.8e-05,4e-06,5e-06,1e-06,4e-06,1e-06,2e-06,1e-06,2e-06,2e-06,0,1e-06,1e-06,1e-06,1e-06,0,1e-06,1e-06,2e-06,1e-06
1e-06,1e-06,0,0,1e-06,0,1e-06,0,0,0,1e-06,1e-06,0,1e-06,1e-06,1e-06,1e-06,0,1e-06,5e-06,4e-06,1e-06,1e-06,4.6e-05,2.8e-05,0.000142,7e-05,2e-06,1.3e-05,3e-06,3.1e-05,5e-06,1.1e-05,7e-06,1.7e-05,1e-05,1e-06,2e-06,1e-06,2.7e-05,0.000186,0.000347,6.4e-05,0.000122,0.000103,0.000251,0.000126,0.000191,0.00013,0.00017,0.00012,0.000152,7e-06,0.000127,0.000108,0.000128,0.000174,0.000137,8.3e-05,4.2e-05,0.000133,0.000172,6.4e-05,9.2e-05,8.9e-05,7.3e-05,0.000172,0.000139,5e-06,5e-05,4.6e-05,4.3e-05,3e-06,5.7e-05,3e-05,6.3e-05,7.8e-05,3.6e-05,3.3e-05,4.7e-05,1.4e-05,3e-05,1.9e-05,6.2e-05,1e-05,1e-06,3.1e-05,4e-06,8e-06,2.2e-05,5e-06,2e-06,5e-06,4.3e-05,3.7e-05,4e-06,1.1e-05,8e-06,5e-06,3e-06,4e-06,1.6e-05,1e-06,1e-06,1e-06,4e-06,2e-06,2e-06,0,1e-06,2e-06,0,2e-06,0,0,0,0,1e-06,1e-06,1e-06,1e-06
