0.000401,-4e-05,-0.001017,-0.001704,-0.000905,-0.000331,-0.000192,-0.000141,-0.001108,-0.000122,-0.000701,-9.2e-05,-0.000803,-0.000605,-0.000415,-0.000792,-5.3e-05,-0.000309,-0.000281,-0.000313,8e-05,0.00046,0.000331,-0.00014,-0.001098,-0.000475,0.000368,-0.000173,-5.3e-05,-0.000771,0.000907,0.000131,-0.000323,-0.000475,0.000932,0.000472,-0.000294,-0.000438,0.00029,0.000172,-0.000231,-0.000948,-0.000414,-0.000258,-9.5e-05,-0.000572,-0.000409,-0.001648,-0.001249,-0.000877,1.5e-05,-0.000553,-0.000748,-0.000685,-0.000474,-0.000303,-0.001238,-0.001619,-0.001109,-0.00099,-9e-04,-0.001075,-0.000696,-1.4e-05,0.000386,0.000189,-0.000255,-0.000258,0.000763,0.000483,0.000922,0.00035,-0.000252,-0.000375,-0.000178,-0.000536,0.00034,0.000119,4e-05,-0.00099,-0.000349,0.000119,-0.00029,0.000205,0.000541,-6.9e-05,-0.000202,-0.000286,-0.001092,-0.000382,-0.000164,0.000358,0.000496,-0.000163,-0.000334,0.000407,-5.5e-05,0.000158,0.000501,-0.000498,-0.000399,-0.000745,-0.000717,0.000162,2.3e-05,-0.000582,-0.001022,-0.000149,-0.000308,0.000418,2.4e-05,-0.00042,0.000332,0.000103,0.000334,0.00032,0.000645,0.00018,-0.000258,0.000102,-0.000256
0.000205,6.7e-05,0.00084,0.000849,0.000413,-1.9e-05,-0.000736,0.000351,-6.3e-05,-0.000537,-0.000284,-0.000465,4.3e-05,0.00072,0.000244,0.000274,-0.000568,-1e-04,0.00066,0.000944,0.001365,0.000877,0.000792,-0.000564,-6.1e-05,0.000479,-8.8e-05,-0.00017,-1.7e-05,-0.000196,-0.000581,-0.000122,5.5e-05,0.000257,0.000438,-0.000774,0.000233,0.000834,0.000637,-0.00011,0.000137,0.001045,3.8e-05,5e-05,-4.7e-05,-0.000274,-6.5e-05,0.000936,0.000813,0.000497,-0.001234,-0.000744,6.7e-05,0.000418,-0.000741,-0.000254,-0.000186,0.000798,0.000215,0.000109,0.000462,-0.000428,0.000263,-0.000615,-0.00089,-0.000133,-1.3e-05,-0.000633,-0.001011,-0.000164,-0.000255,0.000265,-0.000194,2.8e-05,-0.000152,-0.001328,-2.3e-05,-7e-05,0.000874,-0.000496,0.000391,-0.000563,0.000177,0.000312,0.000524,0.000372,-0.001457,-0.001164,-0.000423,0.000761,0.000412,0.000473,-0.001023,7.1e-05,0.000497,-0.000672,-0.000168,0.000186,0.00023,0.000539,-0.000141,-0.00012,0.000599,0.000618,-0.000217,0.000459,0.000584,0.000603,-0.000965,0.000101,0.00032,0.000846,2e-06,0.000104,-0.000632,-0.000272,-0.000301,-0.000439,-0.000684,-0.00034,0.000432
-0.000339,-0.000306,-0.000599,-0.000176,-0.000103,-0.000383,-3.8e-05,-8e-05,-5.8e-05,0.000231,-6e-06,-0.001175,-0.00072,-0.000302,-0.000693,-0.000511,-0.001119,-6.6e-05,0.000329,0.000371,-0.000419,1.8e-05,0.000109,-0.000617,0.000135,-0.001164,-0.000864,-0.00029,-0.000722,-0.000461,-0.000403,-0.000574,-0.000468,-2e-05,-0.000226,-0.001051,0.000168,-0.00111,-0.000124,0.000822,0.000488,-0.000537,0.000221,7.3e-05,0.000193,-0.00064,-0.000659,-0.000824,-2.8e-05,-0.000502,-0.000894,-0.000199,-0.000416,-0.001206,-0.000615,4.5e-05,0.000796,-0.000641,-0.000197,0.000197,-0.001206,-5.7e-05,0.000105,-0.000422,0.000249,-0.000218,0.000545,-2e-06,0.000308,-0.001537,-0.001096,-0.000879,-0.000503,-0.000282,-0.000498,0.00021,5.6e-05,-0.001434,-0.001058,-0.000756,-0.000871,0.000719,0.000309,-0.000168,-0.000683,-0.000715,0.000486,0.000417,0.00062,-0.000141,0.000702,-0.000439,-0.000665,-0.000579,0.000103,7.9e-05,-0.000259,0.000555,0.000203,-0.000401,-0.00078,-0.000641,0.000216,-6.2e-05,-0.001064,-0.000324,0.000118,-5.5e-05,-0.000216,0.000323,-0.000297,0.000366,-7.3e-05,-0.000269,0.000524,0.000405,-0.000376,-0.000239,-6.4e-05,-0.000804,-0.000791
-0.000245,-5.3e-05,0.000479,0.000325,-0.000767,-0.000351,0.000166,0.000241,-0.000478,4.4e-05,0.000638,0.000702,0.000288,-0.000604,-0.000463,8.8e-05,0.000777,0.000321,-0.000188,-0.000158,-0.000111,-0.000217,9.6e-05,0.000177,0.000227,2e-05,3.2e-05,0.000196,0.000195,0.000666,-5.7e-05,-0.000317,-0.000124,-0.000238,-0.000373,0.000717,0.000713,0.000469,0.000428,-0.000381,-0.00035,-0.000569,-0.000244,-0.000164,0.000204,0.000297,0.00027,0.000816,0.000205,-0.000415,0.000544,0.00076,0.000375,-8e-06,0.000101,-9.5e-05,-0.000972,2.1e-05,0.00021,-0.000302,0.000165,0.000222,-0.000936,-0.001029,0.000665,0.000474,4.1e-05,0.000425,0.000343,4.3e-05,0.000753,-0.000154,0.000225,-0.000365,-0.000405,-0.000252,-0.000297,-0.000777,-0.00017,4.1e-05,0.000683,-0.000521,-0.000123,0.000112,0.000186,0.000109,-0.000413,-0.000451,-7.7e-05,-0.000314,-0.000541,-0.000496,0.00014,0.000207,-0.00017,2e-05,-0.000921,-0.000406,0.000211,-0.000301,-7e-06,7.7e-05,-0.00065,0.00036,9.7e-05,2.1e-05,-0.000223,-0.000935,0.00057,0.000344,-0.000681,-0.000257,-0.000125,-0.00027,-0.000492,0.000306,-0.00123,0.000119,0.000276,0.000251,0.001227
-0.000224,-0.001115,-0.000838,-0.000473,5.4e-05,-6.2e-05,-0.000456,-0.000278,0.000618,0.000204,-0.000336,9e-06,0.000592,0.000169,-0.000454,-0.000121,-0.00019,-0.000129,-6.2e-05,0.000138,-0.000508,-0.000381,-5e-04,-0.000705,-0.000749,-0.000825,-0.00111,-0.000184,0.000226,-0.000236,1e-05,-0.000832,3.6e-05,0.000257,-0.000245,0.00056,0.000419,-0.000246,-0.000496,-0.000697,4.6e-05,-0.000199,0.000577,0.000215,0.000128,0.000413,-0.00016,-0.00066,-0.000144,-0.000498,2.3e-05,0.000528,0.000653,0.000351,0.000116,-0.000247,-0.000209,-0.00013,-7e-06,7e-05,-0.000498,-0.000315,0.000127,0.000105,3e-04,-0.000121,0.000262,0.000235,0.00017,-0.000235,-0.000181,-0.000797,-0.000691,-0.000135,-0.00026,0.000414,6.7e-05,5.9e-05,-0.000698,0.000288,0.000332,-0.000228,-0.00025,-0.000742,-0.000966,-0.000202,-4.7e-05,2.1e-05,-6.9e-05,-0.000117,-0.000694,-0.000446,0.000241,-0.001549,-0.000411,-0.000417,-0.00038,-0.000469,-8.5e-05,-0.000293,-0.00032,-0.000285,0.000147,-0.000129,0.00024,-0.000249,0.00061,0.000746,-1.7e-05,-0.000455,0.000352,-5.9e-05,-0.000183,0.000197,-0.00027,-0.000452,-0.000507,4.5e-05,-7.5e-05,0.000478,-0.000263
-0.000637,-0.000212,-9.8e-05,-0.000233,-0.000233,-0.000506,-0.000135,0.000243,1.8e-05,-0.000197,-0.000357,1.8e-05,-0.000312,-0.000657,0.000207,-0.000239,-0.000222,-0.000815,-0.00049,-0.000365,-0.000307,-0.000674,-0.000488,3e-05,-0.000152,0.000556,-6.6e-05,-0.000429,0.000106,0.000135,6.8e-05,-1.3e-05,-0.000141,-0.000121,-1.5e-05,8.9e-05,-0.001195,-0.000679,-0.000422,-0.000266,-0.001017,-0.000908,-0.000679,-0.000568,-0.000283,-0.000419,-0.000118,-0.000113,-0.000265,0.000393,-9.8e-05,-0.000846,-0.000417,-0.000951,0.000286,-0.000253,-0.000299,-0.000178,-0.000242,-5.1e-05,0.000705,-0.000352,0.000248,-0.000122,-0.000232,0.00033,-0.000508,-0.000292,-0.00042,-0.00032,-0.000186,0.000121,0.000646,0.000386,0.000169,0.000308,0.000232,3.7e-05,-0.000121,0.000207,0.000413,-0.000143,0.000446,-0.000328,9.4e-05,-0.001034,-0.000531,0.000494,0.000189,-0.000213,-0.000145,-0.000147,-0.000281,0.000397,-0.000321,-0.000339,0.000561,0.00038,-2.8e-05,-7.9e-05,-0.000711,-0.000102,7.7e-05,-0.000334,-0.00016,-0.00015,-0.000901,-0.001059,-0.000331,-0.000342,-0.000314,6.1e-05,-0.000806,-0.000713,-0.000159,-0.000464,2.8e-05,2.9e-05,-1.1e-05,-0.000162,-0.000509
-6.8e-05,9e-06,-0.000664,-0.000244,1.6e-05,0.000331,4.8e-05,-0.000438,-0.000143,-0.000174,-0.000144,-0.000149,-0.000427,0.000526,-0.000256,-0.000327,0.000791,0.000717,7.3e-05,-0.000355,-0.000193,-0.000285,-0.000441,-9.3e-05,0.000251,-0.000321,-6e-06,-0.000111,3.9e-05,-0.000101,-0.000347,0.000334,0.000304,1.5e-05,-0.000162,-0.000408,0.000244,-2.8e-05,-0.000473,-0.000341,-0.000111,0.000242,0.000247,4.5e-05,-8.9e-05,-3.2e-05,0.000266,0.000261,-0.000357,-0.000207,-0.000281,-0.000217,-0.000185,0.000164,-0.000702,0.000164,-0.000125,-6.3e-05,0.000172,0.000206,-0.00023,0.000275,-0.000364,-0.000499,-0.00019,7.8e-05,-0.000116,-9.7e-05,-0.000362,-0.000532,-0.00088,-0.000285,-0.000664,-0.000272,0.000203,-0.000437,0.000337,0.000155,-0.000308,-0.000328,-0.001066,0.000232,-0.000994,-4.1e-05,-0.000645,-0.000304,-0.000283,-5.8e-05,-0.000684,-0.000226,-0.00037,-5e-04,-0.000181,0.000213,-0.000302,-0.000178,-0.000253,-0.00068,-0.000502,-0.000478,-0.000211,-0.000177,0.000432,-0.000222,0.000336,0.000197,0.000144,0.000543,-0.000502,7.9e-05,-0.000359,-0.000418,0.000141,-0.000483,-0.000484,-0.000232,-9e-05,0.000399,-0.000591,-0.000652,-0.000575
-0.000319,3.8e-05,0.000255,6.5e-05,-8.3e-05,-2.3e-05,0.000238,0.000269,0.000183,-0.000162,8.9e-05,0.00045,-0.000107,-0.000393,6.6e-05,0.000486,-0.000258,-5.2e-05,0.000228,-9.1e-05,9.9e-05,-0.000127,-5.5e-05,0.000266,0.000105,0.000262,0.000399,-0.000259,-0.000388,1.2e-05,0.000283,0.000209,-0.000455,-9.6e-05,-9e-05,-0.000155,0.000151,0.000232,-0.000312,-0.000559,-0.000105,-0.000252,-0.000461,-0.000185,-3.2e-05,0.000362,0.00036,2.7e-05,0.000271,0.000396,3.4e-05,-7.4e-05,0.000111,-0.000121,-9.1e-05,0.000135,0.000239,0.000171,2.9e-05,-0.000251,-3.4e-05,-0.00011,0.000346,0.000238,-0.000345,-0.000667,3.9e-05,1.9e-05,0.000381,0.000169,-0.000266,-0.000497,-0.000427,-1.8e-05,2e-05,0.000256,-0.000408,-0.000165,0.000588,-0.000144,0.000136,-0.000141,-0.000338,-0.000833,-0.000654,-0.000337,0.000176,-0.000417,0.000457,0.000296,-4.6e-05,-0.000166,-0.000543,-0.000166,0.00023,1e-05,-2.4e-05,-8.1e-05,-0.000213,-0.000359,0.000332,0.000213,-0.00034,-0.000338,0.000194,8.7e-05,-0.000248,-0.000304,-0.000297,0.000196,0.000267,-7.7e-05,-0.000101,-0.000137,-0.000471,-4.4e-05,-0.000232,-0.000817,-2.4e-05,0.000427,0.000287
0.00029,3.2e-05,0.000207,-0.00041,3.1e-05,0.000154,-0.000107,-5e-06,9e-05,0.000519,8.1e-05,-0.000101,0.000391,0.000226,0.000336,8.7e-05,0.000101,0.000208,0.000145,1e-04,-0.00024,-9.8e-05,7.7e-05,1.7e-05,-0.000108,-0.000308,-0.000293,5.1e-05,-0.000102,-1.5e-05,0.000157,-0.000196,0.000196,0.000213,0.00026,-0.000323,-7e-06,-1.9e-05,0.000166,0.000115,-0.000124,-0.000263,-0.000183,-1e-06,-0.00012,-0.000196,-0.000267,-1.4e-05,-0.000265,-0.000244,-0.000266,0.000291,0.000175,0.000366,-0.000196,-0.000205,0.000444,0.000153,4.1e-05,2.9e-05,0.000133,0.000474,-7.9e-05,0.000175,0.000104,-0.000447,-0.000251,-0.000268,-0.000235,0.000508,3.7e-05,-0.00012,-0.000224,0.000136,7.9e-05,-4.4e-05,-0.000236,3.1e-05,0.000661,6.9e-05,6.8e-05,-0.000181,0.000539,0.000548,6.1e-05,0.000267,0.000172,-0.000247,-0.000221,-0.00024,-3e-06,7.3e-05,-0.000222,-0.000121,-0.00029,-3.4e-05,1e-05,-5.2e-05,-3.3e-05,0.000319,0.000249,0.000109,-0.000217,0.00014,0.000158,0.000337,0.000138,-0.000391,0.000129,-0.000275,-0.000253,-0.000373,-0.00022,0.000183,1.2e-05,-0.000108,-6.1e-05,1.2e-05,0.000371,-8.2e-05,9.7e-05
-3.6e-05,1.9e-05,0.000137,0.000201,6.8e-05,0.000353,0.000191,-0.000385,-0.000183,-0.000107,9e-06,-0.000315,-9e-05,-0.000231,-0.000131,0.000125,2.1e-05,-0.000318,-0.000226,0.000164,5.3e-05,0.000194,0.000119,0.000131,0.000383,8.8e-05,0.000194,1.1e-05,0.000232,-1.2e-05,-0.000391,-8.5e-05,-0.000302,-1e-05,-0.000233,1.6e-05,-0.000383,-0.000306,-0.000173,5.6e-05,-3e-06,5.2e-05,4e-05,-2.8e-05,-0.000103,-3.2e-05,-0.000321,3.1e-05,-5e-06,0.000177,0.000371,-6.2e-05,-0.000314,-5e-06,0.00033,-4.9e-05,-0.000179,-1.7e-05,2.9e-05,-2.9e-05,1.1e-05,-0.000236,5e-05,-3e-05,-0.000271,0.000247,-0.000319,-0.000247,1e-05,-5.1e-05,-0.000112,0.000439,-2.3e-05,7e-06,-0.000282,-0.000126,0.000167,-0.000141,-0.000175,-2e-05,0.000238,-0.000254,-0.000381,-0.000205,0.000453,-0.000177,-9e-06,2.1e-05,-0.000121,-5.1e-05,1e-05,-1.3e-05,1.2e-05,-0.00037,0.000115,-0.000292,0.000298,0.000231,-1.4e-05,0.000174,0.000359,-2.6e-05,-0.000117,0.000139,0.000109,-0.000633,-0.000358,-6.3e-05,-0.000226,-0.000288,0.000135,-0.00033,1.7e-05,-6.5e-05,0.000187,0.000165,0.000454,-0.000157,-0.000209,-0.000171,2e-06
-9.2e-05,-2.5e-05,-0.000276,3.5e-05,4.6e-05,-0.000484,-0.000128,-2e-04,3.5e-05,-0.000145,-0.000203,8.8e-05,-5.5e-05,0.000106,1.8e-05,-9.6e-05,-5.2e-05,-3e-05,-7e-06,0.000152,0.000199,0.000183,9.6e-05,3.9e-05,7.5e-05,-1.7e-05,-0.000156,0.000176,-0.000319,-1.7e-05,-4e-05,4.1e-05,-0.000113,-3e-05,6.3e-05,8.1e-05,-0.000144,0.00014,0.000372,0.00018,0.000131,0.000217,8.7e-05,8.1e-05,2e-06,1.1e-05,6.5e-05,-6.6e-05,0.000148,0.000115,6.2e-05,0.000115,-4.7e-05,-0.000108,3e-06,-3.3e-05,-3e-05,-6.2e-05,-8.1e-05,1e-05,-7.5e-05,-2e-06,7.3e-05,1e-05,5.4e-05,0.000164,0.000121,0.000169,0.000121,-0.000292,5.2e-05,-0.000164,0.000272,0.000178,-7.6e-05,5.5e-05,0.000111,0.000332,-0.000247,-0.000294,-0.000241,0.000523,0.000291,7.4e-05,9.2e-05,0.000263,5.6e-05,0.000111,0.00037,1.5e-05,5e-05,0.000174,0.000135,0.000287,0.000154,0.000371,-0.000127,0.000144,0.00018,-0.000155,3.7e-05,0.000138,-1.2e-05,-1.8e-05,-0.000125,3.1e-05,0.000132,-3.1e-05,0.000392,-3.1e-05,-0.000192,0.000128,6.5e-05,0.000159,0.000143,-7.3e-05,3.7e-05,-9e-06,-0.000193,-7.1e-05,-0.000174
0.000277,0.000154,0.000302,0.000254,5.9e-05,0.000238,-4.1e-05,0.000213,1.7e-05,-2.9e-05,0.000151,1.2e-05,3.2e-05,0.000134,-0.000201,-3.7e-05,-3.9e-05,-2.3e-05,6.4e-05,-0.000142,3.5e-05,-0.000103,7e-06,-1.4e-05,-4.1e-05,-0.000298,-2.5e-05,7.3e-05,-0.000134,-9.1e-05,0.000205,0.000144,0.000201,1e-06,2.6e-05,3e-05,0.000243,8.5e-05,3e-05,-0.000292,-0.00012,0.000189,5.7e-05,3.9e-05,0.000152,-5.1e-05,-2.2e-05,-1.3e-05,1.3e-05,1e-05,0.000128,4e-06,0,0.000108,2e-05,4.3e-05,0.000137,-7.7e-05,-1.3e-05,-0.000105,6.4e-05,-4.6e-05,-0.00015,2e-06,3e-05,-0.000137,-0.000244,5.4e-05,4.7e-05,0.000116,9.3e-05,-1.5e-05,0.000194,9.3e-05,3.6e-05,4.7e-05,0.000174,-0.000134,-2.7e-05,0.000282,5.5e-05,-0.000123,1e-05,0.000166,-0.000206,-0.000202,0.000133,-1.2e-05,-0.000228,0.00012,-0.000131,-1.9e-05,-2.5e-05,0.000108,-2.4e-05,0.000215,4.4e-05,0.000104,-4e-06,1e-04,-2.9e-05,-5.5e-05,0.000161,-4e-06,-0.000161,1.5e-05,8.7e-05,0.000167,-0.000122,5.7e-05,0.000146,0.000243,4.6e-05,0.000193,-0.000154,-9.2e-05,-0.000134,-3.4e-05,-7.7e-05,-2.4e-05,-2.1e-05
-4.7e-05,2.4e-05,-2.1e-05,0.000137,0.000133,1.7e-05,0.000108,0.000169,-2.7e-05,-8.1e-05,3.7e-05,-8.3e-05,-4.6e-05,-1.1e-05,0.000207,-3.6e-05,-0.000179,-3.1e-05,-2e-06,1.9e-05,-5.1e-05,-2.2e-05,0.00013,4.4e-05,-0.000141,4.1e-05,6.3e-05,-0.00011,-5.3e-05,4.9e-05,7e-06,-8.4e-05,0.000115,-0.000198,1.6e-05,0.000223,0.000183,5.6e-05,-9.4e-05,0.000257,9.7e-05,-0.00012,-2.6e-05,6.5e-05,0.00012,3.1e-05,-4.7e-05,-8.5e-05,-6.9e-05,-4.4e-05,-1.7e-05,-2.2e-05,0.000103,3.5e-05,3e-05,0.000156,4.4e-05,5e-05,-2.4e-05,9.9e-05,9.4e-05,5.6e-05,3.7e-05,-0.000169,4.9e-05,8e-06,0.000243,-2.6e-05,1.8e-05,0.000106,0.000108,3.3e-05,9.7e-05,4.6e-05,1.3e-05,-1.3e-05,-0.000211,5.5e-05,4.8e-05,0.00017,-0.000205,-3.9e-05,9.4e-05,6.6e-05,0.000178,0.000211,-4.2e-05,-9.5e-05,-4.1e-05,0.000111,0.000121,3.6e-05,0.000166,3.1e-05,-4.6e-05,-7.2e-05,-1.4e-05,-8.4e-05,-7e-05,6.3e-05,6.2e-05,-3.8e-05,-7e-06,-5.7e-05,-3.3e-05,-1.8e-05,7.8e-05,-3.4e-05,-1.5e-05,9.7e-05,4.3e-05,0.000293,0.000148,-0.00024,0.00011,6.5e-05,9e-05,3e-05,3e-05,8.7e-05,7.6e-05
-1.7e-05,-4.6e-05,1.4e-05,-9.4e-05,-6.8e-05,-2.9e-05,-6.3e-05,3.6e-05,-2.9e-05,1.3e-05,-1e-04,2.4e-05,-9.5e-05,-0.000115,-2.6e-05,-3.5e-05,-0.000112,1.8e-05,-6.8e-05,-4.4e-05,-3.5e-05,6.1e-05,-5e-05,1e-06,-5.8e-05,-1e-06,-4e-06,3.2e-05,0.000178,6e-06,-8.1e-05,-3.3e-05,-9.9e-05,-5.2e-05,-5.1e-05,2.7e-05,0.000181,4.1e-05,1.7e-05,2.2e-05,5.6e-05,3.8e-05,4.1e-05,-2.9e-05,-8e-05,-7e-06,1.7e-05,7e-06,2.6e-05,-1.3e-05,-5.5e-05,-8.6e-05,5.9e-05,-5.8e-05,0.00021,1.6e-05,-9.8e-05,2e-06,2.7e-05,-8.9e-05,-0.000142,2e-05,-0.000114,0.000108,8.7e-05,9e-06,0.000243,9.9e-05,1.5e-05,-1e-05,2.7e-05,0.000119,-0.000175,-2.4e-05,-1.2e-05,1e-06,-7e-05,1.1e-05,0.000101,4.7e-05,2e-06,-0.000149,-0.000173,-8.9e-05,-7.1e-05,7.7e-05,8.3e-05,0.000199,9.8e-05,-9.3e-05,-6e-05,-3.1e-05,5e-05,-1.8e-05,-1.4e-05,2.9e-05,0.000123,-8.9e-05,8.6e-05,-8.5e-05,0.00012,7.5e-05,3.6e-05,-0.000117,-3.3e-05,-1e-06,-9e-05,0.000179,-3.7e-05,3.9e-05,-4.7e-05,-3.1e-05,-8.7e-05,0.000175,0.000104,0.000123,9.8e-05,0.000153,5.1e-05,3.8e-05,-4.5e-05
0.000109,6.6e-05,-1e-06,-6.9e-05,-6e-06,-5.7e-05,1.1e-05,1e-05,-8.7e-05,-1.1e-05,5.1e-05,-1.7e-05,-3.1e-05,1e-05,-8e-06,1.5e-05,-6.1e-05,2.2e-05,0.000128,-4.5e-05,-1.9e-05,4e-06,6.1e-05,1.1e-05,-4e-06,9.6e-05,-1.5e-05,-0.000138,0,-4.3e-05,1.9e-05,2.6e-05,7.9e-05,1e-05,-3e-05,-5.7e-05,-8.3e-05,-7.4e-05,-7.3e-05,0.000145,-4.4e-05,8.4e-05,1.9e-05,3.8e-05,2e-05,6e-06,-1e-05,8.6e-05,9e-06,8.6e-05,-5.7e-05,0.000119,-5e-06,6e-06,-0.000175,-9.1e-05,6.1e-05,1.7e-05,-2.2e-05,0.000131,9.3e-05,5.2e-05,0.000165,1.5e-05,-2e-05,0.000127,-4e-06,3.2e-05,2.1e-05,-0.000122,-0.000102,-5.2e-05,-2.4e-05,-9e-06,-2.2e-05,-2.1e-05,6e-05,-7.2e-05,2.6e-05,-6.6e-05,1e-04,0.000172,-5.9e-05,1e-06,9.5e-05,7e-06,1e-06,8e-05,6.8e-05,-5.5e-05,8.7e-05,-2.1e-05,-3.6e-05,-1e-04,4.7e-05,-1.8e-05,-6.1e-05,3.8e-05,-5.2e-05,3.7e-05,-8.7e-05,-2.6e-05,8.9e-05,6.1e-05,-6.3e-05,-1.6e-05,-0.000115,-8.5e-05,-6.8e-05,-3.2e-05,6e-06,-0.000139,6.3e-05,-0.000108,7e-05,-2.9e-05,-1.7e-05,3.8e-05,0.000183,-2.4e-05,4.2e-05
-1.5e-05,-1.6e-05,2e-05,8.3e-05,-2.3e-05,5.7e-05,-7e-06,2.7e-05,1.4e-05,2.3e-05,-4.7e-05,-1.5e-05,0.000102,4.8e-05,-2.6e-05,7e-06,7.5e-05,-6.1e-05,-9.4e-05,3.6e-05,3.9e-05,5e-06,3.5e-05,5e-06,1.9e-05,-8e-06,-2.3e-05,7.1e-05,8.9e-05,3.4e-05,-1.5e-05,4.4e-05,-6e-05,2.8e-05,1.1e-05,2.2e-05,-0.000123,-2.1e-05,1.3e-05,-0.000186,-3e-05,1e-06,6e-06,-5e-05,2.8e-05,7.1e-05,6.5e-05,-1.7e-05,-6.7e-05,-6.7e-05,-2.2e-05,-2.2e-05,-1.3e-05,3.8e-05,-1.7e-05,1e-05,-1.4e-05,-2.1e-05,9.2e-05,-6.7e-05,-4e-06,-6.5e-05,-0.000113,-5.2e-05,9e-06,-4.3e-05,-0.000115,5.8e-05,-2.4e-05,0.000145,2e-06,-2.2e-05,3e-06,2e-06,4.1e-05,2.7e-05,-2.4e-05,9.3e-05,-9.4e-05,-6.5e-05,6.3e-05,-2.8e-05,0.00017,-2e-06,-7e-06,-0.000124,4.1e-05,-8e-05,-5.6e-05,2.8e-05,-8.3e-05,1.5e-05,2e-06,0.000124,1e-05,-4.4e-05,-3.8e-05,1.8e-05,5.2e-05,4.7e-05,-4e-05,4e-06,1.5e-05,0.000114,-1.6e-05,7e-06,3.9e-05,8.3e-05,0.000122,-2.7e-05,4.9e-05,5e-05,1.3e-05,4.9e-05,-0.000115,-5e-06,-2.3e-05,-3e-06,2.7e-05,-4.4e-05,4.9e-05
-1.2e-05,1.1e-05,-1.7e-05,-0.000108,1.6e-05,-3.5e-05,8e-06,-0.000106,-2.2e-05,3.4e-05,2.1e-05,5.2e-05,-1.4e-05,1.8e-05,-4.1e-05,1.1e-05,1.5e-05,4e-05,5.9e-05,3.8e-05,-2e-06,3.8e-05,-2.5e-05,4e-06,-2.9e-05,-5.6e-05,1.2e-05,-1.5e-05,4.1e-05,-2.9e-05,-7e-06,-3e-06,6.7e-05,2.6e-05,7e-06,-6.7e-05,-8.1e-05,1.1e-05,5.6e-05,-1.5e-05,1.5e-05,6e-06,-4.1e-05,3.8e-05,-4.1e-05,-1.3e-05,5.3e-05,-5.2e-05,3.5e-05,-2e-06,2e-06,1.2e-05,-2.6e-05,-4.2e-05,-2.9e-05,3.4e-05,2.9e-05,0,-4.2e-05,2.1e-05,-1.8e-05,-6e-06,5.2e-05,2.9e-05,-5.7e-05,-6.2e-05,-2.7e-05,3.9e-05,2.3e-05,-7.8e-05,-1.4e-05,-9e-06,-5.4e-05,-3e-05,4e-06,-3.1e-05,-4.2e-05,-2.1e-05,-6.7e-05,2.4e-05,7.1e-05,6.5e-05,-4.8e-05,2.7e-05,-3.7e-05,6.4e-05,-8e-06,-4.8e-05,6.4e-05,0,5.4e-05,9e-06,-5.2e-05,1.3e-05,4.7e-05,-1.6e-05,6.1e-05,-1.3e-05,-2.1e-05,-2.5e-05,1e-06,1.5e-05,-6e-06,4.5e-05,-9e-06,4.3e-05,3.6e-05,-4.8e-05,-4.8e-05,2e-05,-3.5e-05,-1.6e-05,-2.2e-05,2.4e-05,-5e-06,-6.6e-05,2.9e-05,2.5e-05,-6.9e-05,2.1e-05,-6.1e-05
-2e-06,1.8e-05,-4.1e-05,1.8e-05,3e-06,-1.4e-05,-1.8e-05,1e-06,4.1e-05,-4.5e-05,3.4e-05,1.2e-05,2e-06,-1.1e-05,7.2e-05,-3.3e-05,3e-05,2.8e-05,-2e-06,2.9e-05,4e-06,-1.6e-05,1.9e-05,-8e-06,-1.8e-05,5.2e-05,-1e-06,6e-05,6.3e-05,1.4e-05,1.9e-05,-2.5e-05,-5e-05,2.7e-05,2.8e-05,-2.3e-05,5.7e-05,1.7e-05,2.2e-05,6.5e-05,-2.2e-05,-4e-06,9e-06,-7e-06,3.1e-05,-5e-06,1.3e-05,9e-06,5e-06,-2.3e-05,-4e-06,-1.5e-05,6e-06,3e-05,4.3e-05,6e-06,-7.5e-05,-3e-06,4.7e-05,1e-06,0,-2.4e-05,-2.5e-05,-1.1e-05,-3e-06,6.6e-05,-2.3e-05,-3.9e-05,-1.2e-05,-5e-05,-9e-06,9.5e-05,1.4e-05,-2.4e-05,4.5e-05,3.5e-05,9e-06,1e-05,-4e-05,-6.6e-05,1.4e-05,-7.7e-05,-1e-05,1.9e-05,9.1e-05,-5.8e-05,3.5e-05,1.6e-05,4e-05,4e-06,-3.4e-05,9e-06,-1.7e-05,-4.7e-05,-4.5e-05,5.9e-05,7e-06,1.6e-05,1.8e-05,1e-06,-2.8e-05,-3.2e-05,-3.9e-05,-1.6e-05,-1.3e-05,1.1e-05,5e-06,-1e-05,5.6e-05,2.1e-05,2.5e-05,-3.3e-05,4.3e-05,5e-05,4.8e-05,2.9e-05,4.1e-05,-5.6e-05,-3.6e-05,-2.8e-05,1.7e-05
-1.8e-05,-1.4e-05,7.4e-05,3.5e-05,5e-06,2e-06,5e-06,4.9e-05,-1e-05,1.4e-05,-3e-06,-1.7e-05,3.5e-05,-3.4e-05,-4.7e-05,1e-05,4e-05,3.2e-05,7e-06,-2.5e-05,-1.1e-05,0,-7e-06,-2e-06,-1e-05,-3.2e-05,1.9e-05,-1e-05,-7.2e-05,-1.6e-05,1.8e-05,-2.1e-05,-2.1e-05,-1.9e-05,-1e-05,5e-06,2.3e-05,-5e-06,3e-05,0,4.7e-05,-5e-06,7e-06,2.4e-05,-1.7e-05,1.6e-05,-2.3e-05,-2e-06,-1.7e-05,1.7e-05,2.6e-05,-2.5e-05,4e-06,1.4e-05,9e-06,-7e-06,2.8e-05,5e-06,-1.8e-05,-4e-06,-7e-06,3.6e-05,2e-06,3e-06,-1.2e-05,1.2e-05,3.7e-05,-3.4e-05,1.7e-05,8.6e-05,4.8e-05,-5.8e-05,3.6e-05,-6e-06,-8e-06,-2.8e-05,2.8e-05,2.2e-05,8.4e-05,2.6e-05,-1.1e-05,2.1e-05,2.5e-05,-2e-05,-3.9e-05,6.7e-05,-9e-06,2e-05,-9.8e-05,3.1e-05,1e-06,-5e-06,4e-06,-1.9e-05,8e-06,1e-05,-1.6e-05,3.8e-05,-5e-06,2e-06,-2.9e-05,8e-06,-2.8e-05,-6.7e-05,2.4e-05,2.7e-05,3e-05,-3.1e-05,-1e-06,0,1.2e-05,-1.2e-05,-2.4e-05,-2.8e-05,-1e-06,8e-06,-3e-06,-4e-06,-2e-06,1.8e-05,0
3.1e-05,1.1e-05,-2.3e-05,-1.2e-05,-6e-06,2.2e-05,4e-06,-5.6e-05,2.3e-05,-6e-06,-1e-06,1e-05,-1.4e-05,3e-05,3e-05,-5e-06,1.7e-05,-3e-06,-1.4e-05,-2.9e-05,-1e-06,1.5e-05,2e-05,9e-06,-3e-06,1.2e-05,-2e-05,5e-06,-6e-06,-9e-06,-2.4e-05,2.5e-05,2.6e-05,-6e-06,-3e-06,2.1e-05,3e-05,-8e-06,-2.9e-05,3.5e-05,-3e-06,6.2e-05,2.7e-05,-4e-06,1.2e-05,-8e-06,-4e-06,2.3e-05,2e-05,-3e-06,-3.1e-05,-5e-06,-5e-06,-1e-05,-5e-06,0,-2.4e-05,5e-06,-1.6e-05,8e-06,2.2e-05,-6e-06,1e-05,-1.6e-05,1.5e-05,-9e-06,3.1e-05,-1.8e-05,-5e-06,-2e-05,1.3e-05,2e-06,8.3e-05,-1.7e-05,1.3e-05,9e-06,3.3e-05,3e-06,3.1e-05,7e-06,-9.5e-05,2.5e-05,9e-06,2.8e-05,-2.5e-05,3e-05,1.5e-05,-3.5e-05,7.3e-05,-2.8e-05,2e-05,1.3e-05,1.2e-05,6e-06,1.8e-05,2e-06,-1.8e-05,-2.2e-05,-2e-06,2e-05,-1e-06,-5e-06,2.6e-05,-1e-05,3e-05,-6.2e-05,-1.5e-05,5.5e-05,-4.7e-05,-2.5e-05,-7e-06,2.8e-05,-1e-05,1.1e-05,-1e-05,1.6e-05,-3.7e-05,-9e-06,1.7e-05,2.1e-05,-1.1e-05
-2.2e-05,1e-06,-8e-06,7.8e-05,0,-3.8e-05,-1.1e-05,-1.1e-05,3e-06,-3e-06,-1.6e-05,3e-06,-5e-05,-7e-06,-7e-06,1.3e-05,1e-05,-3e-06,-1.3e-05,-1.3e-05,1.9e-05,-2.3e-05,-8e-06,-1.3e-05,7e-06,-2.6e-05,3e-06,-3.4e-05,-2e-05,1.1e-05,-7e-06,2.2e-05,3e-06,-2e-06,1e-06,2.6e-05,-4e-05,-7e-06,-3e-05,-1.5e-05,-1.6e-05,8e-06,-6e-06,1.6e-05,1e-05,-1e-05,1e-06,4e-06,-6e-06,-4.7e-05,-8e-06,8e-06,-4e-06,-1.9e-05,6.5e-05,-1.1e-05,-2e-06,2e-06,8e-06,-2.4e-05,-3.3e-05,1e-05,-1.6e-05,1.6e-05,6e-06,-3.2e-05,-1.1e-05,4e-06,1e-06,-2.3e-05,4e-06,1.1e-05,-2.5e-05,-3e-05,-8e-06,1e-06,-1.3e-05,3e-06,-4.8e-05,1.3e-05,2.1e-05,7e-06,-3.4e-05,-2e-05,3.4e-05,-1.3e-05,0,-1.5e-05,-2.2e-05,-1.4e-05,-3.2e-05,-4e-06,1.5e-05,5.4e-05,-4e-06,-2e-06,2.5e-05,-3.9e-05,-2e-06,-9e-06,-3.1e-05,-1.2e-05,2e-06,1e-06,7e-06,9e-06,-1.9e-05,-1.9e-05,1.7e-05,-9e-06,-1.2e-05,4.5e-05,4.3e-05,-1e-05,1.5e-05,2.8e-05,2.6e-05,-2.6e-05,1.9e-05,-1.6e-05,2.6e-05
9e-06,1e-06,0,-4.5e-05,-9e-06,1.6e-05,1.3e-05,2e-05,1.3e-05,2.2e-05,-9e-06,-2.1e-05,2e-05,1.9e-05,-1.2e-05,1e-06,3.3e-05,-1.7e-05,3.3e-05,8e-06,-1.6e-05,9e-06,3e-06,1e-06,6e-06,0,4e-06,-2e-06,5e-06,-1.3e-05,2.8e-05,-1.3e-05,-1.6e-05,2.7e-05,-8e-06,2.2e-05,-8e-06,5e-06,9e-06,2.9e-05,-1e-05,-2.6e-05,7e-06,-1.2e-05,1.8e-05,1.1e-05,-9e-06,-2.7e-05,-1.4e-05,7e-06,-2.4e-05,1.4e-05,-3e-06,2.4e-05,-4.3e-05,7e-06,2.3e-05,-3e-06,-7e-06,1.5e-05,2.1e-05,-3.5e-05,2.6e-05,-5e-06,2.6e-05,1.8e-05,-1.3e-05,2.1e-05,-2e-06,2e-06,-7e-06,3.3e-05,-2.1e-05,-1.8e-05,1.8e-05,-8e-06,-4e-05,-4e-06,-2.1e-05,6e-06,9e-06,-1.5e-05,-2.9e-05,-1e-06,1.1e-05,-1.1e-05,6e-06,6e-05,-1.9e-05,3.6e-05,3.5e-05,-1e-06,1.8e-05,-2e-05,5e-06,2e-06,-4e-06,-4e-06,-2e-06,-1e-05,-3.4e-05,1.1e-05,-1.4e-05,6e-06,3.4e-05,2.2e-05,8e-06,1.1e-05,-4.1e-05,1.7e-05,3e-05,2.5e-05,-1.7e-05,1.6e-05,3.3e-05,-3.2e-05,3.8e-05,5.7e-05,1.7e-05,-3e-06,-4e-06
7e-06,5e-06,-4e-06,-4.7e-05,-4e-06,2e-06,-1.3e-05,3.7e-05,6e-06,-1.9e-05,1.4e-05,1.5e-05,2.8e-05,-1.6e-05,9e-06,2e-06,-2.4e-05,1.6e-05,-2.1e-05,2e-05,-7e-06,1.9e-05,1e-05,-7e-06,1.4e-05,1e-05,-2e-06,-1e-06,-1.5e-05,4e-06,-1.4e-05,-2.2e-05,4.4e-05,4e-06,1.6e-05,3e-06,2.6e-05,1.3e-05,-8e-06,-3e-05,9e-06,1.1e-05,-3e-06,1e-06,-7e-06,-1.3e-05,1e-06,9e-06,8e-06,-4e-06,-1.3e-05,4e-06,9e-06,-5e-06,1.3e-05,2.2e-05,-2.6e-05,-1e-06,1.3e-05,-1e-06,-1.4e-05,2e-06,-2.2e-05,-4e-06,-6e-06,2.9e-05,3.6e-05,2e-05,0,2.4e-05,-1.7e-05,-2.2e-05,-3e-05,-1.1e-05,-1e-06,9e-06,2.5e-05,1.5e-05,-2.6e-05,1.3e-05,1.4e-05,-2.1e-05,5.8e-05,9e-06,-5e-06,1e-05,-6e-06,2.5e-05,4.1e-05,-4e-06,-3.2e-05,0,-5e-06,-2e-05,-1e-06,-1.2e-05,-7e-06,2.3e-05,1e-05,1.9e-05,-1.1e-05,-2.2e-05,7e-06,5e-05,1.3e-05,-2.1e-05,1e-06,1.4e-05,2.9e-05,1.2e-05,-1.8e-05,-4e-06,3e-06,-1.8e-05,-1.5e-05,-1.1e-05,-2.3e-05,-1.4e-05,-1.5e-05,8e-06,-1.4e-05
-1.9e-05,-2e-06,-6e-06,-4e-06,-1e-06,-1.2e-05,6e-06,-1.5e-05,-6e-06,1e-05,1.4e-05,-2e-06,-1.2e-05,-1e-06,-6e-06,-3e-06,4e-06,0,1.4e-05,1.3e-05,4e-06,-1e-05,-1.6e-05,-1e-06,1.5e-05,-2.6e-05,3e-06,8e-06,1.1e-05,2e-06,-4e-06,5e-06,-3.9e-05,-1e-06,-1.2e-05,-1.7e-05,1.5e-05,-5e-06,2.9e-05,-1.7e-05,-5e-06,1.5e-05,2e-06,2e-06,-5e-06,0,-2.6e-05,4e-06,2e-06,9e-06,-6e-06,1e-06,8e-06,-1e-05,-3.5e-05,-1.2e-05,-1.4e-05,3e-06,-2.6e-05,1e-06,7e-06,-2e-06,1.4e-05,4e-06,6e-06,-1.4e-05,5e-06,2.4e-05,0,-1.8e-05,5e-06,-1.8e-05,-2e-05,-1.8e-05,4e-06,-1.1e-05,6e-06,-1.1e-05,3.1e-05,2e-06,1.8e-05,2e-05,-2.2e-05,-1.1e-05,6e-06,-2.9e-05,2e-06,-2e-05,-7e-06,-1.9e-05,1.3e-05,1e-05,-8e-06,-5e-06,6e-06,-5e-06,-3e-06,1e-05,-9e-06,1e-06,-1e-05,0,1.7e-05,-1e-05,-5e-06,4e-06,-7e-06,-7e-06,9e-06,5e-06,9e-06,-3.5e-05,1.1e-05,3.5e-05,-2.2e-05,0,-2.2e-05,3.2e-05,-1.9e-05,-5e-06,1.2e-05
1.3e-05,-2e-06,6e-06,-1.5e-05,2e-06,6e-06,-7e-06,-3e-06,3e-06,-1.1e-05,-7e-06,-2.1e-05,0,0,1.4e-05,-3e-06,-1.4e-05,2e-06,-2e-06,3e-06,1.6e-05,-3e-06,1.1e-05,-1e-06,-2e-06,1.1e-05,-4e-06,1.7e-05,9e-06,-2e-06,5e-06,1.9e-05,1.8e-05,-1e-05,4e-06,-1e-05,-2e-06,-9e-06,1.3e-05,1.1e-05,1.6e-05,1.4e-05,-8e-06,2e-06,-9e-06,1.2e-05,6e-06,-8e-06,-7e-06,-2.6e-05,-1e-06,-1.8e-05,-2e-06,1.5e-05,1.1e-05,-1.2e-05,-6e-06,0,2e-05,-3e-06,-3e-06,2.1e-05,-2e-06,-5e-06,-1.4e-05,-1.4e-05,1.5e-05,1e-06,-4e-06,-9e-06,-2e-06,3.2e-05,5e-06,-1e-05,-4e-06,9e-06,-5e-06,1e-05,3.2e-05,-2.3e-05,3e-06,1.2e-05,-7e-06,8e-06,-1.2e-05,3.3e-05,-8e-06,-4e-06,-1e-05,1.1e-05,-4e-06,-6e-06,-8e-06,1.9e-05,-4e-06,6e-06,1.2e-05,-6e-06,1e-05,-1.4e-05,-8e-06,-1e-06,6e-06,-1e-05,1e-05,0,2e-06,-1e-06,3e-06,-1.6e-05,-2e-06,-2.1e-05,-1.8e-05,-4e-06,3e-06,6e-06,2.5e-05,4e-06,1.8e-05,-1e-05,-1.4e-05
-2e-06,4e-06,-2e-06,2.2e-05,-2e-06,9e-06,8e-06,1.2e-05,-8e-06,-3e-06,2e-06,1.4e-05,9e-06,1.5e-05,-1e-05,7e-06,-2.4e-05,-9e-06,-1.9e-05,-1.6e-05,-4e-06,9e-06,-6e-06,-4e-06,-7e-06,-1e-05,-2e-06,-1.2e-05,2.4e-05,5e-06,-3e-06,3e-06,-3e-06,-1.5e-05,3e-06,-1.9e-05,-3.4e-05,1e-06,-1.2e-05,3.6e-05,-6e-06,-3e-06,0,-3e-06,1e-06,-9e-06,1.8e-05,9e-06,6e-06,0,3e-06,-3e-06,0,2e-06,-3e-06,5e-06,1.2e-05,1e-06,-2e-05,2e-06,-9e-06,-8e-06,-1.2e-05,1e-06,-7e-06,9e-06,-9e-06,0,4e-06,2.6e-05,0,1.4e-05,1e-05,4e-06,6e-06,-5e-06,-2e-06,7e-06,-6e-06,1e-06,-2.3e-05,-3e-06,2.4e-05,5e-06,1.6e-05,3e-06,-1e-06,5e-06,-3e-06,1e-06,1.1e-05,4e-06,-9e-06,2e-05,6e-06,1e-06,-8e-06,-1e-06,-1.1e-05,9e-06,1e-06,-1.4e-05,-8e-06,-1.5e-05,-1.1e-05,-1.5e-05,8e-06,1e-06,1.8e-05,-3e-06,3e-06,9e-06,1.3e-05,-5e-06,1.7e-05,1.6e-05,1.4e-05,-7e-06,2.1e-05,1.5e-05,5e-06
-5e-06,-4e-06,-1e-06,2e-05,-1e-06,-2.6e-05,-4e-06,-3.4e-05,0,1.2e-05,-1.1e-05,3e-06,-1.4e-05,-1.3e-05,0,-1e-06,0,-6e-06,2.2e-05,-1.6e-05,-1.4e-05,-5e-06,4e-06,-4e-06,2e-06,9e-06,0,1.3e-05,-5e-06,-7e-06,-1e-06,-1.5e-05,-4e-06,-1.1e-05,-3e-06,-4e-06,-1.6e-05,1e-06,2e-06,-1e-05,-6e-06,-1e-05,3e-06,1.2e-05,1e-06,5e-06,-2e-06,0,2e-06,1.4e-05,-6e-06,-2e-06,-6e-06,-1.5e-05,6e-06,4e-06,9e-06,3e-06,1.6e-05,4e-06,2e-05,-1e-06,1.7e-05,-2e-06,-4e-06,1e-05,-4.4e-05,-1.4e-05,-3e-06,-1.5e-05,8e-06,-2e-05,2.7e-05,1e-06,2e-06,2e-06,-9e-06,-1.5e-05,-1.6e-05,-1.1e-05,-1.6e-05,-2.2e-05,-9e-06,-3e-06,2e-06,-7e-06,-6e-06,2e-06,1.9e-05,-5e-06,-1e-05,4e-06,1e-06,-2.5e-05,-8e-06,5e-06,-4e-06,-1e-06,5e-06,5e-06,-2e-06,7e-06,-1.5e-05,-1.8e-05,-1.4e-05,1.7e-05,8e-06,-1e-06,-3.3e-05,4e-06,2e-06,1.1e-05,2e-06,7e-06,0,0,-1.8e-05,-6e-06,6e-06,-6e-06,1.3e-05
4e-06,-1e-06,-1.4e-05,-1.1e-05,-2e-06,3.6e-05,1e-06,4e-06,-9e-06,-1.1e-05,0,-1.5e-05,-1.4e-05,-1e-06,1e-06,2e-06,-1e-05,3e-06,-1e-05,-1e-06,4e-06,-3e-06,2e-06,-2e-06,8e-06,-6e-06,4e-06,-2.6e-05,1.1e-05,3e-06,1e-06,-7e-06,7e-06,7e-06,3e-06,6e-06,7e-06,1e-06,-1.6e-05,-1e-05,2e-06,1.1e-05,5e-06,-1e-05,2e-06,5e-06,9e-06,-5e-06,-7e-06,-2e-06,2e-06,8e-06,-1e-06,1.3e-05,5e-06,-1e-06,-1.6e-05,-2e-06,2e-06,-3e-06,-2.1e-05,-1.6e-05,-1.4e-05,3e-06,-2e-06,-4e-06,-6e-06,-1.3e-05,3e-06,-7e-06,-2e-06,-9e-06,7e-06,1e-06,5e-06,2e-06,1.8e-05,1.5e-05,-2.4e-05,8e-06,1.7e-05,1.6e-05,-1e-05,5e-06,-2.6e-05,5e-06,-7e-06,-1.4e-05,-2.3e-05,1.2e-05,1e-06,-1e-06,5e-06,-3e-06,2e-06,-4e-06,3e-06,-3e-06,-1e-06,-6e-06,-5e-06,-8e-06,5e-06,2.1e-05,-9e-06,3e-06,-3e-06,-1.4e-05,1e-05,6e-06,-8e-06,2e-06,-1.3e-05,-7e-06,-1e-05,-1.2e-05,-1.4e-05,-9e-06,-1e-06,-2e-06,-1.1e-05
-4e-06,2e-06,6e-06,8e-06,1e-06,-2.3e-05,3e-06,1.6e-05,-1e-06,9e-06,9e-06,1.6e-05,1.3e-05,-1e-06,1e-06,-4e-06,-2e-06,9e-06,1.6e-05,1e-05,5e-06,6e-06,-8e-06,2e-06,5e-06,-9e-06,-3e-06,1.4e-05,2e-06,-4e-06,4e-06,1.1e-05,-5e-06,6e-06,-3e-06,9e-06,2.9e-05,0,-2e-06,-1.5e-05,0,1.3e-05,2e-06,8e-06,3e-06,-9e-06,-6e-06,5e-06,3e-06,1e-06,-6e-06,6e-06,-2e-06,3e-06,1.4e-05,5e-06,6e-06,-1e-06,-6e-06,-2e-06,1.3e-05,8e-06,1.3e-05,-7e-06,9e-06,-1e-05,2.2e-05,-3e-06,-2e-06,1e-05,4e-06,2.7e-05,4e-06,9e-06,1e-06,-4e-06,0,-9e-06,1.4e-05,-4e-06,2e-06,0,-1.2e-05,-9e-06,2.9e-05,2e-06,-4e-06,-1e-05,6e-06,-4e-06,1e-06,-4e-06,4e-06,2e-06,7e-06,4e-06,3e-06,-6e-06,-3e-06,-1e-06,7e-06,-6e-06,3e-06,6e-06,-1.5e-05,-3e-06,-6e-06,2.1e-05,-1.3e-05,2e-06,1.2e-05,-1e-06,1.3e-05,-1e-06,6e-06,-3e-06,1.7e-05,-1e-05,-1.2e-05,3e-06,4e-06
-2e-06,-3e-06,4e-06,1e-06,-1e-06,2e-06,-5e-06,0,-6e-06,-6e-06,-1e-06,2e-06,7e-06,9e-06,2e-06,0,5e-06,1e-06,-2e-05,1.3e-05,3e-06,-4e-06,8e-06,-3e-06,-6e-06,7e-06,2e-06,-1.9e-05,-1e-05,-2e-06,-4e-06,9e-06,-7e-06,4e-06,0,1.2e-05,8e-06,-3e-06,1.2e-05,2.6e-05,-2e-06,-4e-06,-2e-06,-5e-06,1e-06,5e-06,5e-06,-7e-06,3e-06,-5e-06,-2e-06,4e-06,0,-1.4e-05,-1.7e-05,-8e-06,-1e-05,1e-06,4e-06,1e-06,-3e-06,1e-06,-1.4e-05,5e-06,2e-06,-1e-06,2e-05,-2e-06,1e-06,0,0,1e-06,-1.4e-05,1.1e-05,0,2e-06,-1.7e-05,0,2.7e-05,1e-05,6e-06,8e-06,2.7e-05,4e-06,-3e-06,-6e-06,-8e-06,1.5e-05,1.9e-05,-1.1e-05,-1e-06,7e-06,3e-06,1.5e-05,-5e-06,-5e-06,-4e-06,3e-06,6e-06,5e-06,5e-06,7e-06,-2e-06,6e-06,-1e-05,-2e-06,-6e-06,-7e-06,3e-06,-8e-06,-1e-05,8e-06,-4e-06,1e-05,7e-06,-5e-06,1.4e-05,8e-06,-1e-05,1e-06,0
3e-06,1e-06,-7e-06,-2.5e-05,0,1.8e-05,2e-06,-9e-06,2e-06,-4e-06,1e-06,-1.3e-05,-7e-06,0,-4e-06,-2e-06,5e-06,-1e-06,8e-06,5e-06,-5e-06,0,-1.2e-05,1e-06,-5e-06,-9e-06,-1e-06,2.1e-05,-2e-06,0,-3e-06,-4e-06,2.1e-05,1e-06,0,5e-06,-5e-06,-1e-06,-1e-06,-1.2e-05,8e-06,-5e-06,0,2e-06,-1e-06,2e-06,6e-06,2e-06,-6e-06,1.5e-05,-2e-06,-8e-06,2e-06,1e-05,5e-06,-3e-06,1.3e-05,1e-06,-3e-06,0,1e-06,1.1e-05,9e-06,-2e-06,8e-06,1.5e-05,1.3e-05,3e-06,-1e-06,-2e-06,-7e-06,-9e-06,-2e-05,7e-06,2e-06,-2e-06,6e-06,4e-06,-4e-06,6e-06,5e-06,-1.7e-05,-1.2e-05,0,-1.2e-05,9e-06,-1e-06,1.1e-05,-2.7e-05,8e-06,7e-06,0,0,1e-06,2e-06,-4e-06,-3e-06,5e-06,-6e-06,-1e-06,5e-06,-1.1e-05,-4e-06,7e-06,-2e-06,-3e-06,1e-06,0,1.6e-05,-1e-06,5e-06,7e-06,-4e-06,-1e-06,-5e-06,1.4e-05,-1.9e-05,-6e-06,4e-06,-4e-06,-8e-06
-3e-06,0,5e-06,1e-06,0,-1.6e-05,-1e-06,2e-06,-1e-06,8e-06,-2e-06,1e-05,3e-06,-5e-06,4e-06,1e-06,7e-06,-3e-06,-4e-06,-5e-06,-1e-06,4e-06,8e-06,-2e-06,-2e-06,3e-06,-1e-06,-9e-06,-1.2e-05,0,6e-06,-1.2e-05,-1.9e-05,-2e-06,2e-06,-1e-06,-2e-05,3e-06,8e-06,9e-06,-3e-06,-1e-06,-3e-06,-4e-06,0,-6e-06,-8e-06,7e-06,4e-06,2e-06,-4e-06,-2e-06,0,2e-06,-1.4e-05,8e-06,4e-06,0,3e-06,1e-06,-1e-06,-8e-06,-3e-06,-2e-06,-3e-06,-5e-06,-1e-05,9e-06,0,-7e-06,2e-06,-1e-05,-7e-06,1e-05,2e-06,-1e-06,3e-06,-4e-06,-8e-06,-4e-06,-1e-06,6e-06,-5e-06,-1e-06,8e-06,3e-06,-8e-06,0,1.4e-05,3e-06,-1.3e-05,-3e-06,-2e-06,-2e-05,-3e-06,2e-06,5e-06,6e-06,6e-06,-3e-06,7e-06,4e-06,2e-06,-2.1e-05,-1e-06,8e-06,3e-06,4e-06,-9e-06,2e-06,-1e-06,-6e-06,1e-05,-1e-06,-8e-06,2e-06,-1.3e-05,1.5e-05,1.2e-05,2e-06,9e-06
5e-06,-1e-06,-3e-06,-6e-06,0,2e-06,3e-06,1.5e-05,4e-06,-7e-06,-2e-06,2e-06,6e-06,0,-5e-06,2e-06,7e-06,-1e-06,2e-06,-1.1e-05,1e-06,-4e-06,-2e-06,0,-1e-06,-8e-06,2e-06,1.3e-05,1e-06,1e-06,-3e-06,2e-06,1e-05,-4e-06,0,-7e-06,-3e-06,1e-06,-2e-06,-9e-06,-6e-06,8e-06,1e-06,7e-06,-3e-06,4e-06,1e-06,-5e-06,1e-06,0,5e-06,-7e-06,1e-06,-8e-06,2e-06,2e-06,0,0,-6e-06,-3e-06,-1e-06,0,-4e-06,2e-06,-1e-06,-1e-05,-1.9e-05,5e-06,0,1.2e-05,-2e-06,2.4e-05,0,1.3e-05,1e-06,2e-06,2e-06,3e-06,-1.4e-05,0,-2.3e-05,-3e-06,1.4e-05,2e-06,-8e-06,-1.1e-05,-1e-06,-4e-06,1e-06,-6e-06,1e-05,1e-06,-2e-06,5e-06,2e-06,2e-06,0,-6e-06,-2e-06,0,6e-06,1e-06,6e-06,-2e-06,2e-06,-3e-06,2e-06,3e-06,1.3e-05,5e-06,1e-06,-1e-05,-9e-06,0,5e-06,0,1.7e-05,-1e-06,7e-06,4e-06,-1e-06
0,1e-06,1e-06,3e-06,-1e-06,1.1e-05,-3e-06,-1.4e-05,1e-06,9e-06,0,-1.1e-05,-1.1e-05,-1e-06,2e-06,0,3e-06,3e-06,8e-06,-8e-06,4e-06,1e-06,-1e-06,2e-06,-2e-06,0,-1e-06,-1e-05,-2e-06,0,-1e-06,1.1e-05,0,0,0,-7e-06,7e-06,-1e-06,-9e-06,9e-06,1e-06,2e-06,-2e-06,-7e-06,-2e-06,-1e-06,-8e-06,-1e-06,-3e-06,1e-06,0,5e-06,0,4e-06,2e-06,-7e-06,-6e-06,0,7e-06,3e-06,7e-06,-5e-06,8e-06,-3e-06,-6e-06,6e-06,-1e-06,6e-06,0,-5e-06,3e-06,1e-06,1.5e-05,7e-06,-1e-06,-2e-06,2e-06,-1e-06,-5e-06,-5e-06,0,1.2e-05,-7e-06,-2e-06,8e-06,1.1e-05,-5e-06,-1e-06,-1.2e-05,3e-06,-5e-06,4e-06,-1e-06,6e-06,-1e-06,-1e-06,-3e-06,-4e-06,-3e-06,4e-06,2e-06,-7e-06,3e-06,1e-06,1e-05,-3e-06,0,-1e-05,-1.2e-05,0,-1e-06,-6e-06,0,1e-06,5e-06,-6e-06,6e-06,5e-06,-5e-06,-5e-06,-3e-06
-3e-06,0,-2e-06,2.3e-05,1e-06,-9e-06,3e-06,-2e-06,4e-06,-3e-06,3e-06,7e-06,-6e-06,4e-06,1e-06,-1e-06,-1e-06,1e-06,-1.2e-05,3e-06,1e-06,2e-06,4e-06,0,0,1e-06,-1e-06,0,4e-06,0,1e-06,2e-06,-7e-06,5e-06,0,-6e-06,9e-06,0,4e-06,-8e-06,4e-06,-7e-06,2e-06,4e-06,1e-06,-5e-06,4e-06,1e-06,2e-06,3e-06,3e-06,1e-06,0,3e-06,-1e-06,2e-06,-2e-06,1e-06,-6e-06,-1e-06,-1.1e-05,8e-06,-8e-06,3e-06,-1e-06,3e-06,1e-05,-2e-06,-1e-06,-8e-06,4e-06,-1.1e-05,7e-06,5e-06,1e-06,3e-06,-1.1e-05,1e-06,2.2e-05,1e-06,9e-06,-1.1e-05,-4e-06,1e-06,-2e-06,-3e-06,0,7e-06,8e-06,-2e-06,2e-06,-2e-06,-2e-06,7e-06,1e-06,0,-2e-06,1e-06,5e-06,-2e-06,5e-06,8e-06,-7e-06,1e-06,9e-06,3e-06,-2e-06,7e-06,-3e-06,-4e-06,-2e-06,3e-06,7e-06,-4e-06,-4e-06,-6e-06,-1.9e-05,1e-06,-4e-06,3e-06,6e-06
3e-06,-1e-06,3e-06,-5e-06,1e-06,-4e-06,-2e-06,8e-06,3e-06,-5e-06,-1e-06,2e-06,1.2e-05,-1e-06,-2e-06,-1e-06,-2e-06,-2e-06,6e-06,1e-05,-5e-06,-2e-06,-8e-06,0,1e-06,-6e-06,1e-06,-2e-06,1e-06,1e-06,0,-1e-05,5e-06,2e-06,-2e-06,-2e-06,-1e-06,-1e-06,-5e-06,-2e-06,0,-1e-06,1e-06,0,1e-06,5e-06,4e-06,-3e-06,1e-06,5e-06,-5e-06,5e-06,1e-06,-6e-06,1.1e-05,0,9e-06,1e-06,3e-06,1e-06,1.2e-05,0,8e-06,-4e-06,-3e-06,0,1e-06,-4e-06,1e-06,1e-05,-4e-06,-5e-06,1e-05,6e-06,-1e-06,-2e-06,8e-06,-2e-06,3e-06,-6e-06,4e-06,4e-06,-2e-06,1e-06,-8e-06,0,-2e-06,-4e-06,0,-2e-06,0,-2e-06,0,-7e-06,-1e-06,1e-06,4e-06,2e-06,-6e-06,-2e-06,3e-06,-4e-06,0,1.2e-05,7e-06,-6e-06,-1e-06,-1e-06,3e-06,-2e-06,6e-06,8e-06,-8e-06,0,-3e-06,4e-06,-6e-06,-9e-06,-1e-06,-1e-06,-7e-06
-4e-06,0,3e-06,0,0,1.2e-05,-1e-06,-7e-06,1e-06,6e-06,0,-1e-05,4e-06,1e-06,2e-06,1e-06,-1e-06,-2e-06,-6e-06,8e-06,0,-1e-06,8e-06,0,1e-06,2e-06,0,-2e-06,1e-05,-3e-06,0,-4e-06,0,0,2e-06,5e-06,-8e-06,0,3e-06,8e-06,1e-06,2e-06,2e-06,-2e-06,2e-06,-1e-06,-5e-06,5e-06,-3e-06,-5e-06,-2e-06,-2e-06,-1e-06,1e-06,-1e-05,-3e-06,1e-06,-1e-06,0,-2e-06,-9e-06,3e-06,-7e-06,3e-06,4e-06,-6e-06,-7e-06,-4e-06,1e-06,-2e-06,1e-06,1.8e-05,-2e-06,2e-06,2e-06,1e-06,5e-06,1e-06,-7e-06,3e-06,6e-06,-8e-06,9e-06,0,8e-06,3e-06,0,-1.2e-05,-1e-06,5e-06,-1e-06,4e-06,2e-06,-1.1e-05,-1e-06,0,0,0,6e-06,3e-06,1e-06,-1e-06,2e-06,-2e-06,1e-05,3e-06,1e-06,-8e-06,-9e-06,1e-06,-7e-06,3e-06,4e-06,7e-06,4e-06,5e-06,1.6e-05,4e-06,3e-06,0,1e-06
2e-06,-1e-06,-5e-06,0,-1e-06,-1.1e-05,2e-06,-1e-06,2e-06,-8e-06,-2e-06,5e-06,-8e-06,-2e-06,-4e-06,0,-6e-06,0,1e-05,0,3e-06,2e-06,-6e-06,2e-06,-2e-06,-5e-06,0,7e-06,-8e-06,1e-06,0,7e-06,-7e-06,-2e-06,-1e-06,5e-06,-4e-06,1e-06,6e-06,3e-06,-4e-06,1e-06,-1e-06,-1e-06,-1e-06,-1e-06,6e-06,0,1e-06,1e-06,-4e-06,0,-1e-06,2e-06,6e-06,4e-06,-1e-06,0,-1e-06,0,5e-06,-7e-06,4e-06,-2e-06,1e-06,-1e-06,-5e-06,-5e-06,0,-4e-06,-1e-06,0,-8e-06,-3e-06,-1e-06,-1e-06,-9e-06,1e-06,-1e-05,3e-06,5e-06,1.2e-05,-6e-06,0,4e-06,4e-06,1e-06,2e-06,-5e-06,-2e-06,4e-06,1e-06,2e-06,1.1e-05,2e-06,-4e-06,-2e-06,-1e-06,-5e-06,1e-06,0,6e-06,0,-3e-06,4e-06,5e-06,0,7e-06,1.3e-05,4e-06,4e-06,-3e-06,2e-06,-3e-06,3e-06,5e-06,3e-06,-8e-06,5e-06,-1e-06,4e-06
2e-06,-1e-06,3e-06,-1.5e-05,0,2e-06,0,4e-06,-1e-06,8e-06,0,6e-06,1e-06,4e-06,3e-06,1e-06,0,1e-06,-2e-06,-7e-06,3e-06,0,3e-06,0,-1e-06,2e-06,1e-06,-7e-06,1.3e-05,-2e-06,0,7e-06,1.2e-05,-3e-06,1e-06,6e-06,2e-06,0,-6e-06,-4e-06,1e-06,-1e-06,-1e-06,4e-06,1e-06,3e-06,-4e-06,-4e-06,2e-06,-1e-06,-1e-06,-3e-06,0,-2e-06,-1.1e-05,1e-06,-2e-06,1e-06,2e-06,1e-06,0,1e-06,-1e-06,-1e-06,4e-06,8e-06,2e-06,-2e-06,0,0,0,-1e-05,-1.1e-05,-3e-06,1e-06,-1e-06,3e-06,-3e-06,-7e-06,3e-06,-7e-06,-7e-06,0,0,-1.3e-05,-1.2e-05,1e-06,1.1e-05,1e-05,-3e-06,-4e-06,-2e-06,1e-06,4e-06,-2e-06,2e-06,0,2e-06,1e-06,-2e-06,-1e-06,-6e-06,-2e-06,-2e-06,0,-4e-06,0,-1e-06,-5e-06,1e-06,-1e-06,-3e-06,-7e-06,-1e-06,-4e-06,-4e-06,-1.8e-05,2e-06,-1e-06,1e-06,-5e-06
0,1e-06,1e-06,2e-06,0,4e-06,0,6e-06,0,0,2e-06,-1.2e-05,4e-06,-4e-06,0,0,-2e-06,2e-06,-6e-06,-9e-06,-3e-06,1e-06,1e-06,0,1e-06,-2e-06,-1e-06,1.2e-05,-1e-05,1e-06,0,-5e-06,-1e-05,-3e-06,1e-06,3e-06,9e-06,-1e-06,4e-06,-5e-06,3e-06,-3e-06,-1e-06,-6e-06,-1e-06,-4e-06,4e-06,3e-06,-3e-06,0,1e-06,0,0,-2e-06,1e-06,-5e-06,-2e-06,1e-06,1e-06,0,-4e-06,-1e-06,-2e-06,1e-06,2e-06,0,1.9e-05,-1e-06,-1e-06,7e-06,0,-2e-06,-8e-06,-4e-06,-1e-06,1e-06,-3e-06,2e-06,1.5e-05,2e-06,-1.4e-05,5e-06,6e-06,0,5e-06,1.4e-05,2e-06,2e-06,-9e-06,4e-06,3e-06,-1e-06,-1e-06,-2e-06,1e-06,2e-06,1e-06,-1e-06,1e-06,0,-3e-06,5e-06,0,-7e-06,0,1e-06,1e-06,-3e-06,3e-06,-3e-06,-2e-06,2e-06,8e-06,0,-1e-06,-5e-06,-4e-06,-2e-06,-5e-06,1e-06,4e-06
2e-06,0,-1e-06,-2e-06,0,-3e-06,0,-7e-06,-3e-06,-2e-06,-1e-06,6e-06,-7e-06,1e-06,-1e-06,0,-1e-06,0,5e-06,-3e-06,-2e-06,0,-5e-06,0,3e-06,-4e-06,0,-1.1e-05,5e-06,-1e-06,0,-8e-06,5e-06,1e-06,-1e-06,-1e-06,2e-06,0,-1e-06,1e-06,-1e-06,-1e-06,0,5e-06,1e-06,1e-06,2e-06,-1e-06,1e-06,-2e-06,-3e-06,0,2e-06,2e-06,-3e-06,1e-06,4e-06,1e-06,1e-06,-1e-06,6e-06,5e-06,6e-06,-2e-06,-2e-06,-6e-06,8e-06,1e-06,2e-06,-4e-06,-3e-06,1.5e-05,3e-06,-8e-06,1e-06,-1e-06,4e-06,-2e-06,9e-06,-3e-06,5e-06,-8e-06,-5e-06,1e-06,5e-06,-8e-06,2e-06,-9e-06,0,-1e-06,-3e-06,3e-06,-1e-06,-8e-06,0,-3e-06,0,-1e-06,-4e-06,2e-06,-3e-06,1e-06,1e-06,2e-06,-7e-06,0,1e-06,0,3e-06,-2e-06,4e-06,3e-06,-2e-06,0,3e-06,-4e-06,1.6e-05,3e-06,-3e-06,-2e-06,-1e-06
-2e-06,0,0,-1e-06,0,-1e-06,2e-06,-4e-06,0,5e-06,-1e-06,6e-06,-1e-06,-2e-06,3e-06,0,4e-06,0,-1e-05,5e-06,1e-06,-1e-06,7e-06,0,0,2e-06,1e-06,1.1e-05,-7e-06,0,0,1e-06,3e-06,2e-06,1e-06,-4e-06,-3e-06,1e-06,-4e-06,3e-06,-2e-06,1e-06,0,-2e-06,-2e-06,2e-06,-6e-06,-1e-06,1e-06,-4e-06,-2e-06,2e-06,-1e-06,1e-06,4e-06,3e-06,-4e-06,0,-3e-06,0,-8e-06,-3e-06,-7e-06,2e-06,0,0,-1.1e-05,4e-06,-1e-06,-6e-06,2e-06,0,4e-06,-9e-06,-1e-06,1e-06,5e-06,-2e-06,-9e-06,1e-06,4e-06,8e-06,1e-06,-1e-06,-7e-06,2e-06,1e-06,-2e-06,1.1e-05,-2e-06,4e-06,0,0,-3e-06,-1e-06,2e-06,0,-1e-06,6e-06,0,-4e-06,-4e-06,2e-06,3e-06,-9e-06,-2e-06,-1e-06,7e-06,-1e-05,0,-5e-06,-1e-06,-6e-06,-2e-06,1e-06,3e-06,1e-06,-1e-06,3e-06,1e-06,-3e-06
