1.2e-05,8e-06,1e-05,2e-06,1.7e-05,4e-06,2e-06,1.8e-05,9e-06,1.1e-05,1.9e-05,1.7e-05,1.2e-05,4e-06,5e-06,1e-06,0,1.8e-05,1e-06,1.4e-05,1.4e-05,2.3e-05,0,1e-05,1e-05,1.5e-05,1.2e-05,2.6e-05,1.6e-05,1.4e-05,1e-06,9e-06,2.4e-05,1.4e-05,6e-06,1e-05,2.5e-05,4.6e-05,2.6e-05,2.2e-05,1.8e-05,1.9e-05,2.5e-05,2.1e-05,2.1e-05,1.6e-05,7e-06,4.5e-05,3.2e-05,4e-06,4e-06,1e-06,8e-06,5e-06,4.5e-05,3e-06,1.7e-05,1.3e-05,4.4e-05,7e-06,3e-06,2e-06,8e-06,2.6e-05,1.6e-05,1.5e-05,2.5e-05,3.9e-05,3e-06,3.9e-05,1e-05,2.8e-05,9e-06,2.4e-05,0,2.5e-05,1.8e-05,5.5e-05,2e-06,1.6e-05,2e-05,3.3e-05,1.8e-05,1.8e-05,5.2e-05,1e-06,3.4e-05,2.3e-05,5e-06,2.4e-05,4.6e-05,4.7e-05,4e-05,4.5e-05,5.1e-05,7.3e-05,3.8e-05,4e-06,2e-05,2.3e-05,4.8e-05,3.8e-05,3.8e-05,2e-06,2.5e-05,1.3e-05,2.3e-05,9e-06,3.3e-05,5e-06,5e-06,1.5e-05,2.5e-05,6.3e-05,3.9e-05,4e-06,3.1e-05,1e-05,3.3e-05,4.8e-05,3e-06
9e-06,2.3e-05,1.9e-05,1.6e-05,3e-05,3.5e-05,1.6e-05,7e-06,2.1e-05,2e-05,4.1e-05,7e-06,2.4e-05,2.1e-05,4.3e-05,3.4e-05,2.3e-05,4.8e-05,1.4e-05,1.8e-05,2e-05,2.1e-05,1.4e-05,1.1e-05,3.8e-05,4.9e-05,2.4e-05,4.1e-05,3.5e-05,1.3e-05,2.6e-05,1.8e-05,2.6e-05,5.5e-05,3.3e-05,1e-06,6.4e-05,5.1e-05,6.8e-05,3.7e-05,7.1e-05,6.2e-05,2.3e-05,3.7e-05,2.4e-05,2.9e-05,3.8e-05,5.3e-05,7.2e-05,2.5e-05,1.6e-05,2e-06,1e-05,1.3e-05,7.8e-05,3.2e-05,1.5e-05,3.6e-05,0.000119,4.4e-05,2.9e-05,1.5e-05,2.7e-05,5.1e-05,3.1e-05,4.2e-05,6.4e-05,7e-05,2.1e-05,7.4e-05,4.6e-05,8e-05,4.2e-05,3.9e-05,1.1e-05,6.5e-05,4.3e-05,0.000103,2.3e-05,3.6e-05,6.7e-05,9.7e-05,2.8e-05,2.3e-05,9.5e-05,3.7e-05,4.8e-05,8.4e-05,1.7e-05,4.4e-05,0.000107,0.000102,8.3e-05,0.000107,9.4e-05,0.000145,7.4e-05,1.9e-05,4.4e-05,4.4e-05,0.000108,9.4e-05,5.8e-05,2.5e-05,6.7e-05,5.2e-05,4.1e-05,4e-06,6.1e-05,2.2e-05,3.5e-05,2.5e-05,3.7e-05,0.000129,9.5e-05,1e-05,0.000106,3.6e-05,6.8e-05,7.9e-05,2.6e-05
4.9e-05,2e-05,3.5e-05,3.4e-05,5.4e-05,2.1e-05,4e-06,4.2e-05,2.1e-05,4.8e-05,6.6e-05,3.4e-05,3.6e-05,1.8e-05,6.4e-05,1.6e-05,4e-05,2.1e-05,4.6e-05,5.2e-05,6.9e-05,4.5e-05,1.3e-05,8e-06,3.9e-05,1e-04,4.2e-05,2.5e-05,6.2e-05,3.5e-05,4.2e-05,2e-05,5.8e-05,7.4e-05,1.3e-05,2.3e-05,7.8e-05,8.7e-05,0.000104,8.6e-05,4e-05,9.1e-05,2.5e-05,7.2e-05,2.6e-05,9.2e-05,3.9e-05,7.9e-05,4.9e-05,3e-05,1.6e-05,5e-06,6.2e-05,3.9e-05,9.4e-05,3.3e-05,5.4e-05,7.8e-05,4.7e-05,3.7e-05,4e-05,7e-06,3.1e-05,7.7e-05,5.5e-05,5.6e-05,3.9e-05,0.00011,2.1e-05,9.7e-05,5.3e-05,0.000119,1.9e-05,1.8e-05,3.5e-05,8.8e-05,1.8e-05,0.000113,6e-05,7.8e-05,3.8e-05,8.6e-05,2.7e-05,1.4e-05,0.000105,4.6e-05,8.9e-05,4.2e-05,5.4e-05,6.5e-05,9.8e-05,7.7e-05,3.6e-05,0.000105,0.000133,0.00011,8.4e-05,2e-05,5.4e-05,4.6e-05,0.000126,0.000135,0.000118,4.6e-05,0.00011,3.6e-05,7e-05,3.3e-05,6.7e-05,5.5e-05,3.6e-05,8.6e-05,5.8e-05,0.000123,5.8e-05,2.1e-05,0.000157,5.8e-05,7.8e-05,0.000105,2.4e-05
0.000102,9.8e-05,9.9e-05,3e-05,5.3e-05,8.3e-05,5.2e-05,6.5e-05,4.3e-05,7.1e-05,6e-05,2.9e-05,5.1e-05,3.9e-05,5.6e-05,5.9e-05,5.2e-05,0.000103,0.000107,4.3e-05,2.6e-05,6.4e-05,4.3e-05,4.8e-05,4.3e-05,0.000129,9.9e-05,5.5e-05,7.7e-05,7.3e-05,1.6e-05,2.2e-05,6.3e-05,8e-06,9.2e-05,8.1e-05,0.000155,8e-05,3.9e-05,7.8e-05,0.000108,0.000124,4.1e-05,6.5e-05,1.4e-05,0.000108,0.000114,0.00017,2.7e-05,3.3e-05,7.3e-05,3.4e-05,0.000137,0.000107,8.9e-05,5.6e-05,7.9e-05,0.000147,0.00018,0.000155,0.000104,6.2e-05,5.4e-05,8.7e-05,5.5e-05,8.5e-05,7.2e-05,5.5e-05,6e-05,0.000179,9.5e-05,0.000156,0.000111,3.9e-05,8e-05,0.00012,8.4e-05,0.000142,0.000123,6.1e-05,9.9e-05,4.3e-05,1e-04,5.7e-05,0.000135,0.000117,0.000161,0.000137,0.000149,0.000105,8.8e-05,0.000106,0.000111,4.2e-05,0.000144,0.000252,0.000202,0.00013,4.7e-05,7.2e-05,0.000129,0.000155,0.00014,0.000107,3.4e-05,6.8e-05,5.8e-05,5.6e-05,6.3e-05,6.8e-05,6.6e-05,5.8e-05,0.000158,9.9e-05,0.000142,1.8e-05,0.00022,0.000162,0.000158,0.000202,0.000144
2.3e-05,7.9e-05,6.4e-05,4.1e-05,6.3e-05,4.3e-05,5e-05,7.1e-05,7.4e-05,5.8e-05,8.6e-05,5.3e-05,3e-05,8.2e-05,6.4e-05,1.3e-05,1.5e-05,0.000104,6.1e-05,1.3e-05,6.1e-05,5.3e-05,1.6e-05,3.9e-05,8.4e-05,6.5e-05,4e-05,5.8e-05,0.000125,0.000105,8.2e-05,6.4e-05,7.1e-05,4.6e-05,9e-05,8.2e-05,7.2e-05,9.2e-05,7.8e-05,0.000101,0.000123,9.9e-05,9.6e-05,9.3e-05,8e-06,0.000113,7.3e-05,0.00013,7.3e-05,8.8e-05,0.000178,9.8e-05,0.000184,1.9e-05,8.5e-05,6.8e-05,4.7e-05,0.000113,7.4e-05,0.000142,3.9e-05,7.9e-05,0.000101,0.000153,6.6e-05,2.9e-05,0.000123,0.00015,0.000118,0.000167,0.00021,0.000263,3e-05,0.000102,0.000178,0.000183,1e-04,0.000309,0.000243,0.000158,6.2e-05,9.6e-05,0.000104,0.00013,0.000241,9.5e-05,0.000339,8.9e-05,0.000145,0.000273,0.000321,0.000204,0.000109,0.000139,0.000224,0.000336,0.000243,0.000189,0.00011,0.000116,5.5e-05,0.000266,0.000158,9.5e-05,7.5e-05,0.000137,0.000139,9e-06,3.7e-05,0.000109,0.000121,0.000145,5.4e-05,0.000182,0.000147,6.9e-05,0.000332,5.8e-05,0.000191,0.000172,0.00014
2.7e-05,8.4e-05,0.000135,0.000103,2.9e-05,8.3e-05,1.6e-05,1.4e-05,5e-05,8.7e-05,0.000118,1.8e-05,1.2e-05,9.2e-05,0.000133,6.3e-05,3.7e-05,0.000109,0.000123,7.3e-05,6.4e-05,2.2e-05,6e-05,7e-06,4.4e-05,3.2e-05,7.1e-05,0.000102,0.000211,5.7e-05,9e-06,0.000155,0.000203,0.000131,0.000133,9e-05,0.00011,9.3e-05,0.000114,0.000118,3.1e-05,0.00017,8.1e-05,0.000262,0.000147,7.9e-05,0.00016,0.000155,0.000259,0.000189,0.000108,0.000163,3.8e-05,0.000164,0.000114,0.000126,0.000117,0.000131,0.000176,0.000189,0.000146,0.000111,0.000184,0.000251,0.000356,0.000163,0.000209,0.000175,0.000291,0.000187,0.000164,0.000118,0.000169,0.000157,0.000273,0.000177,8e-06,0.000249,0.000121,5.7e-05,0.000111,0.000158,0.000175,0.000345,0.000188,0.000178,0.000164,0.000267,0.00013,5.2e-05,0.000127,0.00014,0.000195,0.000358,0.00012,0.000194,0.000275,0.000213,0.000206,0.000308,2e-04,0.000316,0.000558,0.000268,0.000174,0.00028,8e-05,3.6e-05,0.00015,0.000147,0.000195,2.6e-05,0.000241,0.000111,7.3e-05,7.4e-05,3e-04,0.000335,0.000375,0.000431,5e-05
5.3e-05,0.000116,0.000214,5.9e-05,9e-05,5.7e-05,4.5e-05,3.6e-05,8.6e-05,0.000131,5.1e-05,0.000169,6.6e-05,8.5e-05,3.9e-05,4.6e-05,5.3e-05,0.00015,4e-06,0.000175,0.00018,0.000213,0.000187,0.000103,3.6e-05,5.9e-05,0.000106,0.000107,7.9e-05,0.000165,7.3e-05,0.000183,0.000132,7e-05,0.000155,0.000205,3.6e-05,7.6e-05,3.2e-05,8e-05,9.7e-05,0.000337,0.000193,0.000365,0.000222,0.000134,0.000225,0.000173,0.000228,0.000232,0.00029,0.000149,0.000119,0.000114,0.000258,0.000261,0.000284,0.000359,0.000119,3e-04,0.000415,0.000413,0.00025,0.000302,0.000261,0.000353,0.000528,0.000365,0.000654,0.000198,5.1e-05,0.000232,0.000341,0.000166,0.000325,0.000428,0.000296,0.00028,0.000325,0.000319,0.000415,0.000314,0.00018,0.000559,0.000252,0.000318,0.000431,9e-05,0.000261,0.000377,0.000141,0.000275,0.000646,0.000346,0.00018,0.00061,0.000323,0.000456,0.000679,0.000494,0.000492,0.000185,0.000371,0.000233,0.000253,0.000599,0.000605,0.000117,0.000261,0.000337,0.000253,0.000118,0.000304,0.000482,0.000449,6.1e-05,0.000266,0.000345,0.000349,0.000498,0.000606
6.5e-05,9.9e-05,0.000146,0.000124,0.000132,4.7e-05,4.3e-05,2.2e-05,5.3e-05,4.2e-05,0.000105,0.000262,0.000186,0.000145,0.000106,8.9e-05,0.000126,0.000148,0.000213,0.000309,0.000152,0.000129,0.000112,5.2e-05,8.4e-05,4.4e-05,0.000127,7.1e-05,7e-05,0.000234,0.000157,6.4e-05,0.00026,0.000292,0.000428,0.000408,0.000366,0.000276,0.00033,7e-05,8.5e-05,0.000232,0.00018,0.000194,0.000129,3.9e-05,0.000241,8.2e-05,0.000223,0.000313,0.000189,0.000235,1.7e-05,0.000211,0.000269,0.000354,2.5e-05,0.000318,0.000352,0.000277,0.000231,0.000281,0.000432,0.000695,0.000395,0.000384,0.00022,0.000227,0.000685,0.000652,0.000281,0.000379,0.000429,0.00045,0.000491,0.000498,0.000247,0.000104,0.000471,0.000201,0.000365,0.000739,0.000791,0.000607,0.000614,0.000439,0.000275,0.000559,0.000247,0.000666,0.000677,0.000358,0.00055,0.000562,0.000803,0.001084,0.000659,0.000315,0.00045,0.000227,0.000754,0.000515,0.000614,0.000497,0.000128,0.000488,0.000247,0.000452,0.000362,0.000519,0.000261,5.6e-05,0.000305,7.6e-05,0.000517,0.000564,0.000229,0.000134,7e-04,0.000128,0.000527
5.5e-05,0.000118,4.2e-05,5.1e-05,4.1e-05,0.00011,4.9e-05,6.2e-05,3.1e-05,8.3e-05,0.000141,0.000186,0.000101,6.3e-05,7.2e-05,3.5e-05,9e-05,0.000188,0.000257,0.000103,3e-05,1e-04,0.00011,9.7e-05,7e-05,0.000139,0.000266,0.000161,0.000111,0.000133,5e-05,4.8e-05,0.000117,0.000226,0.000224,0.000156,0.000133,0.000117,0.000359,0.000323,0.00011,0.000206,0.00011,0.000125,0.000247,0.000219,0.000114,0.000316,8e-05,0.000145,0.000122,0.000168,0.000228,0.00046,0.000467,0.000468,0.000323,0.000364,0.000222,0.000274,0.000106,0.000423,0.000134,0.00039,0.000386,0.000256,3.2e-05,0.000286,0.000425,0.000478,0.000321,0.000499,0.000117,0.000383,0.000123,0.000409,0.000542,0.00048,0.000419,0.000599,0.000616,0.000607,0.000503,0.000305,0.000416,0.00046,0.00043,0.000877,0.001004,0.000334,0.000429,0.00053,0.000676,0.000358,0.000749,0.000744,0.000737,0.000598,0.000547,0.000355,0.000564,0.000635,0.000157,0.000452,0.000343,0.000426,0.000486,0.000641,0.000516,0.000111,0.000358,0.000183,0.000245,0.000291,0.000359,0.000365,0.000262,0.000105,0.000684,0.000587,0.000421
6.9e-05,2.7e-05,3.9e-05,4.8e-05,1e-05,7.7e-05,0.000105,0.000131,0.000135,0.000143,7.7e-05,2.4e-05,3e-05,5.4e-05,3.8e-05,3.3e-05,7.3e-05,5e-05,6.1e-05,6.1e-05,0.000129,1e-04,5.9e-05,9.9e-05,0.000123,0.000104,0.000124,0.000139,0.000163,2e-05,2.7e-05,1.5e-05,9.6e-05,0.000135,0.000316,0.00023,0.000166,0.000184,0.000106,0.000191,0.00022,0.000129,6.3e-05,0.000183,0.000223,3.5e-05,6.6e-05,0.00023,0.000353,0.000403,0.000219,0.000182,0.000143,0.000276,0.00044,4.3e-05,0.000122,0.000138,0.000247,0.000464,0.000406,0.00037,0.000272,0.00023,0.000203,0.000257,0.000131,0.000209,0.000151,0.000274,0.000123,0.000398,0.000261,0.000227,0.000304,0.000456,0.000447,0.00012,0.000329,0.000326,0.000263,0.000158,0.000182,0.000221,0.000278,0.000278,0.000303,0.000505,0.000584,0.000749,0.000108,0.000441,0.000201,0.000481,0.000577,0.000661,0.000233,0.000304,0.000115,0.000123,0.000479,0.000289,0.000353,0.000545,0.000689,0.000384,0.000505,0.000387,0.000181,0.000121,0.000474,0.000344,0.000277,0.000232,0.000266,0.000385,0.000462,0.000472,0.000155,0.000148,0.000293
7.4e-05,3.6e-05,2.1e-05,3.6e-05,3.2e-05,3.7e-05,5e-05,3.5e-05,7.2e-05,2.6e-05,8.2e-05,4.6e-05,1.5e-05,1.3e-05,2.9e-05,3.8e-05,4.4e-05,5.4e-05,4.8e-05,3.9e-05,8.2e-05,7.6e-05,6.6e-05,4.9e-05,9e-06,2.1e-05,8.5e-05,5.5e-05,5e-06,6.2e-05,4.3e-05,2.1e-05,0.000106,3.6e-05,0.000146,9.3e-05,3.5e-05,7.6e-05,0.000124,8.6e-05,0.000143,0.000101,1.1e-05,0.00017,4.1e-05,4.5e-05,6e-06,0.00012,0.000163,0.000158,6e-05,0.000107,2.6e-05,0.000214,2.7e-05,0.000158,4.9e-05,0.000131,0.000177,0.000228,0.000194,0.000117,0.000134,8e-05,0.000108,5.4e-05,5.6e-05,0.000166,0.000222,4.1e-05,5.5e-05,0.000233,0.000123,0.000138,3.9e-05,0.00018,7.4e-05,8e-05,0.00024,2.2e-05,0.00015,0.000122,8.5e-05,5.6e-05,0.000133,5.8e-05,8.5e-05,0.000211,0.00017,0.000339,0.00037,0.000184,0.00019,0.000231,0.000137,0.000348,0.000253,0.000288,0.000151,6.8e-05,0.000191,5.1e-05,0.000181,0.000427,0.000276,0.000147,0.000136,0.000112,0.000111,0.000162,0.000211,9.5e-05,9e-05,0.000293,0.000274,0.000126,0.000262,0.000105,0.000119,7.4e-05,5.3e-05
2.8e-05,1.5e-05,1.9e-05,3e-05,1e-05,2.2e-05,3e-05,3.5e-05,2.4e-05,2e-06,3.9e-05,3e-05,2e-05,2.2e-05,3.4e-05,6e-06,1.2e-05,3.8e-05,6.2e-05,6e-06,5.3e-05,2.4e-05,2e-05,1.5e-05,1.8e-05,1.8e-05,4e-05,2e-05,3e-05,3.3e-05,1.9e-05,2.6e-05,6.4e-05,4e-06,1e-04,4.8e-05,3.6e-05,3.1e-05,6.9e-05,4.1e-05,5e-05,1.7e-05,3.1e-05,8.2e-05,3.2e-05,6.2e-05,2.1e-05,1.8e-05,1e-04,6.9e-05,2.2e-05,5.4e-05,4.4e-05,0.000103,6.1e-05,9.2e-05,6e-06,3.8e-05,9.2e-05,8.3e-05,7.1e-05,7.1e-05,8e-05,4.9e-05,2.3e-05,4e-05,5e-05,0.000117,0.000127,2.2e-05,2.8e-05,7.8e-05,6.3e-05,5.9e-05,6.2e-05,6.1e-05,2.8e-05,8.1e-05,0.000123,4.3e-05,0.000116,9.9e-05,8.9e-05,3.6e-05,7.3e-05,2e-06,0.000131,0.00015,0.000144,0.000115,0.000187,0.000111,7.9e-05,0.000166,9.9e-05,0.000154,0.000125,8.8e-05,7.7e-05,6.6e-05,0.000136,5.5e-05,8.3e-05,0.000157,6.9e-05,8.4e-05,0.000117,6.3e-05,4.5e-05,3.3e-05,0.000103,2.8e-05,8.2e-05,0.000147,0.000142,6.8e-05,0.000128,0.000104,0.000124,6.7e-05,1.8e-05
3.2e-05,1.8e-05,1.3e-05,1e-05,1.7e-05,6e-06,3e-06,2.5e-05,4.4e-05,2e-05,5.9e-05,3.1e-05,3.1e-05,2.1e-05,1.8e-05,2.9e-05,1.2e-05,3.4e-05,5e-05,2.2e-05,2.4e-05,1.4e-05,1.2e-05,1.2e-05,2e-05,9e-06,3.5e-05,3.1e-05,4.7e-05,4.6e-05,3.2e-05,1.8e-05,5.8e-05,2.8e-05,6.1e-05,3.4e-05,3.7e-05,2.7e-05,3.3e-05,1.4e-05,1.7e-05,1.5e-05,1.9e-05,5.3e-05,3.2e-05,4.8e-05,2.4e-05,6.2e-05,7e-05,5.7e-05,2e-05,1.8e-05,4.8e-05,4.2e-05,5.7e-05,7.1e-05,1.9e-05,2.5e-05,8e-05,9.3e-05,7.8e-05,4.6e-05,0.000106,4.5e-05,2.7e-05,7.2e-05,4.4e-05,5.1e-05,7.5e-05,2.9e-05,7e-06,4.4e-05,4.7e-05,3.7e-05,4.6e-05,6.1e-05,1.3e-05,5.9e-05,6.1e-05,3.3e-05,8.7e-05,9.2e-05,6.6e-05,5.9e-05,2.8e-05,3.6e-05,9.4e-05,9e-05,9.6e-05,0.000107,0.00013,0.000118,7.8e-05,0.000149,0.000103,0.000127,0.000105,7e-05,4.9e-05,9.2e-05,0.000111,6.2e-05,6.9e-05,7e-05,7.3e-05,6.2e-05,8.3e-05,7.2e-05,5.2e-05,4.9e-05,0.000106,2.8e-05,8.5e-05,0.000173,0.000119,3.8e-05,8.9e-05,9.4e-05,0.000101,3.6e-05,3.1e-05
4e-05,3.8e-05,2.1e-05,1.8e-05,1.6e-05,1.5e-05,2.1e-05,1.3e-05,3.8e-05,1.2e-05,6.2e-05,1.9e-05,3.3e-05,1.2e-05,3.5e-05,3.6e-05,4.8e-05,2.7e-05,1.3e-05,2.3e-05,3e-05,4.6e-05,1.5e-05,2.3e-05,5.5e-05,4.4e-05,1.3e-05,7.5e-05,7.8e-05,3.6e-05,5e-05,4.1e-05,2.1e-05,5e-05,2.9e-05,5e-05,6.8e-05,6.8e-05,7.4e-05,4.1e-05,1.7e-05,1.4e-05,3.6e-05,7.6e-05,5.1e-05,9.2e-05,2.8e-05,4.2e-05,6.7e-05,5e-05,3.7e-05,8e-06,4.5e-05,5.3e-05,6.5e-05,4.7e-05,3.6e-05,6e-05,5.7e-05,5.6e-05,6.1e-05,6e-05,5.4e-05,2.8e-05,1.7e-05,8.3e-05,1e-04,9e-05,0.000114,3.7e-05,7.3e-05,2.5e-05,5.9e-05,5e-05,0.000116,0.000134,1e-04,3e-05,6e-05,4.3e-05,4e-05,4.8e-05,2.5e-05,7.5e-05,8.7e-05,6.6e-05,6.3e-05,5e-05,7.6e-05,0.000104,0.000117,0.000137,0.00014,0.000209,0.000168,9.8e-05,0.00012,9.3e-05,8.8e-05,8.3e-05,9.8e-05,0.000119,0.000122,5e-05,0.000124,7.4e-05,0.000134,5.6e-05,0.000119,6.1e-05,0.000163,8.9e-05,9.2e-05,7e-05,2.6e-05,0.000118,4.8e-05,0.000165,0.000175,2.2e-05,0.000108
3.6e-05,3.7e-05,2.4e-05,2e-05,1.5e-05,8e-06,3.8e-05,1e-05,2.5e-05,1.8e-05,3.7e-05,4.5e-05,2.9e-05,5.9e-05,3.5e-05,1.2e-05,2.2e-05,1.5e-05,1.7e-05,4.4e-05,5.9e-05,7.1e-05,3.3e-05,3.2e-05,5.2e-05,4.6e-05,2.2e-05,4.7e-05,0.00012,9.8e-05,5.5e-05,5.9e-05,7.7e-05,8.6e-05,1e-04,4.3e-05,9.9e-05,0.000122,1.4e-05,4.2e-05,1.8e-05,3.3e-05,4e-05,3.3e-05,1.3e-05,7.4e-05,0.000115,9.2e-05,4.7e-05,4.9e-05,4.3e-05,4.4e-05,4.4e-05,4e-05,5.2e-05,8.1e-05,8.7e-05,5.8e-05,7e-05,5.7e-05,2.7e-05,9.7e-05,5.7e-05,4.5e-05,4.3e-05,0.000112,0.000128,8.9e-05,0.000138,6e-05,9.8e-05,9.8e-05,4.1e-05,2.5e-05,0.000105,0.000223,0.000276,0.000175,4.4e-05,9.7e-05,0.000134,7.3e-05,4.3e-05,4.6e-05,7.4e-05,0.000161,0.000134,0.000117,0.000104,2e-04,0.000144,0.00018,0.000105,5.1e-05,1.7e-05,8.5e-05,4.2e-05,8.2e-05,0.000134,2.7e-05,9.5e-05,0.000107,0.000151,7.9e-05,0.000153,2.2e-05,0.00014,0.000167,0.000228,0.000111,5.2e-05,9.7e-05,8.2e-05,2.1e-05,1.2e-05,0.000113,0.00014,0.000125,0.000114,0.000208,8.2e-05
2.8e-05,4e-06,4.9e-05,3.4e-05,1.1e-05,2.3e-05,4.5e-05,3.9e-05,6.8e-05,1.8e-05,5.8e-05,5.4e-05,6.9e-05,0.000101,5.8e-05,5e-06,1.8e-05,2.1e-05,1.2e-05,5.6e-05,3.8e-05,8.1e-05,2.7e-05,2.6e-05,5.2e-05,1.2e-05,5.6e-05,6.4e-05,6.5e-05,3.2e-05,3.1e-05,6.7e-05,9.4e-05,2.9e-05,5.7e-05,4.5e-05,8.9e-05,3.2e-05,7.7e-05,3.8e-05,2.3e-05,6.5e-05,7.5e-05,9.4e-05,8.6e-05,9.9e-05,8.4e-05,1.8e-05,8.3e-05,4.4e-05,3.3e-05,8e-06,5.3e-05,0.000134,0.000109,3.2e-05,4.1e-05,5.6e-05,1.3e-05,4e-06,3.9e-05,9.5e-05,0.000122,9.2e-05,8.1e-05,7.5e-05,2.6e-05,7.1e-05,5.7e-05,3.3e-05,0.000117,6.1e-05,7.5e-05,8.4e-05,8.9e-05,0.000103,0.000124,8.9e-05,4.1e-05,9.3e-05,9.9e-05,0.000127,9.3e-05,5e-05,0.000126,0.000297,0.000218,0.000135,0.000124,0.000281,0.000144,0.000114,0.000159,0.000133,4.9e-05,3.6e-05,4.3e-05,7.6e-05,0.000188,2e-04,0.000199,7.5e-05,6.2e-05,0.000117,0.000145,0.000252,0.000174,5.3e-05,0.000134,0.000115,0.000191,0.000152,1e-04,3.3e-05,9.1e-05,0.000182,0.000211,0.000198,4e-05,6.5e-05,9.3e-05
2.3e-05,1e-05,3.5e-05,1.7e-05,2e-05,2.5e-05,1.7e-05,4.6e-05,3.1e-05,4e-05,7.3e-05,2.9e-05,3.6e-05,4.6e-05,2.8e-05,5.5e-05,1.9e-05,4.1e-05,6.8e-05,7.3e-05,8.5e-05,5.4e-05,7.1e-05,4.5e-05,5.4e-05,3.4e-05,5.7e-05,2e-05,3e-06,2.8e-05,3.2e-05,3.8e-05,6.9e-05,8.5e-05,1.2e-05,8.9e-05,4.8e-05,9.2e-05,9.4e-05,5.9e-05,7.2e-05,3.5e-05,1e-05,0.000105,0.000156,0.000135,1.2e-05,5.4e-05,7.4e-05,0.000118,7.7e-05,1.9e-05,5.3e-05,1e-04,0.000129,0.000117,5.3e-05,4e-05,6.2e-05,5.7e-05,4e-05,4.8e-05,3.8e-05,5.7e-05,7.6e-05,3.5e-05,1e-05,5e-05,0.000172,8.7e-05,5.2e-05,0.000104,0.000105,7.8e-05,9e-05,0.00012,5e-06,6.1e-05,6.4e-05,8.6e-05,6.7e-05,3.5e-05,1.3e-05,3.3e-05,0.00021,0.00023,0.000147,5.5e-05,7.8e-05,9.7e-05,0.000161,0.000105,9.1e-05,7e-05,0.000115,0.000113,0.000118,1.3e-05,0.000137,0.000114,2.3e-05,9.9e-05,7.7e-05,0.000153,0.000136,0.000216,0.000192,0.000145,8.2e-05,0.00011,0.000197,7e-05,0.000134,0.000123,0.00023,0.000177,8e-06,5.1e-05,5.3e-05,8.3e-05,0.000143
5e-06,1.6e-05,1.4e-05,6e-06,2.9e-05,6e-06,3.3e-05,1.4e-05,1e-05,3e-05,2.3e-05,5e-05,7e-06,8e-06,8e-06,4.4e-05,4.5e-05,1.7e-05,4e-05,2.6e-05,3e-05,2.8e-05,4.8e-05,4e-05,2.3e-05,4e-06,1.8e-05,3.4e-05,2.6e-05,5e-05,4.3e-05,3.4e-05,5e-06,5.9e-05,4.5e-05,5.1e-05,4e-05,5.7e-05,3.5e-05,2.5e-05,3.5e-05,2.5e-05,2.5e-05,7.2e-05,9.8e-05,8.2e-05,9.6e-05,8.3e-05,3.2e-05,4.8e-05,6.2e-05,7.7e-05,4.7e-05,5.3e-05,3.6e-05,6.3e-05,2e-05,3.7e-05,5.3e-05,4.5e-05,2.5e-05,4.9e-05,5.4e-05,4.6e-05,7.7e-05,6.8e-05,4e-05,4.8e-05,0.000161,9.6e-05,5.7e-05,7.6e-05,4.9e-05,2.3e-05,2.5e-05,8.1e-05,4.3e-05,2.8e-05,6.6e-05,2.2e-05,9.6e-05,2.5e-05,5.2e-05,2.9e-05,0.000111,9.1e-05,7.8e-05,1e-05,2.9e-05,3.5e-05,5.4e-05,4.3e-05,0.000104,5.2e-05,4.5e-05,0.000113,6.1e-05,6e-06,0.000103,5.4e-05,4e-05,7.3e-05,9.2e-05,5.1e-05,6.6e-05,0.00011,0.000129,0.000115,0.000136,2.7e-05,0.000155,0.000108,0.000102,0.000107,0.000138,5.9e-05,4.8e-05,7.9e-05,7.7e-05,0.000163,9.5e-05
1.4e-05,1.7e-05,1.3e-05,1.6e-05,2.9e-05,2.8e-05,3.7e-05,2.2e-05,3.6e-05,3.1e-05,1.2e-05,3.1e-05,4.9e-05,3e-05,3.1e-05,3.2e-05,6e-06,4.3e-05,8.2e-05,3.2e-05,3.4e-05,1.9e-05,1.4e-05,2.7e-05,6e-06,1.4e-05,9e-06,3.4e-05,1.9e-05,2.1e-05,4e-06,1.7e-05,3.4e-05,7.6e-05,8.2e-05,8.6e-05,4.5e-05,2.3e-05,5e-05,4.2e-05,2.6e-05,1.6e-05,2.9e-05,8.2e-05,1.6e-05,7.7e-05,2.9e-05,3e-05,3e-05,5.2e-05,4e-05,1.6e-05,4.8e-05,5e-06,2.6e-05,7e-05,5.3e-05,7.3e-05,6.8e-05,0.000122,7.7e-05,8.7e-05,6.1e-05,3.8e-05,1e-05,1.3e-05,2.8e-05,1.1e-05,9.5e-05,5.7e-05,2.6e-05,4.9e-05,3.9e-05,2.5e-05,3e-06,6.1e-05,2.1e-05,1e-05,6.2e-05,8.7e-05,5.8e-05,7.5e-05,7e-05,1.9e-05,1.9e-05,8e-05,3.2e-05,4e-05,9.6e-05,0.000106,2.8e-05,7.8e-05,5.5e-05,4.8e-05,3.7e-05,9.7e-05,2.5e-05,9.5e-05,6.4e-05,3.1e-05,8e-06,7.2e-05,6.4e-05,7e-06,0.000108,0.000112,6.5e-05,0.000104,3.8e-05,7.2e-05,0.000127,7e-05,4.7e-05,2.8e-05,9.3e-05,8e-05,1.1e-05,8.5e-05,2.2e-05,9e-05,5.9e-05
2.3e-05,3.1e-05,1.3e-05,1.2e-05,3.1e-05,3.7e-05,2.6e-05,1.6e-05,4.1e-05,2.1e-05,8e-06,2.3e-05,2.6e-05,1.6e-05,2.4e-05,1.4e-05,2.1e-05,3.1e-05,5.5e-05,2.9e-05,2e-05,2.1e-05,3.4e-05,3.6e-05,3.3e-05,3.7e-05,1.1e-05,6e-05,3.9e-05,6e-06,8e-06,2.2e-05,3.4e-05,4.7e-05,5.9e-05,4.3e-05,3e-05,5.6e-05,5.9e-05,4.4e-05,5.6e-05,3.8e-05,2.2e-05,4.6e-05,5.5e-05,3.4e-05,3.7e-05,2.4e-05,5.5e-05,6e-05,3.4e-05,1.7e-05,3.7e-05,1.6e-05,7.1e-05,4.6e-05,4.3e-05,3.1e-05,2.1e-05,4.7e-05,1.2e-05,3.8e-05,2.5e-05,2.9e-05,1.6e-05,2.7e-05,3.5e-05,3.2e-05,7e-05,2.1e-05,2.7e-05,2e-05,5e-05,6.3e-05,3.8e-05,7.5e-05,4.5e-05,5.4e-05,4e-05,4.3e-05,8.9e-05,3.8e-05,5.6e-05,3.9e-05,5.6e-05,9.1e-05,9.8e-05,1.8e-05,7.3e-05,3.1e-05,4.5e-05,8.4e-05,9.9e-05,7.9e-05,4.1e-05,8.1e-05,9e-06,9.8e-05,6e-06,5.4e-05,8.3e-05,4.4e-05,4e-05,8.9e-05,2.1e-05,1.9e-05,5.1e-05,7.9e-05,5.2e-05,4.1e-05,3e-05,4.5e-05,4.4e-05,5.3e-05,2.2e-05,4.8e-05,6.5e-05,5e-05,7.5e-05,7.4e-05,2.6e-05
1e-05,1.4e-05,2.7e-05,1.1e-05,2.5e-05,2.7e-05,1.5e-05,5.4e-05,5.3e-05,4.8e-05,3.2e-05,1.1e-05,3.8e-05,1.3e-05,3.2e-05,6e-06,2.7e-05,4.1e-05,6e-05,5.5e-05,3.5e-05,3.1e-05,3.4e-05,6.4e-05,3.6e-05,2.7e-05,3.5e-05,4.2e-05,4e-05,3.3e-05,1.8e-05,1e-05,4.1e-05,7e-05,6.5e-05,7e-05,5.5e-05,2.8e-05,8.9e-05,2e-06,1.8e-05,3.7e-05,6.2e-05,7.4e-05,6.4e-05,3.9e-05,3.2e-05,1.9e-05,6.9e-05,7.3e-05,4.4e-05,3.4e-05,4.6e-05,1.8e-05,6.2e-05,1.7e-05,7e-06,1.9e-05,2.9e-05,3.8e-05,2.2e-05,3.7e-05,5.7e-05,2.2e-05,5e-06,4e-05,2.9e-05,1.1e-05,4.5e-05,5.3e-05,1e-05,5.5e-05,3e-05,5e-05,1.6e-05,5.4e-05,2.3e-05,3.6e-05,2.8e-05,3.5e-05,3.8e-05,6.5e-05,3.5e-05,4.9e-05,2e-05,6.2e-05,4.1e-05,8.3e-05,0.000118,9.2e-05,7.4e-05,2.5e-05,5e-05,3.3e-05,5e-06,9.4e-05,5.6e-05,2.8e-05,5.5e-05,8.9e-05,2.7e-05,5.1e-05,2e-05,6e-05,2.1e-05,3.1e-05,9.6e-05,5.8e-05,4.1e-05,3.3e-05,3.5e-05,5.4e-05,8.4e-05,4.2e-05,3.1e-05,5.1e-05,1.4e-05,3.8e-05,2.8e-05,8e-05,2.9e-05
2.7e-05,3.2e-05,3e-05,2.3e-05,1e-05,7e-06,7e-06,4.7e-05,1.1e-05,2e-05,2.3e-05,1.3e-05,2.8e-05,2.1e-05,1.7e-05,2.2e-05,3.9e-05,2e-05,1.5e-05,3.5e-05,4.9e-05,2e-06,5.5e-05,2e-05,2.6e-05,1.6e-05,4.1e-05,1e-05,1.1e-05,2.1e-05,2.3e-05,2.1e-05,2.9e-05,4.6e-05,8.4e-05,3.6e-05,2.7e-05,3.4e-05,5.9e-05,6.2e-05,4.3e-05,1.8e-05,2.4e-05,3.6e-05,6e-05,3.7e-05,5.5e-05,6.1e-05,9e-06,5.5e-05,1.8e-05,2.4e-05,3.1e-05,2.3e-05,4.4e-05,3.2e-05,3.3e-05,4.4e-05,6.1e-05,4.7e-05,2.1e-05,4.7e-05,5e-05,2.8e-05,2.5e-05,6.4e-05,2e-05,1.7e-05,4.5e-05,3.3e-05,4.3e-05,1e-05,2.3e-05,5e-05,4.1e-05,2.9e-05,4.1e-05,3e-05,4.1e-05,2.3e-05,1.4e-05,6e-06,5e-05,2e-05,7.1e-05,8.8e-05,5.5e-05,8.6e-05,2.3e-05,9.8e-05,7.5e-05,4.9e-05,1.6e-05,6.8e-05,4.9e-05,6e-05,5.5e-05,0.000114,4.2e-05,5.3e-05,3.9e-05,8.8e-05,6.3e-05,1.2e-05,1e-05,2.4e-05,5.7e-05,4.6e-05,1.6e-05,5.6e-05,4.5e-05,4.9e-05,7.2e-05,0.000106,2.9e-05,6e-05,7.3e-05,5.9e-05,3.6e-05,5.3e-05,6.2e-05
5e-06,7e-06,3e-06,4e-06,8e-06,3e-06,2e-06,1.6e-05,2e-05,5e-06,1.2e-05,1.3e-05,1e-05,3e-06,8e-06,8e-06,1.3e-05,3e-06,8e-06,9e-06,3e-06,1e-05,3.2e-05,3.1e-05,6e-06,1.3e-05,1.7e-05,2e-06,5e-06,1.1e-05,1e-05,7e-06,1.3e-05,1.5e-05,1.5e-05,1.9e-05,1.5e-05,1.1e-05,1.1e-05,1.9e-05,1.2e-05,2e-05,6e-06,1e-05,8e-06,1.2e-05,2.4e-05,2.1e-05,1e-05,2.1e-05,1.6e-05,3.1e-05,9e-06,2.9e-05,1e-05,1.7e-05,2.3e-05,9e-06,1.1e-05,2.3e-05,1.8e-05,1.8e-05,1.2e-05,4e-06,3.9e-05,2e-06,1.4e-05,1.7e-05,8e-06,1.4e-05,1.6e-05,4e-06,1.6e-05,9e-06,1.2e-05,1e-05,1.4e-05,2.8e-05,3.3e-05,1.6e-05,2.6e-05,3.1e-05,1.8e-05,7e-06,4.1e-05,1.9e-05,3.1e-05,2.8e-05,3.2e-05,3.1e-05,1.7e-05,9e-06,9e-06,1e-05,1.2e-05,1.3e-05,2.8e-05,4.9e-05,2.5e-05,3.3e-05,1.6e-05,2.4e-05,3e-05,2.9e-05,2.4e-05,4e-06,2.2e-05,4.3e-05,2.5e-05,3e-05,2.9e-05,2.9e-05,3.6e-05,4.7e-05,1.7e-05,2.1e-05,7e-06,3.9e-05,1.2e-05,1.2e-05,1.3e-05
2e-06,4e-06,6e-06,0,5e-06,5e-06,3e-06,8e-06,1e-05,8e-06,6e-06,6e-06,7e-06,6e-06,8e-06,9e-06,4e-06,3e-06,1.4e-05,6e-06,5e-06,8e-06,2.2e-05,4e-06,1.1e-05,1.3e-05,2.7e-05,1.8e-05,1.6e-05,1e-06,1.1e-05,2e-06,9e-06,9e-06,2e-05,1.6e-05,1.4e-05,2.2e-05,2.5e-05,2.4e-05,2.8e-05,3.5e-05,2e-05,1e-05,3.1e-05,7e-06,2.2e-05,1.7e-05,1.3e-05,8e-06,1.3e-05,2.9e-05,3.4e-05,4.2e-05,4.5e-05,2.2e-05,1.6e-05,2.4e-05,1.4e-05,1.2e-05,1e-05,6e-06,2.3e-05,7e-06,4.6e-05,2.7e-05,3.6e-05,1.3e-05,3e-05,1.4e-05,3e-05,2.7e-05,4.3e-05,2.3e-05,1.3e-05,3e-05,2.8e-05,1.9e-05,1.7e-05,1e-05,3.7e-05,6.8e-05,4.4e-05,3.2e-05,9e-06,4.5e-05,3e-06,2.9e-05,3.1e-05,1.7e-05,2.9e-05,1.8e-05,2.9e-05,2.9e-05,2.2e-05,1.2e-05,3.9e-05,7.5e-05,2.3e-05,5.7e-05,7e-06,4e-05,4.2e-05,3.2e-05,5.8e-05,6e-05,5e-05,6.3e-05,3.4e-05,4.2e-05,1.2e-05,4.8e-05,3.1e-05,6.3e-05,7.2e-05,3.7e-05,1.5e-05,4.4e-05,7e-06,2.5e-05,1e-05
5e-06,5e-06,7e-06,5e-06,7e-06,4e-06,2e-06,3e-06,8e-06,6e-06,7e-06,5e-06,5e-06,3e-06,9e-06,1e-06,6e-06,5e-06,1.5e-05,7e-06,3e-06,9e-06,8e-06,1e-05,1.2e-05,6e-06,1.1e-05,1.4e-05,5e-06,6e-06,8e-06,4e-06,8e-06,6e-06,5e-06,1e-05,3e-06,1.5e-05,5e-06,1.2e-05,3e-06,1.5e-05,1.6e-05,2.1e-05,3.2e-05,1.5e-05,2.2e-05,1.5e-05,1.1e-05,6e-06,1.8e-05,2.2e-05,1.5e-05,2.1e-05,2.5e-05,3e-05,2.2e-05,9e-06,1.2e-05,2.6e-05,2.2e-05,8e-06,3.3e-05,2.8e-05,3.8e-05,2.5e-05,1.7e-05,1.4e-05,4e-05,1.9e-05,3.1e-05,1e-05,4.7e-05,4.9e-05,3.4e-05,2.7e-05,3.9e-05,2.8e-05,1.5e-05,2.2e-05,2.3e-05,5.8e-05,4.7e-05,3e-06,3.5e-05,6.6e-05,5.2e-05,1.7e-05,3.4e-05,2.9e-05,1.1e-05,1.8e-05,3.1e-05,2.2e-05,1.1e-05,3.2e-05,3.8e-05,3.2e-05,3.9e-05,6.4e-05,6.8e-05,8e-05,3.2e-05,1.1e-05,3.9e-05,2.1e-05,3.8e-05,4.3e-05,1.8e-05,4.4e-05,3e-05,4.8e-05,6.2e-05,3.3e-05,6.7e-05,4.2e-05,2.2e-05,5.8e-05,6.5e-05,7.5e-05,5.7e-05
3e-06,2e-06,6e-06,6e-06,3e-06,3e-06,2e-06,2e-06,7e-06,4e-06,6e-06,6e-06,6e-06,2e-06,4e-06,4e-06,5e-06,2e-06,1e-05,3e-06,5e-06,6e-06,6e-06,1e-06,4e-06,4e-06,1.4e-05,7e-06,5e-06,5e-06,5e-06,1e-06,6e-06,2e-06,1.4e-05,1.1e-05,3e-06,6e-06,1.2e-05,7e-06,4e-06,4e-06,1.5e-05,5e-06,9e-06,1.1e-05,1.2e-05,7e-06,1.7e-05,1.3e-05,8e-06,1e-05,6e-06,2.9e-05,1.4e-05,4e-06,1.5e-05,1.1e-05,1.3e-05,3.4e-05,0,2.1e-05,2.5e-05,2.2e-05,1.5e-05,9e-06,1.1e-05,1.5e-05,3.4e-05,1.4e-05,1.4e-05,2.2e-05,2.3e-05,1e-05,1.5e-05,3.7e-05,2.3e-05,1.3e-05,1.8e-05,2.4e-05,2.8e-05,1.5e-05,1.8e-05,1.5e-05,3.4e-05,1.9e-05,2.8e-05,5.4e-05,3.3e-05,4.4e-05,1.6e-05,2.4e-05,4.8e-05,3.1e-05,2.1e-05,4e-05,2.6e-05,3.1e-05,6e-06,5.4e-05,6.4e-05,3.5e-05,5e-05,3.9e-05,3e-05,2.7e-05,3.6e-05,3.4e-05,5.5e-05,4.8e-05,2e-05,3.2e-05,2e-06,1.8e-05,3.6e-05,2.5e-05,3.7e-05,5.1e-05,5.8e-05,1.9e-05,1.1e-05
4e-06,3e-06,2e-06,2e-06,3e-06,2e-06,1e-06,3e-06,6e-06,3e-06,5e-06,3e-06,6e-06,3e-06,3e-06,3e-06,5e-06,5e-06,6e-06,2e-06,4e-06,4e-06,2e-06,3e-06,6e-06,3e-06,1e-05,6e-06,2e-06,7e-06,9e-06,4e-06,9e-06,3e-06,1.1e-05,1e-05,9e-06,9e-06,1e-05,3e-06,2e-06,1e-06,1.7e-05,5e-06,1.5e-05,2.2e-05,1.8e-05,2.1e-05,1.1e-05,5e-06,1.6e-05,9e-06,7e-06,2.3e-05,1.1e-05,2.3e-05,2.1e-05,1.2e-05,1.4e-05,2.2e-05,1.7e-05,1.9e-05,7e-06,2.2e-05,6e-06,6e-06,1.3e-05,1.2e-05,1.4e-05,4e-06,1.3e-05,1.6e-05,1e-05,1.9e-05,1.4e-05,9e-06,2.3e-05,1e-05,3e-06,2e-05,2.2e-05,1.3e-05,1.2e-05,1.7e-05,1.9e-05,2.6e-05,1.5e-05,3.4e-05,2.7e-05,3.8e-05,3e-05,4e-06,3e-05,2.6e-05,2.8e-05,5.6e-05,3.2e-05,3.4e-05,3e-05,1.9e-05,2.4e-05,5.1e-05,2.9e-05,2.1e-05,4e-05,3.1e-05,3.7e-05,2.8e-05,4.3e-05,1.2e-05,1.9e-05,9e-06,6e-06,1.7e-05,1.6e-05,6e-06,1.4e-05,3.5e-05,2.3e-05,3e-05,3.3e-05
5e-06,1e-06,3e-06,2e-06,3e-06,0,1e-06,2e-06,5e-06,1e-06,5e-06,2e-06,5e-06,6e-06,2e-06,4e-06,2e-06,3e-06,9e-06,2e-06,2e-06,4e-06,3e-06,9e-06,1.1e-05,2e-06,8e-06,4e-06,6e-06,4e-06,3e-06,6e-06,5e-06,3e-06,2e-06,1.6e-05,9e-06,1e-05,1.8e-05,9e-06,4e-06,1e-06,1.5e-05,1.3e-05,8e-06,8e-06,6e-06,1.1e-05,1.8e-05,5e-06,1.8e-05,8e-06,3e-06,1e-05,1.1e-05,2e-05,9e-06,9e-06,1e-05,6e-06,4e-06,7e-06,1.2e-05,2.2e-05,1.3e-05,9e-06,9e-06,1.1e-05,1.2e-05,8e-06,1.3e-05,3.3e-05,2.5e-05,2.7e-05,1.1e-05,2.1e-05,9e-06,1.7e-05,2.2e-05,2.7e-05,9e-06,1.2e-05,1.1e-05,6e-06,1e-05,3e-06,1.2e-05,1.7e-05,2.6e-05,4e-06,1.1e-05,4e-06,2.6e-05,4e-06,6e-06,2.8e-05,1.2e-05,2.5e-05,4e-06,7e-06,1.3e-05,2.3e-05,1.6e-05,3.7e-05,1.9e-05,9e-06,1.9e-05,2.3e-05,1.1e-05,1.2e-05,1.5e-05,1.7e-05,8e-06,2e-05,1.2e-05,1.1e-05,1e-05,2e-06,2.1e-05,2.7e-05,2.5e-05
2e-06,5e-06,3e-06,1e-06,2e-06,2e-06,0,4e-06,2e-06,3e-06,7e-06,5e-06,5e-06,3e-06,6e-06,3e-06,2e-06,4e-06,7e-06,5e-06,3e-06,4e-06,4e-06,8e-06,2e-06,5e-06,3e-06,4e-06,3e-06,2e-06,3e-06,6e-06,1.1e-05,3e-06,9e-06,6e-06,3e-06,5e-06,7e-06,4e-06,2e-06,4e-06,1.2e-05,1.5e-05,3e-06,1.4e-05,4e-06,8e-06,1e-05,7e-06,1.1e-05,1e-06,2e-06,3e-06,7e-06,1.2e-05,1e-06,5e-06,1e-05,1.6e-05,9e-06,1.2e-05,1.2e-05,1.9e-05,4e-06,9e-06,3e-06,1.2e-05,5e-06,9e-06,7e-06,2.1e-05,1.1e-05,1.2e-05,8e-06,1.5e-05,4e-06,8e-06,2.2e-05,8e-06,8e-06,7e-06,5e-06,1.1e-05,4e-06,1.7e-05,1e-05,1.6e-05,1.1e-05,1e-05,9e-06,8e-06,1.6e-05,9e-06,1.1e-05,1.5e-05,2e-05,5e-06,6e-06,4e-06,1.7e-05,2e-05,1.2e-05,2.1e-05,1.1e-05,9e-06,9e-06,1.4e-05,4e-06,1.6e-05,1.3e-05,2.3e-05,5e-06,1e-05,3e-06,5e-06,5e-06,3e-06,7e-06,2.4e-05,1.8e-05
2e-06,5e-06,3e-06,4e-06,2e-06,0,2e-06,4e-06,3e-06,2e-06,4e-06,0,4e-06,1e-06,2e-06,1e-06,1e-06,2e-06,3e-06,1e-06,2e-06,5e-06,1e-06,4e-06,5e-06,6e-06,1e-05,5e-06,4e-06,4e-06,5e-06,3e-06,9e-06,2e-06,1.2e-05,1e-05,4e-06,2e-06,3e-06,4e-06,8e-06,5e-06,8e-06,9e-06,4e-06,1.1e-05,2e-06,5e-06,1.2e-05,2e-06,7e-06,5e-06,4e-06,4e-06,5e-06,9e-06,4e-06,5e-06,6e-06,1.8e-05,4e-06,9e-06,3e-06,1.4e-05,3e-06,1.2e-05,4e-06,7e-06,1.2e-05,1.1e-05,7e-06,1.2e-05,1.2e-05,1.6e-05,5e-06,7e-06,1.2e-05,1.5e-05,1.6e-05,7e-06,7e-06,3e-06,3e-06,9e-06,1e-06,1.4e-05,1.7e-05,5e-06,1.6e-05,1.3e-05,7e-06,5e-06,8e-06,1.1e-05,1e-06,5e-06,2.1e-05,1e-06,5e-06,2e-06,1.3e-05,1.3e-05,8e-06,1.1e-05,8e-06,1e-05,1.2e-05,2.3e-05,8e-06,1.2e-05,3e-06,8e-06,9e-06,8e-06,1.3e-05,1.6e-05,1.3e-05,7e-06,1.7e-05,1.1e-05,1.4e-05
2e-06,4e-06,4e-06,3e-06,2e-06,3e-06,3e-06,6e-06,6e-06,2e-06,7e-06,5e-06,2e-06,4e-06,4e-06,2e-06,2e-06,1e-06,4e-06,4e-06,7e-06,8e-06,3e-06,2e-06,2e-06,2e-06,8e-06,5e-06,5e-06,5e-06,4e-06,3e-06,6e-06,5e-06,1.6e-05,4e-06,1e-06,3e-06,7e-06,1.4e-05,8e-06,1e-05,3e-06,1.6e-05,7e-06,7e-06,6e-06,3e-06,3e-06,3e-06,7e-06,4e-06,1e-06,6e-06,3e-06,8e-06,4e-06,6e-06,4e-06,1.1e-05,1.1e-05,1.3e-05,1.1e-05,8e-06,4e-06,4e-06,7e-06,5e-06,1.6e-05,1.4e-05,3e-06,1.5e-05,1.2e-05,9e-06,1.4e-05,4e-06,1.3e-05,1e-05,1.1e-05,6e-06,3e-06,1.1e-05,7e-06,4e-06,1.3e-05,1.5e-05,1.8e-05,1.8e-05,1.8e-05,2.1e-05,1e-05,7e-06,1.3e-05,1.4e-05,4e-06,1.6e-05,1.3e-05,1.6e-05,2e-06,2e-06,8e-06,1.7e-05,1.7e-05,1.7e-05,5e-06,1.1e-05,1.1e-05,1.9e-05,1e-05,1.6e-05,2.1e-05,1.9e-05,7e-06,9e-06,7e-06,2e-06,3e-06,1.4e-05,1.8e-05,1.5e-05,9e-06
1e-06,2e-06,1e-06,1e-06,2e-06,2e-06,1e-06,2e-06,3e-06,3e-06,7e-06,2e-06,4e-06,4e-06,7e-06,8e-06,2e-06,2e-06,3e-06,2e-06,9e-06,0,5e-06,3e-06,2e-06,1e-06,5e-06,2e-06,3e-06,7e-06,8e-06,1e-06,8e-06,5e-06,1.2e-05,6e-06,7e-06,2e-06,1.2e-05,1.4e-05,5e-06,1e-06,6e-06,1.2e-05,1.7e-05,1.3e-05,1.1e-05,1e-05,9e-06,1.5e-05,1.4e-05,4e-06,1.5e-05,1e-05,4e-06,1e-05,5e-06,1.5e-05,1.2e-05,2.3e-05,1.8e-05,1.5e-05,1.4e-05,1.5e-05,1.2e-05,1.7e-05,5e-06,9e-06,1.4e-05,1.4e-05,4e-06,1.6e-05,8e-06,1.2e-05,1.3e-05,1e-05,1.5e-05,4e-06,2.6e-05,1.1e-05,9e-06,1.6e-05,5e-06,1.1e-05,1.7e-05,1e-05,1.3e-05,7e-06,1.2e-05,3.2e-05,8e-06,4e-06,1.4e-05,5e-06,1e-05,2.1e-05,7e-06,9e-06,4e-06,4e-06,1e-06,2.6e-05,5e-06,2.8e-05,1.8e-05,1.2e-05,1.2e-05,1.6e-05,9e-06,6e-06,1.2e-05,1.8e-05,6e-06,5e-06,8e-06,5e-06,4e-06,1.2e-05,1.5e-05,1e-05,5e-06
4e-06,1e-06,2e-06,2e-06,3e-06,2e-06,0,3e-06,5e-06,1e-06,1e-06,8e-06,1e-06,5e-06,6e-06,7e-06,4e-06,6e-06,8e-06,8e-06,4e-06,3e-06,7e-06,1.3e-05,5e-06,5e-06,1.3e-05,1.2e-05,3e-06,7e-06,2e-06,5e-06,1.4e-05,5e-06,1.1e-05,4e-06,1.1e-05,3e-06,1.3e-05,2.3e-05,1.2e-05,6e-06,1e-06,8e-06,2.2e-05,1.5e-05,4e-06,3e-06,2e-05,9e-06,1.6e-05,7e-06,2.8e-05,2e-05,1.4e-05,1e-06,1.3e-05,1.5e-05,1.7e-05,2.5e-05,2.3e-05,7e-06,2.5e-05,3e-06,1.8e-05,2.5e-05,1e-05,6e-06,1.7e-05,2.2e-05,1.5e-05,1e-05,1.8e-05,2.8e-05,3.1e-05,1.1e-05,1.5e-05,1.9e-05,2.4e-05,2.5e-05,1.8e-05,5e-06,2e-05,2e-05,7e-06,2.9e-05,2.5e-05,1.5e-05,4e-06,5.1e-05,2.1e-05,2.6e-05,2.6e-05,1.8e-05,8e-06,2.1e-05,1.1e-05,1.3e-05,3e-05,8e-06,8e-06,1.8e-05,2.9e-05,2.9e-05,1e-05,8e-06,3e-06,1.3e-05,7e-06,3e-06,2.7e-05,4e-06,1.9e-05,2.2e-05,1.2e-05,1.8e-05,3e-06,1.3e-05,3.3e-05,2e-05,1.9e-05
4e-06,3e-06,5e-06,5e-06,7e-06,9e-06,4e-06,2e-06,3e-06,1e-06,5e-06,9e-06,7e-06,5e-06,6e-06,7e-06,8e-06,1e-06,1.1e-05,1.4e-05,1.5e-05,7e-06,1.4e-05,1.4e-05,1.2e-05,1.4e-05,1.3e-05,1.9e-05,2e-05,1.4e-05,1e-05,9e-06,1e-06,3e-06,1.5e-05,1.2e-05,1.2e-05,1.3e-05,6e-06,2.6e-05,4.8e-05,4.3e-05,2.8e-05,2e-05,2.6e-05,4.4e-05,4.3e-05,2.7e-05,2.1e-05,2e-05,2e-06,1.1e-05,3.5e-05,4.9e-05,4.9e-05,3.6e-05,2.8e-05,3.6e-05,4.8e-05,4.7e-05,1.7e-05,2.2e-05,3.5e-05,3.5e-05,2.7e-05,2.9e-05,3.6e-05,2.5e-05,3.3e-05,5e-05,5.6e-05,5e-05,2.6e-05,6e-06,5e-05,5.2e-05,3.7e-05,1.4e-05,1.2e-05,2.4e-05,5.1e-05,4.8e-05,4.2e-05,1.1e-05,1.9e-05,4.7e-05,7.1e-05,2.8e-05,8e-06,5.9e-05,6.2e-05,5.4e-05,4.1e-05,2.3e-05,2.1e-05,2.9e-05,2.9e-05,3.2e-05,4.6e-05,3.4e-05,2.7e-05,1.3e-05,2.7e-05,1.7e-05,4e-06,2e-05,1.6e-05,1.1e-05,5e-06,1.5e-05,3.7e-05,2.5e-05,2e-05,1.1e-05,1.5e-05,3.3e-05,3.2e-05,2e-05,3.8e-05,1.7e-05,4.9e-05
4e-06,2e-06,5e-06,8e-06,1e-05,7e-06,7e-06,9e-06,1.2e-05,5e-06,6e-06,4e-06,4e-06,7e-06,6e-06,7e-06,7e-06,6e-06,1.4e-05,7e-06,3e-06,5e-06,1e-05,5e-06,1.2e-05,5e-06,2e-05,7e-06,4e-06,1e-06,3e-06,3e-06,5e-06,1e-06,1.5e-05,1.5e-05,1.4e-05,2e-06,1e-05,1.9e-05,3.9e-05,2.2e-05,7e-06,1.4e-05,2.7e-05,3.6e-05,2.6e-05,1.2e-05,4e-06,2e-06,8e-06,1.9e-05,3e-05,1.3e-05,1.7e-05,9e-06,1.7e-05,1.5e-05,1.6e-05,7e-06,1.3e-05,1.6e-05,2.5e-05,2.3e-05,1.2e-05,1.4e-05,2.2e-05,1.8e-05,2.1e-05,4.4e-05,2.8e-05,2e-06,2.4e-05,2.3e-05,3.5e-05,1.9e-05,1.8e-05,1.5e-05,1.2e-05,1.3e-05,2.4e-05,2e-05,5e-06,1.3e-05,7e-06,3.7e-05,1.1e-05,1.2e-05,1.2e-05,3.5e-05,1.3e-05,3e-05,1.1e-05,4e-06,1.7e-05,5e-06,5e-06,2.5e-05,1.5e-05,5e-06,1.2e-05,1e-05,1.1e-05,2.8e-05,1.9e-05,1.2e-05,8e-06,9e-06,1e-05,2e-05,1e-05,6e-06,1e-05,7e-06,9e-06,1.3e-05,1.6e-05,2e-05,1.1e-05,1.2e-05,3.8e-05
0,2e-06,3e-06,4e-06,6e-06,2e-06,3e-06,5e-06,6e-06,1e-06,1e-06,6e-06,1e-06,4e-06,1e-06,2e-06,1e-06,2e-06,8e-06,3e-06,4e-06,4e-06,6e-06,9e-06,4e-06,3e-06,1e-05,6e-06,3e-06,1e-06,3e-06,2e-06,7e-06,4e-06,4e-06,6e-06,3e-06,5e-06,7e-06,1.2e-05,1.4e-05,7e-06,3e-06,1.6e-05,7e-06,1.5e-05,9e-06,3e-06,3e-06,4e-06,4e-06,1.1e-05,8e-06,1e-05,2.3e-05,8e-06,1e-05,5e-06,2e-06,1e-05,2e-06,1e-05,8e-06,6e-06,1e-06,7e-06,1.1e-05,4e-06,8e-06,1.4e-05,1.5e-05,1.3e-05,9e-06,7e-06,1.2e-05,4e-06,7e-06,9e-06,6e-06,6e-06,1.4e-05,1.2e-05,1.2e-05,6e-06,8e-06,2.1e-05,1.4e-05,9e-06,1.7e-05,7e-06,1.1e-05,9e-06,1e-05,1e-06,8e-06,3e-06,6e-06,1.9e-05,4e-06,2e-06,1e-05,1e-06,1e-05,1.2e-05,7e-06,1.6e-05,1.4e-05,9e-06,9e-06,5e-06,7e-06,1e-06,5e-06,9e-06,3e-06,7e-06,4e-06,8e-06,1.2e-05,4e-06,1.5e-05
1e-06,0,3e-06,2e-06,3e-06,3e-06,1e-06,5e-06,6e-06,1e-06,3e-06,4e-06,1e-06,1e-06,2e-06,2e-06,3e-06,1e-06,6e-06,2e-06,1e-06,1e-06,4e-06,2e-06,4e-06,1e-06,7e-06,0,1e-06,1e-06,4e-06,3e-06,5e-06,4e-06,2e-06,5e-06,5e-06,1e-06,1.1e-05,5e-06,6e-06,6e-06,7e-06,1.4e-05,5e-06,8e-06,5e-06,2e-06,8e-06,6e-06,3e-06,9e-06,9e-06,3e-06,1.2e-05,4e-06,7e-06,4e-06,6e-06,1.4e-05,3e-06,7e-06,9e-06,6e-06,4e-06,5e-06,5e-06,8e-06,6e-06,4e-06,1e-05,1.1e-05,5e-06,6e-06,8e-06,1.1e-05,9e-06,9e-06,2e-06,9e-06,1.2e-05,4e-06,1e-05,4e-06,9e-06,1.3e-05,1.3e-05,7e-06,1.6e-05,7e-06,1.2e-05,4e-06,3e-06,4e-06,7e-06,7e-06,9e-06,1.9e-05,9e-06,8e-06,8e-06,4e-06,5e-06,1.7e-05,3e-06,8e-06,7e-06,9e-06,6e-06,7e-06,4e-06,4e-06,4e-06,1.1e-05,6e-06,3e-06,3e-06,6e-06,6e-06,5e-06,1.5e-05
1e-06,2e-06,3e-06,2e-06,3e-06,1e-06,1e-06,3e-06,6e-06,2e-06,3e-06,3e-06,1e-06,2e-06,2e-06,3e-06,0,2e-06,8e-06,1e-06,2e-06,1e-06,2e-06,2e-06,4e-06,2e-06,6e-06,5e-06,4e-06,5e-06,3e-06,5e-06,8e-06,1e-06,3e-06,8e-06,6e-06,7e-06,1.2e-05,4e-06,4e-06,2e-06,9e-06,1.2e-05,4e-06,6e-06,1.3e-05,4e-06,6e-06,3e-06,2e-06,5e-06,7e-06,1e-06,9e-06,7e-06,1.1e-05,3e-06,5e-06,1e-05,4e-06,5e-06,1.1e-05,7e-06,4e-06,4e-06,2e-06,6e-06,5e-06,4e-06,9e-06,1.3e-05,3e-06,3e-06,7e-06,1.2e-05,5e-06,6e-06,3e-06,9e-06,1.1e-05,5e-06,5e-06,6e-06,6e-06,1.3e-05,8e-06,6e-06,1.2e-05,8e-06,1e-05,6e-06,4e-06,0,7e-06,5e-06,1.1e-05,1.6e-05,6e-06,3e-06,8e-06,9e-06,5e-06,1.9e-05,4e-06,7e-06,7e-06,7e-06,3e-06,7e-06,4e-06,4e-06,4e-06,4e-06,4e-06,4e-06,3e-06,5e-06,1e-05,1e-05,1.5e-05
2e-06,2e-06,1e-06,2e-06,3e-06,1e-06,3e-06,4e-06,4e-06,1e-06,2e-06,3e-06,1e-06,1e-06,1e-06,1e-06,2e-06,3e-06,6e-06,2e-06,2e-06,1e-06,2e-06,2e-06,4e-06,3e-06,7e-06,5e-06,3e-06,3e-06,2e-06,2e-06,6e-06,4e-06,6e-06,3e-06,5e-06,1e-06,9e-06,2e-06,4e-06,3e-06,7e-06,1e-05,3e-06,1e-05,8e-06,1e-06,3e-06,4e-06,0,3e-06,9e-06,4e-06,8e-06,4e-06,6e-06,3e-06,3e-06,1e-05,4e-06,7e-06,8e-06,8e-06,3e-06,7e-06,1e-06,4e-06,4e-06,6e-06,5e-06,1e-05,1e-06,3e-06,4e-06,1.3e-05,6e-06,6e-06,5e-06,8e-06,9e-06,6e-06,9e-06,6e-06,4e-06,1.5e-05,1.3e-05,9e-06,1.3e-05,7e-06,9e-06,7e-06,2e-06,1e-06,9e-06,9e-06,6e-06,1.3e-05,1e-06,4e-06,8e-06,5e-06,6e-06,1.4e-05,6e-06,1.1e-05,1.2e-05,1e-05,3e-06,7e-06,3e-06,1e-06,6e-06,6e-06,5e-06,3e-06,0,2e-06,7e-06,6e-06,1.2e-05
2e-06,1e-06,1e-06,2e-06,2e-06,0,2e-06,2e-06,3e-06,2e-06,3e-06,3e-06,0,1e-06,2e-06,1e-06,2e-06,1e-06,6e-06,1e-06,0,1e-06,2e-06,1e-06,4e-06,2e-06,6e-06,2e-06,4e-06,2e-06,3e-06,3e-06,4e-06,2e-06,7e-06,6e-06,1e-06,3e-06,7e-06,2e-06,2e-06,2e-06,8e-06,1.2e-05,1e-06,7e-06,7e-06,1e-06,6e-06,5e-06,1e-06,1e-06,7e-06,3e-06,6e-06,4e-06,6e-06,2e-06,3e-06,8e-06,2e-06,8e-06,9e-06,7e-06,5e-06,6e-06,2e-06,2e-06,5e-06,5e-06,5e-06,1e-05,1e-06,1e-06,3e-06,1e-05,5e-06,1e-05,2e-06,7e-06,1.1e-05,6e-06,7e-06,4e-06,4e-06,1.1e-05,1.3e-05,8e-06,1.2e-05,6e-06,1.1e-05,8e-06,2e-06,2e-06,8e-06,7e-06,5e-06,1.2e-05,6e-06,5e-06,7e-06,1e-06,2e-06,1.5e-05,8e-06,1e-05,9e-06,7e-06,2e-06,3e-06,3e-06,2e-06,5e-06,7e-06,2e-06,0,3e-06,4e-06,7e-06,5e-06,1.3e-05
1e-06,1e-06,1e-06,2e-06,3e-06,0,2e-06,3e-06,5e-06,2e-06,2e-06,3e-06,1e-06,2e-06,1e-06,1e-06,2e-06,1e-06,5e-06,2e-06,1e-06,1e-06,1e-06,0,4e-06,1e-06,7e-06,1e-06,3e-06,1e-06,2e-06,2e-06,5e-06,2e-06,6e-06,6e-06,1e-06,2e-06,7e-06,1e-06,1e-06,2e-06,7e-06,1.1e-05,1e-06,8e-06,6e-06,2e-06,5e-06,4e-06,1e-06,2e-06,7e-06,2e-06,7e-06,4e-06,4e-06,3e-06,2e-06,1e-05,4e-06,7e-06,7e-06,4e-06,5e-06,4e-06,1e-06,4e-06,3e-06,4e-06,4e-06,1e-05,0,1e-06,4e-06,1e-05,3e-06,9e-06,4e-06,5e-06,1e-05,4e-06,5e-06,4e-06,3e-06,1.1e-05,1.1e-05,8e-06,1.3e-05,3e-06,9e-06,9e-06,0,4e-06,7e-06,5e-06,9e-06,1.3e-05,3e-06,1e-06,9e-06,1e-06,1e-06,1.5e-05,4e-06,8e-06,9e-06,5e-06,1e-06,4e-06,4e-06,2e-06,6e-06,8e-06,2e-06,1e-06,2e-06,3e-06,8e-06,5e-06,1e-05
1e-06,1e-06,1e-06,1e-06,3e-06,1e-06,1e-06,3e-06,5e-06,1e-06,3e-06,3e-06,0,1e-06,2e-06,0,2e-06,1e-06,5e-06,2e-06,1e-06,1e-06,1e-06,0,4e-06,1e-06,7e-06,0,3e-06,1e-06,2e-06,3e-06,4e-06,3e-06,6e-06,6e-06,0,2e-06,7e-06,0,1e-06,2e-06,6e-06,1e-05,0,7e-06,6e-06,2e-06,4e-06,4e-06,1e-06,2e-06,7e-06,1e-06,7e-06,4e-06,5e-06,2e-06,2e-06,1e-05,4e-06,7e-06,7e-06,5e-06,4e-06,4e-06,2e-06,3e-06,3e-06,4e-06,4e-06,1e-05,1e-06,1e-06,2e-06,1e-05,3e-06,7e-06,3e-06,6e-06,1.1e-05,4e-06,7e-06,5e-06,3e-06,1.3e-05,1.1e-05,8e-06,1.2e-05,6e-06,1e-05,7e-06,2e-06,3e-06,6e-06,5e-06,8e-06,1.3e-05,1e-06,1e-06,7e-06,0,1e-06,1.4e-05,2e-06,8e-06,8e-06,6e-06,0,5e-06,4e-06,3e-06,4e-06,6e-06,2e-06,2e-06,3e-06,2e-06,7e-06,6e-06,1.1e-05
