-3.7e-05,-0.000172,-6.3e-05,-0.000131,-0.006966,-0.025411,-0.021799,-0.029579,-0.133029,-0.189941,-0.160406,-0.144414,-0.154381,-0.136681,-0.12093,-0.133808,-0.087398,-0.023438,-0.003345,-0.0024,-0.002413,-0.001003,-0.000686,-0.000751,-0.000611,-0.000271,-0.000177,-0.000107
-1.2e-05,-7e-05,-2.4e-05,-0.00021,-0.00052,0.007858,0.022067,0.034718,0.136161,0.158349,0.168061,0.167858,0.180603,0.162376,0.150538,0.139661,0.100244,0.028397,0.003946,0.003156,0.003418,0.001395,0.000957,0.001124,0.00091,0.000433,0.000282,0.000156
8e-06,5.3e-05,1.8e-05,-0.000107,0.006048,0.018597,0.002514,-0.005834,0.00407,0.021048,-0.014648,-0.034809,-0.014518,-0.027976,-0.036498,-0.010259,-0.010515,-0.004203,-0.000886,-0.00065,-0.000618,-0.000265,-0.000214,-0.000292,-0.000323,-0.000227,-9.6e-05,-3.6e-05
1.1e-05,8.1e-05,3e-05,8.7e-05,-0.000668,-0.010887,-0.018511,-0.030508,-0.133305,-0.162279,-0.144104,-0.128516,-0.169433,-0.135951,-0.11735,-0.140859,-0.098896,-0.02677,-0.003364,-0.002603,-0.002806,-0.001161,-0.000753,-0.000804,-0.000584,-0.000217,-0.000186,-0.000118
1e-05,3.8e-05,1.3e-05,0.000181,-0.003879,-0.005571,0.014492,0.021416,0.081933,0.109815,0.130435,0.137317,0.14475,0.133272,0.129856,0.120078,0.08887,0.025346,0.003704,0.002676,0.002824,0.001164,0.000805,0.000944,0.000834,0.000424,0.000245,0.000127
-1.1e-05,-7.6e-05,-3.1e-05,7.6e-05,6.7e-05,0.001735,-0.000852,0.0026,0.057239,0.078457,0.036611,0.00964,0.055103,0.027503,0.008546,0.061543,0.035816,0.007282,0.000404,0.000378,0.000343,0.000123,4.2e-05,-5.6e-05,-0.00013,-0.000157,-4.3e-05,2e-06
-1.4e-05,-6.6e-05,-2.4e-05,-7e-05,0.003744,0.004348,-0.011748,-0.019206,-0.104936,-0.14721,-0.141736,-0.13246,-0.173969,-0.12982,-0.117188,-0.14351,-0.105568,-0.028623,-0.003542,-0.002492,-0.002831,-0.001203,-0.000741,-0.000764,-0.000582,-0.000201,-0.000177,-0.000113
1e-05,6.2e-05,2.7e-05,-0.000115,-4.8e-05,0.003124,0.013192,0.014482,0.012589,0.018467,0.058888,0.067517,0.070334,0.074561,0.082831,0.041858,0.042301,0.01399,0.001853,0.001412,0.001786,0.000724,0.000471,0.000623,0.000527,0.000283,0.000176,8e-05
7e-06,4.6e-05,1.7e-05,-6.8e-05,-0.003375,-0.005756,-0.000562,0.002655,0.067658,0.099546,0.077805,0.056383,0.099267,0.050534,0.03661,0.086102,0.058826,0.014998,0.001558,0.000847,0.001046,0.00047,0.000228,9.1e-05,-1.7e-05,-0.000129,-2e-06,2.8e-05
-9e-06,-4.5e-05,-1.7e-05,3.4e-05,-0.000229,-0.004847,-0.013532,-0.019991,-0.058145,-0.084935,-0.10015,-0.077,-0.133534,-0.105767,-0.097322,-0.107242,-0.087933,-0.024394,-0.002437,-0.001745,-0.002305,-0.000949,-0.000564,-0.00056,-0.000375,-9.3e-05,-0.000138,-8.5e-05
1e-06,-1.7e-05,-1.1e-05,8.5e-05,0.00283,0.008448,0.011413,0.008337,-0.025889,-0.029003,0.001937,0.018032,0.017238,0.032239,0.042006,0.004562,0.015227,0.004891,0.000637,0.000653,0.000868,0.000328,0.000224,0.000377,0.000337,0.000211,0.000117,4.2e-05
9e-06,3.1e-05,1e-05,5.1e-05,0.000343,0.003048,0.004733,0.009584,0.061474,0.09387,0.082495,0.051365,0.113041,0.066394,0.047098,0.105112,0.078029,0.019278,0.001576,0.001035,0.001367,0.000603,0.000331,0.000156,3.9e-05,-0.000109,2.1e-05,4.1e-05
-3e-06,4e-06,1e-05,-1.9e-05,-0.002729,-0.011196,-0.012728,-0.013414,-0.01019,-0.033037,-0.066049,-0.059162,-0.101693,-0.071863,-0.072057,-0.074103,-0.068666,-0.018907,-0.001911,-0.001193,-0.001712,-0.000709,-0.000392,-0.000377,-0.000275,-6.4e-05,-0.000101,-5.5e-05
-5e-06,-1.6e-05,-1e-06,-5.5e-05,0.000353,0.001995,0.003201,-0.000468,-0.048331,-0.065587,-0.029904,-0.010423,-0.033849,-0.005735,0.013922,-0.046652,-0.022836,-0.003694,-0.000256,-9.7e-05,3.2e-05,-2.6e-05,-1e-06,0.000152,0.000107,9.6e-05,5.7e-05,7e-06
2e-06,-9e-06,-1.1e-05,-3.7e-05,0.001858,0.0086,0.007452,0.012469,0.033962,0.063405,0.09041,0.07178,0.118663,0.066582,0.052361,0.094844,0.075941,0.020683,0.002135,0.000947,0.0014,0.00068,0.000363,0.000159,9.6e-05,-6.2e-05,3.1e-05,3.8e-05
3e-06,5e-06,-2e-06,1e-05,-0.000223,-0.002588,-0.004374,-0.000583,0.031838,0.015286,-0.029362,-0.026195,-0.049543,-0.037528,-0.048641,-0.029474,-0.039978,-0.012205,-0.000964,-0.000457,-0.000939,-0.000411,-0.000234,-0.000185,-6.1e-05,2.8e-05,-6.4e-05,-3e-05
1e-06,1.5e-05,7e-06,2.1e-05,-0.001836,-0.00805,-0.0035,-0.006902,-0.043621,-0.065153,-0.063691,-0.054794,-0.070015,-0.036032,-0.01179,-0.066202,-0.041053,-0.010913,-0.00115,-0.000311,-0.000468,-0.000302,-0.000183,-4e-06,-1e-05,4.6e-05,2.1e-05,-1.4e-05
-3e-06,0,1e-06,1.4e-05,0.00086,0.005757,0.002828,0.002793,-0.001889,0.03576,0.070509,0.048454,0.094184,0.053729,0.049214,0.075897,0.070205,0.018751,0.001515,0.000577,0.001126,0.000574,0.000318,0.000104,1.8e-05,-8e-05,2.8e-05,2.9e-05
-4e-06,-1.6e-05,-4e-06,6e-06,0.000781,0.002494,0.001474,0.004531,0.045643,0.039942,0.002218,0.004092,-0.009073,0.002526,-0.020077,0.007577,-0.011534,-0.003788,-0.000432,-0.000199,-0.000348,-0.000134,-4.1e-05,-1.4e-05,1.8e-05,4e-05,-3.5e-05,-8e-06
