0.000361,0.000434,0.000148,-0.000411,-0.013057,-0.012509,-0.00615,-0.003031,-0.001445,-0.006583,-0.009432,-0.00709,-0.029975,-0.026311,-0.014629,-0.000491,-0.002366,0.000704,0.003663,-0.004084,-0.004805,-0.007173,-0.010283,-0.012585,-0.01904,-0.019107,-0.009556,-0.008704,-0.004785,-0.015015,-0.014314,-0.01261,-0.005105,-0.009348,-0.006619,-0.008162,-0.006291,-0.008497,-0.00944,-0.004678,-0.001707,-0.003525,-0.002307,-0.004288,-0.00274,-0.002032,-0.0012,-0.000699,0.000325,-9.7e-05,-0.000621,-0.000804,-0.000679,-0.00071,8.2e-05,-0.00025,-0.000206,-0.000139,-0.000286,-0.005791,-0.003807,-0.002167,-0.000992,-0.000594,-8.4e-05,0.000311,-9.7e-05,-0.000263,-0.001065,-0.001432,-0.0016,-0.001062,-0.004431,-0.002773,-0.003796,-0.002163,-0.000168,-0.004764,-0.002462,0.000873,0.000413,0.000361,0.001406,0.000736,0.000742,0.000546,-4.4e-05,-8.1e-05,-1e-04,0.000117,8e-05,-0.000117,-0.00046,-0.000221,-6.3e-05,-0.000864,-0.000185,0.000336,7e-06,-0.000517,7.9e-05,-0.000105,2.5e-05,0.000246,0.000278,0.000316,-0.000144,-0.000131,-0.015385,-0.014148,-0.020015,-0.014863,-0.007955,-0.002219,-0.000152,0.000698,0.000323,0.00026,0.000664,0.000321,0.000456
0.000374,0.000252,0.000358,1.2e-05,0.005907,0.006962,0.003123,0.000988,6.5e-05,0.001457,0.004202,0.003193,0.019044,0.018013,0.010184,-0.000273,-0.002047,-0.002674,-0.001839,0.000331,-0.003422,0.006623,0.006115,-0.004016,-0.00072,0.003153,-0.003529,-0.003146,-0.00746,-0.004467,-0.003311,-0.005241,-0.008664,-0.003534,-0.00406,-0.002305,-0.000849,-0.001565,-0.00323,-0.001007,0.000432,-0.001011,-0.002708,-0.003372,-0.001883,-0.001767,-0.001292,-0.00058,0.000287,8e-06,-0.000383,-6.3e-05,-0.00016,8e-05,0.000175,0.000383,4e-05,-0.000272,-8.2e-05,0.001827,0.001484,4.2e-05,-0.000217,-0.000413,0.00069,0.00047,0.000143,5.4e-05,0.000384,-9.2e-05,-0.000271,0.00011,0.002516,0.000159,0.000628,0.001065,-0.001421,-0.001459,0.000719,0.001259,0.000349,0.001,-0.001528,0.000419,0.001235,0.000622,0.000213,0.00014,0.000312,0.000491,0.000303,0.000412,0.000314,-0.000206,-0.000306,7.5e-05,-1.1e-05,0.000119,0.000151,0.000329,-0.001433,-0.000843,-0.00022,0.00043,-0.001346,-0.001,-0.000342,-7e-06,-0.003523,-0.001543,-0.003858,-0.001305,0.001398,0.001564,0.000775,0.000217,8e-05,-0.000185,0.000204,6.6e-05,0.000322
0.000202,8e-06,0.000123,0.000368,-0.001771,-0.002757,-0.001102,-0.000364,0.000415,2e-05,-0.005159,-0.002492,-0.00912,-0.008441,-0.004776,0.001452,-0.003551,-0.00363,0.00197,0.005605,0.000269,-0.002442,-0.003839,0.001514,0.001201,-0.000885,-0.004987,-2.7e-05,6.5e-05,2.1e-05,-0.003518,-0.002953,0.003426,0.000413,-0.001738,-0.00042,0.000156,-0.001573,-0.001166,-0.00308,-0.001141,-1e-06,0.000668,0.00075,-0.000654,-0.000375,-0.000331,-0.000553,0.000139,4.6e-05,0.000428,-0.000324,-0.000156,-5.2e-05,6e-05,-2.6e-05,-0.000131,-3.3e-05,-0.000187,-0.001586,-1e-06,0.000129,7.4e-05,-0.000347,-2e-06,4.1e-05,0.000305,0.000169,-0.000396,-0.000254,3.8e-05,0.000148,-0.001438,-0.000224,-0.003507,-0.002976,-0.000758,-0.004175,-0.001826,-0.002102,-0.00081,0.001031,-0.003588,-0.002029,-0.000124,0.000145,0.00013,2.1e-05,-0.00042,-8.1e-05,-4.5e-05,-9.5e-05,-9e-06,0.000325,-0.000122,-0.000964,-0.000763,-0.000334,-0.000165,-0.000625,-0.00159,-0.000953,-0.000233,0.000247,-0.000252,-0.001621,-0.000853,-0.000126,-0.000379,0.002071,-0.009728,-0.004244,-0.002909,-0.001644,-0.000333,-0.000103,-0.000125,-0.000229,5e-05,1.9e-05,6.5e-05
0.000165,-0.000186,8.7e-05,-0.000421,-0.002844,-0.003439,-0.001793,1.7e-05,0.000344,-0.000268,0.003817,0.00151,0.004162,0.000748,-0.00014,-0.000547,0.000409,0.001278,0.002019,-0.001365,-0.005583,-0.006121,-0.011193,-0.008273,-0.004732,-0.002154,-0.00097,-0.000648,0.002449,0.003339,0.006404,0.004136,0.000713,0.001352,0.004913,0.000113,-0.000516,-0.001733,0.000186,-0.000928,-0.000688,0.001098,-0.000873,-0.000518,0.000551,0.000229,0.00053,0.000457,-3.1e-05,0.000276,0.000301,7.2e-05,0,1.4e-05,0.00013,0.000173,0.00032,0.000165,-0.000425,0.00024,-0.000216,2e-05,7.5e-05,0.000211,0.000275,-0.00029,1.7e-05,-0.000292,-8e-05,0.000122,0.000383,-0.000609,0.000784,-0.000959,-0.001229,-0.000427,-6.1e-05,-0.000406,0.000694,-0.000507,-0.000768,-0.000398,-0.001333,-0.000574,-0.000176,-0.000302,3e-06,-0.000157,-2.6e-05,0.000114,-0.000117,0.000177,-5.7e-05,0.000125,-5.7e-05,-0.000301,0.000259,0.000183,0.000137,0.000806,0.00176,0.000752,6.4e-05,2.8e-05,-0.000437,0.000599,0.000385,0.000241,0.000454,0.001109,0.007857,0.003285,0.002882,0.001301,0.000611,-0.000258,-0.000265,-0.000141,1e-06,8e-06,3.8e-05
2.6e-05,-3.5e-05,6e-05,0.000413,0.000302,0.002753,0.00165,0.000399,-0.000161,0.000399,-0.00172,0.001138,0.002518,0.000814,0.000534,-0.001344,-0.001158,0.00097,0.000275,-0.004226,-0.008141,-0.002187,-0.00075,-0.005059,0.001825,-0.000474,0.001521,-0.000107,0.000136,-0.001904,-0.004731,-0.000168,-0.000582,0.00064,-0.000608,-0.002824,-0.000569,0.001181,0.001931,0.003349,-0.000928,-0.001357,0.000332,0.000741,0.000533,-0.000562,-8.6e-05,0.000479,5.8e-05,-0.000277,0.000164,-0.00019,-0.000236,-0.000339,-0.000373,-0.000461,-0.000246,7e-06,-5e-05,-0.00069,-0.001037,-0.000559,-0.000371,-0.000243,1.7e-05,-0.000208,0.000117,-3.7e-05,-0.00011,8.4e-05,-0.000493,0.000297,-7.1e-05,-0.000516,0.000603,-0.000423,-0.000296,0.003256,0.002698,0.000639,0.000248,-4.4e-05,1.7e-05,-9.4e-05,3.6e-05,-0.000148,-0.000215,-9.9e-05,-3.7e-05,0.000145,-0.000159,-0.000182,-0.000146,-1.5e-05,-0.000173,0.000402,0.000522,0.000462,0.000372,1.4e-05,-0.000116,0.000139,-3e-05,9.5e-05,-3.3e-05,0.000754,0.000169,5.4e-05,0.000146,0.006542,0.003889,0.004638,0.001708,-0.000642,0.000123,5e-06,-0.000191,5.6e-05,-0.000145,-1.5e-05,-2e-05
-6.5e-05,-5.2e-05,7.9e-05,0.000133,0.000944,-0.001444,-0.00135,-0.000937,0.000156,-0.000154,0.000507,-0.000903,-0.002723,5.2e-05,-0.000465,-0.000291,0.000835,0.000304,-0.000411,-0.001151,-0.003709,0.004275,-0.00896,-0.001246,-0.00557,0.002241,0.000442,0.000111,0.000837,0.003091,3e-04,-0.000973,-0.00031,-0.001036,-0.00187,0.002529,0.000208,0.000545,0.000296,-0.000912,0.000842,0.000451,-0.000198,-0.000483,-0.000683,-0.000622,0.000462,0.000436,-2.4e-05,2.9e-05,8e-06,0.00034,7.8e-05,6e-05,0.000313,-0.000523,-0.000364,-5.5e-05,-0.000241,0.000174,0.000693,-0.00013,0.000487,0.000465,0.00031,-8.2e-05,7.6e-05,4.7e-05,6.6e-05,-3.4e-05,0.000287,0.000213,-0.000406,0.000779,0.000547,0.000663,-1.9e-05,-0.001993,-0.000425,-0.000365,1.3e-05,-0.000105,0.000205,-8.6e-05,-5.2e-05,5.4e-05,-3.8e-05,7e-05,0.000106,6.1e-05,-0.000158,-3.7e-05,9.3e-05,7e-06,1.8e-05,9.7e-05,-6.5e-05,7.5e-05,0.000133,9.1e-05,-1.1e-05,5e-06,-9e-06,-5.4e-05,-0.00022,7.8e-05,-8.5e-05,-0.000237,7.7e-05,-0.01389,-0.006972,-0.004953,-0.000583,4.2e-05,6.2e-05,-0.000112,-5.2e-05,-9.2e-05,-0.000135,-2.3e-05,-4.3e-05
-6.9e-05,-0.000146,6e-06,5.1e-05,-6.2e-05,-3.1e-05,6.5e-05,0.000185,-8e-05,0.000245,0.000612,0.000875,-8.7e-05,-0.001408,-0.001247,0.000321,0.001671,-0.00283,0.000641,0.000495,0.004878,-0.00308,0.002907,0.004481,0.005421,-8e-04,-0.003071,0.002756,0.001669,-0.001745,0.0028,0.001791,0.001171,-0.00117,0.001503,-4e-06,-0.001294,-0.001371,0.000226,0.001384,-0.000131,-2.6e-05,-0.001227,0.00112,0.000638,-2.8e-05,0.000188,0.000189,9.5e-05,-0.000207,-0.000258,-0.000399,-0.000405,-0.000262,-0.000283,-0.000255,7e-06,-0.000273,-5.9e-05,-2e-05,-0.000252,-3.2e-05,-0.000267,2.4e-05,-7.8e-05,-0.000455,-0.00021,-0.000266,-9.3e-05,-0.000143,-0.000359,-0.000193,0.000602,-0.00066,0.000103,0.000266,6.9e-05,-0.000222,-0.000205,-0.000404,0.000701,-4e-05,0.000311,0.00057,-0.000421,-0.000608,-0.000289,0.000214,4.9e-05,-2e-06,-0.000164,-0.000155,-0.000186,-0.000128,0.00016,-0.00012,-0.000374,-0.000183,-0.000157,-0.000187,-0.000135,-0.000158,-0.000243,-0.00017,-0.000176,-8.9e-05,-8.8e-05,0.000175,-4.5e-05,0.001673,0.003728,0.001476,-0.001028,-0.000984,2.8e-05,-3.7e-05,-2.3e-05,-1e-06,7e-06,-3e-05,1.1e-05
2.5e-05,-0.000109,-0.000122,0.000101,-0.000292,-9.4e-05,-0.000774,-1.5e-05,0.000284,0.000158,-0.000727,-0.000416,0.001129,0.000573,0.001283,0.000773,-0.000247,0.000599,0.00167,0.000255,-0.002386,-0.003698,0.000547,-0.003082,0.000712,0.000683,0.001998,0.001804,-0.000128,-0.00025,-0.00016,-0.000728,-0.001149,6.6e-05,0.001294,-2e-06,0.001804,0.000271,0.000144,7e-05,3.1e-05,-0.000443,-0.000145,-0.000899,-0.000307,-4.3e-05,-0.000504,-6.1e-05,-0.000248,-0.000231,-0.000149,-0.000257,-0.000111,-2.9e-05,-8.1e-05,-0.000305,-0.000113,-0.000337,-5.4e-05,0.000168,-0.000163,5.2e-05,0.000122,-0.000107,-0.000154,-0.00043,-0.000146,-0.000134,-4.8e-05,-7.4e-05,0.000126,-0.000152,-2.3e-05,0.000445,0.001014,0.000679,-0.000392,0.000467,-0.001897,-0.001202,-0.000119,-0.000617,2.4e-05,0.000142,-0.000478,-0.000605,-0.000111,5.5e-05,-0.000214,-0.000197,9e-06,1.9e-05,9.3e-05,2.5e-05,-7.3e-05,2e-05,-0.000361,-6.9e-05,-0.000155,-0.000125,0.000292,0.000155,-6e-06,-1.2e-05,-1e-05,0.000261,0.00043,7.5e-05,0.000106,0.00202,8.1e-05,-0.00094,3e-04,0.000842,5.3e-05,-8e-05,3.2e-05,-0.000142,4.1e-05,-9.2e-05,4.6e-05
1.6e-05,-0.000125,-0.000139,4.4e-05,3.6e-05,0.000573,0.000428,-0.000681,-0.000315,-1e-05,-5e-06,0.000662,-0.001038,-4.8e-05,-0.000403,-0.000385,0.000461,0.000314,-0.001259,-0.000971,0.001441,-0.002848,-0.001561,0.002554,0.000507,-0.00072,-0.000385,-0.000999,0.000383,0.000295,-0.001179,-0.001903,-0.001996,-0.001104,-0.002223,-0.000655,-0.001205,0.000546,-0.000477,-0.000497,0.000699,6e-05,-0.000249,-0.000798,-0.000147,-3.6e-05,0.000193,-3e-06,-0.000227,1e-06,-0.000129,-0.00026,-0.000196,0.000134,-0.000189,-5.2e-05,-0.000169,-0.000175,-0.000253,0.000357,0.000203,-9.4e-05,-8.3e-05,-8.6e-05,-0.000204,-9.8e-05,-4.8e-05,-5.1e-05,-1.6e-05,0.000112,-0.000113,-3.4e-05,0.000303,-0.000349,-0.001067,-0.000163,0.000426,-0.000235,0.000141,-0.00025,0.000107,0.000517,0.000351,-0.000261,-0.000893,-0.000406,-8e-05,0.000128,-5.5e-05,-7.5e-05,-5.9e-05,-7.5e-05,-4.8e-05,-1e-06,-5.4e-05,-2.9e-05,-0.000105,0.000207,6.5e-05,-3e-06,-2.1e-05,-0.000102,1e-06,5.2e-05,3.7e-05,-0.00025,0.000225,9.1e-05,9.6e-05,0.000973,-0.003057,0.001143,0.00188,-9e-06,-7.2e-05,-7.4e-05,-5.4e-05,-0.000101,0,-6.7e-05,-6.5e-05
3e-05,-3e-05,-6.3e-05,8.1e-05,0.000243,0.000401,-0.000843,-0.000279,0.000157,-4.5e-05,0.000152,-0.000587,-0.000354,0.000139,-0.001472,-0.001054,-8.9e-05,2.8e-05,-0.00249,-0.000859,0.000184,-0.00136,-0.00115,0.00022,-0.001396,-0.000325,0.000766,-0.000565,-0.000587,-0.000456,0.00034,-0.000233,0.001499,0.001528,0.000338,0.000955,0.001596,0.000926,-0.000208,0.000209,-0.000973,0.000273,0.000161,0.000368,9.9e-05,0.000637,-7.7e-05,-0.000425,-7.6e-05,4.4e-05,-8.8e-05,-6.6e-05,7e-05,2.4e-05,-9e-05,-2.8e-05,-2.8e-05,6.3e-05,-1.7e-05,-6.1e-05,4.4e-05,-2e-05,6e-06,2.2e-05,-5.4e-05,4.2e-05,-4.4e-05,-0.000124,-7.7e-05,2.3e-05,6.5e-05,3.7e-05,-2.5e-05,5.3e-05,0.000827,-0.000428,0.000348,-5.1e-05,0.000919,0.000929,-0.000181,0.000139,0.00012,9.6e-05,0.000122,-0.000202,-9.8e-05,9.1e-05,-9e-06,6.7e-05,-4.3e-05,-3.4e-05,8.8e-05,8e-06,0.000175,-0.000121,-6.6e-05,-1e-06,4.9e-05,-1.4e-05,-9.5e-05,0.000146,0.000256,-4e-06,-1.3e-05,-6.9e-05,-0.000189,-2e-04,6.4e-05,0.000138,-0.001351,-0.001242,-0.001589,-0.00089,-0.000225,-0.000246,-6.8e-05,-6.1e-05,-3e-05,-3.4e-05,-8.8e-05
-1.9e-05,-2.4e-05,-2.6e-05,5.1e-05,2.2e-05,-0.000378,0.001074,0.000409,1.8e-05,0.000119,-0.000247,-7.8e-05,0.001082,-7.9e-05,0.001502,0.001186,0.000191,0.000118,-5.1e-05,-0.000397,-0.001006,0.000634,-1e-06,-0.000173,-0.001212,0.000918,-0.000644,-0.001729,2.6e-05,-0.000796,-0.001373,0.000944,0.000224,0.000226,-7e-05,0.000434,0.000536,0.000621,0.000467,-0.000138,0.000246,-9e-06,-8.6e-05,-0.000736,-1.2e-05,0.000295,-2.8e-05,0.000186,-2.8e-05,-5.7e-05,-0.000128,-0.00016,2.8e-05,-4.9e-05,3.8e-05,6.6e-05,-0.000116,-0.00033,-4.7e-05,-0.000152,-5e-06,-2.7e-05,8.1e-05,-6.1e-05,7e-05,-8.3e-05,-4.7e-05,-4.1e-05,-2.7e-05,0.000102,-7.7e-05,-0.000153,-0.000129,8.7e-05,-0.000115,0.000237,0.000437,0.000348,-0.000739,-0.000244,0.000277,-0.000193,8.7e-05,0.000163,0.000382,4.2e-05,-1.8e-05,-0.000122,-6.3e-05,-1.3e-05,-0.000128,-1.9e-05,1.6e-05,2e-06,8e-06,-5.1e-05,3.8e-05,-9.6e-05,3.1e-05,-0.000103,2e-06,-0.000166,2.3e-05,1.3e-05,6.7e-05,-7.4e-05,-9.9e-05,-2.3e-05,-5.2e-05,0.000262,-0.00016,-0.001674,-5.5e-05,7e-05,-0.000166,-0.00027,2.2e-05,-6e-06,-5.9e-05,-4.7e-05,-6.8e-05
3e-06,-2e-06,-1.3e-05,8.4e-05,-8.1e-05,-0.000163,-0.000192,-7e-05,-0.000202,-0.000327,1e-04,-1.3e-05,-0.000855,6.2e-05,-0.000844,-0.001027,-6e-05,0.000424,5e-04,0.000647,-0.000698,0.001842,-6e-04,0.000229,-0.001049,-0.002769,-0.00056,0.000819,-0.000276,0.000181,0.000949,-0.000281,-0.000815,-0.00027,-5.6e-05,-0.000629,-0.00071,-0.000394,-0.000387,-2.4e-05,-0.000501,9.6e-05,0.000557,0.000241,3.9e-05,-0.000575,-0.000107,0.000155,3e-06,-3.6e-05,1.9e-05,-7.4e-05,0.000103,-6e-06,8.3e-05,-0.000152,1.6e-05,-2e-05,-7e-06,-0.000222,-4.3e-05,0.000126,9.2e-05,0.000128,-6.6e-05,-9.9e-05,5.7e-05,2.4e-05,6.6e-05,-1.3e-05,-3e-06,4e-05,-0.000118,-0.000197,-0.000126,0.00011,8.2e-05,-4.7e-05,0.000336,0.000122,-0.00034,-0.000128,-8e-06,-1.6e-05,1.3e-05,-8.5e-05,-8e-06,9e-06,4.1e-05,-1.6e-05,-3.3e-05,1e-06,2.1e-05,6.6e-05,0.000103,9.9e-05,4.5e-05,-0.000157,-6.3e-05,-7.9e-05,-0.000159,0.000107,-7.5e-05,3e-06,5e-05,-0.00011,6.7e-05,-8.1e-05,-9e-06,-0.00198,0.000149,0.002663,0.000641,-4.4e-05,5.2e-05,-2.5e-05,-8.3e-05,8e-05,1e-06,1.8e-05,-3.4e-05
-2e-06,-2.8e-05,-9e-06,1.8e-05,6.4e-05,0.000146,0.000446,0.000322,0.000115,0.000356,0.000148,-0.000108,0.000126,-1.5e-05,0.000453,0.000683,0.000243,-0.000141,0.000394,-0.00011,0.000936,-0.000594,0.00187,-0.001928,0.000617,0.000313,0.00104,-0.000445,0.000276,0.000117,0.000866,0.001008,0.000751,-0.000148,0.000438,4.1e-05,-0.000599,-0.000894,-0.00028,-4e-05,0.000278,-0.000321,-0.000162,-0.000226,-7.8e-05,-0.000209,-0.000125,-0.00017,-3e-05,-9e-05,-5.8e-05,-9e-06,-0.000146,-2.9e-05,-2.4e-05,2e-05,8.3e-05,-1.8e-05,6.4e-05,-4.3e-05,-2.1e-05,-0.000109,-3.1e-05,-6.1e-05,2.8e-05,-0.000115,-4.6e-05,-2.2e-05,-5.5e-05,-8e-05,-4.7e-05,-5.6e-05,0.000113,9.5e-05,8.6e-05,-0.000323,-0.000668,0.000102,0.00054,-0.000347,0.000236,-0.000475,0,-3.4e-05,0.000184,-0.000113,3e-06,-6.3e-05,-2.9e-05,-3e-05,1.1e-05,-7.6e-05,-5e-06,2.5e-05,1e-06,-6e-05,1.5e-05,-5.8e-05,3.2e-05,-4.9e-05,7e-06,-2.9e-05,-0.000136,-4.7e-05,3.3e-05,-3.9e-05,1e-05,-5.8e-05,7.1e-05,0.000335,0.00108,-0.002728,-0.001113,0.00018,-6.5e-05,4.7e-05,1.7e-05,8.1e-05,3.1e-05,2.2e-05,-3e-05
6e-06,-1e-05,-8e-06,-1.4e-05,8.8e-05,6.6e-05,-0.000627,-0.000146,-5.5e-05,0.000167,-0.000105,5.2e-05,-0.000188,3.1e-05,0.000656,-0.000508,-0.000222,-0.000569,-0.000182,2.1e-05,0.00071,0.001558,0.000425,0.001261,-0.00039,-1.4e-05,-0.00019,-0.000695,0.001427,-2.2e-05,-0.000286,-0.000886,0.000335,3e-05,0.000661,-0.000373,0.00043,0.000821,5.7e-05,-1.2e-05,-8.7e-05,-0.00028,0.00012,1.3e-05,7.4e-05,-5.8e-05,8.3e-05,-7.6e-05,-0.000122,0.000111,1.1e-05,9.7e-05,0,9e-06,-1.1e-05,-0.000102,-1.1e-05,-2.4e-05,4.2e-05,-2.5e-05,-2.1e-05,0.000248,-7e-05,3.2e-05,4e-06,-9e-06,-5.7e-05,-8e-06,4.4e-05,-2e-05,-1.9e-05,4.9e-05,3.6e-05,-0.000241,0.000195,0.000157,-0.000102,0.000302,-0.000374,0.000223,-0.00032,-0.000329,5e-06,3.6e-05,-4.1e-05,-8e-06,-4e-06,-4.1e-05,2.4e-05,-3.7e-05,3.4e-05,7e-06,-1.5e-05,7e-06,1.2e-05,-4.5e-05,-4.2e-05,-5.6e-05,-2.9e-05,1.3e-05,-5e-06,-2.9e-05,-1e-06,3.1e-05,3.4e-05,1.3e-05,1.7e-05,-6.9e-05,5e-06,0.000444,3.6e-05,0.00102,0.000374,-0.000356,-2.6e-05,3e-06,-1e-06,3e-06,3.6e-05,2.3e-05,-1e-06
-7e-06,-9e-06,4e-06,-5.4e-05,7e-06,-4e-05,1.2e-05,7.8e-05,-6.5e-05,-8.8e-05,6.7e-05,6.8e-05,-8.4e-05,-2.2e-05,-0.000592,-0.000246,-9.6e-05,0.000291,-0.001009,-6.3e-05,-0.000408,0.000211,0.000258,-0.000658,0.000646,0.000814,-0.000164,-0.000195,-0.000559,1.7e-05,-0.000195,-0.000137,-0.000301,-3e-06,-0.00041,4.1e-05,4.8e-05,-0.00072,-9.7e-05,-1.5e-05,-0.000248,0.000189,-0.000115,2.5e-05,6.7e-05,4.2e-05,1.8e-05,0.000109,8.5e-05,-1.7e-05,-1.5e-05,5.6e-05,1.2e-05,-5.4e-05,2.5e-05,6.7e-05,-2.8e-05,-1.3e-05,-4.9e-05,-4.6e-05,-2.7e-05,-0.000112,0.000103,-1.3e-05,-5.2e-05,3.4e-05,7e-06,-1e-06,-1.3e-05,-8.6e-05,4.1e-05,4e-06,-4.1e-05,9.3e-05,-0.000319,-7.3e-05,7.5e-05,-0.000169,-6.1e-05,-0.000102,-1e-06,-5e-05,-9e-06,-1.7e-05,-3e-05,0.000114,-5.2e-05,-1.3e-05,-3.9e-05,-2.7e-05,-1.8e-05,1e-05,4e-06,-1e-06,1.9e-05,6.1e-05,-5.8e-05,-1.5e-05,1.8e-05,2.5e-05,-5.5e-05,5.5e-05,3.2e-05,4.5e-05,1.5e-05,-2.9e-05,7e-05,-2.1e-05,-3.5e-05,0.000209,-0.000218,0.00035,0.000164,-0.00027,9.3e-05,-6.6e-05,1.7e-05,1.5e-05,6e-06,-2.1e-05,7e-06
-1.4e-05,-1.2e-05,0,-2.2e-05,-1.4e-05,1.7e-05,-4.1e-05,-0.00025,4.5e-05,0.000107,6.8e-05,1.2e-05,0.00028,2.3e-05,0.000189,0.000751,-6.7e-05,-2.3e-05,0.000906,0.000169,-0.000669,-0.00062,-0.000222,0.000173,-0.000312,-9.5e-05,-0.000116,0.000103,-0.000218,-4e-06,-0.000361,0.000918,-0.000275,0.00031,-0.000293,0.000382,-0.000296,0.00052,0.000137,-0.000132,0.000284,4.1e-05,0.00019,0.000123,0.000108,4.7e-05,-1.2e-05,7e-06,-3.5e-05,4.3e-05,4e-06,-7.7e-05,5.7e-05,1.1e-05,-9e-06,1.2e-05,-3.8e-05,-6e-06,9.5e-05,9e-06,-4e-05,3.4e-05,-2e-05,4.5e-05,1.7e-05,-2.8e-05,3.5e-05,-4e-06,-2.5e-05,-1e-06,-1.5e-05,-3.2e-05,-6.3e-05,-2e-06,0.000192,-7.2e-05,0.00016,-0.000151,-5.5e-05,-0.000143,-3.9e-05,0.00017,4.1e-05,1.3e-05,-0.000134,-4.8e-05,-3.4e-05,-4.1e-05,2.5e-05,-1e-05,-3.1e-05,-7e-06,-8e-06,3e-06,1.5e-05,-1.5e-05,-4.6e-05,3.3e-05,-2.4e-05,-9e-06,4.6e-05,-2.4e-05,4.2e-05,-1.6e-05,1.3e-05,1.8e-05,-4.2e-05,5.4e-05,2.8e-05,0.00035,0.000248,-0.000432,0.000235,-4.4e-05,3e-06,2.2e-05,-1.6e-05,-2.8e-05,-9e-06,-1e-05,2e-06
-1e-05,-1.5e-05,-1.1e-05,-1.5e-05,3.3e-05,-7.9e-05,0.000155,9e-06,-6.2e-05,-2.7e-05,-6.9e-05,4.6e-05,5.6e-05,-1.6e-05,-0.000238,-0.000771,-0.000111,-0.000112,7.3e-05,-5.3e-05,0.000292,-9e-04,-8.2e-05,-0.000366,0.00053,-0.000324,0.00022,-4e-06,-0.000117,9.1e-05,-0.000137,-0.000804,5.8e-05,-4.8e-05,-0.000136,-4.4e-05,3.9e-05,-0.000285,-0.00011,6.6e-05,-0.000136,8.3e-05,-0.000103,-6.6e-05,3.3e-05,9.6e-05,6.1e-05,-8e-06,-1.8e-05,0,-2.2e-05,0,1.5e-05,0,8e-06,-1.7e-05,-2.4e-05,1e-05,1.4e-05,-2.3e-05,7e-06,-6.8e-05,-4.1e-05,-4e-05,-6e-06,1.4e-05,-9e-06,-2.8e-05,2e-06,1.5e-05,2.2e-05,8e-06,0,-2.9e-05,-8e-05,1.6e-05,-3.4e-05,1.4e-05,-3.4e-05,4.5e-05,1.9e-05,0.000258,-1.5e-05,-1.1e-05,-0.000119,8.1e-05,-1.4e-05,-2.3e-05,-7.4e-05,9e-06,-2.5e-05,-2e-06,-5e-06,-5e-06,-2.6e-05,-4e-06,-3.3e-05,4e-05,-2.6e-05,-1.2e-05,-2.2e-05,2.9e-05,-3.9e-05,-5.2e-05,1.2e-05,4.8e-05,-5.4e-05,1.9e-05,9e-06,-0.000334,-0.000399,0.000733,-0.000486,3.7e-05,-0.000158,-1.4e-05,-1.3e-05,-2.3e-05,-5e-06,0,6e-06
2e-06,-1e-05,-1.6e-05,-1.4e-05,3.6e-05,-4.5e-05,-7.9e-05,2.8e-05,4e-06,3.4e-05,5.1e-05,-4.8e-05,-0.000129,-1.7e-05,0.000333,0.000526,-0.000113,0.000125,0.00024,1.5e-05,0.000301,0.00047,0.000168,0.000125,-0.000139,0.000407,-0.000233,0.000594,-0.000143,-0.000216,0.00038,-1.5e-05,0.000396,-0.000106,-0.000171,-0.000119,0.000257,0.000162,-8.5e-05,-4.3e-05,0.000168,-7.4e-05,0.000161,0.000148,1.2e-05,4e-06,-4.9e-05,2e-06,-8e-06,-1.2e-05,-3.5e-05,8e-06,1e-06,1.3e-05,-7e-06,4e-06,-6e-06,-2.3e-05,2.2e-05,-1e-06,-1.1e-05,9.6e-05,1.4e-05,-2.9e-05,-2.1e-05,-3e-05,-2e-05,-2e-06,-2e-06,-8e-06,-5.2e-05,-3e-06,-2.7e-05,1.1e-05,-9e-06,4.3e-05,0.000165,-9.5e-05,0.000141,0.000208,-2.7e-05,-7.3e-05,-3.6e-05,6e-06,9e-06,-5.9e-05,-1.2e-05,2.4e-05,-1.4e-05,2e-05,8e-06,-1.6e-05,1.4e-05,-4e-06,1.9e-05,7e-06,0,6e-06,3.3e-05,-1.4e-05,3e-05,-1.9e-05,1.5e-05,1e-06,2.2e-05,-3e-06,4.9e-05,2e-06,-2.6e-05,-0.000683,0.000147,-0.000358,0.000175,0.000205,0.000118,2.8e-05,-1e-06,-6e-06,7e-06,-5e-06,0
6e-06,-5e-06,-2e-06,-8e-06,-9e-06,7.2e-05,4.6e-05,-6.9e-05,8e-06,-8e-06,1e-05,0,3.7e-05,2.2e-05,-0.000247,-0.000347,-3e-06,0.000125,-0.000218,-7e-06,0.00011,0.000575,0.000577,0.000152,0.00055,-2.4e-05,-0.000248,-5.6e-05,-0.000159,-3.4e-05,2.2e-05,-5e-05,-1.8e-05,-2.9e-05,0.000115,-0.000129,-0.000245,-9.6e-05,7.1e-05,-3.1e-05,-0.000122,-7e-05,4e-06,-2e-06,2.3e-05,-2.5e-05,2.5e-05,2e-06,-4e-06,-1e-06,5e-06,1.4e-05,2.2e-05,-1e-06,-1e-06,-3.2e-05,3e-06,-2e-05,2.1e-05,-4e-06,-8e-06,-9.7e-05,-8e-06,2.7e-05,1e-06,-4.1e-05,1e-06,-1.5e-05,1.7e-05,2.3e-05,1.9e-05,-2.4e-05,1.8e-05,-4.6e-05,-0.000111,-4.5e-05,-0.000138,-8e-06,-7.3e-05,-0.000162,5.7e-05,-0.000103,-1.8e-05,1e-06,9.5e-05,-7.5e-05,-7e-06,-6e-06,9e-06,-1e-06,1.7e-05,-1e-05,-8e-06,8e-06,-1.5e-05,9e-06,1.5e-05,-4e-06,-1.6e-05,-4e-06,2.5e-05,1.7e-05,-2.7e-05,1.1e-05,8e-06,6e-06,-1.4e-05,1.5e-05,-1.7e-05,0.000251,-0.00023,0.000177,9.5e-05,-3.6e-05,-2.2e-05,-6e-05,-6e-06,-1.4e-05,9e-06,2e-06,-5e-06
3e-06,-6e-06,-1e-06,-4e-06,-1e-05,4.3e-05,-5e-06,6.9e-05,5e-05,-1.2e-05,-3.4e-05,5.2e-05,-1.2e-05,-9e-06,0.00013,0.00025,-4.9e-05,-0.000144,-0.00022,-5e-06,-0.000244,-0.000336,-0.000129,-7.2e-05,-7.8e-05,0.000336,0.000324,-0.000171,-0.000268,-7.3e-05,-0.000153,0.000219,-6.8e-05,-4.6e-05,0.000222,0.000254,-8.5e-05,-2.6e-05,2.9e-05,2e-05,-2e-05,9.3e-05,1e-04,-5.1e-05,4.7e-05,-4.9e-05,-3e-06,-1.5e-05,2.6e-05,-1.7e-05,-4e-06,-1.8e-05,-1.6e-05,-9e-06,9e-06,-1.8e-05,5e-06,-4.6e-05,6e-06,-8e-06,-1.3e-05,3.4e-05,1.5e-05,1e-06,-2e-06,-1.6e-05,9e-06,-5e-06,-1.1e-05,-6e-06,-3.1e-05,1.8e-05,1.6e-05,3.1e-05,7.4e-05,-1.9e-05,6.2e-05,5e-05,0.000113,-6.3e-05,-1.3e-05,-1.2e-05,-2.5e-05,0,4.6e-05,-1.3e-05,-1e-06,1.2e-05,-3e-05,-5e-06,-1.6e-05,4e-06,3e-06,1e-06,-1e-06,-1.2e-05,1.3e-05,-6e-06,1e-06,-3e-06,-2e-06,-9e-06,-3e-05,-3e-06,5e-06,1.1e-05,-1.8e-05,-3.6e-05,-4e-06,0.000323,-0.000373,-0.000333,-0.000254,-9.3e-05,-5.3e-05,0,3e-06,1.2e-05,0,2e-06,-5e-06
0,-5e-06,-3e-06,3e-06,8e-06,-7.5e-05,4.7e-05,1e-06,-5.1e-05,-2e-05,4.9e-05,-5.4e-05,-4.8e-05,2e-05,9.4e-05,-0.000102,-3.4e-05,-2e-05,-2.3e-05,2.7e-05,-0.000226,0.00012,0.000176,0.000122,-0.000127,-0.000247,4.3e-05,0.000104,0.000109,-1.7e-05,-8.8e-05,-0.000151,-7.2e-05,-4.5e-05,6e-05,-3e-06,6.1e-05,0.000134,-1.7e-05,3.2e-05,9.2e-05,-3.6e-05,-5e-05,3e-06,7e-06,-8.6e-05,-4.5e-05,2.3e-05,-7e-06,9e-06,-9e-06,-5.3e-05,-3e-06,-2.7e-05,-4e-06,-8e-06,1e-06,-6e-06,2.1e-05,9e-06,-8e-06,1.3e-05,-3.5e-05,-3e-06,-4e-06,-1.8e-05,-9e-06,-7e-06,-6e-06,-5e-06,2.3e-05,7e-06,-2.6e-05,-2.1e-05,-0.00014,5.1e-05,-9.3e-05,0,9.3e-05,9.9e-05,4.5e-05,3.8e-05,-1.5e-05,-3e-06,-1e-06,-4.2e-05,-9e-06,1.7e-05,-1e-06,-5e-06,-2e-06,0,-3e-06,6e-06,0,0,-3e-06,0,2.6e-05,-1e-06,2e-05,2e-06,1e-05,5e-06,7e-06,-1.4e-05,1.2e-05,-2e-06,-1e-06,-2.3e-05,0.000312,1.2e-05,0.000143,-0.000116,5.1e-05,-3.4e-05,-1.5e-05,1.7e-05,-7e-06,0,-3e-06
-5e-06,-6e-06,1e-06,-1e-06,8e-06,-3.6e-05,-9.8e-05,-3.6e-05,7e-06,1.1e-05,-5e-06,4.2e-05,6.2e-05,-2e-06,-9e-05,-3.5e-05,3.3e-05,5e-05,0.000143,-1.4e-05,0.000153,0.000349,2.3e-05,-0.00029,-0.000213,0.000156,1.6e-05,-4.8e-05,-7.1e-05,-6.9e-05,-0.000189,-0.000164,3.2e-05,6.7e-05,-7.8e-05,1.8e-05,2.1e-05,-0.000134,6.3e-05,-1.4e-05,-0.000115,3.7e-05,8.3e-05,-8.1e-05,-2e-05,2.7e-05,3.1e-05,8e-06,-1.8e-05,7e-06,4e-06,3e-06,3e-06,3e-06,9e-06,6e-06,8e-06,-1.7e-05,2.5e-05,7e-06,-1e-06,8e-06,4.1e-05,1.4e-05,0,2.2e-05,-5e-06,4e-06,2e-06,-5e-06,-1.7e-05,-8e-06,1.3e-05,1.7e-05,3.7e-05,-5e-06,8e-05,-1.7e-05,-0.000184,-7.3e-05,-4.4e-05,-2.2e-05,-9e-06,5e-06,0,-6e-06,-1.5e-05,4e-06,5e-06,-4e-06,-1.2e-05,-3e-06,-4e-06,-2e-06,-1.3e-05,6e-06,-1.2e-05,-3e-06,-6e-06,0,-1.1e-05,-9e-06,2e-06,7e-06,8e-06,-1.5e-05,-1.6e-05,1e-05,0,0.000177,-3.1e-05,-3e-06,0.000143,6e-06,-1.5e-05,-1.1e-05,-3e-06,4e-06,-2e-06,1e-06,-4e-06
-2e-06,-3e-06,2e-06,2e-06,-6e-06,5.9e-05,2e-05,8.4e-05,2e-05,-2.7e-05,-1e-05,-3.2e-05,-9e-06,9e-06,5.7e-05,0.000152,1.4e-05,-3.3e-05,6.6e-05,1.4e-05,0.000192,0.000206,-2.8e-05,0.000233,2.6e-05,0.000192,-0.000108,1.3e-05,0.000124,-6.3e-05,0.000164,-3e-06,5.5e-05,2.6e-05,-5.7e-05,-2.5e-05,4e-05,0.000188,3.3e-05,2.9e-05,7.3e-05,-8e-06,-1.7e-05,2e-05,-1.8e-05,3.5e-05,-7e-06,-3.2e-05,-1.1e-05,-4e-06,7e-06,2.2e-05,1.9e-05,2.2e-05,-4e-06,0,-1.2e-05,-7e-06,9e-06,4e-06,-4e-06,-8e-06,-2.9e-05,-1.3e-05,1e-06,-7e-06,-4e-06,-3e-06,-9e-06,0,6e-06,7e-06,7e-06,-1.2e-05,-3.1e-05,-2.9e-05,0,2.1e-05,9e-06,7.2e-05,5.6e-05,3.5e-05,-1.5e-05,-6e-06,-2.7e-05,2.9e-05,-7e-06,1.7e-05,-1e-06,-4e-06,0,-1e-06,1e-06,-4e-06,-6e-06,-2e-06,-2.3e-05,3e-06,-1.3e-05,-3e-06,-1e-06,0,3.2e-05,-1.1e-05,5e-06,1e-06,-4e-06,-1.6e-05,1e-06,-0.000195,-2e-06,-0.000151,-0.000149,5.5e-05,-2.3e-05,-1e-06,0,7e-06,5e-06,1e-06,1e-06
1e-06,-4e-06,4e-06,2e-06,-6e-06,1.7e-05,-5.7e-05,-5.8e-05,-1.4e-05,-9e-06,2.1e-05,-2.7e-05,-2.6e-05,-1.5e-05,8.2e-05,-0.000134,3.7e-05,-2.6e-05,-0.00015,-7e-06,-0.000101,-0.000213,8.4e-05,-0.000202,-7.1e-05,-9.5e-05,9.7e-05,-5.5e-05,8.8e-05,2.3e-05,0.000197,0.000271,-5.9e-05,-1e-06,-0.000124,-9.6e-05,-0.000107,-9.9e-05,1.9e-05,3.5e-05,-6.5e-05,-1.6e-05,3e-05,-7e-06,6e-06,4.5e-05,-1e-06,1.3e-05,-7e-06,3e-06,-1.1e-05,1.2e-05,7e-06,1.2e-05,1e-06,6e-06,2e-06,-7e-06,-5e-06,1e-06,-6e-06,1e-05,9e-06,4e-06,-1e-06,-1e-05,4e-06,-1.2e-05,0,4e-06,-9e-06,-8e-06,-1.2e-05,-1.9e-05,-1.7e-05,4.2e-05,2.2e-05,-2e-05,2.7e-05,-6.7e-05,-5.4e-05,1.6e-05,-1e-05,1e-06,-4.8e-05,-4e-06,-6e-06,4e-06,-1e-06,3e-06,-1e-06,-4e-06,-8e-06,-1e-06,-3e-06,-6e-06,-2.1e-05,-5e-06,-1e-06,0,-1.1e-05,7e-06,-1.7e-05,-3e-06,1e-06,-1.5e-05,-2e-06,-5e-06,0,-0.000305,0.000308,-1.1e-05,-0.000103,-3.5e-05,2.6e-05,8e-06,-3e-06,-7e-06,4e-06,-1e-06,1e-06
3e-06,-3e-06,-1e-06,3e-06,4e-06,-4.4e-05,7.3e-05,-3.5e-05,8e-06,1e-05,-8e-06,2e-06,4.1e-05,-6e-06,-9.5e-05,-4.7e-05,4.8e-05,5.7e-05,-7e-05,1.4e-05,-5.5e-05,-0.00024,0.000172,9.1e-05,1.2e-05,9.4e-05,-8.4e-05,-0.000193,0.000131,0,-5.8e-05,-0.000156,-3e-05,-3.2e-05,9e-06,0.000153,5.1e-05,-3e-05,4.4e-05,-2.2e-05,3e-05,3.5e-05,-1.3e-05,-7e-06,3e-06,-2.2e-05,9e-06,6e-06,1.3e-05,-7e-06,-5e-06,-3e-05,1.6e-05,-9e-06,0,-6e-06,-4e-06,-6e-06,1.6e-05,-2e-06,-1e-06,3e-06,-9e-06,4e-06,2e-06,-1e-05,1e-06,-4e-06,3e-06,4e-06,-3e-06,2e-06,2.4e-05,1.9e-05,-5e-06,-8e-06,-5e-06,-1e-05,-7.7e-05,3.1e-05,6.1e-05,-1.9e-05,-4e-06,1e-06,-2.6e-05,-4e-06,-8e-06,-3e-06,-7e-06,2e-06,5e-06,-3e-06,1e-05,-3e-06,-1.4e-05,5e-06,-9e-06,-6e-06,3e-06,-2e-06,-8e-06,-1.3e-05,-1.2e-05,1e-06,2e-06,-4e-06,1.7e-05,-1.2e-05,0,0.000121,-0.000302,0.000162,2e-04,-5e-05,-1e-06,-2.3e-05,-5e-06,-9e-06,1e-06,-1e-06,0
2e-06,-4e-06,-7e-06,2e-06,2e-06,-7e-06,-6e-06,2.6e-05,-1.2e-05,-3e-06,-6e-06,1.3e-05,-1.2e-05,-2e-06,0.000138,0.00021,3.6e-05,2.5e-05,7.5e-05,-1.1e-05,-6.5e-05,6.3e-05,-8.4e-05,-7.2e-05,1.8e-05,-4.5e-05,-7.7e-05,3.5e-05,5.5e-05,1.7e-05,-6e-05,3.8e-05,9e-06,-3.1e-05,4.8e-05,-2.8e-05,4.5e-05,1.1e-05,-3e-06,3.4e-05,-6e-06,-2.4e-05,4.5e-05,1.7e-05,1e-05,8e-06,-8e-06,-8e-06,-7e-06,0,2e-06,-9e-06,1e-06,-4e-06,-2e-06,-9e-06,-4e-06,0,6e-06,-1e-05,-1e-06,1.7e-05,3e-06,-9e-06,3e-06,-1.3e-05,-1e-06,-6e-06,2e-06,0,5e-06,-4e-06,-9e-06,-1.1e-05,3e-05,-1.7e-05,-4.6e-05,1.7e-05,5.7e-05,2.5e-05,-6.3e-05,-5.8e-05,0,-3e-06,1.2e-05,-1.4e-05,-9e-06,3e-06,-6e-06,0,-3e-06,-1e-06,-5e-06,1e-06,2e-06,2e-06,4e-06,-1.2e-05,-5e-06,-1e-06,-5e-06,1.1e-05,-1e-05,5e-06,3e-06,6e-06,-2e-06,-8e-06,0,0.000202,6.8e-05,-7.5e-05,-0.000127,-6.6e-05,-1e-06,-4e-06,-7e-06,-3e-06,-4e-06,-3e-06,-1e-06
-1e-06,-2e-06,-2e-06,2e-06,-3e-06,3.1e-05,2.2e-05,-4.8e-05,1e-05,-1e-05,1.3e-05,2.6e-05,-2.7e-05,2e-06,-0.000185,-0.000235,1.9e-05,-6.6e-05,0.000139,6e-06,-2.3e-05,0.000181,7.2e-05,7.4e-05,-7e-06,0.000191,4e-05,7e-05,-6.2e-05,-1.8e-05,-9.9e-05,-0.000161,2.2e-05,1e-06,8.6e-05,-3.3e-05,-4.2e-05,-6e-05,1.4e-05,2e-06,-3e-05,-1.1e-05,-4e-06,5e-05,-2e-06,-4.4e-05,1e-05,-7e-06,-2e-06,5e-06,-3e-06,9e-06,-5e-06,5e-06,2e-06,-1.1e-05,5e-06,-1.9e-05,4e-06,-1.5e-05,-5e-06,-1.7e-05,1.4e-05,6e-06,-1e-06,-5e-06,-1e-06,-3e-06,-4e-06,-4e-06,-7e-06,-7e-06,-1.2e-05,1.1e-05,-1.7e-05,1.7e-05,3.2e-05,-1e-05,3.8e-05,-9e-06,3.9e-05,-2.3e-05,6e-06,1e-06,3.5e-05,-2.9e-05,-4e-06,-8e-06,-2e-06,-1e-06,-1.6e-05,1e-06,1e-06,-2e-06,-4e-06,-5e-06,8e-06,-7e-06,0,1e-06,-7e-06,-4e-06,-2e-06,1e-06,1e-06,0,-1.6e-05,1.1e-05,0,2.2e-05,4e-05,2.6e-05,2e-06,2.5e-05,-1.3e-05,1e-06,3e-06,-5e-06,-3e-06,0,1e-06
-2e-06,-2e-06,2e-06,2e-06,-2e-06,1e-06,-2.2e-05,4.7e-05,-1.9e-05,2e-06,-8e-06,7e-06,2.4e-05,-1e-06,0.00016,0.000174,3.9e-05,2.3e-05,-2.3e-05,0,7.9e-05,-2.1e-05,2.3e-05,0,4.5e-05,-3.6e-05,8e-06,-3.5e-05,-2.2e-05,8e-06,-8e-06,0.000248,1e-06,1e-05,-1.5e-05,-4.5e-05,-6.9e-05,0.000131,-1e-05,-1.8e-05,6.2e-05,6e-06,7e-06,2e-05,3e-06,-3e-06,-8e-06,1e-05,3e-06,-5e-06,-4e-06,1.3e-05,3e-06,8e-06,-2e-06,-5e-06,1e-06,-5e-06,8e-06,-9e-06,1e-06,-1e-05,-1.4e-05,-5e-06,-1e-06,-6e-06,-4e-06,-7e-06,-5e-06,-2e-06,1e-05,7e-06,1.9e-05,-1.1e-05,2.2e-05,0,-4e-05,2e-06,8e-06,-4.6e-05,-2.5e-05,2.2e-05,0,2e-06,3.6e-05,-1e-05,-1e-06,-8e-06,-7e-06,-2e-06,7e-06,0,0,3e-06,-6e-06,1e-06,7e-06,6e-06,1e-05,0,5e-06,2e-06,1e-05,-2e-06,0,2e-06,2.2e-05,4e-06,0,2.2e-05,-0.000266,0.000193,7e-05,2.8e-05,8e-06,0,-5e-06,3e-06,1e-06,0,0
-1e-06,-2e-06,-1e-06,0,2e-06,-2e-05,-1.5e-05,-8e-06,2.2e-05,-6e-06,-2e-06,-2.2e-05,2e-06,4e-06,-6e-05,-0.000121,5e-06,1.3e-05,-6.9e-05,-3e-06,0.000121,-0.000145,-1.1e-05,5e-06,0.000122,-7.8e-05,1.4e-05,0.000115,-1.3e-05,-1.3e-05,0.000164,-0.000219,-1e-05,9e-06,-9e-06,0,7.8e-05,-8.5e-05,-1.6e-05,5e-06,-5.7e-05,-3e-06,6e-06,2.3e-05,-4e-06,-4e-06,-1e-05,-3e-06,8e-06,8e-06,2e-06,-9e-06,1.1e-05,-1e-06,1e-06,3e-06,-2e-06,-1.6e-05,-2e-06,-1e-06,-5e-06,2.5e-05,9e-06,8e-06,-1e-06,-4e-06,6e-06,4e-06,2e-06,-4e-06,-1.1e-05,3e-06,-1.3e-05,-6e-06,2.3e-05,-1.3e-05,5.1e-05,1.2e-05,2.9e-05,5.7e-05,1.3e-05,2.2e-05,-2e-06,-1e-06,-1.1e-05,-8e-06,-5e-06,-1e-06,-4e-06,0,-4e-06,0,-1e-06,-1e-06,5e-06,3e-06,1e-06,8e-06,-1e-06,0,-3e-06,0,1e-06,-1e-06,0,8e-06,-8e-06,3e-06,0,-0.000163,0.000116,-0.000227,7e-06,-1.4e-05,8e-06,-1.2e-05,-2e-06,6e-06,2e-06,1e-06,0
1e-06,-2e-06,-1e-06,0,1e-06,2e-06,-5e-06,5e-06,-1.7e-05,0,8e-06,1.2e-05,-1.5e-05,5e-06,2.6e-05,6.9e-05,-2e-06,-2.3e-05,-6.5e-05,5e-06,-0.00011,5.5e-05,0,-3.7e-05,4e-06,1e-06,-7.6e-05,-4.3e-05,-4.7e-05,-1.9e-05,5.5e-05,0.000159,0,1.8e-05,-2.1e-05,8.1e-05,3e-05,6.7e-05,-1.1e-05,-4e-06,2.4e-05,5e-06,6e-06,-9e-06,-1e-06,6e-06,1.4e-05,-2e-06,-2e-06,-5e-06,2e-06,-1.9e-05,6e-06,-4e-06,0,0,0,-2e-06,2e-06,1e-06,2e-06,-3.2e-05,-1.1e-05,-6e-06,-2e-06,5e-06,-3e-06,-1e-06,-2e-06,1e-06,9e-06,-9e-06,2e-06,9e-06,-3e-06,4e-06,-3.5e-05,0,-5.6e-05,-7e-06,-1.8e-05,2e-05,-1e-06,-1e-06,-6e-06,-1.3e-05,-6e-06,-8e-06,0,0,5e-06,-2e-06,4e-06,-2e-06,-2e-06,-2e-06,-9e-06,1e-05,-3e-06,-1e-06,8e-06,-1e-06,7e-06,-3e-06,1e-06,0,-7e-06,-3e-06,0,-9.4e-05,-2.8e-05,0.000167,-7.8e-05,-4e-05,-1.9e-05,-7e-06,-4e-06,2e-06,1e-06,1e-06,0
1e-06,-2e-06,0,-1e-06,-2e-06,1.1e-05,1.2e-05,-8e-06,4e-06,2e-06,-1.1e-05,-1.8e-05,2e-05,-3e-06,-1.9e-05,1.2e-05,2e-06,0,8.5e-05,-4e-06,-0.000127,0.000214,4.9e-05,-3.8e-05,1.4e-05,-1e-05,6.7e-05,1.4e-05,-5e-06,-2.2e-05,-6.8e-05,-0.000124,-3e-06,-1e-06,-4e-06,-4.8e-05,-5.3e-05,-3.4e-05,-2.3e-05,-2e-05,-2e-06,0,3e-06,-2e-05,-4e-06,2.4e-05,-4e-06,7e-06,-5e-06,3e-06,-3e-06,7e-06,4e-06,-1e-06,0,-1e-06,1e-06,-1.4e-05,1.2e-05,-2e-06,-2e-06,2e-05,8e-06,2e-06,0,-8e-06,-2e-06,-4e-06,0,-3e-06,-1.2e-05,3e-06,1e-05,-3e-06,1.5e-05,6e-06,3.7e-05,-6e-06,-1.4e-05,-4e-05,1.5e-05,0,1e-06,1e-06,-1.5e-05,8e-06,-5e-06,-3e-06,2e-06,0,-3e-06,-1e-06,-6e-06,2e-06,2e-06,-2e-06,-1.4e-05,-2e-06,-1e-06,0,4e-06,1e-06,-7e-06,6e-06,0,-1e-06,1.7e-05,2e-06,0,0.000109,-0.000117,-0.000117,6e-06,-4.8e-05,5e-06,-3e-06,-2e-06,4e-06,-1e-06,-1e-06,0
0,-2e-06,2e-06,0,-1e-06,-4e-06,-6e-06,4e-06,8e-06,-6e-06,8e-06,1e-06,-7e-06,2e-06,5.3e-05,-8.1e-05,-2.3e-05,2.4e-05,3e-06,4e-06,1.8e-05,-7.2e-05,-2e-06,4.1e-05,-4.9e-05,5.2e-05,3e-05,8.8e-05,-3e-05,-1.2e-05,-7.6e-05,-1.7e-05,1e-06,-2e-05,-3e-06,2.6e-05,1e-06,2.5e-05,-1.6e-05,-3e-06,5e-06,-8e-06,-7e-06,0,-8e-06,-2e-06,-2e-06,0,-4e-06,-1e-06,2e-06,7e-06,8e-06,4e-06,-1e-06,4e-06,-3e-06,-6e-06,-5e-06,-3e-06,-1e-06,-7e-06,2e-06,1e-06,0,-2e-06,-1e-06,-6e-06,2e-06,2e-06,8e-06,2e-06,-1.6e-05,4e-06,1.5e-05,-1.3e-05,-3.5e-05,6e-06,7e-06,4e-05,-1.3e-05,-1.4e-05,4e-06,-1e-06,-2.2e-05,-1.6e-05,-3e-06,0,-1e-06,1e-06,-3e-06,0,3e-06,-3e-06,5e-06,2e-06,-1.1e-05,-2e-06,0,0,2e-06,-1e-06,-4e-06,1e-06,-1e-06,2e-06,-9e-06,4e-06,0,8e-05,0.000189,-5.4e-05,8.9e-05,1.5e-05,1.6e-05,-7e-06,-1e-06,-1e-06,-2e-06,0,0
-1e-06,-2e-06,2e-06,-1e-06,1e-06,0,1.1e-05,-7e-06,-7e-06,4e-06,3e-06,1.3e-05,-1e-05,-6e-06,9e-06,0.000107,-3.3e-05,-3e-06,1e-06,-4e-06,0.000131,-0.000218,4.5e-05,-6.2e-05,-3.9e-05,-0.000137,-3e-06,-2.9e-05,3.4e-05,-5e-06,-6e-05,4.5e-05,1.4e-05,-8e-06,2.5e-05,-4.5e-05,1.7e-05,-3.5e-05,-1.1e-05,3e-06,9e-06,5e-06,1e-05,-3e-05,-8e-06,5e-06,1e-06,-1.2e-05,0,-3e-06,-1e-06,4e-06,2e-06,3e-06,0,-6e-06,2e-06,-5e-06,0,-2e-06,-1e-06,1.7e-05,-3e-06,-5e-06,0,-9e-06,1e-06,-2e-06,-4e-06,0,-7e-06,-2e-06,7e-06,-9e-06,2e-06,2e-06,2.2e-05,-2e-06,-4.2e-05,-2.2e-05,1.4e-05,-2.4e-05,1e-06,-1e-06,-9e-06,-4e-06,-5e-06,-1e-06,-2e-06,0,-3e-06,0,-1e-06,1e-06,-1e-06,1e-06,-4e-06,0,-1e-06,0,6e-06,0,-8e-06,-3e-06,-1e-06,-3e-06,-2e-06,-1e-06,0,2.1e-05,-7.2e-05,2.3e-05,-9.9e-05,2.6e-05,-2.1e-05,-2e-06,-4e-06,-3e-06,0,-1e-06,0
-1e-06,-2e-06,-3e-06,-1e-06,0,3e-06,-6e-06,2e-06,1e-06,1e-06,-1.3e-05,-1.5e-05,1.3e-05,1e-06,-6.2e-05,-8.5e-05,-1.1e-05,-1.9e-05,-5.6e-05,5e-06,2.2e-05,4e-05,-2.8e-05,7.1e-05,2.3e-05,0,0,3e-06,1.6e-05,-8e-06,6.3e-05,6.2e-05,-7e-06,5e-06,-3e-06,1.2e-05,-1e-05,-1.1e-05,-1.6e-05,-2.2e-05,-4.1e-05,3e-06,-1.5e-05,-1.4e-05,-5e-06,-2e-05,-2e-06,7e-06,8e-06,3e-06,-1e-06,-1.4e-05,0,-2e-06,0,-4e-06,1e-06,-6e-06,2e-06,-3e-06,2e-06,-8e-06,5e-06,7e-06,0,-1e-06,1e-06,-1e-06,-2e-06,0,5e-06,0,5e-06,1e-06,-3e-06,1e-05,-2.1e-05,-4e-06,3.7e-05,2.9e-05,-1.6e-05,2e-06,0,0,1.1e-05,-6e-06,-4e-06,5e-06,-1e-06,0,-1e-06,0,0,0,3e-06,-2e-06,3e-06,-2e-06,-3e-06,0,-4e-06,-1e-06,4e-06,-1e-06,0,-3e-06,3e-06,-3e-06,0,-1.5e-05,-1.4e-05,-0.000109,7e-06,0,5e-06,-2e-06,-1e-06,-1e-06,1e-06,0,0
0,-1e-06,-3e-06,0,-1e-06,-9e-06,1e-05,-1.5e-05,-2e-06,-2e-06,1.1e-05,6e-06,-4e-06,-5e-06,2.9e-05,3.1e-05,-2.8e-05,1.4e-05,2e-06,-4e-06,-6.5e-05,0.000172,-2.5e-05,-5.8e-05,-6e-06,-1.3e-05,-1e-06,-2.1e-05,1.3e-05,6e-06,9.8e-05,-0.000156,1e-06,7e-06,-2e-05,5.7e-05,8e-06,1.2e-05,-6e-06,7e-06,3e-05,-3e-06,8e-06,-5e-06,-3e-06,2e-06,6e-06,0,-4e-06,-2e-06,-3e-06,-4e-06,3e-06,-2e-06,0,-4e-06,-3e-06,-6e-06,-3e-06,-2e-06,-4e-06,-3e-06,-8e-06,-4e-06,1e-06,-2e-06,-3e-06,-5e-06,-1e-06,0,-4e-06,-1e-06,-1.2e-05,2e-06,1.6e-05,-1.1e-05,1.3e-05,3e-06,3.7e-05,-2.6e-05,2.2e-05,1.4e-05,1e-06,0,2.2e-05,-1.8e-05,-3e-06,3e-06,-6e-06,0,8e-06,-2e-06,1e-06,1e-06,3e-06,0,6e-06,1e-06,4e-06,0,1e-06,3e-06,5e-06,3e-06,-1e-06,0,1e-06,-7e-06,0,-0.000123,9e-05,0.000105,8.5e-05,-4.1e-05,1.7e-05,0,-3e-06,-4e-06,0,1e-06,0
1e-06,-1e-06,1e-06,0,0,-1e-06,-6e-06,1e-05,1.2e-05,3e-06,-4e-06,-9e-06,-6e-06,2e-06,4.9e-05,2.8e-05,-2.4e-05,0,3.8e-05,3e-06,-0.000112,-2.9e-05,-7e-06,6e-05,-2.2e-05,-1e-06,3.8e-05,-4.8e-05,2.8e-05,6e-06,-9e-06,0.00014,-6e-06,7e-06,1.4e-05,-5e-05,-1.7e-05,-6e-06,-5e-06,6e-06,-4e-06,5e-06,-2.1e-05,1.1e-05,1e-06,-6e-06,-3e-06,-7e-06,-4e-06,0,1e-06,5e-06,6e-06,-5e-06,1e-06,-1e-06,0,-9e-06,3e-06,0,4e-06,4e-06,9e-06,-3e-06,1e-06,0,1e-06,-1e-06,0,-2e-06,0,4e-06,1.2e-05,0,-1e-05,1e-06,1e-06,-2e-06,-1.3e-05,-2e-06,-2e-05,8e-06,1e-06,0,1.8e-05,4e-06,-3e-06,1e-06,0,-1e-06,-7e-06,0,-2e-06,1e-06,-1e-06,2e-06,6e-06,-1e-06,4e-06,0,-4e-06,-3e-06,0,-3e-06,-1e-06,-1e-06,0,1e-06,0,-2.5e-05,-0.00012,-5.8e-05,-6.2e-05,-4.3e-05,-2e-05,-1.3e-05,0,0,0,0,0
0,-1e-06,1e-06,0,1e-06,1.5e-05,-1e-05,-6e-06,-1.4e-05,2e-06,-3e-06,6e-06,1.3e-05,1e-06,-9.1e-05,-6.8e-05,-6e-06,-1.2e-05,2e-05,-2e-06,3.3e-05,-0.000168,1.9e-05,-3.5e-05,2e-05,-2.2e-05,-7.3e-05,1.5e-05,-4.1e-05,1e-05,-7.3e-05,-0.000129,3e-06,1e-06,7e-06,2e-05,1e-05,-9e-06,-4e-06,-1.2e-05,2e-06,-5e-06,7e-06,2.3e-05,-2e-06,6e-06,-1e-06,-1e-06,-2e-06,1e-06,-1e-06,5e-06,6e-06,0,-1e-06,-1e-06,0,-3e-06,-1e-06,1e-06,-3e-06,6e-06,-8e-06,6e-06,0,-4e-06,-2e-06,1e-06,1e-06,0,-1e-06,-1e-06,-5e-06,4e-06,4e-06,1e-05,-3e-06,0,1.5e-05,8e-06,2.3e-05,0,1e-06,0,-4e-06,-1.3e-05,-5e-06,5e-06,-3e-06,0,2e-06,-1e-06,3e-06,-1e-06,3e-06,-1e-06,-1e-06,1e-06,-1e-06,0,-5e-06,2e-06,0,1e-06,-2e-06,-1e-06,-5e-06,1e-06,0,0.000105,1.4e-05,5.8e-05,-4.2e-05,9e-06,2e-06,3e-06,-4e-06,2e-06,-1e-06,0,0
0,-1e-06,-1e-06,0,0,0,-1e-06,6e-06,7e-06,1e-06,8e-06,1.8e-05,-7e-06,0,7.3e-05,8.1e-05,-8e-06,6e-06,-1.6e-05,0,0.000101,5.2e-05,1.9e-05,-4e-06,1.2e-05,-2.7e-05,2e-06,0,2.6e-05,2e-06,-6.8e-05,0.000197,0,-4e-06,-4e-06,-3.3e-05,3.9e-05,5e-06,6e-06,8e-06,-1.1e-05,2e-06,-2.7e-05,2e-05,1e-06,6e-06,4e-06,9e-06,1e-06,-3e-06,0,-7e-06,4e-06,3e-06,1e-06,0,0,-9e-06,-2e-06,0,2e-06,-1.5e-05,7e-06,-6e-06,0,-1e-06,0,-1e-06,-1e-06,0,-3e-06,-4e-06,-6e-06,-8e-06,-5e-06,-8e-06,9e-06,2e-06,-1.2e-05,1.6e-05,-2.5e-05,-4e-06,-1e-06,0,-1.1e-05,-9e-06,-4e-06,2e-06,-2e-06,0,-4e-06,0,-3e-06,1e-06,0,-1e-06,-7e-06,-4e-06,-4e-06,0,-1e-06,0,-4e-06,3e-06,-1e-06,2e-06,6e-06,-2e-06,0,4.9e-05,2.2e-05,4.7e-05,8.9e-05,2.2e-05,1.3e-05,-2e-06,-2e-06,1e-06,0,0,0
0,-1e-06,-1e-06,0,0,-1.8e-05,6e-06,7e-06,-1e-06,1e-06,-1.2e-05,-8e-06,-3e-06,4e-06,-2e-05,-6e-05,-3e-06,5e-06,-3.7e-05,2e-06,2.1e-05,0.000156,1.9e-05,-1e-06,-6e-06,5.4e-05,2.5e-05,-3.1e-05,-3.4e-05,3e-06,7e-06,-0.000195,-1e-06,-5e-06,-6e-06,2.3e-05,-3.3e-05,2.3e-05,-1e-06,8e-06,0,1e-06,1e-05,9e-06,-1e-06,0,-4e-06,-4e-06,5e-06,2e-06,1e-06,-8e-06,4e-06,4e-06,-1e-06,0,1e-06,-6e-06,-3e-06,-3e-06,-1e-06,1e-05,-4e-06,4e-06,0,-5e-06,0,-5e-06,0,1e-06,3e-06,4e-06,1.1e-05,1e-06,2e-06,-1e-06,-1.5e-05,-1e-06,-3.3e-05,-2.6e-05,2.4e-05,-4e-06,-2e-06,0,-1.2e-05,-1e-06,-2e-06,-1e-06,2e-06,0,0,0,1e-06,-2e-06,-1e-06,1e-06,-9e-06,-3e-06,0,0,-4e-06,-1e-06,0,-1e-06,-1e-06,1e-06,-3e-06,2e-06,0,-2e-05,-0.000105,-2.4e-05,-3.1e-05,2e-06,-1.3e-05,-2e-06,-2e-06,3e-06,0,0,0
0,-1e-06,0,0,0,0,5e-06,-1.3e-05,-6e-06,0,8e-06,4e-06,8e-06,-1e-06,-6e-06,7e-06,1.7e-05,-5e-06,2.1e-05,-3e-06,-0.000103,-2.3e-05,-5.7e-05,-2.3e-05,5e-05,-5e-06,1.3e-05,1.1e-05,-1.2e-05,2e-06,9e-05,6.1e-05,-1e-06,-2e-06,1e-05,0,-3.7e-05,-1.3e-05,1.2e-05,-8e-06,1.3e-05,-2e-06,-2.7e-05,8e-06,1e-06,4e-06,1e-06,-3e-06,-4e-06,0,0,3e-06,1e-06,-4e-06,0,0,1e-06,-8e-06,0,-3e-06,1e-06,-4e-06,-2e-06,0,0,-2e-06,0,-2e-06,-3e-06,0,-6e-06,1e-06,-8e-06,2e-06,-1.3e-05,8e-06,1.3e-05,-1e-06,0,2e-06,-1.9e-05,-9e-06,0,0,-1.1e-05,-1.4e-05,-3e-06,0,-1e-06,1e-06,2e-06,0,0,1e-06,1e-06,1e-06,-7e-06,1e-06,1e-06,0,1e-06,2e-06,0,-2e-06,-1e-06,-1e-06,-4e-06,-1e-06,0,-5e-05,6.7e-05,3.8e-05,-4.3e-05,-3.7e-05,2e-06,-1.1e-05,-2e-06,1e-06,0,0,0
0,-1e-06,2e-06,0,0,2.1e-05,-1e-06,-3e-06,1e-05,0,1e-06,-2e-06,-4e-06,1e-06,-8e-06,5.3e-05,1.5e-05,2e-06,1.7e-05,3e-06,-3.2e-05,-0.000153,-1.4e-05,3.3e-05,-2e-06,7e-06,-1.5e-05,-8e-06,2.7e-05,-2e-06,5.5e-05,4e-06,-1e-06,4e-06,-2.2e-05,-1.7e-05,4.5e-05,3.1e-05,7e-06,7e-06,-1.3e-05,2e-06,7e-06,-1e-06,-1e-06,-6e-06,1e-06,3e-06,-4e-06,-2e-06,0,5e-06,2e-06,-4e-06,0,-2e-06,0,-5e-06,-1e-06,-2e-06,-2e-06,-6e-06,6e-06,-3e-06,0,-5e-06,-1e-06,-1e-06,-2e-06,0,5e-06,-3e-06,1e-06,1e-06,3e-06,-6e-06,-2e-05,1e-06,-3e-06,2e-05,1.4e-05,-4e-06,0,0,-6e-06,-6e-06,-4e-06,-3e-06,-1e-06,0,-1e-06,1e-06,0,0,-1e-06,-1e-06,-2e-06,2e-06,-3e-06,0,1e-06,-1e-06,0,-1e-06,-1e-06,1e-06,5e-06,1e-06,0,-5.7e-05,-1.5e-05,-3.1e-05,6.1e-05,-3.5e-05,7e-06,4e-06,-2e-06,0,0,0,0
0,-1e-06,0,0,0,0,-5e-06,1.1e-05,-2e-06,2e-06,-8e-06,-9e-06,-3e-06,-4e-06,-2e-06,-9.1e-05,1.7e-05,1e-06,1.5e-05,-3e-06,2e-05,5e-06,9e-06,-3.4e-05,-1.1e-05,1.4e-05,-2.9e-05,-4e-06,-1e-05,-1e-06,-3.9e-05,7e-05,2e-06,2e-06,7e-06,3.9e-05,2.5e-05,-4.8e-05,1e-05,9e-06,6e-06,-3e-06,-2.9e-05,-2e-05,-1e-06,2e-06,-2e-06,2e-06,3e-06,3e-06,-2e-06,0,6e-06,1e-06,-1e-06,-3e-06,-1e-06,-6e-06,-5e-06,-2e-06,3e-06,7e-06,-8e-06,4e-06,0,0,-1e-06,-1e-06,1e-06,-1e-06,-8e-06,0,7e-06,2e-06,-1.2e-05,-3e-06,2.4e-05,1e-06,5e-06,-2.7e-05,-1.5e-05,4e-06,0,0,1.2e-05,-2e-06,-3e-06,-3e-06,-3e-06,0,2e-06,-1e-06,2e-06,-1e-06,-2e-06,0,3e-06,3e-06,0,0,2e-06,1e-06,-2e-06,2e-06,-1e-06,0,-1e-06,4e-06,0,2.1e-05,-5e-05,-3.1e-05,-2e-06,5e-06,-4e-06,-7e-06,-3e-06,-1e-06,0,0,0
