0.031231,0.036552,0.036412,0.035239,0.038309,0.040926,0.036218,0.030645,0.030042,0.029271,0.02654,0.024223,0.023477,0.025924,0.029514,0.028128,0.028947,0.028865,0.022329,0.019705,0.020321,0.022105,0.020179,0.018002,0.018901,0.020588,0.021336,0.020564
0.043164,0.05059,0.050214,0.048431,0.053064,0.057514,0.048284,0.038819,0.040104,0.039977,0.035856,0.031721,0.03047,0.035268,0.041599,0.038639,0.039349,0.040404,0.030868,0.026903,0.027887,0.02997,0.026957,0.0242,0.025548,0.027801,0.028832,0.027873
0.066188,0.078046,0.077782,0.07508,0.082888,0.090398,0.072409,0.055198,0.060097,0.061659,0.054377,0.046083,0.043866,0.053921,0.065802,0.059246,0.05986,0.063674,0.048481,0.041382,0.042591,0.045327,0.04005,0.036058,0.038288,0.041201,0.042621,0.041478
0.088344,0.104508,0.105279,0.103211,0.11422,0.123687,0.097845,0.072423,0.079678,0.083324,0.073066,0.060687,0.057314,0.072598,0.089959,0.07949,0.079993,0.087274,0.067169,0.055911,0.056187,0.059795,0.052223,0.04661,0.049611,0.052288,0.054121,0.053268
0.09645,0.114279,0.11767,0.119656,0.132558,0.13941,0.111564,0.083293,0.088829,0.093495,0.083167,0.069596,0.064988,0.081253,0.099747,0.087066,0.087354,0.097208,0.076797,0.062245,0.060466,0.065372,0.057315,0.050301,0.053255,0.05458,0.057391,0.057696
0.084436,0.099315,0.106512,0.115458,0.12749,0.125721,0.103209,0.081198,0.08149,0.085561,0.079183,0.068392,0.062574,0.073282,0.086104,0.074912,0.074564,0.083865,0.069827,0.055973,0.052465,0.057343,0.05198,0.04661,0.04842,0.048861,0.053745,0.054557
0.07327,0.082702,0.089386,0.100834,0.112466,0.104106,0.089412,0.077239,0.07163,0.07279,0.070477,0.06323,0.056618,0.059056,0.063368,0.056051,0.053105,0.058214,0.054368,0.046574,0.042635,0.044358,0.043789,0.044716,0.04515,0.046296,0.052602,0.051699
0.090573,0.099639,0.099534,0.107104,0.120659,0.111912,0.10296,0.095216,0.085737,0.086178,0.08208,0.07201,0.066035,0.063238,0.060349,0.054973,0.050734,0.050831,0.053022,0.050186,0.04423,0.04375,0.04691,0.052253,0.053552,0.058408,0.061973,0.054023
0.147871,0.165357,0.157375,0.16605,0.183185,0.167922,0.153656,0.143482,0.134743,0.14539,0.136377,0.113225,0.10838,0.100796,0.086904,0.078728,0.075377,0.074066,0.078894,0.073246,0.061161,0.065085,0.0714,0.069406,0.073279,0.092853,0.093186,0.072477
0.250394,0.285065,0.26972,0.287359,0.308258,0.278266,0.249133,0.233924,0.23149,0.260572,0.239556,0.193557,0.194582,0.182431,0.150011,0.130988,0.124903,0.124233,0.132665,0.119077,0.099826,0.112779,0.120129,0.101255,0.112952,0.165762,0.162604,0.118519
0.41083,0.459834,0.431297,0.470801,0.498794,0.445655,0.39381,0.370669,0.38001,0.437875,0.393104,0.313937,0.331048,0.315488,0.25672,0.21908,0.205624,0.206132,0.218348,0.189945,0.162435,0.19026,0.200089,0.162763,0.188453,0.291197,0.283392,0.198896
0.607971,0.657947,0.609287,0.679602,0.717459,0.641157,0.570669,0.533497,0.553906,0.646538,0.566052,0.452817,0.499878,0.483964,0.397622,0.339989,0.314574,0.312358,0.325159,0.278534,0.242187,0.285057,0.300626,0.249621,0.295688,0.458845,0.441268,0.300827
0.750489,0.783783,0.716025,0.81581,0.86821,0.783559,0.712436,0.659914,0.683074,0.798972,0.68383,0.556885,0.638915,0.625736,0.52257,0.455323,0.41808,0.404735,0.412201,0.351855,0.308745,0.360717,0.388333,0.334525,0.399154,0.61071,0.575815,0.381149
0.725955,0.73221,0.658315,0.771071,0.839824,0.768389,0.716414,0.658069,0.674741,0.78316,0.663412,0.561066,0.652379,0.641444,0.548847,0.492323,0.452868,0.424888,0.422686,0.361098,0.317091,0.368507,0.410403,0.368343,0.43501,0.646696,0.596527,0.383301
0.529972,0.525539,0.469668,0.556332,0.627858,0.596927,0.57189,0.521037,0.523645,0.5806,0.493162,0.4427,0.501847,0.493576,0.438384,0.404942,0.374842,0.343389,0.338759,0.289556,0.254239,0.298591,0.340344,0.315409,0.36204,0.515087,0.469828,0.295485
0.366109,0.381798,0.365755,0.391733,0.411566,0.428811,0.441295,0.373638,0.33689,0.346073,0.319456,0.306396,0.299626,0.288816,0.275502,0.256543,0.240661,0.220436,0.216693,0.188633,0.172704,0.207522,0.227978,0.210695,0.228842,0.298226,0.275629,0.183025
0.41663,0.438332,0.419562,0.418329,0.395942,0.427242,0.464376,0.365321,0.294422,0.291508,0.30241,0.292921,0.227509,0.211492,0.212678,0.182181,0.180493,0.183867,0.189012,0.176122,0.166211,0.179017,0.168724,0.146591,0.139509,0.149904,0.147936,0.133791
0.490155,0.543638,0.541847,0.524914,0.467682,0.469301,0.500598,0.444918,0.402018,0.375464,0.3839,0.360309,0.267274,0.237296,0.225006,0.190713,0.197616,0.211166,0.221307,0.222467,0.218281,0.210563,0.178339,0.156569,0.148667,0.142929,0.14187,0.144348
0.513663,0.652052,0.703718,0.644489,0.559412,0.515205,0.539996,0.567692,0.557652,0.495497,0.488292,0.435266,0.309328,0.261629,0.245974,0.230264,0.238759,0.25034,0.257965,0.278468,0.279419,0.235429,0.189772,0.188825,0.190392,0.184218,0.191759,0.183847
0.49693,0.756485,0.906867,0.7915,0.672029,0.591249,0.629306,0.699731,0.693075,0.626424,0.606182,0.516258,0.346877,0.286015,0.28898,0.298658,0.306977,0.313518,0.302888,0.329341,0.341004,0.26646,0.202683,0.218294,0.227457,0.225705,0.24971,0.230637
0.492723,0.825259,1.043001,0.900032,0.747647,0.640409,0.683742,0.731992,0.718734,0.707822,0.684899,0.553285,0.350323,0.281075,0.316707,0.353784,0.353204,0.354715,0.338874,0.359517,0.374649,0.297802,0.226245,0.242222,0.252469,0.25794,0.295383,0.269027
0.464017,0.771305,0.970706,0.833359,0.686351,0.598368,0.633692,0.651551,0.645574,0.672158,0.654977,0.53481,0.335444,0.250819,0.305287,0.35967,0.347914,0.33279,0.318207,0.337665,0.34621,0.286077,0.225357,0.234621,0.241953,0.255745,0.305433,0.279489
0.459204,0.669608,0.74582,0.617554,0.513989,0.502088,0.545666,0.558366,0.558607,0.53825,0.517111,0.460499,0.312747,0.23197,0.281798,0.325268,0.318083,0.280844,0.252968,0.280095,0.285691,0.257771,0.210475,0.197562,0.203331,0.220957,0.263054,0.241767
0.510421,0.641551,0.578309,0.442567,0.415455,0.468278,0.49813,0.483534,0.457723,0.385568,0.363463,0.363566,0.284655,0.23647,0.260503,0.274377,0.292324,0.25599,0.218146,0.259207,0.261198,0.247175,0.201411,0.159006,0.160666,0.184662,0.2139,0.192617
0.547153,0.646939,0.519082,0.400117,0.458175,0.531369,0.491416,0.42373,0.363276,0.30144,0.290831,0.305256,0.258868,0.247187,0.264132,0.268098,0.314428,0.299179,0.276242,0.30249,0.272207,0.249877,0.203325,0.151473,0.146295,0.171815,0.211339,0.188112
0.583007,0.692124,0.55096,0.430928,0.529225,0.651511,0.589016,0.426239,0.319435,0.304735,0.327215,0.350551,0.286904,0.268134,0.289673,0.318555,0.395664,0.397562,0.384247,0.370245,0.309728,0.273518,0.218836,0.165536,0.158314,0.172732,0.226213,0.226122
0.610054,0.744643,0.621736,0.47042,0.584052,0.777347,0.708981,0.466122,0.347373,0.362262,0.407105,0.439116,0.361117,0.314665,0.340438,0.408514,0.508007,0.538284,0.537254,0.472254,0.383578,0.319677,0.244244,0.210175,0.228375,0.2387,0.271108,0.274051
0.626123,0.802909,0.731338,0.516561,0.596774,0.824382,0.757407,0.530891,0.446327,0.459312,0.519007,0.568354,0.480902,0.396838,0.44349,0.532644,0.598302,0.65794,0.688548,0.610746,0.486624,0.378969,0.294617,0.278237,0.336165,0.355204,0.33153,0.297012
0.62723,0.835166,0.797773,0.533791,0.570905,0.732666,0.685857,0.585274,0.563911,0.569906,0.619163,0.668108,0.588381,0.497664,0.574692,0.631346,0.633701,0.721976,0.765313,0.72743,0.582495,0.43329,0.373878,0.359983,0.447457,0.470729,0.376468,0.301721
0.596503,0.832937,0.790309,0.542301,0.548312,0.546687,0.555825,0.654832,0.696669,0.657461,0.66338,0.690879,0.625453,0.59442,0.705464,0.689389,0.620106,0.725514,0.763655,0.785132,0.675715,0.521556,0.48065,0.430182,0.504159,0.516937,0.389734,0.320535
0.492711,0.692412,0.712323,0.574622,0.49176,0.35914,0.466478,0.684036,0.75046,0.651213,0.624406,0.619469,0.556418,0.646173,0.770941,0.669425,0.540472,0.656295,0.695877,0.748169,0.725169,0.614111,0.559039,0.435344,0.457067,0.460144,0.371816,0.347981
0.369923,0.459862,0.547787,0.543181,0.39941,0.258042,0.432745,0.620435,0.650324,0.547662,0.534099,0.496564,0.425044,0.592767,0.694436,0.544137,0.409462,0.513123,0.573956,0.63674,0.669515,0.599671,0.525556,0.355158,0.343913,0.36715,0.339779,0.343109
0.303101,0.294528,0.342708,0.411444,0.296313,0.220657,0.408376,0.498414,0.458367,0.388128,0.406449,0.375872,0.322823,0.465728,0.526335,0.410281,0.325529,0.366223,0.434608,0.487243,0.503722,0.456134,0.385139,0.239239,0.231738,0.280633,0.284535,0.275063
0.227324,0.183787,0.187857,0.258061,0.195145,0.174978,0.325579,0.375267,0.323713,0.252023,0.246272,0.259866,0.293917,0.402412,0.422624,0.339432,0.276228,0.267634,0.292821,0.307214,0.306032,0.304037,0.262974,0.165849,0.155795,0.205863,0.22364,0.177606
0.144736,0.123107,0.136437,0.174686,0.11989,0.117841,0.208272,0.23653,0.215554,0.169899,0.142035,0.181856,0.26426,0.350043,0.32987,0.274194,0.259547,0.252764,0.210097,0.184327,0.215002,0.25915,0.244061,0.151487,0.112492,0.135386,0.145867,0.101972
0.09964,0.100173,0.132801,0.143884,0.096516,0.082534,0.127084,0.152741,0.138969,0.13662,0.13579,0.154861,0.205254,0.252411,0.218596,0.209192,0.234284,0.213,0.14985,0.128108,0.166544,0.205767,0.211303,0.146745,0.102035,0.093558,0.083153,0.067994
0.077641,0.087615,0.121106,0.107368,0.079854,0.074762,0.10779,0.121513,0.089256,0.117298,0.157003,0.145164,0.155451,0.166657,0.149058,0.159015,0.178566,0.149944,0.10659,0.096583,0.112339,0.13046,0.149905,0.123138,0.090462,0.072384,0.050484,0.048957
0.06655,0.085189,0.09898,0.077359,0.071712,0.084821,0.110787,0.099921,0.065536,0.102784,0.168322,0.150391,0.13656,0.119871,0.108517,0.137455,0.146671,0.129083,0.109037,0.096833,0.079967,0.076429,0.092796,0.098593,0.085315,0.067093,0.0432,0.043792
0.05394,0.075719,0.082376,0.073809,0.088109,0.097388,0.109082,0.093811,0.059606,0.08137,0.155956,0.157843,0.134026,0.099558,0.091409,0.122504,0.132926,0.127534,0.116713,0.104332,0.068,0.048546,0.054325,0.073435,0.079637,0.066704,0.048863,0.044241
0.047732,0.063766,0.07797,0.079492,0.101072,0.096681,0.092039,0.08617,0.058921,0.070564,0.131062,0.138813,0.121967,0.074809,0.07111,0.09661,0.106167,0.106264,0.105164,0.096619,0.054028,0.035126,0.02965,0.046152,0.063039,0.057238,0.055795,0.052644
