0.00034,0.000306,0.000302,0.000582,0.000427,0.000775,0.00062,0.000641,0.000293,0.000306,0.000576,0.000652,0.000716,0.000811,0.000386,7.1e-05,0.00032,0.000318,0.000612,0.000498,0.000606,1.5e-05,-0.008308,-0.007962,-0.025438,-0.018241,-0.009187,-0.00415,-0.001501,-0.003159,0.00309,-2.4e-05,-0.005359,-0.010594,-0.01307,-0.008694,-0.013522,-0.019335,-0.014613,-0.013703,-0.029845,-0.020668,-0.017961,-0.011491,-0.009065,-0.016481,-0.014586,-0.007391,-0.025626,-0.018119,-0.018115,-0.014483,-0.0146,-0.017951,-0.016692,-0.014432,-0.015608,-0.014412,-0.014293,-0.014738,-0.00897,-0.010374,-0.012778,-0.012751,-0.007158,-0.005748,-0.003076,-0.00495,-0.005187,-0.010281,-0.009521,-0.006072,-0.003798,-0.003707,-0.002224,-0.002147,-0.001324,0.000448,-0.001945,-0.002035,-0.003141,-0.001404,-0.000709,7.2e-05,-8e-04,-0.000224,-8.1e-05,-0.000495,0.002285,-0.004646,-0.002367,0.000464,-5e-06,0.000978,0.00188,0.000879,-0.004325,-0.007986,-0.004707,-0.001667,-0.000354,-2.8e-05,0.000334,-5.9e-05,0.000413,0.000118,3.1e-05,-0.00013,3.9e-05,-0.003594,-0.010662,-0.008264,-0.003643,-0.000845,0.000126,0.000301,7e-06,0.001375,0.00107,0.000704,0.000669
0.000215,0.000166,2.8e-05,0.000229,0.000303,0.000426,0.000269,0.000347,0.000136,0.000126,0.000503,0.000345,0.000526,0.000529,0.00033,6.3e-05,0.000289,0.000241,0.000687,0.000249,0.000508,-0.000582,-0.000669,0.004208,0.004276,0.006876,0.005546,0.002919,0.000453,0.001024,0.002486,-0.008482,0.001041,0.000378,0.001141,0.006945,0.002861,0.003361,-0.001771,0.002758,0.00378,-0.003467,0.001406,-0.000196,0.002286,-0.001178,-0.004427,-0.001314,0.006718,0.006574,0.004353,-0.002491,-0.0015,0.005297,0.001008,-0.002574,-0.002052,0.000406,-0.001999,0.00298,-0.002758,-0.001871,0.000338,0.003509,0.000145,-0.002746,-0.002028,-0.004828,-0.001951,-0.001255,-6.5e-05,-0.002234,-0.001106,-0.002113,-0.001471,-0.000726,-0.001343,-0.000806,-0.000487,0.000739,-0.001335,-0.00062,5.8e-05,-0.000537,0.000515,0.001123,0.000253,0.000238,-0.00241,-0.003982,0.000476,0.002513,0.000214,0.001007,-0.000617,0.001793,-0.001373,0.005552,0.003792,0.00174,0.000639,0.000149,0.000499,0.000336,0.000529,0.000503,0.000418,0.000157,0.000207,-0.000723,0.0034,0.00483,0.002635,0.000741,0.000475,8.9e-05,0.000124,0.00121,0.000711,0.00065,0.000567
-5e-06,4.7e-05,9.2e-05,3.6e-05,0.000266,0.000254,-3.7e-05,0.000114,2.3e-05,-0.000102,0.000227,0.000106,9e-05,0.000203,-6e-06,-0.000248,1e-04,1.1e-05,6.1e-05,-7.2e-05,6.1e-05,-0.000108,0.000653,-0.000149,-0.004087,-0.002089,-0.00381,-0.001652,-0.000936,-0.000914,0.001084,-0.004677,-0.009217,-0.008213,-0.00181,-0.00454,-0.009014,-0.00844,-0.002986,0.00131,-0.006235,-0.004027,0.000458,-0.005285,-0.005607,0.005518,0.00261,0.001138,-0.004538,-0.006159,-0.002498,0.004203,0.001895,-0.004852,-0.00787,-0.001795,0.003246,0.00203,0.002741,0.000725,0.001206,0.002046,-0.001632,-0.005766,-0.002793,-0.001378,5.1e-05,0.001104,0.000487,0.00506,-0.003661,-0.000249,-0.000902,-0.00113,-0.000379,8e-05,-0.004274,-0.003253,-0.000901,-0.001879,-0.000153,-0.000198,-0.000174,-0.000154,-0.001147,-0.000294,-0.000124,8.9e-05,-0.001351,-0.001413,-0.001263,0.000687,0.000758,0.000485,-0.000626,0.000913,-0.000105,-0.001735,-0.001302,-0.000587,-0.000188,-0.000115,0.000213,1.6e-05,0.000137,4.6e-05,7e-05,8e-06,7.2e-05,-9.5e-05,-0.00634,-0.00463,-0.002045,-0.000779,3.9e-05,9.9e-05,0.000284,0.000415,0.000299,0.000467,5.5e-05
-8.9e-05,1.6e-05,4.4e-05,6.5e-05,0.00022,-0.000119,-3.1e-05,0.000134,0.000227,8e-05,0.000175,-4.5e-05,0.000169,3.3e-05,-2.9e-05,6.1e-05,6.8e-05,0.000111,2.1e-05,5.7e-05,0.000351,-0.000304,0.001521,-0.00341,0.006127,0.002701,0.001171,0.00024,0.00079,0.001125,-0.000978,-0.003425,0.009884,-0.000769,-0.001738,0.001386,0.003379,0.005123,-0.001215,-0.006347,0.005418,0.001561,-0.000678,0.008389,0.000152,-0.001408,-0.001611,0.002831,0.003724,0.005167,-0.000521,0.001281,0.000888,-0.000587,0.00611,0.005532,-0.004547,0.000635,-0.006361,-0.004232,0.001016,-0.000476,0.002836,0.000608,0.003754,0.001926,-0.000487,-0.000289,-0.000325,-0.000517,0.000474,-0.000359,0.000323,-0.000245,0.000803,0.000348,0.000351,-0.001339,-0.000771,0.000998,0.000377,-0.001015,-0.000476,8.7e-05,-0.00034,0.00015,-3.4e-05,-3.2e-05,-0.000788,0.003062,0.00291,0.002037,0.000202,-0.000111,-0.000438,-0.000444,0.00029,0.001125,0.000183,0.000321,5.4e-05,-0.000236,6.5e-05,0.000179,0.000159,3e-06,3e-05,-0.00011,7e-06,-0.000218,0.003889,0.002839,0.001448,0.000469,0.000202,-0.000208,-0.000131,-0.00071,-0.000241,0.000184,4.9e-05
0,0.000109,0.000113,3.4e-05,5.6e-05,-1.7e-05,8.7e-05,0.000189,0.000179,0.000157,0.000114,-0.000171,4.3e-05,8e-06,-8.5e-05,-3.5e-05,-2.4e-05,4.7e-05,5.3e-05,-4.8e-05,0.000119,3.1e-05,0.000445,0.003534,-0.004411,-0.002226,-0.001799,-0.000218,0.000237,0.00056,-0.000143,-0.002237,-0.007055,0.001931,0.002336,-0.006111,-0.011638,-0.002559,0.002572,0.005741,-0.008552,-0.005261,0.000588,-0.007356,-0.006596,-0.007593,-0.000143,-0.003701,-0.006401,-0.006142,-0.000242,-0.001128,0.000618,-0.003611,-0.001927,-0.000588,0.001133,-0.003375,0.002255,0.000957,-0.001001,-0.000281,-0.001121,-0.001147,-0.004966,-0.000774,0.000817,0.000894,0.000647,-0.001099,0.002722,5e-04,0.000119,0.001495,7.3e-05,-0.000307,0.001195,-0.000245,-2.7e-05,0.000366,0.00031,0.000942,-5e-05,-0.000403,-0.000763,-0.000527,-0.00032,-0.000526,5.6e-05,-0.004037,-0.00447,-0.001941,-5e-05,0.00024,0.001015,-0.000718,9.1e-05,-0.000289,0.000207,0.000422,0.00026,8.4e-05,0.000128,-8.9e-05,6.8e-05,-0.000197,-5.9e-05,6.3e-05,-1.2e-05,2.4e-05,-0.000904,-0.00087,0.000183,0.000291,7.1e-05,-0.000108,0.00016,-0.000173,-0.000401,0.00027,-3.4e-05
-3.2e-05,0.000127,8.1e-05,-6.8e-05,7.5e-05,-0.00011,-4.5e-05,1.4e-05,3.8e-05,-5.1e-05,4e-06,-0.000198,2.9e-05,-0.000124,-6.7e-05,-3.8e-05,6e-05,7.2e-05,-1e-05,-5.8e-05,3.5e-05,3.5e-05,0.000856,-0.000756,0.000299,0.002143,0.001006,0.000332,-0.000416,-0.000404,0.000539,-0.00323,0.001643,-0.005634,-0.001457,0.000309,0.009438,0.003566,-0.002056,-0.005293,0.002593,0.010615,-0.002009,0.001133,0.001917,-0.000419,-0.002683,0.000173,0.003015,0.005339,-0.002375,-0.001208,-0.003306,0.000849,0.002282,-0.000324,-0.000982,-0.000265,0.000256,0.000837,1.3e-05,0.001242,-0.000609,0.002525,0.004537,0.000676,0.00025,-4e-06,-0.000175,-0.000893,-0.001493,0.001454,-0.000498,0.000145,0.000344,-0.000542,-0.000868,0.000253,-0.000532,0.000215,0.000188,0.000583,9e-06,0.000208,0.001046,2.2e-05,-0.000452,-0.00027,0.000153,-0.001458,0.001578,0.000303,-0.000196,-0.00054,0.000422,-0.000628,0.000426,0.000226,-0.001323,-0.000562,0.00017,0,8e-06,1.9e-05,4.3e-05,-0.000258,-0.000103,-4.1e-05,3.5e-05,-6.1e-05,-0.000388,2.6e-05,-0.000191,3.7e-05,6e-06,-0.00011,1.5e-05,-0.000181,-0.000488,0.000126,-0.00012
-6.7e-05,2.4e-05,-1.6e-05,-0.000142,-0.000105,-0.000139,-0.00016,-0.00012,-4.3e-05,-5.9e-05,-2e-05,-0.000162,-0.000108,-0.000221,-5.8e-05,-3.9e-05,-0.000258,-0.00011,-9.4e-05,-0.000254,-0.000128,0.000112,-0.000945,0.001118,-0.001317,-0.003256,-0.002847,-0.000516,-0.000186,-0.000751,-0.000105,-1.7e-05,-0.002799,0.001768,0.004412,-0.000198,0.000699,0.002183,0.001377,-0.002661,-0.001595,-0.003116,0.00032,-0.000987,0.003251,-0.000705,0.004447,-0.000935,-0.002745,-0.006337,-1e-04,0.001622,0.003396,-0.000917,-0.0012,-0.001523,0.001684,0.000694,0.000753,-0.000105,-0.001649,0.000147,-0.000659,-0.00253,-0.001535,-0.002136,-0.002071,-0.001688,-0.000426,7.9e-05,0.000187,-0.000377,-0.000297,-0.000385,9e-06,0.000473,0.000132,0.000116,9.6e-05,-0.000329,-0.000484,-6.8e-05,-0.000112,-3.7e-05,-0.000404,-0.000526,-0.000569,-0.000583,-9.3e-05,0.000243,-0.001059,-0.000818,-0.000391,0.000538,0.00014,0.000326,-0.000272,-0.000731,0.000193,3.8e-05,2.2e-05,8.4e-05,-1.7e-05,-0.000218,-0.000126,-0.000184,-4e-05,-9.6e-05,0.000108,4.2e-05,0.001302,-0.001097,-0.00033,-0.000291,-0.000228,-7.8e-05,-0.000181,-0.000118,-0.000397,-1.9e-05,-0.000327
-1e-04,-4.1e-05,-2e-06,-5.6e-05,-5.1e-05,-0.000133,-0.000249,-0.000219,-7.8e-05,-8.7e-05,-2e-05,-0.000132,-8.7e-05,-0.000258,-0.000122,2.7e-05,-2.2e-05,1e-05,-9.8e-05,-0.000194,-0.00022,-7.2e-05,0.000176,-0.000886,0.000965,0.00136,0.002246,0.000788,-0.000902,0.000113,-0.000477,-0.001261,-0.004305,-0.003894,-0.001681,-0.0043,0.002962,-0.004302,-0.002409,0.000633,0.000528,-0.001393,0.001557,-0.002508,-0.00274,-0.005987,-0.004864,0.000911,0.002209,0.002205,-0.001186,-0.004128,-0.000184,0.000575,-0.000923,0.001065,-0.001347,-0.002914,-0.001856,-0.000462,-0.000342,-0.002568,0.000842,0.001411,0.001039,0.002656,-0.000305,0.000848,0.001324,-7.7e-05,0.000157,-0.000832,0.000576,0.00032,-2e-04,-0.000704,-0.000165,-8.5e-05,-0.000244,-5e-06,0.000359,-0.000326,-0.000123,0.000199,7.9e-05,-0.000472,-0.000106,5.7e-05,8.2e-05,0.000649,-8e-04,-0.000569,-0.000572,-0.000186,0.000748,7e-05,0.001524,0.000162,-0.000363,-0.000398,-0.000114,1.6e-05,-6.3e-05,-5.5e-05,5.5e-05,-8.9e-05,-0.000208,-9.6e-05,-5.4e-05,9e-05,-3.1e-05,-0.000586,-0.000278,0.000122,-5.3e-05,-0.000139,2e-06,-3.6e-05,-0.000344,-0.000161,-0.000198
-9.3e-05,-0.000113,1.6e-05,-4.8e-05,-5e-06,-0.00011,-0.000104,-0.000108,-2.2e-05,2e-06,5.5e-05,-7.2e-05,-9.4e-05,-0.00014,-1.9e-05,1e-04,4.1e-05,-4.4e-05,-0.000114,-7e-05,-5.9e-05,2.8e-05,-0.000213,-0.001043,-0.000601,-0.001828,-0.00327,-0.000812,0.000157,-0.000251,-0.000274,0.000384,0.000396,0.002564,0.003246,0.005243,0.000416,0.000919,-0.000679,-0.001186,0.000975,0.002196,-0.00116,0.001212,-0.001577,0.000626,0.004271,0.001631,0.000332,-0.002702,-0.000549,0.002773,-0.001082,-0.00124,-0.002105,-0.001937,0.00071,0.002289,0.002101,0.000597,0.002055,0.00311,0.000719,-0.001373,-0.000636,-0.000665,0.001297,0.000915,-0.001025,0.000709,8.9e-05,-0.000585,-0.000519,0.000679,-0.00025,-5e-05,-0.000639,-0.000122,-7.1e-05,-5.3e-05,-0.000437,-1.7e-05,6.5e-05,9.5e-05,-2e-06,-0.000227,-0.000405,-0.000124,0.00039,0.001143,-0.000448,-0.000173,-0.000238,-0.000353,-0.000293,-0.000396,-0.000572,-0.000228,-0.000117,3.4e-05,0.000262,0,-9.1e-05,-0.000154,-8.7e-05,-8.4e-05,-2.3e-05,5e-06,2.7e-05,0.000128,0.000105,0.000893,0.000454,9.9e-05,-4.6e-05,-0.000123,-0.000193,-0.000112,-0.000125,-0.000178,-0.000222
-5.8e-05,-8.7e-05,2e-05,-3e-05,1.6e-05,-0.000102,-3.5e-05,-7.8e-05,2e-06,-2e-05,5e-06,-8.8e-05,-8.1e-05,-8.7e-05,-3e-05,8.9e-05,5e-05,1.5e-05,-8.4e-05,1.5e-05,-0.000115,6.6e-05,-4.9e-05,0.000138,-8.4e-05,0.002013,0.001119,-0.00059,-0.000502,0.000347,0.000261,0.000896,-0.00195,-0.002734,-0.00334,-0.003519,0.000169,-0.001992,0.002975,0.001886,-0.000972,-0.001071,0.005415,-0.00038,0.001961,-0.002117,-0.003154,-0.001346,0.000283,-0.001057,0.001419,0.000311,0.000475,0.000529,-0.000813,0.000555,-0.000232,0.00142,-0.001909,-0.000862,-0.002159,-0.001042,-0.000757,0.001286,1.5e-05,-0.000465,-0.00043,-0.000524,0.000133,0.000242,0.000244,-0.000475,0.000489,-0.000143,-0.000189,0.000283,5.9e-05,-3.1e-05,-0.000356,-0.000144,0.000277,0.000317,7.2e-05,0.00012,-0.000108,0.000374,0.00027,1.7e-05,0.000115,-0.000379,-0.000673,-0.000116,-0.000441,-0.000227,-9.2e-05,-0.000254,0.000302,-1e-05,-0.000645,-0.00044,0.000115,-1.1e-05,-8.1e-05,4e-05,-5e-05,-1.4e-05,4.3e-05,2.5e-05,1.6e-05,0.000103,0.000284,-0.000195,-0.000164,-5.3e-05,8.8e-05,-5.8e-05,0,-9.5e-05,-6.8e-05,-0.000241,-0.00012
-4.9e-05,-4e-05,2.6e-05,-3.1e-05,-3.8e-05,-2.9e-05,-6e-06,-4.8e-05,-2.1e-05,-9.4e-05,-5.3e-05,-6.9e-05,-2.2e-05,-5.2e-05,6e-06,5.8e-05,2.2e-05,4.2e-05,-3.4e-05,1e-06,-2.7e-05,5.8e-05,6.7e-05,0.000467,0.000322,-0.001407,0.000851,0.000949,4.5e-05,-0.000761,-0.000135,-0.000359,0.000647,0.002812,-0.004633,0.000459,-0.00028,0.001536,-0.000774,1.9e-05,0.002451,-0.000448,-0.003537,0.002624,0.000607,-2e-05,0.000319,3.2e-05,-0.001248,-0.000249,-9e-04,-0.001073,-0.00094,0.000946,-1e-04,-0.000835,-0.000621,0.000672,-9.5e-05,0.000836,0.000936,0.000218,0.000647,0.000363,0.000228,-0.000231,0.000481,-4.1e-05,0.000449,0.00033,-0.000667,0.001254,-0.000105,-0.000555,0.000187,0.000714,0.000177,8.3e-05,0.00043,6e-06,-0.000403,-0.000144,-0.000129,0.000305,3.8e-05,0.000255,-0.000391,-1.4e-05,0.000168,-0.000352,-0.000343,-0.000256,4.9e-05,-0.000289,-0.000422,-0.000157,-0.000234,-0.000549,0.000653,0.000163,4.3e-05,-1e-06,-3e-06,1.8e-05,-9.1e-05,-0.000106,-3.7e-05,1e-05,-4.3e-05,7.8e-05,-3.7e-05,-0.000112,-0.000577,-0.000208,-0.000134,-2.1e-05,-5.5e-05,1.2e-05,1.2e-05,-7.5e-05,-7.2e-05
-3.3e-05,-4.5e-05,-2.5e-05,-5.8e-05,-3.1e-05,-3.1e-05,1.7e-05,-4.4e-05,-2e-05,-7.3e-05,-1.5e-05,-1.7e-05,-9e-06,-7e-05,6e-06,2.3e-05,0,-1.4e-05,-4.5e-05,-2.2e-05,-9.7e-05,5.8e-05,-2.5e-05,-0.000212,5.3e-05,0.00037,-0.000754,-0.000832,0.000595,0.00043,-0.000235,0.000468,6.8e-05,-0.001039,-0.000993,-0.001889,-0.00235,-2.9e-05,-1.6e-05,-0.000923,-0.000484,1.1e-05,0.000271,-0.001172,0.000509,0.001792,-0.000227,-0.003267,-6e-04,0.000145,-0.00144,0.000198,0.000187,-0.001604,-0.000222,-0.000304,0.00204,-3.6e-05,0.000529,0.000248,0.000509,-0.000704,-0.001478,-0.001055,-7.2e-05,0.000405,-0.00071,-0.00029,-0.000545,0.000111,6.2e-05,-3.7e-05,7.2e-05,-0.00015,-8.2e-05,-0.000901,-1.3e-05,-3.8e-05,1.6e-05,-9.3e-05,-0.000118,-7.7e-05,-0.000101,8.6e-05,-0.000107,-0.000123,8.7e-05,-2.1e-05,-0.000187,-0.000123,0.000427,-0.000156,-0.000408,-0.000339,0.000231,-4.6e-05,-0.000475,-0.000142,-1e-06,5.3e-05,0.00017,7.6e-05,-8e-06,-4.8e-05,-6.4e-05,-3.2e-05,1.9e-05,4e-05,1.3e-05,-1.7e-05,3.4e-05,0.000421,0.000177,-7.7e-05,2.9e-05,5.1e-05,7e-06,-1e-06,7.3e-05,-8.6e-05,-7.6e-05
-4e-06,-2.6e-05,-3.1e-05,-3.5e-05,6e-06,-1.8e-05,0,-7e-05,-1.4e-05,-5.5e-05,-1.8e-05,-1.4e-05,6e-06,-1.9e-05,-5e-06,-1.5e-05,1.5e-05,-9e-06,-1.1e-05,-4.1e-05,-6e-06,9e-06,7e-06,-0.000115,0.000222,0.000227,0.000567,0.00013,-0.000596,-0.000232,-0.000144,0.000142,0.000194,0.00054,0.00133,2e-04,-0.000973,0.00027,-0.000286,-0.000588,-0.001054,0.000358,-0.000545,-0.001532,-0.000375,0.000648,-0.00052,0.003772,0.000419,0.000288,0.001036,4e-06,-0.001025,7.9e-05,0.00032,-0.000377,-4.2e-05,-0.000796,-7.3e-05,-0.000217,-0.001418,-7.8e-05,0.00057,0.00033,-0.000328,-9.7e-05,0.000713,0.00044,0.000235,-0.000792,0.000302,-9.9e-05,-0.000487,0.00039,0.000132,0.000159,-0.000258,9.7e-05,0.000694,-4.3e-05,-6e-05,-6.5e-05,-3.3e-05,-0.000154,-1e-06,-2e-06,0.000208,3.6e-05,0.000106,0.000117,0.000476,2e-06,0.000376,-6e-05,-0.000194,-0.000179,-0.000127,-0.000167,-0.000236,-0.000224,-0.000102,-3.5e-05,9e-06,-1.8e-05,-6.4e-05,-3.7e-05,-9e-06,4.1e-05,-4.3e-05,4.2e-05,-4.6e-05,-0.000245,0,5e-05,-0.000156,-1.5e-05,-1.7e-05,3e-05,-5.1e-05,6.3e-05,-8.8e-05
9e-06,-1.3e-05,-3e-05,-1e-05,-9e-06,-1.5e-05,9e-06,1e-06,1e-06,-3.2e-05,2e-06,-3.4e-05,2e-06,-1.7e-05,1e-06,-9e-06,-2.3e-05,1.2e-05,3e-06,-1.7e-05,-3e-06,2.5e-05,-0.000115,0.000125,-9.9e-05,-2.4e-05,-0.000622,0.000105,0.000447,-3.6e-05,8.8e-05,4e-04,0.000754,-0.000773,1.6e-05,-0.000242,-0.000544,0.001085,9e-06,0.000435,1e-05,8.4e-05,0.002098,0.000194,-0.000203,-0.001257,-8e-04,-0.002254,0.000628,6.2e-05,4e-05,0.001119,-0.00021,0.000165,0.000342,0.000752,-0.000519,-0.000431,4e-06,-0.000592,0.000601,0.000586,-0.000535,1.3e-05,0.000286,0.000392,-0.000391,0.000259,8.2e-05,2e-04,-0.000233,7.3e-05,0.000463,-0.00016,9.7e-05,-0.000122,0.000193,-3.7e-05,-0.000806,-0.000219,4.4e-05,5.3e-05,2.6e-05,-8e-06,-7.6e-05,-6.5e-05,0.000177,9.6e-05,-6.4e-05,0.000302,-0.000131,-3.6e-05,-0.000473,-4.9e-05,-2.6e-05,-0.00011,-3.3e-05,-0.000141,-2.4e-05,0.000122,5.8e-05,-7.6e-05,-3e-06,-1.8e-05,-1e-05,-3e-06,-1.3e-05,-4e-06,-2.8e-05,3e-05,-6.3e-05,-8.4e-05,4.3e-05,2.3e-05,7.6e-05,-3.6e-05,1.1e-05,-2.4e-05,-5.6e-05,5.3e-05,-5.5e-05
6e-06,4e-06,-1.3e-05,-7e-06,6e-06,-3e-06,-5e-06,1e-06,4e-06,-1.3e-05,-3e-06,-3.5e-05,1e-06,-1.4e-05,-2e-06,8e-06,-2.9e-05,-4e-06,-1.6e-05,1.8e-05,1.4e-05,-5e-06,-2.8e-05,-7.2e-05,-0.000146,-0.000194,-1.2e-05,0.000176,-6.2e-05,6.5e-05,0.000143,0.000137,-0.000517,0.000668,-0.000226,-0.00029,0.000243,6e-05,-0.000907,0.00086,0.000586,-0.00173,-0.001736,-0.000919,0.000508,-0.000436,-0.000737,0.00068,-3e-05,-0.000136,-0.000392,-0.000865,-0.000996,-0.000265,-4.7e-05,-0.000544,-0.000351,0.000414,0.000147,-5.7e-05,8.5e-05,-0.000517,-3.6e-05,-3.9e-05,-0.000249,0.000534,-0.000177,-1.3e-05,-0.000313,0.000134,-0.000141,-9.6e-05,0.00012,1.5e-05,-8.5e-05,0.000222,-5e-05,-6.2e-05,-2e-05,0,5.7e-05,3.2e-05,3.5e-05,-0.000225,4.1e-05,-4.7e-05,3.3e-05,-6e-05,-7.1e-05,-4.4e-05,-0.000208,1.6e-05,0.000647,-4.5e-05,-3e-06,-4.9e-05,8.2e-05,-2.5e-05,3.7e-05,-0.000227,9e-06,2.8e-05,-1.2e-05,0,2.5e-05,-1.5e-05,-2e-06,2e-05,-1.4e-05,2.8e-05,-6.9e-05,3.4e-05,4.8e-05,-3.6e-05,-9.5e-05,-3.6e-05,-6e-06,1.8e-05,-2.7e-05,1.5e-05,-1e-05
-8e-06,7e-06,1e-05,-9e-06,-9e-06,-1.2e-05,-8e-06,0,4e-06,-1.1e-05,-1e-05,-1.4e-05,-3e-06,-8e-06,-8e-06,-5e-06,-1.1e-05,-7e-06,1.3e-05,-4e-06,1.1e-05,6e-06,-7.1e-05,0.00012,-0.000108,0.000262,0.00056,-0.000529,-0.000199,4.3e-05,-8.1e-05,0.00016,0.000261,-0.000941,0.000322,0.00114,-0.000716,-0.000287,0.000913,-0.000756,0.000272,0.002202,0.002049,0.001323,-0.000118,2e-04,-0.000807,0.000787,-0.000107,-0.000553,0.000155,-7e-06,-0.000117,4.9e-05,8.3e-05,0.000473,0.000691,-0.000232,-0.000134,3e-04,0.000562,0.000161,9.7e-05,6.3e-05,-2.9e-05,-0.000429,-9.9e-05,4.1e-05,4.1e-05,-0.000189,0.000197,7e-05,7.1e-05,4.8e-05,5.5e-05,-7.2e-05,-8e-06,5.7e-05,0.000209,4.3e-05,-7e-05,-3.4e-05,-2.2e-05,-3.6e-05,-3.6e-05,1.6e-05,-8.5e-05,7e-06,-1.6e-05,-2e-05,-0.00022,4.7e-05,-0.000295,7.2e-05,-4e-05,3.6e-05,-3.6e-05,4.4e-05,-4.3e-05,5.2e-05,-0.000159,-2.9e-05,3e-06,-6e-06,6e-06,-2e-06,-8e-06,1e-06,-1.1e-05,1e-05,-9.8e-05,-1.2e-05,0.00022,7e-06,5.2e-05,-7e-06,6e-06,4e-06,-4e-06,1.6e-05,0
-5e-06,0,5e-06,-1.1e-05,8e-06,-7e-06,-1e-06,6e-06,2e-06,-5e-06,-9e-06,-9e-06,0,4e-06,4e-06,-3e-06,-1.3e-05,5e-06,-4e-06,5e-06,-1.3e-05,-1.5e-05,-2.4e-05,-0.000151,3.3e-05,-0.00014,-0.000736,0.000412,9.6e-05,5.8e-05,-9.6e-05,0.000151,-0.000258,0.000823,0.000104,-0.000179,0.00028,-0.000201,-1.1e-05,-8.2e-05,4.3e-05,-0.000729,-0.000962,-0.000619,-0.000295,7.4e-05,0.000712,-4.3e-05,-0.000133,-0.000357,9.8e-05,1e-04,0.000166,0.000189,6.3e-05,-2.9e-05,0.000211,-5.1e-05,-7.9e-05,6.6e-05,-0.000153,3.2e-05,-8.6e-05,0.000141,5.4e-05,2.7e-05,0.000255,-7.6e-05,0.000172,0.000158,-3.6e-05,-0.000148,-0.000122,0.000195,-3e-05,-0.000201,-3.8e-05,-2e-06,-4.5e-05,9.5e-05,3.2e-05,-2e-05,-6.3e-05,7e-06,1e-06,3.3e-05,-7.5e-05,-2e-06,-1.8e-05,-9.5e-05,-5e-06,-9e-06,-3.3e-05,3e-06,-1.3e-05,-2.8e-05,3e-06,-3.1e-05,-5e-06,4.2e-05,2.1e-05,3.1e-05,-1.7e-05,1.8e-05,-1.4e-05,-2e-05,-1.3e-05,-6e-06,-1e-06,6e-06,-1e-05,9e-06,-0.000177,-4e-05,-2.1e-05,2.7e-05,7e-06,7e-06,1.1e-05,-3.2e-05,-2e-06
-2e-06,-1e-06,9e-06,-1.2e-05,-1e-06,-3e-06,-2e-06,-4e-06,1e-06,-5e-06,-3e-06,-6e-06,-8e-06,-1e-05,-4e-06,-1.1e-05,-4e-06,1e-06,-6e-06,3e-06,-6e-06,-9e-06,-4e-06,3.4e-05,9.8e-05,0.000129,0.000516,-5.5e-05,-3e-05,-0.000105,8.3e-05,0.000201,-0.000118,-0.000703,0.000354,0.000213,-0.000573,-0.000338,-6.6e-05,6.7e-05,8e-06,-0.000179,-0.000194,0.000312,0.000311,0.000371,-0.000151,0.000543,-5e-05,0.000127,-0.000135,7.6e-05,-0.000267,5.2e-05,-0.000306,7e-05,0.000113,7.1e-05,8e-05,-1.5e-05,-0.000241,-5e-06,-9e-06,-0.00013,-0.000156,-3.7e-05,0.000101,1.1e-05,-0.000156,4.6e-05,-8.8e-05,4.9e-05,-0.000114,-0.000117,-7.2e-05,9.1e-05,3.5e-05,-2.5e-05,-4.3e-05,6.3e-05,-6.9e-05,4.9e-05,1.8e-05,-2.7e-05,-4e-06,4.2e-05,-5.8e-05,-8e-06,-1.2e-05,2.9e-05,5.5e-05,-2.7e-05,3.2e-05,-8e-06,7.7e-05,-1.5e-05,-3e-06,8e-06,9.2e-05,2e-06,-6.2e-05,-2.6e-05,2e-06,-6e-06,-5e-06,-1.7e-05,1.6e-05,-2e-06,2e-06,-1e-06,-4.3e-05,4.7e-05,-2.3e-05,4e-05,-6e-06,-1.7e-05,-1e-05,-2.1e-05,-1e-06,-1e-05,-2.2e-05
-8e-06,-5e-06,4e-06,-5e-06,-6e-06,-8e-06,-2e-06,-1.2e-05,-4e-06,-5e-06,3e-06,-1.5e-05,-2e-06,-1.5e-05,-2e-06,-9e-06,-5e-06,-2e-06,-6e-06,-5e-06,-1.5e-05,-5e-06,2.8e-05,5.8e-05,-2.5e-05,-6.9e-05,-0.00033,-6.2e-05,-5.6e-05,7.8e-05,3.1e-05,0.000124,0.000226,0.000613,0.000344,0.000145,0.000873,9.4e-05,0.000169,-3.2e-05,-0.000101,2.7e-05,0.000567,0.00045,-4.4e-05,-0.000159,-4.9e-05,-0.000135,4e-04,0.000141,0.000118,-0.000253,0.000321,-0.000198,-0.000196,-9.1e-05,-0.000412,4.7e-05,0.000118,-4.7e-05,0.000134,-0.000111,5.7e-05,1e-05,0.000206,-6.9e-05,-0.000215,-4.6e-05,0.00013,3e-05,0.000129,5.2e-05,-9.3e-05,5.8e-05,-1e-06,8.6e-05,-2.3e-05,1.2e-05,-3.6e-05,8e-06,-2.9e-05,-2e-06,6e-06,7e-06,1.1e-05,2.4e-05,6.9e-05,1.2e-05,-9e-06,0.000148,-5.3e-05,-6.4e-05,-3.7e-05,2.3e-05,2.4e-05,-2.3e-05,7.3e-05,2.4e-05,-6.3e-05,-5.1e-05,-4.5e-05,4e-06,-4e-06,7e-06,6e-06,-7e-06,-3e-06,0,0,-3e-06,-4.8e-05,7e-06,-5.6e-05,2.1e-05,1.7e-05,-1.8e-05,-2e-06,1.1e-05,-1.1e-05,-2.8e-05,-1.7e-05
-8e-06,-7e-06,1e-06,-3e-06,1e-06,-4e-06,6e-06,-1.5e-05,-5e-06,-6e-06,6e-06,-1e-05,-1e-06,-8e-06,3e-06,-1e-05,3e-06,3e-06,-1e-06,-7e-06,-1.1e-05,-5e-06,3.3e-05,7.9e-05,8e-06,-0.000146,0.000165,-5.2e-05,0.000142,-7.1e-05,-4.8e-05,0.000102,-0.000158,-0.000362,-0.00021,-0.000435,-0.000221,-0.000182,-0.000112,9.4e-05,0.000321,9e-06,-0.000865,-0.00054,5.6e-05,-4.1e-05,0.000169,0.000319,-8.3e-05,-5e-05,-0.000209,0.000247,-0.000229,9e-05,-0.00015,0.000141,0.000216,0.000221,1.8e-05,-2.3e-05,-0.000177,8.8e-05,-4e-06,0.000134,-2.7e-05,-2.5e-05,0.000322,8.9e-05,-1.8e-05,-5.7e-05,3.3e-05,1.4e-05,0.000228,2.2e-05,2.7e-05,-1.6e-05,1.8e-05,-9e-06,3.3e-05,-5.1e-05,-2.6e-05,-3e-06,-3.3e-05,1.2e-05,2e-06,-4e-05,1.6e-05,-1.5e-05,-1.2e-05,5.7e-05,-3.1e-05,-2.5e-05,-4.4e-05,-4.2e-05,-1e-06,7e-06,4.1e-05,-1.5e-05,-4.4e-05,-2e-06,-1.1e-05,1e-06,-1e-06,-5e-06,-8e-06,-9e-06,0,8e-06,4e-06,-6e-06,2e-05,-2.7e-05,5.2e-05,3.6e-05,-2.4e-05,3e-06,-4e-06,-4e-06,-1e-05,-2.8e-05,-3.3e-05
-1e-06,-9e-06,-4e-06,-3e-06,0,-3e-06,0,-1e-05,-2e-06,-4e-06,2e-06,-1.1e-05,0,-4e-06,-3e-06,-8e-06,2e-06,-2e-06,-4e-06,-2e-06,1e-06,-3e-06,2.2e-05,-0.000178,-2e-05,0.000268,5.2e-05,5.1e-05,-0.000104,-2.6e-05,-2.4e-05,0.000123,0.00024,0.000529,-0.000501,0.000583,0.00011,0.000159,7.7e-05,-3e-06,-0.000201,0.000219,0.000805,0.000466,-0.000113,0.000163,-0.000101,-3.4e-05,4.4e-05,8.8e-05,0.000103,-0.000173,0.00011,2.7e-05,-0.000135,-0.000162,-0.000247,-0.000153,-5.8e-05,2.9e-05,-8.2e-05,-4e-06,-1.8e-05,-0.000133,8.2e-05,-7e-06,-0.000235,1.2e-05,-0.000142,-0.00012,1.3e-05,2.9e-05,-2e-05,-6.1e-05,1.9e-05,-7.3e-05,1.6e-05,-2e-05,8.1e-05,-2.4e-05,2e-05,-1e-05,0,1.5e-05,-1.4e-05,-2.2e-05,2.5e-05,8e-06,1.1e-05,3.1e-05,-4.1e-05,2.4e-05,1.6e-05,-2.9e-05,1.3e-05,-3e-06,3.2e-05,-1.8e-05,8e-05,-4.6e-05,-1.1e-05,3e-06,3e-06,-1.5e-05,-4e-06,-2e-06,-3e-06,3e-06,3e-06,-6e-06,-4e-06,-2.2e-05,-4.2e-05,-1.3e-05,-5e-06,-1e-06,2e-06,5e-06,-6e-06,1e-06,-1.3e-05
0,-7e-06,0,-1e-06,3e-06,-1e-06,1e-06,-1e-06,0,-7e-06,-3e-06,-7e-06,1e-06,-5e-06,2e-06,-2e-06,-8e-06,-2e-06,0,-4e-06,-2e-06,-5e-06,9e-06,0.000103,-3.4e-05,-2e-04,-0.000212,-3.1e-05,9.2e-05,6e-05,4.2e-05,7.9e-05,-4.7e-05,-0.000653,-0.000443,-0.000274,0.000484,0.000272,-7.5e-05,-1.1e-05,-2.3e-05,-5e-04,-5.8e-05,-0.000193,-3.2e-05,6.6e-05,1.2e-05,-6.5e-05,-0.000209,3.9e-05,0.000101,0.000165,-3e-06,-1.6e-05,-6.4e-05,0.000125,0.000285,-8.7e-05,3.9e-05,3e-06,0.000318,7.8e-05,0.000109,3.3e-05,1.8e-05,-2.6e-05,9.2e-05,2.3e-05,0.000103,4.9e-05,-3.6e-05,-1e-05,7e-06,-2.4e-05,1.7e-05,7.3e-05,-1.1e-05,1e-05,-2e-05,-2.5e-05,-7e-06,-1.4e-05,2.2e-05,1.6e-05,1e-05,-2e-06,1e-05,-1e-06,-2e-06,-5e-05,4.8e-05,2e-05,-2.4e-05,-3e-06,2.4e-05,-1.7e-05,-1.4e-05,-1e-05,-2e-05,6e-05,1e-05,-1e-06,-2e-06,3e-06,1e-06,-6e-06,-3e-06,3e-06,-1e-06,-6e-06,0,-4e-06,2.2e-05,-1.9e-05,1.3e-05,-6e-06,-3e-06,-4e-06,-9e-06,1.7e-05,-1.3e-05
-2e-06,-1e-06,1e-06,-3e-06,-3e-06,-2e-06,-1e-06,-1e-06,2e-06,-5e-06,-2e-06,-5e-06,0,-4e-06,-2e-06,-2e-06,1e-06,4e-06,-2e-06,4e-06,7e-06,-2e-06,-1.6e-05,6e-06,1.3e-05,7.8e-05,-2.6e-05,2.4e-05,-2.2e-05,1.4e-05,1e-06,9e-05,-1.8e-05,0.00035,-0.000222,0.00019,-8e-05,-0.000182,0.000128,-8.9e-05,0.000203,0.000115,-0.000165,0.000122,8.3e-05,-0.000254,-6.3e-05,-0.000136,5.3e-05,-7e-05,-0.000165,-0.000329,-4.6e-05,4e-06,0.000113,-0.000181,-0.000123,2.5e-05,2.7e-05,-7.3e-05,-0.000154,-8e-05,-5e-06,4.5e-05,-5.1e-05,-2.8e-05,-0.000155,-8.2e-05,4.1e-05,4.1e-05,5.2e-05,2.3e-05,-2.8e-05,-1.2e-05,2.9e-05,-5.4e-05,-8e-06,9e-06,-7.4e-05,-2.7e-05,-3e-06,2e-05,-1e-05,6e-06,-2e-06,0,-2.5e-05,-2e-06,2e-06,1e-06,1.2e-05,1.5e-05,6.1e-05,-3.1e-05,-2.9e-05,-1.4e-05,-1.6e-05,-7e-06,-6.3e-05,-9.2e-05,1.6e-05,-2e-06,1e-06,0,-6e-06,-1.3e-05,-1e-06,-4e-06,1e-06,-6e-06,3.3e-05,0,1.4e-05,-2.6e-05,-1.9e-05,-6e-06,2e-06,1e-06,-3e-06,1.4e-05,-5e-06
-2e-06,0,0,-3e-06,3e-06,-1e-06,-1e-06,4e-06,2e-06,-7e-06,-1e-06,-5e-06,1e-06,0,-1e-06,0,-1e-06,-2e-06,2e-06,1e-06,-3e-06,-4e-06,-1.6e-05,-1.3e-05,-3e-06,-1.3e-05,9.8e-05,1e-05,-6e-05,-4.7e-05,-1.3e-05,6.5e-05,9.5e-05,-0.000259,-1e-06,6e-06,0.000243,0.000234,-9e-06,0.000123,-0.000138,0.000377,-0.000268,-0.000129,-4.4e-05,0,-2.6e-05,-5.1e-05,0.000103,-0.000172,-0.000125,7.1e-05,-3.9e-05,-1e-06,0.000195,-1.4e-05,3.6e-05,-0.000205,-2e-05,-4.9e-05,0.000117,-2.1e-05,-2.1e-05,-2e-05,0.000103,6.8e-05,0.000203,3.1e-05,-6.7e-05,2e-06,4e-05,-7.7e-05,1e-05,8e-06,-4e-06,-2.8e-05,5e-06,-2.1e-05,-3.9e-05,-1.3e-05,0,7e-06,-1.7e-05,2e-06,0,1e-05,-2e-06,6e-06,1e-06,5.7e-05,-2.1e-05,-2.1e-05,-6.5e-05,-6e-06,-8e-06,-4e-06,-2e-05,-1.8e-05,3e-05,6.6e-05,-2e-06,-1e-06,-2e-06,4e-06,-5e-06,-7e-06,3e-06,1e-06,0,-5e-06,1.4e-05,1e-05,2e-05,1.1e-05,1.7e-05,-7e-06,0,-2e-06,1e-06,8e-06,-6e-06
0,2e-06,-1e-06,-1e-06,-1e-06,-2e-06,-2e-06,1e-06,2e-06,-6e-06,1e-06,-8e-06,-1e-06,-1e-06,1e-06,-1e-06,-1e-06,-1e-06,-2e-06,-2e-06,3e-06,0,-2.1e-05,-2.9e-05,-2e-06,4.7e-05,1.1e-05,-5.6e-05,5.9e-05,2.6e-05,-1.9e-05,6.4e-05,-0.00014,0.000311,-5.6e-05,-0.000148,-0.000481,-0.000321,3.6e-05,-7.5e-05,0.000176,-0.000472,0.000321,-0.000157,3.1e-05,-2e-05,-0.000284,0.000219,1.9e-05,5.9e-05,0.00017,6.3e-05,3.6e-05,5.1e-05,-4.5e-05,7.6e-05,-0.000225,5e-05,-3.6e-05,3.2e-05,-0.000153,0,5.8e-05,1.3e-05,-3.4e-05,-9e-06,-0.000105,1.7e-05,2.1e-05,-1.6e-05,-7.7e-05,-3.3e-05,-2.5e-05,9e-06,-3.2e-05,-1.2e-05,1e-06,2e-06,1.4e-05,1.1e-05,-1.3e-05,-3e-06,1e-06,-1.8e-05,-6e-06,1.8e-05,-8e-06,-6e-06,2e-06,4.6e-05,-6.4e-05,-2.1e-05,6.6e-05,1.2e-05,7e-06,2e-06,-1.7e-05,-6e-06,1.5e-05,-5.3e-05,2.8e-05,3e-06,1e-06,3e-06,2e-06,-4e-06,-3e-06,-5e-06,1e-06,-5e-06,1.2e-05,6e-06,-4.6e-05,-1.3e-05,-9e-06,-2e-06,0,7e-06,0,9e-06,-7e-06
0,2e-06,0,-1e-06,0,-1e-06,0,-2e-06,0,-3e-06,2e-06,-4e-06,0,-5e-06,-1e-06,0,2e-06,2e-06,1e-06,0,-4e-06,-1e-06,-9e-06,2.1e-05,-7e-06,-2.9e-05,-6.9e-05,2.1e-05,-4.8e-05,1.3e-05,2.3e-05,4.9e-05,0.000105,-0.000396,1.3e-05,0.00021,0.000168,-7.2e-05,-8.8e-05,2.3e-05,-4.5e-05,0.000169,-0.000374,0.000137,-0.000122,0.000228,-0.000101,-0.000337,-1.9e-05,-1e-04,7e-06,0.000108,-0.000185,-3.9e-05,-5.1e-05,-7.3e-05,0.000182,0.000105,4.3e-05,7.8e-05,0.000109,2.2e-05,-7.2e-05,9e-06,-2.8e-05,-9e-06,5.1e-05,2.8e-05,1e-05,-6e-06,-2.8e-05,3.8e-05,1.7e-05,1e-06,-9e-06,2e-05,-9e-06,8e-06,2.9e-05,1.4e-05,-7e-06,-1.9e-05,-5e-06,-3e-06,-5e-06,1.1e-05,1.1e-05,6e-06,0,3.7e-05,-3e-05,-9e-06,-5e-05,-1.6e-05,-2.6e-05,-2e-06,-4e-06,-6e-06,-1.6e-05,3.4e-05,2.7e-05,8e-06,0,1e-06,2e-06,-5e-06,1e-06,0,-3e-06,-3e-06,2e-05,0,6.2e-05,2.3e-05,5e-06,2e-06,0,-4e-06,-1e-06,-4e-06,-8e-06
-3e-06,1e-06,-2e-06,-2e-06,-1e-06,-1e-06,0,0,-1e-06,-2e-06,1e-06,-3e-06,-1e-06,-4e-06,0,2e-06,0,-1e-06,-1e-06,-2e-06,-2e-06,1e-06,2e-06,-1e-05,5e-06,-7e-06,-3.4e-05,2.5e-05,4e-06,-4.8e-05,6e-06,3.7e-05,-5.9e-05,0.000377,0.000321,-0.000138,-0.000332,-8.8e-05,-4e-05,-1.9e-05,-0.000159,0.000106,0.00035,-0.00032,6.1e-05,0.000119,-0.00012,0.000301,-9.7e-05,-8.5e-05,-6.9e-05,-6.2e-05,5.9e-05,-2.9e-05,4.7e-05,6.6e-05,-3.9e-05,8.3e-05,-2.7e-05,4.3e-05,-8e-06,-4.2e-05,1.2e-05,-2.9e-05,-4e-05,-2e-05,-1.7e-05,2e-06,-5e-05,1.7e-05,3.8e-05,3.1e-05,-2.1e-05,2.1e-05,-1.4e-05,5.5e-05,7e-06,-1.4e-05,1e-05,1.7e-05,-1.1e-05,1e-05,6e-06,1e-06,6e-06,-2e-05,-5e-06,1e-06,3e-06,-2e-05,3e-05,2.2e-05,2.1e-05,4e-06,7e-06,-8e-06,-1e-05,-2e-06,4e-06,-1.7e-05,-6e-06,-1e-05,-2e-06,-5e-06,-1e-06,0,-1e-06,-2e-06,1e-06,-2e-06,9e-06,-4e-06,-9e-06,1e-06,-1.6e-05,-3e-06,0,0,-1e-05,-1.2e-05,-1.1e-05
-2e-06,0,0,0,1e-06,-1e-06,1e-06,-5e-06,-2e-06,-1e-06,-2e-06,-3e-06,0,0,1e-06,2e-06,3e-06,-2e-06,1e-06,-2e-06,0,0,9e-06,3.5e-05,1.1e-05,-2.6e-05,6.5e-05,-2.6e-05,4.6e-05,3.1e-05,-1.1e-05,3.4e-05,6e-06,-0.000272,0.000181,0.000163,6.8e-05,-6.4e-05,4.5e-05,1.3e-05,9.7e-05,1.7e-05,1.5e-05,0.000154,6.5e-05,-0.00014,2.1e-05,-0.000106,1.4e-05,4.4e-05,-2.2e-05,6.6e-05,4e-06,2.8e-05,-5.4e-05,-3e-05,4e-05,0.00015,-4e-05,-2.5e-05,-4.7e-05,2.6e-05,4.2e-05,2e-06,-2.2e-05,0,2.2e-05,-5.8e-05,8e-05,3e-06,-5.2e-05,1.1e-05,-5e-06,1e-06,-1.2e-05,9e-06,2e-06,4e-06,-1.7e-05,1.1e-05,-2e-06,9e-06,-2e-06,-6e-06,-4e-06,-1.4e-05,6e-06,-6e-06,-1e-06,-8e-06,1.3e-05,1.3e-05,-1.2e-05,1.1e-05,-1e-06,-8e-06,-1e-06,-2e-06,1.8e-05,-6e-06,3e-05,-1e-06,2e-06,-2e-06,1e-06,-6e-06,2e-06,3e-06,-2e-06,-1e-06,3e-06,-1.1e-05,-1.9e-05,-6e-06,1.2e-05,-7e-06,0,-2e-06,-4e-06,-9e-06,-5e-06
0,-1e-06,0,-1e-06,2e-06,-1e-06,0,-2e-06,-1e-06,-2e-06,-1e-06,-5e-06,1e-06,-1e-06,-2e-06,3e-06,-2e-06,2e-06,-2e-06,1e-06,-4e-06,0,1e-05,-2.5e-05,-1.6e-05,5.5e-05,-7.8e-05,5e-06,-4.6e-05,5e-06,-1.3e-05,2.2e-05,6.4e-05,0.000318,6.8e-05,-8.1e-05,-0.000101,-3e-06,-4.5e-05,3e-06,3.6e-05,-0.00013,-0.000297,6.5e-05,-6.8e-05,-9.2e-05,-0.000191,-2.3e-05,4e-06,-0.000103,2e-05,-3.6e-05,-0.000149,1.1e-05,-0.000144,-5e-06,-0.00014,-0.000149,1.1e-05,-5.2e-05,6.6e-05,-1.2e-05,-3e-06,3.6e-05,2.5e-05,-3.7e-05,-4.3e-05,-1e-05,-1e-06,-1.9e-05,-3e-05,-2.1e-05,4e-05,-4e-06,2.2e-05,-6.3e-05,-7e-06,2e-06,-2.6e-05,1e-05,-6e-06,1e-06,-5e-06,1.5e-05,3e-06,2e-06,4e-06,5e-06,1e-06,1.4e-05,2e-06,3e-06,-7e-06,-1.1e-05,4e-06,4e-06,-2e-06,3e-06,-2.7e-05,3e-06,-1e-06,3e-06,0,-3e-06,1e-06,-1e-05,-2e-06,-1e-06,0,0,1e-06,-1e-06,-2.5e-05,3e-06,-7e-06,-3e-06,-1e-06,4e-06,0,-6e-06,-7e-06
0,-2e-06,1e-06,-1e-06,-2e-06,-1e-06,1e-06,0,0,-2e-06,0,-3e-06,0,-3e-06,1e-06,3e-06,-1e-06,0,1e-06,0,4e-06,1e-06,6e-06,-3.1e-05,1.1e-05,-2.6e-05,5.9e-05,1.2e-05,4.3e-05,-1.4e-05,1.6e-05,2.2e-05,-7.5e-05,-0.00032,7.3e-05,-2.8e-05,-7.7e-05,8.6e-05,4.5e-05,6e-06,-1.6e-05,2e-06,3e-04,-5.6e-05,1.4e-05,9e-05,5e-05,0.000103,6.7e-05,-1.4e-05,3.9e-05,-6.5e-05,0.000133,-1.2e-05,-7.9e-05,4.1e-05,4e-05,-4.1e-05,2e-05,-2e-05,-2e-06,2.5e-05,-2.4e-05,-4.3e-05,-8e-06,-4e-06,5e-06,-2.6e-05,-6.6e-05,-5e-06,2.6e-05,9e-06,6e-06,7e-06,1.3e-05,2.7e-05,4e-06,-5e-06,3.6e-05,4e-06,-2e-06,-1.7e-05,-3e-06,7e-06,-4e-06,9e-06,2e-06,-5e-06,0,2.5e-05,-3.8e-05,-1.5e-05,-1e-06,6e-06,-8e-06,5e-06,8e-06,1e-06,0,-1.3e-05,-1e-06,2e-06,0,-1e-06,-2e-06,-3e-06,0,1e-06,1e-06,0,-2e-06,0,1.4e-05,1e-05,1e-06,-1e-06,1e-06,-4e-06,0,-1e-06,-3e-06
-1e-06,-2e-06,0,0,1e-06,0,-1e-06,-1e-06,0,-2e-06,1e-06,-3e-06,0,-1e-06,0,2e-06,1e-06,-2e-06,0,0,-3e-06,1e-06,0,5.4e-05,-8e-06,-2.5e-05,-4.9e-05,-1.9e-05,-1.7e-05,9e-06,3e-06,7e-06,8.3e-05,0.000234,-0.000206,0.00011,0.000164,4.9e-05,-1.7e-05,-1.4e-05,-5.4e-05,0.000241,-0.000229,8.2e-05,1.9e-05,5.3e-05,-8.3e-05,-6.4e-05,-2e-06,-2.2e-05,-4e-05,-1.5e-05,-5.6e-05,-8e-06,2.9e-05,1e-06,2.6e-05,-2.4e-05,-6e-06,2.2e-05,-9.5e-05,-2.9e-05,-1.1e-05,8e-06,-1.7e-05,1.7e-05,1.4e-05,1.3e-05,4.4e-05,6e-06,4e-06,2e-06,-3.1e-05,-2e-06,7e-06,-6e-06,5e-06,0,-1e-05,1e-06,-8e-06,-1e-06,1e-06,1e-06,3e-06,2e-06,5e-06,0,-1e-06,2.5e-05,-1.1e-05,-1.2e-05,-9e-06,-2e-06,1.9e-05,-1e-06,9e-06,0,2e-05,-6e-06,4e-06,0,0,5e-06,-2e-06,-3e-06,0,-2e-06,-1e-06,1e-06,-7e-06,3e-06,-2.2e-05,-7e-06,5e-06,0,0,1e-06,0,2e-06,-6e-06
-1e-06,-1e-06,1e-06,-1e-06,-1e-06,0,0,0,1e-06,-2e-06,1e-06,-2e-06,0,1e-06,0,2e-06,-1e-06,2e-06,0,1e-06,2e-06,1e-06,-5e-06,-1.2e-05,-4e-06,3.4e-05,-7.3e-05,3e-06,-1.7e-05,8e-06,-8e-06,8e-06,-5.9e-05,-0.000266,-0.000248,-0.000142,-0.000168,9.2e-05,4.8e-05,-9e-06,-1e-06,-0.000208,-2e-06,-0.000138,-2.5e-05,7.5e-05,4e-06,9e-05,-5.5e-05,3e-05,-5.1e-05,4.1e-05,-4.5e-05,1.8e-05,6e-06,-2.5e-05,-4e-06,-9.6e-05,-1.1e-05,2.6e-05,7.2e-05,3.2e-05,-2e-06,2.6e-05,-7e-06,-2.3e-05,1e-06,2.5e-05,6e-06,6e-06,-1.4e-05,-1.2e-05,-2.3e-05,-1.6e-05,8e-06,-2e-06,-7e-06,6e-06,-1.4e-05,-7e-06,-4e-06,2.3e-05,-3e-06,1e-06,-3e-06,-2e-06,-8e-06,2e-06,1e-06,-6e-06,5e-06,6e-06,1.7e-05,-1.2e-05,-2e-06,-8e-06,9e-06,0,-1.3e-05,1.2e-05,-2.4e-05,-7e-06,-1e-06,0,1e-06,-3e-06,3e-06,0,0,1e-06,-9e-06,4e-06,2.1e-05,0,-7e-06,-4e-06,0,-1e-06,0,6e-06,-3e-06
0,0,0,0,1e-06,0,-1e-06,0,1e-06,-2e-06,0,-3e-06,0,-2e-06,0,0,1e-06,0,-1e-06,-2e-06,0,1e-06,-5e-06,-2.6e-05,9e-06,-8e-06,0.000129,1e-05,2.1e-05,-1.4e-05,-6e-06,1e-06,1.8e-05,0.000277,-5.4e-05,0.000123,0.000146,-8.1e-05,-2.2e-05,1.1e-05,4.5e-05,-6.6e-05,0.000131,0.00016,3.5e-05,3e-06,-6.8e-05,-6.6e-05,-3e-05,-4.9e-05,5.7e-05,3.9e-05,7.8e-05,-4e-06,7e-06,4.8e-05,5e-06,8.9e-05,0,-1.1e-05,-5.5e-05,8e-06,-1.5e-05,-1.3e-05,2.6e-05,1.1e-05,2e-06,-6e-06,-2.3e-05,0,5e-06,-1.2e-05,2.9e-05,3e-06,-6e-06,-2.7e-05,-3e-06,-6e-06,-2.7e-05,-1e-05,-4e-06,-7e-06,1e-06,-8e-06,4e-06,8e-06,1e-06,-4e-06,0,-9e-06,4e-06,8e-06,-7e-06,6e-06,-1e-06,-2e-06,5e-06,-1e-06,-1.1e-05,-1.2e-05,-1e-06,5e-06,1e-06,1e-06,0,0,-2e-06,-1e-06,1e-06,1e-06,-6e-06,-4e-06,7e-06,-3e-06,4e-06,-3e-06,0,1e-06,-4e-06,8e-06,-6e-06
0,0,0,0,-1e-06,0,0,0,0,-1e-06,-1e-06,-2e-06,0,-2e-06,-1e-06,1e-06,-1e-06,-1e-06,1e-06,0,-1e-06,1e-06,-4e-06,1e-05,-4e-06,7e-06,-0.000113,-1.9e-05,-2.4e-05,-5e-06,9e-06,-6e-06,1.6e-05,-0.000246,1.3e-05,-7.1e-05,-0.000123,8.8e-05,8e-06,1.7e-05,-1.6e-05,0.000175,2.7e-05,-0.000116,-1.5e-05,-6.3e-05,7e-06,6e-06,2.2e-05,7e-06,1.9e-05,-7e-06,-2.6e-05,-5e-06,6.1e-05,-6.4e-05,-4.2e-05,0,1.6e-05,-1.9e-05,9.5e-05,-6e-06,4e-06,3e-06,1.7e-05,8e-06,0,-3e-06,4.3e-05,-2e-06,1.6e-05,0,1e-06,-1e-05,-1.6e-05,2.3e-05,5e-06,1e-06,1e-06,-5e-06,1e-06,-1e-05,2e-06,-1.1e-05,-2e-06,0,-5e-06,4e-06,-1e-06,-3e-06,1e-06,5e-06,-3e-06,-2e-06,3e-06,4e-06,0,-2e-06,1.2e-05,8e-06,-9e-06,0,-1e-06,-1e-06,-1e-06,-6e-06,2e-06,0,-1e-06,1e-06,-8e-06,-1e-06,1.7e-05,-3e-06,-6e-06,-1e-06,0,-2e-06,-1e-06,1e-06,-4e-06
-1e-06,1e-06,-1e-06,0,0,0,-1e-06,0,0,-2e-06,0,-3e-06,0,0,0,0,0,1e-06,0,0,2e-06,0,0,2e-05,3e-06,-1.9e-05,4.5e-05,1.3e-05,7e-06,1e-05,2e-06,-4e-06,-4.4e-05,0.000226,-1.6e-05,5e-06,0.000256,-8e-05,-2.1e-05,-7e-06,-6.8e-05,-5e-05,-0.000155,2.1e-05,-4.9e-05,4.2e-05,-9.4e-05,-3e-05,4e-05,3.2e-05,-4.7e-05,-1.5e-05,-6.5e-05,1.4e-05,2.5e-05,4.6e-05,3.4e-05,6.6e-05,2e-06,2.1e-05,-6.6e-05,-6e-06,-3e-06,-3e-06,3e-06,1.7e-05,6e-06,-2.3e-05,-1.9e-05,3e-06,1.9e-05,1.9e-05,8e-06,1e-06,-1.1e-05,9e-06,0,4e-06,2.1e-05,0,1e-06,-4e-06,-4e-06,-3e-06,0,-1.1e-05,4e-06,-1e-06,1e-06,7e-06,-2.2e-05,2e-06,1e-05,-6e-06,-2e-06,3e-06,-2e-06,-3e-06,0,-3e-06,-1.9e-05,1e-06,0,-2e-06,0,-6e-06,-4e-06,0,0,1e-06,-7e-06,-1e-06,-1e-05,1e-06,9e-06,-1e-06,0,2e-06,-3e-06,0,-4e-06
-1e-06,1e-06,0,0,0,0,1e-06,-1e-06,0,-2e-06,0,-3e-06,0,1e-06,0,0,0,0,0,-1e-06,-2e-06,0,3e-06,-2.4e-05,-8e-06,7e-06,-2.4e-05,3e-06,1.2e-05,-4e-06,-3e-06,-1.3e-05,5.7e-05,-0.000207,-2.2e-05,6.9e-05,-9.3e-05,2.3e-05,4e-06,-1.2e-05,4.2e-05,-1e-04,0.000191,0.000151,6.9e-05,6.2e-05,-3.6e-05,2.1e-05,1.1e-05,-2.4e-05,-8e-06,-4.2e-05,6.8e-05,-7e-06,1e-05,-4.2e-05,-4e-05,5.4e-05,-1.1e-05,2.6e-05,2.7e-05,4e-06,-1e-06,-9e-06,-1.6e-05,-1.3e-05,-2.3e-05,2e-06,-4.4e-05,-1e-06,-1.2e-05,5e-06,-2e-05,0,-4e-06,2.3e-05,-5e-06,-1e-06,1.3e-05,1e-06,-3e-06,1.4e-05,1e-06,-1e-06,1e-06,-3e-06,1e-06,0,-1e-06,1.2e-05,0,-5e-06,-1.5e-05,5e-06,-1e-06,-4e-06,-4e-06,-1e-06,-6e-06,-2.1e-05,-4e-06,-2e-06,0,-1e-06,0,-1e-06,3e-06,0,1e-06,1e-06,-2e-06,-5e-06,-3e-06,-7e-06,-1.2e-05,-3e-06,0,-2e-06,1e-06,-2e-06,-3e-06
0,0,0,0,0,0,0,0,0,-1e-06,1e-06,-2e-06,0,-2e-06,0,0,-1e-06,-1e-06,0,1e-06,1e-06,0,2e-06,1.7e-05,9e-06,7e-06,-2.9e-05,-1.7e-05,-1.8e-05,5e-06,-6e-06,-1.1e-05,-5.1e-05,0.000233,5.7e-05,-0.000118,0.00011,3e-05,-1e-06,-1.4e-05,1e-05,3.2e-05,-0.000185,-9.9e-05,-4.1e-05,7e-06,-3.8e-05,-1.9e-05,-1.9e-05,3.1e-05,2.7e-05,3.7e-05,-6.6e-05,-2e-06,-5.1e-05,1e-06,7.4e-05,-7.6e-05,2e-05,-1.6e-05,1.8e-05,-1.1e-05,5e-06,8e-06,0,1e-05,2e-05,1.9e-05,5.1e-05,-6e-06,7e-06,1e-06,-1.4e-05,5e-06,1e-06,-3.8e-05,2e-06,-2e-06,-2.4e-05,6e-06,-5e-06,-1e-06,-2e-06,4e-06,0,5e-06,1e-06,2e-06,0,-5e-06,-1e-06,-6e-06,1.2e-05,-3e-06,-6e-06,-3e-06,-3e-06,-1e-06,4e-06,2.7e-05,-4e-06,-1e-06,0,0,0,-2e-06,-1e-06,1e-06,-1e-06,1e-06,-3e-06,1e-06,3e-06,8e-06,1.4e-05,-2e-06,0,1e-06,0,-4e-06,-3e-06
0,0,0,0,0,0,0,-1e-06,0,-1e-06,1e-06,-2e-06,0,-1e-06,0,-1e-06,2e-06,1e-06,0,0,-2e-06,0,2e-06,-1.7e-05,-7e-06,4e-06,4.1e-05,2e-05,1.8e-05,2e-06,5e-06,-1.7e-05,3.7e-05,-0.000236,0.000154,0.00011,-2.4e-05,3e-05,4e-06,2.6e-05,-4.8e-05,0.000116,-1.3e-05,8.1e-05,-1.3e-05,-1.3e-05,-2.5e-05,-2e-06,-3.3e-05,-1e-06,1.3e-05,-4.6e-05,-3.7e-05,8e-06,-7.7e-05,9e-06,-6.2e-05,0,1.1e-05,-2.8e-05,-5.4e-05,5e-06,-2e-06,4e-06,2e-05,-6e-06,-2.3e-05,1e-06,-2e-06,0,2.6e-05,-8e-06,1.5e-05,8e-06,1.1e-05,1e-06,4e-06,5e-06,-5e-06,8e-06,-7e-06,-7e-06,0,6e-06,0,6e-06,1e-06,-3e-06,1e-06,-7e-06,8e-06,-3e-06,-1e-05,-1e-06,4e-06,1e-06,-3e-06,0,1e-06,-2.8e-05,-9e-06,1e-06,0,1e-06,0,-1e-06,1e-06,-1e-06,1e-06,0,-1e-06,2e-06,-9e-06,8e-06,-9e-06,-2e-06,0,0,-1e-06,-5e-06,-4e-06
-1e-06,0,0,0,0,0,0,-1e-06,0,-1e-06,0,-2e-06,0,1e-06,0,0,-1e-06,0,-1e-06,-1e-06,1e-06,0,0,7e-06,1e-06,-2.3e-05,-4.6e-05,-7e-06,-1e-05,-5e-06,5e-06,-1.8e-05,-1.4e-05,0.000215,0.000117,-6.5e-05,-4e-05,4.9e-05,4e-06,7e-06,2e-05,-6.4e-05,0.000217,-4.8e-05,7.1e-05,-4e-06,-4.6e-05,1.7e-05,0,-1.5e-05,-3.3e-05,5.5e-05,4.7e-05,2e-06,-7e-06,-2.9e-05,4.9e-05,-5.6e-05,-1.9e-05,-1e-05,2.5e-05,-1.1e-05,-9e-06,-5e-06,-1e-06,-7e-06,3.5e-05,0,-2.7e-05,4e-06,-1e-05,-4e-06,2.8e-05,0,1.6e-05,1.9e-05,-3e-06,-1e-06,0,5e-06,-3e-06,-3e-06,0,7e-06,0,-3e-06,-2e-06,3e-06,-1e-06,-8e-06,-4e-06,2e-06,2e-06,6e-06,-3e-06,3e-06,-2e-06,0,-4e-06,2.5e-05,7e-06,2e-06,0,1e-06,1e-06,-2e-06,-2e-06,1e-06,0,0,2e-06,-1e-06,-6e-06,-7e-06,3e-06,-1e-06,0,1e-06,0,-1e-06,-3e-06
0,0,0,0,0,0,0,0,0,-1e-06,0,-2e-06,0,0,0,-1e-06,0,-1e-06,0,1e-06,0,0,-1e-06,1.4e-05,6e-06,1.3e-05,-5e-06,-4e-06,0,-2e-06,-3e-06,-1.8e-05,-8e-06,-0.000222,4.7e-05,1.7e-05,5.8e-05,2.1e-05,-1.3e-05,-1e-05,-2e-05,-0.000116,-0.000222,2.3e-05,-6.2e-05,1.9e-05,-4.5e-05,-4.2e-05,3.3e-05,-2.6e-05,-1.4e-05,-1.5e-05,-7.6e-05,-1e-06,-4.1e-05,1.5e-05,-7.2e-05,-2e-05,4e-06,1.3e-05,1.9e-05,3e-06,9e-06,3e-06,-7e-06,2e-06,-4e-05,-1.8e-05,3.2e-05,2e-06,-1.6e-05,-3e-06,-2.5e-05,4e-06,4e-06,-1.5e-05,-2e-06,0,3e-06,0,-1e-06,5e-06,0,1e-06,0,-2e-06,3e-06,-2e-06,1e-06,0,-1.6e-05,8e-06,3e-06,-5e-06,-3e-06,-1e-06,-1e-06,1e-06,2e-06,-2.5e-05,0,0,0,1e-06,0,-6e-06,3e-06,-1e-06,-1e-06,0,3e-06,-1e-06,0,-1e-06,0,-1e-06,0,-2e-06,-2e-06,0,-4e-06
0,0,0,0,0,0,-1e-06,-1e-06,0,-1e-06,0,-2e-06,0,-2e-06,0,-1e-06,0,1e-06,0,0,-1e-06,0,-1e-06,-1.4e-05,-8e-06,6e-06,2.4e-05,-3e-06,4e-06,-1e-06,-5e-06,-2.1e-05,2.6e-05,0.000208,1.5e-05,3.7e-05,-0.000174,-6.3e-05,0,-2.1e-05,-1.8e-05,0.000152,0.000134,-1e-05,8e-06,6.7e-05,-2.8e-05,1.8e-05,2.3e-05,-1.8e-05,3.4e-05,2.8e-05,9e-06,8e-06,-8e-06,1.3e-05,9.9e-05,1.3e-05,7e-06,8e-06,-3.7e-05,4e-06,2e-06,3e-06,-1.8e-05,-2e-06,5.2e-05,-1e-06,-2.8e-05,-1e-06,1.3e-05,-4e-06,-5e-06,-4e-06,-1e-06,-2.5e-05,3e-06,1e-06,-1.3e-05,-3e-06,-1e-06,5e-06,1e-06,-1e-06,1e-06,5e-06,-2e-06,-1e-06,0,1e-06,-6e-06,4e-06,-1.2e-05,-1e-06,4e-06,-2e-06,1e-06,0,3e-06,1.3e-05,7e-06,-4e-06,0,-1e-06,-1e-06,-4e-06,-2e-06,1e-06,0,0,4e-06,0,2e-06,5e-06,-2e-06,-2e-06,0,1e-06,-2e-06,0,-2e-06
0,0,0,0,0,0,0,1e-06,0,-1e-06,0,-2e-06,0,0,0,0,-1e-06,1e-06,0,-1e-06,2e-06,0,0,-1.6e-05,5e-06,-5e-06,-4.3e-05,1.8e-05,-9e-06,3e-06,2e-06,-1.9e-05,-3.8e-05,-0.000211,-0.000115,-7.7e-05,0.000134,2.1e-05,-1e-06,7e-06,1.3e-05,1.6e-05,0,-0.000122,3.7e-05,6e-06,-4.5e-05,8e-06,-1.8e-05,-2.6e-05,4e-06,-3.8e-05,1.1e-05,5e-06,4.5e-05,-2.2e-05,-7.4e-05,0,-1.1e-05,-3e-06,5.5e-05,1e-06,9e-06,-2e-06,-6e-06,1.7e-05,-5.4e-05,1.6e-05,-1.7e-05,-1e-06,-5e-06,7e-06,1e-06,-2e-06,-6e-06,1.3e-05,0,2e-06,2e-06,-6e-06,-3e-06,-6e-06,-1e-06,-2e-06,-1e-06,0,2e-06,2e-06,-1e-06,-6e-06,-4e-06,-5e-06,1.8e-05,3e-06,-1e-06,-1e-06,3e-06,0,-4e-06,-4e-06,1.8e-05,2e-06,0,0,0,-1e-06,2e-06,-1e-06,0,0,5e-06,-1e-06,-4e-06,-6e-06,1e-06,-2e-06,0,-1e-06,0,3e-06,-4e-06
