0.000111,9.9e-05,0.000229,0.000221,0.000251,0.000173,0.000257,0.000205,6.1e-05,6.1e-05,0.000194,0.000143,0.000193,0.000153,7.4e-05,0.000104,0.000188,0.000272,0.000214,0.000128,5.5e-05,9.7e-05,0.000387,0.000162,4.4e-05,3.6e-05,7.8e-05,0.000117,0.000153,8.6e-05,0.000198,0.000181,0.000212,0.000117,6.1e-05,4.4e-05,2.5e-05,0.000256,7.6e-05,7.3e-05,0.000165,0.000167,0.000239,4.5e-05,-6e-06,-1.5e-05,0.000114,0.000174,0.000175,4.8e-05,0,0.000156,0.000291,0.000123,-7e-06,0.000215,0.000194,0.00017,0.000158,0.000119,0.000104,0.000238,0.00025,0.000134,4.1e-05,3.9e-05,0.00014,2e-04,3e-05,5.2e-05,0.000138,0.000123,0.000138,7.2e-05,9e-06,0.00013,0.000223,0.000135,2.7e-05,4.4e-05,3.3e-05,0.000161,0.000179,0.000137,7.7e-05,0.000129,0.000151,0.000109,9.1e-05,8.6e-05,8.2e-05,0.000272,0.000221,3.1e-05,4.6e-05,6.7e-05,0.000165,0.000289,7.6e-05,7.3e-05,1e-04,0.00012,0.000117,8.5e-05,0.000159,5.8e-05,0.000149,0.000167,8.3e-05,0.00033,0.000172,9.6e-05,8.4e-05,1.5e-05,7e-05,0.000179,0.00011,4.6e-05,8.8e-05,0.000201,0.000219
-4.9e-05,5.5e-05,-6e-05,6.6e-05,4.3e-05,1.9e-05,1e-06,5.3e-05,9.2e-05,3.6e-05,-0.000137,-1.5e-05,7.4e-05,-2.2e-05,-6e-05,-6.9e-05,5.9e-05,-6e-06,8e-05,-6e-06,4.5e-05,0.000111,7.6e-05,7.4e-05,1.1e-05,-4.2e-05,0.000135,-3.1e-05,-3.3e-05,-0.000129,-4.5e-05,0.000109,-7.8e-05,-0.000119,-4.2e-05,-0.00011,9.3e-05,0.000228,0.000135,-2.7e-05,-0.000201,5.3e-05,5.7e-05,6.1e-05,0.000153,6.9e-05,0.000122,-3.6e-05,-3.1e-05,-3.1e-05,6e-06,2.9e-05,7.4e-05,-8e-06,3.2e-05,-0.000184,-2.4e-05,-3.7e-05,2.4e-05,-0.000168,-0.000164,5.9e-05,-0.000108,-2e-05,6.1e-05,8.2e-05,0.000177,0.000143,1.7e-05,-2.5e-05,-9.3e-05,0.000134,-2e-06,-5.8e-05,-0.000118,-0.000112,0.000128,1.9e-05,3.5e-05,5.2e-05,-4e-06,3.6e-05,0.000142,-5e-05,-3e-05,-0.000138,7.4e-05,2.9e-05,-0.000101,-0.000186,-4.9e-05,0.000189,-7.8e-05,-3.1e-05,4e-05,-1.3e-05,7.3e-05,-2.1e-05,-8e-06,-4.7e-05,-9.3e-05,0.000123,0.000124,9.6e-05,0.000105,8e-05,0.000139,-9.2e-05,3.7e-05,5.1e-05,-1.7e-05,7.5e-05,1.3e-05,-5.3e-05,4.7e-05,-0.000171,-9e-06,3.5e-05,-7.9e-05,-1e-04,-2.6e-05
-7.4e-05,-5.8e-05,2.8e-05,-1.7e-05,-6.9e-05,-5.3e-05,-0.000107,4.3e-05,2.5e-05,-8.9e-05,-0.000107,-3.2e-05,-1.3e-05,8.4e-05,-7.6e-05,-3.2e-05,1e-05,-9e-06,-9e-05,-5.5e-05,-3.3e-05,5e-06,2.1e-05,-2.3e-05,1.2e-05,-3.9e-05,2.2e-05,-1.5e-05,5.3e-05,-3.8e-05,-9.3e-05,-2.9e-05,1e-06,-6e-05,-6.2e-05,-3.8e-05,-4.3e-05,-4.3e-05,2.6e-05,-5.2e-05,-8.3e-05,-5.6e-05,-2.6e-05,4e-06,-0.000117,-6.6e-05,-1e-06,5e-06,-0.000204,-9.7e-05,-1.3e-05,-9e-06,1.8e-05,4e-05,-8.1e-05,-0.000133,-3.4e-05,1.1e-05,1.6e-05,-8.3e-05,-6.7e-05,-3.4e-05,-0.000105,-0.000208,-0.000135,-2.2e-05,3e-06,-4e-05,4.2e-05,-5.4e-05,-3.6e-05,1.1e-05,-5.2e-05,-1.8e-05,3.4e-05,-2.7e-05,-2e-06,2.6e-05,-0.000123,-5.4e-05,-3.7e-05,-5.4e-05,-5.1e-05,-0.000132,-8.7e-05,-9.2e-05,-1.7e-05,2.4e-05,2.8e-05,-1e-06,1.3e-05,-4.2e-05,-9.2e-05,-8.3e-05,-3.7e-05,3.1e-05,-4e-05,-0.000109,-9e-05,-6.4e-05,-5.5e-05,-1e-05,-7e-06,-5.4e-05,-3.1e-05,3.1e-05,9.1e-05,-5.4e-05,-0.000135,-9.9e-05,-8.2e-05,-9.6e-05,-0.000107,-1.9e-05,-8.4e-05,-7e-05,-1.5e-05,7e-06,4.5e-05,6e-06,7e-06
-0.000113,0,9.6e-05,-3.5e-05,-2.3e-05,3.7e-05,-0.000136,9e-06,-5.6e-05,5e-06,0,0.000147,-2e-06,-3.9e-05,0.000111,-5.9e-05,-3e-05,5.8e-05,-4.5e-05,3.8e-05,-3.9e-05,3.5e-05,3.7e-05,-7e-06,-4.4e-05,-1e-05,5.8e-05,6.9e-05,-5.5e-05,3.8e-05,-0.000104,9.6e-05,4.6e-05,4.2e-05,4e-05,7e-05,7.9e-05,-4e-06,-9.9e-05,4e-05,-3.2e-05,-1.4e-05,-5.2e-05,-5.7e-05,-2.7e-05,-1.5e-05,9.4e-05,0.000107,-5.6e-05,6.9e-05,2.6e-05,2.5e-05,-4.6e-05,-2.3e-05,3.4e-05,-1.9e-05,-0.000113,5.8e-05,-7e-06,-6e-06,-1.4e-05,4.2e-05,1.5e-05,-4e-05,2.8e-05,4e-05,4e-05,2.1e-05,-7.1e-05,-5.6e-05,-8.1e-05,0,-7.7e-05,-2.5e-05,-1.5e-05,2.4e-05,3.4e-05,-4.2e-05,-9.8e-05,7.3e-05,0,3.7e-05,3.7e-05,-8.2e-05,1.5e-05,-5.3e-05,2.8e-05,2.2e-05,-9e-06,0.000137,-4.5e-05,-2.1e-05,-5.7e-05,-7.3e-05,2.7e-05,-2.8e-05,-7.9e-05,1.4e-05,-2.4e-05,5e-06,-2.5e-05,1.5e-05,-8e-06,-1.9e-05,9.7e-05,-7.5e-05,3.2e-05,9.4e-05,-9.2e-05,-6.7e-05,-5.4e-05,8e-06,6.1e-05,9e-06,-7e-06,-6e-06,-3.1e-05,1.3e-05,5.5e-05,5.6e-05,-0.000143
1.5e-05,6.2e-05,5.1e-05,-0.000103,-0.000127,2.8e-05,-1.6e-05,4e-06,5e-06,-5e-05,2.1e-05,4e-06,-7.7e-05,-3.8e-05,2.7e-05,0,5.9e-05,2.6e-05,-2.1e-05,-2.3e-05,3.7e-05,8e-06,-4.1e-05,-5.8e-05,-6.5e-05,1.9e-05,3.9e-05,-7e-06,-4.6e-05,-2.3e-05,-7.7e-05,-4e-06,8e-06,2.1e-05,2.2e-05,2.1e-05,9.5e-05,-4.6e-05,0,-2.1e-05,-1.3e-05,6.9e-05,2e-06,-2e-06,-3.2e-05,3e-06,6.4e-05,-3.8e-05,4e-05,1e-05,3.1e-05,1.6e-05,1.1e-05,-4.4e-05,-0.000105,7.3e-05,5.1e-05,1.1e-05,-8.5e-05,9e-06,1.2e-05,3.1e-05,3.4e-05,7.8e-05,3.2e-05,1.2e-05,-3e-06,-5e-05,9e-06,-1.2e-05,4.3e-05,1.3e-05,-1.1e-05,3.4e-05,4.4e-05,7.4e-05,2.4e-05,-4.1e-05,6.2e-05,2.7e-05,-1.1e-05,2.1e-05,-1.8e-05,-2.4e-05,-1e-05,8.1e-05,-3e-05,-7.3e-05,4e-06,2.6e-05,2.3e-05,6.5e-05,4.3e-05,0.000103,5.6e-05,-4.1e-05,1e-06,9.5e-05,6.5e-05,1.2e-05,6.8e-05,4.6e-05,-7.3e-05,3.7e-05,-0.000114,-1.2e-05,-5.1e-05,1e-06,6e-06,4.4e-05,-1.7e-05,-6e-06,-2.9e-05,3.1e-05,-5.4e-05,0,1.2e-05,-1.3e-05,-6e-06,-1e-05,-0.000129
1.9e-05,-2.4e-05,1.4e-05,-5.1e-05,-9.5e-05,5e-06,-1.6e-05,-9e-06,-8.6e-05,-4e-05,-5.3e-05,-0.000142,-4.3e-05,-2.9e-05,-4.7e-05,5e-05,-1.4e-05,-5.8e-05,-5.7e-05,-3.8e-05,-9e-06,3e-06,-2.7e-05,-0.00015,-7.1e-05,-3.6e-05,-4.1e-05,-5e-06,-2.8e-05,-1.6e-05,9e-06,-4.3e-05,-2e-05,-5.9e-05,3.6e-05,-3.2e-05,1.2e-05,5e-05,-0.000112,-5.5e-05,6.6e-05,-2e-05,-4.2e-05,-8.3e-05,-3.1e-05,-9.3e-05,-1.2e-05,-7.4e-05,-4.9e-05,-5.1e-05,-3.1e-05,-1.9e-05,-5.2e-05,-8.5e-05,-2.6e-05,-1.8e-05,4.3e-05,-3.4e-05,-4e-06,-3.1e-05,7.4e-05,2.9e-05,-5e-06,-1e-05,-1e-05,4e-06,-3.8e-05,-2.7e-05,-4.4e-05,1.6e-05,-6.6e-05,-0.000102,-8.8e-05,6.4e-05,1.8e-05,-4.4e-05,-8.2e-05,-5e-05,-2.2e-05,3e-06,1.2e-05,-1.1e-05,1.6e-05,-1e-05,-9e-06,2.1e-05,-5.1e-05,-5.2e-05,-5e-06,-7.3e-05,1.1e-05,-2.2e-05,-2.3e-05,2e-06,-1e-06,-1.3e-05,-5.2e-05,-5.4e-05,-3.2e-05,8e-06,3e-06,-2.9e-05,1e-05,-9.5e-05,-7.3e-05,-7.6e-05,4e-06,-1e-06,1.4e-05,-7.8e-05,-3.8e-05,8e-06,0.000102,-5.4e-05,4e-06,-3.6e-05,-3.2e-05,-2.4e-05,-2e-06,-6.6e-05,-3.2e-05
-5.8e-05,-6.8e-05,-4.6e-05,2.3e-05,-6.2e-05,-6.6e-05,6e-06,-1e-04,-7.4e-05,-5.9e-05,-7.7e-05,-7.7e-05,-4.3e-05,-8.4e-05,-3.3e-05,-3.9e-05,-7.3e-05,-7.1e-05,-7.8e-05,-0.000102,-1.3e-05,-1.4e-05,-7.2e-05,-7.9e-05,-3.1e-05,-8.4e-05,-7e-05,-0.000114,-5.4e-05,-2.8e-05,2.1e-05,-7.7e-05,-5.9e-05,-5e-05,-5e-06,-4.8e-05,-2.3e-05,-9.3e-05,-7.4e-05,1.2e-05,-2.6e-05,-6.2e-05,-9.6e-05,-9.7e-05,-6.4e-05,-6.5e-05,-4.5e-05,-6.4e-05,-7.3e-05,-0.000128,-1e-05,-1.2e-05,-6.6e-05,-0.000107,-4e-06,-2.6e-05,1e-06,-3.1e-05,-3.7e-05,2.5e-05,-5.8e-05,-6.4e-05,-1.7e-05,-8.5e-05,-0.000117,-5.2e-05,-5e-05,-8.8e-05,-1e-06,-5.8e-05,-5.4e-05,-3e-05,-1.3e-05,-3.8e-05,-5.8e-05,-2.1e-05,-1.2e-05,-4.5e-05,-5e-05,-5.1e-05,4.8e-05,-6e-06,-0.000108,-3.7e-05,-4.7e-05,-1.9e-05,1.8e-05,-3.8e-05,-8.8e-05,-3.6e-05,-3.2e-05,-4.1e-05,-5.3e-05,-0.000101,-1.6e-05,-2e-06,-2.2e-05,-9.2e-05,-3.8e-05,-2.9e-05,-6.3e-05,-2.7e-05,-7.9e-05,-8.3e-05,-0.000102,-4.7e-05,-3.9e-05,-3.7e-05,1e-06,-8.3e-05,-5.1e-05,-6.7e-05,-5.6e-05,-3.6e-05,1e-05,-8.7e-05,-3e-05,-5.5e-05,-1.8e-05,-2e-06,9e-06
-5.4e-05,-6.2e-05,-9.7e-05,-5.1e-05,-5.9e-05,9e-06,-4.2e-05,-6.5e-05,-1.8e-05,-1.9e-05,-4e-05,4e-06,-4.3e-05,-8.5e-05,-1e-05,-4.7e-05,-8.7e-05,-6.7e-05,-5.8e-05,-9.2e-05,-1.6e-05,-4.8e-05,-4.8e-05,-2.3e-05,-6.5e-05,1.1e-05,-8e-06,-3e-06,-7.2e-05,-7.2e-05,-5.8e-05,-3.7e-05,-0.000106,-4.8e-05,-9.4e-05,1e-05,-4.7e-05,-3.8e-05,-7.6e-05,-4.3e-05,-8e-05,7e-06,-4.8e-05,5e-06,-1.7e-05,-3e-06,-5.9e-05,-4.3e-05,-4.5e-05,-5e-06,-1.3e-05,-1.5e-05,-7.3e-05,-3.1e-05,2.1e-05,-1.4e-05,-3.4e-05,-9.4e-05,-8.6e-05,-1e-05,-6.5e-05,-5.9e-05,-6.7e-05,-8.3e-05,-6.6e-05,-3.6e-05,-2.7e-05,-6.4e-05,-6.1e-05,2e-06,-3.7e-05,3e-06,-6.1e-05,-1.8e-05,-1.4e-05,1.2e-05,-6.5e-05,-5.5e-05,-1.5e-05,-4.7e-05,-3.2e-05,-4.5e-05,-8.1e-05,-2.1e-05,-7.4e-05,-7.1e-05,-1.7e-05,-3.6e-05,-6.7e-05,2.7e-05,1e-06,-5e-05,-4.4e-05,-4e-05,-5.4e-05,-1.1e-05,-3.2e-05,-3.3e-05,-1.3e-05,-1e-05,-4.8e-05,-2e-05,-3e-05,-6.6e-05,6e-05,-3.1e-05,-7.2e-05,-6.4e-05,-5.8e-05,-4e-06,1.9e-05,-6.4e-05,-6e-05,-5.3e-05,-5.4e-05,-4e-05,-2.3e-05,-3.2e-05,-3.8e-05,2.3e-05,-1.8e-05
3e-06,-5e-06,-3.6e-05,-7.6e-05,3e-06,-2.9e-05,-5.7e-05,-5.7e-05,-2.8e-05,-2.5e-05,-1e-06,1e-05,-3.3e-05,-9e-06,-4e-05,-2.3e-05,2.9e-05,-1.7e-05,-2.2e-05,-1.9e-05,-3.6e-05,-2.1e-05,-4.3e-05,-2e-06,-2.8e-05,-3.8e-05,7e-06,-3.6e-05,-4.1e-05,-6.1e-05,-5e-05,5e-06,-3e-06,-1.6e-05,-1.8e-05,-2.1e-05,1.7e-05,-3.8e-05,5e-06,3e-06,1.2e-05,-1.4e-05,-3.8e-05,1.5e-05,-5e-06,8e-06,4e-06,0,1.1e-05,4e-06,7e-06,-3.5e-05,-2.1e-05,4e-06,-1.7e-05,-1.3e-05,-6e-06,-3.7e-05,-4e-05,-1.9e-05,-1.4e-05,2.7e-05,-4.8e-05,-1.8e-05,1.5e-05,5e-06,-1e-05,-4.8e-05,1e-06,-2.5e-05,-9e-06,-8e-06,7e-06,-4e-06,-2.2e-05,-2.1e-05,-3e-06,-5.5e-05,2e-06,2.1e-05,-3e-06,-7e-06,-8.5e-05,-1.3e-05,4e-05,1e-05,2.5e-05,-7.5e-05,6e-06,-2.1e-05,-2.1e-05,-2.2e-05,-2.4e-05,-2.3e-05,-2e-05,-2.1e-05,-3.8e-05,-8.5e-05,-1.4e-05,-9e-06,1.3e-05,-3e-06,-7.2e-05,1.5e-05,3e-05,2.7e-05,6e-06,-8.1e-05,-6.1e-05,2.8e-05,1.7e-05,-4.5e-05,-9.9e-05,1.2e-05,1e-05,9e-06,5e-06,-2.4e-05,-2.7e-05,-5.1e-05,-5.7e-05
3.8e-05,1.4e-05,-2e-05,-2.1e-05,3.9e-05,-1.3e-05,-9e-06,2.5e-05,-5e-06,-8e-06,-1.3e-05,1.5e-05,2.2e-05,-2e-05,6e-06,2.2e-05,-3e-06,2.5e-05,3.2e-05,3.4e-05,8e-06,-1.9e-05,1.4e-05,-5e-06,4.4e-05,-9e-06,-4e-06,1.5e-05,-2.3e-05,4.1e-05,1e-06,1e-06,-5e-06,8e-06,5.9e-05,3.6e-05,2.3e-05,5e-06,-1.6e-05,1.4e-05,-3e-05,-3e-06,6.8e-05,-4e-06,-2.9e-05,4e-06,-2.5e-05,-1.5e-05,2.8e-05,5e-05,-1.2e-05,7e-06,2.2e-05,1.9e-05,3.3e-05,-3.2e-05,1e-06,2.7e-05,2.6e-05,2.8e-05,3.3e-05,1.8e-05,5e-06,0,4.9e-05,9e-06,-7e-06,-3e-06,-1e-05,2.3e-05,4.4e-05,1.1e-05,4.3e-05,-1.5e-05,1.2e-05,3.1e-05,2.3e-05,2.2e-05,4.5e-05,2.5e-05,9e-06,-1e-05,6.4e-05,2.6e-05,6e-05,-1.4e-05,-2.9e-05,1.9e-05,-1.6e-05,4.3e-05,2.6e-05,-1.5e-05,-4e-06,1.3e-05,6.2e-05,-7e-06,9e-06,-8e-06,-8e-06,6.8e-05,-1.2e-05,-1e-06,-5e-06,-9e-06,-1.3e-05,-3e-06,-5.9e-05,-2.8e-05,4e-06,5.4e-05,-5e-06,2.8e-05,6e-06,-1.3e-05,1.9e-05,-8e-06,-1e-05,3.6e-05,0,-1.5e-05,2e-06
1e-05,3.6e-05,4.2e-05,1.7e-05,7e-06,-1e-05,2.5e-05,2.7e-05,4e-06,2.2e-05,3e-06,-7e-06,2e-05,4.5e-05,4e-06,-2e-05,2.7e-05,2.5e-05,2.8e-05,3.1e-05,2.4e-05,1.1e-05,3e-06,1.8e-05,3.6e-05,8e-06,2e-06,-1.1e-05,2.6e-05,2.7e-05,3.9e-05,4.2e-05,1.5e-05,1.9e-05,2.6e-05,7e-06,-1.7e-05,3e-06,1.3e-05,6e-06,-1e-06,2.4e-05,6e-06,9e-06,1.5e-05,9e-06,-3e-06,-7e-06,-4e-06,1.5e-05,2.7e-05,1.1e-05,-1.3e-05,-1e-05,3.7e-05,9e-06,4e-06,-5e-06,3e-06,1.3e-05,4e-06,-7e-06,1.9e-05,2.7e-05,1.8e-05,2e-06,1.1e-05,1.5e-05,2.1e-05,2.6e-05,-1.2e-05,-1.4e-05,-8e-06,-5e-06,1e-05,1e-06,2e-06,1e-05,3e-05,2.8e-05,5e-05,1.2e-05,-8e-06,1e-05,5.5e-05,-1.6e-05,-1.8e-05,1.1e-05,5e-06,-1.3e-05,-1.2e-05,2.8e-05,-2e-06,3.7e-05,2.6e-05,1.6e-05,3e-05,-1.6e-05,7e-06,4.5e-05,1.1e-05,0,6e-06,2.5e-05,3.2e-05,2.5e-05,2.4e-05,-3.4e-05,1.7e-05,4.4e-05,2.4e-05,3.3e-05,-2.9e-05,1.2e-05,3.9e-05,2.4e-05,9e-06,-1.8e-05,8e-06,0,1.5e-05
-2.9e-05,1e-06,-1.5e-05,7e-06,-2.4e-05,-6e-06,1.8e-05,1.1e-05,-1e-06,4e-06,0,-2.4e-05,-3e-06,1.9e-05,-2.1e-05,-3e-06,2e-06,-6e-06,0,1e-06,-1.1e-05,-1.4e-05,-5e-06,-2.1e-05,-4e-06,1.3e-05,-1.4e-05,-1.5e-05,1.1e-05,-1e-05,-2e-06,0,-2.7e-05,-1e-05,1e-06,-1.5e-05,-2e-05,-3e-05,-2.9e-05,3e-06,-2.3e-05,-1.7e-05,-1.1e-05,-2.6e-05,2.7e-05,-6e-06,-8e-06,-3e-06,-1.5e-05,8e-06,-1.5e-05,-8e-06,-2e-06,-1.2e-05,-3e-06,1.9e-05,-6e-06,5e-06,-3.3e-05,-1.3e-05,-2e-06,4e-06,-2.2e-05,7e-06,-1e-06,-1e-06,-1.9e-05,-5e-06,-2.1e-05,2.4e-05,-4e-06,1e-06,-1e-05,-1.9e-05,-1.5e-05,-7e-06,7e-06,-1.2e-05,-1.4e-05,2e-05,-8e-06,-2.2e-05,-1.9e-05,-8e-06,-2.3e-05,-2.3e-05,-7e-06,3e-06,7e-06,1.2e-05,6e-06,-4e-06,-3e-06,4e-06,9e-06,-7e-06,-2.2e-05,4e-06,-7e-06,-9e-06,-1.2e-05,-1.8e-05,1e-05,2e-06,-1.1e-05,-1.6e-05,-1e-06,9e-06,-2.7e-05,-1.3e-05,-8e-06,-2e-06,2e-06,-3e-05,-5e-06,-3e-06,-6e-06,-1.1e-05,1.3e-05,-9e-06,-2.3e-05
1.3e-05,0,8e-06,2.2e-05,-3e-06,-8e-06,5e-06,7e-06,1.8e-05,0,1.8e-05,1.2e-05,-1e-06,1.1e-05,1.1e-05,9e-06,1e-06,-6e-06,5e-06,1e-06,-3e-06,4e-06,-4e-06,1e-05,-8e-06,-2e-06,9e-06,2e-05,7e-06,5e-06,2e-05,-3e-05,6e-06,1.4e-05,1e-05,1e-06,2.2e-05,5e-06,0,-2.2e-05,3.3e-05,7e-06,2e-06,1.7e-05,2.7e-05,1e-06,1.9e-05,4e-06,2.4e-05,1.2e-05,5e-06,-1e-06,-1e-06,8e-06,4e-06,1.3e-05,3e-06,7e-06,2e-06,0,2.4e-05,-2.3e-05,-1e-05,1.2e-05,5e-06,1e-06,1.3e-05,-3e-06,1.3e-05,1e-06,1.2e-05,4e-06,-4e-06,1e-05,-1.5e-05,1e-06,-9e-06,-1.3e-05,1.9e-05,-4e-06,-5e-06,1e-06,4e-06,1e-06,1.2e-05,3e-06,8e-06,1e-06,2.4e-05,3e-05,2e-06,-2.2e-05,-2e-06,8e-06,-2e-06,1.5e-05,-1e-06,-5e-06,4e-06,-7e-06,1.6e-05,9e-06,-2e-06,1e-05,4.2e-05,5e-06,7e-06,-1.1e-05,1.8e-05,-1e-05,5e-06,0,-2e-06,1.3e-05,-6e-06,3e-06,7e-06,1.1e-05,1.5e-05,2.4e-05,-9e-06
0,3e-06,1.4e-05,-1.9e-05,1.6e-05,8e-06,-1e-06,-1.4e-05,1e-05,-5e-06,-8e-06,-3e-06,2e-06,-2.3e-05,0,5e-06,-1.7e-05,1.8e-05,-7e-06,9e-06,-1e-06,1.1e-05,-8e-06,3e-06,-9e-06,1.2e-05,-5e-06,-7e-06,7e-06,-4e-06,-2e-06,1e-06,3e-06,-8e-06,2.6e-05,3e-06,-7e-06,-1.1e-05,-7e-06,-2.1e-05,-1e-05,6e-06,-5e-06,-2e-06,1.6e-05,5e-06,1.1e-05,0,-1.1e-05,-3e-06,-1.9e-05,-1e-06,-2e-06,0,-1.9e-05,-1e-06,8e-06,-6e-06,1.1e-05,6e-06,-3e-06,3e-06,8e-06,-8e-06,4e-06,9e-06,-4e-06,1e-06,-7e-06,5e-06,-1.1e-05,9e-06,-2e-06,-1e-05,-6e-06,2e-06,-2e-06,0,-2.2e-05,7e-06,-1.1e-05,-2e-06,-2e-06,-1e-06,-1.8e-05,-6e-06,1e-06,-2.9e-05,3e-06,8e-06,2e-06,0,-5e-06,-1e-05,-6e-06,-5e-06,1e-06,4e-06,-2e-06,-7e-06,-1.3e-05,-1e-06,-1.6e-05,-1e-06,1.1e-05,-1e-06,-2e-06,7e-06,1.1e-05,1.1e-05,-7e-06,1e-06,-5e-06,-6e-06,5e-06,-1.9e-05,-5e-06,6e-06,3e-06,1e-06,2e-06
-2e-06,-3e-06,-2e-06,8e-06,1.3e-05,1.2e-05,1.3e-05,-2e-06,-1e-06,-1e-06,1.5e-05,1.2e-05,3e-06,3e-06,2e-06,0,8e-06,-1.2e-05,3e-06,-1e-06,-1.1e-05,1e-06,1.3e-05,7e-06,6e-06,1.8e-05,1.2e-05,3e-06,-3e-06,1.3e-05,2e-06,4e-06,-2e-06,2e-06,1.5e-05,-5e-06,-2e-06,4e-06,4e-06,2e-06,1.7e-05,3e-06,-1.2e-05,1e-05,-1e-06,0,7e-06,0,1e-06,2e-06,9e-06,1.1e-05,-1e-06,5e-06,-1e-06,1.5e-05,-4e-06,-4e-06,1.8e-05,-1e-06,-8e-06,6e-06,-2e-06,-5e-06,4e-06,-4e-06,5e-06,1e-06,3e-06,1e-05,5e-06,-5e-06,1e-06,1.1e-05,-1e-06,-2e-06,4e-06,4e-06,-1.6e-05,-1e-06,-2e-06,5e-06,-1.1e-05,-1e-06,2e-06,2.3e-05,-1e-06,0,4e-06,3e-06,3e-06,1.5e-05,-1e-06,-1.2e-05,1.6e-05,-6e-06,2e-06,4e-06,0,9e-06,1.2e-05,-3e-06,2e-06,1.6e-05,-4e-06,-1e-06,3e-06,6e-06,1e-06,1.2e-05,4e-06,-1e-06,1.8e-05,2.2e-05,1e-05,1.6e-05,3e-06,-1.1e-05,1e-06,8e-06,9e-06
-4e-06,-7e-06,7e-06,2e-06,4e-06,-6e-06,-3e-06,-8e-06,-7e-06,6e-06,-7e-06,9e-06,-1e-06,1e-05,1e-05,-3e-06,3e-06,9e-06,-2e-06,-5e-06,3e-06,-2e-06,1e-06,-4e-06,2e-06,-1e-05,6e-06,-2e-06,5e-06,2e-06,-5e-06,1e-06,-1e-06,-7e-06,-7e-06,-4e-06,0,1e-06,-2e-06,-1e-06,3e-06,-2e-06,2e-06,-6e-06,-1e-06,7e-06,-5e-06,-1e-06,3e-06,8e-06,-2e-06,-4e-06,-1e-06,1e-06,1.9e-05,4e-06,-2e-06,-1.6e-05,6e-06,2e-06,-5e-06,3e-06,-1e-06,-5e-06,1.1e-05,-5e-06,-2e-06,-3e-06,-4e-06,-4e-06,4e-06,-2e-06,0,2e-06,1e-06,6e-06,-4e-06,-4e-06,3e-06,-1.1e-05,9e-06,-3e-06,-1e-06,0,-1e-06,1.3e-05,-5e-06,-4e-06,9e-06,1e-06,-2e-06,-1.1e-05,0,-1.1e-05,2e-06,-4e-06,3e-06,-1e-06,-4e-06,-3e-06,1e-06,3e-06,-6e-06,6e-06,-1e-06,5e-06,3e-06,2e-06,-7e-06,8e-06,-4e-06,-1.1e-05,4e-06,0,0,-4e-06,-3e-06,3e-06,1e-05,0,-1e-06
6e-06,5e-06,-7e-06,2e-06,0,1e-06,-7e-06,1e-05,-2e-06,-5e-06,1e-06,-3e-06,1e-06,-3e-06,-2e-06,2e-06,2e-06,-2e-06,3e-06,2e-06,0,1e-06,6e-06,2e-06,1e-06,-9e-06,3e-06,-3e-06,-6e-06,-1e-05,-2e-06,1.3e-05,2e-06,0,-1e-06,2e-06,7e-06,-1e-06,-4e-06,-1e-06,2e-06,6e-06,9e-06,-3e-06,4e-06,-5e-06,-2e-06,-1e-06,-1e-06,1.1e-05,8e-06,2e-06,4e-06,2e-06,-3e-06,-1e-05,0,0,-7e-06,-1e-06,-1e-06,6e-06,-1e-06,-1e-06,1.5e-05,2e-06,1e-06,-2e-06,2e-06,6e-06,-5e-06,0,-2e-06,-3e-06,3e-06,-1e-06,3e-06,-6e-06,2e-06,5e-06,-1.1e-05,2e-06,5e-06,0,8e-06,-1e-05,1e-06,5e-06,-1e-06,-7e-06,0,-1e-06,-2e-06,-1e-06,-1.1e-05,0,-2e-06,-8e-06,1e-06,-2e-06,-9e-06,0,1e-06,5e-06,-1.1e-05,-3e-06,-6e-06,-6e-06,1e-06,-1e-06,3e-06,0,1e-06,7e-06,0,-1.2e-05,1e-06,3e-06,-2e-06,-1e-06,-1e-05
0,5e-06,-3e-06,-2e-06,0,1e-06,-1e-06,5e-06,1e-06,-1e-06,-4e-06,-5e-06,4e-06,0,-7e-06,-1e-06,1e-06,1e-06,5e-06,7e-06,1e-06,0,-3e-06,-1e-06,8e-06,-2e-06,-7e-06,3e-06,2e-06,8e-06,2e-06,2e-06,-3e-06,3e-06,5e-06,-3e-06,-2e-06,0,-3e-06,2e-06,-2e-06,0,0,0,2e-06,2e-06,-4e-06,1e-06,-2e-06,3e-06,0,-1e-06,0,-4e-06,-4e-06,-1e-06,3e-06,5e-06,1e-06,1e-06,0,-3e-06,-5e-06,0,3e-06,2e-06,2e-06,0,-2e-06,2e-06,-3e-06,1e-06,3e-06,0,5e-06,0,3e-06,-2e-06,-7e-06,1e-06,4e-06,0,2e-06,0,1.3e-05,0,1e-06,-2e-06,-3e-06,-5e-06,-1e-06,5e-06,-2e-06,4e-06,5e-06,3e-06,-2e-06,-1e-06,-2e-06,5e-06,-7e-06,-4e-06,-5e-06,1e-06,5e-06,2e-06,-8e-06,-7e-06,-2e-06,2e-06,0,6e-06,-6e-06,-4e-06,3e-06,3e-06,-1e-06,0,-3e-06,-3e-06,-2e-06
-4e-06,2e-06,0,-4e-06,0,-5e-06,2e-06,8e-06,3e-06,2e-06,0,-3e-06,0,7e-06,1e-06,-3e-06,6e-06,0,1e-06,4e-06,1e-06,1e-06,0,1e-06,6e-06,-1e-06,-1e-06,-1e-06,0,5e-06,0,-3e-06,1e-06,0,0,2e-06,-5e-06,-3e-06,-5e-06,-4e-06,-6e-06,-3e-06,2e-06,-2e-06,6e-06,-6e-06,-4e-06,-1e-06,0,4e-06,1e-06,0,-3e-06,-1e-06,-4e-06,-4e-06,-3e-06,2e-06,2e-06,1e-06,-2e-06,1e-06,3e-06,3e-06,-2e-06,0,-1e-06,1e-06,2e-06,6e-06,-2e-06,-1e-06,-4e-06,-2e-06,-2e-06,1e-06,-4e-06,3e-06,-1e-06,0,1e-06,0,2e-06,1e-06,-4e-06,-4e-06,1e-06,3e-06,3e-06,3e-06,1e-06,-1e-06,0,4e-06,0,-2e-06,3e-06,-3e-06,1e-06,-2e-06,-1e-06,2e-06,3e-06,2e-06,8e-06,-4e-06,5e-06,-1e-05,2e-06,-5e-06,-1e-06,3e-06,-4e-06,2e-06,5e-06,-4e-06,1e-06,1e-06,-1e-06,1e-06,2e-06
-2e-06,2e-06,-2e-06,2e-06,1e-06,-2e-06,1e-06,1e-06,5e-06,-1e-06,0,-2e-06,-1e-06,4e-06,-5e-06,0,-4e-06,3e-06,-1e-06,1e-06,4e-06,-1e-06,-1e-06,2e-06,-2e-06,0,0,0,6e-06,-1e-06,-1e-06,-5e-06,-4e-06,1e-06,-5e-06,-3e-06,4e-06,1e-06,-1e-06,0,2e-06,3e-06,-5e-06,3e-06,5e-06,1e-06,3e-06,0,1e-06,-1e-06,-2e-06,2e-06,1e-06,2e-06,1e-06,-3e-06,1e-06,4e-06,-3e-06,0,4e-06,-2e-06,-2e-06,2e-06,-1e-06,0,-1e-06,0,-2e-06,0,-2e-06,3e-06,-2e-06,0,-3e-06,-1e-06,2e-06,-2e-06,-1e-06,3e-06,5e-06,-1e-06,-8e-06,-1e-06,-7e-06,-6e-06,0,-2e-06,5e-06,-3e-06,-1e-06,-3e-06,-2e-06,3e-06,-7e-06,1e-06,-1e-06,-2e-06,-1e-06,-6e-06,-1e-06,-1e-06,0,1e-06,1e-06,2e-06,0,-4e-06,-5e-06,-2e-06,-1e-06,0,-5e-06,-3e-06,-2e-06,0,-1e-06,-5e-06,1e-06,0,1e-06
3e-06,-1e-06,6e-06,5e-06,3e-06,3e-06,2e-06,-4e-06,1e-06,1e-06,0,6e-06,1e-06,-1e-06,-1e-06,2e-06,-3e-06,-3e-06,0,0,-6e-06,0,-1e-06,1e-06,-6e-06,7e-06,1e-06,2e-06,0,3e-06,1e-06,-4e-06,2e-06,1e-06,0,-1e-06,3e-06,-4e-06,-3e-06,-2e-06,-3e-06,0,1e-06,2e-06,2e-06,1e-06,4e-06,1e-06,0,-1e-06,0,-2e-06,-1e-06,3e-06,0,0,0,0,-2e-06,-1e-06,2e-06,-3e-06,-2e-06,-1e-06,-1e-06,3e-06,2e-06,-1e-06,1e-06,4e-06,0,-2e-06,0,-4e-06,-5e-06,-1e-06,-1e-06,-3e-06,-5e-06,-4e-06,-4e-06,0,3e-06,0,-3e-06,-5e-06,-1e-06,-3e-06,3e-06,4e-06,1e-06,2e-06,-1e-06,0,-3e-06,-2e-06,-2e-06,2e-06,1e-06,-7e-06,-2e-06,0,0,2e-06,-4e-06,-2e-06,4e-06,-2e-06,-1e-06,0,0,-2e-06,-1e-06,5e-06,-4e-06,-2e-06,1e-06,5e-06,3e-06,-2e-06,-5e-06
0,-3e-06,0,-1e-06,4e-06,-1e-06,-1e-06,-4e-06,-1e-06,0,1e-06,4e-06,0,-4e-06,4e-06,0,1e-06,2e-06,0,0,1e-06,2e-06,2e-06,0,0,1e-06,3e-06,-1e-06,2e-06,-1e-06,1e-06,1e-06,-1e-06,-1e-06,5e-06,0,-5e-06,3e-06,1e-06,-3e-06,1e-06,-2e-06,-2e-06,0,3e-06,1e-06,3e-06,-1e-06,0,0,-2e-06,1e-06,1e-06,1e-06,0,2e-06,1e-06,-3e-06,6e-06,2e-06,0,4e-06,1e-06,-1e-06,0,-1e-06,-2e-06,0,-1e-06,-3e-06,-1e-06,0,0,2e-06,-2e-06,1e-06,-2e-06,-2e-06,-4e-06,-2e-06,-4e-06,0,1e-06,0,-3e-06,1e-06,0,-3e-06,4e-06,-1e-06,0,-1e-06,-1e-06,-5e-06,-2e-06,3e-06,1e-06,0,-1e-06,-1e-06,1e-06,1e-06,-3e-06,4e-06,-4e-06,2e-06,-2e-06,-1e-06,5e-06,1e-06,0,0,-2e-06,1e-06,1e-06,-1e-06,-1e-06,-1e-06,3e-06,3e-06,-3e-06
-3e-06,0,4e-06,-2e-06,0,-1e-06,1e-06,-4e-06,-1e-06,-1e-06,0,-1e-06,0,1e-06,-1e-06,0,2e-06,-2e-06,0,-1e-06,1e-06,0,-1e-06,0,5e-06,-1e-06,1e-06,1e-06,-1e-06,3e-06,-2e-06,3e-06,1e-06,-1e-06,0,0,1e-06,-2e-06,-3e-06,2e-06,0,2e-06,0,-3e-06,3e-06,1e-06,1e-06,1e-06,-1e-06,2e-06,1e-06,0,-1e-06,0,-5e-06,-1e-06,-2e-06,-2e-06,4e-06,-1e-06,-3e-06,0,0,-1e-06,5e-06,-2e-06,2e-06,0,0,1e-06,0,0,-1e-06,-1e-06,-1e-06,-1e-06,3e-06,1e-06,-1e-06,-2e-06,2e-06,0,-3e-06,0,1e-06,0,1e-06,-5e-06,2e-06,-2e-06,0,0,-1e-06,-5e-06,2e-06,-2e-06,1e-06,0,0,1e-06,1e-06,-1e-06,-2e-06,1e-06,-2e-06,-2e-06,-1e-06,4e-06,0,-1e-06,0,-1e-06,3e-06,4e-06,3e-06,0,1e-06,-3e-06,1e-06,-1e-06,2e-06
0,0,0,0,-1e-06,2e-06,1e-06,3e-06,1e-06,1e-06,0,-2e-06,1e-06,0,1e-06,0,-1e-06,1e-06,1e-06,0,-2e-06,0,2e-06,0,5e-06,0,-2e-06,-1e-06,1e-06,3e-06,0,5e-06,-1e-06,-1e-06,-4e-06,-1e-06,2e-06,0,-1e-06,0,2e-06,0,2e-06,-1e-06,0,-3e-06,0,0,2e-06,3e-06,1e-06,1e-06,1e-06,-1e-06,1e-06,0,1e-06,-4e-06,-2e-06,1e-06,0,0,-1e-06,-2e-06,5e-06,0,-1e-06,-1e-06,0,-1e-06,0,1e-06,0,1e-06,1e-06,0,-1e-06,-1e-06,1e-06,-2e-06,3e-06,0,0,0,2e-06,0,0,4e-06,2e-06,-2e-06,0,2e-06,-1e-06,-1e-06,2e-06,0,0,0,0,0,-2e-06,0,1e-06,1e-06,4e-06,2e-06,1e-06,-1e-06,-4e-06,1e-06,0,-1e-06,4e-06,0,-1e-06,-2e-06,-1e-06,1e-06,0,1e-06,0
2e-06,1e-06,-3e-06,1e-06,0,0,-1e-06,2e-06,0,0,-1e-06,-3e-06,0,2e-06,2e-06,1e-06,1e-06,-1e-06,1e-06,2e-06,2e-06,-1e-06,-2e-06,1e-06,1e-06,-1e-06,-1e-06,0,0,-3e-06,0,0,0,1e-06,-2e-06,1e-06,-1e-06,1e-06,-4e-06,-1e-06,1e-06,-1e-06,1e-06,1e-06,-1e-06,1e-06,-2e-06,-1e-06,-1e-06,1e-06,1e-06,0,0,-1e-06,5e-06,0,0,0,-3e-06,-1e-06,0,1e-06,0,0,0,1e-06,0,0,0,-1e-06,-2e-06,0,-1e-06,0,1e-06,0,0,-2e-06,1e-06,3e-06,0,0,2e-06,0,2e-06,1e-06,0,-1e-06,-2e-06,-1e-06,0,0,0,-1e-06,-3e-06,-1e-06,0,0,0,0,-1e-06,1e-06,-1e-06,0,2e-06,-1e-06,-2e-06,1e-06,2e-06,-4e-06,0,1e-06,0,1e-06,-3e-06,0,0,4e-06,-1e-06,0,-2e-06
-1e-06,2e-06,-1e-06,1e-06,1e-06,-2e-06,-1e-06,5e-06,1e-06,0,0,-1e-06,0,2e-06,-3e-06,-1e-06,2e-06,1e-06,1e-06,3e-06,0,1e-06,1e-06,1e-06,0,-3e-06,0,0,0,2e-06,0,-3e-06,-1e-06,0,0,0,-1e-06,-2e-06,-1e-06,0,-1e-06,1e-06,0,1e-06,1e-06,-2e-06,-2e-06,0,-1e-06,0,-1e-06,-1e-06,0,0,-4e-06,-1e-06,0,3e-06,2e-06,1e-06,-1e-06,-2e-06,0,1e-06,-3e-06,0,1e-06,0,0,0,-1e-06,1e-06,0,1e-06,0,-1e-06,1e-06,-1e-06,-2e-06,1e-06,-2e-06,0,0,0,0,1e-06,0,2e-06,1e-06,-2e-06,0,-2e-06,-1e-06,1e-06,0,0,0,-2e-06,0,-1e-06,0,-1e-06,1e-06,1e-06,-2e-06,0,1e-06,-3e-06,1e-06,0,0,2e-06,2e-06,-1e-06,0,-1e-06,0,-4e-06,-2e-06,-1e-06,-3e-06
-2e-06,1e-06,-2e-06,-1e-06,1e-06,2e-06,0,0,1e-06,0,0,3e-06,0,-1e-06,0,-1e-06,-2e-06,-1e-06,0,1e-06,0,0,-1e-06,0,1e-06,0,0,0,1e-06,3e-06,0,-1e-06,0,1e-06,-1e-06,-1e-06,0,2e-06,-2e-06,-2e-06,1e-06,0,-2e-06,1e-06,0,2e-06,-1e-06,0,1e-06,-2e-06,1e-06,1e-06,0,1e-06,-1e-06,-1e-06,-1e-06,1e-06,3e-06,-1e-06,0,1e-06,0,0,-2e-06,0,-1e-06,0,0,-2e-06,0,-1e-06,-1e-06,0,-1e-06,0,-2e-06,0,0,1e-06,1e-06,0,0,0,-3e-06,-1e-06,0,-2e-06,1e-06,1e-06,0,2e-06,0,2e-06,2e-06,1e-06,0,1e-06,0,1e-06,-1e-06,0,-2e-06,-1e-06,-2e-06,-1e-06,-1e-06,-3e-06,-1e-06,0,1e-06,1e-06,-2e-06,1e-06,2e-06,-1e-06,0,1e-06,-1e-06,0,0
0,-1e-06,1e-06,-2e-06,1e-06,0,0,-1e-06,0,0,0,2e-06,0,0,1e-06,1e-06,-1e-06,0,-1e-06,-1e-06,0,0,0,0,0,2e-06,1e-06,1e-06,0,0,0,-2e-06,-1e-06,0,-2e-06,1e-06,1e-06,-2e-06,0,0,-1e-06,-1e-06,1e-06,0,0,-1e-06,1e-06,0,0,-1e-06,-2e-06,-1e-06,0,1e-06,-1e-06,0,0,2e-06,-1e-06,1e-06,1e-06,-1e-06,0,0,-1e-06,0,1e-06,0,0,0,-1e-06,0,0,-1e-06,-2e-06,0,1e-06,0,1e-06,0,2e-06,0,0,0,-3e-06,0,0,-2e-06,1e-06,0,0,0,-1e-06,1e-06,-2e-06,0,1e-06,-2e-06,0,-1e-06,-1e-06,1e-06,1e-06,1e-06,-3e-06,1e-06,0,-4e-06,-1e-06,0,-1e-06,-1e-06,-1e-06,1e-06,-1e-06,0,0,1e-06,0,0,1e-06
1e-06,0,1e-06,2e-06,0,-2e-06,0,-3e-06,0,0,0,0,0,-1e-06,-2e-06,0,1e-06,0,0,-1e-06,1e-06,0,1e-06,0,0,-1e-06,1e-06,-1e-06,1e-06,2e-06,1e-06,1e-06,0,0,0,-1e-06,-1e-06,1e-06,-2e-06,0,0,1e-06,-1e-06,-1e-06,1e-06,1e-06,1e-06,0,-1e-06,-1e-06,0,1e-06,0,0,1e-06,0,0,0,-2e-06,-1e-06,1e-06,0,0,0,0,0,0,0,-1e-06,-3e-06,0,0,0,1e-06,-1e-06,0,0,-1e-06,-2e-06,-2e-06,0,0,0,0,0,-1e-06,0,-1e-06,1e-06,0,0,-2e-06,0,-1e-06,0,0,0,0,0,0,0,-1e-06,-1e-06,0,4e-06,0,1e-06,-1e-06,0,0,0,0,-2e-06,1e-06,-2e-06,-1e-06,0,0,1e-06,0,-1e-06
-1e-06,-1e-06,2e-06,1e-06,0,2e-06,0,-2e-06,0,0,0,-1e-06,0,0,1e-06,0,1e-06,0,0,-1e-06,-2e-06,0,0,0,1e-06,1e-06,-1e-06,1e-06,-1e-06,0,0,4e-06,0,0,2e-06,0,-1e-06,-1e-06,-1e-06,-1e-06,0,0,1e-06,0,0,-1e-06,1e-06,0,1e-06,0,0,0,0,-1e-06,3e-06,0,0,-2e-06,1e-06,1e-06,-1e-06,1e-06,0,0,2e-06,-1e-06,0,0,1e-06,0,0,0,0,-1e-06,0,0,-1e-06,-1e-06,0,0,-2e-06,0,1e-06,0,1e-06,-1e-06,0,-1e-06,1e-06,1e-06,0,1e-06,0,-2e-06,1e-06,-1e-06,-1e-06,0,0,2e-06,1e-06,0,0,1e-06,1e-06,0,-1e-06,-2e-06,1e-06,1e-06,0,0,-1e-06,0,0,-1e-06,0,0,1e-06,0,-2e-06
0,-1e-06,2e-06,0,0,0,0,1e-06,0,0,0,-3e-06,0,-1e-06,1e-06,0,-1e-06,0,0,0,2e-06,0,1e-06,0,3e-06,1e-06,-1e-06,0,1e-06,0,0,1e-06,0,-1e-06,0,0,1e-06,0,-2e-06,1e-06,0,-1e-06,0,0,-1e-06,-1e-06,1e-06,0,0,1e-06,0,0,0,0,-2e-06,0,0,-1e-06,2e-06,-1e-06,0,-1e-06,0,-1e-06,2e-06,-1e-06,0,0,-1e-06,-2e-06,-1e-06,0,-1e-06,0,0,0,1e-06,0,2e-06,0,0,0,-1e-06,0,1e-06,-1e-06,0,0,0,-1e-06,0,1e-06,0,-1e-06,1e-06,0,1e-06,0,0,1e-06,-1e-06,0,-1e-06,0,1e-06,0,0,1e-06,0,-1e-06,0,0,0,0,2e-06,-1e-06,0,-1e-06,1e-06,0,-1e-06
1e-06,1e-06,-1e-06,-1e-06,0,-1e-06,0,1e-06,0,0,0,0,0,1e-06,-1e-06,0,1e-06,0,0,1e-06,-1e-06,0,-1e-06,0,2e-06,0,-1e-06,0,-1e-06,2e-06,1e-06,-1e-06,0,0,-1e-06,0,1e-06,0,-1e-06,0,1e-06,1e-06,0,1e-06,0,0,0,0,-1e-06,0,0,0,0,0,-2e-06,0,0,-2e-06,-1e-06,0,0,0,0,0,-1e-06,0,-1e-06,0,1e-06,0,0,0,0,0,0,0,0,0,-1e-06,0,1e-06,0,0,0,2e-06,0,0,-1e-06,0,0,0,-2e-06,0,-1e-06,1e-06,0,0,0,0,1e-06,1e-06,0,0,0,-1e-06,0,-1e-06,0,-1e-06,0,0,0,1e-06,1e-06,0,-1e-06,0,1e-06,0,0,1e-06
0,1e-06,0,0,1e-06,0,0,3e-06,0,0,0,2e-06,0,1e-06,1e-06,0,0,0,0,1e-06,0,0,1e-06,0,-1e-06,-1e-06,1e-06,1e-06,1e-06,-1e-06,-1e-06,-2e-06,0,0,0,0,-1e-06,-1e-06,-1e-06,-1e-06,-1e-06,0,0,0,0,0,-1e-06,0,0,-1e-06,0,0,0,1e-06,1e-06,0,0,0,-2e-06,-1e-06,-1e-06,0,0,0,-2e-06,0,0,0,-1e-06,-2e-06,0,0,0,0,0,0,0,-1e-06,-1e-06,2e-06,2e-06,0,1e-06,0,-1e-06,0,0,1e-06,-1e-06,0,0,1e-06,0,0,-1e-06,0,0,0,0,-1e-06,-1e-06,0,1e-06,0,-4e-06,0,0,1e-06,1e-06,0,0,0,1e-06,0,-2e-06,0,0,1e-06,0,0,-1e-06
-1e-06,0,-1e-06,1e-06,0,1e-06,0,-1e-06,0,0,0,2e-06,0,0,0,0,0,0,0,1e-06,1e-06,0,-1e-06,0,-1e-06,0,1e-06,0,0,0,0,-2e-06,0,0,0,0,0,1e-06,-1e-06,0,1e-06,-1e-06,-1e-06,0,-1e-06,0,-1e-06,0,0,-1e-06,0,0,0,1e-06,2e-06,0,0,2e-06,1e-06,1e-06,0,0,0,0,-1e-06,0,0,0,1e-06,0,0,0,0,0,-1e-06,0,1e-06,0,1e-06,0,-2e-06,0,0,0,0,0,0,-1e-06,0,0,0,1e-06,0,1e-06,-1e-06,0,0,0,0,0,0,0,-1e-06,0,3e-06,0,0,0,1e-06,0,0,0,1e-06,1e-06,0,-1e-06,0,-2e-06,-1e-06,0,-2e-06
0,0,-1e-06,1e-06,0,-1e-06,0,0,0,0,0,1e-06,0,-1e-06,-1e-06,0,-1e-06,0,0,0,0,0,0,0,1e-06,-1e-06,0,0,0,2e-06,0,0,0,0,0,0,1e-06,-1e-06,-1e-06,-1e-06,-1e-06,0,0,-1e-06,0,0,-1e-06,0,0,-1e-06,0,0,0,0,0,0,0,0,2e-06,-1e-06,0,0,0,0,0,0,0,0,-1e-06,-1e-06,0,0,0,0,-1e-06,0,-1e-06,0,0,0,-1e-06,0,-1e-06,0,-1e-06,0,0,0,0,0,0,-1e-06,0,1e-06,1e-06,0,0,0,0,1e-06,-1e-06,0,0,0,1e-06,1e-06,-1e-06,-1e-06,-1e-06,0,0,0,0,0,1e-06,0,0,0,-1e-06,0,-1e-06
1e-06,0,0,-1e-06,0,0,0,-3e-06,0,0,0,-1e-06,0,0,1e-06,0,1e-06,-1e-06,0,-1e-06,-1e-06,0,0,0,1e-06,0,-1e-06,0,0,-1e-06,1e-06,2e-06,0,0,-1e-06,0,0,1e-06,-1e-06,0,1e-06,0,0,0,0,0,0,0,0,0,0,0,0,0,0,0,0,1e-06,-1e-06,1e-06,1e-06,0,0,0,1e-06,0,0,0,1e-06,0,0,0,0,0,-1e-06,0,0,0,-1e-06,-1e-06,0,0,0,0,0,0,0,-2e-06,0,1e-06,0,0,0,0,-1e-06,0,0,0,0,0,1e-06,0,-1e-06,0,1e-06,0,1e-06,-1e-06,-1e-06,1e-06,0,0,-1e-06,1e-06,0,0,0,2e-06,0,0,0
0,-1e-06,0,0,0,2e-06,0,-1e-06,0,0,0,-2e-06,0,-1e-06,-1e-06,0,-1e-06,1e-06,0,0,1e-06,0,0,0,1e-06,1e-06,-1e-06,0,0,1e-06,-1e-06,2e-06,0,0,0,0,0,-1e-06,-1e-06,0,-1e-06,-1e-06,0,0,-1e-06,0,0,0,0,0,0,0,0,0,-1e-06,0,0,0,-2e-06,-1e-06,0,0,0,0,1e-06,0,0,0,-1e-06,0,0,0,0,0,0,0,0,0,0,-1e-06,2e-06,0,0,0,1e-06,0,0,0,0,0,0,1e-06,0,0,0,0,0,0,0,0,-1e-06,0,0,0,-1e-06,0,0,-2e-06,1e-06,-1e-06,0,0,0,-1e-06,-1e-06,-1e-06,0,-2e-06,0,0,0
-1e-06,0,1e-06,1e-06,0,-2e-06,0,0,0,0,0,-1e-06,0,1e-06,0,0,0,-1e-06,0,0,0,0,0,0,1e-06,0,0,0,0,1e-06,0,1e-06,0,0,1e-06,0,0,1e-06,-1e-06,0,0,0,0,0,0,0,1e-06,0,0,0,0,0,0,0,1e-06,0,0,-1e-06,0,1e-06,0,0,0,0,1e-06,0,0,0,1e-06,0,0,0,0,0,0,0,-1e-06,0,0,0,-1e-06,0,0,0,1e-06,-1e-06,0,0,0,0,0,-1e-06,0,-1e-06,1e-06,0,0,0,0,0,0,0,0,0,-3e-06,0,0,-1e-06,0,0,0,0,-1e-06,1e-06,0,0,0,0,1e-06,0,-1e-06
0,1e-06,1e-06,0,0,0,0,1e-06,0,0,0,1e-06,0,0,1e-06,0,0,1e-06,0,0,-1e-06,0,0,0,1e-06,0,1e-06,0,0,-1e-06,0,-2e-06,0,0,0,0,0,0,-1e-06,0,0,0,0,0,0,0,1e-06,0,0,0,0,0,0,0,2e-06,0,0,0,2e-06,0,0,0,0,0,-1e-06,0,0,0,-1e-06,1e-06,0,0,0,0,0,0,1e-06,0,0,0,-1e-06,0,0,0,0,0,0,0,0,0,0,0,0,-1e-06,0,0,0,0,0,0,-1e-06,0,0,0,1e-06,0,0,-1e-06,-1e-06,0,0,0,0,-1e-06,1e-06,-1e-06,0,1e-06,1e-06,0,-1e-06
0,0,1e-06,0,0,1e-06,0,2e-06,0,0,0,2e-06,0,1e-06,-1e-06,0,1e-06,-1e-06,0,1e-06,1e-06,0,0,0,0,0,1e-06,0,0,2e-06,0,-1e-06,0,0,0,0,0,0,-1e-06,0,0,-1e-06,0,0,-1e-06,0,0,0,0,0,0,0,0,1e-06,-2e-06,0,0,-1e-06,0,1e-06,0,0,0,0,-2e-06,0,0,0,1e-06,0,0,0,0,0,0,0,0,0,0,1e-06,1e-06,0,0,0,0,0,0,1e-06,0,0,0,1e-06,0,0,0,0,0,0,0,0,1e-06,0,0,0,1e-06,0,0,0,0,0,0,0,0,1e-06,0,0,0,0,0,0,0
0,0,0,-1e-06,0,-1e-06,0,0,0,0,0,1e-06,0,0,0,0,-1e-06,1e-06,0,0,-1e-06,0,0,0,0,0,0,0,0,0,0,-1e-06,0,0,0,0,0,1e-06,-1e-06,0,0,0,0,0,0,0,0,0,0,0,0,0,0,0,-1e-06,0,0,0,-2e-06,-1e-06,0,0,0,0,0,0,0,0,-1e-06,1e-06,0,0,0,0,0,0,0,0,0,0,1e-06,0,0,0,0,0,0,-1e-06,0,0,0,-1e-06,0,0,-1e-06,0,0,0,0,-1e-06,-1e-06,0,0,0,1e-06,1e-06,0,-1e-06,1e-06,0,0,0,0,-1e-06,-1e-06,0,0,-1e-06,0,0,0
0,0,-1e-06,0,0,0,0,0,0,0,0,-1e-06,0,0,1e-06,0,0,-1e-06,0,0,0,0,0,0,1e-06,0,0,0,0,-1e-06,0,1e-06,0,0,0,0,0,-1e-06,-2e-06,0,0,0,0,0,0,0,0,0,0,0,0,0,0,0,1e-06,0,0,1e-06,0,1e-06,0,0,0,0,1e-06,0,0,0,1e-06,0,0,0,0,0,-1e-06,0,0,0,0,-1e-06,0,0,0,0,0,0,0,0,0,0,0,-1e-06,0,0,0,0,0,0,0,0,0,0,0,0,0,0,0,0,0,1e-06,0,0,1e-06,1e-06,0,-1e-06,0,0,0,0,0
