0.046008,0.041154,0.0415,0.047133,0.052713,0.052524,0.049346,0.046187,0.044455,0.04307,0.045945,0.044911,0.042058,0.042847,0.039313,0.035279,0.037659,0.042861,0.043944,0.042194,0.038632,0.036245,0.037881,0.04558,0.053874,0.055945,0.051698,0.047432
0.060758,0.054909,0.055046,0.061892,0.069771,0.069056,0.062935,0.059258,0.057162,0.05477,0.058078,0.055797,0.051836,0.053454,0.048796,0.043067,0.046875,0.054328,0.056702,0.056425,0.052836,0.049577,0.051502,0.062036,0.073611,0.076209,0.068338,0.060445
0.092638,0.083949,0.082583,0.091879,0.105968,0.103477,0.089001,0.084829,0.083426,0.079082,0.082958,0.077561,0.070835,0.074364,0.068126,0.059259,0.065441,0.077748,0.082824,0.085682,0.082717,0.078203,0.081978,0.099094,0.117253,0.120341,0.104423,0.087726
0.130728,0.118107,0.113967,0.126615,0.15036,0.144802,0.117142,0.114045,0.116293,0.109583,0.113992,0.104619,0.094004,0.09927,0.091717,0.080056,0.088119,0.105193,0.112284,0.119186,0.119111,0.113542,0.120276,0.145405,0.170585,0.174316,0.150859,0.122927
0.159628,0.145624,0.14009,0.156079,0.188288,0.182343,0.145637,0.1441,0.151142,0.141646,0.145536,0.137006,0.12717,0.132001,0.122752,0.109397,0.114621,0.133267,0.141865,0.151281,0.153783,0.146571,0.154961,0.183217,0.210219,0.215891,0.200558,0.169871
0.174515,0.163886,0.163218,0.182881,0.219973,0.225231,0.194302,0.191207,0.19915,0.182879,0.178875,0.186127,0.197216,0.196659,0.183668,0.170213,0.160193,0.174362,0.187394,0.19372,0.190204,0.181263,0.19436,0.211377,0.224937,0.23744,0.264656,0.257644
0.215999,0.211741,0.226807,0.254694,0.299095,0.323029,0.300859,0.29377,0.301401,0.275231,0.259066,0.291931,0.335769,0.320722,0.298191,0.287019,0.263432,0.273286,0.288944,0.293635,0.276579,0.260005,0.283585,0.279966,0.274003,0.303788,0.39355,0.425404
0.324019,0.335787,0.371339,0.419277,0.47956,0.500972,0.47234,0.467747,0.487428,0.462175,0.433682,0.476238,0.540852,0.508079,0.473753,0.466918,0.436683,0.446374,0.467437,0.474002,0.440503,0.414283,0.452607,0.43838,0.430906,0.479894,0.610546,0.662376
0.492605,0.541927,0.583544,0.659396,0.738809,0.722133,0.678989,0.694191,0.744683,0.737686,0.698882,0.727615,0.790623,0.728758,0.674054,0.675732,0.649917,0.675103,0.717769,0.716758,0.651353,0.618118,0.683726,0.67588,0.669646,0.726269,0.86024,0.896298
0.704369,0.826378,0.833118,0.9482,1.053779,0.959035,0.905274,0.978575,1.084158,1.094264,1.038805,1.027439,1.066118,0.967273,0.876673,0.87996,0.870606,0.93831,1.036854,1.028551,0.905119,0.841711,0.937116,0.955483,0.932499,0.982986,1.083831,1.056657
0.92665,1.144875,1.088193,1.241496,1.36157,1.185147,1.1441,1.289222,1.456572,1.474912,1.404398,1.340941,1.361632,1.23901,1.089681,1.082738,1.093883,1.217166,1.38625,1.376,1.180282,1.058535,1.187536,1.238614,1.160137,1.208182,1.261583,1.127242
1.058806,1.350693,1.246271,1.419463,1.535562,1.311814,1.288839,1.473051,1.676125,1.697518,1.626635,1.540661,1.563098,1.420644,1.218748,1.204134,1.234196,1.413586,1.612131,1.579883,1.347118,1.190757,1.343097,1.392719,1.232983,1.300807,1.363704,1.138802
0.977314,1.267393,1.140362,1.27804,1.376323,1.181893,1.176987,1.337841,1.524933,1.551798,1.497517,1.428582,1.447209,1.295951,1.09594,1.090608,1.135178,1.321906,1.476838,1.422326,1.231861,1.106266,1.247963,1.259753,1.057247,1.130992,1.205457,0.983541
0.69984,0.902423,0.800627,0.856247,0.931895,0.843601,0.840219,0.914438,1.029611,1.05583,1.037802,1.022331,1.02211,0.885713,0.741748,0.75394,0.824332,0.950534,1.000894,0.948516,0.84004,0.784237,0.887275,0.863815,0.718753,0.773824,0.814723,0.678048
0.449039,0.50942,0.487603,0.515514,0.578505,0.618902,0.666526,0.672525,0.626471,0.57493,0.603297,0.650252,0.660758,0.587615,0.522213,0.503575,0.519392,0.570299,0.595888,0.573656,0.490266,0.478565,0.532532,0.520623,0.54653,0.585329,0.543726,0.531911
0.483361,0.435517,0.47143,0.579921,0.662991,0.76419,0.881196,0.885518,0.708549,0.590598,0.68728,0.798195,0.792841,0.700058,0.690377,0.6166,0.526806,0.563154,0.646026,0.591572,0.452166,0.477534,0.509528,0.534983,0.701975,0.738202,0.655869,0.728644
0.665582,0.567153,0.62984,0.815712,0.952998,1.142419,1.307331,1.272762,1.051555,0.913795,1.011745,1.135846,1.126049,1.039769,1.042176,0.890057,0.768952,0.820433,0.908084,0.787036,0.572886,0.623513,0.678891,0.75603,1.009538,1.048522,0.950003,1.048547
0.824361,0.697636,0.775196,1.004282,1.184449,1.493791,1.691455,1.572661,1.391095,1.286197,1.307632,1.379161,1.408774,1.427298,1.418454,1.1552,1.051665,1.120072,1.185,0.994037,0.699502,0.757141,0.825965,0.936589,1.23122,1.301924,1.270746,1.344515
0.950478,0.830075,0.895733,1.107793,1.261728,1.66248,1.904439,1.685975,1.605817,1.59795,1.498199,1.42824,1.564286,1.789693,1.697462,1.331293,1.28278,1.339564,1.355698,1.149189,0.825311,0.847449,0.928184,1.036395,1.273268,1.450849,1.607462,1.565423
1.055842,0.960122,1.055993,1.244994,1.243429,1.631519,2.0177,1.790815,1.719818,1.776201,1.621813,1.392003,1.626016,2.048991,1.788908,1.334576,1.34785,1.38765,1.376718,1.225463,0.926411,0.902777,1.024338,1.130358,1.245721,1.506651,1.866139,1.72625
1.164399,1.06283,1.143335,1.312533,1.194325,1.522761,1.99,1.804813,1.648374,1.686552,1.63032,1.411723,1.634658,2.10641,1.753022,1.232436,1.29569,1.297737,1.201272,1.129974,0.960377,0.947191,1.064172,1.198137,1.30272,1.496364,1.84345,1.73652
1.233717,1.090163,1.037553,1.16948,1.074019,1.254066,1.589893,1.516664,1.352677,1.340362,1.373678,1.257398,1.396418,1.767153,1.476673,1.032777,1.15807,1.137887,0.939951,0.887827,0.858436,0.896568,0.962029,1.062683,1.199177,1.298819,1.496948,1.448712
1.177654,0.986555,0.78658,0.831694,0.824316,0.862574,0.994251,1.033677,0.97842,0.942219,0.930062,0.881884,0.964523,1.184668,1.0767,0.845495,0.913802,0.884817,0.735921,0.66881,0.653796,0.689764,0.720076,0.769762,0.922545,0.991904,1.077828,1.076219
1.000341,0.809978,0.60434,0.579034,0.60463,0.575559,0.61956,0.745778,0.757916,0.641583,0.546295,0.536331,0.609023,0.726059,0.749375,0.676067,0.64119,0.625419,0.62496,0.568061,0.454991,0.451034,0.521696,0.582355,0.699156,0.725292,0.728218,0.773502
0.885484,0.770899,0.649855,0.53038,0.475704,0.51758,0.594662,0.683748,0.684853,0.545819,0.461711,0.508741,0.576406,0.562683,0.579423,0.595085,0.550921,0.540154,0.610514,0.569667,0.37462,0.329313,0.450498,0.588065,0.712092,0.674753,0.577004,0.63276
0.977034,0.834241,0.74295,0.559331,0.474745,0.639494,0.708913,0.740181,0.712303,0.548652,0.542299,0.69534,0.744262,0.629875,0.62548,0.686811,0.694299,0.634642,0.638926,0.61094,0.404974,0.308943,0.474331,0.782883,0.990433,0.827503,0.585092,0.641693
1.170003,0.922089,0.783575,0.584095,0.520038,0.77238,0.755085,0.717239,0.684281,0.548736,0.645708,0.900405,0.971006,0.786674,0.692666,0.742923,0.848521,0.768382,0.686533,0.685013,0.494535,0.342775,0.5529,1.055474,1.325804,1.021522,0.683891,0.698346
1.201017,0.985212,0.808354,0.613174,0.584487,0.814904,0.719423,0.631961,0.626021,0.565819,0.694542,0.963744,1.055909,0.826156,0.62144,0.665855,0.901783,0.851326,0.746526,0.75827,0.550605,0.357204,0.587802,1.208242,1.503766,1.118556,0.752227,0.718959
0.967039,0.887543,0.731179,0.579391,0.565747,0.732199,0.663342,0.559262,0.560368,0.554374,0.674152,0.846204,0.890752,0.677853,0.442529,0.532213,0.823419,0.789085,0.738632,0.766611,0.5383,0.346266,0.533595,1.087786,1.370343,1.040415,0.710742,0.642777
0.61081,0.647371,0.591279,0.505564,0.45075,0.546614,0.559138,0.516189,0.503105,0.455479,0.551938,0.601171,0.565225,0.433187,0.289917,0.396116,0.595182,0.579626,0.626483,0.678969,0.485794,0.347569,0.415284,0.728637,0.965468,0.795127,0.532056,0.492452
0.416627,0.460895,0.501655,0.446072,0.324424,0.354097,0.4112,0.448346,0.430038,0.341414,0.391314,0.389299,0.323081,0.285578,0.252601,0.275448,0.324255,0.349347,0.451867,0.485271,0.3638,0.309319,0.277704,0.360831,0.540021,0.521951,0.332043,0.327143
0.307338,0.326084,0.370821,0.348021,0.240667,0.240821,0.29711,0.336322,0.321403,0.247876,0.245007,0.240155,0.222145,0.247153,0.253539,0.201194,0.184549,0.219904,0.303094,0.311309,0.243485,0.238716,0.181593,0.189348,0.304635,0.337899,0.24206,0.226152
0.236228,0.225735,0.23917,0.232548,0.182252,0.199403,0.240806,0.220829,0.20829,0.170905,0.141687,0.148841,0.15684,0.219827,0.234425,0.163288,0.154324,0.176261,0.213436,0.208558,0.171571,0.167807,0.134728,0.144351,0.222736,0.294437,0.254711,0.190364
0.200149,0.163989,0.171485,0.173338,0.152974,0.163621,0.193844,0.16944,0.152905,0.116117,0.089152,0.122379,0.135292,0.175874,0.177525,0.110635,0.122118,0.145848,0.152344,0.144564,0.115755,0.09671,0.100427,0.137038,0.19534,0.268497,0.237864,0.173537
0.167554,0.140951,0.142123,0.147149,0.138664,0.122771,0.140207,0.161847,0.175643,0.123381,0.08595,0.128283,0.133784,0.124881,0.110851,0.069887,0.096635,0.116185,0.096166,0.093902,0.075423,0.059458,0.08292,0.118369,0.147176,0.200335,0.178932,0.143781
0.139567,0.144504,0.143204,0.13377,0.11501,0.080939,0.086064,0.151839,0.210213,0.157367,0.105888,0.139506,0.131397,0.082243,0.06167,0.0529,0.076669,0.091967,0.071607,0.067005,0.057007,0.055003,0.078931,0.093317,0.114833,0.135479,0.119095,0.107711
0.104799,0.142347,0.15412,0.127969,0.092154,0.053451,0.065387,0.147223,0.221881,0.181698,0.118644,0.132548,0.119641,0.060305,0.044045,0.049084,0.057733,0.085221,0.083658,0.068203,0.052843,0.063015,0.07652,0.077019,0.106136,0.092254,0.068471,0.069615
0.083618,0.130171,0.145756,0.122831,0.08425,0.045808,0.057137,0.124406,0.191656,0.173792,0.110175,0.110828,0.101691,0.055672,0.049944,0.055313,0.062031,0.094071,0.102016,0.08695,0.062438,0.080822,0.084038,0.066928,0.095956,0.075049,0.042905,0.054194
0.064601,0.103914,0.112344,0.099562,0.071773,0.043233,0.046308,0.084095,0.132124,0.133937,0.088239,0.104384,0.099709,0.060976,0.056786,0.059182,0.074319,0.097823,0.106338,0.098824,0.075832,0.102687,0.100102,0.067382,0.08081,0.064361,0.043328,0.062635
0.050768,0.073068,0.071642,0.065244,0.051483,0.043081,0.043151,0.053067,0.076589,0.088783,0.070506,0.098257,0.09746,0.062662,0.058309,0.054674,0.079839,0.086496,0.091527,0.093422,0.082854,0.117564,0.112134,0.068796,0.059738,0.054016,0.052945,0.070663
