-0.000908,-0.000989,-0.0013,-0.001665,-0.001733,-0.001381,-0.000921,-0.000416,-0.001078,-0.000845,-0.000413,-0.000883,-0.00073,-0.000498,-0.000899,-0.000448,-0.00068,-0.000593,-0.000873,-0.001253,-0.000774,-0.000747,-0.000169,-0.000476,-0.000717,-0.000699,-0.000958,-0.000765,-0.000531,-0.000535,-0.001305,-0.000733,-0.000617,-0.000939,-0.000841,-0.001043,-0.001169,-0.001083,-0.000845,-0.000899,-0.001029,-0.000875,-0.001114,-0.001063,-0.001262,-0.001057,-0.001252,-0.000801,-0.000596,-0.000624,-0.001065,-0.001063,-0.001703,-0.002095,-0.001587,-0.001381,-0.000817,-0.001251,-0.001637,-0.000631,-0.001165,-0.000985,-0.001406,-0.001525,-0.001053,-0.000938,-0.000976,-0.001139,-0.001346,-0.00129,-0.000711,-0.000989,-0.000643,-0.000834,-0.001577,-0.000891,-0.001283,-0.00089,-0.001387,-0.000979,-0.001732,-0.00138,-0.001496,-0.000735,-0.001135,-0.001324,-0.001358,-0.000898,-0.001056,-0.001165,-0.000884,-0.000457,-0.000996,-0.000704,-0.000657,-0.001396,-0.001134,-0.001131,-0.001282,-0.000932,-0.000954,-0.001174,-0.001531,-0.001575,-0.001115,-0.00113,-0.001439,-0.000903,-0.001513,-0.002087,-0.001427,-0.000861,-0.001183,-0.000764,-0.00083,-0.000574,-0.001583,-0.001291,-0.000831,-0.000686,-0.00125
0.000178,0.000522,0.000738,0.000905,0.000882,0.000786,0.000718,0.000333,0.000783,0.000349,0.00021,0.000654,0.000281,0.000249,0.000496,0.000107,0.000415,5.9e-05,0.000239,0.000535,0.000358,-2.4e-05,-9e-05,7.8e-05,0.00018,0.00025,0.000179,0.000282,0.000148,5.5e-05,0.000246,4e-06,0.00011,0.000552,-7.7e-05,0.000632,0.000961,0.000547,0.000375,0.000532,0.000852,0.000793,0.000581,0.000206,0.000669,0.000414,0.000723,0.000282,0.000641,0.000261,0.00015,0.000548,0.000786,0.000626,0.00089,0.000598,0.00028,0.000591,0.000522,0.000159,0.000219,3.5e-05,0.000593,0.000823,0.000686,0.000484,0.000138,0.000222,0.000769,0.000644,0.000162,0.000409,-0.000294,0.000374,0.000785,0.000109,0.000497,0.000626,0.001003,0.000399,0.000498,0.000577,0.000657,0.000292,0.000568,0.00042,0.000863,0.000451,0.000905,0.000617,0.000326,5.8e-05,7e-04,0.000428,-8.6e-05,0.000823,0.00067,0.000316,0.000836,0.000455,-4.6e-05,0.000409,0.001057,0.00064,0.000806,0.000506,0.000375,0.000446,0.00055,0.001444,0.000986,0.000315,0.000561,0.000434,0.000425,0.000168,0.000842,0.000673,0.000658,0.000382,0.00069
-0.000124,-0.000259,-0.000319,-0.000562,-0.000815,-0.000789,-0.000316,-9.2e-05,-0.000362,-0.00038,0.000136,-0.000334,-0.000346,-0.000131,-0.000375,-0.000313,-0.000219,4.1e-05,-0.000132,-8e-05,-3.6e-05,0.000144,-0.000226,-0.000467,-0.00047,-0.000282,7e-05,-4e-06,-9.8e-05,8e-06,-0.000109,-2e-04,-5.2e-05,-0.000319,0.000267,-0.000273,-0.000212,-0.000349,-3.9e-05,-0.000367,-0.000406,-0.00053,-0.000391,0.000535,-0.000282,-0.000176,-0.00061,-0.00017,-0.000438,-0.000511,-7.8e-05,1.5e-05,-0.000115,8e-06,-0.000452,-0.00017,2.7e-05,-0.000298,0.000125,-0.000114,3.3e-05,0.000145,-0.000446,-0.000649,-0.000339,-0.000149,-4.3e-05,-2.9e-05,-0.000371,-0.000209,4.4e-05,-0.000457,4.2e-05,-0.000321,-0.000266,-0.000109,-0.00019,-0.000278,-0.000732,-0.00031,-0.00019,-0.000141,-0.000353,-7.7e-05,-0.000357,0.000108,-0.000372,-9.1e-05,-0.000317,-0.00034,-0.000496,-0.000212,-0.000437,-0.000336,-0.000315,-0.000576,6e-06,8e-06,-0.000438,-0.000194,0.000338,-7e-06,-0.000571,-0.000385,-0.000375,-0.000156,0.000183,5e-05,-0.000167,-0.000661,-0.000502,-4.8e-05,-0.00032,-0.000319,-0.00031,-0.000242,-0.000652,-0.000515,-0.00045,-0.000294,-0.000446
-5.1e-05,0.000132,3.8e-05,0.000248,0.000419,0.000628,5.9e-05,9.4e-05,6.9e-05,0.000178,-0.000101,3.4e-05,0.000271,8.9e-05,0.000205,0.00011,4.6e-05,-0.000202,-0.000136,-0.000237,-6.1e-05,-5.2e-05,-2e-04,-0.000192,0.000447,0.000205,-0.000153,-0.000172,-7.6e-05,-8e-05,2.3e-05,-0.000176,-0.000166,-7e-05,-6e-05,-0.00011,9.3e-05,5.3e-05,7.7e-05,0.000128,-0.000109,0.000513,0.000115,-0.000328,-0.000168,-0.000192,0.000112,0.000144,0.000222,0.000317,-8.4e-05,-0.000464,-0.000283,-0.000127,0.000262,-9.7e-05,-0.00029,9.9e-05,-0.000289,-2.5e-05,-0.000245,-0.000366,0.00023,0.000484,-4e-05,-0.000126,-0.000326,-0.000104,0.000131,-0.000176,-0.00015,5e-05,-0.000247,0.000293,-0.000117,0.000118,0.00014,0.000148,9.7e-05,5.1e-05,-0.000209,0.000226,-0.000185,-0.000359,1.9e-05,-0.000362,0.000216,2e-06,-1.5e-05,0.000105,8e-05,0.000328,0.000175,-3e-06,0.000133,3.6e-05,-0.000295,-9.3e-05,0.000286,2.5e-05,-0.000329,-0.000355,0.000237,-0.000159,9.7e-05,-7.2e-05,-0.000373,-0.000324,0.00016,5.9e-05,2.7e-05,3.1e-05,0.000159,0.000336,-1e-05,0.000113,3e-04,0.000466,0.000219,-0.000103,0.000237
0.000129,-0.000244,3.6e-05,-2e-05,-0.000298,-0.000434,0.000134,-0.000261,-0.000243,-9.3e-05,0.000141,-3.8e-05,-0.00031,-0.000202,-2e-05,-0.000121,-0.000209,0.000172,0.000113,0.000174,-1.7e-05,-0.000133,6.6e-05,5.9e-05,-0.000207,-0.000116,-9e-05,7e-05,8.1e-05,0.000102,-5.6e-05,0.000218,6.3e-05,6e-05,-0.000126,-0.000225,8e-05,-0.000374,-0.000158,-0.00014,0.00027,-0.000324,8.7e-05,-4e-05,5.4e-05,0.00026,-0.00023,-0.00025,-0.000304,-5.1e-05,0.000179,0.000424,0.000357,0.000202,-0.000536,0.00017,0.000215,1.3e-05,-0.000127,-6.9e-05,4.2e-05,-6.7e-05,-0.000116,-0.000334,-0.000203,6.4e-05,0.000274,-0.000102,-0.000262,0.000118,9e-06,9.4e-05,0.000198,0.00011,-8.1e-05,5.2e-05,-8.3e-05,4.2e-05,-8.8e-05,-0.000236,0.000227,-0.000362,0.000283,0.000193,-7.2e-05,0.000318,-0.000182,0.00017,4.7e-05,-0.000175,-0.000213,-0.000277,-0.000138,-0.000179,2.7e-05,9.4e-05,0.000246,-4.9e-05,-0.000245,0.000377,0.000387,0.000219,-0.000323,0.000208,-0.000147,-0.000382,0.000129,0.000153,-0.000116,0.000245,-0.000222,-0.00014,2.1e-05,-0.000281,0.00021,-0.00019,-0.000159,-0.000266,-0.000198,0.000172,-9.2e-05
-8.8e-05,0.000123,0.000107,0.000206,0.00037,0.000293,-0.000124,7.7e-05,0.000139,0.000155,-8.3e-05,-0.000223,0.000131,0.000217,-0.000173,6.6e-05,3.4e-05,-1.1e-05,-3.7e-05,-0.000112,6.9e-05,-0.000122,-5.8e-05,0.00026,7e-05,3.7e-05,3.3e-05,2.1e-05,0.000128,6.9e-05,0.000104,-4.8e-05,-0.000139,-0.000113,0.000309,0.000434,-7.2e-05,0.000167,0.000158,4.3e-05,-0.000318,3.7e-05,-0.000118,-0.000126,0.00013,-0.000227,1.8e-05,0.000365,0.000268,0.000171,6e-06,-0.000165,-0.000316,-3e-04,0.000312,-3e-04,-7.6e-05,-5.6e-05,0.000261,0.000151,6.5e-05,0.000319,0.000252,7.3e-05,-2.2e-05,-0.000225,-6.5e-05,0.000136,4.6e-05,5e-06,-4.9e-05,-0.000123,0.000104,-6.7e-05,0.000141,-9.2e-05,-6e-06,-2.7e-05,-4.4e-05,0.000229,-0.000281,0.000485,-0.000243,-0.000375,7e-05,-0.000286,6e-06,-0.000234,-9.4e-05,0.000134,0.000397,0.000212,0.000127,7e-05,4.3e-05,8.1e-05,-0.000112,5e-05,9.1e-05,-0.000129,8e-06,1e-05,-1.9e-05,-0.000254,0.000127,0.000131,7.7e-05,0.000126,0.000172,-5.1e-05,0.000284,0.00023,2.3e-05,0.00022,-9.4e-05,0.000179,-4.4e-05,7.4e-05,4.7e-05,-0.000153,1.1e-05
0.000199,-5.5e-05,-0.000245,-0.000445,-0.000239,-0.000191,0.000218,-4.2e-05,1.5e-05,-0.000251,0.00012,0.000192,-9e-06,-0.000157,6.4e-05,3e-05,0.000105,3.9e-05,6.4e-05,9e-05,-9e-06,4.3e-05,6.3e-05,5.4e-05,-0.000105,-2e-04,0.000103,5.3e-05,-0.00017,3.7e-05,0.000112,-3.7e-05,0.000161,-7.6e-05,-0.000123,-0.000315,-0.000252,-0.000148,-3e-04,0.000114,0.000108,-0.000176,-8e-06,-7.5e-05,-0.000134,0.000267,0.00024,-0.000368,-3.6e-05,-5.3e-05,-0.000125,5.5e-05,5.9e-05,0.000364,0.000105,0.000215,2.3e-05,4.8e-05,-0.00027,-9.7e-05,8.3e-05,-0.000146,-1.5e-05,-4.9e-05,-1.8e-05,9.6e-05,-2.7e-05,6.6e-05,9.7e-05,0.000148,-7.8e-05,0.000235,-0.000401,-0.000192,-5.5e-05,-1.4e-05,-4.9e-05,-0.000261,0.000158,-0.000322,-8.8e-05,-0.000353,8.3e-05,0.000184,0.000134,0.000184,0.000201,8.2e-05,7.3e-05,1e-06,-0.000313,-0.00015,-0.000103,0.000184,1.5e-05,-0.000232,-0.000161,-0.000259,-0.000156,-0.000135,-0.000362,9.8e-05,-7.2e-05,0.000253,8e-05,9.9e-05,-0.000232,6.7e-05,-0.000245,-0.000221,-0.000307,-0.00014,-4.1e-05,-0.00014,0.000187,-7.4e-05,-5.2e-05,-1.1e-05,0.000252,0.000305,8.5e-05
-0.000126,-2e-05,0.000218,0.000366,0.000106,1.4e-05,-0.000311,1.2e-05,0.000152,8.2e-05,-0.000124,-0.000163,3.3e-05,1.8e-05,-9.4e-05,6.9e-05,-1.5e-05,0,-1.5e-05,-8.9e-05,-9.3e-05,1.7e-05,2.8e-05,-9.4e-05,4.1e-05,0.000226,-6.6e-05,-3.4e-05,9.2e-05,-7.4e-05,-0.000223,-1.3e-05,-0.000103,1.5e-05,-3.6e-05,0.000252,0.00021,0.000233,0.000147,-0.000137,-8.6e-05,0.000127,-8.9e-05,6.9e-05,0.000226,-4.4e-05,-0.000222,0.000443,-3.3e-05,-0.000107,0.000122,-1e-05,0.000164,-0.000282,-0.000343,-0.000209,-2.6e-05,2.2e-05,0.000174,8.6e-05,-0.000124,-0.000169,-0.000207,0.000162,0.000218,5e-06,3.9e-05,-2.8e-05,-1.6e-05,-0.000291,-8e-06,-6.2e-05,0.00017,-7e-05,-6.2e-05,-5e-05,6.9e-05,0.000235,0.000123,0.000102,0.000159,0.000129,-9e-06,-1.3e-05,-1.9e-05,-6.4e-05,-0.000285,-0.000173,4.1e-05,3.7e-05,0.00015,1.4e-05,1.6e-05,-0.000241,-0.000196,0.000195,0.000143,8.9e-05,0.000204,9.5e-05,0.000123,2.7e-05,4.5e-05,-0.000112,-1.2e-05,-0.000144,0.00015,-0.000115,2.2e-05,9.3e-05,0.000189,0.000133,-7e-05,-8e-05,-0.000106,5e-05,0.000234,-1.6e-05,-0.000415,-0.000232,-5.4e-05
2.8e-05,-4.2e-05,-0.000244,-0.00026,-0.000143,1.1e-05,0.000199,-4.1e-05,-7.7e-05,-7.3e-05,6e-06,5.7e-05,-5.8e-05,5e-06,0.000134,-0.000125,-4.4e-05,6.6e-05,1e-04,0.000122,6.6e-05,-7e-06,5.4e-05,0.000108,0.000114,-1.5e-05,3.4e-05,3.9e-05,-0.000109,-3e-06,0.000148,4e-05,0,7.1e-05,2.1e-05,-6e-05,-9.4e-05,-0.000226,-6.2e-05,0.000184,0.000175,2.6e-05,4.6e-05,3.7e-05,-0.000139,-0.000225,2e-04,-0.000217,-0.000156,-1e-05,-7.5e-05,0,-0.000126,0.000144,0.000117,0.000205,-4.9e-05,-0.000139,-3.9e-05,-8e-06,0.000139,0.000158,6.4e-05,-0.000193,-0.000243,2.6e-05,-0.00012,-1e-04,-0.000143,0.000154,0.000152,2.4e-05,6.3e-05,-0.000147,0.000157,0.000134,-1e-05,-5.5e-05,-0.000186,1.8e-05,-7.6e-05,-7.3e-05,9.7e-05,4.8e-05,-1.9e-05,7.7e-05,0.000298,0.00013,-4.5e-05,4e-06,-8.4e-05,0.000126,7.3e-05,0.000248,0.000158,-0.000109,-0.00024,1.2e-05,-0.000158,-0.000151,-4.6e-05,-7.3e-05,-9.6e-05,3e-05,-4e-06,0.000181,1.9e-05,3.2e-05,4.8e-05,6.4e-05,-7.1e-05,-0.000198,3e-06,5.1e-05,4.8e-05,-7.9e-05,-0.000151,-5e-05,0.000262,8.5e-05,-2e-06
-9.9e-05,-3.3e-05,0.000123,7.4e-05,0.000204,3.2e-05,-0.000129,-8e-06,4.8e-05,9.9e-05,-5.7e-05,1.6e-05,7.1e-05,3.5e-05,-5.4e-05,0.00017,3.4e-05,-0.000122,-7.8e-05,-7.4e-05,-2.1e-05,4.6e-05,4e-06,-0.000176,-1.8e-05,1e-06,-0.000129,-4.2e-05,0,1.7e-05,-7.8e-05,-8.5e-05,0.000222,0.000101,-4.8e-05,-2e-05,0.000164,0.000184,-0.000198,-0.000126,-7.5e-05,-3.5e-05,-0.000114,-9.2e-05,-3.1e-05,0.000159,-0.000164,-4.5e-05,4.4e-05,1.9e-05,0.000111,0,0.000169,-0.000111,5.8e-05,7e-06,5e-06,0.000153,9.2e-05,3.5e-05,-0.000213,-0.00012,-1e-05,0.000107,9.8e-05,5e-05,-3.7e-05,0,0.00015,-5e-05,-0.000174,-5.4e-05,4.8e-05,0.000233,7.9e-05,2.1e-05,-5.6e-05,-4.4e-05,0.000151,1.3e-05,3.9e-05,-7.5e-05,-0.000201,-2.8e-05,-5.2e-05,-4.7e-05,-0.000198,-0.000134,8.7e-05,-8e-06,7.3e-05,2.2e-05,-4.8e-05,-0.000182,-3.5e-05,4.8e-05,0.000208,5.8e-05,9e-06,4e-05,5.2e-05,-8.2e-05,1e-04,7.3e-05,1.1e-05,-0.000279,2.8e-05,7.2e-05,-3.2e-05,1.8e-05,-9.6e-05,1e-06,0.000136,-1.6e-05,-8.7e-05,-3.5e-05,9.3e-05,0.000103,-0.000257,-1e-06,2.3e-05
0.000194,0.000103,-2.7e-05,-4e-05,-0.000125,-2e-06,9.8e-05,9e-06,-7.5e-05,8e-06,8.1e-05,-8.1e-05,-8.7e-05,7.3e-05,5e-06,-3.1e-05,-4e-05,-1e-06,-1e-06,-5.2e-05,-2.7e-05,-7e-06,-1.2e-05,0.000122,-5e-06,1.4e-05,0.000123,2.7e-05,5.3e-05,3.8e-05,2.5e-05,1e-05,-0.000325,-4.6e-05,-4.9e-05,1e-06,-8.4e-05,-6.7e-05,0.000193,6.3e-05,-1.5e-05,2.4e-05,7.7e-05,6.7e-05,-1e-06,-5.6e-05,1.7e-05,-2.5e-05,-0.000131,-7e-06,-0.000107,-2e-06,-3.7e-05,0.000109,-4.5e-05,-8.7e-05,9.8e-05,-6.2e-05,-4.7e-05,-1.4e-05,0.000236,3.3e-05,-4.1e-05,-5.9e-05,5.4e-05,9.7e-05,5.6e-05,6.8e-05,-9.2e-05,-6e-06,0.000132,4.7e-05,-7.4e-05,-4.9e-05,-4.6e-05,-0.000104,0.000142,1.3e-05,-7e-05,8.9e-05,-0.000124,4.6e-05,0.000281,4.8e-05,-1.4e-05,-2.5e-05,9.8e-05,0.000101,-0.000116,-6e-06,-3.1e-05,8e-06,7e-06,4.5e-05,0.00011,-1.5e-05,-2.7e-05,-8e-06,1.6e-05,-1e-05,-5e-05,3.9e-05,5.5e-05,-6.1e-05,-0.000137,0.000158,0.000143,-7.7e-05,3e-06,-8.6e-05,5.2e-05,6.7e-05,-0.000179,-1.6e-05,0.00017,0.000129,-7.6e-05,-9.6e-05,0.000163,-2e-06,-0.000121
-0.000212,-6.7e-05,1.1e-05,2.3e-05,5.1e-05,1.1e-05,-7.3e-05,2.3e-05,5.8e-05,-1e-06,-6.2e-05,5.6e-05,8.7e-05,-8.2e-05,-3.7e-05,-4.3e-05,6e-05,1.7e-05,-6e-06,9.7e-05,5.5e-05,5.4e-05,1e-06,-4.3e-05,-6.1e-05,-1.4e-05,-6.4e-05,-1e-05,-3.2e-05,-3.8e-05,7.9e-05,3.7e-05,0.000248,-4.7e-05,3e-06,9.8e-05,7.5e-05,4.9e-05,-5.1e-05,-6.7e-05,5.7e-05,3.5e-05,1.2e-05,-4.8e-05,5e-06,-5e-06,8.1e-05,8.2e-05,9.5e-05,-1.9e-05,0.000113,-5.6e-05,1.9e-05,-8.8e-05,3e-06,8e-05,-5.8e-05,2.1e-05,-6.4e-05,3.5e-05,-0.000149,0.00014,-1.1e-05,0.000127,1.6e-05,-0.000132,4.2e-05,-2.4e-05,3e-05,1.5e-05,-0.000137,-4.9e-05,6.9e-05,-2.7e-05,-7.6e-05,9.1e-05,-0.000142,3.6e-05,4.6e-05,-6e-05,0.000193,-5.4e-05,-0.000252,-1.4e-05,-5.5e-05,-7e-06,3e-06,-1e-06,5.5e-05,3.1e-05,-4.6e-05,-7e-06,-4e-05,7.6e-05,-4.3e-05,3.4e-05,4e-06,2e-05,5e-05,6.8e-05,-2.4e-05,4.8e-05,-5.2e-05,1.6e-05,6.5e-05,-0.000114,4e-06,0.000107,4e-06,6.4e-05,2.1e-05,-5.7e-05,0.000117,-1.5e-05,-0.000165,-4.1e-05,-3e-06,3.3e-05,-0.000117,7e-06,0.00015
7.6e-05,5.7e-05,-3.3e-05,-2.5e-05,4e-06,-3e-05,-3e-06,-1.3e-05,-5e-06,-3.5e-05,0,-8e-06,-5e-05,3.1e-05,3.9e-05,-1e-05,-8.7e-05,4e-06,-4.3e-05,-5.9e-05,-4.6e-05,-0.000132,-2.1e-05,-7.4e-05,-4.1e-05,6e-05,-1.1e-05,-2e-06,2.8e-05,2.4e-05,-2.8e-05,-3.3e-05,-7.3e-05,1.5e-05,-1e-06,-1e-06,-0.00012,-8e-05,0.000106,2.2e-05,-5.4e-05,-2.8e-05,9e-06,0.000135,-1.8e-05,6.2e-05,-6.7e-05,-1.8e-05,-3.9e-05,1.6e-05,-0.000135,3.7e-05,-3.6e-05,4.2e-05,2.1e-05,-8.1e-05,4.6e-05,-3.7e-05,0.000127,-9.2e-05,3.8e-05,-8.2e-05,1e-06,-5.7e-05,-0.000156,4.2e-05,6e-06,-6.4e-05,3.4e-05,0,5.2e-05,-3.9e-05,-6.1e-05,4.8e-05,-2.7e-05,-1.6e-05,6e-05,-5.8e-05,-5.7e-05,-1.2e-05,-0.000137,-3e-06,0.000237,-1.3e-05,-4.1e-05,1e-06,-7.4e-05,1.6e-05,-6.7e-05,-1e-05,5.2e-05,-0.000127,6.7e-05,-3.7e-05,1.3e-05,-2.3e-05,-2.5e-05,-7.3e-05,2.9e-05,-2.7e-05,5.3e-05,-2.2e-05,1.9e-05,3.3e-05,-1e-05,0.000128,-4.8e-05,-9.2e-05,-5.2e-05,-0.000119,8e-06,-6e-06,-0.000109,7e-06,3.3e-05,7.1e-05,3.6e-05,5e-06,8e-05,-1.9e-05,-4.8e-05
4.9e-05,-2.7e-05,7e-06,1.7e-05,5e-06,3.4e-05,6.4e-05,7e-06,-5.2e-05,-2.8e-05,-2.6e-05,5.7e-05,1.6e-05,-4.8e-05,-1.7e-05,-2.1e-05,5.9e-05,-2e-05,7e-06,-3e-06,1.8e-05,0.000134,-6e-06,6.1e-05,3.6e-05,-1e-05,-4e-05,1e-06,-6e-06,-4.2e-05,4e-06,6e-06,2.1e-05,-2e-05,3.3e-05,-4.5e-05,-6.3e-05,0,-2.5e-05,-4.4e-05,1.1e-05,-6e-06,-1e-05,-8.7e-05,-2.6e-05,-2.1e-05,9.8e-05,-4.3e-05,7.2e-05,3e-06,5.2e-05,-1.2e-05,2e-05,1.4e-05,-2.7e-05,8.7e-05,-4.6e-05,4.3e-05,-3.4e-05,5.8e-05,-5.1e-05,-8e-06,-6e-06,2.7e-05,0.000128,-2.3e-05,2.7e-05,6.2e-05,-2.4e-05,8e-06,-7e-06,8e-06,-2.9e-05,-1.2e-05,4.3e-05,-4.1e-05,-3.9e-05,1.2e-05,1.8e-05,-1.8e-05,6.5e-05,2.9e-05,-0.000159,1.7e-05,7.1e-05,-1e-06,3.1e-05,-5.7e-05,8e-05,1.8e-05,-4.8e-05,9.8e-05,1e-06,-4.2e-05,-2.9e-05,0,7e-06,5.4e-05,-5e-06,6.2e-05,-2.5e-05,-2.7e-05,-6.5e-05,-2e-05,1e-06,-3.7e-05,-1.7e-05,6e-06,0,5.9e-05,-3.5e-05,3.4e-05,7.9e-05,-1.8e-05,1.1e-05,-4.2e-05,-7e-06,-1.8e-05,-5.7e-05,9e-06,5e-06
-0.000109,-1.9e-05,3.6e-05,-2.7e-05,-3.6e-05,-3.5e-05,-3.5e-05,-8e-06,1.6e-05,1e-06,3.9e-05,-7.4e-05,-3e-06,-1.4e-05,6e-06,3.1e-05,-5.1e-05,1.3e-05,4e-06,5e-06,-1e-06,-6.6e-05,7e-06,1.2e-05,4.7e-05,-2.3e-05,7.7e-05,3e-06,-2.5e-05,2.1e-05,-7e-06,-1.1e-05,-1.2e-05,1.7e-05,-5e-06,2.3e-05,9.7e-05,4.8e-05,2.1e-05,-2.5e-05,-9e-06,-9e-06,-1.5e-05,7.4e-05,3.1e-05,-4.8e-05,-7.1e-05,6.3e-05,6e-06,-3e-06,3e-06,3e-06,1.8e-05,-2.8e-05,5.1e-05,-2e-05,-4e-06,-4.7e-05,-1.4e-05,-2.1e-05,8.2e-05,-4e-06,1.6e-05,-9.4e-05,-7e-06,5.7e-05,-1.1e-05,-1.5e-05,9e-06,-1e-06,-1.1e-05,7e-06,-6e-06,-2.5e-05,-3.1e-05,-8e-06,-1e-06,1.7e-05,-2.4e-05,-2.7e-05,-1.4e-05,3.1e-05,9.9e-05,-4.3e-05,6e-06,1.7e-05,-1e-06,4e-05,-7.9e-05,0,2.7e-05,-4.1e-05,1.8e-05,4.4e-05,8e-06,2e-05,-2.4e-05,-2.4e-05,5e-06,-3.9e-05,-1.4e-05,3.1e-05,3e-06,-2.2e-05,1.2e-05,-1.2e-05,2.2e-05,-2.1e-05,1.4e-05,-7e-06,-2e-05,-4.9e-05,-4.7e-05,1e-06,-1.4e-05,1.5e-05,1.2e-05,6e-06,6.6e-05,-4.2e-05,7e-06
9.9e-05,1.2e-05,-3.6e-05,3.5e-05,4.5e-05,3.2e-05,2.3e-05,-1.4e-05,-1.2e-05,1e-06,8e-06,1.2e-05,-1.7e-05,2e-06,-2e-06,-4e-05,1.5e-05,-9e-06,-4e-06,1.1e-05,-1.4e-05,3.2e-05,-4e-06,-3.1e-05,-2.5e-05,-1.2e-05,-2.1e-05,1e-06,6e-06,-1.1e-05,1.4e-05,6e-06,3.2e-05,1.4e-05,1.8e-05,-3.2e-05,4e-06,1e-06,-6e-06,1.6e-05,2.4e-05,1e-06,-1.5e-05,-6.8e-05,-2.7e-05,4.7e-05,5e-06,-2.9e-05,-2.1e-05,6e-06,1.2e-05,-3.4e-05,-2.3e-05,-7e-06,-7.9e-05,1.2e-05,9e-06,5.4e-05,1.4e-05,-3.3e-05,-4.3e-05,2.6e-05,-1e-06,3.8e-05,-2e-05,-2.7e-05,-7e-06,-1.2e-05,1.4e-05,-1.4e-05,1.7e-05,4e-06,4.3e-05,2e-06,1e-05,-2.3e-05,2.5e-05,-2.4e-05,2.3e-05,3.7e-05,-1.5e-05,9e-06,-6e-05,3.4e-05,-1.2e-05,2e-06,1.1e-05,-3.2e-05,5.2e-05,5e-06,-1.9e-05,3.2e-05,4e-06,-2.2e-05,9e-06,-2.9e-05,6e-06,2.6e-05,-9e-06,-5e-06,5.1e-05,3.1e-05,5e-05,4.2e-05,1.6e-05,9e-06,-1.2e-05,-3.9e-05,0,1.2e-05,3.7e-05,1.9e-05,1.8e-05,-3e-06,-3e-05,1e-05,-4e-06,8e-06,-3.7e-05,3.7e-05,-3e-06
-4.8e-05,-3e-06,1.3e-05,-4e-06,-4.6e-05,3e-06,-6e-06,3.7e-05,1e-06,1.5e-05,1.4e-05,2.5e-05,1.9e-05,0,0,1.3e-05,1.8e-05,1e-05,1.6e-05,-8e-06,1.4e-05,-1.9e-05,3e-06,7e-06,8e-06,-8e-06,1.9e-05,4e-06,-1.3e-05,-1e-06,-7e-06,-2e-06,-3.6e-05,-1.4e-05,1.1e-05,1.7e-05,-3.2e-05,-3e-06,-2.9e-05,-5e-06,-2.2e-05,1.4e-05,2.1e-05,3.2e-05,2.5e-05,-1.1e-05,8e-06,5e-06,-4e-06,-9e-06,-4e-06,2.9e-05,1e-06,9e-06,3.5e-05,-1e-05,-1.3e-05,-2e-05,-1e-05,4.3e-05,-2e-06,-2e-06,6e-06,2e-06,-1.8e-05,-9e-06,-1e-05,1.9e-05,-2.3e-05,1.4e-05,6e-06,-1.3e-05,-2.9e-05,1e-06,-2e-05,2e-05,-2.6e-05,2e-05,-1.7e-05,7e-06,-2e-06,-2.3e-05,4.5e-05,-2.1e-05,2.5e-05,1e-06,1.6e-05,-6e-06,-1.5e-05,-7e-06,4e-06,1.3e-05,-1.1e-05,3e-05,-8e-06,1e-05,1.2e-05,-1.1e-05,-2e-06,-1.2e-05,-4.2e-05,1e-06,-1.2e-05,-1.7e-05,2e-06,1.4e-05,4.2e-05,5e-06,-4e-06,3e-06,-1.2e-05,-2e-06,1.9e-05,-5e-06,1.9e-05,-6e-06,-1.8e-05,4e-06,1.6e-05,-5e-05,-1.5e-05
9e-06,7e-06,4e-06,-1.1e-05,2.4e-05,-5e-06,3e-06,-3e-05,3e-06,-1.1e-05,-2.4e-05,-8e-06,-4e-06,1.5e-05,-7e-06,-9e-06,-1.3e-05,3e-06,0,-4e-06,-3e-06,3e-06,-7e-06,1.6e-05,-1.1e-05,9e-06,-3.1e-05,-3e-06,3e-06,6e-06,0,-1e-06,3.1e-05,2e-06,-1.4e-05,-2.6e-05,1.9e-05,-1.1e-05,1.1e-05,-1.2e-05,1.7e-05,-2.3e-05,-1e-05,-2e-05,-2e-05,-3.1e-05,0,-8e-06,-5e-06,5e-06,1e-06,-1.2e-05,2e-06,-4.8e-05,1.9e-05,9e-06,5e-06,-9e-06,2.5e-05,-4e-05,-7e-06,-2.3e-05,1.2e-05,2e-06,-9e-06,1.1e-05,5e-06,-4.2e-05,1.6e-05,-1e-05,-1.9e-05,1.4e-05,1.1e-05,1e-05,1.2e-05,-2e-06,1.7e-05,-8e-06,3e-06,-2.3e-05,-6e-06,9e-06,-3.8e-05,2.2e-05,-6e-06,2e-06,-2.3e-05,1.8e-05,7e-06,0,2.1e-05,-2.4e-05,-2e-06,-2.7e-05,1.6e-05,-2e-06,8e-06,-1e-05,2.1e-05,1.2e-05,2.3e-05,-2.1e-05,-1.4e-05,1e-05,1.1e-05,-2.2e-05,-2e-05,1.1e-05,-2e-06,-2.1e-05,-6e-06,-2e-06,-1e-05,1.3e-05,1.1e-05,-2e-06,-1e-05,-3e-06,-1.3e-05,3.5e-05,1.6e-05
1.2e-05,-1.3e-05,2e-06,8e-06,-9e-06,8e-06,-7e-06,1.6e-05,-6e-06,8e-06,-1e-06,-1.2e-05,-3e-06,0,3e-06,3e-06,1.2e-05,0,-6e-06,4e-06,-9e-06,-8e-06,1e-06,4e-06,-1.6e-05,5e-06,1.8e-05,0,1.1e-05,1.1e-05,-1e-06,4e-06,-2.6e-05,-1.7e-05,-3e-06,4e-06,-2.1e-05,6e-06,-1.2e-05,2.7e-05,-8e-06,1.8e-05,7e-06,1.6e-05,2.4e-05,1.6e-05,-4e-06,2.3e-05,1e-06,1e-06,-4e-06,9e-06,-1.6e-05,3.4e-05,-2.3e-05,-1.4e-05,-4e-06,7e-06,-2.5e-05,1.9e-05,3.8e-05,2.3e-05,-8e-06,-2.1e-05,2.7e-05,-2e-05,-1e-06,3.5e-05,6e-06,4e-06,3e-06,-7e-06,2e-06,7e-06,-3.8e-05,-3e-06,4e-06,2e-06,-1.5e-05,2.1e-05,2.9e-05,-4e-06,2.1e-05,-2.3e-05,2e-06,8e-06,1e-06,-5e-06,-7e-06,-3e-06,-2.3e-05,-1.5e-05,-6e-06,-1e-06,-7e-06,5e-06,0,1.7e-05,-9e-06,-1.8e-05,-2.2e-05,4e-06,-3e-06,-1.6e-05,0,1.9e-05,-9e-06,-1e-06,-1e-05,1.4e-05,1.2e-05,-1e-06,-1.1e-05,-2.3e-05,-1.4e-05,-1.3e-05,2.7e-05,-1.1e-05,1.3e-05,-1.6e-05,-7e-06
-7e-06,7e-06,-1e-05,-8e-06,-7e-06,-1.2e-05,6e-06,-1.3e-05,1e-06,-1.4e-05,3e-06,1.2e-05,0,-1.1e-05,7e-06,-1.1e-05,-5e-06,-7e-06,1.6e-05,4e-06,5e-06,2e-06,2e-06,-1.3e-05,9e-06,2e-06,8e-06,0,-5e-06,-5e-06,0,0,9e-06,5e-06,-1.1e-05,4e-06,-1.9e-05,-1e-06,2.6e-05,-2.2e-05,4e-06,1e-06,4e-06,-1e-06,-2.7e-05,-1e-06,0,-3.8e-05,-9e-06,-8e-06,-9e-06,-1e-05,0,-2.2e-05,7e-06,1.1e-05,1.2e-05,0,1.8e-05,1e-06,-3.3e-05,1.4e-05,-1e-06,5e-06,-2e-06,1.1e-05,-3e-06,3e-06,-1.9e-05,-3e-06,-5e-06,4e-06,-8e-06,-1e-05,2.6e-05,1.1e-05,-1.9e-05,-1.4e-05,1.6e-05,-2.9e-05,-2.1e-05,-1e-06,-7e-06,1.9e-05,4e-06,2e-06,7e-06,9e-06,-1e-06,1e-06,1.2e-05,1.5e-05,3e-06,1.6e-05,-4e-06,-6e-06,-1.3e-05,-1.2e-05,-2e-06,3e-06,1.6e-05,1.4e-05,0,1.4e-05,-5e-06,-3e-05,-1.5e-05,1e-06,9e-06,-1.5e-05,-6e-06,-3e-06,1e-05,9e-06,9e-06,1e-05,-1.9e-05,8e-06,-1.8e-05,1e-06,-9e-06
-5e-06,-3e-06,3e-06,8e-06,2e-06,2e-06,-1.8e-05,4e-06,3e-06,0,0,-6e-06,6e-06,6e-06,2e-06,6e-06,3e-06,-1e-06,-3e-06,-8e-06,-3e-06,9e-06,-3e-06,5e-06,6e-06,-1.2e-05,7e-06,0,4e-06,3e-06,-1e-06,0,1.9e-05,2e-06,0,-1e-05,1.6e-05,1.6e-05,-1.2e-05,1.9e-05,5e-06,-1.8e-05,5e-06,-3e-06,2.4e-05,-4e-06,1e-06,3.4e-05,-1e-05,7e-06,3e-06,1.4e-05,0,1.4e-05,-7e-06,-8e-06,-1.6e-05,-7e-06,-6e-06,-1e-05,6e-06,-1.3e-05,1e-06,0,-5e-06,0,4e-06,-2.8e-05,1.7e-05,1e-06,1.6e-05,4e-06,-2e-06,-4e-06,5e-06,-1.5e-05,1.5e-05,1.6e-05,-6e-06,9e-06,3e-06,-6e-06,-1e-06,-1.9e-05,-1.9e-05,0,-4e-06,-1e-05,1e-05,-3e-06,-1e-05,-1.9e-05,3e-06,-6e-06,-6e-06,3e-06,8e-06,1.5e-05,7e-06,1.9e-05,-5e-06,-5e-06,-1e-05,-7e-06,-3e-06,1.8e-05,-9e-06,9e-06,-1.3e-05,-1e-06,3e-06,1e-05,-1.1e-05,-1e-06,-6e-06,-1e-06,-1e-06,-1e-06,1.7e-05,7e-06,7e-06
4e-06,1e-06,3e-06,-5e-06,2e-06,5e-06,2.9e-05,7e-06,6e-06,-1e-05,-8e-06,1e-06,-1.4e-05,2e-06,-6e-06,2e-06,3e-06,3e-06,-1e-06,4e-06,1e-06,-5e-06,0,1.2e-05,8e-06,-6e-06,-1.6e-05,-2e-06,-1e-06,-2e-06,-3e-06,-4e-06,-4e-05,6e-06,4e-06,1e-05,1e-05,-1.3e-05,3e-05,-3e-06,2e-06,2e-05,-8e-06,-2e-06,-1.3e-05,1.2e-05,3e-06,-2.3e-05,2.2e-05,-2e-06,1.5e-05,-1e-05,1e-06,3e-06,1.1e-05,6e-06,1.7e-05,1.1e-05,-5e-06,1e-05,-1e-05,-2e-06,-5e-06,9e-06,0,0,9e-06,2.9e-05,-2e-06,4e-06,-1.8e-05,-6e-06,2e-06,5e-06,1.1e-05,1e-06,-7e-06,0,0,8e-06,5e-06,9e-06,0,1.6e-05,1.2e-05,-1e-06,9e-06,6e-06,-1.1e-05,0,5e-06,3.5e-05,-2e-06,-5e-06,-3e-06,3e-06,-7e-06,-4e-06,2e-06,-1.1e-05,-6e-06,-1.1e-05,4e-06,-1e-06,-2e-06,-1e-05,-9e-06,-1e-05,8e-06,1.3e-05,1e-06,-1.6e-05,8e-06,-5e-06,6e-06,-3e-06,1.1e-05,-4e-06,-2.1e-05,-5e-06,-2e-06
-2e-06,4e-06,0,1e-06,-6e-06,-5e-06,-2.3e-05,-6e-06,-2e-06,4e-06,9e-06,7e-06,1.6e-05,-7e-06,0,-2e-06,0,-3e-06,1e-06,6e-06,5e-06,-1e-06,1e-06,-5e-06,-4e-06,3e-06,4e-06,1e-06,-3e-06,3e-06,2e-06,0,3.7e-05,-2e-06,-2e-06,-1.4e-05,9e-06,4e-06,-2.4e-05,2e-06,-4e-06,-6e-06,-6e-06,6e-06,8e-06,-3e-06,-1e-06,1.6e-05,-7e-06,-2e-06,-9e-06,6e-06,-5e-06,-1.1e-05,1e-06,5e-06,-2.4e-05,1e-06,2e-06,-2e-06,3.6e-05,9e-06,4e-06,-4e-06,-2e-06,6e-06,-5e-06,-6e-06,-6e-06,-3e-06,1e-05,3e-06,1.1e-05,-1e-05,-1.7e-05,8e-06,6e-06,-1.5e-05,0,-1.2e-05,1e-06,2e-06,8e-06,-1.3e-05,-3e-06,2e-06,-1e-05,-5e-06,8e-06,1e-06,2e-06,-1.8e-05,-1e-06,7e-06,7e-06,-5e-06,2e-06,3e-06,-1e-06,8e-06,1.4e-05,-1e-06,4e-06,1e-06,4e-06,9e-06,6e-06,1.7e-05,3e-06,-2e-06,-5e-06,9e-06,-1e-06,1.3e-05,-2e-06,4e-06,-1.5e-05,6e-06,2.4e-05,4e-06,5e-06
2e-06,-1.1e-05,0,-2e-06,-3e-06,9e-06,1.1e-05,4e-06,-2e-06,6e-06,-6e-06,-3e-06,-1.3e-05,1e-05,0,1e-05,-8e-06,-1e-06,-4e-06,-7e-06,-5e-06,-2e-06,0,-8e-06,-8e-06,1e-06,1e-06,1e-06,-1e-06,-2e-06,0,1e-06,-1.9e-05,-5e-06,5e-06,1e-05,-1.2e-05,-2e-06,1.2e-05,1e-06,0,-5e-06,-5e-06,-6e-06,-8e-06,-7e-06,2e-06,-1.2e-05,-2e-06,4e-06,5e-06,-9e-06,1e-06,1.4e-05,-1.3e-05,-1.9e-05,1.1e-05,-8e-06,-4e-06,-2e-06,-3.6e-05,-2e-06,-2e-06,-1.5e-05,6e-06,-1.1e-05,1e-06,-8e-06,5e-06,1e-06,-8e-06,-1e-06,-8e-06,-2e-06,1.3e-05,1e-06,-3e-06,1.7e-05,1e-06,1.7e-05,-1e-05,-1e-06,-1.1e-05,1.1e-05,-9e-06,-3e-06,2e-06,-4e-06,-4e-06,0,-8e-06,1.6e-05,3e-06,-8e-06,-4e-06,4e-06,-2e-06,-5e-06,-5e-06,-7e-06,-1.2e-05,5e-06,-1e-06,-2e-06,-2e-06,-1.1e-05,1e-05,-1.5e-05,-7e-06,-4e-06,1e-06,5e-06,-4e-06,-1.5e-05,4e-06,-6e-06,8e-06,0,-1.3e-05,1e-06,-4e-06
-5e-06,9e-06,-5e-06,0,8e-06,-7e-06,-6e-06,-3e-06,1e-06,1e-06,9e-06,-1e-06,9e-06,-6e-06,0,-6e-06,8e-06,2e-06,-5e-06,0,3e-06,3e-06,1e-06,5e-06,-1e-06,6e-06,9e-06,0,-1e-06,-3e-06,-2e-06,-2e-06,5e-06,1e-06,0,-6e-06,-5e-06,4e-06,-1.7e-05,0,6e-06,1.1e-05,3e-06,1e-05,4e-06,8e-06,-6e-06,7e-06,5e-06,-4e-06,-9e-06,1.1e-05,-2e-06,-1.1e-05,4e-06,1.3e-05,-2e-06,6e-06,1.2e-05,3e-06,1.4e-05,-4e-06,1e-06,1.3e-05,-7e-06,2e-06,-6e-06,1.2e-05,1e-06,0,1e-06,-4e-06,5e-06,1.2e-05,-3e-06,8e-06,0,-7e-06,0,-1.5e-05,5e-06,1e-06,1.7e-05,-1.1e-05,9e-06,0,-4e-06,6e-06,2e-06,1e-06,1.1e-05,-2.3e-05,-1e-06,7e-06,6e-06,-1e-06,9e-06,-6e-06,1e-06,4e-06,7e-06,5e-06,5e-06,3e-06,-5e-06,9e-06,-5e-06,8e-06,3e-06,-1e-06,1e-06,-1.1e-05,8e-06,7e-06,-6e-06,6e-06,4e-06,-2e-06,2e-06,0,1e-06
1.3e-05,-5e-06,3e-06,1e-06,-9e-06,1e-06,7e-06,5e-06,2e-06,0,-4e-06,-3e-06,-4e-06,8e-06,1e-06,7e-06,-5e-06,1e-06,3e-06,2e-06,-2e-06,-6e-06,-1e-06,2e-06,-3e-06,-2e-06,-9e-06,-1e-06,3e-06,-1e-06,0,0,-5e-06,-5e-06,0,3e-06,-1e-06,-4e-06,7e-06,0,-8e-06,-1e-05,1e-06,-1.4e-05,1e-06,0,2e-06,5e-06,-3e-06,1e-06,4e-06,-7e-06,1e-06,5e-06,1e-05,-7e-06,3e-06,-2e-06,-1.7e-05,-1e-06,-8e-06,5e-06,3e-06,-5e-06,4e-06,1e-06,2e-06,-1.4e-05,-7e-06,1e-06,-1e-06,2e-06,0,2e-06,1e-06,-4e-06,0,0,1e-06,2e-06,7e-06,-2e-06,-1.8e-05,9e-06,-3e-06,1e-06,3e-06,-2e-06,-1e-06,0,-7e-06,7e-06,0,0,-3e-06,0,-1e-06,5e-06,-1e-06,-1.2e-05,-5e-06,-3e-06,-9e-06,-7e-06,3e-06,-9e-06,-6e-06,5e-06,-7e-06,-1e-06,2e-06,5e-06,-6e-06,-5e-06,3e-06,-6e-06,-8e-06,0,1e-06,-4e-06,0
-1.7e-05,2e-06,1e-06,0,5e-06,1e-06,-7e-06,-7e-06,2e-06,-1e-05,0,1e-06,1e-06,-8e-06,1e-06,-2e-06,2e-06,0,-3e-06,1e-06,0,9e-06,0,-4e-06,6e-06,-2e-06,2e-06,1e-06,-3e-06,2e-06,1e-06,1e-06,1e-05,6e-06,4e-06,4e-06,-6e-06,1e-06,-4e-06,-6e-06,3e-06,2e-06,2e-06,1.2e-05,-6e-06,-6e-06,1e-06,-1.4e-05,3e-06,2e-06,-7e-06,4e-06,1e-06,3e-06,-7e-06,6e-06,-4e-06,2e-06,1e-06,-2e-06,1.6e-05,5e-06,-3e-06,1e-05,-3e-06,2e-06,-5e-06,4e-06,8e-06,-3e-06,1e-06,-4e-06,0,-1e-06,-6e-06,-2e-06,0,1e-06,0,6e-06,-1e-05,5e-06,1.4e-05,-8e-06,0,3e-06,3e-06,2e-06,-2e-06,0,3e-06,0,-1e-06,-5e-06,1e-06,0,-5e-06,-1e-06,1e-06,8e-06,1e-06,-5e-06,-6e-06,3e-06,4e-06,1.2e-05,-7e-06,-9e-06,5e-06,4e-06,-1e-06,0,0,-1e-06,-2e-06,0,6e-06,1e-06,-2e-06,1e-05,0
1.3e-05,2e-06,-3e-06,1e-06,-2e-06,-6e-06,2e-06,7e-06,-4e-06,2e-06,-2e-06,2e-06,0,-2e-06,0,5e-06,1e-06,2e-06,0,-3e-06,3e-06,-5e-06,2e-06,-3e-06,3e-06,2e-06,0,1e-06,3e-06,-1e-06,0,0,-1.2e-05,-1e-06,-2e-06,-4e-06,9e-06,3e-06,0,1e-06,2e-06,6e-06,2e-06,-1.1e-05,8e-06,3e-06,-2e-06,1.9e-05,-7e-06,-3e-06,8e-06,-7e-06,4e-06,-9e-06,-3e-06,-6e-06,5e-06,-2e-06,4e-06,5e-06,-1.4e-05,-2e-06,1e-06,-1e-05,3e-06,3e-06,4e-06,7e-06,-4e-06,1e-06,0,2e-06,-4e-06,0,1.2e-05,1e-06,0,1e-06,-2e-06,-1e-05,4e-06,-5e-06,-9e-06,8e-06,6e-06,-2e-06,-1e-06,0,2e-06,1e-06,-2e-06,4e-06,0,3e-06,0,1e-06,-1e-06,4e-06,4e-06,-3e-06,2e-06,3e-06,5e-06,-2e-06,-2e-06,-1e-05,-1e-06,7e-06,-2e-06,-3e-06,-3e-06,-1e-06,4e-06,4e-06,1e-06,0,-1e-06,0,4e-06,-1.5e-05,0
-3e-06,-6e-06,0,-1e-06,0,5e-06,-2e-06,-8e-06,-1e-06,-2e-06,6e-06,1e-06,0,4e-06,-3e-06,-4e-06,-4e-06,0,1e-06,0,-2e-06,3e-06,-1e-06,-3e-06,-3e-06,2e-06,6e-06,0,0,0,0,-2e-06,1e-05,1e-06,-1e-06,7e-06,1.1e-05,-1e-06,3e-06,-2e-06,0,-8e-06,2e-06,1e-05,-9e-06,2e-06,4e-06,-1.7e-05,1e-06,2e-06,0,7e-06,-1e-06,1.1e-05,3e-06,5e-06,-4e-06,5e-06,-4e-06,-7e-06,5e-06,-4e-06,0,4e-06,1e-06,-4e-06,-1e-06,-1.1e-05,-2e-06,-2e-06,0,2e-06,6e-06,-6e-06,-3e-06,-4e-06,0,-2e-06,3e-06,1.1e-05,3e-06,-2e-06,5e-06,-7e-06,-3e-06,1e-06,1e-06,-1e-06,0,0,-3e-06,0,0,0,-2e-06,-1e-06,0,-2e-06,-3e-06,-1e-06,-4e-06,3e-06,3e-06,2e-06,1e-06,4e-06,5e-06,-6e-06,2e-06,2e-06,2e-06,0,-4e-06,-5e-06,-4e-06,-2e-06,-5e-06,-2e-06,-7e-06,1.3e-05,2e-06
-8e-06,5e-06,3e-06,0,0,-1e-06,6e-06,8e-06,1e-06,5e-06,-8e-06,-3e-06,-2e-06,-4e-06,-1e-06,0,4e-06,0,2e-06,2e-06,-1e-06,-5e-06,1e-06,7e-06,-1e-06,2e-06,-2e-06,-1e-06,-1e-06,1e-06,-1e-06,1e-06,-1e-05,0,-3e-06,-7e-06,-1e-05,-1e-06,4e-06,-5e-06,-5e-06,5e-06,-3e-06,-6e-06,1e-05,-3e-06,-5e-06,1.3e-05,2e-06,0,-3e-06,-5e-06,0,-8e-06,1e-06,-4e-06,2e-06,-5e-06,3e-06,6e-06,-3e-06,5e-06,-2e-06,-5e-06,-6e-06,1e-06,1e-06,4e-06,5e-06,4e-06,-5e-06,-2e-06,-3e-06,-1e-06,-7e-06,3e-06,-1e-06,-1e-06,-2e-06,-6e-06,1e-06,0,-5e-06,5e-06,1e-06,1e-06,-3e-06,0,-2e-06,0,5e-06,3e-06,0,0,2e-06,-1e-06,3e-06,-3e-06,-2e-06,5e-06,5e-06,-1e-06,0,-5e-06,1e-06,-5e-06,9e-06,0,0,0,0,-1e-06,4e-06,4e-06,6e-06,3e-06,8e-06,-1e-06,3e-06,-1.1e-05,-3e-06
1.4e-05,-5e-06,-1e-06,-1e-06,2e-06,-2e-06,-5e-06,-4e-06,1e-06,-3e-06,6e-06,-1e-06,2e-06,4e-06,3e-06,1e-06,-1e-06,-2e-06,1e-06,-1e-06,2e-06,4e-06,-1e-06,-3e-06,-3e-06,0,-2e-06,0,1e-06,2e-06,0,1e-06,8e-06,-4e-06,-2e-06,6e-06,-5e-06,-3e-06,-4e-06,7e-06,4e-06,3e-06,-2e-06,3e-06,-9e-06,2e-06,2e-06,-9e-06,-1e-06,-2e-06,1e-06,4e-06,0,2e-06,1e-06,4e-06,2e-06,2e-06,-8e-06,-3e-06,7e-06,0,1e-06,8e-06,1e-06,-3e-06,-2e-06,2e-06,-1e-06,-4e-06,2e-06,2e-06,2e-06,3e-06,-2e-06,0,2e-06,5e-06,0,-1e-06,-8e-06,1e-06,1e-06,-4e-06,2e-06,1e-06,0,-2e-06,0,0,-5e-06,-1e-05,0,1e-06,-2e-06,1e-06,-2e-06,-3e-06,2e-06,0,-3e-06,-4e-06,-2e-06,4e-06,-2e-06,3e-06,4e-06,2e-06,-1e-06,-3e-06,-1e-06,2e-06,-2e-06,-3e-06,-3e-06,-3e-06,-2e-06,1e-06,0,5e-06,0
-1.2e-05,5e-06,-1e-06,0,-2e-06,4e-06,1e-06,3e-06,0,1e-06,-4e-06,4e-06,0,-3e-06,2e-06,-2e-06,-1e-06,1e-06,1e-06,0,-2e-06,-3e-06,0,-6e-06,0,-1e-06,-1e-06,1e-06,-3e-06,0,1e-06,0,-3e-06,2e-06,2e-06,-3e-06,0,4e-06,7e-06,-6e-06,0,-8e-06,0,-2e-06,1e-05,1e-06,1e-06,7e-06,1e-06,2e-06,-3e-06,-3e-06,1e-06,1e-06,-6e-06,-6e-06,-6e-06,-1e-06,7e-06,-1e-06,-6e-06,-3e-06,-1e-06,-5e-06,1e-06,2e-06,2e-06,-2e-06,-3e-06,3e-06,-1e-06,0,-3e-06,1e-06,6e-06,-1e-06,0,-7e-06,0,5e-06,3e-06,2e-06,5e-06,3e-06,-5e-06,-2e-06,3e-06,3e-06,0,0,5e-06,2e-06,1e-06,-3e-06,1e-06,-1e-06,2e-06,-1e-06,2e-06,0,0,0,-1e-06,-2e-06,0,-2e-06,0,-2e-06,0,2e-06,0,-3e-06,-2e-06,2e-06,0,3e-06,-5e-06,0,2e-06,-3e-06,2e-06
5e-06,-2e-06,1e-06,1e-06,3e-06,-4e-06,2e-06,-1e-06,-1e-06,-3e-06,3e-06,0,-2e-06,4e-06,-1e-06,0,0,0,1e-06,1e-06,2e-06,2e-06,0,6e-06,4e-06,-1e-06,5e-06,0,1e-06,0,0,-1e-06,-4e-06,-1e-06,0,-1e-06,-1e-06,-1e-06,-1.2e-05,2e-06,-1e-06,6e-06,1e-06,1e-06,-8e-06,-2e-06,-2e-06,-5e-06,0,-1e-06,2e-06,4e-06,0,-6e-06,3e-06,5e-06,6e-06,1e-06,-4e-06,5e-06,5e-06,1e-06,0,3e-06,0,0,-2e-06,2e-06,5e-06,-1e-06,1e-06,-1e-06,3e-06,2e-06,0,1e-06,1e-06,4e-06,1e-06,-9e-06,5e-06,-1e-06,-9e-06,-2e-06,2e-06,1e-06,-2e-06,-2e-06,1e-06,0,-2e-06,1e-06,-1e-06,2e-06,-1e-06,0,1e-06,3e-06,-1e-06,-3e-06,2e-06,3e-06,-1e-06,0,1e-06,1e-06,-3e-06,-1e-06,-3e-06,0,0,3e-06,3e-06,0,-1e-06,-1e-06,7e-06,0,-3e-06,2e-06,-1e-06
1e-06,-1e-06,-1e-06,1e-06,0,0,0,-2e-06,0,0,-3e-06,-3e-06,4e-06,-3e-06,-1e-06,-3e-06,0,0,-1e-06,0,1e-06,1e-06,1e-06,3e-06,1e-06,1e-06,-1e-06,-1e-06,1e-06,0,-2e-06,0,8e-06,3e-06,1e-06,2e-06,4e-06,0,9e-06,1e-06,-1e-06,0,0,0,6e-06,1e-06,2e-06,2e-06,1e-06,-1e-06,-1e-06,-4e-06,0,6e-06,4e-06,1e-06,-2e-06,-1e-06,-2e-06,-7e-06,-8e-06,3e-06,1e-06,-5e-06,-2e-06,2e-06,0,-1e-06,-4e-06,1e-06,-3e-06,1e-06,-3e-06,3e-06,-5e-06,-3e-06,-2e-06,2e-06,-2e-06,7e-06,-5e-06,2e-06,1.1e-05,1e-06,0,0,3e-06,2e-06,-2e-06,0,0,1e-06,0,2e-06,0,0,0,2e-06,-2e-06,5e-06,-3e-06,1e-06,0,0,-1e-06,-5e-06,-3e-06,5e-06,3e-06,1e-06,0,0,-4e-06,-1e-06,3e-06,1e-06,-4e-06,0,2e-06,-4e-06,0
-3e-06,3e-06,0,-1e-06,-1e-06,2e-06,-1e-06,2e-06,0,-2e-06,3e-06,1e-06,-5e-06,1e-06,0,3e-06,-1e-06,-1e-06,0,-1e-06,-3e-06,0,-1e-06,-4e-06,1e-06,1e-06,-1e-06,0,-1e-06,0,0,0,-7e-06,-1e-06,0,-1e-06,4e-06,-3e-06,-1.2e-05,-1e-06,3e-06,-5e-06,1e-06,1e-06,-3e-06,1e-06,-1e-06,0,0,2e-06,4e-06,2e-06,1e-06,-5e-06,-4e-06,-3e-06,0,0,5e-06,6e-06,1.1e-05,-2e-06,-1e-06,2e-06,2e-06,0,-2e-06,3e-06,0,-2e-06,1e-06,-1e-06,0,-3e-06,4e-06,1e-06,0,-4e-06,1e-06,-3e-06,1e-06,0,-1.2e-05,0,-1e-06,0,-2e-06,-2e-06,1e-06,0,1e-06,3e-06,1e-06,-3e-06,1e-06,0,-3e-06,1e-06,1e-06,-7e-06,4e-06,-2e-06,0,1e-06,-1e-06,5e-06,2e-06,-5e-06,-2e-06,0,0,-3e-06,2e-06,1e-06,-1e-06,1e-06,-2e-06,0,-1e-06,5e-06,0
2e-06,-5e-06,0,-1e-06,1e-06,-3e-06,-3e-06,-2e-06,1e-06,-1e-06,-3e-06,1e-06,4e-06,-2e-06,0,-5e-06,2e-06,0,0,1e-06,2e-06,-1e-06,0,-1e-06,-2e-06,-1e-06,-2e-06,0,1e-06,-1e-06,1e-06,-1e-06,4e-06,0,-1e-06,3e-06,-2e-06,2e-06,1.2e-05,3e-06,-2e-06,6e-06,1e-06,-2e-06,2e-06,-2e-06,0,0,-2e-06,-2e-06,-3e-06,-2e-06,-1e-06,1e-06,-1e-06,2e-06,1e-06,0,-3e-06,-4e-06,-6e-06,-2e-06,1e-06,2e-06,1e-06,-1e-06,1e-06,-2e-06,3e-06,0,0,0,2e-06,-4e-06,1e-06,0,2e-06,2e-06,0,-1e-06,3e-06,-1e-06,1.2e-05,0,2e-06,-2e-06,0,2e-06,1e-06,0,-4e-06,-2e-06,0,1e-06,-1e-06,0,0,-1e-06,0,3e-06,-3e-06,-1e-06,0,0,1e-06,-3e-06,5e-06,3e-06,2e-06,-1e-06,0,3e-06,0,-4e-06,-1e-06,-2e-06,6e-06,0,4e-06,-4e-06,-1e-06
0,6e-06,-1e-06,0,0,4e-06,5e-06,1e-06,0,1e-06,5e-06,-2e-06,-2e-06,3e-06,0,2e-06,-2e-06,1e-06,-2e-06,1e-06,-1e-06,-1e-06,-1e-06,4e-06,-2e-06,-1e-06,3e-06,0,0,-1e-06,0,0,-2e-06,-1e-06,1e-06,-3e-06,-5e-06,1e-06,-9e-06,0,-1e-06,-4e-06,-1e-06,2e-06,0,-1e-06,1e-06,0,1e-06,0,0,3e-06,0,2e-06,2e-06,-1e-06,-1e-06,-1e-06,3e-06,0,3e-06,1e-06,0,-1e-06,-1e-06,0,-1e-06,0,-3e-06,0,-2e-06,0,-1e-06,0,-1e-06,0,-2e-06,3e-06,0,6e-06,-1e-06,-2e-06,-1.1e-05,1e-06,-1e-06,1e-06,2e-06,-2e-06,-1e-06,0,3e-06,-1e-06,0,0,2e-06,0,2e-06,-2e-06,0,0,3e-06,1e-06,2e-06,0,1e-06,4e-06,5e-06,0,-1e-06,0,0,0,-1e-06,5e-06,0,1e-06,-5e-06,-1e-06,-7e-06,1e-06,0
1e-06,-4e-06,0,0,-1e-06,-2e-06,-2e-06,-1e-06,-1e-06,0,-5e-06,1e-06,0,-2e-06,1e-06,-1e-06,0,1e-06,-1e-06,-1e-06,0,1e-06,1e-06,2e-06,1e-06,-2e-06,0,0,0,0,0,0,2e-06,-1e-06,0,1e-06,-2e-06,-1e-06,8e-06,1e-06,1e-06,-1e-06,-1e-06,-3e-06,-2e-06,1e-06,-1e-06,-1e-06,0,1e-06,-1e-06,-2e-06,-1e-06,-3e-06,1e-06,2e-06,-2e-06,1e-06,-5e-06,3e-06,-9e-06,1e-06,-1e-06,0,0,-1e-06,1e-06,1e-06,-1e-06,0,0,-1e-06,0,0,-6e-06,2e-06,1e-06,-2e-06,0,-8e-06,-6e-06,-1e-06,1e-05,-1e-06,0,0,-3e-06,0,1e-06,0,-2e-06,-4e-06,0,1e-06,-1e-06,0,0,-1e-06,2e-06,-1e-06,-1e-06,1e-06,0,1e-06,0,-4e-06,0,-3e-06,0,-1e-06,-1e-06,-2e-06,1e-06,-4e-06,-1e-06,-2e-06,0,0,6e-06,4e-06,1e-06
-3e-06,2e-06,1e-06,0,0,-1e-06,0,1e-06,0,1e-06,2e-06,1e-06,1e-06,1e-06,1e-06,0,1e-06,-1e-06,1e-06,0,1e-06,-1e-06,-1e-06,-4e-06,0,0,0,0,0,1e-06,-1e-06,0,-2e-06,1e-06,-1e-06,0,2e-06,-1e-06,-5e-06,-2e-06,0,4e-06,-1e-06,3e-06,3e-06,1e-06,1e-06,3e-06,-1e-06,-2e-06,1e-06,2e-06,0,4e-06,-1e-06,-2e-06,4e-06,-1e-06,5e-06,-4e-06,1.1e-05,-2e-06,1e-06,-2e-06,0,1e-06,0,-4e-06,3e-06,0,0,0,0,2e-06,8e-06,-1e-06,-1e-06,-2e-06,0,6e-06,4e-06,1e-06,-9e-06,2e-06,1e-06,0,3e-06,0,0,0,2e-06,4e-06,-1e-06,1e-06,1e-06,0,0,1e-06,-1e-06,1e-06,0,-1e-06,-3e-06,-1e-06,0,1e-06,-4e-06,5e-06,0,2e-06,1e-06,0,-1e-06,3e-06,0,1e-06,4e-06,1e-06,-5e-06,-7e-06,-1e-06
2e-06,0,0,0,0,1e-06,-3e-06,-1e-06,0,-4e-06,-2e-06,-1e-06,-1e-06,-1e-06,-1e-06,1e-06,-1e-06,0,-2e-06,1e-06,-1e-06,2e-06,0,-1e-06,2e-06,1e-06,-2e-06,0,0,0,1e-06,-1e-06,3e-06,0,-1e-06,-1e-06,4e-06,0,5e-06,1e-06,0,-5e-06,-1e-06,-3e-06,-5e-06,0,0,-5e-06,0,1e-06,0,-2e-06,0,-1e-06,-1e-06,1e-06,-4e-06,1e-06,2e-06,3e-06,-4e-06,-1e-06,-1e-06,3e-06,0,0,1e-06,4e-06,-4e-06,-1e-06,-1e-06,-1e-06,1e-06,3e-06,-1e-06,1e-06,1e-06,3e-06,-1e-06,-3e-06,3e-06,0,8e-06,-2e-06,-1e-06,-1e-06,-1e-06,0,0,0,0,-2e-06,0,-1e-06,0,0,0,2e-06,-1e-06,1e-06,1e-06,-1e-06,0,1e-06,0,0,-6e-06,-4e-06,-1e-06,1e-06,0,1e-06,0,-1e-06,1e-06,0,-5e-06,0,7e-06,8e-06,0
1e-06,-3e-06,-1e-06,1e-06,-1e-06,-2e-06,5e-06,2e-06,1e-06,-1e-06,4e-06,-1e-06,0,0,-2e-06,-1e-06,1e-06,0,1e-06,0,-1e-06,-1e-06,-1e-06,3e-06,0,1e-06,1e-06,0,0,0,1e-06,0,-4e-06,1e-06,-1e-06,0,1e-06,3e-06,-4e-06,0,0,2e-06,1e-06,3e-06,6e-06,1e-06,0,7e-06,0,0,1e-06,2e-06,0,-1e-06,2e-06,-1e-06,4e-06,-1e-06,-4e-06,-1e-06,-2e-06,2e-06,0,0,0,-1e-06,-1e-06,-1e-06,2e-06,2e-06,-1e-06,0,-1e-06,0,0,0,0,-2e-06,1e-06,-2e-06,-4e-06,-1e-06,-7e-06,2e-06,0,2e-06,-1e-06,0,0,0,-1e-06,5e-06,0,-1e-06,-1e-06,0,2e-06,1e-06,1e-06,1e-06,-2e-06,0,0,-1e-06,0,2e-06,-3e-06,1e-06,1e-06,0,-1e-06,0,1e-06,-3e-06,0,0,1e-06,-1e-06,-7e-06,-7e-06,0
-5e-06,4e-06,0,0,0,1e-06,-3e-06,-2e-06,0,-1e-06,-3e-06,1e-06,1e-06,1e-06,1e-06,3e-06,0,0,1e-06,0,2e-06,1e-06,1e-06,-1e-06,-2e-06,-1e-06,-1e-06,0,0,0,-1e-06,0,5e-06,-1e-06,1e-06,-1e-06,-1e-06,-1e-06,3e-06,-3e-06,0,2e-06,1e-06,-3e-06,-6e-06,0,1e-06,-9e-06,0,-1e-06,1e-06,-2e-06,-1e-06,4e-06,1e-06,3e-06,-2e-06,1e-06,4e-06,-1e-06,-4e-06,0,0,3e-06,0,1e-06,1e-06,-3e-06,1e-06,-1e-06,-1e-06,1e-06,1e-06,-2e-06,-5e-06,-1e-06,0,-2e-06,0,5e-06,-1e-06,0,7e-06,-2e-06,1e-06,-1e-06,2e-06,0,0,0,2e-06,-4e-06,0,2e-06,0,0,0,-1e-06,1e-06,-4e-06,2e-06,0,0,1e-06,0,-2e-06,1e-06,1e-06,-2e-06,0,0,-1e-06,-1e-06,4e-06,-1e-06,1e-06,3e-06,0,5e-06,5e-06,0
