-9e-05,-0.000169,-0.000202,-0.000451,-0.000332,-0.000209,-0.000395,-0.00033,-0.000261,-0.000317,-0.000191,-0.000442,-1e-06,-0.000449,-0.000644,-7.7e-05,-0.000507,-0.000447,-0.000688,-8e-05,-0.000381,-0.000809,0.000101,-0.000183,-0.000276,-0.000204,-0.000459,-0.000281,-0.001107,-0.000344,8.3e-05,4.8e-05,-0.000311,-0.000412,0.000345,5.7e-05,0.000273,-0.000292,-0.000166,-0.000117,-2.4e-05,1.9e-05,-0.00039,-0.000177,0.000146,-6.8e-05,-0.000391,-0.000285,7e-06,0.000113,0.000418,-0.00046,-0.00046,-0.000135,0.000384,-0.00015,-0.000678,-0.00043,7.9e-05,-0.000436,-5e-04,-0.000444,-0.000152,-8.6e-05,-0.000843,-0.000685,-0.000241,-0.000446,0.000243,0.000355,-0.000369,-0.000411,-0.000293,1.8e-05,0.000126,0.000136,-0.000314,-0.000826,-0.000613,-0.000903,-0.000723,-0.000512,-0.000174,-9.8e-05,-0.000477,7e-05,-0.000209,-0.000331,-0.000287,-0.000668,-0.00014,-0.000229,-0.000537,-0.000102,-0.000251,-0.000326,0.000568,0.000233,0.000409,0.000272,-0.000307,-0.000288,-0.000268,9.1e-05,0.000301,7.6e-05,-0.000223,-0.000224,-0.00019,0.000273,5.2e-05,6.8e-05,0.000191,6.7e-05,0.000184,0.000131,0.000278,-4.6e-05,3e-05,-3e-05,-9.9e-05
1.2e-05,-0.000392,-0.000627,-7.4e-05,-0.00013,0.000107,-0.000335,-8e-06,-9.7e-05,8.8e-05,-0.000798,-0.000194,-0.000279,4.5e-05,8.7e-05,-0.000631,-0.000119,-0.000126,5.2e-05,-0.000657,-0.000792,-0.000331,-0.000275,-0.000421,-0.001322,-0.000595,-0.000388,-0.00071,0.000299,0.001004,-0.000484,-0.001591,-0.001351,-0.000795,-0.001257,-0.000884,-0.000502,-0.00081,-0.000613,0.000331,-2.5e-05,-0.000296,-0.000581,-0.000218,-0.000544,-0.000206,-0.000388,-0.000124,-0.000767,-0.000724,-0.000987,-0.000773,-0.000494,-0.000107,-0.00029,-0.000754,-0.001123,-0.000482,-0.000679,-3.3e-05,-0.000501,-2.5e-05,-0.000879,-0.00042,1.3e-05,9.1e-05,-6.2e-05,-0.000345,-0.001503,-0.000681,-0.000349,8.6e-05,-0.000787,-0.000392,-0.000919,-0.000335,-0.001234,-0.000255,-0.000132,-0.000208,-0.000212,-0.000394,-0.000428,0.000261,-0.000461,-0.000725,-0.000554,-0.000379,-0.000257,4.1e-05,0.000125,-0.000304,1.6e-05,8e-06,-0.000643,-0.000139,-0.000867,-0.000492,-0.00118,-0.001095,-0.000482,-0.000352,-0.000522,-0.000176,-0.000438,-0.000825,-0.000456,-2.1e-05,-0.000133,-0.001066,-0.000673,-0.000358,-0.000548,-5e-05,-5e-04,-0.000247,-0.000443,-0.000557,-0.000166,-5.2e-05,-8.1e-05
-0.000318,-0.000373,0.000131,-0.000114,-8.9e-05,-0.000543,-0.000139,-3e-04,-0.000219,2e-06,-6e-06,-0.000539,-0.000114,-0.000584,-0.00053,-0.000186,-9.4e-05,-0.000518,-0.000415,-0.000453,7e-05,-0.000147,-0.00023,1.4e-05,0.000158,-8.5e-05,6.6e-05,0.000196,-0.00052,-0.000728,-0.000567,0.00041,-0.000298,7e-06,-0.000369,-0.000462,-0.000298,0.000705,-0.000197,-0.000554,-0.000749,-0.001083,-0.000177,-9.5e-05,-0.000342,-0.000407,-0.000504,-0.000368,8.5e-05,-0.000128,-0.000279,0.000245,0.000318,0.000146,8.4e-05,-0.00053,-5.6e-05,-8.8e-05,-0.000421,-0.000194,-0.000566,-0.000641,-0.000103,-0.00019,-9.9e-05,-0.00012,-7.8e-05,-0.000494,-0.000788,-0.000598,7.8e-05,-8.3e-05,0.000385,7.5e-05,4.7e-05,-0.00032,0.00022,1.2e-05,-7.9e-05,-0.000561,-0.000305,-0.00029,-0.000263,-0.000167,0.000134,-0.000119,0.000126,-0.000529,-0.000684,-0.00034,-0.000284,-4.9e-05,-2.5e-05,-0.000179,-4.6e-05,-0.000279,-0.000404,-0.00032,-0.000346,-0.000271,-0.000338,-0.000447,1.8e-05,0.000229,-0.000109,-5.1e-05,6e-06,-0.000206,6.6e-05,7.2e-05,1.8e-05,-8.6e-05,-9.5e-05,-0.000216,-0.000302,-0.000164,-6.7e-05,1e-06,-2.9e-05,-0.000108,6.1e-05
-4.6e-05,0.000396,6.6e-05,0.000144,0.000107,-2.4e-05,-0.00014,-5.8e-05,0.000331,0.00014,0.000154,0.000179,-0.000144,-4.1e-05,0.000527,0.000463,-7.1e-05,0.000216,0.000472,0.000391,-0.000506,0.000241,0.000281,-0.000452,6e-06,0.000244,-0.000267,-3e-06,0.000427,3e-04,0.000514,0.000886,0.000924,0.000514,0.00051,0.000611,0.000172,-0.000348,-3e-05,0.000424,-0.000192,0.000104,0.000193,0.000319,0.000234,0.000395,0.000628,0.000407,0.000344,-9.3e-05,0.000657,0.000319,-5.5e-05,-0.000185,2e-05,0.000791,0.000541,0.000443,0.000166,0.000285,0.000537,-1.8e-05,-3e-06,0.000126,0.000195,-0.000139,-0.00015,-3.3e-05,0.000621,0.000387,-0.000339,-4e-05,-0.000185,8.2e-05,0.000202,-0.000225,0.000334,0.000202,-1e-06,0.000462,0.000362,0.000245,0.000241,0.000158,5e-05,-0.000339,-8.6e-05,0.000529,0.000338,0.000452,4.6e-05,-7e-06,0.000188,-0.000115,0.000134,9.4e-05,0.000763,0.00079,0.000629,0.000504,0.000251,0.000224,5e-04,-0.000217,0.000165,0.000526,0.000455,0.00039,5.6e-05,0.000131,0.000479,-1.5e-05,0.000243,0.000243,0.000528,0.000263,0.000181,0.000207,0.000108,5e-06,-0.000126
-0.000205,-7.8e-05,0.000244,-8e-05,-0.000132,0.000265,9.8e-05,5.9e-05,-0.000159,-0.000173,-2.4e-05,0.00024,0.000132,-0.000177,-0.000232,-0.000151,5.6e-05,0.000173,-0.000225,0.000192,0.000624,-0.000132,-0.00031,0.000114,-0.000374,-1.3e-05,-0.000281,-0.000377,-0.00045,-0.000659,-0.000139,-4.9e-05,-0.000495,-0.000409,0.000117,2.1e-05,-6.9e-05,-0.000391,-1.5e-05,-0.000513,0.000341,0.000316,-0.000292,-0.000582,-0.000239,-0.000419,-0.000275,-1e-04,-3.9e-05,0.000265,-0.000233,0.000219,0.000106,7.4e-05,0.000134,-3.3e-05,-2.3e-05,-0.000108,1.1e-05,-0.000104,-0.000207,0.000335,-5.6e-05,-0.000118,-0.000172,-0.000233,0.000119,0.000306,0.000304,2.9e-05,0.000314,-0.000102,-0.00019,-0.000355,-3.7e-05,-0.000202,-9.5e-05,-0.00036,-0.000417,-0.000537,-0.000109,7.5e-05,-9.3e-05,-0.000145,-0.000127,4e-06,-0.000247,-0.000129,0.000213,-0.000214,-0.000134,-0.000413,-0.000324,-0.000207,0.000291,-3.3e-05,-1.9e-05,5.7e-05,-0.000117,0.00012,0.000263,6.6e-05,-0.000318,-0.000193,-0.000341,-0.000161,-0.000374,-0.000109,-0.000162,-0.000135,-0.000405,-0.000225,-0.000181,-0.000257,-0.000116,-0.000353,-0.000279,5.3e-05,-0.000161,-0.000136,-8.4e-05
-3e-06,1.3e-05,3.8e-05,0.000186,0.000109,0.00014,0.000182,0.000262,0.000109,-0.000233,-1.5e-05,5e-05,7.3e-05,0.000252,-0.000113,-0.000139,-0.000194,2.2e-05,-0.000274,-0.000225,-0.000116,-5.9e-05,0.000147,9.4e-05,0.00025,-0.000501,0.000161,0.000146,0.000543,0.000369,0.000137,-0.000464,-3.9e-05,-0.000455,-1e-06,-2.4e-05,4.8e-05,-7e-06,-0.00042,-0.000222,-0.000118,9e-05,5.1e-05,-0.000259,-0.000182,-0.000378,8.4e-05,4.1e-05,-9.2e-05,7.8e-05,-5.6e-05,-0.000314,-0.000384,-0.000141,-1.4e-05,2.1e-05,-5.2e-05,-0.000159,4.9e-05,-0.000123,-5.4e-05,-0.000105,-0.000199,-0.000527,4.1e-05,0.000171,0.000228,0.000173,-1e-06,0.00045,0.000119,0.000122,0,0.000104,0.00016,0.000287,2.8e-05,0.00051,0.000526,0.000206,-0.000251,6.2e-05,-0.000287,-0.00025,4.6e-05,0.000161,0.000344,-3.9e-05,-5e-05,1e-05,-0.000147,8.3e-05,2.7e-05,8.7e-05,1.5e-05,-0.000181,-0.000176,-0.000472,-0.000164,-0.000393,0.000168,-0.000332,-0.000252,-5.6e-05,-1.8e-05,-0.000439,-0.000154,-8.2e-05,-7.8e-05,0.000159,-8.5e-05,-8.1e-05,-0.000123,-8.3e-05,-0.000139,-0.000133,-0.00012,-0.000366,-0.000193,7e-06,8.2e-05
0.000495,-1.4e-05,-0.000283,-0.000347,-0.000119,-9e-05,-9.3e-05,0.000242,-0.000142,0.000161,-7.4e-05,-0.000291,-9.5e-05,0.000177,0.000116,-7.8e-05,0.000185,-2.4e-05,0.000197,0.000188,-0.000379,-0.000155,-7.3e-05,5e-05,-9e-06,0.000388,1.6e-05,0.000241,-0.000324,-0.000282,-0.000306,-0.000104,0.00039,0.000394,-0.000257,-6.6e-05,-4.6e-05,0.000206,0.000176,3e-06,0.000256,1.9e-05,1e-04,0.000351,5e-05,0.000153,-7.3e-05,-0.000209,-0.000125,-0.000314,0.000205,0.000125,0.000485,-8.7e-05,-0.000167,-8.7e-05,-0.000589,-0.00017,-0.000135,0.000209,-0.000169,-0.000172,0.000426,0.000181,-9.3e-05,-0.000115,-0.000136,-4.8e-05,-0.000307,-0.000374,-0.000226,-6.4e-05,-1e-05,0.00028,-9e-06,0.000324,-6.9e-05,-0.000389,-0.000255,-1e-05,0.000119,0.000109,0.000125,6e-05,-0.000298,-0.00019,-4.5e-05,2.3e-05,-0.000231,-0.00026,0.000138,0.000126,-8.9e-05,8.6e-05,6.2e-05,-2.6e-05,-5.4e-05,-0.000319,0.000246,7.3e-05,-0.000201,0.000131,-6.4e-05,-2e-06,-0.000189,2.7e-05,0.000202,3.6e-05,0.000108,6.7e-05,-1.3e-05,0.000235,6e-05,0.000163,-3e-06,8.4e-05,1e-06,1.7e-05,4.3e-05,-5.4e-05,-4.8e-05
-0.000186,-0.000104,-0.000105,8e-05,1.3e-05,4.4e-05,-0.000241,-0.000316,0.000116,-0.000146,-7e-06,-6.6e-05,-0.00023,-0.000177,0.000208,0.000169,0.000201,-0.000194,2.4e-05,-7.3e-05,-4.2e-05,5.9e-05,0.000106,-0.000131,0.000226,0.000115,-1.2e-05,-0.000486,-0.000318,0.00016,-0.000201,0.000248,0.000106,0.000242,0.000209,6.5e-05,-0.000234,-7.6e-05,-6.8e-05,3e-04,-6.2e-05,-0.000243,0.00014,-0.000152,6e-06,0.00033,7.7e-05,-5.6e-05,-4e-05,9.1e-05,5.1e-05,1.2e-05,-7.7e-05,4e-05,0.000126,2.2e-05,0.000288,0.000299,0.000204,0.000241,0.000263,0.00016,-5.1e-05,0.000229,0.000147,4.4e-05,8e-06,-0.00022,-3.9e-05,-0.00033,-6.1e-05,-0.000166,3.4e-05,-0.000242,-0.000207,-0.000445,-1.8e-05,-0.000136,-0.000178,-2.6e-05,-0.000252,-0.000375,-0.000108,-4.6e-05,-5.2e-05,-0.00012,-0.000298,9.6e-05,0.000137,0.000246,3.2e-05,1.8e-05,-8e-06,6.8e-05,-0.000162,0.00013,-4.7e-05,0.000339,5.2e-05,7e-05,-0.000217,-4.6e-05,0.000228,4.7e-05,2.6e-05,1.8e-05,1.5e-05,0.00014,-2.2e-05,-5.4e-05,9.6e-05,-3.6e-05,-4e-05,0.00011,1.5e-05,0.000173,2e-05,4.4e-05,0.000133,5.8e-05,0.000124
4.8e-05,-0.000141,0.00025,4.2e-05,-0.00013,-7.5e-05,5.2e-05,0.000137,-0.00016,-1.8e-05,-1.4e-05,0.00022,0.000276,0,-0.000139,-0.000155,4e-05,0.000152,0.000102,0.000141,0.000323,0.000121,-0.000512,6.2e-05,5.6e-05,-0.000101,0.000103,0.000223,0.000242,-1.6e-05,-0.000114,2.1e-05,-0.000277,-0.000167,-7.6e-05,7.1e-05,-9.7e-05,-5e-06,-8.3e-05,2.1e-05,0.000165,7.4e-05,-0.000113,8.2e-05,-0.000204,-0.00021,-0.000141,3.4e-05,9.4e-05,0.000272,0.000142,-1.7e-05,-0.000167,0.000128,-2.1e-05,-9.6e-05,5.7e-05,-8e-06,-5.6e-05,-6e-06,2.2e-05,-3.8e-05,2e-04,-5.3e-05,-7.5e-05,-0.000184,-0.000138,8.9e-05,0.000305,0.000174,8e-06,9.6e-05,-3.8e-05,2.3e-05,-4.4e-05,8.9e-05,-2.9e-05,0.000177,1.5e-05,2.5e-05,0.000275,0.000212,0.000176,5.9e-05,3.5e-05,0.000123,0.000131,-1.9e-05,-2.5e-05,-0.000131,-0.000154,0.000124,0.000108,-2.2e-05,2.2e-05,0.00033,0.000129,-0.000117,-0.000324,-0.000102,0.000305,0.000217,-2.2e-05,0.000101,0.000161,-2e-05,-5.7e-05,-0.000164,-9.6e-05,9.7e-05,6.3e-05,-0.000125,6.4e-05,-0.000127,-8.5e-05,-0.000233,-0.000106,-1e-05,-9.8e-05,9.6e-05,1.4e-05
-0.000105,7.3e-05,-9.5e-05,-3.5e-05,-4.4e-05,2.5e-05,7.1e-05,-0.000133,7e-05,-0.000104,-9e-05,2.6e-05,-0.000121,-0.000113,-2e-04,-3.2e-05,-0.00025,1.5e-05,-0.000146,-0.000307,1.2e-05,-4.6e-05,0.000547,4e-05,-0.000382,-8.4e-05,0.000292,-0.000214,-6.2e-05,-5.4e-05,9e-06,-7.6e-05,4e-06,-4e-05,-0.000165,-9.1e-05,0.000338,-9.1e-05,8.4e-05,-9.6e-05,-0.000419,-6.8e-05,-0.000309,-0.000102,0.000171,0.000146,-0.000166,7.4e-05,-4e-06,-0.000132,-0.000152,-2.9e-05,3.5e-05,-0.000123,-2e-04,-2.4e-05,-8.6e-05,-0.000103,-0.000204,-0.000272,-0.000217,-4.7e-05,-0.000328,2.1e-05,-0.000217,0.000133,-6.3e-05,0.000132,-8.8e-05,4.6e-05,1.1e-05,-4.9e-05,0.000135,2.2e-05,0.000182,0.000122,5.7e-05,6.4e-05,1.6e-05,5.1e-05,5.4e-05,0.000189,-1.1e-05,3.1e-05,-2.3e-05,6.6e-05,9.4e-05,6e-05,-3.5e-05,2e-06,-2.4e-05,-0.000172,7.7e-05,-2e-05,-8.2e-05,-0.000261,-6.8e-05,6e-05,-0.000171,9.9e-05,0.000138,-2.3e-05,-5.9e-05,-0.00013,-0.00012,0.000134,-7e-05,-5.2e-05,-2.2e-05,4.6e-05,7e-05,0.000137,7.9e-05,4.8e-05,3.8e-05,1.4e-05,9.2e-05,-5e-06,1e-05,-1e-04,1.3e-05
0.000127,0.000123,6.8e-05,4.1e-05,0.000166,-3e-05,7.2e-05,6.3e-05,-4.6e-05,0.00014,7.3e-05,-5.5e-05,2.2e-05,0.000159,-6.2e-05,4e-06,9.4e-05,-0.000141,-9.4e-05,5.8e-05,-0.000205,-8.3e-05,8.4e-05,3.3e-05,0.00012,-5.4e-05,-0.000157,3e-05,8.2e-05,7.3e-05,0.000118,5.8e-05,2.1e-05,-2.8e-05,-1.4e-05,7.1e-05,-4e-06,4.2e-05,0.000225,7.2e-05,0.00011,-7e-06,8e-05,3.2e-05,8.7e-05,-2.4e-05,7.9e-05,-9.6e-05,-5.8e-05,-6e-06,-9.6e-05,-2.6e-05,2.1e-05,-8.5e-05,1e-05,-2.2e-05,3.6e-05,-9.1e-05,0.000172,-9e-06,0.000166,-3.9e-05,2e-06,-6.6e-05,0.000167,0.00016,9.2e-05,4e-06,9.5e-05,-1.1e-05,0.000164,0.000114,-0.000182,-0.000111,-6.8e-05,2.4e-05,9e-06,-6.1e-05,-7.8e-05,-0.000118,-3e-06,-0.000295,-5.6e-05,-1.3e-05,2.9e-05,6e-06,-2.1e-05,-7.7e-05,-3.5e-05,-8.5e-05,1e-05,0.000163,4.7e-05,0.00017,7.9e-05,4.5e-05,1.4e-05,-6.6e-05,0.000152,1.7e-05,-0.000205,-0.000173,5.5e-05,9.9e-05,0.000111,-8e-06,7.2e-05,6e-05,2.7e-05,-4.4e-05,-5.4e-05,7.7e-05,9.2e-05,3.9e-05,9.1e-05,1.9e-05,5.9e-05,0.000119,1.4e-05,5e-06,-7.3e-05
4e-05,-4.3e-05,-2.2e-05,-6.9e-05,-2.5e-05,-1.7e-05,-5.3e-05,-2.1e-05,-0.000111,-4.1e-05,-1.3e-05,4.3e-05,1.5e-05,-6.9e-05,-8.2e-05,6.6e-05,-0.000105,0.000132,6.3e-05,7.9e-05,8.8e-05,2.6e-05,-0.000192,-7.7e-05,5e-06,-0.000136,-0.000227,-8.5e-05,-9.3e-05,1e-04,8e-05,-8.6e-05,6.2e-05,-0.000139,0.000195,1.2e-05,-0.000264,-1e-05,-4.2e-05,4.8e-05,9.2e-05,3.6e-05,1.4e-05,-4.1e-05,-8.7e-05,5.8e-05,1.4e-05,3.4e-05,-2.8e-05,3.8e-05,0.000133,4e-05,-4.2e-05,9.6e-05,-0.000113,2.2e-05,2e-05,-1e-06,8.7e-05,-1.7e-05,1.9e-05,-1e-05,8.5e-05,-2e-06,-9.7e-05,-8.5e-05,-8.6e-05,-9.3e-05,-5.8e-05,1e-06,-0.000115,1.7e-05,0.000158,6.1e-05,-1.2e-05,-7e-06,-0.000226,-6.1e-05,0.000247,0.000105,4.5e-05,0.000114,-2.5e-05,-1e-05,4e-05,-4.4e-05,0.000131,-0.000155,4.8e-05,8e-05,-3.9e-05,-0.000185,-3e-05,-0.000104,-6.9e-05,-8e-06,5.7e-05,8e-06,0.000132,4.2e-05,-4.7e-05,4e-05,-9.8e-05,3.1e-05,2.7e-05,0,-8.1e-05,-1.2e-05,2.4e-05,-5e-05,-8e-06,-0.000134,-9.4e-05,-5e-06,-1.5e-05,2.6e-05,-1.8e-05,-1.2e-05,8.3e-05,7e-05,-4e-06
-3e-06,4.8e-05,4.1e-05,6.6e-05,-7.6e-05,7e-06,6e-06,-2.7e-05,0.000145,1e-05,-3.1e-05,-3.9e-05,-6.2e-05,1e-05,9.2e-05,1e-06,0.000127,4.3e-05,5.5e-05,-1.6e-05,-4.1e-05,3.4e-05,4.3e-05,-1.6e-05,3e-05,9.8e-05,0.000198,8.3e-05,5.4e-05,-0.000139,-2.1e-05,0.000138,-5.2e-05,6.9e-05,-3.8e-05,5e-06,-2e-05,7.8e-05,1.4e-05,4e-06,-5.6e-05,8.1e-05,9.4e-05,-3.3e-05,4.8e-05,-8e-06,8e-06,-1.8e-05,0.000152,-1e-06,-2.6e-05,-7.8e-05,2.4e-05,3.2e-05,7e-05,-1.3e-05,-6.7e-05,1.1e-05,-6.8e-05,2e-06,-0.00016,-2.6e-05,5.2e-05,-0.000116,2.3e-05,-2.7e-05,5.4e-05,6.9e-05,-7.5e-05,1.1e-05,-5e-05,-3.2e-05,-8.5e-05,-9.7e-05,1.2e-05,-3e-06,8.8e-05,5e-05,-0.000186,8e-06,-3.5e-05,4.3e-05,3.2e-05,3.3e-05,5.6e-05,1.9e-05,-0.000151,5e-06,1.1e-05,-9e-06,-6.8e-05,0.00014,3e-06,-6.7e-05,-3e-06,-1.6e-05,3.5e-05,-7e-06,-5e-05,-8.1e-05,0.000115,6.6e-05,4.2e-05,6.6e-05,-5.2e-05,3.5e-05,-3.7e-05,-2.7e-05,-5e-05,1.1e-05,2e-06,7e-06,-1.7e-05,-1.2e-05,-6e-05,3.3e-05,-6.4e-05,7e-06,-8e-06,-2.3e-05,-1.9e-05
-2.6e-05,-2.7e-05,-7e-05,-5.4e-05,3.4e-05,-6.4e-05,4.5e-05,-5e-05,-6.7e-05,-8.5e-05,-1.8e-05,-3.7e-05,3.8e-05,-6.2e-05,9e-05,-1.4e-05,-9.9e-05,-0.00012,1.2e-05,1.9e-05,-1.5e-05,-2.5e-05,-8.6e-05,-5e-06,-8e-05,-1.1e-05,8.9e-05,2.9e-05,-1.4e-05,9.6e-05,1.6e-05,4.4e-05,-6.7e-05,0,-4.6e-05,-3.6e-05,9.9e-05,-7.1e-05,-1.7e-05,-1.8e-05,-1.6e-05,-2.3e-05,-5e-05,1.2e-05,-4.7e-05,5.6e-05,7.2e-05,-5e-06,-5e-05,-5.1e-05,-7.1e-05,-2.1e-05,-4.7e-05,-9.2e-05,3.3e-05,2e-05,2e-05,-1.5e-05,-4.7e-05,9e-06,-6.5e-05,-1e-05,-7.4e-05,8.4e-05,6.7e-05,-1.5e-05,-1.1e-05,-6.4e-05,8.4e-05,2.5e-05,0.00012,-6.7e-05,6.1e-05,6e-05,-1.9e-05,2.2e-05,-1e-06,-4.7e-05,-2.5e-05,3.1e-05,-1.4e-05,2e-05,3.2e-05,-9e-06,-5.6e-05,2.9e-05,0.000111,5.4e-05,-6e-06,7e-06,-2.4e-05,-3.7e-05,-1.2e-05,4.8e-05,-2e-06,6e-05,-7.5e-05,4.2e-05,2.3e-05,-5.4e-05,3.7e-05,2.9e-05,-1.4e-05,-8.7e-05,-2.6e-05,-5.1e-05,-1.2e-05,5e-06,2.4e-05,-2e-06,1.5e-05,-1.1e-05,3.3e-05,-4e-05,1e-06,-5.6e-05,3.5e-05,1.1e-05,-3e-06,2e-06,2.8e-05
3.3e-05,-1.4e-05,5.2e-05,2.5e-05,-3e-06,1.8e-05,-5.8e-05,4.5e-05,5.5e-05,5e-05,3.9e-05,-3.9e-05,1.3e-05,5.4e-05,7e-06,3.1e-05,2.9e-05,-1.6e-05,-7.4e-05,-2.3e-05,-0.000105,8e-06,8.6e-05,-3.2e-05,2.1e-05,1e-05,3e-06,-2.1e-05,-5.3e-05,-3.8e-05,-2.7e-05,1.7e-05,2.2e-05,-3e-06,3.3e-05,-1.9e-05,7e-06,-7.8e-05,-1e-06,-8e-06,6.3e-05,-1.4e-05,-6.7e-05,7.1e-05,1.5e-05,-3.1e-05,-2.6e-05,3.3e-05,-1e-05,2.9e-05,1.7e-05,-1.5e-05,-1.3e-05,3.3e-05,-2.4e-05,-1.3e-05,2.4e-05,-1.6e-05,2e-05,-2.3e-05,1.7e-05,3e-06,6e-06,-3.7e-05,1e-06,3.7e-05,2.7e-05,3e-06,-7.5e-05,6e-06,1e-05,1.2e-05,-2.6e-05,1e-06,-3e-06,2.9e-05,2e-06,-2.7e-05,4.1e-05,-2e-06,1.3e-05,-3.8e-05,-3e-05,-4e-06,-2.2e-05,-4.3e-05,-4.2e-05,1.2e-05,2.5e-05,-3e-05,6.7e-05,6e-06,1.5e-05,-3e-05,2.1e-05,3.5e-05,-4.1e-05,-5.5e-05,-9e-06,-9e-06,-0.000116,-6.5e-05,-1e-05,-4.4e-05,2.4e-05,1.3e-05,-1.3e-05,9e-06,-3e-06,-2.6e-05,3e-06,1.6e-05,-5e-06,-1.9e-05,-1.2e-05,-9e-06,2.5e-05,5e-06,-4.1e-05,-1.3e-05,-1.9e-05
1e-06,9e-06,2e-05,-1.9e-05,2.8e-05,1.3e-05,2e-06,9e-06,-6e-06,1e-06,-1.4e-05,2.1e-05,8e-06,5e-06,-2.4e-05,1.8e-05,-4.7e-05,1.1e-05,5e-06,-5e-06,0.000121,1e-05,-2e-06,3.4e-05,-1.4e-05,3.4e-05,-5.9e-05,4e-05,1.9e-05,-6.4e-05,-3.9e-05,-3.1e-05,-4e-06,6e-06,-1.6e-05,1.1e-05,-3e-05,4.4e-05,2.8e-05,-8.6e-05,-1.5e-05,3.4e-05,2.4e-05,3.8e-05,-2.1e-05,-2.6e-05,2.6e-05,1.1e-05,-2.7e-05,-4e-06,-3e-05,2.3e-05,3.8e-05,3.9e-05,5e-06,1e-05,-1.4e-05,2e-06,-6e-06,-1.5e-05,-1e-06,-1e-06,-5.5e-05,5.5e-05,-1e-06,-3.5e-05,1.3e-05,-1.5e-05,4.4e-05,-1.6e-05,-6.9e-05,4.9e-05,-1.9e-05,4e-06,-1.5e-05,-4.8e-05,2.8e-05,5e-06,4.8e-05,-9e-06,-2.1e-05,2.9e-05,2.2e-05,-1.3e-05,-6e-06,1.8e-05,0,2.5e-05,-6e-06,0,2.5e-05,-2.4e-05,9e-06,2.2e-05,-1.4e-05,-4.3e-05,-7e-06,2.9e-05,5.1e-05,2.2e-05,6e-05,-1e-06,1.5e-05,3.1e-05,1.8e-05,2e-05,4.2e-05,0,-1e-06,-3.1e-05,-1e-06,2.6e-05,2e-06,1.3e-05,3e-06,-5e-06,2e-06,-9e-06,7e-06,1.2e-05,-2.3e-05
-1.7e-05,-1.3e-05,-7e-06,5e-06,-2.9e-05,-1.1e-05,-2e-06,4e-06,-1.4e-05,5.3e-05,2e-06,-1e-06,8e-06,-1.8e-05,4e-06,3e-06,2.9e-05,-2.3e-05,-4e-06,1.2e-05,-4e-05,-4e-06,-3e-05,-1.8e-05,-8e-06,-1.8e-05,3.2e-05,-1.5e-05,2.7e-05,3.5e-05,-1.1e-05,-6e-05,3.8e-05,-3.2e-05,-4.1e-05,-3.1e-05,-1.5e-05,5e-05,3e-05,3.6e-05,1e-05,-1.4e-05,2e-05,-3.3e-05,7e-06,5e-06,-6e-06,4.3e-05,1e-05,-3.8e-05,2.8e-05,2.4e-05,1e-06,-3.2e-05,1e-06,1e-06,5e-06,1.4e-05,8e-06,4.2e-05,6e-06,3e-06,6.3e-05,-2.6e-05,-2.3e-05,-4.3e-05,3e-06,2e-06,-2.2e-05,1.5e-05,9e-06,7e-06,-2e-06,3e-06,-1e-06,2.6e-05,-5e-06,5e-06,-3.1e-05,-1.2e-05,3e-05,2.7e-05,-1.8e-05,-1e-06,-1e-06,-4e-06,-3e-06,-4e-06,-2.8e-05,1.2e-05,-1.7e-05,-8e-06,1.4e-05,-1e-05,6e-06,-3.4e-05,1e-06,1e-06,-4e-06,4e-06,2.9e-05,-7e-06,-4e-06,5e-06,-3e-05,-8e-06,5e-06,5e-06,-4e-06,-3e-06,-7e-06,-3.8e-05,-5e-06,2e-06,8e-06,2.8e-05,7e-06,1.1e-05,5e-06,-1.7e-05,3.1e-05
-1.1e-05,1e-05,-2.1e-05,3e-06,1.5e-05,2.7e-05,1.3e-05,5e-06,1e-06,-2.6e-05,0,-7e-06,-1.5e-05,-5e-06,1.6e-05,7e-06,1.4e-05,1.9e-05,9e-06,-5e-06,5e-06,2e-06,-8e-06,1.5e-05,3e-05,1.4e-05,1.5e-05,-1.5e-05,-7e-06,2.9e-05,5e-06,-2.2e-05,-1e-05,-5e-06,1.5e-05,1.9e-05,2.8e-05,2e-06,-7e-06,2e-06,1.2e-05,-1.6e-05,3.1e-05,-4.2e-05,6e-06,-4e-06,-1.5e-05,-1.8e-05,-1.2e-05,1.6e-05,2e-06,1.9e-05,-1.9e-05,-1.5e-05,1e-05,6e-06,1.1e-05,2.1e-05,1.6e-05,-5e-06,4e-06,1.2e-05,-2.6e-05,-1.1e-05,4e-06,2.3e-05,-2e-06,1.2e-05,-7e-06,1e-06,5.3e-05,-1.2e-05,0,-2e-06,1e-05,3e-06,9e-06,7e-06,-4.6e-05,1.3e-05,-1.2e-05,-3e-05,1e-06,8e-06,1.2e-05,1e-05,-2.1e-05,-1.7e-05,8e-06,-8e-06,-2.4e-05,1.5e-05,-6e-06,1.2e-05,2e-06,3.1e-05,1.5e-05,-2.7e-05,-2.5e-05,2.3e-05,-5.1e-05,5e-06,-1e-06,-5e-06,1e-06,3.8e-05,-4e-06,-2.5e-05,-8e-06,-3e-06,-1.1e-05,-1.1e-05,-1e-06,5e-06,-6e-06,-3e-06,-1.8e-05,5e-06,7e-06,7e-06,-1e-06
-1.1e-05,1.7e-05,1.2e-05,-8e-06,-2.2e-05,-5e-06,-3e-06,1.1e-05,-3e-06,-7e-06,-5e-06,2.1e-05,1.5e-05,9e-06,1.3e-05,-9e-06,4e-06,9e-06,2e-05,1e-06,-1.6e-05,6e-06,5.5e-05,-8e-06,-2.8e-05,1.4e-05,-1.1e-05,1.4e-05,-1.3e-05,-2.2e-05,1.3e-05,2.8e-05,-1.6e-05,3.9e-05,8e-06,-9e-06,-6e-06,-3.4e-05,7e-06,-2.1e-05,-2e-05,1.6e-05,-4.2e-05,1.5e-05,1.3e-05,1e-05,-1e-05,-1.1e-05,2.1e-05,9e-06,-2e-06,1e-06,1.6e-05,2.6e-05,-2.6e-05,-7e-06,-1.4e-05,1.5e-05,-2.3e-05,1.9e-05,-6e-06,9e-06,1.6e-05,-1e-05,-1.6e-05,6e-06,-1.4e-05,3e-06,-1e-06,-2.1e-05,-3.4e-05,-9e-06,1.6e-05,5e-06,0,4e-06,-9e-06,-1.6e-05,4.5e-05,1e-05,-2.2e-05,-1.6e-05,-2e-06,1.1e-05,1.1e-05,-1e-05,2.1e-05,2e-06,4e-06,1.4e-05,7e-06,2e-06,-1.8e-05,4e-06,1e-06,-1.1e-05,0,3e-06,-1.9e-05,-6e-06,-2.3e-05,1.7e-05,-8e-06,-8e-06,-4e-06,-1.5e-05,-2e-06,-1e-05,1e-06,1e-06,1e-06,3.7e-05,-1e-06,-1e-06,7e-06,-1.2e-05,1.1e-05,0,-1.3e-05,1e-05,3e-06
1.4e-05,6e-06,-1.9e-05,1e-05,2.5e-05,7e-06,-9e-06,1.4e-05,-8e-06,-3e-06,6e-06,1e-06,-9e-06,6e-06,-1.6e-05,-9e-06,-1.2e-05,1.5e-05,-1e-05,-3e-06,2.8e-05,-3e-06,-5.2e-05,1e-05,-5e-06,-2.2e-05,-3.1e-05,-2.1e-05,7e-06,-3.2e-05,1.5e-05,2e-06,4e-06,-2e-06,-2.6e-05,1.2e-05,-4.7e-05,-2e-05,2e-06,8e-06,-1e-06,-2e-06,-1.1e-05,1.7e-05,7e-06,-6e-06,-6e-06,4e-06,9e-06,-7e-06,5e-06,-3e-06,-1e-05,-3e-06,2e-06,1e-06,-3e-06,-3e-06,4e-06,-4e-06,1e-06,-1.3e-05,-3.1e-05,2.1e-05,2e-06,2e-06,1.1e-05,-7e-06,-2.6e-05,8e-06,-6e-06,7e-06,-6e-06,8e-06,2e-06,-1.8e-05,-8e-06,1.2e-05,1e-05,-1.1e-05,-4e-06,1.7e-05,6e-06,-4e-06,-2e-06,1.5e-05,-1.3e-05,3e-06,-1.5e-05,-1.3e-05,1.1e-05,-1.9e-05,-9e-06,1.6e-05,3e-06,-9e-06,1e-05,1.2e-05,9e-06,-4e-06,4e-05,-2e-06,7e-06,-2e-05,-8e-06,-1.2e-05,-5e-06,1.2e-05,0,3e-06,2e-06,-1.6e-05,-8e-06,-8e-06,0,-7e-06,2e-06,8e-06,-1.2e-05,-2e-05,3e-06
-7e-06,-1e-06,-3e-06,-1.3e-05,-1.3e-05,5e-06,5e-06,-1.1e-05,-2e-06,8e-06,2e-06,-1.5e-05,-4e-06,-8e-06,-3.5e-05,9e-06,0,-7e-06,-2e-05,-2e-06,-3.9e-05,-2e-06,0,-1.7e-05,5e-06,-2e-06,4.1e-05,1.4e-05,1.5e-05,4.1e-05,4e-06,3.4e-05,4e-06,-5e-06,2.5e-05,7e-06,4e-06,2.4e-05,-1.2e-05,-8e-06,-1e-06,-1e-05,-1.1e-05,2.1e-05,-1.7e-05,-1.2e-05,4e-06,-1.6e-05,6e-06,-9e-06,-1.3e-05,-1.1e-05,1e-05,-1.7e-05,-3e-06,1e-06,3e-06,-1e-05,1.1e-05,-1.8e-05,3e-06,8e-06,1.2e-05,3e-06,-6e-06,-2.4e-05,-2e-05,6e-06,3.8e-05,2e-06,1.4e-05,-4e-06,3e-06,-1.8e-05,4e-06,-5e-06,1e-06,1e-06,-2.8e-05,2e-06,-2e-05,-2e-06,-2e-06,-5e-06,-8e-06,-1e-05,-1.7e-05,-4e-06,1e-05,5e-06,1e-06,1.2e-05,-2e-06,1e-06,-1e-06,2.5e-05,-1e-05,-1.4e-05,1.3e-05,-6e-06,1.2e-05,-7e-06,-8e-06,7e-06,1.1e-05,1.1e-05,7e-06,1e-06,2e-06,5e-06,5e-06,-8e-06,-1e-06,1e-05,-5e-06,4e-06,-1e-06,-5e-06,3e-06,3e-06,9e-06
-1e-05,3e-06,6e-06,7e-06,-4e-06,-1.1e-05,-4e-06,-1.1e-05,1.4e-05,-6e-06,-4e-06,2e-06,8e-06,-3e-06,-1.4e-05,-1e-06,4e-06,-9e-06,1e-05,5e-06,1.5e-05,-1e-06,2e-05,2.3e-05,0,1e-06,-6e-06,-4e-06,-2.4e-05,-1.6e-05,-7e-06,-2.2e-05,-1e-06,-1.3e-05,1e-06,-8e-06,4.4e-05,2e-05,3e-06,2e-06,1.4e-05,9e-06,3.4e-05,-8e-06,1.8e-05,-7e-06,7e-06,1.2e-05,-1.3e-05,1.6e-05,1.8e-05,-7e-06,9e-06,1e-05,-8e-06,-3e-06,0,-4e-06,-7e-06,8e-06,-1e-06,3e-06,-3e-06,3e-06,-1e-06,1e-06,1.2e-05,-3e-06,-2.9e-05,-3e-06,2e-06,-2e-05,-1.6e-05,7e-06,-5e-06,1.2e-05,-6e-06,-1.1e-05,5e-06,3e-06,9e-06,-5e-06,7e-06,-4e-06,-6e-06,5e-06,1.5e-05,-1e-06,5e-06,-2e-06,-1.5e-05,-2.3e-05,6e-06,-2.2e-05,-2e-06,-2.7e-05,-5e-06,8e-06,0,-2e-06,-2.6e-05,-1.1e-05,7e-06,5e-06,-8e-06,-1.1e-05,2e-06,1e-06,-8e-06,7e-06,-1e-06,1e-05,2e-06,4e-06,0,2.2e-05,1e-06,-3e-06,3e-06,7e-06,-4e-06
-2e-06,-9e-06,1.2e-05,-4e-06,-1e-06,2e-06,-5e-06,-2e-06,-1.6e-05,5e-06,2e-06,1.5e-05,-4e-06,4e-06,1.4e-05,2e-06,1.3e-05,1.7e-05,5e-06,-2e-06,4e-06,3e-06,-1.7e-05,-1.7e-05,-1e-06,-8e-06,-3.8e-05,0,-7e-06,-6e-06,-1.2e-05,0,-3e-06,-2e-05,-1e-05,8e-06,-1.4e-05,-7e-06,0,2e-06,-2.9e-05,-1e-06,-6e-06,-3.2e-05,-6e-06,7e-06,8e-06,5e-06,0,0,-2e-06,0,-1.6e-05,1.2e-05,5e-06,0,1e-06,1e-06,-5e-06,-1e-06,6e-06,-1e-05,2.3e-05,-7e-06,1e-05,1.9e-05,-6e-06,1e-06,1.4e-05,4e-06,0,5e-06,1.4e-05,-2e-06,1e-06,2e-06,-3e-06,4e-06,3e-06,-4e-06,-5e-06,-7e-06,-6e-06,2e-06,-5e-06,2e-06,-4e-06,-9e-06,-7e-06,1e-06,-4e-06,2.6e-05,4e-06,2.9e-05,0,-8e-06,6e-06,2e-06,0,5e-06,0,4e-06,1e-06,6e-06,4e-06,1.4e-05,-8e-06,2e-06,0,5e-06,-5e-06,-3e-06,3e-06,-3e-06,-2e-06,-1.2e-05,3e-06,-2e-06,3e-06,-7e-06,-4e-06
7e-06,-1e-06,-9e-06,0,1.1e-05,-5e-06,-2e-06,1e-06,1.7e-05,-6e-06,4e-06,-5e-06,0,2e-06,1.8e-05,0,-8e-06,-6e-06,1.2e-05,2e-06,-3e-06,-1e-06,2.9e-05,1.5e-05,-5e-06,4e-06,-1.1e-05,7e-06,1.6e-05,1.2e-05,-1e-05,-1.3e-05,-1.2e-05,1.2e-05,8e-06,-4e-06,-2.4e-05,-2.1e-05,-2e-06,1e-05,2.3e-05,-4e-06,-5e-06,1.3e-05,6e-06,-4e-06,7e-06,5e-06,-3e-06,-1.1e-05,-7e-06,1e-06,-6e-06,-1.6e-05,2e-06,2e-06,1e-06,2e-06,4e-06,-2e-06,3e-06,1e-06,-2.4e-05,-1.3e-05,-1e-06,-8e-06,6e-06,2e-06,-1e-06,-2e-06,-3e-06,1.5e-05,-1.2e-05,-2e-06,0,-2e-05,-8e-06,1e-06,-5e-06,2e-06,0,1.5e-05,4e-06,3e-06,0,-4e-06,1e-06,-8e-06,2e-06,-3e-06,9e-06,-2.4e-05,0,-5e-06,0,1.7e-05,-4e-06,-1.2e-05,-1e-06,4e-06,3e-05,8e-06,-6e-06,-1.6e-05,-4e-06,8e-06,-7e-06,-2e-06,0,5e-06,-3e-06,9e-06,-2e-06,0,4e-06,-4e-06,1e-06,0,-1.1e-05,2e-06,6e-06
0,3e-06,6e-06,3e-06,-6e-06,-2e-06,2e-06,-9e-06,-2e-06,1.2e-05,1e-06,1e-06,0,0,1.1e-05,2e-06,-5e-06,-1.2e-05,-6e-06,-2e-06,-9e-06,-1e-06,-2.5e-05,-8e-06,-2e-06,-1e-06,2.4e-05,0,5e-06,-8e-06,-4e-06,6e-06,3e-06,1.1e-05,-3e-06,5e-06,5e-06,-3e-06,0,-1.1e-05,-8e-06,0,-1.5e-05,8e-06,6e-06,2e-06,0,3e-06,-1e-06,1.2e-05,6e-06,3e-06,8e-06,-2e-06,5e-06,-2e-06,0,-1e-06,1e-06,-4e-06,-8e-06,3e-06,1.3e-05,1.3e-05,1e-06,-3e-06,-1e-06,-1e-06,-5e-06,1e-06,-7e-06,-5e-06,1.5e-05,6e-06,-1e-06,1e-05,4e-06,4e-06,1.4e-05,-1e-06,-4e-06,-1e-06,0,-2e-06,0,4e-06,3e-06,2e-06,4e-06,3e-06,0,1.6e-05,-3e-06,-7e-06,-3e-06,0,2e-06,1.2e-05,8e-06,-1e-06,-1.3e-05,0,3e-06,0,1e-06,-3e-06,-7e-06,1e-06,1e-06,2e-06,1e-06,0,-3e-06,0,0,-7e-06,-2e-06,-2e-06,1e-06,0,0
0,-1e-06,-8e-06,-3e-06,2e-06,1e-06,1e-06,2e-06,1e-06,-2e-06,1e-06,9e-06,-1e-06,-5e-06,-3e-06,-3e-06,-1e-05,1.3e-05,-1.2e-05,1e-06,8e-06,0,0,1e-06,-3e-06,0,3e-06,3e-06,-9e-06,-6e-06,4e-06,0,4e-06,-5e-06,4e-06,-4e-06,1.2e-05,1.7e-05,0,1e-06,5e-06,1e-06,1.1e-05,7e-06,-5e-06,-5e-06,0,-7e-06,-2e-06,4e-06,-8e-06,-2e-06,-7e-06,1.3e-05,-6e-06,0,-2e-06,-5e-06,-2e-06,-3e-06,-3e-06,-3e-06,-1.3e-05,-4e-06,2e-06,-3e-06,1e-06,-1e-06,1.5e-05,0,5e-06,-1e-06,-1.5e-05,-8e-06,1e-06,0,3e-06,-6e-06,-1.3e-05,-4e-06,-1e-06,-1e-05,-2e-06,0,5e-06,1e-06,-8e-06,4e-06,-4e-06,1e-06,-4e-06,-1.1e-05,-5e-06,0,2e-06,-7e-06,4e-06,-8e-06,0,1e-06,-1.9e-05,-5e-06,-3e-06,6e-06,0,-1e-06,1e-06,3e-06,-4e-06,-1e-06,3e-06,-1.5e-05,3e-06,0,1e-06,8e-06,-1e-06,2e-06,1e-06,2e-06,-8e-06
-6e-06,7e-06,0,4e-06,-4e-06,-3e-06,-3e-06,-1e-06,-1e-06,-2e-06,-1e-06,-4e-06,2e-06,2e-06,-7e-06,4e-06,8e-06,0,1e-06,0,-1e-06,0,1.2e-05,4e-06,2e-06,8e-06,-1.9e-05,-4e-06,-4e-06,2e-05,9e-06,4e-06,0,-6e-06,-7e-06,1e-06,2e-06,1.1e-05,-7e-06,3e-06,-6e-06,-2e-06,7e-06,0,9e-06,-1e-06,-4e-06,0,5e-06,-8e-06,4e-06,-1e-06,2e-06,-4e-06,2e-06,2e-06,1e-06,-2e-06,4e-06,-3e-06,-1e-06,-3e-06,1.5e-05,1.1e-05,-4e-06,1.2e-05,2e-06,2e-06,-1.7e-05,-4e-06,8e-06,-4e-06,9e-06,7e-06,0,3e-06,1e-06,1e-06,3e-06,0,-5e-06,4e-06,2e-06,0,2e-06,4e-06,1.4e-05,3e-06,-3e-06,-4e-06,-2e-06,5e-06,-2e-06,-2e-06,-1e-06,3e-06,0,2e-06,-7e-06,-3e-06,1.4e-05,0,2e-06,7e-06,-5e-06,-4e-06,-1e-06,-4e-06,-1e-06,-1e-06,2e-06,1.4e-05,-2e-06,2e-06,0,8e-06,0,-2e-06,9e-06,-4e-06,-2e-06
7e-06,2e-06,-6e-06,-5e-06,3e-06,3e-06,0,6e-06,-2e-06,-4e-06,0,-1e-05,-2e-06,2e-06,3e-06,-2e-06,3e-06,-6e-06,8e-06,1e-06,-1.6e-05,0,2e-06,-5e-06,-3e-06,-4e-06,-7e-06,3e-06,9e-06,-1e-05,6e-06,-6e-06,0,-7e-06,1e-05,2e-06,-1.3e-05,-9e-06,0,1e-06,1.5e-05,1e-06,3e-06,-8e-06,-6e-06,1e-06,-5e-06,0,2e-06,2e-06,0,-1e-06,2e-06,-9e-06,2e-06,-1e-06,1e-06,3e-06,-1e-06,8e-06,-9e-06,5e-06,-6e-06,-1e-05,-4e-06,1e-06,-5e-06,-2e-06,1.1e-05,4e-06,-1.5e-05,-2e-06,-9e-06,0,0,-1e-05,7e-06,2e-06,-8e-06,0,7e-06,1.1e-05,-2e-06,0,-2e-06,-6e-06,-1.2e-05,2e-06,5e-06,2e-06,5e-06,0,2e-06,6e-06,2e-06,1e-06,-2e-06,3e-06,-6e-06,-4e-06,1e-05,0,1e-06,-4e-06,6e-06,-7e-06,3e-06,-2e-06,-2e-06,-2e-06,0,5e-06,3e-06,-3e-06,-2e-06,-7e-06,2e-06,-2e-06,-4e-06,3e-06,1e-06
2e-06,0,7e-06,4e-06,-2e-06,-1e-06,1e-06,3e-06,-3e-06,2e-06,2e-06,1e-06,1e-06,-1e-06,6e-06,-2e-06,0,3e-06,3e-06,-1e-06,8e-06,0,-1.6e-05,4e-06,-3e-06,-3e-06,9e-06,-3e-06,-3e-06,-1.1e-05,1e-06,3e-06,-1e-06,-1e-06,-8e-06,-4e-06,6e-06,-1.5e-05,-2e-06,4e-06,-1.7e-05,-1e-06,-1.4e-05,-4e-06,2e-06,3e-06,-2e-06,1e-06,2e-06,6e-06,-4e-06,3e-06,-5e-06,8e-06,-3e-06,0,-1e-06,3e-06,-3e-06,2e-06,-4e-06,-2e-06,6e-06,3e-06,0,-1.3e-05,5e-06,0,-2e-06,2e-06,2e-06,4e-06,1e-05,-2e-06,0,1e-06,0,-4e-06,1.2e-05,-2e-06,-2e-06,-1.6e-05,-1e-06,1e-06,-2e-06,8e-06,3e-06,1e-06,-2e-06,0,3e-06,-4e-06,4e-06,-4e-06,-1e-06,-8e-06,0,2e-06,3e-06,0,-1.5e-05,2e-06,0,-5e-06,-4e-06,6e-06,2e-06,2e-06,0,-3e-06,-2e-06,-1.2e-05,-1e-06,-2e-06,1e-06,-6e-06,0,-2e-06,-2e-06,4e-06,4e-06
-1e-06,-1e-06,2e-06,-3e-06,1e-06,4e-06,-2e-06,1e-06,-2e-06,3e-06,-1e-06,2e-06,1e-06,-1e-06,-2e-06,4e-06,-4e-06,-4e-06,0,0,2e-06,0,1.1e-05,-3e-06,0,7e-06,3e-06,0,-8e-06,1.2e-05,-4e-06,-3e-06,3e-06,1.1e-05,1e-06,1e-06,8e-06,1e-06,-1e-06,-4e-06,1e-05,1e-06,-1e-06,5e-06,-3e-06,-1e-06,-1e-06,4e-06,-1e-06,-6e-06,4e-06,4e-06,7e-06,3e-06,0,1e-06,1e-06,2e-06,2e-06,-1e-06,4e-06,-2e-06,-1.2e-05,-9e-06,0,5e-06,-5e-06,-1e-06,-1e-06,-3e-06,1e-05,1e-06,-6e-06,3e-06,0,7e-06,-1e-06,0,-1e-06,0,1.2e-05,7e-06,0,1e-06,-4e-06,-8e-06,0,-1e-06,-2e-06,1e-06,-3e-06,5e-06,3e-06,0,1e-06,8e-06,0,-1e-05,1e-06,1e-06,-3e-06,2e-06,-2e-06,0,2e-06,5e-06,1e-06,-1e-06,1e-06,-4e-06,-1e-06,5e-06,1e-06,2e-06,-1e-06,-2e-06,-1e-06,-1e-06,-4e-06,-6e-06,-4e-06
0,-3e-06,0,2e-06,-3e-06,1e-06,-1e-06,0,4e-06,1e-06,0,-5e-06,-2e-06,0,-8e-06,-4e-06,-3e-06,-3e-06,-6e-06,0,-3e-06,0,0,2e-06,-2e-06,-2e-06,-1e-05,2e-06,4e-06,4e-06,-6e-06,8e-06,3e-06,1e-06,2e-06,-2e-06,-5e-06,1.5e-05,0,-2e-06,-2e-06,0,-1e-06,-1e-06,1e-06,0,2e-06,-1e-06,0,-2e-06,-4e-06,2e-06,4e-06,-9e-06,0,0,0,1e-06,0,0,-2e-06,4e-06,1.1e-05,1.1e-05,-2e-06,3e-06,3e-06,0,3e-06,3e-06,-3e-06,-1e-06,4e-06,-4e-06,0,-2e-06,-3e-06,0,-1.2e-05,0,-3e-06,-1e-06,0,0,-1e-06,3e-06,-1e-06,0,3e-06,-2e-06,-4e-06,-4e-06,-1e-06,-6e-06,-1e-06,7e-06,-2e-06,8e-06,2e-06,1e-06,1.2e-05,-2e-06,-1e-06,5e-06,0,-1e-06,0,1e-06,-3e-06,-3e-06,1e-06,1e-06,0,0,0,1e-05,-1e-06,-1e-06,5e-06,2e-06,2e-06
1e-06,-2e-06,-2e-06,0,1e-06,-1e-06,0,3e-06,-8e-06,-3e-06,0,0,1e-06,2e-06,-7e-06,3e-06,5e-06,1e-06,-1e-06,1e-06,-1e-05,0,-6e-06,-3e-06,2e-06,-3e-06,5e-06,-2e-06,5e-06,-1.1e-05,-5e-06,-1e-06,-1e-06,-5e-06,-4e-06,2e-06,-1.3e-05,6e-06,1e-06,1e-06,-1e-06,-1e-06,1.1e-05,4e-06,0,-1e-06,3e-06,-4e-06,-5e-06,4e-06,2e-06,0,-5e-06,2e-06,1e-06,0,-1e-06,-1e-06,-1e-06,0,-5e-06,0,-9e-06,-4e-06,3e-06,2e-06,-1e-06,1e-06,-9e-06,-1e-06,-1e-05,1e-06,-5e-06,2e-06,0,-7e-06,-6e-06,3e-06,5e-06,-2e-06,6e-06,0,1e-06,-1e-06,2e-06,-1e-06,5e-06,1e-06,1e-06,0,2e-06,1e-06,-3e-06,7e-06,0,-1e-05,1e-06,-2e-06,1e-06,0,-1e-06,0,1e-06,2e-06,-1e-06,3e-06,-3e-06,1e-06,-1e-06,-1e-06,1e-06,-3e-06,-1e-06,1e-06,1e-06,0,1e-06,1e-06,1e-06,2e-06,2e-06
2e-06,1e-06,2e-06,-1e-06,3e-06,3e-06,0,-2e-06,1.2e-05,-1e-06,0,4e-06,0,0,-1e-06,-2e-06,3e-06,1e-06,4e-06,-1e-06,1.2e-05,0,1e-05,3e-06,-2e-06,-1e-06,8e-06,1e-06,-2e-06,2e-06,-1e-06,-1e-06,-2e-06,-4e-06,4e-06,-1e-06,8e-06,-1.1e-05,-2e-06,6e-06,-5e-06,0,-7e-06,1e-06,-3e-06,0,3e-06,-1e-06,-1e-06,-2e-06,2e-06,-2e-06,3e-06,8e-06,-2e-06,0,-1e-06,0,1e-06,0,1e-06,-2e-06,1.1e-05,5e-06,2e-06,-6e-06,0,0,1e-05,-1e-06,7e-06,0,4e-06,1e-06,0,6e-06,-1e-06,-2e-06,7e-06,0,-3e-06,2e-06,2e-06,-1e-06,2e-06,2e-06,-2e-06,-1e-06,-2e-06,1e-06,3e-06,2e-06,-2e-06,2e-06,-1e-06,1e-06,1e-06,-3e-06,-1e-06,0,-1e-05,-1e-06,-1e-06,-1e-06,2e-06,-9e-06,0,0,0,0,1e-06,7e-06,1e-06,-1e-06,-1e-06,-3e-06,0,0,-1e-06,-3e-06,0
0,1e-06,-6e-06,2e-06,-3e-06,-3e-06,0,-1e-06,-5e-06,2e-06,1e-06,-2e-06,-1e-06,0,7e-06,0,2e-06,2e-06,3e-06,1e-06,-5e-06,0,-1.2e-05,-5e-06,-1e-06,-1e-06,-2e-06,2e-06,-5e-06,1e-05,3e-06,-4e-06,-1e-06,-1e-06,-6e-06,-1e-06,6e-06,-1.1e-05,1e-06,-3e-06,7e-06,1e-06,0,-1e-06,3e-06,2e-06,1e-06,-3e-06,1e-06,-3e-06,-4e-06,-2e-06,0,-6e-06,2e-06,0,0,1e-06,1e-06,2e-06,2e-06,1e-06,-9e-06,-5e-06,0,-1e-06,2e-06,-1e-06,-5e-06,2e-06,3e-06,-1e-06,-1e-06,-4e-06,1e-06,-1e-06,-3e-06,-1e-06,-7e-06,0,5e-06,-5e-06,-1e-06,1e-06,1e-06,-4e-06,1e-06,-2e-06,1e-06,0,-1e-06,-5e-06,0,-8e-06,0,5e-06,-1e-06,4e-06,1e-06,0,4e-06,1e-06,2e-06,-5e-06,-2e-06,-1e-06,0,1e-06,1e-06,0,-1e-06,-6e-06,0,-1e-06,1e-06,-7e-06,0,0,-3e-06,0,0
-3e-06,1e-06,3e-06,-3e-06,2e-06,1e-06,-1e-06,-2e-06,2e-06,0,0,-3e-06,1e-06,-1e-06,6e-06,-1e-06,-4e-06,-1e-06,-1e-06,-1e-06,-5e-06,0,8e-06,5e-06,0,3e-06,-8e-06,-2e-06,4e-06,-1.2e-05,5e-06,-2e-06,0,2e-06,7e-06,2e-06,-6e-06,5e-06,-1e-06,-3e-06,-4e-06,-2e-06,-6e-06,-7e-06,-4e-06,0,1e-06,2e-06,3e-06,1e-06,3e-06,-2e-06,-2e-06,-4e-06,1e-06,0,0,0,-1e-06,-2e-06,-2e-06,2e-06,5e-06,0,0,7e-06,-2e-06,1e-06,-2e-06,-2e-06,-6e-06,-1e-06,1e-06,3e-06,0,2e-06,-1e-06,2e-06,-2e-06,0,-1e-06,8e-06,0,1e-06,-2e-06,4e-06,2e-06,-1e-06,2e-06,-2e-06,-3e-06,7e-06,2e-06,3e-06,0,-5e-06,0,-1e-06,0,-1e-06,6e-06,1e-06,-1e-06,1e-06,2e-06,0,0,1e-06,-2e-06,1e-06,-1e-06,-2e-06,0,1e-06,-1e-06,3e-06,0,0,1e-06,1e-06,0
1e-06,2e-06,0,3e-06,-2e-06,-1e-06,0,-1e-06,3e-06,1e-06,-1e-06,3e-06,-1e-06,1e-06,1e-06,2e-06,-2e-06,1e-06,-3e-06,0,-2e-06,0,0,-5e-06,-1e-06,1e-06,4e-06,2e-06,2e-06,4e-06,4e-06,2e-06,0,4e-06,-5e-06,-1e-06,-2e-06,1.3e-05,0,0,-1e-06,0,8e-06,2e-06,3e-06,0,-1e-06,3e-06,1e-06,2e-06,-1e-06,0,3e-06,8e-06,-2e-06,0,0,-1e-06,0,-2e-06,-1e-06,-3e-06,-6e-06,0,0,-2e-06,3e-06,0,4e-06,1e-06,1e-06,-2e-06,0,-1e-06,-1e-06,-5e-06,2e-06,-1e-06,3e-06,1e-06,6e-06,-2e-06,-1e-06,-1e-06,-2e-06,-1e-06,-3e-06,0,-3e-06,0,0,-9e-06,2e-06,2e-06,0,2e-06,0,-2e-06,-1e-06,-1e-06,-6e-06,0,-1e-06,3e-06,-1e-06,1e-06,-2e-06,-1e-06,0,2e-06,0,9e-06,0,1e-06,-1e-06,8e-06,0,0,3e-06,0,4e-06
1e-06,-1e-06,2e-06,-3e-06,3e-06,-2e-06,0,0,-6e-06,-3e-06,0,1e-06,1e-06,0,-3e-06,-1e-06,0,3e-06,-1e-06,0,6e-06,0,-3e-06,3e-06,0,-4e-06,8e-06,-1e-06,-6e-06,7e-06,0,2e-06,-1e-06,-5e-06,4e-06,1e-06,3e-06,1e-06,0,0,5e-06,2e-06,-2e-06,2e-06,-2e-06,0,-2e-06,0,1e-06,-3e-06,-1e-06,0,-4e-06,0,1e-06,0,0,-1e-06,1e-06,1e-06,2e-06,0,7e-06,1e-06,-1e-06,-3e-06,-3e-06,0,-5e-06,0,3e-06,2e-06,-3e-06,0,0,3e-06,1e-06,0,2e-06,0,-4e-06,-4e-06,1e-06,0,-1e-06,-3e-06,0,0,0,2e-06,2e-06,8e-06,1e-06,0,0,6e-06,-1e-06,3e-06,-1e-06,1e-06,-3e-06,0,0,2e-06,0,5e-06,-4e-06,0,-1e-06,2e-06,1e-06,-5e-06,-1e-06,0,1e-06,-1e-06,0,0,0,-2e-06,-4e-06
-1e-06,-2e-06,-1e-06,2e-06,-4e-06,2e-06,-1e-06,-1e-06,3e-06,3e-06,1e-06,-2e-06,0,-1e-06,-3e-06,0,3e-06,-3e-06,2e-06,0,-5e-06,0,-1e-06,-1e-06,-1e-06,2e-06,1e-06,1e-06,-1e-06,-9e-06,-3e-06,2e-06,-1e-06,-4e-06,-1e-06,-1e-06,4e-06,-1.2e-05,1e-06,3e-06,-4e-06,-2e-06,0,4e-06,0,0,-2e-06,3e-06,-1e-06,0,2e-06,1e-06,-2e-06,-7e-06,0,0,0,-1e-06,-1e-06,1e-06,0,2e-06,-7e-06,3e-06,-2e-06,-2e-06,1e-06,0,7e-06,-1e-06,-1e-06,2e-06,5e-06,2e-06,0,3e-06,4e-06,-1e-06,-1e-06,0,5e-06,5e-06,0,0,0,3e-06,-1e-06,1e-06,2e-06,0,0,-6e-06,-1e-06,0,0,-6e-06,0,-1e-06,1e-06,0,5e-06,0,0,-4e-06,1e-06,0,-2e-06,1e-06,0,1e-06,1e-06,-1e-06,0,0,-1e-06,-5e-06,0,0,-1e-06,2e-06,-1e-06
0,-1e-06,0,-1e-06,3e-06,-2e-06,-1e-06,-1e-06,-3e-06,-1e-06,1e-06,2e-06,0,0,0,1e-06,-1e-06,-2e-06,2e-06,0,-3e-06,0,4e-06,0,-1e-06,3e-06,-6e-06,-1e-06,6e-06,1e-06,-4e-06,-1e-06,0,0,-1e-06,1e-06,-5e-06,-7e-06,0,0,2e-06,-1e-06,-6e-06,3e-06,1e-06,-1e-06,-1e-06,-4e-06,-2e-06,2e-06,-3e-06,1e-06,3e-06,4e-06,0,0,0,1e-06,0,0,-3e-06,-1e-06,8e-06,-3e-06,0,5e-06,-1e-06,0,-6e-06,2e-06,-2e-06,-2e-06,-5e-06,-3e-06,0,-3e-06,0,2e-06,-3e-06,1e-06,-6e-06,-4e-06,-1e-06,0,1e-06,-2e-06,-1e-06,1e-06,-1e-06,-1e-06,-2e-06,4e-06,-1e-06,-2e-06,0,-3e-06,0,-2e-06,0,0,-1e-06,-1e-06,1e-06,-1e-06,-1e-06,-4e-06,0,0,1e-06,0,0,5e-06,0,0,1e-06,-4e-06,0,1e-06,-3e-06,0,1e-06
-1e-06,-2e-06,-2e-06,0,-4e-06,1e-06,0,1e-06,-1e-06,1e-06,0,3e-06,0,0,2e-06,-2e-06,-1e-06,2e-06,-1e-06,0,2e-06,0,-2e-06,1e-06,-1e-06,-1e-06,-1e-06,1e-06,2e-06,9e-06,-3e-06,-1e-06,1e-06,3e-06,2e-06,0,-2e-06,8e-06,1e-06,-1e-06,0,3e-06,3e-06,-8e-06,-1e-06,1e-06,0,-1e-06,-2e-06,-1e-06,2e-06,0,-2e-06,5e-06,-1e-06,0,0,1e-06,1e-06,0,-2e-06,-1e-06,-8e-06,2e-06,0,1e-06,0,0,1e-06,0,2e-06,0,6e-06,2e-06,0,-1e-06,1e-06,0,5e-06,0,2e-06,2e-06,-1e-06,0,1e-06,0,1e-06,0,-1e-06,-1e-06,0,-1e-06,-1e-06,-1e-06,0,7e-06,-1e-06,5e-06,0,0,-4e-06,1e-06,0,1e-06,1e-06,-3e-06,2e-06,0,-2e-06,0,-1e-06,-5e-06,0,0,0,4e-06,0,0,2e-06,-3e-06,1e-06
1e-06,0,1e-06,1e-06,4e-06,1e-06,0,1e-06,1e-06,-3e-06,0,-3e-06,0,0,1e-06,2e-06,-3e-06,-1e-06,-2e-06,0,0,0,-3e-06,0,-1e-06,-2e-06,5e-06,-1e-06,-6e-06,-8e-06,0,-2e-06,0,3e-06,-4e-06,-2e-06,5e-06,1.1e-05,0,-1e-06,2e-06,-1e-06,0,-4e-06,2e-06,-1e-06,1e-06,0,0,0,0,0,1e-06,-7e-06,1e-06,0,-1e-06,0,-1e-06,-1e-06,0,1e-06,7e-06,-5e-06,0,-6e-06,2e-06,0,5e-06,0,-1e-06,1e-06,-8e-06,0,0,4e-06,-1e-06,-1e-06,-3e-06,0,-6e-06,0,-1e-06,0,0,-2e-06,-2e-06,0,1e-06,1e-06,1e-06,-3e-06,0,3e-06,0,-3e-06,0,-4e-06,0,0,2e-06,1e-06,0,3e-06,0,-1e-06,1e-06,0,0,0,-1e-06,3e-06,0,0,0,5e-06,0,1e-06,0,2e-06,-2e-06
0,1e-06,-2e-06,-2e-06,-3e-06,-1e-06,0,0,2e-06,2e-06,0,-2e-06,-1e-06,0,-1e-06,-1e-06,2e-06,-1e-06,1e-06,0,-1e-06,0,6e-06,1e-06,0,1e-06,0,0,-1e-06,-4e-06,2e-06,2e-06,0,0,4e-06,1e-06,1e-06,-3e-06,0,1e-06,-6e-06,-1e-06,2e-06,5e-06,-1e-06,0,1e-06,-2e-06,1e-06,1e-06,-1e-06,0,3e-06,-2e-06,1e-06,0,0,0,0,0,-1e-06,1e-06,-5e-06,5e-06,1e-06,2e-06,-2e-06,0,-6e-06,0,0,0,8e-06,-2e-06,0,-3e-06,-4e-06,1e-06,0,1e-06,2e-06,-2e-06,1e-06,0,0,4e-06,2e-06,0,1e-06,0,0,4e-06,1e-06,1e-06,0,-4e-06,0,0,0,0,1e-06,-1e-06,-1e-06,-1e-06,0,0,-1e-06,0,0,-1e-06,0,4e-06,-1e-06,0,0,-1e-06,0,0,1e-06,1e-06,-1e-06
