1.8e-05,7e-06,1.9e-05,2.8e-05,1.2e-05,4e-06,2e-06,1.8e-05,7e-06,2e-06,0,1e-05,1.4e-05,6e-06,7e-06,4e-06,1e-05,1e-06,3.3e-05,6e-06,1.3e-05,9e-06,5e-06,1.2e-05,1.4e-05,1.5e-05,1.1e-05,8e-06,1.2e-05,1e-06,2e-06,1.1e-05,1.7e-05,4e-06,5e-06,8e-06,2e-06,2e-06,2.6e-05,5e-06,1.5e-05,2.1e-05,0,5e-06,1.8e-05,1.4e-05,4e-06,2e-06,1e-06,1.4e-05,1.3e-05,3e-05,1.2e-05,0,9e-06,2e-06,1e-05,9e-06,6e-06,5e-06,4e-06,1.1e-05,2.4e-05,3.2e-05,3.2e-05,3.5e-05,4.1e-05,1.2e-05,8e-06,2.4e-05,1e-06,6e-06,1e-06,1.1e-05,4.2e-05,1.3e-05,3.7e-05,1.5e-05,4e-06,5e-05,6e-06,8e-06,1.4e-05,4e-06,3.8e-05,3.1e-05,1.7e-05,1.8e-05,0,4.3e-05,1e-05,1e-05,1.6e-05,5e-06,7e-06,2.1e-05,2.2e-05,3e-06,6e-06,2.3e-05,1.5e-05,8e-06,2.3e-05,1e-06,9e-06,1.9e-05,3e-05,1e-05,2.8e-05,5e-06,6e-06,2.9e-05,1.1e-05,4.3e-05,2.2e-05,8e-06,3e-06,4.5e-05,1.9e-05,1.5e-05,4.8e-05
2.2e-05,4e-05,8e-05,9.6e-05,2.1e-05,1.7e-05,3.6e-05,5.6e-05,2.5e-05,2.8e-05,1.3e-05,3.3e-05,5.4e-05,4.5e-05,2.8e-05,2.8e-05,5.1e-05,9e-06,6.1e-05,2.6e-05,1.4e-05,2.1e-05,2.9e-05,6.2e-05,3.3e-05,5.1e-05,3.3e-05,4.1e-05,2.3e-05,2e-05,2.5e-05,2.4e-05,6.4e-05,1.2e-05,2.3e-05,3.2e-05,5.3e-05,1.3e-05,4.7e-05,4.9e-05,2e-05,7.5e-05,3.1e-05,1.4e-05,5.7e-05,5.1e-05,1.8e-05,6e-06,2.3e-05,2.3e-05,2.8e-05,6.9e-05,4.3e-05,7e-06,2.8e-05,3.4e-05,5e-05,2e-05,3.3e-05,5e-05,1.7e-05,1e-05,5.5e-05,6e-05,0.000102,0.000119,0.000121,5.5e-05,5.1e-05,7.3e-05,5.3e-05,2.2e-05,3.7e-05,4.6e-05,8.1e-05,1.6e-05,0.000107,2e-05,8e-06,0.000127,2.6e-05,3.8e-05,4.9e-05,5.5e-05,0.000113,8.4e-05,5.4e-05,6.2e-05,2.8e-05,9.1e-05,5.5e-05,2.8e-05,8e-06,5e-05,8.3e-05,3.9e-05,6.1e-05,4.3e-05,3.3e-05,6.7e-05,9.2e-05,5.7e-05,0.000103,7e-05,1.8e-05,3.8e-05,3.2e-05,2.7e-05,6e-05,4.7e-05,2.9e-05,3.4e-05,3.4e-05,8.1e-05,2.5e-05,1.4e-05,2e-05,9.4e-05,2.5e-05,5.1e-05,6.5e-05
1.9e-05,5.2e-05,4.6e-05,3.7e-05,6.2e-05,3.2e-05,2.9e-05,3.1e-05,5e-05,3.3e-05,3.3e-05,4.2e-05,3e-05,6.3e-05,6e-05,1.5e-05,3.5e-05,6.2e-05,8.9e-05,6.4e-05,2.9e-05,1.4e-05,4.5e-05,7.3e-05,4.4e-05,5.2e-05,2.6e-05,7.7e-05,5.4e-05,2.8e-05,2.7e-05,2.7e-05,6.8e-05,3.9e-05,2.6e-05,8.6e-05,3.3e-05,5.4e-05,1.4e-05,9.5e-05,7.4e-05,8.9e-05,6.7e-05,4.3e-05,9e-05,7e-06,3.2e-05,1.9e-05,4.5e-05,4.7e-05,6.1e-05,9.4e-05,4.2e-05,3.2e-05,4.3e-05,1.7e-05,5.1e-05,7.1e-05,3.2e-05,3.7e-05,1.2e-05,3.9e-05,7.4e-05,6.4e-05,0.000103,9.2e-05,0.000129,8.9e-05,4.6e-05,7.4e-05,9.4e-05,5.7e-05,2.3e-05,7.3e-05,0.00012,6.5e-05,7.3e-05,8.1e-05,7.2e-05,0.000174,2.3e-05,4.3e-05,4.1e-05,8.7e-05,0.000119,7.7e-05,7e-06,1.6e-05,4e-05,5.8e-05,0.000103,4.4e-05,5.4e-05,5.7e-05,7e-05,7.7e-05,9e-05,6.9e-05,7.2e-05,2.5e-05,8.3e-05,0.000137,0.000113,4.1e-05,3.5e-05,4e-06,9.7e-05,1e-05,3.9e-05,1.6e-05,6.7e-05,4.9e-05,2.3e-05,0.000109,8.2e-05,3.1e-05,4.8e-05,4.2e-05,2.1e-05,4.6e-05,0.000128
4.3e-05,7.8e-05,2.5e-05,4e-05,3.4e-05,3e-05,4.3e-05,5.8e-05,5.9e-05,8.7e-05,6.2e-05,7.9e-05,9.7e-05,5.8e-05,5e-06,3.9e-05,2.1e-05,6.6e-05,8.2e-05,0.000102,7.5e-05,2.1e-05,1.3e-05,7.1e-05,5.1e-05,5.4e-05,6.2e-05,7.1e-05,1.4e-05,5.9e-05,6.6e-05,5.3e-05,5.9e-05,2.7e-05,5.3e-05,9.2e-05,9.1e-05,7.9e-05,8e-05,7.3e-05,4.5e-05,0.000129,0.000135,0.00016,6.2e-05,0.000109,7.1e-05,7.9e-05,6.5e-05,5.5e-05,7.9e-05,6.7e-05,0.000148,0.00012,6.5e-05,3.7e-05,6.5e-05,8.8e-05,5.6e-05,5.9e-05,2.2e-05,1.8e-05,4.4e-05,4.4e-05,0.000186,0.000117,9.9e-05,0.000155,0.00015,1.8e-05,6.2e-05,6e-05,4.4e-05,5.7e-05,6.7e-05,9.5e-05,2.7e-05,0.000136,3.9e-05,0.000114,9e-05,7.4e-05,4.2e-05,3.7e-05,9.3e-05,5.4e-05,8.2e-05,6.8e-05,7.1e-05,0.000158,0.000137,9.4e-05,8.6e-05,3.4e-05,7.6e-05,6.5e-05,4.1e-05,2.4e-05,9.3e-05,0.000153,1.8e-05,7.9e-05,6e-05,4e-06,3.4e-05,2.7e-05,0.000104,7.9e-05,3.9e-05,7.2e-05,0.000185,5.7e-05,6.8e-05,8.3e-05,7.5e-05,0.000114,5.8e-05,8.5e-05,6.3e-05,6.5e-05,9.9e-05
4.1e-05,4.3e-05,3.3e-05,1.5e-05,1.5e-05,4.8e-05,5e-05,5.6e-05,4.5e-05,5.1e-05,2.1e-05,2.3e-05,3e-05,2.5e-05,3.6e-05,2.6e-05,4.1e-05,2.2e-05,2e-05,3.9e-05,6e-05,1.8e-05,4.2e-05,0.000106,3.2e-05,3.1e-05,3e-05,2.8e-05,4.6e-05,8.1e-05,6.2e-05,2.8e-05,4.6e-05,4.6e-05,5.3e-05,2.9e-05,6.7e-05,2.5e-05,2.2e-05,3e-05,3.5e-05,1e-04,7.2e-05,9.3e-05,5.4e-05,7.2e-05,3.5e-05,9.3e-05,9.5e-05,6.4e-05,0.000108,8.8e-05,0.00012,4.9e-05,3.9e-05,0.000116,0.000109,4.9e-05,2.9e-05,8.8e-05,8.5e-05,7.2e-05,5.1e-05,0.000153,8.2e-05,0.000139,0.000116,0.000219,4.3e-05,9.2e-05,6.1e-05,5e-05,2.3e-05,2.9e-05,8.9e-05,0.000253,7.7e-05,0.000112,0.000152,0.000191,0.000206,0.000185,7.4e-05,1.1e-05,4.1e-05,0.000144,0.000185,6.7e-05,6.1e-05,0.000153,7.7e-05,0.000138,4.3e-05,5.2e-05,2.2e-05,7.8e-05,6.4e-05,1.3e-05,2.2e-05,0.000186,0.000171,0.000114,0.00013,5.6e-05,7.4e-05,4.1e-05,3.4e-05,5.3e-05,1e-05,0.000109,0.000214,0.000169,5.9e-05,5.4e-05,2.2e-05,5.2e-05,6.9e-05,0.000205,5.8e-05,3.2e-05,0.00017
3.9e-05,3.8e-05,3e-05,1.3e-05,7e-06,5.8e-05,4e-05,3.3e-05,2.6e-05,5.2e-05,3e-05,1.4e-05,4.3e-05,9e-06,4e-05,7.4e-05,3.4e-05,5.7e-05,6.7e-05,6.8e-05,6.2e-05,3.8e-05,8.2e-05,7.2e-05,7.7e-05,0.000118,6.3e-05,2.9e-05,2.8e-05,7.7e-05,8.1e-05,6.3e-05,3.2e-05,3.8e-05,2.3e-05,3.4e-05,4.7e-05,6.5e-05,9.1e-05,0.00014,0.000124,0.000131,0.000118,0.000139,0.000197,0.000198,0.000152,0.000135,2.2e-05,5.9e-05,0.000144,7.2e-05,0.000135,0.000114,0.000185,0.000115,4e-05,6.4e-05,9.8e-05,0.000163,0.000112,0.000134,4.2e-05,0.000269,2.1e-05,0.000192,0.00022,0.00011,0.000152,8.3e-05,0.000128,0.000127,0.000104,0.000107,0.000108,0.000202,0.000165,5.5e-05,0.000109,0.000259,0.000269,0.000139,9.7e-05,4.1e-05,8.8e-05,0.000159,0.000123,6.7e-05,3.3e-05,0.000128,0.000222,0.000181,0.000149,0.000105,9.3e-05,5.6e-05,7.3e-05,0.000102,0.000146,0.000166,7.6e-05,0.000124,0.000164,6.4e-05,7.6e-05,0.000124,0.000117,6.8e-05,9.8e-05,6.5e-05,0.000121,8.2e-05,3e-05,0.00012,0.000128,0.000103,2e-05,0.000344,0.000169,1.4e-05,1e-04
5.9e-05,3.9e-05,2.5e-05,3.3e-05,2.3e-05,4.5e-05,2.1e-05,2.5e-05,2.8e-05,1.3e-05,6.5e-05,5.8e-05,8.3e-05,5.9e-05,3e-06,6.2e-05,7.6e-05,7e-05,0.000161,0.00014,0.000163,8.8e-05,6.3e-05,4.1e-05,4.9e-05,9.1e-05,1.2e-05,7e-06,1e-05,5.3e-05,9.5e-05,0.000169,6.5e-05,6.1e-05,1.3e-05,6.1e-05,7.3e-05,3.7e-05,0.000123,0.000104,8.8e-05,3.1e-05,6.7e-05,0.000152,0.000116,5.4e-05,4.3e-05,7.6e-05,0.000124,0.000192,0.000183,0.000231,0.000183,0.000227,0.000265,0.000208,0.000189,2.3e-05,9.3e-05,0.000117,5e-05,0.000212,0.000187,0.000325,0.000498,0.000336,0.000104,0.000122,0.000101,0.000209,0.00015,7.2e-05,0.000219,0.000188,0.000105,0.000114,0.000122,0.000326,0.000106,0.000338,0.000124,0.000263,0.000303,0.000187,0.000274,0.000361,0.000168,1.9e-05,8.1e-05,0.000102,0.000108,0.000228,0.000237,0.000227,0.000121,7.2e-05,8.1e-05,5.4e-05,0.00021,0.000325,0.000386,0.000275,0.000353,0.000198,0.000141,0.000103,0.000187,6e-05,0.000101,0.000151,5.6e-05,0.000191,9.8e-05,0.000135,0.000161,0.000244,0.000234,0.000385,0.000339,0.000248,0.000172
5.2e-05,0.000122,0.000118,0.000115,9.6e-05,3.8e-05,3.9e-05,5.5e-05,3.1e-05,6.8e-05,0.000102,7.4e-05,1.9e-05,0.000109,8.1e-05,9.2e-05,0.000101,9.3e-05,0.000213,5.3e-05,9e-05,4.4e-05,3.4e-05,2.7e-05,9e-06,0.000116,0.000141,7e-05,6.9e-05,6.3e-05,6.4e-05,0.000108,0.000156,0.000129,0.000105,1.1e-05,0.000136,0.000163,0.000166,0.000239,0.000103,6.7e-05,5.2e-05,5.6e-05,0.000203,0.000162,0.000117,6.8e-05,0.00011,0.000152,0.000139,6.7e-05,8.9e-05,0.000184,4.5e-05,4.8e-05,0.000148,0.000154,0.000134,0.000162,0.000117,0.000204,8.8e-05,0.000103,0.00034,0.000346,0.000349,0.000184,0.000108,0.000204,0.000158,0.000169,6.9e-05,0.000149,8.4e-05,0.000258,0.000245,0.000231,0.000349,8.8e-05,0.00017,0.000285,0.000108,0.000113,0.000364,0.000407,0.000189,0.000145,6.2e-05,0.000107,0.000115,0.000256,0.000207,6.8e-05,0.000262,0.000139,0.000214,0.00022,0.000335,0.000198,0.000222,0.000163,0.000215,9.4e-05,0.000179,0.000135,0.000188,0.000134,9.9e-05,0.000156,0.000203,0.000165,0.000177,8.5e-05,0.000122,0.000223,7.7e-05,0.000185,0.000232,3.1e-05,0.000148
2.3e-05,0.000111,0.000206,0.00012,7.9e-05,0.000103,2.6e-05,7.9e-05,8.4e-05,4.8e-05,4.7e-05,3.5e-05,3.3e-05,9.2e-05,0.000119,0.000101,6.9e-05,4.3e-05,0.000118,0.000125,2e-05,6.6e-05,5e-05,3.5e-05,2.8e-05,0.000107,0.00017,0.000114,8e-05,0.000115,1.8e-05,0.000109,0.000148,0.000156,7.2e-05,5.9e-05,0.000141,0.000198,0.000164,5.1e-05,5.5e-05,8.8e-05,7.4e-05,4e-05,0.000137,0.000186,7e-05,0.000103,9.8e-05,0.000214,0.00011,2.2e-05,0.000172,0.00013,6.4e-05,9.6e-05,0.000143,0.000114,6.9e-05,0.000157,0.000147,0.00013,0.000118,7.3e-05,0.000268,0.000175,0.000116,0.000152,0.000141,0.000196,9.6e-05,0.000179,0.000174,0.000206,0.000213,0.000347,0.000325,0.00042,0.000124,0.00025,0.000256,4.1e-05,3.8e-05,0.000191,0.000406,2.4e-05,0.000121,0.000344,0.000353,0.000365,0.000379,0.00042,0.00012,0.000125,0.000239,0.000282,0.000287,0.000141,0.000206,0.000183,0.000194,0.000243,0.000115,6.5e-05,0.000126,0.000254,0.000403,0.000288,0.000242,0.000218,0.000322,0.000281,0.000136,4.3e-05,0.000125,0.000103,0.000268,0.000505,0.000354,0.000213,0.000272
8.2e-05,9.3e-05,5.5e-05,4e-05,2.9e-05,9.2e-05,9.2e-05,7.1e-05,0.00012,6.3e-05,5.1e-05,5.2e-05,5e-05,2.7e-05,7.7e-05,5e-05,2.8e-05,5.3e-05,2.6e-05,6.7e-05,4e-05,6e-05,0.000124,0.000143,0.000116,8.9e-05,9.3e-05,0.000115,8.6e-05,7.9e-05,8.6e-05,0.000128,0.000185,3.6e-05,2.6e-05,7e-05,4.8e-05,9.6e-05,2.8e-05,9e-06,3.9e-05,0.000111,4.4e-05,3.9e-05,4.8e-05,0.000108,0.000153,6.9e-05,6.3e-05,0.000116,5.9e-05,8e-05,0.000326,0.000182,5.7e-05,0.000182,0.000153,6.1e-05,4.9e-05,0.000198,0.000196,0.000143,0.000165,1.3e-05,0.000125,0.000275,0.000177,0.000191,0.000194,0.000116,1.4e-05,0.000103,0.000124,0.000178,2.5e-05,0.000195,0.000122,8.8e-05,5.4e-05,0.000298,0.000141,3e-05,2.4e-05,0.000148,0.000242,0.000268,0.000195,0.000281,0.000172,0.000162,9.1e-05,0.000234,0.000208,0.000103,0.000103,0.000142,0.000153,0.000132,3.5e-05,6.5e-05,0.000208,6.3e-05,6.6e-05,0.000165,9.7e-05,0.000168,0.000218,0.000136,4.2e-05,0.000178,4.9e-05,3.2e-05,8e-05,0.00012,5.6e-05,0.000142,0.000223,0.000291,0.000227,0.000131,0.000174
3.4e-05,2.9e-05,1.1e-05,2e-05,3.9e-05,6e-05,4.4e-05,8.4e-05,6.8e-05,5e-05,6.5e-05,2.4e-05,6e-06,7e-06,5.6e-05,4.2e-05,3e-05,3.9e-05,2.9e-05,3.3e-05,5.6e-05,7.4e-05,3.2e-05,5.3e-05,3.5e-05,4.1e-05,5.5e-05,4.7e-05,2.2e-05,4.8e-05,7.4e-05,5.4e-05,8.5e-05,0.000124,0.000115,8.9e-05,0.000122,3.1e-05,2.9e-05,3.4e-05,4.4e-05,6.3e-05,0.000114,9e-05,8e-05,6.4e-05,5.7e-05,4.9e-05,5.3e-05,2.3e-05,3.2e-05,0.000162,0.000258,0.000155,0.000211,0.000147,0.000138,0.000119,3.3e-05,0.00014,7.8e-05,0.000167,0.000168,0.000194,0.000236,0.000137,0.00023,0.000327,0.000122,4.9e-05,2.6e-05,5.4e-05,0.000196,1.9e-05,6.3e-05,0.000115,0.000205,0.000161,9.8e-05,0.000186,0.000187,0.000146,9.7e-05,0.000112,0.000107,0.000157,9.8e-05,0.000147,0.00013,6.3e-05,0.00015,0.000152,8.3e-05,2.2e-05,4.4e-05,0.000136,9.2e-05,6.3e-05,8.6e-05,5.5e-05,0.000196,0.000103,9.1e-05,0.000123,8.5e-05,0.000105,0.000185,9.1e-05,8.5e-05,6.8e-05,0.000155,0.000195,0.000215,7.7e-05,6.8e-05,0.000102,5.1e-05,0.000217,4.9e-05,3.2e-05,9.5e-05
2.3e-05,2.5e-05,1.7e-05,1.2e-05,3.7e-05,2.5e-05,9e-06,4.6e-05,4e-05,1.5e-05,3.7e-05,1.7e-05,1.1e-05,1.5e-05,1.6e-05,1e-05,1.1e-05,2.5e-05,6e-06,2.6e-05,9e-06,2.9e-05,2.2e-05,9e-06,3e-05,2.6e-05,2.5e-05,1.3e-05,2.4e-05,1.6e-05,2.9e-05,1.4e-05,4e-05,6e-05,3.8e-05,5.1e-05,6.8e-05,3.3e-05,1.1e-05,2e-05,1.6e-05,3e-05,4.5e-05,9e-06,2.9e-05,2.5e-05,6.2e-05,3.7e-05,8e-06,5.8e-05,5.6e-05,8.8e-05,5e-05,2e-05,8.5e-05,7.6e-05,3.7e-05,3.9e-05,4.3e-05,8e-05,6.1e-05,0.000105,1.8e-05,7.5e-05,0.000101,1e-04,0.000127,7.8e-05,1.5e-05,3.8e-05,5.9e-05,4e-05,8.2e-05,4.4e-05,5.9e-05,5e-05,7.3e-05,6.6e-05,0.000102,9.7e-05,0.000103,4.9e-05,7.6e-05,2.6e-05,8e-05,8.6e-05,1.4e-05,3.2e-05,6.5e-05,7.7e-05,0.00014,3.2e-05,3.3e-05,3.4e-05,4.5e-05,6.5e-05,1.3e-05,4.9e-05,9e-05,5.5e-05,0.000117,5.9e-05,7.6e-05,6.4e-05,5.2e-05,2.8e-05,7.7e-05,1e-06,4.2e-05,4.4e-05,0.000139,0.000113,3.3e-05,3.4e-05,8.9e-05,0.000135,5.2e-05,8.6e-05,3.9e-05,7.6e-05,4.1e-05
1.6e-05,7e-06,2.2e-05,5e-06,3e-05,1.4e-05,2.5e-05,1.6e-05,1.9e-05,1.4e-05,3.2e-05,1.9e-05,7e-06,2.1e-05,7e-06,1.4e-05,5e-06,2e-05,8e-06,1e-05,1e-05,9e-06,1.4e-05,1.8e-05,8e-06,1.1e-05,1e-05,5e-06,2.8e-05,2.9e-05,3e-05,1.5e-05,1.9e-05,3.6e-05,1.3e-05,3.4e-05,4.6e-05,1.9e-05,7e-06,1.4e-05,1.2e-05,7e-06,2.6e-05,2.6e-05,2.2e-05,1.2e-05,3.7e-05,2.6e-05,3e-06,6.4e-05,1.9e-05,5e-05,5.9e-05,2.2e-05,8e-06,4.4e-05,4e-05,8e-06,2.2e-05,4.4e-05,6.1e-05,6.1e-05,1e-05,6.6e-05,9.7e-05,7.5e-05,5e-05,3.7e-05,2.7e-05,1.7e-05,4.4e-05,5.4e-05,2.6e-05,3.3e-05,3.8e-05,1.7e-05,6.8e-05,5.4e-05,8.9e-05,5.3e-05,5.2e-05,5.3e-05,2.3e-05,1.6e-05,9.8e-05,3.7e-05,2e-05,3.6e-05,4.7e-05,3.4e-05,5.7e-05,1.9e-05,1.7e-05,3.2e-05,4.4e-05,8e-05,6.4e-05,9.6e-05,3.6e-05,6.2e-05,8.1e-05,4.4e-05,5.8e-05,2.4e-05,3.4e-05,4.3e-05,3.2e-05,2.6e-05,5.3e-05,6e-05,7.6e-05,3.8e-05,1.5e-05,4.1e-05,6.2e-05,2.4e-05,7.6e-05,9.7e-05,2.2e-05,5.1e-05,1e-05
2.1e-05,5e-06,8e-06,1.5e-05,1.2e-05,1.7e-05,2.2e-05,1.2e-05,8e-06,1.3e-05,3.2e-05,4.5e-05,4e-05,8e-06,1e-05,1.3e-05,7e-06,1.1e-05,5e-06,1.3e-05,3.6e-05,2.1e-05,3.2e-05,1.6e-05,1.5e-05,1e-06,1.8e-05,1.6e-05,3.5e-05,1.9e-05,2.8e-05,2.4e-05,2.1e-05,2.8e-05,7e-06,2.5e-05,4.1e-05,3.3e-05,1e-05,2.6e-05,3.8e-05,1e-05,1.8e-05,2.3e-05,2.8e-05,8e-06,3.1e-05,3.2e-05,3.6e-05,3.5e-05,3.1e-05,4.5e-05,4.5e-05,2.1e-05,2e-05,3e-05,1.4e-05,5e-06,2.7e-05,3e-05,5.3e-05,2.5e-05,4.4e-05,6.9e-05,7.8e-05,8.2e-05,6.9e-05,3.8e-05,2.3e-05,9e-06,1.9e-05,3.9e-05,1.9e-05,1.6e-05,2.4e-05,3.1e-05,3.1e-05,7.2e-05,7.1e-05,7.5e-05,5.9e-05,2.4e-05,7e-06,1.9e-05,5.7e-05,1.2e-05,3.2e-05,2.3e-05,2e-05,5e-05,2.9e-05,2.2e-05,2.4e-05,4.6e-05,5.9e-05,3.8e-05,9e-06,4.7e-05,4e-05,1.1e-05,4.7e-05,1.1e-05,4.2e-05,3.3e-05,3.6e-05,0,4.7e-05,3e-06,3.6e-05,3.6e-05,7.8e-05,3.7e-05,1.3e-05,5.7e-05,3.8e-05,2.8e-05,4.2e-05,6.2e-05,4e-05,9e-06,3.3e-05
1.7e-05,2.2e-05,3.4e-05,1.1e-05,8e-06,1.2e-05,1.7e-05,1.7e-05,2.2e-05,1.5e-05,1.5e-05,3.1e-05,2.5e-05,3e-05,1.1e-05,8e-06,1.1e-05,1.9e-05,2.8e-05,2.2e-05,2.6e-05,1.9e-05,1.4e-05,3.6e-05,2.3e-05,1.8e-05,1.5e-05,2e-05,9e-06,1.4e-05,3.2e-05,1.7e-05,1.3e-05,2.9e-05,1.6e-05,2.8e-05,7e-06,1.1e-05,1.4e-05,2.4e-05,2.6e-05,3.3e-05,2.6e-05,1.1e-05,1.8e-05,1.8e-05,1.5e-05,8e-06,2.4e-05,4.9e-05,1.9e-05,3.7e-05,2.5e-05,8e-06,1.5e-05,3.2e-05,2.4e-05,2.5e-05,3.8e-05,1.9e-05,6e-05,4.1e-05,3.8e-05,5.5e-05,9.5e-05,9.6e-05,3.5e-05,2.7e-05,3.8e-05,2.3e-05,6.1e-05,4.3e-05,4.6e-05,4.4e-05,1e-05,4.2e-05,6.4e-05,5.7e-05,2.6e-05,1.3e-05,6.5e-05,1.8e-05,6.3e-05,1.9e-05,4.8e-05,2.1e-05,2e-05,3.1e-05,5.8e-05,3.9e-05,1.5e-05,2.4e-05,1e-05,4.2e-05,2.8e-05,4.5e-05,2.3e-05,5e-06,7.9e-05,7e-06,2.7e-05,3.7e-05,1.7e-05,1.2e-05,3e-05,4.5e-05,4.6e-05,1.4e-05,4e-05,3.9e-05,4.5e-05,3.1e-05,1.4e-05,4.6e-05,3.4e-05,3.6e-05,2.1e-05,4e-05,7.8e-05,5.8e-05,5.4e-05
7e-06,2.2e-05,1.6e-05,2.6e-05,9e-06,1.9e-05,2.6e-05,3.3e-05,1.2e-05,2.1e-05,3.9e-05,3.5e-05,2.7e-05,3.3e-05,3.6e-05,2.8e-05,4e-06,2.6e-05,3e-05,1.5e-05,1.7e-05,1.8e-05,2e-05,3e-05,2.8e-05,1.6e-05,2.3e-05,4.4e-05,3.2e-05,2.9e-05,4.7e-05,6e-06,1.8e-05,1.9e-05,1.6e-05,2.8e-05,2.8e-05,7e-06,1.2e-05,3e-05,6e-06,3e-05,3.8e-05,3.6e-05,2.7e-05,9e-06,1.5e-05,2.1e-05,6e-06,6.5e-05,6.3e-05,6e-05,2.1e-05,2.1e-05,1.6e-05,2.5e-05,3.9e-05,1.1e-05,3.4e-05,5.5e-05,5.3e-05,5.8e-05,1.7e-05,3.7e-05,5.5e-05,5.1e-05,2.3e-05,8.8e-05,1.6e-05,5.1e-05,4.3e-05,3.8e-05,4.9e-05,7e-05,4.2e-05,8.3e-05,4.7e-05,2.3e-05,2.3e-05,4.5e-05,5.8e-05,4e-06,4.6e-05,4e-05,6.1e-05,2.7e-05,2.8e-05,2.8e-05,3.4e-05,1.1e-05,2.6e-05,3.3e-05,4.4e-05,4.8e-05,5.2e-05,8.7e-05,3.6e-05,2.3e-05,3.4e-05,5.7e-05,4.5e-05,3.1e-05,1.1e-05,3.7e-05,6.6e-05,5.4e-05,1.7e-05,2.9e-05,4.1e-05,5.8e-05,3.5e-05,1.9e-05,1.9e-05,2.8e-05,4.6e-05,3e-05,5.4e-05,2.2e-05,7.6e-05,3.2e-05,4.2e-05
4e-06,3.2e-05,1.5e-05,1.5e-05,1.8e-05,1.5e-05,1.8e-05,4.7e-05,3.4e-05,2.7e-05,3.2e-05,6.6e-05,5e-05,5.1e-05,9e-06,1.4e-05,2.2e-05,3e-05,6.7e-05,3.4e-05,3.3e-05,5e-06,1e-06,1.4e-05,1e-05,1.8e-05,4e-05,5.9e-05,2.5e-05,1.4e-05,6.3e-05,5.8e-05,3.9e-05,3.4e-05,3.8e-05,3.1e-05,4.1e-05,5e-06,2.6e-05,3.2e-05,4e-05,2.2e-05,1.8e-05,1.9e-05,9e-06,1.4e-05,2.7e-05,1.9e-05,1.8e-05,5.3e-05,3.2e-05,5.3e-05,1.4e-05,1.9e-05,4.4e-05,2.7e-05,4.4e-05,3e-06,2.8e-05,5.5e-05,2.5e-05,2.9e-05,4.3e-05,5.3e-05,7.5e-05,6.7e-05,4.4e-05,7.2e-05,6.8e-05,1.2e-05,4.9e-05,7e-05,7e-06,6.5e-05,8.3e-05,4.8e-05,8.9e-05,1.6e-05,1.1e-05,1.9e-05,7.1e-05,5.9e-05,2.6e-05,4.7e-05,1.8e-05,3.6e-05,3.9e-05,9e-06,1.1e-05,1.8e-05,1.7e-05,3.9e-05,1.9e-05,9.5e-05,8.8e-05,2e-05,1.3e-05,2.4e-05,2.4e-05,2e-05,4.7e-05,2.5e-05,9e-06,6e-05,4.7e-05,2.4e-05,3.5e-05,3.2e-05,3e-05,2.2e-05,4.9e-05,4e-05,4.9e-05,5.6e-05,3.8e-05,4.7e-05,4e-05,4.2e-05,6.1e-05,6.4e-05,1.7e-05
2e-06,3e-05,3.1e-05,1.5e-05,1e-05,2e-05,5e-06,3e-05,2.2e-05,9e-06,3.8e-05,2.9e-05,2e-05,1.2e-05,3e-05,2.3e-05,2.5e-05,1.9e-05,4.3e-05,2.3e-05,2.4e-05,2.6e-05,2e-05,1.1e-05,1.9e-05,1.9e-05,4.4e-05,7e-06,6e-06,8e-06,4.8e-05,3.4e-05,9e-06,2.4e-05,7e-06,2.8e-05,5e-06,2.3e-05,6e-06,4.1e-05,3.3e-05,3.2e-05,2e-05,6e-06,2.3e-05,7e-06,2e-05,3e-05,8e-06,3.3e-05,2.5e-05,3.5e-05,2.8e-05,3.4e-05,9e-06,3.6e-05,1.3e-05,5e-05,1.3e-05,2.9e-05,1.8e-05,3.6e-05,1.4e-05,4.9e-05,0.000104,7.1e-05,0.000123,3.4e-05,6.4e-05,5.4e-05,8e-06,4.5e-05,3.9e-05,5.4e-05,8.2e-05,0.000119,0.000102,0.00013,5.4e-05,3.1e-05,3.8e-05,1.3e-05,6.1e-05,3.3e-05,2e-05,4.1e-05,2.7e-05,1.3e-05,2.9e-05,1.3e-05,7e-06,7e-06,1.9e-05,6e-05,2.3e-05,2e-06,3.7e-05,1e-05,4.2e-05,3.6e-05,1.9e-05,1.6e-05,2.2e-05,4e-05,6.1e-05,2.6e-05,2.6e-05,1.1e-05,2.5e-05,2.8e-05,3.8e-05,2.8e-05,2.4e-05,1.4e-05,1.4e-05,3.8e-05,7.5e-05,4.5e-05,5.6e-05,2.3e-05,3.3e-05
2e-05,1.2e-05,2.3e-05,1.8e-05,1.2e-05,2.7e-05,2.4e-05,3e-06,1.3e-05,2.1e-05,9e-06,1.3e-05,1.4e-05,7e-06,2.1e-05,2.5e-05,3.2e-05,2.1e-05,3.8e-05,2.8e-05,1.2e-05,7e-06,2.5e-05,2.2e-05,9e-06,1.9e-05,1.9e-05,9e-06,7e-06,1.2e-05,1.3e-05,1.9e-05,3e-06,1.7e-05,1.6e-05,2.5e-05,3.1e-05,3.2e-05,1.4e-05,3e-05,1.9e-05,9e-06,1.7e-05,2e-05,8e-06,2.5e-05,1e-05,3.1e-05,2.7e-05,1.2e-05,1.6e-05,3.5e-05,1.9e-05,1.9e-05,3e-06,4e-05,1.5e-05,4.3e-05,2.9e-05,2e-05,1.4e-05,2.7e-05,2.7e-05,6.7e-05,4.2e-05,3.7e-05,0.000141,5.8e-05,5.4e-05,3.9e-05,6e-06,3e-05,6.2e-05,2e-05,6.4e-05,1.8e-05,5.6e-05,7.9e-05,4.1e-05,5.3e-05,3.1e-05,5.4e-05,7.2e-05,3.1e-05,2.6e-05,4e-06,4.1e-05,3.1e-05,1.9e-05,5.2e-05,4.6e-05,5.5e-05,5.1e-05,5e-06,3.1e-05,4.8e-05,5.4e-05,5.6e-05,2.1e-05,5.4e-05,3.6e-05,3.3e-05,3.3e-05,3.4e-05,3.6e-05,4.3e-05,3e-05,4.3e-05,2.1e-05,1.7e-05,3.9e-05,3.4e-05,3.3e-05,2.3e-05,2.2e-05,7e-06,3.9e-05,3.9e-05,5e-05,2.4e-05,2.9e-05
2.4e-05,3.6e-05,2.3e-05,5e-06,6e-06,1.7e-05,1.2e-05,1.3e-05,6e-06,1.8e-05,2.4e-05,2.6e-05,2.3e-05,4.1e-05,1.4e-05,1.2e-05,2.4e-05,2.5e-05,1.4e-05,2.5e-05,6e-06,1.6e-05,2.6e-05,1e-05,5e-06,2.4e-05,1.9e-05,8e-06,9e-06,1.1e-05,1.3e-05,2.6e-05,2e-05,1.7e-05,2.5e-05,1.5e-05,1.5e-05,2.1e-05,9e-06,2.5e-05,1.2e-05,2.3e-05,2.5e-05,6e-06,8e-06,1.6e-05,2e-05,2e-05,1.1e-05,1.4e-05,1.3e-05,1.8e-05,6e-06,1.1e-05,2.2e-05,3.4e-05,1.1e-05,1.9e-05,1.1e-05,2e-05,1.5e-05,6e-06,2.4e-05,3.3e-05,4.1e-05,0.000141,0.000181,0.000108,8.7e-05,7.2e-05,2.3e-05,3.2e-05,6.5e-05,6e-05,3.8e-05,4.6e-05,5.3e-05,6.3e-05,2.9e-05,5.7e-05,8.6e-05,0.000102,0.000105,6e-05,4.3e-05,4.5e-05,2.9e-05,1.3e-05,2e-06,5.1e-05,8e-06,2.8e-05,3.6e-05,4.5e-05,1.4e-05,1.8e-05,3.3e-05,1.6e-05,4.5e-05,4e-06,4.9e-05,4.6e-05,7e-05,5.8e-05,4.4e-05,1.7e-05,3.5e-05,1.3e-05,3.2e-05,3.1e-05,3.8e-05,6.2e-05,5.2e-05,3.8e-05,1e-05,2.3e-05,3.3e-05,4.2e-05,3.3e-05,5.6e-05,4.2e-05
9e-06,2.7e-05,9e-06,3e-06,1e-06,9e-06,6e-06,1e-05,1.4e-05,1.1e-05,2.5e-05,1.2e-05,2.9e-05,2e-05,1.8e-05,2.4e-05,4e-05,2e-05,1e-05,1.3e-05,1.7e-05,3.2e-05,1.3e-05,1.5e-05,1.9e-05,3.3e-05,1.9e-05,9e-06,8e-06,1.3e-05,6e-06,1.9e-05,7e-06,1.6e-05,2e-05,2.8e-05,2.8e-05,1.5e-05,1.5e-05,2.4e-05,4e-06,1.9e-05,2.7e-05,2.6e-05,1.4e-05,1.3e-05,1.8e-05,1.4e-05,9e-06,1.6e-05,1.6e-05,2e-05,1.5e-05,1.3e-05,1.3e-05,2.8e-05,1.8e-05,2.1e-05,1.9e-05,1.7e-05,2.2e-05,5e-06,2.7e-05,4e-05,6.8e-05,0.000146,5.3e-05,1.8e-05,6.2e-05,8.4e-05,6.3e-05,3e-05,6.3e-05,3.8e-05,3.8e-05,4.9e-05,3.9e-05,3.1e-05,5.6e-05,7.7e-05,0.000106,5.6e-05,7e-05,2.3e-05,3.7e-05,5.5e-05,3e-05,3.8e-05,4.6e-05,4.8e-05,4.5e-05,2.9e-05,3.6e-05,1.7e-05,4.4e-05,1.1e-05,4.3e-05,4.8e-05,5.9e-05,3.4e-05,4e-05,2.4e-05,3.1e-05,2.4e-05,2.7e-05,1e-05,2e-05,1.8e-05,3.3e-05,4.4e-05,3.6e-05,4e-05,5.5e-05,4.9e-05,3.6e-05,1.3e-05,9.1e-05,6e-06,1.3e-05,3.7e-05,4.1e-05
2.2e-05,1.5e-05,9e-06,4e-06,8e-06,3e-06,1.1e-05,1.1e-05,1.8e-05,6e-06,1.1e-05,2e-06,1.3e-05,1.1e-05,1e-05,1.2e-05,1.4e-05,7e-06,5e-06,1.2e-05,2.2e-05,1.9e-05,1.7e-05,2.5e-05,3.3e-05,1.8e-05,4e-06,5e-06,7e-06,8e-06,1.9e-05,4e-06,1.4e-05,1e-05,2.3e-05,2.5e-05,2.5e-05,1e-05,7e-06,1.4e-05,1.5e-05,2.4e-05,1.3e-05,2e-05,1.6e-05,1.3e-05,1.2e-05,2e-05,1.7e-05,6e-06,1.5e-05,4e-06,2.2e-05,9e-06,8e-06,3.3e-05,1.1e-05,8e-06,1.2e-05,9e-06,2.1e-05,1.2e-05,4.8e-05,3.5e-05,8.6e-05,6.4e-05,8.9e-05,0.000115,7.8e-05,9.9e-05,9.3e-05,3.5e-05,4.7e-05,3.9e-05,4.9e-05,9e-06,4.6e-05,4.6e-05,4.5e-05,9.2e-05,2.1e-05,2.2e-05,3.5e-05,3.1e-05,4e-05,5.7e-05,2.5e-05,1.1e-05,2.9e-05,2.4e-05,8e-06,3.4e-05,4.2e-05,1.9e-05,5.4e-05,6.7e-05,2.7e-05,1.5e-05,3.2e-05,1.6e-05,5.1e-05,1.3e-05,4.9e-05,2.1e-05,1e-05,2.1e-05,2.3e-05,1.8e-05,9e-06,7.4e-05,5.7e-05,4.9e-05,2.5e-05,1.4e-05,3.9e-05,1.1e-05,8.5e-05,5.2e-05,2.1e-05,3e-05,2.9e-05
1.4e-05,9e-06,5e-06,2e-06,1e-05,8e-06,1.2e-05,5e-06,7e-06,4e-06,8e-06,9e-06,1e-05,4e-06,6e-06,1e-06,5e-06,7e-06,7e-06,1.1e-05,4e-06,1.2e-05,4e-06,1.1e-05,4e-06,8e-06,6e-06,5e-06,6e-06,2e-06,1.2e-05,1.6e-05,1.8e-05,7e-06,1.6e-05,4e-06,1.1e-05,3e-06,2e-06,6e-06,9e-06,8e-06,1e-05,1.1e-05,3e-06,1.3e-05,3e-06,6e-06,9e-06,7e-06,7e-06,1.6e-05,8e-06,4e-06,6e-06,1.6e-05,8e-06,6e-06,1.6e-05,1.4e-05,1.1e-05,5e-06,2.4e-05,2.6e-05,3.8e-05,3.4e-05,3.6e-05,4.3e-05,4.5e-05,2.3e-05,5.2e-05,3e-05,1.3e-05,1.9e-05,6e-06,5e-06,1.8e-05,1.7e-05,8e-06,1.2e-05,3e-06,1.9e-05,9e-06,2.2e-05,1.5e-05,3.4e-05,3e-05,7e-06,1.7e-05,1.5e-05,2.7e-05,1.6e-05,8e-06,3.3e-05,1.7e-05,1.1e-05,2e-05,3e-05,1.3e-05,1.4e-05,2.5e-05,3.2e-05,2.6e-05,5e-06,6e-06,2e-05,2.9e-05,3.4e-05,3.3e-05,2.9e-05,4.2e-05,7e-06,1.4e-05,2.1e-05,1.8e-05,3.4e-05,2e-05,3.1e-05,2.2e-05,9e-06,3.4e-05
1e-05,1.5e-05,1.2e-05,4e-06,6e-06,6e-06,6e-06,3e-06,7e-06,1e-06,7e-06,1.1e-05,1e-06,3e-06,9e-06,9e-06,5e-06,7e-06,6e-06,7e-06,1.1e-05,6e-06,3e-06,1.3e-05,1.3e-05,4e-06,5e-06,7e-06,1.2e-05,6e-06,1.2e-05,1e-05,4e-06,7e-06,1.2e-05,1.2e-05,8e-06,1.2e-05,1.4e-05,1.4e-05,2e-06,1.1e-05,1e-05,1.9e-05,2.3e-05,2.9e-05,2.5e-05,1.1e-05,4e-06,7e-06,9e-06,1.3e-05,1.6e-05,1.2e-05,1.3e-05,8e-06,1.5e-05,1.4e-05,2e-05,1e-05,2e-05,2.6e-05,1.6e-05,4.6e-05,2.1e-05,3.4e-05,1.3e-05,1.8e-05,2.1e-05,6.7e-05,3.1e-05,1.9e-05,1.9e-05,3.6e-05,1e-05,1e-05,2e-05,3.7e-05,3.6e-05,3.7e-05,1e-05,1.1e-05,3.1e-05,1.9e-05,3.4e-05,4.3e-05,4.4e-05,2.7e-05,2.1e-05,3.5e-05,3.2e-05,1.9e-05,1.2e-05,2.7e-05,2.6e-05,2.8e-05,3.1e-05,2.9e-05,3.4e-05,4.7e-05,2.7e-05,1.5e-05,5e-05,5.6e-05,3.2e-05,3.9e-05,5.3e-05,3.7e-05,7e-06,4.1e-05,5.8e-05,5.7e-05,4.1e-05,3.6e-05,1.8e-05,3.8e-05,4.5e-05,6.6e-05,4.3e-05,2.6e-05,4.7e-05
6e-06,1.4e-05,1.4e-05,1.4e-05,6e-06,4e-06,7e-06,5e-06,2e-06,4e-06,4e-06,1.1e-05,9e-06,9e-06,1.4e-05,8e-06,2e-06,1e-06,5e-06,3e-06,6e-06,6e-06,2e-06,1.1e-05,1.1e-05,1e-05,6e-06,8e-06,8e-06,7e-06,3e-06,2e-06,3e-06,3e-06,3e-06,9e-06,1.2e-05,1.3e-05,3e-06,3e-06,3e-06,8e-06,6e-06,1.2e-05,2.2e-05,1.8e-05,3e-06,1e-05,1.2e-05,5e-06,4e-06,1.3e-05,1.2e-05,1.5e-05,1.7e-05,1.9e-05,2.2e-05,1.2e-05,2.7e-05,2.5e-05,1.7e-05,2.4e-05,3.4e-05,2.7e-05,1.1e-05,2.2e-05,2.5e-05,4.1e-05,3e-05,3.3e-05,4.5e-05,3.2e-05,5.3e-05,2.1e-05,2.2e-05,2.1e-05,1.3e-05,2.2e-05,2.7e-05,2.4e-05,2.5e-05,2.2e-05,3.4e-05,8e-06,2.8e-05,1.8e-05,1.7e-05,5e-06,1.8e-05,2.3e-05,1.8e-05,1.7e-05,2.2e-05,6e-06,1.4e-05,1.8e-05,3.2e-05,3.9e-05,1.7e-05,2.3e-05,3e-06,9e-06,3.1e-05,4e-05,3.7e-05,1.7e-05,1.5e-05,8e-06,1.3e-05,2e-05,6e-06,2.2e-05,1.2e-05,1.6e-05,1.4e-05,3.3e-05,1.9e-05,3e-05,1.4e-05,7e-06,3.4e-05
4e-06,5e-06,2e-06,8e-06,5e-06,5e-06,2e-06,2e-06,4e-06,3e-06,5e-06,5e-06,7e-06,3e-06,9e-06,4e-06,5e-06,1e-06,4e-06,3e-06,3e-06,5e-06,1e-06,5e-06,4e-06,2e-06,2e-06,8e-06,3e-06,7e-06,6e-06,5e-06,3e-06,4e-06,4e-06,3e-06,5e-06,7e-06,3e-06,6e-06,9e-06,3e-06,6e-06,1.1e-05,6e-06,2e-06,1e-05,4e-06,6e-06,1e-06,4e-06,7e-06,5e-06,1.4e-05,0,6e-06,5e-06,3e-06,1.3e-05,5e-06,1.2e-05,1.4e-05,3.2e-05,2.9e-05,2.9e-05,3.4e-05,2.6e-05,1.9e-05,2e-05,1.6e-05,3.5e-05,2.7e-05,2.5e-05,9e-06,1.4e-05,9e-06,1.9e-05,2.1e-05,1.2e-05,1.6e-05,1.8e-05,1.4e-05,2.3e-05,1.6e-05,7e-06,2.1e-05,4e-06,1.3e-05,1.2e-05,8e-06,2e-05,3e-06,1.7e-05,1.1e-05,1.5e-05,1.3e-05,1.1e-05,6e-06,3e-06,1.8e-05,1.3e-05,6e-06,1.5e-05,6e-06,1.6e-05,1.1e-05,7e-06,5e-06,9e-06,1.4e-05,4e-06,1.5e-05,1.1e-05,1.5e-05,4e-06,1.3e-05,4e-06,8e-06,1.1e-05,1.3e-05,2e-05
5e-06,3e-06,2e-06,3e-06,2e-06,1e-06,1e-06,3e-06,1e-06,2e-06,4e-06,5e-06,7e-06,6e-06,2e-06,3e-06,2e-06,1e-06,4e-06,2e-06,2e-06,1e-06,3e-06,5e-06,2e-06,1e-06,4e-06,5e-06,3e-06,4e-06,2e-06,4e-06,3e-06,6e-06,1e-06,2e-06,6e-06,5e-06,1e-06,9e-06,3e-06,4e-06,3e-06,7e-06,9e-06,5e-06,5e-06,3e-06,5e-06,3e-06,5e-06,3e-06,3e-06,8e-06,7e-06,3e-06,4e-06,2e-06,4e-06,4e-06,1e-06,8e-06,3.5e-05,2.6e-05,6e-06,2.7e-05,1.7e-05,1.2e-05,2.4e-05,3e-05,1.7e-05,6e-06,1e-05,1.4e-05,1.4e-05,1.1e-05,1.6e-05,2.2e-05,1.9e-05,1.2e-05,1.5e-05,3e-06,1.9e-05,5e-06,8e-06,9e-06,4e-06,9e-06,6e-06,1e-05,1.1e-05,2e-06,1e-05,1e-05,4e-06,6e-06,5e-06,6e-06,6e-06,1.5e-05,9e-06,1e-05,9e-06,1.1e-05,4e-06,7e-06,6e-06,4e-06,6e-06,3e-06,9e-06,6e-06,3e-06,3e-06,7e-06,9e-06,6e-06,1.6e-05,7e-06,9e-06,1.4e-05
4e-06,4e-06,3e-06,4e-06,1e-06,2e-06,3e-06,0,2e-06,1e-06,1e-06,4e-06,3e-06,3e-06,1e-06,3e-06,4e-06,3e-06,1e-06,2e-06,2e-06,2e-06,2e-06,2e-06,3e-06,4e-06,3e-06,4e-06,2e-06,4e-06,4e-06,3e-06,3e-06,4e-06,2e-06,2e-06,6e-06,2e-06,2e-06,8e-06,3e-06,4e-06,4e-06,5e-06,6e-06,0,3e-06,3e-06,1e-06,2e-06,6e-06,4e-06,3e-06,4e-06,4e-06,2e-06,6e-06,6e-06,3e-06,2e-06,4e-06,5e-06,1.3e-05,1.3e-05,2e-05,5e-06,7e-06,1.9e-05,1.2e-05,1e-05,2.2e-05,1.1e-05,3e-06,1.2e-05,1.9e-05,4e-06,1.3e-05,1.1e-05,3e-06,6e-06,1.1e-05,2e-06,7e-06,3e-06,1.4e-05,4e-06,7e-06,3e-06,7e-06,7e-06,7e-06,1.3e-05,8e-06,2e-06,3e-06,8e-06,7e-06,3e-06,2e-06,1.1e-05,1.2e-05,1.2e-05,4e-06,7e-06,8e-06,7e-06,5e-06,4e-06,6e-06,3e-06,3e-06,6e-06,3e-06,3e-06,4e-06,4e-06,6e-06,1.7e-05,2e-06,1e-05,4e-06
2e-06,3e-06,4e-06,3e-06,3e-06,1e-06,4e-06,2e-06,2e-06,2e-06,2e-06,4e-06,5e-06,1e-06,3e-06,1e-06,5e-06,1e-06,2e-06,1e-06,2e-06,3e-06,3e-06,2e-06,1e-06,3e-06,0,3e-06,2e-06,4e-06,3e-06,3e-06,3e-06,5e-06,2e-06,2e-06,2e-06,8e-06,4e-06,6e-06,2e-06,5e-06,1e-06,5e-06,5e-06,4e-06,3e-06,2e-06,4e-06,4e-06,2e-06,2e-06,3e-06,3e-06,5e-06,5e-06,6e-06,5e-06,1e-06,4e-06,6e-06,3e-06,5e-06,8e-06,2.3e-05,1.5e-05,1.7e-05,6e-06,1.6e-05,1.6e-05,1.9e-05,1.3e-05,1.8e-05,9e-06,8e-06,2e-06,9e-06,9e-06,5e-06,3e-06,4e-06,6e-06,1.2e-05,6e-06,1.1e-05,6e-06,3e-06,8e-06,5e-06,7e-06,2e-06,7e-06,3e-06,3e-06,3e-06,2e-06,5e-06,6e-06,4e-06,5e-06,7e-06,7e-06,5e-06,5e-06,7e-06,9e-06,5e-06,3e-06,4e-06,3e-06,4e-06,5e-06,5e-06,4e-06,4e-06,4e-06,5e-06,9e-06,1e-06,9e-06,5e-06
5e-06,3e-06,3e-06,3e-06,3e-06,5e-06,2e-06,2e-06,4e-06,2e-06,3e-06,4e-06,4e-06,4e-06,3e-06,1e-06,4e-06,2e-06,2e-06,2e-06,2e-06,5e-06,1e-06,1e-06,2e-06,3e-06,3e-06,1e-06,3e-06,3e-06,2e-06,6e-06,2e-06,3e-06,2e-06,4e-06,6e-06,4e-06,4e-06,5e-06,2e-06,2e-06,4e-06,6e-06,5e-06,3e-06,4e-06,0,1e-06,4e-06,3e-06,3e-06,5e-06,3e-06,1e-06,2e-06,4e-06,7e-06,2e-06,2e-06,5e-06,5e-06,5e-06,1.2e-05,4e-06,1.4e-05,1.2e-05,1e-05,1.9e-05,2.1e-05,1e-05,8e-06,1.4e-05,2e-06,2e-06,7e-06,4e-06,1.5e-05,1.3e-05,5e-06,8e-06,8e-06,1e-05,4e-06,8e-06,7e-06,1e-05,5e-06,3e-06,6e-06,7e-06,4e-06,4e-06,5e-06,3e-06,7e-06,1e-06,3e-06,2e-06,9e-06,9e-06,1e-06,2e-06,4e-06,5e-06,1.4e-05,9e-06,3e-06,3e-06,0,3e-06,1e-06,2e-06,4e-06,4e-06,4e-06,4e-06,5e-06,8e-06,6e-06,2e-06
0,3e-06,4e-06,3e-06,2e-06,5e-06,7e-06,6e-06,5e-06,3e-06,3e-06,7e-06,4e-06,3e-06,3e-06,3e-06,5e-06,4e-06,3e-06,2e-06,4e-06,2e-06,4e-06,2e-06,0,3e-06,2e-06,1e-06,0,2e-06,1e-06,3e-06,2e-06,3e-06,2e-06,3e-06,6e-06,2e-06,3e-06,9e-06,2e-06,3e-06,5e-06,6e-06,3e-06,2e-06,3e-06,3e-06,6e-06,4e-06,1e-06,2e-06,2e-06,5e-06,4e-06,4e-06,2e-06,5e-06,4e-06,4e-06,7e-06,1.2e-05,1.2e-05,4e-06,9e-06,8e-06,7e-06,1.3e-05,6e-06,1.6e-05,1.1e-05,1.7e-05,1.3e-05,8e-06,8e-06,6e-06,7e-06,1.2e-05,1.1e-05,8e-06,1e-06,3e-06,6e-06,8e-06,1.3e-05,7e-06,7e-06,4e-06,2e-06,9e-06,1.3e-05,1.3e-05,5e-06,9e-06,4e-06,9e-06,5e-06,4e-06,5e-06,1.2e-05,1e-05,7e-06,4e-06,1e-05,1.2e-05,1.7e-05,8e-06,4e-06,2e-06,4e-06,6e-06,5e-06,7e-06,1e-05,4e-06,7e-06,1e-05,1.1e-05,7e-06,1e-05,4e-06
3e-06,2e-06,3e-06,1e-06,4e-06,3e-06,3e-06,6e-06,6e-06,3e-06,2e-06,6e-06,7e-06,6e-06,2e-06,3e-06,6e-06,5e-06,5e-06,4e-06,2e-06,3e-06,7e-06,7e-06,6e-06,5e-06,6e-06,2e-06,3e-06,2e-06,1e-06,2e-06,2e-06,2e-06,0,1e-06,4e-06,8e-06,8e-06,1.3e-05,1e-05,6e-06,4e-06,2e-06,4e-06,7e-06,7e-06,4e-06,4e-06,6e-06,4e-06,4e-06,4e-06,7e-06,9e-06,7e-06,3e-06,6e-06,3e-06,5e-06,5e-06,1e-05,2e-06,1e-05,1.4e-05,1.6e-05,9e-06,7e-06,6e-06,3e-06,5e-06,1.2e-05,1.1e-05,1.6e-05,7e-06,8e-06,5e-06,7e-06,8e-06,5e-06,3e-06,2e-06,1.3e-05,4e-06,1e-05,1.2e-05,1.1e-05,9e-06,3e-06,8e-06,5e-06,7e-06,5e-06,1.1e-05,1.1e-05,3e-06,1e-06,3e-06,7e-06,2e-06,4e-06,1.4e-05,5e-06,1.1e-05,3e-06,9e-06,1.3e-05,8e-06,7e-06,1e-06,1.1e-05,1.1e-05,1.4e-05,1.1e-05,1.1e-05,9e-06,3e-06,1.6e-05,5e-06,3e-06,3e-06
1e-06,1e-06,3e-06,1e-06,3e-06,7e-06,5e-06,6e-06,4e-06,7e-06,6e-06,1e-06,7e-06,5e-06,5e-06,3e-06,6e-06,5e-06,1e-06,3e-06,3e-06,3e-06,5e-06,2e-06,5e-06,2e-06,7e-06,5e-06,4e-06,7e-06,5e-06,2e-06,2e-06,5e-06,2e-06,2e-06,2e-06,2e-06,7e-06,5e-06,7e-06,4e-06,3e-06,5e-06,3e-06,1e-05,4e-06,1e-06,3e-06,4e-06,3e-06,3e-06,2e-06,4e-06,8e-06,5e-06,8e-06,2e-06,3e-06,3e-06,5e-06,6e-06,1e-06,1e-05,2e-05,2e-06,1.8e-05,9e-06,1.4e-05,1e-05,7e-06,9e-06,1.2e-05,6e-06,5e-06,1.4e-05,8e-06,5e-06,1e-05,8e-06,6e-06,7e-06,5e-06,2e-06,8e-06,1.1e-05,2e-06,9e-06,7e-06,8e-06,9e-06,9e-06,4e-06,1e-05,7e-06,5e-06,4e-06,3e-06,4e-06,1.2e-05,7e-06,7e-06,6e-06,2e-06,4e-06,2e-06,2e-06,1e-06,6e-06,4e-06,9e-06,1e-05,5e-06,4e-06,4e-06,5e-06,7e-06,1.5e-05,5e-06,8e-06,4e-06
2e-06,2e-06,3e-06,2e-06,1e-06,3e-06,3e-06,3e-06,2e-06,5e-06,4e-06,3e-06,0,4e-06,2e-06,2e-06,3e-06,2e-06,1e-06,3e-06,1e-06,3e-06,1e-06,3e-06,3e-06,0,6e-06,3e-06,5e-06,4e-06,2e-06,2e-06,2e-06,5e-06,2e-06,3e-06,3e-06,6e-06,2e-06,6e-06,5e-06,2e-06,5e-06,1e-06,2e-06,2e-06,1e-06,1e-06,4e-06,2e-06,0,4e-06,2e-06,2e-06,2e-06,3e-06,4e-06,3e-06,4e-06,1e-06,5e-06,1.1e-05,2e-06,1e-05,1.4e-05,9e-06,7e-06,1.5e-05,5e-06,7e-06,7e-06,5e-06,1e-05,5e-06,1.3e-05,1.5e-05,8e-06,9e-06,5e-06,9e-06,3e-06,1e-05,1e-05,7e-06,4e-06,7e-06,6e-06,6e-06,3e-06,8e-06,5e-06,3e-06,5e-06,9e-06,3e-06,4e-06,5e-06,3e-06,5e-06,1.4e-05,1.3e-05,7e-06,5e-06,4e-06,6e-06,3e-06,1e-06,2e-06,9e-06,5e-06,5e-06,8e-06,2e-06,3e-06,5e-06,9e-06,9e-06,1e-05,1e-06,5e-06,3e-06
1e-06,2e-06,3e-06,4e-06,1e-06,3e-06,2e-06,2e-06,1e-06,2e-06,2e-06,2e-06,1e-06,3e-06,2e-06,2e-06,1e-06,1e-06,1e-06,2e-06,1e-06,2e-06,1e-06,3e-06,1e-06,3e-06,2e-06,2e-06,1e-06,2e-06,4e-06,2e-06,3e-06,3e-06,1e-06,3e-06,3e-06,6e-06,2e-06,2e-06,4e-06,2e-06,4e-06,2e-06,3e-06,4e-06,1e-06,3e-06,4e-06,2e-06,0,3e-06,1e-06,2e-06,1e-06,4e-06,5e-06,3e-06,2e-06,1e-06,7e-06,1.3e-05,1.6e-05,1.6e-05,7e-06,5e-06,1.9e-05,1.8e-05,1.4e-05,7e-06,4e-06,6e-06,1.6e-05,1.6e-05,2e-06,1e-05,5e-06,5e-06,7e-06,6e-06,2e-06,8e-06,1.4e-05,1e-05,9e-06,4e-06,1e-06,3e-06,2e-06,3e-06,1e-06,3e-06,5e-06,6e-06,2e-06,2e-06,4e-06,6e-06,4e-06,1.2e-05,8e-06,3e-06,3e-06,5e-06,3e-06,1e-06,2e-06,4e-06,5e-06,5e-06,4e-06,8e-06,3e-06,0,3e-06,6e-06,4e-06,1.3e-05,4e-06,3e-06,2e-06
2e-06,2e-06,1e-06,1e-06,2e-06,4e-06,3e-06,2e-06,1e-06,2e-06,4e-06,4e-06,2e-06,1e-06,2e-06,3e-06,1e-06,1e-06,1e-06,2e-06,0,1e-06,1e-06,2e-06,2e-06,1e-06,2e-06,2e-06,1e-06,0,1e-06,2e-06,3e-06,3e-06,1e-06,2e-06,3e-06,3e-06,3e-06,4e-06,2e-06,2e-06,2e-06,2e-06,3e-06,4e-06,2e-06,4e-06,2e-06,1e-06,1e-06,2e-06,1e-06,4e-06,1e-06,3e-06,4e-06,1e-06,1e-06,3e-06,6e-06,4e-06,8e-06,9e-06,1.1e-05,1.2e-05,1.8e-05,7e-06,9e-06,1.1e-05,4e-06,1.1e-05,1e-05,8e-06,7e-06,1.4e-05,2e-06,4e-06,3e-06,3e-06,4e-06,4e-06,1e-05,6e-06,1e-05,5e-06,6e-06,6e-06,1e-06,4e-06,5e-06,4e-06,3e-06,8e-06,3e-06,5e-06,2e-06,5e-06,7e-06,9e-06,1e-05,4e-06,1e-06,4e-06,4e-06,2e-06,2e-06,2e-06,3e-06,2e-06,3e-06,6e-06,4e-06,1e-06,2e-06,2e-06,1e-06,1e-05,2e-06,5e-06,3e-06
2e-06,2e-06,1e-06,2e-06,2e-06,1e-06,2e-06,1e-06,2e-06,3e-06,2e-06,1e-06,1e-06,4e-06,0,1e-06,1e-06,1e-06,1e-06,2e-06,1e-06,2e-06,2e-06,3e-06,2e-06,1e-06,2e-06,2e-06,2e-06,0,1e-06,2e-06,3e-06,2e-06,1e-06,1e-06,5e-06,4e-06,1e-06,4e-06,3e-06,1e-06,3e-06,2e-06,3e-06,2e-06,2e-06,3e-06,2e-06,1e-06,1e-06,2e-06,3e-06,2e-06,2e-06,4e-06,4e-06,2e-06,2e-06,4e-06,6e-06,3e-06,6e-06,3e-06,6e-06,8e-06,1.6e-05,6e-06,1.7e-05,2e-05,9e-06,8e-06,1.9e-05,1.4e-05,1.1e-05,7e-06,8e-06,2e-06,7e-06,4e-06,6e-06,6e-06,8e-06,4e-06,1.1e-05,3e-06,5e-06,7e-06,4e-06,3e-06,6e-06,8e-06,4e-06,5e-06,3e-06,3e-06,5e-06,3e-06,4e-06,8e-06,1.2e-05,4e-06,5e-06,6e-06,1e-06,1e-06,1e-06,3e-06,2e-06,0,5e-06,5e-06,1e-06,1e-06,4e-06,3e-06,6e-06,1.1e-05,2e-06,3e-06,2e-06
1e-06,1e-06,3e-06,1e-06,1e-06,2e-06,1e-06,2e-06,3e-06,2e-06,2e-06,3e-06,2e-06,2e-06,1e-06,2e-06,1e-06,2e-06,3e-06,1e-06,1e-06,3e-06,1e-06,3e-06,1e-06,1e-06,4e-06,1e-06,2e-06,1e-06,1e-06,2e-06,3e-06,3e-06,1e-06,1e-06,4e-06,5e-06,1e-06,6e-06,2e-06,0,2e-06,2e-06,3e-06,2e-06,2e-06,1e-06,1e-06,1e-06,2e-06,2e-06,2e-06,3e-06,1e-06,4e-06,2e-06,1e-06,3e-06,3e-06,5e-06,3e-06,0,4e-06,9e-06,1.8e-05,8e-06,1.2e-05,4e-06,3e-06,1.2e-05,1.6e-05,1.7e-05,3e-05,2.7e-05,2.5e-05,1.8e-05,1.2e-05,8e-06,6e-06,7e-06,1e-06,6e-06,4e-06,1e-05,4e-06,4e-06,7e-06,2e-06,2e-06,6e-06,4e-06,0,6e-06,2e-06,2e-06,4e-06,5e-06,3e-06,7e-06,9e-06,7e-06,4e-06,6e-06,5e-06,4e-06,1e-06,3e-06,2e-06,3e-06,4e-06,6e-06,2e-06,4e-06,4e-06,3e-06,5e-06,8e-06,1e-06,4e-06,1e-06
1e-06,1e-06,2e-06,2e-06,1e-06,2e-06,1e-06,1e-06,2e-06,3e-06,3e-06,2e-06,1e-06,2e-06,1e-06,1e-06,2e-06,1e-06,1e-06,1e-06,0,2e-06,2e-06,2e-06,2e-06,0,3e-06,1e-06,2e-06,2e-06,1e-06,1e-06,2e-06,3e-06,1e-06,2e-06,3e-06,4e-06,3e-06,5e-06,2e-06,0,2e-06,3e-06,2e-06,3e-06,1e-06,0,1e-06,0,1e-06,3e-06,3e-06,2e-06,2e-06,2e-06,3e-06,2e-06,1e-06,2e-06,5e-06,2e-06,1e-06,2e-06,1e-05,1e-05,1.3e-05,9e-06,6e-06,3e-06,7e-06,6e-06,9e-06,1.2e-05,9e-06,5e-06,4e-06,4e-06,5e-06,1e-06,4e-06,7e-06,9e-06,4e-06,7e-06,6e-06,3e-06,5e-06,2e-06,4e-06,6e-06,5e-06,0,6e-06,1e-06,1e-06,4e-06,2e-06,3e-06,8e-06,7e-06,3e-06,4e-06,5e-06,4e-06,2e-06,1e-06,2e-06,2e-06,4e-06,5e-06,5e-06,4e-06,2e-06,3e-06,4e-06,5e-06,1e-05,2e-06,4e-06,2e-06
0,0,1e-06,2e-06,0,1e-06,1e-06,1e-06,1e-06,2e-06,2e-06,3e-06,2e-06,2e-06,0,0,1e-06,1e-06,1e-06,1e-06,0,1e-06,2e-06,1e-06,1e-06,0,3e-06,1e-06,2e-06,1e-06,3e-06,3e-06,1e-06,3e-06,0,1e-06,4e-06,3e-06,2e-06,6e-06,1e-06,1e-06,3e-06,3e-06,3e-06,3e-06,0,0,2e-06,1e-06,0,3e-06,1e-06,1e-06,1e-06,3e-06,3e-06,2e-06,1e-06,3e-06,5e-06,3e-06,2e-06,4e-06,9e-06,2e-06,1e-05,6e-06,2e-06,1e-06,3e-06,6e-06,6e-06,1.1e-05,4e-06,5e-06,2e-06,2e-06,4e-06,3e-06,2e-06,6e-06,7e-06,2e-06,1e-05,2e-06,2e-06,5e-06,2e-06,3e-06,4e-06,5e-06,2e-06,6e-06,1e-06,2e-06,0,1e-06,3e-06,8e-06,8e-06,5e-06,3e-06,2e-06,6e-06,1e-06,0,1e-06,0,2e-06,5e-06,4e-06,4e-06,1e-06,1e-06,0,7e-06,1e-05,1e-06,3e-06,1e-06
0,0,2e-06,2e-06,1e-06,2e-06,2e-06,1e-06,1e-06,1e-06,1e-06,2e-06,1e-06,2e-06,0,1e-06,1e-06,1e-06,1e-06,0,1e-06,1e-06,1e-06,2e-06,1e-06,0,3e-06,1e-06,1e-06,1e-06,3e-06,2e-06,2e-06,3e-06,1e-06,1e-06,4e-06,3e-06,2e-06,5e-06,2e-06,1e-06,2e-06,3e-06,2e-06,3e-06,1e-06,1e-06,1e-06,1e-06,1e-06,3e-06,1e-06,1e-06,1e-06,4e-06,3e-06,1e-06,1e-06,2e-06,4e-06,1e-06,1e-06,3e-06,7e-06,1e-06,8e-06,6e-06,3e-06,4e-06,3e-06,4e-06,2e-06,8e-06,4e-06,4e-06,1e-06,0,5e-06,1e-06,0,5e-06,9e-06,1e-06,1e-05,3e-06,3e-06,3e-06,2e-06,2e-06,4e-06,3e-06,1e-06,5e-06,1e-06,2e-06,1e-06,1e-06,3e-06,9e-06,6e-06,3e-06,2e-06,3e-06,4e-06,2e-06,0,1e-06,1e-06,1e-06,4e-06,5e-06,4e-06,0,1e-06,3e-06,6e-06,1e-05,1e-06,4e-06,1e-06
1e-06,0,2e-06,1e-06,1e-06,1e-06,2e-06,0,1e-06,1e-06,2e-06,2e-06,1e-06,2e-06,0,1e-06,1e-06,1e-06,1e-06,1e-06,1e-06,1e-06,1e-06,2e-06,1e-06,0,2e-06,1e-06,1e-06,1e-06,2e-06,2e-06,1e-06,3e-06,0,1e-06,4e-06,3e-06,2e-06,5e-06,2e-06,1e-06,2e-06,3e-06,2e-06,3e-06,0,1e-06,2e-06,0,1e-06,3e-06,1e-06,1e-06,1e-06,3e-06,3e-06,1e-06,1e-06,2e-06,4e-06,2e-06,1e-06,3e-06,6e-06,1e-06,9e-06,5e-06,4e-06,4e-06,3e-06,4e-06,2e-06,8e-06,3e-06,3e-06,2e-06,1e-06,5e-06,1e-06,0,5e-06,8e-06,2e-06,9e-06,2e-06,3e-06,4e-06,1e-06,2e-06,3e-06,4e-06,1e-06,5e-06,0,1e-06,1e-06,1e-06,3e-06,7e-06,8e-06,4e-06,1e-06,3e-06,4e-06,2e-06,0,0,0,1e-06,4e-06,6e-06,3e-06,0,2e-06,2e-06,6e-06,1e-05,1e-06,3e-06,1e-06
