1.2e-05,2.2e-05,1.2e-05,1.4e-05,8e-06,1.8e-05,6e-06,1.2e-05,1e-06,1.4e-05,1.3e-05,5e-06,3e-06,4e-06,1.2e-05,7e-06,1e-06,1.3e-05,1.4e-05,7e-06,6e-06,1e-05,1.5e-05,1.3e-05,1.3e-05,7e-06,1.8e-05,1e-06,1e-05,8e-06,6e-06,2e-06,1.8e-05,1e-05,2.6e-05,1.7e-05,5e-06,1.5e-05,1e-06,1e-05,5e-06,7e-06,1.1e-05,8e-06,2e-05,2.6e-05,1.4e-05,5e-06,1.7e-05,6e-06,6e-06,1.3e-05,7e-06,2.7e-05,1e-06,2e-06,1.2e-05,8e-06,1e-05,1e-06,6e-06,4e-06,0,1.8e-05,2.5e-05,5e-06,6e-06,2.9e-05,8e-06,2.3e-05,1e-05,3e-06,1e-05,7e-06,3e-06,9e-06,1.7e-05,1e-06,1.7e-05,8e-06,2.3e-05,4e-06,1.5e-05,2.1e-05,1.9e-05,1e-06,8e-06,8e-06,1.8e-05,2e-05,1.4e-05,1e-06,2e-05,8e-06,8e-06,1.1e-05,9e-06,1.4e-05,1e-05,5e-06,2.5e-05,6e-06,1.7e-05,1.9e-05,1.1e-05,1.3e-05,3e-06,1.5e-05,6.4e-05,4.5e-05,2.3e-05,2.8e-05,1e-05,1.2e-05,1.9e-05,1.2e-05,1.6e-05,4.4e-05,6e-06,7.6e-05,3.8e-05
6.4e-05,8.6e-05,5.1e-05,6.5e-05,7.5e-05,8.5e-05,2e-05,4.6e-05,2.2e-05,5.4e-05,2.5e-05,2.9e-05,2e-05,2.8e-05,3.3e-05,2.1e-05,2.7e-05,5.4e-05,4.5e-05,3.8e-05,1.7e-05,3.4e-05,2.2e-05,5e-05,6.3e-05,2.8e-05,5.6e-05,3.8e-05,2e-05,2.2e-05,2.2e-05,2.8e-05,1.9e-05,1e-05,4.3e-05,5.8e-05,1.2e-05,1.6e-05,5e-06,1.7e-05,3.3e-05,1.9e-05,3.5e-05,2.8e-05,4.1e-05,5.8e-05,3.3e-05,2.1e-05,3.7e-05,2.4e-05,3.2e-05,2e-06,3e-05,6.2e-05,3.4e-05,4.7e-05,4.9e-05,2.8e-05,1.1e-05,9e-06,4.2e-05,4e-05,3.4e-05,2.5e-05,6.5e-05,3.6e-05,3.3e-05,3.9e-05,2.5e-05,4.6e-05,6.2e-05,6.1e-05,6e-06,2.7e-05,1.4e-05,2e-05,2.8e-05,2.1e-05,1.8e-05,3.3e-05,7.1e-05,8e-06,5.2e-05,5.4e-05,7e-05,6e-06,4.8e-05,4.4e-05,2.9e-05,3.7e-05,5.9e-05,4.8e-05,2.9e-05,1.9e-05,4.1e-05,7e-05,5.9e-05,4.7e-05,5.4e-05,5.8e-05,5.8e-05,4.4e-05,3.4e-05,5.8e-05,1.9e-05,4e-06,5e-06,1.5e-05,0.000107,8.9e-05,1.2e-05,5.2e-05,7.6e-05,7.9e-05,5.8e-05,2.2e-05,9e-06,6.5e-05,3e-05,0.000201,0.000125
4.4e-05,5.9e-05,3.8e-05,3e-05,6e-05,0.00013,0.000158,8.6e-05,7.6e-05,8.9e-05,6.4e-05,7.2e-05,2.9e-05,2.4e-05,2.7e-05,1.7e-05,4e-05,5.2e-05,0.000118,3.7e-05,7e-06,3.1e-05,2.1e-05,2.2e-05,5.6e-05,1e-05,4.8e-05,6.1e-05,7.1e-05,5.2e-05,2.3e-05,5.1e-05,0.000113,8.7e-05,9.2e-05,8e-05,5.7e-05,6.1e-05,8e-05,5.6e-05,3.7e-05,4.6e-05,8.5e-05,5.8e-05,3.7e-05,2.9e-05,2.1e-05,1.1e-05,1e-05,3.5e-05,1.5e-05,1.3e-05,3.7e-05,5.9e-05,3.7e-05,4.6e-05,3.5e-05,1.6e-05,2.1e-05,1.5e-05,5.6e-05,1.4e-05,5.4e-05,2.7e-05,6e-06,1.1e-05,4.7e-05,7.7e-05,5.9e-05,3.9e-05,2.7e-05,6.4e-05,6.5e-05,4.4e-05,4.5e-05,6.2e-05,4.9e-05,4.1e-05,6.5e-05,5.4e-05,4e-05,5.9e-05,4.4e-05,3.2e-05,0.000119,0.00011,4.6e-05,6e-06,3.6e-05,7.6e-05,8.9e-05,1e-06,6.2e-05,4e-05,8.6e-05,0.000102,3.6e-05,8e-05,8.2e-05,7.6e-05,8e-05,3e-05,9.2e-05,4.1e-05,7.1e-05,6e-05,1.2e-05,3e-05,0.000169,6.5e-05,2.7e-05,5.5e-05,9e-05,8.7e-05,4.9e-05,3.1e-05,7.4e-05,0.000127,6.3e-05,0.000219,0.000129
5.8e-05,4.4e-05,2.7e-05,6.1e-05,0.000111,7.2e-05,3.7e-05,0.000122,0.000159,6e-05,2.7e-05,6e-05,3.7e-05,3.1e-05,3e-05,1.9e-05,3.5e-05,9.6e-05,4.7e-05,6.1e-05,7.5e-05,7.8e-05,0.000108,1.9e-05,0.000101,3.7e-05,5.9e-05,1.3e-05,0.000114,6.3e-05,0.000108,9.1e-05,9e-05,9e-05,8.3e-05,7.4e-05,0.000105,1.9e-05,0.000123,2.7e-05,5.8e-05,6.8e-05,6.3e-05,7.7e-05,6.7e-05,5.9e-05,6e-05,1.5e-05,3.9e-05,3.6e-05,3.3e-05,3.4e-05,4.1e-05,6e-05,7.4e-05,6e-06,6.3e-05,1.5e-05,2e-05,5e-05,0.000101,8.2e-05,9.9e-05,8.4e-05,9e-05,3.5e-05,5.5e-05,3.8e-05,0.000183,7.5e-05,4.2e-05,5.4e-05,3.6e-05,1.9e-05,6.1e-05,4.3e-05,3.5e-05,3.3e-05,0.000112,8.5e-05,6.3e-05,9.3e-05,0.000114,3.5e-05,7.5e-05,0.000112,0.000129,0.000101,6.9e-05,8.4e-05,3.3e-05,8.1e-05,0.000102,6.4e-05,5.8e-05,3.6e-05,0.000136,8.8e-05,0.000156,1e-04,5e-05,6.1e-05,7.9e-05,0.000116,4e-05,5.2e-05,5.4e-05,9.7e-05,9.8e-05,0.000195,4.9e-05,6.3e-05,8.8e-05,4.5e-05,0.000136,0.000141,0.000158,9.8e-05,7.9e-05,0.000186,0.000251
0.000274,0.000165,1.5e-05,1.2e-05,0.000145,0.000185,0.000138,0.000126,0.000172,0.000174,0.000195,5.3e-05,4.2e-05,5.7e-05,0.000104,5.7e-05,4.6e-05,0.000136,0.000117,4.6e-05,4.7e-05,4.1e-05,0.000172,0.000172,0.00017,0.000139,9.9e-05,8.6e-05,0.000188,7.6e-05,0.000198,9.1e-05,0.000107,4.2e-05,0.000103,0.000115,0.000121,9.8e-05,0.000184,0.000144,0.000153,5.4e-05,9e-05,0.000153,0.000162,0.000181,0.000184,0.00013,4.6e-05,2.2e-05,5.2e-05,2e-05,5.4e-05,0.000108,0.000146,8.6e-05,4.4e-05,0.000113,7.6e-05,3.6e-05,0.000143,7e-05,6.1e-05,0.000155,0.000302,0.000276,0.000238,0.000131,0.000176,0.000201,0.000117,0.000111,4.7e-05,3.2e-05,0.000121,6.6e-05,3.5e-05,6.3e-05,0.000166,7.1e-05,0.000125,0.000169,2.8e-05,3.7e-05,0.00014,4.6e-05,2.6e-05,3.8e-05,8.7e-05,0.000128,0.00011,0.000102,8.2e-05,1.9e-05,7.5e-05,3.6e-05,0.000141,0.00014,0.000262,0.000306,0.00019,0.000103,7.5e-05,0.000173,0.000105,6.8e-05,0.000112,0.000192,0.000114,4.5e-05,0.000123,9.9e-05,0.000103,0.000173,0.000146,2.9e-05,0.000172,0.000272,9.1e-05,0.000309,0.000299
0.000142,9e-06,0.000135,0.000112,0.00015,0.000133,7.4e-05,7.4e-05,6.2e-05,0.000123,0.000111,9.2e-05,7.7e-05,8.5e-05,9.8e-05,5.6e-05,6.5e-05,9.2e-05,3.8e-05,7.2e-05,3.4e-05,8.8e-05,0.000143,0.000144,6.7e-05,6.2e-05,1.1e-05,2.7e-05,0.000148,0.000151,0.000126,9.6e-05,0.000162,0.000128,3.8e-05,9.4e-05,7e-06,1.4e-05,0.000122,0.000138,4.2e-05,4.9e-05,4.7e-05,4.9e-05,7.4e-05,5.3e-05,6.2e-05,5.6e-05,0.000111,6.5e-05,1.7e-05,6e-05,4.9e-05,4.5e-05,0.000132,0.000136,2.3e-05,0.000112,0.000102,0.000106,0.000121,8.4e-05,8.6e-05,0.000101,0.000179,0.000109,9.9e-05,2.5e-05,8.6e-05,0.000111,7.6e-05,7.9e-05,5.3e-05,8e-05,0.000118,0.000132,7.2e-05,0.000108,5.9e-05,3.5e-05,0.000143,3.3e-05,9.1e-05,4.4e-05,8.4e-05,5.7e-05,3.7e-05,4.3e-05,3.3e-05,2.1e-05,7.9e-05,6.7e-05,7.5e-05,0.000128,0.000109,8.7e-05,4.7e-05,4e-05,0.000152,0.000141,0.000139,0.000151,5.7e-05,0.000355,0.000208,9e-05,0.00024,0.000288,0.000301,0.000222,0.000154,0.000107,0.000167,8.3e-05,0.000188,0.000146,0.000165,0.000364,0.000208,0.000386,0.000503
0.000228,0.000218,0.000255,5.7e-05,9e-05,0.000244,0.000191,0.000176,0.000176,0.00018,0.000202,0.000123,0.000108,0.000116,8.5e-05,0.000131,0.000162,0.000152,0.00011,0.000155,9.5e-05,0.000108,0.000152,4.3e-05,9.4e-05,6.4e-05,3.4e-05,3.5e-05,8e-05,5.5e-05,0.000152,6.1e-05,0.000206,0.00016,0.000179,9e-05,5.5e-05,3.8e-05,6.2e-05,8.1e-05,7.8e-05,9.7e-05,0.000117,6.6e-05,7.7e-05,7.1e-05,3.2e-05,7.2e-05,9e-05,0.000105,0.00014,0.000135,0.000126,0.000125,9.8e-05,8.6e-05,0.000112,0.000124,2.2e-05,3.9e-05,0.000196,0.000245,5e-05,7e-05,0.000194,0.000274,0.000224,0.000157,6.2e-05,0.000127,0.000113,0.000136,7.8e-05,8.2e-05,0.000197,0.000153,5.3e-05,0.000142,6.3e-05,4.5e-05,8.5e-05,0.000107,0.000121,0.000104,8e-05,5.1e-05,8.1e-05,0.000121,0.000148,0.00018,0.000116,6.7e-05,0.000141,0.000141,0.000224,0.000132,0.000107,7.6e-05,2.5e-05,0.000145,3.1e-05,0.00023,0.000262,0.000341,6e-04,0.000447,0.000364,0.000712,0.000988,0.001114,0.000742,0.000449,0.000281,0.00028,0.000255,0.000238,5e-04,0.000786,0.000845,7.4e-05,0.001033
0.000161,0.000116,8.7e-05,0.000148,1.1e-05,0.000175,0.000166,0.000159,0.000293,8.8e-05,0.00012,6.1e-05,8.6e-05,6.2e-05,7.7e-05,7.5e-05,4.4e-05,8.7e-05,3.1e-05,0.000115,0.000124,7e-05,2.4e-05,3.5e-05,0.000102,0.000104,2.8e-05,3.6e-05,3.9e-05,3.1e-05,6.1e-05,0.000129,0.000166,8.9e-05,0.000137,0.000152,0.000113,7.2e-05,0.000103,2.4e-05,8.5e-05,3.7e-05,8e-05,6.8e-05,5.9e-05,9.1e-05,0.000204,0.000201,0.000109,6.1e-05,0.00011,5.3e-05,0.000101,7e-05,0.000105,9e-05,4.3e-05,2e-05,6.2e-05,3.7e-05,0.000172,4.3e-05,0.000162,2.5e-05,0.000195,9.3e-05,0.000115,5.4e-05,0.000125,1.9e-05,0.000108,0.000154,0.000212,0.000194,0.000182,0.000117,9.7e-05,7.1e-05,0.000139,8.7e-05,4.7e-05,9.4e-05,9.9e-05,0.000109,7.7e-05,1.4e-05,4.4e-05,8.2e-05,0.000104,9.4e-05,0.00011,3.2e-05,0.000118,3.6e-05,0.000214,0.000113,8.4e-05,0.00023,0.000133,0.00011,8.6e-05,0.000255,0.000206,0.000447,0.000315,0.000292,0.000483,0.000411,0.000324,0.00064,0.000441,9.2e-05,0.000126,8.7e-05,0.000141,2e-06,0.000448,0.000689,6e-04,0.000811,0.001107
2.2e-05,2.9e-05,4e-05,4.5e-05,9.3e-05,0.000128,5.4e-05,0.000107,0.000123,0.000141,8.2e-05,3.6e-05,7.5e-05,5.1e-05,1.6e-05,4.2e-05,7.9e-05,8.9e-05,8.5e-05,0.000126,2.5e-05,3.3e-05,7.6e-05,7.2e-05,0.000149,3.8e-05,5.2e-05,6e-05,5.6e-05,0.000103,6e-05,0.000145,0.000204,0.000125,8.2e-05,0.000131,1.5e-05,9.6e-05,0.000139,0.000147,0.000163,0.000113,0.000112,0.000138,0.00017,3.1e-05,2e-04,2.2e-05,2.9e-05,0.000133,0.00016,0.00016,3e-05,9.1e-05,7.9e-05,7.8e-05,9e-05,6.6e-05,4.4e-05,4.2e-05,0.000108,0.000107,0.000173,0.000204,9.5e-05,0.000236,0.000185,7.2e-05,9.7e-05,7e-05,0.000115,5.4e-05,0.000226,8.2e-05,9.9e-05,0.000146,7.6e-05,0.00012,0.000231,0.000116,7.3e-05,8.3e-05,6.5e-05,0.000122,0.000201,0.000146,9.5e-05,2.9e-05,7e-05,0.000123,9.7e-05,0.000137,7e-05,4.6e-05,0.000188,0.000173,3.5e-05,0.000207,0.00023,0.000136,7.8e-05,0.000164,2.4e-05,0.000176,0.000106,0.000182,0.000218,0.000141,0.000324,0.000169,0.000155,0.000111,0.000173,0.000234,0.000188,8.4e-05,0.000313,0.000133,0.000381,0.000273,0.000125
5.4e-05,4.4e-05,3.8e-05,5e-05,1.8e-05,9.6e-05,3.3e-05,3.4e-05,3.4e-05,7e-05,4.3e-05,4.2e-05,3.7e-05,9e-05,9.1e-05,6.6e-05,6.4e-05,5.6e-05,6e-05,3.2e-05,6.8e-05,8.5e-05,2.8e-05,2.8e-05,0.000119,6.1e-05,8.3e-05,7e-06,1.9e-05,8.3e-05,0.000191,1.7e-05,5.8e-05,6.5e-05,6.7e-05,0.00011,0.000124,8e-06,1.5e-05,7.7e-05,0.000113,1.1e-05,0.000161,6.9e-05,0.000116,0.000187,5.5e-05,0.000104,0.000106,0.000117,0.000104,0.00011,1e-04,9.1e-05,6.1e-05,0.000127,4.4e-05,7e-05,8.3e-05,5.5e-05,6.3e-05,3.3e-05,0.000123,7.2e-05,0.000167,0.000123,0.000153,0.000121,0.000139,0.000172,0.000136,0.000161,0.000103,9e-05,5.1e-05,0.000103,7.5e-05,0.000108,0.000142,0.000113,6.1e-05,8e-05,8.2e-05,0.000111,5e-05,8e-05,4.3e-05,9.1e-05,1.1e-05,4.8e-05,9.1e-05,5.8e-05,9.7e-05,4e-06,9.9e-05,5.4e-05,6.7e-05,7.1e-05,0.000159,6.5e-05,7.7e-05,9.4e-05,8.6e-05,7.6e-05,0.000134,0.000171,0.000203,2.2e-05,0.000198,0.000196,0.000212,0.000149,0.000195,0.000144,7.9e-05,0.000137,0.000273,0.000258,0.000288,0.000261,0.000333
4e-05,7.3e-05,2.1e-05,4.6e-05,3.6e-05,6.1e-05,0.000108,9.4e-05,0.000139,8.3e-05,3.2e-05,2.6e-05,3e-05,8.5e-05,4.9e-05,6.9e-05,1.6e-05,8.8e-05,6e-05,4.2e-05,6.7e-05,4.2e-05,0.000104,5.9e-05,0.000107,0.000116,8.3e-05,6.2e-05,4.9e-05,3.1e-05,0.000124,0.000137,0.000143,0.000109,4.7e-05,0.000104,0.000104,9.2e-05,9.6e-05,6e-05,3.2e-05,6.6e-05,9.1e-05,7.5e-05,7.4e-05,6.6e-05,0.000125,6.1e-05,2.6e-05,0.000132,9.3e-05,1.9e-05,4.8e-05,6.4e-05,8e-05,7.1e-05,0.000116,8.2e-05,4.7e-05,9.4e-05,0.000109,0.000103,0.000117,0.000141,0.00012,0.000106,0.000137,9.7e-05,8.8e-05,7.4e-05,2.9e-05,5.6e-05,6.9e-05,1e-05,1.4e-05,9.8e-05,7.9e-05,8.6e-05,3.6e-05,5e-05,0.000124,5.6e-05,6.4e-05,9.1e-05,5.4e-05,4.7e-05,0.000114,9.8e-05,9e-05,5.4e-05,7.9e-05,0.000115,3.8e-05,8.5e-05,9.5e-05,6.3e-05,5e-05,4.6e-05,0.000117,7.7e-05,5.7e-05,4.6e-05,5.8e-05,0.000178,0.000123,6.2e-05,0.000152,0.000337,0.000174,0.000303,0.000189,7.8e-05,0.000174,9.2e-05,0.000115,4.4e-05,0.000268,0.000183,0.000241,0.000342,0.000762
3.9e-05,3.4e-05,3.5e-05,1.5e-05,7e-06,2.6e-05,5.1e-05,6.1e-05,7.4e-05,3.6e-05,2.8e-05,2.5e-05,4.6e-05,4.2e-05,4.9e-05,4.4e-05,3e-05,5.1e-05,4.3e-05,4.8e-05,4.1e-05,3.7e-05,7.4e-05,3e-05,5.7e-05,8.2e-05,4.5e-05,3.3e-05,2.7e-05,2.5e-05,7.6e-05,5.4e-05,2.7e-05,6.1e-05,6e-06,9.3e-05,1.2e-05,8e-05,6.5e-05,2.8e-05,6.1e-05,1e-05,3.4e-05,2.9e-05,2.4e-05,1.4e-05,4.8e-05,2.3e-05,1e-06,4.8e-05,6.5e-05,2.5e-05,2.9e-05,1.6e-05,5.2e-05,2.3e-05,1.1e-05,3e-06,6e-05,5.2e-05,3.2e-05,3.3e-05,2.7e-05,6.2e-05,7e-06,7.4e-05,5.3e-05,0.000129,4.3e-05,3.4e-05,2.2e-05,3.9e-05,3.9e-05,2.5e-05,9e-06,4.6e-05,9e-06,5.3e-05,1.4e-05,2.6e-05,4.8e-05,1.5e-05,6.3e-05,2.5e-05,1.6e-05,4.3e-05,4.8e-05,9.1e-05,6e-05,4.2e-05,1.5e-05,6e-05,2.3e-05,5.8e-05,4.2e-05,2.6e-05,3.5e-05,5.1e-05,3.3e-05,1.6e-05,4e-05,3.2e-05,2.4e-05,0.000135,1.9e-05,4.4e-05,0.000128,0.000115,9.6e-05,0.000143,5.5e-05,5.9e-05,9e-05,6.7e-05,2.9e-05,6.4e-05,0.000224,9.8e-05,5.3e-05,0.000243,0.000294
5.4e-05,2.8e-05,3.1e-05,1.4e-05,1.7e-05,3.8e-05,7.5e-05,8.9e-05,6.4e-05,2.2e-05,4.9e-05,4.3e-05,5.7e-05,7.5e-05,7.3e-05,8.6e-05,7e-05,4.4e-05,7.9e-05,6.8e-05,6.1e-05,3.9e-05,6.7e-05,6e-05,4.4e-05,5.1e-05,7.7e-05,5.7e-05,4.1e-05,8.1e-05,9.8e-05,9.4e-05,9.1e-05,0.000111,8.7e-05,0.000117,6.4e-05,0.00011,9.2e-05,5.8e-05,7.6e-05,4.6e-05,2.4e-05,5e-05,2.1e-05,3.6e-05,4.1e-05,4.1e-05,4.5e-05,3.4e-05,6.1e-05,4.8e-05,4.7e-05,7.8e-05,5.9e-05,1.7e-05,2.9e-05,5.1e-05,4.4e-05,2.4e-05,4.1e-05,1.3e-05,4.6e-05,6.3e-05,1.8e-05,7.3e-05,3.8e-05,9.7e-05,2.6e-05,4.5e-05,6.6e-05,1.7e-05,2.3e-05,5.9e-05,3.3e-05,1.4e-05,2.6e-05,5e-05,8e-06,6e-06,1.3e-05,2e-05,6.1e-05,4e-05,3.8e-05,3.6e-05,4.6e-05,8.4e-05,7.4e-05,6.5e-05,3.5e-05,9.2e-05,6.1e-05,8.8e-05,7.6e-05,5.6e-05,7.7e-05,5.8e-05,7.2e-05,3.3e-05,5e-05,2.6e-05,3.4e-05,0.000104,3e-05,4e-06,8e-05,9.1e-05,0.000116,4.6e-05,9e-06,5.4e-05,8.8e-05,8.8e-05,3.4e-05,1.4e-05,0.000215,9.7e-05,8e-05,0.000195,0.000302
1.4e-05,3e-05,2.7e-05,3.7e-05,1.6e-05,5.7e-05,6.3e-05,5.5e-05,6.7e-05,3.3e-05,2.5e-05,2.5e-05,3.7e-05,3.8e-05,1.4e-05,4.4e-05,3.4e-05,4.7e-05,1.2e-05,1.1e-05,2.2e-05,2e-05,7e-06,6.1e-05,7.9e-05,2.5e-05,4.1e-05,4.7e-05,4.3e-05,3e-05,4.2e-05,6e-05,6e-05,6.1e-05,2.6e-05,6.7e-05,5.6e-05,3e-05,6.1e-05,2.6e-05,3e-05,3.2e-05,2.9e-05,7e-06,3.7e-05,1.7e-05,4.2e-05,5.8e-05,4.7e-05,9.8e-05,9.1e-05,0.000144,0.000151,0.00016,0.000158,0.00013,0.000109,0.000147,0.000124,0.000104,0.00011,0.00012,0.000134,0.000146,0.000127,6.6e-05,8.5e-05,7.5e-05,0.000137,7.6e-05,0.000161,0.000145,7.9e-05,9.4e-05,4.3e-05,4.8e-05,4e-05,6.8e-05,2.9e-05,4.4e-05,2.8e-05,1.2e-05,2.1e-05,3e-05,2.2e-05,1.6e-05,2.7e-05,4.4e-05,5.5e-05,1.2e-05,1.4e-05,4.2e-05,9.2e-05,2.6e-05,5.1e-05,4.3e-05,5.2e-05,5.9e-05,7e-05,3.6e-05,1.9e-05,4.9e-05,2.2e-05,9.2e-05,2.2e-05,5.9e-05,8.6e-05,9.6e-05,4.1e-05,0.000147,8.8e-05,8e-05,6.4e-05,0.000105,8e-05,7.1e-05,0.000158,0.000257,0.000134,0.000182,0.000189
2.2e-05,2.5e-05,4e-05,9e-06,6e-06,4.6e-05,6.5e-05,7.7e-05,1.6e-05,1.4e-05,1.4e-05,2e-06,3.1e-05,5.8e-05,4.7e-05,3.6e-05,1e-06,3.6e-05,2.8e-05,1.6e-05,7e-06,1.1e-05,2.3e-05,3.8e-05,2.9e-05,2.5e-05,2.4e-05,2.8e-05,1.3e-05,1.3e-05,5e-06,3.3e-05,4.9e-05,9e-06,4.2e-05,2e-06,3.4e-05,2.5e-05,3e-05,1.3e-05,1.4e-05,1.7e-05,2.5e-05,8e-06,2.1e-05,3.8e-05,4.1e-05,1.4e-05,4.8e-05,1.6e-05,3.4e-05,8.2e-05,2.8e-05,6.3e-05,3.2e-05,5e-05,3.7e-05,0.000111,4e-05,2.9e-05,2.9e-05,9.6e-05,5.9e-05,7.5e-05,3.5e-05,2.7e-05,2.6e-05,1.7e-05,7.3e-05,2.2e-05,7.9e-05,8.1e-05,1.9e-05,5.7e-05,5.3e-05,6.7e-05,1.4e-05,4.2e-05,2.6e-05,5.8e-05,2.7e-05,1.4e-05,3e-06,1.3e-05,2e-06,2.5e-05,2.7e-05,1.3e-05,4e-05,3e-05,1.3e-05,2e-05,4.7e-05,5.7e-05,1.3e-05,5e-05,2.9e-05,4.1e-05,6.1e-05,2.5e-05,5.3e-05,4.9e-05,8e-06,6e-05,3.8e-05,4.9e-05,0.000108,0.000153,9.3e-05,0.000124,2.4e-05,8.9e-05,1.2e-05,3e-05,5.6e-05,0.000209,0.000204,0.000244,0.000119,0.000154,3.9e-05
1.3e-05,2.5e-05,7e-06,6e-06,2.5e-05,1.6e-05,1e-05,4.9e-05,1.6e-05,5e-06,4e-06,9e-06,2.2e-05,2.7e-05,2.7e-05,3e-06,2.5e-05,7e-06,3.4e-05,2.3e-05,2.3e-05,2.3e-05,9e-06,3.3e-05,2.1e-05,4.6e-05,5e-06,1.7e-05,3.2e-05,2.6e-05,2.3e-05,4.7e-05,7.4e-05,2.1e-05,5.2e-05,4e-05,2.5e-05,2.6e-05,2.3e-05,1.8e-05,2.7e-05,2.6e-05,2.1e-05,2.5e-05,1.8e-05,2.9e-05,7.1e-05,1.8e-05,2.7e-05,1.5e-05,1.6e-05,4e-05,4e-05,2.7e-05,3.8e-05,1.3e-05,3.4e-05,4.4e-05,4.9e-05,2.2e-05,3.2e-05,7.1e-05,9.2e-05,1.8e-05,3.4e-05,3e-05,2.3e-05,1.4e-05,4.8e-05,4e-05,9.5e-05,6.5e-05,1.1e-05,9e-06,7e-06,1.2e-05,7e-06,1.1e-05,9e-06,2.7e-05,3.5e-05,3e-05,2.7e-05,1.9e-05,2.3e-05,1.8e-05,5e-06,1.2e-05,1.3e-05,2.9e-05,8e-06,3.5e-05,4.6e-05,3.3e-05,1.8e-05,4.3e-05,3.6e-05,5.4e-05,5.6e-05,4.2e-05,3.2e-05,1.8e-05,6.2e-05,8.4e-05,5e-05,9e-05,0.000116,0.000179,4.2e-05,8.4e-05,7.3e-05,3.4e-05,4.3e-05,6.3e-05,4.5e-05,0.000286,8.3e-05,0.000107,6.9e-05,8.7e-05,8.4e-05
3.5e-05,2.9e-05,3.8e-05,2e-06,1.8e-05,1.6e-05,5.2e-05,5e-05,3.4e-05,3.2e-05,2.1e-05,2.7e-05,4e-05,4.9e-05,3.3e-05,2.3e-05,9e-06,4.3e-05,5.4e-05,1.3e-05,3.1e-05,3.3e-05,6e-06,4.7e-05,5.5e-05,7.4e-05,4.2e-05,3.1e-05,4.9e-05,3.2e-05,4.6e-05,7e-06,6e-05,4e-05,4.8e-05,4.9e-05,3.7e-05,6.6e-05,4.2e-05,1.3e-05,1e-05,3.9e-05,2.2e-05,1.3e-05,3.7e-05,1.4e-05,4.7e-05,6.2e-05,3.9e-05,3.4e-05,3.4e-05,4.4e-05,3.1e-05,3.7e-05,2.3e-05,3.6e-05,9e-06,6e-06,1.8e-05,3e-05,4.7e-05,5.8e-05,2e-05,4.8e-05,2.3e-05,2.5e-05,2.1e-05,2.5e-05,8.7e-05,5.2e-05,8.7e-05,3.9e-05,3.8e-05,3.7e-05,2e-05,3.3e-05,3.7e-05,1.1e-05,4.3e-05,1.4e-05,3.5e-05,2.1e-05,2.6e-05,9e-06,2.9e-05,2.6e-05,1.1e-05,2.9e-05,2.8e-05,3.1e-05,2.1e-05,2.7e-05,6.6e-05,4.8e-05,2.1e-05,2.5e-05,2e-05,3.4e-05,9.6e-05,4e-05,1e-05,3.6e-05,7.6e-05,0.000121,4e-06,0.00022,0.000124,0.000192,0.000182,0.000221,0.000144,2.7e-05,0.000135,0.000136,0.000108,0.000409,5.7e-05,0.000111,0.000104,0.000146,0.000134
3e-05,2.1e-05,4e-06,4e-05,2.2e-05,6.4e-05,5.8e-05,2.7e-05,4.2e-05,3.5e-05,1.2e-05,3.5e-05,1.9e-05,5.9e-05,2.9e-05,1.6e-05,1.7e-05,4.5e-05,3.6e-05,3.5e-05,5e-05,3.4e-05,4.8e-05,4.4e-05,4.7e-05,4e-05,2.2e-05,1.1e-05,6.5e-05,5.9e-05,1.3e-05,6e-05,3e-06,2.1e-05,3.5e-05,7.8e-05,5.1e-05,3.5e-05,1.4e-05,4e-06,1.6e-05,2.8e-05,1.9e-05,2.3e-05,4.7e-05,4.4e-05,2.3e-05,3.8e-05,1.1e-05,2.3e-05,8e-06,4.2e-05,3.8e-05,2.8e-05,4.4e-05,4.5e-05,7.5e-05,1.5e-05,2.5e-05,7e-06,3.5e-05,2.1e-05,6.6e-05,0.000106,6.7e-05,3.7e-05,3e-05,1.8e-05,0.000135,3e-05,0.000101,0.000106,6e-06,1.4e-05,1.7e-05,5.4e-05,3e-05,4e-05,3.3e-05,2.2e-05,1.9e-05,3e-05,1.5e-05,2.8e-05,1.3e-05,8e-06,3e-06,5.5e-05,2.6e-05,5.1e-05,1.1e-05,5.2e-05,8.7e-05,9.2e-05,3.5e-05,4.7e-05,2.3e-05,3.1e-05,0.000115,8e-05,4e-05,5.7e-05,4.1e-05,0.000211,8.3e-05,0.000345,0.000408,0.00033,0.000262,7.2e-05,6e-05,0.000165,0.00013,6.1e-05,3.9e-05,0.000376,0.000483,0.000128,7.2e-05,0.000191,0.000158
4e-05,1.9e-05,1.3e-05,4.3e-05,6.9e-05,5.9e-05,1.6e-05,1.8e-05,2.1e-05,4.1e-05,3.3e-05,3e-05,4.4e-05,2.3e-05,8.9e-05,4.2e-05,1.9e-05,5.4e-05,3.7e-05,4.2e-05,5.1e-05,4.4e-05,3.8e-05,0.000102,8.6e-05,7.6e-05,9e-06,2.1e-05,3.7e-05,5.6e-05,4.2e-05,8.6e-05,3.3e-05,4.3e-05,1.6e-05,6.1e-05,4.1e-05,4.7e-05,4e-06,2.2e-05,2e-05,1.7e-05,2.9e-05,5e-06,3e-05,1.4e-05,1.4e-05,3.1e-05,1.6e-05,2e-05,2.7e-05,3e-05,5.2e-05,4.5e-05,6.3e-05,3.9e-05,0.000109,8.9e-05,4.5e-05,1.3e-05,4.9e-05,4.5e-05,0.000102,0.000191,0.000237,0.00015,6e-05,2.5e-05,0.00015,0.000217,9.1e-05,0.000255,0.000154,5.3e-05,6.6e-05,2.1e-05,8.5e-05,6.4e-05,6.4e-05,7.4e-05,3.4e-05,2.9e-05,2e-05,2.8e-05,2.9e-05,3.6e-05,2.2e-05,8e-05,0.000109,3.6e-05,2.5e-05,6.3e-05,8.1e-05,0.000103,0.000108,3.1e-05,9.2e-05,4.7e-05,0.000122,0.000171,0.000188,0.000169,4.9e-05,0.000501,0.000243,0.000516,0.000661,0.000446,0.000133,0.000235,0.000162,0.000274,0.000323,0.000182,8.1e-05,0.000413,0.000693,0.000541,0.000426,0.000331,0.000219
5.6e-05,2.2e-05,1.7e-05,4.9e-05,8.3e-05,8.4e-05,0.000139,8.2e-05,9.5e-05,5.9e-05,1.6e-05,3.9e-05,1.1e-05,5.1e-05,9.4e-05,9.8e-05,5.7e-05,9.6e-05,6.5e-05,5.8e-05,7.5e-05,1.8e-05,2.2e-05,0.000135,4.8e-05,0.000134,7.5e-05,8e-05,4.6e-05,9.4e-05,4.1e-05,0.00011,8.5e-05,3.4e-05,4.6e-05,4.7e-05,0.000103,1e-04,0.000103,7.7e-05,5.7e-05,4.4e-05,1.3e-05,9e-06,2.7e-05,3.6e-05,6e-06,4.6e-05,4e-05,2.5e-05,3.2e-05,4.1e-05,3.8e-05,3.5e-05,6.6e-05,3.5e-05,8.9e-05,0.000121,8.2e-05,7.4e-05,0.000106,0.000106,7.4e-05,0.00017,5.9e-05,0.000139,7.9e-05,3.2e-05,0.000106,0.000226,0.000264,0.000289,0.000169,0.000129,0.000125,9.7e-05,6.1e-05,2.6e-05,5.9e-05,5.9e-05,5.6e-05,4.4e-05,3.4e-05,1.6e-05,5.6e-05,6.6e-05,6.3e-05,9.5e-05,0.000105,0.000104,3.4e-05,4.4e-05,0.000151,0.000182,5.4e-05,4.2e-05,9.1e-05,0.000106,0.00012,9.6e-05,4.7e-05,0.000131,0.000224,0.000582,0.000611,0.000573,0.000406,1e-04,0.000102,0.000343,0.000249,0.000128,9.6e-05,0.000148,0.000125,0.000473,0.000366,7.1e-05,0.000187,0.000215,8.6e-05
4e-05,2.7e-05,1.7e-05,5.6e-05,6e-05,1.8e-05,1e-04,8.6e-05,4.2e-05,2.3e-05,4.3e-05,9.9e-05,6e-05,5.1e-05,7e-06,7.7e-05,4.4e-05,8.1e-05,5.7e-05,4.7e-05,4.3e-05,5.2e-05,7.8e-05,9.5e-05,0.000132,0.000149,6.4e-05,7.5e-05,7.2e-05,8.5e-05,7.8e-05,7.6e-05,5e-06,5e-05,2e-05,3.2e-05,8.3e-05,3.3e-05,7.5e-05,3.6e-05,5.7e-05,4.2e-05,3.9e-05,1.6e-05,1.3e-05,2.3e-05,2.5e-05,2.2e-05,3.9e-05,2.6e-05,1.5e-05,5.5e-05,5.2e-05,1.1e-05,2.6e-05,1.6e-05,5.9e-05,4.1e-05,2e-05,4.2e-05,8.9e-05,3.4e-05,0.000122,5.8e-05,0.000117,4.1e-05,1.4e-05,4.9e-05,0.000158,8e-05,0.000167,8.1e-05,2.9e-05,7.7e-05,8.7e-05,6.6e-05,5.3e-05,2e-06,6.1e-05,4.7e-05,2.5e-05,1.5e-05,2.4e-05,2.5e-05,4.9e-05,2.2e-05,6.2e-05,9.9e-05,6.6e-05,4e-05,3.8e-05,8e-06,0.000116,0.000118,0.000104,9.3e-05,0.000119,9.6e-05,7.7e-05,5.2e-05,6.4e-05,8.8e-05,0.000255,0.000571,0.000282,0.000405,0.00025,0.000232,8.4e-05,0.000207,7.6e-05,9.3e-05,0.000141,0.000176,0.000152,0.000246,3.5e-05,8.9e-05,4.6e-05,8.1e-05,9.4e-05
3.5e-05,6e-06,1.5e-05,4.9e-05,7.5e-05,1e-05,2.3e-05,2.1e-05,4.1e-05,1.9e-05,8.2e-05,6.7e-05,4.3e-05,7.5e-05,6e-05,4.6e-05,6.6e-05,5.6e-05,1e-05,2.1e-05,5.9e-05,5e-05,6.7e-05,5.3e-05,5.1e-05,0.000133,4.6e-05,5.7e-05,4e-06,6.5e-05,2.1e-05,2.7e-05,8.2e-05,2.7e-05,5.9e-05,9e-06,5.5e-05,5.6e-05,5e-05,7e-05,4.5e-05,4.8e-05,4e-06,2e-05,1.4e-05,1.7e-05,4e-06,1.9e-05,2.9e-05,4.4e-05,5.6e-05,1.6e-05,4.6e-05,3.2e-05,3.3e-05,6.5e-05,5.2e-05,2.2e-05,2e-05,5.6e-05,2.5e-05,2e-05,9e-05,4e-06,3.8e-05,7.6e-05,6.3e-05,2.7e-05,0.00013,9.5e-05,0.000169,9.1e-05,6.4e-05,3.8e-05,7.5e-05,2.2e-05,2.4e-05,3.9e-05,3.7e-05,4.3e-05,6.2e-05,2.6e-05,4e-06,1.4e-05,5.3e-05,3.2e-05,2.4e-05,7.8e-05,6.6e-05,3.6e-05,1.1e-05,4.8e-05,0.000119,8.6e-05,6.8e-05,5.6e-05,5.4e-05,7.1e-05,0.000145,0.000116,8.6e-05,0.000166,0.000141,0.000116,4.6e-05,0.000243,0.000115,6.7e-05,4.1e-05,5.2e-05,4.4e-05,1.8e-05,9.2e-05,8.4e-05,5.8e-05,0.000182,1.8e-05,0.000107,5.2e-05,8.1e-05,4.6e-05
2e-05,2.3e-05,1.5e-05,1.7e-05,3.9e-05,3.5e-05,2.9e-05,3.9e-05,1.5e-05,1.2e-05,4.9e-05,1.8e-05,6e-06,2.9e-05,2.4e-05,2.7e-05,2e-05,2.1e-05,1.2e-05,1.9e-05,9e-06,2e-05,1.9e-05,3.4e-05,1.3e-05,9.5e-05,1.9e-05,3.9e-05,1.9e-05,3.4e-05,3.2e-05,6e-06,5.8e-05,2.3e-05,3.2e-05,2.9e-05,1.5e-05,1e-05,1.5e-05,7e-06,2.5e-05,6e-06,5e-06,7e-06,8e-06,3e-06,3e-06,1.3e-05,1.5e-05,2.7e-05,9e-06,1.2e-05,1.3e-05,1.8e-05,3.7e-05,2e-06,2.1e-05,1.9e-05,2.4e-05,3e-05,7e-06,1.3e-05,4.4e-05,6.1e-05,1.7e-05,3.1e-05,2.6e-05,2.3e-05,5e-05,3.2e-05,6.1e-05,5e-05,9e-06,5.3e-05,3.2e-05,2e-05,2.5e-05,2.5e-05,2e-05,2.5e-05,1.1e-05,7e-06,6e-06,8e-06,1.8e-05,1.6e-05,1.6e-05,4.2e-05,3.6e-05,1.4e-05,2e-06,2.3e-05,7.8e-05,7.9e-05,1.8e-05,2.6e-05,2.6e-05,3.6e-05,7.3e-05,8.7e-05,7.6e-05,7.9e-05,0.000115,9.9e-05,4.3e-05,3.7e-05,7.5e-05,4e-05,4e-05,1.6e-05,3.9e-05,2.8e-05,2.9e-05,7.7e-05,4.8e-05,3.2e-05,3.6e-05,3.5e-05,2.4e-05,2.7e-05,3.9e-05
2.6e-05,4e-06,7e-06,3e-05,0.000129,9.4e-05,2.3e-05,4.6e-05,2.5e-05,4e-06,4.3e-05,3.9e-05,3.6e-05,2.8e-05,6.1e-05,2.9e-05,4e-06,1.3e-05,1.4e-05,2.8e-05,1.8e-05,2.2e-05,2.6e-05,4.8e-05,3.8e-05,0.000242,0.000141,0.00011,3.8e-05,0.000129,2.2e-05,1.7e-05,4.8e-05,7.8e-05,5.8e-05,3.3e-05,2.6e-05,3e-05,1.5e-05,2.6e-05,4e-06,2.1e-05,1.1e-05,8e-06,2.5e-05,1.4e-05,7e-06,9e-06,7e-06,9e-06,1.1e-05,1.1e-05,1e-05,1.4e-05,1.5e-05,1.3e-05,1.3e-05,5e-06,1.2e-05,3.2e-05,1.9e-05,4e-06,4.2e-05,8.5e-05,4.8e-05,1.1e-05,2.5e-05,3e-05,3.8e-05,0.000115,4.8e-05,0.000154,0.000129,0.000164,4.7e-05,1.7e-05,1e-05,3.6e-05,2.3e-05,1.8e-05,2.1e-05,2.2e-05,6e-06,1.7e-05,2.3e-05,2e-06,1.6e-05,3.2e-05,6.3e-05,4.5e-05,2.3e-05,3.5e-05,6.9e-05,1.7e-05,5.3e-05,4.8e-05,4.8e-05,5.8e-05,5.2e-05,6.3e-05,5.3e-05,5.3e-05,5.5e-05,5.5e-05,3.4e-05,0.000108,7.5e-05,5.6e-05,4.3e-05,3.5e-05,2e-06,3.6e-05,4.6e-05,2.7e-05,3.9e-05,6.5e-05,2.5e-05,2.5e-05,1.4e-05,3.5e-05,3.5e-05
3.5e-05,2.3e-05,1.9e-05,2.5e-05,0.000145,0.000155,8.6e-05,5.2e-05,6e-06,1.9e-05,5.8e-05,5.7e-05,5e-06,2e-05,6.5e-05,5.6e-05,1e-05,1.9e-05,2e-05,1.5e-05,2.5e-05,4.8e-05,2.5e-05,3.5e-05,4.2e-05,0.000309,0.000227,0.000115,7.6e-05,0.000182,0.000169,0.000106,0.000105,2e-04,9.3e-05,7.5e-05,9.2e-05,3.2e-05,3.4e-05,3e-06,1.8e-05,1.7e-05,2.8e-05,1.1e-05,3e-05,1.5e-05,5e-06,7e-06,6e-06,1e-05,9e-06,2.4e-05,1.6e-05,1.9e-05,1e-05,8e-06,7e-06,2.2e-05,1e-05,2.8e-05,4.7e-05,3.6e-05,5.8e-05,3.6e-05,6.1e-05,3.4e-05,5e-05,6.3e-05,6.1e-05,0.000161,0.000278,0.000345,0.000182,7.3e-05,0.000145,0.000121,6e-05,5.7e-05,3.6e-05,2.7e-05,3.3e-05,4.7e-05,4.7e-05,6e-06,1.3e-05,2.1e-05,2.8e-05,2.7e-05,3.3e-05,6.8e-05,2.9e-05,4.7e-05,1.6e-05,8.7e-05,0.000127,0.000119,9.6e-05,7.2e-05,8.2e-05,6e-05,0.00011,6.8e-05,5.2e-05,1.6e-05,1e-05,0.000112,3e-06,2.9e-05,5e-06,3.4e-05,1.9e-05,5.5e-05,1.2e-05,1.4e-05,2.3e-05,1.7e-05,1.2e-05,1.1e-05,8e-06,3.7e-05,3.9e-05
8e-06,2.8e-05,3.6e-05,4.8e-05,0.000141,4.3e-05,2.5e-05,1.6e-05,3.7e-05,3.2e-05,3e-05,4.2e-05,4.2e-05,3.7e-05,4.2e-05,2.3e-05,3.9e-05,5.7e-05,2.5e-05,9e-06,1e-05,2.9e-05,4.9e-05,1.5e-05,3.7e-05,0.000223,8.9e-05,3.2e-05,6.7e-05,0.000188,9.9e-05,2.6e-05,6.8e-05,0.000206,0.000175,0.000109,2.4e-05,6.9e-05,6.9e-05,4.6e-05,4.1e-05,4.3e-05,2.8e-05,2.2e-05,3.8e-05,3e-05,2e-05,3e-06,3e-06,7e-06,1.4e-05,2e-05,2.7e-05,2.4e-05,2.8e-05,1.7e-05,2.1e-05,1.6e-05,1.9e-05,1.9e-05,3.9e-05,5e-06,4.3e-05,8.2e-05,1.4e-05,4.1e-05,2e-05,4.3e-05,5.9e-05,0.000114,0.000176,0.000102,7.1e-05,0.000105,7.8e-05,7.3e-05,4.1e-05,5e-05,6.4e-05,6.7e-05,3.8e-05,1.1e-05,1.4e-05,2.1e-05,2.8e-05,2.9e-05,1.3e-05,2.4e-05,3.8e-05,5.3e-05,4.4e-05,3.6e-05,6.2e-05,0.000112,5.4e-05,8e-05,0.000152,9.3e-05,9.8e-05,5.6e-05,0.000102,7e-05,7.4e-05,2.3e-05,1.2e-05,6.9e-05,4.2e-05,1e-05,9e-06,3e-05,2e-05,2.4e-05,2.6e-05,1.4e-05,5e-06,1.8e-05,2e-05,2e-05,1.2e-05,2.7e-05,4.6e-05
1e-05,3.7e-05,8e-06,2e-05,9.9e-05,7.4e-05,4.2e-05,3.3e-05,1.8e-05,9e-06,3.6e-05,3.7e-05,2.1e-05,1.6e-05,4e-05,3.1e-05,3.2e-05,3e-05,3.5e-05,2.9e-05,1.8e-05,3.2e-05,1.4e-05,2.5e-05,2.1e-05,9.5e-05,4.5e-05,3.3e-05,6e-06,9e-05,4.2e-05,1e-05,5e-05,8.9e-05,1e-06,2.2e-05,1.7e-05,4e-05,7e-06,8e-06,3e-05,1e-05,7e-06,9e-06,1.7e-05,4e-06,8e-06,1e-05,5e-06,6e-06,6e-06,3e-06,1.8e-05,4e-06,1.4e-05,2e-05,6e-06,1.9e-05,2e-05,5e-06,3.3e-05,3.4e-05,3e-05,6.9e-05,8.6e-05,3.7e-05,4.3e-05,5.3e-05,4.9e-05,4.1e-05,6.5e-05,4.6e-05,6e-05,8.3e-05,7.8e-05,3.7e-05,2.6e-05,2.8e-05,3.1e-05,5e-06,2.8e-05,1.8e-05,0,1.2e-05,1e-05,1.8e-05,3e-06,1.4e-05,2.5e-05,1.7e-05,1.2e-05,2.7e-05,2.9e-05,3.4e-05,1.6e-05,5.9e-05,3.4e-05,4.4e-05,3.9e-05,3.3e-05,6.7e-05,2.5e-05,3.4e-05,2.6e-05,1e-05,5.8e-05,2e-05,1.1e-05,1.4e-05,2.2e-05,1.6e-05,1.6e-05,1.4e-05,2.3e-05,1.9e-05,3.1e-05,8e-06,2.1e-05,1.5e-05,3e-05,3.8e-05
6.8e-05,7.4e-05,4.8e-05,3.1e-05,6.1e-05,2.6e-05,1.6e-05,2.6e-05,2.6e-05,1.9e-05,2.7e-05,1.9e-05,1.6e-05,6e-06,1.8e-05,9e-06,1.9e-05,3.3e-05,5e-06,1e-05,4e-06,1.4e-05,2.1e-05,4e-05,3.3e-05,7.1e-05,5.4e-05,3e-05,1.7e-05,1.7e-05,2.1e-05,2.2e-05,2.7e-05,4.2e-05,3.6e-05,1.5e-05,1.9e-05,4e-06,1.3e-05,7e-06,1.5e-05,1.3e-05,3e-06,7e-06,8e-06,1.2e-05,8e-06,6e-06,7e-06,1.5e-05,9e-06,7e-06,8e-06,4e-06,1.2e-05,2e-05,1.8e-05,1.9e-05,7e-06,7e-06,2.4e-05,3.6e-05,5e-05,4.8e-05,4.3e-05,3.9e-05,3.6e-05,3.6e-05,5.9e-05,3.4e-05,2.9e-05,2.4e-05,2.3e-05,7e-06,2.9e-05,7e-06,1.3e-05,2.1e-05,3e-06,7e-06,1.5e-05,6e-06,6e-06,8e-06,6e-06,5e-06,6e-06,1.5e-05,1.5e-05,1.6e-05,2.1e-05,9e-06,6e-06,1.9e-05,3e-05,2.6e-05,2.6e-05,2.7e-05,5.2e-05,2.9e-05,5.9e-05,4.3e-05,5e-05,1.7e-05,2.5e-05,6e-05,2.5e-05,1.1e-05,1.8e-05,2.7e-05,1e-05,1.6e-05,1e-05,2.5e-05,2e-05,4.4e-05,1.5e-05,3e-05,8e-06,3.1e-05,3.7e-05
4.3e-05,6.5e-05,3.8e-05,6e-06,5.3e-05,5.1e-05,4.4e-05,4.9e-05,4e-05,2.3e-05,1.1e-05,2.1e-05,2.1e-05,1.4e-05,1.4e-05,9e-06,1.6e-05,1.2e-05,2.2e-05,4e-06,4e-06,5e-06,1.8e-05,3e-05,4e-05,0.000115,4.8e-05,1.5e-05,7e-06,3.2e-05,2e-05,3.5e-05,3e-05,2.6e-05,1e-05,2e-05,2.8e-05,6e-06,3e-06,3e-06,5e-06,7e-06,8e-06,6e-06,7e-06,1e-06,5e-06,3e-06,1e-06,1.6e-05,1e-06,4e-06,5e-06,7e-06,5e-06,1.4e-05,7e-06,5e-06,4e-06,1.2e-05,2.7e-05,2.5e-05,1.1e-05,5.1e-05,3.6e-05,7e-06,9e-06,1.2e-05,2.7e-05,4.5e-05,5.9e-05,1.5e-05,9e-06,2.5e-05,3e-05,8e-06,1.1e-05,1.3e-05,1.1e-05,1.7e-05,2.1e-05,1.6e-05,2e-06,7e-06,8e-06,9e-06,5e-06,9e-06,1.5e-05,7e-06,2.2e-05,1e-05,2e-05,3.3e-05,2.4e-05,3.1e-05,1.7e-05,2.6e-05,2.4e-05,2e-06,4.8e-05,1.8e-05,3e-05,1.6e-05,3.2e-05,1.9e-05,1.3e-05,1.3e-05,1.3e-05,2.1e-05,1.8e-05,1e-05,1.1e-05,1.9e-05,1.7e-05,1.6e-05,2e-06,2.1e-05,1.1e-05,2.2e-05,3.1e-05
1.2e-05,3.8e-05,1.3e-05,1.3e-05,8e-06,3.1e-05,7e-06,2.8e-05,1.6e-05,7e-06,1.2e-05,3e-06,1.8e-05,1e-05,1.3e-05,1e-05,5e-06,1e-05,1.9e-05,1.2e-05,3e-06,3e-06,1.4e-05,1.5e-05,2.2e-05,5.3e-05,2.7e-05,1.7e-05,7e-06,2.3e-05,2.1e-05,2.4e-05,3e-06,1.9e-05,2.6e-05,1e-05,2.2e-05,3.2e-05,2e-05,1.5e-05,1.5e-05,1.3e-05,1e-05,1e-05,1.1e-05,5e-06,1.3e-05,1e-06,8e-06,1.3e-05,9e-06,9e-06,7e-06,4e-06,1e-05,6e-06,6e-06,6e-06,1.5e-05,7e-06,1.2e-05,1.4e-05,3e-05,1.4e-05,1.7e-05,1.2e-05,6e-06,8e-06,1.4e-05,4.1e-05,4.1e-05,2.5e-05,2.5e-05,4e-06,3.4e-05,1.4e-05,8e-06,1e-05,1.7e-05,8e-06,1e-05,2e-06,3e-06,7e-06,1.4e-05,1e-05,1e-06,1.5e-05,1.7e-05,9e-06,2.9e-05,1e-05,1.4e-05,2e-05,2.6e-05,1.7e-05,1.5e-05,2.7e-05,2.3e-05,2e-06,3.3e-05,2.8e-05,3.8e-05,3e-06,1.8e-05,4.2e-05,2.6e-05,2.7e-05,1.3e-05,5e-06,3.3e-05,2.7e-05,7e-06,1.8e-05,3.4e-05,2.4e-05,3.6e-05,4.5e-05,1.1e-05,2.8e-05,4.1e-05
2.7e-05,5e-06,5e-06,1.7e-05,9e-06,3e-05,2.8e-05,1.4e-05,1.1e-05,5e-06,1.2e-05,2e-06,1.3e-05,4e-06,7e-06,1.1e-05,1.3e-05,1.1e-05,1e-06,1e-06,1.2e-05,8e-06,1.3e-05,1.7e-05,7e-06,8e-06,3e-06,2.1e-05,3e-06,1.4e-05,1.3e-05,1.4e-05,2e-05,1.6e-05,8e-06,5e-06,1.8e-05,9e-06,3e-06,8e-06,1.2e-05,4e-06,7e-06,3e-06,7e-06,7e-06,7e-06,1.2e-05,6e-06,3e-06,6e-06,8e-06,5e-06,6e-06,1.2e-05,6e-06,1.2e-05,1.1e-05,7e-06,7e-06,5e-06,1.6e-05,1.8e-05,2.5e-05,1.7e-05,1.7e-05,1.1e-05,7e-06,2e-05,4.4e-05,3.7e-05,1.4e-05,1.5e-05,1e-05,2e-05,6e-06,1.3e-05,4e-06,1.9e-05,1.4e-05,5e-06,8e-06,4e-06,2e-06,5e-06,7e-06,3e-06,1.4e-05,8e-06,1e-05,2e-05,1e-05,1.4e-05,1.3e-05,2.4e-05,1.4e-05,2.7e-05,2.1e-05,2.7e-05,1.3e-05,4.5e-05,3.2e-05,1.6e-05,1.2e-05,1.5e-05,5.5e-05,3e-06,1.4e-05,2.7e-05,2.1e-05,2.7e-05,6e-06,1e-05,1.5e-05,2.5e-05,4.8e-05,4.1e-05,1.1e-05,2.4e-05,4.8e-05,4.3e-05
2.4e-05,1.2e-05,7e-06,9e-06,2.6e-05,7e-06,1.4e-05,1.8e-05,1.1e-05,1e-06,7e-06,9e-06,3e-06,9e-06,4e-06,9e-06,2e-06,6e-06,9e-06,4e-06,7e-06,6e-06,8e-06,1.3e-05,1e-05,2.4e-05,3e-06,3e-06,1.2e-05,2.3e-05,1e-05,3e-06,7e-06,5e-06,9e-06,5e-06,6e-06,4e-06,5e-06,4e-06,6e-06,1e-06,7e-06,7e-06,2e-06,4e-06,3e-06,6e-06,3e-06,4e-06,2e-06,5e-06,2e-06,1e-06,2e-05,1.2e-05,1.9e-05,8e-06,1.5e-05,6e-06,8e-06,1.1e-05,1.3e-05,2.2e-05,3.6e-05,1.1e-05,2.9e-05,1.1e-05,3e-05,3.9e-05,4.1e-05,1.7e-05,2e-05,2.3e-05,2.4e-05,3e-06,9e-06,3e-06,6e-06,1.1e-05,9e-06,3e-06,5e-06,6e-06,7e-06,1.2e-05,2e-06,1.4e-05,1.9e-05,3e-06,1.9e-05,4.2e-05,3.4e-05,4.2e-05,2.4e-05,3.5e-05,6.1e-05,3.7e-05,4e-05,6e-06,4.9e-05,2.9e-05,3.6e-05,5e-06,1.3e-05,3.1e-05,1.9e-05,1.3e-05,4e-05,2.8e-05,1.3e-05,2.1e-05,1.3e-05,1.5e-05,2.4e-05,4.1e-05,2e-05,7e-06,2.5e-05,2.8e-05,4.4e-05
1.8e-05,9e-06,1.5e-05,1.4e-05,2.6e-05,2e-05,2.1e-05,1.8e-05,7e-06,2e-06,4e-06,7e-06,8e-06,7e-06,3e-06,5e-06,4e-06,2e-06,9e-06,4e-06,6e-06,2e-06,7e-06,4e-06,6e-06,2.5e-05,1.7e-05,2.1e-05,7e-06,1.1e-05,1.6e-05,7e-06,1e-05,1.5e-05,6e-06,9e-06,1.4e-05,1.2e-05,5e-06,2e-06,2e-06,2e-06,0,5e-06,3e-06,5e-06,2e-06,1e-05,3e-06,4e-06,6e-06,2e-06,4e-06,5e-06,2.8e-05,1.1e-05,9e-06,2.2e-05,2e-06,9e-06,1.7e-05,3.8e-05,2.4e-05,3.6e-05,2.6e-05,1e-05,2.7e-05,4e-05,5.4e-05,3.5e-05,2.7e-05,4.3e-05,3e-05,4.6e-05,5.1e-05,1.3e-05,2.2e-05,1.2e-05,1.6e-05,1.4e-05,1.6e-05,8e-06,1.8e-05,8e-06,1.3e-05,1.1e-05,2e-06,1.8e-05,2e-05,5e-06,1.8e-05,6e-05,2.3e-05,3.6e-05,4.9e-05,3e-05,1.2e-05,1.3e-05,2.7e-05,4.1e-05,2.6e-05,2.6e-05,1.4e-05,1.6e-05,2.1e-05,2.2e-05,1.5e-05,5e-06,2.4e-05,2.5e-05,8e-06,2.4e-05,2.1e-05,1.1e-05,1.4e-05,3.9e-05,3.1e-05,2e-05,2.8e-05,3.1e-05,6e-05
1.2e-05,1.9e-05,5e-06,9e-06,1.4e-05,7e-06,4e-06,7e-06,1.8e-05,1e-05,5e-06,8e-06,2e-06,3e-06,1e-05,7e-06,3e-06,9e-06,2e-06,3e-06,1e-05,5e-06,5e-06,5e-06,1.2e-05,2e-06,9e-06,5e-06,4e-06,8e-06,8e-06,2e-06,1.4e-05,2.1e-05,1.7e-05,1.8e-05,7e-06,1.2e-05,7e-06,6e-06,6e-06,7e-06,6e-06,4e-06,2e-06,3e-06,1e-06,6e-06,3e-06,8e-06,4e-06,8e-06,8e-06,2e-06,1.8e-05,1.7e-05,4e-06,1.7e-05,2.2e-05,1.9e-05,2.7e-05,2.6e-05,2.6e-05,2e-05,2.2e-05,2.6e-05,3.4e-05,6.9e-05,5.4e-05,8.4e-05,4e-05,4.9e-05,5.4e-05,2.5e-05,6.1e-05,6.5e-05,3.2e-05,3.6e-05,2.3e-05,2e-05,2.5e-05,1.7e-05,1.4e-05,1.1e-05,2.4e-05,2.2e-05,1.9e-05,1.8e-05,2.3e-05,2.3e-05,2.2e-05,4.8e-05,6e-05,4.4e-05,1.3e-05,6e-06,1.2e-05,1e-06,4e-06,3.5e-05,4.5e-05,2.3e-05,6e-06,3e-05,8e-06,9e-06,2e-05,9e-06,1.4e-05,2.2e-05,1.2e-05,1.5e-05,2.1e-05,1.1e-05,1.3e-05,3e-05,1.4e-05,1.6e-05,1.5e-05,2e-05,1.7e-05
1.5e-05,2e-05,1.5e-05,1.6e-05,7e-06,9e-06,4e-06,1.7e-05,1.7e-05,1.1e-05,9e-06,0,6e-06,3e-06,9e-06,6e-06,4e-06,1.1e-05,1e-05,3e-06,5e-06,3e-06,9e-06,8e-06,1.4e-05,9e-06,6e-06,4e-06,2e-06,1e-05,1.2e-05,5e-06,8e-06,1.2e-05,1e-05,1.5e-05,1.4e-05,1.9e-05,1.1e-05,6e-06,1.2e-05,1.2e-05,9e-06,6e-06,1e-05,9e-06,3e-06,9e-06,6e-06,1.7e-05,8e-06,6e-06,1e-05,8e-06,1.1e-05,1.4e-05,1.5e-05,1.6e-05,1.2e-05,9e-06,1.8e-05,2.4e-05,2e-05,4.7e-05,1.9e-05,3.4e-05,3.7e-05,2.3e-05,7.2e-05,6.3e-05,3.7e-05,2.3e-05,2.8e-05,4.1e-05,5.3e-05,2.7e-05,4.2e-05,2e-05,2.4e-05,1.9e-05,1.2e-05,2e-05,1.5e-05,1.3e-05,2.9e-05,1.8e-05,3e-05,4.7e-05,2.8e-05,1.3e-05,2.5e-05,1.2e-05,3.7e-05,5e-06,5e-06,1.6e-05,3e-05,9e-06,2.3e-05,2.1e-05,3e-06,2.7e-05,1.7e-05,3.8e-05,2.3e-05,4.2e-05,7e-06,4e-06,2.4e-05,2.2e-05,5e-06,8e-06,1.5e-05,4e-06,1.5e-05,3e-05,8e-06,1.3e-05,5e-06,1.3e-05,1.9e-05
2.1e-05,1.8e-05,1.5e-05,1e-05,2e-05,8e-06,1.5e-05,1.3e-05,2e-06,3e-06,4e-06,9e-06,9e-06,4e-06,1e-05,3e-06,2e-06,8e-06,2e-06,6e-06,8e-06,5e-06,7e-06,8e-06,1.3e-05,8e-06,9e-06,1.4e-05,9e-06,2.4e-05,2.9e-05,2.7e-05,6e-06,4.4e-05,2.3e-05,1.6e-05,1e-06,1.1e-05,1.5e-05,1.7e-05,1.2e-05,2e-06,4e-06,5e-06,1.3e-05,6e-06,6e-06,5e-06,6e-06,1.2e-05,1e-05,2e-06,6e-06,4e-06,3.5e-05,7e-06,2.8e-05,2.6e-05,2.3e-05,7e-06,2.8e-05,4e-05,7.9e-05,0.000102,0.000104,3.8e-05,6.8e-05,2.4e-05,7.3e-05,0.00012,7.4e-05,3.1e-05,2.8e-05,3.4e-05,3.5e-05,4.9e-05,2.5e-05,1.1e-05,1e-05,2.4e-05,1e-05,1.1e-05,5e-06,3e-06,2.9e-05,5.1e-05,4.1e-05,1.9e-05,1.3e-05,2.8e-05,3.6e-05,3.1e-05,4.8e-05,3.1e-05,5.2e-05,3.9e-05,1.2e-05,8e-06,2.5e-05,2.8e-05,3.6e-05,2.2e-05,3.9e-05,3e-05,1.5e-05,4e-05,1.6e-05,1.1e-05,1.7e-05,6.1e-05,3.4e-05,1.6e-05,2.3e-05,2.5e-05,1.1e-05,1.3e-05,1.7e-05,2.4e-05,1.9e-05,1.6e-05,2e-05
2.3e-05,2.7e-05,2.1e-05,2.2e-05,8e-06,2.6e-05,5e-06,1.6e-05,1.8e-05,1e-05,3e-06,1.4e-05,1.4e-05,8e-06,1.3e-05,9e-06,2e-06,8e-06,1e-05,4e-06,6e-06,9e-06,9e-06,3e-06,1.1e-05,8e-06,3e-06,4e-06,3e-06,4.7e-05,1.6e-05,1.1e-05,3e-05,7e-05,5.1e-05,1.9e-05,2.2e-05,9e-06,1.7e-05,1.8e-05,2.6e-05,1.4e-05,4e-06,1.2e-05,1.5e-05,4e-06,6e-06,1e-05,9e-06,1e-05,8e-06,1e-05,8e-06,9e-06,4.5e-05,4.9e-05,6.8e-05,7.3e-05,5.5e-05,4.2e-05,3.5e-05,6e-05,5.5e-05,1.5e-05,8e-05,3.9e-05,9.4e-05,9.3e-05,8.1e-05,0.000108,0.000118,7.6e-05,1.9e-05,2.7e-05,2e-05,2.6e-05,3.7e-05,2.8e-05,2.7e-05,1.6e-05,2.5e-05,1.9e-05,1.1e-05,1e-05,1.7e-05,2.8e-05,2.6e-05,3.1e-05,4e-05,3.9e-05,1.1e-05,2.3e-05,5.3e-05,1.6e-05,7.1e-05,1.1e-05,3.4e-05,1.9e-05,4.1e-05,7e-06,2.9e-05,4.8e-05,6e-05,4.9e-05,5.5e-05,5.3e-05,2.7e-05,1.2e-05,5e-06,4.8e-05,1.3e-05,1.2e-05,2.1e-05,1.5e-05,1.9e-05,1.9e-05,1.6e-05,4e-06,1e-06,2e-05,2.5e-05
2.6e-05,1.8e-05,3e-06,1.6e-05,2.5e-05,3.1e-05,3.4e-05,1e-05,1e-05,1e-05,5e-06,5e-06,8e-06,7e-06,1e-05,8e-06,6e-06,1.1e-05,9e-06,9e-06,7e-06,6e-06,1.1e-05,1.9e-05,2.2e-05,2.3e-05,2.9e-05,2e-05,2.4e-05,6.2e-05,5.3e-05,7e-06,2.2e-05,3.6e-05,1.8e-05,8e-06,4.1e-05,4.3e-05,1.7e-05,2.7e-05,3.5e-05,1.4e-05,9e-06,5e-06,2e-06,9e-06,4e-06,5e-06,6e-06,7e-06,1e-06,5e-06,5e-06,8e-06,4.5e-05,4.9e-05,4.9e-05,3.5e-05,1.1e-05,2.3e-05,2.4e-05,2.2e-05,7.2e-05,5.5e-05,6e-05,3.9e-05,7.7e-05,0.000134,6.9e-05,7.1e-05,7e-05,3.4e-05,1.7e-05,5.5e-05,5.6e-05,6.9e-05,9.1e-05,3.9e-05,6e-06,2.4e-05,3.1e-05,2.4e-05,2.1e-05,5e-06,1.2e-05,4e-06,2.8e-05,3.4e-05,3.2e-05,4.7e-05,5.9e-05,5.8e-05,7.9e-05,8.7e-05,0.000109,9.6e-05,8e-05,6.1e-05,6.3e-05,4.5e-05,1.2e-05,2.9e-05,6e-06,1.7e-05,2.5e-05,8e-06,1e-05,6e-06,2e-06,2.9e-05,1.1e-05,1.1e-05,1e-05,1e-05,8e-06,2.1e-05,6e-06,1.2e-05,1.4e-05,1.7e-05,2.8e-05
7e-06,9e-06,4e-06,1e-05,2.1e-05,1e-05,1.8e-05,1.4e-05,8e-06,6e-06,6e-06,8e-06,4e-06,2e-06,1e-05,1e-05,1.1e-05,3e-06,8e-06,7e-06,3e-06,5e-06,4e-06,1.3e-05,1e-06,1.5e-05,2.6e-05,3.5e-05,2.3e-05,2.1e-05,3.3e-05,3.3e-05,1.5e-05,1.1e-05,1.1e-05,2.1e-05,3.6e-05,2.7e-05,2.6e-05,3e-06,1.1e-05,1.3e-05,1.4e-05,1.4e-05,7e-06,1e-05,9e-06,2e-06,3e-06,1e-06,4e-06,4e-06,2e-06,3e-06,3.2e-05,1.8e-05,4.8e-05,1.9e-05,1e-05,1.8e-05,2.7e-05,1.6e-05,4.6e-05,3.4e-05,7e-05,6.4e-05,2.9e-05,5.7e-05,4.6e-05,9e-06,5.1e-05,1.7e-05,2.7e-05,5.6e-05,3.3e-05,3.9e-05,2.3e-05,2.1e-05,1.9e-05,5e-06,2.2e-05,3.2e-05,2e-05,1.1e-05,6e-06,1e-05,2e-05,4e-06,2e-05,6e-06,2.2e-05,2.5e-05,4.3e-05,4.8e-05,6.3e-05,5.7e-05,2.4e-05,2.4e-05,1.3e-05,5e-06,5e-06,1.6e-05,2.3e-05,7e-06,4e-06,1.1e-05,9e-06,1e-06,3e-06,9e-06,7e-06,1e-05,1e-06,2e-06,7e-06,1.8e-05,2e-06,1.7e-05,8e-06,1.6e-05,9e-06
1.2e-05,5e-06,1e-06,3e-06,7e-06,1e-06,1e-05,1.2e-05,2e-06,3e-06,4e-06,7e-06,4e-06,0,4e-06,2e-06,6e-06,3e-06,1e-06,2e-06,1e-06,2e-06,2e-06,9e-06,6e-06,1.6e-05,7e-06,1.7e-05,1.3e-05,2e-05,9e-06,8e-06,1.8e-05,1.2e-05,4e-06,1.7e-05,7e-06,9e-06,5e-06,5e-06,1e-06,4e-06,1e-06,4e-06,3e-06,1e-06,3e-06,4e-06,1e-06,5e-06,1e-06,3e-06,2e-06,3e-06,1.7e-05,5e-06,1.7e-05,9e-06,0,1e-05,4e-06,1.2e-05,3.2e-05,1.5e-05,1.7e-05,1.9e-05,2.5e-05,1.7e-05,3e-06,5e-06,4e-05,1.3e-05,1e-05,3e-05,1.8e-05,2e-05,1.2e-05,6e-06,8e-06,9e-06,1.3e-05,1e-05,1e-05,4e-06,7e-06,7e-06,4e-06,6e-06,9e-06,3e-06,1.1e-05,1.8e-05,9e-06,1.6e-05,2.4e-05,1.7e-05,8e-06,1.5e-05,5e-06,6e-06,8e-06,8e-06,1.5e-05,4e-06,7e-06,1.6e-05,1e-05,1e-05,2e-06,1.8e-05,5e-06,1e-06,2e-06,2e-06,4e-06,2.1e-05,4e-06,1e-05,7e-06,1.4e-05,1.4e-05
1.1e-05,4e-06,1e-06,1e-06,3e-06,2e-06,8e-06,1e-05,1e-06,2e-06,5e-06,5e-06,3e-06,1e-06,1e-06,1e-06,4e-06,4e-06,2e-06,0,0,1e-06,0,6e-06,4e-06,1.4e-05,9e-06,1.5e-05,1.2e-05,1.2e-05,4e-06,7e-06,1.5e-05,6e-06,6e-06,8e-06,5e-06,5e-06,4e-06,4e-06,2e-06,2e-06,2e-06,2e-06,1e-06,1e-06,3e-06,5e-06,2e-06,6e-06,2e-06,1e-06,3e-06,4e-06,7e-06,3e-06,1.2e-05,6e-06,2e-06,3e-06,6e-06,1.1e-05,1.9e-05,8e-06,4e-06,8e-06,1.9e-05,1e-05,6e-06,1e-06,3.3e-05,1e-05,7e-06,2.3e-05,1.8e-05,2e-05,5e-06,7e-06,5e-06,4e-06,9e-06,6e-06,5e-06,1e-06,6e-06,3e-06,4e-06,6e-06,6e-06,2e-06,7e-06,9e-06,6e-06,9e-06,1.4e-05,1.1e-05,8e-06,1.1e-05,5e-06,4e-06,3e-06,4e-06,1.6e-05,4e-06,7e-06,1.3e-05,7e-06,6e-06,3e-06,1.9e-05,4e-06,3e-06,1e-06,1e-06,4e-06,1.9e-05,1e-06,1.1e-05,5e-06,1.6e-05,1.5e-05
1e-05,4e-06,1e-06,1e-06,2e-06,1e-06,8e-06,1e-05,1e-06,2e-06,4e-06,4e-06,1e-06,1e-06,2e-06,2e-06,3e-06,3e-06,1e-06,1e-06,1e-06,1e-06,1e-06,5e-06,3e-06,8e-06,3e-06,1.1e-05,7e-06,1.1e-05,6e-06,6e-06,1.4e-05,5e-06,8e-06,7e-06,3e-06,3e-06,4e-06,3e-06,4e-06,1e-06,1e-06,2e-06,1e-06,0,3e-06,4e-06,1e-06,5e-06,1e-06,2e-06,2e-06,4e-06,6e-06,2e-06,1e-05,6e-06,2e-06,1e-06,3e-06,8e-06,1.5e-05,1.1e-05,2e-06,8e-06,1.6e-05,7e-06,3e-06,4e-06,3.3e-05,7e-06,7e-06,1.9e-05,1.3e-05,1.6e-05,2e-06,5e-06,5e-06,3e-06,8e-06,4e-06,4e-06,1e-06,5e-06,3e-06,2e-06,5e-06,7e-06,3e-06,4e-06,5e-06,3e-06,6e-06,1.3e-05,1e-05,8e-06,9e-06,4e-06,3e-06,3e-06,3e-06,1.5e-05,5e-06,6e-06,1.6e-05,3e-06,8e-06,3e-06,1.9e-05,2e-06,1e-06,1e-06,1e-06,4e-06,1.8e-05,2e-06,1.1e-05,6e-06,1.2e-05,1.8e-05
