0.097527,0.101369,0.10212,0.101101,0.095205,0.085573,0.079639,0.082805,0.088753,0.089211,0.088967,0.08895,0.091448,0.095503,0.090054,0.087721,0.091572,0.086058,0.080843,0.070676,0.06273,0.066758,0.067471,0.066333,0.073187,0.079415,0.088292,0.088564
0.125968,0.13781,0.139652,0.134515,0.126472,0.114399,0.106977,0.11267,0.120966,0.122873,0.120717,0.119225,0.124294,0.128937,0.121042,0.115941,0.119818,0.112497,0.107891,0.093786,0.080936,0.088399,0.085832,0.079601,0.091093,0.103049,0.120412,0.123588
0.184885,0.214438,0.218054,0.201468,0.189832,0.174705,0.163549,0.174569,0.190199,0.195933,0.18814,0.184504,0.194913,0.198046,0.184167,0.173962,0.178369,0.167661,0.16516,0.143882,0.121038,0.134557,0.123059,0.104047,0.125271,0.1513,0.189494,0.199836
0.249768,0.300835,0.306658,0.27567,0.26319,0.248733,0.230739,0.243208,0.270646,0.284059,0.268396,0.262594,0.278803,0.278361,0.258109,0.243423,0.249002,0.235526,0.234476,0.204298,0.170989,0.190631,0.16696,0.131702,0.163315,0.208058,0.273875,0.292178
0.295985,0.358547,0.367062,0.331823,0.32303,0.310335,0.285342,0.29274,0.330591,0.352527,0.330719,0.323313,0.342342,0.34089,0.318066,0.299641,0.307328,0.29509,0.291586,0.257943,0.222169,0.24015,0.205182,0.163934,0.203111,0.260403,0.344229,0.361118
0.319239,0.368757,0.381766,0.363765,0.361503,0.350629,0.324127,0.318302,0.356961,0.377862,0.350755,0.345161,0.361518,0.365683,0.350375,0.331809,0.345091,0.33971,0.327259,0.303835,0.278718,0.277731,0.23288,0.200832,0.243325,0.305415,0.379666,0.374351
0.409066,0.440703,0.45175,0.437017,0.447407,0.454428,0.420774,0.381029,0.406755,0.420025,0.395569,0.398999,0.409053,0.418355,0.418587,0.413281,0.436269,0.427206,0.395888,0.385202,0.372249,0.352398,0.298804,0.276684,0.330939,0.405585,0.438576,0.388499
0.633711,0.695031,0.703357,0.641695,0.663778,0.699421,0.641855,0.558586,0.577684,0.59631,0.570026,0.5795,0.596653,0.61306,0.625364,0.625567,0.643901,0.610698,0.56716,0.548902,0.517784,0.511147,0.458709,0.426272,0.507757,0.615055,0.631562,0.545199
0.990449,1.13921,1.147639,0.969155,0.997314,1.07159,0.986389,0.867803,0.87245,0.8807,0.84671,0.8832,0.921584,0.937541,0.957352,0.964849,0.96783,0.889103,0.857712,0.81978,0.734823,0.776071,0.74143,0.660472,0.757576,0.911859,0.944307,0.847283
1.507084,1.794207,1.796337,1.416012,1.444911,1.564144,1.444348,1.317814,1.299697,1.260275,1.20655,1.291865,1.344721,1.336218,1.391231,1.457948,1.453717,1.276618,1.263055,1.250113,1.104038,1.199924,1.183242,0.987433,1.063144,1.272818,1.354626,1.272614
2.17145,2.602069,2.586539,1.96294,1.98395,2.130775,1.951025,1.828149,1.786844,1.684004,1.605712,1.744555,1.803893,1.750344,1.868907,2.074219,2.111034,1.783814,1.758204,1.828298,1.631728,1.766215,1.753383,1.376094,1.372358,1.622636,1.802301,1.788566
2.696453,3.197524,3.175,2.421774,2.42871,2.532024,2.270438,2.171046,2.136895,1.987025,1.879823,2.024628,2.086721,2.037001,2.24286,2.609359,2.705649,2.211911,2.113823,2.286247,2.08593,2.223583,2.214863,1.657076,1.547444,1.848998,2.133606,2.203366
2.669621,3.096992,3.094061,2.432416,2.422626,2.447275,2.132587,2.055874,2.046198,1.89978,1.82493,1.926586,1.957852,1.985308,2.258047,2.690668,2.805025,2.228845,2.040487,2.257547,2.110607,2.214918,2.226858,1.649076,1.510652,1.848243,2.142255,2.241524
2.018432,2.242603,2.2674,1.891737,1.899131,1.863277,1.593487,1.538062,1.519172,1.432916,1.444037,1.470883,1.444249,1.558097,1.820999,2.152443,2.21729,1.755717,1.543058,1.669507,1.601915,1.677161,1.72314,1.356977,1.27697,1.517798,1.698682,1.787094
1.394456,1.449908,1.506567,1.36435,1.349525,1.372767,1.361385,1.333508,1.167252,1.056366,1.103731,1.049228,1.022295,1.215414,1.423692,1.55687,1.521387,1.278212,1.048762,1.000828,1.004399,1.085169,1.23872,1.230178,1.173705,1.180678,1.205852,1.210984
1.587554,1.644927,1.73609,1.528278,1.456543,1.620706,1.829068,1.785353,1.500436,1.276393,1.199375,1.032463,1.089246,1.464419,1.724336,1.78823,1.684674,1.472276,1.102851,0.973453,1.029221,1.083353,1.398003,1.617486,1.404619,1.237896,1.339881,1.359676
2.277424,2.277708,2.355659,2.050229,1.946752,2.223931,2.52401,2.37172,1.965688,1.749899,1.626712,1.348392,1.460175,2.023559,2.28727,2.337941,2.292128,1.986666,1.422326,1.24134,1.307607,1.334171,1.775905,2.126968,1.800624,1.586009,1.766203,1.838981
2.976587,2.791983,2.754722,2.471051,2.374689,2.68661,3.00137,2.742675,2.282978,2.179137,2.056998,1.721143,1.924409,2.645073,2.802789,2.753979,2.792397,2.396727,1.675929,1.457526,1.470865,1.420973,1.945746,2.424587,2.094326,1.873321,2.028911,2.182852
3.456309,3.030088,2.822104,2.763557,2.77257,2.93081,3.123023,2.893269,2.440648,2.419041,2.33765,2.148068,2.514441,3.166402,3.185084,3.125222,3.174141,2.624449,1.849663,1.683387,1.588,1.369427,1.941846,2.563147,2.32188,2.075202,2.05738,2.264801
3.578261,3.097232,2.855113,3.08577,3.237577,3.073973,2.986378,2.890564,2.462154,2.405846,2.3903,2.629314,3.169094,3.383932,3.304519,3.454345,3.496115,2.807043,2.065768,2.061026,1.867321,1.425541,2.089602,2.823616,2.620991,2.392568,2.24059,2.348314
3.321367,2.897186,2.749505,3.239756,3.54189,3.139929,2.8127,2.681725,2.297917,2.182491,2.253446,3.080493,3.622379,3.172564,2.98363,3.314176,3.389481,2.775619,2.198508,2.31792,2.100135,1.561784,2.168463,2.875711,2.70119,2.520307,2.410516,2.392837
2.687776,2.24947,2.201513,2.862078,3.314346,2.902505,2.500222,2.259428,1.975109,1.795239,1.948446,3.191062,3.56544,2.615619,2.360078,2.7051,2.771637,2.41707,2.127426,2.232016,2.010998,1.571321,1.940375,2.386977,2.320669,2.293313,2.301403,2.216798
1.799411,1.457447,1.499617,2.083412,2.584019,2.294177,1.842869,1.633541,1.534379,1.325561,1.534655,2.70002,2.907759,2.008363,1.652325,1.803526,1.938372,1.862762,1.779564,1.812023,1.716571,1.545571,1.595028,1.685922,1.740036,1.813087,1.811298,1.699678
1.160744,1.106354,1.176409,1.478597,1.759148,1.562711,1.177598,1.061615,1.17445,1.090923,1.132847,1.73621,1.870632,1.393197,1.145269,1.21373,1.335973,1.333945,1.300835,1.327071,1.471075,1.533335,1.415873,1.270172,1.31517,1.383797,1.292312,1.136312
0.949679,1.11893,1.231092,1.297423,1.361661,1.278025,0.975807,0.847135,0.993557,1.037273,0.954422,1.091428,1.190608,1.012386,0.968772,1.166543,1.231935,1.191618,1.090693,1.149435,1.401032,1.440583,1.273334,1.081323,1.191517,1.228552,1.137503,1.086733
0.901215,1.155575,1.325447,1.273562,1.30231,1.411988,1.20744,1.005474,1.140496,1.214847,1.035945,0.970487,1.094199,1.085904,1.135591,1.408168,1.392881,1.318633,1.155757,1.099347,1.228298,1.174127,1.098797,0.958762,1.135199,1.232291,1.186237,1.293828
0.993994,1.210694,1.444382,1.342576,1.448458,1.789074,1.597486,1.291853,1.390488,1.407185,1.110525,0.915145,1.112981,1.236209,1.339143,1.584761,1.532414,1.495752,1.325135,1.146154,1.062715,0.905763,0.906802,0.902689,1.181822,1.267803,1.207594,1.46063
1.141063,1.183573,1.518508,1.480564,1.598126,2.053292,1.828787,1.422895,1.479829,1.464142,1.136282,0.91691,1.112457,1.249608,1.385921,1.527844,1.476078,1.514449,1.38465,1.19784,1.0274,0.794579,0.755169,0.84914,1.219548,1.278165,1.15468,1.406048
1.177593,1.064758,1.426167,1.404095,1.484677,1.918846,1.679525,1.251204,1.282917,1.284545,1.00605,0.835796,1.002129,1.078924,1.182694,1.311735,1.271191,1.263343,1.251075,1.123716,0.902372,0.764979,0.783953,0.83069,1.074514,1.140259,0.975943,1.064598
0.988097,0.812935,1.112983,1.106518,1.203445,1.472823,1.242734,0.910956,0.855071,0.873907,0.718781,0.620006,0.827271,0.87058,0.824668,0.968113,0.95894,0.943165,1.028835,0.884471,0.640271,0.641087,0.76089,0.741202,0.771997,0.858538,0.73256,0.688509
0.678073,0.577635,0.785478,0.870743,0.958566,0.981296,0.813982,0.588331,0.452037,0.496976,0.44982,0.389439,0.632534,0.726537,0.571909,0.653132,0.676419,0.689493,0.733173,0.606205,0.422934,0.450117,0.618858,0.587614,0.506029,0.602634,0.559491,0.542839
0.419832,0.407516,0.530381,0.630486,0.655572,0.54104,0.45777,0.373699,0.32193,0.374962,0.328006,0.25791,0.461633,0.626602,0.495463,0.430808,0.454506,0.514275,0.453554,0.374288,0.344643,0.379473,0.500107,0.457935,0.340913,0.428175,0.485505,0.479277
0.274685,0.281866,0.376981,0.411528,0.40882,0.339894,0.303178,0.266495,0.25599,0.279205,0.235642,0.190969,0.333291,0.515654,0.430308,0.275906,0.312873,0.388554,0.29321,0.274031,0.350133,0.39683,0.416328,0.324484,0.233818,0.317087,0.426062,0.398031
0.234602,0.220786,0.297529,0.277085,0.294112,0.309586,0.284279,0.222239,0.183116,0.192689,0.173291,0.161365,0.230041,0.351657,0.305912,0.177656,0.233786,0.356864,0.279435,0.245247,0.338151,0.359181,0.28888,0.182715,0.173408,0.25161,0.351967,0.318066
0.201346,0.168218,0.201953,0.178385,0.236816,0.283714,0.260483,0.194926,0.131819,0.130405,0.124427,0.120159,0.137954,0.194068,0.205761,0.163382,0.220993,0.321274,0.255217,0.202285,0.260076,0.250663,0.161976,0.098829,0.143347,0.204917,0.264767,0.253272
0.158649,0.110195,0.111555,0.130493,0.231046,0.266764,0.248104,0.191811,0.103135,0.090594,0.098354,0.096754,0.108556,0.135314,0.150285,0.163295,0.214796,0.259101,0.199603,0.138873,0.151149,0.133021,0.085857,0.073939,0.124876,0.178574,0.18932,0.172945
0.138432,0.077085,0.07018,0.130124,0.223973,0.238399,0.226809,0.174205,0.106838,0.107059,0.100315,0.08702,0.099702,0.116291,0.10871,0.136323,0.19111,0.213568,0.166917,0.095733,0.08293,0.080667,0.07022,0.078962,0.123309,0.154846,0.124066,0.101213
0.132859,0.074461,0.079197,0.137584,0.187776,0.176096,0.17378,0.134708,0.105578,0.13624,0.118018,0.086988,0.094884,0.091747,0.083754,0.103192,0.162748,0.203444,0.162396,0.091637,0.073436,0.089246,0.09244,0.101152,0.141074,0.148398,0.093097,0.0694
0.140111,0.089777,0.10043,0.132649,0.142077,0.109617,0.118706,0.106374,0.093453,0.15404,0.152923,0.110129,0.090389,0.076303,0.093924,0.100098,0.129673,0.168933,0.142562,0.082926,0.064883,0.096642,0.115703,0.119108,0.145364,0.132774,0.078941,0.075097
0.143414,0.103438,0.119817,0.14178,0.133594,0.091694,0.103885,0.107119,0.090592,0.151751,0.180473,0.131752,0.077719,0.075684,0.120181,0.11852,0.116694,0.117986,0.102574,0.066224,0.051665,0.087144,0.123261,0.120275,0.127735,0.114505,0.081517,0.085491
