5.9e-05,4.7e-05,1.5e-05,3.2e-05,4.8e-05,4.7e-05,7.2e-05,5.7e-05,1.7e-05,0.000127,4.2e-05,3.2e-05,4.7e-05,6.2e-05,2e-06,2.5e-05,3.5e-05,1.6e-05,3.1e-05,3.3e-05,4.7e-05,3.7e-05,3.2e-05,6e-06,4.1e-05,9e-06,3.4e-05,5.7e-05,3.1e-05,3.4e-05,7e-06,7e-06,5e-06,4.8e-05,9e-06,3.2e-05,5e-06,5.1e-05,1e-06,4e-06,6.2e-05,8.4e-05,4e-06,2.5e-05,5.4e-05,7.8e-05,4.1e-05,3.1e-05,3e-06,3.8e-05,4.7e-05,4e-06,4.4e-05,2.9e-05,4.7e-05,1.7e-05,2e-06,0,1.2e-05,6.7e-05,1.9e-05,4.2e-05,2e-06,3.2e-05,7e-06,2.7e-05,3e-06,2.2e-05,2e-06,2.4e-05,9.1e-05,1e-06,3.9e-05,4.6e-05,3.1e-05,5.2e-05,2.3e-05,2.4e-05,2.6e-05,2.3e-05,3.3e-05,3.5e-05,2.2e-05,3.9e-05,8e-06,5e-06,4.6e-05,4.3e-05,3.7e-05,3.4e-05,1e-06,7.5e-05,1.5e-05,5.5e-05,5.9e-05,1e-06,6e-06,3.2e-05,3.6e-05,3.5e-05,3e-06,1.4e-05,3.4e-05,1.3e-05,3.7e-05,3.6e-05,1.7e-05,1.1e-05,7e-05,4.3e-05,1.2e-05,1.1e-05,2.1e-05,3.2e-05,2.3e-05,1e-06,7e-06,4e-06,1.2e-05,3.8e-05,2.9e-05
0.000133,6.5e-05,4.5e-05,6.5e-05,6.8e-05,9.6e-05,0.000142,0.00012,6.4e-05,0.000184,0.000147,0.000173,0.000214,7.5e-05,1e-04,4.4e-05,6.9e-05,2.7e-05,4.2e-05,8.3e-05,7.5e-05,0.000102,6.6e-05,9.6e-05,0.000168,0.000104,0.00011,9e-05,0.000109,5.5e-05,4.5e-05,4.8e-05,5.5e-05,0.000121,4.4e-05,3.7e-05,4.4e-05,0.00017,6.4e-05,4.5e-05,0.000122,0.000134,1.1e-05,1.9e-05,0.000147,0.000217,0.000116,4.3e-05,9.8e-05,6.3e-05,0.000157,3.4e-05,0.000119,4.8e-05,0.000101,6.3e-05,1.8e-05,4.3e-05,5.5e-05,0.000151,2.8e-05,0.000119,6.1e-05,6.8e-05,3.4e-05,7e-05,4.7e-05,6e-05,2.9e-05,8.9e-05,0.000196,5.9e-05,2.8e-05,0.000105,2.8e-05,0.000144,4.1e-05,8.6e-05,4.4e-05,0.000116,9.6e-05,3.2e-05,1.5e-05,8.5e-05,6.2e-05,4.2e-05,2.3e-05,8e-05,9.1e-05,2.2e-05,3.8e-05,0.000118,4e-05,0.000188,4e-05,3.6e-05,6.7e-05,5.1e-05,7.4e-05,6.7e-05,5.2e-05,5.9e-05,7.5e-05,3.9e-05,0.000117,0.000106,6.8e-05,6.6e-05,9.4e-05,0.000122,2.8e-05,3.6e-05,1.6e-05,8.7e-05,3.7e-05,5.3e-05,6.9e-05,1.9e-05,6.1e-05,0.000113,0.000107
0.000112,7e-05,0.000137,0.000145,0.000115,8.5e-05,0.000128,0.000176,7.9e-05,0.000228,0.000183,0.000116,0.000202,0.000126,9e-06,0.000137,4.3e-05,5.7e-05,2e-05,1.2e-05,0.000138,9.4e-05,2.4e-05,0.000175,7.4e-05,4.8e-05,9.8e-05,0.000192,5.9e-05,0.000145,6.4e-05,5e-05,2.1e-05,0.000168,5.3e-05,0.00012,1.4e-05,0.000159,5.7e-05,0.00013,0.000151,0.000137,5.5e-05,0.000114,0.000317,0.000224,5.7e-05,0.00011,9.3e-05,2.1e-05,0.000213,6e-05,9.9e-05,0.000119,0.000129,5.5e-05,2.9e-05,9.4e-05,4.9e-05,0.00019,0.000108,0.000197,3.8e-05,9.3e-05,6.1e-05,0.000136,0.000159,5.8e-05,7.7e-05,0.000124,8.8e-05,7e-05,4.9e-05,0.000128,6e-05,6.7e-05,0.000124,0.000143,2.3e-05,0.000142,0.000161,5.7e-05,6.8e-05,3e-05,1.2e-05,4.2e-05,1e-04,9.3e-05,0.000115,0.000113,4.8e-05,0.000118,0.000169,0.000114,0.000118,2.5e-05,0.000146,9.7e-05,1e-04,3.7e-05,3.5e-05,5.7e-05,8.6e-05,8.6e-05,0.000117,9.7e-05,8.9e-05,7.1e-05,8.4e-05,9.1e-05,5.7e-05,1.7e-05,5e-05,0.000197,0.000119,4.3e-05,5.5e-05,2.6e-05,8.3e-05,0.00015,0.000101
0.000155,0.000209,0.000224,0.000145,8.5e-05,0.000219,0.000141,3.1e-05,0.000145,0.000102,0.000202,2.3e-05,0.000147,0.000278,3.8e-05,0.000152,0.000125,8.9e-05,0.000106,8e-05,0.000128,4.4e-05,7.5e-05,0.000184,8e-05,9.5e-05,1e-04,0.000206,8.7e-05,0.000123,0.000109,0.000138,0.000165,0.00027,7.7e-05,0.00015,6.3e-05,0.000102,9.5e-05,0.000138,0.000244,0.000311,7.8e-05,0.000183,0.000279,0.000403,0.000115,8.8e-05,0.000149,0.000133,0.000158,7.9e-05,8.1e-05,0.000127,0.000132,9.9e-05,6.1e-05,8.2e-05,9.6e-05,0.000294,0.00022,7.5e-05,6.3e-05,0.000153,0.000142,0.000178,9.8e-05,9.5e-05,9.2e-05,0.000131,0.000286,0.000115,0.000155,0.000114,0.000158,0.000199,0.000177,2.9e-05,7.2e-05,7.3e-05,0.000153,0.000109,8.4e-05,6.6e-05,0.000108,5.1e-05,0.000137,0.000178,4.5e-05,2.3e-05,0.00021,0.000259,0.000183,0.000321,0.000124,0.00012,0.000175,9.7e-05,7.1e-05,1e-04,7.9e-05,0.000146,0.000155,1.9e-05,0.000178,0.000161,0.000146,0.000163,0.000189,5.1e-05,0.000108,0.000193,0.000217,8.9e-05,0.000137,0.000153,0.000146,8.1e-05,6.1e-05,9.4e-05,0.000138
0.000153,0.000151,0.000249,0.00017,9.9e-05,0.000471,0.000274,0.000262,0.000311,0.000366,0.000196,0.000193,0.000203,0.000154,0.00033,0.00014,0.000208,1.7e-05,0.000204,4.4e-05,0.000128,0.000217,0.000106,0.000288,0.000191,0.000144,0.00019,0.000327,0.000136,0.000263,0.00022,0.000149,0.000189,0.00025,9.8e-05,0.000179,4.6e-05,0.000224,0.000119,0.000191,0.000289,0.000195,0.000176,0.00017,0.000302,0.000333,0.000103,1.5e-05,7.5e-05,7.6e-05,0.000248,2.5e-05,0.000285,0.000233,0.000217,0.000315,0.000115,0.000163,0.000152,0.000215,7e-05,0.000202,0.000149,6.9e-05,0.000156,7.1e-05,0.000108,0.000102,0.000125,9e-06,0.000167,7.5e-05,0.000132,5.6e-05,0.000125,0.000268,0.000147,0.000169,0.000165,2.1e-05,8.4e-05,0.000289,6.3e-05,5.2e-05,0.000183,4.1e-05,0.000136,0.000165,6.6e-05,0.000112,0.000257,3e-05,0.000182,0.00019,0.000251,0.00019,0.000244,0.00012,6.8e-05,0.000144,0.000168,0.000104,0.000188,0.000175,0.000174,0.000113,8.7e-05,0.000105,0.000122,0.000153,0.000286,0.000121,0.000196,0.00017,0.000164,3.1e-05,0.000122,0.000112,8.2e-05,1.3e-05,0.000154
0.000331,8.2e-05,4e-05,0.000222,0.000159,0.000487,0.000178,0.000479,0.00025,9.9e-05,0.000235,0.000115,0.000228,0.000404,0.000486,0.000403,8.4e-05,0.000298,0.000526,0.000323,0.000188,8.7e-05,0.00029,0.000163,0.000192,0.000146,0.000217,0.000225,0.000287,0.000501,0.000358,0.000328,0.000128,0.000262,0.00037,0.000114,0.000168,0.000171,0.000257,0.000303,0.000448,0.000523,0.000279,6.9e-05,0.000169,0.000426,5.3e-05,0.000155,0.000131,0.000169,0.000461,0.000483,0.000238,0.000271,0.000111,0.000299,0.000231,0.00023,9.1e-05,0.000175,0.000156,0.000177,9.1e-05,0.000103,0.000143,0.00016,8.9e-05,0.000208,8.7e-05,4.2e-05,0.000106,6.7e-05,0.000144,0.000177,6.8e-05,0.000297,0.000395,3.8e-05,0.000232,0.000136,7.2e-05,0.000209,0.00028,2.7e-05,0.000154,0.000154,0.000254,0.000261,8.4e-05,0.000221,0.000194,0.000362,4.2e-05,0.000302,0.000331,0.000133,0.000277,0.000436,0.000225,0.000291,1.4e-05,8.5e-05,0.000345,0.000197,0.000299,0.000338,0.000363,8.2e-05,0.000468,0.000336,0.000169,0.000302,0.000443,0.000228,0.000175,0.00014,1.8e-05,0.000298,0.000157,1.7e-05,0.000105
0.000286,0.000592,0.000289,0.00038,0.000535,0.000568,5e-04,0.000304,0.000563,0.000231,0.000249,0.000272,0.000458,0.00125,0.000548,0.00018,0.000149,0.000414,0.000886,0.000436,0.000389,0.000402,0.00039,0.00058,0.000288,0.000199,0.000299,0.000432,0.00054,0.000296,0.000521,0.000866,0.000337,0.00027,0.000583,0.000477,0.00033,0.000316,9.5e-05,6.2e-05,0.000148,0.00035,0.000497,0.00012,0.000258,0.000919,0.000493,0.00016,0.000281,0.000262,0.000488,0.000493,0.000764,0.000902,0.000714,0.000545,0.000258,5.8e-05,2e-04,0.000267,8.3e-05,0.000286,0.000137,0.000341,0.000331,0.000344,0.000406,0.000375,0.000316,0.000208,5.7e-05,0.000323,0.000273,0.000383,9.1e-05,0.000238,0.000302,0.000279,0.000413,0.000176,0.000195,0.000211,0.000251,0.000298,9.6e-05,0.000224,0.000363,0.000101,0.000374,0.00046,0.000459,0.000643,0.000585,0.000134,7.2e-05,0.000187,0.000331,0.000856,0.000536,0.000394,0.00044,0.000207,0.000321,0.000684,0.000555,0.000223,0.000138,0.000458,0.000727,0.000507,0.000167,0.00027,0.00024,0.000291,0.000249,2.1e-05,0.00013,0.000347,0.000332,0.000181,0.00016
0.000255,0.000837,0.001357,0.001087,0.000776,0.000592,0.000303,0.000658,0.000945,0.000506,0.000352,0.000379,0.000267,0.001096,0.000878,0.00059,7.6e-05,0.000598,0.000627,0.001169,0.000344,0.000816,0.000706,0.000177,0.000392,0.000368,0.000682,0.000506,0.000554,0.000177,0.000208,0.000397,0.000557,0.000365,0.000438,0.000153,6.2e-05,0.000137,0.000559,0.00046,0.000614,5.9e-05,0.00045,0.00055,0.000497,0.000909,0.000837,0.000369,8.8e-05,0.000302,0.000201,0.000503,0.000526,0.000385,0.00053,0.000628,0.000202,0.000132,0.000308,0.00041,0.00019,4e-04,0.00011,0.000507,0.000293,0.00023,0.000134,0.000251,0.000214,6.7e-05,0.00015,0.000448,0.000217,0.000226,0.000362,0.000272,0.000479,0.000164,0.00023,0.000178,0.000132,0.000266,0.000433,0.000214,0.000371,0.000481,0.000102,0.000277,0.000505,0.000207,0.000363,0.000206,0.000446,0.00073,0.00027,0.000172,0.000699,0.000552,0.00042,7.4e-05,4e-04,0.000124,6.5e-05,0.000525,0.000266,0.000557,0.000464,0.000394,0.000261,0.000648,0.000573,0.000291,0.000425,0.000524,0.000335,0.00029,0.000238,0.000414,0.000218,0.000557,0.000349
0.000324,0.000818,0.000809,0.000936,0.000559,0.000664,0.000617,0.000605,4e-04,0.000727,0.000483,0.000244,0.000413,0.001074,4e-04,0.000511,0.000723,0.000618,0.001097,0.00078,0.001139,0.000714,0.000519,0.000461,0.000508,0.000238,0.000448,0.001037,0.000938,0.000704,0.000303,0.000288,0.000505,0.001018,0.000638,0.000159,0.000312,0.00051,0.000545,0.000231,0.000546,0.00084,0.000743,0.00012,0.00039,0.000764,0.000828,0.000316,0.000134,0.000464,0.000531,0.00026,0.000147,6.8e-05,0.000515,0.000652,0.000806,0.000326,0.000247,0.000617,0.000753,0.000298,0.000449,0.000429,0.000322,0.000245,0.000315,0.000224,0.000244,0.000117,0.000427,0.000727,0.000428,0.000171,0.000319,0.000489,0.000616,0.000446,0.000264,0.000155,0.000185,0.00038,0.000467,0.000201,0.000573,0.000277,0.000144,0.000262,0.00042,0.00015,0.000115,0.000412,0.000204,0.000537,0.000357,0.000354,4e-04,0.000389,0.00057,0.000638,0.000789,0.00065,0.000435,0.000494,0.00057,0.000492,0.000152,0.000313,0.000538,0.000499,0.000369,0.000151,0.000544,0.000402,9.2e-05,0.000275,0.000554,0.000265,0.000498,0.000618,0.000189
0.000824,0.000334,0.000514,0.000229,0.000197,0.000349,0.000718,0.000958,0.000647,0.000745,0.001011,0.000945,0.000735,0.000723,0.000544,0.000464,0.000576,0.000654,0.000418,0.000716,0.000762,0.00058,0.000656,0.000536,0.00029,0.000242,0.000366,0.000649,0.000496,0.000244,0.000381,0.000292,0.000524,0.000465,0.000635,0.000385,0.000162,0.000395,0.00094,0.000513,0.000402,0.00071,0.000237,0.000382,0.000138,0.000682,0.000323,0.000288,0.00019,0.000356,0.00044,0.000554,0.000326,0.000336,0.000381,1.7e-05,0.00051,0.000378,0.000112,0.000483,0.000553,0.000565,0.000553,0.00061,0.000462,0.000385,0.000265,0.00014,0.000265,0.000134,0.000629,0.000855,0.000517,0.000461,0.000351,0.000231,0.000292,0.000578,0.000568,0.00031,0.000209,3.5e-05,0.000351,0.000638,0.001043,0.001065,0.000844,0.000594,5.9e-05,0.000524,0.000411,0.000669,0.000646,0.000619,0.000432,0.000352,0.000459,0.000387,0.000416,0.000715,0.000138,0.000382,0.000145,0.000222,0.000349,0.000347,0.000299,0.000261,0.000381,0.000216,0.000314,0.000192,0.000317,0.000239,0.000193,0.000287,0.000177,0.000194,0.000386,4e-05,0.000188
0.000178,0.000433,0.000698,0.000374,0.000203,0.00018,0.000487,0.000563,0.000135,0.000115,0.000546,0.000483,0.000689,0.000412,0.000358,0.000487,1e-04,0.000262,3e-04,0.00046,8.1e-05,0.000127,0.000269,0.00012,0.00012,0.000114,8.4e-05,0.000418,7.2e-05,0.000299,0.000177,0.000214,0.000588,0.000371,6e-04,0.000357,0.000135,0.000131,0.000426,0.000374,0.000384,0.000247,0.000433,0.000424,0.000426,0.000528,0.000265,0.000335,0.000304,0.00032,0.000234,0.000121,2.2e-05,0.000289,0.000315,0.000262,0.000192,4.5e-05,5.6e-05,0.000256,0.000131,0.000127,0.000116,0.000256,4e-05,0.000302,0.000182,1.9e-05,0.000277,0.000243,0.000536,0.000283,0.000256,0.00029,0.000105,8.4e-05,0.000205,0.000364,0.000471,0.00035,6e-05,0.000172,0.000392,0.000407,0.000362,0.00053,0.000393,0.000163,0.000223,0.000326,0.000236,0.000556,0.000277,0.00023,0.000269,0.000271,5.4e-05,1.9e-05,0.000416,0.000294,0.000304,5.7e-05,0.000169,0.000217,0.000422,0.000525,0.000416,0.000178,0.000251,0.000353,0.000206,0.000262,9.9e-05,0.000196,5.4e-05,0.000111,0.000134,0.000177,0.000237,0.000131,0.000133
0.000247,0.000186,0.000239,7.5e-05,0.000211,0.000103,0.00024,0.000107,0.000283,0.000185,0.000303,0.000272,0.000227,0.00022,6.3e-05,3.3e-05,7.7e-05,6.4e-05,7.6e-05,0.000229,0.000106,4.4e-05,0.000248,0.000138,0.000143,0.000124,0.000185,0.000204,9.7e-05,0.000224,0.000165,0.000169,0.000369,0.000221,0.000118,6.7e-05,9.7e-05,0.000109,0.000218,0.000284,0.000202,0.000113,0.000253,5.8e-05,0.000223,4.6e-05,0.000144,0.000186,0.000157,0.000133,0.000266,3.8e-05,6e-05,4.2e-05,5.9e-05,0.000227,0.000108,0.000104,5e-05,0.000136,8.2e-05,0.000128,5.9e-05,7.1e-05,0.000151,0.000214,0.00014,2e-06,0.000134,0.000183,0.000384,0.000115,0.000142,0.000216,1e-04,0.000146,0.000223,0.000128,0.000165,9.4e-05,0.00018,0.000144,0.00016,0.00015,0.000241,0.000139,0.000151,9.8e-05,0.000122,0.000174,0.000263,0.000148,0.000184,6.4e-05,9.9e-05,7.1e-05,4.4e-05,3.6e-05,0.000285,6e-05,0.000154,4.4e-05,0.000153,0.000153,6.8e-05,0.000192,0.000107,0.000187,0.000162,0.000148,6.5e-05,0.000103,0.000134,7.4e-05,0.000188,5.1e-05,8.6e-05,0.000189,7.5e-05,5e-05,1.4e-05
0.000112,0.000197,0.000235,9.4e-05,0.000155,0.000131,0.000153,0.000113,0.00025,0.000154,0.000141,6.6e-05,0.000194,0.000102,0.000199,0.000217,0.000104,0.000187,4.1e-05,0.000272,0.000163,5.3e-05,0.000272,0.000299,7e-05,0.000164,0.000223,0.000271,0.000127,4.7e-05,0.000241,0.00012,0.000148,0.000221,0.000117,7.2e-05,3.4e-05,0.00031,0.000241,0.000193,0.000147,5.7e-05,0.000213,0.00019,0.000216,0.000122,0.000128,0.000222,0.000195,7e-06,0.000197,0.000197,0.000119,0.000158,0.000119,0.000196,8.9e-05,0.000136,0.000139,0.000176,0.000167,2.5e-05,7.8e-05,0.000111,0.000242,0.000183,6.2e-05,0.000105,6.1e-05,0.000178,0.000127,0.000134,5.8e-05,0.000112,7e-06,0.000175,0.000116,0.000237,0.000176,7.9e-05,0.000168,0.000144,0.000174,7.2e-05,0.000211,0.000189,7.1e-05,0.000135,8.9e-05,0.000233,0.000161,0.000101,0.000209,6.9e-05,0.000133,0.000144,8.5e-05,7.7e-05,0.000186,0.000102,0.000147,8.8e-05,0.000178,8e-05,5.6e-05,9.6e-05,5.9e-05,5e-05,0.000103,2e-06,0.000137,0.000207,0.000114,0.000136,0.00026,0.000109,0.000101,0.000156,7.1e-05,0.000122,9e-05
5.6e-05,0.000198,0.000214,7.6e-05,0.00023,0.000279,0.000272,0.000261,0.000701,0.000418,0.000277,0.00038,0.000279,0.000171,0.000471,0.000335,0.000334,0.000356,0.000286,0.000275,0.000445,0.000298,0.000421,0.000504,0.00048,0.000254,0.000238,0.000549,0.000302,0.000289,0.000427,0.000359,0.00025,9.6e-05,0.000236,0.000145,8.4e-05,0.000377,0.000466,0.000484,0.000461,0.000356,0.00015,0.000312,0.000208,0.000221,3.3e-05,0.000237,1e-04,0.000148,0.000113,3.6e-05,0.000105,0.000198,0.000127,0.000112,0.000181,0.000223,0.000196,2.3e-05,0.00015,0.000212,0.000116,0.000319,0.000133,0.000104,0.000214,0.000188,0.000351,0.000159,0.000121,0.000262,0.00027,0.00012,0.000112,0.000186,0.000376,0.000391,8.1e-05,3.5e-05,0.000124,2.9e-05,0.00019,0.000276,0.000249,0.000185,0.000238,0.000227,0.000337,0.000243,0.000472,0.000229,0.000423,0.000283,0.000277,0.000151,0.000105,0.000154,0.000244,0.000282,0.000131,8.5e-05,9.1e-05,6.9e-05,0.000144,9.3e-05,6.6e-05,0.000116,0.000142,6.5e-05,7.1e-05,0.000277,0.00023,0.000108,0.000349,0.000256,7.9e-05,0.000186,0.000322,0.00038,0.000298
0.000272,0.000242,0.000356,0.000215,0.000218,0.000175,0.000242,0.000172,0.000515,0.00023,8.5e-05,0.000382,0.000359,0.000169,0.000344,0.000196,0.000422,0.000375,6.1e-05,0.000139,0.00027,0.000187,0.000149,0.000132,0.000338,0.000166,0.000277,0.000282,6e-05,0.00023,0.000185,0.000157,0.000216,3.4e-05,0.000266,0.000267,0.000148,0.000406,0.000356,0.000224,0.000369,6e-05,0.000296,0.000529,0.000262,0.000262,0.000336,0.000261,4e-05,0.000331,0.000271,0.000355,0.000355,0.000245,0.000344,0.000191,8.2e-05,0.00017,0.000203,0.000209,0.000207,0.000144,0.000165,0.000402,0.000182,0.000131,0.000163,0.000226,2e-04,0.000148,7.9e-05,0.000153,0.000137,0.00017,7.5e-05,0.000407,0.000363,9.1e-05,0.000188,0.000174,3.6e-05,0.00011,0.000196,0.000296,0.00012,0.00014,5.2e-05,0.000102,0.000167,0.000392,0.000325,0.000178,0.000232,0.000222,0.000376,9.3e-05,0.000105,0.000161,0.000102,0.000251,0.000177,3.1e-05,2.9e-05,0.000182,0.000317,0.000251,0.000211,0.000149,0.000205,0.000193,0.000103,0.000387,0.000209,0.00014,0.000193,0.000336,0.000418,0.000154,0.000266,0.000103,0.000221
0.000102,0.000328,0.000598,0.00033,0.000127,0.000102,0.000147,9.7e-05,0.000295,0.000288,0.000191,0.000315,0.000404,0.000205,0.000167,0.000214,0.000426,0.000179,0.000197,0.000171,0.000315,0.000223,0.000128,0.000234,0.000307,0.000228,0.000184,0.000129,0.000192,0.000152,0.000176,1e-05,0.00024,0.000344,0.000363,0.000114,0.000155,0.000159,0.000167,0.000299,0.000124,0.000267,0.000304,0.00012,7.7e-05,0.00032,0.000235,5.6e-05,0.000225,0.000169,0.000155,0.000253,0.000253,2.6e-05,0.00024,0.000255,0.000292,0.000142,8.7e-05,8.1e-05,5.4e-05,0.000197,4.9e-05,0.000207,0.000125,0.000131,6.2e-05,0.000168,0.000211,0.000126,0.000198,0.000111,0.000177,0.000147,0.000238,0.000263,0.000257,9.7e-05,0.000151,3.9e-05,0.000154,8.4e-05,0.000154,3.7e-05,0.00017,0.000111,0.000141,7.9e-05,0.000186,0.000117,9.8e-05,2.8e-05,0.000108,0.000156,8.4e-05,0.000144,0.00015,0.000154,0.000273,0.000117,5.2e-05,7.5e-05,0.000112,5.3e-05,2e-04,4.9e-05,5.3e-05,5.9e-05,0.000372,0.00022,9.5e-05,0.000358,0.000219,0.000166,0.000141,0.000238,9.7e-05,0.00019,0.00021,0.00022,0.000287
0.000268,0.000418,0.00029,0.000212,0.000263,0.000325,0.000387,0.000128,0.00027,0.000312,0.000134,0.000266,0.000342,0.000154,4.4e-05,0.000114,0.000175,0.000177,0.000143,0.000286,0.000238,1.1e-05,0.000157,0.000241,0.000153,9.8e-05,0.000106,0.000165,0.000252,0.000221,0.000141,0.000183,0.000139,0.00017,0.000158,0.000167,4.5e-05,0.000129,0.000169,0.000257,0.000231,0.000379,0.000205,0.000124,5.3e-05,0.000248,0.000128,7.7e-05,0.000108,9.1e-05,3.1e-05,0.000125,7.1e-05,0.000194,0.000124,0.000173,5.8e-05,4.3e-05,6.7e-05,5.6e-05,2.8e-05,0.000108,7.9e-05,3.8e-05,2.3e-05,9.2e-05,0.000109,0.000158,0.000251,0.000149,0.000263,0.000228,0.000314,0.000165,0.000223,0.000186,0.000205,5.5e-05,0.000106,0.000111,0.000197,0.000198,3e-05,3.8e-05,0.000175,9.3e-05,0.000216,0.000131,0.000116,3.5e-05,9e-05,6.8e-05,9.6e-05,0.000142,0.00011,0.00019,0.00016,0.000167,0.00023,0.000153,0.000122,0.000118,0.000104,8.6e-05,2.2e-05,3.6e-05,9.4e-05,7.9e-05,0.00033,0.00014,7.7e-05,0.000217,0.000179,0.000226,0.000292,0.000103,0.000103,0.000174,0.000233,7e-05,0.000146
0.000105,9.1e-05,0.000308,0.000177,0.000306,8.9e-05,0.000244,0.000288,0.000207,7.3e-05,4.8e-05,0.00026,0.000121,0.000131,3.8e-05,9.4e-05,6.3e-05,0.00013,6.2e-05,0.000202,7.5e-05,9.8e-05,0.000105,0.000235,1.8e-05,5.6e-05,8.9e-05,2e-05,9e-05,7.3e-05,0.000131,0.000247,0.000178,8.1e-05,8.8e-05,6e-05,0.000161,0.000214,5.3e-05,0.000186,8.6e-05,0.000134,0.000112,0.000112,6.3e-05,3.9e-05,0.000115,0.000121,0.000131,0.000119,9.2e-05,0.000168,4e-05,0.000116,0.000134,5.5e-05,0.000112,0.000106,0.000122,0.000117,5.3e-05,7.1e-05,0.000124,0.000137,6.8e-05,0.000128,3.5e-05,4.3e-05,0.000161,4.2e-05,0.000133,4.3e-05,1e-04,7.6e-05,0.000113,7.4e-05,0.000102,0.000106,1.8e-05,8.7e-05,0.000102,3.8e-05,9.8e-05,5.1e-05,5.7e-05,5.9e-05,0.000111,0.000141,8.2e-05,2.6e-05,0.000118,6.3e-05,4.8e-05,3e-06,4.5e-05,2.6e-05,8.3e-05,0.000133,0.000154,8.5e-05,3.9e-05,9.8e-05,8.5e-05,7.1e-05,4.5e-05,5.7e-05,8.2e-05,4.6e-05,0.000142,8.5e-05,6.9e-05,3.6e-05,7.7e-05,4.7e-05,0.00017,0.000157,2.7e-05,2.9e-05,1.8e-05,1e-04,8.2e-05
9.6e-05,6.4e-05,7e-05,0.000143,0.000243,0.000233,2.6e-05,0.000207,0.000137,0.000152,0.000129,0.000267,5.9e-05,5e-05,2.5e-05,0.000118,0.00011,1.4e-05,3.6e-05,0.000115,0.000106,5.9e-05,9.4e-05,0.000157,0.000116,8.6e-05,9.8e-05,0.000108,7.6e-05,0.00011,8.5e-05,0.000231,9e-05,0.000147,9.6e-05,0.000136,0.000175,2.6e-05,3.7e-05,7.7e-05,0.000129,0.000276,0.000106,0.000146,4.8e-05,4.8e-05,0.000137,0.000164,0.000137,8.8e-05,8.1e-05,0.000104,5.6e-05,8.4e-05,0.000134,9.9e-05,0.000142,2.1e-05,8.2e-05,5.6e-05,3e-05,7.1e-05,8.8e-05,9e-06,0.000152,3.5e-05,2.9e-05,1e-05,9.1e-05,0.000119,0.000125,7e-05,4.7e-05,7.5e-05,8.2e-05,7.5e-05,0.000106,0.000186,0.000165,0.000216,0.000115,9.7e-05,0.000165,0.000102,7.1e-05,0.000117,0.000122,4.7e-05,0.000145,5.1e-05,4.6e-05,6.8e-05,3.5e-05,7.4e-05,0.000105,2.3e-05,9.5e-05,0.000174,9.1e-05,0.000132,4.1e-05,5.5e-05,0.00012,9e-05,8.9e-05,1.4e-05,1e-05,6.5e-05,3.8e-05,1e-04,1.9e-05,7.5e-05,5.5e-05,0.000114,5e-05,8.4e-05,6.6e-05,0.000121,8.5e-05,0.000136,1.8e-05
0.000167,0.000293,8e-05,0.000194,0.000165,7.6e-05,4.8e-05,0.000153,8e-05,0.000183,9e-05,0.00019,9.4e-05,8e-05,6.6e-05,9.7e-05,8.1e-05,0.000117,2.5e-05,0.000101,6.8e-05,4.8e-05,0.000108,0.000194,4.6e-05,1.9e-05,6.9e-05,5.4e-05,0.000148,3.7e-05,0.000163,3.1e-05,8.3e-05,0.000154,3e-05,0.000126,0.000108,6.1e-05,5.1e-05,4.8e-05,9e-05,0.000197,0.000131,0.000108,0.000181,0.000133,0.000125,3.3e-05,0.000255,0.00022,9.8e-05,7.1e-05,4.1e-05,0.000109,4.7e-05,1.2e-05,9.9e-05,6.3e-05,0.000108,9.1e-05,8.2e-05,7.8e-05,4.1e-05,9.5e-05,0.000158,0.00013,7.9e-05,5e-05,1.2e-05,7.5e-05,6.6e-05,0.000137,0.000127,0.000129,4.9e-05,3.1e-05,5.7e-05,0.00013,3.1e-05,0.000142,0.000128,0.000157,2.9e-05,3.1e-05,7.9e-05,3e-05,3.9e-05,1e-04,0.000162,0.000127,0.000126,3.8e-05,4e-06,0.000117,1.5e-05,8.7e-05,7.5e-05,3.7e-05,4.4e-05,4.5e-05,3.9e-05,4.7e-05,9.3e-05,7.8e-05,7.5e-05,3.2e-05,4.1e-05,0.000114,0.000136,0.000137,0.00012,4.3e-05,5.7e-05,0.000117,1.9e-05,0.000125,0.000106,0.000157,8.1e-05,0.000173,8.7e-05
0.000179,7.7e-05,0.000148,7.1e-05,0.000104,8e-05,0.000126,3.8e-05,6.9e-05,0.000132,1.2e-05,0.000173,8.1e-05,2.4e-05,6.5e-05,6.3e-05,0.000104,4.5e-05,9.8e-05,0.00011,0.000128,0.000114,0.000131,0.000118,0.000121,9.3e-05,1.2e-05,2.6e-05,5.4e-05,0.000124,7.3e-05,0.000136,7.1e-05,9.7e-05,6.6e-05,0.00012,9.7e-05,0.000101,3e-05,2.8e-05,9.6e-05,0.000203,7.7e-05,6.9e-05,5e-05,6e-05,9.3e-05,0.000112,0.000208,5.6e-05,5.8e-05,0.000143,5.4e-05,9.6e-05,8.7e-05,9.4e-05,3.5e-05,3.9e-05,8.1e-05,4.3e-05,6.2e-05,6.4e-05,1.9e-05,8.3e-05,7.8e-05,3e-06,3.3e-05,3.5e-05,7.3e-05,4e-06,0.000106,0.000109,4.8e-05,6.5e-05,7.3e-05,2.8e-05,4.6e-05,6.3e-05,5.7e-05,0.000114,1e-05,8.7e-05,1.5e-05,1.5e-05,8.2e-05,6.4e-05,7.5e-05,0.000101,3.5e-05,8e-06,5.8e-05,3.7e-05,1.2e-05,0.000106,0.000129,0.000167,4.7e-05,4.8e-05,7.5e-05,7.8e-05,7.4e-05,1.3e-05,7e-05,2.9e-05,5.8e-05,8.1e-05,3.5e-05,0.000112,1.9e-05,9.8e-05,8.7e-05,8.7e-05,3.1e-05,5.8e-05,5.7e-05,0.000107,5.3e-05,0.000132,0.000122,9.8e-05,2.9e-05
6.4e-05,0.000198,3.6e-05,8.4e-05,0.000111,0.000112,0.000176,4.6e-05,9.2e-05,0.000128,0.000146,8.3e-05,9.1e-05,3.7e-05,7.4e-05,0.000115,1.9e-05,7.2e-05,6.1e-05,0.000101,1e-05,9.8e-05,6.8e-05,3.7e-05,7.3e-05,6.3e-05,7.6e-05,9.4e-05,3.6e-05,3.8e-05,5.4e-05,0.000163,6.9e-05,0.000111,3.9e-05,3.4e-05,7.3e-05,4.7e-05,5.9e-05,3.8e-05,5.2e-05,0.000138,0.000155,0.000139,7.9e-05,4.8e-05,7.3e-05,6e-05,1.8e-05,2.8e-05,7.8e-05,6.7e-05,6.3e-05,5.8e-05,4.6e-05,0.000125,1.9e-05,3.3e-05,6.4e-05,3.1e-05,5.4e-05,7.7e-05,2e-05,0.000103,2.2e-05,1.7e-05,4.4e-05,6.1e-05,0.000102,2.5e-05,0.000105,8.7e-05,4.1e-05,6.9e-05,7.3e-05,0.000111,2.2e-05,8.6e-05,7.4e-05,7.2e-05,7.9e-05,6.8e-05,6.4e-05,4.1e-05,6.3e-05,5.6e-05,1e-04,3.2e-05,4e-05,2.8e-05,2.9e-05,5.4e-05,2.9e-05,0.000102,6.9e-05,6.8e-05,3.9e-05,7.6e-05,0.000108,5.6e-05,2.9e-05,4e-05,4.2e-05,1.4e-05,3.8e-05,1.2e-05,1.3e-05,5.7e-05,7.8e-05,6.3e-05,4.9e-05,5.2e-05,1.9e-05,3.7e-05,9.5e-05,0.000147,2.7e-05,8.2e-05,3.4e-05,0.000133,4.8e-05
9.5e-05,0.000177,0.000161,2.5e-05,0.000128,8.3e-05,5.5e-05,0.000142,5e-05,5.1e-05,0.000119,6.2e-05,8.1e-05,9.3e-05,6e-06,9.3e-05,3.5e-05,4.2e-05,5.5e-05,1.9e-05,2e-06,4.8e-05,8e-05,4.8e-05,8.1e-05,6.1e-05,6.9e-05,3.4e-05,5.6e-05,2.8e-05,7e-05,5.4e-05,1.9e-05,3.6e-05,4.7e-05,5.1e-05,5.4e-05,1.9e-05,5.3e-05,7.8e-05,9.9e-05,1e-05,2.3e-05,4.9e-05,2.6e-05,2.7e-05,2.3e-05,1.6e-05,1.3e-05,5e-05,7e-06,3.9e-05,1e-05,3.8e-05,8.9e-05,5.2e-05,4e-05,2.2e-05,6.4e-05,6.2e-05,1.9e-05,5.6e-05,1.2e-05,7.2e-05,4.3e-05,2.8e-05,4.5e-05,4.1e-05,2.8e-05,3.3e-05,1.6e-05,2e-05,3.8e-05,5.2e-05,6.9e-05,8.4e-05,3e-05,1.8e-05,3.3e-05,3.3e-05,2.4e-05,7.8e-05,5e-06,1.8e-05,2.3e-05,6.2e-05,1.6e-05,2.5e-05,4.4e-05,1.8e-05,4e-05,4.7e-05,4.6e-05,5.5e-05,3.3e-05,3.2e-05,5.2e-05,8.8e-05,8.7e-05,1.4e-05,2.1e-05,6.4e-05,2.4e-05,2e-05,3.3e-05,4.1e-05,1e-05,5e-06,6.7e-05,5.7e-05,4.9e-05,6.4e-05,1.9e-05,4.5e-05,1.1e-05,3.4e-05,3.8e-05,2.8e-05,3.3e-05,7.2e-05,5.6e-05
5.3e-05,0.000188,0.000154,0.00017,0.000119,2e-04,0.000196,0.00019,0.000131,5.5e-05,0.000109,0.000129,0.000129,6.2e-05,9.5e-05,0.000102,8.6e-05,1e-04,3.7e-05,4.6e-05,4.6e-05,5.4e-05,3.2e-05,5.9e-05,3.5e-05,6.1e-05,3.1e-05,6e-05,5.8e-05,4.3e-05,4.7e-05,7.6e-05,0.000122,0.000124,0.000142,0.000111,0.000113,6.3e-05,9.6e-05,0.000111,0.00011,0.000156,6e-05,3.8e-05,3.5e-05,2.2e-05,2.8e-05,3.2e-05,2.5e-05,7.9e-05,3.7e-05,8.6e-05,5.7e-05,1.7e-05,0.000105,0.000108,8.9e-05,3e-05,6.5e-05,5.3e-05,5.6e-05,5.8e-05,0.000108,0.000138,7.9e-05,2.7e-05,2.5e-05,2.3e-05,3.7e-05,4e-05,2.6e-05,3.9e-05,6.6e-05,5.2e-05,3.8e-05,6.5e-05,7.5e-05,7.3e-05,5.8e-05,3.8e-05,5.5e-05,0.000124,8.2e-05,5.5e-05,4.2e-05,8.3e-05,5.9e-05,2.9e-05,5.5e-05,6.1e-05,2.3e-05,6.7e-05,0.000115,0.000138,0.000109,6.7e-05,1.6e-05,6.2e-05,5.9e-05,6.5e-05,4.1e-05,7.2e-05,7.4e-05,3.9e-05,4.7e-05,7.6e-05,8.9e-05,4.9e-05,9.5e-05,5.4e-05,6e-05,1e-05,4.1e-05,6.7e-05,5.7e-05,6e-05,8.7e-05,7.2e-05,5.5e-05,7.3e-05,6.3e-05
0.000113,6e-05,1.4e-05,5.5e-05,6.6e-05,0.000101,4e-05,4.2e-05,3e-05,4.2e-05,5.7e-05,5.6e-05,4.3e-05,3.9e-05,8.6e-05,2.8e-05,3.9e-05,5.4e-05,4.8e-05,1.7e-05,3.6e-05,3.9e-05,5.2e-05,2.2e-05,1.5e-05,3.5e-05,1.6e-05,3.3e-05,1e-05,2.8e-05,3.2e-05,4.1e-05,7.5e-05,0.000101,4.5e-05,1.7e-05,4.5e-05,6.7e-05,3.7e-05,1.9e-05,8.7e-05,5.3e-05,4.5e-05,2.4e-05,9e-06,1.5e-05,3e-05,1.7e-05,1.1e-05,3.2e-05,3.5e-05,4.3e-05,0,4.3e-05,5.3e-05,6.8e-05,2e-05,2.4e-05,2.6e-05,3e-06,2.5e-05,3e-05,6e-05,3.5e-05,1.6e-05,1.7e-05,1.8e-05,6e-06,6e-06,3.4e-05,4.6e-05,2.2e-05,1.5e-05,2.4e-05,3.7e-05,1.1e-05,1.5e-05,3.8e-05,1.1e-05,1.9e-05,2.7e-05,4.1e-05,2.4e-05,2.7e-05,3.3e-05,3.9e-05,3.1e-05,2.7e-05,2.5e-05,2.9e-05,6e-05,2.9e-05,7.2e-05,4.6e-05,4.1e-05,8e-06,1.1e-05,3.7e-05,3.5e-05,3e-05,5.2e-05,9e-06,4.1e-05,1.7e-05,2.4e-05,3.8e-05,4.5e-05,3.4e-05,3.1e-05,4e-06,2.5e-05,3.9e-05,3.5e-05,4.2e-05,2.6e-05,2e-05,3.2e-05,2e-05,1.2e-05,3.4e-05,2.1e-05
6.3e-05,3.1e-05,2.1e-05,1.3e-05,3.1e-05,3.4e-05,3.2e-05,1.1e-05,2.8e-05,3.5e-05,1.2e-05,3.6e-05,1e-05,2.7e-05,3e-05,2e-05,3.5e-05,3.9e-05,2e-06,3.2e-05,2.9e-05,3e-05,1.6e-05,3.3e-05,2.3e-05,6e-06,1.1e-05,7e-06,5e-06,3.9e-05,3.7e-05,1e-05,4.5e-05,6.6e-05,1.1e-05,1.1e-05,9e-06,4.4e-05,3.5e-05,4.2e-05,4.1e-05,3.1e-05,2.1e-05,9e-06,3.3e-05,2.3e-05,2e-05,2e-05,1.2e-05,1.8e-05,2e-06,1.6e-05,1.4e-05,3.2e-05,4.8e-05,2.9e-05,1.2e-05,1.1e-05,2.1e-05,1.3e-05,1.2e-05,3.4e-05,2.7e-05,6e-06,8e-06,1.6e-05,1.7e-05,9e-06,1.4e-05,3e-05,3.2e-05,1.8e-05,1.2e-05,6e-06,1.8e-05,4e-06,2.2e-05,1.5e-05,1.3e-05,1.4e-05,1e-05,2.8e-05,6e-06,2.4e-05,2.9e-05,9e-06,6e-06,1e-05,6e-06,1.9e-05,2.8e-05,4.2e-05,2.1e-05,2.6e-05,1.4e-05,6e-06,1.8e-05,8e-06,2.1e-05,1.7e-05,3e-05,1.1e-05,4.6e-05,1.1e-05,1.5e-05,1.4e-05,1.9e-05,2.1e-05,2.5e-05,1.5e-05,8e-06,1.6e-05,1.4e-05,1.6e-05,2.8e-05,9e-06,2.2e-05,6e-06,2e-05,1.3e-05,6e-06
3.9e-05,1.2e-05,1.6e-05,1.7e-05,2.8e-05,4.1e-05,3.4e-05,3e-06,1.1e-05,4.5e-05,2.2e-05,2.5e-05,8e-06,3e-05,2e-05,8e-06,2.2e-05,2.2e-05,1.8e-05,2.9e-05,2.4e-05,2.7e-05,1.3e-05,2.2e-05,2.9e-05,1.9e-05,1.8e-05,2.6e-05,1.1e-05,3.5e-05,2.5e-05,1.1e-05,2.2e-05,6.2e-05,1.1e-05,2.1e-05,2.6e-05,2.5e-05,2.7e-05,2.5e-05,3.3e-05,3.1e-05,6e-06,1.5e-05,3.4e-05,1.1e-05,1.7e-05,2.6e-05,2.1e-05,1.8e-05,2e-05,2.6e-05,1.6e-05,2.1e-05,3.7e-05,4.7e-05,1.4e-05,2.1e-05,1.4e-05,1.5e-05,9e-06,2.6e-05,2.5e-05,3e-06,2e-05,3e-06,1.3e-05,1.1e-05,2e-05,3e-05,3.1e-05,1.1e-05,1.8e-05,4e-06,1.9e-05,5e-06,2.6e-05,1.7e-05,1e-05,1.2e-05,3e-06,2.8e-05,4e-06,2.2e-05,3.6e-05,2e-05,7e-06,1.1e-05,1.4e-05,1.3e-05,3.8e-05,4.8e-05,4e-05,2.9e-05,1.7e-05,1e-05,9e-06,6e-06,1.9e-05,2.1e-05,2.8e-05,7e-06,3.3e-05,5e-06,1.8e-05,1.2e-05,8e-06,1.6e-05,1.5e-05,8e-06,8e-06,2e-06,1.7e-05,1.1e-05,1.2e-05,3e-06,2.9e-05,8e-06,2.4e-05,1.5e-05,3e-06
3.5e-05,6e-06,1.8e-05,9e-06,2.1e-05,1.6e-05,1.6e-05,3e-06,1.5e-05,3.3e-05,1.6e-05,1.5e-05,1.2e-05,1.6e-05,1.4e-05,1.1e-05,1.8e-05,1.2e-05,2e-06,2.6e-05,1.8e-05,1.8e-05,7e-06,1.7e-05,1.8e-05,9e-06,1.6e-05,1.2e-05,3e-06,2.3e-05,2.5e-05,5e-06,1.9e-05,5.2e-05,1.4e-05,1.6e-05,2.1e-05,2.7e-05,1.2e-05,2.6e-05,2e-05,2.9e-05,1.1e-05,4e-06,2.2e-05,8e-06,1.3e-05,1e-05,2.1e-05,1.7e-05,4e-06,3.3e-05,2e-06,1.2e-05,1.6e-05,3e-05,5e-06,6e-06,1.7e-05,1e-06,9e-06,2.7e-05,1.8e-05,4e-06,1.4e-05,8e-06,1.7e-05,7e-06,1.3e-05,1e-05,3.1e-05,1.5e-05,1.2e-05,6e-06,2.6e-05,6e-06,1.8e-05,1.5e-05,7e-06,1.3e-05,7e-06,1.5e-05,8e-06,1.7e-05,1.7e-05,1.5e-05,6e-06,1.3e-05,1.2e-05,5e-06,3.4e-05,2.8e-05,2.4e-05,1.1e-05,1.2e-05,1.2e-05,1.3e-05,3e-06,2.5e-05,1.7e-05,1.7e-05,0,3.3e-05,5e-06,1.1e-05,1.1e-05,1.5e-05,1.5e-05,1.2e-05,1.1e-05,4e-06,3e-06,1.8e-05,4e-06,2e-06,4e-06,2.2e-05,2e-06,1.1e-05,8e-06,6e-06
3.1e-05,2e-06,1.8e-05,9e-06,1.6e-05,9e-06,2.3e-05,2e-06,1.3e-05,2.5e-05,2.4e-05,2e-05,1.2e-05,4e-06,1.5e-05,1.5e-05,2.1e-05,1.5e-05,6e-06,2.1e-05,2e-05,1.6e-05,3e-06,1.8e-05,1.5e-05,1.2e-05,4e-06,5e-06,4e-06,2.4e-05,1.5e-05,5e-06,1.7e-05,4.4e-05,1e-05,1.9e-05,2e-05,1.9e-05,6e-06,2.3e-05,6e-06,2.4e-05,1.7e-05,5e-06,2e-05,5e-06,2e-06,5e-06,9e-06,2.2e-05,7e-06,1.8e-05,8e-06,1e-05,1.1e-05,3.1e-05,6e-06,6e-06,1.7e-05,8e-06,5e-06,2.1e-05,1.6e-05,3e-06,7e-06,8e-06,1.4e-05,7e-06,1.3e-05,5e-06,2.1e-05,1.4e-05,1e-05,2e-06,2.3e-05,8e-06,1.3e-05,8e-06,9e-06,1.2e-05,7e-06,1.5e-05,3e-06,1.5e-05,2.3e-05,1.2e-05,5e-06,6e-06,2e-06,5e-06,2.9e-05,1.9e-05,1.8e-05,9e-06,1.2e-05,9e-06,1.3e-05,0,1.8e-05,7e-06,1.9e-05,0,3e-05,1e-06,6e-06,1.4e-05,8e-06,1.1e-05,1.6e-05,1.1e-05,5e-06,6e-06,7e-06,6e-06,7e-06,5e-06,2e-05,1e-06,8e-06,7e-06,5e-06
2.2e-05,5e-06,2.1e-05,1.4e-05,9e-06,1.7e-05,2.1e-05,1.3e-05,1.6e-05,1e-05,1.2e-05,1.7e-05,1.1e-05,1.8e-05,2.4e-05,1.1e-05,2.8e-05,6e-06,6e-06,2.5e-05,1.5e-05,2e-05,1.4e-05,2.1e-05,1.4e-05,1.3e-05,1.9e-05,1.8e-05,1.3e-05,2.7e-05,1.6e-05,1e-05,2.6e-05,3.9e-05,1.5e-05,1.9e-05,6e-06,1.5e-05,1.5e-05,3.1e-05,1.4e-05,3e-05,2.8e-05,1.2e-05,2.2e-05,6e-06,8e-06,4e-06,1e-05,1.1e-05,1e-05,2e-05,2e-06,1.8e-05,1.7e-05,3e-05,1.6e-05,1e-05,2e-05,1e-05,9e-06,1.5e-05,1.3e-05,3e-06,9e-06,5e-06,1.1e-05,6e-06,2.6e-05,3e-06,3.1e-05,1.1e-05,1.4e-05,1e-05,2.4e-05,1.4e-05,2.1e-05,1.1e-05,1.4e-05,1.3e-05,8e-06,1.8e-05,7e-06,1.3e-05,2e-05,1.6e-05,7e-06,1.1e-05,7e-06,1.4e-05,4e-05,2.2e-05,1.3e-05,8e-06,1.5e-05,1e-05,1.3e-05,9e-06,1.6e-05,9e-06,2e-05,8e-06,2.8e-05,5e-06,9e-06,1.2e-05,3e-06,1.8e-05,5e-06,4e-06,1.1e-05,7e-06,8e-06,4e-06,5e-06,4e-06,1.7e-05,5e-06,1.2e-05,1.1e-05,8e-06
4.1e-05,1e-05,1.3e-05,1.2e-05,1.6e-05,3.3e-05,2.4e-05,8e-06,5e-06,2.1e-05,7e-06,2.4e-05,7e-06,1.6e-05,1.3e-05,1.1e-05,1.6e-05,1.5e-05,1.5e-05,3.7e-05,1.8e-05,3.9e-05,4e-06,6e-06,2e-05,1.5e-05,2.4e-05,1.4e-05,1.3e-05,1.8e-05,1.7e-05,1.2e-05,2.8e-05,4.3e-05,2e-05,5e-06,1.4e-05,1.2e-05,2e-05,4.3e-05,2.1e-05,1.1e-05,1.9e-05,1.8e-05,1.7e-05,1.2e-05,1.9e-05,1e-06,2e-06,1.5e-05,1.8e-05,1.6e-05,1.3e-05,1.1e-05,4e-06,2.3e-05,1.9e-05,1.9e-05,1.6e-05,8e-06,2e-06,1.5e-05,1.3e-05,2e-06,2.2e-05,1.7e-05,2e-05,1e-05,1.5e-05,2.2e-05,1.3e-05,2.1e-05,1.9e-05,7e-06,2.5e-05,6e-06,2.3e-05,6e-06,2e-05,1.2e-05,7e-06,1.3e-05,1e-05,1.8e-05,2.6e-05,1e-05,1.3e-05,3e-06,1e-05,6e-06,4.3e-05,2.1e-05,1.7e-05,1e-05,1.9e-05,3e-06,7e-06,4e-06,2.2e-05,1.8e-05,2.7e-05,2e-06,2.8e-05,1e-05,4e-06,1e-05,9e-06,1.9e-05,1.3e-05,3e-06,1.1e-05,9e-06,1.3e-05,3e-06,1.3e-05,6e-06,2.1e-05,9e-06,7e-06,9e-06,9e-06
1.7e-05,3.5e-05,2.1e-05,1.7e-05,7e-06,1.8e-05,1.2e-05,2.1e-05,2.7e-05,1.9e-05,1.1e-05,3.3e-05,2.4e-05,3.4e-05,2.3e-05,4e-06,8e-06,2.5e-05,2.1e-05,4.3e-05,1.6e-05,2.7e-05,1.7e-05,3.4e-05,1.2e-05,1.7e-05,4e-06,1.6e-05,2.2e-05,2.9e-05,1e-05,3.1e-05,2e-05,6.4e-05,3e-05,2.6e-05,1.7e-05,9e-06,1.4e-05,4.1e-05,1.6e-05,2.8e-05,1.8e-05,1.1e-05,1.1e-05,1.1e-05,2.7e-05,2.5e-05,2.3e-05,1.3e-05,2e-05,1.9e-05,2.1e-05,2.8e-05,1.6e-05,1.3e-05,1.8e-05,9e-06,9e-06,1.8e-05,1.3e-05,1.4e-05,1.3e-05,6e-06,1.2e-05,1.4e-05,2.7e-05,1.2e-05,1.6e-05,2.7e-05,3.8e-05,1.8e-05,1.1e-05,2.1e-05,2.9e-05,1.9e-05,1.2e-05,1.1e-05,1.6e-05,1.1e-05,1.1e-05,2.4e-05,1.4e-05,1.3e-05,3.9e-05,2.2e-05,8e-06,6e-06,9e-06,1.3e-05,4.6e-05,2e-05,1.8e-05,1.8e-05,2.8e-05,1.3e-05,1.7e-05,6e-06,2.5e-05,1.9e-05,7e-06,1.4e-05,1.8e-05,8e-06,2e-06,6e-06,8e-06,1.7e-05,9e-06,3e-06,1.4e-05,1.1e-05,1.6e-05,4e-06,2e-05,1.3e-05,2.4e-05,7e-06,1.1e-05,6e-06,9e-06
6.7e-05,5.8e-05,9.4e-05,5.1e-05,3.4e-05,3e-05,4.3e-05,1.9e-05,2.4e-05,4.1e-05,5e-05,1.2e-05,4.3e-05,6.5e-05,2.8e-05,3.6e-05,4.5e-05,5.3e-05,4.4e-05,3.1e-05,3.1e-05,3.1e-05,3e-05,5e-05,5.3e-05,4.2e-05,3.5e-05,3.4e-05,1.8e-05,2.2e-05,1.8e-05,6e-05,6.6e-05,7.1e-05,8.1e-05,6.1e-05,3.8e-05,6e-06,3.8e-05,4.7e-05,2.7e-05,3.2e-05,1.1e-05,1.5e-05,5e-06,2.6e-05,3.9e-05,4.5e-05,3.7e-05,5.5e-05,7.9e-05,5.7e-05,3e-05,4e-05,1.6e-05,2.5e-05,1.9e-05,3.2e-05,2e-05,1.9e-05,1.2e-05,1.6e-05,3e-06,3e-06,1e-05,3.1e-05,5.3e-05,5e-05,5.5e-05,3e-05,3.6e-05,2e-05,2.6e-05,4.5e-05,5.5e-05,3.3e-05,1e-05,2e-05,2.1e-05,3.7e-05,3.3e-05,3.6e-05,2.2e-05,8e-06,5.2e-05,2e-05,1.6e-05,6e-06,9e-06,3.5e-05,6.6e-05,2.8e-05,9e-06,7e-06,2.8e-05,1e-05,3.1e-05,3.2e-05,1.7e-05,3.3e-05,2.7e-05,1.6e-05,3.1e-05,4e-06,1.3e-05,2.2e-05,4e-06,3.4e-05,2.3e-05,4e-06,6e-06,5e-06,1.1e-05,1.7e-05,1.4e-05,2.1e-05,2e-05,2e-05,2.3e-05,2.8e-05,2.5e-05
1.6e-05,2.5e-05,6.9e-05,4.5e-05,5e-05,5e-05,1.5e-05,1.5e-05,3.2e-05,2.8e-05,6e-05,5.3e-05,2.1e-05,1e-05,4e-06,5.4e-05,4.5e-05,4.5e-05,1.4e-05,2e-06,1.2e-05,3.4e-05,3.1e-05,3.7e-05,2.3e-05,2.1e-05,7e-06,2.9e-05,2.9e-05,1.8e-05,2.8e-05,2.4e-05,3.5e-05,2.5e-05,4.8e-05,3e-05,1.5e-05,3e-05,2.7e-05,5.4e-05,6.2e-05,4.9e-05,1.4e-05,1e-05,2.8e-05,1.4e-05,3.3e-05,2e-05,3.7e-05,4.6e-05,6e-05,5.5e-05,3.8e-05,6e-06,1.7e-05,1.1e-05,1.1e-05,2.2e-05,3.7e-05,1.4e-05,1.4e-05,9e-06,9e-06,1.5e-05,1.8e-05,1.6e-05,2.2e-05,2.5e-05,3.5e-05,1.9e-05,2.4e-05,5e-06,1.7e-05,2.1e-05,1.5e-05,2.6e-05,3.5e-05,3.3e-05,2.9e-05,3.4e-05,2.8e-05,2e-05,1.1e-05,6e-06,3.5e-05,2e-05,9e-06,1e-05,1.3e-05,2.2e-05,2e-05,2.8e-05,2.1e-05,9e-06,9e-06,1e-05,2.9e-05,2.5e-05,4.1e-05,2.4e-05,6e-06,2e-05,1.5e-05,2.1e-05,2.6e-05,3e-06,2e-05,2.8e-05,1.3e-05,2.1e-05,1.4e-05,1.1e-05,1.1e-05,6e-06,1.8e-05,4e-06,7e-06,2.7e-05,4.1e-05,2.4e-05,3e-05
1.4e-05,9e-06,4e-05,1.2e-05,1.2e-05,2.8e-05,1e-05,4e-06,1e-05,1.6e-05,3.6e-05,2e-05,3.2e-05,1.6e-05,6e-06,4.2e-05,3e-06,9e-06,7e-06,1.2e-05,1.5e-05,3e-06,1.4e-05,2.8e-05,9e-06,1.6e-05,8e-06,2.4e-05,2.3e-05,1.4e-05,3.1e-05,1.7e-05,7e-06,2.2e-05,1.7e-05,1e-05,1.4e-05,2.2e-05,8e-06,1.3e-05,1.7e-05,3.2e-05,6e-06,1.6e-05,3.1e-05,1.3e-05,1e-05,1.4e-05,2.7e-05,4.3e-05,2e-05,2e-05,1e-05,3e-06,5e-06,2e-05,1.1e-05,8e-06,1.5e-05,5e-06,1.4e-05,2.7e-05,1.4e-05,8e-06,1.7e-05,7e-06,1.1e-05,6e-06,1.2e-05,6e-06,1.4e-05,1.1e-05,1e-06,1.2e-05,1e-05,1.8e-05,1.3e-05,1.5e-05,1.4e-05,1.1e-05,6e-06,2.3e-05,7e-06,1.4e-05,1e-05,3e-06,8e-06,1.3e-05,8e-06,1e-05,1e-05,1.1e-05,6e-06,1.1e-05,1e-05,3e-06,2.1e-05,3e-06,2.4e-05,1.4e-05,1.4e-05,1.3e-05,2e-05,1e-05,8e-06,1.2e-05,1.9e-05,1.5e-05,5e-06,1e-05,3e-06,4e-06,5e-06,1e-05,7e-06,2e-05,1.4e-05,9e-06,2.3e-05,5e-06,2.4e-05
1.2e-05,7e-06,2.3e-05,1.3e-05,1e-05,2.6e-05,1.1e-05,6e-06,1.8e-05,1.6e-05,2.4e-05,1.2e-05,1.3e-05,4e-06,1.4e-05,2.6e-05,8e-06,1.4e-05,8e-06,1.5e-05,1.1e-05,7e-06,7e-06,2e-05,1e-05,6e-06,1e-05,1.6e-05,1e-06,1.8e-05,1.9e-05,9e-06,3e-06,2.8e-05,1.1e-05,7e-06,1.2e-05,1.5e-05,4e-06,6e-06,1.6e-05,2.8e-05,4e-06,1.5e-05,2e-06,7e-06,5e-06,1.1e-05,1.6e-05,3.4e-05,1.5e-05,1.2e-05,8e-06,7e-06,7e-06,1.9e-05,7e-06,4e-06,1.5e-05,3e-06,2e-06,1.6e-05,1.2e-05,1.1e-05,1.5e-05,9e-06,4e-06,2e-06,1.4e-05,4e-06,2.6e-05,6e-06,5e-06,5e-06,1.1e-05,1.5e-05,1.2e-05,1.3e-05,7e-06,5e-06,6e-06,2.3e-05,8e-06,1.2e-05,9e-06,7e-06,8e-06,6e-06,7e-06,8e-06,1.9e-05,1.1e-05,5e-06,4e-06,1e-05,8e-06,1.1e-05,3e-06,2e-05,1e-05,1.6e-05,6e-06,1.9e-05,1e-05,8e-06,5e-06,1.3e-05,1.7e-05,7e-06,1.2e-05,3e-06,2e-06,2e-06,4e-06,1e-05,1.1e-05,1.2e-05,4e-06,2.7e-05,1.1e-05,1.7e-05
1.4e-05,5e-06,1.9e-05,1.3e-05,4e-06,2.2e-05,8e-06,3e-06,1.5e-05,2.6e-05,2.2e-05,7e-06,1.3e-05,1.2e-05,4e-06,2.4e-05,1.8e-05,7e-06,8e-06,1.5e-05,3e-06,1e-06,5e-06,2.1e-05,1.2e-05,1.3e-05,1.1e-05,1.8e-05,1e-05,1.2e-05,1.4e-05,6e-06,8e-06,2.5e-05,1.2e-05,6e-06,1.4e-05,1.1e-05,1.3e-05,5e-06,1.1e-05,2.6e-05,5e-06,9e-06,1.7e-05,2e-06,3e-06,6e-06,1.3e-05,3.2e-05,1.5e-05,1.7e-05,1.1e-05,1e-05,9e-06,1.7e-05,9e-06,7e-06,1.5e-05,4e-06,3e-06,1.1e-05,7e-06,8e-06,1.2e-05,1.2e-05,5e-06,3e-06,2.1e-05,9e-06,2.6e-05,5e-06,7e-06,6e-06,7e-06,8e-06,1.9e-05,1.7e-05,9e-06,9e-06,7e-06,1.7e-05,3e-06,1e-05,1.2e-05,7e-06,8e-06,9e-06,4e-06,9e-06,2.2e-05,1.5e-05,7e-06,6e-06,7e-06,7e-06,1.4e-05,7e-06,2.3e-05,6e-06,1.7e-05,2e-06,2.2e-05,7e-06,2e-06,5e-06,7e-06,2.1e-05,9e-06,9e-06,5e-06,1e-06,1e-06,3e-06,9e-06,1e-05,1.1e-05,6e-06,2.3e-05,6e-06,9e-06
1.9e-05,8e-06,2.1e-05,8e-06,1.6e-05,1.4e-05,3e-06,4e-06,2.2e-05,3.3e-05,2e-05,8e-06,1.1e-05,1e-05,6e-06,1.7e-05,2e-05,1.3e-05,7e-06,1.5e-05,8e-06,1e-05,3e-06,1e-05,7e-06,1.3e-05,1e-05,2e-06,6e-06,9e-06,9e-06,1e-05,1.5e-05,3.1e-05,1.7e-05,9e-06,1.7e-05,1.8e-05,1.2e-05,1.9e-05,1.7e-05,2.3e-05,9e-06,1e-05,1.2e-05,9e-06,8e-06,6e-06,1.3e-05,2.3e-05,1.9e-05,1.5e-05,3e-06,1e-05,1e-05,2e-05,1.3e-05,5e-06,1.2e-05,5e-06,6e-06,1.9e-05,1.1e-05,5e-06,1.3e-05,8e-06,4e-06,7e-06,1.2e-05,9e-06,1.8e-05,7e-06,4e-06,8e-06,4e-06,1.4e-05,1.3e-05,1e-05,4e-06,5e-06,1e-06,1.5e-05,5e-06,1.1e-05,1.1e-05,8e-06,2e-06,8e-06,6e-06,5e-06,2.1e-05,1.1e-05,8e-06,7e-06,1.2e-05,7e-06,1.3e-05,1.3e-05,1.9e-05,1.7e-05,1.6e-05,2e-06,2e-05,9e-06,6e-06,7e-06,1e-05,2e-05,2e-05,1.1e-05,3e-06,4e-06,3e-06,6e-06,7e-06,7e-06,1.3e-05,5e-06,1.3e-05,9e-06,9e-06
1.9e-05,2e-06,2e-05,3e-06,1e-05,1.7e-05,4e-06,3e-06,1.7e-05,2.5e-05,1.3e-05,7e-06,9e-06,8e-06,1.5e-05,3.3e-05,1e-06,1e-05,4e-06,1.6e-05,7e-06,1e-05,2e-06,1.6e-05,1.3e-05,5e-06,5e-06,9e-06,3e-06,2e-05,2.6e-05,4e-06,8e-06,3.6e-05,3e-06,1.2e-05,1.1e-05,1.2e-05,3e-06,1.4e-05,1.5e-05,1.9e-05,5e-06,1e-06,1.2e-05,1.5e-05,3e-06,1e-06,1.6e-05,2.3e-05,8e-06,2e-05,3e-06,1e-05,4e-06,1.7e-05,1e-05,2e-06,1.6e-05,1e-06,3e-06,1.5e-05,1.2e-05,4e-06,1.3e-05,6e-06,6e-06,1e-06,9e-06,1.5e-05,2.8e-05,6e-06,3e-06,3e-06,6e-06,1.4e-05,1.2e-05,1e-05,7e-06,3e-06,3e-06,1.6e-05,6e-06,8e-06,1.2e-05,5e-06,6e-06,6e-06,8e-06,3e-06,2.3e-05,1.2e-05,1.3e-05,9e-06,9e-06,7e-06,7e-06,4e-06,1.9e-05,1.3e-05,1.3e-05,3e-06,1.9e-05,9e-06,4e-06,6e-06,7e-06,1.3e-05,1.3e-05,1e-05,4e-06,5e-06,7e-06,4e-06,3e-06,8e-06,8e-06,5e-06,1.7e-05,9e-06,9e-06
1.9e-05,0,1.9e-05,3e-06,6e-06,1.8e-05,2e-06,6e-06,1.5e-05,1.3e-05,5e-06,6e-06,8e-06,4e-06,9e-06,2.9e-05,5e-06,4e-06,2e-06,1.5e-05,7e-06,9e-06,4e-06,1.5e-05,1.2e-05,7e-06,3e-06,7e-06,1e-06,1.8e-05,2e-05,7e-06,1.2e-05,2.8e-05,4e-06,7e-06,1.2e-05,9e-06,4e-06,1.2e-05,1.3e-05,2.1e-05,5e-06,3e-06,7e-06,7e-06,3e-06,4e-06,1.5e-05,2.3e-05,6e-06,1.6e-05,4e-06,9e-06,1e-06,1.8e-05,5e-06,4e-06,1.5e-05,2e-06,3e-06,1.3e-05,8e-06,6e-06,1.1e-05,5e-06,4e-06,2e-06,1.1e-05,1.3e-05,1.4e-05,5e-06,2e-06,4e-06,8e-06,1e-05,1.2e-05,9e-06,6e-06,3e-06,1e-06,1.6e-05,6e-06,1e-05,1.3e-05,4e-06,6e-06,7e-06,7e-06,3e-06,1.8e-05,7e-06,8e-06,5e-06,7e-06,5e-06,8e-06,5e-06,1.8e-05,1.1e-05,1.2e-05,2e-06,2e-05,4e-06,7e-06,2e-06,3e-06,1.3e-05,1.4e-05,4e-06,2e-06,3e-06,1e-06,5e-06,1e-06,4e-06,1.2e-05,6e-06,1.4e-05,4e-06,3e-06
1.7e-05,2e-06,1.7e-05,3e-06,5e-06,1.8e-05,6e-06,8e-06,1.6e-05,4e-06,1.2e-05,5e-06,9e-06,4e-06,1.3e-05,2.6e-05,4e-06,4e-06,2e-06,1.5e-05,8e-06,9e-06,4e-06,1.6e-05,1e-05,1e-05,3e-06,1.1e-05,5e-06,1.4e-05,1.3e-05,1e-06,1e-05,3e-05,5e-06,7e-06,1e-05,9e-06,2e-06,1.1e-05,1.4e-05,1.9e-05,4e-06,0,1.7e-05,1.1e-05,6e-06,2e-06,1.6e-05,2.2e-05,5e-06,1.8e-05,5e-06,7e-06,4e-06,2.1e-05,5e-06,3e-06,1.4e-05,1e-06,2e-06,1.5e-05,8e-06,6e-06,1.1e-05,3e-06,5e-06,2e-06,1.1e-05,1e-05,2.9e-05,1.1e-05,3e-06,4e-06,8e-06,1.1e-05,1.1e-05,8e-06,6e-06,2e-06,2e-06,1.6e-05,5e-06,8e-06,1.4e-05,4e-06,5e-06,5e-06,6e-06,3e-06,1.9e-05,9e-06,1e-05,7e-06,9e-06,7e-06,9e-06,8e-06,1.7e-05,1e-05,1.1e-05,1e-06,1.9e-05,1e-06,4e-06,3e-06,7e-06,1.3e-05,1.2e-05,6e-06,3e-06,3e-06,2e-06,4e-06,0,5e-06,9e-06,3e-06,1.4e-05,6e-06,4e-06
1.6e-05,1e-06,2.2e-05,4e-06,5e-06,1.7e-05,5e-06,8e-06,1.6e-05,1.8e-05,7e-06,3e-06,1e-05,5e-06,1.1e-05,2.3e-05,5e-06,4e-06,2e-06,1.4e-05,8e-06,8e-06,2e-06,1.5e-05,1e-05,8e-06,1e-06,9e-06,3e-06,1.7e-05,1.5e-05,1e-06,9e-06,2.9e-05,4e-06,7e-06,1e-05,1.1e-05,1e-06,1.4e-05,1.4e-05,1.9e-05,4e-06,0,2e-05,8e-06,4e-06,3e-06,1.5e-05,2.2e-05,8e-06,1.6e-05,2e-06,9e-06,2e-06,2e-05,5e-06,3e-06,1.3e-05,1e-06,2e-06,1.5e-05,7e-06,5e-06,1.2e-05,5e-06,5e-06,1e-06,1.1e-05,9e-06,1.5e-05,7e-06,1e-06,5e-06,8e-06,1.1e-05,1.2e-05,7e-06,5e-06,5e-06,3e-06,1.5e-05,4e-06,1e-05,1.3e-05,5e-06,5e-06,6e-06,6e-06,4e-06,1.9e-05,1e-05,9e-06,7e-06,9e-06,5e-06,8e-06,7e-06,1.8e-05,1e-05,1.2e-05,2e-06,2e-05,3e-06,3e-06,5e-06,6e-06,1.3e-05,1e-05,3e-06,1e-06,2e-06,1e-06,5e-06,1e-06,3e-06,9e-06,5e-06,1.3e-05,6e-06,5e-06
