-0.000333,-0.00164,-0.00315,-0.001832,-0.000622,-4.5e-05,0.000146,-0.000172,0.000185,-0.000939,-0.001247,-0.000946,-0.001712,-0.002193,-0.001511,-0.00144,-0.00124,-0.001385,-0.000729,-0.000808,-0.000329,-0.000158,-0.000927,-0.000935,-0.000939,-0.000969,-0.001092,-0.000732,-0.000978,-0.000489,-6.9e-05,-0.004186,-0.003366,-0.003115,-0.005145,-0.007697,-0.030012,-0.023819,-0.011949,-0.003507,-0.001099,-0.000416,-0.000652,-0.001355,-0.000651,-0.00028,-0.000539,-5.6e-05,6.1e-05,-0.003755,-0.024839,-0.019865,-0.012725,-0.009298,-0.006076,-0.003213,-0.00117,-0.000725,-0.000817,0.000175,-0.001764,-0.01658,-0.016767,-0.009889,-0.006442,-0.003635,-0.003695,-0.003657,-0.002924,-0.002991,-0.003198,-0.005027,-0.003526,-0.003581,-0.007998,-0.020525,-0.027892,-0.01836,-0.009566,-0.004487,-0.001316,-0.001339,-0.000498,-0.000339,-0.000272,-0.000724,-0.001916,-0.000715,-0.000712,-0.000701,-0.000181,-0.000978,-0.01922,-0.02517,-0.019726,-0.01232,-0.005685,-0.003395,-0.001837,-0.001989,-0.001249,-0.005841,-0.006838,-0.003203,-0.001586,-0.001093,-0.001161,-0.000821,-0.00179,-0.000929,-0.003394,-0.003199,-0.005822,-0.004674,-0.007306,-0.005888,-0.007439,-0.004108,-0.002446,-0.001626,-0.006559
4e-04,0.000231,0.000799,0.000675,0.000619,0.000599,0.000305,0.000541,0.000732,0.000703,0.000701,0.000674,0.001279,0.001906,0.000467,0.000875,0.000344,0.000472,0.00058,0.000593,0.000297,0.000167,0.000601,0.000403,0.000857,0.000364,0.000238,0.000115,0.000486,0.00083,0.000447,-0.000479,0.000933,0.002078,0.001302,0.000562,0.019666,0.015381,0.008892,0.001858,0.000377,0.000822,0.000541,0.000706,0.001091,0.000568,0.000945,0.000687,0.000173,-0.00581,0.00446,0.013244,0.009005,0.004695,0.002731,0.001432,0.000531,0.001448,0.001194,0.000754,-0.000398,0.012604,0.00867,0.004662,0.003578,0.002183,0.002126,0.00174,0.001977,0.001945,0.002382,0.003606,0.002385,0.000949,0.00277,0.017206,0.020555,0.010037,0.002636,0.00106,0.001222,0.002624,0.001155,0.000737,0.000394,0.000489,0.00201,0.001492,0.001016,0.000818,0.000457,0.000473,0.002809,0.007126,0.006144,0.006971,0.004637,0.002444,0.001771,0.001801,0.001483,0.00208,0.004783,0.002812,0.001743,0.001141,0.001193,0.000914,0.001355,0.000539,-0.000203,0.000587,0.00341,0.001867,0.003869,0.003242,0.004832,0.003138,0.001253,0.000128,0.003208
-4.2e-05,-0.000367,0.000586,0.00023,-0.000101,-2.4e-05,0.000111,0.00032,-0.000135,-0.000216,0.00081,0.000504,-0.000126,-0.000778,3.6e-05,-0.000323,3e-06,0.000133,-0.000115,-0.000166,-0.000105,3.2e-05,0.000231,0.000356,-0.00023,-0.000297,6.3e-05,-5.4e-05,8.8e-05,-0.000189,0.000188,0.000418,0.000352,-0.00164,-0.001298,0.001019,-0.014713,-0.014475,-0.007539,-0.002487,-0.000663,-0.000479,-0.000449,-0.000233,8.2e-05,0.000126,0.000206,-1e-04,-4.3e-05,0.003129,-0.00197,-0.003035,-0.00066,3.4e-05,-0.00088,-0.000903,0.000232,0.000622,0.00019,0.000184,0.00037,-0.004782,-0.001118,0.000251,-0.000255,-0.000524,-0.001388,-0.000599,-0.000589,-0.001027,-0.001447,-0.001297,-0.000783,-4e-05,-0.00162,-0.009391,-0.021186,-0.011664,-0.005195,-0.003308,2.7e-05,-0.001707,-0.001005,-0.000207,-2.8e-05,0.000199,-0.000291,1e-04,0.000189,-0.000119,-0.000173,-0.000262,0.002322,-4.7e-05,-0.001237,-0.002059,-0.000778,0.000449,-9e-05,-0.000887,-0.000569,-9.7e-05,-0.002402,-0.001175,-0.000533,0.000112,-0.000473,-0.000496,-0.000249,-0.000629,0.000502,0.000196,-0.001017,5e-05,-0.001091,-1.6e-05,-0.003156,-0.001567,-0.000455,0.000364,-0.001062
6.2e-05,0.000145,-0.000734,-0.000457,-0.000177,-8.4e-05,-0.000107,6.1e-05,-0.000127,-0.000138,-0.000662,-0.000303,-0.000531,0.000432,2.6e-05,0.000239,-0.000325,-0.000106,8e-05,5.2e-05,-0.000208,-4.3e-05,-0.000263,-0.000499,0.000191,5.9e-05,2.1e-05,1e-06,-0.000174,3.6e-05,-4.6e-05,-0.000114,-0.00045,-0.00037,0.000619,-0.002461,0.002342,0.003616,0.001766,0.000411,0.000618,0.000325,0.00036,6.2e-05,0.000311,-0.000125,0.000392,0.000262,-0.000161,-0.000806,0.003618,-0.000247,5e-06,0.001469,0.001376,0.000112,0.00026,0.000317,-5.3e-05,0.00083,-0.000102,-8e-06,-0.00293,-0.003839,-0.001418,-0.000682,0.000527,-0.000271,0.000358,0.000687,0.000273,-0.000172,-0.00037,-0.000277,0.000809,-0.004041,0.000511,-0.000958,0.001307,0.002213,0.000205,0.001207,9.6e-05,-0.000128,-0.000113,-0.000636,8e-05,-0.000299,-0.000357,-0.000152,2.2e-05,3.1e-05,-0.002359,-0.003913,-0.00171,-0.001322,-0.001472,-0.000771,-0.000531,0.000971,0.000139,-0.000235,0.001422,0.000689,-0.000236,-7.1e-05,0.000433,0.000158,0.000389,0.00044,-0.000292,-3.1e-05,4.3e-05,-0.000874,-0.000978,-0.000742,0.002217,0.001676,0.00058,-0.00136,-0.001395
-0.000142,0.000146,0.000561,0.00057,0.000243,0.000201,2.1e-05,3e-06,-0.000214,-0.000263,0.000535,0.000342,0.000605,0.000119,-0.000156,0.000125,-0.000122,0.000212,0.00041,-4e-05,0.000201,1.5e-05,5.5e-05,0.000296,6.6e-05,-8.7e-05,0.000182,0.000137,0.000365,2.8e-05,-7.6e-05,-0.000388,-0.00025,0.00144,0.000673,0.00154,-0.005482,-0.002729,0.000432,0.001505,0.000621,-8.1e-05,-3.4e-05,-9e-06,7.2e-05,-8.5e-05,-0.000378,-0.000222,-0.000134,-0.00027,-0.00127,0.003651,0.002423,-0.000927,0.000339,0.000309,0.000228,0.000571,-9.8e-05,0.000344,0.000316,-0.000221,0.005059,0.00453,0.001854,0.000682,-0.000313,-0.000182,-0.000316,-7.8e-05,-0.000806,0.000633,-0.000335,-0.000314,-0.001121,0.001334,-0.003386,0.003899,0.005045,0.000873,0.000498,-0.000597,-0.000857,-2.6e-05,-0.000516,5e-06,0.00017,0.00052,0.000197,0.000291,-2.2e-05,-0.000342,-0.000225,0.005545,0.000872,0.003482,0.002036,0.001907,0.001166,-6.3e-05,0.000419,0.000198,0.000125,-9.7e-05,0.000174,0.000292,-0.000156,-0.000293,-0.000157,-0.000291,2.8e-05,3.9e-05,0.000133,0.001619,-3.1e-05,-0.000468,-0.000469,-0.001446,-0.000848,6.5e-05,-4.5e-05
-0.000185,-0.000133,-0.000274,-0.000371,-0.000119,1.8e-05,-5.5e-05,-0.000135,-9.9e-05,-0.000103,-0.000219,-6e-05,-0.000672,-0.000105,0.000225,6.8e-05,0.000237,-0.000318,-0.000289,-5.2e-05,-8.6e-05,0.000159,-4.1e-05,-0.00015,-5e-05,-0.000195,-9.8e-05,-0.000251,-0.000108,-0.000211,-0.000276,-6e-05,0.000602,-0.000575,-0.00071,-0.000374,0.00454,0.002957,0.00134,-0.00028,-0.000128,2.6e-05,-0.000342,-0.000439,-0.000127,-0.000141,-9.4e-05,3.3e-05,-0.000476,4.7e-05,-0.008176,-0.006575,-0.0034,0.000898,-4.7e-05,-0.000249,0.000282,-7.4e-05,-0.000264,-0.00025,-0.000266,0.001307,-0.003197,-0.003327,-0.000749,-9e-06,-1.1e-05,-6.5e-05,-0.000224,0.000168,-0.000629,-0.00091,0.000102,0.000997,0.000946,-0.000405,0.004352,-0.001464,-0.001739,0.000474,-0.000317,-2.8e-05,-5.4e-05,-1.6e-05,0.000148,-0.000674,-0.000238,-0.000534,-8.8e-05,-0.000289,-0.000171,-0.000285,-0.000266,8.6e-05,0.003366,-0.000999,-0.001359,-0.001402,-0.000963,9e-06,-0.000681,-0.000455,-0.000339,-9e-06,-9.4e-05,-0.000175,-0.000292,-0.000383,-3.1e-05,0.000184,0.000199,0.000147,0.000174,-0.000676,0.000798,0.00038,0.000696,0.000811,-6.2e-05,7.8e-05,0.000405
1.8e-05,3e-05,0.000125,1.9e-05,-0.000143,-0.000302,-0.000309,-0.000131,-5.3e-05,-0.000166,-0.000206,-0.000755,3.1e-05,-2.4e-05,-0.000584,-4e-06,-0.000194,0.000177,-0.00011,-0.000121,1.4e-05,-0.000312,-0.000246,-0.000122,-8e-06,0.000112,8.5e-05,0.000248,-0.000123,-4.4e-05,-0.000185,6.4e-05,0.000535,0.000102,1e-04,0.000235,-0.000821,0.000653,0.000234,3.9e-05,-0.000245,-0.000434,-0.000231,-1.2e-05,-6.4e-05,-0.000111,-0.000125,-0.000258,-0.000147,-3.6e-05,0.002396,0.002447,-0.001054,-0.001443,-0.00087,-0.000255,1.5e-05,0.000119,-0.000359,-3.2e-05,-0.000163,-0.00067,-0.000944,-0.000775,-0.00096,-0.000206,-2e-05,0.000233,-6.5e-05,-0.000448,2.6e-05,0.000615,-0.000318,-0.000862,-0.000163,-0.000375,0.005222,0.000777,-0.000715,-0.001389,0.000314,-0.001418,-0.00082,-0.000285,-0.00042,-0.000179,-0.00044,-0.000224,-0.000434,-6.6e-05,-0.000282,-0.000128,-0.000233,-0.00168,-0.004364,-0.00093,-0.000551,6e-04,0.00017,-0.000292,0.000275,0.000138,0.000163,-0.000911,-0.000304,-0.000465,-0.000412,-7.7e-05,-0.00029,-0.000515,-0.000292,-0.000583,-0.001119,-0.000232,-0.000681,-4.8e-05,-0.000321,-0.001045,3.9e-05,-0.000491,-0.00026
0.000123,-0.000136,-0.000193,-8.9e-05,0.000118,0,6e-06,-0.000131,-0.000224,-0.000177,-0.000171,3e-04,2.9e-05,8.3e-05,0.000448,-2.7e-05,-5.8e-05,2.6e-05,-1.7e-05,-0.000207,-0.00025,-4.6e-05,-3.2e-05,0.000184,7.9e-05,-0.000107,-0.000215,-0.000106,8.2e-05,7.4e-05,-7e-06,-0.000241,-0.000243,0.000368,-0.00035,-2.1e-05,-0.000286,0.002769,-0.00181,-0.001817,-0.000179,0.000113,0.000126,2.8e-05,-0.000147,-3.8e-05,-3.9e-05,-0.000239,-0.000194,-1.4e-05,0.000479,-0.001843,-0.001619,-0.00016,0.000697,-0.000171,-0.000365,0.000204,-0.000396,-0.000204,2.8e-05,-8.2e-05,-0.00023,-1.7e-05,0.001658,-6.2e-05,-9.9e-05,-0.000454,-0.000325,3.5e-05,-0.000419,-0.000914,-0.000602,-0.000351,-0.000388,0.00012,-0.001543,-0.003467,-0.001947,7e-06,-0.000655,-0.000777,-0.000296,0.000178,0.000165,-0.000183,-0.000111,-0.000113,0.000163,-0.000293,-0.000187,-0.000131,-9.5e-05,7e-04,0.0046,0.000544,0.000802,-0.000154,-0.000607,0,-0.000288,-0.000484,-0.000558,0.000591,9.4e-05,0.000134,-2.9e-05,-0.000279,2e-06,6.7e-05,0.000137,7e-05,0.000851,0.000159,0.000378,-0.000427,-0.000544,0.000221,-0.000494,3.1e-05,-0.000366
-0.000265,2e-06,5.6e-05,0.000168,3.4e-05,-0.000159,-8.9e-05,-9.5e-05,-0.000177,0.000155,-0.000119,-0.000293,-0.000428,-0.000192,-0.000256,-0.000216,-7.6e-05,-6.1e-05,-6.2e-05,0.000201,0.000109,-0.000141,-6.8e-05,-0.000192,-0.000216,0.00011,0.000124,2e-06,-8.3e-05,-5.9e-05,-8.6e-05,7.3e-05,-0.000179,-0.000781,0.000155,-3.2e-05,0.001362,-0.002861,0.001662,0.001881,6e-04,0.000235,-8.5e-05,-0.000106,3.8e-05,-0.000223,-2.5e-05,-0.00018,-7.3e-05,-9.2e-05,-0.001603,0.00026,-0.000929,-0.001087,0.000218,-9.4e-05,4.8e-05,3.1e-05,-2.1e-05,-0.00024,-0.000304,0.000183,-0.000798,0.000292,-0.001131,0.00019,0.000263,0.000269,0.000235,0.000157,0.000161,0.00016,0.000555,6.2e-05,-2.3e-05,0.000537,-0.001175,-0.002459,0.003159,0.000212,-0.000349,-0.000435,-1.2e-05,-2.9e-05,-0.000255,-4.1e-05,3.5e-05,-0.000217,-0.000256,-0.000174,-6.6e-05,-3.9e-05,1.7e-05,-0.000357,-0.001989,0.000859,-0.000806,-0.000265,-5.9e-05,1.5e-05,-1.8e-05,0.000105,0.000321,-0.000292,-0.000331,-0.000287,-0.000206,9.7e-05,-7.9e-05,-0.000201,-0.000214,-0.000189,-0.000572,1.6e-05,8e-05,-8.1e-05,0.000775,-0.000145,2e-05,-0.000159,0.000207
0.000242,-1.3e-05,4e-06,-0.000228,-0.000182,-9e-05,1.5e-05,-1e-06,-7.3e-05,-7.5e-05,-6.8e-05,-0.000105,-0.000168,2e-06,-3e-06,0.00017,5.4e-05,0.00023,2e-06,-0.000278,-0.000102,4e-06,1e-05,9.6e-05,5.2e-05,-7.1e-05,-5.4e-05,9.3e-05,2e-04,1.4e-05,2e-05,-4.7e-05,-5.4e-05,0.000667,2.6e-05,0.000741,-0.000661,-7.8e-05,-0.00293,-0.001557,-0.000592,-0.000425,-1.3e-05,6.7e-05,-0.000154,7.5e-05,-0.000135,-0.000296,2.8e-05,7.6e-05,0.001776,0.000769,0.000761,0.001291,2.2e-05,0.000317,-0.000111,-5.5e-05,-0.000214,0.000162,-0.000716,-5.8e-05,-0.000128,-0.000667,0.000104,-0.000197,-0.000164,-3e-05,-2.1e-05,-0.000254,-0.000174,-0.000319,-0.00071,-0.000244,0.00011,-0.000447,0.003003,0.000735,-0.000831,0.001046,0.0014,0.000367,0.000113,6.2e-05,-0.000155,4.4e-05,-5.9e-05,-0.000134,-4e-06,1.6e-05,-0.000154,-2.8e-05,0.000137,-0.000266,-0.001995,-0.00234,-0.000473,-3.4e-05,-1.1e-05,-0.000189,-0.000163,-0.000129,-4.7e-05,-0.000136,-6.2e-05,1e-06,4.8e-05,-0.000217,7.2e-05,7.6e-05,1.7e-05,-4e-06,8.7e-05,-6.5e-05,-0.000327,-0.000588,-0.000625,-0.000239,-0.00017,2.4e-05,0.000183
-0.00011,0.000155,4.4e-05,2.4e-05,0.000159,3.7e-05,-3.6e-05,-5.9e-05,-3.6e-05,3.8e-05,-4.6e-05,0.000139,0.000135,-2.9e-05,9.6e-05,-8.5e-05,-3.5e-05,-0.000226,-9e-05,0.000102,9.4e-05,3.1e-05,-5e-06,-3.6e-05,-1.5e-05,4.9e-05,-4.3e-05,3.6e-05,-2e-04,-5e-06,3.5e-05,7.3e-05,-0.000112,-0.000223,-0.00028,-0.000615,0.000977,0.001005,0.002331,0.001319,0.00039,-0.000159,-8.3e-05,-2.2e-05,-5.9e-05,-0.000118,-3.5e-05,-3.9e-05,-0.000172,-0.000252,-0.000887,-0.000703,-0.002353,2.2e-05,0.000951,-7.9e-05,-1.5e-05,0.000185,-4e-06,-0.000239,-2.7e-05,1.9e-05,0.000582,-8e-04,0.000536,-6e-06,-0.000117,3e-05,-0.000115,0.000176,1.7e-05,0.00016,0.000211,0.000245,-0.000386,0.000124,-0.000142,0.00138,0.000418,-0.001135,-0.000679,-7.3e-05,-0.000136,0.000158,0.000101,0.000307,0.000105,-2e-05,7.7e-05,-3.6e-05,1.6e-05,-0.000106,7.2e-05,-0.000602,0.003216,0.002053,0.000771,0.000126,-0.000286,3.8e-05,-8.3e-05,-0.000218,-0.000135,-7.4e-05,9.1e-05,4.6e-05,-9.9e-05,7.9e-05,-7.4e-05,-0.000183,7e-06,-0.000101,0.000112,4.8e-05,0.00056,0.000582,-0.000273,0.000113,0.000327,5.2e-05,1.2e-05
7.7e-05,0.00013,-4.4e-05,8.1e-05,-0.000136,-7.6e-05,-0.000116,-2.6e-05,1.8e-05,-8.1e-05,9.4e-05,-0.000148,-0.000122,-0.000116,-0.000222,-1.2e-05,2e-06,8.6e-05,9.7e-05,-6.7e-05,-2.8e-05,-6.8e-05,-2e-05,3.1e-05,-0.000116,-3.9e-05,5e-06,-5.4e-05,8.1e-05,-2.3e-05,4.4e-05,1e-06,-2.8e-05,-0.000394,0.000165,-0.000306,-0.000903,-0.000762,0.000851,-0.000637,-0.000298,1.1e-05,-1.1e-05,1e-05,4.7e-05,4e-05,5.3e-05,1e-05,0.000178,-4.5e-05,-0.001331,0.000287,-1e-05,-0.000962,0.000284,-1.1e-05,-2.4e-05,-1.4e-05,-0.000129,-6.5e-05,-2e-04,-0.000105,0.000367,0.000886,-0.000776,6.1e-05,-1e-04,1.6e-05,0.000109,-0.000109,-0.000175,-0.000145,-0.000232,-4.1e-05,3e-04,-1.2e-05,-0.000719,0.000232,-0.001282,0.000646,-0.00015,-2.3e-05,0.000247,0.000361,0.000154,-0.000186,-9.6e-05,-2.9e-05,-0.000214,-1e-04,-9.8e-05,3e-05,0.000231,0.000447,-0.00031,-0.001511,-8e-04,-0.000421,-2.2e-05,-0.000134,-4.5e-05,0.000216,3.2e-05,9.6e-05,-0.000133,-0.000177,-8e-05,4.2e-05,-7.1e-05,8.9e-05,0.000139,0.000122,4.8e-05,-0.000197,-0.000299,-9.6e-05,0.000174,-3.9e-05,-0.000516,-7.8e-05,7.1e-05
-7.6e-05,0.000102,-2.8e-05,1.5e-05,6.6e-05,5.2e-05,2.6e-05,-2.1e-05,-2.7e-05,2.9e-05,-2.7e-05,7.9e-05,0.000268,8e-06,0.000123,-2.2e-05,1.6e-05,-0.000138,-5.2e-05,2.8e-05,-5.2e-05,5.2e-05,-5.1e-05,-6.8e-05,0.000109,1.1e-05,-2.6e-05,4.3e-05,7e-06,1.7e-05,-3.2e-05,4.2e-05,-0.000133,7.2e-05,9.8e-05,0.000206,0.00034,-3.2e-05,3.8e-05,0.000458,4e-06,0.000174,5.4e-05,3.3e-05,0.000118,-4.9e-05,-0.000104,-9e-06,-5.9e-05,-5.5e-05,0.001036,0.000177,0.000787,0.000905,0.00013,-9.9e-05,-6.2e-05,-8.9e-05,2.2e-05,1.5e-05,-0.000137,-2.7e-05,-0.000645,0.00042,-0.000375,-0.000177,-8.1e-05,0.000121,6e-05,0.000221,0.000162,0.000193,8e-05,9e-05,4.2e-05,1.7e-05,0.000264,0.000516,0.00044,-1.5e-05,-0.000342,-0.000166,3.4e-05,7.3e-05,3.4e-05,4.5e-05,5.8e-05,-3.6e-05,0.00017,2.1e-05,-3.2e-05,5.2e-05,5.4e-05,-0.000187,-0.000501,0.001259,0.000504,0.000503,2.2e-05,8.3e-05,5e-05,-0.000156,-4.3e-05,-0.000105,3.8e-05,5.5e-05,7.5e-05,1e-05,8.6e-05,-3.8e-05,-0.000191,-6.3e-05,-0.000343,0.00011,0.000239,2.1e-05,-0.000127,0.000193,0.000375,0.000188,0.000108
-6.5e-05,-3e-06,4e-06,-4e-06,3.2e-05,-4.7e-05,5.3e-05,-1.8e-05,2.4e-05,2e-05,5.6e-05,-7.5e-05,-0.000142,-1e-06,-2.3e-05,-7e-06,-4.4e-05,0.000116,0,-2.6e-05,4.8e-05,-2e-05,2.9e-05,2.9e-05,-6.6e-05,-6e-06,2.9e-05,4e-05,-6.7e-05,-2.5e-05,-2e-05,-8.6e-05,-2.9e-05,8.4e-05,-8.8e-05,1.3e-05,0.000158,-0.000353,1.8e-05,-0.000179,1.9e-05,-0.000265,-7.8e-05,-3e-05,-1e-05,5.3e-05,1e-04,7e-06,7.7e-05,-0.000104,-0.000232,-0.000562,0.000209,-0.000816,0.000384,-0.000116,7e-05,0.000136,-0.000131,-4.8e-05,-8.6e-05,-0.000157,0.00032,0.00016,0.000483,-8.4e-05,0.000184,-2e-06,-0.000213,-6.9e-05,4.9e-05,-0.000142,0.00011,-9.9e-05,-0.000217,6.7e-05,-0.00038,0.000359,7.4e-05,-0.000271,0.00043,-0.000204,-1.5e-05,-2.3e-05,-3.3e-05,-2.1e-05,1.7e-05,6.5e-05,-8.3e-05,2.7e-05,7e-05,-8e-06,1.6e-05,0.000131,-0.000141,-0.000587,-0.000517,-0.000543,-9.8e-05,-4.5e-05,-8.3e-05,0.000189,3.9e-05,-4.9e-05,7.1e-05,-1.6e-05,9e-06,5.2e-05,-3.3e-05,1.8e-05,0.000124,2.1e-05,6.3e-05,-2.1e-05,4.7e-05,-9.2e-05,0.000149,-0.000203,-9.8e-05,-2.2e-05,4.7e-05
4e-05,8.3e-05,3e-05,-4e-06,-7.8e-05,2.3e-05,-3.3e-05,1.9e-05,2.1e-05,8e-06,-1.6e-05,9.5e-05,7.8e-05,-3.1e-05,-8e-06,-3e-06,0,-4.1e-05,4e-05,2.6e-05,-1.9e-05,2.9e-05,4e-05,-1.3e-05,3.9e-05,1.6e-05,1.5e-05,-6e-06,2.2e-05,3e-06,3e-06,7.5e-05,6.2e-05,-2.9e-05,3.5e-05,-9.1e-05,-6.1e-05,0.000136,-0.001011,-0.000218,4.8e-05,3.2e-05,5e-06,-9e-06,-2.1e-05,-1e-05,-3.9e-05,-1.4e-05,4.3e-05,1.5e-05,-0.000274,0.000139,-0.000473,0.000205,-0.000164,-0.000297,-2.3e-05,-0.000177,-0.000103,2.9e-05,-3.6e-05,-0.00012,-0.000637,-0.000195,-9e-06,0.000225,-0.000149,-4.9e-05,0.00015,-0.000114,-9e-05,-6e-06,-7.8e-05,5.4e-05,6.8e-05,-5.9e-05,0.000468,-0.000301,0.001006,0.000694,-6e-06,-8.2e-05,-8.7e-05,5.1e-05,-3.1e-05,7.3e-05,2e-05,1.3e-05,9.4e-05,-4e-06,-2.8e-05,-1.8e-05,-2.7e-05,-2.1e-05,-4.3e-05,-0.000428,6.1e-05,0.000399,-9.3e-05,5.2e-05,-1.3e-05,-6.9e-05,5e-06,0.000108,-2.2e-05,2.1e-05,-4e-06,1.7e-05,2.7e-05,4.8e-05,-7.5e-05,-3.1e-05,0.000104,-6.4e-05,-5e-05,0.000111,-0.000115,-5.4e-05,7.2e-05,0.000141,-5e-06
6.4e-05,-6e-06,1.8e-05,8e-06,2.2e-05,-4.2e-05,2.6e-05,-1.5e-05,-7e-06,-6e-06,0,-3.4e-05,-1.7e-05,1.8e-05,5.8e-05,-1e-05,3.3e-05,-6e-06,-2.2e-05,-3.7e-05,1.6e-05,-3.6e-05,3e-06,1.6e-05,-4e-06,-3e-06,-2e-06,4.6e-05,-1.1e-05,-1e-06,4e-06,-5.9e-05,3.6e-05,2.2e-05,3e-06,1.2e-05,0.000255,0.000139,0.000149,2.2e-05,4e-06,-0.000151,5.1e-05,1e-05,2.3e-05,-4e-06,-1.6e-05,9e-06,9.1e-05,-3.9e-05,0.000724,0.000275,-0.00012,1.5e-05,0.000496,9.6e-05,4.2e-05,4.3e-05,-2.1e-05,-3.5e-05,9.7e-05,1.7e-05,0.000399,-4.5e-05,-0.000291,-0.00019,5.7e-05,3.1e-05,-4.9e-05,6.9e-05,7.1e-05,-4.1e-05,-8e-06,-0.000104,-5e-06,-7.9e-05,-0.000599,-7.8e-05,0.000127,-0.000274,-7e-05,-1e-05,7e-05,-6.6e-05,-5.1e-05,8e-06,-3.8e-05,-7e-06,-5e-05,-1.5e-05,2.3e-05,3.2e-05,3.1e-05,0.000232,0.000153,0.000376,-3.8e-05,-0.000156,0.000103,1.5e-05,2.9e-05,3.1e-05,-2.7e-05,-2.8e-05,2.9e-05,-6.1e-05,-6e-06,-1.4e-05,-2.2e-05,-3.6e-05,3.3e-05,-1.9e-05,-2.5e-05,3.3e-05,1.5e-05,2.9e-05,-3.5e-05,0.000127,-2.3e-05,-0.000145,5e-05
-6.1e-05,4e-06,2.2e-05,-8e-06,3.5e-05,1.4e-05,6e-06,-1.5e-05,-3e-06,-4e-06,-3.4e-05,2.6e-05,9e-06,1e-05,-6.1e-05,-1.4e-05,-2.3e-05,8e-06,-1e-05,3.6e-05,-1.1e-05,1.7e-05,-2e-06,-4e-06,1.4e-05,-1.4e-05,-1.2e-05,-4e-06,1.1e-05,1.3e-05,2e-05,2.7e-05,1.7e-05,8.9e-05,-2e-05,1.9e-05,-0.000327,0.00024,0.00017,7.7e-05,-1.7e-05,0.000125,2e-06,-3e-06,5e-06,-6e-06,-1e-05,-5e-05,-3e-06,2e-05,-0.000567,-0.000353,-0.000149,-0.000406,-0.000543,-4.3e-05,-4e-05,2e-05,-4.2e-05,2.2e-05,-4.5e-05,-1.7e-05,-0.000318,-0.000123,6e-05,0.000114,-6.3e-05,-8e-05,-6e-06,-3.6e-05,-1.3e-05,-1.4e-05,9.8e-05,6e-06,4.1e-05,3.3e-05,-0.000498,-0.000699,-0.000225,0.000233,-9.4e-05,-6.5e-05,2.2e-05,8.2e-05,-4.7e-05,5.1e-05,-2.5e-05,-1.9e-05,-1.1e-05,-1.8e-05,1e-06,-6e-05,-7e-06,-7.9e-05,-0.000453,0.000141,7.6e-05,1.5e-05,-9.7e-05,-7.9e-05,-3.6e-05,3.9e-05,9e-06,-5.7e-05,-4.5e-05,6.2e-05,-2.3e-05,4.5e-05,1.4e-05,-3e-06,-1.7e-05,-1e-05,-5e-06,3.7e-05,3.9e-05,-1e-04,2e-06,-5.3e-05,-8.5e-05,0.000131,1e-05
1e-06,-2.2e-05,1.7e-05,3e-06,-3.4e-05,-1.6e-05,-1.9e-05,9e-06,-1.1e-05,-9e-06,-5e-06,1.3e-05,-1.6e-05,3e-05,4.4e-05,3.6e-05,5e-06,-3.8e-05,-2e-06,-2.9e-05,3e-06,-1e-05,-6e-06,-7e-06,-6e-06,2.4e-05,1e-05,-2e-05,-2.8e-05,9e-06,-1e-06,-7e-06,-2.3e-05,-9.9e-05,-1.4e-05,4.5e-05,0.000236,-0.000336,-0.000537,-0.000258,3.4e-05,1.9e-05,-6e-06,1e-05,-9e-06,-2.8e-05,2.1e-05,-9e-06,2.2e-05,4e-06,-0.000152,0.000325,-5.9e-05,0.000209,0.000226,-3.8e-05,3.6e-05,-2.8e-05,-3.5e-05,-2.3e-05,4.5e-05,-7.3e-05,0.000442,1e-06,0.000196,-6e-05,1.9e-05,6e-05,2.1e-05,-4e-05,1.9e-05,-2.5e-05,-0.000138,5.7e-05,-1.3e-05,-4.6e-05,0.000377,0.000205,-0.000215,-1e-04,9.8e-05,4.2e-05,-2e-05,-2e-05,-5e-06,-5.5e-05,4.2e-05,-1e-06,1.5e-05,2e-06,-2.2e-05,4.1e-05,-1.3e-05,2.1e-05,0.000414,-0.000259,0.00013,-1.5e-05,2e-06,5e-05,2.8e-05,1.7e-05,2.2e-05,2.7e-05,3.2e-05,-4.6e-05,-1.9e-05,-1.1e-05,-9e-06,-2.5e-05,-7e-06,-2.1e-05,2.3e-05,-2.7e-05,-5.3e-05,4e-06,7.2e-05,2.2e-05,2.1e-05,-6.9e-05,2.4e-05
-1e-06,-3e-06,2e-06,2e-06,1e-05,-2e-06,1e-06,-1.2e-05,1e-06,6e-06,4e-06,-4e-05,1.1e-05,0,-4.3e-05,-2e-05,-7e-06,3.2e-05,-3e-06,9e-06,-3e-06,-8e-06,-3e-06,-7e-06,-1e-05,-1.7e-05,-1.5e-05,2e-06,2.5e-05,-2.2e-05,-1.1e-05,7e-06,8e-06,3.2e-05,1.7e-05,-5.4e-05,-1e-06,9.2e-05,0.000295,0.000189,-5.2e-05,1e-05,1e-06,-8e-06,-3e-06,1.2e-05,-2.4e-05,-1.7e-05,3e-06,1.6e-05,0.000392,-0.000182,9e-05,3e-05,-0.000295,-3.6e-05,-3.8e-05,2.5e-05,-2.3e-05,-4e-06,-1.4e-05,1e-06,-0.000221,0.000171,1.1e-05,3.4e-05,1e-06,-1e-05,-2.6e-05,3.7e-05,-2.6e-05,1e-05,4.3e-05,-4.5e-05,-2.1e-05,-1.3e-05,-6.2e-05,-2.4e-05,-0.000305,6.4e-05,-3.5e-05,-2.2e-05,9e-05,-4.2e-05,-1.3e-05,3.6e-05,-7e-06,0,-2.7e-05,-4.2e-05,-3e-06,-5e-06,-1.1e-05,-2.6e-05,-0.000304,9.7e-05,-3.9e-05,-2.4e-05,3e-06,-6.4e-05,-2.2e-05,-1.4e-05,-2.8e-05,-1.5e-05,-1e-05,-8e-06,-1.2e-05,1.8e-05,1e-06,1.6e-05,1.1e-05,1.8e-05,1.6e-05,-3.3e-05,7e-06,2.1e-05,-3.9e-05,-4.1e-05,3.7e-05,6.2e-05,4e-06
1.1e-05,-4e-06,-1.1e-05,-2e-06,7e-06,9e-06,-6e-06,-1e-06,9e-06,-2e-06,4e-06,1.8e-05,-1.9e-05,-1.8e-05,1.6e-05,1.8e-05,-1.2e-05,-2.2e-05,-5e-06,-3e-06,1e-06,7e-06,-2e-06,5e-06,1.9e-05,6e-06,1e-06,-5e-06,-1.8e-05,5e-06,5e-06,-3e-06,1.4e-05,7.4e-05,-5e-06,6e-05,-0.000109,0.000338,0.000226,-0.000117,2.2e-05,6e-06,-1.8e-05,8e-06,3e-06,-5e-06,1.3e-05,-9e-06,1.2e-05,0,-0.000352,-9e-05,0.000481,0.000169,3.6e-05,1.9e-05,4e-06,-1e-05,-1.3e-05,1.2e-05,-1.6e-05,5.9e-05,8.6e-05,4.4e-05,-5.3e-05,-4.5e-05,-1.5e-05,9e-06,1.9e-05,2.9e-05,2.4e-05,-1e-05,-1.8e-05,4.4e-05,3e-05,9e-06,-0.000467,0.000431,-0.000219,-0.000123,-0.000103,-3.2e-05,-6e-06,4e-06,4e-06,3e-06,7e-06,-1.1e-05,2.2e-05,3.8e-05,-8e-06,-7e-06,-4e-06,1.9e-05,-0.000186,4e-06,-0.000144,2.9e-05,-5.9e-05,2.9e-05,-1.7e-05,1.1e-05,-4e-06,7e-06,-2.3e-05,-2e-06,1.4e-05,1.6e-05,-7e-06,-1e-05,-1.4e-05,-1e-06,-5.5e-05,2.2e-05,-4.6e-05,6e-05,4.8e-05,4e-05,-1.7e-05,-2.5e-05,-8e-06
-1.9e-05,7e-06,-1.1e-05,0,-1.2e-05,-5e-06,1.3e-05,-5e-06,-9e-06,3e-06,1.6e-05,-1.7e-05,2.4e-05,-2.4e-05,1e-05,-1.6e-05,1.7e-05,3.2e-05,6e-06,-1e-06,-3e-06,-4e-06,2e-06,4e-06,-2.5e-05,2e-06,-7e-06,-1.1e-05,1e-05,-1e-06,-5e-06,0,-1e-06,-9.2e-05,4e-06,-4.8e-05,9.4e-05,-0.000244,-0.000108,3e-05,-2.6e-05,-0.00011,-7e-06,-1.3e-05,1e-06,1e-05,0,-3e-06,1.3e-05,7e-06,0.000163,8.3e-05,-0.000309,-0.000309,-0.00014,-4.9e-05,-8e-06,-2.8e-05,-2.1e-05,-2e-05,-8e-06,3e-06,-2.5e-05,-5.3e-05,5.7e-05,-1.9e-05,2e-05,-1.2e-05,-2.2e-05,-2e-06,-7e-06,1.5e-05,-2.3e-05,-4.1e-05,0,-2.1e-05,0.00013,3.1e-05,-0.000228,-3.1e-05,4.2e-05,-8.7e-05,5e-06,-3.4e-05,2e-06,-5e-06,-8e-06,-1e-06,-1.1e-05,-2.7e-05,-1e-06,-3e-06,-1e-06,-6.5e-05,0.000459,2.2e-05,-2e-05,-3e-05,1.2e-05,2e-06,-1.8e-05,7e-06,-1.2e-05,-1.3e-05,3e-05,-2e-06,6e-06,-9e-06,2e-06,5e-06,1e-05,7e-06,2.2e-05,7e-06,3.8e-05,-2.2e-05,-5.7e-05,1.1e-05,1e-06,1.2e-05,1.2e-05
2e-05,-2e-06,0,1e-06,9e-06,-1e-06,-4e-06,2e-06,1e-06,-2e-06,-3e-06,2.1e-05,2.8e-05,-8e-06,-1.9e-05,1e-06,-2.2e-05,-2.2e-05,9e-06,-1e-05,5e-06,5e-06,9e-06,-7e-06,1.8e-05,-5e-06,6e-06,5e-06,-5e-06,8e-06,-2e-06,0,-2.5e-05,1.5e-05,1.8e-05,5.1e-05,-8.5e-05,0.000102,0.00017,-3.7e-05,3.2e-05,5.5e-05,2.4e-05,1.1e-05,-1e-06,-1.9e-05,-1.9e-05,6e-06,3e-06,0,0.000181,7.1e-05,-8.1e-05,0.000123,-3.6e-05,-6.8e-05,-8e-06,2.7e-05,-3.9e-05,1e-06,-9e-06,-3.3e-05,-9.5e-05,7.2e-05,1.7e-05,4.9e-05,-6e-06,-1.1e-05,-5e-06,-9e-06,1.1e-05,3e-06,4.6e-05,1.4e-05,-3e-06,1.6e-05,7e-05,0.00021,0.000657,0.000154,5.1e-05,-4.2e-05,5e-06,3.5e-05,1e-06,-1.6e-05,-5e-06,8e-06,4e-06,0,-2e-06,-3e-06,0,4e-06,-0.000306,-0.000139,7.9e-05,1e-05,-3.5e-05,-2e-06,2.4e-05,-7e-06,2.1e-05,-4e-06,-2e-05,3e-06,-4e-06,3.3e-05,9e-06,-3e-06,-8e-06,-1e-05,-2.3e-05,-1e-05,-1.8e-05,-3.9e-05,2.5e-05,-2.4e-05,-1.7e-05,2.3e-05,-2e-06
-2.4e-05,-2e-06,3e-06,-1.1e-05,2e-06,-5e-06,-2e-06,2e-06,3e-06,-1e-06,1e-06,-5e-06,-1.6e-05,3e-06,2.4e-05,-9e-06,4e-06,3e-06,-1e-06,1.3e-05,-5e-06,-7e-06,7e-06,3e-06,-1.2e-05,3e-06,0,-5e-06,8e-06,-3e-06,6e-06,1e-06,-1.8e-05,1.6e-05,-3e-06,-5.3e-05,0.000119,-2.1e-05,-0.000276,-1.8e-05,-1e-05,1.1e-05,-3e-06,-1.1e-05,1.2e-05,1.1e-05,1.7e-05,-4e-06,1.6e-05,-2e-06,-0.000383,-0.000184,8e-06,9.5e-05,-1.8e-05,8e-06,2.7e-05,2.1e-05,-1.9e-05,1e-05,-1.2e-05,-6e-06,6.9e-05,5.6e-05,-0.00011,-4.5e-05,-7e-05,1.8e-05,3.7e-05,-1e-06,1e-06,-3.9e-05,-4.8e-05,-2e-05,1e-05,9e-06,7.5e-05,-3.4e-05,-0.000325,-0.000143,2.2e-05,-1.9e-05,3.4e-05,-6.4e-05,-2.1e-05,4.6e-05,1e-06,4e-06,9e-06,5e-06,3e-06,1e-06,-1e-06,2e-05,1.5e-05,0.00017,-4e-06,3e-05,-1e-06,2.6e-05,-2.1e-05,1.2e-05,7e-06,8e-06,1e-05,-1.1e-05,-3e-06,-4e-06,-7e-06,5e-06,4e-06,0,5e-06,-2e-06,-3e-06,1.4e-05,-3e-06,-5e-06,2.8e-05,-6e-06,-2e-06
3.5e-05,-7e-06,5e-06,9e-06,-3e-06,1e-06,3e-06,-6e-06,2e-06,-1e-06,-1.3e-05,1.1e-05,9e-06,0,-2.4e-05,0,6e-06,-2e-06,-3e-06,-1.7e-05,5e-06,3e-06,-5e-06,1e-06,7e-06,-1e-06,4e-06,-1.7e-05,1e-06,-2e-06,1e-06,-5e-06,6e-06,-5e-06,1e-06,3.4e-05,-6.7e-05,-0.000101,3.3e-05,2.1e-05,5e-06,-1.8e-05,-1e-06,7e-06,5e-06,-4e-06,-3e-06,-6e-06,-2e-06,0,0.000158,0.000192,6.9e-05,-0.000319,-0.000137,6e-06,-1.1e-05,-4.3e-05,-2.3e-05,-1e-05,-3e-06,1.8e-05,-0.000137,-2.4e-05,5.7e-05,3.7e-05,5.3e-05,-1.9e-05,-4.3e-05,0,-3e-06,-6e-06,1.5e-05,-2.7e-05,-1e-05,-7e-06,-2e-06,-0.000189,0.000162,7.5e-05,-7.8e-05,-5e-06,2e-06,2e-06,-1.2e-05,-2.1e-05,-4e-06,2e-06,-1.9e-05,-3e-06,-4e-06,9e-06,-1e-06,6e-06,0.000101,-7.2e-05,-0.000119,-4.4e-05,-2.5e-05,-3.8e-05,5e-06,-6e-06,-1.3e-05,-1.7e-05,-4e-06,8e-06,-7e-06,2e-06,3e-06,-3e-06,-4e-06,-4e-06,9e-06,6e-06,9e-06,2.7e-05,-4.1e-05,7e-06,-3.9e-05,5e-06,7e-06
-2.4e-05,-3e-06,0,9e-06,-6e-06,-2e-06,-1e-06,-1e-06,1e-06,3e-06,-3e-06,-6e-06,-1e-06,8e-06,7e-06,-5e-06,-1.5e-05,-4e-06,1e-06,1.2e-05,-5e-06,-4e-06,-8e-06,-1e-06,-1e-06,1e-06,-2e-06,3e-06,-7e-06,2e-06,1e-06,6e-06,1.2e-05,-7e-06,8e-06,-1.2e-05,-2e-05,1e-04,-0.000118,-3.9e-05,-6e-06,-2.3e-05,-4e-06,-5e-06,-1e-05,1e-06,-2e-06,2e-06,9e-06,-3e-06,0.000108,-0.00013,-0.00018,0.000242,-2.1e-05,-9e-06,2.1e-05,4.5e-05,-5e-06,3e-06,-1e-06,7e-06,0.000177,-1.3e-05,-0.000112,-4.9e-05,-1.5e-05,1.6e-05,3e-05,-1.4e-05,1e-06,-1.5e-05,2.6e-05,2.9e-05,-2e-06,1.2e-05,-0.000112,-7.4e-05,-0.000225,-6.5e-05,2.3e-05,2.6e-05,0,-2.6e-05,-1e-06,1.4e-05,1.1e-05,0,1.8e-05,0,-2e-06,-2e-06,-1e-06,-7e-06,-9.3e-05,-5.4e-05,0.000135,4.3e-05,2.9e-05,2.7e-05,-4e-06,8e-06,-8e-06,1.7e-05,-1.1e-05,-2e-06,2e-06,1.4e-05,-4e-06,-1.1e-05,4e-06,-8e-06,1.7e-05,2e-06,-1.5e-05,-5e-06,3.6e-05,1.5e-05,-3e-06,5e-06,-1.3e-05
6e-06,-4e-06,1e-06,-6e-06,7e-06,-3e-06,2e-06,-1e-06,-6e-06,0,-2e-06,-5e-06,-6e-06,2e-06,-2e-06,8e-06,8e-06,1.8e-05,-6e-06,-1.2e-05,4e-06,0,0,0,-4e-06,1e-06,2e-06,0,-1e-06,-3e-06,3e-06,-5e-06,1e-06,2.6e-05,-1e-05,5e-06,6.7e-05,-1.4e-05,5.1e-05,2e-05,1e-06,-8e-06,-8e-06,4e-06,-5e-06,-4e-06,6e-06,-1.4e-05,-1e-06,-2e-06,-0.000247,7.5e-05,0.000114,-6.5e-05,-6.4e-05,-1.4e-05,-1.2e-05,-2.6e-05,-2.7e-05,0,1e-06,-1.2e-05,-0.000109,2.7e-05,6.6e-05,4.3e-05,-1.2e-05,-2.7e-05,-7e-06,-6e-06,1.6e-05,-6e-06,-4.1e-05,-2.1e-05,0,-8e-06,0.000279,-0.000102,0.000175,-4.5e-05,2e-06,-1.8e-05,4.5e-05,3e-06,-2e-06,-1.5e-05,-3e-06,1e-06,-1.8e-05,-1.1e-05,2e-06,-5e-06,-1e-06,1.3e-05,7.1e-05,4.1e-05,-6.5e-05,-4.2e-05,-2.8e-05,-2.9e-05,-3e-06,-5e-06,1e-05,-7e-06,2e-05,-9e-06,-5e-06,-7e-06,2e-06,1e-06,-3e-06,0,-1.5e-05,1e-06,9e-06,-1.2e-05,-1.6e-05,-1.3e-05,1.5e-05,0,0
-1.2e-05,-3e-06,0,-2e-06,2e-06,3e-06,-4e-06,1e-06,0,1e-06,5e-06,1e-06,1e-05,2e-06,-5e-06,5e-06,-6e-06,-1.4e-05,-5e-06,5e-06,-3e-06,-1e-06,6e-06,1e-06,9e-06,-1e-06,-2e-06,-9e-06,2e-06,4e-06,-3e-06,7e-06,-6e-06,0,-5e-06,-8e-06,-5.7e-05,-0.000139,0.000156,-1.5e-05,-2e-06,1.7e-05,8e-06,-3e-06,3e-06,0,-1e-05,-7e-06,5e-06,1e-06,0.000215,-7e-06,-0.000112,3.4e-05,-2.5e-05,-1.2e-05,1e-06,0,-5e-06,-2e-06,-2e-06,-9e-06,0.000137,-4.8e-05,-1e-05,-3.1e-05,1.4e-05,2.5e-05,-2e-06,1.7e-05,-5e-06,-2e-06,1.8e-05,3.1e-05,-4e-06,-6e-06,0.00012,0.000126,-0.000101,2.8e-05,3.7e-05,-7e-06,3e-06,5e-06,1e-06,1.1e-05,5e-06,-4e-06,1.4e-05,5e-06,-8e-06,1e-06,-1e-06,1.4e-05,3e-06,1.5e-05,4e-06,3.1e-05,-1.7e-05,1.6e-05,-6e-06,7e-06,-3e-06,-5e-06,-1.9e-05,9e-06,2e-06,7e-06,-3e-06,-2e-06,2e-06,-2e-06,-1e-05,-1e-05,-6e-06,-1.7e-05,3.3e-05,4e-06,-3e-06,6e-06,-4e-06
1.5e-05,-1e-06,1e-06,8e-06,-8e-06,-4e-06,2e-06,-1e-06,4e-06,-1e-06,5e-06,-2e-06,-5e-06,-2e-06,1.4e-05,2e-06,-2e-06,1e-05,6e-06,-3e-06,1e-06,4e-06,4e-06,-2e-06,-1e-05,1e-06,0,6e-06,3e-06,-2e-06,-1e-06,-8e-06,3e-06,-2.8e-05,1e-06,5e-06,4.4e-05,8.3e-05,1.4e-05,6.2e-05,0,-9e-06,-5e-06,4e-06,4e-06,2e-06,3e-06,-2e-06,-2e-06,0,-5e-06,-4.4e-05,7.7e-05,6.7e-05,2.9e-05,-2.6e-05,-1.2e-05,7e-06,-1e-05,-3e-06,3e-06,-1e-06,-0.000119,-2.3e-05,-1.7e-05,2.1e-05,-3.2e-05,-1.2e-05,3e-06,1e-06,4e-06,4e-06,-2.3e-05,-2.3e-05,1e-05,9e-06,-0.000183,7.3e-05,0.000118,-3.8e-05,-5.4e-05,-4.7e-05,-4e-06,-1.3e-05,-4e-06,-8e-06,-7e-06,-2e-06,0,-3e-06,4e-06,0,0,-1.1e-05,8.2e-05,2.8e-05,-9e-06,-2.5e-05,8e-06,3e-06,8e-06,-5e-06,3e-06,-2e-06,2.2e-05,-7e-06,-3e-06,9e-06,4e-06,-5e-06,-1e-06,6e-06,1.7e-05,4e-06,7e-06,3.4e-05,-2.5e-05,3e-06,1.2e-05,-1.1e-05,-1e-06
-1e-06,0,-2e-06,-4e-06,7e-06,4e-06,1e-06,0,-1e-06,-1e-06,3e-06,5e-06,-1e-06,-1e-06,-1.4e-05,-2e-06,3e-06,-1.7e-05,1e-06,-1e-06,-1e-06,-1e-06,-1e-06,1e-06,7e-06,-2e-06,-2e-06,-2e-06,-3e-06,1e-06,1e-06,6e-06,8e-06,2.3e-05,3e-06,-2e-06,-4e-05,5.2e-05,4.5e-05,-7.6e-05,-2e-06,1.5e-05,5e-06,-2e-06,-4e-06,-3e-06,1e-06,2e-06,2e-06,0,-0.000183,-1.9e-05,-4e-05,-0.00013,4.5e-05,-2e-05,-1e-06,0,-2.1e-05,2e-06,0,6e-06,3.9e-05,8.9e-05,4e-06,-2.1e-05,1.2e-05,1.1e-05,-8e-06,-1e-06,3e-06,-6e-06,-2e-06,6e-06,-8e-06,-1.2e-05,0.000102,0.000135,-3.2e-05,1.4e-05,2.7e-05,-1.8e-05,1.9e-05,1e-05,4e-06,1.6e-05,-4e-06,0,-9e-06,-4e-06,-2e-06,3e-06,0,-6e-06,-0.000117,-3.1e-05,-1.3e-05,1.1e-05,-2.2e-05,-1.4e-05,-7e-06,6e-06,-9e-06,-5e-06,-2.2e-05,2e-06,-1e-06,-1e-05,1e-06,0,0,-3e-06,-1.4e-05,2e-06,-1e-05,-2e-06,2e-05,-8e-06,-2.9e-05,1.4e-05,-2e-06
-3e-06,0,0,-2e-06,-4e-06,-2e-06,-5e-06,-1e-06,-1e-06,0,0,-2e-06,7e-06,0,7e-06,1e-06,-8e-06,8e-06,0,-1e-06,2e-06,-1e-06,-3e-06,1e-06,-5e-06,1e-06,-1e-06,-3e-06,-2e-06,0,0,-5e-06,3e-06,-1.6e-05,5e-06,3e-06,1.9e-05,-9.5e-05,1.1e-05,5.8e-05,1.7e-05,-6e-06,3e-06,-1e-06,0,3e-06,0,-5e-06,-1e-06,1e-06,0.00018,0.000108,1.5e-05,4.5e-05,7.3e-05,-2.8e-05,2e-06,-5e-06,-8e-06,-2e-06,-2e-06,8e-06,-6.6e-05,4.9e-05,-2.1e-05,1.9e-05,-1e-06,-1.2e-05,1.4e-05,-1e-06,2e-06,3e-06,8e-06,3e-06,-5e-06,2e-06,7.6e-05,2.6e-05,-4e-05,1.5e-05,7e-06,-1.3e-05,1.3e-05,-1.5e-05,-3e-06,-2.2e-05,7e-06,0,1.3e-05,4e-06,-3e-06,-1e-06,0,1e-06,3.1e-05,-2.6e-05,-2.3e-05,9e-06,-5e-06,1.7e-05,-4e-06,-6e-06,9e-06,1.1e-05,9e-06,-2e-06,-5e-06,1.3e-05,-3e-06,4e-06,1e-06,1e-06,1e-06,4e-06,1e-06,-6e-06,-1.9e-05,0,7e-06,-1.3e-05,-4e-06
-1e-06,1e-06,0,0,0,1e-06,2e-06,0,-2e-06,0,-3e-06,4e-06,5e-06,-2e-06,-3e-06,-4e-06,2e-06,1e-06,4e-06,4e-06,-1e-06,0,-1e-06,-2e-06,3e-06,-1e-06,0,7e-06,1e-06,0,1e-06,4e-06,-6e-06,3e-06,3e-06,-4e-06,2e-05,8.1e-05,-0.000121,-4.8e-05,-2e-05,-2.7e-05,-5e-06,0,3e-06,-5e-06,1e-06,2e-06,0,0,-5.8e-05,-9.9e-05,1e-06,-4.6e-05,2.3e-05,-3e-06,-2e-06,4e-06,-1.7e-05,0,0,-5e-06,3.9e-05,-5.8e-05,8.5e-05,-1.5e-05,-1.5e-05,5e-06,-1.3e-05,5e-06,3e-06,-1.8e-05,-2.6e-05,-2.9e-05,7e-06,6e-06,-3.2e-05,0,-0.000123,-2e-06,-3e-06,-2e-06,-1e-06,1.6e-05,-1e-06,1.5e-05,1e-06,2e-06,-1.3e-05,-3e-06,2e-06,-1e-06,0,2e-06,0.000115,2.5e-05,3.6e-05,-2.3e-05,6e-06,-1.7e-05,0,6e-06,3e-06,1e-06,5e-06,2e-06,2e-06,-2e-06,1e-06,-5e-06,-2e-06,-3e-06,-4e-06,-4e-06,1e-06,-1.3e-05,7e-06,3e-06,9e-06,1.3e-05,-5e-06
-7e-06,0,1e-06,2e-06,5e-06,-2e-06,3e-06,0,2e-06,1e-06,-3e-06,-4e-06,-3e-06,-2e-06,-5e-06,-3e-06,-1e-06,3e-06,0,-7e-06,0,-1e-06,0,-1e-06,-2e-06,2e-06,1e-06,1e-06,1e-06,1e-06,0,-2e-06,-6e-06,1.3e-05,1e-06,4e-06,-3.9e-05,-1.2e-05,-2.8e-05,1e-05,1.1e-05,1e-05,-3e-06,0,0,5e-06,-3e-06,-1e-06,1e-06,0,-9.4e-05,8.4e-05,-2.5e-05,8.1e-05,4.4e-05,7e-06,1.1e-05,0,-5e-06,0,-2e-06,-1e-05,1.4e-05,-1.2e-05,-2.5e-05,1.6e-05,2e-05,-2e-06,2e-06,-2e-06,5e-06,-7e-06,1.5e-05,2.3e-05,-8e-06,-9e-06,-1.5e-05,-7e-05,0.000139,-2.4e-05,-2.3e-05,1.2e-05,7e-06,3e-06,-3e-06,-3e-06,-1e-06,3e-06,1e-05,-5e-06,-3e-06,-1e-06,0,-9e-06,-0.000167,2.1e-05,-2e-06,3.2e-05,-1.2e-05,1.7e-05,-1e-06,-5e-06,-5e-06,-1e-05,-6e-06,-3e-06,1e-06,-1e-06,-3e-06,3e-06,2e-06,-2e-06,1.6e-05,2e-06,1e-06,9e-06,-2.5e-05,8e-06,-5e-06,-1.2e-05,2e-06
1.4e-05,0,-2e-06,-7e-06,-6e-06,-1e-06,-2e-06,-1e-06,3e-06,0,-5e-06,-1e-06,3e-06,-3e-06,9e-06,-3e-06,-5e-06,3e-06,-3e-06,6e-06,0,3e-06,1e-06,2e-06,-1e-06,-1e-06,0,-2e-06,0,-3e-06,1e-06,1e-06,1e-06,-4e-06,1e-06,-4e-06,3.4e-05,-3.7e-05,-6e-05,-1e-05,-1e-06,1.7e-05,5e-06,0,-1e-06,-2e-06,-1e-06,-2e-06,-1e-06,0,0.000178,-6.6e-05,-0.000129,-7.9e-05,5.5e-05,-1.4e-05,-7e-06,-9e-06,-1.6e-05,-1e-06,0,1e-06,9e-06,3.1e-05,-3e-06,-1.5e-05,-1.8e-05,4e-06,1e-05,-8e-06,3e-06,-1e-06,2e-06,-1.7e-05,6e-06,7e-06,-0.000102,-5.5e-05,-8.9e-05,2.6e-05,7e-06,-4e-06,2e-05,-6e-06,-4e-06,6e-06,-5e-06,1e-06,-5e-06,9e-06,1e-06,0,0,1e-06,9.6e-05,-3e-05,-2.3e-05,-2.8e-05,-2e-06,-1.1e-05,2e-06,4e-06,-6e-06,2e-06,-2e-06,-1e-06,-1e-06,6e-06,3e-06,-3e-06,-2e-06,-1e-06,-9e-06,1e-06,0,1.1e-05,2e-05,-2e-06,-1.5e-05,5e-06,-2e-06
-1.2e-05,0,0,4e-06,1e-06,2e-06,2e-06,1e-06,-3e-06,0,1e-06,1e-06,-4e-06,0,-9e-06,1e-06,3e-06,-1.1e-05,0,-4e-06,1e-06,-4e-06,4e-06,-1e-06,4e-06,0,1e-06,6e-06,-2e-06,1e-06,-2e-06,-1e-06,3e-06,-5e-06,-2e-06,3e-06,-2.3e-05,7.8e-05,6.3e-05,1.9e-05,-7e-06,-1e-06,-1e-06,0,0,1e-06,1e-06,-3e-06,1e-06,0,-0.00012,1e-06,0.000113,3.2e-05,-1.9e-05,-1.8e-05,1.2e-05,1.5e-05,-6e-06,2e-06,-1e-06,9e-06,1.1e-05,-2e-05,9e-06,5e-06,-1.6e-05,-2e-06,-1e-05,1e-06,-2e-06,-3e-06,-1.6e-05,1.5e-05,3e-06,2e-06,1.3e-05,-8e-06,0.000179,-3.2e-05,1.7e-05,0,5e-06,1.3e-05,3e-06,-1.2e-05,3e-06,-2e-06,-2e-06,-8e-06,-1e-06,1e-06,0,5e-06,2.5e-05,1.7e-05,-1.7e-05,1.8e-05,1e-06,4e-06,-3e-06,-3e-06,7e-06,5e-06,6e-06,4e-06,-3e-06,-3e-06,1e-06,2e-06,1e-06,-2e-06,2e-06,1e-06,1e-06,-7e-06,-4e-06,-1.2e-05,6e-06,-1e-06,0
7e-06,0,0,-1e-06,5e-06,-2e-06,-1e-06,1e-06,-1e-06,0,1e-06,0,-1e-06,1e-06,6e-06,2e-06,-5e-06,5e-06,0,1e-06,-1e-06,4e-06,2e-06,0,-7e-06,2e-06,1e-06,2e-06,3e-06,-1e-06,0,1e-06,-1e-06,-3e-06,-6e-06,-3e-06,1.3e-05,-3.7e-05,7.2e-05,-2e-05,6e-06,-2.2e-05,-3e-06,0,0,-4e-06,2e-06,0,-2e-06,0,-4.7e-05,2.1e-05,7.1e-05,7.4e-05,8.7e-05,-7e-06,-8e-06,-9e-06,-9e-06,-3e-06,0,1e-06,-3.2e-05,-1.5e-05,-5e-06,1e-06,2.2e-05,-4e-06,2e-06,2e-06,6e-06,-6e-06,1.2e-05,2e-06,-9e-06,-7e-06,4.5e-05,3.1e-05,8.3e-05,1.3e-05,-8e-06,-2.9e-05,-5e-06,-9e-06,-2e-06,1.2e-05,3e-06,-1e-06,8e-06,2e-06,0,0,0,2e-06,-0.000108,0,3.4e-05,-7e-06,-1.7e-05,5e-06,0,4e-06,3e-06,-2e-06,-4e-06,-5e-06,-1e-06,0,-4e-06,-3e-06,-1e-06,2e-06,-6e-06,-1e-06,2e-06,-1.1e-05,3e-06,1.1e-05,5e-06,0,-2e-06
-8e-06,1e-06,1e-06,5e-06,-5e-06,1e-06,1e-06,-1e-06,1e-06,0,4e-06,1e-06,5e-06,1e-06,-3e-06,1e-06,0,-7e-06,-1e-06,-2e-06,0,-4e-06,-2e-06,0,7e-06,-3e-06,0,-1e-06,0,1e-06,0,-1e-06,-4e-06,1e-05,0,3e-06,0,-4.1e-05,-5e-06,4.6e-05,-1e-06,0,9e-06,-1e-06,-2e-06,2e-06,-1e-06,-5e-06,0,0,0.00016,7e-06,-2e-05,-0.000105,4e-06,-1.8e-05,4e-06,-3e-06,-8e-06,3e-06,0,-1e-05,1.2e-05,3.6e-05,-1e-05,0,-2e-05,6e-06,1e-06,0,1e-06,6e-06,-1.2e-05,-1.6e-05,6e-06,8e-06,-0.00014,6e-05,-8.6e-05,3.2e-05,-2e-06,-1.4e-05,1.4e-05,2.3e-05,2e-06,-1.2e-05,-2e-06,0,-1.1e-05,-1e-06,-1e-06,-1e-06,0,-4e-06,6.2e-05,-7e-06,-2.4e-05,-1e-06,5e-06,-1.6e-05,-4e-06,-4e-06,2e-06,-3e-06,3e-06,2e-06,0,2e-06,3e-06,1e-06,0,-1e-06,-1e-06,-1e-06,-3e-06,6e-06,5e-06,1e-06,1e-06,-4e-06,-1e-06
1e-05,0,0,-5e-06,0,-2e-06,0,0,1e-06,0,2e-06,1e-06,-4e-06,1e-06,-4e-06,1e-06,-1e-06,1.2e-05,0,1e-06,0,1e-06,-5e-06,0,-5e-06,3e-06,-1e-06,4e-06,-1e-06,0,-1e-06,1e-06,0,-1.7e-05,2e-06,-2e-06,-1.5e-05,5.2e-05,3.6e-05,-7.1e-05,5e-06,5e-06,-7e-06,0,0,1e-06,0,-1e-06,-1e-06,0,-0.000136,-2.6e-05,-2.1e-05,6.1e-05,5.2e-05,-2.2e-05,-5e-06,6e-06,-1e-05,-2e-06,0,-3e-06,-2.9e-05,6e-06,-3.6e-05,3e-06,5e-06,-2e-06,3e-06,2e-06,4e-06,-6e-06,-4e-06,2.3e-05,0,-4e-06,4e-06,3.5e-05,-4.5e-05,-4.2e-05,-4e-06,-1.6e-05,5e-06,-1.6e-05,-3e-06,1.1e-05,0,-1e-06,1.2e-05,0,-2e-06,0,0,2e-06,1.8e-05,-1.1e-05,3.2e-05,3e-06,-8e-06,1.1e-05,2e-06,4e-06,-9e-06,4e-06,-4e-06,0,-2e-06,-3e-06,-1e-06,-1e-06,0,1e-06,1e-06,2e-06,2e-06,1e-05,-2e-06,-8e-06,-1.7e-05,3e-06,0
-8e-06,0,1e-06,5e-06,3e-06,2e-06,-2e-06,0,0,0,0,0,2e-06,2e-06,4e-06,0,-3e-06,-3e-06,1e-06,-3e-06,0,-2e-06,-2e-06,-1e-06,3e-06,-1e-06,-1e-06,-1e-06,-1e-06,0,1e-06,-1e-06,4e-06,1.3e-05,1e-06,1e-06,2.3e-05,-1.9e-05,-2.3e-05,7.7e-05,-6e-06,-1e-06,0,0,2e-06,-1e-06,-2e-06,2e-06,0,0,-1e-06,4.3e-05,0,-7.2e-05,-3.5e-05,-5e-06,0,2e-06,-9e-06,-1e-06,0,8e-06,2.5e-05,-4.2e-05,2.2e-05,-8e-06,0,3e-06,-8e-06,0,1e-06,-2e-06,3e-06,-2.6e-05,-2e-06,-4e-06,3.9e-05,1.1e-05,-0.000129,3.7e-05,1.5e-05,1e-06,1e-06,1.3e-05,1e-06,-1e-05,-3e-06,-1e-06,-1.1e-05,1e-06,1e-06,-1e-06,0,2e-06,-3.2e-05,3.4e-05,-4.7e-05,-1e-06,-1e-06,-7e-06,-1e-06,-4e-06,3e-06,1e-06,3e-06,0,0,3e-06,1e-06,0,0,-1e-06,1e-06,2e-06,0,-2e-06,5e-06,2e-06,1e-05,-3e-06,-1e-06
3e-06,0,0,-5e-06,-1e-06,-1e-06,2e-06,0,-3e-06,0,-1e-06,-1e-06,2e-06,1e-06,-5e-06,0,0,0,0,2e-06,0,1e-06,3e-06,1e-06,-1e-06,1e-06,-1e-06,-3e-06,2e-06,-1e-06,1e-06,2e-06,3e-06,2e-06,2e-06,-1e-06,-1.7e-05,-3.4e-05,-5.1e-05,-8.1e-05,2e-06,8e-06,3e-06,0,0,0,0,0,-1e-06,0,0.00013,-7.2e-05,-3.1e-05,5.7e-05,-7e-06,2e-06,0,-9e-06,-1e-05,2e-06,0,5e-06,-1.2e-05,1.8e-05,0,9e-06,-1.4e-05,-6e-06,6e-06,3e-06,4e-06,-8e-06,-1.8e-05,1.2e-05,8e-06,7e-06,-5.5e-05,-1.3e-05,0.000115,-1.3e-05,-1.2e-05,7e-06,5e-06,-9e-06,-1e-06,8e-06,3e-06,2e-06,6e-06,-4e-06,-3e-06,1e-06,0,-2e-06,-4.1e-05,-1.8e-05,1.1e-05,-3e-06,-7e-06,8e-06,2e-06,3e-06,4e-06,-3e-06,4e-06,-1e-06,-1e-06,-3e-06,-1e-06,-1e-06,0,-1e-06,2e-06,-3e-06,1e-06,-1.1e-05,-1.6e-05,3e-06,-4e-06,3e-06,2e-06
-4e-06,0,0,7e-06,-2e-06,0,-1e-06,0,1e-06,0,-3e-06,-1e-06,-1e-06,-1e-06,4e-06,0,-2e-06,-2e-06,0,-3e-06,0,2e-06,4e-06,-1e-06,-1e-06,0,0,4e-06,0,-1e-06,-2e-06,-2e-06,-2e-06,-1e-05,2e-06,1e-06,7e-06,4.3e-05,-4.7e-05,5e-05,0,-1e-06,-4e-06,0,-1e-06,-1e-06,2e-06,-2e-06,0,0,-0.000143,5.7e-05,-1.4e-05,2.4e-05,-3.2e-05,-3e-06,-2e-06,1e-05,-7e-06,-3e-06,0,-4e-06,3e-05,3.4e-05,-1.6e-05,-6e-06,7e-06,5e-06,3e-06,-2e-06,0,-8e-06,4e-06,-5e-06,-9e-06,-7e-06,5e-05,-2.4e-05,-8.5e-05,-9e-06,4e-06,0,8e-06,0,-2e-06,-7e-06,1e-06,2e-06,0,4e-06,1e-06,0,0,-2e-06,8e-05,-1e-06,8e-06,9e-06,2e-06,-1e-06,-5e-06,-3e-06,0,0,-7e-06,0,0,2e-06,0,-3e-06,-1e-06,-1e-06,-3e-06,-2e-06,-2e-06,2e-06,9e-06,3e-06,9e-06,-6e-06,-1e-06
7e-06,0,-1e-06,-7e-06,1e-06,0,-1e-06,-1e-06,2e-06,0,0,0,1e-06,-2e-06,0,-1e-06,-1e-06,-6e-06,0,2e-06,0,-3e-06,1e-06,1e-06,3e-06,0,0,-2e-06,-2e-06,2e-06,0,2e-06,-3e-06,1.2e-05,0,0,3e-06,-1.9e-05,-1e-05,-2.8e-05,-2e-06,-1.8e-05,2e-06,0,0,3e-06,0,-1e-06,0,0,3.9e-05,-9e-06,4.4e-05,-7.2e-05,-6.4e-05,-1.4e-05,4e-06,-6e-06,-1.2e-05,1e-06,0,-6e-06,-1.5e-05,-2e-05,6e-06,5e-06,-2e-06,-2e-06,-6e-06,-3e-06,6e-06,-3e-06,0,-7e-06,-1e-06,1e-06,8e-06,-8e-06,9.2e-05,2e-05,-1e-06,-1e-06,4e-06,7e-06,0,1e-05,-1e-06,-1e-06,-6e-06,-2e-06,0,0,0,3e-06,-2.9e-05,-1.1e-05,7e-06,-1.4e-05,0,-1e-06,2e-06,3e-06,-7e-06,4e-06,7e-06,1e-06,-3e-06,-1e-06,2e-06,3e-06,1e-06,-1e-06,1e-05,4e-06,-1e-06,1.2e-05,-1e-05,-4e-06,-1.6e-05,8e-06,1e-06
-3e-06,0,0,5e-06,1e-06,-1e-06,1e-06,1e-06,-1e-06,0,1e-06,2e-06,1e-06,-1e-06,-3e-06,-1e-06,0,7e-06,0,-2e-06,0,3e-06,-2e-06,0,-4e-06,0,0,-3e-06,0,-1e-06,1e-06,-2e-06,0,-4e-06,-2e-06,0,-1e-05,-2.2e-05,4e-05,1.2e-05,-3e-06,1e-06,0,0,0,-3e-06,-1e-06,0,0,0,8.5e-05,-2e-06,-8e-06,5.8e-05,1e-06,-1.5e-05,-5e-06,-9e-06,-4e-06,1e-06,0,1e-06,1e-05,-1.8e-05,1e-05,-8e-06,-1.5e-05,3e-06,3e-06,1e-06,1e-06,3e-06,-9e-06,2e-05,5e-06,6e-06,-1.2e-05,2.1e-05,-1.4e-05,-1e-05,6e-06,-1.9e-05,0,-9e-06,-2e-06,-1.1e-05,0,-2e-06,1.1e-05,-2e-06,-3e-06,0,0,1e-06,-6.6e-05,1.4e-05,-3e-06,1.9e-05,-1.6e-05,8e-06,-1e-06,-4e-06,3e-06,0,-9e-06,-2e-06,1e-06,-2e-06,-2e-06,-4e-06,-1e-06,1e-06,-7e-06,0,1e-06,-2e-06,1.7e-05,-2e-06,-1e-06,-1.1e-05,0
