4.5e-05,0.000182,0.000119,8.4e-05,0.000136,-2.9e-05,7.2e-05,8.8e-05,0.000201,0.00032,0.000209,0.00031,0.000704,0.000358,0.000258,0.000265,0.000201,0.000282,0.000398,-0.001638,-0.001002,-0.000304,-0.000415,-0.000447,-0.00293,-0.003908,-0.003872,-0.004837,0.003882,-0.013402,-0.018154,-0.020684,-0.009749,-0.022399,-0.016447,-0.011419,-0.014469,-0.018809,-0.019655,-0.018163,-0.020334,-0.018739,-0.017469,-0.016636,-0.014326,-0.010553,-0.01107,-0.012096,-0.017527,-0.018484,-0.025706,-0.025585,-0.014954,-0.008483,-0.023158,-0.01108,-0.01395,-0.013548,-0.009977,-0.010389,-0.010962,-0.009008,-0.009104,-0.008089,-0.008528,-0.004876,-0.004351,-0.006367,-0.00573,-0.004306,-0.001544,-0.00199,-0.002912,-0.002201,-0.001229,-0.001669,-0.000997,-0.000708,-0.000825,-0.001675,-0.000438,-0.000321,-0.000364,-0.000748,-0.000958,-0.001281,-0.001045,-0.001935,-0.001581,-0.000762,0.0034,-0.004582,-0.003875,-0.000611,0.000516,0.001431,0.001212,0.001557,0.000683,0.000383,-3.2e-05,-0.000248,-0.000265,-0.000166,-3.4e-05,-0.002585,-0.001937,-0.001464,-0.000112,-0.001353,-0.001901,-0.000746,-0.001621,-0.000853,-0.000402,0.000404,0.000307,0.000384,0.000228,0.00032,0.000203
0.000158,1.4e-05,2.1e-05,0.000224,0.000157,0.000274,6e-06,-6.6e-05,-2.5e-05,0.00018,0.000181,0.000317,0.000335,0.000149,0.000233,0.000169,2.9e-05,0.000186,-0.000594,-0.000298,-0.000342,-9.3e-05,0.000387,0.000225,0.001422,-0.000129,-0.000345,0.000221,-0.003687,-0.004363,-0.01202,0.002401,-0.000251,0.000205,8e-05,0.002792,0.013589,0.002725,0.010643,0.009278,0.005304,0.000238,0.001477,0.005862,0.006995,-0.001401,-0.003925,-0.004169,-0.000474,0.004269,0.016185,0.010978,0.002138,0.001435,0.006802,0.001144,-0.000656,0.00808,0.000481,-0.002082,0.00234,0.000283,-0.000227,-0.002011,-0.003532,-0.001082,-1.5e-05,0.001283,0.003075,0.001532,-0.000329,0.000168,-0.000467,0.000591,0.001254,0.000497,5.3e-05,0.000206,0.000106,0.000456,0.000228,6.1e-05,0.000316,0.000157,4.9e-05,-2.8e-05,0.000124,0.000764,0.001402,0.000377,0.000129,-0.002701,-0.001286,0.000705,0.000601,0.001209,-0.00114,0.000345,0.000443,0.000155,0.000391,3e-04,0.000238,1.1e-05,0.000359,-0.00016,-0.000345,0.000217,0.000204,0.000217,0.001115,0.000194,5.3e-05,0.000768,-0.000159,0.000662,0.000556,0.000259,3.3e-05,0.000506,0.000436
2.8e-05,-0.000235,-4e-06,2.4e-05,-0.00015,-0.000106,-7.7e-05,-0.000161,-0.000105,7.6e-05,1.9e-05,5.3e-05,-4.1e-05,-4.8e-05,1e-05,-0.000288,-0.00016,-2.1e-05,-0.000248,0.000269,0.000521,0.000278,-0.000182,0.000225,-0.000679,4.1e-05,0.000378,0.00247,0.001663,0.003213,0.007006,0.009776,0.004967,0.005605,-0.004982,-0.000892,-0.00644,-0.001302,-0.01714,-0.000543,0.003025,-0.002538,-0.005495,-0.006613,-0.003112,-0.002254,-0.004708,-0.002085,-0.00213,-0.006685,-0.00286,-0.013183,-0.003459,0.000479,-0.00699,-0.006396,-0.009625,-0.0089,0.001114,-0.002349,-0.007326,-0.000848,-0.003257,-0.004824,0.000532,-0.001781,-0.000972,-0.002074,-0.004512,-0.002348,-0.001163,-0.001366,0.00023,-0.000232,-0.000223,-0.000763,0.000746,-0.00012,-0.000117,-1e-04,-0.000962,-0.000443,-0.000141,-7.8e-05,-7.5e-05,-0.0014,-0.000788,-0.000602,-0.000511,-0.000546,-0.000276,0.001332,0.002531,0.001164,0.000366,0.000667,0.000259,0.000482,0.000424,0.00015,-0.000288,-0.000153,0.000445,0.000745,0.000329,1.4e-05,0.000395,-0.000185,-0.000642,-0.000201,-0.000438,-0.000738,-0.000333,-0.000304,-0.001432,-0.001612,-0.000724,-0.000385,9e-06,0.000139,8.1e-05
4.2e-05,-0.000135,-7.6e-05,-6.3e-05,-7.8e-05,1.4e-05,5.8e-05,4e-06,-0.000117,9.7e-05,4.7e-05,6.8e-05,-3.8e-05,5.2e-05,0.000202,-0.000108,-2.5e-05,4.6e-05,-0.000293,-0.00234,-0.001191,-0.000502,-0.000218,-5.9e-05,-0.000216,-0.002295,-0.000248,-0.00093,-0.004524,-0.001768,-0.00019,0.003613,-5.7e-05,-0.004885,0.003817,0.004165,0.004264,-0.000586,-0.001195,-0.003868,-0.00291,0.005357,0.004137,0.008428,0.005917,0.001292,0.002384,0.006074,-0.00029,-7.5e-05,-0.000681,0.00574,0.00616,-0.002255,0.003566,0.006906,0.005533,0.002964,0.002788,0.00194,0.003968,0.000562,0.001329,0.0048,0.001303,0.002918,0.000624,0.001775,0.002055,-0.000157,0.000922,0.001264,0.000657,-8.1e-05,-0.000522,0.00057,6e-05,-6.5e-05,-0.000408,-5.4e-05,-0.000681,-0.000343,7.1e-05,-0.000293,5.7e-05,0.000747,0.000354,0.000241,0.000278,0.00028,-0.000392,0.001297,0.000998,9.7e-05,0.000551,0.000646,0.000872,4e-06,0.000196,0.000259,5.8e-05,0.000143,-0.000186,-2.6e-05,-0.000336,0.000175,-0.000854,-0.000481,-0.000139,4.3e-05,0.000273,0.000104,4.3e-05,0.000112,-0.000622,-0.001433,-0.000635,-7.8e-05,3.3e-05,-1.8e-05,-0.000138
2e-05,-2e-06,0,-5.3e-05,-3.6e-05,0.000138,5.8e-05,5.6e-05,2e-06,0.000156,-1e-04,7.8e-05,5.4e-05,-2e-05,0.000139,4e-05,0.000151,0.000139,-5e-05,0.001237,0.001223,0.000837,0,1.6e-05,0.000384,-0.000473,0.001555,-0.001151,-0.002182,0.004137,-0.00361,-0.005564,-0.005358,-0.001208,-0.004076,-0.002855,-0.002395,0.002235,-0.001851,0.002614,-0.004258,-0.007093,0.000996,-0.006799,8.2e-05,0.000954,-0.003277,1.3e-05,0.001966,0.004294,-0.001677,-0.003041,-0.003843,-0.001417,0.001389,-0.00477,-0.003671,-0.000119,-0.001898,0.002533,0.000994,0.000116,-2e-06,-0.000626,-0.001997,-0.002926,-0.000924,-0.000294,-0.001098,0.000742,4e-05,-0.000684,-0.001094,0.000217,-0.000617,-7.5e-05,-0.000188,-0.000231,-3.6e-05,-0.000103,-0.000103,5.5e-05,7.3e-05,-0.000292,0.000171,-0.000239,0.000159,-0.000267,-0.000237,6.8e-05,0.000363,0.000185,-3.9e-05,-0.000387,8.9e-05,0.000365,0.000555,0.000245,0.000377,0.000139,0.000358,-0.000133,-4.7e-05,0.000207,0.000594,-0.000342,0.000836,0.00082,0.000294,2.6e-05,-0.000355,-5.1e-05,0.000119,-2.9e-05,-0.000307,0.000165,0.000121,0.000213,0.000302,9.4e-05,-0.000143
-1.6e-05,-5.8e-05,1.2e-05,-5.6e-05,-5.6e-05,-2e-05,-9.8e-05,-7.9e-05,-3e-05,5.8e-05,-0.00016,1.1e-05,-1.7e-05,-0.000146,-6e-06,-0.000102,-3e-05,3.2e-05,8.8e-05,0.000142,-0.000703,-0.000344,-0.000161,1.1e-05,0.000111,0.000949,-0.001377,-0.000278,-0.002372,-0.008563,0.004265,-0.000675,-0.002879,-0.005948,0.001121,0.000862,-0.00032,-0.010133,-0.00096,-0.003517,0.00088,0.003684,0.001474,0.001588,-0.005039,-0.007059,-0.000719,-0.003344,0.00077,-0.000923,-0.003409,0.001638,0.001643,0.003944,0.000158,-0.001035,0.001887,0.000676,-0.000854,-0.000245,-0.002005,-0.000697,0.000444,0.001891,9.6e-05,0.000448,0.000116,-0.000666,0.000369,-0.000681,-0.00026,-0.000626,-0.000249,-0.000271,-0.000662,-0.00037,-0.000445,-0.00061,-0.000328,-9.5e-05,0.000143,0,0.000221,0.00022,-5.4e-05,2e-04,0.000388,0.000359,0.000152,-0.000145,-2e-05,-0.001145,-0.00063,-0.000656,-0.000355,-0.000307,0.000298,-0.000411,-0.000223,-0.000132,0.000162,0.000164,1e-06,6.4e-05,-0.000124,-0.000144,-1e-04,0.000178,-0.00026,-0.000177,-7.8e-05,0.000132,2.4e-05,0.000309,9.6e-05,-0.000753,-0.000698,-0.00016,-1.7e-05,-0.000104,-0.00025
-6.5e-05,-1.6e-05,3.5e-05,8.2e-05,-3.4e-05,-5.8e-05,-2.1e-05,-2.6e-05,-6.3e-05,-2.2e-05,-4e-05,-7.3e-05,-0.000102,-0.000126,-9e-05,-5.4e-05,-4.7e-05,-2.7e-05,0.000148,-0.000551,-0.000747,-0.000391,-2.4e-05,0.000177,0.000316,0.000118,-0.000393,0.000831,0.002648,0.004131,0.004761,0.004759,0.002533,-0.001139,-0.005266,-0.002677,-0.002232,0.006771,0.000509,0.004492,-0.003561,0.000198,0.00099,-0.001671,0.002993,0.001575,-0.000557,0.002198,0.002727,-2.2e-05,0.001409,-2.9e-05,0.000898,-0.001752,0.000638,-0.001158,0.000677,-0.001771,0.000461,-0.002407,0.000517,0.003254,0.00171,-0.000641,0.002884,0.00249,0.001052,3.5e-05,0.000572,0.000489,0.00131,-1.5e-05,-0.000216,0.000814,0.000223,0.000133,0.000295,3.6e-05,-0.000192,6.5e-05,-5.1e-05,-0.000352,-0.00038,-0.000341,-0.000223,4.3e-05,-4.4e-05,-0.000163,-0.000238,-0.00011,-0.000199,-0.001295,-0.000293,-0.000278,-8.5e-05,-0.000284,0.000228,-0.000509,-0.00014,-0.000195,0.000127,4.8e-05,-2.5e-05,-0.000188,-0.000544,-8.9e-05,-9.9e-05,-6.7e-05,-0.00015,0.000181,0.000103,0.000128,-4.5e-05,-0.000556,-0.000273,0.000494,-0.000184,-0.000206,-0.000121,-0.000132,-6.8e-05
-4.4e-05,2.2e-05,-5e-06,-5.7e-05,-4e-06,-0.000113,-0.000141,-3.2e-05,-0.000106,-0.000106,-8.4e-05,-9.1e-05,-0.000102,-0.000138,-7.6e-05,-0.000115,-0.000178,-9e-05,3.4e-05,-0.000126,9.7e-05,-3.9e-05,5.6e-05,-9.7e-05,4.9e-05,-0.000344,-0.00047,-9.7e-05,-0.00038,-0.000463,-0.003253,-0.005604,-0.006338,0.001313,0.00203,0.002005,-0.000731,-0.000771,-0.001701,-0.005414,-0.000912,-0.002134,-0.002083,2.9e-05,-0.00374,-0.00032,-0.000325,-0.002474,-0.000899,0.000994,0.000983,0.00175,-0.004114,-0.000367,-0.002218,0.003038,-0.000923,-0.001448,-0.001248,-0.000295,-0.001712,-0.00217,0.00024,-0.000366,-0.002151,-0.001228,-0.000566,1.5e-05,0.000163,-8.1e-05,-0.00075,0.00021,0.000185,0.000178,1e-05,-0.000371,-9.8e-05,3.1e-05,0.00018,0.000165,0.000161,-0.000196,-0.000168,2.6e-05,0.000206,-0.000195,-0.000181,-7.1e-05,7e-06,-0.00022,5.3e-05,-3.1e-05,-0.000453,-0.000509,-2e-04,-0.000646,-0.00011,-0.000126,0,-0.000123,5e-06,-5.5e-05,-4e-05,0.000125,9.1e-05,-0.000172,-4e-06,-0.000127,-0.000206,-3e-05,-3.2e-05,3.8e-05,0.000137,-6e-05,7.6e-05,-9.4e-05,-0.000281,-0.000204,-0.000117,-4.5e-05,-0.000185
-1.8e-05,0,-5.5e-05,-7.8e-05,2e-05,-5.1e-05,-3.6e-05,-2.4e-05,4e-06,-5.6e-05,-4.7e-05,-3.1e-05,-0.000145,7e-06,-2.5e-05,-1.7e-05,-5.3e-05,-7e-05,3e-05,0.000102,0.000294,-5.1e-05,-1e-04,-0.000156,-1.7e-05,-0.000104,0.000142,-0.000739,-0.000316,0.000737,-0.000769,0.000186,0.001919,-0.002458,-0.002153,-0.001076,-0.001995,0.000658,0.002854,0.004582,0.00096,0.001487,0.002629,0.001,-0.001921,-0.001764,0.002233,0.000295,-0.001049,-0.001801,0.000253,0.00078,0.001748,0.001281,0.002039,-0.000471,0.002656,0.001269,0.000524,0.000395,0.000809,0.00021,-0.000211,-0.00036,-8.7e-05,5e-05,0.000351,-0.000131,0.000164,0.000327,-0.000382,8e-06,-0.000995,-0.000387,-0.00027,0.000132,6.4e-05,-0.000106,-6.4e-05,6.1e-05,-0.000143,-0.000245,0.000145,-9.5e-05,3.2e-05,-1.8e-05,-0.000231,-0.000171,-5.2e-05,0.000172,0.000173,-1.7e-05,0.000262,-0.000209,-0.000451,-0.000145,-5.5e-05,0.000114,-0.000114,-0.000129,2e-06,0.00021,-9.6e-05,-4.1e-05,-0.000184,-6.2e-05,-1e-04,-0.00019,0.000138,0.000145,-0.000135,0.000283,-0.000274,-0.000182,-2.8e-05,0.000186,0.00021,-0.000183,-4.1e-05,-2.9e-05,-1.1e-05
-6.4e-05,2.1e-05,1.2e-05,-2e-05,-7e-06,-6e-05,-3e-06,2e-05,8e-05,-5.5e-05,-6.2e-05,1.3e-05,-7.8e-05,-1.4e-05,-5.7e-05,-2e-05,0,2e-05,3.7e-05,-9.7e-05,4.6e-05,0.000124,-0.000237,-0.000148,0,3.6e-05,-0.000626,0.000401,0.000311,0.000841,0.001979,0.000446,0.000274,3.2e-05,0.000605,-0.001742,-0.001628,-0.00172,0.001726,-0.002131,0.001408,-0.001292,0.001665,-0.000214,-0.001806,0.00019,-0.001195,-0.000564,0.001007,-0.000768,-0.000162,-0.001212,0.000944,0.000612,-0.000926,-0.001445,-0.000478,0.000623,-0.000661,-0.001669,-0.000304,0.000268,-0.000263,-0.000384,-0.001295,-0.000618,-0.000186,0.000423,-0.000554,-0.000552,-0.000562,-0.000233,0.00026,-0.000458,-0.000162,-8.5e-05,-6.4e-05,0.000108,0.000225,-4.6e-05,-3e-05,-8e-05,-0.000239,3.4e-05,0.00021,4.3e-05,9.7e-05,0.000176,-3e-06,-0.000152,0.000128,0.000236,-3e-04,-3.7e-05,3.8e-05,-0.000215,-0.000218,-0.00031,-0.000149,-0.000158,9.2e-05,-3.5e-05,-8e-05,-9.4e-05,-0.000115,-0.000365,-5.5e-05,2e-04,3.7e-05,-0.000282,-0.000133,4.5e-05,0.000158,0.000372,-5.2e-05,-0.000111,0.000323,1.8e-05,-3.2e-05,-9e-06,-8.4e-05
4e-06,6.7e-05,2.1e-05,-3.2e-05,-3.3e-05,4e-06,-1.7e-05,-1.1e-05,2.3e-05,3.1e-05,-3.9e-05,-1.4e-05,-2.9e-05,-8e-06,-9.8e-05,-1.6e-05,-6e-06,-1e-06,6.4e-05,-0.000102,-2e-05,-0.000634,4.7e-05,-6.5e-05,-9.6e-05,-8.4e-05,0.000477,0.000385,0.000554,0.001606,-0.000364,0.000785,-0.001335,0.003103,0.001514,0.001122,0.000696,0.001855,0.00228,0.003,-0.002307,-0.00107,0.000563,0.000104,0.002755,0.002082,0.001399,0.000271,-0.000633,0.000372,-0.000703,0.000385,0.000825,-0.000462,4.1e-05,-0.000546,0.000445,-0.000424,-0.001678,0.001496,-0.001342,0.000105,-0.000626,0.000556,0.00098,0.000397,0.000143,-3e-06,5.6e-05,0.000156,6.6e-05,2.9e-05,4.8e-05,-0.000219,7.8e-05,-2e-05,-0.000377,-3.8e-05,5.8e-05,7.2e-05,7.2e-05,0.000416,-7.9e-05,5.5e-05,9.8e-05,6.6e-05,-3e-05,-0.000332,3.5e-05,2.1e-05,-0.000139,0.000166,-6.7e-05,-0.00063,-0.000148,-0.00029,-0.000309,-0.000243,-0.000183,-0.000199,-5e-05,1.6e-05,-7.9e-05,-2.2e-05,-8.5e-05,-0.000282,-0.000173,-8.5e-05,9.8e-05,-0.00011,-1.5e-05,-0.000403,-0.000332,-5.6e-05,0.00018,0.00015,4.4e-05,-0.000197,-3.3e-05,-8.6e-05,1.7e-05
-3.9e-05,3e-06,9e-06,9e-06,9e-06,-7e-06,-4e-05,1.5e-05,-1.7e-05,1.2e-05,-3.1e-05,-2.2e-05,-3e-05,-1.8e-05,-6.8e-05,-3.3e-05,1.7e-05,-3.1e-05,5.3e-05,0.000145,-0.000131,0.000145,2.5e-05,-2.5e-05,0.00016,5e-06,0.000207,0.000343,-0.000233,-0.001561,-0.001324,4e-04,-0.000566,-0.002378,-0.000806,0.000242,-0.000113,-0.001862,-0.003339,-0.001083,0.00147,-0.000374,-0.002543,-0.001919,-0.000784,-0.00033,9.4e-05,-2.1e-05,-0.000208,0.000358,-0.000391,-0.000817,-0.000836,-0.000373,0.001286,0.001087,-0.001913,0.000263,0.000646,-0.001382,0.001043,-0.000309,0.000584,-0.000227,0.000103,-0.000222,-0.000159,-0.000142,5.8e-05,5.4e-05,0.00054,-0.000307,-9e-05,0.000134,9e-06,3.8e-05,-3.1e-05,-9.1e-05,-6e-05,-0.000191,-0.000109,-4.1e-05,4.9e-05,9.9e-05,2.9e-05,-0.000115,-1.9e-05,0.000211,0.000101,-4.2e-05,1e-06,-7.7e-05,0.000147,3.9e-05,7e-06,-0.000105,-0.000118,-0.000143,0.000165,-0.000178,-4.6e-05,-7.6e-05,6e-06,9e-06,5.2e-05,0.000127,9.9e-05,-7.9e-05,-0.000183,3.1e-05,-2e-06,0.000241,0.000209,-8.1e-05,0,-5.6e-05,-0.000174,-9e-05,-1.3e-05,-4.8e-05,-1.9e-05
-6e-06,1.1e-05,2e-06,3.1e-05,-2e-06,3.1e-05,-2.7e-05,-1.5e-05,8e-06,0,2.6e-05,5e-06,-3.2e-05,-1.1e-05,-3.5e-05,1.7e-05,1.6e-05,-3.8e-05,7e-06,2.2e-05,8.6e-05,-2.9e-05,2.2e-05,2.3e-05,-8e-06,-5.9e-05,-7.4e-05,-0.000151,9e-06,0.000769,-0.000475,-0.002213,0.001158,0.000123,0.001668,-0.001239,-3.9e-05,0.002255,0.000413,-0.000286,-0.000267,-0.000869,0.001912,0.001071,0.00049,-0.000675,-0.000474,0.000306,-0.000216,-7.1e-05,0.000203,-0.000723,-0.002027,0.000112,-0.000491,0.000155,0.000629,0.000127,0.000402,0.00143,0.000545,-4.7e-05,0.000425,-0.000311,0.000303,-0.000767,2e-06,-0.000292,4.7e-05,-9.2e-05,-0.000115,1.6e-05,9.5e-05,-0.000179,-7e-05,-9e-06,-9e-05,-6e-05,-6.3e-05,-0.000128,-2e-05,-0.000143,1.8e-05,1.7e-05,-0.00011,8.6e-05,3e-06,5e-06,-2e-05,-5e-06,-0.000108,-0.000115,-8e-06,0.000464,1.5e-05,-5.8e-05,-1.6e-05,-0.000114,8.3e-05,-2.4e-05,-7e-05,-4.7e-05,2.9e-05,9e-06,-4.1e-05,-3e-05,-9.2e-05,8.6e-05,-1.6e-05,7.9e-05,3.9e-05,-2.9e-05,-0.000141,-1.3e-05,0.000137,7.5e-05,0,1.3e-05,-3e-05,3e-06,-1.4e-05
-2e-06,3e-06,1.3e-05,1.1e-05,-5e-06,1.4e-05,-1.3e-05,1.2e-05,1e-05,1.4e-05,-6e-06,-8e-06,-6e-06,-5e-06,2.8e-05,3e-06,1.3e-05,-3.1e-05,-1.5e-05,-6.3e-05,-0.000173,0.000191,-1.7e-05,-4.4e-05,-4.2e-05,6.6e-05,-1.7e-05,-0.000347,5.3e-05,-0.000286,1e-06,-5e-05,-0.000388,0.000457,4.7e-05,0.002093,0.000208,-0.001597,0.001171,-0.00062,-0.000564,0.001105,-6e-04,-0.000502,0.000169,0.000631,0.001331,-0.000448,0.000416,-0.000657,0.001027,0.001112,0.001299,-0.000541,-0.000657,0.001215,-0.000112,3.7e-05,-0.000138,-0.000374,0.000272,-0.000191,-0.000465,0.000311,-0.000392,0.000116,-0.000183,0.000777,-9.5e-05,-2.4e-05,0.00016,0.000151,-1.7e-05,-6.5e-05,1.9e-05,-1.3e-05,6.2e-05,9.6e-05,-1.5e-05,-7.7e-05,4.2e-05,-4e-06,1.3e-05,-7.1e-05,-2e-05,-4.1e-05,-4.9e-05,0.000133,-6.9e-05,-3.1e-05,-5e-06,-0.000128,0.000114,-0.000326,-2.7e-05,-9e-05,-1.9e-05,-0.00011,-4.2e-05,-0.000164,-4.4e-05,5.3e-05,-2e-06,-1.4e-05,-3.2e-05,3.8e-05,9e-06,3.7e-05,-6.4e-05,-2.9e-05,5e-06,-6.7e-05,0.000106,5e-06,-0.000221,-5.4e-05,-1.5e-05,0.000235,-1e-06,4.2e-05,4e-06
0,1.4e-05,4e-06,1.7e-05,1.6e-05,4e-06,1e-05,-6e-06,-1e-06,1.8e-05,6e-06,-6e-06,8e-06,1e-05,3.3e-05,7e-06,2e-06,1.7e-05,-1.7e-05,2.1e-05,0.000115,5e-05,-8.7e-05,3.3e-05,-2.2e-05,3.6e-05,-0.000103,0.000235,0.000165,-0.00012,0.000578,-3e-04,-2e-04,0.000161,0.000552,-0.000825,-2.9e-05,0.000422,-0.001246,0.000356,0.000122,-0.00043,-0.000103,0.000309,0.000281,0.000398,-0.00057,-0.00044,-0.001687,8.3e-05,6.8e-05,-0.000704,-0.000209,0.000877,0.000539,-0.0012,-0.000734,-9e-06,-0.000258,0.000165,0.00047,0.000578,-0.000113,-0.000185,-0.000134,0.000233,9.3e-05,-0.00035,7.6e-05,5e-05,6.8e-05,7.3e-05,4.2e-05,6.3e-05,-1e-05,-2.1e-05,5.6e-05,-3.3e-05,3.2e-05,4.9e-05,-3e-05,2.6e-05,7.2e-05,7.7e-05,-6.3e-05,-9.5e-05,3.1e-05,-0.000113,2.1e-05,1.7e-05,-5e-06,-7e-05,-7e-05,4.9e-05,0.000128,-6e-06,4.2e-05,3.3e-05,-5.4e-05,1.7e-05,-1.5e-05,-5.1e-05,-3.7e-05,-1.3e-05,-1.9e-05,2.2e-05,-3.7e-05,1e-05,0.000144,-9.9e-05,4.3e-05,-2.9e-05,-5.9e-05,-2.3e-05,1.5e-05,1.7e-05,-5e-06,0.000104,-1.5e-05,2.2e-05,-1.8e-05
0,8e-06,8e-06,-2e-05,1e-06,-1.9e-05,1.5e-05,3e-06,-1.3e-05,8e-06,-1.5e-05,-2e-06,4e-06,1e-06,2.1e-05,-3e-06,-1.5e-05,4e-06,4e-06,5.7e-05,5.4e-05,0.000112,0.000134,7e-06,-1.1e-05,-9.3e-05,-2.6e-05,-2e-06,-0.000208,0.000122,-0.00038,9e-04,-0.000717,-0.000519,-0.000215,0.000376,8e-06,-0.00086,-0.000515,-0.000374,-0.001008,0.000336,0.001167,0.000221,-0.001339,-2e-06,0.000141,0.000979,0.000489,-0.000311,-0.000264,0.000307,0.000402,-0.000106,-0.000153,-0.000472,0.000314,-0.000116,-0.000181,-0.000333,0.00043,-0.000381,0.000137,-7.7e-05,-0.000143,-1.7e-05,0.000174,0.000118,-0.000105,-3.2e-05,-7.2e-05,-2.2e-05,-0.000121,2e-05,-3.4e-05,4e-06,4e-06,6.9e-05,-2.8e-05,5e-06,2.1e-05,-4.7e-05,-7e-06,3.8e-05,-9e-06,1.5e-05,1.9e-05,-2.4e-05,2.4e-05,2e-05,-8.6e-05,3.9e-05,-3.3e-05,0.000152,-2e-05,4.9e-05,7.1e-05,-4e-06,6e-06,-2e-05,-2.9e-05,-1.7e-05,-5.5e-05,-1e-06,-5e-06,-2e-06,-3.5e-05,-5.9e-05,-4e-05,2.6e-05,3e-06,-7e-06,1.9e-05,-2.7e-05,0.000116,-1.7e-05,4.4e-05,1.6e-05,-1e-06,-2.3e-05,-1.5e-05
3e-06,1e-06,-4e-06,-2e-06,-7e-06,-1.1e-05,-3e-06,3e-06,1.2e-05,-1.8e-05,-1.5e-05,4e-06,-3e-06,1e-05,2e-06,-3e-06,-1e-05,1.1e-05,-6e-06,-2.5e-05,-2.4e-05,-0.000173,-1.5e-05,-1.2e-05,-6.5e-05,4.3e-05,-7.7e-05,-4e-06,7e-05,0.000308,2e-04,0.000826,6.5e-05,0.000871,-4.4e-05,-0.000441,-2.1e-05,0.000715,0.000196,-8e-06,0.000479,0.000356,-0.000694,-0.000599,8.7e-05,0.000214,0.000223,-0.000242,0.000254,-9e-06,-4e-05,0.000341,0.000407,-0.000159,-0.000114,0.00017,9.1e-05,-4.6e-05,4.1e-05,7.6e-05,8.7e-05,-0.000175,0.000114,1.5e-05,0.000169,9.7e-05,-0.000169,-1.3e-05,0.000125,4e-06,-1.9e-05,-9.1e-05,-3.4e-05,-4e-06,-8e-06,3e-06,5e-06,-1.4e-05,-7e-06,1e-05,9e-06,-3.1e-05,1.2e-05,2.7e-05,-1.4e-05,-2.4e-05,1e-06,3.5e-05,2.8e-05,1.5e-05,5.1e-05,5.3e-05,-4.3e-05,3.4e-05,-3.3e-05,9e-06,6.7e-05,-4.5e-05,-2.7e-05,3.1e-05,-2.9e-05,1.9e-05,-1.1e-05,1e-06,-3.5e-05,2.5e-05,1.3e-05,3.4e-05,8e-06,3.4e-05,1e-06,-4.3e-05,3.3e-05,6.5e-05,-4.6e-05,1e-05,4e-05,0,1e-05,-1e-05,2e-05
-7e-06,-1e-06,-1e-06,3e-06,-4e-06,-8e-06,2e-06,1e-06,3e-06,-6e-06,-2e-06,0,-8e-06,-8e-06,-1.7e-05,-6e-06,-4e-06,9e-06,-7e-06,-2.1e-05,-4e-06,9e-06,-1.1e-05,2.2e-05,1.1e-05,2.1e-05,6.2e-05,-9.9e-05,8.8e-05,-0.000558,0.00014,-0.000243,0.000409,-0.000301,0.000228,0.000244,-0.000107,-0.00066,-0.000123,-0.000335,0.00013,-0.000324,7.9e-05,0.000404,0.000117,-0.000208,-0.000333,7e-05,0.00036,1.8e-05,0.000193,-0.000452,-0.000394,-0.000115,-0.00023,0.000278,-0.000561,1.4e-05,0.000102,0.000138,0.000105,2.5e-05,-0.000271,-9.6e-05,-0.000155,-0.000232,0.000158,0.00012,2.8e-05,3.9e-05,-8.7e-05,-6.3e-05,7e-06,9.5e-05,8.8e-05,1.2e-05,-1.1e-05,-4e-06,1e-05,1.9e-05,-1.4e-05,-3.8e-05,-9.7e-05,1e-06,-1.9e-05,-1.1e-05,-1.4e-05,0,-1.1e-05,-3.9e-05,-3.7e-05,6.2e-05,-3e-05,-2.3e-05,-9e-06,-4.6e-05,2.8e-05,-2.7e-05,4e-06,2.5e-05,0,-1.6e-05,6e-06,2e-06,1.5e-05,-4e-06,-2.5e-05,-5e-06,-1e-06,3.7e-05,-1e-06,-1.4e-05,-2.5e-05,2.8e-05,1e-06,-1.1e-05,-1.9e-05,-7.8e-05,-1e-06,-5e-06,-3e-06
-3e-06,0,3e-06,-2e-06,7e-06,-9e-06,-1e-05,-1e-06,-3e-06,-3e-06,0,-3e-06,-3e-06,-4e-06,-2.2e-05,-2e-06,-3e-06,5e-06,-1.1e-05,4.1e-05,-1.7e-05,-6.7e-05,-1.4e-05,-3.6e-05,1e-06,-3.7e-05,0.00011,4e-05,-6.6e-05,0.000323,0.000321,-0.000503,0.000119,-0.000238,-0.000343,-0.000302,-0.000179,0.000862,-0.000201,0.000214,8e-06,0.00039,-2.5e-05,-0.000126,4e-04,-0.000452,0.000533,-6.7e-05,-0.000178,0.000148,-6.5e-05,0.00032,0.000439,6.6e-05,0.000153,0.000438,0.00036,2.7e-05,0.000183,2e-06,2.6e-05,6.5e-05,3.8e-05,0.000116,0.000143,2.6e-05,-0.000295,-0.000119,-3.1e-05,-9e-06,-6.7e-05,3.3e-05,0.000117,-3.5e-05,5e-06,-8e-06,-1.1e-05,5e-06,2.1e-05,4e-06,9e-06,5.7e-05,3e-05,-1.2e-05,-1.9e-05,2e-05,5e-06,3e-06,-6e-06,7e-06,2.3e-05,-1.7e-05,5e-05,-0.000158,-2.1e-05,1e-06,-4e-06,2e-06,3.6e-05,-4.6e-05,1e-05,1.4e-05,0,6e-06,7e-06,-1.1e-05,1.6e-05,-4e-05,-1.3e-05,1.3e-05,-3e-06,-2.6e-05,1.5e-05,1.5e-05,1.4e-05,1.4e-05,-3e-05,-3.6e-05,1e-06,-2e-06,-1e-06
-5e-06,-1e-06,1e-06,-8e-06,-4e-06,4e-06,-1.1e-05,1e-06,-8e-06,-1e-06,-3e-06,-2e-06,-9e-06,0,-1.5e-05,-3e-06,6e-06,-7e-06,-5e-06,4e-06,-5e-06,-1.1e-05,-1.8e-05,1.5e-05,-6e-06,7e-06,3.4e-05,3.3e-05,-4.8e-05,-0.000157,-0.000108,-0.000113,-0.000359,0.000387,0.000634,0.000592,3.1e-05,-0.000714,-0.000446,9.5e-05,-0.000331,-0.00039,-0.000645,-0.000136,-9.8e-05,0.00044,-0.000265,0.000297,-1e-05,-0.000179,0.000171,-3.7e-05,-0.000422,5.5e-05,0.000143,-0.000151,-5.4e-05,-0.000104,2.6e-05,-9.1e-05,7.6e-05,-1.7e-05,0.000112,3e-05,-7.9e-05,0.000126,0.000163,9.3e-05,1.8e-05,-5e-05,3.6e-05,3.3e-05,-2.1e-05,-2.5e-05,-4.2e-05,4e-06,2.6e-05,9e-06,3e-06,1e-05,6e-06,1.3e-05,5e-06,2.4e-05,1.1e-05,-3e-05,-1e-06,-1e-06,2e-06,9e-06,-6e-06,-4e-05,2e-05,3.3e-05,-5e-06,-3.3e-05,-3e-05,-2.7e-05,-1.7e-05,-2.4e-05,1.4e-05,-1e-06,-8e-06,7e-06,-2.2e-05,-1e-05,-1.8e-05,-2e-06,-1.8e-05,-3.7e-05,3e-06,5.4e-05,-3e-06,-4.9e-05,3e-06,-1.1e-05,-1e-06,-1.6e-05,-4e-06,1e-05,-1.8e-05
-3e-06,-5e-06,-1e-06,-1e-06,1e-06,8e-06,-1e-05,2e-06,6e-06,4e-06,-2e-06,1e-06,-2e-06,-1e-06,-5e-06,0,8e-06,-9e-06,-2e-06,-2.4e-05,-1.4e-05,6.2e-05,2e-05,-1.8e-05,-1e-06,2e-06,-3.8e-05,3.6e-05,9.6e-05,-5e-05,-0.000159,-0.000114,-1.9e-05,-0.000251,-0.000134,-0.000425,1.3e-05,0.000316,0.000142,-0.000281,7.5e-05,-0.000135,0.000664,8.6e-05,0.000268,0.000145,-5.8e-05,-3.9e-05,7e-06,0.000136,-0.000172,-9.4e-05,-0.000428,-0.000136,-0.00022,-7.7e-05,0.000201,-1e-06,-6.3e-05,0.000169,8.6e-05,8.7e-05,-0.000139,-7.4e-05,0.00012,9e-06,2e-06,-5.5e-05,-1e-05,6.5e-05,-3.2e-05,3.6e-05,-5.8e-05,-8e-06,-4e-06,-5e-06,-2.2e-05,9e-06,-2.2e-05,0,-7e-06,-3.7e-05,-1.3e-05,1e-06,-2.9e-05,0,5e-06,1e-06,-1e-06,-3.8e-05,5e-06,-3.3e-05,1.2e-05,3.5e-05,2.4e-05,-3.2e-05,-3.7e-05,-9e-06,-1.2e-05,-5e-05,1.2e-05,4e-06,-4e-06,-8e-06,-1e-05,-1.1e-05,6e-06,2e-05,2.3e-05,-2.2e-05,1e-06,-2.7e-05,-1.2e-05,-2e-06,-1.7e-05,6e-06,1e-06,2.5e-05,-9e-06,8e-06,2e-06
1e-06,-3e-06,-2e-06,5e-06,0,7e-06,0,-2e-06,2e-06,5e-06,-4e-06,0,-2e-06,2e-06,1e-06,0,4e-06,-2e-06,-3e-06,1e-05,2.1e-05,-4.3e-05,-4e-06,-7e-06,1e-05,1e-06,3.2e-05,-5.6e-05,5e-06,3.9e-05,5.1e-05,0.000296,-1.8e-05,1.6e-05,3.3e-05,0.000191,6.6e-05,-0.00035,5.3e-05,6.5e-05,-0.000279,9.6e-05,-0.000359,-0.000112,-0.000329,0.000106,0.00016,0.000221,0.000268,-8e-06,-0.000102,0.000365,0.000619,2e-06,4.8e-05,-0.000229,1.6e-05,-2.7e-05,9e-06,-0.000202,2.6e-05,-0.000127,5e-06,6.8e-05,-7.3e-05,-2.1e-05,2.8e-05,4.5e-05,1.2e-05,-2.4e-05,2.3e-05,-3.7e-05,1.2e-05,2e-06,2.5e-05,-6e-06,-3.4e-05,1e-06,-4e-06,2e-06,1e-06,-4e-06,2.5e-05,1.1e-05,-4e-06,6e-06,1e-06,2e-06,-3e-06,2e-05,-2e-06,-1.4e-05,-6e-06,-6e-05,1.5e-05,-1e-06,-3.3e-05,-5e-06,2e-06,-1.8e-05,7e-06,1.4e-05,1e-06,-6e-06,8e-06,1e-06,-7e-06,7e-06,-9e-06,1.6e-05,0,-1e-05,6e-06,1.6e-05,7e-06,-1e-06,6e-06,1.7e-05,-6e-06,-7e-06,2e-06
-2e-06,-2e-06,2e-06,8e-06,1e-06,1e-06,-1e-06,4e-06,-4e-06,6e-06,-2e-06,-2e-06,-2e-06,3e-06,5e-06,-2e-06,0,0,-2e-06,1.7e-05,2.9e-05,1.9e-05,1e-05,1.5e-05,0,7e-06,-6.1e-05,-4.1e-05,-7.9e-05,0.000141,9.2e-05,-5.4e-05,-1.9e-05,0.000408,-0.000108,-0.000156,1.4e-05,0.000367,6.5e-05,-6.9e-05,0.000181,-0.000327,-1.7e-05,1.9e-05,-2.7e-05,-7.4e-05,-0.000192,-0.000207,-8.2e-05,-0.000114,-6.6e-05,-0.000336,-0.000171,8.1e-05,0.000142,0.000232,4.8e-05,3e-05,4e-06,0.000158,-7.5e-05,0.00016,2.8e-05,-5.8e-05,2.5e-05,-9.8e-05,-5.8e-05,-1.9e-05,-2e-06,3e-06,2.3e-05,-3.5e-05,2e-06,-3.3e-05,3e-06,-8e-06,2e-06,-2e-06,-3e-06,-3e-06,3e-06,-1.6e-05,5e-06,-4e-06,2e-06,-2.2e-05,-1.3e-05,2e-06,1e-06,-3e-06,-6e-06,2.3e-05,-2e-05,6e-05,-1.4e-05,1.7e-05,-2e-05,-9e-06,2.9e-05,-1.9e-05,2e-06,-1e-05,5e-06,0,-6e-06,2e-06,-2e-06,-1.6e-05,1.2e-05,1.1e-05,3e-06,4.2e-05,-3e-06,-1.4e-05,-5e-06,-4e-06,1e-05,2.8e-05,-4e-06,-1e-05,0
2e-06,-3e-06,0,-3e-06,-3e-06,-1e-06,1e-06,-2e-06,-2e-06,-1e-06,0,1e-06,2e-06,-2e-06,3e-06,-1e-06,-4e-06,3e-06,0,-1.5e-05,-3.5e-05,2.9e-05,-1.3e-05,-1.8e-05,-2e-06,-1.5e-05,-6e-05,1.6e-05,1.1e-05,-0.000253,-0.000207,9.8e-05,0.00011,-9.1e-05,5.1e-05,0.000112,1.6e-05,-0.000357,-0.000278,0.000201,0.000107,7e-05,0.000157,0,-3e-06,0.000109,0.000162,9.4e-05,-2.2e-05,-1.8e-05,4.6e-05,-2.9e-05,0.000148,-6.8e-05,-0.000144,4.6e-05,0.000126,-8.4e-05,6e-06,-0.000146,5.9e-05,-3.3e-05,-2e-05,-9e-06,-0.000112,-1.4e-05,1.3e-05,-2.1e-05,2e-06,-2.4e-05,2.9e-05,-2.4e-05,2.5e-05,-4e-06,-1e-05,0,6e-06,1.2e-05,5e-06,-2e-06,0,3.8e-05,3e-06,5e-06,1.6e-05,-1e-06,8e-06,2e-06,7e-06,-1e-06,1.5e-05,2.1e-05,-1.2e-05,-9e-06,-7e-06,-7e-06,-1e-06,-1.6e-05,-1.6e-05,-8e-06,4e-06,2e-06,-4e-06,2e-06,-1.2e-05,2e-06,-2e-06,1.8e-05,-8e-06,3e-06,4e-06,1e-06,1e-06,8e-06,0,3e-06,7e-06,1.5e-05,3e-06,0,-3e-06
-1e-06,-4e-06,0,-5e-06,1e-06,-4e-06,-3e-06,2e-06,1e-06,-2e-06,-2e-06,0,-2e-06,0,7e-06,-1e-06,-4e-06,0,0,-7e-06,1.6e-05,-1.1e-05,-9e-06,1.7e-05,4e-06,6e-06,1.3e-05,6.8e-05,4.1e-05,0.000232,0,6.9e-05,-4.7e-05,-0.000112,9.6e-05,-3.7e-05,3.4e-05,0.000349,-5.7e-05,-0.000115,-0.00028,0.000127,-0.000179,0.000112,0.000121,-0.000269,2.4e-05,-1e-06,2.6e-05,8.1e-05,0.000144,0.000177,-0.000114,-7e-06,-3.6e-05,0.000119,-0.000103,7e-06,6.8e-05,4.1e-05,6e-05,-3.7e-05,-5.1e-05,2.4e-05,6.4e-05,2.3e-05,-8e-06,-2e-06,-2.1e-05,4.2e-05,2e-05,2.4e-05,-1.7e-05,2e-05,-5e-06,2e-06,1.2e-05,-6e-06,-8e-06,0,-1e-06,-3.4e-05,-6e-06,2e-06,1.1e-05,0,2e-06,-4e-06,4e-06,-3e-06,-1.6e-05,1.3e-05,-1e-05,-5.6e-05,-1e-06,-8e-06,1e-05,-4e-06,-1.4e-05,-1e-06,-3e-06,4e-06,-8e-06,3e-06,6e-06,3e-06,-1.1e-05,1e-05,1e-06,-2.3e-05,4e-06,-1e-06,0,2.1e-05,9e-06,-5e-06,-1.3e-05,1.9e-05,3e-06,7e-06,-2e-06
-2e-06,-4e-06,-2e-06,1e-06,2e-06,-7e-06,-2e-06,-1e-06,3e-06,-4e-06,-2e-06,-1e-06,-2e-06,-1e-06,3e-06,-1e-06,-4e-06,2e-06,1e-06,1.6e-05,-1.7e-05,2.1e-05,2.1e-05,-6e-06,0,6e-06,4.6e-05,-4e-06,-2.3e-05,-0.000131,-3.3e-05,-6e-05,-0.000124,0.000146,-0.000237,0.000138,-4.2e-05,-0.000352,0.000373,3.6e-05,0.000223,6.4e-05,8.6e-05,-4e-05,-0.000186,0.000328,-9.6e-05,-5.2e-05,-0.000118,-8.5e-05,-3.3e-05,-0.000233,-0.000164,2.3e-05,3e-05,-0.000178,0.000114,2.5e-05,-6.4e-05,1e-06,-1.3e-05,9e-06,0.000124,-4.4e-05,-5.7e-05,-2.7e-05,-2.6e-05,1e-05,8e-06,-3.6e-05,-2.2e-05,3.2e-05,-7e-06,-2.2e-05,-1e-06,3e-06,-7e-06,6e-06,-6e-06,-2e-06,2e-06,-5e-06,-2e-06,0,1.6e-05,-8e-06,1e-06,-6e-06,-4e-06,8e-06,9e-06,-7e-06,3e-06,1.5e-05,1.8e-05,3e-06,2.1e-05,-2e-06,5e-06,-1.3e-05,-8e-06,-4e-06,-5e-06,-2e-06,-1e-06,0,4e-06,-1.1e-05,-1e-05,-1.3e-05,1e-06,1.2e-05,0,-2e-06,-1e-05,4e-06,-5e-06,6e-06,2e-06,3e-06,-3e-06
1e-06,-3e-06,1e-06,2e-06,-1e-06,-3e-06,-5e-06,1e-06,-5e-06,-3e-06,-2e-06,0,-1e-06,-1e-06,2e-06,-1e-06,-2e-06,0,1e-06,-1e-06,5e-06,1.3e-05,2e-06,2e-06,-2e-06,-1e-05,-8e-06,-6.1e-05,6e-06,2.8e-05,1.6e-05,-0.000165,7.9e-05,-1.7e-05,0.000178,-1.7e-05,-2.8e-05,0.000284,-0.000214,-6.7e-05,-0.000188,0.000135,0.000107,3e-05,0.000127,-8.2e-05,0.000148,-5.5e-05,-5.8e-05,-8.4e-05,-0.000113,0.000112,0.000129,-1.2e-05,4.7e-05,-4.6e-05,-0.000104,4e-06,-4.2e-05,2.1e-05,4.3e-05,4.2e-05,-4.1e-05,2.5e-05,7.9e-05,6.3e-05,6.6e-05,-4e-06,1e-06,1.5e-05,-2.4e-05,1e-06,-3e-06,3.1e-05,7e-06,1e-06,-6e-06,0,9e-06,0,0,0,3e-06,4e-06,-1e-06,3e-06,-1e-06,-1e-06,-7e-06,-1.1e-05,-2e-06,-1.8e-05,1.7e-05,5.8e-05,-1.6e-05,-1.1e-05,2.3e-05,-3e-06,0,1e-06,-8e-06,-1e-06,0,0,-7e-06,0,-9e-06,-1.1e-05,1.1e-05,1.4e-05,-1e-06,-1e-06,0,-1.5e-05,0,-6e-06,0,-9e-06,1e-06,-1e-06,2e-06
-2e-06,-2e-06,0,-1e-06,0,0,-2e-06,-1e-06,-1e-06,1e-06,-2e-06,0,1e-06,1e-06,-4e-06,-1e-06,3e-06,-1e-06,1e-06,-1e-05,-1e-06,-5.9e-05,-1.3e-05,2e-06,2e-06,3e-06,4.2e-05,-5e-06,2.8e-05,2.2e-05,7e-05,-9.1e-05,-5.9e-05,-9.6e-05,-5.7e-05,-7.4e-05,-6e-06,-0.000163,-6.6e-05,0.000141,7.6e-05,5e-05,-0.00015,-3.2e-05,1.8e-05,-0.000121,-0.00011,-1.4e-05,1.6e-05,6.3e-05,7e-05,-4.5e-05,-7.8e-05,3.3e-05,-2.1e-05,-3.2e-05,-4.5e-05,-5.4e-05,7e-06,8e-06,-5.4e-05,-5.2e-05,-1.4e-05,-3e-06,-6.6e-05,1e-05,-7e-05,-1.8e-05,2e-06,1e-06,-1.3e-05,-1.7e-05,1.5e-05,-1e-05,1e-05,0,3e-06,2e-06,3e-06,1e-06,-1e-06,1.7e-05,-1.7e-05,-4e-06,-1e-06,-9e-06,-5e-06,6e-06,0,2e-06,-5e-06,-9e-06,6e-06,-1.5e-05,-7e-06,-1.1e-05,1.5e-05,-9e-06,1e-06,-1.1e-05,-4e-06,-2e-06,4e-06,2e-06,1e-06,0,6e-06,4e-06,-1e-05,1.5e-05,-1e-06,1e-06,1e-06,-7e-06,5e-06,7e-06,6e-06,-1.8e-05,-2e-06,-4e-06,-3e-06
0,-2e-06,0,-2e-06,1e-06,4e-06,-3e-06,2e-06,3e-06,0,0,0,-2e-06,0,-6e-06,-1e-06,3e-06,-1e-06,1e-06,7e-06,6e-06,1.5e-05,-3e-06,-5e-06,0,2e-06,-2e-06,3.6e-05,-3e-05,3.4e-05,-6.1e-05,8.3e-05,3.1e-05,0.000257,8.5e-05,-1.5e-05,-8e-06,0.000193,0.000252,-1e-04,-3e-06,9.2e-05,0.000202,-4.5e-05,8e-06,5e-06,1.3e-05,-3.5e-05,2.1e-05,-1.2e-05,4.4e-05,1.2e-05,6.6e-05,-8.5e-05,-3.5e-05,7.9e-05,3.3e-05,-1.6e-05,-1.5e-05,-1.5e-05,-3.1e-05,3.7e-05,1e-05,0,7.8e-05,-1.6e-05,3.9e-05,1.3e-05,-5e-06,5e-06,0,-3.2e-05,-3e-06,1.3e-05,-3e-06,0,2e-06,-1e-06,4e-06,-1e-06,3e-06,-4e-06,7e-06,1e-06,-6e-06,-6e-06,2e-06,1e-06,4e-06,-1.3e-05,1.1e-05,-2e-06,7e-06,-1.4e-05,2.3e-05,6e-06,6e-06,0,8e-06,3e-06,-2e-06,0,1e-06,-1e-06,5e-06,-1e-06,-7e-06,2e-06,1.1e-05,3e-06,0,-1.1e-05,1e-06,-1e-06,-3e-06,-8e-06,0,-1.2e-05,-4e-06,-3e-06,0
0,-2e-06,-1e-06,-1e-06,0,4e-06,0,0,0,3e-06,0,0,-1e-06,0,-7e-06,-1e-06,2e-06,0,1e-06,6e-06,1e-05,-3.4e-05,1.2e-05,0,-1e-06,-1e-06,-2.5e-05,3.1e-05,-1.9e-05,-8.4e-05,5.2e-05,0.000198,3.3e-05,-2e-06,-0.000129,3.1e-05,1.8e-05,-0.000213,-5.9e-05,3.7e-05,-1.7e-05,-0.000127,-6e-05,5e-05,-5.6e-05,9e-05,3.3e-05,-2.5e-05,-6e-05,-6.9e-05,2.1e-05,1e-04,9.4e-05,7.8e-05,7.9e-05,3.5e-05,-0.000118,1.4e-05,-1e-06,2.7e-05,1.2e-05,-6.1e-05,2.2e-05,1.5e-05,-6.8e-05,-9e-06,-4.4e-05,-6e-06,-7e-06,-2e-05,1e-05,-3e-06,0,-2.1e-05,-7e-06,-2e-06,-9e-06,-2e-06,-1.2e-05,-1e-06,-2e-06,-9e-06,6e-06,-2e-06,-4e-06,4e-06,3e-06,0,1e-06,1.7e-05,-1.1e-05,1.1e-05,-5e-06,-1.3e-05,-8e-06,5e-06,-5e-06,-4e-06,6e-06,-1.2e-05,-2e-06,1e-06,-3e-06,0,-6e-06,-1e-06,1e-06,-1.1e-05,-2e-06,-1.1e-05,1e-06,-1e-06,-3e-06,1e-05,3e-06,9e-06,3e-06,-3e-06,-2e-06,1e-06,-3e-06
-1e-06,-1e-06,0,3e-06,-2e-06,3e-06,-3e-06,0,-2e-06,2e-06,-1e-06,0,1e-06,0,-3e-06,-1e-06,2e-06,1e-06,0,-9e-06,-1.7e-05,1e-05,-4e-06,-1e-06,0,2e-06,-2e-05,-5.1e-05,4.4e-05,0.000104,0.000108,4.2e-05,-4.4e-05,-6.4e-05,1e-06,3.4e-05,1.6e-05,0.000153,2.9e-05,-8.6e-05,-0.000106,-8e-06,-7.2e-05,-2.8e-05,0.000112,-7e-05,-8.5e-05,2.2e-05,2.5e-05,-8e-06,4.3e-05,-0.000129,-2e-05,-6.5e-05,-2e-06,-6.5e-05,1.6e-05,6e-06,1.6e-05,-6e-06,-2.7e-05,2.6e-05,-5e-06,-2.9e-05,4.8e-05,-4.5e-05,5.2e-05,1e-06,1e-05,1.6e-05,-1e-05,2.1e-05,0,2.6e-05,0,-1e-06,5e-06,4e-06,0,0,-1e-06,-4e-06,-6e-06,1e-06,1e-06,-7e-06,-1e-06,0,1e-06,-1.9e-05,9e-06,8e-06,-6e-06,1.6e-05,-2.1e-05,-6e-06,-1.5e-05,-5e-06,-1.6e-05,-6e-06,-1e-06,-2e-06,-3e-06,-1e-06,-3e-06,-1e-06,-3e-06,2e-06,-2e-06,-1.3e-05,0,4e-06,3e-06,0,1e-06,-9e-06,-2e-06,-2e-06,0,3e-06,0
0,-1e-06,0,1e-06,1e-06,1e-06,-2e-06,1e-06,-1e-06,1e-06,-1e-06,1e-06,-1e-06,-1e-06,1e-06,-1e-06,-1e-06,0,0,-1e-06,7e-06,3.1e-05,-7e-06,0,0,-2e-06,-1.5e-05,-4e-06,1e-05,-7.5e-05,-3.1e-05,-0.000123,-3.9e-05,0.000135,4.4e-05,-8.7e-05,3e-06,-0.000168,-5.9e-05,9.1e-05,0.000145,-2e-05,8.6e-05,6.2e-05,-9.5e-05,9.8e-05,3.5e-05,-4.9e-05,1.8e-05,2.8e-05,-8.3e-05,5.5e-05,3.9e-05,5.4e-05,-5.4e-05,-2.5e-05,-4e-06,-2.7e-05,-3.3e-05,-3.4e-05,1.5e-05,1.3e-05,1.4e-05,9e-06,-7.1e-05,6e-06,-2.4e-05,-9e-06,-6e-06,7e-06,9e-06,1.7e-05,-8e-06,-2.6e-05,2e-06,1e-06,-7e-06,-1e-06,2e-06,1e-06,2e-06,1.1e-05,6e-06,1e-06,6e-06,-4e-06,-3e-06,-1e-06,-2e-06,1.3e-05,-4e-06,3e-06,-1e-05,1e-05,1.4e-05,-5e-06,-1.5e-05,-1e-06,3e-06,-1e-05,2e-06,1e-06,0,0,3e-06,0,-1e-06,1e-05,-6e-06,7e-06,0,-1.6e-05,-3e-06,1e-06,-2e-06,9e-06,-1e-06,2e-05,1e-06,3e-06,0
-1e-06,0,0,-2e-06,0,-2e-06,-3e-06,0,2e-06,-1e-06,-1e-06,0,0,0,6e-06,-1e-06,-2e-06,0,0,7e-06,-1e-06,-3e-06,1.1e-05,-1e-06,-1e-06,1e-06,1.2e-05,1.3e-05,-4.6e-05,2.5e-05,3e-06,-0.000117,3.7e-05,-3.9e-05,-9e-05,3.5e-05,6e-06,0.000162,-5.2e-05,-2.7e-05,-8.2e-05,-0.000207,-5.2e-05,-3e-06,-4.7e-05,-1.2e-05,-3.2e-05,4.5e-05,6.3e-05,-5.1e-05,-3.5e-05,6.3e-05,-0.000196,-2.6e-05,3.7e-05,-2e-05,-1.7e-05,-4e-06,1e-06,2.5e-05,-1.7e-05,-2.4e-05,-1.2e-05,6e-06,3.6e-05,3.2e-05,-8e-06,1e-05,2e-06,-1.7e-05,4e-06,1e-06,4e-06,8e-06,-2e-06,2e-06,5e-06,1e-06,0,1e-06,-1e-06,-2e-06,4e-06,-4e-06,2e-06,0,4e-06,0,0,-7e-06,3e-06,-5e-06,-6e-06,-4.7e-05,7e-06,4e-06,-1.4e-05,1e-06,4e-06,-1.1e-05,3e-06,2e-06,2e-06,1e-06,-1e-06,1e-06,0,3e-06,6e-06,1.4e-05,0,0,3e-06,7e-06,0,-9e-06,-4e-06,1.4e-05,2e-06,0,-1e-06
0,0,0,0,0,-4e-06,-1e-06,0,-1e-06,-2e-06,-1e-06,-1e-06,0,0,6e-06,0,-2e-06,-1e-06,0,-3e-06,-3e-06,8e-06,-5e-06,2e-06,0,2e-06,6e-06,2.6e-05,3e-06,-4e-06,1.9e-05,-2.4e-05,-2e-06,-6.3e-05,1.8e-05,-9.6e-05,0,-1e-04,7.5e-05,1.5e-05,2.6e-05,0.000132,-8e-06,-3.1e-05,0,-0.00011,-3e-05,-2e-06,-1.1e-05,-6e-06,1.7e-05,-8e-05,7.8e-05,1.8e-05,1.3e-05,3.9e-05,2e-06,2.7e-05,2.2e-05,-2.2e-05,-6.3e-05,-1e-05,-2.4e-05,-1.7e-05,-3.1e-05,3e-06,-6e-06,-8e-06,0,6e-06,5e-06,-2.3e-05,-5e-06,-1e-05,4e-06,-1e-06,2e-06,1e-06,2e-06,1e-06,-1e-06,-1e-05,-3e-06,-1e-06,-1e-06,-6e-06,-1e-06,1e-06,-2e-06,3e-06,-2e-06,-7e-06,5e-06,3e-05,-7e-06,-4e-06,-6e-06,-5e-06,3e-06,-2e-06,3e-06,-1e-06,0,0,-3e-06,0,-4e-06,-2e-06,-1e-06,-1e-06,1e-06,3e-06,-1e-06,-8e-06,2e-06,9e-06,1e-06,7e-06,0,-4e-06,-1e-06
0,0,0,1e-06,-1e-06,-3e-06,-2e-06,0,-1e-06,-1e-06,0,0,0,0,3e-06,-1e-06,-2e-06,0,0,-5e-06,8e-06,1.1e-05,-8e-06,-1e-06,0,-2e-06,1.7e-05,-1.7e-05,2.8e-05,2.3e-05,-3.3e-05,8.8e-05,-1e-06,0.000123,-3.4e-05,0.000136,-1.1e-05,9.6e-05,-6e-05,-4.9e-05,3.5e-05,-7e-05,7.5e-05,2.1e-05,8.8e-05,0.000108,3.8e-05,4.6e-05,-8e-06,2.3e-05,3.2e-05,6.1e-05,5e-05,-2.4e-05,-2.3e-05,2.9e-05,5.8e-05,-2e-06,7e-06,1.8e-05,3.2e-05,4.2e-05,2.5e-05,1.3e-05,4.7e-05,5e-06,1.8e-05,6e-06,-3e-06,8e-06,9e-06,-1.7e-05,1.2e-05,6e-06,2e-06,0,-3e-06,-2e-06,-4e-06,0,1e-06,1e-06,-6e-06,-1e-06,-7e-06,1e-06,0,0,1e-06,-8e-06,0,-2e-06,8e-06,-3e-06,6e-06,-2e-06,2e-06,0,-9e-06,-1.1e-05,1e-06,1e-06,-3e-06,0,2e-06,0,0,2e-06,2e-06,-1e-05,0,-4e-06,1e-06,-8e-06,-2e-06,-9e-06,2e-06,2e-06,0,-2e-06,-1e-06
-1e-06,1e-06,0,0,1e-06,-1e-06,0,0,-1e-06,-2e-06,-1e-06,0,-1e-06,1e-06,0,-1e-06,1e-06,0,0,5e-06,-5e-06,-2.2e-05,1.1e-05,2e-06,0,0,2.1e-05,-9e-06,-1.5e-05,-6.4e-05,9e-06,5e-05,8e-06,6.4e-05,9.3e-05,-8e-05,-5e-06,-0.000113,-2e-05,4.6e-05,-0.000147,-3.2e-05,-8e-05,-3.3e-05,-3.3e-05,4.9e-05,-3.9e-05,-4e-06,-2e-06,-3.8e-05,1.6e-05,-6.4e-05,-3.2e-05,2.7e-05,-1.6e-05,1.4e-05,2e-05,-1.2e-05,-2e-06,-3e-06,3e-06,-3e-05,-8e-06,-3e-06,-2.8e-05,-2.4e-05,-3e-06,-8e-06,1e-06,-6e-06,-9e-06,5e-06,0,0,-5e-06,0,3e-06,0,7e-06,0,-1e-06,3e-06,0,1e-06,-1e-05,-3e-06,2e-06,-1e-06,0,8e-06,0,1e-06,8e-06,-3e-06,-3e-06,5e-06,7e-06,-1e-06,5e-06,2e-06,0,1e-06,-2e-06,-1e-06,0,0,-4e-06,3e-06,-2e-06,-9e-06,0,1e-06,0,5e-06,2e-06,1e-05,1e-06,-2e-06,-1e-06,2e-06,-1e-06
0,1e-06,0,-1e-06,-1e-06,1e-06,-2e-06,0,3e-06,0,-1e-06,0,1e-06,0,-4e-06,-1e-06,1e-06,0,0,2e-06,8e-06,8e-06,2e-06,1e-06,0,1e-06,-7e-06,-1e-05,-4e-06,8.1e-05,-4.2e-05,4.1e-05,-5.2e-05,-4.7e-05,-6.5e-05,7.5e-05,5e-06,0.000106,2.1e-05,-1e-06,8.6e-05,0.000192,1.2e-05,4e-06,3.8e-05,-0.00012,8e-06,4.5e-05,2.3e-05,-2.8e-05,-3.7e-05,1.3e-05,7.6e-05,-3.1e-05,2e-05,-3.6e-05,6e-06,2e-06,1.2e-05,-6e-06,-3.5e-05,2.8e-05,-1e-05,-2e-06,2.5e-05,-1.8e-05,5e-06,6e-06,3e-06,-5e-06,-6e-06,1.6e-05,-4e-06,2e-06,-2e-06,-1e-06,0,2e-06,-2e-06,0,0,8e-06,4e-06,0,-2e-06,-5e-06,-5e-06,-1e-06,0,-1.6e-05,2e-06,5e-06,1e-06,7e-06,-4e-06,5e-06,1.3e-05,-1e-06,2e-06,-6e-06,1e-06,0,1e-06,-1e-06,-3e-06,0,1e-06,-7e-06,2e-06,4e-06,0,2e-06,0,4e-06,0,-1e-05,-1e-06,-7e-06,-1e-06,3e-06,1e-06
0,0,0,0,0,2e-06,-1e-06,1e-06,0,1e-06,-1e-06,0,0,0,-4e-06,-1e-06,1e-06,0,0,-5e-06,-1.2e-05,-6e-06,-1e-05,-3e-06,0,-1e-06,-1.5e-05,1.4e-05,1.6e-05,-6.8e-05,-3e-05,-1.7e-05,1.2e-05,8.9e-05,-2e-05,-7.8e-05,-1e-06,-9e-05,3e-06,6e-06,1.5e-05,-8.7e-05,2.4e-05,1.5e-05,-1.2e-05,-6e-06,2.2e-05,-1.4e-05,-1.5e-05,2.4e-05,-5.3e-05,7.4e-05,-5.9e-05,3.5e-05,3e-05,2.1e-05,4e-05,1.3e-05,-1.5e-05,2e-06,-1e-06,-9e-06,9e-06,7e-06,-2.9e-05,5e-06,-3e-06,-4e-06,-2e-06,1.2e-05,2e-06,1.6e-05,-7e-06,5e-06,8e-06,-2e-06,-1e-06,-2e-06,-1e-06,-1e-06,0,-7e-06,-6e-06,-3e-06,1e-06,0,2e-06,0,1e-06,1.7e-05,-1e-06,2e-06,-4e-06,4e-06,-1e-06,-6e-06,1.1e-05,-2e-06,-4e-06,1e-06,1e-06,1e-06,2e-06,1e-06,0,0,-1e-06,-6e-06,-3e-06,1.3e-05,0,1e-06,1e-06,1e-06,-1e-06,1e-05,0,-7e-06,0,0,-1e-06
-1e-06,1e-06,0,1e-06,0,4e-06,-3e-06,0,-2e-06,2e-06,-1e-06,0,0,0,-4e-06,-1e-06,2e-06,0,0,2e-06,6e-06,-1.9e-05,1e-06,2e-06,0,0,-1.6e-05,2e-05,-1.6e-05,3.1e-05,2.9e-05,-1.6e-05,4.4e-05,2.2e-05,1.8e-05,8.7e-05,1e-06,8.8e-05,-7e-06,-3e-05,-2.7e-05,8e-05,-6.3e-05,1.2e-05,-2.2e-05,7e-06,-2.8e-05,1.1e-05,1e-06,-1.5e-05,3.3e-05,-0.000148,-3e-06,-4.3e-05,-2.7e-05,-1.7e-05,1.1e-05,8e-06,-3e-06,-5e-06,-1.2e-05,-4e-06,2e-06,-1.2e-05,1.5e-05,2e-06,-2.2e-05,4e-06,0,-5e-06,-6e-06,-9e-06,4e-06,-1e-05,2e-06,1e-06,1e-06,2e-06,-5e-06,-1e-06,0,-4e-06,3e-06,-2e-06,5e-06,-3e-06,2e-06,2e-06,1e-06,-1.5e-05,-1e-06,-1e-06,-8e-06,-1.2e-05,3e-06,-1e-06,9e-06,0,4e-06,-4e-06,0,-1e-06,0,1e-06,1e-06,-1e-06,-1e-06,0,3e-06,3e-06,0,3e-06,-1e-06,-1e-06,0,-1e-05,-1e-06,-7e-06,0,-1e-06,0
0,2e-06,0,0,0,2e-06,-2e-06,0,1e-06,1e-06,0,0,0,0,-1e-06,0,0,0,0,4e-06,1e-06,5e-06,9e-06,-2e-06,0,0,-7e-06,-1.4e-05,-1.3e-05,-8e-06,-1.7e-05,-8.7e-05,-4.3e-05,-7.9e-05,-2e-06,-8.4e-05,2e-06,-8.9e-05,-6e-05,9e-06,1.9e-05,3.4e-05,6.2e-05,-1.8e-05,-6.1e-05,-3.2e-05,2.2e-05,-7e-06,-1.1e-05,-4.4e-05,8e-06,7.9e-05,9e-06,5.2e-05,-1.1e-05,2.8e-05,-2.6e-05,-1e-06,1.8e-05,2e-06,1e-06,1.1e-05,-2.4e-05,7e-06,-2.4e-05,2.7e-05,2.8e-05,-4e-06,2e-06,-9e-06,6e-06,-1.9e-05,7e-06,1.5e-05,-6e-06,1e-06,2e-06,-1e-06,-1e-06,0,0,0,4e-06,0,8e-06,-3e-06,-3e-06,-2e-06,-1e-06,1.2e-05,1e-06,-3e-06,-6e-06,-1e-06,7e-06,3e-06,2e-06,-2e-06,0,-6e-06,-1e-06,0,-2e-06,-1e-06,-1e-06,0,0,1e-06,-2e-06,-1.1e-05,0,-3e-06,1e-06,-3e-06,1e-06,9e-06,-1e-06,-4e-06,0,-2e-06,-1e-06
0,1e-06,0,-1e-06,0,-1e-06,-2e-06,0,1e-06,0,0,0,-1e-06,0,1e-06,-1e-06,0,0,0,-4e-06,-5e-06,-4e-06,-6e-06,-1e-06,0,0,-1e-06,-1.8e-05,3.3e-05,1.6e-05,-8e-06,-2.5e-05,1e-06,7.2e-05,-5e-06,0.000108,0,6.4e-05,2.2e-05,1.3e-05,-2.3e-05,-7.7e-05,-2e-06,3e-06,5.4e-05,8.2e-05,-1.4e-05,-8e-06,-1.4e-05,2.7e-05,4.6e-05,3.5e-05,-7.6e-05,-5.4e-05,2.6e-05,-2e-06,-7e-06,5e-06,-1e-06,-7e-06,6e-06,-2e-06,2.2e-05,-1e-06,1.3e-05,1e-05,-3e-06,4e-06,-1e-06,1.2e-05,1e-06,-1.1e-05,-4e-06,-1.2e-05,-2e-06,-1e-06,-1e-06,0,6e-06,0,0,4e-06,-4e-06,2e-06,2e-06,-2e-06,1e-06,1e-06,-4e-06,-1e-05,-1e-06,-2e-06,-3e-06,2.7e-05,-7e-06,-5e-06,-5e-06,-1e-06,-3e-06,-3e-06,-2e-06,0,-2e-06,-1e-06,0,0,-2e-06,-2e-06,2e-06,-9e-06,0,3e-06,-1e-06,2e-06,0,-9e-06,0,4e-06,0,-2e-06,0
0,1e-06,0,0,0,-3e-06,-1e-06,0,0,-1e-06,-1e-06,0,0,0,3e-06,-1e-06,-1e-06,0,0,-2e-06,6e-06,3e-06,-5e-06,3e-06,0,1e-06,4e-06,-3e-06,4e-06,-3.8e-05,2.4e-05,2.5e-05,1.4e-05,7.2e-05,-3.8e-05,-0.000109,-2e-06,-7.1e-05,2.6e-05,0,-6.9e-05,1.1e-05,-5.6e-05,1.4e-05,-1e-06,3.3e-05,-2.3e-05,-3e-05,-2e-06,-3e-06,-2e-06,-7.3e-05,3.8e-05,5e-05,-5e-06,-1.1e-05,4e-06,1e-05,-1.6e-05,4e-06,-4e-06,-2.6e-05,9e-06,-8e-06,-1.3e-05,-1.9e-05,7e-06,-2e-06,3e-06,0,-1e-06,6e-06,3e-06,1.2e-05,2e-06,0,3e-06,0,-3e-06,1e-06,0,-1e-06,0,-1e-06,-4e-06,-2e-06,1e-06,-2e-06,1e-06,8e-06,2e-06,1e-06,7e-06,-1.3e-05,-4e-06,-2e-06,-1e-05,-2e-06,-3e-06,-9e-06,-1e-06,-1e-06,1e-06,0,0,0,1e-06,2e-06,-3e-06,4e-06,0,3e-06,0,2e-06,0,1e-05,1e-06,7e-06,0,1e-06,0
