0.009716,0.021485,0.024383,0.01532,0.011669,0.019568,0.329983,0.950942,0.946605,0.547024,0.636793,1.06308,1.403968,1.36043,1.075286,1.089111,1.263891,1.085173,0.822879,0.632894,0.405049,0.230286,0.227698,0.249821,0.182176,0.160679,0.192698,0.137119
0.012187,0.026763,0.030244,0.019118,0.014555,0.023803,0.394988,1.123641,1.118715,0.654644,0.758421,1.21435,1.548507,1.510813,1.227013,1.238405,1.421852,1.241451,0.961876,0.742269,0.47542,0.271333,0.267587,0.289613,0.212423,0.191586,0.229887,0.161782
0.016433,0.035064,0.039228,0.025113,0.019089,0.030365,0.487029,1.35849,1.359392,0.819277,0.952708,1.434176,1.715233,1.685536,1.445523,1.449366,1.624544,1.45042,1.148448,0.895326,0.584393,0.337409,0.325407,0.343779,0.254552,0.236447,0.282077,0.195071
0.019481,0.038692,0.042767,0.028445,0.021788,0.033893,0.518204,1.401889,1.40977,0.895718,1.089392,1.594029,1.795927,1.731197,1.568474,1.573709,1.68548,1.512404,1.189463,0.929184,0.634185,0.378666,0.349223,0.356884,0.266164,0.25282,0.299066,0.203754
0.020379,0.035811,0.039277,0.0284,0.022521,0.034239,0.483646,1.257398,1.292827,0.908986,1.196871,1.822045,2.024206,1.83105,1.669712,1.708812,1.732635,1.477432,1.092156,0.836636,0.601569,0.377125,0.348684,0.354453,0.263062,0.250127,0.293552,0.197326
0.020084,0.031136,0.034652,0.028005,0.023196,0.03431,0.441571,1.141122,1.240598,0.954219,1.322274,2.166914,2.47982,2.214875,2.012875,1.973973,1.838714,1.446068,0.985357,0.728989,0.542125,0.358414,0.348083,0.359519,0.266723,0.257154,0.299372,0.195333
0.020968,0.03192,0.036809,0.030173,0.025047,0.036821,0.410037,1.109196,1.322897,1.099709,1.596694,2.657284,3.024465,2.904686,2.836077,2.584972,2.219376,1.698767,1.149071,0.846707,0.608322,0.401624,0.392693,0.395528,0.287116,0.287961,0.334805,0.210096
0.024698,0.041238,0.048968,0.037458,0.029858,0.044115,0.435069,1.238539,1.555977,1.375004,2.184104,3.42554,3.759943,4.085254,4.425509,3.964003,3.376594,2.695954,1.890193,1.429679,1.001318,0.609521,0.514269,0.475039,0.33247,0.350845,0.42585,0.266699
0.031018,0.05798,0.068605,0.048594,0.037095,0.05432,0.534308,1.527162,1.86583,1.705805,3.146441,4.904502,5.394544,6.242456,7.055601,6.460771,5.595636,4.558933,3.23047,2.422948,1.686676,0.973909,0.690143,0.596864,0.395643,0.408825,0.530923,0.343016
0.03771,0.075177,0.08565,0.056347,0.042552,0.063692,0.666075,1.866912,2.151106,2.049069,4.488945,7.294716,8.288435,9.38817,10.356255,9.757791,8.586834,7.013207,4.972288,3.638863,2.550585,1.449195,0.906198,0.769098,0.484576,0.446605,0.59993,0.399161
0.041707,0.083268,0.089044,0.05461,0.042833,0.070186,0.787938,2.152934,2.348367,2.317136,5.908269,10.123103,11.830364,12.71492,13.36925,12.96736,11.455672,9.244264,6.574075,4.685578,3.346533,1.92537,1.148593,0.993252,0.60799,0.470013,0.604798,0.410753
0.039935,0.078234,0.078847,0.045941,0.03858,0.072362,0.896987,2.355282,2.473146,2.472439,6.877529,12.257903,14.596733,14.865639,14.656945,14.648682,12.907466,10.093665,7.190904,4.97225,3.66477,2.190401,1.335487,1.170779,0.694245,0.450812,0.52102,0.362298
0.03382,0.069623,0.070246,0.039013,0.032523,0.067319,0.936355,2.414488,2.485332,2.389629,6.681152,12.149127,14.642977,14.389793,13.157114,13.336927,11.738667,8.791215,6.197342,4.095213,3.151968,1.984862,1.295624,1.162996,0.682012,0.393363,0.378795,0.269627
0.029192,0.066647,0.070499,0.038189,0.029124,0.056637,0.904182,2.505185,2.56346,2.09281,5.235124,9.479138,11.568114,11.488904,9.858782,9.543801,8.26943,5.859204,4.005226,2.51894,2.019786,1.329938,1.00369,0.97163,0.607628,0.364507,0.277678,0.186934
0.027476,0.065925,0.073399,0.041077,0.028829,0.04824,0.799794,2.491035,2.638078,1.784783,3.294204,5.812809,7.372305,7.58275,6.276265,5.472267,4.514987,3.013927,1.98146,1.285765,1.030795,0.693963,0.718473,0.79386,0.559581,0.367602,0.231563,0.138921
0.032715,0.084238,0.096439,0.052716,0.034665,0.054401,0.769464,2.577566,2.864406,1.773257,2.243672,3.693915,4.639755,4.600376,3.656622,3.018066,2.52568,1.597809,1.000469,0.721708,0.528169,0.43854,0.624242,0.721546,0.58382,0.415502,0.240347,0.131346
0.044697,0.12718,0.145942,0.075046,0.04748,0.071896,0.883932,2.959189,3.339576,2.036376,2.403352,3.987367,4.459105,3.721664,2.88202,2.625814,2.567968,1.684102,0.852714,0.573777,0.442572,0.463564,0.711433,0.855328,0.712831,0.491863,0.278869,0.142164
0.056812,0.181107,0.209349,0.101671,0.061814,0.091586,1.038648,3.369269,3.795958,2.360958,3.075667,5.675862,6.160973,4.473312,3.390853,3.469245,3.750553,2.483353,1.071614,0.727787,0.601866,0.583913,0.866867,1.096245,0.877693,0.537833,0.296158,0.152414
0.064871,0.22785,0.268925,0.127187,0.073714,0.105271,1.196812,3.728695,4.030093,2.466504,4.013717,8.46876,9.368027,6.498819,4.852793,5.082104,5.53036,3.65064,1.493081,1.025533,0.858237,0.694333,0.98371,1.301741,0.976122,0.515485,0.289985,0.168766
0.067254,0.243687,0.298214,0.147287,0.082334,0.10784,1.266743,3.866144,3.975148,2.339933,4.874486,11.371902,12.855409,8.909656,6.712923,6.952131,7.443561,4.944136,1.932043,1.281173,1.097743,0.758279,1.000149,1.36338,0.966807,0.454565,0.275707,0.176252
0.064049,0.216888,0.271469,0.144971,0.083311,0.100776,1.158795,3.470582,3.525174,2.122564,5.048645,12.49814,14.493158,10.20612,7.940862,8.312367,8.712178,5.80198,2.223886,1.388697,1.246378,0.828054,0.993408,1.342786,0.936508,0.417224,0.257286,0.162342
0.059246,0.163329,0.196703,0.112302,0.072054,0.088111,0.939921,2.679292,2.814411,1.972147,4.442662,10.801967,12.811553,9.449183,7.767493,8.325237,8.481967,5.63904,2.247531,1.281301,1.18569,0.838487,1.015398,1.378436,0.942756,0.375862,0.215784,0.128257
0.057287,0.108772,0.114742,0.069771,0.059448,0.079849,0.844988,2.158965,2.199359,1.749484,3.730623,7.931658,9.416018,7.860816,6.806832,7.195741,7.032613,4.628691,2.073247,1.051814,0.900768,0.722589,0.946563,1.281065,0.875626,0.313815,0.1559,0.087315
0.059793,0.07691,0.067879,0.047688,0.055097,0.079878,0.794309,1.832305,1.79481,1.519805,3.044261,5.66425,6.922416,6.736665,5.807092,5.343732,4.813108,3.296553,1.774485,0.862086,0.606168,0.556338,0.873743,1.171872,0.788035,0.268025,0.1178,0.064482
0.059855,0.065907,0.057397,0.050315,0.056129,0.07447,0.75856,1.737405,1.65868,1.398996,2.736474,4.58702,5.424857,5.408741,4.448658,3.560547,3.118315,2.421852,1.493789,0.811239,0.537083,0.480159,0.853449,1.15581,0.74106,0.237885,0.105135,0.062427
0.062053,0.065346,0.062946,0.061649,0.055552,0.060009,0.690126,1.631491,1.630394,1.503118,3.02118,4.449194,4.322824,3.76289,3.211073,2.649469,2.351814,2.160675,1.452298,0.810342,0.543346,0.438581,0.783027,1.069081,0.644509,0.193217,0.098473,0.066117
0.065739,0.067455,0.06803,0.073155,0.059905,0.052964,0.567581,1.39364,1.630071,1.753171,3.206301,4.264707,3.765272,3.005018,2.61731,2.374077,2.104163,2.021241,1.40533,0.793478,0.581964,0.45858,0.728407,0.934007,0.517868,0.143608,0.096973,0.067744
0.062831,0.06683,0.069257,0.078756,0.063533,0.05105,0.465537,1.173333,1.540451,1.827777,3.165278,4.088772,3.432519,2.479606,2.155919,2.175809,1.915364,1.798845,1.331823,0.83813,0.660654,0.51656,0.710319,0.826659,0.426354,0.105241,0.092526,0.064028
0.059632,0.066018,0.066616,0.072565,0.062914,0.05442,0.458393,1.09121,1.320485,1.599998,2.967161,3.624121,2.595435,1.68099,1.490298,1.740809,1.736179,1.553404,1.217915,0.897624,0.656745,0.494648,0.723175,0.839185,0.425626,0.099592,0.089168,0.063608
0.057618,0.060533,0.060654,0.061875,0.062734,0.06519,0.440518,0.931877,0.970134,1.221347,2.749996,3.039318,1.694509,1.211754,1.228345,1.488538,1.678779,1.490938,1.134749,0.868267,0.542814,0.38849,0.696451,0.866105,0.444866,0.096231,0.085007,0.071718
0.058086,0.054296,0.057325,0.059715,0.063985,0.075625,0.394413,0.726835,0.713189,1.025283,2.46619,2.6075,1.428476,1.16848,1.421368,1.624867,1.650624,1.577998,1.214196,0.823309,0.444033,0.315874,0.631179,0.819132,0.42691,0.093756,0.081157,0.075342
0.06516,0.05228,0.057377,0.064806,0.066599,0.082266,0.393603,0.710265,0.705478,1.020196,2.087788,2.275145,1.636181,1.342982,1.590446,1.625767,1.372083,1.516809,1.268202,0.752865,0.390437,0.335226,0.627669,0.746493,0.372726,0.089271,0.076234,0.068613
0.068044,0.04926,0.051946,0.059485,0.060482,0.078067,0.437654,0.85795,0.840917,1.0727,1.958145,2.402096,2.15615,1.68273,1.633237,1.495331,1.089499,1.222003,1.07339,0.617998,0.376008,0.389016,0.607008,0.628033,0.315247,0.081871,0.065514,0.059852
0.066632,0.040676,0.037543,0.042447,0.043193,0.059811,0.448696,0.975918,0.973416,1.092088,2.18431,2.945781,2.599784,1.860541,1.445417,1.233095,0.897498,0.840244,0.71058,0.452145,0.353451,0.427204,0.552186,0.494455,0.271354,0.084757,0.058652,0.055145
0.064508,0.035392,0.02381,0.025745,0.02977,0.042079,0.406682,0.957303,0.990811,1.069399,2.331046,3.165281,2.55822,1.723961,1.268269,0.99093,0.638606,0.495551,0.458542,0.399808,0.328209,0.421469,0.585989,0.506985,0.272311,0.100036,0.065962,0.056079
0.066122,0.042244,0.024316,0.024102,0.031795,0.040068,0.350504,0.792816,0.865317,1.060132,2.245674,2.809803,2.044849,1.47499,1.303279,0.930893,0.498266,0.380267,0.389405,0.372946,0.30602,0.383084,0.652452,0.632653,0.31638,0.112739,0.079774,0.064086
0.067115,0.048585,0.03064,0.027232,0.036573,0.047524,0.305456,0.582889,0.668433,1.009542,1.936701,2.244121,1.620193,1.293763,1.321446,0.849412,0.431508,0.35939,0.337607,0.296744,0.25815,0.325451,0.674577,0.740633,0.355354,0.117656,0.087251,0.066364
0.060735,0.04891,0.038119,0.031036,0.039665,0.05538,0.295334,0.516514,0.520595,0.831166,1.639164,2.102145,1.480157,1.09489,1.207633,0.760579,0.372552,0.349909,0.290293,0.220043,0.194416,0.282222,0.641436,0.775958,0.399344,0.120074,0.095806,0.065107
0.052992,0.046063,0.044701,0.040127,0.045747,0.060177,0.306662,0.505422,0.423498,0.610815,1.273935,1.853466,1.446967,0.996503,1.0502,0.767875,0.418693,0.335383,0.267599,0.223572,0.174859,0.28773,0.594785,0.747774,0.425321,0.109353,0.099316,0.062353
0.057616,0.049399,0.048064,0.050238,0.053004,0.0613,0.332089,0.545219,0.422065,0.478333,0.895918,1.39467,1.427649,1.20514,0.985287,0.740562,0.524818,0.294164,0.218295,0.215824,0.155521,0.319846,0.692007,0.810261,0.413674,0.08665,0.091107,0.062666
