-8e-05,-0.012668,-0.024022,-0.011843,-0.013909,-0.02861,-0.147603,-0.216771,-0.197648,-0.179799,-0.167481,-0.152513,-0.132897,-0.112701,-0.073727,-0.022776,-0.007524,-0.007095,-0.010378,-0.002683,-0.000319,-0.000851,-0.000217,-0.000103,-0.00021,-0.000103,-4.2e-05,-3e-05
-3.3e-05,-0.009255,-0.01768,-0.002542,-0.007216,0.004035,-0.003638,0.02267,0.140264,0.13997,0.138209,0.118219,0.105916,0.125478,0.085112,0.025619,0.006911,0.002731,-0.001908,-0.00081,-0.000348,-0.000543,-2.9e-05,0.000212,0.000548,0.000224,6.9e-05,5.2e-05
3.7e-05,0.004999,0.00865,0.00244,0.002495,6.3e-05,-0.00355,0.002348,0.026221,0.003096,-0.019156,-0.011338,-0.005938,-0.002656,-0.005073,-0.004143,-0.001333,0.000848,0.002989,-0.000179,-0.000112,0.000373,0.000103,-4.9e-05,-0.00033,-6.4e-05,1.9e-05,1.9e-05
3.1e-05,0.010327,0.020383,0.004282,0.008675,-0.00638,-0.015231,-0.057351,-0.175118,-0.157144,-0.150674,-0.14356,-0.116907,-0.123207,-0.08483,-0.026354,-0.007546,-0.002685,0.002559,8e-05,-0.000256,0.000557,0.000103,-6.6e-05,-6e-06,-6.7e-05,-5.7e-05,-3.6e-05
-2e-06,0.002752,0.006695,0.005798,0.007167,0.015617,0.09863,0.153558,0.123146,0.146452,0.16478,0.137129,0.115779,0.101707,0.074158,0.025651,0.007665,0.004017,0.002581,0.001172,0.000429,0.00026,0.000112,0.000107,0.000297,0.000137,3.8e-05,2.9e-05
-1.9e-05,-0.007059,-0.014588,-0.005107,-0.008084,-0.007281,0.001268,0.068009,0.133398,0.097344,0.079355,0.091913,0.066823,0.050698,0.031969,0.008869,0.003102,0.00038,-0.003377,-0.000986,-0.000696,-0.00048,-1.9e-05,1.9e-05,-0.000201,-8e-06,4.4e-05,3.6e-05
-2.4e-05,-0.007451,-0.015522,-0.008905,-0.011261,-0.024263,-0.124094,-0.182572,-0.182118,-0.194224,-0.198882,-0.168407,-0.140607,-0.130899,-0.093873,-0.029434,-0.008411,-0.005982,-0.005986,-0.001553,-0.000572,-0.000331,-0.000123,-7.7e-05,-5.3e-05,-8.1e-05,-5.5e-05,-3.2e-05
-1.7e-05,0.000729,0.002807,0.003744,0.003503,0.006242,-0.002677,-0.051937,-0.036521,0.003409,0.03348,0.009465,0.007693,0.036621,0.034321,0.012445,0.002811,0.002197,0.003048,0.000826,-0.000277,-0.000161,2.1e-05,3.5e-05,0.000215,8.1e-05,3e-06,-3e-06
2.2e-05,0.007378,0.014959,0.007091,0.01023,0.012723,0.062691,0.104322,0.146124,0.134702,0.117743,0.106493,0.083973,0.084803,0.055926,0.015238,0.004451,0.004609,0.005985,0.001211,3.3e-05,6e-06,0.000105,6.3e-05,-9.6e-05,3.4e-05,5.6e-05,3.8e-05
4.7e-05,0.005055,0.008251,-0.000395,0.002364,-0.007626,-0.004057,0.005617,-0.074925,-0.096245,-0.125401,-0.105248,-0.069254,-0.090307,-0.074175,-0.024343,-0.006316,-0.003568,-0.001996,-0.00037,9.2e-05,5e-05,-1e-06,-3.1e-05,-3.2e-05,-5.2e-05,-2.8e-05,-9e-06
-9e-06,-0.004168,-0.008318,-0.002782,-0.005378,-0.005453,-0.006455,-0.004421,-0.059466,-0.025785,0.011063,-0.007413,-0.000951,-0.004588,0.006898,0.004698,0.000629,-0.001532,-0.003749,-0.000566,0.000321,0.000265,-7e-06,-3.3e-05,8.2e-05,1e-05,-2.4e-05,-2.2e-05
-4.7e-05,-0.007133,-0.012517,-0.003024,-0.006536,3.7e-05,-0.001155,0.050565,0.138345,0.122959,0.134341,0.134022,0.088466,0.089061,0.065963,0.018962,0.00545,0.003244,0.001032,0.000289,4.5e-05,0.000195,4.5e-05,5.3e-05,-6.6e-05,3.7e-05,4.9e-05,2.7e-05
-3e-06,5.6e-05,3.4e-05,-0.001658,-3.2e-05,-0.002922,-0.041645,-0.057676,-0.032028,-0.080566,-0.114936,-0.073299,-0.056172,-0.06282,-0.057631,-0.019898,-0.004468,-0.001574,0.000112,5.6e-05,-0.000238,-0.000451,-7.5e-05,2.7e-05,6.9e-05,0,-4e-06,1e-05
3.6e-05,0.005898,0.010602,0.005391,0.007394,0.000594,-0.016175,-0.075754,-0.126576,-0.095197,-0.073426,-0.088315,-0.064876,-0.044934,-0.020974,-0.003691,-0.002019,-0.001521,-0.001049,-0.000589,-0.00037,-0.00039,-7.8e-05,-7.7e-05,-3.5e-05,-5.1e-05,-4.3e-05,-3.6e-05
1.1e-05,0.002601,0.004937,0.003196,0.004149,0.007955,0.046232,0.061614,0.088117,0.123251,0.139915,0.104689,0.069615,0.088638,0.071606,0.022276,0.005277,0.003342,0.00205,1.9e-05,-4.7e-05,0.000314,7.6e-05,2.3e-05,-5.8e-05,1.9e-05,3.1e-05,5e-06
-1.6e-05,-0.002315,-0.004132,-0.004513,-0.004983,0.003089,0.036309,0.051353,0.05383,0.027688,-0.015748,0.003483,0.014038,-0.014413,-0.030278,-0.011039,-0.001585,-0.000551,0.000521,0.000309,0.000329,0.000415,5.6e-05,4.7e-05,5.2e-05,1.6e-05,1.2e-05,1.7e-05
-2.2e-05,-0.003478,-0.00621,-0.00289,-0.006114,-0.005224,-0.010111,-0.034077,-0.099924,-0.098851,-0.090565,-0.082862,-0.05012,-0.067426,-0.042407,-0.010948,-0.003333,-0.003037,-0.00217,-0.00056,-0.000123,-6.8e-05,-8.5e-05,-7.4e-05,-1.6e-05,-5.7e-05,-4.9e-05,-3.3e-05
-4e-06,-0.000728,-0.001506,0.00183,0.000885,-0.000591,-0.019909,0.004307,0.03302,0.050079,0.088214,0.074351,0.039106,0.058019,0.056071,0.017107,0.003653,0.001741,-0.000405,-0.000212,-0.000179,-0.00037,-1e-04,-2.3e-05,-6.7e-05,-1.1e-05,2e-06,-1.9e-05
1.2e-05,0.002352,0.003612,0.001279,0.004878,0.004258,-0.005833,0.010092,0.070366,0.032754,0.003464,0.031018,0.019763,0.015011,-0.007553,-0.005146,0.000305,0.001196,0.000706,-4.6e-05,-0.000124,-0.000279,-3.8e-05,4.7e-05,1e-05,2.1e-05,2.3e-05,1.9e-05
