1.8e-05,5e-06,0.000195,0.000127,5.6e-05,6e-06,1.1e-05,1.1e-05,2.2e-05,3e-06,1.4e-05,1e-05,2e-05,1e-06,1e-05,7e-06,1e-06,3e-06,2e-06,1.6e-05,1.2e-05,1.2e-05,1e-06,6e-06,9e-06,3e-06,9e-06,2e-06,1e-05,4e-06,4e-06,1.4e-05,1.3e-05,1.1e-05,3e-06,1.2e-05,3e-06,3e-06,1e-06,0.000111,1e-04,2e-06,0.000343,0.001276,0.000455,0.000464,0.000103,0.000133,0.00032,0.000211,0.000145,0.000154,9.1e-05,3.3e-05,5.6e-05,0.00022,3.2e-05,0.000211,2.8e-05,1e-04,0.000597,0.000638,0.000405,0.000329,0.000262,0.000135,0.000169,7.2e-05,0.000253,1.7e-05,0.00026,9.5e-05,4e-06,0.000385,0.000173,6.3e-05,0.000287,0.000226,0.000104,8e-06,0.000146,4e-05,0.000178,1.2e-05,0.000122,0.000112,7.7e-05,9.8e-05,5.6e-05,5.3e-05,0.000143,6e-05,4.5e-05,0.000107,3.2e-05,8.6e-05,5.1e-05,1.1e-05,1.8e-05,7.1e-05,5e-05,7.2e-05,8.4e-05,3.2e-05,1.9e-05,1.2e-05,1e-06,2e-06,2e-06,8e-06,0.000205,2.8e-05,8e-06,0.000315,0.000101,1.5e-05,9e-06,7.5e-05,0.000176,3.6e-05,0.000907
9e-06,1e-05,0.000391,0.000166,0.000148,0.000114,4.3e-05,1.5e-05,6.4e-05,2.6e-05,1.1e-05,3.2e-05,1.3e-05,1.9e-05,9e-06,2.9e-05,2.7e-05,1.8e-05,3.3e-05,4.3e-05,8e-06,2.8e-05,3.4e-05,2.2e-05,2.4e-05,2.8e-05,3.2e-05,3e-05,1.1e-05,9e-06,1.8e-05,3.1e-05,1.7e-05,4.1e-05,3.3e-05,2.8e-05,2.1e-05,1.6e-05,1.9e-05,0.00024,0.000223,6.4e-05,0.000708,0.002701,0.001223,0.001656,9e-05,0.000693,0.000529,0.000433,0.00078,0.000426,0.000241,0.00019,0.000169,0.000534,0.00048,0.000672,0.000504,0.000703,0.001684,0.002024,0.002202,0.000652,0.000314,0.000438,0.000898,0.001159,0.001262,0.000937,0.00133,0.000399,0.000583,0.000883,0.000724,0.00014,0.000608,0.000623,0.000593,0.000406,0.000326,0.000148,0.000383,0.000216,0.000273,0.000371,7e-05,0.000213,0.000261,0.000383,0.000239,0.000326,0.00022,0.000277,0.000288,0.000174,0.000277,0.000229,0.000256,0.00019,7.8e-05,0.000126,0.000281,8e-05,9.2e-05,8e-05,0.000107,0.000188,7.9e-05,0.000136,0.000401,0.000254,0.000613,0.001164,0.000427,0.000319,0.000199,0.000233,0.000462,0.000998,0.001801
5e-06,3e-06,0.000374,0.000158,8.1e-05,4e-05,3.2e-05,6e-05,7.8e-05,9.7e-05,6.4e-05,4.7e-05,5.8e-05,4.8e-05,1.4e-05,2.9e-05,1.1e-05,1.5e-05,3.6e-05,1.1e-05,3.1e-05,3.8e-05,3e-05,3.3e-05,2.3e-05,2.2e-05,1.8e-05,7e-06,1.2e-05,9e-06,2e-05,5e-06,5e-06,3.2e-05,1.1e-05,2.3e-05,8e-06,7e-06,2.1e-05,0.00029,0.00025,3.6e-05,0.000698,0.002509,0.000887,0.000763,0.000507,0.000633,0.000244,0.000126,0.000659,0.000476,8.1e-05,0.000106,6.3e-05,0.000438,0.001295,0.00035,0.000363,0.000643,0.001095,0.002245,0.000223,0.000505,0.000196,0.000343,0.000666,0.000908,0.001281,0.000442,0.000806,0.000193,0.000878,0.000411,0.000221,0.000643,0.000136,0.00036,0.000669,0.000469,0.00015,0.000142,0.000172,6.5e-05,9.6e-05,4.6e-05,0.000199,0.000213,8e-05,0.000251,0.000201,0.000171,7.8e-05,6.5e-05,4.4e-05,8.6e-05,0.000217,0.000143,0.000231,0.000136,8.5e-05,0.000114,0.000249,0.000116,6.4e-05,5.4e-05,0.000112,0.000225,0.000138,0.000222,0.000456,0.000235,0.00095,0.001082,0.000533,0.000157,7.9e-05,1e-04,0.000625,0.002157,0.000948
3.8e-05,2.2e-05,0.000353,0.000324,1e-05,2.5e-05,4.7e-05,4.3e-05,1.6e-05,2.2e-05,6e-06,7e-06,4.1e-05,4.3e-05,3.7e-05,3.6e-05,5.5e-05,2.1e-05,4.6e-05,3.3e-05,4.5e-05,3.4e-05,5.3e-05,5.4e-05,3.3e-05,8e-06,2.4e-05,1.3e-05,2.2e-05,1.9e-05,2.8e-05,4.2e-05,3.3e-05,3.4e-05,4e-05,4.6e-05,4.1e-05,2.9e-05,3.4e-05,0.000328,0.000175,0.000123,0.000708,0.000751,0.001869,0.000534,0.000329,0.000852,0.000669,0.000438,0.000704,0.000181,0.000193,0.00014,1.8e-05,0.000426,0.001754,0.001338,0.000302,0.000956,0.001711,0.002531,0.001879,0.000648,0.000291,0.000972,0.00074,0.000583,0.00083,0.00044,0.001133,0.000523,0.000898,0.000862,0.000942,0.000708,0.000865,0.000849,0.000842,0.00033,0.000808,0.000467,0.000435,0.00038,0.000259,0.000205,0.000182,0.000406,0.000151,9.9e-05,0.000173,0.000181,6.9e-05,5.6e-05,0.000146,6e-05,0.000143,0.000227,0.000344,0.000237,6.1e-05,0.000285,0.000136,9.9e-05,0.000138,5.3e-05,0.000114,0.000343,0.000257,0.000112,0.000678,0.000194,0.001244,0.00191,0.001174,0.000457,0.000235,0.00014,0.00032,0.001886,0.002728
2.3e-05,1.1e-05,0.000313,0.000159,7.3e-05,5e-05,9.9e-05,5.1e-05,4.9e-05,5.3e-05,2.9e-05,1.6e-05,3.1e-05,1.7e-05,1e-05,1.3e-05,4e-05,1.8e-05,3.6e-05,9e-06,2.1e-05,1.7e-05,2.7e-05,1.5e-05,2.5e-05,1.2e-05,1.4e-05,1.4e-05,2.1e-05,2e-05,1.7e-05,2.6e-05,1.8e-05,5e-06,1.4e-05,1.2e-05,2.2e-05,7e-06,1.3e-05,0.000372,0.000222,5.7e-05,0.000681,0.002781,0.001813,0.000967,0.000551,0.00109,0.001457,0.000408,0.000719,0.000794,0.000328,0.000115,3e-05,0.000427,0.001386,0.001154,0.000947,0.001113,0.000612,0.002586,0.000903,0.000439,0.000495,0.001848,0.000588,0.001032,0.000481,0.000874,0.002003,0.001185,0.001162,0.000989,0.000452,0.000663,0.000715,0.001613,0.000443,0.000436,0.001129,0.000353,0.000158,0.000293,6.8e-05,4.8e-05,0.000116,0.000336,0.000244,0.000327,0.00011,0.000152,9.7e-05,7.8e-05,0.000186,0.000174,5.4e-05,0.000126,7.8e-05,7.5e-05,2.8e-05,0.000357,0.000231,7e-05,0.000128,0.00012,0.000138,0.000444,0.000151,0.000129,0.000578,0.000605,0.001259,0.002193,0.000988,0.000576,7.1e-05,0.000297,0.000435,0.001962,0.001923
2e-05,1e-05,0.00027,0.000547,1.9e-05,4.9e-05,9.2e-05,0.000156,3.3e-05,7.5e-05,2.1e-05,2e-06,1.6e-05,7e-06,9e-06,1e-05,3e-05,2.1e-05,3.4e-05,9e-06,1.8e-05,8e-06,3.1e-05,3.5e-05,2.3e-05,1.6e-05,4.4e-05,7e-06,2.2e-05,6e-06,1.3e-05,1.8e-05,5e-06,5e-06,8e-06,1.3e-05,2.1e-05,2.5e-05,1.3e-05,0.000386,0.000339,1.5e-05,0.000662,0.001183,0.00219,0.002006,0.000394,0.001081,0.000962,0.000424,0.00097,0.000446,0.000246,0.000171,3.5e-05,0.000427,0.001108,0.000897,0.000483,0.000498,0.00084,0.001855,0.001329,0.000345,0.000397,0.002386,0.003072,0.000614,0.00021,0.001234,7e-04,0.000959,0.001761,0.000653,0.001482,0.001443,0.002137,0.001404,0.002198,0.001301,0.000174,0.000367,0.000703,0.000661,0.000508,0.000277,0.000115,0.00026,0.000267,0.000256,0.000232,7e-05,0.000129,5.8e-05,0.000128,0.000139,3.1e-05,0.000135,9.4e-05,9.4e-05,4.4e-05,0.000416,0.000141,9.7e-05,3.2e-05,3e-05,0.000107,0.000414,0.000195,0.00011,0.000613,0.00043,0.000145,0.00437,0.001496,0.000867,0.000309,0.000336,0.000272,0.002159,0.002247
2.6e-05,1.4e-05,0.000271,9.3e-05,0.000237,4.6e-05,7.3e-05,0.000227,0.000142,0.000147,4.6e-05,2.1e-05,4.3e-05,2.5e-05,8e-06,1.5e-05,2.1e-05,2.2e-05,1.6e-05,2.7e-05,1.3e-05,6e-06,2.1e-05,2e-05,9e-06,3e-06,4.6e-05,3.8e-05,2.5e-05,2e-05,1e-05,1.7e-05,9e-06,5e-06,1.1e-05,2.4e-05,4e-05,1.7e-05,1.5e-05,0.000397,0.00042,0.000175,0.000606,0.003796,0.001073,0.002154,0.000216,0.001386,0.001095,0.00038,0.000838,0.001941,0.000586,0.000143,7e-05,0.000492,0.001025,0.0018,0.001065,0.000402,0.000815,0.000613,0.001336,0.000774,0.000101,0.003134,0.00144,0.001243,0.001024,0.00081,0.000601,0.003509,0.003236,0.000994,0.001662,0.000644,0.001899,0.001489,0.003049,0.002206,0.000551,0.00034,0.000566,0.000456,0.000509,0.000799,0.000452,0.000148,0.000224,0.000351,0.000314,0.000252,0.000209,0.000123,0.000197,0.000172,0.000171,0.00017,7e-05,0.00013,6.1e-05,0.000481,0.000165,0.000139,2.8e-05,5.3e-05,9e-05,0.000534,0.000631,0.000273,0.000724,0.000542,0.000214,0.005543,0.004092,0.002331,0.00082,0.000283,0.000427,0.001232,0.001924
8.1e-05,5e-05,0.000518,0.001513,0.000726,0.000139,7.4e-05,0.000327,0.000251,0.000113,4.7e-05,6.9e-05,4.3e-05,5.1e-05,3e-05,2.1e-05,2.4e-05,1.1e-05,1e-05,3.3e-05,2.6e-05,2e-05,1.9e-05,1.5e-05,2.7e-05,1.7e-05,4.9e-05,2.5e-05,1.3e-05,2.9e-05,7e-06,1.7e-05,2.9e-05,2.6e-05,3.2e-05,1.1e-05,3.7e-05,4.1e-05,1.8e-05,0.000414,0.001616,0.00068,0.000729,0.007465,0.003787,0.002209,0.001701,0.001775,0.002202,0.000807,0.001272,0.004362,0.002522,0.000778,0.000225,0.000461,0.000706,0.001203,0.000666,0.000615,0.000282,0.00017,0.000654,0.000583,0.000881,0.003166,0.001864,0.000619,0.00124,0.001274,0.000998,0.003372,0.005258,0.003625,0.000553,0.002039,0.000768,0.000746,0.001648,0.00127,0.001516,0.000694,0.00012,0.000965,0.000442,0.000749,0.00042,0.00037,0.00045,0.000322,0.000103,0.000121,0.000253,0.000289,0.000315,0.000222,0.000275,0.000235,0.000204,0.000138,3.5e-05,6e-04,0.000525,0.000492,0.000307,0.00014,0.000186,0.000466,0.001018,0.000724,0.000654,0.001015,0.000977,0.004856,0.004178,0.001127,0.000581,0.00029,0.000185,0.001286,0.002122
4.8e-05,7.5e-05,0.000778,0.003337,0.001404,0.000456,2e-05,0.000412,0.000272,6.4e-05,0.000125,2.7e-05,5.2e-05,1.9e-05,2e-05,3.2e-05,2.9e-05,1.3e-05,2.5e-05,3.9e-05,1.8e-05,1.7e-05,1.6e-05,4.1e-05,4.5e-05,5e-06,4.3e-05,3.3e-05,3.6e-05,4.7e-05,1.5e-05,4.1e-05,1.2e-05,1e-05,3.2e-05,1.8e-05,2.3e-05,2.1e-05,1.5e-05,0.000425,0.002212,0.001178,0.001096,0.006221,0.008821,0.006377,0.004356,0.000908,0.005193,0.00282,0.001783,0.004241,0.002684,0.001209,0.000705,0.00059,0.000826,0.000951,0.000828,0.000405,0.000546,0.000289,0.000249,0.000272,0.001589,0.002009,0.001672,0.001719,0.002062,0.002894,0.002943,0.003729,0.000893,0.001309,0.001971,0.001779,0.001724,0.000877,0.00081,0.000492,0.000627,0.001222,0.000881,0.001168,0.000697,0.000126,7.6e-05,0.000233,0.00028,0.000221,0.000174,8.1e-05,0.000201,7.1e-05,8e-05,0.000234,0.000191,0.000223,0.000103,0.000149,0.000106,0.00061,0.00092,0.000534,0.000223,9.3e-05,0.000192,0.000312,0.001038,0.000366,0.000446,0.000718,0.000519,0.003834,0.003154,0.002513,0.000997,0.000413,0.00018,0.001675,0.002887
6.8e-05,7.4e-05,0.000898,0.004408,0.00323,0.001586,0.000484,0.000505,0.000401,0.000306,0.000163,9.9e-05,2.3e-05,3.2e-05,4.5e-05,6.2e-05,4.8e-05,4.2e-05,5.8e-05,9e-06,1.4e-05,2.5e-05,1.4e-05,4.7e-05,6e-05,6.9e-05,6.4e-05,7.6e-05,8e-05,7.9e-05,7.4e-05,8e-06,4.2e-05,1.9e-05,3.2e-05,3.7e-05,3.4e-05,4.2e-05,5.4e-05,0.000421,0.001901,0.001968,0.001808,0.002817,0.010811,0.005972,0.003898,0.002748,0.007829,0.005588,0.001675,0.002358,0.000652,0.000871,0.000399,0.000596,0.000893,0.00098,0.000869,0.000235,0.000545,0.000698,0.000621,0.000773,0.00072,0.002529,0.001667,0.000996,0.001223,0.000995,0.001038,0.000926,0.000804,0.001012,0.000901,0.000874,0.000429,0.000367,0.000239,0.000457,0.000203,0.000375,8.6e-05,0.000373,0.000303,0.000235,0.000319,0.000415,0.000248,0.000126,0.000105,0.000147,6.5e-05,0.00013,0.000146,0.00016,6.9e-05,9.1e-05,0.00015,0.000106,7.1e-05,0.000523,0.000598,0.000608,0.000369,0.000242,9.3e-05,0.000522,0.000652,0.000555,0.000404,3e-04,0.000685,0.001145,0.00158,0.000438,0.000164,8.9e-05,0.000297,0.000992,0.001229
6.3e-05,1.4e-05,0.000851,0.002985,0.001237,0.000315,0.000142,0.000367,0.000216,0.000116,6.3e-05,1.3e-05,1.6e-05,2.2e-05,3.1e-05,2.8e-05,4.5e-05,3.4e-05,4.3e-05,5.2e-05,2.4e-05,2.3e-05,3.3e-05,5.8e-05,2.8e-05,5.4e-05,4.8e-05,3e-05,1.3e-05,4.1e-05,4e-05,5.2e-05,4.4e-05,2.5e-05,1e-05,2.7e-05,1.3e-05,3.4e-05,5.4e-05,0.000388,0.001509,0.001132,0.000339,0.003653,0.009059,0.006451,0.002686,0.002448,0.007482,0.004183,0.001766,0.000839,0.000647,0.000678,0.00029,0.000728,0.000473,0.000713,0.000152,0.000411,0.000362,0.001255,0.000559,0.000683,0.000666,0.002243,0.001082,0.000947,0.000989,0.000628,0.001122,0.001478,0.002694,0.001476,0.001288,0.000417,0.000521,0.000254,0.000621,0.000381,0.000125,0.000276,2e-04,0.000204,0.000263,0.000149,0.000168,0.000232,0.00012,9.8e-05,9.9e-05,6.2e-05,2.1e-05,7.1e-05,0.000136,0.000202,9.2e-05,0.000127,4e-05,7.4e-05,0.000117,0.000485,0.00011,0.000284,9.1e-05,6.3e-05,0.000117,0.000417,9e-05,0.000199,4.6e-05,6.3e-05,0.000711,0.001626,0.00062,0.000274,0.000103,0.000154,0.00021,0.000365,0.000978
2.2e-05,1.2e-05,0.000809,0.000578,0.00053,0.000105,2.2e-05,0.000259,5.6e-05,7.1e-05,2.9e-05,9e-06,3e-06,1.4e-05,6e-06,7e-06,2.5e-05,6e-06,2.1e-05,1.9e-05,2.7e-05,3.2e-05,1.8e-05,2.6e-05,3.9e-05,1.2e-05,4e-06,1.5e-05,1.7e-05,3.8e-05,1.3e-05,1.6e-05,4e-06,6e-06,2e-06,2.1e-05,1.9e-05,1.6e-05,2.1e-05,0.000372,0.000945,0.000261,0.000788,0.002207,0.004503,0.002209,0.001635,0.001438,0.004034,0.000926,0.000568,0.000884,0.000229,0.000116,3.6e-05,0.000671,0.000906,0.000293,0.000162,0.000497,5e-05,0.000994,0.001041,0.001157,0.000441,0.001664,0.001471,0.000356,0.000312,0.000456,0.000514,0.000428,0.001242,7e-05,0.000926,0.000475,0.000429,0.000351,0.001003,0.00042,0.000285,0.000272,7e-05,0.00018,0.000266,4.3e-05,0.000135,4.1e-05,0.000171,5.6e-05,1.8e-05,1.8e-05,4.5e-05,3.1e-05,0.000174,0.000133,5.7e-05,8.4e-05,5.9e-05,6.3e-05,6.6e-05,0.000457,0.000368,9.4e-05,0.000158,0.000118,6.1e-05,0.000373,8.8e-05,0.000113,0.000135,9.1e-05,0.000441,0.001681,0.000928,0.000501,0.000145,0.000245,0.000198,0.000465,0.00103
1.7e-05,4.3e-05,0.000808,0.000751,0.000323,2.7e-05,1.8e-05,0.000142,9.6e-05,3.7e-05,1.2e-05,6e-06,8e-06,1.2e-05,2e-06,1e-05,6e-06,9e-06,4e-06,1.7e-05,6e-06,3e-06,2.1e-05,3e-05,1.8e-05,2.4e-05,1.9e-05,1.3e-05,1.5e-05,1.6e-05,1e-05,1.5e-05,1.8e-05,2.1e-05,2.4e-05,1e-06,7e-06,1.5e-05,7e-06,0.000325,4e-04,0.000318,0.000922,0.002613,0.001068,0.00235,0.000884,0.001665,0.000727,0.001236,0.000856,0.000691,0.000341,0.000153,5.9e-05,0.000532,0.000907,0.001221,0.000639,0.000213,0.000538,0.00088,0.000311,0.001129,0.000581,0.001657,0.001469,0.001161,0.000335,0.00059,0.000715,0.000978,0.000752,0.000658,0.000908,0.000462,0.00064,0.000542,0.000745,0.000356,0.000493,0.000321,6.1e-05,1.4e-05,0.000204,8.6e-05,0.000118,1.8e-05,0.000201,8.9e-05,5.5e-05,7e-06,5.8e-05,3.1e-05,0.000218,0.000114,0.000102,8.9e-05,6.1e-05,7.7e-05,0.000135,0.000373,6.6e-05,8.5e-05,5.8e-05,3.3e-05,7.2e-05,0.000306,9.9e-05,0.000166,9.6e-05,6.1e-05,0.00018,0.001308,0.000677,0.00038,0.000128,0.000186,1.8e-05,0.000485,0.001105
1.6e-05,2.4e-05,0.000818,0.000478,0.00022,9.3e-05,2.5e-05,6.7e-05,7.4e-05,3.7e-05,5e-06,1.2e-05,9e-06,6e-06,2.1e-05,1.4e-05,2.2e-05,9e-06,1.3e-05,7e-06,6e-06,1e-05,1.9e-05,8e-06,1.9e-05,8e-06,8e-06,8e-06,1.8e-05,9e-06,1.6e-05,1.8e-05,1.7e-05,7e-06,2e-05,1.9e-05,1.4e-05,2e-05,2e-06,0.000281,0.000767,0.000279,0.000967,0.005764,0.003085,0.000739,0.000646,0.00177,0.000822,3.6e-05,0.000291,0.000294,0.000186,7e-06,6e-05,0.00053,0.001244,0.001294,0.00054,0.000192,0.000295,0.001405,0.001417,0.000526,0.000665,0.001774,0.003038,0.000175,0.000653,0.001277,0.000409,0.001936,0.003366,0.002334,0.001171,0.000223,0.001082,0.000452,0.001399,0.000876,0.000929,6.9e-05,0.000167,0.000114,0.000271,0.000115,0.000208,0.00023,0.000316,0.00022,9.5e-05,3.7e-05,0.000144,8.8e-05,0.000196,0.000191,0.000191,9.7e-05,8.6e-05,0.000122,0.00013,0.000237,0.00022,0.000163,0.000111,0.000121,4.5e-05,0.000257,0.000118,0.000223,8.9e-05,0.000179,0.00023,0.000625,0.000282,6.2e-05,9.8e-05,8.4e-05,0.000116,0.000461,0.000708
1.3e-05,1.1e-05,0.000783,0.000389,9.7e-05,6e-05,9.2e-05,0.000124,6.3e-05,3.9e-05,2.9e-05,3.1e-05,1.7e-05,1.5e-05,1.4e-05,1.9e-05,3e-06,3e-06,1.9e-05,2.4e-05,2.2e-05,1.1e-05,1.3e-05,1.3e-05,5e-06,1.5e-05,5e-06,3e-06,1.5e-05,1.3e-05,3e-06,1.2e-05,4e-06,1.5e-05,7e-06,1.7e-05,7e-06,3e-06,1.9e-05,0.000243,0.000395,0.000297,0.001015,0.005568,0.003416,0.000329,0.000656,0.002272,0.00099,0.001062,0.00036,0.000502,0.000311,0.000216,9.6e-05,0.00062,0.001491,0.000224,0.000227,0.000197,0.000315,0.000495,0.002064,0.00272,0.000155,0.000532,0.003059,0.003736,0.001225,0.001586,0.000987,0.003562,0.001144,0.000744,0.003466,0.002922,0.002021,0.000912,0.002064,0.000391,0.000969,0.001008,0.00045,0.000417,0.000315,8.6e-05,0.000261,0.000332,0.000317,0.000424,0.000152,0.000136,0.000184,9.5e-05,0.000202,5.4e-05,0.000137,0.000183,6e-05,0.000105,0.000195,8e-06,0.000205,0.000201,0.000257,5.7e-05,2.5e-05,0.000356,0.000313,9.3e-05,0.00015,0.000181,0.000292,0.00028,0.000317,0.000284,0.00018,0.000192,0.000175,0.000482,0.00078
4e-05,1.1e-05,0.000797,0.000509,0.000255,4.4e-05,4.2e-05,0.000208,0.000134,5.6e-05,1.1e-05,2.6e-05,9e-06,5e-06,1e-05,1.5e-05,1.2e-05,1.2e-05,1.3e-05,2e-06,1.1e-05,1.7e-05,2.1e-05,1.5e-05,1.7e-05,1.1e-05,7e-06,4e-06,1.1e-05,4e-06,8e-06,1.8e-05,6e-06,7e-06,5e-06,1e-05,1e-05,1.3e-05,1.2e-05,0.000196,0.000554,0.000293,0.001016,0.00379,0.003362,0.001945,0.000483,0.001751,0.001811,0.000531,0.000703,0.00028,0.000113,0.000176,0.000158,0.000658,0.001116,0.000849,0.000232,0.00034,0.000312,0.001773,0.005045,0.002181,0.001066,0.003143,0.002193,0.0013,0.00104,0.003455,0.002538,0.001533,0.003915,0.001422,0.003251,0.001473,0.002393,0.000456,0.000694,0.002217,0.000964,0.001026,0.001049,0.000544,0.000449,0.000499,0.000153,0.000358,0.000671,0.000565,0.000343,0.000341,0.000358,0.000397,0.000354,0.000271,0.000171,0.000263,0.000236,0.000341,0.000317,0.000354,0.000312,0.000203,0.000261,0.000308,3.4e-05,0.00044,0.000482,0.000155,0.000152,0.000332,0.000475,0.000133,0.000326,0.000115,0.000109,0.000272,0.000218,0.000535,0.001657
2.4e-05,4.3e-05,0.000748,0.000449,0.000198,4.5e-05,3.1e-05,0.000199,5.3e-05,3.5e-05,1.8e-05,2.3e-05,1.5e-05,5e-06,5e-06,1.2e-05,1.2e-05,1.4e-05,1.2e-05,1.6e-05,4e-06,1.8e-05,4.4e-05,2.1e-05,2.3e-05,1.8e-05,8e-06,3e-06,9e-06,9e-06,2.1e-05,6e-06,1e-05,8e-06,1.3e-05,1.5e-05,1.3e-05,1.2e-05,5e-06,0.000161,0.001045,0.000631,0.001152,0.002873,0.00147,0.001399,0.000959,0.002065,0.001432,0.000647,0.000478,0.000455,6.5e-05,8.3e-05,1e-04,0.000614,0.001559,0.001149,0.000647,0.000695,0.000779,0.004045,0.008637,0.010158,0.002917,0.005832,0.005357,0.001589,0.003408,0.003331,0.005744,0.003785,0.004032,0.003782,0.003127,0.002411,0.002835,0.003315,0.003396,0.003624,0.00411,0.001867,0.000857,0.000897,0.000937,0.000695,0.000416,0.000581,0.000938,0.001545,0.001437,0.000452,0.000425,0.000588,0.000232,0.000526,0.000775,0.00083,0.000853,0.000949,0.000844,0.000918,0.000727,0.000615,0.000582,0.00025,0.000378,0.000379,0.000295,0.000142,0.000379,0.000176,0.000522,0.000437,0.000681,0.000464,0.000207,0.000155,0.000102,0.000447,0.001582
5.7e-05,5.4e-05,0.000578,0.000975,0.000607,0.000314,6.2e-05,0.00016,9.9e-05,4.5e-05,3.3e-05,3.8e-05,2.5e-05,1e-05,2e-05,1.4e-05,2.6e-05,3.3e-05,2.6e-05,5e-06,1.1e-05,1.5e-05,3.5e-05,3.5e-05,3.3e-05,6e-06,6e-06,6e-06,1e-05,2.9e-05,1e-06,7e-06,1.4e-05,6e-06,1.3e-05,1.9e-05,6e-06,1.5e-05,1.2e-05,0.000119,0.000987,0.000677,0.001117,0.002807,0.002751,0.001091,0.000979,0.001177,0.002183,0.001214,0.000715,0.00077,0.000489,0.000206,6e-05,0.000358,0.002209,0.000464,0.000344,0.000544,0.000403,0.005514,0.009599,0.009235,0.011238,0.011089,0.010999,0.012079,0.012229,0.010417,0.003264,0.003795,0.002698,0.006179,0.003857,0.004195,0.002812,0.00099,0.00247,0.002686,0.000673,0.002138,0.001519,0.001075,0.000361,0.000186,0.000164,0.000251,0.001114,0.001159,0.000388,0.000438,0.000704,0.000479,0.000406,0.000572,0.000197,0.000559,0.000477,0.000571,0.000909,0.000783,0.000638,0.000845,0.000267,0.000232,0.000503,0.000525,0.000425,0.000358,0.000464,0.000248,0.000727,0.001474,0.001528,0.000621,0.000252,0.000252,0.000351,0.000282,0.001537
3e-05,2.2e-05,0.000555,0.001092,0.000716,0.000284,3.2e-05,0.000104,4.3e-05,7e-06,1.7e-05,1.2e-05,1.7e-05,3e-05,3.8e-05,2.3e-05,1.7e-05,1.7e-05,2e-06,1.6e-05,3.2e-05,3e-05,1.3e-05,4e-06,4.8e-05,5e-05,3.2e-05,2.7e-05,1.2e-05,2.4e-05,2.3e-05,9e-06,1.7e-05,1.9e-05,1.6e-05,1.9e-05,2e-05,6e-06,1.4e-05,9e-05,0.000574,0.000132,0.000887,0.002252,0.001344,0.001168,0.000808,0.001714,0.002799,0.001301,0.000877,0.000779,0.000387,0.000284,9.2e-05,0.000364,0.00203,0.001946,0.000601,0.000449,0.000556,0.004674,0.000828,0.003551,0.006442,0.003615,0.004899,0.006256,0.005136,0.001794,0.005731,0.008263,0.004632,0.007566,0.006423,0.002828,0.002167,0.001005,0.00247,0.000501,0.000221,0.001601,0.00085,0.000228,0.000257,0.000314,0.000405,0.000363,0.000572,7.2e-05,0.000255,0.000177,0.000369,0.000133,0.000395,0.000392,0.000412,0.000121,0.000157,0.000436,0.00012,0.000474,0.000236,0.000664,0.000887,0.00065,0.000313,0.000132,0.000331,0.00032,0.000289,0.000277,0.000629,0.002018,0.001797,0.000789,0.000145,0.000204,0.00024,0.000727,0.001678
7.1e-05,8.1e-05,0.000603,0.000547,0.000393,0.000219,3.1e-05,7.5e-05,9.5e-05,5.6e-05,3.5e-05,3.3e-05,2.8e-05,1.4e-05,1.5e-05,7e-06,1.4e-05,3.1e-05,2.3e-05,2.1e-05,1.9e-05,3e-05,2.9e-05,2e-05,3.6e-05,1.5e-05,2.2e-05,6e-06,7e-06,1.6e-05,5e-06,2.1e-05,7e-06,7e-06,1e-05,1.8e-05,1.3e-05,1e-05,1e-05,8.3e-05,0.000343,0.000266,0.00092,0.002008,0.000698,0.002981,0.002751,0.000253,0.001749,0.000867,0.000111,0.000444,0.000318,0.00012,4.1e-05,0.000291,0.001488,0.001252,0.000826,0.00025,0.000177,0.00263,0.002488,0.001514,0.003837,0.002364,0.002241,0.003512,0.002939,0.003239,0.006972,0.005573,0.002444,0.003446,0.000363,0.000463,0.002389,0.001378,0.001265,0.000825,0.000354,0.000775,0.00045,0.000324,0.000302,0.000263,0.000199,0.000172,8.7e-05,0.000176,0.000159,3.5e-05,0.000288,3.8e-05,0.000305,7.2e-05,7.6e-05,0.000237,0.000154,0.000277,0.000279,0.000284,0.000422,0.000399,0.000118,3.3e-05,9.6e-05,0.000419,0.000243,0.000368,7.7e-05,0.000125,0.000359,0.002802,0.001686,0.000723,0.000184,0.00016,0.000186,0.000517,0.001183
3.4e-05,4.1e-05,0.000476,0.001004,0.000589,0.000223,3.2e-05,1e-05,4.8e-05,2.1e-05,3e-05,1e-05,1.2e-05,2.5e-05,1.3e-05,3e-06,2e-05,7e-06,2e-06,7e-06,1.3e-05,8e-06,1e-05,9e-06,2.1e-05,2.5e-05,1.4e-05,1.8e-05,1.7e-05,1e-05,1.1e-05,1.6e-05,6e-06,4e-06,1.1e-05,2.5e-05,1.5e-05,1.5e-05,1.2e-05,9e-05,0.000758,0.000497,0.000897,0.002394,0.001053,0.00361,0.004232,0.002893,0.000547,0.000303,0.000411,0.000173,0.000264,0.000189,0.000146,0.000226,0.000922,0.000332,0.000286,0.000415,0.000325,0.002104,0.001612,0.001306,0.002285,0.001359,0.000982,0.001026,0.001717,0.003686,0.002385,0.002969,0.000744,0.001564,0.001802,0.001475,0.001465,0.001422,0.001211,0.000914,0.000726,0.000524,0.000403,0.000432,0.000331,0.000108,0.000267,0.000214,0.000393,0.00017,0.000163,0.000147,0.00015,0.000175,0.000244,0.000117,0.000238,0.000317,3.7e-05,0.000253,0.000209,0.000312,0.000211,0.000287,0.000211,0.00015,0.000139,0.000491,0.000185,0.000131,0.000141,8.3e-05,0.000172,0.002878,0.00185,0.001009,0.000377,3.6e-05,0.000161,0.000466,0.000745
2.4e-05,2e-05,0.000376,0.001114,0.000423,0.000114,1.1e-05,2.9e-05,4.5e-05,4.1e-05,5e-06,2.7e-05,9e-06,1.4e-05,1.4e-05,1.8e-05,2.2e-05,5e-06,2.3e-05,5e-06,1.8e-05,2.5e-05,2.9e-05,2.5e-05,4.9e-05,5.7e-05,6.3e-05,4e-05,4.7e-05,3.6e-05,2.8e-05,2e-05,8e-06,1e-05,8e-06,3.4e-05,3.7e-05,3.3e-05,2.7e-05,0.000109,0.001022,0.000557,0.000715,0.0017,0.001466,0.003009,0.003231,0.002019,0.000844,0.00052,0.001011,0.000423,1e-04,1.2e-05,4e-05,0.00026,0.000216,0.000419,0.000357,0.000474,0.000156,0.001776,0.001083,0.000849,0.001585,0.000677,0.000906,0.001032,0.002067,0.001454,0.001149,0.001863,0.000824,0.001417,0.000481,0.00077,0.000718,0.000585,0.000715,0.000562,0.000876,0.000181,0.000311,5.2e-05,0.000118,0.000104,0.000114,0.000218,0.000187,0.00029,9.2e-05,3.2e-05,5.3e-05,3e-05,0.000195,0.000131,0.000102,3.6e-05,7e-05,0.000147,5e-05,8.7e-05,0.000161,0.00019,4.4e-05,0.000127,9.5e-05,0.000286,0.000216,5.3e-05,9.6e-05,4.6e-05,6.9e-05,0.002405,0.000709,0.000206,0.000107,6.8e-05,6.2e-05,0.000266,0.000885
8e-06,5e-06,0.000144,0.000231,0.000157,3.5e-05,1.8e-05,1.6e-05,9e-06,5e-06,4e-06,7e-06,5e-06,8e-06,1.1e-05,1e-06,1e-06,9e-06,1.7e-05,1.3e-05,1.1e-05,1.2e-05,1.5e-05,9e-06,2e-05,9e-06,1.2e-05,6e-06,1.6e-05,3e-06,5e-06,8e-06,6e-06,7e-06,9e-06,7e-06,5e-06,8e-06,9e-06,6.6e-05,0.000433,0.000197,0.000295,0.000551,0.000523,0.001591,0.000631,0.000292,0.000259,0.000101,0.000326,0.000148,5.4e-05,2.5e-05,2.5e-05,0.000119,0.000213,0.000157,0.000176,8.7e-05,4.9e-05,0.000735,0.000395,0.000271,0.000634,0.000371,0.000438,0.000376,0.000681,0.000149,0.000758,0.000765,0.000587,0.000316,0.000392,0.000284,0.000171,0.000205,9.4e-05,9.2e-05,0.000282,0.000108,8.5e-05,4.2e-05,3.4e-05,1.1e-05,2.8e-05,3.9e-05,5.8e-05,7.8e-05,2.8e-05,4e-06,3e-05,4.5e-05,3.6e-05,1.7e-05,6e-05,5e-05,4.1e-05,3.8e-05,3.6e-05,1.8e-05,6.1e-05,3.5e-05,7.4e-05,5.5e-05,3e-05,0.000103,3.1e-05,5.5e-05,2.2e-05,1e-05,3.8e-05,0.000777,0.000233,3.6e-05,5.5e-05,4.9e-05,3.8e-05,0.000132,0.000282
9e-06,8e-06,0.000127,0.000185,5.8e-05,1e-05,1.5e-05,3.1e-05,1.5e-05,9e-06,5e-06,8e-06,1.1e-05,8e-06,5e-06,7e-06,6e-06,8e-06,7e-06,6e-06,8e-06,1.7e-05,2e-06,5e-06,5e-06,4e-06,7e-06,9e-06,5e-06,2e-06,2e-06,4e-06,4e-06,1e-06,5e-06,7e-06,5e-06,7e-06,5e-06,7.5e-05,0.000156,6.6e-05,0.000287,0.000509,0.000225,0.000661,3e-05,0.000351,0.000245,0.000122,0.000157,8.7e-05,2.4e-05,3.2e-05,2.5e-05,0.000135,1e-04,6.3e-05,8e-05,6.1e-05,0.000133,0.000476,0.000468,0.000372,0.000495,0.000381,0.00082,0.000619,0.000614,0.000402,0.000634,0.000258,0.000311,0.000229,0.000127,0.000324,8.3e-05,0.000108,6.5e-05,0.000165,0.000189,6.4e-05,5.2e-05,2.5e-05,2.2e-05,2.2e-05,1e-05,2.4e-05,6.3e-05,3.9e-05,5e-06,2.1e-05,4.3e-05,3.3e-05,3e-05,9e-06,5e-05,2.7e-05,4.3e-05,3e-05,4.4e-05,3.2e-05,4.8e-05,3.8e-05,1.9e-05,2.5e-05,2.7e-05,9.2e-05,5.1e-05,5.5e-05,9e-06,7e-06,5.7e-05,0.000283,0.000268,0.000132,6.1e-05,2.8e-05,1.5e-05,0.000101,0.000169
9e-06,4e-06,9.1e-05,0.000166,7e-05,3e-05,6e-06,1.5e-05,5e-06,1.5e-05,6e-06,3e-06,6e-06,2e-06,5e-06,5e-06,2e-06,4e-06,3e-06,2e-06,2e-06,1e-05,6e-06,4e-06,6e-06,4e-06,1e-06,4e-06,4e-06,3e-06,2e-06,4e-06,4e-06,2e-06,3e-06,5e-06,6e-06,9e-06,3e-06,8e-05,0.000206,1e-04,0.000272,4.2e-05,0.000332,0.000292,0.00015,0.000339,0.00032,0.000244,0.000269,1.1e-05,8e-06,3.4e-05,3.6e-05,0.000157,0.000174,0.000135,7.5e-05,6.2e-05,8.7e-05,0.000324,0.000404,0.000302,0.000435,0.000526,0.000441,0.000291,0.000455,0.000428,0.000496,0.000268,0.000156,0.000167,0.000218,0.000228,0.000127,0.000159,5.8e-05,0.000127,0.000127,8.6e-05,4.3e-05,1.6e-05,4.9e-05,2.6e-05,1.3e-05,2.2e-05,5.9e-05,4.4e-05,1.1e-05,1.7e-05,1.9e-05,2.6e-05,2.6e-05,1.3e-05,4.5e-05,3.5e-05,1.9e-05,5.1e-05,3.7e-05,2.5e-05,5.7e-05,3e-05,1.4e-05,4.1e-05,9e-06,7.9e-05,3.4e-05,3.4e-05,1.8e-05,5e-06,4.4e-05,0.00015,0.000217,6.7e-05,5.9e-05,3e-06,1.5e-05,9.2e-05,0.000143
1e-05,1.8e-05,9.8e-05,4.9e-05,4.1e-05,3e-05,1.3e-05,1.8e-05,1.7e-05,1.7e-05,5e-06,3e-06,1e-06,4e-06,5e-06,3e-06,1e-06,1e-06,3e-06,2e-06,7e-06,7e-06,2e-06,3e-06,4e-06,3e-06,2e-06,2e-06,6e-06,3e-06,3e-06,7e-06,1e-06,3e-06,1e-06,4e-06,4e-06,4e-06,1e-06,8.3e-05,0.000229,0.000101,0.000235,0.000516,0.000348,0.000389,0.00014,0.000316,0.000157,6.6e-05,9.8e-05,9.2e-05,3.5e-05,1e-05,1.8e-05,0.000219,0.00026,9.5e-05,1.6e-05,1.6e-05,6e-05,0.000185,0.000448,0.000381,0.00035,0.000435,0.000417,0.000443,0.000503,0.000308,0.00029,0.000223,0.000321,0.000306,0.000226,0.000267,0.000186,0.000113,0.000107,3.9e-05,0.000198,8.8e-05,4.8e-05,1.1e-05,4.3e-05,2.2e-05,1.6e-05,6e-06,2e-05,3.1e-05,1.8e-05,1.4e-05,2.7e-05,7e-06,2.1e-05,6e-06,4.3e-05,3.5e-05,1.3e-05,6.1e-05,5.8e-05,3.6e-05,5.8e-05,1.4e-05,7e-06,2.7e-05,2.1e-05,6.5e-05,3.5e-05,4.1e-05,1.3e-05,1.9e-05,2.7e-05,0.000353,9e-05,4.5e-05,2.6e-05,1.3e-05,7e-06,8.8e-05,9.8e-05
5e-06,1.3e-05,7.9e-05,0.000129,3.1e-05,2.5e-05,7e-06,1.4e-05,2.4e-05,1.1e-05,6e-06,3e-06,5e-06,5e-06,2e-06,2e-06,5e-06,3e-06,1e-06,3e-06,4e-06,7e-06,6e-06,4e-06,3e-06,2e-06,4e-06,3e-06,3e-06,3e-06,4e-06,5e-06,2e-06,3e-06,3e-06,0,5e-06,3e-06,4e-06,8.1e-05,6.3e-05,4.7e-05,0.000224,0.000705,0.000426,0.000912,0.000295,0.00035,0.000119,7.8e-05,7.6e-05,5.4e-05,3.5e-05,1.7e-05,1.7e-05,0.000223,0.000305,0.000188,3.2e-05,3.6e-05,4.6e-05,0.000264,0.00033,0.000216,0.000278,0.00061,0.000325,0.000138,0.000546,0.000231,0.000395,9.9e-05,0.000208,0.000214,0.000218,0.000129,0.000131,0.00012,0.000113,3.3e-05,0.000118,6e-06,1.5e-05,2.3e-05,3.2e-05,5.4e-05,3.1e-05,1.6e-05,3.3e-05,2.7e-05,1.5e-05,1.4e-05,2.4e-05,2e-05,2.4e-05,9e-06,3.9e-05,3.1e-05,1.3e-05,7.5e-05,2e-05,5.4e-05,3.8e-05,4.3e-05,9e-06,2e-05,1.4e-05,4.2e-05,2.6e-05,3.2e-05,2.5e-05,3.4e-05,1.5e-05,0.000388,9.2e-05,4.2e-05,5.7e-05,2.9e-05,3e-05,7.5e-05,0.000154
7e-06,8e-06,7.3e-05,6.9e-05,5.2e-05,3.2e-05,1.3e-05,1.3e-05,1.5e-05,1e-05,1.3e-05,9e-06,7e-06,3e-06,3e-06,3e-06,2e-06,3e-06,3e-06,3e-06,4e-06,3e-06,1e-06,2e-06,2e-06,2e-06,2e-06,2e-06,3e-06,3e-06,3e-06,3e-06,4e-06,3e-06,2e-06,5e-06,6e-06,2e-06,3e-06,8.2e-05,8.5e-05,3.8e-05,0.000223,0.000461,3.6e-05,0.000563,0.000277,0.000349,0.000203,0.000146,6.6e-05,5.9e-05,3.5e-05,2.8e-05,2.7e-05,0.000224,0.000254,0.000125,5.4e-05,4.6e-05,4.2e-05,0.000263,0.000191,0.000179,0.000135,0.000413,0.000394,0.000169,0.000612,0.000158,9.9e-05,0.000498,0.000163,0.000246,0.000142,0.000187,3.5e-05,0.000161,9.2e-05,8.8e-05,0.000116,4e-06,4.4e-05,1.7e-05,2.3e-05,3.8e-05,1.7e-05,6e-06,4e-05,2.2e-05,8e-06,1.7e-05,1.9e-05,1.8e-05,2.6e-05,1.9e-05,2.8e-05,1.9e-05,5e-06,5.7e-05,4.4e-05,3.5e-05,5.7e-05,8e-06,3.3e-05,2.5e-05,1.3e-05,3.2e-05,2.1e-05,2.2e-05,1.5e-05,2e-05,4.1e-05,0.000332,9.9e-05,3e-05,3.7e-05,1.6e-05,1.9e-05,5.8e-05,0.00015
5e-06,1.3e-05,7e-05,3.9e-05,1.4e-05,2.6e-05,2.4e-05,3e-05,6e-06,5e-06,4e-06,7e-06,1e-06,3e-06,2e-06,1e-06,3e-06,2e-06,2e-06,3e-06,2e-06,3e-06,4e-06,2e-06,2e-06,4e-06,3e-06,3e-06,1e-06,3e-06,2e-06,1e-06,2e-06,2e-06,4e-06,4e-06,1e-06,3e-06,2e-06,7.9e-05,6.3e-05,2.4e-05,0.000185,8e-05,0.000332,0.000511,0.000333,0.000277,0.000138,9.4e-05,6.4e-05,3.4e-05,1.7e-05,1.6e-05,1e-06,0.000231,0.000234,0.000182,0.000177,1e-04,9.2e-05,0.000218,0.00031,0.000207,0.00027,0.000211,0.000149,0.000135,0.000465,2.7e-05,0.000127,0.000154,0.000129,5.2e-05,4.9e-05,0.000293,9.2e-05,0.000123,7.2e-05,4.8e-05,0.000198,4.3e-05,1.8e-05,3.4e-05,4.7e-05,1.2e-05,1.2e-05,1.2e-05,1e-05,2.2e-05,1.6e-05,1.8e-05,2.2e-05,3.1e-05,1.4e-05,9e-06,7e-06,3.5e-05,1e-05,1.4e-05,2.9e-05,1.2e-05,1.8e-05,3.9e-05,2.9e-05,1.6e-05,7e-06,2.2e-05,3.5e-05,3e-05,5e-06,8e-06,2.1e-05,0.000248,5.9e-05,6.8e-05,4.7e-05,5.3e-05,2.3e-05,6.8e-05,0.00011
1.2e-05,7e-06,7.4e-05,5.6e-05,1.7e-05,2.4e-05,1.4e-05,1.7e-05,2e-06,5e-06,3e-06,1.1e-05,6e-06,5e-06,3e-06,3e-06,5e-06,5e-06,4e-06,7e-06,2e-06,1e-06,5e-06,3e-06,2e-06,3e-06,2e-06,1e-06,1e-06,2e-06,3e-06,5e-06,2e-06,2e-06,4e-06,3e-06,0,3e-06,6e-06,7.3e-05,8.8e-05,5.7e-05,0.000146,0.00035,0.000382,0.000254,0.000205,0.000236,9.1e-05,7.7e-05,8.4e-05,3.5e-05,3e-06,1.7e-05,2e-05,0.000201,0.000208,0.000148,5.1e-05,4.7e-05,6.6e-05,0.000115,0.000295,0.00019,0.000317,0.00017,0.000209,0.000261,0.000319,0.000355,0.000161,0.000285,0.000221,0.00026,8.1e-05,0.000269,0.000222,0.000195,9.2e-05,8.8e-05,7e-05,8.6e-05,4.6e-05,4.3e-05,9e-06,3.2e-05,2.1e-05,1.9e-05,3.7e-05,3.1e-05,5.4e-05,3.6e-05,3.3e-05,8e-06,3.6e-05,3.1e-05,3.8e-05,2.6e-05,2.4e-05,2.3e-05,4.2e-05,1e-05,4.8e-05,7.4e-05,2.8e-05,1.2e-05,2.4e-05,2.9e-05,1.9e-05,3.6e-05,1.8e-05,2.1e-05,3.7e-05,0.000207,0.000151,6.6e-05,3.1e-05,5.8e-05,3.5e-05,9.8e-05,0.000112
5e-06,4e-06,6.7e-05,1.9e-05,3.7e-05,4.3e-05,2e-05,8e-06,8e-06,1e-06,4e-06,1.1e-05,1e-05,8e-06,3e-06,7e-06,3e-06,6e-06,2e-06,7e-06,5e-06,8e-06,6e-06,2e-06,4e-06,1e-06,2e-06,2e-06,3e-06,1e-06,2e-06,5e-06,3e-06,4e-06,5e-06,3e-06,3e-06,1e-06,8e-06,6.8e-05,0.000126,2e-05,0.000163,0.000366,0.000562,0.000128,0.000148,0.000245,0.000139,0.000114,0.000117,7.7e-05,1.5e-05,1.5e-05,5e-06,0.00018,7.8e-05,1.7e-05,5.3e-05,5.5e-05,6.8e-05,0.000142,0.000208,0.000139,0.000239,0.000101,0.000269,0.000146,0.000332,0.000362,0.000196,0.000581,0.000264,7.5e-05,0.000181,0.000147,9.7e-05,0.000191,0.000189,0.00014,6.5e-05,6.7e-05,3.2e-05,3.2e-05,1.4e-05,4.7e-05,3.2e-05,2.6e-05,7.1e-05,4.5e-05,4.7e-05,2.1e-05,4.5e-05,3.6e-05,4.5e-05,1.1e-05,2.4e-05,4.4e-05,4e-05,2.9e-05,2e-05,1.3e-05,4.3e-05,4e-05,4.2e-05,3.4e-05,2.7e-05,4.5e-05,4.7e-05,1.3e-05,8e-06,2.5e-05,5.4e-05,0.000159,0.000126,9.9e-05,4.8e-05,2.2e-05,1.3e-05,0.000116,5.1e-05
8e-06,5e-06,5.9e-05,2.4e-05,2.4e-05,1.5e-05,4e-06,7e-06,6e-06,9e-06,8e-06,5e-06,5e-06,7e-06,6e-06,5e-06,4e-06,3e-06,2e-06,5e-06,2e-06,7e-06,5e-06,6e-06,5e-06,4e-06,2e-06,1e-06,6e-06,5e-06,2e-06,2e-06,2e-06,5e-06,3e-06,5e-06,4e-06,1e-06,1.1e-05,6e-05,8.7e-05,4.7e-05,0.00014,0.000251,0.000178,0.000475,0.00017,0.000302,8.2e-05,0.000111,1e-04,6.7e-05,3.2e-05,1.4e-05,1.8e-05,0.00019,8e-05,3.2e-05,2.6e-05,4.2e-05,5.3e-05,0.00032,0.000138,0.000123,0.000236,0.000274,0.000387,0.000278,0.000307,0.000193,0.000169,0.000369,0.000169,7e-05,0.000165,0.000289,7.3e-05,8.4e-05,7.2e-05,5.4e-05,8.9e-05,5.9e-05,5.3e-05,1.1e-05,4e-05,3e-05,1.1e-05,1.6e-05,7.9e-05,3.9e-05,2.8e-05,2.4e-05,4.4e-05,4.3e-05,4.7e-05,3.3e-05,2.6e-05,4.8e-05,2.1e-05,6.1e-05,1.3e-05,1.3e-05,8e-06,5.8e-05,1.3e-05,4.2e-05,2.2e-05,4.1e-05,4.5e-05,3e-05,1e-06,2.3e-05,4.1e-05,0.000144,4.1e-05,3.7e-05,4.6e-05,2e-06,1e-05,9.6e-05,0.00011
5e-06,9e-06,5.3e-05,9.2e-05,5.9e-05,3.2e-05,1.2e-05,2e-05,1.4e-05,1.5e-05,1.6e-05,1.1e-05,1.1e-05,1.9e-05,4e-06,5e-06,4e-06,9e-06,5e-06,8e-06,4e-06,4e-06,5e-06,9e-06,9e-06,5e-06,7e-06,4e-06,4e-06,1e-06,3e-06,5e-06,3e-06,3e-06,8e-06,8e-06,4e-06,6e-06,1.6e-05,5.7e-05,9.7e-05,8e-05,0.000154,0.000466,0.000233,0.000514,0.000358,0.000214,5.5e-05,9e-06,4.6e-05,1.7e-05,2.4e-05,1.1e-05,1e-05,0.000209,3.8e-05,6e-05,4.1e-05,7.4e-05,5.3e-05,0.000281,0.000226,0.000138,0.000215,0.000525,0.000252,0.000267,0.00019,0.000213,0.000127,0.000211,0.000147,0.000116,9.5e-05,0.000357,0.000265,0.000221,3.1e-05,7.8e-05,9.8e-05,7e-05,3.7e-05,5.4e-05,4.1e-05,3.9e-05,3e-05,3.6e-05,2.4e-05,1.7e-05,1.8e-05,2e-06,8e-06,2.2e-05,3.7e-05,3.4e-05,8e-06,2.4e-05,3.4e-05,2.6e-05,3.3e-05,3.1e-05,4.2e-05,6.4e-05,7.6e-05,1.4e-05,2e-06,5.3e-05,2e-05,2.8e-05,2.6e-05,5e-06,3.1e-05,0.000131,0.000111,1.8e-05,1.8e-05,4.9e-05,3.7e-05,5.9e-05,2.5e-05
9e-06,1.4e-05,3.4e-05,0.000148,4.7e-05,1.4e-05,1.6e-05,1.7e-05,1.1e-05,1.7e-05,2.9e-05,1.1e-05,1.1e-05,1.8e-05,2e-05,1.2e-05,7e-06,1.8e-05,1.2e-05,1.5e-05,1.6e-05,1.2e-05,5e-06,1.2e-05,7e-06,2e-06,8e-06,3e-06,2e-06,4e-06,8e-06,1e-05,1.1e-05,1e-05,1.5e-05,6e-06,0,5e-06,2.6e-05,1.9e-05,0.000265,0.000126,0.000109,0.000528,0.000246,0.000549,0.000477,8e-05,9.8e-05,0.000129,9.1e-05,5.1e-05,5.3e-05,3.3e-05,2.7e-05,0.000239,0.000213,0.000127,3.5e-05,5.2e-05,4.9e-05,0.000242,0.000156,0.000125,0.000233,0.000441,0.00029,0.00024,0.000212,0.000193,0.000108,0.000259,0.000301,0.000293,0.000156,0.000113,8.3e-05,8.8e-05,6e-05,8.4e-05,8.4e-05,0.000106,7.4e-05,1.8e-05,3.4e-05,6e-06,3.5e-05,2.1e-05,7e-06,4e-05,2.4e-05,8e-06,9e-06,1.8e-05,2.7e-05,1.2e-05,3.1e-05,3.5e-05,3.4e-05,5e-05,2.2e-05,4.2e-05,5.4e-05,6.5e-05,3.4e-05,4.3e-05,2.5e-05,6.4e-05,4e-06,2.9e-05,3.3e-05,3.4e-05,4.7e-05,0.000172,0.000111,5.2e-05,1.6e-05,3.9e-05,1e-05,3.8e-05,0.000151
9e-06,8e-06,5.1e-05,0.000132,8.6e-05,3.7e-05,1.3e-05,3.3e-05,2.2e-05,4e-06,1.7e-05,1.8e-05,1.5e-05,8e-06,1.4e-05,8e-06,1.7e-05,1.6e-05,1.1e-05,1e-05,1e-05,3e-06,5e-06,1.2e-05,1.5e-05,1e-05,3e-06,6e-06,3e-06,4e-06,1.2e-05,1.3e-05,9e-06,2e-06,1.3e-05,1.2e-05,9e-06,6e-06,2.3e-05,4.6e-05,0.00033,0.00016,6.2e-05,0.000266,0.00012,0.000419,0.000361,0.00028,7.2e-05,9.1e-05,0.000192,8.5e-05,2.7e-05,1.5e-05,1.7e-05,0.000205,0.000283,8.6e-05,8e-06,6.7e-05,8.6e-05,0.000269,0.000127,0.000158,0.000216,0.00031,7.8e-05,0.000171,0.000248,0.000102,6.7e-05,0.000259,0.000201,3.1e-05,0.000157,0.000182,5e-05,5.3e-05,5.2e-05,8.3e-05,6.4e-05,3.8e-05,2.4e-05,4.3e-05,2.2e-05,4.2e-05,4.4e-05,1.2e-05,3.9e-05,3.8e-05,7e-06,5e-06,1e-05,2e-05,7e-06,1.8e-05,2.9e-05,3.5e-05,4.1e-05,4.9e-05,5.2e-05,3e-05,5e-06,4.1e-05,7e-06,7e-06,2.1e-05,6.2e-05,3.6e-05,4.4e-05,3e-06,3e-05,4.5e-05,0.000232,0.000173,0.000118,2.9e-05,1.4e-05,1.5e-05,5.5e-05,0.000111
5e-06,1e-05,5.1e-05,9.7e-05,4.4e-05,1.5e-05,9e-06,3e-05,1.3e-05,1.2e-05,1.3e-05,1.8e-05,7e-06,1.1e-05,7e-06,1e-05,7e-06,5e-06,1e-06,9e-06,3e-06,1e-06,1e-06,6e-06,5e-06,4e-06,5e-06,2e-06,6e-06,9e-06,7e-06,8e-06,4e-06,3e-06,8e-06,2e-06,5e-06,1e-06,9e-06,3.9e-05,0.000268,0.000116,7.7e-05,0.000112,2.3e-05,0.000469,0.000191,0.00026,0.00021,7.5e-05,0.00013,6.3e-05,3.7e-05,6e-06,2.2e-05,0.00019,0.000502,0.000183,5.2e-05,0.000155,5.9e-05,0.000344,0.000259,0.00011,0.000191,0.000242,0.000341,0.000104,0.000268,0.00016,0.000123,0.000384,4.1e-05,0.000143,0.000254,0.000139,0.000108,0.000148,8.1e-05,2.5e-05,9.1e-05,0.000162,9.5e-05,6.8e-05,1.1e-05,1.7e-05,9.4e-05,3.6e-05,4e-05,9e-06,1.1e-05,1.5e-05,1.3e-05,3.4e-05,2e-05,3.8e-05,4.3e-05,3.3e-05,3.8e-05,6e-05,7.3e-05,3.2e-05,1.6e-05,1.7e-05,3e-05,6e-06,3e-05,6.7e-05,2.4e-05,7e-06,1.2e-05,1.6e-05,6.6e-05,0.000281,0.000211,7.5e-05,4e-05,3.8e-05,2.3e-05,5.6e-05,5.3e-05
4e-06,6e-06,3.2e-05,8.5e-05,4.3e-05,1.6e-05,8e-06,1.8e-05,3e-06,2e-06,8e-06,6e-06,5e-06,7e-06,1e-06,2e-06,2e-06,3e-06,1e-06,4e-06,1e-06,2e-06,2e-06,1e-06,3e-06,3e-06,3e-06,2e-06,4e-06,2e-06,2e-06,1e-06,2e-06,3e-06,4e-06,4e-06,5e-06,7e-06,6e-06,2.9e-05,0.000133,0.000117,5.7e-05,0.000335,0.00029,0.000341,0.000101,0.000104,0.000119,9.7e-05,9e-05,1.2e-05,3.1e-05,2.1e-05,1.6e-05,0.000171,0.000887,0.000618,0.000324,0.000273,0.000211,0.000178,0.000212,0.000138,0.00018,0.000236,0.000421,0.000223,0.000155,0.000116,6.2e-05,0.000446,0.000151,9.5e-05,0.000281,0.000335,0.000192,0.000321,0.000172,5.5e-05,0.000112,5.3e-05,4.2e-05,4.9e-05,6.7e-05,1.8e-05,7.7e-05,0.000128,4.6e-05,8.7e-05,2.9e-05,2.6e-05,2.6e-05,5.8e-05,2.7e-05,3e-05,5.7e-05,4.2e-05,3.1e-05,4.7e-05,4e-06,6e-06,1.3e-05,4e-06,2.1e-05,3.1e-05,9e-06,4.7e-05,7.7e-05,5.4e-05,2.6e-05,4e-06,0.00011,0.000402,0.000321,0.000204,0.000101,5e-05,3.8e-05,3.6e-05,7.3e-05
1.5e-05,7e-06,2.2e-05,3.2e-05,6e-06,1.1e-05,8e-06,2e-05,2e-06,1e-06,4e-06,4e-06,2e-06,1e-06,2e-06,2e-06,2e-06,2e-06,1e-06,1e-06,4e-06,3e-06,1e-06,3e-06,2e-06,2e-06,2e-06,1e-06,3e-06,3e-06,1e-06,1e-06,2e-06,1e-06,2e-06,2e-06,3e-06,3e-06,6e-06,2.5e-05,4.2e-05,8.9e-05,0.000117,0.000464,0.000369,0.000311,0.000329,0.000259,8.2e-05,4.9e-05,6.8e-05,0.000116,4.5e-05,1.8e-05,6e-06,0.000163,0.000951,0.000623,0.000243,0.000235,9.8e-05,8.5e-05,0.000175,7e-05,0.000118,0.000321,0.000157,0.000223,0.000226,1e-04,9.6e-05,0.000274,0.000332,0.000112,0.000262,0.000112,3.4e-05,9.7e-05,0.00013,0.000196,0.000205,8.4e-05,4e-05,0.000116,0.000108,9.8e-05,8.7e-05,7.9e-05,1e-04,0.000119,5.8e-05,1.3e-05,9e-06,4e-05,5e-05,2.1e-05,8e-06,2.9e-05,1.6e-05,3.1e-05,3.1e-05,8e-06,3e-06,2.4e-05,1.7e-05,2.6e-05,2.2e-05,1.1e-05,4.8e-05,3.1e-05,2e-05,1.5e-05,8.8e-05,0.000283,0.000119,7.9e-05,6e-06,2.6e-05,3.8e-05,1.8e-05,6.5e-05
5e-06,9e-06,4.4e-05,6.8e-05,2.8e-05,1.5e-05,8e-06,1.4e-05,3e-06,2e-06,5e-06,4e-06,4e-06,4e-06,2e-06,3e-06,2e-06,1e-06,1e-06,1e-06,1e-06,1e-06,1e-06,1e-06,1e-06,2e-06,1e-06,1e-06,2e-06,1e-06,0,3e-06,1e-06,1e-06,0,2e-06,2e-06,2e-06,5e-06,1.8e-05,3e-05,3.1e-05,0.000108,0.000391,4.9e-05,6.2e-05,0.000142,0.000141,7.9e-05,4.4e-05,0.00011,3.1e-05,1.1e-05,8e-06,6e-06,0.000129,0.00061,0.000302,0.000146,0.000154,9.5e-05,0.000112,0.000161,3.5e-05,0.000118,0.000259,0.000203,0.00017,0.000191,5.8e-05,0.000111,5.2e-05,0.000165,7.9e-05,0.000171,0.000141,8.3e-05,0.000129,0.000103,6.8e-05,5.2e-05,1.7e-05,1.1e-05,7.5e-05,9e-06,3.3e-05,2.5e-05,4.1e-05,4.9e-05,1.6e-05,1.7e-05,3.7e-05,4.3e-05,2e-05,2.2e-05,1.3e-05,5e-06,3.1e-05,2.7e-05,1.4e-05,5e-06,2.1e-05,2.8e-05,2.6e-05,3.2e-05,1.8e-05,2e-06,2.6e-05,6e-06,3.8e-05,3e-06,7e-06,6e-05,0.000154,0.000112,1.2e-05,3.8e-05,3.4e-05,2.2e-05,3.6e-05,5.7e-05
1e-06,5e-06,4e-05,6e-05,1.2e-05,8e-06,4e-06,1.8e-05,2e-06,3e-06,4e-06,1e-06,2e-06,4e-06,0,1e-06,1e-06,1e-06,1e-06,1e-06,1e-06,1e-06,1e-06,0,1e-06,0,1e-06,0,2e-06,1e-06,1e-06,2e-06,2e-06,1e-06,0,1e-06,2e-06,2e-06,4e-06,1.8e-05,3.8e-05,1.2e-05,8.9e-05,0.000381,0.000167,0.000182,0.000124,9.1e-05,1.2e-05,5.1e-05,7.4e-05,2.3e-05,1.7e-05,8e-06,6e-06,9.7e-05,0.000269,6.7e-05,2e-05,5.9e-05,5.2e-05,0.00016,0.000218,0.000119,0.000124,0.00014,7.9e-05,0.000115,0.000157,9.5e-05,8.5e-05,0.000205,3.1e-05,7e-05,9.3e-05,0.000147,4.6e-05,0.000145,1.5e-05,3.6e-05,7.3e-05,5e-06,1.4e-05,3.1e-05,2.8e-05,1.1e-05,9e-06,1.9e-05,1.7e-05,3.3e-05,1.3e-05,5e-06,2.2e-05,9e-06,1.3e-05,2e-06,1.4e-05,2.7e-05,1.8e-05,5e-06,1.1e-05,5e-06,1.8e-05,1.2e-05,1.2e-05,4e-06,7e-06,2.1e-05,1.9e-05,1.9e-05,9e-06,5e-06,3.7e-05,6.7e-05,3.9e-05,3.4e-05,9e-06,3.7e-05,1.4e-05,3e-05,1e-04
2e-06,3e-06,4e-05,7e-06,2.1e-05,8e-06,2e-06,1.5e-05,5e-06,1e-06,2e-06,1e-06,3e-06,2e-06,1e-06,1e-06,2e-06,1e-06,0,2e-06,1e-06,1e-06,2e-06,0,0,0,1e-06,1e-06,1e-06,1e-06,0,2e-06,1e-06,1e-06,0,1e-06,2e-06,2e-06,3e-06,1.6e-05,2.6e-05,6e-06,0.000107,0.000419,0.000185,1.6e-05,2.8e-05,0.000127,8.8e-05,2.3e-05,6e-05,3.3e-05,1.1e-05,1.2e-05,2e-06,7.2e-05,0.00012,6.4e-05,1.5e-05,3.3e-05,5.7e-05,0.000181,0.000199,7.7e-05,0.000126,4.6e-05,0.000174,0.000156,0.000184,7.8e-05,0.000125,0.000189,6.9e-05,8.2e-05,8.7e-05,0.000117,4.5e-05,9.9e-05,1.6e-05,3.9e-05,6.5e-05,1e-05,2.2e-05,1.7e-05,1.5e-05,8e-06,1.5e-05,1.2e-05,7e-06,2e-05,4e-06,3e-06,1.9e-05,7e-06,1.3e-05,4e-06,1.3e-05,2.5e-05,1.7e-05,4e-06,1.3e-05,1e-06,2e-05,4e-06,2e-05,7e-06,4e-06,2.4e-05,1.1e-05,1.7e-05,3e-06,3e-06,2.8e-05,9.1e-05,4.4e-05,1e-05,1.3e-05,7e-06,5e-06,3.3e-05,0.000101
2e-06,2e-06,3.9e-05,3.2e-05,9e-06,1e-06,1e-06,1.2e-05,3e-06,2e-06,4e-06,1e-06,2e-06,0,1e-06,1e-06,1e-06,0,1e-06,1e-06,1e-06,1e-06,2e-06,0,1e-06,0,0,0,1e-06,1e-06,0,2e-06,1e-06,1e-06,0,1e-06,1e-06,2e-06,3e-06,1.6e-05,3e-05,2e-06,0.000111,0.000272,2.3e-05,1.5e-05,2.9e-05,0.00014,7.7e-05,6e-06,7.1e-05,3e-05,7e-06,6e-06,3e-06,5.4e-05,3.4e-05,1.9e-05,3e-06,2.6e-05,5.5e-05,0.000182,0.00015,8.1e-05,0.000129,9.5e-05,0.00012,0.00011,0.000209,2.3e-05,4.5e-05,0.000204,5.1e-05,9.5e-05,0.000114,9.7e-05,5.7e-05,0.000107,2.1e-05,3.7e-05,6.3e-05,5e-06,1.7e-05,1.1e-05,1.9e-05,5e-06,1.2e-05,1.1e-05,3e-06,2.1e-05,3e-06,4e-06,1.7e-05,9e-06,1.1e-05,3e-06,1.4e-05,2.3e-05,1.8e-05,2e-06,1.1e-05,3e-06,1.9e-05,5e-06,1.7e-05,9e-06,2e-06,3.1e-05,1.7e-05,1.9e-05,3e-06,4e-06,3.1e-05,0.000135,1.6e-05,1e-05,2.5e-05,1.2e-05,6e-06,3.5e-05,9.2e-05
