-0.001676,-0.00169,-0.0018,-0.002429,-0.001694,-0.00184,-0.002625,-0.002539,-0.001729,-0.001555,-0.002903,-0.002921,-0.00207,-0.002264,-0.002434,-0.00178,-0.001622,-0.001554,-0.001681,-0.001463,-0.002367,-0.002675,-0.002355,-0.002695,-0.0021,-0.001081,-0.001459,-0.001337
-0.000367,-0.000144,6e-06,-0.000606,-0.000356,-0.000691,-0.001475,-0.000359,-0.000208,-0.00128,-0.002326,-0.001318,-0.000984,-0.000678,0.000471,-4.8e-05,0.000178,1e-04,0.00014,-0.000631,-0.000981,-0.000338,-0.000271,2.3e-05,-0.000296,-0.000556,-0.000723,-0.00066
0.000369,0.000484,5.6e-05,-0.000419,-0.000623,-2.7e-05,0.000326,0.000245,-0.000153,-0.00036,-6.3e-05,0.000102,-0.000159,0.000314,0.000489,-2e-05,0.000198,0.000292,5.6e-05,9.3e-05,0.000338,0.000638,0.000729,0.000758,0.000268,0.000157,0.000419,0.000255
8.2e-05,3.8e-05,-0.000484,-0.000681,-0.001386,-0.000193,0.000755,-0.000462,-0.000588,0.000529,0.001646,0.000593,-4.4e-05,0.000246,-0.000844,-0.000784,-0.00072,-0.000455,-0.000635,0.000174,0.00066,5.1e-05,4.8e-05,-0.000486,-0.00066,7.4e-05,0.000305,0.00019
0.000272,0.000282,0.000762,0.001315,0.000348,0.000354,0.000533,0.00066,0.000784,0.001046,0.001763,0.001537,0.000681,0.000851,0.001083,0.000618,0.000383,0.00031,0.000795,0.000453,0.000859,0.000782,0.000282,8.7e-05,-0.000268,-0.000171,-0.000233,-9.7e-05
-0.000337,-0.00038,1.1e-05,0.000133,0.000157,-0.000312,-0.000991,-0.000179,0.00023,-0.000204,-0.001016,-0.000436,-0.000344,-0.000473,0.00038,0.000253,0.000121,-0.000128,0.000192,-0.000272,-0.000755,-0.000401,-0.000627,-0.000628,-0.000617,-0.000503,-0.000659,-0.000528
-0.000706,-0.000859,-0.001295,-0.002234,-0.001338,-8e-04,-0.00128,-0.001472,-0.001125,-0.001244,-0.002689,-0.002539,-0.001387,-0.001785,-0.002186,-0.001252,-0.000999,-0.000943,-0.001423,-0.000915,-0.001682,-0.00173,-0.001191,-0.001135,-0.000597,-0.000279,-0.000297,-0.000332
0.00059,0.000609,0.000533,0.00024,0.000724,0.000993,0.001169,0.000864,0.000418,3.6e-05,6.2e-05,0.000131,0.000584,0.000594,0.000413,0.000594,0.000651,0.000662,3e-04,0.000296,0.000549,0.000714,0.001102,0.001715,0.00175,0.00077,0.000829,0.000716
0.000687,0.000789,0.001243,0.002191,0.002211,0.001234,0.001588,0.001528,0.000997,0.001105,0.002485,0.002281,0.00168,0.001963,0.002195,0.001353,0.001169,0.001037,0.001321,0.000993,0.001618,0.001677,0.001428,0.001852,0.001815,0.000883,0.000797,0.000671
-0.000601,-0.000632,-0.000478,0.000282,0.000263,-0.000576,-0.000535,-0.000931,-0.000636,0.000456,0.001303,0.000535,0.000248,-1e-05,-0.000881,-0.000774,-0.000842,-0.000718,-0.000462,-2.4e-05,7.6e-05,-0.000662,-0.000937,-0.001533,-0.001021,-0.000137,-0.000364,-0.000321
-0.000318,-0.000316,-0.000353,1.4e-05,-0.000165,-0.000443,-0.000743,-0.000435,-0.000226,-0.000286,-0.000669,-0.000377,-0.000187,-0.00072,-0.001125,-0.000659,-0.000513,-0.00023,-0.000279,-0.000412,-0.000421,-0.000574,-0.000739,-0.001156,-0.001115,-0.000477,-0.000415,-0.000199
0.00069,0.000776,0.000554,0.000588,0.000636,0.000483,0.000246,0.001186,0.000804,-0.000624,-0.001585,-0.000279,-5.5e-05,-3.1e-05,0.001206,0.001092,0.001123,0.001018,0.000847,7.9e-05,-1.1e-05,0.000867,0.000873,0.001365,0.000895,4.9e-05,0.000377,4e-04
1.1e-05,-8.8e-05,-0.000593,-0.001577,-0.001293,-0.000597,-0.000279,-0.000489,-0.000558,-0.000857,-0.001515,-0.001501,-0.001214,-0.000774,-0.00036,-0.000117,-0.000118,-0.000363,-0.000589,-0.000217,-0.000622,-0.000542,-5.7e-05,0.000211,0.000207,-8.2e-05,-1.2e-05,-0.000201
-0.000607,-0.00062,-0.000729,-0.00179,-0.002063,-0.000872,-0.000291,-0.001062,-0.000846,1.3e-05,0.000392,-0.000613,-0.00085,-0.00044,-0.001149,-0.000908,-0.00092,-0.000974,-0.000955,-0.000355,-0.000373,-0.000997,-0.000709,-0.00125,-0.00135,-0.000471,-0.000702,-0.000719
0.000138,0.000365,0.000694,0.000959,0.000375,0.000513,0.000578,0.000749,0.000664,0.001098,0.002124,0.00192,0.000995,0.001181,0.001402,0.000608,0.000393,0.00042,0.00078,0.000354,0.000811,0.000948,0.000349,-0.00018,-0.000696,-0.000107,-0.000109,5.2e-05
0.000389,0.000333,0.000404,0.00099,0.000852,0.000499,5.8e-05,0.000266,0.000376,0.000497,0.000708,0.000941,0.000725,0.000373,0.000546,0.000147,0.000116,0.000306,0.000459,0.00033,0.000281,0.000661,0.000231,0.000273,0.000336,0.000237,0.000607,0.000642
-0.000118,-0.000329,-0.00027,-0.000399,-0.000273,-0.000106,-0.000516,-0.000742,-0.000344,-0.000463,-0.001342,-0.001268,-0.000484,-0.00103,-0.001573,-0.00077,-0.000568,-0.000388,-0.000598,-0.000209,-0.000765,-0.000796,-0.000278,0.000209,0.000665,0.000108,0.000278,0.000201
-0.000275,-0.000226,0.000166,0.000283,0.000511,0.000297,0.000131,0.000321,0.000219,-0.00038,-0.000988,-0.000774,-0.000315,-0.000156,0.000194,0.000383,0.000416,0.00013,9.7e-05,9e-06,-0.000176,-0.000153,0.00015,0.000711,0.000845,9.7e-05,-0.000287,-0.000366
-8.2e-05,-2.8e-05,3.4e-05,0.000304,0.000706,0.000122,0.000374,0.000403,5.8e-05,-3.5e-05,0.000331,0.000106,7.3e-05,0.000655,0.000979,0.000438,0.000348,-3.1e-05,0.000138,0.00028,0.000565,0.000306,3.3e-05,1.4e-05,6.4e-05,0.000173,-0.000315,-0.000399
