0.015466,0.015943,0.02716,0.33025,0.842267,0.839529,0.549532,0.612019,0.734327,0.631002,0.587471,0.637831,0.602314,0.557479,0.561886,0.547392,0.425949,0.302162,0.284826,0.288801,0.20326,0.116275,0.095686,0.075695,0.058662,0.050961,0.047798,0.03782
0.018274,0.01977,0.032934,0.3687,0.935135,0.930835,0.607896,0.689112,0.840808,0.739284,0.698023,0.733513,0.689083,0.650662,0.651883,0.628881,0.488255,0.345358,0.325375,0.34118,0.247271,0.139633,0.111603,0.08743,0.068295,0.059406,0.054882,0.043922
0.02249,0.025892,0.041864,0.40371,1.01026,1.003217,0.668095,0.812641,1.02877,0.93701,0.898099,0.91225,0.861523,0.828133,0.817249,0.767931,0.581122,0.403135,0.378259,0.421082,0.322003,0.179686,0.136267,0.104861,0.082526,0.071149,0.064257,0.052984
0.024302,0.028726,0.045672,0.366114,0.892242,0.885561,0.642713,0.920262,1.227146,1.168456,1.138031,1.136098,1.096004,1.045884,1.002314,0.905724,0.642151,0.41816,0.384724,0.465008,0.384772,0.216067,0.154241,0.117149,0.09231,0.076738,0.067492,0.058258
0.024175,0.027241,0.04512,0.32301,0.750384,0.739239,0.616368,1.063106,1.483461,1.491434,1.499181,1.472164,1.420487,1.333538,1.261919,1.098561,0.706631,0.41559,0.372587,0.488357,0.428561,0.238154,0.163958,0.125099,0.097872,0.078526,0.066681,0.058907
0.024348,0.025111,0.046408,0.358511,0.799123,0.759502,0.705342,1.346116,1.904679,2.016297,2.108745,2.05233,1.939731,1.792755,1.722137,1.498899,0.883666,0.439024,0.381348,0.513715,0.444648,0.238328,0.167612,0.132338,0.102699,0.084301,0.072591,0.061422
0.027123,0.028148,0.054648,0.45514,1.028806,0.967085,0.967533,1.977296,2.81559,3.066863,3.253608,3.173763,3.038512,2.807081,2.707308,2.383713,1.363874,0.587277,0.466403,0.564679,0.452664,0.259698,0.210267,0.176758,0.136967,0.120405,0.107393,0.083565
0.034594,0.036865,0.069816,0.562722,1.297163,1.242715,1.429079,3.23666,4.654443,5.097683,5.422423,5.32799,5.184101,4.817505,4.613641,4.066233,2.376642,1.001022,0.71173,0.736522,0.564074,0.383485,0.341187,0.294848,0.226557,0.203273,0.189239,0.146657
0.046017,0.0481,0.086598,0.660698,1.538859,1.501393,2.098722,5.192278,7.422036,8.11781,8.75297,8.71075,8.475343,7.885602,7.497617,6.600045,4.002501,1.703323,1.106016,1.036698,0.774684,0.583283,0.537094,0.474232,0.361778,0.321965,0.30863,0.242655
0.055503,0.055618,0.097447,0.782702,1.818229,1.743168,2.902828,7.650083,10.844833,11.714642,12.696977,12.870767,12.50152,11.624817,11.047749,9.764658,6.127361,2.609928,1.584375,1.421421,1.046337,0.813163,0.75351,0.690658,0.52116,0.443973,0.433653,0.349489
0.059105,0.056923,0.098524,0.901086,2.088178,1.953409,3.649514,9.858958,14.044112,15.005587,15.844218,16.11134,15.768538,14.848019,14.262729,12.744876,8.200817,3.439915,1.991911,1.779216,1.295001,0.999998,0.923809,0.879602,0.651322,0.516425,0.506232,0.425435
0.058601,0.054975,0.095608,0.931779,2.174122,2.041542,4.019233,10.731646,15.476971,16.261944,16.270325,16.294886,16.084193,15.698545,15.390668,13.80309,9.044068,3.724703,2.089394,1.880127,1.357255,1.050856,0.97212,0.943743,0.680966,0.500452,0.480636,0.424071
0.058173,0.053115,0.094744,0.866823,1.992269,1.885353,3.696761,9.695542,14.162603,14.325799,13.356323,12.999257,12.753829,12.936397,12.989923,11.753446,7.81619,3.163606,1.744244,1.617465,1.177951,0.898194,0.838173,0.81864,0.579994,0.406219,0.370451,0.333218
0.053917,0.052074,0.099149,0.761923,1.613817,1.502503,2.758677,7.188261,10.628038,10.089968,8.672558,8.145674,7.725247,7.896361,8.099622,7.460773,4.993221,2.036093,1.152877,1.14929,0.850997,0.584484,0.550228,0.545772,0.394717,0.273954,0.229069,0.200718
0.046634,0.051581,0.103686,0.670867,1.308404,1.182605,1.794926,4.554648,6.698509,5.805074,4.755685,4.649052,4.13922,3.739029,3.742295,3.513508,2.279328,0.953311,0.675934,0.88088,0.662798,0.30566,0.266538,0.270583,0.218992,0.16197,0.12037,0.099335
0.047564,0.054175,0.106924,0.727866,1.445622,1.274096,1.445103,3.121848,4.448213,3.726116,3.216705,3.362938,2.735581,2.127869,2.117732,1.929987,1.039968,0.382247,0.460935,0.947574,0.753711,0.194903,0.109363,0.108433,0.106461,0.091056,0.064313,0.049546
0.055564,0.058173,0.104452,0.877304,1.901673,1.689909,1.40874,2.487666,3.648729,3.278389,3.0878,3.364946,2.659013,1.974379,1.793402,1.420837,0.67384,0.253557,0.526709,1.401065,1.14727,0.209853,0.06539,0.061308,0.057879,0.050337,0.038473,0.029661
0.060773,0.056338,0.103749,1.067908,2.486446,2.244746,1.497394,2.282606,3.538655,3.402307,3.352995,3.829065,3.255477,2.423309,1.931966,1.466847,0.778761,0.338137,0.77092,2.124989,1.732815,0.282013,0.07298,0.072841,0.060422,0.043832,0.036165,0.031174
0.061983,0.053356,0.11116,1.218861,3.029959,2.839723,1.689723,2.333955,3.723704,3.739021,3.825904,4.511646,4.137135,3.233626,2.566086,2.084617,1.217768,0.50757,1.044094,2.866856,2.323805,0.362365,0.098871,0.104096,0.081959,0.054784,0.045688,0.041345
0.065701,0.057731,0.124073,1.228575,3.220281,3.146813,1.908481,2.840214,4.522947,4.434252,4.469192,5.202342,4.933263,4.078714,3.50042,3.102495,1.85778,0.713386,1.225746,3.306234,2.672145,0.419551,0.134233,0.150624,0.116443,0.071274,0.057742,0.054588
0.072038,0.066467,0.130711,1.150137,2.985556,2.932078,1.935489,3.498756,5.768965,5.371789,4.686837,5.151146,5.098471,4.477636,4.304429,4.194238,2.556376,0.931471,1.26505,3.288147,2.674073,0.453151,0.171061,0.197452,0.155233,0.089788,0.067779,0.065762
0.073248,0.070137,0.123614,0.960343,2.340487,2.258862,1.821053,3.988731,6.613272,5.874912,4.190008,4.202995,4.507605,4.297958,4.636642,4.838176,3.015122,1.101184,1.248341,3.05813,2.521193,0.485822,0.198086,0.222815,0.185129,0.112608,0.076289,0.069149
0.073139,0.069164,0.108643,0.670646,1.547374,1.502422,1.625106,4.022762,6.443639,5.445966,3.293543,3.157027,3.73417,3.86964,4.386866,4.630611,3.011672,1.185235,1.182859,2.562458,2.138777,0.497543,0.2173,0.219579,0.193183,0.135226,0.085512,0.066174
0.073077,0.063157,0.088696,0.40862,0.880464,0.864753,1.309959,3.573202,5.386504,4.346779,2.596349,2.602136,3.091089,3.25196,3.581972,3.611015,2.484714,1.151002,1.034131,1.819674,1.552771,0.479669,0.23016,0.195903,0.18043,0.152702,0.096458,0.063347
0.067016,0.055975,0.073319,0.262068,0.471792,0.47095,1.107068,3.107872,4.329623,3.488103,2.371464,2.392438,2.643333,2.732219,2.870995,2.518501,1.728097,1.007385,0.834969,1.128197,1.000727,0.442115,0.2289,0.152402,0.143517,0.148116,0.09853,0.058725
0.050861,0.048211,0.064603,0.217951,0.330402,0.338506,1.109289,2.78232,3.461431,2.862538,2.214085,2.082744,2.184579,2.310622,2.328681,1.7571,1.148841,0.823976,0.673869,0.718233,0.627567,0.363604,0.201109,0.115304,0.105548,0.115516,0.083685,0.048696
0.032828,0.035835,0.053099,0.188467,0.269445,0.307649,1.187522,2.6574,2.839171,2.229536,2.047,1.950271,1.924202,1.993815,1.878921,1.412677,0.94612,0.675867,0.547565,0.563059,0.457728,0.270003,0.166074,0.091759,0.070946,0.07326,0.059338,0.036681
0.022229,0.023395,0.04258,0.167027,0.239506,0.284832,1.142958,2.680333,2.890752,2.144245,2.052904,2.003532,1.933102,1.839101,1.512243,1.26125,0.930527,0.585257,0.452126,0.453041,0.356665,0.211524,0.153084,0.080837,0.052163,0.051654,0.045085,0.034708
0.019876,0.019851,0.040946,0.151037,0.215021,0.26972,1.052761,2.495237,2.941968,2.376422,2.070532,1.816164,1.823638,1.776484,1.371525,1.251034,0.961725,0.550073,0.386854,0.320623,0.26231,0.180877,0.145522,0.075106,0.044276,0.046405,0.042624,0.035932
0.027976,0.027753,0.042659,0.127306,0.178479,0.247758,1.063897,2.281787,2.82907,2.628662,2.097775,1.542945,1.508271,1.642703,1.391312,1.318984,1.058983,0.622127,0.390782,0.288676,0.239918,0.151821,0.128146,0.077649,0.051027,0.051249,0.041308,0.032487
0.039676,0.038889,0.044842,0.102401,0.139726,0.213175,1.045209,2.016888,2.493853,2.555636,2.148263,1.62722,1.401385,1.476705,1.408105,1.327008,1.054558,0.650552,0.399298,0.363745,0.301136,0.149281,0.125686,0.087374,0.06502,0.065327,0.04263,0.026726
0.047155,0.045911,0.046272,0.083324,0.107607,0.186911,1.050487,1.924977,2.155969,2.07817,1.848227,1.607681,1.367947,1.375899,1.345615,1.168184,0.878594,0.574028,0.359772,0.428742,0.361608,0.162347,0.130298,0.093542,0.074828,0.076586,0.04505,0.022596
0.044041,0.042605,0.041952,0.077011,0.098223,0.161347,1.1104,2.168983,2.172359,1.731101,1.46636,1.392667,1.262061,1.221046,1.164734,0.899036,0.668314,0.472286,0.324543,0.448967,0.389164,0.173598,0.118599,0.082137,0.068924,0.074014,0.045452,0.021075
0.031303,0.029337,0.030062,0.072407,0.098022,0.136528,1.147955,2.308899,2.224132,1.767741,1.355795,1.113619,1.025554,1.065654,1.000243,0.616932,0.48046,0.393869,0.318041,0.432084,0.373715,0.180358,0.106295,0.062941,0.050569,0.057438,0.042411,0.020854
0.018963,0.014703,0.017628,0.067559,0.093252,0.115068,1.117349,2.108198,2.032117,1.806945,1.255265,0.785591,0.746619,0.917941,0.847645,0.501937,0.459575,0.410897,0.354684,0.444046,0.351171,0.170196,0.098966,0.059562,0.037765,0.039002,0.036856,0.023233
0.015769,0.00772,0.014098,0.072966,0.0965,0.106814,1.005056,1.693134,1.579979,1.537577,1.102866,0.568708,0.579553,0.799334,0.710522,0.48552,0.479925,0.43094,0.375903,0.467051,0.357675,0.143892,0.09342,0.072608,0.040158,0.035364,0.032615,0.023031
0.016935,0.007701,0.014037,0.079486,0.10806,0.113522,0.882382,1.475125,1.368101,1.180777,0.826772,0.423549,0.545743,0.767225,0.671512,0.534505,0.465499,0.373974,0.323964,0.423313,0.329759,0.104316,0.081914,0.08235,0.042872,0.031977,0.025565,0.018637
0.016666,0.009152,0.012807,0.083671,0.11556,0.114888,0.837357,1.566423,1.527591,1.060793,0.570502,0.359942,0.576112,0.858801,0.868685,0.686531,0.424057,0.259466,0.215559,0.32374,0.269636,0.084514,0.077144,0.080569,0.038701,0.025195,0.01946,0.014657
0.015491,0.011241,0.011647,0.089599,0.134647,0.12958,0.846454,1.730658,1.7499,1.084068,0.581856,0.420427,0.586084,0.852636,1.045594,0.848981,0.44334,0.185136,0.140268,0.266531,0.212268,0.073275,0.072581,0.06943,0.030951,0.021074,0.018955,0.01298
0.016501,0.01354,0.013785,0.103694,0.165673,0.151942,0.852583,1.714804,1.831995,1.293763,0.698353,0.524588,0.528778,0.697722,1.062426,0.912205,0.458168,0.173881,0.139475,0.277139,0.210486,0.064425,0.060045,0.053649,0.024613,0.020795,0.021998,0.015777
