0.30442,0.32138,0.313628,0.288623,0.290758,0.26939,0.242937,0.261402,0.303865,0.315549,0.282585,0.227471,0.220566,0.254642,0.258137,0.249332,0.236655,0.237409,0.246052,0.248304,0.243907,0.226398,0.220713,0.218463,0.190759,0.171904,0.17052,0.177627
0.366531,0.381497,0.36967,0.342393,0.345035,0.319169,0.290179,0.312672,0.360329,0.372017,0.335752,0.274762,0.268484,0.308179,0.310214,0.301388,0.288045,0.284677,0.291153,0.294925,0.292509,0.27417,0.268527,0.265658,0.230602,0.208028,0.208269,0.214571
0.444917,0.452502,0.435968,0.409122,0.412221,0.381799,0.352653,0.378889,0.428008,0.437644,0.399084,0.333685,0.330249,0.377082,0.375819,0.367828,0.354972,0.344894,0.345722,0.352358,0.355393,0.336421,0.330254,0.32681,0.282349,0.256328,0.260953,0.264542
0.43138,0.425669,0.408874,0.392179,0.393169,0.366432,0.34786,0.369133,0.401892,0.404582,0.373103,0.320511,0.321487,0.363799,0.360066,0.354243,0.344427,0.331596,0.326538,0.335984,0.347368,0.333022,0.32699,0.321262,0.276443,0.254761,0.264476,0.264551
0.323505,0.309938,0.297966,0.291171,0.289167,0.274353,0.27128,0.280434,0.286024,0.283391,0.264407,0.233036,0.234028,0.260114,0.259285,0.254908,0.24893,0.241786,0.235285,0.243439,0.260241,0.256181,0.251142,0.242131,0.208074,0.195762,0.20654,0.205911
0.211562,0.209589,0.208823,0.197506,0.194913,0.190766,0.189972,0.184881,0.177538,0.1835,0.169385,0.143224,0.136894,0.152359,0.158428,0.152291,0.151154,0.149568,0.145845,0.152856,0.165988,0.16893,0.167407,0.159837,0.139534,0.130211,0.132761,0.130247
0.181844,0.195717,0.212503,0.191309,0.194722,0.192878,0.17462,0.164884,0.16318,0.176458,0.154094,0.11134,0.098657,0.121893,0.135948,0.128751,0.12709,0.122818,0.126497,0.138016,0.141561,0.142934,0.144257,0.138771,0.125285,0.113843,0.108403,0.099644
0.203495,0.224507,0.250176,0.226617,0.233615,0.224141,0.190661,0.184219,0.189433,0.206428,0.17862,0.125011,0.11681,0.1426,0.149983,0.14049,0.139188,0.139959,0.153028,0.164777,0.160099,0.16267,0.16453,0.151201,0.137286,0.12645,0.121831,0.110426
0.25422,0.292693,0.316828,0.279635,0.278698,0.255248,0.213029,0.212521,0.223264,0.24095,0.206245,0.158004,0.164609,0.17786,0.173663,0.169708,0.171038,0.177668,0.199491,0.220633,0.211733,0.203265,0.198599,0.175614,0.163399,0.155614,0.151894,0.136274
0.333683,0.389381,0.406025,0.34827,0.345477,0.308413,0.25271,0.262025,0.281034,0.290275,0.242971,0.208759,0.234203,0.230609,0.214216,0.219582,0.226863,0.24015,0.266868,0.302742,0.296093,0.267703,0.254109,0.228199,0.21518,0.204924,0.202266,0.177408
0.407452,0.468706,0.47511,0.404396,0.409647,0.369095,0.303281,0.319871,0.347578,0.345805,0.287462,0.266466,0.305921,0.299016,0.279574,0.287115,0.292584,0.309488,0.339509,0.38312,0.374402,0.324165,0.30961,0.292198,0.276445,0.263851,0.265885,0.228629
0.44015,0.472658,0.466344,0.413145,0.437888,0.417532,0.350982,0.351759,0.39295,0.391397,0.323344,0.306916,0.352001,0.363432,0.358945,0.359386,0.351042,0.360082,0.378183,0.413144,0.403683,0.341246,0.334187,0.330968,0.31091,0.309385,0.322432,0.274488
0.438469,0.406112,0.39008,0.391477,0.438092,0.444216,0.385895,0.355947,0.408573,0.417017,0.346104,0.322484,0.359382,0.402579,0.426512,0.414225,0.386238,0.379183,0.372032,0.382085,0.384144,0.338298,0.330958,0.33075,0.311387,0.322385,0.344109,0.30281
0.429333,0.336589,0.314776,0.369626,0.41491,0.418822,0.374679,0.340866,0.401721,0.421401,0.347072,0.303912,0.33427,0.398627,0.448319,0.437366,0.391893,0.361871,0.340568,0.333223,0.343279,0.330123,0.316545,0.311593,0.300337,0.304729,0.322787,0.302914
0.399962,0.303889,0.260231,0.32326,0.359782,0.343944,0.317387,0.306613,0.352278,0.374776,0.314236,0.266584,0.293113,0.350705,0.401773,0.395863,0.341441,0.304443,0.301295,0.301526,0.305422,0.299423,0.278225,0.27238,0.271587,0.26412,0.261468,0.255321
0.357454,0.284883,0.21406,0.271775,0.320222,0.292528,0.275148,0.284212,0.300427,0.312347,0.273625,0.245615,0.270736,0.303716,0.322755,0.316452,0.270792,0.24599,0.263388,0.263512,0.272702,0.276508,0.247509,0.241808,0.249104,0.223725,0.194591,0.193419
0.337008,0.266811,0.198831,0.274707,0.344584,0.301978,0.293615,0.323953,0.315939,0.311257,0.280967,0.272083,0.295333,0.29197,0.262639,0.276147,0.256603,0.23526,0.249461,0.238732,0.275189,0.296472,0.254561,0.254143,0.272551,0.210667,0.152673,0.161726
0.316114,0.24263,0.208134,0.306367,0.387439,0.337673,0.321664,0.351406,0.341501,0.335431,0.301067,0.289744,0.307934,0.286722,0.238886,0.273951,0.270792,0.24758,0.255519,0.25261,0.303372,0.314029,0.264752,0.27084,0.287102,0.205027,0.138834,0.150273
0.262574,0.209087,0.219713,0.303686,0.368708,0.335172,0.303579,0.310956,0.309322,0.31002,0.275208,0.253872,0.259685,0.246384,0.214791,0.251884,0.255934,0.234854,0.243308,0.258303,0.29549,0.283466,0.24309,0.250846,0.255586,0.187693,0.140013,0.146293
0.214574,0.199051,0.244272,0.276347,0.289223,0.284231,0.25798,0.235579,0.230093,0.241031,0.213278,0.185668,0.179873,0.185941,0.183605,0.199918,0.210234,0.209922,0.218371,0.235444,0.24927,0.224894,0.203534,0.214964,0.210404,0.169968,0.146976,0.140104
0.208582,0.21326,0.275906,0.277256,0.252079,0.262273,0.265625,0.216388,0.177522,0.200972,0.189783,0.161199,0.148905,0.155084,0.152118,0.154563,0.189178,0.216028,0.209143,0.205152,0.205725,0.182724,0.172581,0.191855,0.188071,0.16543,0.158236,0.144992
0.241692,0.241176,0.294896,0.288692,0.267883,0.285399,0.296884,0.234092,0.176642,0.206765,0.215118,0.19596,0.178363,0.16885,0.147997,0.157919,0.2236,0.261528,0.225667,0.196493,0.180244,0.151739,0.154652,0.182436,0.179362,0.164259,0.16169,0.148377
0.276227,0.259197,0.284487,0.277413,0.273131,0.29556,0.296535,0.233515,0.186201,0.211703,0.22978,0.22986,0.211409,0.192395,0.160356,0.172572,0.262549,0.30711,0.246581,0.207582,0.183292,0.154125,0.161327,0.175048,0.168788,0.157651,0.157569,0.146578
0.276079,0.236353,0.234525,0.243447,0.248741,0.261867,0.241804,0.190393,0.188013,0.206012,0.205622,0.223531,0.220183,0.200574,0.161487,0.167529,0.26004,0.296883,0.232313,0.200668,0.18867,0.175743,0.169951,0.155397,0.145466,0.138385,0.140669,0.132602
0.220978,0.178054,0.163968,0.185835,0.195031,0.185698,0.153654,0.126107,0.163512,0.178918,0.151341,0.166708,0.186005,0.177812,0.144674,0.150269,0.215602,0.226826,0.18402,0.16678,0.163439,0.168927,0.156864,0.130869,0.122872,0.114999,0.106037,0.100219
0.147598,0.117047,0.108757,0.127313,0.13385,0.111704,0.092179,0.084152,0.118593,0.133878,0.099593,0.095653,0.125927,0.130866,0.107046,0.115977,0.146091,0.148252,0.128702,0.108686,0.111561,0.127698,0.11483,0.092983,0.094773,0.091193,0.070792,0.064038
0.116185,0.095874,0.092454,0.09755,0.100511,0.08311,0.072696,0.067946,0.080378,0.089771,0.071187,0.061688,0.078591,0.080979,0.069204,0.080138,0.088111,0.090994,0.07933,0.060147,0.075399,0.089238,0.074698,0.060027,0.062225,0.063212,0.051045,0.047587
0.110206,0.095139,0.088525,0.096338,0.093844,0.067687,0.05704,0.054988,0.066735,0.079311,0.070309,0.065939,0.071878,0.066223,0.062893,0.06969,0.067559,0.065123,0.053872,0.046706,0.06802,0.082318,0.064842,0.04495,0.041636,0.045494,0.047389,0.04479
0.101637,0.093848,0.084653,0.104326,0.099884,0.061325,0.048108,0.050206,0.070234,0.086571,0.078637,0.075763,0.075513,0.061702,0.06316,0.072618,0.065106,0.062952,0.05759,0.052689,0.077501,0.099961,0.0766,0.046656,0.036616,0.038138,0.050888,0.050289
0.097959,0.098869,0.084231,0.11124,0.110862,0.069782,0.05654,0.062578,0.082828,0.093962,0.086619,0.080768,0.076027,0.060901,0.061739,0.075051,0.070654,0.068867,0.06912,0.065075,0.083039,0.108187,0.094856,0.067416,0.049589,0.042363,0.057304,0.057001
0.117177,0.114419,0.091106,0.112162,0.110928,0.076087,0.06893,0.081835,0.101464,0.105211,0.091194,0.080635,0.072948,0.062337,0.066275,0.083814,0.085381,0.079512,0.077457,0.078412,0.087018,0.102267,0.105713,0.09244,0.06687,0.051369,0.068511,0.069451
0.13329,0.128052,0.102305,0.107957,0.103594,0.079838,0.07983,0.096958,0.112019,0.112818,0.095012,0.079527,0.066398,0.063811,0.074602,0.09241,0.097705,0.086172,0.078726,0.088273,0.093053,0.093855,0.108356,0.107216,0.076436,0.057061,0.073395,0.076569
0.126963,0.12327,0.109898,0.109596,0.09837,0.085248,0.092836,0.098918,0.1004,0.100143,0.085091,0.073236,0.066822,0.067359,0.071372,0.084711,0.093137,0.081216,0.07116,0.085261,0.08713,0.078354,0.097405,0.099601,0.069518,0.054415,0.06563,0.069102
0.107737,0.109078,0.107311,0.103403,0.083188,0.083193,0.099476,0.086515,0.07125,0.072047,0.067807,0.063756,0.066392,0.063195,0.053441,0.062697,0.073275,0.063133,0.05126,0.065805,0.066444,0.0544,0.073459,0.073174,0.051697,0.046144,0.049405,0.053171
0.090334,0.096061,0.088489,0.091248,0.06897,0.076273,0.101761,0.077129,0.054614,0.055267,0.061304,0.06193,0.058639,0.050384,0.033884,0.046451,0.061743,0.050887,0.033226,0.043742,0.046412,0.045677,0.064147,0.052026,0.042208,0.042216,0.038755,0.045253
0.07731,0.086026,0.064971,0.071078,0.055622,0.067777,0.094043,0.068936,0.057622,0.057625,0.06546,0.065699,0.046872,0.041323,0.027948,0.043588,0.064655,0.051917,0.028885,0.035374,0.037106,0.050093,0.067799,0.045415,0.040458,0.040436,0.033776,0.038364
0.07681,0.094323,0.058665,0.054145,0.055594,0.065781,0.078623,0.060448,0.063481,0.07056,0.078,0.071142,0.042091,0.038422,0.033048,0.048069,0.069274,0.056921,0.030311,0.035585,0.038064,0.057343,0.071332,0.04349,0.039258,0.037885,0.032876,0.030006
0.076561,0.102764,0.0702,0.055691,0.066171,0.074042,0.077366,0.068108,0.071605,0.079812,0.086095,0.078164,0.047732,0.038102,0.039131,0.047739,0.064331,0.056609,0.033567,0.038809,0.041563,0.066041,0.072746,0.043278,0.036171,0.034141,0.039191,0.029903
0.075307,0.101197,0.084544,0.069317,0.077243,0.086534,0.089233,0.077413,0.072132,0.077767,0.082043,0.077021,0.057289,0.043612,0.043503,0.040114,0.048663,0.051419,0.03998,0.042637,0.041118,0.069332,0.075439,0.047257,0.032978,0.034635,0.046084,0.036719
0.074658,0.086135,0.087998,0.078953,0.076783,0.086783,0.091396,0.073669,0.061105,0.062966,0.064353,0.064025,0.061507,0.04672,0.044113,0.032299,0.032288,0.045771,0.050744,0.049934,0.040541,0.062184,0.070181,0.046926,0.027955,0.03417,0.047141,0.041217
