6e-06,5e-06,6e-06,6e-06,7e-06,4e-06,1.3e-05,1.2e-05,1e-06,0,2e-06,7e-06,1e-06,2e-06,0,0,2.3e-05,4e-06,1e-06,2.1e-05,2.5e-05,3.9e-05,1.7e-05,9.1e-05,3.7e-05,4.5e-05,9e-06,3.1e-05,2.8e-05,9e-06,3.5e-05,5.9e-05,1.7e-05,6.5e-05,2.4e-05,5.1e-05,2.2e-05,2.2e-05,1.5e-05,2.2e-05,7.1e-05,1.5e-05,8.9e-05,0.000103,2.8e-05,0.000126,0.000152,0.000106,0.000133,1.3e-05,7e-06,0.000126,4.5e-05,5.1e-05,2.7e-05,4.7e-05,4.9e-05,1e-06,2.1e-05,2.6e-05,1.2e-05,1.7e-05,4.1e-05,0.000121,2e-06,5.5e-05,6.2e-05,1.2e-05,0.000199,5.1e-05,0.00017,4.5e-05,5e-05,0.000148,4.6e-05,1.1e-05,1.3e-05,0.000162,8.2e-05,8.1e-05,5.6e-05,8.7e-05,4.2e-05,3.1e-05,2.9e-05,7.8e-05,1.2e-05,7.1e-05,4.7e-05,6.7e-05,6.8e-05,8.1e-05,0.000143,3.2e-05,0.000129,1e-04,0.000119,9.1e-05,7.2e-05,3.2e-05,6.3e-05,0.000124,9e-06,9.8e-05,6.2e-05,9.6e-05,8e-06,4.4e-05,1.5e-05,0,9.6e-05,4e-06,7.3e-05,3.8e-05,6.9e-05,7.7e-05,2.4e-05,6.6e-05,7.1e-05,8e-06,5.1e-05
2.3e-05,2.2e-05,9e-06,1.4e-05,1.9e-05,6e-06,1.8e-05,2e-06,1e-05,1.9e-05,1e-05,1.4e-05,1e-05,2.4e-05,1.3e-05,9e-06,4.8e-05,2.1e-05,1.7e-05,4.8e-05,5e-05,4.4e-05,5e-05,0.000181,5.8e-05,9.6e-05,3.3e-05,5.1e-05,3.9e-05,1e-05,9.9e-05,0.000117,3e-05,0.000168,3e-05,8e-05,0.000119,8e-05,5.6e-05,0.000202,4.9e-05,0.000146,0.000234,2.7e-05,0.000278,0.000401,0.000158,0.000262,0.000338,7.6e-05,0.000107,0.000241,0.000141,5.8e-05,4.1e-05,0.000102,5.1e-05,0.000142,0.000173,0.000116,5.9e-05,1.4e-05,9.1e-05,0.000347,0.000134,9e-05,0.000198,0.000158,0.000387,5.5e-05,0.000247,0.000151,0.000269,0.000363,6.3e-05,8e-05,7.6e-05,0.000373,0.000176,0.000143,0.000168,0.000298,0.00013,0.000103,0.000186,0.000281,6.2e-05,9e-05,0.000122,0.000191,8.5e-05,0.000133,0.000285,0.000188,0.000331,0.000261,0.000216,0.000244,0.000204,0.00015,0.000233,0.000175,0.000167,0.000259,5.4e-05,0.000172,4.6e-05,0.000155,0.000153,5e-05,0.000239,0.000172,0.000302,0.000155,8.2e-05,0.000222,9.8e-05,5.8e-05,0.000163,1.6e-05,0.000121
4e-06,2e-05,1.1e-05,1.5e-05,2e-05,1.5e-05,8e-06,9e-06,3e-06,1.8e-05,8e-06,9e-06,2.2e-05,2e-05,1.4e-05,8e-06,4.4e-05,4.7e-05,2.7e-05,5.2e-05,2.2e-05,5.7e-05,4.2e-05,0.000205,0.000127,7.8e-05,8.3e-05,7.9e-05,3.8e-05,3.4e-05,6.6e-05,8.3e-05,8.9e-05,0.000171,7.9e-05,0.000111,0.000171,0.000219,0.000332,2.5e-05,0.000215,0.000101,9.2e-05,0.000136,0.000228,0.000193,0.000234,0.00037,0.000506,0.000291,0.000171,0.000537,0.000224,2e-04,1.4e-05,0.000171,0.000135,0.000174,3.3e-05,8.2e-05,0.000197,8.2e-05,0.000114,7.7e-05,9.3e-05,0.000157,0.000115,0.000225,0.000467,0.000269,0.000529,0.000388,0.000271,0.000385,0.000126,0.00015,0.000132,0.000294,3.4e-05,0.000466,0.000219,0.000376,0.000102,0.000292,0.000232,0.000376,0.00018,0.000176,0.000167,0.000219,0.000126,0.00016,0.000294,0.000287,0.000537,0.000414,0.000106,0.000177,0.000371,0.000133,0.000114,0.000471,0.000111,0.000304,0.000225,0.000306,0.000172,0.000258,0.000188,0.000261,7e-05,0.000201,0.000403,0.00021,0.000364,0.000232,0.000123,0.00029,0.00029,0.000254,0.000252
1.4e-05,2.9e-05,3.8e-05,3.4e-05,4.8e-05,3.9e-05,2.8e-05,2.4e-05,2.3e-05,1e-06,2.5e-05,2.6e-05,2.8e-05,3.1e-05,4.3e-05,3.4e-05,5.8e-05,5.6e-05,4.9e-05,1.6e-05,7e-05,8.9e-05,5.7e-05,0.000281,0.000214,0.000158,0.00017,0.000186,0.000148,3.8e-05,0.000175,0.00018,0.000124,0.000191,0.000268,3.2e-05,0.000119,0.000247,0.000234,0.000286,0.00034,7.7e-05,0.000148,0.000388,0.00043,0.000453,0.000284,0.000282,0.000273,0.000293,0.000522,0.000432,0.000226,0.000393,0.000242,0.000131,0.000267,0.000335,0.00051,0.000235,0.000132,0.000141,0.000211,0.000423,0.000185,0.000142,7e-05,6.8e-05,0.00032,0.000526,0.000599,0.000225,0.000733,0.00054,0.000178,0.000311,7e-06,0.000254,0.000197,0.000716,0.000574,0.000204,0.000498,0.000664,0.000372,0.000174,3.9e-05,0.000263,0.000201,0.000235,0.000586,0.000215,0.000553,0.000614,0.000199,0.000292,0.000739,0.000308,0.000419,0.000354,0.000248,0.000605,0.000183,0.000167,0.000564,0.00018,0.000701,8.4e-05,0.000148,0.000466,0.000265,0.000341,0.000358,0.000277,0.000347,0.000593,0.000417,0.000625,0.000432,0.000465,0.000237
1e-05,2.5e-05,1.4e-05,5e-06,3.1e-05,6e-06,1.8e-05,2.2e-05,1.9e-05,1e-05,2.8e-05,5e-06,8e-06,7e-06,2.1e-05,1.3e-05,5e-05,6.4e-05,3.1e-05,4e-05,7.4e-05,0.000133,5.6e-05,0.000285,5.5e-05,0.000204,0.000235,0.000154,0.000162,0.000118,0.000366,9.3e-05,0.000175,0.000168,0.000634,0.000425,0.000395,0.000201,0.000444,4e-05,1.3e-05,0.000556,0.000389,0.000553,0.000164,0.000503,0.000524,0.000212,0.000247,0.000432,0.000642,0.000951,0.000926,0.000873,0.000401,5.1e-05,0.000197,0.000247,0.000598,0.000532,0.000255,0.000371,5.1e-05,0.000687,0.000853,0.000763,0.000383,0.000112,0.000756,0.000631,0.001433,0.000743,0.001041,0.001381,0.001013,0.00059,0.000408,0.000285,0.000217,0.000745,0.000194,0.000687,0.001099,0.000475,0.000615,0.00042,0.000229,0.00074,0.000563,0.00035,0.000989,0.000569,0.0011,0.000399,0.00054,0.000466,0.000521,0.00043,0.000454,0.000349,0.000362,0.000234,0.000395,0.000787,0.000649,0.000914,0.001171,0.001358,0.001127,0.000801,0.000946,0.000493,0.000797,0.000484,0.000713,0.00026,0.000371,0.000785,0.001387,0.000611,0.000644
7e-06,1.4e-05,1.1e-05,1.3e-05,2.4e-05,1.9e-05,1.3e-05,2.9e-05,3.2e-05,1.8e-05,9e-06,9e-06,5e-06,2.4e-05,3e-05,2.6e-05,5.8e-05,0.000142,0.000147,0.00014,0.00019,0.000266,0.000135,0.000366,0.000248,0.000119,0.000247,0.000352,0.000182,9.4e-05,0.000169,0.000205,0.000358,0.00056,0.000944,0.000478,0.000145,0.000493,0.000413,0.000528,0.000195,0.000542,0.000131,0.000543,0.000608,0.00013,0.00097,0.000565,0.000199,0.000473,0.001025,0.000412,0.000385,0.00011,0.000341,0.00055,0.000326,0.000244,0.000249,0.000412,0.000305,0.000404,0.000531,0.000789,0.001418,0.000773,0.000615,0.000516,0.001086,0.001229,0.001231,0.000988,0.000209,0.000739,0.000909,0.000932,0.000521,0.000437,0.000505,0.000252,0.000324,0.000827,0.001128,0.000532,0.000529,0.000512,0.000254,0.000988,0.000747,0.000571,0.000846,0.000658,0.000812,0.00062,0.000476,0.000564,0.000133,0.000518,0.000252,0.000191,0.000426,0.000368,0.000574,0.000772,0.00083,0.000447,6e-04,0.000775,0.000429,0.000267,0.000574,0.000473,0.000314,0.000174,0.000436,0.000483,0.000622,0.000673,0.000323,0.000633,0.000746
7e-06,9e-06,6e-06,1.3e-05,2e-05,2e-05,1.9e-05,4.8e-05,3.1e-05,9e-06,1.1e-05,9e-06,1.8e-05,3.1e-05,7.8e-05,3.5e-05,5.2e-05,0.000196,2.2e-05,0.000202,7.7e-05,0.000123,0.000127,0.000619,0.000176,0.000273,0.000209,0.000228,0.000286,0.000191,3.7e-05,0.000223,0.000341,0.000525,0.000286,0.000153,0.000136,0.000542,0.000331,0.000545,0.000614,0.00078,0.000105,0.000529,0.000535,0.000348,0.000794,0.000132,0.000389,0.000323,0.000328,0.000161,0.000328,0.00057,0.000282,0.000733,9.5e-05,0.000336,0.000574,0.000711,0.000246,0.000327,0.000463,0.000234,0.000931,0.000337,0.000587,0.000706,0.000404,0.000811,5e-05,0.000703,0.00032,0.000465,0.000354,0.000534,0.000318,0.001087,7.6e-05,3.7e-05,0.000574,0.00033,0.000908,0.00023,0.000199,0.000412,0.000299,0.000657,0.000211,0.000302,0.000418,0.000127,0.001104,0.000478,0.000625,0.000298,0.000574,0.000258,0.00057,0.000133,0.000243,0.000506,0.000275,0.00092,0.000206,0.000304,0.000533,0.000847,0.000818,0.000265,0.00019,0.000864,0.000206,0.000622,0.000879,0.00079,0.001253,0.000131,0.000442,0.00092,0.000304
1.3e-05,6e-06,6e-06,1.9e-05,1e-05,8e-06,3e-06,4.6e-05,2.6e-05,1.3e-05,9e-06,5e-06,2.5e-05,2.2e-05,7.4e-05,7.7e-05,1.8e-05,0.000114,0.000299,0.000145,0.000176,0.000363,0.000106,0.000698,0.000695,0.000306,4e-04,0.000373,0.000593,0.000505,0.000185,0.000402,0.000424,0.000471,0.000109,0.00016,0.000315,0.000598,0.000953,0.001296,0.000816,0.000301,0.000464,0.000926,0.001794,0.001322,0.000928,0.001467,0.001075,0.000487,0.000534,0.000309,0.000659,0.000444,0.001494,0.001278,0.000916,0.000608,0.001027,0.000215,0.000369,0.000783,0.001073,0.001124,0.000495,0.000377,0.000504,0.001416,0.001763,0.001922,0.001054,0.001093,0.001014,0.001625,0.000958,0.000776,0.000801,0.001806,0.001056,0.00082,0.001151,0.000669,0.001109,0.001347,0.000761,0.000584,8.5e-05,0.000614,0.000352,0.000145,0.000278,0.000242,0.00112,0.000766,0.001258,0.000928,0.000928,0.00091,0.000875,0.000819,0.001101,0.00116,0.000394,0.000506,0.000658,0.000887,0.000875,0.00085,0.001481,0.00153,0.00098,0.001505,0.001504,0.001294,0.000425,0.000531,0.000769,0.000989,0.001056,0.001632,0.000785
2.8e-05,1.3e-05,1.6e-05,2.3e-05,3e-06,1.4e-05,1.2e-05,3.9e-05,3.9e-05,3.8e-05,1.8e-05,2e-06,3.1e-05,5.5e-05,3.6e-05,0.000104,0.00016,0.000127,0.000269,0.000535,0.000404,0.000381,0.000277,0.000556,0.001165,0.001471,0.001294,0.000583,0.000569,0.000881,0.000903,0.000838,0.000443,0.000365,0.000465,0.000507,0.000453,0.000565,0.00082,0.000867,0.001962,0.002085,0.001387,0.001537,0.002538,0.002877,0.002398,0.002852,0.001959,0.000996,0.001644,0.001085,0.000781,0.000742,0.002318,0.002157,0.000743,0.000469,0.001088,0.001119,0.000758,0.00076,0.001829,0.001405,0.001192,0.0011,0.000803,0.001697,0.001742,0.003051,0.002074,0.001212,0.002572,0.000959,0.000543,0.000855,0.000442,0.000839,0.001589,0.000854,0.00139,0.001992,0.002191,0.002466,0.001552,0.00048,0.000268,0.001873,0.001486,0.001188,0.001302,0.000846,0.000773,0.001228,0.001451,0.000962,0.000423,0.000657,0.001717,0.001398,0.000653,0.001715,0.001303,0.00057,0.000801,0.001082,0.001347,0.001895,0.001064,0.00051,0.002422,0.00395,0.003674,0.002241,0.001996,0.001518,0.001629,0.001766,0.001412,0.002616,0.001803
2e-05,2e-05,2.1e-05,1.1e-05,1.4e-05,1.6e-05,2.8e-05,5.6e-05,2.9e-05,1.9e-05,2.4e-05,8e-06,2.6e-05,4.7e-05,8.5e-05,6.5e-05,8e-05,0.000126,0.000219,0.000392,0.000283,0.000733,0.000374,0.000543,0.000719,0.00046,0.000391,0.000472,0.00032,0.000703,0.000366,0.000242,0.00042,0.000542,0.00076,0.000174,0.000481,0.000641,0.000742,0.000314,0.001481,0.000837,0.000511,0.000993,0.000694,0.000843,0.001456,0.001322,0.000543,0.00059,0.000983,0.000214,0.000272,0.000979,0.001378,0.000246,0.000653,0.00072,0.001121,0.000762,0.000486,0.000592,0.000843,0.000289,0.000778,0.000325,0.000705,0.002256,0.000916,0.002072,0.001348,0.001725,0.001,0.001627,0.001095,0.001295,0.00079,0.000367,0.001168,0.001021,8e-04,0.001094,0.000581,0.001161,0.000235,0.000663,7.1e-05,0.002017,0.001506,0.000692,0.000625,0.000462,0.000567,0.000851,0.000788,0.000392,0.000434,0.000428,0.000777,0.000394,0.001477,0.000797,0.000589,0.001079,0.001216,0.000546,0.000661,0.001105,0.000677,0.000205,0.001778,0.001431,0.000751,0.00049,0.000682,0.000361,0.001242,0.000293,0.000415,0.001669,0.001221
9e-06,6e-06,1e-05,5e-06,1e-05,6e-06,1.4e-05,2.5e-05,2.3e-05,2e-05,1.9e-05,1.7e-05,2.3e-05,6.2e-05,3.7e-05,2.8e-05,4e-05,7.2e-05,6.1e-05,0.000198,1.5e-05,0.000506,0.000653,0.00087,0.000267,0.00039,0.000283,0.00016,0.000185,0.000327,0.000135,0.000328,0.000361,3.7e-05,0.000414,0.000441,0.000193,0.000403,0.000281,0.000302,0.000748,0.000687,0.000662,0.001007,0.000973,0.000942,0.000238,0.000651,0.000221,0.000454,0.000354,0.00046,0.00028,0.001016,0.000751,0.000665,0.001138,0.000658,0.000433,0.000176,2e-04,0.000591,0.000766,0.000399,0.000666,0.000526,0.000887,0.001419,0.00112,0.00074,0.00092,0.000599,0.001274,0.001115,0.000169,0.000296,0.000587,0.000402,0.000972,0.000942,0.001094,0.001531,0.001436,0.000288,0.000177,0.000768,0.000353,0.001429,0.00068,0.000727,0.001245,0.000949,0.000647,0.000842,0.000479,0.000576,0.000967,0.000912,0.000573,0.000927,0.000757,0.001406,0.00099,0.000973,0.001114,0.001372,0.00075,0.000643,0.000409,0.000868,0.000727,0.001293,0.000483,0.000307,0.000445,0.000404,0.001274,0.001815,0.001661,0.000513,0.000466
4e-06,8e-06,1.2e-05,0,7e-06,3e-06,7e-06,1.3e-05,1.8e-05,1.4e-05,1.8e-05,4e-06,6e-06,2.9e-05,3.4e-05,5.9e-05,3.7e-05,2.1e-05,6e-05,3.1e-05,8.6e-05,0.000331,0.000334,0.000164,0.000132,0.000114,0.00014,0.000117,0.00015,0.000147,0.000125,0.000267,0.000299,0.000139,0.000153,0.000194,0.000284,0.00018,0.000199,0.00031,0.000339,0.000456,0.000399,3.7e-05,0.000113,0.000455,0.00041,0.000222,0.000204,0.000374,0.000365,0.000412,0.000332,0.00052,0.000487,0.000423,0.000198,0.000208,5.8e-05,0.000204,0.000156,0.000145,0.000274,0.000318,0.000355,9.9e-05,0.000926,0.000234,0.000268,0.000902,0.000443,0.000133,0.000205,0.000113,0.000245,6.9e-05,0.000326,0.000307,0.000455,0.000613,0.000279,0.000623,8.1e-05,0.000182,0.000414,0.000226,0.000291,0.000361,0.000516,0.000504,0.00072,0.000682,0.000592,0.000979,0.000675,0.000234,0.000376,0.000456,0.000719,0.000307,0.000242,0.000487,0.000371,0.000609,0.000721,9.4e-05,0.000505,0.000292,0.000603,0.000424,0.000302,0.000657,0.000405,0.000299,0.000507,0.000231,0.000787,0.001067,0.000196,0.000193,2.5e-05
2e-06,6e-06,7e-06,3e-06,5e-06,2e-06,3e-06,2e-05,1.4e-05,1.3e-05,9e-06,6e-06,5e-06,1e-05,4e-05,2.4e-05,3.3e-05,3.9e-05,7.9e-05,2.8e-05,4.8e-05,0.000176,0.000159,0.000198,5.3e-05,1e-04,3e-05,0.00014,0.000217,0.000135,0.000205,0.000121,0.000243,0.000124,0.000182,9.4e-05,7.4e-05,2.6e-05,0.000143,0.000146,0.00027,0.000152,0.000229,0.000104,7.1e-05,4e-04,0.000226,0.000364,0.000144,0.000115,0.000225,9.5e-05,0.000149,0.000333,0.000356,0.000183,0.000274,0.000317,0.000169,0.000276,0.000117,5.5e-05,0.00041,0.000512,0.00035,0.000195,0.000561,0.000453,0.00025,0.000235,0.000144,0.000371,0.000187,0.000118,4.3e-05,9.2e-05,0.000329,0.000199,0.000379,0.000373,0.000383,5.4e-05,0.000365,0.000104,0.000245,0.000129,0.000321,0.000208,0.000277,0.000122,0.000261,0.000425,0.000138,0.000672,0.000168,0.000356,0.000332,0.000223,0.00032,0.000248,0.000171,0.000316,0.000126,0.000407,0.000111,0.00032,0.000272,0.000389,0.000307,0.000169,0.000213,0.000649,0.00022,0.000185,0.00035,0.000187,0.00036,0.000545,0.000384,0.000118,0.000338
3e-06,4e-06,5e-06,2e-06,2e-06,2e-06,1e-06,2.5e-05,1.9e-05,1.8e-05,1.3e-05,7e-06,7e-06,1.2e-05,4.7e-05,1.6e-05,2e-05,4.4e-05,0.000124,3.5e-05,9.7e-05,6.4e-05,9.9e-05,0.000107,7.3e-05,0.000103,0.000109,0.00015,0.000117,5.2e-05,0.000258,0.000136,8.6e-05,0.000142,0.000278,0.000134,0.000197,0.000231,8e-05,0.000218,0.000218,0.000121,4.6e-05,0.000223,0.000133,0.000333,0.000201,0.000239,3.4e-05,8e-06,8.7e-05,0.000109,6.5e-05,0.000292,0.000216,7.7e-05,0.000554,0.000175,0.000184,0.000396,0.000178,8.9e-05,0.000226,0.000304,0.000274,0.000153,0.000448,0.000397,0.000329,0.000566,0.000166,0.000352,0.000274,2.5e-05,0.000108,0.000396,0.000113,0.000253,0.00041,0.000541,0.000188,0.000173,0.000325,0.000458,0.000269,0.000489,0.000374,0.000323,0.000388,0.00028,0.000309,0.000193,0.000296,0.000475,0.000122,0.000306,0.000114,0.000374,0.000438,0.000408,0.000144,0.000372,0.000109,0.000448,0.000417,0.00031,0.000535,0.000582,0.000531,7.1e-05,0.000169,0.000455,0.000254,5.5e-05,0.000612,0.000127,6.4e-05,0.000365,0.000237,0.000175,0.000342
8e-06,7e-06,2e-06,3e-06,2e-06,4e-06,1e-05,2.7e-05,1.3e-05,1.7e-05,2.4e-05,1.1e-05,4e-06,8e-06,5.3e-05,4.6e-05,5.7e-05,3.2e-05,9.2e-05,3.5e-05,0.000122,0.000131,0.000153,1.9e-05,0.000113,8.5e-05,0.000141,4.6e-05,0.00029,8.4e-05,0.000291,0.000232,6.2e-05,0.000263,0.000142,0.000161,0.000337,9.6e-05,2e-04,9.7e-05,3.7e-05,3.8e-05,5.3e-05,0.000335,6.7e-05,0.000452,0.000191,4.4e-05,0.000193,0.000123,0.000356,0.000142,0.000153,0.000267,0.000277,0.000148,0.000433,0.000431,0.000195,0.000701,0.000155,0.000115,0.000294,0.000365,0.000413,0.000134,0.000366,0.000409,0.000687,0.000388,8.9e-05,0.000344,0.000201,4.4e-05,3.7e-05,0.000424,0.00041,0.000552,0.000381,0.00076,0.000808,0.000455,0.000154,0.000266,0.000152,0.000365,0.000402,0.000433,0.000505,0.000434,0.000355,0.000502,0.000875,0.000631,0.000228,0.000116,0.000321,0.000369,0.000463,0.000212,0.000456,0.000502,0.000516,0.000296,6.5e-05,0.000619,0.001033,0.000844,5.4e-05,0.000485,0.000653,0.000916,0.000356,0.000341,0.000888,0.000258,0.000153,0.000855,0.000375,0.000134,0.000267
4e-06,2e-06,8e-06,6e-06,2e-06,4e-06,6e-06,2e-05,1.1e-05,1.4e-05,2.4e-05,1.4e-05,8e-06,2e-05,6.1e-05,8.7e-05,7.2e-05,5.9e-05,7.6e-05,0.000151,0.000163,9.9e-05,0.000262,0.000108,0.000163,0.000104,0.000269,0.000228,0.000183,0.000122,4e-04,0.000355,0.000394,0.000377,0.000296,0.000223,0.000303,0.000113,0.000515,0.000423,0.000164,0.000317,6.9e-05,0.000653,0.000463,0.000357,0.000503,0.000275,0.000231,0.000488,0.00017,0.000455,0.000332,0.000718,0.000358,2e-04,0.000393,0.000331,0.000391,0.001152,0.000813,0.000532,0.000538,0.000639,0.000528,0.000434,0.000718,0.000581,0.000474,0.000736,0.000737,0.001311,0.000297,0.00021,0.000189,0.000306,0.000851,0.000727,0.00106,0.000411,0.000789,0.000911,0.000777,7.4e-05,0.00074,0.001032,0.001017,0.000238,0.000643,0.000519,0.000111,0.001313,0.000987,0.000511,0.000429,0.000987,0.00042,0.00077,0.001129,0.000559,0.000913,0.000873,0.000802,0.000409,0.000241,0.00115,0.000682,0.000627,0.000891,0.000717,6.5e-05,0.001249,0.00098,0.000703,0.00088,0.000672,1.9e-05,0.001223,0.000295,0.000698,0.000165
2e-06,5e-06,8e-06,4e-06,4e-06,3e-06,7e-06,9e-06,1e-06,1.4e-05,1.8e-05,7e-06,2.1e-05,6e-06,4.7e-05,3.2e-05,9.8e-05,0.000138,0.000146,0.000163,0.000296,0.000251,0.000222,0.000299,0.000157,0.000219,0.000205,0.000323,4e-04,0.000348,0.000115,0.000874,0.000139,0.000359,0.000654,0.000275,0.000869,0.000514,0.000501,0.000541,0.000506,0.000681,0.000713,0.000538,0.000844,0.000948,0.000907,0.001027,0.000618,0.000504,0.000958,0.001227,0.001224,0.000518,0.000426,0.000515,0.000909,0.001042,0.001202,0.001069,0.001248,0.00071,0.000537,0.000303,0.000989,0.000383,0.001656,0.000582,0.000557,0.000463,0.00211,0.001237,0.001125,0.001057,0.000437,0.000855,0.001589,0.001452,0.00077,0.001302,0.001539,0.000502,0.000422,0.000804,0.000573,0.001913,0.002404,0.001683,0.001283,0.0015,0.00046,0.001726,0.002572,0.001736,0.000167,0.001689,0.001483,0.001319,0.002046,0.002241,0.000905,0.000622,0.002095,0.002243,0.001521,0.001293,0.001703,0.001204,0.001692,0.002525,0.002182,0.001904,0.002531,0.00221,0.002117,0.002034,0.001482,0.001121,0.001312,0.001991,0.002036
1e-05,1.3e-05,7e-06,1.2e-05,6e-06,2e-06,1.2e-05,1.1e-05,7e-06,1.3e-05,2.5e-05,9e-06,1.8e-05,2.4e-05,1.6e-05,1.6e-05,7.2e-05,3.9e-05,0.000145,7.6e-05,0.000162,0.000323,0.000441,0.00034,9.8e-05,0.000281,0.000408,6.8e-05,0.000532,0.000519,0.00026,0.001187,0.001233,0.000439,0.001019,0.000998,0.000393,0.000398,0.000862,0.001296,0.001103,0.000587,0.000585,0.000914,0.000914,0.000274,0.000185,0.000504,0.000354,0.000529,0.000738,0.001084,0.000148,0.001383,0.000932,0.000647,0.001555,0.001484,0.001802,0.001985,0.000877,0.000956,0.000941,0.000587,0.002061,0.00161,0.001506,0.001463,0.001217,0.000591,0.002518,0.00403,0.003284,0.001223,0.000787,0.001291,0.002,0.001055,0.000292,0.001294,0.00223,0.001952,0.000969,0.001395,0.00149,0.002677,0.000915,0.001122,0.001934,0.001886,0.001377,0.00197,0.001247,0.001147,0.001316,0.00189,0.002032,0.001747,0.003563,0.004316,0.003574,0.002215,0.003518,0.003852,0.001359,0.001962,0.003302,0.001609,0.000675,0.001841,0.00204,0.001062,0.00117,0.001699,0.002044,0.001652,0.000414,0.001047,0.000923,0.000856,0.001505
1.4e-05,3e-06,5e-06,8e-06,4e-06,4e-06,1e-05,7e-06,8e-06,1.2e-05,2e-05,1.9e-05,5e-06,8e-06,2e-05,2.9e-05,4.3e-05,6.7e-05,0.000125,8.7e-05,8.7e-05,0.000173,0.000216,0.000134,0.000188,0.000425,0.000393,0.000426,0.000859,0.000815,0.000767,0.000934,0.000967,0.000827,0.001288,0.000957,0.001055,0.000748,0.000949,0.000218,0.000178,0.000404,0.00014,0.00039,0.000567,0.000796,0.000972,0.000463,0.000448,0.000336,0.000876,0.000159,0.000564,0.001143,0.001507,0.001494,7.3e-05,0.00048,0.000768,0.001121,0.000753,0.001097,0.001001,0.000752,0.001714,0.001486,0.00181,0.001162,0.000551,0.000169,0.001596,0.001539,0.000852,0.001098,0.000719,0.000319,0.000597,0.001115,0.00147,0.001007,0.000761,0.000783,0.001557,0.001399,0.000638,0.001271,0.001005,0.000902,0.001233,0.000475,0.000495,0.000711,0.000612,0.001321,0.000339,0.001135,0.000456,0.001465,0.002495,5e-04,0.000662,0.000667,0.002162,0.000517,0.000602,0.001633,0.001614,0.00108,0.000329,0.001672,0.000348,0.000365,0.000687,0.000216,0.000975,0.000266,0.000888,0.001414,0.000787,0.000275,0.000856
4e-06,5e-06,5e-06,3e-06,7e-06,4e-06,5e-06,4e-06,5e-06,1.1e-05,1.5e-05,4e-06,9e-06,7e-06,2.4e-05,3e-05,5.8e-05,4.9e-05,5e-05,1.7e-05,3.3e-05,9.2e-05,0.00015,0.000133,4.6e-05,0.000277,8.4e-05,0.000204,0.000433,0.000264,0.00018,0.000171,0.000555,9.3e-05,0.000416,0.000268,0.000191,0.000451,0.000111,0.000349,0.000191,0.00035,0.000285,0.000311,0.000529,0.00022,0.000635,0.000742,0.000188,0.000337,0.000149,0.000196,0.000556,0.000291,0.000613,0.000429,0.000576,0.000626,0.000181,0.000453,0.000255,0.000637,0.00021,0.000141,0.001029,0.000106,0.00066,0.000406,0.000192,0.000481,0.000291,0.001239,0.000359,0.00069,0.000192,0.000136,3.1e-05,0.000949,0.000501,0.000555,0.000749,0.000668,0.000929,0.000326,0.000383,0.000399,0.000147,4e-04,0.000944,0.000832,0.000595,0.000519,0.000632,0.000536,0.000312,0.000195,0.000553,6e-04,0.001083,0.000924,0.000881,0.000421,0.000917,0.000848,0.000347,0.000835,0.000541,0.000499,0.000608,0.000908,0.000506,0.000418,0.000295,0.000514,0.000398,0.000133,0.00057,0.000437,0.000389,0.000228,0.000523
8e-06,3e-06,6e-06,5e-06,1e-05,6e-06,3e-06,3e-06,3e-06,1.4e-05,1.1e-05,1e-05,5e-06,8e-06,1.2e-05,1.5e-05,2.4e-05,2.5e-05,3e-05,3.7e-05,6e-06,1.8e-05,3.6e-05,0.000127,7.3e-05,7.6e-05,3e-05,0.000118,0.000207,0.000243,0.00017,0.000218,0.000189,0.000381,0.000193,0.000157,0.000183,0.000248,0.000212,0.000364,0.000131,0.000253,0.000177,0.000418,0.000175,8.7e-05,0.000558,0.000197,7e-05,0.000235,0.000167,0.000194,0.000239,0.000253,0.000279,0.000353,0.000248,0.00023,0.00017,0.000167,4.5e-05,0.000417,0.000223,0.000405,0.000159,0.000143,0.000343,0.00059,0.000221,0.000547,0.000443,0.000662,0.000188,0.000569,0.000384,0.000113,0.000519,0.000168,0.000623,0.00059,0.000746,0.000481,0.000481,0.000357,0.000273,0.000342,0.000305,0.000273,0.000471,0.000269,0.00015,0.000372,0.000401,0.000169,0.000355,0.000123,0.000139,0.000269,0.000278,0.000176,0.000449,0.000455,0.000403,3.8e-05,0.000165,0.000827,0.000123,0.000322,0.00023,0.000676,0.000143,0.000646,0.000631,0.000355,0.000248,0.000115,0.000468,0.000295,4.2e-05,0.000549,0.000422
6e-06,6e-06,3e-06,3e-06,5e-06,3e-06,8e-06,4e-06,2e-06,1.1e-05,5e-06,7e-06,4e-06,3e-06,5e-06,1e-05,1.2e-05,3.4e-05,3.9e-05,5.2e-05,5e-05,4.4e-05,3.8e-05,0.000105,3.5e-05,0.000101,5.8e-05,4e-05,6.3e-05,0.000104,0.000136,9e-05,5.2e-05,0.000179,0.00017,6.7e-05,0.00016,5.5e-05,9.3e-05,0.000304,0.000231,0.00013,0.00011,0.000289,8.2e-05,0.000115,0.000133,0.00025,7.5e-05,0.000145,8e-05,0.000191,3.6e-05,0.000157,0.000139,6.4e-05,1.4e-05,0.000239,0.000143,0.000189,9.5e-05,0.000391,0.000126,0.000228,0.000262,0.00015,0.00019,0.000254,6.4e-05,0.000307,0.000357,0.000548,0.000361,0.000134,0.000243,7.6e-05,0.000469,0.000374,0.00043,0.00017,0.000248,0.000411,0.000181,3.2e-05,0.000187,0.000295,0.000225,0.000133,0.000307,0.000176,0.000147,0.00031,0.000307,9.2e-05,0.000352,9.5e-05,7.5e-05,0.000305,0.000456,6.7e-05,0.000336,0.000272,0.000235,0.000159,8.2e-05,0.000809,0.000222,0.000206,0.000103,0.000483,8.1e-05,0.000451,9.5e-05,0.000307,0.000287,0.000137,0.000264,0.000326,0.000235,0.000312,0.000152
2e-06,4e-06,2e-06,0,1e-06,1e-06,1e-06,2e-06,2e-06,6e-06,2e-06,4e-06,3e-06,3e-06,7e-06,2e-06,2e-06,7e-06,1.2e-05,9e-06,2.1e-05,1.5e-05,5e-06,9e-06,2.3e-05,3.5e-05,1.2e-05,2.5e-05,5e-05,5.2e-05,4.9e-05,5.2e-05,3.9e-05,4.9e-05,8.8e-05,2e-05,6.5e-05,7e-05,2.1e-05,8.5e-05,6.1e-05,7.2e-05,4e-05,9.4e-05,5.8e-05,6.2e-05,7.6e-05,5e-05,4.1e-05,8.9e-05,6.6e-05,7.8e-05,6e-06,4e-05,0.000118,2.8e-05,2.4e-05,6.1e-05,7.2e-05,0.00014,2.5e-05,0.000111,5.2e-05,9.3e-05,0.000123,2.7e-05,1.1e-05,0.000131,2.6e-05,0.00012,0.000176,5.4e-05,6.1e-05,3e-05,6.9e-05,3.9e-05,0.000103,9.7e-05,6e-05,0.000109,3.3e-05,0.000107,2.5e-05,8e-05,4.6e-05,3.1e-05,2.7e-05,2e-05,0.000126,1e-04,7.7e-05,0.000112,7.4e-05,9.6e-05,0.000183,7.8e-05,9.3e-05,0.00011,0.000215,9.9e-05,7.3e-05,0.000162,0.000126,0.000146,9.1e-05,0.000301,7.8e-05,5.8e-05,6.4e-05,0.000241,0.00013,0.000199,0.000101,9.1e-05,5.6e-05,5.4e-05,9.1e-05,8.7e-05,8.7e-05,0.000107,8.9e-05
2e-06,2e-06,2e-06,1e-06,0,2e-06,2e-06,2e-06,1e-06,6e-06,3e-06,3e-06,2e-06,4e-06,4e-06,1e-06,2e-06,8e-06,6e-06,1.1e-05,1.3e-05,1.2e-05,6e-06,1.7e-05,1.3e-05,2.8e-05,9e-06,1.8e-05,5.2e-05,5e-05,4.3e-05,6.6e-05,7e-06,3.2e-05,5.7e-05,1.6e-05,4.3e-05,6.6e-05,1.8e-05,9.3e-05,2.6e-05,6.6e-05,3.8e-05,6.7e-05,6.9e-05,3.2e-05,3.8e-05,7.9e-05,4.8e-05,6.4e-05,5.2e-05,3e-05,2.8e-05,4.2e-05,4.9e-05,3.2e-05,7e-06,3.6e-05,9e-06,5e-05,2e-05,7.1e-05,3e-05,4e-05,8.5e-05,4.1e-05,6e-05,6e-05,2.2e-05,8.9e-05,0.000167,7.2e-05,4.3e-05,6.6e-05,8.2e-05,6.1e-05,8.6e-05,6.2e-05,5.1e-05,3.7e-05,4.7e-05,0.000103,5.7e-05,3.8e-05,0.00012,2.2e-05,6.3e-05,2.7e-05,5.9e-05,6.2e-05,4.8e-05,6e-05,0.000109,7.4e-05,7.7e-05,8.1e-05,3.8e-05,6.2e-05,0.000141,6e-05,0.000103,0.000153,0.000167,8.9e-05,5.3e-05,0.000263,2.5e-05,3.9e-05,1.4e-05,0.000226,1e-04,0.000102,7.3e-05,5.1e-05,8.6e-05,1.1e-05,5.5e-05,8e-06,5.8e-05,0.000108,9e-05
1e-06,1e-06,0,1e-06,1e-06,2e-06,2e-06,1e-06,1e-06,5e-06,3e-06,1e-06,2e-06,3e-06,4e-06,2e-06,1e-06,1.1e-05,8e-06,1e-05,1.1e-05,1e-05,8e-06,1e-05,8e-06,2.8e-05,9e-06,1e-05,3.9e-05,5.3e-05,2.6e-05,4.7e-05,1.1e-05,4.1e-05,5e-05,1.7e-05,6.2e-05,4.8e-05,3.8e-05,5.2e-05,3.7e-05,5.5e-05,2.7e-05,5.1e-05,4.9e-05,1.5e-05,3.9e-05,2.9e-05,4.3e-05,6e-05,3.7e-05,3.7e-05,1.3e-05,3.4e-05,8e-05,2.1e-05,2.7e-05,1.6e-05,4.9e-05,7.3e-05,2.6e-05,7.2e-05,1.2e-05,5e-05,9.6e-05,4.7e-05,5.9e-05,5.8e-05,8e-06,9.2e-05,7.8e-05,0.000129,3.5e-05,4.3e-05,8.5e-05,4.1e-05,8.1e-05,2.1e-05,5.4e-05,1.7e-05,3.7e-05,0.000105,3.3e-05,2.4e-05,5.6e-05,0.000101,9.3e-05,5.9e-05,7.8e-05,3.6e-05,5.3e-05,7.9e-05,0.000177,0.000101,8.4e-05,4e-05,5.7e-05,6.5e-05,0.000106,0.00012,8.3e-05,0.000145,0.000122,9.5e-05,4.6e-05,0.000231,8e-06,7e-06,2.8e-05,0.000169,9e-05,0.000119,6.2e-05,6.9e-05,8.9e-05,6.7e-05,4.7e-05,8.5e-05,8.3e-05,0.000128,1.8e-05
1e-06,1e-06,2e-06,0,2e-06,1e-06,2e-06,1e-06,1e-06,5e-06,2e-06,2e-06,0,1e-06,6e-06,3e-06,3e-06,7e-06,5e-06,8e-06,1.1e-05,9e-06,5e-06,1.3e-05,7e-06,2e-05,1.1e-05,1e-05,3.1e-05,4.4e-05,2.8e-05,4.2e-05,1.9e-05,3.2e-05,2.9e-05,3.7e-05,1.6e-05,2e-05,3e-05,5.2e-05,4.5e-05,5.2e-05,1.5e-05,5.4e-05,2.4e-05,4e-06,6.7e-05,7e-05,7e-06,9.6e-05,6.7e-05,6.1e-05,4.6e-05,3.4e-05,5.9e-05,2.9e-05,3.4e-05,4.3e-05,3.2e-05,8.5e-05,4.3e-05,2.7e-05,3.9e-05,4.6e-05,9.3e-05,7e-06,2.4e-05,6.1e-05,3.9e-05,8.7e-05,8e-05,0.000109,7.5e-05,8.4e-05,0.000118,3.1e-05,7.3e-05,5.9e-05,3.9e-05,2.4e-05,3e-06,8e-05,4.7e-05,4.4e-05,9.3e-05,6.9e-05,8.9e-05,3.8e-05,1.5e-05,5e-06,6e-05,8.3e-05,0.000142,6.2e-05,0.000167,5e-05,3.3e-05,5.4e-05,0.00011,0.000133,0.000157,0.000192,0.000154,6e-05,8e-06,0.000183,3.7e-05,3.4e-05,1.5e-05,0.000193,0.000112,4.3e-05,3.3e-05,6e-05,6.7e-05,3.2e-05,7.6e-05,8.2e-05,0.000135,0.000151,9.9e-05
3e-06,1e-06,3e-06,2e-06,2e-06,4e-06,1e-06,0,2e-06,1e-06,4e-06,1e-06,2e-06,5e-06,0,3e-06,2e-06,7e-06,5e-06,8e-06,1.1e-05,9e-06,1.2e-05,6e-06,7e-06,2e-05,2e-06,1e-05,3e-05,3e-05,1.4e-05,3.9e-05,1.3e-05,2.7e-05,2.4e-05,2.5e-05,3.9e-05,1.8e-05,2.1e-05,6.2e-05,4.2e-05,3.8e-05,2.1e-05,5.1e-05,2.4e-05,1.3e-05,5e-05,6.8e-05,1.3e-05,6.4e-05,3.4e-05,1.7e-05,2.1e-05,4.4e-05,8.5e-05,3.9e-05,2e-05,2.4e-05,2e-05,1.8e-05,1.3e-05,6.1e-05,5e-06,5.3e-05,8e-05,1e-05,3.3e-05,6.2e-05,2.9e-05,7e-05,6.2e-05,0.000105,4.1e-05,6.1e-05,7.6e-05,5.6e-05,8.3e-05,7.3e-05,7.2e-05,1.8e-05,3.6e-05,5.7e-05,2.8e-05,6.8e-05,9.7e-05,2.1e-05,6.6e-05,4.2e-05,7.3e-05,2e-05,8e-06,4.1e-05,8e-05,2.5e-05,0.000118,2.3e-05,3.9e-05,4.5e-05,0.000147,6.5e-05,4e-05,5.3e-05,4.7e-05,0.00012,5.4e-05,0.000183,4e-05,2.6e-05,4.3e-05,0.000133,9.2e-05,0.000135,6.7e-05,4.8e-05,6e-05,4.4e-05,4.8e-05,6.1e-05,0.000115,0.000108,5.5e-05
1e-06,0,1e-06,1e-06,2e-06,4e-06,3e-06,1e-06,2e-06,4e-06,3e-06,2e-06,2e-06,3e-06,4e-06,5e-06,5e-06,9e-06,3e-06,5e-06,7e-06,8e-06,1.1e-05,1.4e-05,8e-06,2.7e-05,1.7e-05,5e-06,3.2e-05,3.2e-05,1.4e-05,2.9e-05,7e-06,2.4e-05,2.9e-05,1.5e-05,3.4e-05,2.3e-05,1.8e-05,4.3e-05,3.1e-05,4.3e-05,2.5e-05,5.5e-05,3.1e-05,1.7e-05,6.1e-05,8.4e-05,1.7e-05,5.9e-05,1.6e-05,1e-06,2.6e-05,2.3e-05,4.4e-05,3.2e-05,8e-06,2.9e-05,1.7e-05,5.7e-05,3.2e-05,5.5e-05,1.3e-05,2.7e-05,7.6e-05,0,4.6e-05,6.6e-05,1.9e-05,4.9e-05,5e-05,8.9e-05,6.1e-05,6e-05,6.6e-05,4.8e-05,5.8e-05,3.6e-05,4.7e-05,2.3e-05,4.2e-05,3.9e-05,4.3e-05,5.1e-05,5.2e-05,7.7e-05,7e-05,2.6e-05,6.4e-05,1.6e-05,2.6e-05,4.5e-05,3.7e-05,5.5e-05,7.6e-05,9e-06,1.1e-05,8.2e-05,8.2e-05,6.5e-05,4.5e-05,6.9e-05,5.6e-05,5.8e-05,1.8e-05,0.00013,1.6e-05,3.3e-05,3.9e-05,0.000157,3.7e-05,9.1e-05,4.3e-05,6.5e-05,4e-05,3.5e-05,6.9e-05,4.2e-05,8.4e-05,8.1e-05,5.1e-05
0,1e-06,2e-06,1e-06,2e-06,2e-06,2e-06,2e-06,1e-06,4e-06,3e-06,1e-06,3e-06,4e-06,3e-06,4e-06,3e-06,1e-05,3e-06,1e-05,9e-06,1.2e-05,5e-06,1.1e-05,4e-06,2.4e-05,1.3e-05,3e-06,3.4e-05,2.5e-05,1.3e-05,2.9e-05,1.9e-05,3.1e-05,3.4e-05,1.2e-05,2.4e-05,2.4e-05,3.2e-05,3.6e-05,4.5e-05,3.9e-05,1.7e-05,5.8e-05,1.8e-05,2.2e-05,6.2e-05,5.9e-05,1.1e-05,7.2e-05,2e-05,2.3e-05,2.1e-05,2.4e-05,6.5e-05,3.7e-05,1.8e-05,7e-05,2.4e-05,4.2e-05,1.9e-05,6.3e-05,2.3e-05,3.6e-05,8.3e-05,1.6e-05,3e-05,5.4e-05,2.8e-05,5e-05,8.7e-05,6.9e-05,2e-05,2.7e-05,2.7e-05,4.4e-05,4.1e-05,3.9e-05,3.6e-05,2.1e-05,3.8e-05,6.7e-05,3.5e-05,3.6e-05,3.2e-05,5.7e-05,1.6e-05,2.8e-05,4e-05,1.8e-05,1.6e-05,2.9e-05,3.9e-05,5.2e-05,6.6e-05,1.5e-05,3.7e-05,6.2e-05,8.1e-05,5.9e-05,5.5e-05,8.3e-05,6.6e-05,5.8e-05,3.3e-05,0.000154,3.4e-05,3.4e-05,4.9e-05,0.000134,6.7e-05,7.8e-05,2.8e-05,6.6e-05,4.8e-05,1.5e-05,5.2e-05,2.2e-05,7e-05,7.6e-05,4.5e-05
2e-06,1e-06,1e-06,2e-06,2e-06,1e-06,1e-06,3e-06,4e-06,4e-06,6e-06,5e-06,2e-06,3e-06,5e-06,1e-06,6e-06,5e-06,6e-06,8e-06,1.1e-05,1.2e-05,1e-05,4e-06,4e-06,1.8e-05,6e-06,1.1e-05,3e-05,2.8e-05,1.3e-05,2e-05,2.1e-05,8e-06,3.1e-05,1.9e-05,1.6e-05,2.2e-05,3.7e-05,5.3e-05,3.8e-05,4.5e-05,1.5e-05,6.6e-05,5.4e-05,4.5e-05,5.8e-05,6.8e-05,1e-05,4.2e-05,1.6e-05,1.1e-05,2.1e-05,1.7e-05,4.8e-05,3.2e-05,2.6e-05,7.7e-05,3.4e-05,4.7e-05,1.6e-05,7.2e-05,4.2e-05,7e-05,7.5e-05,3.8e-05,1.8e-05,4e-05,2.9e-05,7.5e-05,7.6e-05,3.6e-05,6.7e-05,4e-05,5e-05,1.9e-05,3.8e-05,7.4e-05,8.4e-05,4e-06,4.3e-05,5.3e-05,2.9e-05,4.4e-05,5.4e-05,2e-05,6.3e-05,2.6e-05,2.6e-05,1.5e-05,4.4e-05,2e-05,4.1e-05,6.2e-05,5e-05,1.5e-05,4.8e-05,7e-05,7.1e-05,7.8e-05,6.5e-05,6.9e-05,6.9e-05,9e-06,3.2e-05,0.000132,4.5e-05,2.9e-05,2.2e-05,0.000103,7.7e-05,9.8e-05,3.7e-05,6.2e-05,3e-05,2.8e-05,2.8e-05,1.5e-05,9.5e-05,8.8e-05,1.3e-05
1e-06,2e-06,2e-06,3e-06,3e-06,1e-06,1e-06,1e-06,2e-06,2e-06,1e-05,5e-06,3e-06,2e-06,4e-06,2e-06,4e-06,7e-06,3e-06,3e-06,1e-05,1.4e-05,1.1e-05,4e-06,3e-06,1.9e-05,7e-06,6e-06,1.9e-05,3.1e-05,1.5e-05,2.3e-05,1.5e-05,2.6e-05,1.4e-05,1.2e-05,6e-06,1.6e-05,2.6e-05,2.9e-05,2.6e-05,4.5e-05,4.1e-05,7.3e-05,4.5e-05,4.6e-05,6.7e-05,8.1e-05,6e-05,6.1e-05,1.7e-05,1.7e-05,2e-06,2.7e-05,5.6e-05,3.7e-05,1.6e-05,2.8e-05,3.2e-05,4.7e-05,1.1e-05,6.9e-05,1.9e-05,3.5e-05,3.3e-05,5.4e-05,6.5e-05,9.7e-05,4e-05,4.9e-05,5.4e-05,5.8e-05,6e-05,4.6e-05,9.1e-05,7.1e-05,0.000108,3.5e-05,3.7e-05,3.7e-05,3e-05,7.3e-05,5.2e-05,5.5e-05,4.5e-05,3.3e-05,5.1e-05,3.4e-05,6.1e-05,2.8e-05,3.9e-05,3.7e-05,6.8e-05,6.8e-05,7e-05,1e-05,6e-06,1.7e-05,8.1e-05,7.5e-05,6.9e-05,9.7e-05,8.8e-05,5.1e-05,2.4e-05,8.3e-05,3.2e-05,4.7e-05,1.6e-05,0.00012,3.6e-05,4.6e-05,2.2e-05,8.1e-05,5.6e-05,2.5e-05,3.7e-05,4.5e-05,4.5e-05,3.6e-05,2.5e-05
1e-06,1e-06,2e-06,2e-06,1e-06,1e-06,1e-06,0,2e-06,4e-06,8e-06,5e-06,3e-06,4e-06,3e-06,2e-06,1e-06,6e-06,4e-06,3e-06,3e-06,5e-06,3e-06,9e-06,8e-06,8e-06,1.3e-05,8e-06,3.2e-05,2.3e-05,1.5e-05,2e-05,2e-05,5e-06,1.3e-05,1e-05,1.3e-05,2.3e-05,5e-06,3.4e-05,4e-05,5.1e-05,3.5e-05,4.5e-05,2.6e-05,5e-06,5.2e-05,6.3e-05,2.9e-05,4.2e-05,3e-05,1.5e-05,3.5e-05,3.8e-05,1.3e-05,4.9e-05,5.3e-05,3.6e-05,1.1e-05,3.4e-05,3.4e-05,6.1e-05,1.5e-05,3.7e-05,4.1e-05,3e-05,3.5e-05,6.8e-05,1.9e-05,3.5e-05,3.8e-05,4.9e-05,2.6e-05,1.5e-05,7.1e-05,4.2e-05,6.2e-05,6.1e-05,1.9e-05,1.2e-05,2e-05,2.6e-05,1.2e-05,6.5e-05,5.4e-05,3.9e-05,2.4e-05,3.6e-05,3.4e-05,5e-06,3e-05,5e-06,4.7e-05,4.5e-05,6.7e-05,1.3e-05,3.2e-05,5.3e-05,6e-05,3.7e-05,6.1e-05,8.2e-05,8.7e-05,5.6e-05,2.4e-05,9.5e-05,2.9e-05,3.1e-05,1e-05,0.000117,2.6e-05,8.3e-05,6.3e-05,4.8e-05,2.3e-05,2.5e-05,3.4e-05,6.5e-05,7e-05,6.9e-05,4.9e-05
1e-06,0,0,1e-06,1e-06,2e-06,1e-06,2e-06,1e-06,0,2e-06,1e-06,2e-06,2e-06,4e-06,1e-06,1e-06,7e-06,5e-06,2e-06,6e-06,8e-06,6e-06,7e-06,8e-06,1.9e-05,1e-05,4e-06,2.8e-05,2.4e-05,1e-06,2.7e-05,1.4e-05,3.3e-05,1.3e-05,6e-06,8e-06,1e-05,1.3e-05,3.4e-05,3.2e-05,5.5e-05,2.5e-05,4.4e-05,9e-06,2e-05,5.7e-05,4.5e-05,2.5e-05,5.4e-05,1.8e-05,5e-06,3.8e-05,2.2e-05,3.4e-05,2.5e-05,2e-05,2.4e-05,2.9e-05,3e-05,1.5e-05,6.7e-05,1.7e-05,3.4e-05,5.3e-05,1.8e-05,4.2e-05,3.6e-05,8e-06,2e-05,3.5e-05,5.5e-05,1.3e-05,2.7e-05,6.5e-05,2.5e-05,4.3e-05,5.6e-05,3.3e-05,2.6e-05,2.7e-05,3.7e-05,3.5e-05,4.3e-05,2.3e-05,3.2e-05,1.3e-05,2.5e-05,1.9e-05,2.8e-05,5e-06,4.4e-05,6.5e-05,3.2e-05,8.4e-05,3.5e-05,1.1e-05,6.8e-05,6.7e-05,4.8e-05,6.2e-05,5.1e-05,6.2e-05,4.9e-05,2.7e-05,0.00012,3.1e-05,1.1e-05,4.2e-05,0.000109,4.2e-05,7.4e-05,4.8e-05,6.2e-05,6.2e-05,6.9e-05,3.3e-05,4.4e-05,6.3e-05,8.8e-05,3.2e-05
3e-06,1e-06,1e-06,1e-06,1e-06,3e-06,1e-06,3e-06,3e-06,2e-06,6e-06,3e-06,3e-06,1e-06,5e-06,2e-06,3e-06,6e-06,1e-06,9e-06,5e-06,5e-06,5e-06,3e-06,9e-06,1.9e-05,9e-06,7e-06,2.3e-05,1.5e-05,2e-06,2.3e-05,1.4e-05,2.2e-05,2.6e-05,1.6e-05,7e-06,2.2e-05,1.8e-05,4.1e-05,3e-05,5.2e-05,3.3e-05,3.6e-05,1.9e-05,2.2e-05,4.6e-05,4.3e-05,3.5e-05,4.6e-05,3.3e-05,2.1e-05,2.6e-05,3.3e-05,2.9e-05,1e-06,2.1e-05,1.8e-05,2e-05,4e-05,1.6e-05,5.6e-05,1.5e-05,1.5e-05,4.5e-05,5e-06,4.8e-05,2.5e-05,1.9e-05,5.7e-05,5.4e-05,3.8e-05,2.7e-05,3.2e-05,5.7e-05,1.4e-05,5.1e-05,4.7e-05,1.5e-05,2.3e-05,1.1e-05,7.6e-05,6.4e-05,4.3e-05,3.2e-05,2.4e-05,5e-06,7e-06,2.1e-05,2e-05,2.2e-05,5e-05,3.6e-05,4.6e-05,9.2e-05,3.1e-05,3.4e-05,5.5e-05,5.8e-05,4e-05,3e-05,6.1e-05,6.8e-05,6.4e-05,4.8e-05,0.000101,3.4e-05,3.2e-05,5.1e-05,0.000107,7.9e-05,5.7e-05,3.9e-05,1.7e-05,3e-05,3.9e-05,5.2e-05,4.9e-05,7.6e-05,6.4e-05,4.9e-05
1e-06,2e-06,1e-06,3e-06,2e-06,5e-06,3e-06,3e-06,3e-06,4e-06,5e-06,3e-06,3e-06,3e-06,6e-06,4e-06,2e-06,4e-06,3e-06,6e-06,8e-06,9e-06,5e-06,3e-06,1e-06,1.9e-05,6e-06,4e-06,2.2e-05,1.4e-05,1.4e-05,2.4e-05,1.1e-05,2.1e-05,2.7e-05,6e-06,1.5e-05,1.1e-05,3.1e-05,2.5e-05,3.7e-05,4e-05,6e-06,5.9e-05,8e-06,2.3e-05,5.2e-05,3.2e-05,1.4e-05,7.7e-05,9e-06,1.4e-05,3.7e-05,2e-05,5.2e-05,2.6e-05,4.8e-05,4.7e-05,1.9e-05,1.5e-05,2.5e-05,5.9e-05,3.7e-05,1.6e-05,7.3e-05,2.9e-05,4e-05,8e-05,4.7e-05,4.9e-05,6.4e-05,4.3e-05,2.5e-05,1.8e-05,6.4e-05,1.2e-05,3.6e-05,4.8e-05,2.4e-05,4.2e-05,1.1e-05,7e-05,4.8e-05,2.8e-05,5.6e-05,3.3e-05,1.9e-05,2e-06,2.4e-05,1.6e-05,1.6e-05,5.8e-05,5.9e-05,5e-05,8.6e-05,2.3e-05,5.7e-05,7.2e-05,2.4e-05,3.8e-05,2.4e-05,8e-05,7.6e-05,5.8e-05,2.9e-05,8.7e-05,4.2e-05,1.2e-05,2.8e-05,0.000128,5.9e-05,3.8e-05,5.1e-05,4.4e-05,4e-05,3e-05,3.7e-05,2.1e-05,2.9e-05,8.5e-05,3.6e-05
1e-06,1e-06,1e-06,2e-06,3e-06,2e-06,0,1e-06,2e-06,2e-06,4e-06,0,1e-06,1e-06,2e-06,2e-06,1e-06,6e-06,5e-06,8e-06,1e-05,5e-06,6e-06,6e-06,5e-06,2e-05,7e-06,5e-06,3e-05,1.3e-05,1.2e-05,1.8e-05,2.1e-05,4e-06,1.4e-05,1.1e-05,9e-06,2.8e-05,2.9e-05,4.6e-05,5.6e-05,2e-06,2.3e-05,7.2e-05,9e-06,1.8e-05,5e-05,4.8e-05,8e-06,5.9e-05,2.8e-05,1.5e-05,7.3e-05,6.7e-05,2.6e-05,1.4e-05,4.2e-05,2.2e-05,2.7e-05,5.9e-05,3.8e-05,4.5e-05,8e-06,1.6e-05,8.4e-05,2.7e-05,2.7e-05,7.5e-05,3.8e-05,8.5e-05,9.8e-05,5.7e-05,2.6e-05,4.9e-05,2.6e-05,2.9e-05,3.1e-05,8.5e-05,5.5e-05,5.8e-05,6.6e-05,8.1e-05,4.1e-05,8.2e-05,0.000128,5.9e-05,1.3e-05,1.2e-05,2.6e-05,3.6e-05,4.1e-05,6.9e-05,6.2e-05,2.5e-05,8.2e-05,4.6e-05,8.8e-05,0.000124,9.4e-05,4.2e-05,8.3e-05,7.7e-05,5.3e-05,9.2e-05,5.6e-05,8.6e-05,1.8e-05,4e-05,6.6e-05,8.1e-05,9.1e-05,2.8e-05,6.4e-05,7.5e-05,2.6e-05,2.3e-05,6.1e-05,5.2e-05,6.3e-05,9.6e-05,5.9e-05
1e-06,1e-06,1e-06,1e-06,2e-06,2e-06,2e-06,1e-06,4e-06,2e-06,9e-06,7e-06,3e-06,1e-06,4e-06,3e-06,2e-06,5e-06,2e-06,1.4e-05,1.5e-05,1.3e-05,9e-06,1e-06,9e-06,2.5e-05,2e-05,1.5e-05,2e-05,2.4e-05,1.4e-05,3.8e-05,3e-06,3.2e-05,3.9e-05,1.7e-05,3.1e-05,3.2e-05,3.4e-05,4.9e-05,3.4e-05,0.000103,8.5e-05,5.2e-05,4.4e-05,2.2e-05,6.2e-05,6e-05,9e-06,5.1e-05,1.7e-05,5e-05,9.8e-05,7.5e-05,8.7e-05,3.4e-05,2.6e-05,2.3e-05,5.7e-05,8.8e-05,3.7e-05,4.5e-05,8.3e-05,4.2e-05,7.7e-05,7.4e-05,8e-05,3.6e-05,5.9e-05,9.1e-05,6.2e-05,2.1e-05,5.8e-05,2.2e-05,6.2e-05,1.2e-05,0.000125,5.5e-05,0.000141,0.00015,0.000189,9e-05,5e-05,0.000132,0.000199,0.00014,0.000151,6.1e-05,4.6e-05,5.1e-05,4.5e-05,6.4e-05,0.000158,0.000198,0.000124,9.8e-05,3.9e-05,7.9e-05,0.000191,0.00013,8.6e-05,0.000114,0.000117,0.00015,0.000102,3.8e-05,4.1e-05,2.6e-05,2.4e-05,0.000204,0.000106,0.000133,8.5e-05,0.000152,0.00012,4.2e-05,0.000101,7.2e-05,5e-05,7.8e-05,0.00013
1e-06,1e-06,0,1e-06,2e-06,1e-06,3e-06,1e-06,4e-06,3e-06,1.2e-05,1.3e-05,9e-06,2e-06,2e-06,3e-06,2e-06,6e-06,5e-06,8e-06,2e-06,2e-06,1.4e-05,1.1e-05,3e-06,1.4e-05,2.5e-05,1.1e-05,1e-05,2.4e-05,2e-05,2.7e-05,1.1e-05,3.7e-05,3.2e-05,2.5e-05,4.6e-05,3e-05,2.9e-05,7.4e-05,3.2e-05,9.9e-05,7.3e-05,3.9e-05,3.5e-05,6e-06,2e-06,5.4e-05,6.1e-05,1.3e-05,3.7e-05,5.4e-05,3.1e-05,2.4e-05,7.5e-05,4.4e-05,2.8e-05,1.8e-05,3.4e-05,1.5e-05,2.2e-05,1.7e-05,7.5e-05,8.1e-05,0.000129,0.000107,7.5e-05,3.9e-05,5.9e-05,0.000136,0.00011,6.4e-05,6.4e-05,0.000107,9.3e-05,5.4e-05,0.000155,0.000123,0.000108,8.6e-05,9.9e-05,7e-05,2.5e-05,0.000129,3.2e-05,1.7e-05,0.000135,0.000121,6.7e-05,4.2e-05,3.9e-05,5e-05,0.000106,0.000116,8.2e-05,3.7e-05,2.9e-05,0.000119,9.7e-05,5.5e-05,0.000151,9.1e-05,0.000108,0.000179,3.6e-05,0.000116,7.5e-05,3.3e-05,9e-06,0.000161,6.9e-05,0.000123,6.1e-05,0.000192,0.000138,0.000105,0.000171,8e-05,5e-05,2.9e-05,0.000123
2e-06,1e-06,1e-06,1e-06,1e-06,1e-06,2e-06,1e-06,2e-06,1e-06,8e-06,5e-06,1e-06,2e-06,2e-06,1e-06,1e-06,7e-06,6e-06,7e-06,8e-06,3e-06,3e-06,4e-06,4e-06,1.3e-05,1.6e-05,3e-06,1.9e-05,3.1e-05,1e-05,2.7e-05,6e-06,3.4e-05,1.7e-05,2.2e-05,1.9e-05,2e-05,1e-05,4e-05,1.8e-05,6.2e-05,1.7e-05,5.5e-05,2.7e-05,3.9e-05,5.4e-05,1.8e-05,3.3e-05,2.9e-05,3.4e-05,3.6e-05,2.3e-05,1.9e-05,4.7e-05,1e-05,1.7e-05,1.5e-05,4.2e-05,2.9e-05,1.7e-05,2e-05,1.7e-05,5.4e-05,5e-05,1.7e-05,2.2e-05,1e-06,3e-06,6.4e-05,3.7e-05,9.3e-05,2.2e-05,8.7e-05,2.9e-05,5.9e-05,6.6e-05,8.9e-05,5.2e-05,4.2e-05,7.1e-05,3.4e-05,3.7e-05,8.2e-05,9.2e-05,5.9e-05,0.000147,8.7e-05,5.7e-05,5e-05,5.7e-05,1.3e-05,3.5e-05,7.9e-05,5.4e-05,2.1e-05,3e-05,7e-05,4.8e-05,1.6e-05,5.1e-05,0.000104,1.5e-05,2.1e-05,6.1e-05,0.000121,4.3e-05,2.4e-05,1e-05,8.2e-05,2.5e-05,0.000115,8e-06,0.000111,4.6e-05,3.2e-05,6.3e-05,1.4e-05,7.7e-05,4.7e-05,9.2e-05
1e-06,1e-06,0,0,1e-06,1e-06,0,1e-06,0,1e-06,5e-06,0,1e-06,2e-06,2e-06,1e-06,1e-06,6e-06,5e-06,4e-06,6e-06,4e-06,2e-06,8e-06,3e-06,1.2e-05,1.3e-05,4e-06,2e-05,2.4e-05,5e-06,2.4e-05,0,2.3e-05,1.9e-05,1.4e-05,2.2e-05,1.8e-05,6e-06,3.5e-05,1.5e-05,5.2e-05,5e-06,4.4e-05,1.3e-05,1.9e-05,4.2e-05,3.9e-05,2.4e-05,2.2e-05,8e-06,1.3e-05,5e-06,1.7e-05,3.7e-05,1.5e-05,2e-06,1.4e-05,2.6e-05,2.4e-05,1.6e-05,2.7e-05,6e-06,4.6e-05,2.2e-05,7e-06,2.1e-05,2.9e-05,1.6e-05,2.3e-05,3.4e-05,5.9e-05,3.3e-05,5.1e-05,4.9e-05,3.8e-05,3.9e-05,3.7e-05,1.9e-05,3.8e-05,3.4e-05,2.4e-05,3e-05,5.9e-05,4.7e-05,1.6e-05,6.5e-05,2.7e-05,1.5e-05,3.1e-05,1.1e-05,5e-06,9e-06,4.8e-05,5.2e-05,1.7e-05,2.4e-05,4.3e-05,3.8e-05,1e-05,8e-06,8.5e-05,3.5e-05,4.5e-05,1.1e-05,9.6e-05,3.3e-05,1.4e-05,1e-05,0.000101,1.6e-05,9.5e-05,1.5e-05,7.2e-05,2.2e-05,3.8e-05,5.3e-05,1.6e-05,6.1e-05,2.3e-05,4.4e-05
1e-06,1e-06,0,0,1e-06,1e-06,1e-06,1e-06,0,1e-06,3e-06,0,1e-06,1e-06,2e-06,1e-06,0,6e-06,5e-06,4e-06,5e-06,4e-06,3e-06,8e-06,0,1.2e-05,1.2e-05,5e-06,2.2e-05,2.3e-05,9e-06,1.9e-05,2e-06,2.3e-05,2e-05,1.1e-05,1.8e-05,1.9e-05,8e-06,3.4e-05,1.3e-05,4.9e-05,3e-06,4.4e-05,9e-06,2e-05,3.9e-05,3.1e-05,1.4e-05,3e-05,5e-06,1.2e-05,2e-06,9e-06,3.2e-05,1.6e-05,7e-06,1.2e-05,2.2e-05,2.3e-05,1.9e-05,2.1e-05,7e-06,4.1e-05,2.9e-05,1e-06,1.9e-05,2.5e-05,1.9e-05,2.2e-05,3.7e-05,5.3e-05,2.9e-05,4.5e-05,5.4e-05,3.4e-05,3.5e-05,2.5e-05,5e-06,3e-05,2.3e-05,3.4e-05,3.7e-05,5.3e-05,2.4e-05,1.3e-05,5e-05,1.4e-05,5e-06,9e-06,1.2e-05,9e-06,5e-06,4.8e-05,5.3e-05,1.6e-05,2.2e-05,2.4e-05,4.4e-05,8e-06,7e-06,7.1e-05,3.3e-05,5.9e-05,1.3e-05,8.5e-05,2e-05,5e-06,7e-06,0.000117,1.9e-05,7.2e-05,3e-05,6.3e-05,2e-05,2.8e-05,4.9e-05,2.1e-05,5.4e-05,2.8e-05,2.3e-05
0,1e-06,1e-06,0,1e-06,0,0,1e-06,1e-06,1e-06,2e-06,0,1e-06,1e-06,2e-06,1e-06,1e-06,5e-06,5e-06,3e-06,3e-06,3e-06,0,7e-06,1e-06,1.1e-05,9e-06,2e-06,2e-05,2.2e-05,7e-06,2.4e-05,1e-06,2.1e-05,1.9e-05,7e-06,1.8e-05,1.9e-05,8e-06,3.4e-05,1.6e-05,4.4e-05,1e-06,4.8e-05,7e-06,1.8e-05,4.4e-05,3.1e-05,1.5e-05,3.3e-05,2e-06,1.3e-05,4e-06,6e-06,3.4e-05,1.8e-05,3e-06,1.6e-05,2.2e-05,2.6e-05,1.6e-05,2.7e-05,3e-06,3.9e-05,2.4e-05,2e-06,2e-05,2.5e-05,1.2e-05,1.4e-05,3.5e-05,5.8e-05,2.4e-05,4.5e-05,4.6e-05,2.5e-05,3.7e-05,2e-05,8e-06,3.1e-05,2.4e-05,3.6e-05,2.7e-05,4e-05,1.8e-05,1e-05,4.8e-05,1.4e-05,4e-06,1.2e-05,1.9e-05,3e-06,6e-06,4e-05,5.9e-05,2.2e-05,1.9e-05,2.6e-05,4.7e-05,1e-05,8e-06,5.7e-05,3.5e-05,5.7e-05,6e-06,9.1e-05,3e-05,2.1e-05,2e-06,0.000113,2.3e-05,8.3e-05,2e-05,5.5e-05,1.7e-05,2.2e-05,4.8e-05,1.5e-05,6e-05,3.1e-05,3.3e-05
