-6e-06,-1.2e-05,-1.2e-05,-1.2e-05,-2.3e-05,-9.6e-05,-0.001129,-0.019458,-0.017002,-0.001284,-0.000223,-0.003384,-0.004216,-0.000266,-8.6e-05,-0.001945,-0.00246,-0.000174,-8.9e-05,-0.000924,-0.001736,0.000659,-0.002428,-0.020094,-0.011509,-0.001436,-0.005255,-0.003026
1.2e-05,1.7e-05,1.5e-05,1.5e-05,2.6e-05,0.000134,-0.000147,-0.006485,-0.006279,-0.001165,-7.5e-05,-0.001008,-0.001892,-0.000155,-4.9e-05,-0.002765,-0.003495,-0.000192,0.000374,0.001988,0.003946,0.001489,-0.000229,-0.005025,-0.005286,-0.000752,-0.001026,-0.000925
-1.1e-05,-1.5e-05,-1.3e-05,-1.1e-05,-1.4e-05,-5.3e-05,-0.000366,-0.003708,-0.002534,-0.000542,-9.6e-05,-0.001201,-0.001458,-9.1e-05,-3.1e-05,-0.000482,-0.000512,0,-2.2e-05,-0.000444,-0.000901,0.000201,-0.000446,-0.005353,-0.002635,-0.000142,-0.00025,2e-06
-9e-06,-9e-06,-1e-05,-1.5e-05,-2.2e-05,-6.4e-05,0.00036,0.008204,0.007396,0.00065,4.2e-05,-0.000475,5.3e-05,9.1e-05,6.2e-05,0.001915,0.002618,0.000199,-0.000141,-0.000989,-0.001545,-4.8e-05,0.001813,0.012171,0.007807,0.000681,-0.000233,0.000492
8e-06,1.4e-05,1.3e-05,1.1e-05,2.6e-05,0.00012,0.001344,0.021824,0.018124,0.0014,0.000233,0.002764,0.003423,0.000213,5.3e-05,0.001638,0.002271,0.000175,0.000109,0.001035,0.002335,0.000435,0.002723,0.020112,0.010743,0.000999,0.003035,0.001929
-7e-06,-1.3e-05,-1.1e-05,-8e-06,-9e-06,-5.8e-05,-0.000471,-0.007197,-0.006389,-1.9e-05,2.3e-05,0.001676,0.001699,2e-06,-7.4e-05,-0.00081,-0.001032,-0.00011,-0.000231,-0.000555,-0.000871,-0.000554,-0.002338,-0.01393,-0.007161,-0.00027,0.001565,0.000662
-9e-06,-1e-05,-1.3e-05,-1.5e-05,-2.2e-05,-6.3e-05,-0.00115,-0.02214,-0.018883,-0.000878,-0.000127,-0.000997,-0.00122,-7.3e-05,-3.8e-05,-0.002169,-0.002985,-0.000233,-0.000216,-0.000812,-0.000805,-0.000527,-0.002504,-0.015078,-0.008412,-0.000635,-0.001504,-0.00073
1.1e-05,1.6e-05,1.8e-05,1.9e-05,2.3e-05,9.6e-05,0.000166,0.00094,0.001263,-0.000304,-5.3e-05,-0.001128,-0.001369,-3.2e-05,3.5e-05,-0.000847,-0.001286,-6.4e-05,2.6e-05,0.000406,0.000747,-0.000359,0.000435,0.004664,0.001757,2.5e-05,-0.000829,-0.000237
-3e-06,-7e-06,-9e-06,-8e-06,-5e-06,-3.9e-05,0.000325,0.00967,0.008641,-0.000114,-3.5e-05,-0.000848,-0.001074,-7.5e-05,7e-06,0.001352,0.001792,0.000148,-9.6e-05,-0.000391,-0.001069,-0.000858,0.000346,0.004629,0.00271,7.6e-05,-0.000143,-2.1e-05
2e-06,3e-06,-1e-06,-3e-06,-3e-06,-2.2e-05,0.000224,0.004877,0.00372,0.00019,4.4e-05,-0.000422,-0.000431,1.8e-05,6.1e-05,0.001946,0.00269,0.00018,-8.8e-05,-0.00027,0.000467,-0.000329,0.000272,0.005928,0.003676,7.5e-05,-0.000942,-0.000563
7e-06,6e-06,1.1e-05,1.2e-05,9e-06,5.3e-05,0.000456,0.00601,0.004303,0.000353,6e-05,0.000462,0.000488,3e-06,-1.5e-05,0.000271,0.000513,6e-06,5e-06,9.5e-05,-0.00014,-0.000536,-0.000254,0.000581,0.000317,-2.1e-05,-0.000436,-0.000289
-4e-06,-5e-06,-3e-06,0,-4e-06,-5e-05,-0.000448,-0.0078,-0.006298,0.000284,3.8e-05,0.001183,0.001443,3.9e-05,-6.1e-05,-0.001438,-0.001911,-0.000154,-4.7e-05,2e-06,-0.00041,-0.000494,-0.001408,-0.010912,-0.005494,0.000131,0.001967,0.001284
7e-06,1e-05,4e-06,-4e-06,-4e-06,8e-06,-0.000745,-0.014582,-0.011346,-6.2e-05,5e-06,0.000974,0.001362,0.000109,2.1e-05,-0.001001,-0.001584,-0.000133,-5.1e-05,-9.5e-05,0.000257,-1e-04,-0.000315,-0.003141,-0.001476,0.000276,0.001949,0.00144
0,-1e-06,7e-06,1e-05,1.1e-05,4.8e-05,0.000399,0.006756,0.005779,-0.000165,-4.8e-05,-0.000823,-0.001015,-4.9e-05,1.3e-05,0.000441,0.000465,2.2e-05,4.9e-05,-1.5e-05,-0.000492,-0.000219,0.001126,0.007669,0.003381,-0.000187,-0.001079,-0.000629
-6e-06,-7e-06,-6e-06,-2e-06,-5e-06,-6.1e-05,0.000477,0.011658,0.009052,-0.000392,-6.3e-05,-0.001326,-0.001732,-0.000106,1e-05,0.001191,0.001738,0.000101,2e-05,0.000278,-6.4e-05,-5.7e-05,0.000576,0.003625,0.001549,-0.000397,-0.002009,-0.001366
2e-06,5e-06,-3e-06,-9e-06,0,1.9e-05,-7.4e-05,-0.001637,-0.001898,-0.000134,9e-06,0.00016,0.000181,2.8e-05,2.7e-05,0.000313,0.000663,2.9e-05,-9.5e-05,0.000111,0.000789,0.000321,-0.000102,-0.001135,4.2e-05,5.4e-05,-0.000347,-3e-04
-5e-06,-8e-06,0,2e-06,1e-06,3.6e-05,5e-06,-0.001837,-0.001318,0.000387,4.7e-05,0.000303,0.000366,1e-06,-4.8e-05,-0.000984,-0.001271,-0.000109,-6.3e-05,-0.00029,-0.001159,-0.000159,7.2e-05,-0.002255,-0.000886,0.000223,0.000256,0.000177
-9e-06,-1e-05,-5e-06,-2e-06,-1.2e-05,-6.3e-05,-0.000256,-0.003965,-0.002579,0.000387,4.1e-05,0.000376,0.000469,2.1e-05,-1.4e-05,-0.00098,-0.001613,-0.000132,7.1e-05,0.000422,0.00031,0.000165,-0.000186,-0.005124,-0.002663,0.000242,0.00132,0.000833
6e-06,1e-05,-1e-06,-5e-06,3e-06,2.6e-05,-0.000355,-0.007014,-0.005699,-0.000162,-1.1e-05,0.000497,0.000609,4.2e-05,4e-05,0.000155,-4.8e-05,-4e-05,-6.9e-05,3.5e-05,0.000288,0.000147,-0.000198,-0.001909,-0.000943,-9.6e-05,0.00072,0.000334
