0.0675,0.082073,0.077358,0.069533,0.067857,0.062122,0.073795,0.078425,0.064227,0.061956,0.061946,0.056667,0.058982,0.064904,0.060586,0.055251,0.055095,0.053725,0.055348,0.054282,0.051857,0.057206,0.056894,0.05199,0.05451,0.058856,0.058419,0.050571
0.088249,0.105648,0.101546,0.091551,0.087869,0.082454,0.103682,0.109863,0.086879,0.084103,0.083894,0.075082,0.078993,0.087302,0.081385,0.075808,0.077003,0.075936,0.078473,0.075666,0.069754,0.07632,0.076684,0.069243,0.070822,0.077857,0.07835,0.065463
0.129751,0.153165,0.149448,0.134388,0.126716,0.123444,0.164515,0.173468,0.131708,0.127284,0.127003,0.111186,0.118209,0.131132,0.123298,0.118082,0.121727,0.121754,0.126347,0.118867,0.105549,0.115043,0.117511,0.104918,0.103299,0.11557,0.119634,0.097381
0.170895,0.20183,0.198671,0.177677,0.166567,0.167241,0.226985,0.23753,0.176667,0.169992,0.170699,0.148197,0.158208,0.176894,0.169211,0.164896,0.170188,0.172353,0.179654,0.165186,0.143087,0.156357,0.162144,0.145256,0.139133,0.157106,0.167506,0.135743
0.191722,0.226702,0.2271,0.203827,0.193293,0.198676,0.259553,0.268931,0.206203,0.197,0.198119,0.173738,0.183493,0.205155,0.198524,0.194756,0.199221,0.204343,0.213473,0.192965,0.165949,0.181261,0.190684,0.173961,0.163766,0.182822,0.198224,0.162981
0.193518,0.233355,0.245317,0.2238,0.219104,0.224504,0.255642,0.262777,0.229151,0.213704,0.210975,0.193413,0.196015,0.220305,0.216851,0.204115,0.203208,0.215696,0.222733,0.196975,0.17837,0.197568,0.208278,0.194751,0.178725,0.186292,0.201197,0.173655
0.2472,0.304282,0.332911,0.308421,0.295927,0.288834,0.292228,0.308364,0.319795,0.294022,0.27157,0.260529,0.251564,0.279784,0.287126,0.261298,0.255344,0.275041,0.267147,0.230861,0.239369,0.268995,0.270874,0.257968,0.230127,0.213966,0.229999,0.216812
0.392185,0.480396,0.532833,0.503328,0.444685,0.407502,0.43001,0.471444,0.528945,0.5047,0.434527,0.401133,0.376335,0.404259,0.42842,0.422309,0.42282,0.420053,0.380861,0.341605,0.398748,0.455471,0.438964,0.418591,0.377841,0.334957,0.35903,0.343408
0.609417,0.758347,0.856677,0.834833,0.677134,0.572012,0.665326,0.744536,0.862276,0.854498,0.686749,0.595486,0.557753,0.570971,0.618026,0.693584,0.719957,0.640136,0.541874,0.517956,0.659772,0.773031,0.718629,0.670902,0.620926,0.538181,0.563883,0.533346
0.853928,1.122964,1.317382,1.322585,1.014953,0.806295,1.003192,1.103591,1.300825,1.334693,1.023233,0.84362,0.787494,0.766925,0.850014,1.076892,1.150486,0.932533,0.736124,0.747599,1.023102,1.225166,1.106341,0.996464,0.927383,0.778192,0.801404,0.766042
1.045185,1.488528,1.812074,1.854476,1.384896,1.073501,1.367601,1.450623,1.737342,1.826686,1.357245,1.078435,1.009654,0.970064,1.094892,1.48936,1.612881,1.241942,0.939738,0.992676,1.420979,1.716899,1.514607,1.323316,1.213891,0.971875,1.006059,0.996599
1.079793,1.64514,2.053416,2.128871,1.576483,1.219517,1.551287,1.583492,1.923377,2.057796,1.501461,1.161185,1.093582,1.074018,1.230022,1.71293,1.857256,1.396862,1.049483,1.145729,1.655866,1.979986,1.709144,1.47758,1.337266,1.024059,1.074557,1.102587
0.904762,1.420684,1.793165,1.868918,1.390165,1.090943,1.367305,1.353946,1.65447,1.789815,1.31188,1.004747,0.946348,0.953788,1.110616,1.539545,1.644458,1.230857,0.945457,1.056462,1.497333,1.748231,1.482594,1.306928,1.187742,0.871681,0.912774,0.973275
0.636724,0.93545,1.155198,1.19378,0.917077,0.747249,0.889334,0.866532,1.048966,1.147848,0.909821,0.721589,0.657305,0.664665,0.770045,1.015566,1.049002,0.806726,0.660915,0.740986,0.987445,1.104544,0.931768,0.868324,0.811008,0.58996,0.603514,0.661555
0.592387,0.668771,0.68047,0.652919,0.564811,0.504168,0.535245,0.505188,0.543777,0.665902,0.716049,0.609946,0.492456,0.458383,0.466317,0.533507,0.532592,0.481235,0.489602,0.52381,0.582666,0.574692,0.482169,0.514503,0.582288,0.515082,0.479999,0.497896
0.878617,0.926819,0.836103,0.763502,0.708326,0.678176,0.683156,0.574857,0.530926,0.747878,0.969957,0.858076,0.664743,0.582133,0.510431,0.528696,0.539578,0.557448,0.643615,0.662373,0.693385,0.641737,0.523476,0.599268,0.754295,0.740213,0.708337,0.722778
1.273874,1.347331,1.196606,1.107505,1.063981,1.017426,1.009284,0.843965,0.751588,1.024592,1.307671,1.189175,0.980659,0.877502,0.774801,0.796982,0.81397,0.8393,0.949547,0.960607,1.006969,0.969566,0.805708,0.891953,1.086882,1.063996,1.047956,1.065187
1.61454,1.703652,1.518263,1.415693,1.415531,1.356228,1.339801,1.173986,1.000685,1.245638,1.535255,1.449407,1.286195,1.177874,1.076028,1.129919,1.161432,1.151259,1.245127,1.240539,1.296019,1.333015,1.157878,1.256325,1.427762,1.33706,1.345372,1.364003
1.793081,1.854917,1.737745,1.626651,1.671758,1.690078,1.739595,1.607692,1.273227,1.350191,1.581591,1.590166,1.545231,1.43206,1.339401,1.509151,1.603833,1.449863,1.431937,1.395792,1.4929,1.68075,1.503131,1.611936,1.71713,1.519041,1.540453,1.534756
1.95441,1.811319,1.830579,1.813374,1.908447,2.067074,2.241549,2.126135,1.602785,1.455401,1.580609,1.712547,1.827949,1.663419,1.531799,1.867404,2.072168,1.75706,1.530743,1.401509,1.613641,1.966427,1.750283,1.900851,1.951935,1.619548,1.600505,1.547163
2.177377,1.70112,1.828567,2.077664,2.198405,2.295394,2.479478,2.408507,1.800947,1.448033,1.491479,1.788596,2.073279,1.832322,1.621991,2.053235,2.301436,1.944176,1.602177,1.37971,1.6599,2.078458,1.869198,2.088104,2.085733,1.624803,1.551487,1.464806
2.232204,1.611365,1.706062,2.139208,2.213663,2.087796,2.153764,2.123415,1.613329,1.221523,1.226948,1.590298,1.974304,1.798783,1.605872,1.960452,2.090634,1.850538,1.637089,1.398217,1.602788,1.948095,1.78108,1.935938,1.85258,1.430335,1.418062,1.367883
1.816529,1.375054,1.479283,1.916548,1.911996,1.605004,1.485443,1.4294,1.165899,0.928033,0.930814,1.221645,1.548531,1.510944,1.444703,1.65763,1.610063,1.479348,1.445996,1.268371,1.301193,1.473255,1.418695,1.438043,1.290311,1.059253,1.137258,1.176195
1.179311,1.098069,1.182353,1.425834,1.494028,1.276461,1.043273,0.984198,0.876306,0.705395,0.724686,0.896848,1.045853,1.059299,1.102957,1.243444,1.182506,1.107568,1.104713,1.008634,0.937323,0.966501,0.989749,0.910907,0.812527,0.769536,0.809191,0.913896
0.796846,0.984933,1.090387,1.049235,1.16109,1.168773,0.942165,0.98969,0.941761,0.659365,0.654764,0.811085,0.875684,0.831394,0.850963,0.944484,0.998969,1.004616,0.950082,0.855751,0.769665,0.705698,0.726878,0.672908,0.629541,0.644362,0.58309,0.720459
0.708385,1.071965,1.322155,1.187606,1.225775,1.252132,1.055452,1.190886,1.150661,0.767649,0.737055,0.970569,1.094254,0.986156,0.904243,1.049118,1.191873,1.124668,0.980624,0.838268,0.793911,0.739853,0.738851,0.704603,0.573677,0.551722,0.471329,0.611462
0.773156,1.276022,1.521273,1.348413,1.427844,1.374984,1.093491,1.24489,1.214803,0.849888,0.810491,1.093712,1.294288,1.158357,1.068139,1.304663,1.430421,1.207169,1.003537,0.844376,0.838884,0.830071,0.822053,0.789538,0.574548,0.512908,0.451042,0.624314
0.832913,1.357583,1.447726,1.254135,1.411579,1.327651,0.972645,1.036035,1.055388,0.81955,0.773319,1.054249,1.275233,1.157021,1.137299,1.402341,1.42256,1.053859,0.8173,0.699312,0.76143,0.828851,0.804485,0.786145,0.598778,0.528805,0.442947,0.596345
0.787001,1.212506,1.170947,0.994298,1.122212,1.101699,0.821934,0.714077,0.742711,0.662163,0.650291,0.871365,1.008896,0.961018,1.048225,1.209423,1.093727,0.732389,0.534637,0.512069,0.620258,0.728621,0.701179,0.663632,0.535532,0.473421,0.377613,0.485531
0.609444,0.880802,0.818552,0.689657,0.718067,0.771434,0.646922,0.457495,0.467036,0.495595,0.514585,0.631658,0.701841,0.739985,0.850575,0.817899,0.63522,0.434728,0.339268,0.385474,0.481643,0.544947,0.545847,0.50974,0.426113,0.36271,0.280762,0.359161
0.473636,0.594449,0.555147,0.460541,0.483265,0.578922,0.52898,0.327803,0.29523,0.348846,0.368481,0.394721,0.425676,0.49172,0.56263,0.473241,0.347961,0.27229,0.222984,0.270762,0.319367,0.325676,0.361658,0.346077,0.30414,0.257894,0.211039,0.282934
0.420465,0.419023,0.442045,0.409062,0.41782,0.528688,0.488658,0.272759,0.226747,0.264002,0.256538,0.277482,0.274134,0.274327,0.340437,0.336833,0.259008,0.19966,0.149706,0.157213,0.174922,0.168196,0.209271,0.207026,0.225558,0.226595,0.189147,0.257545
0.428316,0.395293,0.400092,0.363413,0.363678,0.511707,0.502532,0.285211,0.210873,0.235693,0.234643,0.29156,0.281122,0.211387,0.248705,0.261445,0.204462,0.155855,0.120912,0.111798,0.129768,0.128175,0.125462,0.133254,0.178584,0.195225,0.183076,0.24156
0.369728,0.368956,0.349194,0.300294,0.305575,0.430188,0.451538,0.28941,0.208915,0.201185,0.200464,0.284488,0.306823,0.241993,0.232668,0.198628,0.156878,0.13118,0.103612,0.096744,0.106721,0.116846,0.108817,0.103713,0.134803,0.147304,0.175495,0.223846
0.252891,0.272992,0.253195,0.237874,0.255438,0.313539,0.340144,0.263657,0.201022,0.160886,0.146549,0.229146,0.282543,0.252382,0.221058,0.167664,0.130179,0.115901,0.08483,0.074162,0.074078,0.099183,0.110114,0.0933,0.101277,0.10367,0.153697,0.188484
0.158566,0.158079,0.167688,0.197188,0.210059,0.221461,0.257098,0.244462,0.193069,0.160541,0.125185,0.161277,0.211614,0.215302,0.180139,0.15503,0.127552,0.097985,0.070708,0.062708,0.05592,0.080714,0.108329,0.090988,0.089575,0.097542,0.133787,0.134373
0.117113,0.100564,0.127202,0.159208,0.147424,0.161782,0.237788,0.220742,0.164781,0.167634,0.117515,0.110705,0.153435,0.154206,0.131225,0.151831,0.142861,0.103363,0.073442,0.064335,0.060746,0.071805,0.096706,0.090753,0.082445,0.089221,0.109689,0.092334
0.093713,0.082849,0.107252,0.124451,0.102239,0.108929,0.203031,0.189463,0.141701,0.157708,0.11391,0.090457,0.116792,0.107718,0.105308,0.144724,0.146167,0.110399,0.076743,0.065838,0.068014,0.059435,0.074575,0.080299,0.069831,0.069336,0.08733,0.077165
0.085187,0.059703,0.074957,0.085377,0.068356,0.06952,0.144077,0.156343,0.130141,0.130504,0.107114,0.094649,0.097888,0.092044,0.092487,0.12639,0.120475,0.097741,0.079279,0.070611,0.068097,0.053212,0.054468,0.063829,0.072875,0.066794,0.069562,0.069841
0.075394,0.04424,0.046223,0.046885,0.040144,0.048855,0.088616,0.126122,0.127951,0.094738,0.09017,0.092644,0.084043,0.087765,0.097265,0.09778,0.076802,0.06881,0.073147,0.068004,0.057526,0.045508,0.03782,0.047274,0.080497,0.077909,0.066962,0.065219
