-0.001714,-0.001004,-0.000759,-0.000961,-0.001652,-0.001758,-0.001748,-0.001329,-0.001993,-0.002434,-0.001725,-0.001706,-0.001561,-0.001183,-0.001507,-0.001562,-0.001443,-0.00158,-0.001221,-0.001828,-0.002161,-0.001774,-0.001686,-0.001818,-0.001594,-0.001499,-0.002362,-0.001398,-0.001453,-0.001071,-0.001463,-0.001904,-0.00152,-0.001213,-0.000441,-0.000754,-0.001055,-0.000981,-0.000957,-0.001112,-0.000778,-0.000376,-0.00086,-0.000892,-0.001183,-0.001613,-0.00092,-0.001115,-0.001314,-0.001024,-0.001324,-0.000892,-0.00181,-0.001476,-0.000779,-0.001004,-0.00108,-9e-04,-0.000541,-0.000685,-0.001269,-0.001119,-0.001182,-0.000728,-0.001635,-0.001209,-0.000537,-8.1e-05,-0.001379,-0.001239,-0.000965,-0.000919,-0.001173,-0.001161,-0.000568,-0.000694,-0.000908,-0.000744,-0.000744,-0.000552,-0.000807,-0.000879,-0.001167,-0.000816,-0.000472,-0.000799,-0.000456,-0.000405,-0.000563,-0.000817,-0.000787,-0.000726,-0.000789,-0.000525,-0.000721,-0.00028,-0.00042,-0.00069,-0.000461,-0.000966,-0.000633,-0.000509,-0.000689,-0.000488,-0.000381,-0.000448,-0.000233,-0.000693,-0.000684,-0.000393,-0.000778,-0.000772,-0.000387,-0.000628,-0.000377,-0.000145,-0.000387,-0.000508,-0.000604,-0.000781,-0.000371
0.000867,0.000586,0.000164,0.00015,0.00049,0.001215,0.000992,0.000563,0.001093,0.001636,0.000878,0.000829,0.000804,0.000663,7.8e-05,0.000285,0.000149,0.000506,-0.000261,0.000624,0.000899,0.000921,0.000844,0.000842,0.0013,0.000538,0.001132,0.000526,0.000659,0.000373,0.000202,0.001424,0.000963,0.000278,-0.000114,0.000299,0.000449,0.000253,-1.7e-05,0.000628,0.000377,-0.000255,0.000292,0.000232,0.00045,0.000825,0.000727,-5.7e-05,0.000745,0.000477,0.000654,0.000451,0.000537,0.000455,0.000102,0.000337,0.000547,2.6e-05,-0.000144,0.000359,0.000671,0.000323,0.000576,9.5e-05,0.000712,0.000847,0.000174,-5.4e-05,0.000461,0.000204,0.000161,0.000222,0.000668,0.000566,0.000206,0.000539,0.000256,0.000167,0.000127,-8.2e-05,0.000505,0.000534,0.000781,0.000811,0.000192,-9e-06,0.00018,-0.000195,0.000276,0.000302,0.000577,0.000152,0.000261,0.000251,0.000245,0.000434,0.000303,0.000462,0.000151,0.000371,0.000243,0.000429,0.000439,0.000109,5.7e-05,0.000253,0.000245,0.000372,0.000121,0.000248,0.000366,0.000425,-6.1e-05,0.000321,0.00023,2.5e-05,0.000136,0.000413,4.1e-05,0.000691,6.1e-05
-0.000282,-0.000314,-3.1e-05,1.1e-05,0.000119,-0.000727,-0.000556,-0.000298,-0.000624,-0.000472,-0.000184,-0.000202,-0.000475,-0.000652,0.000253,0.00027,0.000422,0.000475,0.000884,-0.000113,-0.000716,-0.000511,-0.000244,-0.00051,-0.000676,-0.000123,-0.000169,-0.000206,-0.000313,-0.000132,0.000206,-0.000951,-0.001056,-0.000128,-3.7e-05,-5.6e-05,1.6e-05,7e-06,-5e-05,-8.7e-05,1.7e-05,-0.000395,-0.000337,-0.000176,-3e-06,-0.001084,-0.000701,7.6e-05,-0.000523,-0.000623,-0.000439,-0.000416,5.8e-05,6.9e-05,0.000152,-6.6e-05,-0.000185,0.00018,4.2e-05,-0.000449,-0.000324,7.5e-05,-9.7e-05,6.9e-05,-0.00059,-0.001053,-0.000221,-0.000167,-0.000139,0.000223,0.000207,6.9e-05,-0.000491,-0.000616,-0.000177,-0.000404,-4.2e-05,9.9e-05,-8e-06,0.000181,-4e-04,-0.000592,-0.000511,-0.000745,-0.000411,0.000246,0.000141,0.000163,-9.5e-05,-0.000227,-0.000492,1.1e-05,2e-05,0.000165,0.000209,-0.00015,-0.000427,-0.000628,-0.00025,-0.000175,-0.000209,-0.000877,-0.000408,-0.000183,-0.000244,-0.000502,-0.000135,-0.000132,-0.000265,-0.000103,-0.000176,-0.000261,-7.1e-05,-0.00021,-0.000174,-0.000266,-0.00022,-0.000176,-0.000123,-5e-04,-0.000288
-9.2e-05,-0.000189,-6.7e-05,-0.000343,-0.000313,-0.000269,-0.000175,0.000125,0.000389,-0.00042,-0.000221,0.000162,-0.000245,0.000482,-0.000121,-0.000467,-0.000519,-0.000845,-0.000758,-0.000548,0.000157,4e-06,-0.000293,6.6e-05,-0.000161,-0.000104,-0.000351,-0.000194,3e-06,-0.000276,-0.000463,0.000437,0.000802,0.000147,-0.000141,-0.00011,-0.000114,-0.000377,-0.000161,-0.000264,-0.000556,7.2e-05,5.2e-05,0.00012,-3e-06,0.000865,0.000515,-0.000162,-0.000315,0.000445,0.000356,0.000136,-0.000461,-0.000402,-0.000337,-1e-04,-6.7e-05,-0.000414,-0.000237,7.1e-05,5.8e-05,-0.000115,-0.000158,-0.000223,0.000212,0.000426,9.6e-05,-7.3e-05,-0.000111,-0.00049,-0.000249,-0.00015,0.000672,0.000331,-0.000107,-0.000259,-0.000195,-0.000257,-0.000266,-0.000272,0.000161,-0.000181,0.000127,0.000342,-4.5e-05,-0.000375,-0.000455,-0.000337,-8.1e-05,0.000141,-0.000123,-0.000401,-0.000496,-0.000202,-0.000278,-4e-04,-0.000254,0.000258,0.000201,-3.8e-05,-0.000128,0.000178,7e-06,0.000153,-0.000213,7.1e-05,6e-06,4.2e-05,0.00045,-1.9e-05,0.000109,3.5e-05,0.000136,0.000224,-0.000181,-0.000337,0.000132,-1e-06,-0.000121,0,0.00011
8.2e-05,6e-05,1e-06,0.000386,0.000149,0.000389,0.000369,-0.00019,-0.000342,0.000492,5.1e-05,-8.6e-05,0.000526,-0.000418,-0.000318,-6e-05,0.000443,0.000649,0.000542,0.000241,0.000221,-0.000173,0.00039,0.000269,0.000193,0.000278,0.000292,0.000266,-4.9e-05,0.000443,0.000378,-3.7e-05,-0.000564,-7e-06,0.000103,0.000164,0.000118,0.000213,0.000165,3.2e-05,0.000172,0.000157,6.8e-05,-0.000149,-0.000182,-0.000287,-0.000533,-1.5e-05,-5.1e-05,-0.000199,-0.000189,-0.000162,0.000618,0.000255,0.000267,7.9e-05,0.000124,0.000383,0.000482,1e-04,-0.000132,7.9e-05,0.000259,0.000221,0.000129,-2.6e-05,-8.5e-05,8.6e-05,0.000288,0.00046,0.000194,9e-05,-0.00035,-0.000245,0.000199,9.1e-05,-0.000184,7.5e-05,0.000106,-3.6e-05,-9e-05,0.00023,-9.4e-05,-0.000548,-0.000158,0.000197,0.000157,0.000172,1.4e-05,-0.000189,0.000146,0.000361,0.00036,0.00022,0.000377,0.000183,-7.6e-05,-0.000243,-0.000313,5.9e-05,0.00023,-3.2e-05,7e-06,-1.1e-05,9.7e-05,-0.000191,-0.00013,-7.8e-05,-0.000312,-0.000121,-0.000118,3.3e-05,-0.000116,-2.3e-05,-1.5e-05,0.000246,0.000121,5.2e-05,0.000138,0.00015,3.7e-05
-9.4e-05,0.000101,0.000156,-0.000124,2.5e-05,-0.000376,-0.00043,4.8e-05,0.000118,-0.000166,8.8e-05,0.000181,-0.000308,0.000272,0.000328,8.7e-05,-0.000762,-0.00047,9e-06,-6e-05,-2.1e-05,0.000547,-0.000162,-0.000529,-0.00029,-4e-04,2.3e-05,-0.000118,0.000214,-0.000291,-0.000154,-0.000246,0.000462,-0.00011,-0.000117,-0.000119,-5e-06,7e-05,-0.00011,8e-06,-9.1e-05,-9.2e-05,0.000246,0.000199,0.000221,0.000162,0.000591,0.000312,0.000124,7e-06,0.000238,0.000471,-0.000147,6.5e-05,-1.7e-05,-9e-05,-7.6e-05,-0.000241,-0.000418,-3e-05,0.000258,8.5e-05,2.2e-05,-0.000136,7.5e-05,0.000134,0.000173,0.000102,4e-05,-0.00021,-0.000216,-0.000199,0.000292,0.000148,1.7e-05,-7.5e-05,0.000167,-6e-05,8.1e-05,0.000172,2.6e-05,3.9e-05,0.000393,0.000233,0.000328,-3.7e-05,-4.6e-05,-0.000131,7.8e-05,0.000104,-8.9e-05,-0.000352,-0.000185,-0.000162,-0.000156,-0.000167,0.000181,0.000176,0.00014,0.000159,-0.000367,-0.000127,-0.000141,-9.3e-05,-0.000109,0.000178,8.3e-05,0.000108,0.000306,7.4e-05,1.2e-05,3.8e-05,0.000205,1.1e-05,-3.1e-05,5.1e-05,5e-05,-4.6e-05,4.8e-05,4e-05,-1.3e-05
6.1e-05,-0.000121,-0.000258,1.4e-05,-4.4e-05,0.000116,0.000368,-9.8e-05,-0.00012,-2.9e-05,-0.000315,-3.9e-05,0.000201,-2.9e-05,-0.000167,0.000192,0.000545,0.000454,-0.000213,0.000196,-5.1e-05,-0.000278,0.000183,0.000436,0.000237,0.000463,-0.000241,1.7e-05,-5.3e-05,0.000133,0.000217,-3.9e-05,-0.000127,0.000123,3e-06,0.000185,-1e-05,4.6e-05,0.000173,0.000253,0.000154,-1.5e-05,-0.000164,-0.000178,-0.000334,4.9e-05,-0.00026,1.5e-05,0.000126,9.1e-05,-8.9e-05,-0.000433,-0.00019,3.8e-05,0.000123,3.3e-05,6.6e-05,0.000218,0.000202,7.1e-05,-0.000186,-0.000195,6.9e-05,9.4e-05,-0.000124,-1e-06,-6.2e-05,-7.8e-05,-1e-04,8.5e-05,0.000258,0.000102,-0.000248,-0.000163,5.6e-05,0.000121,-0.000132,-5.8e-05,-8.1e-05,-0.00011,-4.8e-05,-1.1e-05,-0.000145,-7.7e-05,-4.4e-05,-8.4e-05,-6.9e-05,6.9e-05,-0.000146,-0.000128,5.6e-05,0.000226,0.000201,4.5e-05,-9e-06,8.6e-05,0.000154,7.1e-05,-5.7e-05,-7.7e-05,0.000163,0.000306,7.4e-05,-2.1e-05,0.000168,0.000129,-5.2e-05,-4.8e-05,-0.000276,-2.7e-05,0.000135,-8.9e-05,-0.000167,1.1e-05,-6.2e-05,-0.000141,-9e-06,0.000146,-6.5e-05,-4.9e-05,0.000139
0.000174,0.000111,6.8e-05,4.2e-05,-0.000116,6.9e-05,-7.1e-05,8.3e-05,-5e-05,0.000222,0.000577,-0.000152,-0.000313,-6.7e-05,-3.5e-05,-6e-05,-0.000135,-0.000313,2.7e-05,-5.4e-05,0.000278,0.000127,-0.000265,-6.6e-05,-8.2e-05,-0.00034,9.6e-05,-0.000204,-0.000246,-0.000166,-0.000258,8.3e-05,3.2e-05,-0.000112,0.000168,8.2e-05,2.1e-05,7e-06,-0.00024,-0.00017,9.5e-05,-3.9e-05,-0.000143,-2e-06,0.000246,-0.000202,-0.00013,-0.000197,1e-06,-0.000147,-3e-05,0.000257,-0.000113,-0.000225,-3.5e-05,0.000145,-4.6e-05,-0.000204,-7.3e-05,-0.000239,0.000106,0.000268,-7.7e-05,-7.6e-05,-7e-06,-6e-06,-0.000199,-1.9e-05,1.3e-05,-4.7e-05,0.000156,0.000165,5.1e-05,0.000259,-0.000159,5.1e-05,0.000236,7.3e-05,6.8e-05,0.000149,-3.2e-05,6.6e-05,-0.000125,-3.5e-05,5e-06,0.000103,7.9e-05,6.8e-05,0.000109,2.3e-05,0.000101,-7.9e-05,-0.000193,-5.7e-05,-7.1e-05,0.000102,1e-06,0.000106,0.000135,-4.5e-05,-9.2e-05,-0.000214,-0.000178,-4.6e-05,-7.3e-05,-3.9e-05,9.4e-05,-5.2e-05,0.000132,3e-05,-0.000131,-4.2e-05,7.2e-05,0.00021,-5e-06,-3.4e-05,-0.000156,-0.000139,3.7e-05,6.3e-05,-0.000255
-0.000124,-0.000288,-0.000309,-0.00012,0.00012,-9.5e-05,-0.000122,-3.9e-05,0.000191,-0.000219,-0.000614,1e-04,0.000333,0.000115,8.3e-05,9e-06,9e-06,0.000183,-0.000237,5e-06,-0.000444,-7.9e-05,0.000252,-3.2e-05,-3.4e-05,-9e-06,5.2e-05,0.000272,0.000198,0.000208,0.000115,0.000114,-6.4e-05,0.000156,-0.000145,-7.5e-05,-8.2e-05,-3.3e-05,-8.1e-05,6e-05,-5.9e-05,-6e-06,-0.000142,-4.2e-05,-1.6e-05,0.000177,4.2e-05,0.00024,-1e-04,0.000215,-7.9e-05,-0.000133,7.3e-05,0.000243,-5.4e-05,-0.00013,4.7e-05,0.000139,-5.3e-05,0.000201,-0.000139,-0.00021,-0.000167,0.000145,-4.5e-05,-9.4e-05,9.4e-05,7.9e-05,1e-06,-9.4e-05,-0.000268,-0.000196,-4.1e-05,-0.000102,0.000137,-0.000158,-0.000113,-9.1e-05,-1.3e-05,-0.000171,8.3e-05,-1.2e-05,7.6e-05,8.2e-05,-2.5e-05,3.2e-05,-6.2e-05,-8.8e-05,-6e-06,7e-05,-3.4e-05,6.8e-05,0.000114,-0.000145,-3.6e-05,-2.4e-05,0.000163,-1.2e-05,-6.4e-05,3.1e-05,2.2e-05,0.000193,0.000236,8.2e-05,-5.3e-05,-2.7e-05,-8e-06,-5.7e-05,1.5e-05,3.7e-05,1e-05,-3.8e-05,-3.7e-05,-0.000199,-4.8e-05,1.9e-05,3e-05,-1.4e-05,2.3e-05,-1e-06,9.1e-05
1.9e-05,0.000165,0.000339,0.000113,-4.6e-05,4.5e-05,5.6e-05,6.7e-05,-0.000106,0.000117,0.000339,0.000142,-0.000229,5.5e-05,4.1e-05,-4.3e-05,5.8e-05,-0.000255,0.000296,5.7e-05,0.000216,-0.000147,-0.00026,0.000113,-4e-06,3.3e-05,-8e-05,-0.000123,-0.000201,-0.000222,7.1e-05,-0.000144,-9.3e-05,-0.000149,-5.2e-05,9.9e-05,5.6e-05,4.2e-05,0.000196,-3.1e-05,2e-06,7.5e-05,0.000258,0.000122,0.000213,7e-06,-4.6e-05,-0.000215,0.000118,5.7e-05,0.000152,1.6e-05,-4.9e-05,-0.00018,0.000109,6e-05,-5.2e-05,-3.4e-05,5.2e-05,3.6e-05,4.1e-05,4.1e-05,0.000156,-1.6e-05,5.2e-05,4.4e-05,1.9e-05,4.2e-05,0.000102,-1.1e-05,2e-04,8e-06,4.6e-05,4.5e-05,-0.000106,2.8e-05,6e-06,0.000148,-5.2e-05,0.000131,2.1e-05,2e-05,-3.1e-05,5.8e-05,7.6e-05,7.5e-05,7e-06,0.000115,3e-05,2.1e-05,-7.6e-05,-3.7e-05,-2.5e-05,0.00012,8.8e-05,6.6e-05,-0.000229,-0.000113,2.5e-05,-3.7e-05,1e-05,3e-06,-2.5e-05,-1.1e-05,-9.9e-05,6e-06,6.1e-05,8e-06,-2.5e-05,-8.7e-05,-1e-05,5.5e-05,1.2e-05,0,2.9e-05,-0.00013,-0.000102,-4.8e-05,7.3e-05,0,-6.6e-05
-0.00012,7e-05,-0.00012,-0.000135,6e-06,-5.4e-05,-2.6e-05,-4e-06,5.9e-05,-2.2e-05,-0.000123,-0.000269,-1.9e-05,7.8e-05,-2.4e-05,0.000145,4.2e-05,8.8e-05,-0.000227,-0.00013,-9.8e-05,0.000184,0.000265,-7.7e-05,-0.000215,-4.2e-05,0.000188,2.7e-05,0.000261,0.000215,-0.000107,0.00024,0.000158,8.8e-05,0.000109,-0.00011,-4e-05,3.7e-05,-0.000123,4.3e-05,1.3e-05,7.3e-05,-6.9e-05,-3.9e-05,-0.000302,-0.000115,7.7e-05,0.000131,-0.000115,-4e-05,5.7e-05,-4.5e-05,0.000152,0.000115,-0.000224,-2.8e-05,5.8e-05,-4.9e-05,-5.9e-05,1.2e-05,2.2e-05,3.1e-05,-0.000125,-5.3e-05,-0.000109,1.7e-05,0.000138,-6.1e-05,-4.4e-05,6.3e-05,-0.000112,0.000111,-8e-05,-2.8e-05,-2.5e-05,-3.7e-05,1.9e-05,-2.1e-05,-1.2e-05,-0.000115,-0.000186,-5.1e-05,0.000108,3.9e-05,-0.000117,-3.9e-05,-7.1e-05,-8.2e-05,4e-06,-5.6e-05,7.9e-05,1.7e-05,-0.000152,-1.7e-05,-0.00011,-7.6e-05,0.000109,2.1e-05,-4.9e-05,-2e-05,-2e-06,3.2e-05,-1e-05,-9.7e-05,0.000156,3.3e-05,-0.000101,-0.000114,2.1e-05,7.8e-05,2.9e-05,2.8e-05,-3e-05,5.2e-05,-2.2e-05,3.2e-05,-3.9e-05,5.5e-05,-0.000155,-2.4e-05,0.000142
5e-06,-3e-06,9.1e-05,3.9e-05,-4.6e-05,5e-06,8.2e-05,-0.000112,4.8e-05,6.9e-05,5.8e-05,0.00019,0.000124,-9.3e-05,-9e-05,-7.8e-05,1e-05,-1.4e-05,0.000139,0.000117,0.00014,-5.9e-05,-0.000131,7.3e-05,0.00026,4.5e-05,-0.00018,3.6e-05,-0.000146,-0.000145,3.3e-05,-0.000158,-1.7e-05,-7e-05,7e-06,0.000103,3.5e-05,-4.4e-05,5e-05,2e-05,-4.3e-05,-4.1e-05,-4.9e-05,-1e-06,0.000145,0.000102,-5.6e-05,-2.5e-05,0.000131,-4.1e-05,-0.000181,-1e-05,-0.000107,-5.9e-05,0.000148,-7.2e-05,-1e-06,6.1e-05,4.4e-05,5e-06,-2.8e-05,4e-05,1.6e-05,-5.7e-05,0.00011,9e-06,-4.9e-05,-1.2e-05,-8.1e-05,-4e-06,9e-06,-0.000166,6e-06,4e-05,1.3e-05,0.000117,-6.1e-05,2e-05,3.3e-05,4.1e-05,5.5e-05,4.8e-05,-6.5e-05,-0.000106,-8e-06,2.1e-05,2e-06,4e-05,-2.2e-05,3.3e-05,-4e-05,-1e-06,0.00017,7.6e-05,1e-04,4.7e-05,-7.6e-05,-7.1e-05,0,-2.7e-05,-8.3e-05,-3.5e-05,1.4e-05,6e-05,-0.000125,-5.1e-05,2.1e-05,5.4e-05,-1e-05,-7e-06,-4.2e-05,-3e-05,-1.8e-05,-1.6e-05,1e-05,-4.6e-05,8.3e-05,6e-06,6.5e-05,-6e-06,-2.9e-05
2.5e-05,-4.6e-05,9e-06,-5.3e-05,2e-05,-4.5e-05,-9.6e-05,6.7e-05,-5.8e-05,-3.6e-05,5.3e-05,-5.5e-05,-0.000139,3.2e-05,5.7e-05,5.1e-05,-0.000163,6e-05,-3.8e-05,-0.000101,-0.000116,-4.9e-05,0.000112,-0.000105,-4.8e-05,-1.4e-05,0.000102,-0.000108,0.000132,-1.5e-05,1e-05,2e-06,-5.2e-05,2.1e-05,-3e-05,-7.6e-05,-8.2e-05,4.9e-05,7e-05,-2.5e-05,6.6e-05,6.6e-05,0.000115,1e-06,-6.4e-05,-8.3e-05,-1e-05,-9e-06,-8.3e-05,-5.2e-05,8.3e-05,6.1e-05,5.3e-05,-1e-06,-9e-06,3.1e-05,-2.9e-05,-5e-05,-4.4e-05,-6e-06,2e-05,-7.7e-05,-9e-06,1.8e-05,-7.5e-05,-1.2e-05,1.5e-05,-3e-05,7e-05,-2.4e-05,-7e-06,-1.7e-05,0.000102,-1.4e-05,6.8e-05,-6.9e-05,5.4e-05,-5.9e-05,-8.1e-05,3.1e-05,-5.6e-05,-5.7e-05,8.8e-05,-2.9e-05,-2.8e-05,-0.000119,1.6e-05,1.2e-05,1.5e-05,-3.8e-05,-2.7e-05,-3e-05,-1.4e-05,-9.9e-05,-3.5e-05,-2.9e-05,1.8e-05,3.4e-05,-5.5e-05,9.1e-05,3.7e-05,1.6e-05,-6.9e-05,6e-06,7.7e-05,2e-05,-2.4e-05,-6e-06,-7e-06,2.7e-05,6.2e-05,-1.3e-05,-7e-06,-5e-06,7.2e-05,-2.7e-05,-4.5e-05,-4.1e-05,-0.000126,-1.6e-05,5.2e-05
4.2e-05,4.3e-05,-9.6e-05,2.4e-05,5e-06,6.4e-05,6.3e-05,-2.6e-05,0.000121,-4e-06,-9.5e-05,-4.7e-05,6.8e-05,-1.9e-05,-6.9e-05,-4.9e-05,9.6e-05,-7.2e-05,5e-06,9.1e-05,0.000143,1e-04,-0.00013,0.000155,7e-06,1e-05,-2.7e-05,0.000126,-3e-05,8e-06,2e-05,1.7e-05,8.2e-05,1.6e-05,-3.3e-05,-2.1e-05,1.4e-05,-4.2e-05,-8.6e-05,1.4e-05,-1.4e-05,-5.8e-05,-3.4e-05,3.3e-05,2.5e-05,-1.4e-05,5e-05,-7.6e-05,5.6e-05,-3e-06,-5e-06,-7.3e-05,-3.5e-05,-1.8e-05,-3.7e-05,-1.5e-05,-4e-06,2.8e-05,4.2e-05,3.6e-05,-5.4e-05,4.7e-05,2.8e-05,-3e-06,4.8e-05,7e-06,-2.8e-05,-2.9e-05,-4.1e-05,-5.1e-05,-4.6e-05,6.5e-05,-0.000103,3.1e-05,-3.8e-05,4e-05,-2.7e-05,-1.1e-05,3.4e-05,-4.1e-05,6e-05,3.8e-05,-5.7e-05,3.7e-05,-2.2e-05,6.7e-05,3.5e-05,2e-06,-2.9e-05,2e-05,4e-06,1.6e-05,5.4e-05,4.7e-05,1.3e-05,0,-2e-05,1.7e-05,5.2e-05,-6e-05,5e-06,-9e-06,2.7e-05,2.5e-05,-2.4e-05,-2e-05,4.5e-05,3.8e-05,-2.7e-05,-1.6e-05,-3.5e-05,1.4e-05,1e-06,4e-06,-3e-05,4.5e-05,-1.5e-05,3e-06,-9e-06,-5e-06,-6.7e-05
-1.5e-05,-6.1e-05,8.1e-05,1.1e-05,-1e-05,-2.4e-05,-4.7e-05,2e-05,-8.9e-05,7e-06,8.1e-05,9.7e-05,-2e-06,-1.7e-05,9.7e-05,-2.4e-05,-1.4e-05,9.8e-05,-6.7e-05,-2.4e-05,-8.4e-05,-7.4e-05,5.4e-05,-0.000132,-3.7e-05,-2.4e-05,-4.9e-05,-8.6e-05,4e-06,4.7e-05,-4.3e-05,5.2e-05,-4.2e-05,1.4e-05,6e-05,5.2e-05,-2.1e-05,3.1e-05,8e-05,-2.4e-05,2.1e-05,2.5e-05,1.7e-05,-4.7e-05,1.8e-05,5.2e-05,-1.1e-05,2.8e-05,-4e-06,-4e-06,-5e-06,1.8e-05,2.1e-05,3.6e-05,5e-06,3.7e-05,2e-06,-2.7e-05,-2.2e-05,-3.6e-05,4.2e-05,-2.1e-05,2.3e-05,-1e-06,-1e-06,1e-06,8e-06,6e-05,-1e-05,4.1e-05,5.5e-05,-7.6e-05,3.3e-05,-5.6e-05,4.2e-05,-5.6e-05,1.3e-05,3e-06,-2e-05,4e-06,1.8e-05,-8e-06,4.2e-05,1.5e-05,1.8e-05,5e-06,2e-06,5e-06,7e-06,-8e-06,2e-06,-1.1e-05,-3.8e-05,-2.8e-05,3e-05,-9e-06,1.5e-05,-2.8e-05,-3.1e-05,5.3e-05,0,-7e-06,-2.9e-05,-6e-06,1e-06,-5e-06,-2.5e-05,9e-06,1.3e-05,3e-06,2.3e-05,-2.3e-05,3.5e-05,-1.8e-05,-3.6e-05,-3.8e-05,3.2e-05,6e-06,-4.1e-05,-9e-06,2.4e-05
-8e-06,1.5e-05,-4.2e-05,1.8e-05,1.1e-05,-3e-06,3.8e-05,1.9e-05,1e-06,-1e-05,-5.6e-05,-6.5e-05,-1.4e-05,-4e-06,-3e-06,4e-06,6e-06,-3.9e-05,5.6e-05,-3.3e-05,3.6e-05,4.4e-05,5e-06,5.3e-05,4.2e-05,-1.2e-05,5.7e-05,3.4e-05,4.1e-05,-2.3e-05,5.6e-05,-3.6e-05,-2.2e-05,-1.9e-05,-4.2e-05,-3.9e-05,1.5e-05,-1.8e-05,-4e-05,1.2e-05,-2.3e-05,-4.1e-05,-1e-05,1.2e-05,-4.3e-05,9e-06,-1.7e-05,-1e-06,1.8e-05,1.4e-05,3.7e-05,2.5e-05,-1.7e-05,-5.6e-05,-1e-05,-2.6e-05,-1.2e-05,1.6e-05,1.5e-05,1.9e-05,3e-06,2e-05,-3e-05,0,-3.6e-05,-1.6e-05,-7e-06,-2.3e-05,9e-06,9e-06,-8.2e-05,6.4e-05,-2e-06,2.4e-05,0,4.9e-05,8e-06,2.1e-05,1.8e-05,2.7e-05,-3.3e-05,-7e-06,-4.6e-05,1.6e-05,-2e-06,1e-05,4e-06,1.9e-05,1e-06,0,-1.5e-05,2.2e-05,6e-06,-2e-06,-2.8e-05,0,1.2e-05,-6e-06,1.5e-05,-2.5e-05,1.5e-05,1.3e-05,1.5e-05,-1.9e-05,3.5e-05,-1.4e-05,-9e-06,0,0,1.5e-05,-3e-06,-1.1e-05,-2.3e-05,1e-06,3.3e-05,1e-05,-5.7e-05,2.6e-05,6.1e-05,5e-06,6e-06
7e-06,-1e-06,2.1e-05,2e-06,-8e-06,-1.4e-05,-1.1e-05,-2.3e-05,-1.1e-05,1.2e-05,5.7e-05,7e-06,-1.9e-05,2e-06,-1e-06,3.3e-05,-1.2e-05,2.1e-05,-1.6e-05,3.6e-05,-4.3e-05,-4.7e-05,-1.7e-05,-1.8e-05,-1.5e-05,1.9e-05,-5e-05,1.2e-05,-7.5e-05,2.5e-05,-4.7e-05,-2e-06,3.9e-05,1.4e-05,6e-05,-1.1e-05,5e-06,-4e-06,1.2e-05,-9e-06,2.1e-05,3.5e-05,-5e-06,6e-06,1.1e-05,-2.4e-05,-2e-06,-5e-06,-7e-06,-7e-06,-1.6e-05,-3e-06,2.1e-05,3.3e-05,-6e-06,1.5e-05,3e-06,-3e-06,-1.4e-05,2.6e-05,-6e-06,-2.6e-05,1.2e-05,7e-06,-1e-06,3e-06,1.9e-05,3.3e-05,1.8e-05,-1e-06,2.7e-05,-3.1e-05,-1.7e-05,3e-06,6e-06,2e-06,-2.1e-05,-1.5e-05,2e-06,-1.9e-05,3e-06,-1.6e-05,-2e-06,1e-06,9e-06,1.4e-05,-1.7e-05,-1.2e-05,-8e-06,3e-06,2e-05,-2.5e-05,1.3e-05,-5e-06,-9e-06,-3e-06,-8e-06,3e-05,-1.7e-05,-3e-06,-4e-06,-2.2e-05,-8e-06,-1e-06,-2.8e-05,-8e-06,4e-06,-1.1e-05,-1.4e-05,6e-06,2e-06,2e-05,1.3e-05,2.1e-05,1.6e-05,1e-06,2e-05,-1.7e-05,-5.9e-05,1e-06,-2.8e-05
7e-06,2e-06,5e-06,-2e-06,1e-05,1.5e-05,-1.4e-05,1.3e-05,-7e-06,-3.8e-05,-3.1e-05,2.8e-05,3.1e-05,0,7e-06,-2.1e-05,-3e-06,-3.5e-05,4.2e-05,1e-06,2.3e-05,2e-05,-6e-06,1.3e-05,2.4e-05,8e-06,2.6e-05,-2e-05,4.8e-05,-6e-06,2.1e-05,4.3e-05,-5.9e-05,-2.1e-05,-3.1e-05,1.1e-05,1e-05,-5e-06,1.3e-05,-5e-06,-6e-06,-1e-06,1.9e-05,4e-06,-3.1e-05,2.1e-05,1.7e-05,-1.7e-05,2e-05,1e-06,1e-05,-7e-06,1e-06,-1.2e-05,3.5e-05,4e-06,8e-06,1e-05,1.6e-05,-2.2e-05,-3e-06,2.9e-05,2e-06,2e-06,-1.2e-05,5e-06,1.9e-05,-1.2e-05,-1e-05,-2.4e-05,1.5e-05,9e-06,-5e-06,-2.4e-05,-1.4e-05,-3e-05,1.6e-05,2e-06,0,-1e-06,0,2.1e-05,1.1e-05,-4e-06,-2e-06,-5e-06,-4e-06,7e-06,2e-06,-9e-06,0,1.8e-05,-1.3e-05,3.4e-05,6e-06,-3e-06,1.3e-05,9e-06,6e-06,-1.1e-05,-1.6e-05,-6e-06,-5e-06,-1.4e-05,3e-06,-3e-06,-1e-06,-1.6e-05,4e-06,-5e-06,-3e-06,1e-06,-8e-06,-3e-06,-1e-05,-4e-06,-1.6e-05,-1.2e-05,1.8e-05,-5e-06,2.5e-05
6e-06,-2e-06,1e-06,-7e-06,1e-06,-7e-06,1.8e-05,2e-06,1.6e-05,2e-05,6e-06,-4.3e-05,-1.9e-05,-1.8e-05,-1.8e-05,6e-06,-1.3e-05,2.1e-05,-3.8e-05,-1.2e-05,-2.2e-05,2e-06,3.7e-05,-2.5e-05,-2.5e-05,-1.8e-05,-1.8e-05,1.4e-05,0,2e-06,-8e-06,-7e-05,2.4e-05,1.4e-05,1.2e-05,5e-06,-2e-06,-8e-06,0,1e-06,1.4e-05,2e-06,-1.7e-05,1e-06,4.2e-05,-1.3e-05,-1.4e-05,2.4e-05,4e-06,-2.2e-05,-1.9e-05,-1.3e-05,1.4e-05,1.5e-05,-1.1e-05,-2e-06,1e-06,-2.3e-05,-1.4e-05,4e-06,-7e-06,-1.7e-05,-9e-06,5e-06,-1e-06,-1e-05,2e-06,5e-06,8e-06,1.2e-05,-1.5e-05,2e-06,-4e-06,1.8e-05,0,7e-06,-8e-06,-4e-06,1e-06,1e-05,-1e-05,-2.7e-05,-6e-06,1e-06,1e-05,-7e-06,1e-05,3e-06,-7e-06,1e-06,-1.4e-05,-1.7e-05,-1.9e-05,-4e-06,-9e-06,9e-06,-1e-06,0,6e-06,6e-06,1e-05,-3e-06,-1.3e-05,1.7e-05,-7e-06,-7e-06,5e-06,-5e-06,-9e-06,-9e-06,6e-06,-2e-06,-3e-06,-1.5e-05,3e-06,-7e-06,-9e-06,1e-05,-9e-06,1e-06,1e-06
-8e-06,3e-06,0,-7e-06,4e-06,-1e-06,-2e-06,1.2e-05,-9e-06,-1.2e-05,1e-05,1e-05,8e-06,1.2e-05,1.3e-05,-2e-06,0,-2.2e-05,1.9e-05,1.4e-05,3e-06,-1.2e-05,-3e-05,4.4e-05,-6e-06,2e-06,-1e-05,-9e-06,-1.4e-05,-7e-06,4e-06,3.7e-05,8e-06,-1e-05,-1.9e-05,-5e-06,3e-06,7e-06,1.4e-05,2e-06,-7e-06,-5e-06,-5e-06,-9e-06,-9e-06,-7e-06,-1e-06,4e-06,0,2e-06,-1.7e-05,1.4e-05,-8e-06,-1.5e-05,-4e-06,-2e-06,-5e-06,2.9e-05,6e-06,-2e-06,1.4e-05,5e-06,-1.2e-05,6e-06,-4e-06,6e-06,-5e-06,-5e-06,1.2e-05,4e-06,2e-05,-2e-06,1.7e-05,-1.5e-05,-4e-06,-2e-06,7e-06,-1.8e-05,0,-1.1e-05,1.3e-05,1.1e-05,-1e-06,-2e-06,4e-06,6e-06,6e-06,-5e-06,8e-06,0,1.1e-05,1.8e-05,2.5e-05,4e-06,8e-06,-8e-06,1e-06,4e-06,1e-06,-2e-06,-3e-06,-1.5e-05,9e-06,2e-06,1.2e-05,2e-06,-1e-06,-5e-06,7e-06,2e-06,-6e-06,-5e-06,5e-06,6e-06,1.3e-05,-5e-06,1.6e-05,7e-06,2.2e-05,1e-05,-1e-06
-5e-06,3e-06,-1.1e-05,7e-06,6e-06,3e-06,-4e-06,-1.8e-05,1e-05,1e-05,-1.8e-05,3.3e-05,-1.5e-05,-1.7e-05,7e-06,2e-06,2.5e-05,1.4e-05,0,-9e-06,1e-05,7e-06,2.2e-05,-2.7e-05,8e-06,7e-06,3.8e-05,0,1.8e-05,6e-06,-9e-06,3e-06,-2e-05,9e-06,3.4e-05,1.6e-05,-8e-06,-1.4e-05,-6e-06,-1e-06,-3e-06,2e-06,2e-05,7e-06,2.4e-05,5e-06,-3e-06,-5e-06,1e-06,1.3e-05,1.5e-05,-1.4e-05,-5e-06,3e-06,2.1e-05,-1e-06,3e-06,-2.2e-05,-6e-06,-6e-06,-1e-05,-2e-06,-4e-06,2e-06,1.4e-05,1e-06,-1.1e-05,4e-06,1e-06,5e-06,-9e-06,4e-06,-7e-06,-4e-06,5e-06,1.4e-05,-2e-06,1e-05,0,5e-06,-3e-06,-7e-06,2e-06,4e-06,-2e-06,1e-06,-1e-05,6e-06,-1.1e-05,2e-06,6e-06,-1.9e-05,-9e-06,-6e-06,1.3e-05,6e-06,7e-06,-2e-06,-1e-06,-2e-06,-1e-06,0,-1.1e-05,-2e-06,-1.1e-05,-4e-06,6e-06,2e-06,0,3e-06,5e-06,-8e-06,-6e-06,-4e-06,-3e-06,-4e-06,-1.7e-05,-5e-06,-2e-05,-6e-06,9e-06
-5e-06,-1.4e-05,8e-06,-1.1e-05,1e-06,2e-06,-1e-06,6e-06,-1e-05,-6e-06,2.6e-05,-4.1e-05,2.5e-05,1.6e-05,7e-06,5e-06,-1.3e-05,-1.3e-05,-1.7e-05,1.3e-05,-6e-06,-5e-06,-1.4e-05,2e-06,8e-06,3e-06,-4.3e-05,1e-05,6e-06,1e-06,1.5e-05,-1.1e-05,2.1e-05,-5e-06,-2.9e-05,-5e-06,1e-06,1e-05,1.3e-05,-3e-06,2e-06,-1.1e-05,-4e-06,-2e-06,-3.2e-05,-1e-06,9e-06,1e-05,-1e-06,-1e-06,-4e-06,6e-06,-1.3e-05,0,-1.4e-05,4e-06,-1e-06,7e-06,1.1e-05,3e-06,-5e-06,7e-06,1e-05,-4e-06,-4e-06,-3e-06,-1e-05,3e-06,-7e-06,-1.8e-05,9e-06,-8e-06,1.1e-05,8e-06,-1.2e-05,-6e-06,-1e-06,-9e-06,-4e-06,1e-06,-6e-06,7e-06,1e-06,9e-06,-7e-06,1e-05,0,-3e-06,7e-06,0,-1.1e-05,1.5e-05,-6e-06,-6e-06,-8e-06,-1e-06,-1.1e-05,-1e-06,-8e-06,2e-06,2e-06,1e-06,8e-06,-2e-06,6e-06,3e-06,-1.2e-05,1e-06,5e-06,0,0,2e-06,2e-06,9e-06,1e-06,3e-06,1.2e-05,-5e-06,2.3e-05,-2e-06,-1.2e-05
4e-06,1.5e-05,-1.6e-05,2e-06,-7e-06,-6e-06,4e-06,1e-06,2e-06,6e-06,-2.3e-05,2.1e-05,-2.6e-05,-4e-06,3e-06,-5e-06,4e-06,1.1e-05,1.8e-05,-2e-06,1.4e-05,-1e-06,-2e-06,6e-06,9e-06,-7e-06,2.2e-05,-1.3e-05,-1.1e-05,1e-06,-1.5e-05,1e-05,-7e-06,1e-06,1.4e-05,-7e-06,-3e-06,-1e-05,-4e-06,0,3e-06,-3e-06,-3e-06,-5e-06,1.4e-05,-9e-06,5e-06,-1e-05,1e-05,5e-06,1e-05,0,7e-06,9e-06,8e-06,-1.1e-05,-2e-06,4e-06,-1.2e-05,-1.1e-05,-1e-06,-1e-05,2e-06,-2e-06,9e-06,3e-06,1e-06,-7e-06,-4e-06,3e-06,3e-06,1.1e-05,-7e-06,-6e-06,1.2e-05,-3e-06,5e-06,9e-06,-2e-06,-1e-06,-2e-06,-8e-06,-2e-06,2e-06,2e-06,-2e-06,0,-3e-06,1e-06,0,4e-06,-1.1e-05,1.2e-05,2e-06,4e-06,2e-06,1.1e-05,-1e-06,5e-06,8e-06,-6e-06,-9e-06,-2e-06,-5e-06,-2e-06,1e-06,6e-06,4e-06,0,-4e-06,-1e-06,1e-06,0,-3e-06,6e-06,-1.4e-05,1e-06,0,-1.2e-05,5e-06,2e-06
2e-06,-5e-06,2.1e-05,-5e-06,4e-06,1e-06,-6e-06,-5e-06,1e-06,-7e-06,1.7e-05,6e-06,1.4e-05,-2e-06,-6e-06,-1e-06,-6e-06,-1.2e-05,-1.8e-05,-9e-06,-1.1e-05,1.5e-05,8e-06,1e-06,-1.8e-05,-4e-06,3e-06,2e-06,2e-06,0,8e-06,-5e-06,-4e-06,-1e-06,-3e-06,1.3e-05,-3e-06,9e-06,4e-06,3e-06,-1e-06,2e-06,-2e-06,6e-06,-9e-06,9e-06,-1.8e-05,1.6e-05,-1.1e-05,0,-3e-06,-3e-06,5e-06,-1.5e-05,-3e-06,5e-06,2e-06,-9e-06,1e-05,7e-06,5e-06,1e-06,-1e-06,-1e-06,-7e-06,0,0,1e-05,8e-06,3e-06,4e-06,-9e-06,2e-06,0,2e-06,-1.1e-05,-3e-06,7e-06,-2e-06,-7e-06,-7e-06,9e-06,-1e-06,-5e-06,-3e-06,-1e-06,2e-06,0,0,-3e-06,5e-06,9e-06,2e-06,-5e-06,-4e-06,-2e-06,-1.3e-05,-4e-06,-5e-06,-5e-06,-1e-06,6e-06,1e-06,5e-06,1e-06,-1e-06,-1e-06,6e-06,0,-1e-06,3e-06,-5e-06,-1e-06,-7e-06,6e-06,1e-05,-8e-06,5e-06,0,1e-06,0
-1e-06,-6e-06,-1.2e-05,-2e-06,1e-06,2e-06,8e-06,5e-06,-4e-06,6e-06,-1.7e-05,-2.1e-05,3e-06,1.4e-05,-3e-06,2e-06,3e-06,1.4e-05,2e-05,6e-06,1.6e-05,-1.5e-05,-1.4e-05,-6e-06,7e-06,-1e-06,-1.4e-05,7e-06,-1.4e-05,-4e-06,-1e-06,2e-06,9e-06,3e-06,0,-2e-06,-2e-06,-5e-06,2e-06,1e-06,-5e-06,-2e-06,4e-06,-1e-06,1.3e-05,-3e-06,1.3e-05,-1.3e-05,7e-06,-6e-06,-6e-06,5e-06,5e-06,7e-06,-1e-05,2e-06,1e-06,6e-06,-7e-06,1e-06,5e-06,3e-06,0,-1e-06,1e-06,-1e-06,1.1e-05,-1.3e-05,-1.3e-05,6e-06,-1e-05,3e-06,-8e-06,7e-06,-4e-06,2e-05,4e-06,-7e-06,-3e-06,1.3e-05,1.1e-05,-5e-06,-1e-06,-4e-06,-1.1e-05,-1.1e-05,0,-1e-06,0,1e-06,-7e-06,-9e-06,-8e-06,8e-06,-5e-06,1e-06,7e-06,-8e-06,4e-06,0,3e-06,-3e-06,-4e-06,-2e-06,0,3e-06,7e-06,0,2e-06,3e-06,-1e-06,5e-06,-1e-06,3e-06,-4e-06,-9e-06,6e-06,3e-06,-1.3e-05,-7e-06,-4e-06
-1e-06,2e-06,4e-06,5e-06,-2e-06,1e-06,-1.1e-05,-2e-06,7e-06,0,1.1e-05,1.9e-05,-9e-06,-1e-05,-1e-06,-1e-06,-7e-06,-2e-06,-1.4e-05,3e-06,-2.4e-05,8e-06,1.6e-05,6e-06,-6e-06,3e-06,1.5e-05,-1.1e-05,6e-06,2e-06,1e-06,-1.4e-05,-7e-06,0,-4e-06,-2e-06,0,8e-06,0,-2e-06,2e-06,3e-06,0,0,1e-06,-3e-06,0,9e-06,-6e-06,6e-06,8e-06,-4e-06,-1e-06,-2e-06,-1e-06,-5e-06,-2e-06,-2e-06,7e-06,-8e-06,-5e-06,0,9e-06,-1e-06,-3e-06,0,3e-06,9e-06,0,-1e-05,4e-06,1e-06,-3e-06,-7e-06,3e-06,-7e-06,-3e-06,-3e-06,-2e-06,-1.3e-05,1e-06,4e-06,1e-06,3e-06,0,5e-06,1e-06,-4e-06,-2e-06,0,2e-06,6e-06,-2e-06,-4e-06,4e-06,0,-1e-06,-4e-06,-7e-06,-2e-06,-4e-06,1e-06,2e-06,2e-06,4e-06,1e-06,-9e-06,0,-6e-06,1e-06,1e-06,5e-06,4e-06,3e-06,1e-06,-4e-06,-8e-06,-6e-06,2e-06,3e-06,2e-06
2e-06,9e-06,3e-06,4e-06,2e-06,-2e-06,8e-06,1e-06,-5e-06,-6e-06,1e-06,-5e-06,2e-06,5e-06,9e-06,1e-06,8e-06,2e-06,1e-05,-3e-06,1.8e-05,-5e-06,-6e-06,0,1.9e-05,0,-1.2e-05,1.1e-05,2e-06,-3e-06,-4e-06,1.9e-05,2e-06,0,6e-06,-5e-06,1e-06,-4e-06,2e-06,0,2e-06,-5e-06,-8e-06,0,-6e-06,8e-06,-5e-06,-1.2e-05,6e-06,-1e-06,-7e-06,5e-06,1e-06,3e-06,5e-06,1e-06,0,-3e-06,-1e-05,4e-06,1e-06,-2e-06,-3e-06,-1e-06,-5e-06,1e-06,-2e-06,-6e-06,1e-06,-1e-06,-9e-06,-6e-06,9e-06,6e-06,2e-06,-3e-06,0,1e-06,1e-06,9e-06,-7e-06,-3e-06,2e-06,3e-06,-2e-06,-6e-06,-4e-06,1e-06,4e-06,0,4e-06,-7e-06,4e-06,9e-06,-2e-06,0,-5e-06,4e-06,6e-06,2e-06,1e-06,4e-06,-3e-06,-2e-06,-8e-06,-1e-06,3e-06,-4e-06,2e-06,-2e-06,0,-8e-06,-3e-06,-1e-06,7e-06,5e-06,-1e-06,-2e-06,-1e-05,3e-06,1e-06
3e-06,-8e-06,-8e-06,2e-06,0,2e-06,0,-1e-06,2e-06,5e-06,-9e-06,-1.1e-05,5e-06,0,5e-06,-3e-06,3e-06,-6e-06,-9e-06,-2e-06,-2e-05,4e-06,-1e-06,-6e-06,-1.7e-05,-2e-06,1.2e-05,-1.1e-05,-9e-06,7e-06,7e-06,-9e-06,3e-06,0,-4e-06,4e-06,1e-06,4e-06,0,3e-06,1e-06,1e-06,1e-06,-2e-06,-1e-06,-2e-06,1e-06,8e-06,-7e-06,3e-06,-1e-06,-4e-06,-1e-06,-4e-06,-1e-05,3e-06,1e-06,3e-06,1e-05,-1e-06,0,1e-06,-6e-06,-1e-06,3e-06,0,-7e-06,3e-06,4e-06,1e-06,1e-06,9e-06,-5e-06,1e-06,-6e-06,-3e-06,2e-06,-2e-06,-1e-06,-3e-06,4e-06,4e-06,-3e-06,0,1e-06,1e-05,-1e-06,-4e-06,-5e-06,0,-5e-06,5e-06,3e-06,-8e-06,1e-06,1e-06,4e-06,0,-8e-06,-4e-06,2e-06,0,4e-06,-1e-06,8e-06,0,-3e-06,-4e-06,-2e-06,-1e-06,-1e-06,-3e-06,3e-06,3e-06,1e-06,-7e-06,2e-06,4e-06,-4e-06,-4e-06,2e-06
2e-06,-1e-06,6e-06,-2e-06,1e-06,-1e-06,-2e-06,0,2e-06,-3e-06,1.1e-05,2.1e-05,-1e-06,-2e-06,-1e-06,1e-06,-3e-06,6e-06,7e-06,-1e-06,1.7e-05,0,-2e-06,2e-06,6e-06,-1e-06,-9e-06,6e-06,6e-06,-5e-06,-5e-06,-2e-06,-3e-06,-1e-06,-4e-06,-2e-06,1e-06,0,5e-06,2e-06,-3e-06,-3e-06,6e-06,3e-06,-8e-06,-2e-06,-3e-06,-8e-06,-1e-06,0,5e-06,2e-06,-4e-06,1e-06,1.1e-05,2e-06,-1e-06,2e-06,-1e-05,-1e-06,2e-06,2e-06,-2e-06,-1e-06,-2e-06,-1e-06,-7e-06,1e-06,-5e-06,5e-06,3e-06,-6e-06,6e-06,-2e-06,2e-06,1e-06,-2e-06,5e-06,1e-06,-2e-06,-4e-06,-3e-06,5e-06,1e-06,-2e-06,-7e-06,1e-06,-1e-06,3e-06,0,0,-2e-06,-9e-06,4e-06,5e-06,-1e-06,-3e-06,2e-06,8e-06,0,-2e-06,4e-06,-3e-06,0,-6e-06,0,4e-06,-2e-06,1e-06,0,0,2e-06,-1e-06,-3e-06,-4e-06,0,-4e-06,2e-06,0,-2e-06,-4e-06
-2e-06,2e-06,-5e-06,0,-2e-06,0,3e-06,-2e-06,-4e-06,1e-06,-1.1e-05,-1.4e-05,-6e-06,4e-06,-3e-06,2e-06,-2e-06,-2e-06,-6e-06,3e-06,-1.4e-05,-6e-06,9e-06,3e-06,-1.2e-05,2e-06,-1e-06,1e-06,7e-06,5e-06,2e-06,1e-05,5e-06,2e-06,9e-06,-4e-06,1e-06,1e-06,-6e-06,-3e-06,-1e-06,-1e-06,-2e-06,-4e-06,1.1e-05,5e-06,9e-06,6e-06,-2e-06,-7e-06,3e-06,2e-06,-4e-06,0,-6e-06,1e-06,-1e-06,-9e-06,9e-06,0,-2e-06,-3e-06,1e-06,2e-06,2e-06,1e-06,-1e-06,0,1e-06,-6e-06,-1.1e-05,-1e-06,-3e-06,4e-06,-2e-06,7e-06,1e-06,0,0,1e-06,-1e-06,1e-06,-2e-06,0,1e-06,7e-06,3e-06,0,-2e-06,-1e-06,4e-06,0,4e-06,-7e-06,-3e-06,1e-06,2e-06,4e-06,-6e-06,1e-06,0,2e-06,1e-06,1e-06,3e-06,-2e-06,0,0,2e-06,2e-06,0,-1e-06,-1e-06,-4e-06,4e-06,0,4e-06,-3e-06,-2e-06,3e-06,4e-06
-3e-06,2e-06,2e-06,-3e-06,-1e-06,0,-5e-06,3e-06,5e-06,-1e-06,7e-06,-3e-06,5e-06,-4e-06,-6e-06,-2e-06,-3e-06,-1e-06,6e-06,-3e-06,1.6e-05,4e-06,-1.7e-05,-5e-06,1.4e-05,1e-06,1.3e-05,-4e-06,-1.2e-05,-6e-06,0,-1.1e-05,-4e-06,-2e-06,-7e-06,4e-06,1e-06,0,7e-06,1e-06,2e-06,1e-06,-3e-06,1e-06,-4e-06,-5e-06,-6e-06,-8e-06,0,1e-06,-4e-06,-4e-06,2e-06,2e-06,2e-06,1e-06,1e-06,1.2e-05,-1e-05,0,-2e-06,2e-06,0,3e-06,2e-06,0,2e-06,0,9e-06,0,1e-05,3e-06,3e-06,-1e-06,0,-3e-06,-2e-06,-5e-06,0,1e-06,5e-06,0,-2e-06,-2e-06,3e-06,-8e-06,-1e-06,-2e-06,1e-06,0,-3e-06,0,4e-06,6e-06,-1e-06,-1e-06,0,2e-06,3e-06,1e-06,1e-06,0,-1e-06,1e-06,-2e-06,-1e-06,0,1e-06,-1e-06,-1e-06,0,0,2e-06,6e-06,5e-06,-4e-06,0,-2e-06,-1e-06,1e-06,-6e-06
-1e-06,-3e-06,1e-06,0,2e-06,0,4e-06,3e-06,-5e-06,2e-06,-5e-06,1.6e-05,0,2e-06,-2e-06,1e-06,3e-06,-2e-06,-5e-06,-3e-06,-1e-05,-1e-06,1.8e-05,0,-4e-06,-1e-06,-1.7e-05,5e-06,6e-06,5e-06,0,4e-06,2e-06,2e-06,1e-06,-2e-06,-1e-06,-1e-06,-4e-06,1e-06,0,1e-06,3e-06,2e-06,1e-05,-1e-06,-2e-06,7e-06,-2e-06,-1e-06,-4e-06,3e-06,5e-06,-4e-06,5e-06,-2e-06,0,-1.1e-05,1.1e-05,3e-06,2e-06,0,-2e-06,1e-06,1e-06,-1e-06,6e-06,0,-5e-06,-1e-06,-6e-06,-3e-06,-5e-06,0,2e-06,-3e-06,0,4e-06,0,-1e-06,-4e-06,0,1e-06,0,1e-06,3e-06,-1e-06,0,-1e-06,0,0,-1e-06,-3e-06,-4e-06,1e-06,1e-06,-1e-06,2e-06,-3e-06,0,-1e-06,2e-06,-1e-06,-1e-06,1e-06,0,0,2e-06,0,-1e-06,0,0,-2e-06,2e-06,-3e-06,0,-2e-06,1e-06,-1e-06,-3e-06,4e-06
1e-06,2e-06,-1e-06,-2e-06,0,1e-06,-1e-06,-3e-06,3e-06,-4e-06,3e-06,-1.4e-05,-4e-06,-1e-06,3e-06,0,-3e-06,1e-06,5e-06,3e-06,8e-06,1e-06,-1.3e-05,4e-06,3e-06,-1e-06,9e-06,-4e-06,-7e-06,-5e-06,-1e-06,0,0,-2e-06,1e-06,-1e-06,0,0,-2e-06,0,-1e-06,0,0,0,-1e-05,3e-06,4e-06,-4e-06,-2e-06,-1e-06,4e-06,-1e-06,4e-06,3e-06,0,-3e-06,0,6e-06,-1e-05,-2e-06,1e-06,0,3e-06,0,-2e-06,1e-06,5e-06,-1e-06,1e-06,4e-06,2e-06,3e-06,-1e-06,1e-06,-2e-06,-3e-06,0,-4e-06,-1e-06,-1e-06,1e-06,-1e-06,1e-06,0,0,-2e-06,0,1e-06,-1e-06,0,3e-06,1e-06,-3e-06,4e-06,-4e-06,0,2e-06,3e-06,1e-06,1e-06,1e-06,0,-1e-06,0,-1e-06,-4e-06,-2e-06,2e-06,-2e-06,-1e-06,0,1e-06,1e-06,-6e-06,-1e-06,-2e-06,3e-06,2e-06,5e-06,0,-1e-06
1e-06,0,0,-1e-06,-1e-06,-1e-06,-1e-06,1e-06,0,4e-06,0,2e-06,1e-06,0,2e-06,-1e-06,6e-06,-1e-06,-5e-06,0,-6e-06,0,1.1e-05,-3e-06,-9e-06,0,0,3e-06,2e-06,4e-06,2e-06,3e-06,-3e-06,2e-06,2e-06,3e-06,-1e-06,-2e-06,4e-06,-1e-06,-1e-06,1e-06,-2e-06,1e-06,4e-06,-4e-06,1e-06,4e-06,0,4e-06,0,1e-06,-2e-06,1e-06,-3e-06,1e-06,0,-1e-06,1e-05,0,1e-06,-2e-06,4e-06,0,1e-06,0,0,0,1e-06,-3e-06,6e-06,-2e-06,3e-06,-1e-06,2e-06,9e-06,-1e-06,-2e-06,-1e-06,3e-06,1e-06,0,-1e-06,1e-06,-1e-06,4e-06,1e-06,-1e-06,2e-06,0,-2e-06,-2e-06,6e-06,-2e-06,1e-06,0,-1e-06,0,-2e-06,0,0,1e-06,1e-06,-1e-06,1e-06,1e-06,1e-06,1e-06,1e-06,1e-06,0,0,0,2e-06,4e-06,-2e-06,-2e-06,-1e-06,-4e-06,2e-06,-1e-06
0,-2e-06,-2e-06,0,1e-06,0,0,-1e-06,-2e-06,-1e-06,-1e-06,1e-05,5e-06,-1e-06,1e-06,1e-06,-2e-06,0,4e-06,-2e-06,2e-06,-3e-06,-1e-05,1e-06,5e-06,0,-4e-06,-1e-06,4e-06,-3e-06,-2e-06,-3e-06,3e-06,-3e-06,-4e-06,1e-06,0,0,-6e-06,-1e-06,2e-06,0,-1e-06,-1e-06,-6e-06,1e-06,-1e-06,-3e-06,-1e-06,-2e-06,-1e-06,0,-3e-06,0,5e-06,0,0,-3e-06,-9e-06,2e-06,-1e-06,2e-06,1e-06,-1e-06,-2e-06,0,-4e-06,-1e-06,2e-06,0,-6e-06,0,-4e-06,0,2e-06,-2e-06,1e-06,4e-06,-1e-06,-4e-06,-4e-06,1e-06,-1e-06,1e-06,0,-1e-06,1e-06,0,-3e-06,-1e-06,-1e-06,2e-06,-2e-06,3e-06,1e-06,0,1e-06,-4e-06,1e-06,0,-1e-06,0,-1e-06,1e-06,0,-1e-06,1e-06,0,0,0,0,-2e-06,0,2e-06,0,0,0,-2e-06,3e-06,0,2e-06
-1e-06,2e-06,1e-06,0,0,-1e-06,1e-06,-1e-06,4e-06,-1e-06,4e-06,-1.4e-05,-6e-06,-1e-06,-2e-06,0,-2e-06,1e-06,-3e-06,-1e-06,-1e-06,3e-06,1.1e-05,2e-06,4e-06,1e-06,4e-06,-1e-06,-9e-06,3e-06,0,0,-3e-06,3e-06,2e-06,-3e-06,-1e-06,-2e-06,3e-06,0,0,0,0,0,5e-06,3e-06,-4e-06,4e-06,0,0,1e-06,-1e-06,-1e-06,-2e-06,-6e-06,1e-06,0,3e-06,9e-06,-1e-06,0,-1e-06,-2e-06,-1e-06,0,0,-6e-06,2e-06,-6e-06,-2e-06,7e-06,0,5e-06,-1e-06,-3e-06,-3e-06,-1e-06,-2e-06,-1e-06,3e-06,3e-06,-1e-06,0,-1e-06,-2e-06,0,0,1e-06,3e-06,0,2e-06,-3e-06,-3e-06,-2e-06,-2e-06,0,-2e-06,-2e-06,0,-1e-06,0,0,0,0,-1e-06,-3e-06,2e-06,-1e-06,1e-06,0,0,-4e-06,0,-2e-06,-3e-06,-3e-06,1e-06,1e-06,-2e-06,-2e-06,0
0,-1e-06,-2e-06,2e-06,-1e-06,1e-06,0,1e-06,-4e-06,1e-06,-6e-06,8e-06,1e-06,1e-06,-3e-06,-1e-06,-2e-06,0,1e-06,2e-06,-3e-06,0,-1.2e-05,0,-2e-06,0,-6e-06,2e-06,1e-05,-3e-06,0,2e-06,1e-06,-3e-06,1e-06,3e-06,0,0,-2e-06,0,-1e-06,0,2e-06,1e-06,0,-3e-06,6e-06,-1e-06,-3e-06,0,1e-06,2e-06,0,1e-06,1e-06,-1e-06,0,-1e-06,-1e-05,1e-06,1e-06,0,-1e-06,-1e-06,0,0,-1e-06,-3e-06,0,3e-06,-3e-06,-1e-06,-3e-06,-1e-06,1e-06,-2e-06,0,3e-06,-1e-06,-1e-06,0,1e-06,2e-06,-1e-06,-2e-06,-2e-06,0,0,-2e-06,0,-1e-06,4e-06,1e-06,-1e-06,3e-06,0,2e-06,-1e-06,-3e-06,0,0,0,-1e-06,0,2e-06,2e-06,-3e-06,-1e-06,0,-1e-06,0,2e-06,0,2e-06,1e-06,1e-06,-2e-06,2e-06,2e-06,1e-06,0
1e-06,-1e-06,3e-06,1e-06,0,0,1e-06,0,2e-06,-1e-06,5e-06,2e-06,3e-06,-1e-06,-1e-06,1e-06,1e-06,1e-06,1e-06,2e-06,5e-06,-1e-06,1.3e-05,-1e-06,0,-1e-06,8e-06,-1e-06,-1e-06,2e-06,0,-5e-06,0,4e-06,-3e-06,1e-06,-1e-06,-1e-06,-1e-06,-1e-06,0,0,-1e-06,-1e-06,-1e-06,2e-06,-2e-06,1e-06,2e-06,-2e-06,1e-06,-2e-06,0,0,1e-06,1e-06,0,-2e-06,1e-05,-1e-06,0,0,-1e-06,0,1e-06,0,2e-06,4e-06,1e-06,-2e-06,0,2e-06,4e-06,0,1e-06,3e-06,0,1e-06,-1e-06,0,-2e-06,-1e-06,0,1e-06,-1e-06,0,-1e-06,1e-06,1e-06,0,-1e-06,-4e-06,4e-06,1e-06,0,0,-1e-06,-3e-06,2e-06,0,0,-1e-06,0,0,-1e-06,-1e-06,0,-1e-06,0,1e-06,0,1e-06,-1e-06,0,3e-06,-3e-06,1e-06,0,-6e-06,2e-06,1e-06
1e-06,1e-06,-1e-06,1e-06,0,0,-1e-06,-1e-06,-2e-06,0,-2e-06,-1.1e-05,-1e-06,1e-06,2e-06,0,1e-06,0,-2e-06,-3e-06,-6e-06,-1e-06,-1.6e-05,2e-06,-7e-06,-1e-06,-6e-06,0,-4e-06,-2e-06,-1e-06,4e-06,-1e-06,-4e-06,4e-06,-2e-06,-1e-06,1e-06,-1e-06,-1e-06,1e-06,0,0,2e-06,3e-06,2e-06,-1e-06,-1e-06,-1e-06,2e-06,-3e-06,1e-06,1e-06,1e-06,-7e-06,0,0,3e-06,-1e-05,1e-06,-1e-06,1e-06,-2e-06,0,1e-06,0,5e-06,-5e-06,-2e-06,0,2e-06,-2e-06,-3e-06,-1e-06,-3e-06,2e-06,0,-5e-06,0,-1e-06,2e-06,1e-06,-2e-06,0,-1e-06,0,1e-06,0,-1e-06,0,1e-06,3e-06,-3e-06,-1e-06,-2e-06,0,0,-2e-06,-3e-06,1e-06,0,0,0,-1e-06,1e-06,-1e-06,-1e-06,-1e-06,0,0,0,-2e-06,1e-06,-3e-06,-2e-06,-1e-06,0,-2e-06,3e-06,-2e-06,-1e-06
0,2e-06,0,0,2e-06,0,1e-06,0,0,1e-06,-1e-06,1.2e-05,-2e-06,0,2e-06,0,-1e-06,1e-06,3e-06,0,9e-06,0,1.8e-05,-1e-06,7e-06,1e-06,1e-06,0,3e-06,1e-06,1e-06,0,1e-06,4e-06,-3e-06,1e-06,0,-1e-06,-2e-06,0,1e-06,1e-06,1e-06,0,-5e-06,-3e-06,-1e-06,0,2e-06,0,0,0,3e-06,-1e-06,5e-06,0,0,-1e-06,9e-06,0,0,-1e-06,-1e-06,0,-1e-06,0,4e-06,5e-06,-1e-06,-2e-06,-4e-06,1e-06,-2e-06,0,1e-06,-1e-06,0,2e-06,0,2e-06,-3e-06,-2e-06,0,0,-1e-06,2e-06,0,0,0,0,-1e-06,-4e-06,-2e-06,2e-06,2e-06,0,0,1e-06,3e-06,0,0,-1e-06,0,0,-1e-06,2e-06,3e-06,0,-1e-06,0,0,1e-06,-1e-06,2e-06,-2e-06,0,0,0,-4e-06,-2e-06,1e-06
0,-3e-06,2e-06,-1e-06,-1e-06,0,1e-06,0,1e-06,0,3e-06,-4e-06,2e-06,0,0,1e-06,3e-06,-2e-06,-4e-06,3e-06,-9e-06,2e-06,-1.6e-05,0,-3e-06,1e-06,4e-06,0,0,-1e-06,-1e-06,-1e-06,-1e-06,-3e-06,3e-06,-1e-06,0,1e-06,-1e-06,1e-06,-2e-06,0,0,-1e-06,5e-06,1e-06,2e-06,-1e-06,-1e-06,0,3e-06,-1e-06,2e-06,1e-06,-1e-06,1e-06,0,-3e-06,-9e-06,-1e-06,1e-06,1e-06,0,0,1e-06,0,1e-06,-4e-06,1e-06,2e-06,1e-06,0,3e-06,0,0,-4e-06,0,0,0,-2e-06,1e-06,2e-06,2e-06,0,1e-06,-1e-06,1e-06,1e-06,1e-06,0,0,4e-06,4e-06,-2e-06,-1e-06,0,0,0,-3e-06,0,0,-1e-06,0,0,1e-06,-1e-06,-1e-06,0,0,-1e-06,0,0,0,2e-06,3e-06,-2e-06,1e-06,1e-06,2e-06,3e-06,-1e-06
-1e-06,0,-3e-06,-1e-06,0,0,-2e-06,-1e-06,-2e-06,-2e-06,-2e-06,-8e-06,2e-06,1e-06,-3e-06,0,-2e-06,1e-06,5e-06,0,1e-05,-1e-06,1.2e-05,-1e-06,7e-06,0,-6e-06,1e-06,1e-06,1e-06,0,1e-06,0,4e-06,-5e-06,0,0,0,-3e-06,1e-06,1e-06,1e-06,-1e-06,1e-06,-6e-06,1e-06,3e-06,-1e-06,1e-06,0,-1e-06,1e-06,-2e-06,0,-1e-06,0,0,7e-06,1e-05,0,0,0,2e-06,1e-06,-1e-06,0,-2e-06,3e-06,5e-06,-2e-06,0,-2e-06,-3e-06,-1e-06,-1e-06,-1e-06,0,-2e-06,0,1e-06,2e-06,-1e-06,0,0,1e-06,2e-06,-1e-06,1e-06,-2e-06,0,0,-4e-06,1e-06,3e-06,-1e-06,0,1e-06,2e-06,4e-06,0,0,0,0,0,-2e-06,-1e-06,1e-06,1e-06,0,0,0,-1e-06,1e-06,-1e-06,0,-1e-06,-1e-06,0,-5e-06,1e-06,2e-06
