0.045977,0.145587,0.197275,0.151123,0.09258,0.08481,0.130601,0.265412,0.499783,0.629408,0.742937,0.811677,0.60816,0.49957,0.546589,0.676937,0.807723,0.639808,0.398743,0.288128,0.212988,0.166225,0.15198,0.148817,0.132839,0.098889,0.074745,0.067792
0.056455,0.177129,0.240577,0.186008,0.112414,0.099224,0.152746,0.311869,0.592825,0.734401,0.83007,0.890687,0.660977,0.538407,0.598766,0.767978,0.93179,0.750594,0.480646,0.343655,0.250339,0.195867,0.176565,0.169916,0.153431,0.11571,0.08656,0.077873
0.072877,0.225034,0.306885,0.240924,0.142834,0.117956,0.181044,0.378952,0.731949,0.893771,0.964861,1.010544,0.739057,0.597312,0.677657,0.904229,1.117913,0.925918,0.616404,0.425418,0.298623,0.235647,0.209175,0.196077,0.179587,0.137896,0.101316,0.089617
0.082187,0.249306,0.341182,0.273268,0.158921,0.119806,0.184042,0.419273,0.812235,0.997234,1.097362,1.13833,0.839039,0.70541,0.798917,1.039911,1.263945,1.059657,0.712265,0.455494,0.303167,0.245891,0.218603,0.200539,0.183964,0.142725,0.103111,0.08829
0.080217,0.239824,0.330442,0.269744,0.155765,0.110365,0.166672,0.454872,0.872502,1.077091,1.272827,1.374665,1.083471,0.968155,1.069858,1.259694,1.397808,1.132509,0.743472,0.435483,0.27983,0.234958,0.21057,0.192023,0.17087,0.131776,0.097642,0.081203
0.074149,0.222992,0.334902,0.286472,0.154012,0.102986,0.151044,0.54829,1.040326,1.238434,1.57926,1.836824,1.563121,1.465605,1.584473,1.673318,1.63903,1.217551,0.741919,0.41314,0.269359,0.22228,0.200058,0.188182,0.162388,0.121117,0.097028,0.083952
0.089477,0.279449,0.457889,0.396327,0.186046,0.110426,0.163276,0.750703,1.446402,1.758549,2.414687,2.874387,2.508219,2.375248,2.539863,2.55567,2.333701,1.658556,0.960311,0.54276,0.35591,0.266546,0.24189,0.245223,0.216715,0.155146,0.129039,0.113523
0.1224,0.393193,0.66843,0.578539,0.250645,0.133816,0.204489,1.023115,2.023686,2.738363,4.070363,4.882572,4.415309,4.190668,4.413882,4.328682,3.866187,2.841048,1.665166,0.950496,0.609164,0.43633,0.398809,0.421785,0.380849,0.262588,0.212983,0.187921
0.16914,0.547315,0.906207,0.757261,0.312381,0.163252,0.266895,1.261623,2.592577,4.164176,6.635298,7.976342,7.620489,7.392517,7.666343,7.352112,6.407238,4.807985,2.860773,1.628235,1.012205,0.699747,0.647363,0.707367,0.644216,0.424263,0.330302,0.306559
0.210688,0.684995,1.07711,0.85245,0.341733,0.185654,0.32337,1.350657,2.982113,5.859579,9.795921,11.761245,11.952924,11.994235,12.21238,11.464592,9.762588,7.361289,4.412125,2.479945,1.489865,1.003705,0.945766,1.057756,0.965174,0.604586,0.446132,0.448691
0.225944,0.737576,1.115634,0.843324,0.331401,0.190771,0.35359,1.258743,3.079187,7.302982,12.568306,15.103401,16.25962,16.7655,16.653356,15.324874,12.847526,9.714317,5.841793,3.211697,1.872831,1.240811,1.18667,1.352295,1.233774,0.738076,0.515668,0.565703
0.212752,0.695924,1.071085,0.809716,0.307768,0.18153,0.353273,1.14918,3.015443,7.766437,13.609848,16.462678,18.262861,19.025573,18.40447,16.792093,14.006339,10.499332,6.310911,3.405718,1.95815,1.293933,1.235041,1.41534,1.291822,0.75676,0.508168,0.591925
0.196882,0.632156,0.963599,0.720808,0.267793,0.157432,0.316067,1.132202,2.935334,6.869215,12.004945,14.567513,15.935313,16.658935,15.735923,14.229927,12.008755,8.867167,5.277838,2.809893,1.634013,1.12429,1.039043,1.150572,1.049883,0.628822,0.423705,0.49774
0.172542,0.529324,0.763384,0.559255,0.217362,0.131928,0.270188,1.060905,2.624384,5.07213,8.626171,10.245336,10.265648,10.601685,9.861342,8.822172,7.626265,5.501962,3.191924,1.697234,1.049677,0.777992,0.669648,0.699705,0.642391,0.407559,0.28571,0.323935
0.185134,0.536464,0.658314,0.433808,0.187193,0.117629,0.234149,0.896524,2.14905,3.460346,5.596405,6.320563,5.142854,4.968765,4.693025,4.213546,3.679417,2.48469,1.384966,0.75106,0.514805,0.403566,0.324152,0.337363,0.317073,0.215237,0.159018,0.16475
0.258585,0.757198,0.812661,0.4503,0.195578,0.112241,0.204038,0.685001,1.6817,2.489892,3.76731,4.185691,2.875822,2.55885,2.506002,2.112743,1.784208,1.181728,0.682424,0.366438,0.260545,0.188998,0.143374,0.156409,0.142478,0.104916,0.085951,0.08215
0.376819,1.140369,1.20991,0.645435,0.261497,0.115672,0.181761,0.51241,1.469432,2.455979,3.255158,3.472257,2.435981,1.968051,1.922001,1.4918,1.245298,0.897111,0.538252,0.299774,0.215582,0.155513,0.126345,0.154805,0.122169,0.068914,0.056204,0.052971
0.532859,1.678051,1.894071,1.078459,0.400451,0.130747,0.17618,0.445258,1.598015,3.008199,3.480006,3.358181,2.470672,1.877998,1.855455,1.635901,1.521767,1.131387,0.683981,0.398948,0.292722,0.219159,0.18026,0.245389,0.191613,0.080019,0.051391,0.05343
0.704916,2.308276,2.807964,1.732776,0.611913,0.153938,0.188598,0.4299,1.866757,3.704282,4.03929,3.640244,2.772048,2.155025,2.126294,2.045093,2.117357,1.68642,1.005226,0.581712,0.447387,0.336915,0.2631,0.365175,0.296577,0.124095,0.067324,0.06726
0.845666,2.859042,3.733731,2.471991,0.8474,0.176616,0.203553,0.432717,2.055396,3.988662,4.282855,3.936242,3.101861,2.669129,2.722944,2.508075,2.683031,2.278903,1.327891,0.754683,0.618093,0.476352,0.348783,0.476895,0.402953,0.179047,0.091287,0.084744
0.896778,3.084032,4.295086,3.01775,1.010571,0.180915,0.206409,0.44452,2.037853,3.664934,3.901793,3.820834,3.146625,3.04397,3.323434,2.914911,3.008626,2.618934,1.49107,0.837068,0.732919,0.586045,0.416421,0.560132,0.477115,0.218758,0.1142,0.105511
0.823183,2.827233,4.171361,3.08293,1.016472,0.167099,0.188996,0.483019,2.000586,3.244866,3.540405,3.873185,3.24997,3.126675,3.505004,2.89974,2.78367,2.528263,1.488356,0.815969,0.719003,0.604553,0.462653,0.605219,0.485501,0.222801,0.126985,0.1208
0.656529,2.189931,3.386281,2.605151,0.855163,0.148959,0.161408,0.492187,2.019441,3.130464,3.565301,4.182396,3.444598,3.039695,3.173211,2.323221,2.137031,2.161718,1.368484,0.705741,0.583192,0.531801,0.47024,0.580667,0.418727,0.186498,0.119157,0.116142
0.469463,1.463468,2.321532,1.832958,0.613571,0.138036,0.146969,0.467176,1.866815,3.010423,3.571316,4.111563,3.304889,2.770917,2.588949,1.709639,1.623586,1.72088,1.14379,0.57842,0.441093,0.430498,0.434206,0.516385,0.341192,0.141302,0.099355,0.096742
0.305647,0.88425,1.408417,1.125208,0.409616,0.142273,0.144484,0.435722,1.504139,2.659056,3.363164,3.65795,2.930896,2.416485,2.149476,1.563842,1.542159,1.423154,0.900974,0.482587,0.402368,0.389175,0.38301,0.438805,0.274014,0.110631,0.085466,0.083683
0.185552,0.49856,0.809281,0.672412,0.280017,0.132093,0.130465,0.412318,1.234394,2.420625,3.32852,3.357492,2.545423,2.08103,1.809078,1.478501,1.538629,1.29727,0.792645,0.441746,0.416487,0.400848,0.356368,0.371573,0.229665,0.106187,0.081625,0.082005
0.116093,0.273473,0.450724,0.394514,0.180994,0.100292,0.103322,0.384678,1.239297,2.55472,3.415452,3.047977,2.068887,1.746956,1.560643,1.386628,1.471292,1.156354,0.712593,0.415038,0.385046,0.376083,0.361796,0.363678,0.209336,0.098471,0.079576,0.08014
0.098128,0.237434,0.382335,0.322505,0.131083,0.064285,0.073869,0.328527,1.237537,2.494714,3.096479,2.588264,1.627008,1.44381,1.495482,1.388563,1.399098,1.079821,0.674103,0.384404,0.296662,0.297249,0.352591,0.377628,0.204592,0.078975,0.069905,0.069499
0.099735,0.256704,0.390695,0.316814,0.119771,0.04667,0.054216,0.25133,1.125092,2.135942,2.45107,2.08246,1.328224,1.237404,1.503216,1.353286,1.190185,0.899971,0.551062,0.309561,0.205858,0.21498,0.320842,0.38608,0.212369,0.06572,0.059099,0.057867
0.106421,0.2672,0.371047,0.290183,0.114176,0.041176,0.052556,0.254733,1.089459,1.929983,2.0142,1.768599,1.342949,1.327508,1.512912,1.116398,0.814588,0.629535,0.367348,0.2154,0.168783,0.183747,0.287302,0.371167,0.213933,0.065715,0.059923,0.059137
0.113185,0.275579,0.339393,0.24232,0.098622,0.033061,0.055567,0.337921,1.1967,1.891085,1.722024,1.47747,1.371414,1.499483,1.45356,0.790589,0.51519,0.487816,0.272558,0.133033,0.131669,0.15967,0.277458,0.365378,0.204081,0.07056,0.075925,0.078404
0.118067,0.297099,0.358349,0.236982,0.090267,0.028998,0.055375,0.409522,1.256716,1.873216,1.811174,1.653316,1.444724,1.437802,1.250265,0.616077,0.429979,0.440756,0.288445,0.11396,0.101182,0.157189,0.29799,0.368372,0.195791,0.073596,0.088103,0.094236
0.115369,0.312539,0.395589,0.250396,0.082087,0.028335,0.049165,0.418978,1.308547,2.023471,2.163446,1.979132,1.411735,1.129578,0.985176,0.572979,0.415097,0.410617,0.314525,0.138596,0.109751,0.17508,0.307982,0.353751,0.18966,0.075991,0.085454,0.090616
0.109357,0.308018,0.396731,0.253414,0.079105,0.033427,0.041865,0.357874,1.168599,1.988157,2.368207,2.114104,1.28916,0.786546,0.713313,0.60702,0.45335,0.385577,0.299051,0.155358,0.122207,0.17414,0.279351,0.318595,0.180772,0.070916,0.065593,0.066445
0.100964,0.285617,0.370537,0.249826,0.086453,0.043812,0.0432,0.277245,0.85177,1.766979,2.490359,2.051419,1.06378,0.570758,0.575799,0.702782,0.593439,0.391162,0.244295,0.147256,0.119,0.145439,0.237882,0.30386,0.184429,0.06497,0.045361,0.040421
0.095922,0.268129,0.358694,0.244126,0.08854,0.051357,0.047842,0.218777,0.656665,1.682082,2.530916,1.928451,0.970535,0.543399,0.548426,0.776056,0.760615,0.421445,0.219534,0.145246,0.118797,0.124745,0.204469,0.302611,0.195159,0.066047,0.037374,0.027137
0.094601,0.252111,0.341585,0.252858,0.094796,0.049743,0.04435,0.213178,0.73624,1.79267,2.346726,1.621897,0.882174,0.531999,0.485949,0.767271,0.854894,0.42964,0.20836,0.163292,0.123204,0.125192,0.189902,0.292541,0.196426,0.063517,0.029903,0.023752
0.088941,0.250121,0.353912,0.276167,0.109206,0.043061,0.034241,0.222923,0.770223,1.673214,1.960544,1.45031,0.917349,0.608134,0.543648,0.748623,0.808933,0.407382,0.195003,0.187063,0.131163,0.129095,0.209286,0.286346,0.176562,0.052801,0.020888,0.02269
0.080042,0.245153,0.351408,0.281033,0.120642,0.037467,0.024927,0.223929,0.670534,1.33245,1.623247,1.452586,0.942024,0.664714,0.654728,0.666422,0.635508,0.350918,0.174648,0.190747,0.12827,0.11795,0.212126,0.280206,0.157555,0.039314,0.018318,0.029289
0.077115,0.23064,0.305901,0.253855,0.114468,0.034537,0.021778,0.215524,0.502434,1.026936,1.634669,1.558346,0.867048,0.633334,0.720986,0.548795,0.435016,0.262402,0.131381,0.16485,0.129572,0.11092,0.18514,0.28123,0.164,0.026164,0.018237,0.038722
