-0.000187,-0.000498,-0.000633,-1.3e-05,0.000247,-0.00017,-0.000399,0.000617,-0.000102,-0.000102,-0.000833,-0.001076,8.8e-05,-0.000905,-0.000236,-0.000179,-0.000881,-0.000654,0.001757,0.001038,-5.8e-05,-0.000107,-0.000267,-3.1e-05,-0.000254,-0.000161,-0.000412,2.7e-05,-0.000381,-0.000299,0.000321,0.000422,-0.00021,-0.000539,0.000242,-0.000696,-0.000818,0.000162,-9e-06,-0.000313,-0.000227,-0.000326,-0.000422,-0.001503,-0.001174,-0.000275,-0.000495,-0.000986,-0.000343,-0.000328,-0.000154,-0.001043,-0.00081,-5.7e-05,-0.000712,-0.000987,0.000186,-0.00045,2e-05,0.000788,0.000483,-0.000802,-0.000927,0.000419,0.000317,9.8e-05,0.000478,0.000117,-0.000191,-0.000358,-0.000331,0.000218,-0.001091,-0.000872,-0.001259,-0.000928,-0.000865,-0.001064,-0.000819,-0.00132,-0.000245,-0.000606,-0.000528,-8e-05,-0.000283,-0.000628,-0.00045,-0.000278,-8e-06,-0.000395,0.000306,-0.001111,0.000133,-0.000306,-0.001778,-0.000688,0.000115,-0.000757,0.000691,-0.000222,0.000506,-0.000188,-0.000483,-0.00046,-0.000642,-0.000236,-0.000421,-0.000276,-0.000222,-0.000299,-0.001347,-0.000408,0.000189,0.000114,-0.000531,-0.000289,-0.000269,-0.000778,-0.000475,-0.000625,-0.00022
-0.000583,-0.000327,0.000211,-0.001072,-0.00053,0.000508,0.000251,0.00036,-8.4e-05,7.6e-05,0.000198,-0.000481,-0.000457,0.000479,-2.8e-05,0.000163,0.000201,3.6e-05,0.000269,0.000667,0.000668,-0.000225,-0.000662,-0.000169,0.000506,0.001119,0.000103,-0.001224,-0.000782,0.00027,0.000702,0.000585,0.000561,0.000358,-1e-06,-0.000234,0.000216,-0.000871,-0.000376,-0.000333,8.6e-05,0.000995,0.000296,0.001032,0.000476,-0.000235,0.000178,0.000709,-0.000566,-0.000455,0.000231,0.000498,-2e-04,-0.00031,0.001022,0.000752,-0.001526,-0.000168,-0.000173,-5e-05,-8.9e-05,0.000162,0.000515,-0.00038,-0.000269,0.00062,0.000602,-0.001107,-0.000719,-0.000257,0.000348,0.000585,0.000885,0.00054,0.000317,0.000263,-0.000456,0.000269,-0.000199,-0.000567,-0.000905,-0.000207,0.000192,0.000374,-0.00031,0.000684,-4.4e-05,6e-04,0.000171,0.000164,-0.000777,-0.000288,-3.1e-05,-0.000658,0.000229,0.000316,-0.000157,0.000734,-0.000219,0.000588,-0.000293,-0.000876,0.000363,0.00022,-0.001063,-6.7e-05,0.00023,0.000291,0.000349,-4.8e-05,0.00069,-0.00092,-0.001091,-0.001265,-2.6e-05,-0.00065,-2e-05,-0.000103,0.00027,0.001132,-0.000889
-0.001029,-0.000557,-0.000132,-0.000818,-0.000159,-0.000122,0.000451,-0.001781,-0.000619,-0.000358,2e-05,0.000371,-0.000429,-0.000341,-0.000167,-2e-06,-0.000474,-0.00047,-0.001102,-0.000536,-0.000209,-0.00043,-0.001153,-0.000308,-0.000322,-0.00055,-0.000703,-0.000258,0.000216,0.000128,-0.000876,-0.001059,-0.000715,0.000614,-0.000225,-0.000244,-0.000733,-0.001181,-0.000706,-0.000367,-4.4e-05,-0.000738,0.000368,-0.000822,-0.000531,0.000197,-0.000538,-0.000484,-0.000323,0.000184,0.000291,-0.000897,7.5e-05,-6e-04,-0.000275,-0.000159,-0.000646,-0.000514,0.000261,-9.4e-05,-0.000358,1.9e-05,-0.000352,-0.00045,-0.000291,-0.00048,-0.000158,-0.000236,-0.000771,-2.9e-05,-0.000186,-0.000169,-0.000167,0.000143,0.000145,0.000231,-6.2e-05,-0.000118,8.4e-05,0.000429,-0.000546,-0.000921,-0.000748,-0.000139,8.2e-05,-0.000737,0.000127,0.00024,6.2e-05,0.000407,-0.000519,-0.000191,-0.001224,-0.000504,-2.2e-05,-0.000384,9.5e-05,-1.2e-05,-0.000577,-0.000477,-0.000716,0.000633,-0.000413,0.000402,0.000609,-0.000383,0.000318,3.3e-05,-0.000339,7e-06,-0.000607,-0.000496,0.000375,0.000378,-0.000449,-0.00059,-0.000507,0.000259,-1.3e-05,-0.000735,0.000127
0.000784,0.000522,0.000153,0.000636,0.000521,8.1e-05,-0.000156,-0.000306,0.000653,-0.00053,-7.7e-05,0.000219,0.000376,0.000736,0.000214,-0.00047,0.000125,-0.000119,8.1e-05,-2.6e-05,-0.000831,-0.000765,0.000412,-0.000413,-0.000189,0.000503,-0.000351,-0.000105,-0.000497,-0.000214,-0.00028,-0.000647,0.000394,0.000102,-0.000666,-7.7e-05,2e-04,0.000438,0.000544,0.000325,-0.000541,-0.000383,-0.000798,-0.000227,-0.000198,-0.000171,5.5e-05,-0.000631,7.3e-05,0.000281,-0.00038,-8.4e-05,-0.000338,-0.000116,0.000245,-0.000132,0.000801,0.000441,-0.000357,-0.000112,-6.9e-05,7.3e-05,0.000135,-0.000358,-7.6e-05,0.000247,-0.000555,-0.000112,7.6e-05,0.000314,-0.000391,0.000197,-0.000113,-0.00053,-0.000826,-0.000689,-0.000251,0.000697,-0.000437,-0.000231,0.000152,-0.000774,-0.000297,-9.4e-05,6.3e-05,0.000652,-5e-06,-0.000549,-0.000179,-0.000259,0.000182,-3.4e-05,0.000666,0.000751,0.000217,7.9e-05,-0.000198,-0.000338,-0.000286,-0.000121,-0.000705,-8.9e-05,1.3e-05,-0.000379,0.000289,-0.000267,0.00029,-2.2e-05,-7e-06,-0.000209,-4.1e-05,-0.00026,0.000616,-1.7e-05,0.000163,0.000368,0.000832,-0.000236,-0.000171,-0.000406,0.000356
-0.000625,-0.000176,0.000153,-9.6e-05,-0.000477,-0.000103,-0.000325,-0.000692,-0.000755,-0.000388,-0.000198,0.000231,-0.000207,0.00021,0.000769,0.00044,-0.000207,-0.000222,-0.000164,-0.000302,-0.000718,0.000776,0.000754,0.000441,-4.3e-05,-0.000127,6.3e-05,0.000178,-0.000211,7.8e-05,-0.000149,-0.000909,-0.000182,-0.000175,2.1e-05,-5.9e-05,-0.000171,9.6e-05,-2.8e-05,5.8e-05,0.000517,1e-06,0.000156,-0.000304,0.000215,0.000188,0.000413,0.000771,-0.000132,-0.000535,-0.000522,0.000472,0.000236,9.4e-05,-0.000309,9.4e-05,-0.000444,-0.000189,-0.000251,0.000674,-0.000514,3.3e-05,0.00023,-0.000124,-0.000533,0.000733,9.1e-05,-0.000404,0.000602,0.000269,0.000139,-2e-06,-8.1e-05,0.000345,0.000475,0.000495,-3.7e-05,-0.000439,0.000691,0.000703,0.000511,0.000923,0.00059,1.6e-05,-0.000204,9e-05,-0.000117,-0.000252,-0.00047,-0.000635,-6.7e-05,0.000658,-0.000654,-0.000298,-5e-05,-0.000134,6.4e-05,-3e-06,-0.000195,-2.3e-05,-5.5e-05,-0.000512,0.000113,0.000474,-0.000338,-0.000369,-0.000137,-0.000131,-0.000327,-0.00026,1e-06,0.00035,-0.000741,-0.000524,-4.2e-05,0.000106,-0.00014,-9.1e-05,0.000153,0.000112,-0.000281
0.000289,-0.000263,-0.000478,1e-06,-0.000302,-0.000333,3.5e-05,-0.000332,-0.000735,-0.000393,-0.000143,-0.000479,-0.000544,-2.6e-05,-0.000151,-0.000693,-0.000238,-3.3e-05,-0.000491,-0.000894,-0.000608,-0.000515,-0.000228,-0.000515,-0.000701,-0.000165,7.1e-05,0.000134,7.9e-05,-3.3e-05,-0.000116,-0.000581,-0.000313,-0.000269,-0.000621,-0.000877,0.000403,0.000137,-0.000383,-0.000219,-0.000416,-0.00045,-0.00038,-0.000273,-0.000496,-0.000449,-0.00019,-0.000474,-0.000732,-5.5e-05,-0.000467,-0.000372,-0.000852,-0.000705,-0.00033,0.00012,0.000438,-0.000562,-0.000631,-0.000667,-0.000131,-0.001496,-0.001056,-0.000298,-0.000624,-0.000199,-2.4e-05,5.3e-05,-0.000613,-0.000218,-5.5e-05,-0.000227,-0.000323,-0.000538,-0.00047,-0.000598,3.9e-05,-0.00011,9.2e-05,-0.000452,-0.000279,0.000417,0.000319,0.000142,-8.6e-05,-0.000681,-0.000673,-0.000377,-0.00038,-8e-06,-0.000157,-0.000448,-2e-06,-0.000253,-0.000185,-1.2e-05,-0.000398,-0.00013,1e-05,6.1e-05,-0.000125,-0.000427,-0.000607,-0.000752,-0.000523,-0.000248,-0.000152,-0.000436,-0.000206,-0.000165,-3.1e-05,4.4e-05,0.000716,0.000214,-0.000301,-0.000173,-0.000385,-7.3e-05,-0.000419,-0.000244,0.000266
-0.000368,-0.000468,-0.000249,3.2e-05,0.000235,3e-05,-0.000398,-1e-04,-0.000343,-0.000445,1.8e-05,7e-06,0.000138,-0.000312,-0.000779,-0.000447,-0.000449,-0.000313,2e-05,-0.001078,-0.000243,-0.000589,-0.000214,-0.000407,-0.00025,-0.000434,-0.000394,2e-06,0.00039,-7.2e-05,-0.000614,2.3e-05,-0.000544,-0.000874,3e-05,9e-06,-0.000569,-0.000112,-0.000604,-0.000306,-0.000292,-0.000452,-0.000413,-6e-06,-5e-06,-0.000101,-0.000553,-0.000125,0.000182,-0.000216,0.000261,-7.2e-05,0.000512,2.3e-05,-0.000323,-0.000347,-6e-05,0.000619,0.000508,-1.7e-05,-0.000351,6.6e-05,7.9e-05,-0.000118,-0.000208,-0.000241,-0.000434,0.000124,0.000268,3.2e-05,-0.000254,-0.000209,-0.000369,-0.000173,-0.000103,4.7e-05,-6.6e-05,-5e-05,-0.000156,-0.00041,-0.000325,-0.000291,-0.000434,-0.000273,-0.000103,-0.000303,8e-06,-0.000315,-3.4e-05,-0.000219,-0.000237,-0.000258,-0.000278,-0.000472,2.2e-05,0.000275,-0.000415,-0.000446,-0.000176,0.000188,-0.000273,-0.00022,-0.000343,6.7e-05,8e-06,0.00025,0.000193,7.9e-05,-0.000241,2e-04,-0.000177,3.2e-05,0.000383,0.000247,1.1e-05,-0.000223,0.000336,-0.000522,-1.5e-05,0.000298,2e-05
-0.000185,0.000456,0.000223,0.000198,0.000433,6.1e-05,-6.9e-05,0.000536,0.000111,0.000228,1.2e-05,-0.000221,8.7e-05,0.000249,-0.000148,0.000439,0.00033,-0.000102,-2e-04,0.000317,-9.1e-05,-0.000263,8.8e-05,-0.000167,6.9e-05,-9.5e-05,0.00024,0.000688,-0.000134,-0.000151,-3.9e-05,0.000132,-0.000252,0.000175,-0.000144,1e-06,2.6e-05,-8.5e-05,0.000338,0.000242,0.000101,0.00027,-2.5e-05,-0.000133,-0.000427,-0.000141,6.3e-05,-0.000125,0.000128,-0.000198,8.1e-05,-0.000515,-0.000141,0.00024,0.00036,-5.3e-05,-0.000103,0.000231,-0.000274,-0.000475,-0.000447,1.5e-05,-4.3e-05,-0.000331,3.7e-05,-0.000423,-0.000235,0.000331,-0.000153,-9.5e-05,-8.3e-05,-0.000348,4.5e-05,1.9e-05,0.000112,-0.000168,-0.000441,-0.000136,-8.8e-05,0.00025,0.000504,-0.00026,-0.000287,-0.000125,-0.00019,5e-05,0.000163,0.000342,-2.5e-05,-0.000143,-0.000219,3.8e-05,8.3e-05,0.000311,8.5e-05,-0.000528,-7.9e-05,-0.000264,-0.000368,-0.000154,-0.000215,0.000161,-0.000203,-0.000454,-9e-05,-6.1e-05,-2e-04,-0.000238,0.000131,0.000284,-0.000198,-0.000308,-0.000125,-0.000419,0.000116,-4.3e-05,-0.000191,0.000177,-0.000276,1.5e-05,-0.000315
0.000238,0.000289,0.000323,1.4e-05,-0.000199,-2.4e-05,-1e-05,-0.000359,0.000171,0.000388,-5.4e-05,0.000131,-0.000211,-0.000231,0.000133,-0.000277,7.7e-05,0.000406,0.00036,0.000389,-0.000334,-4.7e-05,0.000252,0.000423,0.000133,-0.000158,-6.8e-05,-0.000505,-0.000288,0.000466,-0.000139,0.000118,-0.000117,-0.000358,-0.00018,0.000412,0.00026,0.000158,0.000456,0.000202,8.9e-05,6e-06,-0.000165,0.00021,0.000294,-2e-05,0.000307,0.000304,0.000288,2.5e-05,-4e-04,-2e-06,-5.1e-05,-4.9e-05,-3e-05,-0.000129,0.000139,-0.000378,1.8e-05,-7.5e-05,0.000321,-6.5e-05,-8.6e-05,0.000151,0.000181,2.1e-05,-9.6e-05,0.00024,-0.000231,0.000232,0.000177,7.5e-05,-8.5e-05,-0.000105,-0.000237,-9.2e-05,0.000376,6e-05,0.000119,-3e-05,3.4e-05,0.000312,1.3e-05,-1.3e-05,9e-06,-8.5e-05,-6.3e-05,-7.7e-05,0.000138,-9.5e-05,-0.000232,-6.8e-05,8e-05,-0.000153,8.7e-05,0.000182,0.000414,0.000127,-7.3e-05,-0.000213,-0.000254,1.3e-05,0.000365,-2.4e-05,4.3e-05,-0.000619,-0.000455,-7.3e-05,-0.000147,4.3e-05,0.000191,0.000307,-0.000278,-0.000172,0.000169,8.4e-05,6e-06,0.000166,0.000245,-0.000237,-3.5e-05
2.7e-05,-0.000222,-0.000123,-0.000216,-7.5e-05,-1.2e-05,5.6e-05,0.000395,0.000276,-0.00016,-1.5e-05,-0.00022,-0.000104,-0.000279,-5e-05,-0.00019,-0.000266,-6.7e-05,6.9e-05,-2.1e-05,0.00011,-4.3e-05,-0.000176,0.000134,-2.8e-05,-0.000103,0.000212,-0.000189,-9.7e-05,-0.000115,0.000119,-1e-05,3.5e-05,0.000133,4.5e-05,6.3e-05,-0.000136,0.000212,-0.00011,-7e-06,9.2e-05,4.4e-05,0.000344,-4.9e-05,-9.9e-05,0.000135,-0.000174,-8.9e-05,-0.000363,2.9e-05,0.000103,0.00025,1.4e-05,-0.000108,-9.8e-05,-3.9e-05,0.000244,-9e-05,0.00023,-6.1e-05,-0.000113,2.3e-05,2.5e-05,-3e-06,-5.5e-05,-0.000329,-4.5e-05,-9.7e-05,-0.00023,-0.000357,-0.000126,-1.1e-05,6.7e-05,-0.000149,0.000211,0.000194,-0.000123,6e-06,9.1e-05,5.5e-05,-2.8e-05,-0.000131,1.6e-05,9.4e-05,-0.00019,2e-06,-0.000194,-0.000156,1.3e-05,0.000401,0.000116,9e-05,5.3e-05,0.000138,-0.000408,0.000155,-4.5e-05,-1.3e-05,-0.000352,-2.9e-05,-1.2e-05,3.5e-05,-0.000364,0.000188,-0.000143,0.000114,0.000133,-0.000196,-2.9e-05,-0.00017,0.000278,-0.000302,-0.000372,6e-05,4.5e-05,-7.4e-05,-6.9e-05,-5.3e-05,-0.000129,0.000321,-0.000225
0.000178,0.000121,-0.000163,-6e-05,-0.000131,-3.5e-05,0.000158,-9e-06,2.8e-05,0.000159,-0.000188,1.4e-05,-9.8e-05,0.000159,-0.000181,2.5e-05,1.8e-05,-4.9e-05,-0.000159,3.5e-05,0.00039,0.000408,-0.000147,-0.000264,-0.000175,-3.7e-05,-0.000113,-6e-05,-3.4e-05,-0.000268,8e-06,-0.000111,0.000226,5.9e-05,0.00033,-4.7e-05,-7e-05,-1.9e-05,-0.000129,-0.000211,-6.1e-05,-2.8e-05,-0.00015,-3.3e-05,0.000141,-0.000139,-6e-05,6.6e-05,9.5e-05,3.9e-05,0.000177,2.6e-05,-0.00018,0.000285,8.9e-05,-0.000117,4.1e-05,0.000107,0.000104,5.9e-05,2.9e-05,0.00013,6.8e-05,0.000122,5.2e-05,-0.000185,1e-05,-0.000178,0.000126,-0.000198,-4.9e-05,4.6e-05,-4.4e-05,0.000213,-8.9e-05,-3.1e-05,7.1e-05,8.5e-05,-0.000495,-5.6e-05,-2.1e-05,0.000147,7.3e-05,-6.3e-05,5.1e-05,0.00013,0.00017,1e-04,-3.3e-05,-4.9e-05,0.000127,-0.00016,-0.000538,-1e-04,-5.3e-05,-0.000128,7.1e-05,0.000128,0.000154,9.6e-05,0.000243,-0.000219,0.000109,0.00018,0.000117,-1.5e-05,8.8e-05,7.9e-05,0.000212,-2e-05,-5.7e-05,8.3e-05,0.000198,1e-06,-0.000156,7e-05,-0.000113,-0.000237,6e-05,-1.4e-05,-4.6e-05
0,2.2e-05,0.000228,4e-05,0,-6.6e-05,-7.4e-05,4.7e-05,-1.9e-05,9.1e-05,0.000233,4.8e-05,0.000101,-7e-06,-8e-06,2.1e-05,3.9e-05,3.5e-05,0.000214,-2e-05,1.4e-05,0.000288,-3.6e-05,-0.000145,0.000102,0.000182,0.000119,9e-05,7.5e-05,-9.3e-05,4.1e-05,0.000157,0.000229,0.000104,-1.3e-05,0.000193,-0.000118,-0.000115,1.8e-05,5.3e-05,3.7e-05,-1.1e-05,0.000155,0.000253,3e-06,0.000127,0.000243,-0.000125,-0.00011,9.9e-05,1e-06,4.1e-05,0.000131,-0.000116,-3.5e-05,-2.4e-05,-7.3e-05,-0.000223,-0.000293,0.000141,-0.000113,-8.4e-05,4e-05,-0.00024,-0.00012,0.000217,4.7e-05,9.9e-05,-9.2e-05,0.000274,5.9e-05,-1e-06,2.3e-05,0.000157,3.9e-05,4.7e-05,-7.8e-05,-9.5e-05,0.000269,-0.000111,5.7e-05,-0.000216,-1.4e-05,-6.9e-05,5.6e-05,-2.9e-05,7.3e-05,0.00027,0.000171,6.6e-05,-3.3e-05,0.000113,0.000138,-1.3e-05,-0.000104,-4.4e-05,-9e-06,-0.000156,0.000108,-0.000147,0.000256,0.000114,0.000277,-0.000177,-0.000123,9.6e-05,-0.000128,6.3e-05,-7e-05,-2.8e-05,-8.9e-05,-6.2e-05,-1.9e-05,0.000153,5.3e-05,-3.7e-05,0,-3e-06,1e-04,5.6e-05,0.000215
-6.8e-05,-0.000137,-0.000121,-6.5e-05,7.7e-05,1.8e-05,-1.3e-05,6e-05,-8.5e-05,2.1e-05,0.000152,4e-06,2.6e-05,-8.9e-05,5.3e-05,0.000102,3.6e-05,8.5e-05,6.1e-05,-0.000158,-0.000163,7.6e-05,-0.000163,9.2e-05,0.000174,0.00014,1.2e-05,-6e-05,-0.000102,0.000164,7.7e-05,0.000151,-1.6e-05,-0.000118,7.1e-05,-0.000256,7.7e-05,7.2e-05,-0.000174,3e-06,-3.7e-05,7e-05,-5.5e-05,-6.7e-05,7.8e-05,0,-1.3e-05,0.000174,0.000135,-5.4e-05,9.2e-05,0.000149,9.2e-05,3e-06,2.9e-05,0.000101,1.2e-05,0.000137,-0.000132,6.4e-05,0.00024,0.000132,4.7e-05,0.000316,0.000171,0.000181,-3.4e-05,-7e-05,0.000192,-2e-05,0.000128,4.7e-05,7.4e-05,4.4e-05,5.3e-05,8e-06,0.00011,2.8e-05,-4.5e-05,3.3e-05,5.1e-05,0.000201,1.6e-05,-2.6e-05,9.7e-05,1.5e-05,1.9e-05,-0.00017,-5.1e-05,1.1e-05,7.9e-05,-4.2e-05,8.2e-05,9e-06,0.000161,5.9e-05,-0.00019,6.9e-05,1.4e-05,0.000117,-0.000131,-4.5e-05,-5.4e-05,0.000112,0.000156,-0.000112,8e-05,8.9e-05,8e-06,-4.7e-05,-8.5e-05,-9.4e-05,4.8e-05,-9.5e-05,1e-05,0.000188,-2.4e-05,0.000143,3.9e-05,-0.000176,1e-06
1.1e-05,0.000173,3.9e-05,-3.6e-05,-6.4e-05,3.5e-05,4.8e-05,-1e-06,-6.2e-05,-0.000105,-0.00016,3.4e-05,-1.2e-05,9.7e-05,3.9e-05,3.8e-05,6e-05,-0.000124,-8.5e-05,8.3e-05,-5.6e-05,5.6e-05,-2e-05,-6e-05,-5.6e-05,4.3e-05,6e-06,1.8e-05,0.000118,3.6e-05,-4e-05,-1.7e-05,-5.1e-05,0.00014,-0.000122,0.000113,3.7e-05,-9.2e-05,0.000127,1.2e-05,6.5e-05,1e-06,6.2e-05,4.2e-05,3.3e-05,0.000113,2e-05,-2.2e-05,-2.3e-05,2e-06,2.8e-05,-2.4e-05,1.9e-05,-3e-05,1.4e-05,0.000108,-5.3e-05,-3.1e-05,0.000157,2.5e-05,-5.4e-05,7.9e-05,-3.1e-05,8e-06,-2.6e-05,3e-06,0.000199,7.3e-05,4e-05,-5e-05,1.7e-05,1.1e-05,-3e-06,-7.6e-05,2.5e-05,-3.3e-05,6.7e-05,4.4e-05,6.1e-05,4.4e-05,1.7e-05,3.3e-05,1e-06,4.1e-05,9e-06,1.4e-05,-2.8e-05,8.8e-05,1.2e-05,-8.8e-05,0.000146,1e-06,-2.8e-05,6e-05,5.4e-05,8.4e-05,3.7e-05,-5e-06,3.4e-05,-9.5e-05,2e-06,0.000164,1.4e-05,0.000144,3.6e-05,5.8e-05,-3.2e-05,-2.8e-05,2.7e-05,-6.4e-05,-1.7e-05,3.3e-05,-9.5e-05,3.2e-05,7e-06,-6.8e-05,6e-06,-8.5e-05,5.5e-05,0.000156,5.1e-05
3e-06,-5.2e-05,-7.6e-05,-2.5e-05,2.7e-05,-9e-06,-9e-06,-6.9e-05,6.7e-05,6.4e-05,7.4e-05,9.8e-05,2.9e-05,-6.5e-05,-4.4e-05,-0.000117,-7.1e-05,2.5e-05,-2.4e-05,4.3e-05,2.5e-05,2.2e-05,4.3e-05,2.6e-05,-0.000161,-2e-05,2.4e-05,3.8e-05,-5e-06,-9.9e-05,5.8e-05,-8.1e-05,-5.8e-05,-5e-06,6.6e-05,0.000107,2.3e-05,-5e-05,4.1e-05,4.3e-05,-5.1e-05,8e-06,-6.2e-05,-3.6e-05,-9.7e-05,-4.4e-05,4.4e-05,-7.5e-05,2.9e-05,2.1e-05,3.3e-05,-7.5e-05,-3.9e-05,2.5e-05,1e-05,-4.5e-05,-0.00011,-0.000141,0.000103,2e-06,-5.7e-05,-0.000129,-3.3e-05,-2.4e-05,-1.6e-05,0.000102,-9.5e-05,-0.000114,5.4e-05,6.6e-05,-8.4e-05,-3.5e-05,1.5e-05,4.1e-05,-6.4e-05,-6e-06,2e-05,-2.3e-05,-3.4e-05,-0.000107,6e-06,-7e-06,-1.9e-05,1.9e-05,-6.7e-05,3e-05,-2.7e-05,-7.2e-05,2e-05,6.1e-05,-2e-05,1.9e-05,2.7e-05,-0.000147,3.8e-05,3.8e-05,0.000102,1.1e-05,-1.9e-05,4.3e-05,-7e-06,-2.1e-05,-1.8e-05,-0.00014,-2e-06,6.7e-05,-1.7e-05,-5.2e-05,5.2e-05,-7e-05,3.4e-05,5.6e-05,3.1e-05,-2.5e-05,2.7e-05,-0.000104,-2e-06,4.4e-05,-5.4e-05,-5.3e-05,-5e-05
2e-05,-1.7e-05,6.6e-05,4.9e-05,-2e-05,-3.5e-05,-2.7e-05,8e-06,5.8e-05,2e-05,-1e-05,2.2e-05,9e-06,7e-06,8e-05,8.1e-05,0,2e-05,-3.1e-05,3.1e-05,6.8e-05,2e-05,7.8e-05,5.5e-05,6.2e-05,-4.1e-05,-2.9e-05,5e-05,0,5.5e-05,-0.000105,6.5e-05,-1.6e-05,2e-05,6.8e-05,-1.7e-05,6.8e-05,-2.8e-05,-3.8e-05,-2e-05,2.6e-05,-3.1e-05,-2.9e-05,3e-06,2.3e-05,6e-05,-8e-06,5.6e-05,-8.1e-05,-0.000118,-4.4e-05,-9e-06,-1.4e-05,-3.8e-05,-2.6e-05,-1.2e-05,-3.5e-05,6.7e-05,-1.3e-05,-3.8e-05,8.9e-05,6.2e-05,-1.5e-05,-3.7e-05,1.1e-05,-6e-06,2.1e-05,-8.4e-05,2e-06,-4.6e-05,-3.8e-05,-3e-06,-1.4e-05,-6e-06,1.8e-05,6e-06,-1.6e-05,-3e-06,9e-05,0.000135,-1e-04,-3.5e-05,-2.8e-05,-1.8e-05,-3.8e-05,4.2e-05,-2e-05,9.2e-05,-8e-06,-4.9e-05,-5.3e-05,-3.2e-05,-1.9e-05,0.000105,-3e-05,-8.1e-05,7e-06,-4.5e-05,6e-05,-4e-06,-1.9e-05,-3.6e-05,-4.4e-05,3.9e-05,-3.3e-05,9.4e-05,-1.5e-05,-2.4e-05,8e-06,3.4e-05,-3e-06,-2.1e-05,8.5e-05,-1.8e-05,-6e-06,8.3e-05,4.2e-05,1.7e-05,2.6e-05,0,-1.4e-05
7e-06,-1.8e-05,-4.9e-05,1.7e-05,8e-06,1.8e-05,8e-06,-3e-06,1.5e-05,-1.1e-05,2.8e-05,2.8e-05,2.7e-05,1.2e-05,-8e-06,-2e-05,-4e-06,-6e-06,-1.4e-05,-7.8e-05,-2.3e-05,-2.5e-05,-9e-06,-4.1e-05,1.5e-05,4e-06,4.3e-05,4.2e-05,-8e-06,-2.8e-05,1.6e-05,-3.8e-05,2.3e-05,3.2e-05,-1.3e-05,-9e-06,-8e-06,-2.3e-05,-6.5e-05,-2.3e-05,-2.4e-05,-7e-06,4e-05,4.2e-05,6.3e-05,-5.5e-05,-4.2e-05,8e-06,4e-06,5.5e-05,2.6e-05,4e-05,-2.3e-05,6e-05,4e-06,3e-06,-3.3e-05,4.6e-05,-8.8e-05,-6.4e-05,-4.8e-05,2.4e-05,6e-06,2.6e-05,-2.6e-05,-0.000114,1e-06,-1e-06,9e-06,-2.7e-05,5.5e-05,3e-06,7e-06,3.2e-05,1.4e-05,-4e-06,-1.2e-05,3.8e-05,-1.5e-05,-1.7e-05,-2.3e-05,8.1e-05,4e-06,-1.1e-05,3.9e-05,6e-06,4.9e-05,-4.7e-05,9e-06,2.4e-05,1.2e-05,1.4e-05,3.8e-05,-1.8e-05,1e-05,1.8e-05,-1.7e-05,2.8e-05,-4.2e-05,-3.8e-05,-9e-06,-1.8e-05,5.9e-05,3.7e-05,-2.6e-05,-7.9e-05,2.2e-05,1.4e-05,-1.2e-05,-2.8e-05,2e-05,1.3e-05,-6e-06,-5e-06,-4.6e-05,-6.8e-05,-1.5e-05,-5.1e-05,-2e-05,-4.4e-05,1.3e-05
-7e-06,2.5e-05,1.9e-05,7e-06,3.8e-05,-1.7e-05,3e-05,-8e-06,-1.5e-05,2.3e-05,1.4e-05,-6.7e-05,-7e-06,-2e-06,-4.6e-05,1.5e-05,2.5e-05,1.2e-05,1.9e-05,1.9e-05,-2.8e-05,4.2e-05,3.9e-05,-2e-05,1.1e-05,1e-06,-1e-05,4e-05,-1.9e-05,-9e-06,2.5e-05,4e-05,4.4e-05,-8e-06,-3.1e-05,-3.1e-05,-2.2e-05,1.5e-05,1.6e-05,0,2e-05,8e-06,1.7e-05,-1.7e-05,-3.5e-05,2.3e-05,2.4e-05,-5.1e-05,1.2e-05,1.3e-05,-2.8e-05,1.1e-05,4.2e-05,-3.2e-05,5e-06,-2e-06,-2.2e-05,-4e-05,2.1e-05,9e-06,2.2e-05,2e-05,2.7e-05,-1.2e-05,2.5e-05,-3.9e-05,2.5e-05,-1.4e-05,-6.2e-05,2.1e-05,-9e-06,3e-05,1e-06,-5e-06,-1.2e-05,3.3e-05,8e-06,-2.8e-05,-3.4e-05,-1.1e-05,-1.3e-05,-7e-06,8e-06,0,-7e-06,-5e-06,3.5e-05,1.5e-05,9e-06,1.8e-05,-3.8e-05,-4e-06,-2.9e-05,-5e-06,0,5.6e-05,-6e-06,1.2e-05,-8e-06,4.8e-05,4.3e-05,-9e-06,-2.7e-05,3.2e-05,1.6e-05,-2.5e-05,-3.4e-05,1e-05,6e-06,2.4e-05,1.8e-05,-3.9e-05,-2.3e-05,1e-06,-1.1e-05,4.4e-05,1.9e-05,-2.1e-05,5.6e-05,3.8e-05,-4.7e-05
1.5e-05,-3.7e-05,2e-05,1e-05,-1.5e-05,1.2e-05,-4e-06,2.3e-05,-3.5e-05,2.3e-05,-7e-06,-2.1e-05,5e-06,-1.9e-05,-3e-06,6e-06,-2e-06,-6e-06,-3.4e-05,-3.2e-05,4e-06,9.5e-05,2.1e-05,-2.2e-05,3.5e-05,2.7e-05,1.5e-05,-2.9e-05,3e-06,-7e-06,5e-06,3.5e-05,3.4e-05,-2.4e-05,6.4e-05,-2.2e-05,-2.2e-05,-7e-06,-4.7e-05,9e-06,-1.5e-05,1.3e-05,1.1e-05,2e-06,1.8e-05,-1.9e-05,7e-06,1.9e-05,3e-05,2.1e-05,3.6e-05,1.1e-05,-2e-06,-3.1e-05,1e-06,-3e-05,4e-06,3.8e-05,5e-06,1.9e-05,-1.1e-05,2.7e-05,1.5e-05,1.1e-05,-1.1e-05,-6e-06,-3.1e-05,2.3e-05,1.5e-05,2.1e-05,-2e-06,-1e-05,1e-05,1.9e-05,2e-06,-8e-06,-8e-06,-5e-06,6e-06,-1.6e-05,-2.2e-05,-3.7e-05,2e-06,1.6e-05,2.5e-05,0,-5e-06,-2.3e-05,-1.4e-05,8e-06,1e-05,-5e-06,4.6e-05,1.9e-05,1.4e-05,-3e-05,-9e-06,-2.3e-05,2e-06,-1.4e-05,-1.7e-05,4.6e-05,6.9e-05,-2.9e-05,1.2e-05,-9e-06,5.1e-05,1e-05,7e-06,-8e-06,-2.3e-05,3e-05,-8.8e-05,-2e-05,4e-06,-1.5e-05,-2e-05,2.7e-05,-1.7e-05,-1e-05,-1.4e-05
-1.8e-05,2e-05,-3.4e-05,-5e-06,-4e-06,1.3e-05,-7e-06,-4.8e-05,-1.5e-05,-4e-05,-1.9e-05,-1.8e-05,-7e-06,2.6e-05,1.4e-05,2.2e-05,-1.5e-05,-3e-06,3.2e-05,-3.3e-05,3.6e-05,-1e-05,-1.2e-05,4.8e-05,-1.1e-05,1.5e-05,-1.7e-05,-3e-06,-8e-06,4.7e-05,-1e-06,-4.2e-05,1.6e-05,8e-06,-2.2e-05,3.9e-05,1.1e-05,7e-06,6.1e-05,1.3e-05,1.4e-05,4e-06,-2.1e-05,2.7e-05,1.8e-05,3.2e-05,-2e-06,8e-06,-2.6e-05,1.5e-05,-2.1e-05,2.4e-05,-3e-06,1.2e-05,1.3e-05,4e-06,-8e-06,-1e-05,2.5e-05,2.1e-05,1.4e-05,9e-06,4e-06,-3.7e-05,1e-05,6e-06,2.1e-05,-1.6e-05,-2.8e-05,-1.1e-05,1.4e-05,7e-06,5e-06,-2e-06,3e-06,-8e-06,8e-06,1.8e-05,5e-06,-2e-06,1e-05,7e-06,1e-06,-4e-05,-4e-06,-7e-06,-1.6e-05,-9e-06,1.2e-05,-3.2e-05,3.5e-05,-1.1e-05,7e-06,-1.8e-05,-2.5e-05,-1.4e-05,-2.9e-05,-8e-06,-9e-06,-2e-05,3.3e-05,1e-06,-2.8e-05,-3e-06,2.5e-05,2.4e-05,-2.5e-05,-2e-05,2.2e-05,1.4e-05,-1.5e-05,-2.5e-05,3.5e-05,2.2e-05,8e-06,1.3e-05,1.5e-05,4e-05,3.8e-05,9e-06,2.8e-05
0,1.4e-05,-4e-06,-7e-06,-1.1e-05,-1.7e-05,-6e-06,1.5e-05,1.4e-05,8e-06,8e-06,2.1e-05,8e-06,-2.3e-05,-9e-06,-3.8e-05,1.4e-05,-1.2e-05,-3e-05,6.2e-05,-3e-05,7.6e-05,-6e-06,-5e-06,-5.1e-05,1.4e-05,1.2e-05,-1.7e-05,-1.2e-05,-2e-06,3e-06,-1.3e-05,-1.7e-05,2.3e-05,1.2e-05,1.5e-05,7e-06,9e-06,7e-06,-4e-06,-8e-06,-1.1e-05,1.4e-05,-2.8e-05,-4e-06,-8e-06,-2.3e-05,-1.7e-05,1e-06,-3.5e-05,-3e-06,7e-06,-1.2e-05,4e-06,-1e-05,1.5e-05,1e-06,-3.5e-05,-3.4e-05,2.4e-05,1.8e-05,-2.9e-05,-1.9e-05,5.2e-05,-1e-06,1.8e-05,1e-05,-8e-06,2.6e-05,-2.3e-05,-4e-06,1e-05,-2e-06,1.8e-05,-2e-06,3e-06,1.7e-05,-5e-06,-1.5e-05,-4e-06,-2.2e-05,3.8e-05,1e-05,2.3e-05,2e-06,5e-06,-3e-06,3.2e-05,-1.3e-05,-1e-05,-2.1e-05,1.8e-05,-2.5e-05,-6e-06,-2.7e-05,1.9e-05,2.5e-05,2.6e-05,3.1e-05,3.7e-05,-1.6e-05,1.1e-05,-7e-06,9e-06,-4e-06,-9e-06,7e-06,8e-06,5e-06,-7e-06,5e-06,-1.1e-05,2e-05,-9e-06,2e-06,0,-2.1e-05,-3.9e-05,-3.7e-05,-3.6e-05,-1.6e-05
0,-2.8e-05,1.5e-05,-2e-06,6e-06,4e-06,0,-8e-06,2e-05,2e-06,1.5e-05,1.1e-05,1e-06,3e-06,-4e-06,2.1e-05,-1e-05,6e-06,-3e-06,3e-06,-3.4e-05,-5e-05,-1e-06,-1.6e-05,-5e-06,-1e-06,-9e-06,-1e-05,-3e-06,-5.5e-05,2e-06,3.2e-05,-1.9e-05,-1.6e-05,2.1e-05,1.3e-05,-1.8e-05,2e-06,1.7e-05,0,5e-06,2e-06,-2e-05,7e-06,-1.1e-05,1.4e-05,3.2e-05,-1e-06,-1.6e-05,-7e-06,5e-06,-1.5e-05,-2e-06,-2.5e-05,-8e-06,3e-06,1.9e-05,4.7e-05,3.6e-05,-1.2e-05,-2.4e-05,1.3e-05,-1.3e-05,-4e-05,-1.8e-05,5.7e-05,1.5e-05,1.8e-05,1.3e-05,2.7e-05,-1.7e-05,-1.8e-05,3e-06,-5e-06,-4e-06,-2.3e-05,-1.7e-05,-3e-06,-1.2e-05,5e-06,4e-06,-3.8e-05,-6e-06,1.4e-05,5e-06,1.5e-05,1.4e-05,4e-06,7e-06,9e-06,1.9e-05,-1.5e-05,4e-06,2e-06,-1.9e-05,-2e-06,2.9e-05,-8e-06,-1.1e-05,-3.2e-05,1.2e-05,-2.5e-05,2.4e-05,2.1e-05,-1.5e-05,-9e-06,-4e-06,1.6e-05,-4e-06,1.7e-05,1.1e-05,3e-06,-2.9e-05,1.2e-05,-9e-06,-1.2e-05,1.7e-05,4e-06,1.8e-05,2.2e-05,2.3e-05
-2e-06,-1.1e-05,7e-06,-7e-06,1e-05,0,7e-06,-8e-06,1.4e-05,1.4e-05,9e-06,2.2e-05,-6e-06,1.1e-05,2e-05,2.1e-05,-2e-06,1e-06,1.1e-05,-3.7e-05,3e-06,8e-06,-1.3e-05,1.3e-05,3.8e-05,-1e-06,0,-2e-05,3e-06,1.9e-05,-2.1e-05,3e-06,-1e-05,3.8e-05,-3.5e-05,-2e-05,9e-06,7e-06,-5.5e-05,-8e-06,-9e-06,-4e-06,8e-06,1.5e-05,0,-7e-06,-1.4e-05,6e-06,8e-06,-3e-06,6e-06,-1.2e-05,2.3e-05,1.7e-05,-2e-06,-2e-06,8e-06,-1.2e-05,-9e-06,1e-06,2.1e-05,1.3e-05,-3e-06,9e-06,9e-06,3.8e-05,-2.7e-05,-3e-06,2.7e-05,2.2e-05,1e-05,0,-1e-06,-4e-06,4e-06,1e-05,2.8e-05,1e-05,2.4e-05,1.5e-05,-4e-06,-3e-06,-9e-06,-1.4e-05,-2e-06,6e-06,1.6e-05,-1.8e-05,2e-06,4e-06,6e-06,-4e-06,4e-06,8e-06,2.1e-05,5e-06,-2.5e-05,-8e-06,1.1e-05,1.1e-05,-2.4e-05,5e-06,-2.7e-05,-2.9e-05,-1e-06,-1e-06,1e-06,1e-06,9e-06,2e-06,1.5e-05,-7e-06,8e-06,-1.8e-05,-9e-06,1.2e-05,-8e-06,-3e-06,-1.2e-05,1.4e-05,0
1.1e-05,2.7e-05,-2.6e-05,-1.9e-05,-3e-06,-6e-06,-4e-06,-5e-06,-4e-06,-2.3e-05,-3e-06,-1e-06,1.4e-05,-9e-06,0,-1.9e-05,9e-06,5e-06,-1e-05,7e-06,3.4e-05,-4.9e-05,-1.8e-05,-1.4e-05,1.7e-05,-5e-06,-4e-06,-1.4e-05,4e-06,2.5e-05,2e-05,-1e-05,-1e-06,-1.5e-05,3.5e-05,-2.5e-05,1e-05,4e-06,1.4e-05,-3e-06,9e-06,2e-06,1e-06,-2.4e-05,1.6e-05,-1e-06,-2.1e-05,-1e-06,-6e-06,-5e-06,-5e-06,2e-06,-1e-06,-9e-06,1.5e-05,8e-06,1.4e-05,-2.4e-05,-2e-06,-8e-06,-1e-05,2e-06,7e-06,-9e-06,-8e-06,-2.1e-05,2.6e-05,2.8e-05,6e-06,-3.2e-05,1.7e-05,8e-06,5e-06,-1.4e-05,-5e-06,1e-06,-2.7e-05,0,-1.1e-05,-8e-06,4e-06,7e-06,3e-06,-1e-06,-3e-06,1e-06,-3e-06,-2e-05,-1.1e-05,1.5e-05,-2.3e-05,9e-06,-5e-06,-1.4e-05,2.7e-05,-1.6e-05,1e-06,-2e-06,1e-06,1.2e-05,1.2e-05,1e-06,1.6e-05,8e-06,0,2e-05,-7e-06,-1.5e-05,1e-06,-4e-06,5e-06,-8e-06,-1.6e-05,2e-06,1e-06,-1.2e-05,5e-06,-1e-05,5e-06,-1.7e-05,-1e-05
-9e-06,-2.9e-05,3.7e-05,-1e-05,-8e-06,8e-06,2e-06,7e-06,-1.7e-05,1.6e-05,-2.6e-05,3e-06,-1.3e-05,0,-7e-06,1.7e-05,0,-7e-06,0,-1e-05,-6e-06,2.3e-05,-8e-06,-1.5e-05,-2.5e-05,-1.1e-05,0,1.1e-05,0,-1.1e-05,-1.6e-05,7e-06,1.3e-05,6e-06,2e-06,2e-06,-3e-06,6e-06,1e-06,4e-06,-6e-06,4e-06,9e-06,1.1e-05,-1e-06,1e-06,2.7e-05,-7e-06,1.8e-05,2.2e-05,-4e-06,3e-06,0,-1.5e-05,-6e-06,5e-06,2.2e-05,1.6e-05,-3.6e-05,-1.7e-05,6e-06,1.8e-05,1.3e-05,1e-05,9e-06,-2.1e-05,-6e-06,-7e-06,2.2e-05,1.4e-05,-1.7e-05,-4e-06,-1e-06,1.3e-05,1e-06,3e-06,1.2e-05,-1.1e-05,9e-06,2e-06,1.2e-05,1.7e-05,4e-06,2e-06,-6e-06,-4e-06,-1.1e-05,2.7e-05,6e-06,-1.6e-05,7e-06,-1.1e-05,1.2e-05,1.6e-05,2.3e-05,6e-06,1e-06,1.2e-05,-9e-06,-2.2e-05,1e-06,1.6e-05,2e-06,1.3e-05,1.5e-05,1.7e-05,2e-06,-9e-06,0,-3e-06,-8e-06,6e-06,4.8e-05,-4e-06,3e-06,8e-06,-5e-06,1.1e-05,3e-06,-4e-06,5e-06
6e-06,1.7e-05,-2.5e-05,0,-6e-06,4e-06,1e-06,-1.8e-05,-9e-06,-1.1e-05,1.3e-05,-1.1e-05,1.1e-05,4e-06,-2e-06,-6e-06,-4e-06,-7e-06,6e-06,-5e-06,-2e-05,-2.4e-05,2e-06,2.3e-05,-1.1e-05,3e-06,4e-06,-4e-06,-3e-06,-5e-06,1.4e-05,-1.1e-05,1.7e-05,-1.9e-05,-1.2e-05,8e-06,-2e-06,0,5e-06,5e-06,5e-06,0,-2e-06,0,-3e-06,-2e-06,-1.6e-05,3e-06,-1.1e-05,6e-06,-4e-06,4e-06,-1.8e-05,1.2e-05,0,-9e-06,8e-06,-4e-06,2.9e-05,9e-06,-3e-06,-8e-06,3e-06,-1.2e-05,-6e-06,-1.4e-05,-6e-06,7e-06,-1.7e-05,0,-1.1e-05,4e-06,4e-06,4e-06,-1e-06,2e-06,-5e-06,6e-06,2e-06,-1e-05,-1e-06,-2.6e-05,-2e-06,1e-06,0,-6e-06,-2e-06,-1.4e-05,-2e-06,3e-06,-2e-06,5e-06,-5e-06,-1.2e-05,-8e-06,1.7e-05,-1.8e-05,-6e-06,1.2e-05,1.3e-05,-2e-06,1e-06,-5e-06,-4e-06,-2e-06,-2.8e-05,1e-06,4e-06,3e-06,-1e-06,-8e-06,-9e-06,1e-06,-2e-06,6e-06,-9e-06,5e-06,6e-06,-4e-06,4e-06,-8e-06
-7e-06,5e-06,-7e-06,-6e-06,6e-06,-1e-05,2e-06,1e-05,4e-06,-7e-06,1.1e-05,1e-06,-3e-06,0,4e-06,-2e-06,-5e-06,1e-05,-7e-06,1.3e-05,-1.4e-05,1.9e-05,1e-06,-6e-06,9e-06,2e-06,-7e-06,2.5e-05,0,2e-06,-8e-06,-2e-06,4e-06,1.7e-05,0,8e-06,9e-06,1e-06,1.7e-05,0,-2e-06,-4e-06,-5e-06,-9e-06,8e-06,4e-06,-1e-06,3e-06,-7e-06,-8e-06,2e-06,7e-06,5e-06,-6e-06,-3e-06,-8e-06,7e-06,-1e-05,1.5e-05,3e-06,-1e-06,-1.2e-05,-1e-06,-1e-06,-1e-06,-3.6e-05,5e-06,-4e-06,1e-06,-2.4e-05,1.5e-05,5e-06,1e-06,3e-06,2e-06,-2e-06,-6e-06,2e-06,8e-06,-4e-06,1.1e-05,-2e-06,-1e-06,4e-06,3e-06,-1e-06,9e-06,2.1e-05,-3e-06,-1e-06,-1.5e-05,-4e-06,-7e-06,-1e-06,-1.1e-05,-1.5e-05,1.1e-05,-6e-06,-1.3e-05,2e-06,4e-06,-9e-06,1.4e-05,-1.2e-05,-5e-06,1e-06,-4e-06,1.1e-05,4e-06,-1e-06,-3e-06,9e-06,-1.8e-05,-2e-06,-3e-06,6e-06,-8e-06,6e-06,4e-06,1.4e-05,-7e-06
1e-06,-1e-05,1.4e-05,-1e-06,3e-06,4e-06,-3e-06,0,9e-06,1e-06,-9e-06,-8e-06,4e-06,-5e-06,-5e-06,4e-06,4e-06,-8e-06,8e-06,1e-05,1.6e-05,0,5e-06,1.1e-05,1.2e-05,7e-06,2e-06,-6e-06,1e-06,6e-06,4e-06,1.9e-05,-5e-06,-1.5e-05,1.4e-05,2e-06,0,1e-06,1e-06,-4e-06,0,-2e-06,4e-06,1.1e-05,0,-6e-06,6e-06,1e-06,0,6e-06,7e-06,5e-06,0,-1e-05,-5e-06,3e-06,3e-06,2e-05,2e-06,1e-06,7e-06,8e-06,-6e-06,-7e-06,-2e-06,-8e-06,-1e-06,2e-06,-7e-06,1.3e-05,6e-06,-5e-06,-1e-06,-8e-06,-2e-06,-1e-05,6e-06,-5e-06,-7e-06,1e-05,4e-06,1.4e-05,5e-06,-1.2e-05,5e-06,3e-06,5e-06,-2.7e-05,6e-06,-6e-06,1.5e-05,1e-06,1.4e-05,2e-06,-8e-06,-7e-06,1.1e-05,2e-06,9e-06,-1.1e-05,7e-06,1e-06,-1.3e-05,9e-06,-2e-06,6e-06,1.3e-05,3e-06,1e-06,-6e-06,6e-06,-1.2e-05,-6e-06,5e-06,-4e-06,4e-06,1.4e-05,-2.2e-05,-1e-06,-9e-06,8e-06
2e-06,0,0,4e-06,4e-06,0,-1e-06,-1.1e-05,7e-06,2e-06,3e-06,1e-06,-6e-06,5e-06,-1e-06,1e-05,2e-06,-1e-06,-2e-06,-5e-06,6e-06,-9e-06,1e-05,-1.6e-05,-5e-06,3e-06,-6e-06,1.7e-05,-6e-06,-1.4e-05,3e-06,-6e-06,-8e-06,1.8e-05,-2.1e-05,-1.6e-05,-8e-06,-4e-06,-3.1e-05,-2e-06,1e-06,5e-06,-4e-06,-1.3e-05,-7e-06,7e-06,-3e-06,-4e-06,7e-06,-1.8e-05,-7e-06,-5e-06,1.4e-05,8e-06,1e-05,2e-06,-1e-06,-1.2e-05,-2.8e-05,1e-05,-9e-06,5e-06,-5e-06,1.6e-05,-4e-06,2.8e-05,4e-06,5e-06,1e-06,1e-05,-1.1e-05,1e-06,0,2e-06,0,2e-06,-7e-06,6e-06,-8e-06,1e-06,5e-06,0,2e-06,6e-06,0,3e-06,-5e-06,1.4e-05,-7e-06,0,-4e-06,-4e-06,-1e-05,2e-06,3e-06,1e-05,-1e-06,6e-06,-1e-06,9e-06,-9e-06,-6e-06,9e-06,4e-06,-1e-06,8e-06,-1.4e-05,-6e-06,1e-06,1e-06,7e-06,0,-1.1e-05,-5e-06,0,-9e-06,-1e-05,0,0,-7e-06,-7e-06
-5e-06,3e-06,1e-06,4e-06,-4e-06,-2e-06,2e-06,1e-05,-2e-06,-5e-06,-8e-06,-5e-06,5e-06,-1e-06,4e-06,-1.7e-05,-1e-06,4e-06,-3e-06,-1.8e-05,-1.2e-05,-2e-05,7e-06,8e-06,2e-06,-2e-06,3e-06,-1e-05,1e-06,3e-06,-8e-06,-1.2e-05,-7e-06,-5e-06,1.9e-05,-7e-06,-1e-06,0,1.1e-05,1e-06,0,0,0,1e-06,1e-06,-7e-06,2e-06,1e-06,-1e-06,-4e-06,-6e-06,-7e-06,-1e-05,-1e-06,-3e-06,-2e-06,-5e-06,-7e-06,4e-06,-5e-06,7e-06,2e-06,-2e-06,-2.1e-05,6e-06,2.1e-05,-1e-06,-7e-06,-4e-06,-6e-06,1e-06,1e-06,0,-3e-06,-1e-06,-1e-06,0,2e-06,1e-05,1e-06,3e-06,-1.7e-05,-5e-06,1e-05,0,3e-06,-7e-06,-1.4e-05,4e-06,3e-06,-3e-06,2e-06,8e-06,-6e-06,2e-06,-2e-06,-4e-06,-4e-06,0,-3e-06,5e-06,1.3e-05,-5e-06,-7e-06,9e-06,-1.3e-05,1.1e-05,-4e-06,-1e-06,-6e-06,0,1e-06,1.8e-05,2e-06,0,6e-06,8e-06,1.1e-05,-3e-06,1e-06,7e-06
7e-06,3e-06,-3e-06,0,-5e-06,6e-06,1e-06,-6e-06,-7e-06,-2e-06,1e-06,4e-06,-3e-06,-2e-06,1e-06,1.4e-05,0,-4e-06,7e-06,1e-05,-1.3e-05,-1.5e-05,2e-06,-6e-06,-6e-06,-2e-06,-4e-06,7e-06,-5e-06,2.1e-05,8e-06,1e-05,-1e-06,4e-06,-1.3e-05,-2e-06,4e-06,-4e-06,0,3e-06,-1e-06,-3e-06,-1e-06,8e-06,2e-06,7e-06,-6e-06,3e-06,-2e-06,7e-06,1e-06,-2e-06,-1e-06,-1e-05,2e-06,1e-06,-8e-06,1.4e-05,1.4e-05,0,-3e-06,5e-06,3e-06,1.4e-05,-4e-06,1.1e-05,-4e-06,-1e-06,1.5e-05,1e-06,6e-06,-4e-06,1e-06,2e-06,0,-1e-06,2e-06,-4e-06,-1.1e-05,1e-06,1e-06,3e-06,-1e-06,-1.6e-05,-4e-06,-1e-06,-3e-06,2.1e-05,0,6e-06,9e-06,-1e-06,3e-06,8e-06,-6e-06,-2e-06,-6e-06,-4e-06,6e-06,-5e-06,-3e-06,-3e-06,-5e-06,2e-06,-3e-06,2e-06,-1.1e-05,2e-06,0,4e-06,-1e-06,-5e-06,-1.5e-05,-3e-06,3e-06,-4e-06,-6e-06,-4e-06,3e-06,1.5e-05,3e-06
-6e-06,-7e-06,0,4e-06,4e-06,-2e-06,0,1e-06,-5e-06,0,7e-06,1e-06,2e-06,1e-06,-3e-06,-5e-06,-3e-06,-1e-06,-8e-06,-2e-06,9e-06,-1.6e-05,1e-06,4e-06,-1.2e-05,-4e-06,0,-1.1e-05,3e-06,-1.7e-05,-7e-06,-7e-06,4e-06,-8e-06,3e-06,5e-06,1e-06,0,6e-06,0,1e-06,1e-06,5e-06,-1.5e-05,1e-06,-6e-06,8e-06,-3e-06,-2e-06,1e-06,7e-06,0,-4e-06,5e-06,-2e-06,4e-06,-3e-06,-3e-06,1e-06,-3e-06,1e-06,-5e-06,5e-06,-1e-05,2e-06,1.2e-05,5e-06,-6e-06,2e-06,3e-06,-6e-06,4e-06,-1e-06,-5e-06,0,6e-06,-4e-06,0,3e-06,-6e-06,-1e-06,1.2e-05,4e-06,6e-06,3e-06,-2e-06,5e-06,-1.2e-05,-1e-06,-3e-06,-9e-06,-4e-06,-7e-06,-5e-06,-9e-06,-1e-06,1e-06,2e-06,-6e-06,8e-06,0,2e-06,1e-05,-2e-06,0,2e-06,8e-06,2e-06,0,-3e-06,0,-3e-06,-3e-06,-1e-06,2e-06,3e-06,1e-06,5e-06,-7e-06,-1.2e-05,-4e-06
4e-06,1.2e-05,-3e-06,1e-06,1e-06,-5e-06,-1e-06,1e-06,1e-06,-2e-06,-1e-06,6e-06,2e-06,1e-06,1e-06,-1e-06,1e-06,2e-06,4e-06,-4e-06,7e-06,-6e-06,-1e-06,-4e-06,1.2e-05,-2e-06,-2e-06,-3e-06,-2e-06,-5e-06,6e-06,3e-06,7e-06,4e-06,4e-06,5e-06,-5e-06,-1e-06,8e-06,-1e-06,-2e-06,0,1e-06,7e-06,-4e-06,5e-06,-4e-06,-1e-06,-1e-06,1.3e-05,0,-1e-06,6e-06,2e-06,-4e-06,0,-1.2e-05,-7e-06,-8e-06,-6e-06,0,-4e-06,4e-06,8e-06,-4e-06,-4e-06,1e-06,-1e-06,8e-06,2e-06,-4e-06,2e-06,0,2e-06,-1e-06,-5e-06,1e-06,2e-06,-2e-06,-1e-06,-4e-06,-7e-06,-2e-06,1e-06,-3e-06,-1e-06,6e-06,0,1e-06,-2e-06,0,3e-06,4e-06,1e-06,2e-06,2e-06,-1e-06,4e-06,7e-06,-6e-06,4e-06,-5e-06,-9e-06,5e-06,-4e-06,8e-06,-8e-06,-1e-06,1e-06,3e-06,-2e-06,2e-06,1e-06,-3e-06,-1e-06,-1e-06,-1e-06,-2e-06,9e-06,-3e-06,3e-06
-2e-06,-6e-06,5e-06,-4e-06,3e-06,4e-06,0,2e-06,6e-06,-8e-06,-5e-06,0,-5e-06,-2e-06,2e-06,2e-06,2e-06,0,1e-06,1.5e-05,-9e-06,-2e-06,-3e-06,1e-05,9e-06,0,1e-06,-6e-06,-1e-06,7e-06,-5e-06,5e-06,3e-06,-4e-06,2e-06,-2e-06,6e-06,-1e-06,-8e-06,0,3e-06,-1e-06,-4e-06,1e-06,3e-06,-6e-06,-5e-06,4e-06,-3e-06,-3e-06,-7e-06,2e-06,3e-06,-1e-05,2e-06,-3e-06,-3e-06,1e-05,-3e-06,5e-06,-2e-06,5e-06,-1e-06,-8e-06,-1e-06,-2.5e-05,-6e-06,-1e-06,2e-06,-5e-06,8e-06,-2e-06,0,-2e-06,0,0,-4e-06,-3e-06,7e-06,1e-06,0,-1e-05,-3e-06,1e-06,3e-06,0,-1e-06,-4e-06,-2e-06,-3e-06,4e-06,-3e-06,1e-06,1e-06,1e-05,5e-06,5e-06,-4e-06,-3e-06,-1e-06,-3e-06,1e-06,6e-06,-3e-06,0,-5e-06,9e-06,-1e-06,0,-3e-06,-2e-06,-7e-06,1.2e-05,-1e-06,-2e-06,-1e-06,0,-3e-06,-8e-06,0,-3e-06
-3e-06,-4e-06,-3e-06,-4e-06,-3e-06,-1e-06,0,-5e-06,4e-06,7e-06,-2e-06,2e-06,4e-06,2e-06,-2e-06,2e-06,-1e-06,-3e-06,-4e-06,-7e-06,-1.1e-05,8e-06,-4e-06,-1.2e-05,-8e-06,2e-06,-1e-06,-1e-06,1e-06,5e-06,6e-06,-7e-06,-2e-06,2e-06,-1.1e-05,-6e-06,0,1e-06,-5e-06,-1e-06,-2e-06,0,1e-06,-1.1e-05,1e-06,4e-06,9e-06,-2e-06,4e-06,-6e-06,-2e-06,3e-06,-2e-06,6e-06,3e-06,0,-5e-06,-8e-06,1.2e-05,0,5e-06,1e-06,-3e-06,4e-06,3e-06,-2.1e-05,5e-06,-2e-06,4e-06,-3e-06,1e-06,3e-06,0,3e-06,-1e-06,-2e-06,2e-06,0,-4e-06,2e-06,-5e-06,9e-06,3e-06,-1e-06,-2e-06,0,-5e-06,6e-06,-1e-06,4e-06,-8e-06,1e-06,-1e-06,-2e-06,1.4e-05,-6e-06,6e-06,-2e-06,0,9e-06,4e-06,2e-06,-1e-06,0,3e-06,-1e-06,-8e-06,0,-1e-06,3e-06,1e-06,3e-06,1.4e-05,0,-1e-06,4e-06,-1e-06,-6e-06,6e-06,1.1e-05,-2e-06
6e-06,6e-06,6e-06,-3e-06,-3e-06,0,0,6e-06,-1e-06,-6e-06,2e-06,-4e-06,-2e-06,-1e-06,-1e-06,-6e-06,-1e-06,2e-06,3e-06,-8e-06,3e-06,-5e-06,-4e-06,6e-06,-9e-06,1e-06,0,3e-06,-2e-06,-4e-06,-5e-06,-5e-06,-4e-06,5e-06,1.2e-05,-3e-06,-4e-06,0,-6e-06,0,0,2e-06,-2e-06,1e-05,-3e-06,-3e-06,-5e-06,-1e-06,1e-06,-3e-06,7e-06,0,-3e-06,0,1e-06,1e-06,-8e-06,-2e-06,-6e-06,0,-5e-06,-3e-06,-4e-06,-2e-06,-1e-06,-2e-06,-3e-06,1e-06,-6e-06,4e-06,-9e-06,-1e-06,0,-2e-06,-1e-06,-3e-06,-3e-06,2e-06,0,2e-06,-2e-06,5e-06,3e-06,-5e-06,1e-06,1e-06,-3e-06,3e-06,2e-06,1e-06,6e-06,-3e-06,-1e-06,1e-06,2e-06,-1e-06,-9e-06,2e-06,3e-06,-1.1e-05,-3e-06,2e-06,-4e-06,-1e-06,-1e-06,-1e-06,8e-06,3e-06,-1e-06,0,5e-06,-5e-06,-1.6e-05,-1e-06,1e-06,-6e-06,4e-06,3e-06,-4e-06,-5e-06,2e-06
-6e-06,-1e-06,-8e-06,-6e-06,2e-06,2e-06,-1e-06,-5e-06,-4e-06,2e-06,3e-06,-2e-06,1e-06,-1e-06,1e-06,5e-06,1e-06,-1e-06,-1e-06,4e-06,9e-06,5e-06,-2e-06,-8e-06,2e-06,1e-06,1e-06,1e-06,2e-06,-4e-06,3e-06,7e-06,-3e-06,-3e-06,-9e-06,1e-06,1e-06,0,1.4e-05,1e-06,1e-06,-1e-06,2e-06,-4e-06,-1e-06,2e-06,-1e-06,0,-2e-06,-3e-06,4e-06,-3e-06,-1e-06,-8e-06,-3e-06,-1e-06,5e-06,8e-06,-2e-06,3e-06,4e-06,1e-06,-3e-06,3e-06,1e-06,3e-06,4e-06,-2e-06,1e-06,-5e-06,2e-06,-3e-06,0,0,-1e-06,0,3e-06,-2e-06,3e-06,-1e-06,-2e-06,-7e-06,-2e-06,5e-06,1e-06,0,3e-06,-5e-06,-2e-06,-2e-06,1e-06,2e-06,1e-06,0,-1e-05,4e-06,-3e-06,2e-06,-5e-06,5e-06,2e-06,0,6e-06,3e-06,2e-06,4e-06,-6e-06,1e-06,-1e-06,1e-06,3e-06,2e-06,1e-06,0,1e-06,4e-06,-4e-06,9e-06,-1e-06,-6e-06,-2e-06
7e-06,-2e-06,3e-06,-4e-06,2e-06,-2e-06,1e-06,1e-06,-3e-06,-3e-06,1e-06,-4e-06,-1e-06,1e-06,1e-06,1e-06,1e-06,1e-06,-2e-06,-2e-06,-5e-06,-1.2e-05,-1e-06,1.1e-05,1.2e-05,0,0,8e-06,-3e-06,1e-05,0,-1e-06,-1e-06,2e-06,1e-06,3e-06,1e-06,1e-06,1e-06,1e-06,-1e-06,-1e-06,-2e-06,-5e-06,2e-06,-1e-06,4e-06,1e-06,-2e-06,-1e-06,-6e-06,-2e-06,6e-06,4e-06,-2e-06,-1e-06,-5e-06,-5e-06,-5e-06,-2e-06,-1e-06,-3e-06,1e-06,-7e-06,-3e-06,9e-06,-6e-06,2e-06,-3e-06,1e-06,8e-06,1e-06,1e-06,-3e-06,0,1e-06,-4e-06,0,-5e-06,-1e-06,-2e-06,-5e-06,-1e-06,3e-06,0,0,6e-06,4e-06,2e-06,1e-06,-4e-06,-2e-06,-1e-06,0,-1.1e-05,-1e-06,3e-06,-3e-06,7e-06,4e-06,0,-3e-06,-8e-06,-3e-06,-2e-06,1e-06,2e-06,-1e-06,0,1e-06,-3e-06,-1e-06,-4e-06,-1e-06,0,-2e-06,6e-06,-6e-06,3e-06,0,0
-4e-06,4e-06,3e-06,-2e-06,1e-06,-2e-06,0,4e-06,1e-06,2e-06,-5e-06,1e-06,2e-06,0,-1e-06,-7e-06,-2e-06,1e-06,4e-06,5e-06,-1e-05,6e-06,-1e-06,-1e-05,-1e-06,-3e-06,1e-06,-1e-06,0,-7e-06,-2e-06,-5e-06,2e-06,-5e-06,3e-06,2e-06,0,0,-1e-06,-1e-06,2e-06,1e-06,0,8e-06,-1e-06,0,-2e-06,-2e-06,1e-06,9e-06,-5e-06,0,0,1e-06,0,2e-06,4e-06,-5e-06,1.5e-05,-1e-06,0,-1e-06,5e-06,8e-06,0,2.2e-05,4e-06,0,1e-06,7e-06,-4e-06,1e-06,-1e-06,3e-06,0,-1e-06,3e-06,1e-06,5e-06,-2e-06,1e-06,9e-06,3e-06,-7e-06,0,0,0,-9e-06,0,0,6e-06,-1e-06,-2e-06,-2e-06,-4e-06,-1e-06,-2e-06,0,-5e-06,-1.1e-05,0,1e-06,5e-06,1e-06,1e-06,-5e-06,-1e-06,-1e-06,-1e-06,-1e-06,-4e-06,-3e-06,8e-06,-1e-06,-1e-06,1e-06,-7e-06,1e-06,-4e-06,9e-06,4e-06
0,-4e-06,-7e-06,0,-2e-06,4e-06,0,-6e-06,4e-06,-4e-06,2e-06,0,-3e-06,0,0,1.1e-05,0,-3e-06,-3e-06,0,-1e-06,-1.4e-05,0,8e-06,-7e-06,-2e-06,-1e-06,6e-06,0,-3e-06,4e-06,6e-06,3e-06,2e-06,-6e-06,-1e-06,-3e-06,1e-06,-4e-06,-1e-06,-1e-06,0,2e-06,-8e-06,-2e-06,1e-06,-1e-06,0,2e-06,2e-06,3e-06,-1e-06,0,-7e-06,2e-06,2e-06,3e-06,8e-06,-8e-06,-1e-06,1e-06,3e-06,4e-06,-7e-06,1e-06,1.4e-05,-1e-06,1e-06,-2e-06,-3e-06,-5e-06,0,0,-1e-06,0,2e-06,-1e-06,-1e-06,-7e-06,0,-1e-06,3e-06,1e-06,1e-06,0,0,-4e-06,1.2e-05,1e-06,-1e-06,-4e-06,0,3e-06,3e-06,5e-06,0,4e-06,2e-06,2e-06,1e-05,-1e-06,-1e-06,-2e-06,0,0,-1e-06,-1e-06,0,0,1e-06,0,-1e-06,-6e-06,-2e-06,-1e-06,-1e-06,4e-06,-1e-06,4e-06,-2e-06,-2e-06
3e-06,3e-06,9e-06,0,-2e-06,0,-1e-06,3e-06,2e-06,1e-06,1e-06,2e-06,1e-06,0,0,-1e-05,2e-06,0,0,-1e-06,9e-06,1.7e-05,2e-06,-7e-06,0,-1e-06,1e-06,-6e-06,-1e-06,9e-06,-5e-06,-7e-06,1e-06,-5e-06,0,-1e-06,2e-06,0,-2e-06,1e-06,-1e-06,0,-1e-06,1e-06,2e-06,-1e-06,1e-06,0,0,1e-06,6e-06,-1e-06,-6e-06,2e-06,1e-06,-2e-06,1e-06,-4e-06,-3e-06,-1e-06,-2e-06,-1e-06,1e-06,6e-06,-1e-06,-7e-06,0,1e-06,4e-06,-1e-06,5e-06,1e-06,0,1e-06,-1e-06,-1e-06,0,0,1e-05,0,2e-06,-9e-06,-3e-06,5e-06,-1e-06,0,-4e-06,-9e-06,-1e-06,-3e-06,0,-2e-06,0,-3e-06,6e-06,2e-06,2e-06,-1e-06,2e-06,-2e-06,4e-06,3e-06,-3e-06,1e-06,-1e-06,5e-06,1e-06,0,0,-2e-06,2e-06,0,-1.1e-05,1e-06,0,-1e-06,-2e-06,-4e-06,-3e-06,-7e-06,2e-06
-6e-06,-5e-06,0,2e-06,1e-06,-1e-06,0,0,-2e-06,0,-3e-06,-1e-06,0,1e-06,0,3e-06,0,1e-06,2e-06,2e-06,-3e-06,-6e-06,2e-06,8e-06,1e-06,1e-06,0,2e-06,1e-06,-1e-06,5e-06,-3e-06,-2e-06,7e-06,6e-06,1e-06,1e-06,0,-8e-06,0,1e-06,-1e-06,1e-06,5e-06,-1e-06,2e-06,1e-06,0,-1e-06,1e-06,-1e-06,0,4e-06,3e-06,-2e-06,-1e-06,9e-06,-3e-06,-6e-06,2e-06,2e-06,-1e-06,-3e-06,-7e-06,2e-06,-1.3e-05,-5e-06,0,0,1e-06,2e-06,0,0,-2e-06,0,-2e-06,2e-06,0,-1.1e-05,-1e-06,2e-06,-1e-06,0,-3e-06,2e-06,0,1e-06,1.2e-05,1e-06,1e-06,4e-06,1e-06,-2e-06,1e-06,0,0,-3e-06,-1e-06,-5e-06,-7e-06,-5e-06,-2e-06,5e-06,-1e-06,2e-06,2e-06,-1e-06,1e-06,-2e-06,1e-06,1e-06,-5e-06,1.2e-05,-1e-06,0,5e-06,0,3e-06,2e-06,-1e-06,-1e-06
