2.8e-05,4.2e-05,1e-06,2e-06,1.3e-05,2.8e-05,3.1e-05,2.4e-05,1.1e-05,3.6e-05,1.5e-05,1.3e-05,1.5e-05,4e-06,1.4e-05,6.2e-05,1.9e-05,5.9e-05,3.1e-05,2.4e-05,0.000193,0.000176,0.000106,9e-05,3.8e-05,3e-05,9.2e-05,9e-06,1e-05,9e-06,2.1e-05,8e-06,3.6e-05,2.5e-05,5.7e-05,9.2e-05,1.3e-05,4.6e-05,2.1e-05,2.4e-05,1.7e-05,3e-05,1.3e-05,8e-05,0.000229,0.000226,0.000124,2e-05,3.4e-05,3.2e-05,5e-06,3.4e-05,5.6e-05,0.000114,0.000726,2.2e-05,2.2e-05,0.000187,0.000682,0.000114,0.000834,0.000148,0.000419,0.000357,0.001069,0.001164,0.000384,0.000941,5.9e-05,0.000434,0.000184,0.000225,0.000536,8.6e-05,0.000411,0.000494,3.9e-05,0.000552,0.000155,2.5e-05,0.000519,5.6e-05,9.3e-05,0.000171,0.000159,0.000103,0.000183,6.2e-05,0.000303,7.3e-05,0.000166,8.2e-05,0.000103,0.000239,6.7e-05,0.000147,0.000106,0.000119,1e-04,9.3e-05,0.000217,6.2e-05,0.00011,0.00031,0.000113,0.000231,8e-05,0.000126,8.8e-05,0.000142,0.000152,2.5e-05,8.5e-05,3.1e-05,1.4e-05,4.3e-05,5.1e-05,3.6e-05,7.5e-05,2.2e-05,6.4e-05
6.3e-05,0.000137,0.000128,4.4e-05,4e-05,1e-04,0.000104,6.3e-05,2.9e-05,5.6e-05,2.5e-05,3.5e-05,4.3e-05,2.6e-05,0.000204,9.6e-05,7.9e-05,0.000104,1.1e-05,7.5e-05,0.00059,0.000274,0.000392,0.000153,0.00011,0.000149,0.000114,0.000215,0.000158,0.000104,6.5e-05,9.7e-05,0.000129,0.000153,2.3e-05,0.000226,0.000144,0.000155,0.000125,0.000104,0.000107,5.7e-05,0.000108,0.00021,0.000379,0.000368,0.000214,0.00021,5.5e-05,0.000122,6.6e-05,2.8e-05,2.3e-05,0.000571,0.001218,0.000509,0.000355,0.000294,0.002152,0.001585,0.00093,0.001089,0.000774,0.001562,0.002344,0.002048,0.002615,0.001083,0.000281,0.001232,0.000506,0.001039,0.00115,0.001174,0.000871,0.000875,0.000438,0.000777,0.000461,0.000536,0.001153,0.000227,0.000533,0.000239,0.000618,0.000318,0.000634,0.000289,0.000331,0.00022,0.000471,0.00013,0.000247,0.000587,0.000494,0.000133,0.000107,0.000209,3.7e-05,0.000202,0.000201,0.000305,7.6e-05,0.000853,0.000699,0.000779,0.000452,7e-05,6.2e-05,0.000326,0.000445,0.000327,0.000148,0.00011,5.1e-05,0.000155,0.000229,0.000119,0.000172,0.00013,0.000148
2.8e-05,9.9e-05,8e-05,4e-05,8.5e-05,6.9e-05,3.2e-05,2.4e-05,8e-06,3.2e-05,5.8e-05,3.3e-05,8e-05,6.6e-05,0.00027,0.000289,4.6e-05,9e-05,0.00011,0.000104,0.000706,0.000619,8.8e-05,4.4e-05,7.2e-05,0.000112,0.000254,9.3e-05,9e-05,7.8e-05,9.5e-05,0.000157,6.9e-05,7.2e-05,0.000102,0.000129,0.000145,8.5e-05,7e-05,0.000113,9e-05,0.000122,9.7e-05,0.000347,9.2e-05,0.000795,0.00049,0.000126,0.000111,0.000118,9.8e-05,1.8e-05,7.8e-05,0.000819,0.001114,0.000377,0.000188,0.000653,0.003694,0.00261,0.002408,0.000726,0.002259,0.004329,0.004664,0.001348,3e-04,0.000969,0.002719,0.002491,0.001446,0.000877,0.000662,0.000918,0.000607,0.002344,0.001143,0.001069,0.000492,0.000992,0.001299,0.00098,0.001304,0.001015,0.000717,0.000493,0.000692,0.000778,0.001151,0.000473,0.000418,0.000232,0.000191,0.000518,0.00033,4.1e-05,0.000169,0.000278,0.000302,0.000171,0.000373,0.000478,0.000409,0.001107,0.000898,0.000189,0.000257,0.00018,0.000316,0.000419,0.000456,0.000178,7.5e-05,8.6e-05,0.000177,0.00014,8e-05,1.2e-05,0.000128,1e-04,0.000166
0.000128,0.000158,0.000107,1.7e-05,6.4e-05,0.000141,0.000168,8.7e-05,4.7e-05,5.1e-05,9.4e-05,6.2e-05,5.5e-05,3.8e-05,0.000229,0.000104,0.000155,0.000158,0.000152,8e-05,0.000296,0.00065,0.000534,0.000273,0.000195,0.000123,0.000452,0.00036,0.00014,0.000187,0.000217,0.000115,7.5e-05,9.4e-05,0.00012,0.000236,0.00013,0.000127,5.6e-05,0.00014,8.3e-05,6.6e-05,4.3e-05,0.000834,4.7e-05,0.000856,0.000422,3e-04,0.000152,0.000153,0.000105,7.6e-05,0.000132,0.000925,0.001354,0.000142,0.000564,0.000306,0.003863,0.002742,0.001651,0.001596,0.003018,0.002255,0.000671,0.00196,0.000425,0.001964,0.00235,0.001129,0.00117,0.000585,0.00138,0.000456,0.000263,0.001753,0.000345,0.001165,0.000365,0.000245,0.000843,0.000942,0.001512,0.000785,0.000399,0.000695,0.000267,0.000757,0.0011,0.000423,0.000536,0.000275,0.000812,0.000759,0.00062,0.000107,0.000296,0.000336,0.000191,0.000191,0.000615,0.000614,0.000158,0.001408,0.000864,0.000526,0.000294,0.000238,0.000323,0.000818,0.000709,0.000257,0.000109,0.000114,0.000208,0.00013,7.2e-05,0.000126,0.000171,7.7e-05,0.000142
8.1e-05,1.3e-05,8.3e-05,0.000154,4.6e-05,0.000137,9.8e-05,0.000161,7.9e-05,3.6e-05,6.2e-05,0.000103,0.000182,0.000118,0.000294,0.000435,4.2e-05,0.000207,0.000135,8.1e-05,0.000367,0.000338,0.000152,0.000124,0.000108,0.000298,0.000587,9.9e-05,8.4e-05,8.4e-05,2.6e-05,0.000165,5.1e-05,0.000151,8.3e-05,0.000165,0.000168,5.5e-05,6.8e-05,3.7e-05,0.00014,0.000134,8.5e-05,0.00118,0.000722,0.000809,0.00034,3.7e-05,0.000144,0.000178,0.000151,8.9e-05,0.000214,0.00076,0.001566,0.000844,9e-04,0.000924,0.002223,0.000726,0.000826,0.001143,0.003058,0.003953,0.004353,0.000944,0.001733,0.000599,0.00161,0.001127,0.001041,0.000333,0.002768,0.00243,0.000545,0.00156,0.000438,0.000849,0.000343,0.000408,0.000758,0.001436,0.002785,0.001726,0.000624,0.000531,0.000174,0.000747,0.000881,0.000651,0.000531,5.5e-05,0.001162,0.000172,0.000289,6.8e-05,0.000144,0.000155,0.000616,0.000341,0.000579,0.000415,0.000221,0.000623,0.001022,0.000367,0.000217,0.000188,8.2e-05,0.000472,0.000451,0.000274,0.000167,0.000169,8.2e-05,0.000192,0.000178,6.9e-05,5.7e-05,7.1e-05,0.000214
5.4e-05,2.5e-05,4.3e-05,0.000154,0.000114,0.000102,8.8e-05,8.7e-05,0.000113,9.7e-05,3.7e-05,0.000149,0.000228,0.000124,0.000355,0.000421,0.000217,0.000184,9.4e-05,0.000121,0.001399,0.000602,0.000457,0.000179,0.00014,0.000239,0.000522,0.000392,0.000191,9.2e-05,5.6e-05,6.4e-05,0.000142,4.8e-05,5.6e-05,0.000166,0.000182,0.000203,4.4e-05,1.9e-05,0.000171,0.00014,9.6e-05,0.001343,0.000486,0.00101,0.000625,0.000378,0.000172,3.8e-05,0.000191,0.000138,0.000216,0.000841,0.004082,0.001178,0.000869,0.000499,0.001421,0.001612,0.001137,0.000744,0.001694,0.004429,0.002307,0.004589,0.002257,0.000833,0.002969,0.001805,0.001454,0.001103,0.00342,0.000477,0.000991,0.002747,0.001818,0.001382,0.000238,0.000197,0.000936,0.001582,0.00155,0.000399,0.000704,0.000868,0.000407,0.000538,0.001099,0.000664,0.000857,0.000467,0.001488,0.000696,0.00044,0.000389,0.000422,0.000531,0.000677,0.000373,0.000279,7.6e-05,0.000218,0.000698,0.000987,0.000369,0.000298,0.000255,0.000224,0.000366,0.00028,0.000168,0.000222,8.4e-05,0.000111,5e-05,5.8e-05,0.000147,0.00013,2.5e-05,0.00015
0.000215,0.000149,0.000101,9.3e-05,7e-05,0.000174,6.6e-05,0.000118,9.9e-05,0.000111,0.000196,5.6e-05,0.000252,6.9e-05,0.000225,0.001013,0.000291,0.000121,5.6e-05,0.000192,0.003018,0.001777,0.00092,0.000239,0.000205,0.000175,0.000872,0.000384,0.000233,0.000201,0.000109,0.00012,4.1e-05,0.000185,0.000218,0.000126,6.5e-05,0.000108,0.000183,0.000119,0.000175,5.2e-05,5.2e-05,0.001402,0.002602,0.001664,0.002022,0.000666,0.000118,0.000212,0.000153,3.9e-05,0.000231,0.000534,0.005759,0.001184,0.000496,0.000706,0.002733,0.001953,0.001615,0.002331,0.002097,0.007663,0.007732,0.006455,0.00286,0.001588,0.007211,0.004124,0.002206,0.001591,0.002482,0.003292,0.002454,0.003037,0.002637,0.003334,0.002916,0.001775,0.001043,0.001676,0.001582,0.000338,0.000535,0.000334,0.000575,0.000694,0.00076,0.000253,0.00122,0.000791,0.002037,0.000832,0.000191,0.000536,0.000403,0.000475,0.001152,0.000655,0.000195,0.000148,0.000419,0.00139,0.001004,0.000695,0.000445,0.000167,0.000377,0.000791,5.7e-05,5e-05,0.000206,0.000258,0.000242,0.000133,0.000145,0.000137,0.000127,0.000114,0.000156
0.000113,0.000204,0.000265,0.000114,0.000108,9.3e-05,0.000201,0.000285,9.6e-05,0.000125,0.000163,0.000235,0.000306,0.000233,0.000193,0.002241,0.001253,0.000397,9e-06,5e-05,0.004029,0.002989,0.001337,0.000298,0.000181,0.000356,0.000832,0.001079,0.000589,0.000102,0.000111,0.000205,0.000132,0.000134,0.000265,0.000293,0.000211,0.000204,0.000208,0.000156,0.000314,0.000165,0.000122,0.001706,0.00508,0.002258,0.002046,0.001493,0.000491,0.000246,3e-05,0.000161,4.7e-05,0.000941,0.007059,0.004973,0.002826,0.001093,0.002921,0.000649,0.001036,0.001136,0.003737,0.004781,0.008607,0.006291,0.004159,0.004215,0.012986,0.007313,0.004464,0.00333,0.002724,0.001433,0.000364,0.002396,0.001968,0.003272,0.00189,0.00068,0.000988,0.002975,0.002251,0.001742,0.001469,0.001206,0.000373,0.00108,0.000999,0.001447,0.001449,0.000932,0.002624,0.002747,0.000954,0.000689,0.001113,0.001284,0.001171,0.000707,0.000395,0.000568,0.000537,0.002332,0.002123,0.000818,0.000434,0.00036,0.000267,0.000593,0.000552,0.000389,0.000292,0.000112,0.000134,0.000179,0.000241,0.000143,4.2e-05,4.8e-05,0.000106
8.3e-05,9.9e-05,0.000192,9.8e-05,5.2e-05,0.000102,8.5e-05,0.000195,0.000153,0.000166,5.1e-05,0.000108,1.2e-05,0.000155,6e-05,0.00294,0.002473,0.001426,0.000422,0.000112,0.003696,0.003048,0.001008,0.000255,0.000208,0.000101,0.000296,0.001255,0.00065,0.000268,0.000237,9.2e-05,9.8e-05,0.000142,7.8e-05,0.000135,6.1e-05,7.1e-05,0.000159,4.5e-05,0.000214,0.000166,8.2e-05,0.001947,0.005315,0.003527,0.001816,0.001885,0.001061,0.000536,0.00029,0.00036,0.000178,0.001164,0.007853,0.009681,0.003772,0.000638,0.001126,0.001451,0.000834,0.00152,0.004035,0.003712,0.004249,0.000369,0.000462,0.00246,0.009555,0.004583,0.001301,0.002007,0.002058,0.000977,0.000155,0.002598,0.001084,0.000297,0.001462,0.001035,0.001295,0.003201,0.003562,0.002169,0.000715,0.000518,0.000714,0.00079,0.001234,0.00154,0.00029,0.000883,0.003837,0.005365,0.003368,0.001555,0.000227,0.000895,0.000276,0.000402,0.000376,0.000667,0.000372,0.002316,0.002233,0.001304,0.000198,0.000707,0.000644,0.000957,0.000832,0.000343,0.000164,1e-04,7.1e-05,0.000191,0.00033,0.00017,7.7e-05,0.000114,0.000124
7.2e-05,7.8e-05,5.3e-05,3.6e-05,6.1e-05,3e-05,4.4e-05,9.9e-05,1.5e-05,5.9e-05,8.9e-05,6.7e-05,7e-05,0.000131,0.00014,0.002828,0.001976,0.00066,7.5e-05,4.4e-05,0.001929,0.001,0.001327,0.000542,6.4e-05,8.8e-05,0.000714,0.001687,0.000962,0.00039,3.6e-05,6.6e-05,8.5e-05,7.2e-05,1.7e-05,5.9e-05,0.000124,5.2e-05,9.3e-05,3.5e-05,0.000102,3.3e-05,5e-06,0.002102,0.002673,0.001297,0.001207,0.000742,0.000382,0.000384,0.000138,0.000167,0.000185,0.001087,0.005173,0.006544,0.004084,0.001062,0.001036,0.000758,0.000516,0.001849,0.005698,0.004533,0.001379,0.002114,0.002045,0.000775,0.005056,0.002855,0.001183,0.002945,0.000193,0.001198,0.00104,0.002488,0.003024,0.001007,0.001433,0.00182,0.001046,0.001247,0.004018,0.001899,0.001198,0.001228,0.001448,0.000657,0.001231,0.000356,0.00036,0.000722,0.002539,0.003651,0.001384,0.000554,0.00039,0.000366,0.000162,0.000336,0.000126,0.000918,0.000634,0.001483,0.000576,0.000546,0.000431,0.001032,0.00049,0.000766,0.00061,0.000321,0.000187,8.5e-05,5.5e-05,0.00027,1.6e-05,8.4e-05,0.000167,4.6e-05,0.000141
1.6e-05,2.8e-05,2.3e-05,1e-05,5.3e-05,5.9e-05,8.2e-05,9e-06,3.5e-05,8.4e-05,7.5e-05,3.1e-05,0.000123,3.6e-05,5.7e-05,0.002015,0.000958,0.000464,0.000147,7.2e-05,6.6e-05,0.001357,0.00058,0.000293,0.000185,0.000178,0.000863,0.001126,0.000501,0.000166,4.3e-05,8e-06,2.8e-05,7.3e-05,2.6e-05,3.6e-05,5.9e-05,8.9e-05,6.1e-05,5.7e-05,1.7e-05,1e-05,2.6e-05,0.001932,0.000347,0.000473,0.000835,0.000193,0.000282,0.000139,4.4e-05,0.000132,0.000137,0.001067,0.003269,0.002592,0.001109,0.001321,0.000369,0.001819,0.001496,0.002123,0.00198,0.002021,0.001088,0.002177,0.001284,0.00051,0.001314,0.001113,0.000739,0.000725,0.00168,0.002373,0.000983,0.001854,0.001271,0.001808,0.001385,0.000868,0.000887,0.001296,0.002815,0.001532,0.000781,0.001301,0.000596,0.000565,0.000594,0.000957,0.000498,0.000358,0.002236,0.00142,0.001349,0.000547,0.00079,0.000111,0.000262,0.000364,0.00021,0.000706,9e-05,0.000874,0.000547,0.000337,0.000354,0.001232,0.000805,0.00051,0.000412,0.000234,0.000118,0.000113,6.5e-05,0.000162,0.000158,0.000108,4.4e-05,0.000113,3.4e-05
2.2e-05,2.9e-05,1.4e-05,1.4e-05,1.9e-05,2.9e-05,4.3e-05,8e-06,1.5e-05,4.3e-05,3.4e-05,3.8e-05,4.9e-05,7e-06,0.000147,0.001304,0.000346,0.00011,3.9e-05,2.4e-05,0.001133,0.000114,0.000116,5.6e-05,6.7e-05,0.000155,0.000571,7.4e-05,9.6e-05,4.3e-05,3.9e-05,4e-05,4e-05,6.5e-05,1.9e-05,2.1e-05,2.7e-05,8e-06,4e-05,2.5e-05,9e-06,3.8e-05,3.9e-05,0.001444,0.000206,0.001046,0.000811,0.00036,0.000112,7.3e-05,2.7e-05,8.3e-05,0.000114,0.001312,0.003513,0.000717,0.000539,0.000701,0.000908,0.000984,0.002732,0.001045,0.00053,0.001901,0.001203,0.000319,0.000599,0.001602,0.001814,0.001059,0.000989,0.000713,0.001066,0.000495,0.000161,0.00108,0.002025,0.000996,0.001241,0.000132,0.001228,0.001242,0.000154,0.000556,0.000614,0.001147,0.000449,0.000188,0.000103,0.000169,0.000198,0.00019,0.001768,0.000585,0.000824,1e-04,0.000224,0.000143,1e-04,0.000213,0.000216,0.000489,0.000248,0.000774,0.000363,7.4e-05,0.000405,0.000628,0.000193,0.000309,1e-04,5.9e-05,5.3e-05,0.000194,0.000109,5e-05,4e-05,3.9e-05,4.1e-05,7.1e-05,3.3e-05
1e-05,5.5e-05,1.4e-05,1.5e-05,2.3e-05,2.3e-05,3.7e-05,6e-06,2.2e-05,3.8e-05,2.5e-05,2.9e-05,4.4e-05,6e-06,0.000241,0.000878,0.000256,0.000146,1.3e-05,4.2e-05,0.000667,0.000297,0.000159,2e-05,5.4e-05,0.000143,6.7e-05,0.00024,0.000131,1.1e-05,3.9e-05,1e-05,3.3e-05,5.9e-05,4.6e-05,2.6e-05,2.7e-05,1.4e-05,1.8e-05,7e-06,7e-06,3.7e-05,3.5e-05,0.000859,0.000336,0.001356,7e-04,0.000594,0.000227,0.000142,4.3e-05,4.5e-05,5.7e-05,0.001393,0.001298,0.000155,6.6e-05,0.000745,0.001206,0.001579,0.002434,0.000768,0.000257,0.001076,0.002076,4e-04,0.001685,0.001867,0.001109,0.000332,0.002096,0.001025,0.00093,0.001085,0.00159,0.00066,0.001142,0.001248,0.000934,0.001172,0.001515,0.000956,0.001703,0.000415,0.000396,0.000835,0.000687,0.000428,0.000895,0.000647,0.000341,0.000349,0.001486,0.000446,0.000711,0.000147,0.000615,0.000217,0.000229,0.000249,0.000183,0.000638,0.000341,0.000904,0.000137,7.6e-05,0.000582,0.000302,7.5e-05,0.000154,6.4e-05,5.2e-05,9.5e-05,0.00014,7.3e-05,5e-05,4.7e-05,3.9e-05,1.4e-05,3.7e-05,3.8e-05
9e-06,6.6e-05,2.5e-05,4e-06,1.9e-05,2.3e-05,3.6e-05,7e-06,3.1e-05,3.6e-05,3e-05,3.2e-05,8.8e-05,4.6e-05,0.000338,0.000549,0.00017,6.9e-05,4.9e-05,4.2e-05,0.000733,0.000843,0.000316,0.000121,9.8e-05,0.000114,0.000722,0.000282,5.2e-05,3.1e-05,6e-05,3.4e-05,3.1e-05,2.7e-05,1.2e-05,1.6e-05,3.7e-05,3.4e-05,4e-05,1.5e-05,1e-05,1.8e-05,3.2e-05,0.000507,0.000374,0.001936,0.001655,0.000557,0.000114,6.7e-05,2.3e-05,6.5e-05,6.2e-05,0.001377,0.001635,0.000279,0.000137,0.00083,0.002185,0.000949,0.002446,0.000783,0.001466,0.00266,0.0031,0.002049,0.000819,0.001619,0.001753,0.001627,0.000956,0.001206,0.002353,0.002436,0.001129,0.000958,0.001367,0.001656,0.001602,0.0024,0.001444,0.002948,0.001735,0.001238,0.000995,0.000128,0.000925,0.000579,0.002035,0.000605,0.000229,0.000423,0.000954,0.000562,0.000888,0.000301,0.000854,0.000269,0.000299,0.000296,0.000262,0.000662,0.000451,0.001079,0.000542,0.000126,0.000596,0.000289,0.000109,0.000118,3.2e-05,7.2e-05,8.6e-05,7.8e-05,1.2e-05,5.9e-05,3.2e-05,3.6e-05,3.8e-05,4.4e-05,4.6e-05
3e-05,6.9e-05,4.5e-05,6e-06,1.4e-05,2.8e-05,3.2e-05,1.2e-05,3.7e-05,6.3e-05,3.6e-05,4.9e-05,0.000106,6.9e-05,0.00045,0.000481,2.7e-05,7.6e-05,8.8e-05,7.6e-05,0.001976,0.000857,0.000393,0.000111,7.2e-05,0.00015,0.000833,0.000386,9.2e-05,4.1e-05,2.4e-05,1e-05,4.9e-05,1.3e-05,3.6e-05,1.5e-05,3.4e-05,4e-05,2.5e-05,3.9e-05,3.6e-05,6.2e-05,7.5e-05,0.000604,0.000438,0.001916,0.001606,0.000883,0.000235,0.000118,0.000105,1e-04,0.000124,0.001357,0.000523,0.000615,0.000448,0.000819,0.003115,0.003286,0.007365,0.003385,0.003108,0.001683,0.006435,0.003621,0.000407,0.000709,0.001237,0.001671,0.001472,0.001992,0.002953,0.006924,0.004523,0.003361,0.003657,0.002779,0.002305,0.002811,0.00342,0.003629,0.003171,0.000533,0.000985,0.000698,0.000195,0.000697,0.003317,0.000738,0.000398,0.000415,0.00091,0.001272,0.000889,0.000571,0.000628,0.000318,0.000718,0.00057,0.000296,0.000751,0.00021,0.001063,0.000377,0.000352,4e-04,0.000509,0.000231,3e-04,9.3e-05,0.000148,2.4e-05,0.000128,8.7e-05,6.8e-05,1.5e-05,4.3e-05,3.6e-05,2.9e-05,5e-05
4e-06,3.5e-05,4.2e-05,4.9e-05,2.4e-05,2.1e-05,3.7e-05,8e-06,1.3e-05,1.7e-05,1.3e-05,3.4e-05,5e-05,7.7e-05,0.000641,0.000983,0.000501,0.000131,6.2e-05,1.5e-05,0.002233,0.001431,0.000645,0.000141,6.1e-05,0.000183,0.000706,0.000374,0.000139,6.9e-05,4e-05,2.9e-05,5.8e-05,2.1e-05,4.3e-05,1.8e-05,3.2e-05,4e-06,1.4e-05,2.1e-05,3.3e-05,6.2e-05,3.9e-05,0.000663,0.000248,0.002038,0.001015,0.000757,0.000587,0.000174,0.000137,8e-05,3.3e-05,0.001201,0.002089,0.000705,0.000103,0.000476,0.00459,0.002872,0.010429,0.00605,0.007332,0.003096,0.005659,0.004829,0.003378,0.00099,0.001658,0.003264,0.004016,0.003676,0.003054,0.004749,0.003202,0.004847,0.008787,0.002089,0.004121,0.006464,0.002172,0.002431,0.001144,0.004619,0.002147,0.000573,0.000241,0.002347,0.003902,0.003797,0.001502,0.000693,0.003032,0.000216,0.000904,0.000964,0.000666,0.001124,8e-04,0.000375,0.000692,0.00069,0.002031,0.000187,0.000424,0.000217,0.000468,0.000661,0.000433,7.9e-05,1e-04,0.000324,0.000299,5.3e-05,7.4e-05,0.000169,0.000122,6.8e-05,5.8e-05,6.3e-05,9.3e-05
1.5e-05,3e-05,2.6e-05,3.7e-05,4e-06,1e-06,3e-05,1.4e-05,1.5e-05,1.7e-05,6e-06,1.9e-05,4e-05,4.3e-05,0.000674,0.000711,0.000461,0.000105,3.1e-05,4.3e-05,0.001512,0.000346,0.000148,0.000104,2.9e-05,7.2e-05,0.001055,0.000638,0.000258,8.1e-05,6.2e-05,3e-05,4.1e-05,4.7e-05,2.2e-05,1.6e-05,2.3e-05,2.6e-05,4e-06,1.6e-05,4.9e-05,8e-05,0.000104,0.000735,0.001094,0.002568,0.000784,0.000718,0.000406,0.000217,0.000102,0.000112,8.1e-05,0.001092,0.001063,0.000312,0.000379,0.000434,0.005722,0.010466,0.006529,0.00817,0.009537,0.00974,0.00961,0.009333,0.011973,0.011146,0.005933,0.008248,0.011546,0.005525,0.005051,0.004953,0.010457,0.003276,0.004753,0.009352,0.008212,0.007074,0.005355,0.007959,0.006201,0.005235,0.002094,0.000604,0.0015,0.002923,0.005516,0.007563,0.004984,0.001699,0.003648,0.004527,0.004062,0.003433,0.001832,0.001644,0.001534,0.000674,0.001099,0.001763,0.003966,0.002751,0.001782,0.000755,0.000432,0.000361,0.000287,0.000147,6.9e-05,0.000343,0.000387,0.000327,0.000321,0.000376,0.000298,0.000139,4.8e-05,0.000128,4.6e-05
2.1e-05,5.3e-05,1.9e-05,3.4e-05,5.4e-05,2e-05,1.5e-05,1.7e-05,3.3e-05,1.4e-05,9e-06,3.1e-05,9e-05,5.6e-05,0.000737,0.000847,0.000262,1.9e-05,3e-05,4.2e-05,0.000608,0.000878,0.000519,0.000211,7e-05,4.2e-05,0.001262,0.000591,0.000166,3.2e-05,6.8e-05,2.5e-05,1.9e-05,3.8e-05,3.4e-05,4.8e-05,1.8e-05,9e-06,1.5e-05,1.3e-05,5.8e-05,0.000107,0.000139,0.001089,0.002447,0.001669,0.001836,0.000737,0.000597,0.000222,3.4e-05,0.000119,0.000148,0.000735,0.001711,0.000485,0.000402,0.000972,0.005388,0.008918,0.005221,0.00752,0.004809,0.005224,0.002714,0.007346,0.00813,0.007548,0.004602,0.005925,0.007742,0.008394,0.009748,0.007122,0.009575,0.009179,0.005674,0.009951,0.004272,0.006671,0.002471,0.005998,0.008186,0.00771,0.007706,0.00568,0.002024,0.003334,0.006973,0.004763,0.002104,0.001939,0.003889,0.005194,0.001633,0.001996,0.0014,0.002205,0.002182,0.001298,0.001326,0.001278,0.003219,0.001894,0.000603,9.6e-05,0.000372,0.000384,0.000277,0.000153,8e-05,0.000268,3.1e-05,8.1e-05,0.00023,0.000103,9.5e-05,9.2e-05,0.000124,4.3e-05,6.1e-05
8.8e-05,2.3e-05,4.3e-05,4e-05,4.6e-05,5e-05,5.5e-05,1.7e-05,6e-06,3.4e-05,1.6e-05,6.2e-05,0.000114,7.4e-05,0.000832,0.000324,0.000138,5.8e-05,4.5e-05,4.5e-05,0.000588,0.000706,0.000285,8.1e-05,7.5e-05,9.4e-05,0.000965,0.000389,0.000182,1.4e-05,4.6e-05,3.7e-05,2.5e-05,5.2e-05,1.4e-05,3.1e-05,6.8e-05,5e-05,1.5e-05,2.5e-05,6.2e-05,2e-05,6.2e-05,0.00177,0.001877,0.0026,0.001356,0.000545,0.000574,0.000281,0.000159,9e-05,7e-05,0.000352,0.000996,0.000746,0.000593,0.000249,0.002967,0.001934,0.00058,0.005705,0.004083,0.003635,0.001886,0.003479,0.002506,0.003693,0.003455,0.005723,0.003174,0.00767,0.002831,0.003486,0.002307,0.005874,0.006532,0.00249,0.005736,0.006101,0.005397,0.002366,0.005137,0.001927,0.004188,0.003207,0.001589,0.00202,0.002732,0.000582,0.001091,0.001043,0.004209,0.00124,0.001534,0.000973,0.001139,0.001085,0.000464,0.000294,0.000403,0.000551,0.001623,0.00062,0.000261,0.00015,0.00016,0.000336,0.000177,0.00017,0.000132,0.000152,0.00018,0.000142,0.000277,0.000274,0.000105,0.000133,0.000203,0.000188,5.3e-05
6.2e-05,6.6e-05,4e-05,1.7e-05,3.6e-05,3.5e-05,5.1e-05,2.1e-05,1.6e-05,3.7e-05,3.2e-05,8e-05,2.6e-05,3.5e-05,0.000834,0.000559,0.00016,0.000111,5.4e-05,8.9e-05,0.000753,0.000678,0.000282,4e-05,5.1e-05,0.000176,0.000535,0.000337,0.000157,5.8e-05,2.6e-05,2.3e-05,2e-05,5.4e-05,3.8e-05,1.7e-05,5.3e-05,7.5e-05,5.9e-05,1.8e-05,1.9e-05,2.6e-05,3.7e-05,0.002143,0.001203,0.001548,0.000853,0.000343,4e-04,0.000142,9.1e-05,5.5e-05,4.2e-05,9.4e-05,0.000658,0.000374,0.000466,0.000436,0.00155,0.001239,0.002067,0.002735,0.003744,0.00287,0.001754,0.00273,0.002332,0.002925,0.00109,0.001418,0.001287,0.005377,0.003489,0.000775,0.000391,0.003039,0.000203,0.001936,0.003074,0.002929,0.001139,0.000952,0.001864,0.000856,0.00233,0.00083,0.001019,0.000277,0.00139,0.001268,0.00077,0.000842,0.002522,0.000716,0.000518,0.000221,0.000643,0.000815,0.000345,0.000286,0.000446,0.000703,3.8e-05,0.000141,8.8e-05,3.9e-05,0.000123,0.000172,0.000177,3.4e-05,7.7e-05,6.4e-05,0.000136,5.4e-05,0.000114,0.000134,0.000126,4.2e-05,0.000116,1.6e-05,5e-05
3.7e-05,3.9e-05,3.6e-05,1.3e-05,2.1e-05,3.3e-05,6.7e-05,4.3e-05,2.3e-05,2.2e-05,3.7e-05,3e-06,3.4e-05,7e-06,0.000793,0.000684,0.000572,0.000159,1.3e-05,6e-05,0.00063,0.000623,0.000377,0.00011,4.9e-05,0.00012,0.000673,0.000588,0.000252,6.1e-05,3e-06,7e-06,2.5e-05,5.7e-05,5e-06,3e-05,3e-05,3.6e-05,4e-05,4.1e-05,2.6e-05,2.2e-05,4e-05,0.002209,0.000174,0.001074,0.00088,0.000442,0.000289,0.000179,5.2e-05,0.000116,0.000178,0.000388,0.001407,0.000521,0.000156,0.000352,0.001348,0.001281,0.00201,0.002575,0.001141,0.00128,0.001262,0.001441,0.000914,0.001722,0.001477,0.002318,0.001286,0.003326,0.001848,0.000428,0.001735,0.000577,0.001409,0.00148,0.00115,0.002813,0.001996,0.003348,0.003474,0.000811,0.000386,0.000489,0.000784,0.000903,0.001377,0.001038,0.000446,8e-06,0.001353,7.6e-05,0.000537,0.000335,0.000531,0.000438,0.000145,0.000179,0.00023,0.000592,0.000482,0.000269,5.6e-05,5.4e-05,0.000249,0.000138,0.000199,7.8e-05,5.5e-05,0.000102,7.8e-05,2.9e-05,5.5e-05,6.8e-05,1.1e-05,2.3e-05,4.6e-05,6.1e-05,6.2e-05
1.5e-05,2.5e-05,2e-05,9e-06,1.4e-05,2.7e-05,2.4e-05,3e-06,1.8e-05,2.9e-05,3.9e-05,3.1e-05,4.7e-05,2.5e-05,0.000719,0.000638,0.000229,4.1e-05,4.8e-05,2e-06,0.000602,0.000176,4.8e-05,2.3e-05,3.4e-05,0.000109,0.000597,0.00033,0.000105,6.8e-05,1.7e-05,8e-06,3.5e-05,5e-06,4.7e-05,7e-05,4.9e-05,2e-05,1.9e-05,3.4e-05,2.7e-05,1.5e-05,2e-05,0.001995,0.001233,0.000471,0.000272,0.000171,6.1e-05,0.000119,7.8e-05,5.7e-05,0.000118,0.000518,0.001271,0.000642,0.000322,0.000411,0.000843,0.000756,0.000877,0.000953,0.00131,0.00093,0.00061,0.001698,0.001318,0.000932,0.00132,0.001658,0.001222,0.001328,0.000685,0.001878,0.001018,0.001692,0.002138,0.000706,0.001206,0.001219,0.001442,0.001385,0.00161,0.002389,0.000734,0.000584,0.000977,8.5e-05,0.001217,0.000722,0.000382,0.000378,0.001266,0.000342,0.000541,6.2e-05,0.000187,0.000341,2e-04,7.5e-05,0.000134,0.000549,5.6e-05,0.000516,0.000276,0.000128,0.000339,0.000161,3.1e-05,9.2e-05,6.4e-05,8e-05,1.8e-05,4e-05,5.5e-05,6.3e-05,4.8e-05,5.1e-05,4e-06,5.9e-05,3.5e-05
1.5e-05,2e-06,8e-06,1e-06,4e-06,5e-06,1.4e-05,6e-06,1.6e-05,2.8e-05,1.9e-05,1.2e-05,7e-06,8e-06,0.000334,0.000172,2.9e-05,4e-06,2.9e-05,1.1e-05,0.000231,0.000124,6.4e-05,1.4e-05,1.1e-05,6.8e-05,0.000241,0.000109,3e-05,1.1e-05,1.3e-05,1.2e-05,2.2e-05,1.5e-05,2.4e-05,1.3e-05,9e-06,3e-06,1.1e-05,8e-06,2e-06,2e-06,1.6e-05,0.00079,0.000587,0.000314,9.1e-05,3.7e-05,3.3e-05,2.5e-05,1.1e-05,1.1e-05,5.2e-05,0.000331,0.000228,0.000162,0.000189,7.3e-05,0.000438,0.000309,0.000534,0.000745,0.000552,0.000223,0.000349,0.000424,0.000189,0.000164,0.000573,0.000383,0.000423,6.6e-05,0.000267,0.000502,0.000357,0.000755,0.000358,0.000443,0.000514,0.000498,0.000477,0.000415,0.000464,0.000193,0.000242,0.000199,0.000123,0.000155,0.000455,0.000147,0.000169,4.2e-05,0.000558,0.000132,0.000156,0.000122,7.7e-05,0.000189,6.4e-05,9e-05,6.5e-05,0.000223,0.000106,0.000168,9.2e-05,3.3e-05,0.000145,8.7e-05,3.4e-05,2.8e-05,3.8e-05,4.7e-05,8e-06,2.4e-05,2.6e-05,3.9e-05,3.1e-05,1.6e-05,1.2e-05,1.3e-05,2.5e-05
1.7e-05,9e-06,1.6e-05,1.2e-05,1.1e-05,3e-06,1.7e-05,7e-06,2.3e-05,1e-06,1e-05,9e-06,7e-06,1.9e-05,0.000283,0.00018,0.00011,5.7e-05,3.7e-05,1.4e-05,9.7e-05,4.7e-05,1.4e-05,2.8e-05,1.1e-05,5.2e-05,0.000169,8.8e-05,3.4e-05,1.1e-05,1.4e-05,7e-06,2e-05,9e-06,2.4e-05,1.6e-05,5e-06,1.2e-05,1e-05,6e-06,6e-06,8e-06,2.1e-05,0.000584,4e-04,0.00021,6.3e-05,3e-05,4.7e-05,3.1e-05,2.1e-05,1.8e-05,3.1e-05,0.000367,0.000493,0.000212,0.000104,0.000175,0.000486,0.000227,0.000177,0.000398,8.2e-05,0.000705,0.000323,0.000619,0.000217,0.000142,0.000246,0.000439,0.000514,0.000415,0.000543,0.000249,0.000404,0.000672,0.000201,0.000325,0.000323,0.000566,0.000347,0.000278,0.00035,0.000524,0.000177,0.000154,0.000129,0.000136,0.000489,0.000138,0.00014,4.9e-05,0.000403,0.000147,0.00012,6e-06,6.6e-05,0.000151,6.3e-05,2.4e-05,4e-05,0.000207,8.9e-05,0.000183,0.000112,5.1e-05,0.000148,0.000136,7.3e-05,3.2e-05,2.2e-05,1e-05,1.3e-05,1.2e-05,1.5e-05,1.3e-05,3e-06,1.3e-05,4e-06,6e-06,2.8e-05
1e-05,1e-05,1.3e-05,6e-06,1e-05,9e-06,1.8e-05,1.8e-05,1.6e-05,2.6e-05,1.9e-05,9e-06,1.9e-05,1.7e-05,0.000242,0.000151,4.4e-05,2.2e-05,1.2e-05,1.3e-05,9.7e-05,0.000137,5e-05,1.6e-05,2.6e-05,4.3e-05,6.7e-05,2.9e-05,6e-06,9e-06,1e-05,7e-06,6e-06,1.2e-05,1.8e-05,6e-06,7e-06,1.4e-05,1.2e-05,7e-06,4e-06,1e-05,1.1e-05,0.000333,0.000253,0.00019,9e-06,2.6e-05,1.7e-05,3.5e-05,3.6e-05,1.1e-05,4.4e-05,0.000334,0.000212,0.000119,7.6e-05,0.000117,0.000278,0.000265,0.000343,0.000139,0.000273,0.000299,0.000483,0.000262,0.000269,0.000334,0.000455,4e-04,0.000527,0.000188,0.000458,0.000229,0.000338,0.000526,0.000388,0.000149,0.000215,0.000485,0.000201,0.000352,0.000402,9.9e-05,0.000244,6.8e-05,8.1e-05,0.000193,0.000435,0.000232,0.000106,8.3e-05,0.000203,0.000201,0.00015,5.7e-05,3.5e-05,5.5e-05,3.6e-05,1.3e-05,3.7e-05,0.000159,9.5e-05,8e-05,5.9e-05,4.1e-05,0.000151,8e-05,5.5e-05,2.1e-05,3.7e-05,2.3e-05,1.7e-05,5e-06,1.8e-05,1.2e-05,1.8e-05,1.8e-05,1.6e-05,1e-05,2e-05
7e-06,7e-06,1e-05,6e-06,6e-06,2e-06,3e-06,8e-06,1.9e-05,1.7e-05,3.2e-05,2.5e-05,7e-06,2.8e-05,0.000165,6e-05,6e-05,1.7e-05,1.3e-05,3e-06,0.000205,4.7e-05,3.4e-05,8e-06,8e-06,4.4e-05,7.1e-05,5e-05,1.2e-05,2.7e-05,9e-06,1e-06,1.2e-05,2.9e-05,1.8e-05,7e-06,5e-06,4e-06,1.1e-05,6e-06,1.1e-05,3e-06,1e-05,0.000161,7.1e-05,0.000144,9.1e-05,1.9e-05,2.6e-05,3.7e-05,5e-06,1.2e-05,4.9e-05,0.000357,0.000283,4.7e-05,3.7e-05,9e-05,8.9e-05,0.000312,0.000422,0.000656,0.000189,0.000739,0.000187,0.000467,0.00024,0.000396,0.000197,0.000318,0.00011,0.000364,0.000331,0.000349,0.000311,0.000308,0.000382,0.000271,0.000333,0.000215,0.000297,0.000181,0.000337,0.000314,0.000142,3.5e-05,8.9e-05,0.000126,0.000266,7.2e-05,0.000123,9.9e-05,3.4e-05,0.000216,0.000166,6.7e-05,8.9e-05,0.000113,5.5e-05,5e-05,2.6e-05,0.000113,4.3e-05,2.9e-05,4.2e-05,3.9e-05,0.000153,7.2e-05,2e-05,3.2e-05,1.8e-05,1.2e-05,2.5e-05,1.5e-05,2.1e-05,2.6e-05,2e-06,1.1e-05,2e-05,1.5e-05,2e-05
6e-06,3e-06,2e-06,7e-06,6e-06,4e-06,8e-06,1.3e-05,4e-06,1.1e-05,8e-06,6e-06,0,1.5e-05,0.000148,0.000131,3e-05,1.8e-05,1.6e-05,9e-06,0.000225,6.9e-05,5.1e-05,2.6e-05,2.1e-05,4.2e-05,6.3e-05,2.5e-05,1.2e-05,2.6e-05,2.2e-05,7e-06,1.4e-05,2.4e-05,1.2e-05,3e-06,4e-06,8e-06,5e-06,9e-06,4e-06,2e-06,4e-06,0.000129,0.000115,9.9e-05,4.3e-05,4e-06,2.5e-05,3.2e-05,3.9e-05,3.2e-05,1.3e-05,0.000286,0.00027,0.000198,5.4e-05,0.00012,0.000151,0.000199,0.000247,0.000437,0.000267,0.000821,9e-05,0.000819,0.000726,0.000448,0.000265,0.000401,0.000324,0.000441,0.000184,0.000122,0.000426,0.000264,0.000118,0.000249,0.000284,0.000374,0.000209,0.000168,0.000225,0.000566,0.000325,0.000188,0.00011,0.00021,0.000148,0.000172,7.7e-05,9.2e-05,0.000239,0.000148,0.000111,2.7e-05,6.5e-05,5.7e-05,5.8e-05,3.2e-05,2.5e-05,9.4e-05,5.4e-05,4.2e-05,4e-06,2.5e-05,0.00017,9.2e-05,1.8e-05,1.6e-05,3.3e-05,3.6e-05,8e-06,1.4e-05,4e-06,1.4e-05,1e-05,1.1e-05,1.9e-05,1.1e-05,1.7e-05
1e-06,2e-06,3e-06,6e-06,1.1e-05,1.1e-05,3e-06,1.2e-05,1e-05,5e-06,9e-06,1.1e-05,3e-06,2e-06,0.000112,3.1e-05,7e-06,5e-06,1e-05,8e-06,0.000138,0.000115,5e-05,1.9e-05,1.5e-05,2.9e-05,3.3e-05,2.7e-05,1.3e-05,2e-05,1.2e-05,1e-05,4e-06,1.2e-05,1.5e-05,5e-06,9e-06,1e-06,3e-06,1e-05,1e-05,0,3e-06,0.000146,4.8e-05,0.000133,0.000114,3.6e-05,2.9e-05,1.8e-05,2.4e-05,2.3e-05,5e-06,0.000253,3.5e-05,2.1e-05,3.6e-05,4.8e-05,0.000284,0.00031,0.000192,0.000331,0.000203,0.000469,0.000645,0.000237,0.000425,0.000189,0.000646,6.4e-05,0.000161,0.000215,0.000373,0.000327,0.000188,0.000514,0.000415,0.000306,0.00025,0.000216,0.000326,0.000242,0.000311,0.000133,0.000285,2.9e-05,0.000134,3.8e-05,0.000127,6e-05,0.000111,5.1e-05,0.00016,0.000148,2.8e-05,5.5e-05,1.4e-05,9.4e-05,1.8e-05,2.4e-05,2.2e-05,7.6e-05,5.2e-05,5.3e-05,9e-06,2.6e-05,0.000178,9.8e-05,4.1e-05,7e-06,3.1e-05,2.7e-05,1.5e-05,5e-06,1.3e-05,8e-06,1e-05,2e-05,1.5e-05,1e-05,2e-05
8e-06,1e-06,4e-06,3e-06,5e-06,4e-06,8e-06,1.1e-05,4e-06,8e-06,7e-06,1.1e-05,4e-06,5e-06,8.4e-05,0.000146,3.5e-05,3e-05,2e-05,1.1e-05,0.000147,0.000101,5.8e-05,8e-06,6e-06,4e-05,5.9e-05,2.8e-05,7e-06,1.1e-05,1.4e-05,3e-06,2e-06,1e-05,1.7e-05,4e-06,1.2e-05,1.1e-05,6e-06,7e-06,4e-06,5e-06,6e-06,0.000137,0.000124,0.000121,8.2e-05,4.9e-05,1.9e-05,1.6e-05,1.7e-05,1.6e-05,1.6e-05,0.00023,0.000163,3.6e-05,4.3e-05,5.4e-05,0.000303,0.000207,0.000222,0.000205,0.00013,0.000158,0.000246,0.000223,0.000388,0.000184,0.000391,0.000313,0.000187,0.000258,0.000285,2e-04,0.000272,0.000404,0.000446,8.4e-05,5.1e-05,0.000172,0.000307,0.000146,0.000483,0.000507,0.000344,0.000189,4.4e-05,8.2e-05,0.000224,4.6e-05,0.00017,5.8e-05,0.000322,0.000198,9.5e-05,6e-06,1.1e-05,0.000114,5.6e-05,2.7e-05,4e-06,0.000101,7.2e-05,5.9e-05,2.8e-05,1.3e-05,0.000154,9e-05,7.6e-05,4e-05,3.3e-05,1.4e-05,1.3e-05,6e-06,2.4e-05,3.9e-05,2.9e-05,1.5e-05,7e-06,1.6e-05,1.9e-05
6e-06,4e-06,9e-06,9e-06,2e-06,1e-06,7e-06,2e-06,6e-06,1e-05,9e-06,5e-06,2e-06,4e-06,6.9e-05,9.1e-05,6.1e-05,4.3e-05,1.5e-05,4e-06,0.000208,0.000167,8.7e-05,2.2e-05,6e-06,3.3e-05,6.7e-05,2.1e-05,2.4e-05,6e-06,9e-06,8e-06,8e-06,1.6e-05,8e-06,1e-05,6e-06,2e-06,2e-06,8e-06,3e-06,1e-05,1e-05,0.000107,0.000172,5.2e-05,0.000112,3.6e-05,6e-06,7e-06,5e-06,4e-06,2.7e-05,0.000206,0.000183,0.000113,2.7e-05,4.4e-05,0.000378,0.000341,0.000181,0.000299,0.000221,0.000207,0.000566,0.000173,0.000253,0.000175,0.00045,0.00011,0.000239,0.000487,0.000283,0.000353,0.000195,0.000305,0.000312,0.000103,0.000212,0.000348,0.000399,0.000338,0.000317,0.000125,9.7e-05,1.9e-05,0.000238,0.000134,0.000236,1e-04,0.000222,0.000102,0.000511,0.00012,4.2e-05,1.6e-05,5.6e-05,8.7e-05,4.6e-05,2.7e-05,4.2e-05,8.5e-05,3.6e-05,8.9e-05,4e-05,0,0.000103,7.9e-05,6e-05,6e-05,3.9e-05,1.8e-05,4e-06,3e-06,3.4e-05,2.1e-05,4e-05,3.1e-05,1.9e-05,1.1e-05,1.1e-05
3e-06,4e-06,1.1e-05,6e-06,7e-06,1e-05,1e-06,3e-06,5e-06,4e-06,6e-06,7e-06,5e-06,8e-06,6e-05,0.000124,7.5e-05,4.5e-05,1.7e-05,6e-06,0.000214,8.9e-05,3.7e-05,4e-06,4e-06,4.8e-05,7.2e-05,1.7e-05,2.4e-05,7e-06,6e-06,4e-06,1.3e-05,1e-05,7e-06,9e-06,1.3e-05,7e-06,1e-06,5e-06,1.2e-05,1.3e-05,2e-06,5.6e-05,0.000119,0.000182,7.3e-05,5.3e-05,2.6e-05,1.4e-05,1.9e-05,1.4e-05,4e-05,0.00021,0.000224,9.2e-05,8.1e-05,8.7e-05,0.000291,0.00024,0.000182,0.000371,0.00023,0.00029,0.000413,0.000278,0.000171,0.000282,0.000536,0.000405,0.000179,0.000493,0.000112,0.00029,0.000264,0.000101,0.000213,0.000159,0.000139,0.000159,0.00019,0.000178,0.000196,0.000295,0.000145,3e-05,0.00028,0.000214,0.000245,0.00018,7.7e-05,0.000104,0.000385,0.000104,0.000161,0.000174,4e-05,7.9e-05,9.2e-05,4.7e-05,4.8e-05,0.000131,0.000147,4.2e-05,1.9e-05,1.1e-05,3.3e-05,6e-06,2.7e-05,1.7e-05,1.4e-05,1.2e-05,2e-05,1.5e-05,2.6e-05,5.1e-05,5e-06,9e-06,3e-05,2.1e-05,2.9e-05
2e-06,5e-06,4e-06,3e-06,3e-06,9e-06,2e-06,1e-06,7e-06,5e-06,8e-06,7e-06,6e-06,6e-06,5.7e-05,0.00019,5.8e-05,3.3e-05,1.5e-05,1.5e-05,0.000275,0.000141,4.9e-05,7e-06,2.1e-05,3.5e-05,6e-05,7.2e-05,4.4e-05,2.3e-05,7e-06,5e-06,1.3e-05,1.5e-05,1.2e-05,4e-06,7e-06,2e-06,3e-06,3e-06,1e-05,2e-06,2e-06,5.2e-05,0.00014,0.00014,0.000128,3.2e-05,3.7e-05,1.4e-05,5e-06,6e-06,3.5e-05,0.000186,8.1e-05,9.4e-05,4.2e-05,6.6e-05,2e-04,0.000216,0.000135,0.000294,0.000193,0.000395,0.000184,0.000153,0.000293,0.000321,0.000131,5.7e-05,0.000216,0.000277,6.3e-05,8.8e-05,0.000277,0.000283,0.000319,0.000143,0.000117,0.000187,0.000149,0.000209,0.000156,0.000135,5.9e-05,4.3e-05,0.000248,0.000202,0.000166,0.000168,5.4e-05,5.3e-05,0.000164,0.000216,7.6e-05,9e-05,0.000105,0.000199,2.3e-05,2.2e-05,5e-06,0.000102,0.000118,4e-05,1.5e-05,1.9e-05,5.1e-05,2.3e-05,3e-05,1.4e-05,1.9e-05,4.4e-05,1.8e-05,1.2e-05,3.2e-05,4.6e-05,5.3e-05,5.1e-05,4.6e-05,3.1e-05,1.3e-05
4e-06,4e-06,3e-06,5e-06,3e-06,5e-06,1e-05,4e-06,6e-06,2e-06,6e-06,9e-06,7e-06,2e-06,4.9e-05,0.00011,6.5e-05,2.7e-05,6e-06,3e-06,0.000404,0.000164,5.2e-05,7e-06,1.3e-05,3.7e-05,6.7e-05,5.4e-05,3.6e-05,2.3e-05,1.2e-05,5e-06,5e-06,1.3e-05,7e-06,3e-06,8e-06,9e-06,7e-06,5e-06,1.2e-05,8e-06,6e-06,0.000132,1.3e-05,0.000157,2.7e-05,2.9e-05,4.4e-05,3.9e-05,2e-05,1.9e-05,4e-05,0.000149,0.000208,6e-05,9e-06,3.9e-05,0.000134,0.000188,5.4e-05,0.000278,0.000164,0.000441,0.000242,0.000446,0.000335,0.000198,0.000277,6.3e-05,0.000139,0.000165,0.000203,0.000215,0.000164,0.000213,0.000291,5.1e-05,0.000271,0.00029,0.000201,0.000296,8.2e-05,5.3e-05,0.000154,0.000135,0.000196,0.00011,8.4e-05,7.7e-05,3.5e-05,1.2e-05,0.000288,6.8e-05,0.000193,9.8e-05,8.4e-05,0.000109,6.7e-05,7e-06,2.4e-05,5.7e-05,6.8e-05,5.4e-05,7.7e-05,3.1e-05,0.000109,8.5e-05,3.6e-05,4.5e-05,4.3e-05,5.2e-05,6.9e-05,3e-05,2.8e-05,1.3e-05,2.2e-05,3.2e-05,7e-06,1.7e-05,2.1e-05
1.1e-05,6e-06,3e-06,3e-06,8e-06,7e-06,1.2e-05,4e-06,6e-06,5e-06,3e-06,9e-06,1e-05,8e-06,5.1e-05,6.8e-05,1.9e-05,1.8e-05,7e-06,1.1e-05,0.000437,0.000212,9.1e-05,2e-05,1e-05,2.5e-05,6.8e-05,3.5e-05,2.1e-05,9e-06,5e-06,9e-06,7e-06,7e-06,1.5e-05,6e-06,4e-06,6e-06,7e-06,1.4e-05,2e-05,5e-06,1e-05,0.000228,0.00017,0.000116,4.5e-05,1e-05,4e-05,2.4e-05,4.5e-05,1.7e-05,4.8e-05,0.000121,0.000277,0.000107,1.4e-05,4.5e-05,0.000106,0.000262,0.00014,0.000252,7.3e-05,0.00044,0.000202,0.000489,7.8e-05,0.000139,0.000321,0.000251,0.000179,0.000206,0.000123,0.000322,0.000175,0.000114,0.000217,7e-05,0.000213,0.00011,8.6e-05,0.000185,0.000131,0.00013,0.000185,4e-05,0.000179,0.000153,0.000212,7.4e-05,2.5e-05,4.7e-05,0.000272,2.8e-05,0.000124,3.2e-05,4.4e-05,3.1e-05,3.1e-05,2.7e-05,5.7e-05,0.000165,7.6e-05,4.2e-05,0.000112,8e-05,0.000138,5.5e-05,5.6e-05,3.5e-05,3e-05,1.4e-05,4.6e-05,2.2e-05,1.2e-05,1.4e-05,1.1e-05,2.5e-05,2.6e-05,9e-06,7e-06
6e-06,8e-06,4e-06,1.1e-05,3e-06,6e-06,4e-06,4e-06,3e-06,7e-06,1.1e-05,1.3e-05,4e-06,1e-05,4.5e-05,2.6e-05,3.6e-05,2.3e-05,4e-06,7e-06,0.000318,0.000153,8.4e-05,3.2e-05,1.1e-05,3.4e-05,5.1e-05,2.3e-05,3.6e-05,3.1e-05,2e-05,1e-05,1e-05,1.4e-05,1e-05,1.3e-05,2e-06,7e-06,1.1e-05,3e-06,1.2e-05,2.3e-05,2.5e-05,0.000283,0.000135,0.000242,1e-04,6.7e-05,6.5e-05,4e-05,6.5e-05,7.2e-05,8.2e-05,0.000137,0.000101,9.7e-05,5.7e-05,0.000101,0.000187,0.000183,0.000152,0.000176,0.000189,0.000343,6.2e-05,0.00015,0.000292,0.000172,8.1e-05,0.000106,0.000182,0.000226,8.8e-05,0.000237,0.000331,0.000152,0.000129,0.000171,0.000169,0.000195,0.000191,0.000125,0.000142,0.000144,0.000213,8e-06,0.000214,7.1e-05,0.000133,0.000142,3.7e-05,5.4e-05,0.000261,0.000109,4e-05,4.1e-05,9.9e-05,9.8e-05,1.6e-05,1.3e-05,3.8e-05,0.000138,3.7e-05,0.000148,9.8e-05,3.5e-05,0.000131,9.1e-05,3.4e-05,3.2e-05,3.1e-05,2.5e-05,2e-05,2.4e-05,3e-06,1.3e-05,1.8e-05,2.1e-05,1.4e-05,2.4e-05,1.6e-05
7e-06,7e-06,7e-06,1.8e-05,2e-05,7e-06,5e-06,1e-05,6e-06,1e-05,1.3e-05,1e-05,1.4e-05,1.5e-05,5.4e-05,0.000155,7e-05,3.2e-05,1.1e-05,1e-05,0.000123,8.4e-05,3e-05,1.2e-05,1.4e-05,2.6e-05,7.3e-05,1.1e-05,1.2e-05,1.1e-05,6e-06,6e-06,8e-06,8e-06,5e-06,1.5e-05,2.3e-05,2.1e-05,5e-06,9e-06,1e-05,1.5e-05,1.7e-05,0.000311,0.000135,0.000187,0.000182,4.5e-05,9e-05,2.7e-05,3.3e-05,3e-05,8e-06,8.5e-05,0.000138,8.2e-05,3.9e-05,8.4e-05,0.000171,0.000215,8e-05,0.000224,0.000202,0.000322,0.000462,0.000233,0.000307,0.000183,0.000402,0.000208,0.000225,0.000186,5.6e-05,0.000257,0.000205,9.8e-05,0.000299,5.8e-05,0.000393,0.000316,0.000412,0.000276,7e-05,0.000183,0.000193,0.000183,0.000194,0.000278,0.000303,0.000158,0.000128,0.000116,0.000198,8.7e-05,0.000125,3.6e-05,0.000101,0.000129,5.2e-05,3.1e-05,3.5e-05,0.000134,6.4e-05,0.000178,5.1e-05,2.4e-05,9.4e-05,7.7e-05,3.2e-05,5.3e-05,5e-05,5.6e-05,4.5e-05,3.4e-05,2.6e-05,1.6e-05,1.4e-05,1e-05,6e-06,2.5e-05,1.7e-05
6e-06,1.4e-05,6e-06,1.6e-05,1.1e-05,1.1e-05,1e-05,0,6e-06,8e-06,1.2e-05,9e-06,1e-05,6e-06,4.6e-05,0.000169,5.7e-05,3.2e-05,1.1e-05,8e-06,0.000123,6.9e-05,4.4e-05,1.5e-05,1.4e-05,2.9e-05,9.3e-05,3.7e-05,2.9e-05,8e-06,6e-06,9e-06,1.1e-05,4e-06,3e-06,1.2e-05,1.3e-05,1e-06,1.3e-05,1.5e-05,1.6e-05,5e-06,8e-06,0.000317,0.000324,0.000126,7e-05,7.6e-05,9.9e-05,7.3e-05,1.2e-05,6e-06,1.6e-05,0.000104,0.000235,8e-05,6.7e-05,4.3e-05,0.000201,0.000149,1.2e-05,0.000155,0.000242,9.7e-05,0.000398,0.00021,0.000253,0.000154,0.00052,0.000389,0.000184,0.000234,0.00018,0.000286,0.000143,6.7e-05,0.000193,3.5e-05,0.000483,0.000131,0.000517,0.000398,0.000102,0.000138,0.000222,0.000431,0.000419,0.000136,0.000145,9.7e-05,0.000158,7.4e-05,0.000233,8.4e-05,0.000126,0.000178,0.000182,0.000211,8.7e-05,4.1e-05,8.9e-05,0.000112,0.000108,0.00012,0.000113,4.3e-05,6.6e-05,3e-05,5.4e-05,2.8e-05,4e-05,1.3e-05,2.4e-05,1.2e-05,1.9e-05,3.1e-05,1.7e-05,1.7e-05,8e-06,2.1e-05,2.8e-05
3e-06,1e-05,8e-06,6e-06,7e-06,3e-06,6e-06,3e-06,7e-06,8e-06,1e-05,7e-06,4e-06,6e-06,4.3e-05,8.7e-05,8e-05,4.1e-05,1e-05,9e-06,0.000152,9.2e-05,4e-05,2e-05,9e-06,3.7e-05,5e-05,3.7e-05,3.4e-05,2.1e-05,1e-05,5e-06,2e-06,4e-06,6e-06,4e-06,1.5e-05,1.8e-05,1.7e-05,1e-05,7e-06,1e-05,1.7e-05,0.000315,0.000392,0.000282,0.000211,7.3e-05,6.5e-05,3.4e-05,2.1e-05,4e-06,2.6e-05,7.4e-05,0.000122,9.4e-05,5.4e-05,0.000122,0.000236,0.000295,0.000109,0.000216,0.000218,0.000246,0.000148,0.000292,0.000113,0.000165,0.000323,0.000162,0.000146,0.000228,0.000129,5.6e-05,0.000226,4.4e-05,0.000107,0.000149,0.000453,0.000374,0.000313,0.000337,0.000203,0.000161,5.3e-05,0.000261,0.000194,0.000157,0.000207,0.000175,0.000149,6.7e-05,0.000302,0.000136,9.5e-05,0.000114,4e-05,6.3e-05,5.6e-05,4.2e-05,7.7e-05,0.000117,0.000145,0.000221,0.000182,0.000116,1.3e-05,8.3e-05,9.2e-05,8e-05,1.2e-05,2e-05,2.6e-05,3.6e-05,1.9e-05,1e-05,1.7e-05,2.2e-05,2.2e-05,1e-05,1.8e-05
4e-06,3e-06,0,3e-06,2e-06,4e-06,3e-06,2e-06,3e-06,4e-06,6e-06,2e-06,3e-06,4e-06,4.9e-05,9.5e-05,5.1e-05,1.7e-05,4e-06,9e-06,7.8e-05,7.6e-05,3.4e-05,6e-06,3e-06,3.1e-05,1.1e-05,1.8e-05,4e-06,3e-06,1e-06,6e-06,5e-06,4e-06,5e-06,6e-06,6e-06,1e-05,2e-06,3e-06,1e-06,5e-06,9e-06,0.000314,0.000261,9.9e-05,0.00015,5.1e-05,3.4e-05,7e-06,9e-06,7e-06,1.8e-05,5.5e-05,5.6e-05,7.4e-05,4.3e-05,5.8e-05,0.000227,0.000229,8.2e-05,0.000156,8.3e-05,0.000129,0.000244,0.000407,0.000195,0.000199,0.000193,0.000247,0.000122,0.000164,0.000123,7.2e-05,0.000257,0.000169,0.000101,4.4e-05,0.000223,9.7e-05,0.000327,0.000298,0.00014,6.6e-05,8.1e-05,0.000153,6e-06,0.000104,0.000245,0.000126,1.8e-05,5.3e-05,0.000185,0.000138,5.5e-05,5.2e-05,5.3e-05,8.7e-05,3.9e-05,6e-06,6.8e-05,0.000123,9.8e-05,9.3e-05,0.000101,4.1e-05,3.8e-05,5e-05,1.6e-05,1.3e-05,3.2e-05,2.6e-05,8e-06,1.8e-05,1.2e-05,8e-06,1e-06,1.2e-05,5e-06,4e-06,1e-05
1e-06,1e-06,2e-06,5e-06,1e-06,4e-06,3e-06,2e-06,2e-06,9e-06,5e-06,2e-06,3e-06,1e-06,4.9e-05,7.8e-05,9e-06,8e-06,2e-06,1e-05,1.3e-05,2.3e-05,2.2e-05,6e-06,8e-06,2.2e-05,2.1e-05,1e-05,4e-06,4e-06,6e-06,2e-06,5e-06,5e-06,2e-06,1e-06,2e-06,7e-06,4e-06,4e-06,2e-06,3e-06,7e-06,0.000287,6.5e-05,2.9e-05,5.1e-05,1.7e-05,1e-05,8e-06,6e-06,5e-06,1.1e-05,5.5e-05,6.8e-05,2.3e-05,2.8e-05,7.2e-05,0.000172,0.000257,0.000185,0.000104,0.000122,0.000259,0.000222,0.000294,0.000318,7e-05,8.2e-05,0.000101,0.000216,0.000237,4.7e-05,6.4e-05,0.000147,0.000143,0.000195,0.000111,0.000111,0.00013,0.000138,6.7e-05,9.8e-05,3.6e-05,6e-05,2.7e-05,2.3e-05,0.00012,0.000175,8.6e-05,9e-06,4.8e-05,0.000185,1.2e-05,1.3e-05,5.9e-05,2.9e-05,7.4e-05,1.1e-05,5e-06,2.9e-05,0.000111,5.1e-05,0.000108,1.3e-05,1e-05,8e-06,8e-06,1.7e-05,1.7e-05,6e-06,1e-05,3e-06,1.1e-05,7e-06,5e-06,4e-06,0,6e-06,4e-06,5e-06
1e-06,0,2e-06,5e-06,1e-06,2e-06,3e-06,2e-06,1e-06,8e-06,4e-06,2e-06,2e-06,1e-06,4.9e-05,5.3e-05,1.1e-05,8e-06,7e-06,6e-06,5.1e-05,8e-06,3e-06,2e-06,5e-06,3.1e-05,2.9e-05,7e-06,2e-06,6e-06,4e-06,3e-06,7e-06,3e-06,2e-06,3e-06,1e-06,4e-06,5e-06,4e-06,1e-06,2e-06,5e-06,0.000254,5.5e-05,9e-06,4.6e-05,6e-06,5e-06,5e-06,2e-06,6e-06,5e-06,5.6e-05,5.6e-05,2.2e-05,1.5e-05,7.4e-05,0.000129,0.000247,0.000159,0.000258,0.000234,0.000475,0.000125,0.000101,0.000202,0.000222,7.5e-05,0.000199,0.000274,0.000145,7.4e-05,4.8e-05,0.000144,0.000144,0.000123,0.000178,4.9e-05,0.000197,6.7e-05,0.000146,7.5e-05,0.000104,4.3e-05,3.7e-05,2.4e-05,9.8e-05,0.000197,0.000112,6e-06,5.2e-05,0.000193,4e-05,2.6e-05,5.1e-05,1.9e-05,6.3e-05,7e-06,1e-06,2.8e-05,0.000107,2.7e-05,9e-05,1.8e-05,9e-06,1.4e-05,9e-06,3e-06,1.6e-05,6e-06,7e-06,3e-06,7e-06,5e-06,4e-06,3e-06,4e-06,2e-06,1e-06,3e-06
1e-06,1e-06,1e-06,4e-06,1e-06,2e-06,3e-06,2e-06,1e-06,7e-06,4e-06,1e-06,1e-06,0,4.8e-05,5.8e-05,1.6e-05,5e-06,5e-06,4e-06,6.4e-05,1.3e-05,6e-06,4e-06,4e-06,3e-05,2.7e-05,1e-06,1e-06,8e-06,3e-06,1e-06,4e-06,4e-06,2e-06,2e-06,1e-06,4e-06,4e-06,3e-06,1e-06,2e-06,3e-06,0.000229,3.5e-05,8e-06,4.7e-05,5e-06,6e-06,7e-06,3e-06,4e-06,4e-06,5.3e-05,8.6e-05,3.4e-05,8e-06,7.3e-05,0.000121,0.000263,6.1e-05,0.000171,0.000105,0.000344,7.5e-05,0.000166,0.000227,0.000191,3.9e-05,0.000108,0.00014,0.000202,3.9e-05,6.3e-05,0.000167,0.000109,0.000178,8.6e-05,3.9e-05,0.000138,5.9e-05,0.000146,6.7e-05,7.6e-05,2.1e-05,2e-05,2.1e-05,8.1e-05,0.000182,6.6e-05,1.6e-05,3.9e-05,0.000218,7e-06,2.4e-05,4.2e-05,1e-05,6.4e-05,1e-06,9e-06,2e-05,0.000105,2.4e-05,8.9e-05,1.3e-05,1.2e-05,1.3e-05,5e-06,2e-06,1.6e-05,5e-06,8e-06,2e-06,6e-06,5e-06,3e-06,4e-06,4e-06,1e-06,1e-06,3e-06
