0.018589,0.018202,0.018214,0.018081,0.018529,0.020166,0.019621,0.018306,0.01827,0.017919,0.01753,0.019227,0.02057,0.017318,0.013461,0.014803,0.018423,0.019206,0.016704,0.015405,0.015112,0.015859,0.017247,0.016085,0.014657,0.015141,0.016521,0.016221
0.024199,0.024272,0.023789,0.022728,0.022756,0.024674,0.024454,0.023564,0.023495,0.02282,0.0221,0.02392,0.02539,0.021399,0.017076,0.018534,0.022551,0.023315,0.021191,0.020273,0.019675,0.020525,0.022105,0.021051,0.019274,0.018789,0.019769,0.020154
0.035696,0.037177,0.035734,0.032367,0.031236,0.033617,0.034365,0.034355,0.033726,0.032396,0.031253,0.032622,0.033638,0.029032,0.024788,0.026403,0.030814,0.032013,0.031146,0.030623,0.02915,0.030179,0.032029,0.031307,0.028686,0.025895,0.026177,0.027955
0.049952,0.054399,0.053485,0.047343,0.044369,0.047579,0.049432,0.048753,0.045595,0.043352,0.042389,0.042183,0.041697,0.038755,0.036942,0.038424,0.042776,0.045848,0.046289,0.043882,0.041329,0.044658,0.046517,0.044967,0.041002,0.035636,0.036601,0.039342
0.068269,0.077584,0.08176,0.074921,0.069594,0.076095,0.078948,0.070953,0.059616,0.054715,0.056114,0.056452,0.055409,0.057476,0.060167,0.060155,0.063277,0.0699,0.069834,0.060413,0.057111,0.069528,0.071953,0.066456,0.060691,0.052214,0.05533,0.057864
0.099918,0.114455,0.129671,0.126145,0.117882,0.131149,0.135017,0.110952,0.082179,0.071969,0.079217,0.08389,0.085502,0.095303,0.101835,0.098759,0.100687,0.113838,0.110536,0.087116,0.082949,0.113926,0.120611,0.107907,0.097939,0.083299,0.088223,0.089386
0.149943,0.171035,0.199079,0.199506,0.188233,0.211177,0.218207,0.173839,0.120589,0.103273,0.117034,0.127265,0.135025,0.154793,0.161782,0.153515,0.157703,0.180504,0.173521,0.13197,0.124655,0.1803,0.194509,0.172342,0.156224,0.134449,0.141893,0.138966
0.201941,0.230128,0.267286,0.270695,0.258259,0.289771,0.301945,0.24114,0.165522,0.142513,0.160631,0.175424,0.191604,0.22079,0.222436,0.206191,0.217005,0.251046,0.241677,0.183955,0.171671,0.248925,0.271182,0.239439,0.217668,0.194274,0.205647,0.196285
0.224345,0.255129,0.291317,0.296984,0.287375,0.318575,0.335683,0.277251,0.197932,0.176214,0.193794,0.207065,0.230169,0.263362,0.254175,0.22954,0.248083,0.288014,0.278306,0.217984,0.201782,0.281373,0.307417,0.271572,0.249937,0.237578,0.251414,0.234007
0.207149,0.233995,0.257009,0.258092,0.251156,0.270882,0.29208,0.26449,0.20895,0.198422,0.216635,0.221365,0.242139,0.268881,0.249663,0.220573,0.239531,0.273855,0.266308,0.221381,0.201214,0.25496,0.280469,0.249911,0.235609,0.246165,0.257031,0.231329
0.187005,0.205724,0.218963,0.206696,0.196816,0.210612,0.241071,0.254301,0.223119,0.218356,0.240251,0.241283,0.258355,0.268577,0.241867,0.214736,0.219737,0.241743,0.249962,0.225196,0.190244,0.205355,0.234001,0.217639,0.206854,0.23227,0.241033,0.210655
0.198726,0.205981,0.208383,0.185814,0.184504,0.21484,0.246118,0.262327,0.236305,0.232957,0.265283,0.271875,0.275296,0.268263,0.248874,0.229669,0.213815,0.222925,0.249531,0.239083,0.194422,0.187284,0.222676,0.214397,0.19158,0.216828,0.232799,0.209741
0.21105,0.207588,0.200623,0.183094,0.207881,0.253577,0.263589,0.254643,0.228452,0.237329,0.279671,0.28552,0.268821,0.24803,0.242452,0.242109,0.220457,0.214284,0.237648,0.227316,0.18996,0.191616,0.233901,0.223279,0.189415,0.205494,0.218192,0.209968
0.214133,0.207201,0.201319,0.194053,0.243519,0.294565,0.266941,0.225483,0.205001,0.229409,0.27518,0.282286,0.251406,0.220333,0.227745,0.247232,0.237353,0.220311,0.225845,0.213975,0.186074,0.200984,0.253203,0.24085,0.199543,0.205105,0.203963,0.201783
0.261431,0.253668,0.237225,0.226767,0.278441,0.328556,0.278336,0.217732,0.208823,0.227924,0.269557,0.289953,0.25479,0.218356,0.223598,0.255747,0.274807,0.249301,0.248539,0.270485,0.247082,0.242026,0.281582,0.26661,0.222358,0.228849,0.233845,0.22272
0.373587,0.359912,0.318478,0.297514,0.323983,0.38431,0.357613,0.282044,0.278161,0.284277,0.335588,0.371334,0.304709,0.26712,0.269073,0.302479,0.357103,0.321811,0.326491,0.404587,0.379614,0.336873,0.340231,0.308723,0.269919,0.282772,0.299998,0.282941
0.52289,0.506831,0.44249,0.394695,0.387328,0.486186,0.500562,0.400077,0.406794,0.409132,0.477572,0.534611,0.421282,0.372298,0.373418,0.399111,0.480122,0.434603,0.440278,0.573237,0.556648,0.497254,0.47966,0.423428,0.376921,0.379891,0.397277,0.387333
0.646452,0.636253,0.573296,0.493179,0.456828,0.590656,0.633907,0.524665,0.549271,0.540664,0.615479,0.700289,0.551885,0.476332,0.481988,0.505697,0.586865,0.544125,0.554748,0.707815,0.700154,0.653025,0.636347,0.56056,0.499056,0.478781,0.483199,0.490599
0.678345,0.685149,0.653797,0.557511,0.489011,0.614359,0.678199,0.609814,0.660496,0.619926,0.662898,0.762549,0.616334,0.51382,0.52282,0.551176,0.609716,0.609631,0.634284,0.740238,0.72887,0.703279,0.703501,0.634988,0.57057,0.535885,0.520874,0.532584
0.578467,0.608426,0.625828,0.541108,0.455353,0.559813,0.632867,0.625311,0.685831,0.604284,0.60045,0.699637,0.589413,0.456383,0.462487,0.509139,0.549548,0.62452,0.648901,0.676113,0.689879,0.640296,0.625253,0.60655,0.575541,0.55222,0.510709,0.492056
0.44741,0.467808,0.501367,0.449291,0.384968,0.47364,0.539485,0.563926,0.590513,0.484862,0.458634,0.554946,0.498531,0.36922,0.383991,0.440773,0.461504,0.588124,0.612185,0.597667,0.64529,0.531729,0.459959,0.495551,0.519962,0.509745,0.451917,0.415073
0.395373,0.381409,0.385894,0.371733,0.353438,0.413352,0.45993,0.472302,0.427145,0.316143,0.294918,0.3744,0.376971,0.32363,0.355788,0.383789,0.366727,0.483947,0.51908,0.504627,0.554317,0.447668,0.350973,0.376062,0.418932,0.41211,0.383958,0.364083
0.405448,0.348528,0.318902,0.322384,0.333508,0.353821,0.387735,0.385289,0.289854,0.191029,0.177103,0.239491,0.283742,0.289732,0.31927,0.317672,0.272554,0.33406,0.382591,0.404652,0.430125,0.361087,0.293118,0.29385,0.303772,0.284342,0.292366,0.290097
0.37492,0.294838,0.239735,0.247507,0.280505,0.275203,0.295778,0.291447,0.198975,0.134323,0.141217,0.185632,0.223641,0.230291,0.242722,0.243894,0.210109,0.220255,0.244856,0.284408,0.307727,0.269337,0.217047,0.202984,0.199218,0.180018,0.190967,0.200302
0.262352,0.191518,0.147927,0.157931,0.19554,0.200669,0.201632,0.189703,0.142111,0.121525,0.138923,0.156591,0.166376,0.168804,0.181425,0.186775,0.17212,0.164169,0.163303,0.187613,0.197622,0.173484,0.140138,0.131823,0.136846,0.125565,0.12072,0.137565
0.145963,0.107974,0.089408,0.096108,0.131236,0.157873,0.134629,0.103903,0.091959,0.108484,0.135821,0.139001,0.131768,0.140965,0.155378,0.141599,0.150542,0.164125,0.14865,0.146872,0.127274,0.103617,0.100945,0.105438,0.1058,0.100626,0.09434,0.105469
0.10502,0.092882,0.078627,0.077268,0.106469,0.140412,0.119376,0.091049,0.078725,0.096071,0.128509,0.126433,0.109683,0.120881,0.136685,0.114685,0.138729,0.166159,0.142286,0.138302,0.120006,0.095937,0.096421,0.100105,0.096802,0.096017,0.084846,0.079692
0.097648,0.098851,0.0842,0.079653,0.100619,0.125368,0.109935,0.096977,0.087382,0.093872,0.119162,0.116466,0.095395,0.101465,0.107792,0.086969,0.118156,0.149637,0.123334,0.116776,0.111142,0.090971,0.08912,0.096466,0.091309,0.088796,0.079967,0.067612
0.08686,0.100661,0.08988,0.080386,0.08669,0.094074,0.081007,0.083804,0.083636,0.081484,0.095066,0.095495,0.087017,0.091339,0.081039,0.057246,0.084994,0.117639,0.10584,0.099508,0.095298,0.080397,0.078127,0.087665,0.081108,0.072885,0.068859,0.063473
0.080725,0.093627,0.088789,0.075304,0.070002,0.069655,0.057766,0.061532,0.065715,0.063694,0.069422,0.071588,0.081904,0.086409,0.060697,0.039008,0.059713,0.096405,0.117326,0.115547,0.097589,0.077597,0.068733,0.073997,0.066226,0.056174,0.061398,0.068611
0.073355,0.082509,0.092271,0.08342,0.065125,0.060615,0.055194,0.056894,0.058297,0.056653,0.053091,0.054398,0.081762,0.094682,0.062726,0.040397,0.053978,0.097005,0.145937,0.148339,0.109554,0.080081,0.073791,0.075404,0.066652,0.064501,0.077414,0.082566
0.070791,0.080836,0.100355,0.094218,0.068656,0.062881,0.061337,0.063043,0.061911,0.058919,0.048866,0.048919,0.088358,0.107128,0.071124,0.045216,0.053993,0.096381,0.159743,0.163399,0.107068,0.072393,0.075555,0.080154,0.072681,0.075568,0.092144,0.091475
0.061909,0.070605,0.094394,0.088012,0.062877,0.056826,0.056754,0.058268,0.056417,0.056785,0.050002,0.051503,0.087343,0.100349,0.065831,0.0416,0.053674,0.093173,0.147774,0.143915,0.0857,0.057343,0.066329,0.071353,0.066911,0.071839,0.088652,0.084266
0.04424,0.049411,0.068878,0.063482,0.046672,0.041807,0.040491,0.041432,0.04182,0.046078,0.043604,0.048147,0.070333,0.071785,0.046476,0.030159,0.049646,0.093216,0.122762,0.100531,0.059588,0.044189,0.048333,0.052054,0.051848,0.054865,0.067404,0.06232
0.028729,0.034851,0.040991,0.038478,0.035722,0.031496,0.025553,0.02647,0.034058,0.036448,0.031004,0.036308,0.04486,0.039952,0.027454,0.020008,0.040799,0.08049,0.09202,0.065459,0.039589,0.032712,0.028965,0.035837,0.040566,0.043139,0.049856,0.041649
0.018023,0.027962,0.027096,0.02509,0.027385,0.025693,0.023097,0.02312,0.033378,0.033023,0.024605,0.027325,0.031244,0.031189,0.023051,0.014021,0.029498,0.058988,0.065611,0.045675,0.025105,0.023597,0.022733,0.028533,0.033293,0.039868,0.044381,0.032807
0.013533,0.021689,0.024159,0.020645,0.018688,0.018271,0.021827,0.023705,0.032833,0.035238,0.027562,0.025767,0.031021,0.032939,0.022924,0.012448,0.025024,0.050371,0.052948,0.038351,0.022898,0.020008,0.023695,0.029018,0.029975,0.036939,0.036739,0.025859
0.010346,0.016733,0.021382,0.017279,0.011558,0.010396,0.017942,0.022897,0.028594,0.033154,0.028139,0.022034,0.027938,0.030257,0.021947,0.015493,0.028622,0.047993,0.046874,0.042201,0.029153,0.021347,0.023738,0.029757,0.027803,0.030147,0.026326,0.020249
0.009069,0.014007,0.019669,0.016255,0.009511,0.006042,0.013701,0.021418,0.023154,0.026417,0.023661,0.01619,0.022682,0.025367,0.019328,0.019261,0.032987,0.04425,0.044967,0.048502,0.036311,0.023462,0.024567,0.029108,0.02616,0.022112,0.019428,0.019383
0.00927,0.011157,0.018762,0.015458,0.008362,0.005438,0.014339,0.024252,0.023265,0.022008,0.016691,0.012481,0.020752,0.02522,0.017368,0.022119,0.034743,0.038163,0.044401,0.05082,0.039136,0.022848,0.023286,0.024626,0.021312,0.01416,0.01282,0.018074
