0.000271,6.8e-05,0.000334,0.000262,0.000181,0.000223,3.6e-05,3.1e-05,0.000185,0.000455,0.000376,0.000305,4e-05,0.000295,0.000364,0.000782,0.000427,0.000321,0.000399,0.000317,0.000374,-0.000227,-0.000978,-0.001631,-0.000743,-0.003462,-0.0163,-0.010581,-0.0093,-0.004543,-0.00239,-0.007937,-0.004589,-0.002483,-0.002974,-0.000939,-0.002922,-0.001028,0.021969,0.002027,-0.018283,-0.016669,-0.01247,-0.017614,-0.012974,-0.003399,-0.002878,-0.006978,-0.007328,-0.007609,-0.010225,-0.00308,-0.016268,-0.006834,-0.006092,-0.020579,-0.015291,-0.011847,-0.010484,-0.01301,-0.011381,-0.010872,-0.014913,-0.013515,-0.009167,-0.011308,-0.009912,-0.005228,-0.003749,-0.007955,-0.009821,-0.007173,-0.005718,-0.006783,-0.004945,-0.00307,-0.001042,-0.001112,-0.002813,-0.001134,-0.000819,-0.003948,-0.001737,-0.000636,-0.000344,-0.000594,-0.000866,-2.2e-05,0.000636,0.000446,0.000373,0.000358,-0.001985,-0.002791,-0.002651,-0.000775,0.000433,-0.001342,-0.00085,-0.001429,-0.000728,-0.003776,-0.003261,-0.001715,-0.000461,-0.000122,0.000498,0.000285,0.000105,-1.7e-05,-0.001972,-0.001273,-0.000206,-0.000384,-9.7e-05,0.000214,0.000331,0.000251,0.00029,-8e-06,6.4e-05
0.000178,5e-05,6.2e-05,0.000112,0.00011,-8.2e-05,7e-06,5.9e-05,0.000158,0.000413,0.000204,-1.2e-05,-9.2e-05,3.7e-05,5.8e-05,0.000359,0.000279,0.000252,7.4e-05,7.3e-05,0.00032,-0.000146,0.000538,0.001264,0.000864,-0.00037,0.00537,0.009497,0.007437,0.003101,0.001243,0.005383,0.00274,0.001011,0.000532,0.00135,-0.000115,0.000215,-0.016643,-0.013244,0.001247,-4.9e-05,-0.001022,0.000724,-0.002379,5.9e-05,-0.002349,-0.001379,-0.000626,-0.002881,-0.003553,-0.005469,-0.002771,-0.000614,-0.007414,-0.000505,-0.001011,-0.001458,-0.001693,-0.001999,-0.003511,-0.003903,0.002244,0.001901,0.000406,-7.8e-05,0.001307,-0.005844,-0.004144,-0.001105,0.002398,2e-05,-0.002535,-0.00101,-0.001008,-0.000724,-0.00025,-0.000901,0.000138,0.000303,-0.002076,-0.001236,-0.000332,-0.000213,-2e-06,0.000141,0.000171,0.000284,-0.001665,-0.001613,-0.000698,2.5e-05,2.5e-05,0.000849,2.7e-05,0.000218,0.000508,0.00064,-0.000506,0.001573,0.000563,0.001406,0.001363,0.000726,0.000322,0.000136,0.000265,0.000303,0.00023,0.000127,0.001346,0.001057,0.000498,0.000302,0.000241,-9.5e-05,7.4e-05,0.000131,0.00018,5.6e-05,-0.000338
-1.2e-05,0.000234,0.000259,9.8e-05,0.000353,0.000106,1e-06,4.7e-05,0.000324,0.000166,-5e-06,0.000172,0.000109,0.000193,8e-06,0.000304,0.000165,0.00018,7.8e-05,1e-04,1.2e-05,0.000106,-0.000274,-0.001028,-0.000478,-0.00043,-0.001014,-0.004,-0.00611,-0.001071,-0.000107,-0.002495,-0.001739,0.000416,-0.000962,-0.000688,-0.000964,-0.000554,-0.000717,-0.004056,-0.005645,0.000638,-0.000565,-0.003967,0.001648,-0.001985,-0.002849,0.001259,-0.004935,-0.001541,-0.002327,-0.002773,-0.007544,-0.001513,0.004183,0.002207,0.001315,-0.001378,-0.002287,-7.5e-05,-0.000425,0.001015,-0.006021,-0.006521,-0.000123,-0.000293,-0.003726,-0.000558,0.002176,-0.003463,-0.005855,-0.003145,-0.00301,-0.001336,-0.00045,0.000491,-3.3e-05,-0.000129,-0.001124,-0.000334,-0.001262,-0.001528,-0.001088,-0.000759,-0.000259,0.000138,-0.000217,1.9e-05,-0.001003,-0.001776,-0.001092,-0.000257,-0.000362,-0.002762,-0.000797,-0.000485,-0.000327,-0.000554,0.00018,-0.000745,-0.000363,-0.000216,0.000269,0.000112,-1.3e-05,-0.000122,4.1e-05,5.7e-05,7.5e-05,-5.3e-05,-0.000698,-0.000458,-8.7e-05,-0.000117,0.000137,0.000256,0.000299,0.000198,0.000235,0.00031,0.000134
-0.000179,-0.000306,-0.000191,-1e-04,-9e-05,-0.000161,-0.000114,-0.000218,-2e-05,-5.8e-05,4.1e-05,-3.3e-05,-0.000295,-0.000131,-0.000114,0.000105,-0.000115,-4.2e-05,4.7e-05,-6.3e-05,-0.000128,-0.000102,0.000638,0.000622,0.000758,-7e-06,-0.002555,-0.004262,0.000148,0.000907,0.000292,0.002059,0.001233,0.000489,0.000431,0.001598,-0.000251,-0.001082,-0.00183,-0.000326,-0.006033,-0.005883,-0.001938,-0.000109,-0.00259,0.002412,-0.001723,-0.003472,-0.003158,0.001817,0.002475,0.000822,0.005186,0.001567,0.002082,0.003512,0.000267,9.8e-05,0.002615,-8.3e-05,-0.001723,-0.000433,0.004684,0.002932,0.002221,-0.004337,0.00194,0.001202,0.00262,0.002663,0.001756,0.000253,0.002195,0.002728,0.000698,-0.000143,-0.000229,-0.001168,0.000368,-0.000443,-0.000347,0.000212,-0.000378,0.000223,-2.4e-05,-0.000126,9.1e-05,-2e-04,-0.000597,0.000802,0.000227,0.000113,-0.000232,-0.001021,-0.00094,-0.001524,-0.000791,-0.000305,-0.000546,-0.000128,9.8e-05,0.000231,0.000519,0.000133,5.7e-05,4.9e-05,8.9e-05,-1.2e-05,5.2e-05,-0.000246,0.000393,0.000199,3.2e-05,3.4e-05,6.7e-05,-0.000249,-0.000211,-0.000121,4.1e-05,-0.000215,-7.2e-05
1e-06,-1.1e-05,9.3e-05,0.000119,0.000307,7.4e-05,1.1e-05,3.3e-05,0.000168,-8.7e-05,-3.1e-05,5e-05,-7.1e-05,-3.6e-05,3e-06,-8.9e-05,-6.8e-05,0.000131,-1.9e-05,-0.000139,-0.000166,-8.6e-05,-0.000253,1.9e-05,-0.000158,0.000297,0.001814,0.003387,-0.00158,-0.001107,-0.000808,-0.001378,-0.00159,-0.00169,-0.002516,-0.001345,-0.000822,-0.000821,-0.001031,-0.000115,0.001747,0.00085,-0.00294,0.004201,0.00448,-0.004649,-0.006057,-0.005832,-0.001727,-0.000134,-0.005828,0.000148,-0.001594,-0.003137,-0.001205,-0.003833,0.004829,0.00373,-0.001774,-0.000132,0.000933,0.001518,0.002315,-0.001317,-0.004147,0.003067,-0.001215,-0.002166,-0.002237,0.000608,-0.002231,-0.000134,0.000712,-0.000183,0.000855,0.000788,0.000347,0.000902,0.000845,0.000318,-2.5e-05,-0.000548,0.000101,-0.00029,0.000386,0.000138,-0.000252,0.000114,-9e-05,0.000563,9.5e-05,8.5e-05,6e-06,0.000456,0.000871,0.000637,-2.2e-05,6e-06,-0.000152,-0.000784,7.9e-05,-0.000185,-0.001066,-0.000413,-4.1e-05,-0.000108,3.3e-05,-5.6e-05,6.7e-05,-8e-06,-0.000144,0.000235,-3e-06,-3.7e-05,5.1e-05,-0.000183,-1e-04,-6.1e-05,-7e-06,1.7e-05,9.7e-05
-0.000226,-3e-04,-9.2e-05,-0.000136,-4e-06,-5e-05,7e-06,-0.000128,3.4e-05,-0.000135,-6.9e-05,6.5e-05,0.000105,0.000188,-3.1e-05,-1.8e-05,-0.000152,-1.6e-05,-1.8e-05,-0.000107,-0.00011,7.6e-05,-8.2e-05,-0.000163,-4.6e-05,0.000173,-0.000521,-0.000829,0.00097,0.002056,0.001021,0.000284,0.000839,0.000208,0.001095,0.000227,0.000147,0.000544,-0.000435,0.011789,0.002405,-0.001728,0.004796,0.003895,-0.001097,-0.001015,-0.003507,-0.000828,0.002019,0.000687,-0.000426,-0.000948,0.001711,0.000899,0.004085,0.002549,-0.004014,-0.000658,0.003203,0.002544,0.004628,0.00063,-0.001751,0.000464,-0.000666,-0.003478,0.0022,0.003222,-0.000623,-0.001463,0.001574,-0.000393,0.000329,0.001242,-0.000101,-0.00133,-0.001425,0.00015,-0.000101,3e-05,0.000836,0.001141,0.000414,0.000178,0.000224,-8.3e-05,0.000231,-8.8e-05,-0.000381,-0.000171,-7e-05,-0.000108,7.2e-05,-0.000947,-0.00246,-0.001443,-0.001081,-0.000204,0.000143,-0.000117,-0.000169,-0.000333,0.000537,0.000446,7.3e-05,-7.2e-05,-9e-06,-0.000135,4.4e-05,-0.000102,-5.3e-05,-7.1e-05,-6.3e-05,-2.7e-05,6.7e-05,-1e-06,4.6e-05,-2.2e-05,-7.9e-05,-2.4e-05,-5.2e-05
-0.000149,-7.3e-05,-0.000166,-0.000181,-1e-05,-0.000102,-0.000101,-3.2e-05,-9.3e-05,-7.1e-05,-0.000122,-0.000154,-0.000136,-0.000282,-0.000247,-0.000142,-0.000208,-5.9e-05,-0.000186,-0.000156,-1.1e-05,-1.3e-05,-0.000139,-0.000173,4.6e-05,-8.2e-05,-0.000455,0.000481,0.000208,-0.000563,-0.001441,-0.000352,-0.000592,0.000431,0.000279,-0.000419,5.9e-05,0.000663,-0.000888,-0.000562,-0.003912,-0.0057,-0.005124,-0.002624,0.000568,0.002823,0.002575,-0.00034,0.001318,-0.001016,0.001526,-0.001607,0.001199,-0.00269,0.002079,0.002058,-9.3e-05,-0.001868,-0.000176,0.002147,-0.003707,0.001252,0.000798,0.000871,-0.000365,-0.001758,0.00149,-0.00163,0.002123,0.001897,4.9e-05,0.002386,0.000435,-4.1e-05,-0.000853,0.001054,0.000772,-0.000258,-0.000186,-0.000217,0.000464,0.00039,4.1e-05,0.000237,0.000261,-7.6e-05,0.000135,0.000146,-9.2e-05,-0.000551,-0.001083,-0.000686,-3.6e-05,0.001013,0.00101,0.000737,-0.000696,1.8e-05,-7.6e-05,-0.000102,-0.000536,-0.000101,-0.000529,-0.00045,-0.000318,-8e-05,4.7e-05,-0.000203,-0.000174,4.7e-05,6e-06,1.5e-05,-2.2e-05,-0.000151,-3.4e-05,-3.3e-05,-0.000243,-0.000193,-0.000202,-0.00016,-0.000143
-7.3e-05,-8.5e-05,-2e-05,-9.3e-05,-1e-05,-1.8e-05,2e-06,1.5e-05,-5e-06,-4.4e-05,-0.000107,-0.00012,-4.6e-05,5e-06,7e-06,-0.000112,-0.000192,-0.000111,-0.000163,-0.000109,-7.2e-05,0.000149,-7.3e-05,-0.000109,-2.9e-05,3e-05,0.00024,0.000241,-0.000772,0.000651,0.000203,0.000613,0.000234,9e-05,-2e-05,1.8e-05,-0.000489,-6.3e-05,0.000127,-0.001605,0.000281,-2.1e-05,0.003096,-7.5e-05,-0.001897,-0.003244,-0.00114,-0.00077,-0.000391,0.001299,-0.000339,-5.3e-05,-0.001054,-0.002211,-0.002057,-0.002362,0.000467,-0.001306,-0.001484,-0.002499,0.000617,-0.001212,-0.000728,0.000111,0.000103,0.001362,-0.001654,0.000545,-0.001094,-0.001686,-0.001567,-0.000456,-0.001171,-1e-06,0.000521,-0.000861,-0.000523,0.000438,-0.000378,-0.000213,0.000493,-8e-06,0.000304,0.000116,-0.000169,-0.00017,5e-06,-4.2e-05,-0.000126,-0.000278,-0.000632,-0.000187,2.1e-05,-0.000218,-0.000161,0.000285,-5.5e-05,-0.000202,-0.000289,0.000209,-1.3e-05,-0.000136,-1.3e-05,-0.000128,-4.9e-05,-3.7e-05,-0.000112,-0.000198,-3.3e-05,3.5e-05,-4.6e-05,-8.1e-05,-0.000102,-0.00012,-0.000111,-3.9e-05,-9.4e-05,-1.2e-05,-0.000139,-9.5e-05,-9e-06
-0.000107,1.8e-05,-7.1e-05,-0.000143,-6.9e-05,-0.000129,-0.000171,1.5e-05,-8.3e-05,-7.6e-05,-5.3e-05,-8.9e-05,-6e-05,-7.7e-05,-5.5e-05,1e-05,-0.00016,-8.4e-05,-7.9e-05,2.3e-05,2e-06,3.2e-05,-5e-05,-4e-05,-6.6e-05,-0.000182,-9.7e-05,-0.000512,0.00114,-0.001592,-0.000721,-9e-06,-0.000203,8e-06,-0.000358,-0.000457,0.000389,0.000113,-4e-06,2e-06,-0.0063,-0.000459,-0.003821,-0.00077,-0.002071,0.003057,-0.000734,0.001412,0.002334,0.000842,0.000218,0.002746,-0.000602,-0.000172,0.001703,0.001301,0.000128,0.001978,-0.001179,-0.002262,-0.001287,-0.001133,-0.000643,0.000587,0.001079,0.000164,0.000678,-0.001383,-0.000158,-0.000459,0.000363,0.000664,0.000679,-0.001191,-0.001049,-0.000372,0.000454,0.000629,-0.000148,0.000127,-0.000344,-0.000199,-0.000181,-0.000284,-0.000135,4e-05,8.4e-05,9.5e-05,0.000161,-0.000323,0.000588,0.000144,0.000208,1.6e-05,0.00114,0.000294,7.3e-05,0.000171,-0.000339,-3.5e-05,-0.000352,-5.4e-05,-4e-05,-8e-05,-2e-05,4e-05,-6e-06,-3.5e-05,-6.5e-05,2e-06,6.8e-05,3e-05,-4.3e-05,3.3e-05,9e-06,-2.4e-05,-0.000108,-5.6e-05,1.6e-05,-0.000107,-6.7e-05
5.3e-05,1.6e-05,5.1e-05,3.1e-05,-3e-05,5e-06,-3.3e-05,2.9e-05,-2e-06,-9.2e-05,5.1e-05,-7.9e-05,-1.5e-05,1.7e-05,-4.1e-05,-5.6e-05,-8e-05,-3.1e-05,-4e-05,-2.4e-05,8.1e-05,6.2e-05,-1.2e-05,-8.8e-05,-4e-05,2.2e-05,-0.000152,0.000424,-0.001012,0.000542,0.000399,-0.00026,0.000575,8.7e-05,0.000354,0.000119,-0.000169,-3.5e-05,0.000262,-0.001009,-0.00046,0.002854,0.000739,-0.002095,-0.000762,-0.004186,0.002342,-0.000387,-6.6e-05,-0.001113,-0.000312,0.001163,-0.001293,0.002795,-0.003343,0.001059,-0.000409,-0.00136,-0.00031,0.001041,0.001719,0.00093,-0.001167,-0.001837,-0.000624,-0.000215,-0.002392,0.000251,-0.001253,0.00028,-0.00024,-0.000691,-0.000584,0.000183,0.000333,0.00013,-0.000454,8.8e-05,-0.000173,-0.000608,0.000581,-0.000148,9e-05,1e-05,0.000118,-0.000169,6.2e-05,2e-05,0.000218,-6.7e-05,0.000161,-6.4e-05,0.000304,-4e-06,0.000398,8e-05,0.000839,3.5e-05,0.000135,-0.000208,0.000129,-0.000146,-7.7e-05,-4.5e-05,2e-05,-4e-05,-4.1e-05,2.1e-05,-9.6e-05,3.7e-05,6.2e-05,-1e-05,8.2e-05,4.2e-05,-5.2e-05,3e-06,-3.8e-05,-2e-06,-9.4e-05,-7.5e-05,1.6e-05
-5.5e-05,-5.7e-05,7e-06,-1.2e-05,-3.5e-05,-3.2e-05,1.7e-05,-1.3e-05,-2e-06,-2.8e-05,-1.3e-05,-3.7e-05,-1e-06,9.2e-05,-1.6e-05,-2.6e-05,2.6e-05,-6.7e-05,-3.7e-05,-6.2e-05,3.4e-05,-4.1e-05,2.3e-05,-3.4e-05,-8.8e-05,-0.000234,-0.000166,-0.00113,-0.00053,-0.001273,-0.000634,-0.000321,-0.000329,-0.00075,-0.000437,0.000256,0.000607,-2.6e-05,-0.000197,-0.001282,0.006079,-0.000418,0.002195,0.000478,0.001839,0.001955,0.000288,-0.000232,-8.4e-05,0.000473,0.000533,0.00134,0.000518,-0.000149,0.001316,0.000224,0.000256,0.001821,0.000536,-0.001343,-0.000202,-0.001959,0.000626,0.000273,0.001138,-0.000816,0.000176,0.000257,0.00042,0.000144,0.000399,-0.00138,0.000335,-0.000177,-3e-06,0.000218,4.6e-05,-0.000306,-0.000164,0.000118,-0.000413,-0.000148,-0.000363,-0.000246,-8.8e-05,-1.2e-05,-7e-05,8e-06,-5.5e-05,-4.1e-05,-0.000309,2.7e-05,0.000176,-0.000123,0.000189,-4.1e-05,-0.000182,0.000136,0.00033,0.00014,-7.4e-05,-0.000215,5e-05,-0.000163,0.000125,2.3e-05,1e-06,-2.1e-05,-4.1e-05,0.000104,2.7e-05,-2.1e-05,-0.000263,-6.6e-05,-1.5e-05,-4.3e-05,3.3e-05,-3.7e-05,1e-05,-2.4e-05,3e-05
1.4e-05,3.4e-05,3.9e-05,-1e-06,-1.3e-05,-1e-05,-1.6e-05,-1.2e-05,2.4e-05,2.7e-05,1.7e-05,-4.6e-05,1.4e-05,5.7e-05,-1.9e-05,-1e-05,1.5e-05,-4.5e-05,-4.8e-05,1.1e-05,3.3e-05,-1.1e-05,-1.4e-05,1.7e-05,-1.1e-05,-1.5e-05,0.000216,0.000678,0.000569,0.000639,0.00011,0.000304,-5.5e-05,0.00062,0.000255,0.000115,-0.000493,-0.000155,0.000305,-0.001844,-0.001222,-0.000874,3.5e-05,-0.000222,-0.000822,0.000109,-0.00224,-0.000508,-0.001776,-0.000161,-0.000138,0.000237,0.001121,-0.000525,-0.001169,0.000415,0.000292,-0.002235,-0.000675,0.000163,-0.000224,0.001667,-0.000204,-0.000466,-0.00191,0.000509,0.000544,2e-06,-4.4e-05,-0.000599,-9.3e-05,-9.9e-05,-3e-04,0.000134,0.000209,-0.000227,0.000333,-0.000159,1.4e-05,0.000119,0.00015,-2e-06,0.000167,0.000241,-3.8e-05,2.1e-05,9e-06,-9e-06,0.000162,2.3e-05,-1.5e-05,1.7e-05,-9.7e-05,2.5e-05,-0.000338,-0.000127,-0.000321,-0.000317,0.000119,-7.4e-05,0.000334,0.000139,-0.000142,5.1e-05,-4.7e-05,1.7e-05,-1.6e-05,4e-06,-3e-05,5.5e-05,3.7e-05,2.7e-05,0.000109,6.5e-05,-4.9e-05,4.1e-05,3.8e-05,-1.4e-05,5e-06,-6e-06,-2e-06
-5e-06,-1e-06,-3e-06,3e-05,-1e-06,-2.6e-05,2.4e-05,4.7e-05,3e-06,-1.8e-05,-3.6e-05,5e-06,-1.1e-05,1.4e-05,-1e-05,-1.6e-05,-3e-05,-1e-06,-1.5e-05,1.2e-05,4.5e-05,-2e-06,3e-06,-5.7e-05,6.1e-05,-1.7e-05,-0.000143,4.7e-05,-0.000241,-0.00055,-0.000157,-0.000606,-9.1e-05,-0.000895,-0.000115,-2.1e-05,0.000745,-0.000108,-0.000435,0.000427,-0.00176,-0.00129,-0.00141,-0.000503,0.000545,0.000437,0.000272,0.000757,-0.000551,0.000525,-0.000587,-0.002203,-0.000175,0.000159,-0.000501,0.000896,-0.001251,0.001886,-0.000187,0.00028,0.000911,-0.000467,8.7e-05,-0.000947,0.000214,-2.4e-05,-0.00103,0.00011,0.001142,-0.000296,8.9e-05,0.000568,0.000404,-8.3e-05,-0.000313,7.2e-05,-0.000343,0.000114,0.000133,-0.000268,-0.000428,-0.000129,3.3e-05,-0.000162,-5.8e-05,4.1e-05,-2.5e-05,1e-05,-1.4e-05,4.9e-05,6.7e-05,7.3e-05,4.3e-05,-4.6e-05,-5.9e-05,-0.000103,-1.7e-05,-1e-05,7.5e-05,7.6e-05,-2.4e-05,-0.000173,4.9e-05,5.3e-05,6.1e-05,7e-06,1.4e-05,-5.6e-05,2.9e-05,4.2e-05,-7.3e-05,-1.6e-05,-6.8e-05,-6.8e-05,-6.5e-05,-1.7e-05,7e-06,1.4e-05,-3.7e-05,3.3e-05,0
-8e-06,1.7e-05,1.6e-05,-3e-06,-2.5e-05,-4e-06,-9e-06,2.7e-05,3.2e-05,1.6e-05,9e-06,3e-06,-2e-06,-1.6e-05,3.4e-05,1.4e-05,-1.3e-05,3e-06,-2e-05,4.4e-05,-7e-06,-3.1e-05,1.5e-05,-9e-06,-2.7e-05,-6.5e-05,1.5e-05,-0.000354,0.000131,2.6e-05,-6.1e-05,0.000211,4.1e-05,0.000557,0.000118,0.000122,-0.000127,-8.8e-05,3e-06,-0.00017,0.002052,-0.00027,-0.000793,-0.000285,0.000115,0.000686,0.000723,-0.000147,-0.000934,0.000633,-0.000409,0.000512,-3.1e-05,-0.000162,-0.001209,-0.000629,0.000124,-3.9e-05,-0.00037,0.000343,-0.00086,0.000264,0.000391,0.000512,-0.000754,-0.000416,0.000165,-0.000295,-0.000222,0.000381,1.3e-05,-9.4e-05,-9.6e-05,-0.000224,8.2e-05,-0.000136,0.000117,-0.000117,3.6e-05,6.4e-05,6.7e-05,9e-05,-5.8e-05,0.000194,-3e-05,-7.7e-05,-3.4e-05,-1.7e-05,7.8e-05,5.2e-05,-6.6e-05,0.000111,2.3e-05,-9.7e-05,0.000207,-0.000118,-8.5e-05,-0.000133,5.2e-05,0.000119,-0.000113,0.000172,-4.8e-05,5.1e-05,-1.3e-05,-3.2e-05,3e-06,-2.4e-05,5.2e-05,3.2e-05,-4.2e-05,6e-06,6e-05,1.4e-05,1.7e-05,-4e-06,-8e-06,7e-06,1.3e-05,2.3e-05,1.5e-05
2.3e-05,0,2e-06,8e-06,1e-05,-9e-06,1.3e-05,2.1e-05,-3e-06,-6e-06,1e-05,2.9e-05,7e-06,1.9e-05,6e-06,-1.2e-05,-3.4e-05,1.9e-05,-1e-05,5e-06,2e-06,4e-06,-9e-06,1.8e-05,-1.2e-05,-1.7e-05,8e-06,-0.000119,3e-05,0.00058,-3.2e-05,-7.8e-05,0.000141,-0.000356,-0.000106,-0.000149,-0.00015,-9.5e-05,7.5e-05,0.000214,0.001087,0.000781,0.001996,-0.000479,-0.000272,-0.000371,0.000525,-0.000374,-0.000538,-0.000434,0.000336,-0.000208,0.000225,-0.000177,0.000686,0.000267,-0.000117,-0.000602,0.000205,-0.000308,0.000214,-0.000332,-0.000801,-0.000489,0.000511,-4.6e-05,0.000113,4.3e-05,0.000534,-3.2e-05,0.000175,-0.000625,-0.000169,0.000188,-5e-05,0.000277,0.000253,-0.000105,0.000112,-6.8e-05,-8e-05,3.4e-05,-3.1e-05,-4.4e-05,-7.2e-05,-4.1e-05,1.2e-05,2e-05,1.3e-05,5.4e-05,-2.2e-05,-0.000293,3e-05,5.1e-05,4.7e-05,0,-1.7e-05,0.000186,-8e-06,0,3.2e-05,-3.3e-05,-2.9e-05,-2.8e-05,5.5e-05,3.2e-05,8e-06,-2e-05,1.3e-05,3.9e-05,4e-06,1.9e-05,-3.9e-05,1e-05,3.5e-05,8e-06,5e-06,2.7e-05,-1.3e-05,-1.4e-05,1.5e-05
3e-06,-1.3e-05,3e-06,-9e-06,1.3e-05,-7e-06,-7e-06,9e-06,0,-1.6e-05,-1e-05,-1.3e-05,-4e-06,-8e-06,1e-06,5e-06,-2e-05,9e-06,-2e-06,1e-05,2.8e-05,-1.2e-05,5e-06,-5e-06,8e-06,-2.7e-05,4e-05,0.000264,-4.9e-05,2.2e-05,0.000167,-0.000109,-0.000125,0.000123,0.000109,-0.000138,-3.8e-05,-7.8e-05,-4.1e-05,0.000674,-0.001869,0.00145,-0.00113,0.000535,0.000199,-0.000271,0.000221,0.000367,0.00021,-0.000455,0.000351,0.000549,-0.000163,-0.000188,0.000738,-0.000756,-0.000234,0.000354,0.000278,5e-05,-0.000288,-1.3e-05,6e-05,-0.000204,0.00027,0.000191,0.000246,-0.000526,-0.000756,0.000321,1e-06,-0.000158,-3.6e-05,7.1e-05,7.5e-05,4.9e-05,-0.000219,-6.1e-05,-3.8e-05,1e-04,2.9e-05,3.7e-05,-1e-06,-0.000105,5.2e-05,-5.5e-05,-6.6e-05,-1.9e-05,7e-06,-2.5e-05,0.000112,3.1e-05,-0.000117,6e-06,5.3e-05,-4.1e-05,-2.3e-05,-0.000116,4.4e-05,-5.8e-05,-8e-05,4.4e-05,4.7e-05,-2.6e-05,2.1e-05,-3.1e-05,-3e-06,1.2e-05,-6e-06,2.5e-05,-1.6e-05,-1e-05,2e-05,0,1.9e-05,1.1e-05,5e-06,-1.4e-05,-3e-06,-5e-06,6e-06
-1.2e-05,-1.4e-05,1e-06,-1e-06,-1e-06,-1.3e-05,2e-06,0,-1.4e-05,9e-06,1e-05,-6e-06,-8e-06,6e-06,-1.6e-05,-4e-06,-1.8e-05,-5e-06,-4e-06,-1e-06,7e-06,0,-1.1e-05,-1.7e-05,-2.1e-05,3e-05,-8.5e-05,-1.6e-05,0.000162,-0.000216,7.6e-05,7.5e-05,8.4e-05,5.2e-05,-1.1e-05,7.8e-05,0.000131,1.2e-05,3.6e-05,0.000196,-0.000428,-0.00027,0.000181,-0.000126,0.000336,0.000693,-0.000491,0.00012,-0.000439,0.000188,-0.000128,-3e-04,0.000209,0.000387,0.000116,-0.000107,3e-05,-6.5e-05,-0.000341,-0.000507,-4e-05,3.7e-05,0.000434,0.000491,-0.000479,-7.7e-05,0.000326,0.000342,9e-06,0.000167,-5.6e-05,0.000151,6.5e-05,8.7e-05,-0.000135,-4.9e-05,0.000161,5e-05,-5.9e-05,5e-05,-8.6e-05,5.7e-05,4.7e-05,7.7e-05,5e-06,2.7e-05,-2.8e-05,-5e-06,1.1e-05,-1.2e-05,3.5e-05,6.8e-05,-3.2e-05,1e-06,-4e-05,-3e-05,0.000169,7.6e-05,-8.9e-05,-5.9e-05,-2.2e-05,-1.6e-05,-4.7e-05,-1.7e-05,2.7e-05,1.9e-05,1e-06,1.4e-05,-1.6e-05,3e-06,4e-06,5e-06,-1.9e-05,2e-06,-4e-06,4e-06,-5e-06,-5e-06,0,-1.1e-05,4e-06
2e-06,5e-06,8e-06,-9e-06,2e-06,-6e-06,-1.1e-05,-1e-06,-7e-06,-1e-06,1e-06,-2.1e-05,0,5e-06,-2e-06,-4e-06,-6e-06,-9e-06,-8e-06,-7e-06,-4e-06,1e-06,-3e-06,-1.3e-05,4e-06,-1e-06,6.2e-05,-8.4e-05,-2.3e-05,9e-06,-3e-05,-0.000102,2.6e-05,-7.1e-05,-9e-06,3.2e-05,-5.7e-05,-3.5e-05,-2.4e-05,0.000446,0.000387,-0.000335,0.000394,-0.00021,-0.000267,-0.000476,-0.000342,0.00012,-4.8e-05,-0.000196,4.3e-05,-0.000346,-0.000267,5.1e-05,-7.9e-05,9.2e-05,0.000261,4.2e-05,0.000167,0.000349,0.000177,0.000441,-0.000446,-8.5e-05,0.000284,-0.000152,-0.000303,-0.000154,9.2e-05,-0.00025,1.3e-05,0.00025,6.1e-05,5.5e-05,7e-05,-6.3e-05,3.3e-05,-0.000117,-3.9e-05,-7e-06,-5.8e-05,9e-06,-3.5e-05,-5.5e-05,1.9e-05,-1.2e-05,-1.1e-05,-4e-06,2.7e-05,-1.2e-05,-8.2e-05,0,-4.6e-05,2.8e-05,-0.000107,-2e-05,-0.000101,-6e-06,2e-06,4.5e-05,4.7e-05,-2.6e-05,3e-05,-3.7e-05,1.1e-05,-1e-05,-3e-06,-7e-06,-1.1e-05,3e-06,-1.2e-05,3e-06,-4e-06,3e-06,-6e-06,-1.2e-05,-6e-06,-6e-06,-5e-06,-4e-06,2e-06
-2e-06,1e-06,4e-06,8e-06,1e-06,-6e-06,-3e-06,8e-06,3e-06,-7e-06,-5e-06,-9e-06,3e-06,9e-06,-1.5e-05,4e-06,-5e-06,-8e-06,-1.2e-05,1.4e-05,-1e-06,7e-06,5e-06,-5e-06,1.3e-05,1.1e-05,-8e-06,-1.9e-05,-0.000115,-4.9e-05,-0.000148,4.8e-05,-7.1e-05,6.1e-05,2.8e-05,4.6e-05,7.4e-05,2.1e-05,5.5e-05,-0.000116,-0.000143,-0.000446,-0.000578,1.9e-05,8.5e-05,0.000707,0.000435,-0.000512,8.3e-05,-2.2e-05,-0.000272,9.6e-05,1.1e-05,-0.000175,0.000283,-0.000153,-0.000272,-0.000568,-5.3e-05,7.9e-05,-0.000272,-0.000371,0.000267,0.000145,-0.000493,4.4e-05,4.9e-05,-2.8e-05,-2.7e-05,0.000283,8e-05,-0.00014,-8.5e-05,-7.4e-05,-0.000188,7.9e-05,-0.000118,0.000129,-1.4e-05,8.5e-05,5.6e-05,-2.5e-05,2.3e-05,4.1e-05,3e-05,8e-06,2.6e-05,3e-06,1.6e-05,-1.2e-05,-1.2e-05,2.7e-05,-2.3e-05,-2.3e-05,-3.1e-05,-1e-06,-8.8e-05,-2.5e-05,3.9e-05,1.9e-05,5.4e-05,3e-06,-2.6e-05,6e-06,-1.8e-05,0,3e-06,-1e-05,-1e-05,0,-1.7e-05,-9e-06,-6e-06,-3e-06,-8e-06,-2e-06,1.2e-05,6e-06,6e-06,-1.4e-05,-3e-06
-3e-06,2e-06,2e-06,-2e-06,-9e-06,-5e-06,3e-06,1e-05,4e-06,-1e-06,1e-06,-1.1e-05,-1e-06,7e-06,1e-05,-4e-06,1e-06,-7e-06,-8e-06,1.4e-05,2e-06,2e-06,5e-06,-5e-06,-1.7e-05,4e-06,-1.5e-05,0.000107,0.000126,4.7e-05,7e-06,9e-06,-3.5e-05,-9.6e-05,-2.3e-05,2.1e-05,-7.2e-05,9e-06,-2.2e-05,-6e-05,0.000624,-0.000186,0.000542,0.000172,1.2e-05,-0.000762,-0.000215,0.000337,0.000254,0.000231,-5.5e-05,-0.000374,9.4e-05,-5.3e-05,-0.000233,-6e-05,-0.000223,0.000322,1.8e-05,-3.7e-05,0.000143,5.6e-05,1.6e-05,-9.2e-05,0.000208,0,6e-06,0.000133,9.2e-05,-0.000246,2.5e-05,-2.6e-05,6.1e-05,2.6e-05,0.000126,-5.1e-05,6.3e-05,-4e-06,-3.1e-05,-9.5e-05,3e-06,-1.7e-05,8e-06,-1.2e-05,3.4e-05,1e-06,2e-06,1e-06,1.1e-05,-4e-06,4e-05,1.8e-05,-3.1e-05,2.4e-05,3.2e-05,-1.9e-05,-5e-05,-1.5e-05,2.7e-05,-2e-06,-1.5e-05,-6e-06,-9e-06,-1.1e-05,3.3e-05,7e-06,-5e-06,-1.7e-05,2e-06,-1e-06,-4e-06,3e-06,-7e-06,0,-1.2e-05,7e-06,4e-06,0,-1e-05,0,5e-06
5e-06,-2e-06,-1e-06,3e-06,-6e-06,-6e-06,-2e-06,1e-06,5e-06,1e-06,-2e-06,2e-06,-3e-06,-7e-06,-3e-06,2e-06,-8e-06,-1e-06,-7e-06,6e-06,8e-06,3e-06,3e-06,-7e-06,1e-06,-6e-06,-1.5e-05,-2.8e-05,-7.5e-05,-5.7e-05,-5.6e-05,-4.8e-05,7.5e-05,0.000117,1.3e-05,-5.3e-05,6.4e-05,1.2e-05,-2e-05,-0.000173,-0.000277,-0.000148,-0.000551,-0.000331,-0.00013,0.000124,-9.2e-05,5.4e-05,0.000186,-4e-06,-1.3e-05,-5.5e-05,-1.7e-05,0.000161,0.000299,-0.000158,2.5e-05,1.6e-05,2e-06,3.9e-05,-0.000119,-4.4e-05,-0.000284,-0.000105,-5.1e-05,2.2e-05,-0.000144,-6e-06,1.5e-05,-8.8e-05,-1.9e-05,9.7e-05,-5.5e-05,1.4e-05,-7.6e-05,3e-05,-1.9e-05,2.1e-05,3.4e-05,-6.2e-05,1.7e-05,7e-06,3e-06,1.4e-05,3e-05,5e-06,9e-06,0,5e-06,1.2e-05,-1.7e-05,-4e-06,-1e-05,5e-06,4.9e-05,4e-06,4.2e-05,1.5e-05,5e-06,-2.2e-05,-4e-06,-1.1e-05,1.5e-05,-5e-06,-5e-06,-9e-06,3e-06,-1e-05,8e-06,-2e-06,-2e-06,-2e-06,1.4e-05,-3e-06,-1.4e-05,1e-06,3e-06,0,-2e-06,4e-06,3e-06
0,-6e-06,2e-06,3e-06,0,-5e-06,3e-06,0,5e-06,2e-06,0,2e-06,0,2e-06,0,-1e-06,-1.4e-05,1e-06,-4e-06,-2e-06,-5e-06,2e-06,-1e-06,-2e-06,3e-06,2e-06,3.4e-05,-9e-05,-4.6e-05,-0.00025,-3e-06,4.8e-05,2.6e-05,-0.000101,-2e-06,1e-06,-5e-05,8e-06,4.5e-05,-0.000195,-0.00035,0.000588,0.000394,-5.7e-05,-3.9e-05,0.000172,0.000237,2e-06,0.000148,-0.000142,0.000109,0.000297,0.000181,0.000152,-0.000456,-2.5e-05,-1.5e-05,-0.000186,-0.000231,6.4e-05,-5.5e-05,-0.000208,0.000246,2.1e-05,0.000152,-7.8e-05,8e-06,9.7e-05,3e-05,8.3e-05,-1.1e-05,-6e-06,6.3e-05,-4.2e-05,3.9e-05,-2.7e-05,7e-06,-1.9e-05,3.9e-05,2.3e-05,-1.6e-05,8e-06,-1.1e-05,-3e-05,-2.8e-05,-6e-06,-2e-06,-2e-06,6e-06,8e-06,-1.5e-05,-6.4e-05,-2e-06,-1.9e-05,1.8e-05,1.2e-05,3.6e-05,5e-06,-2.4e-05,-2.3e-05,-1.3e-05,4e-06,-1.6e-05,1.3e-05,1e-06,-2e-06,-2e-06,4e-06,2e-06,-1.1e-05,2e-06,0,-1.6e-05,-3e-06,1.2e-05,-2e-06,-4e-06,2e-06,4e-06,6e-06,4e-06
0,-4e-06,-2e-06,-2e-06,1e-06,-4e-06,-1e-06,-2e-06,-1e-06,0,3e-06,4e-06,1e-06,-9e-06,0,-3e-06,-1.3e-05,1e-06,-3e-06,0,-6e-06,2e-06,-1e-06,-1e-06,-8e-06,-1.1e-05,-2.3e-05,6.5e-05,2.7e-05,0.000242,-1.5e-05,-6.1e-05,-1.3e-05,0.000104,1.5e-05,3.5e-05,3e-06,3e-06,-1.2e-05,-0.000178,0.000661,0.00042,-0.000289,0.000133,3.3e-05,-0.000257,-8.6e-05,3.9e-05,6.6e-05,-7.1e-05,-1.3e-05,3e-06,-7.7e-05,-0.000138,-6.8e-05,1.5e-05,4.6e-05,0.000138,6.8e-05,-0.000183,-0.00011,0.000374,-6.5e-05,-0.00011,3.1e-05,-7.4e-05,-0.000149,-0.000247,6.1e-05,-0.000138,2.2e-05,2.6e-05,-6.8e-05,9e-06,-3.8e-05,-1.7e-05,3.8e-05,8.5e-05,1.6e-05,2.2e-05,4.2e-05,-2.7e-05,5e-06,3.5e-05,-3.5e-05,-1.3e-05,5e-06,-4e-06,1e-05,0,3.2e-05,-4e-06,-4e-06,1.7e-05,-4.7e-05,2e-06,-1.6e-05,8e-06,-2e-06,9e-06,-7e-06,6e-06,1.8e-05,1e-05,9e-06,6e-06,1e-06,5e-06,4e-06,-1.2e-05,7e-06,4e-06,1e-06,7e-06,4e-06,-1e-06,-1e-06,-2e-06,-6e-06,-2e-06,4e-06
0,1e-06,1e-06,-2e-06,0,-4e-06,2e-06,1e-06,-3e-06,-1e-06,-3e-06,-1e-06,-1e-06,3e-06,0,3e-06,-6e-06,2e-06,-3e-06,3e-06,5e-06,2e-06,-5e-06,-8e-06,8e-06,4e-06,-5e-06,1.3e-05,-1.7e-05,-3.2e-05,9e-06,1.8e-05,-4.5e-05,-0.00014,-2.8e-05,-5.4e-05,0,3e-06,-3.2e-05,-6.3e-05,0.000231,-0.000326,0.000409,-2.8e-05,7e-06,0.00034,-3.7e-05,-0.000179,0.000106,8.6e-05,0.000149,7.6e-05,-7e-06,-3e-05,-0.000166,-6e-06,8e-05,7.4e-05,-1.4e-05,6.4e-05,-8.2e-05,-0.000199,-0.000127,-1.4e-05,-9.8e-05,0.000115,0,0.000162,6.1e-05,0.000112,4.8e-05,0.000162,4.8e-05,-6.6e-05,8.2e-05,6.5e-05,-4e-06,-4.4e-05,1.3e-05,4e-05,-9e-06,6e-06,1.3e-05,-1.4e-05,-1.6e-05,3e-06,1.6e-05,8e-06,0,4e-06,1.2e-05,3.2e-05,-8e-06,0,-5.4e-05,-8e-06,2.8e-05,-1.8e-05,-1.8e-05,1.9e-05,-2.6e-05,-9e-06,-9e-06,-3e-06,1e-05,-5e-06,0,6e-06,2e-06,-5e-06,0,-4e-06,-3e-06,0,4e-06,0,-1e-06,2e-06,6e-06,-2e-06,2e-06
-1e-06,2e-06,0,0,3e-06,-4e-06,-3e-06,1e-06,-3e-06,-1e-06,3e-06,-2e-06,-2e-06,-1e-06,-4e-06,-4e-06,-6e-06,0,-3e-06,8e-06,1e-06,0,-2e-06,-3e-06,3e-06,-8e-06,1.2e-05,-3.5e-05,5.2e-05,6.3e-05,2.9e-05,1.4e-05,-8e-06,9.9e-05,2.7e-05,-5e-06,1.9e-05,3e-06,2.5e-05,6.5e-05,-0.000876,-0.000368,-0.000251,-0.000131,8.5e-05,-0.000266,-3.1e-05,0.000182,-3.5e-05,9e-06,-0.000127,-0.000185,5.3e-05,7.2e-05,0.000101,2.8e-05,2.8e-05,-6e-05,-3.7e-05,-2.6e-05,0.000126,0.000118,0.000189,-9.1e-05,-1e-06,-7.3e-05,1e-04,-0.000135,-0.000105,2.3e-05,-1.6e-05,-8.3e-05,-3.9e-05,-7e-06,-7.5e-05,4e-06,2.3e-05,-3e-06,-9e-06,-2.5e-05,1.3e-05,1.1e-05,-1.9e-05,1.1e-05,1e-05,-1.2e-05,-3e-06,-3e-06,1e-06,2e-06,-3e-05,-7e-06,9e-06,-1.3e-05,-9e-06,1e-06,-4.4e-05,6e-06,-1.8e-05,4e-06,1.3e-05,1.3e-05,-1e-06,-1.7e-05,1e-06,2e-06,2e-06,-5e-06,-1e-06,-6e-06,-1e-06,0,6e-06,-2e-06,-7e-06,4e-06,3e-06,-1e-06,-5e-06,-2e-06,1e-06
0,-3e-06,1e-06,-1e-06,5e-06,-5e-06,0,1e-06,-4e-06,-1e-06,-2e-06,-4e-06,0,2e-06,1e-06,3e-06,-5e-06,0,-4e-06,3e-06,-5e-06,0,2e-06,-2e-06,-8e-06,2e-06,0,-9e-06,-2.2e-05,-6.1e-05,-5.9e-05,-3.5e-05,4.1e-05,-7.5e-05,-8e-06,3.3e-05,-1.1e-05,-4e-06,9e-06,9e-06,-1.4e-05,-2.2e-05,-0.000254,0.000147,2.2e-05,-9.2e-05,-1.9e-05,-6.2e-05,-7.3e-05,2.4e-05,-6.9e-05,4e-06,-0.000118,7e-06,8.4e-05,5.2e-05,-0.000169,0.000137,3.3e-05,5e-06,-0.000105,-8.8e-05,-8.1e-05,-2.5e-05,-0.00013,6e-06,-1.8e-05,5.6e-05,3.6e-05,-8.1e-05,-1.1e-05,-8.6e-05,3.5e-05,2.7e-05,3.8e-05,-2.8e-05,-2.1e-05,2.9e-05,-1.9e-05,-2.7e-05,-2.2e-05,-1.7e-05,2e-05,-7e-06,-2.1e-05,1e-06,0,-1e-06,-1e-06,-5e-06,-4e-06,2.3e-05,1.7e-05,1.3e-05,3.5e-05,7e-06,-2.8e-05,-8e-06,-1.1e-05,-1.3e-05,2.4e-05,-8e-06,1e-06,-1.1e-05,-7e-06,-3e-06,-2e-06,-9e-06,-2e-06,-1.2e-05,-1e-06,0,-1e-06,0,2e-06,-2e-06,-3e-06,0,2e-06,-5e-06,0
1e-06,-1e-06,0,0,-2e-06,-2e-06,-3e-06,-1e-06,2e-06,3e-06,-1e-06,-2e-06,0,1e-06,0,-2e-06,-3e-06,-1e-06,-3e-06,3e-06,-1e-06,-1e-06,1e-06,-7e-06,3e-06,-3e-06,-1.3e-05,6.5e-05,-4.7e-05,7.6e-05,1e-05,2.6e-05,-3.5e-05,4e-05,-4e-06,3e-06,-9e-06,-6e-06,-1.5e-05,0.000145,0.000645,7e-05,0.000514,7.8e-05,4.6e-05,0.000338,0.000101,4.8e-05,-7.7e-05,5.3e-05,-7.9e-05,6.1e-05,6.2e-05,-0.000128,6.1e-05,4.6e-05,-9e-06,-0.000195,1.4e-05,9.5e-05,7.4e-05,1e-06,-4.5e-05,0.000128,0.000109,-9e-05,3.8e-05,3e-06,-0.000177,0.000134,-1e-06,2e-05,-2.5e-05,1.8e-05,-2.1e-05,1.2e-05,2e-06,9e-06,-2.6e-05,3e-06,2.1e-05,2e-06,-1.2e-05,-6e-06,3e-06,-6e-06,-5e-06,-2e-06,-2e-06,-3e-06,2.2e-05,-1e-06,1.2e-05,-4e-06,2.3e-05,-1e-06,-1.4e-05,1.2e-05,-7e-06,-1.7e-05,1e-06,0,-1e-05,-2e-06,-3e-06,4e-06,1e-06,-6e-06,-5e-06,-9e-06,-2e-06,-2e-06,3e-06,-2e-06,2e-06,-2e-06,3e-06,-1e-06,0,-2e-06,1e-06
-1e-06,-4e-06,-1e-06,2e-06,-2e-06,-4e-06,-1e-06,-2e-06,1e-06,0,1e-06,-4e-06,-1e-06,-1e-06,-1e-06,0,-4e-06,-1e-06,-3e-06,-3e-06,0,-1e-06,2e-06,-5e-06,-1e-06,1e-06,8e-06,-3.7e-05,3.9e-05,-5.9e-05,-2.5e-05,-2.8e-05,1.3e-05,2.3e-05,5e-06,8e-06,6e-06,-8e-06,3e-06,8.4e-05,-0.000237,0.000142,-0.000404,8e-06,3e-05,-0.000281,8e-05,2.7e-05,-6.1e-05,-8.6e-05,6.2e-05,-1e-06,-4.4e-05,-1.4e-05,6e-05,3.1e-05,7e-06,0.00019,2e-05,-2.9e-05,-4e-06,2e-06,0.000127,-6.8e-05,5e-06,0.000161,4.5e-05,1.4e-05,8.5e-05,-1.7e-05,2e-05,5e-05,3e-05,2e-06,4e-06,1e-06,1.8e-05,-3.7e-05,-7e-06,-6e-06,-1.1e-05,1.5e-05,1.8e-05,6e-06,1e-06,8e-06,-1e-06,4e-06,-3e-06,2e-06,-5e-06,-3e-06,6e-06,-1e-06,-9e-06,4e-06,3.4e-05,-1.3e-05,4e-06,2e-06,2e-06,0,1e-05,-5e-06,-1e-05,-3e-06,-1e-06,-3e-06,-3e-06,-3e-06,2e-06,3e-06,-4e-06,0,2e-06,1e-06,0,-1e-06,-4e-06,-1e-06,1e-06
1e-06,0,1e-06,-1e-06,-1e-06,-2e-06,0,-3e-06,2e-06,-2e-06,-1e-06,-1e-06,-1e-06,1e-06,0,1e-06,-5e-06,-1e-06,-2e-06,1e-06,1e-06,0,1e-06,1e-06,-3e-06,0,5e-06,-3e-05,9e-06,5.8e-05,6e-06,3e-06,9e-06,-4.2e-05,-2e-06,-3e-06,-7e-06,-6e-06,6e-06,3.5e-05,-0.000266,0.000159,0.000278,-5.2e-05,-3.8e-05,0.000332,-0.000119,-2.5e-05,-0.000147,3e-06,1.4e-05,0.000228,-3.4e-05,0.000143,9.6e-05,5e-06,2.6e-05,-0.000148,1.3e-05,-4.5e-05,-5e-06,8.6e-05,-6.7e-05,7.3e-05,3e-05,-9.5e-05,-3.2e-05,3.3e-05,-1.4e-05,-4.4e-05,9e-06,2.7e-05,-2.5e-05,-7e-06,-7e-06,-3.1e-05,-3.2e-05,0,4e-06,2.1e-05,4e-06,-1e-06,-1.3e-05,-1.9e-05,5e-06,-4e-06,-2e-06,-2e-06,-4e-06,0,-1.1e-05,-1.3e-05,8e-06,3e-06,-1.2e-05,5e-06,2.1e-05,1.1e-05,-1e-06,9e-06,-5e-06,-5e-06,-6e-06,0,1.5e-05,-2e-06,0,3e-06,0,-4e-06,1e-06,-1e-06,1e-06,1e-06,-5e-06,0,1e-06,1e-06,2e-06,1e-06,2e-06
0,0,-1e-06,1e-06,-1e-06,-4e-06,-1e-06,-1e-06,2e-06,1e-06,1e-06,-1e-06,-1e-06,-4e-06,0,-1e-06,-7e-06,0,-2e-06,1e-06,0,0,-1e-06,0,6e-06,0,-1.1e-05,2.8e-05,-5e-06,-0.000106,-2.2e-05,1.3e-05,-1e-06,3.8e-05,0,-2.8e-05,-1.1e-05,-3e-06,1e-06,3e-05,2e-04,-5e-05,-0.00032,4e-05,-2.3e-05,-0.000225,-3.3e-05,1.2e-05,-8.2e-05,4.3e-05,0.000111,-0.000197,7.2e-05,7e-06,4.5e-05,7e-06,6.3e-05,2.9e-05,-1e-06,9.4e-05,8.4e-05,-0.000138,-4.1e-05,1.3e-05,1.1e-05,-1.7e-05,3e-05,-5.5e-05,7.4e-05,5.6e-05,-8e-06,-9.6e-05,2.3e-05,1.3e-05,5e-06,3.7e-05,1.4e-05,1.2e-05,9e-06,9e-06,-1.8e-05,8e-06,-2e-06,2.8e-05,9e-06,-2e-06,-1e-06,2e-06,0,-1e-06,1.4e-05,-2e-05,8e-06,-2e-06,-3e-06,-4e-06,-1.5e-05,-2e-06,-1.4e-05,9e-06,-1e-05,2e-06,2e-06,6e-06,-2e-06,2e-06,-1e-06,5e-06,4e-06,-6e-06,1e-06,0,-1e-06,0,0,1e-06,-2e-06,0,-1e-06,0,1e-06
-1e-06,0,1e-06,0,-2e-06,-2e-06,0,0,-1e-06,0,0,1e-06,0,1e-06,0,1e-06,-6e-06,0,-2e-06,5e-06,-2e-06,0,-2e-06,-4e-06,-2e-06,1e-06,3e-06,5e-06,1.1e-05,6e-06,-1.1e-05,-1.8e-05,-2.3e-05,-5.5e-05,1e-06,9e-06,-1e-06,-1e-06,-1.1e-05,-4.5e-05,0.000102,-0.000154,0.000271,-2.4e-05,-1.7e-05,-4.3e-05,5.7e-05,-1.6e-05,-4.9e-05,-3.6e-05,-5.6e-05,2.2e-05,-5.1e-05,-3.9e-05,2.6e-05,1.9e-05,3.5e-05,-3.2e-05,-6e-05,-1.7e-05,-0.000113,0.000129,6.9e-05,-2.9e-05,-7e-05,-4.7e-05,-4.8e-05,5.9e-05,4.3e-05,-5.8e-05,-6e-06,-4.9e-05,-1.4e-05,1.4e-05,-7e-06,-4.5e-05,1.2e-05,-2.7e-05,1.6e-05,-1.5e-05,3e-06,-3e-06,2e-06,-2.6e-05,4e-06,-4e-06,-8e-06,-3e-06,2e-06,2e-06,5e-06,1.6e-05,2e-06,4e-06,1e-06,-5e-06,-1.2e-05,-6e-06,-6e-06,-1e-06,-1.2e-05,0,0,-1e-06,-3e-06,0,1e-06,1e-06,4e-06,-3e-06,0,2e-06,1e-06,1e-06,-4e-06,0,1e-06,0,0,1e-06,1e-06
1e-06,-2e-06,-1e-06,-1e-06,1e-06,-3e-06,-1e-06,-1e-06,-1e-06,0,-1e-06,0,-1e-06,-1e-06,0,0,-5e-06,0,-1e-06,2e-06,1e-06,0,-1e-06,-4e-06,-3e-06,0,5e-06,-1.8e-05,1e-06,1.8e-05,-2e-06,1.4e-05,-6e-06,5.9e-05,1e-06,1.1e-05,-3e-06,1e-06,5e-06,-4.2e-05,-4.3e-05,-0.000117,-4.7e-05,-3.5e-05,-3.5e-05,0.000197,-6.6e-05,7.8e-05,6e-06,4.8e-05,-1.3e-05,1.3e-05,3.7e-05,-1.5e-05,-0.000182,5e-06,-2.9e-05,2e-05,3e-05,-1.6e-05,0.000115,-9.4e-05,-4.6e-05,6.1e-05,3e-05,9.7e-05,-4.2e-05,-0.000122,6e-06,-1e-05,8e-06,7.2e-05,8e-06,1e-05,-4e-06,2.3e-05,-2.5e-05,-8e-06,9e-06,-6e-06,1e-06,-3e-06,-8e-06,1.8e-05,9e-06,5e-06,-2e-06,1e-06,0,1e-06,-1.4e-05,1e-06,0,-2e-06,2e-06,2e-06,-2.1e-05,5e-06,-9e-06,-1.4e-05,1e-05,-1e-06,-7e-06,-1e-06,-2e-06,-2e-06,-1e-06,-2e-06,2e-06,0,-2e-06,-2e-06,1e-06,0,1e-06,-1e-06,0,0,1e-06,-1e-06,0
0,-1e-06,1e-06,0,2e-06,-2e-06,0,-1e-06,-1e-06,1e-06,1e-06,1e-06,-1e-06,1e-06,0,0,-3e-06,1e-06,-2e-06,-2e-06,0,0,0,-1e-06,3e-06,0,-4e-06,-1.2e-05,0,0,-2.1e-05,-1.1e-05,2.5e-05,-5.4e-05,-7e-06,-7e-06,-3e-06,-2e-06,1.2e-05,-6.1e-05,-4.7e-05,6.5e-05,-0.000134,-1.9e-05,1.3e-05,-0.000226,3.9e-05,-4.7e-05,5e-06,1e-05,-6.3e-05,-4.9e-05,-1.9e-05,4.2e-05,3.8e-05,1e-06,-6.3e-05,3.5e-05,-3e-05,4.6e-05,-1.6e-05,4.1e-05,-2.4e-05,-3.6e-05,-4.4e-05,-7.8e-05,-7e-06,5.7e-05,-5.7e-05,1.9e-05,7e-06,-1.8e-05,-4e-06,-2e-05,1.1e-05,1e-05,2.3e-05,3e-06,2e-06,-1.1e-05,2e-06,-1e-05,-3e-06,-1.2e-05,8e-06,-6e-06,2e-06,0,-2e-06,-2e-06,0,1.1e-05,-1e-06,-2e-06,6e-06,5e-06,8e-06,-8e-06,-3e-06,-3e-06,7e-06,2e-06,4e-06,-1e-06,-4e-06,1e-06,0,-7e-06,1e-06,0,-1e-06,1e-06,1e-06,-1e-06,-2e-06,1e-06,0,0,-2e-06,-1e-06,0
0,-1e-06,0,0,0,-3e-06,-1e-06,-1e-06,-2e-06,-1e-06,0,-1e-06,0,0,0,1e-06,-3e-06,0,-2e-06,-1e-06,-1e-06,0,1e-06,-2e-06,-2e-06,0,-4e-06,3.8e-05,-1.5e-05,2.6e-05,-6e-06,-2e-06,1.3e-05,6.4e-05,9e-06,5e-06,-1e-06,0,-1.2e-05,-3.8e-05,-0.000101,1e-04,0.000196,2e-05,-1.3e-05,0.000201,2.2e-05,-1.3e-05,3.7e-05,-5.9e-05,-7e-06,0,-2.4e-05,-5e-06,-0.000116,-9e-06,-1.9e-05,-7.7e-05,-1.8e-05,-5.2e-05,7e-06,3.8e-05,5.8e-05,-1.9e-05,3.9e-05,-3.1e-05,-1.5e-05,-5.1e-05,8e-06,-3.9e-05,-7e-06,-2.6e-05,0,-1.3e-05,-1.3e-05,3e-06,-3e-06,1.4e-05,-1e-05,1.1e-05,-4e-06,-3e-06,0,3e-06,2e-06,-1e-06,1e-06,1e-06,-2e-06,0,1.2e-05,4e-06,-1e-06,6e-06,6e-06,1e-06,-3e-06,1.3e-05,-4e-06,5e-06,0,0,-6e-06,-6e-06,3e-06,0,0,-4e-06,-2e-06,1e-06,0,1e-06,-2e-06,0,4e-06,1e-06,-1e-06,0,2e-06,-3e-06,0
0,0,0,0,0,-2e-06,0,-1e-06,1e-06,-1e-06,0,-1e-06,0,0,0,-1e-06,-3e-06,0,-1e-06,1e-06,1e-06,0,2e-06,-3e-06,-1e-06,0,7e-06,-4e-06,-1.1e-05,-2.1e-05,-3e-06,1e-05,-1.7e-05,-5.7e-05,-4e-06,-2e-06,-2e-06,0,-2e-06,-1.7e-05,9.1e-05,3.9e-05,-0.000306,0,1.3e-05,-0.000121,-3e-05,3.5e-05,5.5e-05,1.2e-05,-8e-06,5.6e-05,1.6e-05,-5.6e-05,5e-06,-1e-05,1e-06,8.1e-05,4.4e-05,9e-06,3.1e-05,-7.7e-05,-2.2e-05,3e-06,1.1e-05,2.3e-05,1.3e-05,4.3e-05,-7.7e-05,2.2e-05,-4e-06,2.9e-05,4e-06,0,1.9e-05,-2.1e-05,-2.1e-05,-7e-06,-7e-06,1e-05,-4e-06,6e-06,5e-06,-1e-06,-5e-06,-1e-06,2e-06,0,-1e-06,1e-06,-2e-06,-4e-06,-4e-06,-4e-06,-2e-06,-2e-06,1.5e-05,-1.4e-05,1e-06,1.1e-05,-1e-06,-2e-06,2e-06,-7e-06,-3e-06,0,0,0,-2e-06,1e-06,0,-2e-06,0,0,3e-06,-1e-06,1e-06,0,-2e-06,-1e-06,-1e-06
0,0,0,1e-06,1e-06,-3e-06,-1e-06,0,0,1e-06,1e-06,-2e-06,-1e-06,0,-1e-06,1e-06,-4e-06,0,-1e-06,1e-06,0,0,1e-06,-2e-06,4e-06,0,-3e-06,-3e-05,1.6e-05,1.2e-05,-2e-06,-1e-05,-7e-06,3.8e-05,-2e-06,-2e-06,8e-06,2e-06,1e-05,2.3e-05,0.000155,9e-06,0.00032,7e-06,2.2e-05,-8.9e-05,3.9e-05,6e-06,6e-05,1.3e-05,8.2e-05,3.8e-05,-2.1e-05,1e-05,3.8e-05,-5e-06,3.9e-05,5e-06,-3.3e-05,4.8e-05,-7e-05,4.8e-05,-2.1e-05,-3.5e-05,-4e-06,6.4e-05,8e-06,-1.9e-05,4e-05,2.2e-05,2e-06,-3.4e-05,-5e-06,1e-06,-1.7e-05,2.8e-05,1.3e-05,1.3e-05,-8e-06,-4e-06,7e-06,0,-1.1e-05,4e-06,-2e-06,2e-06,0,-2e-06,0,-1e-06,-6e-06,-8e-06,-5e-06,-1e-06,-8e-06,1e-06,3e-06,1.1e-05,4e-06,0,5e-06,2e-06,1e-06,-4e-06,2e-06,-2e-06,0,3e-06,-2e-06,1e-06,1e-06,1e-06,0,0,1e-06,0,1e-06,1e-06,0,-1e-06,0
0,-2e-06,0,0,-1e-06,-3e-06,0,0,1e-06,0,-1e-06,0,-1e-06,-1e-06,1e-06,-1e-06,-3e-06,0,-1e-06,1e-06,-1e-06,0,0,-2e-06,-2e-06,-1e-06,-3e-06,1.6e-05,0,2.2e-05,-5e-06,6e-06,1.3e-05,-2.9e-05,1e-06,3e-06,-3e-06,2e-06,-4e-06,2.4e-05,-0.000187,-7.7e-05,-0.000205,5e-06,9e-06,0.000209,-4.1e-05,1e-06,6.1e-05,-1e-06,0,-0.000104,5e-06,3.4e-05,-3.9e-05,-9e-06,4.6e-05,-5.3e-05,3.1e-05,-4.8e-05,8.9e-05,-2.5e-05,4.8e-05,1e-05,1e-05,-9e-05,-4e-06,7e-06,-1.3e-05,-1.6e-05,7e-06,3e-06,5e-06,6e-06,1.6e-05,-4e-05,-4e-06,2e-06,-2e-06,-2e-06,0,0,9e-06,-5e-06,-1.8e-05,-4e-06,1e-06,1e-06,-1e-06,-1e-06,5e-06,-1.6e-05,-3e-06,3e-06,-4e-06,1e-06,-1.4e-05,-1.1e-05,1e-06,-8e-06,-5e-06,-2e-06,-4e-06,0,-6e-06,1e-06,0,5e-06,0,2e-06,0,-1e-06,2e-06,1e-06,-4e-06,0,-1e-06,0,2e-06,0,0
0,-1e-06,0,0,-2e-06,-3e-06,0,0,1e-06,-1e-06,1e-06,-1e-06,-1e-06,1e-06,-1e-06,1e-06,-5e-06,0,-1e-06,1e-06,0,0,0,-2e-06,0,0,3e-06,1.5e-05,-1.3e-05,1.4e-05,-1.7e-05,-5e-06,-2e-06,3e-06,0,-2e-06,2e-06,1e-06,-6e-06,3e-05,-9.1e-05,-8.5e-05,0.000101,1.3e-05,4e-06,-0.000206,-1.2e-05,-4.3e-05,2.2e-05,1.8e-05,1.9e-05,2.3e-05,9e-06,1.4e-05,8.8e-05,-8e-06,5e-06,4.4e-05,4e-06,1.3e-05,-9.1e-05,1.3e-05,-2.3e-05,-1.6e-05,-3.8e-05,-1.7e-05,4.8e-05,1.1e-05,3.2e-05,1.5e-05,-4e-06,2.8e-05,-9e-06,-1.4e-05,-2e-05,2.3e-05,-2e-06,2e-06,7e-06,-6e-06,2e-06,1e-05,-3e-06,0,-5e-06,1e-06,2e-06,0,-1e-06,1e-06,4e-06,1.1e-05,-2e-06,-1e-06,6e-06,-1e-06,-1.1e-05,1.1e-05,3e-06,-6e-06,-7e-06,0,4e-06,2e-06,7e-06,1e-06,0,-1e-06,1e-06,3e-06,0,-1e-06,0,0,-1e-06,0,0,0,-1e-06,0,0
0,-1e-06,0,0,0,-2e-06,0,0,0,0,0,1e-06,0,0,0,0,-4e-06,0,-1e-06,-1e-06,1e-06,0,-1e-06,-1e-06,3e-06,0,1e-06,-2.1e-05,6e-06,-7.8e-05,-4e-06,-2e-06,-5e-06,2.2e-05,0,-5e-06,1e-06,0,5e-06,4.3e-05,0.000198,4.9e-05,-9.7e-05,-1.6e-05,3e-05,0.000207,4.3e-05,2.6e-05,1.3e-05,-1e-05,-4.9e-05,-2e-05,-1.2e-05,-3e-05,3.9e-05,-2e-06,-4.4e-05,-7e-06,-2.5e-05,4.2e-05,2.9e-05,1.4e-05,-2.7e-05,9e-06,1.5e-05,2.5e-05,1.1e-05,-3.3e-05,2.2e-05,1.5e-05,-7e-06,6e-06,1.2e-05,-6e-06,1.9e-05,-1e-05,3e-06,-5e-06,7e-06,1e-06,-7e-06,-9e-06,-1e-06,3e-06,3e-06,-1e-06,1e-06,1e-06,-1e-06,0,-6e-06,4e-06,-2e-06,0,8e-06,-1e-06,0,-1.1e-05,0,0,4e-06,1e-06,-4e-06,2e-06,0,-2e-06,0,-4e-06,1e-06,1e-06,0,1e-06,-1e-06,-1e-06,0,1e-06,0,-1e-06,1e-06,0,0
0,0,0,0,0,-2e-06,0,-1e-06,0,1e-06,0,0,0,0,0,0,-3e-06,0,-1e-06,-1e-06,0,0,-1e-06,-1e-06,-3e-06,0,-4e-06,-1.2e-05,-1e-06,4.2e-05,-1.1e-05,4e-06,-1e-06,-3.4e-05,1e-06,9e-06,4e-06,-2e-06,4e-06,2e-06,2.4e-05,6.3e-05,4.9e-05,-9e-06,-2.1e-05,-0.000105,-7e-06,1.2e-05,-1.6e-05,-1.5e-05,-3.5e-05,5e-06,1.4e-05,4e-06,-5e-06,0,-4.5e-05,-3.1e-05,1.9e-05,-6.6e-05,-1.5e-05,3e-06,4.3e-05,-9e-06,-4e-06,4.7e-05,-2e-06,3.2e-05,1.3e-05,-2.1e-05,2e-06,1e-05,-1.3e-05,1.2e-05,-2.1e-05,1e-06,1e-06,1e-06,5e-06,6e-06,7e-06,-3e-06,0,-9e-06,-3e-06,1e-06,0,-1e-06,0,-1e-06,-2e-06,6e-06,0,0,-3e-06,-2e-06,1.4e-05,9e-06,2e-06,8e-06,3e-06,-1e-06,1e-06,1e-06,-6e-06,0,0,-5e-06,1e-06,2e-06,-1e-06,-1e-06,0,0,2e-06,-1e-06,1e-06,0,-1e-06,0,-1e-06
0,0,0,0,-1e-06,-2e-06,-1e-06,0,0,0,0,0,-1e-06,0,0,0,-3e-06,0,-1e-06,-1e-06,-1e-06,0,0,-3e-06,1e-06,0,3e-06,2.2e-05,1e-06,-1e-05,-1.5e-05,-2e-06,1.4e-05,4.9e-05,-1e-06,-3e-06,-5e-06,-1e-06,-6e-06,-1e-05,-0.000174,1.2e-05,0.000102,-2e-06,7e-06,-7.6e-05,0,-3e-06,-3.3e-05,-4e-06,-2.5e-05,7.2e-05,3e-06,3.5e-05,1.9e-05,4e-06,-1.9e-05,4.2e-05,-1.2e-05,1.2e-05,-4.1e-05,-5.8e-05,-2e-05,-6e-06,9e-06,-0.000101,-1.8e-05,-4.1e-05,-1.2e-05,6e-06,5e-06,-4.4e-05,1.3e-05,8e-06,1.9e-05,-8e-06,-3e-06,-4e-06,1e-06,5e-06,-2e-06,1e-06,4e-06,1.4e-05,1e-06,-3e-06,-1e-06,0,0,1e-06,6e-06,8e-06,1e-06,1e-06,-8e-06,-3e-06,-5e-06,-6e-06,4e-06,5e-06,0,0,1e-06,-2e-06,0,1e-06,0,-2e-06,0,3e-06,0,0,-1e-06,0,-2e-06,0,-1e-06,0,0,-1e-06,0
0,-1e-06,-1e-06,0,0,-2e-06,0,0,-1e-06,0,0,-1e-06,0,0,-1e-06,0,-3e-06,0,-1e-06,2e-06,0,0,1e-06,-2e-06,2e-06,0,1e-06,6e-06,6e-06,3.2e-05,0,1e-06,-2e-06,-5.4e-05,-2e-06,0,3e-06,-1e-06,-2e-06,-2e-05,-3e-06,-1.5e-05,-0.000303,-6e-06,-1.5e-05,0.000177,-1e-06,1.1e-05,-4.8e-05,3e-06,5e-05,-3e-06,-1.5e-05,-1e-05,-6.4e-05,1e-06,2.7e-05,-5.8e-05,-6e-06,2.5e-05,6.3e-05,9e-05,-2.4e-05,1.8e-05,4e-06,2.5e-05,-1.3e-05,3.5e-05,3e-06,6e-06,-1e-06,-1.2e-05,-1.4e-05,0,-2.1e-05,2.3e-05,-2e-06,0,-3e-06,-1e-06,4e-06,2e-06,4e-06,-1.3e-05,7e-06,1e-06,0,1e-06,0,0,1e-06,-1.1e-05,2e-06,1e-06,0,-1e-06,-1e-06,7e-06,5e-06,-3e-06,-4e-06,0,-2e-06,-4e-06,-2e-06,-1e-06,0,3e-06,0,3e-06,1e-06,1e-06,1e-06,0,2e-06,0,1e-06,0,1e-06,-1e-06,0
