0.011942,0.013245,0.014737,0.015674,0.019295,0.021015,0.020909,0.023223,0.024738,0.025369,0.027457,0.031335,0.031848,0.03083,0.030739,0.029279,0.028734,0.029375,0.026734,0.024076,0.024153,0.025715,0.026767,0.025214,0.025205,0.026586,0.026203,0.024949
0.01409,0.015784,0.018484,0.020738,0.026231,0.028226,0.026499,0.029299,0.032132,0.033194,0.035621,0.039257,0.03975,0.03967,0.038783,0.036342,0.036712,0.03815,0.034884,0.031233,0.031883,0.034536,0.035387,0.032749,0.032538,0.03489,0.035172,0.03312
0.018248,0.020951,0.026026,0.031196,0.040765,0.043505,0.038215,0.041869,0.047756,0.049986,0.052817,0.055045,0.055626,0.057994,0.055265,0.050856,0.053311,0.055767,0.050965,0.046012,0.047836,0.052533,0.053047,0.048856,0.047771,0.051412,0.053604,0.050183
0.024841,0.02933,0.03595,0.044166,0.058307,0.062341,0.054253,0.059173,0.068685,0.073232,0.078223,0.078227,0.078573,0.082647,0.075359,0.069456,0.076094,0.078165,0.069596,0.064739,0.068493,0.075915,0.077341,0.073451,0.070557,0.072284,0.07663,0.073159
0.039149,0.047134,0.05236,0.06032,0.076225,0.08215,0.078627,0.086799,0.099172,0.10904,0.122575,0.123513,0.121016,0.11925,0.100748,0.095821,0.112401,0.112351,0.095738,0.092554,0.0971,0.107069,0.114232,0.117422,0.112431,0.104194,0.108101,0.1092
0.066298,0.081926,0.084829,0.089494,0.104866,0.114074,0.121013,0.131187,0.147515,0.171817,0.203016,0.210285,0.203772,0.186006,0.146767,0.146832,0.181088,0.175745,0.145051,0.143664,0.146628,0.159122,0.179689,0.198817,0.192507,0.165609,0.164639,0.175623
0.108553,0.135573,0.13739,0.140118,0.159773,0.175081,0.187913,0.195558,0.219477,0.268047,0.321559,0.334216,0.322635,0.287507,0.224196,0.229346,0.284185,0.270228,0.221024,0.221847,0.224947,0.242933,0.27722,0.312864,0.307135,0.262695,0.257578,0.27729
0.156729,0.195356,0.19735,0.201637,0.23294,0.255929,0.263646,0.268342,0.305211,0.376586,0.442829,0.452734,0.435715,0.389769,0.311615,0.319659,0.385451,0.359688,0.299005,0.305977,0.310521,0.335316,0.374442,0.417353,0.415975,0.363554,0.356526,0.379696
0.18997,0.235818,0.241491,0.258709,0.307062,0.329174,0.319242,0.320929,0.370058,0.450785,0.5046,0.497254,0.476479,0.437819,0.375628,0.383568,0.432674,0.400597,0.351703,0.36547,0.366858,0.389085,0.417065,0.450145,0.453578,0.4142,0.411824,0.425099
0.198474,0.247272,0.267086,0.320425,0.380165,0.372364,0.341548,0.346543,0.400542,0.470404,0.489494,0.454902,0.430147,0.411831,0.400988,0.4163,0.417613,0.391532,0.385876,0.405525,0.391548,0.389226,0.392845,0.399651,0.399343,0.393686,0.400667,0.388451
0.198303,0.241383,0.283558,0.389129,0.450911,0.394507,0.359821,0.382821,0.430532,0.486437,0.50071,0.445909,0.389355,0.375427,0.411402,0.44265,0.414991,0.41497,0.451195,0.459623,0.421366,0.396457,0.388232,0.366323,0.351737,0.376763,0.380519,0.337171
0.209034,0.250113,0.30317,0.436055,0.506118,0.430209,0.406595,0.460056,0.516494,0.557513,0.567001,0.491268,0.400634,0.396561,0.452402,0.485124,0.457172,0.479486,0.530756,0.529104,0.476016,0.428098,0.41512,0.38289,0.365655,0.411693,0.41199,0.355529
0.223431,0.271421,0.331382,0.440635,0.498809,0.4387,0.444225,0.533887,0.602363,0.612324,0.594621,0.509667,0.409165,0.42728,0.491588,0.504674,0.485114,0.512205,0.554888,0.582395,0.528458,0.43568,0.417363,0.394134,0.381946,0.427347,0.433523,0.390771
0.227602,0.272888,0.326783,0.394906,0.439091,0.405259,0.439474,0.540569,0.615948,0.617563,0.576523,0.491334,0.388771,0.414376,0.469562,0.450915,0.458541,0.507116,0.534236,0.593104,0.543982,0.40865,0.390878,0.39493,0.374773,0.38816,0.400425,0.386855
0.20732,0.241016,0.276796,0.323398,0.361037,0.350979,0.409394,0.490369,0.561768,0.584049,0.552654,0.503718,0.408517,0.389862,0.411039,0.369367,0.388072,0.452812,0.474961,0.543932,0.513726,0.388884,0.381301,0.406118,0.380721,0.362326,0.356877,0.353103
0.190509,0.214977,0.234685,0.317935,0.361261,0.348549,0.444188,0.520318,0.563271,0.589721,0.620284,0.669882,0.554205,0.440714,0.45108,0.403806,0.386172,0.417203,0.419181,0.513196,0.554512,0.457455,0.433059,0.474021,0.471306,0.404948,0.348566,0.379137
0.226095,0.259068,0.260559,0.397285,0.469645,0.446913,0.599695,0.702207,0.705473,0.720082,0.820334,0.956789,0.778221,0.573969,0.614758,0.560764,0.512196,0.515189,0.47329,0.605306,0.732177,0.638865,0.586561,0.653349,0.670933,0.531118,0.415674,0.503803
0.297573,0.335674,0.316719,0.49108,0.580334,0.543935,0.748596,0.890424,0.855635,0.825971,0.960333,1.165321,0.944715,0.695805,0.788389,0.71104,0.633636,0.642718,0.571802,0.720406,0.894107,0.791071,0.71226,0.810467,0.868264,0.681807,0.506488,0.621298
0.35597,0.395513,0.35731,0.522202,0.611654,0.572346,0.777231,0.931114,0.870002,0.799959,0.911439,1.115847,0.920091,0.704731,0.84173,0.750086,0.647072,0.689112,0.627223,0.729227,0.880064,0.787492,0.707779,0.82927,0.927043,0.753485,0.560591,0.645329
0.383812,0.406648,0.357353,0.477774,0.578886,0.563056,0.714025,0.816884,0.748755,0.719551,0.757343,0.844338,0.743258,0.614671,0.751388,0.715747,0.605771,0.670225,0.636769,0.613878,0.680955,0.642664,0.62822,0.767999,0.837983,0.707281,0.569161,0.575458
0.392925,0.405961,0.356714,0.407146,0.51453,0.544785,0.628343,0.658385,0.656601,0.713103,0.675896,0.663907,0.651019,0.559903,0.657823,0.733485,0.639355,0.673744,0.632966,0.491723,0.483794,0.53844,0.617271,0.738596,0.742669,0.655989,0.56084,0.473321
0.377972,0.390161,0.364433,0.381322,0.459097,0.50315,0.568335,0.569807,0.628325,0.721558,0.661109,0.63034,0.633539,0.532671,0.609135,0.756756,0.686705,0.657626,0.582455,0.415796,0.382714,0.502341,0.63663,0.715932,0.666233,0.623526,0.549695,0.388332
0.317492,0.334115,0.345865,0.342111,0.362898,0.394076,0.464569,0.488784,0.594982,0.690647,0.619144,0.556969,0.530047,0.464565,0.534163,0.668553,0.614408,0.534661,0.456465,0.334709,0.310218,0.447171,0.601589,0.688391,0.607611,0.554871,0.514646,0.35202
0.230402,0.253097,0.282731,0.285288,0.279108,0.271315,0.333709,0.40447,0.515141,0.575996,0.50629,0.416757,0.372591,0.356576,0.409116,0.48991,0.437735,0.354885,0.296288,0.222357,0.206174,0.33011,0.486021,0.581555,0.489499,0.407001,0.40189,0.291345
0.134147,0.148917,0.178607,0.194016,0.191874,0.175825,0.208337,0.279069,0.359612,0.37605,0.336186,0.283506,0.247245,0.244314,0.270229,0.309665,0.275851,0.222261,0.187835,0.151313,0.133796,0.208403,0.317538,0.37782,0.31956,0.255563,0.250234,0.205011
0.09185,0.089354,0.105841,0.120874,0.13008,0.140841,0.14813,0.168723,0.202974,0.214959,0.206749,0.18557,0.166805,0.160618,0.165582,0.184666,0.173762,0.157387,0.163968,0.151575,0.118363,0.140352,0.184616,0.191824,0.17834,0.158266,0.137913,0.132419
0.098696,0.091493,0.094692,0.097963,0.123141,0.161252,0.152185,0.130544,0.13642,0.156825,0.160144,0.151111,0.133369,0.111203,0.115219,0.143797,0.144786,0.135521,0.163267,0.164333,0.123144,0.120801,0.128384,0.125346,0.135676,0.123495,0.095349,0.094806
0.102037,0.101808,0.094354,0.092353,0.127846,0.169955,0.154164,0.13203,0.126786,0.13635,0.140705,0.137865,0.118127,0.07565,0.072679,0.107467,0.125528,0.121084,0.142804,0.149966,0.116065,0.109795,0.115802,0.117451,0.123841,0.108167,0.08206,0.073542
0.095436,0.100837,0.081288,0.072306,0.106211,0.137806,0.121874,0.118724,0.123238,0.121536,0.123254,0.119131,0.089274,0.049954,0.055632,0.084295,0.097602,0.090564,0.101057,0.119663,0.106915,0.095916,0.100386,0.102654,0.10413,0.092287,0.070187,0.057153
0.082953,0.088734,0.07182,0.060342,0.074617,0.083993,0.078188,0.091432,0.103703,0.098079,0.095154,0.088248,0.063531,0.05208,0.071592,0.083663,0.076045,0.065394,0.069905,0.088852,0.0923,0.080822,0.080374,0.078504,0.0775,0.079634,0.065892,0.0534
0.06499,0.075799,0.078399,0.070052,0.058733,0.052345,0.058895,0.066231,0.075702,0.080076,0.072593,0.06319,0.055112,0.068917,0.097059,0.091964,0.063868,0.054843,0.059329,0.074267,0.085059,0.077478,0.07613,0.070544,0.076815,0.094271,0.080995,0.06503
0.046349,0.06003,0.080681,0.07659,0.059299,0.056554,0.061794,0.055915,0.060403,0.071036,0.063836,0.053897,0.060083,0.088524,0.115057,0.096333,0.059027,0.051172,0.054517,0.073765,0.087268,0.076627,0.080839,0.07934,0.087229,0.10775,0.092304,0.074562
0.036138,0.045896,0.069841,0.07069,0.06559,0.067998,0.060204,0.050358,0.055629,0.066698,0.06245,0.049064,0.062666,0.097037,0.110977,0.090798,0.061636,0.050315,0.046884,0.068058,0.080239,0.071886,0.083041,0.079108,0.081745,0.098337,0.083768,0.069679
0.038699,0.036157,0.048884,0.051854,0.065769,0.072101,0.04983,0.043123,0.054366,0.057493,0.054348,0.045322,0.062946,0.088721,0.083734,0.072526,0.061081,0.046997,0.037018,0.056103,0.068993,0.07209,0.082268,0.065527,0.057972,0.06697,0.057057,0.051114
0.041512,0.032376,0.033954,0.036138,0.06109,0.066184,0.041311,0.045453,0.052845,0.042166,0.039127,0.039501,0.059636,0.06752,0.050252,0.055671,0.058722,0.044262,0.032582,0.04473,0.059307,0.069544,0.076332,0.053215,0.032652,0.03366,0.030354,0.033378
0.045793,0.031839,0.026198,0.030421,0.059081,0.058236,0.034045,0.045781,0.046175,0.02969,0.032338,0.040587,0.055021,0.044972,0.029,0.043518,0.049067,0.037201,0.030611,0.035062,0.045208,0.055908,0.060305,0.043392,0.021917,0.018816,0.020788,0.028059
0.049724,0.031242,0.022279,0.028651,0.053754,0.054049,0.032251,0.039415,0.039377,0.026454,0.035485,0.045882,0.046271,0.030698,0.018923,0.030335,0.035732,0.030241,0.030124,0.028815,0.035085,0.041953,0.043348,0.035018,0.019962,0.017964,0.025271,0.028409
0.050128,0.029687,0.018767,0.024503,0.04091,0.045956,0.030712,0.029358,0.034951,0.028064,0.037295,0.045219,0.035402,0.02529,0.018975,0.022901,0.026971,0.026299,0.028031,0.028078,0.030739,0.033328,0.034574,0.029759,0.020603,0.019983,0.031158,0.030756
0.045622,0.026493,0.015873,0.022937,0.028564,0.033577,0.025804,0.02124,0.030104,0.026077,0.032545,0.038161,0.02587,0.021207,0.022991,0.028127,0.031182,0.025562,0.024711,0.027002,0.026456,0.023803,0.029927,0.031686,0.023058,0.021862,0.032683,0.032439
0.038803,0.023157,0.012603,0.02285,0.020626,0.021762,0.019633,0.017277,0.025656,0.02134,0.023341,0.03044,0.025083,0.019662,0.024641,0.034607,0.038431,0.028905,0.021135,0.021181,0.021127,0.017315,0.02643,0.0341,0.025896,0.022064,0.027768,0.029458
