0.231993,0.626494,0.985254,1.003831,0.792093,0.949835,1.156126,1.238311,1.286206,1.075982,0.904582,0.954601,1.030936,0.875504,0.60113,0.378523,0.233681,0.172733,0.1652,0.172431,0.17848,0.201732,0.15371,0.079265,0.061344,0.044294,0.034963,0.032513
0.279954,0.743463,1.159807,1.195256,0.948031,1.096796,1.303804,1.388549,1.463247,1.236916,1.046473,1.114329,1.19238,1.008801,0.71875,0.465411,0.279464,0.205811,0.202903,0.208201,0.212036,0.240532,0.182855,0.09544,0.073624,0.053139,0.042777,0.040319
0.348166,0.90478,1.394923,1.467122,1.207431,1.336582,1.508025,1.579921,1.71088,1.488834,1.269542,1.342226,1.4021,1.19251,0.905692,0.610001,0.350178,0.255691,0.265068,0.26293,0.261074,0.30075,0.227525,0.12151,0.094516,0.068334,0.056766,0.054081
0.367427,0.938699,1.443779,1.558176,1.405306,1.535251,1.604058,1.625693,1.799909,1.64608,1.413222,1.427666,1.457908,1.285356,1.030681,0.703267,0.385232,0.281868,0.307945,0.29175,0.283681,0.335489,0.251531,0.139432,0.11254,0.081345,0.068879,0.066149
0.344251,0.853262,1.319649,1.457049,1.499481,1.715221,1.691028,1.674277,1.869118,1.786579,1.520496,1.411809,1.425244,1.327049,1.066657,0.706564,0.378779,0.287854,0.326388,0.29522,0.28652,0.349088,0.261269,0.15435,0.133131,0.096292,0.080343,0.077192
0.333423,0.776655,1.199548,1.353401,1.591423,2.021357,2.023241,1.970996,2.126851,2.040546,1.708789,1.488542,1.44203,1.345333,1.064931,0.677008,0.363608,0.289922,0.330637,0.299794,0.304982,0.374452,0.291939,0.197034,0.175889,0.124581,0.103198,0.100165
0.389756,0.906393,1.351126,1.516567,2.001609,2.705584,2.797538,2.786206,2.879794,2.647284,2.185304,1.972062,1.839391,1.617354,1.324184,0.857682,0.461702,0.343696,0.361119,0.340269,0.373759,0.451698,0.369445,0.284252,0.255403,0.174599,0.146642,0.148812
0.536437,1.266817,1.734471,1.943537,3.003575,4.123653,4.301095,4.4101,4.418346,3.986656,3.418532,3.285448,3.022246,2.513866,2.051066,1.390803,0.771066,0.502485,0.469006,0.445657,0.510476,0.604432,0.500191,0.414496,0.377026,0.252769,0.212296,0.220788
0.730263,1.717073,2.186629,2.540733,4.739291,6.721918,6.982737,7.055664,6.931016,6.417076,5.732832,5.536801,5.027538,4.084133,3.177901,2.19971,1.294498,0.794227,0.672511,0.600584,0.678614,0.792072,0.652325,0.546028,0.500135,0.342289,0.284976,0.296625
0.891796,2.112447,2.669317,3.304781,7.074695,10.333504,10.665215,10.482717,10.110225,9.665445,8.895546,8.399956,7.551296,6.161576,4.599046,3.217851,1.994319,1.181107,0.921686,0.758438,0.826822,0.955781,0.783785,0.626758,0.568697,0.407998,0.330328,0.341388
0.913279,2.271484,3.066517,4.069109,9.272074,13.786734,14.181992,13.639985,12.885444,12.676517,12.032196,11.046212,9.95966,8.237726,5.85054,4.141533,2.687617,1.539692,1.153658,0.909337,0.935704,1.033028,0.845155,0.638892,0.563035,0.423041,0.325465,0.333927
0.79247,2.123705,3.202468,4.491512,10.106523,15.158555,15.649413,14.908968,13.855517,14.090318,13.783639,12.237467,11.282254,9.500189,6.387925,4.514033,2.998991,1.687085,1.288267,1.016388,0.953148,0.962106,0.797048,0.604914,0.517305,0.3975,0.292854,0.295973
0.608661,1.724512,2.963665,4.295656,8.837479,13.413325,14.099778,13.191223,12.000425,12.579749,12.61573,10.992609,10.451282,8.957919,5.902188,4.060306,2.622473,1.463675,1.173815,0.964993,0.823815,0.751231,0.652611,0.51383,0.421299,0.335267,0.25325,0.244872
0.539808,1.421577,2.690714,3.858774,6.450072,9.645636,10.335109,9.374222,8.409155,8.745813,8.727872,7.604348,7.277769,6.269904,4.207829,2.810268,1.685884,0.943675,0.832493,0.754792,0.596555,0.493153,0.451762,0.364235,0.291238,0.238897,0.186316,0.167402
0.689488,1.58613,2.965391,3.76739,4.329737,5.720604,5.996393,5.30372,4.893177,4.769491,4.462239,3.921264,3.629066,3.216606,2.47314,1.632353,0.845068,0.495313,0.522256,0.551391,0.427062,0.36835,0.338665,0.240562,0.185089,0.143234,0.113911,0.099819
0.982831,2.13593,3.942822,4.481572,3.447244,3.356995,3.240951,3.018722,2.940255,2.787865,2.424873,1.987138,1.76108,1.783812,1.840144,1.247842,0.547232,0.364436,0.461399,0.530385,0.410572,0.41039,0.376675,0.237515,0.168259,0.106317,0.086757,0.077077
1.451396,3.003755,5.372872,5.780166,3.627552,2.795661,2.684695,2.925342,2.916945,2.764445,2.33927,1.792635,1.713113,1.848638,1.922489,1.275448,0.571812,0.416834,0.537006,0.642454,0.51531,0.555396,0.521857,0.335413,0.237701,0.144782,0.117614,0.102556
1.94772,3.840467,6.585926,7.042298,4.263875,3.256984,3.386231,3.984094,4.274259,4.096367,3.217741,2.385177,2.349314,2.412664,2.242123,1.435377,0.726251,0.517529,0.611036,0.754661,0.653705,0.722024,0.67727,0.465154,0.338898,0.205007,0.173177,0.157015
2.203155,4.161185,6.883862,7.572214,4.985415,4.250985,4.663036,5.484017,6.247961,6.174577,4.658201,3.450407,3.394214,3.353087,2.833535,1.705025,0.939873,0.650229,0.665023,0.803656,0.755475,0.846387,0.780016,0.592072,0.449873,0.26819,0.236041,0.221372
2.081324,3.765774,6.306205,7.363757,5.576887,5.525007,6.171125,7.062492,8.361538,8.259606,6.062698,4.619359,4.644437,4.537712,3.634832,2.119383,1.163581,0.775355,0.718265,0.828821,0.798299,0.858247,0.78713,0.706287,0.571709,0.332054,0.289704,0.278427
1.700755,3.002002,5.263201,6.54452,5.811109,6.700906,7.384372,8.109762,9.826069,9.453789,6.863861,5.434198,5.454148,5.234804,4.017934,2.330759,1.24904,0.819698,0.773959,0.860931,0.778648,0.761918,0.712067,0.753087,0.642582,0.371016,0.312232,0.30912
1.315298,2.290822,3.93526,5.045307,5.300441,7.38768,8.207506,8.677641,10.343607,9.38708,6.887169,5.564641,5.375477,4.904688,3.511372,2.046733,1.097168,0.741044,0.744051,0.792418,0.662585,0.596512,0.578113,0.671302,0.583691,0.347162,0.292929,0.296277
0.893287,1.513892,2.556034,3.456542,4.30465,7.114186,8.135725,8.495516,9.538783,8.125977,6.27682,5.320569,4.869369,3.872196,2.425761,1.404355,0.821106,0.59737,0.628244,0.711533,0.598686,0.470607,0.428682,0.485147,0.418981,0.274396,0.242738,0.246514
0.538053,0.947241,1.835956,2.68586,3.667079,6.303135,6.923588,7.049625,7.731078,6.549921,5.586413,4.996364,4.197229,2.828581,1.5584,0.912492,0.6435,0.506141,0.52625,0.681639,0.614898,0.438895,0.356885,0.342271,0.28414,0.211297,0.185895,0.184358
0.332108,0.639712,1.380062,2.254585,3.433152,5.327574,5.003925,4.76891,5.837555,5.355266,4.855996,4.505931,3.679356,2.413651,1.338569,0.827984,0.56684,0.447843,0.452215,0.602444,0.562284,0.403249,0.331463,0.298068,0.256172,0.204841,0.172747,0.171943
0.248641,0.500037,1.136202,2.051647,3.330708,4.448759,3.497089,2.897805,4.130918,4.278784,3.881693,3.750762,3.233647,2.137653,1.18965,0.816105,0.528235,0.428606,0.473351,0.519985,0.426699,0.325463,0.299137,0.278242,0.263681,0.21379,0.169586,0.167756
0.245024,0.453224,1.022759,1.945838,3.255372,4.310812,3.428304,2.562733,3.21351,3.2563,2.933584,2.933205,2.638791,1.742564,1.020406,0.739811,0.461404,0.432567,0.555739,0.51851,0.349297,0.26502,0.277955,0.289156,0.272057,0.204327,0.161185,0.152063
0.247693,0.441014,0.891242,1.726133,2.85272,3.972702,3.770484,3.052283,2.884303,2.532588,2.281318,2.20131,1.902143,1.302833,0.892977,0.655011,0.447832,0.48304,0.64727,0.604727,0.390854,0.257199,0.265801,0.307172,0.258944,0.169351,0.140158,0.132118
0.244458,0.455827,0.79346,1.441144,2.362429,3.449543,3.861343,3.34924,2.623646,1.994968,1.680014,1.714396,1.5327,1.094188,0.847556,0.569471,0.441715,0.544686,0.728515,0.688781,0.438477,0.25892,0.259157,0.304811,0.232603,0.151314,0.13831,0.131573
0.235766,0.471464,0.795871,1.382846,2.173947,3.094421,3.685095,3.241495,2.188963,1.4238,1.176601,1.331926,1.251039,1.061125,0.859445,0.477826,0.396136,0.587779,0.774084,0.691752,0.429725,0.246861,0.251901,0.289946,0.224637,0.162738,0.151995,0.140988
0.222364,0.465262,0.848052,1.611193,2.401187,3.022636,3.294553,2.68031,1.575135,0.923142,0.855441,0.998526,0.99493,1.043077,0.897063,0.451391,0.323103,0.551189,0.732043,0.621523,0.379895,0.24806,0.249305,0.248529,0.201406,0.156295,0.144353,0.130014
0.18592,0.43136,0.846923,1.782937,2.585992,2.91711,2.704448,1.848206,1.025584,0.609732,0.591728,0.724873,0.867905,0.978874,0.855731,0.481375,0.293987,0.446798,0.620979,0.531825,0.313705,0.233743,0.219192,0.179094,0.153443,0.130308,0.117743,0.109139
0.156129,0.397862,0.741587,1.668529,2.428971,2.623056,2.179947,1.284665,0.804533,0.498312,0.490077,0.570644,0.704457,0.792697,0.711265,0.494567,0.296171,0.338256,0.471123,0.427712,0.260042,0.207013,0.174815,0.126634,0.110655,0.104735,0.096461,0.092575
0.144406,0.32873,0.56344,1.416496,2.190899,2.234646,1.787661,1.201243,0.776208,0.51023,0.590494,0.629459,0.64031,0.68088,0.63777,0.482443,0.314787,0.293317,0.341221,0.317234,0.225882,0.169224,0.131302,0.109698,0.090024,0.077837,0.071151,0.069346
0.15056,0.299353,0.497528,1.204847,1.879417,1.718591,1.286056,1.1873,0.943335,0.611191,0.655272,0.67609,0.60277,0.637755,0.650648,0.449204,0.306249,0.275839,0.250855,0.255525,0.227993,0.138953,0.113724,0.112535,0.080914,0.059743,0.053043,0.055179
0.160701,0.328699,0.518708,0.994767,1.565734,1.483133,1.045853,1.133336,1.166925,0.770765,0.64473,0.584105,0.49035,0.566259,0.605727,0.39226,0.273243,0.263581,0.213872,0.236815,0.236397,0.134428,0.11834,0.113726,0.071818,0.051549,0.047218,0.053381
0.156068,0.316717,0.489498,0.915942,1.546923,1.564576,1.010193,1.04672,1.28923,0.94215,0.601211,0.408908,0.345454,0.502122,0.510708,0.326797,0.237094,0.246987,0.229536,0.280411,0.280323,0.147495,0.111513,0.098371,0.065727,0.057304,0.055483,0.067603
0.1351,0.248765,0.434938,0.995525,1.562524,1.523849,0.932712,0.833289,1.211597,0.998405,0.567086,0.331544,0.271269,0.424349,0.37906,0.237967,0.229518,0.228334,0.222799,0.311289,0.323673,0.156129,0.088946,0.082133,0.070682,0.064559,0.061293,0.080003
0.128297,0.189597,0.380843,1.120083,1.47244,1.325734,0.908696,0.603739,0.94971,0.882992,0.502421,0.357018,0.314849,0.361667,0.304729,0.171781,0.20896,0.206408,0.192551,0.298951,0.340412,0.16537,0.069676,0.07131,0.076052,0.061691,0.05638,0.078918
0.129033,0.214161,0.425983,1.216415,1.466867,1.211766,0.854584,0.441951,0.640292,0.702084,0.510378,0.399858,0.370052,0.34307,0.283031,0.140367,0.163524,0.207025,0.174132,0.257387,0.32289,0.163074,0.070671,0.077165,0.07907,0.053587,0.0468,0.065046
