0.030188,0.023711,0.024311,0.024351,0.023248,0.020916,0.047026,0.102182,0.228085,0.421192,0.508374,0.458617,0.506189,0.767359,0.897013,0.751038,0.795498,0.910858,0.744271,0.464235,0.292622,0.308286,0.478623,0.425902,0.259298,0.312017,0.211268,0.061161
0.037649,0.029264,0.029366,0.029021,0.027902,0.025413,0.054694,0.120418,0.26726,0.48014,0.579804,0.535534,0.572659,0.851728,1.014006,0.864074,0.909068,1.019446,0.828272,0.530475,0.343637,0.350215,0.533261,0.480151,0.300758,0.361094,0.246012,0.074849
0.052371,0.039782,0.037593,0.036179,0.035125,0.032515,0.065919,0.147388,0.319746,0.54823,0.671676,0.662346,0.689402,0.965493,1.173754,1.041367,1.078415,1.151065,0.911763,0.6125,0.422131,0.40679,0.595272,0.545116,0.355729,0.425741,0.293281,0.097158
0.069336,0.051055,0.044031,0.041045,0.039685,0.036412,0.07071,0.157898,0.323146,0.530602,0.700907,0.796727,0.859436,1.099186,1.312113,1.196814,1.194439,1.175875,0.874134,0.617674,0.464153,0.429019,0.6088,0.563093,0.36847,0.436681,0.305477,0.110169
0.085967,0.062498,0.049735,0.045378,0.042014,0.036513,0.069834,0.150687,0.282666,0.467475,0.754251,1.037965,1.157652,1.384128,1.586323,1.420789,1.333187,1.185331,0.809345,0.584802,0.454164,0.412943,0.606894,0.568816,0.356676,0.413032,0.292245,0.109997
0.102134,0.074072,0.056856,0.051883,0.044329,0.035973,0.070274,0.146173,0.264511,0.475344,0.924458,1.490726,1.737031,1.981466,2.15806,1.888317,1.67277,1.355449,0.851657,0.56817,0.436691,0.398165,0.583724,0.554137,0.371187,0.446204,0.311265,0.107259
0.116163,0.086807,0.067818,0.06363,0.051147,0.040709,0.086699,0.176757,0.318487,0.612799,1.273537,2.329765,2.858535,3.093841,3.252616,2.899677,2.491463,1.899639,1.192421,0.739498,0.539201,0.458819,0.564837,0.543664,0.434712,0.545607,0.382692,0.123135
0.136323,0.107369,0.086714,0.082079,0.064386,0.05288,0.129855,0.261753,0.451719,0.834514,1.765145,3.717044,4.862913,5.10708,5.272482,4.822175,4.203467,3.210244,2.054806,1.259255,0.884232,0.665988,0.654713,0.644966,0.591466,0.747979,0.540054,0.176285
0.161815,0.136803,0.113363,0.101255,0.076985,0.067149,0.188874,0.382355,0.639644,1.102326,2.348045,5.658393,7.922687,8.197391,8.299066,7.746601,6.906888,5.384999,3.464172,2.086224,1.434442,1.007809,0.896503,0.908127,0.845433,1.033239,0.777925,0.277105
0.183347,0.164645,0.135808,0.112482,0.085416,0.079615,0.245462,0.491652,0.803835,1.355228,2.993027,7.902146,11.687498,11.935494,11.734198,11.22036,10.282696,8.203086,5.282841,3.0952,2.100862,1.423627,1.18601,1.234849,1.176136,1.387075,1.066715,0.410297
0.183465,0.170117,0.137973,0.109963,0.089201,0.087585,0.281965,0.539369,0.854966,1.501228,3.577571,9.763968,14.97445,15.068881,14.213246,14.000521,13.409133,11.026764,7.06603,3.965458,2.669369,1.791293,1.381906,1.459442,1.506074,1.771757,1.343173,0.541216
0.160367,0.149094,0.118343,0.097164,0.086785,0.085655,0.290019,0.518343,0.766561,1.418654,3.851172,10.408351,16.230307,16.135887,14.37249,14.500362,14.681463,12.457903,7.896733,4.219968,2.842274,1.931018,1.392688,1.450265,1.663497,2.017139,1.483879,0.619616
0.132158,0.119955,0.090089,0.081031,0.078513,0.075201,0.278408,0.466817,0.60082,1.122387,3.517903,9.019881,14.054108,14.401532,12.321643,12.316067,12.947563,11.081478,6.935757,3.558698,2.428782,1.711313,1.206515,1.213099,1.584275,2.064047,1.455018,0.595224
0.1062,0.09467,0.067029,0.065981,0.06587,0.064159,0.284619,0.462201,0.489718,0.893868,2.874027,6.307725,9.300259,10.170515,8.685235,8.321882,8.831344,7.36734,4.471706,2.225063,1.582035,1.195773,0.888354,0.92531,1.440125,2.045644,1.372316,0.477703
0.072295,0.064543,0.049661,0.054314,0.055329,0.060715,0.360646,0.591029,0.538038,0.944717,2.527803,4.021713,4.809627,5.565069,5.06375,4.651615,4.738725,3.703839,2.110799,1.017623,0.749012,0.649134,0.599382,0.77353,1.490903,2.336882,1.563785,0.412023
0.044306,0.040278,0.041592,0.052112,0.052636,0.064353,0.47865,0.798333,0.653823,1.09945,2.671117,3.170081,2.769401,3.211491,3.032731,2.668441,2.542828,1.839554,0.990436,0.498908,0.362082,0.403362,0.557185,0.870011,1.840168,2.993458,2.015172,0.467576
0.040922,0.034377,0.040544,0.053157,0.055268,0.073755,0.596598,0.991005,0.738056,1.291699,3.291825,3.445959,2.383401,2.742749,2.630757,2.121803,1.796305,1.291058,0.752371,0.454981,0.376108,0.453559,0.692192,1.09388,2.320301,3.743258,2.503899,0.573247
0.050938,0.042346,0.043457,0.053399,0.058912,0.085178,0.67037,1.082787,0.755666,1.505815,4.287922,4.403183,2.538207,2.705158,2.858645,2.347232,1.839326,1.500369,0.968305,0.607522,0.530939,0.562843,0.830907,1.304097,2.62981,4.06873,2.686036,0.632961
0.064375,0.052906,0.047477,0.057665,0.067576,0.093927,0.652666,1.030649,0.769757,1.839177,5.492647,5.672905,3.030646,2.959324,3.413222,2.981992,2.356851,2.141827,1.391761,0.850989,0.764877,0.675561,0.902812,1.432413,2.698898,3.794881,2.422123,0.627845
0.077459,0.062499,0.051894,0.061564,0.075238,0.097466,0.577196,0.910044,0.77123,2.059059,6.169087,6.375848,3.480257,3.546665,4.241026,3.75997,3.138289,2.971219,1.82758,1.096026,1.003989,0.7475,0.900427,1.596482,2.729717,3.230703,1.969422,0.620574
0.087556,0.070603,0.055716,0.060116,0.07501,0.094695,0.48201,0.770381,0.707921,1.948288,5.830961,6.056523,3.546633,4.041578,4.911446,4.357575,3.881713,3.616449,2.091451,1.267906,1.133274,0.759915,0.923143,1.807232,2.759868,2.841234,1.709677,0.608838
0.087553,0.074574,0.058658,0.055907,0.067297,0.082339,0.427295,0.690251,0.580205,1.476511,4.466948,4.829963,3.395282,4.38973,5.19364,4.44686,4.049898,3.62196,2.040793,1.314074,1.097861,0.724688,0.95799,1.8889,2.592945,2.537891,1.587355,0.55156
0.072131,0.06562,0.055648,0.050138,0.056197,0.069322,0.370509,0.584106,0.410996,0.955576,2.971979,3.506315,3.146657,4.420223,5.010941,3.981539,3.448047,3.051258,1.816973,1.255863,0.989972,0.652295,0.902558,1.825728,2.386654,2.176422,1.331654,0.428502
0.050837,0.049148,0.047028,0.046307,0.048311,0.061049,0.293765,0.432792,0.265115,0.598506,1.975956,2.639842,2.800665,3.935653,4.295467,3.151101,2.437095,2.337463,1.622665,1.100721,0.876151,0.625869,0.854552,1.675161,2.134941,1.838183,1.069532,0.321052
0.040437,0.036477,0.036774,0.040983,0.039224,0.051881,0.232719,0.321712,0.185111,0.466459,1.73788,2.431721,2.4402,3.11018,3.430541,2.607203,1.696297,1.640791,1.393841,0.921184,0.706657,0.617427,0.910816,1.574877,1.839588,1.537467,0.91474,0.291845
0.044069,0.036741,0.033274,0.035278,0.030822,0.041845,0.177354,0.242877,0.143458,0.413245,1.623123,2.192927,1.89486,2.163501,2.64354,2.359595,1.381005,1.113041,1.169875,0.846731,0.572309,0.570831,0.956052,1.510491,1.653194,1.362762,0.822804,0.286046
0.046774,0.041933,0.036236,0.033394,0.024264,0.031662,0.136656,0.196492,0.125968,0.347274,1.282393,1.687907,1.333374,1.425661,2.057893,2.136809,1.305618,0.927002,1.028062,0.812911,0.492117,0.492755,0.988831,1.575939,1.713804,1.440433,0.837912,0.284583
0.044124,0.043017,0.037263,0.034687,0.024511,0.030214,0.156816,0.233789,0.143505,0.305879,0.987131,1.262858,1.056633,1.313818,1.910487,1.943327,1.327552,0.94892,0.938654,0.767648,0.455099,0.440229,1.032676,1.655863,1.791265,1.626291,0.976088,0.311048
0.037736,0.039329,0.035742,0.034215,0.028857,0.036115,0.190297,0.289024,0.170079,0.313169,1.041684,1.283554,1.115466,1.449335,1.74289,1.619359,1.234364,0.920022,0.816527,0.678945,0.456048,0.432224,0.982959,1.585753,1.826588,1.790194,1.065665,0.320889
0.036964,0.038616,0.038843,0.034309,0.035706,0.047294,0.209827,0.314139,0.179612,0.292855,1.05207,1.329232,1.202726,1.482468,1.493605,1.327424,1.100021,0.813747,0.641749,0.573329,0.460609,0.435709,0.831953,1.355542,1.808639,1.845439,1.007204,0.280471
0.048597,0.050029,0.049829,0.042214,0.047537,0.061544,0.213957,0.303352,0.177938,0.268614,0.965468,1.259833,1.146436,1.386172,1.359657,1.191916,1.093989,0.838911,0.567413,0.555063,0.485269,0.42364,0.645053,1.063913,1.74278,1.806975,0.864812,0.228149
0.058408,0.058942,0.05797,0.049592,0.055841,0.072351,0.215989,0.286247,0.172873,0.307065,1.03187,1.249825,0.972402,1.116314,1.225056,1.15792,1.146451,0.906079,0.54017,0.530585,0.48123,0.39709,0.566559,0.999014,1.668694,1.649231,0.754834,0.207928
0.056228,0.054987,0.053245,0.046456,0.051697,0.068987,0.208943,0.260868,0.151716,0.353922,1.158822,1.298863,0.825315,0.88197,1.070784,1.045987,1.111683,0.929997,0.508959,0.451169,0.447561,0.380795,0.611619,1.022781,1.415616,1.296149,0.610611,0.188727
0.0438,0.039784,0.036537,0.032682,0.0358,0.050309,0.188797,0.242511,0.12885,0.345183,1.264236,1.460223,0.755018,0.676712,0.888422,0.960236,1.019097,0.885938,0.576774,0.47523,0.458097,0.397668,0.668267,0.928715,1.126284,1.025405,0.452207,0.15041
0.033921,0.026023,0.018797,0.01827,0.020615,0.029349,0.157384,0.219334,0.112759,0.287015,1.215891,1.50859,0.736251,0.563118,0.759596,0.916053,0.921519,0.823535,0.667739,0.528667,0.441696,0.418505,0.662798,0.770032,0.961533,0.879455,0.332785,0.108724
0.025931,0.018947,0.010649,0.015012,0.021514,0.024089,0.132146,0.190575,0.105193,0.226584,1.055656,1.391796,0.748478,0.515775,0.664652,0.869551,0.805408,0.716611,0.66487,0.518303,0.36476,0.37089,0.566391,0.648261,0.879965,0.743654,0.256852,0.093511
0.021974,0.018141,0.013434,0.019458,0.029751,0.02879,0.111913,0.154874,0.091802,0.227611,0.911647,1.179434,0.767714,0.576227,0.647591,0.802765,0.65448,0.552987,0.547433,0.451531,0.313024,0.279139,0.453199,0.664977,0.895826,0.644271,0.211324,0.103463
0.019721,0.019884,0.021035,0.027075,0.038589,0.037682,0.100626,0.121325,0.071166,0.223467,0.735834,0.935482,0.734403,0.662404,0.733664,0.831607,0.641159,0.487098,0.395485,0.336436,0.293898,0.228999,0.344129,0.75479,1.11592,0.759934,0.228858,0.111504
0.02181,0.025262,0.030526,0.034014,0.04348,0.045964,0.09299,0.103615,0.056221,0.196704,0.630903,0.910623,0.741582,0.64631,0.768776,0.791233,0.585094,0.416453,0.293587,0.226092,0.245529,0.210001,0.303179,0.838525,1.322143,0.89056,0.26439,0.109234
0.025379,0.031704,0.038702,0.0367,0.040803,0.047581,0.080588,0.089373,0.047533,0.176293,0.682816,1.033939,0.7112,0.515629,0.692835,0.65436,0.475148,0.318684,0.223024,0.152863,0.185165,0.2037,0.265529,0.823755,1.377075,0.905083,0.263223,0.092943
