0.000372,0.000397,0.000336,0.00021,0.000235,0.000571,0.000407,0.000609,0.000162,0.000444,2e-06,5.2e-05,3.4e-05,0.00042,0.00031,9.8e-05,0.000373,0.000626,0.000573,3e-04,7.6e-05,0.000256,7.7e-05,0.000477,0.000108,0.000175,0.000231,9.3e-05,0.000418,0.000168,0.000433,0.000247,0.000635,0.000229,5.8e-05,0.000123,0.000275,0.000268,0.000227,0.000419,0.000758,0.000505,0.00066,0.000427,0.000484,0.000148,7.4e-05,0.00029,0.000179,0.000354,0.000181,1.9e-05,0.000265,7.2e-05,0.000434,8.9e-05,0.000241,0.000501,0.000189,0.000294,0.000241,0.000197,0.000192,0.000273,1.8e-05,0.000253,0.000287,0.000196,7.6e-05,7e-06,0.000186,5e-06,0.00021,0.000146,0.000127,3.3e-05,0.00037,0.000215,0.000166,6.9e-05,5e-05,0.000311,0.000158,5.3e-05,2.2e-05,0.000154,0.00012,8.4e-05,5e-06,0.000389,3.4e-05,8.3e-05,0.000178,0.000165,8.2e-05,0.000301,0.000344,0.000251,6e-05,0.000277,0.00044,7.2e-05,0.000208,3e-05,0.000129,0.000136,0.000329,0.000398,0.000236,6e-05,0.000458,8.7e-05,0.000107,1.8e-05,0.000352,0.000166,1e-04,0.000205,0.000208,0.000119,0.000159
0.00087,0.000859,0.000644,0.000538,0.000319,0.000783,0.000725,0.0017,0.000121,0.000791,0.000183,0.000505,0.000494,0.000715,0.000586,0.000312,0.000562,0.001489,0.001018,0.000807,0.000296,0.000546,0.000162,0.00083,0.000167,0.000459,0.000725,0.000243,0.001026,0.000131,0.001107,0.000494,0.001388,0.000504,0.000178,0.000179,0.000767,0.000371,0.000603,0.000986,0.001453,0.000981,0.001017,0.000699,0.000743,0.000576,3e-04,0.000675,0.000361,0.000545,0.000337,9.9e-05,0.000544,8.8e-05,0.001041,4.9e-05,0.000489,0.001039,0.000498,0.000719,0.000699,0.00021,0.000308,0.000514,7.3e-05,0.000493,0.000707,0.000358,0.000275,7.7e-05,0.000498,0.000124,0.000615,0.000562,0.000417,7.4e-05,0.000805,0.000575,0.000398,0.000147,6.6e-05,0.000364,0.000207,0.000119,0.000436,0.000289,0.000254,0.000214,8.5e-05,0.00087,1e-04,0.000247,0.00047,0.000112,0.00015,0.00051,0.000734,0.000607,6.1e-05,0.000509,0.001024,0.000324,0.000337,0.000136,0.000445,0.000381,0.000756,0.000932,0.000415,0.000226,0.000979,0.000434,0.000306,0.000219,0.000675,0.000121,0.000314,0.000546,0.000413,0.000264,0.000317
0.000643,0.000837,0.000953,0.000638,0.000297,0.00183,0.000253,0.001769,0.000932,0.000669,0.000189,0.001038,0.000836,0.001276,0.00048,0.000775,0.001143,0.000823,0.001241,0.000473,0.000385,0.001157,0.000417,0.001199,0.000188,0.00031,0.001082,0.000843,0.000684,0.000468,0.001361,0.000744,0.001732,0.000302,0.000261,0.000251,0.001013,0.001414,0.000731,0.000716,0.001991,0.00153,0.001245,0.000491,0.000853,0.000244,0.000716,0.000569,0.000675,0.000646,0.000187,0.000204,0.000667,0.00024,0.000979,0.000426,0.000599,0.001085,0.000282,0.000555,0.00064,0.000477,0.000238,0.000647,7e-05,0.000677,0.000691,0.000266,0.00013,5.5e-05,0.000782,0.000566,0.000527,0.000577,0.000574,0.000257,0.000636,0.000343,0.000353,0.000135,0.000112,0.000734,0.000478,0.00044,0.000537,0.000581,3e-04,0.000468,0.00021,0.000785,0.000194,0.000294,3e-04,0.00063,0.000287,9e-04,0.000655,0.000354,0.000178,0.000358,0.001051,0.000217,0.000734,0.000193,0.000589,0.000535,0.000518,0.000697,0.000895,0.000147,0.000886,0.000524,0.000524,0.000272,0.000657,0.000192,0.000159,0.00033,0.000538,0.000433,0.000218
0.001286,0.000266,0.001509,0.000607,0.000496,0.002131,0.00119,0.001108,0.000823,0.002018,0.001058,0.000775,0.000992,0.00047,0.000995,0.001233,0.000423,0.001889,0.001611,0.001081,0.000865,0.002467,0.000859,0.001532,0.000223,0.000642,0.001081,0.000846,0.000945,0.000534,0.001726,0.001499,0.001472,0.001296,0.000615,0.001232,0.001137,0.001751,0.002092,0.001411,0.001206,0.000401,0.002514,0.000906,0.000995,0.001092,0.000403,0.000856,0.000491,0.000661,0.001227,0.000255,0.000686,0.000618,0.000925,8.8e-05,0.000842,0.000729,0.000407,0.000373,0.000622,0.000405,6e-04,0.000681,0.000151,0.000619,0.001202,0.000424,0.000235,0.000195,0.001101,0.000273,0.000954,0.000773,0.00104,0.000162,0.000665,0.000619,0.000535,0.000193,0.000353,0.000955,0.000463,0.000797,0.000706,0.000559,0.000717,0.000643,4e-04,0.001291,0.000565,0.000308,0.000611,0.000758,0.000588,0.000785,0.000733,0.001199,0.000392,0.000598,0.001785,0.000589,0.00125,0.00037,0.000413,0.000686,0.000469,0.000933,0.000866,6.1e-05,0.001409,0.000346,0.000909,0.000141,0.001081,0.000339,0.00134,0.00067,0.000658,0.000905,0.000934
0.002581,0.001038,0.00105,0.001336,0.000332,0.001927,0.000267,0.003703,0.003022,0.003439,0.000644,0.000501,0.002791,0.002251,0.000849,0.002072,0.000883,0.000971,0.002411,0.001539,0.000382,0.003631,0.003479,9.6e-05,0.000337,0.001251,0.001485,0.0022,0.001065,0.000494,0.001395,0.003645,0.003174,0.002091,0.001051,0.000788,0.001409,0.001874,0.002038,0.00074,0.001082,0.002352,0.003535,0.002317,0.000288,0.001844,0.00096,0.000598,0.000536,0.000835,0.001656,0.000939,0.001315,0.000627,0.001643,0.000207,0.000871,0.001718,0.000743,0.000765,0.001127,0.001601,0.001028,0.001234,0.000706,0.000965,0.001784,0.001764,0.001036,0.00066,0.001381,0.001523,0.000475,0.001707,0.002291,0.001766,0.00068,0.000863,0.001219,0.00068,0.00075,0.000627,0.000471,0.000691,0.000982,0.001136,0.00141,0.001311,0.001445,0.002525,0.001244,0.001201,0.001414,0.000295,0.001728,0.001422,0.002009,0.001695,0.000811,0.001874,0.002721,0.002034,0.000628,0.001183,0.001524,0.00105,0.00054,0.00092,0.000873,0.000435,0.002103,0.002323,0.000497,0.000716,0.000982,0.001284,0.001459,0.001954,0.000535,0.00081,0.000721
0.00026,0.003148,0.002865,0.002767,0.001885,0.002648,0.003231,0.00361,0.003741,0.001552,0.001508,0.001432,0.002537,0.001951,0.003739,0.000628,0.001923,0.003439,0.001988,0.002646,0.003226,0.001079,0.002366,0.003001,0.00143,0.001419,0.001553,0.00152,0.002673,0.001542,0.001526,0.003594,0.003103,0.002824,0.003087,0.001284,0.003414,0.006059,0.004786,0.004101,0.003339,0.00317,0.004703,0.002151,0.001559,0.000663,0.00132,0.001474,0.001346,0.001936,0.002647,0.001839,0.002255,0.001274,0.001845,0.000673,0.000573,0.003418,0.001123,0.002741,0.00143,0.001153,0.001726,0.001915,0.00134,0.001033,0.001735,0.002084,0.000206,0.000436,0.001082,0.001694,0.0017,0.002693,0.002019,0.000839,0.00149,0.002596,0.00142,0.000467,0.002044,0.002226,0.001192,0.001198,0.001488,0.001824,0.001168,0.001389,0.001488,0.001415,0.002127,0.000754,0.00144,0.002095,0.002654,0.002006,0.002119,0.002512,0.001113,0.002898,0.005271,0.002697,0.003111,0.001787,0.00073,0.000579,0.000889,0.001656,0.001853,0.001181,0.002951,0.002566,0.0014,0.000762,0.000724,0.000352,0.0021,0.002234,0.002006,0.0016,0.000668
0.0027,0.004401,0.004061,0.002712,0.002512,0.005757,0.006669,0.006184,0.004535,0.002008,0.000373,0.002621,0.003834,0.000786,0.005935,0.00292,0.001707,0.005136,0.002256,0.006358,0.000807,0.001345,0.002652,0.00217,0.003293,0.001474,0.001828,0.005005,0.00642,0.00299,0.003291,0.003032,0.002256,0.005452,0.008245,0.005804,0.001484,0.006632,0.00732,0.001488,0.005255,0.004176,0.004744,0.007095,0.002603,0.004414,0.000259,0.003013,0.001671,0.003477,0.001822,0.001828,0.001637,0.003653,0.001757,0.002298,0.000711,0.003307,0.002492,0.003893,0.005939,0.002932,0.004022,0.00065,0.00043,0.00149,0.00075,0.001974,0.002484,0.001312,0.000798,0.001482,0.003749,0.001141,0.001117,0.000812,0.003637,0.001512,0.001616,0.000253,0.003001,0.000819,0.003814,0.004589,0.002647,0.000852,0.001685,0.002082,0.000158,0.000541,0.002581,0.002307,0.002617,0.001326,0.004982,0.003517,0.002577,0.002418,0.001684,0.001349,0.005105,0.00256,0.002434,0.002723,0.001884,0.003698,0.000972,0.00333,0.001337,0.002039,0.003031,0.002496,0.002724,0.001706,0.00219,0.000432,0.000565,0.002014,0.003051,0.000384,0.001653
0.010426,0.00604,0.005555,0.005,0.001675,0.00306,0.00253,0.003314,0.004323,0.008043,0.007049,0.00651,0.002465,0.002353,0.007237,0.006958,0.005386,0.007452,0.006755,0.01009,0.008718,0.007636,0.003778,0.003384,0.003784,0.002751,0.004724,0.00969,0.004088,0.002144,0.004515,0.006856,0.009341,0.009928,0.00143,0.004369,0.004727,0.006564,0.001368,0.00517,0.008666,0.004264,0.007942,0.007606,0.007179,0.007254,0.00503,0.004251,0.002406,0.004151,0.002923,0.00365,0.003525,0.004774,0.003955,0.004371,0.002378,0.00216,0.004714,0.00136,0.004811,0.003887,0.006763,0.004554,0.002983,0.001474,0.001824,0.005666,0.002235,0.002446,0.001716,0.003808,0.001574,0.002303,0.00259,0.002806,0.004985,0.003545,0.00291,0.0023,0.002611,0.003067,0.005797,0.001971,0.001929,0.002382,0.004995,0.003819,0.001875,0.001102,0.002932,0.002047,0.001414,0.001795,0.002799,0.000825,0.003103,0.005244,0.003628,0.001156,0.007687,0.008023,0.004049,0.0034,0.000905,0.004022,0.003997,0.00402,0.004268,0.003272,0.001296,0.004163,0.003245,0.004497,0.003631,0.00265,0.001329,0.003213,0.001897,0.003247,0.004391
0.009437,0.004446,0.002325,0.0032,0.004434,0.002442,0.001916,0.005657,0.007583,0.003402,0.004682,0.002533,0.003375,0.002111,0.005673,0.00366,0.002354,0.004082,0.005362,0.004343,0.007629,0.001418,0.003038,0.002851,0.001792,0.003644,0.005178,0.008414,0.006017,0.00354,0.001749,0.002297,0.004815,0.002303,0.006361,0.001155,0.002604,0.004093,0.003964,0.005709,0.010785,0.010807,0.008107,0.004955,0.006797,0.008864,0.005225,0.002237,0.000411,0.001633,0.001167,0.001764,0.000958,0.002735,0.000704,0.003026,0.002623,0.003071,0.004465,0.002392,0.004027,0.005447,0.003545,0.002823,0.000428,0.001314,0.002563,0.005248,0.00537,0.001734,0.003284,0.004417,0.004866,0.004017,0.002311,0.00313,0.004896,0.005015,0.002254,0.001216,0.002882,0.000803,0.004513,0.004433,0.004393,0.005756,0.00449,0.002941,0.001605,0.001305,0.001997,0.001293,0.001371,0.002195,0.002907,0.002954,0.004752,0.002038,0.003158,0.003637,0.008894,0.006968,0.002286,0.00214,0.001148,0.003984,0.004802,0.002155,0.003648,0.004,0.003387,0.002439,0.003817,0.00415,0.005572,0.003122,0.003568,0.005884,0.004583,0.004163,0.002454
0.003249,0.003314,0.001792,0.002975,0.003512,0.00644,0.004752,0.004066,0.002166,0.000849,0.002224,0.003769,0.003627,0.004803,0.002017,0.001669,0.001632,0.001888,0.001694,0.003784,0.002829,0.002374,0.003499,0.003685,0.003641,0.002854,0.001663,0.005935,0.003092,0.001814,0.001378,0.002735,0.000138,0.001943,0.002752,0.004851,0.000947,0.002117,0.001836,0.004292,0.002771,0.001333,0.002708,0.004493,0.001971,0.001695,0.001293,0.002324,0.000738,0.001648,0.000803,0.00102,0.001489,0.001403,0.002707,0.000514,0.001442,0.001377,0.002625,0.002013,0.003174,0.001496,0.003162,0.002229,0.00229,0.002024,0.000836,0.004414,0.003044,0.002116,0.003601,0.00097,0.000731,0.001203,0.002303,0.00109,0.002131,0.003101,0.001983,0.001932,0.001484,0.003589,0.001663,0.001051,0.002613,0.001553,0.001255,0.001092,0.001617,0.002158,0.000779,0.001595,0.001211,0.001632,0.000865,0.001692,0.001824,0.003625,0.000314,0.002617,0.004368,0.001256,0.001354,0.00038,0.000992,0.002075,0.000883,0.001822,0.003915,0.000767,0.001576,0.000358,0.001135,0.001683,0.001662,0.001219,0.002594,0.001988,0.002115,0.000934,0.002686
0.001116,0.002533,0.002481,0.00104,0.003223,0.001283,0.002165,0.005686,0.002788,0.001927,0.000838,0.002214,0.002512,0.003378,0.001235,0.000961,0.002391,0.001361,0.001926,0.002465,0.001571,0.001429,0.004073,0.002314,0.003338,0.003604,0.002263,0.002859,0.00293,0.001829,0.00165,0.001273,0.00263,0.000699,0.001515,0.002301,0.001572,0.000498,0.000774,0.001155,0.001413,0.002123,0.001921,0.005349,0.005043,0.004347,0.000404,0.001619,0.002165,0.002862,0.002507,0.001861,0.001112,0.000942,0.001525,0.002538,0.000427,0.000952,0.002116,0.002438,0.003969,0.003144,0.002422,0.001479,0.000204,0.00144,0.001722,0.003219,0.000605,0.001158,0.002056,0.0019,0.000557,0.000979,0.001981,0.00169,0.002266,0.002543,0.002142,0.000267,0.000543,0.002907,0.001816,0.001856,0.001219,0.001535,0.000925,0.000584,0.001236,0.000234,0.001246,0.000626,0.000845,0.001514,0.002635,0.000608,0.001136,0.001477,0.001353,0.00223,0.002238,0.001565,0.000915,0.001037,0.001043,0.002021,0.001798,0.001084,0.000805,0.00199,0.001746,0.000979,0.0016,0.000878,0.000924,0.000928,0.000926,0.000231,0.001233,0.000677,0.001171
0.003446,0.000791,0.001148,0.000885,0.001083,0.001571,0.003182,0.003094,0.003662,0.001192,0.001951,0.000869,0.000907,0.001357,0.001861,0.00103,0.00209,0.00116,0.001762,0.000831,0.000424,0.002033,0.003429,0.003284,0.000201,0.00275,0.00148,0.000777,0.002627,0.002605,0.00109,0.002425,0.001965,0.002036,0.001042,0.000409,0.001379,0.00091,0.000604,0.001922,0.003167,0.001852,0.000705,0.003027,0.001357,0.001691,0.001905,0.000652,0.00141,0.001334,0.000538,2.8e-05,0.000437,0.000566,0.000947,0.001816,0.001568,0.000258,0.000962,0.000187,0.001331,0.001077,0.000842,0.000653,0.000311,0.000586,0.000704,0.000634,0.001249,0.001711,0.000752,0.000856,0.001173,0.000664,0.000647,0.000935,0.001189,0.001046,0.000289,0.000469,0.000563,0.001123,0.000354,0.001269,0.000628,0.00072,0.000841,0.000888,0.000729,0.000687,0.001125,0.000492,0.000603,0.000586,0.000957,0.00146,0.000362,0.000739,0.000705,0.002037,0.00315,0.000437,0.000609,0.000654,0.000655,0.00071,0.001127,0.001344,0.000706,0.001196,0.00108,0.001579,0.002139,0.000906,0.000631,0.001576,0.001601,0.000442,0.00029,0.000619,0.000461
0.001663,0.001043,0.000251,0.001168,0.000269,0.000632,0.00165,0.001799,0.002245,0.001166,0.002359,0.002049,0.001569,0.001571,0.001039,0.000288,8e-04,0.000776,0.002191,0.000629,0.000514,0.000512,0.001598,0.001395,0.001009,0.002465,0.001932,0.001961,0.001544,0.000511,0.000356,0.001574,0.000689,0.00119,0.000643,0.000918,0.001097,0.000733,0.000282,0.001981,0.000798,0.000462,0.00099,0.000179,0.001194,0.000977,0.000944,0.000713,0.000566,0.000494,0.000499,0.000249,0.000483,0.000384,0.001197,7.6e-05,0.000397,0.000485,0.000302,0.000195,0.000551,0.000721,0.001,0.00077,0.00028,3e-05,0.000135,0.000807,0.000748,0.000591,0.000502,0.000515,0.000303,0.000248,0.000613,0.000803,0.001038,0.000699,0.000275,0.000798,0.000133,0.000402,9.7e-05,0.000922,0.000503,0.000747,0.000473,0.000172,0.000823,0.000149,0.00022,0.000253,0.000363,6.9e-05,0.000334,0.000297,0.000379,0.000195,0.001221,0.000915,0.001702,0.000246,0.000141,0.000338,0.000186,0.000445,0.000783,0.000868,0.000386,0.000398,0.001124,0.000575,0.000945,0.001124,0.00045,0.000669,0.000627,0.000521,0.000297,0.000142,0.000387
0.001157,0.001519,0.001859,0.001213,0.000584,0.001226,0.00141,0.001587,0.004141,0.002396,0.000209,0.003234,0.002347,0.002987,0.001337,0.001856,0.001543,0.001596,0.003905,0.001811,0.001072,0.002712,0.002992,0.001624,0.001817,0.003254,0.001498,0.001663,0.00133,0.001321,0.000517,0.001006,0.002107,0.001831,0.001904,0.002524,0.001649,0.000839,0.000825,0.001372,0.001631,0.001627,0.001414,0.000633,0.00149,0.001521,0.000954,0.000681,0.000439,0.000685,0.000801,0.00063,0.00023,0.000889,0.001503,0.000689,0.001025,0.000416,0.000492,0.000281,0.000644,0.000911,0.000873,3.8e-05,0.000312,0.000221,0.000119,0.000698,0.000394,0.000711,0.000469,0.000454,0.000405,0.000866,0.000738,0.001127,0.000209,0.000822,0.000727,0.000896,0.000467,0.000471,0.000633,0.001084,0.000483,0.000876,0.000903,0.000301,0.000693,0.000415,0.000348,0.000865,0.000587,0.000408,0.000996,0.000397,0.001319,0.000534,0.001236,0.000524,0.000956,0.000369,0.001017,0.001105,0.00089,0.00034,0.000256,0.001269,0.000778,0.000711,0.000921,0.000261,0.000468,0.000704,0.000566,0.000292,8.5e-05,0.000499,0.000817,0.000467,0.000645
0.00259,0.003227,0.00372,0.003843,0.001527,0.004388,0.004883,0.002935,0.003153,0.004088,0.002235,0.00535,0.005628,0.005204,0.003573,0.002167,0.004207,0.004679,0.005349,0.0047,0.003303,0.004328,0.006523,0.002929,0.002106,0.00077,0.00322,0.001999,0.001934,0.000291,0.000195,0.001038,0.002631,0.003861,0.003238,0.000494,0.000567,0.001559,0.000529,0.001124,0.003038,0.003231,0.001846,0.002653,0.001417,0.001122,0.002214,0.0017,0.00072,0.000862,0.000481,0.000779,0.001019,0.00142,0.00045,0.000277,0.001105,0.000981,0.001475,0.001853,0.001132,0.000161,0.000865,0.000813,0.000144,0.000341,0.000333,0.000708,0.00126,0.001101,0.000721,0.000566,0.000367,0.000685,0.000339,0.000435,0.000937,0.001241,0.000694,0.000533,0.001145,0.001412,0.001832,0.001179,0.000821,0.00076,0.000902,0.001518,0.000948,0.000709,0.000243,0.001088,0.001018,0.000509,0.000652,0.001361,0.000613,0.001524,0.00186,0.000478,0.001494,0.00036,0.001667,0.000601,0.001259,0.001615,0.000571,0.00111,0.001005,0.001294,0.001666,0.001476,0.000869,0.000679,0.000322,0.000445,0.000628,0.001152,0.000866,0.000604,0.000698
0.002869,0.004608,0.002028,0.0038,0.002857,0.006588,0.003933,0.001954,0.002078,0.003285,0.003978,0.006283,0.001855,0.004861,0.006032,0.006887,0.001284,0.001944,0.000256,0.002616,0.002273,0.001761,0.003807,0.004523,0.002238,0.000675,0.004172,0.004142,0.002177,0.001455,0.000403,0.002664,0.001521,0.001342,0.000973,0.002154,0.001536,0.00132,0.00222,0.001605,0.00368,0.00318,0.003666,0.003064,0.002093,0.00216,0.001676,0.001506,0.000911,0.001417,0.001672,0.00146,0.00072,0.001135,0.000585,0.000475,0.001191,0.001434,0.00091,0.001571,0.001073,0.000509,0.00089,0.000572,0.000774,0.000727,0.000264,0.000198,0.001161,0.001229,0.001191,0.000821,0.000506,0.000214,0.000195,0.000163,0.000254,8e-04,0.0013,0.000877,0.000969,0.001083,0.001263,0.001676,0.000655,0.001281,0.000537,0.000594,0.000747,0.001092,0.000599,0.001335,0.001314,0.001811,0.001723,0.001448,0.001235,0.001354,0.000948,0.001444,0.001172,0.000353,0.000928,0.001107,0.001898,0.000437,0.000476,0.000421,0.001191,0.001363,0.000947,0.000508,0.000617,0.000751,0.000177,0.000446,0.000781,0.001007,0.000705,0.000612,0.000256
0.002475,0.001826,0.003229,0.000943,0.002712,0.003325,0.001852,0.000912,0.001605,0.001333,0.000305,0.00305,0.002003,0.00327,0.001223,0.002734,0.004488,0.002915,0.003105,0.003777,0.001206,0.002555,0.000904,0.003358,0.003516,0.002167,0.004544,0.002217,0.001739,0.003311,0.002172,0.003459,0.000969,0.000851,0.001154,0.002551,0.00196,0.003585,0.000515,0.001335,0.001162,0.002956,0.003306,0.001445,0.000644,0.001134,0.000932,0.001403,0.000386,0.000963,0.000914,0.000674,0.002202,0.001147,0.000493,0.000881,0.000984,0.000984,0.000804,0.001057,0.001291,0.000272,0.001185,0.000769,0.000696,0.000383,0.001038,0.001019,0.000779,0.000949,0.000539,0.000828,0.001071,0.00057,0.000937,0.000571,0.000457,0.000544,0.000649,0.000649,0.000483,0.000826,0.000125,0.000741,0.000264,0.00031,0.001424,0.001587,0.001597,0.000294,0.000467,0.000992,0.000252,0.00115,0.001104,0.00041,0.000998,0.001631,0.002593,0.001985,0.001783,0.000567,0.000527,0.001077,0.000509,0.000894,0.000998,0.000906,0.001561,0.000936,0.000857,0.000704,0.000916,0.001535,0.000615,0.000896,0.000779,0.000923,0.000121,0.000124,0.000414
0.002223,0.002742,0.000601,0.002195,0.001391,0.002257,0.000295,0.000847,0.000722,0.001009,0.002755,0.002998,0.001974,0.000603,0.000736,0.001574,0.002797,0.000423,0.002872,0.001042,0.001429,0.000527,0.000939,0.002524,0.001115,0.000406,0.002626,0.003992,8.5e-05,0.001838,0.00076,0.002004,0.00306,0.002839,0.003925,0.001972,0.000588,0.004188,0.002732,0.002513,0.001958,0.002876,0.001517,0.001081,0.000104,0.001096,0.001679,0.001652,0.001562,0.000817,0.000976,0.000605,0.002244,0.002658,0.000991,0.000587,0.000973,0.001269,0.001317,0.001003,0.001064,0.000971,0.001701,0.00051,0.000255,0.001122,0.001243,0.000958,0.001353,0.000538,0.000578,0.000662,0.000522,0.000543,0.001145,0.001301,0.001487,0.000691,0.000298,0.000192,0.000703,0.000682,0.000787,0.000305,0.000697,0.000501,0.001146,0.000712,0.001051,0.000902,0.000628,0.001056,6e-04,0.000807,0.000248,0.00049,0.001097,0.001124,0.001972,0.001855,0.002224,0.000291,0.001346,0.000375,0.000462,0.001211,0.001294,0.000941,0.000533,0.001019,0.000546,0.000261,0.00067,0.001705,0.001179,0.000547,0.000787,0.000647,0.000544,0.000294,0.000746
0.002726,0.000804,0.00151,0.003065,0.004216,0.003245,0.003735,0.002038,0.00262,0.002654,0.002587,0.001426,0.000939,0.001386,0.002173,0.00052,0.00252,0.002945,0.000873,0.001611,0.002729,0.00109,0.000448,0.002134,0.002379,0.001685,0.001578,0.001102,0.003079,0.002202,0.001312,0.001803,0.000826,0.002632,0.002047,0.000706,0.001256,0.00395,0.003134,0.000277,0.000534,0.000378,0.002345,0.002566,0.001966,0.000975,0.001112,0.002352,0.001135,5.5e-05,0.00023,0.000485,0.001795,0.001271,0.001372,0.000544,0.001364,0.00041,0.001277,0.000136,0.001132,0.001036,0.00126,0.001015,0.000771,0.000742,0.000624,0.001444,0.002112,0.001632,0.001255,0.001424,0.000936,0.000527,0.000869,0.000811,0.000467,0.000292,0.000642,0.000198,0.000792,0.000676,0.00023,0.001083,0.000308,0.000834,0.001102,0.001102,0.000431,0.000501,0.001108,0.000404,0.000617,0.000764,0.00053,0.000578,0.001338,0.001598,0.000917,0.001407,0.000802,0.000665,0.000997,0.000817,0.001111,0.000376,0.000279,0.00136,0.001315,0.000718,0.001654,0.001151,0.000689,0.001427,0.000939,0.000875,0.000416,0.000534,0.000434,0.00075,0.000556
0.001734,0.003101,0.000589,0.001941,0.000705,0.001137,0.001148,0.000384,0.001231,0.000801,0.003289,0.001588,0.000223,0.001055,0.001768,0.001364,0.000468,0.001432,0.001079,0.000326,0.002364,0.001662,0.000647,0.001321,0.001496,0.000913,0.001205,0.000479,0.001983,0.002061,0.002021,0.001281,0.000566,0.001775,0.001151,0.000182,0.001135,0.001682,0.000901,0.0017,0.00035,0.001312,0.002916,0.001963,0.000558,0.000483,0.000664,0.001233,0.00104,0.000694,0.001326,0.000865,0.00112,0.000956,0.00045,6.6e-05,0.00078,0.000576,0.000839,0.001163,0.001405,0.000932,0.001631,0.000971,0.000827,0.00101,0.000942,0.000383,0.000344,0.001109,0.00155,0.00078,0.000998,0.000801,0.000784,0.00123,0.000907,0.00041,0.000663,0.000327,0.000264,0.000458,0.000408,0.000678,0.000458,0.000315,0.000451,0.000308,0.000248,0.000618,0.001409,0.001173,0.000399,0.000731,0.000734,0.00022,0.000754,0.000689,0.000702,0.001328,0.001914,0.001506,0.001768,0.000136,0.000714,0.00107,0.000773,0.001286,0.001288,0.00153,0.001022,0.000501,0.000697,0.000452,0.000557,0.000459,0.000973,0.000259,0.000758,0.000153,0.000288
0.001466,0.001445,0.002596,0.001214,0.000695,0.000267,9e-04,0.001042,0.000826,6.7e-05,0.001987,0.000598,0.000457,0.001175,0.000844,0.000503,0.000438,0.002075,0.000991,0.001191,0.00146,0.000882,0.001333,0.001557,0.001468,0.001278,0.000855,0.001155,0.00105,0.001355,0.000702,0.000238,8e-04,0.001122,0.000701,7e-04,0.000399,0.001302,0.000712,0.00148,0.001113,0.000441,0.001754,0.000441,0.000195,0.000677,0.000326,0.000405,0.000676,0.001009,0.000541,0.000689,0.000687,0.000419,0.000542,0.000293,0.000236,0.000457,0.000822,0.001257,0.000927,0.00076,0.000801,0.000289,0.000471,0.000908,0.000542,0.000425,0.000484,0.000852,0.000192,0.000569,0.000315,0.000374,0.000625,0.001152,0.000755,0.00025,0.000184,0.000293,0.000404,0.000649,0.000923,0.000747,0.000332,0.000406,8.8e-05,0.000312,0.000295,0.000675,0.001093,0.000186,0.000497,0.000118,0.000155,0.000322,0.000565,0.000943,0.000823,0.001604,0.001076,9.8e-05,0.000721,0.000897,0.000395,0.000303,0.000189,0.000905,0.000481,0.000376,0.000207,0.000622,0.00106,0.000407,0.000112,0.000786,0.000586,0.000182,0.000951,0.000764,0.000754
0.000806,0.000801,0.001371,0.000324,0.001124,0.000616,0.00099,0.000734,0.000398,0.000384,0.000996,0.000174,0.000214,0.000797,0.000313,0.000878,0.000587,0.001201,0.000766,0.000729,0.000482,0.00078,0.001053,0.000102,0.000503,0.000731,0.000201,0.000749,0.000263,0.000499,0.000917,0.000266,0.000344,0.000864,0.000614,0.000644,0.000746,0.000634,0.000514,0.000338,0.000647,0.000732,0.000863,0.000468,0.000389,0.000474,0.000312,0.000548,0.000707,0.000371,0.000781,0.000347,0.000483,0.000232,0.000371,0.000211,0.000622,0.000503,0.00059,0.000747,0.000236,0.00031,0.000242,0.000178,2e-04,0.000439,0.000158,0.000139,0.000813,0.000171,0.000116,0.000427,0.00035,0.000287,0.00069,0.000361,0.000429,0.000553,0.000336,0.000231,0.000396,0.000566,0.000521,0.000646,7.9e-05,0.000276,0.000441,0.00013,0.000455,0.000335,0.000219,0.000419,8e-05,0.000205,5.8e-05,0.00028,3.6e-05,0.000389,0.000954,0.001315,0.000693,0.000803,0.000872,0.000706,0.000544,0.000489,0.000125,0.000549,0.000182,0.000193,0.000244,0.000143,0.000422,0.000616,0.000379,0.000393,0.000693,0.00017,0.000556,0.000219,0.000237
0.000226,0.000196,0.000393,0.000192,0.000295,0.000224,0.000303,0.00014,0.000293,0.000148,0.000261,0.000177,4.6e-05,0.000227,0.000523,0.00023,0.00025,0.000237,5e-05,0.000138,0.00025,0.000247,0.000168,0.000164,0.000458,0.000205,0.000291,0.000155,0.000155,2e-04,0.000263,0.000104,0.000213,7.3e-05,0.000311,5.3e-05,0.000198,0.000159,0.000181,0.000279,0.000317,0.000255,0.000203,0.000108,0.000138,6.8e-05,0.000213,0.000124,7.7e-05,0.000107,0.000259,0.000117,0.000264,9.2e-05,0.000111,0.000307,8.1e-05,0.000166,0.000158,0.000244,0.000123,0.000192,0.000156,0.000121,8.3e-05,0.000147,0.000172,8.1e-05,0.000238,0.000142,0.00018,6e-05,8e-06,8.7e-05,0.000214,0.000135,0.000155,0.000141,2.7e-05,7.4e-05,0.000199,0.000276,0.000158,0.000108,0.000158,2.3e-05,4.4e-05,0.000214,0.000142,6.8e-05,5.9e-05,7.9e-05,0.000179,0.000167,3.7e-05,9.9e-05,4e-05,9.9e-05,0.000154,0.000203,0.00037,0.000257,0.000273,0.000112,0.000223,0.000109,8e-05,1.3e-05,0.000182,0.000165,9.9e-05,0.00013,9.4e-05,0.000172,0.000154,0.000188,5.3e-05,0.000121,0.000107,0.000136,0.000101
0.000342,0.000174,0.000412,0.00018,0.000304,0.000252,0.000371,0.000497,0.000494,0.000177,0.000204,0.000192,9e-05,0.000431,0.000545,0.000303,0.000233,0.000154,0.00017,6.6e-05,0.000204,0.000419,0.000195,0.000182,0.000217,0.000167,0.000166,0.000248,5.8e-05,0.000236,0.000201,0.000182,0.000138,0.000106,2.8e-05,0.000136,0.000157,0.00022,0.000147,0.000277,0.000307,0.000245,0.000165,0.000266,5.7e-05,0.000184,0.000167,7.6e-05,4e-05,5.2e-05,0.000325,0.000142,0.000222,0.000123,7e-05,0.000322,0.00019,8.3e-05,0.000142,0.00033,0.000223,0.000236,9.7e-05,9.3e-05,9.7e-05,0.000112,0.000199,0.000202,0.000268,0.000107,0.000252,6e-05,0.000111,0.000144,0.000101,0.000106,0.000127,0.000168,0.000104,5.3e-05,7.1e-05,0.000201,0.000104,0.000222,3.1e-05,0.000161,0.000181,0.000211,0.000172,0.000107,9.9e-05,1.4e-05,0.000109,3.7e-05,5.8e-05,0.000136,1.1e-05,6.5e-05,0.000102,0.000306,0.000276,0.000293,0.000236,9.5e-05,8.1e-05,0.000219,0.000158,0.000214,5.2e-05,0.000137,0.000269,0.000138,6.1e-05,0.000301,5.8e-05,8.1e-05,0.000214,3e-05,7.3e-05,6.7e-05,1.5e-05
5.9e-05,0.000248,0.000462,0.000237,0.000181,0.000243,4.2e-05,0.000221,0.000131,7e-05,0.000353,0.000128,5.8e-05,0.000549,0.000176,0.000174,9.1e-05,0.000145,0.00012,0.000214,0.000261,0.000428,0.000133,0.000121,0.000216,0.000117,0.000254,0.000256,0.00025,9.1e-05,0.000207,0.000152,8.6e-05,8.8e-05,0.000139,0.000133,0.000248,7.2e-05,0.000132,0.000224,0.000233,0.000134,0.000281,0.000136,0.00016,0.000181,0.000222,8.1e-05,5.1e-05,0.000105,0.000207,6.5e-05,0.000363,0.000163,2.2e-05,0.00024,5e-05,0.000178,0.000141,0.00018,0.000111,2e-04,0.000184,4e-05,8.9e-05,4.7e-05,0.000134,6.3e-05,0.000114,8.2e-05,2.5e-05,0.000124,8.6e-05,3.5e-05,7.3e-05,6.8e-05,4.4e-05,7.2e-05,4.1e-05,0.000113,5.9e-05,0.000227,6e-05,0.000322,9.5e-05,0.000202,0.000104,0.000123,0.000171,0.000135,0.000249,7.4e-05,2.9e-05,3.9e-05,7.8e-05,7e-05,2.9e-05,0.000142,0.000128,0.00029,0.000327,0.000111,0.000127,0.000148,5.7e-05,0.000122,5e-05,0.000178,8e-05,0.000153,0.000237,3.3e-05,0.000224,5.9e-05,9.5e-05,7.5e-05,0.00018,7.7e-05,3.6e-05,8.7e-05,3e-05
0.000422,0.000154,0.000324,7.7e-05,0.000251,1e-04,0.000175,0.000104,0.000176,4.4e-05,0.00024,0.000125,5.4e-05,0.00034,0.000392,0.000251,0.00012,0.000122,5.6e-05,3e-05,0.000186,0.000231,0.000328,0.00014,7.4e-05,7.3e-05,0.000219,0.000316,6.7e-05,0.000126,0.000142,0.000223,0.000139,7.7e-05,4.7e-05,4.1e-05,0.000244,0.000214,0.000102,0.000156,0.000276,0.000167,0.000209,0.000123,9e-05,2.7e-05,7.8e-05,0.000131,0.000175,0.000128,0.00028,8.9e-05,0.00027,8e-05,4.5e-05,0.000155,1.1e-05,0.000159,0.000156,0.000176,0.000128,4.9e-05,5.9e-05,5.7e-05,0.000107,0.000196,3.8e-05,3.3e-05,0.000147,7.9e-05,8.4e-05,7.3e-05,0.000133,0.000126,0.000214,7.3e-05,0.000143,5.3e-05,3.1e-05,8.7e-05,0.000123,0.000188,6.2e-05,0.000254,4.1e-05,0.000225,0.000195,0.000213,6e-05,7.7e-05,0.000153,8.6e-05,6.2e-05,4.5e-05,7.1e-05,5.5e-05,8.4e-05,0.000223,0.000131,0.000132,0.000204,8e-05,0.000218,6e-05,4.5e-05,4.2e-05,0.000123,0.000133,1.6e-05,8.1e-05,0.000286,8.9e-05,0.000314,0.000188,0.000147,9.4e-05,0.000187,7.6e-05,7.7e-05,7.9e-05,5.2e-05
0.000262,0.000255,0.00034,5.3e-05,0.00027,0.00016,0.000217,0.000234,0.00026,6.5e-05,7.5e-05,0.000233,4.5e-05,0.000176,0.000299,9.4e-05,7.4e-05,0.000224,0.000195,0.000125,6.3e-05,0.000181,0.000262,0.000314,0.000271,4.2e-05,0.000262,0.000146,0.000189,7e-05,0.000285,0.000247,0.000184,6.2e-05,0.000189,0.000177,0.000183,0.000261,0.000154,7.9e-05,0.000253,0.000262,0.000332,0.000331,0.000237,0.00012,0.000125,4.2e-05,0.000121,1.1e-05,0.000214,5.1e-05,0.000281,0.000191,5.9e-05,0.000153,0.00011,0.000158,6.7e-05,0.000144,9.3e-05,0.000119,6.2e-05,8.5e-05,8.3e-05,0.000118,0.00013,2.8e-05,0.000139,4.2e-05,0.000127,0.000111,0.000107,0.00012,0.00017,4.9e-05,0.000104,5.5e-05,0.000116,4e-05,0.000114,0.000217,7.5e-05,0.000238,5.9e-05,0.000176,0.000108,0.000205,4.9e-05,0.000119,6.2e-05,8.5e-05,6.7e-05,4.1e-05,4.5e-05,5.4e-05,0.000109,0.000133,0.000141,0.000113,0.000219,0.000107,0.000135,8.5e-05,5.3e-05,0.00015,0.000142,3.4e-05,8.9e-05,0.000117,0.000232,9.7e-05,0.000274,0.000193,6.4e-05,5e-05,0.000164,3.7e-05,0.000106,9.8e-05,3.4e-05
0.000202,0.000158,0.000322,1e-05,0.000159,0.000121,0.000109,0.000261,0.000169,2.1e-05,0.000267,0.000164,0.000171,0.000412,0.000152,7e-05,0.000274,0.000178,0.000226,0.000314,0.000341,0.000226,6.3e-05,9.2e-05,5.4e-05,0.00019,0.000199,0.000204,0.000109,7.2e-05,0.000165,0.000161,6.8e-05,8.8e-05,0.000175,9.9e-05,0.000117,0.000189,0.000131,0.000316,0.000375,5.2e-05,0.000529,5.4e-05,0.000191,1.6e-05,0.000125,5.5e-05,0.000111,6.9e-05,0.000208,4.8e-05,0.000236,5.3e-05,0.000191,0.000207,7.4e-05,0.000109,0.000163,7.9e-05,0.000145,0.000109,6.7e-05,0.000155,5.2e-05,5.7e-05,8e-05,0.000109,0.000214,6e-05,0.000222,9.3e-05,4.7e-05,0.000143,0.000139,9.4e-05,2.8e-05,0.000122,5.9e-05,8.8e-05,0.000149,0.000219,0.000243,0.000113,5.8e-05,0.000166,9.9e-05,0.000215,6.7e-05,4.4e-05,7.5e-05,0.000141,0.000129,0.000103,8.8e-05,3.8e-05,7.7e-05,0.000184,5.7e-05,0.000155,0.000289,6.7e-05,2.7e-05,8.6e-05,9.9e-05,0.000122,0.000143,0.000207,9.1e-05,0.000141,5.5e-05,4.7e-05,0.000116,0.000124,0.000105,0.000112,0.000201,0.00011,5.5e-05,1.4e-05,3.1e-05
0.000158,0.000186,0.000276,0.000124,0.000245,0.00015,0.000275,0.000171,0.000305,6.3e-05,0.000246,0.000135,0.000121,0.000288,0.000301,0.000139,0.000362,2.1e-05,0.000104,0.000175,0.000163,0.000398,0.000192,0.000152,0.000132,0.000295,0.000303,9.3e-05,0.000127,0.000174,8.6e-05,0.000158,5.5e-05,5.2e-05,8.2e-05,0.000109,0.00023,0.000108,0.00018,0.000322,0.000194,0.000288,0.000477,0.000296,4.8e-05,0.000192,0.000229,8.7e-05,8.8e-05,0.000152,0.00017,7e-05,0.000257,0.000163,0.000102,0.000309,0.000127,0.000127,1e-04,5.4e-05,0.000174,0.000103,9.7e-05,0.000109,5.2e-05,0.000107,3.8e-05,0.000125,0.000128,2.4e-05,0.000293,0.000248,0.000227,0.00014,0.000249,0.000108,1.3e-05,9.2e-05,0.000112,0.000126,4.6e-05,0.000137,7e-05,0.000286,7.3e-05,6.4e-05,8.1e-05,0.000259,0.000175,5.8e-05,0.000122,3.8e-05,0.000134,0.000123,1.4e-05,0.000151,0.000119,0.000136,9e-05,0.000129,0.000232,7.9e-05,0.000204,3.9e-05,6.8e-05,0.000244,4.9e-05,0.000206,4.6e-05,8.1e-05,0.000149,7.7e-05,6.7e-05,0.000126,8.1e-05,4.1e-05,0.000225,9.4e-05,9e-05,3.8e-05,3.9e-05
0.000152,0.00028,0.000484,9.5e-05,0.000395,0.000381,0.000228,0.000243,0.000249,0.00048,0.000262,0.000435,0.000292,0.000485,0.000318,0.000678,0.000327,0.00033,0.000237,0.000391,0.000355,0.000397,0.000136,4e-04,4.1e-05,0.000329,9.2e-05,0.000107,0.000115,0.000165,0.000248,0.000348,0.000256,0.000157,7.4e-05,0.000121,0.000287,0.000214,0.000273,0.000208,0.00017,0.000151,0.000349,0.000301,0.000374,0.000345,1.6e-05,0.00015,0.00024,0.000181,0.000342,7.8e-05,0.00012,8.3e-05,0.000147,0.000257,7.6e-05,0.000173,0.000188,7.5e-05,0.000295,0.000249,0.000151,3.8e-05,0.000101,0.000138,0.000167,0.000141,0.000133,2.8e-05,0.000158,0.000302,0.000267,0.000305,0.000256,0.000332,0.000161,9.2e-05,7.9e-05,5.5e-05,0.000152,0.000235,0.000329,0.000206,0.000329,5.1e-05,7.2e-05,0.000202,0.000145,9.7e-05,0.000136,8.8e-05,0.000111,0.00029,0.000157,0.000355,0.000109,0.000145,0.000149,0.000307,0.000188,0.00027,0.000366,0.000195,0.000116,0.00033,0.000204,8.7e-05,0.000197,0.000154,0.000128,8.4e-05,0.000226,9.1e-05,0.000111,8.1e-05,0.00021,8.2e-05,0.000175,0.000133,4.4e-05
0.00028,0.000455,0.000183,0.000419,0.000187,0.000417,0.000351,0.000317,0.000262,0.000327,0.000373,0.000351,0.000514,0.00076,0.000617,0.000196,0.000393,0.00053,0.000191,0.000465,0.000178,8.6e-05,0.000146,0.000318,0.00045,0.000102,0.000224,0.000137,6.2e-05,0.000384,0.000377,6.6e-05,0.000336,0.000388,0.00014,0.000186,0.000268,0.000376,0.000346,0.000457,0.000315,0.000212,0.000266,0.000446,0.000416,0.000189,0.000252,0.000156,7.7e-05,0.000318,0.000288,0.000316,0.000168,0.000131,0.000241,0.000167,0.000187,0.000338,0.000436,0.000439,0.000137,4e-05,0.000113,0.000264,0.000237,0.000332,0.000246,0.00028,0.000101,0.00033,0.000188,0.000395,0.000239,0.000238,0.000294,0.00012,0.000149,0.00011,0.000121,0.000139,0.000227,0.000325,0.000133,5.4e-05,0.000351,0.000525,0.000281,8.5e-05,0.000161,4.6e-05,0.000178,0.000118,0.000256,0.000201,0.00016,0.000323,0.000385,0.000267,0.000159,0.000163,0.000279,0.000238,0.000188,0.000123,6.9e-05,0.000305,9.7e-05,4.7e-05,0.000164,0.000137,0.000198,7.1e-05,0.000329,0.000316,0.000343,0.000131,0.000281,0.000222,0.000134,0.000209,0.000238
0.000302,0.000232,0.000203,0.00028,0.00043,8.4e-05,0.000247,0.00018,0.000347,0.000117,0.000313,0.000344,7.9e-05,0.00039,0.000118,0.000291,0.000231,0.000267,0.000375,0.000489,0.000327,0.000174,8.4e-05,0.000252,0.000154,2.8e-05,0.000174,0.000108,0.000149,0.000333,0.000348,0.000102,0.000346,0.000285,0.000363,0.000448,0.000513,0.000102,0.000236,0.000214,0.000123,4.8e-05,0.000277,0.000324,3e-04,0.000172,0.000425,0.000319,0.000175,0.000226,0.000217,0.000343,0.000315,0.000258,0.000197,0.000183,0.000241,0.000301,0.000193,0.00018,0.000245,0.000132,0.000132,0.000185,0.000173,0.000182,0.000135,0.000415,0.000562,0.000222,0.000154,0.000166,0.000295,0.00018,0.000213,0.000236,0.000254,0.000272,0.00021,0.000256,0.000155,0.000359,0.00026,0.000225,8.1e-05,0.000269,1.5e-05,0.000188,0.000176,0.000276,0.000232,0.000287,0.000172,0.000242,0.00022,0.000372,0.00019,0.000136,0.000153,0.000368,0.000236,0.000111,5.1e-05,2.6e-05,0.000118,0.000316,0.000428,0.000258,9.8e-05,0.000212,0.000244,0.00021,0.000241,0.000127,0.000214,0.000232,0.000169,4e-05,2e-04,0.000172,0.000146
0.000216,0.000204,0.000115,0.000217,0.000312,0.000163,0.000249,0.000302,0.000528,0.000116,0.000195,0.000217,0.000322,0.000198,0.000399,0.000291,0.000126,0.000354,0.000207,0.000221,0.000285,0.000292,7e-05,0.000149,0.000368,0.00023,0.000103,0.000345,0.000363,0.000195,2.6e-05,0.000379,0.000349,0.000125,0.000264,0.000227,8.2e-05,0.000232,0.000273,0.000233,0.00018,0.000139,0.00024,8.6e-05,0.000163,0.000445,0.00034,8.9e-05,0.00016,5.9e-05,0.000277,0.00035,0.000171,0.000121,0.000208,0.000271,0.000455,0.000393,0.000422,0.00013,0.000193,0.000102,0.000255,0.000104,0.000125,0.00019,0.000279,0.000206,0.000211,0.000434,0.000143,9.2e-05,0.00019,0.000143,0.000294,7.6e-05,0.000106,0.000238,8.3e-05,0.000114,6.3e-05,0.000313,0.000261,0.000335,0.000233,0.000109,0.000124,0.000152,6.9e-05,0.000201,0.000119,0.000139,6.7e-05,0.000231,4.3e-05,0.000101,0.000151,0.000147,0.000304,0.000172,0.000277,0.000146,0.000145,0.000183,0.000224,0.000106,0.00024,0.000103,4.7e-05,0.000216,0.000243,0.00019,0.000312,0.000148,0.000224,7.3e-05,0.000231,0.000113,0.000243,0.000136,1.8e-05
0.000301,0.000179,0.000243,0.000258,0.000198,0.00028,9.6e-05,0.000129,0.000144,0.000202,3e-04,0.000162,0.000133,0.000487,0.000186,0.000309,0.000268,1.8e-05,0.000195,0.000355,0.000355,6.6e-05,0.000168,6.3e-05,0.00022,0.000417,0.000501,0.00047,0.000119,5.2e-05,5.4e-05,0.000211,0.000123,0.000214,0.000332,8e-05,5e-05,0.000199,0.000265,0.000129,0.000171,0.000103,0.000406,0.000289,0.00016,0.000281,0.000142,6.5e-05,0.000206,0.000292,0.000156,0.000118,2.2e-05,0.000174,0.000362,0.000171,0.000177,8e-05,0.000353,0.000168,0.000342,0.000249,0.000162,0.000135,0.000194,0.00018,0.00011,0.000169,0.000194,0.000362,0.000399,0.00024,0.00024,0.000206,3.1e-05,0.000157,0.000119,0.000245,0.000206,6.1e-05,0.000144,0.000135,8.7e-05,0.000183,0.000239,0.00012,0.000169,9.5e-05,4.8e-05,8.6e-05,3.1e-05,9.9e-05,7.3e-05,0.000179,0.000194,0.000121,5.3e-05,5.2e-05,0.00016,0.000157,0.000302,0.00031,0.000247,0.000244,0.000134,5.5e-05,5.9e-05,0.000119,0.000114,0.000232,0.000459,0.000354,5.7e-05,0.000113,8.1e-05,0.000222,0.000253,0.000182,0.00026,0.000225,9.5e-05
0.000294,0.000255,0.000165,0.000347,0.000239,7.3e-05,0.000224,9.9e-05,0.000143,0.000103,0.000242,0.000259,7.5e-05,0.000256,4.8e-05,4.3e-05,0.00014,7.4e-05,0.000197,0.00016,0.000204,7.6e-05,0.000114,0.000195,0.000211,0.000245,0.000171,0.000186,0.000139,9.8e-05,9.9e-05,0.000178,6.2e-05,8.8e-05,0.000173,4.6e-05,8.7e-05,7.6e-05,0.000302,0.000344,9.6e-05,0.000241,0.000117,0.00013,0.000101,0.000202,0.000147,0.000139,0.000269,0.000114,0.000247,8.3e-05,0.000156,0.000109,0.000137,9.6e-05,0.000116,0.000149,0.000264,0.000261,5.3e-05,0.000114,0.00013,7e-05,0.000131,0.000169,0.000138,0.000144,0.000208,0.000156,0.000198,0.000115,0.000123,0.000112,7.3e-05,0.000119,3.8e-05,0.000151,0.000135,7.8e-05,0.000188,9.9e-05,0.00013,0.000199,0.000138,0.000143,0.000186,0.000107,7.4e-05,2.2e-05,9.7e-05,0.000171,8.5e-05,0.000199,0.000159,4.7e-05,6.2e-05,8.7e-05,0.000169,0.00011,0.000116,0.000271,0.000325,7.3e-05,1.3e-05,0.000111,0.000124,0.000111,0.000155,5.3e-05,0.000189,0.000202,0.00031,6.7e-05,9.6e-05,0.000116,0.000215,8.4e-05,6e-05,3.3e-05,7.7e-05
0.000118,0.000148,0.000144,0.000287,0.000241,0.00012,0.000157,0.00016,0.000169,5.7e-05,7.1e-05,5.3e-05,0.00017,0.000112,0.000211,0.000125,4.6e-05,0.000144,3.7e-05,8e-05,0.000171,1.7e-05,6.8e-05,8.7e-05,0.000118,8e-05,8.8e-05,6e-05,0.000137,8.7e-05,0.000184,0.000146,3.2e-05,8.6e-05,0.000172,1.6e-05,0.000178,0.000122,8.1e-05,0.00022,0.000139,0.000201,0.000265,5.1e-05,7.2e-05,0.000187,6.8e-05,0.000113,0.000142,7.7e-05,0.000151,0.000177,0.000206,0.000109,8.3e-05,6e-06,0.000195,8.7e-05,6.5e-05,0.000107,8.4e-05,3.1e-05,0.000172,4e-05,8.5e-05,9.1e-05,0.000105,5.7e-05,0.000166,2.7e-05,0.000142,2.2e-05,9.8e-05,2.1e-05,0.000126,6.1e-05,9.3e-05,6.9e-05,8.8e-05,9e-06,0.00013,5.9e-05,0.000181,0.000164,8.5e-05,0.000112,4.7e-05,6.3e-05,7.3e-05,7.1e-05,7.2e-05,0.000107,5e-06,9.2e-05,0.000107,8.4e-05,3.5e-05,7e-06,6.7e-05,0.000184,0.000127,0.000115,0.000152,3.6e-05,2.8e-05,8.3e-05,8.1e-05,7.3e-05,8.7e-05,5.9e-05,7.1e-05,1.5e-05,0.000152,6.4e-05,4.5e-05,0.000134,0.000167,0.000109,6.5e-05,5e-06,7e-05
8.2e-05,0.000238,0.000238,0.000196,0.000272,8.6e-05,6.9e-05,0.00027,9.9e-05,0.00017,0.000293,6e-05,5.7e-05,0.000135,0.000271,0.000232,0.000218,0.000239,0.000199,0.000168,0.000284,0.00022,0.000143,0.000165,0.000122,1e-04,0.000177,9.8e-05,0.000218,0.000104,8.7e-05,0.000277,0.00014,2e-04,0.00021,1.8e-05,0.000221,0.000181,0.000373,0.000263,0.000166,0.00028,0.000171,0.000201,0.00018,0.00029,6.2e-05,0.000222,0.000318,5.7e-05,0.000243,0.000303,0.000118,0.000244,0.000291,9.2e-05,0.000108,0.000251,0.000147,0.000139,0.000137,0.000134,0.000158,0.000143,6.9e-05,8.4e-05,0.000209,0.00024,0.000237,0.000119,0.000132,8.7e-05,0.000107,0.000108,4.9e-05,0.000167,7.9e-05,6.7e-05,0.000113,0.000116,0.000124,4.8e-05,0.000157,0.000217,0.000154,0.000124,8e-05,2.6e-05,0.000139,4.3e-05,6e-05,0.000127,3.5e-05,7.2e-05,0.000136,9.8e-05,1e-04,0.000103,0.000147,0.000167,5.3e-05,8.5e-05,6.6e-05,9.3e-05,5.8e-05,0.000102,3e-05,5.5e-05,7.2e-05,5.5e-05,5.9e-05,2.7e-05,0.000163,5.1e-05,1e-05,0.000132,0.000159,7.5e-05,4.8e-05,5.1e-05,8.9e-05
0.000154,0.000287,0.000231,0.00039,0.000322,0.000162,0.000253,0.000449,0.000524,0.000274,0.000347,0.000354,6.3e-05,0.00013,0.000158,9.9e-05,0.000329,0.000352,0.000154,0.000148,0.000237,2e-05,0.000193,0.000291,0.000174,2.8e-05,0.000419,0.000319,0.000157,5.7e-05,0.000157,0.000315,0.000271,8e-05,0.000132,0.000153,0.000292,0.000166,0.000327,0.00032,0.000269,0.000143,0.000295,0.000373,0.000367,9.3e-05,0.000237,0.000144,0.000209,0.000285,0.000327,0.000453,0.000428,0.000276,0.000201,0.000143,0.000136,0.000238,0.000118,0.000144,0.000165,0.000115,0.000272,0.000317,0.000269,0.000148,0.000129,0.000115,0.000256,3.3e-05,5.4e-05,0.000199,0.000176,0.000188,0.000341,0.000132,9.6e-05,2.8e-05,9.2e-05,0.000101,0.000142,8.8e-05,0.000306,0.000172,0.000256,0.000242,4.2e-05,0.000105,0.00013,0.000218,0.000215,0.000125,9e-05,4.9e-05,0.000114,0.000123,6.2e-05,4.6e-05,0.000216,2.5e-05,0.000117,0.000236,0.00027,0.000139,7.9e-05,7.7e-05,0.000129,0.000118,4.9e-05,6.4e-05,8.1e-05,0.000106,0.000225,0.000102,0.000128,0.000116,0.000206,8.2e-05,0.000115,8.3e-05,5.1e-05
0.000202,0.000131,0.000171,0.000307,0.00023,0.000233,0.000279,0.000214,0.000135,0.000247,6.2e-05,0.000114,0.000216,8.8e-05,0.000117,0.000149,0.000204,0.000102,0.000151,0.000153,3.8e-05,0.000142,0.000137,0.000115,0.000107,6.7e-05,0.000394,0.000297,0.000166,0.000176,0.000242,0.000157,7.7e-05,8.6e-05,0.000202,0.000207,0.000381,0.000264,0.000179,0.000219,7.2e-05,0.000183,0.000133,0.000297,9.5e-05,3.9e-05,0.000205,0.000139,0.00011,0.000121,1.7e-05,0.000143,0.000208,0.000164,0.000118,5.9e-05,0.000104,0.000181,0.000189,4.9e-05,9.7e-05,0.000232,0.000304,0.000183,0.000124,0.000209,6.5e-05,0.000112,0.00015,0.000109,0.00018,0.000148,0.000147,9.9e-05,0.000157,0.000139,6.3e-05,6e-05,8e-06,2.8e-05,0.00016,0.000238,0.000221,0.000156,7.6e-05,6.6e-05,6.9e-05,0.000119,0.000169,0.000124,6.1e-05,9.7e-05,1.5e-05,8e-06,9.1e-05,0.000159,2.1e-05,9.8e-05,0.000127,0.000218,0.000314,0.000208,4.5e-05,0.000121,6.8e-05,7.3e-05,0.000132,0.000147,7.9e-05,7.2e-05,0.000152,2.9e-05,0.000146,0.000154,2.2e-05,3.6e-05,4.2e-05,3.8e-05,4.4e-05,2.5e-05,3.8e-05
6.3e-05,3.3e-05,0.000146,0.00026,0.000157,8.5e-05,0.000134,0.000155,0.000149,9.4e-05,3.9e-05,3e-05,7.3e-05,0.000187,0.000207,2.4e-05,4.9e-05,8.4e-05,1.5e-05,7.2e-05,9.6e-05,3.4e-05,5.7e-05,5.5e-05,5.7e-05,5.6e-05,0.000209,0.000109,0.000142,9.5e-05,6.3e-05,6.5e-05,0.000133,4.3e-05,0.000146,0.000192,8.9e-05,9.6e-05,0.000137,0.000155,6.1e-05,2e-05,0.000158,0.000138,4.2e-05,3e-05,0.000112,0.000115,7.2e-05,7e-06,2.4e-05,0.000115,6.3e-05,5.6e-05,3.6e-05,3.6e-05,8.9e-05,4.8e-05,4.6e-05,9.4e-05,9.6e-05,0.000186,0.000118,7.1e-05,4.4e-05,0.000126,7.3e-05,8.1e-05,0.000118,9.8e-05,0.000125,5.4e-05,3.1e-05,8.3e-05,0.000143,5.6e-05,4e-05,6.6e-05,6.8e-05,3.3e-05,0.000125,0.000158,3.5e-05,6.9e-05,2.8e-05,0.000141,5.7e-05,0.000105,1.3e-05,9.1e-05,0.000138,3.7e-05,2.5e-05,8e-06,6.8e-05,5.6e-05,2.5e-05,0.000104,4e-06,0.000185,0.000216,5.4e-05,4.9e-05,4.1e-05,4.3e-05,4.2e-05,5.5e-05,3.5e-05,5.7e-05,2.1e-05,0.000129,2.8e-05,0.000182,9.5e-05,4e-05,4.6e-05,0.000102,3.4e-05,3.8e-05,1.5e-05,3.4e-05
6.2e-05,6.7e-05,0.000102,0.000182,0.000103,2.9e-05,0.000205,0.00012,0.00014,0.000107,4.8e-05,1.6e-05,4.4e-05,0.000137,0.000174,5e-06,2.8e-05,3.9e-05,3.5e-05,0.000102,0.000115,4.4e-05,6.5e-05,1.2e-05,8.7e-05,6.7e-05,0.000195,0.000103,0.000116,2.1e-05,0.000119,0.000116,1e-04,4e-05,0.000129,0.000127,7.5e-05,8.3e-05,7.4e-05,2e-04,0.000131,6e-05,7.5e-05,0.000125,2.7e-05,6.5e-05,0.000128,7.6e-05,4e-05,1.9e-05,4.9e-05,0.000101,2.5e-05,2.9e-05,1e-05,4.8e-05,8.7e-05,4.2e-05,5e-06,8.8e-05,6.8e-05,0.000115,0.000125,3.7e-05,4.5e-05,6.6e-05,4.9e-05,3.2e-05,9.5e-05,2.6e-05,0.000157,5.7e-05,2.5e-05,5.5e-05,0.000125,2e-06,5e-06,2.2e-05,1.1e-05,9e-06,5.9e-05,0.000115,2.3e-05,0.000102,1.7e-05,9.5e-05,6.2e-05,1.9e-05,1.9e-05,2e-05,0.000109,7.3e-05,1.6e-05,1.1e-05,3.9e-05,6.4e-05,3e-05,7.5e-05,3.7e-05,0.000211,0.000253,3.2e-05,9.4e-05,4.5e-05,3.4e-05,4.4e-05,3.7e-05,1.8e-05,3e-05,1.7e-05,0.000109,2.1e-05,0.000185,9.8e-05,2.9e-05,6.4e-05,0.000113,3.1e-05,2e-05,1.7e-05,1.8e-05
7.2e-05,4.7e-05,0.000134,0.00016,0.000102,1.9e-05,0.000189,9.3e-05,0.000149,7.9e-05,4.9e-05,1.9e-05,4.4e-05,0.000137,0.00017,4.6e-05,4.1e-05,3.6e-05,3.4e-05,0.000113,0.00012,2.8e-05,4.9e-05,1.9e-05,5.3e-05,5.8e-05,0.000179,8.4e-05,0.000101,8e-06,0.000121,0.000101,8.7e-05,3.5e-05,0.000143,8.9e-05,6.4e-05,4e-05,8.2e-05,0.000179,0.000101,9.1e-05,5.2e-05,9e-05,1.5e-05,6.5e-05,0.000109,7.2e-05,2.4e-05,1.2e-05,6.4e-05,5.9e-05,5.4e-05,1.9e-05,3.3e-05,1.9e-05,6.1e-05,2e-05,4e-06,9e-05,6.4e-05,0.000106,0.000111,1e-05,3.2e-05,5.9e-05,3.6e-05,5.5e-05,7e-05,1.8e-05,0.00015,2.9e-05,6e-06,4e-05,0.000123,1e-05,5e-06,8e-06,1.1e-05,1.4e-05,5.4e-05,0.000113,1.1e-05,0.000118,2.9e-05,9.8e-05,6.2e-05,3.2e-05,3.7e-05,1.9e-05,7.6e-05,5.6e-05,1e-05,8e-06,1.4e-05,6.3e-05,1.9e-05,7.7e-05,4.3e-05,0.000187,0.000233,1.5e-05,9.1e-05,4.5e-05,2.4e-05,2.6e-05,2.1e-05,1.9e-05,2e-05,9e-06,0.000111,7e-06,0.000173,8.7e-05,3.2e-05,2e-05,0.000122,1.5e-05,3.5e-05,1.6e-05,8e-06
