6e-06,3e-06,1e-06,8e-06,9e-06,7e-06,3e-06,1.2e-05,1.2e-05,4e-06,1.1e-05,9e-06,2e-06,8e-06,1e-06,0,1.6e-05,3e-06,1.1e-05,2.1e-05,2e-06,1e-05,7e-06,1.1e-05,4e-06,0,2e-05,2e-06,1.8e-05,2e-06,3e-06,6e-06,5e-06,1.9e-05,3e-06,4e-06,1.9e-05,1.4e-05,4e-06,2.8e-05,3e-06,1e-05,2e-05,2.7e-05,2e-06,3e-06,1.4e-05,5e-06,2e-06,2.1e-05,3e-06,9e-06,5e-06,1.3e-05,1e-06,3.2e-05,8e-06,0,4e-06,1e-06,1.2e-05,1.2e-05,2e-06,3e-06,2e-06,2.4e-05,4e-06,5e-06,9e-06,3e-06,6e-06,8e-06,7e-06,3e-06,1.2e-05,2.2e-05,6e-06,1.3e-05,6e-06,1e-06,1.9e-05,9e-06,4e-06,9e-06,6e-06,4e-06,0,1.2e-05,6e-06,1.3e-05,5e-06,6e-06,7e-06,6e-06,3e-06,6e-06,4e-06,3e-06,1.3e-05,1.5e-05,1.1e-05,9e-06,3e-06,1.5e-05,9e-06,2e-06,7e-06,6e-06,8e-06,1.5e-05,6e-06,5e-06,1.4e-05,1e-05,2e-06,4e-06,2.1e-05,1e-05,1.4e-05,6e-06,7e-06
4.2e-05,1.6e-05,1.2e-05,1.6e-05,1.6e-05,3.1e-05,1.1e-05,1.9e-05,3.9e-05,3.5e-05,2.7e-05,2e-05,1.6e-05,2.4e-05,3.9e-05,3.3e-05,3.6e-05,2.4e-05,4e-05,3.1e-05,1.4e-05,1.3e-05,1.5e-05,2.2e-05,1.1e-05,1e-05,3.9e-05,2.7e-05,2.7e-05,1.7e-05,7e-06,8e-06,8e-06,4.7e-05,1e-05,3e-06,4.7e-05,1.5e-05,2.4e-05,4.9e-05,3.1e-05,2.4e-05,5.2e-05,5.5e-05,2.4e-05,1.4e-05,3.4e-05,3.1e-05,1.4e-05,3.6e-05,2.1e-05,3.4e-05,2.5e-05,3.8e-05,1e-05,6.7e-05,2.9e-05,4.1e-05,3.2e-05,1.2e-05,2e-05,1.6e-05,2.7e-05,1e-05,1.9e-05,4.5e-05,2.8e-05,1.6e-05,1.9e-05,2.6e-05,2.3e-05,2.1e-05,2.2e-05,5e-06,2.7e-05,5.5e-05,9e-06,1.6e-05,9e-06,1.7e-05,3.7e-05,1.9e-05,1.4e-05,4.1e-05,2.6e-05,1.9e-05,7e-06,3.4e-05,2.4e-05,5.4e-05,2.4e-05,3.6e-05,7e-06,3e-06,2.1e-05,2e-05,2.6e-05,6e-06,5e-06,4.9e-05,5.8e-05,9e-06,2.2e-05,2.2e-05,2.7e-05,1.5e-05,1.8e-05,2.7e-05,1.4e-05,2.1e-05,3.9e-05,3.8e-05,4e-05,4.1e-05,2.6e-05,1.7e-05,4e-05,2e-05,9e-06,9e-06,1.7e-05
3.1e-05,1.7e-05,1.7e-05,2.2e-05,1.1e-05,3.9e-05,8.1e-05,6.1e-05,7.8e-05,1.1e-05,2.6e-05,5.1e-05,2.7e-05,4.3e-05,1e-05,6e-06,3.4e-05,3.9e-05,5.7e-05,3.7e-05,1.9e-05,5.1e-05,4.7e-05,2.4e-05,1e-05,4.5e-05,1.8e-05,2.5e-05,1.7e-05,1e-05,3.3e-05,2.1e-05,2.7e-05,6.7e-05,4.9e-05,2.5e-05,5e-05,3.1e-05,2e-06,6e-05,5.2e-05,2.3e-05,9e-06,6e-05,2.8e-05,2.7e-05,2.2e-05,5.2e-05,3.8e-05,3.5e-05,3.3e-05,1.4e-05,5.5e-05,1.8e-05,2.3e-05,5.9e-05,8e-06,4.7e-05,4.2e-05,3e-05,2.8e-05,1.7e-05,2.8e-05,2.3e-05,4.1e-05,6.4e-05,4.5e-05,9e-06,3.1e-05,4.9e-05,5.7e-05,2.8e-05,3.3e-05,3.7e-05,1.3e-05,3.8e-05,2.4e-05,3.3e-05,2.3e-05,4e-05,7.1e-05,4.8e-05,1.3e-05,4.4e-05,5.3e-05,4.2e-05,1.6e-05,4.2e-05,1.7e-05,6.3e-05,3.6e-05,4.5e-05,4.6e-05,2e-05,3.3e-05,1.9e-05,4.9e-05,4.9e-05,6.1e-05,7.1e-05,3.6e-05,3.5e-05,4.7e-05,1.4e-05,2e-06,4.9e-05,2.2e-05,2.6e-05,4.6e-05,3.2e-05,3.7e-05,4.3e-05,2.9e-05,7e-05,4.9e-05,2e-05,2e-05,5.7e-05,1.4e-05,7e-06,6.4e-05
7.1e-05,4.6e-05,5.1e-05,7e-05,5.8e-05,3.1e-05,8.5e-05,3.5e-05,2.7e-05,7.1e-05,1.1e-05,6.3e-05,4.2e-05,2.1e-05,1.8e-05,1.4e-05,4.8e-05,3.9e-05,4e-05,4e-06,3.8e-05,0.000107,8.1e-05,6.5e-05,7.7e-05,5.1e-05,6.4e-05,3.9e-05,1.3e-05,3.2e-05,6.2e-05,1.4e-05,6.6e-05,7e-05,4e-06,1.7e-05,2.6e-05,0.000116,6.4e-05,1e-05,0.000127,7.4e-05,0.000106,8.2e-05,6.1e-05,3.5e-05,4.8e-05,1.7e-05,5e-05,2.2e-05,1.6e-05,5.2e-05,5.2e-05,4.1e-05,7e-05,0.000106,7.6e-05,8e-05,2e-05,1.5e-05,4.3e-05,2.4e-05,4.8e-05,3.6e-05,5.4e-05,4.4e-05,8.3e-05,0.000104,5.5e-05,6.5e-05,8e-05,7.3e-05,7.4e-05,6.7e-05,5.4e-05,9e-05,5.9e-05,6.2e-05,7e-06,7e-05,2.8e-05,3.2e-05,2.8e-05,1.2e-05,6.7e-05,4e-05,1.8e-05,4.9e-05,6.4e-05,8e-05,8.4e-05,5.9e-05,3.7e-05,5e-05,6.6e-05,4.7e-05,8.4e-05,2e-05,4.7e-05,1.9e-05,5e-06,1.9e-05,4.1e-05,4.3e-05,1.2e-05,7.9e-05,2.2e-05,4.6e-05,5.9e-05,1.6e-05,3e-05,2.6e-05,3.9e-05,4.2e-05,1.8e-05,5.3e-05,5.2e-05,5.7e-05,7.4e-05,2.9e-05,9e-05
4.8e-05,3.1e-05,8.4e-05,2.6e-05,1.7e-05,7e-06,4.3e-05,6.3e-05,5.7e-05,7.7e-05,2.7e-05,9.7e-05,3e-05,6e-06,1.4e-05,5.1e-05,0.000104,4.6e-05,4e-05,9e-06,8e-05,0.000107,5.1e-05,5e-05,7.4e-05,4.3e-05,7.2e-05,9.6e-05,8.1e-05,5.5e-05,5.8e-05,5.2e-05,7.2e-05,0.000136,0.000141,9.9e-05,7e-05,0.000137,7e-05,3.3e-05,8.6e-05,5.8e-05,0.000123,0.000163,9.4e-05,3.3e-05,3.9e-05,7.3e-05,4.9e-05,0.000103,6.4e-05,1.5e-05,4.7e-05,6.5e-05,5.8e-05,0.000127,0.000117,1.9e-05,5.9e-05,6.1e-05,8.2e-05,9.5e-05,9.5e-05,0.00012,0.000129,0.000158,0.000113,5.9e-05,0.000113,8.3e-05,1e-05,6.1e-05,5.6e-05,3.1e-05,6.7e-05,7.5e-05,3e-05,7.4e-05,7e-06,8.5e-05,9.4e-05,2.8e-05,5e-05,5.8e-05,8.3e-05,6e-06,3.9e-05,4.6e-05,5.9e-05,2.9e-05,9.5e-05,6e-05,2.5e-05,1.6e-05,6e-05,7e-06,5.8e-05,5.6e-05,1.1e-05,2.9e-05,6.7e-05,4.2e-05,3e-05,5.6e-05,5.9e-05,0.000103,8.8e-05,5.3e-05,4.5e-05,8.3e-05,6.9e-05,3.6e-05,5.7e-05,3.9e-05,2.1e-05,3.6e-05,2.2e-05,2.7e-05,2.4e-05,3.3e-05,9.9e-05
3.5e-05,8.6e-05,6.1e-05,8.5e-05,0.000104,6e-05,4.1e-05,6.5e-05,9.3e-05,4.5e-05,4.5e-05,7.9e-05,0.000115,4.2e-05,4.3e-05,5.7e-05,0.000155,0.000116,8.1e-05,2.8e-05,0.000119,0.000163,0.000116,6.9e-05,9.6e-05,8.1e-05,4.9e-05,3.5e-05,5.3e-05,0.000133,0.000156,5.9e-05,7.1e-05,0.000187,0.000174,0.00017,0.000141,0.000144,6.1e-05,4.3e-05,4e-05,4e-05,0.000105,1e-04,9.1e-05,5.3e-05,4.1e-05,9.1e-05,8.8e-05,0.000141,0.000121,4e-05,0.000123,0.000162,0.000133,0.000143,4.6e-05,4.4e-05,4.6e-05,2.2e-05,3.7e-05,1e-04,2.5e-05,0.000114,4.8e-05,0.000103,5.8e-05,4.7e-05,8.4e-05,7.5e-05,3.4e-05,1.6e-05,3.9e-05,6.9e-05,2.5e-05,2.2e-05,6.9e-05,4.5e-05,0.000107,0.000132,7.8e-05,9.8e-05,6.2e-05,6e-05,0.000116,9.5e-05,9.1e-05,9.3e-05,2.8e-05,7.7e-05,7.7e-05,2.8e-05,2.3e-05,2.7e-05,9.1e-05,9e-05,0.000106,7.3e-05,4.9e-05,3.6e-05,0.000109,2.6e-05,4.6e-05,4e-05,7.2e-05,6.5e-05,7.8e-05,0.000104,5.1e-05,5.2e-05,2.4e-05,3.2e-05,5.8e-05,4e-05,2.7e-05,1.8e-05,1.1e-05,4.2e-05,5.4e-05,6e-05,5.2e-05
0.000237,0.000235,0.000164,9.3e-05,4.1e-05,2.6e-05,9.6e-05,8e-05,7.9e-05,0.000139,0.000165,6.8e-05,7.1e-05,0.000144,4e-06,0.000107,0.000108,8.8e-05,1.2e-05,6.1e-05,0.000119,2.3e-05,6.9e-05,7.9e-05,0.000162,0.000206,0.00019,0.000116,5.1e-05,0.000106,2.2e-05,7.3e-05,2.5e-05,0.000163,0.000131,0.00011,6.7e-05,5.2e-05,8e-06,7.4e-05,0.000142,3.7e-05,7.7e-05,0.000109,3.6e-05,4.5e-05,5.3e-05,7.4e-05,0.000111,6e-05,3.4e-05,0.000106,0.000208,4.2e-05,0.000104,5.4e-05,0.000117,8.1e-05,0.000121,0.000115,0.000107,0.000121,5.5e-05,7.9e-05,6.1e-05,0.000112,9.3e-05,2.9e-05,0.000115,1.9e-05,7.9e-05,9.2e-05,2.4e-05,5.4e-05,7.7e-05,5.9e-05,6.9e-05,4.8e-05,0.000113,7.6e-05,8e-05,0.000113,0.00018,0.000172,0.000143,8.6e-05,4.8e-05,8e-05,9.2e-05,0.000163,0.000104,1.5e-05,1e-05,4.1e-05,0.000109,7.1e-05,4.7e-05,5.5e-05,3.3e-05,5.6e-05,0.00013,8.5e-05,8.5e-05,6.6e-05,5.4e-05,3e-06,8.1e-05,0.000105,0.000108,5.3e-05,8.3e-05,4.2e-05,7.1e-05,3.7e-05,4.4e-05,4.4e-05,1.8e-05,4.8e-05,0.000101,4.5e-05,4.7e-05
0.000177,0.000166,9e-05,8.1e-05,5.9e-05,7e-05,0.00013,6.6e-05,0.000109,7.8e-05,0.000139,0.000116,3.9e-05,0.000142,0.000195,0.000198,0.000243,0.000117,2e-05,3.4e-05,5.7e-05,5.4e-05,0.000128,7.9e-05,0.00017,5.2e-05,0.000115,6.5e-05,6.2e-05,9.1e-05,0.000106,0.00014,0.000196,0.000237,0.000155,2.4e-05,0.000113,0.000168,0.000127,0.000221,0.000278,0.000167,0.000165,0.000201,0.000141,5e-05,0.000123,0.000188,0.000273,0.000267,0.00017,2e-04,3.5e-05,7.9e-05,0.000123,0.000192,0.000231,0.000136,9.2e-05,5.3e-05,0.000199,0.000141,5e-05,2.9e-05,1.6e-05,7.3e-05,9.2e-05,0.000143,0.000182,0.000167,0.00017,4.8e-05,0.000153,5.9e-05,0.000125,0.000181,0.000181,0.000169,0.000163,0.000168,0.000141,8.4e-05,9.4e-05,7.4e-05,4.8e-05,0.000107,8.4e-05,2.9e-05,6.1e-05,0.000231,0.000259,0.00017,0.000124,5.2e-05,7.7e-05,4e-05,5.2e-05,0.000143,7.5e-05,0.000107,0.000104,9.1e-05,6.8e-05,9.2e-05,0.000148,6.4e-05,9.1e-05,0.000175,0.000147,1.3e-05,0.000159,0.000102,3.6e-05,5.8e-05,5e-05,0.000111,0.000104,8.5e-05,0.000164,0.000136,8.1e-05
0.00025,8.6e-05,0.000201,9.4e-05,4.2e-05,4.8e-05,7.5e-05,0.00013,7.1e-05,7e-05,4.5e-05,0.000113,0.000166,0.000152,0.000161,9.2e-05,0.000151,0.000107,7.3e-05,3.4e-05,2.5e-05,3.8e-05,9.8e-05,0.000107,0.000115,9.9e-05,0.000136,0.000146,6.2e-05,0.000109,4.5e-05,5.5e-05,0.000136,3.5e-05,0.000118,0.000141,0.000111,0.000137,5.7e-05,0.000218,0.000166,8.4e-05,0.000147,0.00014,0.000103,0.000124,8.7e-05,0.000106,0.000162,0.000137,2.8e-05,9.9e-05,0.00018,0.000113,0.000113,0.000149,8.8e-05,8e-05,0.000139,0.000175,0.000133,0.00016,0.000122,8.2e-05,4.6e-05,4.6e-05,0.000176,0.000249,9.4e-05,0.000132,9.9e-05,0.00014,0.000214,0.000247,0.00012,9.4e-05,0.000112,5.4e-05,1.6e-05,6.8e-05,0.000122,5.8e-05,0.000109,0.000137,9.6e-05,0.000185,2.1e-05,7.6e-05,1e-04,0.000163,6.9e-05,5.6e-05,0.000125,0.00012,6.8e-05,5.2e-05,7.4e-05,0.000157,0.00019,8e-05,0.000111,0.000144,4.6e-05,0.000121,7.1e-05,3.2e-05,6.7e-05,0.000147,9.4e-05,6.2e-05,0.000147,8.4e-05,6.8e-05,4.3e-05,0.000122,2.4e-05,6.9e-05,0.000103,0.000101,8.5e-05,5.9e-05
9.7e-05,5.3e-05,0.00024,0.000203,0.000179,9e-05,7.4e-05,4.3e-05,0.000108,9.6e-05,0.000144,0.000212,8.6e-05,0.000144,6.1e-05,0.000107,3.7e-05,7.5e-05,0.000213,0.000223,9.8e-05,7.7e-05,6.2e-05,0.000138,9e-05,0.000103,1.8e-05,9.1e-05,0.000113,0.000119,0.000121,5.7e-05,0.000134,8.6e-05,0.000139,0.000293,0.000385,0.000183,2.8e-05,0.000272,0.000203,0.000119,7.9e-05,8.4e-05,0.000105,5.1e-05,0.000137,0.000117,0.000231,0.000123,0.000108,7.5e-05,0.000168,0.000108,0.000104,9.6e-05,0.00012,0.000165,0.000216,0.000202,0.000244,0.000112,1.9e-05,0.000122,0.000115,7.5e-05,0.000181,3.1e-05,5.4e-05,0.000119,7.1e-05,4.4e-05,9e-05,0.000116,8.8e-05,0.000148,7.7e-05,4.2e-05,9e-05,8.6e-05,9.1e-05,0.000125,0.000215,5.7e-05,3e-05,0.000198,0.000223,0.000213,0.000115,9.3e-05,9.7e-05,9.2e-05,0.000231,0.000109,8.4e-05,6.8e-05,0.000109,0.000207,0.000112,0.000178,0.000184,0.000202,0.000169,0.000187,0.000179,0.000218,6.6e-05,0.00012,5.9e-05,0.000142,0.000195,0.000172,0.000174,0.000108,9.5e-05,0.000101,1e-04,0.000169,0.000246,0.000205,7.3e-05
0.000106,7.4e-05,9.5e-05,5.9e-05,2.3e-05,6.2e-05,5e-05,4e-06,8.1e-05,0.000124,0.000112,0.000105,0.000211,0.000251,0.000143,9.8e-05,3.8e-05,8.8e-05,0.000124,0.000179,0.000166,0.000121,0.000154,0.000114,6.7e-05,0.000172,9.2e-05,6.2e-05,0.00014,9e-05,6.1e-05,4.5e-05,7e-05,2e-05,4.8e-05,0.000177,0.000169,0.000108,0.000118,0.00026,0.000147,6.4e-05,0.000112,0.000114,0.000108,0.000149,0.000108,8.2e-05,0.000169,0.000139,0.000192,0.000121,0.000102,0.000177,0.000156,0.000175,0.000126,9.9e-05,0.000109,2.6e-05,7.3e-05,9.9e-05,8.8e-05,0.000113,3e-05,8.2e-05,8.7e-05,9.8e-05,6.4e-05,8.8e-05,0.000117,0.000106,2.7e-05,9.7e-05,9e-05,0.00015,0.000178,0.000157,0.000147,6.3e-05,5.4e-05,0.000107,0.000177,0.000139,6.2e-05,0.000141,1e-04,6.3e-05,9.2e-05,1e-04,8e-05,5.3e-05,0.000135,0.000123,6.8e-05,5.6e-05,0.000112,5.2e-05,0.000122,0.000188,0.000148,7.7e-05,4.4e-05,5.7e-05,7.1e-05,0.000191,0.000257,0.000163,0.000182,0.000139,3.7e-05,5.4e-05,6.7e-05,8e-05,6.9e-05,9e-05,3.3e-05,8.3e-05,0.000226,0.000168,0.00011
8.3e-05,2.6e-05,5.2e-05,3.9e-05,3.6e-05,7.2e-05,4e-05,4e-05,2.8e-05,3.8e-05,4.1e-05,5.8e-05,8e-05,6.3e-05,3.2e-05,3e-05,2.5e-05,3.7e-05,6.3e-05,7.4e-05,2e-05,3.5e-05,6.5e-05,2.7e-05,1.6e-05,7.7e-05,6e-05,3.6e-05,6.2e-05,6.1e-05,6.8e-05,2.5e-05,2.9e-05,3.8e-05,7e-06,9.5e-05,5.6e-05,5.4e-05,5.9e-05,9.4e-05,5.5e-05,2.4e-05,9.1e-05,2e-05,6.9e-05,5.6e-05,2.4e-05,8.6e-05,4.4e-05,1.5e-05,0.000122,7.6e-05,2.8e-05,9.1e-05,4.1e-05,3.2e-05,9.2e-05,3.5e-05,4.6e-05,2e-06,2.9e-05,6.8e-05,3.3e-05,5.9e-05,7.3e-05,2.7e-05,5.4e-05,7.4e-05,3.4e-05,8.5e-05,1e-05,1.7e-05,1.8e-05,3.3e-05,3.9e-05,0.000108,8.6e-05,2.8e-05,3.7e-05,9e-05,5.8e-05,3.3e-05,5.5e-05,2.3e-05,4e-06,5.1e-05,4.6e-05,2.9e-05,5e-05,1.1e-05,5e-06,7.5e-05,8.6e-05,2e-05,5.5e-05,2e-06,5.9e-05,3.7e-05,7.1e-05,5.9e-05,7.7e-05,2.3e-05,3.5e-05,2.3e-05,6.6e-05,7e-05,8.8e-05,4.4e-05,6.8e-05,2.7e-05,4.1e-05,2.6e-05,6.4e-05,1.3e-05,4e-05,2.2e-05,4e-05,7.1e-05,7.9e-05,3.9e-05,4.5e-05
4.2e-05,2.7e-05,2.5e-05,2.4e-05,7.6e-05,6.2e-05,3.9e-05,9e-06,6.3e-05,7.5e-05,7.4e-05,2.4e-05,4.9e-05,1.4e-05,6.4e-05,2.3e-05,2.3e-05,2.9e-05,5e-05,3.5e-05,3.7e-05,1.8e-05,1.2e-05,2.2e-05,2e-05,1.3e-05,4.2e-05,1.7e-05,6e-05,2.1e-05,3.6e-05,2.5e-05,2e-05,3.1e-05,3.3e-05,6.2e-05,3.9e-05,4.3e-05,2.6e-05,4.6e-05,6.8e-05,2.6e-05,4.3e-05,7e-05,2.2e-05,5.7e-05,1.8e-05,3.1e-05,4e-05,2.4e-05,6.5e-05,9.4e-05,6.2e-05,5.4e-05,4.8e-05,1e-05,4.8e-05,2.7e-05,5.1e-05,2.3e-05,2e-05,3e-05,1.4e-05,7e-06,1.7e-05,3.2e-05,3.6e-05,7.6e-05,8.2e-05,6e-06,1e-05,2.4e-05,6e-06,3.7e-05,2.3e-05,6e-05,3.4e-05,1.9e-05,1.2e-05,6.6e-05,3.7e-05,5.2e-05,3.7e-05,2.7e-05,3.1e-05,2.7e-05,7.9e-05,3.4e-05,3.5e-05,3.2e-05,5.4e-05,3e-05,6.7e-05,8.7e-05,3.4e-05,2e-05,2.6e-05,2.6e-05,1.4e-05,3.7e-05,1.7e-05,4e-06,2.7e-05,4e-05,4.2e-05,3.1e-05,3.9e-05,4e-05,4.1e-05,5.2e-05,5.4e-05,1.8e-05,3.6e-05,6e-06,2.5e-05,1.8e-05,2e-05,4.7e-05,3.8e-05,2.7e-05,2.6e-05
5.9e-05,4.6e-05,7.3e-05,4.3e-05,5.1e-05,6.7e-05,7.5e-05,3.1e-05,8.2e-05,4.3e-05,4.2e-05,3.2e-05,3.6e-05,2.1e-05,3.6e-05,3.8e-05,3.1e-05,7.9e-05,4.8e-05,5.8e-05,1.3e-05,3e-05,4.6e-05,1e-05,6.8e-05,2.1e-05,3.7e-05,6.5e-05,4.4e-05,3e-05,4.9e-05,1.3e-05,4.7e-05,2.9e-05,6e-06,3.2e-05,4.3e-05,4e-05,6.4e-05,7e-05,5.2e-05,3.6e-05,2.3e-05,7.6e-05,3.8e-05,2.6e-05,7.5e-05,8.6e-05,3.7e-05,3.4e-05,8.8e-05,4e-05,3.7e-05,4e-06,4.1e-05,8.3e-05,4.2e-05,2.5e-05,3.5e-05,1e-05,2.4e-05,7e-06,1.8e-05,1.8e-05,2.5e-05,1.5e-05,4.4e-05,6.9e-05,2.9e-05,2.6e-05,3.7e-05,3.7e-05,4.1e-05,2.2e-05,1.4e-05,1.7e-05,2.6e-05,2e-05,3.6e-05,1.1e-05,4e-05,1.3e-05,3.8e-05,2.3e-05,9e-06,5.4e-05,5e-05,1.9e-05,3e-05,2.2e-05,4.3e-05,2.6e-05,5.6e-05,4.1e-05,2.9e-05,3e-05,4.4e-05,2.7e-05,9e-06,2.2e-05,5e-05,2.1e-05,3.9e-05,3e-06,1.3e-05,5.7e-05,6.2e-05,3e-05,5.7e-05,9e-06,4.6e-05,2.4e-05,3e-06,2.9e-05,1.6e-05,6.3e-05,2.6e-05,1.1e-05,2.8e-05,4.4e-05,4e-06
1.4e-05,1.5e-05,6.9e-05,2.2e-05,6.3e-05,3.4e-05,2.9e-05,3.7e-05,8.5e-05,7e-05,1e-05,2.5e-05,1.3e-05,4e-05,2.4e-05,5.4e-05,2.4e-05,7.1e-05,1.9e-05,5.8e-05,6.3e-05,2.9e-05,3.8e-05,1.5e-05,7.5e-05,5.8e-05,2.9e-05,8.2e-05,3e-05,1.9e-05,3.1e-05,4e-05,1e-05,4.9e-05,3.1e-05,3.7e-05,5.9e-05,1.8e-05,6.1e-05,0.000108,4.3e-05,2.2e-05,3.9e-05,5.2e-05,9.4e-05,8.8e-05,9.1e-05,4.3e-05,2.8e-05,4.8e-05,6.6e-05,0.000104,4.8e-05,4e-06,1.6e-05,4.5e-05,4e-05,3.5e-05,2.6e-05,1.6e-05,1.7e-05,4.1e-05,3.6e-05,3.5e-05,2.5e-05,3.3e-05,2.3e-05,1.4e-05,2.3e-05,5.1e-05,1.9e-05,2e-05,3.3e-05,1.6e-05,1.3e-05,2.4e-05,4e-05,3.9e-05,5.3e-05,2.3e-05,1.6e-05,3e-05,1.9e-05,2.2e-05,2.2e-05,1.9e-05,4.1e-05,2.4e-05,3.3e-05,2.5e-05,9e-06,3.3e-05,5.5e-05,3.5e-05,2.8e-05,1e-05,1.5e-05,1.6e-05,3.2e-05,5.9e-05,5.3e-05,2.6e-05,1.4e-05,1.4e-05,2.3e-05,6e-05,3.7e-05,1.6e-05,6e-05,3e-05,5.5e-05,1.5e-05,3.1e-05,2.3e-05,1.3e-05,5.5e-05,3.8e-05,3.8e-05,1.4e-05,2.7e-05,1.4e-05
1.6e-05,1.7e-05,4.8e-05,1.8e-05,6.9e-05,2.5e-05,5.1e-05,6.8e-05,3e-05,2.6e-05,2.2e-05,4.1e-05,6.9e-05,8.4e-05,8.1e-05,6e-05,7e-05,8.4e-05,3.5e-05,7.9e-05,2.9e-05,2.2e-05,1.8e-05,5.3e-05,7.7e-05,7.5e-05,4.4e-05,3.7e-05,5.8e-05,4.3e-05,3.2e-05,1.8e-05,1.7e-05,4.5e-05,3.6e-05,1.5e-05,3.2e-05,1.9e-05,5e-05,3.7e-05,4.2e-05,1.8e-05,7e-05,7.8e-05,0.000117,4.1e-05,4.7e-05,7.7e-05,5.5e-05,8.9e-05,6.6e-05,4.5e-05,6.1e-05,1.8e-05,3.7e-05,4.6e-05,5.7e-05,5.2e-05,7e-06,7e-06,2e-06,3.5e-05,3e-05,4.8e-05,3.9e-05,6.1e-05,4e-05,1.6e-05,1.9e-05,3.7e-05,3.3e-05,3.1e-05,2.9e-05,3.4e-05,5.1e-05,4e-05,3.2e-05,4.9e-05,5e-06,3.9e-05,7e-06,3.2e-05,1.7e-05,2.2e-05,2.6e-05,3.6e-05,5.4e-05,1.2e-05,3.6e-05,5e-06,4.8e-05,7e-06,5.3e-05,5e-05,2.6e-05,3.2e-05,2.3e-05,4e-06,2.1e-05,5e-05,4.7e-05,3.5e-05,1.8e-05,3.3e-05,1.8e-05,2.3e-05,3.1e-05,3.4e-05,1.5e-05,2.6e-05,1.4e-05,9e-06,4.1e-05,1.6e-05,2.4e-05,2.6e-05,1.9e-05,2.7e-05,2.1e-05,2.5e-05,2.7e-05
8e-06,4e-05,3.3e-05,8e-06,3.6e-05,2.3e-05,4.6e-05,1.8e-05,1.5e-05,3.7e-05,3e-05,6.8e-05,2.2e-05,5.8e-05,6.5e-05,6e-05,6.9e-05,2.6e-05,5e-05,6.1e-05,4.1e-05,5e-06,4e-05,4.4e-05,1.9e-05,2.8e-05,3.7e-05,2e-06,4.6e-05,6.5e-05,3.5e-05,2.2e-05,5.4e-05,4.5e-05,8e-06,3.9e-05,3.6e-05,3.3e-05,2.3e-05,8.2e-05,2.8e-05,4.1e-05,6.9e-05,5.9e-05,3.7e-05,2.3e-05,3.1e-05,2.8e-05,3.9e-05,5.3e-05,4.4e-05,1.4e-05,6.6e-05,6.9e-05,3.6e-05,4.3e-05,3e-05,2.2e-05,2.8e-05,2.9e-05,9e-06,1.8e-05,2.6e-05,2.7e-05,4e-06,6.8e-05,5.9e-05,4.4e-05,1.3e-05,2.9e-05,5e-05,2.4e-05,3.1e-05,6.6e-05,2.8e-05,1.7e-05,3.3e-05,4.4e-05,4e-05,2.6e-05,4e-05,4.7e-05,1.7e-05,3.6e-05,1e-05,2.8e-05,4.8e-05,4.8e-05,1.3e-05,3.5e-05,4.5e-05,1.9e-05,3.8e-05,4.4e-05,2e-05,2e-05,3.9e-05,1e-05,4e-06,5.7e-05,4e-05,1.5e-05,2.2e-05,2.9e-05,2.5e-05,3.6e-05,4.3e-05,5.3e-05,4.1e-05,2.5e-05,2.3e-05,1.1e-05,1.4e-05,2.7e-05,5.1e-05,3.3e-05,2.5e-05,1.3e-05,2.3e-05,4.2e-05,3.2e-05
3.1e-05,4.9e-05,3.1e-05,3.2e-05,4.4e-05,2.9e-05,3e-05,5.1e-05,4.6e-05,5.6e-05,4.1e-05,5.7e-05,4.9e-05,6.4e-05,2.6e-05,6.9e-05,7.1e-05,5.5e-05,3.1e-05,7.6e-05,2.8e-05,2.5e-05,3.6e-05,5.6e-05,6.6e-05,4.8e-05,2.4e-05,5e-06,5.6e-05,2.5e-05,2.5e-05,2e-05,4.2e-05,3.3e-05,1.2e-05,7e-05,8.8e-05,9.3e-05,8.1e-05,0.000117,3.4e-05,4.5e-05,4e-05,3.2e-05,1.4e-05,3e-06,2.7e-05,6.1e-05,6.7e-05,5.2e-05,5.1e-05,8.5e-05,9.3e-05,6.5e-05,5e-05,4.4e-05,2e-05,4.7e-05,3.9e-05,6.6e-05,3.5e-05,8e-06,2.8e-05,9e-06,3.2e-05,7.2e-05,1.5e-05,2.9e-05,3.8e-05,2.9e-05,8.1e-05,6e-05,3e-05,4.2e-05,4.8e-05,3.6e-05,4e-05,2.8e-05,1.7e-05,2.3e-05,2.8e-05,4e-06,3.1e-05,3.1e-05,2.1e-05,3.4e-05,5e-05,4.1e-05,4.7e-05,3.7e-05,2.8e-05,1.9e-05,6.9e-05,4.3e-05,2.7e-05,4.3e-05,3.8e-05,6.2e-05,3.6e-05,4.8e-05,5.4e-05,3e-05,1.1e-05,8e-06,1.8e-05,4.2e-05,1.7e-05,4.5e-05,2.6e-05,5e-06,3.3e-05,2.1e-05,3.3e-05,2.3e-05,4e-05,1e-05,9e-06,1.3e-05,4.4e-05,3.1e-05,1.4e-05
3.4e-05,7.1e-05,7.2e-05,1.7e-05,4.2e-05,7.6e-05,2.8e-05,1.5e-05,6.4e-05,1.4e-05,2.3e-05,2.8e-05,4.1e-05,4.4e-05,5e-05,5.9e-05,2e-05,1.3e-05,4.2e-05,6.2e-05,5.4e-05,4.5e-05,4.6e-05,7.6e-05,8e-05,5e-05,3.6e-05,1.6e-05,5.2e-05,5.1e-05,5.4e-05,8.8e-05,3.3e-05,2.6e-05,4.2e-05,7.8e-05,2.8e-05,5.6e-05,5.1e-05,1.6e-05,7.2e-05,3.5e-05,5.9e-05,7.7e-05,5.4e-05,2.4e-05,2.8e-05,3.2e-05,0.000113,3.5e-05,2.8e-05,7.9e-05,4.6e-05,5e-05,4.3e-05,2.3e-05,3.8e-05,6.3e-05,6.3e-05,8.1e-05,7.7e-05,7.3e-05,3e-05,2.5e-05,4e-05,9.5e-05,8.1e-05,3.6e-05,1.7e-05,3.7e-05,7.1e-05,7.7e-05,1.1e-05,7.8e-05,4.8e-05,3e-05,4.5e-05,6.1e-05,1.8e-05,5.6e-05,4.9e-05,5.9e-05,4.8e-05,1.6e-05,2.8e-05,2.1e-05,1e-06,2.1e-05,4e-05,7.1e-05,9.1e-05,5.3e-05,8.4e-05,0.000106,3.6e-05,4.5e-05,3.9e-05,2.9e-05,1.2e-05,3.6e-05,6.6e-05,9e-06,1.7e-05,2.3e-05,3.2e-05,3.9e-05,3.2e-05,3.6e-05,4.6e-05,4.3e-05,2.3e-05,2.4e-05,4e-05,3.7e-05,9e-06,1.3e-05,1.2e-05,4.8e-05,6.4e-05,6.4e-05,9.1e-05
0.000123,6.2e-05,3.4e-05,6.2e-05,3.6e-05,2.2e-05,4.8e-05,3e-05,4.4e-05,4.2e-05,3.1e-05,3.1e-05,8.6e-05,6.1e-05,3.8e-05,6.2e-05,2.1e-05,2.8e-05,5.3e-05,5.9e-05,2.5e-05,2.2e-05,3.5e-05,3.1e-05,3.7e-05,6.8e-05,5.7e-05,3.4e-05,9.7e-05,8.5e-05,0.000129,6.2e-05,3.4e-05,2.2e-05,4.6e-05,9.2e-05,7.2e-05,8e-06,5.7e-05,2.1e-05,9.1e-05,0.000121,0.000115,5.9e-05,1e-05,2.5e-05,1.6e-05,2.2e-05,5.8e-05,0.000128,5.6e-05,2.8e-05,5.7e-05,5.2e-05,5.7e-05,7e-05,5.3e-05,5.9e-05,5.7e-05,2e-05,3.4e-05,3.1e-05,9.1e-05,4.5e-05,7e-06,5.2e-05,2.4e-05,2.1e-05,4.7e-05,5.3e-05,4e-05,2.1e-05,5.5e-05,0.000128,9.4e-05,0.000102,5.2e-05,1.3e-05,6.4e-05,3.1e-05,1.3e-05,4.9e-05,3.7e-05,3.3e-05,1.8e-05,6.4e-05,6.5e-05,3.8e-05,3.2e-05,6e-05,5.4e-05,5.7e-05,6.9e-05,1.7e-05,1.3e-05,2.6e-05,1.8e-05,1.8e-05,8e-06,2.6e-05,1.8e-05,4.7e-05,5.3e-05,6e-05,3.8e-05,5e-05,6.1e-05,3.7e-05,6.8e-05,3.8e-05,4.4e-05,1.4e-05,1.5e-05,8e-06,4.2e-05,2.5e-05,1.7e-05,6.2e-05,4.1e-05,9e-06,7.1e-05
5.2e-05,4.2e-05,2.1e-05,6.7e-05,4.6e-05,2.4e-05,4.7e-05,3.7e-05,1.1e-05,1.3e-05,6e-06,5.1e-05,3.6e-05,1.4e-05,1.9e-05,5.2e-05,6.4e-05,3.8e-05,6.8e-05,3.6e-05,5.7e-05,4.2e-05,3.4e-05,1.3e-05,5e-05,3.7e-05,5.8e-05,2.6e-05,0.000109,4.6e-05,6.2e-05,0.000115,4.1e-05,2e-05,6.5e-05,4.6e-05,4.8e-05,4.9e-05,6.3e-05,3.6e-05,9.9e-05,0.000102,8e-06,6.3e-05,2.2e-05,5.6e-05,1.5e-05,3.3e-05,5.4e-05,0.000122,7.5e-05,5.8e-05,7e-06,8.2e-05,0.000108,3.8e-05,1.3e-05,5.7e-05,8.6e-05,5.2e-05,6.4e-05,6.8e-05,5e-05,6.1e-05,8e-05,1.6e-05,6.6e-05,5.4e-05,6.2e-05,6.6e-05,1.3e-05,1.8e-05,3.7e-05,9.5e-05,1.1e-05,6.1e-05,3.8e-05,3.6e-05,4.6e-05,6.5e-05,3.6e-05,3.4e-05,3e-05,4e-05,4.3e-05,5.6e-05,5e-05,4e-05,8.1e-05,9.1e-05,9.7e-05,1.7e-05,2.9e-05,5.1e-05,2.4e-05,1.4e-05,3.2e-05,3.4e-05,1.3e-05,5.9e-05,4.5e-05,5.2e-05,3.5e-05,5e-05,4.7e-05,6.8e-05,1.3e-05,7.7e-05,3.6e-05,4.7e-05,2e-05,3.7e-05,1.4e-05,2.1e-05,5.9e-05,2.7e-05,3e-06,6.9e-05,4.5e-05,8e-06,5.2e-05
9e-05,0.000129,1e-04,2.9e-05,0.000119,0.000129,0.000102,7.4e-05,3.2e-05,5.4e-05,2e-06,4.9e-05,8.8e-05,8.3e-05,5.2e-05,7.1e-05,0.000157,7.3e-05,5e-05,3e-05,4.6e-05,7.5e-05,7.7e-05,3.8e-05,5.7e-05,7e-05,4.1e-05,4.2e-05,0.00012,7.7e-05,1.7e-05,7.9e-05,7.8e-05,2.6e-05,4.2e-05,0.00011,0.000159,9.6e-05,2.7e-05,6.7e-05,3e-05,7.3e-05,0.000102,0.000117,5.7e-05,4.8e-05,7.7e-05,8.5e-05,3.8e-05,4.4e-05,0.00011,6.5e-05,0.000113,8.4e-05,0.00022,0.000265,0.000148,1.6e-05,3.6e-05,4.6e-05,7.1e-05,2.1e-05,6.9e-05,9e-06,6.4e-05,0.000118,0.000138,4.9e-05,0.000104,0.000134,0.000113,5.1e-05,3.1e-05,9.3e-05,8.8e-05,4.8e-05,6e-05,9.8e-05,7.7e-05,4.1e-05,4.4e-05,5e-05,2.4e-05,0.000101,5.3e-05,2.2e-05,1.5e-05,1.7e-05,8.6e-05,4.7e-05,3.9e-05,0.000116,9.8e-05,0.000142,5.8e-05,3e-05,3.9e-05,9.9e-05,9.5e-05,0.000137,8.2e-05,1.9e-05,9.3e-05,5e-05,6.9e-05,8.2e-05,4.5e-05,5.1e-05,5.4e-05,0.000106,8.6e-05,8.5e-05,5.4e-05,5e-05,2e-05,1.8e-05,2.7e-05,7.6e-05,5.1e-05,5.4e-05,3.8e-05
5e-05,1e-04,7.6e-05,4.6e-05,6.3e-05,3.9e-05,1.3e-05,2e-05,2.1e-05,2e-05,3e-05,2.7e-05,2e-05,2.5e-05,4.4e-05,7.8e-05,9e-05,6.6e-05,6.7e-05,3.9e-05,2.5e-05,2.1e-05,4.7e-05,6.9e-05,8e-05,6.7e-05,5.5e-05,3.1e-05,6.1e-05,4.5e-05,2.3e-05,8e-06,1.7e-05,1.9e-05,8e-06,4.2e-05,6.2e-05,3.9e-05,3.9e-05,1.1e-05,2e-05,4e-05,4.5e-05,1.2e-05,2.1e-05,2.3e-05,1.6e-05,1.5e-05,5.3e-05,4.9e-05,6.1e-05,6.4e-05,7.9e-05,8.3e-05,9.2e-05,6e-05,4e-05,4.8e-05,4e-05,3.2e-05,3.7e-05,2.1e-05,3e-05,3.2e-05,1e-05,5.9e-05,3.5e-05,3.8e-05,5.7e-05,7e-06,3.3e-05,2e-05,1.7e-05,3.1e-05,2.8e-05,2.3e-05,4e-05,6.4e-05,4.4e-05,5.4e-05,3e-05,8e-06,3.7e-05,5.8e-05,4e-05,2e-05,9e-06,4e-06,3.6e-05,3.7e-05,7e-06,5e-05,1.8e-05,6.5e-05,7.9e-05,6.5e-05,2.6e-05,2.8e-05,1.8e-05,3.5e-05,1.5e-05,1.3e-05,3.3e-05,3.5e-05,2.5e-05,5.9e-05,5.4e-05,4.5e-05,2.3e-05,4.4e-05,2.2e-05,1.7e-05,2.7e-05,2.6e-05,2.3e-05,1.2e-05,1.9e-05,3.5e-05,1.9e-05,2.5e-05,1.7e-05
2.9e-05,4.5e-05,1.2e-05,1.4e-05,2.7e-05,1.1e-05,3e-06,1.8e-05,1.3e-05,1.5e-05,1.9e-05,1.4e-05,2e-05,1.6e-05,3.1e-05,3.2e-05,1.7e-05,2e-05,2.1e-05,1.3e-05,7e-06,1.5e-05,2.4e-05,2.9e-05,2.5e-05,2.1e-05,6e-06,5e-06,2.5e-05,1.1e-05,1.1e-05,7e-06,1.8e-05,2e-05,2.4e-05,2.1e-05,1.8e-05,1.3e-05,1e-05,8e-06,1e-05,2e-05,5e-06,1e-05,1e-05,8e-06,1.2e-05,6e-06,2.8e-05,3.6e-05,3e-06,3.5e-05,2e-05,2e-05,2.8e-05,2.2e-05,3e-06,1.5e-05,1.6e-05,6e-06,1.5e-05,5e-06,1.4e-05,1.5e-05,1.1e-05,4e-05,1.6e-05,2.5e-05,2.1e-05,1.8e-05,1.7e-05,1.6e-05,2.2e-05,9e-06,1.1e-05,7e-06,1.9e-05,1.6e-05,1.8e-05,1.7e-05,5e-06,1.1e-05,2.8e-05,1.4e-05,5e-06,1.4e-05,1e-05,3e-06,1.7e-05,2.3e-05,2.8e-05,2e-05,1.2e-05,4.7e-05,2.3e-05,1.5e-05,1.4e-05,1.5e-05,1.7e-05,1.8e-05,1e-05,1.1e-05,7e-06,6e-06,1.1e-05,2.9e-05,2.7e-05,6e-06,1.7e-05,1.6e-05,1.4e-05,1.4e-05,1.2e-05,8e-06,1e-05,2e-06,9e-06,1.5e-05,2.1e-05,1.1e-05,2.4e-05
1.6e-05,1.3e-05,8e-06,8e-06,9e-06,6e-06,3e-06,1e-05,1e-06,6e-06,1.4e-05,1.7e-05,8e-06,1.7e-05,1.3e-05,7e-06,4e-06,1.2e-05,6e-06,1.1e-05,7e-06,1.5e-05,8e-06,2.2e-05,1.8e-05,1.7e-05,1.3e-05,2e-06,4e-06,5e-06,4e-06,3e-06,9e-06,1e-05,8e-06,1.2e-05,1.3e-05,1.5e-05,6e-06,3e-06,9e-06,1.2e-05,5e-06,4e-06,1e-06,2e-06,7e-06,3e-06,1.2e-05,1.3e-05,7e-06,1.7e-05,9e-06,7e-06,1.9e-05,2e-06,1.2e-05,1.2e-05,1e-05,1e-05,1.2e-05,6e-06,7e-06,3e-06,8e-06,1.1e-05,5e-06,7e-06,7e-06,7e-06,8e-06,9e-06,2e-06,7e-06,8e-06,6e-06,1.5e-05,8e-06,1.4e-05,1e-05,3e-06,5e-06,1.6e-05,9e-06,1.2e-05,1.5e-05,6e-06,3e-06,4e-06,1.2e-05,9e-06,9e-06,2.5e-05,1.3e-05,1.4e-05,4e-06,7e-06,7e-06,1e-05,1e-05,6e-06,3e-06,5e-06,9e-06,1.1e-05,8e-06,1.3e-05,2e-06,1.2e-05,8e-06,9e-06,6e-06,1.1e-05,3e-06,3e-06,1e-06,2e-06,1.1e-05,1.2e-05,7e-06,7e-06
1.1e-05,1.6e-05,1e-05,5e-06,1e-05,6e-06,3e-06,3e-06,3e-06,7e-06,1.2e-05,9e-06,3e-06,1e-05,9e-06,1.3e-05,1.3e-05,8e-06,4e-06,8e-06,4e-06,1e-05,3e-06,1.3e-05,1.4e-05,5e-06,3e-06,2e-06,6e-06,5e-06,5e-06,6e-06,1.1e-05,4e-06,7e-06,1e-05,8e-06,1.3e-05,4e-06,4e-06,5e-06,1e-05,2e-06,3e-06,3e-06,5e-06,1.3e-05,6e-06,8e-06,8e-06,1.1e-05,1.2e-05,8e-06,1.1e-05,2e-05,7e-06,3e-06,5e-06,9e-06,1e-05,5e-06,5e-06,2e-06,6e-06,9e-06,1e-05,2e-06,5e-06,3e-06,1e-05,5e-06,9e-06,2e-06,8e-06,5e-06,2e-06,1.2e-05,6e-06,7e-06,6e-06,4e-06,5e-06,8e-06,5e-06,2e-06,5e-06,4e-06,4e-06,7e-06,8e-06,1.2e-05,1.6e-05,1.4e-05,1.3e-05,7e-06,4e-06,6e-06,4e-06,9e-06,4e-06,1e-06,4e-06,4e-06,7e-06,9e-06,6e-06,4e-06,8e-06,4e-06,5e-06,4e-06,4e-06,5e-06,6e-06,3e-06,3e-06,2e-06,8e-06,9e-06,5e-06,1e-06
1e-05,1.1e-05,2e-06,2e-06,8e-06,3e-06,2e-06,3e-06,3e-06,7e-06,1e-05,6e-06,2e-06,8e-06,4e-06,1.1e-05,1.1e-05,3e-06,8e-06,2e-06,3e-06,8e-06,2e-06,9e-06,7e-06,9e-06,3e-06,2e-06,9e-06,6e-06,3e-06,6e-06,9e-06,3e-06,3e-06,1e-05,8e-06,6e-06,3e-06,5e-06,6e-06,8e-06,1e-06,3e-06,7e-06,2e-06,1e-05,1e-06,6e-06,8e-06,7e-06,9e-06,4e-06,1.1e-05,1.4e-05,5e-06,3e-06,4e-06,5e-06,9e-06,3e-06,2e-06,4e-06,4e-06,8e-06,4e-06,4e-06,7e-06,3e-06,8e-06,1e-06,6e-06,6e-06,6e-06,3e-06,2e-06,1e-05,5e-06,3e-06,7e-06,1e-06,4e-06,7e-06,1e-06,2e-06,6e-06,5e-06,3e-06,2e-06,2e-06,8e-06,1.1e-05,1e-05,1e-05,5e-06,1e-06,5e-06,3e-06,6e-06,5e-06,6e-06,4e-06,1e-06,5e-06,5e-06,3e-06,1.1e-05,4e-06,1e-05,1e-06,4e-06,5e-06,5e-06,4e-06,5e-06,4e-06,3e-06,7e-06,6e-06,4e-06,5e-06
4e-06,7e-06,6e-06,1e-06,6e-06,0,2e-06,1e-06,1e-06,4e-06,1e-05,3e-06,2e-06,6e-06,5e-06,6e-06,7e-06,2e-06,3e-06,2e-06,3e-06,7e-06,3e-06,8e-06,7e-06,7e-06,3e-06,0,5e-06,2e-06,1e-06,3e-06,6e-06,3e-06,3e-06,6e-06,3e-06,7e-06,3e-06,7e-06,3e-06,7e-06,1e-06,2e-06,6e-06,6e-06,7e-06,1e-06,5e-06,1e-05,7e-06,7e-06,0,4e-06,1.1e-05,1e-06,2e-06,1e-06,2e-06,7e-06,1e-06,1e-06,2e-06,2e-06,8e-06,9e-06,4e-06,3e-06,2e-06,4e-06,3e-06,6e-06,5e-06,5e-06,5e-06,2e-06,9e-06,8e-06,7e-06,3e-06,2e-06,1e-06,7e-06,1e-06,5e-06,3e-06,5e-06,3e-06,3e-06,3e-06,4e-06,1e-05,1e-05,1.2e-05,5e-06,2e-06,1e-06,2e-06,6e-06,3e-06,5e-06,3e-06,5e-06,6e-06,7e-06,5e-06,1e-05,2e-06,7e-06,2e-06,1e-06,5e-06,3e-06,4e-06,5e-06,2e-06,2e-06,4e-06,9e-06,3e-06,2e-06
3e-06,4e-06,4e-06,3e-06,5e-06,2e-06,4e-06,1e-06,2e-06,6e-06,6e-06,7e-06,2e-06,5e-06,3e-06,7e-06,5e-06,1e-06,2e-06,5e-06,2e-06,7e-06,3e-06,5e-06,5e-06,1e-06,5e-06,3e-06,4e-06,3e-06,4e-06,3e-06,3e-06,1e-06,2e-06,5e-06,2e-06,4e-06,4e-06,1e-05,7e-06,7e-06,1e-06,2e-06,7e-06,1e-06,9e-06,4e-06,3e-06,7e-06,5e-06,5e-06,4e-06,5e-06,1.1e-05,5e-06,3e-06,3e-06,2e-06,3e-06,2e-06,1e-06,1e-06,4e-06,5e-06,7e-06,3e-06,6e-06,2e-06,1e-06,5e-06,5e-06,4e-06,6e-06,4e-06,3e-06,1.1e-05,6e-06,4e-06,2e-06,2e-06,3e-06,7e-06,1e-06,3e-06,6e-06,3e-06,2e-06,2e-06,6e-06,1e-06,1.5e-05,1e-05,1.1e-05,3e-06,5e-06,3e-06,2e-06,6e-06,3e-06,5e-06,1e-06,4e-06,5e-06,4e-06,5e-06,6e-06,3e-06,5e-06,0,2e-06,5e-06,4e-06,3e-06,5e-06,3e-06,2e-06,5e-06,1e-05,8e-06,4e-06
6e-06,6e-06,6e-06,2e-06,6e-06,4e-06,3e-06,3e-06,2e-06,5e-06,4e-06,5e-06,3e-06,5e-06,3e-06,6e-06,2e-06,3e-06,3e-06,4e-06,5e-06,6e-06,2e-06,5e-06,4e-06,3e-06,2e-06,2e-06,1e-06,4e-06,2e-06,4e-06,7e-06,1e-06,4e-06,7e-06,2e-06,5e-06,5e-06,7e-06,4e-06,4e-06,2e-06,1e-06,5e-06,3e-06,9e-06,2e-06,3e-06,5e-06,4e-06,5e-06,3e-06,5e-06,6e-06,3e-06,2e-06,4e-06,3e-06,3e-06,2e-06,1e-06,1e-06,1e-06,4e-06,6e-06,2e-06,3e-06,3e-06,2e-06,4e-06,3e-06,3e-06,3e-06,6e-06,5e-06,1.1e-05,8e-06,5e-06,2e-06,2e-06,2e-06,7e-06,1e-06,2e-06,6e-06,5e-06,3e-06,4e-06,4e-06,2e-06,1.2e-05,6e-06,9e-06,1e-06,4e-06,3e-06,3e-06,3e-06,2e-06,1e-06,5e-06,0,5e-06,6e-06,3e-06,7e-06,1e-06,3e-06,2e-06,3e-06,3e-06,2e-06,4e-06,5e-06,2e-06,2e-06,6e-06,9e-06,4e-06,1e-06
8e-06,9e-06,7e-06,5e-06,8e-06,4e-06,6e-06,6e-06,4e-06,3e-06,3e-06,2e-06,3e-06,7e-06,5e-06,5e-06,4e-06,2e-06,6e-06,2e-06,7e-06,1e-06,4e-06,3e-06,3e-06,6e-06,9e-06,8e-06,3e-06,6e-06,6e-06,4e-06,5e-06,4e-06,2e-06,1e-05,3e-06,7e-06,7e-06,9e-06,9e-06,6e-06,3e-06,1e-06,6e-06,1e-06,1.1e-05,2e-06,4e-06,6e-06,2e-06,5e-06,1e-06,2e-06,6e-06,4e-06,2e-06,3e-06,2e-06,6e-06,2e-06,2e-06,2e-06,7e-06,5e-06,1e-06,3e-06,2e-06,3e-06,6e-06,1e-06,8e-06,5e-06,3e-06,6e-06,4e-06,1.1e-05,5e-06,3e-06,4e-06,1e-06,3e-06,4e-06,2e-06,4e-06,5e-06,4e-06,4e-06,6e-06,3e-06,4e-06,1.1e-05,7e-06,6e-06,2e-06,2e-06,2e-06,4e-06,5e-06,6e-06,3e-06,4e-06,6e-06,3e-06,5e-06,5e-06,7e-06,2e-06,6e-06,3e-06,2e-06,0,3e-06,2e-06,7e-06,3e-06,3e-06,3e-06,5e-06,5e-06,4e-06
4e-06,5e-06,6e-06,3e-06,6e-06,4e-06,1e-06,2e-06,1e-06,7e-06,9e-06,5e-06,4e-06,1.1e-05,5e-06,1e-06,6e-06,4e-06,3e-06,4e-06,4e-06,6e-06,4e-06,7e-06,1e-06,8e-06,3e-06,1e-05,9e-06,1.3e-05,8e-06,9e-06,1.3e-05,7e-06,3e-06,9e-06,8e-06,6e-06,8e-06,8e-06,9e-06,1.3e-05,8e-06,3e-06,4e-06,5e-06,8e-06,3e-06,3e-06,3e-06,6e-06,5e-06,5e-06,2e-06,8e-06,2e-06,4e-06,5e-06,4e-06,9e-06,8e-06,5e-06,3e-06,8e-06,4e-06,8e-06,3e-06,2e-06,3e-06,2e-06,2e-06,9e-06,5e-06,6e-06,5e-06,6e-06,1.5e-05,6e-06,5e-06,5e-06,5e-06,8e-06,1.2e-05,3e-06,3e-06,5e-06,3e-06,5e-06,7e-06,6e-06,1e-06,9e-06,9e-06,1e-06,5e-06,4e-06,4e-06,4e-06,2e-06,8e-06,1.1e-05,5e-06,3e-06,6e-06,4e-06,1e-05,8e-06,6e-06,1e-05,9e-06,6e-06,2e-06,4e-06,5e-06,8e-06,5e-06,2e-06,6e-06,8e-06,6e-06,5e-06
1e-06,2e-06,7e-06,4e-06,6e-06,2e-06,3e-06,2e-06,3e-06,8e-06,7e-06,8e-06,1e-06,1e-05,2e-06,2e-06,2e-06,6e-06,3e-06,3e-06,5e-06,4e-06,6e-06,8e-06,1e-05,5e-06,4e-06,5e-06,6e-06,6e-06,3e-06,3e-06,5e-06,3e-06,2e-06,8e-06,6e-06,1.1e-05,2e-06,7e-06,1.2e-05,9e-06,9e-06,7e-06,5e-06,3e-06,3e-06,4e-06,2e-06,7e-06,6e-06,4e-06,5e-06,5e-06,1.3e-05,6e-06,6e-06,4e-06,5e-06,7e-06,6e-06,1e-06,2e-06,6e-06,3e-06,7e-06,0,2e-06,3e-06,6e-06,4e-06,4e-06,6e-06,8e-06,2e-06,2e-06,9e-06,4e-06,4e-06,4e-06,4e-06,4e-06,7e-06,4e-06,3e-06,8e-06,4e-06,4e-06,2e-06,1e-05,6e-06,5e-06,4e-06,9e-06,2e-06,2e-06,1e-06,4e-06,8e-06,8e-06,2e-06,1e-06,6e-06,7e-06,3e-06,4e-06,3e-06,5e-06,2e-06,1e-06,2e-06,2e-06,3e-06,3e-06,6e-06,2e-06,2e-06,1e-05,3e-06,5e-06,3e-06
1e-06,3e-06,2e-06,4e-06,7e-06,1e-06,3e-06,2e-06,5e-06,7e-06,2e-06,7e-06,4e-06,6e-06,1e-06,5e-06,5e-06,3e-06,2e-06,0,5e-06,7e-06,2e-06,5e-06,7e-06,2e-06,2e-06,2e-06,3e-06,6e-06,2e-06,4e-06,3e-06,3e-06,4e-06,3e-06,2e-06,2e-06,3e-06,7e-06,6e-06,1.1e-05,4e-06,2e-06,2e-06,3e-06,6e-06,3e-06,3e-06,2e-06,2e-06,3e-06,4e-06,2e-06,1.6e-05,2e-06,2e-06,1e-06,2e-06,4e-06,4e-06,3e-06,3e-06,0,2e-06,3e-06,0,6e-06,1e-06,5e-06,2e-06,4e-06,5e-06,4e-06,3e-06,5e-06,5e-06,1e-06,2e-06,1e-06,4e-06,2e-06,3e-06,4e-06,2e-06,2e-06,4e-06,1e-06,4e-06,7e-06,2e-06,7e-06,1e-06,4e-06,2e-06,1e-06,1e-06,2e-06,7e-06,5e-06,3e-06,1e-06,6e-06,3e-06,3e-06,2e-06,3e-06,0,2e-06,3e-06,1e-06,2e-06,2e-06,4e-06,4e-06,3e-06,3e-06,6e-06,8e-06,3e-06,2e-06
3e-06,3e-06,1e-06,3e-06,6e-06,2e-06,3e-06,0,5e-06,7e-06,3e-06,4e-06,3e-06,7e-06,3e-06,6e-06,3e-06,0,4e-06,1e-06,6e-06,5e-06,3e-06,2e-06,4e-06,7e-06,1e-06,3e-06,2e-06,3e-06,4e-06,2e-06,5e-06,3e-06,2e-06,3e-06,4e-06,8e-06,2e-06,4e-06,2e-06,5e-06,3e-06,2e-06,1e-06,3e-06,8e-06,2e-06,4e-06,4e-06,4e-06,5e-06,3e-06,4e-06,1.1e-05,3e-06,2e-06,3e-06,1e-06,2e-06,1e-06,3e-06,1e-06,3e-06,2e-06,4e-06,3e-06,3e-06,1e-06,4e-06,3e-06,2e-06,2e-06,5e-06,3e-06,4e-06,5e-06,1e-06,4e-06,2e-06,3e-06,4e-06,7e-06,4e-06,6e-06,5e-06,3e-06,4e-06,2e-06,5e-06,3e-06,8e-06,1e-06,6e-06,4e-06,3e-06,1e-06,2e-06,3e-06,5e-06,1e-06,2e-06,4e-06,1e-06,2e-06,3e-06,6e-06,4e-06,3e-06,1e-06,3e-06,2e-06,1e-06,4e-06,2e-06,2e-06,3e-06,4e-06,6e-06,7e-06,2e-06
1e-06,2e-06,3e-06,3e-06,3e-06,3e-06,2e-06,3e-06,4e-06,7e-06,3e-06,4e-06,4e-06,5e-06,4e-06,3e-06,2e-06,2e-06,2e-06,1e-06,4e-06,5e-06,1e-06,4e-06,3e-06,1e-06,1e-06,3e-06,3e-06,2e-06,3e-06,2e-06,3e-06,2e-06,1e-06,4e-06,4e-06,4e-06,2e-06,4e-06,3e-06,8e-06,2e-06,1e-06,1e-06,2e-06,3e-06,4e-06,2e-06,4e-06,5e-06,5e-06,5e-06,0,7e-06,3e-06,2e-06,2e-06,3e-06,5e-06,2e-06,3e-06,2e-06,2e-06,3e-06,6e-06,1e-06,2e-06,1e-06,5e-06,2e-06,4e-06,3e-06,5e-06,3e-06,2e-06,4e-06,3e-06,3e-06,2e-06,1e-06,6e-06,4e-06,1e-06,3e-06,5e-06,3e-06,3e-06,3e-06,8e-06,4e-06,6e-06,4e-06,5e-06,3e-06,2e-06,3e-06,2e-06,7e-06,6e-06,4e-06,1e-06,4e-06,2e-06,4e-06,6e-06,3e-06,5e-06,3e-06,4e-06,1e-06,2e-06,2e-06,4e-06,2e-06,3e-06,2e-06,3e-06,9e-06,5e-06,2e-06
2e-06,2e-06,5e-06,5e-06,5e-06,1e-06,2e-06,2e-06,2e-06,7e-06,6e-06,2e-06,3e-06,4e-06,1e-06,1e-06,5e-06,2e-06,1e-06,2e-06,0,7e-06,2e-06,5e-06,3e-06,4e-06,2e-06,2e-06,3e-06,3e-06,3e-06,0,0,2e-06,1e-06,5e-06,5e-06,8e-06,2e-06,4e-06,1e-06,3e-06,2e-06,1e-06,3e-06,4e-06,5e-06,1e-06,3e-06,4e-06,4e-06,6e-06,4e-06,4e-06,6e-06,2e-06,2e-06,1e-06,2e-06,2e-06,3e-06,1e-06,2e-06,4e-06,1e-06,5e-06,3e-06,3e-06,2e-06,4e-06,1e-06,5e-06,3e-06,5e-06,2e-06,0,5e-06,3e-06,2e-06,1e-06,1e-06,4e-06,5e-06,2e-06,0,5e-06,3e-06,1e-06,1e-06,7e-06,0,4e-06,1e-06,4e-06,3e-06,4e-06,2e-06,5e-06,4e-06,3e-06,2e-06,2e-06,4e-06,4e-06,4e-06,4e-06,5e-06,4e-06,3e-06,5e-06,4e-06,0,2e-06,4e-06,3e-06,2e-06,1e-06,4e-06,8e-06,7e-06,2e-06
1e-06,4e-06,4e-06,4e-06,2e-06,1e-06,1e-06,1e-06,3e-06,4e-06,5e-06,1e-06,3e-06,4e-06,1e-06,2e-06,1e-06,0,1e-06,3e-06,3e-06,6e-06,2e-06,2e-06,3e-06,5e-06,3e-06,5e-06,4e-06,4e-06,6e-06,4e-06,3e-06,1e-06,2e-06,5e-06,3e-06,6e-06,1e-06,4e-06,3e-06,5e-06,2e-06,3e-06,1e-06,1e-06,7e-06,2e-06,3e-06,3e-06,3e-06,6e-06,1e-06,0,7e-06,3e-06,1e-06,1e-06,1e-06,3e-06,1e-06,1e-06,1e-06,3e-06,2e-06,7e-06,1e-06,2e-06,3e-06,3e-06,2e-06,3e-06,4e-06,3e-06,3e-06,1e-06,6e-06,3e-06,2e-06,3e-06,3e-06,5e-06,1e-06,3e-06,3e-06,5e-06,3e-06,2e-06,3e-06,6e-06,1e-06,7e-06,3e-06,7e-06,2e-06,2e-06,3e-06,5e-06,6e-06,2e-06,1e-06,0,5e-06,3e-06,4e-06,3e-06,4e-06,4e-06,5e-06,3e-06,1e-06,2e-06,3e-06,3e-06,4e-06,2e-06,1e-06,2e-06,5e-06,6e-06,1e-06
1e-06,3e-06,6e-06,1e-06,3e-06,1e-06,1e-06,1e-06,1e-06,5e-06,4e-06,3e-06,2e-06,6e-06,2e-06,3e-06,4e-06,2e-06,1e-06,1e-06,3e-06,4e-06,3e-06,4e-06,4e-06,3e-06,2e-06,2e-06,2e-06,2e-06,1e-06,1e-06,5e-06,2e-06,2e-06,3e-06,2e-06,7e-06,1e-06,5e-06,3e-06,5e-06,2e-06,2e-06,2e-06,2e-06,8e-06,3e-06,3e-06,4e-06,3e-06,6e-06,1e-06,1e-06,9e-06,2e-06,0,1e-06,1e-06,3e-06,3e-06,1e-06,1e-06,4e-06,1e-06,6e-06,4e-06,4e-06,2e-06,4e-06,0,3e-06,3e-06,4e-06,2e-06,0,6e-06,2e-06,2e-06,3e-06,3e-06,3e-06,5e-06,1e-06,2e-06,4e-06,5e-06,1e-06,3e-06,5e-06,1e-06,8e-06,1e-06,6e-06,1e-06,0,2e-06,3e-06,3e-06,3e-06,2e-06,1e-06,4e-06,3e-06,4e-06,3e-06,6e-06,1e-06,1e-06,1e-06,1e-06,1e-06,2e-06,1e-06,3e-06,2e-06,1e-06,2e-06,5e-06,5e-06,2e-06
1e-06,1e-06,5e-06,2e-06,3e-06,2e-06,2e-06,2e-06,3e-06,6e-06,4e-06,3e-06,1e-06,4e-06,1e-06,3e-06,4e-06,1e-06,1e-06,2e-06,2e-06,4e-06,2e-06,3e-06,3e-06,2e-06,3e-06,2e-06,2e-06,1e-06,2e-06,1e-06,3e-06,1e-06,1e-06,3e-06,1e-06,5e-06,1e-06,5e-06,4e-06,6e-06,1e-06,1e-06,0,4e-06,6e-06,2e-06,2e-06,2e-06,4e-06,5e-06,1e-06,2e-06,8e-06,2e-06,1e-06,0,2e-06,3e-06,2e-06,1e-06,1e-06,3e-06,1e-06,5e-06,4e-06,2e-06,3e-06,2e-06,1e-06,2e-06,4e-06,4e-06,3e-06,0,6e-06,1e-06,3e-06,3e-06,2e-06,3e-06,5e-06,1e-06,1e-06,4e-06,4e-06,2e-06,1e-06,5e-06,1e-06,6e-06,2e-06,6e-06,1e-06,1e-06,3e-06,1e-06,6e-06,1e-06,3e-06,0,3e-06,3e-06,4e-06,1e-06,4e-06,0,3e-06,1e-06,1e-06,0,2e-06,2e-06,4e-06,2e-06,1e-06,2e-06,6e-06,4e-06,1e-06
1e-06,2e-06,5e-06,1e-06,3e-06,1e-06,0,1e-06,2e-06,6e-06,4e-06,3e-06,2e-06,5e-06,0,4e-06,4e-06,1e-06,2e-06,1e-06,2e-06,4e-06,2e-06,3e-06,3e-06,3e-06,1e-06,2e-06,1e-06,1e-06,2e-06,1e-06,1e-06,1e-06,1e-06,4e-06,1e-06,5e-06,0,3e-06,5e-06,4e-06,1e-06,1e-06,0,2e-06,7e-06,1e-06,1e-06,4e-06,3e-06,5e-06,1e-06,1e-06,7e-06,1e-06,1e-06,0,2e-06,4e-06,2e-06,1e-06,1e-06,3e-06,1e-06,5e-06,2e-06,2e-06,1e-06,3e-06,1e-06,3e-06,3e-06,4e-06,2e-06,1e-06,6e-06,1e-06,2e-06,2e-06,2e-06,2e-06,5e-06,1e-06,1e-06,4e-06,4e-06,1e-06,2e-06,5e-06,1e-06,6e-06,2e-06,6e-06,1e-06,0,1e-06,1e-06,5e-06,2e-06,2e-06,1e-06,4e-06,2e-06,4e-06,2e-06,4e-06,1e-06,2e-06,0,1e-06,1e-06,2e-06,2e-06,3e-06,2e-06,0,3e-06,6e-06,3e-06,1e-06
0,2e-06,4e-06,3e-06,4e-06,1e-06,1e-06,1e-06,2e-06,5e-06,4e-06,3e-06,1e-06,4e-06,0,3e-06,3e-06,1e-06,2e-06,1e-06,1e-06,4e-06,1e-06,3e-06,3e-06,3e-06,1e-06,2e-06,1e-06,1e-06,2e-06,1e-06,3e-06,0,2e-06,4e-06,1e-06,4e-06,1e-06,4e-06,3e-06,5e-06,1e-06,0,1e-06,3e-06,6e-06,1e-06,1e-06,3e-06,3e-06,5e-06,1e-06,1e-06,8e-06,1e-06,0,0,1e-06,3e-06,2e-06,0,1e-06,3e-06,0,5e-06,3e-06,2e-06,1e-06,2e-06,0,3e-06,3e-06,4e-06,2e-06,0,6e-06,1e-06,3e-06,2e-06,2e-06,2e-06,5e-06,1e-06,2e-06,4e-06,4e-06,1e-06,2e-06,5e-06,1e-06,6e-06,2e-06,6e-06,1e-06,0,1e-06,1e-06,5e-06,1e-06,1e-06,0,4e-06,2e-06,3e-06,2e-06,5e-06,1e-06,2e-06,1e-06,0,1e-06,2e-06,3e-06,3e-06,1e-06,1e-06,3e-06,6e-06,3e-06,0
