-0.000638,-0.000159,-0.000113,-0.000854,-0.000668,-0.000818,-0.000561,-0.001715,-0.001878,-0.001235,-0.001149,-0.000887,-0.000841,-0.002912,-0.002594,-0.002234,-0.001422,-0.003162,-0.00098,-0.002489,-0.003226,-0.002057,-0.004627,-0.003848,-0.002649,-0.003015,-0.003353,-0.004412,-0.004575,-0.005228,-0.004307,-0.005917,-0.00505,-0.004324,-0.002247,-0.003061,-0.004172,-0.00422,-0.004343,-0.003809,-0.004847,-0.004462,-0.004695,-0.008805,-0.009858,-0.006085,-0.007274,-0.008204,-0.005226,-0.00618,-0.004875,-0.003068,-0.007091,-0.004941,-0.004859,-0.00572,-0.004375,-0.010589,-0.006749,-0.003681,-0.006575,-0.004844,-0.004463,-0.003461,-0.001315,-0.000624,-0.003254,-0.001569,-0.002719,-0.003323,-0.001889,-0.001613,-0.003867,-0.003548,-0.005681,-0.006055,-0.002993,-0.00443,-0.003349,-0.003339,-0.002589,-0.004616,-0.004603,-0.003623,-0.004166,-0.003217,-0.005572,-0.003173,-0.002564,-0.006374,-0.005304,-0.006014,-0.0044,-0.005029,-0.005685,-0.003326,-0.003535,-0.003941,-0.005611,-0.005287,-0.003898,-0.005153,-0.007983,-0.003195,-0.003909,-0.002902,-0.004149,-0.007707,-0.006138,-0.006437,-0.004599,-0.00536,-0.004128,-0.003313,-0.006685,-0.004107,-0.004106,-0.002401,-0.004119,0.00106,-0.007977
0.000496,-0.000149,-0.000356,0.000212,-0.000718,-0.000879,-0.000748,0.000627,0.000286,-0.00014,0.000213,-0.000534,0.000171,0.001533,0.001589,-0.000778,2.4e-05,0.001604,0.000611,-0.000203,0.000157,0.001571,0.002456,0.000588,-0.001018,-0.000402,-0.000239,0.000326,0.002545,0.001549,0.001591,0.001978,0.00055,-0.000414,-0.001214,0.000237,-0.000769,-0.001548,-0.001107,-0.00023,0.002974,-0.000596,-0.000517,0.002531,0.003133,0.002052,0.00236,0.002755,0.001133,0.000452,0.000164,-0.00179,-9.9e-05,-0.001873,-0.000777,0.000137,0.001026,0.003144,0.002624,0.001929,0.001383,0.001988,0.000779,-0.001424,-0.004419,-0.002716,0.000703,-0.001462,8.5e-05,-0.001138,-0.000808,-0.003639,0.001358,0.001332,0.002334,0.0018,0.001415,0.001488,0.000862,-0.00135,-0.003704,8.9e-05,0.00063,0.000703,0.001573,-0.002008,-0.001695,-0.00367,-0.003195,-0.001601,-0.000104,0.000259,2e-05,0.001006,0.000154,-0.001871,0.003304,-0.000133,-0.000982,-0.00112,-0.000147,0.002346,0.001155,-0.000815,-0.003314,-0.003134,-0.001173,-0.000478,-6.2e-05,-0.000239,-0.001308,0.001345,-0.000344,-6.4e-05,0.002112,6.3e-05,-0.000615,-0.003635,-0.001997,-0.003407,0.003637
-0.000515,-0.000728,-0.000174,-0.000137,0.000267,0.000192,0.00021,-0.000441,-4.3e-05,0,-7.9e-05,0.000336,-0.000116,-0.000612,-0.002136,-0.000442,-5.8e-05,-0.001396,-0.001103,-5.7e-05,0.00033,-0.000937,-0.001597,-0.000636,0.000224,0.001002,0.001094,0.000103,-0.001698,-0.002831,-0.002333,-0.001224,0.000599,0.00047,-0.000229,-0.000917,-9.2e-05,0.000974,0.001567,0.000501,-0.002319,-0.001787,0.000704,0.000199,-0.001308,0.000607,-0.000714,-0.000525,-0.001421,0.000572,-0.000385,0.001436,0.001344,0.001345,0.001418,-0.000951,-2.7e-05,-0.002602,-0.003188,-0.00178,-0.002784,-0.002676,-0.000519,0.001385,-0.000314,-0.001614,-0.001885,-0.00058,0.001352,0.001024,-0.000552,0.001187,-0.001338,-0.001545,-0.001713,-0.000258,0.00143,-0.002465,-0.00046,0.000752,0.000855,-0.001018,-0.002232,-0.002845,-0.00161,0.000334,-0.001289,1.4e-05,0.000495,0.001641,-0.001928,-0.00062,-0.002107,0.000151,5e-06,0.000454,-0.004056,-0.002126,-0.001702,-0.001328,-0.000961,-0.002073,-0.000522,0.000136,-0.000281,0.001324,3.4e-05,0.00084,-0.000544,-0.000954,0.000903,-0.000974,0.000114,0.000623,-0.002857,-0.000301,0.001259,0.000761,0.001011,-0.00116,-0.002796
0.000815,0.000524,-0.000263,-1.9e-05,0.000204,9.3e-05,-3e-06,0.000982,0.000531,0.000422,6.6e-05,-0.000101,0.000104,0.000303,0.001189,0.000627,-0.00033,0.001115,0.001008,0.000556,-0.000315,0.001351,0.00131,0.001396,0.00209,0.001137,-0.000964,0.000306,0.002257,0.003454,0.002822,0.000751,0.000225,0.000582,0.000265,0.000262,-0.001555,0.000471,8e-06,-0.000165,0.000983,0.002009,0.000836,0.001259,0.001643,-0.000552,0.000344,-0.000851,0.000837,-0.000254,2.3e-05,-3e-05,0.000878,0.00024,-0.000696,0.001631,0.001332,0.002478,0.002865,0.000514,0.0015,0.002721,0.001317,0.000283,0.002109,0.00135,0.001905,-8.9e-05,-0.001081,0.000627,-0.000565,0.000901,0.000574,0.000763,0.000185,0.000605,-0.0015,6e-06,0.00012,4e-05,-0.000733,0.000948,0.00315,0.002575,0.000883,0.001391,0.00347,0.002833,0.002129,0.002863,0.002272,0.001797,0.003447,0.00091,0.000153,-0.000179,0.002605,0.003556,0.002127,0.004231,0.003465,0.002194,0.001938,9e-04,0.002569,0.000586,0.000844,0.001026,0.001556,0.001525,0.000482,0.000612,0.000816,-0.000287,0.002944,0.001967,0.000465,0.001391,0.001509,0.003674,0.003095
-0.000453,-0.000351,-0.000122,-0.000402,-0.000292,-8e-06,-0.00076,-0.000674,-0.000756,-0.000886,-7e-05,-0.000241,-0.000243,-0.000617,-0.000383,-0.000109,0.00061,-0.000338,-0.001544,-0.001905,0.000406,-0.001311,-0.001832,-0.001792,-0.00207,-0.001736,0.000282,-0.000603,-0.002338,-0.001496,-0.002711,-0.001069,-0.001167,-0.000245,-0.00043,-0.001044,0.001781,-0.000106,-0.001089,-0.001443,-0.000704,-0.000411,-5e-04,-0.002143,-0.001429,0.000621,5.6e-05,0.001649,0.000977,-0.000158,-0.001611,-0.001684,-0.00185,-0.001592,-6.7e-05,-0.001953,-0.002563,-0.000677,-0.003063,-8.8e-05,-0.001146,-0.002611,-0.001973,-0.00062,-0.000658,0.000209,0.000246,0.000343,0.000784,-0.000171,-0.000221,-9.3e-05,-0.00084,-0.000761,0.000174,-0.000641,-0.000538,0.001691,-0.00058,0.000377,0.00019,-0.001282,-0.001681,-0.000139,-0.000224,-0.000501,-0.000229,-0.000604,0.000523,-0.002472,-0.000211,-0.000371,-0.001201,-0.00085,-0.000636,0.000239,-0.001446,-0.000974,-0.001776,-0.005091,-0.0019,-0.003441,-0.002201,-0.004127,-0.002234,-0.001368,-0.00025,-0.001094,-0.003642,0.00069,-0.000693,-0.001855,-0.002375,-0.001297,-0.001501,-0.002054,-0.000127,0.000835,-0.002285,-0.001912,-0.00282
6e-06,2e-04,0.000378,0.00058,-0.000149,0.000308,0.000829,0.000246,0.000343,0.000821,0.000588,0.000295,0.000288,0.000475,0.000304,2.9e-05,-0.000468,0.000303,0.001363,0.002224,7.7e-05,0.000154,0.000868,0.001742,6e-04,0.000462,0.000438,0.000736,0.001382,0.001281,0.002264,0.000967,5.2e-05,-0.000131,0.000221,0.001284,0.000208,-0.000179,0.001319,0.001639,0.000688,0.000373,-0.000921,0.001976,9.6e-05,-0.000616,-0.000454,-4e-06,-0.001687,0.000531,0.002063,0.002833,0.00183,0.002857,0.001599,0.001156,0.002309,0.000119,0.002772,0.000614,0.000146,0.001246,0.00173,-0.000214,-0.000478,-0.00072,-4e-06,-0.000192,8.9e-05,0.000351,0.000806,-0.000836,0.000292,0.000488,0.000666,0.000976,0.001626,0.000862,0.00152,4e-04,0.000868,0.00099,0.000167,0.001341,9e-06,-0.000139,-0.00215,-0.000936,-0.002302,-0.000615,-0.000627,-0.000325,-0.00033,-0.001049,0.000844,0.000374,0.000297,0.000459,-0.001305,0.000509,0.000175,0.001469,0.000767,0.003778,0.00186,0.001739,-0.00114,-0.000982,0.001174,-0.000981,-0.000637,-0.000568,0.000495,0.001496,0.000368,0.00091,0.000363,-0.001092,0.001698,0.000258,-0.000604
-0.00016,-0.000247,9.6e-05,5.7e-05,0.000423,-0.000217,-0.000348,-0.000171,-3.8e-05,-0.000461,-0.000246,-0.000431,-5e-06,-0.000167,-0.000239,-0.000153,0.000468,-0.000314,-0.000926,-0.000788,-3.8e-05,0.000451,0.000104,-0.000843,-0.000348,4.4e-05,-0.000121,-0.00025,-0.000308,-0.000662,-0.000585,-0.001246,-0.000196,2e-04,0.000352,4.1e-05,-5.5e-05,-0.000278,-2.6e-05,-0.00034,-0.00027,-0.00069,0.00073,-8.3e-05,0.000427,0.001416,0.001106,-0.001752,0.001206,-0.000675,-0.001639,-0.001032,-0.000855,-0.002062,-0.002676,0.000327,-0.000657,-0.000255,-0.001612,-0.000913,0.000917,0.000528,-0.000645,0.000325,0.000383,-0.000929,-0.000782,-0.000795,-0.000251,0.000149,-0.001517,-0.000361,-8e-06,-1.7e-05,-0.000604,-0.000177,-0.000884,-0.000648,-0.000893,-0.000587,-7e-05,-0.001668,-0.000461,-0.002011,-0.000604,0.000247,0.001886,0.001047,0.000535,0.000911,0.000294,0.00079,-0.000334,-0.000249,-0.000524,7.4e-05,-0.000765,-0.000133,0.00052,0.002062,0.00056,0.000466,0.000286,-0.001061,-0.000359,-6.7e-05,0.001025,0.001311,0.000624,0.000926,0.000946,0.001081,0.000521,-0.000957,-0.001105,-0.000113,-0.000213,-0.00035,-0.000136,0.000495,0.001104
7.6e-05,0.000215,-0.000199,-5.5e-05,-0.000291,-0.000159,-0.000108,-9e-05,-0.00012,0.000214,3e-06,0.000123,-3.9e-05,7.6e-05,0.00013,-0.000383,0.000206,-0.000197,0.000405,0.00044,-0.000525,-0.00061,0.000226,-9.1e-05,0.000215,-0.000615,-0.000444,-0.000582,0.000326,0.000315,-0.000936,0.000797,0.000121,-0.000194,-1.9e-05,-0.000675,-0.000595,0.000491,-0.000697,-0.000839,-0.000152,0.000514,0.000153,-0.001098,-0.000519,-0.001982,-0.001321,0.001809,-0.000902,-0.000132,0.000632,0.00069,-1.2e-05,9.3e-05,0.001026,-0.000662,0.000542,-0.000103,0.000422,0.000204,-7.5e-05,-3.2e-05,0.000542,-0.000606,-0.000418,0.001079,0.000372,0.000656,-0.000516,-0.000918,-4.8e-05,-0.000426,0.000639,-0.000993,0.000134,-0.000276,-0.000184,-0.000399,-0.000635,-0.000732,-0.000673,0.000216,-2.3e-05,0.000566,0.000558,-0.000138,-0.000497,-0.000364,-7.4e-05,0.000742,0.000477,-0.000297,0.000518,0.001446,0.00024,-0.000839,0.001536,0.000315,0.000293,-0.000977,-0.000314,0.000304,-0.000909,-0.000442,-0.00091,-7.6e-05,-0.000171,-0.00205,-0.000527,-0.001523,-0.000692,-0.000414,1e-05,0.000701,0.000424,0.000667,-0.00015,0.000632,-0.000372,-0.00139,-0.000336
-3.5e-05,3.8e-05,1.5e-05,-0.000144,0.000333,0.000207,3e-05,0.00013,-0.000245,-6.2e-05,0.000147,-1.1e-05,3.6e-05,0.000198,-5e-06,0.000608,-0.000295,0.000269,-0.000116,-0.000214,0.000797,0.000302,-0.000324,0.00048,-0.000223,0.000456,0.00046,0.000868,-0.000402,-0.000721,0.000138,0.000355,0.000301,0.000283,-0.000492,0.000449,0.00021,-0.000194,0.000713,0.000519,-0.000173,-0.00011,-5.4e-05,0.000486,0.000164,0.001148,0.000349,-0.001225,-0.000293,-0.000395,-0.000253,-0.001,0.000203,0.000515,0.000355,0.000472,-0.00113,-0.000857,-0.000619,0.000394,-0.00056,8.7e-05,-0.000635,0.000592,0.000495,0.000458,0.000664,0.000148,-0.00025,0.000151,0.001175,0.00084,-0.000931,0.000745,3.5e-05,8.3e-05,0.000489,0.000513,0.000385,0.000483,0.000372,0.00133,0.00058,-3.3e-05,0.000615,-0.000323,-0.000314,0.000271,-0.000589,-0.000286,-0.000111,-0.000429,-0.000474,-0.000469,-0.000254,0.000817,0.000325,-0.000663,0.000589,0.000943,0.000265,-0.001137,0.000978,0.001244,-0.000252,-0.001739,-0.001187,0.000459,-0.000239,0.000201,0.000301,-0.000364,0.000246,-0.000561,-0.000313,-0.000536,-0.000444,-0.000467,-0.000255,0.000309,-0.000333
-0.000104,5.5e-05,0.000103,4.4e-05,-6.3e-05,-4.3e-05,-0.000136,-8.2e-05,0.000269,6.4e-05,-0.000238,-4.8e-05,0.000143,-0.000164,-2.7e-05,-0.00041,0.000229,-2e-06,0.000392,1.7e-05,-0.000453,3.9e-05,0.00045,-0.000318,0.000539,0.00019,3.7e-05,-0.000552,-8.4e-05,0.000467,0.001034,-0.00059,-9.6e-05,-0.000288,0.000297,2e-05,-0.000277,-0.000159,-2.5e-05,-3.8e-05,0.000352,-3e-06,-7.9e-05,0.00075,8.2e-05,-0.000872,-0.000498,0.000746,0.000828,0.000653,0.000245,-7.5e-05,0.000194,0.000323,6.5e-05,0.000142,0.000517,0.001389,0.000503,-4e-04,0.000118,1.3e-05,0.000229,-0.00095,-0.00024,0.000217,-0.000415,0.000398,0.000212,0.000389,0.000224,-5e-05,0.000478,0.000469,0.000147,-0.000327,-0.000443,-4e-04,-0.000482,5.2e-05,6e-05,-0.00034,-0.000632,-0.000364,-8.1e-05,0.000544,0.000417,-0.00137,0.000596,-0.001177,-0.000438,-0.000849,-0.000461,-0.000193,-0.000122,-0.000831,-0.000747,-0.000195,-0.001094,-1e-04,-0.000175,0.00148,-8.9e-05,-0.000275,0.000771,0.001442,0.000812,-0.000117,3.1e-05,-0.000133,-0.000736,0.000534,0.000249,0.000411,0.000751,-0.000128,3.4e-05,-0.000904,0.000112,0.000955,-7.6e-05
9.9e-05,-3.1e-05,-8e-05,-8.1e-05,-0.000164,-0.000185,0.000203,-0.000207,-0.000147,-3e-05,2.2e-05,-3e-06,-0.000113,-3.6e-05,0.00012,0.000318,-0.000269,5.5e-05,-0.000116,8e-06,0.000296,-5.1e-05,-0.000334,-0.000317,-0.000352,-0.000267,-0.000216,0.000248,0.000104,-0.000245,-0.000368,-7e-06,-0.000206,-0.000134,-0.000476,-0.00049,0.000285,-2e-04,-0.000374,-0.000174,-0.000158,-7.6e-05,-0.000453,-0.00087,-0.000194,0.000693,0.000902,-0.000537,-0.000564,0.000161,-6e-06,1.3e-05,-0.000265,-0.000663,-9e-06,-0.000396,-0.00022,-0.000834,8e-05,0.000301,-2.1e-05,-0.000233,-0.000353,0.000838,2.2e-05,-0.000203,-0.000341,-0.000687,0.000307,-0.000471,-3.6e-05,-0.000263,0.000128,-0.000281,-0.00043,0.000108,0.000499,-4e-05,0.000398,0.000117,0.000252,2.6e-05,-0.00021,1.6e-05,-0.000324,-0.000486,-0.000431,0.000789,-0.000292,0.001057,0.00024,0.000737,0.00048,-0.000337,0.000461,0.000576,0.000268,-7.6e-05,0.000488,0.00038,0.00038,0.000153,0.000236,0.000184,-0.000828,-0.000619,-0.00013,0.000899,0.000379,0.000901,0.000232,-9e-05,-0.000177,-0.000745,-4.3e-05,0.000285,0.00026,0.000818,0.000821,-0.000899,0.000317
-9e-06,7e-05,-2.4e-05,6.5e-05,2e-05,0.000115,-2.6e-05,0.000107,0.000111,-5.6e-05,8.6e-05,0.000113,5e-05,0.000103,-7e-06,-0.000204,0.000275,-0.000326,-6.2e-05,-1.7e-05,-0.000205,5e-05,0.000121,0.000104,-9e-05,-0.000375,-1.2e-05,8.5e-05,5e-06,6.1e-05,-3e-06,0.000389,0.000141,-0.000106,0.000589,0.000591,0.000137,0.000246,0.000317,0.000305,-0.000141,0.000272,0.000745,0.000107,0.000161,-0.000567,-0.000372,0.000784,-1.2e-05,-0.000268,2e-05,0.000274,0.000755,2.4e-05,0.000198,0.000964,0.000232,0.00035,-0.000329,0.000317,0.000282,-8.9e-05,0.000236,-0.000293,0.000128,9.7e-05,0.000365,0.000259,-0.000229,0.000272,8.3e-05,0.000527,0.000143,0.00017,0.00047,0.000278,-0.000406,7.2e-05,0.000205,-5.4e-05,-0.000127,-0.000154,0.000781,0.000229,0.000112,0.000376,0.000174,0.00026,0.000249,-5.6e-05,0.000325,1.5e-05,-0.000471,4e-04,-1e-06,-2.8e-05,-0.000908,0.000679,0.000186,0.000361,-0.000426,-0.001311,-0.000444,-0.000456,0.00076,0.000373,-0.000294,-0.000282,-2.4e-05,-0.000626,0.000372,6.8e-05,-7e-06,0.000398,-0.000222,0.000455,0.000235,-0.000278,-0.000389,3.4e-05,-0.000363
-3.4e-05,2.7e-05,-9.6e-05,-1.2e-05,6.1e-05,-6.2e-05,-5.4e-05,8.3e-05,-1.4e-05,0.000189,-8.5e-05,-3.5e-05,-0.000157,-2.5e-05,-7.3e-05,9.4e-05,-0.000187,-3.1e-05,-4.6e-05,-4.2e-05,1.8e-05,-9.9e-05,2.6e-05,-2.9e-05,0.000229,0.000294,2e-05,-7.1e-05,0.000283,-0.00012,-8e-06,-1e-04,-2.3e-05,0.000335,-0.000214,-0.000137,-0.00014,-6.4e-05,-0.000147,-0.00017,8.4e-05,-0.000455,-0.000422,5.4e-05,-8.4e-05,0.000308,-0.000556,-0.000566,0.000517,0.00019,-6.5e-05,-0.00029,-0.000456,9.5e-05,-0.000321,-0.000767,-0.000126,-0.000164,0.00025,-0.000199,-0.000428,3.8e-05,0.000146,0.000275,0.000172,-3.7e-05,-0.000194,-6.4e-05,0.000208,3.4e-05,-0.00012,-0.000245,-0.000325,-0.000397,-0.000126,-0.000133,0.000629,-0.000133,-0.000255,-0.000129,1e-05,-0.000155,-0.000128,4e-05,-5.4e-05,-2.4e-05,9.4e-05,-0.000517,-0.000375,-0.000535,-0.000433,-0.000187,-0.000212,-0.000148,4e-05,0.000133,0.000821,-0.000342,0.000291,-0.000426,-0.000132,0.000539,7.3e-05,2.7e-05,-5e-06,-0.00014,4.3e-05,-0.000229,0.000289,0.000646,7.4e-05,-8.5e-05,4.5e-05,-1e-06,0.000101,-0.000314,-0.000632,1.3e-05,-0.000177,0.000172,0.000695
6e-05,-4.4e-05,9.9e-05,9e-06,6.1e-05,2.2e-05,7.4e-05,-2.9e-05,-6e-06,-0.000212,3.7e-05,-3.3e-05,0.000125,1.9e-05,2.4e-05,-3e-05,2.9e-05,0.000209,-3.8e-05,-6.1e-05,-7.9e-05,-0.000192,-3.6e-05,8.9e-05,-0.000117,2.3e-05,1e-05,3.8e-05,-0.000199,0.000188,0.000111,-8.2e-05,-7.7e-05,-0.000371,-0.000142,4.6e-05,0.00011,0.000116,0.000138,0.000211,-0.000102,0.000452,0.000502,0.000337,8.7e-05,3.5e-05,0.000474,-0.000125,-0.000624,-3.8e-05,-0.000439,4.8e-05,-6e-06,-5.4e-05,-0.000124,-0.000111,-0.000206,-7.3e-05,-0.000212,-1e-06,0.000331,0.000173,-4.3e-05,-0.000386,-0.000203,-0.000141,-0.000232,0.00028,-0.000106,5.5e-05,-9.3e-05,6.6e-05,1.1e-05,0.000131,-0.00011,0.000238,-0.000554,5.7e-05,7.8e-05,0.000101,-0.000205,-2e-04,-1e-06,0.000128,-5.3e-05,-0.000185,-0.000144,0.000316,0.000238,0.000388,0.000169,-9.3e-05,-0.00036,0.000296,3e-06,-0.000408,0.000337,0.000255,-9e-05,-4e-06,-0.000108,0.000349,-0.000355,-6e-05,-0.000168,-0.000212,0.000305,4.9e-05,-8.1e-05,-0.000165,6.6e-05,-0.000127,5.6e-05,-2e-05,-0.000132,0.00014,0.000317,0.000343,-5.6e-05,5.1e-05,-0.00037
-2.1e-05,-1.6e-05,-3.9e-05,-1.4e-05,4.3e-05,2.3e-05,-3.5e-05,3e-06,1.3e-05,-1.7e-05,4.6e-05,2.1e-05,-7.5e-05,5.9e-05,-6e-06,5.6e-05,-0.000106,-8.3e-05,9.4e-05,1.1e-05,-4.5e-05,0.000162,-0.000103,7e-06,0.000108,8.7e-05,-9.8e-05,3e-06,-8.5e-05,-0.000144,-0.000168,-0.000119,0.000267,0.000228,3.1e-05,-9.7e-05,6.9e-05,5.3e-05,-6.5e-05,-2e-06,1.4e-05,-0.000135,-0.000571,-9.9e-05,-7.5e-05,-1.6e-05,-3.7e-05,0.000285,0.000319,-3.7e-05,0.000439,6.4e-05,-8.3e-05,2e-06,0.000167,0.000218,0.000335,2e-05,0.000148,-8e-06,-0.000366,-6.1e-05,0.000177,0.000393,5.3e-05,0.000196,0.000169,-4.9e-05,0.000114,0.000101,1e-05,-0.00012,-3.1e-05,0.000218,6.2e-05,-0.000338,0.000125,2.8e-05,-0.000113,8.1e-05,5.4e-05,0.000574,-0.000115,-5.7e-05,-3.8e-05,-0.000252,0.000172,-0.000147,2.8e-05,-0.000601,-8.2e-05,0.000202,0.000438,-4.2e-05,2.7e-05,9.4e-05,-0.000482,-0.000244,8.4e-05,0.000211,-5.8e-05,0.000117,0.000118,6.1e-05,0.00023,0.000199,-0.000139,0.000114,-1.8e-05,6e-06,-0.000299,0.000393,-0.000226,0.000105,-5e-06,-0.000515,-4.2e-05,-0.000224,5.2e-05,-3.3e-05,-0.000179
-4.6e-05,1.5e-05,-1.1e-05,3e-05,-4.1e-05,3.9e-05,0.000108,-3.6e-05,7e-06,5.7e-05,-5e-06,-2.3e-05,-3e-05,-2.5e-05,-4.5e-05,-9.1e-05,9.8e-05,7.9e-05,2.5e-05,0.000108,9.2e-05,4.5e-05,6.4e-05,-2e-06,7e-05,-0.000147,2.2e-05,-1.4e-05,3.7e-05,8.4e-05,-6.2e-05,0.000121,-0.000291,-5.1e-05,-9.4e-05,2.1e-05,-8.6e-05,-0.000143,-0.000206,8.2e-05,6.6e-05,7.5e-05,0.000175,-0.000355,1e-05,-8.6e-05,-6.8e-05,-0.000166,6.1e-05,1.3e-05,-0.000194,0.000113,-5.5e-05,2.9e-05,0.000114,-0.000118,-0.000339,7.9e-05,-8.1e-05,0.000169,0.000232,-0.000117,-9.2e-05,-0.000411,-4.6e-05,-5.4e-05,-6e-06,-9e-06,-0.000152,-9.6e-05,4.8e-05,1.8e-05,4.9e-05,-0.000132,7.2e-05,0.000129,2.8e-05,-1.5e-05,8.4e-05,-3.9e-05,-2.6e-05,-0.000208,-0.000104,1.8e-05,6.6e-05,0.000182,-4.3e-05,6.2e-05,1e-04,0.000352,6e-05,5e-06,1.7e-05,6e-05,6.7e-05,3e-06,-7.3e-05,5e-05,-0.000151,-1.6e-05,0.000105,-0.000345,0.000182,9.5e-05,-0.000348,0.000107,-7.3e-05,-2.1e-05,-0.000137,-0.000162,-1.2e-05,-0.000106,-0.000104,0.000105,0.000185,0.000406,9e-05,9.6e-05,-7e-05,-6.2e-05,0.000274
5.3e-05,-2.9e-05,-1.6e-05,7e-06,-3.6e-05,-2.7e-05,-0.000143,-1.1e-05,-8.1e-05,-5.9e-05,-3.7e-05,-9e-06,3e-05,-1.1e-05,7e-06,0.000106,-1.8e-05,-3.3e-05,-1.6e-05,-6.9e-05,-3e-05,1.6e-05,2e-05,3.7e-05,-0.000123,3.6e-05,3.7e-05,-1.4e-05,6.8e-05,1.7e-05,0,-5.6e-05,9.2e-05,8.4e-05,0.000133,7.5e-05,-2.3e-05,-6.9e-05,0.000104,-0.000211,-1.5e-05,-0.000101,-5e-05,9.5e-05,-3.1e-05,0.000119,2.9e-05,5.4e-05,-0.000154,-5.7e-05,8e-06,-4.1e-05,3.7e-05,2.7e-05,-0.000197,0.000215,0.000234,-0.000118,2.9e-05,-0.000167,1.2e-05,-2e-05,7.8e-05,0.000206,8.4e-05,-7.2e-05,-0.000101,9.3e-05,-1.9e-05,5e-06,-9e-05,4.3e-05,-3e-06,-2.3e-05,-7.4e-05,-1.3e-05,1.3e-05,1.3e-05,-2.8e-05,2.3e-05,-2.7e-05,-5.2e-05,6.8e-05,-8.7e-05,-0.000103,-4.4e-05,-0.000143,0.000119,-9.4e-05,0.000174,7.1e-05,6.1e-05,-5.4e-05,-0.000101,-5.4e-05,-1e-05,3.1e-05,-3e-05,0.000153,-2.3e-05,-0.00013,0.000163,9e-06,3.5e-05,0.000191,-0.000283,0,5.8e-05,6.7e-05,5.7e-05,0.000103,-5.6e-05,7e-05,7e-06,-6.8e-05,1.3e-05,-0.000123,-6e-05,-9.9e-05,-0.000156,-8.4e-05
-2.5e-05,-9e-06,3.5e-05,-2.6e-05,-4e-06,-1.3e-05,7.4e-05,2.1e-05,3.8e-05,3.8e-05,1.4e-05,6e-06,-7e-06,-6e-06,2.2e-05,-1e-04,-1e-05,-4.3e-05,-6.2e-05,3.6e-05,1.7e-05,9e-06,2e-06,-1.7e-05,5.3e-05,7e-06,8e-06,-1.5e-05,5.3e-05,-8.8e-05,0.000127,2e-06,2.7e-05,-0.000135,-0.000116,-3e-05,5.6e-05,-9e-06,-2.5e-05,3.5e-05,3.1e-05,0.000136,8.5e-05,0.000245,7e-05,-0.000142,1.7e-05,-0.000119,-5e-06,0.000182,5.7e-05,-2e-06,-5.5e-05,-6e-05,0.000165,-0.000141,-3.9e-05,7.9e-05,2.2e-05,0,-2.3e-05,6.7e-05,-5.6e-05,-0.000121,-2.9e-05,1.9e-05,5.7e-05,4e-06,-1.8e-05,1.1e-05,6.1e-05,-2.5e-05,-0.000118,1e-06,-1.5e-05,-1.2e-05,-2.3e-05,5.4e-05,-7.4e-05,-5.3e-05,-4.3e-05,-2.6e-05,-6.5e-05,3e-05,-3.5e-05,5e-05,0.000196,-7.4e-05,3.9e-05,-0.000293,-2.4e-05,-0.000225,0.000134,0.00018,-6e-06,-3.1e-05,4.7e-05,2.9e-05,-9.4e-05,-0.000196,3.8e-05,-9.4e-05,-5.9e-05,-8.4e-05,-0.000141,2.5e-05,-1.2e-05,-7.8e-05,9.9e-05,-5.8e-05,1.4e-05,-9.6e-05,-3.1e-05,-1.7e-05,0.000116,-0.000117,9e-06,-3.6e-05,9.8e-05,0.000281,0.000115
-5e-06,4e-06,8e-06,-3e-06,6e-06,7e-06,-3e-06,8e-06,1.3e-05,-5.8e-05,1e-06,1.2e-05,1.8e-05,1.8e-05,-1.4e-05,6.1e-05,2.1e-05,2e-05,4e-05,-1.7e-05,-3.4e-05,-6e-05,-3.2e-05,7e-06,-6.2e-05,-1e-05,-4.6e-05,-3e-06,-4.5e-05,9.2e-05,-7.1e-05,2e-05,-7.9e-05,0.000157,0.000147,-8.5e-05,-7e-05,5.1e-05,-5e-06,0.000158,-3e-06,-8.1e-05,5.5e-05,-8.4e-05,1.2e-05,8.7e-05,0.000112,0.000191,0.000108,-0.000124,-3.5e-05,-3.1e-05,7.4e-05,6e-06,-4.9e-05,1.1e-05,-4.4e-05,1.7e-05,-7.2e-05,4.4e-05,7.7e-05,5e-05,-5.1e-05,0.000141,-3.7e-05,-3.3e-05,0.000106,6.2e-05,8.5e-05,-5.5e-05,4.6e-05,6e-05,6.8e-05,-6e-06,-3e-06,-6.2e-05,-1.6e-05,-2.8e-05,9.9e-05,1.2e-05,1.3e-05,-0.000128,0.000153,-1e-05,3e-05,7.4e-05,-0.00013,-3.2e-05,-3.4e-05,2.5e-05,-0.000106,7.7e-05,-0.000141,-2.1e-05,7e-06,7.4e-05,6.5e-05,-8e-06,0.000112,-5.3e-05,9e-05,0.000101,-0.000135,2.1e-05,-1.2e-05,0.000263,0.000103,3.6e-05,-7e-06,0.000179,-3e-05,4.4e-05,7e-06,-6.6e-05,-5.4e-05,-7.8e-05,4.4e-05,1.3e-05,-1.3e-05,-0.000225,-1e-05
2.2e-05,-2.3e-05,-2.6e-05,5e-06,2.9e-05,-4e-06,6e-06,1e-05,1.4e-05,5.6e-05,-8e-06,-3e-06,-1.7e-05,1e-05,-4e-06,-3.5e-05,-4.6e-05,-2e-06,-1.8e-05,3.4e-05,6.7e-05,3.4e-05,-1.9e-05,3.3e-05,5.8e-05,1.3e-05,6e-06,2e-06,-4.6e-05,-7.2e-05,-5.6e-05,-3.8e-05,0.000127,-8.7e-05,-6.6e-05,9.5e-05,1e-05,-1.6e-05,6.4e-05,-7.1e-05,-5e-06,5.9e-05,-0.000158,-0.000104,-3e-06,2e-06,-2.4e-05,-0.000139,-0.000108,8e-05,1.8e-05,-5e-06,-2e-06,5e-05,-4.1e-05,0.000154,1.8e-05,-0.000124,0.000119,3e-06,-4e-05,-3.3e-05,1.7e-05,-7.5e-05,4.8e-05,-1.2e-05,-1.8e-05,-5.2e-05,5.4e-05,2.1e-05,-8e-05,1.9e-05,3.2e-05,-1.2e-05,6e-06,8.5e-05,-1.4e-05,-7e-06,1.1e-05,4e-06,-4e-06,0.000101,-1e-06,-4.4e-05,4e-05,-6.1e-05,-1.8e-05,1.7e-05,-1.4e-05,7.3e-05,6.4e-05,6.3e-05,2e-05,7e-06,3.3e-05,-0.000117,2.6e-05,1.8e-05,-5.2e-05,2.2e-05,-0.000114,-7.3e-05,6e-06,1e-05,8.8e-05,-0.000157,-3.7e-05,1.7e-05,-2.7e-05,-2.6e-05,-3e-06,9.2e-05,-2.6e-05,4e-05,-4.1e-05,0.00011,-2e-05,9e-06,1.5e-05,0.000132,-0.000198
-1.5e-05,-2e-06,8e-06,2e-06,-2.6e-05,-1.1e-05,-3e-06,-1.8e-05,-1e-05,-2.3e-05,-1.6e-05,-6e-06,1e-06,-2.5e-05,1.1e-05,2.3e-05,5.8e-05,3e-06,1.5e-05,7e-06,-4.6e-05,9e-06,3e-05,-5.6e-05,-1.3e-05,-1e-06,2.7e-05,-1.3e-05,4e-06,1.1e-05,7.6e-05,-3.3e-05,-0.000123,2e-06,3.1e-05,-2.7e-05,-8e-06,2e-06,-4.6e-05,2.4e-05,1.4e-05,-5.6e-05,7e-05,2.3e-05,-2.5e-05,-8.3e-05,-9.1e-05,3e-05,7.3e-05,-1e-05,-5.7e-05,-1.4e-05,-4.5e-05,-2.5e-05,-9.9e-05,-0.000177,-3e-06,0.000154,-0.000132,-1.3e-05,5.1e-05,-5.1e-05,-1.4e-05,9e-05,-1.2e-05,-8e-06,-4.1e-05,5.4e-05,-6e-06,4.1e-05,-3.1e-05,-3.2e-05,6e-06,-1.5e-05,-1.9e-05,-8.1e-05,8.9e-05,-6e-06,-3.7e-05,4e-06,-5e-06,-7e-06,-0.000139,5.6e-05,-8e-06,2.3e-05,0.000125,1.1e-05,-2.4e-05,-7.9e-05,0,-5.2e-05,5.2e-05,1.6e-05,-6e-06,7.7e-05,-0.000101,3.8e-05,3.7e-05,3.6e-05,0.000114,-2.6e-05,8.4e-05,-4e-06,-1.9e-05,8.7e-05,-4.3e-05,-7.6e-05,-6.7e-05,-3.2e-05,-5.6e-05,-3.8e-05,-3e-06,3e-06,-4e-06,-5.4e-05,2e-06,2.1e-05,-5e-06,-2.9e-05,0.000135
-4e-06,-4e-06,7e-06,-1e-05,-1e-06,0,-1.7e-05,-1e-06,2e-06,-9e-06,3e-05,7e-06,2.5e-05,4e-06,-4e-06,-1.9e-05,-2.7e-05,2.8e-05,-2.7e-05,-4.3e-05,4.3e-05,-2.8e-05,-3e-06,-2.4e-05,1.5e-05,-1e-06,1e-06,9e-06,6.6e-05,4.2e-05,1.3e-05,6.1e-05,5.4e-05,-1e-06,-4.2e-05,-4.3e-05,5.1e-05,-1.6e-05,2.1e-05,3.3e-05,-2.2e-05,6.3e-05,-6.1e-05,6.2e-05,4e-06,0.000102,2.1e-05,4.3e-05,-2.7e-05,-5.9e-05,8.9e-05,-4.1e-05,-1e-06,-1.8e-05,0.000124,0.000102,3.6e-05,-0.000114,0.000112,-2.7e-05,-1.3e-05,2.2e-05,2.5e-05,-7.9e-05,1.1e-05,4.4e-05,6.8e-05,-7.6e-05,1e-06,-2.4e-05,1.3e-05,-3.5e-05,-6.5e-05,5.2e-05,9e-06,0.000103,-0.000134,-4e-06,3e-05,6e-06,-3.2e-05,6.8e-05,0.000111,6e-06,1.1e-05,0,-8.8e-05,9e-06,3.1e-05,0.000168,1.3e-05,9e-06,-0.000129,-1.6e-05,-3.8e-05,-9e-06,-6.4e-05,6e-06,-1.6e-05,-7e-05,-3.1e-05,6.9e-05,1.7e-05,2.1e-05,7.4e-05,-0.00017,3.3e-05,-2.9e-05,9.4e-05,-3e-06,7.8e-05,-6e-06,1.1e-05,-3.7e-05,-1.2e-05,0.000109,-9e-06,-9e-06,2.4e-05,-2.1e-05,3.2e-05
9e-06,-2e-06,5e-06,-2e-06,-1.7e-05,8e-06,3.8e-05,6e-06,1e-06,1.5e-05,-1.6e-05,-6e-06,-2.1e-05,3e-06,-9e-06,2.9e-05,1e-05,-2.3e-05,1.4e-05,3e-05,-3.8e-05,3e-06,8e-06,1e-05,-1e-05,-2e-05,-2.2e-05,3e-06,6e-06,-3.2e-05,-3.6e-05,-1.3e-05,7e-06,2.3e-05,1e-05,3.9e-05,-6.2e-05,1.2e-05,2.1e-05,1.5e-05,-1e-05,-4.5e-05,0.000137,2e-06,2.6e-05,-6e-05,-1.3e-05,-3.4e-05,-4.7e-05,5e-05,-6.3e-05,3.1e-05,-2e-06,2.4e-05,-2e-06,-1.7e-05,-7.2e-05,0,-5.6e-05,1.3e-05,1.9e-05,2.6e-05,-1e-06,2.6e-05,-1.3e-05,-3.1e-05,0,2.5e-05,-4.7e-05,4.2e-05,7e-06,1e-05,2.6e-05,-4e-06,3.5e-05,-6.4e-05,0.000141,-1.5e-05,-6e-05,-9e-06,3.5e-05,-3.2e-05,-1.1e-05,-8e-06,1.5e-05,-8e-06,-3e-06,-2.8e-05,1e-05,-5.1e-05,2e-06,2e-06,8.5e-05,3.1e-05,1e-05,2.1e-05,0.000131,4e-06,1.2e-05,-3.5e-05,-3.8e-05,-4.2e-05,8e-06,-3.6e-05,-6.4e-05,0.000138,3e-06,6.2e-05,3e-06,-1e-05,-2.3e-05,-5.8e-05,2.1e-05,4.1e-05,4.6e-05,-0.00014,8e-06,1.1e-05,1.7e-05,1.6e-05,-1.6e-05
-1e-06,-2e-06,-2e-05,6e-06,1.4e-05,-4e-06,-1.8e-05,5e-06,-4e-06,-6e-06,-5e-06,-1e-06,1.9e-05,-2e-06,1.1e-05,-3.5e-05,-2e-05,-3.8e-05,1e-05,-1.6e-05,5.8e-05,1.9e-05,-2.3e-05,-1.7e-05,-4e-05,-1.5e-05,2e-06,-7e-06,-3.2e-05,2.2e-05,-2.4e-05,-2.6e-05,-6.1e-05,-6.9e-05,2.4e-05,-1.8e-05,4e-05,1.6e-05,-3.2e-05,-4.5e-05,4e-05,1.9e-05,-6.9e-05,-7e-05,9e-06,3e-05,2.4e-05,-9e-06,5.5e-05,-5.8e-05,2e-05,-1.1e-05,1.9e-05,1.4e-05,-2.8e-05,-6.7e-05,7.5e-05,7.3e-05,-1.7e-05,-7e-06,-1.2e-05,1e-06,2e-05,-1.3e-05,-9e-06,-3.4e-05,-5.6e-05,-1.1e-05,-5e-06,-3.4e-05,-1.3e-05,-3.4e-05,2e-05,-2.9e-05,-6.3e-05,-9e-06,-7.3e-05,9e-06,4.4e-05,-7e-06,0,-3.4e-05,-6.1e-05,1.8e-05,-1.7e-05,-1e-05,8.1e-05,1.8e-05,1.2e-05,-0.000107,-3.5e-05,-2.1e-05,-4e-05,-3e-06,-3e-06,-3.9e-05,-3.7e-05,-5.6e-05,-1e-06,2.9e-05,8.3e-05,-3.9e-05,-1.1e-05,2.9e-05,3.9e-05,1e-06,-6e-06,6e-05,-1.5e-05,-7.4e-05,1.3e-05,5.5e-05,2.5e-05,-4e-05,4e-06,1.4e-05,4e-06,2.7e-05,-3.9e-05,3e-06,1.9e-05
-8e-06,2e-06,7e-06,6e-06,5e-06,3e-06,1e-06,2e-06,-1.3e-05,1.1e-05,3e-06,-1e-06,-1.3e-05,4e-06,3e-06,3.6e-05,1.8e-05,3.4e-05,-2e-05,1.1e-05,-5.6e-05,9e-06,1e-05,2.1e-05,4.4e-05,3.1e-05,1.5e-05,-1e-06,-3.1e-05,1e-06,3.2e-05,-5e-06,7.8e-05,6e-05,-6e-06,2.9e-05,-1.5e-05,5e-06,3.3e-05,0,-1.1e-05,-3e-06,2.2e-05,3.4e-05,-5e-06,-1.2e-05,-1.8e-05,1.3e-05,-1e-05,3.4e-05,-4e-05,5.3e-05,9e-06,-1.9e-05,1.8e-05,0.000128,-4.3e-05,-6.7e-05,5.5e-05,-5e-06,-2.6e-05,-1e-05,3e-06,2.2e-05,1.7e-05,4.3e-05,1.8e-05,2.7e-05,-2.5e-05,4e-06,-4e-06,6.2e-05,1e-05,5e-06,2.4e-05,3e-06,1.3e-05,-1.1e-05,-2.4e-05,8e-06,8e-06,-2.9e-05,4.3e-05,-2e-05,1.3e-05,2.9e-05,-9.5e-05,-2.4e-05,-4.3e-05,9.5e-05,2.7e-05,4.4e-05,-2.3e-05,9e-06,-9e-06,1.2e-05,-1.1e-05,2.5e-05,-4e-06,-3.6e-05,-8.4e-05,-2.1e-05,-3.7e-05,-2.6e-05,-7.4e-05,-9.9e-05,3e-06,-1.5e-05,-3.5e-05,4.9e-05,-4e-05,9e-06,-1e-06,4.9e-05,2e-06,7.8e-05,-2e-05,-5.1e-05,-1e-06,-3.7e-05,-7.2e-05
9e-06,3e-06,4e-06,-3e-06,7e-06,5e-06,-3e-06,-8e-06,-3e-06,-1.7e-05,1.3e-05,2e-06,3e-06,-1e-06,-7e-06,-3.5e-05,2e-06,-5e-06,1.3e-05,-1.1e-05,2.4e-05,-1.4e-05,1e-06,6e-06,-2.2e-05,1.6e-05,-2e-06,6e-06,8e-06,-1.8e-05,4e-06,1.6e-05,-5.3e-05,-2.8e-05,-1e-05,-3.2e-05,2e-05,7e-06,-1.9e-05,-1.2e-05,-2.2e-05,-4e-06,-9e-05,5e-05,-1.3e-05,1e-05,-1.3e-05,2.6e-05,-1e-05,9e-06,1.9e-05,-4e-05,3e-05,-1.4e-05,1.1e-05,-9.7e-05,1.4e-05,2.3e-05,-5.4e-05,-7e-06,4.1e-05,-1e-05,2e-06,-1.9e-05,-1.6e-05,-3.3e-05,7e-06,-7e-06,2.6e-05,-1e-06,3.8e-05,-2e-05,-2.2e-05,-8e-06,5e-06,3e-06,1.5e-05,4e-06,-2.2e-05,-3e-06,-6e-06,1e-05,-1e-06,4e-06,2e-05,-3.6e-05,5.1e-05,3.6e-05,2.4e-05,-7.2e-05,-1e-05,-1.6e-05,3.7e-05,-5.7e-05,-1.2e-05,-2.3e-05,3.7e-05,-4.3e-05,-1e-06,4.1e-05,2.8e-05,0.000132,-2.3e-05,0,1.8e-05,4.5e-05,-2.2e-05,-2.7e-05,4e-06,-2.6e-05,-4e-06,-3.9e-05,-1.8e-05,-3.1e-05,-1.6e-05,-6.6e-05,2.7e-05,3.9e-05,4.6e-05,7e-05,1.3e-05
-1e-06,1e-06,1e-06,-4e-06,-1.1e-05,2e-06,6e-06,-5e-06,1.7e-05,1.4e-05,-1.3e-05,-4e-06,1e-05,-4e-06,5e-06,2.5e-05,-6e-06,-2e-06,-7e-06,-8e-06,-3.5e-05,-1.1e-05,5e-06,-4e-06,1.7e-05,-1e-05,-9e-06,-1e-05,3.4e-05,2.8e-05,4e-06,7e-06,2.3e-05,3e-06,-2.4e-05,1.5e-05,-3.7e-05,-3.4e-05,-2.5e-05,4.3e-05,1.6e-05,1e-06,5.5e-05,-5.3e-05,6e-06,-4.3e-05,3.6e-05,-5.4e-05,6e-06,-7e-06,0,2.9e-05,1e-05,8e-06,-4.4e-05,1.4e-05,-1e-05,2.7e-05,4.6e-05,1e-05,-3.1e-05,9e-06,-8e-06,1.2e-05,1e-06,1.9e-05,-4e-05,-2.2e-05,8e-06,-7e-06,-7e-06,2.6e-05,-1.1e-05,1.9e-05,8e-06,7e-06,-2.6e-05,1.5e-05,5e-05,-5e-06,1.6e-05,3.5e-05,-1.1e-05,-2.4e-05,-1e-06,1.5e-05,5e-06,-2e-05,-2e-06,6.3e-05,1.3e-05,-1.9e-05,-1.8e-05,6.4e-05,-9e-06,3e-05,-5.6e-05,4.3e-05,-3e-06,1e-06,1e-05,-6.8e-05,2.1e-05,1e-05,-3e-06,1.3e-05,2.2e-05,-3.3e-05,4.3e-05,3.6e-05,1.9e-05,2.9e-05,3e-06,2e-05,-3e-06,5.8e-05,-4.4e-05,-2.2e-05,-2.5e-05,-7.2e-05,6.9e-05
-9e-06,4e-06,-1.1e-05,3e-06,-3e-06,-4e-06,6e-06,2e-06,2e-06,-2e-06,4e-06,0,-2.2e-05,-1e-06,2e-06,-1.8e-05,6e-06,1.5e-05,1.4e-05,1.6e-05,3.2e-05,6e-06,-3e-06,2.2e-05,3e-06,-1.4e-05,1e-06,7e-06,4e-06,-2.7e-05,-4.2e-05,-1.3e-05,9e-06,8e-06,4.6e-05,1.9e-05,2.3e-05,-9e-06,3.2e-05,-1.4e-05,6e-06,-1e-05,2.1e-05,-3e-05,2e-06,7e-05,1.5e-05,2.7e-05,-3e-06,2.1e-05,-1.8e-05,-1.1e-05,-1.2e-05,1.4e-05,-1e-05,3.2e-05,2.6e-05,-6.3e-05,-3.5e-05,1.5e-05,2.1e-05,-1e-06,-2.1e-05,-6e-06,3e-06,1.5e-05,-3e-06,4e-06,3.5e-05,0,-1.5e-05,-1.4e-05,1.2e-05,-3e-06,-2.3e-05,1.5e-05,2.3e-05,1e-06,-2.6e-05,-1e-06,3e-06,1.4e-05,-3e-06,3e-06,-1.2e-05,5e-06,-4.5e-05,-2e-06,3.3e-05,3e-06,-2.2e-05,4e-06,-1.2e-05,-3.5e-05,3e-06,-5e-06,2e-06,-3.2e-05,8e-06,-2e-05,-4.4e-05,-2.9e-05,3.2e-05,-3e-06,-1.8e-05,2.7e-05,8e-06,2.4e-05,-1.6e-05,3.7e-05,4e-05,-1.5e-05,1.9e-05,-3e-06,-2e-06,-3.2e-05,4.9e-05,-1.4e-05,-2.8e-05,4.2e-05,-2.4e-05
9e-06,3e-06,2e-06,3e-06,-3e-06,-1e-06,-9e-06,6e-06,0,-9e-06,3e-06,2e-06,1.2e-05,3e-06,-4e-06,1.4e-05,-1.9e-05,-1.6e-05,-9e-06,-6e-06,-2.7e-05,3e-06,-4e-06,-6e-06,-2.5e-05,0,7e-06,-2e-06,-1.5e-05,1.5e-05,4.2e-05,2e-06,-4.2e-05,1.2e-05,-3.3e-05,-2.1e-05,-1.2e-05,3e-06,-1.2e-05,-1.8e-05,-1e-06,9e-06,9e-06,5.3e-05,9e-06,-7.4e-05,-1.2e-05,1.6e-05,8e-06,-4e-05,3.1e-05,0,-1.7e-05,-8e-06,4e-05,-7.5e-05,-1.3e-05,4.7e-05,2e-05,-1.6e-05,-8e-06,0,-1e-06,0,0,-1.3e-05,2.1e-05,-1.6e-05,-7e-06,1.2e-05,7e-06,-3.7e-05,8e-06,-4e-06,9e-06,-2.9e-05,-3e-05,-3e-06,4e-06,3e-06,-4e-06,2.1e-05,3.2e-05,1.9e-05,-7e-06,-1.8e-05,4.6e-05,5e-06,-2.4e-05,-8.3e-05,2e-05,-3e-06,4.4e-05,3.9e-05,-6e-06,-1e-06,3.7e-05,4.3e-05,-6e-06,7e-05,4.4e-05,-1.1e-05,5e-06,5e-06,5.5e-05,-3.9e-05,-1.7e-05,6e-06,-2e-06,-1.9e-05,-3.2e-05,1.1e-05,7e-06,-1.6e-05,-8e-06,-2.2e-05,-3.7e-05,3e-05,4e-06,-4e-06,-2.6e-05
-2e-06,2e-06,8e-06,-2e-06,9e-06,0,2e-06,4e-06,-3e-06,5e-06,-4e-06,1e-06,-4e-06,3e-06,-2e-06,-1.3e-05,3.2e-05,4e-06,-3e-06,1e-06,1.4e-05,4e-06,0,0,4e-06,9e-06,-3e-06,3e-06,-1.9e-05,-2e-06,1.3e-05,-1e-06,4.4e-05,-2.8e-05,2e-05,0,1.4e-05,7e-06,0,2e-05,-6e-06,-1.2e-05,-1e-05,2.4e-05,-6e-06,5.8e-05,-1.2e-05,-2.5e-05,2e-06,2.9e-05,-3.1e-05,0,-6e-06,-1.3e-05,1.2e-05,8.4e-05,-2.2e-05,-2e-06,-2.1e-05,-7e-06,-2e-06,5e-06,-6e-06,1.5e-05,7e-06,5e-06,-1e-05,8e-06,2e-06,-1e-05,-1.1e-05,1.6e-05,-9e-06,1.5e-05,1.1e-05,1.8e-05,5e-06,4e-06,1e-06,9e-06,-5e-06,-5.5e-05,-1.4e-05,-2.1e-05,-3e-06,7e-06,-1.8e-05,6e-06,-1e-06,7.4e-05,-1.3e-05,1.8e-05,-1.1e-05,-3.4e-05,-6e-06,-1.2e-05,4e-06,-2.7e-05,2e-06,-2.8e-05,-3.6e-05,4.8e-05,-1.3e-05,-2e-06,-3.4e-05,2.2e-05,-2e-06,-1.6e-05,-2.1e-05,-2.9e-05,-4e-06,-3e-06,-2e-06,1.9e-05,1.6e-05,2.2e-05,3e-05,-2.3e-05,2e-05,-2.3e-05,-1e-06
-6e-06,4e-06,-4e-06,-3e-06,2e-06,-3e-06,4e-06,-4e-06,-4e-06,-1e-06,-8e-06,-1e-06,2e-06,-3e-06,5e-06,1.5e-05,-2.4e-05,3e-06,1e-06,-2e-06,-6e-06,-4e-06,3e-06,5e-06,1.2e-05,2e-06,-3e-06,3e-06,1.3e-05,-1.1e-05,-2.4e-05,-7e-06,-2.9e-05,3.1e-05,-1.9e-05,3e-06,-1.3e-05,2e-06,1.1e-05,-2.3e-05,-1e-06,6e-06,-6.5e-05,-4.4e-05,1e-06,-3.6e-05,1e-06,1e-06,-1.3e-05,-2.4e-05,1.3e-05,-2.7e-05,2e-06,3e-06,-2.2e-05,-5.4e-05,4.1e-05,-4.5e-05,3.3e-05,9e-06,9e-06,-2e-06,2e-06,-1.9e-05,-8e-06,1e-06,-1e-05,-2.6e-05,-3.6e-05,1e-05,4e-06,-2e-05,-1.4e-05,-1.9e-05,-1.9e-05,2e-06,3.6e-05,-2e-06,-1.4e-05,-2e-06,6e-06,2e-06,-4.3e-05,2.6e-05,-5e-06,4e-06,-2e-05,-6e-06,-3e-06,-3.5e-05,1e-05,0,-2.6e-05,7e-06,1e-06,0,-2.5e-05,2e-05,-4e-06,-2e-06,1.5e-05,3e-06,-1.9e-05,-3e-06,3.9e-05,-1.5e-05,7e-06,2e-06,9e-06,1e-06,-2.3e-05,-2e-05,-8e-06,-2e-05,-5e-06,1.4e-05,-2.4e-05,1.3e-05,-1e-05,2.7e-05,-2e-06
6e-06,2e-06,-2e-06,1e-06,-1e-06,-1e-06,0,-3e-06,-2e-06,-1e-06,8e-06,0,0,-1e-06,-2e-06,-1.7e-05,1.6e-05,-1e-05,4e-06,0,1.1e-05,0,3e-06,-2.1e-05,-2e-06,-2e-06,1e-06,-2e-06,1e-05,1.5e-05,-1.8e-05,1.2e-05,1.6e-05,-2e-05,1.5e-05,3e-06,5e-06,-2e-06,-2.1e-05,6e-06,1.2e-05,-1e-05,6.8e-05,-2.7e-05,-5e-06,2.9e-05,1.1e-05,1.3e-05,1.5e-05,-7e-06,-3e-06,2e-05,-1e-06,9e-06,9e-06,-8e-06,-3.1e-05,6.4e-05,-2.5e-05,-2e-06,0,-6e-06,9e-06,1.2e-05,2e-06,7e-06,2.3e-05,2.1e-05,0,-2e-06,1e-05,3.1e-05,1e-05,-3e-06,2e-05,-7e-06,-5.5e-05,-5e-06,1.6e-05,-7e-06,-5e-06,2e-06,4.8e-05,4e-06,0,-5e-06,5.2e-05,1e-06,8e-06,2.6e-05,-1.1e-05,-2.8e-05,2.1e-05,-2.7e-05,-5e-06,1e-06,6e-06,-1.6e-05,0,3.2e-05,1.3e-05,-4.1e-05,-7e-06,7e-06,-2.1e-05,1.7e-05,-1e-06,2.2e-05,6e-06,-1.8e-05,3.4e-05,1.8e-05,-3e-06,1.7e-05,6e-06,-1.3e-05,1.3e-05,5e-06,9e-06,-1.6e-05,3.7e-05
-1e-06,0,-1e-06,2e-06,-3e-06,2e-06,1e-06,0,-1e-06,-4e-06,0,0,-6e-06,2e-06,-3e-06,1.9e-05,-1.6e-05,1.2e-05,1e-06,7e-06,-7e-06,4e-06,-3e-06,0,1e-05,-4e-06,1e-06,3e-06,3e-06,-1.7e-05,3.1e-05,0,5e-06,1e-06,-1e-05,-1.4e-05,4e-06,-3e-06,1.3e-05,3e-06,-3e-06,1.1e-05,-2.6e-05,4e-05,5e-06,-2.2e-05,-1.3e-05,-1e-06,-2.4e-05,2.7e-05,2e-06,-1.2e-05,1e-05,-2e-06,3e-06,6.1e-05,1.1e-05,-4e-05,-3e-06,1e-06,1e-06,-4e-06,2e-06,-1.8e-05,1e-06,-8e-06,7e-06,-1e-05,-1.4e-05,-3e-06,0,-2e-06,8e-06,1.2e-05,2e-06,3e-06,5.2e-05,-3e-06,-1.4e-05,-4e-06,-4e-06,1e-05,-1.1e-05,-1.8e-05,6e-06,3e-06,-4.7e-05,-2e-06,-1.2e-05,4e-06,1.4e-05,1.5e-05,-5e-06,4.2e-05,4e-06,1.8e-05,-4e-06,5e-06,0,-2.8e-05,-3.1e-05,2.7e-05,6e-06,-5e-06,-8e-06,-3.3e-05,3e-06,-5e-06,-1e-06,-1e-06,8e-06,1e-05,-7e-06,-1.2e-05,-6e-06,1.6e-05,0,-1.3e-05,-2e-06,-3e-06,-3e-06
-4e-06,3e-06,7e-06,0,-2e-06,1e-06,-9e-06,1e-06,-4e-06,4e-06,-1e-06,-2e-06,1.1e-05,0,2e-06,-1.8e-05,1.5e-05,3e-06,-4e-06,-6e-06,1e-06,-4e-06,-2e-06,-2e-06,-1.1e-05,-3e-06,-2e-06,-1e-06,-6e-06,1.4e-05,-3e-06,-1.4e-05,-2e-05,2e-06,-1e-06,2e-06,2e-06,2e-06,3e-06,-9e-06,-8e-06,-1.6e-05,6.4e-05,2.8e-05,2e-06,2e-05,-6e-06,-1.7e-05,2.6e-05,-1.2e-05,-9e-06,1.1e-05,0,-8e-06,-2.8e-05,-7.2e-05,-4e-06,-8e-06,3.3e-05,3e-06,-1e-06,9e-06,1e-05,2.6e-05,-2e-06,1.3e-05,-1.3e-05,-2e-06,2.6e-05,3e-06,1e-06,1.1e-05,-3e-06,-3e-06,-1e-06,-1.7e-05,-2.8e-05,-3e-06,-2e-06,1e-06,-5e-06,3e-05,-2.8e-05,1e-05,-7e-06,9e-06,1.1e-05,6e-06,-4e-06,-5.4e-05,-9e-06,1.3e-05,-2.9e-05,-1.7e-05,-4e-06,-1.1e-05,-9e-06,-1.1e-05,-1e-06,3.7e-05,4.2e-05,-2e-05,1.9e-05,3e-06,-4e-06,1.4e-05,-7e-06,-1.3e-05,3e-06,2.1e-05,-1.3e-05,-1.2e-05,-2e-06,3e-06,-1.2e-05,-5.8e-05,-6e-06,1.3e-05,-1.5e-05,2.3e-05,-4.1e-05
4e-06,-2e-06,-4e-06,-1e-06,4e-06,0,1.2e-05,2e-06,9e-06,0,0,-1e-06,-4e-06,0,1e-06,1.6e-05,-8e-06,-7e-06,2e-06,-2e-06,9e-06,3e-06,0,-8e-06,-6e-06,-3e-06,0,-2e-06,-1.1e-05,-9e-06,-1.9e-05,3e-06,1.7e-05,5e-06,1.7e-05,8e-06,-4e-06,7e-06,-1.5e-05,5e-06,5e-06,1.3e-05,-7.6e-05,-4.1e-05,1e-06,-2.9e-05,1e-05,1.6e-05,-7e-06,9e-06,-2e-06,1e-06,-5e-06,0,3e-06,5.4e-05,1.1e-05,4.1e-05,-5.7e-05,7e-06,1e-06,6e-06,3e-06,-2.5e-05,-2e-06,-1e-06,9e-06,-4e-06,2e-06,-7e-06,-1e-06,-1.6e-05,-9e-06,7e-06,-1e-05,1.5e-05,1.3e-05,1e-06,1.8e-05,2e-06,3e-06,-1.4e-05,4.3e-05,-1e-05,-4e-06,-1.1e-05,2.9e-05,-7e-06,3e-06,6.6e-05,2e-06,-6e-06,3.6e-05,2e-06,2e-06,-6e-06,3.1e-05,5e-06,0,-1e-06,-3.2e-05,3.2e-05,8e-06,-2e-06,-1.8e-05,3e-06,-2e-06,-1.4e-05,-1.5e-05,-1e-06,-1.2e-05,-8e-06,1e-06,7e-06,9e-06,6.6e-05,7e-06,-1.1e-05,9e-06,-2.8e-05,1.3e-05
1e-06,0,-1e-06,0,1e-06,1e-06,-9e-06,0,2e-06,-1e-06,3e-06,0,-5e-06,1e-06,-3e-06,-1.3e-05,4e-06,-3e-06,-1e-06,3e-06,-4e-06,-3e-06,3e-06,1.3e-05,-3e-06,4e-06,1e-06,1e-06,6e-06,-1e-06,-1e-06,6e-06,-1.1e-05,-2.1e-05,-1.3e-05,-4e-06,-7e-06,-1e-06,1.5e-05,8e-06,2e-06,-1.1e-05,1.1e-05,-2.1e-05,-3e-06,3.4e-05,4e-06,-1e-06,-1.8e-05,-7e-06,3e-06,-6e-06,-1.4e-05,5e-06,2.3e-05,-1.5e-05,-1.7e-05,-4.7e-05,6.5e-05,-8e-06,3e-06,-8e-06,-5e-06,2.6e-05,0,-1.1e-05,9e-06,7e-06,2.1e-05,2e-06,3e-06,-3e-06,5e-06,-6e-06,1.6e-05,0,3e-06,2e-06,-1.3e-05,1e-06,-4e-06,-4e-06,-1.4e-05,-1e-06,6e-06,5e-06,-4.5e-05,4e-06,4e-06,-1.8e-05,-3e-06,-9e-06,-2.2e-05,-1e-06,1e-06,0,-9e-06,5e-06,-1e-06,-2.9e-05,1.3e-05,-3.4e-05,-7e-06,0,1.9e-05,6e-06,9e-06,1.7e-05,3e-06,1.9e-05,3e-06,5e-06,2e-06,-1e-05,-5e-06,-1.3e-05,-6e-06,2e-06,1.4e-05,1.2e-05,1.6e-05
-5e-06,0,1e-06,1e-06,1e-06,0,8e-06,-2e-06,-1e-06,-2e-06,-4e-06,0,9e-06,-1e-06,0,1.1e-05,-5e-06,1e-06,2e-06,-2e-06,6e-06,-4e-06,0,1e-06,1.1e-05,5e-06,-1e-06,-1e-06,4e-06,8e-06,1.8e-05,0,4e-06,2.6e-05,4e-06,2e-06,1.6e-05,-3e-06,-5e-06,-2e-05,-2e-06,1e-05,-7e-06,3.9e-05,-2e-06,-2.8e-05,-1e-06,-1e-05,1.2e-05,3e-06,-6e-06,1.6e-05,-2e-06,4e-06,8e-06,-3.1e-05,4e-06,1.9e-05,-4.5e-05,-4e-06,-5e-06,-7e-06,-3e-06,-3.3e-05,1e-06,1.2e-05,-9e-06,-3e-06,-8e-06,0,-5e-06,-1.7e-05,6e-06,-7e-06,0,6e-06,-2.6e-05,4e-06,6e-06,0,-3e-06,-2.1e-05,-2.2e-05,3e-06,4e-06,1e-06,2.3e-05,-3e-06,1e-05,-1.6e-05,1e-06,-3e-06,-2e-06,-1.5e-05,2e-06,-1e-06,-1.8e-05,-4e-06,-1e-06,2e-05,1.8e-05,1.7e-05,-1.8e-05,-2e-06,-1.7e-05,3e-06,0,1.8e-05,-5e-06,4e-06,7e-06,2e-06,-1.1e-05,1.1e-05,1e-05,-1.6e-05,7e-06,4e-06,-6e-06,1.1e-05,5e-06
3e-06,-2e-06,2e-06,0,-4e-06,-1e-06,-8e-06,-1e-06,-1e-06,3e-06,-1e-06,0,-6e-06,-1e-06,3e-06,-1.1e-05,-1e-06,1e-06,-3e-06,3e-06,-1.2e-05,9e-06,-1e-06,1e-06,4e-06,3e-06,-1e-06,0,6e-06,-1.3e-05,4e-06,-5e-06,7e-06,-1.6e-05,-7e-06,2e-06,-1e-05,-1e-05,-4e-06,0,0,-9e-06,3e-05,1.2e-05,3e-06,2.1e-05,-3e-06,8e-06,1.4e-05,-3e-06,1.1e-05,-1.3e-05,2e-06,-3e-06,-2.1e-05,6.2e-05,1e-05,2e-05,1.1e-05,6e-06,3e-06,4e-06,-6e-06,3.4e-05,4e-06,-8e-06,-3e-06,-9e-06,0,1e-06,-8e-06,1e-05,0,8e-06,-1.5e-05,-1.1e-05,3.6e-05,2e-06,-5e-06,2e-06,-1e-06,4e-06,2.6e-05,-2e-06,0,-3e-06,1.7e-05,4e-06,-1e-05,2.5e-05,6e-06,1e-05,2e-05,1.6e-05,2e-06,9e-06,7e-06,9e-06,1e-06,-1.3e-05,-3.9e-05,5e-06,-3e-06,2e-06,3e-05,-4e-06,-4e-06,-6e-06,1e-05,-1.4e-05,1.1e-05,7e-06,-2e-06,-1e-05,-5e-06,2e-06,-6e-06,-1e-05,-2.1e-05,-2.5e-05,-4e-06
3e-06,0,-2e-06,-1e-06,0,-1e-06,5e-06,1e-06,-5e-06,-2e-06,3e-06,1e-06,5e-06,0,-1e-06,1.2e-05,9e-06,2e-06,0,-5e-06,1.5e-05,-1e-06,-2e-06,1.1e-05,-4e-06,-4e-06,1e-06,2e-06,-1e-06,1.2e-05,-1.6e-05,-2e-06,-1e-05,2e-06,8e-06,5e-06,5e-06,-4e-06,1.5e-05,1.3e-05,-1e-06,9e-06,2.3e-05,-3.6e-05,0,-1.5e-05,1e-06,1e-06,-3.2e-05,-9e-06,-7e-06,6e-06,5e-06,-6e-06,8e-06,-6e-05,-9e-06,-4.4e-05,1.3e-05,0,-2e-06,1e-05,-4e-06,-3.2e-05,-4e-06,1e-06,3e-06,1.1e-05,-2.3e-05,1e-06,1e-05,8e-06,-7e-06,-3e-06,6e-06,2e-06,-3.1e-05,2e-06,-1e-06,-1e-06,3e-06,6e-06,-3e-06,1.2e-05,2e-06,3e-06,-4.1e-05,-3e-06,4e-06,-6.1e-05,-9e-06,2e-06,-1.9e-05,-3e-06,1e-06,4e-06,4e-06,-1.2e-05,-1e-06,-1e-06,4.2e-05,-5e-06,3e-06,-2e-06,-1.3e-05,-7e-06,-1e-06,-2e-05,-1e-06,-1.7e-05,-1.6e-05,-8e-06,4e-06,5e-06,0,-5e-06,3e-06,1.3e-05,1.5e-05,3.1e-05,-2.6e-05
-5e-06,-1e-06,-2e-06,0,-1e-06,0,2e-06,3e-06,-1e-06,-2e-06,1e-06,1e-06,-4e-06,1e-06,-1e-06,-1.2e-05,-1.2e-05,-1e-06,1e-06,1e-06,-1.6e-05,-2e-06,1e-06,-4e-06,1e-06,-2e-06,1e-06,-1e-06,-8e-06,-5e-06,-2e-06,5e-06,6e-06,6e-06,-3e-06,-2e-06,-1.2e-05,5e-06,-1.2e-05,-1e-06,2e-06,-6e-06,-5e-05,-7e-06,2e-06,1.5e-05,1e-06,-5e-06,3.8e-05,1.2e-05,3e-06,-3e-06,8e-06,1e-06,-2e-06,3.1e-05,1e-06,3.6e-05,-2.7e-05,0,-1e-06,-2e-06,0,3.5e-05,2e-06,4e-06,-1e-06,2e-06,-2e-06,2e-06,3e-06,4e-06,1e-06,2e-06,4e-06,-5e-06,2e-06,2e-06,3e-06,-1e-06,0,1e-05,-1.8e-05,-9e-06,0,1e-06,3.7e-05,0,0,5.3e-05,6e-06,-8e-06,9e-06,8e-06,1e-06,-1.1e-05,-6e-06,1.3e-05,1e-06,8e-06,-2.5e-05,-2e-06,1.6e-05,3e-06,8e-06,-7e-06,1e-06,0,-9e-06,3e-06,3e-06,-5e-06,9e-06,-1e-06,-1e-06,1.9e-05,0,-8e-06,1e-05,-2.7e-05,1.3e-05
3e-06,-1e-06,4e-06,1e-06,3e-06,0,-8e-06,0,-1e-06,3e-06,-1e-06,-1e-06,0,0,2e-06,1.3e-05,9e-06,-1e-06,0,4e-06,1.2e-05,2e-06,2e-06,0,-1.1e-05,0,-2e-06,0,-3e-06,-2e-06,1.6e-05,-1e-06,-4e-06,2e-06,2e-06,-3e-06,1.9e-05,2e-06,0,-4e-06,1e-06,7e-06,1.4e-05,3.4e-05,-4e-06,-1.2e-05,-2e-06,1e-06,-2.5e-05,-4e-06,-4e-06,-5e-06,3e-06,7e-06,-1.5e-05,9e-06,-3e-06,-5e-06,3e-05,4e-06,4e-06,-1e-05,1e-06,-3.9e-05,2e-06,-6e-06,-4e-06,1e-06,-1.1e-05,-3e-06,-5e-06,1.7e-05,5e-06,3e-06,-6e-06,1.5e-05,2.4e-05,-2e-06,-3e-06,-1e-06,0,1.1e-05,1.4e-05,3e-06,-4e-06,-1e-06,-8e-06,0,9e-06,1.6e-05,-7e-06,-2e-06,5e-06,-2.1e-05,4e-06,-5e-06,8e-06,-1.8e-05,-2e-06,-1.3e-05,-7e-06,-1.1e-05,2e-06,-2e-06,9e-06,2.1e-05,4e-06,8e-06,-3e-06,-4e-06,-3e-06,7e-06,-2e-06,-5e-06,-2e-06,-5e-06,-1e-06,0,-7e-06,1.1e-05,1.9e-05
3e-06,-1e-06,-1e-06,0,-2e-06,0,8e-06,-1e-06,0,-3e-06,0,-1e-06,6e-06,-1e-06,1e-06,-1.3e-05,-1.2e-05,0,0,-4e-06,-1.7e-05,-1e-06,-1e-06,0,6e-06,1e-06,0,0,2e-06,1e-05,2e-06,-3e-06,-1e-06,-1.6e-05,-1e-06,1e-06,-1.4e-05,0,6e-06,-3e-06,-1e-06,-7e-06,-3.3e-05,2e-06,2e-06,1.2e-05,0,5e-06,-5e-06,-3e-06,-1e-06,1.2e-05,0,-1e-06,0,-4.7e-05,1.3e-05,-3.3e-05,-2.2e-05,-1e-06,-5e-06,1e-06,4e-06,3.8e-05,-2e-06,1e-06,-1e-06,-6e-06,2.1e-05,3e-06,1e-06,-2.7e-05,1e-06,-3e-06,-5e-06,-1.4e-05,-3.4e-05,-4e-06,-1e-06,0,1e-06,-1.6e-05,6e-06,7e-06,-1e-06,-2e-06,-2.3e-05,3e-06,-1.1e-05,-4.4e-05,1e-05,3e-06,-1.7e-05,2.7e-05,0,7e-06,5e-06,1.7e-05,2e-06,-2e-06,3.4e-05,2.7e-05,-2e-06,1e-06,-2.9e-05,-1.7e-05,1e-06,4e-06,-5e-06,1.2e-05,2e-06,-2e-06,2e-06,8e-06,4e-06,-2.3e-05,2e-06,8e-06,-9e-06,7e-06,-9e-06
