-0.000316,0.000366,0.000155,-5.7e-05,-0.00025,-0.0015,-0.000836,-0.001112,0.000391,0.00022,0.000702,0.001306,0.001114,5.8e-05,-0.000194,0.0039,-0.000142,-0.00482,-0.014435,-0.008394,-0.021161,-0.015928,-0.01567,-0.013482,-0.013321,-0.010663,-0.012289,-0.008817,-0.014984,-0.015665,-0.018071,-0.021947,-0.01273,-0.01888,-0.013056,-0.012111,-0.017594,-0.011134,-0.020025,-0.013941,-0.008353,-0.007545,-0.012216,-0.013185,-0.018002,-0.013329,-0.006638,-0.006184,-0.006934,-0.009202,-0.008445,-0.010456,-0.007169,-0.011388,-0.006793,-0.006855,-0.003828,-0.001816,-0.001433,-0.004567,-0.003157,-0.003001,-0.00172,-0.003937,-0.003147,-0.001597,-0.002529,-0.000593,-0.000277,-0.000718,-0.000432,-0.00058,-0.000732,-0.001068,-0.00121,-0.00073,-0.000627,-0.000412,-0.000454,-0.000635,-0.000677,-0.00036,-0.00034,-0.000216,-0.000317,-0.00042,-0.000703,-0.000876,-0.00046,-0.000419,-0.000689,-0.000907,-0.00055,-0.000248,-0.002008,-0.001321,-0.00058,-0.000365,-0.000359,-0.001171,-0.000921,-0.000516,-0.000816,-0.000681,-0.000508,-0.000471,-0.001166,-0.001756,-0.002292,-0.001701,-0.001116,-0.000594,0.000296,0.004385,0.004007,0.004179,0.002516,-0.018221,-0.007966,-0.003598,-0.000602
-0.000275,-0.000697,-0.000495,-0.00037,-0.000193,0.000461,0.000171,-0.000318,0.000314,0.001771,0.001061,0.00117,0.000671,0.000865,0.000171,-0.000747,-0.006891,0.001145,-0.004827,-0.004576,0.000928,-0.000855,-0.001056,0.003044,-0.005753,-0.006374,-0.001563,-0.003945,0.002509,0.000325,0.002721,-0.00174,-0.003126,-0.001751,6.4e-05,0.006261,-0.000496,-0.003696,0.002648,-0.003733,-0.002496,0.002551,-0.006488,0.0026,0.002577,0.001189,-0.000543,-0.003461,-0.003129,0.001403,-0.000735,-0.005434,-0.004124,-0.00168,0.00011,0.001686,-0.005965,-0.002156,-0.001623,-0.00076,-0.000412,-0.001038,-0.000831,-0.000541,0.000746,-0.00069,0.000637,0.000183,-0.00124,-0.000751,-0.000797,-0.001092,-0.000572,0.000115,-0.000208,-0.000706,-0.000484,-0.00042,-0.000482,-0.000312,-0.000503,-0.000412,-0.000256,-0.00023,-0.000143,-0.000421,-0.000165,-5e-05,-6.1e-05,5.2e-05,0.000197,7.7e-05,1e-06,-0.000694,0.001215,0.000955,0.000335,-4e-06,8.1e-05,0.000623,0.000524,0.000289,0.000319,0.000158,0.00014,0.000157,0.000746,0.000329,-0.001017,0.000749,0.000856,0.000783,4e-04,-0.001651,0.002103,-1.2e-05,0.000336,0.003319,9e-04,0.002393,0.001998
0.000122,0.000109,-4.5e-05,0.000264,0.000351,-5.6e-05,8.9e-05,0.000327,-0.000981,-0.000518,-0.00022,0.000707,-2.3e-05,-3.2e-05,9.2e-05,0.000218,-0.002814,0.002078,0.000984,-0.001382,-0.000792,-0.004107,-0.003185,0.000472,0.003625,-3.8e-05,-0.003233,-0.003604,0.000403,-0.000683,-0.002463,0.003156,-0.001136,0.001943,-0.004465,-0.007893,-0.004632,0.000145,-0.003418,-0.001793,1.2e-05,0.000201,-0.004224,-0.002479,-0.004166,-0.002141,-0.008143,-0.006846,-0.003508,-0.003328,0.000145,0.001116,0.000452,-0.000184,0.004934,-0.000649,0.003613,0.001194,-0.000657,0.000261,-0.000341,2e-04,0.001061,0.000179,-0.001202,-0.000764,-0.000782,-0.000579,-0.000297,-1.7e-05,0.000356,0.000355,-0.000266,-0.000252,-1.3e-05,-0.000387,-0.000372,-0.000315,-0.00017,-0.000146,0.000269,8.5e-05,7.3e-05,-5.7e-05,-7.7e-05,5.5e-05,0.000237,-1.9e-05,9.3e-05,0.000162,3.6e-05,0.000233,-1.8e-05,-0.000141,-0.000866,-0.000916,-0.000512,-5e-05,-0.000206,-0.000463,-0.00052,-0.000241,0.000305,-2.3e-05,-1.3e-05,-8.7e-05,-0.000681,-0.001356,-0.00043,-0.000749,-0.000864,-0.000438,-0.001307,-0.003858,-0.003276,-0.003547,-0.000869,-0.001568,0.001245,-0.001389,-0.000605
6.9e-05,-0.000405,-0.000765,-0.000395,-0.000359,0.000184,5e-06,-0.000317,-0.000455,-0.000432,-0.000238,0.000231,-0.000463,-0.000272,-0.000278,-0.00027,-0.002572,-0.005176,0.00134,0.000586,-7.2e-05,0.003258,-0.003988,0.001189,-0.000715,0.000115,-0.000705,0.004532,0.004505,3.5e-05,-0.001006,-0.001778,-0.000948,0.000465,-5.2e-05,0.002597,0.003864,-0.001666,0.001929,-0.000464,-0.002827,-0.003362,0.001824,0.002402,0.003611,0.003546,0.000156,-0.004808,0.000776,-0.00045,-0.001755,-0.00471,0.003334,0.000534,-0.0042,-0.001672,0.000715,0.000441,-0.001208,-0.000449,0.000403,0.000589,-0.001505,-0.000604,0.000683,9.1e-05,0.000626,-8.4e-05,0.000837,1.5e-05,-0.000398,7.2e-05,0.00016,-6.7e-05,2.6e-05,-0.00039,9.4e-05,0.000125,-5.5e-05,-0.000102,-0.000149,-0.000141,-0.000231,-0.00012,4e-06,4e-06,-0.000158,-0.000149,-7e-05,-0.000401,-0.000392,-0.000317,-0.000196,3.7e-05,-0.000189,0.000448,0.000228,0.000115,-5e-06,6.7e-05,0.000598,0.000136,-0.00012,0.000159,-4.4e-05,1.2e-05,0.000246,0.000924,0.000544,7.6e-05,0.000384,-9.9e-05,-0.000134,-0.000949,-0.002868,-0.000523,0.001253,-0.002571,0.001393,-0.000996,0.00088
-0.000213,0.000338,0.000489,-3.5e-05,6.3e-05,-0.000214,-0.00012,7e-05,-4.6e-05,8.8e-05,-0.00097,0.000261,-0.000935,-0.000479,-0.000142,-0.000204,0.000507,0.00309,0.000205,-0.001935,-0.000535,-0.008205,0.001804,-0.003739,0.001022,0.005058,-0.003084,-0.001296,-0.001024,-0.00374,0.000887,7.7e-05,0.00232,-0.001635,0.001906,-0.00014,-9e-06,0.001584,-8.7e-05,0.000816,0.001909,0.00374,0.001211,-0.000488,0.000139,0.001466,-0.002199,0.004214,0.001162,0.001286,0.00114,0.004462,0.000137,-0.001837,0.001672,0.002562,7.1e-05,-0.000255,0.000179,0.00053,0.000236,-0.000432,0.000796,0.001919,0.00061,-0.000309,-0.000629,0.000101,5e-05,-0.000251,-0.000149,-0.000326,-0.000133,-0.000131,-0.000184,0.00043,-1.6e-05,2.7e-05,0.000341,-1.7e-05,3.3e-05,3.7e-05,2.8e-05,0.000114,0.000105,2.8e-05,5.1e-05,5e-06,-0.000181,9.4e-05,7.8e-05,0.000184,0.000179,-3.7e-05,-0.000207,-0.00032,-1.5e-05,8.1e-05,-0.000126,1e-06,-0.000304,-9.7e-05,8.1e-05,-0.000166,-0.000133,0.000155,-0.00012,-0.000183,-0.000655,0.000465,-6.4e-05,-0.000305,-0.000494,0.000164,-0.002967,-0.003237,-0.000708,0.000853,-0.00024,-0.001892,-0.00155
0.000104,-5.7e-05,9.4e-05,3.5e-05,0.000172,8.8e-05,0.000204,0.000122,0.000388,-0.000763,-4e-04,0.000256,-0.000175,-0.000301,-0.000302,0.000153,-0.000731,-0.000627,-0.002676,-0.000792,-0.001948,0.002129,0.000676,0.003804,-0.004065,-0.005504,0.001582,0.002879,-0.003468,0.001324,0.000871,0.001628,-0.000145,-0.001247,-0.00247,0.004126,-0.001696,-0.001359,0.001432,-0.003437,0.004173,-0.000323,0.00119,-0.000865,-0.004124,-0.004771,0.00339,0.000692,-0.001419,0.000692,0.002141,-0.002057,0.000429,0.000744,-0.001737,-0.002054,-0.000489,0.000149,0.00086,-0.000417,6.3e-05,0.000768,0.000505,-0.001373,-0.000385,-0.000304,0.000322,0.000194,-0.000355,0.000287,-1.3e-05,0.000123,-0.000219,-0.000217,4.9e-05,-0.000135,-0.000376,-0.000122,-4.9e-05,7.1e-05,4.6e-05,-1e-06,-2.7e-05,4e-06,3e-06,-9.7e-05,1.2e-05,7.2e-05,6.6e-05,-3e-05,-0.000268,-0.000216,-1.1e-05,0.000171,0.000197,0.000181,0.000144,-3.4e-05,0.00011,2e-06,0.000156,-2.2e-05,-8e-06,0.000199,-2.2e-05,-0.000143,1.1e-05,-0.000174,-3.3e-05,-0.002034,-0.000785,-0.000249,-4.4e-05,-0.000248,0.000591,-0.001674,-0.001783,-0.00024,0.000577,0.000137,-0.000288
-5.4e-05,-9.9e-05,-0.000247,-0.000217,-0.000222,-6.3e-05,-0.000102,-9.5e-05,-0.000531,-0.001163,-0.000764,-0.000548,-0.000174,-0.000603,-0.00012,-6.5e-05,0.000143,-0.00306,-0.00299,0.000354,-0.001142,-9e-06,0.002213,0.001185,0.001476,0.003001,0.002208,-0.000756,0.001659,0.003075,-0.000886,-0.002057,-0.001,-0.000979,0.003666,-0.001591,0.002397,0.001304,-0.000109,0.001251,0.000122,-0.004133,-0.002375,0.002488,0.004861,0.000582,0.002205,0.00127,-0.002093,-0.002806,-0.00164,0.001833,-0.001105,0.000536,0.00058,0.000115,0.00043,0.001634,-6.8e-05,0.000244,-0.001325,-0.000184,-0.000882,-0.000201,9.4e-05,0.000346,-8.8e-05,0.000238,-3e-05,4.8e-05,0.000549,-1.3e-05,-0.000185,0.000197,0.000222,-0.000278,0.000294,0.00025,-1.1e-05,-0.000137,-0.000148,-3.3e-05,-0.000222,-0.000193,-0.000197,-0.000173,-0.000199,-0.000103,9.7e-05,-0.000104,-8e-05,3.2e-05,-0.000199,-0.000149,0.000333,-0.000138,-0.000165,-3.8e-05,2.1e-05,2.2e-05,-0.000131,-6.3e-05,8.7e-05,-0.000385,-8.4e-05,0.000107,-9.9e-05,3.9e-05,-0.000485,0.001516,3.7e-05,-0.000271,0.00011,0.00058,0.000173,-0.000859,-0.000828,0.000257,-0.003446,-0.001257,-0.000169
3.8e-05,9.1e-05,3.2e-05,0.000172,4.4e-05,-4.9e-05,3.8e-05,9e-06,0.000243,0.000351,3e-06,-0.000285,-0.000469,-0.000346,2.8e-05,-0.000277,-0.000169,-0.000183,0.000815,0.000334,-0.000418,0.00235,-0.001561,-0.000688,-0.000872,-0.00231,5.6e-05,0.001477,-0.000719,-0.000281,0.000854,0.001355,-0.001812,0.001047,-0.003398,-0.001036,-5.1e-05,0.001463,-0.00094,-0.001041,0.000601,-0.000568,0.000348,-0.0022,-0.001304,0.002223,-0.001552,-0.000892,0.003167,-0.000835,-0.000317,-0.000916,0.00103,0.000408,-2.4e-05,-0.000826,-0.000147,-0.002101,-0.000593,0.00057,0.000843,-0.000332,-6.9e-05,0.000421,-0.000367,-7.9e-05,-0.000294,-3.9e-05,-0.000126,-0.000303,-0.000344,-0.000109,0.000243,0.00013,-0.000122,0.000242,3.1e-05,-9e-06,-5.3e-05,0.000107,8.2e-05,2.1e-05,1.2e-05,2e-06,-2e-05,1.4e-05,1.8e-05,-6.4e-05,-6.2e-05,-3.3e-05,-1.9e-05,-4.5e-05,7.5e-05,-1.3e-05,7.2e-05,-5.8e-05,-5.6e-05,-6e-05,-6e-06,0.000117,5.3e-05,-4.6e-05,-6.2e-05,0.000134,0.000116,-0.000174,0.000191,-6e-05,0.000546,-0.000929,-0.000353,0.000468,0.000208,0.000211,0.000975,0.000492,0.00026,0.000879,-0.000613,-0.002589,-0.000753
-3.2e-05,1.6e-05,0,-0.000186,6.8e-05,0.000128,2.4e-05,5.7e-05,-1.2e-05,0.000187,-0.000324,-0.000382,-0.000102,-7.6e-05,-0.000155,6.4e-05,4.6e-05,-0.001081,-0.001577,-0.002663,0.001003,-0.001135,-4.2e-05,-0.000404,6e-06,-0.000349,-0.000555,-0.000724,0.00073,-0.001635,-0.001058,-0.000129,0.000914,-7.4e-05,0.001321,0.000158,0.00024,-0.002599,0.000513,0.000638,-0.003793,-0.001333,-0.002337,-0.002888,-0.000851,-0.001976,-9.9e-05,-0.00078,-0.000429,0.000658,0.0016,-0.000579,0.000237,0.000175,0.000418,5e-05,-0.00014,-0.001019,4.8e-05,-6e-04,-0.000408,-0.000155,0.000344,-0.000242,0.00024,0.000505,-9.4e-05,-0.000138,0.000105,-1.6e-05,-4e-05,5.5e-05,8.5e-05,-0.000137,3.3e-05,3e-05,7.8e-05,-0.000289,-0.000157,-0.000243,-9.8e-05,4.5e-05,0.000113,-9.9e-05,2.4e-05,-9.4e-05,-2.5e-05,3.4e-05,6.3e-05,0.000113,0.000146,2.1e-05,-1.3e-05,1.5e-05,-0.000119,8.2e-05,4.5e-05,9.5e-05,-5e-05,-9.5e-05,2.1e-05,4.2e-05,-6e-05,8e-06,-0.000141,8.5e-05,-9.2e-05,-3e-06,0.000145,0.000516,-1.8e-05,-0.000696,3.2e-05,-6.6e-05,-0.00075,0.000352,-0.000352,0.000354,-0.00015,0.00145,0.000409
3.1e-05,-0.000103,-4e-06,-6.5e-05,-7e-05,-0.000111,4.5e-05,4.2e-05,-3.5e-05,0.000148,-6.7e-05,-0.000521,-0.000394,6.6e-05,0.000252,-8.4e-05,-5.7e-05,-5.4e-05,0.000139,0.000503,-0.001044,-0.000591,-0.000419,0.000255,-0.00229,0.000112,-0.000761,-0.000768,-0.002374,0.002138,0.002282,0.000678,-0.001204,7.3e-05,4.6e-05,-0.001899,-0.000259,0.002751,0.000139,-0.000142,-0.000194,6.9e-05,-0.000393,0.003884,0.002679,0.002863,0.001936,-0.000986,0.001214,-2e-05,0.001078,-0.000546,0.000139,0.001578,0.000385,0.000127,6.3e-05,0.000921,0.001,-0.000283,-0.000331,-0.000258,3.2e-05,0.000437,0.000157,-0.000426,-0.000147,9.1e-05,-0.000102,0.000169,0.000206,0.000118,-0.00022,8.3e-05,6.7e-05,7e-06,1.1e-05,5e-06,4.8e-05,-8.6e-05,5.1e-05,5.1e-05,-2e-06,4.1e-05,-2.8e-05,0.00011,1.9e-05,-2.9e-05,-1e-06,-0.000102,4.8e-05,1.2e-05,3.4e-05,-3e-05,2.3e-05,7.1e-05,-1.6e-05,-2.3e-05,3.7e-05,0,-4.5e-05,-7.3e-05,-2.9e-05,-0.000152,-2.1e-05,-2.7e-05,0.000144,-0.000119,-0.000303,-0.000194,-0.000872,0.000171,0.000352,-0.000185,-0.000257,0.000979,6.7e-05,0.00012,0.001586,-0.00015,-0.000274
3.6e-05,3.3e-05,-3e-05,0.000249,8.7e-05,-2e-05,-2.9e-05,-8.3e-05,-1.1e-05,-8.8e-05,0.000207,4.7e-05,4.2e-05,0.000202,6.4e-05,0.000114,0.000124,0.000653,-0.000808,0.000263,0.002707,0.001144,0.000318,-0.000171,0.001483,0.000995,0.002021,-0.000829,-0.000367,-0.000165,-0.000179,-0.000866,0.003209,-0.000212,-0.00031,0.000354,-0.000974,-0.000563,-0.000495,-0.001001,0.000822,0.000984,-0.000546,-0.000269,-9e-04,-0.002348,-0.00167,0.001188,-0.000662,-0.000838,0.000813,0.002277,0.000426,-0.002734,0.00027,0.000321,-0.000869,-0.000169,-0.000587,0.000205,0.000408,0.000545,-5.2e-05,0.000245,-0.000192,1.2e-05,7.4e-05,0.000207,0.000221,0.000246,-8.6e-05,-5e-05,0.000145,-2.3e-05,-0.000115,1.9e-05,-5.6e-05,0,4e-06,5.2e-05,-1e-05,-4.3e-05,-5.7e-05,5.7e-05,2.3e-05,6e-06,-2.3e-05,-4.8e-05,-7.7e-05,9.9e-05,-4e-06,7e-05,1.9e-05,4.2e-05,5.2e-05,1.5e-05,2.1e-05,5.6e-05,4e-05,8e-06,-8e-06,1e-06,-4.7e-05,6.6e-05,-1e-05,-1.1e-05,-5.5e-05,7e-06,0.000139,0.000163,0.000597,-0.000405,2e-05,-4.8e-05,0.000549,-0.000528,2e-06,0.000577,-0.000259,-0.000242,-0.000609
-2.4e-05,9e-06,1.3e-05,-6e-05,-2.4e-05,5e-05,-1.3e-05,6.7e-05,4.1e-05,-8.1e-05,0.000276,-0.000117,6.2e-05,9e-06,9.1e-05,5e-06,-1.2e-05,0.000742,0.001504,-0.000168,0.000154,0.001217,0.00053,-0.000487,-0.000516,0.000203,-0.001829,0.000633,-0.000207,0.001423,-0.00239,-0.000395,-0.002401,-0.000262,1.7e-05,7.4e-05,0.00087,0.000897,0.000328,-7.3e-05,-0.000938,-0.000604,-0.00015,-0.000716,-0.001036,0.001899,0.000217,-0.001262,-0.001918,7.9e-05,0.000384,-0.000786,-0.001102,0.000943,-0.000674,0.000154,0.001159,6.6e-05,0.000685,0.000585,0.000201,-2.5e-05,0.000215,-0.000439,-2e-06,0.000134,9e-06,-0.000107,-0.000153,-0.000105,8.7e-05,-3e-05,4.4e-05,4.8e-05,9.1e-05,1.7e-05,3.8e-05,0.000137,-4.7e-05,0.000141,-1.1e-05,-3.5e-05,8e-05,9e-06,-5.8e-05,-6e-05,-3e-05,0.000102,6.8e-05,-2.2e-05,-3.1e-05,-6.3e-05,4.7e-05,-5.8e-05,4.7e-05,-1.5e-05,-6.9e-05,-8.9e-05,-6e-06,-1.4e-05,2e-05,1.8e-05,3.9e-05,-6.4e-05,-2.3e-05,-2.2e-05,4.1e-05,4.6e-05,-4.2e-05,1.3e-05,0.00031,0.000505,1.5e-05,-0.000134,-0.000188,-0.000669,-9.3e-05,0.000895,0.001041,0.000188,-4.5e-05
-8e-06,-1.2e-05,2.4e-05,-2.1e-05,-9.1e-05,-6.4e-05,-2.7e-05,-5.9e-05,-4.4e-05,-0.000174,-0.000107,0.000173,-1.1e-05,-3.8e-05,1.1e-05,0.000126,1e-04,-0.00057,0.002293,0.000178,-0.000723,0.000538,4.7e-05,0.000984,0.000834,-0.000355,-0.001084,-0.000409,0.001033,-0.000596,0.001654,0.00045,3.1e-05,-6.7e-05,-0.000528,0.00053,0.000191,-0.002635,-0.000179,-0.000469,-0.000467,-0.000586,0.000656,-0.000878,-0.000605,-0.00155,-0.000457,-9.6e-05,0.000581,0.000447,-0.000722,0.000448,0.000282,0.000794,1e-05,-0.00042,-0.00111,-0.000225,-0.000611,-0.000466,0.000167,-0.000194,-0.000221,0.000181,7e-06,-3.4e-05,8.8e-05,-0.000214,2.1e-05,-6.5e-05,-5e-05,1.8e-05,-5e-06,1.3e-05,-6.4e-05,-7.5e-05,-9e-06,-1e-06,1.7e-05,-1.3e-05,6e-06,-2.8e-05,-5.7e-05,2e-06,3.1e-05,2.6e-05,1.5e-05,-1.6e-05,-4.2e-05,8e-06,7.6e-05,-1.7e-05,-1.7e-05,-6e-06,-5.6e-05,-1.8e-05,1.7e-05,2.5e-05,4e-06,-2e-06,-2.9e-05,-1.6e-05,1e-05,6.5e-05,6.3e-05,3e-06,-1.3e-05,4e-06,1.1e-05,-3.7e-05,3.5e-05,-0.000148,6.1e-05,-2.2e-05,-4.5e-05,0.000145,-1.6e-05,-0.000127,-0.000804,-0.000142,0.000258
6e-06,1.6e-05,-1.4e-05,-5e-05,-1e-05,1.5e-05,8e-06,2.1e-05,1.2e-05,0.000105,-0.000162,9e-06,-4.9e-05,-1e-06,5.5e-05,6.2e-05,-7.8e-05,-9.9e-05,-0.00115,0.00035,0.000369,-0.001127,-1.3e-05,0.000393,-0.00038,-0.000107,0.000119,-0.000355,-0.000524,-0.000134,-0.001876,0.000106,-0.000262,-1.3e-05,0.000285,-0.000524,0.000738,0.000835,0.000415,0.000109,0.00047,-0.00042,0.000446,-0.00155,0.000279,8.2e-05,0.000787,0.000515,-0.000344,0.000249,-0.001246,-0.000184,-3e-04,-0.000185,0.000516,0.000126,0.000527,0.000118,0.000151,0.000175,-0.000268,0.000134,-9e-06,1.1e-05,-9.3e-05,0.000249,-1e-05,6.5e-05,-0.000128,2.7e-05,-1e-04,-6.4e-05,4.3e-05,-4.6e-05,4.9e-05,-4e-06,2e-06,-8.7e-05,4.7e-05,-8.2e-05,-3.3e-05,-9e-06,-8e-06,0,-1.1e-05,2.4e-05,8e-06,-1.8e-05,-1.1e-05,-5.2e-05,-4.6e-05,6.4e-05,-1.6e-05,6.3e-05,-4e-05,2.2e-05,4e-06,-5.1e-05,-2e-06,-1e-06,2.2e-05,9e-06,2.7e-05,-3.5e-05,-2.6e-05,-7e-06,1.8e-05,-6e-06,7.6e-05,-9.5e-05,-0.000106,5.9e-05,0.000107,2.4e-05,-0.000198,0.000132,9.2e-05,-0.000924,-0.000464,-8.6e-05,-5.2e-05
-5e-06,1.2e-05,-4e-06,7e-05,-3.5e-05,-7e-06,6e-06,1e-05,3.4e-05,3.1e-05,-8.7e-05,-1.3e-05,5.9e-05,2.9e-05,-2.3e-05,-5.9e-05,4.9e-05,-0.000121,-0.000814,-0.000566,0.000359,4e-06,-0.000318,-1.6e-05,2.3e-05,-0.000197,-9.6e-05,0.000414,7.2e-05,-0.000744,1.4e-05,-8.1e-05,4.3e-05,0.001185,0.00034,-0.000402,-0.000486,-0.000428,-0.000214,2e-04,0.000366,0.000541,0.000252,0.000699,0.000424,0.000292,-0.000825,0.001129,0.001253,-0.00059,-0.000474,0.000878,0.000307,0.000397,-0.000254,-1.1e-05,-0.000389,0.000218,4e-06,-2.8e-05,4.5e-05,6.4e-05,-0.000111,-0.000217,7.6e-05,-0.00024,-6.1e-05,-0.000142,9.3e-05,3e-05,-1.7e-05,3.5e-05,-6e-05,2.1e-05,-3.6e-05,2.6e-05,1.6e-05,2e-05,-6e-05,2.2e-05,-3.2e-05,-1.4e-05,2.4e-05,-4.2e-05,1.7e-05,-1.5e-05,4e-06,2e-06,6e-06,2.2e-05,3.7e-05,-2.3e-05,-3e-06,-5.3e-05,2.7e-05,-3e-06,5.4e-05,5e-05,3.3e-05,-3e-06,9e-06,-2.5e-05,-2.5e-05,3e-06,-8e-06,3e-06,5e-06,-5e-06,-2.7e-05,0.00012,-0.000115,3.6e-05,-1.2e-05,-2e-06,0.000174,-2.5e-05,-8.6e-05,2.1e-05,-0.000218,-0.000274,-0.000215
5e-06,-1e-06,1.1e-05,-3.2e-05,0.000101,-4e-06,-1e-05,-3.7e-05,-5.8e-05,5.6e-05,4.8e-05,0.000117,-4.8e-05,4.8e-05,8.3e-05,4.3e-05,-3.8e-05,-0.000135,-0.000465,0.000215,-0.000134,7.2e-05,0.000734,1.2e-05,-0.000535,0.000494,0.000188,-0.00022,-0.00032,-0.000157,0.000373,8.1e-05,0.000171,-0.000938,-2.8e-05,9.5e-05,2.9e-05,0.000398,0.000297,0.000288,-0.000137,0.000362,0.000243,0.000381,-0.000244,-0.000175,-0.000309,-0.000728,-0.000396,3.3e-05,0.000125,-8.4e-05,1.3e-05,-0.000496,-0.000511,-0.000206,0.000387,-0.000239,-6.1e-05,1.6e-05,-5.4e-05,2.8e-05,0.000164,9.7e-05,-3.1e-05,8.5e-05,1.6e-05,-5.7e-05,-6.8e-05,-6.6e-05,1.4e-05,-1.4e-05,-2.1e-05,-6e-06,2.3e-05,9e-06,-5.4e-05,-2.2e-05,3.8e-05,4e-05,-5.4e-05,1.6e-05,-2e-05,-1.1e-05,9e-06,9e-06,4e-06,-2e-06,-7e-06,9e-06,-1e-05,-2e-06,-9e-06,5.4e-05,-2e-06,-1e-06,2.9e-05,-5.7e-05,-6e-06,-5e-06,6e-06,1e-05,-1.1e-05,3.1e-05,6e-06,5e-06,-3.1e-05,2e-06,1e-06,-7.4e-05,-9.3e-05,3.2e-05,-1.1e-05,8e-05,6.7e-05,0.000141,-4e-06,-9e-05,-1e-06,4.2e-05,-2e-06
-1e-06,-3e-06,5e-06,1.6e-05,-2.5e-05,3e-06,-3e-06,-7e-06,4.2e-05,-2.6e-05,5.5e-05,-6.7e-05,1.8e-05,4e-05,3.7e-05,-6.7e-05,1.2e-05,8.7e-05,-0.000222,0.000278,0.000226,-0.00028,-0.000102,-0.000429,0.000694,-0.000337,-0.000603,4e-05,7.7e-05,-0.000185,-0.000242,2.5e-05,0.000223,0.000121,-0.000455,0.000173,5.4e-05,-0.000404,0.000224,-0.000294,3.2e-05,9e-06,-0.000474,-0.000982,-7.9e-05,-6.3e-05,0.00059,6.7e-05,0.00014,-1.2e-05,-0.000165,0.00034,2.2e-05,0.000233,0.000111,2.4e-05,-0.000211,-0.000186,-0.000215,7.3e-05,-2e-06,-2.4e-05,-4.4e-05,6.5e-05,-1e-06,4.2e-05,4.1e-05,5.6e-05,2.9e-05,2.1e-05,4.6e-05,3e-05,5e-06,-6e-06,-1e-05,-1.6e-05,3.9e-05,-8e-06,0,1.2e-05,3.2e-05,-6e-06,-3e-06,1.2e-05,-1e-05,-7e-06,-4e-06,1.9e-05,3e-06,-4e-06,-2e-06,-1e-06,-7e-06,-4.5e-05,-1.6e-05,1.2e-05,-2.8e-05,6.5e-05,1e-05,5e-06,-1e-06,-7e-06,9e-06,-5.1e-05,8e-06,-1.2e-05,3e-06,-8e-06,2e-06,-2.4e-05,5e-05,-9.9e-05,-6e-06,2e-05,-0.000102,-0.000265,3.6e-05,-0.000186,-9e-06,5.1e-05,3.2e-05
-6e-06,-2e-06,-9e-06,-1.3e-05,1.1e-05,-7e-06,-1e-06,-7e-06,-6e-06,-1.4e-05,1.3e-05,-4e-05,-6.5e-05,4.3e-05,3e-06,2e-06,-2.7e-05,6.6e-05,0.000694,-0.000191,4.4e-05,1.9e-05,-0.000302,-0.000394,-0.000434,-8.4e-05,-0.000262,-0.000242,-7.1e-05,-3.1e-05,-7e-06,-0.000118,-0.000514,-0.00015,0.00032,-8e-06,-5.9e-05,-0.000246,-0.000149,-0.000125,-0.000528,-0.00018,-0.00028,0.00062,-4.4e-05,-0.000127,0.000192,1.8e-05,-0.00081,-0.000281,-5.4e-05,-0.00033,-0.000249,-0.000258,0.000267,7.5e-05,0.000279,0.000118,0.000105,9e-06,1.8e-05,-4.6e-05,-1.8e-05,-8.7e-05,4.8e-05,-2e-06,-9e-06,-3.3e-05,2.4e-05,2.9e-05,-3e-05,-7e-06,2e-05,8e-06,8e-06,2.3e-05,7e-06,-5e-06,2e-06,-2.4e-05,1.2e-05,9e-06,-3e-06,1.3e-05,4e-06,2e-06,-3e-06,-1.8e-05,7e-06,3e-06,1.4e-05,9e-06,1e-06,2.7e-05,-1.2e-05,-1e-06,-8e-06,-2.8e-05,-8e-06,6e-06,-8e-06,8e-06,2e-06,1.9e-05,-7e-06,9e-06,-8e-06,-4e-06,-1e-05,9.8e-05,-1.5e-05,1.7e-05,-8e-06,3.2e-05,8e-06,3.3e-05,-2.3e-05,-9e-05,0.000196,5.6e-05,2e-06
-4e-06,-2e-06,3e-06,-1e-06,-2.9e-05,1.3e-05,3e-06,1.5e-05,1e-06,-6.5e-05,-3.8e-05,-6e-05,-2e-06,2.5e-05,1.6e-05,-2.9e-05,9e-06,1.6e-05,0.000205,-7.1e-05,5e-05,0.000147,-0.000201,-1e-06,0.000123,1.5e-05,0.000238,5.6e-05,4.4e-05,-6e-06,-0.00033,-0.000113,0.000762,-9.1e-05,-6.5e-05,-0.000237,-5.6e-05,5.7e-05,-0.000211,-0.000172,0.000374,-0.000127,8.6e-05,0.000314,8.8e-05,0.000528,-0.000439,3.9e-05,0.000336,0.000141,0.00021,0.000283,-0.000189,3.2e-05,-0.000256,-2e-05,-0.000244,0.000121,-9.5e-05,-8.4e-05,-4.3e-05,5.1e-05,-1.1e-05,3.8e-05,-3.2e-05,1.2e-05,-2.7e-05,8e-05,-2e-06,3e-05,-1.1e-05,0,5e-06,-3e-06,-2.5e-05,5e-06,-3.1e-05,-7e-06,6e-06,2.4e-05,1e-05,-4e-06,1e-05,-4e-06,-1.1e-05,1e-06,-4e-06,-1e-06,-4e-06,-1e-06,-6e-06,-1e-06,2e-06,-1.6e-05,-7e-06,-5e-06,-8e-06,-4e-06,1e-05,-4e-06,-3e-06,-2.4e-05,-1e-05,-1.6e-05,3e-06,-1.1e-05,8e-06,7e-06,1.1e-05,-0.000116,-2.6e-05,-7e-06,-2.3e-05,6e-06,-5.5e-05,-0.00011,1e-06,-3.5e-05,-0.000106,-0.000229,-1e-06
1e-06,4e-06,6e-06,2.1e-05,2e-05,-4e-06,-1e-06,-8e-06,-8e-06,2.6e-05,-6e-06,-1e-05,1.2e-05,-1.4e-05,5e-06,7e-06,-1.5e-05,8.1e-05,4.7e-05,0.000149,-0.000109,0.00014,0.000549,0.000159,-0.000273,2e-04,0.000364,0.000204,-0.000118,-0.000278,0.000333,-0.000117,-0.000596,6.1e-05,-7.6e-05,-1.6e-05,-0.000142,-3.3e-05,-3.7e-05,-6.7e-05,-4.5e-05,-5.4e-05,-0.000205,9.1e-05,0.000104,-0.000748,-7.5e-05,-0.000283,2.9e-05,3.9e-05,0.000236,-0.000218,8.4e-05,0.000191,2.1e-05,1.5e-05,0.000223,1.9e-05,9.3e-05,9e-06,9.4e-05,-1.7e-05,2.3e-05,5.5e-05,-1.2e-05,2.7e-05,1.8e-05,-3.9e-05,-3e-06,-1.6e-05,1.1e-05,0,8e-06,2e-06,3.2e-05,-3e-06,2.6e-05,-8e-06,-3e-06,-2e-06,-3e-06,4e-06,-3e-06,-1e-06,8e-06,1e-06,-4e-06,1.6e-05,-4e-06,3e-06,1.2e-05,-7e-06,-8e-06,-2e-06,1e-05,-3e-06,-7e-06,1.3e-05,-8e-06,1e-06,-1e-06,6e-06,-5e-06,1.2e-05,-1e-06,1e-05,-1.1e-05,1e-06,-4e-06,9e-05,2.2e-05,-8e-06,-1.4e-05,1.4e-05,0.000135,8.9e-05,2.7e-05,-6.4e-05,-0.000161,4.6e-05,-4.6e-05
2e-06,-1e-06,-4e-06,-1.1e-05,-1.9e-05,-6e-06,0,-5e-06,8e-06,3.6e-05,2e-05,2.7e-05,-4e-06,-3e-06,7e-06,-3e-06,1e-05,-3.7e-05,-1.9e-05,0.000197,0.00013,0.000169,-0.00021,0.000219,0.000182,-0.000297,-1.6e-05,-0.000174,-3.1e-05,0.000102,1.6e-05,0.000107,8.5e-05,0.000328,-0.000141,2.8e-05,-0.00025,0.000132,-2.6e-05,3.5e-05,-0.000157,-6.1e-05,-6.9e-05,-0.000211,-0.000175,0.000874,0.000182,0.000282,0.000223,9.9e-05,-0.000137,0.000188,5.9e-05,-9.5e-05,-4.2e-05,1e-05,-0.000246,-0.000136,-0.000124,7.6e-05,-2.9e-05,2.8e-05,-3.1e-05,-5.9e-05,3.1e-05,-4e-05,2e-06,-1e-06,3e-06,-2.2e-05,1.9e-05,-7e-06,2e-06,4e-06,-3.3e-05,-6e-06,-8e-06,3.4e-05,-4e-06,2.3e-05,4e-06,3e-06,-1e-06,1e-06,-4e-06,-1e-06,0,-1e-06,6e-06,-9e-06,7e-06,8e-06,-2e-06,9e-06,2e-06,1e-06,-6e-06,-7e-06,-7e-06,5e-06,-3e-06,0,6e-06,-1e-06,-9e-06,-9e-06,6e-06,-4e-06,3e-06,-4.6e-05,7.5e-05,2.7e-05,-1.8e-05,2e-06,-4.5e-05,1e-05,-3.6e-05,0,-2e-06,-7.1e-05,6e-06
-3e-06,1e-06,-3e-06,-1e-06,-1e-06,4e-06,6e-06,1.4e-05,0,1.5e-05,-1.6e-05,1.3e-05,-7e-06,2.4e-05,-6e-06,-2e-06,-5e-06,-0.000153,-0.000221,-0.000191,-0.000199,-0.000242,-0.000119,0.00019,-0.000107,0.000131,-0.000192,0.000228,2.9e-05,6.5e-05,-0.000193,6.8e-05,-7.2e-05,-0.000109,0.000237,0.000159,-6.2e-05,-0.000286,-2.1e-05,3.6e-05,-4.2e-05,7e-05,0.000283,-0.000298,0.000249,-0.000585,0.000195,-0.000205,0.000198,-6.2e-05,-9.6e-05,-0.000136,0.000111,-0.000139,0.000119,-4.6e-05,0.000176,8e-05,5.4e-05,-5.7e-05,5.2e-05,-2.4e-05,1.8e-05,0,-2.1e-05,4.1e-05,-3e-06,1.1e-05,-2.3e-05,4e-06,-2.4e-05,8e-06,-2.6e-05,-8e-06,1.1e-05,8e-06,-1.3e-05,-1.7e-05,0,-2e-06,4e-06,-1e-06,5e-06,-8e-06,9e-06,5e-06,-2e-06,-4e-06,-1e-05,4e-06,-5e-06,-5e-06,-3e-06,-5e-06,-1e-05,4e-06,8e-06,1e-06,1e-06,-1e-06,9e-06,-5e-06,1.2e-05,-1.3e-05,1e-05,5e-06,-7e-06,5e-06,0,2.4e-05,1.6e-05,-8e-06,-1.4e-05,1e-06,-3.4e-05,3e-06,7e-06,2.4e-05,-0.000155,-2.3e-05,-4.4e-05
3e-06,-1e-06,3e-06,-1.3e-05,1.7e-05,-4e-06,0,-1.1e-05,-5e-06,-1.2e-05,-3.1e-05,3.6e-05,-1.8e-05,3.7e-05,6e-06,3e-06,1.1e-05,2e-05,9.2e-05,8.8e-05,-1.3e-05,7.2e-05,6.2e-05,-0.000118,0.000225,-0.000202,3.2e-05,-4.8e-05,0.000132,0.000224,0.00013,0.000166,0.000201,-8.3e-05,-8.1e-05,-3.1e-05,3.4e-05,0.000293,0,6.2e-05,3.8e-05,7e-06,7.3e-05,0.000102,-2.2e-05,0.000306,-6.2e-05,-7e-06,-0.000681,-7.7e-05,0.000123,2.9e-05,-1.4e-05,1.4e-05,3.1e-05,-5.4e-05,-0.000167,8.9e-05,1.2e-05,1.5e-05,-6.2e-05,-2e-06,1.2e-05,2.2e-05,0,-4.1e-05,1.8e-05,3e-06,2e-05,-1e-06,5e-06,-1e-05,1.2e-05,-2e-06,-8e-06,6e-06,1.8e-05,0,7e-06,-9e-06,-1.1e-05,1e-06,-3e-06,1e-06,-3e-06,-4e-06,-1e-06,4e-06,1e-05,2e-06,2e-06,3e-06,-6e-06,1e-06,1e-06,-4e-06,3e-06,7e-06,1e-06,-2e-06,6e-06,0,-7e-06,1.5e-05,-3e-06,-2e-06,4e-06,-1e-06,-8e-06,-2.4e-05,-8.8e-05,1e-05,-1.3e-05,2e-06,1e-06,-5.9e-05,1e-05,-2e-05,0.00015,-9.4e-05,1.3e-05
0,0,0,2.5e-05,1e-06,1e-06,0,1.4e-05,4e-06,-1.4e-05,4e-06,-8e-06,-1e-06,2.5e-05,-5e-06,-6e-06,-3e-06,6.2e-05,-0.000116,1.7e-05,4.1e-05,3e-05,0.000129,-6.2e-05,-0.000268,0.00017,3.5e-05,-2.1e-05,4.9e-05,-0.000237,1e-06,4e-06,-0.000117,-5.9e-05,6.2e-05,-0.000104,-9.4e-05,-8e-06,6.7e-05,-4.2e-05,0.000223,0.000129,0.000112,0.000425,-2.5e-05,-0.000233,-0.000196,5.8e-05,0.000148,6.2e-05,0.000223,-0.000123,-5.6e-05,-3.7e-05,-4.7e-05,6.2e-05,0.000101,-7.2e-05,-2.2e-05,-1.2e-05,-6e-06,4.2e-05,0,-7e-06,8e-06,3.3e-05,-2e-06,2.4e-05,-2.4e-05,-9e-06,0,1.3e-05,-1e-06,6e-06,1.1e-05,-1e-06,-8e-06,-6e-06,-8e-06,-2e-06,-3e-06,-2e-06,-5e-06,-1e-06,-1e-06,-3e-06,-1e-06,0,2e-06,0,0,-1e-06,-3e-06,5e-06,1.1e-05,-2e-06,3e-06,-5e-06,3e-06,1e-06,-5e-06,-7e-06,1e-06,-1.9e-05,-2e-06,3e-06,-2e-06,0,2e-06,2.8e-05,-3.4e-05,-1.6e-05,-1e-05,-2e-06,2.1e-05,-4e-05,-1.7e-05,1.8e-05,6.6e-05,8.6e-05,1.3e-05
-1e-06,-1e-06,-3e-06,-1.3e-05,1e-06,0,-2e-06,-1e-05,-2e-06,-1.7e-05,2.5e-05,-1e-06,1.1e-05,8e-06,9e-06,2e-06,6e-06,1.3e-05,-0.000173,1e-06,-3.6e-05,-0.000195,-0.000132,-2.5e-05,8e-05,6.1e-05,-2e-05,0.000204,-3.6e-05,0.000124,6.9e-05,-1.3e-05,0.000111,-7.2e-05,-0.00013,1.8e-05,5.8e-05,0.000152,3.5e-05,-6.5e-05,-0.000136,-8.3e-05,0.00014,-0.00024,1.6e-05,0.000191,0.000119,0.000164,-0.00012,-4.8e-05,2.2e-05,0.000107,-9e-05,-1e-06,-2.3e-05,3.6e-05,-6.6e-05,-8e-05,2e-06,-4e-06,0,-1.5e-05,-1e-05,7e-06,-4e-06,-3e-05,-6e-06,-3.9e-05,2.6e-05,4e-06,1.9e-05,-7e-06,-1.1e-05,-5e-06,-6e-06,0,-1e-06,5e-06,3e-06,1.1e-05,-1e-05,0,2e-06,0,0,3e-06,0,4e-06,-5e-06,-6e-06,0,-2e-06,2e-06,-9e-06,3e-06,3e-06,0,2e-06,-5e-06,2e-06,4e-06,6e-06,-5e-06,5e-06,2e-06,-4e-06,0,-3e-06,0,-4.4e-05,-3e-05,3.6e-05,-6e-06,3e-06,4.5e-05,2.9e-05,1.4e-05,7.4e-05,5.1e-05,-4.9e-05,1e-06
0,1e-06,2e-06,1e-06,-1.3e-05,-2e-06,1e-06,9e-06,1e-06,0,1.2e-05,-6e-06,-1.5e-05,1e-06,-1.7e-05,-2e-06,-3e-06,1e-06,8e-05,6.5e-05,1.3e-05,0.000137,-2.5e-05,-0.00013,-8.5e-05,5.4e-05,-0.000136,-0.000112,-7.4e-05,-6.5e-05,-5.6e-05,-4.9e-05,-0.000111,6.1e-05,3.3e-05,-8e-06,-6e-05,-0.000296,-9e-06,-9.4e-05,4.2e-05,-0.000105,-8.8e-05,-5.9e-05,-9e-05,-0.00015,4e-05,-0.000238,0.000207,-1.7e-05,4.8e-05,-0.000166,-1.2e-05,4.6e-05,1.1e-05,-6.7e-05,6.8e-05,1.9e-05,3.5e-05,7e-06,-4e-06,4e-06,1.5e-05,0,2e-06,6e-06,3e-06,2.3e-05,-1e-05,7e-06,-5e-06,4e-06,8e-06,3e-06,5e-06,2e-06,3e-06,-2e-06,3e-06,1.2e-05,-1e-06,-1e-06,0,1e-06,-3e-06,-1e-06,0,-3e-06,5e-06,7e-06,0,4e-06,-3e-06,9e-06,-5e-06,-1e-06,-5e-06,-1e-05,0,-3e-06,-2e-06,-5e-06,4e-06,-3e-06,-1e-06,4e-06,3e-06,-1e-06,2e-06,5.3e-05,2.2e-05,-4.7e-05,-5e-06,0,-6.4e-05,-1.7e-05,3e-06,4.2e-05,-4.4e-05,5.7e-05,-3.9e-05
1e-06,1e-06,1e-06,-2e-06,-2e-06,0,0,-3e-06,-1e-06,2.2e-05,-1.2e-05,-1.7e-05,-9e-06,1e-06,-2e-06,-1e-06,2e-06,1.8e-05,0.000151,-3.8e-05,-4e-05,-0.000163,8.3e-05,1.2e-05,0.000178,-0.000144,-8.8e-05,4.6e-05,1e-06,0.000232,0.000159,-0.000139,6e-05,3.7e-05,7.7e-05,-2.9e-05,7.7e-05,9.2e-05,2.4e-05,-1.4e-05,-9.5e-05,-6.6e-05,-6.4e-05,9.6e-05,1.1e-05,6.8e-05,-6.4e-05,0.000204,0.000131,5.3e-05,6.3e-05,-9e-06,6.6e-05,-9.4e-05,8e-06,-1.4e-05,-3.4e-05,8.4e-05,1.6e-05,1.8e-05,1.8e-05,-1.7e-05,-6e-06,-1e-06,-4e-06,-1.8e-05,-1e-06,-9e-06,1e-05,1.6e-05,-1.3e-05,-3e-06,6e-06,2e-06,-1.2e-05,-1e-06,-2e-06,5e-06,-2e-06,-1.1e-05,4e-06,1e-06,-4e-06,2e-06,2e-06,1e-06,-3e-06,2e-06,-4e-06,-3e-06,2e-06,-2e-06,-1e-06,-7e-06,-3e-06,-1e-06,6e-06,5e-06,-2e-06,0,-5e-06,-2e-06,-6e-06,-3e-06,-1e-06,-2e-06,-2e-06,-1e-06,4e-06,-5.9e-05,5.2e-05,3.3e-05,-4e-06,2e-06,1e-05,3.9e-05,-1.1e-05,4e-06,-4.2e-05,-9.8e-05,1.2e-05
0,0,-1e-06,5e-06,-4e-06,-1e-06,-2e-06,4e-06,1e-06,6e-06,-2.2e-05,-8e-06,-5e-06,3e-06,-1e-05,4e-06,-4e-06,-1.8e-05,0.00015,-8.7e-05,-3.1e-05,7.9e-05,-0.000122,0.00012,-0.000118,4.8e-05,6.1e-05,3.9e-05,1.7e-05,-6.9e-05,-2e-05,-3.2e-05,-0.000129,1e-04,-5e-05,5e-05,8.9e-05,4.8e-05,3.4e-05,2e-05,0.000113,9e-05,-2.6e-05,2.7e-05,3.6e-05,6.9e-05,6.2e-05,-5.1e-05,-0.000141,-3.8e-05,-2.5e-05,-5.6e-05,7.1e-05,6.2e-05,-6.7e-05,5.8e-05,4e-05,-1.3e-05,8e-06,-2.1e-05,2e-06,5e-06,-6e-06,1.1e-05,-2e-06,8e-06,2e-06,-1.4e-05,-3e-06,-1e-05,1e-05,0,-3e-06,-4e-06,9e-06,0,3e-06,-4e-06,-1e-06,0,2e-06,-1e-06,4e-06,-1e-06,-1e-06,1e-06,1e-06,5e-06,-1e-06,1e-06,0,-1e-06,3e-06,6e-06,5e-06,-1e-06,-5e-06,-6e-06,2e-06,1e-06,3e-06,-2e-06,0,4e-06,1e-06,0,4e-06,1e-06,-4e-06,5.4e-05,-1.6e-05,-3.6e-05,-3e-06,0,3e-06,-4.6e-05,3e-06,1e-05,-0.000132,4.6e-05,-1e-06
-1e-06,-1e-06,0,1e-06,1e-05,1e-06,0,-2e-06,-2e-06,-6e-06,-1e-06,-7e-06,4e-06,8e-06,-5e-06,-4e-06,0,-1.4e-05,1.4e-05,6.7e-05,-7.6e-05,8.4e-05,-1.4e-05,2.9e-05,7.3e-05,-8e-06,-1.2e-05,-7.1e-05,1.9e-05,-1e-05,-7.8e-05,2.2e-05,0.000124,-0.000119,-5.1e-05,2.6e-05,9.1e-05,-1.2e-05,1.9e-05,5e-05,-1.7e-05,6.1e-05,-0.000101,-2.4e-05,-8.2e-05,-0.000208,5e-06,-1e-06,-7.8e-05,1.9e-05,-0.000156,0,2.6e-05,-5e-05,1.7e-05,-1.4e-05,-2.3e-05,-6.3e-05,-9e-06,-1.3e-05,1.4e-05,9e-06,-3e-06,-2.3e-05,1.2e-05,-1.3e-05,-7e-06,1.8e-05,-9e-06,-1.5e-05,8e-06,0,1e-06,4e-06,-5e-06,2e-06,-5e-06,4e-06,2e-06,1e-06,4e-06,1e-06,0,-1e-06,2e-06,-1e-06,-1e-06,-2e-06,3e-06,-5e-06,0,0,-2e-06,-4e-06,4e-06,0,1e-06,7e-06,-1e-06,0,-1e-06,0,-1e-06,-9e-06,-1e-06,0,-2e-06,1e-06,-1e-06,-3e-05,-1e-06,3.9e-05,6e-06,1e-06,2.3e-05,-1e-06,2e-06,1.5e-05,4.7e-05,-5.1e-05,7e-06
2e-06,0,1e-06,-4e-06,8e-06,0,-1e-06,-4e-06,1e-06,-7e-06,1e-05,1.7e-05,2e-06,1.6e-05,-5e-06,4e-06,-2e-06,1.8e-05,-0.000129,0.000115,-2.4e-05,4.6e-05,5.5e-05,-2.7e-05,-0.00014,-9e-06,-8.5e-05,2.2e-05,-1e-05,-5.2e-05,7.5e-05,7.8e-05,-5.3e-05,-3e-05,5.6e-05,-2.8e-05,4e-06,-0.000155,-6.4e-05,2e-05,-6.2e-05,0,0,-0.000126,-1.7e-05,0.000257,-0.000102,-0.000112,-8.9e-05,1.1e-05,-0.000155,-0.000128,-4.8e-05,-1.5e-05,4.2e-05,-4.2e-05,4e-06,2.4e-05,-1.5e-05,2.9e-05,-3.9e-05,-1.6e-05,2.2e-05,4e-06,-1e-05,7e-06,-3e-06,-1.6e-05,0,3e-06,-7e-06,-3e-06,0,1e-06,3e-06,0,3e-06,3e-06,-4e-06,1.3e-05,-1e-06,-1e-06,0,-3e-06,-2e-06,-1e-06,0,3e-06,-2e-06,6e-06,-1e-06,1e-06,-3e-06,2e-06,-3e-06,0,-1e-06,-1e-06,-1e-06,0,1e-06,-1e-06,5e-06,8e-06,-2e-06,0,1e-06,0,0,4e-06,-4e-06,-3.1e-05,5e-06,-1e-06,-9e-06,-1.9e-05,-9e-06,-4e-06,1e-05,1.6e-05,-1.2e-05
-1e-06,0,0,2e-06,-1e-06,-1e-06,1e-06,2e-06,0,-5e-06,7e-06,8e-06,-1e-05,1.6e-05,-6e-06,-3e-06,1e-06,2.5e-05,-0.000151,-7.8e-05,0,8e-05,1.1e-05,0,0.000133,4e-06,-8e-05,-4.8e-05,-8e-06,7.1e-05,-3.8e-05,8.4e-05,4e-05,1e-05,5e-06,-3.6e-05,1.5e-05,6e-06,-2.2e-05,-2.2e-05,-2.2e-05,-9e-06,0.000132,-3.2e-05,7.6e-05,-0.000255,3e-06,0.000147,0.00018,-2.2e-05,-2.8e-05,3.5e-05,-5.6e-05,6.7e-05,-3.2e-05,1.4e-05,2e-06,6.3e-05,1.5e-05,-1e-05,3.3e-05,4e-06,-2.4e-05,2e-05,-2e-06,-1.3e-05,3e-06,6e-06,-3e-06,2e-06,-1e-06,5e-06,-6e-06,-3e-06,-1e-06,0,3e-06,0,6e-06,-6e-06,1e-06,1e-06,0,0,0,0,-3e-06,-1e-06,-1e-06,-3e-06,-2e-06,0,1e-06,-1e-06,-3e-06,-2e-06,-5e-06,3e-06,0,1e-06,2e-06,-3e-06,1e-06,-6e-06,3e-06,1e-06,-1e-06,1e-06,1e-06,7e-06,-1.3e-05,1.9e-05,3e-06,0,-2.8e-05,7e-06,1e-05,-5e-06,4.7e-05,-4.5e-05,-4e-06
0,0,-1e-06,-4e-06,-6e-06,0,-1e-06,-2e-06,-1e-06,-5e-06,-8e-06,1e-06,-6e-06,1e-06,-9e-06,1e-06,0,1e-06,-1.5e-05,-5.9e-05,-1.6e-05,-0.000196,-0.000121,-3.5e-05,-7.4e-05,0,4.6e-05,-3.4e-05,6e-06,-3.3e-05,4e-06,2.9e-05,-3.4e-05,-1.6e-05,-8e-06,2.2e-05,2e-06,2.2e-05,2.8e-05,-3.9e-05,5.5e-05,-1.9e-05,9e-06,0.000203,-0.000108,0.000255,3.6e-05,-0.00015,-3e-06,1.1e-05,-7e-06,-3.3e-05,-1.6e-05,-1.2e-05,-1.6e-05,1.4e-05,-2.1e-05,-1.6e-05,-1.6e-05,-3e-06,-2.3e-05,-1e-06,4e-06,-2.3e-05,1.2e-05,1.3e-05,6e-06,3e-06,7e-06,0,-1e-06,-4e-06,-4e-06,2e-06,0,1e-06,-8e-06,-2e-06,-3e-06,0,-4e-06,0,0,0,0,-1e-06,0,1e-06,3e-06,1e-06,1e-06,-3e-06,1e-06,-1e-06,2e-06,0,2e-06,-2e-06,-1e-06,1e-06,-3e-06,-1e-06,2e-06,0,-1e-06,0,1e-06,-1e-06,2e-06,-1e-06,-5e-06,-9e-06,3e-06,-1e-06,2.4e-05,5e-06,2e-06,-5e-06,4.5e-05,3.3e-05,-2e-06
0,0,0,7e-06,-2e-06,-1e-06,0,0,0,1.2e-05,-2e-06,1e-06,1e-06,-1e-05,-4e-06,1e-06,2e-06,-2e-06,4e-05,5.9e-05,3.8e-05,1.5e-05,4.2e-05,2.1e-05,6.3e-05,-4e-06,4.7e-05,8e-06,1.1e-05,-3.2e-05,-1.7e-05,-5.4e-05,-5.9e-05,3.4e-05,-2e-06,6.8e-05,1.3e-05,3.9e-05,-5.5e-05,-3.5e-05,4e-05,-1.9e-05,4.7e-05,-2e-05,7.3e-05,-0.000233,4.3e-05,9.1e-05,0.000126,-1.7e-05,-1e-06,-1.9e-05,3.7e-05,7e-06,3.8e-05,-7e-06,2e-05,-6.8e-05,1.6e-05,-2e-06,-3e-06,8e-06,1e-06,0,-7e-06,-8e-06,3e-06,-7e-06,6e-06,2e-06,5e-06,4e-06,4e-06,0,2e-06,0,6e-06,0,-1e-06,-2e-06,-2e-06,0,0,1e-06,0,0,-1e-06,-1e-06,-3e-06,-1e-06,-3e-06,1e-06,-3e-06,2e-06,2e-06,1e-06,3e-06,-1e-06,1e-06,0,2e-06,0,-3e-06,0,-1e-06,-1e-06,-1e-06,-1e-06,0,-1.2e-05,-3.1e-05,7e-06,6e-06,0,3e-06,0,-8e-06,-1.4e-05,-2.7e-05,-3.1e-05,4e-06
1e-06,0,0,-4e-06,-2e-06,0,1e-06,-4e-06,0,6e-06,2e-06,-5e-06,1e-06,-4e-06,-2e-06,-2e-06,0,5e-06,7.5e-05,6.1e-05,-1.1e-05,5.6e-05,3.8e-05,5.6e-05,-8.4e-05,7.2e-05,-2.2e-05,-7.6e-05,5e-06,-2.3e-05,1e-05,-5.2e-05,0.000126,3.9e-05,-3.6e-05,-3.5e-05,-9e-06,-2.7e-05,-4.4e-05,-7e-06,-6.4e-05,-1.8e-05,0.000116,-0.000107,2.3e-05,0.000194,-1.2e-05,-1.8e-05,-0.000134,1.6e-05,2e-05,-3e-05,5.2e-05,1.4e-05,7e-06,-1e-06,-2.8e-05,1e-05,-1.3e-05,4e-06,9e-06,5e-06,6e-06,2.7e-05,-3e-06,1.1e-05,-6e-06,9e-06,-3e-06,2e-06,-3e-06,-3e-06,0,-1e-06,1e-06,0,1e-06,1e-06,2e-06,7e-06,-2e-06,0,-3e-06,0,1e-06,0,0,0,1e-06,3e-06,0,1e-06,0,-2e-06,-2e-06,0,-1e-06,1e-06,-1e-06,1e-06,-1e-06,-1e-06,-2e-06,-5e-06,0,0,0,0,-1e-06,1.4e-05,9e-06,-4e-06,3e-06,0,6e-06,-1.5e-05,6e-06,-1.1e-05,-2.8e-05,1.1e-05,0
-1e-06,0,0,0,0,0,0,1e-06,0,-2e-06,2e-06,-4e-06,-3e-06,6e-06,-4e-06,3e-06,1e-06,1e-06,5.7e-05,-1.9e-05,-8e-06,-3.9e-05,1.2e-05,-5.1e-05,5.7e-05,-3.6e-05,-2.6e-05,6e-05,-1.7e-05,-3.3e-05,2.9e-05,-6.1e-05,-9.5e-05,-3.4e-05,5.5e-05,-6.9e-05,-3.1e-05,-0.000103,4.5e-05,1.2e-05,1.1e-05,7e-06,-5e-06,-8e-06,-6.5e-05,-0.000154,-7.7e-05,4.2e-05,-8e-05,-3e-06,9.5e-05,3.3e-05,1.9e-05,0,-8e-06,3e-06,3.4e-05,5.5e-05,8e-06,-5e-06,9e-06,-7e-06,-7e-06,-2.6e-05,6e-06,-4e-06,2e-06,0,3e-06,5e-06,-1e-06,2e-06,3e-06,2e-06,-3e-06,0,-7e-06,0,0,1e-06,-3e-06,0,1e-06,-1e-06,0,0,-1e-06,1e-06,1e-06,-2e-06,0,-1e-06,2e-06,1e-06,-3e-06,0,0,-2e-06,2e-06,0,-3e-06,-2e-06,-3e-06,3e-06,-1e-06,1e-06,0,0,0,-7e-06,1.8e-05,3e-06,3e-06,0,-2e-05,-5e-06,-3e-06,-5e-06,-1e-05,-3.9e-05,-2e-06
1e-06,0,0,0,3e-06,0,0,0,-1e-06,-6e-06,-5e-06,-4e-06,-7e-06,8e-06,1e-06,-3e-06,-1e-06,-3e-06,-2.2e-05,8e-06,-2.4e-05,-3.6e-05,-7.7e-05,-4.7e-05,-6.2e-05,-6.6e-05,-8e-06,-6.1e-05,-1.6e-05,2.6e-05,-5.4e-05,1.3e-05,-7e-06,-2.7e-05,2e-06,2e-05,-3.2e-05,4.2e-05,4.3e-05,2.8e-05,-2.2e-05,1.1e-05,-5.2e-05,-2.2e-05,0.000129,9.3e-05,1.2e-05,-8.9e-05,2.2e-05,-1.9e-05,5.9e-05,-2.5e-05,-3.2e-05,1.1e-05,-2e-05,-1.5e-05,-3.6e-05,-4e-06,-1.7e-05,8e-06,5e-06,2e-06,0,-4e-06,-2e-06,8e-06,1e-06,-2e-06,-1.2e-05,-7e-06,-2e-06,-1e-06,2e-06,0,-2e-06,1e-06,6e-06,2e-06,0,-3e-06,1e-06,0,0,-1e-06,1e-06,0,0,0,-4e-06,-1e-06,0,0,-2e-06,1e-06,1e-06,-1e-06,2e-06,6e-06,0,0,3e-06,-1e-06,1e-06,-5e-06,0,-1e-06,0,-1e-06,0,-1e-06,1.7e-05,-2e-06,3e-06,0,4e-06,-6e-06,-5e-06,-1e-05,-1.5e-05,2.4e-05,-1e-06
0,0,0,3e-06,5e-06,0,0,0,0,1e-06,-4e-06,-3e-06,-2e-06,4e-06,-1e-06,3e-06,0,-2e-06,2.2e-05,-1e-05,4e-06,1.2e-05,2.3e-05,9e-06,9.7e-05,3.8e-05,4.3e-05,-3e-05,1e-06,-5.5e-05,2.2e-05,2.1e-05,8.4e-05,9e-06,-3.5e-05,2.8e-05,-1.8e-05,9.6e-05,1e-05,1.3e-05,8e-05,1.4e-05,2.6e-05,2.9e-05,-7.2e-05,-2.5e-05,5.5e-05,0.000117,6.3e-05,2.4e-05,-5e-06,9e-06,-5.6e-05,5e-06,1.1e-05,0,4.6e-05,-5.1e-05,-1e-06,-2e-06,-1.2e-05,-1e-06,1e-05,2.8e-05,1e-06,-2e-06,-5e-06,0,4e-06,-6e-06,4e-06,1e-06,-2e-06,-1e-06,1e-06,-1e-06,0,-3e-06,-1e-06,-2e-06,0,0,0,-1e-06,-1e-06,0,-1e-06,0,2e-06,2e-06,0,0,-2e-06,-2e-06,3e-06,0,0,-4e-06,0,0,-1e-06,0,2e-06,2e-06,1e-06,0,0,0,1e-06,9e-06,9e-06,-8e-06,2e-06,0,1.2e-05,6e-06,9e-06,-9e-06,1.1e-05,-2.9e-05,-7e-06
-1e-06,0,0,-1e-06,0,-1e-06,1e-06,-1e-06,0,-6e-06,2e-06,3e-06,2e-06,1e-06,2e-06,-2e-06,-1e-06,-1e-06,-8e-06,9e-06,-1e-06,5.4e-05,5.9e-05,-2e-06,-9.1e-05,-1.8e-05,-1.6e-05,7.5e-05,1.5e-05,4.5e-05,-2.8e-05,4.3e-05,-5.2e-05,-1.1e-05,-9e-06,1.2e-05,1.1e-05,-4.8e-05,4e-06,-1e-05,-5.1e-05,-6e-06,-5.4e-05,-1.1e-05,-9e-06,-2.8e-05,1e-06,-8.9e-05,2.5e-05,5e-06,-1.3e-05,2.6e-05,-2.3e-05,2e-06,2e-06,1.9e-05,-4.7e-05,4e-06,-1.2e-05,-7e-06,5e-06,-2e-06,-8e-06,-2.1e-05,-1e-06,5e-06,3e-06,-4e-06,-3e-06,4e-06,-4e-06,1e-06,-1e-06,1e-06,-2e-06,0,-4e-06,1e-06,1e-06,1e-06,3e-06,0,1e-06,0,0,0,-1e-06,0,1e-06,0,-1e-06,1e-06,1e-06,2e-06,0,0,-3e-06,3e-06,0,0,-1e-06,-1e-06,1e-06,-1e-06,-1e-06,0,-1e-06,2e-06,0,-1.6e-05,-3.2e-05,1.7e-05,0,0,-5e-06,-1e-06,-1e-06,0,2.8e-05,2e-05,5e-06
0,0,0,-3e-06,-4e-06,0,0,0,0,6e-06,5e-06,6e-06,0,-2e-06,0,1e-06,0,0,-6.2e-05,5.1e-05,2.3e-05,2.8e-05,-2e-05,2.7e-05,6.4e-05,4.7e-05,-4.4e-05,-4.3e-05,7e-06,-2.4e-05,-5e-06,1.6e-05,8e-06,1e-05,4.9e-05,-4e-06,-1.7e-05,-0.000101,2.5e-05,-2.8e-05,-3.5e-05,-9e-06,-3.4e-05,-5.8e-05,8.2e-05,7.8e-05,-8e-06,4.8e-05,3.5e-05,-1.9e-05,4e-06,1.2e-05,2.9e-05,8e-06,0,-8e-06,5.2e-05,5.3e-05,1.8e-05,5e-06,-8e-06,-4e-06,1e-06,-9e-06,-1e-06,-3e-06,1e-06,9e-06,6e-06,1e-06,2e-06,-1e-06,-2e-06,-1e-06,5e-06,-1e-06,4e-06,0,-1e-06,5e-06,-1e-06,0,0,0,0,0,0,1e-06,-2e-06,0,0,0,-1e-06,-1e-06,-2e-06,0,1e-06,-2e-06,0,0,2e-06,-2e-06,-1e-06,-1e-06,-1e-06,0,0,0,0,2.4e-05,-1.3e-05,-1.5e-05,-1e-06,0,-5e-06,-3e-06,-4e-06,3e-06,-2.7e-05,-2.6e-05,-2e-06
0,0,0,3e-06,-3e-06,0,0,0,0,4e-06,0,4e-06,-4e-06,-7e-06,4e-06,0,-1e-06,-5e-06,-5.1e-05,5e-06,3.5e-05,-1.6e-05,-2.6e-05,6.4e-05,-6.7e-05,-2e-06,-1.2e-05,1.6e-05,-7e-06,4.4e-05,3e-06,-3e-06,-8e-06,1.1e-05,-2.4e-05,-8e-06,1.2e-05,0.000106,1.3e-05,-2.7e-05,1.6e-05,-7e-06,6e-05,8.6e-05,-8.4e-05,-0.000125,-1.1e-05,-5.5e-05,-9.4e-05,-2e-06,-1.2e-05,2e-06,5.1e-05,-1.5e-05,-1.2e-05,-1.7e-05,-5.2e-05,-3e-06,-5e-06,0,-4e-06,-3e-06,3e-06,3.1e-05,5e-06,3e-06,-1e-06,-5e-06,3e-06,4e-06,-2e-06,2e-06,-3e-06,-1e-06,-4e-06,0,0,-1e-06,2e-06,-4e-06,-1e-06,0,0,0,0,0,-1e-06,-1e-06,2e-06,-1e-06,0,0,-2e-06,0,0,1e-06,1e-06,-2e-06,1e-06,0,-1e-06,0,2e-06,0,1e-06,0,-1e-06,0,0,-2.7e-05,-3e-06,1.3e-05,-2e-06,0,-4e-06,-6e-06,4e-06,2e-06,1.4e-05,1.4e-05,2e-06
0,0,0,-2e-06,-3e-06,0,0,1e-06,0,2e-06,-5e-06,-2e-06,-5e-06,-6e-06,1e-06,-1e-06,0,-6e-06,-2.4e-05,-3.4e-05,6e-06,9e-06,2.5e-05,-7e-06,7.5e-05,-2.4e-05,1.1e-05,3.3e-05,-1e-05,-5.5e-05,-7e-06,4e-06,0,-1e-06,-1.2e-05,-5e-06,-1.9e-05,1.3e-05,-4.1e-05,-7e-06,2.5e-05,7e-06,-1e-05,5e-05,2.5e-05,0.000168,-1.6e-05,7.3e-05,-7.2e-05,1.1e-05,-3e-05,4.7e-05,2.2e-05,-4e-06,1e-05,1.4e-05,5.1e-05,-5e-05,1e-05,1e-06,0,5e-06,-4e-06,-1.8e-05,-4e-06,-5e-06,0,-2e-06,-2e-06,-2e-06,1e-06,-2e-06,1e-06,0,2e-06,0,-2e-06,-1e-06,-1e-06,-1e-06,-1e-06,0,-1e-06,-1e-06,1e-06,0,0,0,-1e-06,3e-06,-1e-06,0,1e-06,1e-06,2e-06,1e-06,0,1e-06,0,0,0,0,2e-06,-2e-06,0,0,0,1e-06,0,2.1e-05,2e-06,-1.7e-05,-2e-06,0,1.1e-05,-6e-06,-4e-06,4e-06,-2e-05,-1.9e-05,-7e-06
-1e-06,0,0,2e-06,4e-06,0,0,0,0,-7e-06,0,-2e-06,-1e-06,3e-06,4e-06,2e-06,0,-3e-06,4.5e-05,-4e-06,6e-06,6e-06,2.7e-05,-4.4e-05,-5.9e-05,-1e-05,-8e-06,-1e-06,3e-06,6.2e-05,2.3e-05,-3.6e-05,4.6e-05,-7e-06,1e-06,-4e-06,1.3e-05,-8e-06,-2.7e-05,1.3e-05,2.5e-05,1e-06,1.1e-05,-4.4e-05,2.4e-05,-2e-04,7e-06,-8.7e-05,0.000136,3e-06,-1.7e-05,3.1e-05,-2.3e-05,4e-06,1.1e-05,6e-06,-5.2e-05,0,-9e-06,-4e-06,1.1e-05,1e-06,3e-06,-1.4e-05,-3e-06,2e-06,-1e-06,7e-06,2e-06,-2e-06,0,2e-06,2e-06,0,-2e-06,0,1e-06,2e-06,0,-2e-06,-2e-06,0,0,0,-1e-06,0,-1e-06,-1e-06,-2e-06,-1e-06,0,0,0,-1e-06,0,0,0,0,0,0,1e-06,0,-1e-06,1e-06,-1e-06,0,0,-1e-06,0,-1e-05,9e-06,1.8e-05,-2e-06,0,-1e-06,2e-06,-2e-06,6e-06,6e-06,-1e-06,5e-06
