-0.000747,-0.000871,-0.000591,-0.000333,-0.000342,-0.000532,-0.000481,-0.000463,-0.000747,-0.00061,-0.000351,-0.000275,-0.000239,-0.000259,-0.000247,-0.000589,-0.000522,-0.000317,-0.000507,-0.000436,-0.000427,-0.000213,-0.000184,-0.000239,-0.000192,-0.000221,-0.000258,-0.000263
-0.000492,-0.000635,-0.000392,-0.000219,-0.000249,-0.000464,-0.000458,-0.000358,-0.000577,-0.000466,-0.000253,-0.000168,-0.000135,-0.000149,-0.000129,-0.000435,-0.000425,-0.000243,-0.000378,-0.000321,-0.000312,-0.000128,-0.000103,-0.000139,-0.000131,-0.000182,-0.000259,-0.000189
0.00029,0.000348,0.000167,6e-06,4.4e-05,9.9e-05,1e-06,7.7e-05,0.00026,0.000229,0.000103,5.6e-05,2.8e-05,2.5e-05,2.8e-05,0.000231,0.000177,6.9e-05,0.000212,0.000161,6.5e-05,2e-06,-2e-06,5.4e-05,4.2e-05,5e-05,3e-05,6.6e-05
0.000733,0.000843,0.000561,0.000266,0.000257,0.000501,0.000462,0.000423,0.000737,0.000592,0.000288,0.000236,0.00019,0.000168,0.00021,0.000586,0.000508,0.00029,0.000468,0.000378,0.000403,0.000193,0.000163,0.000215,0.000146,0.000193,0.000266,0.000216
6.2e-05,1e-04,0.000114,0.000179,0.000135,0.000236,0.000304,0.000177,0.000172,0.000108,5.8e-05,5.3e-05,6.2e-05,6.6e-05,4.6e-05,7.1e-05,0.000107,8.3e-05,3.8e-05,6.5e-05,0.000139,5.9e-05,2.5e-05,3e-05,4.5e-05,6.1e-05,0.00013,6.6e-05
-0.000681,-0.000743,-0.000469,-0.000144,-0.000135,-0.000308,-0.000213,-0.000295,-0.000629,-0.000518,-0.000224,-0.000182,-0.000145,-0.000118,-0.000185,-0.000521,-0.000401,-0.000218,-0.000408,-0.000307,-0.000279,-0.00015,-0.000141,-0.000192,-0.000107,-0.000132,-0.000144,-0.000157
-0.000326,-0.000389,-0.000257,-0.000193,-0.000164,-0.000359,-0.000345,-0.000269,-0.000464,-0.000324,-0.000114,-7.8e-05,-7.5e-05,-5.9e-05,-5.3e-05,-0.000275,-0.000257,-0.000142,-0.000197,-0.000199,-0.000198,-6.1e-05,-2.1e-05,-7.6e-05,-7.2e-05,-9.9e-05,-0.000176,-0.000116
0.000373,0.000444,0.000208,-5.2e-05,-1e-05,3.7e-05,-8.8e-05,6.4e-05,0.00031,0.000298,0.000128,5.2e-05,2.9e-05,4.2e-05,7e-05,0.000283,0.000196,8.3e-05,0.000254,0.000166,3.2e-05,1.1e-05,3e-05,6e-05,4.4e-05,4.2e-05,-2e-05,6.8e-05
0.000539,0.000541,0.000346,0.000116,8.4e-05,0.000287,0.000213,0.000252,0.000595,0.000424,0.000137,0.000101,7.9e-05,5e-05,1e-04,0.000388,0.00029,0.000154,0.000265,0.000242,0.000227,0.000103,7.1e-05,0.000111,6.9e-05,8.3e-05,0.000108,0.000122
-6.7e-05,-0.000156,-2.6e-05,0.000109,3.8e-05,0.000125,0.000216,7.8e-05,2.7e-05,-6e-05,-5.4e-05,2.2e-05,2.5e-05,-2.7e-05,-1e-05,-5e-05,-2.3e-05,9e-06,-0.000122,-5.9e-05,9.5e-05,5.7e-05,1.1e-05,1.2e-05,-1.5e-05,5e-06,9.2e-05,-1.5e-05
-0.000611,-0.000594,-0.000374,-4.3e-05,-4.7e-05,-0.000161,-6.3e-05,-0.000182,-0.000542,-0.000429,-0.000157,-0.000115,-9.3e-05,-9.1e-05,-0.000155,-0.000402,-0.000252,-0.00014,-0.000283,-0.000233,-0.000208,-0.000119,-0.000107,-0.000114,-6.9e-05,-6.2e-05,-1.8e-05,-0.000118
-0.00013,-5.4e-05,-2.7e-05,-3.1e-05,1.9e-05,-0.000131,-0.000135,-7.3e-05,-0.000236,-0.000112,2.3e-05,1e-06,1.2e-05,7.1e-05,4.1e-05,-7.9e-05,-4.9e-05,-2.5e-05,4.4e-05,5e-06,-6e-05,-8e-06,4.7e-05,1.8e-05,1.8e-05,-8e-06,-5e-05,5e-06
0.000434,0.000494,0.000254,-3.6e-05,4.4e-05,5e-05,-4.8e-05,8.2e-05,0.000316,0.000318,0.000137,6.2e-05,6.2e-05,0.000128,0.000125,0.000295,0.000168,7.6e-05,0.000264,0.000196,7.5e-05,4.6e-05,7.5e-05,6.9e-05,6.3e-05,4.3e-05,-3.6e-05,9.2e-05
0.000325,0.000254,0.000102,-3e-05,-3.4e-05,8.7e-05,1.9e-05,6.2e-05,0.000339,0.000209,-8e-06,-2.4e-05,-2.1e-05,-4.9e-05,-2.2e-05,0.000158,5.8e-05,1.7e-05,3.2e-05,5.8e-05,3.2e-05,-1.8e-05,-3.6e-05,-1.2e-05,-1e-06,9e-06,-2.1e-05,1.4e-05
-0.000142,-0.000296,-9.4e-05,5.5e-05,-5e-05,1.5e-05,8.8e-05,-7e-06,-3.8e-05,-0.000149,-0.000107,-1.4e-05,-1.4e-05,-0.00013,-6.2e-05,-0.000137,-9.5e-05,-1.9e-05,-0.000227,-0.000138,6.4e-05,2.9e-05,-3.1e-05,-1e-05,-3.9e-05,-2.3e-05,2.7e-05,-5e-05
-0.000486,-0.000428,-0.000217,1.1e-05,-2.2e-05,-7.3e-05,2e-05,-0.000104,-0.00037,-0.000273,-3.6e-05,-8e-06,-3e-05,-6.5e-05,-9e-05,-0.000222,-7e-05,-3.3e-05,-0.000131,-0.000137,-6.2e-05,-2.3e-05,-5e-05,-3.4e-05,-3.8e-05,-2.5e-05,3.9e-05,-6.6e-05
-6.4e-05,0.000118,5.2e-05,3.4e-05,8.3e-05,-8e-06,-2.1e-05,6e-06,-0.000137,1.3e-05,0.000115,5.7e-05,3.7e-05,0.00012,5.2e-05,3.7e-05,8.1e-05,3.1e-05,0.000191,7.5e-05,-7.3e-05,-8e-06,5.5e-05,2.2e-05,2.1e-05,1.4e-05,2.7e-05,1.9e-05
0.000434,0.00045,0.000231,2.8e-05,7.4e-05,5.9e-05,-3.7e-05,0.000119,0.000292,0.000292,0.000105,3.2e-05,5.6e-05,0.000153,0.000148,0.000225,9.3e-05,4.2e-05,0.000209,0.000171,3.3e-05,2.8e-05,8.1e-05,4.3e-05,6e-05,3.2e-05,-1.7e-05,9.4e-05
0.000218,5.7e-05,-3.1e-05,-8.5e-05,-5.4e-05,-7e-06,-6.7e-05,-8e-06,2e-04,8.4e-05,-0.00011,-0.000113,-6.8e-05,-6.1e-05,-3.8e-05,1.8e-05,-8.4e-05,-6.2e-05,-0.000121,-8e-06,3e-06,-3.8e-05,-6.6e-05,-6.2e-05,-3e-06,-8e-06,-6.3e-05,8e-06
