-0.000306,-0.000313,-0.000223,-0.000187,-0.000208,-0.00022,-0.000186,-0.000187,-0.000219,-0.000197,-0.000179,-0.000198,-0.000346,-0.000416,-0.000322,-0.000301,-0.00035,-0.000294,-0.000261,-0.000217,-0.000214,-0.000152,-0.000207,-0.000356,-0.000297,-0.000258,-0.000232,-0.000311
-0.000243,-0.000288,-0.000164,-0.000169,-0.000165,-0.000123,-0.000108,-0.000135,-0.000198,-6e-05,-6e-05,-9.4e-05,-0.000241,-0.000355,-0.000205,-0.000208,-0.000293,-0.000148,-0.000128,-0.000113,-0.000106,-8.3e-05,-0.000102,-0.000195,-0.000205,-0.000174,-0.000117,-0.000165
-5.6e-05,-5.7e-05,-8.7e-05,-0.000102,-0.000105,-6.8e-05,-4.1e-05,-5.9e-05,-0.000117,-9e-05,-5.1e-05,-4.5e-05,-4.3e-05,-0.000163,-0.000134,-0.000117,-0.000139,-9.2e-05,-0.000132,-9.5e-05,-0.000105,-0.000111,-8.6e-05,-8.4e-05,-7.3e-05,-4.7e-05,-1e-05,-4.6e-05
2e-04,0.00023,0.000144,8.9e-05,0.000164,0.000198,0.000121,9.5e-05,0.000136,8.2e-05,4.7e-05,0.000128,0.000295,0.000371,0.000267,0.000224,0.000241,0.000216,0.000229,0.000172,0.00019,9.5e-05,0.000162,0.000364,0.000236,0.000183,0.000159,0.000223
0.000234,0.000222,0.000158,0.000172,0.000187,0.000151,0.000129,0.000146,2e-04,0.000146,0.000108,0.000113,0.000236,0.000392,0.000252,0.000239,0.000332,0.000189,0.000181,0.000155,0.000145,0.000141,0.000143,0.000232,0.000216,0.000178,0.000124,0.000179
-4.2e-05,-4.8e-05,-5.7e-05,3.2e-05,-6.2e-05,-0.000157,-6.5e-05,0,1e-05,-3.6e-05,-2.4e-05,-0.000107,-0.000196,-0.000109,-0.000109,-9e-05,1e-05,-9.8e-05,-0.00013,-9.4e-05,-0.000118,-2.9e-05,-9.1e-05,-0.000252,-0.000108,-0.000111,-0.000121,-0.000128
-0.000175,-0.00015,-8.8e-05,-8.9e-05,-9.1e-05,-0.000113,-0.000119,-8.2e-05,-7e-05,-6.4e-05,-7.1e-05,-1e-04,-0.000245,-0.000281,-0.00015,-0.000122,-0.000198,-0.000114,-5.8e-05,-5.1e-05,-2.5e-05,-2.5e-05,-6.3e-05,-0.000192,-0.000176,-0.000163,-0.000125,-0.000124
-7.2e-05,-8.5e-05,-7.7e-05,-0.000118,-8.2e-05,-1.8e-05,-6.2e-05,-8.7e-05,-0.000103,-5.5e-05,-1.8e-05,3e-06,-2.1e-05,-0.000238,-0.000161,-8.3e-05,-0.000232,-0.000129,-0.000112,-7.5e-05,-7.3e-05,-6.9e-05,-7.8e-05,-0.000107,-0.000111,-3.5e-05,1e-06,-6.3e-05
6.9e-05,3.8e-05,2.4e-05,0,4e-06,9.5e-05,7.9e-05,-7e-06,-3.2e-05,5.5e-05,7.4e-05,0.000123,0.000197,0.00011,0.000109,3.7e-05,1e-06,0.000106,7.2e-05,1.7e-05,1.7e-05,-2e-05,4.8e-05,0.000213,0.000131,0.000116,0.000106,9.9e-05
6.5e-05,5.8e-05,9.4e-05,9e-05,0.000102,0.000108,0.000117,7.9e-05,5.4e-05,7.2e-05,5.6e-05,9.5e-05,0.000168,0.000311,0.000232,0.000104,0.000177,0.000159,0.000167,9.7e-05,0.000112,6.1e-05,0.00012,0.000289,0.000208,0.000132,6.2e-05,0.000133
-4.9e-05,-4e-05,-4e-06,3.9e-05,-2e-06,-0.000102,-3.9e-05,1.3e-05,7e-06,-7.2e-05,-7.4e-05,-0.000118,-0.000112,3e-05,-6.8e-05,-2.9e-05,8.7e-05,-0.000142,-0.00015,-8.6e-05,-0.000106,-2.3e-05,-0.000101,-0.000232,-8.8e-05,-7.4e-05,-0.000106,-0.000126
-1.9e-05,1.8e-05,4.2e-05,3.5e-05,-9e-06,-6.9e-05,-6.9e-05,-1.5e-05,5.3e-05,7e-06,-3.9e-05,-9e-05,-0.000145,-6.7e-05,-6.6e-05,1.7e-05,8.9e-05,-5e-06,-1.8e-05,6e-06,1.2e-05,3.3e-05,-3.6e-05,-0.000189,-0.000123,-0.000109,-4.2e-05,-3.8e-05
6.4e-05,8.4e-05,1.6e-05,-3.3e-05,-4e-06,1.7e-05,-3e-05,1.3e-05,5.4e-05,-8e-06,-7e-06,2e-05,-1.1e-05,-0.000125,-6.2e-05,1.1e-05,-6e-05,5.1e-05,5.9e-05,7.6e-05,6.5e-05,2.4e-05,5.6e-05,3.3e-05,-2.6e-05,1.3e-05,6.6e-05,7.6e-05
5.3e-05,1.5e-05,-0.000101,-1e-04,-3.3e-05,4.6e-05,9e-06,-1.3e-05,-3.4e-05,-5.3e-05,-1.9e-05,5.4e-05,9e-05,-0.000123,-4.7e-05,-7.8e-05,-0.000238,-5.5e-05,-4.2e-05,-1.8e-05,-6.2e-05,-6.5e-05,1.2e-05,9.4e-05,2.7e-05,4.5e-05,2.6e-05,-2.8e-05
-2.3e-05,-5.5e-05,-2.3e-05,1e-06,3.7e-05,0.000101,6.9e-05,-2.5e-05,-6.8e-05,7.4e-05,6.4e-05,8.2e-05,0.000122,0.000104,0.000112,-1.5e-05,-5.6e-05,5.9e-05,7.1e-05,1.4e-05,4.5e-05,-3e-06,4.3e-05,0.000203,0.000112,4.2e-05,4e-06,6e-06
-0.000125,-0.000106,2.2e-05,5.9e-05,9e-06,-6.6e-05,6e-06,-1.3e-05,-9.9e-05,-3e-06,4.1e-05,-3.3e-05,-4.7e-05,7.1e-05,0,3e-06,0.000121,-3.5e-05,-5.2e-05,-7.3e-05,-3.8e-05,-9e-06,-7.5e-05,-0.000113,-7e-06,-1.9e-05,-6.1e-05,-4e-05
-6.7e-05,-3.1e-05,3.8e-05,4.7e-05,-8e-06,-9.9e-05,-3.4e-05,2.3e-05,1.3e-05,-2.5e-05,-1.5e-05,-9.4e-05,-0.000127,2.4e-05,-2e-06,6.2e-05,0.000163,-3.2e-05,-3.7e-05,-3.6e-05,-2.7e-05,1.9e-05,-5.7e-05,-0.000185,-6.3e-05,-4.9e-05,-4.1e-05,-1e-06
0.000108,0.000103,4.4e-05,1.6e-05,8e-06,4e-05,-1.4e-05,4e-05,0.000144,4.9e-05,-6e-06,-1.3e-05,-3.6e-05,3e-05,2.8e-05,7.6e-05,7.7e-05,7.2e-05,7.9e-05,9.7e-05,9.7e-05,6.6e-05,6.7e-05,6.1e-05,-6e-06,6e-06,7.2e-05,0.000104
0.000127,8.6e-05,-6e-05,-5.4e-05,-4.3e-05,2.6e-05,-2.1e-05,-1e-05,6.3e-05,-4.4e-05,-4e-05,4.1e-05,3.3e-05,-0.000106,-7.6e-05,-6.1e-05,-0.000127,-2e-05,-4.3e-05,1.4e-05,-5.4e-05,-1.8e-05,1.9e-05,3.4e-05,-2.7e-05,1.7e-05,2.9e-05,-4.3e-05
