0.000146,0.000199,5.6e-05,0.000151,8.8e-05,2.1e-05,-5e-06,4.3e-05,1.1e-05,0.00014,3.9e-05,-4e-06,4.3e-05,7.1e-05,-4.7e-05,7.5e-05,2.4e-05,3.5e-05,7.7e-05,1.2e-05,1e-05,-3e-06,7.5e-05,0.000219,0.000101,0.000253,0.000224,0.00019,0.000207,0.000109,9.8e-05,-6.4e-05,2.9e-05,6.1e-05,0.000158,0.000236,6.9e-05,6.1e-05,0.00026,0.000161,0.000227,9.8e-05,7e-06,7.1e-05,8.6e-05,0.000296,0.000158,6.5e-05,1.6e-05,2.5e-05,0.00027,0.000159,0.000141,7.1e-05,0.000114,0.00012,0.000121,8.2e-05,2.1e-05,5.4e-05,-5.9e-05,-0.000101,3.7e-05,-3.3e-05,2e-05,-3.5e-05,0.000105,7.4e-05,5.5e-05,0.000198,0.000103,0.000103,-2.2e-05,3.6e-05,1e-05,0.00026,0.000209,0.000184,0.000122,7.9e-05,8e-06,0.000189,0.000178,8.6e-05,-4.5e-05,0.000243,0.000169,0.00014,8e-05,5e-05,0.00021,7.9e-05,9.9e-05,0.000109,0.000253,0.000101,-2.7e-05,6.5e-05,9.5e-05,5.9e-05,0.000156,0.000105,5.5e-05,9.6e-05,0.000265,0.00024,0.00025,3.7e-05,1.5e-05,4e-06,5.5e-05,8.3e-05,7.7e-05,5.6e-05,2.8e-05,1.3e-05,0.000178,0.000231,0.000126,8.5e-05,0.000185
-4.5e-05,-0.000122,-0.000163,-3.7e-05,0,-5.9e-05,-5.9e-05,4.1e-05,-1.4e-05,-0.000126,-0.000159,1e-05,1e-05,-0.000114,-2.4e-05,2.9e-05,6e-05,-3.6e-05,-0.000148,-0.00016,5.1e-05,-2.9e-05,-5.3e-05,6.5e-05,1e-06,-8.9e-05,-4.3e-05,6.3e-05,0.000106,-1.7e-05,-1e-06,3.3e-05,6.4e-05,0.000106,-0.000108,-4.1e-05,7.5e-05,-3.2e-05,-0.000147,-8.9e-05,3.9e-05,5.4e-05,2.8e-05,-7.5e-05,-1.4e-05,-3.9e-05,-0.000165,-0.00011,8.2e-05,7e-05,-4.8e-05,-0.000113,-4.9e-05,-5.7e-05,-7.4e-05,-5.5e-05,-7e-06,-4.3e-05,-7.6e-05,-0.00012,-1.4e-05,-8e-06,-5e-05,2.4e-05,3.6e-05,-2e-06,-7.9e-05,5.4e-05,2.5e-05,-2e-05,-0.000121,-0.000159,-9.3e-05,-4.5e-05,-4.6e-05,-4.1e-05,-0.000105,-0.000157,-0.000197,-0.000121,-0.00013,-0.000278,-3e-05,-0.000185,-8.4e-05,-9.7e-05,-0.000244,-0.000147,-7.4e-05,-8.5e-05,-2e-05,7e-06,-2.2e-05,5e-06,-0.000128,-0.000177,-3.1e-05,4.2e-05,-0.000112,-0.000175,-0.000175,-0.000101,4.2e-05,1e-05,-0.000202,-0.000175,-0.000209,-8.2e-05,4.2e-05,-5e-05,-3.7e-05,-6.7e-05,-0.000107,-0.000191,-0.000162,-0.000152,-3.9e-05,-2.3e-05,2e-06,-7.8e-05,-5e-06
-3.5e-05,-4.9e-05,-0.000101,-0.000178,-9.1e-05,-3e-06,-2.1e-05,-3.4e-05,-0.000142,-0.000171,-7e-05,-0.00013,5.9e-05,-1e-05,-5e-05,-7.1e-05,-5e-05,-6.4e-05,2e-06,2.1e-05,-2.3e-05,-2.7e-05,-5.8e-05,-4.5e-05,4.2e-05,-0.000162,-7.8e-05,-5.2e-05,-4.9e-05,-8.8e-05,-5.7e-05,-3.5e-05,-3.6e-05,-0.000105,-0.000186,-0.000224,-8.9e-05,-0.000101,-5.6e-05,-7e-06,1.1e-05,1.5e-05,-7e-06,-1.8e-05,-8.9e-05,-8e-05,-0.000151,-5.7e-05,-1.8e-05,-7.7e-05,-0.000104,-0.00017,-7.7e-05,-4.1e-05,-9.9e-05,6e-06,-0.000145,-8.2e-05,-7.2e-05,-0.000153,-0.000113,-5.2e-05,2.2e-05,-1.1e-05,1.2e-05,-3.2e-05,-7.4e-05,-9e-05,-8.7e-05,-0.000158,-0.000198,-0.000117,-4.2e-05,-3.9e-05,-3.4e-05,2.3e-05,6e-05,-4.5e-05,-2.6e-05,1.2e-05,2.9e-05,-0.000123,-0.000101,-0.000166,-7.8e-05,-8.7e-05,-0.000191,-9.2e-05,-6e-05,-6e-05,-0.00019,-0.000108,-0.000108,-9.8e-05,-0.000191,-0.000183,-0.000111,-6.6e-05,-0.000131,-5e-06,-0.000136,-8.5e-05,-9.3e-05,-0.000109,-0.000188,-0.000171,-0.000231,-0.000138,-2.9e-05,2.1e-05,-9.1e-05,-6.4e-05,-5.9e-05,-4.5e-05,5e-06,-5.5e-05,-0.000117,-9.9e-05,-0.000159,-0.000118,-0.000122
3.7e-05,-4.1e-05,8.1e-05,-8.1e-05,-4e-06,-3.4e-05,-1.6e-05,-1.8e-05,5.3e-05,2e-05,7.7e-05,-1.6e-05,1.2e-05,2.5e-05,1.5e-05,7.1e-05,-3.4e-05,1.6e-05,0.000164,0.000101,8.7e-05,4.7e-05,2.7e-05,6e-06,5.4e-05,1e-05,-1e-06,-3e-06,0.000109,4.2e-05,-2e-05,-1.4e-05,-1.8e-05,-5.3e-05,0.000109,-8.8e-05,1.5e-05,5e-06,4.3e-05,3.2e-05,2e-05,-1.5e-05,-6e-06,4.8e-05,1.4e-05,7.2e-05,5.4e-05,-6e-06,2e-05,7e-06,-2.8e-05,1.9e-05,3.1e-05,6.7e-05,-7.2e-05,-0.000105,-0.000178,-0.000122,3.9e-05,0,3.1e-05,1e-06,-8.2e-05,1.4e-05,-7.1e-05,1.8e-05,-2.2e-05,-2.6e-05,4.1e-05,-1.3e-05,6.5e-05,-3.9e-05,-4e-06,-3.3e-05,6.3e-05,8.4e-05,8.4e-05,3.1e-05,0.000117,2.4e-05,-5.4e-05,0.000118,2.1e-05,6.4e-05,1.5e-05,0.000104,0.000125,0.000175,1e-06,-5e-05,-5.2e-05,-4.7e-05,-4.5e-05,-2.7e-05,-0.000119,1.5e-05,-8e-06,-2.3e-05,-6e-05,-5e-06,-6.2e-05,-6.7e-05,-6.2e-05,-3e-06,5.3e-05,-7.8e-05,1e-06,-5.3e-05,-3.8e-05,-1.4e-05,1.8e-05,5.2e-05,-3.4e-05,6e-06,-6.3e-05,6.9e-05,-4.1e-05,4.2e-05,-0.00013,1.6e-05,-3.7e-05
-4.8e-05,-4e-05,4.9e-05,6.4e-05,8.8e-05,7.5e-05,8.1e-05,4.6e-05,4.2e-05,8.3e-05,0.000149,9.7e-05,2.2e-05,9e-05,1.7e-05,6e-05,-1.6e-05,3e-05,1e-05,3.2e-05,6.9e-05,4.1e-05,7e-06,4.5e-05,4.7e-05,2.5e-05,0.000152,4.6e-05,8.4e-05,0.000143,0.000141,6.6e-05,7.2e-05,-3e-05,9.6e-05,5.9e-05,5.6e-05,6.2e-05,4.5e-05,3.3e-05,9e-06,3e-05,7.2e-05,-9e-06,1.3e-05,3.6e-05,3.5e-05,4.8e-05,1e-06,1.5e-05,7.5e-05,0.000176,6.4e-05,-0.000118,-5.1e-05,6.7e-05,4e-05,1e-05,1.2e-05,7.9e-05,0,4.8e-05,-2.7e-05,5.4e-05,3.2e-05,4.9e-05,4.9e-05,-7e-06,-8e-06,-4.3e-05,0.00015,0.000146,0.000121,8.5e-05,-8e-06,8.1e-05,-1e-04,0.000103,3.1e-05,-1.7e-05,8.1e-05,9.2e-05,-1.1e-05,8.9e-05,9.6e-05,-1.7e-05,0.000111,0.000154,0.000108,6.4e-05,3.2e-05,7.4e-05,8.1e-05,0.000101,4.4e-05,0.000172,0.000108,3.8e-05,7.8e-05,6e-06,5.6e-05,0.000146,3.1e-05,2.9e-05,4.1e-05,0.000162,0.000194,0.000124,5.9e-05,1.9e-05,1.1e-05,3.3e-05,4.3e-05,9.4e-05,4.4e-05,4.1e-05,5.9e-05,0.000111,7.7e-05,4.7e-05,8.4e-05
-4.1e-05,-4.8e-05,-8.5e-05,-2.5e-05,4.1e-05,3.1e-05,4.3e-05,1.8e-05,1e-05,-2.9e-05,-5.9e-05,0,1.1e-05,-4.2e-05,4.3e-05,6.7e-05,4.1e-05,-4.9e-05,-6.1e-05,-9.2e-05,-7e-05,-2.7e-05,-6.3e-05,5.3e-05,9.1e-05,-4.5e-05,8.4e-05,1.4e-05,5.8e-05,-6.9e-05,1e-05,-2.2e-05,-4.8e-05,1.8e-05,-1.3e-05,8e-06,4e-05,-2.8e-05,-6.2e-05,5.6e-05,0,1.8e-05,2e-05,3e-05,-1.9e-05,2.9e-05,-3.1e-05,-1.8e-05,-3.4e-05,-8.1e-05,2.4e-05,4.2e-05,-4e-05,-5.9e-05,3.5e-05,0.000105,5.6e-05,8.7e-05,8e-06,1.5e-05,2.9e-05,-4.8e-05,1.2e-05,-3.1e-05,7e-06,4.6e-05,7e-06,6.4e-05,1.8e-05,-5.4e-05,-5.8e-05,3.7e-05,-3.6e-05,-5.5e-05,-5.2e-05,-6e-06,-9.8e-05,-2.1e-05,-6e-05,2e-05,-3.7e-05,1e-05,1.2e-05,-1e-06,-3.2e-05,4.7e-05,-6.1e-05,1.4e-05,-9e-06,1.9e-05,3.3e-05,0.000125,2.6e-05,5.9e-05,4e-05,-1.5e-05,-3.2e-05,-4.7e-05,3e-06,4.7e-05,-2.5e-05,3.7e-05,2.7e-05,-3.3e-05,2.3e-05,1e-04,8.2e-05,0.000109,-3e-06,-4.9e-05,-5.3e-05,4.3e-05,7.9e-05,3e-06,8.5e-05,-4.1e-05,-5.3e-05,2.6e-05,2.9e-05,3.9e-05,1.4e-05
4e-06,-8.1e-05,-5.4e-05,-5e-05,-4.3e-05,-5e-06,-5.2e-05,3.7e-05,1.1e-05,-3.5e-05,-5.1e-05,-4.8e-05,-4.4e-05,3.9e-05,3.8e-05,-1.6e-05,-1.8e-05,-1.5e-05,5.3e-05,-1.6e-05,-4.3e-05,4.9e-05,1.4e-05,1.2e-05,6.8e-05,-2.1e-05,-2.3e-05,-9e-05,3.2e-05,-5.2e-05,-6.7e-05,-1.3e-05,7e-06,-1.2e-05,2.8e-05,-2.8e-05,4e-06,1.7e-05,-1.4e-05,-1.3e-05,-7e-06,-1.3e-05,-1e-05,-2.5e-05,2e-05,6.8e-05,-2e-06,-0.00011,-3.5e-05,-1.3e-05,8e-06,5e-06,-1e-04,-1e-06,1e-06,4e-06,4.7e-05,4.2e-05,-2.9e-05,-5.6e-05,-4e-06,3.1e-05,5e-06,-2.7e-05,1.5e-05,-5.2e-05,-1.9e-05,4.7e-05,-5e-06,4.3e-05,-5e-05,-2.3e-05,-1e-05,-4e-06,-2.1e-05,-3.5e-05,-1e-05,3e-06,-4.2e-05,1.7e-05,-3.1e-05,-1.1e-05,3.9e-05,1.5e-05,-2.3e-05,1e-06,-3.8e-05,-0.000123,-9.4e-05,-2.6e-05,-4.7e-05,-4.1e-05,1e-05,-8e-06,1.2e-05,2e-06,3.7e-05,2.5e-05,9e-06,-2.4e-05,-5.7e-05,-6e-06,1.8e-05,-2.3e-05,-4.7e-05,-2.9e-05,-9e-06,-2.7e-05,3.3e-05,-1e-05,3.3e-05,-3.9e-05,-4.5e-05,-2.5e-05,-6.5e-05,-2.5e-05,-8.1e-05,-6.1e-05,5e-06,-4.9e-05,-3.6e-05
-4.8e-05,-2.5e-05,3e-06,-2.3e-05,-7.8e-05,-5.8e-05,-1.4e-05,-1.3e-05,-3.3e-05,-6.7e-05,-1.6e-05,4e-06,-1.9e-05,-6e-06,-6.9e-05,-8e-06,-1.7e-05,-4.6e-05,6e-06,5.1e-05,3.4e-05,1.1e-05,-2.6e-05,-6.3e-05,2e-06,-3.5e-05,-5e-05,-9.5e-05,-1.8e-05,-7.4e-05,-2.6e-05,1.8e-05,-8e-06,-2.3e-05,-7.5e-05,-6e-05,-7.2e-05,-4.8e-05,1e-06,-1.3e-05,-5.1e-05,-7.2e-05,-3.5e-05,8.9e-05,-2.3e-05,2.5e-05,-1.9e-05,8e-06,7e-06,-1.4e-05,-4.5e-05,-1.4e-05,-2.5e-05,-3e-06,-3.5e-05,-1e-05,-1.2e-05,-2.4e-05,-3.4e-05,5e-06,-5e-06,-4.2e-05,-4.3e-05,-2e-05,1.8e-05,1.3e-05,-2.2e-05,-2.5e-05,-5e-06,-8e-06,-6.7e-05,-7.7e-05,2.3e-05,5.7e-05,5e-06,9e-06,-1e-05,6.7e-05,-1.4e-05,-2.5e-05,8e-06,-1.7e-05,-7.6e-05,-5.3e-05,-1.9e-05,-2.4e-05,1.5e-05,-1e-05,-3.9e-05,-2.9e-05,-7.8e-05,-2.7e-05,-2e-05,-3.2e-05,-2.5e-05,-3.6e-05,-3.4e-05,-5e-05,4e-06,-4.3e-05,7.4e-05,-2.4e-05,-4.1e-05,-5.4e-05,-4.6e-05,-0.000143,-5.7e-05,-1.2e-05,-4.4e-05,-2.6e-05,-1.9e-05,-7.5e-05,-4.5e-05,-2.2e-05,-2.7e-05,4e-05,6e-06,-8.6e-05,-5e-05,-9.7e-05,-7.2e-05
-7e-06,5e-05,-2e-05,1.8e-05,-4.5e-05,-3.3e-05,-3.5e-05,-3.9e-05,-2.2e-05,3.3e-05,2.1e-05,1.3e-05,-4.8e-05,-1.4e-05,-2.4e-05,-2.2e-05,-4.6e-05,-3.8e-05,4.7e-05,-1e-05,-1.7e-05,2.6e-05,2.7e-05,-1.7e-05,-2.7e-05,-4.2e-05,4e-06,-3.2e-05,-5e-05,-4e-06,-2e-05,5e-06,-3e-06,1.5e-05,-3.3e-05,-1.7e-05,-3.3e-05,-3e-05,5.8e-05,1.9e-05,-7.4e-05,-5e-05,-4.4e-05,-4.9e-05,-4.7e-05,-3.7e-05,-8e-06,6.1e-05,3.5e-05,1e-06,-9e-06,-1e-05,5.2e-05,2e-06,6.4e-05,-1.2e-05,-2.1e-05,-5e-05,1e-06,6e-06,-5.6e-05,2e-06,-4.5e-05,-2.5e-05,-1.4e-05,-3.4e-05,-1.4e-05,-2.7e-05,-4.3e-05,-4.2e-05,-1.2e-05,2.9e-05,-7e-06,-5e-06,5e-05,1.2e-05,0,-3.3e-05,1.7e-05,3e-05,-1.5e-05,-8e-06,-3.1e-05,-5.5e-05,5.2e-05,-1.2e-05,-3e-05,2.6e-05,3.4e-05,-5.8e-05,1.9e-05,-4.4e-05,-2.8e-05,-2.1e-05,-2.9e-05,-3.4e-05,-8e-06,2.7e-05,-2e-06,4.1e-05,3.1e-05,-1e-05,-2.7e-05,-2.6e-05,-1.5e-05,-6e-06,-1.8e-05,-1.4e-05,1.8e-05,-1.3e-05,-9e-06,9e-06,-5e-06,-2.4e-05,-2.5e-05,-6e-06,2.8e-05,-4.2e-05,-1.6e-05,-1.7e-05,2.1e-05
-2.4e-05,3.1e-05,3e-05,1.8e-05,1.2e-05,2.6e-05,4e-06,-1e-05,2e-06,-1.2e-05,1.4e-05,3.1e-05,3.4e-05,8e-06,-5e-06,-1.8e-05,-6e-06,1.1e-05,-2e-06,-1.8e-05,-1.7e-05,-2.6e-05,-1.7e-05,2.6e-05,-2e-05,-1.9e-05,-1.2e-05,1.8e-05,-2e-06,-4e-05,3e-05,3.2e-05,8e-06,-2e-05,-1.8e-05,9e-06,-3.7e-05,-2.4e-05,1.7e-05,2e-06,-1e-06,1e-06,-1.5e-05,-1e-05,-1.7e-05,-5.4e-05,-4.5e-05,1.9e-05,8e-06,-2.1e-05,-1.4e-05,1.1e-05,3.8e-05,-2.1e-05,1.6e-05,-3.5e-05,9e-06,-1.2e-05,3.3e-05,3e-06,2e-05,2.5e-05,3.3e-05,5e-06,4.8e-05,1.3e-05,1.7e-05,-2.3e-05,-3.8e-05,-5e-05,-2.8e-05,3.6e-05,4.4e-05,-1.8e-05,-2.2e-05,-1.9e-05,-3.3e-05,-9.3e-05,-3.2e-05,3e-05,1.6e-05,-1.1e-05,-6e-06,-3.6e-05,-4.1e-05,2.6e-05,2e-06,2.9e-05,0,2.9e-05,-1.4e-05,9e-06,2.9e-05,1.4e-05,2.1e-05,2e-06,2e-06,4e-06,1.4e-05,-3.1e-05,-3e-05,3e-06,-2e-06,0,8e-06,1.5e-05,3.7e-05,-4e-06,-3.2e-05,1e-05,1e-06,2.2e-05,8e-06,2.4e-05,4e-05,4.3e-05,-1.2e-05,-3e-06,7e-06,-1e-05,-1.3e-05
2.2e-05,-2.3e-05,-1e-05,2e-05,6e-06,2e-05,-6e-06,3.9e-05,-4e-06,4e-06,-7e-06,-1.7e-05,2.8e-05,-1.9e-05,6e-06,8e-06,-1.4e-05,2e-05,4e-06,1.8e-05,-6e-06,-2.8e-05,-2e-06,-2.9e-05,-1.4e-05,6e-06,-2.7e-05,-6e-06,6e-06,1e-06,-2e-05,-1e-05,-2.8e-05,1.9e-05,2.3e-05,-6e-06,3.7e-05,2.4e-05,-1e-06,-2e-06,2.1e-05,1.3e-05,-1.5e-05,-1.6e-05,-3.4e-05,-1.3e-05,1e-05,-2.2e-05,-2.5e-05,-2e-06,-3.1e-05,-1.2e-05,-3e-05,0,-1.3e-05,-6e-06,1.1e-05,-1.9e-05,1.5e-05,-1.2e-05,-6e-06,3.3e-05,-1e-06,1e-05,2.3e-05,2.6e-05,-5e-06,1.9e-05,0,-1.8e-05,1e-05,-1.3e-05,-1.7e-05,-2.1e-05,-1.4e-05,-2.1e-05,-1.8e-05,-4e-06,-2.2e-05,4e-06,2.9e-05,-1.6e-05,5e-06,2.1e-05,9e-06,3e-05,1.5e-05,-5.3e-05,-1.4e-05,6e-06,-1.3e-05,-3.3e-05,5.5e-05,1.3e-05,3.5e-05,4e-06,9e-06,2.3e-05,-1.2e-05,-1.9e-05,-8e-06,-3e-05,1.4e-05,2.3e-05,-9e-06,-3.3e-05,1.9e-05,2.9e-05,-1.4e-05,-1e-05,-3e-05,-1.2e-05,-7e-06,1.9e-05,-7e-06,-1.2e-05,-2.1e-05,-5e-06,2.6e-05,2.5e-05,1.9e-05
1e-06,2.2e-05,3e-06,-1.7e-05,-4e-06,-3.3e-05,-1.9e-05,-2.6e-05,2.2e-05,-8e-06,0,8e-06,-5e-06,-1.4e-05,-2.8e-05,1.3e-05,1.7e-05,-1.1e-05,1.2e-05,-1.6e-05,-2e-06,1.4e-05,-3e-06,-1.3e-05,2e-05,0,-4e-06,-1.9e-05,-2.3e-05,-1.1e-05,2e-06,-1e-06,2.3e-05,-1e-05,2.1e-05,1.6e-05,-1e-06,7e-06,-1.2e-05,-1.2e-05,-3.6e-05,-7e-06,-1.4e-05,2e-06,0,3.9e-05,1e-06,-3e-06,2.5e-05,2.2e-05,-1.8e-05,-5e-06,-6.6e-05,2.3e-05,0,-7e-06,2.2e-05,-2e-06,-1e-06,-6e-06,1.1e-05,-7e-06,-9e-06,1e-06,-1.3e-05,-5e-06,-7e-06,-2.2e-05,5e-06,-1.3e-05,2.7e-05,-3e-05,-8e-06,1.9e-05,1.2e-05,3e-06,4e-06,4e-06,1.1e-05,-3.4e-05,-1.4e-05,-7e-06,1.1e-05,2.8e-05,-2e-06,-2.8e-05,-2e-05,-7e-06,-1.1e-05,-1.4e-05,6e-06,6e-06,8e-06,-3e-06,2e-06,-2e-06,1.2e-05,-1.7e-05,7e-06,-5e-06,2e-06,-2.1e-05,-1.1e-05,9e-06,-1.2e-05,-1.2e-05,-1.5e-05,-2e-06,-1.7e-05,1.9e-05,-2e-06,-1.2e-05,3e-06,-9e-06,-1.1e-05,-3.5e-05,2e-06,-2.5e-05,2e-06,1.4e-05,-3e-05
4e-06,2.8e-05,1.9e-05,8e-06,3e-06,-1.2e-05,-8e-06,0,-2e-06,-1e-05,-1e-06,-1.6e-05,-2.2e-05,-1.2e-05,-1.6e-05,-8e-06,-1e-05,-3e-06,-5e-06,2e-06,-1e-06,2e-06,-1.6e-05,-4e-06,-7e-06,-5e-06,4e-06,-2.7e-05,-3.2e-05,-1.3e-05,-1.7e-05,-1e-06,1e-06,-3e-06,1.7e-05,4e-06,1.2e-05,-3e-06,-1.7e-05,2e-06,5e-06,1e-06,-1.8e-05,7e-06,-7e-06,-2.7e-05,1e-06,-8e-06,1.4e-05,-6e-06,-5e-06,-1e-05,-6e-06,1.4e-05,1.4e-05,-7e-06,1.8e-05,7e-06,-2.4e-05,-1.2e-05,-1.1e-05,-2e-05,-1.7e-05,-1e-05,-6e-06,2e-06,1e-05,3e-06,-1e-06,1.6e-05,1e-06,-5e-06,0,2.2e-05,-1.8e-05,7e-06,1e-06,-1.4e-05,-2.4e-05,-1.2e-05,-2.5e-05,-6e-06,-3e-06,-2.4e-05,-4e-06,-2.8e-05,0,8e-06,4e-06,-2.6e-05,-2.9e-05,-1.5e-05,0,1e-05,-2e-06,0,2e-06,-3.4e-05,-1.6e-05,-1e-06,-8e-06,2.4e-05,1e-06,-1e-05,-2e-06,-4e-06,-2.4e-05,-6e-06,1.7e-05,-1.9e-05,-1.2e-05,2.4e-05,-1.8e-05,-2e-06,1e-06,1e-05,2.2e-05,1.7e-05,-2e-06,-1e-06,-1.9e-05
-4e-06,-7e-06,4e-06,-3e-06,1.7e-05,-7e-06,-1e-05,-5e-06,-6e-06,-3e-06,0,-3e-06,-6e-06,4e-06,1.2e-05,-1.8e-05,-5e-06,-1.3e-05,1.5e-05,-1e-06,-4e-06,-2e-05,-8e-06,1.7e-05,-2e-05,-6e-06,-8e-06,-2.4e-05,-1.5e-05,-1.5e-05,4e-06,0,-4e-06,1.4e-05,1e-05,-9e-06,-1.4e-05,-1.4e-05,-1e-05,2e-06,1.3e-05,1e-06,-1e-05,-9e-06,-1.1e-05,-7e-06,-9e-06,-1.1e-05,1e-05,-4e-06,-1e-06,-1e-06,-9e-06,-1.6e-05,1.1e-05,6e-06,-1e-06,-7e-06,-8e-06,0,0,0,7e-06,-1e-06,-5e-06,7e-06,-1.4e-05,-7e-06,-9e-06,0,-1.2e-05,-7e-06,1.5e-05,7e-06,2e-06,1.2e-05,-1e-06,8e-06,-1.2e-05,-5e-06,2.4e-05,0,6e-06,1e-06,9e-06,1.1e-05,1e-06,-2.5e-05,-5e-06,1.2e-05,-7e-06,-1e-06,-1.4e-05,-8e-06,-3e-06,7e-06,-2e-06,1e-05,3e-06,1.1e-05,2.9e-05,5e-06,4e-06,-8e-06,0,-7e-06,-4e-06,2e-06,2e-06,-1.4e-05,-1e-06,-1.1e-05,-1e-06,2e-06,1e-06,1.1e-05,-1.6e-05,2.1e-05,3e-06,5e-06,-1e-05
-4e-06,1.5e-05,-1e-05,-7e-06,-1e-06,1e-06,3e-06,4e-06,-2e-06,-2e-06,0,-6e-06,6e-06,9e-06,-2e-06,1.3e-05,0,3e-06,-9e-06,-6e-06,5e-06,0,-1.2e-05,-7e-06,6e-06,-8e-06,-1e-06,-1e-05,1e-05,7e-06,-1.1e-05,-2e-06,-1.7e-05,-9e-06,3e-06,0,1e-05,-9e-06,1e-06,3e-06,-3e-06,-4e-06,0,8e-06,2e-06,-9e-06,5e-06,8e-06,-1e-05,-1e-06,-3e-06,-5e-06,8e-06,-1.9e-05,-1.1e-05,1.8e-05,7e-06,9e-06,-4e-06,6e-06,1e-06,5e-06,2e-06,5e-06,-5e-06,9e-06,3e-06,6e-06,-3e-06,-2e-06,-6e-06,-1.3e-05,-3e-06,-3e-06,3e-06,-5e-06,-2e-06,7e-06,3e-06,4e-06,3e-06,8e-06,8e-06,1.4e-05,1.1e-05,1.5e-05,-1e-06,8e-06,5e-06,9e-06,-7e-06,1e-05,-7e-06,6e-06,4e-06,2e-06,-2e-06,1.3e-05,0,-2e-06,4e-06,-2e-06,8e-06,-9e-06,8e-06,2e-06,-1.4e-05,1e-06,4e-06,-2e-06,-2e-06,-8e-06,4e-06,-9e-06,-2e-06,-2e-06,9e-06,-6e-06,-2e-06,-7e-06,8e-06
1e-06,1.2e-05,4e-06,-2e-06,-6e-06,1.1e-05,-2e-06,0,7e-06,6e-06,0,6e-06,-4e-06,6e-06,-7e-06,-2e-06,0,3e-06,-1.4e-05,-1e-06,-6e-06,0,-1e-06,-6e-06,1e-05,-3e-06,6e-06,-7e-06,6e-06,-1.3e-05,0,-1e-06,-1.2e-05,3e-06,-4e-06,-5e-06,7e-06,3e-06,-1e-06,1e-06,-5e-06,-2e-06,3e-06,-1.1e-05,-9e-06,-4e-06,-2e-06,1.2e-05,-1.3e-05,-8e-06,0,-4e-06,1.3e-05,6e-06,-3e-06,3e-06,2e-06,3e-06,2e-06,1e-06,5e-06,1e-06,1e-06,-7e-06,-6e-06,-1.2e-05,2e-06,3e-06,-2e-06,5e-06,-8e-06,-1e-06,-3e-06,-1e-05,4e-06,0,-4e-06,2e-06,1e-06,-7e-06,-1.5e-05,4e-06,-5e-06,6e-06,8e-06,-2e-06,-3e-06,1.3e-05,2e-06,1e-06,0,-4e-06,-6e-06,8e-06,4e-06,5e-06,-5e-06,7e-06,2e-06,8e-06,-1.3e-05,1e-05,-4e-06,2e-06,2e-06,-7e-06,-1.1e-05,-5e-06,-1.7e-05,1e-05,-2e-06,-2e-06,0,-2e-06,-3e-06,6e-06,0,-6e-06,1e-06,-7e-06,5e-06
-1e-06,7e-06,-3e-06,4e-06,-7e-06,4e-06,-2e-06,-1e-06,-5e-06,1e-06,2e-06,-4e-06,-4e-06,1e-06,-6e-06,-6e-06,-9e-06,3e-06,-7e-06,1e-06,-2e-06,4e-06,-2e-06,1e-06,6e-06,-2e-06,3e-06,4e-06,3e-06,-1e-06,1e-06,-3e-06,-2e-06,-3e-06,-6e-06,-2e-06,-1.6e-05,-1e-06,-6e-06,0,-4e-06,0,2e-06,8e-06,-6e-06,0,-1e-06,-3e-06,-9e-06,5e-06,4e-06,2e-06,-1e-06,1.6e-05,8e-06,2e-06,-4e-06,-2e-06,9e-06,1e-06,-6e-06,1e-06,-6e-06,1e-06,-1e-06,-3e-06,-5e-06,-2e-06,-1e-06,-9e-06,-9e-06,1.4e-05,6e-06,0,1e-06,1e-06,-3e-06,1.2e-05,3e-06,-5e-06,-5e-06,1e-06,0,-4e-06,-4e-06,-2e-06,5e-06,3e-06,1e-06,-2e-06,2e-06,2e-06,-3e-06,3e-06,-2e-06,-1e-06,-4e-06,-6e-06,-2e-06,1e-06,3e-06,6e-06,-3e-06,-2e-06,5e-06,9e-06,-1e-06,-1e-06,1e-06,6e-06,-1e-06,1e-06,-5e-06,-3e-06,6e-06,-5e-06,-9e-06,-1e-06,-5e-06,-5e-06,8e-06
-1e-06,-4e-06,0,-4e-06,0,1e-06,0,-5e-06,0,2e-06,-3e-06,-1e-06,6e-06,2e-06,0,3e-06,0,-2e-06,-6e-06,-1e-06,3e-06,7e-06,-2e-06,5e-06,-6e-06,-4e-06,-3e-06,2e-06,2e-06,-2e-06,0,-3e-06,2e-06,2e-06,-5e-06,0,-1e-06,-4e-06,-5e-06,1e-06,-3e-06,2e-06,0,-2e-06,-1e-06,2e-06,-1e-06,-1e-05,2e-06,1e-06,0,0,-9e-06,7e-06,-4e-06,4e-06,-1e-06,3e-06,3e-06,0,-2e-06,3e-06,0,0,-4e-06,-2e-06,3e-06,0,-3e-06,5e-06,4e-06,6e-06,-3e-06,5e-06,-7e-06,-5e-06,0,8e-06,-1e-06,0,6e-06,1e-06,-2e-06,-4e-06,1e-06,-3e-06,-7e-06,-1e-06,-4e-06,2e-06,-1e-05,1e-06,-8e-06,-4e-06,2e-06,-1e-06,-3e-06,-3e-06,0,-2e-06,2e-06,-6e-06,3e-06,3e-06,-3e-06,-2e-06,2e-06,2e-06,-1e-06,0,0,1e-06,3e-06,0,-1e-06,-8e-06,-2e-06,-4e-06,0,-3e-06,4e-06
3e-06,5e-06,3e-06,-2e-06,-2e-06,7e-06,-1e-06,5e-06,1e-06,0,2e-06,1e-06,6e-06,-1e-06,3e-06,0,0,4e-06,1e-06,-1e-06,-2e-06,2e-06,-2e-06,-6e-06,0,-1e-06,0,-3e-06,1e-06,-1e-06,-1e-06,0,0,1e-06,-4e-06,-2e-06,2e-06,2e-06,-3e-06,-2e-06,5e-06,2e-06,-1e-06,2e-06,-7e-06,-8e-06,-1e-06,1e-06,7e-06,-3e-06,-1e-06,3e-06,-1.4e-05,-1e-06,-3e-06,0,-2e-06,-2e-06,2e-06,0,4e-06,-1e-06,0,1e-06,2e-06,-1e-06,0,2e-06,-3e-06,-7e-06,2e-06,0,-1e-06,3e-06,-1e-06,2e-06,0,-8e-06,-2e-06,-2e-06,-3e-06,-1e-06,-1e-06,-3e-06,2e-06,0,3e-06,0,0,2e-06,3e-06,0,5e-06,5e-06,2e-06,-1e-06,0,3e-06,0,0,-2e-06,-2e-06,2e-06,2e-06,0,-2e-06,2e-06,-2e-06,0,-2e-06,-4e-06,-3e-06,2e-06,0,1e-06,4e-06,9e-06,-5e-06,1e-06,7e-06,2e-06
-4e-06,6e-06,3e-06,1e-06,-1e-06,-5e-06,-3e-06,2e-06,0,-2e-06,-2e-06,0,-2e-06,-2e-06,-9e-06,0,0,-2e-06,4e-06,2e-06,-1e-06,0,-3e-06,-5e-06,1e-06,0,2e-06,-7e-06,2e-06,-6e-06,0,1e-06,1e-06,-3e-06,4e-06,2e-06,1e-06,1e-06,-1e-06,0,-2e-06,-1e-06,-4e-06,-3e-06,-2e-06,5e-06,-1e-06,-3e-06,3e-06,0,0,0,0,-6e-06,1e-06,-4e-06,-2e-06,-1e-06,-4e-06,-1e-06,-2e-06,0,-3e-06,2e-06,-3e-06,2e-06,-1e-06,1e-06,-1e-06,0,1e-06,3e-06,1e-06,-2e-06,-2e-06,-1e-06,-1e-06,-6e-06,-5e-06,-1e-06,2e-06,-3e-06,3e-06,-2e-06,-6e-06,-2e-06,0,-3e-06,-2e-06,-3e-06,-2e-06,-6e-06,1e-06,0,1e-06,-2e-06,0,-4e-06,0,-1e-06,2e-06,-1e-06,-3e-06,1e-06,-2e-06,-2e-06,4e-06,0,-5e-06,-3e-06,2e-06,4e-06,-3e-06,1e-06,-4e-06,0,-3e-06,-1e-06,0,1e-06,-5e-06
4e-06,0,-2e-06,-2e-06,4e-06,-5e-06,-3e-06,-5e-06,1e-06,-1e-06,1e-06,-2e-06,-6e-06,0,-5e-06,0,-2e-06,-2e-06,-2e-06,-2e-06,2e-06,1e-06,-1e-06,5e-06,1e-06,-3e-06,-3e-06,-7e-06,-5e-06,1e-06,0,0,0,1e-06,4e-06,-1e-06,2e-06,0,1e-06,-1e-06,-6e-06,0,-6e-06,-1e-06,-3e-06,1e-06,0,-2e-06,-4e-06,-1e-06,-1e-06,3e-06,5e-06,0,1e-06,-3e-06,-1e-06,-2e-06,-4e-06,0,0,-7e-06,-3e-06,-1e-06,-4e-06,1e-06,1e-06,-1e-06,0,-5e-06,4e-06,3e-06,0,-2e-06,1e-06,0,-2e-06,0,-5e-06,2e-06,1e-06,-2e-06,-2e-06,0,2e-06,-1e-06,-2e-06,-7e-06,-1e-06,-3e-06,-7e-06,-2e-06,-4e-06,-5e-06,-1e-06,-2e-06,3e-06,1e-06,0,0,2e-06,-3e-06,-1e-06,-3e-06,-1e-06,0,2e-06,1e-06,4e-06,-2e-06,-3e-06,1e-06,-2e-06,-1e-06,3e-06,0,-2e-06,4e-06,-1e-06,3e-06,0
-3e-06,1e-06,4e-06,-2e-06,5e-06,0,-2e-06,-1e-06,0,0,-2e-06,0,-2e-06,-2e-06,1e-06,3e-06,0,-1e-06,2e-06,0,0,0,0,1e-06,-5e-06,-1e-06,-2e-06,-4e-06,-4e-06,-5e-06,-3e-06,1e-06,-3e-06,1e-06,2e-06,-2e-06,-1e-06,-2e-06,1e-06,0,5e-06,0,-5e-06,2e-06,-4e-06,3e-06,0,4e-06,-5e-06,0,-1e-06,-1e-06,5e-06,6e-06,-3e-06,-1e-06,-2e-06,-1e-06,-1e-06,0,1e-06,2e-06,-1e-06,-1e-06,3e-06,2e-06,-1e-06,-3e-06,0,2e-06,-2e-06,-3e-06,-1e-06,0,4e-06,0,-1e-06,-8e-06,0,4e-06,-1e-06,-1e-06,1e-06,-1e-06,0,1e-06,1e-06,1e-06,0,0,1e-06,0,-2e-06,1e-06,0,1e-06,1e-06,2e-06,0,-2e-06,-3e-06,-3e-06,2e-06,-2e-06,0,-3e-06,3e-06,-1e-06,-2e-06,-1e-06,0,-1e-06,0,0,-2e-06,5e-06,3e-06,3e-06,0,1e-06,0
1e-06,3e-06,-4e-06,0,0,0,-1e-06,3e-06,0,0,1e-06,2e-06,2e-06,-1e-06,0,-2e-06,0,0,-1e-06,1e-06,-2e-06,0,-1e-06,-1e-06,-2e-06,-1e-06,1e-06,-3e-06,1e-06,-2e-06,1e-06,0,3e-06,-1e-06,3e-06,1e-06,3e-06,-2e-06,1e-06,0,2e-06,-1e-06,-2e-06,-3e-06,0,-3e-06,0,4e-06,0,0,-1e-06,1e-06,0,3e-06,-3e-06,-1e-06,-1e-06,-1e-06,1e-06,-1e-06,-1e-06,0,2e-06,1e-06,2e-06,-1e-06,0,2e-06,-1e-06,-3e-06,-4e-06,-3e-06,0,2e-06,-2e-06,0,0,-2e-06,-2e-06,2e-06,0,-1e-06,1e-06,2e-06,-1e-06,1e-06,0,2e-06,2e-06,2e-06,-3e-06,-1e-06,1e-06,0,0,1e-06,1e-06,1e-06,1e-06,1e-06,-2e-06,1e-06,1e-06,-2e-06,-1e-06,-1e-06,1e-06,0,1e-06,1e-06,-1e-06,-2e-06,0,0,-1e-06,-3e-06,0,-1e-06,0,-3e-06,-1e-06
-1e-06,0,1e-06,0,-2e-06,1e-06,-1e-06,-1e-06,0,1e-06,0,-2e-06,2e-06,-1e-06,-3e-06,-2e-06,-1e-06,0,2e-06,-1e-06,2e-06,-2e-06,0,-2e-06,-1e-06,-2e-06,1e-06,0,-1e-06,-2e-06,-1e-06,0,-1e-06,-1e-06,-1e-06,-1e-06,-1e-06,-2e-06,0,0,-5e-06,-1e-06,-1e-06,4e-06,-3e-06,1e-06,-1e-06,-4e-06,1e-06,-1e-06,0,-2e-06,-4e-06,-2e-06,2e-06,0,-1e-06,2e-06,3e-06,0,0,3e-06,-2e-06,-1e-06,0,1e-06,0,0,-1e-06,1e-06,-4e-06,0,-1e-06,1e-06,-1e-06,1e-06,0,3e-06,-1e-06,-1e-06,1e-06,0,-1e-06,4e-06,1e-06,0,-2e-06,3e-06,-1e-06,0,-2e-06,-2e-06,-1e-06,0,0,1e-06,0,1e-06,-1e-06,0,4e-06,2e-06,-1e-06,0,1e-06,0,-1e-06,1e-06,-1e-06,1e-06,-1e-06,1e-06,-2e-06,-1e-06,-1e-06,-2e-06,-3e-06,1e-06,0,-2e-06,0
0,-2e-06,0,0,-1e-06,0,0,1e-06,0,-1e-06,-1e-06,1e-06,0,0,-4e-06,3e-06,-1e-06,1e-06,1e-06,0,0,-4e-06,-2e-06,3e-06,2e-06,0,-1e-06,0,0,0,0,1e-06,-1e-06,1e-06,-3e-06,-1e-06,-1e-06,0,0,0,1e-06,1e-06,1e-06,-3e-06,-2e-06,-2e-06,0,-3e-06,2e-06,1e-06,0,-1e-06,-5e-06,-2e-06,0,1e-06,-2e-06,-2e-06,2e-06,0,2e-06,-2e-06,-2e-06,-1e-06,0,-3e-06,0,0,0,-1e-06,-1e-06,0,-1e-06,-1e-06,-2e-06,-1e-06,0,-1e-06,0,0,-2e-06,1e-06,1e-06,2e-06,0,-2e-06,1e-06,0,0,-1e-06,-2e-06,2e-06,2e-06,-1e-06,0,2e-06,-1e-06,-3e-06,0,0,-2e-06,1e-06,0,0,0,0,-1e-06,0,2e-06,0,-1e-06,1e-06,0,0,1e-06,2e-06,1e-06,0,-1e-06,-3e-06,1e-06
1e-06,1e-06,0,0,-2e-06,0,0,-1e-06,0,1e-06,1e-06,0,1e-06,0,2e-06,-1e-06,-1e-06,-1e-06,1e-06,0,-2e-06,-1e-06,-1e-06,0,2e-06,-1e-06,0,-1e-06,1e-06,-4e-06,-1e-06,1e-06,1e-06,0,-2e-06,1e-06,-2e-06,-1e-06,0,0,0,1e-06,1e-06,2e-06,-1e-06,1e-06,0,1e-06,0,-1e-06,0,-1e-06,-4e-06,1e-06,-2e-06,2e-06,-1e-06,1e-06,0,0,-3e-06,1e-06,-1e-06,2e-06,2e-06,-1e-06,0,-1e-06,0,-2e-06,-1e-06,-3e-06,1e-06,-2e-06,-1e-06,1e-06,0,2e-06,-2e-06,0,1e-06,1e-06,-1e-06,0,1e-06,0,1e-06,1e-06,0,1e-06,-2e-06,2e-06,1e-06,2e-06,0,0,0,-1e-06,0,1e-06,-1e-06,0,1e-06,1e-06,0,-1e-06,0,-1e-06,-1e-06,0,0,-2e-06,0,0,0,-1e-06,2e-06,-2e-06,1e-06,0,0
-1e-06,1e-06,0,-1e-06,-2e-06,2e-06,0,0,0,-1e-06,-1e-06,0,1e-06,2e-06,1e-06,-1e-06,0,0,0,-1e-06,1e-06,-1e-06,-1e-06,-1e-06,0,-1e-06,1e-06,-3e-06,0,1e-06,1e-06,0,0,-1e-06,-2e-06,-1e-06,-2e-06,0,0,0,0,1e-06,1e-06,-1e-06,-3e-06,0,0,0,-2e-06,0,0,-1e-06,3e-06,3e-06,0,1e-06,-1e-06,1e-06,-2e-06,0,1e-06,-2e-06,1e-06,0,1e-06,1e-06,0,1e-06,0,1e-06,1e-06,-1e-06,-1e-06,0,2e-06,-1e-06,-1e-06,6e-06,-1e-06,0,2e-06,1e-06,0,-1e-06,-2e-06,0,-2e-06,-1e-06,0,1e-06,-1e-06,0,1e-06,-1e-06,0,0,0,2e-06,0,-1e-06,2e-06,2e-06,1e-06,0,0,0,-2e-06,1e-06,-1e-06,-2e-06,-1e-06,1e-06,0,0,-1e-06,1e-06,-2e-06,-2e-06,0,1e-06,-1e-06
0,-1e-06,2e-06,0,0,-1e-06,-1e-06,2e-06,0,1e-06,0,-2e-06,-1e-06,0,-3e-06,2e-06,-1e-06,0,0,0,0,0,-1e-06,-2e-06,1e-06,0,0,-3e-06,1e-06,-2e-06,-1e-06,1e-06,1e-06,0,0,0,2e-06,0,0,0,1e-06,-1e-06,0,1e-06,-1e-06,-1e-06,0,0,-1e-06,1e-06,0,0,4e-06,1e-06,1e-06,1e-06,-1e-06,-1e-06,-1e-06,0,1e-06,1e-06,-1e-06,0,0,-1e-06,0,1e-06,-1e-06,-2e-06,2e-06,1e-06,0,1e-06,0,0,0,1e-06,-1e-06,-1e-06,-1e-06,1e-06,1e-06,-1e-06,1e-06,0,1e-06,-2e-06,-1e-06,0,-3e-06,0,2e-06,0,0,0,0,0,0,2e-06,-2e-06,0,-1e-06,0,0,1e-06,-1e-06,0,-1e-06,-1e-06,0,0,-1e-06,0,1e-06,2e-06,-1e-06,0,0,1e-06,1e-06
0,-1e-06,-1e-06,0,2e-06,0,-1e-06,0,0,0,0,2e-06,-3e-06,1e-06,-3e-06,0,0,-1e-06,0,0,-1e-06,1e-06,-1e-06,3e-06,1e-06,-1e-06,-1e-06,-1e-06,1e-06,-2e-06,0,0,0,0,1e-06,0,0,0,0,0,-2e-06,0,-1e-06,0,-2e-06,-1e-06,0,2e-06,2e-06,-1e-06,0,0,1e-06,-2e-06,0,0,0,1e-06,-1e-06,0,-2e-06,-2e-06,-2e-06,0,0,1e-06,0,-1e-06,0,-1e-06,0,1e-06,1e-06,1e-06,1e-06,0,0,-1e-06,-1e-06,-1e-06,-1e-06,0,-1e-06,-2e-06,-1e-06,0,0,0,0,-1e-06,0,1e-06,0,0,0,-1e-06,1e-06,0,0,-1e-06,0,-2e-06,-1e-06,-1e-06,0,0,-1e-06,0,1e-06,0,-1e-06,0,0,0,-1e-06,-2e-06,2e-06,0,0,2e-06,0
-1e-06,0,1e-06,0,2e-06,1e-06,-1e-06,-2e-06,0,0,0,-1e-06,-1e-06,0,-1e-06,-2e-06,0,0,0,0,0,1e-06,-1e-06,0,1e-06,-1e-06,0,-1e-06,-1e-06,-1e-06,0,0,-1e-06,2e-06,2e-06,-1e-06,0,-1e-06,0,0,-1e-06,0,-1e-06,0,-2e-06,1e-06,0,1e-06,2e-06,0,0,1e-06,-3e-06,-2e-06,-1e-06,0,0,-2e-06,1e-06,0,2e-06,1e-06,-1e-06,0,0,2e-06,0,0,0,-1e-06,-1e-06,0,0,0,-1e-06,0,0,1e-06,-1e-06,-1e-06,1e-06,0,1e-06,-1e-06,-2e-06,0,-1e-06,0,0,0,-1e-06,-1e-06,-2e-06,0,0,-1e-06,0,-1e-06,0,0,1e-06,-1e-06,1e-06,0,0,-1e-06,-1e-06,0,-1e-06,1e-06,0,-1e-06,0,0,1e-06,0,0,1e-06,0,-1e-06,1e-06
2e-06,0,0,0,1e-06,0,-1e-06,1e-06,0,0,0,0,2e-06,-1e-06,1e-06,1e-06,0,0,-1e-06,0,1e-06,1e-06,0,-2e-06,-2e-06,0,0,0,0,0,0,0,0,-1e-06,1e-06,0,0,0,0,0,3e-06,0,-2e-06,1e-06,-1e-06,0,0,-3e-06,0,0,0,0,-4e-06,1e-06,0,-1e-06,0,1e-06,1e-06,0,0,1e-06,1e-06,0,1e-06,0,0,0,0,-1e-06,-2e-06,1e-06,0,-1e-06,-2e-06,0,0,-2e-06,-1e-06,-1e-06,0,-1e-06,0,0,0,0,1e-06,0,0,0,-2e-06,-2e-06,1e-06,0,0,0,0,1e-06,0,0,0,0,0,0,0,0,0,0,0,0,0,0,0,0,-2e-06,1e-06,-1e-06,1e-06,0,-1e-06,0
-2e-06,-1e-06,-1e-06,0,0,0,-1e-06,1e-06,0,0,0,-1e-06,2e-06,0,-2e-06,1e-06,0,0,0,0,-1e-06,2e-06,-1e-06,0,-1e-06,-1e-06,-1e-06,0,0,-3e-06,0,0,0,-1e-06,0,0,1e-06,-1e-06,0,0,-1e-06,-1e-06,-2e-06,-1e-06,-2e-06,0,0,0,-2e-06,0,0,1e-06,-1e-06,2e-06,1e-06,0,1e-06,-1e-06,1e-06,0,-2e-06,1e-06,-1e-06,0,-1e-06,-1e-06,0,1e-06,0,-1e-06,-2e-06,2e-06,0,0,1e-06,0,0,-4e-06,-1e-06,-1e-06,-1e-06,-1e-06,0,1e-06,-1e-06,0,0,0,0,0,-1e-06,0,0,-1e-06,0,0,0,0,0,-1e-06,-1e-06,-1e-06,-1e-06,0,0,0,0,0,0,0,-1e-06,0,-1e-06,0,1e-06,-1e-06,1e-06,1e-06,0,-1e-06,1e-06
2e-06,0,1e-06,-1e-06,0,-1e-06,-1e-06,-1e-06,0,0,0,1e-06,0,0,-3e-06,-1e-06,0,0,-1e-06,0,0,0,-1e-06,1e-06,-2e-06,-1e-06,0,0,-1e-06,0,0,0,0,2e-06,0,0,0,0,0,0,-2e-06,0,-1e-06,2e-06,-2e-06,0,0,2e-06,-1e-06,0,0,0,1e-06,0,-1e-06,-1e-06,0,0,0,0,2e-06,-1e-06,-1e-06,0,-1e-06,0,0,0,0,0,-2e-06,0,0,0,0,0,0,0,-1e-06,0,1e-06,0,1e-06,2e-06,0,0,-1e-06,0,0,-1e-06,-1e-06,0,-1e-06,1e-06,0,0,-1e-06,0,0,1e-06,1e-06,0,0,0,0,0,0,0,0,-1e-06,0,-1e-06,0,0,-1e-06,1e-06,1e-06,0,0,-1e-06,-1e-06
-1e-06,0,0,0,-1e-06,0,0,1e-06,0,0,0,-1e-06,0,0,0,0,0,0,0,0,1e-06,0,0,0,1e-06,0,1e-06,-1e-06,0,-1e-06,0,0,1e-06,-1e-06,-1e-06,1e-06,-2e-06,0,0,0,2e-06,0,-1e-06,-1e-06,-1e-06,0,0,0,1e-06,0,0,1e-06,3e-06,-1e-06,0,0,0,-1e-06,-1e-06,0,-1e-06,-1e-06,0,0,0,-1e-06,0,-1e-06,0,-1e-06,0,-1e-06,0,0,1e-06,-1e-06,0,0,-1e-06,1e-06,0,0,-1e-06,2e-06,0,0,0,0,0,0,-1e-06,-1e-06,1e-06,0,0,1e-06,-1e-06,0,0,0,0,1e-06,1e-06,0,0,0,1e-06,0,0,-1e-06,0,0,0,0,1e-06,0,-2e-06,-1e-06,0,1e-06,0
0,-1e-06,0,0,-2e-06,0,0,-1e-06,0,0,0,0,0,0,1e-06,1e-06,0,0,0,0,0,-1e-06,-1e-06,-1e-06,0,-1e-06,0,-2e-06,0,-1e-06,0,0,0,0,-1e-06,-1e-06,0,0,0,0,0,0,0,1e-06,-2e-06,1e-06,0,-1e-06,2e-06,0,0,0,1e-06,-1e-06,1e-06,0,1e-06,1e-06,-1e-06,0,-1e-06,0,0,0,0,-1e-06,0,0,0,0,1e-06,0,1e-06,0,0,0,0,-1e-06,-1e-06,0,0,0,0,1e-06,0,0,0,0,0,1e-06,-2e-06,0,0,0,0,0,0,0,0,0,-1e-06,0,0,0,0,0,1e-06,0,0,0,0,0,0,0,-1e-06,-1e-06,0,-1e-06,0,0,0
0,-1e-06,0,0,0,0,0,0,0,0,-1e-06,1e-06,-1e-06,0,-1e-06,-1e-06,0,0,0,0,0,-1e-06,0,0,0,0,0,-1e-06,0,-1e-06,0,0,0,-1e-06,0,0,0,0,0,0,-1e-06,0,0,-1e-06,-1e-06,-1e-06,0,1e-06,1e-06,0,0,0,-2e-06,0,0,0,0,-1e-06,0,0,2e-06,0,0,0,0,0,0,0,0,-1e-06,0,0,0,0,-1e-06,0,0,2e-06,-1e-06,0,0,0,0,0,0,0,-1e-06,1e-06,0,0,-1e-06,1e-06,-1e-06,0,0,0,0,0,0,1e-06,1e-06,0,0,0,0,0,1e-06,0,0,0,0,0,0,0,0,0,1e-06,0,0,1e-06,0
-1e-06,0,0,0,1e-06,0,0,0,0,0,0,0,-1e-06,0,-2e-06,-1e-06,0,0,0,0,0,-1e-06,0,1e-06,1e-06,0,0,-1e-06,0,1e-06,0,0,0,0,0,0,0,0,0,0,1e-06,0,1e-06,1e-06,-1e-06,1e-06,0,-1e-06,-1e-06,0,0,0,-3e-06,1e-06,0,0,0,0,0,0,-2e-06,1e-06,-1e-06,0,0,0,0,0,0,0,0,-1e-06,0,0,-1e-06,0,0,3e-06,-1e-06,0,0,0,0,-1e-06,0,0,1e-06,0,0,0,0,0,0,1e-06,0,0,0,0,0,0,0,0,0,0,0,0,1e-06,0,0,0,0,-1e-06,0,0,0,0,0,0,0,1e-06,-1e-06
1e-06,0,-1e-06,0,1e-06,0,0,0,0,0,0,0,0,0,0,1e-06,0,0,0,0,0,-1e-06,-1e-06,0,1e-06,0,1e-06,0,0,-2e-06,0,0,0,1e-06,0,-1e-06,0,-1e-06,0,0,0,0,1e-06,0,-2e-06,-1e-06,0,-2e-06,-2e-06,0,0,0,-1e-06,0,0,0,0,1e-06,0,0,0,-1e-06,0,0,0,0,0,0,0,-1e-06,-1e-06,-1e-06,0,0,-1e-06,0,0,0,-1e-06,0,0,0,0,-1e-06,1e-06,0,0,0,-1e-06,0,-2e-06,0,0,-1e-06,0,-1e-06,0,0,0,0,-1e-06,0,0,0,0,0,0,0,0,0,0,0,0,0,0,0,-1e-06,0,0,-1e-06,1e-06
0,0,1e-06,0,0,0,0,-1e-06,0,0,0,0,2e-06,0,1e-06,0,0,0,0,0,0,-1e-06,0,-2e-06,1e-06,0,0,0,0,0,0,0,0,-2e-06,1e-06,0,0,0,0,0,0,0,0,0,-1e-06,0,0,1e-06,0,0,0,0,1e-06,-1e-06,1e-06,0,0,0,0,0,2e-06,1e-06,0,0,0,0,0,0,0,0,-2e-06,0,0,0,1e-06,0,0,1e-06,-1e-06,0,0,0,0,-1e-06,0,0,0,0,0,0,0,0,-1e-06,0,0,-1e-06,0,0,0,0,0,0,0,0,0,0,0,0,0,0,0,0,0,0,0,1e-06,1e-06,1e-06,0,-1e-06,-1e-06
0,0,-1e-06,0,1e-06,0,0,1e-06,0,0,0,1e-06,1e-06,0,-1e-06,-1e-06,0,0,0,0,0,0,-1e-06,1e-06,0,0,0,0,0,0,0,0,0,1e-06,1e-06,0,0,-1e-06,0,0,1e-06,0,0,1e-06,-2e-06,0,0,2e-06,1e-06,0,0,0,2e-06,0,0,0,0,1e-06,0,0,-2e-06,-1e-06,0,0,0,1e-06,0,0,0,-1e-06,-1e-06,0,0,0,1e-06,0,0,1e-06,-1e-06,0,0,0,0,0,0,0,1e-06,0,0,0,-1e-06,0,1e-06,1e-06,0,0,0,0,0,0,1e-06,0,0,0,0,0,0,0,1e-06,0,0,0,0,0,-1e-06,0,0,0,0,-1e-06,0
1e-06,0,1e-06,0,0,0,0,-1e-06,0,0,0,-1e-06,0,0,-2e-06,1e-06,0,0,0,0,0,0,0,1e-06,0,0,0,-1e-06,0,-1e-06,0,0,0,1e-06,0,0,0,0,0,0,-1e-06,0,-1e-06,-1e-06,-1e-06,1e-06,0,-1e-06,1e-06,0,0,1e-06,1e-06,0,-1e-06,0,0,-1e-06,0,0,0,1e-06,-1e-06,0,0,0,0,0,0,0,-1e-06,0,0,0,0,0,0,-2e-06,-1e-06,0,0,0,0,0,1e-06,0,0,0,0,0,-2e-06,-1e-06,0,-1e-06,0,0,0,0,0,0,0,0,0,0,0,0,0,0,0,0,0,0,0,0,1e-06,0,-1e-06,0,0,0,0
-1e-06,0,0,0,-1e-06,0,0,0,0,0,0,0,-1e-06,0,-1e-06,0,0,0,0,0,0,1e-06,0,0,-1e-06,0,0,-1e-06,0,-1e-06,0,0,0,-1e-06,-1e-06,0,0,0,0,0,-1e-06,0,-1e-06,1e-06,-1e-06,-1e-06,0,-1e-06,0,0,0,0,-1e-06,0,0,0,0,0,0,0,1e-06,-1e-06,0,0,0,0,0,0,0,-1e-06,0,1e-06,0,0,0,0,0,-2e-06,-1e-06,0,0,0,0,1e-06,0,0,0,0,0,0,-1e-06,0,0,0,0,0,0,0,0,0,-1e-06,0,0,0,0,0,-1e-06,0,0,0,0,0,0,0,-1e-06,0,0,0,0,1e-06,1e-06
