0.006053,0.005749,0.005577,0.005049,0.005654,0.006856,0.006814,0.006454,0.006149,0.006116,0.006223,0.005727,0.005283,0.005267,0.004974,0.004841,0.006337,0.007163,0.006586,0.006153,0.005385,0.00565,0.005822,0.004942,0.004677,0.005013,0.005685,0.006658
0.007478,0.006951,0.006537,0.00587,0.006609,0.008084,0.008158,0.007825,0.007505,0.00738,0.007421,0.006934,0.006507,0.006412,0.005917,0.00577,0.007449,0.008404,0.007954,0.00748,0.0066,0.00694,0.006994,0.005847,0.005511,0.006014,0.00688,0.007969
0.009761,0.00878,0.007941,0.007148,0.008087,0.009932,0.010185,0.009929,0.009713,0.009428,0.009259,0.008822,0.008509,0.008256,0.007335,0.00721,0.009093,0.010205,0.010129,0.009599,0.008605,0.009072,0.008869,0.007281,0.006822,0.007612,0.008661,0.009798
0.011045,0.009795,0.008812,0.008173,0.009125,0.010928,0.011269,0.01109,0.011157,0.010808,0.010296,0.009957,0.009907,0.009475,0.008141,0.008154,0.0099,0.010932,0.011303,0.010803,0.009978,0.010416,0.009948,0.008237,0.007748,0.008773,0.009567,0.010291
0.011337,0.010429,0.009812,0.009265,0.009989,0.011359,0.01145,0.011188,0.011529,0.011386,0.010566,0.010331,0.010679,0.010045,0.008459,0.008794,0.010213,0.010836,0.011249,0.01082,0.010475,0.010742,0.010025,0.008562,0.008431,0.009592,0.00978,0.00993
0.0125,0.012294,0.012012,0.011118,0.011234,0.011832,0.011563,0.011279,0.011471,0.011822,0.011174,0.010936,0.011542,0.010868,0.009596,0.010213,0.011207,0.011234,0.011159,0.010973,0.011232,0.011364,0.01041,0.009219,0.009798,0.010916,0.01046,0.010103
0.014494,0.014734,0.014922,0.01382,0.013366,0.01294,0.012371,0.012494,0.012168,0.01298,0.012942,0.012366,0.012968,0.012965,0.012566,0.013007,0.013622,0.013321,0.01294,0.012996,0.013297,0.013498,0.012289,0.010935,0.012466,0.013291,0.012229,0.011959
0.016571,0.016988,0.018045,0.017316,0.016486,0.015342,0.014536,0.014688,0.013685,0.01497,0.015775,0.015079,0.015796,0.016665,0.016872,0.016917,0.017779,0.017873,0.017215,0.01686,0.016406,0.016606,0.015094,0.013304,0.015893,0.016512,0.015158,0.015185
0.019134,0.019398,0.021229,0.021085,0.020085,0.018713,0.018111,0.017786,0.015821,0.017686,0.019222,0.019081,0.020488,0.021895,0.022032,0.021775,0.023415,0.023613,0.022164,0.021198,0.019531,0.019403,0.018286,0.016282,0.01927,0.020122,0.019153,0.019283
0.022233,0.022499,0.024457,0.024374,0.023251,0.022061,0.022785,0.022283,0.019154,0.021011,0.022288,0.022721,0.024917,0.026411,0.02614,0.025672,0.028054,0.028183,0.026119,0.025053,0.022591,0.02144,0.020774,0.01923,0.021676,0.02286,0.022785,0.022878
0.024348,0.025507,0.026685,0.025831,0.024926,0.024955,0.027858,0.027376,0.023708,0.024469,0.023756,0.024243,0.027075,0.029035,0.027944,0.026115,0.028237,0.029031,0.027554,0.026969,0.025153,0.023306,0.022565,0.021696,0.023178,0.024309,0.024467,0.024367
0.024208,0.02745,0.028482,0.026189,0.025175,0.027452,0.031875,0.030642,0.027728,0.027667,0.023934,0.023721,0.027279,0.029895,0.027608,0.023904,0.024992,0.026378,0.026044,0.026175,0.026081,0.025396,0.024079,0.023036,0.024733,0.025762,0.024727,0.024287
0.024056,0.028905,0.029992,0.026676,0.025575,0.028934,0.032095,0.029875,0.028645,0.028771,0.023452,0.022571,0.026742,0.030503,0.028078,0.023025,0.023635,0.025276,0.025016,0.024736,0.025121,0.025906,0.024054,0.022693,0.025904,0.027109,0.025091,0.024749
0.025284,0.028185,0.028297,0.026805,0.02643,0.027689,0.028161,0.026397,0.026284,0.026326,0.022269,0.022069,0.025773,0.029825,0.0288,0.024052,0.024625,0.026428,0.025913,0.024659,0.024112,0.024971,0.022613,0.021349,0.025792,0.027342,0.025628,0.026126
0.026911,0.025837,0.024718,0.025687,0.02622,0.025216,0.025832,0.025821,0.024754,0.023559,0.021827,0.023384,0.026704,0.03019,0.030254,0.026323,0.027905,0.030893,0.029735,0.027121,0.026139,0.026398,0.022824,0.022327,0.028219,0.030554,0.028616,0.029027
0.031772,0.027285,0.02651,0.028209,0.029159,0.028613,0.03084,0.030371,0.028086,0.026423,0.02558,0.029296,0.033997,0.035777,0.034658,0.03165,0.035994,0.041227,0.041172,0.038157,0.036032,0.035095,0.029307,0.029858,0.039221,0.043081,0.039566,0.03879
0.042344,0.034189,0.034802,0.037269,0.038384,0.039939,0.044171,0.040964,0.036147,0.034854,0.034006,0.039153,0.046629,0.047328,0.043889,0.040978,0.047393,0.053973,0.055809,0.055034,0.053477,0.051604,0.042726,0.042354,0.054158,0.059206,0.054239,0.052464
0.05994,0.045697,0.045974,0.04962,0.051322,0.054912,0.060351,0.053878,0.047348,0.04762,0.043524,0.047057,0.058107,0.058951,0.052775,0.049129,0.05518,0.063072,0.068707,0.072566,0.074825,0.072533,0.05933,0.055975,0.067232,0.070856,0.064262,0.061502
0.080546,0.059843,0.058487,0.062935,0.064891,0.068318,0.073365,0.066337,0.061216,0.064894,0.054299,0.052376,0.066628,0.066011,0.056291,0.052751,0.056931,0.066476,0.076911,0.085357,0.093514,0.091926,0.074567,0.067057,0.073395,0.072952,0.065381,0.060644
0.095544,0.073216,0.070644,0.073204,0.07274,0.074311,0.078503,0.073884,0.073313,0.082067,0.065579,0.058539,0.07671,0.07326,0.060135,0.056273,0.058302,0.070895,0.082823,0.090325,0.103411,0.105413,0.087389,0.078298,0.078169,0.072031,0.063507,0.057176
0.095976,0.078616,0.076364,0.073992,0.069723,0.072252,0.077671,0.077022,0.081482,0.092025,0.073746,0.066984,0.088809,0.083658,0.071118,0.066848,0.061611,0.074178,0.086026,0.087285,0.100627,0.106689,0.093423,0.088949,0.087549,0.077195,0.064323,0.059905
0.086793,0.074566,0.073475,0.066877,0.061645,0.066702,0.074131,0.076529,0.083543,0.091789,0.075099,0.072263,0.091875,0.086492,0.078837,0.076957,0.066703,0.075866,0.086025,0.080805,0.093825,0.104949,0.096205,0.093305,0.097351,0.085834,0.063291,0.065109
0.085637,0.07197,0.069197,0.064289,0.06283,0.068349,0.074853,0.075994,0.082198,0.086838,0.071791,0.072582,0.082446,0.074502,0.072668,0.076678,0.068427,0.072215,0.080401,0.073607,0.080695,0.096483,0.095814,0.089666,0.100722,0.093983,0.065498,0.0704
0.088118,0.08102,0.075016,0.068969,0.070131,0.074846,0.075598,0.07544,0.083095,0.084498,0.068212,0.067548,0.071906,0.063248,0.064265,0.073945,0.070586,0.069326,0.074755,0.068329,0.065855,0.082852,0.090605,0.084512,0.097714,0.09441,0.072594,0.077286
0.086381,0.093162,0.083159,0.074127,0.075663,0.078468,0.072218,0.070569,0.079576,0.078953,0.061321,0.058432,0.067947,0.067458,0.070545,0.080425,0.079234,0.074599,0.072983,0.067407,0.065433,0.072719,0.078377,0.079446,0.089868,0.090349,0.080867,0.080434
0.091962,0.10671,0.086461,0.076445,0.087429,0.089464,0.074407,0.066796,0.071951,0.073283,0.061288,0.057961,0.068942,0.07619,0.082157,0.089191,0.089367,0.084466,0.072507,0.066059,0.074506,0.075693,0.074561,0.079861,0.087044,0.090226,0.08819,0.079745
0.114807,0.127063,0.091591,0.078978,0.100376,0.106033,0.081878,0.06854,0.078412,0.08738,0.080335,0.074188,0.07801,0.084828,0.090825,0.090713,0.093035,0.092582,0.07351,0.064365,0.080126,0.081418,0.076976,0.081315,0.083616,0.090329,0.094431,0.080231
0.127141,0.140873,0.099279,0.080698,0.10395,0.113635,0.089055,0.076892,0.091156,0.10644,0.103796,0.09431,0.092761,0.094093,0.09697,0.092867,0.093437,0.096918,0.081016,0.066724,0.077435,0.079665,0.076786,0.082189,0.075984,0.084299,0.098043,0.086169
0.114167,0.135565,0.102444,0.072112,0.085885,0.100415,0.088219,0.081077,0.090299,0.106792,0.111274,0.103138,0.100106,0.091516,0.087465,0.090002,0.090178,0.087875,0.081397,0.07014,0.06961,0.073109,0.077212,0.083474,0.069451,0.073468,0.096883,0.091261
0.086413,0.109852,0.094961,0.060214,0.055936,0.076271,0.080864,0.074293,0.077199,0.088649,0.09671,0.097592,0.091763,0.071087,0.064383,0.077702,0.078738,0.070242,0.073002,0.070227,0.064682,0.069679,0.079425,0.082004,0.066445,0.06945,0.09229,0.087689
0.071156,0.087421,0.085298,0.060173,0.038417,0.053793,0.06402,0.059161,0.06895,0.079352,0.079593,0.07896,0.070022,0.049393,0.050883,0.074788,0.076889,0.070159,0.073634,0.074983,0.078493,0.083532,0.086626,0.078882,0.06455,0.075823,0.089261,0.078462
0.060784,0.07899,0.08171,0.064733,0.038595,0.044427,0.053813,0.052161,0.067047,0.087432,0.081906,0.063926,0.052868,0.043078,0.049922,0.079581,0.081062,0.071825,0.076062,0.081473,0.089121,0.094376,0.095804,0.080106,0.063537,0.078127,0.083585,0.075264
0.049278,0.069221,0.075519,0.061093,0.041167,0.043147,0.05357,0.04971,0.059214,0.086713,0.079702,0.055513,0.045907,0.043067,0.050975,0.077272,0.076944,0.063571,0.069686,0.078706,0.082263,0.086484,0.089421,0.07124,0.057616,0.069952,0.073536,0.070294
0.034403,0.04985,0.058244,0.050313,0.040963,0.040181,0.048027,0.045899,0.050772,0.07395,0.064455,0.048025,0.045048,0.043495,0.04657,0.061335,0.060418,0.051186,0.053741,0.059596,0.060255,0.063193,0.064912,0.049719,0.046834,0.055244,0.05618,0.057697
0.023435,0.031803,0.044912,0.04687,0.039126,0.032696,0.035696,0.039248,0.045974,0.060645,0.049231,0.043472,0.046865,0.038699,0.033988,0.039119,0.043231,0.044317,0.039303,0.038481,0.046707,0.048018,0.037836,0.026668,0.040165,0.054362,0.052074,0.047851
0.018318,0.023328,0.040497,0.048244,0.037798,0.025935,0.023906,0.028628,0.035136,0.045706,0.03637,0.036006,0.042586,0.028533,0.021578,0.027915,0.041804,0.047877,0.038206,0.028831,0.039144,0.040448,0.024424,0.014364,0.03685,0.057442,0.052605,0.037035
0.015614,0.021137,0.037129,0.044543,0.03618,0.0227,0.017237,0.021086,0.02329,0.028538,0.022726,0.026859,0.034525,0.019845,0.015377,0.026945,0.041979,0.049029,0.039078,0.026762,0.030814,0.029898,0.019745,0.014976,0.034268,0.050681,0.043439,0.025545
0.016444,0.019172,0.028405,0.033451,0.030042,0.019057,0.012471,0.01641,0.018396,0.018366,0.014337,0.022187,0.028537,0.015064,0.012045,0.025594,0.03584,0.041013,0.034476,0.023083,0.020743,0.01692,0.01429,0.01537,0.027341,0.035019,0.027508,0.016073
0.016228,0.017414,0.020115,0.019742,0.02197,0.016981,0.009119,0.014338,0.019538,0.015464,0.013287,0.022533,0.024009,0.012699,0.010344,0.0205,0.024599,0.026882,0.024656,0.01674,0.012055,0.007945,0.009239,0.012809,0.017971,0.019201,0.014578,0.012317
0.01426,0.017103,0.018501,0.012714,0.017353,0.017932,0.008504,0.016507,0.023441,0.016577,0.016384,0.02324,0.018962,0.011781,0.009454,0.014318,0.015402,0.014294,0.015843,0.013592,0.0095,0.007264,0.007741,0.009128,0.011744,0.01344,0.012744,0.013418
