-0.008601,-0.003957,-0.001681,-0.004503,-0.005705,-0.00523,-0.008085,-0.00478,-0.003435,-0.008363,-0.005905,-0.003042,-0.004247,-0.003959,-0.004766,-0.004836,-0.003155,-0.002469,-0.004383,-0.003643,-0.002883,-0.004631,-0.002804,-0.008947,-0.005403,-0.002779,-0.002718,-0.001886,-0.00545,-0.003823,-0.002522,-0.003544,-0.004515,-0.002115,-0.004395,-0.003896,-0.005533,-0.005688,-0.00602,-0.003982,-0.004634,-0.003265,-0.003786,-0.004432,-0.003904,-0.003017,-0.005583,-0.003949,-0.003972,-0.004219,-0.004968,-0.003325,-0.002374,-0.004461,-0.006751,-0.005156,-0.005104,-0.004237,-0.004724,-0.003994,-0.004222,-0.003764,-0.002944,-0.001163,-0.003913,-0.003774,-0.003446,-0.004078,-0.002845,-0.006441,-0.004242,-0.002403,-0.007382,-0.006476,-0.006505,-0.004928,-0.003391,-0.003163,-0.004509,-0.004634,-0.006073,-0.004938,-0.003935,-0.003344,-0.003673,-0.005452,-0.004937,-0.004988,-0.004045,-0.002999,-0.003816,-0.003106,-0.005333,-0.002532,-0.005577,-0.005557,-0.006014,-0.00407,-0.003391,-0.003154,-0.00313,-0.007218,-0.005492,-0.003943,-0.00413,-0.003049,-0.002408,-0.003765,-0.005069,-0.003779,-0.003591,-0.003599,-0.004963,-0.00583,-0.005716,-0.00536,-0.005748,-0.0043,-0.002809,-0.003962,-0.002209
0.002254,-0.000225,-0.002895,0.000725,-0.002226,0.002883,0.005151,0.001128,0.001514,0.002258,0.000514,-0.000974,0.00201,-0.000114,0.00126,-0.000498,-0.001528,-0.004621,-0.002584,-0.00083,-0.000463,0.001041,-0.00171,0.00266,0.000653,-0.001128,-0.000649,-0.000396,0.000392,4.7e-05,-0.000151,0.000611,-0.00108,0.000601,0.00087,0.000412,0.001325,0.00288,0.003109,-7.6e-05,-0.001401,0.001154,0.000597,-0.000447,-0.000486,0.000481,0.001751,0.001523,-0.000483,-0.000681,-0.000465,7.3e-05,0.000984,0.003356,0.003784,0.00023,0.000867,0.001195,0.000663,0.001563,7e-04,0.000972,7e-04,-0.000442,-0.000759,-0.002983,-0.001631,-0.00025,0.001635,0.001954,0.000526,-0.000497,0.00283,0.001682,0.003662,0.001799,0.001599,-7.9e-05,0.000119,0.002415,0.002618,0.003287,0.002201,-0.001801,-0.000529,0.001298,0.002624,0.000251,0.000441,0.000315,0.001318,0.001198,0.001674,0.001076,0.002,0.002612,0.002508,0.000835,0.000281,0.000336,0.000989,6.3e-05,0.00064,-0.000654,0.001298,0.001558,0.000282,-0.000441,-0.000329,-0.000582,0.000912,-0.002924,-0.002236,0.001513,7e-05,4.9e-05,0.000656,-1e-04,0.000592,0.000951,-0.000385
-0.004067,-0.001506,0.000763,-0.000236,0.001703,-0.003181,-0.005248,-0.003067,-0.00165,-0.001814,-9e-05,0.000245,-0.001708,-0.001182,-0.000506,0.000136,-0.000798,0.001586,0.002769,0.000863,0.000148,-0.000192,0.001375,-0.001587,3.7e-05,0.000451,-0.000366,0.001111,-0.001289,-0.001013,-0.000703,-0.001184,-4.8e-05,-0.001924,-0.00241,-0.000673,-0.00087,-0.001639,-0.002668,0.000153,0.001087,-0.00072,-0.002772,-5.8e-05,0.000278,-0.001061,-0.000611,-0.000163,-0.001213,0.000198,0.000685,-8.7e-05,-0.000853,-0.002371,-0.002909,0.000354,-0.002315,-0.00192,-0.00277,-0.002014,-0.001495,-0.001986,-0.00148,0.000686,-3e-04,-0.000717,0.000575,0.000495,-0.003162,-0.003241,-0.001716,-0.001302,-0.002236,-0.001512,-0.002843,-0.000931,-0.000614,-0.000669,7.6e-05,-0.00142,-0.002133,-0.002656,-0.00205,0.000252,-0.001171,-0.000156,-0.002793,-0.001533,-0.000671,0.000561,0.000216,-0.001247,-0.000873,-0.002099,-0.002882,-0.002723,-0.002198,-0.000619,-0.002198,-0.000994,-0.000949,0.000519,0.000348,0.000996,-0.000695,-0.001264,-0.002128,0.00063,-0.000882,-0.001316,-0.003211,0.000274,0.001673,0.001113,0.001025,0.000448,-0.001091,0.000165,-0.000772,-0.00092,-0.000872
0.00353,0.001446,0.001577,0.001408,-0.001189,0.001824,0.002376,0.00272,0.000863,0.00316,-0.000449,0.000243,0.000673,0.00075,0.000515,0.000364,0.001064,0.00055,0.000262,-0.000568,5.2e-05,0.00024,-0.000305,0.001001,-0.000945,-0.000257,-0.000267,-0.000804,0.000708,-8.7e-05,0.000324,0.001366,2.6e-05,0.00081,0.002122,0.000979,7.9e-05,0.000284,0.001051,-0.000809,-0.001074,-0.000504,0.001999,0.000156,0.000389,0.00092,0.000652,-0.000416,0.001766,0.00091,-0.000921,0.000123,0.000917,0.001612,0.001428,-0.000438,0.00184,0.002636,0.002082,0.000824,0.001596,0.001259,0.000675,-0.000912,-0.000947,0.001807,-0.000377,-0.000866,0.000445,0.002829,0.001968,0.000374,-0.000375,-0.000162,0.001505,0.00107,0.000101,0.000401,0.000163,0.00041,0.001172,0.001345,0.001373,0.001573,0.002377,0.00098,0.002308,0.002057,0.000336,-0.000524,0.000133,0.001869,0.000794,0.000981,0.002177,0.002606,0.002105,0.000943,0.00217,0.001439,0.001099,0.001266,-9e-06,-0.000767,0.000283,0.000375,0.00174,0.000219,0.002469,0.002219,0.001859,0.000948,0.001337,0.000122,-0.000172,-0.000264,0.001319,-0.000451,-7.1e-05,-0.00012,0.002328
-0.001507,-0.000999,-0.001208,-0.001175,0.00085,-0.000158,-0.00197,-0.001398,-0.000835,-0.002243,-0.000983,-0.000579,-0.000905,0.000746,-0.00099,-0.00132,0.00038,-0.000409,-0.001491,1.9e-05,-0.000958,-0.00044,-0.000662,7.5e-05,0.000633,-5.3e-05,4.2e-05,-0.000134,-0.000371,0.000731,-0.000501,-0.000981,0.000856,-0.000558,-8e-04,-0.000128,-5.2e-05,-0.000534,-0.000945,-0.000823,-0.000656,0.000313,0.00056,0.000113,-4.7e-05,-0.000894,0.000189,0.000188,-0.001032,-0.001067,-7.7e-05,0.00023,4.5e-05,-0.00208,-0.001872,-0.001175,-0.000418,-0.002221,-0.00093,0.000382,-0.000135,-0.000261,0.000605,-0.000144,0.001936,0.00028,0.000567,0.000257,0.00021,-0.001048,-0.00209,-0.000193,0.00071,0.00078,-0.001262,-0.002244,-0.001041,-0.000399,-0.000255,-0.000476,-0.000172,-0.000503,-0.001045,-0.001402,-0.001843,-0.001127,-0.00142,-0.002341,-0.000234,-0.000844,-0.001044,-0.001665,-0.000593,-0.001262,-0.000953,-0.001079,-0.00214,-0.001285,-0.000684,-0.001445,-0.000876,-0.001494,-0.000741,-0.000822,-0.000625,-0.000385,0.000121,4.1e-05,-0.002326,-0.001515,-0.000199,-0.000514,-0.002175,-0.001764,-0.001003,-0.001194,-0.001653,-0.000389,0.000411,-0.000506,-0.00148
0.000679,-0.000299,-6e-04,-0.000281,0.000295,0.000729,0.001643,0.001253,0.001377,0.000402,0.001944,0.00012,0.00018,0.000181,0.000926,0.001548,-0.000789,-0.000314,0.000157,-0.00051,0.000187,0.000241,5.6e-05,-0.000371,0.000283,0.000826,0.00084,0.000336,0.000863,0.000156,0.000433,0.00044,4.5e-05,0.000661,-0.000505,-0.001121,0.000413,0.000559,0.000575,0.001733,0.001959,-0.000167,-0.001505,5.9e-05,0.000164,0.001175,-0.000451,-0.000316,0.000935,8.9e-05,0.001401,-0.000433,-0.000105,0.001117,0.001367,0.001838,0.000942,0.001083,0.000626,-3.7e-05,-0.000294,0.000541,-0.000365,0.000651,-0.000395,-0.00163,-0.001247,-0.000273,0.000675,4.5e-05,0.001393,0.000725,-0.000267,0.00025,0.000452,0.002169,0.001535,0.000238,-0.000205,0.000224,-0.000702,0.000332,0.001024,0.000326,-0.000653,0.001047,0.000292,0.001926,-0.000401,7.1e-05,0.000237,0.001652,0.000766,0.001281,0.001373,-0.000755,0.001324,0.000978,8.1e-05,0.000276,-0.000398,0.000763,0.000905,0.00127,9.3e-05,0.000741,-3e-06,-0.000956,0.000528,0.000779,0.001177,-0.000587,0.000169,0.000779,0.001148,0.001488,0.00125,0.001159,-1.9e-05,0.00046,0.000162
0.000451,0.001484,0.000659,6e-04,-5e-04,-0.001292,-0.000609,-0.001794,-0.001899,-0.000368,-0.001666,-0.000711,0.000822,-0.00129,-0.000497,-0.001206,5.3e-05,0.000337,0.001547,0.001541,0.000941,-0.000145,-0.000149,0.000142,0.000102,-0.000335,-0.000247,-0.000523,-0.000401,-0.000619,0.000466,0.000376,6.8e-05,-0.000698,7.6e-05,0.001471,0.000124,-0.000284,-0.00017,-0.000502,-0.000443,-1.9e-05,0.000613,-0.000657,0.000221,-0.000992,0.000305,0.000404,-0.000729,0.000766,-0.001513,0.000322,-0.000442,-5.6e-05,-0.000583,-0.000752,-0.000496,-4.1e-05,0.000228,0.00026,-0.00055,-0.001044,-0.000235,-0.000309,0.000302,0.00107,0.000396,0.001141,-0.000292,-0.000106,-0.000393,-0.000127,-7e-06,0.000719,0.000955,-0.000994,-0.001075,-0.00023,0.000467,0.000494,0.000861,-0.000671,-0.000194,-0.000413,0.00149,-0.000603,0.000112,-0.000909,0.000559,0.000498,8.3e-05,-0.000828,-0.00078,-0.000388,-0.000527,0.001049,-0.000204,-7.3e-05,-9.4e-05,0.000727,0.000507,3.5e-05,-0.000116,-0.000934,0.000513,0.000154,0.000135,0.000524,-6.1e-05,-0.000235,-0.000881,0.000314,0.000984,0.000692,-0.000329,-0.000609,-0.000648,-0.000894,-0.000108,0.00045,0.00011
-0.000576,-0.00054,-0.000245,0.00073,-0.00023,0.000151,0.000575,0.001128,0.001521,0.00082,0.000573,0.000436,-0.00047,0.001137,-0.000409,0.000201,0.001216,0.000533,-0.001253,-0.001112,8.1e-05,-0.000541,0.000453,0.000128,0.000642,-0.000346,-0.000565,0.000155,0.000332,-9e-05,-0.000316,0.000348,-0.000833,0.000214,0.000722,-0.000547,-0.000215,0.00031,0.000715,0.000166,-8.1e-05,0.000204,0.000105,0.001035,-0.000944,-3.6e-05,-0.000106,-0.000265,0.000234,-0.000596,0.000195,-0.000148,0.000222,-0.000335,0.000414,0.000678,4.4e-05,0.000124,0.000234,-9.4e-05,0.001301,0.000265,-0.000353,0.000303,-0.000399,-9.6e-05,0.000416,-0.000158,0.000357,0.000699,-0.000132,-0.00035,-2.8e-05,-0.001197,-0.001603,0.000343,0.000661,0.000559,3.5e-05,-0.000167,-0.000912,0.000807,-0.000656,0.000226,-0.000788,-0.000642,-0.000772,0.000821,0.000882,-0.000373,-0.000258,-0.000462,0.000832,0.00089,8.2e-05,-5e-06,-0.000358,-0.000725,-6.3e-05,-0.000306,-3.8e-05,-0.000303,-0.000695,0.000239,-0.000942,-0.000257,-0.000545,0.000237,0.000488,0.001038,0.00011,0.000208,-0.000695,-0.001,-0.000874,0.000221,0.000848,0.000429,-0.000115,-0.000148,-0.000494
-1e-06,-0.000304,9.3e-05,-0.000624,0.000372,0.001109,2.3e-05,-6.6e-05,-0.000486,-0.000643,0.000122,0.000586,0.000318,-0.000447,0.000356,0.000428,-0.000849,-0.000448,-9.9e-05,-0.000454,-0.00053,0.000445,8.6e-05,3.4e-05,-0.000715,0.000711,0.000472,0.00035,0.000111,-0.000505,-0.000252,-0.000362,0.001032,0.000864,-0.000124,-0.000699,-0.000282,-0.000588,-0.000516,-1e-04,0.000323,-4.3e-05,1.9e-05,-0.001188,0.000223,0.000812,-4e-05,0.000168,0.000377,0.000474,0.000938,0.000439,-5.7e-05,0.000505,-0.00054,-0.00076,0.000114,-0.000756,-0.000852,-0.00028,-0.000833,0.000228,0.000401,-0.000685,-1.2e-05,-0.000403,0.000546,-4.3e-05,-0.000148,-0.001019,-0.000228,0.000608,0.000593,0.000282,0.001342,-0.000131,-0.000575,-0.000517,-0.000455,1.6e-05,0.000783,-0.000309,0.000631,0.000184,-0.000137,0.000451,0.0016,-0.000545,-7e-04,0.000164,0.001013,0.000296,-0.00074,-0.00138,-0.000688,-0.00061,0.000645,0.000925,0.000186,-0.000634,-0.000275,-0.000196,0.000513,0.000537,0.001155,-1.6e-05,0.000239,0.00018,-0.000277,-0.001264,-0.000299,0.00022,0.000401,0.000485,0.001171,5.2e-05,-0.000606,-0.00027,6.8e-05,-0.000272,0.000418
0.000379,-0.000173,0.000231,3.4e-05,0.00013,-0.001071,0.000721,0.000396,0.00021,0.000135,0.000192,-0.000237,1.3e-05,0.000154,0.000269,5.1e-05,-0.000476,-8e-05,0.000511,0.000927,-6.2e-05,2e-04,-0.00042,-0.00051,0.000117,-0.000981,-0.000191,0.000282,-0.00027,0.001215,0.000232,0.000206,-0.00043,-0.001219,-0.000278,0.000881,0.000384,0.000531,0.000167,-0.000363,-0.000286,-2e-05,-0.000139,0.000771,0.000372,-0.000261,-0.000705,-0.000159,-0.000752,-0.000496,-0.000519,-0.000273,0.000534,-0.000194,0.000168,0.000503,-0.000135,6.4e-05,0.00098,0.000105,0.000448,-2e-06,-0.000112,0.000472,-0.000217,0.000116,-0.00074,-0.000159,0.000455,0.000338,0.000226,-0.000519,-1.8e-05,0.000542,-0.000393,0.000389,0.000668,0.000552,0.000185,-0.000138,-0.000446,-0.000101,-0.000217,-0.000147,0.000535,0.000478,-0.000984,-0.000138,-0.000135,0.000276,-0.000497,3.4e-05,0.000141,0.001222,0.00038,-8.9e-05,-0.000277,-0.000447,-0.000193,0.000166,0.000845,0.00049,-0.000301,-0.000775,-0.000199,-0.000408,-0.000159,-0.000514,-0.000164,0.000182,0.000379,1.1e-05,-0.000211,-0.000372,-0.000255,0.00032,6e-06,0.000518,-6.7e-05,0.000159,0.000345
0.000256,0.000621,0.000227,0.000221,-0.000421,0.000268,-0.000803,9.7e-05,-3.4e-05,0.000291,-0.000262,-6.4e-05,-7.5e-05,0.000218,-0.000392,-0.000321,0.000787,3.3e-05,-3.3e-05,0.000299,0.000605,0.000107,0.00042,0.000162,7.3e-05,0.000489,2.5e-05,-0.000562,-6.4e-05,-0.00053,-0.000307,-0.000404,1.7e-05,0.000388,0.00037,-0.000168,-6e-05,-0.00026,-0.000134,0.000306,-0.000352,0.000473,0.000155,-7e-05,0.000188,-8.8e-05,0.000993,0.000119,0.000744,0.000157,-5.8e-05,-9.5e-05,-0.000952,0.000134,9.4e-05,-0.000454,-7.9e-05,0.000636,-0.00067,0.000108,-0.000545,-0.000294,-0.000179,-4.5e-05,0.00028,-1.2e-05,1.8e-05,0.000141,-0.000634,-8.2e-05,0.000432,-0.000112,-3e-05,-0.000475,0.000389,-8e-05,-0.000508,-6e-04,-4e-06,0.000114,8.4e-05,8.8e-05,8.4e-05,-0.000172,8.4e-05,-0.000539,0.00067,0.000219,-5.3e-05,6.6e-05,-0.000183,0.000196,-0.000107,-0.000491,-0.000217,0.000176,-1.1e-05,0.000238,0.000256,0.000166,-0.000623,-0.000366,0.000225,0.000236,-0.000673,9.7e-05,9e-05,-2.3e-05,0.000387,0.00049,-0.000498,-0.000784,0.000118,0.000942,-0.000279,-0.000483,0.000377,-0.000529,-6.8e-05,0.000242,-0.000303
-0.000591,-0.00026,-0.000471,-0.00012,2e-06,0.000124,-9.5e-05,-0.000147,-0.000366,-0.00016,-0.000119,8.2e-05,0.000277,-0.000324,0.00022,3e-05,-0.00054,0.000214,-1.7e-05,-0.000543,-0.000449,-0.000423,-0.000368,0.000254,5.6e-05,-0.000132,0.000189,-0.000199,5.5e-05,0.000114,-9.3e-05,0.00016,-0.000369,7e-06,7.1e-05,4.9e-05,-6.1e-05,0.000203,0.000214,-0.000314,0.000528,-0.000249,-0.000158,1.6e-05,-0.000123,0.000162,-0.000279,4e-05,-0.000306,-3.3e-05,4.5e-05,7.3e-05,0.00072,8.1e-05,-0.000295,8.6e-05,0.000714,0.000113,0.000188,0.000111,0.000415,0.000317,0.000281,0.000382,-0.000232,1.1e-05,0.00018,-0.000353,4.7e-05,-0.000181,-0.000304,0.000452,-4.7e-05,-3.1e-05,-0.000146,-0.000348,0.000294,0.000354,-6.9e-05,-0.000205,0.000149,0.000168,-0.000169,2e-06,-0.000169,0.000316,-8.4e-05,-0.000283,7.1e-05,0.000101,-5.9e-05,-0.000202,1.1e-05,-0.000143,0.00023,0.000372,-3.2e-05,-0.000321,-0.000492,-1.5e-05,0.000155,-0.000304,-0.000249,-8.2e-05,0.000441,0.000279,4.4e-05,1e-04,-0.000248,-0.000195,0.000119,0.000269,0.000225,-0.000543,-4e-06,0.000128,-0.000102,0.000416,0.000231,-0.000305,0.000101
0.000132,7e-05,0.000253,5e-05,0.000209,-0.000504,0.000344,-0.000349,0.000376,0.000263,0.000396,0.000178,-0.000268,0.000135,-0.000437,0.000167,0.000306,-0.000434,-2.2e-05,4.3e-05,0.000131,0.000261,0.000177,-9.1e-05,-0.00012,0.000304,-1.1e-05,0.000367,0.000105,0.000183,0.00016,1.3e-05,0.000366,-3.1e-05,-0.000274,-0.000412,0.000143,7.4e-05,-0.000136,0.000231,-0.000204,-0.000243,0.000185,0.000101,-0.000388,-0.000189,-0.000243,-5.3e-05,-4e-05,0.000203,0.000494,2.8e-05,0.000136,-0.000345,8.8e-05,-2.6e-05,-0.000688,-0.000142,-4.7e-05,-0.000124,-1.7e-05,-1.2e-05,-0.000299,-0.000399,0.000178,-7.3e-05,-0.000206,-4.1e-05,2e-04,0.000334,-0.000238,-0.000287,-0.00024,5e-05,-0.00018,0.000402,-0.000235,-1e-06,5.3e-05,0.000108,-0.000138,-0.000218,0.000107,0.000176,0.00031,-6.6e-05,-0.000355,0.000307,6.2e-05,-0.000185,0.000137,-4e-05,0.000202,0.000356,-0.00022,2.5e-05,0.000149,0.000155,0.000481,7e-06,-0.000274,0.000171,0.000257,0.000138,0.000274,-0.000154,-8.1e-05,3.2e-05,4.1e-05,-0.000119,0.000245,0.000106,-0.000326,9e-05,0.000288,0.00031,-0.000275,-0.000228,5.4e-05,-4.8e-05,-0.000284
3e-06,-0.000282,-0.000447,-0.000241,-4.3e-05,0.000633,-1.7e-05,0.000221,-0.000154,-0.000213,-7.2e-05,-0.000331,-7.4e-05,1.2e-05,0.000377,-1.1e-05,0.000107,0.000234,-0.000198,4.8e-05,5.4e-05,3.6e-05,5.7e-05,1.1e-05,-1.7e-05,-0.000126,5.1e-05,1.4e-05,3.2e-05,-0.000225,-2e-06,5.7e-05,-0.000107,0.000219,0.000265,0.000237,8e-06,-8.5e-05,0.000102,7.2e-05,0.000106,0.000149,0.000105,-0.00022,0.000491,7.9e-05,0.000126,2.6e-05,0.000157,-0.000155,-0.00049,-6.2e-05,-0.000219,0.000305,2.2e-05,-5.1e-05,0.000304,-7e-06,0.000225,0.000187,-0.000102,-0.000118,0.000252,-0.000209,-8.8e-05,0.000126,0.00029,0.000406,-0.000203,1.4e-05,0.000221,5e-05,0.000122,0.000102,0.000182,-0.000172,0.000148,6.6e-05,8.6e-05,-0.000111,7.4e-05,0.000213,0.000151,-7e-05,-0.000476,-2.2e-05,-1e-05,-0.000197,-3.6e-05,-7.1e-05,-4.1e-05,-0.000166,2.6e-05,-7.8e-05,4e-04,-0.00015,-2.8e-05,-5.5e-05,-0.000135,-0.000144,0.000353,4.6e-05,-0.000209,6.6e-05,-6e-04,-2.8e-05,-3e-05,6.7e-05,-8.2e-05,0.000132,-2.4e-05,0.000328,9.4e-05,-1.2e-05,-0.000246,-0.000319,0.000232,0.000258,-8e-05,0.000256,0.000248
-1.8e-05,9.9e-05,0.000534,1.2e-05,-0.000224,-0.00016,-0.00023,-0.000218,0.000129,0,-0.000145,0.000169,0.000151,-2e-05,-2.4e-05,-2.8e-05,-0.000132,3.7e-05,0.000127,6.1e-05,-0.00013,-0.000101,-0.00022,-4.6e-05,6e-05,-8.5e-05,-5.5e-05,-4.6e-05,-6.6e-05,2.1e-05,-0.000232,9.6e-05,9e-05,-3.6e-05,-0.000137,-0.000115,-0.000146,-5e-05,-4.8e-05,-3.1e-05,-5.3e-05,3.1e-05,-0.000148,0.000228,-0.000259,0.000123,0.000224,-5.8e-05,-0.000137,-5e-06,1.5e-05,5.5e-05,5.1e-05,-5.9e-05,-7.3e-05,-3.5e-05,-0.000222,-7e-06,-0.000205,-0.000162,0.000109,4.6e-05,-0.000118,0.000204,0.000162,6.4e-05,-0.000169,5.6e-05,8.9e-05,-4.6e-05,7e-06,-0.000202,1.2e-05,-0.000108,-0.000157,0.000153,1.6e-05,-0.000156,-5.8e-05,9.1e-05,5.2e-05,-0.000149,-0.000184,6.6e-05,0.000311,-0.000161,0.000302,0.000107,-8.8e-05,8e-06,-3.4e-05,0.000141,-0.000107,-0.000146,-0.000126,-0.000295,-0.000133,-6e-06,-2e-06,8e-05,-2.3e-05,1.6e-05,0.000118,-0.000191,0.000416,0.000104,4.4e-05,-2.5e-05,0.000138,-3.3e-05,-0.000206,-3e-04,9e-06,-5.1e-05,9.7e-05,0.000149,5.7e-05,-0.000162,3.3e-05,-3e-05,-6.3e-05
5.6e-05,0.000143,-0.000266,0.000148,0.000174,-0.000174,3.4e-05,-3.3e-05,2.6e-05,5.7e-05,8.7e-05,-2e-06,-5.2e-05,-0.000133,-4.9e-05,2.6e-05,-5.4e-05,-4.7e-05,-4.7e-05,6.5e-05,8.2e-05,1.5e-05,0.000105,-2.5e-05,-1.6e-05,0.000124,-5e-05,-2.2e-05,4.4e-05,-3.3e-05,0.000152,-0.000226,-4.7e-05,-0.000109,4e-05,0.00027,4.1e-05,-3.2e-05,-1.8e-05,0.000108,-0.000144,-0.000105,2.7e-05,-0.00013,6.5e-05,-0.000116,-0.000141,6.2e-05,4.2e-05,-3.5e-05,0.000117,5e-06,-6.4e-05,4.6e-05,6.5e-05,-5.3e-05,-8e-06,2.3e-05,9.6e-05,2e-06,-0.000159,-6.4e-05,4.5e-05,2e-05,-5.2e-05,-0.000172,-1.2e-05,-0.000274,2.1e-05,9e-06,1.2e-05,0.000295,-0.000106,0.000134,-6.9e-05,-0.000188,-0.000182,8.4e-05,-0.000101,-2.6e-05,-0.000129,2e-06,0.000102,-4.6e-05,0,8.9e-05,-0.000146,-4.3e-05,0.000145,0.000102,0.000147,1.2e-05,8e-06,2.5e-05,-1.4e-05,7.6e-05,-0.000155,6e-05,-4.7e-05,0.000125,-2e-05,0.000111,6e-05,0.000174,-9e-06,1.5e-05,1.1e-05,-3.9e-05,-7e-06,2e-05,0.000155,0.000147,0.000155,7.3e-05,2.2e-05,-7.2e-05,-0.00016,-5.6e-05,5e-06,-8.7e-05,6.6e-05
-0.000113,-0.000126,0.000113,7.1e-05,1e-05,0.000123,4.6e-05,0.000116,-0.000175,-3e-06,2.1e-05,6e-06,-5.2e-05,0.000164,0.000136,2.1e-05,0.000117,0.000102,-6.3e-05,-0.000242,-2.7e-05,4.3e-05,1.9e-05,3.2e-05,-4.6e-05,-9e-06,-9e-06,1e-06,-3.7e-05,4.6e-05,3.5e-05,4.9e-05,0.000152,2.3e-05,7.2e-05,-0.000264,5.2e-05,0.000116,-2.6e-05,-0.000169,0.000165,0.000117,2e-06,-3.3e-05,-7.5e-05,7.4e-05,2.4e-05,-1.4e-05,-3.8e-05,4.2e-05,-5.8e-05,-8.1e-05,0,-0.000134,-3.2e-05,0.000124,4.8e-05,3.2e-05,-0.000174,6e-06,3.9e-05,-2.5e-05,3e-06,-8.9e-05,8.8e-05,0.000184,-4.7e-05,-7e-06,2.3e-05,-2e-05,-3.8e-05,-0.000113,8.7e-05,-0.000114,0.000257,-5.1e-05,0.000176,2e-06,2e-05,-9e-06,3.4e-05,8.2e-05,-1.8e-05,-3.3e-05,-8.1e-05,0.000124,-0.000115,-2.3e-05,-0.000133,-5.3e-05,-0.000159,-2.4e-05,4.5e-05,2.2e-05,8.7e-05,8.5e-05,0.000224,-5.4e-05,1.3e-05,-7.6e-05,-9.2e-05,1.1e-05,-4.5e-05,-6.6e-05,-0.000132,-1.8e-05,5.1e-05,9e-06,1.9e-05,4.1e-05,4.7e-05,-0.000181,-1.4e-05,-0.000128,3.6e-05,-4e-05,9.3e-05,0.000185,-3e-05,-2.8e-05,-8e-06
9.9e-05,2.3e-05,-3.8e-05,-0.000108,4.3e-05,-6.7e-05,-0.000151,9.5e-05,0.000188,-2.4e-05,-2e-05,-6e-06,-2.9e-05,-4.2e-05,-0.00011,-3.8e-05,-5.7e-05,-9.5e-05,0.000114,7.7e-05,1.4e-05,1.9e-05,4.9e-05,-6.4e-05,-4.4e-05,-4.8e-05,9e-06,-5.9e-05,2e-05,3.4e-05,-3.3e-05,4.8e-05,-0.000124,1.9e-05,-1.7e-05,6.9e-05,3e-06,-6.3e-05,4e-06,0.00011,-0.000111,-3e-06,-0.000111,7.5e-05,6.7e-05,-0.000126,-6.7e-05,-2.1e-05,1e-05,1.5e-05,1.6e-05,7.5e-05,-0.000108,4.9e-05,-5.5e-05,-2.7e-05,-0.000122,-2.8e-05,0.000167,-2.7e-05,2.8e-05,1e-04,-1.3e-05,-9e-06,-0.00015,-0.000106,9.7e-05,5.7e-05,-1e-05,4e-05,2.5e-05,-4e-05,-2.9e-05,7.9e-05,-0.000187,6.1e-05,-0.000109,8e-06,4e-05,-2e-06,4.8e-05,-0.000122,-2e-06,4.6e-05,8e-05,-2.8e-05,0.000123,7.4e-05,8.4e-05,5.8e-05,7e-06,0.000102,-5e-05,-0.000137,-0.000133,0.000106,-4e-05,-3.8e-05,2.1e-05,-2.3e-05,-1e-05,-1.1e-05,3.9e-05,7e-06,-3e-06,-4.5e-05,1.9e-05,3.3e-05,-6.9e-05,-0.000127,-8.9e-05,7.7e-05,-0.000113,-4.8e-05,-5.2e-05,8.1e-05,-1.9e-05,-0.000148,2e-06,5e-06,-8e-06
8e-06,1.1e-05,-2.7e-05,-9.8e-05,-0.000107,9.7e-05,7.3e-05,-0.000107,-0.000205,-4.6e-05,-3.8e-05,-4.3e-05,-3e-06,-7.3e-05,-5e-06,5e-06,-3.3e-05,-9e-06,-3.1e-05,0.00017,4e-06,-8.7e-05,-1.4e-05,-1e-06,4.4e-05,6.9e-05,-1.8e-05,4.9e-05,8e-06,1.4e-05,7.2e-05,-8e-06,2e-05,8e-05,-4.9e-05,5.6e-05,-4.3e-05,-3.2e-05,1e-05,-0.00011,1e-05,-6.5e-05,5.9e-05,-9.7e-05,4.5e-05,3.9e-05,1.2e-05,-2.5e-05,4.2e-05,4.6e-05,-7e-06,-1.3e-05,0.000155,8.1e-05,7.3e-05,3.8e-05,9.8e-05,-2.8e-05,-0.000148,1.1e-05,4.5e-05,-4.2e-05,3.3e-05,0,8.2e-05,-0.000101,4.8e-05,5e-05,-1.2e-05,-5.8e-05,4.5e-05,2e-05,-3.9e-05,-9.2e-05,5.2e-05,-1.6e-05,0.000141,1.2e-05,-4.9e-05,3.5e-05,-6.4e-05,0.000135,-2e-06,-1.5e-05,-5.9e-05,-4.3e-05,-5.7e-05,-6.8e-05,-2.2e-05,-5.8e-05,0.000132,-2.9e-05,1e-06,0.00016,5.8e-05,-0.00015,-3.2e-05,6.4e-05,1.1e-05,1e-05,5.3e-05,-6.7e-05,-6.1e-05,2.1e-05,2.2e-05,1.4e-05,-2.8e-05,-2.9e-05,-1.2e-05,3.7e-05,6.2e-05,3.9e-05,-1.5e-05,0.000158,-2.2e-05,3e-06,-4.6e-05,0.000106,-4.1e-05,7e-05,-0.000112
-1.5e-05,3.4e-05,-3e-06,8.8e-05,5.6e-05,-3.5e-05,3.5e-05,1.9e-05,0.000165,3.9e-05,5.6e-05,5.8e-05,3.7e-05,8.8e-05,2.6e-05,3.7e-05,-6e-06,6e-06,-1.6e-05,-0.000124,-2.2e-05,1e-05,-1.4e-05,3.5e-05,3.5e-05,-8.2e-05,1.6e-05,2.9e-05,-1.2e-05,-7.4e-05,-9e-05,2.9e-05,-3.8e-05,-7e-05,-2.6e-05,-5e-06,3.3e-05,1e-05,-2.7e-05,6.7e-05,-1.8e-05,6e-06,3.1e-05,0.000142,-4.1e-05,6.3e-05,6e-06,5e-06,-3.2e-05,-8.1e-05,4.8e-05,1e-06,-4.2e-05,-2.1e-05,-3.8e-05,-5.6e-05,1.4e-05,6e-05,6.8e-05,2.3e-05,-1.7e-05,3e-06,-4.7e-05,3.5e-05,-9e-05,0.000149,-2.6e-05,-1.6e-05,-3.4e-05,-4.6e-05,-4.6e-05,4.6e-05,5e-06,2e-06,2.8e-05,3.1e-05,-8.5e-05,-6.1e-05,7e-05,6e-06,4.8e-05,-9.7e-05,-2.1e-05,2.9e-05,-4e-05,-1e-05,-0.000121,1.7e-05,0,1.9e-05,-2.4e-05,1.5e-05,2.2e-05,-5.8e-05,-2.2e-05,0.000124,5.9e-05,-4.2e-05,-4.1e-05,1.6e-05,-2.3e-05,-1.6e-05,4.4e-05,-5.9e-05,4.6e-05,0,-1e-06,1.6e-05,1.6e-05,5.1e-05,-1e-05,3e-06,-9e-06,-5.3e-05,5.7e-05,-4.1e-05,4.7e-05,-0.000157,-2.6e-05,-3.4e-05,7.1e-05
1.4e-05,-1.9e-05,2.1e-05,1.6e-05,3.2e-05,-2.7e-05,7e-06,1.4e-05,-0.000102,-3.1e-05,-2.9e-05,-7.4e-05,0,-7.2e-05,-3.5e-05,-1e-06,4e-06,-2.9e-05,4.3e-05,-6.6e-05,4.4e-05,8e-06,1e-06,-1.8e-05,-1.3e-05,8.2e-05,-1.3e-05,6e-06,1.2e-05,0.000103,6.2e-05,-2.5e-05,0.000104,3.9e-05,4.9e-05,-4.6e-05,2.9e-05,4.6e-05,8e-06,-4e-05,1.2e-05,5.4e-05,-2.4e-05,-9.5e-05,-4.6e-05,-8.5e-05,2.4e-05,6e-06,1.6e-05,3.4e-05,-2.2e-05,-3e-06,2e-06,-2.4e-05,-2.5e-05,1.2e-05,-3.1e-05,6.9e-05,-3.8e-05,-1e-05,-5.1e-05,1.4e-05,3.9e-05,-1.8e-05,5.4e-05,-5.8e-05,-2e-05,-8.4e-05,6.8e-05,1.5e-05,-4.9e-05,-8.9e-05,2.2e-05,3.8e-05,-0.00011,-2.4e-05,3.2e-05,5.7e-05,-3.7e-05,-9e-06,3.8e-05,6.6e-05,2.4e-05,-2.1e-05,8.4e-05,6.5e-05,0.000175,2e-06,-4e-06,-3.2e-05,2e-06,-3.1e-05,-1.5e-05,-3.6e-05,-1e-05,-9.5e-05,-2.6e-05,2.9e-05,1.9e-05,2.9e-05,5e-05,1e-06,1.3e-05,6.2e-05,-4.9e-05,-1.4e-05,-3.2e-05,-1.6e-05,3.5e-05,-5.9e-05,-3.7e-05,-2e-06,5.8e-05,4.9e-05,-4.5e-05,-1.9e-05,7e-06,0.000151,6e-06,-5.8e-05,-5.6e-05
-3.8e-05,-1.9e-05,-2.5e-05,2.2e-05,-5.3e-05,5.8e-05,-3.7e-05,-5.2e-05,5.3e-05,6.3e-05,-2.1e-05,4.2e-05,-1.8e-05,5.1e-05,4e-05,-1.5e-05,4e-06,4.5e-05,-4.2e-05,8e-05,-3.2e-05,4e-05,-1.1e-05,1.1e-05,-1.9e-05,-6.6e-05,5.3e-05,-4.5e-05,-3.1e-05,-8.1e-05,-4e-06,-4.1e-05,-3.9e-05,-7e-06,-7e-06,-3.1e-05,-1.2e-05,-4.9e-05,3e-06,2.2e-05,5.7e-05,-4.8e-05,1.7e-05,1.5e-05,6e-05,0.00012,-2.7e-05,4e-06,-1e-06,-1.6e-05,-5.8e-05,-5e-06,-2.8e-05,-1.7e-05,2.7e-05,2e-06,3.9e-05,-3.5e-05,3.4e-05,1.3e-05,3.2e-05,-2.3e-05,-4.4e-05,-2.7e-05,-4.4e-05,2e-05,-9e-06,0,-5.9e-05,5e-06,1.3e-05,4e-05,-4e-06,2.1e-05,5.1e-05,2.4e-05,-5e-06,-2.9e-05,2.1e-05,-1.5e-05,-6.5e-05,-7e-05,0,-1.6e-05,-6.3e-05,-8.8e-05,-5.1e-05,-1.1e-05,-3e-06,-8e-06,-2.8e-05,-1.8e-05,1.4e-05,8.9e-05,1.3e-05,8.9e-05,-8e-06,-2.1e-05,0,-6e-05,-5.7e-05,2.4e-05,-4.4e-05,-4.8e-05,-3.3e-05,1.3e-05,-6e-06,2.7e-05,1e-06,5.2e-05,9e-06,-7.7e-05,-1e-06,-8.7e-05,-1e-05,4.3e-05,-2.3e-05,-6.6e-05,3.5e-05,6.2e-05,0.000107
4e-05,1e-06,2.8e-05,-8.5e-05,1e-06,-8.2e-05,1e-06,4.2e-05,-2.2e-05,-1.2e-05,2.5e-05,1.6e-05,7e-06,1.1e-05,3e-05,-1.1e-05,2.6e-05,-4.5e-05,7e-06,-1e-05,-4e-06,-1.3e-05,2.9e-05,-2e-06,0,4.4e-05,-1.9e-05,-7e-06,3.4e-05,-1.9e-05,-3.8e-05,3.7e-05,-1e-05,-7.3e-05,-1.1e-05,8.7e-05,-2.6e-05,4e-06,1.6e-05,-1.1e-05,-2.1e-05,0,5e-06,3.8e-05,-4.7e-05,-8e-05,1.2e-05,8e-06,-1.8e-05,3.2e-05,8.7e-05,2e-05,4.3e-05,4.3e-05,-1.7e-05,-3.1e-05,-1e-06,-8.5e-05,-1.8e-05,-6e-06,-2.9e-05,7e-06,2.6e-05,3.5e-05,5.4e-05,2.4e-05,-8e-06,5.2e-05,5e-06,-1.1e-05,4.7e-05,5e-06,-1e-05,-8.7e-05,3.6e-05,-2.8e-05,-4.1e-05,3e-06,-2.6e-05,6e-06,2.1e-05,6.9e-05,-2.4e-05,1.2e-05,2.6e-05,2.8e-05,-2.6e-05,3e-05,6e-06,1.9e-05,-2.1e-05,4.8e-05,1.2e-05,-6.4e-05,1.8e-05,-5.7e-05,-2.7e-05,-1.5e-05,2.5e-05,-2.1e-05,2.4e-05,1.1e-05,3.6e-05,-9e-06,8.8e-05,4e-06,-5e-06,-4e-06,-3.7e-05,-7e-06,1.5e-05,4.1e-05,-2.1e-05,4.6e-05,2.8e-05,-4.8e-05,-6e-06,1e-06,-4.2e-05,-3e-06,-3.1e-05
-1.9e-05,1.8e-05,-9e-06,1.1e-05,7e-06,5.8e-05,1.1e-05,1.2e-05,-2.6e-05,-2.4e-05,6e-06,-2.6e-05,-3e-06,-4.4e-05,-8.1e-05,1e-05,-3.6e-05,4.2e-05,1.7e-05,1.7e-05,-7e-06,-1e-05,-7e-06,-8e-06,2.9e-05,-9e-06,1e-05,2e-05,-2.4e-05,7.5e-05,2.7e-05,1.7e-05,-2.8e-05,0.000107,2e-05,-4.7e-05,-1e-06,3.3e-05,-6e-06,1.2e-05,-1.5e-05,3.7e-05,-2.6e-05,-6.5e-05,2.4e-05,1e-06,1.8e-05,2e-06,1.9e-05,4e-06,-7.2e-05,-2.4e-05,-2.9e-05,-1e-06,-2e-06,5e-06,-2.2e-05,1.1e-05,-5e-06,-4e-06,3.4e-05,7e-06,-2e-05,-1.2e-05,-2.6e-05,-2.5e-05,4.4e-05,-2.3e-05,1.7e-05,3.4e-05,1.4e-05,-2.5e-05,9e-06,0.000103,-2.7e-05,-6e-06,2.9e-05,0,3.7e-05,2e-06,2.1e-05,-5e-05,2.7e-05,-2e-06,1.7e-05,-1.1e-05,3.5e-05,-3e-05,-1e-06,1e-05,1.9e-05,-2.4e-05,-3e-06,-4e-06,-3e-06,-1.5e-05,3.5e-05,5e-05,-3.7e-05,3.6e-05,-2.8e-05,-1.1e-05,-3e-05,5.4e-05,-6.7e-05,-1.7e-05,-1e-06,4e-06,2.6e-05,-4.8e-05,-1.9e-05,-1.3e-05,1e-06,2.6e-05,6e-06,5.9e-05,3.3e-05,-9e-06,4.4e-05,-3.8e-05,-5e-06
-9e-06,-1.7e-05,-7e-06,4.9e-05,4.1e-05,9e-06,2.5e-05,2e-06,4.1e-05,8e-06,-2e-06,5e-06,-1e-06,1e-05,4.8e-05,2e-06,2.8e-05,-2.6e-05,-2.9e-05,-3.5e-05,9e-06,9e-06,-1.4e-05,-3e-06,4e-06,-1.8e-05,7e-06,1.7e-05,1.5e-05,-5.6e-05,1.7e-05,-1.1e-05,6e-06,-2.5e-05,-2.7e-05,1.4e-05,3.1e-05,-4.4e-05,1.9e-05,-1.1e-05,-1.1e-05,-2.1e-05,1.1e-05,8.5e-05,-9e-06,3.2e-05,9e-06,-3e-06,-1e-06,-1.3e-05,-8e-06,-3e-06,-3e-06,-2.4e-05,6e-06,-3.1e-05,3.1e-05,4.7e-05,9e-06,-9e-06,7e-06,-2.4e-05,9e-06,3.5e-05,4.1e-05,1.5e-05,6e-06,-2e-05,-2.1e-05,-1.2e-05,-2e-05,2e-05,-4e-06,-1.8e-05,3.2e-05,0,-4.9e-05,1.4e-05,-3.4e-05,4e-06,-4.7e-05,3.1e-05,-8e-06,1.8e-05,-3.3e-05,6.3e-05,-4.3e-05,1.9e-05,-1.1e-05,2e-06,1.1e-05,1.7e-05,-1.2e-05,4.5e-05,1.4e-05,-4.5e-05,1.9e-05,-3.2e-05,5e-06,1e-06,1.3e-05,5e-06,5.4e-05,-4.9e-05,-2e-06,2.9e-05,8e-06,-1.8e-05,-2.6e-05,5.7e-05,-7e-06,6.9e-05,-1.1e-05,-2.9e-05,-2e-05,-1.6e-05,-2.2e-05,1.1e-05,-1.3e-05,1e-05,-1.8e-05
4e-06,4e-06,-1.3e-05,-2e-06,-5.5e-05,-5.2e-05,-4e-06,-1e-05,-2.4e-05,-1.8e-05,-1.7e-05,-2.2e-05,1.4e-05,2.6e-05,-9e-06,-1e-06,-1.8e-05,1.2e-05,1.7e-05,-4.1e-05,2.1e-05,-7e-06,1.3e-05,-4e-06,-1e-05,2.2e-05,-7e-06,-8e-06,-1e-05,4.4e-05,-3.1e-05,0,-2e-05,-4.3e-05,-2.6e-05,-3.6e-05,-1.4e-05,1.8e-05,-1e-05,2.7e-05,3.8e-05,-2.4e-05,4e-06,-9.2e-05,2e-06,-4.7e-05,-3.4e-05,-4e-06,-1.9e-05,-2.5e-05,4.1e-05,2.1e-05,2.1e-05,2e-06,-9e-06,2.4e-05,-3.4e-05,-1.8e-05,5e-06,-3e-06,-1.1e-05,2.5e-05,-1e-05,-4.7e-05,-3.4e-05,-1.9e-05,-3.6e-05,3.5e-05,2.4e-05,1e-06,-2.7e-05,-1.8e-05,-1.1e-05,-4.2e-05,-2.1e-05,3.6e-05,7.8e-05,-2.7e-05,2.2e-05,-7e-06,2.1e-05,-1.8e-05,0,-1.1e-05,1.4e-05,-5.4e-05,0,3e-06,0,-2e-06,1.1e-05,-1.5e-05,6e-06,-5e-06,-1.3e-05,9.1e-05,-3.7e-05,6e-06,1.5e-05,-3e-06,1.3e-05,-2e-06,-4.8e-05,3.4e-05,4.3e-05,7e-06,1.6e-05,-5e-06,1.8e-05,-1.3e-05,1.3e-05,-5.3e-05,1.2e-05,-2e-05,-1.5e-05,-5.1e-05,-9e-06,3.8e-05,1e-06,1.1e-05,-1.8e-05
-5e-06,5e-06,4.5e-05,-1.9e-05,2.8e-05,5e-05,-2e-05,8e-06,1.3e-05,6e-06,1.5e-05,2e-05,-4e-06,-1.1e-05,-1.8e-05,1e-06,-1.2e-05,-2e-06,1.4e-05,9.3e-05,-3.6e-05,-5e-06,-1.5e-05,4e-06,-1.4e-05,-1.2e-05,3e-06,-1.2e-05,1e-06,-1.6e-05,0,-1.6e-05,-4e-06,3.5e-05,3.6e-05,4.6e-05,-7e-06,1.1e-05,-2e-06,-3.3e-05,-1.4e-05,2.5e-05,-1.3e-05,6.3e-05,4.5e-05,4.8e-05,0,7e-06,2.9e-05,2.1e-05,-2.1e-05,-2e-05,-4.7e-05,1e-05,-6e-06,-4e-06,3e-05,-2e-05,1e-05,8e-06,-1e-06,1e-06,1e-05,8e-06,2.4e-05,1.9e-05,-2e-06,1e-06,-1.4e-05,2.3e-05,1.6e-05,4.1e-05,8e-06,1.8e-05,-1.9e-05,-1.8e-05,-5.8e-05,1.3e-05,-2.2e-05,1e-06,0,9e-06,-1.1e-05,-5e-06,5e-06,2.2e-05,1.2e-05,-1.2e-05,4.5e-05,-6e-06,-2.2e-05,-6e-06,-9e-06,-3.3e-05,-4e-06,-1.7e-05,4e-06,-1e-06,1e-06,-1.3e-05,4e-06,5e-06,1.3e-05,-2.7e-05,-1.2e-05,-2.5e-05,-1.1e-05,6e-06,1e-05,-2.8e-05,1.1e-05,1.4e-05,-3e-06,-1.3e-05,2.9e-05,6.6e-05,2.3e-05,-7.3e-05,-6e-06,1.6e-05,1.8e-05
1.9e-05,-8e-06,-6e-05,-2.1e-05,-3e-06,-2.2e-05,2.2e-05,-2.8e-05,0,1.2e-05,3e-06,-3e-06,1e-06,-1.7e-05,3.6e-05,-1e-06,3e-05,-2e-06,-1.2e-05,-1e-05,1.3e-05,-1e-06,7e-06,0,1.4e-05,1e-06,-1.1e-05,1.2e-05,8e-06,-1.7e-05,2.1e-05,4e-06,1.4e-05,-2e-05,-1.3e-05,-1.5e-05,1.2e-05,-2e-05,2e-06,2.8e-05,6e-06,9e-06,1.3e-05,-2.3e-05,-6.4e-05,-1.5e-05,7e-06,1e-06,-2.2e-05,8e-06,1.5e-05,0,5.4e-05,1.1e-05,1.1e-05,1e-06,-6e-06,4e-06,-3.4e-05,0,-1e-05,-2e-05,-6e-06,1.3e-05,-3.1e-05,-2e-05,-6e-06,-3e-05,-8e-06,-1.5e-05,-3e-06,-5.3e-05,4e-06,2.5e-05,1.3e-05,-1.5e-05,4.6e-05,-4e-06,3.7e-05,1e-06,-2e-05,-5e-06,1.5e-05,-2e-06,-1.9e-05,-4e-06,2.5e-05,2.1e-05,-4.8e-05,-6e-06,-1.5e-05,1e-05,7e-06,4.1e-05,-1e-06,3.4e-05,2.2e-05,-6e-06,-1.3e-05,-4e-06,-1e-05,6e-06,1e-06,9e-06,-2.8e-05,-7e-06,5e-06,1.2e-05,-1.4e-05,2.5e-05,-1.4e-05,-3.4e-05,-2e-06,4e-05,-8e-06,-3.8e-05,-1.3e-05,4.7e-05,2.3e-05,-1e-05,2.6e-05
-1.8e-05,3e-06,5.8e-05,2e-05,1.4e-05,-1e-05,-1.6e-05,9e-06,-1.5e-05,-1e-06,-1.1e-05,-4e-06,3e-06,2.4e-05,-2.7e-05,-6e-06,-1.1e-05,6e-06,6e-06,-7.5e-05,-1.4e-05,9e-06,1e-05,0,1.1e-05,6e-06,-1e-05,-1.5e-05,-1.2e-05,2.1e-05,-1.5e-05,1.5e-05,3e-06,1e-06,6e-06,3e-06,8e-06,1e-05,-3e-06,-3.3e-05,-3.1e-05,-2.2e-05,0,-1e-06,3.6e-05,-1.6e-05,1.3e-05,0,3e-06,1.7e-05,-1.6e-05,1.1e-05,-3.6e-05,-2e-05,-1.2e-05,0,-2.2e-05,1.7e-05,2.8e-05,1e-05,1.4e-05,1.6e-05,2e-06,0,1.6e-05,-4.1e-05,2.3e-05,-9e-06,1.5e-05,-1.3e-05,-7e-06,3.3e-05,-8e-06,-4e-05,1e-06,1.8e-05,-2.3e-05,1.1e-05,-2.6e-05,2e-06,2.9e-05,-1.1e-05,-4e-06,1e-06,2.6e-05,1.4e-05,-3e-06,-2.2e-05,7e-06,5e-06,1.9e-05,-1.9e-05,-1e-06,-2.2e-05,-1.1e-05,-6.8e-05,-1.4e-05,1.2e-05,0,3e-05,-1.2e-05,2e-06,-1.1e-05,1.9e-05,1e-05,1.7e-05,-3e-06,0,7e-06,-6e-06,-1e-06,2.5e-05,1.2e-05,1e-05,5e-06,5e-06,-3e-06,-2.1e-05,-3.2e-05,-2.8e-05,-5e-06
2e-06,1e-05,-4e-05,9e-06,-3e-05,2.5e-05,-1.4e-05,7e-06,2.1e-05,-6e-06,-1e-06,1.9e-05,-2e-06,-1.8e-05,1.3e-05,1e-06,-2.1e-05,-8e-06,-5e-06,4.4e-05,1e-05,6e-06,-1.5e-05,3e-06,-9e-06,-1.6e-05,1.3e-05,1e-05,1.4e-05,-1.3e-05,4e-06,0,-1e-05,2e-05,0,-1.5e-05,-1.4e-05,5e-06,-3e-06,2.6e-05,2.1e-05,1.1e-05,-1.2e-05,2.9e-05,-2.8e-05,2.6e-05,-1.2e-05,-9e-06,1.3e-05,-2.6e-05,2.8e-05,-7e-06,2.2e-05,-7e-06,-6e-06,3e-06,2.6e-05,1.7e-05,-2e-05,-5e-06,-1.3e-05,-3e-06,7e-06,3e-06,-2.3e-05,4.5e-05,3e-06,1.4e-05,4e-06,5e-06,9e-06,-1e-05,5e-06,1.8e-05,9e-06,1e-06,2e-06,-6e-06,2.4e-05,-3e-06,-2e-06,3e-05,-7e-06,1.2e-05,-1.5e-05,-3e-05,-3.6e-05,1.4e-05,-2e-06,-9e-06,1.2e-05,1.3e-05,2e-06,-2.2e-05,8e-06,7e-06,-1.5e-05,2e-06,4e-06,1e-06,7e-06,-6e-06,2.3e-05,-3.2e-05,2.3e-05,-2e-06,-2e-06,-3e-06,-9e-06,-1.2e-05,1.7e-05,4e-06,-6e-06,-2.4e-05,-6e-06,2.7e-05,7e-06,3.8e-05,1.1e-05,1.5e-05,-2e-06
4e-06,-1.5e-05,1e-06,4e-06,1.3e-05,-2.3e-05,1.9e-05,0,-2.1e-05,6e-06,6e-06,-2.6e-05,3e-06,-1e-06,8e-06,4e-06,3e-05,8e-06,-1e-05,2.2e-05,1.7e-05,-1.6e-05,1e-05,0,-1.6e-05,2e-05,-1.2e-05,3e-06,-1e-05,-1.5e-05,6e-06,-3e-06,-1.8e-05,3e-06,2e-06,1.4e-05,-5e-06,-1.8e-05,-3e-06,-2.1e-05,1e-05,6e-06,1e-05,-5.2e-05,1.2e-05,-2.8e-05,-3e-06,-2e-06,-2.3e-05,-6e-06,-1e-05,-1e-06,-7e-06,2.1e-05,1e-05,1e-05,-1.8e-05,-1.6e-05,2.4e-05,-5e-06,2e-06,-8e-06,-8e-06,-2.5e-05,1.8e-05,-7e-06,0,1.8e-05,-1.7e-05,1e-06,1.1e-05,6e-06,-2e-06,-1.2e-05,0,-1e-06,4e-06,-1.3e-05,-2.1e-05,2e-06,-8e-06,-3.7e-05,4e-06,-5e-06,0,6e-06,2.2e-05,1e-06,2.1e-05,1.1e-05,2e-06,-3e-06,0,4.3e-05,-4e-06,5e-06,1e-05,-1.7e-05,1.1e-05,-1.6e-05,0,-1.5e-05,-2.5e-05,1.9e-05,-2e-05,-1.1e-05,-4e-06,-1e-05,8e-06,2.1e-05,-3e-06,1e-05,0,4e-06,1.1e-05,-3.2e-05,2e-06,-4.7e-05,-8e-06,2.2e-05,-2.4e-05
0,5e-06,2.5e-05,-2.3e-05,1e-05,1.2e-05,1.2e-05,2e-06,1.7e-05,-2e-06,1e-06,1.2e-05,6e-06,1.4e-05,-2.5e-05,-1e-06,-8e-06,-9e-06,1e-05,-2.8e-05,-3.1e-05,5e-06,-5e-06,0,6e-06,-1.7e-05,1e-05,-3e-06,6e-06,3.6e-05,-9e-06,-7e-06,2e-05,-2.1e-05,-8e-06,8e-06,1.2e-05,1.7e-05,0,1.5e-05,-7e-06,-1.5e-05,1e-06,5.2e-05,1.2e-05,1.4e-05,9e-06,0,2.3e-05,2e-06,-3.4e-05,1e-06,7e-06,-4e-06,-9e-06,-7e-06,-3e-06,-2.9e-05,-2e-05,1e-06,-1e-06,1.1e-05,9e-06,2.7e-05,-1.5e-05,-9e-06,-1.4e-05,-1.4e-05,1.1e-05,-1.1e-05,5e-06,-2e-05,-3e-06,9e-06,-3e-06,-1.8e-05,-3e-05,7e-06,1.3e-05,2e-06,1.4e-05,3.4e-05,3e-06,-2e-06,7e-06,1.4e-05,-6e-06,-1.1e-05,-1.7e-05,3e-06,-1.6e-05,7e-06,0,-2e-05,5e-06,3e-05,7e-06,1.7e-05,-1.1e-05,1e-06,1.4e-05,-4e-06,1.2e-05,-4e-06,-1.8e-05,0,1e-06,1e-06,-5e-06,-4e-06,-1.4e-05,-1.1e-05,-7e-06,7e-06,-1.5e-05,1e-06,-9e-06,1.4e-05,9e-06,-8e-06,-1.3e-05
6e-06,2e-06,-2.6e-05,4e-06,-6e-06,6e-06,-2.2e-05,5e-06,-5e-06,-7e-06,-9e-06,-1e-05,-1e-06,-1.6e-05,1.3e-05,-1e-06,-1.3e-05,1e-05,-2e-06,9e-06,1.5e-05,2e-06,1e-06,0,1.1e-05,1.1e-05,6e-06,-2e-06,-2e-06,-1.5e-05,6e-06,-2e-06,7e-06,-1e-05,-4e-06,-1.3e-05,-5e-06,4e-06,-2e-06,-7e-06,-6e-06,3e-06,-8e-06,-3.4e-05,-1.7e-05,1.6e-05,5e-06,6e-06,-1.4e-05,2.1e-05,4.4e-05,3e-06,-1.7e-05,-6e-06,-3e-06,3e-06,7e-06,-4e-06,1.4e-05,0,0,-1e-05,-1e-05,-1e-05,2.2e-05,3.9e-05,-7e-06,-1.9e-05,-6e-06,0,-2.3e-05,2.4e-05,1e-06,1.5e-05,-1e-06,1.6e-05,4e-05,7e-06,-1.3e-05,0,-1.8e-05,-3e-05,0,-3e-06,-9e-06,-5e-06,-1.4e-05,1.5e-05,1.4e-05,2e-06,-5e-06,-1e-06,1e-06,-1e-05,6e-06,-2.1e-05,-1e-06,-1.6e-05,-6e-06,1e-06,-1.2e-05,6e-06,-7e-06,-9e-06,3.6e-05,1.2e-05,-2e-06,3e-06,2e-06,-1.7e-05,4e-06,-1.8e-05,1e-06,1.3e-05,2e-06,2.1e-05,7e-06,1.7e-05,-3e-06,-1.4e-05,2.7e-05
-6e-06,2e-06,2.1e-05,6e-06,-9e-06,-1.5e-05,-4e-06,-6e-06,-6e-06,1e-05,5e-06,1.1e-05,0,1e-05,8e-06,-1e-06,1.6e-05,-8e-06,-2e-06,-2.2e-05,-3e-06,4e-06,3e-06,-3e-06,-4e-06,-1e-06,-5e-06,-7e-06,-4e-06,-1.6e-05,0,8e-06,2.3e-05,2.8e-05,1.2e-05,7e-06,-5e-06,-2.2e-05,4e-06,5e-06,-4e-06,1.4e-05,5e-06,1.4e-05,2.4e-05,-3e-05,-9e-06,1e-06,1e-06,0,-1.7e-05,-3e-06,1.3e-05,-7e-06,4e-06,-1e-05,-7e-06,2.9e-05,-1.4e-05,1e-06,1.4e-05,1e-06,1e-05,4e-06,-1.2e-05,-2.2e-05,1.2e-05,4e-06,4e-06,8e-06,-8e-06,-1.6e-05,2e-06,-2.6e-05,-1.3e-05,6e-06,-3.7e-05,-4e-06,1.4e-05,-3e-06,3e-06,2.5e-05,-3e-06,-1e-06,6e-06,-4e-06,2.4e-05,-1.4e-05,-1.5e-05,-4e-06,4e-06,-7e-06,-3e-06,1.9e-05,-2e-06,-7e-06,-1.2e-05,1.7e-05,5e-06,7e-06,0,8e-06,8e-06,1.4e-05,-1.3e-05,-2e-06,1e-06,5e-06,7e-06,1.8e-05,1e-05,1.6e-05,1e-05,-2e-05,5e-06,-1e-05,3e-06,-5e-06,1.2e-05,3e-06,-3e-06
5e-06,0,-7e-06,1e-05,5e-06,1.1e-05,9e-06,-5e-06,1e-05,-6e-06,4e-06,-1e-06,-3e-06,-3e-06,-1.9e-05,0,-2e-06,6e-06,6e-06,1.8e-05,3e-06,-1e-06,-3e-06,1e-06,-1.4e-05,-4e-06,1.2e-05,1e-05,7e-06,3.5e-05,-6e-06,2e-06,-1.5e-05,-1.1e-05,-6e-06,-5e-06,6e-06,1.7e-05,-1e-06,-3e-06,1.2e-05,-1e-05,-1e-06,5e-06,-1e-05,2.7e-05,-3e-06,-2e-06,1e-05,-1e-05,-4e-06,-5e-06,-4e-06,9e-06,-6e-06,4e-06,9e-06,1.4e-05,1.5e-05,1e-06,-4e-06,1.1e-05,-1.2e-05,-5e-06,1.5e-05,6e-06,8e-06,2.3e-05,8e-06,6e-06,9e-06,3e-06,-2e-06,5e-06,9e-06,-1.2e-05,3.9e-05,-7e-06,-1.3e-05,-1e-06,8e-06,-2.1e-05,-2e-06,7e-06,0,1e-06,9e-06,9e-06,-1e-06,-5e-06,6e-06,8e-06,-2e-06,-1.5e-05,2e-06,1e-06,9e-06,-1e-05,9e-06,0,-3e-06,8e-06,1e-05,-1.6e-05,-2.1e-05,-4e-06,-5e-06,-1e-06,-1e-05,-4e-06,-1e-05,-5e-06,-2e-06,-2.4e-05,2e-06,-1.1e-05,-1e-05,-9e-06,-1.2e-05,1.4e-05,2.9e-05
-2e-06,-8e-06,-4e-06,-6e-06,1.1e-05,-7e-06,-3e-06,4e-06,-1.6e-05,-1e-06,-4e-06,-3e-06,1e-06,-6e-06,1.5e-05,0,-1.5e-05,-3e-06,-4e-06,3.2e-05,4e-06,-4e-06,2e-06,2e-06,3e-06,8e-06,-8e-06,-3e-06,-9e-06,-3.7e-05,8e-06,-1e-06,1.9e-05,-1e-06,2e-06,8e-06,7e-06,6e-06,2e-06,1e-06,-2e-06,-3e-06,-4e-06,-2.6e-05,-1.5e-05,-1.1e-05,0,-4e-06,-1.5e-05,-1.4e-05,1.1e-05,7e-06,-7e-06,6e-06,-2e-06,-6e-06,-4e-06,-2.9e-05,-1e-05,-2e-06,6e-06,-1.2e-05,7e-06,-3e-06,-1.3e-05,8e-06,-1e-06,-5e-06,-1.5e-05,-2e-06,8e-06,3e-06,0,2.6e-05,5e-06,-6e-06,-2.8e-05,3e-06,1.2e-05,2e-06,-1.9e-05,1.6e-05,6e-06,-2e-06,-5e-06,1.9e-05,-3e-05,-2e-06,4e-06,-1e-06,1.2e-05,-5e-06,1e-06,-1.1e-05,-1e-06,2.1e-05,8e-06,1e-06,-6e-06,-1.4e-05,1e-06,1e-06,-2.5e-05,1.6e-05,2.5e-05,6e-06,4e-06,-3e-06,2e-06,-1e-05,-5e-06,1.8e-05,0,2.3e-05,-3e-06,2.3e-05,7e-06,-1.5e-05,1.1e-05,-2e-06,-2.5e-05
-1e-06,6e-06,-8e-06,-1.4e-05,-1.4e-05,6e-06,1e-06,0,1.9e-05,4e-06,-1e-06,2e-06,4e-06,3e-06,-6e-06,1e-06,1.6e-05,0,1e-06,-5.2e-05,-1.6e-05,5e-06,-2e-06,0,1.1e-05,-8e-06,-4e-06,4e-06,8e-06,1.7e-05,-2e-06,0,-1.8e-05,1.5e-05,9e-06,-6e-06,-5e-06,-1.8e-05,0,-1e-06,-5e-06,7e-06,5e-06,3.9e-05,1.6e-05,-1.5e-05,4e-06,1e-06,1.5e-05,9e-06,-5e-06,0,1.3e-05,-1.3e-05,4e-06,-4e-06,-2e-06,-1e-05,1.1e-05,2e-06,-1.2e-05,1e-06,-4e-06,1.4e-05,8e-06,-1.5e-05,-6e-06,-1.6e-05,5e-06,-3e-06,3e-06,-4e-06,0,-2.3e-05,-7e-06,1.2e-05,2.4e-05,0,-8e-06,2e-06,1.2e-05,-9e-06,-4e-06,2e-06,6e-06,-1.9e-05,6e-06,-5e-06,8e-06,3e-06,-7e-06,7e-06,0,2.7e-05,-4e-06,-7e-06,-1.3e-05,-2e-06,-8e-06,2e-06,4e-06,-6e-06,1.7e-05,-4e-06,2e-06,-4e-06,2e-06,-3e-06,4e-06,1.4e-05,7e-06,-1.5e-05,-7e-06,3e-06,-1e-06,-2.3e-05,1e-06,3.2e-05,-5e-06,-1.4e-05,-7e-06
0,3e-06,1.6e-05,9e-06,2e-06,5e-06,5e-06,0,-1.4e-05,-3e-06,3e-06,-3e-06,0,8e-06,-3e-06,1e-06,-2e-06,1e-06,3e-06,0,1.8e-05,-5e-06,3e-06,0,0,4e-06,5e-06,-6e-06,-6e-06,6e-06,-6e-06,-5e-06,1.6e-05,-2.5e-05,-1e-05,6e-06,-7e-06,9e-06,0,1e-06,-4e-06,-4e-06,0,-3.4e-05,-2.3e-05,3.4e-05,0,4e-06,-1e-05,1e-05,1.5e-05,-7e-06,-1.2e-05,1e-06,-7e-06,0,1.2e-05,2.7e-05,-1.1e-05,2e-06,-2e-06,5e-06,-2e-06,-1.1e-05,-1.4e-05,-5e-06,-8e-06,2e-06,5e-06,3e-06,-2e-06,5e-06,0,-1.3e-05,6e-06,4e-06,-1.2e-05,5e-06,7e-06,-1e-06,7e-06,1e-06,-2e-06,-7e-06,-4e-06,2e-06,1.3e-05,9e-06,4e-06,0,-1.6e-05,-4e-06,0,-9e-06,1e-06,-1.5e-05,1e-06,7e-06,4e-06,7e-06,2e-06,-5e-06,-9e-06,-7e-06,-2.1e-05,-4e-06,2e-06,0,-4e-06,-8e-06,2e-06,-1e-06,1e-06,1.1e-05,6e-06,4e-06,-4e-06,-1.1e-05,4e-06,5e-06,-1.3e-05
-5e-06,-6e-06,-2e-05,8e-06,2e-06,-1.8e-05,0,0,8e-06,-1e-06,-1e-06,-1e-06,-2e-06,-6e-06,1.3e-05,0,-1e-05,-2e-06,-5e-06,4.8e-05,-6e-06,-1e-06,-1e-06,1e-06,-1.2e-05,-2e-06,-1.3e-05,3e-06,3e-06,-2.2e-05,6e-06,3e-06,-2e-05,-3e-06,0,-6e-06,6e-06,9e-06,1e-06,-2e-06,7e-06,-4e-06,-3e-06,1.9e-05,2.5e-05,-3.3e-05,-1e-06,1e-06,3e-06,8e-06,-2.5e-05,4e-06,9e-06,5e-06,1e-06,-1e-06,-1.1e-05,7e-06,3e-06,0,0,-6e-06,2e-06,3e-06,9e-06,-2e-05,1e-06,1.4e-05,-5e-06,2e-06,-2e-06,-1.2e-05,-1e-06,3.3e-05,4e-06,-1.2e-05,-1e-05,-6e-06,-1e-05,-2e-06,-1.1e-05,6e-06,1e-06,2e-06,1e-06,-3e-06,-2.5e-05,-9e-06,-1.8e-05,1e-06,2e-06,2e-06,1e-06,-1.4e-05,-3e-06,-3e-06,7e-06,-6e-06,8e-06,-1e-06,-1e-06,-1e-06,1.2e-05,1.1e-05,8e-06,5e-06,1e-06,2e-06,2e-06,-5e-06,-5e-06,-6e-06,3e-06,-2.3e-05,-7e-06,2.1e-05,0,-9e-06,-7e-06,1.5e-05,1.2e-05
2e-06,0,2.2e-05,0,9e-06,1.3e-05,-5e-06,3e-06,-5e-06,6e-06,-3e-06,6e-06,-3e-06,-1e-06,-1.2e-05,-1e-06,1.1e-05,1e-06,1e-06,-3e-05,2e-06,0,-1e-06,1e-06,1e-06,-1e-06,5e-06,0,1e-06,2.9e-05,1e-06,3e-06,2.4e-05,2.6e-05,4e-06,2e-06,2e-06,-1.5e-05,0,1e-06,0,7e-06,3e-06,-2e-06,-2e-06,2e-05,-1e-06,-3e-06,3e-06,-1.4e-05,9e-06,3e-06,-3e-06,2e-06,2e-06,3e-06,3e-06,-1.9e-05,0,-3e-06,-2e-06,6e-06,-2e-06,-3e-06,-1.3e-05,1.6e-05,9e-06,-2e-06,5e-06,-1e-06,-5e-06,1.9e-05,2e-06,-2.3e-05,-1.4e-05,-4e-06,1.1e-05,2e-06,8e-06,0,1.7e-05,-1.1e-05,1e-06,4e-06,1e-06,1.2e-05,2.5e-05,5e-06,1.4e-05,3e-06,1e-05,1e-06,1e-06,2e-05,0,5e-06,2e-06,7e-06,-3e-06,1e-06,-4e-06,1e-06,-5e-06,-5e-06,1.5e-05,2e-06,3e-06,1e-06,3e-06,1.3e-05,-1e-06,9e-06,1e-06,1.4e-05,4e-06,-2.7e-05,4e-06,-4e-06,6e-06,-6e-06,7e-06
3e-06,4e-06,-4e-06,-1.1e-05,-1.5e-05,2e-06,-3e-06,-4e-06,1e-06,-1e-06,3e-06,-5e-06,-2e-06,1e-06,6e-06,0,-3e-06,0,-1e-06,-1.3e-05,0,3e-06,2e-06,-1e-06,1.1e-05,3e-06,2e-06,-2e-06,-5e-06,-1.3e-05,-3e-06,0,-1.8e-05,-7e-06,-5e-06,2e-06,-7e-06,5e-06,0,-1e-06,-2e-06,-2e-06,-2e-06,-1.6e-05,-1.3e-05,3e-06,5e-06,-3e-06,-6e-06,-8e-06,7e-06,-5e-06,5e-06,-6e-06,-4e-06,-3e-06,4e-06,-1.3e-05,4e-06,-2e-06,7e-06,-3e-06,4e-06,3e-06,1.1e-05,2e-06,3e-06,-1e-05,-5e-06,-6e-06,-6e-06,-1.9e-05,-1e-06,6e-06,3e-06,1.6e-05,-2.4e-05,1e-06,-8e-06,1e-06,-7e-06,1.7e-05,-1e-06,-1e-06,-1e-06,-1.8e-05,4e-06,0,-1.1e-05,0,7e-06,-5e-06,0,-1.4e-05,2e-06,1.6e-05,-9e-06,-1.2e-05,-7e-06,-5e-06,0,3e-06,-1.1e-05,0,-1.5e-05,-9e-06,-1e-06,1e-06,-6e-06,-5e-06,6e-06,5e-06,1e-06,1.1e-05,0,9e-06,-2e-06,1.8e-05,-9e-06,-1.7e-05,2.2e-05
0,-1e-06,-1.2e-05,-2e-06,6e-06,-1e-05,1e-06,0,4e-06,-4e-06,0,7e-06,0,-2e-06,5e-06,1e-06,-8e-06,-2e-06,-2e-06,1.8e-05,-1e-05,2e-06,-4e-06,-1e-06,1e-06,-4e-06,-5e-06,4e-06,7e-06,-1.2e-05,-1e-06,1e-06,1.2e-05,-1e-05,4e-06,-1e-06,1e-06,7e-06,-1e-06,2e-06,0,-3e-06,-2e-06,3.2e-05,2.5e-05,-2.5e-05,-1e-06,1e-06,7e-06,3e-06,-1.7e-05,-1e-06,-1.2e-05,-3e-06,0,4e-06,-7e-06,7e-06,-1e-06,2e-06,-6e-06,-5e-06,-5e-06,5e-06,-7e-06,-1e-05,-1e-06,2e-06,-5e-06,-1e-06,3e-06,1.1e-05,-1e-06,0,9e-06,-4e-06,3.5e-05,2e-06,7e-06,0,-1.3e-05,-2e-05,-1e-06,2e-06,1e-06,1e-05,-2.3e-05,-4e-06,1.1e-05,0,-3e-06,5e-06,-2e-06,-8e-06,-1e-06,-5e-06,-1e-06,1.1e-05,0,-1e-06,-2e-06,1e-06,1.4e-05,5e-06,-6e-06,1e-06,0,-2e-06,3e-06,-6e-06,1e-06,-4e-06,-3e-06,-4e-06,6e-06,1.1e-05,-4e-06,3e-06,7e-06,1e-06,-2.7e-05
