0.024506,0.20108,0.314521,0.258028,0.311969,0.844526,1.438007,1.358579,1.051537,0.89369,0.921188,1.060948,0.969042,0.696714,0.5356,0.455408,0.304906,0.206478,0.236363,0.218741,0.21615,0.176935,0.064787,0.023518,0.023274,0.017588,0.015126,0.013994
0.029335,0.235535,0.365185,0.301376,0.367797,0.994581,1.693431,1.566779,1.159714,0.987875,1.05813,1.225756,1.113348,0.802176,0.616132,0.521851,0.350668,0.240129,0.279546,0.261082,0.251213,0.201871,0.074257,0.027732,0.027391,0.02051,0.017504,0.016145
0.036969,0.281239,0.43058,0.358189,0.442213,1.211716,2.078855,1.868171,1.289857,1.113989,1.253127,1.423615,1.269936,0.927303,0.716739,0.597537,0.400088,0.278938,0.331323,0.313674,0.292344,0.230174,0.086889,0.03439,0.03343,0.024424,0.020522,0.018857
0.040935,0.282538,0.428134,0.362251,0.454662,1.312295,2.289553,2.011779,1.365818,1.24499,1.358132,1.401451,1.199021,0.903633,0.714859,0.573101,0.374125,0.265755,0.31799,0.310242,0.285481,0.222771,0.089271,0.03806,0.035712,0.025305,0.020627,0.018753
0.04069,0.244597,0.37119,0.326826,0.425539,1.328435,2.354617,2.097308,1.527261,1.457768,1.437424,1.254249,1.001737,0.788415,0.632748,0.476954,0.297166,0.212824,0.259248,0.274859,0.262956,0.207176,0.087468,0.037564,0.033678,0.024075,0.019071,0.016841
0.041115,0.233777,0.361472,0.325114,0.428712,1.35956,2.399989,2.277678,1.876231,1.802759,1.655747,1.283639,0.993022,0.798976,0.587813,0.411016,0.248891,0.184917,0.242385,0.272321,0.265943,0.210831,0.089423,0.038603,0.031964,0.022475,0.018634,0.016808
0.047994,0.294505,0.461446,0.411961,0.526834,1.577253,2.814545,2.913028,2.617771,2.450998,2.217265,1.705007,1.35878,1.115946,0.728384,0.466986,0.282718,0.232525,0.308281,0.324142,0.296942,0.224618,0.092543,0.046238,0.036069,0.023418,0.021282,0.020394
0.065997,0.417189,0.652375,0.572126,0.724035,2.104111,3.901582,4.334552,4.15656,3.972885,3.656335,2.899236,2.335914,1.923623,1.236898,0.771642,0.461332,0.368876,0.442374,0.434886,0.386121,0.276583,0.104821,0.058549,0.044879,0.027604,0.026256,0.025812
0.095161,0.580341,0.887576,0.739987,0.978364,3.040235,5.80897,6.693378,6.741649,6.62471,6.178511,5.001107,3.947362,3.189661,2.080692,1.300238,0.779405,0.579812,0.619667,0.593528,0.519968,0.35552,0.125745,0.072228,0.056326,0.035976,0.033763,0.032537
0.133465,0.783942,1.150631,0.852406,1.216497,4.208262,8.122964,9.661105,10.217362,10.210167,9.54322,7.804841,5.985135,4.708208,3.15732,1.98942,1.200503,0.829266,0.779033,0.74305,0.650361,0.429894,0.147961,0.086273,0.070306,0.048154,0.042833,0.039833
0.169542,0.966485,1.35919,0.878837,1.392751,5.143139,9.907291,12.448291,13.806689,13.802268,12.888989,10.619035,7.942696,6.067346,4.187521,2.651618,1.599486,1.029959,0.862412,0.849912,0.732252,0.460763,0.166455,0.098391,0.083299,0.060757,0.05163,0.046097
0.18303,1.001726,1.368833,0.830348,1.484174,5.340122,10.408103,14.107455,15.944832,15.735181,14.681237,12.178984,9.080055,6.712894,4.690617,2.955455,1.748334,1.06549,0.852211,0.88699,0.716774,0.4164,0.172154,0.10997,0.093742,0.068375,0.058283,0.05058
0.160218,0.826638,1.127762,0.762346,1.541225,4.92134,9.471536,13.528917,15.037839,14.287845,13.329072,11.260802,8.492021,6.048316,4.178647,2.587885,1.475251,0.889517,0.77097,0.82114,0.59125,0.30962,0.155708,0.11807,0.097466,0.064676,0.056914,0.048288
0.118505,0.555682,0.803131,0.693873,1.502916,4.286698,7.611047,10.47785,11.060495,9.957181,9.412268,8.20247,6.185669,4.18814,2.793901,1.695674,0.919462,0.569783,0.598149,0.654118,0.434782,0.219169,0.139164,0.126179,0.097537,0.050525,0.044091,0.037221
0.093659,0.422861,0.694239,0.715746,1.417289,3.927493,6.116892,6.867769,6.369666,5.572531,5.446207,4.652535,3.388463,2.187314,1.383578,0.843648,0.463979,0.32677,0.456726,0.536869,0.356792,0.205058,0.154852,0.146024,0.106327,0.03804,0.028298,0.024789
0.105835,0.567893,0.939546,0.839894,1.283726,3.582286,5.185192,4.803758,3.908685,3.377885,3.232788,2.424569,1.589199,0.98899,0.590708,0.380367,0.258993,0.232153,0.460701,0.62037,0.408333,0.245597,0.202273,0.190257,0.135939,0.039553,0.022861,0.020234
0.139153,0.868669,1.414575,1.096193,1.242954,3.383336,5.026926,4.295433,2.961907,2.280806,2.070476,1.501897,1.051482,0.727618,0.431716,0.275563,0.223829,0.23463,0.589429,0.872517,0.559765,0.303515,0.263408,0.266246,0.191331,0.051988,0.026015,0.022652
0.177892,1.208177,1.971832,1.475893,1.298615,3.166345,5.320759,4.679706,2.85326,2.151992,2.027746,1.6641,1.383149,1.038891,0.600082,0.358083,0.263321,0.263805,0.754836,1.178959,0.741361,0.348102,0.316697,0.363792,0.263016,0.06632,0.032852,0.02915
0.214462,1.432997,2.344508,1.788625,1.508598,3.633748,6.463748,5.688838,3.549551,3.052808,2.86836,2.444293,2.172409,1.627159,0.917335,0.52259,0.320488,0.291607,0.881218,1.402836,0.884526,0.380031,0.342683,0.436801,0.318265,0.074066,0.038304,0.037967
0.236693,1.420613,2.319121,1.887575,1.776469,4.803208,8.205471,6.733102,4.553337,4.471386,4.096929,3.495428,3.168865,2.304746,1.283956,0.719122,0.382063,0.334879,0.926582,1.424046,0.911652,0.397858,0.34274,0.461102,0.340061,0.074647,0.040784,0.046268
0.241754,1.217705,1.938033,1.673899,1.878284,5.893896,9.488296,7.361157,5.565577,5.899516,5.231534,4.405762,4.010548,2.794817,1.545843,0.860622,0.40068,0.361516,0.855126,1.21494,0.812265,0.403173,0.327938,0.440306,0.325255,0.072792,0.045499,0.055937
0.227112,0.990534,1.490087,1.25414,1.77157,6.35514,9.637976,7.472549,6.438131,6.710166,5.556029,4.582281,4.224815,2.943617,1.679233,0.905551,0.373494,0.371362,0.731857,0.926791,0.646378,0.365743,0.289754,0.365166,0.265786,0.068788,0.055853,0.074677
0.196321,0.811352,1.143084,0.869251,1.536981,5.650019,8.102783,6.781541,6.696196,6.467855,4.914217,3.92018,3.723018,2.862832,1.754435,0.882887,0.36246,0.399563,0.652978,0.71872,0.500616,0.300983,0.238182,0.25726,0.180768,0.065727,0.076709,0.110898
0.158847,0.627007,0.828654,0.607296,1.294018,4.204271,6.089633,6.04225,6.363753,5.738111,4.211976,3.186115,2.882929,2.470708,1.691127,0.866138,0.392673,0.41446,0.629721,0.64804,0.430406,0.237774,0.177305,0.158909,0.109594,0.070802,0.108319,0.153414
0.126029,0.457923,0.589463,0.463436,1.170641,3.362439,5.227058,5.723532,5.727041,4.921747,3.691042,2.771347,2.151818,1.94588,1.58542,0.903308,0.419771,0.375006,0.624893,0.651639,0.387295,0.186279,0.129272,0.091783,0.070324,0.082857,0.134614,0.175119
0.09521,0.357076,0.477384,0.384302,1.243493,3.804533,5.687982,5.398469,4.575362,3.528845,2.760283,2.373461,1.765257,1.629672,1.507671,0.925213,0.396561,0.306774,0.568658,0.59788,0.320363,0.140688,0.097009,0.067236,0.065959,0.089032,0.133092,0.155468
0.071119,0.285846,0.399194,0.320232,1.317357,4.193022,5.758168,4.482369,3.0326,2.060902,1.814668,1.972734,1.637521,1.46488,1.305306,0.804572,0.335696,0.276157,0.505965,0.518946,0.266147,0.103761,0.073135,0.069481,0.075859,0.078093,0.09718,0.100985
0.061102,0.225852,0.326043,0.303605,1.33555,3.979678,4.863874,3.182043,1.841324,1.291088,1.37572,1.546263,1.456979,1.389081,1.071272,0.594515,0.271176,0.264109,0.482112,0.501562,0.261743,0.093484,0.06848,0.081637,0.079619,0.053172,0.050596,0.047232
0.055858,0.177404,0.265383,0.304934,1.232845,3.425297,3.772504,2.282394,1.54661,1.252283,1.348996,1.292368,1.226711,1.389451,1.015076,0.494379,0.254701,0.265209,0.487861,0.535938,0.29549,0.094074,0.068958,0.08909,0.074602,0.034346,0.029995,0.032453
0.05567,0.148495,0.224131,0.294509,1.033371,2.674747,2.979146,1.996862,1.588018,1.347437,1.295361,1.162469,1.118666,1.278482,0.93005,0.45946,0.238186,0.263351,0.515674,0.594801,0.330196,0.092268,0.067334,0.0873,0.072764,0.040051,0.037929,0.039966
0.06534,0.153514,0.230871,0.294418,0.808013,1.968788,2.383093,1.866726,1.59603,1.427352,1.221019,0.976242,0.975079,1.016029,0.743286,0.477529,0.252476,0.230409,0.479182,0.583378,0.329553,0.085107,0.064225,0.079535,0.071903,0.052637,0.051352,0.053862
0.074741,0.188056,0.278659,0.313436,0.763271,1.89589,2.151081,1.638635,1.538478,1.439321,1.164296,0.852087,0.86127,0.838834,0.624187,0.505672,0.263347,0.169227,0.358166,0.466435,0.287175,0.081083,0.066108,0.078994,0.076295,0.062527,0.060298,0.064387
0.070742,0.20898,0.30126,0.32373,0.821639,2.004309,2.239511,1.612256,1.35806,1.233636,1.08183,0.864049,0.818605,0.820532,0.642873,0.498231,0.246546,0.121611,0.256277,0.350563,0.231557,0.075194,0.064536,0.071581,0.072025,0.060759,0.056294,0.061572
0.052796,0.207449,0.305577,0.314223,0.850542,1.958885,2.221587,1.701773,1.265949,0.914706,0.823881,0.816924,0.841605,0.839951,0.642468,0.42908,0.197542,0.105109,0.251848,0.344492,0.207008,0.066444,0.053715,0.053702,0.056309,0.045742,0.03972,0.04471
0.036754,0.20085,0.315848,0.308956,0.810518,1.964597,2.192559,1.690105,1.38116,0.823652,0.53851,0.654049,0.801458,0.788775,0.582737,0.323841,0.135097,0.086088,0.23419,0.334582,0.200241,0.064615,0.040295,0.039808,0.044326,0.028842,0.023298,0.027367
0.032579,0.187836,0.312383,0.302845,0.70116,2.079542,2.375539,1.617465,1.424441,0.866378,0.450849,0.505996,0.62459,0.607862,0.44352,0.212006,0.084562,0.073671,0.193344,0.28625,0.193624,0.071625,0.035113,0.034297,0.036426,0.020384,0.017952,0.023308
0.032426,0.1618,0.267423,0.265977,0.605525,2.100161,2.49658,1.492893,1.23597,0.806053,0.422617,0.394315,0.40854,0.41196,0.281036,0.125923,0.054117,0.085889,0.190429,0.258311,0.197063,0.079512,0.03347,0.032377,0.029374,0.014257,0.015945,0.021066
0.029752,0.127303,0.203007,0.219208,0.574748,1.936779,2.243022,1.187549,0.892958,0.632875,0.34552,0.282991,0.280346,0.315579,0.175452,0.081885,0.048668,0.109027,0.25352,0.339843,0.247991,0.091566,0.035492,0.029103,0.025127,0.01515,0.021237,0.022066
0.027365,0.098705,0.171853,0.187123,0.518637,1.572471,1.72051,1.007318,0.701468,0.49156,0.288112,0.234899,0.247706,0.279513,0.147484,0.065777,0.050569,0.128247,0.31344,0.42788,0.301719,0.105756,0.038578,0.027218,0.025756,0.021446,0.030013,0.028727
0.025013,0.080028,0.140604,0.168052,0.443316,1.132101,1.255791,1.048323,0.790868,0.407155,0.233201,0.242482,0.309978,0.336348,0.177109,0.069506,0.051518,0.137152,0.335222,0.458842,0.324492,0.10727,0.039446,0.031868,0.033899,0.031628,0.03735,0.034684
