-0.000103,-3.2e-05,-4.7e-05,-9.2e-05,-0.000384,-0.000387,-6.7e-05,-0.000291,-0.010471,-0.01536,-0.002788,-0.040634,-0.154591,-0.19843,-0.180708,-0.15714,-0.155473,-0.148527,-0.140334,-0.104816,-0.038806,-0.010617,-0.004744,-0.001517,-0.001053,-0.000783,-0.000538,-0.000221
-6.4e-05,1.4e-05,2.7e-05,6.7e-05,0.00018,0.000105,2.7e-05,0.000222,0.008155,0.010037,0.000752,0.04786,0.136421,0.088636,0.095326,0.144131,0.119551,0.131206,0.107842,0.090249,0.03539,0.001583,0.0043,0.001239,0.000582,0.00085,0.000619,0.000233
-1.2e-05,-1.5e-05,-1.4e-05,-1.3e-05,3e-05,4.3e-05,5e-06,1.5e-05,0.002909,0.006313,0.000608,-0.001738,0.007472,-0.004153,-0.032068,-0.033647,-0.047681,-0.038531,-0.035462,-0.033535,-0.023668,-0.007714,-0.002049,-0.000588,-2e-06,-9.1e-05,-7.5e-05,-9.4e-05
4.6e-05,-2.8e-05,-4.5e-05,-8.5e-05,-1e-04,-2.7e-05,-3.3e-05,-0.000144,-0.006356,-0.008541,-0.001553,-0.047457,-0.136686,-0.107498,-0.11313,-0.135451,-0.11518,-0.118851,-0.105992,-0.086684,-0.030951,-0.00721,-0.004408,-0.001178,-0.000513,-0.000835,-0.000623,-0.000198
8.7e-05,2.9e-05,3.5e-05,5.8e-05,0.000174,0.000167,2.8e-05,0.000112,0.00195,0.000649,0.000517,0.023491,0.104097,0.147716,0.145335,0.135646,0.162761,0.148451,0.141023,0.115507,0.054543,0.014958,0.005775,0.001627,0.000585,0.00074,0.000534,0.000265
1e-06,2.4e-05,3.2e-05,5.3e-05,-5.1e-05,-0.000109,1.4e-05,5e-06,0.00179,0.002185,-0.000976,0.014881,0.063558,0.057611,0.041757,0.039967,0.048759,0.035727,0.040094,0.027051,0.003496,0.007245,0.000995,0.000127,-4e-05,0.000236,0.00023,3.7e-05
-8.6e-05,-1.2e-05,-2.2e-05,-4.6e-05,-0.00016,-0.000163,-2.9e-05,-7.6e-05,-0.001422,0.000486,0.000712,-0.02986,-0.134252,-0.190007,-0.170318,-0.132906,-0.133511,-0.130343,-0.125287,-0.098321,-0.035364,-0.008589,-0.004981,-0.00127,-0.000388,-0.000854,-0.000622,-0.000201
-4.3e-05,-5e-06,-1e-06,-3e-06,6.8e-05,0.000102,5e-06,2.3e-05,-0.000908,-0.001457,0.000847,0.005499,0.019257,0.00612,0.010881,0.04635,0.027755,0.047582,0.04058,0.038828,0.021579,-0.000463,0.002533,0.000905,0.000577,0.000331,0.000206,9.9e-05
3.7e-05,-4e-06,1e-05,3e-05,0.000182,0.000196,2.7e-05,2.1e-05,0.000573,-0.000408,-0.000292,0.015975,0.08808,0.121366,0.091638,0.064848,0.033828,0.042109,0.037275,0.025827,-0.004635,-0.002103,0.001171,-9e-06,-0.000291,0.000346,0.000316,5e-06
5.9e-05,-1.3e-05,-2.1e-05,-3e-05,-7.3e-05,-8.9e-05,-1.6e-05,4.8e-05,0.002292,0.002326,-0.000161,-0.012344,-0.062715,-0.057978,-0.045892,-0.070425,-0.068185,-0.077157,-0.080665,-0.06226,-0.023558,-0.007514,-0.003519,-0.001109,-0.000827,-0.000664,-0.000415,-0.000106
1.4e-05,-2e-06,-1.6e-05,-3.7e-05,-0.000187,-0.000195,-3.2e-05,-6.2e-05,-0.001671,-0.000762,-0.00016,-0.009727,-0.02146,-0.018466,-0.001043,0.001546,0.034408,0.026841,0.036301,0.032624,0.025981,0.005836,0.001842,0.000825,0.000578,0.000113,3.4e-05,9.6e-05
-3.1e-05,1.6e-05,2e-05,3.6e-05,0.000103,9.6e-05,1.4e-05,-8.9e-05,-0.003004,-0.003194,-0.001033,0.003073,0.056032,0.079656,0.061297,0.050718,0.071768,0.065356,0.069521,0.0455,0.009259,0.008909,0.001786,0.000563,0.00048,0.000523,0.000362,4.5e-05
-4.1e-05,1.5e-05,2e-05,3.9e-05,8.5e-05,7.9e-05,3.1e-05,0.000126,0.003724,0.002823,-0.000143,0.004852,-0.030502,-0.055403,-0.042018,-0.039756,-0.044783,-0.042063,-0.05603,-0.047678,-0.018496,-0.002738,-0.002678,-0.000903,-0.000524,-0.000416,-0.000254,-8.5e-05
-1.5e-05,-3e-06,-6e-06,-2.4e-05,-8.9e-05,-7.2e-05,-7e-06,5.2e-05,0.001349,0.001647,0.000751,-0.002595,-0.031993,-0.057709,-0.045906,-0.032515,-0.0455,-0.037943,-0.026986,-0.015845,0.00326,-0.003194,0.000436,0.000163,8.6e-05,-0.00015,-0.000165,-1.1e-05
4.2e-05,-8e-06,-1e-06,-3e-06,4e-05,4.9e-05,-1.3e-05,-0.000149,-0.005209,-0.004639,0.000103,-0.00217,0.044105,0.080398,0.058686,0.051879,0.028918,0.025345,0.032082,0.031375,0.000771,-0.000341,0.001916,0.000489,0.000291,0.000488,3e-04,1.9e-05
5.2e-05,-4e-06,8e-06,2.8e-05,4.3e-05,3.2e-05,1.3e-05,5.6e-05,0.002356,0.002383,0.000437,0.01047,0.008082,0.014435,0.025706,0.025353,0.001591,0.002669,-0.023191,-0.012444,-0.006568,-0.003762,-0.001193,-0.000594,-0.000365,-0.00011,-2.5e-05,-1.8e-05
-1.5e-05,-8e-06,-1.9e-05,-3.9e-05,-0.000102,-0.000101,-5e-06,8.1e-05,0.003498,0.002956,-0.000508,0.002125,-0.024905,-0.061579,-0.049331,-0.044665,-0.019055,-0.014356,-0.001296,-0.011323,0.005938,0.000121,-0.000401,1.9e-05,-1.8e-05,-0.000262,-0.000197,2e-05
-5.3e-05,-2e-06,-1.7e-05,-3.1e-05,4.3e-05,5.3e-05,-1.8e-05,-0.000121,-0.004722,-0.00475,0.000243,-0.008822,0.01898,0.028881,-0.007953,0.000399,0.0416,0.029392,0.052048,0.034016,0.005767,0.006766,0.000972,0.000453,0.000235,0.000266,0.000147,4e-05
-1.6e-05,8e-06,1.6e-05,4e-05,2.4e-05,6e-06,5e-06,1.6e-05,-2.2e-05,0.000288,0.000351,0.004946,0.002114,0.01301,0.015986,0.036673,0.025212,0.02011,-0.012371,0.000345,0.001684,0.002678,-0.000414,-0.000339,-0.000157,2.9e-05,6.7e-05,-1.3e-05
