8.2e-05,-0.00011,-0.000321,-0.000122,-0.000452,-0.000207,-0.000654,1.7e-05,-0.000156,-0.000364,-5e-04,-0.000148,-0.000206,-9.4e-05,-0.000106,-0.000146,-0.000733,-0.000325,-0.000319,-0.000296,-0.000462,-7e-06,0.000138,-3.4e-05,-0.000139,2.1e-05,-0.000172,-0.000287,-4.8e-05,-5.2e-05,-2.4e-05,-0.000191,-0.000437,-0.000308,-0.000363,-0.000413,-0.000417,-0.000325,-0.000283,-0.000272,-0.000313,-0.000265,-0.000236,-1.6e-05,-0.000166,-0.000171,-3.9e-05,-8.3e-05,-0.000582,-0.000569,-0.000406,-0.000561,-8.2e-05,-0.000406,-0.000391,-0.000198,-0.000134,-0.000352,-0.000402,-0.000632,-0.000448,-0.000218,8e-05,-0.00023,-0.000335,-0.000283,-0.000432,-0.000105,-0.00027,-0.000483,-0.000179,-0.00014,-0.000351,0.00017,-0.000119,-0.000227,-0.000568,-0.000488,-0.000196,-0.000581,-0.000312,-0.000483,-0.000426,-0.000195,-0.000186,-0.000205,-0.000171,-0.000138,-0.000109,-0.000471,-0.000384,-4.7e-05,-0.000354,-0.000172,-0.000302,-0.000369,-8.3e-05,-8.7e-05,-0.000134,-0.000252,-0.000343,1.4e-05,-0.000168,-0.00014,-0.000118,-0.000177,-0.000261,8e-06,-0.000276,-0.000111,-0.000334,-8.1e-05,-0.000166,-0.000128,-7.9e-05,-0.000328,-0.000171,-0.000177,-0.000348,-9.1e-05,-3.4e-05
-0.000405,-0.000295,0.000126,-0.000122,-7.4e-05,-7e-06,0.000242,-4.3e-05,7e-06,-0.000413,-8.3e-05,-0.000118,2.4e-05,-0.000296,-0.000357,-0.000398,0.000215,0.000244,3.4e-05,1e-05,-0.000111,-8.4e-05,-0.000244,-0.000152,-6.7e-05,-9.9e-05,2.4e-05,0.000118,-1.2e-05,-0.000142,-0.000359,-6.5e-05,-0.000114,-0.00014,0.000118,-6.9e-05,8.3e-05,0.00011,2e-05,0.000152,7.1e-05,2.7e-05,6.5e-05,-8.6e-05,4.1e-05,0.000281,5.5e-05,-0.000249,0.000154,0.000236,-5.7e-05,0.00019,-3.5e-05,0.000108,0.000249,6.3e-05,7.2e-05,-1.6e-05,-2.5e-05,0.000127,-5e-06,0.000208,9.5e-05,0.000216,-9e-06,0.000145,9.1e-05,-0.000269,-0.000125,0.000126,0.000157,-0.000277,-4e-06,0.000107,0.00024,7.9e-05,0.000299,0.000233,0.000157,0.000133,-0.000274,0.000166,-6e-05,-0.000126,-0.000187,-6.1e-05,9.7e-05,0.000104,-2.8e-05,0.000202,0.000125,3.4e-05,-0.000146,-7.2e-05,4e-05,0.000144,0.000243,-0.000115,6.5e-05,-3.6e-05,0.000203,-0.000359,-0.000268,-0.000142,-0.000185,-8.8e-05,-4.7e-05,-0.000267,-4.5e-05,5.9e-05,5.5e-05,-1.2e-05,-8.4e-05,-0.000121,-0.000326,-2.4e-05,-6e-06,0.000111,6.2e-05,8.1e-05,0.000138
-0.000202,-9.1e-05,-0.000386,-0.000303,-0.00016,-3.4e-05,-0.000331,-0.000456,-0.000282,0.000226,0.000247,0.000163,-1.8e-05,0.000238,7.7e-05,0.00021,-0.000327,-0.000138,-2.4e-05,-5.8e-05,0.000209,0.000157,0.000156,2.9e-05,-1.1e-05,-0.000272,-3.5e-05,-0.000124,-0.000185,-0.000234,-9.4e-05,-0.000303,4.6e-05,4.4e-05,-0.000299,-0.000109,-0.000118,-1.5e-05,0.000144,-0.000194,-0.000343,3.7e-05,-0.000151,-0.000137,-0.000262,-0.000287,-8.5e-05,0.000231,-0.000147,-0.000284,-0.000188,-0.000143,-9.6e-05,-0.000138,-0.00012,-0.000184,-6.4e-05,0.00017,0.000153,-1e-05,-7.9e-05,-3.8e-05,-0.000142,-0.000205,-9e-05,-0.000114,0.000118,-0.000286,-0.000174,-5e-05,-0.000172,0.000182,0.00012,-0.000276,-0.000172,6.8e-05,2.8e-05,0.000115,1.1e-05,-1.5e-05,-0.000156,-0.000302,-0.000106,-5.6e-05,-0.000166,1.5e-05,-0.000193,-0.000122,-0.00011,-0.000384,-0.000234,-0.00025,1.4e-05,-9.8e-05,-0.000128,-0.000278,-0.000161,-0.000162,-8.1e-05,-6.8e-05,-0.00017,-5.4e-05,-0.000147,-2.9e-05,-1.3e-05,-0.000141,-0.000159,2.5e-05,-0.000131,-0.000317,-0.000131,6.5e-05,0.000187,-0.000106,0.000164,-0.00012,7.5e-05,-0.000173,-0.000191,6.2e-05,1.4e-05
-2.7e-05,-0.000154,9.6e-05,-5.5e-05,-5.1e-05,-0.000199,9.9e-05,-0.000239,3.7e-05,-0.000213,-0.000456,-7.7e-05,0.000123,-2.3e-05,-4.8e-05,-0.000234,0.000148,-3.8e-05,5.4e-05,8.8e-05,-0.000118,-0.000178,-0.000133,-0.00013,-1.8e-05,1.4e-05,-0.000139,0.000205,-3.5e-05,2e-06,3.3e-05,0.000109,8.5e-05,-2.4e-05,6.9e-05,0.000139,5.4e-05,6.2e-05,-4e-06,-0.000171,8.1e-05,-7.9e-05,-7.8e-05,-6.2e-05,-3.4e-05,4.3e-05,-6.9e-05,-1e-05,-3e-06,-4.9e-05,0.000146,-4.7e-05,-8.9e-05,-8e-05,-6.7e-05,1.3e-05,9.9e-05,6.8e-05,9e-06,-0.000111,-0.00015,-0.000199,-0.000146,0.000183,0.000148,0.00023,-0.000165,8.6e-05,-1e-04,-0.000156,-8.3e-05,3.7e-05,-3e-05,-0.000177,0.000176,9e-06,0.000158,-0.000108,3e-06,-6.5e-05,0.000113,-7.8e-05,7.9e-05,-2.6e-05,-6e-06,0.000153,2e-05,3.6e-05,-0.000145,-6.4e-05,0.000106,-2e-05,-5.5e-05,-5.9e-05,9e-05,-2.5e-05,-5e-06,5.9e-05,-1.1e-05,-0.000419,6e-06,-1.4e-05,-6e-06,-5.2e-05,-1.9e-05,-8.3e-05,5.2e-05,-0.000125,8.3e-05,2.5e-05,-2.1e-05,-3e-06,-0.000113,-0.000188,-7.1e-05,-8.5e-05,-0.000172,-5e-05,-0.000123,-4.5e-05,-0.000151
0.000106,7.6e-05,-3.9e-05,0.000201,0.000286,0.000331,6.2e-05,2.1e-05,-5.9e-05,-4.5e-05,0.000231,0.000296,8e-06,-0.000162,0.000164,0.000165,8.8e-05,0.000233,7.7e-05,7.5e-05,6.6e-05,8.3e-05,-0.000149,-0.000149,6.1e-05,0.000162,-5.6e-05,-0.000177,8.3e-05,-4.6e-05,-4.3e-05,0.000166,-2.5e-05,-0.000108,-1.7e-05,-6.9e-05,-5.8e-05,-6.1e-05,1.8e-05,5.2e-05,7.7e-05,5.2e-05,8.4e-05,0.000101,7e-05,-0.000152,-8.3e-05,-3.9e-05,0.000187,0.000162,-9.1e-05,0.000168,6.8e-05,0.000194,-3.1e-05,2.7e-05,-3.1e-05,3.1e-05,-8.8e-05,0.00012,-1.8e-05,0.000213,-2.6e-05,-3e-05,9.6e-05,-0.000104,0.000146,3.9e-05,0.000134,8.7e-05,-7e-06,-8.6e-05,0.000101,-3.4e-05,-1.8e-05,6.5e-05,-0.00026,0.000125,6.1e-05,-3e-05,0.000203,0.000238,-0.000134,1.4e-05,0.000112,4.2e-05,-5e-05,-4.8e-05,-7e-06,7.7e-05,9e-06,4e-05,0.000136,0.000126,2e-05,1.7e-05,-0.000104,-2.4e-05,9.7e-05,0.00017,-4.4e-05,0.000112,0.00022,8.7e-05,7.1e-05,0.000169,9.5e-05,1.9e-05,-2.9e-05,-9.8e-05,0.000157,7.5e-05,4.4e-05,4.8e-05,0.000275,0.000278,-2.5e-05,-9.7e-05,-3.2e-05,7.3e-05,5.8e-05
1.4e-05,0.000212,0.000259,-4e-05,6.2e-05,-8.3e-05,-6.2e-05,0.000123,-0.000217,0.000138,2.2e-05,-7e-06,-0.000127,-0.000155,-0.000249,-9.3e-05,-0.000197,-4.6e-05,-0.000161,-6.9e-05,-6.9e-05,4.3e-05,4.8e-05,7.9e-05,4e-06,-2.8e-05,-8.6e-05,0.000128,-5.7e-05,6.7e-05,0.000188,-8.6e-05,-7e-05,9.3e-05,5.9e-05,6.5e-05,-0.000138,6e-06,-5.7e-05,1.2e-05,0.000203,1.1e-05,4.5e-05,9.6e-05,0.000228,7.6e-05,-5.3e-05,-3.5e-05,-3.1e-05,-7.8e-05,-1.8e-05,-6.7e-05,-2.2e-05,0.000127,1e-05,8e-05,9.2e-05,3e-05,0.000217,-0.000112,0.000287,1e-04,-9.9e-05,-2.7e-05,-0.000222,-8e-06,-0.000124,8.6e-05,0.000123,9.7e-05,1e-06,-4.7e-05,-1.6e-05,0.000129,1e-06,3.1e-05,9.4e-05,-6.1e-05,-9.6e-05,5.3e-05,-9.3e-05,-0.000158,0.000234,0.00027,4.1e-05,3e-06,-1.6e-05,5.3e-05,9e-06,-4.9e-05,5.7e-05,-9e-06,-3.6e-05,-0.000141,3.9e-05,8.5e-05,0.000131,-2.5e-05,-0.000156,-5.2e-05,7e-05,6e-05,-0.000205,-0.000148,-3.2e-05,-2.8e-05,8.4e-05,4.5e-05,-0.000101,1.2e-05,-0.000146,-2.1e-05,1.8e-05,4e-05,6.6e-05,-0.000145,-8.3e-05,0.00024,0.000131,5.5e-05,-9.3e-05
-3.2e-05,0.000202,8e-05,-4e-06,-0.000182,-6e-05,0.000219,-0.000159,-9.1e-05,4.7e-05,-0.000145,-5.5e-05,-0.000147,-2.3e-05,-2.3e-05,-3.8e-05,6.4e-05,8.1e-05,-4.3e-05,7.7e-05,9.6e-05,-9.8e-05,3.9e-05,-0.000136,-4e-05,8.9e-05,-3e-05,-4e-06,-9.3e-05,-0.000133,-0.000227,-1e-04,-2.4e-05,-6.5e-05,-1.5e-05,-0.000187,4e-05,-6.2e-05,-2.3e-05,-0.00014,-0.00016,-5.3e-05,-6.3e-05,0.000122,7.4e-05,0.000102,-0.000163,1.6e-05,-8.3e-05,5e-06,-3.6e-05,-2.6e-05,-5.9e-05,0.000137,6.6e-05,3.6e-05,8.6e-05,-0.000116,-0.000127,0,-0.000192,4.7e-05,9.5e-05,-0.000102,1.8e-05,4e-05,-1.8e-05,-6.1e-05,-0.000165,-0.000116,-4.1e-05,-9.3e-05,-0.000219,-0.000252,-0.000107,0.000163,3e-06,3.5e-05,7.8e-05,-3.4e-05,2.8e-05,2.8e-05,-0.000281,-0.000177,-7.9e-05,-8e-05,-4.6e-05,-1.5e-05,-1.6e-05,0.000172,1.9e-05,2e-06,3.6e-05,2e-06,1.3e-05,-4.2e-05,0,-0.000184,-3.2e-05,2e-05,-7.3e-05,-8e-05,5.5e-05,0.000169,2.5e-05,-9.8e-05,-0.000155,-6.9e-05,3e-05,5.9e-05,0.000116,7.5e-05,-1.1e-05,-0.000119,-3e-06,-9.7e-05,-2.5e-05,-2.8e-05,-5.7e-05,-0.000115,-2.2e-05
-1.7e-05,-0.000144,-5e-05,-6.6e-05,2.7e-05,-8.8e-05,-4.1e-05,-7.8e-05,0.000231,-4e-06,3e-05,2.3e-05,-8e-06,9e-06,6.6e-05,-4.5e-05,7.5e-05,-6.2e-05,-9.6e-05,3e-05,-5e-06,5.2e-05,-4.8e-05,3.9e-05,2.1e-05,1.6e-05,6.3e-05,-7e-06,-4.6e-05,1.5e-05,-6.2e-05,-6e-06,4.8e-05,7.2e-05,-2.4e-05,5e-05,-5.7e-05,0.000106,8.9e-05,0.000114,2.5e-05,-9.1e-05,3.9e-05,-0.00014,-9.4e-05,-6.5e-05,-7e-06,-2.1e-05,-2.4e-05,-5.8e-05,7.9e-05,-3e-05,-1e-04,-0.000186,-0.000118,5.4e-05,7.2e-05,-9e-06,0.000117,3.8e-05,5e-06,0.000133,7e-06,-6.1e-05,-4.4e-05,2e-05,-2.3e-05,0.000161,5.4e-05,0.000168,3.3e-05,5.5e-05,0.000114,2e-06,-6.3e-05,-0.000127,-6.5e-05,-9.2e-05,-7.8e-05,9.2e-05,-4.6e-05,-8.6e-05,5.2e-05,4.4e-05,-5e-06,0.000112,2.9e-05,-8.5e-05,-5e-06,-3e-06,-7e-05,-8.4e-05,-5.5e-05,-6.5e-05,-0.000104,8.7e-05,3.9e-05,-3.3e-05,1.3e-05,9e-06,-1.8e-05,-3e-06,-2.7e-05,2.3e-05,-2e-05,1.3e-05,2.6e-05,-8.7e-05,7.9e-05,-3.8e-05,-2.8e-05,-1.1e-05,3e-05,0.000106,-7.6e-05,-8.2e-05,-0.000174,5.4e-05,0.000119,9.5e-05,-8.4e-05
-7e-05,-0.000204,-6.4e-05,-5e-05,-1e-06,1.4e-05,5.3e-05,3.8e-05,2.5e-05,-7.5e-05,-6.8e-05,-0.000162,5.3e-05,-1.8e-05,-0.000117,2.6e-05,-5.3e-05,-8.6e-05,7.2e-05,-7.5e-05,-4.9e-05,2.4e-05,6.7e-05,0.000121,-6e-05,-0.000106,2.1e-05,-5.7e-05,7.9e-05,2.1e-05,4.6e-05,8e-06,-4e-05,-5.4e-05,-2.4e-05,-1.5e-05,-5.6e-05,-3.1e-05,-1.4e-05,-2.4e-05,-8.6e-05,4.3e-05,-9.1e-05,-9.6e-05,1.7e-05,-8.5e-05,-1.5e-05,-4.6e-05,-5e-06,0.000126,4e-05,5.9e-05,3.1e-05,4e-05,4.2e-05,-5e-05,-0.00011,-3.6e-05,-2.6e-05,0,-1e-05,-5.8e-05,-7e-05,-6.2e-05,0.000132,3.8e-05,3.9e-05,-0.000112,-3.9e-05,-4.5e-05,-2.9e-05,5e-06,-4.4e-05,-2e-06,-0.00013,-1.4e-05,-2.8e-05,1.7e-05,2.2e-05,4.2e-05,2.4e-05,7.9e-05,-7.1e-05,-1.7e-05,-0.000133,-1.5e-05,-8e-06,-1.8e-05,4.7e-05,5.1e-05,6.9e-05,0.000115,-5e-06,6.8e-05,1.8e-05,-8.1e-05,-0.00012,-7.9e-05,-4e-05,-0.000105,6.2e-05,8e-06,3e-06,7e-06,-2.2e-05,-1e-06,8e-06,0.00011,1.5e-05,1.3e-05,5.7e-05,-5.4e-05,8.1e-05,-1.6e-05,-1.6e-05,6.2e-05,0.000113,2.5e-05,-0.000116,1.1e-05,-3.5e-05
-3.8e-05,0.000103,3e-06,3.1e-05,1e-04,1.1e-05,-4.7e-05,-5.9e-05,0.000185,7.5e-05,-4.1e-05,-5.3e-05,-9.8e-05,-6e-05,-1.7e-05,9.5e-05,5.2e-05,3.2e-05,-8e-05,-6.5e-05,6.9e-05,-5.2e-05,-6.3e-05,5.4e-05,-7e-06,-4.1e-05,-0.000105,-9.7e-05,-8.2e-05,-7e-06,9.8e-05,-1e-06,2e-06,3.7e-05,2.7e-05,5.5e-05,2e-06,-2.4e-05,2e-06,-2e-06,-2.4e-05,2.9e-05,8.8e-05,3.1e-05,-8e-06,-1.9e-05,6.3e-05,2.8e-05,2.7e-05,-6e-06,-6.3e-05,-7.7e-05,2.8e-05,2.1e-05,-4.2e-05,1.9e-05,6e-06,9e-06,8.2e-05,-3.9e-05,-3.8e-05,-6.1e-05,-2.4e-05,3.4e-05,-8.4e-05,-9.2e-05,-4.8e-05,0.000113,2.8e-05,3.8e-05,-2.1e-05,2.9e-05,-3.8e-05,-6.1e-05,0.000113,-3.9e-05,-5.3e-05,5e-06,-7.9e-05,-8.6e-05,2e-05,-5.2e-05,3.6e-05,-1.9e-05,0.000125,1.7e-05,6e-06,1.7e-05,1.8e-05,-0.000103,-4.6e-05,-5e-06,-1.1e-05,4.2e-05,-1.4e-05,2.3e-05,-3.3e-05,7.8e-05,-3.8e-05,0.000116,-6e-05,-2.3e-05,-3.7e-05,-6.5e-05,5.8e-05,2.3e-05,-2.8e-05,-3.8e-05,-2.2e-05,1.8e-05,-5e-06,-5.8e-05,3.3e-05,-5.8e-05,3.9e-05,4.5e-05,-9e-05,-3.8e-05,-6e-06,3.5e-05,3.3e-05
4.1e-05,1.6e-05,3e-06,2.5e-05,-2.6e-05,2.8e-05,-5.7e-05,-3.4e-05,-0.000157,-8.3e-05,9.8e-05,4.9e-05,9e-06,6.4e-05,8.9e-05,-0.000136,-4.9e-05,0.000121,5.9e-05,-4e-05,-6.2e-05,2.9e-05,2.3e-05,-6.5e-05,-2.6e-05,-1e-05,-2.9e-05,9e-06,-1.5e-05,4.3e-05,4e-05,8.6e-05,-3.9e-05,-8.3e-05,-5.6e-05,-5e-05,-3.7e-05,4.7e-05,5.7e-05,-1.7e-05,4.4e-05,-1.7e-05,-8.3e-05,4.8e-05,-6e-06,2e-06,1.9e-05,-3.4e-05,-0.000132,-6.2e-05,1.3e-05,-4e-06,-4.5e-05,-2.9e-05,-6.5e-05,-8.9e-05,-7e-06,1.1e-05,-2.1e-05,0.000111,4.7e-05,5.8e-05,-7.8e-05,2.8e-05,3.9e-05,7.9e-05,-1.8e-05,-4.8e-05,-6.9e-05,-0.000108,-9e-06,-7e-06,-3.7e-05,-2.7e-05,-5.4e-05,8.5e-05,2.5e-05,2e-06,2.3e-05,4.9e-05,7e-06,-2.1e-05,0.000138,7e-06,-1.6e-05,-4.2e-05,-7.4e-05,-1.3e-05,2e-06,-2.6e-05,-1.7e-05,8.1e-05,-2.3e-05,-5.8e-05,-1e-05,-3.6e-05,-1.5e-05,1e-05,-3.5e-05,-2.4e-05,7.2e-05,-5.1e-05,3.1e-05,-1.8e-05,-1.8e-05,-2e-06,2e-06,3.1e-05,1.6e-05,2.1e-05,4e-05,3.7e-05,6.1e-05,2.5e-05,-3.7e-05,0,4e-05,3.1e-05,-5e-06,2.8e-05,2.3e-05
-9e-06,-6.2e-05,6.4e-05,8e-06,7e-06,-5.6e-05,0.000156,3.9e-05,4.5e-05,-9.8e-05,1.4e-05,-2.3e-05,-9.6e-05,4e-05,6e-06,-9e-06,4.2e-05,-3e-05,-3.6e-05,4.1e-05,7.7e-05,2.1e-05,3.3e-05,-4e-06,-2.6e-05,7e-06,2.4e-05,-1.2e-05,-1.7e-05,-6.3e-05,-6e-06,-5.5e-05,7.4e-05,2e-05,1.6e-05,-5e-05,4.4e-05,-7.3e-05,4.1e-05,4.3e-05,-4.3e-05,-4.6e-05,-1.8e-05,-0.000102,2.3e-05,-7e-06,-1.9e-05,1.5e-05,5e-06,2.3e-05,-2e-06,3.2e-05,-2.6e-05,-8.5e-05,-1.4e-05,1.5e-05,2.7e-05,1e-06,-4.3e-05,-0.000146,-8.8e-05,8e-06,3.9e-05,3.6e-05,1e-06,6e-06,3.4e-05,-2.5e-05,2.7e-05,1.1e-05,6.1e-05,-4.5e-05,5e-05,-4.2e-05,-3.7e-05,1.9e-05,-9.7e-05,-7e-06,-4.7e-05,-1e-06,-8e-06,1.3e-05,-0.000112,-1.8e-05,-2.6e-05,-2.7e-05,1.4e-05,3e-05,-7e-06,2.2e-05,4.1e-05,-3.8e-05,-7e-06,-2.9e-05,-4e-06,1.7e-05,5e-06,-8e-06,-2.5e-05,-1.5e-05,4.6e-05,-4e-05,-5.7e-05,8.3e-05,5.8e-05,-4e-06,-7e-06,-2.2e-05,-3.7e-05,-4.6e-05,-3.5e-05,-1.2e-05,-4.5e-05,-2.9e-05,-4e-05,-5.2e-05,-5.3e-05,3.1e-05,1.2e-05,-2.2e-05,-2.7e-05
-6e-06,7e-06,4.6e-05,6e-06,-3.3e-05,6e-06,-6.5e-05,3e-06,1.6e-05,-1.8e-05,-1.9e-05,2.3e-05,2.2e-05,-2.1e-05,4e-06,2e-05,1e-05,-8.4e-05,-1.9e-05,-1.4e-05,-2.3e-05,2.1e-05,-3.6e-05,7e-06,2.5e-05,-3.2e-05,-2.7e-05,2.5e-05,-1.1e-05,5.2e-05,0,1e-06,2.2e-05,3e-05,-2.5e-05,3.1e-05,0,7e-06,-6e-06,-4.4e-05,2e-05,4e-06,-3.2e-05,2.8e-05,-2.7e-05,-1e-06,-2.9e-05,-3.7e-05,7.3e-05,-4.1e-05,1.4e-05,-3e-05,1.3e-05,2.7e-05,1.1e-05,-8e-06,1.2e-05,-4e-05,-6e-06,5.8e-05,4.4e-05,-1.8e-05,-2.9e-05,-4.4e-05,-3e-06,-3.8e-05,-2.6e-05,-4.8e-05,-3e-06,2e-06,1.9e-05,1e-05,-9e-06,-1.7e-05,4.1e-05,-4e-06,6e-05,6e-06,-3e-06,-1.2e-05,1.8e-05,-1.7e-05,4.5e-05,-1.2e-05,1.3e-05,2.7e-05,1.3e-05,-1.8e-05,3e-06,-1.1e-05,-4e-06,-7e-06,5e-06,1e-05,-3.4e-05,1.8e-05,-1.5e-05,-5.1e-05,1.3e-05,-1.5e-05,-5.6e-05,-7e-06,3.2e-05,-2.1e-05,2e-06,-1e-06,-1e-06,-3e-06,2.4e-05,-6.8e-05,3e-06,1e-06,-6e-06,-3.6e-05,3.2e-05,-8e-06,-2.3e-05,-9.6e-05,-1.4e-05,-1.6e-05,-8e-06
-6e-06,-3.6e-05,-7e-05,-1e-06,-5e-06,-1.2e-05,-2.5e-05,-1e-06,4.6e-05,5.4e-05,-2.4e-05,6e-06,4.3e-05,-4e-06,2.5e-05,-4.3e-05,-2e-06,4e-05,4e-06,2.2e-05,2.1e-05,-2.8e-05,1.6e-05,1.8e-05,2.4e-05,-1.1e-05,8e-06,7e-06,-2.6e-05,-1.5e-05,-1.1e-05,2.1e-05,-3.7e-05,-1.9e-05,3.9e-05,-1.2e-05,-1.2e-05,3e-06,-2.6e-05,1.2e-05,5.3e-05,-2.9e-05,3.6e-05,-2e-06,2e-06,-2e-05,-2.7e-05,3.2e-05,-3.1e-05,8e-06,-2e-06,4.3e-05,-1.6e-05,-4.3e-05,1.6e-05,3e-06,1.8e-05,-1.9e-05,-1.9e-05,-4.3e-05,1e-05,-1.4e-05,0,1.3e-05,1.6e-05,-5.1e-05,0,8e-06,-3.3e-05,1.2e-05,-7e-06,1.8e-05,2e-05,1.8e-05,-3.4e-05,-1.6e-05,-5.4e-05,-6e-06,-1.6e-05,-1.3e-05,-5.4e-05,-1.7e-05,-5e-05,-2.3e-05,2.2e-05,0,1.4e-05,7e-06,-4.2e-05,-1.4e-05,-1e-05,2e-06,2.3e-05,1.1e-05,2.3e-05,-5e-06,-1e-06,0,9e-06,5.2e-05,6e-06,-2e-05,-3e-06,-5e-06,-3e-06,5e-06,-1e-06,-9e-06,4e-06,5.7e-05,2e-05,-2.2e-05,-1e-06,2.9e-05,-4e-06,-1.5e-05,5.6e-05,-3e-06,6e-06,-3.4e-05,-3.2e-05
-1e-05,8.5e-05,6e-06,-2.6e-05,-8e-06,9e-06,-1.8e-05,-6e-06,2e-05,4.9e-05,4.1e-05,-5e-06,1e-06,1e-06,-1.7e-05,-3e-05,1.3e-05,-2.8e-05,-1.2e-05,-4.3e-05,-1.2e-05,2.5e-05,-1.2e-05,6e-06,0,1e-06,1.9e-05,-8e-06,1.8e-05,1.1e-05,-9e-06,-5e-06,1e-05,-1.9e-05,-2e-06,1.1e-05,-2.9e-05,-1.6e-05,7e-06,-2e-05,-3.2e-05,1e-05,-9e-06,-2.6e-05,-2.9e-05,-3e-06,1.4e-05,-2.9e-05,0,9e-06,-1.9e-05,-3e-05,2e-06,2.1e-05,-1e-05,-1e-05,-3.5e-05,2e-05,0,2.7e-05,-6e-06,-1.1e-05,6e-06,-3.3e-05,1.6e-05,3e-06,-8e-06,-5.6e-05,3.4e-05,-1.4e-05,-1.9e-05,-1.1e-05,-2e-05,-2.1e-05,-3e-06,-1.4e-05,-3e-06,-8e-06,2.9e-05,1.9e-05,-2.1e-05,9e-06,5e-05,1.2e-05,-3.2e-05,1e-05,-2e-06,1.1e-05,1.2e-05,-1.3e-05,7e-06,-2.1e-05,-1e-05,-3e-06,2.2e-05,-7e-06,-5e-06,-7e-06,1.3e-05,-1.3e-05,-6e-06,3.3e-05,1.5e-05,-4e-06,-5.3e-05,2.9e-05,0,5e-06,-1.6e-05,1e-06,-2.2e-05,2e-06,-1.2e-05,1.2e-05,-6e-06,1.5e-05,-2.4e-05,1.1e-05,7e-06,5e-06,-8e-06
-6e-06,-5.2e-05,3.2e-05,1.6e-05,2.1e-05,-1.5e-05,-2.1e-05,4e-06,2e-06,-6e-06,-4.4e-05,0,3e-06,2e-05,1.2e-05,3e-05,-2e-06,1.6e-05,9e-06,3.8e-05,1.3e-05,7e-06,0,-9e-06,9e-06,-1.2e-05,-2.5e-05,1.5e-05,1.8e-05,-3e-06,0,-1.4e-05,-1.6e-05,-1.8e-05,-1.6e-05,1.4e-05,9e-06,1.4e-05,-5e-06,1.2e-05,1.4e-05,6e-06,1.5e-05,1.8e-05,6e-06,1.5e-05,2.7e-05,2.8e-05,3.9e-05,-3e-05,1.2e-05,8e-06,2e-06,7e-06,-1.5e-05,-1.1e-05,2.8e-05,5e-06,-9e-06,-1.5e-05,-1.6e-05,1.7e-05,-1.8e-05,8e-06,-1.4e-05,4e-06,1.5e-05,1e-05,-2e-06,-4e-06,-3e-06,1.8e-05,1.2e-05,8e-06,6e-06,-2.5e-05,-1.5e-05,9e-06,-2.5e-05,-2.3e-05,-1.1e-05,-8e-06,-1.5e-05,2e-05,2e-05,-2.4e-05,-1.6e-05,-5e-06,8e-06,2.3e-05,-8e-06,1.2e-05,2.4e-05,7e-06,2e-06,1e-05,1.1e-05,5e-06,-1.8e-05,-7e-06,1.1e-05,2.1e-05,-1.3e-05,-1e-05,1.3e-05,-7e-06,1.4e-05,-7e-06,2e-06,-1.5e-05,0,0,1.7e-05,-2.6e-05,1.3e-05,-2e-06,2.5e-05,-1.4e-05,-2.2e-05,1.3e-05,-6e-06
-9e-06,-5e-06,-3.8e-05,-2e-06,-3e-06,2.5e-05,3e-05,4e-06,-3.1e-05,-1.2e-05,-1.4e-05,4e-06,-3.5e-05,2.7e-05,2e-06,1e-05,-1e-06,-1e-06,-2.4e-05,-1.2e-05,-1.5e-05,-1.8e-05,6e-06,4e-06,-6e-06,1e-05,3e-06,-1.7e-05,-3e-06,2.1e-05,4e-06,1.8e-05,5e-06,2e-05,-2e-06,3e-06,-3e-06,-7e-06,0,-8e-06,-6e-06,9e-06,-6e-06,-2.3e-05,-1e-05,-1.2e-05,6e-06,-1.6e-05,-5e-06,1.3e-05,-1.1e-05,-9e-06,1.2e-05,-6e-06,1.7e-05,1.2e-05,-1.2e-05,3e-06,-4e-06,1.8e-05,1e-05,-9e-06,-7e-06,-5e-06,-7e-06,-4e-06,-1.5e-05,-4e-06,-1.3e-05,1e-05,2e-06,-5e-06,-2.8e-05,-4e-06,-1.3e-05,1e-05,7e-06,-7e-06,3e-06,0,-1.5e-05,-6e-06,-5e-06,8e-06,-9e-06,-1.2e-05,4e-06,-5e-06,-2e-05,3e-06,-1e-06,-4e-06,1e-06,6e-06,-1e-05,-1.1e-05,-8e-06,2.6e-05,1e-06,-2e-06,-1e-06,9e-06,1.5e-05,8e-06,1.5e-05,5e-06,-3e-06,5e-06,8e-06,1e-06,3e-06,1e-05,-4e-06,9e-06,0,1e-05,-1.8e-05,1e-06,1.6e-05,6e-06,-6e-06
5e-06,3.9e-05,-1.6e-05,7e-06,-5e-06,-9e-06,-1.4e-05,-7e-06,-2e-05,3.4e-05,7e-06,-1.2e-05,5e-06,4e-06,-9e-06,-4e-06,1.3e-05,-8e-06,1.1e-05,2.2e-05,0,1.4e-05,-9e-06,-7e-06,-4e-06,8e-06,4e-06,1e-06,0,-1.4e-05,1.7e-05,-8e-06,6e-06,-2e-06,-1e-06,-6e-06,4e-06,3e-06,8e-06,3e-06,-7e-06,6e-06,2e-06,1e-06,-2e-06,-5e-06,1e-06,6e-06,-5e-06,3e-06,1.5e-05,4e-06,-5e-06,1.7e-05,-7e-06,1e-06,-8e-06,-6e-06,-2e-06,-1.4e-05,8e-06,-1e-06,8e-06,1.3e-05,-2e-06,-5e-06,-5e-06,-1.8e-05,1e-05,-1.4e-05,1e-06,-8e-06,1.5e-05,-1e-06,0,-1.9e-05,1.8e-05,6e-06,5e-06,3e-06,4e-06,4e-06,4e-05,2e-06,-2e-06,-3e-06,0,1e-06,1e-06,7e-06,-1e-06,2.3e-05,-1e-06,-1.1e-05,-5e-06,6e-06,-5e-06,-2e-05,-2e-06,8e-06,-1.3e-05,-8e-06,-4e-06,1.3e-05,0,0,-3e-06,-7e-06,-1.4e-05,7e-06,-4e-06,-4e-06,-5e-06,7e-06,0,3e-06,-4e-06,-2.4e-05,-1e-06,-3e-06,7e-06
-1e-05,-9e-06,1e-06,3e-06,4e-06,-7e-06,-1e-05,1e-06,1.3e-05,1.4e-05,1.2e-05,3e-06,1e-06,-1.4e-05,1e-05,-4e-06,3e-06,1.1e-05,-1.1e-05,-2e-05,-3e-06,-1e-06,9e-06,1e-06,-6e-06,-9e-06,-2e-06,-1.5e-05,0,1.2e-05,-3e-06,-1.3e-05,0,0,-5e-06,-1.2e-05,-1.1e-05,-8e-06,-9e-06,0,-1e-05,-1.4e-05,0,1e-06,1e-06,5e-06,-3e-06,-6e-06,-1.1e-05,-6e-06,-6e-06,1e-06,-6e-06,7e-06,-1e-06,-2e-06,-1e-05,-4e-06,4e-06,0,-1.4e-05,-4e-06,-1.2e-05,7e-06,5e-06,-4e-06,3e-06,2.4e-05,3e-06,1.6e-05,4e-06,0,1e-06,-1e-05,8e-06,1.1e-05,-9e-06,-2e-06,-8e-06,-1e-06,8e-06,3e-06,-1.6e-05,6e-06,6e-06,1.1e-05,-1e-06,5e-06,-2e-06,0,-9e-06,-2.4e-05,-5e-06,-8e-06,-1e-06,-1e-06,-2e-06,5e-06,-2e-06,5e-06,7e-06,-6e-06,3e-06,-2e-05,0,-2e-06,0,0,6e-06,2e-06,-5e-06,-1e-06,-1.8e-05,-1.2e-05,1e-06,-6e-06,5e-06,3.2e-05,-8e-06,-4e-06,-1e-06
4e-06,5e-06,1.1e-05,1.2e-05,-4e-06,-3e-06,1.3e-05,3e-06,4e-06,-7e-06,-1.9e-05,-5e-06,0,0,1.4e-05,7e-06,-1e-05,5e-06,6e-06,2e-06,-2e-06,1e-06,-4e-06,8e-06,-3e-06,8e-06,-1e-06,-6e-06,-6e-06,1e-06,-6e-06,5e-06,-6e-06,-2e-06,8e-06,1.1e-05,-5e-06,7e-06,-7e-06,-2e-06,-1e-06,-5e-06,-4e-06,4e-06,6e-06,0,-3e-06,2e-06,4e-06,1.2e-05,0,1e-06,4e-06,-1.8e-05,-6e-06,-1e-06,-3e-06,-5e-06,3e-06,1.3e-05,3e-06,0,0,2e-06,-5e-06,2e-06,3e-06,-1.5e-05,-4e-06,0,-4e-06,4e-06,5e-06,-3e-06,-1.1e-05,1.9e-05,-7e-06,2e-06,2e-06,-3e-06,-2e-06,-5e-06,1.6e-05,2e-06,4e-06,7e-06,-1e-06,2e-06,-3e-06,2e-06,3e-06,1.3e-05,1e-06,8e-06,-7e-06,-2e-06,3e-06,-9e-06,-5e-06,-7e-06,1e-06,-5e-06,-2e-06,0,5e-06,-2e-06,-2e-06,-4e-06,2e-06,-5e-06,5e-06,1e-06,-2e-06,-1e-06,-3e-06,-8e-06,-1e-05,-1e-06,-2e-06,-1e-06,-3e-06
-4e-06,-2.5e-05,-6e-06,-2e-06,-5e-06,7e-06,-5e-06,-3e-06,4e-06,-1.7e-05,1.7e-05,-4e-06,6e-06,1.2e-05,7e-06,3e-06,5e-06,-6e-06,-1e-06,-1.3e-05,6e-06,-5e-06,0,4e-06,-3e-06,0,-6e-06,3e-06,0,-1e-06,-8e-06,1e-06,3e-06,-3e-06,-4e-06,4e-06,4e-06,-6e-06,2e-06,2e-06,2e-06,3e-06,0,-1.4e-05,8e-06,-2e-06,-6e-06,-3e-06,-1e-06,-1e-06,0,0,-2e-06,6e-06,-1e-06,-1e-06,2e-06,-2e-06,6e-06,-1.8e-05,5e-06,1.1e-05,-4e-06,-4e-06,1.2e-05,7e-06,-1e-06,1.9e-05,-4e-06,0,2e-06,0,-2e-06,4e-06,2e-06,-2e-06,-8e-06,-2e-06,-6e-06,1e-06,8e-06,-3e-06,-2.2e-05,-9e-06,-9e-06,3e-06,-1e-06,-3e-06,-6e-06,0,2e-06,-8e-06,-1e-06,4e-06,-6e-06,4e-06,3e-06,-1.1e-05,4e-06,-1e-06,-5e-06,-4e-06,5e-06,1e-06,-4e-06,4e-06,0,4e-06,-8e-06,-5e-06,-6e-06,2e-06,8e-06,9e-06,1e-06,1e-06,1.2e-05,0,0,-6e-06,-8e-06
0,4e-06,3e-06,3e-06,-1e-06,-7e-06,1.8e-05,-1e-06,-1.3e-05,1.1e-05,-7e-06,7e-06,-2e-06,7e-06,2e-06,-8e-06,-2e-06,-8e-06,-1e-06,1e-05,-1.3e-05,9e-06,3e-06,-7e-06,5e-06,-6e-06,0,1e-06,3e-06,8e-06,-7e-06,-7e-06,0,2e-06,-4e-06,-3e-06,-5e-06,-3e-06,2e-06,-1e-06,0,-4e-06,-1e-06,1.1e-05,-2e-06,-2e-06,8e-06,2e-06,-7e-06,7e-06,-2e-06,4e-06,-1e-06,0,4e-06,5e-06,1.1e-05,2e-06,8e-06,8e-06,0,-2e-06,-6e-06,-5e-06,-1e-06,-1e-06,-1e-06,3e-06,5e-06,-7e-06,3e-06,4e-06,3e-06,-1e-05,5e-06,1e-06,4e-06,-3e-06,2e-06,6e-06,7e-06,4e-06,7e-06,-2e-06,8e-06,-4e-06,1e-06,3e-06,0,2e-06,0,1e-06,-1e-06,-4e-06,4e-06,-3e-06,-5e-06,6e-06,-1e-06,8e-06,2e-06,-2e-06,-3e-06,3e-06,-6e-06,-1e-06,-2e-06,-6e-06,4e-06,1.3e-05,3e-06,-3e-06,-1e-06,-8e-06,-2e-06,3e-06,-3e-06,6e-06,2e-06,6e-06,0
-2e-06,1.5e-05,1e-05,3e-06,5e-06,0,3e-06,1e-06,-2e-05,-4e-06,-2e-06,4e-06,-4e-06,0,1e-06,-1e-06,0,9e-06,-5e-06,-5e-06,7e-06,-6e-06,-4e-06,-6e-06,1e-06,2e-06,-4e-06,7e-06,-1e-06,-4e-06,0,7e-06,-1e-06,0,4e-06,-2e-06,3e-06,1.1e-05,-2e-06,-1e-06,1.1e-05,4e-06,0,0,6e-06,-5e-06,4e-06,0,6e-06,-2e-06,4e-06,-1e-06,-3e-06,-8e-06,-8e-06,-1e-06,-1e-06,2e-06,1e-06,0,-1e-06,-1e-06,8e-06,-3e-06,-1.1e-05,-3e-06,2e-06,4e-06,-1e-06,7e-06,-2e-06,0,-4e-06,-2e-06,-1e-05,-1e-05,2e-06,-2e-06,-2e-06,-3e-06,-4e-06,-2e-06,4e-06,-1e-06,-2e-06,-7e-06,-2e-06,-2e-06,2e-06,-2e-06,6e-06,0,0,0,3e-06,2e-06,-3e-06,1e-06,-2e-06,-1e-06,-6e-06,-1e-06,1e-06,4e-06,0,-1e-06,1e-06,6e-06,3e-06,-4e-06,0,-2e-06,0,-5e-06,-2e-06,3e-06,0,2e-06,-3e-06,2e-06,-3e-06
-1e-06,-1.1e-05,-9e-06,-1e-06,0,2e-06,-1e-05,1e-06,-4e-06,-5e-06,-2e-06,-4e-06,-3e-06,-4e-06,-1e-06,7e-06,1e-06,1e-06,4e-06,8e-06,-3e-06,-1e-06,2e-06,1e-06,4e-06,-4e-06,3e-06,-4e-06,-2e-06,9e-06,1e-06,-1e-06,-2e-06,5e-06,-1e-06,1e-06,-4e-06,-1e-05,-2e-06,-2e-06,-2e-06,4e-06,-4e-06,-6e-06,3e-06,5e-06,2e-06,-1e-06,7e-06,-2e-06,1e-06,-1e-06,3e-06,-1e-06,2e-06,-3e-06,-5e-06,2e-06,-4e-06,-1e-06,-6e-06,-3e-06,-7e-06,1e-06,5e-06,1e-06,-5e-06,0,-5e-06,-2e-06,-1e-06,-6e-06,-3e-06,0,3e-06,-1e-06,-4e-06,1e-06,-4e-06,1e-06,4e-06,-4e-06,0,-2e-06,-4e-06,4e-06,0,1e-06,-3e-06,-3e-06,0,1e-06,3e-06,2e-06,4e-06,-2e-06,2e-06,-2e-06,1e-06,-1e-06,2e-06,-1e-06,2e-06,-7e-06,-3e-06,1e-06,2e-06,-5e-06,-6e-06,-5e-06,1e-06,-1e-06,2e-06,7e-06,1e-06,0,0,6e-06,-1e-06,3e-06,4e-06
1e-06,-1.3e-05,3e-06,5e-06,1e-06,1e-06,8e-06,0,7e-06,-7e-06,7e-06,4e-06,-1e-06,0,-3e-06,-1e-05,0,-5e-06,-5e-06,-7e-06,6e-06,2e-06,0,4e-06,2e-06,-3e-06,2e-06,6e-06,1e-06,-4e-06,4e-06,-7e-06,-2e-06,-5e-06,-1e-06,-3e-06,-2e-06,7e-06,0,3e-06,1e-06,-4e-06,4e-06,2e-06,-3e-06,1e-06,0,0,-3e-06,4e-06,-3e-06,0,-1e-06,0,3e-06,-2e-06,4e-06,1e-06,-2e-06,-2e-06,9e-06,4e-06,0,2e-06,-4e-06,3e-06,2e-06,6e-06,4e-06,-4e-06,0,2e-06,1e-06,-3e-06,3e-06,2e-06,-2e-06,3e-06,5e-06,4e-06,2e-06,2e-06,8e-06,-1e-06,3e-06,3e-06,1e-06,0,1e-06,-2e-06,-3e-06,2e-06,2e-06,-4e-06,0,2e-06,2e-06,1e-06,0,-4e-06,7e-06,-1e-06,0,-1e-06,1e-06,1e-06,-1e-06,3e-06,4e-06,1e-06,-2e-06,1e-06,0,-4e-06,1e-06,-2e-06,-7e-06,-1e-06,-1e-06,-2e-06,-5e-06
-3e-06,1.3e-05,5e-06,-1e-06,1e-06,-3e-06,-4e-06,-1e-06,5e-06,1.4e-05,-1.2e-05,1e-06,5e-06,6e-06,5e-06,-1e-06,0,2e-06,3e-06,7e-06,-5e-06,2e-06,0,0,-1e-06,2e-06,-5e-06,-1e-06,1e-06,5e-06,2e-06,3e-06,1e-06,-1e-06,-2e-06,-2e-06,1e-06,-3e-06,3e-06,-4e-06,4e-06,-1e-06,-3e-06,1e-06,-3e-06,-4e-06,-4e-06,2e-06,-2e-06,-5e-06,3e-06,-2e-06,0,0,-4e-06,-1e-06,2e-06,-3e-06,1e-06,3e-06,-2e-06,3e-06,1e-06,1e-06,2e-06,1e-06,0,-9e-06,0,2e-06,-1e-06,-1e-06,0,-2e-06,-5e-06,-2e-06,-3e-06,0,-1e-06,-4e-06,-4e-06,1e-06,-7e-06,1e-06,-2e-06,3e-06,1e-06,-2e-06,0,2e-06,1e-06,-1e-06,0,-2e-06,-1e-06,-2e-06,0,-3e-06,0,8e-06,-7e-06,4e-06,0,4e-06,1e-06,-1e-06,1e-06,-2e-06,1e-06,1e-06,4e-06,1e-06,-2e-06,-5e-06,0,-1e-06,7e-06,-8e-06,2e-06,-1e-06,-1e-06
2e-06,5e-06,-2e-06,5e-06,0,1e-06,4e-06,0,3e-06,7e-06,7e-06,-7e-06,4e-06,2e-06,2e-06,0,-3e-06,0,-2e-06,-1e-06,2e-06,-4e-06,1e-06,0,-2e-06,-2e-06,-1e-06,-3e-06,-2e-06,-2e-06,-2e-06,1e-06,1e-06,1e-06,0,4e-06,-1e-06,-4e-06,2e-06,2e-06,-9e-06,-1e-06,3e-06,-5e-06,0,1e-06,1e-06,-3e-06,5e-06,-2e-06,-4e-06,1e-06,0,5e-06,0,0,-2e-06,-2e-06,-1e-06,-4e-06,-2e-06,-4e-06,-5e-06,3e-06,1e-06,-3e-06,2e-06,0,-3e-06,-3e-06,2e-06,3e-06,0,-2e-06,1e-06,1e-06,3e-06,0,-4e-06,1e-06,1e-06,-4e-06,8e-06,2e-06,-1e-06,-3e-06,-1e-06,4e-06,-1e-06,1e-06,-3e-06,-2e-06,-1e-06,3e-06,1e-06,2e-06,-3e-06,-8e-06,0,-4e-06,2e-06,1e-06,2e-06,1e-06,6e-06,0,1e-06,1e-06,-5e-06,0,-3e-06,-1e-06,1e-06,6e-06,0,0,-3e-06,-3e-06,-2e-06,-2e-06,0
-2e-06,3e-06,-4e-06,-1e-06,-3e-06,0,-2e-06,-1e-06,-9e-06,0,0,-1e-06,-6e-06,-4e-06,2e-06,3e-06,-2e-06,-2e-06,-1e-06,3e-06,0,2e-06,-1e-06,0,-1e-06,0,1e-06,-1e-06,1e-06,2e-06,-4e-06,-5e-06,1e-06,2e-06,2e-06,0,-2e-06,4e-06,0,0,0,-2e-06,-2e-06,5e-06,-2e-06,2e-06,0,3e-06,-1e-06,3e-06,4e-06,-1e-06,0,-3e-06,-1e-06,-1e-06,-1e-06,0,-2e-06,1e-06,0,-1e-06,4e-06,-1e-06,3e-06,-3e-06,-3e-06,-5e-06,0,0,0,-3e-06,0,1e-06,1e-06,6e-06,0,-1e-06,5e-06,1e-06,-4e-06,0,-1e-05,0,1e-06,-4e-06,-1e-06,0,0,-2e-06,0,2e-06,2e-06,2e-06,-3e-06,-1e-06,0,4e-06,-1e-06,3e-06,3e-06,2e-06,1e-06,2e-06,-1e-06,0,0,-2e-06,4e-06,-1e-06,2e-06,0,6e-06,-1e-06,1e-06,-1e-06,1e-06,5e-06,-2e-06,-1e-06,-2e-06
0,-1e-05,2e-06,3e-06,0,-1e-06,-1.2e-05,0,-5e-06,-6e-06,1e-06,3e-06,-6e-06,-2e-06,5e-06,-5e-06,4e-06,2e-06,0,-3e-06,0,1e-06,0,-2e-06,-2e-06,2e-06,-1e-06,-7e-06,0,2e-06,-2e-06,4e-06,-1e-06,0,-1e-06,0,-1e-06,-2e-06,-2e-06,1e-06,-1e-06,3e-06,3e-06,-5e-06,-3e-06,-2e-06,4e-06,-3e-06,-4e-06,-5e-06,-3e-06,2e-06,1e-06,2e-06,1e-06,1e-06,-3e-06,1e-06,-4e-06,2e-06,0,-1e-06,-3e-06,-1e-06,-6e-06,2e-06,1e-06,-5e-06,3e-06,0,-1e-06,3e-06,2e-06,-3e-06,-2e-06,1e-06,-1e-06,0,-4e-06,-1e-06,-6e-06,1e-06,3e-06,1e-06,1e-06,-2e-06,1e-06,-2e-06,0,0,2e-06,-3e-06,-2e-06,-3e-06,-2e-06,0,1e-06,-4e-06,0,-4e-06,-3e-06,0,-2e-06,-3e-06,-1e-06,0,0,2e-06,1e-06,0,0,0,0,-6e-06,-1e-06,1e-06,0,-8e-06,1e-06,3e-06,-3e-06
-1e-06,5e-06,5e-06,-2e-06,1e-06,0,7e-06,1e-06,1e-06,8e-06,-7e-06,-2e-06,2e-06,2e-06,-3e-06,4e-06,-2e-06,-2e-06,-2e-06,-3e-06,2e-06,-2e-06,0,-1e-06,-1e-06,-1e-06,-1e-06,1e-06,0,-2e-06,0,1e-06,-1e-06,-2e-06,-2e-06,-1e-06,-2e-06,4e-06,-1e-06,-2e-06,-2e-06,1e-06,-2e-06,2e-06,-2e-06,0,0,3e-06,0,1e-06,2e-06,0,-1e-06,5e-06,0,0,-2e-06,1e-06,-1e-06,-2e-06,4e-06,2e-06,-3e-06,-3e-06,2e-06,1e-06,0,-1e-06,-1e-06,4e-06,1e-06,-3e-06,-2e-06,-2e-06,2e-06,3e-06,-3e-06,-1e-06,2e-06,-1e-06,1e-06,-1e-06,-3e-06,2e-06,-3e-06,3e-06,1e-06,2e-06,2e-06,2e-06,-1e-06,3e-06,-1e-06,-1e-06,-2e-06,1e-06,1e-06,1e-06,0,5e-06,4e-06,-2e-06,3e-06,-2e-06,-4e-06,0,-1e-06,-3e-06,-3e-06,1e-06,1e-06,2e-06,-2e-06,4e-06,-1e-06,2e-06,-3e-06,-1e-06,-1e-06,0,2e-06
0,7e-06,-5e-06,3e-06,0,1e-06,-3e-06,-1e-06,8e-06,1e-06,9e-06,0,3e-06,3e-06,-2e-06,0,-3e-06,0,2e-06,-2e-06,-3e-06,0,-1e-06,1e-06,1e-06,0,1e-06,0,-1e-06,3e-06,2e-06,-4e-06,0,1e-06,1e-06,-1e-06,0,-3e-06,3e-06,2e-06,3e-06,-1e-06,2e-06,-1e-06,0,-2e-06,0,-2e-06,1e-06,0,0,0,1e-06,-3e-06,-4e-06,2e-06,7e-06,0,0,-1e-06,-6e-06,0,3e-06,0,-1e-06,0,-1e-06,-4e-06,-1e-06,-2e-06,0,-2e-06,0,1e-06,-1e-06,-9e-06,-1e-06,1e-06,-2e-06,0,-5e-06,-1e-06,5e-06,-1e-06,3e-06,3e-06,-1e-06,-2e-06,-3e-06,1e-06,1e-06,-1e-06,-1e-06,1e-06,1e-06,-1e-06,-2e-06,3e-06,0,-2e-06,-3e-06,-1e-06,-1e-06,4e-06,3e-06,0,1e-06,2e-06,4e-06,-1e-06,-1e-06,-1e-06,-1e-06,0,0,0,4e-06,-6e-06,-1e-06,1e-06,-1e-06
0,-3e-06,0,-1e-06,0,1e-06,0,-1e-06,5e-06,-4e-06,-5e-06,2e-06,2e-06,0,-2e-06,1e-06,2e-06,2e-06,-2e-06,0,5e-06,2e-06,1e-06,3e-06,1e-06,0,-3e-06,3e-06,0,-3e-06,2e-06,3e-06,1e-06,-1e-06,-1e-06,2e-06,0,3e-06,1e-06,-1e-06,1e-06,0,-2e-06,3e-06,0,-1e-06,-2e-06,2e-06,0,0,-2e-06,-1e-06,-1e-06,-2e-06,1e-06,-1e-06,0,-1e-06,0,3e-06,3e-06,-1e-06,-3e-06,1e-06,2e-06,-1e-06,0,2e-06,3e-06,1e-06,0,3e-06,-1e-06,-2e-06,-2e-06,-3e-06,2e-06,1e-06,1e-06,1e-06,-2e-06,1e-06,1e-06,0,-2e-06,1e-06,-1e-06,0,1e-06,-1e-06,1e-06,1e-06,1e-06,-1e-06,2e-06,1e-06,-1e-06,-4e-06,0,0,1e-06,-2e-06,1e-06,0,0,-1e-06,0,-2e-06,-1e-06,1e-06,1e-06,0,-1e-06,-5e-06,-1e-06,-2e-06,-3e-06,6e-06,0,-1e-06,-1e-06
-1e-06,-1.3e-05,2e-06,1e-06,1e-06,-2e-06,3e-06,0,1e-06,-8e-06,1e-06,1e-06,-3e-06,-3e-06,-3e-06,-4e-06,-2e-06,0,1e-06,2e-06,-3e-06,-1e-06,0,-1e-06,2e-06,0,-1e-06,1e-06,0,2e-06,1e-06,2e-06,0,1e-06,1e-06,0,-2e-06,-3e-06,-1e-06,-1e-06,3e-06,-2e-06,1e-06,-5e-06,1e-06,4e-06,-1e-06,-3e-06,0,1e-06,2e-06,-1e-06,-1e-06,3e-06,1e-06,0,-3e-06,0,2e-06,-4e-06,0,-1e-06,0,2e-06,-2e-06,-1e-06,1e-06,-2e-06,-1e-06,0,0,-1e-06,0,-1e-06,2e-06,0,1e-06,1e-06,0,-1e-06,4e-06,0,-3e-06,0,1e-06,-1e-06,1e-06,1e-06,-1e-06,0,-2e-06,1e-06,-1e-06,-1e-06,0,0,1e-06,-2e-06,0,0,2e-06,0,-1e-06,-1e-06,2e-06,0,-1e-06,2e-06,-4e-06,0,-1e-06,-1e-06,0,3e-06,0,-1e-06,2e-06,2e-06,0,0,0
1e-06,5e-06,-1e-06,0,0,0,-6e-06,0,-5e-06,2e-06,-1e-06,-1e-06,-2e-06,-1e-06,2e-06,2e-06,0,-1e-06,-1e-06,0,4e-06,-1e-06,0,-2e-06,1e-06,0,1e-06,1e-06,0,-3e-06,0,-4e-06,0,0,-1e-06,0,0,0,-2e-06,0,0,-1e-06,0,3e-06,2e-06,-2e-06,1e-06,2e-06,2e-06,0,-1e-06,0,0,-2e-06,-2e-06,0,1e-06,0,2e-06,2e-06,-1e-06,1e-06,2e-06,0,5e-06,2e-06,0,5e-06,-1e-06,0,0,1e-06,-1e-06,-2e-06,-1e-06,2e-06,0,-1e-06,-1e-06,0,0,-1e-06,4e-06,-1e-06,0,-2e-06,1e-06,-1e-06,-1e-06,1e-06,0,-3e-06,1e-06,1e-06,2e-06,0,0,-3e-06,0,0,-3e-06,0,2e-06,0,1e-06,0,1e-06,-1e-06,3e-06,0,0,1e-06,1e-06,2e-06,0,0,0,-3e-06,-1e-06,-1e-06,-3e-06
-1e-06,6e-06,-2e-06,0,-1e-06,0,7e-06,0,-3e-06,2e-06,4e-06,0,-1e-06,1e-06,0,-1e-06,2e-06,1e-06,0,2e-06,-3e-06,2e-06,1e-06,0,0,-1e-06,-2e-06,2e-06,0,2e-06,-2e-06,2e-06,0,-1e-06,-2e-06,0,-1e-06,3e-06,0,0,1e-06,1e-06,0,0,2e-06,-2e-06,0,-1e-06,1e-06,2e-06,0,0,0,-1e-06,1e-06,0,0,0,1e-06,-1e-06,0,1e-06,-4e-06,0,-5e-06,0,-1e-06,1e-06,1e-06,0,0,-1e-06,2e-06,0,-1e-06,4e-06,-2e-06,-1e-06,1e-06,1e-06,1e-06,0,-6e-06,-1e-06,1e-06,0,-1e-06,1e-06,0,0,0,3e-06,0,0,1e-06,0,1e-06,0,0,1e-06,2e-06,0,-2e-06,-2e-06,1e-06,0,0,1e-06,0,1e-06,0,0,1e-06,-5e-06,0,1e-06,-1e-06,4e-06,0,0,1e-06
0,-3e-06,0,0,0,2e-06,1e-06,-1e-06,3e-06,-1e-06,-5e-06,0,-1e-06,1e-06,1e-06,-1e-06,0,1e-06,-1e-06,-2e-06,2e-06,-1e-06,0,2e-06,0,0,0,-2e-06,0,-2e-06,-1e-06,1e-06,0,0,1e-06,0,0,-5e-06,1e-06,-1e-06,-1e-06,0,0,-2e-06,1e-06,2e-06,1e-06,0,-2e-06,1e-06,1e-06,0,0,1e-06,-1e-06,0,0,0,0,1e-06,-3e-06,1e-06,2e-06,-1e-06,2e-06,-1e-06,1e-06,4e-06,0,0,0,1e-06,0,-1e-06,1e-06,2e-06,0,0,1e-06,-1e-06,5e-06,1e-06,6e-06,0,-1e-06,1e-06,0,0,-1e-06,-1e-06,-1e-06,-4e-06,1e-06,-2e-06,0,0,-2e-06,-2e-06,0,-2e-06,-1e-06,0,2e-06,3e-06,-1e-06,-1e-06,0,-1e-06,-2e-06,-1e-06,0,1e-06,-1e-06,1e-06,1e-06,0,2e-06,2e-06,0,1e-06,1e-06
0,-2e-06,2e-06,-1e-06,0,-1e-06,-1e-06,0,5e-06,-4e-06,3e-06,0,2e-06,0,1e-06,-2e-06,0,-1e-06,0,3e-06,-1e-06,0,0,0,-1e-06,0,-1e-06,1e-06,0,1e-06,0,-3e-06,0,0,1e-06,-1e-06,0,5e-06,0,0,-2e-06,2e-06,0,2e-06,1e-06,0,-1e-06,1e-06,0,-1e-06,-2e-06,0,-1e-06,-1e-06,0,-1e-06,2e-06,0,0,-1e-06,4e-06,-1e-06,0,0,0,0,-1e-06,2e-06,-1e-06,0,0,-1e-06,0,-2e-06,-1e-06,-1e-06,1e-06,0,-2e-06,0,0,-1e-06,-7e-06,0,2e-06,1e-06,1e-06,-1e-06,0,0,1e-06,4e-06,-1e-06,0,-1e-06,0,0,2e-06,0,1e-06,-1e-06,0,-1e-06,0,0,0,0,1e-06,3e-06,0,0,-1e-06,-2e-06,3e-06,0,-1e-06,-2e-06,3e-06,-1e-06,0,-2e-06
0,-4e-06,-4e-06,0,0,0,5e-06,1e-06,4e-06,4e-06,-2e-06,-1e-06,1e-06,-2e-06,-3e-06,3e-06,-1e-06,1e-06,-1e-06,-2e-06,0,0,0,0,-1e-06,0,-1e-06,-3e-06,0,0,1e-06,2e-06,0,1e-06,-1e-06,0,-1e-06,-3e-06,-1e-06,1e-06,1e-06,0,1e-06,-1e-06,1e-06,-1e-06,0,-2e-06,0,2e-06,2e-06,0,0,1e-06,0,0,-4e-06,0,1e-06,2e-06,-2e-06,0,-2e-06,0,1e-06,0,0,1e-06,0,-1e-06,0,1e-06,0,0,-1e-06,1e-06,1e-06,0,1e-06,1e-06,2e-06,0,5e-06,1e-06,-1e-06,0,0,0,-1e-06,0,0,-3e-06,0,1e-06,-2e-06,0,1e-06,-2e-06,0,0,3e-06,1e-06,1e-06,-2e-06,0,0,0,-2e-06,-1e-06,1e-06,0,1e-06,0,-4e-06,0,0,2e-06,1e-06,-1e-06,0,0
0,1.4e-05,2e-06,-2e-06,0,-1e-06,-6e-06,0,-3e-06,4e-06,2e-06,1e-06,0,-1e-06,-1e-06,-3e-06,0,0,1e-06,2e-06,1e-06,1e-06,-1e-06,1e-06,0,0,0,-1e-06,0,-1e-06,1e-06,2e-06,0,0,0,0,0,0,-1e-06,-1e-06,-2e-06,-2e-06,-1e-06,0,0,0,0,2e-06,-2e-06,-1e-06,-2e-06,0,0,1e-06,-1e-06,0,-2e-06,0,1e-06,-2e-06,0,0,3e-06,0,-2e-06,1e-06,0,1e-06,1e-06,0,0,0,0,-1e-06,1e-06,-4e-06,0,0,-1e-06,0,1e-06,0,-1e-06,0,0,-1e-06,0,0,0,0,-1e-06,2e-06,0,0,-1e-06,0,0,-3e-06,0,0,-3e-06,0,-1e-06,0,0,0,0,1e-06,-2e-06,0,0,-1e-06,0,-1e-06,0,0,-1e-06,-3e-06,0,-1e-06,2e-06
0,-3e-06,3e-06,1e-06,1e-06,1e-06,3e-06,-1e-06,-5e-06,0,-4e-06,1e-06,-3e-06,1e-06,-3e-06,1e-06,2e-06,-1e-06,-1e-06,-4e-06,-2e-06,-2e-06,0,-1e-06,-1e-06,0,-1e-06,1e-06,0,1e-06,1e-06,-4e-06,0,-1e-06,0,1e-06,-1e-06,1e-06,1e-06,1e-06,0,1e-06,1e-06,1e-06,0,-2e-06,0,-3e-06,-1e-06,0,1e-06,0,0,-2e-06,1e-06,0,3e-06,0,0,1e-06,0,0,-3e-06,1e-06,3e-06,0,0,-1e-06,0,-1e-06,0,-1e-06,-1e-06,-1e-06,-1e-06,-1e-06,-1e-06,0,0,0,-2e-06,0,-1e-06,1e-06,1e-06,-1e-06,0,-1e-06,0,0,1e-06,0,0,0,-1e-06,0,0,0,0,0,1e-06,0,2e-06,0,0,0,0,-1e-06,3e-06,0,0,1e-06,1e-06,4e-06,0,-1e-06,0,0,0,0,-3e-06
0,-8e-06,-3e-06,-2e-06,0,-1e-06,2e-06,-1e-06,-3e-06,-5e-06,4e-06,-1e-06,-2e-06,1e-06,-2e-06,-1e-06,0,1e-06,0,2e-06,3e-06,2e-06,0,-2e-06,1e-06,0,0,0,0,-3e-06,0,2e-06,0,0,0,-1e-06,0,-2e-06,2e-06,-1e-06,1e-06,-1e-06,-1e-06,0,-1e-06,2e-06,1e-06,3e-06,1e-06,-1e-06,0,0,0,2e-06,0,0,1e-06,0,-1e-06,0,0,0,0,1e-06,-2e-06,-1e-06,0,-1e-06,0,1e-06,0,1e-06,0,0,0,0,0,0,0,0,0,-1e-06,4e-06,0,0,0,0,0,-1e-06,0,0,-1e-06,0,1e-06,0,0,0,-3e-06,0,-1e-06,0,0,-2e-06,1e-06,-1e-06,0,0,1e-06,-1e-06,0,0,-1e-06,1e-06,-3e-06,0,-1e-06,1e-06,2e-06,-1e-06,0,0
0,3e-06,0,1e-06,0,1e-06,-5e-06,0,2e-06,0,-3e-06,0,2e-06,-1e-06,1e-06,2e-06,-1e-06,0,0,-3e-06,-3e-06,-1e-06,0,0,0,0,-1e-06,2e-06,0,2e-06,-1e-06,2e-06,0,0,0,0,-1e-06,3e-06,-1e-06,1e-06,0,0,1e-06,-1e-06,-1e-06,1e-06,-1e-06,-4e-06,1e-06,-1e-06,-1e-06,0,-1e-06,1e-06,-1e-06,0,-1e-06,0,-1e-06,0,2e-06,0,2e-06,0,1e-06,0,0,-3e-06,0,0,0,-1e-06,0,-1e-06,0,1e-06,0,0,0,0,0,0,-7e-06,-1e-06,-1e-06,1e-06,0,0,1e-06,0,0,2e-06,0,0,1e-06,0,-1e-06,0,0,1e-06,-2e-06,0,1e-06,1e-06,1e-06,0,0,-1e-06,-2e-06,0,0,1e-06,0,-2e-06,0,0,-2e-06,-4e-06,0,0,0
