1.6e-05,4.4e-05,1.5e-05,6.2e-05,5.3e-05,6e-05,8e-05,6.5e-05,7e-06,7e-05,6.5e-05,1.5e-05,4e-05,2.6e-05,4.8e-05,4.1e-05,3.7e-05,1.8e-05,3.7e-05,8.2e-05,4.4e-05,2.9e-05,0.000105,1.3e-05,1.2e-05,3.5e-05,2.9e-05,4.5e-05,6.4e-05,2.2e-05,3.6e-05,1.7e-05,3.7e-05,2.6e-05,1.3e-05,2.6e-05,2.9e-05,8.7e-05,9e-06,3.5e-05,4e-06,4.9e-05,2e-06,5e-05,3.2e-05,7.3e-05,1.1e-05,1e-05,0,2e-06,0.000102,4e-06,4.6e-05,3.1e-05,3.6e-05,3e-06,2.5e-05,5.9e-05,2.1e-05,4.1e-05,1.7e-05,1.4e-05,2.9e-05,7.1e-05,1.1e-05,7e-06,3e-06,1e-05,3e-06,6.4e-05,4.9e-05,1e-05,1.8e-05,1.4e-05,6.3e-05,2.2e-05,9e-06,4.2e-05,2.4e-05,1.7e-05,1.9e-05,1.2e-05,2.2e-05,5.2e-05,9e-06,2.7e-05,1.9e-05,1.3e-05,1.9e-05,4e-06,5e-06,3e-06,1.5e-05,1.6e-05,4.7e-05,1.2e-05,2.8e-05,1e-05,1.5e-05,6e-06,1.6e-05,1.7e-05,3.4e-05,3.8e-05,2.4e-05,6e-05,4.9e-05,4.4e-05,2.1e-05,5e-05,3.5e-05,2.8e-05,1e-05,6e-05,4.2e-05,5e-06,8.6e-05,3.9e-05,2.5e-05,6e-06,0
4.9e-05,0.000104,3.7e-05,0.000198,8.8e-05,0.000103,0.000164,0.00014,5.1e-05,0.000157,0.000106,4.8e-05,0.000119,5.1e-05,0.000112,8.2e-05,8.6e-05,1.4e-05,0.000123,0.000169,0.000131,0.000114,0.000162,1.3e-05,2.3e-05,1e-04,6.8e-05,8.2e-05,0.000139,8.3e-05,8.1e-05,8.8e-05,9.6e-05,5.6e-05,3.8e-05,0.000106,0.00016,0.00014,8.7e-05,0.000107,3.2e-05,0.000136,5e-05,0.000111,6.4e-05,0.000178,4.9e-05,2.7e-05,3e-05,6.4e-05,0.000243,1.9e-05,0.000108,6.5e-05,0.000101,5.9e-05,8.7e-05,0.000145,3.7e-05,6.9e-05,1.7e-05,7.1e-05,4.3e-05,0.000165,1.5e-05,4.6e-05,2.8e-05,2.3e-05,3.3e-05,0.00015,0.000103,2.6e-05,2.6e-05,2.5e-05,0.000139,4.2e-05,3.2e-05,7.8e-05,8.3e-05,3.1e-05,4e-05,3.5e-05,2.6e-05,0.000116,6.5e-05,7.9e-05,7.8e-05,4.6e-05,2.9e-05,5.6e-05,2.2e-05,4.9e-05,2e-05,2.1e-05,0.000107,1.3e-05,0.000106,0.000112,3.9e-05,1e-05,7.2e-05,7.1e-05,8.4e-05,0.000126,8.5e-05,0.000116,0.000128,0.000151,9.1e-05,4.4e-05,7.8e-05,7.7e-05,2.6e-05,0.000132,9.4e-05,2e-05,0.000155,1e-04,3.7e-05,4.9e-05,4.3e-05
0.000159,0.000138,0.000179,0.000139,0.000182,0.000116,0.000145,0.000238,0.000191,0.000206,0.000267,0.000173,0.000189,0.000185,0.000248,3.2e-05,7.3e-05,0.000108,0.000183,0.000268,0.000272,0.000131,0.000255,0.000131,4.6e-05,0.000134,0.000143,0.000196,0.000223,0.000151,0.000144,0.000168,0.000183,5.6e-05,0.000119,0.000164,0.000219,0.000384,0.000232,8.4e-05,5.3e-05,0.000185,4.7e-05,0.00015,8.5e-05,0.000201,3.8e-05,5.2e-05,2.5e-05,4.3e-05,0.000222,8.4e-05,0.000153,6.1e-05,0.000181,3.1e-05,0.000161,0.000149,9.3e-05,7.3e-05,6.3e-05,0.000185,0.000117,0.000178,7.6e-05,0.000121,9.3e-05,0.000106,8.8e-05,0.000196,0.000151,6.9e-05,8.7e-05,3.3e-05,0.000194,8.3e-05,7.1e-05,0.000108,9.7e-05,5.6e-05,6.1e-05,5.9e-05,4.5e-05,0.000146,0.000135,7.3e-05,6e-05,0.000105,1e-04,7.1e-05,7.5e-05,0.000202,0.000111,6.6e-05,0.000112,3.1e-05,7.7e-05,0.000168,0.000118,0.000137,0.000161,0.000123,0.000132,0.000261,0.00011,0.000146,0.000177,0.000184,5.9e-05,0.000158,6.3e-05,0.000192,8.2e-05,0.000101,8.9e-05,8e-05,0.000146,6.1e-05,6.9e-05,5e-05,4.4e-05
0.000232,0.000134,0.000289,0.000266,0.000137,0.000137,0.000485,0.000516,0.000147,9e-05,0.000205,0.000404,0.000254,0.000203,0.000334,0.000282,0.000212,1e-04,0.000136,0.00046,0.000367,0.000322,0.000385,0.000489,0.000362,0.000191,0.000156,0.000226,0.000274,3.9e-05,0.000415,0.000308,0.000457,0.000468,0.000151,0.000156,0.000319,0.000558,0.000219,0.000261,0.000291,8.3e-05,0.000291,0.000161,0.000304,0.00031,0.000125,3.3e-05,0.000213,2e-04,0.000187,0.000217,0.000284,0.000162,0.000245,0.000304,0.00021,0.000274,0.000212,0.000326,9.3e-05,0.000266,0.000107,0.000196,0.00013,0.00029,8.8e-05,0.000277,0.000143,0.000321,8.3e-05,0.000214,0.000253,0.000212,0.000315,0.000229,0.000117,9.5e-05,9.4e-05,0.000194,6.5e-05,0.000189,0.000193,0.00039,0.000126,9.1e-05,0.000245,0.000154,9.2e-05,0.000141,8.2e-05,0.000302,0.000202,0.000171,9.8e-05,7.1e-05,0.000174,0.000222,0.000268,8.6e-05,0.000215,0.000153,0.00042,0.000105,9.7e-05,0.000172,0.000348,0.000258,7.7e-05,0.000131,0.000168,0.000224,0.000237,0.000215,0.00024,0.000133,0.000128,0.000281,0.000177,9.6e-05,6e-05
7.5e-05,0.000114,0.000465,0.000931,0.000381,0.000141,0.000368,0.000796,0.000417,0.000234,7.2e-05,0.000202,0.000149,0.000185,0.000726,0.000489,0.000257,0.000271,0.000131,0.00054,0.000365,0.000198,0.000599,0.000592,0.000501,0.000405,0.000439,0.000223,0.000626,0.000567,0.000764,0.000655,0.000401,0.000151,0.000245,0.000157,0.000132,0.00049,0.000697,0.000709,0.000385,0.000305,0.000471,0.000248,0.000189,0.000541,0.000686,0.000508,0.000612,9.8e-05,0.000407,0.000472,0.000503,0.000602,0.000476,0.000317,0.000262,0.000242,0.000253,0.000181,0.000235,0.000544,0.000417,0.000341,9e-05,0.000102,0.000144,0.000296,0.000513,0.00034,0.000458,0.000502,0.000476,0.000458,0.000129,0.000193,9.7e-05,0.000114,0.000191,0.000371,0.000401,8.9e-05,0.000255,0.000296,0.000486,0.000349,0.000316,9.6e-05,1.3e-05,0.000296,0.00043,7e-04,0.000784,0.000265,0.000184,0.00021,0.000307,0.00058,0.000327,0.000389,0.000687,0.000481,0.00057,0.000459,0.000212,9.4e-05,0.00039,0.000668,0.000565,0.000318,0.000206,0.000306,0.000364,0.000412,0.000485,0.000357,0.00018,0.000202,0.000295,0.000209,0.000181
0.000151,0.000314,0.000457,0.000635,0.000737,0.000235,7e-05,0.000741,0.000765,0.000237,0.000183,0.000208,3.7e-05,0.000107,0.000486,0.000277,0.000177,0.000102,0.000291,0.000421,0.000273,0.000441,0.000476,0.000371,0.000623,0.000168,0.00053,0.000702,0.000559,0.000421,0.000218,0.000913,0.000466,8.9e-05,0.00021,0.000285,0.000353,0.000368,0.000456,0.000221,0.00023,2e-04,0.000283,0.000214,0.000233,0.000633,0.000642,0.000383,0.000325,0.000555,0.000629,0.000642,0.000621,0.000341,0.000386,0.000427,0.000464,0.000378,0.000182,0.000171,0.000179,0.000351,0.000312,0.000207,0.000246,0.000221,0.000182,0.000243,0.000228,0.000151,0.000228,0.000116,0.000389,0.000106,0.000126,1.6e-05,0.000121,0.00021,0.000174,0.000199,0.000313,0.00042,4e-04,0.000429,0.000419,0.000466,0.000378,0.000465,0.000291,0.000468,0.000421,0.00027,0.000325,0.000259,0.00024,0.00027,0.000635,0.000515,0.000411,0.000338,0.000536,0.000285,0.000292,0.000409,0.000405,0.000391,0.000528,0.000327,0.000334,0.000259,0.000266,0.000199,0.00029,0.00011,0.000275,4e-04,8.7e-05,0.000142,0.000122,5.6e-05,0.000135
0.000378,0.000499,0.000372,0.000267,0.000314,0.000387,0.000368,0.000498,0.000166,0.000301,0.000323,0.000192,7.6e-05,0.000152,0.000159,0.000129,0.000132,0.000227,0.000213,0.000437,0.000365,0.000288,0.000514,0.000392,0.000326,0.000246,0.00036,0.000179,0.000286,8.9e-05,0.000239,0.000586,0.000274,0.000114,5.8e-05,0.000519,0.000193,0.000452,0.000272,9.8e-05,0.000249,0.000105,0.000311,0.000123,0.000322,0.000353,0.000309,0.000293,0.00047,0.000212,0.000229,0.000349,0.000171,0.000208,0.000234,4e-04,1e-04,0.000326,0.000125,0.000214,2.7e-05,0.000398,0.000222,0.00039,0.000317,0.000238,0.000105,0.000192,0.000123,0.00015,1e-04,0.000103,0.00018,0.000215,0.000196,7.3e-05,0.000231,6.6e-05,0.000147,0.000199,5.6e-05,4.9e-05,0.000442,0.000234,0.000194,0.000437,0.000216,0.000361,0.000245,0.000242,0.000575,0.000515,0.00034,0.00015,7.3e-05,0.000241,0.00042,0.000278,0.000489,0.000214,0.00043,0.000124,0.000288,4.2e-05,0.000242,0.000594,0.000201,4.8e-05,0.000235,8.3e-05,0.000224,0.000307,0.000283,0.000359,0.000164,0.000162,0.00025,3e-04,0.000133,0.000134,0.000118
0.000614,0.00083,0.000749,0.000193,0.000138,0.000471,0.000235,0.000535,0.000563,0.000219,8.9e-05,8.6e-05,0.000126,0.00018,0.000571,0.000375,0.000236,5.3e-05,0.00043,0.00054,0.000419,0.000297,0.000599,0.000146,0.000367,0.000292,0.000313,0.000186,0.000193,0.000108,0.00037,0.000276,0.000544,0.000453,0.000293,0.00045,0.000379,0.00045,0.000576,0.000478,0.000117,0.000121,0.000288,0.000362,0.000527,0.000124,0.000192,0.000471,0.000502,0.000374,0.000492,0.00065,0.000329,0.000291,0.000127,0.000189,0.000399,0.000154,0.000299,0.000538,0.000383,0.000547,0.000146,0.000536,0.000887,0.000944,6e-04,0.000485,0.000345,0.000406,0.00016,0.000361,0.00013,0.000151,0.000272,0.00045,0.000493,0.000287,0.000235,0.000276,0.000212,9.3e-05,0.000245,0.000692,0.000656,0.000426,0.000219,3.9e-05,0.000518,0.000436,0.000421,0.000445,0.000166,0.000261,0.000143,0.000264,0.000563,0.000429,0.000333,0.00034,0.000142,0.000156,0.000276,0.000295,0.000245,0.000767,0.00083,0.000403,0.000245,0.000151,0.00037,0.000534,0.000562,0.000221,0.00026,0.000183,0.000248,0.00034,0.000273,0.000173,8.1e-05
0.000693,0.000534,0.000168,0.000817,0.000558,0.000452,0.000369,0.000534,0.000571,0.000429,0.000398,0.000425,0.000349,0.000312,0.000659,0.000326,0.000384,0.000242,0.000395,0.000295,0.000416,0.000731,0.000508,0.000632,0.000523,0.000612,0.000795,0.00039,0.000508,0.000484,0.000333,0.000261,0.000588,0.000224,0.000279,0.000448,0.000262,0.000168,0.000302,3e-04,0.000292,0.000294,9.1e-05,0.000155,0.000159,0.000174,8.3e-05,0.00027,0.000206,0.000131,0.000483,0.000212,0.00025,0.000306,0.000206,0.000161,0.00033,0.000181,0.000251,0.000375,0.000121,0.00042,0.000366,0.000552,0.000738,0.000227,0.00013,0.00036,0.000154,0.000444,0.000426,0.000582,0.000284,2e-04,0.000226,0.000261,0.000147,0.000254,0.000199,0.000138,0.000508,0.000605,0.000439,0.000603,0.000457,0.000381,0.000502,0.000466,0.000686,0.000397,0.00033,0.000121,0.000225,0.000352,0.000251,0.00021,0.000298,0.000374,0.000527,0.000214,0.000247,0.000154,0.000197,0.00014,0.000373,0.000707,0.000233,3.8e-05,0.000185,0.000195,0.000373,0.00011,5.3e-05,0.000318,9.5e-05,0.000389,0.00028,0.000241,0.000186,7.8e-05,4e-05
0.000274,0.000372,0.000174,0.000682,0.000217,0.000126,0.000262,0.00046,0.000346,0.000156,0.000188,0.000363,0.000204,0.000206,0.000417,0.000417,0.000107,0.000193,0.000181,0.000513,0.000398,0.000513,0.000213,0.000433,0.000654,0.00023,0.000523,0.000561,0.000376,0.000259,0.000291,0.000324,0.000311,0.000282,0.00032,3e-04,0.000203,0.000282,0.000222,0.000351,0.000347,6.9e-05,0.000176,0.000204,8.2e-05,3.4e-05,7.9e-05,0.000159,0.000129,0.000141,0.000226,0.000293,0.000218,9.4e-05,0.000193,0.000231,2e-04,0.00019,0.000301,0.00043,0.000354,0.000504,0.000355,0.000389,0.000274,8e-05,0.00016,0.000218,0.000146,0.000317,0.000513,0.000477,0.000427,8.2e-05,0.000142,0.000273,0.000247,0.000347,0.000225,0.000238,0.000359,0.000273,0.000419,0.000509,0.00027,0.000188,0.000473,0.000204,0.000431,0.000118,0.000243,0.000218,0.000163,0.000119,0.000225,9.7e-05,0.000187,0.000326,0.000296,0.000187,0.000359,0.000331,0.000262,0.000176,0.000391,0.000221,6.2e-05,0.000122,0.000219,6.1e-05,0.000108,0.000105,8.7e-05,0.000236,0.000315,0.000478,0.000138,6.7e-05,9.3e-05,9.8e-05,0.000197
0.000403,0.000405,0.00018,0.000233,0.00037,0.000413,0.000562,0.000315,0.000228,0.00015,0.000116,0.000372,0.000257,0.000284,8.3e-05,6.4e-05,0.000179,0.000369,0.000209,0.000464,0.000283,0.000387,0.000109,0.000358,9.2e-05,0.00041,0.000145,0.000438,0.000486,0.000277,0.000231,0.000484,0.000257,4.8e-05,0.000253,5.6e-05,4.5e-05,0.000307,0.000167,0.000341,0.000107,6.7e-05,0.000245,9.3e-05,2.7e-05,0.000104,6e-05,1.8e-05,0.000176,0.000329,0.000216,0.000152,0.000191,0.000269,0.000347,0.00032,0.000187,0.00016,7.6e-05,0.000306,0.00044,0.000659,0.000355,2.4e-05,0.000274,0.000256,0.000177,0.00026,0.000355,0.00039,0.000548,0.000774,0.000417,0.000317,0.000115,4.8e-05,0.000293,0.000373,0.000251,0.000139,0.000217,0.000148,0.000531,0.000269,0.000139,0.000125,0.000197,0.000211,0.000464,0.000395,0.000545,0.000549,0.000436,0.000251,0.000114,0.000168,0.000316,0.000598,0.000482,0.000267,0.000282,0.000138,0.000118,1.6e-05,0.000386,0.000261,0.000186,0.000166,8.6e-05,9.5e-05,5.9e-05,6.9e-05,6e-05,4.6e-05,0.00027,0.000294,0.000392,0.000297,0.000102,4.9e-05,0.000263
0.000103,0.000113,1.9e-05,3.8e-05,0.00023,0.000164,0.000256,0.000256,0.000219,0.000129,0.000178,0.000128,0.000118,1e-04,0.000162,0.000216,0.000211,0.000316,0.000131,0.000233,0.000251,0.000235,0.000122,0.000148,6.7e-05,0.000255,0.000221,0.000208,0.000157,0.000131,0.000112,0.000163,0.000245,0.00022,7.8e-05,0.000158,0.000143,0.000162,0.000319,0.000154,0.000219,0.00015,0.000175,7.8e-05,5.8e-05,6.7e-05,0.000121,0.000135,4.4e-05,0.000277,0.000123,5.1e-05,0.000198,0.000147,9.9e-05,0.000168,0.000197,8.4e-05,5.8e-05,0.000185,0.000137,0.000307,0.000111,0.000111,1.5e-05,0.000228,0.000292,0.000113,0.000215,0.000267,0.000193,0.000288,0.000183,0.000276,0.000127,0.000176,0.000163,8.5e-05,0.000125,3.5e-05,3.9e-05,0.00023,0.000122,6.4e-05,0.000117,0.000144,0.000154,0.00015,0.000129,0.000118,0.000262,0.000235,4e-05,5.7e-05,0.000107,7.9e-05,0.000202,0.000198,7.8e-05,0.000137,8.1e-05,0.000103,0.000142,0.000126,0.000245,3.7e-05,4e-05,9e-05,0.000231,0.000203,4.6e-05,5e-05,8.2e-05,1.9e-05,3e-04,0.000148,0.000223,0.000156,3.1e-05,2.1e-05,0.000223
7e-05,3.6e-05,0.00013,4.1e-05,6.9e-05,0.000114,0.000176,5.9e-05,6.6e-05,5.3e-05,9.5e-05,5.6e-05,6.9e-05,5.9e-05,0.000127,0.000248,0.000112,0.000124,8.6e-05,0.000105,0.00011,9.5e-05,0.00013,2.8e-05,6.6e-05,0.000127,0.000149,5.3e-05,8.1e-05,8.7e-05,0.000136,0.000117,0.000118,2.2e-05,8.6e-05,4.4e-05,6.7e-05,9e-05,0.000198,5.8e-05,4.9e-05,5.2e-05,0.000157,8e-05,6e-05,6.8e-05,0.000113,0.000127,0.000116,0.000213,9.8e-05,5e-05,9.4e-05,0.000138,5.2e-05,0.000157,8e-05,7.9e-05,9.4e-05,0.000214,8.9e-05,0.000151,0.000227,0.000112,3.2e-05,8.1e-05,0.000137,7e-05,4.2e-05,0.000132,0.000132,0.00019,0.000155,0.00013,3e-05,0.000134,0.000117,5.3e-05,2.2e-05,0.000112,8.6e-05,0.000193,4.4e-05,3.2e-05,9.4e-05,7.3e-05,4.4e-05,0.000121,3.9e-05,6e-06,0.000165,0.000162,0.000143,5.3e-05,3.9e-05,8.8e-05,0.000106,0.000133,0.000108,4e-05,6e-05,5.3e-05,6.7e-05,8.2e-05,0.000189,4.4e-05,8.4e-05,4.5e-05,0.000142,2.2e-05,9.6e-05,3e-05,5.8e-05,0.000118,0.00015,8e-05,5.5e-05,3.1e-05,4.8e-05,1e-05,0.000112
0.000258,0.00024,1e-04,5.5e-05,7e-05,4.3e-05,0.000141,0.000182,5.2e-05,0.000144,7.2e-05,3.9e-05,5.7e-05,5.2e-05,5.3e-05,0.000235,0.00022,0.000156,0.000133,0.000137,0.000178,0.00012,0.000137,8.5e-05,0.000192,0.000109,0.000164,6.5e-05,9.8e-05,5.8e-05,7.5e-05,0.000116,5.1e-05,6.5e-05,0.000106,7.2e-05,5.4e-05,4e-05,0.000111,1.7e-05,9.7e-05,0.000161,0.000156,0.000163,7e-06,0.000209,0.000153,9.5e-05,6e-05,0.000259,6e-05,7.5e-05,9.2e-05,1e-04,0.000117,4.6e-05,5.6e-05,0.000102,6.7e-05,0.000146,3.8e-05,0.000128,0.000108,0.000166,4.3e-05,0.000113,8.4e-05,6.4e-05,1.5e-05,4.2e-05,5e-05,0.00017,0.000156,0.000133,5.9e-05,8.8e-05,0.00024,0.000124,6.2e-05,0.000167,0.000154,0.000254,9.8e-05,0.000178,4.2e-05,0.000206,0.000112,3.3e-05,0.000165,9.6e-05,9.2e-05,1.6e-05,0.000172,0.000116,8.9e-05,3.3e-05,0.000127,7e-05,1e-04,8.7e-05,7.1e-05,6e-06,0.00016,9e-05,0.000141,6.8e-05,0.000142,7.1e-05,0.00011,0.000102,0.000111,9.7e-05,4.8e-05,6.6e-05,0.000209,6.2e-05,0.000136,0.000132,3.6e-05,4.1e-05,0.000129
0.000101,0.000189,5.4e-05,0.000121,8.9e-05,0.000145,0.000134,0.000223,9e-05,0.000214,0.000111,0.000134,0.000104,0.000163,0.000116,0.000157,0.000159,2.2e-05,3.8e-05,0.000126,0.000247,0.000292,0.000208,5.9e-05,0.000253,0.000372,0.000291,0.000203,6.9e-05,0.00019,0.000167,0.000221,0.000144,0.000113,0.000278,0.000307,0.000137,4.5e-05,0.000217,4.7e-05,0.000119,0.000131,2.8e-05,0.000196,0.000205,0.000257,0.000294,0.000149,0.000115,0.000332,0.000174,0.000154,0.000189,0.000118,0.000223,9.7e-05,0.000219,0.000117,0.00019,6.2e-05,0.000128,0.000162,0.000264,0.000386,0.000277,0.000213,6.7e-05,7.5e-05,3.9e-05,0.000101,9e-05,0.000135,0.00021,8.2e-05,0.000132,5.1e-05,0.000236,0.000185,0.000155,8.9e-05,7.2e-05,0.000346,0.000218,0.000102,3.4e-05,0.000314,0.000159,0.000234,0.000164,0.000267,9.4e-05,0.000168,0.000269,0.000216,0.00012,0.000147,0.000154,0.000114,0.000185,9.4e-05,6.5e-05,0.00011,0.00035,0.000174,0.000147,0.000147,5.2e-05,0.000165,0.000218,0.000165,9.1e-05,0.000121,0.000208,0.000272,0.000219,0.000175,0.000169,8.4e-05,0.000133,0.000137,0.000293
0.000297,0.000305,0.000161,9.7e-05,7.5e-05,0.000302,0.000213,0.000216,0.000434,0.000445,0.000281,0.000291,0.00012,0.000201,0.000458,0.000274,0.000533,0.000397,4.7e-05,0.000181,0.000444,5.8e-05,0.000103,0.000102,0.000321,0.00036,0.000572,0.000163,0.000229,0.000107,0.000189,0.000304,9.1e-05,0.000252,0.000331,0.000286,0.000355,0.000412,7.4e-05,0.000219,9e-05,0.000103,0.00012,8.2e-05,2.7e-05,0.000203,0.000178,9e-05,0.000175,0.000163,0.000339,0.000516,0.000124,6e-05,8e-05,3.8e-05,0.000294,0.000184,0.000187,0.000171,0.000119,0.000207,0.000114,0.000183,0.000137,0.000244,0.000172,0.000278,0.000242,2.4e-05,7.5e-05,8.1e-05,0.000159,0.000381,0.000104,0.000112,4.1e-05,8.4e-05,3.6e-05,0.000185,0.000235,0.000232,0.000168,0.000242,9.3e-05,0.000339,0.000221,0.000287,0.00018,0.000227,0.000206,0.000347,0.000173,0.000126,0.000197,0.000136,0.000222,0.000211,0.000134,0.000427,0.000109,5.8e-05,0.000243,0.000217,3e-04,0.000152,0.000102,0.000333,0.000232,0.000353,0.000204,9.6e-05,0.00019,0.000154,0.000236,0.000206,8.6e-05,0.000232,0.000107,0.000186,0.000158
0.000825,0.000185,0.000501,0.000439,0.000195,0.000363,0.000332,0.000461,0.000767,0.000292,0.000288,0.000713,0.000664,0.000476,0.000693,0.000481,0.000593,0.000835,0.000708,0.00046,0.000277,0.000587,0.000493,0.00015,0.000228,8.8e-05,0.000488,0.000682,0.000287,0.000274,0.000143,0.000161,0.00029,0.00039,0.00043,0.000163,0.00041,0.00019,0.000401,0.000229,0.000136,0.000109,0.000218,0.000228,0.000282,0.000257,0.000526,0.000415,0.000261,0.000224,0.000245,0.000261,0.000358,4.3e-05,3.7e-05,9.7e-05,0.000335,0.000228,0.000215,0.000307,0.000205,3.1e-05,0.000287,0.000312,0.000264,0.000299,0.000529,0.000518,0.00045,0.000276,0.000131,0.000156,0.000215,0.000508,0.000524,0.000328,0.000244,0.000313,0.000237,0.000325,0.000244,0.000292,0.000465,0.000616,0.000322,0.00021,0.000283,0.00012,3e-04,0.000334,0.000328,0.000216,0.000435,0.000481,0.000484,0.000277,0.000278,0.000424,0.000202,0.000494,0.000501,0.00019,0.000205,0.000241,0.000216,0.000241,4e-04,0.000586,0.00061,0.000538,0.000333,0.000212,0.000359,0.000439,0.000602,0.000497,0.000385,0.000497,0.000351,8.4e-05,0.000273
0.001149,0.000928,0.000768,0.000338,0.000101,0.000264,0.000133,0.000314,0.000476,0.000395,0.000166,0.000321,0.000355,0.000192,0.000464,0.000781,0.000796,2.5e-05,0.000371,0.000333,0.000315,0.000587,0.000625,0.000567,0.000355,0.000323,0.000147,0.000601,0.000643,0.000414,0.000377,0.00038,0.00049,0.000251,0.000462,0.000539,0.000126,0.000432,0.000642,0.000368,0.000176,0.000232,0.000218,5.9e-05,0.000365,0.000659,0.000752,0.000466,0.000219,3.1e-05,1.1e-05,0.000272,0.000424,0.000544,0.000287,6.9e-05,0.000334,0.000107,0.000129,0.000316,0.000284,0.000182,0.000318,0.000495,0.000358,0.000343,0.000408,0.000723,0.000332,0.000234,6.4e-05,0.000143,6.2e-05,0.00042,0.000188,0.000258,0.000659,0.00076,0.000573,0.000292,7.9e-05,0.000175,0.000327,0.000194,0.000262,8.2e-05,0.000248,0.000365,0.000174,0.000187,0.000174,0.000423,0.000342,0.000137,0.000203,0.000284,0.000138,0.000453,0.000577,0.000642,0.000514,0.000355,0.000184,0.000276,0.000245,0.00013,0.000276,0.000142,0.000414,0.000296,1.6e-05,0.000264,0.000358,0.000311,0.000192,0.000221,8.6e-05,0.000394,0.000461,0.000433,0.00024
0.000125,0.000229,0.000188,0.00013,3.8e-05,0.000197,0.000176,7.4e-05,0.000135,0.000152,0.00021,0.000222,0.000144,0.000121,0.000355,0.000368,0.000165,0.00018,0.000159,0.000102,8.9e-05,0.000298,0.000113,0.000283,0.000254,0.000215,0.000364,0.000216,0.00027,0.00022,0.000187,0.000251,0.000196,0.000198,0.000191,0.00013,0.000346,0.000424,8.2e-05,0.000123,5.8e-05,0.000142,5.9e-05,0.000176,0.000199,0.000388,3.8e-05,0.000124,9.1e-05,6.2e-05,6e-05,0.00015,0.000233,0.000308,0.000322,0.00019,5.4e-05,0.000133,0.000218,0.000196,4.8e-05,0.000117,0.000136,0.000256,3.9e-05,0.000185,0.000105,0.000294,0.000199,0.00011,5.5e-05,0.00021,0.000146,0.000202,0.000141,0.000245,0.000235,0.000212,1.3e-05,0.000115,0.000167,0.00017,2.6e-05,8.8e-05,0.000106,0.000208,0.000133,0.000246,0.000247,0.000268,0.000178,0.000238,0.000137,0.000182,7.1e-05,0.00011,5.5e-05,0.000267,0.000274,0.000152,0.000222,0.000224,0.000312,0.000182,0.000136,0.000107,0.000205,0.000198,0.000204,8.6e-05,0.000189,0.000155,0.000268,7.7e-05,0.000148,8.4e-05,6.7e-05,0.000285,0.00014,7.5e-05,2e-05
5.5e-05,0.00016,1e-05,5.3e-05,0.000125,0.000203,7.8e-05,0.000135,7.6e-05,7.8e-05,0.000119,0.000296,0.000121,0.000102,0.000248,0.000158,0.000199,0.000142,0.000143,8.3e-05,0.000102,0.000105,0.000173,2.6e-05,8.8e-05,6.7e-05,0.000203,0.000155,0.000168,0.000155,5.9e-05,9.8e-05,9.3e-05,0.000117,0.00015,5.8e-05,0.000189,1e-05,0.000165,6.4e-05,1.9e-05,8.2e-05,0.000147,0.000215,0.000169,0.000137,0.000103,4.4e-05,5.2e-05,4.7e-05,8.8e-05,6.8e-05,0.000183,0.000273,0.000155,0.000141,6.7e-05,9.8e-05,0.00011,3.9e-05,0.000152,0.000106,0.000117,0.000193,0.000178,0.000208,3.8e-05,1e-04,8.6e-05,8.7e-05,0.000114,0.000114,1.6e-05,9e-05,4.2e-05,0.000109,0.000126,4.6e-05,5.5e-05,1e-04,8.5e-05,9.5e-05,0.000117,0.000102,4.3e-05,9.4e-05,0.000188,0.000127,0.000131,9.5e-05,0.000176,0.00014,7.6e-05,6e-05,9.1e-05,2e-05,0.000103,0.000133,0.000158,0.00017,0.000188,0.000106,8.7e-05,0.000111,0.000161,0.000132,0.000105,6.8e-05,0.000208,2e-05,0.000122,8.4e-05,7e-05,7.3e-05,5.8e-05,4.3e-05,0.000125,9e-06,0.000119,0.000121,1.2e-05
5.6e-05,0.000143,3e-05,4.7e-05,5.7e-05,0.000132,6.7e-05,0.000108,2.4e-05,9.1e-05,0.000145,1e-04,5.6e-05,0.000123,8.4e-05,9.3e-05,4e-05,8.8e-05,4.5e-05,5e-05,5.6e-05,4.7e-05,8.6e-05,5.7e-05,0.000131,5.8e-05,1e-04,2.4e-05,5.3e-05,9.3e-05,0.00015,0.000164,6.3e-05,7.8e-05,7.7e-05,3.2e-05,0.000108,0.000111,0.000122,8.6e-05,0.000111,0.000138,5.1e-05,1.6e-05,6.2e-05,6.8e-05,6.9e-05,3.8e-05,4.9e-05,3.9e-05,8.2e-05,0.000112,7.5e-05,0.00017,0.000101,0.000131,1.3e-05,4.8e-05,0.000121,6.1e-05,0.000139,6.8e-05,8.7e-05,5.4e-05,0.000105,4.5e-05,7.1e-05,0.000144,5.8e-05,4.6e-05,5.5e-05,6.8e-05,4e-05,2e-05,9.9e-05,0.000123,0.000119,9.7e-05,0.000116,3.6e-05,8.9e-05,8.8e-05,9.5e-05,7.2e-05,6.2e-05,1.4e-05,2.8e-05,5.6e-05,3.2e-05,4.6e-05,6.4e-05,0.000105,3.7e-05,9.7e-05,5.1e-05,6.9e-05,7e-06,4.1e-05,7.5e-05,3.9e-05,8.9e-05,4.9e-05,0.000104,8.6e-05,9.1e-05,1.1e-05,3e-05,9.7e-05,0.000118,7.1e-05,0.000113,2.9e-05,7.5e-05,2.8e-05,7.4e-05,5e-05,0.00015,0.000111,3.7e-05,2.3e-05,8.5e-05
1.5e-05,0.000101,2.7e-05,4.3e-05,3.9e-05,7.8e-05,7.7e-05,3.1e-05,5.2e-05,5.7e-05,4.1e-05,0.000111,4.2e-05,4.9e-05,7e-05,6.6e-05,2.8e-05,3e-05,3.5e-05,2.9e-05,5.8e-05,4e-05,6e-05,6.8e-05,0.000126,8.2e-05,7.5e-05,6.8e-05,6.2e-05,5.2e-05,7.3e-05,6.7e-05,5.1e-05,5e-05,2e-05,5.8e-05,4e-05,5.3e-05,0.000104,6.4e-05,4.6e-05,1.3e-05,5.6e-05,6.6e-05,6.3e-05,5.3e-05,7.2e-05,4.6e-05,5.4e-05,1.9e-05,1.1e-05,5.6e-05,4.5e-05,0.000101,0.000118,9e-06,2.5e-05,1.9e-05,6.3e-05,2.1e-05,6.4e-05,3.4e-05,3.2e-05,8.9e-05,5.1e-05,8e-05,3.1e-05,0.00011,5e-06,3.1e-05,2.8e-05,4.4e-05,4e-05,2.2e-05,7.3e-05,2.8e-05,0.000124,5.9e-05,7.2e-05,4.5e-05,5e-05,3.1e-05,0.000107,3.8e-05,4.4e-05,1.5e-05,5.1e-05,4.7e-05,6.1e-05,3.3e-05,5.7e-05,4.5e-05,3.2e-05,6.2e-05,2.1e-05,6.8e-05,6.5e-05,4e-05,7.7e-05,4.8e-05,5.6e-05,4.3e-05,4.1e-05,5.8e-05,6.2e-05,4.8e-05,1e-06,4.4e-05,4.9e-05,3e-06,4.3e-05,3.4e-05,5.1e-05,6.8e-05,2.1e-05,2.4e-05,7.4e-05,6.7e-05,2e-06,1.7e-05,5.2e-05
2.8e-05,3.5e-05,3e-06,2.9e-05,2.2e-05,2e-05,3.5e-05,7e-06,1e-05,2.1e-05,1.8e-05,5.6e-05,7e-06,1e-05,2.6e-05,3e-05,1.1e-05,1.1e-05,1.7e-05,1.2e-05,1.7e-05,1e-05,3e-05,3e-05,4.4e-05,1e-05,1.3e-05,2.7e-05,2e-05,1.4e-05,1.3e-05,4.6e-05,2.1e-05,7e-06,1.2e-05,1.8e-05,2e-05,6e-06,4.4e-05,1.4e-05,1.6e-05,2.3e-05,2.4e-05,1.8e-05,2.3e-05,3.3e-05,2.4e-05,1.7e-05,1e-05,1.4e-05,1.8e-05,2.2e-05,2.7e-05,3.1e-05,3e-05,1.9e-05,1.1e-05,1.1e-05,2.7e-05,2.2e-05,6e-06,1.2e-05,1.1e-05,2.7e-05,1.1e-05,5e-05,1.8e-05,4.4e-05,9e-06,1.8e-05,2.2e-05,1.7e-05,1.9e-05,7e-06,8e-06,1.2e-05,2.9e-05,1.9e-05,2.7e-05,8e-06,2.7e-05,9e-06,4.6e-05,2.2e-05,9e-06,7e-06,2.3e-05,2.5e-05,7e-06,1e-05,4.3e-05,5e-05,2e-05,1.3e-05,1.6e-05,2.1e-05,1.9e-05,2.9e-05,1.6e-05,1.3e-05,2.1e-05,1.2e-05,3e-05,2.3e-05,2.6e-05,2.3e-05,8e-06,2.7e-05,3.7e-05,4e-06,1.6e-05,1.6e-05,2.7e-05,2.5e-05,1.2e-05,1.1e-05,3.8e-05,1.9e-05,1e-05,1e-05,1.5e-05
2.2e-05,3.5e-05,1.1e-05,2.1e-05,2.4e-05,2.5e-05,1.5e-05,1.7e-05,1.8e-05,6e-06,1.1e-05,5.1e-05,3.4e-05,1e-05,1.7e-05,3e-06,1.5e-05,7e-06,1.7e-05,3.7e-05,3.2e-05,9e-06,3.6e-05,2.7e-05,1.7e-05,5e-06,2.6e-05,5e-05,1.8e-05,1.7e-05,2.3e-05,4.2e-05,3.3e-05,2.4e-05,2.8e-05,2.9e-05,3.9e-05,5e-06,4.3e-05,9e-06,5e-06,2.2e-05,2.2e-05,2.4e-05,2.9e-05,1.2e-05,2.9e-05,1.3e-05,2.2e-05,2.4e-05,3.4e-05,2.8e-05,4.2e-05,1.6e-05,3e-05,1e-05,1.9e-05,2.2e-05,3.6e-05,3.8e-05,5.3e-05,4.3e-05,2.6e-05,3.9e-05,3.7e-05,5.6e-05,1e-05,4.6e-05,1.5e-05,1.8e-05,1.3e-05,1.1e-05,1.2e-05,1.9e-05,6e-06,3.7e-05,2e-05,4e-05,2.6e-05,2.5e-05,3.8e-05,2.6e-05,6.2e-05,3.6e-05,1.3e-05,1.3e-05,3e-05,2.1e-05,1.1e-05,1.7e-05,3.8e-05,2.3e-05,2.1e-05,8e-06,1.1e-05,3.1e-05,2.1e-05,2.8e-05,2.1e-05,1e-05,3.3e-05,7e-06,1.1e-05,2.3e-05,1.6e-05,2.2e-05,7e-06,1.8e-05,5.8e-05,1.3e-05,2.5e-05,1e-05,1.5e-05,3.6e-05,1.9e-05,6e-06,3e-05,1.7e-05,1.3e-05,1.7e-05,2e-05
9e-06,2.6e-05,8e-06,8e-06,2e-05,4e-06,1.8e-05,1.8e-05,1e-05,2.3e-05,1.9e-05,3.1e-05,2e-05,9e-06,2.8e-05,1.2e-05,6e-06,8e-06,1.3e-05,3.3e-05,2.3e-05,7e-06,2.8e-05,4.3e-05,3.4e-05,3.3e-05,3.9e-05,2.5e-05,3.3e-05,1.9e-05,4.1e-05,1.2e-05,2.1e-05,1.5e-05,1.7e-05,9e-06,2.5e-05,3.4e-05,1.9e-05,3.5e-05,2e-06,2.2e-05,2.2e-05,2.9e-05,1.5e-05,1.9e-05,2.6e-05,3.6e-05,2.1e-05,1e-05,2.7e-05,9e-06,3.8e-05,3.9e-05,5.7e-05,4.9e-05,2.3e-05,2.3e-05,2.9e-05,2.6e-05,3.9e-05,2.1e-05,1.3e-05,5.5e-05,2.2e-05,1e-05,1.5e-05,4.1e-05,2.2e-05,1.6e-05,1e-05,3.5e-05,2.6e-05,3.5e-05,2.7e-05,3.4e-05,4.7e-05,2.7e-05,2.1e-05,1.2e-05,3e-05,3.3e-05,3.1e-05,5.7e-05,4.8e-05,4.1e-05,1e-05,2.8e-05,3.1e-05,2.4e-05,3.8e-05,3.5e-05,2.4e-05,2.2e-05,2.1e-05,1e-05,1.4e-05,2.6e-05,8e-06,9e-06,3.1e-05,2.1e-05,3.5e-05,2.1e-05,6e-06,1.7e-05,1.8e-05,1.6e-05,4.5e-05,2.8e-05,1.7e-05,1.3e-05,8e-06,9e-06,1.8e-05,1e-05,1.4e-05,2.5e-05,2.6e-05,2.1e-05,2e-06
8e-06,1.5e-05,2.1e-05,9e-06,1e-06,3.9e-05,2.5e-05,9e-06,1.1e-05,2.2e-05,2.2e-05,1.3e-05,1.3e-05,3.1e-05,2.8e-05,7e-06,1.3e-05,1.5e-05,1.2e-05,1.9e-05,2.8e-05,2.5e-05,1.2e-05,1.9e-05,2.8e-05,3e-05,3.8e-05,3.3e-05,3.1e-05,2.3e-05,2.3e-05,3e-05,2.5e-05,2.1e-05,1.5e-05,1.8e-05,2.6e-05,3.2e-05,2.7e-05,1.2e-05,2e-05,4e-06,1e-05,1.9e-05,1.1e-05,1.6e-05,1.4e-05,5e-06,1.5e-05,3.1e-05,7e-06,1.5e-05,2.4e-05,1.7e-05,4.6e-05,3.5e-05,9e-06,1.4e-05,4e-06,7e-06,3.1e-05,2.7e-05,1.2e-05,2.7e-05,8e-06,1.5e-05,1.2e-05,3.2e-05,1.9e-05,2e-06,2.1e-05,3e-05,4e-06,1.1e-05,5e-06,2.1e-05,3.2e-05,3.7e-05,2.5e-05,6e-06,3.3e-05,2.3e-05,1.9e-05,2.3e-05,1.5e-05,9e-06,1.8e-05,2.5e-05,7e-06,2.9e-05,1.3e-05,2.8e-05,2.4e-05,1e-05,1e-05,5e-06,9e-06,5e-06,1e-06,1.8e-05,1.4e-05,1.6e-05,3.9e-05,1.8e-05,2.4e-05,2.5e-05,1e-05,1.3e-05,3.5e-05,2.4e-05,6e-06,1.2e-05,1.4e-05,2.3e-05,1.5e-05,1.4e-05,3e-05,1.1e-05,1.5e-05,9e-06,1.1e-05
8e-06,2.6e-05,7e-06,4e-06,9e-06,3.2e-05,1.6e-05,9e-06,4e-06,1.4e-05,4e-06,2.7e-05,1e-06,2.3e-05,1.2e-05,2.2e-05,8e-06,1.5e-05,6e-06,2e-06,2.7e-05,1.6e-05,9e-06,2.1e-05,3.1e-05,1.8e-05,1.6e-05,1.2e-05,2.2e-05,1.4e-05,8e-06,4e-06,1.1e-05,1.3e-05,1.3e-05,7e-06,1.1e-05,9e-06,2.2e-05,2e-06,3e-06,2e-06,1.7e-05,1.3e-05,1e-05,2e-05,9e-06,1.5e-05,5e-06,2.3e-05,2.1e-05,1.2e-05,3e-05,2.5e-05,2.4e-05,1.3e-05,5e-06,1.1e-05,3e-06,5e-06,1.6e-05,7e-06,6e-06,2.3e-05,6e-06,2.6e-05,1e-05,2.1e-05,5e-06,1.7e-05,1.2e-05,2e-05,4e-06,1.6e-05,1.5e-05,2.6e-05,2.6e-05,3.4e-05,7e-06,6e-06,3.4e-05,6e-06,1.9e-05,7e-06,3e-06,8e-06,1.1e-05,1.6e-05,6e-06,1.4e-05,9e-06,2.6e-05,1.7e-05,1.7e-05,3e-06,1e-05,1.3e-05,2.4e-05,1.2e-05,1.9e-05,1.7e-05,4e-06,2.8e-05,2e-05,3.1e-05,2e-05,1.6e-05,1e-06,2.2e-05,8e-06,1.9e-05,3e-06,1.5e-05,2.3e-05,9e-06,1e-05,2.3e-05,1.5e-05,4e-06,1.2e-05,5e-06
1.3e-05,3.1e-05,2e-06,1e-05,2e-05,3.5e-05,1.5e-05,1.1e-05,8e-06,8e-06,2e-06,2.8e-05,6e-06,1.4e-05,1e-05,1.5e-05,1.3e-05,1.5e-05,1.3e-05,1.4e-05,1.8e-05,1e-06,7e-06,2.3e-05,2.9e-05,1.6e-05,8e-06,1.5e-05,9e-06,1.2e-05,1.6e-05,1.3e-05,1.2e-05,8e-06,1.1e-05,7e-06,8e-06,7e-06,2.6e-05,3e-06,1.2e-05,5e-06,1.4e-05,1.4e-05,2e-06,2.1e-05,1.5e-05,7e-06,6e-06,3e-06,1.5e-05,2.7e-05,1.3e-05,2e-05,2.2e-05,1.7e-05,5e-06,9e-06,1.7e-05,1.4e-05,9e-06,4e-06,7e-06,1.6e-05,2e-06,2.7e-05,6e-06,3e-05,2e-06,1.1e-05,6e-06,2.1e-05,9e-06,9e-06,7e-06,2.2e-05,3.1e-05,2.1e-05,1e-05,6e-06,2.8e-05,1.2e-05,1.4e-05,1.1e-05,8e-06,1.2e-05,2e-06,1e-05,9e-06,1.3e-05,1.3e-05,1.9e-05,3e-06,5e-06,9e-06,1.4e-05,1.4e-05,1.8e-05,8e-06,1.3e-05,1e-05,1e-06,2.5e-05,8e-06,1e-05,1e-05,1.7e-05,5e-06,1.7e-05,7e-06,1.2e-05,1e-05,1.1e-05,2.6e-05,5e-06,9e-06,2e-05,1.2e-05,9e-06,1e-05,4e-06
1.3e-05,1.8e-05,1.7e-05,1e-05,1.3e-05,2e-05,1.3e-05,1.2e-05,6e-06,8e-06,3e-06,2.9e-05,8e-06,1.6e-05,1.7e-05,1.6e-05,6e-06,5e-06,1.3e-05,9e-06,1.3e-05,2e-06,1.2e-05,1.5e-05,2.8e-05,1.1e-05,7e-06,1.7e-05,1.3e-05,1.3e-05,3e-06,1.8e-05,3e-06,2e-06,1e-05,1.9e-05,8e-06,7e-06,3.1e-05,8e-06,1e-05,6e-06,1e-05,2.1e-05,6e-06,1.3e-05,1.4e-05,1.7e-05,1e-06,1e-05,5e-06,2.2e-05,1.9e-05,2e-05,1.8e-05,5e-06,1.4e-05,3e-06,1.4e-05,1.2e-05,5e-06,1.2e-05,1.3e-05,1.6e-05,8e-06,2e-05,1.1e-05,4.2e-05,8e-06,3e-06,1.1e-05,2.4e-05,1.9e-05,1.4e-05,1.3e-05,1e-05,2.4e-05,1.7e-05,8e-06,1.5e-05,2.6e-05,4e-06,1.5e-05,1.2e-05,6e-06,1e-05,1e-05,1.1e-05,1.6e-05,4e-06,1.6e-05,1.4e-05,1e-05,1e-05,6e-06,6e-06,1.6e-05,2.1e-05,8e-06,1.8e-05,2.1e-05,7e-06,2.4e-05,5e-06,1.7e-05,1.7e-05,1.5e-05,7e-06,1.9e-05,4e-06,1.3e-05,1.5e-05,8e-06,2.4e-05,4e-06,5e-06,2.6e-05,1.2e-05,1.1e-05,1.1e-05,1.2e-05
7e-06,2.4e-05,2.5e-05,8e-06,8e-06,1.6e-05,6e-06,9e-06,9e-06,9e-06,5e-06,2e-05,9e-06,1.4e-05,9e-06,1e-05,1e-05,1.3e-05,2.6e-05,1.7e-05,1e-05,6e-06,1.7e-05,1.3e-05,1.6e-05,1.4e-05,1.5e-05,1.4e-05,1e-05,6e-06,1.3e-05,1.6e-05,5e-06,1.2e-05,1.5e-05,1.5e-05,2e-06,1.4e-05,1.1e-05,1.6e-05,9e-06,1.1e-05,1.1e-05,2.3e-05,7e-06,2.4e-05,4e-06,9e-06,1.3e-05,1.9e-05,1.6e-05,1e-05,2e-05,7e-06,1.5e-05,8e-06,5e-06,7e-06,1.6e-05,1.4e-05,1.8e-05,1.4e-05,8e-06,1.8e-05,1e-05,3.5e-05,7e-06,3.3e-05,1e-05,1.1e-05,9e-06,2.7e-05,1.8e-05,3e-06,1.1e-05,1.4e-05,1.8e-05,2.1e-05,1.4e-05,1.2e-05,1.5e-05,4e-06,1.6e-05,4e-06,1e-05,1e-05,9e-06,1e-05,1e-05,5e-06,9e-06,1.6e-05,1.3e-05,9e-06,4e-06,1.6e-05,2.2e-05,8e-06,7e-06,1.6e-05,1.4e-05,5e-06,1.9e-05,1e-05,1e-05,1.8e-05,1.4e-05,2e-06,2.4e-05,4e-06,1.9e-05,1.5e-05,1.9e-05,1.5e-05,5e-06,5e-06,1.3e-05,1.4e-05,7e-06,1.4e-05,1.8e-05
1e-06,1.7e-05,1.3e-05,1.9e-05,2e-05,2.2e-05,8e-06,5e-06,5e-06,4e-06,6e-06,1.4e-05,1.2e-05,1.2e-05,2e-06,7e-06,8e-06,1.2e-05,1.3e-05,2e-05,7e-06,8e-06,1.4e-05,2.1e-05,1.5e-05,1.4e-05,1e-05,2.1e-05,1.9e-05,1.6e-05,2.1e-05,1.5e-05,8e-06,1.9e-05,1.1e-05,3e-06,1.4e-05,1.1e-05,1.1e-05,1.9e-05,1.3e-05,5e-06,6e-06,1e-05,1.2e-05,2.5e-05,1.1e-05,6e-06,9e-06,1.8e-05,8e-06,9e-06,1.2e-05,2e-05,1.4e-05,4e-06,1.4e-05,1.3e-05,7e-06,8e-06,9e-06,1e-05,6e-06,1.5e-05,1.2e-05,2.3e-05,4e-06,2.6e-05,1.4e-05,2.1e-05,1.3e-05,1.6e-05,8e-06,1.2e-05,1.8e-05,7e-06,1.9e-05,7e-06,3e-06,6e-06,2.4e-05,1.2e-05,1.8e-05,4e-06,8e-06,5e-06,8e-06,8e-06,8e-06,1e-05,1e-05,2.6e-05,2.1e-05,1.3e-05,1.2e-05,2.2e-05,1.6e-05,9e-06,2e-06,9e-06,1.2e-05,7e-06,1.7e-05,1.1e-05,1.4e-05,1.5e-05,1e-05,8e-06,2.1e-05,6e-06,1.7e-05,9e-06,2e-06,2e-05,6e-06,9e-06,1.6e-05,1e-05,1e-05,1.5e-05,8e-06
8e-06,1.1e-05,1e-05,1.8e-05,1e-06,2.8e-05,1.8e-05,1e-05,1.5e-05,1e-05,6e-06,2.7e-05,6e-06,1.1e-05,3e-06,5e-06,1.3e-05,1.9e-05,6e-06,1.8e-05,1.5e-05,5e-06,1.8e-05,1.7e-05,1.1e-05,1.9e-05,8e-06,4e-06,1.4e-05,1.5e-05,4e-06,1e-05,1.4e-05,1.2e-05,9e-06,3e-06,1.1e-05,1.1e-05,2.1e-05,1.5e-05,1.1e-05,2e-06,1.1e-05,1.3e-05,9e-06,1.3e-05,1.4e-05,3e-06,1.2e-05,2.7e-05,1e-05,2.3e-05,2.8e-05,2.5e-05,6e-06,1.3e-05,1.3e-05,1.7e-05,1e-05,1.1e-05,4e-06,1.4e-05,8e-06,1.5e-05,6e-06,2.3e-05,9e-06,2.5e-05,1e-06,1.7e-05,1.8e-05,2.4e-05,7e-06,1.3e-05,1e-05,1e-05,2.8e-05,1.5e-05,8e-06,8e-06,2e-05,1.1e-05,1.9e-05,1.3e-05,1e-05,1.2e-05,6e-06,6e-06,9e-06,1.4e-05,2e-05,1.8e-05,7e-06,1.1e-05,9e-06,1.1e-05,7e-06,6e-06,7e-06,5e-06,2.2e-05,6e-06,2.5e-05,1.8e-05,4e-06,2.6e-05,8e-06,1e-06,1.2e-05,6e-06,4e-06,1.1e-05,8e-06,2.9e-05,8e-06,9e-06,2.5e-05,8e-06,8e-06,2e-06,6e-06
1.3e-05,1.1e-05,1e-05,9e-06,9e-06,1.9e-05,1.7e-05,2e-06,1.8e-05,1.2e-05,6e-06,2.8e-05,1.1e-05,1.4e-05,7e-06,1.5e-05,1e-05,1.3e-05,1.6e-05,1.2e-05,6e-06,1.7e-05,1.5e-05,2.3e-05,2.1e-05,1.9e-05,4e-06,1e-06,2.3e-05,1.3e-05,2e-05,1.2e-05,1.3e-05,2e-05,1.9e-05,8e-06,1.1e-05,1.5e-05,1.3e-05,1.1e-05,8e-06,1.4e-05,2.2e-05,1.9e-05,1.2e-05,1.4e-05,1.3e-05,1.8e-05,1.9e-05,1.5e-05,2e-06,2.7e-05,2.1e-05,4e-06,8e-06,6e-06,1e-05,1.1e-05,1e-05,6e-06,2e-06,1.4e-05,1.3e-05,2e-05,1.6e-05,2.2e-05,4e-06,2.2e-05,2e-05,2.5e-05,2e-05,5e-06,2.6e-05,1e-05,1e-05,9e-06,2.9e-05,1.6e-05,8e-06,6e-06,2e-05,7e-06,1.6e-05,1.2e-05,1.9e-05,5e-06,7e-06,1.3e-05,9e-06,1.2e-05,9e-06,2.3e-05,1.5e-05,1.3e-05,5e-06,8e-06,2.1e-05,1e-06,6e-06,2.1e-05,2e-05,1.2e-05,2.5e-05,1e-05,7e-06,2e-05,1.9e-05,5e-06,1.3e-05,5e-06,1.6e-05,5e-06,1.2e-05,2.2e-05,4e-06,3e-06,1.3e-05,9e-06,7e-06,2e-06,1.2e-05
1.5e-05,2.9e-05,1.9e-05,1.8e-05,5e-06,2.6e-05,6e-06,7e-06,2.1e-05,1.3e-05,5e-06,2.7e-05,5e-06,2.9e-05,1.2e-05,2e-05,1.3e-05,1.4e-05,1.5e-05,8e-06,4e-06,1.2e-05,1.5e-05,1e-05,2.8e-05,1.9e-05,1e-05,1e-06,1.6e-05,1.7e-05,2.8e-05,2e-05,9e-06,9e-06,1.8e-05,1.1e-05,9e-06,1.3e-05,2e-05,9e-06,1.1e-05,1.2e-05,4e-06,3e-05,1.3e-05,1e-05,1e-05,2.9e-05,1.8e-05,2.2e-05,7e-06,8e-06,2.1e-05,1.9e-05,1.5e-05,8e-06,1.4e-05,1.1e-05,2.3e-05,3e-06,7e-06,9e-06,1.2e-05,8e-06,7e-06,1.8e-05,1e-05,1.1e-05,1.4e-05,2.4e-05,8e-06,8e-06,1.7e-05,1.9e-05,6e-06,1.5e-05,3e-05,2.8e-05,6e-06,1.3e-05,3.1e-05,1e-05,1e-05,1.5e-05,8e-06,1.1e-05,6e-06,8e-06,7e-06,1.2e-05,2.4e-05,2.9e-05,9e-06,2.3e-05,1.7e-05,1.1e-05,1e-05,1.2e-05,1.7e-05,2.4e-05,2.1e-05,1.4e-05,1.2e-05,1.9e-05,1.1e-05,1.7e-05,8e-06,2.3e-05,2.5e-05,9e-06,1.6e-05,7e-06,1.4e-05,1.1e-05,1.2e-05,9e-06,4e-06,6e-06,1.3e-05,1.9e-05,1e-05
1.7e-05,1.8e-05,6e-06,1.2e-05,1e-05,2.7e-05,1.6e-05,1e-05,8e-06,7e-06,3e-06,2.5e-05,8e-06,1.9e-05,1.6e-05,1.4e-05,3e-06,8e-06,2e-06,1.8e-05,9e-06,9e-06,1.3e-05,1.7e-05,1.1e-05,3.6e-05,2.1e-05,1.9e-05,1.6e-05,1.8e-05,2.4e-05,3.2e-05,1.4e-05,1.7e-05,6e-06,1e-05,2.1e-05,1.9e-05,1.5e-05,1.9e-05,1.2e-05,1.6e-05,7e-06,1.5e-05,9e-06,1.1e-05,2.9e-05,2.7e-05,2.5e-05,3.7e-05,1.4e-05,1.4e-05,8e-06,8e-06,1.6e-05,9e-06,1e-05,8e-06,6e-06,1.2e-05,1.9e-05,1.8e-05,1e-05,1.9e-05,1.5e-05,2.2e-05,1.7e-05,1.4e-05,8e-06,1e-05,2e-05,1.3e-05,1e-05,1e-06,1.6e-05,1.8e-05,2.8e-05,1.4e-05,1.5e-05,1.1e-05,1.5e-05,5e-06,1.6e-05,1.4e-05,9e-06,1.6e-05,6e-06,9e-06,8e-06,9e-06,2e-05,1.4e-05,9e-06,1.2e-05,1.4e-05,1.3e-05,1.4e-05,1.5e-05,1.6e-05,4e-06,1.2e-05,5e-06,1.3e-05,2.1e-05,5e-06,1.9e-05,1.2e-05,1.2e-05,6e-06,7e-06,6e-06,6e-06,1.2e-05,1.1e-05,8e-06,8e-06,2e-05,1.8e-05,1.4e-05,1.5e-05,1.7e-05
1e-05,1.1e-05,7e-06,7e-06,6e-06,1.4e-05,1.3e-05,3e-06,6e-06,9e-06,6e-06,2.7e-05,1.1e-05,1e-05,1.5e-05,1.3e-05,1.1e-05,1.2e-05,9e-06,2.2e-05,1.5e-05,1.2e-05,8e-06,1.9e-05,1e-05,1.6e-05,2e-06,1e-05,1.5e-05,7e-06,1.1e-05,1.4e-05,7e-06,1e-05,1.8e-05,6e-06,9e-06,5e-06,2.1e-05,1.1e-05,1.1e-05,1.6e-05,2e-06,1.4e-05,1e-05,1.1e-05,1.9e-05,2e-06,1.2e-05,1.5e-05,1.5e-05,7e-06,1e-05,1e-05,7e-06,4e-06,2e-06,4e-06,4e-06,3e-06,1.6e-05,3e-06,1e-05,9e-06,3e-06,2e-05,1.2e-05,1.6e-05,5e-06,2e-06,5e-06,1.3e-05,2e-06,5e-06,1.3e-05,9e-06,1.7e-05,8e-06,7e-06,5e-06,1.6e-05,4e-06,1.7e-05,7e-06,5e-06,7e-06,1.3e-05,3e-06,3e-06,8e-06,1.5e-05,1.8e-05,1.9e-05,9e-06,1.2e-05,9e-06,1e-05,1.7e-05,1e-05,2e-06,1.2e-05,6e-06,1.9e-05,1.1e-05,4e-06,1e-05,4e-06,6e-06,1.4e-05,7e-06,6e-06,2e-06,1.4e-05,1.6e-05,5e-06,1.1e-05,1e-05,1.6e-05,1e-05,6e-06,8e-06
7e-06,1.5e-05,8e-06,7e-06,2e-06,1.6e-05,2.1e-05,6e-06,3e-06,1.2e-05,1e-06,2.2e-05,9e-06,1e-05,9e-06,1.2e-05,6e-06,9e-06,7e-06,1.5e-05,2e-05,9e-06,1.6e-05,2.6e-05,6e-06,6e-06,8e-06,1e-05,7e-06,3e-06,2e-06,7e-06,5e-06,5e-06,9e-06,3e-06,3e-06,2e-06,2.3e-05,1.4e-05,1.5e-05,1.7e-05,8e-06,1.4e-05,3e-06,1e-05,1.3e-05,2e-06,8e-06,1e-05,9e-06,1.4e-05,8e-06,1.1e-05,1e-05,2e-06,1e-05,3e-06,6e-06,8e-06,5e-06,5e-06,7e-06,6e-06,8e-06,1.1e-05,3e-06,1.5e-05,1.2e-05,1e-05,9e-06,1.4e-05,5e-06,1e-06,9e-06,1.3e-05,1.9e-05,1.8e-05,7e-06,6e-06,1.9e-05,2e-06,1.6e-05,5e-06,5e-06,9e-06,9e-06,8e-06,1.2e-05,7e-06,1.6e-05,2e-05,1.9e-05,2e-06,3e-06,1e-05,8e-06,9e-06,5e-06,3e-06,6e-06,2e-06,2e-05,1.2e-05,1e-05,8e-06,1.3e-05,3e-06,1.1e-05,6e-06,2e-06,1e-05,1.2e-05,1.3e-05,6e-06,7e-06,1.8e-05,1.4e-05,1.2e-05,5e-06,1.6e-05
5e-06,1.1e-05,5e-06,8e-06,1e-05,1.4e-05,1.6e-05,4e-06,5e-06,2e-06,5e-06,2.7e-05,1.1e-05,1.5e-05,9e-06,3e-06,7e-06,6e-06,1e-06,1e-05,8e-06,6e-06,1.6e-05,1.9e-05,6e-06,6e-06,4e-06,1.3e-05,9e-06,1.2e-05,6e-06,1.2e-05,5e-06,4e-06,6e-06,2e-06,1.3e-05,9e-06,1.7e-05,1.4e-05,6e-06,3e-06,8e-06,1e-05,5e-06,1.4e-05,1e-05,4e-06,2e-06,1.3e-05,5e-06,1.2e-05,1.4e-05,1.2e-05,1.4e-05,9e-06,3e-06,5e-06,5e-06,7e-06,5e-06,5e-06,1.1e-05,1e-05,8e-06,1.5e-05,1e-06,2.8e-05,1.4e-05,1.3e-05,1.5e-05,1.7e-05,2e-06,4e-06,1e-06,1.1e-05,2.6e-05,1.4e-05,1.2e-05,5e-06,1.6e-05,4e-06,1.5e-05,4e-06,1e-05,9e-06,3e-06,1e-05,8e-06,7e-06,1.4e-05,2e-05,1.3e-05,9e-06,7e-06,9e-06,6e-06,1.6e-05,5e-06,6e-06,1e-05,3e-06,1.8e-05,1.2e-05,9e-06,4e-06,6e-06,1e-06,1.2e-05,4e-06,6e-06,4e-06,9e-06,1.9e-05,3e-06,6e-06,1.7e-05,9e-06,5e-06,4e-06,1.8e-05
4e-06,1.4e-05,5e-06,6e-06,6e-06,1.1e-05,8e-06,6e-06,6e-06,4e-06,4e-06,2.3e-05,7e-06,1.1e-05,1e-05,1.2e-05,1e-06,6e-06,3e-06,1e-05,4e-06,6e-06,5e-06,1.6e-05,5e-06,8e-06,6e-06,1.3e-05,7e-06,8e-06,4e-06,1.3e-05,5e-06,3e-06,1.1e-05,4e-06,1.2e-05,2e-06,2.4e-05,8e-06,3e-06,4e-06,8e-06,1.4e-05,5e-06,1.6e-05,1e-05,4e-06,2e-06,1.3e-05,4e-06,1.4e-05,1.1e-05,1e-05,1e-05,4e-06,9e-06,3e-06,7e-06,7e-06,8e-06,7e-06,4e-06,1.1e-05,8e-06,1.3e-05,1e-05,1.9e-05,9e-06,8e-06,1.1e-05,1.8e-05,5e-06,5e-06,7e-06,1.2e-05,2.1e-05,1.3e-05,1e-05,4e-06,1.8e-05,7e-06,1.3e-05,4e-06,8e-06,8e-06,4e-06,7e-06,1e-05,8e-06,1.7e-05,2.2e-05,1.1e-05,6e-06,2e-06,8e-06,1.2e-05,1e-05,7e-06,3e-06,1.5e-05,2e-06,1.8e-05,9e-06,1e-05,7e-06,7e-06,4e-06,1.8e-05,5e-06,9e-06,5e-06,4e-06,1.6e-05,2e-06,0,1.8e-05,1.1e-05,1e-06,4e-06,1.1e-05
6e-06,1.5e-05,7e-06,4e-06,3e-06,1.5e-05,1.3e-05,6e-06,5e-06,7e-06,4e-06,2.4e-05,4e-06,1.4e-05,7e-06,6e-06,3e-06,9e-06,4e-06,1.1e-05,7e-06,8e-06,3e-06,1.7e-05,9e-06,8e-06,5e-06,1.2e-05,9e-06,4e-06,0,1.1e-05,6e-06,4e-06,8e-06,5e-06,3e-06,5e-06,2.1e-05,1e-05,4e-06,5e-06,1e-05,8e-06,4e-06,1e-05,6e-06,4e-06,1e-06,1.2e-05,4e-06,1.2e-05,8e-06,9e-06,8e-06,7e-06,1.1e-05,3e-06,6e-06,9e-06,4e-06,4e-06,8e-06,1e-05,5e-06,1.9e-05,6e-06,2e-05,6e-06,9e-06,9e-06,1.7e-05,7e-06,5e-06,5e-06,1.1e-05,2e-05,1.4e-05,6e-06,1e-06,1.7e-05,6e-06,1.8e-05,4e-06,4e-06,6e-06,8e-06,5e-06,9e-06,5e-06,1.6e-05,2.1e-05,6e-06,1e-06,3e-06,7e-06,1.1e-05,1e-05,7e-06,4e-06,1.2e-05,3e-06,2e-05,1.2e-05,1e-05,8e-06,8e-06,3e-06,1.1e-05,2e-06,3e-06,5e-06,6e-06,1.5e-05,3e-06,3e-06,1.6e-05,1.2e-05,6e-06,1e-06,5e-06
7e-06,1.3e-05,6e-06,6e-06,7e-06,1.1e-05,1.1e-05,2e-06,3e-06,5e-06,1e-06,2e-05,6e-06,1.2e-05,6e-06,7e-06,0,5e-06,5e-06,9e-06,9e-06,6e-06,1e-06,1.7e-05,1.1e-05,8e-06,3e-06,9e-06,1e-05,3e-06,3e-06,1.1e-05,4e-06,1e-06,1.2e-05,1e-06,3e-06,4e-06,2e-05,7e-06,3e-06,6e-06,5e-06,9e-06,4e-06,1.1e-05,8e-06,1e-06,1e-06,1.1e-05,4e-06,1.1e-05,1.2e-05,9e-06,6e-06,5e-06,8e-06,1e-06,7e-06,7e-06,4e-06,5e-06,7e-06,8e-06,3e-06,1.8e-05,8e-06,1.9e-05,6e-06,9e-06,1e-05,1.2e-05,3e-06,5e-06,7e-06,7e-06,2.2e-05,1e-05,8e-06,1e-06,1.6e-05,3e-06,1.6e-05,2e-06,3e-06,8e-06,8e-06,2e-06,8e-06,6e-06,1.3e-05,2e-05,8e-06,2e-06,4e-06,7e-06,1e-05,1.2e-05,7e-06,3e-06,1.2e-05,1e-06,1.5e-05,1.2e-05,8e-06,1e-05,1e-05,4e-06,1e-05,5e-06,6e-06,3e-06,7e-06,1.4e-05,1e-06,2e-06,1.4e-05,1.3e-05,1e-06,4e-06,8e-06
7e-06,1.3e-05,6e-06,6e-06,8e-06,1.2e-05,1e-05,1e-06,3e-06,4e-06,1e-06,1.9e-05,9e-06,1.4e-05,4e-06,8e-06,0,2e-06,4e-06,1.1e-05,7e-06,7e-06,1e-06,1.7e-05,9e-06,1.1e-05,6e-06,1e-05,9e-06,4e-06,1e-06,1.1e-05,3e-06,2e-06,1.2e-05,2e-06,4e-06,5e-06,1.9e-05,6e-06,4e-06,5e-06,5e-06,1.1e-05,4e-06,1.1e-05,9e-06,2e-06,1e-06,1.2e-05,2e-06,1.2e-05,9e-06,1e-05,7e-06,7e-06,8e-06,1e-06,6e-06,5e-06,2e-06,5e-06,7e-06,7e-06,3e-06,1.6e-05,7e-06,1.8e-05,6e-06,9e-06,1e-05,1.2e-05,3e-06,3e-06,4e-06,8e-06,2e-05,1.2e-05,9e-06,2e-06,1.8e-05,3e-06,1.4e-05,4e-06,3e-06,8e-06,7e-06,1e-06,7e-06,4e-06,1.5e-05,1.9e-05,8e-06,2e-06,2e-06,8e-06,1e-05,1.2e-05,7e-06,3e-06,1.1e-05,2e-06,1.6e-05,1.2e-05,7e-06,9e-06,7e-06,2e-06,1.1e-05,4e-06,4e-06,3e-06,7e-06,1.4e-05,1e-06,1e-06,1.4e-05,1.1e-05,5e-06,2e-06,7e-06
