0.006689,0.025855,0.291777,0.495094,0.306582,0.191354,0.311295,0.713131,1.117029,1.163566,0.915226,0.742161,0.834304,0.877752,0.735863,0.657988,0.622084,0.362518,0.171399,0.163578,0.150428,0.159281,0.200794,0.12817,0.037057,0.029909,0.026925,0.022116
0.008282,0.030861,0.331049,0.561038,0.354266,0.23287,0.370441,0.794303,1.225798,1.29337,1.019032,0.82671,0.946982,1.026682,0.885878,0.781026,0.72152,0.416431,0.197301,0.191365,0.173707,0.184656,0.234968,0.149888,0.043485,0.034765,0.030682,0.02538
0.010925,0.037949,0.369873,0.623789,0.408011,0.296113,0.459757,0.892904,1.341926,1.446039,1.15891,0.961279,1.117876,1.252456,1.133713,0.98142,0.863346,0.487446,0.234722,0.230128,0.202472,0.218594,0.283438,0.180823,0.05316,0.041704,0.035796,0.030194
0.012796,0.039048,0.332945,0.564642,0.39199,0.32554,0.506341,0.919309,1.381361,1.541881,1.274929,1.105253,1.26828,1.396266,1.305,1.115924,0.926841,0.516929,0.256206,0.240143,0.198866,0.223178,0.297894,0.190852,0.058367,0.045051,0.03851,0.034137
0.014363,0.035107,0.265821,0.47019,0.346294,0.313141,0.517814,0.986247,1.519695,1.723227,1.481066,1.328847,1.463724,1.509385,1.372572,1.132026,0.880245,0.494387,0.270435,0.231721,0.17384,0.210528,0.292132,0.186929,0.058861,0.046997,0.042091,0.039204
0.017243,0.035038,0.256529,0.470512,0.342073,0.301128,0.55209,1.215792,1.909034,2.103615,1.864248,1.691902,1.781723,1.71966,1.445181,1.14478,0.853665,0.477632,0.300148,0.248232,0.164974,0.210856,0.299299,0.189658,0.059302,0.048989,0.046111,0.044806
0.021707,0.040482,0.309437,0.580621,0.417217,0.340249,0.657377,1.595516,2.542596,2.803696,2.609666,2.426456,2.497886,2.342583,1.873023,1.469395,1.085463,0.572252,0.363438,0.301807,0.180141,0.235488,0.333712,0.209184,0.066739,0.054711,0.052444,0.052832
0.027191,0.050846,0.405969,0.760474,0.537932,0.410104,0.835811,2.161247,3.596916,4.122176,4.060535,3.959256,4.057699,3.838188,3.14718,2.527201,1.841246,0.87766,0.467029,0.386085,0.216387,0.293163,0.419851,0.260416,0.083579,0.069641,0.069076,0.071272
0.033355,0.064014,0.519402,0.951826,0.661453,0.474428,1.092933,3.253856,5.689742,6.603901,6.740982,6.82107,6.763612,6.240237,5.306615,4.394484,3.081486,1.330743,0.58581,0.489095,0.268944,0.358198,0.520181,0.325603,0.109612,0.093214,0.092311,0.096158
0.038404,0.073628,0.607797,1.098388,0.76577,0.52009,1.400655,5.04873,9.097896,10.293709,10.659831,11.08785,10.496186,9.206138,8.106637,6.953924,4.654332,1.851613,0.70454,0.583322,0.332936,0.417396,0.591459,0.377057,0.137837,0.118253,0.112584,0.115364
0.039731,0.075556,0.633239,1.15368,0.834375,0.572287,1.710542,7.076447,12.946652,14.207601,14.80162,15.664766,14.231664,11.876415,10.845089,9.666279,6.163129,2.283203,0.821728,0.669785,0.396512,0.452321,0.598816,0.385685,0.152061,0.133602,0.121517,0.119233
0.036485,0.071281,0.57742,1.063804,0.818819,0.612286,1.917358,8.448998,15.566635,16.861234,17.430164,18.170761,16.086716,13.089451,12.232157,11.20335,6.847142,2.412301,0.92278,0.74069,0.423771,0.424903,0.517583,0.338309,0.145289,0.12832,0.11306,0.107242
0.030672,0.066346,0.54545,0.999844,0.779694,0.610448,1.846785,8.058629,14.830173,16.203749,16.429962,16.338946,14.500987,11.954039,11.113052,10.295893,6.163894,2.131723,0.921597,0.726315,0.390178,0.347034,0.382835,0.258832,0.125407,0.104252,0.091034,0.087576
0.025301,0.061196,0.596672,1.093158,0.807564,0.582385,1.467393,5.833508,10.615562,11.893357,11.706647,10.792004,9.923858,8.615761,7.721513,7.090552,4.245941,1.495687,0.823053,0.672068,0.337049,0.273506,0.272934,0.186862,0.100116,0.07733,0.067833,0.070887
0.02547,0.066228,0.714445,1.320181,0.928468,0.585034,1.044358,3.323275,5.848689,6.635346,6.297887,5.353983,5.159845,4.723638,3.985119,3.544275,2.129615,0.835799,0.710143,0.639108,0.318754,0.239636,0.203931,0.130778,0.074334,0.06089,0.060261,0.06884
0.031831,0.076629,0.825534,1.566179,1.087274,0.632853,0.813335,1.80515,3.073312,3.514795,3.245401,2.764179,2.768282,2.464413,1.889311,1.588302,0.986858,0.520455,0.715834,0.716856,0.369398,0.265685,0.20678,0.119846,0.066939,0.06202,0.073016,0.090731
0.04008,0.083541,0.88733,1.782808,1.299044,0.795231,0.906938,1.59377,2.600232,2.994281,2.717155,2.311082,2.275504,2.037639,1.609526,1.205483,0.772244,0.527696,0.788884,0.829005,0.463903,0.332127,0.244101,0.136603,0.075491,0.073007,0.097836,0.128927
0.046426,0.083331,0.94085,2.047681,1.593267,1.046322,1.176959,1.940327,3.048727,3.681164,3.335221,2.48023,2.381748,2.549615,2.355187,1.606839,0.930354,0.620129,0.883831,0.973328,0.576484,0.393296,0.278181,0.154126,0.08239,0.079939,0.119619,0.163102
0.050361,0.078776,1.049946,2.379811,1.879094,1.269293,1.488409,2.713732,4.3474,5.092082,4.388699,2.979242,2.82417,3.393249,3.342036,2.146306,1.151497,0.727738,0.976309,1.152953,0.703952,0.429234,0.291389,0.155604,0.077548,0.076851,0.126191,0.173291
0.055387,0.072872,1.077455,2.475957,1.969755,1.402031,1.755341,3.742966,6.06102,6.658893,5.59495,3.80553,3.566762,4.277568,4.140017,2.568164,1.379796,0.855684,1.021185,1.293705,0.809104,0.422182,0.270209,0.135788,0.065888,0.06826,0.116502,0.153966
0.060873,0.06517,0.926148,2.174384,1.810712,1.400675,1.842196,4.567908,7.359534,7.561838,6.397097,4.623713,4.352804,4.86887,4.349767,2.63839,1.481874,0.939166,0.995667,1.316467,0.874491,0.422928,0.243682,0.113296,0.058729,0.059001,0.096279,0.124216
0.062379,0.05829,0.654406,1.552487,1.400949,1.251761,1.764912,4.775979,7.555148,7.44995,6.487457,5.114191,4.988388,4.996125,3.921793,2.386313,1.408709,0.92307,0.957241,1.259156,0.853094,0.406774,0.228718,0.106336,0.059927,0.056161,0.080211,0.100268
0.060956,0.053943,0.375708,0.891504,0.910067,0.950261,1.468601,4.132005,6.305869,6.009145,5.44605,4.943933,5.086018,4.530835,3.210045,1.987137,1.197913,0.816917,0.896924,1.115708,0.70456,0.320957,0.185863,0.097323,0.06611,0.06184,0.07744,0.083308
0.06001,0.053626,0.207212,0.475584,0.585659,0.703075,1.136371,3.216197,4.626213,4.152547,3.821526,3.991305,4.458736,3.844461,2.752331,1.757435,0.973619,0.641198,0.749416,0.867417,0.4921,0.212361,0.129569,0.078798,0.064872,0.061605,0.073797,0.073332
0.057657,0.051588,0.199947,0.414329,0.505006,0.637775,0.975329,2.79894,3.958186,3.243865,2.83059,3.055148,3.567825,3.26395,2.435296,1.645023,0.954416,0.569311,0.644865,0.715741,0.378696,0.160666,0.100928,0.061422,0.053547,0.05231,0.061777,0.060715
0.05237,0.051436,0.235202,0.464663,0.503096,0.57004,0.852076,2.497631,3.738421,2.978,2.320177,2.429942,3.011381,2.840681,1.91371,1.332084,0.916128,0.596635,0.66318,0.692859,0.341402,0.128914,0.076673,0.047131,0.041555,0.038039,0.043478,0.046247
0.046581,0.0536,0.250209,0.468528,0.441897,0.427062,0.74587,2.303772,3.649461,3.100008,2.151638,2.105932,2.795793,2.534406,1.518642,1.044687,0.773848,0.573572,0.665365,0.650839,0.297956,0.092805,0.054783,0.039245,0.033307,0.027142,0.030656,0.038485
0.04444,0.052969,0.225217,0.404886,0.339108,0.263016,0.613415,2.090332,3.391259,3.093035,2.155326,1.945656,2.441106,2.140314,1.319879,0.930118,0.677881,0.524987,0.633762,0.587467,0.269293,0.080529,0.054587,0.042049,0.028924,0.021911,0.028384,0.040116
0.046149,0.049767,0.171175,0.308808,0.271588,0.189932,0.578505,2.293844,3.410373,3.017486,2.372121,2.093063,2.214991,1.816272,1.228621,0.919123,0.661453,0.518509,0.621564,0.569991,0.275924,0.081432,0.066452,0.052101,0.030197,0.024778,0.032312,0.042979
0.054379,0.053432,0.125765,0.21911,0.228762,0.195711,0.643701,2.498555,3.220187,2.61189,2.464922,2.358199,1.999155,1.358035,1.051099,0.88522,0.635063,0.523825,0.678731,0.62682,0.295771,0.079385,0.077272,0.065118,0.039809,0.035711,0.041859,0.048917
0.066263,0.062372,0.104827,0.153662,0.182827,0.214923,0.741667,2.521872,2.937623,2.037156,2.108723,2.241464,1.594317,0.865662,0.739468,0.72167,0.559237,0.499562,0.718952,0.661835,0.294243,0.074855,0.081338,0.076063,0.054834,0.050589,0.055925,0.059621
0.074851,0.069083,0.110916,0.160396,0.185172,0.248132,0.818354,2.229539,2.488524,1.558284,1.525926,1.715779,1.128234,0.587045,0.487104,0.510418,0.497696,0.472982,0.663414,0.601854,0.264179,0.074714,0.08303,0.082426,0.064108,0.060325,0.066249,0.068633
0.068554,0.062932,0.114974,0.18821,0.215391,0.305333,0.898056,1.810488,1.870895,1.302781,1.284027,1.268196,0.801528,0.445967,0.323857,0.386273,0.499204,0.495624,0.548332,0.473075,0.224144,0.072294,0.083267,0.081323,0.060245,0.057225,0.063015,0.064754
0.048528,0.045469,0.117609,0.21419,0.242283,0.358163,0.965639,1.679533,1.515915,1.119595,1.176706,0.968551,0.592887,0.381302,0.254428,0.304875,0.476716,0.534261,0.468087,0.360268,0.180988,0.067263,0.078983,0.072497,0.051251,0.04445,0.046207,0.047172
0.030868,0.033554,0.127277,0.234981,0.258344,0.362327,0.931243,1.595472,1.285845,0.870285,1.028079,0.902766,0.579255,0.392254,0.26541,0.274288,0.416278,0.541951,0.478159,0.348114,0.166218,0.062178,0.071691,0.067438,0.056061,0.03741,0.028708,0.027719
0.0243,0.02992,0.134586,0.244026,0.255099,0.307328,0.7865,1.669987,1.47267,0.748712,0.780803,0.858175,0.639878,0.386012,0.300304,0.324573,0.352743,0.484234,0.521809,0.402118,0.182328,0.060745,0.06841,0.069018,0.066485,0.041554,0.022214,0.019889
0.025324,0.033105,0.138768,0.245612,0.253189,0.256573,0.748584,1.941676,1.828849,0.772476,0.598777,0.730389,0.598931,0.348476,0.365582,0.38669,0.327991,0.464091,0.618236,0.504979,0.22135,0.068031,0.064796,0.067964,0.070079,0.046422,0.025808,0.025728
0.037224,0.045459,0.134319,0.22116,0.235134,0.218428,0.718969,2.090403,2.138644,0.90382,0.58302,0.660343,0.463782,0.284643,0.415726,0.419841,0.343409,0.559468,0.75904,0.603794,0.260187,0.079556,0.059747,0.055019,0.06131,0.047162,0.032829,0.037685
0.054128,0.057537,0.11628,0.16901,0.182556,0.179091,0.628467,1.92727,2.21785,1.076676,0.592826,0.608134,0.394014,0.271832,0.411076,0.412495,0.331042,0.619434,0.822419,0.640526,0.278282,0.093639,0.057721,0.037519,0.044267,0.044142,0.041932,0.050837
0.068452,0.061734,0.092119,0.118914,0.130724,0.170697,0.543132,1.524589,2.005056,1.287853,0.641364,0.588145,0.485128,0.324778,0.384151,0.399366,0.313664,0.591641,0.764847,0.609439,0.272041,0.097651,0.053654,0.028162,0.029671,0.042731,0.054838,0.058705
