-0.02119,-0.011721,-0.038078,-0.121367,-0.161292,-0.170806,-0.148529,-0.090062,-0.036239,-0.016778,-0.003898,-0.00109,-0.000453,-0.000355,-0.002708,-0.002729,-0.000338,-0.000227,-0.000589,-3e-04,-0.000263,-0.000567,-0.003478,-0.027577,-0.108991,-0.055416,-0.001844,-0.000682
-0.022511,-0.009164,-0.00929,0.047186,0.147982,0.164862,0.097966,0.036426,0.028755,0.019501,0.004301,0.001153,0.000469,0.000264,-0.000137,-0.000315,-0.000116,-8.4e-05,-0.000278,-1.3e-05,0.00067,0.000187,-0.002767,-0.011667,-0.045896,-0.024893,-0.001019,-0.000235
0.003725,0.002761,0.01167,0.004803,0.000366,0.004516,-0.032055,-0.023829,-0.006527,-0.003607,-0.00051,-0.000178,-4e-05,1.3e-05,0.000534,0.000425,-0.000351,-0.000351,1e-06,5.9e-05,-0.000519,-0.000327,0.000137,0.001756,0.001315,-0.003039,-4e-05,-0.000146
0.023161,0.010096,0.007719,-0.041297,-0.13745,-0.168386,-0.113609,-0.048816,-0.031259,-0.018417,-0.004558,-0.001437,-0.000454,-0.000225,0.000492,0.00049,-0.000147,-0.000297,0.00014,0.000154,-9e-06,0.000219,0.002717,0.018523,0.068147,0.031593,0.000985,-0.00027
0.012888,0.006104,0.003186,0.055274,0.124484,0.133694,0.152139,0.097315,0.038121,0.0193,0.004129,0.001161,0.000495,0.000281,0.000403,0.000572,0.000782,0.000373,6.1e-05,1.1e-05,0.00046,0.000544,0.001992,0.020531,0.093001,0.053442,0.001646,0.000138
-0.013209,-0.007989,-0.016366,-0.022866,0.040102,0.08163,0.074771,0.037008,0.0136,0.004901,0.001383,0.000458,9.9e-05,1e-05,-0.0014,-0.001152,0.000323,1.6e-05,-0.000282,-2e-04,-0.000415,-0.000536,-0.002454,-0.017531,-0.054251,-0.019162,-0.000219,0.000312
-0.020485,-0.009857,-0.014179,-0.081657,-0.164018,-0.177753,-0.147912,-0.087523,-0.040189,-0.020849,-0.004864,-0.001438,-0.000543,-0.00029,-0.000569,-0.000554,-0.000206,-0.000459,-0.000258,-1.8e-05,-3.4e-05,-0.000414,-0.003537,-0.028499,-0.114564,-0.059573,-0.001445,0.000219
-0.000729,0.002297,0.008781,0.036549,0.057863,0.03553,0.001756,-0.008011,0.007245,0.009809,0.001898,0.00055,0.000248,0.000187,0.001573,0.001246,-1.6e-05,5.1e-05,0.000127,0.000139,0.000346,0.000245,-0.000228,0.006555,0.016554,0.00139,-2.1e-05,0.000105
0.016927,0.0086,0.012685,0.045033,0.101252,0.122218,0.056781,0.025973,0.01892,0.008834,0.002485,0.000897,0.000265,0.000124,0.000248,6.1e-05,-0.00021,0.000167,0.000118,-2.3e-05,-0.000258,-1e-06,0.001922,0.016336,0.061051,0.029269,0.000799,-0.00016
0.011241,0.003515,0.003172,-0.01914,-0.10711,-0.119153,-0.079372,-0.025077,-0.02013,-0.016512,-0.003405,-0.001088,-0.000406,-0.000216,-0.000819,-0.000838,-0.000428,-0.000137,-7.1e-05,-3.1e-05,-3.8e-05,0.000186,0.002344,0.00606,0.025648,0.017428,0.00063,-0.000131
-0.006488,-0.004706,-0.00348,-0.004914,-0.011874,-0.021486,0.028885,0.026622,0.006477,0.005699,0.001096,0.000149,0.000119,6.7e-05,-1.8e-05,-0.000118,-0.000195,4.7e-05,-3e-05,-2.7e-05,0.000249,3e-04,0.000793,-0.001102,0.010698,0.015273,0.000474,-0.000107
-0.013129,-0.005634,-0.005397,0.003265,0.088255,0.131479,0.11011,0.04459,0.02067,0.011942,0.002681,0.000981,0.000317,0.000175,0.000346,0.000326,-8.5e-05,1.5e-05,0.000115,5.3e-05,-0.000202,-0.000381,-0.002146,-0.017591,-0.060587,-0.024998,-0.000526,-0.000152
-0.004223,-0.000321,0.001054,3.1e-05,-0.054944,-0.060334,-0.053652,-0.033782,-0.018052,-0.013129,-0.002982,-0.000786,-0.000324,-0.000144,9.1e-05,3.5e-05,-0.000183,-0.000215,-0.000119,1.9e-05,-6e-06,-0.000228,-0.001877,-0.009914,-0.058096,-0.04016,-0.000931,0.000109
0.008333,0.004876,0.00082,-0.001452,-0.031705,-0.076665,-0.079459,-0.04021,-0.011876,-0.001228,-0.000451,-0.00034,-7e-05,-8.7e-05,-0.000504,-0.000662,-0.000162,-6.6e-05,-0.000134,-8.2e-05,0.000175,0.000315,0.00113,0.015817,0.049861,0.016202,0.000395,0.000258
0.008593,0.002494,-0.003911,-0.009101,0.076137,0.099037,0.043978,0.014668,0.017078,0.012152,0.002747,0.000994,0.000327,0.000132,-0.000173,-0.000136,-3.9e-05,7e-05,5.6e-05,-1.2e-05,-0.000118,0.000129,0.00202,0.011479,0.051657,0.031878,0.000863,-7.9e-05
-0.000741,-0.001637,0.002426,0.002504,-0.026545,-0.004873,0.009963,0.014081,-0.00069,-0.00818,-0.00183,-0.00044,-0.00018,-5e-06,0.000595,0.000753,-1e-05,-6.5e-05,0.000101,0.000108,-3.2e-05,-1.9e-05,0.000606,-0.006111,-0.009553,0.00562,0.000318,-5.4e-05
-0.007266,-0.003324,-0.002302,-0.010404,-0.062422,-0.093079,-0.035846,-0.003195,-0.01038,-0.004371,-0.000916,-0.000647,-0.000145,-6.1e-05,7.8e-05,-9.2e-05,-0.000416,-0.000282,-0.000161,-3.2e-05,0.000101,-3.9e-05,-0.001253,-0.007233,-0.014154,-0.002757,6.7e-05,0.000219
-0.003727,-0.000118,-0.012492,-0.023602,0.056242,0.067324,0.058173,0.016591,0.009289,0.010542,0.002239,0.000773,0.000291,8.1e-05,-0.000375,-0.000553,-0.000244,-3.8e-05,-0.000127,-6.3e-05,-5.9e-05,-0.000238,-0.002087,-0.005082,-0.028483,-0.020447,-0.000476,7.7e-05
0.002559,0.001709,0.002801,0.028284,0.028305,0.049343,0.033374,0.005891,0.002915,-0.004071,-0.001336,-9.3e-05,-0.000103,-2.3e-05,-9.6e-05,-5.3e-05,-7.9e-05,-3.6e-05,2.3e-05,-6e-06,-5.9e-05,-8.9e-05,-0.000462,0.000949,-0.023559,-0.023701,-0.000665,-0.000157
