0.000226,0.000172,0.000307,0.000342,0.000115,0.000252,0.000262,0.00037,0.00023,0.000239,0.000321,0.000307,0.000156,9.8e-05,-2.3e-05,0.000239,0.000174,0.000186,0.000194,0.000247,0.000122,0.00016,0.000169,0.00017,6e-05,0.00013,7.8e-05,0.000162,0.000104,-9e-06,4.9e-05,-2e-06,0.00031,0.000196,-0.002914,-0.002985,-0.00152,-0.000538,-0.000213,-0.006905,-0.005199,-0.002445,-0.003003,-0.00273,-0.002362,-0.002976,-0.012526,-0.005441,-0.004563,-0.000685,0.00015,-0.018583,-0.023188,-0.012941,-0.009598,-0.006597,-0.023771,-0.015573,-0.01201,-0.013113,-0.004078,-0.016701,-0.022274,-0.007775,0.000138,-0.006902,-0.013182,-0.019081,-0.006208,-0.003803,-0.013899,-0.015479,-0.01259,-0.008016,-0.017152,-0.010872,-0.012231,-0.009999,-0.009186,-0.007862,-0.005866,-0.009708,-0.013064,-0.007812,-0.000956,-0.003434,-0.003257,-0.001798,-0.001116,-0.000658,-0.002994,-0.001304,-0.002506,-0.001659,-0.000998,-0.002125,-0.001644,-0.00141,-0.001052,-0.003153,-0.002354,-0.000566,-0.000556,0.002708,-0.013517,-0.013621,-0.007469,-0.002858,-0.003094,0.001197,0.000773,-0.001555,-0.001465,-0.000377,-1.7e-05,-0.000455,-0.000234,-0.00013,-0.001084,-0.001353,-0.000524
0.000133,2.5e-05,7e-05,2.2e-05,0.000114,0.000169,-0.000117,-0.000156,2e-06,7.5e-05,-0.000172,-0.000164,2.4e-05,-3.1e-05,-0.000143,2.7e-05,-1.2e-05,-3.1e-05,-6.4e-05,1.5e-05,-7.1e-05,-1.5e-05,-0.000308,-0.000219,-0.000101,-4.6e-05,-1.5e-05,-9e-06,-4.5e-05,-3.8e-05,-0.000191,-6e-06,-2e-06,-0.000172,-0.001088,-0.000474,-8.1e-05,0.000164,0.000149,0.00162,0.002138,0.001412,0.001257,0.001657,0.001006,0.000714,-0.000985,-0.000855,-8e-06,0.002834,0.003288,-0.002107,-0.000618,0.003211,-0.001274,-0.006741,0.000983,0.004454,-0.000834,-0.002459,-0.00922,-0.007853,0.002524,0.001695,-0.002091,-0.011703,-0.006868,0.004517,-0.013815,-0.009321,-0.003479,-0.006832,-0.00729,-0.00483,0.000731,-0.001806,-0.003497,0.004346,-0.007401,-0.004869,-0.006171,-0.005375,-0.000759,-0.001301,0.001242,-0.00207,-0.003734,-0.002787,-0.002168,-0.00164,-0.000317,-0.001234,-0.001018,-0.000929,-0.000914,0.000718,0.000395,0.000156,0.000449,0.001548,-0.000699,-0.000362,-6.9e-05,0.001964,0.000163,0.009866,0.006164,0.002975,0.001329,-0.002516,-0.000427,0.000818,0.001689,0.000872,0.000839,0.000598,0.000212,0.00037,7e-06,0.000481,0.000224
8.2e-05,-3.5e-05,-0.000141,-2.2e-05,3.4e-05,-0.000101,-0.000116,-0.000186,-0.000103,2.1e-05,-8e-05,-0.000252,-0.000213,-8.7e-05,-0.00012,-0.000172,-0.00012,-8.6e-05,-0.000162,-7.6e-05,-4.5e-05,-0.000131,-7.3e-05,-0.000176,-7.4e-05,3e-05,-0.000112,-7.7e-05,-5.7e-05,-4.1e-05,-8.5e-05,-4e-06,-0.000162,-0.000231,0.00054,-0.000786,-0.000595,-0.000317,-0.000611,-4.9e-05,-0.002258,-0.001323,0.000718,-0.000397,-0.000108,-0.000962,-0.001261,0.001657,-0.000524,0.001474,-0.001399,-0.002646,0.005526,6e-05,-0.001953,0.001632,-0.004637,-0.009322,-0.007083,0.002519,0.000999,0.00059,-0.001167,-0.004623,-0.002816,0.00626,0.012687,0.003283,-0.003435,0.000157,-0.002106,0.006827,0.004183,0.004594,0.002662,0.000435,0.001871,-0.004904,9.3e-05,-0.000443,0.000798,0.001074,-0.000278,-0.000799,-0.002636,-0.002072,-0.001027,0.001262,-0.000892,-0.000869,-0.001178,0.001618,-0.002057,-0.001307,-0.000107,-0.003106,-0.00072,-0.000816,-0.000332,-0.000248,0.000209,-0.001401,-0.000682,-0.002456,0.001145,-0.007653,-0.003392,-0.001205,-0.00233,-0.002205,-0.000622,-0.000565,-0.001267,-0.000928,-0.000176,0.000131,-2.2e-05,-0.000237,0.000106,-0.000425,-0.000529
-1.1e-05,-1.4e-05,3.6e-05,-2.9e-05,4e-05,7.7e-05,-0.000102,-0.000144,-0.00014,-0.00016,3.3e-05,-8.7e-05,1.6e-05,-8.4e-05,7.8e-05,0.000142,-0.000115,4.8e-05,9.6e-05,-0.000153,1.5e-05,5e-06,-0.000151,8.7e-05,1.6e-05,-6.3e-05,-8e-06,-0.000126,-8.2e-05,-6.2e-05,4e-06,-3e-06,-0.000219,-0.00012,0.00044,-8.6e-05,0.000152,0.000133,0.000652,-0.001963,0.000369,0.000808,-9.5e-05,-0.000893,-0.000341,0.000944,-0.000411,-0.003071,5.5e-05,-0.002245,-0.000993,-0.004889,-0.010621,-0.004368,-0.000613,0.000308,0.008134,0.009215,0.00331,-0.001991,-0.000826,-0.000615,-0.001813,-0.004075,-0.000925,-0.000521,0.002959,-0.004943,0.000764,0.001128,0.00125,-0.005009,-0.004778,-0.000319,-0.003392,-0.003882,0.005095,0.004054,-0.000436,-5.5e-05,0.001922,0.002703,-0.000962,0.001359,0.00049,0.002009,0.002006,0.001208,-0.000219,-0.000527,-0.000206,0.000781,0.001014,0.000101,-0.000641,0.00165,-0.000168,0.000851,-0.000274,-0.000368,-0.000435,-0.00024,0.000362,-0.000173,-0.001689,0.005575,0.003971,0.001199,0.001991,0.000921,0.000579,-9.8e-05,0.001016,0.000539,0.000338,7.6e-05,0.000279,0.000257,-0.000253,0.000269,5.7e-05
6.5e-05,1e-05,7.6e-05,6.5e-05,9.1e-05,1.8e-05,0.00012,0.000225,8.3e-05,-2.3e-05,-2.7e-05,0.000117,0.000101,7.3e-05,9e-05,-1.5e-05,-7e-06,4.8e-05,9.8e-05,9e-06,2.1e-05,1.6e-05,5.5e-05,0.00016,0.000125,-2.9e-05,4.6e-05,-3.4e-05,9.1e-05,0.000142,5.2e-05,1e-06,-4e-05,0.000118,7.8e-05,0.00011,-0.000381,-0.000278,-6.1e-05,-0.000843,-0.000174,-0.000401,-0.000241,0.00094,0.00081,0.000281,-0.000651,-0.002517,-0.000504,0.000667,-0.001007,-0.003203,0.00724,-0.000147,-0.001615,0.001201,-0.001416,-0.00251,-0.002498,0.003019,0.003002,0.004218,0.003488,0.005683,0.008176,0.007262,0.001196,0.007379,0.003153,0.001319,0.000108,-0.001446,0.002741,0.004537,0.002575,0.001706,-0.001066,-0.003943,-0.002401,0.002656,0.001315,-0.002115,-0.00196,0.000713,0.000534,0.000106,-0.001917,-0.001114,0.000563,0.00119,0.001586,-0.000757,-7e-04,0.000974,0.000449,0.00019,-0.000719,-0.000183,0.000521,-0.000385,0.001091,0.00068,2.9e-05,0.000462,-0.001778,-0.001418,-0.001774,-0.001309,-0.000841,-6.8e-05,-2.2e-05,0.000527,-0.000627,-0.000685,-0.000115,-0.000149,0.000158,-0.000141,9.2e-05,2e-06,-7e-05
3.3e-05,-9.2e-05,3.3e-05,3.4e-05,-5.3e-05,1e-06,7.2e-05,-8e-06,6e-06,-5.2e-05,0.000104,4.4e-05,-2.7e-05,-3.5e-05,-8.8e-05,-1e-04,-6.9e-05,-2.7e-05,2.2e-05,8e-06,-6.8e-05,-4.6e-05,5.7e-05,3e-06,6.1e-05,-1e-05,-2e-06,1.2e-05,6.2e-05,2e-05,3.7e-05,6.6e-05,-4.3e-05,6.9e-05,-9.4e-05,0.000466,0.000118,-0.000139,-8.3e-05,0.000853,0.001284,0.000861,-0.000145,-0.00085,-0.000655,0.000108,0.000133,0.000192,-0.000429,0.000532,-0.002668,-0.000559,-0.004403,-0.003516,-0.002084,0.00044,0.002283,0.000994,-0.002891,-0.002942,-0.001621,-0.007238,-0.005814,-0.008588,0.001695,-0.000372,-0.002252,-0.005236,-0.002351,0.00222,0.000978,0.001757,-0.004634,-0.002689,-9.9e-05,-0.00294,-0.000944,-0.002672,0.00269,-0.00011,0.000548,0.00076,0.001204,0.000218,-0.001945,-0.002651,0.002081,0.000376,-0.000296,-0.000125,-0.000463,-0.000185,-0.000847,-0.000268,-0.000168,-0.000301,0.000372,0.000288,-0.000272,-0.000186,-0.000745,8.6e-05,0.00061,-0.000733,0.000697,-0.002679,0.000583,2.5e-05,0.00013,-0.000164,-0.000707,-0.00117,-2.9e-05,0.000275,0.000116,-0.000116,-7e-06,-0.000112,5.7e-05,3.1e-05,-9.2e-05
3.4e-05,-7.9e-05,-5.2e-05,-4e-06,-4.1e-05,-8.7e-05,8.7e-05,-5.5e-05,0.000104,-1e-05,0.000114,-6.1e-05,-0.000145,0.000126,2.1e-05,-3.9e-05,2.2e-05,-3.6e-05,-2.7e-05,2.2e-05,4e-06,-8.5e-05,9.2e-05,-6.3e-05,-1.4e-05,-7e-06,6.4e-05,2.4e-05,1.3e-05,-1.8e-05,-5.5e-05,-0.000128,2.1e-05,1.6e-05,-6.7e-05,0.000217,0.000267,0.000156,0.000153,-0.000103,-0.000538,-0.000621,-0.000556,-7e-05,0.000285,0.000406,9.8e-05,0.00018,0.000625,-0.000872,-0.00055,-0.001401,0.003616,0.006055,0.002102,0.000195,0.000795,-0.001992,-0.001085,0.001213,0.002647,-0.000815,0.004352,0.004163,-0.00497,-0.001906,0.001904,0.006258,0.00138,-0.003354,-0.00266,0.001368,-0.000301,0.000757,-0.001425,-0.001248,-0.000519,0.000797,0.001177,0.000749,-0.001032,0.000264,-0.003236,-0.001168,0.000377,0.001109,-0.00133,-0.000552,6.7e-05,-0.000534,-0.000146,-0.000232,0.000298,-0.000287,0.000532,0.000276,4.2e-05,0.000542,-0.000106,0.000132,0.000361,-0.000613,6.5e-05,1.3e-05,-0.000474,-0.000216,-0.001319,-0.000517,-0.000666,-0.000747,-0.000659,-1.7e-05,-0.000306,-0.000568,-0.000238,-6.4e-05,-2.2e-05,-9.2e-05,0.000115,0.000116,0.000195
-6e-05,-5.8e-05,-1.3e-05,-0.00013,-2.4e-05,-6e-06,-2.2e-05,-9.7e-05,5.9e-05,4.8e-05,5.6e-05,1.5e-05,-9.1e-05,4.8e-05,-2.5e-05,5e-05,-1e-06,-3.8e-05,2.7e-05,-2.5e-05,-0.000118,6e-06,-9e-06,1e-05,-4.9e-05,7e-06,1e-04,1.7e-05,1.2e-05,-4.4e-05,2.7e-05,5e-05,-4e-05,1.3e-05,6.5e-05,-0.000412,-9e-05,-5.1e-05,-9.1e-05,-0.000284,-1.4e-05,0.000427,0.000428,4.7e-05,-0.000497,-0.000243,0.000668,0.000609,0.000612,0.000456,6.5e-05,-0.000708,-0.005085,-0.005758,0.000144,-0.000488,-0.003252,-0.00115,-0.006491,-0.002405,-0.001178,0.002558,-0.003764,-0.002352,-0.001852,-0.000651,-0.004106,-0.006303,-0.001614,-0.001713,1.1e-05,-0.000891,0.003275,-0.003263,-0.004126,-0.000845,-0.001448,-0.000228,-0.00086,-0.002206,-0.002876,-0.000693,0.003311,0.001634,0.000562,-0.001657,9.7e-05,-0.000177,-0.000477,0.000115,0.000107,-0.000581,0.000109,-0.000284,-0.000241,-2.9e-05,0.000746,0.000287,0.000357,-0.000538,0.000307,0.000547,0.000341,-0.000114,0.000206,-0.000562,0.000217,-0.000373,0.000142,0.000312,-0.000135,-0.000624,-0.000139,3e-05,5.5e-05,-0.000251,-6.9e-05,1.1e-05,-2.4e-05,-0.000106,-0.000302
-2.6e-05,-7e-06,-4e-05,-0.000125,-2.5e-05,-5.6e-05,0,-7.2e-05,1.7e-05,3.7e-05,4.9e-05,-3.6e-05,-6.6e-05,-4e-05,0,1.9e-05,1.8e-05,-0.000107,2e-05,-4.2e-05,-3.7e-05,-7e-06,-6e-06,-8.3e-05,-3.5e-05,-6.1e-05,-1.6e-05,-5.3e-05,-5.4e-05,-2.7e-05,-3.1e-05,3.2e-05,6e-06,-5.3e-05,6.1e-05,-0.000104,0.000112,0.000103,0.000132,6.7e-05,0.00017,-0.000671,-0.000501,-0.000705,3.4e-05,0.000127,-0.000545,5.2e-05,-0.001029,-0.000489,0.001004,-0.00049,-0.005684,-0.001339,3e-05,-0.000663,0.001924,0.00132,0.004824,0.001225,0.000187,0.000363,0.005432,0.00189,-0.004177,-0.000924,-0.00051,-0.003243,-0.000971,0.000486,-0.001097,-0.001785,-0.003088,-0.001443,0.002578,0.000113,-0.002345,-0.001093,0.000506,-0.000673,-0.000398,-0.000627,0.000224,-0.001713,-3.5e-05,0.001176,0.000863,0.001152,0.000777,0.000847,8.4e-05,0.000212,-0.000137,0.000171,-0.000612,-0.000423,-0.000724,-0.000629,-0.000405,2e-06,-0.000368,-0.000424,6.9e-05,-0.000175,-9.7e-05,-0.000625,-0.000131,-0.000121,-0.00061,0.000257,0.00043,0.000697,0.000335,-0.000123,-0.000269,-0.000199,-5.1e-05,-7.9e-05,-0.000287,-9.8e-05,0.000245
-5e-06,-2e-06,-1.1e-05,-4.1e-05,1e-05,-3.9e-05,1.1e-05,-4.3e-05,2.6e-05,1e-06,-2.9e-05,-8.1e-05,4.6e-05,-5.3e-05,3.7e-05,-1.8e-05,-2.6e-05,3e-05,1e-06,-1.8e-05,1.4e-05,-3.2e-05,1.1e-05,2.8e-05,8.9e-05,2e-05,-3.8e-05,2.3e-05,-2.8e-05,8e-06,4.5e-05,-1.7e-05,4.6e-05,-4e-06,-6.5e-05,0.000115,1.7e-05,-4.3e-05,-2.6e-05,0.000203,-0.000266,0.000473,0.000375,0.000347,-0.00015,-0.000281,0.000186,-0.000247,-0.000454,0.001156,-0.000713,8.2e-05,0.002623,-0.00105,0.003175,0.000356,-0.00157,0.000292,0.001882,-0.000293,-0.000975,0.000458,-9.1e-05,-0.000968,0.000205,0.000148,0.002243,0.001044,0.001521,-0.001729,-5.7e-05,-0.001003,0.001727,0.000983,-0.001783,-0.000272,0.002063,0.001626,0.000857,0.000557,-0.000423,-0.00028,-0.000884,0.000375,0.000186,-0.000335,0.001093,-0.000434,8.8e-05,0.000654,-9e-06,-0.000588,0.000318,-0.000246,0.000722,9.6e-05,8.7e-05,0.000139,0.000117,0.000277,4.8e-05,-8.6e-05,-0.000417,9.2e-05,-0.000216,-0.00027,-0.000605,-0.000281,-0.000259,5.2e-05,-0.000423,-0.000355,-0.000375,-4.6e-05,0.000156,-0.000124,-0.000117,-6.5e-05,4.9e-05,7e-05,-0.000161
-1.1e-05,-2e-05,-3.3e-05,2.6e-05,-8e-06,-7.8e-05,6e-06,9e-06,-2.6e-05,-7.8e-05,-2.9e-05,1e-05,-7e-06,1.4e-05,2.7e-05,-1.9e-05,3.5e-05,5.6e-05,1e-05,2.1e-05,2.9e-05,-3.3e-05,3.3e-05,1.8e-05,-5e-06,-2.2e-05,-2.5e-05,-4.4e-05,-1.6e-05,8e-06,-5e-06,-5e-06,1.6e-05,-3e-05,-5e-05,-7.9e-05,-0.000128,0.000103,0.00012,-0.000138,-0.000259,0.000115,-0.000363,-0.000142,1.5e-05,0.000259,-0.000231,-7.5e-05,0.000495,-0.000756,-0.000375,0.000702,0.000801,0.000174,7e-06,-0.00184,0.000477,-0.000497,-0.001477,-0.001266,-0.00013,-0.001128,-0.003165,-0.000629,-0.002152,0.000517,-0.001065,-0.000136,0.001005,0.002011,0.001509,0.000155,0.000308,-0.000402,-0.000613,0.00014,-0.003278,-0.001153,-0.00053,-0.00076,0.001172,9.2e-05,0.000272,-3.7e-05,-0.001052,0.000242,-7.3e-05,0.000212,-0.000473,-0.00036,-0.000152,0.000925,2.6e-05,0.000269,-0.000114,0.000153,-0.000151,-0.000278,-0.000366,-0.000197,-0.000343,-7.3e-05,-0.000149,0.000278,0.000254,-0.000494,-7.3e-05,-0.000274,0.000124,0.00026,0.000467,-0.000393,6.1e-05,0.000199,-0.000107,-4.6e-05,-2.6e-05,-0.000101,-8.1e-05,2e-05,8.2e-05
-8e-06,-6e-06,-2.5e-05,-3.5e-05,-3.3e-05,-4.5e-05,-3.1e-05,1.1e-05,4.2e-05,-3.6e-05,-2.6e-05,-8e-06,2.1e-05,2.2e-05,2.9e-05,3e-06,-2.2e-05,5.4e-05,-1.9e-05,-2e-06,1.3e-05,-3e-05,-2.9e-05,1.1e-05,-8e-06,-1e-06,-9e-06,-3.1e-05,-8e-06,-3e-06,-2.7e-05,-4e-06,2.6e-05,-7e-06,-1e-06,-0.000119,-4.4e-05,-0.000198,3.6e-05,-5.3e-05,-6e-05,-0.000202,0.000397,0.00012,-1.6e-05,-0.000262,-0.000101,0.000428,-0.000892,3.3e-05,9e-06,-0.000581,-0.000515,0.000626,0.002081,0.00077,7.1e-05,-0.000619,0.000759,-0.001917,-0.000679,-0.000805,-0.000102,0.000921,0.000871,-0.000375,-0.002003,-0.000795,-0.000886,-0.000989,-0.001059,0.000321,-0.001073,0.000567,-0.000461,0.000682,0.001544,-0.000885,0.000562,-0.000416,-0.000583,1e-05,0.001373,-0.00079,0.000415,-9.3e-05,-0.001011,-0.000305,-6e-06,-6.8e-05,-0.00024,0.000129,0.000252,0.00015,0.000547,-9.8e-05,-5.5e-05,-6.5e-05,0.000121,2.9e-05,-3.5e-05,-2.7e-05,-4.7e-05,-0.00037,-0.000123,0.000575,1.2e-05,-3.5e-05,3.6e-05,0.000122,-0.000365,0.000268,0.000113,1.7e-05,1e-04,4.9e-05,-2.3e-05,-5e-05,-1.3e-05,1.6e-05,-3e-06
7e-06,-4.1e-05,4e-06,-2.7e-05,-2.1e-05,2e-05,2e-06,-1e-06,-1e-06,0,-4.3e-05,-7e-06,5e-06,-1.1e-05,-3e-05,3e-06,3e-06,0,-4.3e-05,-1.6e-05,-2.1e-05,1.5e-05,-3.3e-05,-1e-05,-5e-06,-2.5e-05,-5e-06,-3e-06,4e-06,0,-2.2e-05,3e-06,-1.9e-05,-3.2e-05,1.7e-05,-2.2e-05,-4.5e-05,1.6e-05,-5.6e-05,9.9e-05,2e-05,0.000496,-0.000503,-2.2e-05,-0.000123,0.000158,-2e-06,-0.000246,0.000414,0.000112,-8.7e-05,0.000121,0.00029,0.000228,-0.004037,0.000139,-0.000323,0.000495,-0.000782,-0.000745,-0.000796,2.2e-05,0.001298,-0.000714,0.001976,0.000951,-0.001418,0.000505,0.000656,0.001326,0.003128,0.000965,-0.000334,-0.000834,-0.001325,-0.000689,-0.000489,3.7e-05,-0.000259,0.000815,-0.000384,-1e-04,-0.000625,0.001068,-0.000489,-0.000311,-8.7e-05,6e-05,0.000117,-0.000603,-6.9e-05,-8e-05,-0.000181,-9.7e-05,-0.000775,1e-05,0.000181,-7.9e-05,-0.000266,-7.6e-05,-5e-05,0.000157,-0.000132,-8.4e-05,-8e-05,0.000876,0.000308,0.000189,0.000194,1.6e-05,0.000225,1.6e-05,0.000283,6e-06,-8.2e-05,3e-05,1.6e-05,9e-06,-5e-05,-5.8e-05,-3e-05
-1e-06,1e-06,0,-1.7e-05,1.1e-05,-8e-06,-2e-05,4e-06,-1.6e-05,1.7e-05,-1e-06,8e-06,-1.7e-05,-6e-05,-3.8e-05,1.3e-05,-1e-06,2e-06,-1.7e-05,-2e-06,-1.6e-05,3e-06,2e-06,-3e-06,-1.3e-05,8e-06,-1e-06,3e-06,-8e-06,-1e-06,-1.1e-05,-8e-06,-2.3e-05,6e-06,1.7e-05,6.1e-05,1.1e-05,-7.7e-05,0,4.8e-05,-6.1e-05,-0.000303,0.000272,-2e-05,-2.6e-05,-0.00013,-2.9e-05,0,7.9e-05,-0.000484,0.000115,-0.000155,0.000882,-6e-04,0.002231,0.000534,0.000507,5.8e-05,-0.000578,0.002227,-0.000406,0.000379,-0.000386,-0.000544,0.001093,-0.001106,0.000504,0.000538,6.8e-05,-0.000796,0.001149,-0.000137,0.000757,0.001284,0.001922,-0.000427,-2e-06,0.000657,-0.000746,2.1e-05,-0.000219,0.000515,-0.000611,7.1e-05,-0.000112,0.000335,-0.000416,0.000174,-1.3e-05,0.00024,7.1e-05,-0.00031,-0.000112,7.3e-05,-0.000214,-2e-06,-9.3e-05,0.000151,9.1e-05,1.4e-05,-1e-05,-0.000285,0.000124,1.9e-05,-2.7e-05,-6.7e-05,-0.000228,-0.000143,3.7e-05,-5.6e-05,-0.000122,-1.5e-05,2.9e-05,-4.8e-05,8e-05,-1.6e-05,-3.2e-05,-1e-06,6.9e-05,-4.6e-05,-1.7e-05
0,-3e-06,1e-05,1.2e-05,1.3e-05,7e-06,7e-06,6e-06,-2.4e-05,-4e-06,-9e-06,4e-06,-2.6e-05,-2.8e-05,2e-06,2e-06,8e-06,-1.9e-05,2e-06,6e-06,5e-06,3.7e-05,6e-06,-1.2e-05,-1.7e-05,-6e-06,-1.8e-05,-2e-06,1.4e-05,-1e-05,1e-06,2e-06,3e-05,-5e-06,-7e-06,3.3e-05,1e-05,0.000164,-2.4e-05,1e-05,-8e-06,-0.000198,-0.000301,-2.4e-05,0.000151,-4.8e-05,-6.9e-05,-9.3e-05,-0.000235,-0.000144,-8.6e-05,-8.3e-05,-0.000255,-0.000299,-0.000274,0.001042,-0.000281,-0.000226,0.000278,-0.000489,-0.000269,0.000477,0.000993,-0.000602,3.4e-05,-0.00036,0.001204,-0.000506,-0.000185,0.00069,-0.002374,-0.000216,-0.000249,0.000174,0.000391,0.000167,0.000766,0.000392,0.000107,-8.7e-05,-4.2e-05,-0.000143,0.000863,-0.000502,0.000315,-0.000266,-1.8e-05,-3.6e-05,-0.000132,0.000121,3e-06,-0.00018,0.000133,0.000118,0.000121,1.7e-05,2e-06,0.000116,0.000163,6e-06,3e-06,0.000272,-0.000152,-1.5e-05,-1.9e-05,-0.000211,-9.9e-05,7.1e-05,5e-05,-8e-06,9.1e-05,0.000153,8.4e-05,3.4e-05,-4.7e-05,1.1e-05,2.2e-05,-1.4e-05,9e-06,-4.5e-05,4.5e-05
-7e-06,1e-06,4e-06,-1.3e-05,2e-06,-3e-06,-1.1e-05,-7e-06,-1.1e-05,-1.8e-05,1.2e-05,-3e-06,9e-06,2e-06,-1e-05,-1.3e-05,-1e-06,3e-06,8e-06,9e-06,-1.2e-05,-3e-06,-1.8e-05,-1.1e-05,-5e-06,-1.3e-05,-1.2e-05,-6e-06,-5e-06,-4e-06,-3e-06,7e-06,8e-06,8e-06,-6e-06,-2.3e-05,-3e-05,-3.2e-05,-1e-06,-2.3e-05,0.000122,5.9e-05,0.000488,2.3e-05,-0.000169,6.8e-05,-1.9e-05,8e-05,1.5e-05,0.000186,-0.000133,3.9e-05,-2e-06,0.000547,-0.000713,0.00073,0.000159,-0.000135,0.00028,0.000493,-0.000126,0.00017,-0.000886,0.000671,-0.000455,-0.000406,-0.000136,0.000331,1.3e-05,4.9e-05,-0.000414,0.000165,0.000356,-0.00048,-0.000453,0.000198,-0.000541,0.000703,0.000199,-0.000111,0.000669,-0.000247,7.5e-05,0.000563,3.2e-05,0.000176,-0.00025,8.5e-05,0.000173,-0.000313,1.8e-05,0.000236,-6.7e-05,-0.000132,0.000136,-2.7e-05,-9.2e-05,-2.9e-05,-4.3e-05,-3.2e-05,7.6e-05,-0.00012,4.8e-05,3.6e-05,-1e-06,-0.000344,0.000243,4.9e-05,5.4e-05,-2.9e-05,-0.000137,-8.1e-05,2.9e-05,3e-05,1e-06,-5.7e-05,1.3e-05,-4e-06,-6e-06,-1.8e-05,-3.7e-05
1e-06,-8e-06,3e-06,-1.3e-05,-1e-06,-9e-06,-1.5e-05,-8e-06,-1.8e-05,-6e-06,-2e-06,-2e-06,-4e-06,1.8e-05,7e-06,-5e-06,-4e-06,-1.8e-05,1e-05,-7e-06,1e-06,-9e-06,-1.1e-05,-4e-06,8e-06,-5e-06,4e-06,-2e-06,2e-06,4e-06,3e-06,-1.1e-05,-1.3e-05,2e-06,-1.5e-05,5e-06,2.3e-05,5e-06,-3.2e-05,1e-05,3.7e-05,-3.4e-05,-0.000323,-7e-05,0.000136,-0.000112,-5.6e-05,3.6e-05,0.000122,0.000151,-0.000188,-3.1e-05,-0.001135,0.000351,0.000992,0.000498,-0.000207,0.000156,0.000846,0.000657,-0.000133,-0.00011,-7.5e-05,-0.000214,-0.00028,4.2e-05,-0.00042,0.000123,-0.000177,-0.000392,0.000245,0.000359,0.000418,-0.000359,-0.00031,-4.3e-05,0.000206,-0.000166,-0.000269,1e-06,-0.000115,-2.7e-05,-0.000101,4e-05,-1e-05,3.7e-05,0.000361,-0.000247,-8e-05,7e-06,2.1e-05,-8.4e-05,8.8e-05,1.5e-05,-3.7e-05,-3e-06,1e-04,-1.7e-05,-1.9e-05,2.7e-05,2.5e-05,8.6e-05,3.9e-05,-2e-06,9e-06,-0.000287,-8.9e-05,-8.6e-05,5e-06,7e-06,0.000117,-0.000129,-5.3e-05,2e-06,2.7e-05,1.5e-05,4e-06,-7e-06,-1e-06,-8e-06,4.1e-05
0,-3e-06,-3e-06,-7e-06,-3e-06,-5e-06,5e-06,-2e-06,-4e-06,1e-06,2e-06,4e-06,4e-06,-5e-06,5e-06,-6e-06,4e-06,0,1e-05,-1e-06,2e-06,-3e-06,3e-06,-8e-06,1.2e-05,7e-06,7e-06,2e-06,-2e-06,1e-06,-2e-06,2e-06,9e-06,8e-06,-4e-06,3.4e-05,3e-05,-7e-05,2.9e-05,1.6e-05,-2.1e-05,-5.6e-05,0.000124,-2.3e-05,-7.5e-05,3.7e-05,-1.8e-05,9.5e-05,-0.000314,-0.00024,0.000103,-6e-05,-2.9e-05,-0.000515,-0.000671,-0.000808,-0.00028,0.000308,-0.00089,-0.00071,-0.000127,-0.00023,-0.00019,-3.7e-05,-0.001174,-7.9e-05,-0.000166,-0.000228,0.000298,0.000164,0.000166,0.000393,-0.000239,0.000555,-0.000175,2.4e-05,-0.000218,-0.000205,-7.5e-05,9.5e-05,0.000155,3e-05,0.000339,-0.000341,0.000453,-1e-05,-0.000111,-1.5e-05,-2e-06,0.000125,-5e-06,0.000195,3.4e-05,6.2e-05,1.6e-05,2.9e-05,-3e-06,-2.2e-05,4e-05,-5e-06,-1.5e-05,-5.9e-05,2e-05,-4.8e-05,-2.6e-05,0.000223,2.9e-05,-4e-06,1.8e-05,1e-05,-6.8e-05,-2e-06,7.2e-05,-3.2e-05,-2.6e-05,-3.2e-05,-3e-06,-8e-06,-1.6e-05,1.2e-05,-2.5e-05
0,-8e-06,-1e-06,9e-06,-5e-06,-3e-06,-1e-06,-6e-06,-8e-06,4e-06,1.2e-05,-9e-06,9e-06,-5e-06,-3e-06,1e-06,-4e-06,1.5e-05,3e-06,2e-06,4e-06,-6e-06,1e-06,5e-06,4e-06,1e-06,4e-06,0,-2e-06,2e-06,0,3e-06,1e-06,1e-06,1e-06,-4e-06,-7e-06,2.4e-05,-2e-06,-3e-06,2.6e-05,6.2e-05,-0.000154,6.3e-05,-1.6e-05,2.6e-05,-4e-06,-0.000116,0.000236,0.000179,5.3e-05,-4.3e-05,0.000616,-5.5e-05,-0.000244,0.000455,0.000269,-3.5e-05,-0.000219,-2.5e-05,-2.6e-05,8.2e-05,-1.7e-05,-6.5e-05,6.6e-05,0.000396,0.000166,5e-06,0.000106,-0.000271,0.000427,0.000122,-0.000298,5.8e-05,0.000172,0.000108,3.4e-05,7.8e-05,-0.000149,-4e-05,0,0.000102,-1.6e-05,0.000164,-0.000571,3.8e-05,-0.000106,-4.5e-05,-6.6e-05,-0.000103,-1.7e-05,-0.000202,-8.4e-05,-5e-05,-2.5e-05,-8e-06,-9e-06,8.6e-05,0,-1.2e-05,2.2e-05,3.5e-05,6e-05,4.5e-05,-1e-06,0.000246,-2.2e-05,-0.000134,-4e-06,-1.2e-05,1.1e-05,5.6e-05,-2e-05,1.4e-05,2.2e-05,4e-06,-6e-06,-9e-06,2.8e-05,2.2e-05,1.1e-05
-3e-06,-5e-06,-3e-06,-5e-06,-1e-06,1e-06,0,-1e-06,-2e-06,4e-06,2e-06,-3e-06,2e-06,5e-06,1e-06,3e-06,4e-06,8e-06,0,2e-06,2e-06,4e-06,1e-06,1e-06,-3e-06,-4e-06,4e-06,-6e-06,-4e-06,4e-06,-3e-06,0,1e-06,1e-06,5e-06,-2.6e-05,1.3e-05,3e-06,1.3e-05,-3e-06,1.7e-05,3.6e-05,1.8e-05,-9e-06,1.8e-05,-5.5e-05,-4e-06,8.8e-05,-4e-06,-4e-05,5e-06,-2e-05,-2.2e-05,-1.3e-05,-9.5e-05,-0.000171,-0.000182,-0.000125,0.000308,-0.00047,0.000154,0.000162,0.00043,0.000196,-0.000154,5.9e-05,-0.000129,-5e-05,-0.000275,6.8e-05,4.3e-05,-0.00012,0.000281,-9.5e-05,-0.000339,-4e-05,1.3e-05,-0.000137,0.000151,-2.5e-05,-0.000138,-2.5e-05,-0.000449,-3.4e-05,0.000129,1.3e-05,-0.00011,2.6e-05,9.5e-05,-9.2e-05,2.5e-05,7.7e-05,3e-05,-1.2e-05,4.4e-05,-6e-06,-4e-05,-6.1e-05,-4.8e-05,9e-06,1e-05,-1.9e-05,-3.1e-05,4e-06,-9e-06,4e-05,-7e-05,0.000187,-2e-05,-7e-06,7e-06,7.5e-05,8e-06,-3e-06,-2.4e-05,-1e-06,-1.6e-05,-1e-06,-2.2e-05,9e-06,-9e-06
3e-06,-3e-06,-2e-06,-5e-06,0,-8e-06,0,1e-06,-1e-06,-2e-06,7e-06,3e-06,-4e-06,1.4e-05,-7e-06,-2e-06,-2e-06,5e-06,2e-06,-2e-06,-6e-06,-3e-06,1e-06,3e-06,5e-06,-1e-06,1e-06,-1e-06,-1e-06,0,0,-3e-06,-2e-06,-2e-06,2e-06,-5e-06,3e-06,3e-06,-1.4e-05,8e-06,-4.5e-05,-1e-05,8e-06,-2.5e-05,-6.9e-05,8.3e-05,-5e-06,-4.4e-05,-0.000185,-3.5e-05,-9.7e-05,-4.3e-05,-2e-05,0.000275,-0.000518,0.00021,0.000189,1.7e-05,-0.00039,1.7e-05,7.2e-05,0.000138,0.000231,-0.000176,0.000554,3.8e-05,-1e-04,-0.000126,7.4e-05,-0.000251,-0.000289,-0.000136,-0.000556,-0.000102,-0.000183,-4e-05,8.6e-05,0.000119,4e-05,-1.3e-05,-0.000231,-0.00011,0.000227,-0.000156,-9e-06,-0.000117,8.2e-05,3.2e-05,-6.3e-05,0.000111,-1e-06,4.6e-05,2.4e-05,6.9e-05,-2.9e-05,-5e-06,-1e-06,-4.7e-05,4.6e-05,1e-06,-7.2e-05,4e-06,-1e-06,0,-1.4e-05,2.4e-05,-6.5e-05,-0.000171,5.9e-05,-2e-06,-2.3e-05,-8.8e-05,1e-06,0,2.5e-05,3e-06,-4e-06,-3e-06,-7e-06,0,-4e-06
1e-06,-2e-06,1e-06,-6e-06,2e-06,0,4e-06,0,5e-06,-7e-06,-2e-06,-4e-06,-3e-06,6e-06,-4e-06,-1e-06,2e-06,-3e-06,0,-1e-06,-4e-06,4e-06,3e-06,0,-4e-06,-2e-06,2e-06,0,-1e-06,-2e-06,1e-06,3e-06,-2e-06,-3e-06,-1e-06,5e-06,-6e-06,-8e-06,3e-06,3e-06,-3.8e-05,4.4e-05,4.4e-05,1.2e-05,3.3e-05,-4.2e-05,-1.8e-05,7.7e-05,8.4e-05,-2.7e-05,1.1e-05,-1.7e-05,0.000248,9.8e-05,0.000297,-0.000119,7.6e-05,1.8e-05,0.000213,1.4e-05,3.6e-05,3.5e-05,-0.000575,0.000192,0.000297,-2e-06,0.000184,0.000323,0.000144,0.000187,1.2e-05,6.7e-05,0.000416,0.000214,0.000259,3.9e-05,-0.000378,0.000151,-2.5e-05,0.000211,-0.000182,-2.5e-05,0.000183,0.000131,-3.5e-05,0.000163,0.000106,4.6e-05,-8e-06,4.3e-05,-1e-05,-3.8e-05,-3.2e-05,-3.2e-05,2.3e-05,-9e-06,2.7e-05,-3.6e-05,-3e-05,-1.4e-05,1.3e-05,2.3e-05,-1e-06,1.2e-05,-1.5e-05,-5.5e-05,5.2e-05,0.000142,2.7e-05,-1.5e-05,1.6e-05,-5e-06,-4e-06,1.5e-05,-1.7e-05,2e-06,-4e-06,-7e-06,-1.1e-05,-3e-06,-3e-06
0,-2e-06,-1e-06,3e-06,1e-06,-3e-06,0,-1e-06,4e-06,-3e-06,-2e-06,-1e-06,-3e-06,-4e-06,3e-06,-1e-06,-2e-06,-9e-06,-2e-06,1e-06,-1e-06,-4e-06,4e-06,0,-4e-06,2e-06,4e-06,-2e-06,-1e-06,-2e-06,0,2e-06,5e-06,-4e-06,0,-6e-06,-3e-06,9e-06,-1e-06,-6e-06,1.3e-05,-8.1e-05,-2e-05,-1.4e-05,-1e-06,1.1e-05,-5e-06,-4.1e-05,-2.2e-05,3.6e-05,-3.3e-05,-2.3e-05,3.2e-05,-0.000342,-1.8e-05,0.00029,-4.2e-05,-9.3e-05,0.000233,9e-05,2.6e-05,-3.2e-05,0.000273,2.3e-05,0.000238,-0.000109,7.9e-05,-0.000128,-6.1e-05,0.000133,0.000323,0.000194,-0.000114,-6.2e-05,-0.000148,-3.9e-05,0.000372,8.1e-05,2e-05,-8.3e-05,0.000106,8.3e-05,-0.000272,8.2e-05,-1.9e-05,-0.000121,1.5e-05,-4.7e-05,5e-06,1.2e-05,1.3e-05,1.4e-05,1.2e-05,-2.8e-05,-1e-05,1.4e-05,3e-06,-8e-06,0,-7e-06,-4e-05,-4.4e-05,-3.4e-05,-7e-06,-3e-06,-8.2e-05,9.8e-05,-0.000142,2.8e-05,-4e-06,-2.3e-05,3.8e-05,3.8e-05,-3.6e-05,8e-06,-5e-06,3e-06,-1e-06,7e-06,-5e-06,1.1e-05
-2e-06,-3e-06,2e-06,-2e-06,-1e-06,0,1e-06,1e-06,4e-06,3e-06,-1e-06,2e-06,-2e-06,-6e-06,4e-06,0,3e-06,-6e-06,-1e-06,1e-06,-2e-06,0,2e-06,-3e-06,-1e-06,-2e-06,-1e-06,-3e-06,1e-06,-1e-06,-1e-06,-5e-06,-2e-06,-2e-06,0,-1.1e-05,-1e-05,-2.2e-05,-5e-06,-1e-06,-1.2e-05,-1e-06,-6e-06,4e-06,-2e-05,2.2e-05,-1.5e-05,6e-06,-0.00014,3.9e-05,-1.6e-05,-2.4e-05,-0.000104,-5.3e-05,5.7e-05,-0.000158,0.000128,-6.9e-05,-0.000158,-0.000119,-5.6e-05,-6.5e-05,-0.000108,-9e-06,0.000171,-0.000133,-0.000121,-0.000145,2e-05,-0.000211,-0.000351,0.000172,0.000195,-0.000433,-9.2e-05,-6.4e-05,-0.000288,5e-05,-2.3e-05,-8e-06,0.000155,6.1e-05,1.5e-05,-5.7e-05,0.000109,8.8e-05,0.00016,-9e-06,1.9e-05,-4e-06,-1.8e-05,-0.000104,2e-06,4.5e-05,4.8e-05,1e-06,-5e-06,1.7e-05,0,-4e-06,3.4e-05,2.7e-05,1.5e-05,-9e-06,2e-06,2.8e-05,6e-06,0.000146,3.1e-05,9e-06,-4e-06,-6.9e-05,-2e-05,2.5e-05,-4e-06,-1e-05,4e-06,-6e-06,4e-06,-2e-06,-9e-06
2e-06,-3e-06,0,-3e-06,-2e-06,1e-06,0,-1e-06,2e-06,4e-06,-6e-06,-1e-06,2e-06,1e-06,8e-06,2e-06,-2e-06,1e-06,-2e-06,0,2e-06,3e-06,0,-1e-06,2e-06,0,-4e-06,0,1e-06,0,-2e-06,1e-06,-1e-06,-4e-06,0,3e-06,-5e-06,6e-06,9e-06,4e-06,-2.5e-05,3.1e-05,-1.7e-05,-5e-06,3.5e-05,-3.9e-05,-5e-06,-4.4e-05,0.000106,-7.4e-05,7.9e-05,-2.1e-05,-0.000146,0.000129,-0.000109,0.000239,-0.000141,6.8e-05,8e-06,0.000355,1.5e-05,-2.2e-05,3.1e-05,5.8e-05,-0.000165,-6.2e-05,-0.000163,0.000332,3e-06,0.000255,-9.7e-05,3.9e-05,-0.000112,4.9e-05,-4.2e-05,1.6e-05,8.2e-05,-7.9e-05,2.9e-05,-1.9e-05,4.5e-05,-4.9e-05,0.000155,6.4e-05,4.3e-05,-2.8e-05,-0.000107,-3e-05,-3.4e-05,3.2e-05,-1.3e-05,0.000106,-8e-06,-1.3e-05,-4.2e-05,-2e-06,-2.2e-05,1.2e-05,4e-06,6e-06,-3.9e-05,-1.1e-05,-2.7e-05,-3e-06,-8e-06,-4.1e-05,-3.3e-05,-0.000143,-1.2e-05,-9e-06,1.2e-05,2.5e-05,4e-06,-1e-05,2e-06,-8e-06,3e-06,1e-06,-7e-06,1e-06,5e-06
0,-4e-06,1e-06,-4e-06,0,-1e-06,0,-2e-06,5e-06,-2e-06,-1e-06,-2e-06,1e-06,3e-06,3e-06,-1e-06,2e-06,-3e-06,-4e-06,-1e-06,0,0,1e-06,0,1e-06,-1e-06,-2e-06,-1e-06,0,0,-1e-06,2e-06,1e-06,-1e-06,-1e-06,1e-05,-3e-06,1.2e-05,-2e-06,2e-06,1.7e-05,-3e-05,1.1e-05,-2.1e-05,-4.3e-05,1.8e-05,-8e-06,5.9e-05,-1.1e-05,2.7e-05,-3.3e-05,-1.9e-05,-0.000103,7.1e-05,-0.000202,-0.000122,2.2e-05,9e-05,-0.000269,3.9e-05,-8e-05,5.4e-05,0.000166,4.3e-05,-0.000156,5.9e-05,1.9e-05,-1.4e-05,1.4e-05,-0.000246,-0.000116,-5.9e-05,7.2e-05,0.000154,9.7e-05,7.3e-05,6.9e-05,-8.6e-05,3.9e-05,2e-05,6.4e-05,-4.1e-05,-0.00014,-3e-06,8.3e-05,1.5e-05,5.4e-05,2.7e-05,6e-06,-3.7e-05,9e-06,2e-05,2.2e-05,-3.8e-05,3.2e-05,-7e-06,8e-06,1e-05,-6e-06,-1e-06,4.7e-05,2.2e-05,-4e-06,-6e-06,-5e-06,-4.5e-05,-3.7e-05,8.3e-05,1.4e-05,-1e-06,-9e-06,4e-05,-1.1e-05,-4e-06,0,-7e-06,3e-06,-1e-06,1e-05,1e-06,-3e-06
-1e-06,-2e-06,0,3e-06,1e-06,1e-06,0,0,2e-06,-4e-06,-4e-06,2e-06,2e-06,-4e-06,-1e-06,0,-1e-06,8e-06,-1e-06,1e-06,0,2e-06,0,-1e-06,0,1e-06,-2e-06,-1e-06,1e-06,1e-06,-1e-06,-1e-06,-1e-06,0,0,2e-06,-5e-06,-1e-05,1e-06,-2e-06,1.9e-05,4.2e-05,-1.8e-05,1.4e-05,2.4e-05,-4e-06,-9e-06,-1.1e-05,-8.4e-05,-1.8e-05,-4.3e-05,-1.7e-05,0.000171,-6e-05,2.2e-05,0.000148,-4.6e-05,2e-06,0.000107,-0.000184,-2.1e-05,6.2e-05,-0.000105,-4.2e-05,-0.000378,4.9e-05,0.00022,-0.000134,3e-06,2e-04,-0.000122,-2e-05,-8.5e-05,9.6e-05,7.4e-05,-1e-06,-0.000289,2.4e-05,-4.1e-05,-1.1e-05,-4.6e-05,0,-6.1e-05,-5.7e-05,-0.000171,-6e-06,-0.000172,-2.1e-05,5e-06,8e-06,0,-2.7e-05,-2.8e-05,3.5e-05,-3.6e-05,4e-06,1.5e-05,1.2e-05,7e-06,-9e-06,-1e-05,-2.4e-05,1.1e-05,-1e-06,-9e-06,4.8e-05,-2.3e-05,-1.4e-05,-1.7e-05,8e-06,0,-4.8e-05,-2.1e-05,3e-06,-3e-06,0,2e-06,-1e-06,-3e-06,-2e-06,-3e-06
-1e-06,-2e-06,0,-2e-06,0,-3e-06,-1e-06,-1e-06,1e-06,-1e-06,0,0,0,-7e-06,-2e-06,0,1e-06,4e-06,0,0,0,-3e-06,-1e-06,1e-06,-1e-06,-1e-06,-1e-06,-2e-06,0,1e-06,0,-2e-06,0,0,0,-3e-06,5e-06,7e-06,7e-06,-1e-06,0,2.8e-05,2.7e-05,1.1e-05,-1e-05,-1.8e-05,-1e-05,1.7e-05,6.7e-05,2.6e-05,0,-1.7e-05,7.5e-05,-0.000139,2.9e-05,-0.000186,-8.7e-05,-4.6e-05,8.8e-05,2e-04,-1.5e-05,-4e-06,-4.7e-05,-4.6e-05,5.6e-05,0.000108,2.6e-05,5.1e-05,9e-06,-0.000167,0.000622,5.8e-05,-9e-05,-4e-06,-0.000176,-3.3e-05,0.000131,-6e-06,-2.2e-05,-7e-06,1.4e-05,1.5e-05,0.000141,3.8e-05,6.6e-05,-1e-06,1.8e-05,3.4e-05,3e-06,2.6e-05,-4e-06,-3.8e-05,2e-05,0,2e-05,6e-06,0,2.7e-05,5e-06,5e-06,2.9e-05,1.6e-05,-8e-06,1e-05,-7e-06,6.2e-05,1.1e-05,-4.6e-05,8e-06,-4e-06,3e-06,-1.4e-05,4e-06,-1.4e-05,4e-06,1e-06,-4e-06,-2e-06,8e-06,-6e-06,-3e-06
1e-06,-2e-06,0,-1e-06,0,1e-06,-1e-06,0,0,1e-06,1e-06,-2e-06,-1e-06,-4e-06,-3e-06,-1e-06,-2e-06,1e-06,1e-06,0,-3e-06,1e-06,-1e-06,0,0,0,0,0,0,0,-1e-06,2e-06,1e-06,1e-06,0,3e-06,5e-06,-1.3e-05,-7e-06,1e-06,7e-06,-2.2e-05,-1.3e-05,-2e-05,-2e-05,1.9e-05,-1e-05,-2e-05,-2.6e-05,-3.3e-05,2.5e-05,-1.3e-05,-8.7e-05,2.1e-05,7.3e-05,0,6e-05,5e-06,-9.4e-05,-0.000202,-2.4e-05,-3.9e-05,2e-05,5.5e-05,-0.000155,5.5e-05,-0.000115,-4.2e-05,1.5e-05,0.000128,7.8e-05,8.2e-05,0.00011,0.000119,-0.000165,1.5e-05,-4e-05,7e-05,-1.9e-05,-5.7e-05,-9.7e-05,2.4e-05,-0.000104,-2.7e-05,-3.4e-05,-3e-06,1.6e-05,-3.1e-05,-2.1e-05,-2.8e-05,3e-06,-1.7e-05,-5e-06,-2.9e-05,-2.3e-05,2e-06,-8e-06,-5e-06,-1.2e-05,2e-06,-2.4e-05,-7e-06,2.7e-05,4e-06,-5e-06,5.6e-05,1.1e-05,7e-05,0,-5e-06,-2e-06,1.2e-05,0,2.5e-05,-5e-06,2e-06,-3e-06,-1e-06,-9e-06,-8e-06,8e-06
0,-2e-06,0,-3e-06,0,-1e-06,0,0,-1e-06,2e-06,0,1e-06,-1e-06,2e-06,-1e-06,1e-06,1e-06,-2e-06,2e-06,-1e-06,-1e-06,-3e-06,-1e-06,0,-1e-06,0,-1e-06,0,0,0,0,1e-06,-2e-06,0,0,3e-06,3e-06,-5e-06,6e-06,0,1.4e-05,-3e-06,1e-05,-3e-06,1.4e-05,-9e-06,-9e-06,3e-06,-5.8e-05,2.1e-05,3e-06,-1.4e-05,4.3e-05,0.000134,4.6e-05,-0.000157,-5.4e-05,1e-05,0.00016,1e-05,-1.3e-05,-1.1e-05,-0.000105,-2.5e-05,0.000269,-1.8e-05,-3.9e-05,2.3e-05,-4.6e-05,-1e-05,-0.000421,2.5e-05,-1.6e-05,8.1e-05,-1.9e-05,1.2e-05,6.6e-05,7.3e-05,1.4e-05,8.6e-05,-9e-06,-8e-06,-0.000149,-6.9e-05,-3.9e-05,2e-05,-2.2e-05,3.3e-05,6e-06,7e-06,1e-06,5.8e-05,-1.1e-05,2.3e-05,3e-06,-2e-06,-6e-06,-7e-06,7e-06,-5e-06,2.2e-05,-6e-06,3e-06,-1e-06,-2e-06,1.7e-05,1.8e-05,-9.8e-05,1.2e-05,7e-06,9e-06,1e-06,7e-06,-2e-05,6e-06,1e-06,0,0,2e-06,-6e-06,-5e-06
-1e-06,-2e-06,0,2e-06,-1e-06,0,0,1e-06,-1e-06,1e-06,3e-06,0,0,2e-06,1e-06,0,-1e-06,-4e-06,2e-06,0,0,1e-06,-1e-06,0,-1e-06,0,0,-1e-06,0,0,-1e-06,-2e-06,0,1e-06,0,-3e-06,4e-06,1e-05,-2e-06,-1e-06,-3e-06,-7e-06,-1.4e-05,1e-05,-1.5e-05,-1e-06,-7e-06,-1e-06,7.6e-05,1.2e-05,-9e-06,-1.3e-05,4e-05,8e-06,-1.6e-05,1.7e-05,6.4e-05,-3.8e-05,-0.000123,-6.4e-05,-2.7e-05,1.3e-05,0.000195,-4.2e-05,0.000134,-7.8e-05,-2.4e-05,7.7e-05,3e-05,-3.4e-05,-6e-05,-4.6e-05,1.7e-05,-0.000101,6.2e-05,-2.3e-05,3.7e-05,-4e-05,1.1e-05,-5.2e-05,2.5e-05,-2.4e-05,0.000127,9e-05,7e-05,-1.2e-05,3.7e-05,-3.1e-05,4e-06,1.2e-05,-7e-06,-1.5e-05,2.1e-05,8e-06,1.9e-05,1e-06,4e-06,-4e-06,-3e-06,-6e-06,-2e-05,1.7e-05,5e-06,3e-06,-1e-06,-8e-05,-8e-06,0.000109,1e-05,0,-4e-06,-5e-06,-1.4e-05,5e-06,-5e-06,-1e-06,0,-1e-06,1e-06,-2e-06,2e-06
-1e-06,-2e-06,0,-1e-06,0,0,0,-1e-06,-1e-06,-1e-06,1e-06,-2e-06,0,0,2e-06,0,0,-5e-06,1e-06,0,0,1e-06,-1e-06,0,2e-06,-1e-06,2e-06,-1e-06,0,0,0,1e-06,1e-06,0,0,-5e-06,1e-06,-1e-06,-2e-06,0,-1.2e-05,-3.3e-05,-7e-06,-9e-06,-1e-06,1.1e-05,-7e-06,1.2e-05,-2.4e-05,-1.8e-05,6e-06,-1.3e-05,-3.8e-05,-6.6e-05,1.8e-05,-6.7e-05,4e-05,-2.1e-05,-4.7e-05,-6e-06,2.1e-05,1e-06,-6.6e-05,-2.4e-05,0.000165,-3.5e-05,2.5e-05,-0.00011,0,3.3e-05,3.5e-05,-5.4e-05,7e-05,-0.000132,3e-05,-2.2e-05,5.6e-05,-1.8e-05,-1.1e-05,3.8e-05,8e-06,5e-06,1e-04,-2.7e-05,0,1.2e-05,-7.3e-05,3.5e-05,-8e-06,-2e-05,6e-06,5e-06,-1.3e-05,-3e-05,-1e-06,0,6e-06,-2.2e-05,1e-06,-3e-06,-2e-06,-1.2e-05,5e-06,-2e-06,-6e-06,-7.8e-05,2e-06,-9.5e-05,5e-06,-4e-06,2e-06,-1e-05,-4e-06,3e-06,3e-06,-5e-06,-2e-06,-2e-06,-2e-06,3e-06,-1e-06
1e-06,-2e-06,0,0,0,-1e-06,0,0,-2e-06,-2e-06,2e-06,1e-06,1e-06,-2e-06,1e-06,0,0,1e-06,0,0,1e-06,-1e-06,-1e-06,-1e-06,2e-06,0,2e-06,0,0,0,0,1e-06,-1e-06,0,0,-1e-06,1e-06,2e-06,4e-06,1e-06,-3e-06,1e-05,9e-06,-3e-06,1.2e-05,-7e-06,-7e-06,-1.5e-05,-6.4e-05,8e-06,-2.1e-05,-1.3e-05,-7e-05,-3.4e-05,-4.2e-05,7.2e-05,-2e-06,3.2e-05,1.8e-05,1.4e-05,-1.5e-05,1.8e-05,-5.4e-05,2.2e-05,-3.6e-05,-3.3e-05,1.5e-05,2.3e-05,-2.5e-05,-9.6e-05,-3.3e-05,-4e-06,-9.3e-05,-2.7e-05,-9.4e-05,1.1e-05,-9.7e-05,-4.6e-05,-1.1e-05,-6.1e-05,2e-06,2e-05,-0.000146,-2.3e-05,2e-05,-9e-06,2.8e-05,-1.7e-05,-7e-06,-2.5e-05,2e-06,-1.1e-05,-3e-06,1.5e-05,-3e-06,0,0,-1.2e-05,-4e-06,1e-06,-2.1e-05,8e-06,-8e-06,-2e-06,-4e-06,-7e-06,7e-06,6.1e-05,3e-06,4e-06,0,1.9e-05,-1e-06,-9e-06,-1e-06,-2e-06,2e-06,0,1e-06,4e-06,-3e-06
0,-1e-06,0,-2e-06,0,1e-06,0,0,-2e-06,0,0,1e-06,1e-06,2e-06,-1e-06,0,0,1e-06,0,0,0,1e-06,0,0,0,0,1e-06,0,0,0,0,-1e-06,0,-1e-06,0,1e-06,1e-06,-3e-06,-6e-06,0,-4e-06,1e-05,-5e-06,-1e-06,-1.7e-05,0,-7e-06,4e-06,6.1e-05,-6e-06,-1e-05,-1.2e-05,-3.1e-05,4.8e-05,-0.00013,2e-06,6e-05,3.4e-05,-4.4e-05,9.6e-05,2.1e-05,2e-06,5.1e-05,-3.6e-05,-8.5e-05,2.4e-05,1.7e-05,0.000111,7e-06,4.5e-05,0.000156,4.4e-05,6e-06,4.6e-05,-2.4e-05,7e-06,9.3e-05,-6.6e-05,-3e-06,6.2e-05,-2.1e-05,-8e-06,-3.7e-05,7.8e-05,1e-05,4e-06,-6.4e-05,1.1e-05,7e-06,1.6e-05,-7e-06,-8e-06,1.3e-05,1.4e-05,-2.4e-05,-2e-06,-4e-06,-5e-06,5e-06,0,1.5e-05,-1.8e-05,4e-06,-2e-06,-5e-06,3.2e-05,-5e-06,-3.4e-05,-5e-06,1e-06,2e-06,-2.3e-05,-4e-06,1.3e-05,1e-06,-3e-06,2e-06,1e-06,-4e-06,4e-06,3e-06
-1e-06,-1e-06,0,1e-06,0,-1e-06,0,0,-1e-06,2e-06,-1e-06,-1e-06,0,3e-06,-3e-06,0,0,3e-06,-1e-06,0,-1e-06,-2e-06,1e-06,0,0,0,1e-06,-1e-06,0,1e-06,0,-1e-06,-1e-06,-1e-06,0,-1e-06,-3e-06,-1e-05,3e-06,-1e-06,-8e-06,1e-06,1.8e-05,-2e-06,1.3e-05,7e-06,-7e-06,-2e-06,-4.4e-05,1.7e-05,3.2e-05,-1e-05,2.2e-05,4.6e-05,0.000269,2.4e-05,-3.8e-05,-8e-06,0.00019,-6e-05,2.2e-05,-1.2e-05,-5.3e-05,-8e-06,-0.000122,6.3e-05,6.9e-05,-5.2e-05,-1.5e-05,-4.6e-05,-2.7e-05,3.4e-05,-4.8e-05,1.7e-05,-2e-06,6e-06,-0.000111,5.8e-05,1.3e-05,-5e-05,-1e-05,-1.7e-05,0.000131,-3.1e-05,-6e-05,7e-06,5.8e-05,-1.6e-05,-2e-06,2e-06,4e-06,3.9e-05,-1.1e-05,-2.5e-05,1.6e-05,4e-06,-2e-06,2e-06,-5e-06,-4e-06,-1.4e-05,2.3e-05,-8e-06,-3e-06,-4e-06,6.7e-05,-2.3e-05,2.4e-05,-2e-06,-4e-06,-9e-06,-2.7e-05,4e-06,-1.2e-05,-1e-06,1e-06,1e-06,-2e-06,6e-06,2e-06,1e-06
-1e-06,-1e-06,0,-1e-06,0,1e-06,0,0,-1e-06,1e-06,0,0,0,2e-06,-3e-06,0,0,4e-06,-1e-06,0,-1e-06,2e-06,0,0,-1e-06,0,0,-1e-06,0,0,0,1e-06,1e-06,-2e-06,0,-1e-06,-2e-06,8e-06,-2e-06,0,1e-06,2.5e-05,-1.9e-05,4e-06,-7e-06,-8e-06,-6e-06,7e-06,-2.9e-05,-2.7e-05,-9e-06,-9e-06,3.3e-05,-2.3e-05,-0.00015,-8e-06,-4e-06,-1.9e-05,-0.000107,9.5e-05,1e-06,-2.4e-05,7e-06,6e-06,-0.000107,2.9e-05,-4.2e-05,-4.2e-05,1.5e-05,7.5e-05,-0.000104,-1.8e-05,6.2e-05,3.6e-05,-4.8e-05,8e-06,4.4e-05,5.9e-05,5e-06,4.8e-05,5e-06,8e-06,-5.8e-05,-4e-05,-2.4e-05,-1.3e-05,2.9e-05,1.4e-05,-1.2e-05,0,-1e-06,-4.9e-05,3e-06,5e-06,8e-06,-4e-06,2e-06,9e-06,0,0,1.3e-05,-1.3e-05,-8e-06,1e-06,-3e-06,4.2e-05,-4e-06,-3.3e-05,-4e-06,2e-06,7e-06,3.7e-05,-3e-06,5e-06,0,0,0,-1e-06,-3e-06,0,-1e-06
1e-06,-1e-06,0,0,0,-1e-06,0,0,0,-1e-06,-2e-06,1e-06,0,0,-1e-06,0,1e-06,0,-1e-06,0,-1e-06,-1e-06,0,0,-1e-06,0,0,0,0,0,0,0,0,-1e-06,0,2e-06,-1e-06,1e-06,-3e-06,0,6e-06,-8e-06,1.1e-05,-6e-06,-7e-06,3e-06,-6e-06,9e-06,5.4e-05,1.9e-05,-1.7e-05,-9e-06,-2e-05,-6.1e-05,6.6e-05,-7e-06,-2e-05,9e-06,-6.1e-05,-1.1e-05,1.7e-05,1.8e-05,6.4e-05,-7e-06,4.3e-05,4e-06,-7.4e-05,2.2e-05,-2.2e-05,-8e-06,0.000149,-5.7e-05,-5.1e-05,8e-06,-5.3e-05,2e-06,-5.8e-05,6e-06,-1e-05,-5.8e-05,-3e-06,1e-05,-7.7e-05,6.1e-05,3.1e-05,1.9e-05,5.9e-05,-1.8e-05,0,3e-06,-3e-06,2.1e-05,4e-06,2e-05,1.3e-05,-1e-06,3e-06,1.6e-05,3e-06,1e-06,-6e-06,5e-06,-1e-06,2e-06,-3e-06,-1.8e-05,1e-05,2.9e-05,0,3e-06,-9e-06,-2e-06,2e-06,0,1e-06,0,-1e-06,1e-06,3e-06,-1e-06,1e-06
0,-1e-06,0,-2e-06,0,0,0,0,0,-2e-06,0,-1e-06,0,-1e-06,1e-06,0,-1e-06,-2e-06,-1e-06,0,0,1e-06,0,0,0,0,0,0,0,0,0,-2e-06,-1e-06,-2e-06,0,2e-06,-3e-06,3e-06,4e-06,0,4e-06,-1.1e-05,-1.9e-05,-4e-06,9e-06,4e-06,-6e-06,-1.5e-05,-2.4e-05,-6e-06,8e-06,-1e-05,-1.4e-05,1.8e-05,4.9e-05,-1.1e-05,-5.2e-05,6e-06,0.000135,-3.8e-05,3e-06,1.6e-05,-5.8e-05,-2.3e-05,8e-06,-1.6e-05,1e-06,-2.1e-05,-5e-06,-4e-06,3.8e-05,-4.9e-05,7.7e-05,1e-06,-9e-06,-1.1e-05,-6.2e-05,1.8e-05,4e-06,5.8e-05,3.2e-05,-9e-06,0.000128,-4.5e-05,-3.7e-05,-2.1e-05,-3e-06,2.7e-05,5e-06,2e-06,2e-06,-1.9e-05,-8e-06,-2e-05,-2.3e-05,1e-06,-1e-06,6e-06,-3e-06,-2e-06,2.5e-05,-3e-06,-9e-06,1e-06,-2e-06,-3.5e-05,1.5e-05,-1.6e-05,2e-06,-4e-06,8e-06,-3.2e-05,-6e-06,-3e-06,-1e-06,-1e-06,0,1e-06,-2e-06,-1e-06,-4e-06
-1e-06,-1e-06,0,1e-06,0,0,0,0,0,0,-1e-06,0,0,0,3e-06,0,1e-06,-3e-06,-1e-06,0,0,0,0,0,0,0,0,-1e-06,0,0,0,1e-06,0,0,0,0,-1e-06,-1e-06,-5e-06,0,2e-06,-1e-06,1.9e-05,4e-06,-1.5e-05,-9e-06,-6e-06,3e-06,-3.9e-05,-5e-06,-4e-06,-1e-05,5e-05,2.2e-05,-5.7e-05,-2e-05,7e-06,-2e-05,-0.00015,-3.3e-05,3e-06,-9e-06,4.8e-05,4.1e-05,0.000121,-5.1e-05,1.8e-05,1e-05,1.9e-05,2.6e-05,-0.000102,-4e-06,-2.3e-05,-6.3e-05,4e-06,0,8.4e-05,-4.5e-05,-3e-06,-3.7e-05,1.4e-05,-4e-06,-1.1e-05,-2.5e-05,7.3e-05,2e-05,-1.5e-05,-2.4e-05,-6e-06,-1e-06,2e-06,2.6e-05,1e-05,-2e-06,-3e-06,1e-06,-2e-06,8e-06,1e-06,-1e-06,-1.5e-05,-1e-06,5e-06,1e-06,-5e-06,-3e-05,2e-06,-4e-06,0,0,-8e-06,1.3e-05,5e-06,4e-06,1e-06,-2e-06,-2e-06,-2e-06,1e-06,0,2e-06
0,-1e-06,0,-1e-06,0,-1e-06,0,0,1e-06,1e-06,0,1e-06,0,1e-06,2e-06,0,-1e-06,-3e-06,0,0,0,-1e-06,0,0,1e-06,0,-1e-06,-1e-06,0,0,0,1e-06,0,-1e-06,0,0,1e-06,-1e-06,3e-06,0,2e-06,-1.9e-05,-1.1e-05,-3e-06,4e-06,7e-06,-6e-06,-4e-06,4.5e-05,8e-06,-2e-06,-1e-05,-1.5e-05,1.5e-05,-4e-05,0,-2e-05,-1.2e-05,7.5e-05,-6e-06,-7e-06,-1.4e-05,-5.9e-05,9e-06,-9e-06,-3.9e-05,4.5e-05,2e-05,-1.4e-05,-4.3e-05,-1e-06,2.3e-05,-2.7e-05,-6.3e-05,-5.9e-05,0,-8.5e-05,-7.2e-05,4e-06,4.9e-05,1.1e-05,3e-06,-0.000116,4.2e-05,-3.8e-05,-1.6e-05,-1.5e-05,2.2e-05,-4e-06,-3e-06,-4e-06,1.6e-05,-8e-06,2.1e-05,4e-06,-3e-06,0,6e-06,1e-06,-3e-06,1.5e-05,6e-06,1e-06,2e-06,-4e-06,-2.1e-05,-5e-06,2.5e-05,1e-06,3e-06,4e-06,3e-06,7e-06,-6e-06,-1e-06,-1e-06,-2e-06,0,1e-06,0,1e-06
1e-06,-1e-06,0,1e-06,0,1e-06,0,0,1e-06,1e-06,1e-06,-1e-06,0,-1e-06,1e-06,0,1e-06,0,0,0,0,1e-06,0,0,0,-1e-06,0,0,0,0,0,-1e-06,0,0,0,1e-06,1e-06,-8e-06,1e-06,0,0,3e-06,1.6e-05,-4e-06,1e-06,-1e-06,-6e-06,7e-06,-4.6e-05,-6e-06,1.1e-05,-9e-06,-8e-06,-5e-05,-8e-06,0,1e-05,1e-05,6.8e-05,-2.9e-05,-8e-06,1e-06,1.5e-05,-2.8e-05,4.4e-05,0,-8e-06,-3.5e-05,1e-06,2.6e-05,-0.000156,6e-06,4e-05,2.3e-05,-7.7e-05,-4e-06,7.9e-05,0,9e-06,-6.5e-05,-8e-06,2e-06,0.000123,-1.7e-05,5.1e-05,9e-06,-5.2e-05,-2.3e-05,3e-06,-1e-06,1e-06,-3.8e-05,0,-1.5e-05,1.6e-05,4e-06,1e-06,-5e-06,0,-1e-06,-1.4e-05,-8e-06,1e-06,-1e-06,-3e-06,1e-05,-1.3e-05,-4.5e-05,0,-2e-06,-1e-06,-1.8e-05,-2e-06,3e-06,1e-06,-1e-06,1e-06,1e-06,-4e-06,-1e-06,0
0,-1e-06,0,-1e-06,0,-1e-06,0,0,1e-06,0,0,0,0,-1e-06,-1e-06,0,-1e-06,3e-06,1e-06,0,-1e-06,-1e-06,0,0,0,0,0,0,0,0,0,0,0,0,0,-1e-06,2e-06,7e-06,-3e-06,0,-3e-06,1.5e-05,-1.6e-05,0,-1.2e-05,-6e-06,-6e-06,-2e-06,-3e-05,1.5e-05,0,-9e-06,-4e-06,1.7e-05,8e-05,2.4e-05,3.8e-05,9e-06,-9.3e-05,5.2e-05,-1e-06,7e-06,3.8e-05,1.4e-05,-7.3e-05,2.8e-05,-2.9e-05,-4e-06,4e-06,-5.3e-05,-1e-06,-3.5e-05,-6e-05,3.8e-05,5e-06,-1e-06,-6e-06,3.7e-05,-4e-06,6.1e-05,-2e-05,-2e-06,5.4e-05,-2.2e-05,-2.4e-05,-7e-06,4.7e-05,1.6e-05,1e-06,-2e-06,3e-06,3.1e-05,7e-06,-9e-06,-5e-06,1e-06,0,-1.2e-05,-4e-06,-1e-06,1.1e-05,1.3e-05,7e-06,-2e-06,-3e-06,2.3e-05,3e-06,5.9e-05,-4e-06,-1e-06,4e-06,0,2e-06,2e-06,-1e-06,-1e-06,1e-06,0,2e-06,-2e-06,1e-06
