0.088789,0.098741,0.106613,0.102362,0.105604,0.108385,0.108746,0.131978,0.12628,0.101196,0.093282,0.081085,0.073752,0.077973,0.076847,0.06925,0.062602,0.065187,0.078793,0.083687,0.077904,0.080615,0.079337,0.074014,0.083792,0.096842,0.093903,0.083135
0.117686,0.1289,0.135559,0.130754,0.141194,0.145693,0.145458,0.178783,0.170705,0.134535,0.120616,0.104385,0.096586,0.101939,0.100807,0.089263,0.079944,0.083649,0.101124,0.108558,0.100919,0.103277,0.101916,0.095769,0.105875,0.120265,0.117537,0.105818
0.170677,0.182324,0.18501,0.180278,0.204243,0.212081,0.213025,0.264939,0.252411,0.197528,0.171238,0.145782,0.138048,0.145305,0.144248,0.126055,0.1115,0.116607,0.14038,0.152262,0.14109,0.142573,0.141691,0.135177,0.144834,0.158378,0.156229,0.145791
0.215869,0.224489,0.220181,0.21669,0.25116,0.264583,0.270073,0.331916,0.316835,0.25431,0.217264,0.180961,0.172822,0.178667,0.176604,0.156657,0.139798,0.14371,0.168653,0.18266,0.169321,0.169768,0.1714,0.167649,0.172672,0.178342,0.177574,0.174028
0.232639,0.236969,0.225444,0.22307,0.25646,0.278736,0.289504,0.337755,0.324885,0.279037,0.24602,0.202342,0.187872,0.18506,0.177591,0.165148,0.156342,0.156962,0.174195,0.184357,0.173145,0.174935,0.180896,0.183262,0.178575,0.169425,0.168918,0.174348
0.234035,0.23439,0.225572,0.227044,0.244847,0.271807,0.281085,0.289812,0.280047,0.273323,0.260915,0.21525,0.19337,0.178781,0.160349,0.158657,0.166179,0.166826,0.173411,0.175306,0.172137,0.17864,0.183046,0.192476,0.182603,0.159233,0.153658,0.160073
0.280534,0.276661,0.281318,0.288973,0.283717,0.297348,0.297215,0.281561,0.273468,0.292502,0.294664,0.259879,0.240482,0.208282,0.174283,0.174543,0.194076,0.204526,0.206345,0.200446,0.205467,0.215102,0.210073,0.230125,0.239162,0.207512,0.178072,0.175
0.427135,0.428319,0.434959,0.430652,0.396116,0.382173,0.37534,0.38628,0.390829,0.414537,0.401483,0.365172,0.360293,0.310472,0.250162,0.236532,0.259839,0.295694,0.305754,0.29498,0.314205,0.323444,0.298524,0.333635,0.390573,0.355085,0.279287,0.271542
0.734671,0.752436,0.74103,0.69406,0.61549,0.573487,0.571427,0.654332,0.682296,0.698189,0.63092,0.550598,0.580068,0.53247,0.417646,0.358934,0.393277,0.484671,0.51633,0.503222,0.551748,0.559569,0.485276,0.543734,0.694149,0.63987,0.47846,0.484606
1.234212,1.280099,1.225357,1.119189,0.991435,0.922774,0.924052,1.11058,1.170048,1.155848,0.9874,0.825844,0.930648,0.9118,0.692079,0.539409,0.606115,0.806235,0.86994,0.841997,0.932934,0.935521,0.773205,0.867413,1.184791,1.098808,0.796774,0.844904
1.876183,1.948048,1.807247,1.63714,1.482011,1.375438,1.364123,1.690839,1.800427,1.718696,1.400293,1.151261,1.39629,1.441319,1.069143,0.763622,0.870591,1.232504,1.332569,1.25822,1.387702,1.378523,1.101528,1.249025,1.818423,1.70397,1.208148,1.32666
2.402792,2.492227,2.25279,2.059792,1.936358,1.772345,1.717963,2.176486,2.343161,2.187994,1.733838,1.445258,1.859999,1.979543,1.459361,0.977576,1.107987,1.62397,1.738049,1.583331,1.718086,1.69143,1.325007,1.53706,2.372509,2.246228,1.57236,1.786103
2.434185,2.523664,2.247654,2.111875,2.090373,1.899118,1.797402,2.262672,2.44633,2.306091,1.845406,1.57778,2.060872,2.23208,1.681119,1.080637,1.18598,1.740062,1.819023,1.589003,1.687283,1.657478,1.29769,1.553325,2.502824,2.391237,1.690957,1.990634
1.841255,1.91381,1.709281,1.690196,1.796238,1.640445,1.509628,1.815069,1.959744,1.929692,1.629384,1.447159,1.802478,1.965574,1.558462,1.005971,1.058707,1.459668,1.446966,1.209162,1.264719,1.271431,1.033166,1.269446,2.065112,1.979961,1.453582,1.75919
1.088333,1.139147,1.071662,1.120838,1.240638,1.12718,1.041057,1.195714,1.252759,1.262543,1.154453,1.102794,1.254771,1.339483,1.125762,0.808334,0.871788,1.032107,0.923048,0.763679,0.808231,0.859983,0.779584,0.933247,1.358644,1.296537,1.052174,1.241056
0.77431,0.833548,0.826878,0.804056,0.867126,0.848045,0.884242,1.020403,0.987734,0.913385,0.862955,0.838481,0.888156,0.911468,0.791481,0.787891,0.962604,0.917985,0.733528,0.649495,0.655709,0.766574,0.840253,0.94626,1.048601,0.945405,0.877649,0.924883
0.874845,0.977585,0.976046,0.840608,0.842064,0.889478,1.049156,1.253996,1.153174,1.041268,0.98165,0.879895,0.953836,0.985158,0.82698,0.973804,1.261222,1.112886,0.859546,0.763309,0.700102,0.880146,1.087299,1.204961,1.255745,1.116341,1.026606,0.989979
1.078625,1.227328,1.215259,1.007116,0.942367,1.001158,1.237544,1.486059,1.3814,1.313216,1.240228,1.081192,1.184977,1.180931,0.965305,1.180396,1.512451,1.311292,1.059133,0.926261,0.796639,1.033711,1.325062,1.436205,1.46672,1.346787,1.295408,1.252111
1.288054,1.564587,1.587787,1.332871,1.155189,1.131583,1.347906,1.592488,1.536812,1.501991,1.425017,1.288703,1.394863,1.296377,1.02348,1.25164,1.605575,1.39779,1.171428,1.072513,0.95783,1.175905,1.468646,1.51891,1.453007,1.422057,1.572968,1.658848
1.420799,1.868829,1.959908,1.662449,1.362293,1.247018,1.428221,1.627109,1.602659,1.508171,1.364698,1.327925,1.449781,1.263582,0.989267,1.208512,1.595325,1.455721,1.241997,1.177378,1.102001,1.22625,1.480917,1.52944,1.357116,1.360462,1.752203,2.028635
1.402734,1.852048,1.97848,1.732626,1.406554,1.225336,1.364329,1.510329,1.472761,1.292339,1.090919,1.134342,1.293179,1.137909,0.911143,1.066552,1.49536,1.47903,1.22426,1.143507,1.132889,1.222818,1.421634,1.505825,1.333225,1.289223,1.770521,2.145683
1.152484,1.420139,1.558998,1.430806,1.161012,1.012067,1.150357,1.291036,1.284343,1.082876,0.815581,0.806155,0.942365,0.899042,0.762608,0.832697,1.194061,1.265962,1.030016,0.925537,0.989444,1.095418,1.181153,1.233841,1.184588,1.164746,1.554575,1.843429
0.777496,0.867168,0.980255,0.923389,0.725899,0.679488,0.823924,0.970839,1.031163,0.935787,0.681366,0.558784,0.643138,0.663002,0.6019,0.645274,0.818766,0.874394,0.756136,0.661978,0.723707,0.805841,0.811655,0.826609,0.917423,0.97827,1.148271,1.246892
0.488345,0.532244,0.63007,0.601873,0.448745,0.44743,0.563778,0.669074,0.748432,0.791017,0.619434,0.434224,0.483087,0.51866,0.482758,0.511286,0.542768,0.535235,0.530326,0.491775,0.501116,0.535948,0.528433,0.608526,0.76773,0.806065,0.781756,0.762129
0.391415,0.418076,0.519531,0.566625,0.451461,0.396596,0.47927,0.56758,0.6287,0.691441,0.576,0.408907,0.422028,0.45337,0.460964,0.506126,0.506497,0.437624,0.437883,0.423799,0.411065,0.440204,0.436512,0.587818,0.720206,0.660393,0.691379,0.708228
0.430441,0.418306,0.514881,0.602666,0.52208,0.447669,0.535448,0.649731,0.66838,0.693643,0.606896,0.455009,0.430425,0.442664,0.503508,0.552181,0.510977,0.438669,0.466083,0.443813,0.395573,0.445547,0.45313,0.598076,0.706446,0.63909,0.768789,0.837592
0.494754,0.43146,0.529812,0.642883,0.604751,0.545567,0.647388,0.78076,0.774946,0.806228,0.719042,0.535175,0.473733,0.46113,0.541692,0.619489,0.581953,0.538373,0.598284,0.571086,0.484345,0.498282,0.526002,0.660631,0.767578,0.766356,0.884361,0.976541
0.549652,0.462483,0.572504,0.69611,0.710637,0.666762,0.768178,0.951885,0.953394,1.003497,0.915184,0.638552,0.492543,0.462929,0.525953,0.651943,0.721202,0.739086,0.779784,0.729457,0.64398,0.643753,0.687987,0.778224,0.821272,0.87012,0.921712,0.994068
0.573927,0.472454,0.573307,0.701839,0.760191,0.728731,0.792895,1.035576,1.110687,1.190881,1.126622,0.721832,0.433195,0.425029,0.503297,0.696616,0.88633,0.927656,0.902631,0.812866,0.758205,0.764397,0.805205,0.804393,0.768256,0.930105,0.9568,0.897396
0.509704,0.430933,0.546898,0.68593,0.69896,0.640536,0.65939,0.930767,1.167135,1.363435,1.347611,0.812029,0.350942,0.35556,0.507879,0.763633,0.974806,0.968305,0.894752,0.78793,0.740419,0.781054,0.810709,0.704286,0.638355,0.916538,0.962561,0.735012
0.411301,0.361357,0.472818,0.632783,0.571164,0.462075,0.502653,0.72648,1.0688,1.388906,1.41393,0.860321,0.344285,0.326093,0.526018,0.791355,0.908172,0.846016,0.746911,0.630994,0.584307,0.708215,0.74673,0.605531,0.520999,0.764269,0.84495,0.600494
0.390746,0.311389,0.355108,0.529979,0.472885,0.336921,0.398758,0.555645,0.865986,1.178668,1.219584,0.80525,0.401488,0.3613,0.539011,0.703372,0.686559,0.637591,0.559002,0.449081,0.444072,0.631204,0.613886,0.520567,0.451974,0.523653,0.595968,0.503379
0.350547,0.239745,0.239872,0.40278,0.382849,0.252257,0.31873,0.45214,0.655032,0.890101,0.869356,0.614027,0.40992,0.377721,0.524777,0.547243,0.427366,0.434566,0.436386,0.367984,0.420891,0.567426,0.454406,0.402346,0.398308,0.333494,0.371605,0.425578
0.340993,0.196994,0.179612,0.315386,0.293819,0.194876,0.252252,0.328446,0.417724,0.569525,0.514745,0.371627,0.3275,0.316927,0.432966,0.421274,0.300518,0.328234,0.378553,0.365123,0.41287,0.471344,0.339183,0.298572,0.340382,0.253225,0.228138,0.315051
0.345592,0.215362,0.165672,0.250348,0.220896,0.160904,0.229338,0.24467,0.220169,0.286465,0.271292,0.197553,0.19766,0.20139,0.291651,0.308429,0.23247,0.27822,0.324677,0.319269,0.331508,0.317048,0.225276,0.203302,0.251581,0.217381,0.168757,0.224523
0.293286,0.21525,0.143383,0.167997,0.141038,0.120881,0.1928,0.196632,0.144975,0.153393,0.156387,0.1372,0.124127,0.124156,0.189596,0.207018,0.189114,0.224745,0.235273,0.220526,0.20539,0.161978,0.135841,0.154636,0.17543,0.15582,0.112389,0.144283
0.19472,0.175485,0.120965,0.105622,0.077414,0.078836,0.132291,0.137585,0.121083,0.133976,0.127754,0.126718,0.117908,0.118978,0.141396,0.146657,0.159362,0.167657,0.150896,0.139302,0.118712,0.074653,0.09739,0.151164,0.145386,0.092746,0.060805,0.076838
0.106156,0.11432,0.089154,0.065362,0.0466,0.05861,0.082437,0.090854,0.104119,0.114923,0.119287,0.115761,0.102355,0.110146,0.128192,0.126068,0.12491,0.121027,0.111489,0.10935,0.096649,0.061153,0.090118,0.141043,0.120013,0.063756,0.042491,0.045584
0.06871,0.065783,0.053764,0.042085,0.039657,0.048387,0.065251,0.075711,0.092028,0.094611,0.105602,0.090536,0.069468,0.083615,0.106037,0.107454,0.092181,0.080039,0.092091,0.093001,0.073938,0.050705,0.076258,0.108971,0.09541,0.05903,0.039976,0.043799
0.05849,0.053991,0.04021,0.03849,0.041109,0.037918,0.048065,0.056752,0.075867,0.089616,0.085401,0.061266,0.038294,0.057615,0.087506,0.104517,0.084287,0.060071,0.078652,0.071766,0.056452,0.051313,0.062264,0.077545,0.07734,0.058407,0.045836,0.050652
