1.3e-05,9e-06,4e-06,1e-06,1.3e-05,4e-06,7e-06,1.4e-05,2.1e-05,0,6e-06,4.7e-05,8e-06,2.2e-05,1.9e-05,5e-06,7e-06,7e-06,3.3e-05,1.6e-05,2e-05,1e-06,2e-06,2.2e-05,8e-06,4.1e-05,0,1.8e-05,8e-06,1.5e-05,2e-05,1e-05,1.2e-05,5e-06,5.9e-05,3.9e-05,1.6e-05,3.1e-05,4.2e-05,6.1e-05,3e-05,7.1e-05,1.7e-05,1e-05,0,3e-05,2.4e-05,3e-06,3e-06,4e-06,2.6e-05,8.4e-05,3.8e-05,5.9e-05,7.4e-05,2.9e-05,3.3e-05,7.9e-05,0.00011,3e-05,1.7e-05,8.4e-05,2.9e-05,4.7e-05,5e-06,3.6e-05,7.2e-05,1.4e-05,5.6e-05,3.7e-05,4.2e-05,6.4e-05,1.2e-05,5.4e-05,1.9e-05,1e-05,8e-06,1e-06,5.6e-05,4.4e-05,7.9e-05,8.7e-05,0.000116,0,4e-05,1e-06,8e-06,2.2e-05,2e-06,6e-06,1.2e-05,9.6e-05,3.4e-05,3.7e-05,3.3e-05,1.1e-05,5.4e-05,2.3e-05,4.9e-05,6.5e-05,4e-06,1.9e-05,2.6e-05,3.5e-05,0.000165,4e-06,6.5e-05,3e-06,2e-06,1e-06,5.5e-05,0.000101,0.000117,2.3e-05,1.4e-05,1.5e-05,5.4e-05,2.6e-05,3.5e-05,8e-06,0.000105
1.7e-05,3.4e-05,2.9e-05,1.9e-05,7.3e-05,1.7e-05,8e-06,2.1e-05,3.7e-05,1.9e-05,1.8e-05,0.000107,5.9e-05,5.4e-05,5.9e-05,2.1e-05,2.7e-05,1.4e-05,6.2e-05,7.2e-05,5.4e-05,2e-05,1.7e-05,5.5e-05,3e-06,7.4e-05,3e-05,1.9e-05,6.4e-05,3.6e-05,3.8e-05,1.4e-05,3.6e-05,2.9e-05,0.000121,8.7e-05,4.5e-05,5.4e-05,0.00011,0.000104,6.7e-05,0.000169,5.3e-05,3e-05,1.5e-05,7.7e-05,3.3e-05,1.9e-05,5e-06,7e-06,9.8e-05,0.000159,0.000126,0.000106,0.000155,6.6e-05,8.3e-05,0.000133,0.000203,6.1e-05,4.2e-05,0.000166,7.9e-05,0.000118,2.5e-05,8.1e-05,0.000147,1.1e-05,0.000107,5.8e-05,6.4e-05,0.000135,3.2e-05,9.6e-05,3.4e-05,4.7e-05,1.4e-05,9e-06,0.000149,0.000143,0.000183,0.000178,0.000247,2.3e-05,8.2e-05,8e-06,3.3e-05,4.8e-05,1.4e-05,1.7e-05,2.9e-05,0.000191,8.6e-05,7.3e-05,8.7e-05,4.7e-05,0.00012,3.5e-05,9.4e-05,0.000154,2.9e-05,5.5e-05,7.5e-05,8.4e-05,0.000324,1.6e-05,0.000139,2.6e-05,3.6e-05,1.7e-05,8.1e-05,0.000209,0.000215,4.2e-05,7.1e-05,2.5e-05,0.000117,7.9e-05,7.5e-05,3.3e-05,0.000199
6.2e-05,3.8e-05,4.7e-05,6.3e-05,6.5e-05,0.000107,0.000101,5.8e-05,8.6e-05,6.8e-05,1.2e-05,0.000122,7.7e-05,1e-04,6.8e-05,1e-04,4.7e-05,5.6e-05,1.8e-05,0.000133,0.00013,0.000117,7.2e-05,0.000159,0.000107,8e-06,0.00013,4.8e-05,7.9e-05,5.9e-05,2.5e-05,3e-05,5e-05,1.9e-05,0.000158,0.000109,0.000144,0.000111,0.000124,0.00012,0.000108,0.000246,1.4e-05,0.000111,8.3e-05,0.000111,0.000133,6.8e-05,7e-06,5.5e-05,6.3e-05,0.000107,7.3e-05,0.000184,0.000157,4.6e-05,7.9e-05,0.000122,0.000252,5.9e-05,0.000101,0.000128,0.000153,0.000102,7.4e-05,0.000106,0.000169,3.3e-05,0.000152,7.7e-05,0.000138,0.000183,8.7e-05,0.000116,8.7e-05,4.3e-05,4.2e-05,4.6e-05,0.000146,8.6e-05,1e-04,0.00016,0.00028,6.4e-05,6.9e-05,7.1e-05,6.7e-05,7.8e-05,2.9e-05,6.3e-05,7.3e-05,0.000193,9.5e-05,8.6e-05,6.3e-05,4.9e-05,0.000109,0.000104,0.000101,0.000122,7.4e-05,9.6e-05,4.3e-05,0.000153,0.000343,1e-05,0.000143,6.2e-05,2.9e-05,8.7e-05,0.000103,0.000187,0.000271,6.7e-05,0.000123,8.9e-05,9.3e-05,8.8e-05,0.000118,6.1e-05,0.000209
4.4e-05,4.7e-05,7e-05,7e-05,7.2e-05,8.5e-05,8.3e-05,4.7e-05,3.4e-05,8.2e-05,7.7e-05,7.3e-05,8.2e-05,1.5e-05,3.5e-05,6.6e-05,1.7e-05,0.000101,9.1e-05,0.000105,3.9e-05,4.5e-05,2.7e-05,0.000112,0.00011,7.8e-05,0.000155,6.6e-05,7e-05,7e-06,5.5e-05,4.9e-05,3.2e-05,6.3e-05,0.00021,4.6e-05,8.6e-05,8.9e-05,9.2e-05,0.000117,0.000188,0.000191,7.7e-05,8.6e-05,2.4e-05,0.000149,4.7e-05,5.9e-05,2.6e-05,0.000201,0.000225,0.00014,1.6e-05,0.000153,0.000205,0.000129,6.9e-05,0.00017,0.000396,0.000159,2.5e-05,0.000131,0.000126,0.000267,6.1e-05,0.000124,0.000222,7e-05,0.000189,8.9e-05,0.000123,0.000238,8.4e-05,0.000203,9.2e-05,0.000103,4.6e-05,9.9e-05,0.000137,0.000153,0.000159,0.000205,0.000232,0.000105,0.000135,1.3e-05,3e-05,0.000116,0.000153,3.9e-05,0.000163,0.000207,7.5e-05,5.5e-05,0.000136,5.6e-05,6.9e-05,9.2e-05,5.4e-05,9.1e-05,0.000132,0.000121,0.000106,3.4e-05,0.000349,7.7e-05,0.000214,8.1e-05,8.8e-05,1e-04,0.000125,0.000231,0.000274,9.5e-05,9.1e-05,0.000109,1e-04,9e-05,0.000188,0.000117,0.000277
6.1e-05,4e-05,6.4e-05,4.3e-05,4.3e-05,7.5e-05,5.3e-05,4.7e-05,9.9e-05,1e-04,1e-04,4.4e-05,4e-05,9.5e-05,0.000127,8.8e-05,0.000104,7.8e-05,0.000103,8.7e-05,0.000133,4.4e-05,3.9e-05,2.1e-05,7.9e-05,6.7e-05,0.00014,4.9e-05,0.000143,8e-05,4.5e-05,0.000137,2.8e-05,9e-06,0.000183,8.2e-05,0.000234,0.000143,7.9e-05,0.000201,0.000207,0.00031,9.2e-05,0.000175,5.5e-05,0.000187,0.000141,0.000193,9.5e-05,0.000353,0.000252,6.6e-05,0.000129,0.000369,0.000451,0.000243,0.000195,0.00023,0.00045,0.000204,0.00029,0.000248,0.000257,0.000392,0.000412,0.000353,0.000132,0.000205,0.000217,2.7e-05,0.000125,0.000297,0.000126,0.000241,0.000137,0.000111,0.000169,2e-05,0.00012,0.000176,0.000172,0.000471,0.000383,0.000126,0.000156,0.000163,8.2e-05,0.000254,0.000207,0.00023,0.000279,0.000235,6.4e-05,3.3e-05,0.000157,0.000126,0.000276,8.7e-05,6.4e-05,0.000159,0.000143,0.000163,0.000198,0.000134,0.000524,6e-05,0.000291,7.5e-05,0.000118,0.000197,0.000204,0.000365,0.000351,0.00016,0.00028,0.000143,0.000118,0.00017,0.000176,8.8e-05,0.000468
9.8e-05,3.8e-05,5.6e-05,4.4e-05,7.4e-05,7.7e-05,0.000137,7.7e-05,0.000172,0.000127,8.7e-05,0.000109,5.1e-05,0.000103,0.000144,0.000104,5.9e-05,9.3e-05,0.000121,0.000172,0.000196,0.000134,0.00016,0.000216,3.8e-05,5.8e-05,0.000348,0.000354,0.000213,0.000147,0.000165,0.000258,0.00017,0.000178,0.000183,0.000329,0.000162,0.000123,6.3e-05,0.00015,6e-05,0.000373,5.8e-05,0.000319,0.00026,0.000251,0.000225,0.000411,0.00017,0.000302,0.000612,0.000142,0.00041,0.000111,0.000394,6.5e-05,0.000321,0.00035,0.000103,0.000381,0.000697,0.000637,0.00025,0.000132,0.000213,0.000142,0.000279,0.000432,0.000109,0.000165,0.000449,0.000245,0.000166,0.000229,0.000194,8.1e-05,5.2e-05,0.000452,0.000145,0.000291,0.000257,0.000348,0.000485,0.000129,9.6e-05,0.000253,0.000138,0.000347,0.000248,0.000104,0.000463,0.000516,0.000421,0.000285,0.000269,2.3e-05,0.000418,0.000188,0.000234,0.000343,0.000414,0.000278,0.000127,0.000264,0.000803,0.000182,0.000471,0.000112,0.000387,0.00011,0.000465,0.000336,0.000573,0.000253,0.00045,0.000237,0.000286,0.000221,8.3e-05,0.000353,0.000395
1.7e-05,1.4e-05,6.8e-05,2.8e-05,0.000116,0.000124,0.000108,0.000107,0.000162,0.000128,0.00012,6.6e-05,0.000222,4.3e-05,9.3e-05,4.7e-05,6.7e-05,2e-04,0.000183,0.00025,5.5e-05,3.7e-05,0.000204,0.000452,0.000297,0.00016,0.000518,0.000597,0.000361,0.000568,0.000293,0.000323,0.000238,0.000482,0.00041,0.000601,0.000412,0.000662,0.000548,0.000251,0.000418,0.00066,0.000455,0.000212,7e-05,5.3e-05,0.000579,0.00056,0.000265,0.000334,0.00039,0.000898,0.00047,0.000292,0.000728,0.000555,0.000864,0.000426,0.000638,0.000409,0.001217,0.000642,0.00059,0.000273,0.000462,0.000164,0.000136,0.000511,0.000582,0.000283,0.000685,0.000806,0.000328,0.000799,0.000582,0.000331,0.00044,0.000602,0.000551,0.000418,0.000988,0.000741,0.000735,0.000958,0.00076,0.000316,0.00026,0.000134,0.000397,0.000385,0.000733,0.001248,0.000637,0.000371,0.000361,0.000513,0.000602,0.000224,0.000665,0.000491,0.000999,0.001203,0.000497,0.000474,0.000773,0.000559,0.000785,0.000357,0.000447,0.000836,0.000767,0.00116,0.000355,0.000121,0.000761,2e-04,0.000468,3.7e-05,0.000148,0.000575,0.000507
3.9e-05,9e-06,1e-04,0.000128,0.000137,9.5e-05,0.000158,0.000169,0.00025,5.2e-05,8.7e-05,0.000126,0.000318,0.000433,0.000238,0.000171,0.000103,0.000326,0.000148,0.000226,0.00023,0.000306,8.9e-05,0.000244,8.3e-05,0.000254,0.000699,3.6e-05,0.000285,0.000701,0.000432,0.000188,0.000206,0.000568,0.000334,0.000242,0.000509,0.000868,0.000562,0.000301,5e-04,0.001158,0.001073,0.000638,0.000232,4.1e-05,0.000878,0.000973,0.000743,0.00054,0.000461,0.001244,0.001691,0.000971,0.000641,0.001005,0.000578,0.000893,0.000995,0.000977,0.001237,0.000934,0.000388,0.000411,0.000901,0.000591,0.000641,0.000554,0.00035,0.000852,0.001091,0.000646,0.001423,0.001424,0.000861,0.000389,0.000844,0.001068,0.00052,0.000407,0.000794,0.001141,0.00062,0.001194,0.000432,0.000553,0.000414,0.000153,0.000213,0.000228,0.001312,0.000663,0.001767,0.001006,0.000671,0.000138,0.000549,0.000574,0.000894,0.000766,0.000444,0.000926,0.001107,0.00046,0.001544,0.001613,0.000866,0.001044,0.000703,0.000878,0.000191,0.000684,0.001914,0.001133,0.000672,0.001102,0.000509,0.000634,0.000454,0.000499,0.000555
4.7e-05,6.9e-05,9.1e-05,7.8e-05,0.000106,4.4e-05,0.000117,7.1e-05,6e-05,0.000117,4.3e-05,0.000139,0.000141,0.00022,0.000141,3.9e-05,9.2e-05,0.000345,0.000362,6.8e-05,0.000117,0.000307,0.000378,0.000326,0.000258,0.000381,0.000252,0.00054,0.000588,0.000471,0.000343,0.000265,0.000138,0.000378,0.000474,0.000357,0.000566,0.000301,0.000894,0.000997,0.000533,0.00065,0.000625,0.000656,0.000583,0.000284,0.000954,0.00139,0.001058,0.00112,0.001087,0.00099,0.001429,0.001182,0.000701,0.000437,0.001081,0.000657,0.000289,0.000673,0.001135,0.000448,0.000895,0.00052,0.000607,0.000768,0.000774,0.001094,0.000645,0.001292,0.000811,0.001228,0.002112,0.000519,0.000487,0.000169,0.000963,0.001008,0.000728,0.000526,0.000974,0.002009,0.001702,0.001978,0.001292,0.00091,0.000567,0.000315,6.6e-05,0.000301,0.001558,0.001445,0.001897,0.00128,0.000733,0.000454,0.000102,0.000429,0.000583,0.000595,0.000543,0.000278,0.001171,0.00123,0.001532,0.001289,0.001624,0.000892,0.000506,0.000886,0.00068,0.000206,0.001702,0.001365,0.001723,0.001441,0.00099,0.00075,0.000564,0.000742,0.000252
3.5e-05,6.8e-05,0.00014,0.000176,0.000196,0.000149,0.000116,0.00012,4.5e-05,8e-05,0.000151,0.000118,5.5e-05,0.000142,0.00011,5.5e-05,9.5e-05,0.000168,4.5e-05,9.5e-05,0.000117,0.000216,9.5e-05,0.000127,0.000252,0.000367,0.000282,0.000522,0.000563,0.00082,0.000846,0.000357,0.000271,0.000277,0.000326,0.000299,0.000517,0.000589,0.00047,0.000173,0.000324,0.000208,0.000324,0.000682,0.000608,0.000409,0.000734,0.000379,0.000238,0.000441,0.000411,0.000621,0.000541,0.000309,0.00038,0.000693,0.000618,0.001043,0.000687,0.000548,0.000386,0.000776,0.001162,0.000577,0.000696,0.000581,0.001016,0.001135,0.000934,0.000665,0.000432,0.001254,0.001567,0.001412,0.000346,0.000436,0.001246,0.000674,0.000583,0.000847,0.000668,0.001167,0.000436,0.001234,0.000496,0.000665,0.000522,0.000692,0.000512,0.000254,0.001105,0.00119,7.9e-05,0.00041,0.000853,0.000339,7.1e-05,0.000184,0.000331,0.000365,0.000381,0.000189,0.001066,0.000759,0.00095,0.000565,0.001058,0.000645,0.000474,0.000308,0.000397,0.000219,0.001009,0.000582,0.000976,0.000213,0.000129,0.000591,0.000218,0.000486,0.000694
3.5e-05,2.7e-05,0.000121,0.000151,7e-06,7.3e-05,3.7e-05,4e-05,4.4e-05,6.6e-05,0.000144,0.000108,0.000117,4.5e-05,8.2e-05,9.6e-05,2.8e-05,0.000103,0.000118,0.000116,7.6e-05,0.000197,0.000142,5.9e-05,0.000144,0.000237,0.00019,0.00016,0.000207,0.000144,3e-04,0.000204,0.000182,0.000264,0.000189,0.000279,9.6e-05,9.5e-05,8.7e-05,0.000181,0.000284,0.000277,0.000161,0.000199,0.000229,0.000227,0.000188,0.000476,0.000193,0.000345,0.000157,0.000333,0.000266,0.000379,0.000367,0.000116,0.000141,0.000514,0.000443,0.000204,0.000106,0.000602,0.000616,0.000457,0.000171,0.000198,0.000411,0.000193,9.8e-05,0.000427,0.000188,0.000787,0.00022,0.000239,0.000401,0.000346,0.000734,0.000369,0.000199,0.000394,0.000294,0.000594,0.000679,0.000561,0.000275,0.000418,0.000658,0.00047,0.000212,0.000119,0.000635,0.000235,0.000115,0.000197,0.000508,0.000469,0.000223,0.000122,7.9e-05,0.000367,0.000308,9.8e-05,0.000498,5.3e-05,0.000541,0.000583,0.000638,0.000538,0.000391,0.000386,0.000264,0.000586,0.000633,0.000541,0.000205,0.000185,0.000176,8.2e-05,4.4e-05,0.000422,0.000116
2e-06,2.7e-05,5e-05,2.2e-05,4.5e-05,1.4e-05,8e-06,2.2e-05,3.2e-05,3.8e-05,6.5e-05,7.2e-05,4.6e-05,4.6e-05,4.5e-05,5e-05,2.9e-05,2.8e-05,1.6e-05,2.7e-05,3.5e-05,4e-05,5.8e-05,8e-05,5.6e-05,6.9e-05,0.000137,6.3e-05,0.000161,0.000148,0.00012,2.7e-05,3.8e-05,0.000135,0.000177,6.8e-05,1.5e-05,0.000111,6.9e-05,0.000191,0.000151,0.000118,0.000183,0.000253,7.7e-05,0.000141,8e-05,8.7e-05,4.9e-05,0.000258,0.000158,0.000223,6.3e-05,0.000118,0.000331,0.000232,3.7e-05,0.000133,0.000143,5.1e-05,1.1e-05,0.000406,8.6e-05,5.5e-05,0.000225,0.000116,0.000183,0.000226,0.000222,9.2e-05,5.3e-05,0.00042,0.000203,5.8e-05,0.000181,0.000112,0.000353,0.000115,0.000149,9.5e-05,0.000154,0.000203,0.000579,0.000144,8.7e-05,0.000214,0.000125,0.000194,0.000119,0.000115,0.000235,0.000289,9e-05,0.000123,0.000125,9.8e-05,0.00015,0.000135,0.000167,0.000172,0.000165,0.000157,0.00028,2.6e-05,0.000278,0.000301,0.000215,0.000296,8.1e-05,0.000151,0.000138,0.000267,0.000431,0.000231,0.000251,5.3e-05,0.000162,0.00016,0.000162,0.00016,0.000345
1.6e-05,9e-06,1.2e-05,1.6e-05,3.3e-05,1.3e-05,9e-06,1e-05,2.9e-05,1e-05,5.7e-05,4.5e-05,6.5e-05,2.2e-05,3.2e-05,6.7e-05,2.2e-05,1.2e-05,3.9e-05,1.2e-05,4.5e-05,3.8e-05,6.3e-05,1.4e-05,5e-05,1.9e-05,7.4e-05,8.6e-05,0.000102,4.9e-05,5.3e-05,2.9e-05,3.4e-05,7.4e-05,0.000163,7.1e-05,2.5e-05,9.5e-05,1.8e-05,0.000151,0.000128,0.000144,0.000118,0.000179,7.1e-05,0.000107,0.000116,9.5e-05,6.1e-05,0.000243,0.000118,0.000161,9.3e-05,0.000108,0.000198,8.6e-05,0.000107,0.000197,0.000117,8.5e-05,7e-06,0.000233,2.4e-05,1.7e-05,0.000131,3.4e-05,0.000122,0.000112,0.000169,4.1e-05,7.3e-05,0.000254,7.3e-05,1.5e-05,0.000179,0.000117,0.000168,7.2e-05,0.000168,0.000253,0.000152,0.00022,0.000333,8.6e-05,7.4e-05,5.5e-05,0.000123,0.000115,0.000235,0.000115,0.000232,0.000165,7.9e-05,4.9e-05,8.4e-05,6e-05,6.8e-05,2.3e-05,0.000136,9.8e-05,0.000168,0.000209,0.000257,1e-05,0.000251,0.000177,0.000231,0.000145,0.000107,3.1e-05,8.9e-05,0.000111,0.000285,0.000132,0.000134,9.7e-05,0.000102,0.00018,0.000115,1.1e-05,0.00025
5e-05,3.7e-05,1.5e-05,3.1e-05,1.9e-05,6.7e-05,3.4e-05,2.1e-05,2.2e-05,2.3e-05,4.8e-05,6.7e-05,6.2e-05,3.3e-05,4e-05,2.6e-05,5.4e-05,5.6e-05,0.000105,4.8e-05,3.2e-05,2.5e-05,1.3e-05,6.9e-05,9.9e-05,0.000121,6.7e-05,0.000124,3.8e-05,3.2e-05,9.9e-05,0.000105,8.5e-05,0.000165,0.000251,7e-05,5e-05,6.5e-05,0.000127,9.5e-05,8.5e-05,5.5e-05,0.000134,0.000248,0.000117,6.2e-05,0.000127,9.1e-05,3.9e-05,0.00021,0.000202,0.000115,3.4e-05,5.1e-05,0.000171,9.2e-05,0.000139,0.000319,0.000218,0.000156,0.000116,8.7e-05,7.3e-05,0.00011,0.000171,0.000134,5.6e-05,0.000104,0.000107,0.000181,7.8e-05,0.000359,0.000222,0.000114,0.000195,3.2e-05,9.2e-05,0.000265,0.000115,0.000295,0.000245,0.000204,0.000295,5.4e-05,0.000162,0.000165,0.000105,5.9e-05,0.000339,0.000326,0.000391,0.000332,0.000209,0.000182,0.000135,4.3e-05,9e-05,0.000154,9.5e-05,0.000142,0.000118,6.9e-05,0.000164,1e-04,0.000301,0.000387,7.4e-05,9.6e-05,0.000108,0.000249,0.000295,8.4e-05,8.7e-05,6.8e-05,0.000117,9.2e-05,0.00019,0.000293,7.6e-05,1.3e-05,9.6e-05
5.3e-05,2.1e-05,3.4e-05,2.1e-05,3.5e-05,9.6e-05,5.8e-05,3.4e-05,5e-05,2.6e-05,3e-05,5.3e-05,3.3e-05,6e-05,5.7e-05,0.000112,4.8e-05,1e-05,0.000125,6.2e-05,2.9e-05,9e-06,0.000106,0.000136,0.000101,3.2e-05,9.5e-05,5.8e-05,3.2e-05,8.1e-05,0.000116,0.00012,4.2e-05,9.8e-05,0.000196,0.00018,0.000141,9.8e-05,0.000264,0.000294,0.000171,0.000188,0.000197,9.8e-05,0.000108,0.00014,0.000185,7.6e-05,4.7e-05,0.000223,0.000117,0.000363,6.9e-05,7.2e-05,2e-04,7.7e-05,0.000229,0.000159,0.000106,0.000106,1e-04,0.000214,3.6e-05,0.000109,0.000125,0.000211,0.00013,0.000181,0.000332,0.000381,0.000286,7e-06,0.000226,9.8e-05,0.000198,0.000108,0.000166,0.000183,0.000168,0.000177,0.000537,0.000514,0.000382,9.5e-05,0.000174,0.000119,0.00015,0.000109,0.000394,0.000134,0.000146,0.000216,0.000122,0.000245,0.000376,0.000306,0.00023,0.000116,0.000133,0.000199,0.000125,0.00013,9.1e-05,0.000113,0.000387,0.000174,0.000291,2.5e-05,6.6e-05,0.000232,0.000299,0.00031,8.3e-05,0.000141,0.000151,0.000347,9.4e-05,0.00021,0.000233,7.2e-05,9.4e-05
5.2e-05,4.7e-05,3.5e-05,2.5e-05,3.4e-05,5e-05,5.2e-05,1.8e-05,5.1e-05,2.4e-05,1.3e-05,7.6e-05,2.8e-05,2.7e-05,3.2e-05,8.9e-05,0.000122,5.7e-05,9.5e-05,0.000166,0.000101,6.3e-05,0.000156,1.1e-05,3.4e-05,9.1e-05,0.000176,3.5e-05,8.2e-05,5.9e-05,0.000111,4.5e-05,5.4e-05,0.00014,0.000239,0.000188,9.4e-05,0.000119,0.000271,4.4e-05,0.00013,3.5e-05,9.5e-05,0.000186,0.000186,8.5e-05,0.000265,0.000398,0.000351,0.000353,0.000161,0.000351,0.000315,8.5e-05,8.6e-05,0.000241,0.000171,0.000251,0.000304,0.000323,0.000223,0.000183,0.000183,0.000183,9.7e-05,3e-05,6.7e-05,0.00021,0.000231,6.8e-05,6e-05,7.2e-05,0.000378,0.00046,0.00047,0.000179,0.00026,0.000276,0.000228,2.4e-05,0.000343,0.000266,0.000219,0.000201,0.000228,0.000205,0.000283,0.000273,0.000391,0.000293,0.000172,0.000163,0.00036,0.000231,0.000239,7.2e-05,0.000197,0.000258,0.000293,9.2e-05,0.000123,0.000252,9.4e-05,0.000101,0.000418,0.000359,0.000369,0.000356,0.000372,0.000207,0.000205,5e-05,0.000195,0.000314,0.000266,0.000169,0.00032,4.2e-05,0.000165,0.000266,0.000209
4.2e-05,2.5e-05,3.4e-05,3.8e-05,2.9e-05,4.1e-05,3.7e-05,1.5e-05,4.1e-05,6.2e-05,6.9e-05,6e-05,8.9e-05,5.4e-05,3.4e-05,6.9e-05,0.000124,0.000102,0.00011,0.000109,8.8e-05,3.7e-05,9.2e-05,0.000107,6.2e-05,0.000128,7.6e-05,0.000106,7.5e-05,2.7e-05,4e-05,5.5e-05,0.000127,0.000157,6e-05,8.6e-05,8.8e-05,0.000133,0.000253,0.00023,0.000207,0.000153,9.1e-05,7.1e-05,9.3e-05,0.000112,0.00019,0.000246,9.7e-05,8.7e-05,0.000241,0.000178,0.000108,0.000106,7e-05,0.000166,0.000249,0.000271,0.000178,0.000292,0.000263,0.000156,0.000245,0.000126,0.000178,0.000212,0.000172,0.000255,0.00021,0.000219,0.000164,0.000149,0.000187,0.000278,0.000279,0.000252,0.000256,0.000288,0.000115,0.000265,7.9e-05,0.000261,0.000204,0.000176,0.00021,0.000117,0.00014,0.000232,0.00044,0.000452,0.000273,0.000146,0.000318,0.000157,0.000159,0.000136,0.000183,0.000248,0.000281,0.000361,0.000102,0.000307,0.000296,0.00017,0.000198,0.000167,0.000307,0.000246,9.5e-05,9.7e-05,4.7e-05,0.000191,9.9e-05,0.000172,0.000329,0.000337,0.000262,0.000393,0.000204,8.3e-05,8.6e-05
1.4e-05,3.1e-05,2.2e-05,1.7e-05,6e-06,4e-05,9e-06,1.3e-05,9e-06,2.5e-05,6e-06,3e-05,4.8e-05,2.8e-05,3.5e-05,8.3e-05,5.6e-05,5e-05,8.6e-05,4e-05,3.8e-05,3.9e-05,7.7e-05,3e-05,5.5e-05,6.5e-05,5.7e-05,6.9e-05,8.4e-05,1.4e-05,5.6e-05,0.00011,9.5e-05,9.3e-05,9.7e-05,3.2e-05,5e-05,7e-05,5.8e-05,6.6e-05,0.000144,0.000109,4e-05,0.000104,3.4e-05,8.5e-05,2.9e-05,8.6e-05,3.9e-05,0.000113,0.000172,9.4e-05,7.2e-05,0.000138,2.5e-05,8.5e-05,7.7e-05,0.000105,0.000105,0.000154,5.2e-05,0.000107,7.7e-05,4.5e-05,0.000165,1.8e-05,6.2e-05,0.000181,0.000129,0.000155,1.1e-05,0.000231,1e-04,0.000254,8e-05,0.000113,0.000348,0.000124,6.5e-05,0.00018,9.6e-05,0.00026,0.000166,6.3e-05,0.000132,4.8e-05,0.000142,0.000175,0.000284,0.000152,0.000155,0.000221,0.000236,0.000173,9.5e-05,1.4e-05,2.7e-05,0.000128,9.5e-05,0.000146,0.000214,0.000329,0.000132,9.1e-05,3.1e-05,0.00015,0.000147,4.6e-05,0.000142,0.000194,5.1e-05,0.000116,0.000152,0.00012,0.000112,0.000127,0.000232,0.00015,9.9e-05,2.5e-05,0.000116
1.4e-05,1.2e-05,3.6e-05,9e-06,8e-06,1.3e-05,1.9e-05,2.7e-05,8e-06,5e-06,1.6e-05,1.8e-05,2.5e-05,2.4e-05,3.5e-05,4.2e-05,8.3e-05,5.5e-05,0.000109,0.00014,0.000117,6e-05,5.6e-05,2.8e-05,6e-05,0.000108,9e-05,2.8e-05,4.9e-05,2.4e-05,4.3e-05,0.000112,3e-05,4.2e-05,0.000137,8.5e-05,4e-05,3.2e-05,2.5e-05,3e-05,0.000117,6.8e-05,6e-05,9.6e-05,2.4e-05,8e-05,7.1e-05,0.000171,0.000139,0.000108,0.000161,0.000132,1e-04,0.000109,0.000101,0.000131,9.1e-05,1.5e-05,0.000133,6.3e-05,6.9e-05,5.9e-05,2.2e-05,2.9e-05,0.000142,9.9e-05,6.1e-05,0.000155,0.000113,0.000141,0.000148,0.000344,5.4e-05,6.6e-05,7.7e-05,6.9e-05,0.000123,0.000188,0.000255,0.000125,5.5e-05,0.000246,0.000149,0.000141,1.9e-05,2.8e-05,0.000149,3e-04,0.000324,0.000162,0.000184,9.7e-05,0.000108,0.00011,0.000235,0.000143,4.1e-05,9.6e-05,5e-05,0.000153,0.00014,7.4e-05,6.6e-05,0.000134,7.5e-05,0.000119,0.000241,0.00013,8.6e-05,0.000126,5.8e-05,7.1e-05,8.6e-05,0.000129,0.000288,0.000112,5.6e-05,0.000165,0.000127,0.00014,5.2e-05
3.3e-05,3e-05,3.9e-05,1.5e-05,1.4e-05,2.7e-05,1.1e-05,8e-06,1.8e-05,4e-05,2.8e-05,1.1e-05,3.2e-05,9e-06,3.8e-05,2.4e-05,3e-05,3.1e-05,2.4e-05,6.1e-05,5.2e-05,1.5e-05,3.2e-05,3.7e-05,1.9e-05,6.8e-05,1.9e-05,4.3e-05,5.2e-05,2.3e-05,4.9e-05,0.000119,4.3e-05,9.8e-05,3.1e-05,2.7e-05,8.1e-05,4e-05,3.7e-05,1e-05,0.000111,0.000138,0.000106,4.8e-05,2.7e-05,6e-05,3.7e-05,0.000154,8.8e-05,6.3e-05,7.9e-05,4.9e-05,6.9e-05,4.4e-05,8.1e-05,0.000103,5.9e-05,2.3e-05,0.000149,9e-05,6.7e-05,4.6e-05,8.4e-05,6.8e-05,8.1e-05,5.9e-05,4.3e-05,9.5e-05,0.000145,2.3e-05,6.5e-05,0.000181,7.7e-05,6.4e-05,0.000123,0.000168,0.000177,0.00013,0.000118,4.1e-05,5.5e-05,0.000122,0.000142,0.000143,6.7e-05,5.8e-05,0.000183,5.9e-05,4e-06,0.000168,0.000115,9.3e-05,0.000155,0.000101,0.000136,3.4e-05,4.9e-05,9.9e-05,3.1e-05,9.6e-05,8.9e-05,2.3e-05,0.00011,4e-05,7.6e-05,4.8e-05,0.000125,4.6e-05,6.2e-05,8e-05,1.3e-05,0.000114,5.2e-05,0.000157,0.000203,5.6e-05,3.1e-05,9.4e-05,4.4e-05,0.000173,0.000221
1.6e-05,1.8e-05,6e-06,1.5e-05,3e-05,2.8e-05,3.1e-05,2.3e-05,5e-06,4.8e-05,3.6e-05,2.1e-05,6e-06,2.6e-05,4e-05,2.5e-05,2.1e-05,6e-06,2.5e-05,1.9e-05,2.6e-05,2.6e-05,2.1e-05,5.6e-05,5.8e-05,7.6e-05,4.7e-05,2.6e-05,3.4e-05,7.9e-05,5.5e-05,3.4e-05,2.7e-05,4.4e-05,5.4e-05,5e-06,6.6e-05,5.6e-05,2.2e-05,2.6e-05,5.2e-05,4.7e-05,2.5e-05,4.1e-05,1.9e-05,2.6e-05,4.2e-05,6.4e-05,9.8e-05,5.9e-05,4.9e-05,8.4e-05,5.4e-05,3.8e-05,7.2e-05,8.9e-05,0.000112,2.4e-05,8.1e-05,0.000115,6e-05,3.8e-05,6.3e-05,1.6e-05,0.00012,5.8e-05,8.1e-05,7.3e-05,4.3e-05,9e-06,5e-05,0.000122,2.6e-05,0.000147,4.7e-05,9.1e-05,0.000112,9.4e-05,9.6e-05,1.5e-05,7e-05,0.000103,0.000131,9e-05,7.1e-05,4.8e-05,8.2e-05,3.2e-05,9.5e-05,0.000136,0.000121,0.000123,5.1e-05,2e-05,6.9e-05,0.000112,8.7e-05,9.1e-05,4.2e-05,6.3e-05,0.000169,0.000169,7.3e-05,2.7e-05,7.6e-05,7.3e-05,0.000127,0.000141,0.000105,0.000131,5.5e-05,1.8e-05,5.2e-05,0.000156,0.000198,0.000108,6.2e-05,4.8e-05,5.3e-05,8.9e-05,9.5e-05
2.2e-05,1e-06,6e-06,1e-05,1.3e-05,1.9e-05,1.9e-05,3e-06,2.3e-05,2.9e-05,1.2e-05,1.8e-05,2.7e-05,3.3e-05,3.4e-05,1.4e-05,1.9e-05,1.1e-05,3.9e-05,3.9e-05,2.7e-05,1.5e-05,2.7e-05,2.6e-05,5.9e-05,4.3e-05,7.3e-05,3e-05,1.2e-05,4.3e-05,2.5e-05,5.9e-05,6e-05,7e-05,5.5e-05,3.3e-05,2.4e-05,1.8e-05,2.9e-05,3.2e-05,2.6e-05,4e-05,4.9e-05,1.7e-05,2.7e-05,2.1e-05,3.3e-05,0.000124,7.8e-05,7.5e-05,7.5e-05,4.9e-05,5.8e-05,5.8e-05,5e-05,3e-05,6.9e-05,4.4e-05,1.5e-05,9.4e-05,1.6e-05,5.9e-05,3.7e-05,2.9e-05,0.000158,7e-05,3e-05,4.7e-05,7.3e-05,1e-05,3.3e-05,0.000181,4.3e-05,0.000126,3.8e-05,7.4e-05,6.1e-05,9.8e-05,3.5e-05,3e-05,2.2e-05,5.8e-05,0.000145,4.7e-05,5.4e-05,3.2e-05,2.1e-05,7e-05,9.9e-05,0.000126,5.2e-05,8.9e-05,3.8e-05,2.5e-05,7.8e-05,3.5e-05,7.7e-05,1e-05,3.4e-05,1.9e-05,0.000123,9.1e-05,7.8e-05,3e-05,6.8e-05,6.9e-05,5.6e-05,7.1e-05,0.000101,6.9e-05,4e-05,4.5e-05,6.3e-05,9.7e-05,9.4e-05,0.000125,7.6e-05,6.3e-05,5.6e-05,7.6e-05,5.8e-05
5e-06,5e-06,5e-06,3e-06,9e-06,7e-06,6e-06,8e-06,7e-06,5e-06,9e-06,4e-06,1.1e-05,2.1e-05,5e-06,5e-06,1.1e-05,9e-06,8e-06,8e-06,2.2e-05,1.4e-05,1.6e-05,1.8e-05,2.4e-05,3e-05,2.4e-05,2.4e-05,2.4e-05,3.9e-05,1.2e-05,2.9e-05,2.9e-05,1e-05,5e-06,1.4e-05,1.1e-05,3.5e-05,3.9e-05,4.8e-05,3.3e-05,4e-06,4e-05,5.9e-05,2.6e-05,1.6e-05,2.9e-05,4e-05,2.4e-05,3.9e-05,2e-05,3.2e-05,3.7e-05,2.4e-05,2.2e-05,3e-05,6.7e-05,3.1e-05,2.1e-05,2.5e-05,3.6e-05,2.6e-05,9e-06,1.4e-05,8.6e-05,5.6e-05,2.7e-05,3e-06,3.4e-05,1.6e-05,2.3e-05,6.6e-05,2.6e-05,8e-05,1.2e-05,3.2e-05,6.1e-05,1.5e-05,4.5e-05,1.6e-05,1.8e-05,5.2e-05,5.9e-05,7e-06,3.8e-05,2.5e-05,2.1e-05,1.1e-05,2.3e-05,3.2e-05,2.3e-05,3.1e-05,4.1e-05,4.4e-05,5.8e-05,4.6e-05,3.4e-05,6.7e-05,4.5e-05,5.3e-05,7.3e-05,3.8e-05,4.6e-05,1.3e-05,4.4e-05,1.5e-05,6.5e-05,2.6e-05,3.2e-05,5e-05,3.5e-05,3.7e-05,1.9e-05,4.5e-05,4.7e-05,6e-05,2.3e-05,3.1e-05,1.1e-05,5e-05,3.9e-05
5e-06,7e-06,2e-06,1e-06,1.3e-05,3e-06,4e-06,4e-06,1e-05,2e-06,1.1e-05,1.1e-05,1.1e-05,2.3e-05,1.7e-05,1.3e-05,2.4e-05,1.1e-05,8e-06,1.6e-05,1.2e-05,1.1e-05,4e-06,2e-05,1.2e-05,2.6e-05,2.7e-05,2e-05,6e-06,2.6e-05,3e-05,2.3e-05,4.5e-05,2.3e-05,4.3e-05,4.8e-05,1e-05,2.3e-05,3.5e-05,5.6e-05,2.4e-05,4.4e-05,2.1e-05,4.6e-05,2.6e-05,2.2e-05,4.5e-05,4.3e-05,2.6e-05,4.3e-05,5e-05,4.4e-05,6.3e-05,1.5e-05,1.7e-05,5.6e-05,4.2e-05,3e-06,1.5e-05,4e-06,2e-05,6.4e-05,2e-05,2.1e-05,8e-05,1.6e-05,2.4e-05,2.5e-05,4.8e-05,2.9e-05,6.9e-05,8.1e-05,1.7e-05,5.1e-05,7.2e-05,3.6e-05,7.8e-05,2.9e-05,4.9e-05,3.6e-05,6.4e-05,7.6e-05,5.8e-05,2.6e-05,3.6e-05,1.5e-05,6e-06,7e-06,8.8e-05,4.9e-05,5.8e-05,5.4e-05,2.7e-05,2.4e-05,4.8e-05,1.1e-05,3.6e-05,5.5e-05,3.4e-05,3.5e-05,9.2e-05,4.4e-05,4.9e-05,2.5e-05,3.7e-05,1.8e-05,6.2e-05,7e-05,4.3e-05,2.2e-05,3.5e-05,3.6e-05,3.2e-05,4.2e-05,2e-05,3.9e-05,2.4e-05,3.9e-05,4.2e-05,4.9e-05,3.1e-05
1e-06,4e-06,9e-06,1.1e-05,4e-06,7e-06,1.1e-05,6e-06,6e-06,1.4e-05,1.2e-05,1e-05,7e-06,2e-05,9e-06,9e-06,2.4e-05,9e-06,1e-06,2e-05,7e-06,2e-05,1.3e-05,2e-05,2.1e-05,2.2e-05,5e-06,3e-06,1.4e-05,1.5e-05,2.5e-05,3.8e-05,4.4e-05,3.9e-05,3.2e-05,6.5e-05,7.8e-05,4.6e-05,5.8e-05,1.5e-05,1.9e-05,5.2e-05,6.6e-05,3.3e-05,1.5e-05,2.7e-05,2.7e-05,5.5e-05,5.6e-05,2.9e-05,3.8e-05,2e-05,3.4e-05,4.6e-05,1.1e-05,5.2e-05,9.4e-05,5.2e-05,4.2e-05,2.9e-05,1.2e-05,5.7e-05,3.9e-05,3.7e-05,3.5e-05,7.2e-05,5.3e-05,1.7e-05,3.8e-05,1e-05,6.5e-05,5.2e-05,4.8e-05,6.6e-05,9.4e-05,6.6e-05,4.7e-05,3.7e-05,2.9e-05,4.7e-05,3.3e-05,3.8e-05,2.7e-05,3.6e-05,3.9e-05,1.5e-05,3.2e-05,9e-06,9e-05,5.9e-05,8e-06,7.3e-05,1.6e-05,2.6e-05,8e-06,1.9e-05,5e-06,3.8e-05,5.4e-05,3e-05,7.2e-05,6e-05,2.6e-05,2.3e-05,1e-05,4.3e-05,5.7e-05,3e-06,6.3e-05,1.5e-05,3.6e-05,2.3e-05,3.5e-05,3.4e-05,7.3e-05,4.9e-05,8e-06,1.3e-05,3.8e-05,5.7e-05,6.3e-05
3e-06,3e-06,8e-06,5e-06,4e-06,6e-06,4e-06,1e-06,6e-06,6e-06,9e-06,4e-06,1.7e-05,2e-06,1e-05,1.1e-05,1.3e-05,2e-06,6e-06,1.7e-05,1.2e-05,1.3e-05,4e-06,2.6e-05,1.2e-05,1.2e-05,2.2e-05,1.7e-05,8e-06,2.1e-05,1.4e-05,2.3e-05,3.7e-05,2.7e-05,1.9e-05,4.4e-05,4.9e-05,2.3e-05,7e-05,7.1e-05,4.8e-05,1.7e-05,3.2e-05,1.8e-05,1.1e-05,2e-05,3.4e-05,2.5e-05,3.1e-05,1.5e-05,3.8e-05,2.8e-05,3.3e-05,4.7e-05,5.9e-05,2.3e-05,5.1e-05,2.8e-05,6e-06,2e-05,2.9e-05,7.2e-05,5.4e-05,2.7e-05,6.1e-05,2.8e-05,2.5e-05,5.3e-05,5.2e-05,6e-05,0.000103,6.6e-05,4.5e-05,3.9e-05,4.3e-05,8e-06,6.2e-05,3.3e-05,3.6e-05,1.2e-05,1.4e-05,5.9e-05,7.4e-05,3.7e-05,6.5e-05,3.5e-05,5e-05,5.5e-05,9e-06,2.6e-05,3.1e-05,3.3e-05,7.3e-05,6.8e-05,4.8e-05,2.5e-05,2.8e-05,3.4e-05,5e-05,2.4e-05,3.9e-05,7.2e-05,1.6e-05,6e-06,8e-06,4.7e-05,2.9e-05,4.4e-05,4.8e-05,7.4e-05,7.5e-05,9.3e-05,5.8e-05,4.6e-05,6.9e-05,1e-05,1.8e-05,4.5e-05,2e-05,5e-06,5.2e-05
4e-06,4e-06,8e-06,6e-06,3e-06,4e-06,3e-06,4e-06,7e-06,4e-06,4e-06,3e-06,1.9e-05,1.1e-05,1.2e-05,1.2e-05,1.4e-05,1e-05,1.2e-05,5e-06,8e-06,2.1e-05,2.5e-05,2.4e-05,9e-06,1.4e-05,1.7e-05,1.5e-05,1.4e-05,1.6e-05,3e-06,1.8e-05,5.3e-05,7.2e-05,2.4e-05,2.8e-05,1.7e-05,4e-06,5.7e-05,2.9e-05,5.3e-05,2.7e-05,1e-05,3e-05,2e-05,1.9e-05,3.6e-05,2.7e-05,2e-05,3.3e-05,1.6e-05,9e-06,3.9e-05,1.2e-05,6.9e-05,8.9e-05,4.9e-05,4.9e-05,7.4e-05,6e-05,2.5e-05,6.9e-05,3.8e-05,2.4e-05,6.7e-05,1.2e-05,3e-06,4.6e-05,5.9e-05,9.9e-05,1.3e-05,3.7e-05,1.7e-05,2.3e-05,4.1e-05,2.4e-05,9.7e-05,6.8e-05,1.8e-05,3.9e-05,4e-05,7.9e-05,6.8e-05,1.5e-05,7e-05,2e-05,5.7e-05,3.3e-05,4.3e-05,4.1e-05,4.1e-05,5.2e-05,7.2e-05,3.6e-05,7e-06,4e-05,4.6e-05,2.7e-05,9e-06,3.3e-05,5.5e-05,1.9e-05,5.9e-05,1.4e-05,1.5e-05,6e-05,4.9e-05,8.8e-05,7.7e-05,9.6e-05,1.4e-05,4e-05,0.000103,7.1e-05,6.8e-05,3e-05,4e-05,6.4e-05,7.4e-05,6e-05,7.5e-05
1e-06,1e-06,7e-06,5e-06,7e-06,6e-06,6e-06,1.3e-05,1e-05,9e-06,0,7e-06,1.4e-05,4e-06,3e-06,1e-05,9e-06,7e-06,1e-06,5e-06,7e-06,1.9e-05,2.6e-05,2e-05,2.3e-05,3.2e-05,9e-06,2.7e-05,1.6e-05,1.8e-05,5e-06,1.8e-05,4.2e-05,1.8e-05,1.7e-05,1.1e-05,1.2e-05,6e-06,3.5e-05,1.3e-05,3.8e-05,3e-06,1.1e-05,2.2e-05,2.5e-05,3.7e-05,2.4e-05,3.6e-05,2.3e-05,4.6e-05,3.1e-05,1e-05,1.3e-05,4.2e-05,6e-05,8e-06,2.3e-05,5.4e-05,4.2e-05,2e-05,4e-06,4.6e-05,1.9e-05,2.3e-05,1.5e-05,3.2e-05,4.1e-05,1.1e-05,4.1e-05,3e-05,6.1e-05,3.2e-05,3.3e-05,1.8e-05,2.3e-05,1.7e-05,6.9e-05,7e-06,3.9e-05,4e-05,4e-05,5.4e-05,4.2e-05,3.2e-05,6.6e-05,6.6e-05,3.2e-05,3.3e-05,5.1e-05,4.1e-05,1.7e-05,5e-05,2e-05,1.9e-05,1e-05,3.4e-05,2.9e-05,3.5e-05,4.8e-05,4.9e-05,2.9e-05,5.1e-05,4.6e-05,2.3e-05,2.7e-05,5.1e-05,2.6e-05,5.9e-05,5.7e-05,6e-06,2.7e-05,1e-05,5.3e-05,2.7e-05,3.1e-05,2.6e-05,4.2e-05,7e-06,3.7e-05,3.5e-05,4.4e-05
2e-06,2e-06,6e-06,3e-06,1e-06,5e-06,4e-06,1e-05,2e-06,5e-06,8e-06,2e-06,6e-06,6e-06,8e-06,4e-06,1.1e-05,3e-06,2e-06,1.1e-05,6e-06,9e-06,1.7e-05,1.3e-05,1e-05,2.4e-05,9e-06,9e-06,9e-06,1.8e-05,8e-06,1e-05,2.7e-05,2.3e-05,1.4e-05,1.7e-05,1.2e-05,4e-06,2.2e-05,2e-06,2.2e-05,2.2e-05,1e-05,2.5e-05,1.2e-05,2.1e-05,6e-06,2.4e-05,1.7e-05,2.6e-05,7e-06,1.8e-05,1e-05,4e-05,1.1e-05,9e-06,1.1e-05,2.8e-05,3.7e-05,1.4e-05,1e-05,3e-06,2.2e-05,1.7e-05,2.1e-05,1.3e-05,2.5e-05,3.1e-05,1.9e-05,2e-05,1.4e-05,3e-05,1.2e-05,2.3e-05,1.8e-05,5e-06,4e-05,1.8e-05,3.7e-05,1.8e-05,3.2e-05,2.7e-05,4.2e-05,1.3e-05,3.2e-05,2.7e-05,3.9e-05,3.3e-05,2.3e-05,3.6e-05,2.2e-05,5e-06,1.1e-05,1.1e-05,1.4e-05,9e-06,1.6e-05,1.8e-05,4.3e-05,1.7e-05,4e-06,2.4e-05,3.2e-05,7e-06,7e-06,2e-05,3e-06,4.5e-05,2.5e-05,2.8e-05,1.6e-05,2.4e-05,1e-05,3e-06,3.4e-05,3.8e-05,4e-06,7e-06,2.4e-05,1.5e-05,3.8e-05
1e-06,3e-06,3e-06,4e-06,1e-06,6e-06,3e-06,3e-06,3e-06,5e-06,9e-06,8e-06,7e-06,3e-06,1.2e-05,8e-06,7e-06,4e-06,3e-06,1.8e-05,1.1e-05,5e-06,1.3e-05,1.9e-05,9e-06,7e-06,1e-05,6e-06,2e-05,1.5e-05,2e-06,3e-06,1.6e-05,2e-05,1.7e-05,1.7e-05,8e-06,2e-06,1.9e-05,1e-05,1.7e-05,1.1e-05,5e-06,1.9e-05,1e-05,2.2e-05,2e-06,2.6e-05,1.1e-05,1.6e-05,4e-06,3.1e-05,1.9e-05,3.2e-05,2e-05,4e-06,7e-06,1.7e-05,1.7e-05,2e-06,7e-06,6e-06,1.5e-05,2.3e-05,2.5e-05,1.6e-05,5e-06,2.4e-05,1.7e-05,1.6e-05,1.8e-05,3.9e-05,1.3e-05,2.6e-05,1.5e-05,1.3e-05,4.4e-05,2.6e-05,2.6e-05,5e-06,1.4e-05,2.1e-05,3.6e-05,1.7e-05,2e-05,6e-06,1e-05,3.2e-05,1.8e-05,3.4e-05,1.1e-05,3.8e-05,2.9e-05,2.4e-05,1.3e-05,3e-06,1.3e-05,2.6e-05,7e-06,2.5e-05,6e-06,1.2e-05,2.7e-05,8e-06,5e-06,1.6e-05,1.6e-05,3.5e-05,2.4e-05,1.1e-05,4e-06,2.4e-05,7e-06,1.4e-05,1e-05,3.4e-05,1.6e-05,1e-05,1.9e-05,2e-05,2.4e-05
4e-06,1e-06,3e-06,7e-06,6e-06,6e-06,5e-06,2e-06,2e-06,6e-06,6e-06,9e-06,8e-06,3e-06,1.5e-05,3e-06,1e-05,2e-06,4e-06,1.6e-05,4e-06,7e-06,1.4e-05,1.6e-05,7e-06,1.5e-05,1.3e-05,1e-05,2.5e-05,1e-05,1.2e-05,1e-05,2.3e-05,2.7e-05,1.7e-05,9e-06,7e-06,1e-06,2.7e-05,9e-06,1.1e-05,1.7e-05,1e-05,2.8e-05,1.2e-05,2.7e-05,1.1e-05,3.2e-05,1.6e-05,2.5e-05,1e-05,2.9e-05,6e-06,1.8e-05,1.6e-05,1.7e-05,1e-05,1.1e-05,2.2e-05,2.2e-05,6e-06,8e-06,1e-05,2e-05,3.1e-05,2.2e-05,2e-05,3e-05,3.1e-05,1.2e-05,3.4e-05,2.6e-05,1e-06,2.9e-05,1e-06,1.5e-05,4.9e-05,2e-05,4.4e-05,2.4e-05,1.3e-05,1.6e-05,1.4e-05,3.9e-05,1.3e-05,1.5e-05,8e-06,6e-06,3.4e-05,3.6e-05,1.9e-05,1.1e-05,3.6e-05,1.2e-05,8e-06,1.1e-05,2e-05,3.3e-05,3e-05,1.7e-05,1.6e-05,1.8e-05,4.2e-05,1.3e-05,7e-06,1.4e-05,1.3e-05,4.4e-05,1.2e-05,1.7e-05,1e-05,3.8e-05,2.4e-05,1.9e-05,3.6e-05,5.2e-05,7e-06,1.2e-05,3.5e-05,2.8e-05,2.9e-05
5e-06,3e-06,4e-06,7e-06,9e-06,7e-06,5e-06,8e-06,5e-06,4e-06,9e-06,1.2e-05,1.4e-05,1.6e-05,8e-06,1.6e-05,1e-05,1.5e-05,8e-06,1.4e-05,2.1e-05,8e-06,1e-05,1.4e-05,1.3e-05,8e-06,3.3e-05,4e-06,2.1e-05,1.6e-05,1.6e-05,1.1e-05,2.1e-05,4.5e-05,1.1e-05,2.5e-05,2e-06,1e-06,2.3e-05,1.5e-05,2.5e-05,1.6e-05,3.4e-05,2e-05,1.8e-05,2.9e-05,1.4e-05,2.4e-05,9e-06,3.1e-05,2.1e-05,3.4e-05,3.7e-05,2e-05,1.1e-05,3e-05,1.9e-05,2.4e-05,3.5e-05,3.8e-05,2.9e-05,4.1e-05,1.6e-05,6e-06,4.2e-05,3.7e-05,3e-05,4.4e-05,5.7e-05,4.6e-05,5.3e-05,4.9e-05,2.2e-05,3e-05,9e-06,2.8e-05,5.4e-05,3.1e-05,2.5e-05,4.8e-05,2e-05,2.3e-05,2.6e-05,3.7e-05,6.3e-05,1.3e-05,2.5e-05,2.5e-05,2.8e-05,3.8e-05,3e-05,6.4e-05,2.1e-05,1.1e-05,1.8e-05,2.2e-05,4e-05,5.1e-05,1.2e-05,5e-05,2.2e-05,1.2e-05,5.2e-05,2.7e-05,8e-06,1.7e-05,1.4e-05,2.4e-05,2.2e-05,9e-06,3.2e-05,2.8e-05,1.2e-05,1.1e-05,3e-05,4.5e-05,3.1e-05,2.2e-05,3.5e-05,6e-06,2.7e-05
7e-06,6e-06,7e-06,1.1e-05,1e-06,5e-06,4e-06,8e-06,1e-06,1.2e-05,9e-06,5e-06,1.5e-05,1.7e-05,1e-05,2.3e-05,1.8e-05,1.5e-05,2.6e-05,2.8e-05,3.2e-05,1.5e-05,5e-06,1.4e-05,1.3e-05,2e-05,4.4e-05,4.2e-05,3.9e-05,2.9e-05,4.4e-05,5.3e-05,4e-05,4.8e-05,5.9e-05,3.4e-05,1.4e-05,1.7e-05,1.8e-05,2e-05,4.1e-05,2.8e-05,4.1e-05,5.9e-05,4.6e-05,4.3e-05,4.3e-05,3.5e-05,2.4e-05,3.8e-05,4.4e-05,4.6e-05,3e-05,5.3e-05,3.4e-05,5.7e-05,2.9e-05,2.7e-05,3.7e-05,2.5e-05,1.6e-05,3.7e-05,2.3e-05,1.3e-05,5.3e-05,3e-05,7.1e-05,2.9e-05,4.7e-05,1.4e-05,5.3e-05,3.3e-05,7.1e-05,6.4e-05,5.8e-05,3.9e-05,7.9e-05,5.2e-05,6.7e-05,7.4e-05,4.1e-05,4.8e-05,6.9e-05,5.9e-05,8.3e-05,9.1e-05,3.2e-05,4.1e-05,2.6e-05,5.4e-05,9.2e-05,0.00015,9.9e-05,5.8e-05,1.7e-05,1.9e-05,5.6e-05,2.8e-05,2.2e-05,7.5e-05,5.4e-05,1e-05,2.2e-05,2.1e-05,2.7e-05,5.8e-05,5.6e-05,6.1e-05,4.5e-05,4e-05,3.9e-05,6.7e-05,8e-05,6.9e-05,6.4e-05,6e-05,5.3e-05,4.6e-05,5.7e-05,5.9e-05,5.6e-05
1.3e-05,1.2e-05,9e-06,7e-06,7e-06,8e-06,6e-06,1e-05,8e-06,2.2e-05,1.5e-05,9e-06,1.7e-05,1e-05,1.5e-05,1.7e-05,1e-05,2e-05,1.8e-05,2.7e-05,3.6e-05,3e-05,1.6e-05,5e-06,4e-06,6e-06,3.6e-05,5.3e-05,2.9e-05,4.4e-05,3.8e-05,1.4e-05,9e-06,2.5e-05,5.6e-05,5.5e-05,5.5e-05,3.1e-05,1.7e-05,8e-06,1.8e-05,2.5e-05,1.7e-05,6e-05,3e-06,2.9e-05,2.7e-05,3.6e-05,3.8e-05,4.1e-05,1.4e-05,6e-06,4.4e-05,4.5e-05,5e-05,1.9e-05,1.7e-05,1e-05,2.5e-05,3.1e-05,1.7e-05,2.1e-05,1.4e-05,5e-06,3.9e-05,6e-05,8.8e-05,6.8e-05,5.2e-05,4.9e-05,1.9e-05,4.5e-05,3.8e-05,3.8e-05,7.3e-05,6.1e-05,5.9e-05,4.4e-05,4e-06,4.1e-05,5.7e-05,4.3e-05,4.4e-05,4.7e-05,3.4e-05,3e-05,2.5e-05,2.5e-05,9e-06,2.2e-05,7.1e-05,3.7e-05,1.5e-05,1.1e-05,1.7e-05,5e-06,4.3e-05,3.6e-05,1e-05,4.6e-05,7e-05,6.3e-05,3.1e-05,1.2e-05,2.7e-05,3.1e-05,7e-06,3e-05,4.3e-05,2.8e-05,3.7e-05,5.1e-05,6.5e-05,2.1e-05,3.8e-05,4e-05,4.1e-05,1.4e-05,2.4e-05,4.9e-05,3.8e-05
7e-06,3e-06,2e-06,1.1e-05,1.1e-05,1e-05,7e-06,2e-06,2e-06,1.3e-05,8e-06,1e-05,1.2e-05,5e-06,4e-06,1.1e-05,4e-06,8e-06,3e-06,1.7e-05,1.3e-05,3e-06,5e-06,6e-06,3e-06,8e-06,1.9e-05,2.5e-05,1.4e-05,2.8e-05,6e-06,2.1e-05,2.4e-05,1.5e-05,1.8e-05,1.7e-05,1.8e-05,7e-06,6e-06,1.5e-05,1e-05,1.6e-05,3.6e-05,1.9e-05,3.2e-05,9e-06,1e-06,2.8e-05,1.9e-05,2.5e-05,2.5e-05,1e-05,3e-05,1e-05,2e-05,2.1e-05,1.3e-05,1.7e-05,2.4e-05,4e-06,2.4e-05,1.7e-05,1e-06,4e-06,3.2e-05,3.6e-05,1.9e-05,2.2e-05,1.6e-05,2.7e-05,2.8e-05,4.5e-05,1.8e-05,1.8e-05,3e-05,7e-06,3.9e-05,1.3e-05,4e-06,1.2e-05,2.7e-05,8e-06,4.2e-05,2.6e-05,1.5e-05,1e-06,2.3e-05,2.5e-05,1.4e-05,2.1e-05,2e-05,4.1e-05,8e-06,1e-05,1.7e-05,1.7e-05,1.3e-05,9e-06,1.7e-05,1.8e-05,2.3e-05,2.3e-05,2e-05,2e-06,2.2e-05,1.2e-05,5e-06,1.5e-05,9e-06,2.6e-05,2.9e-05,1.5e-05,1.9e-05,7e-06,3e-05,1.9e-05,1.5e-05,1e-06,1.2e-05,1.6e-05,3.7e-05
1e-06,1e-06,1e-06,4e-06,2e-06,2e-06,4e-06,1e-06,5e-06,7e-06,3e-06,4e-06,1e-05,5e-06,3e-06,5e-06,3e-06,5e-06,5e-06,4e-06,1.5e-05,8e-06,1.1e-05,1.2e-05,4e-06,1.2e-05,8e-06,1.5e-05,1.6e-05,2e-05,3e-06,9e-06,1.6e-05,1.6e-05,1.1e-05,7e-06,1.7e-05,3e-06,5e-06,1.5e-05,1e-05,5e-06,2.1e-05,1.2e-05,1.1e-05,8e-06,1.2e-05,2.6e-05,1.4e-05,1.6e-05,1.9e-05,7e-06,1.8e-05,5e-06,1.9e-05,1.6e-05,7e-06,1.1e-05,7e-06,6e-06,1.4e-05,4e-06,1e-05,3e-06,2.6e-05,1.9e-05,1e-05,2.4e-05,1e-05,1.1e-05,1e-05,4.3e-05,1.2e-05,2.6e-05,1.4e-05,5e-06,3.5e-05,8e-06,1e-05,1.9e-05,1.5e-05,7e-06,3.2e-05,1.3e-05,1.4e-05,6e-06,1.4e-05,2.4e-05,1.1e-05,1e-05,1.5e-05,3e-05,1.1e-05,3e-06,1e-05,5e-06,7e-06,6e-06,1e-05,1e-05,1.1e-05,3.1e-05,1.8e-05,6e-06,1.8e-05,1.3e-05,8e-06,5e-06,1.7e-05,1.5e-05,1.1e-05,9e-06,2.1e-05,1.2e-05,3.4e-05,2e-05,9e-06,3e-06,3e-06,2e-06,2.4e-05
1e-06,3e-06,1e-06,1e-06,1e-06,1e-06,2e-06,3e-06,3e-06,3e-06,3e-06,5e-06,1e-05,3e-06,3e-06,0,3e-06,5e-06,1e-06,4e-06,1.1e-05,5e-06,7e-06,6e-06,4e-06,9e-06,9e-06,9e-06,1.5e-05,1e-05,7e-06,7e-06,1.1e-05,1.5e-05,6e-06,5e-06,1.9e-05,4e-06,4e-06,1.2e-05,1e-05,7e-06,2.1e-05,1.9e-05,6e-06,5e-06,5e-06,3.1e-05,1.4e-05,2.3e-05,1.2e-05,9e-06,1.8e-05,5e-06,2.2e-05,8e-06,7e-06,1e-05,1.2e-05,9e-06,4e-06,5e-06,6e-06,4e-06,2.8e-05,2.3e-05,1.1e-05,1.9e-05,7e-06,8e-06,1.9e-05,4.3e-05,9e-06,1.7e-05,1e-05,5e-06,3e-05,5e-06,6e-06,1.6e-05,1.6e-05,3e-06,3.7e-05,1.6e-05,4e-06,8e-06,1.4e-05,1.8e-05,6e-06,1.4e-05,2e-05,2.8e-05,6e-06,4e-06,2e-06,5e-06,4e-06,8e-06,8e-06,6e-06,1.2e-05,2.7e-05,1.5e-05,1e-06,1.5e-05,1.8e-05,1.1e-05,3e-06,7e-06,9e-06,1.7e-05,4e-06,2.2e-05,1.2e-05,3.4e-05,2.1e-05,1.2e-05,5e-06,3e-06,7e-06,1.9e-05
1e-06,2e-06,2e-06,2e-06,1e-06,3e-06,2e-06,2e-06,3e-06,5e-06,4e-06,6e-06,8e-06,1e-06,3e-06,0,3e-06,3e-06,3e-06,4e-06,8e-06,3e-06,6e-06,9e-06,3e-06,1.1e-05,1e-05,1e-05,1.4e-05,6e-06,5e-06,9e-06,1.4e-05,1.5e-05,9e-06,1.3e-05,1.5e-05,0,8e-06,9e-06,1e-05,8e-06,2.2e-05,2.3e-05,8e-06,2e-06,3e-06,2.6e-05,1.4e-05,2.6e-05,1.8e-05,1.2e-05,1.9e-05,6e-06,1.2e-05,9e-06,9e-06,6e-06,1.6e-05,9e-06,1.1e-05,1.1e-05,4e-06,2e-06,2.5e-05,1.5e-05,5e-06,1.6e-05,7e-06,5e-06,2e-05,3.5e-05,8e-06,2.2e-05,9e-06,7e-06,2.9e-05,1.5e-05,1.5e-05,1e-05,2.3e-05,9e-06,4.2e-05,5e-06,1.3e-05,7e-06,1.4e-05,2.2e-05,5e-06,1.1e-05,1.1e-05,2.1e-05,7e-06,3e-06,3e-06,5e-06,2e-06,7e-06,1.1e-05,7e-06,1.6e-05,2.5e-05,1.7e-05,2e-06,8e-06,1e-05,6e-06,9e-06,1.3e-05,1.5e-05,1.2e-05,2e-06,1.2e-05,1.4e-05,3.2e-05,2.1e-05,6e-06,3e-06,3e-06,4e-06,1.9e-05
1e-06,1e-06,1e-06,1e-06,1e-06,1e-06,3e-06,2e-06,1e-06,3e-06,4e-06,6e-06,9e-06,1e-06,4e-06,1e-06,5e-06,4e-06,2e-06,3e-06,1e-05,2e-06,4e-06,7e-06,2e-06,8e-06,1.1e-05,1.1e-05,1.2e-05,6e-06,3e-06,6e-06,1.1e-05,1.5e-05,1.3e-05,5e-06,1.4e-05,1e-06,7e-06,1e-05,1.4e-05,4e-06,1.4e-05,1.7e-05,5e-06,1e-06,2e-06,2.7e-05,1.2e-05,1.9e-05,1.5e-05,1.1e-05,1.3e-05,4e-06,1.8e-05,9e-06,2e-06,1.3e-05,5e-06,4e-06,9e-06,1e-05,6e-06,1e-05,2.7e-05,1.5e-05,7e-06,1.7e-05,5e-06,4e-06,1.5e-05,4.2e-05,3e-06,1.2e-05,3e-06,5e-06,3.2e-05,1.5e-05,1e-05,4e-06,1.5e-05,3e-06,4.1e-05,1e-05,1.2e-05,5e-06,1.4e-05,1.8e-05,4e-06,1.7e-05,1e-05,2.5e-05,6e-06,1e-06,5e-06,3e-06,1e-06,3e-06,8e-06,8e-06,1.4e-05,2.7e-05,1.8e-05,5e-06,1.3e-05,0,6e-06,1.5e-05,1.3e-05,1.5e-05,9e-06,0,1.2e-05,1.2e-05,3.2e-05,1.9e-05,1e-05,7e-06,3e-06,9e-06,2.2e-05
1e-06,1e-06,2e-06,2e-06,1e-06,2e-06,3e-06,2e-06,2e-06,3e-06,3e-06,5e-06,8e-06,2e-06,3e-06,1e-06,5e-06,2e-06,2e-06,2e-06,6e-06,4e-06,4e-06,8e-06,2e-06,1.1e-05,1e-05,9e-06,1.3e-05,8e-06,4e-06,6e-06,1e-05,1.5e-05,8e-06,8e-06,1.3e-05,1e-06,5e-06,1e-05,1.6e-05,6e-06,1.9e-05,1.5e-05,8e-06,1e-06,1e-06,2.7e-05,1.3e-05,1.8e-05,1.4e-05,1.1e-05,1.2e-05,0,1.8e-05,2e-06,6e-06,1e-05,7e-06,5e-06,6e-06,8e-06,6e-06,3e-06,1.9e-05,7e-06,3e-06,1.7e-05,1.1e-05,0,1e-05,3.5e-05,3e-06,1.4e-05,4e-06,5e-06,3.5e-05,1.6e-05,1.4e-05,1e-06,1e-05,2e-06,3.6e-05,2e-06,7e-06,7e-06,1.7e-05,1.8e-05,5e-06,1.5e-05,1.2e-05,2.5e-05,1e-05,3e-06,4e-06,2e-06,2e-06,4e-06,1e-05,6e-06,1.4e-05,2.6e-05,1.8e-05,5e-06,1e-05,5e-06,9e-06,5e-06,9e-06,1.4e-05,1.1e-05,2e-06,9e-06,1.6e-05,2.8e-05,1.8e-05,9e-06,3e-06,5e-06,8e-06,2.3e-05
1e-06,1e-06,2e-06,2e-06,1e-06,1e-06,2e-06,2e-06,2e-06,3e-06,3e-06,4e-06,7e-06,4e-06,3e-06,0,4e-06,2e-06,2e-06,0,7e-06,3e-06,5e-06,9e-06,1e-06,1.1e-05,8e-06,1e-05,1.1e-05,8e-06,1e-06,5e-06,1.1e-05,1.5e-05,6e-06,7e-06,1.2e-05,1e-06,5e-06,9e-06,1.5e-05,2e-06,1.5e-05,1.6e-05,6e-06,1e-06,2e-06,2.5e-05,1.3e-05,1.9e-05,1.4e-05,1.1e-05,1.6e-05,3e-06,1.6e-05,3e-06,1e-06,1.1e-05,1e-05,9e-06,4e-06,9e-06,6e-06,3e-06,2.1e-05,1e-05,1e-06,1.5e-05,1.1e-05,5e-06,1.2e-05,3.7e-05,5e-06,1.7e-05,1e-05,2e-06,2.7e-05,1.5e-05,9e-06,6e-06,1.1e-05,2e-06,3.7e-05,7e-06,9e-06,5e-06,1.6e-05,1.6e-05,1e-05,1.4e-05,1.1e-05,2.5e-05,8e-06,2e-06,3e-06,1e-06,1e-06,5e-06,8e-06,8e-06,1.5e-05,2.3e-05,1.8e-05,3e-06,1.1e-05,5e-06,5e-06,1.2e-05,9e-06,1.5e-05,1.1e-05,2e-06,7e-06,9e-06,3e-05,2e-05,8e-06,1e-06,3e-06,3e-06,2.1e-05
1e-06,1e-06,2e-06,1e-06,1e-06,1e-06,2e-06,2e-06,1e-06,3e-06,3e-06,4e-06,8e-06,2e-06,3e-06,1e-06,4e-06,2e-06,1e-06,2e-06,8e-06,2e-06,6e-06,8e-06,1e-06,1e-05,1e-05,8e-06,1.1e-05,1e-05,1e-06,6e-06,1e-05,1.4e-05,6e-06,6e-06,1.3e-05,1e-06,7e-06,1e-05,1.4e-05,2e-06,1.6e-05,1.8e-05,5e-06,0,2e-06,2.6e-05,1.2e-05,1.9e-05,1.3e-05,1.1e-05,1.3e-05,0,1.4e-05,4e-06,4e-06,1.1e-05,6e-06,4e-06,4e-06,8e-06,6e-06,3e-06,2e-05,8e-06,2e-06,1.4e-05,1.2e-05,4e-06,1.1e-05,3.8e-05,4e-06,1.3e-05,7e-06,1e-06,2.7e-05,1.2e-05,1.1e-05,4e-06,1.1e-05,2e-06,3.4e-05,7e-06,6e-06,5e-06,1.6e-05,2e-05,9e-06,1.3e-05,1e-05,2.4e-05,6e-06,2e-06,2e-06,2e-06,1e-06,6e-06,5e-06,6e-06,1.6e-05,2.7e-05,1.9e-05,3e-06,1e-05,1e-06,6e-06,1.3e-05,1e-05,1.4e-05,1e-05,1e-06,8e-06,9e-06,2.9e-05,1.9e-05,9e-06,1e-06,4e-06,5e-06,2.2e-05
