-0.000164,0.000162,0.000411,-0.000171,-0.000295,-0.000107,-0.000276,-0.000243,3.4e-05,0.000146,-0.000362,-0.000108,0.000174,-0.000179,-0.000274,-6.7e-05,-9e-05,-0.00027,0.00018,0.000693,-0.00011,-0.00014,-5.3e-05,0.00024,0.000329,0.000309,0.000119,-7.3e-05,5e-05,-6.4e-05,0,6.6e-05,0.000336,0.000185,-9.1e-05,-0.00011,0.000127,0.000311,-0.000244,0.000226,-0.000706,-0.000371,4.1e-05,6.3e-05,0.000169,-4.7e-05,0.000502,0.00081,-3e-04,-0.000427,0.000105,-0.000123,0.000182,0.000189,-4.5e-05,0.001485,0.001669,0.001901,0.001803,0.002114,-0.003908,-0.018384,-0.018051,-0.020294,-0.012431,-0.022173,-0.001903,-0.019199,-0.020534,-0.031803,-0.019638,-0.004706,-0.011032,0.012719,-0.015779,-0.033893,-0.028889,-0.013923,-0.015341,-0.02185,-0.017293,-0.018753,-0.010883,-0.000751,-0.017211,-0.021652,-0.023474,-0.028333,-0.025322,-0.010689,-0.014103,-0.023093,-0.02826,-0.025405,-0.02746,-0.015075,-0.027978,-0.02655,-0.04079,-0.024459,-0.027992,-0.020098,-0.016908,-0.027329,-0.02422,-0.029206,-0.030663,-0.032455,-0.034179,-0.029016,-0.030172,-0.031216,-0.03356,-0.020934,-0.022243,-0.020323,-0.022959,-0.027524,-0.025898,-0.017505,-0.02612
-0.000194,-0.000439,-0.00052,-0.000251,-0.000193,0.000153,-5.6e-05,0.000335,-0.000165,-0.000128,-9.5e-05,0.000138,-9.5e-05,-1.6e-05,-0.000103,-0.000276,-0.000189,-1.5e-05,-1.9e-05,0.000191,-0.000391,2.1e-05,-0.000563,-9.8e-05,-0.000344,-0.000135,-0.000323,-4e-06,-9.9e-05,-0.000215,-0.000152,-0.000134,0.000185,-0.000123,0.000266,0.000168,0.00013,0.00019,0.000362,-0.000325,0.000126,0.000305,3.5e-05,-1.4e-05,-0.00032,-0.000262,-0.000248,-0.000627,-0.000187,-1.3e-05,-0.000111,9.1e-05,-0.000106,-0.000248,-0.000811,-0.001685,-0.001271,-0.003825,-0.00301,-0.008732,-0.009938,-0.012043,-0.01616,-0.008931,-0.017923,-0.012746,-0.018453,-0.003522,-0.002295,0.011284,0.001009,-0.011554,-0.011127,-0.030987,-0.015913,0.019329,0.013999,-0.019036,-0.013625,-0.004605,-0.002368,0.013161,-0.003117,-0.033907,-0.01124,0.012308,0.015182,0.023794,0.007713,-0.005003,-0.003991,0.006033,0.014815,0.012865,0.021115,0.010353,0.011903,0.018577,0.020298,0.017924,0.017121,0.014536,-0.019267,0.000717,0.005116,0.008777,0.005465,0.013271,0.021871,0.005194,0.014142,0.017496,0.009202,0.020065,0.011655,0.002572,0.010026,0.018722,0.023067,0.010678,-0.012559
0.000132,0.000525,-0.000191,-0.000129,7.8e-05,-0.000185,-0.000159,-0.000211,-0.000235,-0.000276,0.000114,-0.00042,0.000557,4.5e-05,-0.000311,-0.000251,-0.000295,0.000136,0.000307,-1.9e-05,9.7e-05,-0.000447,-1.3e-05,-0.000268,-0.000277,0.00011,-5.1e-05,-6.6e-05,-1e-04,-1.1e-05,0.000256,5.2e-05,0.000221,5.2e-05,-0.000295,-6.8e-05,9.6e-05,-9.2e-05,-0.000277,0.000212,2.8e-05,-5.1e-05,-0.000102,-0.000305,-0.000637,-0.000497,-0.000246,-0.000158,-3.7e-05,4.5e-05,-5.3e-05,-0.000224,-0.00046,-4.1e-05,0.000134,-3e-06,-0.000125,0.001058,0.002093,0.001599,0.007862,0.008702,0.015241,0.012564,0.007614,0.019275,0.0225,0.011959,0.006024,-0.01111,0.003244,0.003873,0.012206,0.011433,0.023011,-0.000246,-0.005876,0.007962,-0.000496,-0.000414,0.004256,-0.009618,-0.00583,-0.002539,0.014452,-0.005638,-0.005933,-0.003722,-0.010644,0.012523,0.007573,-0.000348,-0.018668,-0.012056,-0.012452,-0.012974,-0.01189,-0.014262,-0.014519,-0.01396,-0.012974,-0.019384,0.000991,-0.010889,-0.003162,-0.003616,-0.004264,-0.008545,-0.014366,-0.004066,-0.011181,-0.008301,-0.012048,-0.014864,-0.008327,-0.002352,-0.014758,-0.014485,-0.018414,-0.014394,0.015448
-9.4e-05,-7.8e-05,-7.5e-05,0.000214,0.000122,-0.000199,-7.6e-05,-0.000334,-0.000294,-0.000135,-0.00034,0.000174,0.000366,7.4e-05,0.000365,0.000151,0.000193,-1.4e-05,-1.3e-05,-0.000253,-9.8e-05,-7e-06,-0.000209,-0.000254,5.5e-05,-0.000167,-4.1e-05,-0.000149,-0.000189,-0.000233,-4.4e-05,-0.000146,1.1e-05,0.000103,8.2e-05,-0.000206,-8e-06,2.4e-05,-7.4e-05,4.4e-05,0.000299,-3.5e-05,-0.000111,-0.000537,-0.000543,0.000188,-0.000498,-2e-05,-0.000217,-4.1e-05,-0.000189,0.000134,-9e-05,-0.000258,-3.8e-05,-3.7e-05,-0.000431,0.001692,0.000547,0.002603,-0.002542,-1.8e-05,0.002167,-0.004591,-0.010605,-0.005263,-0.007716,0.003594,-0.012031,0.011572,0.010795,0.0052,-0.003102,-0.000599,-0.012436,0.005648,-0.005345,0.00219,0.007568,0.007938,0.009538,0.014199,0.004568,0.02324,0.003994,0.010276,0.002009,-0.004422,0.007164,0.014226,3.2e-05,-0.009527,0.011199,0.015895,0.011601,0.010845,0.012624,0.005496,0.010744,0.00589,0.011856,0.014712,0.005447,0.010396,0.002336,-0.000514,0.01126,-0.001723,0.008851,0.009265,0.010987,0.002241,0.014769,0.008387,0.011151,0.006724,0.015525,0.011969,0.008489,0.00864,0.000525
0.000329,0.000129,1.6e-05,-6.5e-05,-0.000183,-0.000195,-3.3e-05,-5.7e-05,0.000317,0.000291,0.000377,0.000165,7e-06,-0.000579,-0.000284,0.000258,-0.000147,-0.000129,-8.6e-05,-0.000145,-0.000402,-0.000167,-6.5e-05,-0.00045,0.000124,-2e-06,-9.3e-05,-7.8e-05,0.000152,-4.4e-05,-0.000263,-0.000131,0.000265,-0.00036,-0.000338,-9.2e-05,8e-06,-0.000265,-0.00034,1.8e-05,-0.000554,2.4e-05,-0.000623,9.5e-05,0.000329,0.000203,3.3e-05,-0.000289,0.00025,-0.000155,-0.000216,-3.1e-05,-9.5e-05,-0.000204,-3.8e-05,-0.000308,-0.001269,-0.001125,-0.001805,0.001178,-0.005356,-0.005995,-0.002362,0.001094,0.009049,-0.001042,0.000168,-0.003559,0.003357,0.001898,0.003182,-0.00107,0.008376,-0.016556,0.002041,0.001806,0.011553,0.00466,-0.019428,-0.014146,-0.008956,-0.014065,-0.005931,-0.0029,-0.005126,-0.020424,0.004189,-0.003132,0.002855,-0.007118,-0.007229,-0.003514,-0.001184,-0.006984,-0.008862,-0.007599,-0.012807,-0.006644,-0.006671,-2e-06,-0.007166,-0.004864,-0.006822,-0.003075,-0.006784,-0.008228,-0.013885,0.009822,-0.007588,0.001015,-0.014904,-0.003617,-0.008293,-0.009583,-0.007372,-0.003046,-0.011864,-0.004396,-0.006304,-0.002706,-0.005507
-7.8e-05,0.000206,-0.000227,-7.9e-05,-0.000103,0.000223,0.000343,-1e-04,7.7e-05,0.000108,9.9e-05,-3.2e-05,-0.000232,0.000105,0.000237,0.000298,-4.6e-05,1.1e-05,1.8e-05,-0.000419,-4.5e-05,-0.000228,0.000187,0.00037,-0.000114,-0.000217,0.000152,-2.6e-05,-0.000238,0.000108,-6.9e-05,3.5e-05,-0.000127,-0.000151,-8.6e-05,-8.9e-05,-0.000115,0.000143,4.8e-05,-2.5e-05,-1.4e-05,-0.000453,-2.2e-05,-2e-04,-0.000247,-0.000388,-6.9e-05,4.5e-05,-6.4e-05,0.000185,-6.3e-05,2.3e-05,0.00021,-0.000158,-0.000344,0.00034,0.000898,-0.000243,0.000344,-0.001401,0.003222,0.001991,0.00038,-0.002881,0.004784,-0.001128,-0.005427,0.000331,-0.007214,-0.005468,-0.006445,-0.008172,-0.013348,-0.003891,-0.011802,-0.001408,-0.005931,-0.004758,0.005717,0.005715,-0.00998,-0.00806,-0.002457,0.000932,0.006783,0.011438,-0.001437,0.003343,-0.007836,-0.00192,0.008315,-0.011441,-0.002566,0.002135,0.005872,0.004613,0.005756,0.006615,0.003231,-0.002433,0.000822,0.003339,0.002827,-0.003786,0.00127,0.002784,0.004945,-0.00334,-0.001095,-0.004778,0.007259,-0.000423,0.002423,0.008235,0.002633,-0.003817,0.003399,0.004739,0.006424,-0.002806,0.001485
-8.6e-05,-9.9e-05,-6.6e-05,5e-06,0.000123,-1.7e-05,-0.00019,-0.000132,6.6e-05,-0.000144,-7.5e-05,1.4e-05,-0.000169,-1.2e-05,-0.000176,-0.000212,-8.2e-05,1e-06,-0.000204,2.7e-05,-0.000153,0.000342,-5.4e-05,-2.1e-05,-0.000324,-8.5e-05,-8.7e-05,0.000215,3.9e-05,0.000101,-0.000117,-9.1e-05,-0.000169,-2e-04,0.000141,3e-06,-0.000111,-0.000201,6e-06,-0.000138,7.1e-05,0.000228,-8.3e-05,-9.8e-05,0.000358,-0.000108,-0.000196,-1.3e-05,-0.000266,-0.000284,-8.5e-05,-0.000106,-0.000424,2.4e-05,0.000364,-0.000182,0.000789,-0.000406,0.000776,-0.000675,0.001433,-0.000349,0.000395,0.000383,-0.000115,0.00645,-0.010342,0.000498,0.00501,0.008607,0.001737,0.004053,-0.004529,-0.00131,-0.003089,0.007566,0.004613,0.000801,0.004038,0.002905,0.003348,0.001639,-0.006859,0.002909,0.010293,-0.002734,-0.001804,-0.005246,0.001099,-0.003438,-0.003687,0.005764,0.002624,0.002647,-0.000232,-0.002331,0.010932,-0.004276,0.000432,0.004662,0.006536,0.000742,0.004719,-0.002149,-0.005728,-0.010154,-0.005633,0.003835,-0.001696,0.002435,0.002837,-0.003812,-0.000441,-0.007254,-0.003598,0.003656,0.006993,-0.000893,-0.005,0.005149,-6.8e-05
-2.4e-05,-3.2e-05,0.000105,-1.2e-05,-0.000321,5.3e-05,0.000131,0.000144,4.1e-05,-0.000124,-0.000178,-6.9e-05,3.5e-05,-8.5e-05,3.1e-05,0.000107,-0.000143,-0.000193,6e-05,6.8e-05,1e-06,-0.000166,0.000363,3.7e-05,-3.5e-05,-2e-06,0.000116,-1.8e-05,0.000107,-8.5e-05,-2e-06,-0.000338,-0.000113,-1.2e-05,1.9e-05,0.000128,4e-06,-0.000151,-0.000121,-3.1e-05,-0.000195,2.7e-05,2.4e-05,6.1e-05,0.000239,0.000121,-8e-06,-0.000302,-0.000106,-6.4e-05,-0.000146,0.000252,0.00017,0.000365,0.000133,-6e-05,-0.000718,-0.00035,-0.000903,0.000577,-0.001289,0.001184,-0.003698,-0.004307,-0.000311,0.001123,0.006675,0.002429,-0.003656,-0.00346,-0.004102,-0.001014,0.001192,-0.001613,0.005913,-0.004486,-0.009357,0.000543,-0.005166,-0.010215,-0.005845,-0.004647,0.006736,-0.004195,-0.008072,-0.007409,-0.00432,-0.001758,-0.006487,0.005297,0.000193,-0.006766,-0.003874,-0.004289,-0.006328,0.002388,-0.009522,-0.001975,-0.001991,-0.004506,-0.006489,-0.002235,-0.00507,-0.003812,0.010112,0.009531,0.005543,-0.002562,0.001276,-0.006197,-0.010575,-0.003438,-0.002999,-0.001455,0.000842,-0.003992,-0.005468,-0.003877,0.002201,-0.003898,0.00141
-0.00014,-0.000103,5.9e-05,-1.8e-05,-1.8e-05,5.2e-05,-0.000117,8.3e-05,-2.4e-05,4.7e-05,6e-06,-8.8e-05,-2.5e-05,0.000132,0.00019,-7.4e-05,2.1e-05,6.1e-05,-4.1e-05,-0.000203,0.000107,0.000151,1.4e-05,-7.5e-05,-0.000138,-0.000103,0.000145,-0.000118,2e-05,-1.3e-05,0.000109,4e-06,1e-06,-4.6e-05,-5e-05,7.4e-05,3e-06,-0.000226,-1e-05,-7.8e-05,0.000106,3.4e-05,2.7e-05,7e-05,-0.00026,4.3e-05,-2.4e-05,7.8e-05,0.000337,0.000121,-2.1e-05,-4.4e-05,3.2e-05,-0.000113,-5.4e-05,0.000176,-0.00022,0.000177,-0.000397,-0.001412,-0.00126,0.000472,0.002168,0.006417,0.000637,0.001662,0.001192,0.000196,-0.008977,-0.002086,0.001326,-0.00762,0.002599,-0.001151,0.006593,-0.001469,0.006623,0.000256,-0.000293,0.000857,0.00582,-0.004299,-0.008237,0.002933,-0.007019,-0.00247,0.004279,0.003755,0.005339,-0.000813,-0.006883,-0.004199,-0.00493,-0.001194,0.005764,-0.000332,0.003649,0.00206,0.00507,0.004152,0.002725,0.002256,0.002495,0.003126,-0.006478,-0.004198,0.00213,0.004546,-0.004805,0.006711,0.003654,0.005441,0.005989,0.005887,0.001779,0.003514,0.000116,-0.001893,0.00018,0.001764,0.000361
-2.3e-05,3.3e-05,5.4e-05,-0.000186,8.2e-05,4.9e-05,3e-05,4.5e-05,-1.1e-05,0.000103,0.000137,8e-05,-0.000165,2e-05,9.2e-05,8e-06,1.7e-05,-2.2e-05,-8.7e-05,0.000148,0.000179,9.1e-05,-7.6e-05,-0.000104,1.8e-05,-4e-06,-0.000117,-1.6e-05,0.000127,9.2e-05,-5.7e-05,7.3e-05,-8e-05,-0.000199,1.1e-05,0.000124,3e-05,2.9e-05,7e-06,-2.2e-05,-5.8e-05,-8.8e-05,4.6e-05,-9.4e-05,-0.000149,-1e-06,5.8e-05,5.5e-05,1.1e-05,2.1e-05,0.000162,-0.000241,1.7e-05,-5.4e-05,-2e-06,0.000122,0.000148,0.000872,0.00046,0.000452,0.000983,0.000823,-2.1e-05,0.00187,-0.000573,-0.005645,-0.000799,-0.001381,0.001485,0.00282,-0.003473,-0.000501,-0.006168,-0.005345,-0.004111,-0.001883,-0.009951,-0.002122,-6.5e-05,0.00531,-0.000745,0.00212,0.0022,-0.001256,-0.000809,0.001132,-0.002758,-0.005264,0.00177,-0.000839,0.003495,0.009051,-0.000226,0.000943,0.001006,-0.000435,-0.003236,-0.000322,-0.003569,-0.002549,0.000169,-0.001865,-0.00312,-0.001857,-0.005183,-0.000895,-0.004848,0.000661,0.005119,-0.005058,-0.001391,-0.005984,-0.002335,-0.002354,-0.000548,-0.005073,0.00247,0.004396,0.002001,-0.004022,-0.0022
6.9e-05,2.6e-05,2.5e-05,-7.4e-05,9.3e-05,0.000123,2.1e-05,-6.2e-05,-8.4e-05,5e-06,-6.1e-05,7.1e-05,6e-05,3.1e-05,-0.000114,-3e-06,9e-06,4.8e-05,1.7e-05,-7.8e-05,-1.8e-05,-0.000122,-0.000187,2e-05,0.000318,4.1e-05,-4.2e-05,-4.6e-05,7.9e-05,-6.2e-05,2e-05,-8.4e-05,7.5e-05,3.9e-05,1.2e-05,4.3e-05,-2.4e-05,1.4e-05,-1.1e-05,-1e-05,-4.6e-05,0.000143,0.000224,9.1e-05,-0.000195,9e-05,-0.000345,-4.9e-05,0.000177,0.000148,-9.7e-05,-8.5e-05,0.000111,4.8e-05,-6.7e-05,-5.3e-05,1.5e-05,4e-06,0.00047,0.000563,0.001952,-0.001752,0.000784,-0.003197,-3.4e-05,-0.000959,-0.006354,-0.005457,0.005386,-0.000596,-8.1e-05,-0.002208,0.000228,0.006051,0.00391,0.00143,0.003733,0.001969,-0.001861,-1.5e-05,0.001344,0.0047,0.00322,0.002205,0.005038,0.002895,0.010396,0.000214,0.001638,0.002364,-0.003476,0.002995,-0.000737,0.001683,0.000547,0.0019,0.001628,-0.002043,-0.000342,0.000834,5.7e-05,0.000697,0.00111,0.001924,0.006784,-0.001673,0.002514,-0.003704,-0.000515,0.006381,0.001517,0.003839,0.003453,-0.00116,0.000756,0.005027,0.000973,-0.003207,-0.000265,0.004073,0.000609
-8.8e-05,-6e-05,-4.2e-05,7.8e-05,-4.5e-05,-2.5e-05,-8.1e-05,-3e-05,-3.4e-05,0.000132,4.2e-05,-3.4e-05,-2e-06,3.7e-05,6.7e-05,-3e-06,9.2e-05,-7e-05,0,1.6e-05,-0.000106,-7.2e-05,6.3e-05,-0.00011,-0.000108,1.1e-05,-3.7e-05,3e-06,-3.1e-05,-3.5e-05,-5.1e-05,3.9e-05,-8.1e-05,1.4e-05,-2.6e-05,-4.6e-05,2e-05,0,7.5e-05,0.000186,0.000141,-4.6e-05,-0.000275,-1.7e-05,-3.7e-05,-5.7e-05,6.9e-05,-6.9e-05,2.8e-05,-0.00013,9.8e-05,6e-05,0.00012,5.9e-05,1e-06,-0.000214,-1e-05,-0.000338,0.000122,-0.000342,-0.000832,0.00012,-0.001353,0.000981,0.001129,0.001407,0.004712,0.002631,-0.005649,0.00047,0.000975,0.003986,0.004446,-0.003544,0.00145,-0.00249,-0.004688,-0.001451,0.002725,0.002731,-0.001525,-0.001193,0.002377,0.002347,-0.001311,-0.000696,-0.004704,-0.001724,0.001977,-0.003278,0.003309,-0.002732,-0.002031,0.000263,-0.00089,-0.001215,0.000366,0.004902,0.001746,0.00017,-0.000998,0.002671,0.000191,-0.001044,-0.00319,0.003249,-0.000156,0.000768,0.002865,-0.00242,0.00054,-0.000247,0.000835,-3e-05,0.001087,-0.002858,-0.002797,0.002254,0.000646,-0.003161,-0.001694
-5.9e-05,-1.1e-05,2.2e-05,-6.3e-05,-0.000139,2.2e-05,-3.9e-05,-1.8e-05,-2.8e-05,-1.2e-05,-6.2e-05,-1.7e-05,5e-06,1.6e-05,-3.5e-05,1.6e-05,-8.8e-05,9.4e-05,8e-06,2.1e-05,-2.2e-05,-6.5e-05,4.4e-05,-1.8e-05,-8.8e-05,-1e-05,4.1e-05,1.5e-05,-6.8e-05,-4.9e-05,1.2e-05,3e-05,-7.6e-05,9e-06,1.4e-05,-0.000173,-3.3e-05,4.4e-05,-2e-05,3.9e-05,-7.6e-05,1.6e-05,8.1e-05,-4e-05,-2.2e-05,-9.4e-05,-1.3e-05,-6e-06,-0.000112,-6.6e-05,-0.000103,-1.8e-05,2.6e-05,2e-06,-4.9e-05,8.8e-05,-0.000138,-0.000147,-0.000147,6.4e-05,-0.000914,0.000719,0.00033,-0.001762,-4e-05,-0.000529,-0.004342,-8.3e-05,0.001134,-0.002236,-0.000408,-0.001956,-0.00529,0.002858,-0.00195,-0.006247,0.001113,0.001651,-0.001766,0.000196,0.001055,-0.000643,-0.001079,-0.001189,-0.000892,0.000135,-0.000657,5.4e-05,-0.00075,0.002072,-0.002611,0.000948,0.00185,-0.002497,-0.000261,-0.001131,-0.001351,-0.00242,-0.000466,-0.000652,0.000303,-0.003247,-0.000469,-0.000822,0.001672,-0.003054,-0.002103,0.00047,-0.000417,0.002085,-0.001222,-0.003162,-0.000467,0.000156,-0.000384,0.001497,0.001032,0.000394,-0.002099,0.002067,0.00052
0,-5e-06,4.8e-05,2.7e-05,1.4e-05,-2.6e-05,4.8e-05,5.2e-05,2e-05,-3.2e-05,6e-06,-8e-06,1.9e-05,4.5e-05,-0.000122,5.5e-05,1.4e-05,-5.4e-05,6.3e-05,1.5e-05,5.8e-05,-6.5e-05,-0.000142,1.2e-05,3.7e-05,3.3e-05,-2.5e-05,-7.4e-05,3.3e-05,1.7e-05,-1.2e-05,2.1e-05,9.7e-05,-1.5e-05,-2.4e-05,2.8e-05,-1e-05,-2.2e-05,2.9e-05,3.4e-05,5.3e-05,3.3e-05,0,-2.1e-05,-0.000104,-1.8e-05,8e-05,4.5e-05,-5.4e-05,8e-06,1e-06,-6.3e-05,2.5e-05,-1.5e-05,-2.1e-05,2e-06,-4e-06,-3.9e-05,-0.000229,0.000323,0.000202,0.000114,-0.000829,0.001412,-0.00159,0.000859,0.00116,0.000657,0.001511,0.001058,0.000453,0.000412,0.000303,-0.003792,0.001651,0.000323,-0.001091,-0.000684,-0.000958,0.00025,-0.000202,-0.001708,0.001985,0.003766,-0.000969,-0.001959,0.00075,0.001595,-0.000806,-0.002823,0.000896,-0.002996,-0.001424,0.00077,-0.000321,0.001868,0.000158,0.000485,-0.000752,-0.000581,0.000426,0.001563,4.9e-05,-0.001414,0.000117,-0.000869,0.00106,0.000986,-0.002888,-0.001372,0.000301,0.000939,-6.5e-05,0.001042,-6.5e-05,-0.000182,-0.000136,0.000438,1e-04,-0.0016,0.001146
-6e-06,-1.6e-05,1.5e-05,6e-05,4.2e-05,-1.7e-05,-3.2e-05,4.1e-05,1.6e-05,-2.2e-05,3.6e-05,1.1e-05,-6.1e-05,-8e-06,-3.8e-05,3.5e-05,6e-06,4.4e-05,4.8e-05,-2.8e-05,7e-06,2.7e-05,5.1e-05,2.7e-05,-7.6e-05,-3.6e-05,-3.5e-05,4.8e-05,2.4e-05,-5e-06,3e-06,-1.1e-05,-9e-06,-1e-05,-3e-06,3.3e-05,-1.8e-05,2.1e-05,-4e-06,-3.3e-05,-1.9e-05,-3.7e-05,-1.2e-05,4.2e-05,9.6e-05,-1.8e-05,1.7e-05,-3e-05,1.8e-05,-1.4e-05,1.4e-05,3.3e-05,-4.8e-05,-6.3e-05,1.1e-05,-1e-06,0.00017,0.000107,-6.9e-05,-0.000198,0.000378,-0.000578,0.000778,-0.000386,0.00078,-0.001486,0.000606,-0.000524,-0.00015,-0.00016,-0.001441,0.000767,0.003235,0.002504,0.000725,0.001636,-0.000424,0.002734,0.001464,0.000548,0.000583,-4.8e-05,0.001709,-0.003558,0.003299,0.001212,-0.000435,-0.000724,0.00091,-0.001095,-0.000125,0.003013,0.002613,-0.001577,-0.000602,-0.00067,0.001509,-0.000288,0.001035,0.000332,0.000228,0.00036,0.000314,0.000548,-0.00213,0.002456,-0.000961,-0.001748,0.002216,0.000628,0.000338,0.001716,0.000563,-0.001054,-0.000245,-0.001132,-0.000802,-0.001072,0.001378,0.001888,-0.000976
-2.4e-05,-6e-06,1.4e-05,-2.3e-05,2.6e-05,4e-06,-1.6e-05,-1e-06,1.5e-05,-1.5e-05,-5.4e-05,-8e-06,-1.2e-05,-4.5e-05,-3.2e-05,-1.6e-05,-2.6e-05,-3.4e-05,-2.1e-05,4.3e-05,3e-06,-2.5e-05,-2.6e-05,1.4e-05,-1.3e-05,5e-06,1.3e-05,3.3e-05,1.1e-05,-9e-06,5e-06,-6.3e-05,-2.2e-05,-1.2e-05,2e-06,-6e-05,2.2e-05,-3.3e-05,1e-05,-2.4e-05,-2.5e-05,1.1e-05,-3.2e-05,-7e-06,-2e-06,3.7e-05,-3.4e-05,-1.7e-05,1.5e-05,-6.2e-05,-2.3e-05,-3e-06,-1.7e-05,-1e-05,-2e-05,2.2e-05,-4.5e-05,0.00013,7.7e-05,3.1e-05,9e-06,-0.000278,0.000104,0.000778,-0.000294,0.000142,0.001506,-0.000944,0.000264,-0.001082,-0.001378,-0.001058,-0.001467,-0.000582,0.000263,-0.000361,-0.00031,-0.00101,-0.000845,-0.001338,-0.002257,0.001542,-0.002163,0.001967,-0.000594,-0.000623,-0.002052,-0.000281,-0.001116,2.3e-05,-0.000119,0.000189,0.002709,-0.001042,0.000609,0.000755,-0.001025,0.000757,-0.000625,-0.000507,-0.000691,-0.001414,-0.000632,-0.000536,0.000766,-0.000716,0.00069,0.002399,0.000356,-0.001013,-0.001358,0.00014,-0.00143,0.000964,0.000401,0.000275,0.000696,0.000206,-0.001204,-0.000971,0.000455
8e-06,2e-06,8e-06,1.1e-05,-1.9e-05,-1.7e-05,2.1e-05,-1.7e-05,1.1e-05,-2.8e-05,6e-06,0,1.1e-05,1.2e-05,3e-06,7e-06,2.2e-05,1.6e-05,-3.2e-05,-2.4e-05,-8e-06,-7e-06,7e-06,-5.1e-05,5.4e-05,0,-2e-05,-2.5e-05,2e-06,9e-06,-1.7e-05,2.1e-05,3.6e-05,6e-06,-1.1e-05,-1.3e-05,-2.5e-05,-1.6e-05,9e-06,-2.4e-05,1.5e-05,2.8e-05,1.5e-05,-2.9e-05,2.2e-05,2.3e-05,0,-2e-06,-1e-06,-3.7e-05,2.6e-05,-7e-06,2e-06,2e-05,-4e-06,2.1e-05,-3.4e-05,5.6e-05,5.5e-05,-7e-05,-0.000404,0.000347,0.000561,0.00012,-0.000114,0.000529,-0.002222,0.000725,-0.002266,0.000683,-0.000242,0.000713,-0.00019,-0.00024,-0.001177,0.0011,-0.000321,0.001691,0.000272,0.000142,0.000401,-1.5e-05,0.000936,-0.003152,-0.001875,-7.5e-05,0.001537,0.000561,0.001167,-0.000329,-0.000275,-0.000973,-0.002262,-0.000312,0.00094,-0.000406,0.001331,-8.6e-05,-0.000964,0.000394,0.000928,0.00084,0.000431,0.000413,5.2e-05,-0.001283,-0.001453,-0.001072,-0.000229,0.000498,0.000321,-0.001333,0.000769,0.00085,-2.7e-05,0.000667,-0.000633,0.000431,0.000164,0.001117,-0.000938
1.5e-05,-3e-06,-1.3e-05,3e-06,1.3e-05,-2e-06,-6e-06,-1.1e-05,1.1e-05,1.3e-05,1e-05,6e-06,2.5e-05,2.5e-05,-3e-05,-9e-06,-1.2e-05,7e-06,6e-06,2e-06,-9e-06,1e-06,6e-06,2.9e-05,1e-05,-2e-06,1.6e-05,4e-06,-1.2e-05,1.2e-05,1e-05,0,-1.5e-05,2e-06,-7e-06,1.8e-05,-1e-06,3e-06,9e-06,1.1e-05,-1.5e-05,-2.8e-05,3.3e-05,2.8e-05,3.8e-05,-1.3e-05,-1.2e-05,2e-05,1.4e-05,2.2e-05,-1.2e-05,4.9e-05,-1.2e-05,-6e-06,2e-06,8e-06,-2.5e-05,-1.2e-05,-4e-06,-9.2e-05,-1.7e-05,1.5e-05,-0.000458,-0.001052,-0.000186,0.000344,0.001082,0.000281,-0.000411,-0.001235,0.000721,-0.001027,0.001494,0.000434,0.000153,0.000974,-0.001737,-0.000392,-1.1e-05,0.001516,1.8e-05,-0.000949,-8.8e-05,-0.000265,-0.00116,0.000378,0.000402,-0.001326,0.001071,0.001427,-8.1e-05,0.0018,0.000532,0.000911,-0.00048,9.2e-05,-0.001291,-0.001231,0.000669,-0.000418,-0.000786,1.3e-05,-0.000225,1.5e-05,0.000413,0.000872,0.000652,0.00068,0.00014,-0.001227,0.000144,0.000323,3.9e-05,-0.00098,3.6e-05,-0.001168,-2e-04,-0.000437,0.000662,-0.000965,0.000457
-1e-05,0,8e-06,-2.1e-05,3e-06,-1.7e-05,6e-06,1.3e-05,5e-06,3e-06,-3e-06,3e-06,9e-06,1e-06,-5e-06,-2.9e-05,9e-06,-5e-06,1e-05,1.9e-05,-1e-05,-1.8e-05,1.6e-05,-1e-06,1e-06,5e-06,0,-1.1e-05,-2.8e-05,-3e-06,-1.3e-05,-1.2e-05,-1.9e-05,-2e-06,3e-06,-4.5e-05,2e-06,0,6e-06,5e-06,3e-06,7e-06,-3.1e-05,-1.2e-05,-8e-06,0,2e-06,-1.4e-05,-9e-06,-1.9e-05,-5e-06,-1.1e-05,1.4e-05,-1.7e-05,5e-06,-2e-05,4e-05,-9.2e-05,-1e-06,2.3e-05,0.000293,3.3e-05,1.3e-05,-0.000145,0.000241,0.000404,-0.000597,0.000644,0.001834,0.000772,0.000325,0.000567,-0.001464,-0.00129,-0.000737,-1e-06,0.002158,0.000304,0.000103,-0.00021,0.000679,0.000751,0.000175,-0.000224,0.001358,-0.000458,-0.000944,0.000949,-0.000962,-0.000377,9e-05,0.001376,-7.8e-05,-2.6e-05,-0.000324,2e-05,0.000669,0.001589,0.000292,0.000265,1e-05,-0.000508,0.000217,9.2e-05,-0.000727,-0.00054,-0.000114,-0.001195,0.000851,0.001081,0.000112,7.8e-05,4.2e-05,0.000517,0.000102,0.000796,0.00128,-0.000546,-4e-04,0.000496,0.000135
1e-05,-1e-06,8e-06,-5e-06,-1.3e-05,-4e-06,1e-06,9e-06,1e-06,7e-06,-1.4e-05,-3e-06,-5e-06,-1.6e-05,1.6e-05,-1e-05,3e-06,-4e-06,1e-06,-2.4e-05,-2e-06,1.8e-05,-8e-06,0,1.2e-05,1e-06,1.2e-05,6e-06,5e-06,3e-06,9e-06,1e-05,9e-06,-4e-06,0,3e-05,-3e-06,8e-06,8e-06,8e-06,9e-06,7e-06,-2e-06,-1.2e-05,-1e-06,-1.4e-05,-1.1e-05,-8e-06,-5.3e-05,-2e-05,4e-06,-2.2e-05,-2.6e-05,-1.6e-05,7e-06,1.3e-05,2.7e-05,-5.9e-05,1.5e-05,3.5e-05,3.6e-05,-5.3e-05,-0.000376,0.000204,0.000268,-0.000584,9e-06,-0.001108,-0.000441,0.000549,0.000457,-0.00052,-0.000679,0.001776,0.000265,-0.000154,-0.001514,-0.00055,-0.000496,0.000264,-0.000266,-0.000494,0.000444,-0.000816,0.000726,0.000866,0.000446,0.000151,0.000536,0.000131,-8.2e-05,-0.00254,-0.001025,6e-04,-0.000376,-9.8e-05,-0.00011,-0.000369,-0.000338,-0.000172,0.000562,0.000536,-0.000132,-0.000574,1.7e-05,-0.000598,-0.00023,0.000788,-0.000702,-0.000858,-0.000308,-0.00038,-0.000658,-0.000224,-0.000171,9.6e-05,-0.000888,0.000881,-3e-05,-0.000544,7.4e-05
-1.4e-05,0,-6e-06,-2e-06,-1.7e-05,-5e-06,-3e-06,8e-06,-6e-06,-9e-06,-1e-06,-1e-06,-1.4e-05,-5e-06,-8e-06,-9e-06,-1.7e-05,1.1e-05,5e-06,1.5e-05,1.5e-05,2e-06,-1e-06,-1.4e-05,-2e-05,-1e-06,-6e-06,1.4e-05,-5e-06,1e-06,-6e-06,0,-2e-06,-2e-06,-1e-06,-1.6e-05,0,-1.1e-05,4e-06,8e-06,-1.5e-05,-1.5e-05,9e-06,1.5e-05,-8e-06,-1e-06,1.6e-05,4e-06,-1.6e-05,5e-06,-9e-06,-4e-06,4e-06,2e-06,1.1e-05,-1e-06,-5.7e-05,1.3e-05,-9e-06,-2e-06,-0.000213,-3.1e-05,0.000201,0.000372,-0.000333,-0.000121,-7.8e-05,0.00023,-0.001499,-0.000851,0.000103,0.000365,0.001295,-0.001681,0.000535,-0.000471,0.000608,0.000433,0.00077,-0.000232,-0.000147,-0.000129,0.000424,0.001152,-0.000798,-0.000738,-0.000549,-0.00085,-0.001029,-0.000509,0.000255,0.000384,-4e-05,-0.000346,0.000179,8.3e-05,-0.000105,-0.000428,-3.5e-05,0.000105,-0.000989,-0.000264,1e-05,-0.000234,0.000382,0.001062,0.000593,-0.00058,0.000656,0.000897,-0.000239,0.000249,-0.000256,0.000196,-1e-04,-0.000902,-0.000184,0.000162,-6.2e-05,0.000557,1.5e-05
-1e-05,-1e-06,7e-06,-4e-06,1e-06,-7e-06,-2e-06,-8e-06,-5e-06,-3e-06,1.3e-05,-1e-06,-1.2e-05,1e-06,1.3e-05,1e-06,1.4e-05,-1e-05,-3e-06,-5e-06,8e-06,-7e-06,1e-05,-1.2e-05,-2.8e-05,-1e-06,-4e-06,-2.1e-05,-1e-06,3e-06,3e-06,5e-06,-1e-06,-1e-06,-1e-06,3.1e-05,0,1.5e-05,7e-06,2e-06,9e-06,1e-05,-8e-06,-3e-06,-1e-05,6e-06,-2.3e-05,5e-06,1.2e-05,2e-06,0,1.3e-05,-1.4e-05,6e-06,-5e-06,4e-06,-7e-06,6.1e-05,-3.3e-05,2.5e-05,-7.1e-05,-1.7e-05,-5.8e-05,4.1e-05,0.000266,0.000136,0.000642,-0.000361,0.000944,0.000511,-0.00035,0.000341,-0.000243,0.001415,-0.000528,-0.000648,-0.000922,-0.000433,-0.000785,-0.000236,-0.000319,0.000404,-0.000494,-0.00035,-0.000559,2.5e-05,-0.00049,0.000662,-0.000205,-0.000114,-0.000565,0.000541,0.00029,-2.9e-05,0.000128,-9.7e-05,3.5e-05,0.000118,0.000243,-2.4e-05,0.000917,2.7e-05,-1.1e-05,8.3e-05,-0.000439,-0.000481,-0.000279,-0.000197,-0.000446,-0.000769,0.000143,0.000692,-0.000168,5e-05,4.9e-05,0.00118,0.000789,-0.000817,0.000352,-0.000463,-0.000177
-1.1e-05,-1e-06,-4e-06,1e-06,1.8e-05,3e-06,7e-06,-7e-06,-7e-06,-4e-06,-3e-06,-1e-06,-2e-06,5e-06,1.6e-05,6e-06,-7e-06,1.1e-05,1e-06,1e-06,-1.2e-05,1.2e-05,5e-06,1.4e-05,1.8e-05,0,1.1e-05,-6e-06,4e-06,1e-06,-1e-06,-1.2e-05,5e-06,2e-06,-2e-06,-7e-06,-3e-06,-8e-06,3e-06,-3e-06,-4e-06,4e-06,1.5e-05,-1.4e-05,-3.2e-05,5e-06,5e-06,-9e-06,9e-06,2e-06,8e-06,-1e-05,-1.3e-05,2e-06,6e-06,-8e-06,3.3e-05,4.2e-05,-1.3e-05,6e-06,0.000159,2.5e-05,0.000281,-4.7e-05,-3.9e-05,2.7e-05,-0.000543,0.000726,0.000345,3.2e-05,-0.000427,-0.000578,-0.000329,-0.001146,-0.000474,0.000171,7.5e-05,0.000707,9.4e-05,0.00011,5.1e-05,-0.000678,0.000166,0.000522,0.000702,-0.000254,0.000429,-0.000568,0.000127,0.000419,0.000496,0.000372,-0.000106,-0.000225,-0.000224,2.7e-05,-0.000249,0.000649,-6.6e-05,7.9e-05,-0.000454,0.000215,9.1e-05,-1e-05,0.000586,-0.000363,4.1e-05,0.000187,-0.000377,0.000102,-8.2e-05,-0.000817,-0.000157,-0.000192,1.2e-05,-0.000902,-0.000635,0.000547,-0.000295,0.000329,-0.000156
5e-06,-1e-06,-7e-06,6e-06,7e-06,-1e-06,-8e-06,-1e-06,-3e-06,-5e-06,-7e-06,1e-06,1.4e-05,-3e-06,9e-06,1.1e-05,-2e-06,-1.1e-05,0,-3e-06,-6e-06,-1.7e-05,-1e-05,-1.2e-05,9e-06,-2e-06,-7e-06,1e-05,-5e-06,-9e-06,-5e-06,-9e-06,5e-06,-1e-06,0,1.7e-05,3e-06,-2e-06,5e-06,-1.4e-05,-3e-06,-1.2e-05,-1.3e-05,1.2e-05,8e-06,3e-06,4e-06,-2e-06,9e-06,-1.2e-05,-1.3e-05,-7e-06,-4e-06,-7e-06,-2e-06,4e-06,4e-06,0,2.1e-05,-2.4e-05,8.9e-05,5.9e-05,-9.2e-05,-0.000176,-6.4e-05,-3.5e-05,-0.000177,-0.000456,-0.000631,-0.000346,-8.8e-05,0.000563,0.000416,0.00058,-0.00037,0.000162,-5e-04,-0.000806,0.000487,-0.000502,-0.000179,0.000571,6.3e-05,-0.000123,0.000872,0.000194,0.000473,0.000169,2.6e-05,-0.000126,-0.000398,0.000656,0.00052,-0.000234,0.00034,3.7e-05,0.000143,-0.000786,-0.000141,-0.00016,0.000111,-0.000278,-7.6e-05,-0.000142,-0.000402,-7.2e-05,-0.000195,-2.7e-05,0.000871,-6.9e-05,9.9e-05,5.3e-05,-3.9e-05,0.00021,0,0.000315,0.000174,9.3e-05,0.000191,-0.00024,0.000295
-1.2e-05,0,2e-06,6e-06,-1.1e-05,4e-06,-3e-06,3e-06,-4e-06,-4e-06,3e-06,0,3e-06,-9e-06,5e-06,8e-06,8e-06,1e-05,2e-06,1.1e-05,-1e-06,-3e-06,-5e-06,-1e-06,-1.1e-05,1e-06,4e-06,-3e-06,-1e-05,1e-06,5e-06,9e-06,-9e-06,-3e-06,2e-06,-1.5e-05,-3e-06,-3e-06,3e-06,-2e-06,5e-06,2e-06,6e-06,2e-06,-2.1e-05,-4e-06,-1e-06,3e-06,1e-05,4e-06,1.3e-05,5e-06,-8e-06,-3e-06,1e-06,-2e-06,-1.6e-05,-3.8e-05,2.2e-05,-5e-06,-1e-04,-1.6e-05,6.2e-05,-0.000107,1.8e-05,-0.000333,0.000203,0.00021,3.9e-05,0.000311,-0.00038,-0.000592,-8.4e-05,4.3e-05,0.000396,-0.000821,-0.000191,0.00092,-0.000719,4.8e-05,0.000386,0.000104,-0.000387,-0.000144,-0.000493,0.000231,-0.000953,0.00035,7.9e-05,0.000373,0.000394,-0.00107,0.000733,0.000185,7.3e-05,-0.000108,0.000288,0.000205,0.000266,0.000146,-5e-06,0.000185,4e-06,0.000188,-0.000272,0.000396,0.000131,0.000148,-0.000106,-0.00025,-0.000357,0.000125,2e-06,-0.000125,-3e-06,-2.8e-05,0.000159,-0.00037,-0.000103,0.000269,-0.000149
8e-06,0,-3e-06,-1e-06,-6e-06,1e-06,6e-06,6e-06,2e-06,1.3e-05,7e-06,0,5e-06,6e-06,0,-1e-06,-6e-06,-6e-06,-2e-06,-1.6e-05,1e-06,3e-06,1e-06,-4e-06,2.4e-05,-1e-06,-6e-06,4e-06,2e-06,1e-06,-4e-06,-6e-06,1e-06,0,-2e-06,-1e-06,2e-06,-3e-06,2e-06,-4e-06,-6e-06,6e-06,-4e-06,-1.1e-05,-2e-06,-2e-06,0,0,-1e-05,2e-06,-1.1e-05,-5e-06,4e-06,4e-06,-4e-06,0,-1.5e-05,-3.5e-05,3e-06,-2e-06,-8.5e-05,-3.9e-05,-0.000209,-9.8e-05,-1e-06,1.1e-05,-8.5e-05,-0.000385,-0.000497,-0.000164,0.000368,0.000596,-0.000311,-0.000327,-0.000139,-0.000387,6e-06,-0.000936,0.000543,0.000299,4.4e-05,-0.000373,-4e-06,-2e-06,-0.001013,-0.000297,0.001085,-0.000545,0.000547,-0.000351,-0.000442,0.00036,-0.000516,0.000173,-0.000324,8.4e-05,-0.000403,0.000111,6.1e-05,-4.3e-05,-2.7e-05,-1.8e-05,-3.8e-05,-0.000223,0.000551,-0.000387,0.000107,-0.000262,-0.000119,0.000473,0.000266,0.000107,0.000136,3.5e-05,-9e-06,2.3e-05,-0.000334,-6.3e-05,7e-05,-0.000246,0.000172
0,-1e-06,-3e-06,3e-06,1e-06,2e-06,-4e-06,-1e-06,2e-06,1e-06,-4e-06,1e-06,-6e-06,-6e-06,-1e-06,1e-06,3e-06,4e-06,-1e-06,1.5e-05,5e-06,-1.6e-05,-7e-06,2e-06,-5e-06,2e-06,1e-06,-4e-06,1e-06,-4e-06,3e-06,-3e-06,7e-06,0,-1e-06,1.7e-05,-1e-06,6e-06,3e-06,7e-06,3e-06,-1e-05,3e-06,6e-06,1.1e-05,-4e-06,0,-1e-06,-1.7e-05,-2e-06,4e-06,0,0,4e-06,-5e-06,1e-06,1.5e-05,-6e-06,-1.3e-05,-6e-06,7e-05,-1.5e-05,5.8e-05,0.000284,1.8e-05,0.000199,0.000158,0.000263,0.000272,0.000106,0.000145,-0.000655,0.000183,0.000377,0.000439,0.00078,-0.00039,0.000835,-0.000204,-2.3e-05,-9.4e-05,0.000165,6.9e-05,-0.000113,0.000178,0.000324,-0.000252,0.000405,-0.000948,-4.2e-05,0.000391,0.000451,0.000256,5.4e-05,-2.5e-05,-2.1e-05,0.000368,0.000164,-0.000301,-5e-05,3.4e-05,-0.000146,6.6e-05,-4.7e-05,-0.000352,1.5e-05,-0.000243,0.000541,-0.000135,-2e-04,5.8e-05,-0.00048,7.4e-05,0.000101,-1.5e-05,-0.000234,0.000215,0.000298,-0.00012,0.000224,-0.000235
0,0,1e-06,-3e-06,3e-06,3e-06,-1e-06,-3e-06,3e-06,-2e-06,-5e-06,0,-2e-06,1e-06,-5e-06,-7e-06,-1e-06,-3e-06,-1e-06,-5e-06,0,3e-06,-1e-06,4e-06,-1.9e-05,-1e-06,-1e-06,-6e-06,4e-06,0,-3e-06,3e-06,-1e-05,1e-06,1e-06,-2e-06,0,-5e-06,0,1e-06,0,7e-06,0,5e-06,-1.2e-05,0,-4e-06,-4e-06,1e-06,-2e-06,1e-06,9e-06,0,0,-4e-06,-1e-06,1.5e-05,2.1e-05,-8e-06,8e-06,7.4e-05,3.2e-05,-6.5e-05,0.000129,-7.2e-05,7.4e-05,-0.000133,-2.6e-05,0.000364,2.4e-05,0.000204,0.000439,0.000266,-0.000464,-0.000314,0.000277,-2.3e-05,-0.000742,-0.000191,-6.8e-05,-0.000177,-0.000317,3e-06,1.5e-05,0.000714,-0.000263,-0.00027,-0.000162,0.000601,-7e-06,-0.000394,-0.000598,4e-05,5.7e-05,9.2e-05,0,-0.000341,-0.000462,0.000101,5.1e-05,-3.8e-05,0.000189,-2.7e-05,-0.000172,0.00021,5.9e-05,0.000147,-0.000385,-4e-06,0.000368,-0.000181,0.00063,-0.000121,-0.000125,-3e-06,0.000505,-5e-06,-8.2e-05,0.000115,-0.000198,3.5e-05
-4e-06,0,-5e-06,-4e-06,0,2e-06,3e-06,-3e-06,2e-06,7e-06,3e-06,0,-3e-06,5e-06,-9e-06,-5e-06,-3e-06,3e-06,-1e-06,-3e-06,-2e-06,-6e-06,-2e-06,-1e-05,9e-06,0,-3e-06,1.1e-05,3e-06,1e-06,1e-06,-1e-06,4e-06,-2e-06,0,-1.5e-05,0,4e-06,3e-06,6e-06,-2e-06,0,-5e-06,-8e-06,1.5e-05,4e-06,-1e-06,5e-06,1.1e-05,-6e-06,-4e-06,-1e-06,1e-06,-3e-06,-4e-06,2e-06,-1.4e-05,2.9e-05,2e-06,6e-06,-4.2e-05,1.3e-05,0.00015,-8.6e-05,7.1e-05,9.5e-05,0.00026,0.000109,-0.000655,-0.000204,2.4e-05,-0.000128,-0.000192,0.000493,-0.00016,-0.000117,0.000149,0.000523,0.000313,-0.00016,3.2e-05,0.000226,-0.000109,0.000535,2.6e-05,0.000269,-0.000191,-0.00026,-0.000765,-0.000132,0.000416,-0.000153,-0.000464,-0.000209,8.9e-05,2.5e-05,0.000204,0.000307,0.000144,-3.5e-05,-9e-06,-0.000119,1e-05,3.8e-05,-2.2e-05,-7e-05,-0.000162,0.000347,-8e-06,-0.000143,0.000117,-2e-04,2.4e-05,6.7e-05,5e-06,-0.000606,-8.3e-05,-9.2e-05,-6.7e-05,0.000152,-1e-06
2e-06,0,-1e-06,-1e-06,-1e-06,2e-06,0,0,2e-06,-3e-06,3e-06,0,-2e-06,-5e-06,-4e-06,-3e-06,5e-06,-2e-06,1e-06,6e-06,-3e-06,-1.1e-05,0,3e-06,-4e-06,1e-06,5e-06,-1e-06,1e-06,0,0,1e-06,7e-06,-1e-06,-1e-06,1.3e-05,-1e-06,-4e-06,0,-3e-06,2e-06,-6e-06,8e-06,2e-06,-6e-06,0,4e-06,-2e-06,8e-06,3e-06,4e-06,-5e-06,1e-06,-1e-06,-2e-06,-2e-06,-1e-05,1e-05,3e-06,-2e-06,-6.4e-05,-1.2e-05,-3.2e-05,-0.000115,-4.5e-05,-0.000135,-0.00044,-2.6e-05,-0.000126,0.000193,-0.000113,-4e-06,-0.000104,-0.000347,-9.6e-05,0.000324,-0.000297,-0.000428,-0.000109,-6.9e-05,2.3e-05,4.2e-05,0.000131,-0.000381,-0.000632,-0.000265,0.000606,0.000494,0.00034,0.000192,-0.000305,0.000675,-4.6e-05,-0.000181,-2.5e-05,-3.4e-05,9.2e-05,0.00019,-0.000158,6e-06,0.000123,-3.7e-05,-3e-05,-2e-05,-0.000203,-0.00019,-1e-05,-0.000331,0.000175,-7e-06,-0.000108,-0.000204,7.9e-05,1.3e-05,1e-05,0.000538,-4.6e-05,4.9e-05,-1.6e-05,-0.000116,5.8e-05
-5e-06,0,0,-2e-06,5e-06,1e-06,-1e-06,3e-06,0,-5e-06,-2e-06,0,0,2e-06,-5e-06,-2e-06,-6e-06,0,2e-06,-3e-06,-2e-06,6e-06,-3e-06,-3e-06,-5e-06,-1e-06,-5e-06,-6e-06,-4e-06,2e-06,-2e-06,-6e-06,-1.1e-05,0,1e-06,-1e-05,0,4e-06,1e-06,0,-2e-06,4e-06,-3e-06,4e-06,1e-06,0,-5e-06,-3e-06,8e-06,-4e-06,-2e-06,2e-06,-1e-06,2e-06,-2e-06,1e-06,1e-05,-1.2e-05,0,4e-06,1.8e-05,-8e-06,6.4e-05,-9.5e-05,-1e-06,-3.6e-05,0.000256,-0.000155,0.000547,-0.000185,-0.000305,0.000107,0.000167,7.2e-05,0.000308,1.6e-05,4e-06,9.5e-05,-0.000112,2.6e-05,2.5e-05,-3e-05,-0.000157,0.000817,-9e-05,2.8e-05,-0.000568,-0.000376,-1.3e-05,-0.000138,0.000259,-0.00019,2.4e-05,2.7e-05,-5.4e-05,1.9e-05,-0.000241,-0.000435,-7e-06,1.6e-05,-0.000183,0.000175,1.8e-05,-5.5e-05,0.000243,0.000106,8.9e-05,0.000356,-0.000289,-0.000117,4.4e-05,-4.6e-05,0.000206,-3.4e-05,1e-05,-0.000359,0.00015,0.000128,0.000116,8.2e-05,7.2e-05
-1e-06,0,-2e-06,1e-06,0,1e-06,2e-06,1e-06,0,3e-06,-5e-06,0,4e-06,-1e-06,-6e-06,3e-06,3e-06,1e-06,0,-1e-06,2e-06,-8e-06,4e-06,2e-06,1.5e-05,1e-06,3e-06,2e-06,3e-06,-2e-06,2e-06,-1e-06,4e-06,-1e-06,0,-1e-06,0,-2e-06,0,-4e-06,1e-06,3e-06,-3e-06,-5e-06,0,-2e-06,4e-06,1e-06,0,-3e-06,-1e-06,3e-06,5e-06,2e-06,0,0,7e-06,-2e-05,0,-3e-06,5.9e-05,-3e-06,-0.00011,6.6e-05,1.3e-05,2.9e-05,-0.000125,7.6e-05,-0.000172,0.000115,2.8e-05,-0.000201,-0.000108,0.000177,0.000103,-0.000134,-0.000161,5.4e-05,0.000223,-4.9e-05,-6e-06,6e-06,-1.8e-05,-0.000641,0.000676,0.000116,0.000456,0.000117,0.000337,0.000138,-0.000163,0.000319,-3e-05,-3.9e-05,0.000134,-1.3e-05,0.000127,0.000131,0.000108,-3.7e-05,0.000135,-0.000183,4e-06,3.1e-05,-0.000123,8.1e-05,-3.9e-05,-0.000385,0.000104,5e-06,4.1e-05,0.000371,8.9e-05,1e-06,-2e-06,0.000214,-3.8e-05,-0.000152,-0.000141,-5.6e-05,-6.2e-05
0,0,0,1e-06,-4e-06,0,-1e-06,0,-2e-06,1e-06,4e-06,0,3e-06,1e-06,-1e-06,3e-06,2e-06,-1e-06,-1e-06,4e-06,2e-06,-1e-06,2e-06,-3e-06,0,-1e-06,-1e-06,-2e-06,1e-06,1e-06,-2e-06,3e-06,4e-06,0,0,-3e-06,0,-3e-06,0,0,1e-06,-6e-06,3e-06,0,-9e-06,-3e-06,-2e-06,1e-06,-1.1e-05,-2e-06,2e-06,-4e-06,-1e-06,-1e-06,-1e-06,0,-4e-06,-1e-05,3e-06,-3e-06,-6e-06,5e-06,2e-05,2.1e-05,-1.3e-05,3.2e-05,0.000199,-3e-05,-0.000375,0.000109,-8.4e-05,0.000288,-0.00015,-0.000454,6.3e-05,-0.00011,-0.000172,-0.000214,-0.000153,-1.3e-05,3.4e-05,-0.000115,-6e-06,0.000322,0.000199,-0.000126,-0.000114,0.000119,-0.000287,-3.5e-05,7.8e-05,-0.000666,0.000189,0.000127,-0.000101,8e-06,-5.3e-05,0.000252,-0.00011,3.5e-05,-1.2e-05,6.4e-05,7e-06,-7.7e-05,0.000107,-0.000314,7.1e-05,0.000166,0.000149,-0.00011,-0.000166,-0.000408,5.1e-05,-2.3e-05,-1.4e-05,-0.000111,-0.000173,-3.5e-05,7.3e-05,3.7e-05,-7.6e-05
-2e-06,0,0,0,-3e-06,0,-1e-06,-2e-06,-1e-06,-1e-06,2e-06,0,3e-06,3e-06,-1e-06,5e-06,-5e-06,1e-06,0,-2e-06,0,4e-06,0,-4e-06,-6e-06,0,1e-06,3e-06,2e-06,2e-06,2e-06,-5e-06,-8e-06,0,1e-06,6e-06,0,4e-06,0,0,-1e-06,5e-06,1e-06,4e-06,0,2e-06,-1e-06,-1e-06,-8e-06,-1e-06,-3e-06,-1e-06,6e-06,-2e-06,2e-06,1e-06,-7e-06,5e-06,2e-06,0,-4.9e-05,6e-06,-6.6e-05,0.000116,2.7e-05,-2e-06,-0.000234,0.000186,9.7e-05,-0.000237,0.000169,-0.000326,0.000299,0.000634,-9.1e-05,-0.000293,4.2e-05,0.000281,-4.7e-05,0.000113,-4.2e-05,0.000134,-3.3e-05,-0.00031,-0.000532,0.000193,-8.6e-05,-0.00034,0.00054,-2.4e-05,1.1e-05,-9.6e-05,0.000275,8e-05,-0.000125,-2e-06,-9e-06,-0.00017,-3.3e-05,-1.9e-05,-0.000115,8e-05,-1.4e-05,-8.5e-05,-0.000134,0.000129,-0.000135,-7.2e-05,-0.000175,0.000269,0.000122,0.000207,9.6e-05,7.4e-05,-4e-06,4.6e-05,0.000263,0.000118,-2.3e-05,-2.5e-05,3.6e-05
0,0,-1e-06,2e-06,1e-06,-1e-06,1e-06,-1e-06,-1e-06,3e-06,-3e-06,0,-4e-06,-2e-06,2e-06,3e-06,3e-06,-1e-06,0,-4e-06,-1e-06,-1e-05,2e-06,4e-06,3e-06,0,2e-06,2e-06,2e-06,-2e-06,-2e-06,1e-06,6e-06,0,-1e-06,-4e-06,0,-4e-06,0,2e-06,1e-06,-1e-06,1e-06,-4e-06,-9e-06,0,1e-06,0,3e-06,0,1e-06,2e-06,0,-1e-06,1e-06,-2e-06,1e-06,1.3e-05,-3e-06,0,-3e-06,0,8e-05,1e-06,-4.5e-05,-0.000116,0.000222,-0.000155,3.7e-05,0.000196,7.1e-05,0.000287,-3.2e-05,-0.000671,-0.000174,-0.000179,-0.000422,-0.00029,0.000208,1.4e-05,-2.7e-05,-0.000144,-4.3e-05,-0.000294,-0.000421,-0.000284,-4.4e-05,0.00038,-0.000802,2.7e-05,-2.6e-05,0.000506,3e-06,1.4e-05,0.00012,2e-06,0.000122,-0.000226,0.000108,2e-06,0.000156,-0.000135,3e-06,-1.6e-05,3.3e-05,6.3e-05,5e-05,4.1e-05,1.3e-05,-0.000288,-1e-05,7.2e-05,2.4e-05,-4.2e-05,7e-06,-1.3e-05,-0.000134,-6.8e-05,3.4e-05,3.5e-05,2e-05
-2e-06,0,0,0,3e-06,-1e-06,-1e-06,1e-06,-1e-06,-1e-06,-2e-06,0,-3e-06,-1e-06,3e-06,0,-1e-06,1e-06,0,8e-06,-2e-06,3e-06,0,-4e-06,-1e-06,0,-3e-06,-7e-06,1e-06,0,1e-06,0,0,0,0,2e-06,0,4e-06,-1e-06,2e-06,-1e-06,-3e-06,-4e-06,-1e-06,1e-06,1e-06,0,-1e-06,6e-06,-5e-06,1e-06,-2e-06,1e-06,1e-06,2e-06,2e-06,8e-06,9e-06,-4e-06,0,3.5e-05,-5e-06,-1.5e-05,-7.5e-05,4.8e-05,6e-06,-0.000194,2e-06,1.6e-05,-7.2e-05,0.000118,-0.000213,-0.000224,0.000595,4.2e-05,0.000192,0.000269,0.000232,-0.000257,-5.1e-05,4.7e-05,7.4e-05,5.8e-05,0.000256,0.000412,0.000222,0.00025,-0.000186,0.000599,-9.3e-05,7.5e-05,-0.00016,-4.4e-05,-5.6e-05,5.5e-05,4e-06,-0.000173,0.000337,-1.3e-05,1.6e-05,-8.9e-05,9.1e-05,-7e-06,-4e-05,0.000131,-0.000212,-3e-06,-4.5e-05,-6e-05,0.000478,-4.9e-05,-2.8e-05,-4.3e-05,-4.4e-05,2e-06,4e-06,-9.1e-05,-1.4e-05,-5.4e-05,-3.1e-05,3.2e-05
1e-06,0,0,0,1e-06,-1e-06,-1e-06,1e-06,0,1e-06,3e-06,0,-4e-06,0,3e-06,-2e-06,-2e-06,0,0,-7e-06,0,-2e-06,1e-06,1e-06,-9e-06,0,3e-06,2e-06,-3e-06,0,0,-1e-06,-5e-06,0,1e-06,0,0,-3e-06,0,0,0,4e-06,3e-06,3e-06,-9e-06,1e-06,-1e-06,1e-06,5e-06,1e-06,-3e-06,0,1e-06,0,1e-06,-2e-06,-3e-06,-1e-06,0,2e-06,1.4e-05,-1e-06,6.7e-05,-8.2e-05,-2.3e-05,4.8e-05,9.2e-05,-1e-04,-0.000127,-7.8e-05,-6.7e-05,0.000109,0.000213,-0.000476,0.000147,5.7e-05,-0.000435,-0.000121,0.000103,-1.6e-05,-2.3e-05,6.2e-05,6e-06,-0.000429,0.000408,-0.000106,-0.000471,-9.7e-05,-0.000568,9e-05,-0.000146,-0.000314,8.2e-05,-4.9e-05,-3.9e-05,0,0.000101,-1.2e-05,-6.9e-05,-4.1e-05,-1.4e-05,-1e-06,1.3e-05,1.6e-05,-0.000195,-2.1e-05,-8e-06,5e-06,-1.4e-05,-0.000526,1.9e-05,-0.000348,-5e-05,6.2e-05,3e-06,-5.7e-05,0.000234,4.7e-05,4.4e-05,1.1e-05,-1.5e-05
-3e-06,0,0,0,-1e-06,-1e-06,1e-06,1e-06,0,-3e-06,2e-06,0,2e-06,2e-06,3e-06,-5e-06,2e-06,0,0,2e-06,1e-06,-7e-06,-1e-06,-3e-06,5e-06,0,-3e-06,4e-06,1e-06,-1e-06,0,0,4e-06,0,-1e-06,-4e-06,0,2e-06,-1e-06,1e-06,1e-06,0,-1e-06,-2e-06,4e-06,-1e-06,0,-1e-06,2e-06,-1e-06,4e-06,3e-06,-2e-06,-1e-06,0,1e-06,-4e-06,-7e-06,2e-06,0,-2.5e-05,1e-06,-5.6e-05,0,-5e-06,4.7e-05,-4e-05,0.000152,-0.000179,0.000172,-2.3e-05,-2.6e-05,-3.2e-05,0.000271,0.000143,-0.000109,0.00028,-5.6e-05,4.8e-05,-4.4e-05,-1.5e-05,-0.000134,-3e-05,0.000536,-0.000264,5.6e-05,0.00031,0.000285,0.000447,-3.8e-05,0.000179,0.00022,-0.000265,-4.1e-05,-2.7e-05,-4e-06,-1.5e-05,-0.000231,5.2e-05,6.1e-05,7.9e-05,-8e-05,-5e-06,-6.7e-05,0.000199,0.000124,5.7e-05,0.000149,8e-05,0.000493,-3.3e-05,0.000421,7e-06,-2e-06,4e-06,0.000115,-0.000211,-2e-06,-7e-06,1.1e-05,-5.4e-05
3e-06,0,0,-2e-06,-1e-06,0,-1e-06,-1e-06,0,-1e-06,-3e-06,0,3e-06,-1e-06,0,-3e-06,-3e-06,0,0,3e-06,0,4e-06,1e-06,1e-06,7e-06,0,1e-06,-2e-06,0,0,1e-06,-3e-06,-1e-06,0,-1e-06,3e-06,0,-1e-06,-1e-06,-3e-06,-1e-06,-4e-06,0,-1e-06,-6e-06,-1e-06,1e-06,-1e-06,-6e-06,-1e-06,-4e-06,0,2e-06,-1e-06,0,-1e-06,1e-06,-6e-06,2e-06,0,-2.1e-05,2e-06,1.8e-05,6e-05,1.6e-05,2.2e-05,9.4e-05,7e-06,0.000178,-0.000154,-0.000173,-3.5e-05,-0.000164,-1.2e-05,-9.8e-05,8e-05,-0.000422,0.000271,-0.000167,8.5e-05,1.1e-05,0.00017,4.1e-05,-0.000277,-0.000446,-1.1e-05,8.2e-05,-0.000354,-0.000192,4.3e-05,-0.000204,-4.4e-05,-0.000118,5.7e-05,1.8e-05,3e-06,2e-05,4.5e-05,1.5e-05,-4.5e-05,-7.2e-05,0.000108,3e-06,-2e-06,-0.000145,-0.000154,-4.7e-05,-0.000165,1.7e-05,-0.000522,4e-05,-0.000172,5.1e-05,-3.2e-05,-3e-06,-0.000161,5.3e-05,-1.7e-05,-1.7e-05,-2.3e-05,2e-05
-4e-06,0,1e-06,0,-2e-06,0,0,-1e-06,0,2e-06,-1e-06,0,5e-06,0,0,-1e-06,3e-06,1e-06,0,-4e-06,0,-7e-06,-1e-06,0,-7e-06,0,0,2e-06,0,-1e-06,-1e-06,1e-06,-2e-06,0,1e-06,5e-06,0,-1e-06,-1e-06,0,0,5e-06,1e-06,3e-06,0,-1e-06,-1e-06,0,-1e-05,-1e-06,2e-06,-2e-06,-2e-06,1e-06,-1e-06,1e-06,2e-06,-2e-06,0,0,1.7e-05,2e-06,-6.9e-05,4.5e-05,-1.3e-05,-3.9e-05,-0.000109,-2.8e-05,7.3e-05,7.2e-05,7e-06,0.000131,0.000218,-0.000261,-9.1e-05,9.6e-05,0.000225,-0.00047,0.00017,-6e-06,3.4e-05,-0.00014,-2.7e-05,0.000292,0.000205,-5.6e-05,-0.000183,0.000214,0.000397,-2e-06,0.000225,7.5e-05,2.8e-05,6e-06,2.2e-05,-7e-06,5e-06,0.000259,-4.7e-05,1e-06,1.5e-05,-7.5e-05,-4e-06,-3.8e-05,-2e-06,-4.9e-05,-7e-06,0.000144,-9.6e-05,0.000376,7e-06,-4.2e-05,-2e-05,-1.8e-05,-7e-06,0.000108,0.000102,-5e-06,1.7e-05,1.7e-05,-9e-06
2e-06,0,0,0,-1e-06,0,1e-06,-1e-06,0,-2e-06,3e-06,0,1e-06,-1e-06,-1e-06,1e-06,-1e-06,-1e-06,0,2e-06,0,-3e-06,-1e-06,-3e-06,5e-06,0,-2e-06,-3e-06,0,0,1e-06,0,2e-06,0,0,-4e-06,0,1e-06,-1e-06,-2e-06,0,-2e-06,-1e-06,-1e-06,2e-06,0,0,-1e-06,-2e-06,-1e-06,0,2e-06,-1e-06,1e-06,-1e-06,0,1e-06,2e-06,-1e-06,0,2.2e-05,-3e-06,3.8e-05,3.7e-05,6e-06,-3.6e-05,7.1e-05,-9.2e-05,-0.000275,1.9e-05,-3.5e-05,-0.000217,-5.3e-05,0.000489,-0.000151,-5e-05,-0.000337,0.000618,-3.2e-05,-2.8e-05,-2e-05,-2e-05,2e-05,-2.5e-05,0.000501,0.000159,4.6e-05,4.5e-05,-0.000463,-5.9e-05,-0.00026,-0.000441,-2.3e-05,3e-05,-6.8e-05,4e-06,-4.8e-05,-0.000238,4.1e-05,1.9e-05,3.7e-05,-6e-06,0,-5.7e-05,0.000125,3.1e-05,-1.5e-05,-0.000157,4.4e-05,-0.000303,-5.1e-05,3.9e-05,-8.8e-05,4.2e-05,-3e-06,2.9e-05,-0.00012,6e-06,-2e-05,-1e-05,6.6e-05
-4e-06,0,1e-06,0,1e-06,0,0,1e-06,0,-3e-06,0,0,-2e-06,-1e-06,-2e-06,3e-06,-2e-06,1e-06,0,3e-06,0,2e-06,0,2e-06,4e-06,-1e-06,2e-06,-2e-06,0,1e-06,-1e-06,-2e-06,0,0,0,-2e-06,0,-3e-06,-1e-06,3e-06,0,-2e-06,0,-1e-06,-9e-06,0,-1e-06,1e-06,5e-06,1e-06,-1e-06,1e-06,-1e-06,0,-3e-06,0,-1e-06,3e-06,0,0,-6e-06,-1e-06,-2.5e-05,-4.2e-05,-9e-06,5e-06,-3.5e-05,2.7e-05,-6.3e-05,-0.000111,0.000108,0.000243,-0.000133,-0.00064,8.9e-05,-3.4e-05,0.000118,-0.000693,-9.7e-05,5.5e-05,3e-06,0.000127,-1.7e-05,-0.000172,-7.9e-05,-0.000176,0.000148,-0.000247,0.000557,6.4e-05,0.00024,-0.000147,7e-05,-1.6e-05,-2e-05,-3e-06,7e-06,-6.9e-05,2.2e-05,1e-06,-6.7e-05,8.7e-05,-2e-06,-1.3e-05,-0.00014,-4e-05,-9e-06,0.000227,3e-05,0.000252,2.4e-05,0.000206,-7.2e-05,1.3e-05,3e-06,-0.000161,5.1e-05,2.3e-05,3.4e-05,1e-06,-3.4e-05
