0.008465,0.040019,0.197398,0.279874,0.27285,0.388045,0.64524,1.038234,1.410339,1.299056,0.988776,0.908316,1.136734,1.362011,1.10528,0.721548,0.4521,0.298295,0.235296,0.230623,0.317678,0.308302,0.144737,0.046044,0.023338,0.024181,0.024523,0.034682
0.010191,0.047347,0.232491,0.332665,0.328697,0.456752,0.744581,1.178573,1.591677,1.47016,1.115472,1.031069,1.317139,1.580164,1.265489,0.825926,0.525623,0.345534,0.269629,0.267862,0.373759,0.363262,0.172585,0.055786,0.028032,0.029294,0.02942,0.0416
0.01288,0.057249,0.280312,0.406174,0.404625,0.555915,0.907182,1.385459,1.824301,1.689378,1.277499,1.189158,1.544504,1.841542,1.445551,0.937071,0.608029,0.398429,0.30751,0.313407,0.445218,0.434404,0.211453,0.070743,0.035385,0.036964,0.036274,0.051401
0.014413,0.058534,0.285206,0.418342,0.412634,0.59866,1.044194,1.527155,1.904973,1.751611,1.31154,1.207021,1.526084,1.771101,1.36775,0.878107,0.578187,0.377008,0.285879,0.305627,0.450914,0.441119,0.219465,0.078833,0.039885,0.039782,0.037849,0.053434
0.015475,0.054306,0.2606,0.383284,0.357846,0.596398,1.172327,1.683689,1.989662,1.819363,1.364899,1.207898,1.357917,1.440498,1.100967,0.716405,0.475661,0.301286,0.223577,0.255861,0.39665,0.392011,0.203413,0.082146,0.041985,0.037542,0.034826,0.048282
0.01868,0.06114,0.287815,0.413406,0.346529,0.654039,1.38716,1.988222,2.301042,2.14256,1.686915,1.47897,1.432174,1.279259,0.932925,0.611383,0.398311,0.245521,0.190381,0.241026,0.367446,0.352103,0.188963,0.084918,0.045067,0.037518,0.034118,0.04516
0.026719,0.083501,0.392456,0.55254,0.430466,0.840944,1.778273,2.522871,2.868758,2.715401,2.380375,2.27031,2.072762,1.616193,1.077076,0.682231,0.452546,0.281375,0.212691,0.288402,0.421669,0.373933,0.189757,0.087597,0.052134,0.045693,0.041748,0.054751
0.038597,0.120276,0.551479,0.752748,0.567408,1.177905,2.519045,3.623952,4.075557,3.866908,3.799351,3.964522,3.566193,2.680838,1.775516,1.126996,0.735222,0.436919,0.291207,0.38752,0.5491,0.449215,0.204171,0.097172,0.065449,0.058893,0.054735,0.07633
0.049894,0.163515,0.726508,0.965291,0.718223,1.774878,4.053703,5.801017,6.273334,5.993704,6.348412,6.855044,6.089566,4.522622,3.055857,1.993305,1.279994,0.720603,0.422096,0.511861,0.696435,0.543055,0.231722,0.121893,0.089365,0.075349,0.067704,0.106143
0.054899,0.198847,0.87314,1.146541,0.858832,2.711017,6.650905,9.273672,9.465708,9.089501,9.992183,10.767198,9.370118,6.830624,4.72033,3.21142,2.052808,1.106703,0.584016,0.61429,0.780362,0.589524,0.25371,0.159015,0.123251,0.091819,0.076196,0.139682
0.054344,0.216452,0.962925,1.255352,0.949829,3.774429,9.760548,13.220923,12.858679,12.556755,13.919877,14.64378,12.487198,8.944631,6.323205,4.475693,2.852227,1.486003,0.735524,0.667881,0.780108,0.579681,0.268595,0.199613,0.157685,0.104795,0.079625,0.168268
0.052173,0.214374,0.936714,1.198972,0.922322,4.435334,11.921046,15.833282,14.949174,15.073747,16.494927,16.551146,13.791162,9.799061,7.11921,5.147198,3.244851,1.637074,0.796084,0.658779,0.739481,0.556605,0.278311,0.222162,0.172405,0.10643,0.077294,0.186298
0.045877,0.189758,0.809382,1.04123,0.830846,4.163419,11.392555,15.059508,14.149423,14.785434,15.642605,14.628786,11.896121,8.489161,6.370303,4.655309,2.856039,1.395687,0.702365,0.57388,0.691963,0.552931,0.278468,0.207617,0.155338,0.093918,0.069091,0.19886
0.03527,0.152969,0.683883,0.953872,0.779191,3.02788,8.055028,10.685594,10.492719,11.551202,11.5656,9.721708,7.800997,5.801759,4.431834,3.226813,1.870561,0.878638,0.493392,0.451799,0.620602,0.519634,0.249928,0.1637,0.119423,0.073767,0.057114,0.192431
0.028604,0.133454,0.712237,1.082144,0.821524,1.83902,4.255388,5.596449,6.153819,7.236139,6.671043,4.853974,3.868673,3.143671,2.502055,1.856021,1.043718,0.469764,0.301936,0.3611,0.522949,0.442704,0.2273,0.136254,0.094423,0.058177,0.045444,0.164346
0.026638,0.12516,0.851336,1.380859,0.97765,1.362101,2.639428,3.077674,3.509647,4.371217,3.784521,2.375018,1.745936,1.509464,1.239222,1.053602,0.72317,0.326674,0.19987,0.321436,0.449906,0.403181,0.271021,0.158674,0.100135,0.059599,0.04102,0.137019
0.032052,0.132845,1.081447,1.828508,1.273747,1.333586,2.489427,2.892493,3.142555,3.455282,2.701315,1.778653,1.329561,1.059483,0.782202,0.769781,0.656577,0.308904,0.196757,0.354785,0.463155,0.43809,0.354722,0.218412,0.137691,0.08212,0.051693,0.150809
0.039287,0.169197,1.439381,2.411531,1.668978,1.668704,3.170039,3.842849,3.903004,3.737112,2.632185,1.831892,1.538407,1.171572,0.819848,0.773487,0.625207,0.307687,0.233188,0.450642,0.586896,0.546685,0.452997,0.287819,0.183142,0.111531,0.069297,0.182203
0.04488,0.205139,1.690807,2.783928,1.948022,2.033433,4.131557,5.265993,5.38618,4.973421,3.217875,2.22101,2.133705,1.677341,1.132729,0.913653,0.603855,0.300939,0.263286,0.552976,0.727963,0.64461,0.513855,0.330467,0.214421,0.133106,0.083203,0.200515
0.049275,0.223424,1.670429,2.725774,1.980911,2.234938,4.9371,6.734677,7.249138,6.683359,4.142668,2.861298,2.94124,2.361823,1.565993,1.200629,0.739082,0.343227,0.277999,0.636246,0.861669,0.695556,0.493224,0.334642,0.238514,0.145091,0.088674,0.198888
0.050755,0.211618,1.361236,2.262684,1.814895,2.349062,5.65453,8.128861,8.952921,8.11399,5.077932,3.653049,3.649881,2.899956,1.918655,1.447921,0.889228,0.399358,0.283991,0.682634,0.964988,0.707408,0.412979,0.303218,0.247212,0.143313,0.084046,0.194933
0.04721,0.179876,1.021745,1.797275,1.651173,2.489975,6.209385,9.010819,9.944105,8.771666,5.530352,4.188158,3.940036,3.080158,2.125377,1.56169,0.934287,0.408645,0.268068,0.628136,0.918868,0.657518,0.333256,0.256854,0.227037,0.127591,0.080101,0.190245
0.045736,0.148944,0.825531,1.473859,1.418045,2.648009,6.719925,9.075322,9.321129,8.038235,5.163839,4.093929,3.673128,2.963434,2.3208,1.660056,0.896297,0.350359,0.225443,0.473835,0.704549,0.547051,0.286064,0.215104,0.187995,0.103568,0.077542,0.183486
0.045478,0.120809,0.639839,1.099902,1.081734,2.615485,6.518281,8.06735,7.557014,6.583072,4.4606,3.687819,3.242107,2.697168,2.434706,1.720779,0.818263,0.270206,0.177686,0.298972,0.431004,0.379388,0.228318,0.17307,0.142855,0.076382,0.07,0.168812
0.040827,0.0993,0.50121,0.803516,0.837703,2.367307,5.32973,6.334255,5.903589,5.108315,3.54873,3.059078,2.671805,2.307197,2.241733,1.575732,0.755777,0.249854,0.161592,0.236267,0.317913,0.28948,0.182385,0.138286,0.116976,0.062689,0.058794,0.159448
0.032087,0.086208,0.431716,0.636391,0.679675,2.091573,3.983531,4.460829,4.199453,3.858781,3.198134,2.600519,1.96967,1.744945,1.719078,1.268426,0.712307,0.262409,0.177822,0.279896,0.361754,0.288986,0.15207,0.110735,0.101449,0.053822,0.04488,0.150093
0.027307,0.077911,0.381216,0.541858,0.584316,1.843645,2.903047,2.861092,2.861411,3.110067,3.037941,2.431072,1.783096,1.387426,1.210006,1.000468,0.637219,0.244902,0.192301,0.335954,0.420236,0.29798,0.131326,0.087813,0.084274,0.045777,0.035573,0.149088
0.030561,0.070844,0.315426,0.466445,0.566071,1.731388,2.406644,2.040836,2.126427,2.479418,2.580818,2.266872,1.747305,1.131506,0.84086,0.786437,0.527809,0.223227,0.21471,0.403846,0.500171,0.342187,0.142746,0.085706,0.085246,0.048865,0.035409,0.147811
0.038442,0.067123,0.255499,0.426024,0.580257,1.688931,2.246447,1.844823,1.815592,1.874109,2.006153,1.977437,1.559312,0.966752,0.695036,0.652347,0.443178,0.226584,0.237629,0.466973,0.599006,0.420186,0.182243,0.098433,0.098055,0.057817,0.038294,0.141305
0.049316,0.072649,0.220945,0.407642,0.628413,1.825205,2.30705,1.723327,1.562319,1.443745,1.555468,1.635073,1.30885,0.860892,0.724669,0.671012,0.422752,0.241607,0.255312,0.516786,0.691651,0.489543,0.209519,0.1039,0.105701,0.073161,0.049589,0.131744
0.063222,0.083675,0.216543,0.396972,0.648681,1.948694,2.393685,1.576633,1.425522,1.368808,1.269839,1.26931,1.146215,0.841176,0.73727,0.645191,0.391152,0.251899,0.267536,0.522063,0.697631,0.486472,0.202161,0.099043,0.109599,0.094305,0.068781,0.119895
0.073212,0.094699,0.21251,0.338691,0.578177,1.915391,2.470436,1.636293,1.391273,1.28367,1.024162,1.124524,1.248758,0.930655,0.678442,0.5164,0.329478,0.250216,0.286011,0.506436,0.611399,0.405217,0.172627,0.096271,0.119981,0.110787,0.081401,0.100984
0.070942,0.095802,0.197592,0.272625,0.491835,1.764692,2.341879,1.71296,1.394176,1.139488,0.961139,1.218441,1.339501,0.960957,0.611835,0.386495,0.265504,0.207451,0.267486,0.489065,0.529345,0.30078,0.135238,0.092618,0.119889,0.105804,0.076255,0.07833
0.062175,0.091809,0.18281,0.269983,0.462823,1.478842,1.899388,1.501202,1.322007,1.060217,0.950038,1.182706,1.220994,0.878758,0.610243,0.397513,0.250414,0.15343,0.203788,0.413207,0.414048,0.196298,0.09693,0.08662,0.09979,0.078029,0.05681,0.064545
0.057228,0.087898,0.165157,0.276403,0.430102,1.147381,1.400407,1.090136,1.141082,1.127783,0.994236,0.973621,1.014588,0.799484,0.630422,0.502458,0.305141,0.149721,0.142976,0.307869,0.310826,0.158942,0.088723,0.078618,0.073319,0.05281,0.046198,0.064271
0.047566,0.081041,0.151392,0.255717,0.355684,1.008413,1.372224,1.027949,0.981033,1.124437,1.03265,0.836618,0.794688,0.647634,0.584484,0.55165,0.343615,0.167113,0.116728,0.258225,0.282092,0.172153,0.113484,0.075405,0.061102,0.048225,0.045124,0.066838
0.034533,0.062222,0.140909,0.238958,0.305677,0.999151,1.47189,1.197911,0.930995,1.058489,1.05267,0.791044,0.657351,0.514812,0.54913,0.500285,0.321032,0.161064,0.096547,0.235308,0.295188,0.21176,0.138274,0.071866,0.048031,0.049211,0.048332,0.063612
0.02601,0.038883,0.125343,0.221826,0.278554,0.971599,1.401277,1.280131,1.046179,1.168569,1.148125,0.797791,0.610184,0.421013,0.505309,0.381191,0.240435,0.134569,0.084625,0.20343,0.306226,0.257812,0.142528,0.061908,0.037657,0.049847,0.048255,0.052457
0.025162,0.026083,0.107389,0.19046,0.244462,0.903013,1.191063,1.202442,1.211517,1.328165,1.165835,0.745298,0.571707,0.399517,0.488462,0.302593,0.150163,0.108436,0.091789,0.16181,0.292866,0.278263,0.121848,0.053427,0.038724,0.048956,0.04626,0.043644
0.033275,0.025166,0.099514,0.171796,0.222338,0.806578,1.124697,1.103053,1.290638,1.373212,1.118685,0.761788,0.57684,0.461226,0.484426,0.27808,0.113022,0.088122,0.107746,0.143937,0.267096,0.265283,0.092758,0.04425,0.038885,0.045572,0.043701,0.035981
