6.8e-05,6.7e-05,0.000212,0.000197,0.000233,0.000108,4.7e-05,8.7e-05,0.000166,4e-05,0.000152,0.000215,0.000183,0.000132,0.000244,0.000105,6.2e-05,-3.2e-05,-2.5e-05,0.000115,-2e-06,0.00029,0.000151,0.000264,0.000263,0.000225,7.7e-05,0.000147,-9e-06,-0.000106,8e-06,4.6e-05,0.000103,7e-06,-6.8e-05,-0.000129,1e-04,8.6e-05,1.7e-05,3.9e-05,0.000209,0.000166,0.000185,0.000186,0.000148,2.1e-05,0.000105,0.000143,0.00018,8.8e-05,0.000215,0.000194,0.000205,0.00025,5.6e-05,8e-05,7.3e-05,3.5e-05,0.000194,0.000232,0.00032,0.000361,0.000216,0.000264,0.000272,0.000244,0.000194,0.000131,9.6e-05,0.00016,0.000299,0.000187,-3.1e-05,9e-05,0.000226,0.000138,0.000256,0.000153,0.000226,2.2e-05,-0.000203,-0.000159,-0.000155,-0.000143,-1e-04,-2e-06,-6e-06,7.1e-05,0.00017,0.000251,0.000348,0.000348,0.000325,6e-05,-6.6e-05,0.000341,6.9e-05,0.000172,1e-05,-4e-06,0.000119,0.000136,3.1e-05,8.3e-05,8.1e-05,0.000164,0.000213,0.00024,0.000149,0.000329,0.000155,0.000112,-6.2e-05,0.000157,1.4e-05,2.6e-05,2.3e-05,2e-06,0.000117,0.000132,7.1e-05
-6.7e-05,-0.000228,-0.000172,-0.000215,-8.3e-05,-0.000271,-0.000178,-0.000142,-1.3e-05,-4.4e-05,-0.000157,-0.000363,-0.000246,-0.000417,-0.000377,-0.000249,-7.9e-05,-0.000108,-2.3e-05,-1e-04,-2.4e-05,-2.3e-05,-8.9e-05,-1.3e-05,3.6e-05,-0.000127,2.9e-05,9e-06,-0.000153,-5.7e-05,-8.3e-05,-0.000171,1.3e-05,-7.2e-05,-1.5e-05,3.6e-05,-8.1e-05,-0.000119,-0.000196,-6.1e-05,2e-05,0.000135,-8.2e-05,-1.5e-05,3e-05,2.8e-05,7.8e-05,-5.6e-05,-0.000173,-0.000101,-0.000141,-0.000323,-0.000239,-0.000233,-0.000101,-9.5e-05,-9.5e-05,-1e-04,-2.1e-05,-0.000319,-4.6e-05,5.3e-05,-9.3e-05,5.7e-05,9.2e-05,-1e-05,-6e-05,-4e-06,-4.5e-05,-4e-06,-2.8e-05,-1.3e-05,2.3e-05,-0.000107,4.4e-05,1.6e-05,-0.000111,-5.1e-05,-2.2e-05,-1.3e-05,8e-05,0.000144,0.000244,0.000108,0.000129,0.000257,-1.3e-05,-0.000107,-4.6e-05,0.00013,0.000155,2e-05,1.6e-05,0.000114,0.000127,2.4e-05,8.7e-05,0.000133,-8.5e-05,7.4e-05,-0.000103,-0.000101,-8.9e-05,7.9e-05,7.7e-05,5e-06,-0.00024,7e-06,-0.00012,4.3e-05,9e-06,0.000148,4.7e-05,1e-04,0.000183,0.000174,-1.4e-05,0.000178,6.3e-05,-0.000102,-2.3e-05
-6.7e-05,1.9e-05,-0.000193,-0.000151,-0.000212,-1.4e-05,-0.000114,7.9e-05,2.5e-05,-6.3e-05,-9e-05,-4e-05,-0.000171,-0.000125,-0.000317,-9.5e-05,-4.3e-05,7.7e-05,6e-06,-0.000133,1.4e-05,-0.000107,-0.00013,-0.000148,0.00014,-8.4e-05,-5.5e-05,-1e-05,9e-05,-1.4e-05,0.000155,5.4e-05,-3.6e-05,4.1e-05,-6.1e-05,-6.2e-05,-0.000157,-8.5e-05,3e-05,-2.7e-05,-8e-05,-0.000129,-7.8e-05,-8.5e-05,-0.000115,-0.000145,-6.6e-05,-0.000101,6.9e-05,8.6e-05,-0.000118,-0.000243,-1.2e-05,-1.9e-05,-1e-06,0.000163,7e-06,2e-06,-6.9e-05,-0.000138,-0.000106,-2.9e-05,-0.000122,-2.4e-05,5.1e-05,-1.1e-05,-0.000131,-1.3e-05,-6.4e-05,-1.4e-05,-0.000118,-3.6e-05,-0.000115,-1.1e-05,8.1e-05,6.9e-05,-0.000197,-0.00016,-0.000127,-9e-05,-0.000191,-0.000106,-0.000183,-0.000165,-9.2e-05,-0.000122,3.4e-05,-8.8e-05,0.000207,4.3e-05,-0.000175,-0.000229,0.000142,1.1e-05,-4.4e-05,-0.000252,-0.000291,-0.000335,-0.000264,3.8e-05,0.000117,-4e-05,-9.2e-05,-0.00016,-5.5e-05,-0.000182,-3.7e-05,-0.000255,-0.000181,-0.000385,-0.000176,-0.000352,-0.000139,-0.000391,-0.000127,-0.000318,-0.000208,-0.000252,-0.000178,-0.000193,-0.000116
1e-06,-5e-05,4.5e-05,5.3e-05,1e-06,7.2e-05,-1e-05,-7.6e-05,-0.000143,-9.8e-05,-5.8e-05,4.7e-05,-3.5e-05,-4e-05,5.4e-05,8.9e-05,-7e-06,-7.1e-05,8.2e-05,2.2e-05,-7.1e-05,-9.7e-05,7.8e-05,-6.7e-05,-9.3e-05,-0.000231,-0.000113,-0.000131,-4.5e-05,1.7e-05,-1.9e-05,-8.5e-05,-5e-05,-8.7e-05,2.7e-05,4.9e-05,-2.4e-05,1.1e-05,3.3e-05,9.1e-05,7.6e-05,-5.2e-05,-9.3e-05,-0.000202,-4.6e-05,-4.4e-05,-4e-06,9.6e-05,-5.2e-05,-5.8e-05,3.5e-05,1.4e-05,-0.000104,-5.4e-05,-2e-06,-8.9e-05,6e-06,-0.000114,-0.000156,-1.4e-05,-3.9e-05,-1.5e-05,-0.000184,-8.1e-05,-0.000185,-0.000115,-0.000183,-0.000104,-2.7e-05,-1.7e-05,-0.000126,-0.00019,-7e-06,-8.2e-05,2.4e-05,2.8e-05,-8.8e-05,-3.9e-05,-9e-05,-8.6e-05,7.1e-05,4.1e-05,5e-06,5.1e-05,6.3e-05,0.000132,-9e-06,-9.3e-05,-8.4e-05,-0.000182,1.8e-05,-0.000238,-4.3e-05,-0.000187,-5.7e-05,-0.000256,0.000188,-0.000157,0.000136,-0.000267,-1.3e-05,-0.000218,-3.2e-05,-0.000189,-0.000114,-0.000212,-6.9e-05,-0.000188,9.2e-05,-0.000144,7.4e-05,-0.000143,-9.6e-05,-0.000106,-5.9e-05,-8.8e-05,-0.000127,8e-06,-0.000166,-6e-06,-0.000199
-5.3e-05,-1.8e-05,-1.4e-05,9.4e-05,7.8e-05,2.4e-05,0.000105,7e-06,-1.8e-05,-5.6e-05,-1.2e-05,5.1e-05,0.000102,0.000234,0.000253,0.000204,2.5e-05,-4.7e-05,-6.5e-05,-5e-05,-6.9e-05,-0.000118,3.1e-05,2.2e-05,-9.2e-05,-0.000121,-6.1e-05,-1e-04,-8.6e-05,-4.3e-05,-3.1e-05,-0.000114,-3.1e-05,4.2e-05,-1.9e-05,-2e-06,5.8e-05,6.2e-05,2.6e-05,-8.5e-05,-6.1e-05,-6.7e-05,-6.7e-05,-0.000125,-0.000125,-6.8e-05,-0.000122,-5.9e-05,-5.5e-05,-0.000112,-6.3e-05,-2.2e-05,-1.6e-05,-0.000177,-8.8e-05,-9e-05,-8.2e-05,9e-05,-0.000149,4.7e-05,6.8e-05,-3.7e-05,-0.000153,-0.000104,-0.000113,-4e-05,-0.000136,-5.1e-05,6e-06,-2.2e-05,-0.000138,-0.000204,-3.1e-05,0.000135,5e-06,-0.000108,-6.6e-05,2.6e-05,-2.9e-05,5.8e-05,-6e-06,-0.000148,-0.000177,-0.000157,-9.3e-05,-8.6e-05,-0.000119,-8e-05,5.6e-05,1.7e-05,-3.3e-05,-0.000145,-9.2e-05,-0.000119,-7.7e-05,-1.8e-05,2.9e-05,-9.1e-05,-3.5e-05,4.9e-05,-3.8e-05,-6.1e-05,-3.5e-05,6.8e-05,0.000129,5.1e-05,9.1e-05,-3.1e-05,0.000117,-5e-05,0.000195,-0.000131,0.000153,-3e-05,0.000139,-0.00015,0.000125,-9.4e-05,-2.5e-05,1e-06,5.1e-05
-0.000128,-2.6e-05,-4.5e-05,8.3e-05,-3.7e-05,-5e-05,-9.4e-05,-3.8e-05,2.2e-05,-3e-05,-0.000112,5.3e-05,8.1e-05,9.7e-05,2.6e-05,-0.000103,0,-5e-06,5.4e-05,-4.4e-05,-1.9e-05,3e-05,-5e-05,-2.6e-05,-0.000119,1.9e-05,-1.7e-05,2.2e-05,-3.7e-05,0.000112,5.9e-05,0.00012,4.3e-05,-8.6e-05,0.000123,5.6e-05,-1.2e-05,6e-06,-1e-05,-2.1e-05,-3e-05,-5.2e-05,-9.6e-05,-6e-06,-7.9e-05,-3e-05,7.5e-05,-1.5e-05,-3e-06,1.7e-05,-5.4e-05,0.000153,-4.2e-05,1.3e-05,-1e-06,-2.5e-05,-1e-06,5e-05,8.9e-05,6.2e-05,0.000143,-0.000116,1e-06,-8.7e-05,-8.2e-05,-0.000127,4e-05,-2.7e-05,-3.7e-05,3.6e-05,4.7e-05,1.8e-05,-5e-06,-3.5e-05,1.9e-05,-0.000106,9e-05,-2.1e-05,-7e-06,5.1e-05,7e-05,6.9e-05,-2.1e-05,6.3e-05,8e-05,-3.4e-05,-5.3e-05,-7.3e-05,-2.7e-05,-8.8e-05,-5.7e-05,0.000126,-8.3e-05,-6.9e-05,3e-06,-4.4e-05,-4.6e-05,6.1e-05,-5.7e-05,-3.8e-05,-5.6e-05,1e-05,1e-05,-3.5e-05,-9e-06,6.5e-05,5e-05,7.8e-05,-3.7e-05,0.000111,-0.000129,7.7e-05,-5.9e-05,3.5e-05,-7.2e-05,3.4e-05,-6.9e-05,0.000134,-4.4e-05,1e-06,1.3e-05
1.4e-05,-5e-05,-3.1e-05,-8.4e-05,-7.7e-05,-0.000139,-5.2e-05,-0.000109,-8.3e-05,-0.000146,-6.8e-05,-9.1e-05,-0.000204,-8.8e-05,-0.000115,-0.000132,-6.1e-05,-3.4e-05,-1e-05,-6e-06,1.5e-05,-3.7e-05,-7.4e-05,-4.3e-05,-5.6e-05,-1e-06,-1.7e-05,-4.5e-05,-4.2e-05,-0.000113,-7.3e-05,-6.4e-05,-3.6e-05,-5.6e-05,-0.000126,-4e-06,8e-06,-6e-05,-7.8e-05,3.5e-05,-9e-05,-5.4e-05,1.6e-05,6.8e-05,1.8e-05,4e-06,-0.000127,-5e-05,-4.6e-05,-4.1e-05,2.6e-05,6.2e-05,-9.9e-05,2e-06,7.6e-05,2.9e-05,-4.6e-05,6.5e-05,1.9e-05,2.6e-05,-6.1e-05,-0.000111,4.9e-05,-4.3e-05,4e-06,-0.000136,-2e-05,-8.8e-05,-2.4e-05,8e-06,-2.7e-05,9e-06,1.5e-05,3e-06,-2.3e-05,-3.6e-05,-2.1e-05,-1e-06,-8e-05,0,-2.6e-05,-4.5e-05,-4.9e-05,-3.9e-05,-4.2e-05,-6.2e-05,-4.1e-05,-4e-06,-9.8e-05,-5.3e-05,-0.000198,-3.6e-05,-9.9e-05,-9.5e-05,-0.000118,-4e-05,-0.000168,5.1e-05,-0.00011,-2.3e-05,-7.9e-05,-1.8e-05,-4.4e-05,-2.5e-05,-2.7e-05,-4.3e-05,-2e-05,-0.000118,-8.2e-05,1.6e-05,-2e-06,-0.000119,7.1e-05,-4e-06,9e-05,-2.4e-05,0.000107,-5.5e-05,6e-05,-0.000105,1.6e-05
9e-06,2e-06,7.5e-05,-9.9e-05,8e-06,-3.7e-05,6.1e-05,5.6e-05,1.5e-05,5.4e-05,5.3e-05,-2e-05,1.4e-05,-6.8e-05,1.8e-05,-3e-05,-1.9e-05,2.6e-05,-5.6e-05,-9e-06,1.2e-05,3e-06,-8.9e-05,-4e-05,3.6e-05,2.3e-05,2.1e-05,2.6e-05,3.1e-05,2.3e-05,-8e-06,2.5e-05,9.7e-05,-5.4e-05,4e-06,-1.7e-05,-4.6e-05,2.6e-05,-4e-06,1.7e-05,2.2e-05,1.1e-05,2.1e-05,8e-06,3.7e-05,-1.3e-05,-5.4e-05,1.9e-05,-7.5e-05,-4.8e-05,-7.1e-05,-8.1e-05,-9.4e-05,-0.000136,-7.6e-05,-4.1e-05,-7.7e-05,-0.000122,-2.8e-05,-7.3e-05,-9.6e-05,2.5e-05,-1.8e-05,7.5e-05,-6.6e-05,-4.7e-05,3.2e-05,-2e-05,-1e-06,-0.00011,1.1e-05,8.7e-05,-2.1e-05,-4.9e-05,-6.4e-05,-6.6e-05,2.9e-05,2.5e-05,-7.2e-05,-1.7e-05,-8.5e-05,5.5e-05,-4e-06,-2.1e-05,-2.7e-05,-1.3e-05,-4e-05,9.4e-05,-5.7e-05,-1.8e-05,-8.5e-05,4e-06,-4.5e-05,-7e-06,7.9e-05,-1.4e-05,-7.7e-05,-3.5e-05,-4.2e-05,-6e-05,-9.6e-05,-1.4e-05,1e-06,-1.9e-05,-6.3e-05,-1.1e-05,-2.1e-05,-0.000102,-0.000156,-7.9e-05,-0.00013,-4.6e-05,-0.000186,-9.9e-05,-0.000166,-7.4e-05,-8.1e-05,-0.00014,-6.1e-05,-7.5e-05,-4.1e-05
6e-06,3.1e-05,5.3e-05,2.4e-05,7.9e-05,0.000114,5.1e-05,5.1e-05,-7e-06,5.2e-05,1.7e-05,5.8e-05,0.000117,4.1e-05,6e-06,8.7e-05,-4e-06,1.9e-05,6.3e-05,3.4e-05,-2.3e-05,3.7e-05,7.1e-05,2.5e-05,1.2e-05,6.2e-05,4.5e-05,-3e-06,4.9e-05,7.8e-05,-2.8e-05,-4e-06,-4e-05,1e-05,8e-06,-2.3e-05,2.4e-05,-2.6e-05,6.9e-05,2.9e-05,3.6e-05,2e-05,8.6e-05,2.4e-05,7e-05,6.2e-05,1.3e-05,-6e-06,2.6e-05,1.2e-05,-3e-06,5e-06,9.4e-05,8.6e-05,-5.1e-05,2.7e-05,-3e-05,3.4e-05,2.6e-05,-2.9e-05,2.1e-05,4.1e-05,2.4e-05,3.4e-05,5e-05,6e-05,4.5e-05,8.7e-05,-2.7e-05,-3.9e-05,-6e-06,5.3e-05,2.1e-05,2.2e-05,-5e-05,-2e-05,8.7e-05,2.7e-05,4e-06,-7.8e-05,2.2e-05,-1.9e-05,-1.9e-05,6e-06,8e-06,7.6e-05,4e-06,-0.000142,2.8e-05,-3.1e-05,-9e-06,-1.1e-05,7.2e-05,-5e-06,-4.2e-05,1.1e-05,-2.9e-05,-3.9e-05,4.5e-05,2.8e-05,3.4e-05,1.1e-05,7.8e-05,-5.4e-05,-5.8e-05,2.6e-05,4e-06,-2.4e-05,-5e-06,2e-06,2.1e-05,7e-06,-3.2e-05,4.6e-05,-8e-06,-1.1e-05,4.1e-05,-1.5e-05,-3e-06,-4.4e-05,3.8e-05
2e-06,3.2e-05,-9e-06,2.5e-05,4.1e-05,1.4e-05,1.2e-05,5e-05,2.2e-05,4e-06,2e-05,-3.4e-05,2.1e-05,9e-06,6.2e-05,3.5e-05,5e-06,-5.5e-05,-2e-05,-2e-06,3.1e-05,2.9e-05,4.1e-05,5.3e-05,2.4e-05,7e-06,2.4e-05,5.8e-05,1.9e-05,-3.3e-05,3e-06,3.5e-05,-1.8e-05,4.4e-05,-1.2e-05,7e-05,4e-05,3.4e-05,-2.9e-05,-2.7e-05,-2.2e-05,-4e-06,1.7e-05,1.6e-05,6.3e-05,1.3e-05,5.8e-05,7.8e-05,9.4e-05,0,5e-05,3.4e-05,7.1e-05,4.3e-05,-1.4e-05,4e-06,5e-05,1.5e-05,-5.5e-05,-3.9e-05,-1e-05,9e-06,3.7e-05,7.7e-05,3.8e-05,2.4e-05,2.8e-05,3.2e-05,4.2e-05,1.5e-05,-5e-06,8e-06,6.6e-05,1.6e-05,-1.5e-05,3e-05,5.3e-05,0,7.1e-05,8e-06,3e-06,4e-06,2.5e-05,3e-06,8.2e-05,4e-06,-1.8e-05,0.000117,7.9e-05,5.1e-05,1.8e-05,9e-05,6.7e-05,-2e-06,5.4e-05,4.1e-05,3.3e-05,0.000119,6.2e-05,-3.3e-05,-2.1e-05,-1.3e-05,-5.1e-05,1.4e-05,-2e-06,4.9e-05,9e-06,1.9e-05,-5e-06,5.6e-05,1.7e-05,0,-2.8e-05,-3.2e-05,-7e-06,-2.1e-05,-6.7e-05,-2e-05,-2.3e-05,5.2e-05,1.3e-05
1.1e-05,-3.6e-05,-5e-06,-2.8e-05,-1.9e-05,-1.6e-05,1.9e-05,-6.5e-05,1.6e-05,4.3e-05,2.7e-05,5e-06,2.9e-05,4.2e-05,2.8e-05,-4.4e-05,-3.1e-05,-7e-06,2.6e-05,1.1e-05,1e-06,1.6e-05,2.7e-05,1.4e-05,5e-06,3.8e-05,-9e-06,3.9e-05,-1e-06,2e-06,5.3e-05,1.6e-05,2.5e-05,1.2e-05,1e-05,-3.4e-05,-1.1e-05,-1.2e-05,-2.2e-05,-1.5e-05,-3e-06,1.2e-05,-1.2e-05,1.3e-05,-9e-06,-2e-06,4.5e-05,-1.2e-05,0,1.3e-05,9e-06,-4e-06,-1e-06,-4e-06,0,-6.8e-05,-2.1e-05,-5.8e-05,2.1e-05,-1.2e-05,3e-06,-3.3e-05,3.6e-05,-1.3e-05,-9e-06,3.8e-05,6.9e-05,1.8e-05,2.4e-05,1.7e-05,-1.9e-05,0,-3.6e-05,2e-05,1e-06,-6e-06,-7e-06,3.5e-05,3.7e-05,-2e-05,1.1e-05,-1.9e-05,-5e-06,-1.1e-05,2e-05,-4.8e-05,3.4e-05,-2.8e-05,2.1e-05,8e-06,7.2e-05,4.3e-05,1.6e-05,3.5e-05,1.9e-05,-9e-06,5.9e-05,8.9e-05,8.1e-05,4.3e-05,7.6e-05,7.3e-05,5.9e-05,8.7e-05,4e-06,8.9e-05,1.9e-05,0.000103,2.9e-05,9.5e-05,7.8e-05,0.000108,5.1e-05,8.6e-05,7e-05,0.000102,5.6e-05,0.00012,4.6e-05,9.6e-05,4e-05
1e-06,1.5e-05,-3e-05,9e-06,-3.1e-05,-1e-06,-5.2e-05,-1.6e-05,-2.2e-05,-4.2e-05,1.1e-05,-1e-06,-1e-06,-5.1e-05,-2e-05,-1e-06,-2.1e-05,3e-05,0,-1.5e-05,6e-06,-1.6e-05,1.9e-05,2e-06,6e-06,-1.5e-05,0,-1e-05,-1.4e-05,4e-06,0,1.5e-05,-2.6e-05,-3.7e-05,-3.8e-05,3.3e-05,-7e-06,8e-06,-3.3e-05,7e-06,2.4e-05,2e-06,-2.2e-05,-7e-06,-2.6e-05,-5e-06,8e-06,4e-06,-1.6e-05,-7e-06,1.5e-05,-1.3e-05,-2.6e-05,-2.4e-05,2.2e-05,-1.1e-05,2.1e-05,-1.9e-05,6e-06,4e-06,6e-06,-5.9e-05,-1.3e-05,-2.1e-05,1.2e-05,7e-06,-1.8e-05,-9e-06,-2e-05,1.2e-05,3.4e-05,2.6e-05,4.7e-05,2e-05,9e-06,-4.8e-05,-1.7e-05,-3.9e-05,-2.5e-05,-3e-06,1.7e-05,-1.1e-05,2e-05,-7e-06,1.6e-05,1.3e-05,7e-06,1.8e-05,2.1e-05,2e-06,-3.1e-05,1e-06,-1.3e-05,2.2e-05,2.5e-05,0,-5e-06,3.2e-05,-3.6e-05,3.1e-05,-1.1e-05,1e-05,2e-06,-8e-06,7e-06,-2.1e-05,1e-06,-4e-05,3.7e-05,-2.5e-05,-2.4e-05,-8e-06,1e-06,-7e-06,-3.6e-05,5e-06,-2e-05,-1.8e-05,-4e-06,-3e-05,-8e-06
1.8e-05,1.8e-05,-5e-06,3.8e-05,-2.5e-05,-7e-06,1.1e-05,2.2e-05,-7e-06,-1e-06,1.3e-05,9e-06,-9e-06,5e-06,-1.5e-05,-2e-06,-2.1e-05,9e-06,5e-06,-9e-06,-1.2e-05,-1.6e-05,2e-06,-1e-06,-2.3e-05,-1.6e-05,9e-06,-1.1e-05,-1e-06,4e-06,-1.9e-05,8e-06,-2.1e-05,-4e-06,1.6e-05,6e-06,2e-06,-1.3e-05,1.8e-05,5e-06,-1.4e-05,0,2.2e-05,-2.5e-05,-1.2e-05,-1.1e-05,-9e-06,9e-06,-2e-05,7e-06,6e-06,1e-06,-2.8e-05,1.2e-05,7e-06,8e-06,-2e-06,2e-06,3.9e-05,7e-06,9e-06,3e-06,-3.5e-05,-1.3e-05,-1.2e-05,-1.8e-05,2e-06,-1.1e-05,-1e-05,-1e-06,2.2e-05,5e-06,5e-06,-1.9e-05,-5e-06,1.9e-05,-4e-06,8e-06,-1e-05,-2.4e-05,-1e-05,3.5e-05,-2.6e-05,1e-05,-7e-06,1.7e-05,-1.7e-05,-1.6e-05,5e-05,1e-06,2.4e-05,-3e-06,-2.5e-05,-2.4e-05,1.9e-05,-2.2e-05,1.3e-05,-1.9e-05,-2.7e-05,1.7e-05,-1.5e-05,1.6e-05,-1.1e-05,-3e-06,1.5e-05,1.1e-05,0,6e-06,-3.1e-05,-1e-05,1.2e-05,1.3e-05,2.9e-05,-4e-06,8e-06,4.5e-05,2.7e-05,3e-05,1e-06,4.3e-05,1.7e-05
1e-05,-1.1e-05,6e-06,-6e-06,-1e-06,-6e-06,1e-05,1.1e-05,3e-06,7e-06,-8e-06,9e-06,-2.1e-05,3.8e-05,1e-05,-3.2e-05,3e-06,-1.5e-05,1.2e-05,6e-06,1.6e-05,0,-2.5e-05,-1.8e-05,1.8e-05,-9e-06,-1e-05,-2.9e-05,1.3e-05,-4e-06,0,-6e-06,1.7e-05,-2e-05,-1.9e-05,-2.4e-05,5e-06,1.2e-05,1.4e-05,-1.4e-05,-2.4e-05,1e-05,4e-06,-7e-06,4e-06,-2e-06,-1.3e-05,-9e-06,1e-06,-1e-05,-6e-06,1.5e-05,-2.5e-05,1e-06,-9e-06,-7e-06,-1.2e-05,-2.3e-05,-1.8e-05,-1e-06,-2.3e-05,4.4e-05,1.9e-05,1.9e-05,-5e-06,-1.4e-05,-1e-05,-1.1e-05,0,2e-05,-1.5e-05,1.4e-05,-3.3e-05,-3e-06,1e-06,-2e-06,-3.4e-05,4e-06,-6e-06,3e-06,9e-06,-1e-06,-2e-06,-5e-06,-2.3e-05,-1.3e-05,-1.1e-05,2.2e-05,-6.8e-05,-8e-06,8e-06,1e-05,7e-06,-1.4e-05,-7e-06,-1.5e-05,-2.6e-05,-1e-05,-5e-06,-3.2e-05,-3e-05,-4e-06,8e-06,-1.1e-05,-5e-06,-4.5e-05,4e-06,-4e-06,9e-06,-2e-05,-1.3e-05,-2.8e-05,-2.1e-05,-1.9e-05,1.6e-05,-2e-05,-1.5e-05,-8e-06,5e-06,-3.7e-05,-2.5e-05
-9e-06,-1e-06,-9e-06,-1.3e-05,8e-06,-1.4e-05,-7e-06,-2.3e-05,1.2e-05,4e-06,-1e-05,-1e-06,4e-06,-7e-06,-1.2e-05,2.4e-05,1.5e-05,-1.2e-05,-9e-06,-9e-06,-1.2e-05,-2e-06,-8e-06,-2e-06,6e-06,9e-06,-1e-06,0,-1e-06,1e-06,-5e-06,-1e-06,-2.2e-05,-1.3e-05,1.3e-05,1.3e-05,9e-06,-7e-06,5e-06,-9e-06,1e-05,-8e-06,4e-06,9e-06,1e-05,-7e-06,-8e-06,6e-06,-7e-06,-1e-06,1e-05,-1.5e-05,6e-06,-6e-06,-8e-06,-2e-06,-6e-06,1.6e-05,4e-06,0,-1.4e-05,1.5e-05,2.3e-05,-3e-06,-4e-06,7e-06,-2e-06,4e-06,-2e-06,4e-06,-1e-06,-5e-06,-9e-06,1e-06,2e-06,2.6e-05,-1.3e-05,-1.4e-05,-1.4e-05,1.3e-05,-2e-05,-7e-06,-2e-06,-3e-06,-1.4e-05,-4e-06,4e-06,-2.6e-05,6e-06,-1.1e-05,-2.3e-05,3e-06,-3e-06,-1.1e-05,4e-06,-2.1e-05,-1.1e-05,1.2e-05,-1e-06,-7e-06,1.7e-05,-3e-06,8e-06,-5e-06,-6e-06,-1e-06,1e-06,-8e-06,1e-05,-1.6e-05,0,1.6e-05,2.3e-05,-2.3e-05,-1.2e-05,-2.1e-05,6e-06,-6e-06,-5e-06,-1.8e-05,-6e-06
-6e-06,4e-06,1e-06,-1e-06,4e-06,1.3e-05,6e-06,1e-05,-1.2e-05,4e-06,-8e-06,5e-06,1e-06,-9e-06,5e-06,8e-06,6e-06,1.3e-05,-9e-06,5e-06,8e-06,3e-06,-3e-06,0,3e-06,6e-06,5e-06,7e-06,0,0,-8e-06,-2e-06,0,9e-06,5e-06,-2.5e-05,2e-06,0,6e-06,-8e-06,2e-06,3e-06,-6e-06,4e-06,2e-06,3e-06,-9e-06,-6e-06,9e-06,0,-3e-06,1.7e-05,1.3e-05,-1e-05,9e-06,1.2e-05,-2e-06,-4e-06,2.8e-05,3e-06,2e-06,-1.2e-05,3e-06,-1e-06,4e-06,5e-06,-3e-06,9e-06,4e-06,-1.2e-05,-1e-06,2e-06,-1.3e-05,-6e-06,2e-06,-8e-06,-4e-06,2e-06,0,8e-06,-5e-06,-9e-06,7e-06,2e-06,-1.2e-05,-8e-06,6e-06,1.7e-05,-7e-06,-5e-06,1.6e-05,-5e-06,1e-05,7e-06,1.9e-05,8e-06,-8e-06,-2e-05,8e-06,6e-06,4e-06,2e-06,-1e-06,-8e-06,1.1e-05,-6e-06,3e-06,-8e-06,-1.9e-05,-6e-06,-7e-06,5e-06,1.3e-05,-8e-06,1e-06,1.7e-05,1.1e-05,-1.8e-05,4e-06,0,-5e-06
-5e-06,4e-06,-3e-06,-8e-06,0,-1e-06,0,-4e-06,3e-06,0,-2e-06,-1e-06,0,-5e-06,1e-06,-2e-06,-5e-06,-1e-06,1e-06,1e-06,-4e-06,-5e-06,6e-06,-1e-06,-1.2e-05,-8e-06,-3e-06,1e-06,-7e-06,-9e-06,-4e-06,9e-06,4e-06,7e-06,-4e-06,-1e-06,3e-06,1e-06,-1e-05,8e-06,-2e-06,5e-06,-2e-06,-9e-06,-1e-05,-8e-06,6e-06,0,-5e-06,0,0,-4e-06,8e-06,1.1e-05,1e-06,5e-06,0,2.1e-05,2e-06,-2e-06,-4e-06,-1e-05,-1e-05,-8e-06,-1e-06,3e-06,-1.2e-05,2e-06,4e-06,-1e-06,7e-06,-3e-06,-9e-06,3e-06,-2e-06,-1e-05,-1.7e-05,-2e-06,1.1e-05,4e-06,3e-06,-1e-06,4e-06,-1e-06,-1e-06,-1.1e-05,-1e-06,-4e-06,1.7e-05,2e-06,-6e-06,1e-06,2e-06,3e-06,4e-06,-9e-06,-3e-06,-1.1e-05,-6e-06,-4e-06,6e-06,0,-5e-06,0,-5e-06,-9e-06,-1e-06,0,-2e-06,-1.7e-05,7e-06,-4e-06,-2.6e-05,-5e-06,-5e-06,5e-06,2e-06,-1e-05,-5e-06,6e-06,-6e-06
4e-06,-5e-06,0,-6e-06,-2e-06,0,-1.1e-05,-7e-06,1e-06,1e-06,5e-06,0,0,-4e-06,-2e-06,0,-3e-06,8e-06,0,-4e-06,-1e-06,1e-06,7e-06,3e-06,-4e-06,-4e-06,-3e-06,-7e-06,-2e-06,-5e-06,7e-06,-5e-06,0,0,3e-06,-1e-06,-3e-06,-1e-06,-7e-06,4e-06,4e-06,-2e-06,-2e-06,-5e-06,-4e-06,-2e-06,8e-06,-1e-06,1e-05,1e-06,7e-06,3e-06,0,-2e-06,-8e-06,-1e-06,2e-06,4e-06,0,-3e-06,-3e-06,-1.2e-05,-2e-06,-3e-06,1e-06,5e-06,1e-06,-6e-06,-2e-06,0,-2e-06,2e-06,5e-06,8e-06,-1e-06,-3e-06,-1.6e-05,0,6e-06,1e-06,-6e-06,8e-06,-5e-06,1e-06,1e-06,1e-06,-2e-06,-9e-06,-1e-05,-1e-06,3e-06,3e-06,-5e-06,-2e-06,-8e-06,3e-06,1.3e-05,-4e-06,9e-06,1e-06,5e-06,2e-06,7e-06,2e-06,-7e-06,0,0,1e-05,3e-06,5e-06,-1e-06,1.9e-05,2e-06,-9e-06,3e-06,4e-06,2e-06,1.5e-05,2e-06,1.1e-05,-7e-06
5e-06,2e-06,-1e-06,-4e-06,-3e-06,-1e-06,-3e-06,1e-06,1e-06,-8e-06,-2e-06,-1e-06,-2e-06,-1.6e-05,-2e-06,-4e-06,-5e-06,-2e-06,3e-06,2e-06,3e-06,-3e-06,2e-06,-2e-06,-1e-06,-5e-06,0,2e-06,-2e-06,3e-06,7e-06,1e-06,-5e-06,-7e-06,-7e-06,-6e-06,1e-06,0,-4e-06,1e-06,1e-06,-1e-06,2e-06,1e-06,-4e-06,-1e-06,3e-06,0,-8e-06,-4e-06,-2e-06,-1e-06,-1e-05,0,-5e-06,-8e-06,2e-06,-3e-06,-3e-06,-4e-06,3e-06,-1e-06,1e-05,-1e-06,-6e-06,0,-1.3e-05,-6e-06,1e-06,4e-06,-1e-06,-5e-06,-9e-06,-2e-06,-1e-06,3e-06,-7e-06,-4e-06,-2e-06,0,7e-06,1e-06,0,-3e-06,-1e-06,2e-06,-2e-06,1.7e-05,1.4e-05,-1e-06,2e-06,2e-06,-1.1e-05,-6e-06,1.2e-05,-2e-06,7e-06,5e-06,-1.7e-05,5e-06,-1e-06,2e-06,-2e-06,4e-06,5e-06,-4e-06,-1e-06,0,2e-06,-1e-06,8e-06,5e-06,0,4e-06,4e-06,4e-06,0,3e-06,-1e-06,7e-06,-2e-06
-1e-06,1e-06,2e-06,1e-05,0,-3e-06,5e-06,9e-06,-4e-06,2e-06,-3e-06,0,-6e-06,-4e-06,0,-6e-06,-3e-06,-4e-06,-3e-06,-3e-06,-2e-06,1e-06,0,-2e-06,6e-06,2e-06,1e-06,2e-06,4e-06,1e-06,0,-3e-06,7e-06,-6e-06,7e-06,7e-06,0,-1e-06,6e-06,-1e-06,-5e-06,4e-06,0,6e-06,3e-06,-2e-06,-5e-06,-4e-06,-4e-06,3e-06,2e-06,-1e-06,-5e-06,-5e-06,1e-06,4e-06,-2e-06,2e-06,1e-05,-1e-06,7e-06,1.5e-05,1e-06,2e-06,4e-06,-8e-06,-5e-06,-3e-06,-1e-06,0,2e-06,-3e-06,-1e-06,0,0,0,0,5e-06,-6e-06,-4e-06,4e-06,-3e-06,-2e-06,1e-06,-3e-06,9e-06,-1e-06,-1.2e-05,-6e-06,0,3e-06,-7e-06,-3e-06,-4e-06,-3e-06,-3e-06,2e-06,-9e-06,-7e-06,3e-06,-5e-06,-1e-06,-6e-06,3e-06,0,-1e-06,0,-1e-06,5e-06,-9e-06,-3e-06,4e-06,9e-06,-7e-06,-3e-06,8e-06,2e-06,0,2e-06,7e-06,-2e-06
-1e-06,0,1e-06,4e-06,3e-06,1e-06,-3e-06,-1e-06,2e-06,4e-06,-4e-06,1e-06,-4e-06,0,-4e-06,-2e-06,-2e-06,1e-06,0,2e-06,0,-1e-06,-8e-06,0,3e-06,-4e-06,-2e-06,-6e-06,1e-06,-4e-06,-4e-06,-2e-06,1e-06,-5e-06,-1e-05,0,-1e-06,2e-06,3e-06,-2e-06,-2e-06,-1e-06,1e-06,-5e-06,5e-06,1e-06,-6e-06,3e-06,-2e-06,-3e-06,1e-06,1e-06,-2e-06,4e-06,6e-06,2e-06,1e-06,3e-06,5e-06,-2e-06,-2e-06,6e-06,-5e-06,2e-06,-4e-06,0,-8e-06,-1e-06,-2e-06,-1e-06,-1e-06,-6e-06,0,-1e-06,0,4e-06,-2e-06,-5e-06,-1e-06,-3e-06,0,-4e-06,1e-06,1e-06,-4e-06,-7e-06,0,3e-06,-5e-06,-2e-06,-2e-06,-1e-06,2e-06,-2e-06,-2e-06,-1e-06,-5e-06,-1.8e-05,-8e-06,-5e-06,-6e-06,0,5e-06,-4e-06,-3e-06,-8e-06,-1e-06,-2e-06,-1e-06,-3e-06,-1e-06,-2e-06,-3e-06,-2e-06,-3e-06,7e-06,0,2e-06,0,-1.2e-05,-5e-06
-2e-06,-3e-06,-1e-06,-3e-06,2e-06,-3e-06,1e-06,-6e-06,1e-06,0,-3e-06,0,1e-06,2e-06,1e-06,3e-06,1e-06,5e-06,1e-06,0,-1e-06,1e-06,-5e-06,-2e-06,-2e-06,-2e-06,-2e-06,1e-06,-2e-06,2e-06,-5e-06,0,-6e-06,1e-06,5e-06,-2e-06,1e-06,-3e-06,-2e-06,2e-06,5e-06,-2e-06,-3e-06,-2e-06,-1e-06,-1e-06,0,-3e-06,4e-06,1e-06,-3e-06,-2e-06,5e-06,-1e-06,-1e-06,-1e-06,-3e-06,-1e-05,-5e-06,-1e-06,-5e-06,-7e-06,0,-1e-06,2e-06,3e-06,-5e-06,2e-06,1e-06,5e-06,2e-06,-2e-06,-7e-06,-1e-06,0,1e-06,1e-06,2e-06,2e-06,-3e-06,0,0,-1e-06,-1e-06,-3e-06,-4e-06,-1e-06,0,-1.4e-05,0,-2e-06,1e-06,6e-06,-1e-06,2e-06,-1e-06,-5e-06,-3e-06,-3e-06,1e-06,0,-4e-06,-3e-06,-2e-06,3e-06,0,0,-1e-06,2e-06,-3e-06,-3e-06,4e-06,8e-06,-4e-06,6e-06,-6e-06,1e-06,0,-1e-06,2e-06,-3e-06
0,3e-06,2e-06,2e-06,0,6e-06,2e-06,0,-1e-06,0,-2e-06,0,0,1e-06,2e-06,8e-06,-1e-06,4e-06,-3e-06,-1e-06,1e-06,1e-06,0,1e-06,-3e-06,0,2e-06,2e-06,-4e-06,2e-06,-1e-06,-4e-06,6e-06,1e-06,-2e-06,3e-06,0,3e-06,-2e-06,2e-06,-1e-06,2e-06,0,1e-06,-1e-06,0,-1e-06,-1e-06,2e-06,-2e-06,2e-06,-3e-06,3e-06,-2e-06,-4e-06,-4e-06,-1e-06,-2e-06,3e-06,-1e-06,3e-06,-8e-06,4e-06,-2e-06,0,2e-06,-1e-06,4e-06,1e-06,0,-1e-06,-3e-06,5e-06,-1e-06,0,-3e-06,6e-06,3e-06,-1e-06,0,-5e-06,3e-06,1e-06,-1e-06,1e-06,4e-06,0,2e-06,5e-06,-1e-06,6e-06,-1e-06,-1e-06,-3e-06,0,0,-6e-06,2e-06,6e-06,0,3e-06,0,-3e-06,2e-06,1e-06,0,0,1e-06,-2e-06,2e-06,1e-06,4e-06,-4e-06,-4e-06,-2e-06,3e-06,-3e-06,-1e-06,0,-1e-05,-1e-06
1e-06,-1e-06,-1e-06,0,-1e-06,-1e-06,-4e-06,1e-06,-1e-06,0,-1e-06,0,0,5e-06,-1e-06,-2e-06,-1e-06,-4e-06,1e-06,1e-06,-1e-06,-1e-06,2e-06,1e-06,-2e-06,-3e-06,0,5e-06,-1e-06,-3e-06,2e-06,0,-1e-06,2e-06,-1e-06,-2e-06,0,-2e-06,-2e-06,0,-2e-06,0,0,5e-06,-2e-06,0,2e-06,2e-06,-1e-06,0,0,2e-06,2e-06,0,-1e-06,1e-06,0,-2e-06,0,0,0,-4e-06,1e-06,-3e-06,0,2e-06,-5e-06,-1e-06,0,-3e-06,1e-06,-3e-06,1e-06,1e-06,0,-2e-06,5e-06,-3e-06,1e-06,0,0,2e-06,0,1e-06,2e-06,-2e-06,1e-06,-6e-06,3e-06,0,-6e-06,-4e-06,1e-06,0,-4e-06,-2e-06,1e-06,-1e-06,-2e-06,-2e-06,7e-06,-4e-06,1e-06,-1e-06,-1e-06,1e-06,0,-3e-06,-4e-06,0,-1e-06,0,9e-06,1e-06,-3e-06,1e-06,4e-06,-8e-06,1e-06,5e-06,1e-06
0,0,1e-06,-3e-06,-1e-06,1e-06,0,1e-06,0,-1e-06,0,0,1e-06,2e-06,1e-06,-2e-06,-2e-06,0,0,-2e-06,2e-06,1e-06,4e-06,-1e-06,2e-06,0,-2e-06,-2e-06,1e-06,1e-06,2e-06,-2e-06,-3e-06,-1e-06,2e-06,0,-1e-06,2e-06,1e-06,-1e-06,3e-06,-2e-06,1e-06,-2e-06,0,0,2e-06,-2e-06,0,1e-06,-1e-06,-2e-06,-4e-06,2e-06,2e-06,-1e-06,0,1e-06,4e-06,0,-4e-06,4e-06,-5e-06,2e-06,0,0,1e-06,-3e-06,0,-1e-06,-1e-06,-2e-06,-1e-06,2e-06,0,-1e-06,3e-06,2e-06,3e-06,1e-06,-2e-06,-2e-06,0,0,3e-06,2e-06,0,9e-06,4e-06,1e-06,4e-06,-1e-06,-7e-06,0,0,2e-06,4e-06,-7e-06,-1e-06,0,-1e-06,1e-06,-2e-06,-1e-06,0,2e-06,0,2e-06,2e-06,-1e-06,2e-06,6e-06,-9e-06,-3e-06,0,2e-06,-3e-06,2e-06,-1e-06,4e-06,-2e-06
-1e-06,-1e-06,1e-06,-1e-06,0,-1e-06,3e-06,-1e-06,1e-06,-1e-06,-1e-06,1e-06,0,3e-06,1e-06,0,0,1e-06,1e-06,1e-06,-2e-06,-1e-06,2e-06,0,1e-06,-2e-06,1e-06,-3e-06,3e-06,2e-06,2e-06,1e-06,2e-06,-4e-06,-3e-06,5e-06,0,-2e-06,3e-06,-1e-06,0,1e-06,0,-2e-06,3e-06,0,1e-06,2e-06,-1e-06,-2e-06,2e-06,1e-06,-2e-06,-1e-06,1e-06,1e-06,-1e-06,-2e-06,-1e-06,0,0,8e-06,-1e-06,1e-06,-1e-06,-2e-06,-3e-06,-1e-06,0,0,1e-06,-2e-06,6e-06,-1e-06,0,2e-06,3e-06,1e-06,0,1e-06,-1e-06,-3e-06,0,-1e-06,2e-06,2e-06,-1e-06,-8e-06,-1e-06,0,1e-06,2e-06,2e-06,-2e-06,0,-4e-06,3e-06,2e-06,-4e-06,3e-06,-1e-06,-2e-06,-1e-06,2e-06,-1e-06,1e-06,0,1e-06,-2e-06,3e-06,1e-06,0,2e-06,1e-06,2e-06,3e-06,2e-06,4e-06,0,3e-06,1e-06
-1e-06,1e-06,-1e-06,0,0,-1e-06,-1e-06,3e-06,-1e-06,2e-06,-1e-06,-1e-06,-1e-06,-2e-06,-1e-06,-4e-06,0,3e-06,0,-1e-06,1e-06,1e-06,-1e-06,0,3e-06,0,1e-06,1e-06,0,0,1e-06,-2e-06,1e-06,-4e-06,4e-06,-1e-06,0,2e-06,1e-06,0,-1e-06,0,0,-1e-06,1e-06,0,-1e-06,-1e-06,0,1e-06,-2e-06,-1e-06,-3e-06,0,-2e-06,0,0,0,0,-1e-06,4e-06,2e-06,3e-06,1e-06,0,-2e-06,2e-06,1e-06,-1e-06,1e-06,1e-06,0,0,1e-06,0,3e-06,4e-06,-2e-06,-3e-06,1e-06,4e-06,0,0,0,0,-2e-06,-1e-06,4e-06,5e-06,0,-3e-06,-1e-06,-3e-06,-2e-06,-4e-06,2e-06,2e-06,6e-06,-3e-06,1e-06,-5e-06,-1e-06,-2e-06,0,1e-06,1e-06,0,0,3e-06,1e-06,0,2e-06,-4e-06,-1e-06,0,-2e-06,-3e-06,1e-06,0,2e-06,1e-06
0,-1e-06,1e-06,2e-06,0,0,1e-06,-2e-06,0,0,-1e-06,1e-06,0,1e-06,1e-06,0,0,0,-1e-06,0,-1e-06,0,-2e-06,0,-3e-06,0,-1e-06,1e-06,-1e-06,-1e-06,-1e-06,0,-3e-06,-1e-06,-5e-06,3e-06,0,-2e-06,0,1e-06,0,-2e-06,-1e-06,4e-06,0,0,-2e-06,0,-2e-06,-2e-06,0,1e-06,1e-06,-1e-06,-2e-06,2e-06,0,5e-06,0,0,-1e-06,-6e-06,1e-06,-1e-06,0,0,0,1e-06,1e-06,-1e-06,-1e-06,0,1e-06,0,0,-2e-06,2e-06,1e-06,-1e-06,1e-06,0,2e-06,0,0,-1e-06,-1e-06,0,0,-8e-06,0,3e-06,-2e-06,6e-06,-2e-06,-1e-06,-2e-06,-2e-06,0,-2e-06,-3e-06,0,0,2e-06,0,0,0,0,-2e-06,2e-06,0,-1e-06,1e-06,4e-06,-2e-06,0,3e-06,3e-06,0,0,-3e-06,1e-06
0,0,-1e-06,0,0,-1e-06,1e-06,-1e-06,0,0,-1e-06,-1e-06,1e-06,-1e-06,1e-06,5e-06,-1e-06,-1e-06,1e-06,1e-06,1e-06,0,-3e-06,0,0,0,0,1e-06,-2e-06,1e-06,-3e-06,0,2e-06,0,4e-06,1e-06,0,1e-06,-4e-06,0,1e-06,1e-06,0,0,-1e-06,0,0,1e-06,3e-06,2e-06,0,1e-06,1e-06,2e-06,1e-06,-2e-06,-1e-06,2e-06,-2e-06,-2e-06,-3e-06,-4e-06,-3e-06,0,1e-06,1e-06,1e-06,1e-06,0,0,0,0,2e-06,0,0,-2e-06,1e-06,1e-06,1e-06,0,1e-06,2e-06,0,0,-1e-06,-1e-06,0,-1e-06,-2e-06,0,-2e-06,0,-2e-06,0,-1e-06,1e-06,-3e-06,-3e-06,3e-06,1e-06,0,-3e-06,-2e-06,1e-06,-1e-06,2e-06,0,0,-1e-06,0,-1e-06,1e-06,-1e-06,1e-06,-1e-06,-1e-06,-3e-06,-1e-06,0,-1e-06,0
0,0,0,1e-06,0,2e-06,-2e-06,-1e-06,1e-06,0,0,1e-06,0,0,-1e-06,2e-06,-1e-06,0,-1e-06,-1e-06,-1e-06,0,0,0,-2e-06,-1e-06,1e-06,-2e-06,0,1e-06,-1e-06,0,1e-06,1e-06,-2e-06,-4e-06,0,-1e-06,0,0,-1e-06,0,0,-3e-06,-1e-06,0,0,0,0,-1e-06,-1e-06,-1e-06,2e-06,-1e-06,2e-06,0,0,-2e-06,3e-06,0,2e-06,-1e-06,-2e-06,-1e-06,-1e-06,0,4e-06,1e-06,0,2e-06,0,0,-2e-06,-1e-06,0,-1e-06,0,-1e-06,0,-1e-06,-1e-06,-1e-06,0,0,0,1e-06,0,0,-2e-06,0,0,2e-06,2e-06,0,-1e-06,-1e-06,-2e-06,1e-06,2e-06,1e-06,4e-06,1e-06,0,-1e-06,1e-06,0,0,1e-06,1e-06,0,-1e-06,0,4e-06,-2e-06,2e-06,0,1e-06,1e-06,0,-5e-06,2e-06
0,0,0,1e-06,0,-1e-06,0,3e-06,0,-1e-06,0,-1e-06,1e-06,-1e-06,1e-06,0,-1e-06,0,0,1e-06,0,0,1e-06,0,2e-06,0,0,1e-06,1e-06,-1e-06,1e-06,1e-06,-3e-06,0,1e-06,2e-06,0,0,0,-1e-06,0,-1e-06,1e-06,-1e-06,1e-06,0,1e-06,0,1e-06,0,1e-06,1e-06,-1e-06,0,0,0,0,1e-06,-2e-06,-1e-06,1e-06,3e-06,1e-06,1e-06,1e-06,1e-06,1e-06,-1e-06,0,0,1e-06,1e-06,1e-06,1e-06,0,1e-06,-1e-06,0,0,-1e-06,-2e-06,-2e-06,0,0,0,1e-06,0,2e-06,6e-06,0,0,-1e-06,-4e-06,-1e-06,-2e-06,0,0,7e-06,0,-1e-06,1e-06,-2e-06,1e-06,-1e-06,1e-06,0,0,-1e-06,-2e-06,1e-06,0,0,-2e-06,-1e-06,1e-06,1e-06,-1e-06,-2e-06,0,3e-06,0
-1e-06,0,0,-1e-06,0,1e-06,1e-06,-1e-06,0,0,0,1e-06,1e-06,1e-06,0,-1e-06,-1e-06,2e-06,0,0,0,0,2e-06,0,0,0,0,1e-06,2e-06,0,2e-06,0,2e-06,-2e-06,0,-4e-06,0,0,3e-06,0,1e-06,1e-06,0,3e-06,1e-06,0,0,1e-06,-2e-06,0,0,-1e-06,-1e-06,0,-2e-06,2e-06,0,2e-06,-1e-06,0,-2e-06,5e-06,1e-06,1e-06,-1e-06,0,3e-06,-1e-06,0,-1e-06,0,1e-06,0,0,0,1e-06,-2e-06,1e-06,0,-1e-06,-1e-06,0,0,0,1e-06,-2e-06,0,-3e-06,-1e-06,0,0,-1e-06,1e-06,-2e-06,-1e-06,-1e-06,1e-06,1e-06,0,-1e-06,1e-06,0,-1e-06,2e-06,-1e-06,0,0,0,-1e-06,-1e-06,1e-06,2e-06,2e-06,0,-2e-06,-2e-06,1e-06,-1e-06,0,0,0
0,0,0,-1e-06,0,-2e-06,-1e-06,0,0,0,0,0,0,1e-06,-1e-06,-2e-06,0,1e-06,0,0,0,0,1e-06,0,1e-06,0,0,0,0,1e-06,1e-06,1e-06,1e-06,-3e-06,-2e-06,-1e-06,0,0,0,1e-06,-1e-06,0,0,1e-06,0,0,1e-06,0,0,-1e-06,0,1e-06,-1e-06,0,-1e-06,-1e-06,0,-3e-06,-1e-06,-1e-06,-1e-06,0,-2e-06,0,1e-06,-1e-06,1e-06,0,0,-1e-06,0,2e-06,-2e-06,0,0,1e-06,-3e-06,-1e-06,1e-06,0,-1e-06,2e-06,0,0,0,1e-06,0,2e-06,4e-06,0,-1e-06,1e-06,-2e-06,-1e-06,0,0,2e-06,-2e-06,-3e-06,2e-06,-3e-06,0,1e-06,0,0,0,0,0,0,0,0,-2e-06,-1e-06,-2e-06,0,1e-06,-1e-06,1e-06,0,2e-06,0
0,0,0,0,0,1e-06,0,0,0,1e-06,0,1e-06,0,0,0,-1e-06,0,-1e-06,1e-06,0,0,0,0,0,-1e-06,0,1e-06,-1e-06,-1e-06,-1e-06,0,0,-2e-06,-2e-06,3e-06,2e-06,0,0,0,0,0,-1e-06,0,-2e-06,0,0,0,0,0,1e-06,1e-06,-1e-06,0,0,1e-06,0,0,-1e-06,1e-06,0,2e-06,-5e-06,-1e-06,-1e-06,-1e-06,0,2e-06,1e-06,0,0,0,1e-06,1e-06,0,0,-1e-06,-2e-06,0,-1e-06,0,1e-06,1e-06,0,0,0,0,0,1e-06,-2e-06,0,0,1e-06,3e-06,-1e-06,0,-1e-06,1e-06,1e-06,-1e-06,0,-1e-06,0,0,-1e-06,1e-06,0,0,0,0,0,1e-06,0,-2e-06,0,1e-06,-1e-06,0,1e-06,0,3e-06,1e-06
0,0,0,0,0,-1e-06,1e-06,0,0,0,0,-1e-06,0,0,0,0,0,0,0,-1e-06,0,0,-1e-06,0,-1e-06,0,0,-1e-06,-1e-06,-1e-06,-1e-06,1e-06,1e-06,0,-3e-06,-3e-06,0,0,-1e-06,0,1e-06,0,0,-2e-06,-1e-06,0,-1e-06,1e-06,0,-2e-06,-1e-06,0,1e-06,0,0,-1e-06,0,-1e-06,1e-06,-1e-06,0,-3e-06,1e-06,-1e-06,0,0,1e-06,0,0,1e-06,0,1e-06,-2e-06,0,0,-1e-06,-3e-06,1e-06,-1e-06,0,1e-06,-1e-06,0,0,-1e-06,-1e-06,0,-2e-06,0,0,1e-06,0,-1e-06,-1e-06,-1e-06,-1e-06,-1e-06,4e-06,1e-06,-1e-06,-1e-06,1e-06,0,1e-06,-1e-06,0,0,0,2e-06,0,0,0,0,-2e-06,0,0,0,1e-06,0,-4e-06,-1e-06
0,0,0,0,0,1e-06,-1e-06,-1e-06,0,0,0,1e-06,0,-1e-06,-1e-06,3e-06,-1e-06,1e-06,0,0,0,0,-1e-06,0,0,0,-1e-06,1e-06,0,1e-06,-1e-06,0,1e-06,1e-06,3e-06,2e-06,0,0,0,0,0,0,0,1e-06,0,0,0,-1e-06,0,1e-06,0,0,1e-06,0,-1e-06,1e-06,0,3e-06,-3e-06,0,-2e-06,1e-06,0,0,0,0,0,0,0,0,0,1e-06,-1e-06,0,0,0,-2e-06,-1e-06,0,0,1e-06,-1e-06,0,0,-1e-06,1e-06,0,3e-06,-6e-06,0,-2e-06,-1e-06,2e-06,-1e-06,1e-06,0,-1e-06,1e-06,0,1e-06,2e-06,-1e-06,0,0,0,0,0,-1e-06,1e-06,0,0,-1e-06,-1e-06,-1e-06,-1e-06,-1e-06,0,0,0,1e-06,-1e-06
0,0,0,0,0,0,0,1e-06,0,0,0,0,0,-1e-06,0,1e-06,0,1e-06,0,0,0,0,-1e-06,0,1e-06,0,0,0,1e-06,0,-1e-06,1e-06,-2e-06,0,-2e-06,-1e-06,0,-1e-06,1e-06,0,0,-1e-06,0,2e-06,0,0,0,1e-06,0,-1e-06,0,0,1e-06,0,-1e-06,-1e-06,0,-2e-06,1e-06,-1e-06,1e-06,3e-06,-1e-06,0,0,0,1e-06,0,0,0,0,1e-06,0,0,0,0,-1e-06,1e-06,1e-06,0,1e-06,0,0,0,0,0,0,-2e-06,1e-06,0,1e-06,1e-06,-3e-06,-1e-06,1e-06,-1e-06,-1e-06,-4e-06,2e-06,0,2e-06,1e-06,0,-1e-06,1e-06,0,0,1e-06,0,0,-1e-06,-1e-06,2e-06,0,1e-06,-1e-06,0,1e-06,0,-3e-06,0
0,0,0,1e-06,0,0,0,1e-06,0,-1e-06,0,1e-06,0,-2e-06,0,-1e-06,0,0,0,0,0,0,1e-06,0,1e-06,-1e-06,0,0,1e-06,-1e-06,0,0,1e-06,-1e-06,1e-06,-2e-06,0,1e-06,1e-06,0,0,0,0,-2e-06,0,0,0,0,0,1e-06,0,0,-1e-06,0,0,1e-06,0,0,0,0,1e-06,3e-06,-1e-06,1e-06,0,0,-1e-06,0,0,0,0,0,-1e-06,0,0,1e-06,0,0,0,0,-1e-06,1e-06,0,0,0,-1e-06,0,1e-06,0,0,-1e-06,1e-06,1e-06,0,-1e-06,0,0,0,0,-1e-06,1e-06,0,1e-06,1e-06,0,0,0,0,0,0,0,-1e-06,-1e-06,-2e-06,0,0,0,0,0,1e-06,0
0,0,0,0,0,0,0,-1e-06,0,0,0,-1e-06,0,0,0,-1e-06,0,0,0,0,0,0,1e-06,0,-1e-06,0,-1e-06,-1e-06,-1e-06,0,1e-06,0,1e-06,-2e-06,0,2e-06,0,-1e-06,0,0,0,0,0,-2e-06,0,0,0,0,-1e-06,0,0,0,-1e-06,0,1e-06,-1e-06,0,1e-06,1e-06,-1e-06,-2e-06,-1e-06,1e-06,0,0,0,0,0,0,0,0,0,0,0,0,0,0,0,0,0,-1e-06,0,0,0,0,0,0,0,3e-06,0,0,-1e-06,-2e-06,-1e-06,1e-06,-1e-06,1e-06,3e-06,-2e-06,0,-1e-06,1e-06,-1e-06,0,0,0,0,0,-2e-06,0,0,0,3e-06,0,0,-1e-06,1e-06,0,0,1e-06,-1e-06
0,0,0,0,0,-1e-06,0,-1e-06,0,0,0,1e-06,0,-1e-06,0,-1e-06,0,0,0,0,0,0,1e-06,0,0,-1e-06,0,0,-1e-06,0,1e-06,0,-2e-06,-2e-06,-1e-06,-2e-06,0,1e-06,-1e-06,0,0,-1e-06,0,0,0,0,0,0,0,-1e-06,0,-1e-06,-1e-06,0,0,1e-06,0,2e-06,-1e-06,0,-1e-06,-5e-06,0,0,0,-1e-06,-2e-06,0,0,0,0,0,0,0,0,-1e-06,1e-06,1e-06,0,0,-1e-06,-1e-06,0,0,0,0,0,1e-06,-1e-06,0,1e-06,0,3e-06,-1e-06,1e-06,0,1e-06,-1e-06,-1e-06,1e-06,-2e-06,0,0,-1e-06,0,0,0,0,0,0,1e-06,-2e-06,-2e-06,-1e-06,0,-1e-06,-1e-06,0,0,0,-1e-06
0,0,0,0,0,1e-06,0,0,0,0,0,-1e-06,0,1e-06,0,-1e-06,0,1e-06,0,0,0,0,0,0,-1e-06,0,0,1e-06,-1e-06,0,0,-1e-06,1e-06,-1e-06,2e-06,1e-06,0,-1e-06,-1e-06,0,0,0,0,3e-06,0,0,0,0,0,1e-06,0,1e-06,0,0,-1e-06,-1e-06,0,-3e-06,-1e-06,-1e-06,2e-06,-2e-06,0,0,0,0,-2e-06,0,0,0,0,0,0,0,0,-1e-06,2e-06,0,0,0,0,-1e-06,0,0,0,0,0,-1e-06,3e-06,0,-1e-06,1e-06,-2e-06,-1e-06,0,-1e-06,0,-4e-06,-1e-06,-1e-06,-1e-06,0,0,1e-06,0,0,0,0,0,0,0,-1e-06,3e-06,-1e-06,0,-1e-06,0,0,0,2e-06,0
0,0,0,0,0,-1e-06,0,1e-06,0,0,0,1e-06,0,0,0,1e-06,-1e-06,0,0,0,0,0,-1e-06,0,1e-06,0,0,0,1e-06,0,-1e-06,0,1e-06,0,-3e-06,2e-06,0,1e-06,1e-06,0,0,0,0,-1e-06,0,0,0,0,1e-06,-1e-06,0,-1e-06,0,0,0,1e-06,0,1e-06,2e-06,0,1e-06,2e-06,0,0,0,0,-1e-06,0,0,0,0,0,1e-06,0,0,0,2e-06,0,0,0,1e-06,0,0,0,0,0,0,2e-06,-3e-06,0,0,0,2e-06,-1e-06,0,0,-1e-06,-1e-06,0,0,1e-06,1e-06,0,0,0,0,0,0,0,0,0,-1e-06,-4e-06,0,0,-1e-06,-1e-06,1e-06,0,-3e-06,0
