-0.000388,-0.000345,-0.000351,-0.000317,-0.000454,-0.000471,-0.000277,-0.000269,-0.000446,-0.000373,-0.00021,-0.000304,-0.000232,-0.000221,-0.000165,-0.000143,-0.000146,-0.00018,-0.000177,-0.000129,-0.000149,-0.00019,-0.000198,-0.000122,-0.000169,-0.000138,-0.000152,-0.000228
-0.000447,-0.00038,-0.000372,-0.00039,-0.000598,-0.000625,-0.000342,-0.000316,-0.000459,-0.000394,-0.000227,-0.000302,-0.000224,-0.000245,-0.000179,-0.000169,-0.000133,-0.000165,-0.000176,-0.000147,-0.000159,-0.000179,-0.00015,-0.000112,-0.000179,-0.000162,-0.000185,-0.000227
-9.6e-05,-7.5e-05,-1.8e-05,-8.5e-05,-0.00011,-0.000144,-9.1e-05,-9.8e-05,6e-06,-3.1e-05,-7.3e-05,-5.3e-05,-6.9e-05,-7.7e-05,-4.6e-05,-5.3e-05,-1.4e-05,-1e-05,-3.3e-05,-5.5e-05,-1.8e-05,7e-06,5.2e-05,-3e-06,0,-3.2e-05,-4.8e-05,2e-06
0.000272,0.000245,0.000308,0.000261,0.000428,0.000424,0.000226,0.000182,0.000382,0.000314,0.000129,0.000208,0.000134,0.000153,0.000112,7.4e-05,7.2e-05,0.000106,9e-05,5.4e-05,9.6e-05,0.000148,0.000165,7e-05,0.00014,0.000136,0.000127,0.000182
0.000283,0.000269,0.000243,0.000279,0.000428,0.000434,0.000224,0.000232,0.000234,0.000215,0.000142,0.000228,0.000189,0.000174,8.7e-05,7.2e-05,4.8e-05,6.4e-05,7.5e-05,6.8e-05,6.8e-05,9.2e-05,3.3e-05,2.5e-05,6.1e-05,8.5e-05,0.000128,0.000114
-6e-06,2e-06,-0.000103,-9e-06,-5.7e-05,-6.2e-05,-4.8e-05,3.5e-05,-0.000182,-0.000123,-4e-06,-4.8e-05,1.5e-05,-8e-06,-5.4e-05,-4e-06,-2.6e-05,-5.4e-05,-3.2e-05,-5e-06,-3.4e-05,-7.1e-05,-0.000129,-3.8e-05,-8.8e-05,-7.9e-05,-1.7e-05,-7.7e-05
-0.000202,-0.000211,-0.000279,-0.000223,-0.000408,-0.000412,-0.000211,-0.000135,-0.00028,-0.00022,-0.00011,-0.000267,-0.000149,-0.000118,-9.4e-05,-3.4e-05,-2.7e-05,-7.3e-05,-6.3e-05,-3.4e-05,-5.8e-05,-0.000117,-7.8e-05,-1.1e-05,-8.1e-05,-0.000117,-0.000106,-0.000118
-0.000131,-0.000141,-0.000106,-0.000157,-0.000233,-0.000229,-0.000129,-0.000134,2e-06,-2.8e-05,-8.7e-05,-0.000151,-0.000129,-8.2e-05,-3.4e-05,-3e-05,1.1e-05,-6e-06,-1e-06,0,-1e-06,-1.8e-05,5.4e-05,3.3e-05,3.1e-05,-4.1e-05,-7.4e-05,-7e-06
7.5e-05,9e-05,0.00019,6.7e-05,0.000187,0.000229,0.00011,-2e-06,0.00024,0.00018,5.6e-05,0.000137,2.3e-05,3.1e-05,6.6e-05,-4e-06,1.1e-05,6.4e-05,6.4e-05,3.8e-05,4.3e-05,7.3e-05,8.8e-05,2.5e-05,1e-04,9.6e-05,3.7e-05,7.7e-05
0.000116,0.00014,0.000224,0.000162,0.000313,0.000364,0.000199,6e-05,8e-05,7.6e-05,8.3e-05,0.000217,8.1e-05,4.9e-05,6.7e-05,-2e-06,-2.6e-05,4.9e-05,3.5e-05,1.4e-05,8e-06,4.5e-05,-9e-06,-2.4e-05,3.3e-05,0.000107,7.5e-05,2.4e-05
4e-06,-3e-06,-1.3e-05,5.9e-05,6.3e-05,7.4e-05,6.1e-05,5.7e-05,-0.000175,-0.000126,5e-06,7e-05,4.7e-05,-1.2e-05,-2.9e-05,-9e-06,-1.2e-05,-9e-06,-3.4e-05,-2e-05,-2.3e-05,-3e-06,-5.7e-05,-2.9e-05,-6.4e-05,-7e-06,2.3e-05,-4.5e-05
-2.6e-05,-8.4e-05,-0.000185,-6.9e-05,-0.000212,-0.000242,-9.1e-05,6.9e-05,-0.000103,-8.8e-05,-1.5e-05,-8.4e-05,4.3e-05,9e-06,-5.4e-05,3e-05,5.5e-05,-1.8e-05,-3.1e-05,-4e-06,1.6e-05,5e-06,2.4e-05,2.6e-05,-4.5e-05,-5.2e-05,-1e-06,-1e-06
0,-4.1e-05,-0.000135,-9.6e-05,-0.000207,-0.000291,-0.000151,-9e-06,8.9e-05,3.5e-05,-3.9e-05,-0.000166,-2e-05,5.1e-05,1.5e-05,6.2e-05,5.8e-05,-1.5e-05,4e-06,5e-06,3.2e-05,-7e-06,3.6e-05,3.5e-05,1.6e-05,-4e-05,-1.6e-05,5e-05
-7e-06,4.3e-05,4.8e-05,-1.2e-05,5.1e-05,-2.7e-05,-6e-05,-9.3e-05,0.000127,0.000117,0,-7e-05,-6.6e-05,4.6e-05,8.7e-05,3.1e-05,-7e-06,1e-06,2.6e-05,-2e-06,-3e-06,-2e-05,-1.9e-05,-8e-06,4.4e-05,1.6e-05,-2e-05,2e-05
-4.5e-05,4.8e-05,0.000155,7.1e-05,0.000222,0.00024,8.7e-05,-6.1e-05,1.3e-05,7.4e-05,8.4e-05,0.000155,-1e-06,-2.2e-05,4.4e-05,-3.7e-05,-5.9e-05,1.3e-05,1.1e-05,-5e-06,-3e-05,4e-06,-2.7e-05,-3.1e-05,2.3e-05,5e-05,-1.3e-05,-4.6e-05
-6.2e-05,-3.4e-05,7.2e-05,5.3e-05,9.8e-05,0.000184,9.9e-05,1e-05,-0.000116,-8.5e-05,4.8e-05,0.000183,1.9e-05,-0.000103,-6e-05,-6e-05,-5.5e-05,-1.6e-05,-3.8e-05,-1.3e-05,-2.3e-05,1.7e-05,-3e-06,-1.5e-05,-2.7e-05,-1.1e-05,-3.8e-05,-7.5e-05
2e-06,-5.8e-05,-6.7e-05,-2.4e-05,-0.000135,-6.3e-05,3e-06,6.2e-05,-8.2e-05,-0.000108,-3.9e-05,-3.8e-05,-1.2e-05,-5.9e-05,-6.9e-05,-7e-06,9e-06,-2.4e-05,-4.2e-05,-1e-05,2e-06,2e-06,2.9e-05,1.2e-05,-3.3e-05,-4.1e-05,-1.5e-05,-5e-06
7.4e-05,-2e-06,-0.000125,-8.1e-05,-0.000188,-0.000182,-8.3e-05,5.6e-05,4.5e-05,-9e-06,-9.8e-05,-0.000202,-5e-06,5.1e-05,-1.2e-05,4.6e-05,5.2e-05,-1.7e-05,3e-06,1e-06,9e-06,-2.7e-05,3e-06,9e-06,-6e-06,-2.9e-05,4.7e-05,7.6e-05
8e-05,5.8e-05,-5.9e-05,-5.4e-05,-1.6e-05,-6.3e-05,-7.1e-05,-7e-06,8.3e-05,5.2e-05,-7.3e-05,-0.000127,1.9e-05,0.000101,4.2e-05,3.3e-05,2.2e-05,-3e-06,3.6e-05,1.3e-05,1e-06,-2.9e-05,-4.1e-05,-2e-06,1.2e-05,-2e-06,5e-05,5e-05
