6.4e-05,0.000104,7e-05,3.6e-05,1.3e-05,3.9e-05,8.5e-05,1e-05,3e-05,0,0.000171,5.8e-05,6e-06,8.8e-05,4e-05,7e-06,0.000225,6.1e-05,0.000102,0.000148,5.7e-05,2.1e-05,7.2e-05,4.2e-05,7.9e-05,5.7e-05,0.00016,1e-05,0.00016,7.5e-05,1.3e-05,0.000117,7.1e-05,0.000105,6e-05,1.7e-05,0.000137,3e-05,5.2e-05,8e-05,1.2e-05,1.1e-05,6.8e-05,1.1e-05,1.4e-05,5e-05,2e-05,9.4e-05,2.1e-05,0.000172,3.5e-05,0.000169,1.1e-05,3.7e-05,4e-05,1.6e-05,0.000125,0.000111,4.3e-05,9.2e-05,5.1e-05,1.1e-05,0.000133,1e-05,3.4e-05,0.000198,8.8e-05,6.1e-05,1.9e-05,4.3e-05,9.6e-05,5.1e-05,3.4e-05,3.1e-05,3.3e-05,7e-05,2e-05,8.3e-05,0,4e-05,3.5e-05,3.4e-05,0.00011,3.7e-05,6e-05,2.1e-05,2.1e-05,1e-05,2.5e-05,2e-06,6.9e-05,1e-05,6e-05,1.6e-05,4.1e-05,2.8e-05,3e-06,5.6e-05,8.1e-05,9.3e-05,9.1e-05,8e-06,1.2e-05,2.7e-05,8.5e-05,4.8e-05,3.2e-05,2.9e-05,3.2e-05,5.9e-05,5.9e-05,0.000196,1.6e-05,6.2e-05,5.7e-05,0.000182,3.3e-05,7.1e-05,3.3e-05,0.00014,4.1e-05
7.3e-05,0.00021,0.000129,9.5e-05,8.1e-05,0.000133,0.000228,5.2e-05,3.8e-05,0.000119,0.000351,0.00015,4.7e-05,0.000215,8.2e-05,4.9e-05,0.000509,0.00015,0.000212,0.00033,0.000123,3.9e-05,0.00015,8.1e-05,0.000135,0.000126,0.000326,8.6e-05,0.00036,0.000172,5.3e-05,0.000278,0.000154,0.000208,3.8e-05,6.8e-05,0.000285,0.000118,6.7e-05,0.00017,0.000127,7.1e-05,0.000154,5.7e-05,9.7e-05,4e-05,3.6e-05,0.000233,0.000183,0.000348,8.1e-05,0.000302,7.3e-05,7.5e-05,0.000156,4.6e-05,0.000212,0.000235,9.6e-05,0.000242,7.2e-05,1.3e-05,0.00026,1.3e-05,0.000107,0.000373,0.000263,0.000241,0.00013,9.6e-05,0.000175,0.000115,7.7e-05,9.5e-05,7.3e-05,0.000109,0.000109,0.000229,8.9e-05,0.000111,8.8e-05,4.3e-05,0.000278,0.000103,0.000215,5.8e-05,4.3e-05,5.6e-05,3.1e-05,6.1e-05,0.000218,6.1e-05,0.000127,0.000143,5e-05,4.1e-05,4.3e-05,0.000147,8.2e-05,0.000176,0.000275,0.000169,9.8e-05,0.000145,0.00022,9.2e-05,7.2e-05,7.4e-05,5.2e-05,7.9e-05,0.000109,0.00044,5.9e-05,0.000175,0.000105,0.000374,7.8e-05,0.000127,7.2e-05,0.000259,0.000136
0.000337,0.000302,0.000288,7.9e-05,0.000293,3.7e-05,0.000276,4.5e-05,3.3e-05,0.000174,0.000639,8.2e-05,0.000242,0.000114,0.000206,0.000195,0.000553,0.000282,0.000141,0.00058,0.000263,0.000233,0.000326,0.00017,0.000169,0.000216,0.000392,0.000251,0.000518,0.000276,0.000327,0.000746,0.000146,0.000151,0.000219,0.000416,0.00024,5.8e-05,0.000282,0.000287,0.000328,0.000449,0.000396,0.000119,0.000106,0.000158,0.000238,0.000236,0.000163,0.000529,0.000135,0.000524,0.000181,7.3e-05,0.00025,0.000155,0.000296,0.000332,0.000201,0.000349,0.000242,6e-05,0.000337,0.000314,9.9e-05,0.000628,0.000404,0.000188,0.000195,6.8e-05,0.000234,3.9e-05,0.000147,0.000169,0.000168,0.000233,0.000213,0.000293,0.000116,7.9e-05,0.000146,0.000167,0.000352,9.4e-05,0.000265,0.000106,2e-04,0.000127,0.000276,9.5e-05,0.000225,0.000148,0.000204,0.000194,0.000186,0.000147,8.2e-05,0.000278,0.000195,0.000202,0.000446,0.000158,0.000351,0.000215,0.00038,0.000151,0.000113,0.000229,8.5e-05,3.2e-05,0.000119,0.00051,0.000253,0.000319,6.6e-05,0.000604,9.4e-05,0.000276,0.000278,0.000404,0.000151
0.000618,0.000755,0.000957,0.000515,0.000485,0.000898,0.000743,0.000695,0.000333,0.000287,0.001102,0.000834,0.000817,6e-04,0.000207,0.00026,0.000842,0.000798,0.000852,0.000912,0.000584,0.000784,0.000774,0.000691,0.00084,0.000552,0.000278,0.000384,0.000951,0.000163,0.000255,0.000966,0.000843,0.000256,0.000577,0.000357,0.000754,0.000537,0.000741,0.001188,0.00088,0.000309,0.000376,0.000715,8.4e-05,0.000434,8.8e-05,0.000353,0.000178,0.000556,0.000567,0.000526,0.00049,0.000404,0.000585,0.00052,5.5e-05,0.000262,0.000366,1.7e-05,0.000227,0.000332,0.000225,0.000703,0.000639,0.001107,0.001175,0.000946,0.000923,0.000632,0.00051,0.000335,1e-04,0.000378,0.000299,0.000666,0.000816,0.000626,0.000822,0.000795,0.000547,0.000228,0.00041,0.000297,0.000446,0.00034,0.000451,0.000123,0.000409,0.000575,0.000892,0.000839,0.000767,0.000349,0.000466,0.000251,0.000308,0.000553,0.000935,0.000228,0.000947,0.001016,0.00102,0.000731,0.000811,0.000492,0.000302,0.000392,0.000143,0.000181,0.000366,0.000622,0.000275,0.000183,0.000357,0.000845,0.000484,0.000294,0.000901,0.00123,0.000792
0.000498,0.000688,0.000837,0.000603,0.000327,0.000715,0.000281,0.000342,0.000275,0.000682,0.000309,0.000577,3.5e-05,0.000164,0.000737,0.000328,0.000529,0.000898,0.000284,0.000201,0.000687,0.000205,0.000827,0.000873,0.000286,0.00058,0.000756,0.00044,0.000684,0.000662,0.000182,0.000765,0.000849,0.000962,0.000915,0.001106,0.001076,0.001104,0.000865,0.000513,4.2e-05,0.000511,0.00023,0.000673,0.001205,0.00067,0.000423,0.000148,0.000177,0.000415,0.000784,0.001152,0.000672,0.000545,0.000439,0.000429,0.000433,0.000467,0.000351,0.000312,0.000493,0.00031,0.000228,0.000438,0.001111,0.000976,0.000764,0.001027,0.000316,0.000208,0.00041,0.000314,0.000418,0.000264,0.000536,0.000314,0.000708,0.00051,0.000456,0.000446,0.000207,0.000284,0.00013,0.000152,0.000101,9.9e-05,0.000295,0.000462,0.000567,0.000805,0.00089,0.000973,0.000491,0.000338,0.00033,0.000561,0.000926,0.001025,0.001723,0.001213,0.001422,0.001122,0.000412,0.000595,0.000346,0.000664,0.000467,0.000371,0.000288,0.000291,0.000556,0.000381,3.6e-05,0.000385,0.000747,0.001428,0.00104,0.000453,0.00082,0.000602,0.000423
0.000427,8.2e-05,0.000432,7.6e-05,0.000132,0.000323,0.000324,9.6e-05,0.000182,0.000481,0.000508,0.000281,0.000202,0.000388,0.000479,0.00043,0.000733,0.000798,0.000591,0.000326,0.000628,0.000581,0.000485,0.000311,0.000916,0.000683,0.000412,0.000154,0.000225,0.000356,0.00027,0.000587,0.000472,0.000169,0.000443,0.000717,0.000236,0.000696,0.000183,0.00071,0.000493,0.000523,5.4e-05,0.000677,0.000756,3e-04,0.000493,0.000318,0.000427,0.000168,0.000226,0.000517,0.00052,0.000317,0.000492,0.000389,0.000298,0.00047,0.000528,0.000379,0.000522,0.000137,0.000205,0.000221,0.000841,0.000417,0.00041,0.000415,0.000343,0.00046,0.000534,0.000322,0.000492,0.000767,0.000491,0.000567,0.00034,0.000251,0.000476,0.000568,0.00017,0.000218,0.000254,3.6e-05,0.000143,5.2e-05,0.000186,0.000245,0.000527,0.000363,0.00043,0.000534,0.000372,0.000277,0.000524,0.000394,0.000624,0.000724,0.000643,0.000239,0.000584,3e-04,0.000224,0.000392,0.000424,0.00031,0.000194,0.00012,0.000331,0.000116,0.000236,0.000854,0.00012,0.000546,0.000197,0.000754,0.000545,0.000414,0.000699,0.000555,0.000383
0.000224,8.1e-05,0.000309,0.000388,0.000263,0.000514,0.000536,0.000335,7.1e-05,0.000414,0.000456,0.000531,0.00058,0.000426,0.000227,0.000272,0.000862,0.000364,0.000443,0.000181,0.000421,0.000247,0.000846,0.000293,0.000969,0.000124,0.000276,0.000536,4.6e-05,0.000159,0.000319,0.000297,0.000163,0.000198,0.000423,0.000207,0.000491,0.000873,0.00033,5.9e-05,0.000121,9.9e-05,0.000301,0.000261,0.000597,0.000256,0.000725,0.00025,0.000745,0.000176,0.000119,0.000497,0.000669,0.00047,0.000334,3.4e-05,0.000446,0.000184,0.000348,0.00014,0.000328,0.000447,0.000461,0.000376,0.00026,0.000683,0.000564,0.00059,0.000426,0.000574,0.000318,0.000255,0.000415,0.000565,0.000474,0.000301,0.000395,6e-05,0.00023,0.000168,0.000489,0.000214,0.000522,7.6e-05,9.7e-05,0.000441,0.000134,0.000254,0.000185,0.000896,0.000738,0.000718,0.000485,0.000642,0.000545,0.000268,0.000626,0.000683,0.000222,0.000279,0.000889,0.000683,0.00027,0.000162,0.000102,0.000501,0.000366,0.000473,0.000125,0.000302,0.000464,0.001247,0.000925,0.000324,0.000287,2.5e-05,0.000228,0.000445,0.000554,0.000688,0.000287
0.000985,0.000274,0.00047,0.000754,0.000721,0.000639,0.001015,0.001593,0.000967,0.000301,0.000547,0.001135,0.001212,0.001016,0.000703,0.000788,0.001732,0.001976,0.001125,0.000903,0.000303,0.000475,0.000949,0.000598,0.001017,0.000844,0.000307,0.000154,0.000552,0.000228,0.000787,0.001006,0.000862,0.000556,0.000748,0.000878,0.000941,0.000193,0.000909,0.000484,0.000831,0.000724,0.000331,0.000319,0.000143,0.001,0.000833,0.000938,0.001274,0.001306,0.000492,0.000498,0.000316,0.001037,0.000572,0.000301,0.000755,0.001052,0.000533,0.000291,0.000695,0.000726,0.000981,0.000478,0.000727,0.001656,0.000689,0.000851,0.000734,0.000257,0.000568,0.000452,0.000334,0.000961,0.001139,0.000997,0.000671,0.000787,0.000248,0.000617,0.00091,0.001015,0.00063,0.000522,0.000265,0.000805,0.000558,0.000176,0.000208,0.000924,0.00019,0.000139,0.000294,0.000739,0.001423,0.001003,0.000425,0.000681,6e-05,0.000222,0.00117,0.00073,0.000598,0.000648,7.2e-05,0.000665,0.001154,0.000335,0.000586,0.000339,0.000998,0.000786,0.001104,0.001385,0.001299,0.000729,0.000727,0.000283,0.000365,0.000223,0.000271
0.000161,0.000851,0.000987,0.000659,0.000399,0.000966,0.001008,0.001064,0.000583,0.000978,0.000391,0.00076,0.001715,0.001673,0.002198,0.001005,0.00207,0.002427,0.001811,0.000946,0.001126,0.000807,0.000188,0.000866,0.000636,0.000922,0.00061,0.000661,0.000905,0.000337,0.001388,0.000537,0.00124,0.001078,0.000558,0.000756,0.000183,0.000936,0.001489,0.001809,0.002279,0.0011,0.000268,0.000467,0.001101,0.000952,0.000736,0.000277,0.000375,0.001465,0.00112,0.000485,0.000422,0.001308,0.00192,0.001631,0.001734,0.001728,0.001435,0.001393,0.001812,0.001342,0.000385,0.00017,0.001403,0.002581,0.001856,0.002089,0.001654,0.001531,0.001047,0.001372,0.001037,0.000676,0.00047,0.000605,0.000648,0.000623,0.000583,0.001129,0.000615,0.000954,0.001453,0.001264,0.001103,0.001461,0.000819,0.000868,0.000541,0.001011,0.00113,0.001209,0.000279,0.000614,0.00062,0.00044,0.000484,0.000669,0.000685,0.000451,0.001208,0.00188,0.001945,0.000803,0.000607,0.001217,0.000892,0.000572,0.001081,0.001218,0.001653,0.001259,0.000833,0.000214,0.001037,0.000479,0.000482,0.000448,0.000338,0.000397,0.000138
0.001445,0.001905,0.000586,0.00074,7.8e-05,0.000666,0.000366,0.001263,0.000359,0.001127,0.001359,0.000377,0.00094,0.000322,0.001528,0.001213,0.001101,0.000589,0.000421,0.000631,0.000473,0.00047,0.000106,0.000581,0.000967,9.4e-05,0.000333,0.00091,0.000599,0.00082,0.001706,0.001918,0.001114,0.000551,0.001208,0.000397,0.000339,0.000866,0.000416,0.001031,0.001191,0.00098,0.000148,0.000541,0.001193,0.001727,0.00113,0.000307,0.000707,0.000937,0.00058,0.000241,0.000528,0.00157,0.000638,0.000614,0.000721,0.000563,0.000606,0.001004,0.000901,9.6e-05,0.000264,0.000264,0.001031,0.000976,0.000842,0.001072,0.000388,0.00071,0.000776,0.001007,0.000948,0.000755,0.000424,0.000361,0.000229,0.00128,0.000706,0.000501,0.000589,0.000443,0.000999,0.000997,0.000592,0.000498,0.000277,0.000661,0.000496,0.000679,0.000959,0.000788,0.000622,0.000819,0.000705,0.000747,0.000227,0.000315,0.000945,0.000493,4e-04,0.000954,0.000424,0.000493,0.000693,0.000663,0.000826,0.000629,0.001701,0.001215,0.000254,0.000658,0.000352,0.000172,0.000517,0.000628,0.000952,0.000334,0.000302,0.00038,0.000171
0.001614,0.001517,0.001411,0.000888,0.000673,0.000792,0.000873,0.000567,0.000883,0.001469,0.001835,0.001654,0.000915,0.000671,0.00084,0.000533,0.001263,0.001222,0.001158,0.001014,0.000485,0.000619,0.000461,0.000256,0.000418,0.000888,0.000945,0.000757,0.001749,0.001343,0.001218,0.000627,0.000599,0.000526,0.000132,0.000458,0.000556,0.000385,0.000401,0.000655,0.001142,0.000854,0.001044,0.000348,0.001874,0.001886,0.000481,0.000474,0.000613,0.000364,8e-04,0.000599,0.00023,0.000469,0.000787,0.000552,0.001223,0.001088,0.001104,0.001391,0.001382,0.000861,0.000198,0.000367,0.000202,0.000503,0.000448,0.00115,0.001013,8.1e-05,0.000319,0.001275,0.000192,0.000857,0.000427,0.000297,0.000243,0.001095,0.000794,0.000647,0.000613,0.000507,0.001286,0.000325,0.000541,0.000645,0.000508,0.000529,0.000251,0.000581,0.000861,0.00137,0.001013,0.000459,0.001004,0.000286,0.000737,0.000465,0.001123,0.00113,0.000897,0.000478,0.000515,0.000428,0.000568,0.000744,0.001145,0.000468,0.001201,0.000577,0.000573,0.000683,0.000553,0.000764,0.000624,0.000714,0.000412,0.000397,0.00013,0.00042,0.000426
0.001433,0.000442,0.000944,0.000614,0.000406,0.00037,0.000723,0.001129,0.000578,0.00068,0.000734,0.000356,0.000448,0.000352,0.000679,0.000655,0.000623,0.000817,0.000698,0.000248,0.000171,0.00011,0.000366,0.000404,0.000614,0.00089,3.7e-05,0.00021,0.001243,0.000575,0.001066,0.001302,0.000927,0.000318,0.000497,0.000715,0.000539,0.000767,0.000549,0.000407,0.00067,0.000534,0.00073,0.000704,0.001332,0.001084,0.000695,0.000132,0.000489,0.000419,0.000352,9.4e-05,0.000482,0.000523,0.000812,0.000224,0.000601,0.000363,0.000431,0.000169,0.000721,0.0011,0.001153,0.000918,0.000522,0.000414,0.000824,0.000626,0.00015,0.000373,0.000136,0.000544,0.000469,0.000519,0.000415,0.000558,0.000416,0.000895,0.000792,0.000633,0.000542,0.001088,0.000507,0.000373,0.000632,0.00036,0.000146,0.000127,0.000415,0.000807,0.000607,0.000148,0.000481,0.00105,3.2e-05,0.00025,0.000488,0.000209,0.000847,0.000689,0.000238,0.000548,0.000804,0.000752,0.000995,0.000673,0.00099,0.000511,0.000797,0.001104,0.000493,0.000466,0.00088,0.00112,0.000785,0.000134,0.000366,3.4e-05,0.000167,0.000181,0.000118
0.000344,0.000384,0.000468,0.000213,0.000564,0.000317,0.000268,0.00041,0.000191,0.000547,0.000436,0.000203,0.000166,0.000223,0.00023,0.000264,0.000574,0.00045,0.000206,0.000429,0.000499,3e-04,0.000221,0.000141,0.000466,0.000129,0.000239,0.000565,0.00024,9.5e-05,0.000269,0.000627,0.000424,0.000238,0.000443,0.000129,0.000105,0.000399,0.000516,0.000441,9.4e-05,0.000543,0.000241,0.000264,0.000973,0.000306,0.000264,0.000204,0.000402,0.000303,3e-05,0.000167,0.000481,0.000442,0.000319,0.000507,0.000293,0.000142,0.000453,0.000774,0.000482,0.000447,0.000155,0.000443,0.000442,0.000398,0.000408,0.000301,5.8e-05,1e-04,0.000239,0.000135,2.5e-05,0.000225,0.000269,3.8e-05,0.000131,0.000211,0.000234,0.000381,0.000878,0.000451,0.000209,0.000343,0.000456,0.000177,0.000213,0.000445,0.000265,0.000324,0.000561,0.000234,0.000522,0.000264,0.000167,0.000239,0.000155,9.2e-05,0.000162,0.000415,0.000681,0.000225,0.000388,0.000661,0.000564,0.000713,0.00015,0.000163,0.000635,0.000758,0.00051,0.000664,0.000458,0.000458,0.000232,0.000249,0.000212,0.000307,0.000136,0.000204,0.000365
0.000606,0.00027,0.000598,0.00059,0.000507,0.000311,0.000398,0.000416,0.000145,0.000286,0.000385,0.000482,0.000316,0.000591,0.000469,0.000615,0.000732,0.000756,0.00012,0.000406,0.000635,0.000576,0.000266,0.00028,0.000465,0.000419,0.000403,0.000239,0.000245,0.000319,0.000494,0.000534,0.000346,0.000269,0.000314,0.000289,0.000437,0.000595,0.000657,0.000563,0.00051,0.000677,0.000265,0.000327,0.000789,0.000443,0.000301,0.000575,0.000724,0.001,0.000547,0.000237,0.000166,0.000623,0.000452,0.000415,8.8e-05,0.000204,0.000531,0.000629,9e-05,0.000403,0.000566,0.000551,0.000461,0.000499,0.000497,7.6e-05,0.000205,7e-05,0.000299,0.000516,0.00032,0.000445,0.000259,0.000173,0.000371,0.00056,0.000122,0.000211,0.000458,0.000613,0.000423,0.000269,0.000586,0.000569,0.000477,0.000202,2.4e-05,0.000192,0.000401,0.000782,0.000145,0.000563,0.000212,0.000108,0.000285,0.000238,0.00047,0.000426,0.000627,0.000428,0.000718,0.000659,0.000465,0.000502,0.000255,0.000139,0.000654,0.000695,0.00016,0.000293,0.000197,0.000632,0.000325,0.00032,0.000184,0.000292,0.000219,0.00032,0.000395
0.000626,0.000885,0.00067,0.000127,0.000519,0.000329,0.000363,0.001109,0.000785,0.000363,0.000712,0.000405,0.000315,0.000956,0.000292,0.000616,0.000524,0.000649,0.000589,0.000457,0.000657,0.000458,0.000397,0.000369,0.000629,0.000481,0.000259,0.000189,0.000511,0.000506,0.000539,0.000578,0.000302,0.00028,0.00076,6e-04,0.000452,0.000483,0.000674,0.000401,0.000475,0.000374,0.000343,0.000428,0.001104,0.000512,0.000427,0.001257,0.000631,0.001514,0.000583,0.00026,0.00024,0.000234,0.000362,0.000601,0.000562,0.000357,0.000573,0.000465,0.000687,0.000211,0.000524,0.000278,0.001141,0.000548,0.000227,0.000399,0.00038,0.000347,0.000225,0.000414,0.000698,0.000936,0.001107,0.000455,0.000688,0.000268,0.00061,0.00067,0.000728,0.000618,0.000207,0.000388,0.001174,0.001238,0.000433,0.000204,0.000397,0.000538,0.00037,0.000451,0.000662,0.000688,0.000517,0.000167,0.00014,0.000429,0.000466,0.000282,0.000179,0.00093,0.000646,0.001069,0.00083,0.000694,0.000428,0.000461,0.000418,0.000969,0.00132,0.001206,0.000857,0.000621,0.000885,0.000761,0.000759,0.000437,0.000242,0.000775,0.000363
0.000975,0.001157,0.001084,0.00063,0.000546,0.001404,0.000633,0.001552,0.001705,0.001826,0.001087,0.000768,0.000324,0.000979,0.000853,0.001008,0.001678,0.000635,0.000879,0.001608,0.001696,0.001483,0.00038,0.000584,0.00044,0.001204,0.000658,0.000398,0.000769,0.00123,0.001027,0.000666,0.000928,0.000958,0.001009,0.00036,0.000959,0.000542,0.000761,0.000853,0.001007,0.000911,0.001012,0.00095,0.001905,0.001277,0.001255,0.002025,0.001884,0.002844,0.002625,0.001433,0.000294,0.000118,0.000648,0.000975,0.000792,0.001273,0.000411,0.00089,0.001291,0.001599,0.00046,0.00014,0.001616,0.00213,0.002013,0.001044,0.000888,0.000293,0.000557,0.000372,0.000488,0.000768,0.000927,0.001308,0.000557,0.000665,0.00131,0.000232,0.001639,0.001856,0.00159,0.001447,0.001261,0.000416,0.001116,0.000834,0.00056,0.000522,0.001635,0.001196,0.001263,0.001908,0.001724,0.001083,0.000233,0.000906,0.001095,0.001174,0.000744,0.001591,0.001438,0.000487,0.000977,0.000319,0.001181,0.000957,0.000406,0.000661,0.000675,0.001898,0.002887,0.001071,0.000987,0.000846,0.000438,0.000923,0.000481,0.000732,0.001627
0.000735,0.000642,0.000643,0.001837,0.002086,0.002724,0.001815,0.001142,0.000349,0.000903,0.002146,0.002511,0.00174,0.001818,0.001248,2e-04,0.001985,0.002631,0.001624,0.001039,0.000764,0.001739,0.001492,0.00107,0.000597,0.000927,0.001103,0.00128,0.001319,0.000727,0.000787,0.001205,0.002019,0.002377,0.002219,0.001311,0.001605,0.001697,0.001921,0.001796,0.002327,0.001151,0.000224,0.000468,0.000889,0.00138,0.000537,0.001252,0.000633,0.001416,0.001666,0.001197,0.001557,0.001343,0.001115,0.001549,0.001095,0.002055,0.002681,0.003158,0.003238,0.000836,0.000532,0.000518,0.001393,0.001175,0.000889,0.001112,0.000954,0.001092,0.000689,0.000265,0.00036,0.000174,0.001126,7e-04,0.000387,0.001193,0.001441,0.001331,0.002031,0.001587,0.000184,0.000833,0.002251,0.002412,0.001829,0.001169,0.0016,0.001253,0.002719,0.003308,0.001959,0.000395,0.000936,0.000565,0.00126,0.001095,0.000867,0.001911,0.0011,0.000826,0.000786,0.000244,0.001265,0.001274,0.001542,0.001357,0.000544,8e-05,0.000165,0.002232,0.00334,0.002986,0.002285,0.000762,0.000597,0.001405,0.001245,0.000946,0.001877
0.001339,0.00046,0.000373,0.001527,0.001002,0.000633,0.000341,0.000895,0.000584,0.000415,0.000798,0.000776,0.000585,0.00073,0.000243,0.000355,0.001483,0.000892,0.00019,0.000752,0.000859,0.001149,0.000503,0.000201,0.000298,0.000106,0.000447,0.000454,0.000244,0.000429,0.000313,0.000476,0.001052,0.000549,0.000645,0.000502,0.000988,0.00052,0.000444,0.000496,0.000977,0.000628,0.00049,0.000171,0.000652,5.7e-05,0.000401,0.000509,0.000452,0.000921,0.000415,0.000651,0.000688,0.000285,0.000499,0.000406,0.001125,0.001408,0.001231,0.001456,0.000503,0.000899,0.000747,0.000208,0.001017,0.000892,0.000213,0.00081,0.000331,0.000937,0.000685,0.000272,0.00018,0.000232,0.000746,0.000279,0.000693,0.000576,0.000669,0.000242,0.000959,0.000207,0.000561,0.000126,0.000953,0.001013,0.000248,0.000765,0.00084,0.000958,0.001379,0.000834,0.000435,0.00048,0.000192,0.000498,0.000964,0.000479,0.000467,0.001216,0.000519,0.000534,0.00038,0.001155,0.001918,0.000852,0.001112,0.000339,9e-05,0.000396,0.000833,0.001126,0.000916,0.000697,0.000169,0.000197,0.000446,0.000842,0.000332,0.000245,0.001096
6.8e-05,0.000248,0.000218,0.000913,0.000579,0.000169,0.000538,0.000673,0.000222,0.000412,0.000818,0.00029,0.000572,0.000568,0.000308,0.00021,0.000839,0.000694,0.000322,0.000293,0.000453,2.6e-05,0.000347,0.000113,0.000357,0.000676,0.000255,0.000242,0.000197,7.6e-05,0.000311,0.000749,0.000126,0.000307,0.00036,0.000113,0.000487,0.000283,8.6e-05,0.00023,0.000584,0.000399,0.000309,0.000521,0.000343,0.000133,0.000378,0.000605,0.00033,0.000979,0.000505,0.000119,0.000446,0.000292,0.000161,0.00014,0.00072,0.000534,0.000914,0.000684,0.000633,0.000554,4.2e-05,0.000101,0.000764,0.00106,0.000826,0.000506,0.000642,0.000663,4.6e-05,0.000228,0.000225,9.7e-05,0.000198,0.000353,0.000229,9.8e-05,0.000378,0.000371,0.000145,9.4e-05,0.00042,0.000352,0.000144,0.000153,0.000265,0.000699,0.000202,0.000395,0.000936,0.001086,0.000928,0.000558,0.000296,0.000342,0.000324,0.000402,0.000459,0.000848,0.000533,0.000344,0.000691,0.000789,0.000593,0.000877,0.000554,0.000357,9.6e-05,0.000491,0.000747,0.00093,0.000846,0.00027,0.000277,0.000237,0.000229,0.000678,0.001066,0.001118,0.000582
0.00023,0.000254,0.000595,6.3e-05,0.000253,0.000618,0.000302,0.000218,0.000362,0.000523,0.000698,0.000499,0.000303,0.000309,0.000249,0.000102,0.00017,0.000222,0.00016,0.000138,0.000542,0.000146,0.000313,7.8e-05,0.000159,0.000523,0.000542,0.000296,5.7e-05,2.6e-05,0.000348,0.00056,0.000399,0.000399,0.000216,0.000264,9.8e-05,0.000177,0.000317,0.000427,0.000459,0.000134,7.6e-05,0.000356,0.000224,0.000336,0.000193,0.000354,0.000241,0.000459,0.000131,0.000304,9.6e-05,4.1e-05,0.000169,0.000199,0.000254,0.000195,0.000361,0.000404,0.000466,0.000241,0.000118,4.7e-05,0.000438,0.000198,0.000237,0.000709,0.000569,0.000146,0.00026,0.00012,0.000157,5.6e-05,0.000381,0.000143,0.000245,0.000241,3.2e-05,0.000402,0.000217,0.000162,0.000239,0.000182,0.000427,0.000516,0.000192,0.000304,0.000351,0.000249,0.000324,0.000467,0.000217,0.000278,0.000371,0.000195,0.000254,0.000178,0.000226,0.000581,0.000519,5.7e-05,0.000145,0.000477,6.5e-05,0.00063,0.000327,0.000123,0.000301,0.000691,0.000308,0.000183,0.000314,0.000462,0.000487,0.00027,0.000248,0.000255,0.000595,6.9e-05,0.000437
0.000169,4.4e-05,0.000398,7.3e-05,0.000125,0.000408,0.000159,9.4e-05,0.000236,0.000163,0.000563,0.000193,0.000228,0.000114,0.000208,0.000244,0.000296,0.000172,0.000213,4.6e-05,0.000296,0.000229,0.000336,0.000292,0.000284,0.000206,0.000257,0.00026,0.000177,0.000124,0.000396,5.8e-05,0.00023,0.000376,0.000155,0.000128,0.000377,0.000148,0.000367,2e-04,0.000305,0.000126,0.000142,0.000139,1e-04,0.000233,0.000311,0.000156,0.000165,0.000388,0.00011,0.000492,0.000251,0.000244,0.000268,0.000217,0.000303,0.000153,0.000256,0.000368,0.000133,0.00019,6.2e-05,5.1e-05,0.00016,0.000368,0.000116,0.000368,0.000265,2e-06,0.000128,9.4e-05,0.000212,0.000281,0.00028,0.000208,0.000238,7.5e-05,0.000217,0.000187,0.000113,0.000105,0.000377,0.000192,0.000365,0.000226,0.000131,5.3e-05,0.000226,0.000336,0.000251,0.000338,0.000148,0.000164,0.000125,0.000242,0.000227,7.9e-05,0.000287,0.000368,0.000103,0.000273,0.000172,0.000314,0.000122,0.000596,0.000304,0.000317,0.00024,0.000217,9.7e-05,0.000439,0.000316,0.000452,0.000215,0.000175,0.000127,4.2e-05,0.000354,0.000409,0.000196
6.9e-05,0.000241,0.000156,0.000187,0.000185,0.000203,1.7e-05,3.6e-05,0.000109,6.5e-05,0.000279,0.000361,4.7e-05,0.000138,0.000124,0.000258,8e-06,0.000185,6.9e-05,6e-05,0.00011,7.8e-05,0.000183,0.000294,9.5e-05,0.000125,7.7e-05,9.5e-05,0.000234,0.000109,0.000121,9.5e-05,0.000144,0.000247,0.000102,0.000112,0.000214,0.00012,0.000255,0.000108,0.00014,4.7e-05,0.000214,0.000239,0.000139,0.000131,0.000151,0.000127,5.1e-05,0.000337,0.000123,0.000238,0.000124,0.000169,5.1e-05,0.000117,0.000242,6.5e-05,0.000332,0.000254,0.000106,0.000214,0.000114,0.00012,0.000142,0.000162,6.7e-05,8.4e-05,0.000137,0.000133,0.000136,0.000147,1e-04,0.000165,6.6e-05,6.4e-05,0.000218,0.00015,7.9e-05,0.00018,0.000129,7.7e-05,0.000175,0.000106,0.000221,0.000115,8.3e-05,0.000117,0.000192,0.000202,0.000344,0.000229,0.000164,0.000109,0.000151,0.000152,0.000152,0.000153,6.8e-05,0.000151,0.000137,0.000272,6.4e-05,0.000112,0.000274,0.000256,0.000135,0.000145,0.000187,0.000126,0.000217,0.00034,0.000414,0.00014,0.000167,8.4e-05,0.000122,7.6e-05,0.000103,0.000317,0.000197
7.7e-05,7.4e-05,9.3e-05,8.3e-05,3.7e-05,0.000109,1.5e-05,4.4e-05,2.1e-05,2.9e-05,0.000143,0.000156,2.5e-05,1.6e-05,3.1e-05,6.9e-05,4.9e-05,8.1e-05,3.9e-05,7.3e-05,7.3e-05,2.7e-05,6.8e-05,5.2e-05,4.1e-05,8.4e-05,3.1e-05,9.8e-05,5.1e-05,7.2e-05,8.8e-05,3.2e-05,4.5e-05,0.000131,2.3e-05,4e-05,6.1e-05,6.2e-05,0.000128,7.3e-05,5.9e-05,6e-05,7.5e-05,4.3e-05,5.6e-05,2.4e-05,2.6e-05,7e-06,2.7e-05,1e-04,9.1e-05,3.9e-05,6e-06,4.4e-05,5.4e-05,4.9e-05,0.000121,3.9e-05,0.000114,8.5e-05,7.9e-05,6.8e-05,4.7e-05,3.5e-05,2.7e-05,9.7e-05,4.4e-05,7e-05,6.8e-05,4.1e-05,5.2e-05,5e-06,3.3e-05,8.4e-05,5.1e-05,4.6e-05,0.000141,7.2e-05,2.4e-05,8.8e-05,3.4e-05,4.6e-05,4.9e-05,4.9e-05,8.7e-05,3.5e-05,2.3e-05,5e-05,7e-05,3e-05,0.000126,4e-05,1.5e-05,0.000104,6.2e-05,1.7e-05,2.4e-05,8e-05,3.4e-05,8.2e-05,2e-05,0.000116,1.7e-05,5.7e-05,6.8e-05,0.000102,4.3e-05,3.2e-05,3.8e-05,1.5e-05,8.8e-05,5.8e-05,0.000185,0.000109,3.4e-05,4.7e-05,6.2e-05,3.1e-05,1.7e-05,0.000117,0.000111
9.2e-05,2.8e-05,9.8e-05,5.9e-05,5.9e-05,7.3e-05,2.1e-05,2e-05,1.7e-05,2.6e-05,0.000113,0.000102,3.6e-05,3.6e-05,3.6e-05,5.1e-05,7.8e-05,2.2e-05,3.2e-05,2.6e-05,6.1e-05,3.6e-05,6.1e-05,4.9e-05,3.3e-05,5.8e-05,2.1e-05,9e-05,6e-05,4.5e-05,8.4e-05,5e-05,4.8e-05,0.00014,2.9e-05,5.4e-05,6e-05,4.6e-05,9.8e-05,2.2e-05,6.1e-05,4.8e-05,8.5e-05,9.1e-05,1.7e-05,5.4e-05,6e-05,3.9e-05,3.7e-05,0.000102,6.3e-05,2.4e-05,5.5e-05,5e-06,5.7e-05,3.6e-05,0.000118,4.4e-05,0.000115,9.2e-05,4.7e-05,6.3e-05,1.2e-05,2.5e-05,3.8e-05,0.000103,8.5e-05,5.6e-05,5.9e-05,2.7e-05,2.8e-05,2.9e-05,2e-05,2.2e-05,1.7e-05,4.8e-05,0.000102,8.3e-05,2.3e-05,7.2e-05,3.9e-05,5.5e-05,2.8e-05,3.1e-05,8.4e-05,7.3e-05,2e-05,2.7e-05,6.9e-05,3.9e-05,8.9e-05,3.9e-05,2.6e-05,8.3e-05,5.7e-05,1.7e-05,6.2e-05,9e-05,3.3e-05,3.3e-05,4.5e-05,0.000117,3.3e-05,7.3e-05,2.3e-05,9.9e-05,4e-06,4.9e-05,6.5e-05,3.1e-05,2.8e-05,9.5e-05,0.000141,9.7e-05,7.1e-05,4.6e-05,3e-05,2e-05,2.4e-05,9.6e-05,0.000143
0.000111,7.1e-05,8.5e-05,4e-06,2.6e-05,3.5e-05,2.3e-05,2.6e-05,5e-06,4.5e-05,0.000112,0.000123,2.7e-05,5.1e-05,4.6e-05,3.7e-05,3.1e-05,2e-05,2e-05,3.3e-05,6.9e-05,3.2e-05,6.5e-05,3.1e-05,3.4e-05,6.5e-05,2.6e-05,9.1e-05,5e-05,1.9e-05,7.2e-05,4.7e-05,4.5e-05,6.5e-05,5.4e-05,8.6e-05,0.000134,9.6e-05,0.000127,7e-05,3.2e-05,8.3e-05,2.9e-05,8.2e-05,5.1e-05,4.4e-05,3.5e-05,2.3e-05,3.8e-05,6.6e-05,7.2e-05,8.1e-05,2.7e-05,3.9e-05,8.1e-05,5e-05,0.000135,6.7e-05,0.000114,0.000124,2.9e-05,0.000103,5.3e-05,7.8e-05,8.2e-05,9.1e-05,0.000111,9.8e-05,7e-05,3.5e-05,7e-05,1.3e-05,4e-06,9.1e-05,0.000107,8.9e-05,7.9e-05,9.5e-05,1.3e-05,4.8e-05,1.7e-05,5.8e-05,0.000101,1.6e-05,4e-05,9.4e-05,5.9e-05,4.6e-05,5.4e-05,1.7e-05,9.7e-05,7e-05,5.7e-05,5.5e-05,1.7e-05,4.9e-05,8.2e-05,3e-05,4.3e-05,7.3e-05,3.7e-05,7.8e-05,2.5e-05,0.000111,9e-05,9.1e-05,6.6e-05,8e-06,3.9e-05,1.4e-05,6.2e-05,0.000145,0.000102,5.7e-05,2e-06,1.4e-05,3.9e-05,4.8e-05,7.5e-05,8.3e-05,0.000121
5.6e-05,9e-05,7e-05,6.6e-05,4.6e-05,8.6e-05,3.1e-05,1.5e-05,1.9e-05,8e-05,5.7e-05,0.000143,0.000111,7e-05,2.8e-05,8.5e-05,2.8e-05,5.9e-05,3.7e-05,5.3e-05,5.6e-05,2e-05,6.3e-05,6.5e-05,1.3e-05,5.2e-05,1.4e-05,0.000103,3.9e-05,4.1e-05,4e-06,6.9e-05,7.4e-05,8.3e-05,3.6e-05,3.7e-05,9.6e-05,4.9e-05,5.9e-05,9.4e-05,3.9e-05,0.000125,8.7e-05,8.2e-05,9.2e-05,7.3e-05,8e-06,4.6e-05,1.3e-05,7.1e-05,7.2e-05,5.5e-05,3.9e-05,5.7e-05,3.5e-05,2.9e-05,6.9e-05,5.6e-05,8.2e-05,4.4e-05,9.2e-05,4.8e-05,5.4e-05,4.1e-05,3.9e-05,6.2e-05,8.1e-05,7.4e-05,9e-06,2.8e-05,6.8e-05,4.6e-05,1.2e-05,0.000106,8.1e-05,6e-05,0.000148,6.9e-05,6.3e-05,8.5e-05,2.8e-05,1.5e-05,7.4e-05,1e-04,9.6e-05,6.8e-05,4.3e-05,2.2e-05,5.8e-05,9e-05,0.000137,6.9e-05,2.9e-05,1.8e-05,5.6e-05,4.8e-05,0.00011,0.000114,3.7e-05,6.1e-05,4.3e-05,0.00012,6.3e-05,7e-05,6.1e-05,7e-05,7.2e-05,0.000113,8.1e-05,3.4e-05,0.000119,7.9e-05,0.000146,0.000117,9.6e-05,5.8e-05,2.9e-05,7e-05,0.000109,6.9e-05,5.1e-05
4.4e-05,3.3e-05,8.6e-05,5.7e-05,5.7e-05,4.5e-05,3.5e-05,3.7e-05,2.5e-05,6.9e-05,0.000138,6.7e-05,7.9e-05,2.4e-05,3.3e-05,7.7e-05,4e-05,6.1e-05,1.5e-05,4.9e-05,2e-06,3.7e-05,1.4e-05,3.5e-05,3.9e-05,1.7e-05,2.4e-05,3.2e-05,1.5e-05,3.2e-05,5.6e-05,0.000108,2.6e-05,4.2e-05,3.8e-05,5.8e-05,5.9e-05,4.2e-05,2.5e-05,8.5e-05,3.8e-05,8.7e-05,7.4e-05,2.4e-05,6.5e-05,3e-05,1.9e-05,1.8e-05,2.1e-05,8.7e-05,5.9e-05,3.5e-05,3.9e-05,1.7e-05,3e-06,2.3e-05,9e-05,7.6e-05,2.9e-05,3.4e-05,8.5e-05,8.2e-05,2.4e-05,5.8e-05,2.4e-05,7.6e-05,3.7e-05,4.2e-05,1.1e-05,4.1e-05,4e-06,2.8e-05,1.3e-05,5.2e-05,8.4e-05,4.6e-05,9.2e-05,3.7e-05,5e-05,3.6e-05,1.8e-05,1.8e-05,5.1e-05,5.9e-05,0.000115,4.6e-05,1.2e-05,3.6e-05,4.4e-05,8.7e-05,6.7e-05,9.2e-05,3.4e-05,3.4e-05,4.3e-05,4.8e-05,7.1e-05,7e-05,3.6e-05,3.5e-05,4.6e-05,0.000131,8e-06,4e-05,5.3e-05,8.8e-05,4.7e-05,6.2e-05,7.8e-05,5.7e-05,0.000104,5.7e-05,0.000101,9e-05,4.1e-05,1.5e-05,6.2e-05,6e-06,9e-05,7.8e-05,4e-05
5.5e-05,1.9e-05,5.9e-05,4.8e-05,2e-05,6.8e-05,9e-06,3.5e-05,2.8e-05,7.5e-05,4.1e-05,1.3e-05,3.7e-05,1.2e-05,5.2e-05,3.9e-05,3.2e-05,4e-05,2.1e-05,5.5e-05,2.4e-05,5.2e-05,1.4e-05,3e-06,1e-06,4.1e-05,3.8e-05,9e-06,3.1e-05,2.4e-05,3.2e-05,8e-05,5.7e-05,7.1e-05,2.5e-05,2.2e-05,5.1e-05,2.4e-05,7.3e-05,3.2e-05,8e-06,4e-05,3.3e-05,3.4e-05,3.2e-05,4.8e-05,1.5e-05,1.9e-05,4.3e-05,2.7e-05,6e-05,5.8e-05,1e-05,2.5e-05,3e-05,1.4e-05,5.8e-05,4.9e-05,7.6e-05,5.4e-05,6.9e-05,3.2e-05,2.1e-05,2.4e-05,9e-06,8.3e-05,4.3e-05,3.8e-05,1.6e-05,4.7e-05,8e-06,4e-05,1.3e-05,5.2e-05,4.5e-05,4.7e-05,8.8e-05,2.7e-05,3.1e-05,4.3e-05,6e-06,2.9e-05,3.1e-05,1.3e-05,4.1e-05,1.1e-05,1e-06,4.1e-05,3.3e-05,9.4e-05,9.3e-05,5.9e-05,4.5e-05,6.4e-05,5.9e-05,3.2e-05,9.2e-05,0.000104,7.6e-05,4.6e-05,3e-05,7.2e-05,3.7e-05,1.4e-05,4.3e-05,5.5e-05,8e-06,4.9e-05,4.9e-05,2.3e-05,7.9e-05,1.7e-05,0.000126,5.7e-05,2.4e-05,2e-05,7e-05,2.7e-05,4.2e-05,7.9e-05,5.1e-05
6.7e-05,4.5e-05,7e-05,4.2e-05,3.8e-05,5.3e-05,2.2e-05,1.1e-05,1.3e-05,3.5e-05,7.2e-05,4.4e-05,3.7e-05,1.6e-05,3.9e-05,5.3e-05,2.4e-05,4.3e-05,5e-06,4.8e-05,3.7e-05,2.6e-05,1e-05,1.8e-05,2e-05,4.2e-05,2.3e-05,5.6e-05,3e-05,3e-05,4.8e-05,8.1e-05,4.3e-05,6.3e-05,3.1e-05,3.7e-05,7.6e-05,2.4e-05,8.2e-05,2.4e-05,5e-06,1.8e-05,7e-06,2.8e-05,3.2e-05,3.7e-05,2.9e-05,4e-05,1e-05,4.1e-05,4e-05,4e-05,2.6e-05,2e-05,5.5e-05,5e-06,6.1e-05,5.5e-05,5.5e-05,4.5e-05,7.4e-05,3.7e-05,3e-06,1.6e-05,1.1e-05,7.4e-05,3.9e-05,2.9e-05,2.4e-05,3.2e-05,1.7e-05,1e-05,2.4e-05,5.7e-05,4.3e-05,3.9e-05,7.4e-05,6.1e-05,3e-05,3e-05,2.9e-05,2.6e-05,3.5e-05,9e-06,2.1e-05,4e-05,8e-06,4.4e-05,4.2e-05,3.3e-05,8.4e-05,4.3e-05,3.8e-05,5.7e-05,2.5e-05,1e-05,5.3e-05,8.9e-05,1e-06,3.7e-05,5.1e-05,8.3e-05,1.9e-05,5e-06,1.1e-05,3.7e-05,5e-06,7e-05,3.5e-05,1.7e-05,5.5e-05,3e-05,0.000144,2.3e-05,3.9e-05,3.6e-05,5.6e-05,4e-06,3.5e-05,4.1e-05,5.7e-05
5.6e-05,7.8e-05,4.6e-05,2.6e-05,1.3e-05,5.8e-05,2.9e-05,3.4e-05,2.1e-05,3.1e-05,8.8e-05,4.4e-05,5.1e-05,1.9e-05,2.4e-05,2e-05,6e-05,5.3e-05,7e-06,4e-05,2.8e-05,3e-05,8e-06,1.1e-05,2.2e-05,1.5e-05,2.4e-05,4.9e-05,3.9e-05,2.7e-05,2.6e-05,0.000101,4e-05,2.5e-05,6.2e-05,3.3e-05,8e-05,4.6e-05,6.9e-05,3.9e-05,1.6e-05,2.4e-05,3e-05,2.2e-05,2.2e-05,3.5e-05,8e-06,3.3e-05,4.9e-05,1.4e-05,3.8e-05,1.6e-05,3.2e-05,2e-05,3.1e-05,3e-05,9.3e-05,5.2e-05,4.4e-05,4.8e-05,6.5e-05,1.3e-05,3.7e-05,3.6e-05,3.2e-05,5.4e-05,2.5e-05,3.3e-05,2e-05,3.7e-05,3.3e-05,3.5e-05,3.7e-05,3.8e-05,4.8e-05,3.7e-05,5.4e-05,7.5e-05,4.2e-05,1.4e-05,2.4e-05,1.8e-05,4e-06,1.3e-05,1.4e-05,2.4e-05,1.5e-05,9e-06,4.3e-05,3.9e-05,1.7e-05,4.5e-05,1e-05,3.1e-05,1.4e-05,2.8e-05,1.4e-05,8.2e-05,3.6e-05,6e-05,6.6e-05,0.000114,1.1e-05,3.5e-05,2.3e-05,7.7e-05,5.9e-05,7.2e-05,5.4e-05,2.7e-05,6.1e-05,5.7e-05,0.000162,6.7e-05,6e-05,1.5e-05,5.9e-05,2.3e-05,4.7e-05,6.2e-05,4.8e-05
5.3e-05,9.5e-05,8.6e-05,2.4e-05,2.8e-05,5.2e-05,3.4e-05,2.2e-05,2e-05,3.6e-05,7.8e-05,5.8e-05,3.7e-05,2.3e-05,3.4e-05,2.6e-05,6.2e-05,5e-06,3.2e-05,5.3e-05,5e-06,4.5e-05,2e-05,3e-06,2.1e-05,3.5e-05,3.7e-05,2.3e-05,3.1e-05,5.8e-05,7.5e-05,8.1e-05,4.6e-05,1.3e-05,1.1e-05,5.6e-05,9.8e-05,2.9e-05,5.6e-05,9e-06,6.2e-05,6.3e-05,8e-06,2.4e-05,2e-05,1.8e-05,2.2e-05,4.4e-05,3.7e-05,7e-05,7.2e-05,6e-05,1.7e-05,1.8e-05,2.2e-05,1.8e-05,3.7e-05,3.3e-05,4.5e-05,5.2e-05,5e-05,4.6e-05,1.1e-05,4.6e-05,2.1e-05,6e-05,2.6e-05,5.1e-05,3.5e-05,6.6e-05,2.9e-05,4.5e-05,4.5e-05,5.7e-05,3.4e-05,4e-05,3.5e-05,4.6e-05,2.1e-05,1.7e-05,3.3e-05,2e-05,3.4e-05,2.6e-05,2e-05,2.4e-05,4.1e-05,1.8e-05,2.5e-05,3.1e-05,6.8e-05,1.7e-05,5e-06,3.5e-05,2.4e-05,7.2e-05,9e-05,9.7e-05,3.8e-05,3.6e-05,6.7e-05,5.2e-05,5.9e-05,3.4e-05,6.7e-05,4.1e-05,4.7e-05,2.4e-05,4.9e-05,2.5e-05,3.7e-05,4.6e-05,0.000117,3e-05,2.5e-05,5.1e-05,7.7e-05,2.6e-05,9e-05,0.000103,6e-05
9e-05,7.2e-05,4.1e-05,3.3e-05,2.9e-05,1.3e-05,3.8e-05,3.3e-05,2.5e-05,2.6e-05,6.2e-05,8e-05,7.5e-05,4.7e-05,2.7e-05,6.1e-05,4.5e-05,6.5e-05,2.1e-05,8e-06,3.8e-05,2.2e-05,3.8e-05,3.4e-05,6e-05,4e-05,2.2e-05,8.1e-05,4.5e-05,4.5e-05,6.5e-05,8e-05,6.8e-05,5.3e-05,2.9e-05,5.1e-05,3.4e-05,2.6e-05,6.1e-05,4.6e-05,4.8e-05,1.5e-05,4.4e-05,9e-06,3.4e-05,4.5e-05,4.8e-05,3e-05,4.7e-05,4.8e-05,3.5e-05,6.4e-05,2.7e-05,7e-06,2.1e-05,1.6e-05,6e-05,5.9e-05,1.4e-05,4.8e-05,2.8e-05,5e-05,2.4e-05,7.9e-05,6.2e-05,2.4e-05,7.2e-05,5.5e-05,1.4e-05,7.5e-05,3.7e-05,2.7e-05,3.2e-05,5.6e-05,4.8e-05,4.6e-05,8.5e-05,1.2e-05,2.4e-05,1.1e-05,2e-05,4e-05,5.5e-05,3.7e-05,5.7e-05,1.9e-05,4.5e-05,4.7e-05,4.1e-05,5.4e-05,7.1e-05,4e-05,2.4e-05,3.9e-05,3.7e-05,5.5e-05,5.8e-05,6.5e-05,6.3e-05,2e-05,3.1e-05,0.000104,8.1e-05,9.4e-05,4.6e-05,2.9e-05,7.3e-05,0.000103,7.2e-05,4.3e-05,5.9e-05,3.3e-05,0.000106,4.8e-05,7.5e-05,5.7e-05,4e-05,1.8e-05,7.9e-05,1e-04,7.1e-05
0.000104,6.6e-05,1.5e-05,6e-05,8.9e-05,1.4e-05,2.8e-05,1.3e-05,4.3e-05,3.8e-05,9.1e-05,0.000109,0.000138,5.8e-05,3e-05,4.5e-05,1.6e-05,7e-06,2.6e-05,1.9e-05,1e-05,4.4e-05,4.6e-05,3e-05,7.9e-05,0.000135,7.5e-05,7.5e-05,2e-05,2.9e-05,3.2e-05,1.9e-05,0.000109,0.000125,7.5e-05,7.1e-05,6.1e-05,1.3e-05,5.7e-05,7e-05,5e-05,1.2e-05,7.9e-05,3.9e-05,4.6e-05,0.000121,3.4e-05,4.4e-05,1.9e-05,8.1e-05,2.4e-05,3.7e-05,1.8e-05,2e-05,3.5e-05,2e-05,5.6e-05,4.8e-05,4.5e-05,9.8e-05,9.5e-05,6.6e-05,7e-05,3.9e-05,3.1e-05,3.7e-05,3.2e-05,7e-05,2.7e-05,6.8e-05,6.2e-05,1.9e-05,3.4e-05,4.9e-05,5.8e-05,6e-06,5.3e-05,5.1e-05,1e-05,6.6e-05,2.9e-05,4.5e-05,4.4e-05,4.3e-05,1.7e-05,2.6e-05,2.5e-05,3.3e-05,1.6e-05,6.4e-05,5.7e-05,4e-06,1.6e-05,5e-05,2.8e-05,8.3e-05,6.5e-05,3.9e-05,1e-06,3.1e-05,4.9e-05,5.5e-05,6.3e-05,6.8e-05,9.7e-05,7.7e-05,4.7e-05,6.8e-05,8.9e-05,2.8e-05,6.1e-05,3.3e-05,0.000103,9e-05,8.1e-05,8.3e-05,7.1e-05,2.9e-05,3.2e-05,6.4e-05,9.7e-05
3.8e-05,9.1e-05,2.7e-05,1.2e-05,5.2e-05,8.9e-05,3.6e-05,3.7e-05,4.9e-05,9.6e-05,0.000169,8.1e-05,9.1e-05,0.000101,5.9e-05,3.7e-05,5.6e-05,7.2e-05,1.7e-05,5.9e-05,3.4e-05,7.7e-05,3.2e-05,2e-05,4.3e-05,9.8e-05,6.9e-05,0.000105,8.1e-05,3.2e-05,2e-05,4.3e-05,0.000107,4.8e-05,3.9e-05,0.000111,4.9e-05,8.6e-05,8.7e-05,4.4e-05,9e-05,7e-05,6.8e-05,8.3e-05,0.000101,8.4e-05,8.9e-05,6.3e-05,8.7e-05,8.3e-05,5.6e-05,5e-05,3.2e-05,3.2e-05,2e-05,2.1e-05,3.6e-05,4.7e-05,8.9e-05,0.000126,2.1e-05,1.7e-05,3.7e-05,6.8e-05,0.000123,5e-05,6.5e-05,2.7e-05,6.2e-05,7.9e-05,0.00011,8.5e-05,7.9e-05,0.000126,8.6e-05,6e-05,0.000102,5e-05,3.8e-05,7.9e-05,5.7e-05,5.5e-05,3.1e-05,5.1e-05,3.5e-05,7.7e-05,5.8e-05,4.7e-05,7.6e-05,5.8e-05,4e-05,7.6e-05,5.2e-05,6e-05,0.000116,0.000108,8.7e-05,7e-05,2.4e-05,3.9e-05,2.4e-05,6.5e-05,2.4e-05,3.2e-05,5.8e-05,9e-05,2.3e-05,3.7e-05,9.5e-05,6.4e-05,9.4e-05,3.7e-05,8.5e-05,5e-05,8.8e-05,5.6e-05,4.7e-05,4.9e-05,6e-05,6.6e-05,7.8e-05
2.9e-05,3e-05,6.6e-05,2.8e-05,5e-06,4e-05,2e-05,3.6e-05,7.2e-05,5.1e-05,5.9e-05,4.5e-05,6.3e-05,4.5e-05,3.5e-05,9e-06,2.1e-05,4e-05,4.2e-05,6e-06,2.1e-05,5e-05,3.6e-05,1.1e-05,2.6e-05,4.7e-05,3.9e-05,7.4e-05,4.8e-05,2.1e-05,3.1e-05,2.1e-05,4.6e-05,5.1e-05,2.4e-05,3.9e-05,5.4e-05,3.4e-05,4.9e-05,8e-06,5.1e-05,8e-06,4.7e-05,3.9e-05,5.2e-05,5e-06,3.2e-05,1.3e-05,4.4e-05,5.7e-05,5.8e-05,3.7e-05,4.8e-05,6e-06,1e-05,2.1e-05,3.9e-05,7.2e-05,0.000104,2.4e-05,5.4e-05,4e-06,1.6e-05,4.9e-05,4.6e-05,6.4e-05,3.7e-05,6.2e-05,1.6e-05,4.2e-05,2e-05,2.1e-05,3.8e-05,7.6e-05,6.5e-05,8.2e-05,4.5e-05,2.9e-05,1.8e-05,7.3e-05,6.2e-05,2.3e-05,9e-06,4.9e-05,3.5e-05,2.9e-05,4e-06,3.9e-05,8.7e-05,0.000107,6.7e-05,3.7e-05,3.1e-05,2.5e-05,0.000108,1.4e-05,3.6e-05,9.1e-05,4.7e-05,2e-05,3.9e-05,7.3e-05,4.4e-05,2.8e-05,4.6e-05,2.6e-05,5.2e-05,4.8e-05,3.7e-05,2.7e-05,3.9e-05,1.5e-05,8.1e-05,2.6e-05,2.9e-05,5.6e-05,6.7e-05,1.2e-05,4.3e-05,6.4e-05,2.8e-05
2.4e-05,2.1e-05,3.6e-05,2.9e-05,2e-05,6.1e-05,3.9e-05,1.8e-05,3.4e-05,1.6e-05,6.8e-05,4.6e-05,3.9e-05,1.8e-05,1.9e-05,8e-06,1.7e-05,3.6e-05,2e-05,1.2e-05,3.3e-05,2.5e-05,2e-06,1.3e-05,1.2e-05,1.7e-05,6e-06,4.4e-05,3.5e-05,8e-06,3e-06,2.4e-05,2.3e-05,1.7e-05,1.5e-05,1.6e-05,3.8e-05,2.3e-05,2.7e-05,6e-06,1.1e-05,1e-05,1.9e-05,2e-05,5.2e-05,1.4e-05,2e-06,3.4e-05,2.3e-05,3e-05,2.9e-05,4.1e-05,2.1e-05,1.5e-05,2.5e-05,2.1e-05,3.4e-05,5.5e-05,6.6e-05,4.3e-05,2.4e-05,2.1e-05,1e-05,1.2e-05,1.7e-05,6.8e-05,2.6e-05,4.5e-05,4.4e-05,2.8e-05,1.3e-05,6e-06,2.8e-05,6.5e-05,4e-05,5.7e-05,6e-05,1e-05,6e-06,3.5e-05,1.4e-05,3.6e-05,6e-06,2.3e-05,2e-06,1.2e-05,1e-05,2.1e-05,5e-05,2.3e-05,2.2e-05,2.2e-05,2.5e-05,2.5e-05,7.5e-05,2.1e-05,3.4e-05,6.4e-05,3e-05,3.1e-05,2.6e-05,3.7e-05,3.7e-05,1.3e-05,1.4e-05,1.9e-05,4.5e-05,1e-05,3.6e-05,2.2e-05,3.6e-05,2.4e-05,7.3e-05,2e-05,3.3e-05,3.2e-05,3.7e-05,2.2e-05,4.6e-05,3.9e-05,3.9e-05
2.4e-05,3.3e-05,3.2e-05,2.4e-05,1.8e-05,7.3e-05,1.4e-05,2e-05,2.5e-05,9e-06,6e-05,4.5e-05,3e-05,2.6e-05,2.7e-05,1.1e-05,3.1e-05,2.8e-05,2.6e-05,3.3e-05,1.9e-05,1.3e-05,6e-06,1.8e-05,3.9e-05,1.2e-05,8e-06,4.2e-05,2.3e-05,2.1e-05,1.5e-05,2.3e-05,1.7e-05,3.5e-05,2e-05,1.6e-05,3.7e-05,3.2e-05,3.1e-05,1.4e-05,3.8e-05,2.3e-05,2.6e-05,1.1e-05,3.4e-05,2.8e-05,1e-05,2.3e-05,1.5e-05,2.3e-05,5.3e-05,2.3e-05,6e-06,2e-06,3.2e-05,2.2e-05,3.7e-05,4.1e-05,8.2e-05,3.5e-05,4.7e-05,8e-06,1.4e-05,3.8e-05,3.3e-05,6.5e-05,2.2e-05,6.4e-05,1.5e-05,3.1e-05,9e-06,1.4e-05,1.3e-05,4.3e-05,1.4e-05,3.1e-05,3.8e-05,3.5e-05,9e-06,1.7e-05,1.2e-05,2.9e-05,5e-06,3.5e-05,4e-05,2.5e-05,2.9e-05,3.1e-05,6.7e-05,4.1e-05,4e-05,2.7e-05,0,1.7e-05,6.2e-05,3.1e-05,4.7e-05,9.1e-05,6e-06,2.8e-05,4.5e-05,7.2e-05,3.4e-05,3e-05,1.3e-05,2.4e-05,2.6e-05,1.8e-05,4.1e-05,3e-05,3.9e-05,1.9e-05,4.4e-05,4.4e-05,5.5e-05,3.8e-05,4.3e-05,2e-05,2.8e-05,3.2e-05,4e-05
1.9e-05,3.6e-05,5.2e-05,1e-05,8e-06,4.1e-05,1e-05,1.7e-05,1.7e-05,1.2e-05,5.9e-05,2.9e-05,2e-05,1.2e-05,3.5e-05,3.1e-05,2.5e-05,3e-06,1.3e-05,3.2e-05,2.9e-05,3.7e-05,2e-05,1.2e-05,3.2e-05,2.5e-05,2.4e-05,3.8e-05,2.6e-05,2.6e-05,2.1e-05,3.3e-05,2.5e-05,4.6e-05,2.2e-05,3e-05,3.8e-05,2.4e-05,4.3e-05,1.1e-05,4e-05,2.1e-05,7e-06,1.2e-05,3.8e-05,1.1e-05,1.5e-05,5e-06,2.5e-05,4.8e-05,2.2e-05,4.7e-05,1.8e-05,9e-06,1.3e-05,1.1e-05,4.5e-05,1.7e-05,7.6e-05,4.8e-05,4.4e-05,5e-06,1e-05,2.6e-05,2.8e-05,6.2e-05,4.2e-05,4.4e-05,1.7e-05,2.2e-05,5e-06,2e-05,1.2e-05,4e-05,2.4e-05,3e-05,5.7e-05,4.1e-05,1.4e-05,1.2e-05,3e-05,4.8e-05,2.6e-05,2e-05,2.6e-05,5.5e-05,4.8e-05,1.9e-05,6.8e-05,1.3e-05,4.4e-05,2.6e-05,2.1e-05,2.6e-05,4.3e-05,3.2e-05,3e-05,4.9e-05,2e-05,2.5e-05,2.4e-05,5.9e-05,1.2e-05,2.4e-05,4.7e-05,2.3e-05,2.5e-05,3.5e-05,4.6e-05,2.8e-05,4.9e-05,3.4e-05,6.2e-05,6e-06,4.4e-05,5e-06,4.9e-05,1.6e-05,5e-05,3.9e-05,2.8e-05
4.2e-05,3.6e-05,4.8e-05,3.1e-05,3.6e-05,3.1e-05,2.5e-05,1.6e-05,1.2e-05,6e-06,6.4e-05,4e-05,1.2e-05,1.5e-05,2.7e-05,1.6e-05,4.1e-05,3.2e-05,1.8e-05,2.4e-05,3.2e-05,1.8e-05,9e-06,2.5e-05,1.5e-05,1.3e-05,1.2e-05,1.6e-05,3.4e-05,1.8e-05,2.5e-05,5.4e-05,1.8e-05,4.8e-05,9e-06,1.2e-05,3.4e-05,2.9e-05,4.5e-05,1.3e-05,2.8e-05,7e-06,1.4e-05,1.7e-05,1.3e-05,1.4e-05,1.4e-05,7e-06,1.8e-05,4e-05,2.9e-05,5e-05,1.5e-05,1.4e-05,2.4e-05,8e-06,3.7e-05,1.2e-05,4.2e-05,3.2e-05,3.8e-05,1.4e-05,1.1e-05,2.3e-05,1.5e-05,5.1e-05,3.1e-05,4.8e-05,1.9e-05,1.4e-05,1.2e-05,9e-06,8e-06,4.6e-05,2.8e-05,2e-05,5e-05,2.5e-05,6e-06,1.8e-05,2.5e-05,3e-06,1.6e-05,1.6e-05,2.4e-05,4.7e-05,2.4e-05,2.5e-05,3.3e-05,2.7e-05,4.8e-05,3.1e-05,1.6e-05,4e-05,3.4e-05,2.5e-05,7e-06,4.3e-05,9e-06,2.2e-05,1.6e-05,7.1e-05,1.2e-05,1.5e-05,2.5e-05,9e-06,4e-06,3.1e-05,1.7e-05,2.1e-05,5.5e-05,3.4e-05,7.3e-05,2.7e-05,2.6e-05,2.3e-05,2.8e-05,8e-06,3.3e-05,6.1e-05,5.4e-05
1.6e-05,2.2e-05,3.2e-05,2.9e-05,1.5e-05,5e-05,1.6e-05,6e-06,2.1e-05,2e-06,6.3e-05,4.5e-05,1.6e-05,1.8e-05,4e-06,2.1e-05,2.9e-05,2.4e-05,1.5e-05,2.4e-05,3.6e-05,1.7e-05,7e-06,1.3e-05,1.3e-05,6e-06,1.5e-05,3.6e-05,3.1e-05,1.3e-05,7e-06,3.7e-05,1.4e-05,3.9e-05,1e-05,1.9e-05,3.7e-05,2.8e-05,3.3e-05,1.5e-05,1.4e-05,1e-05,1.7e-05,2.1e-05,1.8e-05,4e-06,4e-06,1e-05,1.6e-05,4.6e-05,2.3e-05,4.3e-05,1.9e-05,1e-06,2.3e-05,1e-06,2.4e-05,2.8e-05,4.6e-05,3.2e-05,3.3e-05,8e-06,5e-06,2.1e-05,8e-06,5.8e-05,1.7e-05,3.9e-05,2.1e-05,1.9e-05,1.3e-05,8e-06,1.1e-05,3.6e-05,2.6e-05,2.2e-05,4.8e-05,1.9e-05,1.1e-05,1.9e-05,1.9e-05,9e-06,2e-05,3e-06,1.3e-05,4.1e-05,5e-06,1.1e-05,2.1e-05,2.8e-05,4.5e-05,2.6e-05,1.4e-05,2.7e-05,3.3e-05,2.1e-05,1.3e-05,4.4e-05,1.3e-05,1.1e-05,1.2e-05,5.8e-05,5e-06,2e-05,5e-06,6e-06,7e-06,3e-05,1.5e-05,1.5e-05,3.7e-05,3.1e-05,6e-05,3.2e-05,3.4e-05,2.5e-05,3.6e-05,1e-06,3.7e-05,5.6e-05,2.5e-05
2.4e-05,3.1e-05,3e-05,3.7e-05,2.1e-05,4.2e-05,1.8e-05,5e-06,1.5e-05,1e-06,6.4e-05,4.7e-05,2e-05,4e-06,3e-06,1.6e-05,1.6e-05,1.4e-05,1.3e-05,3.1e-05,3.5e-05,1.1e-05,5e-06,1.4e-05,7e-06,3e-06,7e-06,2.7e-05,2.6e-05,1e-05,1.6e-05,3.4e-05,1.2e-05,2.8e-05,7e-06,1.8e-05,4.3e-05,3e-05,4.1e-05,1.5e-05,1.8e-05,1.2e-05,2.2e-05,1.2e-05,2.1e-05,1.1e-05,7e-06,1.2e-05,1.3e-05,4.5e-05,2.1e-05,3.4e-05,2e-05,9e-06,1.8e-05,2e-06,3.6e-05,2.6e-05,5.6e-05,3.9e-05,3.6e-05,9e-06,2e-06,1.3e-05,9e-06,4.3e-05,2.3e-05,3.6e-05,1.6e-05,2.2e-05,9e-06,7e-06,9e-06,3.7e-05,2.2e-05,2.6e-05,4.7e-05,2.8e-05,9e-06,1.3e-05,6e-06,5e-06,6e-06,2e-06,1.2e-05,3.3e-05,8e-06,1e-05,3e-05,2.7e-05,5.3e-05,2.8e-05,1.8e-05,1e-06,3.9e-05,2e-05,1.9e-05,4.4e-05,4e-06,1.1e-05,7e-06,5.7e-05,5e-06,1.3e-05,4e-06,3e-06,5e-06,2.1e-05,2.6e-05,6e-06,3.4e-05,2.6e-05,6.5e-05,1.5e-05,2.5e-05,2.8e-05,2.9e-05,2e-06,3.3e-05,5.1e-05,2.2e-05
2.9e-05,2.6e-05,3.5e-05,2.7e-05,1.6e-05,4e-05,1.5e-05,2e-06,1.5e-05,2e-06,5.9e-05,3.6e-05,1.1e-05,7e-06,4e-06,2.2e-05,2e-05,2.6e-05,1.1e-05,2.3e-05,2.8e-05,1.5e-05,2e-06,1.4e-05,9e-06,1e-06,4e-06,3e-05,2.2e-05,4e-06,1.2e-05,3.6e-05,1.8e-05,2.8e-05,1e-06,1.6e-05,3.7e-05,2.7e-05,3.8e-05,1.5e-05,1.9e-05,6e-06,1.6e-05,1.4e-05,2e-05,1e-05,8e-06,1.3e-05,1.4e-05,4.1e-05,2.8e-05,3.6e-05,1.4e-05,7e-06,2.3e-05,6e-06,3.7e-05,2.5e-05,4.9e-05,3.9e-05,3.9e-05,1.6e-05,7e-06,1.6e-05,1e-05,4.6e-05,2.1e-05,3.4e-05,1.6e-05,2.2e-05,1.1e-05,7e-06,1e-05,4e-05,2.2e-05,2.7e-05,4.4e-05,2.5e-05,8e-06,9e-06,1e-05,9e-06,1e-05,7e-06,1.3e-05,2.8e-05,3e-06,1.1e-05,2.8e-05,2.7e-05,4.4e-05,3e-05,2.1e-05,1.1e-05,3.8e-05,1.8e-05,1.6e-05,4.7e-05,1.1e-05,1.2e-05,9e-06,5.1e-05,7e-06,9e-06,6e-06,5e-06,3e-06,2.3e-05,2.2e-05,9e-06,4e-05,1.6e-05,6.6e-05,2.1e-05,2.2e-05,2.3e-05,3.3e-05,3e-06,2.8e-05,5.1e-05,2.9e-05
