3.6e-05,2e-05,1.1e-05,3.6e-05,0.000108,8e-05,6.3e-05,6.6e-05,2.6e-05,4e-05,3.4e-05,1e-06,4.1e-05,1e-04,5.8e-05,0.000115,4.5e-05,7.2e-05,1.1e-05,5.3e-05,0.000128,3.6e-05,5e-05,1.4e-05,1.9e-05,5.7e-05,2e-06,2.2e-05,5e-05,3.1e-05,2.9e-05,6e-05,3.1e-05,0.00011,3.8e-05,5.1e-05,3.7e-05,1e-06,4.8e-05,7.4e-05,6.9e-05,5e-06,8e-05,8e-06,1.4e-05,1.1e-05,0.000111,6e-05,2.2e-05,9.3e-05,0.000116,6e-06,3.9e-05,7e-06,5.7e-05,9.1e-05,1.1e-05,9e-06,2.3e-05,0.000183,5e-05,2e-06,6.1e-05,5.4e-05,9.8e-05,0.000106,6.2e-05,8e-05,2.2e-05,3.3e-05,8.1e-05,2.4e-05,0.000101,5e-06,8.2e-05,1.6e-05,4.9e-05,8.4e-05,2.3e-05,4.4e-05,1e-05,4.1e-05,2.1e-05,8e-06,2e-06,9e-05,3.8e-05,2.1e-05,3.7e-05,2.7e-05,7.3e-05,5.9e-05,0,7e-06,0.000128,0.000107,9.8e-05,8.6e-05,0.000124,3e-06,3e-05,4.5e-05,9.6e-05,4.4e-05,1.2e-05,0.000127,0.000118,6.6e-05,3.4e-05,1.9e-05,5.2e-05,9.2e-05,5.5e-05,6.8e-05,1.2e-05,9.3e-05,2.8e-05,1.1e-05,0,0.000108,1.3e-05
0.000215,0.000203,0.00024,0.000164,0.000331,3e-04,0.000347,0.000311,8e-05,0.000123,3.9e-05,2.4e-05,0.000111,0.000228,0.000304,0.000463,0.000319,0.000426,0.000202,0.000163,0.000318,0.000217,0.000345,0.000194,0.000196,9.9e-05,0.000117,0.000238,0.000294,0.000426,0.000447,0.000283,0.00022,0.000331,9.5e-05,0.00019,0.000112,6.1e-05,8.9e-05,0.000221,0.000285,0.000119,0.000279,0.000156,9.5e-05,6.6e-05,0.000261,0.000289,0.000274,0.000365,0.000457,0.000262,0.000485,0.000199,0.000214,0.00027,0.000104,0.000236,0.000138,0.000394,0.000333,0.000278,0.000144,0.000176,0.000244,0.000452,0.000422,0.000432,0.000226,0.000118,0.000266,0.000189,0.000378,0.000298,0.000253,0.00021,0.000183,0.00022,9.2e-05,6.8e-05,0.000115,0.000134,0.000176,9.1e-05,5.8e-05,0.000213,0.000162,0.000138,0.000168,1.9e-05,0.000211,3.7e-05,0.000161,1.8e-05,0.000232,0.000233,0.000386,0.000401,0.000448,0.000175,7.8e-05,0.000325,0.000202,0.000295,0.000223,0.000289,0.000376,0.000206,0.000224,0.000149,9e-05,0.000271,0.00026,0.000134,0.000131,0.000357,0.000134,0.000148,9.4e-05,0.000291,9e-05
0.000232,0.000216,0.000457,0.000174,0.000302,0.000287,0.000161,3.6e-05,0.000231,0.000128,0.000195,4.1e-05,0.000162,0.000193,0.000244,0.000159,2.8e-05,0.000285,0.000323,0.000124,0.000196,0.000155,0.000213,0.000269,4.9e-05,0.000294,0.000421,4.4e-05,0.000206,0.00029,0.000243,0.000279,5e-05,0.000255,0.000349,0.000348,0.000313,0.000249,0.000103,0.000104,0.000221,0.000259,0.000261,0.000282,0.000255,9.7e-05,0.000207,0.000367,0.000178,0.000162,0.000476,0.000257,0.000463,0.000374,0.000425,0.000211,0.00028,0.000275,0.000366,0.000466,0.000493,0.000168,3.6e-05,0.000101,0.000196,0.000369,0.000134,0.000225,0.00021,0.000215,0.000235,0.000145,0.000256,0.000278,9.3e-05,0.000247,0.000183,5.7e-05,0.000118,0.000157,0.000225,5.8e-05,0.000136,0.00033,0.000207,0.000246,9.3e-05,4.2e-05,2e-04,0.000201,0.000299,0.000242,0.000261,0.000302,0.000273,3e-04,0.000186,0.000293,0.000112,0.000296,6.5e-05,0.000384,0.000269,0.000212,0.000255,0.00013,0.000271,0.00044,0.000276,4.6e-05,0.000119,0.000321,0.000725,0.000585,0.00043,0.00018,0.000215,0.000108,0.000197,0.000382,0.000397
0.000192,9e-05,0.000347,0.000339,0.00039,0.000385,0.000469,0.000474,0.000476,0.000185,0.000258,0.000408,0.000436,0.000208,0.000258,0.00031,0.000396,0.000125,0.000228,0.000192,0.000332,0.000477,0.000231,0.000207,0.000118,0.000365,0.000475,0.000423,0.000157,0.000164,0.000396,0.000348,0.000211,0.000493,0.000405,0.00017,0.000131,0.000254,0.000231,3e-06,0.00027,0.000105,0.000132,0.000138,0.000208,0.00044,0.000162,0.000243,0.000298,0.000292,2e-04,0.000301,0.000163,8.5e-05,0.000302,0.000355,0.000426,0.000155,0.000218,0.000304,0.000308,0.000407,0.000321,0.000306,0.000323,0.000521,0.000419,8.8e-05,0.000203,4.9e-05,0.000447,0.000371,0.000244,4.8e-05,0.000236,0.000324,0.000199,0.000239,7.7e-05,0.000303,0.000227,0.000174,5.6e-05,0.00031,0.000362,0.000193,0.000216,8.6e-05,0.000129,7.1e-05,0.000144,4.1e-05,0.00022,0.000258,0.000111,0.000569,0.000336,0.000223,0.000356,0.000435,0.000373,0.000305,0.000234,0.000281,0.000231,0.000329,0.000431,0.000173,0.000344,0.00044,0.000407,0.00022,0.000556,0.000261,5.6e-05,0.000255,0.000133,0.000263,7.4e-05,0.000388,0.000412
0.000234,0.000226,4.3e-05,0.000352,0.000337,7.3e-05,0.000355,0.000456,0.000213,0.000193,0.000145,0.000482,0.000131,0.000196,0.000141,0.00023,0.000117,0.000279,0.000139,0.000146,0.000379,0.000384,0.000314,0.000125,0.000158,0.000326,0.000139,0.000206,0.000253,0.000115,0.000272,2.1e-05,0.000275,0.000575,0.00028,6.8e-05,5.1e-05,0.000253,1e-04,0.000302,0.000245,0.000338,4.2e-05,0.000141,0.000211,0.000368,0.000389,0.000218,5.5e-05,0.000145,0.00023,8.8e-05,0.00017,0.00012,8.4e-05,0.000316,6.2e-05,0.000234,0.000104,0.000309,0.000239,0.000457,0.000212,0.000169,0.000351,0.000442,0.000143,0.000125,0.000106,0.000164,0.000318,0.000291,0.000193,0.000144,0.000377,0.000361,0.000163,0.000371,0.00029,0.000111,0.000338,0.000191,0.00016,0.000271,0.000401,0.00045,3.9e-05,0.000178,0.000141,3e-05,0.000231,0.000234,3e-05,0.00024,0.000238,0.000425,0.000358,0.00012,0.000127,0.000211,1e-05,8.3e-05,0.000121,3.5e-05,0.000257,8.2e-05,0.000239,7e-05,0.000289,7.8e-05,0.00015,0.000218,0.000247,7.1e-05,6.1e-05,0.000193,0.000183,0.000316,0.000417,0.000374,7.9e-05
0.00026,0.00035,0.000381,0.000404,0.000312,0.000303,0.000363,0.000112,0.000196,0.000191,9.9e-05,0.00057,0.00045,0.000404,0.000233,0.000385,0.00021,0.000285,0.000138,0.000139,0.000324,0.000206,0.000138,0.000165,0.00023,0.000457,0.000482,0.000389,0.000108,0.000197,0.000151,0.00015,0.000211,0.000296,0.000118,0.000312,0.00034,3e-04,0.000227,0.000314,0.000432,0.000289,0.000395,0.00048,7.2e-05,0.000358,0.000181,0.000243,7.1e-05,4.1e-05,8.2e-05,8.6e-05,0.000258,0.000185,7.5e-05,0.000337,0.000276,0.000171,0.000151,0.000267,3.9e-05,0.00031,5.8e-05,7.6e-05,0.000234,0.000144,0.000216,8e-05,0.000123,0.000196,0.000276,6.9e-05,8.9e-05,0.000237,0.000253,0.000227,0.000263,0.000243,0.000205,0.000148,0.00039,0.000218,0.000199,0.000163,0.00031,0.000211,0.000265,0.000152,6.2e-05,5.6e-05,0.000205,8.8e-05,0.000133,0.000315,0.000383,0.000259,0.000235,9.6e-05,0.000111,0.000173,0.000128,0.000218,0.000178,0.000227,0.00034,0.000302,0.000192,0.000351,0.000264,0.000301,0.000196,0.000203,0.000173,0.000314,0.000387,0.000279,0.000327,1.3e-05,0.000333,6.2e-05,0.000193
0.000336,0.000679,0.000185,0.000315,0.000218,0.000112,0.000316,0.000241,0.000286,0.000151,0.000143,0.000439,0.000274,0.000182,1e-06,0.000324,0.000206,0.000144,0.000167,0.000121,0.000471,0.000382,0.000387,0.000214,5.4e-05,0.000387,0.000264,0.000201,0.000278,0.000402,0.000154,0.000217,8.9e-05,0.000257,0.000118,0.000388,0.00016,8e-06,0.000105,0.000178,9.7e-05,1e-04,0.000155,0.00029,0.000256,9.1e-05,0.000204,9e-05,0.000182,0.000162,0.000158,0.000341,0.000304,0.000276,0.000184,0.00026,0.000156,9.4e-05,5e-05,0.00026,0.000221,5e-05,0.000301,0.000274,3.8e-05,0.000118,9.1e-05,0.000267,0.000287,0.000194,0.000129,0.000164,6.7e-05,0.000284,0.00032,0.000211,0.000196,0.000101,0.000223,0.000147,0.000406,0.00028,0.000307,0.000483,0.000394,0.000195,0.000235,9.9e-05,4.5e-05,0.000156,0.000121,0.000249,8.5e-05,0.000275,2.3e-05,0.000317,0.000377,0.000287,0.000138,0.000156,0.00037,0.000255,0.000177,0.000173,0.00018,0.000183,0.000342,0.000424,0.00019,0.000355,0.000285,0.000251,0.000227,0.000208,0.000222,0.000437,0.000274,0.000261,0.000158,0.000158,0.000221
0.000392,0.000402,0.000622,0.00029,0.000301,0.000183,0.000283,9.7e-05,0.00032,0.000246,0.000342,0.000503,0.000487,0.000112,9e-05,0.000384,0.000626,0.000252,6.7e-05,0.000344,0.000389,9e-05,0.000506,0.00053,0.000172,0.000331,0.000168,0.000363,0.000231,0.000712,0.00078,0.000263,0.000278,0.000349,0.000155,0.000321,0.000284,0.000138,0.000322,0.000182,0.000172,5e-05,8.4e-05,0.000276,0.000443,0.00026,0.000137,0.00025,0.000194,0.000275,0.000284,0.000539,0.000277,0.000175,3.7e-05,6.4e-05,0.00022,0.000312,0.000269,0.000229,0.000187,0.000295,0.000232,0.000174,0.000171,4.2e-05,0.000149,0.000378,0.000267,0.000112,0.000283,0.00028,0.000298,0.000186,0.000363,0.000341,0.000451,0.000156,0.00034,0.000149,0.00034,0.000113,0.000512,0.000187,0.000144,0.000303,0.000479,0.000506,0.000247,0.000315,0.000164,0.000509,0.000439,0.000228,0.000172,0.00039,0.000707,0.000602,0.000447,6.6e-05,0.000404,0.000385,0.000272,0.000125,0.000347,0.000382,0.000229,0.000126,0.000101,0.000279,8.6e-05,0.00035,0.000133,8.5e-05,0.000237,0.000208,8.9e-05,0.000243,0.000367,0.000316,0.000113
0.000125,4.9e-05,0.000412,0.000567,0.000371,0.000441,4.4e-05,0.000372,5.1e-05,0.000118,0.00024,6.5e-05,0.000515,0.000523,0.000379,0.000268,0.000332,0.000464,0.000283,0.000609,0.000925,0.000661,0.000573,0.000814,0.000608,9.1e-05,0.000164,0.000219,0.000561,0.000582,6.5e-05,0.000396,0.000761,0.000359,0.000235,0.000248,0.000368,0.000195,3e-04,0.000508,0.000361,0.000305,0.000306,0.000434,0.000506,0.000384,0.000358,0.000384,0.000224,0.000221,0.000194,0.000454,0.000303,0.000171,0.000303,0.000228,0.000176,0.000291,0.000594,0.000642,0.000194,0.000399,0.000463,0.000506,0.000177,8.1e-05,0.000162,0.000165,0.000314,0.00044,0.000433,0.000231,0.000353,0.000534,0.000565,0.000493,0.000216,0.000182,0.00024,0.000265,0.000224,0.000459,0.000313,0.000174,0.000286,0.000299,0.000265,8.5e-05,5.9e-05,0.000319,0.000192,0.000548,0.000264,0.000143,6.8e-05,0.000522,0.000258,5e-05,0.000181,7.8e-05,0.000353,0.000646,0.000378,7.5e-05,0.000274,0.000538,0.000427,0.000443,0.000163,8.6e-05,0.000128,0.000248,8.9e-05,0.000139,0.000391,0.000365,0.000198,0.000345,6.7e-05,0.000194,0.000217
0.000264,0.000195,0.000477,0.000704,0.000478,0.00014,0.00033,0.000307,0.000378,0.00029,0.000103,0.000154,0.000314,5.6e-05,4.3e-05,0.000203,0.000243,0.000318,0.000293,0.000467,0.000579,0.000397,0.000206,0.000212,0.000107,0.000212,0.000217,0.000287,0.00049,0.000238,8.3e-05,0.000281,0.000637,0.000485,0.000174,0.000146,0.000139,2.7e-05,0.000239,0.000289,0.000283,0.00027,0.000332,0.000161,0.00024,6.6e-05,0.000317,0.000304,7.5e-05,0.00018,0.000314,0.000276,0.000215,0.000248,0.000142,0.000159,0.000277,0.000535,0.000381,0.000288,0.000244,0.00043,0.000312,0.000133,0.000237,0.000155,0.00014,0.000109,0.00017,0.000346,0.000113,0.000272,0.000123,0.000221,0.000194,0.000203,0.000439,0.00039,0.000293,0.000315,0.000302,0.000219,0.000173,0.000208,0.000413,0.000178,0.000121,0.000159,0.000171,0.000268,0.00018,0.000272,0.000187,0.000122,7.7e-05,0.000446,0.000334,0.000169,0.000284,0.000244,0.000254,0.000377,0.000386,0.000252,0.000345,0.000156,0.000156,0.000212,0.000349,0.000242,0.000111,1.4e-05,0.00029,0.00031,0.000448,5.4e-05,0.000261,0.000134,0.000302,0.000198,0.000305
9.5e-05,0.000172,0.00032,0.000279,0.000168,0.00015,0.000299,0.000284,4e-04,0.000218,0.00028,0.000151,0.000193,0.000212,0.000139,0.000168,0.000266,8.7e-05,0.000242,5.1e-05,0.000392,0.000141,0.000115,9.3e-05,0.000105,0.000227,0.000193,0.000285,0.000243,0.000291,2e-04,0.000191,0.000314,0.000287,0.000213,9e-05,0.000104,0.000193,7.9e-05,0.00023,0.000288,0.000103,0.000229,0.000309,0.000194,9.7e-05,0.000325,0.000197,0.000167,0.000137,0.000153,0.000175,0.000143,7e-05,0.000101,3.7e-05,5.5e-05,0.000325,0.000174,0.000231,0.000113,2e-04,0.000167,5.7e-05,5.5e-05,4.7e-05,8.9e-05,9.4e-05,0.000171,0.000354,0.000232,0.000267,4e-04,0.000205,0.000249,8.9e-05,0.000327,0.000139,0.00014,0.000153,5.4e-05,0.00012,7.5e-05,7.3e-05,0.000147,0.000118,0.000111,3.7e-05,7.6e-05,0.000276,0.000246,0.000227,6.9e-05,9.1e-05,8.7e-05,0.000341,0.000126,0.000119,0.000368,0.000165,6.3e-05,0.000205,6.3e-05,6e-05,0.000126,0.000172,9e-05,0.000167,0.000224,0.000169,0.000187,0.000258,0.00025,0.000437,0.000151,0.000205,0.000413,0.000325,0.000354,0.000143,0.000309
1e-04,2.6e-05,0.000191,7.6e-05,0.000146,8e-05,0.000132,0.00015,6.8e-05,7.1e-05,7.1e-05,0.000102,0.000136,0.000105,0.000146,4.7e-05,8.7e-05,9.5e-05,0.000185,0.000143,6.4e-05,0.000183,0.000107,0.000154,0.000152,0.000121,6.9e-05,7.1e-05,0.000294,7.1e-05,6.5e-05,0.000111,0.000123,6e-06,7.7e-05,0.000128,0.000144,5.6e-05,0.000139,0.000101,7.1e-05,2.8e-05,6e-05,0.000179,1.7e-05,8.6e-05,0.000127,3.6e-05,2.1e-05,0.00014,8.2e-05,0.000101,0.000124,3.4e-05,8.2e-05,3.1e-05,5.3e-05,0.000173,0.000168,4.4e-05,3e-05,9e-05,0.000119,0.00014,0.000136,0.000103,4.1e-05,0.000102,0.000102,8.6e-05,0.000109,0.000125,0.000143,0.000114,0.000172,0.000138,0.000112,4.7e-05,0.000126,4.5e-05,6.7e-05,2.7e-05,0.000119,4.7e-05,7.6e-05,4.5e-05,2.4e-05,6.9e-05,5.6e-05,0.00015,0.000142,5.1e-05,0.000127,0.000123,8.9e-05,5.3e-05,0.000149,0.000122,9.8e-05,9.3e-05,0.000183,0.000108,6.4e-05,6e-05,4.7e-05,0.000106,0.000115,0.00016,3.8e-05,0.00014,0.000168,8.1e-05,0.000141,9.3e-05,0.000127,0.000159,0.00016,0.000157,0.000101,0.000154,0.000127
5.6e-05,7.7e-05,0.000135,2.9e-05,0.000148,7e-05,2.9e-05,8.7e-05,5.9e-05,5.9e-05,4.6e-05,4e-05,7.9e-05,6.6e-05,8.9e-05,4.6e-05,6.2e-05,5.4e-05,0.00012,0.000114,6.4e-05,0.000118,5.4e-05,9.4e-05,3.7e-05,0.00011,6.7e-05,0.000123,0.000211,6.8e-05,9.2e-05,7.4e-05,4.2e-05,7.2e-05,6.7e-05,8.3e-05,8.3e-05,6.7e-05,0.000116,4.3e-05,9.5e-05,1.1e-05,3.8e-05,0.000113,4.4e-05,6e-05,0.000109,2.5e-05,1e-05,8.3e-05,5.2e-05,0.000108,7.3e-05,3.9e-05,6.6e-05,5.8e-05,7.2e-05,0.000159,0.00013,2.7e-05,5.6e-05,0.000128,1.9e-05,6.9e-05,0.000126,2.5e-05,2.5e-05,8.6e-05,7.7e-05,9.2e-05,0.000112,9.3e-05,3.9e-05,4.6e-05,0.000176,3.9e-05,7.9e-05,3.4e-05,4.4e-05,3.3e-05,4.4e-05,3.9e-05,3.7e-05,8.1e-05,8.4e-05,0.000113,6.1e-05,4.5e-05,4.5e-05,7.4e-05,0.000112,4e-05,0.000107,5.8e-05,3.5e-05,6.3e-05,0.000122,0.000104,3.7e-05,5.5e-05,9.4e-05,8.5e-05,3.8e-05,2.7e-05,7.5e-05,7.3e-05,0.000113,5.9e-05,3.2e-05,9e-05,8.1e-05,5.8e-05,8.9e-05,4.5e-05,3.4e-05,3.3e-05,0.00012,7.6e-05,3.5e-05,1.6e-05,5.4e-05
8.6e-05,0.000171,8.2e-05,6e-05,3.7e-05,0.000107,0.000122,0.000157,7.9e-05,9.2e-05,0.000186,8.4e-05,4.9e-05,3.7e-05,0.000149,8.8e-05,3.2e-05,2e-05,6.5e-05,0.000145,5.1e-05,8.4e-05,2.6e-05,3e-05,2.6e-05,4.1e-05,8.6e-05,0.000122,0.000246,5.4e-05,6.2e-05,0.000106,9.6e-05,9e-05,0.000119,0.000198,6.5e-05,7e-05,0.000118,9.4e-05,0.000164,0.000123,6.1e-05,9.1e-05,3.4e-05,8.5e-05,0.000158,6.9e-05,7.7e-05,2.8e-05,5.4e-05,9.7e-05,3.7e-05,2.9e-05,1.8e-05,4.5e-05,4.4e-05,9.9e-05,0.000131,5.2e-05,9.3e-05,0.000176,6.7e-05,3.5e-05,0.000198,0.000133,8.2e-05,8.1e-05,0.000103,0.000156,5.4e-05,7.8e-05,6.7e-05,8.9e-05,0.000218,0.000127,6.4e-05,0.000115,0.00014,5.3e-05,9.7e-05,0.000152,7.8e-05,0.000119,0.000118,0.000116,4e-05,5.9e-05,8.2e-05,1e-05,7.8e-05,0.000129,0.000124,7.3e-05,7.4e-05,9.9e-05,9.9e-05,6.6e-05,9.3e-05,5.7e-05,7.9e-05,8.9e-05,9.8e-05,5.2e-05,0.000111,4.6e-05,0.000128,9.9e-05,5.5e-05,0.000119,0.000104,8.4e-05,9.6e-05,5.8e-05,9e-06,5.2e-05,0.000166,0.000107,6.4e-05,9.3e-05,5.7e-05
4.3e-05,7.6e-05,0.000138,6.8e-05,4.5e-05,4.7e-05,0.000181,0.000215,0.000274,6.3e-05,0.000133,0.000114,0.000168,8.1e-05,0.000132,0.000136,5.2e-05,7.6e-05,0.000107,0.000166,0.000162,9.6e-05,3.2e-05,6.4e-05,9.5e-05,7.6e-05,0.000132,0.000195,0.000247,0.000226,0.00011,7.7e-05,6.4e-05,0.000118,1.2e-05,0.000169,0.000113,0.000149,2.1e-05,9.9e-05,9.7e-05,4.9e-05,0.000192,0.000217,0.000168,0.000185,5.7e-05,0.000173,0.000124,2.4e-05,1.8e-05,8.6e-05,7.6e-05,5.3e-05,9.4e-05,8.5e-05,0.000144,2.3e-05,2.4e-05,2.5e-05,0.000115,9.6e-05,0.00015,5e-06,0.000118,5.7e-05,9.1e-05,2.8e-05,6.6e-05,9.4e-05,0.00014,0.00012,0.000169,0.000118,0.000223,7.7e-05,4.4e-05,8.7e-05,0.000174,9.7e-05,0.000143,0.000117,0.00013,7.4e-05,0.000256,0.000122,0.000113,5.9e-05,0.000119,0.00012,5.7e-05,0.00012,8.9e-05,9.5e-05,0.000165,0.000133,7.7e-05,0.000126,6.9e-05,0.000184,0.000165,7.9e-05,9.2e-05,6.8e-05,7.1e-05,7.2e-05,0.000103,5.5e-05,5.4e-05,0.000174,0.000116,7.8e-05,9.3e-05,0.000202,0.000121,0.000118,0.000124,8.6e-05,8.8e-05,0.000106,2.6e-05
5.5e-05,2.9e-05,8.5e-05,0.000153,3.5e-05,0.000103,0.000133,7.7e-05,6.6e-05,0.000133,7.7e-05,0.000129,5.6e-05,0.00011,5e-05,6.1e-05,4.5e-05,1.9e-05,8.8e-05,0.000102,2.7e-05,0.00019,9.4e-05,7.7e-05,0.000104,0.000131,9.3e-05,0.000156,0.00014,0.000181,0.000134,6.4e-05,8.4e-05,1.8e-05,0.000164,4.7e-05,7.5e-05,5e-05,0.000102,9e-05,9.7e-05,0.000162,0.00018,3.3e-05,8.6e-05,0.000133,5.5e-05,0.000143,4.3e-05,5.4e-05,3.3e-05,8.5e-05,2.9e-05,4.1e-05,8.1e-05,3.1e-05,0.000172,0.000215,0.000126,0.000119,4e-05,9.9e-05,3.2e-05,6.6e-05,0.000127,8e-06,4e-05,0.000159,0.000115,7.5e-05,0.000122,1.4e-05,9.2e-05,8.2e-05,7.2e-05,7e-05,6.8e-05,3e-05,0.000124,6.2e-05,0.000119,0.000188,0.000213,0.000127,0.000163,0.000106,0.000179,1e-04,0.000138,0.000121,0.000184,7.6e-05,5.5e-05,6.8e-05,0.000106,5.5e-05,0.000131,4e-06,5.9e-05,0.000192,5.8e-05,1.7e-05,0.000119,0.000115,8.7e-05,0.00012,5.4e-05,9.1e-05,2.7e-05,0.000148,0.000111,0.000188,9.5e-05,0.000187,0.000121,0.000133,4.9e-05,0.000149,5.7e-05,8.7e-05,0.000104
0.000142,4e-05,0.000131,9.7e-05,0.000101,8.8e-05,0.000173,0.000103,1.8e-05,4.9e-05,8.8e-05,0.000168,0.000105,0.000219,0.000152,6.1e-05,8.4e-05,4.9e-05,7.6e-05,6.6e-05,5.5e-05,0.000265,7.8e-05,0.000112,0.000115,8.6e-05,2.4e-05,3.7e-05,0.000195,0.000115,6.9e-05,5.1e-05,7.8e-05,8.8e-05,0.000257,0.000177,8.4e-05,0.000132,4.1e-05,0.000133,7.3e-05,4.2e-05,6e-05,8.9e-05,9.1e-05,0.000143,6.1e-05,9.6e-05,5e-05,9.3e-05,0.000176,8.3e-05,7e-05,4.6e-05,9.5e-05,4e-05,0.000126,8.2e-05,9.1e-05,9.6e-05,0.000105,0.000148,7.5e-05,4.6e-05,5.6e-05,0.000106,5.9e-05,0.000162,8.1e-05,8.6e-05,5.3e-05,7.8e-05,8.9e-05,9e-05,9.4e-05,6.8e-05,8.7e-05,9.1e-05,6.7e-05,1.9e-05,5.8e-05,0.000155,6.9e-05,1.3e-05,0.000136,5.6e-05,8.1e-05,4.7e-05,5.7e-05,8.6e-05,7.4e-05,0.00015,4.2e-05,7e-05,0.00018,0.000191,0.000158,6e-05,0.00017,0.000156,0.000107,3.3e-05,0.000118,6.5e-05,7.6e-05,5.6e-05,8.7e-05,1.5e-05,4.5e-05,0.000135,0.000161,0.000203,5.6e-05,0.000166,5e-05,0.000119,0.000132,0.000137,0.000145,8.1e-05,0.000157
5.3e-05,0.000129,0.000198,8.5e-05,1e-04,9e-05,0.000122,1.9e-05,4e-05,5.7e-05,0.000127,2.4e-05,2.7e-05,0.000194,6.4e-05,0.000109,4.2e-05,0.000125,9.2e-05,5.2e-05,0.000199,0.00017,0.000133,0.000129,0.000119,0.000108,0.000103,4.7e-05,0.000127,1.7e-05,5.7e-05,0.000164,4.3e-05,4.4e-05,0.000214,0.000219,0.000174,0.000202,0.00022,0.000193,0.000299,0.000184,0.000102,0.00014,2.4e-05,1e-05,4.2e-05,6.5e-05,7.1e-05,0.000131,0.000254,3e-05,1e-04,8.3e-05,0.000174,0.000128,5.6e-05,2.3e-05,0.000119,7e-05,0.000105,0.000111,8.3e-05,8.8e-05,9e-05,0.00012,3.8e-05,6.9e-05,4.5e-05,4.1e-05,3.4e-05,5.1e-05,5.7e-05,4.2e-05,0.00019,3.5e-05,5.6e-05,3.9e-05,4e-05,0.000127,7.9e-05,0.000111,8e-05,9e-05,8.9e-05,5.8e-05,6.1e-05,7.8e-05,6.8e-05,9.2e-05,0.000107,1.6e-05,7.1e-05,7.6e-05,0.000134,0.000101,0.000159,6.6e-05,0.000145,0.000154,5.8e-05,7.9e-05,5.8e-05,5e-06,1e-04,8.4e-05,6.2e-05,0.000159,0.000138,0.000154,0.000128,5.5e-05,0.000196,0.000172,0.000161,3e-05,7.9e-05,0.000199,6.1e-05,6.7e-05,0.000131
0.000179,0.000268,0.000289,0.000169,0.000147,0.000111,9.2e-05,9e-05,2.1e-05,9.6e-05,0.00011,1e-04,0.000106,0.00017,0.000183,0.00028,0.000229,0.000136,0.000114,7.3e-05,0.000289,0.000275,0.000258,9.3e-05,0.000117,0.000176,0.000126,0.000157,0.000258,6.9e-05,7.7e-05,0.000171,0.000121,6.1e-05,0.000193,0.000235,0.000129,0.000245,7e-05,9.8e-05,0.000306,0.000366,0.000347,0.000397,0.000325,0.000268,0.000127,4.2e-05,4.4e-05,7.5e-05,0.000199,0.000262,5.2e-05,0.000115,9.2e-05,0.000207,0.00031,7.4e-05,0.000166,2.5e-05,9e-06,2e-04,0.000223,0.000287,0.000243,0.000244,0.000205,9.4e-05,8e-05,0.000136,0.000129,3.7e-05,0.000135,8.7e-05,0.000202,0.000196,7.7e-05,5.4e-05,0.000105,0.000244,0.000167,0.000169,0.000208,9.2e-05,0.000117,0.000182,7.4e-05,5.2e-05,3.4e-05,0.000109,0.000118,0.000112,9.7e-05,0.000201,0.000226,0.000146,0.000184,0.000132,9e-05,0.000107,0.000136,0.000116,8.7e-05,6.4e-05,6.7e-05,6.4e-05,7.1e-05,0.000239,9.9e-05,8.2e-05,0.000221,0.000151,0.000243,0.00029,0.000174,0.000344,0.000186,0.000216,0.000307,0.000305,0.000155
9.3e-05,0.00016,4.5e-05,0.000141,3.2e-05,3e-05,0.000147,0.000194,0.000149,9.1e-05,5.7e-05,3.9e-05,2.4e-05,7.8e-05,1.7e-05,0.000218,0.000183,0.000217,0.000149,3.7e-05,0.000196,0.000128,0.000109,7.2e-05,0.000123,0.000239,0.000193,0.000129,0.000181,0.000151,9.3e-05,0.000178,7.5e-05,1.7e-05,9.8e-05,5.7e-05,0.000222,9.2e-05,0.000116,9.4e-05,0.000209,3.6e-05,0.000186,9.5e-05,0.000143,0.000135,0.000117,5.7e-05,2.9e-05,2e-06,0.000191,0.000285,0.00017,0.000106,0.000193,2e-04,0.000127,0.000266,0.000366,0.000252,0.000216,0.000277,0.00018,0.000166,2.6e-05,8.4e-05,7e-05,9.6e-05,0.000157,0.000152,0.000141,0.000137,0.000186,1e-04,0.000207,0.000191,0.000113,5.9e-05,0.000103,0.000149,0.000152,8.5e-05,0.000214,0.000123,8.4e-05,0.000169,0.000199,0.000119,8e-05,0.000171,0.000102,0.000129,9.2e-05,0.000179,0.000275,0.000284,0.000124,0.000117,0.000127,6.8e-05,0.000145,0.00029,0.000227,9.7e-05,5e-06,6e-05,0.000126,0.000168,0.000159,0.000126,0.000135,0.000157,8.9e-05,0.000104,0.000156,0.000425,0.000322,0.000108,0.000238,0.000227,0.000181
8.4e-05,4.4e-05,0.000108,9.6e-05,5.6e-05,8.8e-05,0.000169,8.4e-05,4.2e-05,4.4e-05,2e-05,4.3e-05,7.4e-05,6.4e-05,3.4e-05,0.000169,7.6e-05,0.000142,3.5e-05,9e-05,0.000116,0.000126,0.000108,3.5e-05,6.7e-05,0.000176,2.2e-05,3.4e-05,0.000121,9.2e-05,4.7e-05,6.8e-05,1.9e-05,7.2e-05,6.3e-05,0.00011,0.00014,2.8e-05,0.000101,0.000133,0.00011,8.8e-05,0.000112,0.000118,4.7e-05,0.000167,0.000115,4.7e-05,4.9e-05,2.3e-05,9.7e-05,9.1e-05,0.000131,7.1e-05,0.000132,4.3e-05,9.8e-05,0.000232,9.8e-05,0.000151,0.00018,0.000106,8.2e-05,0.000111,0.000119,5.7e-05,2.3e-05,5e-05,6e-05,0.000146,0.000155,9.8e-05,0.000123,1.1e-05,1e-04,3.3e-05,4.9e-05,0.000101,4.4e-05,0.000118,6.3e-05,7e-05,0.000144,5.9e-05,0.00012,0.000107,0.000204,0.000109,0.000164,0.000106,9.7e-05,8.7e-05,6.9e-05,0.000132,3e-05,0.000189,7.1e-05,0.000137,4.3e-05,7.6e-05,0.000163,0.000161,2e-05,3e-05,3.7e-05,3.9e-05,5.6e-05,0.00011,5.3e-05,4.5e-05,4.8e-05,0.000113,4.6e-05,6.2e-05,0.000133,0.000207,2.7e-05,2.7e-05,0.000129,0.000125,0.000105
3.9e-05,8.6e-05,9.9e-05,5.5e-05,4.1e-05,0.000116,4e-05,7.4e-05,3.9e-05,3.4e-05,9.2e-05,1.6e-05,0.000131,8.7e-05,4.7e-05,7.1e-05,1.6e-05,7e-05,9e-05,0.000105,0.000173,0.000176,2.8e-05,1.5e-05,9e-06,0.000141,0.000128,4.2e-05,8.8e-05,9.7e-05,3.9e-05,2.5e-05,7e-06,8.1e-05,0.000102,9.1e-05,0.000186,9.3e-05,0.000109,3e-05,5.6e-05,0.000144,6.3e-05,3e-05,3.7e-05,4.5e-05,4.3e-05,6.7e-05,3.7e-05,3e-05,0.000104,6.1e-05,0.00017,0.000116,1.4e-05,4e-05,2.9e-05,0.000144,0.000108,6.7e-05,0.000165,0.000106,9.8e-05,2.7e-05,2.6e-05,3.5e-05,7.5e-05,0.000116,7.6e-05,0.000201,5e-05,6.2e-05,6.1e-05,6.7e-05,9.1e-05,9e-05,7.2e-05,0.000103,0.000125,0.000137,4.4e-05,9.2e-05,3.2e-05,3.1e-05,9.5e-05,0.000162,5.2e-05,1.8e-05,8.4e-05,9e-05,0.00011,0.000126,5.8e-05,6.5e-05,3.3e-05,8e-05,5.7e-05,9.5e-05,6.9e-05,3e-05,0.000113,6e-05,4.6e-05,2.5e-05,8.8e-05,7.2e-05,2.5e-05,0.00011,8.2e-05,6.6e-05,6.2e-05,4.3e-05,5.9e-05,7.2e-05,0.000119,0.000134,0.000111,8e-05,5.3e-05,0.000139,8.6e-05
2.9e-05,6.7e-05,3.1e-05,4.1e-05,4.3e-05,1e-05,2.7e-05,3.7e-05,1.3e-05,2.2e-05,5.5e-05,4.2e-05,3.3e-05,2.7e-05,1.7e-05,5.8e-05,1.3e-05,2e-05,3.5e-05,3.7e-05,5.4e-05,2.4e-05,2.9e-05,1.2e-05,1.9e-05,1.6e-05,3.6e-05,1.7e-05,7.1e-05,3.8e-05,3.4e-05,4.5e-05,2.4e-05,2.2e-05,3e-05,3.5e-05,2.9e-05,7.4e-05,4e-06,1.5e-05,2.4e-05,2.8e-05,1.8e-05,1.9e-05,3.3e-05,1.8e-05,1.9e-05,1.5e-05,3.1e-05,1.3e-05,6e-05,3.3e-05,1.5e-05,3e-06,5.1e-05,4.9e-05,4.3e-05,5.5e-05,1.4e-05,2.6e-05,7.2e-05,5.6e-05,4.6e-05,4.6e-05,3.5e-05,3.9e-05,6.2e-05,2.4e-05,1.2e-05,3.5e-05,4.2e-05,3.1e-05,5.9e-05,2e-05,5.8e-05,2.9e-05,1.7e-05,7.1e-05,4.4e-05,2.8e-05,4e-06,3.1e-05,5.4e-05,5e-05,1.5e-05,2e-05,1.8e-05,2.6e-05,1.5e-05,1e-05,2.6e-05,1.9e-05,7e-06,1.8e-05,7e-06,1e-05,3.6e-05,2.5e-05,6.2e-05,3.9e-05,2.7e-05,2.3e-05,1.5e-05,3.8e-05,5.6e-05,1.6e-05,2.6e-05,6.7e-05,7.1e-05,3.7e-05,4.2e-05,4.8e-05,4.2e-05,2.7e-05,1e-05,5.4e-05,3.1e-05,3.4e-05,2.4e-05,6.4e-05,3.2e-05
2.6e-05,6.8e-05,3e-05,1.1e-05,6.5e-05,2.3e-05,1.4e-05,5.5e-05,4.2e-05,2.8e-05,3.5e-05,4.1e-05,5.4e-05,2.4e-05,3.5e-05,4.1e-05,2.5e-05,4.7e-05,2.2e-05,6.6e-05,6.5e-05,4.9e-05,2e-05,2.1e-05,2e-05,3.7e-05,3.8e-05,4.9e-05,6.3e-05,4.2e-05,2.9e-05,5.1e-05,3.3e-05,3.1e-05,3.1e-05,1.8e-05,2.9e-05,1.8e-05,4.5e-05,3.4e-05,1.1e-05,3.4e-05,1.2e-05,1.9e-05,3.1e-05,5.3e-05,1.2e-05,1.7e-05,3.8e-05,4.3e-05,3.1e-05,4.1e-05,5.5e-05,1.5e-05,7.9e-05,1.8e-05,5e-05,3.5e-05,3.9e-05,6.3e-05,4.4e-05,2.7e-05,4.9e-05,8.4e-05,2.9e-05,1.8e-05,3.9e-05,3.3e-05,2.6e-05,3.4e-05,4e-05,5.6e-05,1.8e-05,3.1e-05,1.6e-05,1.3e-05,1.5e-05,6.4e-05,3.7e-05,4e-06,2.1e-05,2.1e-05,2.2e-05,2.1e-05,3.1e-05,1.7e-05,1.7e-05,3.3e-05,4.9e-05,1.9e-05,1.5e-05,1.5e-05,2e-05,1.9e-05,1.2e-05,2.9e-05,4.2e-05,4.6e-05,6.8e-05,2.3e-05,2.4e-05,4.4e-05,6e-06,3.4e-05,2.2e-05,3.7e-05,1.2e-05,4.1e-05,3.3e-05,1.8e-05,6.4e-05,4.8e-05,2.7e-05,2.6e-05,2.5e-05,4.8e-05,3.9e-05,2.4e-05,3.7e-05,3.1e-05,3.2e-05
3.5e-05,1.1e-05,2.5e-05,5e-06,5.3e-05,5.4e-05,3.1e-05,4.7e-05,9.3e-05,6.6e-05,1.2e-05,6.7e-05,0.000101,3e-05,2.1e-05,3.1e-05,3.7e-05,4.8e-05,2.1e-05,2.9e-05,4.2e-05,5.3e-05,6.3e-05,2.1e-05,3.6e-05,5.4e-05,6.7e-05,2.6e-05,2.1e-05,4.1e-05,9e-06,6.1e-05,1.4e-05,1.9e-05,3.1e-05,2.7e-05,4.3e-05,6.6e-05,6e-05,2.3e-05,1e-05,7.8e-05,6.6e-05,1.3e-05,4e-05,3.7e-05,5.2e-05,2.4e-05,7e-06,3.5e-05,2.4e-05,1.7e-05,6.7e-05,5.9e-05,8.1e-05,7.4e-05,6.8e-05,6.4e-05,5.2e-05,6.4e-05,8e-05,7.9e-05,4.5e-05,6.8e-05,7.9e-05,8.2e-05,6.3e-05,4e-05,7.9e-05,6.5e-05,1.8e-05,1.7e-05,4.2e-05,1.9e-05,5.1e-05,3.2e-05,2.4e-05,2.2e-05,3.8e-05,8.1e-05,4e-05,9e-06,3.9e-05,2.2e-05,3.6e-05,5.6e-05,2.4e-05,3.2e-05,3.6e-05,6.2e-05,3.3e-05,2e-05,5e-05,2.7e-05,4.6e-05,6e-05,2.7e-05,2.8e-05,2.3e-05,1.9e-05,1.7e-05,5.1e-05,4.3e-05,1e-05,2e-05,2e-06,2.4e-05,1.4e-05,3.7e-05,2.2e-05,3.7e-05,5.3e-05,2.2e-05,4.1e-05,3.3e-05,3.6e-05,2.5e-05,2.6e-05,3.8e-05,3.2e-05,2.4e-05
5.6e-05,4.2e-05,1.9e-05,6e-06,3.5e-05,5.5e-05,3.7e-05,4.1e-05,6.6e-05,7e-06,5.4e-05,7e-05,1e-05,5.8e-05,4.6e-05,2.5e-05,2.3e-05,4e-06,3.4e-05,3.6e-05,5.9e-05,8e-06,4e-05,6.2e-05,6.2e-05,2.1e-05,2e-05,2.5e-05,2.7e-05,2.4e-05,4.1e-05,5.7e-05,3.9e-05,5e-05,4.8e-05,6.9e-05,2.2e-05,3.2e-05,1.4e-05,1.3e-05,1.9e-05,5.1e-05,4.4e-05,6.5e-05,4e-06,2.5e-05,4.5e-05,2.4e-05,2.2e-05,3.2e-05,1.8e-05,2.3e-05,5e-05,1.2e-05,1.3e-05,4.3e-05,2.8e-05,4.3e-05,5.6e-05,3.6e-05,7e-05,4.4e-05,3.5e-05,4.2e-05,2.8e-05,4.9e-05,1.4e-05,1.7e-05,5.5e-05,1.3e-05,4.6e-05,5e-05,4.5e-05,5.3e-05,7.2e-05,7e-06,2.8e-05,2.9e-05,2.9e-05,6.6e-05,4.5e-05,3.7e-05,3.1e-05,3.5e-05,8e-06,6e-06,5e-06,2.7e-05,1.2e-05,3.2e-05,1.4e-05,2.8e-05,3e-05,2e-06,4.2e-05,5.2e-05,2.1e-05,1.1e-05,9e-06,4e-06,4e-06,2.2e-05,3.3e-05,3e-05,2.8e-05,1.8e-05,2.9e-05,4.3e-05,2.6e-05,8e-06,2e-05,3.1e-05,2.6e-05,3e-05,5.9e-05,3.9e-05,1.3e-05,3.2e-05,3.1e-05,4.1e-05,4.5e-05
6.2e-05,2.4e-05,2.5e-05,1.5e-05,6e-06,3.8e-05,1.9e-05,3.4e-05,1.7e-05,1.1e-05,4.7e-05,1e-05,3.5e-05,4.3e-05,2e-05,1e-05,1.6e-05,3e-05,3.7e-05,1.2e-05,3.4e-05,3.6e-05,1.6e-05,3.8e-05,1.2e-05,2.1e-05,1.8e-05,1.4e-05,2.9e-05,3.9e-05,3e-05,2.8e-05,1.4e-05,2.1e-05,2.2e-05,4.6e-05,7e-05,3.5e-05,1.4e-05,1.3e-05,3.9e-05,4.3e-05,1.4e-05,3e-05,3.5e-05,3.1e-05,3.9e-05,3.8e-05,3.9e-05,6e-06,1.3e-05,2.6e-05,3.8e-05,3.6e-05,5.7e-05,2.8e-05,3.3e-05,7.2e-05,6.7e-05,7.3e-05,5e-06,3.1e-05,1.5e-05,9e-06,2.3e-05,7.1e-05,5e-05,4.3e-05,2.6e-05,2.6e-05,3e-05,3.4e-05,1.6e-05,5.5e-05,1.7e-05,1.4e-05,3.3e-05,3.2e-05,1.3e-05,3.9e-05,9e-06,1.2e-05,4.6e-05,1.2e-05,2.7e-05,3.3e-05,1.6e-05,5e-06,1.8e-05,1.2e-05,2.5e-05,1e-05,1.3e-05,2e-05,2.6e-05,3.3e-05,1.7e-05,1.1e-05,9e-06,1.3e-05,2.9e-05,2.1e-05,6e-06,2.7e-05,7e-06,3e-06,2.6e-05,2.9e-05,1.1e-05,9e-06,4.4e-05,1.6e-05,2.5e-05,2.2e-05,5.4e-05,2.5e-05,2.1e-05,1.8e-05,1.3e-05,2.5e-05,1.2e-05
2.8e-05,2.8e-05,1e-05,2.3e-05,4.1e-05,1e-06,1.2e-05,2.9e-05,3.9e-05,4e-06,3.2e-05,2.1e-05,2.5e-05,4e-06,1.4e-05,2e-05,3e-05,2.3e-05,3.5e-05,1.1e-05,2.3e-05,7e-06,3e-05,1.7e-05,2.2e-05,3.6e-05,2.4e-05,9e-06,4.3e-05,2.1e-05,2.1e-05,2.5e-05,2.3e-05,1.8e-05,4.3e-05,1.4e-05,4.4e-05,6e-06,1.5e-05,2.3e-05,2.6e-05,9e-06,1.2e-05,1e-05,1.1e-05,2.3e-05,4.9e-05,1.7e-05,3e-05,1.1e-05,2.1e-05,2e-06,2.7e-05,2.6e-05,3.6e-05,1.1e-05,1.6e-05,5.4e-05,3.7e-05,3.1e-05,2.8e-05,1.9e-05,1.9e-05,1.6e-05,1.3e-05,3.7e-05,2.8e-05,2.2e-05,4.6e-05,1.7e-05,1.2e-05,2e-05,9e-06,2.8e-05,2.7e-05,1.3e-05,2.7e-05,5e-06,1.7e-05,2.4e-05,2e-05,1.8e-05,1.7e-05,2.2e-05,2e-05,1.8e-05,1.1e-05,1.4e-05,1.2e-05,2.6e-05,2.6e-05,3e-05,1.6e-05,8e-06,1.6e-05,2.4e-05,2.6e-05,2.4e-05,1.3e-05,2.6e-05,1.6e-05,9e-06,8e-06,1.7e-05,1.9e-05,1.6e-05,1.8e-05,2.8e-05,1.4e-05,2e-06,4.2e-05,1.1e-05,1.1e-05,1.3e-05,3.4e-05,3.9e-05,2e-05,2.5e-05,2.2e-05,8e-06,1.4e-05
3.1e-05,2.2e-05,1.3e-05,2.3e-05,2.3e-05,1e-06,2.3e-05,2.2e-05,3.3e-05,4.1e-05,1.8e-05,2.2e-05,3.3e-05,3.3e-05,1.8e-05,1.7e-05,9e-06,2.5e-05,2.3e-05,1e-05,2.5e-05,3.2e-05,4e-06,2.2e-05,5e-06,1.5e-05,9e-06,7e-06,1.9e-05,1.9e-05,2.5e-05,3.1e-05,1.9e-05,1.7e-05,4e-05,2.1e-05,2.6e-05,1.6e-05,3.4e-05,1.6e-05,1.6e-05,2.4e-05,8e-06,7e-06,2.4e-05,1.8e-05,1.5e-05,9e-06,2.9e-05,4e-05,1.3e-05,1.6e-05,1.6e-05,1.5e-05,2.1e-05,1.3e-05,1.4e-05,3.2e-05,3.8e-05,2e-05,2.9e-05,1.1e-05,2.8e-05,3.7e-05,3.4e-05,4e-05,2.3e-05,2.4e-05,2.4e-05,2.4e-05,2.4e-05,2.1e-05,1.8e-05,2.4e-05,3e-05,7e-06,3.2e-05,1.9e-05,1.9e-05,1.3e-05,1.8e-05,6e-06,1.5e-05,1.7e-05,7e-06,6e-06,7e-06,1.4e-05,1.5e-05,2.4e-05,3.2e-05,3e-06,2.8e-05,1.2e-05,2.6e-05,2.6e-05,9e-06,1.7e-05,2e-05,3e-05,2.5e-05,4e-06,1.1e-05,9e-06,2e-05,2e-06,2.5e-05,2.5e-05,3e-05,1e-05,2.9e-05,2.7e-05,1.9e-05,2e-06,3.3e-05,3.2e-05,3.2e-05,1.3e-05,6e-06,1.5e-05,1e-05
3e-05,2.5e-05,9e-06,1.1e-05,2.1e-05,2.3e-05,1.5e-05,3.4e-05,5e-06,3.1e-05,1.5e-05,1.7e-05,8e-06,1.9e-05,2.5e-05,2.6e-05,1.9e-05,1.3e-05,2.2e-05,5e-06,1.1e-05,2.7e-05,3e-05,3.6e-05,3.2e-05,3e-05,1.7e-05,1.3e-05,1.8e-05,1.5e-05,1.5e-05,1.2e-05,1.3e-05,2.7e-05,2.1e-05,4.7e-05,5.6e-05,2.4e-05,1.9e-05,6e-06,1.2e-05,1e-05,1e-05,2.4e-05,2.4e-05,1.6e-05,4.5e-05,2.1e-05,3.5e-05,3e-05,2.9e-05,2.4e-05,3.9e-05,1.9e-05,4.7e-05,2.4e-05,1.3e-05,1.3e-05,2.7e-05,7e-06,3.3e-05,2.8e-05,3.2e-05,1.8e-05,7e-06,2e-05,2.4e-05,1.9e-05,1.4e-05,1.4e-05,3.4e-05,1.2e-05,3e-06,1.6e-05,3e-05,2.8e-05,4.4e-05,3e-05,1.8e-05,1.3e-05,1.3e-05,2e-06,2e-05,1.1e-05,1.5e-05,3.1e-05,1.6e-05,1.4e-05,1.3e-05,5e-06,1.3e-05,3e-06,2.6e-05,1e-05,2.8e-05,2.7e-05,1.9e-05,4e-06,2.3e-05,2.1e-05,1.5e-05,2.1e-05,2.6e-05,8e-06,1.1e-05,1.5e-05,1.5e-05,1.4e-05,1e-05,2.3e-05,3e-05,1.5e-05,4e-06,1e-05,4.5e-05,1e-05,2.5e-05,9e-06,1e-05,1.7e-05,7e-06
1.5e-05,2.6e-05,1.7e-05,4e-06,1.9e-05,1.5e-05,2.7e-05,2e-05,4e-06,1.7e-05,1.6e-05,2e-05,1.6e-05,1.2e-05,2.4e-05,2.8e-05,2.6e-05,1.4e-05,1.7e-05,3.2e-05,2.9e-05,3.8e-05,1.8e-05,2.2e-05,1.7e-05,1.7e-05,9e-06,1.3e-05,3.5e-05,6e-06,7e-06,2.6e-05,3.4e-05,2e-05,7e-06,2.5e-05,1.4e-05,1.6e-05,1.3e-05,1.3e-05,8e-06,9e-06,4e-06,1.7e-05,3e-06,1.6e-05,3.3e-05,1.3e-05,3.7e-05,2.1e-05,2.9e-05,1.2e-05,1.5e-05,2.5e-05,1.8e-05,1.7e-05,3.8e-05,2.4e-05,4.7e-05,2.1e-05,2.4e-05,1.8e-05,6e-06,1.3e-05,1.7e-05,2.4e-05,2.2e-05,1.3e-05,3.7e-05,1e-05,2.1e-05,2e-05,1.3e-05,1.8e-05,2.3e-05,3.1e-05,1.9e-05,1.8e-05,8e-06,2e-06,1.3e-05,1.8e-05,5e-06,2.4e-05,2.9e-05,9e-06,6e-06,4e-06,2.2e-05,2.3e-05,1.5e-05,1.8e-05,1.5e-05,1.6e-05,4.9e-05,4e-05,1.2e-05,1.5e-05,2.3e-05,6e-06,2.9e-05,1.7e-05,2.7e-05,3.8e-05,1.7e-05,1.4e-05,1.6e-05,1.7e-05,9e-06,2.9e-05,1.4e-05,4e-06,3e-06,9e-06,1.7e-05,1.5e-05,2e-05,9e-06,1.1e-05,2e-05,1.7e-05
3.3e-05,5e-06,1e-05,2.4e-05,2.2e-05,2.3e-05,4e-06,3.8e-05,2.8e-05,1.4e-05,7e-06,8e-06,4e-06,1.1e-05,1.1e-05,1.4e-05,1.1e-05,1e-05,1.4e-05,2.4e-05,1.4e-05,3.2e-05,1.7e-05,2.1e-05,7e-06,5e-06,1e-05,1.1e-05,2.7e-05,2e-06,1.5e-05,2e-06,1.4e-05,2.2e-05,8e-06,7e-06,2.5e-05,2.4e-05,1.6e-05,9e-06,6e-06,2.8e-05,1.1e-05,1e-05,1e-05,1.3e-05,3.5e-05,1.1e-05,1.6e-05,2.8e-05,6e-06,2.8e-05,3e-05,2.7e-05,2.2e-05,1.7e-05,1.4e-05,1.1e-05,3.8e-05,1.4e-05,4e-06,3e-06,7e-06,1e-05,2.2e-05,1e-05,1.4e-05,1.1e-05,3.3e-05,2.5e-05,1.7e-05,5e-06,9e-06,1.2e-05,2.8e-05,2.1e-05,2.2e-05,1.3e-05,2e-05,1.1e-05,1.7e-05,7e-06,2e-05,2.1e-05,3.6e-05,1.4e-05,1.7e-05,1.1e-05,2.3e-05,1e-05,1.4e-05,5e-06,8e-06,2.2e-05,2.7e-05,2e-05,1.1e-05,9e-06,9e-06,2e-05,2.4e-05,1.6e-05,3.2e-05,1e-05,1.4e-05,2e-06,1.2e-05,1.1e-05,1.7e-05,2.4e-05,2e-06,1.1e-05,3e-06,4e-06,1.3e-05,2.1e-05,1.3e-05,9e-06,1.2e-05,2.2e-05,1.8e-05
3.9e-05,2.1e-05,1.3e-05,2.4e-05,5e-06,1.5e-05,1.8e-05,9e-06,1.5e-05,1.1e-05,1.4e-05,1e-05,1.3e-05,2.4e-05,3e-05,2.9e-05,7e-06,1.7e-05,1.4e-05,3.2e-05,2.2e-05,7e-06,4e-06,2.7e-05,2.4e-05,6e-06,1e-05,9e-06,2.4e-05,2e-05,1.8e-05,2.4e-05,1.2e-05,1.9e-05,2.4e-05,2e-06,1.8e-05,2.6e-05,2.8e-05,2e-05,1.4e-05,3.1e-05,1.8e-05,1.4e-05,1.9e-05,1.5e-05,2.4e-05,1.1e-05,2.8e-05,6e-06,7e-06,2.7e-05,2.2e-05,1e-05,3.2e-05,6e-06,7e-06,2.3e-05,2e-05,3.1e-05,3.4e-05,1.7e-05,1.9e-05,8e-06,3.1e-05,1.4e-05,3.3e-05,3.1e-05,3.3e-05,1.7e-05,6e-06,6e-06,1.6e-05,2.1e-05,3e-05,2.1e-05,5e-06,8e-06,1.3e-05,1.3e-05,8e-06,1.5e-05,1.9e-05,2.9e-05,4e-06,1.7e-05,2.3e-05,2.3e-05,2.5e-05,1.9e-05,2e-05,2e-05,2.4e-05,1.5e-05,1.9e-05,1.7e-05,1.8e-05,2.1e-05,7e-06,2.7e-05,1e-05,3.2e-05,7e-06,2.2e-05,8e-06,9e-06,1e-05,2e-05,3.3e-05,1.9e-05,1.1e-05,1.6e-05,9e-06,8e-06,1.9e-05,5e-06,1.7e-05,4e-06,1.9e-05,1.8e-05,1.4e-05
1.2e-05,3.2e-05,2.3e-05,3.9e-05,1.9e-05,1.5e-05,1e-05,1.1e-05,2.1e-05,3.2e-05,1.2e-05,2.5e-05,1e-05,1.8e-05,3e-05,1.4e-05,7e-06,1.7e-05,1.4e-05,3.6e-05,1.9e-05,2.2e-05,7e-06,1.5e-05,2e-05,1.9e-05,2.6e-05,2.9e-05,3.3e-05,2.1e-05,3.2e-05,1.5e-05,1e-05,1.3e-05,3.1e-05,2.7e-05,8e-06,2.6e-05,3.3e-05,1.9e-05,9e-06,4e-06,1.2e-05,4e-06,6e-06,4e-06,3.2e-05,7e-06,1.7e-05,4.5e-05,4e-06,2.8e-05,2.8e-05,8e-06,2.7e-05,1.4e-05,1e-05,2e-05,3e-05,2.6e-05,2.7e-05,1e-05,1.2e-05,1.2e-05,3.1e-05,1.3e-05,4.6e-05,1.2e-05,2.4e-05,1.8e-05,1.3e-05,2e-05,1.4e-05,2.7e-05,1.1e-05,1e-05,8e-06,6e-06,1.8e-05,1.1e-05,2.5e-05,2.3e-05,1.1e-05,2.9e-05,2e-05,1.3e-05,2.5e-05,4e-06,1.1e-05,1.8e-05,2.1e-05,1.3e-05,2.6e-05,7e-06,3.7e-05,3e-05,9e-06,1.7e-05,1.4e-05,2.4e-05,3.4e-05,3.6e-05,8e-06,1.4e-05,2.1e-05,8e-06,1.7e-05,1.2e-05,1.6e-05,1.7e-05,1.8e-05,1.7e-05,8e-06,6e-06,1e-06,3.1e-05,2.8e-05,1.5e-05,1.8e-05,1.8e-05,3.2e-05
2.7e-05,1.5e-05,1.6e-05,9e-06,2.2e-05,2.4e-05,1.7e-05,2.1e-05,7e-06,3.1e-05,3.5e-05,2e-05,3.3e-05,2.8e-05,1.2e-05,3.5e-05,4e-05,2.3e-05,1.3e-05,1.7e-05,3.1e-05,5.6e-05,3.5e-05,1.4e-05,2.4e-05,1e-05,3e-05,3e-05,3.7e-05,8e-06,3.2e-05,8e-06,8e-06,2.2e-05,1.9e-05,8e-06,1.8e-05,2.9e-05,4.2e-05,1.3e-05,2.5e-05,5.2e-05,1.8e-05,1.8e-05,1.2e-05,1.5e-05,2.9e-05,1.1e-05,1.9e-05,4e-05,5.5e-05,3.4e-05,3.6e-05,1.3e-05,1.3e-05,1.7e-05,2.3e-05,3.2e-05,3.5e-05,2.3e-05,3e-05,2.7e-05,1.9e-05,2.4e-05,1.3e-05,2e-05,1.5e-05,3.6e-05,5.6e-05,5.1e-05,3.4e-05,3e-05,2.6e-05,2.7e-05,3.9e-05,2.9e-05,2.8e-05,1.1e-05,1.2e-05,1.8e-05,2.4e-05,3.2e-05,4e-06,3.7e-05,3.2e-05,3.2e-05,2.2e-05,2.3e-05,1.5e-05,4e-06,7e-06,1.3e-05,1.3e-05,3.3e-05,4.8e-05,3.2e-05,1.9e-05,3e-06,0,1.1e-05,1.3e-05,4.4e-05,2.9e-05,1.7e-05,3.5e-05,2.6e-05,1.6e-05,1.6e-05,7e-06,9e-06,3.3e-05,2.1e-05,1.4e-05,8e-06,1.5e-05,1.8e-05,3.1e-05,2.4e-05,1.3e-05,1e-05,2e-05
2e-05,2e-05,1.8e-05,2.5e-05,3.1e-05,1.7e-05,1.1e-05,2.8e-05,1.7e-05,2.8e-05,8e-06,1e-05,1.8e-05,2.4e-05,1e-05,2e-05,2.4e-05,9e-06,1.3e-05,1.6e-05,4.1e-05,5e-06,1.2e-05,1.1e-05,2.8e-05,1.8e-05,1.8e-05,2.4e-05,1e-05,1.4e-05,1.1e-05,9e-06,1.6e-05,1.1e-05,2.8e-05,9e-06,1.8e-05,1.1e-05,9e-06,1.8e-05,2.2e-05,3.1e-05,9e-06,1.3e-05,2e-05,2.5e-05,8e-06,2.3e-05,3.8e-05,9e-06,3.7e-05,1.2e-05,3.3e-05,1.4e-05,3e-06,1.6e-05,3.8e-05,4.1e-05,3.5e-05,1.4e-05,3.5e-05,2.7e-05,6e-06,9e-06,1.1e-05,7e-06,2.1e-05,1.3e-05,4.6e-05,2.8e-05,8e-06,1.8e-05,1.1e-05,7e-06,2.3e-05,1.6e-05,1.6e-05,1.7e-05,1e-05,2e-05,1.1e-05,6e-06,1.7e-05,2.2e-05,2.8e-05,2.9e-05,2e-05,1.9e-05,2.5e-05,2.6e-05,1.8e-05,2.5e-05,4e-06,2.4e-05,2.6e-05,1.4e-05,3e-06,1.2e-05,7e-06,3e-06,2.1e-05,3.2e-05,1.5e-05,1.6e-05,4.1e-05,3.5e-05,3.1e-05,1.1e-05,1e-05,1.5e-05,2.8e-05,5e-06,2.3e-05,2e-05,1.7e-05,2.6e-05,4.1e-05,2.3e-05,4e-06,1.5e-05,2.6e-05
4.5e-05,2.1e-05,7e-06,2.5e-05,8e-06,7e-06,4e-06,2.4e-05,1.6e-05,8e-06,1.3e-05,1.4e-05,8e-06,9e-06,1.1e-05,1e-05,1e-05,5e-06,2.5e-05,6e-06,2.8e-05,3.3e-05,1.4e-05,1.9e-05,1.2e-05,1e-05,1.9e-05,2.1e-05,2.8e-05,1.1e-05,2.3e-05,2e-05,1.5e-05,8e-06,2.7e-05,1.4e-05,3e-06,1.8e-05,2e-05,8e-06,1.5e-05,1.2e-05,4e-06,6e-06,1.1e-05,7e-06,2e-05,5e-06,1.6e-05,1e-05,2.1e-05,2.8e-05,1.4e-05,7e-06,1.5e-05,5e-06,1.4e-05,2.9e-05,3.7e-05,1.2e-05,1.1e-05,1.4e-05,4e-06,6e-06,1e-05,1.1e-05,2.6e-05,1.1e-05,2.7e-05,7e-06,6e-06,8e-06,1.7e-05,8e-06,2.1e-05,1.9e-05,2.6e-05,8e-06,4e-06,8e-06,1.1e-05,1.1e-05,2.5e-05,1.7e-05,2.1e-05,1.4e-05,1.4e-05,7e-06,1.6e-05,1.5e-05,1.1e-05,2.7e-05,1.5e-05,2e-05,2.3e-05,1.5e-05,1.3e-05,1.6e-05,1.7e-05,7e-06,3.5e-05,1.3e-05,1.3e-05,2.5e-05,1.8e-05,4e-06,1.1e-05,1.1e-05,1e-05,1.1e-05,2.3e-05,1.9e-05,1.9e-05,6e-06,2.9e-05,1.9e-05,1.3e-05,1e-05,5e-06,2.3e-05,3e-06
1.7e-05,3.5e-05,2.3e-05,3e-05,2.4e-05,1.6e-05,1.1e-05,1.9e-05,2.9e-05,2.3e-05,9e-06,7e-06,9e-06,1.4e-05,2.3e-05,1.7e-05,7e-06,5e-06,2.2e-05,2.3e-05,1e-05,3.8e-05,1.3e-05,1.8e-05,9e-06,9e-06,2.6e-05,2.1e-05,7e-06,2e-05,3.4e-05,2.4e-05,1.3e-05,1.6e-05,2.4e-05,7e-06,6e-06,2.2e-05,2.7e-05,1.7e-05,1.6e-05,1.4e-05,1.3e-05,1e-05,5e-06,1.9e-05,3.1e-05,1.6e-05,1.5e-05,7e-06,2e-06,1.5e-05,1.4e-05,1.5e-05,2.3e-05,6e-06,4e-06,1e-05,2.4e-05,2.2e-05,1.9e-05,8e-06,5e-06,1.4e-05,3e-06,1.5e-05,7e-06,2e-06,1.8e-05,7e-06,1.7e-05,1.9e-05,1.8e-05,1.4e-05,9e-06,1e-05,1.5e-05,1e-05,1e-06,8e-06,1.8e-05,1.3e-05,1.1e-05,7e-06,1.1e-05,1.1e-05,2e-06,1.1e-05,1e-05,1.7e-05,3.1e-05,2.1e-05,2.3e-05,1.2e-05,1.9e-05,2e-05,1.2e-05,1.3e-05,1.2e-05,1.4e-05,3.3e-05,2.8e-05,1.9e-05,2.6e-05,2.8e-05,1.5e-05,5e-06,6e-06,1.3e-05,6e-06,8e-06,1.2e-05,2e-05,1.6e-05,1.7e-05,5e-06,5e-06,7e-06,7e-06,1.7e-05,2e-05
8e-06,3.1e-05,2.2e-05,1.2e-05,5e-06,1.2e-05,3e-06,1e-05,1.1e-05,7e-06,1.1e-05,4e-06,1.3e-05,1.5e-05,1.5e-05,2e-06,8e-06,5e-06,1.4e-05,2.2e-05,1.7e-05,1.7e-05,2.5e-05,1.1e-05,6e-06,3e-06,1.5e-05,1.7e-05,3.5e-05,4e-06,3.2e-05,4e-06,5e-06,8e-06,1.1e-05,9e-06,1.7e-05,6e-06,2.5e-05,3e-06,9e-06,2.1e-05,1.5e-05,9e-06,1.3e-05,1.5e-05,2e-06,2.2e-05,2.1e-05,2.9e-05,2.6e-05,2e-05,2.1e-05,1.5e-05,2.1e-05,1.6e-05,1.2e-05,1.8e-05,2.2e-05,1.2e-05,4e-06,9e-06,3e-06,7e-06,1.2e-05,1.3e-05,1.7e-05,1e-05,1.3e-05,2e-06,1.9e-05,3e-06,1.5e-05,1.7e-05,2.2e-05,1.8e-05,5e-06,9e-06,9e-06,1.6e-05,1.6e-05,1.5e-05,9e-06,1e-05,2.2e-05,4e-06,6e-06,8e-06,8e-06,4e-06,1.9e-05,1.4e-05,8e-06,1e-06,1.9e-05,2e-05,2e-05,1.1e-05,1.7e-05,1.4e-05,9e-06,1.4e-05,1.1e-05,1e-05,5e-06,2e-06,7e-06,3e-06,8e-06,7e-06,1.7e-05,2e-06,1e-06,1e-05,2.3e-05,1.1e-05,6e-06,2e-06,1e-06,1.1e-05,2e-05
1.1e-05,2.2e-05,1.3e-05,8e-06,1e-06,4e-06,4e-06,5e-06,5e-06,1e-06,5e-06,3e-06,9e-06,0,5e-06,1.1e-05,2e-06,4e-06,1.5e-05,1.8e-05,1.6e-05,7e-06,9e-06,9e-06,3e-06,1e-06,9e-06,6e-06,2.5e-05,1e-05,1.9e-05,3e-06,8e-06,7e-06,1.2e-05,6e-06,1.2e-05,8e-06,1.2e-05,4e-06,1.4e-05,2.2e-05,8e-06,4e-06,1e-06,1.5e-05,1.4e-05,8e-06,9e-06,1.6e-05,1.7e-05,1.1e-05,1.5e-05,6e-06,8e-06,6e-06,5e-06,1.8e-05,2.4e-05,6e-06,1e-05,3e-06,2e-06,2e-06,5e-06,1.6e-05,1.1e-05,1e-06,1.6e-05,5e-06,1.1e-05,8e-06,1.6e-05,1.3e-05,1.4e-05,1.6e-05,2e-06,6e-06,2e-06,1.2e-05,9e-06,8e-06,1.5e-05,1e-05,1.1e-05,4e-06,3e-06,7e-06,6e-06,8e-06,8e-06,8e-06,1e-06,5e-06,1.7e-05,1.8e-05,1.2e-05,2e-06,8e-06,8e-06,1.3e-05,1.4e-05,8e-06,3e-06,3e-06,3e-06,2e-06,2e-06,7e-06,2e-06,1.3e-05,5e-06,5e-06,5e-06,2.1e-05,1e-05,6e-06,3e-06,3e-06,7e-06,1e-05
7e-06,1.4e-05,1e-05,1e-05,7e-06,6e-06,5e-06,4e-06,2e-06,2e-06,5e-06,4e-06,7e-06,3e-06,1e-06,6e-06,4e-06,6e-06,1.5e-05,1.8e-05,1.2e-05,1.1e-05,6e-06,9e-06,1e-06,5e-06,8e-06,3e-06,2.6e-05,9e-06,1.9e-05,2e-06,9e-06,5e-06,1.1e-05,3e-06,1e-05,6e-06,1.3e-05,2e-06,1.2e-05,1.8e-05,8e-06,3e-06,5e-06,1.3e-05,1.5e-05,6e-06,5e-06,1.4e-05,1.5e-05,1.5e-05,1.1e-05,4e-06,7e-06,1e-06,7e-06,1.7e-05,2.2e-05,3e-06,9e-06,7e-06,3e-06,2e-06,7e-06,1.3e-05,9e-06,2e-06,1.6e-05,4e-06,7e-06,3e-06,1.5e-05,1.1e-05,1e-05,1.5e-05,2e-06,3e-06,2e-06,1.2e-05,8e-06,7e-06,1.3e-05,6e-06,1.1e-05,2e-06,1e-06,7e-06,2e-06,5e-06,6e-06,7e-06,7e-06,2e-06,2e-05,1.5e-05,9e-06,2e-06,7e-06,5e-06,1e-05,1.5e-05,1e-05,1e-06,5e-06,3e-06,1e-06,2e-06,6e-06,1e-06,1.2e-05,4e-06,3e-06,4e-06,2e-05,1e-05,1e-05,3e-06,2e-06,6e-06,4e-06
9e-06,1.4e-05,1e-05,8e-06,6e-06,6e-06,3e-06,4e-06,3e-06,3e-06,5e-06,3e-06,6e-06,3e-06,2e-06,7e-06,5e-06,6e-06,1.5e-05,1.8e-05,1.2e-05,9e-06,7e-06,7e-06,1e-06,4e-06,7e-06,0,2.6e-05,1e-05,1.8e-05,3e-06,7e-06,6e-06,1.1e-05,2e-06,1e-05,6e-06,1.2e-05,2e-06,1.1e-05,2e-05,9e-06,5e-06,2e-06,1.1e-05,1.6e-05,3e-06,3e-06,1.4e-05,1.4e-05,1.3e-05,1.1e-05,2e-06,9e-06,0,9e-06,1.8e-05,2.1e-05,1e-06,8e-06,6e-06,2e-06,0,7e-06,1.2e-05,9e-06,3e-06,1.6e-05,2e-06,4e-06,3e-06,1.4e-05,1.1e-05,1e-05,1.4e-05,2e-06,3e-06,1e-06,1.2e-05,8e-06,6e-06,1.2e-05,7e-06,1.2e-05,1e-06,1e-06,6e-06,0,5e-06,6e-06,5e-06,6e-06,3e-06,1.9e-05,1.7e-05,7e-06,1e-06,6e-06,3e-06,1e-05,1.6e-05,7e-06,1e-06,4e-06,2e-06,2e-06,2e-06,6e-06,2e-06,1e-05,6e-06,5e-06,3e-06,1.8e-05,7e-06,7e-06,2e-06,2e-06,3e-06,4e-06
