4e-06,7e-06,1e-06,1e-06,4e-06,-0.000126,-0.010964,-0.018385,-0.00305,-0.004023,-0.079461,-0.207238,-0.211103,-0.154988,-0.161233,-0.142981,-0.118537,-0.091017,-0.039138,-0.014182,-0.003257,-0.005052,-0.004245,-0.000533,-0.000427,-0.000315,-5.4e-05,-6e-06
-1e-05,0,-1e-05,-1.8e-05,-7e-06,9.6e-05,-9.5e-05,-0.0048,-0.001816,0.001263,0.040589,0.0191,0.030787,0.084832,0.064342,0.099178,0.11075,0.090178,0.038547,0.016251,0.003554,-0.004924,-0.005437,-0.000379,0.000293,0.00128,0.000236,1.2e-05
-1.1e-05,-3e-06,-1.2e-05,-2.1e-05,-9e-06,-3.8e-05,0.000382,0.002223,-4e-05,-0.001264,0.009191,0.006659,-0.012169,-0.010261,-0.016058,-0.022746,-0.006444,0.003261,-0.004097,-0.004158,-0.000497,-0.0019,-0.002131,9.8e-05,-0.000217,-0.001018,-0.000161,4e-06
2e-06,1e-06,-4e-06,-9e-06,-4e-06,-5.1e-05,0.00253,0.007842,0.001474,-0.002991,-0.061766,-0.062629,-0.067631,-0.107622,-0.087205,-0.104042,-0.117107,-0.096968,-0.037943,-0.014919,-0.00386,0.000909,0.001549,0.000324,0.000239,2e-06,-2.9e-05,3e-06
1.7e-05,5e-06,8e-06,1e-05,7e-06,0.000131,0.005314,0.006796,0.001207,0.001386,0.02852,0.140129,0.183795,0.128402,0.142245,0.138564,0.103089,0.075463,0.038623,0.016144,0.003602,0.003179,0.003149,0.000172,0.000262,0.000903,0.000203,1.8e-05
2e-05,5e-06,1.2e-05,1.9e-05,9e-06,-2.9e-05,-0.006094,-0.011021,-0.001194,0.000787,0.030187,0.07384,0.083828,0.080892,0.064944,0.044748,0.051541,0.049264,0.014221,0.001721,0.001072,0.000457,0.000182,-0.000195,-0.000505,-0.000999,-0.000169,8e-06
1.1e-05,2e-06,9e-06,1.6e-05,6e-06,-0.000102,-0.005295,-0.007726,-0.001627,-0.003808,-0.062543,-0.192379,-0.217934,-0.140782,-0.148601,-0.141516,-0.120517,-0.104209,-0.045477,-0.015348,-0.004374,-0.002843,-0.002855,-0.000265,4.4e-05,0.000256,2.7e-05,1e-06
-3e-06,-2e-06,0,3e-06,3e-06,9.1e-05,0.006898,0.010048,0.000267,-0.00044,-0.002414,-0.051511,-0.046086,-0.014838,-0.013415,0.032344,0.035627,0.019884,0.014018,0.00962,0.00079,-0.000842,-0.001061,7.4e-05,0.000288,0.000556,0.000124,7e-06
-1.4e-05,-5e-06,-1e-05,-1.3e-05,-7e-06,1.1e-05,0.002444,0.00457,0.000582,0.001693,0.056178,0.137304,0.134608,0.078432,0.071608,0.061678,0.072291,0.075872,0.024843,0.004437,0.001388,0.001533,0.00174,0.00021,-0.000157,-0.000719,-0.000125,8e-06
-1.1e-05,-4e-06,-1.2e-05,-1.8e-05,-1e-05,-6.3e-05,-0.002714,-0.002945,0.00018,-0.000511,-0.018995,0.006959,-0.01611,-0.05073,-0.031221,-0.072483,-0.084463,-0.067318,-0.0265,-0.010204,-0.003259,-0.000571,0.001093,-2e-06,2.9e-05,0.000301,3.6e-05,4e-06
1e-06,0,-5e-06,-9e-06,-4e-06,4.6e-05,-9.1e-05,-0.001702,9e-06,-1e-05,-0.019411,-0.023761,-5e-06,0.001116,0.010103,0.023076,0.002566,-0.012996,0.00378,0.006996,-4.8e-05,-0.0019,-0.000426,-3.8e-05,-1.4e-05,0.000177,5.4e-05,5e-06
1.4e-05,5e-06,5e-06,8e-06,8e-06,1e-06,-0.00223,-0.003665,-9.8e-05,0.001508,0.038388,0.043965,0.064826,0.086691,0.059665,0.064199,0.074429,0.074608,0.022548,0.00379,0.001544,0.000174,-0.000303,4.5e-05,-5.1e-05,-0.000378,-5.7e-05,9e-06
1.8e-05,5e-06,1.1e-05,1.9e-05,1.2e-05,-6.8e-05,-0.001405,-0.000634,-0.000147,-8.1e-05,-0.005517,-0.066435,-0.103436,-0.050956,-0.058921,-0.067785,-0.059484,-0.046435,-0.023568,-0.010383,-0.002472,-0.000531,-0.000954,-7.2e-05,0.000127,0.000267,3.3e-05,8e-06
9e-06,0,7e-06,1.6e-05,1e-05,6.9e-05,0.004922,0.006462,1.8e-05,-0.000879,-0.033829,-0.071709,-0.072164,-0.073372,-0.058317,-0.023855,-0.028419,-0.045085,-0.008861,0.003184,-0.001064,-0.00207,-0.001164,-9.1e-05,-5.3e-05,4.3e-05,2.4e-05,-2e-06
-6e-06,-7e-06,-4e-06,1e-06,-1e-06,2.1e-05,0.000161,-0.000503,2.9e-05,0.001048,0.0239,0.104754,0.138061,0.066145,0.063016,0.068164,0.077483,0.072588,0.025964,0.004239,0.001081,-0.000473,0.000323,1.7e-05,-0.000119,-0.000298,-5.9e-05,-2e-06
-1.5e-05,-1.2e-05,-1.3e-05,-1.4e-05,-1.2e-05,-5.6e-05,-0.002906,-0.003143,0.000318,0.000364,0.011139,0.064951,0.047882,0.015909,0.025697,-0.01675,-0.026572,-0.005267,-0.004938,-0.006116,-0.001045,-6.1e-05,0.000481,6.2e-05,0.000122,0.000269,3.5e-05,0
-1.3e-05,-1.1e-05,-1.4e-05,-2e-05,-1.7e-05,1.1e-05,0.000621,0.001032,0.000381,-0.000578,-0.038389,-0.090634,-0.095975,-0.056282,-0.046535,-0.041917,-0.05433,-0.058497,-0.013892,0.002891,-0.000239,-0.000924,-0.000596,1.1e-05,5e-06,-6.8e-05,-7e-06,-8e-06
-1e-06,-7e-06,-7e-06,-1.4e-05,-1.4e-05,3e-06,0.000187,2.2e-05,2e-06,0.001006,0.007827,-0.030222,0.00291,0.052199,0.021257,0.03684,0.060437,0.046326,0.011376,0.002868,0.001436,0.000565,-0.000133,-4e-05,-2e-05,-4.6e-05,-3e-06,-2e-06
1.1e-05,-1e-06,2e-06,-1e-06,-6e-06,-3.1e-05,-0.000752,-0.001456,-0.000708,-3.7e-05,0.030354,0.034902,0.016232,0.0312,0.020353,0.00029,0.005227,0.02023,-0.001149,-0.006098,-0.001068,-0.000187,-0.000189,-9.2e-05,-4.3e-05,-1.5e-05,-1.6e-05,6e-06
