0.000213,5.7e-05,1e-05,0.000144,0.000333,0.000387,0.000555,0.000269,0.000433,1e-06,2.8e-05,3.2e-05,0.000275,2e-05,2.5e-05,0.000198,0.000165,7.6e-05,0.000118,7e-05,1.7e-05,3.9e-05,6e-06,0.000404,0.000251,0.000103,0.000197,4.9e-05,6.6e-05,0.000216,7.7e-05,0.000105,8e-06,8e-05,0.000178,1e-05,0.000468,1.9e-05,6e-06,1.2e-05,0.000401,0.000236,0.00019,2.9e-05,0.000509,3e-06,0.000378,0.000106,3.4e-05,0.00016,0.000442,0.000231,3e-05,0.000155,7.7e-05,0.000152,9.6e-05,8.4e-05,0.000173,0.000479,0.000322,4.6e-05,3.2e-05,0.000146,7e-05,8.8e-05,1e-05,0.000128,9.5e-05,0.000105,0.000387,6.7e-05,0.000483,0.000184,0.000256,0.000559,0.00031,0.000768,5.1e-05,0.000252,2e-04,5e-06,2.1e-05,1.7e-05,0.00015,0.000244,0.000118,0.000128,0.000211,4e-06,0.000326,0.000356,2.8e-05,0.000114,0.000187,0.000113,6.8e-05,1.1e-05,0.000265,6.6e-05,0.000221,6.8e-05,0.000234,0.000223,0.000214,5e-05,0.000105,0.000293,1.8e-05,0.00031,8.4e-05,4.3e-05,8.1e-05,4e-06,5.3e-05,0.000223,6.4e-05,0.000183,0.00034,0.000206,0.000152
0.000292,0.000381,0.000359,0.000656,0.000717,0.000457,0.000977,0.000682,0.001073,0.000195,0.000309,0.00014,0.000496,0.000168,0.000198,5e-04,0.000171,0.000238,0.000134,0.000371,0.000492,0.000374,2e-04,0.000623,0.000528,7.9e-05,0.000601,0.000206,0.000196,0.000273,0.000746,0.000639,0.000197,0.000116,5.4e-05,0.000357,0.001003,0.000222,0.000245,0.000235,0.000921,0.000597,0.000456,0.00019,0.00098,9.8e-05,0.000644,0.000316,9.1e-05,0.000464,0.000783,0.000572,7.5e-05,0.000443,0.000295,0.000253,2e-04,0.000163,0.000316,0.001091,0.000777,1.6e-05,9.7e-05,0.00039,0.000121,0.000253,7.5e-05,0.000295,0.000253,0.000184,0.000806,7.8e-05,0.001123,0.000493,0.000357,0.001005,0.000742,0.001559,0.000113,0.000574,0.000312,0.000184,0.00012,0.000273,0.000255,0.000162,0.000276,0.000331,0.000507,7.8e-05,0.000814,0.000958,0.000232,0.000299,0.000365,0.000198,0.000315,8.7e-05,0.000649,6.9e-05,0.000436,1e-04,0.000514,0.000378,0.000348,6.4e-05,0.000328,0.000708,0.000109,0.000723,0.000324,0.000197,0.00023,0.000111,0.000112,0.000504,2.7e-05,0.000386,0.000833,0.000439,0.000358
0.000477,0.000502,0.000632,0.00024,0.001062,0.000885,0.001244,0.000594,0.000636,2.3e-05,0.000369,0.000499,0.000986,0.000547,0.000445,0.000789,0.00085,9.2e-05,0.000188,0.000506,0.000417,0.000558,0.00012,0.00069,0.00066,0.000382,0.000501,0.000287,0.000304,0.00042,0.000957,0.000287,0.000314,0.000393,0.00048,5.7e-05,0.000625,0.000345,0.000155,0.000425,0.000886,0.000845,0.000979,0.000593,0.000738,0.000163,0.000763,0.000774,0.000417,7.6e-05,0.001157,0.000652,0.000344,0.000659,0.000132,0.000506,0.000209,0.000177,0.000394,0.001162,0.000464,0.000133,2.1e-05,0.000481,0.000416,0.000384,0.000269,0.000154,0.000226,0.00021,0.000992,0.000413,0.001184,0.000654,0.000808,0.001289,0.000815,0.002054,0.000412,0.000672,0.000512,0.000172,6.8e-05,0.000377,0.000477,0.000686,0.000375,0.000428,0.000624,0.000275,0.000719,0.000829,0.000141,0.000141,0.000327,0.000281,0.000253,0.000316,0.000727,0.000352,0.000489,0.000175,0.000772,0.000686,0.000487,0.000518,0.00019,0.000676,0.000214,0.000689,0.000456,0.000436,0.000309,0.000409,0.000163,0.000449,0.000126,0.000555,0.00094,0.000348,0.000684
0.000242,0.000204,0.001145,0.000948,0.000901,7e-04,0.001124,0.000688,0.000904,0.000604,0.000866,0.000668,0.001014,0.000427,0.001052,4.5e-05,0.000881,0.00044,0.000682,0.000247,0.000825,0.000877,0.000487,0.00091,0.000558,0.000742,0.000764,0.000476,0.000961,0.001427,0.000553,0.001071,0.000621,0.001056,0.000462,0.000403,0.000707,0.000213,0.000209,0.000764,0.000952,0.001413,0.000552,0.00031,0.001134,0.00079,0.001094,0.00042,0.000126,0.000706,0.001423,0.001008,0.001124,0.001218,0.000932,0.000242,0.000377,0.000607,0.000642,0.001092,0.000816,0.000337,0.00034,0.000705,0.000941,0.000346,0.000629,0.000389,0.000218,0.000368,0.001067,0.000972,0.00213,0.000456,0.001021,0.001669,0.000753,0.002251,0.000421,0.000493,0.000347,0.000513,0.000217,0.000927,0.000385,0.001356,0.000492,0.000543,0.000836,0.000363,0.000971,0.000338,0.000308,0.00062,0.000555,0.000394,0.000357,0.000452,0.000102,0.000229,0.000703,0.000454,0.00044,0.000839,0.001087,0.000551,0.000411,0.000631,0.000463,0.001357,0.00047,0.000631,0.000346,0.000527,0.000222,0.000518,0.000627,0.000889,0.001079,0.000409,0.000549
0.000585,0.002365,0.000357,0.002378,0.000218,0.001983,0.001293,0.000211,0.000948,0.001758,0.000862,0.001021,0.001158,0.001106,0.001007,0.000901,0.001523,0.000788,0.001943,0.001094,0.001445,0.000844,4.1e-05,0.00075,0.001337,0.001033,0.000773,0.000472,0.002156,0.001742,0.000658,0.000241,0.000534,0.001164,0.001554,0.000745,0.001279,0.000643,0.001347,0.001178,0.000847,0.001567,0.001323,0.001387,0.001943,0.001072,0.002655,0.000766,0.000992,0.000596,0.001152,0.000713,0.00177,0.001203,0.000951,0.000612,0.00201,0.001516,0.000981,0.000569,0.000788,0.001665,0.001254,0.001409,0.001114,0.001569,0.001536,0.001654,0.001192,0.000603,0.000926,0.000996,0.002338,0.002036,0.001133,0.002531,0.001339,0.002773,0.001919,0.000986,0.000888,0.001183,0.000207,0.000777,0.002109,0.001233,0.00072,0.001357,0.001071,0.000706,0.001557,0.002638,0.002234,0.001385,0.000769,0.000964,0.000794,0.000889,0.001047,0.000266,0.000651,0.001271,0.00106,0.001219,0.000952,0.000933,0.000641,0.001309,0.001109,0.000827,0.00216,0.00153,0.001218,0.000977,6.4e-05,0.000899,0.001322,0.00179,0.002313,0.000328,0.001479
0.002393,0.003292,0.001926,0.004088,0.003426,0.003165,0.001704,0.000818,0.000389,0.002358,0.002779,0.003185,0.001215,0.002039,0.001381,0.003663,0.002601,0.001279,0.002646,0.001451,0.001506,0.002155,0.002365,0.001431,0.001714,0.00096,0.001413,0.001193,0.003812,0.001364,0.000419,0.000927,0.001362,0.001758,0.001037,0.001897,0.002304,0.001126,0.001468,0.001837,0.002026,0.000566,0.001592,0.001371,0.001537,0.00217,0.002362,0.000561,0.002338,0.002047,0.002927,0.00161,0.002645,0.002817,0.001921,0.002498,0.001883,0.002337,0.000232,0.002241,0.002281,0.001203,0.001923,0.00173,0.003135,0.001817,0.000887,0.002933,0.000747,0.001389,0.001884,0.004762,0.001632,0.000522,0.000246,0.002357,0.002793,0.003888,0.002317,0.001765,0.00153,0.002039,0.001466,0.000241,0.00225,0.002386,0.000537,0.002,0.002537,0.001922,0.003465,0.003885,0.001639,0.001656,0.000623,0.00218,0.002379,0.002411,0.001583,0.0011,0.000958,0.001321,0.002856,0.00309,0.00215,0.000145,0.00149,0.002215,0.00133,0.002168,0.003453,0.001293,0.002726,0.000902,0.000342,0.001319,0.002152,0.000902,0.000814,0.002015,0.003355
0.006956,0.007751,0.003039,0.003725,0.001245,0.001681,0.0055,0.004079,0.003428,0.000826,0.001948,0.002116,0.004472,0.004458,0.002707,0.005986,0.00119,0.001279,0.003202,0.001499,0.002638,0.000791,0.002489,0.001716,0.000717,0.003094,0.001871,0.002963,0.006878,0.003523,0.001585,0.002303,0.002293,0.002306,0.003161,0.001629,0.001816,0.000338,0.001833,0.006041,0.006395,0.004865,0.003663,0.002397,0.001493,0.000759,0.005739,0.005058,0.005741,0.00026,0.003469,0.007267,0.002194,0.004269,0.0052,0.003193,0.00524,0.005974,0.003354,0.005221,0.004638,0.003359,0.001893,0.001812,0.00321,0.002032,0.001547,0.003659,0.001805,0.000693,0.003213,0.003267,0.003697,0.003375,0.001927,0.002278,0.000422,0.002316,0.002125,0.001689,0.001322,0.00192,0.004025,0.003132,0.002793,0.001686,0.003407,0.001307,0.00135,0.000926,0.003122,0.004966,0.003695,0.003161,0.003865,0.002383,0.003009,0.003435,0.002955,0.001621,0.002994,0.00254,0.003214,0.005885,0.003568,0.003145,0.001216,0.002854,0.00502,0.0027,0.000185,0.002582,0.004242,0.004801,0.001828,0.002553,0.002529,0.00259,0.002742,0.003563,0.001722
0.004745,0.000675,0.004724,0.000459,0.005848,0.004175,0.006732,0.00457,0.001701,0.003431,0.002124,0.004836,0.006598,0.004978,0.00268,0.006585,0.00838,0.003179,0.002098,0.001182,0.004056,0.003997,0.002506,0.003855,0.003287,0.003156,0.0046,0.004542,0.003405,0.004653,0.002843,0.002126,0.001096,0.003462,0.002786,0.004755,0.005933,0.004023,0.002466,0.005509,0.004297,6.2e-05,0.003512,0.003123,0.001118,0.002468,0.006149,0.005791,0.002712,0.007085,0.001889,0.007332,0.008073,0.000519,0.0025,0.000946,0.003661,0.007455,0.005301,0.003226,0.005404,0.003567,0.001378,0.00196,0.002654,0.003162,0.003098,0.007411,0.006564,0.003944,0.003254,0.006527,0.002462,0.002887,0.005288,0.006663,0.006216,0.000931,0.00546,0.002503,0.003715,0.001793,0.003486,0.002068,0.001096,0.00247,0.004908,0.002916,0.001961,0.002173,0.002989,0.007334,0.009341,0.003993,0.004248,0.007159,0.008801,0.003148,0.002961,0.002271,0.004773,0.002652,0.002154,0.003741,0.003661,0.002958,0.001354,0.003726,0.004244,0.004075,0.003175,0.004376,0.00361,0.002222,0.002826,0.002565,0.00355,0.003464,0.00531,0.00184,0.003064
0.00271,0.002819,0.005931,0.007145,0.010204,0.009375,0.003026,0.001556,0.004086,0.004728,0.003401,0.00544,0.001915,0.001354,0.001693,0.004453,0.009059,0.005282,0.002975,0.002275,0.00511,0.006155,0.006316,0.001149,0.003071,0.004778,0.002344,0.002636,0.006422,0.00724,0.003783,0.003152,0.004315,0.004083,0.004002,0.005728,0.007621,0.004807,0.002701,0.004316,0.002452,0.001741,0.000807,0.001042,0.00191,0.002888,0.003923,0.001334,0.003775,0.005964,0.004646,0.002265,0.003264,0.004422,0.005548,0.004424,0.00313,0.005655,0.00265,0.003694,0.001397,0.001338,0.002839,0.00459,0.002989,0.002311,0.00154,0.006004,0.004984,0.002253,0.003283,0.002429,0.004681,0.004005,0.002853,0.002278,0.005833,0.006133,0.009096,0.006269,0.004481,0.003159,0.003268,0.002921,0.001979,0.002715,0.004227,0.005084,0.002987,0.002424,0.005123,0.004472,0.002133,0.002668,0.004797,0.004306,0.003781,0.002525,0.001677,0.001343,0.005086,0.002239,0.001765,0.002555,0.001014,0.002796,0.002376,0.002229,0.003683,0.002656,0.002842,0.001889,0.001492,0.002621,0.00327,0.00162,0.002836,0.002715,0.001325,0.003741,0.003863
0.003896,0.004487,0.000946,0.002854,0.003735,0.001226,0.00025,0.00385,0.001346,0.002268,0.002345,0.002106,0.003823,0.001783,0.00028,0.003776,0.003786,0.002363,0.00175,0.001325,0.002956,0.003009,0.001936,0.001274,0.002223,0.002295,0.003705,0.00097,0.004454,0.00203,0.003275,0.004388,0.002138,0.001054,0.002105,0.001314,0.003054,0.001059,0.002155,0.002776,0.002468,0.001558,0.000543,0.001817,0.004447,0.003161,0.001762,0.001681,0.001213,0.003951,0.002663,0.001893,0.002742,0.001957,0.002752,0.001287,0.000815,0.002359,0.002557,0.002663,0.00185,0.00145,0.001223,0.002892,0.002494,0.001266,0.001354,0.003706,0.000997,0.000249,0.002781,0.00484,0.003269,0.001936,0.000237,0.002017,0.003091,0.00173,0.004679,0.00149,0.001437,0.002232,0.001576,0.002159,0.000661,0.002622,0.000113,0.002186,0.003045,0.002639,0.002128,0.001242,0.000541,0.001299,0.003605,0.001938,0.001544,0.001449,0.001432,0.000613,0.002474,0.002252,0.003127,0.001097,0.001679,0.002005,0.001038,0.003249,0.003345,0.003244,0.002065,0.00186,0.001219,0.001092,0.00219,0.001745,0.002129,0.001631,0.00073,0.004104,0.00111
0.005103,0.002628,0.000969,0.001204,0.00258,0.001785,0.000723,0.003029,0.003242,0.001255,0.003158,0.004277,0.003148,0.001922,0.001809,0.002958,0.003046,0.003006,0.001206,0.002054,0.002799,0.001387,0.002519,0.002443,0.001764,0.001309,0.000321,0.00076,0.003614,0.002412,0.00241,0.002719,0.001249,0.000255,0.001975,0.002261,0.000408,0.000748,0.002209,0.00408,0.001426,0.001074,0.001254,0.00245,0.002858,0.003125,0.004855,0.002991,0.001951,0.002827,0.002106,0.000927,0.000895,0.000558,0.002444,0.002285,0.000533,0.000551,0.003174,0.001663,0.001399,0.000518,0.000673,0.000682,0.000885,0.000771,0.000729,0.001955,0.001207,0.000831,0.00143,0.003917,0.003358,0.003382,0.002926,0.002936,0.001728,0.00364,0.001621,0.003159,0.002772,0.000927,0.002632,0.004541,0.003495,0.002032,0.000361,0.001386,0.002942,0.001307,0.000814,0.002021,0.002555,0.001214,0.001449,0.00045,0.000603,0.001536,0.001527,0.000855,0.000527,0.001595,0.00262,0.001896,0.000567,0.001269,0.001946,0.002787,0.00167,0.002923,0.004178,0.003476,0.002949,0.00152,0.000624,0.001342,0.000189,0.000912,0.000594,0.003099,0.001997
0.001007,0.001515,0.001095,0.000594,0.001601,0.001375,0.001711,0.000704,0.000444,0.000316,0.002588,0.001492,0.001436,0.000986,0.001166,0.000266,0.001271,0.001063,0.000249,0.000798,0.000469,0.001786,0.000803,0.000924,0.001088,0.00115,0.001215,0.000646,0.001755,0.001078,0.000803,0.000514,0.000952,0.001068,0.001474,0.001869,0.001013,0.000309,0.000683,0.002116,0.001963,0.001289,0.001098,0.000396,0.001936,0.002045,0.002713,0.001097,0.000739,0.000307,0.001658,0.00066,0.000255,0.000415,0.000659,0.001243,0.000306,0.001844,0.001362,0.001053,0.000388,0.000579,0.000791,0.000805,0.000706,0.000754,0.000805,0.001833,0.000373,0.000821,0.001118,0.000812,0.001717,0.000843,0.001151,0.000906,0.000591,0.001538,0.000519,0.001084,0.001128,0.000768,0.001288,0.001715,0.001524,0.000687,0.001399,0.00208,0.001342,5.8e-05,0.000666,0.001764,0.000797,0.000226,0.000543,0.001621,0.001019,0.000734,0.000417,5e-04,0.000825,0.000922,0.000711,0.000584,0.000404,0.000281,0.000754,0.001114,0.001545,0.001123,0.001817,0.000347,0.001135,0.001961,0.001298,0.000529,0.000843,0.000861,0.001793,0.000639,0.000372
0.000475,0.000855,0.000889,0.00068,0.001009,0.001248,0.001514,0.000984,0.00048,0.000523,0.00095,0.00107,0.001016,0.000752,0.000893,0.000794,0.000363,0.000549,0.000277,0.00028,0.000965,0.000973,0.00039,0.000476,0.000626,0.000722,0.000686,0.000422,0.000162,0.001666,0.000824,0.001217,0.000521,0.000541,0.000571,0.001878,0.000618,0.000657,0.000812,0.000566,0.000612,0.00017,0.000511,0.000502,0.001225,0.001135,0.001474,0.000794,0.00066,0.000833,0.000889,0.000604,8.3e-05,0.000388,0.00043,0.000915,0.000532,0.00121,0.000229,0.000382,0.000218,0.000651,0.000416,0.00069,0.000494,0.000251,0.000999,0.000721,0.00033,0.000573,0.000386,0.000376,0.000751,0.000866,0.000668,0.000532,0.000425,0.000753,0.000509,0.000393,0.000607,0.000609,0.000864,0.000891,0.000515,0.000657,0.000864,0.000874,0.000666,0.000422,0.001113,0.001031,0.001313,0.000405,0.000369,0.001121,0.000143,0.000721,0.000359,0.00038,0.000493,0.000926,0.000157,0.00021,0.000604,0.000305,0.000339,0.000795,0.000708,0.000744,0.000995,0.00011,0.000367,0.001163,0.000607,0.000756,0.000786,0.000592,0.000117,8e-05,7.8e-05
0.000203,0.000937,0.000719,0.000735,0.00087,0.001425,0.000227,0.000575,8e-04,0.001035,0.000982,0.001103,0.00114,0.000885,0.001063,0.00143,0.000185,0.00149,0.000655,0.000981,0.001211,0.000632,0.000234,0.000533,0.000903,0.001318,0.000499,0.000217,0.001019,0.000358,0.001103,0.000838,0.000633,0.000799,0.000463,0.001976,0.001309,0.00021,0.000636,0.001135,0.000524,0.000173,0.000542,0.000468,0.001207,0.001029,0.000997,0.001174,0.000666,0.000595,0.00096,0.000451,0.00034,0.000641,0.000666,0.000711,0.001158,0.001206,0.000251,2.1e-05,0.000155,0.000743,0.000946,0.000616,0.000583,0.000734,0.00093,0.000728,9.9e-05,0.000837,0.000516,0.001051,0.000475,0.001003,0.000394,0.000342,0.000244,0.000251,0.000166,0.000377,0.000879,0.000422,0.000684,0.000377,0.000311,0.000577,0.000757,0.00051,0.001369,0.000981,0.000983,0.000599,0.001091,0.000297,8e-04,0.001146,0.000711,0.000451,4.3e-05,0.000109,0.000313,0.000872,0.000115,0.000546,0.000363,0.000528,0.000375,0.000346,0.000731,0.000586,0.001391,0.000107,0.00088,0.00054,0.000621,0.000234,0.000752,0.000779,0.000842,0.000526,0.000547
0.000967,0.002707,0.001614,0.000347,0.001606,0.002116,0.001544,0.001615,0.000796,0.001925,0.001672,0.002769,0.001664,0.000188,0.000755,0.001222,0.001308,0.002586,0.001808,0.000481,0.00071,0.001167,0.000669,0.000996,0.001402,0.002293,0.001617,0.000456,0.002065,0.00139,0.000909,0.000627,0.001262,0.000563,0.001264,0.00248,0.001672,0.000991,0.00035,0.000909,0.000626,0.000722,0.000429,0.000768,0.002056,0.001007,0.001215,0.001,0.001724,0.001345,0.001611,0.000806,0.000937,0.00133,0.000855,0.001273,0.001534,0.001399,0.000149,2e-04,0.000508,0.000364,0.001085,0.001454,0.000484,0.001352,0.001504,0.001257,3e-05,0.001195,0.001656,0.001115,0.000682,0.000955,0.000457,0.000985,0.000268,0.000582,0.000492,0.000435,0.001182,9e-04,0.001167,0.001184,0.000831,0.001606,6e-04,0.001103,0.000957,0.000514,0.000638,0.000473,0.001255,0.001621,0.001702,0.000906,0.000668,0.001609,0.001192,0.000843,0.000454,0.00089,0.000245,0.000591,0.000306,0.000685,0.001424,0.00124,0.00059,0.000936,0.00066,0.000592,0.00151,0.000931,0.000419,0.000519,7e-04,0.001138,0.000461,0.000529,0.001292
0.002049,0.001813,0.000931,0.000384,0.000919,0.00053,0.00065,0.000964,0.001129,0.001094,0.001035,0.002083,0.002998,0.002784,0.001008,0.000917,0.000398,0.001058,0.000616,0.001016,0.001723,0.001502,0.000906,0.001158,0.00025,0.001774,0.000308,0.000358,0.001982,0.00157,0.001354,0.000511,0.001447,0.001312,0.001403,0.001162,0.000972,0.000562,0.000727,0.000445,0.000754,0.000155,0.00117,0.00151,0.001824,0.001957,0.000873,0.000707,0.00104,0.001349,0.001023,0.001226,0.00157,0.000667,0.002214,0.000878,0.000435,0.001056,0.000386,0.000877,0.001016,3.9e-05,0.001163,0.00149,0.001341,0.002307,0.000968,0.000653,0.001064,0.00104,0.000889,0.000838,0.000266,0.000262,0.000368,0.001419,0.001639,0.000829,0.001332,0.001344,0.000615,0.000797,0.00153,0.000907,0.00117,0.000461,0.001214,0.001066,0.001363,0.001093,0.001656,0.001495,0.001091,0.001828,0.000882,0.000425,0.000912,0.000226,0.00102,0.000631,0.001199,0.000789,0.00043,0.000172,0.000627,0.000758,0.000834,0.00105,0.000759,0.000462,0.001112,0.000693,0.000913,0.001119,0.00133,0.000586,0.000741,0.000929,0.000435,0.000871,0.00141
0.001275,0.002003,0.000552,0.000256,0.00059,0.000682,0.001269,0.001442,0.000759,0.000388,0.001168,0.002319,0.002023,0.000728,0.000787,0.002202,0.002239,0.00059,0.000549,0.000903,0.000841,0.001025,0.000404,0.001143,0.000452,0.001119,0.001389,0.000173,0.000733,0.001165,0.001049,0.001211,0.000885,0.000699,0.000849,0.000928,0.001205,0.001548,0.000465,0.001014,0.000905,0.000561,0.001886,0.001296,0.001824,0.001734,0.00065,0.001188,0.001056,0.000595,0.000863,0.000632,0.000521,0.001875,0.000874,8e-04,0.000856,0.000648,0.000433,0.00117,0.00097,0.001074,0.000702,0.000775,0.001064,0.000848,0.000544,0.000504,0.001359,0.001166,0.000471,0.000456,0.000495,0.000973,0.000558,0.000679,0.000618,0.001238,0.00146,0.000437,0.000539,0.001053,0.000517,7.9e-05,0.000614,0.000805,0.001359,0.001818,0.000494,0.000765,0.001086,2.9e-05,0.001558,0.000452,0.00049,0.000964,0.000574,7.7e-05,0.000725,0.000181,0.000896,0.001425,0.00088,0.000677,0.00023,0.000552,0.00079,0.001477,0.000216,0.000123,0.000951,0.000575,0.000937,0.000957,0.000485,0.000453,0.001336,0.001438,0.001137,0.000876,0.000564
7.7e-05,0.00036,0.001399,0.000796,0.002219,0.001746,0.001261,0.001547,0.000276,0.001679,0.000743,0.001085,0.001855,0.000149,0.000861,0.002001,0.003446,0.00297,0.000886,0.000594,0.000812,0.000283,0.000524,0.001052,0.001185,0.001022,0.000645,0.001758,0.000981,0.001533,0.000956,0.000133,0.000825,0.001085,0.00033,0.000294,0.000833,0.001697,0.001352,0.00181,0.002758,0.001709,0.001434,0.000774,0.000214,0.001982,0.000961,0.000878,0.000434,0.000802,0.000883,0.001278,0.000483,0.002098,0.002374,0.000374,0.000832,0.000586,0.000665,0.001441,0.001321,0.000559,0.000642,0.000245,0.000365,0.000446,0.00139,8.4e-05,0.000805,0.00123,0.001206,0.00028,0.000573,0.00244,0.001054,0.001137,0.001046,0.001025,0.000695,0.000604,0.000416,0.000737,0.0011,0.000758,0.000279,0.000584,0.000717,0.000939,0.001335,0.001245,0.000835,0.000697,0.001316,0.001878,0.001117,0.000712,0.000338,0.000846,0.000158,0.000711,0.000609,0.000839,0.000634,0.000457,0.000347,0.000476,0.000606,0.001175,0.002096,0.000838,0.00111,0.000146,0.000758,0.000677,0.000655,0.000621,0.000666,0.000907,0.001772,0.000765,0.00093
0.00105,0.000485,0.001247,0.001974,0.002056,0.000377,0.002704,0.001989,0.001861,0.001064,0.001008,0.001318,0.002208,0.002176,0.000878,0.002019,0.000772,0.000577,0.00096,0.000979,0.001322,0.000861,0.00094,0.00159,0.002295,0.001077,0.001635,0.002104,0.001225,0.001353,0.002343,0.001513,0.002162,0.002678,0.001728,0.000853,0.00122,0.001403,0.000355,0.001905,0.001751,0.000783,0.001378,0.001188,0.002585,0.001834,0.001779,0.001403,0.000945,0.00052,0.000679,0.000551,0.000928,0.002552,0.00039,0.001001,0.001711,0.001447,0.001252,0.000847,0.000421,0.000489,0.00069,0.000141,0.000118,0.000733,0.001653,0.001359,0.000846,0.00181,0.000444,0.000671,0.001288,0.001824,0.002068,0.000636,0.001903,0.002144,0.001658,0.00146,0.000872,0.00102,0.001186,0.000194,0.000872,0.00101,0.000792,0.000136,0.00082,0.001251,0.000647,0.001191,0.000376,0.000623,0.00121,0.001602,0.000682,0.001339,0.00119,0.001751,0.001168,0.000278,0.001447,0.000965,0.001052,0.000482,0.00072,0.001292,0.002311,0.002391,0.00061,0.000968,0.002354,0.002803,0.001629,0.000877,8e-04,0.001291,0.00117,0.000897,0.001119
0.001143,0.00058,0.000732,0.001421,0.003485,0.003481,0.004197,0.001345,0.002024,0.002571,0.000855,0.000801,0.001347,0.000326,0.001343,0.001435,0.001089,0.001574,0.001975,0.000453,0.001447,0.001703,0.000852,0.000533,0.000985,0.001777,0.002191,0.001215,0.001388,0.001275,0.001838,0.000901,0.001524,0.001579,0.001824,0.000838,0.00167,0.002262,0.001482,0.001366,0.001594,0.000505,0.001003,0.000546,0.00253,0.002983,0.001509,0.000427,0.000544,2e-04,0.000403,0.000831,0.002034,0.002154,0.001895,0.001505,0.001023,0.000507,0.00097,0.001098,0.00079,0.000591,0.000928,0.001214,0.000333,0.000724,0.001465,0.000936,0.001827,0.000555,0.001563,0.001604,0.000408,0.001488,0.00101,0.001428,0.000788,0.001583,0.000506,0.000752,0.000386,0.000549,0.001429,0.001367,0.001952,0.000255,0.000856,0.000864,0.000955,0.000725,0.00068,0.000522,0.000374,0.000646,0.000664,0.000316,0.000418,0.00103,0.000821,0.001363,0.000652,0.000429,0.000997,0.000418,0.000475,0.000573,0.00087,0.001546,0.001124,0.000998,0.000613,0.001029,0.002054,0.001882,0.00042,0.000814,0.00193,0.001353,0.001317,0.000963,0.001817
0.000568,0.000857,0.001191,0.002327,0.001506,0.001231,0.001036,0.000806,0.001609,0.002399,0.001945,0.000707,0.000908,0.000803,0.001035,0.000657,0.001437,0.002758,0.002232,0.001947,0.000286,0.000594,0.000997,0.000337,0.000659,0.000759,0.000958,0.001228,0.00093,0.000809,0.00141,0.00062,0.000388,0.001256,0.000583,0.000889,0.000969,0.000276,0.000742,0.000535,0.000279,0.000972,0.000618,0.000745,0.000926,0.001074,0.000405,0.000389,0.000259,0.00089,0.001078,0.00038,0.001457,0.000387,0.000954,0.000493,0.001004,0.001306,0.000867,0.001403,0.000429,0.001152,0.00019,0.000918,0.000987,0.000529,0.000791,0.00097,0.000998,0.001114,0.001111,0.000683,0.001151,0.001466,0.000541,0.00052,0.000784,0.000191,0.000458,0.001066,0.001279,0.001124,0.001325,0.000639,0.00089,0.000877,0.000458,0.000331,0.000728,0.000226,0.000354,0.000471,0.000741,0.001096,0.000594,0.000385,0.000352,0.000757,0.000236,0.001094,0.000694,0.000538,0.000686,5e-04,0.00045,0.000746,0.000331,0.001511,0.002009,0.00064,0.00013,0.000208,0.001851,0.000682,0.000375,0.001466,0.001218,0.000476,0.000608,0.000447,0.000999
0.000256,0.001047,0.000841,0.000616,0.000675,9e-04,0.00097,0.00124,0.001238,0.000918,0.000804,0.000831,0.000213,0.000312,0.000271,0.001136,0.000415,0.001422,0.000163,0.000719,0.000546,0.000265,0.000494,0.000508,0.000674,0.000942,0.000545,0.001897,0.001185,0.000435,0.000459,0.000318,0.000637,0.000365,0.000443,0.00071,0.000205,0.000181,0.001155,0.000691,0.00077,0.000524,0.000244,0.000445,0.000113,0.000652,0.000799,0.000613,0.000331,0.00064,0.000356,6.1e-05,0.000725,0.000532,0.000725,0.00071,0.000402,0.000804,0.000446,0.000693,0.000331,0.000868,0.000644,0.000281,0.000715,0.001136,0.000646,0.000818,0.000548,0.000381,0.000614,0.000116,0.00049,0.000465,0.000568,0.00011,0.000443,0.00073,0.00067,0.000804,0.001007,0.000612,0.000324,0.000703,8e-06,0.000162,9.4e-05,0.000321,0.000401,0.000376,0.00048,0.000547,0.000583,0.000385,0.000704,0.001012,0.000578,0.000412,0.000742,0.000544,0.000269,0.001023,0.001002,0.000441,0.000302,0.000513,0.000438,0.001088,0.001434,0.001099,0.00058,0.000177,0.000733,0.000241,0.000339,0.000954,0.000617,0.00034,0.000746,0.000337,0.000368
0.000142,0.00038,7.1e-05,0.000452,0.000542,0.000157,7.4e-05,0.000157,0.00045,0.000369,0.000128,0.000386,0.000163,0.000195,4.4e-05,0.000428,0.000303,0.00022,0.000167,0.000285,0.000241,0.000106,0.000242,0.000212,0.000235,0.00057,0.000253,0.000985,0.000228,0.000345,0.000407,0.000113,0.000511,0.000258,0.000218,0.000251,0.000183,0.000101,0.000283,0.000409,0.000432,0.000666,0.000228,0.000308,0.000162,0.000116,0.000283,7.6e-05,0.000185,0.000443,0.000273,0.000109,0.000355,0.00021,0.000158,0.000233,0.000142,0.000135,0.000396,0.000457,0.000138,1.8e-05,0.000175,0.000135,0.000394,0.000322,0.00018,0.000217,0.000134,2e-04,0.000414,0.000425,0.000148,0.000286,0.000332,0.000236,0.00029,0.000249,0.000242,0.000239,0.000327,5.8e-05,0.000192,0.000299,0.000171,0.000205,0.000123,0.000248,0.000241,0.000359,0.000324,0.000251,0.000165,0.000541,0.000153,0.000304,9.9e-05,0.000414,0.000105,0.000315,0.000125,0.000342,9.9e-05,0.000201,0.000142,0.000233,0.00024,0.000257,0.000246,0.000174,0.000342,0.000122,0.000286,0.000257,0.000224,0.000282,0.000235,8.5e-05,0.000423,0.000196,6.1e-05
0.000364,7e-05,4.9e-05,0.000504,0.000192,0.000431,7e-05,6.8e-05,0.00021,2e-04,0.000234,0.000147,0.000192,5.6e-05,0.000176,0.000251,0.000128,0.000304,0.000124,0.000261,0.000114,0.000122,0.000277,9e-05,0.000156,0.000268,0.000303,0.00057,0.000856,0.000675,0.000653,0.000313,0.000153,0.000246,0.000556,0.000463,0.000222,0.000172,0.000335,0.000395,0.000465,0.000241,0.000242,0.000459,0.00041,0.000114,0.000309,0.000271,0.000239,0.000386,0.000428,0.000425,0.000317,0.000242,0.000262,0.00021,0.000174,0.000211,0.000178,0.000351,0.000231,0.000285,0.00032,0.000273,0.000305,0.000193,0.000103,0.000191,0.000206,0.00027,8.1e-05,0.000222,0.000148,0.00012,0.000504,0.000598,0.000539,0.000252,0.000206,0.000136,6.4e-05,0.000142,5.3e-05,0.000108,0.000316,0.000299,0.000191,0.000134,0.000229,3e-04,0.00012,0.00031,0.000111,0.000298,0.00026,0.000173,0.000253,0.000329,0.000266,0.000426,0.000305,0.000291,0.000293,5.9e-05,0.000171,4.5e-05,0.000156,0.000209,4e-04,0.000138,0.000203,0.000286,0.000322,0.000351,8.2e-05,0.000312,0.000142,5.5e-05,0.000217,0.000165,3.9e-05
0.00016,0.000229,0.000165,0.000367,0.000411,0.000527,0.000346,0.000287,7.1e-05,0.000267,0.000216,0.000251,0.000467,0.000201,2.8e-05,0.00037,0.000438,0.000216,0.000103,0.000252,0.00014,0.000179,0.000226,6.7e-05,0.000113,0.000148,0.000102,0.00064,6.6e-05,0.000521,0.000413,0.000582,0.000616,0.000235,0.000369,0.000481,0.000427,0.000492,0.00026,0.000493,0.000424,0.000789,0.000382,0.000162,0.000163,0.000179,0.000234,3.8e-05,0.000191,0.000177,0.000376,0.000269,0.000343,0.000207,0.000221,0.000157,8.8e-05,0.000259,0.000183,0.00017,0.000221,0.000487,0.000156,0.000248,0.000234,3.1e-05,0.00013,0.000147,5.9e-05,0.000173,0.000268,0.000274,0.000284,0.000208,0.000396,0.000472,0.000178,0.000146,0.000257,0.000198,0.000325,0.000307,0.000114,0.000327,6.9e-05,9.4e-05,0.000284,0.00043,8.3e-05,0.000142,0.000177,0.000189,0.000149,0.000205,0.000292,0.000106,0.000356,0.000308,4.1e-05,0.000113,0.000146,1.9e-05,7.6e-05,0.000186,0.000257,6.9e-05,0.000186,0.000328,0.000231,0.000114,9.7e-05,0.000424,0.000272,0.000258,0.000136,3e-04,5.3e-05,0.000211,0.000114,0.000216,0.000218
0.000199,9.3e-05,0.000289,0.000547,0.000386,0.000515,0.000369,0.000478,0.00023,0.000155,0.000362,0.000114,0.000488,0.000405,6.6e-05,0.000335,0.000341,0.000202,3e-05,0.000244,0.000268,0.000174,0.000119,0.000116,7.8e-05,0.000111,0.000297,0.000546,4e-04,0.000534,0.000347,0.000268,0.000588,0.000337,0.000315,0.000434,0.000448,0.000448,0.000245,0.000521,0.000553,0.000347,0.000351,0.000312,8.5e-05,8.6e-05,0.000106,0.000177,3.1e-05,0.000125,0.000192,9.7e-05,0.000116,0.000132,9.8e-05,0.000255,0.000342,0.000148,0.000236,0.000161,0.000304,0.000352,0.000258,0.00018,6.2e-05,0.000177,0.000155,0.000194,0.000245,0.000133,0.000177,0.000143,9.5e-05,0.00015,0.000272,0.000245,5.8e-05,2.3e-05,0.000231,9.7e-05,0.000146,0.000247,8.8e-05,0.000155,7.9e-05,0.000198,0.000255,0.000447,0.000129,0.000192,0.000125,0.000184,2e-04,0.000421,4.7e-05,0.000348,6e-05,0.000135,3.2e-05,0.000172,0.00015,0.000103,0.000157,7.7e-05,0.000155,0.000198,0.000213,7.1e-05,4.2e-05,7.7e-05,8.9e-05,0.000206,0.000166,0.000143,0.000102,0.000155,0.000303,9.6e-05,0.000145,0.000215,7.9e-05
0.000174,6e-05,0.000312,0.000484,0.000343,3.7e-05,0.000203,0.000309,0.000335,2e-04,0.000218,0.000186,0.000331,0.000345,0.000327,6.6e-05,0.000111,0.000334,3.1e-05,9.7e-05,0.000249,0.000184,8e-05,0.000203,0.00021,0.000336,0.000181,9.9e-05,0.000188,0.000301,0.000118,0.000393,0.000482,0.000456,9.1e-05,0.00059,7.6e-05,0.000453,0.000354,0.000539,0.000204,0.000542,0.000179,0.000201,0.000224,0.000138,0.000237,0.000257,5.4e-05,0.000169,0.000245,9.5e-05,0.000101,0.000104,0.00034,0.000206,0.000228,0.000268,0.000192,0.000409,0.00035,0.000224,0.000111,9.3e-05,0.000286,0.00051,0.000283,0.000325,0.000232,0.000101,5.8e-05,0.000174,0.000253,6e-06,0.000135,0.00016,0.000185,0.000149,0.000105,0.000303,0.000196,0.00014,0.000117,0.000263,2.6e-05,0.000118,3e-04,7.2e-05,0.000209,0.000229,0.000157,0.000181,0.000135,0.000279,0.000252,0.000285,0.00016,0.000212,0.00017,0.000271,0.000168,0.00014,0.000161,6.3e-05,8.6e-05,0.000208,0.000137,0.000157,0.000101,9.6e-05,0.000141,0.000156,0.000176,0.000125,0.000189,7.9e-05,3e-04,0.00013,0.000249,8.6e-05,9.7e-05
0.000488,0.00027,0.000275,5e-04,3e-04,0.000369,9.5e-05,0.000141,0.000223,0.000154,0.000234,5.3e-05,0.00023,0.000201,8.2e-05,0.000192,0.000211,0.000405,0.000146,8.7e-05,0.000281,0.000121,9.4e-05,0.000148,0.000129,0.000216,6.1e-05,0.000233,0.000234,0.00055,0.000339,0.000552,0.000397,0.000365,0.000209,0.000666,0.000191,0.000531,0.000293,0.000462,0.000288,0.000491,0.00048,0.000202,0.000439,0.000473,0.000274,0.000237,0.000229,0.000146,0.000232,0.000195,0.000217,0.00015,0.000463,0.000183,0.000125,6.8e-05,7.2e-05,0.000286,0.000287,0.000267,0.000154,0.000152,0.00037,0.000287,0.00014,0.000173,4.9e-05,0.000104,0.000113,0.00021,0.00023,0.000207,0.000154,0.000159,7e-05,0.00023,0.000138,0.000103,0.000236,0.000195,0.00013,0.00025,0.000178,0.000113,0.00033,0.000339,9.3e-05,8.6e-05,7.8e-05,0.000135,2.5e-05,0.000256,0.000166,0.000246,1.9e-05,0.000253,0.000155,1.7e-05,9.3e-05,0.000138,8.5e-05,6.9e-05,8.8e-05,0.000111,5.5e-05,3.6e-05,0.000246,8.8e-05,0.000274,0.000329,2e-04,8.6e-05,0.000164,0.000303,0.000263,8.6e-05,0.000209,0.000109,0.000134
0.000553,0.000233,0.000157,0.000198,0.00036,8.2e-05,0.000405,0.000209,0.000271,0.000144,0.000237,0.000408,0.000327,0.000336,0.000436,0.000387,0.000181,0.000405,0.000278,0.000289,0.000273,0.000183,0.000106,0.000403,0.000182,0.000248,0.000404,0.000406,0.000569,0.000573,0.000976,0.000721,0.000378,0.000373,0.000156,0.000584,0.000229,0.000355,0.00018,0.000208,0.000323,0.000326,9e-05,0.000225,0.000283,0.00036,0.000224,0.000211,0.000245,0.00013,0.000361,0.000138,0.000275,0.000221,0.000437,0.000136,8.7e-05,0.000143,0.00017,0.000197,0.000229,0.000325,0.000183,0.000396,0.00033,0.000397,0.000226,0.000204,6.8e-05,0.000221,0.000277,3e-04,0.000183,6.5e-05,0.000242,0.000166,0.000384,0.000157,0.00026,0.000118,0.000217,0.000194,0.000108,0.000305,0.000144,2.9e-05,0.000419,0.000418,0.000323,0.000304,0.000149,2.6e-05,3.6e-05,9.8e-05,0.000143,0.000168,5.5e-05,0.000282,8.9e-05,0.000112,8.1e-05,8.7e-05,0.000225,0.000227,0.000192,9.7e-05,0.000106,7.6e-05,0.000252,0.000203,0.000216,0.00012,7.4e-05,8.8e-05,7.7e-05,0.000199,2.2e-05,0.000118,0.000241,0.000114,0.000117
0.00035,0.00027,1e-05,0.000343,0.000449,0.00055,0.000611,0.001039,0.00082,0.000198,0.000178,0.00064,0.000318,6.4e-05,0.000398,0.000146,0.000274,0.000528,0.000792,0.000511,0.000621,0.00011,0.000366,0.000358,0.000445,0.000414,0.000465,0.001165,0.000313,0.000646,0.000393,0.001455,0.001208,0.000202,0.000297,0.000472,0.000335,0.000546,0.000875,0.000863,0.000779,0.000912,0.000412,0.00012,0.00021,0.000519,0.000233,0.000402,0.000208,0.000452,0.000251,0.000517,0.000712,0.000227,0.000282,0.000306,0.000324,0.000482,0.000217,0.00026,0.000259,0.000582,0.000415,0.000547,0.000803,0.000489,0.000504,0.000402,0.000411,0.000321,0.000199,0.000119,0.000562,0.000544,0.000619,0.000568,0.000353,0.000277,0.000198,0.000197,0.000187,0.000296,0.000265,0.000352,0.000394,6e-05,0.000363,0.000754,0.000687,0.000123,6.8e-05,7.8e-05,0.000233,0.000185,0.000272,0.000301,0.000197,0.000269,0.000187,8.7e-05,0.000198,0.000466,0.000224,0.000213,0.000175,0.000194,0.00041,0.00029,0.000396,0.000372,0.000312,0.000618,0.000121,1e-04,0.000223,0.000266,0.000266,0.000255,0.000252,0.000223,0.000414
0.000372,0.000626,0.000634,0.000493,0.000199,8e-04,0.001301,0.000941,0.000829,0.000693,0.000449,0.00089,0.000697,0.00044,0.000573,0.000269,0.000337,0.000159,0.00064,0.000653,0.000186,0.000394,0.000838,0.000783,0.000257,0.000404,0.000183,0.000906,0.00044,0.000357,0.000938,0.00087,0.0013,0.001035,0.00114,0.001343,0.001194,0.000799,0.001152,0.000514,0.000685,0.000404,0.000228,0.000228,0.00042,0.000553,0.00051,0.000868,0.000596,0.000895,0.000232,0.000539,0.000311,0.000898,0.000962,0.000476,0.000383,0.000159,0.000259,0.000445,0.000147,0.000555,0.000289,0.000421,0.000706,0.000644,0.000418,0.000221,0.000356,0.000357,0.000155,0.000234,0.000626,0.000772,0.000498,0.000381,0.00071,0.000653,0.00026,0.00048,0.000345,0.000126,0.000353,6.2e-05,0.00029,0.000494,0.000559,0.000696,0.000362,0.000613,0.00047,0.000264,0.00027,0.000689,0.000854,0.000392,0.000292,4.7e-05,0.000129,0.000286,0.000401,0.000558,0.000434,0.000509,0.00051,4.4e-05,0.000323,0.000303,0.000481,0.000211,0.000275,0.000583,0.000611,0.000382,0.000147,0.000112,0.00035,0.000346,0.000455,0.000301,0.000565
0.000431,0.000443,0.000206,0.000526,0.000417,0.000631,0.00046,0.000489,0.000621,0.000259,0.000784,0.001033,0.000589,0.000553,0.000901,0.000553,0.000576,0.000424,0.000628,0.000142,0.000191,0.000233,0.000966,0.00033,0.000218,0.00034,0.000159,0.000324,0.000263,0.000423,0.000806,0.000615,0.000845,0.000744,0.000788,0.000512,0.00089,0.000843,0.000133,0.000933,0.000178,0.000531,6.7e-05,0.000229,0.000314,0.000161,0.000445,0.000617,0.000139,0.000406,0.000458,0.000618,0.000782,0.000344,0.000632,0.000182,0.000334,0.000222,0.000283,0.000293,4.8e-05,0.000358,0.000462,0.000509,0.000447,0.000343,0.000766,0.000377,0.000249,0.000526,0.000371,0.000395,0.000781,6.2e-05,3.3e-05,0.000214,0.000644,0.000627,4e-04,0.000473,0.000166,5.3e-05,0.000257,0.000392,0.000229,0.00021,0.000525,0.000108,0.000261,0.000982,0.000642,0.000303,0.000286,0.000664,0.000619,0.000283,0.000381,0.000474,0.000257,8.3e-05,0.000142,0.000749,0.000589,0.000116,0.000182,0.000513,0.000191,0.000351,0.000244,0.000679,0.00047,0.000438,0.000461,0.000376,1e-04,5.5e-05,0.000472,0.000406,4.2e-05,0.000153,0.000472
0.000329,0.000406,0.000519,0.000135,0.00022,0.000629,0.000743,0.000496,0.000658,0.000756,0.001035,0.000367,0.000429,0.000257,0.000689,0.000613,0.000645,0.000732,0.000545,0.000378,0.000299,0.00033,0.00063,0.000841,0.000628,0.000135,0.000802,0.000649,0.000557,0.000791,0.000521,0.000653,0.000287,0.00093,0.000666,0.000582,0.00028,0.000124,0.000416,0.00057,0.000238,0.00028,0.000691,0.000544,0.000488,0.000449,0.00081,0.000716,0.000703,0.000201,0.00028,0.000635,0.000525,0.000485,0.000307,0.000512,0.000188,0.00019,0.000271,0.000538,0.000373,0.000333,0.000392,0.000762,0.000429,0.000717,0.000477,0.000455,0.000258,0.000645,0.000413,0.000586,0.000284,0.000207,0.00049,0.000272,0.000533,0.000299,0.000174,0.000235,0.000581,0.000283,2e-04,0.000591,0.000444,0.000409,0.000514,0.000405,0.000286,0.000878,0.000839,0.000574,0.000162,3.8e-05,0.000609,0.000367,0.000217,0.000328,6.7e-05,7.4e-05,0.000106,0.000519,0.000169,9.9e-05,0.000294,0.000772,0.000336,0.000411,0.000494,0.000545,0.000215,0.000194,0.000173,0.000135,0.000157,0.000231,0.000253,0.000224,0.000144,0.000203,0.000512
0.000297,0.00072,0.000695,0.000434,0.00063,0.000739,0.000317,0.000362,0.000444,0.00023,0.000286,0.000463,0.000459,0.000661,0.000483,0.000402,0.000471,0.000276,0.000714,0.000921,0.001147,0.001034,0.000866,0.000398,0.000105,0.000321,0.000854,0.000925,0.001001,0.000259,0.000248,0.000876,0.000661,0.000584,0.000351,0.000319,2e-04,0.000435,0.000226,0.000205,0.000333,0.00024,0.000703,0.000245,0.000232,0.000207,0.000443,0.000194,0.000351,0.000181,0.000321,0.000392,0.000254,0.00056,0.000558,0.000218,0.000401,0.000372,0.000236,0.000512,0.000568,0.000225,0.000338,0.000208,0.000486,0.000448,0.000582,0.000315,0.000373,0.000468,0.000164,0.000457,0.000544,0.000141,0.000625,0.00056,0.000921,0.000554,0.000362,0.000216,0.000256,0.000179,0.000247,0.000399,0.00051,0.000711,0.00025,0.000147,0.000279,0.000586,0.000319,0.000207,0.000372,0.00044,0.000253,0.000245,0.000204,0.000437,0.00039,0.000295,0.000176,0.000238,0.000125,0.000119,0.000194,0.000526,0.000457,0.000399,0.000354,0.000137,0.000224,0.000319,6.5e-05,0.000186,0.000147,0.000358,0.000201,0.000239,0.00023,0.000201,0.000264
5.4e-05,0.000702,8.9e-05,0.000185,0.000224,0.000358,0.000132,0.000124,0.000227,0.00039,0.000278,0.000357,0.000437,0.00055,0.000252,0.000127,0.000292,0.000211,0.00056,0.000542,0.000362,0.000286,0.000161,9.6e-05,0.000137,0.000302,0.000448,0.001,0.00134,0.000995,0.000825,0.001127,0.000553,0.000183,0.000102,0.000521,0.000725,0.000621,0.000504,0.000301,0.000149,0.000461,0.000175,0.000146,0.000201,6.7e-05,0.000269,0.000306,0.000105,0.000283,0.000302,0.000367,0.000143,0.000569,5.9e-05,0.00041,0.000492,0.000195,0.000205,0.000375,0.000141,0.000144,0.000287,0.000176,0.000406,5.3e-05,0.000165,2.1e-05,0.000404,0.00049,0.000578,0.000324,0.000309,0.000226,0.000576,0.000296,0.000353,0.000616,0.000284,0.000335,0.00013,0.000146,0.000185,8.2e-05,0.000334,0.00044,0.000323,0.000197,9.5e-05,0.000261,0.000437,0.000204,0.000506,0.000126,0.000159,0.000168,6.7e-05,0.000269,0.000123,0.000156,2.5e-05,0.000216,0.000234,7.6e-05,0.000191,0.000125,0.000236,0.00012,0.000157,9e-05,0.000224,0.000233,0.000284,0.00035,0.000165,0.000393,0.000118,0.000104,3.2e-05,0.000176,0.000169
0.000308,0.000429,0.000218,0.000248,0.000295,0.00011,0.000217,0.000108,8.6e-05,6e-05,0.00022,0.000303,9.2e-05,3.4e-05,5.7e-05,4.3e-05,0.000326,0.000253,0.000613,0.000287,0.000183,0.000187,9.7e-05,0.000178,7.8e-05,0.000252,5.8e-05,0.000199,0.000428,0.000342,0.000414,0.000358,0.000225,0.00073,0.000354,0.000185,0.000449,0.000145,0.000318,0.000438,0.000531,0.000194,0.000707,2.8e-05,0.000252,0.000207,9.8e-05,0.00026,0.000361,0.000291,0.000216,0.000191,0.000224,0.00054,0.000335,0.00039,0.000524,8e-05,5e-05,0.000534,0.000208,0.000229,7.3e-05,9.4e-05,0.000164,0.000257,0.000228,0.000123,0.000251,8.7e-05,0.000335,0.000306,0.000263,0.000191,0.000277,0.000146,0.000195,0.000427,5.3e-05,0.000291,0.000112,0.000154,3e-04,0.000246,0.00018,0.000413,0.00018,0.000269,0.000311,0.000261,0.000316,0.000155,0.000505,0.000292,0.000342,0.000153,0.000186,6.9e-05,0.000175,0.000295,0.000154,0.000162,7.9e-05,0.000186,0.000154,7e-05,0.000302,0.000147,8e-05,0.000157,0.000107,0.000116,0.000138,0.000289,0.000124,8.6e-05,6.7e-05,0.00021,0.000227,0.000182,5.6e-05
0.000117,0.000497,9.3e-05,0.000629,0.000209,0.000579,0.000482,0.000317,7.7e-05,9.9e-05,0.000391,0.000254,0.000228,0.000237,0.000513,0.000204,0.00028,0.000317,0.00017,0.000526,0.000262,0.000431,0.000187,0.000273,0.000347,0.000381,0.000484,0.00045,0.000188,0.000608,0.000638,0.000358,0.000561,0.000495,0.000379,0.000242,0.000162,0.000408,0.000284,0.000295,0.000413,0.000703,0.001233,0.001193,0.000483,0.000353,0.000415,6e-04,0.000214,0.000739,0.000708,0.000495,0.000379,0.000356,0.000264,0.000315,0.000348,0.000568,0.000134,0.000464,0.00077,0.000488,0.00024,0.000145,0.000161,0.000395,0.000364,0.000354,0.000205,0.000164,0.000356,0.00047,0.000288,0.000396,9.3e-05,0.000306,0.00033,0.000246,4e-04,0.000235,0.000316,6.8e-05,0.000437,0.000119,0.000302,0.000301,0.000391,0.000312,0.000251,0.00011,0.000434,0.000359,0.000356,0.000544,0.000246,0.000328,2.2e-05,0.00034,0.000314,0.000506,0.000276,8.2e-05,9.5e-05,0.000188,0.000325,0.000356,0.00059,0.000486,0.000334,0.000244,0.000153,8.1e-05,0.000132,0.000176,0.000407,0.000529,0.000216,0.000204,0.000203,0.000411,0.000374
0.000687,0.001136,0.000737,0.000716,0.000867,0.00046,0.000374,0.000429,0.000376,0.000231,0.000553,0.00068,0.000551,0.000611,0.000716,0.000487,0.000325,0.000213,0.00055,0.000661,0.00052,0.00057,0.000822,0.000923,0.000624,0.000153,0.000597,0.000549,8e-04,0.001198,0.00091,0.000292,0.000747,0.000688,0.00044,0.000297,0.000438,0.00047,0.000488,0.00051,0.00065,0.000416,0.000593,0.00101,0.000854,0.000682,0.000921,0.000247,0.000543,0.000741,0.000862,0.000473,0.000268,0.000695,0.000962,0.00067,0.00056,0.000759,0.000721,0.000498,0.000532,0.000441,0.000274,0.000296,0.000422,0.000638,0.000317,0.000347,0.000329,7.1e-05,0.00037,0.000263,0.000119,0.000383,0.000466,0.000116,0.000392,0.000511,0.000615,0.000366,0.000443,0.000601,0.00085,0.000422,0.000459,0.000527,0.000519,0.00026,0.000382,0.000337,0.000463,0.000912,0.000918,0.00094,0.000817,0.000158,0.000177,0.000328,0.000331,0.000201,0.000452,0.000475,0.000238,7.6e-05,0.000614,0.000381,0.000417,0.00039,0.000223,0.000264,0.000184,0.000206,7.4e-05,0.000425,0.000655,0.000178,0.000314,0.000214,0.000249,0.000249,0.000106
0.000614,0.000406,0.000707,0.000522,0.000138,0.000732,0.000434,0.000405,9.2e-05,0.000178,0.000343,0.000301,0.000338,0.000226,0.00068,0.00051,0.000226,0.000231,0.000338,0.000106,0.000223,0.000499,0.000478,0.000336,9.9e-05,0.000195,0.000501,0.000217,0.000784,0.000982,0.000481,0.000259,0.000581,0.000577,0.000106,0.000541,0.000495,0.000672,0.000519,0.000427,0.000704,0.000609,0.000467,0.000537,0.000568,8.2e-05,0.00044,0.000324,0.000585,0.000315,7e-04,0.000415,0.000143,0.000443,0.000607,0.000192,0.000241,0.000588,0.000359,0.000209,3e-04,0.00024,0.000158,0.00037,0.00061,0.000141,0.000148,0.00041,0.000249,0.000162,0.000215,0.00031,0.000323,0.000438,0.000448,0.000266,0.000336,0.000248,9.6e-05,8.3e-05,0.000252,0.00046,0.000236,0.000319,0.000427,0.000447,0.000448,0.000209,0.000551,0.000594,0.000416,0.000371,0.000212,3.9e-05,0.000187,0.000494,0.000509,0.000268,0.000199,0.000188,0.00021,0.000369,0.000253,0.000144,0.000633,0.000305,0.000304,5e-05,0.00012,8.5e-05,0.000153,7.4e-05,6.6e-05,0.000343,0.000443,0.000684,0.000338,0.000134,0.000276,0.000172,0.00015
0.000243,0.00043,0.000249,0.000212,3.4e-05,0.000344,0.00028,0.000135,0.00012,4.6e-05,0.000291,0.000172,6.1e-05,2.2e-05,0.000355,8.4e-05,0.000281,9.6e-05,0.000183,0.000167,0.000204,0.000169,0.000128,0.000135,9.5e-05,0.000137,0.000136,0.000139,5e-04,0.00021,2.7e-05,9.3e-05,0.000401,0.000123,0.000387,0.000332,0.000135,6.1e-05,0.000256,0.000163,0.000293,0.000215,0.000191,0.000196,7.6e-05,0.000179,0.00015,0.000122,0.000239,0.00032,0.000322,0.000152,0.000152,0.000141,0.000173,7e-05,7.6e-05,0.000362,6e-06,0.000121,0.000121,0.000101,3.5e-05,0.000213,0.000315,0.000115,0.000127,0.000214,2.3e-05,7.1e-05,0.000175,0.000193,7.1e-05,0.000117,0.000162,9.3e-05,0.000337,0.000131,5.7e-05,4.6e-05,0.000139,0.000254,0.000121,0.00022,0.000186,0.000275,0.000226,0.000376,0.000161,0.000114,0.000155,8.7e-05,0.000191,0.000148,8.1e-05,0.000276,0.000154,0.000105,1e-05,5.4e-05,0.000195,0.000141,0.000136,0.000172,0.000238,8.3e-05,0.000102,5.1e-05,0.000196,0.000165,8.6e-05,0.000118,0.000148,9.3e-05,0.000104,0.000254,9.2e-05,6.3e-05,0.000166,0.000122,0.000108
0.000172,0.000199,0.000233,0.000139,0.000212,0.000142,2e-05,9.5e-05,2.2e-05,1e-05,0.000134,7.8e-05,4.1e-05,0.000133,0.000129,0.000118,0.000189,0.000153,9.7e-05,0.000124,6.4e-05,5e-05,6.2e-05,0.000105,3.8e-05,8.1e-05,8e-05,0.000127,0.000349,9.2e-05,5.7e-05,6.3e-05,0.00018,2.9e-05,0.00018,7.9e-05,0.000109,7.5e-05,0.000189,9.2e-05,0.000162,7.7e-05,0.00021,7.5e-05,6.5e-05,9e-05,0.000101,3.8e-05,0.00015,0.000184,0.000226,7.1e-05,0.000112,0.00011,0.000192,9.9e-05,8.4e-05,0.000257,5e-06,8.7e-05,5.2e-05,1e-04,2.1e-05,0.000146,0.000277,0.000104,8.3e-05,0.000166,0.000103,2e-05,6.8e-05,0.000127,6e-05,3.9e-05,0.00013,3.5e-05,0.000123,2.8e-05,8.3e-05,3e-05,0.000126,0.000158,5.3e-05,0.000187,0.000168,0.000172,3.5e-05,0.00015,0.00013,4.1e-05,0.000124,0.000176,8.8e-05,0.000104,5.4e-05,0.00016,8.2e-05,5.7e-05,4.2e-05,1.1e-05,0.000125,7.7e-05,3.9e-05,8.9e-05,0.000144,2.7e-05,4.9e-05,2.9e-05,0.000173,0.000102,5.4e-05,3.4e-05,0.000107,0.000105,2.8e-05,0.000255,9.1e-05,1.8e-05,9.3e-05,0.000111,1e-04
0.000117,0.000211,0.000152,9.6e-05,0.000171,4.4e-05,2.6e-05,6.4e-05,3.2e-05,2.1e-05,0.00014,4.4e-05,4.5e-05,0.000106,8.4e-05,8e-05,0.000163,0.000123,6.7e-05,5.3e-05,5.7e-05,3.5e-05,6.8e-05,8.6e-05,3.7e-05,7.5e-05,8.3e-05,6.5e-05,0.000275,0.000142,7.9e-05,3.7e-05,0.000137,5.5e-05,0.000141,1.8e-05,0.00011,9.8e-05,0.000178,0.000101,0.000132,8.8e-05,0.000194,7.2e-05,5e-05,8.6e-05,0.00013,4.1e-05,0.000139,0.00016,0.000191,7.8e-05,6e-05,3.5e-05,0.000108,7.2e-05,4.1e-05,0.000196,1.9e-05,4.3e-05,3.1e-05,6.7e-05,1.9e-05,0.000133,0.000254,6.4e-05,5.5e-05,0.000143,7.9e-05,1.7e-05,4.1e-05,8.1e-05,4.5e-05,2.3e-05,0.000122,2e-05,0.00011,3.3e-05,7.8e-05,1e-05,0.000102,0.000149,4.3e-05,0.000159,0.000165,0.00014,3.3e-05,0.000148,7.8e-05,1.7e-05,6e-05,0.000147,3.7e-05,0.000107,2.9e-05,0.000162,6.7e-05,7e-05,1.7e-05,8e-06,0.000107,5.8e-05,2.6e-05,7.1e-05,0.000124,3.2e-05,3.8e-05,2.3e-05,0.000131,0.000114,4.3e-05,5.3e-05,0.000124,5.7e-05,3.9e-05,0.000227,8.3e-05,1.6e-05,0.000105,7.4e-05,7.3e-05
