-0.004407,-0.003422,-0.003015,-0.00313,-0.002452,-0.006147,-0.004344,-0.004369,-0.005561,-0.004316,-0.004857,-0.006187,-0.004312,-0.003391,-0.002204,-0.004107,-0.002831,-0.003298,-0.00588,-0.007497,-0.005714,-0.005198,-0.006464,-0.006396,-0.003286,-0.003471,-0.004877,-0.005366,-0.004259,-0.004781,-0.006787,-0.003833,-0.005333,-0.00632,-0.007189,-0.006877,-0.006172,-0.003872,-0.008591,-0.007866,-0.004562,-0.005685,-0.003189,-0.003243,-0.003137,-0.004922,-0.002675,-0.003835,-0.004126,-0.002787,-0.00748,-0.006738,-0.005266,-0.004485,-0.001927,-0.001856,-0.004013,-0.004666,-0.004066,-7e-04,-0.003534,-0.003301,-0.00197,-0.001557,-0.002627,-0.004115,-0.006602,-0.004227,-0.004792,-0.002815,-0.003578,-0.00334,-0.004684,-0.002832,-0.00447,-0.003747,-0.004397,-0.006079,-0.002922,-0.004084,-0.000487,-0.004842,-0.00411,-0.006531,-0.006357,-0.005883,-0.002803,-0.004701,-0.002904,-0.002755,-0.004017,-0.003119,-0.005484,-0.005283,-0.005196,-0.003037,-0.003202,-0.004596,-0.005531,-0.004467,-0.002112,-0.004914,-0.003258,-0.002629,-0.002564,-0.006583,-0.00268,-0.003672,-0.001658,-0.005909,-0.004956,-0.00258,-0.003302,-0.003578,-0.002897,-0.00276,-0.004507,-0.002547,-0.001581,-0.001872,-0.004896
-0.000142,0.001528,0.000504,-0.000494,-0.00187,0.000636,-0.00183,-0.001477,-0.00031,0.000805,-0.000414,0.001793,-0.001536,-0.001286,-0.002662,-0.00387,-0.003875,-0.002125,0.003338,0.00258,0.002838,-3e-06,0.002614,9e-04,0.001149,0.000394,0.002184,0.000578,0.00053,-0.000806,-0.000181,0.001246,0.000503,0.000597,0.000827,0.000456,-0.001065,-0.002013,0.001411,0.002219,0.001521,0.001401,-0.000574,-0.000884,-0.002799,0.00038,0.000393,-0.002065,-0.000488,0.000266,0.001699,0.000882,-0.000804,-0.001412,-0.002622,-0.002553,-0.00111,-0.002253,-0.001943,-0.00434,-0.004688,-0.00184,-0.002689,-0.003621,-0.002764,0.000285,0.001848,0.001933,0.00067,-0.00036,-0.002851,-0.001157,0.000476,-0.00171,-0.000994,0.000815,0.001152,-0.000585,-0.001757,-0.000428,-0.001776,0.000607,0.001286,2.8e-05,0.001034,0.000108,-0.002555,0.001771,-0.001845,-0.002192,0.000681,-0.001484,0.001054,0.000209,0.000202,0.002178,-0.000594,0.001358,0.000897,-0.00032,-0.001702,-0.000761,-0.004354,-0.001636,-0.002214,-0.000436,-0.000896,-0.001901,-0.000485,-0.000405,0.000405,-0.002256,0.000424,0.001497,0.000336,0.000593,-8.9e-05,-7.4e-05,-0.00132,-0.002283,0.001135
-0.000432,-0.001405,-0.001519,-0.001472,-0.001415,-0.002492,0.000752,-0.001639,-0.002555,-0.001413,0.000921,-0.000726,0.001302,6e-06,-0.000761,0.002664,0.001975,0.000628,-0.001551,-0.004097,-0.003115,-0.002024,-0.001011,-0.000306,0.000289,-0.002136,-0.002604,-0.000218,-0.00154,-0.00018,0.001506,8.7e-05,-0.00139,-0.001095,-0.00162,-0.000379,0.000679,-0.000601,0.000824,-0.001696,-0.001802,-0.001651,-0.000506,-0.000251,0.002523,-7.7e-05,-0.001543,0.00076,-0.001579,-0.002889,0.00024,-0.002173,-0.001449,-0.001793,-0.001728,-0.00093,0.000729,0.001904,0.001993,0.000897,0.002335,-0.000943,7.6e-05,-0.000302,0.001408,-0.001953,-0.002547,-0.002803,-0.001263,-0.00026,0.000851,0.001118,-0.00011,-0.000472,-9.5e-05,-0.000965,-0.002187,-0.001184,-0.000269,-0.000488,-0.001546,-3.1e-05,-0.00022,-0.001011,-0.002303,-0.001399,-0.001603,-0.001347,-0.00205,0.001474,-0.000444,0.001794,-8.3e-05,0.000564,-0.001348,-0.004305,-0.001201,-0.002844,-0.000446,-0.002376,-0.00106,0.000161,0.001817,0.003136,0.001866,0.001842,0.000797,-0.001217,-0.000464,0.001636,0.000869,0.00032,-0.001455,-0.002437,-0.002962,-0.003162,-0.003383,-0.002103,-0.001672,0.000486,-0.0011
0.002531,0.001006,0.000236,0.00062,0.003643,0.0015,0.001496,-0.000276,0.0031,0.000974,0.001115,0.000669,0.000545,0.00121,0.004232,-0.001079,0.000604,-0.000111,0.000663,0.002163,0.001798,0.001956,0.000261,0.000454,-0.000658,0.001738,0.003437,0.000478,0.000201,0.00135,-0.001194,-0.001167,0.001169,0.001068,0.001425,0.001007,0.002028,0.002241,0.00028,0.002452,0.001832,1e-06,0.000911,0.001661,0.000655,0.001149,0.001477,0.001242,0.001614,0.00352,-0.00106,0.002376,0.002183,0.001812,0.002802,0.001591,-7.7e-05,0.000201,-0.001063,-0.000605,0.001889,0.003462,0.000831,0.002399,-0.000325,0.001257,0.002255,0.001553,0.000413,0.000484,0.000752,0.000783,0.000241,0.000897,-0.000292,0.001172,0.000927,0.001687,0.001257,0.001344,0.003295,0.000978,0.001018,0.00058,0.000741,0.001662,0.002469,0.001143,0.003174,0.000154,0.000677,-0.000813,0.000493,0.00071,0.000458,0.002332,0.002588,0.001341,0.000473,0.002884,0.001834,0.001074,0.000854,-0.002101,-0.000674,-0.002238,-0.000844,0.001705,0.000196,-0.001018,-0.000275,0.000625,0.000933,0.001648,0.002075,0.001821,0.004219,0.001128,0.000239,0.000223,0.001074
-0.002372,-0.000405,0.000732,2e-04,-0.001737,0.000555,-0.002086,0.001803,-0.000134,-0.000672,-0.001606,0.000742,-0.001741,0.00016,-0.002045,-0.000759,0.000163,0.000286,0.000374,0.000163,-0.001829,0.000371,0.000329,-1.8e-05,-7.6e-05,0.00159,-0.00221,-0.001069,0.001153,-0.00116,0.001126,0.000836,-0.001277,-0.000271,-0.001205,-0.00091,-0.002121,-0.001784,-0.001468,-0.002695,-0.001866,1e-04,-0.00054,7e-06,-0.001468,-0.001493,-0.000946,-0.001628,-0.000621,-0.001475,0.000696,-0.000809,0.000145,-8.6e-05,-0.000735,-0.000182,-5.6e-05,-0.000191,-0.000639,0.000306,-0.002145,-0.0027,-0.001368,-0.000661,-0.000227,0.000722,-0.001497,1.6e-05,-0.00012,-0.000577,-0.000366,-0.00101,-0.001207,-0.000704,0.000229,0.000223,3.7e-05,-0.000313,0.000315,-0.000944,-0.001347,-0.000826,-0.001241,-0.000384,-4.1e-05,1.5e-05,-0.001104,-0.000899,-0.000273,-0.000974,-0.000434,0.000209,-0.000932,-0.001884,0.00029,-0.000163,-0.002187,0.000405,0.000589,-0.000368,-0.001782,-0.002675,-0.001638,0.001107,0.000997,0.000717,0.001591,-0.000126,0.000486,-0.000214,-0.000671,0.000466,-0.00026,-0.000944,-0.002223,6e-06,-0.001021,0.000155,0.001287,0.000264,-0.00012
0.001247,0.000242,0.000457,-0.000347,0.000428,0.000929,0.001221,-0.000475,0.000257,0.000855,0.000409,-0.000296,0.001462,-0.001352,-0.000352,0.001142,-0.001242,0.000607,0.001138,0.000332,0.001441,-0.000893,0.00026,0.001472,6e-04,-0.001567,0.000144,0.001132,-0.000903,0.000185,-7.3e-05,-0.000454,0.00042,0.000665,0.00169,0.001689,0.001722,0.001867,0.000381,0.001472,0.001022,-0.000131,-0.000483,-0.000364,-0.000984,0.001049,0.001852,0.000804,-3.8e-05,0.00066,0.000861,0.000675,-5.4e-05,0.000971,0.000377,-0.001044,-0.000682,-0.000332,0.000819,0.000716,-0.000396,0.000209,0.000818,0.000168,0.001536,-0.000468,0.001039,0.000604,0.001015,-0.000129,0.000447,-2.1e-05,0.002294,0.000875,0.001597,-0.000779,-4e-05,0.000465,-0.000587,7.5e-05,0.000481,-0.000517,0.000577,0.000661,0.000684,8.8e-05,0.000113,0.001332,-0.000116,0.001059,0.000119,0.00012,0.000694,0.000556,0.000986,0.001127,0.001391,0.000322,-0.000841,-0.000259,0.001306,0.002755,0.002171,-0.000864,-0.001115,0.000396,5.3e-05,-0.000302,-0.00055,6.3e-05,0.001428,-0.000521,0.000306,0.000562,0.00149,-0.000192,-0.000417,-0.000746,-0.000101,6.4e-05,-0.00032
0.000388,-0.000981,-0.000804,0.000994,-0.000837,-0.001926,-0.000245,-0.000252,-0.000808,-0.000952,-0.00017,-0.000418,-0.001382,0.000659,0.000593,0.000696,0.000647,-5.6e-05,-0.000311,0.000195,0.001122,0.000515,-7.7e-05,-0.001077,0.000158,-8.5e-05,0.00078,-4.6e-05,0.000421,7.9e-05,-0.000593,0.00055,-4.9e-05,-0.00057,-0.000273,-0.001124,-0.001089,-0.00044,0.002143,-1e-04,0.000515,0.000208,0.001961,0.000336,0.001204,0.000352,-0.001178,-0.000699,-3.1e-05,-0.001111,-0.000526,-0.000448,-0.000685,-0.001131,-0.000534,0.001642,0.00074,0.000238,-0.000445,0.000191,0.001546,0.001409,0.001313,0.000322,-0.000819,0.000874,-0.000515,-0.000741,-0.000725,0.001066,-0.001047,0.000642,-0.001385,8.3e-05,-0.001393,-0.00018,-0.000134,3.7e-05,0.000829,0.001103,-0.000578,0.000593,-0.001391,-0.000381,-0.000353,0.000201,0.001103,-2.8e-05,-0.00069,1e-04,0.000479,-0.000456,-0.000273,-4.9e-05,-0.001894,-0.000553,-0.000639,-0.000581,-0.000678,-0.000499,-0.000333,-0.000244,-0.000718,3.9e-05,0.000856,-3e-05,-0.000781,0.000512,-0.000821,0.000302,-0.000508,0.000257,-0.00018,-0.00108,-0.000485,-0.00097,-0.000376,0.001032,0.000426,6.4e-05,0.000844
-0.000534,0.001588,0.001013,-0.00032,0.000594,0.001841,-0.000211,0.000259,0.000511,0.001481,0.000553,0.000506,0.000812,0.00053,-0.000153,-0.00155,-9.7e-05,-0.000501,-0.000844,-0.000705,-0.000826,-0.000335,-0.000499,0.000308,-0.001088,-0.000611,-0.000369,-0.00045,-0.001136,0.000175,-0.000241,-0.000615,0.000171,0.000251,-0.000457,3.9e-05,0.000332,-0.001098,-0.002153,-9e-04,-0.001552,-4.7e-05,-0.001123,-0.000364,-0.000146,-0.000535,0.000161,0.000848,0.001305,0.001358,0.000886,0.000773,0.000419,0.000641,0.000638,2.2e-05,4.1e-05,-0.000352,0.000324,-0.000788,-0.00123,-0.000955,-0.001683,-0.000472,-0.000373,-0.000223,0.000946,0.000536,-3.8e-05,-0.001279,0.000648,-0.000353,0.000427,-0.00061,-4.5e-05,0.000551,-0.00028,-0.001025,-0.000395,-0.001307,0.000681,-0.000463,0.00065,-0.000161,-0.000286,-0.00033,-0.000301,-0.000659,0.000797,-0.000182,-0.000492,4e-05,-9.4e-05,-0.000379,0.001515,-0.000862,0.000768,0.001268,0.001705,0.000101,0.000721,-0.000305,-0.000298,0.00053,-0.001433,-0.000403,0.000534,0.000653,0.001675,0.000299,-2e-06,0.000228,-0.000373,0.000892,0.000428,0.001105,0.000199,0.000309,-0.000427,-7e-06,-0.000929
9.7e-05,-0.001117,-0.000601,0.000124,-7.4e-05,-0.000419,-0.000157,0.000569,0.000368,-0.001078,-0.000317,-0.000236,-0.000631,-0.000693,0.000128,0.000776,-8.4e-05,0.000321,-0.000352,-0.000127,-0.000357,0.00045,0.000528,-0.001089,0.000758,-1.2e-05,-0.000256,-0.000155,0.001299,0.00056,0.000989,-1.4e-05,0.000216,-0.000653,0.000749,-9.7e-05,-0.000432,-1.3e-05,0.000426,0.000829,0.000923,0.000609,0.000699,1.7e-05,-0.000458,0.000737,0.000288,-0.000185,-0.001488,-0.000134,-0.000829,-0.001497,4e-06,-0.000816,0.00028,-5.4e-05,9.7e-05,-0.000244,-0.000929,0.000758,0.001638,-0.000174,6.1e-05,-0.000193,9e-05,-0.000782,-0.000292,-0.000502,-0.000144,0.00089,0.000428,-0.000206,3.6e-05,0.000537,0.000631,-0.000338,0.000702,0.0013,-0.000285,0.000244,-0.000704,0.000409,0.000534,0.000681,0.000917,-0.00038,-0.000551,-0.000299,-0.001215,-0.000144,1.7e-05,0.000426,0.000396,0.000365,-0.000269,0.000476,-0.000703,-0.00089,-0.00099,2.3e-05,-0.001152,-0.000573,0.000378,0.000365,0.00106,-0.000205,-0.000825,-0.001071,-0.000218,-0.000531,-0.000217,-0.000519,0.000327,7.4e-05,-0.000246,-0.001029,7.9e-05,-0.000818,-0.000288,0.000261,-3.2e-05
-0.000479,0.000139,7.3e-05,-0.00042,-6.9e-05,-0.000214,-0.000819,-0.001199,-0.000184,1.5e-05,3e-05,-9.9e-05,0.000221,0.000728,-0.000425,0.00016,0.000822,0.000627,0.000389,0.000652,-0.000164,-0.00077,-0.000297,0.000667,0.000287,0.001075,-0.000418,0.000376,-0.000292,-0.000579,0.000162,0.000641,-0.000271,0.000539,-0.000789,0.000157,0.000607,0.000381,-0.000347,0.000276,-0.000378,-0.001055,-0.000561,-0.000207,0.000492,-0.000577,-0.000735,-4.9e-05,0.000463,4.7e-05,0.000244,0.001191,1.8e-05,0.00074,4.3e-05,-0.000726,-6e-05,-6.1e-05,0.000307,-0.000373,-0.001215,0.000456,0.000763,0.000562,0.000567,0.000446,-0.000714,0.000237,0.000514,-0.00089,0.000318,0.00041,-8.3e-05,-0.000171,-0.000481,9e-04,0.000144,-0.000698,-3.8e-05,-0.00026,-0.000264,-0.000724,-0.001044,2e-06,-0.000126,0.000182,8.7e-05,0.00014,0.001158,7.6e-05,0.000296,-0.000568,-0.000697,0.000167,-0.000443,-0.000145,4.6e-05,-6.4e-05,0.000334,-0.000216,0.00021,-2e-06,0.000268,-0.000812,-0.00086,0.000207,0.000647,0.000167,-0.000799,0.00022,0.000291,3.7e-05,9.5e-05,1.5e-05,0.000261,0.001011,-0.000274,0.000101,-0.000248,-0.000314,-7.4e-05
0.000218,-0.000282,-4.7e-05,8.2e-05,0.000247,0.000197,0.001021,0.001238,-2.8e-05,0.000271,-0.000328,3.4e-05,0.000683,-3e-05,0.000346,7.4e-05,-0.000657,-0.000955,-5.9e-05,-0.000537,0.000114,0.000871,-0.000115,-0.00028,-0.000251,-0.000808,0.00028,-0.000122,-3.5e-05,0.000259,-0.000406,-0.000698,0.000138,-0.000593,0.000249,-0.000561,-0.000686,-4.9e-05,0.000688,-0.000594,-2e-06,0.000464,-0.000226,1.2e-05,0.000221,0.000215,0.000316,-0.000383,-0.000177,-5.9e-05,-0.000664,-0.000644,-0.000606,-0.000778,-0.000489,0.000462,-7.1e-05,0.000257,9.6e-05,-0.000547,0.000205,0.000459,-0.000516,-5.7e-05,-0.000467,-0.000196,0.000621,-0.000424,8.5e-05,0.000681,-0.001067,-0.000508,-0.000281,-0.000325,0.000127,-0.000402,-0.000379,0.000256,0.000215,0.000629,0.000506,0.000651,0.000938,2e-06,-0.00042,0.000178,-0.000358,0.000464,-0.000322,0.000663,-0.000486,0.000321,0.00061,-0.000253,0.000347,0.000308,0.000148,-1.7e-05,-0.000188,0.000141,0.00041,-2.1e-05,-0.000735,0.000263,-0.000135,-8.4e-05,0.000302,0.000281,-0.000167,0.000289,-0.000264,0.000474,8.4e-05,-0.000206,-5.5e-05,-5.3e-05,-0.000241,0.000222,0.000187,-0.000206,0.000139
0.000133,0.000234,-7.7e-05,0.000201,-0.000407,-9.6e-05,0.000282,-0.000271,-8.8e-05,0.000166,0.00032,-0.000153,-0.000498,-0.000338,6.6e-05,-0.000327,-8.7e-05,0.000443,0.000164,0.000107,4.3e-05,-0.000392,0.000149,0.000554,-0.000202,0.000599,0.000432,0.000193,-0.000157,-0.000305,-0.000218,0.000763,-0.000571,0.000683,-0.000101,0.000417,0.000495,0.000178,-0.000463,-0.000177,0.000109,0.000106,8.2e-05,0.000251,-5e-04,-0.00047,0.00039,0.000441,0.000159,-0.000102,0.001017,0.000239,0.000834,0.000398,0.00011,-0.000294,2.8e-05,0.000142,0.000169,0.000544,-0.000238,-0.000196,-0.000309,-0.00047,2e-06,6.7e-05,-0.000647,0.000548,-0.000313,-0.00033,9.7e-05,0.000471,0.000112,0.000341,-0.000251,-0.000792,-6.7e-05,-0.000206,5.1e-05,5e-05,0.000218,-0.000402,-1.1e-05,-0.000333,0.000105,-4.9e-05,0.000586,-0.000348,-0.000318,-0.00063,0.000337,-5.7e-05,-0.000553,0.000267,-4e-04,-0.000214,0.000296,0.000358,7.5e-05,0.000513,0.000212,2e-06,0.000106,-0.000141,0.001441,0.000551,5.7e-05,-0.000406,0.000577,-9.2e-05,0.000288,-0.000413,-0.000247,-0.000141,-2.9e-05,0.000302,0.00031,0.000461,0.000325,1.2e-05,0.00022
4.9e-05,-0.00043,-1.5e-05,0.000389,0.000166,-0.000144,-0.000519,-0.000158,-0.000142,-0.000404,-0.000644,6.4e-05,0.000212,0.000123,-0.000438,0.000222,0.00028,1.1e-05,8.9e-05,-4e-05,-0.000356,-0.000114,-1.1e-05,-0.000221,0.000378,-5.4e-05,-0.000112,-0.000279,0.000417,0.000216,0.000221,-0.000684,0.000712,-0.000176,5.9e-05,6e-05,-0.000233,-0.000192,0.000314,0.000475,-8.7e-05,4.3e-05,-0.000135,-0.000456,-1.1e-05,7.1e-05,-0.000813,-5.1e-05,-5.4e-05,4e-05,-0.00042,0.000184,-0.000502,0.000142,7.4e-05,0.000333,-0.000259,-0.000375,-6e-06,-0.000184,0.000386,-8.1e-05,0.00034,0.000292,0.000152,0.000502,0.000371,-0.00014,2.5e-05,0.000116,0.000463,-0.000239,0.000431,1e-05,0.000362,0.000394,0.000398,-1.6e-05,-3.8e-05,-0.000114,-0.000251,0.000435,-0.000305,0.000237,4.8e-05,-3e-06,-0.000323,3.8e-05,2.4e-05,4.1e-05,-3.2e-05,-0.000154,0.000284,-0.00029,-0.000273,8.4e-05,-0.000109,-0.000292,-0.000106,-0.000717,-0.000316,-0.000109,0.000181,-5.8e-05,-0.000931,-0.000559,-0.000346,0.000257,-0.000371,-0.000276,-0.000268,0.000278,-1.7e-05,0.000564,-0.00016,-0.000482,-2e-05,-0.000539,-0.000247,0.00026,-9.8e-05
-0.000331,0.000252,2.5e-05,-0.000518,-0.000158,-9e-06,0.000144,-0.000208,-8.1e-05,3e-05,0.000294,0.000176,-0.00013,4e-05,0.000389,0.000179,-0.000302,-0.000241,-0.000405,0.000119,0.000144,-0.000226,-9.2e-05,-0.000355,-0.000509,-0.000413,-2.1e-05,-2.5e-05,-0.000549,2.8e-05,-0.000139,0.000262,-0.000118,0.000144,-3.4e-05,-0.000315,5.5e-05,0.000131,-0.000635,-0.000264,0.000313,-0.000188,2.3e-05,2e-04,0.000185,-1.7e-05,0.000189,-3.1e-05,6e-06,-0.000281,-0.000189,0.000106,0.000215,2.2e-05,2.9e-05,-0.000509,0.000134,0.000181,-0.000156,-4.9e-05,6e-05,-0.000326,0.000126,3.1e-05,4.2e-05,-0.000355,0.000351,0.000104,0.000131,5e-06,-0.000384,-0.000196,-0.000399,-0.000265,-0.00023,0.000238,-0.000454,0.000141,-0.000153,3.5e-05,-6.1e-05,-0.00023,0.000168,1.1e-05,3.3e-05,0.000116,0.000319,0.000206,3e-04,-1.1e-05,0.000156,0.000293,-0.000167,0.000118,0.000352,2e-04,-0.00022,-8.1e-05,0.000156,0.00043,0.000113,0.000466,7.5e-05,0.000245,-0.000208,0.000329,0.000173,3e-06,-2.2e-05,0.000279,0.000215,-3.3e-05,0.000133,-0.00033,-1.3e-05,0.000224,5.5e-05,7.2e-05,-9.5e-05,-0.000187,-0.000152
0.000101,6.9e-05,-4.5e-05,0.000176,0.000392,7e-05,0.000108,0.000205,0.000232,-6.7e-05,0.000134,-1e-04,0.000271,-0.000113,-0.000317,-0.000124,0.000141,0.00012,8.2e-05,-5e-06,8.9e-05,0.000512,7e-05,0.000411,0.000395,0.00017,-0.000131,0.000132,0.000511,-0.000219,-5.3e-05,0.000249,-0.000365,-0.000353,0.000113,0.000267,7.1e-05,-8.2e-05,0.000331,0.00011,-0.000341,0.000143,9e-05,-2.9e-05,-0.00014,6.4e-05,0.00016,8.3e-05,-2e-04,0.000257,-6.7e-05,-0.000262,4.6e-05,-0.000132,-1.8e-05,5.3e-05,-0.000214,0.000161,0.000182,-0.000148,-8.2e-05,0.000275,-9.7e-05,8e-06,-0.000158,-0.000267,-0.000531,-0.000329,-0.000152,5.7e-05,0.000348,0.000169,4.2e-05,5.1e-05,7.3e-05,-0.000266,0.000334,-0.000179,3.1e-05,-9.8e-05,-3.8e-05,0.000158,2.1e-05,-0.000149,-6.9e-05,-0.000234,-0.000194,-7.1e-05,-0.000297,6e-06,-0.000203,-8.6e-05,0.000137,-5.1e-05,-0.000173,-0.000396,-1.4e-05,8e-06,-0.000109,-0.00024,7.8e-05,-0.000273,-2.6e-05,-1.2e-05,0.000362,2.8e-05,-5.6e-05,-0.000115,0.000231,4e-05,-0.000177,-8.4e-05,-4.5e-05,-3.4e-05,9.1e-05,-0.000208,0.00011,-6.7e-05,0.000177,9.9e-05,0.000133
0.000112,-0.000134,2.2e-05,8.2e-05,-0.000195,-5.6e-05,0.000112,-0.000187,-5.1e-05,2.6e-05,-3.7e-05,3e-06,-9.9e-05,0.000157,4.7e-05,-0.000167,-6.7e-05,-1.7e-05,0.00028,5.4e-05,-2e-06,-0.00031,-4.3e-05,-7.7e-05,-0.000234,-2.1e-05,7.7e-05,-9.2e-05,-0.000295,0.000115,0.000207,-0.000101,0.000285,0.000327,1.8e-05,-0.000163,-0.00014,-3.9e-05,1.4e-05,-6e-06,4.1e-05,-7.3e-05,-0.000106,1.3e-05,0.000205,8.7e-05,2e-06,-0.000151,0.00018,0.000194,8.9e-05,4.2e-05,-8.9e-05,-0.000107,-7.4e-05,9.9e-05,0.000201,-0.000108,-0.000121,8.9e-05,-8.8e-05,-7.3e-05,-1.5e-05,-3.2e-05,-9e-06,0.000261,0.000201,0.000381,-1e-06,-8.8e-05,-0.000367,0.000138,6e-05,0.00022,2.4e-05,0.000238,-8.4e-05,1.5e-05,0.000108,3.2e-05,2e-06,-0.00023,-3.2e-05,-2.8e-05,-0.000109,0.000248,0.000107,-0.000127,0.000272,-2.2e-05,3.4e-05,-0.000131,-0.000177,1e-04,-6.7e-05,7.8e-05,-6.4e-05,9e-05,3.6e-05,-0.000113,1.5e-05,5.6e-05,5.3e-05,-0.000214,-0.000275,-5.6e-05,3.2e-05,9e-06,-0.00011,-9.2e-05,0.000144,1e-05,-2.2e-05,0.000132,7.3e-05,9.5e-05,-7.8e-05,0.000238,2.3e-05,-3.6e-05,-3.8e-05
-6.4e-05,0.00018,-2.7e-05,-3e-06,-4.6e-05,-6.3e-05,-8.7e-05,5.6e-05,8e-06,0.000152,3e-05,-4.5e-05,-0.000122,-0.000212,0.000118,0.000126,5.3e-05,2.8e-05,-0.00013,-9.7e-05,0.000124,0.000205,3.7e-05,-8.6e-05,0.000178,-0.000122,1.6e-05,3.5e-05,0.000128,1.3e-05,-0.000139,-2e-05,-0.000303,-0.000304,-1e-05,0.000167,6.6e-05,4.5e-05,7.8e-05,-2.2e-05,0.000176,2.6e-05,0.000123,0.000132,-0.000102,-2.6e-05,2.8e-05,0.000119,4.8e-05,-3e-04,7.7e-05,8.3e-05,0.000119,0.000208,3.9e-05,7.9e-05,-6.9e-05,2.2e-05,5.5e-05,0.000111,-2.6e-05,-1.4e-05,8.2e-05,-7.6e-05,0.000166,-1e-06,-1.8e-05,-0.000319,4.6e-05,0.000196,0.000199,5.3e-05,6.2e-05,-0.000209,-8.2e-05,-0.00017,-5.5e-05,9.8e-05,-8.5e-05,4e-06,7.3e-05,0.00012,3.7e-05,3.6e-05,6.8e-05,-0.000218,-4.2e-05,-8e-05,-9.3e-05,-5.3e-05,0.000196,-3e-05,-9e-06,4.4e-05,0.000102,0.000129,0.000125,0.000103,-8.2e-05,0.000257,-5.8e-05,-7.6e-05,1.8e-05,0.000135,0.000158,-0.000115,-7.6e-05,2.2e-05,-0.000163,-7e-05,-0.000162,-0.000115,5e-05,-0.000132,-5.8e-05,2.4e-05,-8.6e-05,-0.000143,-6.1e-05,-7.8e-05,4.8e-05
3.7e-05,-0.000147,-3.2e-05,-7.7e-05,-1.5e-05,6.4e-05,-0.000167,1.7e-05,-6.3e-05,-0.000109,-0.000115,-2e-05,0.000135,6.3e-05,-0.000173,6.9e-05,5e-06,3.1e-05,-3.8e-05,2e-05,-4.4e-05,5e-06,4.9e-05,8e-05,-0.000117,0.000134,2.7e-05,-4.5e-05,-9.2e-05,-1e-05,8e-06,-0.000114,0.000356,0.000106,-3.6e-05,-6.2e-05,-8.1e-05,3e-06,-0.00012,3.6e-05,-0.000207,-3.9e-05,-5.5e-05,-1.1e-05,-5.4e-05,4.3e-05,-3.6e-05,-2.7e-05,-0.000181,0.000105,-0.000111,-0.000118,-5.6e-05,-0.000185,-6.7e-05,-5e-05,6.1e-05,-1.9e-05,-7.5e-05,-0.000104,2.1e-05,3.7e-05,0.000128,0.000118,-7.3e-05,-5.1e-05,-3.2e-05,0.000115,5.9e-05,-0.000205,-0.000272,-0.000118,-3.6e-05,0.00011,7.9e-05,-2e-06,-6.9e-05,-4.7e-05,-1.2e-05,-6.4e-05,1e-06,-2.8e-05,-1.1e-05,2.7e-05,4.8e-05,0.00013,9.5e-05,0.000164,-8.4e-05,2.3e-05,-5.7e-05,0.000115,0.00011,-9.4e-05,8.9e-05,-0.000178,-1.7e-05,-3.4e-05,1.8e-05,-0.000107,-7.1e-05,0.000146,5e-06,8.4e-05,1.9e-05,0.000111,7.8e-05,-9.2e-05,0.000183,-1.5e-05,9.4e-05,9e-05,-7e-06,6e-06,-7.4e-05,6.4e-05,6e-05,-8.9e-05,3.4e-05,5.2e-05,-4.2e-05
-0.000122,1.9e-05,1.9e-05,-5e-06,-1e-04,-2.7e-05,5.3e-05,3.2e-05,4.7e-05,1.1e-05,0.000139,7e-06,-5.4e-05,1.1e-05,0.000176,-1.2e-05,-3.9e-05,-7.3e-05,2.8e-05,5.6e-05,-1.8e-05,-2.3e-05,-2e-06,-0.000141,4.1e-05,2.8e-05,-3.9e-05,2.7e-05,4.9e-05,5.1e-05,-3.6e-05,0.000128,-0.000178,-4e-05,-4.5e-05,-5.5e-05,0,2.9e-05,4.7e-05,3.7e-05,-2.9e-05,8.8e-05,2.8e-05,-5.4e-05,-2e-06,-1e-05,0.000176,1.2e-05,0.000122,-7.6e-05,0.000131,0.000179,-9.5e-05,2.9e-05,4.6e-05,4.8e-05,-6.2e-05,-5.4e-05,3.6e-05,4.4e-05,0.000112,-7.4e-05,-0.000112,-6.2e-05,-8.5e-05,3.4e-05,7.4e-05,-1e-06,-1.5e-05,0.000186,0.000201,-9.9e-05,-0.000154,-1.9e-05,5e-06,-6e-06,9.6e-05,2.7e-05,2e-05,9e-06,-1.6e-05,3.4e-05,9e-06,-7.4e-05,-1.3e-05,-0.000103,-0.000138,1.2e-05,0.000113,-2.4e-05,-5.5e-05,4.7e-05,-7.7e-05,3.5e-05,-9.6e-05,7.8e-05,1.8e-05,-8.4e-05,1.5e-05,3.4e-05,0.000106,-1e-05,-6e-05,-7.3e-05,-2.7e-05,5.2e-05,-0.000105,2.3e-05,8.2e-05,6.1e-05,-8.4e-05,5.4e-05,3.2e-05,5.3e-05,7.1e-05,-0.000117,-4.5e-05,-3.1e-05,-4.7e-05,-1.3e-05,-2.6e-05
6.2e-05,3e-05,1.2e-05,-4.2e-05,0.000107,6e-06,5.3e-05,-0.000112,2.7e-05,1.3e-05,-5.2e-05,2e-06,0.000113,4.4e-05,-9.7e-05,-9.1e-05,-3.2e-05,3.3e-05,6.6e-05,-5.4e-05,0.000114,-1.1e-05,-5e-06,0.000194,-0.000104,-3.6e-05,-4.8e-05,6e-06,-5.1e-05,-2.1e-05,0.000114,-2.7e-05,-7.5e-05,8.4e-05,6.3e-05,0.000127,3.1e-05,-1.3e-05,-3.3e-05,-7.4e-05,0.00023,-9.9e-05,4.9e-05,5.5e-05,3.2e-05,-1.6e-05,-0.000198,2.4e-05,4e-06,-8e-06,-0.000125,-9.8e-05,0.000108,9e-06,1.9e-05,-6e-05,3.7e-05,2.8e-05,3.5e-05,3.8e-05,-5e-06,0.000141,-5.3e-05,-2e-05,3.7e-05,-4.1e-05,-4.6e-05,3.2e-05,-3e-05,-0.00016,4.5e-05,9.3e-05,0.000162,-4.4e-05,-5.9e-05,-5e-06,-4.3e-05,-1.9e-05,2e-05,5.9e-05,-4.2e-05,-2.3e-05,-0.000159,-5e-05,2.3e-05,9.2e-05,4.7e-05,-0.000101,-0.000136,1.7e-05,6e-06,-8.3e-05,4.6e-05,-1.5e-05,-1e-05,-4e-06,-6.9e-05,7.9e-05,1.5e-05,1.6e-05,-4.3e-05,-9.7e-05,3.2e-05,2.7e-05,-3e-06,2.5e-05,1e-04,4.6e-05,-0.000238,7.8e-05,0.000107,-5e-06,-7.2e-05,4.5e-05,-3e-05,4.5e-05,5.1e-05,4.9e-05,2.2e-05,4.2e-05,4.1e-05
3.6e-05,1.9e-05,-2.1e-05,6.2e-05,-8.3e-05,7.3e-05,0.000129,0.000101,-8e-06,6.7e-05,4.7e-05,-9e-06,-0.000121,-0.00011,-1.4e-05,3.8e-05,3.8e-05,3.3e-05,-2e-05,-9e-06,-8.9e-05,-7.6e-05,-1.8e-05,-0.000103,0.000148,4.5e-05,8.5e-05,1.7e-05,8.9e-05,-5e-06,-4.4e-05,-6e-05,0.000203,-3e-06,-1.3e-05,-0.000137,-2.3e-05,-3e-06,0.000128,4.3e-05,-0.000223,2.7e-05,-6.2e-05,-0.000106,-6.2e-05,3.2e-05,8.1e-05,-7.2e-05,-6.5e-05,4.5e-05,9.8e-05,2.2e-05,-3.9e-05,9e-06,-1.9e-05,6.5e-05,-4.1e-05,-1.1e-05,-5.2e-05,-3.5e-05,-3e-05,-0.000126,6.2e-05,2.4e-05,0.00011,1.6e-05,-2e-06,-0.000108,1.4e-05,9.5e-05,-3.8e-05,4.2e-05,-5.7e-05,-5e-06,5.9e-05,6.1e-05,1.4e-05,1.5e-05,1.3e-05,-9e-06,7.4e-05,1.4e-05,0.000204,9.2e-05,-3.7e-05,-7e-06,-4.1e-05,2.9e-05,4.8e-05,-6.7e-05,2.7e-05,3e-05,-4.9e-05,6e-06,0.000129,2.2e-05,5.8e-05,-2.2e-05,4.6e-05,-6.8e-05,3.7e-05,2.7e-05,-1.9e-05,-4.6e-05,-2e-06,-0.000104,-0.000109,-6.1e-05,0.000133,-7e-05,-8.7e-05,1e-06,5.8e-05,-1e-04,1.7e-05,-1.5e-05,9e-06,0.00011,9e-06,-8e-06,-2e-05
-3.7e-05,-3.8e-05,1.4e-05,8e-06,0.000109,-2.6e-05,-7.3e-05,-3.8e-05,4e-05,-4.5e-05,-4.5e-05,1e-05,6.5e-05,1e-04,8.7e-05,1.6e-05,-1.8e-05,-5.8e-05,-8.7e-05,2.4e-05,-8.3e-05,0.000111,1.7e-05,-1e-05,-9.6e-05,-9.6e-05,3.1e-05,-4e-05,-9.1e-05,-4e-06,3.6e-05,7e-06,-0.000216,-3.1e-05,-1.2e-05,7.8e-05,-4e-06,1.7e-05,-0.000113,2.3e-05,0.000134,2e-05,1.5e-05,5.5e-05,7.7e-05,-4.3e-05,3.3e-05,3.1e-05,3.9e-05,7.9e-05,3.4e-05,-1.5e-05,-6.6e-05,3e-06,5e-06,1e-05,6.4e-05,-5.7e-05,2.6e-05,-1e-06,-5.3e-05,2.8e-05,4.6e-05,-2.3e-05,-6.5e-05,4.3e-05,-5.3e-05,0.000134,1.2e-05,-5.6e-05,5.1e-05,-2.3e-05,1.6e-05,7.7e-05,-4.4e-05,6.1e-05,8e-06,2.6e-05,-1.9e-05,1.8e-05,-5.1e-05,-1.8e-05,-4.2e-05,-2.9e-05,9e-06,-6.8e-05,3.7e-05,8.1e-05,3.9e-05,6.4e-05,-3e-05,-2.9e-05,1.9e-05,2.2e-05,-0.000104,-2e-06,-3.3e-05,-2e-05,-5.9e-05,6e-05,-5.8e-05,-2.4e-05,8e-06,-8e-06,3.8e-05,4.8e-05,9.9e-05,3.7e-05,3.6e-05,-6.6e-05,5.4e-05,-6e-06,-1.3e-05,1.6e-05,3e-06,-2.1e-05,-5e-06,-0.000111,-1e-06,-3.5e-05,-1.8e-05
1.1e-05,-5e-06,1.4e-05,-3.7e-05,-7.8e-05,2e-06,-4.8e-05,2.8e-05,-2.2e-05,1e-05,-5.6e-05,2.1e-05,1.9e-05,-6.3e-05,-0.000114,-1.8e-05,-3e-06,3.8e-05,2.8e-05,-2.1e-05,3.4e-05,-0.000163,-6e-06,7.2e-05,3.9e-05,3.8e-05,-4e-05,3.2e-05,0.000128,5e-06,-4e-05,6.2e-05,1e-04,1.9e-05,7e-06,-3.3e-05,1e-05,-1e-05,-6e-06,-5.2e-05,-5.2e-05,-2e-06,-3e-06,-2e-05,-3e-05,-9e-06,-9.2e-05,-4.1e-05,3.1e-05,-5.8e-05,-4e-05,0,5.3e-05,1.2e-05,-7e-06,-1.4e-05,-2.8e-05,5.8e-05,-1.4e-05,1e-05,4e-06,2.7e-05,-6.7e-05,4.6e-05,-6.1e-05,-6.6e-05,8.9e-05,-4.1e-05,-1.8e-05,2.6e-05,-0.000151,-3.5e-05,-2.9e-05,-8.8e-05,5.5e-05,-0.000132,-2.1e-05,-2.3e-05,-1.6e-05,-4.4e-05,1e-05,3.7e-05,-6.8e-05,-4e-05,3.1e-05,8.8e-05,7e-06,-1.6e-05,-1.8e-05,1.5e-05,-1e-05,-6e-06,1e-06,6e-06,1.8e-05,-4.8e-05,-2.5e-05,-3e-06,4.4e-05,-5e-06,2e-05,5e-05,-2.3e-05,1.2e-05,-1.2e-05,5.1e-05,-8.9e-05,1.4e-05,-8.6e-05,3.9e-05,-1.7e-05,-2.9e-05,-3.4e-05,6.3e-05,-2.2e-05,2.1e-05,1e-06,8e-06,-8e-06,2e-05,2e-06
-3.4e-05,3.6e-05,-2.7e-05,-1.7e-05,2.4e-05,2e-05,6.6e-05,-1.1e-05,8e-06,-1.6e-05,7.6e-05,-1e-05,-5.5e-05,3.5e-05,1e-04,-2.2e-05,4.3e-05,-1e-06,2.4e-05,9e-06,-6e-06,0.000193,-1.3e-05,-0.000109,-1.6e-05,3e-05,-4.4e-05,1e-05,-0.000123,-4e-06,4e-05,-2.3e-05,3.8e-05,-4.2e-05,-1.4e-05,0,-2.2e-05,-2e-06,-1.3e-05,5.4e-05,1.8e-05,-2.1e-05,-2.6e-05,3e-06,1e-05,-3.2e-05,6.3e-05,4.8e-05,-7e-05,-3.7e-05,-7.5e-05,-5.2e-05,-2.8e-05,4.6e-05,2.3e-05,-7e-06,3.2e-05,2e-06,1.7e-05,1.2e-05,7.6e-05,-3.5e-05,-1.3e-05,-3.9e-05,7e-05,1.9e-05,-3.3e-05,-5.1e-05,0,-1.6e-05,0.000143,-2e-05,2.2e-05,6.7e-05,-4.2e-05,1.6e-05,1.2e-05,-1.2e-05,2e-05,-3e-06,2.3e-05,-4.2e-05,0.000125,5.2e-05,-2e-06,-0.000104,-1.5e-05,-7.1e-05,-4.7e-05,-1.1e-05,1.1e-05,3.9e-05,-2.6e-05,-1.3e-05,1.9e-05,7.2e-05,3.1e-05,1.8e-05,-5.3e-05,-3e-05,4e-06,-6e-06,2.2e-05,6.1e-05,-5.2e-05,-1.1e-05,8.2e-05,-2.6e-05,2.5e-05,4.4e-05,2.1e-05,-1.7e-05,6.1e-05,-5.7e-05,4.6e-05,5e-06,5e-06,-3.7e-05,-4e-06,2.1e-05,-1.4e-05
5.1e-05,-6e-05,2.1e-05,5.1e-05,2e-06,-1.2e-05,-1.9e-05,2.8e-05,-2.2e-05,0,-9e-06,-4e-06,2.2e-05,-1e-05,-5.6e-05,2.9e-05,-2.7e-05,-1.2e-05,-2.5e-05,9e-06,2.2e-05,-0.000122,-2e-06,0.000134,3.6e-05,-6.5e-05,-1.2e-05,-2e-05,6.3e-05,1.2e-05,-7e-05,-4.8e-05,-6.8e-05,4.4e-05,2.6e-05,1.2e-05,2.8e-05,4e-06,7.1e-05,-9e-06,-3e-06,4e-06,4.1e-05,2.2e-05,-3.8e-05,2.1e-05,4e-06,-7e-06,4.8e-05,3.4e-05,4.1e-05,5.5e-05,2.7e-05,-6.9e-05,-3e-06,-2e-05,-2.7e-05,6e-06,-2.7e-05,-1.4e-05,-1.3e-05,6.3e-05,1.8e-05,6e-06,3.3e-05,1.5e-05,-2.5e-05,5.1e-05,7e-06,2.7e-05,-7.5e-05,5.2e-05,7e-06,-3.8e-05,-8e-06,4.6e-05,-3e-05,2e-05,-4e-06,1e-05,-2.3e-05,3.4e-05,-9.8e-05,1.3e-05,-6e-06,8.7e-05,-1.3e-05,5e-06,0.000117,2e-06,2.5e-05,-5e-06,4.5e-05,1e-06,-5.5e-05,-6.9e-05,-5e-06,-2.1e-05,5.3e-05,4e-05,-2e-06,-3.3e-05,-4e-06,-5.9e-05,8.2e-05,-4.4e-05,-6.6e-05,2.1e-05,6.8e-05,-8e-06,-2e-06,5.3e-05,-4.8e-05,1.5e-05,-3.3e-05,1.2e-05,-1e-05,0.000119,4.4e-05,-2e-06,3.4e-05
-2e-06,4e-05,-4e-06,-3.5e-05,-1.3e-05,-1.3e-05,-1.3e-05,-1.4e-05,-2.2e-05,2e-05,1.3e-05,4e-06,-4.2e-05,1.2e-05,-2e-06,1.9e-05,-4e-06,8e-06,-1e-06,-1.9e-05,-3e-06,6.9e-05,1.5e-05,-0.000103,-7.4e-05,7.2e-05,3.7e-05,1.2e-05,-2.6e-05,-1e-05,5.1e-05,5e-05,2.4e-05,-7.3e-05,-3e-06,-3.2e-05,-3e-06,3e-06,-1e-05,-2.5e-05,6e-06,9e-06,-2.7e-05,1e-06,3.1e-05,-6e-06,-4.6e-05,-2.4e-05,-1e-06,-5.2e-05,9.3e-05,-2.3e-05,-3e-05,3.3e-05,-9e-06,2e-06,5e-06,-7e-06,5e-06,-1.2e-05,1.4e-05,-4.9e-05,3.3e-05,1.7e-05,-5.6e-05,-2.5e-05,6.4e-05,-1.2e-05,5e-06,-4.6e-05,8.2e-05,6e-06,-3.9e-05,1e-05,4.3e-05,-4.6e-05,2.7e-05,-3e-06,-3e-06,4e-06,2e-06,-3.8e-05,-2.3e-05,-1.9e-05,-1.2e-05,-6.4e-05,7e-06,5.1e-05,-0.000132,-5e-06,-3.2e-05,-4e-06,-3.9e-05,-7e-06,0,1.9e-05,5.1e-05,-2e-06,-3.6e-05,-2.8e-05,3e-06,3.8e-05,3e-06,7e-06,-4.7e-05,1.2e-05,5.4e-05,5e-06,-5.8e-05,-3.1e-05,-1.1e-05,-2.9e-05,1.2e-05,2e-05,-9e-06,-4.6e-05,4e-06,-3.9e-05,-1.9e-05,-2e-06,1e-06
0,1e-05,-1.9e-05,2.7e-05,5.5e-05,-4e-06,-6.1e-05,4.5e-05,2.7e-05,-1.4e-05,-3.4e-05,-5e-06,4.7e-05,-3.9e-05,5.4e-05,-3e-05,1.2e-05,1e-06,3e-06,1.7e-05,-2e-05,-0.000111,-6e-06,3.7e-05,7.2e-05,-9e-06,1.1e-05,-2.3e-05,2.5e-05,-5e-06,-2e-05,-3.6e-05,2e-06,7.7e-05,-6e-06,5.2e-05,-8e-06,3e-06,-2.9e-05,3.2e-05,-2e-05,-4e-06,6e-06,-1.3e-05,-2.5e-05,-5e-06,3.9e-05,1e-05,-3.8e-05,6.4e-05,-7.9e-05,-7e-06,9e-06,-2e-05,4e-06,8e-06,-2.1e-05,-4e-06,2.2e-05,2.2e-05,-8.3e-05,8e-06,-3.4e-05,-1.4e-05,-2.9e-05,2.2e-05,-8.7e-05,-1.3e-05,-3e-06,5.6e-05,-4.8e-05,-3.4e-05,5.4e-05,2e-06,-4.1e-05,5.1e-05,-3e-06,-9e-06,3e-06,-1.5e-05,0,3.6e-05,4.8e-05,9e-06,3e-06,4.7e-05,1.5e-05,-1.4e-05,8.3e-05,7e-06,-1e-05,-2.5e-05,1.9e-05,9e-06,3.2e-05,2.7e-05,-2.8e-05,1.4e-05,2.7e-05,3.8e-05,-1.9e-05,-4e-06,2e-06,-4e-06,-2e-05,3.8e-05,-3.4e-05,-2.5e-05,-4.5e-05,-1.3e-05,1.6e-05,1.4e-05,1.7e-05,-2.2e-05,1.5e-05,6e-05,-9e-06,-3.3e-05,-1.2e-05,-6e-06,-5e-06
-1.8e-05,-3.7e-05,1.7e-05,-1.3e-05,-6.7e-05,0,1.7e-05,-3.1e-05,-5e-06,-1.4e-05,7e-06,-6e-06,-3.9e-05,5e-05,-8.7e-05,-1.4e-05,-4.3e-05,-5e-06,-3e-06,9e-06,6.1e-05,8.4e-05,-4e-06,-9e-06,-4.1e-05,-3.2e-05,-1.6e-05,2.3e-05,-4.4e-05,7e-06,3.6e-05,6.1e-05,-8e-06,-5.2e-05,1.4e-05,-4.7e-05,4e-06,-9e-06,-4e-05,-9e-06,2.4e-05,-7e-06,9e-06,2.4e-05,3.4e-05,2.3e-05,-2.2e-05,-2e-05,4.2e-05,-4e-06,-1.8e-05,4.6e-05,3.3e-05,1.8e-05,4e-06,4e-06,4e-06,-1e-05,-1.8e-05,-9e-06,2.1e-05,7e-06,-2e-06,1.3e-05,6.4e-05,5e-06,5.3e-05,-5e-06,-6e-06,-5.8e-05,-1.4e-05,-6e-06,-3.5e-05,1.3e-05,2.6e-05,9e-06,-2e-06,-2e-06,0,5e-06,2.1e-05,-2.6e-05,-2.1e-05,1.5e-05,1.1e-05,-3.2e-05,-6e-06,-3.3e-05,-2.4e-05,1.6e-05,3.5e-05,7e-06,-1.9e-05,-6e-06,-4.8e-05,-3.7e-05,-7e-06,-1.1e-05,-1.8e-05,-2.3e-05,1.3e-05,-4e-06,-1e-06,1.7e-05,4.9e-05,-7e-06,1.8e-05,5e-06,0.000103,1.3e-05,-1.5e-05,-1.7e-05,-3.1e-05,1e-06,-1.8e-05,-4.8e-05,-6e-06,-2.2e-05,1.3e-05,-2e-05,7e-06
-8e-06,3.4e-05,-2e-06,-1.7e-05,5.1e-05,-2.2e-05,5.9e-05,2e-06,6e-06,-1e-06,1e-06,1e-06,1.3e-05,-3e-05,8.1e-05,2e-05,5.2e-05,9e-06,5e-06,-2.8e-05,7e-06,-4.5e-05,-1e-06,1.1e-05,3.1e-05,2e-05,-2.1e-05,-1.7e-05,4.5e-05,-8e-06,-5.7e-05,-7.6e-05,0,7.3e-05,-1.6e-05,2.2e-05,-8e-06,2e-06,5.1e-05,-1.8e-05,-4.6e-05,1e-06,-6e-06,-1.3e-05,-1.6e-05,8e-06,3.1e-05,2.6e-05,-1.3e-05,-3e-06,5e-06,-3.3e-05,-1.9e-05,-8e-06,-1.3e-05,-3.9e-05,-3e-06,1.1e-05,1e-06,-7e-06,5e-06,-2e-06,1.7e-05,-3e-05,3e-06,-2.8e-05,2.2e-05,4.3e-05,0,6.1e-05,-5e-06,1.6e-05,1.9e-05,-3.7e-05,-1.5e-05,-4.7e-05,-2e-06,1e-06,-3e-06,0,-1.6e-05,2e-05,1.1e-05,2e-06,-8e-06,1.3e-05,5e-06,1.4e-05,-1.1e-05,-2.4e-05,-5e-06,1.6e-05,8e-06,9e-06,1e-06,4.2e-05,-2.5e-05,1e-06,-2e-06,-2.2e-05,2e-06,-9e-06,2e-06,-8e-06,-3.3e-05,-2.7e-05,-1e-05,1.5e-05,-4.4e-05,1.6e-05,5e-06,2.1e-05,3.2e-05,8e-06,1.9e-05,2.6e-05,4e-06,4e-05,2e-06,2e-05,-1.1e-05
3e-05,-2.1e-05,-1.2e-05,2.7e-05,-5.6e-05,6e-06,3e-06,1.3e-05,-1.3e-05,1.5e-05,1e-05,2e-06,1e-05,1.8e-05,-3.8e-05,1.5e-05,-3.4e-05,-9e-06,1.1e-05,1e-06,-2.9e-05,4.6e-05,4e-06,-2e-06,-3.4e-05,-1.4e-05,-7e-06,-4e-06,-4.7e-05,7e-06,4.2e-05,3.4e-05,2.3e-05,-6.9e-05,3e-06,-2e-06,3e-06,1e-06,1.7e-05,2.3e-05,8.1e-05,1e-06,1.6e-05,3e-06,8e-06,5e-06,-3e-05,-1.8e-05,-2.9e-05,-1.4e-05,2.8e-05,9e-06,-1.5e-05,-9e-06,-2e-06,3.6e-05,1.3e-05,-1.7e-05,-1.3e-05,1e-05,4.7e-05,7e-06,1.4e-05,2e-05,-5.4e-05,2.2e-05,-5.4e-05,-5.6e-05,0,-4.3e-05,-2.4e-05,1.5e-05,-2.8e-05,4.5e-05,-2e-06,1.4e-05,-2e-06,1.1e-05,2e-06,1.3e-05,-7e-06,-1.2e-05,-1e-06,-2e-06,-4e-06,1.6e-05,-2.7e-05,3.1e-05,2e-06,2.1e-05,-2.5e-05,-3e-06,0,-1e-06,3.2e-05,-3.8e-05,1.4e-05,-1e-06,1.8e-05,3.7e-05,1e-05,-5e-06,-3e-06,1.6e-05,1.3e-05,5e-06,4e-06,-1.4e-05,-3.4e-05,-1.2e-05,-5e-06,-1.8e-05,-2.3e-05,1e-06,-1.3e-05,-1.7e-05,5e-06,3.2e-05,-1.5e-05,-4e-06,-2e-06
-2.8e-05,2e-06,1e-05,6e-06,3.1e-05,3e-06,-3e-06,1e-06,-3e-06,-9e-06,1e-05,5e-06,-2.3e-05,-1.1e-05,-1.4e-05,-1.3e-05,2.3e-05,4e-06,-2e-06,1.6e-05,4e-06,1.2e-05,4e-06,-9e-06,2.2e-05,0,4e-05,3e-06,6.1e-05,0,-3.5e-05,1.1e-05,-3.2e-05,4.8e-05,3e-06,0,9e-06,-2e-06,-1.3e-05,-3e-06,-7.6e-05,-4e-06,-1.2e-05,9e-06,-2e-05,-2e-06,3e-06,1.2e-05,4.5e-05,-2.3e-05,-1.3e-05,-1e-05,2.5e-05,1e-05,2e-06,-1.2e-05,4e-06,8e-06,1.8e-05,-2e-06,-1.2e-05,-2e-05,-2.7e-05,7e-06,5e-06,0,3.1e-05,4.4e-05,3e-06,2.8e-05,6.9e-05,-8e-06,3e-05,-2.9e-05,2.3e-05,8e-06,4e-06,-8e-06,-4e-06,5e-06,1e-05,4e-06,2.6e-05,-4e-06,-1e-06,-3.2e-05,1.6e-05,-1.1e-05,2.6e-05,-1.5e-05,-5e-06,7e-06,-6e-06,-6e-06,-6e-06,9e-06,8e-06,6e-06,-2.7e-05,-2e-05,-1.8e-05,3.2e-05,-4e-06,-2e-05,-3e-06,2e-05,5e-06,1e-06,3.5e-05,-5e-06,1e-05,6e-06,5e-06,-2e-06,-7e-06,3.1e-05,-2e-06,-4.8e-05,1.3e-05,-5e-06,-5e-06
1.4e-05,4e-06,2e-06,-2.2e-05,-1e-05,-1e-05,-3.9e-05,-2.8e-05,1.6e-05,4e-06,-1.6e-05,0,2.2e-05,1e-06,5.4e-05,-1.5e-05,-2e-06,2e-06,-4e-06,-5e-06,-1.9e-05,-1.6e-05,-4e-06,5e-06,-2.1e-05,1.3e-05,9e-06,0,-5.4e-05,-3e-06,2.8e-05,-2e-05,1.6e-05,-4.8e-05,-3e-06,6e-06,-5e-06,-2e-06,-3.5e-05,-1.4e-05,3.6e-05,5e-06,-3e-06,-2.3e-05,1.9e-05,2e-06,4e-05,-8e-06,-1.2e-05,2.1e-05,-4e-06,3e-06,-1.1e-05,-1.3e-05,2e-06,1.5e-05,-2e-06,-6e-06,-5e-06,-1e-06,-2.5e-05,1.4e-05,-1e-06,-1.6e-05,4.8e-05,-1.3e-05,-1.6e-05,-2.7e-05,0,-1.8e-05,-5.6e-05,-2.1e-05,-4e-06,1e-06,-3.2e-05,-2.1e-05,-1e-05,-8e-06,2e-06,-1.1e-05,1e-06,3e-06,-3.5e-05,1e-06,-1e-06,3e-05,-5e-06,-2.2e-05,-5.1e-05,1.4e-05,2.7e-05,-1.9e-05,4e-06,2e-06,-2.4e-05,2.4e-05,4e-06,3e-06,3.9e-05,1e-05,9e-06,-4e-05,6e-06,1e-06,0,-1e-05,-4e-06,6e-06,9e-06,1e-05,-1.6e-05,-2e-06,2e-05,-3e-06,1.3e-05,-3.6e-05,5e-06,-1e-06,-1.3e-05,8e-06,-9e-06
-1.5e-05,8e-06,-1.2e-05,1.4e-05,-1.1e-05,1e-05,1.3e-05,2.1e-05,-6e-06,-4e-06,8e-06,-5e-06,-2.1e-05,-9e-06,-6.7e-05,1.3e-05,-8e-06,-6e-06,8e-06,2e-06,1.5e-05,-5e-06,-3e-06,-1e-06,3.8e-05,-1.5e-05,-2.6e-05,2e-06,3.3e-05,4e-06,-2.6e-05,2.2e-05,-3e-06,3.1e-05,-1e-06,-1.5e-05,1e-06,0,1.2e-05,2e-05,6e-06,-3e-06,8e-06,1.4e-05,-1.7e-05,-4e-06,-6e-05,-4e-06,-3.4e-05,-1e-06,-2e-06,-1.6e-05,-3e-06,2.8e-05,0,-8e-06,-6e-06,9e-06,-7e-06,-2e-06,-2.4e-05,5e-06,1.2e-05,1.1e-05,-1.8e-05,1.3e-05,7e-06,2.2e-05,-2e-06,6e-06,4.8e-05,8e-06,-2.2e-05,1.6e-05,2.6e-05,4.8e-05,1.7e-05,1.3e-05,2e-06,-3e-06,-6e-06,-9e-06,-1.5e-05,4e-06,5e-06,-2.2e-05,1.6e-05,6e-06,4.6e-05,-1.8e-05,-1.7e-05,-3e-06,-1.8e-05,0,2.3e-05,-3.9e-05,8e-06,-4e-06,-4.5e-05,2e-06,-3e-06,2e-05,-7e-06,8e-06,5e-06,-1e-05,2e-06,-1e-05,-3.3e-05,0,1.3e-05,5e-06,-3e-05,-4e-06,-1.5e-05,2.5e-05,-1e-06,-1.6e-05,1e-06,-1.3e-05,9e-06
8e-06,-8e-06,1.3e-05,-7e-06,3.5e-05,8e-06,1.3e-05,-7e-06,1e-05,1e-06,-1.1e-05,1e-06,7e-06,2.1e-05,5.7e-05,8e-06,0,3e-06,7e-06,-6e-06,-2e-06,-3.3e-05,3e-06,7e-06,-5.1e-05,1.4e-05,-1.3e-05,-9e-06,-1.3e-05,-5e-06,3.9e-05,-3.7e-05,-8e-06,-2.5e-05,2e-06,2.1e-05,2e-06,4e-06,2.7e-05,-1.3e-05,-3.4e-05,-3e-06,-1.4e-05,-1.8e-05,1.9e-05,-1.2e-05,4.2e-05,1e-05,4.5e-05,1.6e-05,-1.3e-05,3e-05,-7e-06,-2.3e-05,-6e-06,3e-06,-9e-06,-5e-06,4e-06,5e-06,2e-05,-9e-06,6e-06,-1.2e-05,-4.3e-05,-5e-06,8e-06,-2.2e-05,1e-06,-6e-06,-5.4e-05,1.6e-05,2.7e-05,-1e-05,-1.4e-05,-2.4e-05,-1.4e-05,-2e-06,-1e-06,2e-06,8e-06,1.1e-05,5.9e-05,-1.5e-05,-2e-06,1.1e-05,-1.5e-05,1.7e-05,-9e-06,1.2e-05,-2.1e-05,1.4e-05,1.3e-05,1e-06,8e-06,3e-05,-9e-06,-5e-06,4e-05,-1.8e-05,1e-05,-6e-06,5e-06,0,-1.1e-05,-1e-06,-7e-06,5e-06,6e-06,-1e-05,-1.6e-05,-4e-06,2.1e-05,1.5e-05,8e-06,-7e-06,-5e-06,5.8e-05,6e-06,5e-06,4e-06
1.7e-05,-4e-06,-1e-06,4e-06,-4e-05,-2e-06,-2e-05,-2.2e-05,-4e-06,7e-06,7e-06,4e-06,-1.2e-05,-2.1e-05,-2.7e-05,-1e-05,-3e-06,0,-9e-06,-1e-05,-4.1e-05,2.7e-05,3e-06,-1.1e-05,4e-05,4e-06,1.4e-05,1.1e-05,1.3e-05,3e-06,-3.2e-05,4.3e-05,2.6e-05,2.4e-05,-2e-06,-2e-05,-6e-06,0,8e-06,-1e-06,3.6e-05,-3e-06,1e-05,7e-06,-1.1e-05,2e-06,-1.1e-05,-1.1e-05,-1.3e-05,-8e-06,3.2e-05,-1.6e-05,-1e-06,1.5e-05,9e-06,-9e-06,6e-06,4e-06,-6e-06,-1e-06,1.8e-05,-4e-06,-1.8e-05,1.5e-05,2.9e-05,-5e-06,-5e-06,1.9e-05,1e-06,1.2e-05,2.6e-05,-2e-06,-2.3e-05,-9e-06,2e-06,-1.8e-05,8e-06,-2e-06,1e-06,-1e-06,-5e-06,-1.1e-05,-5.5e-05,-5e-06,-3e-06,-4e-06,7e-06,-9e-06,-2.5e-05,-9e-06,2e-05,-1e-06,-7e-06,0,-2.6e-05,-1.2e-05,8e-06,9e-06,-3.6e-05,2.4e-05,-8e-06,3e-06,-1e-06,-4e-06,1.1e-05,1.1e-05,9e-06,7e-06,3.4e-05,-2e-06,2e-05,-4e-06,-5e-06,-1.1e-05,-2e-06,-7e-06,3e-06,-2.2e-05,-4e-06,1.1e-05,4e-06
-2.5e-05,1.8e-05,-1.2e-05,1e-06,3.5e-05,7e-06,-3e-06,1.1e-05,-4e-06,2e-06,-7e-06,-1e-06,5e-06,1e-05,-1.4e-05,0,3e-06,-3e-06,-1.4e-05,1.1e-05,3e-05,-1.1e-05,-3e-06,2e-06,-1.9e-05,-2.6e-05,2.3e-05,-5e-06,-2.1e-05,0,2.3e-05,-2.4e-05,-3.7e-05,3e-06,1e-06,1e-05,9e-06,-2e-06,-3.2e-05,1.4e-05,-5e-06,8e-06,-4e-06,2e-06,9e-06,-2e-06,-1.4e-05,1.8e-05,-2.8e-05,1e-06,-4e-06,8e-06,1.8e-05,-1.6e-05,-1e-06,2.5e-05,4e-06,0,9e-06,-4e-06,1.9e-05,1.1e-05,0,-1e-06,3.1e-05,1.2e-05,-7e-06,-2.1e-05,-1e-06,-1.9e-05,-7e-06,-9e-06,2.6e-05,2.2e-05,1.4e-05,1.9e-05,-5e-06,-2e-06,-3e-06,3e-06,-5e-06,1.1e-05,7e-06,1e-05,2e-06,5e-06,-1.3e-05,-1.4e-05,4.3e-05,1.1e-05,7e-06,3e-06,2e-06,0,1.2e-05,-1e-06,-1.3e-05,2e-06,3e-05,-1e-05,-1e-06,1.3e-05,-1e-06,2e-06,-9e-06,-5e-06,-7e-06,-7e-06,-4.1e-05,1.8e-05,-2.3e-05,1e-05,-9e-06,-1e-05,-2e-06,3e-06,-1e-06,-1.3e-05,-1e-06,-6e-06,4e-06
1.3e-05,-2.3e-05,1.4e-05,-5e-06,-3.2e-05,7e-06,-6e-06,1.2e-05,7e-06,-7e-06,9e-06,-4e-06,8e-06,-2e-06,4.8e-05,4e-06,3e-06,1e-06,7e-06,9e-06,1.4e-05,1.2e-05,-3e-06,8e-06,1.3e-05,1.7e-05,0,4e-06,2.3e-05,-1e-06,-2.5e-05,7e-06,2.7e-05,-7e-06,-3e-06,-4e-06,-2e-06,1e-06,-1.2e-05,-1.7e-05,-4e-05,-2e-06,-4e-06,3e-06,-1.6e-05,0,2.3e-05,-1.8e-05,3.7e-05,-1.7e-05,-1.2e-05,4e-06,-1.6e-05,7e-06,-3e-06,-2.9e-05,1.2e-05,1e-06,-7e-06,3e-06,-3.1e-05,-7e-06,1.1e-05,-1.5e-05,-3.2e-05,-1e-05,-6e-06,2.6e-05,-3e-06,2.3e-05,1.7e-05,-7e-06,-3e-05,-1.8e-05,-2.5e-05,-7e-06,4e-06,2e-06,-1e-06,-4e-06,6e-06,-9e-06,4.3e-05,-1e-05,3e-06,3e-06,1.5e-05,1e-05,-3.7e-05,-1.3e-05,-1.6e-05,-6e-06,-6e-06,-1e-06,-1e-06,1.3e-05,-3e-06,-7e-06,-1.6e-05,-1.3e-05,3e-06,-2.1e-05,4e-06,1e-06,-5e-06,-4e-06,1e-05,-2e-06,5e-06,3e-06,2e-05,-9e-06,1.6e-05,2.6e-05,1e-05,6e-06,0,-2.2e-05,-6e-06,2e-06,-4e-06
-1.3e-05,1.6e-05,-5e-06,-2e-06,2.8e-05,-2e-06,2.7e-05,-2.9e-05,-1.1e-05,2e-06,-3e-06,0,-1.2e-05,3e-06,-6.1e-05,5e-06,3e-06,2e-06,3e-06,-7e-06,-1.4e-05,1.3e-05,2e-06,-1.1e-05,-2.7e-05,2e-06,-2.1e-05,-6e-06,-3.4e-05,3e-06,3e-05,-9e-06,-5e-06,8e-06,0,3e-06,-2e-06,1e-06,2.1e-05,2e-06,5.4e-05,-4e-06,9e-06,1e-06,1.3e-05,0,-2.2e-05,6e-06,-1e-05,4e-06,-8e-06,-1.1e-05,-6e-06,2e-06,2e-06,2.2e-05,-5e-06,0,2e-06,0,-1.5e-05,4e-06,1e-06,1.5e-05,-2.5e-05,-1e-06,2.5e-05,-2.1e-05,0,-2.7e-05,6e-06,7e-06,2.2e-05,0,2.2e-05,-5e-06,-4e-06,4e-06,2e-06,-2e-06,-1e-06,7e-06,-5.7e-05,-8e-06,0,-1e-05,-7e-06,9e-06,1.4e-05,1e-05,2e-06,-4e-06,-4e-06,-2e-06,-1.4e-05,-2.2e-05,-2e-06,-1e-06,4e-06,1.6e-05,-2e-06,1.3e-05,-5e-06,-6e-06,1.4e-05,-2e-06,-1.6e-05,7e-06,2.3e-05,-1.5e-05,-1.5e-05,1.2e-05,-1.5e-05,-1.8e-05,-9e-06,-3e-06,3e-06,2.8e-05,6e-06,0,0
9e-06,1e-06,-7e-06,8e-06,-1e-05,-1e-06,7e-06,9e-06,5e-06,2e-06,0,2e-06,1.3e-05,-3e-06,5e-05,-1.2e-05,-4e-06,-3e-06,-1.1e-05,-1e-06,1.7e-05,-1.8e-05,4e-06,9e-06,3.7e-05,-1.2e-05,-1e-05,2e-06,4.2e-05,-4e-06,-2.9e-05,8e-06,-2.2e-05,-2.1e-05,2e-06,0,3e-06,0,2.4e-05,1.3e-05,-2.6e-05,-2e-06,-8e-06,7e-06,-1.1e-05,3e-06,2e-05,0,-2.3e-05,1.4e-05,2e-05,1e-06,2e-05,-1e-06,-1e-06,-2.3e-05,0,-3e-06,-6e-06,-1e-06,-5e-06,-4e-06,-1.3e-05,-4e-06,3.9e-05,9e-06,-1.9e-05,6e-06,5e-06,2.4e-05,-1.9e-05,1e-05,-6e-06,1.7e-05,-1.1e-05,2.5e-05,1e-06,-5e-06,1e-06,9e-06,2e-06,-5e-06,2.6e-05,1e-05,-4e-06,5e-06,6e-06,-9e-06,2e-06,-8e-06,1.4e-05,-1e-06,3e-06,1e-06,2e-06,2.6e-05,5e-06,7e-06,7e-06,-8e-06,6e-06,-8e-06,4e-06,6e-06,-7e-06,4e-06,1.9e-05,-1e-06,-9e-06,-1.4e-05,1.2e-05,-1e-05,1e-05,-1e-05,5e-06,-1.1e-05,-1e-06,2.5e-05,1e-06,-6e-06,-4e-06
1e-06,-1.1e-05,1.2e-05,-9e-06,-1.2e-05,3e-06,-1.2e-05,2.3e-05,0,-4e-06,3e-06,1e-06,1e-06,4e-06,-1.9e-05,2e-06,-5e-06,2e-06,2e-06,1e-06,-1.4e-05,-7e-06,-1e-06,1e-06,-3.1e-05,1.3e-05,1.1e-05,3e-06,-3.4e-05,1e-06,2.4e-05,9e-06,3.3e-05,2.4e-05,-3e-06,-7e-06,-4e-06,-1e-06,-1.4e-05,-1.2e-05,-8e-06,6e-06,5e-06,-6e-06,1.3e-05,1e-06,-1.5e-05,-1e-06,3.3e-05,-9e-06,3e-06,-4e-06,-4e-06,5e-06,2e-06,1.6e-05,-1.4e-05,-2e-06,-1e-06,0,2.5e-05,1e-06,0,3e-06,1.5e-05,-1e-05,7e-06,9e-06,0,-1.6e-05,1.3e-05,-6e-06,-1e-05,-2.1e-05,3e-06,-2.7e-05,6e-06,-2e-06,-1e-06,-2e-06,1e-06,3e-06,1.8e-05,2e-06,0,0,-1e-05,-6e-06,-1e-06,1e-05,-3e-06,4e-06,-5e-06,2e-06,8e-06,-1.8e-05,6e-06,-2e-06,-2.3e-05,6e-06,-7e-06,9e-06,-2e-06,-3e-06,0,-3e-06,-2.3e-05,-4e-06,-1.7e-05,1.2e-05,-1.2e-05,7e-06,-2e-06,2.8e-05,-2e-06,2.1e-05,1e-06,-2.6e-05,-5e-06,9e-06,-3e-06
-1.1e-05,9e-06,-6e-06,5e-06,2.3e-05,-6e-06,-9e-06,-1.8e-05,2e-06,2e-06,-7e-06,-1e-06,-3e-06,-8e-06,-1.7e-05,1.1e-05,1e-05,0,7e-06,-1e-06,1.1e-05,-1.7e-05,-3e-06,-1.9e-05,2.2e-05,0,1.8e-05,-8e-06,2.1e-05,0,-2.3e-05,-2.4e-05,-1.8e-05,-4e-05,-1e-06,1e-05,1e-06,0,-2.7e-05,2e-06,1.8e-05,-2e-06,3e-06,0,-8e-06,-1e-06,0,9e-06,-1.3e-05,1.3e-05,-2e-05,5e-06,-1.2e-05,-1.5e-05,-2e-06,-9e-06,4e-06,1e-06,9e-06,0,1.9e-05,5e-06,1.2e-05,-4e-06,-4.2e-05,3e-06,0,-7e-06,-3e-06,1.1e-05,-2.7e-05,-8e-06,2.2e-05,9e-06,5e-06,3e-06,-9e-06,6e-06,0,0,-4e-06,-3e-06,-2.5e-05,-4e-06,5e-06,-3e-06,2e-06,8e-06,-2e-05,-1.1e-05,-7e-06,1e-05,6e-06,-1e-06,-1.3e-05,-2e-06,1e-06,-4e-06,3e-05,-3e-06,3e-06,-2e-06,0,4e-06,4e-06,-1e-06,2.9e-05,1e-06,1.5e-05,2.3e-05,1.4e-05,-1.9e-05,-5e-06,-1.6e-05,-2e-06,-2.1e-05,0,-1.1e-05,-1e-06,-2e-06,0
1.4e-05,-3e-06,-5e-06,0,-3e-05,-7e-06,-6e-06,-7e-06,6e-06,-2e-06,9e-06,-1e-06,1e-06,6e-06,4.7e-05,-2e-06,-1.8e-05,0,1e-06,2e-06,1.2e-05,3.8e-05,1e-06,3.6e-05,-2.3e-05,-6e-06,-4e-06,4e-06,-1.5e-05,-2e-06,2.5e-05,2.1e-05,-1e-05,3.9e-05,3e-06,-8e-06,2e-06,0,4e-06,9e-06,-9e-06,0,-7e-06,3e-06,9e-06,1e-06,2.2e-05,-1.2e-05,-1.8e-05,-4e-06,6e-06,-1.1e-05,4e-06,1.7e-05,-1e-06,1.4e-05,-3e-06,0,-7e-06,0,-1.4e-05,-1.1e-05,1e-06,-7e-06,-3e-06,6e-06,-1.9e-05,-1e-05,-1e-06,-4e-06,2.8e-05,3e-06,-2.6e-05,6e-06,-1.7e-05,1.1e-05,8e-06,-3e-06,-1e-06,0,-2e-06,2e-06,7e-06,3e-06,-1e-06,6e-06,-2e-06,3e-06,4.7e-05,1e-05,0,-3e-06,-3e-06,0,1e-06,2.4e-05,-1e-06,2e-06,-3.6e-05,-1e-05,-4e-06,-1.4e-05,1e-06,-5e-06,-5e-06,-2e-06,-3e-05,1e-06,1.6e-05,-6e-06,-9e-06,1.7e-05,1e-05,-1.3e-05,7e-06,1.2e-05,-3e-06,-1.4e-05,7e-06,-7e-06,1e-06
