0.000122,3e-05,2.3e-05,2.4e-05,4.7e-05,4e-05,5.8e-05,5e-06,9e-06,0.000112,7.6e-05,1.3e-05,9e-06,5.5e-05,6.2e-05,5.3e-05,8.1e-05,6.9e-05,5.8e-05,3.2e-05,4.4e-05,5.9e-05,3.2e-05,4.7e-05,1.8e-05,2.6e-05,4e-05,1.6e-05,2.6e-05,3e-06,2.5e-05,3.9e-05,2.1e-05,5.6e-05,2e-05,1.4e-05,6.2e-05,3.7e-05,5e-05,1e-06,5.4e-05,5.8e-05,9.8e-05,1.4e-05,5.1e-05,6.4e-05,4.1e-05,2.5e-05,4.3e-05,7.6e-05,7e-06,1.7e-05,1.3e-05,1.7e-05,4.9e-05,2.7e-05,3.9e-05,4.2e-05,1.5e-05,9e-06,8e-06,2.2e-05,4.4e-05,7.9e-05,5.9e-05,5.3e-05,2.8e-05,5.5e-05,2.8e-05,8e-05,6e-06,2.1e-05,7.7e-05,1.4e-05,7e-06,3e-05,7e-06,2.1e-05,8.5e-05,2.7e-05,6.6e-05,7.4e-05,2.2e-05,7.3e-05,3.1e-05,2e-05,0.000112,4.1e-05,4.3e-05,7e-06,3.4e-05,5e-05,0.000138,9.8e-05,2e-06,3e-06,3.9e-05,6e-05,0.000103,3.1e-05,1.6e-05,2.4e-05,2.7e-05,7e-06,2.2e-05,1.9e-05,1e-06,2.4e-05,2.9e-05,1.3e-05,5e-06,5.1e-05,7e-06,4e-05,4e-06,3.6e-05,2e-06,5.9e-05,1e-06,7e-05,4.4e-05
0.000354,0.000275,0.000153,0.000136,0.000163,0.000218,0.000287,0.000306,0.00016,0.000383,0.000332,0.000224,0.000286,0.000185,0.000217,0.000243,0.000261,0.000313,0.000269,0.000195,0.000292,0.000302,0.000117,0.00016,0.000235,0.000224,0.000197,0.000142,0.000251,0.000218,0.000282,0.000243,0.000265,0.000283,9.6e-05,0.000145,0.000205,0.000167,9.4e-05,0.000137,7.7e-05,0.000103,0.000282,4.5e-05,0.000136,0.000217,5.5e-05,3.3e-05,0.000189,0.000174,7.9e-05,0.000201,4.8e-05,0.000112,9.9e-05,4.2e-05,0.000153,0.000118,0.000134,0.000141,2.2e-05,0.000116,6.7e-05,0.000253,0.000193,0.000306,0.000208,0.000235,8.2e-05,0.000353,0.00015,0.000214,0.000158,0.000123,7e-05,0.000132,2.4e-05,0.000102,0.00012,0.000152,0.000311,0.000313,7.7e-05,0.00011,8.3e-05,0.000206,0.000369,0.000298,0.000161,0.000186,8.9e-05,0.000159,0.000388,0.000365,0.000241,0.000223,5.9e-05,9.7e-05,0.000185,0.000172,0.000198,0.000201,0.000186,0.000137,0.000109,4.9e-05,1.7e-05,8.8e-05,5.3e-05,0.000178,0.000185,0.000153,0.000101,0.000117,7.3e-05,4.7e-05,4.9e-05,0.000102,0.000108,0.00019,0.000108
7.6e-05,0.000276,0.000111,0.000179,0.000154,0.000221,0.000246,0.000239,0.000153,0.00029,0.000243,8.2e-05,0.00025,0.000226,8.3e-05,0.000209,0.000105,0.000117,0.000104,0.000132,0.000395,1.4e-05,0.000186,0.000261,0.000245,0.00014,0.00022,0.000296,0.000108,0.00021,0.000302,8.1e-05,0.000258,6.8e-05,0.000171,0.000341,0.000529,0.000333,0.000229,0.000193,0.000126,0.000171,0.000397,0.000213,0.00019,0.000446,0.000316,5.1e-05,0.00036,0.000451,0.000307,0.000291,0.000257,0.000305,0.00015,0.00014,0.000314,0.00028,0.000195,0.000196,0.000139,0.000236,0.000335,0.000395,0.000299,0.000197,0.000205,0.000351,0.000344,0.000284,0.000225,0.000249,0.000202,9.7e-05,0.000117,0.000152,0.000116,0.000284,0.00022,0.000262,7.1e-05,0.000168,0.000421,0.000262,0.000236,0.000185,0.000164,0.000149,0.00013,0.000307,0.000285,0.00017,0.000204,7.4e-05,0.000223,0.000264,0.000239,0.000185,0.00022,0.000349,0.000268,0.000219,6.3e-05,0.000273,0.000313,0.000208,0.000102,0.000136,2.7e-05,0.000309,0.000218,0.000236,0.00018,0.000208,8.3e-05,0.000131,1.8e-05,0.000111,0.000278,0.000224,0.000165
0.00032,0.000358,0.000339,0.000365,0.000436,0.00015,6.6e-05,0.000396,0.000192,0.000102,0.000165,0.000218,0.00023,0.000148,0.000118,0.000321,0.000262,6.6e-05,8.9e-05,0.000174,3e-04,0.000429,0.000505,0.000488,0.00045,0.000173,0.000314,0.000341,0.000337,0.000123,0.00025,0.000325,9.6e-05,0.000206,0.000158,0.00021,0.000274,0.000145,0.000178,3.8e-05,8.1e-05,5.7e-05,0.000325,0.000498,0.000337,0.000287,0.000456,0.000473,0.000345,0.00019,0.000218,0.00037,0.000297,0.000103,0.000198,0.00041,0.000665,0.000395,0.000113,7.5e-05,0.000155,0.000189,0.000333,0.000508,0.000497,0.000372,0.000332,0.00031,0.000353,0.00054,0.000397,0.000447,0.00026,0.000185,0.000184,0.000164,9.6e-05,0.000257,5.6e-05,0.000223,9.8e-05,5.6e-05,0.000329,0.000262,0.000166,0.000335,0.000359,0.000303,0.000239,9.3e-05,0.000215,0.000162,0.000261,0.000407,0.000192,0.000419,0.000135,0.000274,0.000285,0.000271,0.000414,0.000445,0.000289,0.000382,0.000433,0.000105,0.000149,0.000184,0.000149,0.000318,0.000135,0.00031,0.00034,0.00045,0.000361,0.000297,0.000105,0.000124,0.000279,0.000503,0.000285
0.000214,0.000172,0.00013,0.000194,0.000263,0.000453,0.000319,0.000467,0.000352,0.000268,8.3e-05,0.000109,0.000174,0.000183,0.000194,0.000321,0.000463,0.000456,0.000195,0.000269,8.8e-05,0.000201,0.000539,0.000161,0.000135,0.000198,0.000192,6.9e-05,0.000156,0.00015,0.00023,0.000493,0.000433,0.000326,0.000213,2.9e-05,0.000225,0.000282,0.000108,0.000198,0.000281,1.7e-05,0.000213,0.000257,7.4e-05,0.000166,0.000247,0.000166,0.000226,6.1e-05,0.000205,0.000354,5.9e-05,0.00015,7.2e-05,0.000341,0.000272,0.000144,0.000131,1e-04,0.000166,3.6e-05,0.000498,0.000103,0.00041,0.000298,0.000458,0.000672,0.000357,0.000234,9.2e-05,0.000435,0.00024,5.1e-05,0.000286,0.000293,0.000121,0.000353,0.000394,0.000262,0.000112,0.000144,0.000214,0.000118,0.000384,0.000216,0.000194,0.00018,0.000256,0.000236,0.000322,0.000128,0.000209,0.000383,0.000537,0.000427,0.000298,0.000237,0.00013,0.000276,7.3e-05,0.000417,0.000305,0.000247,0.000423,0.000254,0.000427,9.2e-05,0.000186,1.8e-05,0.000129,0.000273,7.6e-05,0.000214,0.000254,0.000131,0.000173,0.000147,5e-05,0.000295,0.000268
0.00028,0.000167,0.000164,0.000149,0.000243,0.000278,8.4e-05,0.000217,0.00034,0.000517,0.000301,0.000295,0.000255,4e-05,3.5e-05,0.00029,0.000276,5.1e-05,8.7e-05,0.000198,8.7e-05,0.000197,0.000313,0.000458,0.000348,0.000159,6.3e-05,0.000221,8.5e-05,9.1e-05,0.000215,4e-04,9.4e-05,0.000233,0.000285,0.000285,0.000236,0.00029,0.000388,0.000196,7.1e-05,0.000294,0.000165,0.000179,4.8e-05,0.000143,0.00013,0.000386,0.000345,0.000176,8e-05,0.000158,0.000119,0.000103,0.000174,0.000184,0.000374,0.000468,0.000322,9.5e-05,0.000223,0.000108,0.000437,0.000443,0.000235,9.3e-05,0.000393,0.000243,0.000523,0.000533,9.7e-05,0.000409,0.000308,0.00037,0.000307,7.7e-05,0.000304,0.00023,0.00024,0.000457,0.000484,0.000487,8.5e-05,0.000171,0.000535,0.000257,0.000355,0.000382,0.000626,0.000164,0.000297,0.000325,0.000158,0.000189,0.000253,0.000257,0.000193,5e-05,0.000324,0.000182,0.000141,0.000232,0.000123,4e-05,0.000291,0.000158,0.000402,0.000375,0.000257,0.000275,0.000137,0.000357,0.000437,0.000363,8.3e-05,0.000191,0.000212,0.00023,0.000305,0.00015,0.000289
0.000102,0.000119,0.000442,0.000373,0.000414,0.000269,0.000171,0.000209,0.000254,0.000101,0.000197,0.000392,0.000105,0.000291,0.000336,0.000414,0.000163,0.000133,1e-04,0.000137,0.000166,0.000203,0.000221,0.000274,0.000135,0.000163,0.000183,0.000336,0.000202,8.9e-05,0.000314,0.000148,0.000268,0.000315,0.00015,0.000409,0.000175,0.000217,0.000276,0.00028,0.000237,0.000399,0.000457,0.000447,0.000286,0.000301,0.000111,0.000347,0.000128,0.000119,0.000102,0.000292,0.000114,8.2e-05,0.000214,0.000171,0.000267,0.000344,0.00019,0.000243,0.000141,0.000143,0.000398,0.000214,0.00032,0.00034,0.000332,0.000491,0.000239,0.000285,0.000319,0.000228,0.000341,4e-04,0.000223,0.000338,0.000419,0.000167,0.000238,0.000131,8.9e-05,0.000282,0.00033,0.000124,0.000388,0.000311,0.000416,0.000212,0.000517,0.000535,0.000269,0.000135,0.000318,0.000294,0.000181,0.000154,0.000176,4.4e-05,0.000348,0.000387,0.000235,0.000129,0.000149,2.3e-05,0.000349,0.000356,0.000493,7.1e-05,0.000203,0.000126,0.000272,0.000312,0.000404,0.000237,0.000235,0.000399,0.000104,0.000196,0.000272,0.000256,0.000395
0.000276,0.000404,0.000266,0.00024,0.000271,0.000337,0.000136,3.9e-05,0.000207,0.000297,0.000437,2e-04,0.000162,0.00048,0.000868,0.000312,0.000142,0.000152,0.000115,0.000322,0.000168,2.9e-05,0.000157,0.000223,0.000111,0.000251,0.000143,0.000331,0.000276,3.4e-05,0.000389,0.000457,0.000258,0.00042,0.000483,0.000755,0.000935,0.000374,0.00046,0.000485,0.000573,0.000243,0.000245,0.000197,0.000235,0.000123,0.000132,0.000247,0.000345,2e-05,3.1e-05,0.000266,0.000446,0.000394,0.000123,0.000198,0.000255,5.3e-05,0.000202,0.000519,0.000125,1e-04,0.000416,0.00057,0.000354,0.000166,0.000513,0.00039,0.000451,0.000246,7.9e-05,5.4e-05,0.000497,0.000324,0.000162,0.000161,0.000252,0.000232,0.000385,0.000204,0.000267,0.000142,9.9e-05,0.000144,0.00011,0.000176,0.000163,0.00019,0.000236,0.00026,0.00036,7.4e-05,0.000295,0.000347,0.000464,0.000198,0.000307,0.000213,0.000131,0.000129,0.00042,0.000569,0.000201,0.000116,0.000384,0.000367,0.000309,0.00041,0.000377,0.000418,0.000421,0.000164,0.000444,0.000342,0.000268,0.000449,0.000348,0.000324,0.000133,0.000141,0.000149
0.000288,0.000191,0.000399,0.000577,0.000494,0.000193,0.000235,0.000345,2.5e-05,0.00039,0.000285,0.000402,0.000113,0.000422,0.000492,0.000881,0.000533,0.000182,0.000314,0.000405,0.000285,2e-04,0.000228,0.000175,0.000335,4.1e-05,0.000159,0.000352,0.00063,0.00059,0.000575,7.6e-05,0.000122,0.000359,0.000249,0.000306,0.000601,0.000685,0.000123,0.000209,0.000303,0.000166,0.000411,0.000243,6.3e-05,0.00013,0.000257,0.000102,0.000192,0.000289,0.000147,0.000165,0.000502,0.000155,0.000381,0.000516,0.000327,0.000209,0.00027,0.000494,0.000594,0.000334,0.000402,0.000332,0.000321,0.000484,0.000605,0.000233,0.000297,0.000291,0.00037,0.000232,0.000519,0.000355,0.000109,0.000154,0.000236,0.000173,0.000405,0.000364,0.000449,0.000135,0.000126,0.000167,0.000311,0.000264,2.8e-05,4.9e-05,0.00025,8e-05,0.00026,0.000291,0.000432,0.000489,0.00049,0.00055,7.8e-05,0.000122,7e-05,0.000245,0.000321,0.000196,0.000176,5.8e-05,0.000226,2.3e-05,0.000107,0.000388,0.000272,0.000155,0.000216,0.000194,0.000358,0.00055,0.000202,0.000285,0.000152,0.000383,0.000405,0.000363,0.000168
0.000176,0.000318,0.000112,0.000178,0.000212,0.000317,9.3e-05,0.000279,0.000262,0.000417,0.000252,0.000261,0.000171,0.000332,0.00048,0.000434,0.000256,0.000405,0.000361,0.000466,0.000324,5.9e-05,0.000162,6.6e-05,0.000233,0.000283,8.8e-05,0.000419,0.000404,0.000352,0.000221,0.000267,0.000262,9.8e-05,4.7e-05,0.000192,0.00038,0.00038,0.000223,0.000302,0.000276,8.8e-05,3e-04,0.000331,0.000198,8.6e-05,0.000219,0.000275,4.7e-05,0.000274,0.000306,0.000145,0.000222,0.000196,0.00041,0.000217,0.000125,4.9e-05,0.000149,0.000269,0.000348,0.00016,0.000145,0.000324,1.9e-05,0.000299,0.000169,0.000128,0.000151,8.8e-05,0.000354,0.000152,0.000364,0.000243,0.000346,0.000429,0.000141,0.00021,6.9e-05,0.000193,0.00012,3.3e-05,0.000223,0.000319,0.000304,0.000136,0.000271,0.000289,0.000407,0.000214,0.00014,0.000309,0.000103,2.8e-05,0.000361,0.000242,0.000264,0.000226,0.000161,0.000327,0.000152,0.000174,0.000176,0.000314,0.000289,0.00021,8.8e-05,0.000232,0.000101,0.000189,0.000406,0.00035,0.000137,0.000287,0.000278,4.8e-05,5.7e-05,0.000358,8.2e-05,0.000299,0.000323
9.2e-05,0.000173,0.000194,0.00013,0.000134,0.000106,0.000137,0.000226,0.000376,0.000206,8.6e-05,0.000296,0.000217,0.000113,0.000181,0.000205,0.000137,0.000234,0.000204,0.000137,7.2e-05,0.000176,0.000285,0.000289,6.4e-05,0.000164,0.000281,0.000207,0.000173,6.1e-05,0.00011,7.2e-05,0.000108,9.7e-05,0.000108,4.7e-05,0.000203,7.9e-05,0.000129,0.000291,0.000341,0.000276,5.1e-05,0.000155,1.9e-05,0.000123,0.000105,0.000125,0.000241,7.4e-05,0.000182,0.000201,9.9e-05,6.3e-05,0.000211,0.000201,0.000183,0.000164,0.000114,0.000251,4.5e-05,0.000149,0.000123,5.3e-05,5e-05,0.000102,5e-05,3.3e-05,0.000165,0.000103,0.000224,0.00024,0.000168,0.000134,0.000114,0.00014,0.000225,4.2e-05,5.1e-05,0.000132,0.000165,0.000137,0.000267,0.000219,0.000265,0.000179,0.000251,0.00011,0.000195,7.7e-05,7.2e-05,0.00012,0.000153,0.000182,0.000171,0.000218,0.000167,9.5e-05,5e-05,0.000192,0.000151,0.000191,0.000131,0.000305,0.000248,0.000134,0.000243,0.000129,5.9e-05,0.000173,0.000298,2.8e-05,0.000134,0.000288,5.1e-05,0.000153,9.7e-05,0.000188,0.00025,8.9e-05,0.000101
7e-05,0.000103,5.7e-05,0.000163,4.4e-05,8.7e-05,3.9e-05,0.00021,0.000195,0.000125,0.000172,0.000181,4.3e-05,0.000137,0.000136,0.000148,9e-05,6.7e-05,0.000201,0.000184,0.000112,9.8e-05,0.000152,0.000118,0.000125,0.000102,0.000196,0.000196,0.000185,0.000126,1.5e-05,0.000154,0.000126,0.000135,8.8e-05,3.4e-05,7.4e-05,7.5e-05,6.9e-05,0.000172,4.1e-05,9.4e-05,0.000137,4.8e-05,1.7e-05,0.000115,0.000143,7.7e-05,0.000186,0.00026,9.4e-05,2.5e-05,2.6e-05,7.6e-05,0.000111,0.000113,0.000163,0.000122,0.00012,9e-05,6.6e-05,0.000151,5.7e-05,7.4e-05,7.3e-05,0.000189,6.1e-05,4.6e-05,9.4e-05,8.7e-05,5.3e-05,7.7e-05,4.4e-05,0.000125,0.000154,3e-05,0.000162,0.000168,0.000149,2.1e-05,6.9e-05,8.5e-05,0.000106,4.2e-05,0.000111,0.000221,4.5e-05,0.000182,0.000106,3e-05,9.2e-05,8.2e-05,8.8e-05,0.000127,0.000196,8.8e-05,0.00012,0.000102,5.4e-05,0.000102,4.6e-05,6.6e-05,0.000156,7.2e-05,8.2e-05,6.1e-05,6.1e-05,5.3e-05,0.00011,0.000148,1.8e-05,8.4e-05,0.00014,0.000128,0.000168,0.000103,8.4e-05,4.1e-05,2.4e-05,0.000105,2.9e-05
5.9e-05,3.1e-05,2.1e-05,0.000125,9.3e-05,2.1e-05,6.4e-05,4.4e-05,0.000145,1e-04,3.2e-05,0.000115,5.5e-05,0.000112,0.000126,7.6e-05,4.1e-05,6.7e-05,8.6e-05,7.2e-05,3.2e-05,4.3e-05,0.000125,9e-05,4.8e-05,0.000111,0.00012,0.000116,4.9e-05,0.000115,5.1e-05,9.5e-05,6.3e-05,8.3e-05,7.4e-05,2.6e-05,0.000109,4.7e-05,0.000152,3.8e-05,7.3e-05,0.000101,0.000111,9.2e-05,5.5e-05,5.9e-05,9.8e-05,0.000127,3e-05,0.000175,4.8e-05,7.9e-05,6.6e-05,8.6e-05,6.1e-05,6.7e-05,0.000145,7.1e-05,3.6e-05,0.000117,2.6e-05,0.000108,7.9e-05,0.000109,3.7e-05,0.000167,2.5e-05,3.4e-05,5.5e-05,9.6e-05,2.5e-05,2.4e-05,8.2e-05,4.2e-05,0.000101,1.3e-05,9.1e-05,8.1e-05,8.8e-05,1.3e-05,4.4e-05,4.3e-05,5.2e-05,4e-06,4.9e-05,0.000124,2.4e-05,0.000108,7.9e-05,7e-06,8.7e-05,6.6e-05,8.5e-05,6.9e-05,7.1e-05,2.5e-05,0.000112,4.7e-05,3.7e-05,6.6e-05,4.2e-05,5.3e-05,6.4e-05,4.9e-05,0.000109,7.9e-05,6.1e-05,6.5e-05,6.8e-05,6.3e-05,3.1e-05,4.2e-05,7e-05,8.8e-05,4.2e-05,5e-06,6.4e-05,5.8e-05,6.8e-05,5.4e-05,5.2e-05
2.5e-05,3.2e-05,5.2e-05,6.9e-05,0.000101,5e-05,5.1e-05,0.00014,8.1e-05,6.8e-05,3.7e-05,3.4e-05,3.1e-05,7.5e-05,0.000129,7.7e-05,0.000119,3.3e-05,0.00018,0.000194,0.000109,0.000125,7.2e-05,6.6e-05,6.7e-05,0.000109,0.000149,3.8e-05,6.7e-05,8.1e-05,4.9e-05,5.3e-05,8.1e-05,8.9e-05,4.4e-05,2.7e-05,6.5e-05,3.8e-05,0.000152,9.1e-05,4e-05,7.5e-05,0.000193,3.7e-05,4.7e-05,2.3e-05,0.000154,0.000101,7.6e-05,0.00015,4.3e-05,0.000107,8e-05,0.000122,0.000155,3.7e-05,0.000143,5.8e-05,0.000129,0.000189,0.000105,4.4e-05,8.8e-05,0.000126,8.5e-05,0.000118,1.7e-05,4.1e-05,4.6e-05,0.000113,0.000114,0.000104,0.000135,9.6e-05,8.2e-05,9.8e-05,5.9e-05,0.000128,0.000134,5.6e-05,1.1e-05,7.6e-05,3.4e-05,7e-05,7.3e-05,5.3e-05,8.1e-05,1.3e-05,3.8e-05,0.00011,4.6e-05,5.4e-05,6.6e-05,8.8e-05,0.000141,7.9e-05,1.4e-05,4.2e-05,1.4e-05,2.2e-05,5.5e-05,5.7e-05,2e-05,5.3e-05,0.000113,0.000112,6e-05,4.6e-05,1.6e-05,7.3e-05,5.9e-05,5.1e-05,0.000103,0.000121,0.000121,7.1e-05,8.7e-05,0.000137,0.000122,5.5e-05,3.4e-05
8.5e-05,3.4e-05,7.8e-05,0.000178,0.000106,0.000116,9.3e-05,2e-04,6.9e-05,3.1e-05,6.4e-05,0.000107,7.9e-05,0.000138,0.000118,0.000133,2.8e-05,0.000152,0.000173,0.000127,8.6e-05,0.000103,8.8e-05,0.000102,3.4e-05,0.000235,0.00011,6e-05,4.7e-05,3.6e-05,3e-05,7.1e-05,0.000106,6.5e-05,0.000134,8.5e-05,6.1e-05,5.8e-05,0.000183,0.000225,0.000205,8.9e-05,0.000177,0.000124,0.000117,5.6e-05,0.000169,4e-05,3.6e-05,7.6e-05,0.000159,0.000137,0.000127,0.000118,0.000222,0.000156,0.000229,0.000149,8.2e-05,7.2e-05,2.6e-05,2.3e-05,0.000108,0.000115,4.9e-05,0.000214,0.000143,0.000129,4.4e-05,0.000155,0.000176,6e-05,9.2e-05,6.5e-05,8.6e-05,0.000131,0.000227,0.000244,0.000117,0.00014,0.000104,8.4e-05,0.000103,0.000139,0.000145,0.000103,2.5e-05,8.9e-05,6.9e-05,9.8e-05,0.000143,0.000101,5.5e-05,0.000109,0.000142,5.3e-05,0.000111,2.3e-05,0.000123,0.000118,4.1e-05,3.3e-05,0.000116,7.5e-05,0.000101,5.8e-05,9.4e-05,4e-05,6.9e-05,0.000105,5.7e-05,3.2e-05,0.000143,0.000138,9e-05,0.000155,3.6e-05,9.8e-05,7.7e-05,9.8e-05,0.000102
6.4e-05,6.3e-05,5.3e-05,9.5e-05,0.000155,4.8e-05,5.5e-05,0.000129,6.4e-05,0.00012,8.8e-05,0.00019,0.000144,9.6e-05,6e-05,0.000103,5.7e-05,0.000143,0.000117,0.00022,7.7e-05,8.3e-05,3.8e-05,0.000126,9.8e-05,0.000244,0.000197,0.000124,0.000165,0.000204,0.000159,0.000101,1e-04,0.000121,0.000194,0.000148,0.000157,4.6e-05,0.000162,0.000112,0.00011,0.000153,9.6e-05,9.3e-05,0.000117,0.00015,6.3e-05,9.5e-05,0.000114,3.3e-05,0.000102,9e-05,3e-05,8.8e-05,0.000144,0.000151,0.000172,0.000267,0.000115,4.6e-05,5.6e-05,1.1e-05,0.000104,0.000169,5.4e-05,0.000193,0.000131,2.8e-05,6.4e-05,0.000117,2.1e-05,3.7e-05,3.7e-05,0.000103,0.000119,9.4e-05,0.000147,1.1e-05,1.1e-05,6.9e-05,3.2e-05,4.7e-05,8.3e-05,7.7e-05,4.5e-05,3.2e-05,9.4e-05,0.000128,3.4e-05,7e-05,0.000134,9.7e-05,0.000109,7.4e-05,0.000268,0.000257,5.9e-05,4.5e-05,0.000199,8.3e-05,0.000158,3.1e-05,8.7e-05,0.000123,3.4e-05,8.9e-05,0.000197,0.000217,6.8e-05,9.1e-05,3.9e-05,7.3e-05,8.5e-05,3.3e-05,9.7e-05,4.6e-05,7.2e-05,3.7e-05,4.9e-05,9.5e-05,1.8e-05
3.2e-05,3.3e-05,7.4e-05,6e-05,9.5e-05,0.000128,3.7e-05,8.3e-05,7.3e-05,0.000141,9.3e-05,0.000225,1.6e-05,3.7e-05,6.1e-05,0.000125,6.4e-05,0.000157,0.000183,0.000171,0.000129,7.3e-05,6e-05,5.1e-05,2.2e-05,0.000141,7.9e-05,0.000285,7.3e-05,0.000103,0.000242,0.000116,0.000124,0.000174,0.000169,8.8e-05,0.000128,7.9e-05,8.9e-05,9.6e-05,8.3e-05,7.8e-05,5e-05,0.000104,0.000105,0.000158,5.7e-05,7.4e-05,0,6e-05,1.9e-05,2.6e-05,5.9e-05,0.000104,0.000206,6.1e-05,0.000107,0.000135,0.000198,0.000136,0.000113,9.5e-05,0.000125,9.7e-05,4.9e-05,1.5e-05,0.000123,4.2e-05,4.8e-05,6.1e-05,8.9e-05,6.6e-05,6.7e-05,5.6e-05,2.7e-05,0.000101,0.000249,0.00022,0.000117,2.1e-05,0.000102,2.1e-05,0.000108,0.000203,9.7e-05,0.00012,6.7e-05,8e-06,8.5e-05,5.6e-05,6.8e-05,8e-06,8.3e-05,0.000129,0.000285,0.000103,0.000105,0.000161,6.2e-05,0.000102,0.000149,0.000191,0.000183,6.3e-05,6.3e-05,3.1e-05,0.000107,0.000124,0.000142,4.2e-05,8.2e-05,0.000158,1e-04,0.000102,0.000122,7.9e-05,2e-05,8.3e-05,8.3e-05,0.000125,8.8e-05
8.4e-05,5.4e-05,0.000141,9.1e-05,5.7e-05,0.000155,8.9e-05,0.000171,0.000107,0.000101,0.000125,0.000168,0.000207,0.000129,5.8e-05,0.000145,0.000121,1e-04,0.000122,0.000117,3.4e-05,0.000147,0.000116,7.7e-05,6e-05,5.6e-05,2.7e-05,0.000191,0.000178,0.000222,0.000258,0.000183,8.9e-05,4.6e-05,1.4e-05,7.1e-05,0.000151,0.000115,8.2e-05,0.000118,0.000181,1e-04,0.000144,5.7e-05,3.5e-05,0.000122,0.000193,7.7e-05,0.000144,8.1e-05,2.8e-05,0.000173,8.4e-05,0.000137,4.4e-05,3.7e-05,6.6e-05,4.8e-05,0.000177,0.000146,8.7e-05,7.5e-05,8.8e-05,0.000114,0.000119,3.8e-05,0.000162,1.9e-05,6.7e-05,4.4e-05,0.000129,0.000149,5.3e-05,5.7e-05,7e-05,3e-05,0.000179,4.9e-05,1.8e-05,3.3e-05,0.000187,0.000119,0.000203,0.000136,7.1e-05,0.000121,0.000105,9.7e-05,4.9e-05,0.000105,9.4e-05,0.000136,0.000124,6.3e-05,0.000218,0.000157,6.7e-05,0.000126,0.000103,2.5e-05,0.000128,8.6e-05,8.8e-05,0.000114,0.000199,0.000133,5.1e-05,6.1e-05,8.9e-05,9.1e-05,0.000182,0.000119,0.000108,3.4e-05,0.000108,2e-05,0.00012,0.000134,6.9e-05,9.1e-05,0.000112
0.000171,0.000173,0.000218,0.000101,7.9e-05,0.000131,0.000191,0.000224,0.000228,0.000109,0.000241,0.000362,0.000399,0.000328,0.000196,0.000145,8.1e-05,9.1e-05,0.000204,0.000153,9.9e-05,8e-05,0.000203,5e-05,7.8e-05,0.00012,0.000158,0.000163,0.00016,1.8e-05,0.00028,0.000247,0.000157,5.8e-05,9.1e-05,0.000144,0.000194,0.000409,0.000333,0.00027,0.000257,0.000184,4.3e-05,0.00016,0.000102,0.000132,0.000127,0.000115,0.000129,0.000238,0.000153,0.000289,0.000257,0.000184,0.000154,0.000175,0.000127,8e-05,0.000102,0.000193,0.000191,0.000155,0.000201,0.000122,0.000215,0.000171,0.000216,0.000287,2e-04,2e-04,0.000184,0.000103,8e-05,7.7e-05,6.7e-05,7.2e-05,0.000183,0.000272,0.000218,0.000136,0.000261,0.000237,7.2e-05,0.000257,0.000116,2.2e-05,3.4e-05,7.5e-05,8.6e-05,4.3e-05,1e-04,0.000119,7.6e-05,5.9e-05,0.000234,0.000265,0.000159,0.000126,0.000142,0.000154,0.000214,0.000198,0.000104,0.000132,0.000321,0.000203,0.000121,6.6e-05,0.000145,6.8e-05,0.000163,0.000165,0.000129,0.000115,6.2e-05,0.00014,0.000196,7e-05,0.000102,0.000182,9.9e-05
0.000318,0.000123,0.000137,0.000109,0.000112,0.000108,0.000189,0.000188,0.000162,0.000325,0.000205,0.000196,0.000162,7.4e-05,1.8e-05,0.000111,6.3e-05,0.000115,0.000275,0.000283,0.000191,0.000177,0.000159,0.000193,0.000211,0.000252,0.000125,0.000103,3.4e-05,0.000102,0.000347,0.000206,5.1e-05,5.4e-05,8.6e-05,6.6e-05,0.000121,0.00041,0.000324,0.000102,0.000179,0.000114,0.000141,0.000149,0.000134,3.2e-05,0.000136,0.000134,0.000185,0.00019,0.000219,0.000179,0.000144,0.000233,7.4e-05,0.000123,8.3e-05,5.6e-05,1.8e-05,0.000104,0.000119,0.000105,0.000189,4.6e-05,0.00011,2.7e-05,0.000112,0.000331,0.000201,0.000147,5.6e-05,7.3e-05,4.7e-05,0.000114,4.9e-05,2.6e-05,4.9e-05,0.000135,0.000125,0.000125,0.000193,7.4e-05,0.000168,0.000226,0.00019,0.000132,6.4e-05,3.3e-05,6.1e-05,6.6e-05,0.000158,0.000192,7.6e-05,2.3e-05,0.000146,0.000131,8.4e-05,0.000169,0.000128,0.000241,0.000229,0.000168,0.000157,8.4e-05,0.000213,4.8e-05,2.7e-05,6e-05,7.6e-05,4.4e-05,0.00017,8.9e-05,2.1e-05,9.1e-05,8.5e-05,0.000112,7.1e-05,0.000107,0.000129,0.000144,0.00031
0.000135,0.000103,5.7e-05,1.8e-05,3e-06,7.3e-05,0.000144,0.000103,3.5e-05,0.000164,3.6e-05,8.8e-05,0.000117,6.3e-05,7.5e-05,0.000142,6.4e-05,2.9e-05,0.000165,5.9e-05,4.1e-05,0.000138,3e-05,0.000138,0.000141,0.000161,4.7e-05,8.9e-05,9.8e-05,0.000114,0.000336,0.000177,0.000144,0.000121,5.7e-05,0.000118,0.000164,0.000155,8.8e-05,0.00014,6.3e-05,9.7e-05,4.7e-05,8.6e-05,8.9e-05,4.1e-05,0.000151,7.7e-05,0.000168,4.4e-05,0.000144,0.000192,7.7e-05,0.000173,9.9e-05,7.6e-05,5.1e-05,0.000171,4e-05,8.8e-05,7.9e-05,0.000125,6.5e-05,9.2e-05,6.9e-05,6.3e-05,7e-06,0.000219,9.2e-05,4e-05,0.000104,3.5e-05,0.000111,8.1e-05,9.4e-05,0.00013,0.000125,9.7e-05,4.9e-05,0.000117,0.000158,0.000106,5.9e-05,8e-05,9.6e-05,0.000109,9.8e-05,2.8e-05,4.1e-05,6e-05,9.4e-05,0.000108,4.8e-05,5.6e-05,0.000111,4.7e-05,3.9e-05,6.6e-05,6e-06,0.000158,4.3e-05,7.7e-05,4e-05,7.4e-05,0.000153,0.000158,0.000118,5.8e-05,9e-05,7.2e-05,0.000167,0.000125,0.000141,0.000104,6.2e-05,1.8e-05,1e-04,2e-05,0.000114,0.000173,0.000245
5.7e-05,5.9e-05,6.9e-05,7.2e-05,1.4e-05,0.000131,3.8e-05,3.1e-05,5.5e-05,5e-06,2.5e-05,1.4e-05,3.6e-05,0.000113,4.9e-05,5.2e-05,0.000122,8.7e-05,9.2e-05,0.000128,9.1e-05,8.4e-05,0.000106,6.3e-05,6.7e-05,7.2e-05,9.3e-05,6.4e-05,8e-05,0.000178,9.5e-05,3.3e-05,3.5e-05,3e-05,0.000107,8.1e-05,0.000111,9.6e-05,0.000147,0.000123,6.5e-05,8.9e-05,7.1e-05,0.000115,2.1e-05,7.6e-05,0.000117,5.8e-05,0.00021,0.000192,1.2e-05,4.8e-05,8.7e-05,8.6e-05,6.8e-05,5.3e-05,4.4e-05,0.000151,0.000171,0.000101,9.1e-05,7e-05,3.5e-05,0.00011,6.4e-05,5.9e-05,4.8e-05,0.000122,0.000108,3.4e-05,8.5e-05,0.000101,0.000118,0.00011,9.5e-05,8.9e-05,0.000148,0.000174,7.9e-05,8.7e-05,5.5e-05,2.1e-05,6.6e-05,0.000128,0.000174,0.000114,9.8e-05,0.000126,8.2e-05,6.8e-05,8.9e-05,1e-04,1.5e-05,4.6e-05,0.000109,7e-06,0.000106,6.8e-05,3.1e-05,7.3e-05,6.1e-05,4.6e-05,5.7e-05,5.3e-05,2.5e-05,5.6e-05,4.9e-05,5.6e-05,5.1e-05,2.4e-05,4.6e-05,3.5e-05,0.000106,0.000112,8.8e-05,2.3e-05,6.5e-05,7.1e-05,0.000152,0.000104,0.00014
1.5e-05,5e-06,1.5e-05,6.3e-05,5.7e-05,8.5e-05,6.7e-05,4.1e-05,4.1e-05,8e-06,3.2e-05,5e-05,1.7e-05,2.2e-05,1e-05,2.4e-05,7.3e-05,5.2e-05,3.4e-05,2.1e-05,3.9e-05,2.6e-05,2.7e-05,4.8e-05,5.3e-05,3.7e-05,5.1e-05,5.7e-05,2.2e-05,3.1e-05,4e-05,2.2e-05,3e-06,1.3e-05,3.7e-05,3.6e-05,3.2e-05,2.9e-05,5.1e-05,7.9e-05,4.8e-05,3.2e-05,6e-06,4.8e-05,3.3e-05,5.7e-05,2.7e-05,9e-06,7.3e-05,3.9e-05,6.4e-05,5.6e-05,4.5e-05,7.6e-05,6.5e-05,1.2e-05,2.8e-05,3.6e-05,3.8e-05,2.7e-05,3.9e-05,2.8e-05,2.7e-05,4.7e-05,4.3e-05,2.8e-05,1.1e-05,3.3e-05,3.5e-05,2e-05,5.8e-05,7.8e-05,2.3e-05,5e-05,5.7e-05,1e-04,1.2e-05,4.2e-05,9e-06,1.7e-05,3.3e-05,1.7e-05,2e-05,6.4e-05,1.9e-05,5.7e-05,2.1e-05,3.4e-05,4e-05,7e-06,3e-05,2e-05,4.3e-05,2e-05,1.5e-05,4.2e-05,5.5e-05,3.1e-05,3.3e-05,1.7e-05,2.8e-05,3.2e-05,2.9e-05,5.2e-05,2.1e-05,2.2e-05,2.9e-05,2.5e-05,1.6e-05,1.6e-05,8e-06,1.9e-05,2.5e-05,1.1e-05,4.1e-05,3.5e-05,3.4e-05,1e-05,4.3e-05,2.2e-05,2e-05
2.6e-05,2.3e-05,2.9e-05,3.9e-05,2.9e-05,4.1e-05,3.3e-05,2.9e-05,4.6e-05,1.2e-05,3.8e-05,2.4e-05,3.8e-05,3.1e-05,9e-06,2.6e-05,6.7e-05,2.4e-05,2.5e-05,3.3e-05,3.4e-05,5.2e-05,7e-06,1.2e-05,9e-06,1.7e-05,2.1e-05,2e-05,3.3e-05,2.9e-05,3.9e-05,2.2e-05,8e-06,2e-06,2.3e-05,3e-05,2.8e-05,2.4e-05,3.9e-05,6.2e-05,8.6e-05,5.1e-05,2.2e-05,8.3e-05,2.7e-05,4e-06,4.1e-05,4.2e-05,2.9e-05,1.8e-05,5.5e-05,7e-05,1.9e-05,4.2e-05,5.5e-05,7.3e-05,5.7e-05,4.5e-05,1.8e-05,8e-06,2.5e-05,3.6e-05,2.7e-05,5.3e-05,2.4e-05,2.2e-05,9e-06,1.3e-05,1.6e-05,4e-05,4.4e-05,2.2e-05,1.4e-05,4.1e-05,1.3e-05,5.5e-05,3.1e-05,3.6e-05,3.4e-05,1.7e-05,2.7e-05,4.3e-05,2.3e-05,4.6e-05,4.5e-05,3.4e-05,7e-06,2.4e-05,2.7e-05,3.2e-05,3.4e-05,3.4e-05,5.1e-05,2.8e-05,4.1e-05,4.5e-05,7.4e-05,8e-05,2.6e-05,6e-06,2.3e-05,4.8e-05,3.4e-05,1.5e-05,2.6e-05,3e-06,1e-06,1.2e-05,1.2e-05,2.2e-05,1e-06,1.8e-05,1.9e-05,1e-05,3e-05,3.9e-05,5.1e-05,5e-05,4.2e-05,2.4e-05,1.5e-05
5.5e-05,3.9e-05,1.2e-05,1.3e-05,3.1e-05,5.6e-05,3.9e-05,3.5e-05,2.8e-05,2e-05,1.5e-05,1.7e-05,2.3e-05,3.3e-05,1e-05,1.3e-05,1.3e-05,8e-06,8e-06,4.3e-05,1.1e-05,4.7e-05,4.7e-05,3.8e-05,1.7e-05,1.9e-05,2.7e-05,1.2e-05,2.3e-05,1.5e-05,6.4e-05,1.4e-05,7e-06,5e-06,9e-06,2.8e-05,3.6e-05,4.7e-05,2.8e-05,2.5e-05,2.3e-05,1.6e-05,6e-05,3.2e-05,5.6e-05,4.6e-05,4.5e-05,4.1e-05,4.2e-05,3.9e-05,4.9e-05,3.8e-05,4.5e-05,4.2e-05,2e-05,5.2e-05,1.6e-05,6e-05,5.6e-05,3.4e-05,2.9e-05,2.3e-05,5.9e-05,6.4e-05,3.3e-05,2.4e-05,4.6e-05,4.1e-05,4.1e-05,5.9e-05,6.9e-05,6.8e-05,2.6e-05,3e-05,3.3e-05,5e-05,2.1e-05,8e-06,2.9e-05,6.8e-05,4.5e-05,2.2e-05,2.4e-05,1.5e-05,2.7e-05,3.4e-05,6e-06,4e-06,2.9e-05,3.7e-05,2.9e-05,4.1e-05,2.9e-05,1.6e-05,5.5e-05,1.7e-05,3.9e-05,2.9e-05,8e-06,2.6e-05,3.2e-05,4e-05,2.2e-05,1e-05,1.2e-05,2.2e-05,2.6e-05,2.4e-05,1.3e-05,2.9e-05,2.7e-05,2.7e-05,2.7e-05,3.7e-05,2e-05,2e-05,2.7e-05,3.9e-05,3.1e-05,2.5e-05,1.9e-05
8e-06,8e-06,1e-05,1.6e-05,3.8e-05,6e-06,2.2e-05,7e-06,2.1e-05,3.8e-05,2.1e-05,1.1e-05,2.6e-05,1.9e-05,2.3e-05,1.1e-05,1.3e-05,1.8e-05,2.1e-05,4.3e-05,1.7e-05,3.6e-05,3.4e-05,2.1e-05,1.9e-05,3e-05,9e-06,2.6e-05,6e-06,2.8e-05,2.1e-05,5.3e-05,4.4e-05,3e-05,2.3e-05,2.2e-05,3.3e-05,3.3e-05,2.3e-05,1.9e-05,1.1e-05,3.3e-05,5.3e-05,6.1e-05,6.4e-05,2.7e-05,3.4e-05,1.7e-05,1.7e-05,2.3e-05,2.1e-05,1.7e-05,2.5e-05,1.3e-05,3.2e-05,6.3e-05,5.4e-05,6.5e-05,2e-05,1.4e-05,1.4e-05,7e-06,4.4e-05,1.4e-05,6e-06,3.6e-05,7.1e-05,1.4e-05,1.9e-05,2.1e-05,3.3e-05,5.5e-05,7.5e-05,4.2e-05,1.8e-05,5.6e-05,3.5e-05,1.3e-05,9e-06,3.3e-05,1.1e-05,1.8e-05,3.2e-05,1.8e-05,4.7e-05,2.7e-05,3.1e-05,2.2e-05,2.2e-05,3.7e-05,1.9e-05,2.7e-05,1.7e-05,2e-05,3.4e-05,1.7e-05,3e-05,2.8e-05,1.7e-05,4e-05,3.3e-05,8e-06,7e-06,9e-06,1.5e-05,1.6e-05,2.9e-05,2.7e-05,1.8e-05,3.6e-05,2.7e-05,3.4e-05,1.2e-05,1.9e-05,3.7e-05,3.6e-05,4.6e-05,2e-06,1.8e-05,3.4e-05,2.5e-05
3.3e-05,3e-05,3.7e-05,1.1e-05,2.4e-05,2.9e-05,5e-06,2e-05,2.3e-05,2.2e-05,2.3e-05,2.1e-05,4e-06,1.1e-05,6e-06,4e-06,7e-06,3.2e-05,2.1e-05,2.3e-05,1.3e-05,3.5e-05,1.4e-05,3e-05,2e-06,1.8e-05,1.5e-05,2.1e-05,1e-05,3.1e-05,8e-06,3.2e-05,6e-06,1.4e-05,1.6e-05,6e-06,1.4e-05,2.9e-05,4.1e-05,1.8e-05,1.8e-05,1.9e-05,7e-06,1e-05,1.1e-05,3.1e-05,1.7e-05,1.1e-05,1.4e-05,1.9e-05,2e-05,1.9e-05,1.8e-05,3.2e-05,3.8e-05,8e-06,2.4e-05,3.6e-05,3.3e-05,1.4e-05,1.7e-05,1.4e-05,8e-06,1.4e-05,1.2e-05,2.3e-05,2.5e-05,3e-05,2.2e-05,3.5e-05,5.1e-05,3.4e-05,5.1e-05,3e-05,1.2e-05,3.4e-05,2.6e-05,6e-06,6e-06,1.7e-05,7e-06,2.5e-05,3.9e-05,8e-06,3.7e-05,3.1e-05,2.7e-05,1.1e-05,1.4e-05,1.5e-05,8e-06,1.9e-05,6e-06,1.4e-05,3e-05,9e-06,1.4e-05,3e-06,1.9e-05,3.1e-05,1.8e-05,1.3e-05,1.1e-05,3e-06,1.9e-05,1.2e-05,1.5e-05,5.1e-05,5.6e-05,1.3e-05,2.4e-05,3.1e-05,4e-05,1.5e-05,2.9e-05,1.9e-05,2.4e-05,2.8e-05,1.7e-05,3.2e-05,7e-06
1.7e-05,1.4e-05,1.5e-05,1.8e-05,7e-06,1.2e-05,2.2e-05,2.6e-05,7e-06,1.8e-05,8e-06,2.3e-05,2.4e-05,1.4e-05,6e-06,1.2e-05,1.1e-05,2.6e-05,2.7e-05,4e-05,9e-06,2e-05,1e-05,1.5e-05,1.4e-05,2.3e-05,9e-06,1.8e-05,1.9e-05,2.4e-05,3.4e-05,2.7e-05,2e-05,1.8e-05,2e-05,3.5e-05,3e-05,2.6e-05,5e-06,2.5e-05,2.1e-05,2.6e-05,5e-06,2e-06,1.7e-05,3e-05,1.7e-05,1.1e-05,2.4e-05,2.1e-05,1.7e-05,1.1e-05,2.4e-05,4.9e-05,2.5e-05,1.2e-05,1.8e-05,4.2e-05,2.4e-05,1.8e-05,1e-05,1.6e-05,1.1e-05,1.2e-05,2.1e-05,2.6e-05,1.7e-05,3e-05,4e-06,1.6e-05,1.2e-05,3.4e-05,2e-06,2e-05,1.5e-05,1.4e-05,1.7e-05,1.9e-05,7e-06,2e-05,1.9e-05,3.3e-05,3e-06,1.2e-05,2.1e-05,1.6e-05,1.2e-05,1.2e-05,5e-06,8e-06,1.1e-05,7e-06,1.7e-05,1.5e-05,4.8e-05,1.3e-05,1.3e-05,1.5e-05,1.4e-05,2.6e-05,1.5e-05,1.3e-05,1e-06,6e-06,1.3e-05,8e-06,1.9e-05,4.5e-05,1.9e-05,1.5e-05,3.5e-05,9e-06,2.1e-05,9e-06,7e-06,1.6e-05,1.8e-05,1.8e-05,2e-05,1.7e-05,1.5e-05
1.4e-05,2.6e-05,2.3e-05,7e-06,2e-05,1.5e-05,3.9e-05,2.1e-05,8e-06,2.5e-05,2.4e-05,8e-06,9e-06,1.7e-05,5e-06,1.8e-05,5e-06,2e-06,1.7e-05,8e-06,2.3e-05,2.9e-05,2.8e-05,1.7e-05,8e-06,1.1e-05,1.2e-05,1.6e-05,3.8e-05,2.5e-05,1.1e-05,8e-06,1.8e-05,1.3e-05,1.2e-05,3e-05,2.5e-05,8e-06,4.9e-05,3.9e-05,3.5e-05,3e-05,3.4e-05,1.4e-05,2.6e-05,3.4e-05,2.2e-05,2.4e-05,1.3e-05,1.3e-05,1.4e-05,2.5e-05,3e-05,2.6e-05,1.4e-05,1.4e-05,2.1e-05,1.6e-05,2.7e-05,2.4e-05,1e-05,1.3e-05,1.8e-05,2.1e-05,4e-06,2.4e-05,2.2e-05,1.2e-05,1.7e-05,4e-06,2.2e-05,2.6e-05,2e-06,2.3e-05,9e-06,2.2e-05,6e-06,1.5e-05,1.5e-05,1.6e-05,1.8e-05,1.6e-05,1.7e-05,2.1e-05,1.3e-05,3.2e-05,7e-06,1.2e-05,5e-06,1.6e-05,2.4e-05,2.3e-05,2.7e-05,1.4e-05,5.9e-05,1.3e-05,2.6e-05,1.5e-05,1e-05,1e-05,2.2e-05,2.1e-05,2.5e-05,1.7e-05,1.2e-05,7e-06,3.8e-05,1.8e-05,3.3e-05,1.4e-05,1.7e-05,1.5e-05,2.1e-05,1.8e-05,1.6e-05,1.6e-05,1.2e-05,6e-06,1.9e-05,2.2e-05,2e-06
3.5e-05,4e-05,9e-06,3e-06,1e-05,3e-05,4.3e-05,1.5e-05,8e-06,2.6e-05,1.4e-05,1.1e-05,9e-06,2.3e-05,2.4e-05,3e-05,2.3e-05,1.5e-05,1e-05,1.6e-05,2.2e-05,1.7e-05,1.9e-05,1.8e-05,2.4e-05,1.6e-05,1.5e-05,6e-06,2.7e-05,2.5e-05,8e-06,1.7e-05,1.9e-05,1.2e-05,2.5e-05,1.1e-05,1.4e-05,8e-06,4.6e-05,7e-06,4.3e-05,2.6e-05,2.7e-05,1.9e-05,1.7e-05,1.9e-05,1.4e-05,3.1e-05,3e-05,3e-05,2.8e-05,2.1e-05,1.1e-05,3.3e-05,4.3e-05,2.1e-05,1.1e-05,2.2e-05,4.1e-05,1.2e-05,2.2e-05,7e-06,1.9e-05,6e-06,2.2e-05,2e-05,2.8e-05,1e-05,2.3e-05,1.6e-05,2.9e-05,1.6e-05,2e-05,9e-06,2.8e-05,1.8e-05,2.9e-05,2.2e-05,1.3e-05,9e-06,3.3e-05,2.5e-05,2.2e-05,2.5e-05,8e-06,2.9e-05,1.5e-05,1.5e-05,2.6e-05,3e-06,2e-05,7e-06,1.9e-05,1.8e-05,4.7e-05,2.6e-05,2.9e-05,1.5e-05,2e-05,1.8e-05,4.2e-05,4.1e-05,2e-05,1.7e-05,1.1e-05,2e-05,3e-05,3.9e-05,3.2e-05,3.6e-05,2.7e-05,2e-05,2.7e-05,2.5e-05,3.4e-05,1.3e-05,1.2e-05,1.2e-05,4.8e-05,3.2e-05,1.4e-05
3.3e-05,2.2e-05,2.7e-05,1.2e-05,2.9e-05,3.2e-05,1.6e-05,1.1e-05,2.3e-05,2.4e-05,2.3e-05,2e-06,6e-06,4e-06,2e-05,2.5e-05,2.3e-05,2.3e-05,7e-06,1e-05,1.3e-05,1.9e-05,1.7e-05,2e-05,2.6e-05,1.3e-05,2.2e-05,2e-05,2.3e-05,3.6e-05,3.9e-05,2.4e-05,3.3e-05,2e-05,3.1e-05,1.9e-05,6e-06,2.5e-05,3.1e-05,2.7e-05,2.3e-05,3.8e-05,9e-06,4e-06,1.1e-05,1.8e-05,1.7e-05,2e-05,1.4e-05,8e-06,1.3e-05,2.2e-05,1.7e-05,2.4e-05,2.7e-05,2e-05,2.6e-05,3e-06,1.2e-05,1.5e-05,3.3e-05,3e-05,3.1e-05,1.7e-05,3.9e-05,4.5e-05,2.1e-05,2e-05,2.4e-05,1.5e-05,2e-05,1e-05,1.7e-05,9e-06,2.8e-05,3.9e-05,3.6e-05,1.8e-05,1.1e-05,9e-06,1.8e-05,8e-06,2.3e-05,1.3e-05,2.2e-05,2.6e-05,2.3e-05,3.2e-05,3.5e-05,1.9e-05,1.4e-05,1.4e-05,1.2e-05,2.1e-05,3.9e-05,2.4e-05,1.5e-05,1.2e-05,1e-05,6e-06,4.2e-05,3.1e-05,2.8e-05,1.3e-05,2.8e-05,3.7e-05,3.4e-05,3.1e-05,5e-06,2.4e-05,2.3e-05,9e-06,1.5e-05,2.2e-05,1e-05,2.1e-05,2.4e-05,3.3e-05,4.7e-05,2.4e-05,6e-06
9e-06,8e-06,4e-06,4e-06,3.1e-05,1.2e-05,4e-06,1.4e-05,1.6e-05,4e-06,1.1e-05,1.4e-05,1.1e-05,1.9e-05,3e-05,7e-06,2.2e-05,1e-05,1.1e-05,1.9e-05,1.5e-05,1.3e-05,9e-06,1e-05,1.8e-05,1.7e-05,7e-06,2e-05,2.4e-05,1.1e-05,1.5e-05,1e-05,1.4e-05,2.1e-05,1.8e-05,6e-06,5e-06,1.7e-05,1.1e-05,2.1e-05,2.5e-05,1.7e-05,4e-06,6e-06,5e-06,1.1e-05,1.3e-05,8e-06,1.3e-05,7e-06,1.7e-05,3e-05,1.1e-05,1.6e-05,8e-06,1e-05,3e-05,2.4e-05,5e-06,1.7e-05,1.4e-05,1.4e-05,3e-06,1.8e-05,2.1e-05,1.8e-05,1.4e-05,8e-06,2.4e-05,2.3e-05,1.3e-05,1.6e-05,2.9e-05,1.1e-05,1.7e-05,3.4e-05,7e-06,1e-05,7e-06,8e-06,9e-06,1.5e-05,1.9e-05,4e-06,2.3e-05,4e-06,1.8e-05,1.5e-05,1.8e-05,6e-06,1.7e-05,1.5e-05,1.1e-05,6e-06,3.7e-05,9e-06,1.4e-05,1.6e-05,6e-06,1.5e-05,2.3e-05,1.9e-05,1.9e-05,1.8e-05,9e-06,2.1e-05,1.5e-05,2.6e-05,2e-05,1.8e-05,1.8e-05,1.1e-05,1.2e-05,2.3e-05,2.3e-05,2.5e-05,1.4e-05,7e-06,2.1e-05,1.9e-05,1.4e-05
5e-06,6e-06,2e-05,2e-05,2.1e-05,1.1e-05,1.2e-05,1.6e-05,2.3e-05,2e-05,1.4e-05,1.5e-05,2.3e-05,2.3e-05,1e-05,3e-06,9e-06,1.2e-05,1.7e-05,4e-05,1.4e-05,1e-05,1.1e-05,1.6e-05,1.4e-05,1.8e-05,4e-06,2.1e-05,1.2e-05,2.1e-05,1.7e-05,1.7e-05,2e-06,1.9e-05,3.3e-05,8e-06,1.3e-05,1.9e-05,1.7e-05,1.6e-05,2.6e-05,2.3e-05,1.5e-05,1.7e-05,4e-06,8e-06,1e-05,1.1e-05,2.4e-05,1.6e-05,1.6e-05,2.3e-05,2.2e-05,2.1e-05,4e-06,1.3e-05,1.9e-05,2.2e-05,2.7e-05,7e-06,2.9e-05,1.2e-05,1.1e-05,3.9e-05,2e-05,1.8e-05,1.5e-05,1e-05,2.1e-05,6e-06,1.4e-05,1.8e-05,1.8e-05,1.7e-05,1.1e-05,1.7e-05,9e-06,1.1e-05,1.9e-05,2.1e-05,1.2e-05,2.3e-05,1.4e-05,2e-05,2.5e-05,2.2e-05,1.6e-05,2.6e-05,2.7e-05,1.8e-05,2.6e-05,6e-06,3e-06,2e-05,2e-05,2.9e-05,1.4e-05,1.6e-05,8e-06,1.4e-05,2.5e-05,3.2e-05,1e-05,9e-06,2e-06,2.1e-05,2.5e-05,2.3e-05,1e-05,1.1e-05,1.4e-05,1.2e-05,5e-06,1.2e-05,2.7e-05,1.6e-05,1.9e-05,2e-05,2.8e-05,1.4e-05,1e-05
5e-06,7e-06,1.5e-05,1.4e-05,1.7e-05,1.9e-05,5e-06,9e-06,1.7e-05,1.8e-05,3e-06,1.2e-05,1e-05,1.9e-05,9e-06,1e-05,1.6e-05,1.6e-05,6e-06,1.6e-05,7e-06,2.8e-05,3.1e-05,2.1e-05,1e-05,2.1e-05,1.9e-05,3.1e-05,1.7e-05,3e-05,3.1e-05,2.1e-05,2e-05,1.4e-05,1.5e-05,3.4e-05,4e-05,2e-05,1.8e-05,1e-05,1.4e-05,1.4e-05,2.3e-05,1.7e-05,1.8e-05,2.2e-05,2.4e-05,1.1e-05,2.7e-05,6e-06,1.1e-05,5e-06,5e-06,1.1e-05,1.2e-05,1.6e-05,2.1e-05,5e-06,1.8e-05,2.4e-05,2.5e-05,2.5e-05,3.4e-05,3.1e-05,1.6e-05,2.4e-05,1.6e-05,2.3e-05,1.8e-05,2.4e-05,2.1e-05,1.8e-05,2.6e-05,1.6e-05,1.6e-05,2.4e-05,2.1e-05,1e-05,2.9e-05,1e-05,2.4e-05,1.4e-05,1.5e-05,2.5e-05,2.4e-05,2e-05,1.5e-05,2.3e-05,6e-06,1.5e-05,9e-06,2.1e-05,2.4e-05,1.6e-05,3e-05,2e-05,1.1e-05,1e-05,9e-06,8e-06,9e-06,2.5e-05,2.7e-05,2e-05,7e-06,2e-05,1.1e-05,2.8e-05,1.6e-05,2.3e-05,3e-05,2.6e-05,1.6e-05,1.3e-05,2e-05,9e-06,1.3e-05,1.6e-05,4e-06,1.5e-05,1.9e-05
1.2e-05,4e-06,1.6e-05,1.1e-05,2.9e-05,3.1e-05,1.6e-05,1e-06,1.3e-05,2.1e-05,4.2e-05,2.8e-05,2.3e-05,2.1e-05,2.1e-05,2.5e-05,2.5e-05,3.5e-05,2.6e-05,2.8e-05,9e-06,1.9e-05,2.1e-05,2.1e-05,1e-05,2.3e-05,3.2e-05,1.1e-05,1.7e-05,2.3e-05,2.1e-05,3.4e-05,2e-05,7e-06,1.3e-05,2.7e-05,7e-06,3.6e-05,2.6e-05,2.9e-05,2.7e-05,4e-06,1.4e-05,1.4e-05,2.3e-05,1.7e-05,2e-05,9e-06,2.1e-05,7e-06,6e-06,7e-06,1.8e-05,2e-05,1.5e-05,8e-06,1.4e-05,1.2e-05,1.7e-05,2.6e-05,3e-05,1.9e-05,1e-05,3.6e-05,3.8e-05,2.3e-05,2.5e-05,2.1e-05,1.9e-05,1.6e-05,1.1e-05,1.6e-05,4.4e-05,4e-05,3.4e-05,1.6e-05,8e-06,2.1e-05,6e-06,9e-06,2.5e-05,1.9e-05,1.2e-05,2e-05,1.9e-05,7e-06,8e-06,2.3e-05,2.1e-05,1.8e-05,1.5e-05,2.9e-05,2.1e-05,1.5e-05,3e-06,2.7e-05,9e-06,9e-06,8e-06,7e-06,1.3e-05,1.2e-05,1.3e-05,2.9e-05,2.9e-05,2.1e-05,2e-05,1.5e-05,3.1e-05,2.4e-05,4e-06,8e-06,9e-06,1.5e-05,7e-06,2.4e-05,1.8e-05,4e-06,2.7e-05,2.1e-05,1.6e-05
5e-06,3e-06,2.4e-05,3e-06,1.4e-05,1.3e-05,1.9e-05,1.1e-05,2.1e-05,1.2e-05,5e-05,3.9e-05,1.1e-05,2.9e-05,8e-06,1.9e-05,0,1.3e-05,2e-06,4.1e-05,1.5e-05,1.4e-05,5e-06,1.6e-05,2.1e-05,8e-06,2e-06,2.4e-05,3e-05,1.3e-05,1.3e-05,1.8e-05,1.2e-05,1e-05,1.2e-05,1.2e-05,1.8e-05,3e-05,6e-06,3.7e-05,3e-05,2.7e-05,8e-06,2.4e-05,9e-06,7e-06,1.1e-05,1.4e-05,1e-05,1.1e-05,1.7e-05,2.1e-05,3.5e-05,9e-06,8e-06,1.7e-05,1.4e-05,1.2e-05,7e-06,1.9e-05,2.6e-05,1.7e-05,3e-06,1.2e-05,9e-06,2.9e-05,2.1e-05,2.4e-05,2.3e-05,1.9e-05,1.6e-05,3e-05,2.9e-05,1.1e-05,1.4e-05,1.7e-05,6e-06,1.4e-05,8e-06,9e-06,2.4e-05,1e-05,1.2e-05,8e-06,2.2e-05,9e-06,1.4e-05,9e-06,4e-06,7e-06,1.2e-05,2.8e-05,3.3e-05,3.1e-05,1.2e-05,2.6e-05,1.6e-05,5e-06,1.5e-05,2.1e-05,2.7e-05,1.1e-05,6e-06,1.2e-05,1.7e-05,2.3e-05,1.2e-05,1.6e-05,3.3e-05,7e-06,2e-06,4e-06,1.3e-05,2.5e-05,3.1e-05,3.5e-05,1e-05,7e-06,3.4e-05,1e-05,1.3e-05
2.6e-05,9e-06,1.7e-05,2.5e-05,2.1e-05,9e-06,1.3e-05,9e-06,3e-05,1.1e-05,2.9e-05,1.3e-05,7e-06,1.1e-05,2.2e-05,3.7e-05,3.5e-05,2e-05,9e-06,4.9e-05,1.7e-05,9e-06,9e-06,1.5e-05,1.1e-05,1.5e-05,2.3e-05,9e-06,7e-06,8e-06,8e-06,1.4e-05,1.8e-05,2.1e-05,6e-06,1.4e-05,1.2e-05,8e-06,1.7e-05,5.7e-05,2.1e-05,2e-05,1.8e-05,2.5e-05,1.9e-05,1.4e-05,1.3e-05,1.2e-05,1.2e-05,2.1e-05,6e-06,1.2e-05,1.8e-05,1.5e-05,1.1e-05,9e-06,4e-06,1e-05,1e-05,1.4e-05,2.4e-05,2.7e-05,3e-06,5e-06,2.1e-05,1.7e-05,2.2e-05,2.8e-05,1.2e-05,7e-06,1.2e-05,2.5e-05,2.1e-05,1.5e-05,4e-06,9e-06,7e-06,1.1e-05,1.8e-05,1.2e-05,1e-06,1.7e-05,2.6e-05,2.1e-05,2.4e-05,1e-05,1.8e-05,1.5e-05,1.5e-05,3e-06,1.6e-05,3.8e-05,1.6e-05,1.9e-05,2.8e-05,3.4e-05,1.4e-05,2.1e-05,2.9e-05,7e-06,2.4e-05,9e-06,1.6e-05,7e-06,9e-06,1.8e-05,2.7e-05,2.1e-05,7e-06,8e-06,1.4e-05,5e-06,6e-06,1.9e-05,8e-06,2.1e-05,1.3e-05,1.3e-05,1.6e-05,2.9e-05,4.1e-05
1e-05,1.2e-05,8e-06,7e-06,8e-06,4e-06,9e-06,6e-06,1.2e-05,1.4e-05,1.1e-05,2.4e-05,7e-06,1.2e-05,2.7e-05,4e-05,1.2e-05,1.9e-05,1.8e-05,3e-05,3.2e-05,2.1e-05,7e-06,7e-06,1.4e-05,1.4e-05,1.8e-05,1.2e-05,4e-06,1.4e-05,2.1e-05,2.4e-05,2.1e-05,2.7e-05,1.3e-05,2.8e-05,1.7e-05,6e-06,2.1e-05,4.7e-05,9e-06,1e-05,2.4e-05,9e-06,5e-06,1.5e-05,3e-06,1.2e-05,7e-06,1.2e-05,2e-05,1.1e-05,8e-06,1.4e-05,6e-06,8e-06,8e-06,8e-06,1.7e-05,1.5e-05,3e-06,1e-05,2.3e-05,5e-06,1.3e-05,1.5e-05,1.6e-05,9e-06,1.9e-05,9e-06,1.1e-05,1e-05,7e-06,3e-06,1e-05,3e-06,9e-06,1e-05,1e-05,7e-06,1.4e-05,2.9e-05,8e-06,1.3e-05,2e-05,1.8e-05,3e-06,7e-06,3e-06,1.2e-05,1.1e-05,1.1e-05,1.3e-05,1.2e-05,3.1e-05,2.7e-05,1e-05,2.3e-05,1e-05,1.4e-05,2.3e-05,2.1e-05,1.6e-05,1.3e-05,7e-06,1.4e-05,5e-06,1.9e-05,1.8e-05,1e-05,1.5e-05,1.6e-05,9e-06,6e-06,5e-06,1.5e-05,1.8e-05,2.5e-05,1.6e-05,1.7e-05,1.3e-05
7e-06,6e-06,1e-05,1.2e-05,1.4e-05,7e-06,9e-06,1.8e-05,1.6e-05,1.6e-05,3e-06,1e-05,1.2e-05,2.3e-05,1.8e-05,4e-06,1.9e-05,4e-06,3e-06,3e-06,1.3e-05,1e-05,3e-06,1.3e-05,2e-06,1e-06,1.6e-05,1.7e-05,1e-05,1.3e-05,2e-05,6e-06,1.1e-05,7e-06,7e-06,1.6e-05,1e-05,8e-06,1.7e-05,2.2e-05,7e-06,1e-05,1.3e-05,2e-06,7e-06,7e-06,4e-06,1e-05,3e-06,1e-06,1.7e-05,1.1e-05,1.2e-05,5e-06,7e-06,1.3e-05,8e-06,1e-05,1.1e-05,6e-06,2e-06,7e-06,1.7e-05,2.1e-05,1.1e-05,1.5e-05,2.1e-05,6e-06,1.2e-05,9e-06,1.7e-05,1.2e-05,5e-06,6e-06,9e-06,4e-06,7e-06,1.6e-05,5e-06,1.4e-05,1.3e-05,1.3e-05,1.9e-05,1.8e-05,6e-06,1.7e-05,5e-06,6e-06,7e-06,6e-06,1.2e-05,1.7e-05,1.2e-05,4e-06,2.4e-05,1.7e-05,7e-06,1.3e-05,7e-06,2e-06,1.2e-05,1.2e-05,8e-06,8e-06,2e-06,7e-06,1.7e-05,6e-06,4e-06,4e-06,1.3e-05,5e-06,1.2e-05,1.4e-05,4e-06,1.8e-05,1.9e-05,1e-06,1.4e-05,6e-06,1.2e-05
4e-06,0,1.1e-05,1.1e-05,1.3e-05,3e-06,6e-06,7e-06,8e-06,1e-05,0,6e-06,7e-06,1.3e-05,1e-05,1.6e-05,1.3e-05,5e-06,6e-06,4e-06,4e-06,1e-05,4e-06,8e-06,3e-06,2e-06,5e-06,7e-06,5e-06,4e-06,6e-06,1.2e-05,6e-06,1.3e-05,4e-06,9e-06,4e-06,7e-06,1.4e-05,2.1e-05,1e-06,7e-06,4e-06,8e-06,2e-06,1e-06,3e-06,9e-06,3e-06,5e-06,1.3e-05,1e-06,7e-06,6e-06,4e-06,5e-06,3e-06,2e-06,1e-05,0,4e-06,2e-06,9e-06,8e-06,9e-06,2.1e-05,1.2e-05,3e-06,7e-06,4e-06,1.3e-05,1e-05,3e-06,1e-06,6e-06,4e-06,6e-06,1.1e-05,4e-06,5e-06,1.8e-05,4e-06,9e-06,1e-05,1.4e-05,1e-05,2e-06,1e-05,3e-06,1e-06,7e-06,1.5e-05,5e-06,2e-06,2.3e-05,1.6e-05,3e-06,1.1e-05,4e-06,3e-06,1.9e-05,4e-06,4e-06,5e-06,3e-06,3e-06,8e-06,6e-06,3e-06,3e-06,4e-06,8e-06,8e-06,5e-06,9e-06,3e-06,5e-06,1e-06,1.4e-05,6e-06,3e-06
5e-06,2e-06,9e-06,1.2e-05,1e-05,4e-06,5e-06,5e-06,9e-06,8e-06,1e-06,4e-06,2e-06,1.4e-05,9e-06,1.3e-05,1e-05,5e-06,5e-06,6e-06,3e-06,8e-06,1e-06,7e-06,2e-06,3e-06,1e-06,4e-06,4e-06,3e-06,7e-06,1e-05,5e-06,6e-06,2e-06,7e-06,2e-06,4e-06,1.3e-05,2.1e-05,4e-06,5e-06,5e-06,6e-06,2e-06,0,3e-06,7e-06,1e-06,5e-06,9e-06,1e-06,8e-06,4e-06,4e-06,3e-06,1e-06,2e-06,1e-05,3e-06,2e-06,3e-06,4e-06,1.1e-05,8e-06,1.7e-05,1.1e-05,6e-06,3e-06,0,1.3e-05,1.3e-05,5e-06,4e-06,4e-06,3e-06,3e-06,1.3e-05,6e-06,3e-06,1.5e-05,5e-06,8e-06,9e-06,8e-06,1e-05,1e-06,8e-06,3e-06,3e-06,4e-06,1.1e-05,1e-06,2e-06,2.2e-05,1.6e-05,1e-06,8e-06,2e-06,3e-06,1.3e-05,2e-06,2e-06,1e-06,1e-06,1e-06,9e-06,2e-06,1e-06,1e-06,3e-06,5e-06,5e-06,3e-06,8e-06,3e-06,6e-06,2e-06,1.1e-05,2e-06,5e-06
6e-06,1e-06,9e-06,1.1e-05,9e-06,3e-06,3e-06,5e-06,1e-05,8e-06,0,2e-06,2e-06,1.4e-05,7e-06,1.3e-05,9e-06,4e-06,4e-06,6e-06,2e-06,8e-06,1e-06,8e-06,4e-06,2e-06,4e-06,2e-06,3e-06,4e-06,4e-06,1e-05,2e-06,8e-06,2e-06,6e-06,0,4e-06,1.4e-05,2.1e-05,3e-06,4e-06,3e-06,5e-06,0,1e-06,3e-06,7e-06,2e-06,5e-06,8e-06,1e-06,8e-06,3e-06,4e-06,2e-06,3e-06,2e-06,1e-05,3e-06,2e-06,3e-06,3e-06,1.1e-05,8e-06,1.6e-05,9e-06,4e-06,1e-06,1e-06,1.1e-05,1.3e-05,5e-06,2e-06,5e-06,4e-06,4e-06,1.1e-05,6e-06,3e-06,1.5e-05,5e-06,7e-06,8e-06,1.1e-05,1.1e-05,2e-06,6e-06,4e-06,1e-06,2e-06,9e-06,2e-06,2e-06,2.2e-05,1.5e-05,1e-06,8e-06,2e-06,4e-06,1.3e-05,1e-06,4e-06,2e-06,1e-06,1e-06,1.2e-05,4e-06,1e-06,1e-06,1e-06,3e-06,3e-06,1e-06,1e-05,2e-06,5e-06,2e-06,1.2e-05,3e-06,3e-06
