-0.000305,-6e-05,-0.000138,-0.031901,-0.089623,-0.057572,-0.148913,-0.220154,-0.197737,-0.180731,-0.160676,-0.127793,-0.095176,-0.05834,-0.026715,-0.010202,-0.006889,-0.002248,-0.001304,-0.005696,-0.018388,-0.004679,-8e-05,-8.1e-05,-7.3e-05,-4e-04,-0.000171,-6e-06
-0.000355,-6.5e-05,-5.4e-05,-0.01799,-0.056583,-0.046413,-0.068573,-0.053698,0.03542,0.088938,0.129181,0.094396,0.063671,0.057981,0.031842,0.011932,0.008617,0.00252,0.000997,-0.0014,-0.011727,-0.003524,1e-06,-1.1e-05,3.4e-05,7.4e-05,1.6e-05,1e-06
-6.1e-05,-3e-06,5.5e-05,0.014047,0.036847,-0.024612,-0.066508,-0.027409,0.003833,0.00605,-0.016722,-0.039936,-0.039396,-0.016591,-0.00761,-0.003505,-0.001589,-0.000465,-0.000195,9.1e-05,0.000367,-7.6e-05,-7e-06,1e-05,1.7e-05,3.6e-05,2.6e-05,3e-06
0.000205,5.1e-05,5.9e-05,0.023938,0.066076,-0.00962,-0.016388,0.02629,-0.053846,-0.095136,-0.1289,-0.077493,-0.041196,-0.050291,-0.025376,-0.008888,-0.007244,-0.002145,-0.000583,0.000868,0.008859,0.002851,-1.1e-05,6e-06,-9e-06,-1.2e-05,2.6e-05,9e-06
0.000201,4.5e-05,-1.5e-05,0.001336,0.004104,0.026295,0.12915,0.19142,0.134121,0.113807,0.142456,0.133709,0.109815,0.06476,0.029585,0.012294,0.008126,0.002456,0.001205,0.003693,0.012452,0.003667,7.6e-05,2.8e-05,4.6e-05,0.000352,0.000161,9e-06
-7e-05,-2.1e-05,-9.1e-05,-0.026461,-0.068554,0.006783,0.031328,0.009367,0.044246,0.039147,0.04783,0.014364,-0.009455,0.007563,0.000818,-0.000946,0.000533,3.2e-05,-0.000297,-0.001615,-0.005472,-0.001358,0,-2.1e-05,-5.9e-05,-6.9e-05,-2.1e-05,-7e-06
-0.000264,-6.1e-05,-4.2e-05,-0.013928,-0.033082,-0.014363,-0.102283,-0.207732,-0.175832,-0.156039,-0.165388,-0.121054,-0.086566,-0.060085,-0.026745,-0.010418,-0.008287,-0.002593,-0.000992,-0.005155,-0.01628,-0.004265,-6.5e-05,-3.3e-05,-0.00011,-0.000409,-0.00016,-8e-06
-0.000127,-2.2e-05,4.6e-05,0.020157,0.056738,0.01433,-0.01066,-0.046299,-0.036227,0.011116,0.046788,0.035161,0.031551,0.030489,0.016728,0.00704,0.00474,0.00132,0.000612,0.001139,0.000821,-2.2e-05,2.9e-05,2.9e-05,-1e-05,-2.6e-05,7e-06,7e-06
0.000153,3.8e-05,3.4e-05,0.018214,0.04929,0.024695,0.054607,0.101048,0.108258,0.104172,0.096901,0.049341,0.017044,0.022192,0.009824,0.002204,0.003044,0.001015,0.000221,0.003278,0.010889,0.00264,2.2e-05,1.8e-05,1.6e-05,0.000128,7.8e-05,9e-06
0.000242,5e-05,-7e-06,-0.009439,-0.029363,-0.00547,0.005665,0.030832,0.001085,-0.036882,-0.091423,-0.043061,-0.012131,-0.036896,-0.015968,-0.005546,-0.005845,-0.001602,-0.000405,-0.000622,0.001613,0.000802,-3.9e-05,-3.8e-05,-1.6e-05,5.5e-05,4.3e-05,7e-06
3.9e-05,4e-06,-1.2e-05,-0.017784,-0.051764,-0.017317,0.009491,0.004986,-0.014672,-0.017677,0.003905,0.015356,0.030243,0.015779,0.005424,0.003872,0.001862,0.000328,3.3e-05,-0.000773,-0.002585,-0.000405,-1.3e-05,-3.7e-05,-2.7e-05,-3.4e-05,-9e-06,4e-06
-0.000197,-4.1e-05,7e-06,-0.001771,-0.003531,-0.008414,-4.6e-05,-0.006618,0.0379,0.032976,0.067806,0.026876,-0.012787,0.021589,0.008011,0.000837,0.003114,0.000941,3.2e-05,7.5e-05,-0.002577,-0.001015,3.2e-05,6e-06,-1.3e-05,-0.000167,-8.2e-05,1e-06
-0.000166,-3.3e-05,3.2e-05,0.015567,0.040842,-0.004634,-0.056213,-0.082683,-0.066387,-0.065489,-0.088008,-0.051753,-0.037728,-0.034893,-0.011343,-0.004807,-0.004418,-0.00109,-9e-05,-0.000677,-0.00237,-0.000837,3.8e-05,4.1e-05,8e-06,-8.9e-05,-4e-05,3e-06
6.8e-05,1.4e-05,2e-05,0.010322,0.025334,0.000503,-0.026024,-0.04325,-0.061981,-0.024055,-0.020128,-0.013377,0.008977,-0.000339,-0.001118,0.00217,0.000487,-6.8e-05,-8.2e-05,0.000748,0.00359,0.001008,3.3e-05,4e-05,4.7e-05,0.000234,0.000101,3e-06
0.000196,4.2e-05,-5e-06,-0.008401,-0.021819,0.005318,0.044781,0.095365,0.105355,0.09934,0.102387,0.054443,0.021895,0.0289,0.009181,0.002121,0.003777,0.001146,5.3e-05,0.001448,0.004688,0.001293,-9e-06,-1.6e-05,1.7e-05,8.8e-05,3.5e-05,-2e-06
8.9e-05,2e-05,-1.4e-05,-0.011501,-0.027409,0.011515,0.016738,0.04971,0.049923,0.020105,-0.017445,0.010943,0.01704,-0.013242,-0.002799,-0.00199,-0.002094,-0.00046,0.000147,-0.001302,-0.004077,-0.000866,-3.8e-05,-4e-05,3e-06,-1e-05,-1.7e-05,-5e-06
-0.000114,-2.7e-05,-2.5e-05,-0.00029,0.001725,0.007634,-0.026266,-0.063206,-0.081825,-0.062636,-0.052106,-0.036072,-0.009594,-0.012283,-0.006431,0.000191,-0.001661,-0.00076,-0.000305,-0.001706,-0.004829,-0.001127,-2.1e-05,-1.3e-05,3e-06,-7e-06,-2.3e-05,-5e-06
-0.000155,-3.7e-05,-5e-06,0.008483,0.018506,-0.005111,0.013442,-0.009469,-0.004127,0.007141,0.042249,0.001332,-0.027006,0.018232,0.005735,0.000537,0.002256,0.000663,-0.000128,0.001001,0.002459,0.000409,9e-06,9e-06,-3e-06,-6.3e-05,-3.9e-05,-3e-06
1e-05,2e-06,2e-05,0.003184,0.002887,-0.011246,0.020097,0.023365,0.028584,0.014225,-0.012193,0.007635,0.008814,-0.004174,0.002529,-0.00085,6e-05,0.000291,0.000369,0.001065,0.003357,0.000742,1.4e-05,9e-06,6e-06,3e-06,1e-06,-1e-06
