-0.00796,-0.006064,-0.004365,-0.002874,-0.001902,-0.003737,-0.007704,-0.009689,-0.006895,-0.006968,-0.004316,-0.00459,-0.010221,-0.0086,-0.01243,-0.006285,-0.006884,-0.008428,-0.008861,-0.008757,-0.008628,-0.006594,-0.008406,-0.008283,-0.005916,-0.009196,-0.005229,-0.0081,-0.004691,-0.005047,-0.00475,-0.004208,-0.007837,-0.006427,-0.006993,-0.006388,-0.007389,-0.005174,-0.007423,-0.005532,-0.005433,-0.003666,-0.00545,-0.005852,-0.00572,-0.007952,-0.006573,-0.005123,-0.002371,-0.006216,-0.002649,-0.003341,-0.003024,-0.003742,-0.004645,-0.006401,-0.007684,-0.005332,-0.006097,-0.005148,-0.006825,-0.005811,-0.003887,-0.003759,-0.001577,-0.005569,-0.004666,-0.00567,-0.005447,-0.005602,-0.003945,-0.009466,-0.00428,-0.005359,-0.005759,-0.006857,-0.006414,-0.003546,-0.000664,-0.0028,-0.005382,-0.00641,-0.006902,-0.005549,-0.003786,-0.000214,-0.010113,-0.010402,-0.007284,-0.00266,-0.004048,-0.008086,-0.009295,-0.00784,-0.005326,-0.004081,-0.003905,-0.006064,-0.005996,-0.003923,-0.004284,-0.004893,-0.007313,-0.006536,-0.005934,-0.006717,-0.004379,-0.005027,-0.006361,-0.003648,-0.004855,-0.006095,-0.00301,-0.005441,-0.00548,-0.007281,-0.004995,-0.005846,-0.006156,-0.004967,-0.002551
0.003327,0.001912,-0.001644,-0.001946,-0.000147,0.001151,0.002355,0.00447,0.001605,0.003173,-8.6e-05,0.000325,-0.000931,0.001785,0.005672,0.002572,0.000162,0.002971,0.002289,0.003485,0.004322,0.002181,0.003163,0.002919,0.003117,0.002411,0.00197,0.004303,0.001275,-0.000608,0.00057,5.9e-05,0.003174,0.002088,0.000368,0.004324,-0.001418,-0.00112,0.001335,0.000196,-2e-06,0.002188,0.001729,0.001017,0.001596,0.0032,0.001276,0.000862,-0.005253,-0.001282,-0.002913,-0.003068,-0.001483,-0.002004,-0.000743,0.000962,0.002698,0.00218,0.001462,-2.2e-05,-0.001772,-0.001176,-0.000237,-0.002624,-0.002199,0.000416,-0.001249,0.003004,-0.000723,0.001383,-0.000108,0.002105,0.001691,0.00135,0.00015,0.000887,0.002096,-0.000701,-0.003123,-0.003992,-0.000374,0.004445,0.00362,0.001255,-0.00146,-0.001885,0.001091,-0.000896,-0.00069,0.000679,0.00017,0.001018,0.000288,0.001489,0.002411,-0.000965,-0.002207,0.000608,0.000807,-0.001371,-9.7e-05,-0.000393,0.001085,0.000757,-0.000458,-0.001792,-0.000619,-0.000139,-0.001432,-0.002109,0.000381,-0.005031,-0.001047,-2e-04,-0.00095,-5e-06,-0.003076,0.000516,-0.001938,-0.000473,0.000277
-0.002819,-0.000474,0.001465,0.00055,0.000615,-0.00052,-2e-06,-0.004021,-0.003907,-0.002091,-0.000638,-0.002797,0.000501,-0.001227,-0.003773,-0.000725,0.000421,-0.002036,0.000728,-0.001213,-0.002897,-0.000473,-0.001922,-0.002924,-0.003258,-0.002647,-0.000925,-0.001595,-0.002047,0.000951,-0.001164,0.000389,-0.000765,-0.002543,-0.000274,-0.004295,-0.000318,-0.000833,-0.001066,-0.002205,-0.001346,-0.001468,-0.001271,-0.002339,0.000783,-0.002129,-0.000103,-0.000717,0.000487,0.000781,0.001808,0.002229,-0.000121,-0.001822,0.000242,-0.001306,-0.002632,-0.003172,-0.001704,-0.000369,0.001082,0.000704,-0.00062,-0.001324,0.000504,-0.00146,4.2e-05,-0.000943,0.000214,-0.001396,-0.000222,-0.001614,-0.000685,-0.001444,0.000379,0.00034,-0.00048,-0.001816,0.000392,-0.000167,-0.000142,-0.005769,-0.002753,-0.002823,-0.000343,-0.001405,-0.000642,0.000684,0.000214,-0.002586,-0.001605,0.001943,-0.00021,-0.001557,-0.005064,-0.002509,-0.000512,-0.003024,-0.001467,-7e-04,-0.002181,-0.001929,-0.001354,0.000137,0.000287,0.001226,-0.002415,-0.000605,0.000761,-0.000676,-0.000575,-0.001295,-0.003749,-0.002295,-0.000996,-0.001452,-0.000667,-0.002225,-0.001003,-0.000643,-0.000808
0.002648,0.002194,0.001533,0.000542,0.000435,-0.000343,0.001356,0.003516,0.005284,0.002752,0.002203,0.003777,0.003587,0.001846,0.003114,-0.000203,0.001732,0.002186,-0.000543,-1.2e-05,0.002584,0.000456,0.000996,0.003071,0.004487,0.004023,0.003791,0.000757,0.002164,0.000829,0.000948,-0.000266,-5.3e-05,0.000826,0.000886,0.003363,0.002352,0.002044,0.001652,0.002534,0.002695,0.000458,0.000881,0.000598,-0.000235,0.001291,0.001139,0.000723,0.002014,0.00347,-0.001335,0.001512,0.002087,0.003777,0.001263,0.001437,0.002738,0.001829,0.001049,0.000704,0.000448,0.002091,0.001625,0.004416,0.002598,0.001454,0.001087,0.001038,0.000744,0.000294,0.000407,0.002809,0.001037,0.001111,0.00168,-0.000525,0.000989,0.000341,0.001539,0.003443,0.002006,0.00495,0.004391,0.002209,0.001029,0.001557,0.002054,2e-04,0.000117,0.002381,0.003779,0.001009,0.002124,0.001817,0.003658,0.004083,0.002152,0.004324,0.00379,0.002763,0.003424,0.004028,0.002288,0.000398,0.000908,-0.00023,0.002657,0.001298,0.000875,0.002104,0.001052,0.003362,0.00522,0.003102,0.003583,0.002946,0.004523,0.003217,0.001952,0.003158,0.001109
-0.000851,-0.002031,-0.001874,0.000352,-5e-06,0.000716,-0.002543,-0.00223,-0.002537,-0.001753,-0.001548,-0.00152,-0.005173,1.5e-05,-0.002416,0.000216,-0.002162,-0.002675,0.001101,-0.000879,-0.002916,-0.000219,-2.3e-05,-0.002962,-0.003251,-0.004497,-0.0047,-0.001297,-0.00068,-0.000941,-0.000373,-0.000413,-0.001057,0.00159,0.00103,-0.001419,-0.001949,-0.001745,-0.000956,-0.00011,-0.002162,0.000141,-0.000833,0.000471,-0.001399,-0.000549,-0.001317,-0.000334,-0.000522,-0.001973,-0.000803,-0.001099,-0.000408,-0.001343,-0.000567,-0.00064,-0.001121,-0.00143,-0.001421,-0.000127,-0.000589,-0.001188,-0.000513,-0.002003,-0.001771,-0.000519,-0.000837,-0.001018,-0.000896,0.000907,8.2e-05,-0.001498,-0.001227,-0.000153,-0.000889,0.002034,-0.000175,0.001511,-0.001146,-0.000418,-0.001879,-0.002035,-0.004599,-0.002061,5.1e-05,-0.000958,-0.001751,0.000387,-0.001112,-0.001068,-0.00181,-0.000941,-0.000674,-0.001233,-0.001465,-0.000392,0.00059,-0.001791,-0.003393,-0.002598,-0.00151,-0.002167,-0.001696,-0.001164,-0.001279,0.000975,-0.000285,-0.000933,-0.000249,0.000149,0.000858,-0.000798,0.000339,0.000338,-7.9e-05,-0.00316,-0.002583,-0.000966,-0.001956,-0.003075,-0.001724
0.001152,0.000508,0.000357,-0.000823,-0.00107,-0.000322,0.002574,0.001193,0.000707,-0.000367,1.5e-05,0.000461,0.003211,2e-06,0.001119,-0.000319,0.001694,0.00281,-0.000809,0.001971,0.002266,0.000285,-0.000152,0.00146,0.002415,0.002871,0.002338,0.000337,4e-06,0.000574,-0.000582,0.000643,0.000392,-0.001739,-0.001591,0.000351,-0.001174,0.001327,0.001873,0.000605,0.000789,-0.001576,0.001263,-0.000405,0.001474,0.000184,0.000978,-0.000688,0.000251,-0.000765,0.001904,-0.00029,-0.000486,1.5e-05,-0.001172,0.000564,0.00192,0.001799,0.001203,-8.9e-05,0.001128,-0.000752,-0.000317,0.000118,-0.000167,0.000711,0.000573,-1e-04,0.002004,-0.001096,-0.000179,-6.3e-05,0.00014,0.000251,-0.000184,-0.001205,0.00052,-0.000363,-0.000514,-0.001181,-6.1e-05,-0.000445,0.003394,0.001337,0.000483,-0.000176,-7.9e-05,-0.000997,0.002807,0.001845,0.000184,-0.000736,-0.00208,0.001063,0.000985,-0.000849,-0.002143,-0.000933,0.001895,0.000572,-0.000452,0.000494,0.000453,0.00147,0.001288,0.000865,-0.000603,-7.9e-05,-0.001323,-0.001413,-0.000762,5.4e-05,-0.001187,-0.001796,7.9e-05,0.002651,0.00032,-1e-06,0.001375,0.001478,0.001497
-0.00127,-0.001078,0.001358,0.001481,-7.9e-05,-0.000722,-0.000402,-0.000627,9.3e-05,0.001035,2.5e-05,0.000949,-0.000481,-1.2e-05,0.000337,0.000163,-0.001193,-0.00246,7e-04,-0.001687,-0.001357,-0.000871,-0.000422,-5.3e-05,-0.002332,-0.000666,-0.000295,0.000285,-0.000353,-0.000793,0.000198,-0.00066,0.000207,0.001636,-0.000178,-0.000839,0.002401,0.00034,-0.000483,-0.000283,-0.000381,0.001854,-0.000335,0.000699,-0.001328,7.7e-05,-0.000724,0.001202,-6.4e-05,0.000524,-0.001518,7.6e-05,1.8e-05,-7.2e-05,0.001408,-0.00071,-0.002454,-0.000525,-0.000254,0.000388,0.00048,0.000516,0.000148,-0.000588,0.000343,0.000648,-0.000972,0.000264,-0.001572,9e-06,0.000967,-1e-06,0.00097,0.000236,1.7e-05,-0.000486,-0.000999,-0.000148,0.000873,-0.000169,0.000461,0.000232,-0.000721,-0.000425,-0.001296,7.5e-05,0.00089,0.000204,-0.000358,-0.001609,-0.001073,0.000577,0.001467,0.000954,-0.001384,-0.000595,0.000376,0.000649,-0.000531,0.000957,0.000584,-0.000869,-0.000557,-0.001188,-0.000961,-0.002141,-0.000409,1.6e-05,0.0013,0.000594,-0.001212,0.000542,-0.001215,0.000378,-0.002145,-0.000357,0.000507,-0.001243,-0.001155,-0.000775,-0.000144
0.000273,0.000256,-0.00048,-0.000426,0.000876,0.000198,-0.000153,0.000683,-0.000678,-0.000457,5e-06,-0.001206,0.001091,-0.000128,-0.002229,6e-06,0.000644,0.001539,-0.000444,-0.000459,-0.000181,0.000259,0.001551,0.00056,0.001377,0.000171,-0.000268,-0.001091,0.000223,5.8e-05,6e-06,0.001158,0.000426,-0.000562,0.00137,0.001657,-0.000771,-0.000969,-0.000643,-5.1e-05,0.000819,-0.000677,-0.000155,-0.000122,-0.000657,0.000565,4.5e-05,-0.001613,-0.000602,0.000309,0.000194,2.9e-05,0.000581,0.000386,-0.000535,-7.3e-05,0.000797,-0.000631,0.000726,-0.000676,-0.000939,2.6e-05,-0.000828,0.00028,0.001066,-0.000513,0.00153,0.000769,0.000629,0.000353,-0.000592,-0.000574,-0.000955,-0.000981,-0.000541,0.000317,4.8e-05,0.000323,0.000202,0.000644,-3.7e-05,0.000783,0.000627,0.000357,0.000898,0.000873,0.000645,0.000396,-0.001196,0.000446,0.001232,-0.000474,-0.000438,-0.001841,0.000776,0.000493,0.001425,0.001154,-1e-04,-0.001305,0.000204,0.000814,0.000894,0.001047,0.000473,0.000867,0.00049,0.000166,-5.2e-05,4.4e-05,0.000148,-0.000913,0.000979,0.000511,0.001221,-0.001173,-0.00098,0.00101,0.001624,8.7e-05,0.00017
0.000282,0.000677,-0.000131,-0.000148,-4.1e-05,-2.2e-05,-0.000529,-0.000327,0.000311,0.000189,-0.000257,0.000381,-0.001707,-9e-06,0.001277,0.000145,-5.5e-05,-0.00014,0.000567,0.001378,0.000476,0.000743,-0.001036,-0.000639,-0.000784,-0.000849,-0.000514,0.000558,-0.00018,0.000397,-0.000211,-0.000725,-0.000936,-0.000241,-0.00103,-0.001006,-0.000326,0.000816,-0.000452,-0.000378,-9e-05,-0.000312,-0.000189,-5.1e-05,0.000204,-0.000171,0.000479,0.001809,0.000362,-0.000383,0.00097,0.001558,-0.000885,-0.000617,0.000269,0.000362,0.00036,-5.6e-05,-0.001228,5e-06,-0.000183,0.000569,0.000803,-0.000242,-0.001344,-0.001254,-0.000838,-0.000488,-0.000558,0.000198,0.00017,0.000759,0.000396,0.000816,0.001038,-0.000131,0.000171,-0.000433,0.000307,-0.000559,-0.000358,-0.000759,-0.001347,-0.000813,-0.000467,-0.000586,-0.001052,-0.001282,-0.000941,-0.000746,-0.000552,0.000314,-0.000136,0.001139,-0.000442,7.2e-05,-0.001405,-0.000663,-0.000623,0.000836,-0.000187,-0.000168,-0.000398,-0.000765,-0.000265,-0.000176,0.000584,0.000214,8.9e-05,0.000487,0.00075,0.00029,-0.000211,0.000646,0.000866,-0.000635,-0.000456,-0.000615,-0.000729,0.000416,-0.000439
-0.000413,-0.00033,0.000512,-3.7e-05,-0.000542,-0.000236,0.000416,-0.000543,4.2e-05,-0.000753,-7.5e-05,0.000373,0.000456,-0.000832,0.000444,0.000338,-0.000384,-0.000904,-0.001296,-0.000569,0.000359,-0.000491,9.6e-05,2e-06,-8.9e-05,0.00029,0.000971,9.3e-05,-0.000312,-0.000247,0.000896,0.000421,0.000623,-0.000304,0.000316,3e-04,0.000232,-0.00111,0.000493,-0.000296,-0.000647,0.000465,0.000443,-0.000479,-0.000205,-0.000593,-0.000386,-0.000975,-5.6e-05,0.000694,0.000392,-0.000856,-0.000249,-0.000174,-0.000296,-0.000631,9.7e-05,0.000537,0.000622,0.000153,0.00043,-0.00104,-0.000729,-0.000118,0.000322,0.00099,0.000213,-0.000281,9.7e-05,-0.000396,-0.000347,-0.000443,0.000202,0.000126,-0.000551,0.000157,0.000167,0.000499,-0.000384,0.000729,0.000766,-0.000601,-2e-06,0.000824,-7.3e-05,-9.3e-05,-0.000231,0.00089,0.000624,0.000569,0.000279,-0.000599,0.00056,5.1e-05,0.000353,2e-06,0.000389,-0.000736,0.000522,-0.000391,-0.000572,-0.000475,0.000179,0.000431,-5.2e-05,8e-06,-0.000223,-0.000304,-0.000313,-0.000554,0.000684,3.5e-05,-0.000263,-0.001431,-0.001349,0.000356,0.00127,0.000933,-0.000578,-0.000286,0.001206
-0.00065,-0.000514,3.8e-05,0.000302,-0.000236,0.000224,-0.000157,0.000781,-0.000292,0.000511,0.000586,-0.000359,0.000195,0.000956,-0.000181,-6.4e-05,0.000705,0.000453,0.00136,0.000208,1.3e-05,4.2e-05,0.000458,0.000306,0.000392,-0.000208,-0.001003,-0.000102,0.000765,0.00012,-0.000184,-0.000164,-0.000248,-8.1e-05,-2.4e-05,-0.00067,0.000153,0.000689,5.2e-05,-0.000206,0.00029,0.000373,-0.000656,0.000749,0.000995,0.000564,0.000416,6.1e-05,0.000302,-0.000716,-0.001132,-9.3e-05,0.000653,0.00039,7.4e-05,0.000228,-0.000479,-0.000225,0.00013,0.000299,0.000445,0.000231,0.000865,0.000591,3.8e-05,-9.9e-05,-0.000393,0.00037,0.000158,0.000465,0.000177,0.000479,0.000196,-0.000325,-0.000204,-0.000357,-0.000313,-0.000219,-0.000389,0.000153,7.3e-05,0.000297,0.000428,3.8e-05,0.000343,-8.6e-05,6e-05,-0.000372,0.000709,0.00019,-0.00016,0.000516,-0.000361,0.000428,0.000516,0.000288,-0.000782,0.00029,0.000239,0.000175,0.001134,0.000493,1.8e-05,-0.00052,-2.8e-05,-0.000308,-0.000365,0.000485,0.000434,-0.00016,-0.000763,-0.000132,0.000557,0.000519,0.00052,0.000975,-0.000518,-9e-04,-7e-06,-0.000317,3e-06
0.000162,-0.000145,-0.000638,-0.000625,0.000318,0.000286,8e-05,0.00022,8.5e-05,-0.000254,-0.000371,3.5e-05,-5.1e-05,-0.000177,-0.000436,-0.000235,-0.001163,2.7e-05,-0.000752,0.000261,-0.000445,0.000402,-0.000829,-0.000127,-0.000238,0.000628,0.000478,2.3e-05,-0.000613,0.000104,-0.000442,-0.000177,0.000255,-2.7e-05,-0.000477,0.000488,-0.000364,-0.000507,-0.00032,0.000194,-0.000157,-0.000853,0.000423,-0.000421,-0.000536,-0.000239,0.00029,-0.000241,-0.000428,0.000375,0.00014,-0.000186,-0.000276,0.000119,0.000146,0.000114,0.000214,0.000125,-0.000179,0.000218,-0.000706,7.9e-05,-0.000375,-0.000264,0.00038,-0.000131,3.5e-05,0.000234,-0.000148,-0.000585,0.000158,-0.000574,-0.000202,-0.00016,2.4e-05,0.000352,0.00029,-0.000419,0.000154,-0.000211,-0.000525,0.000578,0.000284,0.000173,-7.4e-05,0.000501,2.6e-05,0.00045,-0.000347,0.000246,3e-04,-0.000146,-9.3e-05,-0.00061,-0.000536,-0.000208,0.000882,0.000712,-0.000581,-0.000151,-0.000737,-0.000174,-5.7e-05,0.000164,0.000379,0.000479,0.000441,-0.000413,-0.000504,0.000322,0.000399,0.000454,-0.00014,-1e-06,-0.000179,-0.00038,0.000129,0.000536,0.000533,0.000403,-0.000534
0.000586,0.000204,-3.3e-05,-4.7e-05,-0.00024,-0.000236,-0.000239,-0.00033,0.000187,0.000335,-3.2e-05,-0.000168,0.00048,0.000154,0.000517,0.000292,0.001018,3.8e-05,-0.00019,-0.000283,0.000442,-0.000428,0.000724,-8.6e-05,0.000196,-0.000438,-0.000149,-5.2e-05,0.000481,-3.2e-05,0.000133,0.000124,-0.00023,0.000178,0.000269,0.000245,0.000291,0.000297,0.000138,0.000348,0.00035,0.000358,-0.000249,0.000287,0.00038,-0.000159,-0.000223,0.000678,0.000355,4.9e-05,0.000703,0.000167,0.000249,-0.00021,-0.000254,0.000212,-0.000155,-0.00034,0.000206,-9.9e-05,0.000246,-4.7e-05,6.4e-05,6e-06,-0.000367,-0.000111,0.00029,-0.000612,0.000289,0.000372,-0.000479,0.000129,-0.000146,8.5e-05,-7.6e-05,-0.000412,-0.000104,2.6e-05,-6.4e-05,-0.000129,-0.000164,-0.000651,-0.000485,-0.00026,-0.000149,2.4e-05,-0.000316,-0.000274,1e-05,-0.000523,-0.00022,0.000175,0.000257,-0.000387,0.000144,-0.000211,-0.000413,-0.000238,-4.3e-05,3e-06,-6e-06,1.4e-05,0.000129,0.000133,-0.000288,-0.00023,-0.000399,2.6e-05,-0.000154,-0.00029,-0.00017,-0.000176,-0.000471,0.000202,0.000181,-0.000343,-0.00015,-0.000202,-0.000411,-0.000451,-0.000214
-0.000463,0.000145,1e-06,1.3e-05,0.000175,0.000114,-0.000264,2.4e-05,-0.000106,-0.000123,0.000133,0.000118,-0.000334,-0.000298,-0.000212,0.000174,-0.000469,-1.9e-05,0.000121,0.000212,-0.000124,2e-05,-0.000358,-9.6e-05,0.000163,0.000106,-4.8e-05,4.5e-05,-0.000109,9.8e-05,0.000171,-0.000251,1.4e-05,-0.000188,0.000132,-0.000336,-0.000362,-0.000108,0.000173,-0.000103,0.000136,0.000205,0.000185,-0.000155,-0.000153,-9.3e-05,4.5e-05,-0.00024,-0.000216,-4e-05,-0.000151,-0.000203,-0.000359,0,9.6e-05,-0.000403,-0.000135,0.00018,-0.000107,-0.000278,-0.00021,0.000131,-0.000305,4.1e-05,-0.000214,6.3e-05,-0.00013,0.000299,-3.9e-05,-9.9e-05,0.000273,0.000134,-7.9e-05,2e-04,0.000119,0.00047,-4.6e-05,-3.1e-05,0.000212,-8.1e-05,0.000483,-7.5e-05,0.000199,0.000251,0.000139,-0.000194,0.000423,0.000189,0.000466,-0.000461,0.000345,-0.000291,-0.000206,0.000455,-0.000172,0.000179,0.000426,-0.000303,0.000441,-3.5e-05,0.000296,1.5e-05,-0.000133,-0.000129,1.3e-05,0.000203,0.000246,0.000241,5.2e-05,0.000124,2.1e-05,-0.000389,0.00022,3e-06,-0.000228,-2.3e-05,8.2e-05,-8.3e-05,0.000137,0.000252,-0.000141
-1.7e-05,-1.5e-05,3.4e-05,-5.5e-05,-2.2e-05,-4.9e-05,0.000309,-7e-05,-6.8e-05,-0.000112,-0.000141,-0.000166,-7e-05,0.000152,-8.7e-05,-0.000514,0.000224,1.4e-05,0.000273,-0.000242,-6.8e-05,-4.9e-05,1.4e-05,-9e-06,-0.000277,0.000147,9e-05,4.9e-05,3.3e-05,-0.000193,-0.000206,0.000156,-3.7e-05,0.000324,0.000291,0.000178,0.000436,3.2e-05,3.1e-05,-0.000222,-0.000221,-0.000243,-0.000104,0.000159,-0.000191,-0.000174,-0.000131,-0.000167,2.9e-05,4e-05,-0.000236,-1e-05,-0.000221,-1e-06,-0.00013,0.000169,0.000145,-1.7e-05,-0.000114,0.000164,8.2e-05,-9.5e-05,0.000317,0.000105,0.000328,0.000173,-9.9e-05,-0.000152,-4.1e-05,6.1e-05,0.000159,-8.9e-05,0.000118,-0.000139,0.000111,-0.000251,0.000139,-6e-06,-0.000133,-0.000239,-4e-05,0.000632,2.1e-05,-0.000107,-9e-06,-0.000138,-0.000216,6.1e-05,3e-06,0.000435,-0.000356,0.000247,0.000173,-0.000193,0.000219,3.7e-05,-0.000209,0.00023,4.9e-05,0.000115,-0.000124,-1.3e-05,0.000156,-4.3e-05,-9.1e-05,-0.000145,-0.000138,-0.00032,0.00014,0.000162,-0.000236,0.000192,9e-05,-0.000168,-4.2e-05,0.000517,0.000293,0.000276,-5.9e-05,1.7e-05,0.000276
0.000336,7.3e-05,8.9e-05,3.6e-05,-3.7e-05,2.8e-05,-1e-06,0.00016,0.000146,8e-05,2e-04,4.5e-05,0.000159,0.000101,-0.000129,0.000281,5.5e-05,-0.000171,-0.000232,3.6e-05,0.000181,2e-04,-0.000169,5.1e-05,9.5e-05,-0.000161,-0.000199,6.9e-05,1e-05,0.000175,0.000154,-0.000101,0.000118,-0.000107,-0.000401,-0.000239,-0.000163,3.9e-05,-0.000198,0.000142,0.00015,0.000109,0.000133,-0.000167,7.3e-05,7.7e-05,-4.2e-05,-3.7e-05,3.8e-05,-0.000168,0.000153,-4.9e-05,0.000314,9.6e-05,0.000118,0.000111,-0.00021,2.8e-05,9.6e-05,-9.2e-05,1.7e-05,-3e-05,-0.000133,-8.8e-05,-0.000119,-0.000121,3.5e-05,0.000208,-5.4e-05,-4.1e-05,-0.000136,9.9e-05,5.6e-05,-6.9e-05,-4e-06,7.1e-05,-0.000185,3.8e-05,7.2e-05,0.000227,-3.6e-05,-0.00019,-5.6e-05,6.7e-05,4e-06,0.000108,0.000146,-0.000125,-8.6e-05,7.6e-05,-6.2e-05,-0.000141,1.6e-05,-0.000176,8e-06,-2.8e-05,-5.2e-05,-0.000129,-0.000278,-0.000129,-8.2e-05,-1.1e-05,8e-06,-4.8e-05,2.8e-05,-0.000119,7.9e-05,0.000153,-4.6e-05,-7.3e-05,0.00014,-5.7e-05,-1.8e-05,-0.000153,0.000405,-9.5e-05,-0.000274,-0.00016,0.000256,-0.000102,-9.7e-05
-0.000137,-5.7e-05,-0.000178,-8e-06,-3.9e-05,-4.4e-05,-1e-05,-9.1e-05,-9.6e-05,0.000122,-2.7e-05,0.000126,0.000113,-7.5e-05,0.000163,-5.6e-05,-0.000206,1.6e-05,9.7e-05,0.000228,-0.000216,-0.000169,0.000328,5.6e-05,-7.4e-05,0.000128,7.8e-05,-5.2e-05,-0.000105,-0.000101,-8.2e-05,3.3e-05,-3.5e-05,0,0.000344,0.000103,-1.4e-05,4.8e-05,7e-06,6.9e-05,-0.000169,-0.000249,-1e-06,0.000177,-4.2e-05,3.7e-05,0.000114,0.00018,-6.8e-05,1.3e-05,1.3e-05,6e-05,-1.4e-05,4.4e-05,-5.4e-05,-0.000114,0.00022,-5.6e-05,-2.2e-05,-5.2e-05,-8.9e-05,-8.2e-05,7.9e-05,-9e-06,0.000105,-2.2e-05,-5.3e-05,3.8e-05,-6.3e-05,5.6e-05,-1e-05,-7.2e-05,-4.9e-05,-3.6e-05,-0.000156,-0.000146,-4.2e-05,8e-05,-5.9e-05,0.000108,1e-05,-9.8e-05,2.6e-05,-0.000104,-7e-05,-6.4e-05,0,0.000119,-0.000279,2.7e-05,5.8e-05,0.000173,-0.000135,0.000121,-7.3e-05,2.5e-05,4e-05,0.000159,-2.3e-05,4.2e-05,0.000247,2.8e-05,-3.1e-05,0.00023,1.8e-05,6e-05,-0.000121,1.6e-05,6.2e-05,-3e-05,0.000119,3.4e-05,0.000102,0.000224,-0.000186,-0.000374,3.3e-05,0.000131,-0.000211,4.2e-05,-9.1e-05
-4.1e-05,1.3e-05,7e-06,3e-05,0.000175,7e-05,5.5e-05,-1.2e-05,0.000189,-0.000147,-4e-05,-3.3e-05,-6.6e-05,5.2e-05,9.3e-05,5.7e-05,0.000208,5.7e-05,7e-06,-0.000293,0.000105,9.2e-05,-0.000111,-2.7e-05,1.7e-05,-6.4e-05,3.2e-05,-4e-05,7.4e-05,-2.8e-05,3e-06,2.7e-05,1.1e-05,4.2e-05,-0.000231,-4.9e-05,-9.9e-05,-7.2e-05,0.000155,-9.5e-05,-1.1e-05,0.000129,-0.000146,-0.000106,0.000134,3.4e-05,-0.00011,-0.000363,4.1e-05,9e-05,-0.000221,-9.7e-05,-0.00018,-6.2e-05,0.000109,5.4e-05,3.6e-05,0.00011,3.5e-05,0.000122,0.000102,6.2e-05,4.3e-05,2.5e-05,-0.000114,7.5e-05,9.3e-05,-0.000124,7.7e-05,-0.000122,-1.8e-05,4.6e-05,-9e-06,0.000115,7.2e-05,0.000167,0.00011,1.9e-05,0.00011,1.2e-05,-2e-05,0.000171,-8.7e-05,8.4e-05,0.000121,2.3e-05,-2.9e-05,-0.000123,7.9e-05,8e-06,2.5e-05,-0.000152,2.6e-05,-2.7e-05,-3e-05,-6.2e-05,1e-06,3e-05,8.3e-05,6.4e-05,-0.000252,7e-06,1.3e-05,-8.2e-05,-3.8e-05,-6e-06,-4.3e-05,-7.7e-05,-7.3e-05,1.9e-05,-8e-06,-3.8e-05,-6.9e-05,0.000125,6e-06,0.000147,7.1e-05,-0.00013,9.7e-05,-7.6e-05,1.7e-05
7.8e-05,2e-06,9.6e-05,4.1e-05,-0.000144,5.7e-05,-8e-06,-6.1e-05,-0.000132,7.4e-05,-4.3e-05,-4.3e-05,-5.7e-05,-3.4e-05,-5.4e-05,-9.5e-05,-0.000157,-1e-05,2.9e-05,8.9e-05,6.5e-05,-8.7e-05,-8.3e-05,-1.6e-05,-2.7e-05,-0.000116,5.9e-05,-7e-06,9e-06,5.2e-05,6.9e-05,-2.5e-05,-7e-06,-9.6e-05,-4.2e-05,0.000121,9.6e-05,-1.3e-05,-6.2e-05,-2.6e-05,3.5e-05,5.1e-05,0.000104,1.5e-05,-2.7e-05,3e-05,1e-06,0.000269,2.1e-05,-2e-05,5.3e-05,0.000116,0.000143,-2.9e-05,-6.8e-05,-1.2e-05,-2.6e-05,-3e-05,-0.000125,2e-06,3.6e-05,0.000154,-4e-06,-1.9e-05,5.6e-05,6.3e-05,-2e-06,-3e-06,-2.7e-05,5.8e-05,5.8e-05,-3.8e-05,-3e-06,-0.000137,-2.1e-05,-2e-05,-4.6e-05,5.9e-05,-5e-06,5.3e-05,-1.6e-05,-0.00018,0.000138,-1.5e-05,-8.8e-05,-2e-06,3.9e-05,0.000116,0.00011,-1.4e-05,6.4e-05,1e-06,4.8e-05,5.8e-05,0.000111,5e-06,7.3e-05,-0.000249,0.000114,1.9e-05,8.3e-05,-4e-06,-2.3e-05,6e-06,9.1e-05,7.7e-05,9e-05,7.8e-05,1.4e-05,-1e-05,-3.6e-05,-3.1e-05,-8.5e-05,-0.000101,8.6e-05,0.000146,-0.000125,9.4e-05,-7.6e-05,8.4e-05,6.7e-05
6e-06,2.9e-05,1.8e-05,3.8e-05,0.000157,-7.1e-05,-1.3e-05,4.6e-05,3.9e-05,-3.5e-05,2.8e-05,2.3e-05,-9.2e-05,1.9e-05,-0.000111,7.5e-05,0.000162,3.6e-05,-5.7e-05,7.1e-05,-0.000103,5.1e-05,0.000171,1.5e-05,2.8e-05,0.00017,-9.6e-05,7.5e-05,-2.3e-05,-5e-05,-7.6e-05,4.3e-05,4e-05,-1.6e-05,0.000185,-6e-05,-2.8e-05,1.7e-05,-7.6e-05,4.4e-05,-2.5e-05,4e-06,-2.6e-05,-3e-06,2.5e-05,-1.5e-05,3.7e-05,-5.2e-05,5e-06,3.1e-05,0.000165,-5.8e-05,-9e-06,1.7e-05,8.6e-05,-4.9e-05,-5.3e-05,-1.5e-05,3.4e-05,-4.1e-05,-1.6e-05,-0.000149,-4e-05,5.8e-05,1.4e-05,-0.000118,2e-05,-1e-05,2.7e-05,-1.7e-05,3.8e-05,-1.5e-05,2e-06,9e-05,4.3e-05,-4.8e-05,3.9e-05,-6e-06,-3.7e-05,-0.000125,-2.2e-05,-5e-06,-0.000139,-2.3e-05,4.5e-05,-8.2e-05,-8e-06,-7.5e-05,-5.5e-05,-5e-06,2.9e-05,-3.1e-05,-6.6e-05,2e-06,-4e-05,-1.6e-05,-0.000174,8.7e-05,-9e-05,-5.5e-05,4.5e-05,-5e-06,2e-05,-3.8e-05,-4.8e-05,-8.5e-05,-3.6e-05,-6.9e-05,2.9e-05,1.2e-05,2.1e-05,8.1e-05,-1.3e-05,-3.7e-05,-0.000255,-6.3e-05,9.3e-05,-5.3e-05,2.7e-05,3.4e-05,-3e-05
-0.000118,-1e-05,-2e-05,-1.8e-05,-0.000119,2.9e-05,2.6e-05,1e-05,-1.2e-05,1.2e-05,-2.5e-05,-4.7e-05,0.000115,-4e-05,0.000111,-0.000111,-5.6e-05,-6.1e-05,6.4e-05,-9.7e-05,2.3e-05,-0.000113,-0.000108,1.3e-05,5.4e-05,-0.000112,4.6e-05,-5.5e-05,4.8e-05,4.1e-05,-3.3e-05,-2.2e-05,-4.4e-05,3.5e-05,-0.000135,-2.5e-05,5.8e-05,-7.9e-05,1.1e-05,-3.8e-05,7e-06,-0.000172,3.6e-05,2.1e-05,9.3e-05,4.2e-05,-9.7e-05,-5.2e-05,-4.4e-05,-3e-06,-3.8e-05,7e-05,-4.5e-05,5e-06,-8.3e-05,1.1e-05,2.2e-05,-3.2e-05,4.5e-05,5.3e-05,2.1e-05,-2.3e-05,3e-06,-1.1e-05,-1.8e-05,-2.7e-05,-3.4e-05,1.6e-05,1.4e-05,5.1e-05,-0.00013,4.3e-05,-4e-06,2e-06,6e-06,1.9e-05,5.6e-05,-1.1e-05,3.8e-05,1.4e-05,-2e-06,0.000132,3.2e-05,1e-06,1.8e-05,7.9e-05,-4.1e-05,6.7e-05,-4.9e-05,9e-06,-2e-06,5.4e-05,0.000111,-9.1e-05,-1.7e-05,1.7e-05,0.000122,3.1e-05,-7.6e-05,3.6e-05,-5.7e-05,5e-06,-3e-06,1.4e-05,-6e-06,9.4e-05,6e-06,3.1e-05,-2e-06,-3.4e-05,-4.4e-05,5e-05,7.9e-05,3.3e-05,0.000115,-6.5e-05,1.9e-05,3.4e-05,2.6e-05,-0.00011,-8.3e-05
2.2e-05,-2e-05,5e-06,1.9e-05,6e-06,2.7e-05,-6.3e-05,-2.8e-05,-3e-06,4.4e-05,1.9e-05,7.3e-05,-3.7e-05,2.1e-05,3e-05,0.000144,-5.5e-05,2.6e-05,-0.00011,3.4e-05,1.3e-05,0.000109,-2.6e-05,-3e-06,-9.3e-05,4.2e-05,-4.5e-05,5.2e-05,-7.9e-05,-1.8e-05,8.2e-05,6.4e-05,0,-4.1e-05,9.6e-05,4.4e-05,-7.4e-05,4.8e-05,5.5e-05,1.3e-05,-1.7e-05,0.000215,-9.9e-05,-3e-05,-0.000157,-6e-06,1.6e-05,2e-06,-4e-06,-7.8e-05,-0.000145,-2.5e-05,8.9e-05,2.6e-05,6.4e-05,1.5e-05,-2.5e-05,3e-05,-7.4e-05,-4.2e-05,-4.1e-05,3.5e-05,2.5e-05,-2.1e-05,1.9e-05,6.6e-05,-7.8e-05,1.1e-05,-2.4e-05,-2.6e-05,2.5e-05,-1.4e-05,-2.7e-05,1.3e-05,2.6e-05,2e-06,-4.7e-05,1.4e-05,-5e-05,-1.2e-05,5.7e-05,-6.4e-05,1e-05,-2.8e-05,-4.1e-05,-2.5e-05,-3.8e-05,-3.4e-05,6.5e-05,-6.6e-05,-4e-05,-4e-05,-8.1e-05,0.000113,-3.8e-05,-1.3e-05,-6.2e-05,1.1e-05,8.2e-05,-7.6e-05,4e-06,-3e-05,-1e-06,3.7e-05,-5e-06,-4.4e-05,3.2e-05,5.1e-05,-4e-06,5e-06,-4.4e-05,-8e-05,-3.1e-05,-8.6e-05,9e-06,8e-06,-2.5e-05,-2e-06,-1.1e-05,9.4e-05,9.9e-05
4.6e-05,-2.1e-05,3.2e-05,-4.3e-05,1.3e-05,-4.2e-05,-8e-06,-1.1e-05,-5e-06,1.3e-05,4.1e-05,-3.3e-05,-4e-06,-1.9e-05,-7.7e-05,-0.000104,7.6e-05,2.4e-05,-4e-06,-1e-05,-1.6e-05,-7.7e-05,9.6e-05,-9e-06,7.5e-05,4e-05,8e-06,-6.9e-05,4.6e-05,-1.7e-05,-3.4e-05,-4.4e-05,1e-06,3.4e-05,-0.000138,-3.8e-05,1.7e-05,-6e-06,1.2e-05,1.3e-05,1.5e-05,-8.3e-05,0.000107,7e-06,6.3e-05,1.5e-05,-1.4e-05,2.4e-05,2.4e-05,5.8e-05,1e-04,1.9e-05,-0.000105,1.3e-05,-8.7e-05,1.4e-05,-3.6e-05,4e-05,2.1e-05,-4.1e-05,3.1e-05,6e-06,-2.8e-05,-1e-05,-3.1e-05,7e-06,8.5e-05,2.5e-05,2.5e-05,6e-06,7e-05,2.3e-05,1.6e-05,-2.4e-05,-6.6e-05,2.1e-05,-3.4e-05,-2.3e-05,3.2e-05,2e-05,-5e-06,-8.3e-05,1.5e-05,2.4e-05,4.7e-05,2.3e-05,2e-06,1.7e-05,0.000117,3.9e-05,-3e-06,3.3e-05,-1.7e-05,4.7e-05,0,3e-06,1.9e-05,-1e-05,1e-05,7.9e-05,2.6e-05,4e-06,-6e-06,-3.7e-05,-1.8e-05,-1.6e-05,-2.3e-05,-8.1e-05,-3e-06,2.8e-05,5e-05,9e-06,-8e-06,8.1e-05,1.8e-05,6.5e-05,6.1e-05,2e-06,-1.8e-05,-4e-05,3.7e-05
-3.5e-05,2.4e-05,-2.3e-05,2.1e-05,3.2e-05,-7e-06,4.7e-05,1e-06,1.3e-05,-5.4e-05,-5.3e-05,-2.1e-05,-2.2e-05,2.5e-05,2e-06,5.3e-05,-8.7e-05,-3.3e-05,5.3e-05,7e-06,-5e-06,9.6e-05,-5.2e-05,-3e-06,-1.7e-05,-7.9e-05,6.1e-05,7.7e-05,1e-06,1.1e-05,-3e-05,0,-1.3e-05,3.1e-05,0.000127,4.3e-05,3e-06,-1.9e-05,-7.4e-05,6e-06,-1.8e-05,3e-06,-4.4e-05,-5e-06,-4.1e-05,0,-1e-05,-3.2e-05,-1e-06,-2e-05,4.5e-05,-2.2e-05,-3e-06,-4.1e-05,5.1e-05,-3.8e-05,4.4e-05,-5.5e-05,-1.6e-05,4.3e-05,-1.4e-05,5.3e-05,3.1e-05,1.6e-05,2.2e-05,-2.2e-05,-3.4e-05,-4.6e-05,-3.1e-05,-5.7e-05,-2e-05,-1.7e-05,2.6e-05,-1.3e-05,-4e-06,-8.2e-05,2.6e-05,-1.9e-05,-1.1e-05,1e-06,-2.9e-05,6.2e-05,-1.2e-05,-1.4e-05,-3.3e-05,-2e-05,4e-06,2.1e-05,-5.5e-05,6.9e-05,-1.3e-05,-2.3e-05,5.8e-05,-0.000109,4.8e-05,1.3e-05,4.1e-05,-2.1e-05,-3.3e-05,-4.8e-05,-1.8e-05,2.2e-05,-2e-06,2e-06,1.5e-05,-2.7e-05,3.4e-05,2.8e-05,-1e-05,-4.3e-05,1.3e-05,6e-06,2e-06,3e-06,2.3e-05,1.8e-05,-6.2e-05,2e-06,-4.2e-05,5e-06,4e-05
-3.8e-05,1.1e-05,-1.6e-05,-2.9e-05,-1.2e-05,1.3e-05,-3.7e-05,1.5e-05,-2e-05,4e-06,1.4e-05,3.3e-05,-7e-05,-2.2e-05,3.9e-05,-4e-05,9.3e-05,3.7e-05,-4.9e-05,2e-05,4e-06,-7e-05,-1.4e-05,-1e-06,-4.8e-05,8.1e-05,-8.9e-05,-4.4e-05,-3.6e-05,-9e-06,5.4e-05,2.8e-05,2.7e-05,-3.3e-05,-8.5e-05,-4.2e-05,2.5e-05,5.7e-05,2.5e-05,-7e-06,-9e-06,-5.2e-05,2.2e-05,-6e-06,1.4e-05,-1.5e-05,3.9e-05,4.6e-05,-2e-06,1.2e-05,-7.3e-05,1e-06,8.8e-05,4e-06,-4.5e-05,1.9e-05,-2e-06,-1.1e-05,3.1e-05,-1.7e-05,-2e-06,-5.9e-05,-2.8e-05,-2e-05,-1.8e-05,-5.1e-05,3.1e-05,-3e-06,3e-06,5.3e-05,-4.5e-05,-5e-06,-4e-06,4e-06,1.7e-05,6.9e-05,-1.7e-05,-4e-06,4e-06,5.2e-05,-2.3e-05,4.7e-05,-1.9e-05,8e-06,2.7e-05,-1.7e-05,3e-06,-3.8e-05,-9.2e-05,-4.5e-05,6e-06,2e-05,-4.9e-05,5.6e-05,-4e-05,-1.6e-05,-4.1e-05,-1.8e-05,-4.3e-05,8e-06,-1.6e-05,-3.4e-05,-3e-06,-3.5e-05,7e-06,2.5e-05,-3.4e-05,3.5e-05,-2.6e-05,1.7e-05,-5e-06,-3e-06,2.7e-05,-2.6e-05,-4.6e-05,-9.6e-05,-1.6e-05,-5.2e-05,4.5e-05,2.5e-05,-6.2e-05
8.3e-05,1.9e-05,0,1.9e-05,-2.3e-05,1.5e-05,4e-06,3e-06,3.2e-05,1.4e-05,-7e-06,-1.2e-05,0.000113,3.6e-05,-8e-06,4.6e-05,-6.1e-05,-2.9e-05,3e-05,-4.9e-05,-2.8e-05,2.9e-05,7e-06,1e-05,4.5e-05,-3.7e-05,8e-05,2.2e-05,2.3e-05,-2e-06,-3.1e-05,-2.3e-05,-1e-06,5e-05,4.4e-05,2.7e-05,-2.9e-05,-3.5e-05,3e-05,-3e-06,-4e-06,4.6e-05,-4.8e-05,-3e-06,3e-05,-5e-06,-2.4e-05,-2.3e-05,-1.1e-05,2.9e-05,-2e-06,6e-06,-7.4e-05,2.4e-05,3.2e-05,3.1e-05,6e-06,3.7e-05,-3e-06,-1.2e-05,0,2e-06,2.4e-05,1.7e-05,2.3e-05,4.9e-05,-7.7e-05,1e-05,7e-06,-8e-06,8e-06,-2e-06,-1.3e-05,-5e-06,1.4e-05,-9e-06,1.6e-05,-1.5e-05,-1.3e-05,-3.6e-05,8e-06,-6.2e-05,1.9e-05,-3.1e-05,-1.8e-05,2.4e-05,-4e-06,4.5e-05,-3.9e-05,-2e-06,7e-06,-8e-06,2.4e-05,1.8e-05,4e-05,4e-06,2.1e-05,4e-05,6.7e-05,2.4e-05,4.6e-05,1.9e-05,-9e-06,2.5e-05,1.4e-05,2.9e-05,2.1e-05,-4.7e-05,-6e-06,1.8e-05,-6e-06,3.2e-05,-2.6e-05,3e-06,4.2e-05,5e-06,3.4e-05,8.4e-05,-1e-05,-6.1e-05,-3e-05
-4e-06,-1.2e-05,-2.2e-05,-2.8e-05,-3e-06,1e-06,1.9e-05,-1.4e-05,-1.2e-05,1.2e-05,-6e-06,-6e-06,-5.5e-05,-3.5e-05,-1.4e-05,-6.2e-05,1.8e-05,1.9e-05,3.7e-05,3.9e-05,2.1e-05,-4.6e-05,1.2e-05,-2e-06,-7e-06,-9e-06,-4e-05,-2.2e-05,0,2.1e-05,-1e-06,3e-06,-1.4e-05,-2.2e-05,9.1e-05,-5e-06,1.5e-05,1.6e-05,7e-06,-1e-06,-9e-06,2e-06,3.9e-05,1.1e-05,-4.4e-05,-1.6e-05,2.2e-05,2e-06,1.2e-05,-4.7e-05,6.7e-05,1.9e-05,3.5e-05,-1e-06,-9e-06,-3.1e-05,-1.8e-05,1.6e-05,5e-06,1.4e-05,-5e-06,-6e-06,-4e-06,4e-06,-1e-06,3.3e-05,2.9e-05,1.2e-05,-1.3e-05,6e-06,4.6e-05,-3e-06,-1.1e-05,1.6e-05,1e-06,1.3e-05,-2.6e-05,-3e-06,1.8e-05,-1.5e-05,2.1e-05,3e-06,-4e-06,2.9e-05,1e-05,1e-05,1e-05,-4.6e-05,2.2e-05,-2.4e-05,1.1e-05,1.4e-05,2.1e-05,-5.4e-05,-2.2e-05,-4e-06,-5.4e-05,1e-06,0,-2.6e-05,-2.9e-05,8e-06,3e-06,1.2e-05,-1.9e-05,-3.2e-05,1.4e-05,2.8e-05,-1.7e-05,-2.1e-05,2.1e-05,-3.1e-05,-6e-06,3.4e-05,-3.4e-05,8.5e-05,-2.6e-05,-6.5e-05,1.7e-05,6.1e-05,6.2e-05
-4.1e-05,-1.4e-05,1.7e-05,1.3e-05,2.7e-05,-7e-06,-1.5e-05,-1e-06,-1.1e-05,-2.1e-05,2.1e-05,5e-06,6e-06,3e-05,-1.4e-05,6.5e-05,1.2e-05,-8e-06,1.9e-05,1.2e-05,1.1e-05,5.5e-05,-3.5e-05,-4e-06,-1.4e-05,3.7e-05,1e-05,2.5e-05,-8e-06,-2.2e-05,1.3e-05,-1.8e-05,6e-06,-1.5e-05,-0.000149,6e-06,-1.7e-05,9e-06,-3.9e-05,1.4e-05,6e-06,0,1.5e-05,-2.4e-05,7.5e-05,-1.5e-05,1e-05,-7e-06,-1e-06,1.6e-05,-1.3e-05,-2.9e-05,2.3e-05,-4e-06,9e-06,4e-06,1.6e-05,-3.1e-05,-1.4e-05,-4e-06,1.2e-05,1e-06,-1.6e-05,-2.3e-05,-3.5e-05,-2.1e-05,2.8e-05,2.6e-05,2.5e-05,-7e-06,-1.4e-05,1.4e-05,9e-06,-1.2e-05,7e-06,-3.1e-05,-1e-06,4e-06,-1.3e-05,-1.3e-05,-3e-06,6e-05,2e-05,-2.2e-05,7e-06,-3e-06,7e-06,4e-05,1.1e-05,1.6e-05,-8e-06,-2.2e-05,-3.6e-05,3.6e-05,1.1e-05,2e-06,8.9e-05,-2e-05,-2.8e-05,1.3e-05,-1.4e-05,-1.9e-05,-3e-06,4e-06,-3e-06,3.1e-05,-4.5e-05,-1.2e-05,5e-06,-2e-06,-3.3e-05,-1.8e-05,2.1e-05,-1.2e-05,-1.2e-05,-1.7e-05,2.8e-05,3.6e-05,-1.6e-05,-2.1e-05,-2.1e-05
5e-05,-1e-06,-9e-06,-5e-06,-1.9e-05,-1.1e-05,9e-06,8e-06,2.3e-05,-9e-06,-1.1e-05,-5e-06,-2.3e-05,-2.9e-05,2.8e-05,-4.1e-05,-2.9e-05,-8e-06,-4e-05,-5.2e-05,-3.3e-05,-4.6e-05,3.4e-05,1e-06,2e-06,-4.2e-05,1.3e-05,-1.6e-05,9e-06,1.2e-05,-2.4e-05,1.6e-05,5e-06,4e-06,9.4e-05,-2.1e-05,2.4e-05,-4.6e-05,-4e-06,-1.9e-05,-6e-06,-5e-05,-4.9e-05,1.2e-05,-3e-05,-4e-06,-2.5e-05,-4e-06,4e-06,6e-06,-6.4e-05,4e-06,-6.9e-05,-1.3e-05,1e-06,1e-06,-2.2e-05,-7e-06,9e-06,-2e-05,-1.3e-05,4.8e-05,8e-06,2.7e-05,3.8e-05,-1.2e-05,-2.9e-05,-6e-06,-1.3e-05,6e-06,-3.1e-05,-5e-06,7e-06,1.3e-05,-3.2e-05,1.5e-05,4.6e-05,-3e-06,9e-06,-2e-06,-1e-06,-3.3e-05,-3.6e-05,1.5e-05,-1.6e-05,-2.4e-05,1.3e-05,-2.9e-05,-2.9e-05,-3e-06,1.9e-05,1.2e-05,1e-05,-4e-05,-5e-06,-2e-06,-5.9e-05,9e-06,-1.9e-05,1e-06,3.4e-05,1.3e-05,0,-1.3e-05,4e-06,-9e-06,2.6e-05,-9e-06,7e-06,1.4e-05,-3e-06,3.8e-05,-1.1e-05,-4e-06,4.5e-05,-6.9e-05,8e-06,-1.7e-05,1.1e-05,-2e-05,-1.1e-05
9e-06,7e-06,-1.2e-05,1.6e-05,3.8e-05,1.1e-05,5e-06,8e-06,-2e-05,2e-06,4e-06,9e-06,-8e-06,3.1e-05,1.5e-05,1.9e-05,4e-05,2.9e-05,4.3e-05,4.7e-05,1.2e-05,2.4e-05,6e-06,-1e-06,2e-05,2.8e-05,-3.9e-05,1e-05,-7e-06,0,1.3e-05,-6e-06,-1.5e-05,-2.1e-05,-8.7e-05,4e-06,-1.5e-05,3.7e-05,4.4e-05,-1e-06,1.4e-05,5.5e-05,2.7e-05,-4e-06,-2.2e-05,-3e-06,2.5e-05,1.5e-05,-1e-05,-1.5e-05,2e-05,-1.1e-05,4.7e-05,2e-06,-4e-06,-5e-06,1.2e-05,1.9e-05,4e-06,2.2e-05,5e-06,-3.5e-05,1.1e-05,-1.7e-05,-1.9e-05,7e-06,2.2e-05,-3e-05,5e-06,-2.2e-05,1.9e-05,2e-06,-7e-06,-2.2e-05,9e-06,-1e-05,-3e-05,1.2e-05,0,2.2e-05,3e-06,-1.6e-05,1.6e-05,-1.2e-05,1.9e-05,2e-05,-2e-06,1.5e-05,3e-05,1.9e-05,-1e-05,-4e-06,6e-06,4e-06,-2.6e-05,5e-06,1.5e-05,-1.4e-05,2.4e-05,-1.2e-05,-1.8e-05,-1.3e-05,1e-06,-1e-05,3e-06,1.8e-05,-8e-06,2.9e-05,9e-06,-8e-06,1.5e-05,-6e-06,0,-3e-06,-3.8e-05,2.6e-05,-1.8e-05,8e-06,-2.5e-05,2.7e-05,-3.3e-05
-4.3e-05,8e-06,1.2e-05,-5e-06,-3.7e-05,1.2e-05,-1.3e-05,-6e-06,1e-06,1.9e-05,-4e-06,-2e-06,5.6e-05,-3.3e-05,-3.1e-05,-1.3e-05,-3.3e-05,-3.2e-05,-5.8e-05,-1.1e-05,1e-06,1.3e-05,-3.6e-05,3e-06,-1.4e-05,1e-06,4.1e-05,-1.7e-05,4e-06,-1.3e-05,1.7e-05,-1.6e-05,1.1e-05,-2e-06,7e-05,2.1e-05,6e-06,-4.1e-05,-2e-05,1.1e-05,8e-06,2e-05,-9e-06,3e-06,2e-05,4e-06,-4e-06,-2e-06,-3e-06,2.9e-05,3.3e-05,1.5e-05,1e-05,1e-05,6e-06,2e-06,1.9e-05,1.4e-05,-5e-06,-1.6e-05,-1e-06,-1e-05,-1.9e-05,6e-06,1.5e-05,1.1e-05,-2.7e-05,-1.1e-05,4e-06,1.7e-05,6e-06,-3e-06,-3e-06,1e-05,-3e-06,2e-06,-4e-06,1.6e-05,-9e-06,7e-06,-6e-06,4.1e-05,-1.2e-05,8e-06,-1.1e-05,-5e-06,-1e-05,-1e-06,5.5e-05,0,-1.2e-05,4e-06,-2.2e-05,4.5e-05,1.9e-05,-3e-06,-8e-06,1.8e-05,2.1e-05,1.4e-05,-6e-06,1e-05,-2e-06,2.4e-05,-9e-06,-4e-05,-1e-06,-3e-05,-6e-06,-3e-06,2.1e-05,-1.2e-05,1e-05,-3.5e-05,2e-05,4e-05,9e-06,4e-06,1.4e-05,-4.5e-05,4.1e-05
-7e-06,0,1.5e-05,5e-06,-1.2e-05,-1e-05,1.4e-05,-7e-06,5e-06,5e-06,2e-06,-1.1e-05,-2.2e-05,2.7e-05,-4e-06,1.1e-05,2.2e-05,1.2e-05,1.3e-05,-1.1e-05,-3e-06,1e-05,2.7e-05,-1e-06,-1.9e-05,-2.5e-05,-3e-05,2.6e-05,-3e-06,2.1e-05,-2.5e-05,1.4e-05,-1e-05,2e-05,-2.6e-05,-1.6e-05,-9e-06,1.8e-05,-2e-05,0,1e-05,-4.1e-05,2.8e-05,-1e-05,-3.3e-05,7e-06,4e-06,8e-06,1.2e-05,-2.1e-05,-2.3e-05,-2e-06,-4.7e-05,1e-06,-9e-06,-3e-06,-1.3e-05,-2.3e-05,-7e-06,5e-06,-4e-06,0,2.5e-05,4e-06,-1.8e-05,-1.3e-05,2.1e-05,1.7e-05,-1.4e-05,-7e-06,1e-06,-6e-06,6e-06,-4e-06,2.4e-05,1.4e-05,3.7e-05,0,9e-06,3e-06,-8e-06,-2.8e-05,2.3e-05,-4e-06,1e-06,8e-06,-6e-06,-7e-06,5e-06,-8e-06,-7e-06,-1e-05,3.4e-05,-6.5e-05,-5e-06,-1e-06,1e-06,1.3e-05,-2.5e-05,-1.1e-05,2.1e-05,7e-06,0,4e-06,4e-06,1e-05,3e-06,9e-06,6e-06,3e-06,-3.1e-05,6e-06,2e-06,1.8e-05,1e-06,-1e-06,-1.4e-05,-2.9e-05,-3e-06,3.5e-05,-1.6e-05
1.7e-05,-8e-06,-2e-06,-1e-06,3.9e-05,-1.1e-05,-2e-06,7e-06,0,-1.5e-05,-8e-06,1e-05,3e-06,-2.4e-05,2.7e-05,-1e-05,-1.1e-05,2e-06,-1.4e-05,1.3e-05,0,-5e-05,2e-06,0,3.5e-05,2.9e-05,3.2e-05,-2.5e-05,3e-06,-1.7e-05,9e-06,-4e-06,2e-06,-1.4e-05,9e-06,5e-06,1.3e-05,-2e-06,1.2e-05,-9e-06,-6e-06,7e-06,-4.4e-05,9e-06,3.3e-05,1e-05,2e-05,-4.4e-05,-1e-06,-8e-06,-1e-05,-1e-06,3.3e-05,-3e-06,1.4e-05,1e-06,4e-06,-5e-06,1e-06,8e-06,1.3e-05,3e-06,-2.9e-05,-1.1e-05,2e-06,-1.3e-05,-1.7e-05,1.6e-05,1.1e-05,1.4e-05,-1.2e-05,7e-06,5e-06,8e-06,-1e-05,-1.2e-05,-1.8e-05,6e-06,-4e-06,-8e-06,1e-06,-1.5e-05,-1.6e-05,4e-06,7e-06,-9e-06,-8e-06,1.7e-05,-4e-05,6e-06,1e-06,6e-06,-1.5e-05,2.3e-05,1.6e-05,1e-06,1.2e-05,-2.1e-05,1e-06,9e-06,-1.7e-05,-1.4e-05,-1e-06,-6e-06,4e-06,3e-06,-6e-06,6e-06,-1e-06,6e-06,4e-06,-1.8e-05,-3.1e-05,3e-05,-1.6e-05,-4.2e-05,0,3.7e-05,5e-06,1.4e-05,-1.7e-05
-2.1e-05,-2e-06,-1e-06,4e-06,-3.8e-05,8e-06,-1.5e-05,2e-06,-5e-06,-1.1e-05,2e-06,-2e-06,-2e-05,2.6e-05,-9e-06,9e-06,-5e-06,-5e-06,2.2e-05,-1.1e-05,0,1.9e-05,-1.7e-05,-1e-06,-1.4e-05,-2.1e-05,-1.6e-05,1.9e-05,-1e-06,9e-06,1e-05,6e-06,1.1e-05,1.9e-05,3.3e-05,-9e-06,-9e-06,-2e-06,8e-06,8e-06,6e-06,-1.9e-05,3.1e-05,-5e-06,-2.7e-05,5e-06,-1.6e-05,5.9e-05,-4e-06,2.1e-05,3.5e-05,1e-06,-2e-06,-7e-06,-1.2e-05,-5e-06,-2e-06,2.1e-05,-1e-06,-5e-06,-1.1e-05,3.2e-05,2.1e-05,1.1e-05,2e-05,-3e-06,0,4e-06,-1.2e-05,-6e-06,-4e-06,-3e-06,-5e-06,1e-06,1e-06,2e-06,-3.5e-05,3e-06,4e-06,1e-06,9e-06,2.6e-05,-4e-06,-1e-06,-1.1e-05,-4e-06,-3e-06,-2e-05,-2.4e-05,-2e-05,4e-06,-3e-06,-1.3e-05,2.8e-05,-6e-06,0,-1.9e-05,3e-06,-1e-05,-6e-06,-1e-06,1.4e-05,0,-1.6e-05,0,1e-05,1.6e-05,-6e-06,0,-4e-06,1.1e-05,2e-05,1.9e-05,-1.4e-05,1.6e-05,-9e-06,9e-06,-2.1e-05,0,-4.2e-05,2e-06
-2.2e-05,-1e-06,-1e-06,-2e-06,4.1e-05,1.1e-05,1e-05,0,9e-06,7e-06,1.1e-05,1e-06,1.7e-05,-2.8e-05,-1.6e-05,-6e-06,1e-05,0,-3.1e-05,1.4e-05,0,2.1e-05,1.7e-05,0,-1.8e-05,2e-06,-3e-06,-1.4e-05,-1e-06,0,-1.7e-05,-4e-06,-4e-06,5e-06,-0.000102,1e-05,5e-06,1e-05,2e-06,0,3e-06,3e-05,-1.4e-05,3e-06,1.5e-05,0,8e-06,-3.9e-05,-3e-06,-2.1e-05,-4e-06,-2e-06,-1.7e-05,-1e-06,1.7e-05,3e-06,-7e-06,-5e-06,4e-06,-5e-06,3e-06,-2.6e-05,-7e-06,-7e-06,-2.5e-05,1.8e-05,1.6e-05,-1.9e-05,5e-06,-5e-06,1.6e-05,4e-06,-6e-06,1e-06,-1.6e-05,0,1.6e-05,-8e-06,-5e-06,-1.9e-05,4e-06,-7e-06,4e-06,3e-06,1.1e-05,1e-05,-1e-06,2e-05,-9e-06,1.3e-05,8e-06,3e-06,1.9e-05,-3.5e-05,4e-06,0,3.8e-05,3e-06,2.8e-05,9e-06,1.5e-05,-1e-05,1e-06,3e-06,-2e-06,-3e-06,-1.2e-05,1e-06,-6e-06,-8e-06,-3e-06,1.2e-05,1.5e-05,7e-06,-1.4e-05,4.4e-05,-2e-06,1.2e-05,3e-06,2.4e-05,-6e-06
3.3e-05,5e-06,4e-06,-4e-06,-1.5e-05,-9e-06,2e-06,-4e-06,-9e-06,1.1e-05,-1.2e-05,-6e-06,2.5e-05,2.6e-05,9e-06,-4e-06,-1.2e-05,-3e-06,5.7e-05,-9e-06,5e-06,-2.5e-05,-3e-06,2e-06,2.4e-05,1e-05,1.6e-05,9e-06,6e-06,-8e-06,7e-06,0,-6e-06,-5e-06,0.000105,-1e-05,-9e-06,-2e-06,-1.8e-05,-4e-06,-1.4e-05,0,1.7e-05,0,2.3e-05,-1e-06,-3e-06,2e-06,2e-06,1.8e-05,-3.4e-05,0,3e-05,1e-05,-1.8e-05,4e-06,-1.1e-05,-1.2e-05,-4e-06,6e-06,4e-06,-1.1e-05,-1e-06,5e-06,1.8e-05,-1.4e-05,-1.6e-05,-1.7e-05,5e-06,-1.1e-05,-4e-06,-1e-06,1e-06,-4e-06,7e-06,1e-05,7e-06,-4e-06,5e-06,1.1e-05,-3e-06,-1.5e-05,3e-06,-1e-06,-8e-06,-6e-06,1e-06,-1.9e-05,0,-7e-06,4e-06,0,-1.9e-05,3e-05,-8e-06,0,-5.6e-05,8e-06,-1.2e-05,-1.2e-05,-1.1e-05,-1e-06,2e-06,1.1e-05,-3e-06,0,-2e-06,-3e-06,-2e-06,8e-06,-1.3e-05,-2.5e-05,-1.1e-05,-1e-05,1.2e-05,1.6e-05,3e-06,-1.9e-05,-7e-06,-5e-06,4.8e-05
1.4e-05,4e-06,-7e-06,-1e-06,-1.1e-05,-1e-05,-4e-06,0,1.1e-05,1e-06,9e-06,3e-06,-9e-06,-2.4e-05,8e-06,1.6e-05,1.4e-05,1.2e-05,-4e-05,-8e-06,2e-06,9e-06,-1.2e-05,-2e-06,-3e-06,-1.7e-05,-3e-05,-6e-06,-6e-06,1.2e-05,2e-06,9e-06,3e-06,6e-06,-6.8e-05,7e-06,7e-06,-5e-06,8e-06,0,2e-05,-3.2e-05,-2.1e-05,-1e-06,-3e-05,-2e-06,-1.2e-05,1e-05,4e-06,1e-06,1e-05,1e-06,-2.5e-05,2e-06,1.4e-05,-7e-06,1.3e-05,5e-06,-1e-06,-1e-05,-8e-06,8e-06,2e-06,-5e-06,-1.4e-05,3e-06,0,1.1e-05,-7e-06,2.1e-05,-9e-06,-3e-06,5e-06,-4e-06,0,-2.1e-05,-2e-06,-7e-06,-6e-06,6e-06,-4e-06,6e-06,3e-06,-2e-06,4e-06,3e-06,3e-06,1.4e-05,-1.1e-05,1.7e-05,-4e-06,2e-06,9e-06,-1.1e-05,0,0,3.4e-05,-3e-06,-8e-06,8e-06,-1e-06,6e-06,0,0,0,1.2e-05,1.2e-05,3e-06,-1e-05,3e-06,1.4e-05,6e-06,-1e-05,1e-06,4e-06,-5.9e-05,-3e-06,2.1e-05,-2e-06,5e-06,-3.5e-05
-1.6e-05,-2e-06,2e-06,-3e-06,-9e-06,6e-06,2e-06,2e-06,-1e-05,-5e-06,-8e-06,4e-06,-1.3e-05,2.5e-05,-1e-06,-1.5e-05,-8e-06,-1.7e-05,3.1e-05,2.1e-05,-8e-06,2.1e-05,3e-06,1e-06,-1.4e-05,1.2e-05,3.1e-05,1e-06,3e-06,-1.1e-05,-4e-06,-7e-06,-2e-06,-8e-06,5.5e-05,2e-06,-3e-06,5e-06,1.1e-05,2e-06,-6e-06,0,5e-06,1e-06,2.1e-05,2e-06,1e-05,2.3e-05,-3e-06,-2.2e-05,2.9e-05,3e-06,-4e-06,-8e-06,-2.1e-05,4e-06,-2e-06,8e-06,1e-05,7e-06,7e-06,4e-06,0,3e-06,1.1e-05,1.2e-05,-7e-06,2e-05,1.1e-05,-4e-06,6e-06,2e-06,0,0,1.4e-05,5e-06,-4e-06,-7e-06,5e-06,5e-06,-2e-06,1.1e-05,-1e-05,6e-06,-1e-06,-5e-06,6e-06,-9e-06,1.6e-05,-8e-06,-1e-06,-2e-06,1.3e-05,-1.1e-05,0,0,-2e-06,-4e-06,-2e-06,-3e-06,6e-06,-1.2e-05,0,-9e-06,0,-1e-05,-1.3e-05,2e-06,-4e-06,-9e-06,1.2e-05,9e-06,1.7e-05,-3e-06,-1.6e-05,4e-06,-3e-06,-1.3e-05,6e-06,1e-05,1.1e-05
1.7e-05,-2e-06,-8e-06,4e-06,2e-05,9e-06,-3e-06,2e-06,3e-06,-5e-06,-1e-06,-6e-06,-9e-06,-2.4e-05,-5e-06,1.1e-05,4e-06,9e-06,-2.6e-05,-1.5e-05,7e-06,-5e-06,1e-05,0,4e-06,-5e-06,-2.2e-05,0,0,6e-06,5e-06,4e-06,2e-06,-1.2e-05,-2.3e-05,-2e-06,4e-06,-1.3e-05,-1.1e-05,-3e-06,2e-06,6.1e-05,1.4e-05,1e-06,-1.9e-05,2e-06,-6e-06,-5.6e-05,-2e-06,2.3e-05,-2.2e-05,3e-06,2.9e-05,-3e-06,1.2e-05,3e-06,1e-06,-4e-06,-7e-06,9e-06,-3e-06,1.5e-05,-2e-06,-1e-06,-5e-06,4e-06,1.5e-05,-1e-06,-9e-06,-3e-06,1e-06,-1e-06,-4e-06,2e-06,-6e-06,1.2e-05,8e-06,-1e-06,-1e-06,-6e-06,3e-06,-3e-06,7e-06,-7e-06,-3e-06,3e-06,2e-06,1e-06,4.6e-05,-3e-06,-5e-06,2e-06,-1.9e-05,3.7e-05,-4e-06,0,7e-06,-5e-06,1.5e-05,-2e-06,-3e-06,1.2e-05,1e-06,-7e-06,4e-06,-7e-06,9e-06,-4e-06,-6e-06,3e-06,-1.9e-05,-7e-06,-5e-06,7e-06,1.5e-05,4.4e-05,2e-06,0,-1e-06,-2.7e-05,1.1e-05
2.4e-05,-3e-06,6e-06,-5e-06,-9e-06,-4e-06,1e-06,-1e-06,0,7e-06,7e-06,2e-06,1.2e-05,2.5e-05,-7e-06,-1.4e-05,0,5e-06,2.3e-05,0,1e-06,-4.4e-05,-1.2e-05,0,1.5e-05,-2e-06,1.1e-05,5e-06,-1e-06,-2e-06,-4e-06,-2e-06,2e-06,6e-06,-2.2e-05,0,-7e-06,5e-06,-2e-06,2e-06,-1e-06,-5e-05,-1.7e-05,1e-06,5e-06,0,4e-06,5.1e-05,1e-06,-1.3e-05,-2e-05,-4e-06,-2.5e-05,3e-06,-1.6e-05,-1e-06,9e-06,-8e-06,7e-06,-4e-06,-1e-06,-1.8e-05,7e-06,-2e-06,-2e-06,5e-06,1e-06,-1.3e-05,3e-06,-5e-06,1e-06,4e-06,1e-06,8e-06,-6e-06,0,2e-05,1e-06,-3e-06,-3e-06,3e-06,-1.1e-05,-5e-06,6e-06,4e-06,-1e-06,2e-06,5e-06,1.1e-05,0,-3e-06,0,1.1e-05,-3.3e-05,8e-06,1e-06,-1.2e-05,7e-06,7e-06,7e-06,-1e-06,-5e-06,0,7e-06,1e-06,-1.1e-05,-9e-06,-1e-06,-1e-06,7e-06,-8e-06,1e-05,-1.4e-05,-1e-05,-1e-05,-6e-06,-2e-06,8e-06,6e-06,2.1e-05,-1.2e-05
-2.6e-05,0,-2e-06,4e-06,2.1e-05,-9e-06,5e-06,-3e-06,1e-06,1.1e-05,-3e-06,0,1.3e-05,-2.5e-05,1.4e-05,1.6e-05,-4e-06,-1e-05,-3.4e-05,1e-05,-2e-06,3.9e-05,5e-06,0,-1.3e-05,5e-06,1e-05,-1.1e-05,1e-06,-4e-06,0,-1e-06,-4e-06,-2e-06,3.6e-05,-6e-06,5e-06,-5e-06,5e-06,-1e-06,-8e-06,9e-06,1.4e-05,-2e-06,4e-06,-2e-06,1e-06,-3.2e-05,3e-06,1e-06,2.7e-05,-8e-06,3e-06,5e-06,1.5e-05,-1e-06,-5e-06,9e-06,-1e-05,4e-06,3e-06,-7e-06,-1e-05,4e-06,1.2e-05,-1.5e-05,-1.7e-05,-1.3e-05,2e-06,5e-06,-2e-06,0,4e-06,-4e-06,-8e-06,-1.1e-05,-2.5e-05,1e-06,3e-06,-1e-06,-1e-06,1e-05,6e-06,-6e-06,-6e-06,0,-2e-06,-1.1e-05,-1.5e-05,-8e-06,1e-06,-1e-06,-5e-06,1e-06,-3e-06,-2e-06,-8e-06,3e-06,-2.6e-05,-6e-06,1e-06,-1e-06,1e-06,8e-06,-4e-06,1.5e-05,3e-06,3e-06,-2e-06,-6e-06,9e-06,-1.1e-05,1.8e-05,-2e-06,-3e-06,-3.5e-05,1e-06,-1.4e-05,-3e-06,4e-06,7e-06
-1.7e-05,2e-06,2e-06,-3e-06,-3.4e-05,2e-06,-1e-06,0,-5e-06,-2e-06,3e-06,-1e-06,-5e-06,2.4e-05,3e-06,-1.9e-05,5e-06,7e-06,3.7e-05,-8e-06,6e-06,-3e-06,9e-06,-1e-06,-9e-06,-5e-06,-2.5e-05,1e-05,-1e-06,7e-06,4e-06,4e-06,0,2e-06,-7.1e-05,9e-06,-4e-06,2e-06,2e-06,0,4e-06,4e-06,-1.9e-05,2e-06,-1.9e-05,-3e-06,-1e-05,2.7e-05,0,1.7e-05,6e-06,4e-06,1.7e-05,-1e-06,-8e-06,-2e-06,-2e-06,2e-06,2e-06,2e-06,-2e-06,1.1e-05,9e-06,-6e-06,-2.2e-05,0,1.1e-05,4e-06,-7e-06,-6e-06,-3e-06,0,-1e-06,0,1e-05,-4e-06,-1.1e-05,4e-06,-3e-06,2e-06,-1e-06,6e-06,-7e-06,4e-06,6e-06,2e-06,-5e-06,1.4e-05,-1.5e-05,1.6e-05,5e-06,-1e-06,-7e-06,2e-05,3e-06,3e-06,2.5e-05,-6e-06,1.2e-05,3e-06,3e-06,1e-05,1e-06,-1e-06,0,-3e-06,8e-06,0,5e-06,-2e-06,1e-05,-8e-06,1e-06,9e-06,1.2e-05,7e-06,2e-06,2.4e-05,4e-06,-1.7e-05,-1.9e-05
