0.082663,0.086315,0.085252,0.076543,0.07287,0.074279,0.072503,0.068854,0.072006,0.077124,0.074861,0.073557,0.074074,0.075823,0.08447,0.089701,0.085557,0.083949,0.084623,0.080883,0.074126,0.06743,0.057621,0.04913,0.046475,0.055585,0.064685,0.079472
0.108697,0.115672,0.115402,0.10312,0.094439,0.093815,0.093807,0.088875,0.088698,0.094049,0.094656,0.093426,0.093674,0.095226,0.104403,0.111707,0.107098,0.106768,0.10624,0.096379,0.090956,0.089994,0.077454,0.061893,0.058851,0.075682,0.088552,0.104691
0.160531,0.173044,0.174334,0.154618,0.13487,0.130106,0.13377,0.126574,0.119353,0.124082,0.131025,0.130094,0.129148,0.129843,0.139936,0.151094,0.146289,0.149945,0.146912,0.12349,0.121197,0.133113,0.115441,0.084995,0.081666,0.116316,0.13749,0.155313
0.214534,0.227825,0.227509,0.200549,0.171986,0.164261,0.170162,0.161396,0.148018,0.150123,0.163394,0.163287,0.159595,0.158238,0.167625,0.18058,0.176892,0.186279,0.182664,0.148337,0.150202,0.175025,0.151235,0.104061,0.101747,0.159008,0.190923,0.208814
0.246095,0.250156,0.242248,0.214552,0.192665,0.187763,0.18813,0.178977,0.166891,0.162605,0.175649,0.178179,0.172369,0.16981,0.17514,0.184491,0.183413,0.196106,0.194305,0.160799,0.166603,0.194696,0.165332,0.108848,0.109878,0.183791,0.223309,0.237828
0.238494,0.225788,0.21466,0.199674,0.202814,0.207909,0.193743,0.184203,0.18136,0.166127,0.167934,0.175826,0.170474,0.165562,0.162202,0.163574,0.166494,0.178257,0.182289,0.161887,0.162105,0.17724,0.148808,0.099998,0.104589,0.176474,0.215593,0.223799
0.231714,0.208585,0.208452,0.209537,0.230871,0.241384,0.208238,0.195186,0.203223,0.186757,0.185098,0.197876,0.182136,0.170899,0.168438,0.165784,0.167175,0.170692,0.177335,0.166899,0.149148,0.141563,0.118104,0.086648,0.092643,0.149338,0.189263,0.202178
0.326285,0.293601,0.302148,0.304734,0.319564,0.321161,0.259689,0.230801,0.25434,0.267488,0.285187,0.29881,0.25173,0.236717,0.256248,0.247987,0.227872,0.210072,0.221025,0.214427,0.169514,0.133698,0.104354,0.086754,0.093272,0.141157,0.204444,0.246668
0.590487,0.526632,0.538708,0.534277,0.550363,0.546336,0.410291,0.329416,0.383456,0.461867,0.526757,0.541567,0.426863,0.399952,0.458452,0.43229,0.365995,0.314092,0.349802,0.35472,0.266974,0.192418,0.134545,0.118052,0.128957,0.195455,0.317864,0.418565
1.059954,0.926244,0.944063,0.924855,0.955917,0.962954,0.696439,0.523987,0.631975,0.810121,0.946264,0.967344,0.731914,0.679227,0.813791,0.758155,0.607097,0.502863,0.598067,0.630057,0.45848,0.318318,0.214904,0.187919,0.200813,0.308938,0.52766,0.728025
1.695662,1.461618,1.490064,1.440622,1.491556,1.539898,1.111168,0.809836,0.977327,1.281458,1.515898,1.545038,1.130835,1.040086,1.303636,1.226111,0.954774,0.76794,0.949952,1.027525,0.729807,0.488413,0.324487,0.285867,0.29438,0.446871,0.807036,1.17045
2.289363,1.969056,2.004665,1.900128,1.963321,2.093476,1.541275,1.112568,1.316516,1.727712,2.055828,2.084523,1.486376,1.361733,1.777881,1.699546,1.314751,1.040826,1.307491,1.438568,1.003641,0.646257,0.426092,0.38414,0.386015,0.566076,1.073336,1.628225
2.472052,2.151441,2.179628,2.016587,2.06316,2.277985,1.738893,1.269132,1.45534,1.886361,2.241714,2.244294,1.571674,1.445392,1.947804,1.897499,1.494181,1.187208,1.472279,1.627312,1.117858,0.690382,0.455195,0.425201,0.422795,0.592206,1.169268,1.844346
2.021823,1.804151,1.838025,1.697311,1.674622,1.867379,1.507492,1.152828,1.266613,1.597642,1.877321,1.835281,1.29937,1.211869,1.622127,1.618621,1.343586,1.096597,1.297008,1.403423,0.948738,0.568195,0.381522,0.370378,0.369994,0.491221,0.987261,1.604702
1.326293,1.187379,1.260318,1.317816,1.19572,1.165055,1.050628,0.978428,1.037273,1.163995,1.276013,1.216301,0.959555,0.902316,1.051796,1.100999,1.040426,0.898305,0.934267,0.905855,0.612083,0.384444,0.273435,0.284534,0.29649,0.355234,0.647266,1.034786
1.208152,0.948835,1.127652,1.496831,1.268527,0.96013,0.995124,1.194274,1.218518,1.121866,1.102999,1.070093,0.977897,0.937751,0.897087,0.958366,1.037721,0.945785,0.829814,0.643611,0.477071,0.36635,0.285108,0.338097,0.343934,0.317482,0.429468,0.643416
1.530897,1.220437,1.475461,1.998572,1.780793,1.368879,1.390266,1.684691,1.694055,1.463545,1.369676,1.338102,1.255054,1.224779,1.162772,1.187401,1.272862,1.203836,1.086079,0.816583,0.604256,0.49751,0.403285,0.476416,0.483732,0.415758,0.479059,0.691624
1.86407,1.647611,1.897047,2.380406,2.303534,1.936286,1.901909,2.241685,2.234668,1.843245,1.566494,1.526887,1.50044,1.456742,1.43128,1.484315,1.509008,1.419449,1.400328,1.071449,0.726736,0.623574,0.521459,0.581558,0.612942,0.556692,0.615906,0.879705
2.154758,2.096312,2.214852,2.461367,2.667048,2.531012,2.491363,2.883306,2.810556,2.183424,1.640174,1.636735,1.812274,1.715968,1.626755,1.714973,1.634303,1.54895,1.676487,1.262231,0.774779,0.700176,0.590145,0.600767,0.687039,0.694022,0.739358,1.035952
2.345841,2.415534,2.481627,2.383106,2.756446,3.00866,3.051055,3.358018,3.131942,2.427653,1.78252,1.831135,2.198924,2.020879,1.804968,1.858011,1.641748,1.591909,1.819568,1.330731,0.795666,0.753227,0.61963,0.590385,0.730099,0.781624,0.805163,1.117975
2.281828,2.451501,2.637903,2.270895,2.499776,2.961092,3.163941,3.286816,2.843915,2.345871,1.843322,1.864859,2.319915,2.086775,1.779125,1.778708,1.516772,1.529816,1.726297,1.260233,0.814588,0.783128,0.622749,0.553716,0.685954,0.748582,0.790319,1.09935
1.851281,2.072466,2.38591,1.924207,1.849596,2.224681,2.54178,2.527061,1.983075,1.814313,1.566261,1.494622,1.917264,1.754197,1.52398,1.561169,1.370078,1.383909,1.435154,1.072764,0.760807,0.721809,0.559952,0.443368,0.526911,0.602599,0.73062,0.983907
1.289399,1.458662,1.740999,1.343345,1.062016,1.218722,1.503151,1.527687,1.158126,1.145151,1.069413,0.962843,1.220875,1.188719,1.144179,1.265607,1.201663,1.152566,1.073864,0.821132,0.594683,0.538632,0.426261,0.313884,0.356418,0.443893,0.644183,0.800926
0.900316,0.945094,1.07677,0.842613,0.611369,0.686664,0.79786,0.810902,0.732711,0.715379,0.703458,0.678925,0.763929,0.788974,0.854464,0.979809,0.997278,0.894759,0.720014,0.547241,0.415975,0.378469,0.312017,0.229851,0.290291,0.428003,0.632622,0.687342
0.672979,0.703755,0.778283,0.698325,0.609844,0.707433,0.692167,0.573561,0.597742,0.601601,0.563349,0.567891,0.65293,0.739525,0.795372,0.828154,0.815669,0.66555,0.495365,0.396312,0.329711,0.321729,0.257686,0.203884,0.328305,0.498956,0.621563,0.613483
0.657527,0.73796,0.861203,0.835749,0.785641,0.862006,0.85164,0.664609,0.599862,0.643718,0.55802,0.547059,0.74552,0.889495,0.829477,0.741624,0.735814,0.571698,0.387165,0.312892,0.30794,0.345084,0.277448,0.228609,0.382204,0.538561,0.557834,0.53191
0.753711,0.789079,1.011144,1.083421,1.061369,1.03051,1.038904,0.869276,0.650104,0.7194,0.62487,0.591199,0.855814,1.076326,0.918972,0.717063,0.736625,0.532624,0.343581,0.312464,0.335206,0.372236,0.30777,0.26548,0.415084,0.5405,0.583238,0.651296
0.952031,0.808099,1.014166,1.221989,1.309749,1.185921,1.19193,1.053881,0.691903,0.747788,0.693804,0.689828,0.99573,1.262133,0.98764,0.689562,0.737811,0.493974,0.3222,0.370214,0.413925,0.395934,0.315123,0.279409,0.4196,0.514436,0.674079,0.929099
1.063759,0.743795,0.864106,1.201996,1.407415,1.261308,1.262735,1.143927,0.77651,0.787792,0.709367,0.714137,1.044943,1.328865,0.99193,0.670504,0.693811,0.456624,0.378747,0.523673,0.566718,0.466679,0.325268,0.254841,0.381853,0.494258,0.805201,1.195942
0.963268,0.653245,0.711436,1.052108,1.247714,1.134206,1.144555,1.0657,0.845898,0.837806,0.699336,0.626595,0.895469,1.142078,0.842704,0.616348,0.650796,0.465855,0.458445,0.696261,0.738426,0.560223,0.356354,0.232438,0.334718,0.51192,0.919183,1.272304
0.707516,0.587576,0.669062,0.860834,0.891076,0.887159,0.927593,0.884898,0.7887,0.754593,0.63022,0.492765,0.627433,0.78811,0.609971,0.507529,0.554279,0.442679,0.468013,0.784927,0.826562,0.593457,0.377452,0.220349,0.291609,0.498837,0.86545,1.05076
0.491007,0.561377,0.639533,0.657272,0.557425,0.61703,0.687805,0.672699,0.589015,0.521554,0.475083,0.366484,0.386375,0.481651,0.447557,0.379319,0.387208,0.347401,0.402523,0.736402,0.819166,0.569418,0.347151,0.211747,0.263728,0.42266,0.626772,0.649514
0.362329,0.472072,0.512246,0.486086,0.409154,0.44878,0.467967,0.431101,0.351114,0.302582,0.356841,0.317633,0.250546,0.264581,0.313758,0.287069,0.2658,0.236311,0.297167,0.565488,0.694043,0.487583,0.274873,0.198824,0.246031,0.309435,0.340842,0.315767
0.288354,0.329494,0.346593,0.375997,0.301513,0.303358,0.309321,0.268961,0.217409,0.195044,0.291778,0.312808,0.219585,0.170432,0.215318,0.217868,0.180353,0.135333,0.181478,0.369728,0.50643,0.401708,0.222311,0.175744,0.207853,0.212248,0.178067,0.180707
0.25034,0.212959,0.208221,0.268416,0.218527,0.188787,0.200281,0.201168,0.178348,0.145276,0.228281,0.28178,0.219166,0.171419,0.165241,0.136366,0.111436,0.077166,0.111987,0.232795,0.321212,0.283617,0.161325,0.125879,0.144488,0.161636,0.156335,0.177256
0.203984,0.136073,0.125235,0.169396,0.155507,0.146823,0.163961,0.166474,0.160902,0.132654,0.171065,0.209247,0.181589,0.155616,0.119622,0.084559,0.07991,0.062664,0.083165,0.134381,0.170194,0.156021,0.090644,0.068986,0.084105,0.115854,0.130788,0.166227
0.156002,0.100539,0.098318,0.116927,0.115942,0.130164,0.147235,0.134037,0.144656,0.147671,0.137746,0.125687,0.124631,0.122944,0.08679,0.063554,0.059442,0.058636,0.071574,0.100595,0.115267,0.089196,0.052633,0.043347,0.056258,0.076311,0.085619,0.13005
0.109435,0.086657,0.084075,0.097427,0.115052,0.122957,0.121611,0.118029,0.135651,0.147163,0.103716,0.069331,0.103398,0.113236,0.061304,0.046405,0.049183,0.054771,0.069222,0.096954,0.102826,0.071698,0.049495,0.04345,0.045372,0.04217,0.047093,0.091955
0.062291,0.073189,0.082695,0.083444,0.10896,0.114625,0.096035,0.099864,0.11515,0.120022,0.085833,0.071287,0.119682,0.125116,0.054832,0.035713,0.045315,0.047198,0.067671,0.096014,0.083739,0.053438,0.044887,0.041226,0.037099,0.027038,0.0396,0.078992
0.043791,0.072448,0.092593,0.079591,0.09146,0.108011,0.096749,0.085681,0.082479,0.083073,0.080184,0.096021,0.138754,0.126336,0.05576,0.03645,0.037945,0.032467,0.054631,0.079882,0.064032,0.039968,0.039621,0.038141,0.034855,0.030259,0.042177,0.069342
