-0.000309,-0.000643,-0.000442,-0.000204,-0.000176,-0.000317,-0.000423,-0.000249,-0.000612,-0.000718,-0.000602,-0.000328,-0.000218,-0.000345,0.000225,-0.001019,-0.000672,-0.000428,-0.000936,-0.001496,-0.001016,-0.000318,-0.000367,-0.000685,-0.00063,-0.00018,-0.000212,-0.000266,-0.000298,-0.000346,-0.00025,-0.000297,-0.00025,-0.000386,-0.000538,-0.000359,-0.000451,-0.000267,-0.000186,-0.000128,-0.000312,-0.000201,3.6e-05,-0.000147,-0.000248,-0.000265,-0.000222,-0.000281,-0.000108,-0.000276,-0.000297,-0.000299,-0.000151,-0.000165,-0.000167,-0.000139,-0.001097,-0.003681,-0.00198,-0.000658,-3e-04,-0.000207,-0.000249,-0.000234,-0.000269,-0.000151,-3.1e-05,-0.000139,-6.6e-05,0.000136,-0.000469,0.00077,-0.001317,-0.000585,-0.000375,-4.3e-05,0.000437,-0.000274,0.000355,-0.00396,-0.002323,-0.001536,0.000641,0.001483,-0.000374,0.001616,-0.012367,-0.006063,-0.003305,-0.000821,-0.012161,-0.007833,-0.001541,-0.006847,-0.005669,-0.003081,-0.004028,-0.017499,-0.015328,-0.007906,-0.00256,-0.000491,0.000326,-9.1e-05,-0.000107,-0.000171,1.7e-05,6.6e-05,-0.000175,-0.000164,0.001097,-0.014523,-0.024185,-0.021077,-0.011036,-0.003714,-0.00033,0.000166,0.000456,0.00056,0.000264
-0.000166,-0.000159,-0.000421,-0.000276,-0.000187,-0.000187,-0.000497,-0.000216,7.7e-05,1e-05,-3e-04,7.8e-05,-5.6e-05,-0.000114,-0.00181,-0.000682,-0.000233,-0.000103,0.000524,0.000962,0.000205,-0.000206,-0.000125,-0.000154,-0.000107,-0.000179,-0.000108,-0.000104,-0.000153,7.6e-05,-7.3e-05,-0.000103,-0.000118,-0.000157,0.000103,3.3e-05,-1.2e-05,-4.3e-05,-0.000137,-9.1e-05,-7.1e-05,-0.000242,2.3e-05,-0.000309,-0.000163,-0.000156,-3.9e-05,6.3e-05,-0.000124,-7.6e-05,-0.000314,3e-05,-0.000143,-0.000155,-0.000202,-9.8e-05,-0.000316,0.002502,0.001227,0.000376,-1.2e-05,-4.6e-05,0.00018,7e-06,-4.2e-05,1e-06,-5.9e-05,0.000256,-3.1e-05,-9.8e-05,-6.7e-05,-0.001377,0.000199,0.000276,8.4e-05,-0.000169,3.7e-05,0.000164,0.000343,-0.000614,0.004486,0.001686,-8.1e-05,0.010545,0.007727,0.005439,-0.003699,0.004775,0.004388,0.002412,-0.000923,0.008297,0.006032,0.001962,0.002701,0.001821,0.001502,0.00632,0.007797,0.004815,0.002289,0.000368,-0.000496,-0.000251,-2.8e-05,0.00021,-0.000198,-0.000217,-1.3e-05,-0.000175,-0.000349,0.009746,0.009124,0.005344,0.004678,0.001316,-0.000258,-0.00037,-0.000263,-0.000398,-8.6e-05
-4.4e-05,1.5e-05,1.6e-05,-9e-06,3.1e-05,0.000152,0.000188,4.3e-05,-0.000265,-0.00013,-1.7e-05,-0.000114,-1.6e-05,0.000142,0.000142,-0.000652,-0.000432,-0.00018,-0.000761,-0.001108,-0.000387,-9e-06,-1.8e-05,0.000199,-4e-06,-3.7e-05,-0.00016,2.6e-05,3.3e-05,-7.3e-05,0.000135,1.6e-05,-5.4e-05,0.000167,0.000166,5.7e-05,0.000215,8.4e-05,0.000118,-2.9e-05,1e-06,2.8e-05,0.000136,9.2e-05,-2e-06,-3e-05,1.1e-05,-6.7e-05,9.3e-05,0.000206,0.000256,-7.7e-05,0.000101,0.000151,6.1e-05,5.5e-05,0.000136,-0.001495,-0.000926,-0.000443,-6e-06,0.000151,-0.000199,5.7e-05,2.2e-05,1.4e-05,-0.000102,-0.00017,-0.000149,-0.000353,-0.000108,-0.000196,-0.000451,-0.000114,-0.00018,-0.00027,-0.00013,-0.000815,-0.000647,0.000292,-0.004315,-0.004693,1.7e-05,-0.009666,-0.009255,-0.003354,-0.000753,-0.010754,-0.006603,-0.00246,-0.002227,-0.014321,-0.007848,-0.00295,-0.001024,-0.000455,-0.000282,-0.002998,-0.006216,-0.00337,-0.001115,-4.6e-05,4e-06,-0.000134,-0.000148,-4.9e-05,0.000138,8.3e-05,7.9e-05,0.000181,0.000115,-0.000738,-0.009459,-0.011055,-0.005363,-0.000351,0.000765,0.000295,0.000484,-6.9e-05,-9.7e-05
-8.9e-05,-8.7e-05,4.4e-05,-0.000148,-0.000185,2.2e-05,7e-06,-0.000148,3e-05,-2.5e-05,3.2e-05,5.5e-05,-6.2e-05,-0.000219,-0.000216,0.000349,0.000267,4.9e-05,-4.3e-05,0.000222,0.000145,-1.1e-05,-4.4e-05,-0.000166,1.7e-05,-2e-06,-0.000187,-5.7e-05,8e-06,-5e-06,-7.1e-05,-4.8e-05,-4.9e-05,-0.000111,-0.000176,-0.000133,-0.00017,-0.000134,-6.8e-05,2e-05,-0.000152,1.4e-05,-0.000233,-9e-05,-8.3e-05,4.1e-05,4e-06,-3.5e-05,-0.00027,-0.000375,-0.000412,-0.000103,-6.8e-05,-0.000171,-9.3e-05,-5.7e-05,-0.00015,0.00046,0.000471,0.000253,-0.000187,-9.9e-05,4.1e-05,-0.000184,-0.000132,6e-05,-1e-04,-2e-06,-8.2e-05,-8.3e-05,0.000198,0.000376,0.000543,0.000218,-0.00012,-0.000155,-0.000201,-0.000155,0.00016,-0.000581,-0.002091,-0.000788,0.000396,0.001551,-0.002769,-4e-04,0.000411,-0.000598,-0.00244,-0.002139,-0.000132,-0.001032,-0.00098,-0.002007,-0.000717,1.7e-05,-0.000273,0.001346,0.004987,0.00228,0.000253,-0.000221,-0.000228,-0.000447,-0.000304,-8.5e-05,-0.000515,-0.000402,-0.000358,-0.00032,0.000136,-0.001351,-0.001559,0.003808,0.002549,0.000388,-0.000704,-5e-05,-0.000395,-0.000647,-0.000505
-7.7e-05,-7e-05,-2.7e-05,2.9e-05,3e-05,0.000128,9.3e-05,0.000233,6.1e-05,0.000268,5.1e-05,4.1e-05,-4e-05,3.2e-05,0.000158,-0.000296,-0.000148,1.6e-05,3.9e-05,0.000447,0.000195,2e-06,1.6e-05,6.4e-05,0.000132,5.1e-05,6.9e-05,2.5e-05,1.9e-05,6e-05,0.000104,9.8e-05,-1.1e-05,0.000126,0.000146,9.8e-05,-2e-06,3e-05,8.8e-05,-2.6e-05,0.000186,4.3e-05,6.2e-05,-4.1e-05,0.000101,6.4e-05,6e-06,-9.4e-05,-1.6e-05,0.000229,0.000215,0.000122,6.5e-05,7.2e-05,5.6e-05,0.000113,-2.3e-05,-6.8e-05,-0.000327,-9.6e-05,0.000127,8.2e-05,9e-06,0.000145,3.5e-05,7.6e-05,-2e-05,6.1e-05,8.8e-05,2.8e-05,0.000189,-0.000351,-0.001097,-0.000657,-0.000195,-5.5e-05,0.000249,0.000147,-0.000116,-0.000312,0.001677,-0.00056,0.000133,-0.001392,-0.004094,-0.000136,0.000693,-0.005999,-0.003544,-0.001408,0.000472,-0.004583,-0.00497,-0.00106,0.000932,0.000166,2e-06,-0.003952,-0.003092,-0.002428,-0.001145,-0.000705,-0.000213,-8.9e-05,2.7e-05,-0.000142,-0.000132,-3.3e-05,4e-06,0.000133,0.000172,-0.001152,-0.000601,0.000561,0.000242,-0.000554,-0.000193,0.000241,-0.000308,-0.000268,-0.000207
2.7e-05,-7.5e-05,0.000175,6.8e-05,1.2e-05,-0.000243,-0.000125,0.00014,-2.8e-05,-0.000235,2.5e-05,-0.000115,-3.5e-05,0.00015,-0.000157,0.000223,-4.9e-05,-0.000144,-4.2e-05,-0.000177,-4.4e-05,-6e-06,-9.1e-05,3.7e-05,0,3.2e-05,-1.5e-05,5.5e-05,2.8e-05,-1e-05,-5.3e-05,-3.3e-05,0.000106,-8.6e-05,-0.000115,-0.000124,1.4e-05,-3e-05,9.7e-05,-3e-06,1.1e-05,2.5e-05,2.5e-05,4.7e-05,0,-2.8e-05,6.8e-05,0.000153,6e-05,5e-05,-8.5e-05,-6.5e-05,-6.2e-05,-9.2e-05,3.8e-05,1e-06,-5.3e-05,-0.000109,0.000399,0.000112,8.3e-05,0.000122,-1.4e-05,2.2e-05,2.1e-05,-1e-06,7.3e-05,0.000143,-2.2e-05,-6.6e-05,-0.000206,0.00016,-0.000123,-6.2e-05,5.5e-05,0.000162,-9.6e-05,0.000153,0.000296,-0.000445,-0.000382,0.00144,-3.1e-05,-0.001856,0.001332,0.001841,0.000822,0.003665,0.00352,0.00158,0.000167,0.005099,0.001042,0.00105,-0.001314,-0.000359,4e-05,0.002428,0.000131,0.000749,0.000617,0.000281,0.000302,0.000356,0.000317,0.00012,3.5e-05,0.000268,-1.4e-05,-2.1e-05,6.7e-05,0.000156,-0.001089,0.002415,0.000439,-0.00027,0.000616,0.000317,0.000463,0.000123,0.000428
-7.6e-05,0.000115,1.2e-05,-0.000174,1.5e-05,-3.7e-05,-0.000102,-1.3e-05,0.000109,0.000108,1.9e-05,2.4e-05,6e-06,-5e-06,0.000102,0.000337,0.000151,-8e-06,-6e-05,-4.5e-05,-0.000279,-0.000226,2e-05,6e-05,-0.000107,-7.5e-05,3.4e-05,-3.1e-05,-4.7e-05,-3.7e-05,3.2e-05,-1.4e-05,-2.1e-05,3.3e-05,-1e-06,9.9e-05,-0.000115,-6.3e-05,1.3e-05,7.3e-05,5.9e-05,-8.6e-05,-4.8e-05,3.9e-05,-3.5e-05,2.2e-05,3.6e-05,-7e-05,4.4e-05,-3.7e-05,0.000123,0.000155,3.7e-05,-0.000109,-0.000139,-0.000105,4.4e-05,0.00014,-0.00029,-0.000129,-1.7e-05,-4.8e-05,-0.000123,-8.5e-05,1.8e-05,-5.1e-05,-6.1e-05,-4.2e-05,9.2e-05,9e-06,7.3e-05,5.9e-05,0.000341,0.000175,0.00036,1.7e-05,-0.000234,-5.9e-05,-0.000266,0.000102,-0.000576,-0.000202,-0.000377,0.000943,-0.002405,-0.000716,0.000935,0.000673,0.000932,0.000188,0.000281,-0.001491,0.00095,0.002112,0.001322,-0.000118,-3e-06,-0.000847,0.000985,0.000264,0.000147,-0.000238,-0.000112,-0.000159,6.9e-05,7.9e-05,3.5e-05,2.9e-05,2.7e-05,4.5e-05,-6.4e-05,0.000466,0.00028,-0.004423,-0.003067,-0.000377,-3.9e-05,-0.000125,-0.000178,-0.000313,0.000206
-0.000149,-7.7e-05,-4.5e-05,1.9e-05,-2.6e-05,-5.2e-05,-0.000142,-5.7e-05,-9.9e-05,-0.000105,-9.9e-05,4.5e-05,2e-05,4.8e-05,6e-06,-0.000324,6.3e-05,5e-06,0.000106,-7.3e-05,0.000189,0.000226,-6.4e-05,-4.3e-05,-2e-06,-9.3e-05,-4e-06,9e-06,-1.4e-05,-1e-06,-7.7e-05,-9.8e-05,-4.8e-05,1e-06,3e-06,-7.5e-05,0.000137,-3.7e-05,-6.4e-05,-3.4e-05,-2.3e-05,2e-05,3e-05,0.000108,-4.3e-05,-8.7e-05,-4.6e-05,-3.8e-05,-0.000124,-6.9e-05,4e-06,-5.1e-05,2.6e-05,8.2e-05,9.1e-05,3.8e-05,2e-06,-0.000101,9.2e-05,6.6e-05,-0.000131,-4.1e-05,-1e-05,-4.7e-05,-0.000117,-6e-06,-3.6e-05,-2.4e-05,-6e-06,0.000125,3.5e-05,-0.000101,2e-06,-0.000465,-0.000273,8.5e-05,1.1e-05,3.9e-05,-0.000156,0.000167,0.00057,0.00049,0.000203,-0.000426,-0.000669,-0.000492,0.000807,-0.002391,0.000754,0.001,0.000305,-0.001434,0.000793,9e-06,-0.000543,-3.9e-05,-8e-05,0.00057,-0.000153,-0.001113,-0.000266,8.9e-05,0.000235,0.000152,2.5e-05,1.4e-05,1.8e-05,7.7e-05,0.000126,0.000109,-7e-06,-0.000225,0.00153,0.002386,0.000436,9e-06,-0.000168,0.000289,-0.000144,0.000168,7.4e-05
8.1e-05,-2.5e-05,-1.6e-05,2.4e-05,-0.000114,5e-06,0.00021,5.7e-05,-3e-05,-9e-06,0.000113,2.5e-05,-8.5e-05,9.1e-05,-1.8e-05,0.00019,-5.1e-05,0.000116,-8.4e-05,-2.9e-05,-0.000169,-1.3e-05,9e-06,1e-06,6.4e-05,7.8e-05,4.5e-05,-6.1e-05,-1.9e-05,1.4e-05,5.1e-05,8.5e-05,-1e-05,1.6e-05,1.3e-05,2.5e-05,-0.000103,4e-06,-3.6e-05,1.8e-05,7.9e-05,-5.7e-05,-4.5e-05,-2.3e-05,1.7e-05,4.6e-05,-4.3e-05,4e-05,8.8e-05,-3.5e-05,-0.000114,-3.4e-05,6e-06,-1.2e-05,-4.5e-05,-2.6e-05,4.1e-05,1.4e-05,-6.8e-05,-5.9e-05,1.7e-05,-8.4e-05,6e-06,-5.4e-05,4.2e-05,6.4e-05,-1.4e-05,-6.8e-05,-1.3e-05,2.4e-05,0.000191,-0.000103,-4.4e-05,0.000189,0.000218,-3.1e-05,2.8e-05,3.4e-05,3e-06,0.000218,0.000307,-1.8e-05,0.000345,-0.000675,0.00063,-0.000701,-1.6e-05,-0.000336,0.000333,-0.000226,0.000395,0.000876,0.001447,-1.3e-05,0.00014,3.3e-05,2.9e-05,-0.001091,0.000942,0.000583,8.9e-05,9.5e-05,2.6e-05,3.7e-05,-6.6e-05,0.00012,5.7e-05,3.7e-05,-0.000156,-2.7e-05,-0.000128,-0.000463,0.000149,-0.000649,0.000899,-0.000354,-0.000293,0.00045,-0.000222,3.1e-05,0.00016
1.5e-05,4.8e-05,-6.5e-05,-1e-06,9e-05,6.3e-05,-4.1e-05,2.8e-05,0.000106,9.5e-05,-1.1e-05,4.1e-05,6.2e-05,-6.5e-05,-5.5e-05,-0.000109,-0.000223,-4.8e-05,7e-06,-2.6e-05,0.000112,6e-06,0.000101,4.3e-05,-9.4e-05,-6.2e-05,-6.5e-05,1.4e-05,1.8e-05,3.8e-05,-9e-06,-5e-06,-8e-06,-8e-06,-1e-06,1.2e-05,2.2e-05,-7e-06,2e-06,5.6e-05,-6.8e-05,5.5e-05,-0.000144,-9e-06,7.1e-05,-2.2e-05,4e-06,3e-05,-0.000103,1.6e-05,0.000105,8e-06,1.5e-05,3.9e-05,5.5e-05,3.2e-05,3.6e-05,1.1e-05,0.00017,1e-04,-3e-06,3.7e-05,-5.4e-05,-7e-06,-4e-06,-4.8e-05,4.4e-05,4.1e-05,1.4e-05,-0.000114,-2.6e-05,8e-06,-1e-06,0.000282,-3e-05,-0.000217,-2e-05,4.6e-05,2.2e-05,-0.000183,-0.000273,2e-06,0.000968,0.000321,-0.000596,-0.000936,2.3e-05,1.3e-05,0.000254,9.1e-05,-0.00034,-0.000374,0.000572,-0.002428,-0.000176,-8.7e-05,-1e-04,0.000399,-0.001232,0.000192,-0.00036,-6.4e-05,-1.8e-05,-6.9e-05,-8.2e-05,-4.3e-05,-5.9e-05,-5.3e-05,5.9e-05,-8.2e-05,3.5e-05,-0.000114,0.000499,-0.001075,-0.000535,7e-05,3.1e-05,-0.000614,-8.9e-05,-0.000198,-0.000201
5.8e-05,3.1e-05,1.6e-05,2.1e-05,5e-06,1e-05,-6.4e-05,4e-06,-4.1e-05,-5e-06,3e-06,-1.5e-05,9e-06,5e-05,1e-05,2.5e-05,0.00022,3.4e-05,-7.2e-05,2.2e-05,-4.8e-05,-5.5e-05,-1.1e-05,1.7e-05,5.1e-05,7.6e-05,1.9e-05,-1.5e-05,-6e-06,-3e-06,2.5e-05,-4.1e-05,4e-06,9e-06,2.8e-05,-3.1e-05,1.5e-05,1.1e-05,-3.1e-05,-2.3e-05,-4.1e-05,-2.2e-05,2.2e-05,3.8e-05,1e-06,3e-05,4e-05,4e-06,8e-05,8e-06,3e-06,-2e-05,-8.1e-05,-3.7e-05,-1.7e-05,1.9e-05,-3.8e-05,-6.4e-05,-5.3e-05,-8.7e-05,-5.3e-05,-3e-06,5.4e-05,2.9e-05,1.1e-05,0,-4.2e-05,-3.8e-05,3.3e-05,1.1e-05,-3.6e-05,9.3e-05,-6.6e-05,0.000196,9e-06,9.4e-05,7.8e-05,3.1e-05,9.2e-05,-0.000113,-0.000181,7.2e-05,0.000159,7.5e-05,-0.000413,-0.000507,0.00032,-0.000393,0.00074,0.000328,-0.000272,7.2e-05,6.8e-05,0.000583,3.5e-05,0.000125,0.000118,0.000269,-0.000596,-0.00021,1.1e-05,0.000113,-0.000117,-1.7e-05,-3.4e-05,-4.9e-05,2.7e-05,-4.3e-05,-4.1e-05,-6.8e-05,8.3e-05,0.000201,0.000238,-0.000113,0.000262,-0.000195,-0.000471,8.2e-05,-0.000112,-3.1e-05,7.2e-05
-2.6e-05,-5.3e-05,-4.5e-05,-4.4e-05,-3.1e-05,-4e-05,2.3e-05,-2.8e-05,0.000125,-2.5e-05,7e-06,-1.7e-05,-2e-05,-5.1e-05,4.8e-05,4.4e-05,1.1e-05,-2.7e-05,4e-06,4.1e-05,4.1e-05,3.3e-05,1.4e-05,2.9e-05,9e-06,-6.5e-05,-4e-06,3e-05,2e-06,5e-06,-3e-05,3e-06,3.8e-05,1e-05,-2.1e-05,4.6e-05,6.2e-05,-6e-06,2.2e-05,1.8e-05,4.8e-05,1.3e-05,3.2e-05,-3.4e-05,-2e-06,1.9e-05,1e-06,1.1e-05,-2.2e-05,0,-1.3e-05,2.4e-05,3.7e-05,6e-06,-1.4e-05,0,6.9e-05,1.7e-05,-1e-06,4.6e-05,5.7e-05,1.6e-05,-6e-06,-9e-06,1.7e-05,-1.9e-05,-2.4e-05,7e-06,9e-06,-4.6e-05,-3.9e-05,-4e-05,5.6e-05,-9e-05,-0.000147,6e-06,2.9e-05,-4.2e-05,4.5e-05,5.5e-05,0.000166,-4e-05,-0.000243,-9.6e-05,0.00011,-0.000143,-1e-06,-0.000538,0.000429,-0.00051,-0.000416,-0.000972,-0.001603,-0.001579,-0.000197,1e-05,-5.1e-05,-0.000265,0.001162,-0.00026,-0.00028,-0.000203,-5.9e-05,1.4e-05,2.9e-05,4.9e-05,-5.7e-05,-1.7e-05,-3.1e-05,-5e-06,-6.9e-05,0.000106,0.000354,-7e-04,0.000426,0.000327,-0.000268,-1e-04,-3e-05,9.2e-05,-0.000161
2.1e-05,3.6e-05,3e-05,1e-06,-6.1e-05,-1.2e-05,-2.4e-05,-8.1e-05,-3.1e-05,-5.7e-05,-4.4e-05,-7e-06,-2.6e-05,-4e-06,4.9e-05,-7.9e-05,-1e-04,3.6e-05,1.3e-05,-2e-05,-6.6e-05,-4.4e-05,-4.3e-05,5e-06,-4.3e-05,9e-06,1.5e-05,4e-06,-5e-06,-2.4e-05,2.2e-05,0,4e-06,-7e-06,-1.2e-05,-2.3e-05,-4.2e-05,-1.4e-05,-2.9e-05,-1e-06,-1e-05,-2.1e-05,1.9e-05,-9e-06,-1e-05,-4.5e-05,-1.8e-05,6e-06,1.8e-05,-2.7e-05,-8e-06,-1.2e-05,-1.8e-05,-1.2e-05,-4e-06,8e-06,-1e-05,2.1e-05,1.5e-05,-1.4e-05,-6e-05,-1.5e-05,-3.1e-05,1.9e-05,-1.9e-05,-5.7e-05,1.7e-05,-1.6e-05,2e-05,1.9e-05,-7e-06,-5.2e-05,2.5e-05,-0.000131,0,2.4e-05,-5.7e-05,3e-06,-2.5e-05,7.9e-05,-4.6e-05,1.5e-05,-0.002095,-0.000144,1.8e-05,-0.000217,0.000921,0.000139,-0.000521,-0.000155,-0.000303,0.000699,0.00152,0.001024,-0.000161,0.000119,0.000269,2.8e-05,-0.000716,-0.000359,7.5e-05,8.9e-05,-0.000102,-3.5e-05,-6e-05,-5.1e-05,5e-06,5e-06,2.8e-05,5e-06,6.4e-05,-0.000131,1.4e-05,-0.000209,-0.000614,-8.5e-05,9.1e-05,-0.000171,-0.000108,1.5e-05,-8.3e-05
-1e-05,2.6e-05,1.5e-05,-2.2e-05,-1.1e-05,-1.2e-05,2.9e-05,5e-06,-3e-05,4.3e-05,2.3e-05,2.3e-05,-9e-06,-1.7e-05,2.9e-05,5.8e-05,2.8e-05,-6.2e-05,-2.4e-05,-2e-06,7e-06,7.5e-05,-7e-06,-4.6e-05,0,6e-06,-2e-06,2e-06,-8e-06,1.3e-05,-4e-06,2e-06,-4.1e-05,1e-06,-1.5e-05,3e-06,-1e-06,1e-05,1e-06,-1e-05,-1.5e-05,1.9e-05,-3.9e-05,-6e-06,-4e-06,3.3e-05,-2.4e-05,-4e-06,-3e-05,1.1e-05,-6e-06,1.2e-05,1e-05,-5e-06,-5e-06,0,-2.7e-05,-2.5e-05,-1.8e-05,-2e-05,3.8e-05,-1e-06,2.9e-05,2.4e-05,7e-06,6.3e-05,-3e-06,1e-05,-1.6e-05,0,-4.4e-05,-7.4e-05,-4e-06,3e-05,-5.2e-05,-1.9e-05,-6e-06,-3e-06,3e-05,4.7e-05,-6.7e-05,-1.5e-05,0.000914,-8.3e-05,-0.000488,0.00043,-0.000593,8.9e-05,0.000586,-0.000144,9.5e-05,0.00017,0.000272,-0.000291,-8.9e-05,-0.000105,-0.000369,-0.000174,0.000391,0.000598,-0.000236,-1e-06,-2.2e-05,2.5e-05,5e-06,6.7e-05,6e-06,-2.3e-05,-1.5e-05,1e-06,-4.5e-05,-7.7e-05,-0.00021,0.000968,-0.000306,0.000355,-0.000123,0.000147,8.9e-05,-6e-06,-3.4e-05
2e-05,-3.1e-05,1e-05,1e-06,3e-06,8e-06,-1.3e-05,-1.4e-05,4.7e-05,5e-06,-1.2e-05,-2.3e-05,-1.1e-05,-2e-06,1.9e-05,-2.3e-05,-7.5e-05,-5e-06,1.8e-05,1.5e-05,-9e-06,9e-06,2.4e-05,-1e-05,1.6e-05,-1.6e-05,4e-06,5e-06,-1e-06,1.7e-05,-1.9e-05,-6e-06,3.1e-05,0,5e-06,-3e-06,1.4e-05,1.5e-05,2.2e-05,0,2.3e-05,-1e-06,2e-06,-1.7e-05,-1.4e-05,-4e-06,9e-06,-6e-06,2.4e-05,0,-3e-06,2e-06,2.5e-05,7e-06,4e-06,0,7e-06,2.3e-05,1.5e-05,2.2e-05,-3.6e-05,5e-06,-1.8e-05,-6e-06,-4e-06,-1.7e-05,4e-06,2e-06,1.3e-05,3e-06,3e-06,1.1e-05,-2e-06,7.9e-05,1.2e-05,5.9e-05,-4e-05,-1.9e-05,-2.1e-05,-7.6e-05,2.9e-05,5e-05,-0.00045,-0.000232,5e-05,-1.5e-05,-0.000834,-0.000164,-0.000112,-0.000367,0.000527,-0.000615,-0.00039,9.9e-05,-0.000133,2e-06,0.000523,0.000238,1e-06,0.000237,0.000213,3.7e-05,1.8e-05,-8e-06,2.8e-05,6e-06,4.6e-05,5e-06,-1.7e-05,1.9e-05,-2.3e-05,6.4e-05,-0.000142,-0.000736,-0.000222,-0.000126,0.000117,-2.8e-05,7.4e-05,1e-05,-2.7e-05
-1.3e-05,0,9e-06,2e-06,3.8e-05,-1e-06,-9e-06,-1.6e-05,6e-06,7e-06,1.7e-05,9e-06,4e-06,-1.1e-05,1.3e-05,-1.6e-05,3e-05,2.4e-05,-1.6e-05,-1.8e-05,2.3e-05,1e-05,-2.5e-05,0,-6e-06,1.9e-05,-7e-06,-1.1e-05,2.2e-05,-1.2e-05,-1e-05,-8e-06,9e-06,2e-06,5e-06,-4e-06,-1.4e-05,-1.1e-05,-5e-06,-3e-06,9e-06,-3e-06,-8e-06,-1.2e-05,-5e-06,-1.6e-05,-3e-06,5e-06,-2e-06,-1.2e-05,9e-06,6e-06,-1.6e-05,-4e-06,-2e-06,-4e-06,-1e-05,1e-06,-7e-06,-1.8e-05,4e-05,-1.4e-05,-2e-06,-7e-06,-3e-06,1.3e-05,-8e-06,2e-06,-1.1e-05,-2.2e-05,1.9e-05,-4e-06,-2.5e-05,2.3e-05,3.3e-05,2.1e-05,4.2e-05,-1e-06,-1.2e-05,-5.9e-05,4.6e-05,-2.3e-05,0.000689,9.2e-05,8.1e-05,6.4e-05,-0.000668,-6.4e-05,0.000154,-0.000117,0.000295,0.000323,2.8e-05,9.5e-05,-1.6e-05,2.1e-05,-0.000159,-0.000141,-0.000331,-0.000419,-3e-06,8.2e-05,2.2e-05,6e-06,2e-06,-5e-06,-7e-06,7e-06,4e-06,-3e-06,-2.3e-05,9.9e-05,-0.00024,0.000354,-0.000106,-0.000195,1.1e-05,-3.1e-05,-6.4e-05,1.8e-05,-1.5e-05
1.1e-05,-7e-06,4e-06,-2e-06,-1.7e-05,7e-06,4e-06,-1.6e-05,-4e-06,0,1e-05,-8e-06,-4e-06,-1e-05,2e-06,2.5e-05,2.7e-05,1e-05,4.4e-05,-3e-06,-1e-05,-1.5e-05,8e-06,3e-06,-6e-06,-4e-06,-3e-06,6e-06,-6e-06,6e-06,1.4e-05,9e-06,1e-06,1e-06,7e-06,6e-06,1.1e-05,-2e-06,1.2e-05,-1e-05,3e-06,-1e-06,2.3e-05,-7e-06,1.1e-05,2.2e-05,-1e-06,1e-05,1e-06,-1e-06,-1e-05,-2e-06,-2e-06,1e-05,6e-06,3e-06,1.3e-05,-1.4e-05,3.1e-05,1.7e-05,-2.6e-05,-1e-06,-1e-06,0,-1e-06,5e-06,7e-06,-5e-06,-2e-06,3e-06,-6e-06,1e-05,2.1e-05,-1.6e-05,-4e-06,-4.2e-05,-3e-06,1e-06,5e-06,-5e-06,-5.9e-05,-4e-06,0.000121,9.6e-05,-0.000274,-2.5e-05,-0.00031,-6.2e-05,-0.000311,-1.7e-05,-0.000148,6.2e-05,-0.000296,0.000347,-4.9e-05,-2e-05,8e-06,2.7e-05,0.000196,5e-05,-3.7e-05,-0.000136,-8e-06,-1e-05,4e-06,5e-06,1.5e-05,-1e-06,1.7e-05,0,3e-06,-2.7e-05,-2e-05,0.00073,3.2e-05,6e-06,-3.3e-05,-8.3e-05,-4.7e-05,-2e-06,-3.1e-05
5e-06,7e-06,2e-06,1.4e-05,-4e-06,-1e-06,-1e-05,6e-06,4e-06,-1e-06,-1.3e-05,1e-05,8e-06,7e-06,-4e-06,-3e-05,-4.2e-05,-6e-06,-1.3e-05,1e-06,1.1e-05,-1.2e-05,2.5e-05,-1.5e-05,1e-05,5e-06,-3e-06,-7e-06,1e-06,8e-06,-8e-06,-4e-06,-9e-06,-5e-06,4e-06,4e-06,-9e-06,-3e-06,-8e-06,6e-06,1e-06,-6e-06,-2e-06,-4e-06,5e-06,-4e-06,2e-06,-4e-06,-5e-06,4e-06,-1.1e-05,2e-06,2e-06,-5e-06,-3e-06,0,1e-06,2e-05,-1.3e-05,-1.1e-05,6e-06,-2e-06,3e-06,-2e-06,-1e-06,-6e-06,-4e-06,-1e-06,-4e-06,8e-06,-5e-06,-8e-06,1.3e-05,4e-06,3.1e-05,3.7e-05,2.4e-05,-5e-06,-1e-05,2.5e-05,0,-6e-06,-0.000222,6e-05,-9.8e-05,4.3e-05,3.2e-05,0.000148,-0.000169,-6.6e-05,5.4e-05,6.4e-05,0.000186,0.000106,4e-06,1.4e-05,0.000115,-3.2e-05,-2.4e-05,-3.4e-05,9.7e-05,6.2e-05,3e-05,1.1e-05,0,-1e-06,-1.5e-05,-1e-06,-2e-05,1.2e-05,1e-05,-7.9e-05,-1.3e-05,-0.000423,0.000223,-0.000114,3.4e-05,5.9e-05,1.6e-05,1e-05,3.5e-05
4e-06,2e-06,-9e-06,-4e-06,8e-06,-3e-06,2e-06,9e-06,-1.5e-05,-1.3e-05,1.2e-05,0,-8e-06,1e-06,-3e-06,2.6e-05,-1e-05,8e-06,4e-06,-7e-06,-1.6e-05,5e-06,-2.2e-05,1e-06,3e-06,-7e-06,6e-06,2e-06,-3e-06,-9e-06,1.3e-05,-4e-06,1e-06,-1e-06,-1e-06,-6e-06,1.4e-05,-1e-06,-7e-06,-7e-06,5e-06,7e-06,-1e-06,-2e-06,-8e-06,-4e-06,0,-9e-06,1.8e-05,-2e-06,9e-06,-6e-06,0,-3e-06,3e-06,3e-06,-6e-06,-1e-05,6e-06,-2e-06,-6e-06,1e-05,1e-06,4e-06,4e-06,-3e-06,-7e-06,6e-06,1e-06,-5e-06,-2e-06,9e-06,2e-06,5e-06,-1e-06,-1.5e-05,-9e-06,-1.1e-05,1.1e-05,8e-06,3.6e-05,1.3e-05,1.3e-05,-5.8e-05,3.3e-05,-0.000115,7e-05,2.2e-05,6.7e-05,-0.000194,-7.6e-05,-0.000334,4.5e-05,8.5e-05,-5e-06,3.5e-05,-4.1e-05,4.6e-05,1.5e-05,-0.000115,1.4e-05,-1.6e-05,1.5e-05,-1e-06,1e-05,-2e-06,2.3e-05,5e-06,1.5e-05,1.7e-05,4e-06,1e-05,3.2e-05,7.6e-05,-5.3e-05,0.000224,-7e-05,3.8e-05,2.1e-05,1.3e-05,2.3e-05
-3e-06,2e-06,0,-4e-06,-6e-06,-3e-06,1.2e-05,1e-06,1.9e-05,4e-06,-3e-06,4e-06,-8e-06,1e-06,0,-7e-06,-3e-06,-9e-06,3e-06,5e-06,0,3e-06,1e-06,0,-1.2e-05,-1e-06,0,1e-06,-2e-06,-3e-06,-6e-06,2e-06,6e-06,0,-6e-06,1e-06,-1.5e-05,-2e-06,3e-06,-4e-06,2e-06,-4e-06,-1.9e-05,3e-06,-4e-06,6e-06,8e-06,-1e-06,-5e-06,-3e-06,0,2e-06,7e-06,-3e-06,-6e-06,-1e-06,2e-06,-6e-06,-1.5e-05,2e-06,0,1e-06,-5e-06,-2e-06,-1e-06,3e-06,-1e-06,-7e-06,-6e-06,1e-06,5e-06,4e-06,3e-06,-3.2e-05,2.5e-05,-1.4e-05,2e-06,5e-06,0,-6e-06,-7e-06,-7e-06,-0.000126,1e-05,-5.3e-05,-9.2e-05,9.9e-05,-8.7e-05,-0.000204,9.1e-05,-5e-06,0.000113,-0.000195,-0.00033,2.3e-05,-4.2e-05,8e-06,2.7e-05,5.7e-05,0.000186,-3.2e-05,3.3e-05,4e-06,-3e-06,-3e-06,3e-06,-2e-06,7e-06,-5e-06,-2e-05,5e-06,6.5e-05,7.1e-05,6e-06,-3.8e-05,-1.5e-05,-1.4e-05,-7.2e-05,-5.6e-05,-5e-06,1.3e-05
-1e-06,0,-4e-06,-2e-06,-6e-06,2e-06,-5e-06,4e-06,-2e-06,-1.3e-05,-2e-06,-9e-06,5e-06,0,1e-06,-7e-06,2.4e-05,-2e-06,-2e-06,6e-06,0,5e-06,-7e-06,0,3e-06,6e-06,-3e-06,1e-06,1e-06,0,-6e-06,-1e-06,1e-06,-2e-06,-3e-06,0,1.7e-05,-4e-06,-6e-06,1e-06,-6e-06,7e-06,9e-06,5e-06,1e-06,-5e-06,-1e-06,2e-06,-2e-06,2e-06,-7e-06,-1e-06,-2e-06,5e-06,4e-06,0,0,1.2e-05,8e-06,1e-05,0,1e-06,5e-06,1e-05,-1e-06,-2e-06,2e-06,-3e-06,1e-06,3e-06,1e-05,-8e-06,-9e-06,-2.1e-05,-1e-06,6e-06,-8e-06,-3e-06,-1e-06,-1.8e-05,-1.9e-05,-1.7e-05,0.000102,3.9e-05,-0.000176,8e-05,0.000113,3.4e-05,-8.3e-05,3.7e-05,-5e-06,2e-04,1e-05,7e-05,5e-06,2.2e-05,0,-4.9e-05,-0.000152,-4e-05,1e-05,1.4e-05,3e-06,-1e-06,-3e-06,-7e-06,8e-06,5e-06,-7e-06,-3e-06,-1e-06,7e-06,3.7e-05,-0.000228,2e-05,3e-05,-3.2e-05,5.4e-05,-7e-06,-2e-06,1.7e-05
3e-06,5e-06,2e-06,2e-06,-7e-06,1e-06,-1e-06,8e-06,-2.4e-05,5e-06,7e-06,4e-06,0,8e-06,4e-06,1.9e-05,-9e-06,4e-06,0,-8e-06,2e-06,4e-06,0,3e-06,5e-06,-8e-06,-6e-06,2e-06,-2e-06,-5e-06,-1e-06,-1e-06,-1e-06,2e-06,-2e-06,-3e-06,-1e-05,3e-06,-2e-06,-2e-06,-1e-06,-9e-06,1.3e-05,4e-06,-3e-06,1e-06,-1e-06,-3e-06,-3e-06,2e-06,-2e-06,-3e-06,-4e-06,-2e-06,-1e-06,-2e-06,0,-1e-05,1e-06,-1.3e-05,-6e-06,-3e-06,-3e-06,1e-06,0,2e-06,-1e-06,1e-06,-3e-06,-6e-06,7e-06,7e-06,5e-06,2e-05,1.6e-05,0,1e-06,-4e-06,1e-06,-4e-06,1.1e-05,2e-06,1.1e-05,-2.5e-05,-1.7e-05,-9.2e-05,0.000139,1.5e-05,-0.000128,1.9e-05,-1.6e-05,-0.000269,4.9e-05,-0.000132,9e-06,-1.6e-05,-9e-06,3e-05,0.000119,-4.4e-05,-5.3e-05,-3.1e-05,2e-06,3e-06,-2e-06,3e-06,-8e-06,-5e-06,6e-06,-2e-06,0,-5.1e-05,-1.1e-05,3.5e-05,-3.2e-05,-3.7e-05,-1.8e-05,-2e-05,-5e-06,1.2e-05,7e-06
2e-06,-2e-06,-3e-06,-1e-06,0,1e-06,-4e-06,3e-06,1e-05,1e-06,-7e-06,-4e-06,2e-06,4e-06,4e-06,-1.5e-05,-1.3e-05,-5e-06,1e-06,-2e-06,2e-06,-1e-06,1.2e-05,4e-06,-7e-06,1e-05,2e-06,-1e-06,2e-06,3e-06,-1e-06,-2e-06,-2e-06,2e-06,3e-06,6e-06,2e-06,-1e-06,0,1e-06,1e-06,5e-06,-5e-06,6e-06,-4e-06,-3e-06,-2e-06,-3e-06,7e-06,-3e-06,1e-06,1e-06,-1e-06,1e-06,0,-2e-06,0,4e-06,-8e-06,5e-06,0,-1e-06,-2e-06,0,-1e-06,-7e-06,-5e-06,4e-06,-1e-06,1e-06,2e-06,-1.1e-05,5e-06,3.6e-05,-1.2e-05,-4e-06,-1e-06,5e-06,-5e-06,6e-06,7e-06,-2e-06,0.000194,-5e-06,2e-05,3e-06,0.000125,-2.4e-05,-8.1e-05,2e-05,-2.4e-05,3.8e-05,-0.000161,-2.2e-05,-6e-06,-9e-06,1.1e-05,-1.7e-05,-5.5e-05,4.6e-05,3.5e-05,1e-05,-4e-06,0,-8e-06,-1.1e-05,4e-06,3e-06,-3e-06,-8e-06,-2e-06,-2e-05,-4.3e-05,-0.000118,-0.000136,-5e-06,-7.6e-05,-2.2e-05,2.5e-05,4e-06,1.7e-05
0,-3e-06,2e-06,-1e-06,6e-06,0,-1e-06,2e-06,-6e-06,-7e-06,3e-06,5e-06,-3e-06,-1e-06,0,1e-05,2e-06,4e-06,-3e-06,5e-06,-2e-06,-6e-06,-9e-06,5e-06,-1e-06,-6e-06,-1e-06,1e-06,4e-06,1e-06,1e-06,-1e-06,2e-06,0,1e-06,-5e-06,-5e-06,2e-06,4e-06,4e-06,-3e-06,-4e-06,-1.1e-05,2e-06,3e-06,0,0,1e-06,-1e-06,1e-06,2e-06,1e-06,-1e-06,0,0,1e-06,-1e-06,6e-06,3e-06,8e-06,-2e-06,-3e-06,4e-06,-1e-06,-1e-06,5e-06,2e-06,-3e-06,-1e-06,3e-06,-4e-06,1e-05,-2e-06,4e-06,6e-06,-7e-06,6e-06,1e-06,0,6e-06,-1e-05,0,-0.000127,2.4e-05,-0.000123,3e-05,5.8e-05,4e-06,4.5e-05,1.5e-05,-1.6e-05,2.8e-05,1e-06,-4.9e-05,7e-06,1.4e-05,-8e-06,3.6e-05,-3e-06,-0.000105,-2.6e-05,-1.4e-05,-1.3e-05,-3e-06,-3e-06,9e-06,5e-06,-1e-06,-3e-06,1e-06,1e-06,3.4e-05,-3.6e-05,-3.7e-05,0.000135,-4.3e-05,3e-06,2.4e-05,-1.2e-05,-4e-06,-8e-06
1e-06,5e-06,2e-06,2e-06,1e-06,-3e-06,4e-06,-3e-06,0,-4e-06,0,0,-1e-06,1e-06,-1e-06,0,-9e-06,3e-06,-2e-06,-1e-06,7e-06,2e-06,-3e-06,3e-06,7e-06,3e-06,0,-2e-06,-3e-06,-2e-06,4e-06,2e-06,0,-1e-06,1e-06,1e-06,4e-06,-4e-06,2e-06,-1e-06,-1e-06,5e-06,3e-06,1e-06,4e-06,0,-1e-06,3e-06,-1e-06,-1e-06,-2e-06,0,4e-06,-2e-06,-1e-06,0,1e-06,-9e-06,-3e-06,-1.1e-05,2e-06,-1e-06,-3e-06,-3e-06,1e-06,-6e-06,0,0,1e-06,-2e-06,-6e-06,-5e-06,2e-06,-4e-05,-2e-05,1.6e-05,-2e-06,1e-06,1e-06,-2e-06,0,-8e-06,-1e-06,-1e-05,-7e-05,4.9e-05,3.2e-05,2e-05,-0.000122,3.8e-05,-5e-06,7.9e-05,0.000141,-0.00011,-1.2e-05,-1e-06,3e-06,-3.2e-05,0.000109,2.8e-05,-2.1e-05,1.9e-05,3e-06,3e-06,0,-4e-06,-1e-06,-5e-06,1e-06,2e-06,0,2.3e-05,-2.5e-05,0.000123,-4e-06,5.2e-05,1.9e-05,-7e-06,-1.1e-05,2e-06,-9e-06
2e-06,4e-06,-1e-06,0,-4e-06,-2e-06,-1e-06,0,2e-06,-3e-06,-7e-06,0,2e-06,0,-1e-06,-6e-06,2e-05,-5e-06,3e-06,-3e-06,-8e-06,-6e-06,1e-05,0,-4e-06,2e-06,-2e-06,0,-2e-06,3e-06,-1e-06,-2e-06,2e-06,-1e-06,-1e-06,0,1e-06,2e-06,1e-06,1e-06,1e-06,-4e-06,5e-06,1e-06,-1e-06,-1e-06,-2e-06,-2e-06,-1e-06,3e-06,-1e-06,2e-06,1e-06,-2e-06,0,1e-06,1e-06,7e-06,5e-06,8e-06,-2e-06,1e-06,1e-06,1e-06,-1e-06,4e-06,-3e-06,2e-06,-1e-06,-2e-06,-4e-06,0,-2e-06,-1e-05,3e-06,-5e-06,3e-06,2e-06,0,-6e-06,5e-06,-3e-06,-0.000183,-6e-06,2.4e-05,-3.1e-05,2.8e-05,3e-06,-1e-06,4.1e-05,2.1e-05,-0.00013,-0.000188,0.000102,-6e-06,-1e-06,1e-06,9e-06,-0.000117,6.9e-05,3.5e-05,1.1e-05,-1.2e-05,-2e-06,0,-1e-06,0,-1e-06,2e-06,-4e-06,0,-2.3e-05,5e-06,7e-06,-3.1e-05,-6.6e-05,-1.3e-05,6e-06,-4e-06,7e-06,-9e-06
1e-06,-5e-06,3e-06,-3e-06,0,-1e-06,2e-06,-3e-06,-1.2e-05,2e-06,6e-06,-2e-06,2e-06,0,-2e-06,9e-06,-7e-06,2e-06,0,1e-06,3e-06,5e-06,-8e-06,0,-4e-06,-6e-06,1e-06,1e-06,0,0,-1e-06,-1e-06,-2e-06,0,-2e-06,-2e-06,-3e-06,-3e-06,0,2e-06,0,2e-06,3e-06,-1e-06,-3e-06,3e-06,0,-2e-06,1e-06,-1e-06,0,0,-2e-06,1e-06,-1e-06,1e-06,0,1e-06,-6e-06,-6e-06,0,2e-06,-1e-06,-4e-06,2e-06,3e-06,0,0,1e-06,3e-06,-1e-06,3e-06,1e-06,1e-05,-1.2e-05,-9e-06,-4e-06,2e-06,1e-06,-3e-06,-2e-06,0,0.000109,1.3e-05,-5.2e-05,-2e-05,1.1e-05,-1.8e-05,4e-05,-5.8e-05,1.9e-05,-5.2e-05,0.000116,7.4e-05,-1.2e-05,1.1e-05,1e-06,2e-06,2.7e-05,-5.3e-05,-7e-06,-8e-06,3e-06,0,1e-06,3e-06,2e-06,1e-06,-6e-06,3e-06,1e-06,-2.4e-05,1.2e-05,8e-06,2.8e-05,7.8e-05,1e-05,-2.9e-05,2.2e-05,-2e-06,-1e-05
-1e-06,1e-06,-1e-06,-1e-06,-1e-06,2e-06,0,-2e-06,7e-06,-1e-06,-3e-06,1e-06,1e-06,-1e-06,-2e-06,-9e-06,-1.4e-05,2e-06,1e-06,0,-5e-06,-2e-06,-1e-06,-1e-06,5e-06,5e-06,-2e-06,-2e-06,-1e-06,-2e-06,-3e-06,0,-2e-06,1e-06,-2e-06,3e-06,5e-06,2e-06,-1e-06,-1e-06,1e-06,-2e-06,-1e-06,-2e-06,1e-06,-2e-06,0,2e-06,2e-06,-1e-06,3e-06,0,0,1e-06,2e-06,0,0,-6e-06,2e-06,4e-06,-1e-06,2e-06,0,4e-06,-1e-06,-2e-06,0,-1e-06,0,-2e-06,1e-06,-7e-06,2e-06,7e-06,5e-06,1e-05,1e-06,0,1e-06,2e-06,-1e-06,1e-06,-8e-06,-6e-06,-0.000103,3.9e-05,1.1e-05,-3e-06,3.1e-05,-1.2e-05,9e-06,0.000158,-1e-06,4.2e-05,-1.1e-05,-1e-05,-6e-06,3e-06,1.8e-05,-9e-06,6e-06,3e-06,-3e-06,0,4e-06,-5e-06,3e-06,-1e-06,5e-06,6e-06,-1e-06,1.3e-05,5e-05,-1.1e-05,-6e-06,-6.5e-05,-1.6e-05,1.4e-05,-1.1e-05,1e-06,-4e-06
-1e-06,2e-06,1e-06,0,-1e-06,2e-06,0,-3e-06,2e-06,5e-06,-1e-06,0,-3e-06,-4e-06,-2e-06,5e-06,8e-06,-6e-06,0,0,5e-06,3e-06,1e-06,-2e-06,0,-2e-06,0,1e-06,1e-06,0,-1e-06,-1e-06,1e-06,0,0,-1e-06,-5e-06,-3e-06,-3e-06,2e-06,1e-06,2e-06,-6e-06,-2e-06,1e-06,-1e-06,3e-06,1e-06,-2e-06,2e-06,0,0,0,-1e-06,-2e-06,-1e-06,0,7e-06,-3e-06,-1e-06,-3e-06,-1e-06,1e-06,0,0,2e-06,0,0,1e-06,-1e-06,0,8e-06,-1e-06,5e-06,-4e-06,-5e-06,-3e-06,2e-06,-1e-06,3e-06,1e-06,-2e-06,6.5e-05,-7e-06,7e-06,-3.4e-05,-3.7e-05,1.1e-05,6.8e-05,1.7e-05,2e-06,-9e-05,-7e-05,-1.4e-05,-1.1e-05,-4e-06,4e-06,-1e-06,-5.8e-05,2.6e-05,2e-06,-1.4e-05,2e-06,1e-06,1e-06,4e-06,-2e-06,0,-1e-06,2e-06,0,2.3e-05,1e-05,6.5e-05,-7.2e-05,3.7e-05,1e-05,6e-06,-1.8e-05,5e-06,-1.5e-05
2e-06,2e-06,-1e-06,1e-06,0,2e-06,-1e-06,-1e-06,-8e-06,-3e-06,5e-06,1e-06,2e-06,0,-1e-06,1e-06,-2e-06,4e-06,0,2e-06,-3e-06,-2e-06,-1e-06,-1e-06,-5e-06,2e-06,0,-1e-06,0,0,2e-06,0,0,1e-06,1e-06,-1e-06,5e-06,0,1e-06,0,0,0,-2e-06,-3e-06,-1e-06,2e-06,0,-1e-06,1e-06,0,-1e-06,-1e-06,1e-06,0,1e-06,-1e-06,0,-3e-06,2e-06,-3e-06,3e-06,0,-1e-06,3e-06,1e-06,0,-1e-06,0,0,2e-06,-1e-06,-8e-06,1e-06,-3e-06,8e-06,-6e-06,3e-06,1e-06,0,0,0,-3e-06,2.1e-05,7e-06,-8e-06,0,-5.3e-05,1.4e-05,-9e-06,-1e-05,-8e-06,-4.7e-05,0.000115,7e-06,-2e-06,7e-06,0,-1e-05,9.1e-05,-8e-06,-1e-06,6e-06,1e-06,0,1e-06,-1e-06,0,0,-3e-06,-1e-06,0,-4e-06,6e-06,-4e-06,1.1e-05,-1.2e-05,1e-05,-1.2e-05,6e-06,1e-06,2e-06
1e-06,-1e-06,-1e-06,0,0,0,2e-06,-2e-06,4e-06,2e-06,-5e-06,0,-1e-06,-1e-06,0,-5e-06,3e-06,-2e-06,1e-06,-1e-06,3e-06,0,6e-06,-1e-06,2e-06,-1e-06,1e-06,1e-06,1e-06,1e-06,-1e-06,-1e-06,0,0,2e-06,0,-6e-06,-1e-06,-1e-06,-2e-06,0,-1e-06,6e-06,-2e-06,1e-06,-1e-06,0,0,-1e-06,0,0,0,1e-06,-1e-06,-1e-06,0,0,-2e-06,0,2e-06,-5e-06,-1e-06,1e-06,1e-06,-1e-06,-4e-06,-1e-06,-1e-06,1e-06,-1e-06,-1e-06,6e-06,-1e-06,7e-06,-1e-06,2e-06,0,-2e-06,-1e-06,-2e-06,0,2e-06,-8.2e-05,3e-06,-9.7e-05,-8e-06,-6.8e-05,1e-06,7.1e-05,-7.4e-05,-1e-05,-6e-06,-7.2e-05,-2.9e-05,-4e-06,-6e-06,-6e-06,1.2e-05,-5.5e-05,-1.6e-05,2e-06,4e-06,6e-06,0,0,-2e-06,-1e-06,0,3e-06,-1e-06,0,-1.9e-05,-8e-06,-8.4e-05,2.1e-05,1.6e-05,-4.2e-05,2.2e-05,7e-06,-1e-06,0
0,-1e-06,0,0,1e-06,-1e-06,0,2e-06,-4e-06,-2e-06,4e-06,-1e-06,0,-1e-06,1e-06,6e-06,-5e-06,1e-06,-1e-06,-3e-06,-3e-06,-3e-06,-7e-06,-1e-06,2e-06,-1e-06,0,-1e-06,1e-06,1e-06,3e-06,0,-1e-06,-1e-06,1e-06,-1e-06,5e-06,1e-06,-1e-06,0,0,1e-06,4e-06,-1e-06,3e-06,1e-06,0,1e-06,1e-06,-2e-06,1e-06,0,-1e-06,-1e-06,1e-06,0,0,6e-06,-1e-06,3e-06,5e-06,-1e-06,-1e-06,-1e-06,0,2e-06,0,1e-06,0,-2e-06,2e-06,-3e-06,0,-3e-06,5e-06,1e-06,2e-06,1e-06,0,-2e-06,0,2e-06,3.5e-05,-7e-06,-3.1e-05,6e-06,-5e-05,-8e-06,7e-05,-1.7e-05,-1e-06,7.1e-05,1e-05,1.4e-05,2e-06,2e-06,7e-06,-4e-06,-2e-06,8e-06,0,2e-06,2e-06,0,1e-06,4e-06,4e-06,1e-06,-3e-06,-1e-06,0,-1e-06,-1.5e-05,6.2e-05,-3.3e-05,-3e-06,-1.3e-05,-1.2e-05,-2e-06,3e-06,5e-06
-1e-06,1e-06,-1e-06,0,2e-06,-2e-06,1e-06,-1e-06,2e-06,3e-06,1e-06,1e-06,1e-06,0,1e-06,-4e-06,-5e-06,-1e-06,0,2e-06,-1e-06,3e-06,2e-06,0,-4e-06,1e-06,0,0,0,0,-2e-06,0,0,0,0,1e-06,-5e-06,-1e-06,2e-06,-1e-06,0,-1e-06,-6e-06,0,1e-06,1e-06,-1e-06,1e-06,-2e-06,1e-06,0,0,0,0,-1e-06,1e-06,0,-5e-06,2e-06,-1e-06,-8e-06,-1e-06,1e-06,0,0,-1e-06,0,0,0,1e-06,2e-06,-1e-06,1e-06,-1.6e-05,3e-06,-5e-06,-1e-06,-1e-06,1e-06,0,-1e-06,1e-06,-5.6e-05,3e-06,1.3e-05,-3e-06,-2.3e-05,4e-06,3e-05,6e-06,1e-06,-3.7e-05,5.9e-05,-6.8e-05,2e-06,7e-06,-4e-06,3e-06,2.4e-05,9e-06,-6e-06,1e-06,-1e-06,0,-1e-06,-4e-06,-5e-06,1e-06,-1e-06,-3e-06,0,1.5e-05,-1.6e-05,-1.6e-05,1.9e-05,-9e-06,0,-3e-06,-1.2e-05,2e-06,2e-06
1e-06,1e-06,1e-06,-1e-06,-2e-06,-1e-06,-1e-06,3e-06,6e-06,-2e-06,-3e-06,-1e-06,0,0,1e-06,3e-06,2e-06,1e-06,0,2e-06,-2e-06,-2e-06,4e-06,0,0,-3e-06,0,1e-06,0,0,-1e-06,-1e-06,0,1e-06,-1e-06,1e-06,5e-06,-1e-06,1e-06,-1e-06,-1e-06,2e-06,-5e-06,0,-2e-06,-1e-06,0,-1e-06,1e-06,1e-06,-1e-06,0,0,1e-06,1e-06,1e-06,0,1e-06,-2e-06,-4e-06,6e-06,1e-06,0,-3e-06,0,0,-1e-06,0,0,0,2e-06,4e-06,-1e-06,1e-06,2e-06,0,1e-06,-1e-06,0,1e-06,0,-1e-06,6.6e-05,4e-06,-6.2e-05,0,-9e-06,4e-06,5.4e-05,-1.4e-05,-3e-06,-9e-05,-3.9e-05,-1e-05,2e-06,-8e-06,-1e-06,-6e-06,-5.2e-05,1.1e-05,-1e-06,-7e-06,1e-06,0,-2e-06,3e-06,2e-06,1e-06,1e-06,-1e-06,0,4e-06,-6e-06,-5.8e-05,2.8e-05,-3e-06,-3e-06,3e-06,2e-06,-1e-06,4e-06
0,-2e-06,-1e-06,0,0,0,0,0,-7e-06,4e-06,4e-06,2e-06,0,2e-06,0,0,0,-3e-06,0,-2e-06,1e-06,2e-06,-7e-06,-1e-06,4e-06,2e-06,0,-1e-06,1e-06,0,0,0,0,0,-1e-06,-2e-06,-2e-06,0,1e-06,1e-06,0,-1e-06,4e-06,1e-06,1e-06,-1e-06,-1e-06,0,-1e-06,-2e-06,0,0,0,0,0,0,0,4e-06,2e-06,5e-06,-5e-06,1e-06,-1e-06,2e-06,0,0,0,0,0,-2e-06,1e-06,-6e-06,1e-06,1.1e-05,1e-06,5e-06,-1e-06,0,0,0,1e-06,1e-06,-1.6e-05,-5e-06,-6.3e-05,1.6e-05,1.2e-05,3e-06,2e-06,-1.3e-05,0,7.9e-05,-1.4e-05,-6.4e-05,1e-06,2e-06,2e-06,4e-06,7.5e-05,-1.8e-05,0,-1e-06,-1e-06,0,0,0,-2e-06,0,0,1e-06,0,-1.1e-05,6e-06,4.6e-05,-3.6e-05,2e-06,-2e-05,0,8e-06,0,8e-06
0,-1e-06,1e-06,0,-1e-06,1e-06,1e-06,3e-06,5e-06,-1e-06,-3e-06,-1e-06,-1e-06,1e-06,-1e-06,-2e-06,1e-06,4e-06,-1e-06,-1e-06,0,0,3e-06,0,-2e-06,-1e-06,0,1e-06,0,-1e-06,0,0,0,0,-1e-06,1e-06,1e-06,-1e-06,1e-06,-1e-06,1e-06,1e-06,5e-06,1e-06,1e-06,0,0,1e-06,2e-06,0,0,0,1e-06,0,0,-1e-06,0,-5e-06,0,-2e-06,3e-06,1e-06,1e-06,-2e-06,0,0,1e-06,1e-06,-1e-06,1e-06,0,7e-06,0,4e-06,-4e-06,-4e-06,1e-06,0,0,-1e-06,-1e-06,3e-06,3.6e-05,1e-06,1e-05,-1.3e-05,2.1e-05,5e-06,3.8e-05,-1.4e-05,1e-06,2e-06,5.3e-05,6.3e-05,1e-06,2e-06,-1e-06,2e-06,-2.6e-05,-2.6e-05,9e-06,0,-1e-06,0,-1e-06,-3e-06,4e-06,-1e-06,-2e-06,-3e-06,0,-6e-06,6e-06,-5.4e-05,-8e-06,3e-06,-1e-06,6e-06,2e-06,2e-06,2e-06
-1e-06,2e-06,0,-1e-06,-1e-06,1e-06,0,0,2e-06,-2e-06,-1e-06,1e-06,0,-1e-06,-1e-06,4e-06,-7e-06,-4e-06,0,1e-06,0,-1e-06,2e-06,0,-2e-06,0,0,-1e-06,-1e-06,0,-1e-06,-1e-06,0,0,0,0,-1e-06,0,-1e-06,0,-1e-06,-1e-06,-2e-06,1e-06,-1e-06,-1e-06,0,0,-2e-06,1e-06,1e-06,0,0,0,0,0,0,3e-06,2e-06,0,-3e-06,0,0,2e-06,0,0,-1e-06,0,0,1e-06,-1e-06,-6e-06,0,-4e-06,0,-3e-06,0,-1e-06,0,-1e-06,-1e-06,1e-06,-4.5e-05,4e-06,-2.6e-05,5e-06,2.2e-05,4e-06,9e-06,2e-06,1e-06,-3.8e-05,-4e-05,-5e-06,0,-6e-06,1e-06,-1e-06,-2.5e-05,6e-06,-8e-06,5e-06,-2e-06,0,0,4e-06,-4e-06,0,2e-06,1e-06,0,6e-06,7e-06,1.6e-05,2.5e-05,6e-06,3e-06,-1.1e-05,-1.4e-05,0,2e-06
1e-06,0,0,1e-06,1e-06,1e-06,0,2e-06,-4e-06,1e-06,2e-06,-2e-06,0,2e-06,-1e-06,-3e-06,-1e-06,2e-06,0,0,0,1e-06,-3e-06,0,3e-06,0,0,1e-06,-1e-06,0,3e-06,0,0,0,0,0,-1e-06,-2e-06,0,0,-1e-06,1e-06,-2e-06,1e-06,-1e-06,0,1e-06,-1e-06,1e-06,1e-06,-1e-06,0,0,0,0,0,0,1e-06,-1e-06,-1e-06,0,-1e-06,0,0,0,0,-1e-06,0,0,-1e-06,-1e-06,4e-06,1e-06,-3e-06,-5e-06,6e-06,0,0,0,0,1e-06,-1e-06,-2e-06,-3e-06,-7.3e-05,-6e-06,2.2e-05,-1e-06,-2.8e-05,1.6e-05,2e-06,-4.4e-05,-2.5e-05,2.2e-05,-2e-06,4e-06,0,0,3.6e-05,2e-05,-2e-06,6e-06,0,0,1e-06,-4e-06,2e-06,0,-1e-06,3e-06,0,5e-06,1e-06,4.7e-05,-2.5e-05,6e-06,3e-06,7e-06,2e-06,-1e-06,0
0,-2e-06,0,-1e-06,1e-06,0,0,-1e-06,5e-06,-1e-06,-4e-06,2e-06,0,0,-1e-06,2e-06,3e-06,-1e-06,0,1e-06,-2e-06,-2e-06,4e-06,0,-1e-06,-1e-06,0,-1e-06,0,0,-2e-06,-1e-06,0,0,0,1e-06,2e-06,0,-1e-06,0,1e-06,0,-4e-06,0,1e-06,1e-06,1e-06,0,-2e-06,-1e-06,-1e-06,0,0,0,1e-06,0,0,-4e-06,0,1e-06,0,-1e-06,0,1e-06,0,1e-06,0,0,0,0,0,-2e-06,0,4e-06,2e-06,-2e-06,0,0,0,0,0,-1e-06,-2e-06,-1e-06,-1.2e-05,6e-06,1.1e-05,0,-9e-06,-5e-06,3e-06,5.3e-05,6.2e-05,-2.2e-05,-2e-06,1e-06,0,-2e-06,-5.6e-05,-3e-06,4e-06,-2e-06,-1e-06,0,0,2e-06,-2e-06,-1e-06,-2e-06,1e-06,0,-3e-06,4e-06,-4.7e-05,-7e-06,-1.5e-05,1e-06,-5e-06,9e-06,1e-06,1e-06
0,0,0,0,0,0,0,1e-06,-4e-06,0,2e-06,-1e-06,0,0,0,0,-3e-06,1e-06,0,0,0,3e-06,-4e-06,0,-3e-06,1e-06,0,0,0,1e-06,2e-06,0,0,0,0,-1e-06,-3e-06,-1e-06,0,1e-06,0,0,3e-06,0,0,0,0,0,3e-06,0,1e-06,0,0,0,-1e-06,1e-06,0,4e-06,1e-06,2e-06,-2e-06,-1e-06,0,1e-06,0,-1e-06,-1e-06,0,-1e-06,1e-06,1e-06,-1e-06,0,2e-06,-4e-06,-3e-06,0,0,0,0,-1e-06,1e-06,-1e-06,4e-06,0,1e-06,3e-06,5e-06,-3.1e-05,-1.1e-05,0,2e-05,-5.4e-05,4.5e-05,-2e-06,-2e-06,1e-06,3e-06,4.4e-05,-1.5e-05,5e-06,-5e-06,1e-06,0,0,0,3e-06,1e-06,2e-06,-1e-06,0,-4e-06,-7e-06,3.4e-05,3.5e-05,4e-06,-1.6e-05,-2e-06,-3e-06,1e-06,-1e-06
-1e-06,1e-06,0,0,0,0,-2e-06,-3e-06,1e-06,-2e-06,1e-06,2e-06,0,-1e-06,0,-1e-06,0,-2e-06,0,-2e-06,-2e-06,-3e-06,0,0,3e-06,0,0,1e-06,0,0,-1e-06,0,0,0,0,0,4e-06,1e-06,-1e-06,0,-1e-06,-1e-06,5e-06,-1e-06,-2e-06,0,0,0,-2e-06,1e-06,0,0,0,0,1e-06,0,0,-1e-06,0,-3e-06,1e-06,0,0,-2e-06,0,0,-1e-06,0,0,-1e-06,0,4e-06,0,-5e-06,5e-06,4e-06,0,1e-06,0,0,1e-06,1e-06,3.9e-05,-2e-06,-6.4e-05,-1.2e-05,-2e-06,6e-06,-2.1e-05,1.3e-05,0,-7.8e-05,1.2e-05,-3.5e-05,-1e-06,2e-06,-1e-06,-1e-06,1.6e-05,-2e-06,-7e-06,-4e-06,-1e-06,0,0,-1e-06,-5e-06,1e-06,-2e-06,0,0,1e-06,0,1.6e-05,-2.2e-05,-2e-05,0,7e-06,-9e-06,-1e-06,-5e-06
0,-1e-06,-1e-06,0,0,0,1e-06,1e-06,4e-06,1e-06,-2e-06,-2e-06,0,-2e-06,1e-06,2e-06,-1e-06,3e-06,0,0,2e-06,3e-06,4e-06,0,1e-06,1e-06,0,-1e-06,1e-06,0,1e-06,-1e-06,0,0,0,1e-06,-4e-06,-2e-06,0,0,0,0,0,-1e-06,-1e-06,0,-1e-06,0,2e-06,0,0,0,0,0,-1e-06,0,0,-3e-06,1e-06,-1e-06,-2e-06,1e-06,0,1e-06,0,0,0,0,0,0,-1e-06,-6e-06,0,-1e-06,-3e-06,1e-06,0,1e-06,0,0,0,0,-4.4e-05,-2e-06,-4.2e-05,7e-06,-5e-06,2e-06,-4e-05,3e-06,-1e-06,1e-05,4.4e-05,1.2e-05,-1e-06,1e-06,0,1e-06,-4.5e-05,4e-06,0,1e-06,2e-06,0,0,1e-06,3e-06,0,0,-1e-06,0,1e-06,-2e-06,-4.5e-05,-1.5e-05,2.6e-05,-2e-06,-4e-06,1e-06,0,-1e-06
