-0.000304,-0.000394,-0.000445,-0.00046,-0.00041,-0.000341,-0.00047,-0.000553,-0.000386,-0.000286,-0.00026,-0.00034,-0.000509,-0.000223,-0.00014,-0.000232,-0.000158,-0.000102,-0.000219,-0.000358,-0.00024,-0.000204,-0.000221,3.5e-05,4.6e-05,-3.6e-05,-0.000203,-0.000248
-0.000534,-0.000538,-0.000587,-0.000627,-0.000536,-0.000411,-0.000467,-0.00049,-0.00045,-0.000356,-0.000288,-0.000292,-0.000545,-0.000292,-0.000244,-0.00033,-0.00022,-7.1e-05,-0.000212,-0.000434,-0.000261,-0.000254,-0.000407,-4.6e-05,5.7e-05,-0.000253,-0.000478,-0.000321
-0.000419,-0.000382,-0.00039,-0.000259,-0.000261,-0.000174,-5.4e-05,-4.7e-05,-0.000263,-0.000232,-0.000108,1.8e-05,-8.8e-05,-0.00017,-0.000223,-0.000216,-0.00018,-0.000115,-0.000141,-0.000178,-0.000151,-9e-06,-0.000123,-0.000139,-9.4e-05,-0.000329,-0.000413,-0.000293
-2.8e-05,-2e-06,0.000141,0.000264,0.000152,0.000204,0.000323,0.000342,0.000151,2e-04,0.000354,0.000498,0.000458,4.8e-05,-6.2e-05,5e-05,3.8e-05,-2.4e-05,4.9e-05,0.000208,0.000207,0.000442,0.000349,9.8e-05,0.000142,-0.000104,-8.6e-05,0.000109
0.000228,0.00028,0.000475,0.00032,0.000191,0.000226,0.000139,0.000109,0.000212,0.000314,0.000419,0.000426,0.000367,2.3e-05,-3.9e-05,0.000118,0.000126,5.8e-05,0.000134,0.000228,0.000278,0.000437,0.000311,0.000146,0.000278,2e-05,3.9e-05,0.000295
9.7e-05,0.00012,8.9e-05,-0.00015,-0.000164,-0.00011,-0.000358,-0.000502,-0.000293,-0.000235,-0.000164,-0.000289,-0.000404,-0.000284,-0.000238,-0.000138,-4.9e-05,-6.8e-05,-0.000128,-0.000233,-0.000257,-0.000289,-0.000325,-0.000246,-3.6e-05,-2e-04,-0.000191,-0.000103
-6e-05,1.7e-05,-0.000173,-3e-04,-0.000173,-0.00017,-0.000331,-0.000416,-0.000371,-0.000478,-0.000374,-0.000275,-0.000558,-0.000389,-0.000296,-0.000192,-7e-05,-4.9e-05,-0.00017,-0.000356,-0.000344,-0.000496,-0.000514,-0.000271,-0.000135,-0.000224,-0.000217,-0.00023
-0.000102,8.9e-05,-7e-05,-6.4e-05,0.000105,6.9e-05,0.000132,0.000187,4.8e-05,-0.000175,-0.000159,0.000118,-1.5e-05,-0.000112,-0.00011,1.9e-05,-3e-06,3.6e-05,4.8e-05,3e-06,9e-05,1.1e-05,-5.8e-05,-3.5e-05,-0.000109,-6.4e-05,3.8e-05,-8.6e-05
-7.4e-05,-3.6e-05,-1e-04,4.9e-05,0.000126,0.000143,0.00035,0.000394,0.000235,4.5e-05,-9e-05,-2.3e-05,0.000288,9.1e-05,1.9e-05,3.6e-05,-0.000106,-5.4e-05,7.1e-05,0.000184,0.000172,0.000228,0.000271,1.1e-05,-0.000155,-1e-06,0.000172,-0.000109
3.3e-05,-0.000163,-6e-05,3.5e-05,3e-06,3.6e-05,0.000114,8.3e-05,0.000239,0.000253,3.6e-05,-0.000203,0.000186,7.2e-05,0.000115,1.3e-05,-0.000113,-5.3e-05,4.4e-05,0.000118,0.000104,0.000125,0.00024,5.9e-05,-9.1e-05,2.5e-05,0.000185,2.3e-05
6e-05,-0.000128,6.2e-05,-5.1e-05,-0.000137,-0.000135,-0.000191,-0.000176,0.000154,0.000289,2e-05,-0.000339,-0.000132,6e-06,0.000129,2e-05,5e-06,2.2e-05,1.2e-05,-5.5e-05,-2.2e-05,-0.000253,-0.000161,-1.4e-05,-0.00013,-2.7e-05,0.000113,0.000113
7e-05,-2e-05,7.2e-05,-1.4e-05,-0.000142,-0.000204,-0.000172,-9e-05,-6.3e-05,-6e-05,-0.000202,-0.000306,-0.000251,8.7e-05,0.000146,1.9e-05,8.4e-05,1.2e-05,-0.000111,-0.000159,-0.000239,-0.000591,-0.000486,-0.000214,-0.000266,-4.3e-05,0,-5.9e-05
5e-05,5.7e-05,9.9e-05,0.000109,5e-06,-6.5e-05,3.6e-05,0.000103,-7.4e-05,-0.000267,-0.000203,4e-05,1.5e-05,0.00015,0.000173,4.3e-05,6.9e-05,4.4e-05,-9.7e-05,1e-06,-0.000118,-0.00042,-3e-04,-0.000149,-0.000164,6.9e-05,-4.3e-05,-0.000115
-5e-05,4.4e-05,3.9e-05,7.5e-05,9.2e-05,0.000114,0.000164,0.000124,-3e-06,-0.000165,-0.000105,-2.1e-05,8.3e-05,0.000107,6.7e-05,-9.2e-05,-0.000154,-3.8e-05,1.2e-05,0.000155,2e-05,-0.000163,-7.2e-05,-6.9e-05,-5.8e-05,0.000125,1.9e-05,-9.9e-05
-0.000115,-1.5e-05,-0.000212,-0.000102,2e-05,6.3e-05,3.4e-05,-5e-05,-0.000146,-8.3e-05,-0.000116,-0.000466,-0.00019,2.5e-05,-0.000119,-0.000362,-0.000374,-0.000175,-1.5e-05,-2.6e-05,-0.000269,-0.000251,-8.6e-05,-0.00019,-0.000164,-4e-06,1.7e-05,-0.000125
-5.7e-05,3e-06,-0.000195,-0.000117,5e-05,1.5e-05,-5.6e-05,-0.000102,-0.000108,7.7e-05,2.3e-05,-0.000363,-0.000257,2e-06,-0.000128,-0.000351,-0.000242,-4.4e-05,5.5e-05,-0.000133,-0.000375,-0.000291,-6.6e-05,-0.000113,-0.000138,-0.000114,-4.1e-05,5e-05
-6.1e-05,-6.2e-05,-2.4e-05,-7.6e-05,4.5e-05,-4.3e-05,-9.3e-05,1e-06,2.8e-05,4.4e-05,5e-06,-0.000102,-0.000261,-6e-05,-5.2e-05,-8.5e-05,-2.9e-05,4.9e-05,8e-05,5e-06,-0.000126,-0.000224,-0.000156,-0.000103,-0.00019,-0.000187,-9.4e-05,6.3e-05
-6.6e-05,-0.000186,3e-05,-8e-06,-4.9e-05,-9.7e-05,-5.2e-05,8.3e-05,4.6e-05,-0.000227,-0.000186,-3.1e-05,-0.000196,-0.000108,-2.9e-05,0.000115,3.6e-05,-9e-06,-7e-06,9.3e-05,1.2e-05,-0.000184,-0.00022,-0.000213,-0.000355,-0.000243,-0.000181,-0.000144
7.5e-05,-0.000116,6.7e-05,0.000113,-3.5e-05,-4e-06,2.3e-05,4.7e-05,9e-05,-0.000178,-0.000114,5e-05,6.5e-05,-5.3e-05,2.1e-05,0.000224,7.1e-05,0,1.6e-05,0.000144,0.000131,1.1e-05,-2.7e-05,-0.000139,-0.00022,-0.000128,-0.000187,-9.6e-05
