1e-05,1.3e-05,1.6e-05,3e-06,5e-06,1.6e-05,2.5e-05,2.5e-05,1e-05,8e-06,2.6e-05,2e-06,2.2e-05,1e-06,1e-05,8e-06,1.8e-05,5e-05,8e-06,6.1e-05,2e-05,2.2e-05,4e-05,2.2e-05,1.8e-05,1e-06,0,2.9e-05,3.8e-05,1.9e-05,2.5e-05,4.6e-05,9e-06,4.3e-05,1.7e-05,2.5e-05,8e-06,1.8e-05,2.6e-05,3.4e-05,1.9e-05,3e-06,3.2e-05,1.3e-05,1e-05,2.1e-05,5e-06,6e-06,3.5e-05,3.5e-05,7e-06,2.3e-05,7e-06,1.7e-05,9e-06,1.1e-05,6e-06,1.6e-05,1.3e-05,5e-06,1.7e-05,6e-06,1.5e-05,9e-06,2.1e-05,1.9e-05,1e-06,1.7e-05,2.1e-05,1.1e-05,1.9e-05,1e-05,1.8e-05,1.6e-05,2e-05,1.1e-05,1.6e-05,3e-06,1e-06,2e-05,1.5e-05,5e-06,1.5e-05,1e-05,2.1e-05,5e-06,9e-06,1e-06,1.3e-05,2e-06,1.2e-05,1.4e-05,0,3.4e-05,3e-06,1e-05,7e-06,5e-06,2e-06,3e-06,1.7e-05,8e-06,2e-06,3e-06,9e-06,3e-06,3e-06,2.4e-05,9e-06,6e-06,4e-06,5e-06,1.4e-05,6e-06,1.6e-05,0,1.2e-05,2e-06,3e-06,1.6e-05,2.5e-05
3.4e-05,3.1e-05,3.7e-05,1.1e-05,1.5e-05,2.1e-05,3.7e-05,6.8e-05,9e-06,4.7e-05,7.7e-05,3.3e-05,2.2e-05,5e-05,6.5e-05,3.1e-05,1.3e-05,0.000119,2.3e-05,0.000137,4.3e-05,4.9e-05,8.4e-05,8.5e-05,4.2e-05,5.6e-05,3e-05,4.5e-05,0.000127,4.2e-05,5.3e-05,6.6e-05,2.6e-05,8.7e-05,3.2e-05,5.8e-05,1.9e-05,1.8e-05,5.4e-05,6e-05,5e-05,2.4e-05,3.1e-05,1.5e-05,2.9e-05,5.9e-05,5e-06,9e-06,0.000101,4.9e-05,6e-06,4.7e-05,4.6e-05,4.3e-05,1.8e-05,1.2e-05,2.3e-05,1.3e-05,2.6e-05,3.1e-05,2.3e-05,1.2e-05,4e-05,1e-06,4.9e-05,3.2e-05,1.7e-05,4e-05,2e-05,2.1e-05,3.1e-05,4e-05,7.5e-05,1.6e-05,3.7e-05,1.2e-05,7e-06,1.9e-05,2.7e-05,8.2e-05,5.7e-05,6e-06,2.1e-05,4.9e-05,5.9e-05,1.3e-05,3.7e-05,3.8e-05,6e-06,2e-05,2.3e-05,2.4e-05,2.7e-05,8.4e-05,2.3e-05,1.8e-05,3e-05,2.5e-05,1.8e-05,3.1e-05,6.8e-05,2.1e-05,2.1e-05,2.2e-05,2e-05,4e-06,8e-06,4.9e-05,2.9e-05,1.2e-05,1.2e-05,1.5e-05,2.9e-05,1.9e-05,3.1e-05,3.6e-05,6e-05,7e-06,9e-06,4.1e-05,5.6e-05
5.6e-05,1.9e-05,7.7e-05,3.4e-05,3.7e-05,5.5e-05,5.1e-05,3.8e-05,5.3e-05,5.9e-05,8e-05,2.5e-05,7.8e-05,4.6e-05,5.6e-05,2.9e-05,3e-05,0.000118,6e-05,0.000106,3.1e-05,5.1e-05,8.2e-05,9e-05,1.4e-05,5.1e-05,2.8e-05,0.000136,9e-05,7.7e-05,5.5e-05,8.8e-05,7e-06,0.000128,4.3e-05,0.000113,4.6e-05,4.7e-05,5.5e-05,8.7e-05,7.8e-05,6.8e-05,5.3e-05,1.7e-05,5.8e-05,4.4e-05,4.4e-05,3.4e-05,0.000118,0.00011,4.2e-05,5e-05,8.4e-05,7e-05,1e-05,3.1e-05,2.6e-05,4.8e-05,9e-06,3.5e-05,4e-05,2e-05,4.9e-05,3.9e-05,6.3e-05,5e-05,1.3e-05,2.2e-05,5e-06,3.7e-05,6.6e-05,6.8e-05,2.4e-05,4.7e-05,5.9e-05,3.4e-05,6.8e-05,6.4e-05,2.4e-05,0.000104,5.4e-05,2e-05,2e-05,5.9e-05,5.3e-05,3.8e-05,4.4e-05,5.6e-05,4.6e-05,3.4e-05,4e-06,5.9e-05,2.3e-05,8.5e-05,5.4e-05,7.1e-05,5.4e-05,4.4e-05,5.4e-05,2.6e-05,5.4e-05,1.5e-05,1.8e-05,3.3e-05,4.2e-05,1.1e-05,1.4e-05,6e-05,3.9e-05,3.3e-05,2.9e-05,4e-06,4.4e-05,6.3e-05,7.3e-05,6.5e-05,7e-06,3.8e-05,3e-05,6.1e-05,4.3e-05
6.3e-05,4.2e-05,7.2e-05,1.2e-05,3.8e-05,7.4e-05,8.4e-05,4.9e-05,3.8e-05,0.000106,0.000113,3.8e-05,8.5e-05,0.000117,0.000113,5.2e-05,4.4e-05,0.000108,5.7e-05,0.000151,0.00012,3e-05,8.5e-05,5.4e-05,5.2e-05,3.1e-05,7.6e-05,0.000111,0.000102,6.9e-05,0.00011,7.2e-05,6.3e-05,0.000143,0.000104,0.000107,9e-05,0.000142,0.000146,0.000154,5.4e-05,4.4e-05,0.000112,0.000102,5.9e-05,5.2e-05,5.1e-05,2.4e-05,8.9e-05,0.000107,1.7e-05,7.9e-05,8e-05,9.9e-05,8.7e-05,7e-05,2.5e-05,5.4e-05,3.1e-05,6e-05,2.1e-05,4.5e-05,8.1e-05,5.9e-05,7e-05,7.2e-05,7.3e-05,5.3e-05,7.4e-05,4.2e-05,3.6e-05,2e-06,2.4e-05,3.1e-05,3.2e-05,5.3e-05,5e-05,5.3e-05,6.3e-05,0.000137,0.000104,9.7e-05,5.3e-05,3.4e-05,4.1e-05,5e-05,0.000125,8.7e-05,2.3e-05,1e-05,3.1e-05,8.6e-05,7.9e-05,9.8e-05,4e-06,4.5e-05,7e-05,3.6e-05,3.8e-05,9e-06,4e-05,7.5e-05,5.1e-05,5.8e-05,2.4e-05,7e-05,5.2e-05,0.000121,6.8e-05,8.9e-05,1e-05,1.5e-05,4.1e-05,5e-05,8.5e-05,5.8e-05,4.6e-05,5e-05,9e-05,6.1e-05,2.4e-05
8.9e-05,5.8e-05,5.3e-05,0.000145,0.000127,8.9e-05,0.000124,0.000139,3.4e-05,6.9e-05,0.000181,0.000127,6.3e-05,5.2e-05,7.2e-05,6.9e-05,9.5e-05,9.6e-05,7e-06,0.000217,0.000195,0.000164,0.000112,9.2e-05,6.6e-05,7.2e-05,0.000137,9.1e-05,0.000167,7.4e-05,0.000183,7.1e-05,6.2e-05,8.3e-05,6.1e-05,0.000117,0.000119,4.2e-05,0.000132,0.000195,1e-04,0.000141,7.1e-05,7.4e-05,5.7e-05,3.6e-05,7.4e-05,6.4e-05,7.6e-05,0.000208,0.000115,0.000108,5.4e-05,8.9e-05,3.4e-05,1.8e-05,5.9e-05,6.2e-05,5.1e-05,8.3e-05,6.6e-05,0.000115,0.000102,7.6e-05,0.00012,0.00012,7.1e-05,5.3e-05,0.000134,7.1e-05,5.8e-05,5.5e-05,2e-05,2.8e-05,8.8e-05,5.5e-05,2.9e-05,4.7e-05,1.8e-05,6.3e-05,6.9e-05,6.9e-05,3.5e-05,0.00012,5e-05,4.4e-05,7.9e-05,5.6e-05,2.8e-05,8e-06,5.4e-05,4.4e-05,2.7e-05,7.6e-05,8.2e-05,1.3e-05,4.3e-05,4.4e-05,2.6e-05,4.7e-05,7.7e-05,0.000109,8e-05,9.5e-05,6.5e-05,9.9e-05,5.2e-05,0.000164,9.8e-05,0.000108,0.000161,6.5e-05,7.1e-05,0.000129,8.2e-05,7.3e-05,3.5e-05,3.9e-05,9.5e-05,5e-05,6.2e-05
8.1e-05,1.1e-05,7.4e-05,0.000148,5e-05,0.000135,0.000167,2.9e-05,4.6e-05,9.1e-05,9.1e-05,0.000127,0.000175,4.8e-05,0.000172,6.7e-05,0.000171,0.000156,4.7e-05,0.000166,9.9e-05,5.5e-05,1e-04,3e-05,7.4e-05,9.7e-05,8.9e-05,3e-04,0.000163,0.000195,0.000115,0.000227,0.000123,8.4e-05,0.000154,0.000221,6.1e-05,9e-05,0.000207,0.000255,0.000156,9.6e-05,0.000124,0.000195,0.000157,0.000177,9e-05,9.3e-05,7.6e-05,0.000189,0.000154,7e-05,8e-05,0.000193,0.000135,4.2e-05,8.7e-05,9e-05,0.000103,0.000151,4.7e-05,0.000186,6.1e-05,6.9e-05,0.000146,0.000174,8.8e-05,0.000109,0.000127,7.9e-05,2.5e-05,0.000102,6.8e-05,1.7e-05,0.000114,0.000145,0.000108,2.3e-05,4.8e-05,6.5e-05,0.000183,5.7e-05,4e-05,0.000179,0.000169,4.5e-05,6.9e-05,0.000104,2.6e-05,7.3e-05,2.9e-05,8.2e-05,0.000139,0.000142,0.00012,0.000127,8.1e-05,3.5e-05,3.9e-05,0.000116,2.2e-05,3.5e-05,5.2e-05,0.000114,7.9e-05,2.8e-05,4e-06,0.000154,0.000133,6.8e-05,0.000121,0.000118,0.000117,0.00024,9.6e-05,7e-05,3.7e-05,7e-05,5.8e-05,0.00011,9.1e-05
0.000393,0.000239,9.1e-05,0.000186,0.000169,0.00026,0.000387,0.000446,0.000319,0.000225,8.9e-05,6.6e-05,0.000351,0.000257,0.00037,0.000294,0.000388,0.000183,0.000263,0.000273,0.000212,0.000191,0.00017,7.2e-05,0.000187,0.000202,0.000263,0.000575,0.00035,0.000266,0.000391,0.000523,0.000575,0.000284,0.00024,6.9e-05,0.000238,0.000169,0.000386,0.000558,0.000586,0.000472,0.000264,0.000314,0.000142,0.000157,0.000337,0.000132,0.000172,7.2e-05,7.6e-05,6.4e-05,9.7e-05,0.00016,0.000254,0.000179,8.3e-05,0.000154,0.000246,0.000125,0.000141,0.000195,0.00023,0.000165,0.000249,8.3e-05,0.000124,0.000166,0.000107,0.000269,0.000146,8.8e-05,0.000105,4.6e-05,4e-05,9.4e-05,0.000106,0.000108,5.5e-05,0.000101,0.000319,0.000214,0.000181,0.000147,0.000263,0.000266,1.7e-05,5.3e-05,0.00011,0.000138,4.6e-05,7.9e-05,0.000201,0.000408,0.000205,0.000131,0.000241,0.000222,8.7e-05,9.4e-05,0.000116,0.000113,4.2e-05,8e-05,8.3e-05,0.000113,9.2e-05,5.1e-05,0.000177,0.000163,0.000113,0.000134,0.000223,5.2e-05,0.000117,0.00019,0.000155,0.000121,0.000166,7.2e-05,6.1e-05
1.8e-05,7e-05,0.00018,0.000159,0.000184,0.00032,0.000372,0.000339,2.2e-05,0.000197,6.3e-05,6.7e-05,0.000388,0.000165,0.000266,0.000205,0.000162,0.000233,0.000426,5.7e-05,0.000202,0.000152,0.000223,0.000333,0.000438,0.00017,0.000267,0.000308,0.000308,0.000133,0.00021,0.000198,0.000509,0.000519,0.000174,0.00023,0.000442,0.000471,0.000133,6.2e-05,0.000328,1.7e-05,6.3e-05,6.4e-05,0.000381,0.000217,0.000329,0.00024,0.000327,0.000137,0.000144,5.6e-05,0.000106,0.000292,0.000136,3.9e-05,0.000112,8.5e-05,0.000189,0.000214,0.000174,6.6e-05,0.000121,0.000238,0.000107,0.000182,0.000239,0.000237,0.000176,0.000382,0.000247,0.00026,8.6e-05,0.000151,3.9e-05,0.000159,0.000109,5.2e-05,5e-05,0.00015,0.000155,0.000181,0.000113,8.5e-05,0.000184,0.000214,0.000306,0.000123,9.6e-05,0.000303,0.000206,0.000171,5.2e-05,0.000226,0.000455,0.000273,0.000301,6.3e-05,6.9e-05,6.8e-05,3.7e-05,0.000249,0.000231,0.000215,5.9e-05,0.000102,8.6e-05,9.5e-05,0.000188,0.000138,0.000148,6.7e-05,0.000156,0.000169,0.000177,0.000159,0.000217,2.5e-05,0.000188,0.000104,0.000158
0.000326,0.00021,0.000136,0.000143,0.000149,0.000139,0.000104,0.000367,0.000406,9.5e-05,0.000126,0.000198,0.000152,0.000189,0.000208,0.000376,0.000301,4.5e-05,0.000542,0.000593,0.000523,0.000352,0.000578,0.000601,0.000314,0.000273,0.000419,0.00039,0.000539,0.000454,0.000274,0.000152,0.000437,0.000297,0.000485,0.000154,0.000351,0.000587,0.000489,0.000462,0.000375,0.000294,7.1e-05,5.7e-05,0.000357,0.000122,0.000347,0.000238,0.000172,0.000418,0.000434,0.000245,0.000278,8.8e-05,7e-05,0.000121,6.2e-05,0.000187,0.000119,0.000147,0.000101,0.000291,0.000123,0.000262,0.000224,0.000109,0.000162,0.000337,0.000475,0.000511,0.000234,0.000411,0.000332,0.000298,0.00028,0.000276,0.000191,8.6e-05,0.000143,0.000213,0.000237,0.000126,7.4e-05,9.5e-05,6.3e-05,0.00012,0.000195,0.000225,0.000114,0.000222,0.000133,9.2e-05,6.6e-05,4.7e-05,0.000275,0.000164,0.000221,0.000316,0.000173,9.5e-05,0.000154,0.000332,0.000203,3.1e-05,0.000173,0.000107,0.000197,3.2e-05,0.000116,0.000159,1.9e-05,2.9e-05,8.6e-05,8.6e-05,8.5e-05,0.000161,6.6e-05,0.000218,0.000207,0.000408,0.000285
0.00016,0.000184,0.000245,0.000123,0.000209,5.6e-05,0.000254,8.7e-05,0.000401,0.000238,0.000105,0.000329,0.000165,0.000123,0.000196,0.000432,0.000226,0.000218,0.000498,9.4e-05,0.000418,0.00015,0.000497,8.9e-05,5.1e-05,0.000244,0.000168,0.000164,0.000477,0.000247,0.000107,0.000262,0.000196,0.000471,0.000625,0.000455,0.000487,0.000319,0.000217,0.000445,0.000215,0.000179,0.000274,0.00034,0.000438,0.000263,0.000262,0.000168,0.000103,0.000248,2.9e-05,2.4e-05,0.00021,0.000252,0.00013,0.000207,0.000223,5.5e-05,0.000197,0.000237,0.000123,0.000336,0.000185,0.000143,0.000287,9.4e-05,0.000122,0.000302,0.000148,0.000109,0.000155,0.000352,0.000213,0.000206,0.000113,0.000196,0.000255,0.000154,0.000132,0.000106,2e-05,7.1e-05,7.4e-05,0.000209,0.000221,0.000116,0.000114,0.000278,2e-04,0.000112,9.1e-05,7.4e-05,6.8e-05,0.000139,0.000155,0.000118,0.000125,7.1e-05,9e-06,9.4e-05,0.00023,0.000183,1e-04,7.1e-05,7.4e-05,9.6e-05,0.000163,0.000157,0.000179,0.000188,0.000161,9.2e-05,3.2e-05,0.000131,0.000215,0.000131,0.000112,0.000226,0.000256,0.000414,0.000171
0.000155,9.2e-05,0.000134,0.00017,0.000123,0.000163,0.000358,0.000339,0.000279,0.000213,0.000184,0.00021,0.000254,0.00023,0.000188,0.000171,0.000142,0.000169,0.000201,0.000294,0.000236,0.000192,0.000248,0.00034,0.000244,5.8e-05,0.000167,0.000288,4e-05,7.7e-05,0.000113,0.000155,9.5e-05,0.000196,0.000253,0.000215,0.000121,0.000179,0.000299,0.000146,0.000105,9.6e-05,0.000251,0.000246,8.7e-05,6.4e-05,0.000142,0.000115,0.000165,1.9e-05,3.3e-05,6e-05,0.000133,0.000132,9.5e-05,0.000187,9.8e-05,0.000137,0.000137,8e-05,0.000132,0.000204,0.000127,6.3e-05,0.000151,0.000181,0.000159,0.000195,0.00021,8.1e-05,0.000149,5.8e-05,0.000117,3.7e-05,8.4e-05,0.000157,6.1e-05,6e-06,9.8e-05,7.4e-05,7.2e-05,0.000134,0.000101,0.000108,6.6e-05,2.8e-05,0.00012,0.000111,7e-05,0.000124,9.6e-05,1e-05,4.5e-05,0.000185,0.000107,9.7e-05,4.7e-05,1.6e-05,3.5e-05,8.4e-05,0.000102,3.5e-05,7.2e-05,6.3e-05,7.2e-05,9e-06,9.6e-05,1e-05,0.000134,5.5e-05,4.6e-05,4.9e-05,0.000135,0.000187,0.000114,6.2e-05,8.3e-05,6e-05,0.000105,0.000165,7.6e-05
5.8e-05,0.000123,6.5e-05,7.4e-05,3.1e-05,6.3e-05,0.000123,0.000157,7.5e-05,0.000143,9.4e-05,9.1e-05,0.00013,8e-06,7e-05,0.000133,0.000121,3.2e-05,0.000106,9e-05,4.9e-05,5.2e-05,7.3e-05,8.9e-05,8.4e-05,6.8e-05,7.1e-05,0.000134,7.9e-05,4.4e-05,0.000147,7.6e-05,8.3e-05,0.000161,0.000111,7.1e-05,0.000124,0.000119,8.4e-05,0.000124,4.4e-05,3.9e-05,9.9e-05,0.000125,1e-05,3.5e-05,5.5e-05,3.8e-05,4.9e-05,4.8e-05,5e-05,6.1e-05,4.9e-05,4.4e-05,5.2e-05,4.9e-05,1.8e-05,5.6e-05,2.1e-05,4.4e-05,8e-05,2.6e-05,3.3e-05,6.2e-05,6.5e-05,2.8e-05,8.3e-05,2.2e-05,6.8e-05,2.3e-05,4.1e-05,5.6e-05,6.2e-05,5.4e-05,3.8e-05,4.8e-05,3.4e-05,2.4e-05,4.7e-05,6.3e-05,5.1e-05,6.6e-05,3.7e-05,7.5e-05,5.3e-05,4.6e-05,6e-05,5e-05,2.1e-05,4.8e-05,8e-06,2e-06,6.3e-05,6.8e-05,6.6e-05,8.3e-05,8.7e-05,6e-05,2.7e-05,2.1e-05,8.8e-05,4e-05,3.6e-05,1.3e-05,2.2e-05,2.9e-05,4.2e-05,5.9e-05,5.6e-05,9e-05,5.8e-05,6.3e-05,5.5e-05,7.2e-05,9e-06,2.3e-05,4.2e-05,6.7e-05,0.000104,4e-05,3.9e-05
4.1e-05,5.3e-05,5.8e-05,0.000122,3.6e-05,4.4e-05,0.000135,0.000107,9.9e-05,1.8e-05,6.9e-05,1.4e-05,7.6e-05,2e-05,0.000123,8.8e-05,5.1e-05,2.4e-05,5.4e-05,9.7e-05,4.7e-05,4.8e-05,1.5e-05,2.5e-05,7.3e-05,4e-05,1.3e-05,8.6e-05,8.8e-05,5.8e-05,1e-04,7.3e-05,2.8e-05,0.00012,4.7e-05,4.2e-05,0.000104,4.8e-05,0.000101,0.000155,1.9e-05,4.2e-05,2e-05,0.000126,4.5e-05,3.6e-05,5.6e-05,1.8e-05,5.8e-05,3.6e-05,4.4e-05,4.6e-05,5.3e-05,2.1e-05,4.7e-05,7e-06,2.1e-05,6.3e-05,4.3e-05,3.4e-05,6.5e-05,5.2e-05,5.3e-05,4.6e-05,1.5e-05,6.4e-05,6.7e-05,7.2e-05,4.3e-05,1.7e-05,6.7e-05,7.2e-05,5.1e-05,2.9e-05,2.5e-05,6.9e-05,1.5e-05,2.5e-05,3.7e-05,6.1e-05,1.4e-05,8e-06,2.9e-05,8.1e-05,4.3e-05,3.9e-05,5.8e-05,1.7e-05,1.6e-05,3.1e-05,6.3e-05,2.5e-05,4.4e-05,6.6e-05,4.3e-05,6.5e-05,7.4e-05,3.1e-05,1.1e-05,2.9e-05,6.9e-05,4.8e-05,3.2e-05,3.1e-05,2.1e-05,2.4e-05,2e-05,3.8e-05,4.5e-05,9.1e-05,5e-05,4.9e-05,5.5e-05,5.6e-05,4.2e-05,3.4e-05,3.6e-05,3.9e-05,5e-05,2.4e-05,5e-06
4.7e-05,4.5e-05,8.9e-05,0.000114,0.000226,7e-05,0.000216,0.000217,7.5e-05,0.000114,6.4e-05,4e-06,3.6e-05,6.9e-05,2e-04,0.000257,0.000202,7.5e-05,7.1e-05,6.2e-05,0.000147,0.00011,5.7e-05,5.8e-05,0.00014,9.1e-05,3.3e-05,0.000139,0.000108,6e-05,0.000172,0.000138,3.6e-05,7.4e-05,0.000224,0.000185,0.000105,3e-05,0.00013,0.000226,0.000114,9.6e-05,6e-05,0.00013,8.3e-05,7.7e-05,0.000103,7.3e-05,0.000134,0.00012,7.4e-05,9e-05,9e-05,3.6e-05,6.2e-05,9e-05,5e-05,7.3e-05,0.000141,0.000137,0.000121,9e-06,6.8e-05,9.9e-05,4.3e-05,0.000115,9.6e-05,2.2e-05,4.2e-05,2.4e-05,4.6e-05,7.9e-05,9.7e-05,7.2e-05,4.8e-05,3.8e-05,5.9e-05,2.7e-05,3.5e-05,8.6e-05,4e-05,7.3e-05,3.8e-05,5.6e-05,6.8e-05,5.4e-05,0.000127,0.000116,5.9e-05,6.1e-05,5.9e-05,6.6e-05,5e-05,0.000112,7.4e-05,7.6e-05,6.4e-05,0.000103,4.7e-05,2.3e-05,6.2e-05,0.000106,0.000119,8.8e-05,7.9e-05,5.6e-05,2.9e-05,4.7e-05,1.2e-05,0.000114,0.000157,0.000102,2.1e-05,4.1e-05,5.1e-05,6.3e-05,4.1e-05,1.7e-05,6.1e-05,3.4e-05,2.3e-05
8.6e-05,9e-05,7.3e-05,9.1e-05,0.000183,0.000203,0.000109,0.000133,0.000111,0.00011,0.000179,8.9e-05,2e-05,4.4e-05,0.000201,0.000273,0.000286,0.000158,0.000213,0.000167,3.8e-05,6.8e-05,0.000265,0.000204,6.6e-05,2.9e-05,0.000158,0.000222,5.1e-05,2.2e-05,9.5e-05,9.1e-05,6.2e-05,7.6e-05,0.000214,3.4e-05,0.000133,0.000161,0.000215,0.000168,0.000113,0.000101,5.1e-05,0.000107,0.000146,3e-06,6.9e-05,0.000151,5.8e-05,0.00011,7.1e-05,6.4e-05,0.000146,0.000123,2.9e-05,8.6e-05,4.2e-05,7.1e-05,0.000105,5.8e-05,2.8e-05,5e-06,3.4e-05,5.3e-05,8.8e-05,6.1e-05,9e-06,9e-06,4.9e-05,2.7e-05,1.8e-05,6e-06,5.1e-05,2.9e-05,8.9e-05,0.000123,0.000119,3.2e-05,4.2e-05,7.8e-05,0.000107,0.000121,7.1e-05,3.8e-05,4.8e-05,1.4e-05,0.000116,2.9e-05,1.2e-05,6.1e-05,0.000103,3.4e-05,6.6e-05,6.4e-05,2.6e-05,8e-06,7.4e-05,0.000113,5.7e-05,6.2e-05,7.3e-05,5.9e-05,3.3e-05,4.1e-05,6.7e-05,4.2e-05,7.1e-05,2.9e-05,2.8e-05,7.7e-05,0.000164,7.5e-05,3e-05,6e-05,2.9e-05,5.2e-05,8.2e-05,6.5e-05,4.3e-05,2e-06,3.6e-05
0.000285,0.000306,0.000189,0.000111,0.000191,0.000166,0.000151,0.00021,0.000273,6.6e-05,0.000143,0.000132,9.8e-05,0.000147,6.2e-05,0.00013,0.000145,9.2e-05,0.000294,0.000207,0.000129,7.8e-05,0.000177,0.000109,0.000132,0.000172,0.00024,4.3e-05,0.000253,0.000168,7.9e-05,5.8e-05,8e-05,5.1e-05,0.000125,0.000108,0.000184,0.000188,9.7e-05,6.9e-05,8.2e-05,0.00019,0.000105,5.1e-05,4.3e-05,9.3e-05,0.000127,4.1e-05,9.8e-05,2.8e-05,2.6e-05,5.6e-05,2.9e-05,7.4e-05,0.000116,3.4e-05,5e-06,7.6e-05,0.000106,0.00013,0.000125,4.1e-05,2.7e-05,1.5e-05,4.2e-05,5.5e-05,1.9e-05,1.5e-05,7e-05,1.5e-05,4.7e-05,5.3e-05,2.6e-05,7.1e-05,7.7e-05,0.00017,6.2e-05,4.5e-05,5.3e-05,0.00012,1e-04,9.7e-05,6.5e-05,8.8e-05,9.4e-05,8e-06,0.000119,0.000136,7.7e-05,5.3e-05,6.7e-05,6.8e-05,4.1e-05,3.6e-05,2e-05,2.5e-05,0.000103,2.2e-05,3.5e-05,7.2e-05,5.5e-05,6e-05,2.1e-05,4e-06,1.3e-05,4.3e-05,0.000136,9.3e-05,8.7e-05,5.4e-05,4.3e-05,9e-05,3.6e-05,1.6e-05,4.3e-05,7.5e-05,9e-06,8e-05,5.2e-05,4.2e-05,2.1e-05
0.000194,0.000126,7.8e-05,0.000194,0.000117,0.000218,0.000228,0.000114,0.000249,0.000286,0.000159,3.7e-05,0.000111,7.2e-05,6.6e-05,9e-05,8.9e-05,2.6e-05,0.000289,0.000162,0.000149,0.000118,0.000233,0.000257,0.000144,0.000194,0.000138,0.000102,0.000238,0.000166,5.4e-05,2.5e-05,0.00011,8e-05,0.000179,8.2e-05,4.7e-05,6.6e-05,5.9e-05,0.000118,0.000182,0.000189,7.9e-05,5.3e-05,7.6e-05,6.7e-05,5.7e-05,0.000107,0.000105,0.000115,4.8e-05,5e-05,3.7e-05,9.1e-05,0.000105,0.000104,8.7e-05,8.9e-05,0.000104,9.7e-05,5.6e-05,0.000111,9.6e-05,8.9e-05,7.5e-05,3.8e-05,4.3e-05,3.9e-05,7.3e-05,0.000105,0.000104,5.5e-05,6.5e-05,7.6e-05,4.8e-05,0.000108,4.5e-05,1e-05,5.3e-05,3.7e-05,7.4e-05,0.000107,4.6e-05,6e-05,8.8e-05,9.1e-05,0.000147,9.4e-05,1e-05,8.5e-05,7.4e-05,0.000112,9.8e-05,7.8e-05,5.2e-05,0.000118,3.5e-05,1.8e-05,6.5e-05,1.6e-05,4.7e-05,3.9e-05,1e-05,3.2e-05,4.6e-05,9.1e-05,0.000125,0.000159,0.000117,0.000135,9.1e-05,7e-05,0.000159,8.3e-05,0.000124,0.000133,7.4e-05,0.000103,0.000136,0.000102,1.6e-05
6.9e-05,1e-04,7.2e-05,0.00011,7e-05,0.00023,7.1e-05,0.000109,7.6e-05,0.000128,3e-06,8.6e-05,8.7e-05,0.00012,0.000126,0.000117,7.5e-05,9.4e-05,0.000166,5.1e-05,6.9e-05,0.000139,0.000149,0.000131,7e-05,5.3e-05,6.4e-05,4.2e-05,0.000136,5.5e-05,3.7e-05,5.5e-05,6.6e-05,8.4e-05,0.000114,7.6e-05,2.5e-05,3.2e-05,5.7e-05,5.6e-05,0.000123,4.3e-05,3.5e-05,1.2e-05,5.9e-05,5.2e-05,3.1e-05,8.7e-05,5e-06,8.8e-05,6.4e-05,8e-06,6.4e-05,1e-04,1.6e-05,6e-05,4.1e-05,1.4e-05,3.8e-05,1.6e-05,2e-06,4.4e-05,2.3e-05,3.8e-05,4.7e-05,7.4e-05,3.9e-05,4.9e-05,3.4e-05,6.5e-05,4.8e-05,2.4e-05,4.7e-05,1.6e-05,6.2e-05,1.6e-05,5.3e-05,6.5e-05,4.1e-05,5.3e-05,4.4e-05,2.2e-05,3.6e-05,8e-06,3.5e-05,3e-05,7.5e-05,2.9e-05,3.9e-05,7.9e-05,5.4e-05,8.1e-05,0.00011,4.7e-05,3.5e-05,0.000114,2.6e-05,5e-06,6e-05,6e-06,4.2e-05,3.7e-05,7.4e-05,2.4e-05,6.3e-05,3.5e-05,5.9e-05,6.8e-05,5.1e-05,6.2e-05,7.9e-05,5.2e-05,0.000104,6e-05,6.4e-05,9.3e-05,4.5e-05,5.5e-05,6.6e-05,4.9e-05,4.4e-05
5.2e-05,0.000107,0.000171,4.2e-05,0.000131,0.000156,0.000116,6e-05,4.1e-05,7.9e-05,7.9e-05,3.1e-05,9.1e-05,4.8e-05,0.000137,4.2e-05,5.7e-05,0.000133,0.00014,0.00013,1.6e-05,4.9e-05,0.000137,1.6e-05,4.3e-05,7.8e-05,0.000105,2.6e-05,7.6e-05,6.3e-05,6.8e-05,9.9e-05,5.5e-05,6e-05,7e-05,5.3e-05,6.5e-05,7.8e-05,4.8e-05,4e-05,4.4e-05,3.2e-05,2.4e-05,6.4e-05,6.5e-05,0.000137,9.5e-05,4.4e-05,2.7e-05,6e-05,1.9e-05,3.8e-05,7.7e-05,0.000153,0.000124,1.8e-05,2.4e-05,3.4e-05,3.6e-05,3.4e-05,0.000102,2.2e-05,3.3e-05,8.5e-05,8.7e-05,9.9e-05,5.6e-05,4.2e-05,8.4e-05,6.2e-05,8.8e-05,3.1e-05,2.5e-05,2e-05,6.9e-05,1.6e-05,6.7e-05,5.4e-05,8.9e-05,4.5e-05,4.7e-05,1.2e-05,3.4e-05,5.8e-05,6.8e-05,2.7e-05,2.6e-05,6e-05,1.3e-05,8.5e-05,5.2e-05,7.8e-05,0.000132,5.7e-05,3.4e-05,0.000108,0.000132,5.9e-05,6.2e-05,7.4e-05,0.000101,4.4e-05,4.5e-05,7.2e-05,4.1e-05,4.2e-05,5.9e-05,0.000118,4.4e-05,3.7e-05,3.6e-05,4e-05,5.5e-05,3.1e-05,3.2e-05,7.6e-05,3.9e-05,7.3e-05,5.8e-05,3.7e-05,1.2e-05
8.3e-05,0.000165,0.000191,0.000193,0.000146,0.000206,0.00013,1e-05,6.7e-05,0.000101,1.3e-05,5.3e-05,0.00017,9.9e-05,5.3e-05,5.8e-05,6.5e-05,7.2e-05,0.000106,0.000102,8.8e-05,9.3e-05,7.4e-05,4.6e-05,6.6e-05,0.000105,0.000114,0.000108,4.1e-05,0.000131,8.9e-05,0.000157,0.000158,5.4e-05,8.1e-05,2.8e-05,6.9e-05,0.000144,0.000147,0.000126,5.7e-05,1.2e-05,5.4e-05,9.3e-05,3.8e-05,1e-04,4.6e-05,4.7e-05,6e-06,4.7e-05,3.6e-05,4.7e-05,0.000101,0.000105,2.2e-05,7.2e-05,6.6e-05,7.7e-05,5.6e-05,3.3e-05,0.000147,0.000141,6.6e-05,0.000128,8.7e-05,0.000135,5.2e-05,5e-05,6.8e-05,1.8e-05,6e-05,5.2e-05,3.2e-05,2.7e-05,8.7e-05,5.4e-05,5.8e-05,8.8e-05,3.1e-05,3.1e-05,5.4e-05,9.3e-05,6.1e-05,7.1e-05,3.3e-05,6.6e-05,8e-06,7.2e-05,6e-05,1.9e-05,2.9e-05,9.1e-05,0.000173,0.000133,1.4e-05,9.1e-05,0.000147,9.2e-05,6.4e-05,5.8e-05,4.1e-05,0.000112,0.000111,0.000104,3.2e-05,9e-06,5.2e-05,5.9e-05,8e-06,1.4e-05,7e-05,1.4e-05,3.5e-05,1.5e-05,3.6e-05,9.9e-05,4.8e-05,0.000102,0.000101,0.000101,5.8e-05
0.000157,0.000173,0.000126,8e-05,0.00022,6.5e-05,2.7e-05,2.6e-05,0.000165,0.000162,0.000117,8.8e-05,0.000119,4.3e-05,7.3e-05,0.000114,6.8e-05,0.000101,0.000155,0.000131,0.000105,9.5e-05,0.000152,0.000113,0.000128,6.8e-05,8e-05,7.2e-05,8.7e-05,0.000139,4.9e-05,0.000105,0.000145,0.000174,0.000173,7.4e-05,0.000162,9.4e-05,4.4e-05,2.1e-05,0.000138,9.4e-05,9.3e-05,0.000129,9.1e-05,0.000121,0.000118,5.9e-05,7.1e-05,5.4e-05,3.5e-05,7.3e-05,0.000126,5.4e-05,7.4e-05,7.9e-05,9.3e-05,9.6e-05,5.6e-05,7.5e-05,0.000127,9.9e-05,9.8e-05,8.5e-05,0.000103,8.2e-05,6.9e-05,8.6e-05,2.6e-05,5.6e-05,4e-05,2.8e-05,3.4e-05,1.9e-05,7.6e-05,2.6e-05,5.9e-05,6.8e-05,5.7e-05,1.7e-05,8.6e-05,2.6e-05,2.6e-05,9.2e-05,8.5e-05,8.7e-05,7.3e-05,4.5e-05,8.2e-05,3.4e-05,9e-06,3.3e-05,7.4e-05,2.3e-05,4.1e-05,4.1e-05,1.5e-05,4.6e-05,5.5e-05,5.3e-05,4.6e-05,7.3e-05,8.3e-05,4.8e-05,4.1e-05,3.2e-05,1.6e-05,1e-04,3.9e-05,3e-05,8.9e-05,0.000124,0.000115,8e-05,2.3e-05,5.3e-05,7.6e-05,0.000107,3.7e-05,9.2e-05,1e-04
0.000292,0.000228,0.000243,0.000201,0.000269,0.000152,0.00019,6.8e-05,0.000203,0.000148,8.1e-05,0.000141,0.000203,4.9e-05,6.1e-05,0.000138,0.000168,0.000125,0.000142,6.3e-05,3.5e-05,8.7e-05,0.000118,0.000148,8.5e-05,0.000102,4.7e-05,0.00011,3.1e-05,3.8e-05,6.5e-05,0.000102,3.8e-05,0.000131,0.000104,7.2e-05,0.000186,8.3e-05,4.7e-05,3.1e-05,0.000116,2.3e-05,8.6e-05,1e-04,0.000114,8.2e-05,6.2e-05,3.1e-05,6.1e-05,0.000122,6.9e-05,5.8e-05,0.000199,0.000117,0.000118,4.8e-05,8.2e-05,4.5e-05,7.1e-05,7.7e-05,2.9e-05,2.9e-05,4.3e-05,9.3e-05,3.9e-05,6.9e-05,4.3e-05,4.7e-05,5.9e-05,3.8e-05,7.6e-05,1.6e-05,6e-05,6.6e-05,9.6e-05,0.000106,5.6e-05,3.2e-05,8.9e-05,4e-05,9.1e-05,8.2e-05,6e-05,5.6e-05,2e-05,5.8e-05,4.3e-05,5.8e-05,0.000112,0.000126,7.9e-05,4.3e-05,7e-05,8.5e-05,7.1e-05,9e-06,4.9e-05,3.8e-05,5.7e-05,2.7e-05,5.6e-05,6.3e-05,0.000151,8.6e-05,7.2e-05,3.4e-05,5.4e-05,0.000128,0.000114,0.000111,6e-06,9.3e-05,1.9e-05,2.4e-05,5.4e-05,1.4e-05,4.7e-05,2.3e-05,9.7e-05,7.6e-05,5.2e-05
5.6e-05,8.9e-05,4.2e-05,7.5e-05,3.3e-05,3.2e-05,0.000105,7.2e-05,0.000125,0.000156,9.6e-05,6.2e-05,5.4e-05,9.5e-05,5e-05,3.1e-05,8.8e-05,7.9e-05,9.3e-05,0.000106,9.1e-05,7.3e-05,8.5e-05,5.8e-05,2.7e-05,4.4e-05,6e-05,4.7e-05,6e-05,3e-05,5.2e-05,7.5e-05,4.8e-05,6.1e-05,3.6e-05,4e-05,7.5e-05,4.4e-05,4.2e-05,8.1e-05,8.9e-05,7e-05,6.4e-05,4.4e-05,3.5e-05,9.5e-05,0.000123,6.9e-05,3.7e-05,2.9e-05,1.4e-05,4.3e-05,7.6e-05,3.3e-05,5.4e-05,4.3e-05,4.1e-05,6.9e-05,0.000103,7.5e-05,1.7e-05,2.9e-05,2.2e-05,2.4e-05,8e-06,9e-06,2.8e-05,3.7e-05,3.3e-05,4.6e-05,3.5e-05,2.7e-05,3.5e-05,1e-05,2.1e-05,3e-05,5e-05,3.5e-05,4e-05,4.4e-05,4e-06,8e-06,4e-05,5.4e-05,4.1e-05,3.6e-05,2.2e-05,3.3e-05,3.4e-05,2.1e-05,1.3e-05,1.3e-05,4.3e-05,4.7e-05,3.8e-05,5e-05,6.1e-05,4.3e-05,3.4e-05,3.5e-05,1e-06,4.4e-05,8.9e-05,4.5e-05,3.9e-05,3e-05,2.8e-05,4.2e-05,4.6e-05,2.2e-05,2.4e-05,4.2e-05,1.8e-05,1.3e-05,5.1e-05,5.9e-05,1.6e-05,2.9e-05,5.8e-05,5.7e-05,2.7e-05
6.3e-05,3.1e-05,4.6e-05,1.8e-05,4.4e-05,7.8e-05,9.5e-05,4.3e-05,9.5e-05,6.5e-05,3.3e-05,2.5e-05,2.6e-05,6.1e-05,6.7e-05,5.8e-05,3.7e-05,5.1e-05,4.6e-05,3.9e-05,5.9e-05,7.4e-05,5.3e-05,4.1e-05,2.5e-05,3.9e-05,5.1e-05,8.1e-05,6.7e-05,5e-05,2.9e-05,1.5e-05,1.1e-05,1.2e-05,2e-05,3.5e-05,4.5e-05,3.4e-05,1.3e-05,6.9e-05,4.8e-05,2.5e-05,5e-05,3.6e-05,4e-05,5.2e-05,6.9e-05,5.5e-05,5.8e-05,1.8e-05,3e-06,3.7e-05,2.6e-05,4e-05,4.3e-05,2e-05,1.6e-05,4.3e-05,4.7e-05,2.6e-05,3.7e-05,2.7e-05,1.2e-05,2.6e-05,1.1e-05,1.7e-05,3.1e-05,1.4e-05,8e-06,2.6e-05,4e-06,8e-06,1.4e-05,1.5e-05,1.1e-05,2.5e-05,1.3e-05,1.3e-05,1.6e-05,2.7e-05,2.2e-05,1.6e-05,3.4e-05,4.4e-05,4.3e-05,2e-05,1.1e-05,3.5e-05,1.2e-05,1.8e-05,1.4e-05,1.8e-05,2.4e-05,3e-05,1e-05,2.5e-05,2.7e-05,2.1e-05,2.8e-05,1.1e-05,9e-06,2.4e-05,3.1e-05,3.1e-05,6e-06,4e-06,2.9e-05,1.8e-05,3.1e-05,3.6e-05,3e-05,1.6e-05,1.7e-05,8e-06,3.1e-05,2.2e-05,3.2e-05,3.6e-05,2.8e-05,2.4e-05,1e-05
2.2e-05,1.1e-05,8e-06,1.5e-05,1.3e-05,5.7e-05,8e-06,1.5e-05,2.8e-05,8e-06,2.2e-05,1e-05,7e-06,3.5e-05,1.1e-05,1e-06,1.1e-05,3.4e-05,1.2e-05,3.1e-05,1.4e-05,3.4e-05,3.6e-05,2.9e-05,6e-06,3.8e-05,7e-06,3.1e-05,3.2e-05,1.1e-05,1.6e-05,1.4e-05,1.5e-05,6e-06,1.9e-05,8e-06,2.6e-05,1.1e-05,2.5e-05,3.3e-05,1.2e-05,3e-05,1.9e-05,9e-06,1.6e-05,2.4e-05,2.7e-05,1.5e-05,2e-05,7e-06,6e-06,1.5e-05,1.9e-05,2.1e-05,1.7e-05,2e-06,1e-05,2.5e-05,2e-05,1.6e-05,9e-06,1.7e-05,1.3e-05,1.1e-05,1e-05,1.7e-05,1.5e-05,2e-06,4e-06,1.2e-05,1.8e-05,1e-05,7e-06,9e-06,5e-06,1.3e-05,1e-05,8e-06,2.9e-05,1e-06,1.4e-05,1.6e-05,8e-06,1.8e-05,1.5e-05,4e-06,9e-06,1.1e-05,6e-06,6e-06,7e-06,1.3e-05,8e-06,8e-06,1.3e-05,1.6e-05,3e-06,1.7e-05,3e-06,1.5e-05,7e-06,9e-06,1.8e-05,1e-06,9e-06,1.2e-05,1.6e-05,6e-06,2e-05,1.5e-05,1.9e-05,1.3e-05,6e-06,9e-06,9e-06,4e-06,1e-05,1.7e-05,8e-06,1.2e-05,5e-06
1.7e-05,2.5e-05,2.7e-05,1.5e-05,2.2e-05,3.5e-05,2.5e-05,7e-06,8e-06,1e-06,1.2e-05,1e-06,1.5e-05,1e-05,1.8e-05,1.3e-05,1.6e-05,2e-05,9e-06,5e-06,1.4e-05,2.7e-05,1.3e-05,2.9e-05,1.5e-05,3.6e-05,2.6e-05,9e-06,1.7e-05,7e-06,2.8e-05,1.7e-05,1.1e-05,5e-06,2e-06,5e-06,2.6e-05,5e-06,1.6e-05,2.8e-05,2.8e-05,2.5e-05,1.2e-05,9e-06,1.7e-05,1.1e-05,1.7e-05,1.2e-05,1.3e-05,1.6e-05,1.5e-05,1.4e-05,1.1e-05,9e-06,1.8e-05,1.8e-05,2.3e-05,1.6e-05,2e-05,8e-06,2e-06,5e-06,1.4e-05,1.8e-05,1.4e-05,1.7e-05,9e-06,7e-06,5e-06,4e-06,1.1e-05,5e-06,1e-05,6e-06,1e-05,9e-06,6e-06,9e-06,1.2e-05,2e-06,9e-06,4e-06,2e-06,8e-06,6e-06,7e-06,1.5e-05,1.5e-05,5e-06,1.3e-05,7e-06,1.4e-05,1.4e-05,1.7e-05,7e-06,1.1e-05,6e-06,1.6e-05,1.1e-05,1.1e-05,1.1e-05,3e-06,2e-06,3e-06,9e-06,1e-05,8e-06,1e-05,6e-06,1e-05,1.5e-05,1.1e-05,8e-06,1.1e-05,1.4e-05,1.6e-05,7e-06,1.1e-05,3e-06,7e-06,5e-06
1.1e-05,1.1e-05,9e-06,5e-06,1e-05,1.5e-05,1.3e-05,1.3e-05,5e-06,5e-06,1.9e-05,1e-05,1.1e-05,5e-06,1e-05,9e-06,1e-05,1.3e-05,1.2e-05,1.5e-05,4e-06,8e-06,3e-05,2e-05,6e-06,1.6e-05,7e-06,1.3e-05,1.7e-05,7e-06,1.6e-05,5e-06,1.1e-05,1.6e-05,1.5e-05,1.1e-05,1.7e-05,7e-06,1.3e-05,2.8e-05,3.1e-05,7e-06,1.2e-05,1.4e-05,1.8e-05,8e-06,1.2e-05,3e-06,9e-06,1.7e-05,1.1e-05,1.2e-05,9e-06,1.5e-05,1.4e-05,8e-06,6e-06,1.2e-05,1.9e-05,1.4e-05,5e-06,6e-06,9e-06,1.1e-05,7e-06,1.3e-05,5e-06,4e-06,2e-06,6e-06,2e-06,4e-06,6e-06,1.4e-05,6e-06,6e-06,3e-06,5e-06,1.5e-05,6e-06,6e-06,7e-06,2e-06,1.2e-05,7e-06,9e-06,5e-06,1.1e-05,4e-06,1.3e-05,9e-06,1.4e-05,8e-06,7e-06,5e-06,1.2e-05,6e-06,1.1e-05,9e-06,1.4e-05,1e-06,2e-06,8e-06,9e-06,1e-06,1e-05,9e-06,1.4e-05,7e-06,9e-06,9e-06,1e-06,5e-06,4e-06,1.3e-05,6e-06,7e-06,1e-05,3e-06,7e-06,3e-06
5e-06,9e-06,7e-06,5e-06,1.3e-05,1.6e-05,1.2e-05,8e-06,7e-06,7e-06,1.5e-05,3e-06,6e-06,5e-06,7e-06,1.4e-05,1.1e-05,1.1e-05,1e-05,7e-06,7e-06,1.1e-05,2.7e-05,1.7e-05,7e-06,1e-05,1e-05,9e-06,1.3e-05,9e-06,1.9e-05,7e-06,8e-06,9e-06,7e-06,1.2e-05,2e-05,3e-06,1.5e-05,2.5e-05,2.2e-05,4e-06,8e-06,9e-06,1.2e-05,7e-06,1e-05,6e-06,2e-06,5e-06,2e-06,1e-05,1e-05,1.1e-05,3e-06,7e-06,6e-06,1.1e-05,1e-05,2e-06,9e-06,1e-06,1e-05,1.3e-05,5e-06,1.6e-05,4e-06,1e-06,5e-06,2e-06,3e-06,2e-06,3e-06,9e-06,2e-06,1e-06,2e-06,4e-06,1.4e-05,4e-06,3e-06,4e-06,4e-06,1e-05,7e-06,5e-06,7e-06,6e-06,3e-06,1e-05,8e-06,8e-06,2e-06,9e-06,6e-06,8e-06,7e-06,6e-06,2e-06,4e-06,7e-06,5e-06,3e-06,1.1e-05,7e-06,9e-06,9e-06,1e-05,6e-06,1e-05,8e-06,3e-06,1e-06,8e-06,5e-06,4e-06,4e-06,9e-06,9e-06,5e-06,2e-06
2e-06,3e-06,3e-06,4e-06,8e-06,1.4e-05,8e-06,2e-06,1e-05,1e-06,9e-06,3e-06,6e-06,2e-06,6e-06,8e-06,1e-05,1.5e-05,4e-06,1.6e-05,1.1e-05,7e-06,2.5e-05,1.1e-05,3e-06,1.2e-05,1e-05,1.3e-05,1.4e-05,1e-05,8e-06,8e-06,5e-06,1.1e-05,4e-06,1.1e-05,2.3e-05,1e-05,2.3e-05,2.3e-05,1.6e-05,1.4e-05,1e-05,5e-06,5e-06,1e-05,1.8e-05,1.2e-05,1.1e-05,6e-06,6e-06,8e-06,1.1e-05,9e-06,6e-06,2e-06,6e-06,1.1e-05,9e-06,4e-06,6e-06,1e-06,1.2e-05,9e-06,4e-06,7e-06,3e-06,5e-06,7e-06,3e-06,2e-06,2e-06,4e-06,9e-06,4e-06,2e-06,4e-06,4e-06,1.3e-05,1e-06,5e-06,3e-06,3e-06,8e-06,5e-06,3e-06,7e-06,6e-06,3e-06,1.1e-05,6e-06,1.2e-05,3e-06,8e-06,9e-06,1.1e-05,3e-06,1.2e-05,4e-06,7e-06,8e-06,8e-06,3e-06,7e-06,4e-06,9e-06,7e-06,9e-06,8e-06,1e-05,9e-06,1e-06,3e-06,1.1e-05,6e-06,4e-06,8e-06,6e-06,8e-06,8e-06,3e-06
1.7e-05,2e-06,1e-06,7e-06,1.3e-05,2.4e-05,1.3e-05,2e-06,1.3e-05,2e-06,6e-06,5e-06,1e-05,3e-06,9e-06,3e-06,1.4e-05,1e-05,4e-06,1.1e-05,1.5e-05,2.1e-05,2e-05,6e-06,1.2e-05,1e-05,3e-06,1.6e-05,9e-06,9e-06,1.9e-05,8e-06,4e-06,4e-06,7e-06,1.5e-05,1.8e-05,1.2e-05,1.3e-05,1.9e-05,1.2e-05,3e-06,1e-06,1.6e-05,5e-06,1.6e-05,1.1e-05,3e-06,6e-06,9e-06,4e-06,1.6e-05,8e-06,1.1e-05,1e-06,4e-06,3e-06,1.5e-05,7e-06,3e-06,1.3e-05,8e-06,1.6e-05,1.2e-05,2e-06,1.5e-05,9e-06,3e-06,9e-06,2e-06,8e-06,3e-06,4e-06,5e-06,5e-06,6e-06,1e-06,2e-06,1.2e-05,7e-06,8e-06,5e-06,3e-06,1.1e-05,5e-06,2e-06,7e-06,7e-06,6e-06,7e-06,6e-06,7e-06,5e-06,1.1e-05,1e-05,8e-06,4e-06,8e-06,8e-06,4e-06,7e-06,3e-06,4e-06,8e-06,4e-06,9e-06,8e-06,5e-06,9e-06,9e-06,7e-06,2e-06,4e-06,1.3e-05,1e-05,3e-06,4e-06,2e-06,8e-06,1e-05,2e-06
1.5e-05,2.1e-05,6e-06,1.1e-05,1e-05,2.3e-05,2.1e-05,2e-05,1.8e-05,1.9e-05,1.1e-05,3e-06,9e-06,1.6e-05,2e-06,5e-06,1e-05,2.8e-05,1.4e-05,1.7e-05,1.8e-05,1.2e-05,1.3e-05,2.2e-05,4e-06,1e-05,1.1e-05,2.3e-05,2.3e-05,7e-06,1.5e-05,3e-06,9e-06,1.5e-05,7e-06,1.6e-05,2.4e-05,6e-06,2.6e-05,1.6e-05,1.9e-05,1.3e-05,1.5e-05,1.6e-05,2.3e-05,3e-06,8e-06,1.5e-05,5e-06,1.1e-05,2e-05,9e-06,2.3e-05,5e-06,6e-06,1.2e-05,2.1e-05,5e-06,1.8e-05,2.1e-05,1.3e-05,6e-06,3e-06,1.2e-05,5e-06,2.1e-05,2e-06,2e-06,6e-06,1.3e-05,1.3e-05,9e-06,1e-05,1e-05,1e-06,1.2e-05,3e-06,1e-05,7e-06,3e-06,1e-05,8e-06,8e-06,1.3e-05,1e-05,6e-06,1.6e-05,1e-05,1.1e-05,1.9e-05,9e-06,1.1e-05,1.2e-05,7e-06,1.5e-05,1.2e-05,7e-06,1.1e-05,1.4e-05,5e-06,7e-06,1.1e-05,1e-05,1.1e-05,7e-06,6e-06,5e-06,8e-06,1e-05,6e-06,1e-05,7e-06,1.2e-05,7e-06,6e-06,8e-06,1e-06,3e-06,9e-06,1e-05,8e-06
1.1e-05,2.2e-05,1.9e-05,5e-06,1.4e-05,1.4e-05,3.3e-05,8e-06,3.2e-05,1.5e-05,1.6e-05,1.7e-05,1.5e-05,2.5e-05,4e-05,2.5e-05,6e-06,1.8e-05,1.1e-05,1.4e-05,4e-06,2e-06,2.6e-05,1.8e-05,1.1e-05,1.1e-05,3.4e-05,2.9e-05,1.9e-05,1.5e-05,1.7e-05,1e-05,9e-06,2.1e-05,1.2e-05,1.5e-05,3.7e-05,1e-05,2.5e-05,1.9e-05,9e-06,9e-06,6e-06,1.6e-05,2.6e-05,1.1e-05,2e-05,1.5e-05,1.8e-05,1.3e-05,2.9e-05,2.5e-05,2.9e-05,2e-05,2.2e-05,3e-05,6e-06,1e-05,2.3e-05,3e-06,1e-05,1.9e-05,2.1e-05,1.3e-05,1.2e-05,2e-05,1.6e-05,9e-06,5e-06,2.1e-05,1.6e-05,1e-05,1.9e-05,7e-06,6e-06,1.7e-05,1.3e-05,1.9e-05,1.3e-05,1.3e-05,1.3e-05,3e-06,9e-06,3e-06,6e-06,6e-06,1.3e-05,8e-06,1.3e-05,8e-06,3e-06,1.2e-05,1.2e-05,9e-06,1.3e-05,6e-06,1.5e-05,1.3e-05,1e-05,2.4e-05,2.3e-05,2.1e-05,9e-06,1.1e-05,1e-05,3e-06,7e-06,6e-06,1.3e-05,1.1e-05,6e-06,5e-06,6e-06,6e-06,2e-05,5e-06,1.2e-05,1e-05,8e-06,5e-06,1.4e-05
3.7e-05,2.8e-05,1.2e-05,4e-06,4e-06,2.7e-05,3.6e-05,2.5e-05,2.6e-05,1.7e-05,1.7e-05,7e-06,1.7e-05,3.5e-05,3.3e-05,1.4e-05,1e-05,1.7e-05,8e-06,5e-06,4e-06,4e-06,1.6e-05,8e-06,1.3e-05,1.6e-05,4.7e-05,4.9e-05,3.6e-05,1.6e-05,1.6e-05,1.2e-05,5e-06,1.2e-05,8e-06,9e-06,1.7e-05,3.2e-05,1.4e-05,3.7e-05,2.4e-05,2.7e-05,1.7e-05,2.8e-05,7e-06,1.4e-05,9e-06,1.8e-05,1.6e-05,1.4e-05,1.6e-05,2.5e-05,1e-05,4e-06,2.2e-05,8e-06,1.3e-05,1.5e-05,7e-06,1.4e-05,1e-05,1.6e-05,1.9e-05,3e-05,9e-06,6e-06,1.5e-05,8e-06,8e-06,1.5e-05,7e-06,1.4e-05,1.6e-05,9e-06,8e-06,6e-06,7e-06,1e-05,1e-05,1.1e-05,9e-06,1e-05,9e-06,1.3e-05,6e-06,6e-06,9e-06,8e-06,1.6e-05,9e-06,4e-06,8e-06,1.4e-05,8e-06,1.7e-05,1.1e-05,4e-06,9e-06,2e-05,2.8e-05,5e-06,7e-06,3e-06,5e-06,9e-06,1.2e-05,1e-05,2.4e-05,1.6e-05,6e-06,7e-06,6e-06,5e-06,4e-06,1.6e-05,1.4e-05,1.5e-05,4e-06,5e-06,8e-06,1.6e-05
3.2e-05,1.5e-05,1.5e-05,1.6e-05,2.2e-05,3.3e-05,9e-06,5e-06,5e-06,6e-06,2.2e-05,1.5e-05,2.1e-05,8e-06,1.8e-05,2e-05,2.6e-05,1.6e-05,1.1e-05,7e-06,1e-05,7e-06,1e-05,2e-05,1.1e-05,2.1e-05,2.3e-05,1.7e-05,1.1e-05,8e-06,1.1e-05,1.7e-05,1.1e-05,1.8e-05,2.4e-05,1.7e-05,8e-06,1.5e-05,2.3e-05,2.3e-05,1.9e-05,1.8e-05,1e-05,1.3e-05,1e-05,1.3e-05,2e-06,1e-05,7e-06,1.6e-05,1.8e-05,1e-05,6e-06,1e-06,1e-05,5e-06,1.3e-05,1.1e-05,1.5e-05,1.2e-05,1e-05,1.9e-05,2.7e-05,1e-05,6e-06,9e-06,5e-06,3e-06,2e-06,1.3e-05,1.2e-05,1.4e-05,0,8e-06,6e-06,2e-06,2e-06,1e-05,2e-06,6e-06,4e-06,6e-06,2e-06,1.5e-05,7e-06,6e-06,1e-05,1e-05,7e-06,5e-06,3e-06,7e-06,4e-06,9e-06,4e-06,6e-06,4e-06,3e-06,1e-05,6e-06,1e-05,1.2e-05,9e-06,6e-06,7e-06,2e-06,6e-06,1.7e-05,6e-06,5e-06,1e-06,5e-06,6e-06,8e-06,1.1e-05,1e-05,3e-06,0,8e-06,5e-06,8e-06
9e-06,1.1e-05,6e-06,7e-06,1.2e-05,2.9e-05,7e-06,6e-06,5e-06,1e-06,1.4e-05,6e-06,8e-06,5e-06,6e-06,1.1e-05,5e-06,1e-05,5e-06,8e-06,1.2e-05,7e-06,1.2e-05,8e-06,5e-06,1.5e-05,1.6e-05,7e-06,7e-06,5e-06,1.4e-05,9e-06,3e-06,1.2e-05,1.2e-05,3e-06,9e-06,5e-06,1.4e-05,6e-06,2e-05,1e-05,2e-06,8e-06,7e-06,6e-06,4e-06,6e-06,6e-06,7e-06,6e-06,9e-06,7e-06,4e-06,7e-06,7e-06,8e-06,5e-06,8e-06,2e-06,4e-06,7e-06,1e-05,1.1e-05,7e-06,6e-06,5e-06,7e-06,5e-06,4e-06,8e-06,7e-06,2e-06,8e-06,1e-06,2e-06,3e-06,2e-06,8e-06,6e-06,6e-06,4e-06,2e-06,1e-05,3e-06,1e-06,8e-06,3e-06,4e-06,1.1e-05,4e-06,5e-06,4e-06,6e-06,3e-06,3e-06,6e-06,6e-06,8e-06,5e-06,4e-06,5e-06,3e-06,3e-06,5e-06,7e-06,4e-06,1e-05,1e-05,1.2e-05,7e-06,7e-06,3e-06,5e-06,5e-06,5e-06,4e-06,2e-06,9e-06,7e-06,4e-06
1.1e-05,7e-06,4e-06,3e-06,8e-06,1.9e-05,9e-06,6e-06,4e-06,3e-06,9e-06,7e-06,1.2e-05,8e-06,3e-06,4e-06,4e-06,5e-06,7e-06,6e-06,9e-06,6e-06,1e-05,1.6e-05,4e-06,5e-06,1.1e-05,5e-06,1.1e-05,3e-06,8e-06,6e-06,1e-06,2e-06,8e-06,5e-06,1e-05,3e-06,1.1e-05,9e-06,1.6e-05,1.1e-05,4e-06,1.1e-05,4e-06,7e-06,2e-06,6e-06,2e-06,1e-06,5e-06,3e-06,4e-06,7e-06,5e-06,7e-06,9e-06,3e-06,7e-06,2e-06,1e-06,3e-06,9e-06,1.1e-05,4e-06,3e-06,6e-06,5e-06,3e-06,5e-06,7e-06,5e-06,4e-06,7e-06,1e-06,1e-06,3e-06,2e-06,7e-06,5e-06,4e-06,1e-06,4e-06,9e-06,6e-06,1e-06,6e-06,3e-06,3e-06,7e-06,1e-06,8e-06,5e-06,8e-06,4e-06,3e-06,4e-06,6e-06,4e-06,4e-06,2e-06,3e-06,2e-06,7e-06,3e-06,6e-06,3e-06,1.1e-05,7e-06,6e-06,8e-06,1e-06,1e-06,3e-06,3e-06,2e-06,2e-06,3e-06,8e-06,4e-06,2e-06
4e-06,7e-06,5e-06,2e-06,1.4e-05,1.5e-05,8e-06,5e-06,6e-06,2e-06,8e-06,8e-06,9e-06,3e-06,2e-06,3e-06,2e-06,5e-06,5e-06,9e-06,4e-06,5e-06,1.5e-05,1.9e-05,1.4e-05,8e-06,6e-06,1e-06,1.2e-05,4e-06,1.2e-05,6e-06,2e-06,9e-06,1e-05,4e-06,9e-06,2e-06,6e-06,1.3e-05,1.1e-05,1.4e-05,2e-06,6e-06,2e-06,4e-06,4e-06,3e-06,5e-06,2e-06,6e-06,3e-06,3e-06,4e-06,9e-06,5e-06,9e-06,3e-06,8e-06,0,1e-06,0,6e-06,1.2e-05,3e-06,6e-06,2e-06,1e-06,6e-06,3e-06,6e-06,2e-06,2e-06,7e-06,1e-06,1e-06,4e-06,1e-06,5e-06,3e-06,4e-06,2e-06,3e-06,6e-06,4e-06,4e-06,5e-06,2e-06,1e-06,7e-06,0,8e-06,3e-06,8e-06,5e-06,6e-06,4e-06,6e-06,6e-06,7e-06,3e-06,2e-06,2e-06,5e-06,2e-06,6e-06,1e-06,1.1e-05,9e-06,7e-06,8e-06,6e-06,3e-06,6e-06,4e-06,2e-06,2e-06,1e-06,7e-06,5e-06,3e-06
4e-06,4e-06,6e-06,3e-06,1.4e-05,1.4e-05,2e-06,6e-06,2e-06,3e-06,7e-06,4e-06,9e-06,6e-06,3e-06,3e-06,3e-06,5e-06,6e-06,5e-06,2e-06,7e-06,1.5e-05,1.2e-05,6e-06,3e-06,1e-05,6e-06,7e-06,7e-06,6e-06,1e-05,6e-06,8e-06,6e-06,1e-06,9e-06,6e-06,1.1e-05,1.1e-05,1.6e-05,9e-06,8e-06,5e-06,6e-06,7e-06,3e-06,2e-06,2e-06,2e-06,5e-06,2e-06,4e-06,5e-06,7e-06,5e-06,6e-06,3e-06,5e-06,2e-06,3e-06,3e-06,9e-06,1.2e-05,1e-06,6e-06,4e-06,3e-06,5e-06,3e-06,5e-06,2e-06,3e-06,3e-06,2e-06,2e-06,1e-06,2e-06,7e-06,4e-06,3e-06,4e-06,3e-06,8e-06,3e-06,5e-06,5e-06,4e-06,5e-06,9e-06,1e-06,7e-06,7e-06,6e-06,5e-06,7e-06,3e-06,2e-06,6e-06,6e-06,1e-06,2e-06,4e-06,4e-06,1e-06,4e-06,0,8e-06,8e-06,8e-06,4e-06,6e-06,4e-06,3e-06,3e-06,4e-06,3e-06,2e-06,6e-06,3e-06,2e-06
2e-06,4e-06,4e-06,4e-06,1.1e-05,1.3e-05,1e-06,5e-06,4e-06,3e-06,3e-06,4e-06,5e-06,4e-06,4e-06,2e-06,1e-06,4e-06,3e-06,5e-06,3e-06,8e-06,1.3e-05,1.2e-05,1e-06,3e-06,1.2e-05,1e-06,8e-06,8e-06,1e-05,6e-06,3e-06,7e-06,8e-06,5e-06,1.2e-05,7e-06,9e-06,1e-05,1.9e-05,8e-06,5e-06,3e-06,3e-06,9e-06,2e-06,2e-06,4e-06,1e-06,5e-06,2e-06,4e-06,6e-06,5e-06,7e-06,7e-06,4e-06,6e-06,1e-06,3e-06,1e-06,7e-06,7e-06,3e-06,5e-06,3e-06,2e-06,3e-06,2e-06,8e-06,4e-06,1e-06,5e-06,1e-06,1e-06,2e-06,1e-06,8e-06,2e-06,0,2e-06,1e-06,7e-06,5e-06,3e-06,2e-06,4e-06,1e-06,6e-06,1e-06,7e-06,5e-06,8e-06,4e-06,6e-06,2e-06,5e-06,4e-06,2e-06,2e-06,2e-06,4e-06,3e-06,3e-06,6e-06,1e-06,8e-06,8e-06,3e-06,8e-06,5e-06,4e-06,4e-06,6e-06,1e-06,4e-06,5e-06,4e-06,0,2e-06
3e-06,3e-06,2e-06,2e-06,9e-06,1.4e-05,6e-06,4e-06,5e-06,1e-06,5e-06,2e-06,7e-06,5e-06,2e-06,0,3e-06,2e-06,2e-06,6e-06,2e-06,4e-06,1.7e-05,1.1e-05,2e-06,5e-06,1e-05,2e-06,2e-06,1e-06,1e-05,5e-06,3e-06,5e-06,8e-06,5e-06,8e-06,3e-06,6e-06,1.2e-05,1.4e-05,7e-06,6e-06,4e-06,3e-06,3e-06,4e-06,2e-06,3e-06,3e-06,6e-06,1e-06,5e-06,7e-06,6e-06,5e-06,8e-06,3e-06,4e-06,1e-06,2e-06,1e-06,5e-06,9e-06,3e-06,7e-06,5e-06,2e-06,4e-06,1e-06,6e-06,5e-06,2e-06,5e-06,1e-06,2e-06,2e-06,1e-06,8e-06,3e-06,2e-06,2e-06,1e-06,7e-06,5e-06,3e-06,3e-06,4e-06,3e-06,6e-06,1e-06,7e-06,5e-06,9e-06,4e-06,7e-06,1e-06,3e-06,3e-06,3e-06,3e-06,1e-06,2e-06,6e-06,2e-06,5e-06,2e-06,1e-05,9e-06,4e-06,6e-06,3e-06,4e-06,5e-06,6e-06,2e-06,3e-06,2e-06,7e-06,1e-06,0
1e-06,4e-06,2e-06,1e-06,1e-05,1.5e-05,7e-06,3e-06,2e-06,0,7e-06,2e-06,6e-06,5e-06,3e-06,1e-06,1e-06,3e-06,1e-06,6e-06,1e-06,4e-06,1.6e-05,1.2e-05,3e-06,6e-06,7e-06,1e-06,4e-06,1e-06,8e-06,6e-06,1e-06,5e-06,7e-06,3e-06,1e-05,5e-06,7e-06,1.1e-05,1e-05,6e-06,3e-06,4e-06,1e-06,6e-06,3e-06,2e-06,2e-06,1e-06,5e-06,2e-06,6e-06,4e-06,4e-06,4e-06,6e-06,2e-06,3e-06,0,2e-06,1e-06,6e-06,9e-06,2e-06,6e-06,4e-06,1e-06,4e-06,2e-06,5e-06,4e-06,4e-06,4e-06,1e-06,1e-06,0,1e-06,8e-06,2e-06,3e-06,1e-06,0,6e-06,5e-06,3e-06,3e-06,4e-06,2e-06,6e-06,1e-06,4e-06,5e-06,7e-06,4e-06,5e-06,1e-06,3e-06,4e-06,3e-06,3e-06,1e-06,1e-06,4e-06,1e-06,5e-06,1e-06,1e-05,8e-06,4e-06,5e-06,4e-06,2e-06,5e-06,5e-06,1e-06,1e-06,2e-06,5e-06,1e-06,1e-06
1e-06,2e-06,1e-06,1e-06,1e-05,1.4e-05,7e-06,3e-06,3e-06,1e-06,6e-06,1e-06,5e-06,5e-06,1e-06,2e-06,2e-06,1e-06,1e-06,7e-06,1e-06,5e-06,1.5e-05,1e-05,2e-06,5e-06,9e-06,3e-06,4e-06,2e-06,7e-06,7e-06,1e-06,5e-06,7e-06,3e-06,9e-06,4e-06,8e-06,1e-05,1.2e-05,7e-06,4e-06,4e-06,4e-06,5e-06,3e-06,2e-06,3e-06,1e-06,4e-06,2e-06,4e-06,4e-06,5e-06,4e-06,6e-06,1e-06,3e-06,2e-06,2e-06,1e-06,5e-06,1e-05,1e-06,6e-06,3e-06,2e-06,3e-06,2e-06,5e-06,4e-06,3e-06,5e-06,1e-06,2e-06,1e-06,1e-06,7e-06,2e-06,2e-06,2e-06,0,6e-06,4e-06,4e-06,3e-06,4e-06,3e-06,7e-06,1e-06,6e-06,4e-06,7e-06,5e-06,6e-06,1e-06,3e-06,3e-06,4e-06,3e-06,0,1e-06,5e-06,2e-06,5e-06,2e-06,9e-06,9e-06,4e-06,5e-06,4e-06,3e-06,5e-06,4e-06,1e-06,1e-06,1e-06,7e-06,1e-06,1e-06
