0.032436,0.035648,0.026455,0.019354,0.016779,0.014541,0.012004,0.010578,0.010989,0.011119,0.011019,0.009872,0.007276,0.006817,0.007554,0.007482,0.007593,0.007771,0.007515,0.007763,0.008923,0.016906,0.027864,0.032061,0.028856,0.020378,0.014498,0.012547
0.040764,0.044761,0.033094,0.024228,0.021268,0.018279,0.014849,0.012848,0.013337,0.01375,0.013571,0.012017,0.008916,0.008348,0.009103,0.009006,0.009177,0.009394,0.009252,0.009536,0.010698,0.020185,0.035008,0.041421,0.036158,0.025131,0.018155,0.01552
0.05399,0.060535,0.045859,0.034012,0.030141,0.025521,0.020261,0.017032,0.017588,0.018623,0.018111,0.015732,0.01183,0.010914,0.011644,0.011541,0.011754,0.011963,0.012059,0.012332,0.013524,0.026193,0.049223,0.059567,0.049453,0.033983,0.02525,0.021263
0.060409,0.073339,0.060588,0.046024,0.039941,0.03346,0.026458,0.021705,0.022041,0.023625,0.022791,0.019514,0.014619,0.013033,0.013744,0.013511,0.013482,0.013464,0.013829,0.014189,0.01585,0.034063,0.069697,0.083947,0.065674,0.045023,0.034063,0.028292
0.059299,0.084258,0.079219,0.060972,0.050425,0.042474,0.034531,0.027801,0.027474,0.029596,0.029396,0.025183,0.017891,0.015053,0.015903,0.015423,0.014925,0.014294,0.014498,0.01518,0.018812,0.048477,0.104457,0.124238,0.09395,0.063181,0.046641,0.037812
0.060308,0.098659,0.102301,0.079129,0.062374,0.051958,0.044007,0.03594,0.035269,0.037987,0.038535,0.032551,0.021557,0.017336,0.018582,0.017814,0.017002,0.016351,0.01632,0.016722,0.023187,0.07069,0.153431,0.179812,0.134923,0.089398,0.063567,0.049323
0.07199,0.11631,0.121537,0.094926,0.074488,0.060135,0.052878,0.044844,0.043038,0.045793,0.046859,0.038631,0.025268,0.021137,0.022437,0.020876,0.019417,0.019689,0.020738,0.020711,0.029527,0.097584,0.204737,0.233259,0.174252,0.115214,0.08268,0.063641
0.093951,0.137447,0.134998,0.105518,0.085818,0.066089,0.059224,0.053255,0.049855,0.051362,0.051886,0.041991,0.029306,0.026092,0.026197,0.023701,0.021757,0.023347,0.02623,0.025831,0.03641,0.122832,0.246332,0.270468,0.198571,0.131429,0.099278,0.079648
0.124044,0.167825,0.152463,0.11779,0.09839,0.071156,0.064462,0.06099,0.055904,0.055717,0.053794,0.043262,0.033528,0.031385,0.029843,0.025645,0.023074,0.025969,0.030272,0.029911,0.04327,0.144507,0.274404,0.286714,0.206521,0.138955,0.11061,0.094211
0.151521,0.200916,0.177327,0.135236,0.112309,0.077381,0.069181,0.06535,0.059276,0.059476,0.053978,0.042599,0.035683,0.034357,0.032462,0.027229,0.023349,0.02672,0.031853,0.032057,0.049075,0.169294,0.302659,0.291637,0.206972,0.145884,0.116488,0.099769
0.16268,0.218177,0.191114,0.147246,0.120281,0.080764,0.068502,0.061335,0.056461,0.059128,0.051792,0.039426,0.034184,0.033044,0.030891,0.026499,0.022518,0.025321,0.029727,0.030343,0.051156,0.189078,0.327042,0.300836,0.213506,0.15038,0.112291,0.091994
0.150901,0.212307,0.190102,0.154132,0.121668,0.077101,0.060541,0.051592,0.048465,0.051051,0.043992,0.032864,0.029105,0.028076,0.02549,0.023565,0.021846,0.023417,0.025435,0.026443,0.049476,0.184347,0.309112,0.284846,0.210869,0.146816,0.101389,0.0752
0.126705,0.196122,0.185354,0.158038,0.116211,0.065492,0.049394,0.042344,0.03884,0.038751,0.033049,0.025002,0.022109,0.021633,0.02011,0.020783,0.021551,0.022002,0.022484,0.023774,0.043933,0.153712,0.249984,0.245586,0.203094,0.138862,0.087719,0.057776
0.103859,0.173783,0.16864,0.143167,0.099575,0.051462,0.039583,0.034865,0.030164,0.028599,0.024562,0.019589,0.017458,0.017042,0.017023,0.019559,0.021394,0.020465,0.019998,0.021215,0.036339,0.121602,0.196322,0.20211,0.177909,0.120825,0.07326,0.046676
0.087051,0.152728,0.143928,0.111668,0.079363,0.042679,0.031831,0.02901,0.025631,0.024269,0.022105,0.019189,0.01729,0.016665,0.017069,0.019687,0.021264,0.019642,0.018628,0.019335,0.031046,0.104054,0.170226,0.173397,0.147014,0.099117,0.067783,0.048995
0.090957,0.170703,0.156257,0.115576,0.091689,0.050059,0.031311,0.031892,0.032797,0.031174,0.029142,0.025538,0.021548,0.019923,0.019711,0.021844,0.023974,0.022456,0.020629,0.021403,0.034763,0.125374,0.220604,0.222335,0.168232,0.111156,0.091102,0.071586
0.114752,0.233916,0.218212,0.157326,0.12801,0.071497,0.043874,0.045732,0.047196,0.044534,0.04336,0.037316,0.02846,0.024822,0.024052,0.025266,0.028587,0.028579,0.027095,0.029628,0.050224,0.198786,0.375295,0.384877,0.273359,0.170678,0.141152,0.109257
0.143871,0.313847,0.303224,0.209029,0.162716,0.095575,0.065256,0.063856,0.060172,0.056995,0.059212,0.051394,0.036725,0.029687,0.029431,0.029903,0.033352,0.036021,0.036159,0.040406,0.071891,0.312388,0.617537,0.63565,0.433068,0.255856,0.197654,0.146239
0.168769,0.386429,0.3846,0.255647,0.185142,0.111403,0.086979,0.078321,0.065732,0.063877,0.071825,0.064653,0.046193,0.034051,0.035473,0.037595,0.038482,0.04148,0.043916,0.049521,0.094389,0.458483,0.922385,0.930148,0.611124,0.34088,0.23587,0.168335
0.175835,0.420674,0.431207,0.283018,0.19509,0.116715,0.099269,0.082087,0.0638,0.06732,0.081426,0.075445,0.054351,0.038631,0.042182,0.045438,0.04204,0.044103,0.049096,0.053433,0.110608,0.601511,1.195183,1.155558,0.735858,0.395533,0.251243,0.182948
0.159198,0.391565,0.414668,0.277705,0.198667,0.123255,0.099334,0.078361,0.061211,0.067989,0.086383,0.081421,0.057629,0.041108,0.044857,0.046611,0.040417,0.043686,0.051301,0.052581,0.11499,0.668397,1.276232,1.172997,0.735166,0.393123,0.254939,0.200255
0.129169,0.305807,0.339986,0.247786,0.194598,0.131916,0.094676,0.074184,0.059577,0.066007,0.083703,0.076074,0.052169,0.0387,0.039911,0.039222,0.031894,0.035548,0.045214,0.046181,0.103605,0.601883,1.075855,0.943043,0.611179,0.343486,0.248117,0.214761
0.104,0.238974,0.2983,0.258868,0.211534,0.147295,0.099323,0.078653,0.064116,0.064672,0.073306,0.060472,0.040842,0.03285,0.031333,0.030628,0.023884,0.025311,0.034902,0.037571,0.084277,0.452693,0.753817,0.642791,0.459568,0.285026,0.215023,0.197768
0.087668,0.214998,0.307546,0.310408,0.254549,0.171083,0.11476,0.092009,0.075842,0.068737,0.068895,0.05538,0.03644,0.028802,0.027557,0.030094,0.024576,0.023113,0.031789,0.036159,0.067255,0.319269,0.571995,0.512552,0.356103,0.235109,0.175929,0.158043
0.083988,0.222349,0.336442,0.356257,0.287299,0.183371,0.128391,0.103321,0.084667,0.075506,0.069173,0.058402,0.037973,0.025694,0.026391,0.032899,0.027946,0.023169,0.029427,0.035216,0.062792,0.287861,0.537698,0.492236,0.318028,0.209782,0.165745,0.138574
0.092932,0.25041,0.351297,0.347365,0.278973,0.171609,0.129763,0.108534,0.085836,0.080267,0.068286,0.058344,0.039935,0.02373,0.024154,0.032845,0.029472,0.021923,0.024925,0.033249,0.065597,0.314879,0.546745,0.466044,0.297575,0.198313,0.162917,0.141865
0.099847,0.267313,0.323314,0.273468,0.239432,0.158317,0.124411,0.110681,0.080217,0.075701,0.065226,0.055155,0.042079,0.0266,0.024109,0.033299,0.031985,0.023639,0.024783,0.033975,0.065522,0.304086,0.499753,0.408129,0.263415,0.168771,0.134698,0.136222
0.094125,0.248568,0.264357,0.181251,0.186265,0.142389,0.107988,0.103363,0.070511,0.063675,0.059315,0.047812,0.040512,0.031122,0.02655,0.034361,0.034582,0.026614,0.026166,0.034885,0.060096,0.248582,0.393506,0.313551,0.213808,0.13274,0.094627,0.119966
0.080665,0.194345,0.191073,0.130317,0.158104,0.132218,0.094043,0.086131,0.062591,0.056075,0.05475,0.04569,0.040382,0.034977,0.029109,0.03398,0.036488,0.030502,0.028164,0.03434,0.053241,0.183355,0.298968,0.246161,0.181693,0.125024,0.076335,0.09725
0.076723,0.154826,0.150116,0.117816,0.137693,0.117222,0.077505,0.064453,0.056837,0.053758,0.050799,0.04964,0.047619,0.041211,0.036378,0.041334,0.045017,0.038897,0.034193,0.037571,0.052701,0.130168,0.226298,0.224143,0.175626,0.115459,0.065336,0.071827
0.090062,0.152262,0.143304,0.108302,0.110859,0.10187,0.071885,0.064625,0.067137,0.060153,0.051708,0.060471,0.063761,0.053103,0.04887,0.055591,0.060279,0.052441,0.045144,0.048573,0.060501,0.108212,0.179778,0.19635,0.157011,0.090833,0.047438,0.048251
0.097378,0.152184,0.146497,0.103753,0.092073,0.095791,0.0756,0.074035,0.082046,0.068107,0.056285,0.071848,0.07785,0.062845,0.057328,0.064816,0.07029,0.062014,0.051803,0.056221,0.068475,0.094028,0.126371,0.142033,0.118431,0.066773,0.038412,0.04332
0.086386,0.132862,0.136262,0.098887,0.075717,0.079581,0.066877,0.070653,0.083059,0.065286,0.05283,0.070764,0.076399,0.0596,0.0537,0.060536,0.065579,0.059394,0.047518,0.052011,0.068059,0.086666,0.091739,0.095527,0.078655,0.051576,0.042375,0.047969
0.059083,0.089802,0.100425,0.07748,0.052876,0.053184,0.047518,0.053234,0.065432,0.053912,0.045558,0.055929,0.057332,0.044134,0.040523,0.045666,0.047786,0.046172,0.036409,0.037086,0.053346,0.087354,0.106505,0.096868,0.069058,0.056737,0.053794,0.053361
0.03245,0.051668,0.063228,0.049803,0.039867,0.040022,0.035504,0.034274,0.040145,0.043819,0.042697,0.037459,0.035042,0.033193,0.033344,0.036328,0.033703,0.03658,0.034322,0.025287,0.032355,0.081538,0.130825,0.127461,0.089355,0.073543,0.067283,0.062097
0.026398,0.044908,0.049443,0.034298,0.038496,0.047089,0.034808,0.022824,0.023558,0.032963,0.036768,0.025799,0.024172,0.030438,0.031384,0.030881,0.029796,0.036249,0.036477,0.023166,0.020137,0.072569,0.14665,0.157217,0.112481,0.084364,0.07295,0.065442
0.029376,0.049997,0.048883,0.036703,0.04509,0.053476,0.039031,0.028198,0.023941,0.024727,0.029921,0.023913,0.0219,0.030204,0.031818,0.024302,0.024752,0.033785,0.034012,0.024529,0.016507,0.06474,0.143706,0.161176,0.118979,0.078867,0.064117,0.057012
0.034742,0.059171,0.053801,0.043958,0.053269,0.052891,0.044095,0.037776,0.025732,0.021045,0.028952,0.024659,0.017855,0.027517,0.034384,0.022489,0.0191,0.025662,0.024873,0.023457,0.018606,0.064318,0.128912,0.137112,0.10446,0.059595,0.04543,0.042029
0.038741,0.070695,0.062733,0.049271,0.06017,0.050803,0.048081,0.045308,0.028444,0.02233,0.029852,0.023353,0.0152,0.02471,0.034692,0.02523,0.019514,0.018543,0.014737,0.021034,0.024381,0.064059,0.125607,0.119366,0.084258,0.045582,0.032172,0.037226
0.036657,0.077638,0.07314,0.053126,0.064634,0.056072,0.052252,0.050156,0.034356,0.026075,0.029211,0.02262,0.018822,0.027219,0.033398,0.028252,0.026934,0.021589,0.014573,0.02528,0.031719,0.067131,0.141094,0.116376,0.067253,0.043687,0.032854,0.041122
