0.007723,0.007754,0.01312,0.018887,0.015851,0.010487,0.008938,0.008614,0.013376,0.02719,0.035199,0.02874,0.021151,0.025604,0.037402,0.035343,0.022682,0.017475,0.021395,0.021654,0.019568,0.021215,0.016723,0.010583,0.0091,0.009769,0.019434,0.048594
0.009489,0.009506,0.015973,0.022943,0.019208,0.012771,0.011127,0.010707,0.0165,0.03393,0.044543,0.037063,0.027133,0.032663,0.048171,0.04566,0.029665,0.022866,0.027419,0.02746,0.024881,0.027105,0.021047,0.013032,0.011207,0.011958,0.023546,0.058167
0.012909,0.012893,0.021445,0.030664,0.0254,0.016774,0.015092,0.014604,0.022594,0.047824,0.063438,0.053073,0.038066,0.044961,0.06783,0.066434,0.045,0.034062,0.038124,0.036965,0.033703,0.036845,0.027874,0.016809,0.014802,0.015993,0.031202,0.076339
0.017023,0.017189,0.028721,0.040569,0.03241,0.020588,0.019174,0.018677,0.030381,0.06705,0.087267,0.071066,0.049728,0.055586,0.086678,0.092622,0.067645,0.048408,0.046926,0.042801,0.039411,0.04284,0.031618,0.01903,0.017976,0.020962,0.040524,0.098038
0.022115,0.022801,0.037947,0.051219,0.039261,0.024602,0.023045,0.022344,0.040435,0.094554,0.122385,0.095568,0.063473,0.064508,0.105137,0.12663,0.09796,0.065228,0.054068,0.04551,0.041436,0.043662,0.032101,0.020408,0.020963,0.027916,0.055706,0.132435
0.027494,0.028675,0.047402,0.060293,0.044864,0.028813,0.026453,0.02568,0.053881,0.132947,0.173984,0.132896,0.084056,0.076785,0.125635,0.164053,0.130243,0.082502,0.062474,0.050002,0.043916,0.044484,0.034279,0.023747,0.024898,0.036358,0.07712,0.182034
0.032209,0.034085,0.057529,0.069423,0.049384,0.03162,0.028807,0.02918,0.07072,0.182356,0.238688,0.181192,0.113689,0.09496,0.144959,0.190407,0.153194,0.097942,0.072403,0.056397,0.050273,0.054407,0.044866,0.029693,0.028827,0.043823,0.102609,0.247998
0.035557,0.039261,0.070799,0.081939,0.054595,0.033109,0.029619,0.032038,0.08889,0.23833,0.306524,0.228704,0.145408,0.116149,0.156365,0.192122,0.160613,0.115074,0.084511,0.061031,0.058385,0.071681,0.061128,0.036606,0.03096,0.047665,0.123865,0.309516
0.038957,0.044999,0.085422,0.094647,0.059479,0.035448,0.030753,0.033114,0.105636,0.295189,0.366845,0.266098,0.175866,0.13692,0.158916,0.174815,0.15362,0.129112,0.097507,0.065525,0.064121,0.086003,0.075157,0.042446,0.032223,0.048511,0.133615,0.350399
0.041658,0.049828,0.095826,0.10265,0.06253,0.037922,0.032073,0.033079,0.1181,0.337981,0.40677,0.291377,0.200843,0.151391,0.160248,0.162021,0.141854,0.130064,0.10445,0.070801,0.066952,0.091153,0.080751,0.045001,0.033589,0.048699,0.133554,0.362403
0.039605,0.050263,0.096452,0.099489,0.05854,0.036273,0.031368,0.032558,0.117735,0.335133,0.392099,0.277219,0.199413,0.151319,0.160097,0.161467,0.134104,0.119278,0.102449,0.076565,0.069286,0.087506,0.076305,0.042314,0.032561,0.045656,0.128154,0.353015
0.032864,0.045114,0.084664,0.084491,0.047875,0.030424,0.02835,0.029383,0.096608,0.271053,0.31825,0.227227,0.168897,0.13432,0.150594,0.158048,0.122908,0.104283,0.102272,0.084133,0.070112,0.079406,0.065982,0.035516,0.027874,0.037152,0.110653,0.305075
0.026179,0.037581,0.065278,0.064222,0.037868,0.02579,0.024844,0.024024,0.066145,0.184797,0.234109,0.181642,0.135274,0.110819,0.128205,0.138523,0.105062,0.089738,0.104483,0.090793,0.065818,0.069749,0.057896,0.030544,0.023664,0.028913,0.081282,0.217407
0.022836,0.03251,0.05173,0.050194,0.031637,0.023528,0.023032,0.02122,0.052227,0.139467,0.17936,0.14085,0.102126,0.087827,0.109084,0.121791,0.094205,0.07927,0.097527,0.087834,0.059024,0.062808,0.055041,0.02889,0.020577,0.024307,0.057025,0.141488
0.022603,0.030978,0.047637,0.043998,0.02748,0.022118,0.022207,0.0211,0.055468,0.141719,0.166592,0.116816,0.081719,0.083192,0.12487,0.13895,0.104334,0.082214,0.08476,0.073272,0.057175,0.068968,0.061347,0.030675,0.018955,0.022839,0.0483,0.11503
0.026582,0.037959,0.06357,0.056289,0.031717,0.026009,0.025899,0.024233,0.07827,0.208495,0.233701,0.152502,0.10465,0.109394,0.176157,0.19304,0.146264,0.115967,0.08951,0.066044,0.065342,0.088477,0.081115,0.041985,0.023699,0.027556,0.059026,0.153381
0.033843,0.051008,0.092089,0.080679,0.041682,0.032819,0.032786,0.030311,0.120306,0.333894,0.375859,0.245538,0.167583,0.16661,0.258043,0.284313,0.22315,0.178217,0.128678,0.090261,0.085077,0.109834,0.105637,0.059917,0.034223,0.038788,0.086939,0.247485
0.042964,0.064298,0.116238,0.100612,0.050078,0.038191,0.037974,0.037654,0.177107,0.492147,0.561372,0.377098,0.25734,0.239405,0.338926,0.375481,0.305889,0.242932,0.174382,0.122967,0.106865,0.124832,0.122846,0.076575,0.045601,0.051201,0.124783,0.386396
0.050158,0.069393,0.119887,0.104709,0.055123,0.041943,0.042492,0.04768,0.233253,0.638919,0.743575,0.51798,0.355479,0.30658,0.378598,0.416247,0.351501,0.277931,0.199511,0.144242,0.120036,0.12321,0.121419,0.083495,0.053171,0.059433,0.164504,0.548533
0.056205,0.065606,0.104487,0.097067,0.061204,0.047156,0.048071,0.058257,0.26592,0.718531,0.850356,0.603373,0.416792,0.343446,0.366837,0.383747,0.332385,0.275166,0.198861,0.142343,0.116694,0.100378,0.097247,0.078584,0.057367,0.062803,0.191273,0.671694
0.057686,0.060293,0.090958,0.09037,0.066257,0.052744,0.052204,0.063102,0.259633,0.690191,0.819662,0.579281,0.399241,0.333476,0.335909,0.318563,0.27812,0.256912,0.183052,0.121064,0.101183,0.072687,0.066889,0.069833,0.059915,0.059708,0.187385,0.683222
0.054331,0.060037,0.091039,0.088276,0.063943,0.054315,0.051874,0.057546,0.214287,0.558589,0.675176,0.488378,0.330281,0.284964,0.303365,0.275578,0.228633,0.213004,0.149554,0.095012,0.082277,0.059188,0.051064,0.05848,0.054309,0.050041,0.154694,0.563972
0.049295,0.06496,0.093951,0.085322,0.057645,0.049113,0.045218,0.044986,0.153359,0.415938,0.547499,0.432323,0.287674,0.248606,0.285407,0.252227,0.181702,0.151737,0.10765,0.072327,0.062276,0.046926,0.042675,0.045569,0.042111,0.041648,0.148563,0.476744
0.047655,0.070725,0.099031,0.087614,0.055924,0.042341,0.037131,0.037569,0.1141,0.339444,0.486628,0.421456,0.291984,0.23514,0.255226,0.216243,0.14179,0.101677,0.075203,0.058246,0.04862,0.039025,0.039752,0.037555,0.033723,0.039563,0.181651,0.506293
0.045342,0.068086,0.092533,0.080594,0.053216,0.040147,0.036126,0.036921,0.1022,0.320579,0.444633,0.38318,0.291259,0.21945,0.194473,0.158281,0.110018,0.074577,0.058888,0.050243,0.041127,0.035615,0.037482,0.034941,0.032706,0.03783,0.221396,0.63692
0.043438,0.063612,0.078229,0.065253,0.047292,0.041127,0.041509,0.040015,0.111567,0.316926,0.370929,0.288464,0.263178,0.208672,0.144063,0.108446,0.086427,0.058716,0.046549,0.044057,0.037456,0.035045,0.035632,0.032866,0.034032,0.038052,0.259494,0.807131
0.046783,0.060989,0.068417,0.055158,0.04148,0.040337,0.044703,0.040182,0.120584,0.316004,0.312832,0.204509,0.237379,0.221598,0.1373,0.094456,0.083118,0.061325,0.043952,0.04605,0.043485,0.038432,0.035949,0.033281,0.037765,0.04176,0.278951,0.906148
0.049034,0.055819,0.062929,0.050001,0.036248,0.036932,0.042956,0.036768,0.116142,0.296109,0.282341,0.169679,0.217837,0.232161,0.150417,0.094458,0.081087,0.067608,0.045375,0.047647,0.047749,0.040627,0.037722,0.035616,0.039464,0.04298,0.259524,0.856779
0.048459,0.051129,0.067963,0.052098,0.034646,0.035902,0.038581,0.035122,0.103048,0.244139,0.241956,0.148414,0.178352,0.199821,0.142578,0.093451,0.074449,0.064599,0.043777,0.04439,0.043892,0.037588,0.037268,0.035096,0.036256,0.039219,0.20708,0.681086
0.052098,0.055475,0.087078,0.065694,0.038457,0.038697,0.037661,0.039627,0.091107,0.190477,0.197417,0.12952,0.134475,0.142987,0.115104,0.086793,0.070815,0.059522,0.041079,0.041211,0.042064,0.039403,0.041009,0.036593,0.034945,0.036585,0.151252,0.473766
0.059696,0.064741,0.107211,0.084255,0.048712,0.047118,0.045779,0.050528,0.080871,0.146839,0.165557,0.117857,0.096922,0.092434,0.083243,0.076366,0.072565,0.057274,0.044716,0.050098,0.052569,0.051405,0.053088,0.046677,0.040896,0.035635,0.099036,0.342072
0.060834,0.066265,0.113629,0.094598,0.058464,0.055586,0.051526,0.056616,0.067397,0.095218,0.121714,0.106713,0.08436,0.072434,0.064938,0.069754,0.075996,0.059456,0.052572,0.062739,0.064021,0.062475,0.063555,0.054669,0.044697,0.033699,0.07081,0.317398
0.050739,0.05871,0.1018,0.086849,0.058005,0.054786,0.046498,0.050847,0.06099,0.07213,0.087913,0.09105,0.079092,0.069122,0.060376,0.070249,0.084021,0.064443,0.05865,0.066996,0.06352,0.061282,0.061666,0.052981,0.041756,0.034138,0.069608,0.296933
0.034339,0.047281,0.078199,0.063903,0.046306,0.043994,0.034234,0.039089,0.055565,0.08435,0.104326,0.102851,0.088454,0.071151,0.057041,0.069796,0.085413,0.066776,0.0648,0.06497,0.052276,0.047883,0.046661,0.042135,0.035105,0.033967,0.06888,0.23485
0.023993,0.037702,0.05445,0.045427,0.037349,0.036999,0.027256,0.030565,0.04799,0.098968,0.14496,0.146544,0.11957,0.090334,0.06861,0.075282,0.090299,0.074954,0.078402,0.075534,0.051035,0.039945,0.031418,0.028795,0.027577,0.031093,0.061245,0.170567
0.023816,0.033721,0.03653,0.033563,0.03323,0.035477,0.026179,0.025235,0.040894,0.105492,0.179548,0.18654,0.144217,0.106549,0.086463,0.091824,0.110365,0.08831,0.088577,0.086169,0.056188,0.040357,0.024757,0.019539,0.019024,0.025066,0.052042,0.136036
0.027014,0.035567,0.029065,0.023653,0.029238,0.033334,0.024901,0.022817,0.033404,0.103082,0.18874,0.194726,0.143216,0.103709,0.097453,0.107228,0.123891,0.102395,0.095316,0.087932,0.061044,0.041871,0.024128,0.018457,0.017761,0.022962,0.048767,0.117013
0.026619,0.036609,0.02809,0.022586,0.030833,0.030759,0.024244,0.027824,0.040247,0.109893,0.169863,0.160866,0.117287,0.083064,0.09129,0.108621,0.119082,0.111697,0.098057,0.082703,0.071232,0.044873,0.023049,0.019066,0.018789,0.026162,0.051819,0.11765
0.024876,0.033284,0.028673,0.029508,0.032819,0.026013,0.022681,0.033238,0.050949,0.113093,0.130981,0.105611,0.091201,0.065762,0.070553,0.097959,0.111911,0.113608,0.099372,0.085152,0.078417,0.04956,0.024959,0.019695,0.019239,0.029843,0.049602,0.111428
0.030471,0.035889,0.031563,0.037311,0.039975,0.028551,0.027893,0.040897,0.05864,0.105089,0.097661,0.070137,0.066547,0.050499,0.058624,0.090892,0.113999,0.106804,0.090399,0.087531,0.07606,0.050973,0.030556,0.027865,0.022971,0.034667,0.046677,0.100793
