0.000334,5e-05,6.9e-05,-0.000133,-5.1e-05,-0.000114,5.4e-05,8.9e-05,-7.2e-05,1.9e-05,6.5e-05,-7.4e-05,-1.1e-05,-8e-05,-0.000314,-0.000182,-9e-05,-0.000114,-0.000178,-0.000117,-0.000128,-3.2e-05,-0.00012,4.8e-05,5.2e-05,8e-06,7.2e-05,0.000178,-4.4e-05,4.4e-05,0.000116,1.8e-05,0.000105,4.4e-05,-4.8e-05,4.9e-05,-3.3e-05,0.000101,6e-05,0.000128,0.000105,-7e-06,0.000107,1.4e-05,3.8e-05,4e-06,-1.9e-05,-2.8e-05,2.5e-05,7.6e-05,3.2e-05,2.6e-05,5.5e-05,0.000101,-3.3e-05,0.000119,0.000175,0.000177,-2.5e-05,-9.4e-05,0.000116,0.000287,0.000102,4.1e-05,-0.000156,-0.000248,-0.00018,-6.9e-05,-0.000143,-0.000229,-4.9e-05,-4.4e-05,1e-06,-9.2e-05,-0.000229,-9.1e-05,1.7e-05,-7.4e-05,2e-06,0.000117,-0.000137,-0.00011,-3e-05,0.000109,0.000153,-1e-06,-2.2e-05,-1.8e-05,0.000134,-3.6e-05,1.2e-05,2.6e-05,9e-06,-9.7e-05,-6.3e-05,-0.000117,-7.6e-05,-9.5e-05,-5.2e-05,-4.2e-05,-6.5e-05,-0.000166,-0.000187,-1.6e-05,0.000176,9.5e-05,7.1e-05,1.6e-05,-8.4e-05,-0.00016,5e-05,-3e-06,9.8e-05,-3.7e-05,-0.000106,-4.4e-05,-4.2e-05,-0.000139,0.000163,-5.3e-05,1.7e-05
-0.000155,-0.000161,-0.000215,-0.000132,-0.000119,-0.000188,-0.00025,-0.000257,-5.9e-05,-0.000189,-8.2e-05,-6.9e-05,-0.000218,-0.000118,4e-05,0.000103,-7e-05,-2.6e-05,3.2e-05,-3.8e-05,0.000145,-5.2e-05,-4.5e-05,-1.3e-05,0.000161,-0.000167,-4.9e-05,-1.2e-05,-9.2e-05,-0.000132,-0.000236,-1e-04,-0.000145,-0.000162,-5.2e-05,-8.6e-05,-3.1e-05,1e-06,1.4e-05,-4.5e-05,-8.8e-05,1e-05,-0.000124,-2.9e-05,1.9e-05,-0.000112,2.1e-05,-0.000173,-4.1e-05,-4.2e-05,-0.000335,-1e-06,-0.000257,-0.000328,-0.000212,-0.000318,-7.9e-05,-0.000434,-0.000233,-2e-06,-0.000105,-0.000356,-0.000134,-0.000236,0.000118,0.000118,-6.4e-05,-1.5e-05,0.00016,-0.000247,6e-05,-0.000202,-0.000118,-0.000145,-0.000136,-8.6e-05,-0.000218,-0.000156,-0.000224,-0.00012,0,-0.000147,-7e-05,-0.000102,-0.000108,-0.000306,-0.000236,-0.000121,-3.1e-05,-0.000126,-5.2e-05,-0.000222,-0.00035,-9.9e-05,0.000152,6.6e-05,-9.7e-05,4e-06,-3.6e-05,8.2e-05,-1.8e-05,-7.3e-05,-1.2e-05,-9.6e-05,-0.000348,-0.00017,8.1e-05,-0.000235,-0.000115,-0.000101,8.3e-05,-0.000188,-0.000251,-0.000179,-0.000162,-0.000163,-0.000156,1.2e-05,-0.000289,-1e-04,-3e-04
-6.2e-05,-9e-06,-7.1e-05,-0.000169,-0.000101,-2.7e-05,4.1e-05,-4.7e-05,-2.9e-05,-0.000131,-0.00025,-0.000257,-0.000134,-1.2e-05,-9.1e-05,-9.6e-05,-9.9e-05,-0.000101,-2e-06,5.3e-05,-0.000189,-0.000177,-0.000107,-0.000174,-0.000347,-0.000398,-0.000239,-0.000171,-0.000185,-1e-06,-6.6e-05,-7.1e-05,0,2.9e-05,4.2e-05,-0.000259,-0.00011,-9.2e-05,-9.4e-05,-0.000207,-0.000102,-0.000142,-5.2e-05,-1.9e-05,-0.00014,-0.000233,-0.000122,0.000166,0.000119,0.000144,0.000112,0.000113,7.7e-05,5.1e-05,0.000184,-0.000138,1.1e-05,-7.7e-05,8.8e-05,-6.9e-05,-0.000147,-0.000307,-0.000341,-0.000182,-0.000144,-0.000101,0.000211,-5.5e-05,-0.00011,0.000151,-1.1e-05,-7.9e-05,6.5e-05,4.5e-05,-7e-06,3e-06,-0.000137,-8.8e-05,-9.4e-05,-3.3e-05,-3.2e-05,-0.000149,-2.5e-05,-1.5e-05,-0.000231,0.000195,3.6e-05,-0.000176,-6.9e-05,-0.000161,-7.8e-05,-5.5e-05,9.3e-05,-4.3e-05,-0.000258,-0.000253,-3.8e-05,-6.7e-05,-9.4e-05,-8.6e-05,-9.3e-05,1e-06,2.1e-05,9.6e-05,-0.000258,-0.00022,-0.000261,-0.000248,-3.9e-05,0.000108,-7.5e-05,0.000155,-2.3e-05,0.000107,-7.1e-05,5e-05,2.5e-05,8e-06,-6.4e-05,-6.1e-05,6.1e-05
-0.000166,-3.7e-05,-5e-06,0.00016,4e-05,-0.000112,-2.4e-05,-3.3e-05,3.1e-05,0.000109,-5.6e-05,0.000109,-5.9e-05,-0.000115,9.4e-05,0.000121,5.7e-05,-5.4e-05,-5.2e-05,-5.3e-05,6.4e-05,-2.9e-05,4.7e-05,-9e-05,1.5e-05,2.9e-05,-4e-06,-0.000143,0.000169,-2.9e-05,6.9e-05,0.000118,-0.000154,3.2e-05,-5.9e-05,0.000132,2.2e-05,-0.000157,0.000155,-0.00011,-5e-05,-7.6e-05,1.9e-05,-0.000119,-0.000104,7.1e-05,-8.9e-05,-9.4e-05,5.7e-05,-0.000133,2.3e-05,-8.1e-05,-5e-06,0.000182,-8e-06,0.000154,4.2e-05,0.000309,0.000173,0.000114,-5.3e-05,-0.000156,-3e-06,0.000121,0.000103,0,-1e-04,-0.000203,-0.000193,-0.000223,-3.9e-05,0.000106,-6.5e-05,2.4e-05,-1.6e-05,6.5e-05,4.4e-05,0.000187,0.00012,-1.5e-05,-9.3e-05,0.000152,1e-05,1.7e-05,-0.000148,-4.3e-05,-3.7e-05,-1e-04,-0.000145,8.1e-05,-9.7e-05,-1.8e-05,-0.000184,-9.2e-05,-7.5e-05,-0.000144,-0.000117,8e-05,2.3e-05,4e-05,-8.2e-05,1.5e-05,-9.3e-05,-7.4e-05,0.000211,2.1e-05,7.6e-05,0.000147,2.1e-05,-5.4e-05,-7.4e-05,1.3e-05,9.1e-05,-1e-04,7.3e-05,-7.2e-05,6.6e-05,6.5e-05,5.9e-05,1.4e-05,-1.9e-05
-0.000108,-3e-05,-2.1e-05,6.2e-05,-6e-06,9.6e-05,-3e-06,-5.9e-05,-3e-05,-4.4e-05,0.000124,8.4e-05,0.000148,0.000228,-1.8e-05,-0.000149,-1e-05,2.9e-05,5.2e-05,-8e-06,-6.3e-05,8.9e-05,0.000164,0.000129,7.8e-05,0.000121,0.000139,2.7e-05,-4.2e-05,-6.2e-05,0.000129,-0.000129,8.6e-05,3.4e-05,4.7e-05,8.4e-05,7e-05,0.000131,4.8e-05,1.4e-05,4.6e-05,-2.1e-05,-7.6e-05,-5.2e-05,-0.000175,-1.5e-05,0.00025,0.000128,2.6e-05,-6.5e-05,-4.6e-05,1.9e-05,5.7e-05,1.5e-05,-0.000182,-7e-06,-8.7e-05,-0.000114,-8.1e-05,-4.3e-05,2.2e-05,0.000162,0.000235,3e-05,3.2e-05,-8.6e-05,3.2e-05,1.9e-05,0.000171,1.6e-05,-0.000131,1.7e-05,0.000172,7.1e-05,-5.2e-05,4.2e-05,-5.9e-05,-5e-05,1.9e-05,-2.3e-05,4.7e-05,-6.5e-05,4.8e-05,-0.000124,0.000186,9e-06,6.9e-05,0.000224,0.000205,0.000103,5.2e-05,7.6e-05,0.000174,0.000199,8.5e-05,1.6e-05,-2.6e-05,-0.000174,-2.2e-05,-3.8e-05,0.000115,8.9e-05,0.000132,-9.1e-05,3.5e-05,-6.2e-05,-4.3e-05,7.3e-05,0.00013,0.000158,-9.4e-05,-0.000137,-5.4e-05,8.1e-05,-6.1e-05,-3.3e-05,1.9e-05,-3e-05,5.3e-05,0.000125,1e-06
9e-05,6.5e-05,1.9e-05,-6.8e-05,4.6e-05,4.5e-05,5.6e-05,0.000163,7.9e-05,-3.6e-05,2.4e-05,0.000119,8.3e-05,-8.2e-05,6.2e-05,9.9e-05,4e-05,5.4e-05,5.6e-05,6.8e-05,-2.2e-05,-4.9e-05,-0.000119,2.9e-05,0.000101,4e-05,3e-05,3.2e-05,-8.8e-05,0.000127,-2.2e-05,-7.7e-05,-3.7e-05,-2.3e-05,1e-06,-1.2e-05,0.000106,-3e-05,-5e-06,6.5e-05,-7.9e-05,1.5e-05,-1.2e-05,0.000116,0.000167,0.000112,2.7e-05,8.4e-05,-4.6e-05,-2.6e-05,-1.8e-05,-3e-06,-2.4e-05,-0.000134,3.9e-05,2e-06,-7e-05,-6.5e-05,-0.000207,-0.000134,4e-06,5.9e-05,7e-06,4e-06,-8.3e-05,0.000103,-8e-06,-3e-06,3.7e-05,-5.2e-05,-9.9e-05,1.9e-05,1.4e-05,-0.000147,5.5e-05,-0.000137,7.6e-05,3.2e-05,-5.6e-05,-4.5e-05,0.000117,9.9e-05,3.7e-05,1.6e-05,1e-04,0.000121,-5.6e-05,-8.9e-05,-3.9e-05,-4.2e-05,-2.6e-05,-7.6e-05,6.4e-05,-6.6e-05,4e-05,0.000249,0.000154,8e-05,-5.3e-05,5.2e-05,-1.4e-05,4.2e-05,-0.00011,-1.6e-05,-3.2e-05,0.00016,0.000106,3.9e-05,7.5e-05,-6e-05,1.5e-05,-0.000103,-4.8e-05,-3.7e-05,0.000122,0.000171,-3.6e-05,-3.9e-05,-2.8e-05,-0.000122,4.2e-05
1e-04,7e-05,8.9e-05,-2.9e-05,6e-06,1.6e-05,-3.3e-05,4e-06,0.000103,4.6e-05,-6.6e-05,-0.000112,5.6e-05,2.3e-05,-7.3e-05,-2.8e-05,0,1.1e-05,-1.3e-05,-6e-05,-9.2e-05,3.8e-05,-6.7e-05,9.8e-05,1.5e-05,7.7e-05,-5e-05,0.00011,-8e-05,-1.5e-05,2e-05,8.7e-05,-0.000125,-0.000139,4.8e-05,2.5e-05,-2.9e-05,-4.9e-05,-3e-05,3.2e-05,-1e-04,8.7e-05,-3.4e-05,-5e-06,-1.3e-05,-4.6e-05,1e-05,-3.6e-05,2.9e-05,-5.5e-05,7e-06,-6.9e-05,-7e-05,0.000147,2.9e-05,0.000103,6.6e-05,-8.4e-05,9e-05,3.4e-05,-3.2e-05,-3.2e-05,-3.3e-05,-5.9e-05,3.5e-05,5.7e-05,-9e-06,9.3e-05,5.7e-05,3.4e-05,3.9e-05,-7e-06,-9.5e-05,1.6e-05,3.5e-05,4.9e-05,-6.3e-05,3.1e-05,0.000161,2e-05,-0.00012,-7.1e-05,-0.000106,6e-06,-0.000117,8.4e-05,-2e-06,-5.8e-05,-1.3e-05,5.4e-05,7.6e-05,-2.2e-05,-1.3e-05,-1.6e-05,2.4e-05,-7.4e-05,-6e-05,-1.7e-05,8.9e-05,2.3e-05,3.3e-05,-7.7e-05,-4.3e-05,-3.4e-05,5.7e-05,0.000177,-6.1e-05,-3.9e-05,-0.000154,-7.3e-05,6e-06,2e-06,2.1e-05,-6.3e-05,6e-06,-0.000117,-4e-06,5e-05,-2.8e-05,-6e-05,2.9e-05
-0.00012,-7.1e-05,-9e-05,3.8e-05,-6.8e-05,1.7e-05,-6.3e-05,-9.9e-05,-0.000146,2.2e-05,-2.2e-05,-9.3e-05,-3.6e-05,-3.1e-05,3e-06,-1.6e-05,2.6e-05,-4.3e-05,-4.6e-05,-2.2e-05,4.6e-05,-0.000136,-2.1e-05,-0.000147,-0.000113,-0.000158,-7.3e-05,1.4e-05,2.1e-05,-7.8e-05,-2.4e-05,3.1e-05,-4.2e-05,2e-05,-5.7e-05,-3.2e-05,-3.1e-05,-3.5e-05,-0.000164,-0.000145,-0.000105,-1.6e-05,7e-05,-5.2e-05,-1.1e-05,-3.8e-05,-0.000124,-1.9e-05,-0.00011,-8.7e-05,-0.000136,0.000102,3.6e-05,7e-06,-1.2e-05,-7.8e-05,0.000116,8e-06,3.9e-05,9.9e-05,-1.7e-05,-1e-05,-1.8e-05,-5.4e-05,-4.7e-05,-8e-06,3e-06,6e-06,-8.1e-05,-2.1e-05,2e-05,-1.6e-05,-5.3e-05,-4e-05,-1.6e-05,-1e-06,-5.2e-05,3e-05,-3.5e-05,-1.2e-05,-4.7e-05,-5.7e-05,2.1e-05,-0.000129,7.2e-05,1.7e-05,-2e-06,6e-06,-0.000111,-7.3e-05,-9.4e-05,-8.8e-05,-7.8e-05,6.1e-05,-9e-05,9.6e-05,2.7e-05,-4.8e-05,-5.5e-05,3.8e-05,-6e-06,3.6e-05,3.2e-05,9.4e-05,2.1e-05,-8.1e-05,-7.4e-05,-7e-05,-8.5e-05,-2.6e-05,-8.4e-05,-3.8e-05,1e-05,3.6e-05,-0.000128,-8.6e-05,-2.8e-05,3.5e-05,4.5e-05,5.3e-05,-1.3e-05
-0.000106,-2.5e-05,-0.000101,4.1e-05,1.4e-05,-3.8e-05,5e-05,7.1e-05,-5e-06,2.4e-05,2.7e-05,2.2e-05,-0.00012,-3.5e-05,-2.2e-05,-2.3e-05,-2.1e-05,-5.8e-05,-2.9e-05,-1.4e-05,-2e-06,-5e-06,-3.5e-05,4.2e-05,2.1e-05,4.8e-05,-1.1e-05,-8e-05,6.6e-05,3.8e-05,-6.9e-05,-5.8e-05,2.9e-05,-1.1e-05,3.3e-05,-2.4e-05,-4.5e-05,3e-06,-2e-05,4.3e-05,2.6e-05,-4e-06,1.3e-05,-4e-06,9e-06,-0.000102,-1e-05,-2e-06,-1e-06,-1e-06,6e-05,-7e-06,-2e-06,-0.000168,-9.4e-05,-8.6e-05,-6.7e-05,-3.7e-05,-7.9e-05,-7.5e-05,3.8e-05,-5.7e-05,-4.6e-05,8.4e-05,9.3e-05,3e-05,5.8e-05,-3.2e-05,-1.5e-05,1e-05,-5.4e-05,-3.9e-05,-2e-06,2e-05,-1.7e-05,1.4e-05,-2.7e-05,-1.3e-05,-0.000103,-8.5e-05,-6.1e-05,3.4e-05,2.4e-05,2e-05,-3.6e-05,-6.9e-05,-6.2e-05,1.3e-05,-2.2e-05,3.3e-05,-2.6e-05,5e-05,2e-05,-0.000111,-1e-05,-0.000149,-5.1e-05,9.3e-05,6e-06,-2.2e-05,-1.4e-05,-5.9e-05,4.1e-05,-0.000123,-9.1e-05,-7.1e-05,-6.2e-05,1.9e-05,0.000101,1.3e-05,-2.4e-05,-6e-06,-3.4e-05,-5e-05,8.5e-05,-2e-06,-1.9e-05,-2.6e-05,-4.3e-05,1e-05,-5.6e-05
6.5e-05,2.8e-05,8.6e-05,-1.6e-05,-1.2e-05,-6.8e-05,-3.4e-05,1.2e-05,4.3e-05,1.6e-05,-1.5e-05,5e-06,0.000107,-5e-06,7.1e-05,1.3e-05,9e-06,7.9e-05,2.4e-05,4.3e-05,-3.1e-05,5e-06,4.7e-05,7.3e-05,1e-05,5e-06,-1.5e-05,-4e-05,1.2e-05,2.9e-05,5.1e-05,-4.5e-05,-7.7e-05,9e-06,8.3e-05,-3e-06,8.1e-05,1.5e-05,2.2e-05,3.6e-05,2.3e-05,-2.3e-05,3.3e-05,-9e-06,-3.1e-05,7e-06,1e-05,3.2e-05,5.1e-05,4.2e-05,2e-05,-5.5e-05,-5.2e-05,7e-06,3.7e-05,2.2e-05,-0.00012,-1.8e-05,1.9e-05,4.3e-05,-2.8e-05,2.4e-05,1.4e-05,6.5e-05,-4.7e-05,-1e-05,-4.3e-05,5.8e-05,-3.6e-05,-1.9e-05,0.000131,-4e-05,-5e-06,4.2e-05,2.8e-05,1.8e-05,3e-05,5.5e-05,-4.2e-05,3e-05,1.3e-05,1.5e-05,-6.7e-05,-2.3e-05,-2e-06,-0.000103,8.7e-05,4.3e-05,8.7e-05,3.7e-05,-2.3e-05,-2e-06,1.2e-05,7.4e-05,5e-05,7.4e-05,-3.2e-05,-6e-06,-2.1e-05,-9.2e-05,8e-06,5.5e-05,-2.4e-05,6e-06,1.8e-05,5.3e-05,7.2e-05,4.7e-05,-6e-06,5.4e-05,2.3e-05,4.2e-05,2.3e-05,-5e-06,1.9e-05,6.4e-05,7e-05,-1.4e-05,-1.5e-05,-2.4e-05,3.4e-05
4e-05,-3e-05,4.2e-05,3.1e-05,4e-06,3.7e-05,4.4e-05,4e-06,-2.1e-05,2.1e-05,-2.3e-05,-1.3e-05,-3e-06,1.7e-05,-3e-06,5e-06,8e-06,-3.2e-05,-3e-06,-3e-05,4e-05,2e-05,-3e-05,-2.4e-05,2.5e-05,3.4e-05,2.9e-05,6.1e-05,2.9e-05,-3e-05,1.7e-05,-5e-06,-1.3e-05,-2.6e-05,-7.4e-05,-5e-06,6.3e-05,1.8e-05,0,3.1e-05,2.3e-05,3.4e-05,-3.1e-05,-1.2e-05,1.6e-05,-2.3e-05,1.9e-05,7e-06,-4e-05,-2.4e-05,-2e-05,-1.4e-05,3.2e-05,-1.3e-05,4.5e-05,0,3.2e-05,7.3e-05,-2e-05,3.7e-05,-4.9e-05,-3.9e-05,-6e-06,-7.1e-05,6e-06,-9e-06,-2.5e-05,2e-05,-4.7e-05,0,6e-06,1e-05,-3.8e-05,-8.6e-05,7e-06,1.2e-05,1e-05,-3.8e-05,7.9e-05,-6e-06,4.7e-05,-7e-06,-5e-06,6.6e-05,-3.7e-05,5.3e-05,1e-06,-1.4e-05,-6e-06,-3.5e-05,1.6e-05,2.3e-05,-2.9e-05,2.2e-05,-1.2e-05,-2.1e-05,1.1e-05,5.9e-05,-1e-05,3.5e-05,-7e-06,-3.2e-05,-1e-06,-3e-06,-4.3e-05,3.4e-05,2e-05,-4.6e-05,6e-06,-3.3e-05,8e-06,-5.9e-05,3e-05,7.3e-05,1e-06,-4.9e-05,-5.2e-05,4e-05,8e-06,-4e-06,7.1e-05
-8e-06,2.3e-05,3.3e-05,-1.1e-05,-2.5e-05,4.9e-05,4e-06,-1.2e-05,1.9e-05,-5.7e-05,2.4e-05,9e-06,-4e-06,-2.2e-05,-4.6e-05,2.9e-05,-1.3e-05,2.6e-05,1.4e-05,1.3e-05,-3.3e-05,-2.4e-05,7e-06,-4.7e-05,2e-06,-9e-06,1.3e-05,1.6e-05,-3.5e-05,-6.4e-05,-2.5e-05,2.3e-05,7.1e-05,2.5e-05,-6.5e-05,-4e-05,-3e-05,-1.5e-05,2.4e-05,8e-06,-5e-06,-7e-06,-3.1e-05,-2.4e-05,1.1e-05,4.4e-05,-4.7e-05,1.1e-05,1.7e-05,-7e-06,7e-06,6.8e-05,1.8e-05,2.8e-05,-1.2e-05,1e-06,4.8e-05,9e-06,8e-06,4.5e-05,1.8e-05,1.6e-05,-9e-06,-9.2e-05,-1e-05,-6e-06,-4e-06,-1.7e-05,3.1e-05,6e-06,-4e-06,7.2e-05,2.9e-05,2e-06,-3.9e-05,-4e-05,-7e-05,1e-06,-1.8e-05,1.2e-05,-2.3e-05,2.6e-05,1.1e-05,8e-06,2e-05,2.8e-05,-2.6e-05,2.8e-05,-3e-05,1.4e-05,4e-05,1.2e-05,-1.8e-05,-3.4e-05,1e-05,3.7e-05,-9e-06,-5.4e-05,-3.6e-05,1.6e-05,4.4e-05,2e-05,-1.3e-05,-2e-06,2.7e-05,-9e-06,8.1e-05,3e-06,-6e-06,-4e-05,1.6e-05,-1.3e-05,4e-06,-1.9e-05,-1.4e-05,4.4e-05,1e-06,9e-06,1.8e-05,1.6e-05,1.3e-05
-1.8e-05,-2.5e-05,1.8e-05,-5e-05,-1e-05,-7.4e-05,1e-06,-2e-06,-3e-06,-9e-06,5e-06,1.8e-05,-4.7e-05,6e-06,4.2e-05,-3.8e-05,-8e-06,-1.6e-05,-6e-06,-8e-06,-6e-06,2.2e-05,-3.5e-05,1e-06,1e-06,3e-06,-3e-06,-1e-05,-4.9e-05,-1.9e-05,-8e-06,1.4e-05,1e-06,-1.8e-05,3.2e-05,3e-06,3e-06,-4.2e-05,6e-06,1.3e-05,-5e-06,-3.5e-05,-2.9e-05,8e-06,4e-06,2.1e-05,3.6e-05,-1.6e-05,-3.8e-05,-3e-06,3e-06,8e-06,-8e-06,5.7e-05,2.6e-05,-1.4e-05,-1.3e-05,-4.4e-05,2.9e-05,-4.3e-05,1.6e-05,-2.8e-05,-2e-06,-1e-05,-1.4e-05,2.5e-05,-3.4e-05,2.1e-05,-1e-05,2e-06,-5.2e-05,-8.9e-05,-8e-06,2.1e-05,7e-06,5e-06,5.9e-05,-6e-06,-1.8e-05,-4e-06,-2e-06,-3.1e-05,-2e-05,-4.6e-05,-5.6e-05,-1.8e-05,-4.8e-05,3e-05,-5e-06,-2.4e-05,-3.6e-05,-4.5e-05,-1.8e-05,2.9e-05,-1e-05,-3.7e-05,1.8e-05,-1.2e-05,3.7e-05,-1.5e-05,-7e-06,-1.7e-05,1e-05,2.3e-05,-2.8e-05,-3.8e-05,-3.4e-05,-1.4e-05,7e-06,4.4e-05,-4.4e-05,1e-05,1.3e-05,1.6e-05,-3.3e-05,-2.2e-05,5e-06,3e-06,-2.7e-05,-2.7e-05,-2e-05
-2.3e-05,1.6e-05,-7e-06,3.2e-05,1e-06,5e-06,-1.6e-05,1.2e-05,-2.7e-05,3.3e-05,7e-06,4e-06,-1.9e-05,-4e-06,-1.6e-05,8e-06,-2e-06,3.3e-05,1.3e-05,1.2e-05,1.5e-05,7e-06,1.7e-05,-1e-06,0,-1e-05,-1e-06,-3.6e-05,6e-06,4.3e-05,2.9e-05,-3e-06,-4.6e-05,5e-06,-1.7e-05,4e-06,1.7e-05,8e-06,-2e-06,-6e-06,2e-06,-3e-05,1.6e-05,2e-05,-9e-06,6e-06,-2.8e-05,-1.2e-05,7e-06,-1.1e-05,6e-06,1.8e-05,-1.4e-05,-1.3e-05,-8e-06,1.1e-05,3.6e-05,-1.7e-05,-6e-06,2e-06,-1.6e-05,1.6e-05,6e-06,1.9e-05,3.1e-05,-1.3e-05,1.7e-05,-1.8e-05,1e-06,2.3e-05,-1.1e-05,5.9e-05,-3e-06,-6e-06,-2.5e-05,-1e-06,6e-06,-1.2e-05,-1.5e-05,3e-06,1.3e-05,-8e-06,1.3e-05,-1.5e-05,-6e-06,-1.5e-05,-4e-06,-3.2e-05,3.5e-05,4e-06,1.1e-05,-7e-06,1.7e-05,1.9e-05,8e-06,3e-06,4e-06,3e-06,0,-1.9e-05,-1.2e-05,7e-06,-1.3e-05,-4.2e-05,-1.2e-05,2.5e-05,-8e-06,-4e-06,-2.4e-05,3e-06,1.1e-05,1.4e-05,-2.2e-05,3.9e-05,4.5e-05,-8e-06,-3e-06,6e-06,1e-06,1.6e-05,1e-06
1.1e-05,-1.4e-05,-4e-06,3e-06,1.6e-05,-1e-06,6e-06,-1.3e-05,1.1e-05,-5e-06,-3e-06,-1.1e-05,3e-06,1.9e-05,2e-05,-1.6e-05,-1e-06,-1.7e-05,-1.2e-05,-4e-06,-4e-06,-2e-06,-7e-06,-6e-06,1.4e-05,7e-06,3e-06,-6e-06,1.9e-05,8e-06,-3.2e-05,-2.5e-05,1e-06,-1.2e-05,1.3e-05,0,-3.9e-05,1.3e-05,-3e-06,-5e-06,5e-06,-5e-06,3.3e-05,8e-06,7e-06,2e-06,-1.4e-05,-1.8e-05,1e-05,1.2e-05,-7e-06,5e-06,8e-06,3e-06,-6e-06,2.3e-05,-3e-06,9e-06,-9e-06,5e-06,2e-06,-1.4e-05,-4e-06,2.1e-05,-1.6e-05,-1.6e-05,1.4e-05,1.7e-05,1e-06,-6e-06,1e-05,1.4e-05,-2e-06,2.1e-05,1.7e-05,5e-06,-1.2e-05,4e-06,-8e-06,-1.5e-05,1.1e-05,1e-05,6e-06,2.3e-05,1.7e-05,2.4e-05,1.8e-05,2.4e-05,3e-06,-4e-06,4e-06,1.9e-05,-6e-06,-2.1e-05,-4e-06,1e-06,1e-06,3.7e-05,1.1e-05,2.6e-05,-7e-06,-1e-05,2.6e-05,1.6e-05,1.9e-05,2e-06,-2e-06,2e-06,1e-06,-7e-06,1.2e-05,-9e-06,-8e-06,-1.5e-05,-1.8e-05,-7e-06,3e-06,-3.4e-05,-2e-06,3e-06,9e-06
-1e-06,1.1e-05,-3e-06,-1.1e-05,-6e-06,2.5e-05,-6e-06,-6e-06,0,4e-06,1e-05,2e-06,1e-05,-1e-05,-2.5e-05,1.5e-05,-2e-06,7e-06,3e-06,-2e-06,-2e-06,1e-06,1.3e-05,-1.7e-05,-8e-06,-3e-06,-1.2e-05,9e-06,1.7e-05,-6e-06,1.4e-05,-3e-06,1.3e-05,1.4e-05,-1.7e-05,2e-06,-8e-06,7e-06,-1e-05,-6e-06,3e-06,-7e-06,-1.4e-05,-9e-06,1.2e-05,-1.2e-05,3e-06,5e-06,-1.9e-05,1e-06,-8e-06,-2.8e-05,-6e-06,1e-05,-1e-06,1e-06,-3.2e-05,1.2e-05,-2e-06,1.4e-05,2.5e-05,-7e-06,-3e-06,2.1e-05,1.6e-05,-2e-06,1e-06,1.4e-05,1.8e-05,1e-06,1.7e-05,-9e-06,1.5e-05,-1.1e-05,1e-06,4e-06,6e-06,-2.5e-05,1.5e-05,8e-06,-1.2e-05,-4e-06,2e-06,1.2e-05,-9e-06,2e-06,5e-06,1e-05,-1.5e-05,-1e-06,5e-06,6e-06,7e-06,7e-06,-6e-06,-5e-06,0,8e-06,-1e-06,-1.2e-05,8e-06,3e-06,-9e-06,2.3e-05,-1.3e-05,-1.3e-05,2e-06,2.5e-05,9e-06,-6e-06,7e-06,-7e-06,-1.2e-05,1.5e-05,-2.2e-05,0,2e-06,1.1e-05,9e-06,-6e-06,4e-06
-7e-06,-8e-06,-8e-06,0,2e-06,-2e-05,0,4e-06,-9e-06,0,-4e-06,-2e-06,-6e-06,3e-06,7e-06,1.1e-05,2e-06,-7e-06,0,-3e-06,-1e-06,-1e-05,-1e-06,1.4e-05,-5e-06,3e-06,6e-06,8e-06,5e-06,5e-06,-1.8e-05,1e-05,-4e-06,-9e-06,1.5e-05,-9e-06,-2.1e-05,-1.4e-05,-1e-05,4e-06,5e-06,-1e-06,1e-06,-3e-06,-4e-06,-2e-06,2.3e-05,-2e-06,4e-06,-4e-06,6e-06,-1e-06,2e-06,-2.1e-05,-9e-06,3e-06,2.5e-05,2e-06,-1.1e-05,9e-06,1.3e-05,-2e-06,2e-06,3e-06,3e-06,4e-06,-8e-06,-2.4e-05,-8e-06,5e-06,-6e-06,-4e-06,0,-5e-06,-1.2e-05,3e-06,1e-06,1e-05,-1e-06,0,-2e-05,1e-06,-6e-06,3e-06,1.2e-05,6e-06,-3e-06,-2.8e-05,1.1e-05,0,-4e-06,-2e-06,9e-06,2e-06,7e-06,1.2e-05,-1e-06,-1e-05,-5e-06,5e-06,-5e-06,0,-1e-06,-5e-06,1e-05,-2.4e-05,2e-06,0,5e-06,2e-06,-5e-06,-9e-06,4e-06,0,2.1e-05,1e-06,-8e-06,9e-06,-1.3e-05,0,-8e-06
-7e-06,3e-06,2e-06,-1.4e-05,2e-06,1.2e-05,5e-06,-1e-06,7e-06,-1.3e-05,-6e-06,-7e-06,3e-06,2e-06,-9e-06,-1.7e-05,0,6e-06,-3e-06,2e-06,5e-06,5e-06,3e-06,0,5e-06,1e-06,0,-1.6e-05,-1.3e-05,6e-06,3e-06,3e-06,-5e-06,2e-06,1e-06,4e-06,1.4e-05,1.5e-05,2e-06,-2e-06,5e-06,-6e-06,-2e-06,2e-06,-4e-06,-1e-05,-9e-06,4e-06,5e-06,1e-06,-4e-06,1e-05,-1e-06,-6e-06,4e-06,-3e-06,8e-06,6e-06,1.6e-05,-1e-05,-1.2e-05,0,-3e-06,-4e-06,1e-06,3e-06,0,5e-06,-3e-06,-3e-06,-1.4e-05,-4e-06,-7e-06,1e-06,4e-06,-8e-06,-9e-06,-4e-06,-1.3e-05,0,1.7e-05,4e-06,7e-06,-7e-06,-7e-06,-1.3e-05,-3e-06,2e-06,1.4e-05,7e-06,-3e-06,-2e-06,6e-06,-1.1e-05,3e-06,-1.5e-05,0,-5e-06,4e-06,0,-8e-06,-2e-06,-5e-06,-8e-06,-2e-06,0,-7e-06,3e-06,-4e-06,-6e-06,-1e-05,-1e-06,-1e-06,-1e-06,-9e-06,-6e-06,5e-06,-5e-06,4e-06,4e-06,-6e-06
8e-06,-2e-06,9e-06,-9e-06,-4e-06,-5e-06,0,-1e-06,-4e-06,2e-06,2e-06,-3e-06,2.1e-05,-6e-06,-6e-06,3e-06,-1e-06,-1e-06,5e-06,0,-6e-06,-5e-06,-4e-06,-1e-06,-5e-06,0,0,-2e-06,-1.1e-05,-4e-06,5e-06,-2e-06,1.1e-05,0,-2e-06,-4e-06,2e-06,-4e-06,5e-06,-1e-06,0,1e-06,5e-06,-4e-06,1e-06,-7e-06,1e-05,4e-06,-5e-06,-6e-06,0,3e-06,0,-2e-06,1e-06,-3e-06,-1.6e-05,-2e-06,-6e-06,-1.7e-05,7e-06,-3e-06,-1e-06,-1.2e-05,1e-06,-6e-06,-2e-06,4e-06,-3e-06,7e-06,-1e-06,-9e-06,2e-06,-4e-06,-1e-06,1e-06,4e-06,-2e-06,1e-06,2e-06,3e-06,3e-06,0,5e-06,1e-05,-1.5e-05,3e-06,6e-06,-1.2e-05,-4e-06,-3e-06,3e-06,-4e-06,3e-06,-3e-06,1.2e-05,-4e-06,-5e-06,2e-06,-8e-06,6e-06,2e-06,5e-06,1e-06,-3e-06,1.4e-05,2.2e-05,0,1.2e-05,-3e-06,3e-06,0,-1e-06,-2e-06,5e-06,4e-06,-6e-06,0,-7e-06,-6e-06,3e-06
6e-06,2e-06,2e-06,1e-06,2e-06,7e-06,1e-06,-4e-06,7e-06,3e-06,3e-06,7e-06,-5e-06,5e-06,1e-06,-1e-06,4e-06,-3e-06,-1e-06,-1e-06,1e-06,4e-06,-1e-06,-8e-06,1e-06,3e-06,3e-06,1.1e-05,-4e-06,-9e-06,-1e-06,-1e-05,-3e-06,-3e-06,-2e-06,1e-06,-7e-06,-5e-06,6e-06,0,-1e-06,6e-06,5e-06,-4e-06,6e-06,4e-06,2e-06,5e-06,2e-06,0,2e-06,-1.4e-05,-4e-06,-6e-06,6e-06,0,2e-06,-4e-06,2e-06,-1e-06,5e-06,-3e-06,1e-06,-1e-06,-2e-06,1e-06,5e-06,-1.1e-05,1e-06,-5e-06,-4e-06,5e-06,-1e-06,1.1e-05,7e-06,-2e-06,-5e-06,9e-06,7e-06,2e-06,-3e-06,-6e-06,-2e-06,1e-06,-1.2e-05,2e-06,-6e-06,-1.5e-05,-4e-06,4e-06,8e-06,-8e-06,0,4e-06,0,-2e-06,0,0,-8e-06,-1e-06,-4e-06,1e-06,-4e-06,-7e-06,3e-06,-1.1e-05,-1e-06,-4e-06,-5e-06,6e-06,8e-06,7e-06,2e-06,4e-06,-7e-06,1e-06,0,-6e-06,2e-06,0,2e-06
-1.1e-05,-2e-06,0,3e-06,-4e-06,0,-1e-06,3e-06,-1e-06,-1e-06,-3e-06,2e-06,5e-06,-7e-06,-3e-06,3e-06,1e-06,4e-06,2e-06,1e-06,-1e-06,-5e-06,-1e-06,9e-06,-2e-06,-2e-06,2e-06,5e-06,6e-06,2e-06,-2e-06,-2e-06,-9e-06,2e-06,1.7e-05,-2e-06,4e-06,-1e-06,4e-06,0,1e-06,2e-06,7e-06,-1e-06,-1e-06,2e-06,2e-06,-2e-06,-3e-06,1e-06,-1e-06,0,1e-06,1.2e-05,-3e-06,-7e-06,1e-06,-1e-06,-2e-06,8e-06,-5e-06,0,-2e-06,1.1e-05,-1e-06,4e-06,-1e-06,5e-06,-4e-06,5e-06,2e-06,-3e-06,-3e-06,4e-06,-4e-06,2e-06,4e-06,-4e-06,-2e-06,-2e-06,-2e-06,2e-06,-2e-06,-3e-06,9e-06,7e-06,-2e-06,3e-06,6e-06,-2e-06,-2e-06,1e-06,-2e-06,-9e-06,2e-06,5e-06,-2e-06,-1e-06,6e-06,7e-06,2e-06,0,7e-06,1.5e-05,-1e-06,-4e-06,-2e-06,0,-8e-06,3e-06,-8e-06,-6e-06,-6e-06,0,-1e-06,-1e-06,6e-06,2e-06,-1e-06,4e-06,-6e-06
-1e-06,2e-06,-3e-06,-1e-06,1e-06,5e-06,-2e-06,2e-06,-7e-06,1e-06,0,0,-7e-06,6e-06,1.4e-05,-2e-06,-1e-06,-2e-06,1e-06,-1e-06,0,9e-06,0,2e-06,1e-06,-1e-06,-2e-06,-5e-06,8e-06,5e-06,1e-05,7e-06,8e-06,-3e-06,-7e-06,-1e-06,4e-06,6e-06,0,-1e-06,1e-06,-1e-06,-4e-06,3e-06,-3e-06,7e-06,-8e-06,-1e-06,-1e-06,-2e-06,1e-06,2e-06,0,7e-06,0,0,-3e-06,-4e-06,-2e-06,-5e-06,1e-06,-2e-06,-1e-06,3e-06,1e-06,2e-06,1e-06,-7e-06,-4e-06,-1e-06,-1e-06,5e-06,0,-9e-06,2e-06,2e-06,4e-06,7e-06,1e-06,2e-06,5e-06,0,5e-06,-1e-06,-4e-06,-7e-06,2e-06,0,3e-06,2e-06,-3e-06,-1e-06,-3e-06,5e-06,-1e-06,-8e-06,4e-06,2e-06,-5e-06,1e-06,-1e-06,-3e-06,-1e-06,-7e-06,-3e-06,3e-06,-7e-06,-4e-06,-1e-06,4e-06,1e-06,-1e-06,4e-06,-1e-06,1.2e-05,-7e-06,-4e-06,4e-06,1e-06,-2e-06,-6e-06
3e-06,-1e-06,-6e-06,3e-06,-1e-06,-1e-05,1e-06,-2e-06,6e-06,0,2e-06,1e-06,4e-06,-4e-06,-9e-06,-3e-06,1e-06,1e-06,-2e-06,1e-06,2e-06,-6e-06,2e-06,-5e-06,1e-06,1e-06,1e-06,-4e-06,3e-06,-6e-06,-4e-06,3e-06,0,3e-06,-3e-06,2e-06,-3e-06,-3e-06,-4e-06,-2e-06,2e-06,2e-06,1e-06,0,1e-06,0,-3e-06,-2e-06,4e-06,2e-06,-3e-06,1e-06,0,0,-1e-06,3e-06,8e-06,4e-06,1e-06,0,5e-06,0,2e-06,-6e-06,-2e-06,1e-06,-4e-06,-1e-06,3e-06,1e-06,1e-06,-1e-06,4e-06,1e-06,2e-06,2e-06,-7e-06,2e-06,-8e-06,-1e-06,3e-06,-3e-06,-4e-06,1e-06,-2e-06,0,2e-06,-7e-06,-3e-06,-2e-06,-2e-06,2e-06,-4e-06,2e-06,-1e-06,7e-06,-2e-06,8e-06,2e-06,-9e-06,1e-06,2e-06,-3e-06,0,3e-06,1e-05,2e-06,2e-06,4e-06,-4e-06,2e-06,-4e-06,-6e-06,3e-06,-1.1e-05,4e-06,2e-06,-1e-06,-2e-06,-1e-06,-1e-06
3e-06,2e-06,-1e-06,2e-06,-1e-06,3e-06,-1e-06,1e-06,-1e-06,-4e-06,0,1e-06,-3e-06,5e-06,3e-06,2e-06,1e-06,-2e-06,0,-2e-06,-4e-06,3e-06,0,-2e-06,-2e-06,-1e-06,0,1e-06,-3e-06,-5e-06,-2e-06,-4e-06,-6e-06,-2e-06,-4e-06,-3e-06,-3e-06,1e-06,-5e-06,0,1e-06,1e-06,-5e-06,-2e-06,2e-06,1e-06,0,0,-5e-06,-2e-06,0,1e-06,-1e-06,3e-06,-1e-06,1e-06,0,1e-06,2e-06,-7e-06,-2e-06,-2e-06,-1e-06,-6e-06,2e-06,1e-06,0,3e-06,3e-06,2e-06,2e-06,4e-06,0,-1e-06,0,-5e-06,5e-06,-1e-06,3e-06,0,-6e-06,3e-06,0,3e-06,0,4e-06,2e-06,-1e-06,-2e-06,1e-06,4e-06,0,-1e-06,-7e-06,0,-2e-06,2e-06,-1e-05,2e-06,2e-06,-3e-06,-1e-06,-2e-06,-4e-06,-3e-06,3e-06,-2e-06,0,0,-3e-06,2e-06,-1e-06,5e-06,-2e-06,3e-06,-4e-06,0,-4e-06,1e-06,2e-06,0
-3e-06,-1e-06,-3e-06,-4e-06,0,3e-06,1e-06,1e-06,-2e-06,1e-06,-1e-06,-3e-06,-3e-06,-3e-06,-3e-06,2e-06,-1e-06,2e-06,-1e-06,2e-06,1e-06,-3e-06,1e-06,7e-06,1e-06,0,-2e-06,4e-06,-7e-06,2e-06,3e-06,-4e-06,1e-06,1e-06,5e-06,1e-06,2e-06,1e-06,-3e-06,1e-06,2e-06,0,2e-06,1e-06,0,-2e-06,3e-06,1e-06,2e-06,-1e-06,0,-1e-06,0,-4e-06,1e-06,4e-06,-8e-06,1e-06,-2e-06,1e-06,1e-06,-1e-06,-1e-06,-5e-06,-2e-06,1e-06,0,-5e-06,-2e-06,-1e-06,-2e-06,1e-06,-1e-06,0,-1e-06,1e-06,-1e-06,3e-06,0,1e-06,-3e-06,-1e-06,2e-06,1e-06,-1e-06,7e-06,-5e-06,-2e-06,2e-06,-1e-06,0,0,0,4e-06,0,1e-06,-2e-06,-4e-06,0,5e-06,2e-06,0,3e-06,4e-06,0,-6e-06,2e-06,0,0,2e-06,-1e-06,2e-06,-4e-06,-3e-06,1e-06,2e-06,-2e-06,0,-1e-06,-1e-06,-2e-06
-3e-06,0,-1e-06,3e-06,1e-06,-4e-06,1e-06,2e-06,1e-06,3e-06,0,-3e-06,-4e-06,2e-06,2e-06,-1e-06,-1e-06,-2e-06,0,-2e-06,0,3e-06,-1e-06,-3e-06,0,1e-06,1e-06,0,-4e-06,5e-06,-4e-06,0,5e-06,-1e-06,-3e-06,-1e-06,8e-06,-2e-06,0,0,1e-06,-4e-06,1e-06,2e-06,-2e-06,-5e-06,-3e-06,0,1e-06,0,-1e-06,-5e-06,0,-5e-06,-2e-06,0,1e-06,1e-06,-2e-06,0,2e-06,-1e-06,1e-06,0,0,-1e-06,3e-06,0,1e-06,2e-06,-4e-06,-5e-06,1e-06,6e-06,-2e-06,-2e-06,-1e-06,-3e-06,0,1e-06,1e-06,0,0,-2e-06,1e-06,2e-06,0,-2e-06,2e-06,-1e-06,-3e-06,-1e-06,1e-06,0,0,-2e-06,2e-06,-1e-06,0,-1e-06,0,-1e-06,-1e-06,2e-06,1e-06,4e-06,0,0,4e-06,-3e-06,-3e-06,2e-06,4e-06,1e-06,-1e-06,-3e-06,1e-06,4e-06,0,-2e-06,-2e-06
1e-06,1e-06,2e-06,3e-06,0,-2e-06,1e-06,-2e-06,-2e-06,-1e-06,2e-06,0,0,0,-2e-06,-1e-06,0,1e-06,0,2e-06,0,-4e-06,0,-4e-06,0,-1e-06,1e-06,-3e-06,3e-06,-1e-06,2e-06,3e-06,-2e-06,0,-2e-06,0,1e-06,0,4e-06,-1e-06,0,-4e-06,1e-06,-1e-06,0,0,3e-06,1e-06,-2e-06,-1e-06,0,-1e-06,0,-1e-06,1e-06,1e-06,4e-06,-3e-06,3e-06,1e-06,1e-06,0,0,5e-06,1e-06,0,-1e-06,2e-06,3e-06,-2e-06,1e-06,2e-06,1e-06,-2e-06,2e-06,1e-06,0,-1e-06,-4e-06,-1e-06,4e-06,1e-06,-2e-06,0,-3e-06,-4e-06,-2e-06,1e-06,-3e-06,-1e-06,1e-06,-1e-06,2e-06,-4e-06,0,1e-06,-1e-06,4e-06,2e-06,-2e-06,0,1e-06,1e-06,-3e-06,-1e-06,5e-06,1e-06,2e-06,0,2e-06,1e-06,-5e-06,-2e-06,-3e-06,3e-06,4e-06,0,1e-06,-1e-06,2e-06,0
3e-06,-1e-06,0,-1e-06,-1e-06,2e-06,-1e-06,0,2e-06,1e-06,-1e-06,1e-06,1e-06,-1e-06,0,-1e-06,-1e-06,-3e-06,0,-1e-06,-1e-06,4e-06,-1e-06,1e-06,0,1e-06,-1e-06,-3e-06,5e-06,-2e-06,0,2e-06,-4e-06,-1e-06,0,0,1e-06,1e-06,3e-06,1e-06,1e-06,-2e-06,1e-06,-1e-06,1e-06,-3e-06,4e-06,-1e-06,2e-06,1e-06,0,5e-06,0,-3e-06,1e-06,1e-06,-1e-06,0,-3e-06,-3e-06,0,0,-1e-06,5e-06,-1e-06,0,1e-06,0,-2e-06,2e-06,3e-06,-1e-06,-3e-06,-1e-06,-2e-06,1e-06,-1e-06,-2e-06,2e-06,1e-06,-1e-06,-2e-06,2e-06,0,4e-06,-5e-06,2e-06,-2e-06,-2e-06,0,0,1e-06,2e-06,3e-06,0,1e-06,0,5e-06,-4e-06,1e-06,0,0,1e-06,1e-06,1e-06,0,2e-06,-1e-06,-6e-06,2e-06,3e-06,-1e-06,1e-06,-1e-06,-6e-06,-1e-06,-1e-06,0,0,0,2e-06
0,1e-06,0,2e-06,0,2e-06,1e-06,1e-06,0,0,0,0,-3e-06,0,5e-06,2e-06,-1e-06,3e-06,1e-06,2e-06,0,-2e-06,1e-06,3e-06,0,0,1e-06,4e-06,2e-06,3e-06,0,-2e-06,4e-06,1e-06,5e-06,-2e-06,1e-06,1e-06,1e-06,-1e-06,1e-06,-2e-06,-4e-06,0,0,2e-06,-2e-06,-1e-06,-1e-06,0,0,1e-06,0,1e-06,1e-06,-3e-06,-1e-06,-1e-06,5e-06,3e-06,-2e-06,-1e-06,1e-06,2e-06,1e-06,-1e-06,-2e-06,0,-1e-06,-1e-06,2e-06,-2e-06,0,-1e-06,0,2e-06,1e-06,-3e-06,0,0,-3e-06,1e-06,0,1e-06,-3e-06,1e-06,0,2e-06,2e-06,-1e-06,2e-06,0,1e-06,0,1e-06,-2e-06,-1e-06,-4e-06,3e-06,-1e-06,-1e-06,1e-06,-2e-06,-3e-06,0,-4e-06,-3e-06,1e-06,1e-06,0,-2e-06,-1e-06,0,1e-06,5e-06,-1e-06,2e-06,-3e-06,0,-2e-06,1e-06
-4e-06,-1e-06,-1e-06,-1e-06,0,-3e-06,0,0,-3e-06,-1e-06,0,1e-06,4e-06,-1e-06,-2e-06,0,1e-06,-1e-06,0,-2e-06,1e-06,2e-06,0,-2e-06,0,0,0,1e-06,-2e-06,1e-06,0,-3e-06,-1e-06,-2e-06,-4e-06,2e-06,-1e-06,-3e-06,-1e-06,0,1e-06,-3e-06,3e-06,1e-06,0,2e-06,-2e-06,-1e-06,0,0,0,-2e-06,0,4e-06,-1e-06,-1e-06,0,1e-06,-4e-06,3e-06,2e-06,-1e-06,0,-3e-06,-1e-06,-1e-06,1e-06,1e-06,0,1e-06,-1e-06,1e-06,1e-06,-2e-06,-1e-06,-3e-06,-1e-06,-1e-06,2e-06,0,2e-06,1e-06,-1e-06,0,2e-06,-1e-06,0,1e-06,1e-06,1e-06,-1e-06,1e-06,0,-3e-06,0,3e-06,1e-06,-1e-06,-1e-06,2e-06,2e-06,-1e-06,-1e-06,5e-06,0,-1e-06,1e-06,0,1e-06,-1e-06,-1e-06,0,-1e-06,-2e-06,0,-1e-06,-1e-06,-2e-06,0,2e-06,0
1e-06,1e-06,-1e-06,-2e-06,-1e-06,3e-06,0,-1e-06,2e-06,1e-06,1e-06,2e-06,-1e-06,0,3e-06,-1e-06,0,0,0,1e-06,-2e-06,-1e-06,0,-1e-06,0,0,-1e-06,-2e-06,-4e-06,-3e-06,2e-06,0,-3e-06,2e-06,1e-06,-1e-06,-2e-06,3e-06,-3e-06,-1e-06,1e-06,-2e-06,-2e-06,-1e-06,-1e-06,1e-06,1e-06,0,1e-06,0,0,-1e-06,1e-06,2e-06,-1e-06,-1e-06,-1e-06,1e-06,2e-06,0,1e-06,-1e-06,-1e-06,-3e-06,0,-1e-06,0,0,0,0,-2e-06,1e-06,-1e-06,3e-06,0,0,0,-1e-06,-1e-06,0,2e-06,-1e-06,0,-1e-06,-1e-06,-2e-06,0,-1e-06,-2e-06,0,-1e-06,-1e-06,0,3e-06,-1e-06,-3e-06,0,-1e-06,0,1e-06,-2e-06,0,1e-06,-2e-06,0,3e-06,-4e-06,0,-1e-06,-1e-06,0,0,2e-06,0,-3e-06,1e-06,0,4e-06,0,0,1e-06
1e-06,-1e-06,0,0,0,0,0,0,-1e-06,1e-06,-1e-06,0,4e-06,0,-4e-06,0,0,0,0,0,1e-06,0,0,1e-06,0,1e-06,0,-1e-06,-2e-06,-2e-06,-4e-06,2e-06,1e-06,-2e-06,2e-06,0,-6e-06,-1e-06,-3e-06,1e-06,0,-1e-06,3e-06,-1e-06,1e-06,2e-06,0,0,-1e-06,-1e-06,0,1e-06,0,2e-06,1e-06,-1e-06,1e-06,-1e-06,-2e-06,-1e-06,-3e-06,0,1e-06,0,0,0,1e-06,1e-06,-1e-06,0,0,0,0,2e-06,0,-1e-06,0,0,-1e-06,0,-2e-06,0,1e-06,1e-06,1e-06,-1e-06,-1e-06,3e-06,-1e-06,0,0,1e-06,-1e-06,0,1e-06,3e-06,0,-1e-06,1e-06,-4e-06,1e-06,0,1e-06,0,0,-1e-06,3e-06,-1e-06,1e-06,0,1e-06,0,-2e-06,0,3e-06,-1e-06,1e-06,1e-06,-1e-06,-2e-06,2e-06
0,1e-06,0,0,0,1e-06,0,0,0,0,0,-1e-06,-1e-06,0,2e-06,0,1e-06,1e-06,0,1e-06,-1e-06,0,0,1e-06,0,-1e-06,0,1e-06,1e-06,2e-06,3e-06,1e-06,2e-06,1e-06,2e-06,0,1e-06,-1e-06,-1e-06,0,0,1e-06,-1e-06,0,0,-1e-06,-2e-06,1e-06,1e-06,0,0,0,0,-1e-06,0,1e-06,2e-06,1e-06,1e-06,0,1e-06,0,0,2e-06,-1e-06,0,-1e-06,2e-06,0,0,1e-06,2e-06,2e-06,-1e-06,-1e-06,1e-06,0,1e-06,0,0,-3e-06,0,-1e-06,0,-1e-06,2e-06,0,2e-06,2e-06,1e-06,2e-06,-2e-06,-1e-06,-2e-06,0,-1e-06,0,1e-06,0,0,-1e-06,0,-1e-06,-1e-06,0,-4e-06,-1e-06,0,2e-06,-1e-06,1e-06,-2e-06,3e-06,-1e-06,-3e-06,-1e-06,-1e-06,-2e-06,0,1e-06,2e-06
-2e-06,-1e-06,0,-1e-06,0,-1e-06,0,0,1e-06,0,0,-1e-06,1e-06,1e-06,-2e-06,1e-06,0,-1e-06,0,-1e-06,-1e-06,0,0,0,0,1e-06,-1e-06,2e-06,3e-06,1e-06,-1e-06,-1e-06,-2e-06,-1e-06,-3e-06,0,1e-06,0,1e-06,1e-06,0,0,0,1e-06,0,-1e-06,1e-06,0,1e-06,0,0,1e-06,0,-3e-06,0,0,-2e-06,-1e-06,-1e-06,2e-06,1e-06,0,-1e-06,1e-06,1e-06,0,0,-1e-06,1e-06,-1e-06,0,0,0,0,1e-06,0,0,1e-06,1e-06,0,1e-06,-1e-06,0,-1e-06,0,4e-06,-2e-06,-1e-06,0,0,-1e-06,1e-06,-1e-06,2e-06,0,0,0,2e-06,-1e-06,3e-06,0,0,0,2e-06,0,-1e-06,1e-06,0,-1e-06,1e-06,-1e-06,-1e-06,-3e-06,0,3e-06,1e-06,1e-06,-1e-06,-1e-06,1e-06,1e-06
0,1e-06,1e-06,0,0,2e-06,0,0,-2e-06,0,0,-1e-06,-1e-06,0,-1e-06,0,0,0,0,0,1e-06,0,0,-2e-06,0,0,0,0,2e-06,-2e-06,-1e-06,-2e-06,-1e-06,0,1e-06,1e-06,-1e-06,2e-06,3e-06,-1e-06,0,0,-1e-06,0,0,-2e-06,0,0,-1e-06,0,0,-1e-06,0,-2e-06,-1e-06,1e-06,-1e-06,0,1e-06,2e-06,-2e-06,0,0,0,0,1e-06,-1e-06,1e-06,0,1e-06,0,0,-1e-06,-2e-06,0,1e-06,0,1e-06,-1e-06,0,2e-06,0,1e-06,0,0,2e-06,1e-06,2e-06,-2e-06,0,-1e-06,-1e-06,-1e-06,0,0,0,0,1e-06,2e-06,0,-1e-06,0,0,0,0,2e-06,-1e-06,0,-2e-06,0,0,0,2e-06,0,-2e-06,0,1e-06,0,1e-06,-2e-06,1e-06
1e-06,-1e-06,1e-06,0,0,-3e-06,0,0,1e-06,-1e-06,0,0,0,1e-06,0,-1e-06,1e-06,-1e-06,0,1e-06,0,-1e-06,0,1e-06,0,0,0,-1e-06,-1e-06,-1e-06,1e-06,0,3e-06,1e-06,0,-1e-06,0,-2e-06,2e-06,1e-06,0,0,0,0,0,-1e-06,1e-06,0,1e-06,0,0,-2e-06,0,-1e-06,0,1e-06,1e-06,0,-1e-06,1e-06,1e-06,-1e-06,0,-2e-06,0,1e-06,1e-06,1e-06,-1e-06,-1e-06,0,0,1e-06,1e-06,1e-06,-2e-06,0,2e-06,-1e-06,0,-1e-06,0,0,0,0,-2e-06,-1e-06,1e-06,0,0,0,1e-06,0,-2e-06,0,1e-06,0,-1e-06,-2e-06,-2e-06,1e-06,0,-1e-06,0,0,0,1e-06,0,0,0,1e-06,0,-2e-06,0,-1e-06,0,-1e-06,2e-06,0,1e-06,1e-06
1e-06,0,0,-1e-06,0,0,0,0,0,0,0,0,-1e-06,0,0,0,0,0,0,0,0,2e-06,0,1e-06,0,0,0,-1e-06,-3e-06,2e-06,0,1e-06,-1e-06,-1e-06,1e-06,1e-06,0,0,0,-1e-06,0,1e-06,1e-06,0,1e-06,0,-2e-06,0,0,0,0,0,0,0,0,-1e-06,0,0,0,-2e-06,0,0,0,-2e-06,0,0,0,-1e-06,1e-06,0,0,0,0,2e-06,0,0,0,1e-06,0,0,-1e-06,-1e-06,-1e-06,0,0,-1e-06,1e-06,-1e-06,2e-06,0,1e-06,0,1e-06,2e-06,0,-1e-06,0,-2e-06,1e-06,-1e-06,0,0,0,-2e-06,0,-2e-06,0,0,0,0,0,0,1e-06,0,4e-06,-1e-06,1e-06,0,0,1e-06,1e-06
0,-1e-06,0,0,0,1e-06,0,0,-1e-06,0,0,1e-06,-2e-06,-1e-06,1e-06,0,0,1e-06,0,0,-1e-06,-2e-06,0,-1e-06,0,0,0,1e-06,-2e-06,1e-06,0,0,-2e-06,1e-06,-2e-06,-1e-06,0,1e-06,-1e-06,1e-06,0,0,0,0,0,1e-06,1e-06,0,0,0,0,2e-06,0,2e-06,0,0,0,1e-06,1e-06,0,-1e-06,0,0,-1e-06,0,0,1e-06,1e-06,1e-06,0,0,-1e-06,-1e-06,0,0,-1e-06,0,1e-06,0,0,0,0,1e-06,0,-1e-06,0,-1e-06,1e-06,0,0,0,0,1e-06,-1e-06,0,1e-06,0,-2e-06,-1e-06,1e-06,-1e-06,0,2e-06,1e-06,0,0,-1e-06,1e-06,-1e-06,-1e-06,0,0,-1e-06,0,-3e-06,1e-06,0,-2e-06,-1e-06,-1e-06,0
-1e-06,1e-06,-1e-06,1e-06,0,0,0,0,1e-06,0,0,1e-06,0,1e-06,-1e-06,0,0,-1e-06,0,-1e-06,1e-06,2e-06,0,-1e-06,0,0,0,1e-06,1e-06,-2e-06,1e-06,0,1e-06,-1e-06,1e-06,0,-2e-06,-1e-06,-2e-06,-1e-06,0,-1e-06,1e-06,0,0,1e-06,0,0,1e-06,0,0,0,0,2e-06,0,-1e-06,1e-06,0,-1e-06,0,1e-06,0,0,2e-06,0,0,-1e-06,-1e-06,-1e-06,0,-1e-06,0,0,0,0,1e-06,0,0,1e-06,0,2e-06,0,0,0,0,0,-1e-06,0,-1e-06,0,-1e-06,0,1e-06,-1e-06,0,0,0,3e-06,0,1e-06,1e-06,0,-1e-06,1e-06,0,3e-06,0,0,1e-06,0,0,-1e-06,0,0,2e-06,-1e-06,0,-1e-06,1e-06,0,-1e-06
1e-06,0,0,0,0,-2e-06,0,0,-1e-06,0,0,1e-06,-1e-06,-1e-06,1e-06,0,0,1e-06,0,1e-06,0,-2e-06,0,1e-06,0,0,0,-1e-06,3e-06,0,0,-1e-06,1e-06,1e-06,0,0,-1e-06,0,-2e-06,1e-06,0,-1e-06,-1e-06,0,0,1e-06,1e-06,0,-1e-06,0,0,-2e-06,0,1e-06,0,0,-1e-06,0,2e-06,0,-1e-06,0,0,2e-06,0,0,0,0,0,0,0,0,0,-2e-06,0,0,0,0,-1e-06,0,-1e-06,-1e-06,-1e-06,0,-1e-06,-1e-06,0,-1e-06,0,0,1e-06,-1e-06,1e-06,2e-06,0,0,0,1e-06,0,0,0,0,0,-1e-06,0,0,-1e-06,0,2e-06,0,0,-1e-06,1e-06,0,-1e-06,0,1e-06,2e-06,-1e-06,1e-06,-1e-06
0,0,0,1e-06,0,2e-06,0,0,0,0,0,0,2e-06,2e-06,0,0,-1e-06,0,0,-1e-06,-1e-06,2e-06,0,-1e-06,0,0,0,-1e-06,1e-06,2e-06,0,-1e-06,-2e-06,0,0,0,2e-06,0,0,-1e-06,0,-1e-06,1e-06,0,1e-06,0,-2e-06,0,0,0,0,0,0,0,0,0,0,0,-2e-06,-1e-06,0,0,0,1e-06,0,0,-1e-06,0,1e-06,-1e-06,1e-06,0,0,-1e-06,0,1e-06,0,-1e-06,0,0,-2e-06,0,1e-06,0,1e-06,-1e-06,-1e-06,0,1e-06,0,1e-06,1e-06,0,-1e-06,0,1e-06,0,0,1e-06,-2e-06,0,0,0,1e-06,0,-2e-06,2e-06,0,-1e-06,0,1e-06,0,-1e-06,0,0,0,0,2e-06,1e-06,-1e-06,-1e-06
0,0,1e-06,1e-06,0,0,0,0,1e-06,0,0,-1e-06,0,-2e-06,0,0,0,0,0,1e-06,0,-2e-06,0,0,0,0,0,0,-1e-06,0,1e-06,0,-1e-06,0,-1e-06,1e-06,1e-06,1e-06,2e-06,1e-06,0,-2e-06,-1e-06,0,0,-1e-06,1e-06,0,1e-06,0,0,0,0,-1e-06,0,0,1e-06,0,2e-06,0,1e-06,0,0,-1e-06,0,0,1e-06,-1e-06,0,0,0,0,0,1e-06,-1e-06,-1e-06,1e-06,-1e-06,-1e-06,0,0,0,0,0,0,1e-06,1e-06,-1e-06,0,0,0,-1e-06,0,-1e-06,0,-1e-06,0,0,-1e-06,0,0,0,1e-06,-2e-06,0,1e-06,-2e-06,0,-1e-06,1e-06,0,0,2e-06,0,3e-06,1e-06,0,-1e-06,-1e-06,0,-1e-06
