0.000186,-0.000182,7.8e-05,-6.8e-05,0.000121,0.000123,7.6e-05,0.000444,-0.000554,-0.000171,-0.011392,-0.00735,-0.00507,-0.002042,-0.000476,0.000398,0.000279,0.000215,0.000266,3e-05,0.000125,0.000214,0.000518,0.000248,-5e-06,0.000102,-9e-06,0.000171,0.000146,0.000206,0.000327,0.000186,0.000306,0.000101,1.9e-05,-0.006774,-0.022976,-0.013954,-0.006233,-0.007589,-0.00355,-0.006097,-0.005858,-0.00353,-0.003094,-0.004016,-0.010064,0.000366,0.004407,-0.000405,-0.00968,-0.007708,-0.01732,-0.014643,-0.007329,-0.007666,-0.018979,-0.012866,-0.012633,-0.016434,-0.011827,-0.010009,-0.025574,-0.01787,-0.022706,-0.023108,-0.014642,-0.013747,-0.017307,-0.011999,-0.000744,-0.021024,-0.019451,-0.015689,-0.019391,-0.012269,-0.011457,-0.009734,-0.006441,-0.005341,-0.008038,-0.008761,-0.006922,-0.004909,-0.004797,-0.001984,-0.003649,-0.000948,-0.002061,-0.003152,-0.002115,-0.000744,-0.000994,-0.000558,-0.000647,-0.000499,-0.000529,-0.000395,-0.000314,-0.000684,-0.000756,0.000537,-0.002523,-0.01225,-0.001218,-0.006957,-0.00305,-0.005525,-0.002299,-0.001599,-0.000729,-0.000498,0.002332,-0.000771,-0.003718,-0.002327,-0.000886,-0.001617,-0.000824,-0.000787,-0.000442
0.000185,0.000257,0.000252,4.1e-05,-0.000181,0.000283,0.000102,9.9e-05,0.000485,0.000217,0.000946,-0.002938,-0.000298,0.000457,0.000268,-0.000165,0.000108,3.2e-05,0.000177,2.6e-05,8.8e-05,0.000327,0.000171,0.000182,9.7e-05,7e-06,0.000393,0.000425,0.000273,-5.9e-05,0.000183,0.000211,9.2e-05,8.5e-05,-5e-06,-0.00115,0.01187,0.008188,0.003505,0.002826,0.001184,0.003189,0.003033,0.000515,1.8e-05,-0.001876,0.006675,0.001123,0.005512,-0.003627,-0.005965,-0.005846,-0.000883,9.9e-05,0.000716,-0.002994,0.004007,0.005339,0.001146,-0.005616,-0.003571,-0.005262,0.002196,0.012587,0.001193,0.002022,5.2e-05,0.002372,0.004053,0.003285,-0.006465,0.001998,0.002074,-0.002383,-3.6e-05,0.000484,-0.003831,-0.00299,-0.001719,6e-04,0.00014,0.004561,0.00261,0.000951,0.000711,0.001043,0.001455,0.001824,-0.000157,-0.000412,-0.001123,-0.00126,-0.000681,-0.000453,-0.000949,-0.000295,-0.000395,-0.000231,0.000105,0.000178,-0.000107,-0.001946,-0.001193,0.005223,0.003075,0.005198,-0.000898,4.6e-05,0.001163,0.001068,0.000325,0.000127,-0.000534,4.5e-05,0.000673,0.000556,-1e-04,0.001045,0.000727,0.000367,0.000545
6.6e-05,2.3e-05,0.000421,0.000413,6.1e-05,0.000137,0.000261,0.000222,-5.2e-05,-0.000204,0.000385,0.003857,0.001701,0.000546,0.000113,-1e-06,0.000252,0.000153,7e-06,2.7e-05,0.000142,0.000176,0.000105,1.8e-05,2.4e-05,2.6e-05,3e-05,9.4e-05,0.00014,-4e-05,3.3e-05,0.000112,0.000188,0.000191,0.00015,-0.00036,-0.006328,-0.00486,-0.001995,-0.000857,-0.000454,-0.000817,-0.000821,0.001848,-0.000804,-0.000901,-0.004612,-0.005318,-0.000788,-0.007847,-0.004442,-0.011447,-0.00566,-0.006975,-0.003338,0.00268,-0.00515,-0.010219,-0.007681,0.004294,0.00037,0.001633,-0.002744,-0.006931,0.002681,-0.000908,0.003373,-0.004565,-0.00538,-0.002401,-0.000901,-0.003262,-0.007607,-0.002471,0.002607,5e-06,-0.000654,-1e-06,9.3e-05,-0.002286,-0.003478,-0.0041,-0.003196,0.000384,-0.000254,-0.000274,-0.000864,-0.000758,-0.000856,-0.001723,-0.000356,0.000336,-0.000166,0.000232,0.000255,0.000546,-0.000148,-7.1e-05,0.000164,3.7e-05,2.1e-05,0.000134,0.000722,-0.000608,0.000161,-0.002789,-0.002188,-0.003662,-0.002063,-0.000485,-0.001093,0.000226,-0.00191,-0.000447,0.000385,0.00027,-0.000209,-0.000885,-0.000565,-0.000177,0.000154
-3e-05,7.9e-05,4e-06,-0.000117,-0.000223,-0.000191,-4.8e-05,0.000132,8.3e-05,6.7e-05,0.000301,-0.001892,-0.001361,-0.000594,-5.5e-05,-0.000212,-0.00016,1.2e-05,-5.6e-05,-8.8e-05,1.1e-05,2e-05,0.000135,7.9e-05,8e-06,8.6e-05,0.000235,-3.7e-05,5.3e-05,6.2e-05,0.000188,0.000216,8.1e-05,4e-06,-0.000115,-0.00015,0.001166,0.003124,0.000882,0.000668,0.000226,0.000718,-0.000122,-0.000789,-0.000845,-0.000789,-0.000823,0.000815,0.001511,-0.002461,0.000744,0.001959,-0.003995,-0.003462,-0.000183,-0.005355,-0.009683,-0.004162,0.002629,0.002567,0.000317,0.004374,-0.000691,0.000241,0.000119,-0.00198,-0.000725,0.000497,0.001822,0.000618,-0.00208,0.00123,0.008276,0.005343,-0.001716,-4e-05,-0.001645,0.001842,0.002742,0.001373,0.003166,-0.00024,0.003053,0.000703,0.000926,0.001245,-0.000219,0.00055,-0.000979,0.001107,0.000302,4.8e-05,-0.000372,-0.000198,0.000282,0.000536,0.000332,0.00051,0.000196,9.2e-05,-1e-06,0.000106,-0.000613,0.000336,0.000812,-0.000533,8.3e-05,0.000537,0.000778,-0.000102,3.3e-05,-0.000919,-0.002291,-0.002069,-0.001203,-0.000577,0.000106,0.000404,0.000133,-1e-06,-0.00035
0.000242,-4.9e-05,0.000303,0.000229,9.8e-05,6.5e-05,-1.5e-05,7.3e-05,0.000296,-5.7e-05,1.3e-05,-0.000432,0.000765,0.000406,3e-05,2.8e-05,0.000102,1e-04,2.7e-05,3.5e-05,-1e-06,4.8e-05,2.5e-05,9.2e-05,4.6e-05,0.000131,0.000172,-6e-06,0.000144,9.9e-05,9.6e-05,0.000273,0.000161,0.000226,6.6e-05,-0.000269,-0.000977,-0.001197,-0.000604,-0.000151,0.000244,-0.000553,0.000692,-0.001037,0.000459,0.001054,-0.000489,-0.000127,0.000884,0.001107,0.001114,-0.004126,0.003943,0.002179,0.00478,-0.000505,0.003381,-0.008367,-0.002981,0.002359,0.003158,-0.001699,0.005343,0.000386,-0.005656,-0.005127,-0.003796,-2.2e-05,0.001165,0.002569,0.005585,0.00077,-0.00136,-0.004907,0.003138,0.000597,0.003474,0.000883,-0.00172,-0.001788,-0.001049,-0.000344,-0.002095,-0.000756,-0.001073,-0.002869,-0.000779,-0.001794,0.000485,0.00011,0.00013,0.00054,0.000383,-9.1e-05,-6.5e-05,0.000169,-0.000138,-0.000386,-0.000632,4.8e-05,0.000183,0.000305,0.000709,-9.8e-05,-0.002311,-0.002643,-0.002234,0.001192,0.000503,0.000154,-0.000416,-0.000204,-0.000327,-0.00067,-0.000339,0.000196,4.3e-05,-0.000506,-0.000596,0.000107,0.00041
5e-06,0.000102,-0.000133,9.8e-05,-0.000102,7.8e-05,6.8e-05,4.1e-05,0.000102,5.7e-05,-5.1e-05,0.001126,-8.1e-05,-7.7e-05,-1e-05,2.9e-05,7e-05,-8.1e-05,2e-06,9.5e-05,0.000138,-1.1e-05,-9e-05,8e-06,3.5e-05,1e-06,2.6e-05,-0.000246,-2.9e-05,-3.4e-05,7.1e-05,5.6e-05,-0.000125,-3.5e-05,4.2e-05,6.6e-05,0.000345,-0.00012,9e-06,-0.000225,-0.00025,0.000848,-0.00087,-0.000115,-0.001,0.00203,-0.000916,0.000199,0.001135,-0.000313,-0.000411,0.006863,-8.8e-05,-0.001023,-0.000395,-0.000431,0.006399,0.011977,0.005699,0.001044,-0.001101,-0.000226,-0.001184,-0.000778,0.000773,0.005164,-0.001945,0.004468,0.002215,-0.000642,-0.000536,-0.001926,0.001211,0.006577,-0.002281,0.001346,0.001739,0.001063,0.000497,0.002466,0.001331,0.000643,0.001675,0.000186,0.000123,0.001405,6.6e-05,0.001342,0.00031,0.000882,0.000524,-0.00052,0.000462,-0.000346,-0.000185,0.000148,-0.000124,0.000127,-0.000144,-6.3e-05,-6e-06,-0.000251,-0.000243,-0.000462,-0.000303,-0.001871,0.000183,5.9e-05,0.000289,-0.00059,-7e-06,-0.00032,0.000573,-0.000762,-0.00032,-7.7e-05,0.00025,0.000379,0.000309,0.000116,-0.00029
5.9e-05,-6.2e-05,-8e-05,-7.6e-05,-0.000103,6.6e-05,-0.000192,-0.000202,-8e-06,-0.000216,5.7e-05,0.000461,-0.000439,-0.000164,-9e-05,4e-05,-8e-06,-0.000148,-5e-06,7.2e-05,-9.3e-05,2.6e-05,-0.000142,-6.1e-05,5.8e-05,-6.6e-05,-2.1e-05,-0.000124,1e-05,2.1e-05,-9.5e-05,4.4e-05,-0.00021,-0.000135,1e-06,-0.00016,0.001482,-0.000253,0.000328,0.000239,0.00057,0.000104,0.000622,0.000687,0.00036,-0.000878,-0.000668,-0.00251,-0.002394,-0.001861,-0.00419,0.000707,-0.003612,0.000742,-0.00215,-4e-04,-0.005382,-0.004502,-0.007974,0.001504,-0.004449,-0.001258,0.001404,-0.001524,-0.006537,-0.001368,0.002624,0.000758,-0.003386,-0.000133,-0.001152,-0.000118,-0.002547,-0.004352,0.003205,0.000887,-0.001725,-0.000933,-0.000428,0.000238,-0.001722,-0.001083,-0.002842,0.000178,0.000797,-0.000548,-0.000364,0.000316,-7.3e-05,0.00014,0.000519,0.00063,-0.000658,-6e-06,-0.000357,0.000129,-7.4e-05,0.000256,-0.000163,-0.00011,1.7e-05,3e-05,-3e-06,-0.000447,-0.000124,0.001192,0.00016,-0.000545,-0.000377,5.8e-05,0.000179,0.00074,-9e-05,-0.00021,0.000392,-0.000311,-0.000522,-9.8e-05,-0.000389,-0.000135,-6.1e-05
5.6e-05,9.4e-05,-8.2e-05,6.7e-05,4.6e-05,0.000105,0.000168,1.4e-05,5.5e-05,-4.7e-05,0.000107,-0.000904,0.000638,0.000316,-6.1e-05,3.4e-05,-4.7e-05,-6e-06,-4.6e-05,-5.7e-05,4.6e-05,4.3e-05,-9e-05,-5.4e-05,-3.8e-05,-1e-05,2.1e-05,-4e-05,6.8e-05,3.7e-05,-0.000127,-3.3e-05,-7.4e-05,-6e-06,0.000108,3.1e-05,-4e-04,0.000517,0.000154,-0.00036,-0.000191,0.00023,-0.00054,8e-05,2e-04,-0.000513,0.001284,0.000169,-0.002152,-0.000137,0.000551,-0.001823,-0.005181,-0.002859,-0.00286,-0.003356,-0.000735,-0.000978,0.002664,0.002172,0.002374,-0.001516,0.000441,-0.001744,0.004884,0.002789,-0.002156,-0.003258,-0.000328,-0.001306,-0.00088,0.000647,0.00167,0.00447,0.001115,-0.001492,0.00054,-4.3e-05,-0.000517,9.6e-05,-0.000271,-0.000302,0.001686,6.9e-05,-0.001071,0.000198,-0.00035,0.000222,-3e-05,-0.000557,-0.000401,-0.000681,4.3e-05,-0.000701,-0.000156,-0.000196,-0.00037,-6e-05,3e-06,-1.4e-05,-0.000147,-5.1e-05,7.1e-05,0.000741,0.000484,-0.00036,0.002407,-0.000492,-0.000761,-0.000721,-0.000243,-1.6e-05,-0.000201,0.000179,4.2e-05,-9.3e-05,0.000505,8.9e-05,6.8e-05,-7.4e-05,-0.000185
0.000106,-6e-06,-5.9e-05,-7.6e-05,-9.5e-05,-5.1e-05,-7e-05,-0.000135,-8.1e-05,-7.8e-05,2.8e-05,0.000301,-0.000173,-0.000126,-8.1e-05,3.4e-05,2.7e-05,-0.00012,-5.5e-05,-2.9e-05,-4e-05,-8e-06,-9.8e-05,-2e-06,3.3e-05,2.4e-05,5.4e-05,-1.7e-05,-3e-05,-1.7e-05,-1.8e-05,1.7e-05,-5.7e-05,-2.5e-05,3.7e-05,-5.1e-05,-0.001068,-0.000163,0.000679,0.000226,-0.000699,-0.000342,-5.9e-05,-0.000277,-9.8e-05,-9.8e-05,0.000437,-0.000588,-0.000439,-0.000555,0.004377,0.00084,0.003008,-0.003195,-0.000301,0.001943,0.001175,-2.6e-05,-0.002475,-0.001995,-0.001438,-0.001875,-0.000529,0.001559,-0.004308,-0.001042,-0.000369,-0.000909,-0.000599,-0.0017,-0.00199,-6.3e-05,-0.001862,-0.002363,-0.001351,-0.000719,0.001641,0.001095,0.000437,-0.000686,-2.4e-05,-0.001145,-0.00131,-0.000481,0.000756,-7.4e-05,0.001138,-8.5e-05,-0.000272,0.000238,-0.000836,0.000114,3.3e-05,0.000479,-8.1e-05,-0.000293,9.5e-05,-9.9e-05,-6.4e-05,-9.2e-05,-0.000209,-3e-06,-9.6e-05,7.3e-05,-0.000299,0.000921,-0.000126,-0.000521,0.000473,0.000449,0.000338,0.000182,-4e-05,0.000473,0.000605,0.000684,0.000167,-0.000148,9.9e-05,0.000306,9e-06
-7e-06,-2.5e-05,-7e-05,8.5e-05,2e-05,6.2e-05,7.9e-05,-2.8e-05,5.5e-05,-1.6e-05,-8.1e-05,-2.4e-05,-0.000552,-0.000269,-6.4e-05,2.2e-05,1.2e-05,-4.7e-05,1e-06,-7.3e-05,-8.8e-05,-1.1e-05,-5.1e-05,-1.9e-05,8e-06,-3.5e-05,2.9e-05,-6.1e-05,-7.6e-05,3.4e-05,1e-06,1e-05,-9e-06,-3.2e-05,-1e-05,6.6e-05,0.000278,5.1e-05,-0.000649,-0.000269,0.000369,0.000224,-0.000134,0.000502,0.000269,-0.00022,-0.000372,0.000402,0.001203,0.000777,0.003543,-0.00038,-0.002892,-0.00015,-0.004353,-0.001086,-0.001714,-0.001537,-0.000404,-0.002143,-0.002168,-0.001091,0.000565,0.000187,0.006327,0.002029,0.001162,-3.8e-05,0.000925,0.001327,-0.001303,0.000584,-0.000424,0.001094,-0.001678,2e-04,-0.000439,-0.000805,-0.000944,0.000695,0.000101,0.000394,0.000887,-0.000162,-0.000581,0.000125,-0.000596,0.000121,-0.000179,-5.7e-05,0.00015,0.000168,0.000449,0.000399,-9.1e-05,0.000102,-0.000239,-0.000148,-5e-05,1.5e-05,0.00013,0.00013,-4e-06,-0.000247,-0.000163,-0.001442,0.000279,-0.000545,0.000346,6.1e-05,0.000226,-0.000176,-0.000186,0.00076,-0.000105,2.1e-05,4.1e-05,0.000126,-0.000184,-0.000212,-4.4e-05
-4e-06,5.9e-05,7.4e-05,5e-06,-2e-06,-1e-05,2.3e-05,-5.8e-05,-3.8e-05,2e-06,2.5e-05,-7.5e-05,0.000512,0.000131,-2.7e-05,1.6e-05,6e-06,-0.000121,-4.5e-05,-1.1e-05,-2e-06,6e-06,-2.7e-05,-2.4e-05,-5e-06,-2e-06,-1.3e-05,-1e-06,-3.7e-05,-4.4e-05,-1.3e-05,2e-05,-5.5e-05,1e-05,-4.5e-05,-4.6e-05,0.000231,-0.000378,0.001547,0.000568,-0.000144,-0.000273,0.000197,-0.000275,-0.000367,0.000474,-0.000208,-8.4e-05,-0.000902,0.000587,-0.000491,0.001172,0.002481,0.001635,-0.00078,-0.000285,-0.001996,0.001062,0.000934,-0.000807,-0.000352,-0.000727,0.001729,-0.00065,-0.004306,-0.001788,0.001642,-0.001,-0.000603,-0.001829,-0.000572,-0.001372,0.003593,-0.000117,0.001961,0.000246,-0.000819,-0.000562,0.001046,-0.000822,-0.000536,0.000393,0.000579,0.000546,0.000384,9.1e-05,0.000491,-3e-05,7.5e-05,-0.000354,6.7e-05,0.000276,-0.000448,-0.000154,-0.000139,4e-06,4.5e-05,-8.9e-05,-2e-04,-7.6e-05,-2.7e-05,6.8e-05,5.6e-05,9.7e-05,-0.000355,0.000537,0.000312,0.001101,-0.000194,-0.000299,-0.000239,-0.00016,-6.7e-05,-0.001292,-0.000402,-0.000165,-3.1e-05,-8.2e-05,5.4e-05,0.000127,-4.2e-05
-5.4e-05,-5.1e-05,-9.2e-05,-2.8e-05,-2.3e-05,-2.3e-05,-3.7e-05,-4.4e-05,-1.9e-05,-3.8e-05,-0.000146,-0.000191,1e-04,0.000135,1.3e-05,2e-05,1e-06,-3.6e-05,-1.6e-05,-3.3e-05,3e-05,-2.2e-05,5e-06,1.1e-05,-6e-06,-3.2e-05,-1.8e-05,-4.6e-05,-1.3e-05,-1e-05,-1.9e-05,-4.9e-05,-4.3e-05,-2e-05,1.7e-05,9e-06,-5.2e-05,-9.7e-05,-0.001715,-0.000294,-6e-06,0.000232,-0.000153,0.000223,2.8e-05,-0.000791,-0.000387,0.000309,5.2e-05,-0.000626,-0.00023,-0.000553,-3e-04,-0.001788,0.00235,-0.001378,-9.2e-05,0.000277,0.000525,0.000627,-0.00053,0.003894,0.00094,-8.6e-05,0.00249,0.000101,-0.003096,-0.001066,0.00071,0.000771,-0.000102,4e-04,-0.002594,0.000929,-0.001567,0.000148,0.000946,0.000223,0.000567,0.000121,0.000941,0.000289,-0.000671,-0.000938,-0.000458,-0.000234,-0.000408,-0.000223,-7.8e-05,0.000207,3.5e-05,-0.000214,0.000145,2.5e-05,-1.2e-05,-0.000247,0.00012,-2.5e-05,-4e-06,-6e-06,7.8e-05,-1.1e-05,2.2e-05,-0.000107,0.000234,0.000131,-0.000195,-0.000479,-8.7e-05,0.000318,0.000318,-7e-06,-9.3e-05,3e-04,8.7e-05,3.9e-05,0.000277,-0.000106,-4.8e-05,-0.00015,-1.6e-05
-3e-05,1.1e-05,0,-6e-06,1.2e-05,-1.9e-05,-1.6e-05,-6e-06,-1.1e-05,-8e-06,6.1e-05,1.2e-05,-0.000258,-4.8e-05,-2e-06,-2.3e-05,1e-05,3.9e-05,-5e-06,-2.4e-05,1.2e-05,2e-06,-1.4e-05,0,-7e-06,-4e-06,-9e-06,-1.1e-05,-1e-05,-1.6e-05,8e-06,-1.5e-05,-2.9e-05,2.5e-05,1.2e-05,-2.7e-05,-0.000132,9.9e-05,0.001531,0.000256,7.4e-05,-0.000168,-2.8e-05,-0.000186,8.5e-05,0.000734,0.000171,0.000207,0.000491,0.00016,-0.001006,-0.002271,0.000102,0.000369,-0.002024,-0.000625,0.000672,0.00015,0.000517,-0.000551,-0.000831,-0.002471,-0.000343,4.3e-05,-0.00069,-0.000234,0.000595,0.001219,-0.000942,-0.000578,-0.001205,-6e-06,0.000116,-0.000119,-0.000231,0.001242,0.000289,-0.00019,9.6e-05,0.000124,-0.000646,-0.000174,4.4e-05,0.000543,0.000336,0.000237,0.000139,2.6e-05,-9.2e-05,-8.7e-05,0.000139,-3.7e-05,-1.5e-05,-0.000303,0.000204,4.9e-05,-0.000153,7e-06,-4e-06,2.3e-05,-1.7e-05,-6.5e-05,-1.9e-05,2.8e-05,-2e-06,0.000131,-5e-04,0.001222,0.000367,-0.000137,-9.8e-05,-5.3e-05,0.000102,0.000169,-5.4e-05,-8.7e-05,-0.000361,-8e-06,-1.4e-05,8e-06,2e-05
-4.4e-05,-2.3e-05,-2.7e-05,-5e-06,1.4e-05,-2.6e-05,-1.5e-05,5e-06,-4e-06,-1.2e-05,-5.8e-05,-7.9e-05,9.9e-05,-4e-06,-2.5e-05,-1.7e-05,1e-06,3.1e-05,1.2e-05,9e-06,-4.6e-05,-1.8e-05,-1.9e-05,-1.2e-05,8e-06,-2.2e-05,-1.3e-05,-4.2e-05,-1.2e-05,-6.4e-05,-1.4e-05,-1.9e-05,-2.6e-05,-7e-06,-2.7e-05,2.7e-05,-0.000158,0.000117,-0.00087,7.3e-05,0.000142,-9.2e-05,-6e-06,-0.000101,-8.2e-05,4.8e-05,0.000137,-0.000334,-0.000341,0.000183,-0.000126,-0.000127,-0.001328,0.000318,0.001503,0.002293,-5.8e-05,-0.000446,-0.000866,0.00065,0.000419,0.000735,0.000474,-0.000644,-4.6e-05,-0.000128,0.000313,0.000543,-1e-04,0.001273,0.002279,4.8e-05,0.000614,-0.00017,-0.000405,-0.000466,-0.000317,-4.3e-05,7.7e-05,-2.4e-05,8.3e-05,-8e-05,5e-05,-0.000212,-2e-05,-0.000146,-0.000224,-0.000476,4.9e-05,1.2e-05,-0.000272,-0.000249,-6e-05,-7e-06,-7.2e-05,-1.5e-05,-5.5e-05,-9e-05,1e-05,8e-06,-8.2e-05,1.4e-05,-9e-06,-8e-06,3.5e-05,-0.000128,0.000209,0.000243,1.3e-05,-8.2e-05,-1.8e-05,1e-04,8e-06,-7e-05,0.000147,-0.00017,0.00026,-2.5e-05,0,-8.4e-05,2.1e-05
-1e-06,1.3e-05,1.8e-05,-2.7e-05,3.2e-05,-7e-06,2.8e-05,9e-06,-1.1e-05,-9e-06,-2e-06,5.7e-05,-6.9e-05,1.4e-05,2e-06,-1.5e-05,0,3e-05,9e-06,-6e-06,-1.9e-05,1.5e-05,-6e-06,2e-06,-4e-06,6e-06,3e-06,-3e-06,9e-06,-1.2e-05,-2.9e-05,0,-6e-06,-1.1e-05,-4.7e-05,-6e-06,0.000128,-8.4e-05,-0.000292,-0.000141,3.2e-05,-5.1e-05,5.9e-05,6.3e-05,-5e-06,0.000103,-5.5e-05,0.000149,0.000169,-0.000215,0.000395,-0.00016,-9.4e-05,-0.00013,-0.000533,-8e-05,-0.000484,0.000783,0.000424,-0.001492,-0.000808,-0.000458,-0.000537,-0.000583,0.000451,-0.000103,-8.2e-05,-1.2e-05,-0.000687,-0.00128,-0.001114,0.000217,-0.000405,-0.00025,0.000104,-0.000334,0.000217,0.000294,-0.000185,9.2e-05,1.8e-05,-3.4e-05,0.00011,0.000121,0.000129,0.000117,0.000314,0.000245,3.6e-05,-0.00013,3e-06,0.000206,-6.2e-05,0.000238,6.8e-05,-6e-05,9.5e-05,7.6e-05,-2.3e-05,-5e-05,1e-05,5e-06,-7e-06,8.1e-05,-5.1e-05,-0.00012,-0.000244,-6.4e-05,-5.8e-05,-0.000105,-0.000191,-0.00023,-1.7e-05,0.000102,-0.000109,-5.2e-05,-7.2e-05,3e-06,1.6e-05,7.3e-05,-1.7e-05
-2.3e-05,-1.7e-05,-1e-05,1.2e-05,5e-06,-8e-06,-1.2e-05,3e-06,-2e-06,-9e-06,-1.3e-05,-0.000125,-2e-06,-3.3e-05,-2.6e-05,-5e-05,-8e-06,-2.7e-05,0,4e-06,-2.2e-05,7e-06,-2.4e-05,-5e-06,-4e-06,0,0,-7e-06,2e-06,3e-06,-1.5e-05,3e-06,-9e-06,-4e-06,-1.6e-05,3.5e-05,0.00012,-0.00016,-0.000174,4e-05,-0.000234,0.00017,-0.000151,3.1e-05,-3.5e-05,-3e-06,-0.000123,-0.000302,-0.000146,0.000157,0.000216,0.000499,-0.000614,-0.000125,-0.000418,-0.000435,0.000206,0.00011,-0.000292,0.000373,0.00018,-0.000162,0.000185,0.000317,-0.000695,-0.000484,0.00039,2.5e-05,0.000798,0.000233,0.000384,-0.00018,0.000509,-0.000544,-0.000235,0.000538,-0.000268,-0.000318,0.000231,-0.000266,4.3e-05,5.8e-05,-0.000104,1.9e-05,-0.000215,-4.9e-05,-6.4e-05,5.1e-05,1.8e-05,0.000151,6.4e-05,-9.8e-05,5.4e-05,-2.7e-05,-2.2e-05,-1.6e-05,-6.7e-05,1.7e-05,-1.1e-05,1.5e-05,3.3e-05,-5.5e-05,1.1e-05,-2.7e-05,6e-05,0.000133,-0.000259,-6e-06,2.5e-05,8.7e-05,5.9e-05,0.000114,-1.1e-05,-8.6e-05,-1.5e-05,9e-06,-0.00024,2e-05,-6e-06,-1.6e-05,1.8e-05
1e-06,5e-06,-2e-06,-2e-06,6e-06,-1.6e-05,1.6e-05,-3e-06,2e-06,-6e-06,2e-06,-2.9e-05,-2.4e-05,-8e-06,-3e-06,9e-06,6e-06,-2.2e-05,-1e-06,1.2e-05,5e-06,-2e-06,-7e-06,1e-06,1e-06,-1.7e-05,4e-06,2e-06,8e-06,2e-06,-6e-06,1.4e-05,-3e-06,-4e-06,5e-06,2e-06,-7.4e-05,-3.5e-05,0.000295,5.5e-05,5e-05,-4.1e-05,3.8e-05,9e-06,0.000101,-6.7e-05,-4.8e-05,5.2e-05,0.000128,4.8e-05,-0.000182,-0.000129,0.000104,0.000207,-0.000539,-0.000505,0.000176,-0.000449,-0.000266,0.000293,7e-06,0.000664,-0.00012,-3.4e-05,0.00091,-0.000173,-0.000326,-9.6e-05,-0.000257,0.000294,-0.000357,-0.000294,-0.00029,0.000897,0.00048,-0.000366,0.000229,2.1e-05,-0.000271,0.000109,-0.000209,-3e-05,0.000131,-4.9e-05,0.000113,5.7e-05,9e-06,-3.4e-05,-5.5e-05,-4.2e-05,-7e-05,0.000107,5.1e-05,-3e-06,-0.000108,4e-05,-7e-06,1.4e-05,-2.6e-05,-6e-06,-4.8e-05,2.5e-05,1.1e-05,-6.1e-05,-6.4e-05,5e-05,-8.8e-05,-0.000141,1.7e-05,-4.4e-05,1.8e-05,1e-06,8e-06,-4e-06,-4.9e-05,8.9e-05,0.000123,-5.9e-05,-2.5e-05,4.7e-05,-1.4e-05
1e-06,2e-06,-1.5e-05,5e-06,4e-06,-3e-06,-1.5e-05,-2.3e-05,0,-7e-06,1.3e-05,4.9e-05,2e-06,2.6e-05,-1.3e-05,-4e-06,0,-4.5e-05,0,0,-6e-06,-1e-05,1e-06,-1e-06,4e-06,-2e-06,1e-06,-9e-06,8e-06,9e-06,2e-06,8e-06,-1e-05,1e-06,8e-06,1.1e-05,-6.3e-05,1e-04,-2e-05,-1.6e-05,5.9e-05,-2.7e-05,2.1e-05,-0.00014,-5e-05,3.2e-05,1e-05,6.3e-05,0.000121,-3e-05,-0.000567,-0.000217,-0.000509,-0.000124,0.000761,0.000142,-0.000392,0.000448,0.000143,0.000569,-0.000129,-0.000364,-0.000282,-0.000173,-0.001088,6.1e-05,0.000342,8.8e-05,0.000723,-0.000197,0.000431,-5e-05,0.000591,-0.000776,-1.9e-05,-0.000362,5e-06,0.000119,-2.2e-05,1.9e-05,4.8e-05,-5e-05,-0.000166,4e-06,-4.2e-05,3.3e-05,-0.000131,3.2e-05,2.2e-05,-1e-05,-5.5e-05,-6e-05,-6e-05,-1.3e-05,-9e-06,1.8e-05,-2.1e-05,-5e-06,-2.1e-05,-1e-06,3e-06,-2.5e-05,9e-06,1.1e-05,4e-05,-3.1e-05,-0.000151,-0.000214,-7.1e-05,0.00011,-1.2e-05,1e-05,-1.8e-05,2e-06,1.9e-05,-0.000109,-4.4e-05,1.6e-05,2.8e-05,-3.2e-05,-8e-06
1.2e-05,-4e-06,5e-06,2e-06,3e-06,7e-06,1e-06,-9e-06,2e-06,-9e-06,8e-06,0,6e-06,-8e-06,-6e-06,-2.2e-05,-4e-06,3e-06,-3e-06,3e-06,4e-06,5e-06,-7e-06,1e-06,-1e-06,-3e-06,-1e-06,-1e-05,-1e-06,1e-05,-5e-06,3e-06,0,4e-06,8e-06,9e-06,2.8e-05,3.7e-05,0.000111,2.4e-05,-2.5e-05,3.4e-05,3.1e-05,1.8e-05,-1.9e-05,-0.000114,3.3e-05,1.2e-05,-0.000332,7.5e-05,-0.000622,0.000482,0.000504,3e-05,-0.000737,8.8e-05,-1.3e-05,-0.000251,0.000182,0.000139,-0.000195,-0.000322,-0.000178,-0.000151,0.001092,0.000233,-0.000136,3e-05,-0.000263,7.6e-05,-0.000157,-0.000195,-0.000396,0.000455,-0.000343,0.000181,-0.000247,-0.000119,0.000124,0.000274,8.3e-05,0.000116,-5.7e-05,-4.8e-05,9e-06,-7.5e-05,0.000127,3.7e-05,-1.1e-05,2.5e-05,-1e-05,5.4e-05,2.1e-05,-3.1e-05,-2e-05,2.9e-05,3e-06,-4.2e-05,-7e-06,-1e-06,1.6e-05,0,-1.2e-05,4e-06,-4.4e-05,-1e-06,0.000114,7.5e-05,-5.7e-05,-0.000129,-4.7e-05,-1e-06,-1.9e-05,-0.000103,4e-05,-7e-06,9.5e-05,2.9e-05,-1.2e-05,1e-05,7e-06
-2e-06,6e-06,-1e-05,-6e-06,4e-06,1e-06,-6e-06,-2e-06,0,-4e-06,3e-06,-3.7e-05,2.2e-05,-1.9e-05,3e-06,3e-06,-1e-06,-5e-06,-4e-06,-5e-06,-4e-06,1e-06,4e-06,1e-06,-2e-06,1e-06,-1e-06,-5e-06,-1.2e-05,0,9e-06,-4e-06,-9e-06,1e-06,0,4e-06,4.1e-05,-4.8e-05,-0.000206,-1.3e-05,-1.4e-05,2.8e-05,-3.3e-05,-4e-05,4.3e-05,-2.4e-05,1.8e-05,3.5e-05,0.000204,-2.7e-05,-0.000245,-0.000183,-0.000416,0.000161,7.8e-05,-0.000201,9.6e-05,0.000283,-1.6e-05,0.000172,-7.5e-05,0.000336,-5.3e-05,8.3e-05,-0.000817,-1e-05,0.000692,-0.000202,-0.000103,-0.000205,4.5e-05,-7.2e-05,8.6e-05,-0.000428,0.000508,1.3e-05,0.000259,0.00017,-0.000142,-7.5e-05,-0.00014,3.7e-05,0.000201,2.6e-05,-1.1e-05,9.5e-05,-5.9e-05,-2.4e-05,-3.2e-05,-1.2e-05,5.7e-05,-4.7e-05,3e-06,0,2.7e-05,1e-06,-2e-06,7e-06,-9e-06,-1e-05,-4e-06,-1.9e-05,-8e-06,8e-06,1.8e-05,5e-06,-7.1e-05,8e-05,2.2e-05,7.1e-05,3e-06,1.9e-05,-5e-06,0.00023,3.5e-05,3e-06,-8.2e-05,-2.5e-05,1.2e-05,-1.9e-05,-4e-06
1.3e-05,-2e-06,4e-06,3e-06,6e-06,2e-06,4e-06,-1e-06,4e-06,-6e-06,1e-06,1.6e-05,-2e-05,2.6e-05,2e-06,3e-06,4e-06,5e-06,1e-06,-5e-06,7e-06,3e-06,-4e-06,-2e-06,2e-06,1e-06,0,-3e-06,-4e-06,1e-06,3e-06,-6e-06,-1e-06,6e-06,-1e-06,9e-06,1e-05,-5.7e-05,0.000242,-1.7e-05,2.9e-05,2.5e-05,3.7e-05,6.4e-05,-3.5e-05,-5e-06,-2.1e-05,-2.7e-05,4.2e-05,-2e-06,1e-05,4.6e-05,0.000165,0.000181,0.000134,0.000342,-0.000151,-0.000221,-0.000197,-0.000139,-3.1e-05,-0.000215,-0.000191,-3.6e-05,0.001132,4.6e-05,-0.001079,-1e-04,-0.000389,0.000141,-0.000211,8.2e-05,-0.000168,0.000281,-0.000118,-0.00014,-0.000111,-5e-05,0.000149,-6.9e-05,-1e-05,-2.1e-05,-0.000122,-5.3e-05,1.2e-05,-7.2e-05,5.3e-05,9.6e-05,-3e-06,2.4e-05,5.1e-05,2.5e-05,1.8e-05,-2.8e-05,1.3e-05,-3.7e-05,-1.5e-05,-1e-06,-1.3e-05,8e-06,3e-06,1.1e-05,1e-06,2e-05,1.3e-05,-2.7e-05,0.000102,5.6e-05,4e-06,-7.2e-05,-2.2e-05,-5e-06,-2e-06,-6.1e-05,-5.4e-05,-1.8e-05,3.6e-05,-1.4e-05,-1.6e-05,1.2e-05,9e-06
3e-06,2e-06,-3e-06,-5e-06,0,0,5e-06,4e-06,0,-3e-06,-1e-06,-6e-06,1.1e-05,1.3e-05,-3e-06,1e-06,-2e-06,3e-06,0,-5e-06,8e-06,-2e-06,-4e-06,0,3e-06,0,1e-06,-2e-06,2e-06,5e-06,-6e-06,-3e-06,-6e-06,-7e-06,8e-06,2e-06,-3.7e-05,9e-06,-0.000211,2.2e-05,-4.2e-05,-4.7e-05,-2.8e-05,-7e-06,1.4e-05,-1e-05,-4.1e-05,1.7e-05,-3.8e-05,3.1e-05,2e-04,0.000161,-0.000316,-2.2e-05,-7e-05,0.000219,-0.000238,6.6e-05,0.000143,-0.000283,-0.00019,0.000464,-6.2e-05,-8.3e-05,-0.000813,-9.1e-05,0.001067,7.6e-05,9e-06,4e-05,0.000118,7.2e-05,-0.000318,-4.5e-05,-3.1e-05,9.5e-05,1.5e-05,-2.5e-05,-0.000151,5.4e-05,4.8e-05,-2.8e-05,6e-05,2.4e-05,-1e-05,4.5e-05,-4.3e-05,-9.8e-05,-2e-06,-5.2e-05,-2e-06,-3.9e-05,-5.8e-05,5.6e-05,0,-1.1e-05,0,6e-06,-7e-06,-7e-06,2e-06,-1.8e-05,5e-06,-8e-06,-1.2e-05,2.4e-05,-5e-05,3.9e-05,-4.4e-05,2.1e-05,-2.2e-05,1.3e-05,-6e-06,-0.000103,-1.3e-05,9e-06,1.1e-05,2.3e-05,1e-06,2e-06,-4e-06
3e-06,-1e-06,8e-06,6e-06,5e-06,4e-06,0,1e-06,-4e-06,-5e-06,1e-06,1.9e-05,-3.5e-05,-2.4e-05,-8e-06,-1e-06,0,2e-06,0,-4e-06,-7e-06,-3e-06,0,1e-06,-2e-06,2e-06,1e-06,-1e-06,1e-06,-6e-06,-2e-06,-3e-06,-1e-06,0,1.2e-05,7e-06,-1.8e-05,2.5e-05,0.00011,-2.1e-05,-1.1e-05,6e-06,-1.3e-05,-2.7e-05,7e-06,8.3e-05,-9e-06,-4.4e-05,-0.000146,1.4e-05,0.000157,-0.00011,4e-06,4.7e-05,0.000137,-0.000423,8.4e-05,0.000296,-8.9e-05,-0.000158,-0.000209,-0.000493,3.2e-05,3.6e-05,0.000503,0.000164,-0.00036,4e-06,0.000251,-0.00011,-0.000134,-6.7e-05,0.00041,-2.2e-05,-0.000105,-0.000115,-1.1e-05,4.5e-05,9.2e-05,-9.2e-05,1e-05,-8e-06,1.9e-05,-1.7e-05,2.3e-05,-1.5e-05,5.2e-05,-1.1e-05,1e-06,-2e-06,-4e-05,2.6e-05,5.2e-05,3.9e-05,1.1e-05,-1.2e-05,-9e-06,4e-06,-9e-06,4e-06,-2e-05,8e-06,3e-06,-2e-05,0,7e-06,0.000132,0.000199,9e-06,5e-06,2.2e-05,-1e-06,-2e-06,4.1e-05,1e-05,2.7e-05,-7e-06,-1e-06,1.1e-05,-2e-06,1e-06
-3e-06,2e-06,-4e-06,-4e-06,2e-06,2e-06,2e-06,0,1e-06,-4e-06,-1e-06,-1.8e-05,3.6e-05,-2e-06,-6e-06,3e-06,-1e-06,3e-06,0,-2e-06,-4e-06,1e-06,-6e-06,-1e-06,-2e-06,-2e-06,0,-4e-06,-1e-06,2e-06,-4e-06,1e-06,-2e-06,-5e-06,3e-06,0,2.1e-05,-1e-06,4.8e-05,1.5e-05,5.2e-05,-5e-06,-1e-06,2e-05,-1.6e-05,-2.9e-05,1.3e-05,2.8e-05,0.000157,-3.9e-05,-0.000129,0.000212,-0.000282,3e-05,-0.000568,2e-04,0.000119,-0.000127,-5.4e-05,-0.000304,1.4e-05,-9.2e-05,-8e-05,2.2e-05,-0.000478,0.00011,-1.7e-05,0.000134,0.000133,-0.000191,0.000112,0.000164,-0.000353,0.000184,0.000114,9.4e-05,-1.8e-05,-1.9e-05,-7e-05,8.7e-05,-4.9e-05,2.4e-05,-3.4e-05,4.1e-05,-1.7e-05,3e-06,-6.8e-05,6.1e-05,-1.2e-05,2e-06,-1.1e-05,7e-06,-2.2e-05,-3.6e-05,-3.1e-05,-1.2e-05,-1.1e-05,-1.5e-05,-5e-06,1e-06,-6e-06,-8e-06,2e-06,-8e-06,-3e-06,1.1e-05,-2e-06,-0.000108,3.3e-05,-1.1e-05,2e-06,-2.3e-05,2e-06,4.1e-05,2.2e-05,4.1e-05,0,-1.8e-05,-1.7e-05,6e-06,-3e-06
3e-06,0,0,5e-06,0,-3e-06,-9e-06,-3e-06,1e-06,-4e-06,0,-1.3e-05,-2.2e-05,1.1e-05,-5e-06,2e-06,2e-06,-6e-06,1e-06,1e-06,-7e-06,2e-06,1e-06,0,1e-06,-1e-06,0,-1e-06,-1e-06,-2e-06,0,2e-06,-1e-06,0,-6e-06,5e-06,1.2e-05,-1.6e-05,-2.4e-05,-4.9e-05,-6.8e-05,2.4e-05,2.6e-05,-9e-06,-2e-06,6e-05,8e-06,-3e-05,-8e-06,3.4e-05,-0.000151,-0.000236,6.1e-05,-0.000104,0.000593,-9.2e-05,-0.000169,-6.2e-05,-4.4e-05,4.9e-05,-0.000155,0.000322,-3.1e-05,-6.6e-05,0.000155,7e-06,0.000113,-2.8e-05,-5.7e-05,0.000264,-4.1e-05,-0.000135,0.000162,-0.000239,-0.000392,-2.6e-05,0.000111,8.1e-05,-4.2e-05,6e-06,5.8e-05,1.1e-05,-4e-05,1.8e-05,1.7e-05,1e-05,4.3e-05,-7.4e-05,4e-06,-2.1e-05,1.2e-05,-3e-06,0,-3.5e-05,-1.7e-05,7e-06,1.1e-05,8e-06,0,1e-06,1.1e-05,1.2e-05,-6e-06,1.4e-05,-7e-06,-3.1e-05,6e-05,-8.6e-05,-1.4e-05,-1.1e-05,0,1.3e-05,-2e-06,-2.2e-05,1.2e-05,-3.3e-05,1.2e-05,3e-06,1.4e-05,-1e-05,4e-06
-7e-06,-1e-06,-6e-06,-3e-06,3e-06,-1e-06,3e-06,-1e-06,-2e-06,-3e-06,-1e-06,1e-05,1e-05,-5e-06,-3e-06,1e-06,-1e-06,-3e-06,1e-06,1e-06,5e-06,0,0,0,1e-06,0,0,-4e-06,1e-06,-5e-06,-2e-06,2e-06,-2e-06,2e-06,-7e-06,0,-1.2e-05,-1e-06,-6.7e-05,4e-05,3.7e-05,-1.6e-05,-1.7e-05,4.7e-05,2.9e-05,-2.7e-05,-6e-06,3.4e-05,-5.9e-05,1.5e-05,-2e-06,1e-05,-0.000186,-0.000107,-0.000431,0.000272,-4e-05,0.000106,0.000137,9.5e-05,-0.000114,-9.5e-05,3.5e-05,-3.5e-05,5e-05,-3.4e-05,2e-05,-1.3e-05,-2.1e-05,-4.6e-05,-4.5e-05,-0.000145,-6e-05,0.000221,0.000248,-3.2e-05,-0.000107,-2.9e-05,9e-05,-1.2e-05,3e-06,-1e-05,2.1e-05,1e-06,-8e-06,-2.4e-05,-2.2e-05,6.5e-05,7e-06,9e-06,-1.3e-05,-3e-06,-5e-06,-8e-06,-9e-06,2.4e-05,-1.6e-05,-9e-06,-6e-06,-9e-06,8e-06,-7e-06,3e-06,7e-06,7e-06,2.9e-05,6e-06,-4.4e-05,-1.7e-05,3.9e-05,-1.2e-05,-1.1e-05,-2e-06,9e-06,-1.3e-05,-1.9e-05,-5e-06,4e-06,-1.1e-05,2e-06,-6e-06
-1e-06,2e-06,2e-06,1e-06,1e-06,1e-06,-2e-06,-1e-06,-1e-06,-3e-06,-1e-06,7e-06,0,-2e-06,-2e-06,-1e-06,-1e-06,-1.2e-05,-1e-06,2e-06,0,-1e-06,-2e-06,0,-2e-06,-1e-06,-1e-06,-1e-06,2e-06,-1e-06,2e-06,0,-2e-06,1e-06,1e-06,4e-06,-1.1e-05,1e-05,0.000128,-1.4e-05,1.1e-05,-1.1e-05,-5e-06,-4.2e-05,-4.1e-05,0,-1.7e-05,-1e-05,-1.3e-05,-4e-05,0.000162,7.4e-05,4.3e-05,2.3e-05,2.9e-05,1e-05,0.000126,5.7e-05,-0.000111,0.000263,-7.3e-05,0.000139,9e-06,3.3e-05,-9.5e-05,-4.8e-05,-0.000156,-2.1e-05,-7.3e-05,-0.000126,9.8e-05,2.5e-05,-4e-05,-0.000164,-0.000146,7.4e-05,3.7e-05,-3e-05,-9.4e-05,-6.2e-05,-4e-05,1e-06,-7e-06,1.5e-05,-6e-06,2.7e-05,2.9e-05,-4.3e-05,-2.1e-05,7e-06,-3.5e-05,-3e-06,2.9e-05,3e-05,0,5e-06,-5e-06,3e-06,-5e-06,7e-06,-5e-06,9e-06,-1e-06,1e-06,-4e-06,-1.5e-05,4e-06,-0.000116,9e-06,-3.6e-05,2.8e-05,1.1e-05,-4e-06,2e-06,-1.9e-05,2.2e-05,3e-06,-2e-06,-4e-06,-5e-06,3e-06
-4e-06,-1e-06,-1e-06,-4e-06,0,0,6e-06,-1e-06,3e-06,-3e-06,0,-1.8e-05,9e-06,8e-06,-1e-06,2e-06,1e-06,-3e-06,0,2e-06,1e-06,0,2e-06,0,-1e-06,1e-06,0,-1e-06,2e-06,-2e-06,3e-06,1e-06,-1e-06,2e-06,2e-06,0,8e-06,-1e-05,-8.4e-05,5e-06,-3.9e-05,3e-06,-4e-06,1.9e-05,2.1e-05,-1.2e-05,-9e-06,4e-06,7.8e-05,3.8e-05,0.000219,-0.000127,-0.000163,-5.1e-05,0.000124,-0.000326,-1.4e-05,-7.1e-05,-6e-06,4.5e-05,-0.000113,-0.000179,4.9e-05,4.3e-05,0.000313,2.4e-05,0.000232,-1e-06,-0.000187,5.5e-05,-4e-06,-7.1e-05,0.000196,0.000153,-1.8e-05,3e-06,2.4e-05,2.5e-05,7.1e-05,8e-06,-4e-06,2e-05,-2.7e-05,-2.4e-05,1e-06,-4.3e-05,-3.4e-05,-1.9e-05,8e-06,2e-06,-5e-06,-4e-06,-2.1e-05,1.8e-05,1e-06,-6e-06,4e-06,2e-06,-6e-06,-1e-06,5e-06,-4e-06,2e-06,-4e-06,3e-06,1.9e-05,1.2e-05,-1.9e-05,-1e-06,-1.2e-05,-7e-06,-1e-05,1e-06,-1.1e-05,-2e-06,-8e-06,9e-06,0,9e-06,1.1e-05,-1e-06
0,1e-06,4e-06,3e-06,2e-06,-1e-06,-2e-06,0,0,-2e-06,0,1e-06,-2.1e-05,-8e-06,-1e-06,0,1e-06,-4e-06,1e-06,1e-06,-2e-06,0,-2e-06,0,2e-06,-1e-06,1e-06,-1e-06,0,-1e-06,-1e-06,-1e-06,-1e-06,0,-3e-06,2e-06,1e-05,6e-06,8.6e-05,-1.6e-05,7e-06,-7e-06,1.4e-05,-2.3e-05,9e-06,-2.6e-05,3e-06,1.1e-05,-3.8e-05,-9e-06,9.8e-05,0.000106,6.5e-05,-1.8e-05,-3.2e-05,0.000224,-0.000145,-7e-06,3.8e-05,7e-05,-6.1e-05,-4.7e-05,7.3e-05,-3.7e-05,-0.000398,-1.2e-05,-0.00012,-1.4e-05,0.00019,6.6e-05,4e-06,0.000101,-0.000158,-0.000165,4.6e-05,-5.7e-05,3.2e-05,-4.7e-05,-3.5e-05,-6e-06,1.1e-05,5e-06,9.4e-05,-1e-05,-4e-06,4.8e-05,3.3e-05,6.3e-05,2e-06,1.4e-05,2.1e-05,8e-06,-1.3e-05,-2.3e-05,-5e-06,1e-06,-4e-06,3e-06,-4e-06,1e-06,1e-06,2e-06,0,-9e-06,6e-06,-2.4e-05,-4e-06,7e-05,-6e-06,2.5e-05,0,6e-06,-1e-06,1.1e-05,1.6e-05,-6e-06,-3.3e-05,-7e-06,-7e-06,-7e-06,-1e-06
-3e-06,-1e-06,-2e-06,-2e-06,0,-2e-06,0,-1e-06,-1e-06,-3e-06,0,4e-06,1.5e-05,-5e-06,-1e-06,-1e-06,-2e-06,4e-06,0,0,-1e-06,0,0,0,1e-06,0,0,-1e-06,-3e-06,1e-06,0,1e-06,0,-2e-06,-5e-06,0,-4e-06,1.4e-05,-7.4e-05,9e-06,3.2e-05,3.2e-05,-2e-06,2.4e-05,-1.9e-05,-9e-06,3e-06,-2.4e-05,-3.2e-05,-2.1e-05,-1.1e-05,-8.1e-05,-0.00015,4.3e-05,-0.000132,-9.4e-05,2.3e-05,-1.7e-05,-4.3e-05,-9.2e-05,-0.000112,0.000153,-6e-06,-1.6e-05,0.000424,-3.1e-05,-0.000171,1e-06,1.4e-05,-2.9e-05,-2e-06,9.3e-05,0.000164,3.1e-05,0.000133,0.000102,-9.7e-05,8e-06,-8e-06,6.8e-05,-1.4e-05,-1.9e-05,-4.9e-05,-8e-06,6e-06,-2.9e-05,-2.7e-05,-5.2e-05,-1.7e-05,-1.1e-05,1.7e-05,-3e-06,2e-05,1.1e-05,1.2e-05,-8e-06,-6e-06,7e-06,-5e-06,-2e-06,-7e-06,-4e-06,-2e-06,-3e-06,-7e-06,5e-06,6e-06,0,3e-06,-1.9e-05,3e-06,-1e-06,-2e-06,-3.6e-05,8e-06,-1e-06,3.2e-05,2e-06,-1e-06,8e-06,3e-06
3e-06,1e-06,2e-06,3e-06,0,1e-06,-3e-06,1e-06,1e-06,-2e-06,0,1e-06,-6e-06,1.3e-05,-3e-06,0,0,5e-06,-1e-06,-1e-06,2e-06,0,0,0,-1e-06,0,0,-2e-06,-1e-06,2e-06,-3e-06,0,-1e-06,0,-5e-06,1e-06,-6e-06,1.2e-05,3.1e-05,-2e-06,-1.6e-05,-2.4e-05,-1e-06,4e-06,8e-06,2e-06,-3e-06,1.9e-05,1.7e-05,3.3e-05,-7.2e-05,-1.6e-05,4e-06,-1.1e-05,0.000278,9.5e-05,8.9e-05,5.4e-05,1e-06,6e-06,-5.7e-05,-8.5e-05,6e-06,1.4e-05,-0.000452,-6.4e-05,0.000317,2e-06,6.9e-05,-4e-05,-2.9e-05,1.1e-05,-7.7e-05,-2e-05,-0.000116,-1.6e-05,8e-05,-1.3e-05,3.7e-05,-5e-06,-1.8e-05,-2e-06,-9e-06,8e-06,1e-06,6e-06,1.3e-05,1.7e-05,2e-06,1.2e-05,-2e-06,-2e-06,-4e-06,-6e-06,-5e-06,-2e-06,-2e-06,-6e-06,-3e-06,2e-06,-2e-06,1e-06,0,8e-06,3e-06,1.6e-05,-4.7e-05,2.2e-05,1e-05,1.7e-05,7e-06,6e-06,0,8.2e-05,-2e-06,1e-05,-3.2e-05,9e-06,-1e-06,-8e-06,-2e-06
0,0,-3e-06,-1e-06,1e-06,1e-06,-1e-06,1e-06,1e-06,-2e-06,0,-4e-06,1e-06,4e-06,-4e-06,-1e-06,1e-06,2e-06,0,-2e-06,0,0,-1e-06,0,-1e-06,-1e-06,0,1e-06,1e-06,0,0,1e-06,-1e-06,-4e-06,2e-06,1e-06,1e-06,-1.5e-05,-8.2e-05,4e-06,-9e-06,0,-7e-06,-1.3e-05,1.1e-05,1e-05,-6e-06,-1.9e-05,4.8e-05,-1.6e-05,-5e-05,0.000115,-0.000124,-4.9e-05,-0.000147,-8e-05,-8.7e-05,1.2e-05,-6e-05,-3.4e-05,-5.2e-05,-1e-05,2.7e-05,-2e-05,0.00049,6e-06,-0.000283,-7e-06,-7.4e-05,2.4e-05,3.1e-05,-5e-05,0.000116,3.2e-05,0.00016,-6.8e-05,-1.5e-05,-4.1e-05,-6.8e-05,-5.4e-05,2.2e-05,1.3e-05,1.4e-05,-8e-06,-3e-06,1e-05,-1.3e-05,6e-06,3e-06,-3e-06,-1.8e-05,5e-06,-4e-06,-1.3e-05,-7e-06,3e-06,-2e-06,-1e-06,-4e-06,-2e-06,-3e-06,-2e-06,0,7e-06,-3e-06,-1.2e-05,-7e-06,4.3e-05,2e-06,-2.2e-05,-1e-06,-4e-06,0,-4.6e-05,-1.3e-05,-2.2e-05,3.2e-05,-1e-05,3e-06,4e-06,1e-06
3e-06,0,0,1e-06,-1e-06,-1e-06,2e-06,0,-1e-06,-3e-06,0,-4e-06,-9e-06,-1.4e-05,-3e-06,0,0,0,0,-2e-06,0,0,0,0,1e-06,1e-06,0,-2e-06,0,2e-06,-1e-06,-1e-06,-1e-06,2e-06,5e-06,0,3e-06,-1.3e-05,5.3e-05,-1e-05,3.1e-05,9e-06,0,6e-06,-2.1e-05,1.7e-05,-5e-06,1.5e-05,-2.9e-05,-6e-06,1.7e-05,-0.000155,5e-06,3.1e-05,-8.2e-05,4e-06,-5.7e-05,-9.5e-05,9.3e-05,-5.5e-05,-4.2e-05,1.3e-05,5e-06,-1e-05,-0.000426,-6e-06,5e-05,6e-06,9e-06,-1.1e-05,-6e-05,-4.2e-05,-4.2e-05,-7e-06,2.1e-05,3.3e-05,-2.4e-05,1.5e-05,6.8e-05,4.4e-05,0,5e-06,-1.6e-05,2e-06,3e-06,-2.1e-05,2.6e-05,-2.1e-05,-8e-06,-8e-06,-6e-06,-6e-06,-1.1e-05,2e-06,-6e-06,-1e-06,-1e-06,-9e-06,-3e-06,2e-06,-6e-06,2e-06,0,-3e-06,2e-06,5e-06,-4.8e-05,-2.1e-05,-9e-06,1.2e-05,-3e-06,2e-06,0,-2.6e-05,-7e-06,-8e-06,-1.9e-05,0,-3e-06,-5e-06,-2e-06
0,0,-2e-06,-1e-06,0,0,1e-06,0,-1e-06,-2e-06,0,1e-06,1.5e-05,-1e-06,-2e-06,-1e-06,-1e-06,-5e-06,0,-1e-06,-3e-06,1e-06,0,0,0,0,0,1e-06,-1e-06,1e-06,1e-06,0,-1e-06,-1e-06,2e-06,1e-06,0,9e-06,-3e-06,3e-06,-3.5e-05,-2e-06,0,-1.4e-05,1.4e-05,-1e-06,-1e-06,-9e-06,-3.3e-05,1.6e-05,6.6e-05,0.000132,-0.000128,1.9e-05,0.000202,0.000115,7.1e-05,5.7e-05,-9.6e-05,-5.6e-05,-2.9e-05,-5.9e-05,8e-06,1.3e-05,0.000318,1.6e-05,6.5e-05,0,-0.000102,6.5e-05,1.3e-05,-6e-05,-9e-05,-6.1e-05,-9.4e-05,3e-06,3e-05,9e-06,-2.8e-05,-3.5e-05,-1e-05,-5e-06,-1e-06,-1e-06,-2e-06,2.1e-05,-2.2e-05,3.9e-05,-7e-06,5e-06,1.1e-05,6e-06,2.7e-05,5e-06,-5e-06,-1e-06,-5e-06,-1e-06,-2e-06,0,4e-06,0,0,-6e-06,0,-3e-06,2e-05,-9.4e-05,1e-06,-4e-06,3e-06,-5e-06,0,4.8e-05,7e-06,1.4e-05,2e-06,7e-06,-1e-06,7e-06,2e-06
2e-06,0,2e-06,-1e-06,0,0,2e-06,-1e-06,0,-2e-06,0,4e-06,-9e-06,9e-06,-1e-06,-1e-06,0,-3e-06,0,0,3e-06,0,0,0,-1e-06,0,0,-2e-06,0,-1e-06,2e-06,-1e-06,0,2e-06,-1e-06,0,-4e-06,2.1e-05,-9e-06,5e-06,1.7e-05,1e-05,7e-06,2.4e-05,2e-06,1.3e-05,2e-06,9e-06,2.3e-05,-1e-05,2.6e-05,-6.2e-05,-1.9e-05,1e-06,-0.000218,-0.000203,2.3e-05,2.6e-05,2.4e-05,-2.7e-05,-9.4e-05,0.000159,3e-06,1.1e-05,-0.00031,-8e-06,-3.9e-05,3.5e-05,3.8e-05,-7.1e-05,3e-06,-1.2e-05,0.000103,7.2e-05,4.1e-05,-1.6e-05,-3.8e-05,1.7e-05,8e-06,3.7e-05,5e-06,-5e-06,1e-05,-1.3e-05,-2e-06,-2.7e-05,1.1e-05,-2.4e-05,6e-06,-8e-06,-4e-06,-9e-06,-1.1e-05,2.5e-05,-4e-06,3e-06,0,6e-06,-3e-06,-2e-06,5e-06,1e-06,-1e-06,-3e-06,0,-1e-06,-2.1e-05,-1.6e-05,5e-06,-6e-06,1e-06,2e-06,-1e-06,-2.5e-05,1.2e-05,2e-06,2e-06,-2e-06,0,-5e-06,-2e-06
-1e-06,0,0,0,-1e-06,1e-06,-2e-06,0,0,-2e-06,0,-6e-06,2e-06,-1e-06,-1e-06,0,0,-4e-06,0,1e-06,1e-06,-1e-06,0,0,-1e-06,0,0,1e-06,0,1e-06,0,0,-1e-06,1e-06,-2e-06,1e-06,-1e-06,-3e-06,3.8e-05,1e-06,9e-06,-2e-05,-3e-06,-1.7e-05,-1.5e-05,-2e-06,0,-8e-06,3.2e-05,-4e-06,-3.9e-05,-5e-06,-9.8e-05,3.4e-05,0.000151,4.5e-05,-8.9e-05,-4.8e-05,2.9e-05,2.9e-05,-3.1e-05,-9.6e-05,-1.4e-05,-1.7e-05,0.000139,2.3e-05,-3.6e-05,6e-06,1.1e-05,-3.3e-05,8e-06,0.000107,-0.000189,-4e-05,-3.7e-05,6e-06,5.2e-05,2e-05,2.9e-05,-2.6e-05,1e-05,7e-06,1e-06,2e-05,4e-06,3.4e-05,-1.3e-05,-8e-06,-4e-06,1e-06,-2e-05,9e-06,-1e-05,-6e-06,-6e-06,-2e-06,-2e-06,1e-06,-2e-06,1e-06,-1e-06,-1e-06,0,0,0,6e-06,2e-06,-1.5e-05,-3e-06,2e-06,-9e-06,0,0,1.7e-05,0,-1.2e-05,2e-06,-5e-06,1e-06,6e-06,3e-06
1e-06,0,2e-06,-1e-06,0,0,0,-1e-06,0,-2e-06,0,-3e-06,-4e-06,-2e-06,-1e-06,0,0,1e-06,0,1e-06,2e-06,0,-1e-06,0,1e-06,0,0,-2e-06,1e-06,-1e-06,1e-06,0,0,-1e-06,3e-06,-1e-06,6e-06,-2e-05,-3e-06,-5e-06,-1.5e-05,8e-06,0,1.2e-05,1.3e-05,-7e-06,-4e-06,4e-06,-3.2e-05,1.1e-05,-8.4e-05,9.2e-05,3e-06,4.8e-05,-9e-05,6.6e-05,1e-06,9e-06,-4.6e-05,3.9e-05,-3.1e-05,-2.6e-05,-5e-06,-1.3e-05,-1e-05,6e-06,0.000111,-2.1e-05,6.2e-05,9.3e-05,1.4e-05,-3.2e-05,8.6e-05,5.8e-05,-9.1e-05,-9e-06,-4.5e-05,1.3e-05,-4.2e-05,2.3e-05,-1e-05,6e-06,-2.6e-05,0,-3e-06,-3e-05,1.5e-05,2.3e-05,-9e-06,-2e-06,-1e-06,-1.1e-05,1e-06,-2.9e-05,3e-06,-5e-06,-4e-06,7e-06,-2e-06,-1e-06,2e-06,1e-06,0,6e-06,0,-1.1e-05,-1.6e-05,-1.8e-05,0,1.1e-05,1e-06,-2e-06,0,-7e-06,-7e-06,3e-06,1e-06,6e-06,2e-06,-8e-06,-3e-06
-1e-06,0,-1e-06,2e-06,0,0,-2e-06,0,-1e-06,-2e-06,0,1e-06,8e-06,2e-06,-2e-06,0,-1e-06,1e-06,0,1e-06,-2e-06,1e-06,0,0,0,1e-06,0,0,1e-06,-1e-06,-2e-06,1e-06,0,0,5e-06,0,-1e-06,-5e-06,-4.5e-05,0,8e-06,7e-06,-2e-06,-1.5e-05,1e-06,-1.2e-05,-4e-06,0,-1.9e-05,-4e-06,-5.5e-05,-0.000126,-8.1e-05,-1.5e-05,3.7e-05,2.3e-05,6.8e-05,-1.3e-05,1.1e-05,6.9e-05,-9.4e-05,3.4e-05,-2e-06,8e-06,-2.1e-05,2.3e-05,-0.000125,-2.8e-05,-2.4e-05,-1.3e-05,6e-06,1.8e-05,-6e-05,-5.8e-05,3e-06,3e-06,1.1e-05,2.3e-05,4.3e-05,-1.6e-05,-6e-06,-6e-06,3e-05,2e-06,2e-06,1.9e-05,-1.4e-05,-2.6e-05,7e-06,3e-06,1.2e-05,1.5e-05,1.3e-05,3e-06,2e-06,7e-06,1e-06,-5e-06,-2e-06,2e-06,-1e-06,-2e-06,0,5e-06,-1e-06,1.2e-05,3e-06,6.6e-05,2e-06,-1.1e-05,6e-06,5e-06,-1e-06,3e-06,-7e-06,1.2e-05,-9e-06,-1e-06,-5e-06,6e-06,2e-06
1e-06,0,0,-1e-06,-1e-06,0,1e-06,0,1e-06,-2e-06,0,0,-9e-06,-4e-06,-2e-06,0,1e-06,2e-06,0,1e-06,-1e-06,0,0,0,-1e-06,0,0,-1e-06,0,0,0,0,0,-2e-06,1e-06,-1e-06,-5e-06,9e-06,4.5e-05,5e-06,5e-06,-4e-06,2e-06,5e-06,-1.5e-05,-9e-06,-1e-06,-4e-06,4.1e-05,-9e-06,2.2e-05,0.000103,3e-06,-6e-06,7.8e-05,-3.1e-05,-4e-05,1.6e-05,-1.6e-05,-3e-06,-2.6e-05,-3.9e-05,-7e-06,0,0.000184,-1.1e-05,9.1e-05,-2e-06,-2.3e-05,-7.4e-05,-6e-06,-3e-05,1.3e-05,4.6e-05,4.7e-05,1.5e-05,1.8e-05,8e-06,-3.8e-05,-2.5e-05,7e-06,-6e-06,-1e-06,-8e-06,-1e-06,-2e-06,1.5e-05,2.2e-05,-2e-06,1e-06,1.1e-05,-1.7e-05,-9e-06,1.4e-05,-4e-06,3e-06,-4e-06,-1e-06,-3e-06,-1e-06,-2e-06,1e-06,1e-06,-3e-06,0,-8e-06,1.5e-05,4.3e-05,-2e-06,8e-06,-8e-06,-2e-06,0,1.2e-05,0,-8e-06,8e-06,-4e-06,4e-06,-7e-06,-1e-06
-2e-06,0,-2e-06,1e-06,0,0,2e-06,0,1e-06,-2e-06,0,-1e-06,1e-06,-3e-06,-2e-06,0,0,1e-06,0,0,1e-06,0,-1e-06,0,0,0,0,1e-06,0,0,0,1e-06,-1e-06,-1e-06,-3e-06,0,3e-06,8e-06,-3e-05,-1e-06,-1.1e-05,0,-2e-06,3e-06,1.8e-05,-3e-06,1e-06,7e-06,1e-06,1.3e-05,5.3e-05,-4e-05,-7.9e-05,4e-06,-0.000131,-5.5e-05,-4.2e-05,6e-06,2.6e-05,1.2e-05,-6.8e-05,3.8e-05,-1e-06,-2e-06,-0.000268,1.5e-05,-6e-06,1.9e-05,-2.9e-05,2.8e-05,-5e-06,-8.9e-05,1.7e-05,-2e-06,-0.000131,-2.4e-05,-1.9e-05,-4e-06,6e-06,2.4e-05,-5e-06,5e-06,-8e-06,-1.1e-05,2e-06,-1.7e-05,-1.3e-05,-1.2e-05,-9e-06,1e-06,-1e-06,1.5e-05,-5e-06,7e-06,0,0,-1e-06,-3e-06,-1e-06,1e-06,1e-06,-2e-06,-1e-06,-6e-06,0,1e-06,2e-06,1e-06,-3e-06,-6e-06,0,4e-06,0,-2.4e-05,8e-06,-7e-06,-3e-06,6e-06,-3e-06,9e-06,1e-06
1e-06,0,1e-06,-2e-06,0,0,1e-06,0,-1e-06,-2e-06,0,-2e-06,0,9e-06,-2e-06,0,0,-1e-06,0,0,0,0,0,0,1e-06,0,0,-1e-06,0,0,-1e-06,0,0,1e-06,-4e-06,-1e-06,3e-06,-6e-06,1.6e-05,-3e-06,-5e-06,-3e-06,2e-06,-4e-06,-8e-06,6e-06,0,-1e-05,-3.1e-05,-5e-06,3.2e-05,-4.3e-05,-1e-05,-2.4e-05,5.3e-05,6.8e-05,4.5e-05,-2.3e-05,-3.9e-05,-2.9e-05,-7.3e-05,-1.1e-05,-1e-06,7e-06,0.000288,-1e-05,-1e-05,1.3e-05,-2e-05,4.6e-05,2.4e-05,5e-06,-4e-05,-2.1e-05,9.8e-05,1.5e-05,1.2e-05,-1.2e-05,2e-05,-1e-06,-2e-06,6e-06,1.3e-05,0,-1e-06,2.4e-05,9e-06,-1e-05,5e-06,2e-06,-1.7e-05,-1.6e-05,1.3e-05,-4e-06,-2e-06,0,-2e-06,-3e-06,-3e-06,-2e-06,-1e-06,2e-06,0,-3e-06,0,8e-06,1.9e-05,3.5e-05,1e-06,-1e-06,1e-06,-3e-06,1e-06,2.6e-05,6e-06,1.3e-05,9e-06,-2e-06,0,-6e-06,-1e-06
-2e-06,0,0,2e-06,-1e-06,0,0,-1e-06,0,-2e-06,0,-1e-06,6e-06,1e-06,-1e-06,0,0,-1e-06,0,-1e-06,1e-06,0,0,0,0,0,0,1e-06,0,0,1e-06,0,0,-1e-06,0,0,-1e-06,-2e-06,-1.8e-05,1e-06,2e-05,1e-06,-1e-06,5e-06,-6e-06,1e-06,-2e-06,1.2e-05,-5e-06,-9e-06,-2.4e-05,0.000106,-9.6e-05,-2.3e-05,7.6e-05,2.2e-05,1.1e-05,-1.3e-05,0,-1e-05,-4.4e-05,-4.2e-05,-1e-06,-4e-06,-0.000364,0,-5e-05,-2e-06,8e-06,-2.2e-05,-2.9e-05,-5e-06,0.000115,2e-05,2.4e-05,1.1e-05,-9e-06,-2e-05,-3.7e-05,2.4e-05,-4e-06,-1e-06,-7e-06,2e-06,1e-06,-2.5e-05,-1.3e-05,2.4e-05,0,-3e-06,-4e-06,1.4e-05,-2e-06,-9e-06,-3e-06,0,-1e-06,5e-06,-2e-06,2e-06,-1e-06,-1e-06,0,3e-06,0,-1e-05,-8e-06,-1.3e-05,1e-06,9e-06,0,2e-06,0,6e-06,-3e-06,0,-1.7e-05,-1e-06,4e-06,6e-06,2e-06
