-0.003555,-0.004758,-0.008132,-0.010985,-0.019923,-0.024301,-0.026613,-0.027162,-0.024043,-0.02538,-0.017637,-0.011726,-0.015297,-0.014285,-0.015435,-0.015796,-0.014285,-0.019601,-0.026209,-0.027781,-0.023637,-0.023123,-0.023688,-0.024676,-0.020452,-0.012384,-0.014994,-0.017513
-0.002723,-0.003088,-0.006493,-0.007071,-0.013383,-0.0164,-0.01695,-0.021308,-0.015366,-0.013535,-0.009547,-0.006542,-0.009392,-0.00578,-0.007445,-0.009028,-0.008197,-0.014917,-0.014615,-0.011287,-0.004329,-0.009631,-0.010947,-0.00844,-0.007962,-0.00369,0.003141,-0.00623
0.000193,-0.000113,0.000367,0.002945,0.006534,0.004708,0.004505,-0.001454,0.004875,0.012538,0.003241,0.001204,0.004001,0.002031,0.001109,0.000207,-0.000898,0.000129,0.005067,0.006553,0.001343,0.003467,0.007601,0.005757,0.003419,-0.001756,-0.00413,-0.001204
0.002642,0.002652,0.006219,0.00772,0.015927,0.018939,0.019517,0.0186,0.01587,0.017226,0.008784,0.005183,0.010521,0.006195,0.007159,0.008621,0.00736,0.012292,0.015755,0.015695,0.00913,0.012155,0.014475,0.011429,0.008222,0.002153,-0.003769,0.00365
0.002203,0.002649,0.004707,0.001987,0.004193,0.011772,0.012773,0.016959,0.007444,-0.002862,0.002825,0.002976,0.004425,0.005464,0.006427,0.008422,0.009013,0.010757,0.011525,0.011582,0.015569,0.009092,0.004707,0.008818,0.007081,0.007849,0.01366,0.010214
-0.001713,-0.002204,-0.004325,-0.008001,-0.014672,-0.015317,-0.017248,-0.014179,-0.015028,-0.018639,-0.010676,-0.006253,-0.010188,-0.008362,-0.008741,-0.008979,-0.007338,-0.009004,-0.013612,-0.017511,-0.014886,-0.015225,-0.016421,-0.014279,-0.010242,-0.004418,-0.003652,-0.005389
-0.002692,-0.002394,-0.005558,-0.004286,-0.009185,-0.017957,-0.019025,-0.019278,-0.011838,-0.001343,-0.003312,-0.003745,-0.00862,-0.007622,-0.007643,-0.010459,-0.010005,-0.013065,-0.01699,-0.017482,-0.017753,-0.011567,-0.009314,-0.013185,-0.009171,-0.006735,-0.012054,-0.010146
0.000533,0.00214,0.00202,0.006446,0.00947,0.006603,0.010094,0.007768,0.010793,0.017579,0.012735,0.007174,0.00684,0.009164,0.009177,0.005963,0.005278,0.004938,0.008785,0.015091,0.016235,0.014102,0.014677,0.014915,0.012253,0.007473,0.011111,0.007779
0.001796,0.001512,0.004166,0.00476,0.0086,0.013336,0.015672,0.016029,0.009992,0.002581,0.004295,0.004194,0.008157,0.006698,0.006756,0.007856,0.007059,0.010076,0.011663,0.012793,0.010766,0.008489,0.008594,0.009857,0.007174,0.00436,0.004805,0.005604
0.000709,-0.000784,0.001202,-0.002468,-0.001937,0.00356,0.001256,0.006218,-0.001897,-0.013674,-0.007986,-0.00359,-0.000732,-0.004131,-0.003211,0.002115,0.001343,0.002352,-0.002512,-0.006696,-0.005677,-0.004297,-0.007038,-0.009679,-0.008371,-0.00376,-0.0078,-0.002634
-0.000329,-0.000601,-0.001376,-0.003638,-0.004568,-0.003084,-0.006643,-0.005383,-0.003061,-0.003402,-0.003682,-0.00236,-0.003712,-0.002596,-0.002861,-0.000953,-0.000866,-0.001729,-0.001459,-0.003666,0.000568,-0.001527,-0.004125,-0.003187,-0.002323,0.000271,0.005649,0.004075
-0.001522,-0.00132,-0.003467,-0.001291,-0.003078,-0.009149,-0.010164,-0.017406,-0.005055,0.009584,0.000989,-0.000358,-0.003273,-0.002245,-0.004122,-0.00723,-0.006375,-0.0071,-0.002141,-0.003307,-0.006937,-0.004759,-0.000291,0.001769,0.001375,-0.002526,-0.001233,-0.003047
-0.001152,-0.000691,-0.002094,0.00106,0.000308,-0.006039,-0.003369,-0.010525,-0.005368,0.004688,0.00145,-0.000292,-0.001547,-0.002604,-0.003827,-0.006864,-0.00563,-0.008051,-0.0073,-0.003857,-0.007227,-0.003931,-0.000554,-0.001856,-0.002814,-0.006301,-0.01323,-0.01289
0.001244,0.001756,0.002274,0.001768,0.002824,0.007122,0.009956,0.011852,0.0031,-0.007946,0.00083,0.001194,0.003161,0.003856,0.003744,0.003418,0.004041,0.003213,0.001985,0.008176,0.012386,0.00567,0.001574,0.002876,0.002253,0.002817,0.005184,0.001249
0.001844,0.001255,0.003388,0.000325,0.001069,0.008469,0.007069,0.016222,0.006482,-0.007887,-0.002557,0.000178,0.003477,0.003523,0.004875,0.00758,0.005994,0.009399,0.007488,0.003831,0.004086,0.002416,-0.00026,-0.000136,0.002683,0.005922,0.009124,0.010426
7.6e-05,0.000122,0.001204,1.8e-05,0.001057,0.000128,-0.002992,0.003158,0.003764,0.006782,0.000464,-0.000569,-0.000801,-0.000777,0.001318,0.003603,0.001611,0.003441,8.3e-05,-0.007473,-0.008776,-0.000655,0.000693,-0.004152,-0.001646,0.000466,-0.003902,0.004098
-0.001232,8.9e-05,-0.00098,0.000622,0.000865,-0.004418,-0.003758,-0.007595,0.000354,0.01116,0.005568,0.001223,-0.00285,0.000142,0.000114,-0.00306,-0.001275,-0.0023,-0.001801,-0.000359,0.002541,0.002577,0.003828,0.0055,0.002397,-2e-06,0.001781,0.000331
-0.001389,-0.001667,-0.002921,-0.001119,-0.004312,-0.006865,-0.003449,-0.011435,-0.007281,-0.004295,-0.00071,-0.000111,-0.002152,-0.00192,-0.003647,-0.006945,-0.003939,-0.00501,-0.002381,0.002466,0.000986,-0.003473,-0.002785,0.003135,0.000182,-0.002641,-1.9e-05,-0.006785
-0.000121,-0.001691,-0.002205,-0.00203,-0.003691,-0.001708,-0.001062,-0.002533,-0.006854,-0.013048,-0.005743,-0.001606,0.000963,-0.002961,-0.004008,-0.00116,-0.001805,-0.003788,-0.005029,-0.001826,-0.004584,-0.004357,-0.006126,-0.008939,-0.006988,-0.005457,-0.009629,-0.008529
