-0.019006,-0.016993,-0.010749,-0.010192,-0.012754,-0.014538,-0.010004,-0.01312,-0.018018,-0.021409,-0.013327,-0.013739,-0.014559,-0.019847,-0.015406,-0.016524,-0.009901,-0.015864,-0.012537,-0.019176,-0.014025,-0.022176,-0.028324,-0.022944,-0.02243,-0.009004,-0.01088,-0.013204,-0.014696,-0.021082,-0.017281,-0.01615,-0.005967,-0.011335,-0.024525,-0.015515,-0.013745,-0.011749,-0.015019,-0.019588,-0.017471,-0.017653,-0.013901,-0.009445,-0.011137,-0.019619,-0.025807,-0.021666,-0.012565,-0.01356,-0.014763,-0.015139,-0.019887,-0.003984,-0.012474,-0.011027,-0.011809,-0.019854,-0.012699,-0.022682,-0.015919,-0.013999,-0.025258,-0.022804,-0.013562,-0.007157,-0.019957,-0.012187,-0.013099,-0.014239,-0.011239,-0.013744,-0.021851,-0.01707,-0.015566,-0.017799,-0.024507,-0.017132,-0.011834,-0.017108,-0.018447,-0.011707,-0.013812,-0.008207,-0.010658,-0.02277,-0.015216,-0.013742,-0.011748,-0.01322,-0.011869,-0.010427,-0.011939,-0.006613,-0.013809,-0.01906,-0.012184,-0.014897,-0.007739,-0.004561,-0.012229,-0.016731,-0.008428,-0.015601,-0.013928,-0.010741,-0.005444,-0.017555,-0.012454,-0.01533,-0.015084,-0.012787,-0.010728,-0.007282,-0.007137,-0.00841,-0.007109,-0.01361,-0.009305,-0.016845,-0.009502
-0.008845,0.000751,0.000429,-0.00301,-0.001403,-0.001244,0.000815,-0.006689,-0.001204,0.00749,0.002625,0.004946,-0.011036,-0.000445,0.000848,-0.000949,-0.005817,-0.001199,0.000242,0.006116,0.003034,0.008143,0.013183,0.000463,4.4e-05,-0.00053,0.004589,0.003997,0.003374,0.004571,-0.004093,-2.7e-05,-0.009058,-0.007573,0.002565,-0.00419,0.001072,0.000493,-0.001296,0.002985,-0.004367,-0.002888,-0.011612,-0.009551,0.00031,-0.002069,0.006283,0.001158,0.001051,-0.001982,0.005967,-0.000226,-0.001402,0.005078,0.004961,-0.002106,0.006233,0.001791,0.003271,0.003563,0.002163,-0.00247,0.008862,0.007262,-0.006291,-0.003836,-0.004517,-0.00548,0.001544,-0.002227,-0.004976,-0.003207,0.002114,-0.002321,0.005275,0.008363,0.004268,0.003029,-0.002347,0.001972,0.004459,0.0044,0.002157,0.000488,0.000805,0.002643,0.000573,-0.004741,-0.005395,0.004008,-0.003785,-0.001536,-0.002874,-0.003819,0.001849,0.009551,0.003849,0.002538,0.000113,-0.009024,0.001252,0.003245,0.003355,0.006252,0.006802,0.001039,0.00065,0.004964,0.005901,0.008049,0.004038,0.004349,-0.002613,0.005036,-0.002014,-0.000282,0.001635,0.003219,0.001415,0.003663,0.004518
0.003007,-0.005496,-0.007211,-0.001281,0.002927,-0.008941,-0.001946,-0.002516,2.3e-05,-0.009278,-0.007296,-0.006085,0.000277,-0.000382,-0.00525,0.002653,0.002134,0.000678,0.00071,-0.010326,-0.00737,-0.008234,-0.005008,-0.002117,0.003753,-1e-04,0.000685,-0.001963,0.000564,-0.002259,0.000675,0.004175,0.004674,0.005631,0.001556,0.001435,-0.001449,-0.00744,-0.00264,-0.002696,-0.001496,-0.001557,-0.000328,0.002777,-0.008377,-0.003411,-0.003817,-0.008172,-0.003283,-0.002465,-0.001811,0.001315,0.002823,0.000332,-0.003206,0.000501,-0.008461,0.002758,-0.005888,-0.00584,-0.003384,-0.00349,-0.009428,-0.007646,0.003573,0.001594,-0.00156,-0.004504,-0.005939,-0.00597,0.004284,0.001475,0.004799,-0.00242,-0.00635,-0.002133,-0.005986,-0.003193,-0.008043,-0.006246,-0.003061,-0.008223,0.002385,-0.003904,-0.002075,0.000771,0.001516,0.000361,0.000416,-0.00761,-0.000771,0.00151,0.003513,0.002672,0.002337,-0.00549,-0.00117,0.005267,-0.000652,0.001534,0.001748,0.000654,-0.008428,-0.007309,-0.00569,-0.001384,-0.002012,-0.000222,-0.002319,-0.004571,-0.003204,-0.000865,0.00097,-0.005589,-0.000417,-0.001275,0.000812,-0.005453,-0.002624,-0.002032,-0.003407
0.001781,0.011748,0.01291,0.002805,-0.001499,-0.000296,0.005901,-0.001208,0.000198,0.003711,0.004868,0.004487,0.001921,0.003156,0.001076,-0.005672,-0.00084,0.001317,-0.000285,-0.004118,-0.000879,0.004592,0.003517,0.006762,0.000373,-0.004662,-0.00274,-0.0026,0.000283,-0.002131,-0.000243,-0.006911,-0.001728,-0.00077,0.003801,-0.004787,0.000675,0.000431,0.001185,-0.001269,-0.001937,2.5e-05,0.006158,-0.003175,0.006613,0.006972,0.001839,0.004645,-0.001655,0.004486,0.002276,-0.006504,-0.000539,-0.004929,-0.001224,-0.000635,0.00617,-0.00398,0.001283,0.003774,0.003526,-3.5e-05,0.004139,-0.000165,-0.001021,-0.002325,0.001189,0.008472,0.005428,0.007229,-0.007125,0.003961,0.003923,0.007412,-0.001688,5.1e-05,0.007385,-0.001245,0.00574,0.002147,0.000793,0.003551,-0.001448,0.000619,0.002909,-0.001949,-0.00598,0.005864,0.003835,0.005801,0.004375,-0.001219,0.00126,-0.000163,-0.001991,0.0045,-0.001196,-0.002083,-0.001519,0.004585,0.001141,0.003665,0.004859,0.006123,0.005302,0.001837,0.002264,-0.003916,0.00057,0.00253,0.000128,0.001225,-0.004488,0.000897,-7.2e-05,-0.000866,-0.002783,0.003674,0.00489,0.00116,0.002792
-0.003466,-0.008145,-0.005303,-0.002501,-0.000869,-0.000419,-0.001643,-0.001212,0.003047,-0.00036,-8.6e-05,-0.001855,-0.000508,-0.008332,-0.001705,0.000481,-0.0042,-0.00712,-0.001424,0.001049,-0.000512,-0.003872,-0.003403,-0.00818,-0.003068,-0.000812,0.002778,0.004077,-0.000249,-0.000841,-0.000979,0.001727,-0.001947,-0.008162,-0.007373,-0.003547,-0.000688,-0.00303,-0.00292,-0.002497,0.002714,-0.002434,-0.00898,-0.004879,-0.001448,-0.00803,-0.003785,-0.000578,0.000915,-0.003977,0.001094,0.002495,-0.001767,1.6e-05,0.000915,-0.002232,-0.007996,-0.006751,0.004254,0.00093,-0.002121,0.002891,-2.5e-05,0.001564,-0.002645,-0.006245,-0.001771,-0.006982,-0.004231,-0.004316,0.00154,-0.001991,-0.011151,-0.007179,-0.000137,-0.002208,-0.001443,-0.003216,-0.002702,-0.000251,0.001255,-0.00304,0.000905,0.00047,-0.004424,-0.004775,-0.00324,-0.004653,-0.001767,-0.002262,-0.001226,0.00176,-0.005312,0.000313,0.004077,-0.003475,0.002952,-0.002013,-0.001008,-0.003524,-0.001246,-0.007139,-0.001962,-0.00156,-0.003298,-0.001023,-0.001788,-0.001208,-3.2e-05,-0.002615,0.000489,-0.003679,0.000861,0.00188,0.001755,-0.001089,-0.000443,-0.001501,-0.003309,-0.002091,-0.000863
0.004637,-0.001531,-0.002597,-0.005642,-0.003052,0.001007,0.003063,-0.000139,0.003429,0.002832,-0.005666,-0.003964,-0.000456,0.003316,0.001001,-0.00054,-0.004718,0.001545,-0.000159,-0.001766,-0.004097,0.00032,0.005104,0.000365,0.004051,-0.00202,-0.005174,-0.005535,0.001618,0.001057,0.002257,-0.000569,-0.002408,0.002181,0.002843,0.000119,0.002413,0.001937,-0.000609,0.000345,-0.009329,0.003571,0.004279,0.007652,-0.003294,-0.001404,0.001081,0.002371,-0.00327,-0.002651,-0.002767,-0.000268,-0.000683,-0.002702,-0.002331,-0.001794,-0.000571,0.004392,-0.000521,-0.005335,-0.002959,0.002777,0.000879,-0.000519,0.001318,0.000103,-0.001661,0.000458,-0.003113,0.000422,-0.001652,0.00224,0.004892,-0.000707,0.001878,0.000648,-0.000639,-0.001997,-0.003933,-0.0019,0.003666,0.001365,0.001615,0.005015,0.000542,-0.001904,0.005891,0.002859,-0.000881,-9.2e-05,-0.001214,0.000302,0.001041,0.005074,-0.001503,0.001354,-0.005479,-0.001323,0.002187,0.002115,-7.7e-05,0.004047,-0.001834,-0.002959,0.000878,-0.000214,0.000803,1.6e-05,-0.002048,0.001529,0.000126,0.000503,-0.002915,-0.002365,-0.002855,0.0013,0.001034,0.003076,0.001504,-0.001388,0.001295
-0.007634,0.002918,0.002044,-0.000974,-0.003213,-0.00081,-0.005944,0.003052,-0.003101,-0.001385,0.00015,-0.002633,-0.000828,0.003456,-0.00065,-0.000701,0.002139,0.003664,0.002408,0.001216,0.002122,0.000381,-0.003848,-0.001319,-0.00452,0.00273,-0.000443,-0.000379,-0.001719,-0.001277,-0.00496,0.000681,-0.000724,0.004649,-0.00147,0.002572,-0.003661,-0.001238,-0.000832,0.004092,0.007135,-0.005437,-0.001983,-0.001114,0.002332,0.002073,-0.001516,-0.001237,-0.000232,0.001631,0.001582,-0.00026,0.00118,0.004613,-0.001845,5.5e-05,0.002469,-0.002468,-0.000353,0.003461,-2.6e-05,-0.001896,-0.000463,0.000614,-0.001498,0.000854,0.001718,0.00281,-0.001693,-0.003472,0.001851,-0.005049,-0.001203,0.002801,-0.000872,-0.000491,0.003749,0.004447,0.005445,-0.002268,-0.006597,-0.001119,-0.003685,-0.003126,0.000687,0.002886,-0.003826,-0.002514,0.001084,-0.00095,-0.001807,-0.001077,0.000601,-0.00236,-0.002479,-8.9e-05,0.001941,0.000321,0.001558,0.000886,0.001771,-6.5e-05,0.003562,0.00388,0.000969,0.001335,3.9e-05,-0.00025,-1.1e-05,-0.002177,0.001155,0.001694,0.001504,0.001581,-0.000267,-0.00051,0.000815,-0.002413,-0.002963,0.00089,-0.0029
0.005184,0.000867,0.000897,0.004212,-0.002232,-0.000608,-0.001207,-0.001299,-0.002658,-0.002047,0.000355,0.000446,0.001679,-0.001039,0.000683,-0.002229,-0.001373,-0.002731,-0.001439,-0.000544,-0.000963,0.001706,0.00272,0.000653,0.004731,-0.00021,-0.000681,-0.003083,0.000164,-0.000406,0.00102,-0.001986,0.005994,-0.002027,-0.001672,-0.002437,-0.003105,-0.000378,0.00157,-0.0041,-0.002125,4e-05,0.001494,-0.001505,0.000896,2.3e-05,0.005953,0.000793,0.000816,0.003977,-0.002063,-7.3e-05,0.000329,-0.000647,-0.00349,-0.00497,0.000745,0.001198,0.001967,-0.001726,-0.00161,0.000237,-0.003823,-0.001515,-0.001682,-0.001684,-0.001435,-0.001003,0.003798,0.003985,-0.003062,0.004898,0.001479,-0.000617,0.003093,-0.001696,-0.004581,-0.004435,-0.001302,4e-04,0.003931,0.000947,-0.000395,-0.00053,0.000599,-0.001486,0.001178,0.001938,-0.000325,0.001068,0.002973,0.004546,-0.001051,0.00064,0.001831,0.001143,-0.002687,-0.001522,-0.002188,-0.00018,0.002673,8e-04,-0.001881,-0.002173,-2.6e-05,-0.000118,1.1e-05,0.00081,0.001805,0.004754,-0.00175,-0.001363,0.000934,-0.003547,-7.2e-05,-0.000865,0.000804,-0.000929,0.002435,0.001006,0.000598
-0.00262,-0.007394,-0.001836,-0.004266,0.001287,0.001782,0.000323,-8.3e-05,0.001555,-0.000961,-0.001147,2.7e-05,0.001022,-0.001199,-0.000564,0.001628,0.001936,0.001258,0.000861,0.000486,0.006504,0.000962,-0.001336,-0.001385,-0.003356,-0.00111,0.002023,0.001309,-0.001768,0.001108,0.001996,-0.000144,-0.002514,0.000993,0.002567,0.003272,0.001382,0.001163,0.002143,0.000152,0.000626,0.00138,0.000547,-0.000191,1.6e-05,-0.001324,-0.00848,-0.003012,-0.001898,0.001696,0.000998,-0.000676,-0.001378,-0.003734,0.00044,0.001969,-0.000522,-0.001205,-0.00323,0.000609,0.002212,0.001934,0.000327,-0.000152,0.000957,0.000935,-0.00112,0.000245,-0.001881,-0.001959,0.002211,-0.002628,-0.000334,-0.001365,-0.003559,0.003273,0.001928,0.003073,-0.00068,0.003843,-0.001357,-0.002051,-0.001418,0.000818,-0.001168,0.001485,-0.000135,0.00168,-0.001857,-0.001778,8.8e-05,-0.003327,0.001131,0.000441,0.000651,-0.000248,0.002183,0.001265,0.000381,0.000139,-0.005206,-0.002927,0.000613,0.000146,-0.000456,-0.001578,-0.000784,-0.002026,0.000376,-0.003475,0.000638,0.001082,-0.000272,0.000944,0.000276,0.000549,-0.000883,0.001329,0.000651,-1.1e-05,0.000856
0.002265,0.001769,0.001179,0.00029,-0.001953,0.00042,0.002275,0.001029,0.001098,4.2e-05,0.001248,0.001597,0.000608,-0.000386,0.000759,0.000563,0.001535,-0.000991,-0.004725,0.000332,-0.003034,0.001016,0.000226,0.001578,0.004797,0.003513,-0.001745,-0.000886,-0.000819,0.000937,0.000772,0.000256,0.002894,-0.002393,0.000242,-0.002844,0.001076,0.000625,-0.00383,0.00016,0.001891,0.00086,-0.001773,0.002377,0.002124,1.6e-05,0.003209,0.002334,0.002104,-0.001603,-9.5e-05,0.000777,0.001192,0.002085,0.001924,-0.000879,-0.000852,0.000673,0.00162,0.000435,-0.001879,-0.002536,0.000307,0.000538,0.001402,0.001043,0.001287,-0.0015,0.001281,-0.001405,-0.001347,-0.000527,-0.000951,0.001556,0.003501,-9.9e-05,-0.001618,-0.001968,0.000594,-0.001493,0.002139,0.00315,0.00189,-0.000519,0.000115,-0.000597,0.000905,-0.000224,0.000872,0.002864,-0.00046,0.000222,-0.000989,-0.000945,-0.001653,-0.000885,-0.000631,-0.002386,-0.000835,-4.9e-05,0.000503,0.003616,0.00026,-0.001581,0.000157,0.00206,0.000839,0.000824,0.001189,0.002066,0.000424,-9.6e-05,0.000794,0.000826,-0.000223,0.000423,0.000409,-0.000634,-0.001457,-0.001502,-0.001594
0.000397,-0.002348,-0.000665,-0.001665,-0.000181,6.5e-05,-0.000296,0.001897,-0.001334,0.000927,-0.000434,-0.001461,-0.000518,0.000831,0.002106,-0.000351,-0.002177,-0.001273,0.002821,-0.000238,0.000824,9.4e-05,-0.000486,0.000269,-0.002418,-0.002159,0.000972,-0.00096,0.001597,0.000165,-0.000482,0.000221,-0.001,0.001905,-0.001368,0.000368,0.000456,0.000403,0.001904,-0.000687,-0.000401,0.000889,-0.000213,-0.002244,9e-06,0.000281,0.001954,-0.000113,0.00046,-0.001056,-0.001005,0.000714,4.3e-05,0.001713,-0.002373,0.001886,0.001215,0.001764,-0.001806,-0.000787,-0.000141,-0.000628,-0.001746,-0.00088,-0.001392,-5.4e-05,0.001083,-0.000124,-0.000769,0.002002,0.000659,0.000534,0.001804,-0.001948,-0.001202,-0.001319,0.002157,0.001346,-0.001221,0.000657,-0.001851,-0.001555,-0.001337,0.001155,-0.001239,0.000583,0.000235,-0.000227,-0.001991,-0.002511,-0.000997,4e-04,-0.000345,-0.002066,-0.001875,0.001134,0.000293,0.001185,-0.000597,-0.000452,-7.2e-05,-0.002018,-8.6e-05,0.000425,0.00125,-0.000993,-0.000886,0.000913,-0.000668,-0.000783,0.000148,0.00017,0.000129,-0.001123,-0.00077,-0.000329,-0.001504,-3.9e-05,-5.2e-05,0.002326,8.1e-05
-0.000461,0.000108,0.000166,0.002155,0.000461,-0.00047,0.00217,0.000208,0.000974,-0.002064,-0.001398,0.001562,-0.000926,0.000356,0.002237,-0.001446,0.002093,-0.000346,0.000535,-0.000731,-0.000635,-0.000889,-6e-04,0.000184,0.002369,-0.000865,-0.000455,0.001143,-0.002559,4.6e-05,7e-06,-0.000636,-0.001243,0.000243,0.001636,0.001499,0.000339,0.001415,1.1e-05,0.000177,-0.000398,-0.003158,-0.000153,0.00022,-0.003449,0.000211,-0.001109,0.000795,-0.001174,0.001311,0.000523,0.00047,-0.000859,-0.001082,0.000794,0.000913,-0.001207,-0.000651,0.000499,0.001355,0.001103,-0.001301,0.001803,0.001182,0.001478,-0.000624,-0.001235,0.000235,0.002111,0.001287,-0.001237,-0.001192,-5e-05,-4.6e-05,0.001264,0.000715,-0.000338,-9.4e-05,-0.000336,0.001422,0.000874,-0.000456,2.1e-05,-0.000646,-0.000146,-0.000788,0.000798,-0.001852,0.001492,0.001545,0.001438,0.000201,0.000155,0.001362,-0.000328,-0.000779,-0.001406,6e-06,-0.000285,-0.001301,-0.001214,0.000362,0.000109,0.000677,-0.001202,0.000755,9.8e-05,0.001673,-0.000203,-0.000405,-0.000928,-0.000716,0.000164,0.001256,0.000205,-0.00018,0.001196,0.000771,0.00051,-0.001459,0.000362
-0.000555,0.002581,-0.000807,-0.001502,0.000405,-0.002261,-0.001159,-0.000949,-0.001261,-0.001167,0.000132,-0.001679,0.000229,-0.000892,-0.003222,0.002545,-0.001144,-0.000393,2.3e-05,0.001107,0.000722,-0.000528,0.001322,-0.000431,-0.000991,0.001751,-8.2e-05,-5.6e-05,0.000381,2.5e-05,-0.000133,0.000259,-0.000954,-0.001446,0.000159,0.000189,-8.2e-05,-0.00024,-0.000116,-8.1e-05,0.000346,0.001123,0.001158,-0.000181,0.001497,0.000577,-0.000182,-4e-04,5.1e-05,-0.001716,0.001709,-0.001878,-0.000352,-0.000868,0.000524,-0.001156,0.001233,-0.001231,-0.000202,-0.001172,-0.001072,0.001714,2.3e-05,-0.001153,-0.000798,0.000289,0.000159,-0.000453,-0.002177,-0.000769,0.00127,0.000444,-0.000721,0.000711,-0.001416,-0.000923,-0.00042,-0.001217,0.000587,-0.002261,0.000529,0.000461,0.000504,-0.001595,0.00109,0.000102,-0.001074,3.6e-05,0.000138,-0.000174,-0.000304,-0.001677,-0.00159,-0.001047,0.000722,-0.00014,0.001329,0.000483,-0.000659,0.001097,0.000743,0.001699,8.6e-05,0.000324,2e-06,-0.000797,-1.6e-05,-0.001095,0.00022,0.000831,0.001049,0.00051,-0.000515,8.4e-05,0.000165,0.000604,-0.000724,-0.000587,-0.000744,0.00118,0.000223
-0.001328,-0.00148,-0.001261,0.00058,-0.000549,0.001106,0.000155,0.000108,-0.001441,0.000621,0.000309,0.000683,-0.000306,7.7e-05,0.00136,-0.000702,0.001231,1.6e-05,-0.001076,0.000147,0.000887,-0.001557,-2.3e-05,-0.000391,5.1e-05,-0.00045,-1e-05,-0.000688,0.000321,0.000921,-0.000446,-3.7e-05,0.000445,0.001915,-0.001037,-0.00104,-0.000272,-0.000654,-0.00086,0.000661,0.001473,0.000499,-0.000382,0.000529,0.000458,5.8e-05,0.000333,0.002184,0.000208,0.001381,-4.3e-05,0.000725,0.000628,6.7e-05,-0.000363,0.000112,-0.001795,0.000119,0.00077,0.001051,0.000601,-0.001026,0.000265,0.000752,0.000699,0.000788,0.001026,0.000393,0.000421,0.000208,0.000664,0.000539,0.000617,-0.000939,0.00034,-0.000507,0.000317,0.000537,0.00025,-2.4e-05,-0.000371,0.000167,-0.000363,0.001095,-0.000286,0.000282,0.000775,-8.2e-05,-0.000952,-0.000873,-0.000597,0.00071,0.001299,-9e-05,7.4e-05,-0.00034,-0.001424,-0.000115,9.6e-05,-0.000253,-1.4e-05,-0.000675,0.000177,9.8e-05,-5.9e-05,0.000632,5.5e-05,0.000232,2e-04,-0.001043,-0.000371,-7.4e-05,0.000452,-0.000373,0.000503,-0.000285,0.000661,-0.000409,0.000715,-0.001113,-0.000125
0.001052,0.000337,-2e-04,-0.000975,-0.000456,-0.001403,-0.000546,-0.000119,0.001037,-0.000117,0.000162,0.000305,-7.4e-05,-0.000279,-3.1e-05,-0.000172,-0.000219,0.000263,0.00012,-3.6e-05,-0.000921,0.000283,0.000367,0.000493,-0.000235,0.000578,0.001018,-0.000537,-0.000379,0.000124,-9.6e-05,0.000317,0.000366,-0.000371,0.000525,0.000608,-0.000382,0.000219,0.000403,0.00016,-0.001039,-0.000677,-9.3e-05,-0.000504,-0.000689,-0.00028,-5.3e-05,-0.001589,-0.000475,-0.000938,-0.000261,0.000758,-7.5e-05,-0.000189,0.00018,-0.000652,-0.000448,0.000496,-0.000223,8.2e-05,-0.000265,0.000538,0.000548,-0.000565,-0.000167,-0.000631,-0.000438,5.1e-05,0.000288,-0.00028,-0.000669,8e-04,-0.000906,0.000975,4.4e-05,0.000336,0.000103,2.7e-05,-0.00041,0.000782,0.000277,-7.7e-05,2.4e-05,-0.000997,-0.000437,0.000354,1e-05,-0.000109,0.000425,0.000126,0.000476,-7.9e-05,6.5e-05,0.000598,9.9e-05,-0.000511,0.000325,-0.000343,-0.000186,-0.000306,-0.000384,-0.001052,1e-04,-0.000141,0.000298,-0.000136,2.8e-05,0.00045,0.000157,0.000823,0.000115,0.000258,-0.00057,0.000496,0.000373,6.6e-05,-0.000393,-3.1e-05,-0.00035,0.000586,0.000253
-0.000176,0.001633,0.000219,-6.3e-05,-1e-05,-0.000157,-0.000437,-0.000369,0.00078,-0.000336,0.000465,0.000287,-5.3e-05,0.000324,0.000148,-0.00014,-0.000596,0.000153,0.000165,-0.000614,0.000591,0.000515,-0.000374,-7.1e-05,-0.001145,0.000119,-0.000548,0.000162,0.000382,-0.000306,-0.000177,5.4e-05,-0.000398,0.000344,-0.000523,-0.000507,-7.9e-05,0.000284,-0.000482,-0.000163,0.000819,0.00053,0.000563,-0.000427,0.000395,-0.000457,0.000248,-0.00037,0.000613,-0.000229,-0.000651,-0.000366,-4.4e-05,0.000192,4.3e-05,0.000462,-0.000102,0.000366,7e-05,-0.001006,-0.000349,1.7e-05,-0.000127,8.8e-05,-0.000399,0.000221,-0.000321,-0.000338,-0.000803,-0.000327,3e-06,-0.001171,0.000807,-1.8e-05,0.000322,0.000591,-0.000262,2.8e-05,0.000495,-0.000127,-0.001037,0.000119,6.4e-05,0.000535,0.000153,-0.000329,2e-04,0.000695,-0.000175,0.000168,1.1e-05,0.000305,-0.00063,0.000441,-0.00012,0.000657,0.000247,6e-06,0.000249,0.00026,0.000534,-0.000461,3.1e-05,0.000189,-2.2e-05,-0.000196,5.5e-05,0.000315,-0.000621,-0.00047,-0.000219,-0.00035,0.000555,-0.000406,-5.4e-05,0.000278,0.000133,0.000294,6.3e-05,0.000208,0.000185
-2e-05,-0.00084,0.000196,0.000485,0.000936,-9.1e-05,0.000562,8.3e-05,-0.001333,0.000525,-0.000658,-0.000857,-0.000237,0.000229,2.4e-05,0.000525,0.001009,-2e-06,-6.9e-05,0.000247,-0.00048,0.000139,0.000277,2.7e-05,0.000924,-5.8e-05,0.000329,-0.000448,-0.000124,1.3e-05,0.000261,1e-06,0.000272,-9e-06,0.000576,0.000191,-1.7e-05,-0.000212,0.000117,-0.000298,-0.00098,0.000274,0.000496,0.000436,-0.000175,0.000115,0.000499,0.000968,8.6e-05,-0.00082,0.000479,-0.000844,7.2e-05,-0.000134,-2.4e-05,0.000546,2e-05,-0.000853,0.00079,8.5e-05,0.00038,0.000684,-0.000226,0.000336,0.000329,-0.000255,0.000259,1.4e-05,0.00121,-8.4e-05,0.000142,0.000964,-0.000359,-0.00078,-0.000761,-0.000773,-6.6e-05,-0.00025,-0.000385,0.000162,0.000692,3.6e-05,0.000146,-0.000148,-7.9e-05,0.000123,-0.000483,-0.000625,0.000196,-4.9e-05,-9.9e-05,-3.9e-05,0.000436,-0.000278,0.000285,-0.000109,1.2e-05,0.000251,8.4e-05,-5.3e-05,0.000232,0.00042,-1.8e-05,0.000413,0.000296,0.000134,-5.9e-05,-0.00028,-0.000366,0.000553,-1.1e-05,0.000242,-0.000138,-1e-06,5.4e-05,-8.2e-05,0.000227,-7.6e-05,-0.000349,0.000331,-2e-04
0.000169,0.000225,0.00032,-0.000449,-0.000568,-0.000502,-0.000444,-5.6e-05,0.000577,0.000182,0.000311,0.000517,-1.7e-05,-0.000674,0.000304,-0.000775,-0.000183,0.00042,0.000174,0.000333,0.000242,-0.000388,-0.000159,1.6e-05,-0.001012,-2.9e-05,-0.000622,0.000208,0.000524,-5.7e-05,-0.00022,-0.000231,-0.000476,-0.000362,-0.000344,-0.000186,-7.9e-05,-0.000458,0.000152,0.000111,0.000448,-0.000198,-0.000202,0.000242,-0.00073,9e-05,-0.000874,-0.001125,-0.000105,0.000661,-0.000506,0.000473,-3.2e-05,-9.7e-05,0.000242,2.2e-05,0.00029,0.000105,-0.001033,0.000321,-7.3e-05,0.000152,-9.5e-05,-0.000286,-0.000202,-0.000169,-0.000109,0.00031,-0.000399,0.000395,0.000156,-0.000569,7e-05,0.000631,0.000121,-0.000175,-2.1e-05,4.9e-05,0.000109,-0.000101,-0.001013,0.000121,-0.000201,7.9e-05,0.000312,-0.00031,-0.000254,0.000687,0.000266,-0.000145,-1.2e-05,-0.00042,-0.00038,-2e-06,5.9e-05,-1.3e-05,-0.000299,-0.000218,0.000247,-0.000194,-0.00083,-0.000331,0.000187,-0.000532,-0.000356,-0.000156,-3e-05,6.4e-05,0.000254,-0.000487,0.000269,-0.000249,0.000116,-5.6e-05,-0.000284,4.4e-05,-6.8e-05,0.000203,2.8e-05,-0.000542,-0.000196
-0.000426,-0.000229,-3.9e-05,0.000165,0.000548,0.000149,0.000495,0.000278,0.000495,-0.000204,-0.000455,-0.000169,9e-06,0.000493,-0.000816,0.000322,-6.8e-05,2.5e-05,-0.000372,-4.2e-05,-0.000215,-0.000135,-0.000429,-9.6e-05,0.001136,7.5e-05,2.7e-05,0.000373,-0.000395,9e-06,-1.5e-05,0.000316,0.000194,0.000598,6.7e-05,0.000269,0.000565,-0.000146,9.3e-05,0.000118,-9.6e-05,-0.000264,0.000147,-0.00044,0.000818,-0.000174,0.000438,0.000639,-7.6e-05,-2.9e-05,0.000351,0.00025,0.000245,0.000293,-0.000379,0.000316,-0.000185,0.000473,0.000262,-0.000629,0.000165,-0.000233,-0.000187,0.000353,0.000222,0.000491,-4.1e-05,5.9e-05,4.1e-05,-8e-06,-0.000581,4.5e-05,-1.3e-05,-2.3e-05,-5.7e-05,0.000477,-0.000147,0.000146,0.000394,-0.000241,0.000399,0.000138,0.00014,0.000199,0.00015,0.000168,0.000491,-3.5e-05,-0.000281,0.000252,0.000135,0.000249,0.000289,5e-05,-0.00018,-0.000135,0.000166,0.000236,-0.000156,0.000211,0.000161,0.000388,-0.000113,6.9e-05,3.7e-05,0.000225,0.000103,0.000224,-7.7e-05,0.000239,-7.8e-05,0.000133,-0.000108,0.000196,7.6e-05,-0.000119,5.6e-05,0.000175,0.000355,4.9e-05,2e-04
0.000175,-0.000902,-0.000184,-0.000427,-0.000303,-0.000292,-0.000297,-0.000121,-0.000383,-0.000244,0.000197,0.000241,7.9e-05,-4.3e-05,0.000351,-0.000328,0.000202,0.000114,-0.000231,1.6e-05,0.000201,-8.2e-05,2.4e-05,8e-06,-0.001173,-0.00017,-0.000134,0.000129,-0.000142,-0.000129,2.4e-05,5.4e-05,-9.1e-05,-0.000277,0.000624,-8.5e-05,-1.5e-05,-0.000134,-0.00072,-4.6e-05,0.000304,-0.000204,-0.000207,-4.6e-05,5.1e-05,0.000156,0.000305,-0.000557,5.5e-05,0.000245,0.000412,-9.9e-05,-0.000143,8.3e-05,2.2e-05,0.000168,1.4e-05,-0.000223,-0.000326,0.000693,0.000117,0.000396,9e-05,-0.000189,-6.3e-05,-0.000118,0.000273,-0.000178,7.8e-05,-0.000313,0.000355,7e-05,-0.000174,-7.8e-05,0.000265,-0.000181,5.3e-05,-0.000198,-0.000228,-0.000166,0.000274,-7e-05,-5.2e-05,-0.00026,-0.000298,8.3e-05,-0.000473,-9.2e-05,7.7e-05,-0.000234,-7e-05,3.2e-05,2e-05,-0.000198,-7.9e-05,4.8e-05,-0.000177,-0.000246,2.7e-05,-0.000157,7e-06,-0.000315,0.000102,2.1e-05,0.000137,-0.000133,-0.000126,8.5e-05,-5e-06,3.9e-05,-9.9e-05,-2.1e-05,0.000141,-6.1e-05,-8.4e-05,0.000135,-0.000101,-0.000148,-9.1e-05,3.3e-05,-9.9e-05
-0.000241,0.000346,0.000105,0.00038,-0.000345,9.2e-05,0.000168,-0.000215,-0.000245,-0.000214,-2e-06,-9e-05,1.2e-05,-2.9e-05,-0.000481,0.000611,-0.000264,-8.8e-05,0.00056,-4.9e-05,-8.8e-05,0.000205,-1.7e-05,3e-06,0.000714,0.000154,0.00022,-0.000292,0.000128,-0.000168,-0.000217,-0.00025,8.9e-05,-5.9e-05,-0.000399,8.8e-05,-0.000224,-0.00011,2.2e-05,-0.000182,-0.000473,0.000356,8e-05,-7.2e-05,-0.000356,-5.2e-05,-0.000391,0.000322,-5e-06,-0.000372,-0.000133,-0.000159,-7.4e-05,-0.000372,0.000192,-0.000488,3.5e-05,5.7e-05,-3.2e-05,-0.000301,-0.000347,-8e-04,8.7e-05,0.000235,0.000124,-0.000155,-6.4e-05,2.6e-05,-3e-04,0.000455,-0.000181,-6.7e-05,0.000273,0.000299,-0.000298,-9e-05,-7.3e-05,-2e-05,-0.000127,6.3e-05,5.5e-05,0.000114,7.3e-05,0.000209,-8.1e-05,-1.7e-05,-1.2e-05,0.000277,9.2e-05,0.000133,-4.5e-05,0.000217,-0.000249,-0.000149,7.1e-05,0.000143,5.7e-05,6e-06,-7.5e-05,-1.4e-05,-0.000276,2e-04,-0.000202,-1e-04,-0.000262,8.7e-05,7.6e-05,1.7e-05,7.3e-05,-0.000175,-9.7e-05,4e-06,-5.8e-05,-3.1e-05,7.9e-05,-1.2e-05,5e-05,-7.3e-05,-3.6e-05,0.000204,-0.000106
0.000142,0.000354,5.7e-05,-0.000431,8e-06,0.000159,-0.000265,-0.000157,0.000226,5.4e-05,2.1e-05,0.000109,0.000107,0.00015,5.8e-05,-0.000331,9.5e-05,-9e-05,5.4e-05,-9.8e-05,-0.000161,0.000263,7.2e-05,7.8e-05,-0.000433,9.3e-05,-6.3e-05,-1.1e-05,-0.00019,-2.1e-05,4.5e-05,2e-06,-1.9e-05,-5.7e-05,2.7e-05,-2e-04,-0.000101,-0.000133,0.000254,0.000138,0.000264,7.4e-05,2.2e-05,0.000473,0.000412,-0.00015,2.4e-05,0.000204,9.1e-05,0.000483,-0.000205,8e-06,-9.1e-05,8.1e-05,-0.000187,6.8e-05,0.00027,-0.000153,0.000157,0.000182,0.00016,0.000296,-1e-06,-0.000127,-5.3e-05,5e-05,-7.4e-05,-4e-06,0.000238,-7.4e-05,3e-04,-3.8e-05,-0.000221,-0.000423,-8.4e-05,0.000364,-7.2e-05,0.00013,0.000296,0.000221,1.5e-05,8.6e-05,-1.6e-05,2e-06,0.00013,-2.1e-05,-0.000122,2.1e-05,-0.000216,-7e-05,1.1e-05,-0.000274,0.000328,0.000141,-1.8e-05,-3.9e-05,-4.6e-05,0.000131,1.8e-05,0.000151,0.000362,-8.9e-05,0.000104,0.000181,0.00014,-8.2e-05,-5.1e-05,-0.000148,-7.3e-05,3e-04,0.000164,9e-06,-3.4e-05,9.9e-05,8.5e-05,-1.8e-05,-3.8e-05,1.7e-05,5.1e-05,-5.4e-05,0.000202
5.7e-05,-0.000387,-3.1e-05,0.00039,0.000236,5e-06,3.9e-05,0.000235,-3e-06,4.8e-05,6.7e-05,-0.000205,0.000109,-0.000491,-0.000335,1e-04,-3.3e-05,-4e-06,-0.000128,0.000151,-0.000268,-3.3e-05,-3.3e-05,-2.7e-05,7.7e-05,-0.000166,0.000103,-1e-06,0.00018,-6.6e-05,-9.8e-05,0.000115,1.3e-05,-0.000286,-7e-05,0.000214,-0.000169,-5.7e-05,7.7e-05,7.5e-05,-0.000205,-0.000413,-4.5e-05,-0.000357,-0.000198,8.7e-05,0.000304,-0.000412,0.000108,-0.000472,4.9e-05,1e-05,8e-05,0.00023,8.5e-05,-0.000356,0.000103,7.6e-05,-7e-05,-0.000137,-4e-05,-0.000565,0.000213,3.1e-05,-1.7e-05,-4.1e-05,0.000119,-7e-05,-0.000102,-0.000265,-0.000489,-0.000103,0.000102,2.9e-05,0.000261,-0.000171,3.9e-05,-0.000102,-0.000401,-9.2e-05,-0.000117,-0.000102,-5.5e-05,-7.5e-05,3.7e-05,1.8e-05,0.000146,-2.4e-05,0.000185,0.000122,-1.8e-05,-1.6e-05,-0.000264,9e-05,-0.000212,5e-06,2.3e-05,-4.6e-05,-0.000233,-9e-05,-0.000131,-1.9e-05,-7.7e-05,3.1e-05,-2.2e-05,8.4e-05,1.8e-05,-1.6e-05,-7.9e-05,-0.000318,-8.6e-05,-1.5e-05,8.7e-05,-6.6e-05,-6.4e-05,4.9e-05,7.1e-05,-2e-05,-0.000131,6e-06,9e-06
-0.000217,0.000468,3.3e-05,-0.000206,-9.5e-05,0.000273,-0.000145,-2e-05,-8.3e-05,-8.8e-05,-5.7e-05,0.000107,0.00011,0.000359,0.000285,-0.000223,-7.8e-05,-8.4e-05,-0.000313,4.7e-05,6.3e-05,0.000183,0.000156,2e-05,0.000202,0.000152,-6.9e-05,-0.000159,-0.00014,-7.8e-05,0.000102,-7.9e-05,7.7e-05,0.000571,-4.6e-05,-0.000213,2.2e-05,5.3e-05,-5e-05,-3.6e-05,2.5e-05,0.000547,9.8e-05,4.8e-05,-0.000264,-4.3e-05,-0.000364,0.000318,-0.000186,0.000707,-0.000104,0.000118,9e-05,-0.000106,9e-06,0.000316,-0.000154,0.000249,-3.8e-05,0.000126,-1.1e-05,0.000408,-6.6e-05,7e-05,-9.2e-05,0.000113,-8.1e-05,7.4e-05,0.000116,0.000174,0.000398,0.000329,-1.2e-05,0.000241,-3.1e-05,-0.000165,8.8e-05,0.000147,0.000265,8.1e-05,0.000338,4.7e-05,5.4e-05,-3.2e-05,3e-05,-1e-05,-0.000107,-0.000197,-0.000128,-0.000156,1e-06,7.7e-05,6.6e-05,-0.000217,0.000184,-0.000114,3.6e-05,6.7e-05,-3e-05,-2.6e-05,-0.000156,6.8e-05,6.6e-05,-2.9e-05,5.2e-05,-2.7e-05,1.8e-05,6.8e-05,4.8e-05,0.000227,2.8e-05,-1.5e-05,-8.6e-05,-1e-06,6.1e-05,-3.5e-05,-6e-05,-4.8e-05,1.8e-05,-0.000143,-1e-04
0.000256,6.4e-05,-8.1e-05,-9.2e-05,1.6e-05,-0.000114,0.000226,8.7e-05,7.6e-05,-3.5e-05,0.000106,8.5e-05,-4.1e-05,-4.8e-05,-0.000129,0.000241,0.000221,-7e-06,0.000239,-0.000118,-3.4e-05,-2.6e-05,0.000167,-3.4e-05,-0.000228,-0.000309,0.000127,-3.4e-05,8.9e-05,-6.8e-05,7.9e-05,-3e-05,4.3e-05,-0.000255,0.000104,0.000122,0.000109,6.1e-05,6.4e-05,-1.4e-05,0.000185,-0.000317,-0.00015,2e-05,0.000303,-4e-05,0.000161,-0.000225,7.9e-05,-0.000187,-8.6e-05,-1.1e-05,-1e-04,-0.000136,4.7e-05,0.000149,2.8e-05,-0.000225,3.1e-05,-0.000193,0.000102,-0.000303,-8.1e-05,-4.8e-05,-4.3e-05,-1.5e-05,-6.3e-05,7.2e-05,6.7e-05,-0.000159,-0.000178,-0.000302,1.3e-05,-0.000243,6.9e-05,6.8e-05,-6.9e-05,-0.000109,-4.1e-05,8e-05,-0.000437,4.8e-05,-4.8e-05,-3.6e-05,-6.6e-05,-3e-06,1e-04,8e-06,1.1e-05,5.3e-05,-1.1e-05,8.6e-05,2.8e-05,9.7e-05,7.2e-05,8.3e-05,-5.8e-05,-7e-05,-4.7e-05,4.7e-05,0.000275,5.6e-05,-7.3e-05,0.000102,-4.7e-05,-1.1e-05,-2.8e-05,6.8e-05,0.000123,-0.000231,-9.1e-05,-1.4e-05,0.000103,5e-05,-5.1e-05,2.4e-05,-5e-06,5.2e-05,0.000135,7.1e-05,8e-05
-0.000232,-0.000218,-2.2e-05,-1.8e-05,-5.9e-05,3.5e-05,-4.6e-05,-0.000122,-4.4e-05,1.9e-05,-0.000161,-0.000115,-5.2e-05,-6.6e-05,1.9e-05,-0.000229,-0.000232,-1.6e-05,4.5e-05,1e-05,0.000279,-0.000155,-0.000152,-9e-06,0.000598,0.000149,-0.000138,0.000164,6.1e-05,-3.5e-05,-3.5e-05,4.6e-05,3.3e-05,-8.4e-05,3.9e-05,-1.8e-05,0.000125,0.000121,-1.7e-05,-1.9e-05,-0.00019,-7.2e-05,0.000212,4.5e-05,-8.7e-05,2.1e-05,5e-05,9.3e-05,4e-06,4.2e-05,-3e-06,-0.000226,5.4e-05,1.7e-05,-2.6e-05,0.000122,-0.000123,-2.1e-05,0.00026,0.000181,-0.000123,0.00028,2.9e-05,-2.4e-05,8.6e-05,1.8e-05,0.000126,3.8e-05,-0.000261,1.2e-05,0.000185,0.000305,0.000104,0.000166,-0.000215,0.000116,6.8e-05,0.000127,-7e-05,-0.000312,0.000154,-1.1e-05,1.1e-05,-1.3e-05,-9.8e-05,-2.8e-05,-0.000152,-5.5e-05,0.00013,8e-05,-3e-05,-8.4e-05,-0.000118,0.000116,5.3e-05,-1.2e-05,-1.9e-05,-6e-05,9.7e-05,-3.1e-05,-3.7e-05,1.7e-05,4.5e-05,-9.1e-05,-1.7e-05,1.7e-05,1.9e-05,-0.000143,1.7e-05,0.00018,0.00013,4.2e-05,-0.000104,-0.000166,8.3e-05,-3.6e-05,9e-06,5.3e-05,-3.4e-05,-1.3e-05,2e-06
0.000159,0.000366,1e-05,4e-06,0.000221,-2.5e-05,1.9e-05,2.6e-05,2.8e-05,-4e-06,0.000151,-9e-06,-1.2e-05,0.000153,-2.8e-05,0.000195,-1.4e-05,3.5e-05,-5.5e-05,8.8e-05,-0.000469,-0.000165,-6.2e-05,-8e-06,-5e-04,0.000144,0.000151,2.3e-05,-8e-05,2.5e-05,2.8e-05,-2e-06,-6.1e-05,4.3e-05,8.1e-05,4.3e-05,-4.6e-05,5.9e-05,6.9e-05,3e-06,0.000128,9.2e-05,-2.9e-05,2.7e-05,-0.000203,1.7e-05,-0.000303,-0.000101,-1e-06,-0.000311,2.2e-05,0.000144,-8.3e-05,4.5e-05,-4.4e-05,-5.9e-05,0.000165,8.6e-05,-0.000323,-0.000151,-1.8e-05,0.000125,-5.3e-05,3.6e-05,-3.8e-05,-0.000115,-5e-06,5.3e-05,0.000212,0.000117,-0.000255,-0.00018,-7.4e-05,-3.3e-05,0.000312,-5.7e-05,-6.2e-05,-0.000139,1.8e-05,-2.5e-05,1.8e-05,0,-2.5e-05,8.8e-05,5.7e-05,2.1e-05,0.000141,-4e-05,-0.000133,-0.000145,2.5e-05,-7.8e-05,0.00021,-4.5e-05,-0.00019,-6.2e-05,1.5e-05,6.1e-05,-5.3e-05,-1e-05,-0.000145,-0.000106,-7e-05,-7e-06,-1.3e-05,-4.3e-05,-2.4e-05,-5.9e-05,-7.2e-05,-0.000131,-5.8e-05,-2.6e-05,0.000102,0.000116,-3.5e-05,4.4e-05,1.7e-05,-3.6e-05,0,3.7e-05,-7.7e-05
-3.3e-05,-0.000265,-7.3e-05,0.00014,-2e-04,-0.000168,5.5e-05,1.8e-05,-0.000105,-3.6e-05,-0.000143,8.9e-05,-6.2e-05,-0.000288,3.4e-05,-0.000163,0.000133,2.7e-05,-6.3e-05,-2.3e-05,0.000129,2e-05,4e-06,2.1e-05,0.000394,-0.00017,-9e-05,-0.000125,8.9e-05,-2e-06,-5.2e-05,4.1e-05,4.2e-05,-0.000117,1e-05,-0.000129,3.2e-05,2.3e-05,7.4e-05,-6e-06,-0.000163,-0.000119,0.000102,-7.4e-05,0.000256,-2.1e-05,3e-04,-5.2e-05,3e-06,0.000119,0.000109,9.6e-05,1e-04,7.5e-05,9e-06,-4e-05,-2e-05,5.4e-05,0.000114,0.000194,5.1e-05,9.6e-05,-3.9e-05,-3.8e-05,0.000104,4.6e-05,-6.5e-05,4.5e-05,-0.000111,-2.9e-05,0.000199,4.4e-05,2e-05,-0.000221,-0.000227,-6.4e-05,-8e-06,7.3e-05,8.8e-05,0.000216,5.9e-05,-1.1e-05,4e-05,-9.8e-05,0.000104,5.5e-05,-6.4e-05,0.00013,0.000108,0.000104,2.1e-05,6.4e-05,-0.000161,-4e-06,6.4e-05,3.1e-05,2.6e-05,-3e-05,7.4e-05,3.5e-05,0.000121,0.000179,8.8e-05,7.6e-05,1.6e-05,3.8e-05,3.9e-05,8.1e-05,-2.8e-05,5.4e-05,6.1e-05,2.4e-05,-1e-04,7.2e-05,4.1e-05,-2.6e-05,-6e-06,1e-06,-8.3e-05,-6.1e-05,8e-06
-3.2e-05,-0.000218,-2.9e-05,-0.000235,-7e-05,8.4e-05,-0.000107,9.1e-05,8.6e-05,-1.7e-05,3.7e-05,3.5e-05,-1.1e-05,0.000289,-9e-06,0.00015,-0.000232,2.1e-05,-8.2e-05,-3e-05,5e-06,5.4e-05,-9e-06,7e-06,-0.000444,7.2e-05,1e-05,1.3e-05,-6.2e-05,-1e-05,-5.4e-05,-2.4e-05,-7.9e-05,0.000242,-0.000162,0.000122,-9.2e-05,6e-05,8.1e-05,-2.9e-05,0.000163,0.000304,3.8e-05,0.000167,-4.8e-05,1.4e-05,-2.6e-05,0.000179,8e-06,-3.3e-05,3.9e-05,-3.2e-05,-1.9e-05,-3.2e-05,3.2e-05,-0.000275,-9.3e-05,1e-06,-7e-06,-0.000238,-1.4e-05,8e-05,1.9e-05,-4.6e-05,-0.000113,6.3e-05,6.2e-05,-2.8e-05,5.8e-05,7.8e-05,-9.5e-05,-6.1e-05,-2.7e-05,0.000237,0.000155,9.5e-05,-2.6e-05,-4e-06,-0.000151,-2.9e-05,-0.000104,-2.1e-05,-3e-05,1e-06,-1.9e-05,-2.1e-05,0.000116,-0.000134,-4.2e-05,-2.8e-05,-3.6e-05,5.5e-05,1.9e-05,9e-05,8e-06,-2.4e-05,-7.1e-05,9e-06,3e-05,-3e-06,-5.8e-05,-0.000133,-7.6e-05,-0.000107,7.2e-05,-3.1e-05,-2.7e-05,2.4e-05,3.7e-05,5e-06,-0.000144,-1.8e-05,9.1e-05,-0.000137,-2.5e-05,-2.6e-05,1e-06,9e-06,6.6e-05,1.7e-05,4.1e-05
0.000113,0.000163,6.3e-05,0.000133,9.5e-05,-0.000165,7.2e-05,-5.3e-05,4.5e-05,3.9e-05,2.1e-05,-3.9e-05,-2.7e-05,-0.000109,0.000127,-0.000136,0.000209,1.2e-05,8.4e-05,-7e-06,1.8e-05,2e-06,-0.000105,-6e-06,0.000253,6e-06,-7.6e-05,3e-06,5.1e-05,2.8e-05,5e-06,-4.6e-05,-4e-06,-0.000205,4.2e-05,-9e-05,-4.6e-05,2.6e-05,-0.00013,2.4e-05,-0.000182,-0.000299,-4.6e-05,-9.7e-05,-8.5e-05,1.4e-05,-0.000211,-0.00011,-2.8e-05,5.7e-05,3.5e-05,-0.000177,-2.1e-05,-0.000118,1e-06,0.000135,2e-05,-0.000178,-5.1e-05,0.00017,6.7e-05,-0.000106,6e-05,4.5e-05,4.2e-05,-5.2e-05,1.9e-05,-6.7e-05,9.9e-05,-8.2e-05,4.8e-05,3.7e-05,-2.5e-05,-2.9e-05,-0.000198,-2.8e-05,-2.7e-05,1.4e-05,0.000145,1.5e-05,3.7e-05,-2e-06,-4e-06,5.5e-05,-5e-05,-6e-06,-6.9e-05,0.000123,-6.5e-05,-1.4e-05,1.3e-05,1.2e-05,3.4e-05,-7e-05,1.7e-05,5e-05,8.1e-05,1.5e-05,6.4e-05,-4.4e-05,-9.5e-05,3.9e-05,4.7e-05,-3.7e-05,-7e-05,4.2e-05,1.1e-05,-9.1e-05,1.2e-05,-6.8e-05,0.000158,-7e-06,-1e-04,0.000106,-2.7e-05,2.2e-05,-3e-06,-3.1e-05,1.3e-05,-3.9e-05,-1.8e-05
-0.000149,-0.000119,-2e-05,-0.000165,-4.6e-05,-5.7e-05,-0.000178,3.8e-05,-0.000163,-2.6e-05,-2.8e-05,6e-06,-4.5e-05,-6.6e-05,6e-05,0.00014,-0.000109,2.1e-05,6.7e-05,1e-06,6e-05,-3.4e-05,-2.2e-05,2e-06,-0.00014,-6.1e-05,3.2e-05,-0.000115,-5.5e-05,3.3e-05,1.1e-05,2e-05,7.2e-05,8e-06,4.1e-05,8.8e-05,-2.5e-05,-2e-06,-7e-05,2.5e-05,0.000242,0.000103,9.4e-05,-1.1e-05,0.000161,-4e-06,9e-05,4.6e-05,2e-05,-0.000134,-8.3e-05,0.000108,-2e-06,5e-05,-5.4e-05,-0.000117,-1.9e-05,9.4e-05,5.4e-05,-0.000103,-1.9e-05,-4e-06,5.5e-05,-6.3e-05,1e-06,1.7e-05,-4.3e-05,-8e-06,-0.00015,4.7e-05,-0.000119,1e-05,2.3e-05,-9.8e-05,0.000208,-0.000109,-1.4e-05,-5.7e-05,-2.5e-05,5.1e-05,0.000154,-1e-06,1.2e-05,-1.4e-05,-3.1e-05,0,-9e-06,3.5e-05,7.1e-05,3.2e-05,3.6e-05,-9.4e-05,-6.7e-05,-8.1e-05,-7.9e-05,3e-06,-5.7e-05,-4.2e-05,-6.4e-05,4.8e-05,0.000146,-0.000106,-5.1e-05,5.6e-05,3.2e-05,-3e-05,-5e-06,-5.1e-05,7e-06,0.000119,-9.8e-05,1.1e-05,6.7e-05,-4.5e-05,2e-05,-1.7e-05,-1.5e-05,-6e-06,-3.9e-05,2.6e-05,-2.3e-05
0.000154,-3e-06,3e-05,0.000153,-1.4e-05,-3.3e-05,0.000192,-4.1e-05,0.00011,-2.9e-05,6.7e-05,-3e-05,-4e-06,0.000157,-3.2e-05,-0.000125,-1.3e-05,6e-06,-3e-06,3.5e-05,-9.7e-05,-8.7e-05,0.00011,-1e-05,1.9e-05,2.6e-05,-5.6e-05,-1.2e-05,-5.3e-05,4.4e-05,3.3e-05,7e-06,-1.4e-05,7.8e-05,-4.7e-05,-4.9e-05,5.3e-05,-2.3e-05,6.9e-05,-1.3e-05,-0.000205,0.000112,-0.000118,-1.4e-05,-8e-05,-5e-06,0.000132,6.2e-05,4.3e-05,-2e-05,-4.9e-05,5.6e-05,4e-06,9.9e-05,6.5e-05,0.000254,4.3e-05,7.6e-05,-7.1e-05,5.3e-05,-5.4e-05,-0.000207,-9e-06,2.7e-05,-1.6e-05,-3e-06,8e-06,-2e-06,1e-06,1.2e-05,9.6e-05,-8.1e-05,-3.1e-05,0.000159,-0.000141,7.5e-05,3.4e-05,9e-05,-9.5e-05,-8.1e-05,-0.000197,-4e-06,1e-06,3.6e-05,5e-06,-4e-06,9.6e-05,-2.3e-05,-4e-05,8e-06,-1.9e-05,3.9e-05,0.000106,2.3e-05,-1.2e-05,-3.3e-05,3e-05,6.8e-05,1.3e-05,-1e-05,-6.7e-05,0.00011,4.8e-05,2.3e-05,-1.5e-05,2e-06,-7e-06,3.2e-05,5e-06,-0.000146,9.2e-05,-9e-06,-4.7e-05,-4.3e-05,-3.1e-05,7e-06,1.8e-05,2.8e-05,2.4e-05,-3.1e-05,4e-05
-0.000113,0.000207,9e-06,-9.6e-05,0.000164,-0.000171,-0.00011,3e-06,0.000157,-3.9e-05,-5.8e-05,5e-05,-4e-05,-0.00022,9.4e-05,0.00011,0.000123,-3e-06,-8.6e-05,4e-06,0.000144,-2.7e-05,2.7e-05,-1e-05,0.000173,-4e-06,0.000106,9.7e-05,4.6e-05,2.5e-05,4.2e-05,-8e-06,-2.2e-05,-9.5e-05,6.7e-05,4.2e-05,5.2e-05,-1.7e-05,1.8e-05,-2.4e-05,0.000139,-0.000237,3.7e-05,0.00011,-7e-05,2.1e-05,-0.000176,-7.3e-05,-6e-05,-0.000171,-6e-05,-1.1e-05,3.7e-05,-7.7e-05,-1e-05,1.1e-05,-4e-05,-5.1e-05,5.9e-05,-4.1e-05,2.2e-05,-4.5e-05,-2.5e-05,-2.9e-05,1.4e-05,-4.5e-05,1e-05,-3.4e-05,2e-06,-0.000136,2.3e-05,0.00015,6.3e-05,-0.000146,6.3e-05,7.5e-05,1.2e-05,-7.4e-05,0.000114,-7.3e-05,3e-05,1.1e-05,1.8e-05,-3.3e-05,6.7e-05,1.6e-05,-8e-06,6.9e-05,6e-06,-6.2e-05,-1e-05,1.5e-05,-6.6e-05,3.7e-05,4.2e-05,-1.9e-05,-4.3e-05,-3e-06,-5.3e-05,-5.4e-05,-5.4e-05,-6.2e-05,-2.1e-05,-6e-06,4e-06,-8e-06,1.2e-05,1.8e-05,-4.1e-05,0.000137,-0.000158,1.4e-05,2.3e-05,0.00012,4.2e-05,-2e-05,-6e-06,1.1e-05,-1.9e-05,-3e-06,1.1e-05
4.5e-05,-9.7e-05,-3.4e-05,5.2e-05,-0.000107,1.4e-05,6.5e-05,-1.5e-05,-0.00021,5e-06,1.6e-05,-1.2e-05,8e-06,0.000223,-1e-06,-0.000112,-0.00018,-1.6e-05,-3e-06,-5.3e-05,-5.2e-05,3.9e-05,-1e-06,1e-06,-0.000226,-5.6e-05,-3.9e-05,-6e-06,-5.6e-05,2.2e-05,-3.9e-05,1.7e-05,2.3e-05,0.000108,-3.1e-05,-6.9e-05,4.9e-05,-7e-06,-8.3e-05,1.4e-05,-0.000109,0.000159,-7.9e-05,-6e-06,0.000113,2e-06,0.000138,6.1e-05,1.8e-05,0.000143,3.1e-05,-8.1e-05,-5.3e-05,-3.5e-05,3e-06,6.3e-05,-4.1e-05,9e-06,7e-06,8.5e-05,-1.1e-05,-1e-04,-1.4e-05,3.9e-05,-5.4e-05,6e-05,-1.3e-05,2.3e-05,1e-05,0.000135,-8.6e-05,-0.000157,-8e-06,2e-06,-5.2e-05,-7.1e-05,3.4e-05,5e-05,-6.5e-05,2.3e-05,-1.9e-05,-3e-05,-1.9e-05,-1.2e-05,1.9e-05,-1.7e-05,1.1e-05,-7e-06,4.5e-05,5.2e-05,2.3e-05,1.5e-05,1.1e-05,-5.3e-05,5e-06,1.9e-05,5.1e-05,1.3e-05,-9e-06,7.7e-05,0.000156,2.5e-05,1.5e-05,-9e-06,-9e-06,5e-06,-1.1e-05,-2.3e-05,-1e-05,-0.000127,0.000152,-8e-06,-2e-05,-0.000119,-1.9e-05,2e-06,-8e-06,-1.5e-05,-4.1e-05,1e-06,-3.7e-05
5.3e-05,4.2e-05,2e-05,-7.2e-05,-3.3e-05,-8.5e-05,-6.9e-05,3.9e-05,-4.1e-05,-1.8e-05,-1.8e-05,5.4e-05,4.6e-05,-0.000105,4.4e-05,8.9e-05,0.000139,-1e-05,8.7e-05,-1e-06,-2.2e-05,6.4e-05,6.7e-05,1.2e-05,0.000195,0.000152,6e-05,-4.5e-05,3.8e-05,3.2e-05,-1.5e-05,2e-06,-4.5e-05,-0.000119,8e-06,4.5e-05,-2.7e-05,4e-06,-8.2e-05,1.8e-05,8.2e-05,-9.3e-05,2.3e-05,-9.8e-05,-9e-05,0,-4.9e-05,-4.8e-05,-7e-06,0.000147,0.000121,2.8e-05,9e-06,5.3e-05,-1e-06,-0.000143,-1.1e-05,-7.1e-05,5.8e-05,-9.1e-05,3.6e-05,2e-05,-5.6e-05,-2.5e-05,5.6e-05,-1.7e-05,1.7e-05,5.4e-05,9.1e-05,-4.2e-05,5.1e-05,0.000128,-1.2e-05,0.00013,6.4e-05,-3e-05,1e-05,-8.3e-05,-1.2e-05,6.6e-05,6.5e-05,-1.1e-05,2.3e-05,4.5e-05,-6e-05,2.1e-05,-1.6e-05,1.1e-05,-5.7e-05,-2.6e-05,9e-06,-2.2e-05,6e-06,2e-06,-5e-06,2.3e-05,-5.1e-05,-7e-06,-3.8e-05,-2.8e-05,-4.4e-05,2e-06,-3.3e-05,-4e-06,-1.5e-05,2.1e-05,4e-06,-3.4e-05,2.4e-05,0.000106,-0.000104,5e-06,6e-06,6e-06,2.6e-05,8e-06,3e-06,-2e-06,4.4e-05,1.9e-05,1.1e-05
-7.8e-05,0.000126,2.8e-05,-1.1e-05,-6.3e-05,-3.1e-05,5.4e-05,-2e-06,0.000204,-2e-06,1.9e-05,-0.000103,4.6e-05,-6.1e-05,1.6e-05,-1e-04,-5e-05,-3e-06,1e-06,3.2e-05,6.6e-05,3.7e-05,4.5e-05,-4e-06,-0.000317,-6.5e-05,-5.1e-05,3.4e-05,1.1e-05,2e-05,-3.3e-05,-9e-06,-3.8e-05,2.6e-05,-5e-06,-4.7e-05,-5.3e-05,2.7e-05,-5e-06,-2e-06,-2.6e-05,8.7e-05,4e-05,-7e-06,-5.2e-05,1.3e-05,-0.000126,-4.8e-05,1.4e-05,-3.8e-05,4.8e-05,1e-05,4e-06,-8e-06,-3.3e-05,-4.9e-05,5.2e-05,6.5e-05,-0.000124,0.000121,9e-06,2.2e-05,-2.8e-05,2e-06,-3.3e-05,-1.6e-05,5e-06,-1e-06,-6e-06,-1.6e-05,-2.8e-05,-6.3e-05,-2.2e-05,-0.000116,-2.6e-05,5.9e-05,-2e-06,9.3e-05,6e-05,6e-06,-0.000115,6e-06,-1.2e-05,-3.8e-05,-3.9e-05,-1e-06,4e-05,-4e-05,4.1e-05,-1.3e-05,-1.5e-05,-4.1e-05,-4.1e-05,6e-05,5e-06,-1.5e-05,5.2e-05,-3e-05,2.5e-05,-3.6e-05,-5.1e-05,-7e-06,4.1e-05,3e-05,2.6e-05,-1.2e-05,0,8e-06,2e-06,-7.7e-05,0.000122,-7e-06,7e-06,8.2e-05,-3e-05,-1.7e-05,3e-06,-3e-06,2.1e-05,-1.5e-05,1.1e-05
0.000106,-0.000163,-2.3e-05,3.4e-05,3.1e-05,3.5e-05,-5.8e-05,-5e-06,-0.000104,-8e-06,6e-06,5.1e-05,4.1e-05,0.000167,9.2e-05,1e-04,-4.5e-05,-7e-06,-2.8e-05,-1e-05,5.2e-05,6e-05,-8.8e-05,-1e-06,0.000176,-9.4e-05,2.5e-05,-6e-06,5e-06,1.1e-05,-3.9e-05,6e-06,4.8e-05,0.000101,-1.1e-05,7.2e-05,-1.9e-05,1.7e-05,1.3e-05,-1.9e-05,-1.1e-05,2.6e-05,-1e-06,5.4e-05,0.000115,1.1e-05,0.000201,0.000113,4e-06,4.7e-05,-4.9e-05,3.6e-05,1.5e-05,-7e-06,4.6e-05,-0.000176,2.8e-05,4.2e-05,0.000104,-9.5e-05,-3.3e-05,9.8e-05,2.9e-05,4.5e-05,3e-05,1.6e-05,-2.2e-05,-1.7e-05,-8.7e-05,7.5e-05,8.7e-05,2.8e-05,-3.3e-05,5.8e-05,-4.4e-05,-8e-06,-5e-06,-7.6e-05,-3.1e-05,-7e-06,7.3e-05,9e-06,0,2e-06,2.8e-05,-1.2e-05,-8e-06,-2.5e-05,7e-06,3.6e-05,0,1.9e-05,5.3e-05,-6e-06,5.4e-05,1.7e-05,-5.5e-05,-1.1e-05,-1.4e-05,6.7e-05,8.1e-05,1.3e-05,-2.3e-05,-2.5e-05,-1.1e-05,0,1e-06,3.8e-05,0,4.7e-05,-0.000164,3e-06,-2.7e-05,-5.5e-05,1e-06,1e-05,-2e-06,-1.1e-05,-1.2e-05,-1.1e-05,-2.1e-05
-0.000112,-8e-06,6e-06,-3.5e-05,1.1e-05,-7.5e-05,-2.9e-05,-4.7e-05,-6e-05,1.5e-05,7e-06,3e-06,2.5e-05,-0.000189,-8.2e-05,-7.9e-05,0.00011,-7e-06,-2e-06,-1.5e-05,2e-06,6e-06,-9.7e-05,-6e-06,-0.000121,7.1e-05,-4.8e-05,-6e-05,3.4e-05,-3e-06,4.3e-05,2e-06,-1.2e-05,-0.000129,5e-05,-4.7e-05,-4e-06,6e-06,1.9e-05,-2e-06,2.4e-05,-0.00017,6.3e-05,2.7e-05,-2.9e-05,-1e-05,-6e-05,-0.00012,-3e-06,-0.000128,4e-06,-1.4e-05,-6e-06,6e-06,-3.4e-05,0.000179,-3.9e-05,-8.3e-05,-2.1e-05,4.6e-05,-2.1e-05,0.000102,4.1e-05,-4.1e-05,-1.1e-05,-1.3e-05,5e-06,-3e-06,2.5e-05,-8.1e-05,-0.000153,-2.4e-05,4.4e-05,1e-05,6.1e-05,-5.3e-05,-1.8e-05,5.5e-05,-4.4e-05,1.5e-05,8.3e-05,3e-06,-9e-06,4e-06,4.3e-05,-6e-06,1.5e-05,-2.1e-05,-5.2e-05,-2.5e-05,1.4e-05,1.6e-05,-1.9e-05,-2.6e-05,-3.3e-05,-1.8e-05,5.3e-05,7e-06,1.7e-05,-4e-05,-5.6e-05,-3.2e-05,2.3e-05,-3.1e-05,1.7e-05,-1.5e-05,1e-06,2e-06,-8e-06,-1.5e-05,0.000149,-3e-06,2.6e-05,2e-05,1e-06,-6e-06,1e-06,9e-06,-2.1e-05,-5e-06,2e-06
5.2e-05,3.2e-05,-7e-06,4.6e-05,2.1e-05,4.1e-05,5.4e-05,5e-06,8.5e-05,-1.5e-05,-5e-06,7.1e-05,-8e-06,0.000179,4.3e-05,9.9e-05,-0.00011,-5e-06,-9e-06,-5e-06,-7.1e-05,-2.3e-05,1.1e-05,2e-06,0.000107,0,2.4e-05,8e-06,-2.1e-05,-6e-06,-1e-06,-1.7e-05,-1e-05,5.1e-05,-5.3e-05,3.5e-05,3.5e-05,1e-05,3.6e-05,1e-05,-7.2e-05,0.000176,-3.3e-05,-3.2e-05,-2.3e-05,-1e-06,-0.000114,8.3e-05,-1.7e-05,0.000126,-5.2e-05,-6.5e-05,-2e-05,-1.2e-05,-1.2e-05,-4.1e-05,3.1e-05,3.3e-05,-7.8e-05,-6.8e-05,6e-06,5.9e-05,2e-05,2.5e-05,1e-05,4e-06,1e-05,-3.3e-05,-6.5e-05,5.7e-05,0.000149,-1e-06,9e-06,-0.000127,-6.3e-05,4.4e-05,-2.1e-05,-5.2e-05,9.9e-05,-2.7e-05,-7e-05,0,6e-06,-1.7e-05,1.5e-05,9e-06,-5.1e-05,-4e-06,5.3e-05,7e-06,-9e-06,-9e-06,1.2e-05,2.8e-05,-2.3e-05,-1e-05,-5.2e-05,-2.3e-05,2e-06,-2.3e-05,-4.4e-05,3.5e-05,-3.3e-05,2.4e-05,-2.7e-05,1e-05,-3e-06,-3.3e-05,-1.4e-05,-2.6e-05,-9.9e-05,2e-06,-3.6e-05,-9e-06,1e-06,2e-06,0,1.1e-05,-1.2e-05,1.6e-05,1.3e-05
-1.7e-05,-0.000123,-1.5e-05,-8.4e-05,2.4e-05,-4.4e-05,-3.7e-05,2.3e-05,-2e-05,-6e-06,-2.3e-05,-6.8e-05,-2.1e-05,-9.8e-05,-7.7e-05,-9.7e-05,7.1e-05,8e-06,1.8e-05,-7e-06,-2.8e-05,-1.1e-05,2.2e-05,-7e-06,9.6e-05,7e-06,-2.2e-05,4.5e-05,1.5e-05,-1.1e-05,4e-05,-3e-06,5.1e-05,-3e-05,-1.5e-05,-4e-05,3.2e-05,-2e-06,-1.9e-05,6e-06,8.5e-05,-7.2e-05,2.7e-05,-5e-05,8.2e-05,1.1e-05,0.000119,-7e-06,2e-06,-4.7e-05,-5.2e-05,2.3e-05,1.5e-05,1.6e-05,7e-06,0.000223,-3e-06,-1e-05,6.4e-05,2.8e-05,9e-06,1e-06,2.1e-05,5e-06,1e-06,6e-06,-1.5e-05,-3.2e-05,7.8e-05,-5.2e-05,-0.000109,2.1e-05,6e-06,0.000142,8.1e-05,3.7e-05,0,6.5e-05,-9.5e-05,-3.7e-05,-1.6e-05,-1.5e-05,8e-06,2.5e-05,-3.7e-05,1.1e-05,2.8e-05,2e-05,-3.8e-05,9e-06,-1.2e-05,-1.8e-05,-1.1e-05,1.6e-05,-1.3e-05,1.4e-05,4e-05,1.2e-05,2.6e-05,5.6e-05,8.6e-05,-2.9e-05,2.3e-05,1e-05,8e-06,5e-06,2e-06,8e-06,9e-06,6.8e-05,0.000129,4e-06,4.6e-05,-2.8e-05,2.7e-05,-6e-06,-3e-06,2e-06,3.2e-05,8e-06,0
-4.2e-05,5.5e-05,8e-06,4.9e-05,1.4e-05,-3e-05,5e-05,2.6e-05,4e-06,-2.4e-05,-2e-06,3.6e-05,-1.8e-05,-7.7e-05,2.5e-05,8.6e-05,1.4e-05,7e-06,3e-06,8e-06,0.000126,-4.1e-05,-4.7e-05,6e-06,-0.000101,2e-06,2.9e-05,-3.7e-05,-1.3e-05,-1.7e-05,1.1e-05,1.6e-05,-1.7e-05,2.9e-05,2e-05,2.7e-05,9e-06,-2.8e-05,-4.2e-05,-4e-06,-0.000114,-5.9e-05,-2.3e-05,3.8e-05,-5.8e-05,-1.4e-05,-5e-06,-5.3e-05,2.2e-05,0.000129,3.1e-05,5.2e-05,9e-06,-6e-06,3e-06,-8.7e-05,2.5e-05,2e-05,-4.4e-05,-5.4e-05,2.6e-05,-2.8e-05,1.6e-05,-1.6e-05,-3.3e-05,2e-06,-6e-06,2e-05,4.4e-05,-1.6e-05,0.000108,-5.7e-05,-1.1e-05,-1.4e-05,-0.000112,-6e-05,7e-06,-6.7e-05,4e-05,4e-06,2.6e-05,-4e-06,-1.3e-05,-2e-05,-4.4e-05,-1.1e-05,-3.5e-05,-1.3e-05,2e-06,1e-06,1e-05,1.5e-05,-2.3e-05,-4.3e-05,5.7e-05,-1.6e-05,-4.2e-05,-1.1e-05,-4e-06,-3e-05,-5e-05,3.8e-05,-8e-06,-3.3e-05,1e-05,4e-06,1e-06,4.5e-05,1.6e-05,-8.6e-05,-0.00017,-7e-06,-5.4e-05,4.3e-05,-1.6e-05,3e-06,3e-06,-1e-06,-1.3e-05,6e-06,-4e-06
8.5e-05,8.8e-05,6e-06,-7.1e-05,-7.7e-05,3.1e-05,-0.000113,-1.9e-05,1.4e-05,5e-06,4e-06,-3.3e-05,-1.9e-05,0.000172,-0.000125,-8.5e-05,-9.1e-05,5e-06,1.9e-05,-2e-06,-9.5e-05,-6e-06,3.7e-05,-5e-06,0.000153,-2e-05,-3.1e-05,-1.9e-05,-2.3e-05,-2.5e-05,-4.6e-05,6e-06,-2.6e-05,6.5e-05,-7e-06,-4e-05,-2.9e-05,-3.6e-05,2.5e-05,-6e-06,0.000129,8.9e-05,-7e-06,-2.5e-05,-4.6e-05,6e-06,-0.000111,9.6e-05,-2e-05,-9.7e-05,3.6e-05,1.4e-05,4e-06,-1e-05,2.2e-05,6e-06,7e-06,3.2e-05,3.2e-05,7.8e-05,-1.1e-05,-0.000105,-3.2e-05,1e-06,3.2e-05,-6e-06,2e-06,2.9e-05,-7.2e-05,6.6e-05,-0.000164,9.2e-05,-1.6e-05,-9.2e-05,0.000114,-1.5e-05,1.3e-05,6e-05,3e-05,1.9e-05,6e-05,6e-06,1.2e-05,-3e-06,1.4e-05,6e-06,1.9e-05,2.9e-05,3.9e-05,-1.8e-05,0,2e-06,2.5e-05,-8e-06,-2.3e-05,3e-06,5e-05,1.9e-05,-5e-06,-1.9e-05,-4.8e-05,-6.2e-05,1.5e-05,3e-06,-5e-06,-1e-06,-1e-06,9e-06,-3e-06,0.000109,0.000139,1e-05,5.1e-05,5e-06,9e-06,1.3e-05,2e-06,-5e-06,-6e-06,-5e-06,-1e-06
