-0.007164,-0.024856,-0.011503,-0.038376,-0.140462,-0.16863,-0.164289,-0.160781,-0.166889,-0.154735,-0.108544,-0.056067,-0.027041,-0.00798,-0.002587,-0.002144,-0.001764,-0.001526,-0.000813,-0.000323,-0.000373,-0.000446,-0.000231,-0.00016,-0.000172,-0.000162,-0.000132,-6.1e-05
0.006395,0.020182,0.00575,0.018931,0.114872,0.154552,0.163178,0.16471,0.164915,0.161156,0.126593,0.050275,0.018175,0.006507,0.001945,0.002292,0.002119,0.001844,0.000931,0.000313,0.000411,0.00051,0.000294,0.000197,0.000183,0.000157,5e-05,3e-06
0.001685,0.005314,0.002369,0.007266,0.002101,-0.011432,-0.003515,-0.01062,0.011249,0.008354,-0.018802,-0.008069,9e-05,-0.000525,-0.000308,-0.000201,-0.000273,-0.000264,-0.000146,-5.3e-05,-5.7e-05,-5.1e-05,-6.9e-05,-7.4e-05,-4.4e-05,-4.2e-05,-5.1e-05,-3.9e-05
-0.00725,-0.021964,-0.00645,-0.011141,-0.098465,-0.141912,-0.148225,-0.156659,-0.161771,-0.150999,-0.105836,-0.048645,-0.022697,-0.007055,-0.002244,-0.002376,-0.002111,-0.001786,-0.000912,-0.000343,-0.000423,-0.000509,-0.000272,-0.000188,-0.000207,-0.000179,-9.7e-05,-4.2e-05
0.005711,0.018834,0.007965,0.012452,0.08544,0.139142,0.131569,0.138883,0.119773,0.11683,0.109727,0.051503,0.021906,0.007546,0.002323,0.002049,0.001647,0.001527,0.00084,0.000308,0.000365,0.000441,0.000269,0.000202,0.000182,0.000169,0.00015,7.4e-05
0.002509,0.009281,0.002176,-0.007806,0.019849,0.047288,0.052615,0.058258,0.071635,0.061316,0.021851,0.018245,0.015653,0.003968,0.001235,0.00098,0.000762,0.000593,0.000325,0.000152,0.000177,0.000209,6.9e-05,4.2e-05,0.000102,8.2e-05,6.5e-05,3.6e-05
-0.008468,-0.031857,-0.012598,-0.017075,-0.102668,-0.160771,-0.153001,-0.160424,-0.160341,-0.151226,-0.109875,-0.052709,-0.028771,-0.009103,-0.002557,-0.002454,-0.001872,-0.001702,-0.000898,-0.000325,-0.000416,-0.000524,-0.000258,-0.00016,-0.000178,-0.000176,-0.000146,-5.1e-05
0.003161,0.010989,0.003463,0.013129,0.041714,0.052601,0.051291,0.053882,0.04088,0.048146,0.053717,0.01107,-0.00214,0.000728,-6.4e-05,0.000637,0.000721,0.000753,0.000365,9.1e-05,0.000153,0.000187,0.000148,0.00012,6.8e-05,5.4e-05,9e-06,6e-06
0.005453,0.020244,0.008619,0.009838,0.063958,0.08928,0.082046,0.088494,0.108062,0.102067,0.049654,0.026926,0.020591,0.005458,0.001543,0.001557,0.001108,0.000951,0.000448,0.000166,0.000213,0.000291,9.1e-05,2.8e-05,8.9e-05,9.5e-05,6.2e-05,9e-06
-0.005667,-0.017586,-0.005601,-0.008541,-0.060205,-0.103378,-0.100553,-0.110897,-0.112725,-0.106951,-0.071823,-0.022365,-0.009545,-0.004443,-0.000748,-0.001615,-0.001362,-0.001296,-0.000696,-0.000224,-0.000321,-0.000393,-0.000216,-0.000161,-0.000171,-0.000138,-7.2e-05,-4.1e-05
-0.002748,-0.007244,-0.003042,-0.006769,-0.018546,0.000532,0.005169,0.010257,-0.012918,-0.012428,0.01698,0.001219,-0.005232,-0.000247,-0.000292,-0.000221,-0.000114,6.4e-05,3e-05,-1.9e-05,2e-05,1.3e-05,6.4e-05,6.4e-05,1e-06,9e-06,3.5e-05,1.5e-05
0.007407,0.020852,0.006117,0.002224,0.048026,0.086878,0.075298,0.090933,0.112454,0.099007,0.043585,0.018388,0.015469,0.005293,0.001221,0.00165,0.001194,0.001029,0.000532,0.000208,0.000285,0.000353,0.00014,7.9e-05,0.000157,0.000139,9.1e-05,3.9e-05
-0.002644,-0.011875,-0.004125,0.008849,-0.005403,-0.057312,-0.063453,-0.079768,-0.0698,-0.066544,-0.052454,-0.018569,-0.008775,-0.003986,-0.000522,-0.000905,-0.000696,-0.00081,-0.000367,-7.9e-05,-0.000181,-0.000246,-0.000132,-7.8e-05,-6.1e-05,-8.9e-05,-9.3e-05,-2.2e-05
-0.0049,-0.010405,-0.002596,-0.001508,-0.0242,-0.03492,-0.02878,-0.030161,-0.056102,-0.04958,-0.009945,-0.015418,-0.016212,-0.003952,-0.00132,-0.001,-0.000608,-0.000411,-0.000169,-7.8e-05,-8.7e-05,-0.000146,-8e-06,3.4e-05,-5.4e-05,-6.4e-05,-5.5e-05,-4e-06
0.007229,0.022004,0.00778,-0.007225,0.021693,0.062854,0.059625,0.088132,0.103125,0.102251,0.05394,0.02232,0.015496,0.005203,0.000934,0.001636,0.001117,0.001037,0.000538,0.000155,0.000236,0.000319,0.000116,5.3e-05,0.000105,0.000127,9.6e-05,2.8e-05
-0.001488,-0.005234,-0.001421,0.004469,0.002867,-0.017102,-0.012731,-0.027451,-0.013782,-0.01046,-0.012009,0.010772,0.009819,0.000856,0.000776,-1.7e-05,-0.000113,-0.00029,-0.00017,-4.3e-05,-0.000117,-8.4e-05,-7.3e-05,-7.2e-05,-4.7e-05,-2.7e-05,-1e-06,-2e-05
-0.004587,-0.014251,-0.005825,-0.002971,-0.03816,-0.045056,-0.024176,-0.045049,-0.079179,-0.0866,-0.038605,-0.01642,-0.01298,-0.003627,-0.000882,-0.001434,-0.000916,-0.000695,-0.000404,-0.000154,-0.000152,-0.000223,-5.1e-05,-1.1e-05,-0.000105,-9.3e-05,-3.8e-05,-1.9e-05
0.003464,0.010187,0.002774,-0.005046,0.00985,0.037131,0.032159,0.061621,0.066091,0.05988,0.02751,0.000648,0.000645,0.001992,-8.6e-05,0.000912,0.000721,0.000693,0.000312,8.7e-05,0.000171,0.000194,7.3e-05,2.3e-05,7.7e-05,9e-05,5.8e-05,2.3e-05
0.001949,0.005055,0.002313,0.011676,0.033733,0.012375,-0.010362,-0.006212,0.023481,0.03517,0.018133,0.01062,0.007033,0.000933,0.000493,0.000593,0.000378,0.000117,7.4e-05,6.8e-05,5e-06,6.1e-05,-5e-06,-1.4e-05,4.9e-05,3e-06,-3.2e-05,-7e-06
