1e-06,1e-05,3e-06,1.9e-05,0,4.4e-05,1.9e-05,2.9e-05,3e-06,1e-06,1.5e-05,2e-06,3e-06,8e-06,4e-06,2.4e-05,0,1.3e-05,3e-06,3.4e-05,1.3e-05,2.5e-05,1.9e-05,1e-05,6e-06,1.4e-05,4e-06,1e-06,1.3e-05,1.7e-05,2.9e-05,0,6e-06,1e-05,7e-06,9e-06,0,1.5e-05,7e-06,1e-05,1.2e-05,8e-06,6e-06,1e-05,0,8e-06,4e-06,1.1e-05,2.6e-05,8e-06,7e-06,3e-06,2e-06,3e-06,1.9e-05,1.1e-05,1.5e-05,8e-06,7e-06,4e-06,1.6e-05,3e-06,1.8e-05,4e-06,2.5e-05,1e-06,1e-05,8e-06,0,1.3e-05,2.2e-05,6e-06,5e-06,1.5e-05,1.3e-05,1.6e-05,0,1.4e-05,1.9e-05,2.1e-05,4e-06,8e-06,3e-06,2.1e-05,0,6e-06,2.6e-05,8e-06,1.2e-05,1.1e-05,3e-06,5e-06,2e-05,1e-06,1.5e-05,1.1e-05,5.1e-05,9e-06,1e-06,1.8e-05,1.5e-05,6e-06,8e-06,2e-06,7e-06,8e-06,1.1e-05,3e-06,4e-06,1e-06,1.5e-05,7e-06,2.6e-05,0,2.4e-05,4e-06,9e-06,1.6e-05,8e-06,2.3e-05,2e-06
4.7e-05,4.1e-05,5.9e-05,3.2e-05,1.6e-05,6.9e-05,3.8e-05,4.7e-05,6.2e-05,5.4e-05,3.4e-05,2.1e-05,1.8e-05,3.2e-05,1.9e-05,8.4e-05,1.1e-05,7.3e-05,2.4e-05,5.1e-05,2.4e-05,4.5e-05,1.7e-05,2.1e-05,4.1e-05,5.8e-05,2.7e-05,1.5e-05,3e-05,2.8e-05,3.7e-05,2.6e-05,1.4e-05,2.4e-05,1.7e-05,2.6e-05,1.1e-05,2.2e-05,1.7e-05,4e-05,2e-05,2.3e-05,5.9e-05,1.3e-05,3.3e-05,4.1e-05,2.9e-05,4e-06,8.1e-05,1e-05,1e-05,8e-06,4.7e-05,3e-05,7e-06,3.2e-05,1.2e-05,2.4e-05,4.4e-05,2.5e-05,5e-05,1.1e-05,3.1e-05,1.9e-05,4.5e-05,1.6e-05,2.2e-05,3.2e-05,8e-06,2.7e-05,4.1e-05,3.3e-05,2.3e-05,2.2e-05,1.1e-05,6e-05,1.7e-05,5.1e-05,2.7e-05,5.4e-05,2.5e-05,2.3e-05,1.3e-05,5.5e-05,3.8e-05,3e-05,4.2e-05,1.6e-05,4.7e-05,4.3e-05,4.1e-05,2.9e-05,4e-05,1.9e-05,3.6e-05,3.5e-05,9.2e-05,3.9e-05,4.5e-05,7.4e-05,3e-05,3.3e-05,3e-06,2.5e-05,1.2e-05,6e-06,2.5e-05,1.1e-05,3.9e-05,2.2e-05,3.8e-05,2.7e-05,5.4e-05,3.6e-05,1.1e-05,2.6e-05,2.3e-05,5.5e-05,5e-06,4.5e-05,1.6e-05
0.000102,2.4e-05,0.000114,6e-05,5.1e-05,6.7e-05,0.000133,6.4e-05,3.9e-05,3.6e-05,9e-05,6.2e-05,5.1e-05,7.5e-05,4.4e-05,8.1e-05,1e-04,0.000114,4.2e-05,3.5e-05,5.9e-05,6.1e-05,6.4e-05,2e-05,5.6e-05,8e-05,1.6e-05,9e-06,1.7e-05,7.6e-05,3.7e-05,3.2e-05,2.1e-05,2.5e-05,5.8e-05,3.1e-05,4.4e-05,4.3e-05,1.4e-05,6.4e-05,7e-06,1.7e-05,4.2e-05,7.1e-05,5.2e-05,5.3e-05,3.2e-05,1.9e-05,0.000114,9.6e-05,1.7e-05,9e-06,7.5e-05,6.3e-05,6.4e-05,5.8e-05,4.3e-05,3.2e-05,4.7e-05,7e-06,5.2e-05,2.2e-05,2.7e-05,1.4e-05,9.4e-05,3.8e-05,2.9e-05,3.4e-05,4.1e-05,3.7e-05,4.2e-05,4.2e-05,5e-05,1.3e-05,3.2e-05,8.7e-05,5e-05,7.5e-05,5.2e-05,1.9e-05,7.3e-05,4.2e-05,2.9e-05,2.9e-05,2.7e-05,4.7e-05,7.4e-05,6e-06,8.9e-05,0.00011,3.8e-05,7.5e-05,4e-05,1.1e-05,5.7e-05,7.4e-05,0.000128,5.5e-05,1.7e-05,2.8e-05,5.6e-05,1e-05,3.2e-05,3.9e-05,3.6e-05,3e-05,3.9e-05,1.4e-05,7.8e-05,7.8e-05,5.2e-05,3e-05,8.8e-05,0.000114,0.000109,8.9e-05,1.9e-05,7.3e-05,8.9e-05,8e-05,4.2e-05
0.000159,0.000145,0.000156,0.000154,0.000117,4.7e-05,0.000104,0.000123,8.3e-05,1e-04,7.8e-05,3.1e-05,5.2e-05,4.6e-05,9.3e-05,0.000139,0.000114,0.000192,0.00014,0.000125,8e-05,4e-05,7.6e-05,4.2e-05,6.5e-05,8.9e-05,7.9e-05,2.5e-05,1.4e-05,9.9e-05,0.000105,6e-05,2.4e-05,5.3e-05,8.6e-05,3.4e-05,0.000115,4.5e-05,9.5e-05,7.5e-05,0.000103,4.4e-05,3.7e-05,9.8e-05,0.000106,4.1e-05,2e-05,3.9e-05,8.9e-05,0.000129,0.000119,3.4e-05,7.7e-05,3.8e-05,6.9e-05,3.1e-05,2.4e-05,7.1e-05,5.8e-05,2.5e-05,6.5e-05,3.4e-05,4.4e-05,3.3e-05,0.000113,4.6e-05,5.2e-05,4.3e-05,6.9e-05,3.2e-05,9.9e-05,7.1e-05,2.6e-05,8.2e-05,6.7e-05,0.000152,7.9e-05,4.9e-05,2.7e-05,4e-05,9.5e-05,2.3e-05,2.4e-05,5e-05,3.4e-05,6.9e-05,1.8e-05,7e-05,7.9e-05,3.5e-05,9.5e-05,5.1e-05,2e-05,3.3e-05,5.5e-05,7.2e-05,0.000146,0.000166,0.000119,4.2e-05,3.3e-05,4.1e-05,2.2e-05,4.9e-05,6.8e-05,6.9e-05,2.3e-05,2.2e-05,7.4e-05,5.8e-05,5.2e-05,2.3e-05,2e-05,7.5e-05,7.2e-05,7.4e-05,6.5e-05,7e-05,6.9e-05,3.1e-05,3.4e-05
2.6e-05,0.000111,4.4e-05,0.000163,5.2e-05,6.1e-05,0.000111,7.3e-05,3.6e-05,6.4e-05,9.6e-05,5.6e-05,3.9e-05,3.8e-05,7.4e-05,7.9e-05,1.2e-05,5.3e-05,5.2e-05,7.2e-05,4.5e-05,6.2e-05,5.5e-05,4.8e-05,8.4e-05,2e-05,7e-05,8.9e-05,6.6e-05,8.7e-05,7e-05,3.8e-05,7.1e-05,8.9e-05,0.000103,4.9e-05,0.000155,0.000104,0.000165,8.3e-05,9.8e-05,4.7e-05,4.6e-05,9.3e-05,2.5e-05,9e-06,4.6e-05,9.6e-05,7.8e-05,1.2e-05,4.4e-05,6.3e-05,3.3e-05,9e-06,2.3e-05,2.9e-05,7.1e-05,8.1e-05,3.9e-05,3.2e-05,9.8e-05,5e-05,3.6e-05,2.7e-05,7.8e-05,4.6e-05,6e-05,2.6e-05,5.6e-05,3.5e-05,7.8e-05,3.3e-05,6.1e-05,0.00011,1e-04,9.3e-05,3.1e-05,5.6e-05,7.5e-05,6.3e-05,5.1e-05,7.2e-05,3.1e-05,0.000102,6.9e-05,8.7e-05,7.7e-05,0.000123,0.000106,0.000129,8.4e-05,2.3e-05,3.2e-05,4.2e-05,9.2e-05,0.000101,3.6e-05,9.2e-05,7e-05,0.000129,2.5e-05,5.5e-05,4.2e-05,7.2e-05,6.2e-05,8.2e-05,6.6e-05,5.8e-05,7.9e-05,9.9e-05,6.4e-05,2.9e-05,5.4e-05,5.5e-05,9.4e-05,6.2e-05,9.6e-05,8e-05,3.5e-05,4.7e-05,3.2e-05
5.3e-05,0.000109,2.5e-05,0.00015,0.000144,5.5e-05,4.8e-05,9.5e-05,9.8e-05,5.2e-05,7e-05,4.8e-05,6.1e-05,8e-05,0.000124,0.00018,0.000132,0.000174,5.4e-05,5.3e-05,0.000114,7.4e-05,0.00011,0.000142,2.4e-05,0.000136,0.000188,0.00011,8e-05,6.9e-05,0.000103,7.3e-05,6e-05,9.7e-05,0.000188,0.000119,8.3e-05,5.8e-05,9.3e-05,0.000148,7.4e-05,0.000111,0.000125,1.1e-05,2e-06,2.6e-05,4.5e-05,6.8e-05,9.7e-05,5.2e-05,5.7e-05,0.000126,8e-05,8.1e-05,8.2e-05,7e-06,8.2e-05,0.000119,0.000105,3.2e-05,8e-05,6.9e-05,3.6e-05,4.8e-05,5.5e-05,3.2e-05,7.6e-05,3.7e-05,0.000103,6.6e-05,4.1e-05,2e-05,6.8e-05,1.5e-05,9.5e-05,0.000173,0.000185,8.5e-05,0.000151,4.5e-05,4.4e-05,9e-05,5.7e-05,0.000119,4.6e-05,3.2e-05,9.7e-05,0.000138,0.000124,0.000158,0.000114,3.1e-05,8e-05,1.1e-05,5.4e-05,0.000151,0.000204,0.000113,2.5e-05,0.000104,0.000146,7.8e-05,0.000109,9.5e-05,3.4e-05,9.7e-05,3.8e-05,5.9e-05,1.7e-05,0.000146,0.000118,6.5e-05,5e-05,4.5e-05,2.8e-05,3.6e-05,9.5e-05,4e-05,2.9e-05,6.3e-05,6.1e-05
0.000209,0.00017,0.000136,5.9e-05,0.000118,0.000206,0.000126,4.7e-05,4.9e-05,7.4e-05,4.5e-05,6.9e-05,0.000127,0.000139,9.8e-05,1.4e-05,4e-05,0.000257,0.000286,0.000116,0.000129,0.000101,0.000105,0.000119,0.000166,0.000163,0.000161,0.000208,0.000127,8.8e-05,0.000205,0.000191,0.000204,0.000145,6.8e-05,9e-06,0.000125,9e-06,8.6e-05,7.2e-05,6.6e-05,0.000125,5.3e-05,4.8e-05,4.2e-05,0.000104,8.6e-05,0.000157,0.000126,9.4e-05,0.000112,0.000136,9.7e-05,6.5e-05,0.000244,0.000162,0.000166,0.000166,0.000108,0.000124,0.000112,4.3e-05,2.8e-05,6.9e-05,0.000124,0.000108,4.8e-05,0.000103,7.3e-05,6.3e-05,0.000108,2.8e-05,6.8e-05,3.2e-05,0.000114,0.000175,0.000203,0.000237,0.000206,0.000151,0.000185,0.000108,9.1e-05,0.000141,7.8e-05,4.8e-05,0.000126,1.3e-05,0.000141,5.1e-05,9.9e-05,0.000124,0.000134,5.2e-05,2.4e-05,0.000126,0.000271,0.000193,8.3e-05,6.5e-05,9.2e-05,0.000152,0.000198,0.00011,1.1e-05,4.9e-05,0.000152,0.000185,0.00017,0.000212,2e-04,0.000107,0.000101,1.8e-05,8.9e-05,7.2e-05,0.000107,0.000115,0.000153,0.000107,7e-05
0.000259,0.000193,0.000101,2e-05,1.7e-05,8.9e-05,7.9e-05,8.7e-05,5.9e-05,0.000127,4.3e-05,8.9e-05,0.000119,2.2e-05,0.000115,0.000106,9.4e-05,0.000232,7.6e-05,7.8e-05,6.5e-05,5.8e-05,3.1e-05,8.1e-05,0.000126,8.3e-05,0.000137,0.000128,0.00015,6.5e-05,0.00018,0.00011,5.9e-05,6.1e-05,9.8e-05,0.000143,0.000137,0.000178,5.5e-05,9.6e-05,1.6e-05,6.5e-05,7.5e-05,9.9e-05,5e-06,0.000154,7.2e-05,0.000127,5.3e-05,6.5e-05,0.000103,7.6e-05,7.6e-05,0.000137,0.000137,0.000109,9.7e-05,3.1e-05,0.000148,0.000201,8.9e-05,4.6e-05,9e-06,7.8e-05,1.8e-05,3.7e-05,0.000119,0.000102,0.000131,7.3e-05,0.000177,0.000216,3.2e-05,5.3e-05,0.000102,6.3e-05,8.7e-05,0.000151,7.7e-05,5.7e-05,0.000122,6.3e-05,7e-05,9.1e-05,6.3e-05,8.5e-05,0.000155,0.00014,3.4e-05,0.000111,0.000119,5e-05,6.7e-05,0.000143,0.000135,9.4e-05,0.000119,9.4e-05,6.1e-05,4.3e-05,3.1e-05,2.6e-05,8.3e-05,1.1e-05,6.3e-05,6.4e-05,0.00017,2.7e-05,0.000115,2.6e-05,4e-05,2.6e-05,0.000105,9.9e-05,0.00011,8.4e-05,0.000104,6.7e-05,0.000112,5.1e-05,7.4e-05
9.4e-05,0.000248,0.000216,8.7e-05,0.000134,7.5e-05,6.3e-05,3.4e-05,6.6e-05,0.000162,0.000205,0.000127,2.1e-05,4.7e-05,0.000109,0.000154,0.000195,2.7e-05,0.000108,8e-05,0.000142,0.00016,0.000128,9.6e-05,3.6e-05,0.000171,0.000232,0.00029,7.5e-05,6e-05,0.000101,9.1e-05,0.00011,6.6e-05,0.000134,0.000238,0.000216,0.00032,0.000225,0.000127,2.6e-05,7e-06,6e-05,4.8e-05,0.000143,0.000119,0.00014,8.9e-05,6.3e-05,0.000124,9.3e-05,3.2e-05,4.4e-05,0.000112,0.000173,0.000124,8.6e-05,0.000117,2e-04,0.000277,0.000311,0.00026,0.000153,4.4e-05,8.1e-05,8.1e-05,8.2e-05,5.3e-05,8.8e-05,6.2e-05,0.000129,0.000208,0.000222,0.000172,7.8e-05,7.1e-05,1e-04,5.6e-05,7.3e-05,7e-05,4.6e-05,0.000102,1e-04,7.9e-05,3.8e-05,5.3e-05,4.2e-05,7.5e-05,4.7e-05,0.000164,0.000133,5.8e-05,0.000139,0.000228,9.9e-05,0.000102,6.2e-05,7.2e-05,0.000117,7.5e-05,0.000125,7.6e-05,0.000124,7.8e-05,5.1e-05,2.7e-05,0.000133,0.00017,1.4e-05,4.5e-05,4.6e-05,6.6e-05,7.7e-05,0.000148,7.6e-05,0.000146,0.000196,0.00011,0.000137,7.4e-05,7.5e-05
0.000258,0.000114,9.7e-05,0.000181,0.000198,0.000104,2.2e-05,3.9e-05,0.000153,3.1e-05,0.000215,0.000128,0.000106,5.7e-05,0.000142,7.9e-05,7.8e-05,4.5e-05,0.000159,0.000114,8.7e-05,9.3e-05,4.4e-05,3.1e-05,2.9e-05,0.000142,6.3e-05,8.7e-05,0.000163,0.000128,3.7e-05,8.6e-05,0.000162,0.000197,0.000151,9.3e-05,0.000159,0.000161,4e-05,0.000104,0.000178,0.000141,5.9e-05,3.4e-05,0.000194,0.000258,0.000119,0.00014,9.7e-05,0.000142,4.4e-05,6.7e-05,8.6e-05,6.1e-05,3.1e-05,9.8e-05,0.000188,5.8e-05,0.000171,8.4e-05,5.8e-05,8.3e-05,4.2e-05,9.1e-05,6.1e-05,9.4e-05,7.5e-05,7.4e-05,0.000118,8.1e-05,4.8e-05,5e-05,9.7e-05,1.5e-05,3.7e-05,9.2e-05,0.000107,0.000141,0.000108,0.000114,6.7e-05,0.000101,4.9e-05,7.3e-05,0.000122,7.1e-05,6.9e-05,0.000119,0.00012,0.000124,6.6e-05,9.9e-05,0.000212,0.00016,3.6e-05,8.6e-05,2.3e-05,6.7e-05,8.7e-05,7.8e-05,0.000147,0.000162,0.000128,8.5e-05,4.4e-05,1.2e-05,6.4e-05,0.000106,0.000131,5.8e-05,4.2e-05,7.4e-05,0.000117,4.3e-05,7.8e-05,0.000185,0.000125,6.4e-05,6.6e-05,0.000125,9e-05
0.000139,0.000118,4e-05,0.000127,2.7e-05,7.6e-05,3.9e-05,6.1e-05,0.000151,0.000157,9.4e-05,6.4e-05,8.7e-05,3.2e-05,0.000203,0.000205,0.000128,1.8e-05,0.000154,8.5e-05,0.000124,6.7e-05,5.9e-05,3.5e-05,6e-05,0.000123,0.000117,6.6e-05,9.2e-05,0.00016,6.6e-05,5.9e-05,9.3e-05,0.000147,5.1e-05,7.8e-05,4.9e-05,7e-05,0.000102,0.000114,7.5e-05,3.4e-05,6.5e-05,0.000103,0.000168,6.5e-05,0.000131,0.000137,5.1e-05,5.6e-05,6.9e-05,4.2e-05,5.2e-05,4e-05,8.1e-05,6.5e-05,7.7e-05,0.000116,6.9e-05,8e-05,8.3e-05,3.4e-05,6.8e-05,0.000109,0.000102,2.5e-05,4.9e-05,4.1e-05,6.2e-05,4.5e-05,7e-05,1e-05,0.000113,8.9e-05,3.8e-05,6.1e-05,2.2e-05,0.000145,6.7e-05,7.6e-05,6.9e-05,7.6e-05,8.2e-05,7.6e-05,1.5e-05,4.3e-05,7.5e-05,0.000103,1.7e-05,8.5e-05,7.3e-05,0.000107,8.5e-05,5e-05,0.000171,0.000124,4.4e-05,6.6e-05,0.000105,0.000132,3.4e-05,5e-05,7.8e-05,3.1e-05,5e-05,2.5e-05,1.5e-05,0.000117,4e-05,7.1e-05,6e-06,4.1e-05,3.1e-05,7.1e-05,2.3e-05,6.2e-05,2e-05,4.2e-05,7.8e-05,5.2e-05,5.8e-05
2.1e-05,4.5e-05,6.5e-05,2.4e-05,2.5e-05,5e-05,6e-06,1e-04,7.2e-05,7.2e-05,0.000102,9.7e-05,5.9e-05,0.000143,0.000182,6.6e-05,8.6e-05,9.6e-05,8e-05,7.9e-05,0.000143,8e-06,8.2e-05,0.000112,1.7e-05,4e-05,7.4e-05,6.3e-05,9.5e-05,5.6e-05,0.000132,0.000123,0.00014,5.9e-05,4.2e-05,5.1e-05,7.4e-05,0,5.1e-05,2.6e-05,8.3e-05,7e-05,9.2e-05,7.7e-05,7.1e-05,3.4e-05,8.3e-05,4e-05,7.9e-05,4.9e-05,4.6e-05,2.2e-05,4.9e-05,7.4e-05,8e-06,4.1e-05,3.8e-05,8e-05,0.000121,0.000135,0.000102,0.000109,2.1e-05,4.5e-05,6.6e-05,5.4e-05,4.5e-05,5.5e-05,7.6e-05,8e-05,6.2e-05,5.7e-05,0.000119,7.6e-05,5e-05,1.6e-05,1.6e-05,0.000113,8.4e-05,1.8e-05,5.1e-05,2.1e-05,1.7e-05,8.1e-05,4.9e-05,7.3e-05,2.4e-05,8.4e-05,7.1e-05,3.9e-05,5.9e-05,9.6e-05,1e-04,2.4e-05,0.000144,4e-05,9.7e-05,9.9e-05,9.3e-05,2.2e-05,6.9e-05,3.2e-05,4.1e-05,9e-05,0.000112,7.8e-05,2.8e-05,4.8e-05,0.000114,0.000116,8.7e-05,7e-05,0.000104,4.3e-05,3.6e-05,7.5e-05,2.5e-05,7.5e-05,7.2e-05,4.2e-05,3.2e-05
4.5e-05,6.3e-05,5.6e-05,5.6e-05,3e-05,1.7e-05,3.7e-05,0.000126,0.000118,3.2e-05,3.5e-05,9.1e-05,8.5e-05,0.000115,9.2e-05,0.000131,5.1e-05,4.7e-05,0.000113,3.7e-05,0.000108,5.9e-05,6.7e-05,4.7e-05,5.8e-05,7.4e-05,1.8e-05,5e-05,5.1e-05,0.00011,9.9e-05,2.8e-05,7.5e-05,9.1e-05,0.000118,0.000117,8.2e-05,0.000127,1e-05,2.2e-05,4.9e-05,2.6e-05,7.8e-05,6.4e-05,6.7e-05,5.3e-05,2.7e-05,3.4e-05,3.1e-05,3.2e-05,3.6e-05,4.9e-05,6.2e-05,4.6e-05,1.6e-05,5.3e-05,1.5e-05,2.5e-05,1.7e-05,0.000132,5.7e-05,3.7e-05,8.6e-05,3e-05,2.7e-05,4.6e-05,6.6e-05,4.6e-05,4.6e-05,6e-05,1.6e-05,1.7e-05,9.5e-05,8e-05,7.9e-05,6.6e-05,5e-05,1.6e-05,3.3e-05,4e-05,4.3e-05,1.9e-05,6.3e-05,3.4e-05,3.1e-05,5.8e-05,8.9e-05,8.5e-05,3.5e-05,6.1e-05,4.6e-05,8.8e-05,2.5e-05,5.9e-05,0.000115,0.000141,8.5e-05,4.9e-05,5.5e-05,1.7e-05,5.9e-05,8e-06,3.4e-05,2.8e-05,4.3e-05,3.6e-05,5.6e-05,3.3e-05,7e-05,4.9e-05,4.2e-05,1.7e-05,9.4e-05,6e-05,8e-06,6e-05,4.3e-05,8.9e-05,5.4e-05,6.7e-05,5.1e-05
2.9e-05,3.1e-05,0.000116,6.1e-05,6e-05,2.7e-05,3.1e-05,5.3e-05,7e-05,2.4e-05,5.4e-05,3.6e-05,2.2e-05,3.5e-05,3.7e-05,3.3e-05,4.5e-05,6e-05,5.5e-05,3.4e-05,9.2e-05,1e-04,9.4e-05,9.2e-05,6e-05,3.9e-05,6.3e-05,7.9e-05,1.4e-05,9e-05,7.7e-05,7.7e-05,0.000155,9.4e-05,0.000109,9.9e-05,4.8e-05,0.000107,0.000113,7.4e-05,4.3e-05,4.3e-05,4.4e-05,6.4e-05,1.6e-05,3.8e-05,1.4e-05,4.2e-05,3.5e-05,9.4e-05,5.7e-05,3.4e-05,3.3e-05,1.5e-05,5.9e-05,9.9e-05,5.7e-05,1.4e-05,9.3e-05,7.9e-05,0.000102,4.2e-05,7.8e-05,6.9e-05,9e-06,3.2e-05,9e-05,5.8e-05,7.3e-05,6.9e-05,7.6e-05,0.000106,3.6e-05,5.2e-05,2.1e-05,3e-05,3.3e-05,5.2e-05,0.000116,4.2e-05,6.5e-05,4.4e-05,6.8e-05,3.2e-05,7.5e-05,7.8e-05,4e-05,2.9e-05,6.4e-05,8.9e-05,9.1e-05,3.4e-05,4.6e-05,4.3e-05,2.5e-05,4.6e-05,1.5e-05,1.5e-05,8e-06,2.4e-05,5.4e-05,6.1e-05,6.2e-05,5.6e-05,5.6e-05,4e-05,5.1e-05,0.000113,9.2e-05,7e-05,5.3e-05,5e-05,5.2e-05,6.8e-05,5.3e-05,2.5e-05,6e-06,3.8e-05,7.5e-05,9.4e-05,3.1e-05
6.4e-05,7.3e-05,6.8e-05,3e-05,3.6e-05,3.2e-05,4.8e-05,2.1e-05,9.1e-05,6.5e-05,5.1e-05,5.5e-05,6.2e-05,9.2e-05,6.1e-05,3.4e-05,3.8e-05,8.4e-05,8.4e-05,3e-05,7.1e-05,9.9e-05,7.2e-05,6.5e-05,6.1e-05,3.9e-05,5.1e-05,0.000105,9.3e-05,0.000111,7.1e-05,4.8e-05,0.000178,0.000118,9.4e-05,7.9e-05,6.1e-05,3.3e-05,5.5e-05,1.6e-05,6.6e-05,3.7e-05,4.8e-05,7.6e-05,8e-05,0.000112,6.7e-05,4.6e-05,3e-05,8.7e-05,8.8e-05,8.3e-05,9e-05,3.1e-05,6e-05,4.2e-05,8.2e-05,4.7e-05,0.000131,9e-05,5.7e-05,5.7e-05,6.7e-05,9.6e-05,9.1e-05,5.1e-05,5.6e-05,2.4e-05,5e-05,8.9e-05,0.000147,5.5e-05,6.1e-05,0.000108,5.7e-05,3.8e-05,2.8e-05,6.6e-05,0.000147,0.000128,1.2e-05,3.9e-05,7.4e-05,7.9e-05,4.5e-05,0.00011,8.9e-05,0.000104,3e-05,6.6e-05,4e-05,3.5e-05,1.7e-05,7.8e-05,5.4e-05,8.5e-05,1e-05,5e-06,2.1e-05,2.8e-05,5.6e-05,6.1e-05,4.4e-05,5.2e-05,3.9e-05,8.8e-05,8.5e-05,5.5e-05,2.9e-05,7.7e-05,4.6e-05,4.8e-05,1.6e-05,6.4e-05,7.3e-05,6.3e-05,1.3e-05,2.6e-05,5.3e-05,6.8e-05,4e-05
6.8e-05,6.9e-05,8e-06,3.6e-05,6.7e-05,6.5e-05,5.8e-05,0.000112,9.3e-05,7.8e-05,5.8e-05,0.000115,0.000153,1.8e-05,2.5e-05,4.3e-05,2.6e-05,0.000152,6.5e-05,3.6e-05,4.7e-05,6.2e-05,4.3e-05,1.3e-05,1e-04,6.5e-05,4.4e-05,8.5e-05,0.000117,3.6e-05,8.7e-05,2.8e-05,0.000117,3.1e-05,0.000117,0.000136,0.000129,0.000138,6.4e-05,1.4e-05,6.5e-05,4.6e-05,3.4e-05,2.8e-05,5.5e-05,4e-05,1.9e-05,7e-05,2.4e-05,5.9e-05,7.4e-05,1.4e-05,2.5e-05,4.6e-05,4.2e-05,8.4e-05,0.000116,6.6e-05,0.000128,1e-04,7.7e-05,6.2e-05,2.5e-05,7.6e-05,7.4e-05,2.8e-05,5.4e-05,4.3e-05,4.1e-05,3.8e-05,6.8e-05,2.8e-05,7.4e-05,4.9e-05,4.2e-05,3.7e-05,3e-05,0.000116,3.2e-05,2.7e-05,9.7e-05,5.6e-05,2.7e-05,6.4e-05,1.4e-05,8.3e-05,2.7e-05,6.3e-05,8.9e-05,4.4e-05,1.2e-05,2.3e-05,1.6e-05,6.9e-05,0.000106,0.000124,7e-05,4.3e-05,3.6e-05,3.7e-05,7.2e-05,6.6e-05,4.4e-05,8.8e-05,7e-05,2.5e-05,2.3e-05,2.3e-05,9e-06,9.5e-05,6.3e-05,0.000106,7.8e-05,6.8e-05,4.9e-05,5.5e-05,7.2e-05,1.3e-05,4.9e-05,9e-06,2.9e-05
5.4e-05,3.5e-05,8.2e-05,3.7e-05,5.2e-05,4.3e-05,2.7e-05,0.000162,0.000106,4.6e-05,5.5e-05,5.8e-05,4.2e-05,0.000108,3.3e-05,2.8e-05,4.5e-05,9.9e-05,0.000111,4.1e-05,3.5e-05,0.000117,8.6e-05,4.7e-05,1e-04,9.9e-05,0.000142,0.000116,6.5e-05,4.6e-05,0.00012,0.000139,6.3e-05,1.4e-05,5.1e-05,6.9e-05,7e-05,4.3e-05,3.3e-05,3e-05,8.5e-05,6.8e-05,5.3e-05,5.6e-05,5.3e-05,3.2e-05,7.3e-05,0.000117,0.000111,0.000109,5.1e-05,4.2e-05,3.1e-05,6.8e-05,5.7e-05,9.1e-05,7.2e-05,2.7e-05,9.6e-05,2.8e-05,7.7e-05,3.5e-05,6.5e-05,5.1e-05,0.000124,9.2e-05,8.6e-05,8.9e-05,6.7e-05,6.3e-05,6e-05,1e-04,0.000115,7.7e-05,7.2e-05,2.6e-05,3e-05,0.000114,7.8e-05,5.4e-05,0.000108,0.000101,2.6e-05,7.8e-05,5.2e-05,2.5e-05,1.6e-05,2.2e-05,6e-05,3.8e-05,5e-05,4.9e-05,5.9e-05,2.2e-05,3e-05,7.8e-05,1.8e-05,4.8e-05,4.9e-05,6.6e-05,5e-05,9e-05,7e-06,3.8e-05,6.1e-05,3.3e-05,7.2e-05,8.6e-05,5.8e-05,8.1e-05,8e-05,7.4e-05,0.000138,6.2e-05,6.2e-05,3.1e-05,8.4e-05,9.7e-05,3.7e-05,4e-05,3.8e-05
7.2e-05,6.7e-05,8e-05,8e-05,9.1e-05,9.7e-05,6.3e-05,0.000136,0.000105,6.6e-05,7e-05,3.5e-05,2.8e-05,4.5e-05,6.2e-05,5.9e-05,6.3e-05,7.7e-05,4.8e-05,7.3e-05,8.8e-05,0.000148,0.000122,9.3e-05,4.6e-05,0.000145,0.000193,0.000109,1.5e-05,2.9e-05,5.9e-05,6.1e-05,3.4e-05,3e-06,1.8e-05,5.8e-05,0.000112,9e-05,4.7e-05,6.8e-05,8.7e-05,6.7e-05,3.6e-05,8.7e-05,0.000102,5.2e-05,5e-05,5.8e-05,2.7e-05,9.4e-05,0.000141,8.4e-05,8e-05,7.3e-05,2.5e-05,4.8e-05,8.9e-05,7.7e-05,3.7e-05,7.2e-05,3.9e-05,5.7e-05,4.3e-05,2.3e-05,0.000129,0.000103,6.2e-05,6.6e-05,1.2e-05,1.9e-05,3.8e-05,7.3e-05,5.6e-05,2.3e-05,4.5e-05,7.8e-05,3.7e-05,9e-05,2.3e-05,6e-05,0.000116,5.9e-05,7.1e-05,0.000155,0.000153,9.6e-05,3.6e-05,1.4e-05,6.2e-05,2e-06,4.1e-05,6.2e-05,4.6e-05,7.3e-05,7e-05,7.8e-05,0.000113,5.8e-05,1.7e-05,6e-05,5.6e-05,4.5e-05,6.8e-05,5.5e-05,2e-06,5e-05,8.6e-05,5.9e-05,7e-06,7.5e-05,5.7e-05,3.9e-05,5.3e-05,7.4e-05,7e-06,4.1e-05,3.8e-05,7.2e-05,5.5e-05,2.2e-05,1.8e-05
9.5e-05,7.7e-05,4.2e-05,7.2e-05,5e-05,3.3e-05,3.2e-05,0.000129,5.6e-05,4.6e-05,3.2e-05,7e-05,4.5e-05,1.6e-05,2.7e-05,4.5e-05,7e-06,2.4e-05,5.8e-05,8e-05,5.8e-05,4.9e-05,4.8e-05,8.4e-05,8.4e-05,8.1e-05,3.1e-05,3.3e-05,1.9e-05,2.7e-05,4.5e-05,4.2e-05,1.1e-05,3.2e-05,5.5e-05,1.6e-05,3.3e-05,1.7e-05,2.5e-05,3e-05,3.7e-05,7.8e-05,7e-05,2.8e-05,7.7e-05,9.2e-05,5.3e-05,4.8e-05,6.6e-05,6.2e-05,3.1e-05,1.3e-05,4.5e-05,1.5e-05,5.3e-05,3.7e-05,5.6e-05,2.3e-05,4.2e-05,3.5e-05,2.7e-05,1.4e-05,1.7e-05,1e-06,9.9e-05,3.6e-05,3.4e-05,1e-06,3e-05,1.1e-05,3.8e-05,9.1e-05,2.8e-05,1.4e-05,9e-06,5.5e-05,5.4e-05,5e-05,7e-05,7.1e-05,2e-06,4.6e-05,4e-06,0.000115,9.1e-05,5.3e-05,5.3e-05,5.3e-05,4.9e-05,5.7e-05,1.5e-05,3.3e-05,2.8e-05,1.6e-05,5.9e-05,4.9e-05,4.2e-05,1.8e-05,1.7e-05,3.8e-05,3.7e-05,1.3e-05,2.2e-05,1.3e-05,1.9e-05,7.1e-05,7e-06,1.8e-05,1.2e-05,2.7e-05,2e-05,2.3e-05,4.2e-05,4e-05,5.4e-05,1.4e-05,4.3e-05,8e-06,2.4e-05,3.7e-05,2.5e-05
6.5e-05,2.8e-05,5.5e-05,2.4e-05,1.5e-05,8e-06,6.1e-05,2.3e-05,2.9e-05,1.9e-05,6.2e-05,2.7e-05,1.7e-05,5e-06,2.9e-05,5e-05,3.9e-05,5.8e-05,8.1e-05,5.1e-05,5.2e-05,4.1e-05,5.4e-05,3.2e-05,1.5e-05,7.7e-05,3.8e-05,4.1e-05,5.1e-05,4.2e-05,4.9e-05,3.5e-05,3e-05,3.3e-05,3.9e-05,3.1e-05,3.6e-05,2.9e-05,4.6e-05,3.4e-05,5.2e-05,3.6e-05,2.6e-05,2e-05,3.6e-05,2.7e-05,2.9e-05,3.2e-05,6.3e-05,1.9e-05,2.8e-05,2.2e-05,7e-06,2e-05,5.6e-05,2.3e-05,2.1e-05,1.2e-05,8e-06,2.1e-05,1.2e-05,1.1e-05,2.3e-05,1.2e-05,3.2e-05,1.7e-05,2.4e-05,2.1e-05,5.1e-05,4.9e-05,1.2e-05,5e-05,2e-06,1.2e-05,2.4e-05,2.4e-05,3.4e-05,7.4e-05,4.9e-05,1e-05,1.3e-05,3.3e-05,2.6e-05,6.2e-05,1.1e-05,1e-05,3.8e-05,3e-05,2.2e-05,2.7e-05,1e-05,1.4e-05,2.4e-05,1.9e-05,3.6e-05,2.8e-05,3e-05,2.4e-05,6e-06,2.8e-05,1.5e-05,3.5e-05,3.5e-05,5e-06,1.3e-05,6.5e-05,7e-05,6.6e-05,3e-05,1.4e-05,1.3e-05,1.3e-05,1.6e-05,2.7e-05,2.1e-05,2.6e-05,4.3e-05,3.9e-05,3.9e-05,1.9e-05,2.5e-05
8e-06,6e-05,2.2e-05,3.2e-05,1.8e-05,8e-06,4.7e-05,5e-05,2.3e-05,2.5e-05,7.3e-05,5.3e-05,4e-06,2.5e-05,5e-06,5e-05,2.3e-05,4.1e-05,4.8e-05,2.2e-05,2.7e-05,2.3e-05,4e-05,9e-06,1.7e-05,2.6e-05,2.3e-05,2.3e-05,4e-05,5.3e-05,1.5e-05,5.5e-05,1e-05,1.2e-05,2.9e-05,5e-06,2.9e-05,2.7e-05,2.9e-05,2.8e-05,1.4e-05,2.6e-05,3.5e-05,2.3e-05,2.5e-05,5e-06,1.9e-05,1.7e-05,3.8e-05,3e-06,2.9e-05,1e-05,2.2e-05,3.5e-05,2.6e-05,3.9e-05,3.3e-05,2.9e-05,2.4e-05,1.1e-05,1e-05,1.5e-05,1.6e-05,2.5e-05,1.4e-05,5e-06,9e-06,1.7e-05,3.9e-05,1.5e-05,1.3e-05,3.5e-05,9e-06,8e-06,1.3e-05,3.3e-05,2.2e-05,1.3e-05,4.9e-05,2.5e-05,2.1e-05,2e-05,1e-05,2.3e-05,1.3e-05,2.4e-05,1.9e-05,1.3e-05,2.4e-05,1.9e-05,1.9e-05,2.8e-05,3.1e-05,1.9e-05,2e-05,1.3e-05,2.7e-05,1.6e-05,1.1e-05,1.2e-05,1.5e-05,3.8e-05,2.9e-05,2.2e-05,1.9e-05,5.9e-05,3.9e-05,2.4e-05,2e-05,2e-05,3.2e-05,3.6e-05,4.1e-05,1.4e-05,2.8e-05,2.8e-05,2.5e-05,1.2e-05,1.4e-05,1.6e-05,2.6e-05
1.3e-05,7e-05,3e-05,1e-05,7e-06,1.1e-05,1.8e-05,2.2e-05,4.6e-05,7e-06,3.3e-05,1.4e-05,2e-05,2.7e-05,1.3e-05,3.1e-05,2e-06,1.1e-05,4.6e-05,3.6e-05,3.2e-05,2.5e-05,1.4e-05,1.3e-05,2.9e-05,3.6e-05,1.4e-05,1.7e-05,3.6e-05,7e-06,1.6e-05,5.8e-05,3.2e-05,2.2e-05,2.1e-05,2.7e-05,5.2e-05,1.9e-05,1e-05,2.2e-05,1.5e-05,1e-05,2.3e-05,2.4e-05,4.1e-05,1e-05,2.4e-05,2.9e-05,2e-05,2.7e-05,3.4e-05,1.4e-05,2e-05,1.2e-05,1.4e-05,1.8e-05,2.2e-05,9e-06,2.4e-05,8e-06,8e-06,1.7e-05,2e-05,2.6e-05,1.1e-05,1.3e-05,3e-06,3e-05,2.1e-05,1.7e-05,7e-06,2.2e-05,1.2e-05,4e-06,1.4e-05,3.5e-05,2.6e-05,3e-05,3.5e-05,2.3e-05,1.4e-05,1.8e-05,1.5e-05,1.3e-05,5e-06,2.5e-05,2.5e-05,1.2e-05,1.2e-05,2.1e-05,4e-06,2.3e-05,1.7e-05,2.7e-05,2.8e-05,2.9e-05,2.3e-05,1.3e-05,1.3e-05,1.2e-05,2.7e-05,2.5e-05,3.1e-05,2.6e-05,1.7e-05,3.9e-05,1.7e-05,2.6e-05,1.3e-05,3e-05,1.8e-05,1.8e-05,1.5e-05,1.7e-05,1.4e-05,1.9e-05,2.4e-05,2.6e-05,2e-05,2e-05,5e-06
4e-06,3.5e-05,1.6e-05,9e-06,1.5e-05,1.8e-05,2.1e-05,2e-05,1.7e-05,1.2e-05,2e-05,5e-06,9e-06,1e-05,9e-06,9e-06,3e-06,1.1e-05,1.4e-05,6e-06,1.3e-05,7e-06,1e-05,9e-06,1.1e-05,2.1e-05,1.5e-05,2.7e-05,1.9e-05,2.7e-05,8e-06,3e-05,1.6e-05,5e-06,1.5e-05,4e-06,1.6e-05,5e-06,1.5e-05,5e-06,4e-06,1.3e-05,8e-06,9e-06,1.8e-05,1.8e-05,8e-06,1.3e-05,8e-06,4e-06,1.2e-05,2e-06,3e-06,8e-06,1.3e-05,7e-06,1.3e-05,1e-05,1.1e-05,1.1e-05,7e-06,5e-06,1e-05,1.1e-05,1e-05,9e-06,9e-06,1.4e-05,5e-06,8e-06,4e-06,1.7e-05,4e-06,6e-06,1e-05,1.7e-05,1.6e-05,2.3e-05,2.2e-05,1.3e-05,1.4e-05,1.3e-05,6e-06,1.6e-05,1.6e-05,1.4e-05,1.1e-05,8e-06,1.5e-05,1.3e-05,1.4e-05,6e-06,1e-05,9e-06,1.4e-05,2.2e-05,1e-05,5e-06,9e-06,4e-06,1.4e-05,7e-06,3e-06,1e-06,5e-06,1.9e-05,1.6e-05,9e-06,5e-06,1.3e-05,2.2e-05,1.5e-05,8e-06,4e-06,1.4e-05,5e-06,1e-05,2.1e-05,1.1e-05,1e-05,1.2e-05
1e-05,2.2e-05,3.7e-05,3e-05,3.2e-05,7e-06,2.8e-05,1.2e-05,3.5e-05,1.9e-05,1.7e-05,7e-06,1.8e-05,2e-06,2e-05,4e-06,5e-06,1e-05,1e-05,2.2e-05,6e-06,2.4e-05,2.3e-05,4e-06,1.6e-05,3.1e-05,1.8e-05,4e-05,1.9e-05,3.1e-05,2.2e-05,2.9e-05,1.2e-05,1e-05,6e-06,4e-06,3e-06,2e-05,5e-06,9e-06,1.3e-05,1e-05,2e-06,1.8e-05,1.1e-05,1.9e-05,1.5e-05,5e-06,6e-06,5e-06,1.1e-05,8e-06,7e-06,7e-06,1.5e-05,1e-05,1e-05,1.2e-05,8e-06,3e-06,1.6e-05,1e-05,3e-06,8e-06,8e-06,1.1e-05,9e-06,5e-06,1.3e-05,1.9e-05,1e-05,1.7e-05,1e-05,6e-06,1e-05,1.7e-05,5e-06,3.1e-05,7e-06,7e-06,1.5e-05,1.1e-05,7e-06,2.2e-05,2.8e-05,3e-06,1.8e-05,8e-06,1e-05,8e-06,1.4e-05,9e-06,8e-06,1.3e-05,1.3e-05,6e-06,1e-05,6e-06,1.9e-05,2.1e-05,1.5e-05,1.9e-05,7e-06,5e-06,8e-06,1.8e-05,1.9e-05,1.6e-05,5e-06,3e-06,1.8e-05,7e-06,6e-06,9e-06,2e-05,1.7e-05,1e-05,2.4e-05,1.8e-05,5e-06,2.6e-05
4e-06,3e-05,2.7e-05,1e-05,2.3e-05,2.7e-05,3.7e-05,1.6e-05,5e-05,2.2e-05,2.7e-05,2.7e-05,2.7e-05,2.5e-05,2.3e-05,1.4e-05,7e-06,7e-06,2.5e-05,4.7e-05,4.4e-05,6e-05,1.3e-05,2.2e-05,2e-05,1.7e-05,1.7e-05,1.9e-05,1.9e-05,2.3e-05,2.5e-05,3.6e-05,2.8e-05,1.6e-05,4e-06,7e-06,1.8e-05,1.9e-05,9e-06,1.5e-05,1.4e-05,3e-06,8e-06,2.4e-05,2.8e-05,8e-06,1.4e-05,2.3e-05,1.3e-05,1e-05,2.6e-05,2.3e-05,1.7e-05,1.3e-05,1.8e-05,1.2e-05,1.9e-05,1.1e-05,2.1e-05,1.5e-05,2.2e-05,1.7e-05,3e-06,9e-06,9e-06,1.3e-05,5e-06,1.2e-05,1.8e-05,1.6e-05,1.4e-05,2e-05,1.8e-05,1.1e-05,9e-06,5e-06,9e-06,3.1e-05,3e-05,2.3e-05,3e-05,3.2e-05,1.1e-05,1.8e-05,9e-06,2e-05,2.9e-05,1.9e-05,6e-06,1.7e-05,1.2e-05,2.1e-05,1.6e-05,7e-06,2.2e-05,2.8e-05,1.7e-05,5e-06,1.4e-05,8e-06,1.2e-05,1.9e-05,2.4e-05,1.7e-05,7e-06,2.1e-05,3.8e-05,6e-06,8e-06,1.5e-05,1.8e-05,2.9e-05,5e-06,1e-05,1.7e-05,1.8e-05,3e-06,1.6e-05,2.2e-05,2e-05,3.9e-05
3.9e-05,6.1e-05,3e-05,2.7e-05,8e-06,2.4e-05,4.7e-05,4.1e-05,5.4e-05,3.1e-05,1.9e-05,3.1e-05,1.7e-05,3.1e-05,3.2e-05,1.8e-05,1.2e-05,1e-06,1.6e-05,2.4e-05,3e-06,4e-05,4.2e-05,2e-05,2.5e-05,1.6e-05,4.4e-05,3e-05,3.1e-05,3e-06,4e-06,4e-06,3.6e-05,4.1e-05,2.4e-05,1.7e-05,4.4e-05,4.4e-05,2.5e-05,1.2e-05,2.9e-05,3.1e-05,4.2e-05,9e-06,1.9e-05,3.2e-05,1.6e-05,3.8e-05,1.9e-05,1.2e-05,3e-05,3.7e-05,2.1e-05,5e-06,1.6e-05,1.4e-05,3.2e-05,2.3e-05,2.1e-05,1.7e-05,1.3e-05,2e-05,2e-05,2.5e-05,1.3e-05,9e-06,1.7e-05,6e-06,9e-06,1.5e-05,9e-06,2.7e-05,1.3e-05,1.3e-05,2.4e-05,1.8e-05,9e-06,1.9e-05,2.2e-05,1.8e-05,2.8e-05,1.1e-05,1.8e-05,5e-06,1.9e-05,1e-05,3.1e-05,2e-05,2.8e-05,3.8e-05,3.9e-05,1.8e-05,1.8e-05,3e-06,1.5e-05,1.4e-05,1.9e-05,2.3e-05,1.1e-05,1.5e-05,2.1e-05,7e-06,1.2e-05,4e-06,1.8e-05,4e-06,1.3e-05,3.7e-05,2.7e-05,3.9e-05,3.3e-05,5.1e-05,4.2e-05,1.2e-05,1.8e-05,1.4e-05,2e-06,3.5e-05,4e-06,1.7e-05,1.9e-05
4.8e-05,2.2e-05,2.3e-05,4.9e-05,3.8e-05,3.1e-05,3.6e-05,1.3e-05,4e-05,3e-05,1.8e-05,1.4e-05,1.4e-05,2.9e-05,3.1e-05,3e-05,1.5e-05,8e-06,9e-06,2.4e-05,2e-05,2.8e-05,5.4e-05,4.6e-05,4.8e-05,1.9e-05,5.1e-05,4.4e-05,4.4e-05,4.2e-05,3.3e-05,3e-05,4.1e-05,2.2e-05,2.9e-05,2.8e-05,4e-05,2.5e-05,1.5e-05,2e-05,1.3e-05,2.2e-05,4.8e-05,3.1e-05,1.4e-05,1.9e-05,3.1e-05,1.8e-05,3.2e-05,1.6e-05,3e-05,2e-05,5e-06,1.4e-05,1.3e-05,1.6e-05,1.9e-05,3.5e-05,4.2e-05,3.8e-05,3.6e-05,2e-05,9e-06,2.3e-05,1.7e-05,1.3e-05,1e-05,1.9e-05,1.5e-05,8e-06,1e-06,1.9e-05,8e-06,9e-06,3.1e-05,1.8e-05,1.2e-05,1.1e-05,1.1e-05,2.7e-05,6e-06,1.2e-05,2.6e-05,1.5e-05,3.1e-05,2.8e-05,3.6e-05,2.3e-05,2.7e-05,2.6e-05,7e-06,1.2e-05,1.9e-05,2.6e-05,1.6e-05,7e-06,1.1e-05,6e-06,3e-06,1.6e-05,5e-06,1.1e-05,5e-06,1.4e-05,3.1e-05,2.3e-05,2.4e-05,3.3e-05,1.9e-05,2.3e-05,4.2e-05,1.4e-05,4e-05,2.9e-05,2.2e-05,1.9e-05,1.9e-05,4.7e-05,4.2e-05,1.2e-05,1.2e-05
3.2e-05,1.6e-05,9e-06,2.5e-05,3e-06,3.4e-05,1.6e-05,3.1e-05,1.3e-05,2e-05,1.1e-05,4e-06,9e-06,2.4e-05,3e-06,1.8e-05,1e-06,4e-06,1.5e-05,1.5e-05,8e-06,2.6e-05,2.8e-05,6e-06,2.5e-05,2.7e-05,8e-06,1.5e-05,1.8e-05,1.4e-05,3.1e-05,1.3e-05,9e-06,1.9e-05,1.2e-05,1.7e-05,2.1e-05,3e-06,5e-06,8e-06,1.4e-05,1.3e-05,3e-05,1.8e-05,9e-06,2.1e-05,2e-05,2.3e-05,1.4e-05,1.1e-05,2.2e-05,1e-05,4e-06,1.5e-05,1.5e-05,1e-05,3e-06,2.4e-05,1.2e-05,1.8e-05,2.5e-05,1.7e-05,1.7e-05,1.9e-05,2.2e-05,8e-06,8e-06,2e-05,2.4e-05,1.1e-05,1e-05,1.6e-05,1e-05,4e-06,1.9e-05,8e-06,1e-05,1.1e-05,2.1e-05,1e-05,1.8e-05,1e-05,8e-06,2.1e-05,3.2e-05,1.9e-05,2e-06,1.2e-05,5e-06,8e-06,3e-06,6e-06,1.6e-05,1.6e-05,1.3e-05,2.3e-05,1.4e-05,1.4e-05,1.2e-05,1.8e-05,1.4e-05,7e-06,1e-05,2e-05,1.8e-05,1.2e-05,7e-06,4e-06,7e-06,2.1e-05,1.2e-05,1.6e-05,3.6e-05,1.3e-05,9e-06,1.3e-05,5e-06,2.6e-05,1e-05,1.1e-05,6e-06
2e-05,6e-06,1.8e-05,8e-06,1.2e-05,1.6e-05,1.1e-05,2.6e-05,6e-06,8e-06,1.4e-05,1.2e-05,7e-06,7e-06,2e-06,3e-06,7e-06,1e-06,8e-06,6e-06,1e-06,1.7e-05,1.3e-05,1.5e-05,1.4e-05,1.8e-05,7e-06,1.6e-05,1.2e-05,1.2e-05,1.4e-05,1.5e-05,1.6e-05,1e-05,9e-06,8e-06,9e-06,1.4e-05,4e-06,1.1e-05,1.2e-05,1.8e-05,1.6e-05,3e-06,1.1e-05,2.4e-05,1.1e-05,1.1e-05,0,2e-06,1.1e-05,1.4e-05,1.6e-05,2e-06,8e-06,1e-06,4e-06,1.7e-05,5e-06,1.7e-05,3e-06,1.2e-05,5e-06,1e-05,1.3e-05,1e-05,6e-06,1.3e-05,6e-06,2e-06,1e-05,1e-05,0,2e-06,8e-06,8e-06,6e-06,1.1e-05,1.7e-05,9e-06,9e-06,1.2e-05,4e-06,2.2e-05,6e-06,9e-06,7e-06,1e-05,7e-06,1.4e-05,4e-06,3e-06,7e-06,1e-05,8e-06,1.8e-05,9e-06,4e-06,9e-06,1e-05,8e-06,1.5e-05,9e-06,8e-06,7e-06,6e-06,1e-06,5e-06,2e-06,6e-06,1e-05,8e-06,1.5e-05,1.2e-05,1.1e-05,1.1e-05,9e-06,9e-06,9e-06,1e-05,7e-06
1e-05,1.3e-05,1.7e-05,9e-06,1e-05,1.5e-05,8e-06,5e-06,4e-06,5e-06,1e-05,7e-06,7e-06,9e-06,1.1e-05,1e-05,3e-06,3e-06,7e-06,6e-06,4e-06,1.1e-05,9e-06,9e-06,8e-06,6e-06,1e-05,1.4e-05,9e-06,6e-06,3e-06,1e-05,3e-06,5e-06,9e-06,2e-06,8e-06,1.2e-05,8e-06,1.3e-05,1e-05,6e-06,4e-06,5e-06,4e-06,1.3e-05,4e-06,6e-06,3e-06,3e-06,9e-06,7e-06,4e-06,7e-06,5e-06,4e-06,6e-06,3e-06,6e-06,1.1e-05,9e-06,1e-06,3e-06,9e-06,7e-06,3e-06,8e-06,3e-06,4e-06,5e-06,5e-06,5e-06,4e-06,1e-06,2e-06,6e-06,3e-06,9e-06,1.9e-05,4e-06,7e-06,1e-06,2e-06,1.4e-05,9e-06,7e-06,9e-06,1.1e-05,5e-06,1.1e-05,6e-06,4e-06,2e-06,8e-06,8e-06,1.3e-05,7e-06,2e-06,8e-06,3e-06,3e-06,1e-05,4e-06,6e-06,2e-06,9e-06,6e-06,4e-06,3e-06,6e-06,3e-06,1.6e-05,6e-06,5e-06,2e-06,4e-06,6e-06,4e-06,4e-06,5e-06,2e-06
1.4e-05,1.3e-05,7e-06,2e-06,4e-06,1.1e-05,2e-06,1.2e-05,3e-06,6e-06,9e-06,6e-06,2e-06,7e-06,1e-05,4e-06,6e-06,6e-06,1e-05,6e-06,3e-06,1.3e-05,4e-06,9e-06,2e-06,3e-06,4e-06,8e-06,5e-06,8e-06,8e-06,8e-06,1.1e-05,4e-06,8e-06,1e-05,9e-06,4e-06,5e-06,9e-06,3e-06,8e-06,5e-06,1e-06,6e-06,9e-06,6e-06,6e-06,3e-06,2e-06,1e-05,8e-06,0,5e-06,5e-06,5e-06,8e-06,3e-06,3e-06,1.2e-05,7e-06,4e-06,6e-06,3e-06,6e-06,1e-06,6e-06,5e-06,9e-06,6e-06,8e-06,5e-06,1e-06,3e-06,5e-06,3e-06,1e-06,4e-06,1.2e-05,1e-05,1.4e-05,4e-06,2e-06,6e-06,3e-06,6e-06,7e-06,2e-06,3e-06,8e-06,5e-06,6e-06,4e-06,1e-05,5e-06,1.7e-05,8e-06,7e-06,2e-06,4e-06,7e-06,9e-06,2e-06,1e-05,6e-06,1.1e-05,3e-06,4e-06,5e-06,9e-06,4e-06,8e-06,4e-06,2e-06,4e-06,6e-06,4e-06,1e-06,3e-06,5e-06,4e-06
8e-06,3e-06,5e-06,7e-06,8e-06,1e-05,8e-06,7e-06,5e-06,5e-06,1.1e-05,7e-06,1e-06,1e-05,1.2e-05,5e-06,7e-06,4e-06,6e-06,3e-06,7e-06,1.7e-05,1.5e-05,1.5e-05,9e-06,7e-06,8e-06,1.1e-05,9e-06,1e-05,2e-06,7e-06,8e-06,5e-06,3e-06,9e-06,8e-06,4e-06,8e-06,3e-06,6e-06,1e-05,3e-06,6e-06,9e-06,9e-06,6e-06,7e-06,6e-06,3e-06,8e-06,6e-06,5e-06,6e-06,3e-06,5e-06,7e-06,1.1e-05,7e-06,8e-06,6e-06,8e-06,2e-06,4e-06,5e-06,4e-06,5e-06,1e-06,7e-06,3e-06,9e-06,1.2e-05,5e-06,4e-06,3e-06,5e-06,1e-06,7e-06,8e-06,9e-06,2e-06,9e-06,6e-06,4e-06,4e-06,5e-06,5e-06,8e-06,3e-06,9e-06,5e-06,6e-06,1e-06,7e-06,1.6e-05,1.2e-05,6e-06,9e-06,7e-06,6e-06,5e-06,5e-06,4e-06,8e-06,3e-06,6e-06,3e-06,5e-06,4e-06,4e-06,2e-06,6e-06,9e-06,6e-06,4e-06,4e-06,5e-06,3e-06,5e-06,7e-06,7e-06
1.3e-05,5e-06,5e-06,1.9e-05,2e-05,9e-06,5e-06,8e-06,6e-06,2e-06,1.3e-05,4e-06,1.2e-05,6e-06,3e-06,6e-06,7e-06,7e-06,1.3e-05,7e-06,6e-06,1.2e-05,7e-06,3e-06,9e-06,1.1e-05,7e-06,1.1e-05,5e-06,9e-06,7e-06,2e-06,4e-06,5e-06,1e-05,6e-06,7e-06,6e-06,7e-06,8e-06,6e-06,1e-05,6e-06,6e-06,5e-06,5e-06,8e-06,2e-06,4e-06,3e-06,6e-06,9e-06,8e-06,6e-06,8e-06,5e-06,3e-06,1.2e-05,1.5e-05,1.3e-05,1.1e-05,9e-06,5e-06,1e-06,2e-06,4e-06,1e-06,4e-06,6e-06,5e-06,9e-06,1.2e-05,1e-06,2e-06,4e-06,3e-06,3e-06,1.2e-05,1.4e-05,6e-06,7e-06,0,6e-06,3e-06,6e-06,6e-06,4e-06,6e-06,1e-06,6e-06,5e-06,6e-06,2e-06,2e-06,9e-06,1.3e-05,1.2e-05,1e-06,7e-06,5e-06,8e-06,1.2e-05,5e-06,5e-06,9e-06,1e-05,3e-06,6e-06,2e-06,2e-06,4e-06,3e-06,5e-06,7e-06,5e-06,3e-06,0,3e-06,1e-05,5e-06,7e-06
1.5e-05,2e-06,1.2e-05,9e-06,3e-06,2e-06,5e-06,1.2e-05,3e-06,2e-06,5e-06,4e-06,9e-06,9e-06,1.1e-05,9e-06,8e-06,9e-06,3e-06,1e-05,1e-05,1.7e-05,1.2e-05,4e-06,1e-05,1.4e-05,9e-06,9e-06,1e-06,1.4e-05,4e-06,1e-06,7e-06,6e-06,1.2e-05,9e-06,1.2e-05,5e-06,6e-06,1.3e-05,6e-06,1e-05,1.3e-05,5e-06,4e-06,1e-05,6e-06,7e-06,4e-06,5e-06,5e-06,2e-06,5e-06,4e-06,9e-06,2e-06,4e-06,9e-06,9e-06,7e-06,1.1e-05,4e-06,0,6e-06,5e-06,4e-06,4e-06,9e-06,7e-06,2e-06,1e-05,6e-06,6e-06,2e-06,3e-06,5e-06,7e-06,5e-06,1.1e-05,8e-06,7e-06,1e-06,3e-06,9e-06,6e-06,2e-06,3e-06,5e-06,2e-06,4e-06,2e-06,7e-06,2e-06,4e-06,6e-06,6e-06,1.1e-05,7e-06,1.1e-05,2e-06,7e-06,1.1e-05,4e-06,5e-06,1e-05,4e-06,7e-06,5e-06,4e-06,7e-06,3e-06,7e-06,6e-06,5e-06,1e-06,4e-06,5e-06,5e-06,5e-06,7e-06,7e-06
1.1e-05,1e-05,1.3e-05,6e-06,1e-06,2e-06,7e-06,1.9e-05,1.7e-05,6e-06,7e-06,9e-06,9e-06,9e-06,2e-06,1.3e-05,1.4e-05,8e-06,9e-06,2e-06,6e-06,8e-06,6e-06,2e-06,4e-06,1.1e-05,4e-06,2e-06,7e-06,6e-06,9e-06,1.2e-05,6e-06,4e-06,9e-06,3e-06,8e-06,4e-06,1e-06,9e-06,2e-06,7e-06,6e-06,5e-06,7e-06,1.1e-05,7e-06,8e-06,5e-06,1e-05,1.1e-05,9e-06,5e-06,5e-06,3e-06,2e-06,3e-06,6e-06,2e-06,8e-06,1.1e-05,1e-05,6e-06,3e-06,1.1e-05,4e-06,5e-06,1.5e-05,1.3e-05,7e-06,1.7e-05,1.2e-05,1.2e-05,1e-05,6e-06,3e-06,1e-05,6e-06,9e-06,6e-06,6e-06,7e-06,6e-06,6e-06,4e-06,5e-06,1e-05,9e-06,8e-06,6e-06,6e-06,6e-06,1.1e-05,7e-06,6e-06,1.4e-05,9e-06,3e-06,5e-06,6e-06,1.5e-05,6e-06,8e-06,9e-06,3e-06,7e-06,8e-06,4e-06,7e-06,3e-06,5e-06,1.1e-05,9e-06,3e-06,3e-06,3e-06,5e-06,7e-06,6e-06,4e-06,1e-05
1.1e-05,9e-06,9e-06,7e-06,3e-06,6e-06,6e-06,1e-05,2e-05,7e-06,1e-05,7e-06,8e-06,5e-06,2e-06,1.9e-05,1.1e-05,2e-06,1.4e-05,3e-06,5e-06,1.5e-05,1.7e-05,5e-06,6e-06,1.6e-05,2e-06,6e-06,1e-05,5e-06,7e-06,1.5e-05,8e-06,2e-06,6e-06,2e-06,2e-06,7e-06,8e-06,5e-06,1.8e-05,9e-06,9e-06,2e-06,8e-06,5e-06,1.2e-05,5e-06,9e-06,1.3e-05,3e-06,3e-06,5e-06,6e-06,9e-06,4e-06,8e-06,1e-06,9e-06,8e-06,5e-06,5e-06,5e-06,3e-06,1.3e-05,1.2e-05,2e-06,1.1e-05,7e-06,8e-06,6e-06,1.1e-05,4e-06,7e-06,7e-06,8e-06,9e-06,5e-06,1.7e-05,8e-06,1.1e-05,9e-06,1e-05,3e-06,8e-06,1.4e-05,1.9e-05,1.3e-05,1.2e-05,1e-05,1e-05,3e-06,1.5e-05,1.4e-05,1e-05,8e-06,9e-06,1.2e-05,3e-06,6e-06,1.6e-05,1.6e-05,1.3e-05,8e-06,2e-06,3e-06,3e-06,6e-06,1.4e-05,9e-06,1e-05,1.2e-05,1e-05,7e-06,5e-06,5e-06,3e-06,1.2e-05,7e-06,1.4e-05,1.2e-05
5e-06,5e-06,1.9e-05,1.1e-05,1.7e-05,1.5e-05,8e-06,1.7e-05,3.1e-05,2.2e-05,3e-06,7e-06,3e-06,7e-06,8e-06,1.6e-05,2e-05,9e-06,1.4e-05,2.1e-05,2.1e-05,2.7e-05,1.7e-05,2.1e-05,8e-06,1.3e-05,1.5e-05,7e-06,6e-06,5e-06,7e-06,1.3e-05,1.1e-05,1.3e-05,1.6e-05,5e-06,5e-06,8e-06,1e-05,5e-06,2.2e-05,2.8e-05,1.9e-05,1.4e-05,1.3e-05,1.6e-05,2.9e-05,2.5e-05,2.8e-05,2e-05,1.3e-05,7e-06,4e-06,9e-06,1.3e-05,1.1e-05,1.2e-05,6e-06,1.3e-05,5e-06,1e-06,5e-06,1e-05,1.2e-05,9e-06,3e-06,9e-06,7e-06,2.1e-05,2.7e-05,1.4e-05,1.1e-05,9e-06,1.6e-05,1.9e-05,2.2e-05,1.3e-05,5e-06,1.9e-05,9e-06,1e-05,1.1e-05,1.3e-05,1.4e-05,1.7e-05,7e-06,5e-06,2e-06,1.8e-05,1.5e-05,1.8e-05,7e-06,1.7e-05,1.8e-05,1.8e-05,2e-06,1.3e-05,3e-06,6e-06,1.5e-05,2.8e-05,9e-06,4e-06,5e-06,6e-06,1.3e-05,1e-05,6e-06,1.1e-05,1e-05,3e-06,8e-06,9e-06,8e-06,1.4e-05,1.9e-05,7e-06,1.4e-05,1.3e-05,1.1e-05,2.1e-05
6e-06,8e-06,1.4e-05,4e-06,1.3e-05,1.9e-05,1.5e-05,7e-06,3.1e-05,2.5e-05,1.4e-05,4e-06,9e-06,1.6e-05,1.4e-05,5e-06,1.2e-05,1.4e-05,9e-06,1e-05,2.7e-05,1.8e-05,1.8e-05,1.6e-05,1.5e-05,1.1e-05,1.6e-05,1e-05,4e-06,8e-06,8e-06,1.5e-05,2.4e-05,2.8e-05,2.3e-05,2.3e-05,1.4e-05,8e-06,1.6e-05,1.5e-05,2.7e-05,2.1e-05,1.2e-05,8e-06,5e-06,2.3e-05,2.6e-05,1e-06,1.6e-05,4e-06,8e-06,8e-06,1.2e-05,1.3e-05,1e-05,1e-05,1.1e-05,1.2e-05,5e-06,1.2e-05,8e-06,9e-06,3e-06,1.4e-05,1.3e-05,8e-06,1.4e-05,1.7e-05,1.7e-05,1.1e-05,1.7e-05,2e-05,7e-06,1.3e-05,1e-05,5e-06,1.1e-05,6e-06,1.1e-05,2e-06,7e-06,5e-06,5e-06,1e-05,8e-06,1.2e-05,7e-06,3e-06,1.3e-05,2.2e-05,9e-06,1.2e-05,1.3e-05,3e-06,1.1e-05,2.2e-05,4e-06,7e-06,6e-06,1.2e-05,2.6e-05,2.8e-05,1.3e-05,1.1e-05,3e-06,1.5e-05,1.2e-05,3e-06,8e-06,7e-06,3e-06,9e-06,1.7e-05,1.4e-05,2e-06,1e-05,8e-06,4e-06,1e-06,9e-06,2e-05
7e-06,2e-06,1e-05,4e-06,4e-06,8e-06,3e-06,1e-05,6e-06,4e-06,7e-06,2e-06,1e-05,4e-06,3e-06,3e-06,6e-06,6e-06,2e-06,7e-06,1.4e-05,4e-06,7e-06,7e-06,5e-06,4e-06,5e-06,0,6e-06,1e-06,2e-06,4e-06,1e-05,1.2e-05,4e-06,9e-06,1e-06,2e-06,8e-06,8e-06,5e-06,3e-06,6e-06,8e-06,2e-06,1.5e-05,8e-06,9e-06,3e-06,2e-06,5e-06,4e-06,4e-06,4e-06,2e-06,1e-06,4e-06,4e-06,5e-06,5e-06,3e-06,4e-06,2e-06,7e-06,5e-06,6e-06,4e-06,5e-06,9e-06,8e-06,6e-06,6e-06,3e-06,5e-06,3e-06,5e-06,5e-06,6e-06,9e-06,1e-06,5e-06,4e-06,3e-06,6e-06,3e-06,9e-06,6e-06,5e-06,5e-06,1.1e-05,2e-06,6e-06,7e-06,1e-06,7e-06,1.4e-05,3e-06,5e-06,3e-06,7e-06,9e-06,1e-05,2e-06,4e-06,5e-06,1.1e-05,3e-06,3e-06,3e-06,3e-06,1e-06,7e-06,1e-05,2e-06,3e-06,6e-06,3e-06,2e-06,3e-06,7e-06,1e-05
6e-06,1e-06,8e-06,4e-06,4e-06,3e-06,1e-06,9e-06,6e-06,3e-06,5e-06,3e-06,5e-06,3e-06,2e-06,3e-06,6e-06,4e-06,3e-06,3e-06,8e-06,2e-06,7e-06,5e-06,2e-06,5e-06,2e-06,2e-06,6e-06,2e-06,4e-06,1e-06,1e-05,8e-06,2e-06,7e-06,2e-06,2e-06,6e-06,4e-06,3e-06,2e-06,5e-06,5e-06,2e-06,1e-05,7e-06,6e-06,2e-06,2e-06,3e-06,2e-06,2e-06,1e-06,2e-06,1e-06,1e-06,1e-06,5e-06,4e-06,3e-06,4e-06,2e-06,0,2e-06,3e-06,3e-06,4e-06,9e-06,4e-06,2e-06,6e-06,2e-06,3e-06,1e-06,2e-06,5e-06,7e-06,9e-06,3e-06,5e-06,2e-06,2e-06,2e-06,0,6e-06,1e-06,3e-06,2e-06,1e-05,3e-06,6e-06,6e-06,1e-06,5e-06,1.4e-05,2e-06,3e-06,4e-06,5e-06,5e-06,8e-06,1e-06,2e-06,2e-06,7e-06,1e-06,1e-06,2e-06,4e-06,3e-06,4e-06,5e-06,4e-06,3e-06,3e-06,4e-06,2e-06,3e-06,5e-06,4e-06
7e-06,2e-06,6e-06,4e-06,4e-06,3e-06,3e-06,7e-06,4e-06,2e-06,6e-06,2e-06,4e-06,3e-06,1e-06,3e-06,6e-06,1e-06,2e-06,3e-06,7e-06,2e-06,7e-06,4e-06,1e-06,5e-06,3e-06,2e-06,4e-06,1e-06,3e-06,1e-06,6e-06,5e-06,3e-06,5e-06,2e-06,3e-06,5e-06,2e-06,1e-06,2e-06,5e-06,4e-06,1e-06,9e-06,6e-06,4e-06,4e-06,1e-06,3e-06,2e-06,2e-06,3e-06,2e-06,1e-06,0,1e-06,5e-06,5e-06,2e-06,5e-06,0,1e-06,1e-06,2e-06,1e-06,2e-06,8e-06,3e-06,3e-06,5e-06,3e-06,2e-06,2e-06,1e-06,4e-06,6e-06,7e-06,3e-06,4e-06,1e-06,2e-06,2e-06,2e-06,4e-06,1e-06,2e-06,2e-06,8e-06,3e-06,4e-06,6e-06,2e-06,4e-06,1.3e-05,4e-06,1e-06,5e-06,3e-06,4e-06,8e-06,1e-06,1e-06,1e-06,6e-06,1e-06,1e-06,1e-06,4e-06,1e-06,3e-06,5e-06,5e-06,4e-06,2e-06,3e-06,1e-06,2e-06,4e-06,2e-06
6e-06,2e-06,7e-06,3e-06,4e-06,2e-06,2e-06,1e-06,1e-06,2e-06,6e-06,1e-06,5e-06,3e-06,2e-06,3e-06,6e-06,1e-06,2e-06,1e-06,7e-06,0,5e-06,4e-06,1e-06,7e-06,3e-06,1e-06,4e-06,1e-06,3e-06,1e-06,5e-06,5e-06,3e-06,4e-06,1e-06,1e-06,5e-06,1e-06,1e-06,2e-06,4e-06,5e-06,2e-06,9e-06,5e-06,4e-06,3e-06,2e-06,3e-06,1e-06,1e-06,2e-06,2e-06,1e-06,0,1e-06,5e-06,4e-06,2e-06,4e-06,0,1e-06,1e-06,2e-06,1e-06,1e-06,8e-06,3e-06,2e-06,5e-06,2e-06,3e-06,1e-06,1e-06,3e-06,7e-06,7e-06,2e-06,4e-06,1e-06,1e-06,2e-06,1e-06,3e-06,1e-06,2e-06,2e-06,8e-06,2e-06,4e-06,5e-06,2e-06,3e-06,1.2e-05,4e-06,2e-06,5e-06,4e-06,4e-06,8e-06,1e-06,1e-06,1e-06,6e-06,0,2e-06,0,4e-06,2e-06,3e-06,5e-06,3e-06,2e-06,3e-06,4e-06,1e-06,1e-06,4e-06,2e-06
