2.4e-05,2.4e-05,1.6e-05,9e-06,3.5e-05,4e-06,3.6e-05,4e-05,1e-06,3.1e-05,1.3e-05,6.2e-05,2.8e-05,1.8e-05,3.9e-05,6e-06,3.3e-05,0,1.8e-05,1.9e-05,3e-05,5.4e-05,3.6e-05,4.5e-05,1.5e-05,3.7e-05,8.5e-05,2.4e-05,4.4e-05,4.1e-05,2.8e-05,1.8e-05,0.000146,0.000302,0.000109,0.000118,0.000818,0.00025,7.4e-05,0.000196,0.000986,0.000105,0.001036,0.00044,0.000445,0.00058,0.000616,0.000264,9.9e-05,0.000766,0.00054,0.000755,0.000357,0.000172,9.6e-05,0.00054,0.000482,8.6e-05,0.000232,0.000433,0.000253,5.4e-05,0.000277,9.5e-05,3.8e-05,0.000235,4e-06,0.000126,0.000114,8.6e-05,0.000242,0.000188,3.8e-05,6e-06,4.9e-05,0.00018,2.4e-05,2e-05,8.4e-05,6.5e-05,7e-06,0.000105,0.000125,2.8e-05,1.6e-05,2.4e-05,8.8e-05,6.6e-05,0.000137,0.00017,0.000315,0.000101,0.000119,0.000294,0.000233,0.000106,0.000124,7.8e-05,0.000142,5.5e-05,8.6e-05,5.6e-05,2.4e-05,1.7e-05,8e-06,6.1e-05,2e-05,2.4e-05,1.9e-05,4.2e-05,8e-06,2.8e-05,4.8e-05,9e-06,3.4e-05,2e-05,3.4e-05,5e-05,8e-06,1.1e-05,2.6e-05
1e-04,9.3e-05,9.6e-05,7.3e-05,4.5e-05,6.6e-05,0.000111,0.000154,0.000114,5.9e-05,8.8e-05,8.4e-05,0.000144,7.4e-05,5.5e-05,6.2e-05,9.1e-05,6e-05,3.2e-05,4.9e-05,8.6e-05,0.000213,0.000155,6.7e-05,0.00011,0.000125,0.000165,0.000318,0.000147,5.3e-05,8.2e-05,3e-05,0.000256,0.000616,0.000619,0.000699,0.00166,0.00123,0.001209,0.000669,0.000902,0.001884,0.000439,0.001477,0.000271,0.000781,0.001349,0.001241,0.001002,0.001309,0.00148,0.002298,0.001533,0.000659,0.000845,0.000464,0.001383,0.000132,0.00054,0.000457,0.000651,0.000452,0.000288,0.000441,0.000482,0.000787,0.000936,0.000891,0.000457,0.000128,0.00051,0.000618,0.000691,0.000691,0.000319,0.000109,0.000255,0.00035,0.000286,0.000423,0.000357,0.000282,0.000452,0.000363,0.000149,7.6e-05,0.000207,0.000328,0.000342,0.001349,0.001556,0.000934,0.001111,0.000797,0.000622,0.000561,0.000264,0.000281,0.000128,0.000294,0.000222,0.000278,0.00015,0.000101,6.4e-05,0.000126,0.000166,0.000221,0.00025,0.000121,1e-04,5.8e-05,0.000132,0.000139,0.000111,0.000128,0.000133,9.3e-05,8.2e-05,0.000101,8.6e-05
5.1e-05,2.1e-05,3.4e-05,1.7e-05,3.4e-05,4.6e-05,7.7e-05,2e-05,1.9e-05,2.2e-05,5.7e-05,8.4e-05,5.2e-05,3.4e-05,1.5e-05,2.3e-05,5.2e-05,5.2e-05,2.8e-05,7.2e-05,1.4e-05,0.000347,0.000224,0.00023,0.000147,1.4e-05,0.000113,0.000549,0.000278,2.4e-05,6e-05,8.4e-05,0.000215,0.000185,0.000149,0.000524,0.000929,0.001256,0.001827,0.001027,0.001324,0.000803,0.001373,0.002376,0.00068,0.00223,0.002149,0.001887,0.000798,0.001116,0.000494,0.000655,0.000573,9.3e-05,0.001097,0.00112,0.001201,0.000404,0.001286,0.000821,0.000422,0.000631,0.000437,0.000588,0.000931,0.001385,0.001088,0.000986,0.001103,0.000215,0.000387,0.000351,0.000382,0.000326,0.000222,6.5e-05,0.000283,0.000248,4.4e-05,0.000264,0.000146,0.000179,0.000224,0.000227,0.000189,0.000228,8.8e-05,0.000169,0.00057,0.00167,0.000619,0.000173,0.001031,0.000465,0.000262,0.000229,0.000145,0.000115,5.8e-05,0.000181,9e-05,0.000163,8.9e-05,1e-04,0.000109,7.6e-05,0.000109,0.000155,8.5e-05,9.8e-05,6.1e-05,4e-05,4.6e-05,8.2e-05,2.8e-05,5.9e-05,0.000118,0.000145,0.000115,5.7e-05,6.2e-05
2.2e-05,6.9e-05,4.6e-05,6.2e-05,7.3e-05,2.8e-05,6.8e-05,6.4e-05,4.2e-05,1.8e-05,3.9e-05,7.6e-05,7e-05,5.1e-05,4.9e-05,4e-05,3.4e-05,2.6e-05,1.2e-05,3.3e-05,5.7e-05,0.000658,0.000463,0.000162,6.6e-05,4.2e-05,0.000358,0.000858,0.00048,0.000104,4.2e-05,0.000101,0.000325,0.000352,0.000201,0.000574,0.000946,0.0019,0.000254,0.001385,0.002236,0.001218,0.000963,0.001526,0.002203,0.003013,0.00118,0.00199,0.001098,0.000798,0.001478,0.000289,0.000661,0.000418,0.001659,0.000851,0.000434,0.001401,0.001759,0.000917,0.000746,0.000957,0.001383,0.001266,0.000873,0.000687,0.000407,0.00097,0.00094,0.000936,0.001029,0.000257,0.000228,0.000577,0.000481,0.000511,0.000433,0.000382,0.00032,8.6e-05,5.6e-05,0.00016,6e-06,0.00015,1.6e-05,0.000176,9.6e-05,3.4e-05,0.000525,0.00147,0.000396,0.000123,0.000828,0.000361,0.000595,0.000324,0.000151,3.7e-05,1.5e-05,9.3e-05,0.000147,7e-06,4.7e-05,1.3e-05,6.8e-05,1e-06,9e-05,0.000105,6.8e-05,9.2e-05,8.8e-05,7.2e-05,6.7e-05,1.1e-05,3.8e-05,4.7e-05,9.2e-05,0.000159,1.5e-05,6.7e-05,4.3e-05
5e-05,4.6e-05,4.6e-05,4.7e-05,1.2e-05,4.3e-05,5.1e-05,6e-06,2.5e-05,1.1e-05,2.1e-05,1.3e-05,3.3e-05,5.2e-05,1.8e-05,3.4e-05,1.4e-05,2.7e-05,7e-06,6e-06,3.6e-05,0.000877,0.000747,0.000315,2.8e-05,5e-05,0.001104,0.000704,0.000242,0.000181,2.5e-05,0.000111,0.000235,1e-04,0.000341,0.000273,0.000959,0.00126,0.001025,0.001978,0.000532,0.001331,0.001257,0.000947,0.002153,0.000843,0.001275,0.000527,0.001214,0.000656,0.000864,1.9e-05,0.000608,0.000873,0.001114,0.00097,0.001232,0.001869,0.001176,0.001582,0.001021,0.000328,0.001228,0.000596,0.001089,0.001032,0.000634,0.001007,0.000157,0.000425,0.000437,0.001008,0.001269,0.001042,0.000263,0.000313,9.6e-05,4.8e-05,0.000106,4.9e-05,8.2e-05,1.3e-05,0.00011,6.1e-05,4.2e-05,0.000134,7.6e-05,1.6e-05,0.000394,0.001487,0.000605,0.000302,0.000569,0.001082,0.000654,0.000223,0.000145,6.6e-05,3.3e-05,1.7e-05,5.2e-05,3.6e-05,4e-05,1.5e-05,5.1e-05,2.3e-05,0.000152,0.000112,3e-05,5.6e-05,7.7e-05,4.8e-05,1.7e-05,2.6e-05,3.5e-05,1.6e-05,9.1e-05,9e-05,3.5e-05,3e-05,2.7e-05
2.9e-05,4.9e-05,1.1e-05,2.3e-05,5e-06,3.3e-05,6.8e-05,5e-05,2.1e-05,2.3e-05,1.8e-05,2e-05,2.2e-05,3.9e-05,5.3e-05,4.7e-05,1.9e-05,4.3e-05,9e-06,3e-05,2.9e-05,0.000972,0.000425,0.000198,0.000124,8.5e-05,0.002115,0.000708,0.000277,8.1e-05,9.7e-05,9.2e-05,0.000235,0.000636,0.000335,0.000236,0.000581,0.000711,0.001296,0.001329,0.001588,0.002581,0.001202,0.002039,0.001293,0.001876,0.00123,0.000702,0.001295,0.000709,0.000652,0.002232,0.00097,0.000631,0.00089,0.001561,0.002103,0.001723,0.002751,0.000399,0.002204,0.001892,0.001612,0.000798,0.000702,0.00134,0.000693,0.001162,0.001328,0.000762,0.001149,0.001566,0.000624,0.000208,0.00029,0.000169,4.1e-05,8e-05,0.000117,9e-05,9.8e-05,0.000115,9.3e-05,0.000165,5.4e-05,5.3e-05,7.7e-05,5.2e-05,0.00046,0.001215,0.000672,0.000321,0.000358,0.001128,0.000726,0.000235,0.00012,0.000147,0.000135,0.000124,0.000113,7.2e-05,6.8e-05,4.4e-05,9.1e-05,4.9e-05,0.000218,9.7e-05,9e-06,5.2e-05,3.2e-05,2e-05,4.2e-05,3.6e-05,5e-06,5e-05,0.000105,0.00015,2.8e-05,2e-05,2.4e-05
0.000101,9.4e-05,7.3e-05,5.4e-05,5.5e-05,2.7e-05,5.7e-05,2.8e-05,2.4e-05,3.6e-05,2.1e-05,3.2e-05,3e-05,3e-05,5.1e-05,3.6e-05,1e-05,5.5e-05,6.2e-05,4.8e-05,4.8e-05,0.000999,0.000254,7.3e-05,0.000136,7.2e-05,0.003243,0.001894,0.000793,0.000248,1.5e-05,9.6e-05,0.000236,0.000313,0.000557,0.000365,0.000459,0.001491,0.001789,0.001355,0.002823,0.00123,0.005082,0.002036,0.002518,0.000757,0.001493,0.002143,0.000356,0.000654,6e-04,0.00404,0.001542,0.001008,0.001226,0.003847,0.003091,0.002823,0.003643,0.00504,0.004183,0.001883,0.002231,0.001283,0.000239,0.000795,0.001076,0.001805,0.001388,0.000683,0.001179,0.000519,0.001613,0.00092,0.000406,0.00013,0.000146,0.000146,0.00033,4.2e-05,8.3e-05,0.000187,9e-06,7.3e-05,6.7e-05,6e-05,0.000121,0.000232,0.000669,0.00165,0.001129,0.000572,0.000236,0.000201,0.001566,0.000924,0.000443,7.8e-05,6.7e-05,9.8e-05,0.00011,7.2e-05,3.1e-05,7.6e-05,0.000174,0.000115,0.00037,0.000176,2.1e-05,6.1e-05,4.8e-05,2.9e-05,3.2e-05,4.1e-05,5.7e-05,8.9e-05,0.000157,5.1e-05,9.6e-05,5.9e-05,3.7e-05
5.4e-05,4.2e-05,3e-05,1.2e-05,5.7e-05,3.2e-05,6.3e-05,4.4e-05,3.1e-05,2.9e-05,4.4e-05,1.8e-05,2.7e-05,3.6e-05,2.2e-05,2.8e-05,4.6e-05,1.6e-05,4.3e-05,6.5e-05,6e-05,0.000967,0.000872,0.000408,0.000171,1e-04,0.004193,0.001898,0.000583,0.000141,0.000113,8.2e-05,0.000224,0.000959,0.000591,0.001508,0.00047,0.003894,0.001939,0.006712,0.002141,0.000507,0.006549,0.006544,0.00277,0.002131,0.002732,0.003955,0.002526,0.000179,0.0021,0.00327,0.002959,0.002767,0.00062,0.002904,0.003401,0.000817,0.001243,0.002735,0.001642,0.001063,0.001444,0.001797,0.001746,0.001808,0.000469,0.001362,0.000713,0.001016,0.001612,0.001211,0.00075,0.000632,0.000421,0.000388,0.000399,0.000205,0.000326,0.000218,0.000206,5.8e-05,0.000177,9.7e-05,5.1e-05,5.6e-05,4.8e-05,0.000257,0.000692,0.000909,0.001182,0.000508,0.00042,0.000947,0.001067,5e-04,0.000318,9.6e-05,7.1e-05,2.3e-05,5.7e-05,6.7e-05,8.1e-05,0.000108,0.000103,0.000284,0.000402,0.000196,0.000103,0.000201,4.1e-05,4e-05,2.6e-05,5.7e-05,3.1e-05,2.9e-05,0.000167,0.000379,7.4e-05,1.1e-05,9.2e-05
1.6e-05,2.8e-05,5.7e-05,3.7e-05,4.9e-05,5e-06,7.2e-05,2.9e-05,2.7e-05,6e-06,3.7e-05,1.7e-05,3e-05,3.7e-05,9e-06,4.1e-05,9e-06,1.5e-05,3.9e-05,3.7e-05,1.2e-05,0.000926,0.001462,0.000673,0.000211,4.6e-05,0.004491,0.003862,0.002487,0.000857,0.000213,0.000181,0.000226,0.001719,0.001037,0.001928,0.001513,0.00598,0.003722,0.010678,0.006216,0.002132,0.006794,0.011322,0.00813,0.005651,0.004137,0.00248,0.003611,0.00377,0.001694,0.004456,0.003376,0.001073,0.000246,0.001876,0.004455,0.005603,0.002643,0.001544,0.00227,0.001007,0.001586,0.002054,0.001178,0.000497,0.000242,0.0012,0.00107,0.001127,0.000967,0.000256,0.000638,0.000965,0.000807,0.000609,0.000166,0.000269,0.000117,0.000222,0.000305,9.1e-05,0.000222,0.000173,0.000135,4.5e-05,8.9e-05,0.000221,0.000183,0.001312,0.001756,0.000965,0.000747,0.001376,0.000174,0.00047,0.00023,8.4e-05,9.5e-05,6.1e-05,3.1e-05,2e-06,7.3e-05,5.8e-05,0.000111,0.00025,0.000868,0.001147,0.000701,0.000471,0.00029,0.000191,7.7e-05,8.6e-05,7.2e-05,5.6e-05,0.000221,0.001018,0.000457,0.000267,0.000153
1.6e-05,4.1e-05,3.6e-05,6.3e-05,8.4e-05,5.7e-05,8.5e-05,5.2e-05,4.1e-05,2.3e-05,3.4e-05,3.4e-05,3.2e-05,8e-06,1.1e-05,2.2e-05,1.8e-05,3.1e-05,3.9e-05,3.5e-05,1.8e-05,0.000889,0.000592,0.000509,0.000203,4.4e-05,0.003962,0.003536,0.001056,0.000109,0.000303,9.4e-05,0.000479,0.001401,0.002187,0.001917,0.000835,0.006399,0.002502,0.009154,0.004681,0.002513,0.004002,0.005542,0.001921,0.003629,0.00245,0.000753,0.002753,0.002138,0.003461,0.002937,0.001205,0.000888,0.000246,0.001652,0.001904,0.002512,0.001011,0.001419,0.003062,0.003229,0.00017,0.000997,0.00106,0.000337,0.000342,0.001563,0.001329,0.000978,0.000439,0.000254,0.00182,0.001017,0.000327,0.000262,0.000392,0.000124,0.000234,5.4e-05,9.9e-05,0.000281,0.000309,5.9e-05,8e-06,2.2e-05,9.4e-05,0.000107,0.000433,0.001735,0.001945,0.000829,0.000641,0.002085,0.002487,0.001889,8e-04,0.000177,5.7e-05,7.5e-05,6.4e-05,5e-05,6.2e-05,9.6e-05,0.000213,0.000322,0.000754,0.001517,0.000777,0.000436,0.00019,1.2e-05,6e-06,6.9e-05,6.2e-05,4.2e-05,0.000273,0.001454,0.001106,0.000474,0.000109
3.5e-05,4.4e-05,1.3e-05,6.8e-05,7.8e-05,4.2e-05,4.1e-05,1.6e-05,3.2e-05,3e-05,4.9e-05,3.7e-05,1.1e-05,1.7e-05,2.1e-05,1e-05,0,3.8e-05,4.6e-05,2.7e-05,2.8e-05,0.000865,0.000457,0.00039,0.000274,5.6e-05,0.002658,0.001367,0.000843,0.000234,9e-05,0.000222,0.000387,0.001035,0.000762,0.000446,7.2e-05,0.004864,0.006506,0.00451,0.002783,0.003566,0.000859,0.00458,0.001539,0.002762,0.001645,0.001384,0.002453,0.002253,0.001673,0.001304,0.000799,0.00048,0.000221,0.001784,0.000936,0.000733,0.000426,0.001021,0.00091,0.001126,0.001201,0.000614,0.000965,0.001052,0.000264,0.001682,0.000714,0.001224,0.000322,0.000474,0.001424,0.000675,0.00024,0.000154,0.000266,0.00045,0.000483,0.00031,0.000225,0.000438,0.000342,0.000397,0.000209,7e-05,8.2e-05,0.000153,0.000653,0.000873,0.000539,0.000502,0.000616,0.00277,0.002873,0.001094,0.000343,0.00015,3.8e-05,5e-05,4e-05,2.2e-05,1.2e-05,5.4e-05,0.000193,0.000264,0.00087,0.000793,0.000421,0.000174,2.4e-05,4e-05,3.5e-05,4.4e-05,4.7e-05,3.5e-05,0.000294,0.001179,0.000771,0.000318,0.000169
1.9e-05,8e-06,1.3e-05,3.3e-05,2.6e-05,1.9e-05,5e-06,7e-06,2e-05,2e-05,2.2e-05,1.2e-05,2.2e-05,1.5e-05,1.7e-05,2e-05,7e-06,2.5e-05,2.2e-05,2e-06,1.6e-05,0.000774,0.000326,0.000114,9.9e-05,7e-05,0.001285,0.000349,0.000226,0.000112,2e-05,0.000113,0.00045,0.000243,4e-04,0.000157,8.9e-05,0.004645,0.004378,0.001429,0.001422,0.000455,0.001645,0.000932,0.002101,0.001625,0.000605,0.001237,0.000648,0.000814,0.001065,0.000466,0.001538,0.000985,0.000719,0.001812,0.001934,0.001275,0.000375,0.000324,0.000899,0.002027,0.000699,0.000315,0.000461,0.001374,0.000733,0.001033,0.00032,0.001252,0.000136,0.000847,0.000544,0.000238,0.000297,0.000231,0.000119,0.000347,4.9e-05,7.7e-05,6.3e-05,0.000265,7.3e-05,0.000256,9e-05,2.9e-05,1.4e-05,0.000178,0.000449,0.000609,0.000136,4.4e-05,0.001049,0.001583,1e-05,0.000248,3.4e-05,2.9e-05,5.1e-05,3.6e-05,3.4e-05,5.8e-05,2.6e-05,3e-05,0.000184,7.9e-05,0.000657,0.000155,8.1e-05,4.7e-05,2.5e-05,2.5e-05,1.2e-05,3.7e-05,1.9e-05,2.4e-05,0.000375,0.000336,0.000124,5.8e-05,4.3e-05
8e-06,8e-06,4e-06,1.5e-05,2.5e-05,5e-06,1.1e-05,4e-06,8e-06,1e-05,1.6e-05,2e-06,1.4e-05,7e-06,1.1e-05,1.2e-05,1.5e-05,2.5e-05,1e-05,5e-06,1e-05,0.000693,0.000528,0.000176,4.9e-05,5.6e-05,0.000686,0.000514,0.000205,5.9e-05,7.6e-05,0.000112,0.000473,0.000644,0.000725,0.00016,9.3e-05,0.004084,0.001742,0.00183,0.002765,0.001304,0.001971,0.001688,0.001893,0.001187,0.001116,0.000977,0.000496,0.001147,0.001066,0.001045,0.001671,0.000889,0.000974,5.2e-05,0.000409,0.001187,0.000745,0.001197,0.000599,0.001516,0.001455,0.001958,0.000588,0.000635,0.000549,0.000263,0.000565,0.001271,0.000212,0.001023,0.000652,0.000116,0.000455,7.7e-05,0.000169,6.8e-05,0.000125,5.6e-05,0.000138,0.000107,7.9e-05,0.000126,8.8e-05,1.1e-05,6.2e-05,0.000207,0.000224,0.000379,0.000178,0.000131,0.001523,0.001478,0.000848,0.00036,0.000166,0.00011,2.1e-05,2.8e-05,3.4e-05,3.1e-05,2.7e-05,2.4e-05,0.000198,0.000114,0.000397,0.000122,8.4e-05,3.4e-05,2.5e-05,8e-06,1e-05,2.1e-05,2.1e-05,1.9e-05,0.000391,0.000358,0.000101,3.3e-05,4.9e-05
1.8e-05,1.2e-05,7e-06,1.2e-05,1.2e-05,1.4e-05,1.9e-05,2.2e-05,1.9e-05,2.4e-05,6e-06,3e-06,1.4e-05,8e-06,2e-06,2.3e-05,2.3e-05,1.3e-05,1.1e-05,7e-06,1.1e-05,0.000581,0.000544,0.000319,7.1e-05,0.000131,0.000435,0.000623,0.000251,0.000107,0.000103,4e-05,0.000389,0.000586,0.000232,9.6e-05,9.9e-05,0.003009,0.001811,0.004327,0.001223,0.00161,0.001981,0.003585,0.000544,0.001882,0.001601,0.001045,0.001318,0.003562,0.002394,0.000841,0.002587,0.001901,0.000977,0.000833,0.000928,0.001538,0.000974,0.001513,0.001841,0.00375,0.001991,0.001226,0.001334,0.000854,0.001381,0.000997,0.000371,0.00111,0.000305,0.000799,0.001111,0.000341,0.000391,0.000405,6.8e-05,0.000306,0.000209,2.6e-05,0.000166,8.8e-05,7e-05,0.000182,3.5e-05,5.9e-05,0.000129,0.000129,0.000104,0.000431,0.000126,5.3e-05,0.001867,0.000636,0.000376,0.000188,0.000109,3.8e-05,7e-06,1.4e-05,2.8e-05,1.9e-05,1.8e-05,4e-06,0.000158,4.8e-05,0.000104,0.000178,8.6e-05,3.1e-05,4.1e-05,1.9e-05,7e-06,2.3e-05,1.8e-05,3.4e-05,0.000413,0.000307,5.3e-05,1.5e-05,2e-06
1.4e-05,8e-06,1.5e-05,1.5e-05,2.3e-05,3.6e-05,4.2e-05,2.9e-05,2.2e-05,2.5e-05,2.9e-05,5e-06,2.2e-05,6e-06,1.7e-05,3.3e-05,5.5e-05,3.9e-05,4.4e-05,3.1e-05,1.8e-05,0.000481,0.000283,0.000215,0.000179,0.00012,0.000647,0.000527,9.4e-05,0.000169,5.3e-05,1.4e-05,0.000372,6e-05,0.00011,0.000241,0.000146,0.004436,0.004243,0.005089,0.001726,0.000627,0.003021,0.001177,0.002789,0.002404,0.001112,0.002861,0.004329,0.006881,0.004538,0.001596,0.002731,0.000205,0.001942,0.002036,0.003624,0.000884,0.001588,0.002055,0.002194,0.004267,0.002864,0.000157,0.001518,0.003775,0.001429,0.002267,0.001803,0.001296,0.000426,0.001597,0.002009,0.001111,0.000903,0.000675,0.000673,0.000657,0.000646,6.7e-05,0.000336,0.000386,0.000152,0.000207,0.000172,0.000125,0.000118,0.000131,0.00028,0.000209,0.00024,0.000122,0.002031,0.001341,0.000837,3e-04,0.000102,6.6e-05,3.6e-05,4e-05,1e-05,1.5e-05,4.1e-05,2.6e-05,0.000115,3.8e-05,0.000195,3.4e-05,3.8e-05,2.4e-05,3.4e-05,1.4e-05,2.6e-05,5e-06,7e-06,2.3e-05,0.000404,0.000124,8.9e-05,2.2e-05,2.3e-05
1.5e-05,1.3e-05,1.7e-05,4.8e-05,3.4e-05,5.5e-05,6.5e-05,3.2e-05,7e-06,1.2e-05,2e-05,1.8e-05,1.1e-05,2.5e-05,2.3e-05,2.4e-05,3.6e-05,3.5e-05,2.2e-05,3.9e-05,2.7e-05,0.000503,0.000446,0.000134,0.000117,0.000198,0.000506,0.000971,0.000663,0.000352,0.000126,4e-05,0.000253,0.000384,0.000215,0.000254,0.000238,0.005261,0.00975,0.003333,0.005384,0.007771,0.006143,0.007548,0.003975,0.005647,0.003884,0.006044,0.00952,0.007573,0.004778,0.002587,0.00281,0.006745,0.00489,0.003391,0.007131,0.006358,0.002428,0.001676,0.002129,0.006215,0.006681,0.003264,0.006509,0.008252,0.001747,0.003426,0.002834,0.002546,0.000223,0.003172,0.001458,0.00308,0.000685,0.001168,0.001471,0.000205,0.000931,0.000889,0.000911,0.000603,0.000518,0.000285,0.000138,0.000256,0.000145,0.000284,0.000428,0.00036,0.000208,2.5e-05,0.00206,0.002544,0.000698,0.000166,4.8e-05,9.4e-05,6.3e-05,8.9e-05,8.5e-05,1.3e-05,6.8e-05,4.7e-05,8.7e-05,5e-05,0.00033,0.000127,7.2e-05,5.6e-05,4e-05,3.5e-05,4.5e-05,2.1e-05,2.3e-05,2.5e-05,0.000425,0.00023,0.000178,0.000101,6.6e-05
5e-06,2.8e-05,1.7e-05,6.7e-05,3.4e-05,5.3e-05,2.3e-05,2.2e-05,2.8e-05,2.4e-05,1.4e-05,1e-05,9e-06,2.2e-05,1.6e-05,3.1e-05,2.3e-05,1.5e-05,4.5e-05,2e-05,1.4e-05,0.000634,0.000564,0.000382,0.000164,0.000195,0.000979,0.001303,0.000732,0.000112,0.000163,0.000195,0.000163,0.000815,0.000746,0.000128,0.000247,0.003928,0.005327,0.006484,0.008663,0.004972,0.006118,0.002346,0.005335,0.00831,0.012543,0.01238,0.00217,0.008442,0.006576,0.001429,0.002341,0.008532,0.012876,0.004163,0.006948,0.004428,0.002176,0.002832,0.005391,0.008218,0.003178,0.004087,0.007803,0.011483,0.010152,0.005851,0.007226,0.006962,0.006504,0.006226,0.007315,0.005631,0.004367,0.002795,0.001856,0.001574,0.000521,0.000819,0.000972,0.001429,0.000866,9.1e-05,0.000424,0.00045,0.000151,0.000349,0.000505,0.000186,6.8e-05,7.2e-05,0.00193,0.003369,0.002196,0.00082,0.000149,0.000112,6.3e-05,6.4e-05,4.4e-05,3.3e-05,8.3e-05,4.5e-05,4.8e-05,4.8e-05,0.000306,0.000138,7.2e-05,4e-05,1.6e-05,2.9e-05,4.1e-05,3.7e-05,1.1e-05,1.9e-05,0.000393,0.000101,9.6e-05,7.7e-05,2.2e-05
5.6e-05,5.5e-05,8e-06,7.7e-05,6.6e-05,4.6e-05,0.000103,4.8e-05,3.3e-05,7e-06,1.4e-05,1e-05,1.1e-05,3.2e-05,3.5e-05,4.3e-05,6.4e-05,4.6e-05,4.2e-05,5.8e-05,4.6e-05,0.000766,0.000718,0.000326,0.000185,7.3e-05,0.002249,0.001329,0.000453,6.1e-05,6.1e-05,0.000126,0.000338,0.001292,0.000649,0.000596,0.000517,0.001719,0.004471,0.004121,0.005118,0.010164,0.005009,0.001792,0.008583,0.008896,0.003602,0.002355,0.00608,0.002573,0.003692,0.008834,0.01103,0.010532,0.00258,0.006564,0.005064,0.009789,0.007179,0.002014,0.008373,0.004889,0.004281,0.009238,0.010585,0.001003,0.005527,0.005679,0.005086,0.002976,0.006142,0.003406,0.004355,0.001778,0.002838,0.001773,0.000813,0.000962,0.001725,0.001368,0.000251,0.001318,0.000522,0.000355,0.000939,0.000628,0.000362,0.00034,0.000239,0.000381,0.000257,8.1e-05,0.001397,0.00251,0.000805,0.000132,0.00023,0.000102,5.6e-05,0.000101,5.1e-05,1.4e-05,7.1e-05,2.7e-05,3.1e-05,2.8e-05,0.000145,9.3e-05,8.6e-05,1.7e-05,3.9e-05,3.9e-05,5.9e-05,3.4e-05,3.4e-05,4.1e-05,0.000376,0.000273,0.000101,6e-05,6.3e-05
5.5e-05,4.9e-05,4e-05,0.00011,1e-05,2.6e-05,0.000115,0.000116,9.9e-05,6.5e-05,4.7e-05,3.7e-05,3.4e-05,2e-05,2.7e-05,2.9e-05,2.3e-05,6e-06,6.4e-05,5.7e-05,2.5e-05,0.000757,0.000233,0.000105,0.000124,0.000121,0.003048,0.002121,0.000876,0.000153,6.1e-05,0.000246,0.000482,0.000867,0.000344,0.00084,0.000843,0.001911,0.00149,0.000566,0.003613,0.002826,0.00543,0.004991,0.004685,0.001612,0.003329,0.004553,0.003812,0.003541,0.00299,0.006971,0.005754,0.003092,0.002603,0.005796,0.004327,0.006279,0.005716,0.007278,0.001387,0.001865,0.006109,0.00501,0.000977,0.00197,0.002126,0.003863,0.002274,0.003234,0.002298,0.003283,0.001496,0.002547,0.000452,0.000477,0.000117,0.000773,0.001153,0.000496,0.000803,4e-04,0.000579,0.000634,0.000507,0.000189,0.000187,6.3e-05,0.000401,0.000123,0.000177,0.000108,0.000907,0.001475,0.00108,0.000428,0.000179,0.000108,5.7e-05,7.1e-05,2.5e-05,5.3e-05,6.8e-05,3e-05,1.6e-05,6.7e-05,0.00011,0.000127,7.6e-05,8.9e-05,4.7e-05,2.9e-05,3.7e-05,2.5e-05,3.7e-05,3.5e-05,0.000274,0.000182,8.2e-05,4.3e-05,5.1e-05
5.4e-05,3.4e-05,5e-06,8.2e-05,0.000102,9.8e-05,5.9e-05,5e-05,1.1e-05,2.4e-05,1.6e-05,2.9e-05,1.3e-05,2.4e-05,2.9e-05,1.6e-05,1.1e-05,3.1e-05,5.9e-05,2.5e-05,1.6e-05,0.000656,0.000652,0.000248,9.4e-05,0.000198,0.002948,0.001639,0.000779,0.000184,7.2e-05,0.000225,8.1e-05,3e-04,0.000251,0.000432,0.000154,0.002609,0.004555,0.003892,0.004272,0.002752,0.004394,0.00111,0.003093,0.001264,0.001334,0.002125,0.002634,0.004366,0.004525,0.002268,0.004553,0.003105,0.002411,0.000691,0.001471,0.000603,0.003542,0.001417,0.002253,0.001066,0.00297,0.00383,0.003287,0.002749,0.001419,0.002061,0.001303,0.000464,0.000542,0.002047,0.001579,0.000865,0.001047,0.000594,0.00044,0.000188,0.000207,0.000504,0.000176,0.000292,0.00024,0.000157,0.000362,0.000221,0.000111,0.000154,0.000313,0.000476,0.000291,0.00014,0.000435,0.001702,0.000757,0.000159,6.6e-05,6.5e-05,5.1e-05,5.3e-05,7.4e-05,5.3e-05,1.8e-05,3e-05,1.7e-05,6.5e-05,0.000151,0.000101,4.9e-05,5.3e-05,8e-06,2.4e-05,3e-05,2.3e-05,2.4e-05,5.6e-05,0.00024,0.000264,0.000155,7e-05,3.8e-05
3.3e-05,2.9e-05,2.9e-05,3.9e-05,5.8e-05,3e-05,6.7e-05,5.6e-05,2.8e-05,1.5e-05,2.7e-05,9e-06,3.6e-05,3.6e-05,4.3e-05,5.1e-05,3.9e-05,4.4e-05,3.4e-05,2e-05,1.3e-05,0.000524,0.000807,0.000508,0.00016,0.000122,0.001622,6e-04,0.00023,0.000101,0.00016,7e-05,6.2e-05,0.000326,0.000266,0.000151,0.000207,0.001902,0.001706,0.000945,0.002921,0.002434,0.00094,0.000841,0.001052,0.002011,0.000914,0.000622,0.003289,0.00045,0.002878,0.001732,0.002311,0.00126,0.001834,0.002318,0.001053,0.001912,0.001923,0.001702,0.001442,0.00125,0.002188,0.003657,0.000289,0.001913,0.001262,0.000603,0.000428,0.000776,0.001806,0.001695,0.00191,0.001786,0.001267,0.00075,0.000542,0.000341,0.000326,0.000107,0.000371,0.000358,0.000152,7.1e-05,0.000131,7.3e-05,3.8e-05,0.000161,0.000328,0.000205,0.000105,7.3e-05,0.000206,0.00213,0.001133,0.000297,9.3e-05,2.5e-05,3.6e-05,3e-05,4.5e-05,5e-05,1.7e-05,3.6e-05,1.3e-05,5.3e-05,0.000229,7.3e-05,3.6e-05,2e-05,6e-06,2.7e-05,2.4e-05,1.4e-05,1.1e-05,3.6e-05,0.000135,0.00017,0.000103,3.3e-05,3.8e-05
7.6e-05,1.8e-05,2.2e-05,4.9e-05,2.4e-05,5e-06,1.7e-05,4.5e-05,4e-06,2.2e-05,1.8e-05,1.6e-05,2.3e-05,7e-06,3.3e-05,3e-05,1.6e-05,1.1e-05,1e-05,2.1e-05,2e-05,0.000385,0.000327,0.000135,0.000143,0.000123,0.000333,0.000275,0.000334,0.000213,0.000103,2.9e-05,7.6e-05,0.000448,7.7e-05,0.000124,0.000157,0.000928,0.000571,0.000386,0.003071,0.001213,0.00171,0.000786,0.000448,0.000945,0.001526,0.001157,0.002506,0.001473,0.000434,0.001426,0.000821,0.001164,0.001257,0.002524,0.00231,0.000877,0.001354,0.002565,9.8e-05,0.000546,0.002399,0.000995,0.0015,0.001163,0.001211,0.000757,0.000691,0.001118,0.001379,0.000619,0.001115,0.000347,0.000393,0.000192,0.000347,0.000358,0.000352,0.000243,4e-05,0.000142,8.3e-05,0.000128,6.1e-05,9.6e-05,6.9e-05,0.000114,0.000147,0.000217,5.3e-05,1.1e-05,0.00036,0.001475,0.000721,0.000229,7.6e-05,5.3e-05,3.1e-05,3.2e-05,2e-05,3.4e-05,5e-05,6.6e-05,4.9e-05,8e-05,0.000154,7e-05,4.1e-05,9e-06,2.4e-05,1.3e-05,1.2e-05,2.4e-05,2e-05,8e-06,0.000108,7.5e-05,4e-05,3.9e-05,3.9e-05
1.5e-05,1.8e-05,9e-06,3.6e-05,2.2e-05,1.5e-05,1.7e-05,2e-05,2.6e-05,8e-06,5e-06,3e-06,5e-06,8e-06,1.8e-05,2e-06,3e-06,1.2e-05,1.1e-05,8e-06,6e-06,0.000145,2.6e-05,1.4e-05,4.1e-05,2.3e-05,0.000375,0.000412,0.000155,2.9e-05,5.3e-05,1.2e-05,2.7e-05,0.000101,9e-05,1e-05,9.4e-05,0.000418,1e-05,0.000449,0.000437,0.00053,0.000618,0.000434,0.000138,0.001018,0.000902,0.00041,0.000222,0.000554,0.000677,0.000423,2e-04,0.000532,0.000509,0.000683,0.000523,4.5e-05,0.000556,0.000427,0.000608,0.000239,0.000911,0.000822,0.000495,0.000388,0.000444,0.000151,2e-05,0.000374,0.000482,0.000207,0.000271,0.00029,0.00015,0.000129,6.6e-05,0.00016,8.8e-05,6.3e-05,8.2e-05,6.6e-05,6.7e-05,6e-06,4.5e-05,3e-06,5e-06,4e-05,9.2e-05,9.3e-05,3.7e-05,1.9e-05,0.000226,0.000371,0.000162,4.9e-05,3e-05,2.9e-05,1.5e-05,2.8e-05,2.3e-05,2.6e-05,1.9e-05,1e-05,1.1e-05,2.3e-05,3.1e-05,1.1e-05,1.2e-05,1e-05,5e-06,1e-06,6e-06,3e-06,4e-06,1e-06,3.6e-05,1.5e-05,1.2e-05,2.4e-05,1.6e-05
3.4e-05,2.9e-05,1.5e-05,4e-05,2.7e-05,2e-05,2.6e-05,1.1e-05,1.5e-05,2.1e-05,1e-05,3e-06,4e-06,1.1e-05,1.2e-05,9e-06,1.3e-05,1.5e-05,7e-06,1e-06,4e-06,0.000104,4.9e-05,2.3e-05,3.4e-05,1.2e-05,0.000498,0.000174,9.1e-05,5.2e-05,6.3e-05,4.5e-05,3.5e-05,7.1e-05,8.5e-05,4.8e-05,1e-05,0.000253,0.000121,0.000112,0.000751,0.00033,0.000844,0.000542,0.000317,0.001229,0.000383,0.000375,0.00052,0.000268,0.000551,0.000123,0.000443,0.000382,0.000517,3.6e-05,0.000862,0.00075,0.000671,0.000527,0.000564,0.000627,0.000178,0.000429,0.000323,0.000259,0.000186,0.000133,0.000109,0.000175,0.000274,0.000153,0.000264,0.000196,7e-05,0.00011,6.8e-05,0.000133,0.000135,3.2e-05,8.2e-05,4.7e-05,5.5e-05,2.4e-05,1.8e-05,9e-06,2.1e-05,1.5e-05,9.2e-05,6.6e-05,1.6e-05,2.9e-05,0.000266,0.000246,0.000128,1.7e-05,1.8e-05,2.3e-05,3.8e-05,1.2e-05,4e-06,1.4e-05,1.2e-05,1.2e-05,3.3e-05,1e-05,6e-05,1.1e-05,1.4e-05,1.6e-05,1e-06,7e-06,2e-06,7e-06,2e-06,2e-06,2.6e-05,3.9e-05,9e-06,7e-06,5e-06
2.8e-05,4e-06,1e-06,1.6e-05,4e-06,8e-06,9e-06,2.7e-05,1.9e-05,1.3e-05,9e-06,8e-06,5e-06,1.2e-05,5e-06,9e-06,7e-06,4e-06,9e-06,1e-06,9e-06,3.8e-05,2e-05,1.8e-05,2.4e-05,1.4e-05,4e-04,0.000103,5.8e-05,5.3e-05,1.6e-05,1.3e-05,1.3e-05,0.000122,9.3e-05,5.8e-05,4.8e-05,0.00018,0.00059,0.000829,0.000778,0.000211,0.000775,0.000489,0.000126,0.000707,0.000763,0.000201,0.000421,0.000386,0.00018,0.000538,0.000435,0.00046,0.000415,0.00011,0.000764,0.000127,0.000263,0.000351,0.000441,0.000303,0.000207,0.000401,0.000422,0.000223,7.4e-05,0.000159,0.000163,0.000291,0.000142,0.00019,6.9e-05,6.4e-05,2.7e-05,7.8e-05,4.1e-05,6.3e-05,8.4e-05,6e-06,6.6e-05,3.9e-05,4.3e-05,2.7e-05,2.4e-05,1e-05,1.4e-05,1.4e-05,5.4e-05,6.2e-05,1.2e-05,1.2e-05,0.00028,4.9e-05,7.4e-05,1.4e-05,1.5e-05,3.2e-05,2.2e-05,2.2e-05,1.3e-05,1.3e-05,4e-06,3e-06,3.3e-05,9e-06,6.3e-05,2.5e-05,1.4e-05,1.4e-05,7e-06,8e-06,6e-06,5e-06,3e-06,4e-06,2.9e-05,2.7e-05,2e-05,8e-06,2e-06
2.1e-05,1.1e-05,4e-06,4e-06,3e-06,1e-05,7e-06,2.5e-05,1.4e-05,5e-06,1.4e-05,1e-06,2e-06,7e-06,1e-05,4e-06,7e-06,3e-06,1.1e-05,1.7e-05,1.6e-05,2e-05,2.8e-05,4e-06,2.1e-05,1e-05,0.000259,0.000102,6e-06,3.6e-05,3.5e-05,3.4e-05,4.5e-05,5.1e-05,8.1e-05,5.1e-05,5.4e-05,0.000585,0.000419,0.00085,0.000539,0.000259,0.000683,0.001062,0.000843,0.000299,0.000338,0.000419,0.000451,0.000169,0.000277,0.000404,0.000613,0.000305,0.000325,1.9e-05,0.000644,9.9e-05,0.000299,0.000243,0.000241,0.000603,0.000442,0.000487,0.000529,0.000375,0.000317,4.1e-05,4.7e-05,0.000224,0.000198,0.000174,0.000131,6.9e-05,8.2e-05,3.8e-05,3.2e-05,7.1e-05,9.4e-05,2.1e-05,1e-05,1.2e-05,2.3e-05,4.5e-05,4.9e-05,1.8e-05,1.6e-05,1.8e-05,7e-06,3.3e-05,8e-06,1.7e-05,0.000294,0.000114,9.1e-05,4.8e-05,1.9e-05,7e-06,1.6e-05,1.3e-05,6e-06,1.7e-05,1.6e-05,8e-06,2.4e-05,1.7e-05,5e-05,9e-06,9e-06,1.1e-05,5e-06,3e-06,2e-06,4e-06,1e-06,4e-06,2.7e-05,1.9e-05,1.2e-05,5e-06,5e-06
6e-06,7e-06,9e-06,6e-06,7e-06,1.8e-05,3e-06,1.8e-05,1.5e-05,7e-06,1.6e-05,2.3e-05,1.2e-05,6e-06,4e-06,5e-06,5e-06,1e-05,1.4e-05,7e-06,4e-06,7.7e-05,3.3e-05,1.1e-05,1.9e-05,1.8e-05,0.000233,7.4e-05,7.4e-05,3.8e-05,1.5e-05,8e-06,5.5e-05,4.5e-05,0.000104,1.2e-05,4.8e-05,0.000639,0.000611,0.00025,0.000341,1.9e-05,0.000281,0.000298,0.000175,0.000635,7.5e-05,0.000304,0.000298,0.000277,0.000153,0.000545,0.000365,0.000299,0.000388,7.8e-05,0.000491,0.000529,0.000312,0.000239,0.000144,0.000233,0.000267,0.000673,0.000322,0.000284,0.000137,4.5e-05,7.8e-05,0.000277,0.000202,0.000176,0.000186,7.4e-05,2.3e-05,2.4e-05,8e-06,5e-05,8.1e-05,3.1e-05,3.4e-05,2.1e-05,5.3e-05,3.9e-05,1.1e-05,9e-06,1.3e-05,2.1e-05,1.6e-05,4.9e-05,5e-06,1.7e-05,0.000313,8.8e-05,0.000101,4.3e-05,3e-05,2.6e-05,2.8e-05,1.5e-05,6e-06,5e-06,5e-06,5e-06,1.4e-05,4e-06,3.4e-05,5e-06,7e-06,7e-06,8e-06,9e-06,4e-06,4e-06,2e-06,5e-06,3.3e-05,2.7e-05,9e-06,7e-06,3e-06
8e-06,1.4e-05,1.7e-05,1.3e-05,4e-06,1.3e-05,1.4e-05,8e-06,1e-05,4e-06,1.5e-05,1.2e-05,9e-06,6e-06,7e-06,4e-06,1e-05,4e-06,6e-06,1.4e-05,2e-06,9.5e-05,2.4e-05,7e-06,1.5e-05,1.3e-05,0.000268,7.9e-05,1.3e-05,2.3e-05,2e-06,1e-05,6.3e-05,4.6e-05,0.000122,4.6e-05,4.7e-05,0.000444,0.000302,0.000253,0.000413,0.000228,0.000171,0.000387,0.000338,0.000441,0.000169,0.000273,0.000284,0.000333,0.000669,0.000809,0.000667,0.000406,0.00033,0.000123,0.000146,0.000511,0.000304,0.000232,0.000161,0.000268,0.000427,0.000378,0.000393,0.000223,0.000203,0.000156,0.000123,0.00023,0.000155,0.000195,0.000208,7.5e-05,9e-06,8.5e-05,3.8e-05,5.3e-05,6e-05,1.1e-05,6.2e-05,3.8e-05,2.2e-05,1.2e-05,3.6e-05,2.9e-05,1.4e-05,2.2e-05,2.1e-05,3.2e-05,1.3e-05,1.7e-05,0.000313,0.000193,3.1e-05,1.8e-05,1.6e-05,7e-06,1.6e-05,1.1e-05,7e-06,1e-05,4e-06,7e-06,1.4e-05,1e-05,4e-05,5e-06,1e-06,5e-06,9e-06,6e-06,3e-06,6e-06,4e-06,5e-06,4.1e-05,1.5e-05,5e-06,1.1e-05,3e-06
8e-06,1.1e-05,8e-06,7e-06,9e-06,1.1e-05,9e-06,5e-06,5e-06,5e-06,1.1e-05,1.8e-05,3e-06,3e-06,1.4e-05,8e-06,4e-06,7e-06,7e-06,8e-06,5e-06,8.8e-05,4.7e-05,1e-05,2.4e-05,1.1e-05,0.000182,0.000165,9e-05,5.4e-05,1.4e-05,3e-06,5.8e-05,8.4e-05,0.000142,7.1e-05,7.2e-05,0.000195,0.000387,0.000285,0.000432,0.000157,6e-05,0.000135,0.000333,0.000348,0.000284,0.000407,0.000669,7.7e-05,0.000736,0.000364,0.000255,0.000302,0.000318,0.000196,0.000152,0.000209,0.000202,0.000193,6e-05,0.00016,0.00043,0.000484,0.000146,0.000231,0.000143,0.00013,6e-05,0.000145,0.000206,0.000182,0.000145,2.4e-05,6.3e-05,6.9e-05,2.2e-05,4.9e-05,6.3e-05,1.5e-05,8e-05,8e-06,3.3e-05,2.8e-05,3.2e-05,1.8e-05,9e-06,1.4e-05,4e-05,5.3e-05,3.2e-05,3.4e-05,0.000309,0.000139,6.1e-05,1.3e-05,1.5e-05,1.6e-05,2e-06,1.8e-05,5e-06,6e-06,1.1e-05,1.1e-05,6e-06,5e-06,4.3e-05,9e-06,1.3e-05,8e-06,4e-06,4e-06,4e-06,3e-06,3e-06,7e-06,3.2e-05,2.8e-05,1.5e-05,1e-05,8e-06
3.4e-05,3.3e-05,1.5e-05,1e-05,1.1e-05,5e-06,8e-06,1e-05,9e-06,9e-06,1.4e-05,3e-06,5e-06,7e-06,1.5e-05,1e-06,4e-06,1.2e-05,1.5e-05,8e-06,1e-06,5.9e-05,9.6e-05,5.8e-05,2.4e-05,1.3e-05,8.2e-05,0.000211,9.8e-05,2.7e-05,2.3e-05,2.1e-05,5.7e-05,2.5e-05,0.000164,0.000137,9.1e-05,0.000172,0.000246,0.000214,0.000404,0.000304,0.000425,0.000257,0.000344,0.00046,0.000321,0.000403,0.000382,0.000224,0.000437,0.000483,0.000479,0.000305,0.000171,0.000111,0.00012,0.000439,0.000437,7.3e-05,3e-05,0.000259,0.000369,0.000347,0.000341,0.000228,0.000125,0.000112,9.7e-05,0.000242,0.000257,9.3e-05,0.000284,0.00013,6.4e-05,7.5e-05,5e-05,7.2e-05,6.1e-05,4.2e-05,0.000127,7.2e-05,4.4e-05,1.5e-05,3.9e-05,3.4e-05,3e-05,3.3e-05,3.2e-05,1.7e-05,9e-06,1.8e-05,0.000257,1.5e-05,7.6e-05,1.7e-05,6e-06,8e-06,9e-06,1.7e-05,1.1e-05,4e-06,1e-05,2e-06,7e-06,3e-06,3.5e-05,5e-06,7e-06,5e-06,5e-06,5e-06,3e-06,1e-06,2e-06,2e-06,3e-05,4e-06,1.4e-05,4e-06,7e-06
2.4e-05,1.7e-05,1.6e-05,7e-06,7e-06,2e-06,1e-06,1.2e-05,6e-06,1e-06,1.2e-05,1.3e-05,7e-06,5e-06,7e-06,8e-06,8e-06,6e-06,5e-06,9e-06,3e-06,4.8e-05,2.7e-05,1.1e-05,2e-05,8e-06,0.000206,0.000109,6.1e-05,3.9e-05,2.2e-05,4e-06,4.2e-05,2.1e-05,0.000104,9.7e-05,3.5e-05,0.000203,0.000189,0.000296,0.000469,0.000148,0.000305,0.000319,0.000294,0.000316,0.000127,3.4e-05,0.000146,0.000141,0.000108,0.000299,0.000222,0.00029,0.000142,0.000155,8.9e-05,0.000376,0.000267,0.000569,0.000232,0.000422,0.000201,0.000331,0.000172,0.000245,0.000141,0.000259,0.000235,0.000218,0.000217,4e-05,0.000139,0.000217,0.000137,9.2e-05,6.9e-05,0.000104,5e-05,3.5e-05,6.3e-05,3.9e-05,4e-05,2.9e-05,4.4e-05,8.1e-05,5e-05,2e-05,2.6e-05,4e-05,2.1e-05,2.2e-05,0.000205,5e-05,9.7e-05,5.3e-05,1.4e-05,1.4e-05,1.4e-05,1.6e-05,1.1e-05,5e-06,1.1e-05,1.1e-05,5e-06,6e-06,2.7e-05,4e-06,5e-06,3e-06,8e-06,5e-06,1e-06,2e-06,1e-06,2e-06,3e-05,2.1e-05,1.3e-05,1.5e-05,1e-06
8e-06,1.8e-05,2e-06,8e-06,1e-06,4e-06,9e-06,9e-06,7e-06,6e-06,7e-06,4e-06,5e-06,2e-06,1e-05,5e-06,3e-06,1e-06,2e-06,7e-06,6e-06,7.3e-05,3.1e-05,1.2e-05,2.6e-05,8e-06,0.000204,6.5e-05,3.8e-05,2.2e-05,2e-06,7e-06,5.6e-05,2.6e-05,7.3e-05,5.2e-05,4.1e-05,0.000151,0.00037,0.000306,8.4e-05,0.000229,7.3e-05,0.000188,0.00012,0.000167,0.000239,0.000331,0.000505,4.5e-05,0.000327,0.000288,0.000203,0.000255,0.000127,0.00024,4.6e-05,0.000204,0.00015,0.000244,0.000266,0.000358,0.000245,0.000202,0.000322,0.000219,0.000175,0.000227,4.6e-05,0.000191,0.000121,0.000149,0.000151,5.4e-05,3.6e-05,7.4e-05,4.9e-05,4.7e-05,2.1e-05,4.5e-05,3.3e-05,9e-06,2.7e-05,1.8e-05,3.5e-05,5e-05,2.6e-05,8e-06,2.6e-05,5.2e-05,3e-05,2e-05,0.000168,6.9e-05,3.5e-05,1.8e-05,1.5e-05,1.5e-05,4e-06,1e-05,6e-06,5e-06,1e-05,2e-06,1.3e-05,7e-06,3.7e-05,9e-06,1.3e-05,2e-06,5e-06,5e-06,3e-06,5e-06,3e-06,4e-06,2.5e-05,1.7e-05,4e-06,4e-06,4e-06
1.3e-05,1.9e-05,2e-05,1.1e-05,2e-05,1.5e-05,7e-06,1.3e-05,9e-06,6e-06,1.3e-05,4e-06,9e-06,6e-06,1.1e-05,8e-06,4e-06,5e-06,7e-06,9e-06,8e-06,0.000109,4.9e-05,3.6e-05,2.3e-05,2.1e-05,7.1e-05,9e-05,4e-05,1.7e-05,6e-06,1.4e-05,5.4e-05,3.2e-05,0.000119,8.5e-05,9.5e-05,2.2e-05,0.000118,0.000286,0.000421,0.000242,0.00028,0.000203,0.000237,0.000284,0.000236,0.000405,0.000239,9.9e-05,0.000172,0.000171,0.00023,0.000254,0.000116,0.000215,0.000159,0.000366,0.000172,0.000166,0.000287,0.000233,0.00025,0.000246,0.000283,0.000165,0.000148,1.5e-05,1e-04,7e-05,0.000257,0.000215,0.00017,0.000117,9.2e-05,6.9e-05,4.3e-05,2.3e-05,6.1e-05,1.9e-05,5.6e-05,3.6e-05,2.3e-05,9e-06,2e-05,1e-05,6e-06,2.2e-05,2.4e-05,2.5e-05,8e-06,1.5e-05,0.000158,5.8e-05,2e-05,1.1e-05,1.1e-05,5e-06,4e-06,1.3e-05,2e-05,1.4e-05,3e-06,1e-05,2.1e-05,1.4e-05,5.2e-05,2e-05,2.1e-05,1.2e-05,3e-06,3e-06,2e-06,8e-06,6e-06,4e-06,2.2e-05,3e-05,1.5e-05,1.1e-05,9e-06
1.4e-05,2.1e-05,2.1e-05,1.9e-05,2.2e-05,2.7e-05,2.4e-05,1.9e-05,1.4e-05,1.1e-05,1e-05,1e-05,7e-06,2.1e-05,2.1e-05,1.9e-05,6e-06,1e-06,1e-05,1e-05,9e-06,0.000121,8.8e-05,2.6e-05,6e-06,2e-05,0.000235,0.000185,4.7e-05,1.6e-05,8e-06,3.6e-05,4.5e-05,8e-05,8e-05,5e-05,6.8e-05,6.2e-05,0.000304,0.000331,2e-04,0.00016,0.000318,0.000147,5.7e-05,0.000382,0.000224,0.000208,0.000257,4.4e-05,0.000395,0.000284,0.000117,0.000221,0.000146,0.00014,9.7e-05,0.000239,2.7e-05,0.000262,0.000184,0.000171,0.000194,0.00026,0.00017,0.000118,0.000164,0.000107,0.000103,1e-04,0.000158,6.4e-05,0.000179,2.6e-05,7.7e-05,6.6e-05,2.9e-05,4e-05,4.4e-05,3.5e-05,4.8e-05,3e-05,2.1e-05,2.6e-05,9e-06,1.3e-05,8e-06,2e-05,3.7e-05,1.9e-05,3e-05,2e-05,0.000134,4.2e-05,1.1e-05,1.7e-05,2.3e-05,2.2e-05,1.8e-05,1.7e-05,2.3e-05,1.1e-05,7e-06,8e-06,1.1e-05,1.1e-05,6.1e-05,4e-06,8e-06,6e-06,2e-06,2e-06,3e-06,2e-06,4e-06,3e-06,1.9e-05,2.3e-05,1.2e-05,1.1e-05,6e-06
2.2e-05,8e-06,1.3e-05,7e-06,1.5e-05,1.4e-05,9e-06,9e-06,1.7e-05,1.1e-05,8e-06,7e-06,1.4e-05,1.5e-05,6e-06,2e-06,9e-06,6e-06,3e-06,2e-06,4e-06,0.000127,9.1e-05,5e-05,2.6e-05,3.1e-05,0.000467,0.000178,8.8e-05,2.8e-05,1.4e-05,4.3e-05,3e-05,0.000132,0.000149,5.5e-05,6.3e-05,0.00019,0.000106,0.000304,7.4e-05,0.000185,0.00019,0.000163,0.000195,0.000218,0.000282,0.00024,0.000404,8.5e-05,0.000631,0.000215,0.00022,0.000209,0.000137,0.000293,0.000206,0.000189,0.00015,6.1e-05,0.000349,0.00021,0.00028,0.000197,0.000246,0.000171,4.9e-05,4.7e-05,5e-05,0.000132,8e-05,0.000143,0.000236,0.000112,6.4e-05,3.6e-05,5.5e-05,7.5e-05,2e-05,3.3e-05,3e-05,3.3e-05,4.4e-05,5.4e-05,3.7e-05,3.6e-05,3.4e-05,2.2e-05,2.8e-05,3.5e-05,1.1e-05,1.7e-05,0.000117,3.4e-05,1.8e-05,2.8e-05,6e-06,2.3e-05,1e-05,9e-06,1.5e-05,1.1e-05,9e-06,1.3e-05,2.6e-05,2.3e-05,4.8e-05,2.5e-05,1.7e-05,6e-06,1e-06,2e-06,4e-06,3e-06,4e-06,2e-06,1.3e-05,1.3e-05,1.6e-05,3e-06,1.1e-05
1.4e-05,8e-06,1.1e-05,4e-06,1.3e-05,1.2e-05,1.6e-05,7e-06,1.7e-05,1.5e-05,8e-06,5e-06,1e-05,9e-06,7e-06,2e-06,6e-06,3e-06,5e-06,6e-06,2e-06,0.000118,9.1e-05,3.7e-05,2.1e-05,1.6e-05,0.000651,0.000177,4.9e-05,4e-05,3.7e-05,1.5e-05,3.1e-05,0.000144,8.4e-05,4.4e-05,2.3e-05,0.000279,0.000454,3.7e-05,0.000265,0.000135,0.00031,8.3e-05,0.000357,0.000261,0.000203,0.000402,0.000109,0.000136,0.000431,0.000247,0.000158,0.000184,6.8e-05,0.000374,0.000252,0.000112,7.1e-05,0.000244,0.000352,0.000283,0.000137,0.000282,0.00029,0.000159,9.5e-05,2.2e-05,9.9e-05,0.000136,7.7e-05,7.6e-05,0.000123,8.2e-05,6.9e-05,5e-05,6.2e-05,1.8e-05,6.9e-05,2.6e-05,3.2e-05,4.3e-05,3.1e-05,2.8e-05,1.8e-05,1.4e-05,5e-06,6e-06,5.1e-05,3.1e-05,3e-06,5e-06,0.000126,2.6e-05,3.3e-05,3.7e-05,2.4e-05,1.1e-05,9e-06,1.1e-05,4e-06,1.7e-05,2e-05,1.1e-05,2e-05,1.2e-05,4e-05,2.8e-05,6e-06,7e-06,4e-06,4e-06,1e-06,3e-06,1e-06,2e-06,6e-06,2.3e-05,8e-06,1e-06,8e-06
7e-06,1e-05,4e-06,6e-06,6e-06,8e-06,9e-06,4e-06,1.2e-05,3e-06,9e-06,8e-06,1e-06,4e-06,1e-05,5e-06,0,3e-06,8e-06,6e-06,7e-06,9.7e-05,2.5e-05,1.2e-05,8e-06,8e-06,0.000676,0.00034,0.000163,2.8e-05,1.5e-05,2.2e-05,2e-05,6e-05,3e-05,0.000114,8.5e-05,0.000294,0.000306,0.00017,7.7e-05,0.00018,0.000278,0.000178,0.00023,9.6e-05,0.000362,0.000219,0.000183,0.000164,0.000186,0.00014,0.000132,0.000197,9.4e-05,0.00019,0.000243,0.000226,8.6e-05,0.000212,0.000179,0.000199,0.000197,0.00031,7.9e-05,0.000303,4.4e-05,0.000107,5.7e-05,4.3e-05,0.000143,6.8e-05,8.7e-05,1.9e-05,9e-06,0.000142,9.6e-05,5.8e-05,6.8e-05,3.5e-05,3.1e-05,3.8e-05,2.4e-05,8e-06,9e-06,1.7e-05,1.5e-05,1.4e-05,3.5e-05,3.8e-05,3.1e-05,5e-06,0.000128,7e-06,2.2e-05,3.2e-05,2.4e-05,1.5e-05,1.5e-05,3e-06,9e-06,1e-05,5e-06,7e-06,2.4e-05,9e-06,2.2e-05,1.1e-05,1.3e-05,7e-06,2e-06,2e-06,2e-06,3e-06,1e-06,0,5e-06,8e-06,1e-05,8e-06,2e-06
1.8e-05,7e-06,7e-06,1e-06,7e-06,3e-06,1e-05,1.4e-05,1.1e-05,1e-05,7e-06,3e-06,2e-06,7e-06,7e-06,5e-06,8e-06,5e-06,4e-06,7e-06,6e-06,6.8e-05,7.8e-05,2.5e-05,2e-05,9e-06,0.000544,0.000559,0.000291,7.2e-05,1.7e-05,2.4e-05,7e-06,3.4e-05,0.000124,0.000199,0.000122,0.00021,0.000169,0.000174,0.000148,0.000116,0.000129,0.000333,0.000122,0.000181,0.000146,0.000126,0.000338,0.000263,0.000332,0.000211,0.00017,0.000211,0.000108,2e-05,0.000215,0.000181,3.3e-05,9.1e-05,0.000278,0.000249,0.000204,0.00015,0.000153,0.000163,0.000178,0.00018,0.000139,9.7e-05,0.000231,0.00014,0.000141,9.6e-05,6.3e-05,0.000107,0.000118,6.1e-05,8.3e-05,7.6e-05,2.4e-05,5.1e-05,5e-05,1.6e-05,2.9e-05,3.6e-05,2.3e-05,1e-06,3.5e-05,8.7e-05,4.7e-05,3.1e-05,0.00016,9.5e-05,2.9e-05,1.1e-05,1.5e-05,1.9e-05,1.6e-05,1.5e-05,8e-06,1.5e-05,7e-06,7e-06,1.1e-05,6e-06,1.8e-05,5e-06,9e-06,1.2e-05,4e-06,1e-06,1e-06,1e-06,3e-06,1e-06,5e-06,2e-05,5e-06,7e-06,6e-06
5e-06,7e-06,2e-06,3e-06,9e-06,9e-06,8e-06,9e-06,4e-06,5e-06,8e-06,4e-06,5e-06,2e-06,4e-06,2e-06,1e-05,5e-06,5e-06,0,1e-06,4.2e-05,4.1e-05,3.4e-05,1.8e-05,1e-05,0.000362,0.000343,0.00017,6e-05,3.4e-05,1.5e-05,1.9e-05,2.9e-05,0.000156,0.000161,7.6e-05,0.000213,7.6e-05,0.000247,0.000136,0.000149,0.000297,0.000269,0.000307,0.000321,0.000201,0.000269,0.000143,0.000133,0.00026,0.000147,0.000177,0.000162,0.000161,3.6e-05,7.6e-05,0.000261,0.000148,9.8e-05,0.000142,0.000121,0.000154,0.000172,0.000162,0.000101,2.6e-05,5.8e-05,1.2e-05,5.3e-05,0.000196,0.000114,8.5e-05,0.000153,0.000109,1.4e-05,3.3e-05,3.8e-05,5.6e-05,8.4e-05,7.3e-05,9.2e-05,6e-05,6e-05,5.3e-05,3.7e-05,2.1e-05,7e-06,3.9e-05,3.5e-05,2.2e-05,4e-06,0.000181,0.000121,7.3e-05,2.5e-05,9e-06,7e-06,3e-06,9e-06,5e-06,7e-06,5e-06,3e-06,1.6e-05,6e-06,2.4e-05,4e-06,6e-06,6e-06,4e-06,3e-06,2e-06,1e-06,2e-06,2e-06,8e-06,2e-05,5e-06,5e-06,2e-06
4e-06,5e-06,4e-06,4e-06,2e-06,8e-06,5e-06,1e-05,4e-06,5e-06,6e-06,5e-06,2e-06,1e-06,5e-06,2e-06,8e-06,3e-06,2e-06,1e-06,1e-06,1.9e-05,6e-06,7e-06,1.3e-05,1.1e-05,0.000214,8e-05,4.6e-05,5e-06,9e-06,6e-06,1.2e-05,8e-06,7.9e-05,4.7e-05,4.6e-05,0.000264,0.000191,0.000185,0.000211,0.000139,0.000301,0.000255,0.000223,0.00017,0.000223,0.000337,0.000297,1.9e-05,0.000309,0.000193,0.000214,0.000222,0.00014,9e-05,0.000128,0.000193,5.9e-05,5.9e-05,7.8e-05,0.000239,0.000154,0.000199,0.000153,0.000143,1.2e-05,2.5e-05,4.3e-05,0.00013,1.2e-05,1.5e-05,5.5e-05,3.1e-05,5.4e-05,3.3e-05,2.1e-05,2.6e-05,4.1e-05,8e-06,2.5e-05,5.7e-05,1.9e-05,1.9e-05,1.1e-05,4e-06,4e-06,6e-06,3.4e-05,1.1e-05,2e-06,1.3e-05,0.000178,2.6e-05,1.4e-05,5e-06,1.1e-05,1.1e-05,5e-06,9e-06,2e-06,6e-06,3e-06,4e-06,1.2e-05,4e-06,2.4e-05,3e-06,4e-06,4e-06,1e-06,2e-06,0,2e-06,1e-06,1e-06,9e-06,1.6e-05,4e-06,2e-06,3e-06
0,2e-06,1e-06,1e-06,1e-06,3e-06,1e-06,5e-06,1e-06,2e-06,1e-06,1e-06,3e-06,2e-06,3e-06,1e-06,6e-06,1e-06,1e-06,1e-06,1e-06,7e-06,1.5e-05,5e-06,6e-06,5e-06,0.000115,5e-06,9e-06,9e-06,1.2e-05,9e-06,5e-06,6e-06,5.9e-05,1.1e-05,2.6e-05,0.000184,0.000246,0.000256,3.5e-05,9e-05,0.000203,7.8e-05,0.000174,0.00018,9e-05,5.1e-05,1e-04,8.3e-05,0.000159,0.000103,0.000122,0.000204,0.000133,8.2e-05,0.000135,0.000112,0.000126,0.000124,0.000132,0.000233,0.000138,0.000188,0.000181,0.000115,9e-06,2.8e-05,3.9e-05,0.000113,5.8e-05,1.2e-05,7e-06,3.3e-05,3.6e-05,1.4e-05,7e-06,2.6e-05,2.7e-05,1e-05,2.8e-05,3.3e-05,1.3e-05,1.6e-05,4e-06,3e-06,2e-06,7e-06,2.7e-05,5e-06,4e-06,1.3e-05,0.000154,2.7e-05,3.3e-05,3e-06,8e-06,3e-06,1e-06,6e-06,4e-06,1e-06,1e-06,2e-06,1.1e-05,0,2.3e-05,3e-06,6e-06,6e-06,1e-06,2e-06,2e-06,2e-06,1e-06,1e-06,9e-06,1.8e-05,2e-06,2e-06,0
1e-06,1e-06,0,1e-06,2e-06,1e-06,2e-06,4e-06,1e-06,1e-06,1e-06,1e-06,3e-06,1e-06,3e-06,1e-06,5e-06,2e-06,2e-06,1e-06,0,5e-06,1.2e-05,6e-06,4e-06,6e-06,0.000117,2e-05,7e-06,7e-06,7e-06,1.1e-05,3e-06,8e-06,5.7e-05,1.8e-05,4.2e-05,0.000131,0.000179,0.000136,0.000201,0.000188,0.000108,0.000136,0.000213,0.00026,0.000265,0.000135,0.000165,9.6e-05,0.000193,0.000107,0.00019,0.000208,0.000139,6.6e-05,7.2e-05,6.5e-05,5.9e-05,0.000106,0.000126,0.000201,0.000188,0.000175,0.000209,0.000143,2.1e-05,2.5e-05,8e-06,0.000106,6.7e-05,2.3e-05,2.2e-05,1e-05,3.7e-05,1.4e-05,6e-06,2.1e-05,2.5e-05,1e-06,2.6e-05,2.8e-05,9e-06,1.1e-05,0,2e-06,2e-06,7e-06,2.6e-05,4e-06,2e-06,1.4e-05,0.000142,3.7e-05,2.7e-05,4e-06,9e-06,6e-06,2e-06,6e-06,4e-06,4e-06,1e-06,1e-06,9e-06,1e-06,2.4e-05,2e-06,4e-06,5e-06,1e-06,1e-06,1e-06,3e-06,0,1e-06,1e-05,1.8e-05,2e-06,2e-06,1e-06
