1.1e-05,5e-06,2.1e-05,1.4e-05,2e-05,1.9e-05,3.1e-05,7e-06,3.2e-05,1.3e-05,1.3e-05,3.2e-05,2.3e-05,1.8e-05,2e-06,6e-06,7e-06,4.5e-05,2e-05,5e-06,8e-06,1.1e-05,1.7e-05,1.8e-05,5.5e-05,1e-05,0.000349,2.9e-05,0.000326,0.000568,0.000296,0.000617,0.001187,0.000172,0.00071,0.000953,0.000121,0.000242,8e-05,0.000398,0.000359,0.000125,0.000324,0.00038,0.000379,0.000621,0.001019,0.000759,0.000383,0.000389,0.000126,0.000309,0.000164,8.7e-05,0.000363,0.00039,0.000247,0.000159,0.000207,0.000113,4.8e-05,7.2e-05,0.000125,4.7e-05,0.000147,5.7e-05,8e-06,5.4e-05,1e-04,9.1e-05,6e-06,0.00013,9.7e-05,1e-04,9.6e-05,4.1e-05,9.2e-05,0.00021,0.000123,0.000181,0.000423,0.000128,0.000333,9.5e-05,0.000203,2e-05,6.7e-05,9.6e-05,4e-05,7.6e-05,0.000112,1.3e-05,9.7e-05,5.4e-05,3.2e-05,9.9e-05,5.3e-05,5.5e-05,6.3e-05,1e-05,4.1e-05,7.8e-05,1.7e-05,9.2e-05,5.5e-05,4.9e-05,7e-05,1.5e-05,4.4e-05,2.5e-05,3e-06,7.4e-05,5.7e-05,3.2e-05,8.4e-05,2.8e-05,2.8e-05,3.9e-05,1e-06,5.9e-05,3.4e-05
2.9e-05,2.7e-05,1.6e-05,5.3e-05,6.8e-05,6.7e-05,2.6e-05,2.2e-05,4.6e-05,5e-05,4.2e-05,2.9e-05,7.9e-05,4.4e-05,2.4e-05,3.2e-05,2e-05,0.000102,9.3e-05,7.1e-05,4e-05,4.5e-05,7.8e-05,6e-05,9.8e-05,0.000109,0.000838,0.000302,0.00055,0.00095,0.001198,0.002677,0.003079,0.001906,0.001295,0.000973,0.001491,0.001123,0.001455,0.00117,0.000866,0.000454,0.001636,0.000865,0.000607,0.001273,0.000615,0.001815,0.000537,0.000751,0.001497,0.000907,0.000701,0.000364,0.000725,0.000677,0.000463,0.000736,0.000764,5.7e-05,0.000425,0.000173,0.000319,0.000162,6.2e-05,0.000248,2e-04,0.000248,6.8e-05,0.000173,0.000181,0.000148,0.000423,0.000175,0.000284,0.000401,0.000533,0.000798,0.000635,0.000684,0.00116,0.00094,0.000727,0.000592,0.000484,0.00052,0.000334,0.000319,0.000343,0.000262,0.000359,0.00029,0.000241,3e-04,0.000255,0.000253,0.000275,0.000194,0.000239,0.000221,0.000165,0.000241,0.000239,0.000202,0.00027,0.000189,0.000212,0.000206,0.000149,0.000368,0.000103,7.5e-05,0.000197,0.000175,0.000219,0.000231,0.000137,0.000128,0.000122,0.00013,0.000175
2.3e-05,6e-06,3.8e-05,5.9e-05,4.4e-05,3.6e-05,9e-06,1.7e-05,3e-05,2.2e-05,1.8e-05,2.1e-05,2.4e-05,1e-05,7e-06,4.1e-05,4.9e-05,0.000116,0.00018,9.2e-05,3.3e-05,2.2e-05,0.000136,0.000107,0.00014,4.7e-05,0.000936,0.000584,0.00077,0.002184,0.002007,0.003523,0.001767,0.001333,0.002933,0.00202,0.000634,0.001567,0.002406,0.002544,0.001221,0.001769,0.001571,0.00021,0.000484,0.001498,0.001691,0.001012,0.001402,8.4e-05,0.002144,0.001196,0.000556,0.000316,0.000695,0.000448,0.000389,0.001141,0.00019,0.000777,0.000473,0.000736,0.000327,2e-04,0.000122,0.000208,3.7e-05,0.000207,0.000302,0.00015,0.000139,0.000145,0.000372,0.000259,0.000272,0.000223,0.000558,0.00034,0.000283,0.00057,0.000541,0.000309,0.000281,0.000257,1.8e-05,0.000223,8.9e-05,0.000119,0.000165,4.8e-05,0.000108,4.1e-05,7.4e-05,8.8e-05,0.00012,1.9e-05,9e-05,0.000166,2.6e-05,7e-05,6.3e-05,6.1e-05,6.3e-05,5.4e-05,7.1e-05,6.8e-05,4.7e-05,3.8e-05,4.8e-05,0.000434,0.000234,9.1e-05,8.3e-05,6.8e-05,6.8e-05,5.7e-05,2.9e-05,3.7e-05,6.7e-05,4e-05,4.1e-05
1.9e-05,1.4e-05,5.8e-05,3e-05,4.8e-05,4.4e-05,3.9e-05,4.4e-05,4e-05,4.6e-05,3.6e-05,3.6e-05,5.3e-05,3.3e-05,2.7e-05,2.7e-05,8e-05,0.000113,9.9e-05,5e-05,2.4e-05,3.6e-05,0.000314,0.000119,0.000144,6.7e-05,0.000672,0.000394,0.00038,0.002958,0.001031,0.004143,0.002591,0.001812,0.000819,0.000149,4.9e-05,0.001655,0.001479,0.001716,0.000237,0.001327,0.002198,0.001238,0.000939,0.001738,0.001216,0.001206,0.001381,0.001252,0.001234,0.000832,0.000391,0.000661,0.000712,0.00094,0.00037,0.000645,0.001092,0.001324,0.000394,0.000632,0.000234,0.000366,0.000191,0.000318,0.000202,0.000315,0.000483,0.000176,0.000122,0.000119,0.000169,7.3e-05,0.000134,0.000285,0.00043,0.000379,0.000126,0.000187,0.000409,0.000581,0.00033,0.000195,6.3e-05,0.000122,0.000104,0.00011,2.5e-05,5.6e-05,6.7e-05,8.5e-05,5.9e-05,5.8e-05,0.000143,6.4e-05,0.000236,9.1e-05,8e-05,9.8e-05,1.6e-05,3e-05,7.1e-05,3.6e-05,2.9e-05,9.2e-05,6.2e-05,6.7e-05,1.9e-05,0.000393,0.000538,0.000255,4.6e-05,6.5e-05,7.5e-05,6.1e-05,3.5e-05,5.6e-05,9.6e-05,4.9e-05,3.1e-05
3e-06,2.1e-05,2.2e-05,1.6e-05,1.1e-05,1.9e-05,2.8e-05,4e-06,1.9e-05,2.3e-05,4.5e-05,1.6e-05,3.4e-05,6e-06,1.8e-05,4e-06,7.9e-05,6.7e-05,7.3e-05,5.3e-05,5.8e-05,2.2e-05,0.000432,0.000124,9.8e-05,8.4e-05,0.000367,0.000362,0.000203,0.00328,0.002482,0.00282,0.002825,0.001163,0.000997,0.000615,0.000671,0.002034,0.00075,0.002723,0.002741,0.001078,0.003118,0.002647,0.001115,0.000266,0.001803,0.001954,0.001243,0.000308,0.000791,0.001658,0.000819,0.001146,0.001177,0.001239,0.001973,0.001457,0.000754,0.001227,0.000731,0.000611,0.000642,0.001045,0.000418,0.000298,0.000139,0.000496,7.2e-05,0.000197,6.9e-05,0.00016,0.00012,4.3e-05,8.5e-05,0.000171,0.000493,0.00029,0.000507,0.000859,0.000342,0.000281,0.000183,3.5e-05,6.4e-05,8.2e-05,8.7e-05,1.4e-05,3.5e-05,2.9e-05,3.6e-05,5e-05,2.5e-05,7e-06,4.9e-05,1.4e-05,0.000217,9.4e-05,1.1e-05,5.5e-05,1.5e-05,4e-06,3.1e-05,4.2e-05,3.2e-05,2.2e-05,1e-05,3.7e-05,3.6e-05,7.8e-05,0.000233,0.000188,9.6e-05,6e-05,3e-06,2.3e-05,3.9e-05,4.9e-05,4.4e-05,4.3e-05,3.6e-05
1.4e-05,2.9e-05,2e-06,2.3e-05,3e-06,1.9e-05,2.5e-05,2.2e-05,3.5e-05,2.6e-05,3e-05,5.5e-05,3.7e-05,3.4e-05,2.2e-05,1e-06,9.3e-05,0.000106,8e-05,2.3e-05,8.7e-05,2.9e-05,0.000541,0.000222,0.000101,0.000345,0.000876,0.000654,0.000337,0.00305,0.001223,0.0056,0.00057,0.001422,0.002078,0.003225,0.000999,0.002722,0.001423,0.002734,0.002785,0.002248,0.001699,8e-04,0.001288,0.00038,0.000742,0.001043,0.001028,0.001509,0.002004,0.002659,0.001146,0.000508,0.000869,0.00065,0.00138,0.000589,0.000359,0.000906,0.000632,0.000375,0.000667,0.000538,0.000853,0.000364,0.000157,0.00036,0.000388,0.000161,5.8e-05,0.000244,0.000108,9.1e-05,0.00019,0.000115,0.000281,0.000197,6e-04,0.000712,0.001048,0.00055,0.00033,7.1e-05,7.6e-05,0.000118,2.2e-05,3.8e-05,6.6e-05,4.3e-05,1.9e-05,4.4e-05,4.7e-05,5.5e-05,4.4e-05,1.3e-05,2.2e-05,5.3e-05,3.1e-05,4.6e-05,5e-06,9e-06,1.9e-05,5.5e-05,3.6e-05,1.4e-05,2.7e-05,3.7e-05,1.9e-05,0.001171,0.000515,6.7e-05,5.3e-05,6.1e-05,3.3e-05,7e-06,2e-05,3.8e-05,4.8e-05,3.9e-05,2.8e-05
1.2e-05,2.8e-05,5e-05,2.5e-05,2.6e-05,3.5e-05,1.8e-05,3.5e-05,4.8e-05,3.3e-05,3.6e-05,4.4e-05,1.7e-05,2.5e-05,9e-06,2e-05,0.000101,6.4e-05,5.1e-05,2.3e-05,7.5e-05,4.8e-05,0.000621,0.000418,0.00039,0.000195,0.00165,0.000344,0.000635,0.002095,0.00179,0.008909,0.006886,0.005472,0.005229,0.001731,0.00058,0.002845,0.003033,0.001034,0.003476,0.000534,0.003619,0.00201,0.002318,0.001045,0.001792,0.001533,0.001798,0.000758,0.001284,0.001329,7e-04,0.000704,0.001297,0.000929,0.000342,0.000885,0.000571,0.00096,0.000274,0.000878,0.00032,0.000652,0.000572,0.000413,0.000469,0.000529,0.000329,0.000521,0.000376,4e-04,0.000225,0.000143,0.000218,0.000376,0.000252,0.00036,0.000809,0.000672,0.000971,0.000451,0.00046,0.000246,0.000166,5.6e-05,9.3e-05,4.1e-05,3.1e-05,6.9e-05,1.8e-05,5.1e-05,4.7e-05,8e-06,2.5e-05,4.9e-05,0.000311,0.000105,5.5e-05,7.6e-05,4.5e-05,3.1e-05,1.8e-05,2.2e-05,1e-05,3.1e-05,1.6e-05,1.7e-05,3.9e-05,0.002478,0.00104,0.000331,8.9e-05,2.2e-05,4e-06,4e-05,2.3e-05,3.9e-05,1.3e-05,2.4e-05,1.9e-05
8e-06,2.4e-05,3.5e-05,2.1e-05,4e-06,1.9e-05,2.9e-05,2.3e-05,2.6e-05,8e-06,8e-06,3.4e-05,2.2e-05,4.1e-05,5e-05,5.5e-05,6.4e-05,0.000206,0.000234,9.9e-05,0.000103,7.1e-05,0.000556,4e-04,0.000228,0.000158,0.001758,0.001141,0.000891,0.001828,0.000609,0.00808,0.004098,0.00175,0.002613,0.005792,0.003143,0.004056,0.007793,0.003613,0.005223,0.002108,0.00635,0.005396,0.003306,0.001598,0.003091,0.003608,0.004889,0.003704,0.000662,0.00132,0.00031,0.001929,0.001276,0.0013,0.001249,0.001079,0.001531,0.001211,0.00037,0.000823,0.000485,0.000422,0.000746,0.000139,0.000425,0.000503,0.000146,0.000244,8.5e-05,0.000287,0.000204,0.000195,0.000252,0.000221,0.000172,0.000207,0.00061,0.001197,0.000893,0.000485,0.000106,4e-05,9e-05,2.8e-05,5.7e-05,7.5e-05,5.6e-05,2.5e-05,4.1e-05,7.7e-05,7.9e-05,6.4e-05,6.1e-05,3.9e-05,0.00055,0.000191,8.9e-05,4.2e-05,1e-05,2.9e-05,1.7e-05,2.9e-05,4.1e-05,4.6e-05,2.4e-05,3.8e-05,7.1e-05,0.003453,0.00268,0.001333,0.000373,6.9e-05,9e-06,2.2e-05,3.7e-05,1.8e-05,1.4e-05,1.4e-05,2.5e-05
1.3e-05,2.4e-05,8.2e-05,5.8e-05,5.7e-05,5.6e-05,4.9e-05,3.7e-05,1e-05,6e-06,1.6e-05,5.6e-05,2.3e-05,5.6e-05,4.9e-05,1.5e-05,7.1e-05,0.00015,0.000169,0.000128,0.000174,0.00016,0.000413,0.000595,0.000218,0.000314,0.001625,0.001315,0.000835,0.001396,0.001084,0.006719,0.007534,0.003349,0.001885,0.002413,0.001516,0.003245,0.006217,0.004968,0.005344,0.004816,0.003668,0.005019,0.001846,0.002719,0.00517,0.000771,0.003262,0.000803,0.003837,0.002418,0.000194,0.002963,0.003546,0.002933,0.001574,0.001368,0.002382,0.003077,0.001542,0.00015,0.000439,0.000114,0.00079,0.001127,0.000514,0.000626,0.000345,0.000317,0.000307,0.000507,0.000194,0.000269,0.000247,0.000305,0.000121,0.000243,0.000636,0.001879,0.000921,0.000231,0.000733,0.000261,7.6e-05,7.5e-05,9.5e-05,0.000134,0.000163,1.7e-05,4.7e-05,1.6e-05,7.4e-05,1.1e-05,3.8e-05,4e-06,0.000561,0.000398,0.000159,4.1e-05,2.6e-05,1.6e-05,3.7e-05,5.1e-05,6.7e-05,6.4e-05,8.2e-05,5.5e-05,0.000104,0.003544,0.002957,0.001349,0.000199,2.4e-05,1.3e-05,2.3e-05,4.8e-05,3.6e-05,3.6e-05,5.1e-05,2.6e-05
5.6e-05,5.5e-05,0.000161,0.000173,6.1e-05,6.3e-05,5.4e-05,5.2e-05,6.3e-05,4.9e-05,1.6e-05,7.6e-05,9.8e-05,2.2e-05,1.3e-05,2.3e-05,3.3e-05,0.000176,0.000174,8.6e-05,0.000162,0.00015,0.000333,0.000514,0.000519,0.000587,0.001119,0.002169,0.000801,0.001408,0.001683,0.008067,0.007894,0.004205,0.00251,0.002394,0.004289,0.002437,0.002666,0.002308,0.007835,0.006275,0.006816,0.00369,0.000943,0.003649,0.001805,0.003354,0.001148,0.003367,0.004513,0.002224,0.001561,0.002386,0.003729,0.003738,0.001695,0.001145,0.001297,0.000712,0.000747,0.000208,0.000469,0.000281,0.000823,0.001032,0.000657,0.000765,0.000672,0.000441,7.3e-05,0.000609,0.000305,0.000216,0.000304,0.000348,0.000744,0.000824,0.001214,0.003091,0.001885,0.001222,0.000749,0.000534,0.000207,9.7e-05,2.5e-05,9.7e-05,0.000129,0.000135,9.5e-05,2.6e-05,0.000126,0.000127,3.4e-05,7.1e-05,0.000388,0.000562,0.000254,0.000111,0.000124,7.5e-05,2.6e-05,6.7e-05,3.1e-05,3.4e-05,6.3e-05,3.4e-05,7.6e-05,0.003299,0.002844,0.001251,0.000126,0.000135,3.7e-05,5.1e-05,4.1e-05,9.9e-05,5.2e-05,5.6e-05,6.4e-05
5.2e-05,2.7e-05,0.000121,7.7e-05,7.9e-05,6e-05,1e-05,2.1e-05,5.7e-05,5.5e-05,2.7e-05,6.5e-05,7.5e-05,9.3e-05,7.7e-05,5.3e-05,3.7e-05,0.000137,0.000238,0.000206,0.000143,4.2e-05,0.000239,0.000219,0.00022,0.000372,0.001493,0.002337,0.002568,0.003099,0.001201,0.00663,0.001632,0.001515,0.001583,0.001307,0.003219,0.002099,0.0015,0.001597,0.004689,0.000524,0.003014,0.000255,0.001016,0.002725,0.002908,0.002293,0.002307,0.001926,0.003313,0.002403,0.00136,0.000397,0.002694,0.000751,0.000397,0.000337,0.000625,0.000883,0.000301,0.000832,0.000102,0.000366,0.000174,0.000528,0.000199,0.000305,0.000144,0.000316,0.000458,0.000268,0.000372,0.000235,0.000183,0.000163,0.00073,0.000619,0.000796,0.003115,0.00198,0.001211,0.001496,0.001092,0.00057,0.000244,9.7e-05,5.4e-05,0.000132,0.000199,0.000103,2.7e-05,7.7e-05,0.000112,7.2e-05,9.1e-05,0.000376,0.00053,0.000325,0.000184,0.000103,5.8e-05,6.3e-05,9e-05,8.2e-05,2.4e-05,3.9e-05,4e-05,7.1e-05,0.002775,0.001567,0.000839,0.000411,0.000178,7e-05,5.3e-05,3e-05,7.8e-05,6.2e-05,6.2e-05,6e-05
9e-06,2.6e-05,5.3e-05,2.8e-05,3.2e-05,3.5e-05,2.4e-05,1.9e-05,5.6e-05,3e-06,1.5e-05,2.8e-05,2.1e-05,2.2e-05,2e-05,1.4e-05,2.2e-05,6.4e-05,0.000151,1e-05,3.2e-05,4.4e-05,0.000157,7e-05,0.000323,0.00027,0.001223,0.000709,0.000898,0.002177,0.002095,0.004169,0.003304,0.002433,0.002139,0.001731,0.001592,0.000565,0.003696,0.002785,0.001544,0.001487,0.001808,0.002633,0.001437,0.001936,0.000395,0.001995,0.000715,0.001212,0.003106,0.003317,0.00222,0.001911,0.00105,0.001834,0.00014,0.000987,0.001763,0.000597,0.000534,0.000612,0.000371,0.000316,0.000232,0.000382,3.8e-05,0.000139,0.000101,0.000323,0.000327,9.9e-05,0.000318,0.000232,0.000204,6.2e-05,0.000551,0.000107,0.000898,0.001819,0.00092,0.000235,0.000611,0.000171,0.000102,7.6e-05,4.4e-05,6.6e-05,0.000121,8e-05,3.9e-05,6.2e-05,7.7e-05,2.3e-05,1.8e-05,3.5e-05,0.000419,0.000276,6e-05,5.1e-05,2.6e-05,8e-06,2.9e-05,3.7e-05,3.2e-05,1.9e-05,3e-05,2.5e-05,3.7e-05,0.00183,0.000209,0.000123,0.000101,4.7e-05,2.7e-05,2e-05,1.5e-05,3.3e-05,1.2e-05,2.5e-05,2.2e-05
9e-06,1.5e-05,2.1e-05,1.1e-05,8e-06,3e-06,1.4e-05,1.4e-05,2.1e-05,9e-06,1.7e-05,1.1e-05,8e-06,1.6e-05,4e-06,1.5e-05,1.6e-05,1.7e-05,8e-05,6e-05,9e-06,3.6e-05,9.7e-05,0.000135,0.000256,0.000371,0.001006,0.001005,0.000157,0.002431,0.00166,0.001684,0.000681,0.000452,0.00116,0.000764,0.002605,0.000764,0.002877,0.000993,0.000816,0.001554,0.001599,0.001378,0.000512,0.000503,0.000689,0.00234,0.001305,0.001544,0.00183,0.001618,0.001516,0.002035,0.000841,1.2e-05,0.001753,0.001127,0.001855,0.001042,0.000585,0.000508,0.000677,0.000236,0.000251,0.000374,8.8e-05,0.000214,0.000291,0.000299,0.000212,8.6e-05,0.00015,0.000105,0.000208,0.000182,0.000215,9e-05,0.00082,0.000351,0.000731,0.000279,0.000242,0.000124,5.6e-05,9.1e-05,5.3e-05,0.000151,2.7e-05,5.1e-05,3.3e-05,9e-06,3.9e-05,1.9e-05,1.2e-05,3.7e-05,0.000482,0.000249,6.4e-05,2.6e-05,2e-05,1.5e-05,2.8e-05,2e-05,1e-05,5e-06,1.7e-05,2.4e-05,1.3e-05,0.000651,0.000348,0.000164,4.3e-05,1.7e-05,2.1e-05,1.4e-05,3e-05,7e-06,7e-06,1.9e-05,1.3e-05
7e-06,2.4e-05,2.6e-05,7e-06,1.5e-05,1.2e-05,7e-06,1e-05,2.2e-05,9e-06,6e-06,8e-06,1.5e-05,2.5e-05,1.9e-05,3e-05,4.8e-05,5e-05,7.8e-05,3.8e-05,4.6e-05,3.5e-05,0.000161,5e-05,0.000208,8.4e-05,0.000447,0.000483,0.000501,0.003144,0.000676,0.003634,0.004383,0.003462,0.003615,0.002082,0.002822,0.002746,0.001436,0.003585,0.001701,0.002444,0.001814,0.001434,0.001311,0.000973,0.001562,0.003365,0.002802,0.00322,0.001911,0.001448,0.000543,0.001869,0.003797,0.001671,0.000142,0.001795,0.002326,0.000802,0.00071,0.001633,0.000683,0.00035,0.000438,0.000299,0.000115,0.000287,0.000228,0.000314,0.000225,0.00017,0.000253,8.3e-05,0.000234,6.7e-05,8.4e-05,6.8e-05,0.000838,0.000472,6.7e-05,0.000132,8.5e-05,9.7e-05,3e-05,2e-05,2.4e-05,0.000104,9.8e-05,2.8e-05,5.3e-05,3.1e-05,5.6e-05,4e-06,1.7e-05,2.2e-05,0.000437,0.000191,8.8e-05,1.3e-05,8e-06,9e-06,9e-06,5e-06,1.1e-05,8e-06,1.3e-05,2.7e-05,4.2e-05,0.00047,0.000438,0.000236,0.000107,3.5e-05,1.3e-05,7e-06,3.7e-05,7e-06,1.7e-05,2.7e-05,9e-06
1.7e-05,3e-05,3e-06,1.4e-05,1.8e-05,1e-06,3e-06,1.3e-05,2e-05,2.5e-05,1.1e-05,1.2e-05,2.1e-05,2e-05,7e-06,2.2e-05,2.5e-05,9.3e-05,3.8e-05,4.6e-05,0.000104,0.000101,0.00012,9.4e-05,0.00018,0.000104,0.000958,0.001085,0.000166,0.00377,0.00064,0.001692,0.00332,0.004189,0.003625,0.001974,0.001876,0.002303,0.003999,0.005308,0.005592,0.001484,0.002117,0.001381,0.00262,0.001033,0.002371,0.003712,0.001163,0.002559,0.001546,0.00151,0.00188,0.000593,0.003806,0.003593,0.003533,0.002443,0.00249,0.001572,0.001733,0.002474,0.000724,0.000536,0.000659,0.001022,0.000422,0.000324,0.000533,0.000703,2.6e-05,0.000319,0.000553,0.00019,0.000154,7.7e-05,0.000186,0.00013,0.000851,0.000148,0.000235,8.1e-05,0.000104,0.000132,5e-05,6.6e-05,2.7e-05,4e-05,3.5e-05,5.2e-05,5.2e-05,4.6e-05,3.1e-05,2e-05,8e-06,4.4e-05,0.000304,0.000153,3.6e-05,1.3e-05,9e-06,1.5e-05,6e-06,2.3e-05,1.9e-05,5e-06,2.7e-05,5.3e-05,3.2e-05,0.000765,0.000233,5.4e-05,6.8e-05,5.4e-05,4.3e-05,2.4e-05,3.4e-05,1.7e-05,3e-05,2.6e-05,2.6e-05
1.4e-05,5.2e-05,1.8e-05,2.4e-05,1.1e-05,8e-06,2e-06,1e-05,9e-06,7e-06,1.6e-05,7e-06,7e-06,8e-06,2.1e-05,6e-06,2.1e-05,0.00012,5.8e-05,8.3e-05,0.000144,4.3e-05,0.000129,6.4e-05,4.2e-05,0.000225,0.001848,0.002519,0.000913,0.004488,0.004952,0.003623,0.004025,0.008502,0.00635,0.005487,0.005843,0.003051,0.008397,0.004615,0.004317,0.002721,0.002848,0.003469,0.006389,0.005495,0.004888,0.007475,0.008592,0.003648,0.003803,0.004157,0.002369,0.005405,0.007133,0.002049,0.005204,0.00086,0.004214,0.002514,0.002709,0.004513,0.002411,0.000542,0.00081,0.000686,0.00084,0.000817,0.00058,0.001721,0.001467,9.7e-05,0.000427,0.00087,0.000387,0.000161,0.000168,7.1e-05,0.000635,0.000846,0.000259,0.000179,0.000198,8.4e-05,7.6e-05,7.6e-05,3.7e-05,0.000178,9.2e-05,2.1e-05,5.2e-05,2.1e-05,4.9e-05,5.1e-05,3.2e-05,4.8e-05,0.000148,0.000166,0.000107,2.2e-05,1.4e-05,2.2e-05,4.1e-05,4.6e-05,4.5e-05,3.2e-05,3.3e-05,4.3e-05,3.2e-05,0.000519,0.00029,0.000202,4.4e-05,3.8e-05,1.3e-05,1.8e-05,4.8e-05,5.1e-05,8e-06,1.5e-05,1.1e-05
1e-05,5e-05,3.7e-05,2.7e-05,1.2e-05,1.1e-05,8e-06,2e-05,3.5e-05,9e-06,1.4e-05,6e-06,2.4e-05,1.6e-05,2.4e-05,9e-06,5e-05,0.000114,4.2e-05,6.4e-05,1.7e-05,6.2e-05,0.000136,4.7e-05,0.000119,0.000233,0.001888,0.003159,0.002186,0.003969,0.009586,0.0026,0.005807,0.009202,0.007401,0.011122,0.012349,0.010802,0.002164,0.009991,0.007174,0.001315,0.003623,0.001911,0.005696,0.008901,0.004859,0.000756,0.006457,0.008426,0.008462,0.008959,0.008565,0.010209,0.001179,0.007438,0.009177,0.008597,0.008117,0.008874,0.006362,0.0078,0.009297,0.006589,0.002428,0.000753,0.000895,0.000141,0.000737,0.002335,0.001744,0.001474,0.001401,0.001419,0.000913,0.00023,0.000151,0.000253,0.000772,0.001576,0.00096,0.000289,0.000263,1e-04,0.000128,2.4e-05,2.4e-05,0.000291,0.000186,8.8e-05,2.7e-05,3e-05,5.2e-05,9e-06,2.5e-05,1e-06,0.000154,6.8e-05,3.5e-05,4.3e-05,3.8e-05,4.1e-05,2.1e-05,3.9e-05,2.5e-05,1.6e-05,3.3e-05,2.1e-05,5.8e-05,0.000284,0.000138,4.2e-05,6.1e-05,2e-05,1.9e-05,8e-06,7.4e-05,7e-05,5.7e-05,3.9e-05,3e-05
1.8e-05,4.9e-05,4.5e-05,2e-05,1.2e-05,1.1e-05,1.1e-05,2.8e-05,2.5e-05,3.4e-05,9e-06,1.5e-05,2.7e-05,3.4e-05,2.2e-05,2.6e-05,6.2e-05,0.000138,5.1e-05,7.7e-05,9.5e-05,8.4e-05,0.000193,2.4e-05,0.000238,0.000155,0.001815,0.001733,0.000562,0.002408,0.006548,0.006727,0.005628,0.000904,0.004864,0.004279,0.004398,0.00338,0.004649,0.005737,0.003595,0.005401,0.002765,0.003899,0.004468,0.003471,0.002768,0.002828,0.003124,0.002817,0.001184,0.003335,0.008739,0.006793,0.007954,0.008928,0.005976,0.00503,0.00653,0.003097,0.003582,0.005937,0.005822,0.003145,0.003152,0.002036,0.001551,0.000779,0.000955,0.002117,0.001012,0.001186,0.000472,0.000391,0.000521,4e-04,0.000145,9.9e-05,0.000675,0.001983,0.001115,0.000307,0.000282,0.000186,0.000131,9.5e-05,5.8e-05,0.000311,0.000203,8.3e-05,5e-05,1.6e-05,3.8e-05,5.5e-05,5.7e-05,5.4e-05,0.000229,0.000102,5.7e-05,5.5e-05,5e-06,3.1e-05,2.3e-05,3.7e-05,3.4e-05,3.2e-05,2.9e-05,1.7e-05,6.1e-05,0.000272,0.000316,0.000179,1.8e-05,2.4e-05,2.3e-05,3.9e-05,5.8e-05,1e-05,7e-06,8e-06,2.6e-05
3e-06,5.3e-05,1.8e-05,1.4e-05,7e-06,1.3e-05,5e-06,1.3e-05,3.7e-05,2.1e-05,2.6e-05,2.8e-05,8e-06,1e-05,5.1e-05,2.7e-05,4.3e-05,5.5e-05,3.5e-05,9.8e-05,4e-05,0.000196,0.000226,0.000307,0.00032,0.000237,0.00168,0.001521,0.000686,0.000775,0.003483,0.000655,0.002479,0.001296,0.004111,0.00253,0.002087,0.002133,0.001671,0.001159,0.004475,0.002085,0.00524,0.003944,0.002317,0.001632,0.003642,0.002212,0.002592,0.003996,0.003994,0.002605,0.005996,0.004061,0.003028,0.003267,0.002326,0.005095,0.001208,0.001767,0.000666,0.003401,0.001697,0.000642,0.00191,0.000511,0.000371,0.001103,0.001876,0.000856,0.000213,0.001002,0.001019,0.00066,0.000321,0.000128,0.000142,0.000264,0.000634,0.001767,0.000886,0.000275,0.000434,0.000115,7.2e-05,7.1e-05,3.4e-05,0.000324,0.000124,5.9e-05,5.5e-05,6.9e-05,2.3e-05,7.1e-05,4.4e-05,2.5e-05,0.00028,0.00018,9.6e-05,4.4e-05,3.8e-05,1.6e-05,3.4e-05,1.6e-05,2.9e-05,1.1e-05,2.6e-05,1.4e-05,2.1e-05,0.000221,0.000256,9.5e-05,7.3e-05,6.2e-05,6.1e-05,4.1e-05,6.5e-05,2.9e-05,2.9e-05,1.9e-05,1.2e-05
2.2e-05,3.7e-05,6.6e-05,6e-05,2.5e-05,1.5e-05,1.8e-05,1.3e-05,3.2e-05,3.4e-05,1.4e-05,4e-05,3.6e-05,3.2e-05,0.000113,5.2e-05,4.5e-05,8.7e-05,6.6e-05,7.8e-05,6.5e-05,0.00027,0.000102,0.000179,2e-04,0.00024,0.001957,0.001195,0.001363,0.001756,0.001605,0.001663,0.001518,0.002621,0.003869,0.001277,0.000818,0.003569,0.002369,0.001331,0.001551,0.004953,0.004281,0.007892,0.007792,0.005069,0.004906,0.005161,0.002912,0.002478,0.001828,0.001241,0.0023,0.003146,0.003623,0.00184,0.003696,0.001037,0.002025,0.001401,0.001168,0.001372,0.001043,0.000398,0.000943,0.000985,0.000434,0.000861,0.000321,0.000552,0.000721,0.000846,0.000561,0.000353,1.3e-05,2.8e-05,0.000141,0.000294,0.000477,0.000982,0.000474,3.8e-05,0.000554,0.000387,0.000197,0.000124,3.9e-05,0.000344,0.000196,6.6e-05,2.1e-05,6.3e-05,6.4e-05,6.4e-05,4.1e-05,1.7e-05,0.00025,7.2e-05,4e-05,5.4e-05,1.3e-05,3e-05,1.4e-05,1.1e-05,1.4e-05,3.7e-05,1.3e-05,5.2e-05,2.5e-05,0.000546,0.000589,0.000291,7.2e-05,4.7e-05,4e-05,1.3e-05,4.8e-05,4.7e-05,7e-05,7.5e-05,6.3e-05
8e-06,3.3e-05,5.3e-05,1.6e-05,1.2e-05,2.6e-05,1e-05,2.4e-05,2.5e-05,3e-05,4.8e-05,4.5e-05,4e-06,2.7e-05,0.000126,0.000138,0.000149,0.000228,0.000179,0.000125,9.1e-05,0.000241,0.000162,6.4e-05,0.00025,0.000104,0.002393,0.001545,0.000727,0.00127,0.002454,0.001022,0.003555,0.001238,0.001586,0.002546,0.001478,0.002038,0.003301,0.002311,0.001553,0.005726,0.003583,0.004422,0.002178,0.002338,0.002125,0.000893,0.003942,0.003128,0.002137,0.000203,0.000875,0.002215,0.003429,0.001482,0.001928,0.000207,0.003115,0.000425,0.000868,0.001894,0.00064,0.001857,0.001072,0.000761,0.000385,0.000407,0.000416,0.000616,0.000668,0.000121,0.000383,0.000145,0.000154,0.000108,0.000216,0.000195,0.000549,0.00017,0.000201,0.000244,0.000605,0.000409,0.000166,0.000142,0.000136,0.000396,0.000321,0.000213,7.8e-05,6e-05,4.2e-05,0.000106,3.7e-05,3.9e-05,0.000227,0.000272,0.000136,7.5e-05,7.7e-05,7e-05,2.9e-05,3.7e-05,2.2e-05,5.7e-05,1e-05,9e-05,0.00013,0.000766,0.000252,0.000237,1e-04,7e-06,4.3e-05,3.4e-05,2.6e-05,2e-05,3.9e-05,7.3e-05,8e-06
1.7e-05,3.5e-05,4.7e-05,4.9e-05,2e-05,2.1e-05,2.1e-05,9e-06,1.2e-05,3.8e-05,5.5e-05,2.8e-05,2.1e-05,4.8e-05,6e-05,9.7e-05,5.6e-05,0.000117,8.7e-05,2.7e-05,6.3e-05,0.000261,0.000264,2e-04,0.000189,0.000328,0.002991,0.002679,0.001874,0.001248,0.000752,0.00219,0.001964,0.002817,0.003258,0.001455,0.000372,0.001872,0.00242,0.000796,0.003366,0.003897,0.00288,0.001905,0.001744,0.004352,0.002933,0.003057,0.000504,0.001611,0.002927,0.004198,0.002738,0.001003,0.002533,0.003123,0.002917,0.001828,0.001315,0.001832,0.001754,0.000432,0.000562,0.001427,0.000493,0.000468,0.000393,0.000227,0.000672,0.000198,0.000571,0.000245,0.000437,0.000503,0.000191,0.000275,0.000318,8.1e-05,0.000372,0.000402,0.000287,5.1e-05,0.000648,0.000376,0.000165,0.000131,2.3e-05,0.000351,0.00016,7.5e-05,3.5e-05,2.1e-05,3.7e-05,7.5e-05,6.2e-05,2.5e-05,0.000195,8.5e-05,2.4e-05,3e-05,6.6e-05,1.9e-05,2.5e-05,7.2e-05,7.8e-05,9e-06,4.2e-05,7.7e-05,4.2e-05,0.000668,0.00072,0.000257,6.1e-05,1e-06,3.9e-05,1.9e-05,2.8e-05,3.8e-05,3.8e-05,2.7e-05,4.1e-05
3e-06,1.1e-05,2.1e-05,7e-06,4e-06,3e-06,4e-06,5e-06,2e-06,1.2e-05,1e-05,6e-06,3e-06,1.7e-05,2.6e-05,2.6e-05,3.8e-05,5e-05,5.3e-05,5.8e-05,7.3e-05,8.2e-05,6.1e-05,4.3e-05,4.9e-05,9.9e-05,0.001501,0.001185,0.000304,0.000391,0.000389,0.001283,0.000816,0.000428,0.000748,0.00031,0.000319,0.001261,0.000239,0.000356,0.001185,0.000251,0.000339,0.000348,0.000324,0.001071,0.001234,0.000472,0.000339,0.001163,0.000699,0.001386,0.000739,0.000657,0.000669,0.000356,0.000652,0.000898,0.001034,0.000795,0.000638,0.000255,4e-04,0.000154,0.000258,0.00034,0.00019,5.6e-05,0.000294,0.000177,0.000105,4.6e-05,0.000129,0.000122,8.2e-05,0.000129,1.8e-05,6.8e-05,0.000209,0.000229,7.4e-05,4.3e-05,0.000297,0.000174,7.7e-05,4.5e-05,3.2e-05,0.000133,6.8e-05,1.8e-05,1e-05,1.1e-05,1e-05,1.5e-05,1.4e-05,6e-06,9.5e-05,4.9e-05,1.4e-05,9e-06,1.6e-05,8e-06,1.5e-05,2.3e-05,8e-06,1.6e-05,2.2e-05,2.4e-05,2.5e-05,0.000403,0.000342,0.000142,2.7e-05,6e-06,1e-05,1.2e-05,9e-06,1.5e-05,1.3e-05,1.6e-05,1.1e-05
7e-06,1.4e-05,1.2e-05,4e-06,3e-06,4e-06,6e-06,1e-06,4e-06,7e-06,3e-06,3e-06,1.1e-05,9e-06,1.9e-05,9e-06,7e-06,2.4e-05,4.3e-05,2.3e-05,4.9e-05,9.7e-05,0.000117,9.5e-05,4.7e-05,5e-05,0.001273,0.000766,0.000291,0.000359,0.000606,8e-04,0.001105,0.00044,0.000504,0.000945,0.001035,0.000516,0.000379,0.00033,0.000161,0.000478,0.000732,0.000216,0.000636,0.00076,0.000912,6.8e-05,0.000555,0.000818,0.000596,0.000723,0.000255,0.000667,0.000404,0.000467,0.000371,0.000428,0.000418,0.000696,0.000277,0.000607,8.9e-05,8.7e-05,7.3e-05,0.000192,0.000229,0.000179,0.000173,0.000121,3e-05,7e-05,1e-04,3.7e-05,1.7e-05,8.2e-05,4.5e-05,6e-05,0.000199,0.000109,7.6e-05,5e-05,0.000159,7.6e-05,2.7e-05,2e-05,2.4e-05,9.9e-05,4.1e-05,1.5e-05,8e-06,7e-06,8e-06,5e-06,1.2e-05,1.8e-05,8.3e-05,5.1e-05,1e-05,9e-06,6e-06,1e-05,1e-05,1.6e-05,5e-06,1e-06,5e-06,5e-06,1.6e-05,0.000498,0.000283,0.000101,1.6e-05,1e-05,1.2e-05,1e-05,5e-06,3e-06,5e-06,5e-06,5e-06
6e-06,1.1e-05,3e-06,8e-06,4e-06,4e-06,6e-06,5e-06,8e-06,9e-06,2e-06,5e-06,8e-06,8e-06,1.8e-05,4e-06,2.1e-05,1.9e-05,3.2e-05,2.9e-05,1.6e-05,2.7e-05,8.5e-05,8.3e-05,7.3e-05,3.1e-05,0.000918,0.000612,0.000318,0.000328,0.000183,0.000443,0.000456,0.000225,0.000946,0.000201,0.000368,0.000796,2e-04,0.000435,0.000264,0.000799,0.001024,0.000603,0.000871,0.000568,0.001006,0.000309,0.000167,0.00062,0.000205,0.000303,0.000414,7.3e-05,0.000427,3.7e-05,0.000206,0.000488,0.000532,0.000537,0.000125,0.000358,0.000273,0.000116,4.4e-05,0.000115,6.4e-05,1.2e-05,0.000133,7.1e-05,0.000108,8.9e-05,0.000125,9.7e-05,6.6e-05,4.3e-05,5.2e-05,1.4e-05,0.000128,0.000108,6.6e-05,5.8e-05,4.2e-05,3.9e-05,1e-05,3.2e-05,3.9e-05,4.2e-05,3.1e-05,2e-05,1.4e-05,6e-06,1e-05,5e-06,1.1e-05,1.3e-05,7.9e-05,5.6e-05,2.4e-05,1.1e-05,6e-06,5e-06,8e-06,3e-06,6e-06,7e-06,1.3e-05,8e-06,1.2e-05,0.000431,0.000108,5.2e-05,8e-06,1.1e-05,8e-06,9e-06,1e-05,4e-06,5e-06,7e-06,9e-06
4e-06,6e-06,4e-06,8e-06,3e-06,3e-06,5e-06,4e-06,4e-06,2e-06,1e-06,4e-06,7e-06,3e-06,1.1e-05,9e-06,1.8e-05,4e-05,2.2e-05,2.8e-05,3.3e-05,1.8e-05,7.5e-05,4e-05,2.9e-05,2.9e-05,0.000486,0.000376,0.00025,0.000261,0.000292,0.000443,0.000225,0.00055,0.000692,6e-04,0.000614,0.000405,0.000481,8.6e-05,0.000501,0.000425,0.000103,0.000274,0.000769,0.000376,0.001261,0.001303,0.000785,0.000127,0.000239,0.000581,0.00046,0.000161,0.000266,0.000313,8.8e-05,0.000127,0.000505,0.000296,0.000113,0.000237,0.000195,0.000101,9e-05,4.6e-05,3.5e-05,5.1e-05,5.6e-05,2.5e-05,7.9e-05,5.5e-05,5.8e-05,5.8e-05,4.3e-05,7.1e-05,9.1e-05,5.8e-05,0.000164,0.000149,3.1e-05,3.3e-05,9.9e-05,5e-05,3e-05,3.6e-05,3.7e-05,3.6e-05,2e-05,2.2e-05,1e-05,1.3e-05,7e-06,1.8e-05,1.1e-05,1.1e-05,6.9e-05,2.1e-05,9e-06,4e-06,4e-06,2e-06,1e-05,2e-06,4e-06,7e-06,1.1e-05,1.8e-05,1.7e-05,0.000219,3.8e-05,1.6e-05,2.4e-05,1.9e-05,5e-06,4e-06,4e-06,6e-06,3e-06,4e-06,2e-06
1e-06,4e-06,3e-06,2e-06,2e-06,1e-06,6e-06,3e-06,1e-06,4e-06,1e-06,1e-06,2e-06,2e-06,9e-06,1.3e-05,3e-06,2.9e-05,7e-06,2.5e-05,1e-05,1.1e-05,4.2e-05,4e-06,1e-05,1.5e-05,0.000152,0.000121,6.3e-05,0.000225,0.000308,0.000239,0.000605,0.000319,0.000386,7.7e-05,9.6e-05,0.000193,0.000105,7.7e-05,0.000134,0.000324,0.000283,0.000319,0.000377,0.000618,0.000501,0.00055,0.000184,0.000234,0.000239,0.000539,0.000385,4.6e-05,0.000436,0.000221,0.000215,0.000292,0.000413,0.000344,5.9e-05,0.000255,6.8e-05,9.6e-05,7.1e-05,6.1e-05,5.5e-05,5.5e-05,1e-04,4.4e-05,5.5e-05,4.8e-05,0.000104,7.4e-05,5.2e-05,1.1e-05,9.9e-05,5.5e-05,0.000127,5e-05,6e-05,5.5e-05,0.00015,5.5e-05,3.4e-05,2e-05,2.3e-05,2.9e-05,5e-06,5e-06,9e-06,2e-06,8e-06,1e-05,8e-06,1e-05,6.7e-05,3.3e-05,1.1e-05,1e-05,5e-06,4e-06,2e-06,1e-06,7e-06,9e-06,2e-06,1.1e-05,1.9e-05,0.000144,4.4e-05,9e-06,2.7e-05,1.7e-05,8e-06,5e-06,5e-06,6e-06,7e-06,1e-06,3e-06
3e-06,4e-06,4e-06,1e-06,2e-06,1e-06,4e-06,4e-06,3e-06,5e-06,2e-06,2e-06,5e-06,5e-06,5e-06,1.5e-05,1.4e-05,2.2e-05,3.1e-05,1e-05,1e-05,1.4e-05,1.4e-05,1.8e-05,1.8e-05,2.4e-05,9.4e-05,0.000148,3.7e-05,0.000268,0.000127,0.000543,0.000223,0.000119,0.000328,0.000321,0.000247,0.00024,7.1e-05,0.000454,0.000221,0.000126,0.000178,0.000113,0.000205,0.000117,0.00034,0.000173,0.000489,0.000567,0.000368,0.000217,0.000489,0.000255,8.6e-05,0.00021,0.000178,0.000187,0.000349,0.000333,2e-04,0.000217,0.00011,9.4e-05,5.3e-05,0.000116,3.2e-05,0.000105,6.1e-05,2.3e-05,2.8e-05,4e-05,2.2e-05,3.1e-05,3.7e-05,1.9e-05,0.000108,4.4e-05,0.000114,6.7e-05,3.5e-05,2.9e-05,8.1e-05,5.2e-05,1.1e-05,1e-06,7e-06,2.1e-05,7e-06,8e-06,7e-06,8e-06,2e-06,1.1e-05,2e-06,2e-06,4.9e-05,3.8e-05,2e-05,1.7e-05,3e-06,3e-06,1e-05,9e-06,4e-06,6e-06,1e-06,1.2e-05,1e-05,0.000208,1.2e-05,1.7e-05,1.8e-05,4e-06,5e-06,1.2e-05,9e-06,4e-06,3e-06,3e-06,2e-06
2e-06,5e-06,2e-06,6e-06,5e-06,2e-06,2e-06,4e-06,4e-06,3e-06,2e-06,1e-06,4e-06,4e-06,5e-06,9e-06,4e-06,1.1e-05,2.3e-05,5e-06,1.3e-05,1.5e-05,5e-06,2.1e-05,1.9e-05,2.1e-05,0.000236,0.000142,0.000128,0.000252,0.00025,0.000424,0.000188,0.000302,0.000217,0.000129,6.1e-05,0.000328,0.000546,0.000196,0.000145,0.000407,0.000275,0.000302,0.000276,0.000383,0.000556,0.000156,0.000682,5.5e-05,0.000552,0.000479,0.000335,0.000432,0.000323,0.000244,0.000136,0.000229,0.000278,3.1e-05,6.7e-05,0.000273,0.000152,0.000118,4.8e-05,1e-04,5.8e-05,0.000101,5.7e-05,2.7e-05,7.6e-05,9e-06,4.2e-05,2.5e-05,1.7e-05,3.8e-05,5.5e-05,3.5e-05,0.000115,0.000106,4e-05,2.3e-05,4.4e-05,4.3e-05,1.6e-05,1.6e-05,3e-06,1.8e-05,9e-06,2e-06,5e-06,4e-06,2e-06,8e-06,6e-06,6e-06,2.7e-05,1.7e-05,1e-05,5e-06,5e-06,4e-06,1.3e-05,6e-06,5e-06,5e-06,1e-05,1.2e-05,5e-06,0.000157,4.4e-05,1.9e-05,1.3e-05,1e-06,9e-06,8e-06,1.1e-05,9e-06,5e-06,4e-06,5e-06
2e-06,4e-06,5e-06,8e-06,2e-06,1e-06,3e-06,3e-06,7e-06,3e-06,2e-06,1e-06,2e-06,3e-06,8e-06,6e-06,7e-06,1.1e-05,1.3e-05,2e-06,1.4e-05,8e-06,1.3e-05,1.5e-05,1.7e-05,2.7e-05,0.000234,0.000135,0.000101,0.000247,0.000175,0.000483,0.000273,0.000349,0.000147,0.000164,0.000162,0.000262,0.000627,0.000551,0.000192,0.000176,0.000128,0.000136,0.000272,0.000318,0.000192,0.000445,0.000309,0.000395,0.000452,0.000379,0.00019,0.000343,0.000241,0.000275,0.000276,0.000151,8.9e-05,8.2e-05,6e-05,0.000135,0.00012,0.000107,1.4e-05,1e-05,2e-05,3.5e-05,9e-05,6e-06,7.7e-05,2.3e-05,6.5e-05,6e-05,2.8e-05,1.9e-05,2.6e-05,4.2e-05,9.6e-05,7.5e-05,4.9e-05,1.6e-05,6.8e-05,3.7e-05,6e-06,2.1e-05,1.5e-05,3.2e-05,1.7e-05,1e-06,6e-06,8e-06,5e-06,1e-05,9e-06,4e-06,1.9e-05,1.1e-05,6e-06,6e-06,0,6e-06,6e-06,6e-06,6e-06,4e-06,1e-05,7e-06,1.4e-05,8.5e-05,5.5e-05,1.3e-05,9e-06,6e-06,9e-06,1.1e-05,5e-06,4e-06,6e-06,5e-06,2e-06
3e-06,6e-06,4e-06,2e-06,1e-06,1e-06,1e-06,0,5e-06,2e-06,3e-06,4e-06,7e-06,4e-06,2e-06,1.1e-05,7e-06,3e-06,7e-06,1.3e-05,1.3e-05,1.1e-05,8e-06,1.8e-05,3.2e-05,1.6e-05,0.000171,0.000136,0.000116,0.000303,0.00021,0.000404,0.000193,0.000398,0.000237,0.000171,0.000189,0.000309,0.000478,7.7e-05,0.000505,0.000378,0.000105,0.000324,0.000415,0.000329,7.9e-05,0.000331,0.000277,0.000146,0.000189,0.000223,0.000162,0.000212,0.000241,0.000285,6.5e-05,0.00022,0.000163,0.000254,0.000114,9.1e-05,0.000148,6.8e-05,6.8e-05,0.000112,4.5e-05,1.7e-05,0.000111,3.6e-05,6.6e-05,7e-05,3.3e-05,7.6e-05,1.1e-05,3.4e-05,3.6e-05,2.9e-05,9.1e-05,3.2e-05,5.2e-05,2.3e-05,6.9e-05,3e-05,2.5e-05,2.8e-05,2.1e-05,4.3e-05,4.2e-05,3.1e-05,1e-05,1e-05,5e-06,4e-06,9e-06,4e-06,1.2e-05,2e-06,2e-06,9e-06,6e-06,2e-06,7e-06,4e-06,4e-06,4e-06,5e-06,2e-06,3e-06,9e-05,4e-05,5.1e-05,2.9e-05,1.2e-05,8e-06,5e-06,1.1e-05,5e-06,4e-06,2e-06,1e-06
1e-06,3e-06,6e-06,3e-06,2e-06,1e-06,3e-06,3e-06,3e-06,1e-06,1e-06,2e-06,5e-06,8e-06,1e-05,1.1e-05,1.1e-05,6e-06,1.5e-05,7e-06,2e-06,1.3e-05,1.7e-05,2.4e-05,2.8e-05,1.6e-05,8.9e-05,8.8e-05,0.000118,0.000205,0.000217,0.000277,0.000206,0.000464,0.000139,0.000169,0.000163,0.000272,0.000492,0.000471,0.000608,0.000274,0.000348,0.000538,0.000118,0.000371,5.1e-05,0.000139,5.3e-05,0.000283,3e-05,0.000303,0.000288,0.000325,0.000225,5.8e-05,0.000154,0.00014,0.000202,0.000282,0.000149,9.4e-05,0.000169,5.8e-05,1.7e-05,0.000117,9e-05,5e-05,6.2e-05,4.1e-05,4.1e-05,6.3e-05,7e-05,3e-05,1.7e-05,4.9e-05,3e-05,1.9e-05,7.8e-05,6.2e-05,1.4e-05,1.9e-05,6.3e-05,2.3e-05,2.1e-05,1.2e-05,8e-06,1.2e-05,1e-06,9e-06,5e-06,1.4e-05,4e-06,2e-06,8e-06,3e-06,1.8e-05,4e-06,2e-06,5e-06,2e-06,4e-06,5e-06,5e-06,2e-06,5e-06,1e-06,5e-06,1e-05,0.000135,1e-05,3.1e-05,1.9e-05,5e-06,4e-06,3e-06,1e-05,7e-06,2e-06,3e-06,1e-06
4e-06,3e-06,2e-06,1e-06,4e-06,4e-06,1e-06,4e-06,7e-06,4e-06,1e-06,1e-06,7e-06,8e-06,9e-06,7e-06,8e-06,9e-06,9e-06,5e-06,6e-06,8e-06,1e-05,1.3e-05,1.4e-05,1.7e-05,3.7e-05,9.6e-05,0.000131,0.000233,0.000201,0.000758,0.00032,0.000241,0.00012,0.000248,0.00022,0.000328,0.000277,0.000144,0.00036,0.000234,0.000514,8.6e-05,9.7e-05,0.000309,0.000254,0.000208,0.000205,0.000369,4.2e-05,0.000163,2e-04,0.000265,0.000124,8.9e-05,5e-05,0.000239,0.000207,0.000189,7.1e-05,0.000193,0.000158,1.1e-05,4.6e-05,8e-05,5.4e-05,5.1e-05,4.4e-05,3.4e-05,2.2e-05,7.1e-05,3.7e-05,4.5e-05,3.9e-05,3.4e-05,6.1e-05,2.1e-05,8.5e-05,6.7e-05,2.1e-05,4.4e-05,6.1e-05,2.3e-05,4e-06,1.2e-05,1.4e-05,1.8e-05,7e-06,1.5e-05,8e-06,1.6e-05,8e-06,5e-06,1e-05,2e-06,2.9e-05,1.6e-05,8e-06,4e-06,7e-06,1e-06,4e-06,3e-06,3e-06,5e-06,5e-06,6e-06,1e-05,0.000122,2e-06,2.1e-05,6e-06,4e-06,6e-06,3e-06,8e-06,6e-06,2e-06,4e-06,3e-06
2e-06,2e-06,2e-06,4e-06,2e-06,2e-06,1e-06,3e-06,2e-06,1e-06,2e-06,2e-06,6e-06,5e-06,3e-06,3e-06,8e-06,1.9e-05,1.9e-05,1e-05,1.3e-05,8e-06,2.2e-05,1.3e-05,7e-06,1.8e-05,0.000136,0.000104,9.1e-05,0.000211,0.000226,0.000617,0.000152,0.00024,0.000248,0.000118,7.7e-05,0.000224,6.6e-05,0.000314,0.00027,0.000404,0.000105,9.6e-05,0.000289,0.000163,9.5e-05,0.000404,0.000133,0.000442,0.000257,0.000221,0.000255,0.000158,0.000283,0.000218,9.8e-05,0.000111,0.000276,0.000174,0.000119,0.000266,0.000172,0.000126,5.6e-05,3.6e-05,1.5e-05,2.3e-05,8e-06,2.8e-05,4.7e-05,3.6e-05,4.2e-05,5.7e-05,2.8e-05,4.5e-05,5.8e-05,1.9e-05,9.6e-05,2.1e-05,6.8e-05,3.1e-05,4.2e-05,4.7e-05,2.7e-05,4e-06,4e-06,3.2e-05,1.8e-05,1.5e-05,2e-06,1.2e-05,2e-06,3e-06,2e-06,6e-06,3.2e-05,2.8e-05,1.3e-05,3e-06,1.2e-05,4e-06,4e-06,6e-06,2e-06,6e-06,2e-06,5e-06,3e-06,0.00011,1.5e-05,2e-05,2e-05,8e-06,5e-06,4e-06,5e-06,4e-06,6e-06,1e-06,3e-06
5e-06,5e-06,5e-06,6e-06,3e-06,2e-06,5e-06,5e-06,4e-06,3e-06,5e-06,5e-06,6e-06,1.1e-05,4e-06,8e-06,1.2e-05,5e-06,2.3e-05,1.2e-05,1.2e-05,1.8e-05,1.9e-05,1e-05,1.6e-05,1.1e-05,0.000268,0.000191,0.000109,0.000226,0.00016,0.000268,4.3e-05,0.000106,0.000229,0.000251,0.00026,0.000217,9.9e-05,0.000321,0.000328,0.000215,0.000237,9.2e-05,0.00026,0.000188,7.7e-05,0.000331,0.000274,0.000298,8.5e-05,9.9e-05,0.000242,0.000186,0.000368,0.000126,5.5e-05,0.000162,0.000268,4.3e-05,0.000107,0.000224,0.000223,5.6e-05,7.5e-05,0.000103,6.7e-05,8.1e-05,8.8e-05,5.8e-05,3.1e-05,4.4e-05,4.3e-05,4e-05,4.7e-05,5.4e-05,4.3e-05,1.7e-05,8.9e-05,6.5e-05,2.5e-05,4.2e-05,7.2e-05,1.5e-05,1.3e-05,6e-06,1e-05,1.9e-05,2.1e-05,2.8e-05,1.4e-05,1.2e-05,3e-06,7e-06,1.1e-05,3e-06,3.1e-05,1.5e-05,1e-05,8e-06,9e-06,1.1e-05,3e-06,8e-06,5e-06,6e-06,7e-06,1e-05,8e-06,0.000114,4.7e-05,2.6e-05,1e-05,7e-06,5e-06,2e-06,4e-06,2e-06,1e-06,1e-06,2e-06
5e-06,4e-06,3e-06,7e-06,3e-06,3e-06,5e-06,2e-06,5e-06,2e-06,7e-06,3e-06,3e-06,6e-06,1.3e-05,1e-06,7e-06,1.5e-05,1.8e-05,1.2e-05,1.9e-05,2.9e-05,4e-05,2.7e-05,8e-06,1.9e-05,0.000333,0.000474,0.000171,0.000111,0.000226,0.000448,0.000164,0.000245,8e-05,0.00014,0.000109,0.000135,6.8e-05,0.000383,0.00011,0.00018,0.000135,0.000309,0.000195,0.000237,0.000161,0.000284,0.000265,0.00022,0.000261,0.000209,0.000158,0.00022,0.000158,0.000127,0.000169,6.8e-05,0.000205,0.000147,0.000147,0.000139,7.1e-05,0.000112,5.9e-05,3e-05,2.9e-05,6.4e-05,6e-05,4.4e-05,5.4e-05,4.4e-05,9.5e-05,7e-05,4.7e-05,9e-06,8.6e-05,4.1e-05,0.000104,5.4e-05,6.3e-05,3.8e-05,5.6e-05,2.9e-05,1.2e-05,1.2e-05,1e-05,1.7e-05,1.9e-05,1.4e-05,1.7e-05,1.8e-05,3e-06,7e-06,1.3e-05,5e-06,2.7e-05,1.2e-05,1e-06,8e-06,9e-06,6e-06,8e-06,3e-06,9e-06,5e-06,6e-06,5e-06,1.2e-05,0.000133,5.7e-05,2.8e-05,8e-06,5e-06,1e-06,1e-06,7e-06,5e-06,5e-06,5e-06,4e-06
3e-06,1e-06,3e-06,2e-06,1e-06,2e-06,6e-06,2e-06,6e-06,5e-06,3e-06,7e-06,5e-06,4e-06,3e-06,7e-06,4e-06,1.1e-05,1.4e-05,1e-06,1.6e-05,1.9e-05,1.1e-05,6e-06,1.1e-05,2.9e-05,0.000346,0.000367,0.000254,8.1e-05,9.4e-05,0.000154,0.000476,0.000137,0.000151,0.000132,7.2e-05,0.000215,6.3e-05,0.000319,0.000123,0.000295,7.3e-05,0.000249,0.000113,0.00017,0.00011,0.000245,0.000145,0.000105,0.000124,0.000174,0.000204,0.00018,4e-05,0.000154,0.000172,0.000217,0.00022,0.000161,0.000131,0.000202,6.4e-05,0.000125,6.8e-05,4.1e-05,2.8e-05,5.9e-05,6.5e-05,2.8e-05,2.3e-05,4.2e-05,5.8e-05,1.5e-05,8e-06,3e-05,5.9e-05,5.4e-05,8.2e-05,7.7e-05,4.3e-05,4.5e-05,4.7e-05,2.8e-05,1.8e-05,2.6e-05,2.4e-05,4.4e-05,2.2e-05,1.6e-05,2e-06,7e-06,8e-06,3e-06,6e-06,6e-06,2e-05,1.2e-05,8e-06,5e-06,4e-06,6e-06,4e-06,2e-06,5e-06,5e-06,2e-06,5e-06,1.3e-05,0.000248,7.7e-05,5e-05,2.3e-05,8e-06,6e-06,3e-06,5e-06,5e-06,4e-06,2e-06,3e-06
1e-06,3e-06,2e-06,4e-06,1e-06,1e-06,5e-06,3e-06,3e-06,2e-06,2e-06,5e-06,7e-06,7e-06,5e-06,9e-06,9e-06,1e-05,2e-05,1.1e-05,7e-06,2.1e-05,3.7e-05,3.9e-05,3.9e-05,2.7e-05,0.000281,0.000114,8e-05,0.000128,0.000148,0.000305,5.9e-05,0.000412,0.000405,0.000246,0.000141,0.000121,0.000142,0.000183,0.000161,0.000405,0.000422,0.00018,0.000148,0.000118,0.000214,0.000316,0.000169,0.000207,0.000189,0.00023,0.000173,8e-05,0.000273,0.000131,0.000184,6.7e-05,0.000179,0.000196,0.00021,0.000207,0.000203,0.000111,9.1e-05,9.9e-05,3.1e-05,2.9e-05,3.1e-05,1.5e-05,4.6e-05,1.6e-05,0.000104,7.2e-05,3.2e-05,4.2e-05,8.6e-05,4e-05,8.9e-05,9.5e-05,5.1e-05,5.1e-05,6.9e-05,8.7e-05,4.2e-05,1.4e-05,2.3e-05,3.2e-05,4.6e-05,2.8e-05,1.2e-05,1e-06,1e-06,6e-06,8e-06,4e-06,2.4e-05,2e-05,1e-05,4e-06,6e-06,3e-06,5e-06,4e-06,4e-06,6e-06,5e-06,8e-06,1.4e-05,0.000299,0.000153,7.5e-05,3.1e-05,9e-06,1e-05,9e-06,8e-06,2e-06,5e-06,5e-06,4e-06
0,2e-06,5e-06,2e-06,2e-06,2e-06,2e-06,2e-06,0,1e-06,2e-06,3e-06,3e-06,0,7e-06,5e-06,5e-06,9e-06,1.7e-05,6e-06,1.2e-05,1e-05,2.5e-05,2.9e-05,7e-06,3e-06,0.000214,7.9e-05,3.1e-05,8.6e-05,0.000119,0.000479,0.000353,0.000345,0.000189,0.00028,0.000128,0.000117,0.00011,0.000194,0.000202,0.000141,0.000175,0.000191,0.000201,0.000157,0.000235,4e-05,0.000178,4e-04,9.9e-05,0.000182,0.000158,0.000236,0.000143,0.000165,0.00015,0.000176,0.000182,0.000134,0.00029,0.000272,0.000234,3.4e-05,8.6e-05,8.6e-05,8.8e-05,8.7e-05,1.8e-05,5.8e-05,5.4e-05,2.2e-05,0.000112,3.9e-05,4e-06,5.1e-05,1.4e-05,3.3e-05,0.000116,5e-05,3.2e-05,6e-06,3.6e-05,3.8e-05,1.1e-05,2.5e-05,1.5e-05,2.7e-05,3.5e-05,2.6e-05,1.1e-05,1.1e-05,6e-06,7e-06,2e-06,3e-06,2.5e-05,1.8e-05,1e-05,7e-06,2e-06,2e-06,2e-06,1e-06,6e-06,3e-06,4e-06,7e-06,1e-05,0.000238,9.1e-05,3e-05,5e-06,3e-06,8e-06,4e-06,4e-06,2e-06,2e-06,3e-06,2e-06
0,2e-06,3e-06,1e-06,1e-06,1e-06,2e-06,2e-06,1e-06,1e-06,1e-06,1e-06,2e-06,3e-06,6e-06,3e-06,4e-06,9e-06,1e-05,1.2e-05,5e-06,8e-06,1.8e-05,6e-06,5e-06,1e-06,0.000161,2.2e-05,1.5e-05,0.000121,0.000126,0.000354,0.000233,0.000138,4e-05,0.000283,0.000204,0.000109,0.000129,0.000246,0.000239,0.00013,0.000107,7.9e-05,0.000187,5.4e-05,0.00018,0.000101,0.000294,0.000194,6.9e-05,0.000168,0.00022,0.000204,0.00013,9.7e-05,4.5e-05,0.000186,0.000162,5.7e-05,0.000152,0.000246,8.1e-05,8e-06,3.1e-05,5.2e-05,4e-06,5.4e-05,7e-05,1.9e-05,3.2e-05,2.5e-05,3.8e-05,4.9e-05,1.1e-05,2.9e-05,2e-05,1.9e-05,0.000108,7e-06,1.4e-05,1.2e-05,4.2e-05,2.9e-05,1.8e-05,1e-05,1.8e-05,3.2e-05,2.6e-05,1e-05,4e-06,7e-06,3e-06,5e-06,2e-06,2e-06,2.1e-05,9e-06,3e-06,3e-06,2e-06,2e-06,3e-06,1e-06,3e-06,2e-06,1e-06,6e-06,9e-06,0.000131,4e-06,1.2e-05,1.4e-05,8e-06,8e-06,5e-06,4e-06,4e-06,4e-06,1e-06,0
0,2e-06,2e-06,2e-06,1e-06,0,2e-06,1e-06,1e-06,0,0,1e-06,1e-06,2e-06,5e-06,1e-06,2e-06,1e-05,9e-06,6e-06,1e-06,6e-06,1e-05,8e-06,2e-06,4e-06,0.000129,2.5e-05,1.5e-05,0.00012,0.000129,0.00029,0.000103,0.000173,8.7e-05,0.000157,5e-06,0.000115,8.6e-05,0.000271,0.00012,0.000206,0.000149,0.000194,0.00012,8.9e-05,3.8e-05,0.000119,0.000198,0.000198,0.000139,0.000205,0.000175,8.2e-05,0.000235,3.1e-05,5.3e-05,0.000168,0.000213,6.4e-05,0.000119,0.000151,1e-04,2e-05,4.4e-05,2.3e-05,2.9e-05,5.5e-05,5e-05,1.8e-05,4.9e-05,2.3e-05,2.4e-05,2.5e-05,4e-06,1e-05,1.6e-05,1e-05,0.000105,2.3e-05,7e-06,1.5e-05,3e-05,1.4e-05,3e-06,8e-06,7e-06,1.4e-05,9e-06,2e-06,1e-06,5e-06,2e-06,5e-06,3e-06,1e-06,1.4e-05,2e-06,1e-06,4e-06,2e-06,1e-06,4e-06,1e-06,3e-06,1e-06,2e-06,6e-06,9e-06,0.000126,7e-06,6e-06,7e-06,3e-06,5e-06,4e-06,4e-06,1e-06,3e-06,1e-06,0
1e-06,2e-06,3e-06,1e-06,1e-06,0,2e-06,1e-06,1e-06,1e-06,1e-06,1e-06,1e-06,2e-06,4e-06,1e-06,1e-06,9e-06,1.2e-05,6e-06,2e-06,6e-06,1e-05,7e-06,3e-06,3e-06,0.000125,4e-05,4.1e-05,0.000142,0.00011,0.000358,0.000101,0.00015,0.000102,9.5e-05,0.000107,0.000152,0.000131,0.000174,0.000198,0.000161,8e-05,0.000167,0.000109,0.000108,6.7e-05,0.000136,0.000136,0.000133,0.000111,0.000132,0.000201,0.000143,0.000118,8e-05,9.6e-05,0.000194,0.000242,7e-05,1.9e-05,0.000121,0.000102,3.1e-05,4.4e-05,7e-06,1.3e-05,4.1e-05,4.8e-05,1.3e-05,4e-05,1.7e-05,3.1e-05,2.8e-05,5e-06,1.8e-05,1.2e-05,1e-05,0.000103,3.2e-05,6e-06,1.1e-05,2.7e-05,1.1e-05,1e-06,7e-06,4e-06,8e-06,4e-06,6e-06,3e-06,5e-06,3e-06,4e-06,4e-06,1e-06,7e-06,1e-06,3e-06,4e-06,3e-06,1e-06,4e-06,2e-06,3e-06,1e-06,1e-06,6e-06,9e-06,0.000137,1e-05,4e-06,5e-06,3e-06,2e-06,1e-06,2e-06,2e-06,3e-06,1e-06,1e-06
