0.033969,0.032467,0.032311,0.03744,0.037246,0.030116,0.026823,0.029324,0.027903,0.027453,0.029267,0.029306,0.026545,0.024056,0.024751,0.023857,0.026948,0.030857,0.029258,0.02647,0.025774,0.028066,0.0299,0.030184,0.033491,0.040813,0.038506,0.029754
0.041408,0.040427,0.039179,0.04393,0.044096,0.036568,0.033228,0.035848,0.033726,0.033145,0.035537,0.035791,0.032408,0.029155,0.029325,0.028221,0.031866,0.036289,0.034249,0.031042,0.030584,0.033654,0.03628,0.036935,0.040603,0.047832,0.044558,0.035719
0.054657,0.054387,0.050157,0.054141,0.055669,0.047758,0.044523,0.046974,0.0436,0.042668,0.046361,0.047309,0.042404,0.037379,0.036285,0.035203,0.039679,0.044771,0.042084,0.038731,0.039564,0.0442,0.047738,0.048662,0.052966,0.058521,0.053297,0.04602
0.067963,0.067475,0.058715,0.062308,0.066091,0.05843,0.055961,0.057972,0.053656,0.051776,0.056474,0.058701,0.052519,0.044722,0.041329,0.040798,0.046329,0.052073,0.048935,0.046708,0.050122,0.055819,0.058491,0.058558,0.064636,0.066623,0.058786,0.05598
0.081815,0.079887,0.067566,0.07279,0.078245,0.070297,0.068085,0.069725,0.066296,0.063075,0.066506,0.071232,0.065597,0.054148,0.048077,0.048305,0.055951,0.06283,0.05964,0.060678,0.066952,0.071205,0.070248,0.067548,0.075558,0.075241,0.066325,0.06829
0.09472,0.089844,0.074118,0.082118,0.088015,0.07959,0.078263,0.079582,0.077208,0.073178,0.075373,0.083716,0.079927,0.067005,0.06058,0.060198,0.06862,0.075919,0.07307,0.078976,0.087394,0.088811,0.084831,0.079682,0.087259,0.084678,0.078041,0.084093
0.104114,0.094987,0.075433,0.082479,0.087586,0.081475,0.082867,0.083562,0.080744,0.076507,0.08009,0.092053,0.088886,0.078169,0.074846,0.071957,0.076622,0.081789,0.081657,0.092674,0.101814,0.101177,0.096092,0.090888,0.09684,0.092065,0.088725,0.095947
0.104666,0.092129,0.071799,0.075003,0.078748,0.07726,0.080167,0.078707,0.076182,0.073476,0.078034,0.088794,0.084935,0.081413,0.083705,0.077526,0.07569,0.078177,0.081753,0.093604,0.101721,0.102158,0.098415,0.096315,0.100028,0.094767,0.094057,0.09619
0.099713,0.087203,0.072015,0.073915,0.07349,0.073523,0.075661,0.073938,0.077573,0.076992,0.076109,0.080666,0.076716,0.079427,0.083542,0.07588,0.071152,0.072896,0.07692,0.082786,0.087524,0.091193,0.093183,0.096618,0.096984,0.092336,0.092095,0.086907
0.106908,0.093338,0.080898,0.083719,0.080084,0.077544,0.078018,0.079689,0.094368,0.096825,0.087564,0.088065,0.084507,0.084271,0.084436,0.080639,0.079282,0.080537,0.082987,0.082198,0.082256,0.090068,0.100896,0.105563,0.098637,0.095498,0.094141,0.08324
0.132186,0.117303,0.101318,0.101914,0.100192,0.095677,0.091662,0.098397,0.121551,0.124491,0.112661,0.113788,0.107454,0.096447,0.093096,0.100231,0.103703,0.100662,0.099905,0.095297,0.095502,0.108531,0.122616,0.1246,0.114391,0.11517,0.11134,0.09799
0.159667,0.146945,0.126439,0.123564,0.126918,0.123348,0.111933,0.120285,0.148076,0.15033,0.146337,0.151195,0.138631,0.114786,0.105044,0.123764,0.131355,0.120049,0.116453,0.112836,0.11887,0.138691,0.147363,0.143496,0.133978,0.135697,0.130244,0.122591
0.174495,0.16957,0.146551,0.142941,0.152651,0.148669,0.128074,0.135467,0.164136,0.168745,0.178885,0.184936,0.167684,0.137162,0.118599,0.140259,0.148433,0.133056,0.130022,0.129464,0.142752,0.169463,0.167479,0.153586,0.147391,0.146314,0.13693,0.141518
0.180224,0.181202,0.154617,0.155757,0.171675,0.163441,0.132985,0.137061,0.164389,0.17252,0.194122,0.203089,0.184025,0.152389,0.129396,0.143635,0.150655,0.141232,0.141786,0.141553,0.154184,0.180951,0.1789,0.166443,0.159952,0.152049,0.14094,0.155438
0.172688,0.170691,0.146543,0.155821,0.173657,0.165797,0.133145,0.128921,0.151196,0.160438,0.183411,0.198615,0.180381,0.151593,0.133548,0.13924,0.143356,0.141379,0.145178,0.143058,0.145025,0.165021,0.179297,0.179846,0.173772,0.163642,0.15122,0.166283
0.151934,0.14475,0.134616,0.150785,0.167868,0.166164,0.13827,0.123617,0.136282,0.146084,0.167217,0.190004,0.174113,0.145024,0.134059,0.134917,0.139961,0.145841,0.147823,0.142189,0.130752,0.147801,0.187004,0.1957,0.188115,0.180473,0.166577,0.169945
0.16052,0.146228,0.153782,0.169751,0.185039,0.189983,0.166182,0.147941,0.157373,0.172237,0.193804,0.2066,0.181756,0.146425,0.134517,0.137698,0.152198,0.163786,0.160634,0.157398,0.139369,0.15765,0.213011,0.223639,0.212417,0.206001,0.189607,0.176092
0.194276,0.174469,0.203955,0.217407,0.21466,0.221063,0.20319,0.185878,0.199925,0.222175,0.243808,0.234933,0.193895,0.157209,0.148568,0.165106,0.188273,0.190599,0.178528,0.184917,0.173454,0.196109,0.243313,0.251478,0.25053,0.239163,0.211774,0.190535
0.217393,0.204712,0.249578,0.258521,0.235764,0.235214,0.223739,0.214025,0.232042,0.255498,0.271591,0.251852,0.211223,0.174823,0.165952,0.195674,0.223398,0.212097,0.19085,0.200931,0.201313,0.230444,0.2631,0.271567,0.282841,0.259276,0.221238,0.207931
0.203701,0.203465,0.252676,0.260855,0.236264,0.222871,0.219691,0.229716,0.242212,0.254238,0.256535,0.248353,0.236092,0.202075,0.190955,0.217975,0.227065,0.207364,0.189304,0.193755,0.203209,0.232402,0.246246,0.260036,0.287129,0.265686,0.22525,0.209915
0.189289,0.195567,0.226718,0.240689,0.240937,0.211711,0.212237,0.242133,0.236681,0.222323,0.207925,0.224471,0.251566,0.227083,0.225332,0.23768,0.204832,0.185477,0.192339,0.190752,0.195515,0.21065,0.200032,0.209783,0.243869,0.243417,0.217368,0.191824
0.200022,0.210056,0.227065,0.242266,0.248915,0.202881,0.205735,0.246143,0.230114,0.198655,0.172071,0.203781,0.254758,0.248135,0.269702,0.271086,0.204982,0.190919,0.216786,0.203652,0.202117,0.204536,0.173732,0.179041,0.217311,0.245241,0.233096,0.196307
0.2328,0.24428,0.244672,0.254863,0.254284,0.204136,0.214815,0.241399,0.21681,0.197552,0.177991,0.211775,0.276273,0.283363,0.30609,0.295817,0.207788,0.193982,0.235704,0.223112,0.222218,0.218615,0.18314,0.20174,0.253803,0.285258,0.26653,0.230771
0.257333,0.278012,0.252947,0.276179,0.296984,0.230992,0.227302,0.232548,0.205433,0.196543,0.187341,0.234761,0.307681,0.312673,0.316875,0.294392,0.200027,0.184882,0.233367,0.226523,0.235286,0.227594,0.194789,0.239716,0.296616,0.310402,0.281025,0.255359
0.269345,0.293558,0.25589,0.288384,0.332035,0.247585,0.225863,0.218777,0.184855,0.185066,0.185473,0.233582,0.298518,0.297183,0.289936,0.261338,0.177917,0.159748,0.19931,0.196347,0.212583,0.210851,0.198878,0.267962,0.303575,0.286766,0.253538,0.243356
0.256648,0.273048,0.239635,0.265158,0.31166,0.231496,0.216168,0.204591,0.159954,0.16274,0.169511,0.224929,0.271442,0.248696,0.230992,0.206593,0.146544,0.124496,0.147992,0.146686,0.156192,0.162003,0.180607,0.25743,0.267835,0.230161,0.192986,0.188096
0.22653,0.224363,0.196299,0.206007,0.239917,0.191221,0.183691,0.173418,0.132102,0.127528,0.145337,0.209396,0.230091,0.190835,0.173979,0.159375,0.11773,0.100035,0.113121,0.105917,0.106218,0.123608,0.155365,0.20677,0.207914,0.174566,0.140487,0.133935
0.199328,0.166249,0.138262,0.137873,0.169628,0.163382,0.146604,0.138114,0.115778,0.10744,0.131968,0.18809,0.192149,0.152103,0.133672,0.130739,0.112622,0.101822,0.10689,0.094156,0.093348,0.109756,0.127432,0.146734,0.156886,0.140856,0.1108,0.11389
0.183453,0.127943,0.093037,0.094429,0.134639,0.15488,0.128209,0.116845,0.119772,0.11687,0.129579,0.160314,0.148441,0.116539,0.104502,0.113326,0.115424,0.101544,0.098368,0.089705,0.090276,0.094514,0.103692,0.122721,0.132656,0.120141,0.102263,0.125432
0.163543,0.111427,0.070167,0.069207,0.109144,0.144375,0.121445,0.107416,0.129001,0.125505,0.117455,0.128193,0.113925,0.095003,0.090844,0.10412,0.106558,0.091169,0.08431,0.083614,0.089844,0.091615,0.103784,0.120988,0.115788,0.108756,0.11559,0.146281
0.131702,0.090918,0.058975,0.055943,0.092801,0.138149,0.125746,0.112824,0.132742,0.118878,0.093704,0.106557,0.112961,0.098288,0.087461,0.095598,0.099277,0.094093,0.086492,0.081011,0.085506,0.094816,0.120705,0.124691,0.102717,0.107836,0.128934,0.153813
0.118203,0.083689,0.05586,0.05128,0.083192,0.133858,0.139715,0.129265,0.126647,0.10068,0.074637,0.103303,0.141601,0.122863,0.09021,0.092018,0.108573,0.115977,0.103281,0.084188,0.087504,0.098455,0.12241,0.133278,0.111994,0.117372,0.13098,0.140275
0.113876,0.080778,0.053934,0.050009,0.077633,0.130577,0.156529,0.141165,0.112005,0.079641,0.064596,0.113866,0.172055,0.152342,0.10945,0.100648,0.114801,0.127085,0.110532,0.085299,0.08963,0.089732,0.100395,0.130837,0.131703,0.126308,0.118862,0.11539
0.096673,0.07315,0.054889,0.052235,0.071845,0.11484,0.149284,0.126682,0.083748,0.055787,0.049657,0.107209,0.173618,0.162182,0.122698,0.104102,0.102072,0.109979,0.096595,0.080651,0.087127,0.082747,0.083141,0.115943,0.138397,0.120534,0.092411,0.083792
0.069719,0.059877,0.055296,0.055173,0.06985,0.102579,0.119816,0.091239,0.054056,0.033454,0.03171,0.078865,0.13749,0.136955,0.111379,0.091533,0.073043,0.072402,0.068488,0.06904,0.079116,0.085809,0.088357,0.097868,0.117432,0.098881,0.061424,0.051804
0.055696,0.047119,0.047026,0.051501,0.065972,0.087074,0.079834,0.057017,0.041943,0.025372,0.021062,0.046318,0.08353,0.087994,0.077546,0.066313,0.046174,0.042339,0.050988,0.057862,0.061175,0.078726,0.087319,0.077454,0.079493,0.07402,0.046733,0.033857
0.047067,0.038118,0.036128,0.047367,0.064143,0.070581,0.050638,0.036257,0.04059,0.027696,0.021507,0.034471,0.046691,0.049016,0.045109,0.044411,0.040265,0.035974,0.044246,0.049367,0.048022,0.062554,0.073468,0.061011,0.046405,0.047227,0.04043,0.026365
0.035783,0.030967,0.028345,0.044345,0.056587,0.055272,0.038285,0.03095,0.039962,0.02906,0.024199,0.039041,0.041492,0.035715,0.031214,0.030462,0.036537,0.033205,0.034364,0.039677,0.040613,0.044927,0.049471,0.040306,0.027829,0.030835,0.032187,0.022317
0.031399,0.030761,0.021607,0.036995,0.044333,0.038726,0.025347,0.02421,0.033552,0.026362,0.029346,0.044417,0.045172,0.034553,0.02528,0.026252,0.036233,0.032716,0.026429,0.032994,0.038483,0.035622,0.02896,0.026152,0.0258,0.028314,0.028002,0.023328
0.037052,0.033779,0.018899,0.029935,0.039018,0.029692,0.017547,0.01734,0.023961,0.0245,0.036907,0.044742,0.042021,0.030353,0.021907,0.025348,0.037468,0.032952,0.02125,0.028889,0.039043,0.031145,0.022991,0.028004,0.028825,0.025623,0.029014,0.031556
