-3e-06,-2e-06,-3e-06,-0.00015,-0.004668,-0.015888,-0.029385,-0.145974,-0.186506,-0.171847,-0.160599,-0.157911,-0.15349,-0.131384,-0.098754,-0.044041,-0.008305,-0.002499,-0.00151,-0.00113,-0.001423,-0.000143,-0.002158,-9e-04,-2.7e-05,-5e-06,-2e-06,3e-06
-2e-06,3e-06,-3e-06,-0.000143,-0.002053,-0.007939,0.002623,0.068633,0.131723,0.135791,0.135165,0.107475,0.120629,0.143762,0.103401,0.042923,0.008607,0.0032,0.002107,9.5e-05,-0.000549,0.002122,0.003247,0.000483,8e-06,1.1e-05,5e-06,5e-06
-6e-06,-5e-06,-7e-06,-6e-05,0.00036,0.002286,0.002634,0.022436,0.023183,0.016901,-0.010241,-0.018112,-0.011757,-0.008287,-0.003477,0.000105,-0.000292,0.000191,0.000232,0.000706,0.000881,0.001587,0.001454,0.000419,5.2e-05,1.1e-05,8e-06,2e-05
-3e-06,-4e-06,-2e-06,-1.2e-05,0.002679,0.010277,-0.007103,-0.082649,-0.126708,-0.127029,-0.130475,-0.114621,-0.122908,-0.139829,-0.100744,-0.040903,-0.008044,-0.002826,-0.002065,-0.000486,0.000517,0.000214,-0.001026,3.3e-05,6e-05,7e-06,1.1e-05,2.8e-05
4e-06,7e-06,7e-06,3.1e-05,0.003019,0.009694,0.018092,0.069009,0.112832,0.114396,0.145345,0.14879,0.139646,0.127452,0.087023,0.03537,0.007218,0.002467,0.001738,0.00071,0.000556,0.001079,0.002191,0.000607,3.5e-05,1.5e-05,1.5e-05,2e-05
-3e-06,0,3e-06,3e-06,-0.002971,-0.010728,0.00417,0.038454,0.0469,0.042508,0.037088,0.044889,0.055112,0.052811,0.035695,0.014707,0.003057,0.00134,0.000701,-0.000251,-0.000685,9.7e-05,0.000417,-0.000136,-2.1e-05,2e-06,-2e-06,-5e-06
-5e-06,-3e-06,0,-3.2e-05,-0.003608,-0.012593,-0.025957,-0.107114,-0.165173,-0.164295,-0.182999,-0.174236,-0.163546,-0.159711,-0.111595,-0.045881,-0.00845,-0.002977,-0.002057,-0.000811,-0.000836,-0.000977,-0.002383,-0.000649,-5e-06,-5e-06,-1.2e-05,-1.5e-05
2e-06,6e-06,4e-06,0,0.001892,0.006415,-0.001279,0.016832,0.040713,0.047622,0.069833,0.054635,0.041852,0.059958,0.046074,0.018098,0.002976,0.001115,0.000822,0.000395,0.000514,0.000345,0.001117,6e-04,5.7e-05,9e-06,3e-06,5e-06
4e-06,3e-06,0,1.9e-05,0.002326,0.009065,0.016276,0.079125,0.119914,0.111179,0.100428,0.098599,0.09662,0.098887,0.073217,0.032077,0.00574,0.00212,0.001481,0.000797,0.000624,1.9e-05,0.001593,0.000723,4.2e-05,1.1e-05,1e-05,1.4e-05
3e-06,0,-1e-06,1.1e-05,-0.000304,-0.000931,-0.009399,-0.065182,-0.083791,-0.091267,-0.127992,-0.115368,-0.103514,-0.126017,-0.089533,-0.035145,-0.0051,-0.002209,-0.0017,-0.000387,5.3e-05,-0.001697,-0.002193,-0.000445,-1.4e-05,0,3e-06,2e-06
2e-06,0,2e-06,2e-05,-0.000656,-0.00339,-0.005401,-0.028001,-0.022252,-0.006324,0.032229,0.016453,0.00311,0.008052,-0.001994,-0.006362,-0.001776,-0.00048,-0.00013,-0.000609,-0.000904,-0.001236,-0.001614,-0.000425,-2.4e-05,-1e-06,-1e-06,-1e-05
-1e-06,-3e-06,0,1.6e-05,-0.001223,-0.004405,0.013982,0.078846,0.074956,0.079328,0.105374,0.094823,0.097484,0.114158,0.079812,0.031799,0.004418,0.002282,0.001685,0.000424,-0.00019,-0.000261,0.000739,0.000286,1.7e-05,5e-06,-3e-06,-1.2e-05
-2e-06,-3e-06,-1e-06,-9e-06,-0.000173,-0.000217,-0.004572,-0.017472,-0.052387,-0.068169,-0.120424,-0.107568,-0.083496,-0.095948,-0.06146,-0.019733,-0.002275,-0.001174,-0.001004,-1.7e-05,-6.2e-05,-0.001042,-0.000539,0.000165,3.1e-05,5e-06,-6e-06,-1.1e-05
2e-06,1e-06,-2e-06,-2e-05,0.001855,0.006617,-0.012715,-0.060795,-0.027565,-0.018994,-0.018879,-0.017449,-0.041672,-0.038212,-0.027831,-0.015432,-0.002985,-0.001368,-0.000814,-0.000175,0.000343,-0.001231,-0.001242,-7e-05,9e-06,1e-06,-2e-06,-4e-06
2e-06,0,-5e-06,-1.4e-05,0.000314,0.001426,0.007565,0.032051,0.073214,0.086224,0.120414,0.124515,0.108407,0.118852,0.08121,0.031208,0.004367,0.001802,0.001459,4.8e-05,-0.000313,-0.000536,-9.8e-05,-6.5e-05,-2.3e-05,-1e-06,-1e-06,-8e-06
-1e-06,-2e-06,-5e-06,0,-0.001501,-0.005403,0.002943,0.008047,-0.024606,-0.033254,-0.064127,-0.05594,-0.023371,-0.049582,-0.03293,-0.005887,0.001118,-0.000187,-0.00044,-8.5e-05,-0.000398,-0.000656,-0.00059,-0.000208,-2.2e-05,-2e-06,-8e-06,-2.1e-05
-4e-06,-3e-06,-4e-06,1.8e-05,-0.000226,-0.001478,-0.007655,-0.035778,-0.059128,-0.051749,-0.051484,-0.070168,-0.077099,-0.074278,-0.054518,-0.024885,-0.004285,-0.001728,-0.001189,-0.000439,-0.000368,-0.000714,-0.000832,-7.9e-05,1.1e-05,-4e-06,-1.4e-05,-2.6e-05
-4e-06,-2e-06,-4e-06,1.6e-05,0.00068,0.002317,0.007097,0.032593,0.037223,0.049082,0.095394,0.084905,0.065905,0.096836,0.064608,0.021114,0.001301,0.001054,0.001105,0.000336,0.000334,-0.000136,0.000502,0.000283,2.6e-05,0,-1.1e-05,-1.9e-05
-2e-06,0,-4e-06,-2.6e-05,3.3e-05,0.000499,0.005175,0.019474,0.01381,-0.006545,-0.037367,-0.012698,0.016151,-0.003276,0.003955,0.009114,0.002788,0.000484,0.00012,0.000152,4.1e-05,-0.000265,8e-05,-2e-06,-8e-06,-1e-06,-7e-06,-1e-05
