3e-06,3e-06,1e-06,4e-06,1.3e-05,3e-06,2.3e-05,2e-06,1e-06,5e-06,1e-06,3e-06,9e-06,4e-06,1.9e-05,6e-06,5e-06,5e-06,0,9e-06,1e-06,5e-06,1e-06,6e-06,0,1e-05,6e-06,1e-06,1.4e-05,1e-06,2e-06,6e-06,9e-06,4e-06,7e-06,1e-06,5e-06,1.4e-05,4e-06,2e-06,4e-06,1e-06,1e-05,3e-06,0,2e-06,8e-06,2e-06,0,9e-06,3e-06,4e-06,3e-06,3e-06,7e-06,8e-06,1.6e-05,1.5e-05,1e-06,1.5e-05,1e-05,2.2e-05,5e-06,1.2e-05,2e-06,1e-05,4e-06,1.5e-05,1.9e-05,5e-06,5e-06,3e-06,2e-06,7e-06,6e-06,1.5e-05,1e-06,0,8e-06,1.4e-05,1.9e-05,6e-06,6e-06,3.8e-05,1.4e-05,9e-06,2.2e-05,2.4e-05,1e-06,2.2e-05,8e-06,8e-06,1.8e-05,1.5e-05,6e-06,1.8e-05,4e-06,9e-06,2.4e-05,7e-06,1e-05,1e-06,6e-06,5e-06,3e-06,3e-06,1.4e-05,9e-06,2e-06,3e-06,8e-06,8e-06,1.4e-05,5e-06,2e-06,2e-06,3e-06,1.9e-05,7e-06,9e-06,5e-06
2.1e-05,1.4e-05,1.2e-05,1.1e-05,3.8e-05,3.8e-05,3e-05,2.6e-05,2.9e-05,1.3e-05,1.4e-05,2.7e-05,2.1e-05,2.4e-05,3.5e-05,2e-06,1.4e-05,1.7e-05,2.7e-05,3.4e-05,1.6e-05,1.5e-05,1.4e-05,3e-06,2.4e-05,1.9e-05,1.4e-05,6e-06,4e-06,2.5e-05,2.3e-05,2.3e-05,1.7e-05,2.4e-05,1.4e-05,2.9e-05,1.2e-05,1.9e-05,1.1e-05,2.6e-05,2.1e-05,1.3e-05,2.1e-05,1.1e-05,5e-06,1.5e-05,2.5e-05,3.9e-05,2.2e-05,1.3e-05,1.8e-05,1.3e-05,2e-05,2.4e-05,1.5e-05,2.9e-05,4e-05,5.5e-05,4e-06,1.7e-05,1.8e-05,4.2e-05,2.7e-05,3e-06,3e-05,3e-05,3.4e-05,6.5e-05,5.2e-05,1.5e-05,3.3e-05,3.4e-05,7e-06,5e-06,1.5e-05,2.5e-05,4.1e-05,3.8e-05,6e-06,3.7e-05,6.8e-05,4.3e-05,3.7e-05,0.000106,2e-05,3.6e-05,7.8e-05,8.9e-05,6.2e-05,3.9e-05,8e-06,1.3e-05,7.7e-05,3.8e-05,2.9e-05,3.8e-05,2.1e-05,9e-06,4.4e-05,2.7e-05,1e-05,3.1e-05,2.3e-05,9e-06,2.6e-05,2.9e-05,4.5e-05,4.3e-05,1.2e-05,4.3e-05,4.4e-05,3.9e-05,5.2e-05,2.4e-05,1.3e-05,6e-06,1.7e-05,3.9e-05,3e-05,3.6e-05,3e-05
2.3e-05,8e-06,2.7e-05,1.4e-05,4.3e-05,2e-05,4.3e-05,2.6e-05,2.8e-05,2.4e-05,1e-05,3.6e-05,9e-06,1.8e-05,5.2e-05,2.9e-05,1.2e-05,1.2e-05,2.3e-05,4.1e-05,3.7e-05,3e-05,2.6e-05,4.3e-05,3.2e-05,2.6e-05,2.8e-05,2e-05,3.7e-05,3.1e-05,3.6e-05,1.9e-05,1.7e-05,8e-06,2.5e-05,2.5e-05,3.8e-05,1.9e-05,2.8e-05,2.4e-05,3.4e-05,1.6e-05,2.1e-05,1.1e-05,7e-06,3.2e-05,1.8e-05,5.7e-05,1e-05,1.6e-05,1.9e-05,2e-05,4.7e-05,1.2e-05,1.8e-05,3e-05,5e-05,9.8e-05,6.5e-05,2.9e-05,8.9e-05,9.6e-05,9e-05,5.2e-05,7.7e-05,7.6e-05,4e-05,0.00011,8.9e-05,7.5e-05,4.9e-05,4.1e-05,5.4e-05,2.8e-05,2.6e-05,3.6e-05,6.8e-05,2.8e-05,4.8e-05,3e-05,3.3e-05,4.3e-05,3.5e-05,0.000101,0.000109,6.4e-05,4.5e-05,2.7e-05,4.9e-05,9.5e-05,9.2e-05,3.7e-05,0.000121,7.6e-05,2.9e-05,3.8e-05,5.7e-05,5.5e-05,5.6e-05,8e-05,4.9e-05,6.1e-05,7.2e-05,3.1e-05,4.3e-05,4.5e-05,5.2e-05,1.2e-05,3.7e-05,3.7e-05,3.8e-05,2.3e-05,2.2e-05,1.9e-05,1.5e-05,4.5e-05,2.8e-05,3.3e-05,5e-05,2.8e-05,1.4e-05
5.5e-05,2.8e-05,3.9e-05,5.1e-05,1.3e-05,3e-05,7.3e-05,7.5e-05,5.7e-05,1.4e-05,3.5e-05,5.5e-05,5.2e-05,5.5e-05,7.8e-05,9.2e-05,5.3e-05,3.8e-05,9e-06,6.4e-05,7.9e-05,9.6e-05,6.5e-05,5.7e-05,6.5e-05,5.5e-05,3.3e-05,3.1e-05,8.6e-05,5.7e-05,8.9e-05,7.3e-05,2e-05,1.7e-05,4.7e-05,4.5e-05,2e-05,4.5e-05,6.5e-05,6.1e-05,9.6e-05,5.3e-05,2.4e-05,9e-06,6e-06,4.7e-05,5.1e-05,0.000115,7.6e-05,1.2e-05,4e-05,3.4e-05,5.8e-05,4.1e-05,1.3e-05,2.6e-05,1e-05,4e-05,4.6e-05,2e-05,0.000157,3.3e-05,6.8e-05,4.9e-05,7e-05,9.4e-05,0.000104,0.000135,4.2e-05,2.6e-05,2.9e-05,1.4e-05,4.5e-05,2.5e-05,4.8e-05,5.7e-05,0.000123,9.9e-05,5.8e-05,2.2e-05,5e-05,9.5e-05,9.6e-05,0.000183,0.000252,0.000139,4e-05,3.3e-05,6.8e-05,3.7e-05,9e-05,5.5e-05,9.4e-05,3.7e-05,7.2e-05,5.9e-05,5.4e-05,5.8e-05,8.1e-05,0.000101,6.4e-05,5.2e-05,5.7e-05,5.6e-05,4.6e-05,1.9e-05,6e-05,0.000103,1.5e-05,4.9e-05,3.1e-05,1.5e-05,8e-06,1.8e-05,2.4e-05,7.2e-05,9.7e-05,7.9e-05,8.3e-05,4.2e-05,3.7e-05
6e-06,7e-06,4.1e-05,4.7e-05,4.1e-05,2e-05,6.3e-05,7.6e-05,5.7e-05,2.3e-05,3.9e-05,1.8e-05,1.4e-05,1.9e-05,2.8e-05,6.6e-05,3.5e-05,1.8e-05,1.1e-05,6.4e-05,1.2e-05,4.1e-05,4.7e-05,4.3e-05,1.5e-05,4.8e-05,5.1e-05,1.5e-05,7.3e-05,5.3e-05,8.1e-05,6.3e-05,4.4e-05,3.6e-05,2.5e-05,2.2e-05,4.2e-05,3.5e-05,2.8e-05,2.8e-05,4e-05,5e-05,3.7e-05,3.4e-05,1.4e-05,5.6e-05,4.5e-05,7e-05,8.1e-05,7.7e-05,4.9e-05,1.5e-05,6.5e-05,3.6e-05,3.2e-05,3.8e-05,1.4e-05,6e-05,4.5e-05,3.3e-05,0.000113,0.000151,8.2e-05,6.5e-05,9.2e-05,2.9e-05,0.000116,9.6e-05,6.8e-05,4.6e-05,2.4e-05,2.2e-05,6.3e-05,6.3e-05,1.8e-05,2.9e-05,8.3e-05,9.6e-05,8.5e-05,4.7e-05,3.9e-05,8.9e-05,4.2e-05,0.000136,0.00029,0.000167,7e-05,6.2e-05,6.7e-05,6.7e-05,2.7e-05,5.1e-05,1.6e-05,4.2e-05,7.7e-05,3.3e-05,4.4e-05,7.6e-05,6e-06,3.6e-05,1.7e-05,3.2e-05,1e-05,5.3e-05,3e-05,8e-06,6e-05,3.8e-05,5.4e-05,4.7e-05,3.8e-05,3.5e-05,2.8e-05,3.5e-05,2.2e-05,6.2e-05,2.3e-05,1.4e-05,3.7e-05,1.6e-05,2.8e-05
3e-05,1.7e-05,2.7e-05,2.2e-05,8e-06,3.8e-05,3.6e-05,3e-05,2.2e-05,1.4e-05,1.2e-05,1.7e-05,1.9e-05,6e-06,2.3e-05,2.6e-05,1.1e-05,1.1e-05,1.9e-05,2.7e-05,3.6e-05,2.2e-05,3.9e-05,2.8e-05,4e-06,3e-05,3.7e-05,3.1e-05,3.6e-05,5.6e-05,3.5e-05,3.6e-05,1.2e-05,8e-06,1.3e-05,1.6e-05,3.5e-05,9e-06,3.4e-05,1e-05,3.6e-05,2.2e-05,2.7e-05,1.1e-05,1.5e-05,4.1e-05,1.6e-05,2e-05,2.9e-05,3.2e-05,6e-06,2e-05,5.1e-05,4.6e-05,5e-05,1.4e-05,6.1e-05,5.2e-05,0.000103,2.4e-05,7e-05,8.3e-05,5.9e-05,2.5e-05,3.9e-05,2.4e-05,0.00012,5e-05,8e-06,2.9e-05,2.6e-05,1.1e-05,3.7e-05,3e-05,5.2e-05,2.1e-05,5.8e-05,8e-06,4e-05,5e-05,5.7e-05,4.8e-05,3.3e-05,0.000174,0.000364,0.000179,6.9e-05,4.5e-05,3.3e-05,2.5e-05,1.3e-05,2.9e-05,1e-05,4.5e-05,3.8e-05,3.3e-05,2.6e-05,2.5e-05,4e-05,3e-06,2e-06,3.6e-05,2.1e-05,4.8e-05,4.4e-05,1.5e-05,2.5e-05,0.000105,4.8e-05,1.6e-05,1e-05,1.4e-05,4.4e-05,4.3e-05,6.8e-05,2.1e-05,6.3e-05,5.6e-05,4.7e-05,4e-05,2.8e-05
3.5e-05,1.5e-05,1.9e-05,3.6e-05,1.6e-05,1.8e-05,3.2e-05,6e-06,3.3e-05,1.5e-05,1.5e-05,2e-05,2.5e-05,1.9e-05,9e-06,1.8e-05,1.5e-05,1.2e-05,3e-05,2e-05,1.9e-05,6e-06,4e-05,1.9e-05,2.9e-05,3.6e-05,2.5e-05,1.7e-05,2.4e-05,4.2e-05,3.4e-05,4.2e-05,5.1e-05,3.2e-05,4e-05,1.6e-05,2.2e-05,3.6e-05,4.9e-05,6e-05,6e-06,1.6e-05,2.2e-05,2.4e-05,3.3e-05,1.6e-05,1.5e-05,4e-05,2.9e-05,1.8e-05,1.5e-05,2.1e-05,4.3e-05,4e-05,1.5e-05,1e-06,6.9e-05,6.8e-05,3.3e-05,8.1e-05,4.6e-05,1.7e-05,7.1e-05,5.5e-05,5.1e-05,4.2e-05,3.1e-05,5.1e-05,2e-05,2.5e-05,5.3e-05,3.6e-05,6e-06,2.5e-05,1.6e-05,5.5e-05,1.2e-05,1.4e-05,1.1e-05,4.5e-05,1.5e-05,3.6e-05,2e-05,0.000202,0.000466,0.000222,7.2e-05,7.9e-05,4.6e-05,3.3e-05,1.9e-05,1e-05,1.1e-05,4.6e-05,2.9e-05,2.8e-05,3.8e-05,2.6e-05,2.1e-05,2.2e-05,7e-06,1.9e-05,1.9e-05,1.5e-05,3.3e-05,3.1e-05,2.7e-05,0.000132,8.5e-05,2.9e-05,3e-05,7e-06,7.8e-05,8e-06,6.3e-05,4.8e-05,7e-05,1.2e-05,3.5e-05,1.9e-05,1.9e-05
2.3e-05,2.4e-05,2.4e-05,5.1e-05,4.4e-05,1e-05,2.3e-05,1.6e-05,1.9e-05,3.1e-05,2e-05,8e-06,1.6e-05,3.1e-05,2.1e-05,3.5e-05,1.1e-05,2e-05,2.5e-05,2.3e-05,2.4e-05,4.9e-05,6.8e-05,4.7e-05,3e-05,1.3e-05,5.4e-05,3.1e-05,3.6e-05,3.2e-05,3.8e-05,3.6e-05,2.6e-05,1.1e-05,3e-05,2.7e-05,3e-05,4.9e-05,1.4e-05,5.3e-05,3.2e-05,3e-06,1.7e-05,2.6e-05,3.2e-05,1.1e-05,8e-06,5.2e-05,5.6e-05,4.1e-05,1e-05,2.4e-05,3.8e-05,5e-06,2.1e-05,2.9e-05,4.9e-05,7.7e-05,7.6e-05,8.5e-05,8.9e-05,1.3e-05,5.4e-05,4.1e-05,4e-05,6.7e-05,4.8e-05,0.000103,2.2e-05,8.5e-05,4.9e-05,7e-06,2.5e-05,2e-05,5.4e-05,0.000102,3.5e-05,2.2e-05,2.5e-05,5.2e-05,4.2e-05,2.6e-05,2.6e-05,0.000356,0.000545,0.00046,0.000181,8.8e-05,7e-06,2.2e-05,1.2e-05,2.1e-05,2.5e-05,4e-05,5e-06,1e-06,2.7e-05,2e-05,1.3e-05,3.9e-05,5.6e-05,1.8e-05,2.6e-05,2.8e-05,1e-05,2.4e-05,3.4e-05,0.000119,0.00021,0.000137,3.5e-05,1.3e-05,0.000113,1.3e-05,4.1e-05,5.6e-05,5.8e-05,5e-05,7e-06,1.6e-05,9e-06
2.2e-05,2.8e-05,6e-06,3.1e-05,9e-06,2.7e-05,5.4e-05,3e-05,2.9e-05,2.5e-05,1.6e-05,4e-06,8e-06,3.9e-05,8e-06,5.2e-05,4.8e-05,3.5e-05,3.1e-05,5.2e-05,3.7e-05,7.7e-05,4.8e-05,4.7e-05,1.3e-05,1.9e-05,5.8e-05,4.5e-05,5.6e-05,3.5e-05,2.4e-05,2.4e-05,1.9e-05,1.9e-05,1.8e-05,1.4e-05,5e-05,5e-05,3.1e-05,3e-05,8.4e-05,1.8e-05,3.7e-05,6.4e-05,3.2e-05,4.9e-05,2.5e-05,4.5e-05,9.6e-05,6.2e-05,1.8e-05,2e-05,1.4e-05,2.5e-05,1.7e-05,3.6e-05,2.7e-05,8.5e-05,0.00016,9.1e-05,1.9e-05,8.7e-05,7e-05,2.8e-05,3.2e-05,7.2e-05,8.8e-05,0.000167,0.000181,6.5e-05,4.2e-05,5.9e-05,2.8e-05,7.1e-05,3.9e-05,6.7e-05,0.000103,5.2e-05,3.8e-05,6.9e-05,2.9e-05,5.4e-05,4.5e-05,0.000694,0.000864,0.000323,0.000159,8.8e-05,5.4e-05,9e-06,1e-05,3.4e-05,8e-06,1.6e-05,2.3e-05,1e-05,2.5e-05,3.5e-05,3.9e-05,4e-05,3.7e-05,5.2e-05,4.2e-05,4.7e-05,4e-05,3e-06,2.8e-05,0.000142,0.000163,7.3e-05,3.4e-05,2.2e-05,9.9e-05,0.000112,6.9e-05,6.5e-05,6.1e-05,3.5e-05,3.8e-05,1e-05,8e-06
2.7e-05,8e-06,2.3e-05,2e-05,3.1e-05,1e-05,5e-05,4.8e-05,2.5e-05,1.4e-05,9e-06,1.5e-05,1e-05,4.6e-05,4.2e-05,3.1e-05,4.1e-05,6e-06,1.8e-05,4.1e-05,4e-05,9.1e-05,5.2e-05,3.3e-05,2.9e-05,3e-05,2.4e-05,2e-06,1.3e-05,2.1e-05,5e-06,3.5e-05,5.5e-05,4.4e-05,4.6e-05,3.7e-05,4e-05,9.5e-05,5.6e-05,2.7e-05,0.000109,7e-05,7e-05,0.00011,0.00011,2.5e-05,3.4e-05,1.7e-05,7.9e-05,0.000122,8.8e-05,2.6e-05,2.3e-05,4.1e-05,1.6e-05,5e-05,6.8e-05,0.000114,4.7e-05,0.000158,0.000153,5e-05,7.4e-05,6.2e-05,6e-05,0.000142,0.000202,2e-05,0.000171,0.000234,0.000112,7.6e-05,1.8e-05,7.2e-05,0.000117,4.9e-05,0.000101,5.8e-05,5.3e-05,7e-05,5.6e-05,4.3e-05,9e-06,0.000956,0.001438,0.000902,0.000391,7.6e-05,1.2e-05,9e-06,1.7e-05,1.1e-05,3.2e-05,1.7e-05,1.2e-05,8e-06,2.4e-05,2e-05,1.1e-05,1.5e-05,1.3e-05,2.1e-05,1.8e-05,2.7e-05,8e-06,1.2e-05,2.2e-05,0.00011,1.9e-05,1.3e-05,8e-06,1.3e-05,0.000103,0.000204,4.3e-05,1.4e-05,1.1e-05,2.2e-05,6.6e-05,4.5e-05,2.8e-05
1.9e-05,1.7e-05,1.4e-05,9e-06,1.8e-05,1.5e-05,3.9e-05,1.5e-05,1.5e-05,1.6e-05,2e-06,2.2e-05,3.2e-05,4.2e-05,3e-05,4.8e-05,4e-05,3.7e-05,5e-06,2.7e-05,3.2e-05,6.9e-05,5.5e-05,1.8e-05,1.8e-05,2.2e-05,2.4e-05,1.4e-05,9e-06,2.5e-05,2e-05,2.9e-05,1.8e-05,2.3e-05,4.8e-05,3.6e-05,4.1e-05,5.2e-05,7.7e-05,4.9e-05,0.000112,0.000102,7.7e-05,5.4e-05,3e-05,8.9e-05,5.4e-05,3.8e-05,2.9e-05,5.6e-05,4.3e-05,5.3e-05,3.7e-05,2.2e-05,3.4e-05,5.6e-05,4.2e-05,1.8e-05,4.2e-05,0.000159,0.00017,0.000103,0.000137,5e-05,6.5e-05,0.000204,0.000183,0.000172,0.00014,1e-04,8.5e-05,4.4e-05,3.7e-05,6e-05,6.1e-05,9.2e-05,5.4e-05,2.6e-05,5e-06,2.9e-05,2.4e-05,2.3e-05,2.2e-05,0.001,0.001024,0.000409,0.000134,5.2e-05,3e-05,4e-06,2.5e-05,2.2e-05,2.3e-05,1.1e-05,6e-06,3e-06,1.8e-05,2.1e-05,2.3e-05,2.5e-05,1.2e-05,1.6e-05,1.5e-05,1.1e-05,1.6e-05,1.4e-05,5e-06,6.2e-05,5.2e-05,2.7e-05,1.3e-05,2.9e-05,0.000135,0.000184,0.000177,9.2e-05,5.4e-05,4.7e-05,8.3e-05,7.2e-05,4e-05
9e-06,5e-06,1.5e-05,3e-06,1.5e-05,7e-06,1.6e-05,1.2e-05,1.4e-05,4e-06,9e-06,1.4e-05,1.3e-05,2.5e-05,1.7e-05,3.3e-05,2.4e-05,1.1e-05,1.5e-05,2.5e-05,5.5e-05,3.7e-05,1.6e-05,4e-06,7e-06,5e-06,4e-06,7e-06,4e-06,1.4e-05,9e-06,2e-06,1.6e-05,5e-06,3e-05,1.2e-05,3.1e-05,4.5e-05,3.8e-05,2.6e-05,4e-05,4.6e-05,5.5e-05,5.1e-05,3.8e-05,5.4e-05,3.1e-05,5.8e-05,3.1e-05,2.8e-05,7e-06,1.7e-05,1.9e-05,4.2e-05,2e-05,3.9e-05,2.1e-05,2e-05,4.7e-05,8.2e-05,7.1e-05,4.8e-05,0.000107,0.000125,6.8e-05,7.9e-05,1.3e-05,7.7e-05,3.2e-05,4.6e-05,2.5e-05,2.6e-05,5.2e-05,2.3e-05,3e-05,3.5e-05,1.9e-05,1.2e-05,1.2e-05,5e-06,6e-06,1.9e-05,1.3e-05,0.000788,0.000262,0.000255,7.3e-05,3.3e-05,1.2e-05,1e-05,1.3e-05,4e-06,4e-06,1.1e-05,7e-06,8e-06,6e-06,7e-06,7e-06,1.2e-05,1.1e-05,1.1e-05,1.2e-05,1.1e-05,1.5e-05,1e-05,1.3e-05,3.3e-05,2.4e-05,1.2e-05,1.4e-05,1.1e-05,9.6e-05,5e-05,3.5e-05,1.6e-05,1.1e-05,2.2e-05,4.2e-05,2.3e-05,1.7e-05
3e-06,3e-06,9e-06,7e-06,9e-06,5e-06,2e-06,7e-06,7e-06,3e-06,2e-06,7e-06,1.3e-05,1.4e-05,1e-05,2.1e-05,7e-06,1.1e-05,1.5e-05,2e-06,3e-05,5.5e-05,2.3e-05,8e-06,1.1e-05,2e-06,9e-06,3e-06,5e-06,1.2e-05,6e-06,3e-06,4e-06,8e-06,1.1e-05,9e-06,5e-06,3.3e-05,1.5e-05,1.9e-05,1.9e-05,2.5e-05,1.4e-05,4e-06,1.9e-05,2.5e-05,2.5e-05,1.3e-05,5e-06,1.6e-05,8e-06,1.3e-05,3e-06,2e-05,1.6e-05,5e-06,2e-06,1.5e-05,4e-05,6.6e-05,2.6e-05,3e-06,5.6e-05,3.9e-05,4e-05,2.7e-05,1.2e-05,4.3e-05,1.9e-05,2e-05,1.6e-05,4e-06,2.3e-05,1e-05,1.8e-05,1.1e-05,4e-06,5e-06,1.2e-05,7e-06,3e-06,2.1e-05,6e-06,0.000459,6.3e-05,2.9e-05,2.3e-05,1.5e-05,1.9e-05,8e-06,3e-06,7e-06,8e-06,4e-06,4e-06,9e-06,8e-06,1e-05,3e-06,9e-06,1.2e-05,1.2e-05,8e-06,7e-06,1e-05,7e-06,7e-06,2.2e-05,1e-05,1e-05,1.7e-05,1.3e-05,5.4e-05,9e-06,1.4e-05,2.4e-05,3e-06,1.5e-05,2.2e-05,1e-05,1e-06
1e-06,7e-06,1.3e-05,1e-05,1.3e-05,8e-06,8e-06,1e-05,6e-06,2e-06,7e-06,5e-06,1.2e-05,7e-06,1e-05,1.9e-05,1e-05,7e-06,2.3e-05,2.3e-05,2.6e-05,4.5e-05,2.5e-05,3e-06,3e-06,2e-06,5e-06,4e-06,1e-06,1.1e-05,2e-06,5e-06,4e-06,1.6e-05,9e-06,8e-06,8e-06,2.8e-05,1.7e-05,1.3e-05,4e-06,3.6e-05,2.2e-05,5e-06,1.2e-05,3.2e-05,9e-06,1e-05,2.1e-05,8e-06,6e-06,5e-06,1e-05,2e-06,1.9e-05,9e-06,1.2e-05,3e-06,3.4e-05,5e-05,3e-05,1.6e-05,4.7e-05,4.3e-05,3.9e-05,1.3e-05,2.7e-05,2.5e-05,9e-06,1.9e-05,2e-05,1.1e-05,3e-06,3e-06,1.1e-05,1.4e-05,3e-06,1e-05,3e-06,1.1e-05,2e-06,1e-05,8e-06,0.000246,0.000118,8.8e-05,3e-05,7e-06,1.7e-05,1.7e-05,3e-06,3e-06,1.1e-05,5e-06,4e-06,1.2e-05,1.1e-05,1.1e-05,7e-06,4e-06,2e-06,6e-06,6e-06,6e-06,8e-06,9e-06,9e-06,1.2e-05,1.5e-05,8e-06,7e-06,4e-06,4.6e-05,1.8e-05,1.4e-05,2.2e-05,1.1e-05,4e-06,1.8e-05,7e-06,7e-06
6e-06,1.1e-05,1.3e-05,1.2e-05,4e-06,6e-06,1.1e-05,1.5e-05,1.5e-05,1.2e-05,9e-06,9e-06,4e-06,1.1e-05,8e-06,9e-06,5e-06,6e-06,8e-06,2e-05,3.1e-05,4.1e-05,2.3e-05,4e-06,7e-06,4e-06,5e-06,4e-06,4e-06,1.2e-05,1e-06,9e-06,4e-06,2.1e-05,1.5e-05,1.5e-05,1.9e-05,2.8e-05,2.9e-05,1.2e-05,1.1e-05,4.2e-05,4e-06,8e-06,1.2e-05,3e-05,1.3e-05,1.5e-05,1.5e-05,1.8e-05,1.1e-05,4e-06,1.3e-05,1.5e-05,1.3e-05,6e-06,8e-06,3e-06,2.6e-05,1.4e-05,1.8e-05,1.7e-05,2.8e-05,5e-05,3.9e-05,3.5e-05,1.9e-05,1.4e-05,1e-05,7e-06,1.7e-05,2e-05,2.1e-05,8e-06,3e-06,2.4e-05,1.5e-05,1.4e-05,2.3e-05,1.1e-05,6e-06,2e-06,7e-06,0.000177,0.000113,4.1e-05,1.9e-05,1.6e-05,8e-06,1.2e-05,1.4e-05,3e-06,6e-06,8e-06,1e-05,1.5e-05,8e-06,1.2e-05,9e-06,1.4e-05,3e-06,5e-06,9e-06,4e-06,4e-06,2e-06,7e-06,1.4e-05,2.1e-05,1.2e-05,1.1e-05,1e-05,8.1e-05,7.1e-05,5.8e-05,1.8e-05,1.3e-05,1.2e-05,2.9e-05,2.2e-05,2.3e-05
5e-06,7e-06,1.4e-05,5e-06,5e-06,8e-06,2e-06,1.4e-05,4e-06,5e-06,1.4e-05,2e-06,5e-06,2e-06,8e-06,3e-06,4e-06,9e-06,1.9e-05,1.9e-05,1.1e-05,2.3e-05,3e-06,4e-06,5e-06,5e-06,6e-06,1e-05,4e-06,9e-06,1.1e-05,2e-05,1.8e-05,1.7e-05,2.6e-05,5e-06,2.3e-05,4.5e-05,6.8e-05,4e-05,2.5e-05,2.6e-05,2e-05,1.9e-05,9e-06,1e-06,6e-06,1.2e-05,1.1e-05,1.7e-05,4e-06,1.1e-05,1.5e-05,2e-06,1e-05,1.6e-05,7e-06,7e-06,8e-06,4e-06,4.6e-05,3.9e-05,3.7e-05,3.7e-05,2.5e-05,2.1e-05,2.2e-05,3.2e-05,3e-06,2e-05,2e-05,6e-06,6e-06,1.5e-05,2e-05,1.6e-05,1.3e-05,1.3e-05,9e-06,2e-06,7e-06,1.2e-05,1e-05,0.000161,3.8e-05,3.7e-05,1.1e-05,1.8e-05,1.8e-05,8e-06,1.2e-05,1.4e-05,7e-06,1e-05,1.4e-05,2e-06,7e-06,9e-06,4e-06,1.4e-05,1.2e-05,6e-06,1.5e-05,1.1e-05,1e-05,1e-05,1.5e-05,1.7e-05,1.5e-05,1.2e-05,1.9e-05,1.9e-05,0.000128,0.000103,6.2e-05,5e-06,9e-06,1.6e-05,1.1e-05,2.3e-05,1.1e-05
1e-06,3e-06,1.6e-05,1.3e-05,8e-06,1.1e-05,3e-06,7e-06,1e-06,5e-06,1.4e-05,3e-06,8e-06,1.4e-05,4e-06,4e-06,3e-06,1.8e-05,1.5e-05,2.2e-05,1.7e-05,3.9e-05,2.4e-05,7e-06,5e-06,5e-06,1.4e-05,7e-06,1e-06,2e-06,1.4e-05,9e-06,1.5e-05,2.3e-05,2.7e-05,3.7e-05,1e-05,5.1e-05,5.3e-05,4.7e-05,5.5e-05,5.4e-05,1.9e-05,2.9e-05,6e-06,3.9e-05,7e-06,6e-06,9e-06,1.2e-05,8e-06,1.1e-05,7e-06,6e-06,1e-05,1.4e-05,1.4e-05,1.4e-05,1.8e-05,1.4e-05,2e-05,1.2e-05,4e-06,4.1e-05,1.2e-05,3.1e-05,1.8e-05,1.8e-05,8e-06,6e-06,1.5e-05,6e-06,1.2e-05,5e-06,2e-05,1.1e-05,8e-06,1.8e-05,1.7e-05,6e-06,6e-06,9e-06,5e-06,0.000264,1.1e-05,1.3e-05,2.5e-05,1.9e-05,1e-05,1e-06,1.2e-05,1.1e-05,9e-06,9e-06,2e-06,9e-06,9e-06,6e-06,6e-06,1.6e-05,1e-05,1e-06,1.4e-05,8e-06,9e-06,2.1e-05,1.3e-05,2.8e-05,1.7e-05,1.1e-05,9e-06,6e-06,0.000137,5.9e-05,1.1e-05,2.3e-05,2.9e-05,1.9e-05,2.1e-05,2.6e-05,2.3e-05
5e-06,2e-06,1.2e-05,1.2e-05,1e-05,7e-06,7e-06,1e-06,8e-06,9e-06,6e-06,8e-06,1.2e-05,7e-06,1.5e-05,8e-06,6e-06,2.2e-05,2.9e-05,2.5e-05,9e-06,4.3e-05,2.8e-05,1.3e-05,1e-05,1.3e-05,8e-06,1.2e-05,1.1e-05,1.2e-05,1.6e-05,2.4e-05,1e-05,1.5e-05,1.4e-05,1.3e-05,2.3e-05,5.4e-05,1.9e-05,2.7e-05,3.9e-05,3.3e-05,6.5e-05,4.5e-05,4.1e-05,4.8e-05,3.1e-05,4e-05,2.5e-05,1.6e-05,4e-06,7e-06,4e-06,8e-06,1.1e-05,1.4e-05,3e-06,1.3e-05,1.3e-05,2e-05,6.5e-05,1.4e-05,1.1e-05,4.8e-05,3e-05,2.7e-05,3.3e-05,3.3e-05,1.8e-05,1.7e-05,1.5e-05,1.4e-05,1.1e-05,7e-06,2.5e-05,2.9e-05,1.1e-05,2.2e-05,2.3e-05,1.6e-05,1.3e-05,2e-05,1.3e-05,0.00031,0.000214,0.000119,3.7e-05,2.6e-05,1.3e-05,1.3e-05,1.7e-05,1.4e-05,1e-05,8e-06,1.1e-05,1e-05,1.7e-05,1e-05,1e-05,9e-06,9e-06,4e-06,1.1e-05,9e-06,1.4e-05,1.3e-05,9e-06,7e-06,9e-06,1.6e-05,1.4e-05,1.7e-05,0.000121,5.5e-05,2.5e-05,1e-05,1.7e-05,2.1e-05,3.6e-05,1.9e-05,1.6e-05
6e-06,3e-06,1.4e-05,3e-06,4e-06,1e-05,7e-06,6e-06,1.1e-05,7e-06,7e-06,1.3e-05,5e-06,1.1e-05,9e-06,2.5e-05,2e-05,2.7e-05,1e-05,1.6e-05,1.3e-05,3.9e-05,1.8e-05,1.1e-05,1.1e-05,4e-06,8e-06,1.5e-05,1.6e-05,9e-06,1.4e-05,3e-06,1.1e-05,1.8e-05,1e-06,9e-06,3e-05,3e-05,3.7e-05,2e-05,4e-05,4.3e-05,9.6e-05,4e-05,3.9e-05,6.7e-05,4.4e-05,2.2e-05,2.5e-05,1.5e-05,9e-06,8e-06,1.1e-05,1.3e-05,1.6e-05,1.1e-05,1.9e-05,1e-05,9e-06,3.6e-05,9.7e-05,8.3e-05,4e-05,5.4e-05,4.9e-05,5.3e-05,5.7e-05,5.1e-05,7.1e-05,6.3e-05,2.8e-05,1.7e-05,2.5e-05,9e-06,1.5e-05,1.4e-05,5e-06,1.9e-05,6e-06,3e-06,5e-06,1.1e-05,1.4e-05,0.000223,0.000189,6.4e-05,2.4e-05,1.2e-05,2e-05,3e-06,9e-06,1.5e-05,1.7e-05,1.3e-05,8e-06,3e-06,1.7e-05,1e-05,7e-06,5e-06,5e-06,7e-06,3e-06,3e-06,1.3e-05,1e-05,4e-06,9e-06,1.2e-05,2.2e-05,1.2e-05,1e-05,0.000115,7.9e-05,3.7e-05,1.4e-05,1e-05,2e-05,5e-06,2.8e-05,1.8e-05
3e-06,4e-06,1.6e-05,9e-06,4e-06,1.2e-05,9e-06,3e-06,8e-06,3e-06,8e-06,1.3e-05,1.8e-05,1.6e-05,8e-06,2e-05,4e-06,1.4e-05,2.1e-05,3.2e-05,1.4e-05,5.1e-05,3.3e-05,7e-06,5e-06,3e-06,2e-06,7e-06,6e-06,8e-06,4e-06,4e-06,1e-05,1.4e-05,1.7e-05,7e-06,2.1e-05,2.9e-05,2.2e-05,3.1e-05,1.4e-05,1.7e-05,6.9e-05,4.9e-05,1.3e-05,2.5e-05,1.5e-05,2.7e-05,3.1e-05,2.2e-05,8e-06,1.2e-05,9e-06,6e-06,2.8e-05,3.2e-05,2.2e-05,1.2e-05,1.2e-05,1.8e-05,6.7e-05,6.4e-05,1.8e-05,8e-05,0.000107,7e-05,2.3e-05,1.9e-05,3.5e-05,5.1e-05,5.4e-05,3.4e-05,3.6e-05,3.3e-05,3.2e-05,1e-05,1.2e-05,1.3e-05,7e-06,5e-06,8e-06,1.3e-05,8e-06,6.9e-05,6.1e-05,4.7e-05,3e-05,1.7e-05,8e-06,4e-06,5e-06,2e-06,2.3e-05,1e-05,9e-06,1.6e-05,7e-06,1e-05,1.3e-05,6e-06,6e-06,8e-06,8e-06,6e-06,1e-05,3e-06,8e-06,1.6e-05,1.4e-05,6e-06,6e-06,5e-06,8.6e-05,6.2e-05,3.5e-05,8e-06,7e-06,2.2e-05,2e-05,2.5e-05,2.1e-05
6e-06,3e-06,5e-06,7e-06,6e-06,1.2e-05,1e-05,1e-05,8e-06,1.3e-05,1.1e-05,3e-06,1.6e-05,1.3e-05,5e-06,9e-06,1.7e-05,1.4e-05,1e-05,2.5e-05,1.7e-05,5.5e-05,2.8e-05,7e-06,8e-06,6e-06,1e-06,1e-06,5e-06,3e-06,5e-06,1e-05,9e-06,9e-06,1e-05,8e-06,1.2e-05,2.2e-05,1.3e-05,2.6e-05,2.8e-05,4.9e-05,1.1e-05,1e-05,8e-06,3.1e-05,1.9e-05,1.1e-05,3.6e-05,2.8e-05,1.1e-05,1.4e-05,2e-06,8e-06,1.8e-05,1.3e-05,7e-06,7e-06,2.2e-05,1.1e-05,1.6e-05,4.8e-05,3.6e-05,6.9e-05,3.3e-05,8e-06,1.5e-05,1.6e-05,2.8e-05,7e-06,3.1e-05,3.4e-05,3.9e-05,1.1e-05,1.1e-05,1.5e-05,2.2e-05,8e-06,9e-06,8e-06,5e-06,7e-06,6e-06,9.4e-05,4.1e-05,2.3e-05,8e-06,1e-05,1.2e-05,1.2e-05,1.4e-05,8e-06,1.5e-05,1.2e-05,1.1e-05,1.3e-05,1.7e-05,9e-06,7e-06,6e-06,8e-06,7e-06,3e-06,6e-06,9e-06,8e-06,9e-06,8e-06,4e-06,2e-06,6e-06,1.3e-05,6.4e-05,2e-05,8e-06,1.7e-05,8e-06,1.6e-05,1e-05,1.1e-05,1.1e-05
3e-06,6e-06,4e-06,7e-06,4e-06,8e-06,7e-06,1e-05,7e-06,7e-06,5e-06,8e-06,6e-06,4e-06,1.3e-05,1.2e-05,1e-05,4e-06,2e-05,1.8e-05,1.5e-05,3.4e-05,1.3e-05,4e-06,1e-05,5e-06,6e-06,6e-06,5e-06,8e-06,3e-06,1e-05,7e-06,9e-06,5e-06,4e-06,1.1e-05,2.7e-05,1.5e-05,1.7e-05,1e-06,2.1e-05,2e-05,2.8e-05,8e-06,4.1e-05,1.9e-05,1.8e-05,3.7e-05,2.2e-05,1.6e-05,8e-06,9e-06,1.3e-05,9e-06,1e-05,5e-06,6e-06,3.3e-05,7e-06,2.9e-05,5.2e-05,2.9e-05,4e-05,5.4e-05,3e-05,7e-06,1.9e-05,1.5e-05,2.2e-05,7e-06,9e-06,3.2e-05,2.9e-05,6e-06,1.5e-05,1e-05,1e-05,1.7e-05,3e-06,8e-06,4e-06,2e-06,0.000174,9.2e-05,3.4e-05,1e-06,1.1e-05,2e-05,2.1e-05,5e-06,2e-06,6e-06,9e-06,6e-06,1.2e-05,1.1e-05,2e-06,4e-06,1e-05,6e-06,6e-06,3e-06,8e-06,9e-06,7e-06,4e-06,2e-05,1e-05,1.2e-05,4e-06,2e-05,3.4e-05,2.7e-05,2.3e-05,3e-06,8e-06,3.7e-05,1.6e-05,1.1e-05,1e-05
1e-06,1e-06,1e-06,3e-06,3e-06,5e-06,5e-06,0,2e-06,2e-06,5e-06,3e-06,6e-06,6e-06,2e-06,5e-06,3e-06,5e-06,1.9e-05,1.5e-05,8e-06,1.8e-05,1.1e-05,5e-06,5e-06,3e-06,1e-06,1e-06,2e-06,3e-06,4e-06,6e-06,2e-06,5e-06,3e-06,1e-06,7e-06,1e-05,5e-06,1.3e-05,1.7e-05,1.3e-05,1.2e-05,1.3e-05,1.6e-05,1.5e-05,1.2e-05,8e-06,1.2e-05,6e-06,2e-06,3e-06,6e-06,2e-06,5e-06,4e-06,1e-06,2e-06,1.8e-05,1.3e-05,7e-06,1.2e-05,4e-06,4e-06,5e-06,1.1e-05,1.4e-05,1.4e-05,1.7e-05,7e-06,6e-06,6e-06,8e-06,8e-06,7e-06,4e-06,1e-06,3e-06,5e-06,5e-06,4e-06,4e-06,1e-06,9.1e-05,5.1e-05,2.4e-05,1.2e-05,3e-06,4e-06,1e-06,0,1e-06,2e-06,3e-06,3e-06,5e-06,5e-06,2e-06,2e-06,3e-06,2e-06,2e-06,4e-06,3e-06,3e-06,0,4e-06,1e-05,4e-06,8e-06,4e-06,7e-06,1.4e-05,6e-06,7e-06,3e-06,3e-06,1.4e-05,5e-06,5e-06,4e-06
3e-06,1e-06,1e-06,2e-06,2e-06,5e-06,3e-06,2e-06,3e-06,4e-06,6e-06,8e-06,8e-06,7e-06,7e-06,4e-06,7e-06,5e-06,1.2e-05,1e-05,8e-06,7e-06,5e-06,2e-06,3e-06,4e-06,0,0,2e-06,3e-06,2e-06,4e-06,2e-06,3e-06,2e-06,1e-06,4e-06,1.7e-05,7e-06,9e-06,9e-06,1.6e-05,1.6e-05,8e-06,8e-06,1.7e-05,1.6e-05,6e-06,6e-06,1.2e-05,8e-06,3e-06,6e-06,3e-06,3e-06,2e-06,2e-06,2e-06,1.1e-05,7e-06,2.4e-05,9e-06,9e-06,8e-06,5e-06,5e-06,9e-06,7e-06,7e-06,6e-06,7e-06,4e-06,6e-06,4e-06,2e-06,5e-06,2e-06,0,4e-06,5e-06,2e-06,2e-06,4e-06,6.9e-05,3.3e-05,1.5e-05,8e-06,9e-06,5e-06,5e-06,4e-06,3e-06,4e-06,2e-06,0,2e-06,4e-06,4e-06,2e-06,3e-06,4e-06,2e-06,2e-06,1e-06,3e-06,1e-06,3e-06,1e-05,9e-06,5e-06,3e-06,1e-06,7e-06,1.7e-05,1e-05,6e-06,7e-06,1.1e-05,8e-06,1e-06,2e-06
1e-06,2e-06,1e-06,3e-06,3e-06,1e-06,1e-06,2e-06,3e-06,4e-06,1e-06,4e-06,3e-06,2e-06,5e-06,1e-06,2e-06,3e-06,5e-06,1e-06,2e-06,4e-06,2e-06,3e-06,3e-06,2e-06,3e-06,2e-06,2e-06,2e-06,2e-06,2e-06,1e-06,1e-06,0,1e-06,3e-06,1.1e-05,6e-06,4e-06,1.5e-05,4e-06,1e-05,1.3e-05,9e-06,6e-06,8e-06,9e-06,1.1e-05,1e-05,5e-06,5e-06,2e-06,0,2e-06,4e-06,3e-06,3e-06,5e-06,1.2e-05,2.5e-05,1.3e-05,1.4e-05,5e-06,4e-06,2e-06,1.1e-05,1e-05,1.1e-05,7e-06,2e-06,4e-06,3e-06,1e-06,2e-06,4e-06,2e-06,3e-06,3e-06,3e-06,3e-06,2e-06,2e-06,2.9e-05,2.8e-05,8e-06,7e-06,3e-06,3e-06,5e-06,3e-06,3e-06,2e-06,1e-06,1e-06,1e-06,1e-06,2e-06,1e-06,3e-06,4e-06,1e-06,5e-06,1e-06,1e-06,3e-06,2e-06,7e-06,4e-06,2e-06,3e-06,4e-06,7e-06,8e-06,5e-06,4e-06,4e-06,1e-06,1e-06,0,3e-06
0,2e-06,2e-06,1e-06,1e-06,1e-06,1e-06,3e-06,3e-06,4e-06,4e-06,1e-06,2e-06,6e-06,4e-06,1e-06,2e-06,3e-06,8e-06,2e-06,3e-06,7e-06,2e-06,1e-06,3e-06,3e-06,2e-06,0,1e-06,0,3e-06,2e-06,2e-06,3e-06,1e-06,3e-06,2e-06,4e-06,1e-06,2e-06,6e-06,5e-06,6e-06,7e-06,2e-06,4e-06,5e-06,4e-06,9e-06,6e-06,1e-06,4e-06,4e-06,1e-06,4e-06,5e-06,1e-06,3e-06,9e-06,1.2e-05,1e-05,3e-06,7e-06,3e-06,6e-06,5e-06,5e-06,1e-06,6e-06,6e-06,3e-06,1e-06,5e-06,3e-06,2e-06,2e-06,2e-06,1e-06,2e-06,2e-06,1e-06,0,3e-06,1.1e-05,1e-05,7e-06,9e-06,6e-06,2e-06,2e-06,4e-06,3e-06,2e-06,1e-06,1e-06,2e-06,2e-06,3e-06,4e-06,1e-06,1e-06,1e-06,4e-06,2e-06,2e-06,1e-06,3e-06,3e-06,5e-06,3e-06,1e-06,1e-06,1.2e-05,1e-05,2e-06,1e-06,3e-06,7e-06,5e-06,4e-06,1e-06
1e-06,2e-06,1e-06,1e-06,2e-06,3e-06,2e-06,2e-06,3e-06,5e-06,3e-06,2e-06,4e-06,8e-06,6e-06,5e-06,2e-06,4e-06,5e-06,4e-06,6e-06,9e-06,5e-06,2e-06,1e-06,3e-06,2e-06,2e-06,1e-06,2e-06,1e-06,2e-06,3e-06,2e-06,2e-06,5e-06,3e-06,5e-06,0,2e-06,4e-06,4e-06,4e-06,2e-06,2e-06,2e-06,6e-06,5e-06,4e-06,3e-06,3e-06,3e-06,2e-06,1e-06,2e-06,0,2e-06,3e-06,7e-06,8e-06,9e-06,2e-06,1e-05,6e-06,5e-06,5e-06,8e-06,7e-06,6e-06,4e-06,4e-06,4e-06,3e-06,2e-06,2e-06,3e-06,2e-06,2e-06,1e-06,1e-06,2e-06,3e-06,2e-06,2.6e-05,1.7e-05,8e-06,5e-06,2e-06,2e-06,4e-06,1e-06,3e-06,3e-06,1e-06,2e-06,0,6e-06,3e-06,1e-06,3e-06,3e-06,1e-06,3e-06,1e-06,3e-06,1e-06,2e-06,5e-06,8e-06,3e-06,3e-06,3e-06,1.4e-05,3e-06,2e-06,3e-06,4e-06,5e-06,8e-06,5e-06,1e-06
1e-06,1e-06,1e-06,2e-06,2e-06,1e-06,1e-06,1e-06,2e-06,2e-06,2e-06,2e-06,5e-06,6e-06,7e-06,4e-06,3e-06,2e-06,6e-06,7e-06,4e-06,1e-05,6e-06,1e-06,1e-06,3e-06,1e-06,2e-06,1e-06,1e-06,2e-06,4e-06,4e-06,1e-06,3e-06,9e-06,5e-06,5e-06,3e-06,3e-06,5e-06,2e-06,1e-06,5e-06,1e-06,2e-06,4e-06,4e-06,1e-06,3e-06,2e-06,3e-06,4e-06,1e-06,0,2e-06,2e-06,4e-06,6e-06,4e-06,1.4e-05,6e-06,6e-06,8e-06,5e-06,3e-06,1.2e-05,5e-06,3e-06,1e-06,4e-06,2e-06,2e-06,3e-06,3e-06,3e-06,1e-06,2e-06,1e-06,1e-06,1e-06,3e-06,3e-06,1.7e-05,1.6e-05,5e-06,6e-06,1e-05,5e-06,5e-06,3e-06,3e-06,2e-06,1e-06,0,1e-06,4e-06,2e-06,1e-06,2e-06,2e-06,2e-06,3e-06,2e-06,3e-06,3e-06,3e-06,5e-06,4e-06,6e-06,3e-06,3e-06,1.9e-05,1.9e-05,5e-06,6e-06,3e-06,2e-06,0,1e-06,2e-06
1e-06,1e-06,3e-06,1e-06,1e-06,1e-06,1e-06,1e-06,1e-06,1e-06,1e-06,1e-06,4e-06,4e-06,2e-06,2e-06,2e-06,2e-06,5e-06,3e-06,1e-06,4e-06,3e-06,2e-06,2e-06,0,2e-06,1e-06,2e-06,2e-06,1e-06,5e-06,2e-06,1e-06,6e-06,4e-06,8e-06,8e-06,1e-06,2e-06,5e-06,5e-06,6e-06,9e-06,7e-06,1e-06,4e-06,8e-06,3e-06,1e-06,1e-06,1e-06,1e-06,2e-06,2e-06,3e-06,3e-06,2e-06,4e-06,4e-06,1e-05,6e-06,5e-06,6e-06,5e-06,7e-06,1.4e-05,1.2e-05,8e-06,3e-06,4e-06,4e-06,2e-06,2e-06,1e-06,4e-06,0,3e-06,3e-06,2e-06,1e-06,3e-06,2e-06,2e-05,1.7e-05,1.1e-05,8e-06,3e-06,2e-06,3e-06,2e-06,3e-06,2e-06,2e-06,2e-06,2e-06,2e-06,1e-06,1e-06,1e-06,0,1e-06,3e-06,2e-06,2e-06,1e-06,3e-06,2e-06,7e-06,6e-06,3e-06,1e-06,2.4e-05,1.4e-05,1.1e-05,4e-06,4e-06,1e-06,2e-06,0,2e-06
1e-06,1e-06,4e-06,0,2e-06,2e-06,2e-06,2e-06,4e-06,2e-06,3e-06,2e-06,6e-06,4e-06,0,2e-06,2e-06,2e-06,2e-06,5e-06,1e-06,1.1e-05,8e-06,4e-06,1e-06,1e-06,1e-06,2e-06,2e-06,2e-06,4e-06,3e-06,3e-06,2e-06,8e-06,6e-06,5e-06,7e-06,6e-06,4e-06,1e-06,5e-06,6e-06,5e-06,5e-06,7e-06,8e-06,7e-06,8e-06,4e-06,1e-06,1e-06,2e-06,1e-06,3e-06,2e-06,2e-06,2e-06,6e-06,7e-06,4e-06,8e-06,1.1e-05,5e-06,2e-06,7e-06,8e-06,3e-06,7e-06,6e-06,3e-06,3e-06,1e-06,2e-06,2e-06,4e-06,1e-06,1e-06,3e-06,2e-06,3e-06,1e-06,3e-06,3e-05,2.3e-05,1e-05,8e-06,2e-06,4e-06,6e-06,3e-06,2e-06,1e-06,2e-06,1e-06,1e-06,2e-06,1e-06,1e-06,2e-06,1e-06,2e-06,0,2e-06,0,2e-06,3e-06,3e-06,1e-06,3e-06,2e-06,5e-06,1.9e-05,1.2e-05,1e-05,5e-06,2e-06,4e-06,2e-06,1e-06,3e-06
1e-06,2e-06,1e-06,2e-06,3e-06,3e-06,2e-06,1e-06,3e-06,1e-06,2e-06,1e-06,5e-06,5e-06,5e-06,2e-06,2e-06,2e-06,6e-06,6e-06,6e-06,1e-05,5e-06,3e-06,1e-06,1e-06,1e-06,1e-06,2e-06,3e-06,3e-06,3e-06,0,1e-06,9e-06,7e-06,4e-06,3e-06,8e-06,7e-06,8e-06,9e-06,5e-06,4e-06,4e-06,6e-06,3e-06,3e-06,2e-06,1e-06,3e-06,0,2e-06,1e-06,4e-06,3e-06,1e-06,4e-06,1.1e-05,5e-06,4e-06,7e-06,9e-06,4e-06,7e-06,5e-06,6e-06,4e-06,0,3e-06,2e-06,1e-06,1e-06,2e-06,2e-06,4e-06,2e-06,1e-06,1e-06,1e-06,2e-06,3e-06,3e-06,3.2e-05,4e-06,4e-06,1e-05,1e-05,6e-06,4e-06,1e-06,3e-06,3e-06,2e-06,2e-06,1e-06,2e-06,2e-06,1e-06,1e-06,2e-06,1e-06,1e-06,2e-06,2e-06,3e-06,2e-06,2e-06,3e-06,1e-06,6e-06,1e-06,1.6e-05,1.4e-05,8e-06,4e-06,1e-06,4e-06,3e-06,2e-06,1e-06
1e-06,2e-06,2e-06,1e-06,3e-06,3e-06,1e-06,1e-06,3e-06,1e-06,2e-06,4e-06,1e-06,5e-06,6e-06,6e-06,2e-06,3e-06,6e-06,4e-06,2e-06,6e-06,2e-06,1e-06,2e-06,0,1e-06,1e-06,2e-06,1e-06,2e-06,2e-06,1e-06,2e-06,8e-06,1e-06,3e-06,1e-06,7e-06,2e-06,8e-06,7e-06,6e-06,5e-06,3e-06,3e-06,5e-06,5e-06,6e-06,2e-06,4e-06,4e-06,1e-06,2e-06,4e-06,1e-06,2e-06,2e-06,9e-06,5e-06,6e-06,4e-06,3e-06,4e-06,6e-06,7e-06,8e-06,9e-06,6e-06,6e-06,4e-06,5e-06,1e-06,2e-06,3e-06,4e-06,2e-06,2e-06,1e-06,1e-06,1e-06,2e-06,1e-06,1.7e-05,1.2e-05,7e-06,6e-06,2e-06,5e-06,3e-06,3e-06,3e-06,1e-06,1e-06,2e-06,1e-06,1e-06,1e-06,1e-06,1e-06,3e-06,2e-06,1e-06,3e-06,2e-06,2e-06,1e-06,1e-06,5e-06,5e-06,5e-06,4e-06,9e-06,6e-06,2e-06,2e-06,1e-06,6e-06,4e-06,4e-06,2e-06
1e-06,1e-06,1e-06,1e-06,2e-06,2e-06,2e-06,1e-06,4e-06,3e-06,3e-06,4e-06,4e-06,5e-06,8e-06,5e-06,3e-06,2e-06,7e-06,6e-06,4e-06,6e-06,5e-06,2e-06,1e-06,3e-06,2e-06,1e-06,1e-06,3e-06,3e-06,4e-06,3e-06,3e-06,6e-06,7e-06,6e-06,7e-06,5e-06,1e-05,6e-06,1.1e-05,8e-06,6e-06,5e-06,2e-06,2e-06,4e-06,4e-06,4e-06,1e-06,1e-06,4e-06,2e-06,2e-06,4e-06,1e-06,1e-06,6e-06,3e-06,1e-06,2e-06,6e-06,6e-06,8e-06,3e-06,4e-06,5e-06,4e-06,3e-06,1e-06,3e-06,3e-06,1e-06,1e-06,3e-06,2e-06,1e-06,2e-06,3e-06,1e-06,2e-06,3e-06,1.1e-05,8e-06,3e-06,4e-06,1e-06,3e-06,4e-06,2e-06,1e-06,1e-06,2e-06,0,1e-06,1e-06,1e-06,1e-06,2e-06,3e-06,1e-06,1e-06,2e-06,3e-06,1e-06,2e-06,1e-06,4e-06,3e-06,5e-06,1e-06,6e-06,3e-06,3e-06,2e-06,2e-06,4e-06,7e-06,5e-06,3e-06
1e-06,2e-06,2e-06,1e-06,1e-06,1e-06,2e-06,1e-06,3e-06,3e-06,3e-06,1e-06,2e-06,3e-06,3e-06,2e-06,1e-06,3e-06,6e-06,8e-06,1.1e-05,1.1e-05,5e-06,2e-06,2e-06,2e-06,2e-06,1e-06,0,2e-06,2e-06,1e-06,2e-06,2e-06,2e-06,3e-06,1e-06,5e-06,8e-06,9e-06,6e-06,2e-06,4e-06,6e-06,9e-06,6e-06,5e-06,2e-06,1e-06,3e-06,1e-06,2e-06,6e-06,4e-06,3e-06,3e-06,3e-06,1e-06,6e-06,5e-06,5e-06,2e-06,4e-06,4e-06,1e-06,5e-06,4e-06,3e-06,1e-06,2e-06,4e-06,0,2e-06,1e-06,1e-06,5e-06,2e-06,1e-06,3e-06,2e-06,1e-06,2e-06,2e-06,3.6e-05,1.2e-05,1e-05,5e-06,4e-06,4e-06,3e-06,2e-06,1e-06,1e-06,2e-06,1e-06,2e-06,2e-06,1e-06,1e-06,2e-06,2e-06,1e-06,2e-06,2e-06,1e-06,1e-06,2e-06,1e-06,3e-06,1e-06,4e-06,4e-06,6e-06,5e-06,1e-06,2e-06,4e-06,5e-06,2e-06,4e-06,1e-06
3e-06,1e-06,3e-06,3e-06,2e-06,3e-06,2e-06,3e-06,4e-06,1e-06,3e-06,1e-06,3e-06,8e-06,5e-06,3e-06,4e-06,4e-06,2e-06,3e-06,6e-06,9e-06,4e-06,2e-06,2e-06,3e-06,4e-06,3e-06,2e-06,3e-06,1e-06,3e-06,1e-06,1e-06,3e-06,2e-06,4e-06,4e-06,5e-06,1.1e-05,1e-05,1.5e-05,1.2e-05,5e-06,4e-06,1e-06,6e-06,3e-06,3e-06,2e-06,3e-06,4e-06,4e-06,2e-06,2e-06,4e-06,4e-06,6e-06,3e-06,7e-06,1e-05,9e-06,9e-06,7e-06,7e-06,4e-06,5e-06,5e-06,2e-06,3e-06,3e-06,1e-06,3e-06,3e-06,1e-06,3e-06,3e-06,4e-06,1e-06,3e-06,1e-06,2e-06,2e-06,5e-05,2.4e-05,1.3e-05,3e-06,1e-05,6e-06,1e-06,2e-06,1e-06,2e-06,2e-06,2e-06,1e-06,0,2e-06,0,1e-06,1e-06,1e-06,2e-06,2e-06,3e-06,3e-06,4e-06,5e-06,1e-06,2e-06,6e-06,5e-06,1.4e-05,5e-06,4e-06,2e-06,3e-06,3e-06,3e-06,5e-06,4e-06
3e-06,4e-06,0,2e-06,2e-06,2e-06,1e-06,1e-06,2e-06,3e-06,1e-06,3e-06,2e-06,5e-06,3e-06,3e-06,4e-06,1e-06,3e-06,3e-06,4e-06,7e-06,3e-06,2e-06,1e-06,1e-06,2e-06,1e-06,2e-06,4e-06,3e-06,4e-06,1e-06,1e-06,5e-06,5e-06,8e-06,5e-06,3e-06,1.4e-05,6e-06,1.2e-05,7e-06,6e-06,6e-06,8e-06,1e-05,7e-06,5e-06,5e-06,3e-06,4e-06,3e-06,2e-06,1e-06,5e-06,1e-06,5e-06,7e-06,8e-06,9e-06,1.2e-05,1e-06,6e-06,1.1e-05,1.1e-05,1.1e-05,5e-06,1e-06,4e-06,6e-06,5e-06,2e-06,2e-06,1e-06,2e-06,1e-06,3e-06,4e-06,1e-06,1e-06,0,1e-06,4.6e-05,2.8e-05,1.1e-05,4e-06,1.4e-05,1e-05,4e-06,4e-06,1e-06,1e-06,0,2e-06,0,1e-06,3e-06,2e-06,3e-06,2e-06,3e-06,1e-06,1e-06,0,3e-06,2e-06,2e-06,4e-06,0,3e-06,2e-06,1.1e-05,8e-06,5e-06,8e-06,4e-06,1e-06,4e-06,4e-06,2e-06
1e-06,3e-06,2e-06,0,0,0,2e-06,0,1e-06,1e-06,0,3e-06,2e-06,1e-06,2e-06,2e-06,1e-06,2e-06,2e-06,1e-06,1e-06,5e-06,3e-06,1e-06,1e-06,2e-06,0,1e-06,1e-06,2e-06,2e-06,1e-06,2e-06,1e-06,5e-06,5e-06,4e-06,4e-06,8e-06,1.8e-05,1.4e-05,1e-05,1e-05,5e-06,2e-06,6e-06,4e-06,3e-06,4e-06,4e-06,3e-06,2e-06,5e-06,3e-06,1e-06,3e-06,2e-06,5e-06,3e-06,8e-06,3e-06,1.1e-05,1.1e-05,4e-06,8e-06,5e-06,6e-06,4e-06,3e-06,4e-06,2e-06,1e-06,2e-06,1e-06,1e-06,3e-06,2e-06,4e-06,3e-06,2e-06,0,1e-06,1e-06,2.8e-05,1.8e-05,5e-06,3e-06,9e-06,3e-06,1e-06,1e-06,0,1e-06,0,2e-06,2e-06,2e-06,2e-06,1e-06,2e-06,1e-06,1e-06,2e-06,2e-06,1e-06,2e-06,1e-06,2e-06,3e-06,1e-06,3e-06,3e-06,1.4e-05,1.2e-05,2e-06,7e-06,8e-06,3e-06,5e-06,2e-06,2e-06
1e-06,2e-06,1e-06,0,1e-06,1e-06,2e-06,2e-06,1e-06,0,2e-06,3e-06,2e-06,0,1e-06,2e-06,1e-06,1e-06,1e-06,1e-06,2e-06,3e-06,1e-06,1e-06,1e-06,0,1e-06,2e-06,2e-06,4e-06,1e-06,2e-06,2e-06,4e-06,2e-06,4e-06,5e-06,1e-06,1e-05,7e-06,8e-06,6e-06,6e-06,2e-06,3e-06,8e-06,7e-06,2e-06,4e-06,4e-06,8e-06,5e-06,4e-06,3e-06,1e-06,2e-06,1e-06,5e-06,7e-06,7e-06,4e-06,6e-06,3e-06,8e-06,1.1e-05,1e-05,5e-06,2e-06,5e-06,6e-06,6e-06,5e-06,3e-06,1e-06,1e-06,2e-06,2e-06,1e-06,3e-06,3e-06,2e-06,2e-06,1e-06,1.9e-05,1.3e-05,1.5e-05,6e-06,8e-06,3e-06,3e-06,3e-06,2e-06,3e-06,1e-06,2e-06,1e-06,1e-06,2e-06,1e-06,2e-06,1e-06,1e-06,1e-06,1e-06,2e-06,4e-06,3e-06,2e-06,2e-06,1e-06,3e-06,2e-06,1.3e-05,2.5e-05,1.5e-05,5e-06,7e-06,1.2e-05,6e-06,2e-06,3e-06
0,1e-06,2e-06,1e-06,1e-06,1e-06,2e-06,2e-06,1e-06,1e-06,2e-06,2e-06,1e-06,2e-06,1e-06,2e-06,1e-06,1e-06,1e-06,1e-06,2e-06,6e-06,3e-06,1e-06,1e-06,0,2e-06,2e-06,1e-06,3e-06,1e-06,2e-06,2e-06,2e-06,3e-06,2e-06,1e-06,3e-06,6e-06,6e-06,5e-06,4e-06,8e-06,4e-06,2e-06,3e-06,6e-06,5e-06,6e-06,1e-05,6e-06,2e-06,2e-06,2e-06,2e-06,1e-06,1e-06,3e-06,4e-06,8e-06,3e-06,5e-06,5e-06,3e-06,3e-06,5e-06,3e-06,2e-06,2e-06,4e-06,2e-06,0,0,2e-06,1e-06,2e-06,1e-06,1e-06,1e-06,1e-06,0,1e-06,1e-06,2e-05,8e-06,9e-06,5e-06,4e-06,3e-06,5e-06,1e-06,0,2e-06,2e-06,1e-06,1e-06,1e-06,1e-06,2e-06,1e-06,1e-06,0,1e-06,0,1e-06,3e-06,1e-06,2e-06,2e-06,1e-06,3e-06,2e-06,1.2e-05,2.2e-05,1.4e-05,8e-06,5e-06,7e-06,7e-06,6e-06,3e-06
1e-06,1e-06,1e-06,1e-06,1e-06,1e-06,1e-06,1e-06,1e-06,0,1e-06,1e-06,1e-06,2e-06,1e-06,1e-06,1e-06,1e-06,1e-06,2e-06,3e-06,4e-06,2e-06,0,1e-06,1e-06,2e-06,0,0,2e-06,1e-06,2e-06,1e-06,0,1e-06,2e-06,0,3e-06,2e-06,4e-06,1e-06,2e-06,3e-06,1e-06,3e-06,5e-06,2e-06,2e-06,2e-06,5e-06,1e-06,0,1e-06,0,1e-06,2e-06,1e-06,1e-06,4e-06,6e-06,2e-06,2e-06,4e-06,1e-06,1e-06,2e-06,1e-06,1e-06,2e-06,0,2e-06,1e-06,1e-06,1e-06,1e-06,2e-06,1e-06,0,1e-06,0,1e-06,1e-06,1e-06,1.7e-05,4e-06,2e-06,2e-06,1e-06,2e-06,1e-06,1e-06,1e-06,0,1e-06,1e-06,0,0,1e-06,1e-06,1e-06,1e-06,1e-06,1e-06,1e-06,1e-06,2e-06,0,2e-06,2e-06,1e-06,1e-06,1e-06,9e-06,9e-06,7e-06,1e-06,2e-06,6e-06,2e-06,0,0
1e-06,1e-06,1e-06,0,1e-06,1e-06,1e-06,1e-06,1e-06,0,1e-06,1e-06,1e-06,1e-06,1e-06,0,0,0,0,1e-06,1e-06,2e-06,0,0,0,0,1e-06,1e-06,0,2e-06,0,1e-06,1e-06,0,1e-06,1e-06,0,3e-06,2e-06,4e-06,1e-06,1e-06,1e-06,1e-06,2e-06,2e-06,2e-06,0,1e-06,4e-06,1e-06,1e-06,1e-06,0,1e-06,2e-06,0,2e-06,4e-06,5e-06,2e-06,1e-06,4e-06,2e-06,2e-06,2e-06,0,0,1e-06,1e-06,1e-06,1e-06,0,1e-06,0,2e-06,1e-06,1e-06,1e-06,0,0,1e-06,1e-06,1.5e-05,3e-06,3e-06,2e-06,3e-06,2e-06,2e-06,0,1e-06,1e-06,0,0,1e-06,1e-06,1e-06,0,1e-06,1e-06,1e-06,1e-06,1e-06,1e-06,2e-06,0,2e-06,2e-06,1e-06,1e-06,1e-06,8e-06,3e-06,4e-06,1e-06,0,4e-06,1e-06,0,1e-06
0,1e-06,1e-06,0,1e-06,1e-06,0,1e-06,1e-06,0,1e-06,1e-06,1e-06,1e-06,1e-06,0,0,0,1e-06,1e-06,1e-06,2e-06,0,1e-06,0,1e-06,1e-06,0,0,2e-06,0,1e-06,0,0,0,2e-06,0,3e-06,3e-06,3e-06,1e-06,1e-06,1e-06,1e-06,1e-06,2e-06,1e-06,0,0,3e-06,0,1e-06,1e-06,0,1e-06,1e-06,0,2e-06,4e-06,5e-06,2e-06,1e-06,4e-06,1e-06,2e-06,2e-06,1e-06,1e-06,1e-06,1e-06,1e-06,1e-06,0,1e-06,1e-06,2e-06,1e-06,1e-06,1e-06,0,0,1e-06,1e-06,1.6e-05,3e-06,2e-06,1e-06,2e-06,1e-06,1e-06,0,0,1e-06,0,1e-06,1e-06,0,0,0,1e-06,1e-06,1e-06,1e-06,1e-06,0,1e-06,0,1e-06,2e-06,0,1e-06,1e-06,7e-06,2e-06,4e-06,1e-06,1e-06,4e-06,1e-06,0,0
