-0.00023,-0.000192,-0.000268,-8.4e-05,-0.000177,-0.00047,-0.000204,-0.000252,-0.000307,-0.004145,-0.0071,-0.00474,-0.003508,-0.005481,-0.003524,-0.002876,-0.006334,-0.005848,0.003099,0.003056,0.000197,-0.007422,-0.007644,-0.006307,-0.005339,-0.016156,-0.012019,-0.013361,-0.022236,-0.016509,-0.009779,-0.020951,-0.017199,-0.01562,-0.019355,-0.012562,-0.017888,-0.016488,-0.007829,-0.010956,-0.010164,-0.009397,-0.012024,-0.01223,-0.013899,-0.020064,-0.01908,-0.014121,-0.01906,-0.016543,-0.017326,-0.014047,-0.012168,-0.012134,-0.007289,-0.004875,-0.006801,-0.004347,-0.003953,-0.004287,-0.002904,-0.001883,-0.003366,-0.002981,-0.002658,-0.003581,-0.002675,-0.002153,-0.001581,-0.00107,-0.001526,-0.000933,-0.000941,-0.000523,-0.001037,-0.00056,-0.001198,-0.001135,-0.000586,-0.00085,-0.000911,-0.000555,-0.001102,-0.000927,-0.005524,-0.004947,-0.00264,-0.00084,-0.000719,-0.000556,-0.000521,-0.000329,-0.000307,-0.000328,-0.000602,-0.00028,-0.000487,-0.000377,-0.000612,-0.000451,-0.000388,-0.000468,-0.000364,-0.000347,-1.4e-05,-0.00022,-0.000153,-0.000396,-0.000405,-0.000257,-0.000194,-0.000451,-0.000341,-0.000271,-0.000163,-0.000889,-0.001106,-0.000677,-0.000375,-0.000214,-0.000478
-9.7e-05,-3.5e-05,6e-06,2.4e-05,0.000104,0.000296,6.3e-05,9.4e-05,4.5e-05,0.001199,0.000969,0.00309,0.001396,-0.001269,0.002072,0.000805,0.004185,0.002596,-0.004386,-0.00083,-0.004207,0.00598,-0.000342,0.000609,0.002189,0.002523,-0.001585,-0.008666,0.003471,0.003547,0.003745,0.004198,0.004306,-0.006436,-0.003168,0.000193,0.004651,-0.000273,0.001046,-0.001049,0.001786,-0.002127,-0.000152,-0.009209,0.000575,0.003872,0.002363,-0.000564,0.007556,0.00429,0.001064,0.001472,0.001814,0.006106,0.002476,-0.001514,-0.001061,-0.000121,-0.000177,-0.000569,-0.000124,-0.000372,-0.000125,0.000427,0.000285,0.001465,0.000236,-6.8e-05,7.8e-05,-8.9e-05,-0.00041,-0.000198,-0.000439,-4.5e-05,-0.000486,-0.001076,3.5e-05,4.3e-05,-0.000299,-0.000669,-0.000689,-0.000244,-0.000203,-0.00012,0.002362,0.002649,0.0011,-0.000108,-0.000145,2.1e-05,-0.00024,-4.2e-05,-8.6e-05,-0.000236,-0.000183,-0.000518,-0.000588,-0.000429,-0.000217,-0.000362,-0.00021,-2.2e-05,-0.000242,-3.2e-05,0.000211,-0.000199,-9.5e-05,9e-06,3.7e-05,-0.000405,-0.000376,0.000142,0.000109,-0.000161,-0.00011,-5.7e-05,0.00077,0.000315,0.000244,7e-06,1.3e-05
0.000259,3.5e-05,-2.7e-05,1e-06,-4.9e-05,-0.000122,-9.3e-05,-0.000204,6.3e-05,2.3e-05,-0.002859,0.000463,0.000457,-0.002292,0.000443,-0.001561,-0.001699,0.000344,-0.001178,-0.003819,-0.00018,0.00118,-0.005201,-0.000545,0.001116,-0.008969,-0.005739,0.000216,-0.010647,-0.00818,-0.005169,-0.005306,-0.004018,0.00208,-0.002333,-0.003525,-0.001181,-0.01133,-0.00414,-0.002887,-0.000727,-0.002098,-0.002504,-0.000743,-0.004791,-0.000551,0.001605,-0.000698,-0.006559,-0.004477,-0.002883,-0.003233,-0.002565,-0.0016,-0.000678,0.002221,-0.000254,-0.000474,-0.00012,0.000851,-0.000563,-0.000742,-0.000443,-0.001897,-0.000501,-0.000466,-0.000131,-0.000295,0.000145,-6.4e-05,-0.000621,-0.00044,-6.7e-05,0.000325,0.000175,-7.2e-05,-0.000647,-1.8e-05,-7.7e-05,-1.9e-05,0.000203,-0.000284,-1.7e-05,0.000369,-0.000268,-0.001477,-0.000846,-0.000399,-0.000136,3.4e-05,0.000102,0.000171,1.7e-05,-2.8e-05,-8.4e-05,0.000203,0.000272,8.9e-05,-0.000401,-0.000102,7.9e-05,0.000127,6.6e-05,5.7e-05,4e-06,0.000222,0.000171,-3.2e-05,-0.000262,-5.4e-05,0.000303,-3.9e-05,-2.4e-05,-6e-05,-0.000289,-0.000157,-0.000713,-0.000383,-0.00023,-4.8e-05,0.000131
-0.000309,-0.000136,-8.2e-05,-0.000123,3e-06,7e-05,9.7e-05,2.7e-05,-5.6e-05,-9.1e-05,-0.000283,0.001539,0.000509,0.002024,0.001647,0.00132,0.00082,-0.000521,-7.3e-05,-0.007992,0.005892,0.000465,0.002356,-0.002835,-0.006002,-0.003322,0.002441,0.002115,0.002825,0.01044,-0.000813,-0.00079,0.001128,0.001767,-0.002708,-0.002757,-0.002128,0.005609,0.001807,0.000301,0.003354,0.000395,0.001486,0.005434,0.000268,-0.000113,0.004605,0.004193,0.006679,-0.00517,-0.002675,-0.002416,-0.001502,-0.000449,-0.001554,-0.000424,0.001594,0.0022,-0.000802,-0.000354,0.000129,-0.000128,-0.000134,0.000907,0.000436,0.000576,0.000986,0.000772,0.000801,0.00021,0.000612,-0.000371,-0.000581,0.000152,-0.000467,-0.000611,0.000274,-0.000127,8.7e-05,-0.000241,-0.000164,-0.000328,-0.000252,-0.000235,-0.000517,0.001306,0.000629,0.000117,-0.000173,-1.5e-05,-9.2e-05,-0.000102,-0.000235,-0.000191,2.4e-05,0.000134,-2e-04,-1.9e-05,0.000104,-0.000121,1.8e-05,-7.8e-05,-6.4e-05,-0.000143,-0.000123,-1.9e-05,-0.00023,-9.9e-05,5e-06,5.7e-05,-0.000186,-0.000156,6.7e-05,0.000108,7.6e-05,0.000196,0.000346,0.000148,2e-06,1.2e-05,-0.000335
0.000155,0.000115,6.6e-05,0.000147,0.000103,3.4e-05,-5e-05,0.000102,8e-05,-0.000126,-2.9e-05,-0.002444,-0.000694,0.000908,0.000928,-0.001043,-0.000539,-0.00012,-0.001103,-0.005202,-0.002995,-0.006579,0.000562,-0.001581,0.002861,0.002723,0.000875,-0.000284,-0.0037,-0.00804,0.003211,0.005055,-5.5e-05,-0.002661,-0.000484,-0.001917,-0.000857,-0.003236,-0.003858,-0.002503,-0.001258,-0.004672,-0.003456,4.7e-05,0.002045,-0.000334,-0.006541,-0.006441,-0.004945,0.004768,0.001886,0.003328,0.001983,0.001574,0.001928,-0.001345,-0.001389,-0.001321,-0.000114,2.5e-05,-0.000216,-1.8e-05,0.000795,-0.000191,0.000178,0.000275,3.1e-05,-0.001319,-0.000916,-0.000493,-7.6e-05,-0.000126,-0.000168,-0.000444,-0.000401,6.4e-05,-0.000446,-7.6e-05,8.8e-05,0.000151,0.000271,2.4e-05,-3.1e-05,-8.1e-05,0.00022,-0.000328,-6.9e-05,5.4e-05,0.000328,0.00013,0.000261,0.000251,3.4e-05,0.000193,9.4e-05,0.000192,6.7e-05,0.000432,0.000165,0.000366,0.000112,0.000142,5.6e-05,4.6e-05,7.8e-05,-1.1e-05,0.000285,7.6e-05,5.1e-05,0.000164,0.00025,4.4e-05,5.6e-05,-6.1e-05,-4.6e-05,-0.000195,-0.00036,-0.00017,-2e-05,-7.9e-05,0.000114
7.8e-05,1.6e-05,3.8e-05,4.8e-05,5.2e-05,8.2e-05,0.000162,5.7e-05,-1e-06,0.000107,-0.000981,0.000402,0.000587,0.000599,-0.001341,-0.000378,-0.000569,-0.000604,7e-04,-3e-04,-0.001979,-0.000688,-0.002512,-0.000355,0.001666,0.002056,-0.003749,-0.001393,-0.001717,-0.000191,0.000429,-0.003954,0.001135,0.000264,-0.002868,0.005595,-0.002914,0.001813,-0.003624,-0.00126,-0.001786,-0.002856,0.000226,-0.003277,0.000233,0.001674,0.004669,0.00114,-0.001132,-0.002655,0.000311,0.001119,0.001161,-0.001467,-0.003043,2.8e-05,0.000542,0.001002,0.000385,-0.000511,0.000337,-0.000111,-0.000239,0.000927,0.000344,-0.000324,-0.000454,0.000632,0.000968,0.000201,-0.000448,0.000171,0.000102,0.000325,0.000211,7.8e-05,0.000324,0.000289,-0.000119,0.00024,6.9e-05,0.000295,-6.9e-05,6.1e-05,-0.000103,0.000161,0.000378,3.4e-05,6.4e-05,-1.2e-05,-3.8e-05,2.6e-05,0.000107,1.1e-05,-5.9e-05,1.4e-05,7.6e-05,-5.1e-05,0.000133,0.000103,0.000199,-3.4e-05,4.3e-05,4e-05,-5e-05,-3.1e-05,-1e-05,1e-06,9.9e-05,-1e-06,-1.7e-05,-5e-06,6.9e-05,8.4e-05,0.00019,-4.3e-05,4.1e-05,0.000263,7.6e-05,-5.8e-05,0.000114
-9.2e-05,-4.7e-05,-9.8e-05,-6.2e-05,2.2e-05,-9.1e-05,-7.5e-05,-3.9e-05,-4e-05,0.000134,0.000441,-0.000727,-0.002034,-0.000931,-0.000403,-0.001694,-0.00097,0.00054,-0.000241,0.00295,0.000235,-0.001523,-0.004656,-0.00141,-0.002996,-0.00085,0.001431,0.003303,0.004926,0.000753,9.8e-05,0.002557,-0.002196,-0.002609,0.00853,-0.002858,0.000491,0.001675,-0.00052,0.001245,-0.000164,0.004368,0.000583,-0.00093,-0.002393,-0.004009,-0.00511,-0.000895,0.001414,0.004677,0.005948,0.000938,0.00034,0.00066,0.001309,5e-06,-0.000342,-0.000112,-0.000808,3e-04,0.000161,-1e-05,-9e-06,-0.000162,-0.000363,-0.000477,-0.000676,0.000129,-0.000384,3.4e-05,0.000176,0.000187,0.000228,0.000134,-7.7e-05,0.000173,0.000129,-0.000221,-0.000152,0.000204,-0.00025,1.9e-05,3.3e-05,-0.00031,5.1e-05,-0.000357,-0.000756,-4.8e-05,3.1e-05,3.7e-05,-0.000106,-0.000111,-3.9e-05,7e-06,2e-05,-0.000128,-0.00025,-0.000205,-4.3e-05,-6.8e-05,-9.8e-05,-3e-06,1.9e-05,-8.6e-05,-2e-06,-0.000185,-8.1e-05,8.1e-05,-4.3e-05,5.6e-05,-0.00014,-3.8e-05,-9e-05,-9.2e-05,-1.1e-05,4.1e-05,-2e-05,-0.000205,0,-5.9e-05,-2.9e-05
5e-06,-4.8e-05,5e-06,-1.1e-05,-1.4e-05,-6.4e-05,1.8e-05,1.2e-05,-8e-06,-0.000153,-0.000215,0.00022,-0.000683,0.000778,-0.00069,-0.000564,-0.000188,-0.000444,-0.000423,-0.002331,-0.004564,-0.000426,-0.003229,0.000433,0.000519,-0.000822,-0.000281,-0.002216,0.000951,0.000678,0.002848,-0.003251,-0.004983,0.002748,-0.004212,-0.001118,-0.000648,0.001087,0.00299,0.00126,-0.000351,-0.004124,-0.001199,-0.000285,0.002133,0.000257,-0.00093,5e-04,0.002074,-0.003605,-0.004185,-0.002178,-0.001484,2.4e-05,6.7e-05,0.000654,0.001069,-5.2e-05,0.000499,-0.000251,-0.001045,-9.2e-05,0.00019,4.2e-05,-6.6e-05,0.000537,0.000632,5.5e-05,0.000193,-0.000157,0.000525,3.8e-05,-2.7e-05,-0.000259,-0.000127,2.9e-05,-0.00012,-0.000289,-0.000347,-0.000294,-0.000121,-9.2e-05,7.3e-05,2.3e-05,-3.2e-05,0.000108,0.000264,0.000158,-7.3e-05,6.6e-05,3e-06,7e-05,0.00015,-4e-05,-0.000107,2.1e-05,-4.1e-05,6.2e-05,-2.4e-05,-0.000108,3e-06,1.1e-05,-0.000105,0.000111,-4.4e-05,3.4e-05,1e-06,-4.5e-05,4.8e-05,-0.000115,-5.1e-05,-0.000123,3.2e-05,-7.2e-05,-7e-05,7e-05,6e-06,0.000141,1.1e-05,-5.3e-05,1.6e-05
-3.7e-05,-5.2e-05,2.7e-05,-8e-06,-1.5e-05,1.9e-05,9e-06,3e-06,-2e-05,6.8e-05,-0.000181,9.9e-05,6.8e-05,-0.001089,-0.000504,0.000443,-7.7e-05,-0.000399,-0.000122,-0.000769,-0.000742,-0.001243,-0.001549,-0.001462,-0.003133,-0.00094,0.004672,0.001213,-0.000393,0.000781,-0.000762,1.2e-05,-0.001145,-0.000243,-0.000527,0.000694,0.000642,0.000595,0.002554,-0.000503,-0.001365,0.001484,0.001241,0.001933,-0.001226,0.002583,0.002063,0.000224,0.000703,0.001973,4e-05,-0.000432,-0.000284,0.000569,-0.00067,-6.9e-05,0.000278,0.00016,0.000441,0.000701,-0.00017,-0.000149,-0.000393,0.000252,-0.000122,-0.000417,-0.000395,-0.000136,-0.000182,0.000125,-0.000308,-0.000254,3e-05,-0.00012,0.000324,9.4e-05,7e-05,-0.000278,-1e-06,5.4e-05,-2.4e-05,-4.4e-05,7.3e-05,5.4e-05,8.3e-05,2.8e-05,-0.000276,-0.00018,-7.4e-05,-0.000156,-0.000124,-6.2e-05,-8.9e-05,-5.3e-05,-6.7e-05,6.8e-05,7.7e-05,-4.6e-05,-0.00016,7.9e-05,-5.7e-05,-4.8e-05,4.1e-05,-2.2e-05,-8.6e-05,-7.4e-05,-4.2e-05,-1.1e-05,-5.5e-05,2.6e-05,7.4e-05,5e-05,-2.7e-05,-4e-06,0.000105,3.9e-05,-3.9e-05,-0.000266,-0.000147,3.5e-05,-2e-05
-9e-06,4.4e-05,1e-06,1.3e-05,6e-06,-3.7e-05,3.5e-05,3e-05,3.3e-05,-3e-06,-7.2e-05,-0.000253,-3e-06,0.000114,-0.00031,-0.001152,-0.000173,0.000189,0.000329,7.2e-05,0.001356,-0.001758,0.000543,-0.002675,7.7e-05,0.00136,-0.003201,0.001166,-0.000702,-0.000589,0.002659,-0.000263,-0.001154,0.002336,0.002136,-0.000168,0.001947,0.000263,-0.001239,0.001487,-1.5e-05,-0.000182,-0.001088,0.000467,0.000716,-0.000538,0.000176,0.001914,-0.000777,-0.002656,-0.000398,-1.5e-05,0.00061,-0.001485,0.000597,0.001252,-0.000201,-0.000278,-0.000116,-0.00061,0.00022,0.000248,-0.000326,-0.000299,-5e-05,-0.000186,9.4e-05,0.000293,5.7e-05,-0.000351,-4.6e-05,-0.000185,-8.5e-05,-0.000119,-3.2e-05,-3e-06,-6.6e-05,0.000181,0,-1.8e-05,2.1e-05,-6.6e-05,-6.7e-05,1e-04,0.000109,0,0.000388,2e-04,4.7e-05,-4.2e-05,6.8e-05,2.9e-05,2.1e-05,-1.9e-05,0.000136,9.1e-05,1.9e-05,8.3e-05,4.7e-05,-0.000105,3.8e-05,1.5e-05,2.3e-05,4e-05,1.2e-05,6.7e-05,-2.3e-05,8.6e-05,4.6e-05,1.6e-05,6.1e-05,2e-05,-4e-05,1.5e-05,-1.7e-05,-2.5e-05,5.8e-05,4.2e-05,6.8e-05,-4e-06,-1.4e-05
4e-05,-1.1e-05,-2.7e-05,-7e-06,-1.4e-05,1.3e-05,3e-06,3e-06,-2.4e-05,-6.5e-05,3.9e-05,0.000367,-0.000368,-0.000523,-7.8e-05,-0.000309,6.9e-05,-0.000286,-0.000245,0.000471,0.001181,-0.001513,-0.001142,-0.000679,-0.001828,-0.001412,-0.000435,-0.000171,0.001029,0.000302,-0.003079,-0.001299,0.001032,-0.003485,-0.000414,-0.000925,-0.002952,-0.000226,-0.001579,-0.000759,0.001226,0.001588,3.8e-05,-0.0011,-0.001743,-0.000184,-0.00029,-0.002671,-0.001637,0.001282,0.000168,-0.00034,-0.001241,-0.000176,-0.000498,-0.000168,0.00021,-0.00049,-0.000142,-5.7e-05,0.000331,9.1e-05,0.000222,0.000216,7.5e-05,1e-05,7e-06,0.000128,-0.00022,8.4e-05,3.1e-05,0.000206,5.2e-05,1.2e-05,-0.000232,6.7e-05,8.5e-05,5.4e-05,6.4e-05,7.8e-05,0.000131,0.00025,1.5e-05,-9e-05,-0.000181,2.9e-05,-0.000122,-0.000153,-8e-05,2.9e-05,-1.6e-05,-4.1e-05,0.000147,4.5e-05,-6e-06,-4.6e-05,3.8e-05,4.9e-05,6.8e-05,5.9e-05,3.5e-05,-3.5e-05,-4.4e-05,-4e-05,4.4e-05,-4e-06,1e-06,-2e-06,-1e-05,1.3e-05,1e-06,2.3e-05,-6.1e-05,-4.7e-05,-9e-06,-9.1e-05,-2.3e-05,-2.6e-05,-2.2e-05,4.2e-05,3.2e-05
-2.4e-05,-1.5e-05,1e-05,-1.6e-05,2e-06,-1.5e-05,-7e-06,1.2e-05,-1e-05,4.7e-05,-0.000105,-0.000296,0.000502,4.8e-05,1.7e-05,-0.000565,-0.000176,-0.000126,0.000407,-9.6e-05,0.000473,0.000722,0.000256,0.000959,-0.000287,0.000484,-0.000827,-0.000351,-0.001069,-0.001213,0.000139,-0.001472,-0.000139,0.000939,0.000373,-0.000703,-0.00023,3e-06,7e-06,0.000607,0.000686,1e-04,0.00057,0.000205,-5e-04,-0.000602,0.001174,0.002012,0.000759,0.000296,-0.00013,0.002265,0.001482,0.000834,0.00016,-0.000316,-0.000129,0.000142,-0.000107,-0.000281,9.7e-05,3e-06,5.9e-05,8.6e-05,-8e-05,0.000247,0.00015,0.000225,0.000107,-0.000109,-0.000154,-0.000194,-0.000125,9.1e-05,0.00015,-6.8e-05,-0.000117,-1e-06,-1.8e-05,-4.9e-05,-1.1e-05,-7.7e-05,-2.7e-05,1.6e-05,-7e-05,-7.4e-05,-1.4e-05,-6e-06,0.000117,5.9e-05,4e-05,-4.3e-05,4e-06,1e-06,3.8e-05,4e-06,-8.6e-05,-7.3e-05,-8.3e-05,8e-06,2.4e-05,-4.5e-05,0,5.8e-05,1.5e-05,-1.5e-05,-5.5e-05,6.4e-05,-2.6e-05,4e-06,-2e-06,-1.5e-05,3.5e-05,3.1e-05,-9e-06,3.6e-05,-2.4e-05,4.6e-05,2e-05,-2.1e-05,-3.8e-05
1.1e-05,-1.5e-05,-4e-05,2e-06,-5e-06,-2.1e-05,-1.2e-05,1.2e-05,-1e-05,1.1e-05,-6.9e-05,7e-06,-0.00037,-0.00014,0.000167,0.000886,2.4e-05,0.000409,-0.000506,-0.000544,-0.000243,0.001336,0.001383,0.000824,-1.2e-05,-8.2e-05,-0.000313,-0.001449,-0.000661,-0.00029,-0.000627,0.001252,0.000315,-0.000202,8.7e-05,0.002509,0.000632,-0.001291,-0.000466,-0.001729,0.000417,-0.000266,7.6e-05,8.1e-05,0.00107,-0.000171,-0.000282,-0.000704,0.00086,0.001053,-0.000306,-0.000953,-0.000464,-0.000221,-0.00041,0.000429,-0.000219,-5.7e-05,4.5e-05,0.000173,-0.00018,-0.000142,0.000179,-0.000163,0.000221,-0.000118,-0.000132,-0.00028,-7.2e-05,0.000112,5.9e-05,-1e-05,0.000123,1.1e-05,0.000162,-9.9e-05,3.3e-05,7e-05,1.8e-05,-5.9e-05,-8.3e-05,-1e-06,8.2e-05,6.8e-05,4.2e-05,4.3e-05,0.000168,3.4e-05,1.8e-05,-3e-05,-2.5e-05,-1.7e-05,-6e-06,6.3e-05,1e-06,-1.6e-05,4.8e-05,-7e-06,1.1e-05,-7e-06,-2.3e-05,3.2e-05,-2e-06,-5.2e-05,-1.6e-05,1.1e-05,-2.5e-05,-5e-06,2e-06,6e-06,-2.4e-05,-2.1e-05,1.3e-05,-4.2e-05,-7e-06,3.8e-05,1.4e-05,5.3e-05,-1.6e-05,1e-06,-1.6e-05
-5e-06,4e-06,9e-06,1.1e-05,-5e-06,7e-06,-1.7e-05,-6e-06,1.6e-05,-3.9e-05,5e-05,6.2e-05,-0.000145,0.000171,-0.000579,0.000229,0.000106,0.000207,0.000555,-0.00022,-0.000496,0.000876,-0.000588,-0.000425,0.000298,7.8e-05,0.000732,0.000313,-4.7e-05,0.000296,-0.000372,-3e-05,0.000324,0.001708,-0.001991,-0.001451,-3.4e-05,-0.000123,0.000479,0.001938,-0.000336,-0.00053,-0.000481,-0.000465,4.6e-05,0.001355,0.000219,-0.000148,-0.000633,-0.000836,0.000515,0.00024,-9.8e-05,4.4e-05,0.000242,-0.000745,0.000181,-4.1e-05,6.3e-05,-8.7e-05,-5.4e-05,3.1e-05,4e-05,-9e-05,-0.000139,-6.3e-05,8.9e-05,0.000139,6.3e-05,-3.4e-05,5.8e-05,-7e-06,7e-06,2.6e-05,-5.7e-05,-1.6e-05,4.1e-05,-6.6e-05,-3.1e-05,-5.8e-05,-1.4e-05,2e-06,-5e-06,-5.7e-05,-2.2e-05,-1.3e-05,-0.000128,0,5e-06,2.1e-05,-2e-06,4e-06,-3.6e-05,-3.2e-05,-9e-06,-3.3e-05,1e-05,3.8e-05,-3.2e-05,5e-06,-1.5e-05,3e-06,1.4e-05,1.4e-05,-7e-06,-1.5e-05,0,-3.2e-05,-1.1e-05,-2.3e-05,0,8e-06,-2.3e-05,-2e-06,-1.9e-05,-2.5e-05,-4e-06,-3.2e-05,3.5e-05,-1.8e-05,-2.5e-05
-4e-06,-5e-06,4e-06,-2e-06,1.1e-05,-1e-05,1e-06,2.7e-05,-1.8e-05,1e-05,-4.3e-05,1.3e-05,-0.000115,4.6e-05,0.000151,-0.000448,-1.1e-05,-0.000242,-0.000281,0.000453,-0.000154,-0.000465,-0.000976,-0.000535,0.00016,-8.8e-05,7.7e-05,0.000292,3e-05,-0.000279,-0.000125,0.000278,-0.000744,-0.000755,0.00128,-0.000255,-0.000378,-0.000142,-0.000428,-0.000638,-0.000611,0.000264,0.000686,6.1e-05,0.000875,3.6e-05,-0.000628,0.000887,-0.000829,0.00049,-0.000196,-0.000124,-0.000151,-0.000397,-7.9e-05,0.000217,-9.8e-05,0,-0.000178,7.9e-05,3.6e-05,0.000166,1.6e-05,-2.8e-05,-8.3e-05,-6.9e-05,5.4e-05,-0.000147,-0.000147,8e-06,-5.2e-05,0.000114,-2.5e-05,1.4e-05,-1.9e-05,4.1e-05,-6.2e-05,-3e-05,1.4e-05,9e-06,-1.5e-05,-1.2e-05,2e-06,1.3e-05,-3.2e-05,-1.9e-05,6e-05,7e-06,-6e-06,-5e-05,-1.5e-05,-2e-06,1e-06,2.8e-05,-7e-06,3e-05,9e-06,-3.8e-05,-3.8e-05,-2.9e-05,1.2e-05,3e-06,4e-06,1e-06,-1.6e-05,-1e-06,1.6e-05,1e-06,1.8e-05,1.5e-05,1e-05,-1.2e-05,5.7e-05,1e-06,-1.7e-05,-4e-06,8e-06,4e-05,-1.1e-05,3e-06,3e-06
-3e-06,0,-5e-06,-9e-06,-6e-06,3e-06,-6e-06,-1.1e-05,3e-06,3e-06,-8e-05,3.5e-05,0.000304,-8.7e-05,-0.000285,0.000205,-1e-06,0.000123,0.000195,-0.000286,-0.000322,-0.000497,-0.000192,0.000111,0.000225,-0.000104,-0.001012,0.000833,0.000267,0.000139,-1.8e-05,-0.000408,-0.000179,-0.00034,4.7e-05,0.000766,0.000137,-0.000228,-0.000226,0.000157,-0.000215,-0.000929,-1.1e-05,0.000324,-0.000446,0.000127,-0.000244,-0.000718,0.000515,-0.000355,-0.000174,0.000216,-9.7e-05,9.5e-05,0.000287,-0.000451,2.3e-05,0.000129,-6.7e-05,-2.1e-05,0.000117,1.4e-05,8e-06,-7e-05,5.4e-05,7e-05,-5.1e-05,-0.000117,4.6e-05,-1.9e-05,-2.6e-05,6.4e-05,-3.9e-05,-1.2e-05,-2.4e-05,-5e-05,1.9e-05,-2.6e-05,-2e-06,-1.2e-05,3.1e-05,2.2e-05,-1.3e-05,-2e-05,-1.3e-05,5e-06,-5.4e-05,-6.4e-05,-1.8e-05,4e-06,1.8e-05,5e-06,1.4e-05,2e-06,-9e-06,4e-06,-1.3e-05,-5e-06,2.7e-05,2.1e-05,-1.1e-05,-9e-06,-1.3e-05,-1.5e-05,-2e-06,8e-06,-8e-06,-7e-06,-1.8e-05,-1.3e-05,1.1e-05,2e-06,-3e-05,2.7e-05,-5e-06,-2e-06,1e-06,-1.5e-05,1e-06,-5e-06,7e-06
2e-06,4e-06,-4e-06,3e-06,8e-06,-3e-06,-3e-06,1e-06,0,7e-06,-2e-06,-3.2e-05,-3.3e-05,0.00013,0.000116,-0.000188,3e-06,-0.000168,-1.2e-05,-0.000133,1.1e-05,-0.000313,0.000194,0.000144,0.000463,-0.000255,-0.000424,-0.000223,-0.000359,-0.000216,0.000701,0.000358,-0.000283,-0.000447,-0.00035,0.000283,6e-06,-0.000188,-0.000502,3.1e-05,-0.000101,0.000827,0.000118,0.000452,0.00014,-0.000502,0.000558,0.000261,-0.00034,0.000248,0.000112,-0.000499,0.000253,0.000208,-0.000196,3.6e-05,4.5e-05,3.2e-05,3.4e-05,7.2e-05,-0.000115,-1.6e-05,-4e-05,-4e-05,-9e-06,5.3e-05,3.3e-05,6.4e-05,8.3e-05,-3e-06,3.5e-05,-6.1e-05,4.8e-05,1.5e-05,2.2e-05,-4.5e-05,5e-06,1.5e-05,-2.4e-05,-2.3e-05,1e-06,-2e-05,-1e-05,-1.3e-05,2.1e-05,-9e-06,2.5e-05,3.9e-05,-3e-06,-5e-06,7e-06,1e-06,-3e-06,-2e-06,-1.2e-05,-3e-06,2e-06,1e-05,-2e-06,-1.9e-05,8e-06,-1.5e-05,2e-06,1e-06,-5e-06,6e-06,1.5e-05,-2.3e-05,9e-06,-2e-06,1e-06,-6e-06,3e-06,-2e-05,3e-06,7e-06,-7e-06,2e-06,1e-06,9e-06,-2e-06
1e-06,2e-06,5e-06,5e-06,-2e-06,0,-2e-06,-6e-06,-4e-06,-1e-06,8e-06,-7e-06,-0.000107,-7.2e-05,-2.4e-05,-7.3e-05,-4.4e-05,0.000143,-2e-05,-0.000131,0.00031,-0.000167,7.2e-05,-0.00014,-0.000371,0.000176,0.000107,-0.000284,-0.000231,-0.000101,-0.000237,9.6e-05,-9.6e-05,1.7e-05,5.2e-05,-0.000335,-0.000258,-1e-04,0.00034,-0.000283,0.00027,-9.6e-05,-0.000224,-0.000521,-0.000252,-8e-06,-0.000186,-0.000439,0.000268,-0.000115,8.1e-05,0.000199,0.000233,0.000118,7.5e-05,4.7e-05,7.5e-05,7.1e-05,0.000148,-4.4e-05,1.8e-05,3e-06,-4.6e-05,4.7e-05,-1e-06,1.8e-05,-2.4e-05,-6.9e-05,-9e-06,-6e-06,-2.6e-05,3.7e-05,-2.5e-05,-4e-05,-1.6e-05,-3e-06,-2.4e-05,4e-05,-1.6e-05,-3e-06,2e-06,-6e-06,2.4e-05,-1e-06,2.6e-05,1e-06,-2.7e-05,-4e-05,8e-06,1.6e-05,-1.5e-05,4e-06,-2.9e-05,-1.2e-05,3e-06,-7e-06,-3e-06,1.2e-05,-1.3e-05,1.2e-05,-4e-06,-4e-06,7e-06,3e-06,5e-06,-7e-06,6e-06,8e-06,-5e-06,0,2e-06,4e-06,-1.6e-05,1e-06,-1.2e-05,5e-06,-5e-06,-2e-05,5e-06,3e-06,1e-06
-2e-06,-5e-06,-7e-06,-1e-05,4e-06,0,2e-06,-2e-06,-2e-06,-4e-06,-5.2e-05,-2.7e-05,6e-05,-2.8e-05,0.000206,7e-05,-1.6e-05,-6.3e-05,4.3e-05,0.000119,0.000327,0.000431,0.000197,-0.000188,8.4e-05,-3.6e-05,0.000438,-8.5e-05,0.000216,-1e-05,0.00032,-0.000466,0.000194,1e-04,-3e-05,-0.000382,7.6e-05,-6.2e-05,0.000545,0.000531,0.000126,0.00033,8e-05,0.000132,2.9e-05,4.6e-05,-1.6e-05,0.00043,0.000366,-0.000271,0.000119,-3.4e-05,-7.6e-05,-0.000325,-0.000206,-5e-05,-3.7e-05,2.9e-05,-6.3e-05,4.6e-05,4.4e-05,-3.1e-05,-8.5e-05,-1.8e-05,-2.6e-05,1.1e-05,-1.1e-05,4e-05,-9e-06,1.8e-05,1.8e-05,-1.4e-05,2.5e-05,-2.6e-05,1.7e-05,-3e-06,2.7e-05,2e-05,9e-06,2.2e-05,-1.8e-05,-9e-06,-2e-06,1.3e-05,1e-06,-2e-05,7e-06,1.1e-05,-1e-05,-1.1e-05,3e-06,-7e-06,8e-06,1.4e-05,4e-06,-1e-06,-2e-06,-1e-05,6e-06,0,1.6e-05,1.1e-05,-3e-06,6e-06,7e-06,5e-06,2e-06,-5e-06,6e-06,-3e-06,-1.1e-05,2e-06,0,-1.5e-05,3e-06,1e-06,7e-06,-8e-06,-2e-06,3e-06,2e-06
1e-06,-1e-06,-2e-06,2e-06,-5e-06,-4e-06,0,-3e-06,0,0,-1.7e-05,-4e-06,-0.000161,-6e-06,-0.000172,-0.000114,-3e-06,5.6e-05,-2.7e-05,-2.1e-05,-7.2e-05,0.000144,-7.9e-05,-5.6e-05,-0.000188,-7e-06,0.000133,-0.000303,6.7e-05,0.000236,-0.000323,0.000126,-0.000108,0.000164,-0.000157,0.000313,-2.5e-05,-6.2e-05,9.7e-05,-7.9e-05,0.000144,-0.000202,7e-05,-6.8e-05,0.000218,-2.1e-05,-0.000195,-0.000178,-0.000145,7.3e-05,-2.5e-05,-7.8e-05,-0.000149,-4.7e-05,0.000104,-7.5e-05,2.4e-05,-6.1e-05,-6e-06,-6e-06,5.7e-05,0,4.6e-05,-5e-06,1.3e-05,-2.3e-05,-9e-06,-8e-06,-3.9e-05,4e-06,2.4e-05,5e-05,-1.7e-05,1.2e-05,3.1e-05,-1.1e-05,-1.4e-05,-1.1e-05,2e-05,-6e-06,3e-06,1.6e-05,5e-06,5e-06,-8e-06,7e-06,1e-06,3e-06,1e-06,1.3e-05,6e-06,-2e-06,-2e-06,-5e-06,-1e-06,0,0,1.8e-05,3e-06,0,-1.2e-05,-4e-06,-1e-06,-7e-06,-5e-06,-7e-06,-1.3e-05,-1.3e-05,-6e-06,-2e-06,-5e-06,-3e-06,1.3e-05,3e-06,5e-06,1e-06,-7e-06,1.7e-05,0,-1e-06,1e-06
0,-1e-06,-2e-06,2e-06,4e-06,-2e-06,2e-06,-2e-06,2e-06,2e-06,9e-06,1.6e-05,2e-06,-2.7e-05,5.9e-05,0.00014,7e-06,-4.3e-05,1e-06,-0.000142,-0.000116,-0.000289,-0.000158,-2.5e-05,0.000238,-2e-06,8e-06,0.000393,-1.1e-05,0.000161,4e-04,-0.000112,0.000127,-1.1e-05,0.000554,-3.7e-05,3.4e-05,1e-05,-0.000329,-2.5e-05,7.4e-05,-0.000249,-0.000175,9e-05,-5.6e-05,0.000294,-0.000136,-6e-06,-0.000145,-0.000168,-0.000138,9.5e-05,7.7e-05,1e-04,6.8e-05,-1.4e-05,4e-05,-1.2e-05,3.3e-05,2e-06,-3.6e-05,3.3e-05,5.3e-05,4.1e-05,-6e-06,-5e-06,5.2e-05,-2.7e-05,2.2e-05,6e-06,-3.2e-05,-2.7e-05,-1.6e-05,-4e-06,-4.3e-05,0,0,-2.3e-05,7e-06,3e-06,-2e-06,7e-06,-1e-06,3e-06,9e-06,9e-06,-1.9e-05,-7e-06,-3e-06,-5e-06,-2e-06,-1e-06,-1e-06,4e-06,4e-06,5e-06,8e-06,-9e-06,-6e-06,-1e-06,-4e-06,-1e-06,0,6e-06,-3e-06,2e-06,2e-06,-1e-06,-1e-06,3e-06,-3e-06,-3e-06,-1.2e-05,-5e-06,-3e-06,-3e-06,-1e-06,-8e-06,0,-7e-06,3e-06
0,-5e-06,2e-06,0,-6e-06,0,4e-06,-5e-06,1e-06,-1e-06,-2e-05,1.6e-05,3.1e-05,-8e-06,-0.00012,-0.000144,-1.5e-05,4.6e-05,-2.4e-05,-0.000104,-6e-05,-0.000224,0.000116,0.000212,-9.1e-05,-2.7e-05,-0.000178,-0.000105,0.000142,-7.2e-05,-0.000333,4.9e-05,-0.000132,-0.000289,-0.000506,-9.4e-05,-0.000255,1.9e-05,-0.000136,-0.000163,-0.00018,3.2e-05,0.000134,-4e-06,0.00014,-6.9e-05,0.00016,0.00011,0.000265,0.000254,0.000124,8.9e-05,2e-06,1.6e-05,-2.4e-05,7e-05,4e-06,-3.1e-05,-7.5e-05,2e-06,-3.8e-05,-1e-05,4.4e-05,-1.4e-05,9e-06,8e-06,-2e-05,2e-06,-7e-06,-2e-05,1.1e-05,-2.5e-05,2.4e-05,2.7e-05,-6e-06,1e-06,-3e-06,-7e-06,5e-06,-2e-06,-1.1e-05,-1.6e-05,-1.1e-05,-1.8e-05,0,-2e-06,4.9e-05,1.8e-05,-2e-06,8e-06,-1.1e-05,-1e-06,-4e-06,3e-06,2e-06,3e-06,3e-06,2e-06,1e-06,3e-06,3e-06,4e-06,2e-06,-1e-06,-1e-06,-4e-06,-4e-06,-4e-06,0,1e-06,9e-06,1e-06,1.5e-05,4e-06,3e-06,-3e-06,3e-06,1.3e-05,-1e-06,-1e-06,-1e-06
-1e-06,-1e-06,-2e-06,-4e-06,1e-06,-1e-06,2e-06,3e-06,-2e-06,-1e-06,-2.3e-05,2.2e-05,6.7e-05,1e-05,-5e-06,-0.000135,-1e-06,-3.6e-05,4.3e-05,0.000117,-0.00019,0.00027,-0.000198,-3.2e-05,0.000116,-7e-06,-0.000169,0.000129,-1.8e-05,6.1e-05,7.5e-05,-0.000106,-0.000179,-2.6e-05,0.000103,-0.000197,1.4e-05,0.000215,-8.1e-05,0.000105,-1e-04,0.000224,-1.6e-05,0.000232,-0.00012,-0.000202,3.1e-05,-0.000166,6.8e-05,-0.000124,-3.8e-05,-7.6e-05,-4e-05,3.5e-05,-4.1e-05,-9.4e-05,-3.5e-05,2e-06,2.9e-05,-1e-06,-3.6e-05,-1.8e-05,1.2e-05,1.2e-05,9e-06,1.7e-05,-1.4e-05,3.6e-05,1.4e-05,-5e-06,9e-06,1e-05,2e-06,-9e-06,2.1e-05,-4e-06,7e-06,-1.2e-05,0,-1e-06,1.4e-05,8e-06,4e-06,-5e-06,-7e-06,-3e-06,-3.4e-05,-2.2e-05,1.1e-05,-1.9e-05,7e-06,-1e-06,-7e-06,5e-06,-3e-06,0,0,0,-5e-06,-3e-06,-5e-06,-7e-06,1e-06,0,2e-06,2e-06,-4e-06,5e-06,0,4e-06,1e-06,0,-4e-06,-3e-06,2e-06,3e-06,-1e-06,-9e-06,7e-06,1e-06,1e-06
0,2e-06,-5e-06,2e-06,-2e-06,1e-06,2e-06,-3e-06,-1e-06,1e-06,6e-06,-3.7e-05,4e-06,1.6e-05,-3.2e-05,9.3e-05,-1e-05,3e-06,-3.2e-05,-2.8e-05,4.4e-05,0.000185,-0.000175,-9e-06,6e-06,4.4e-05,0.000355,-0.000125,-4.2e-05,-9.8e-05,-1.7e-05,4e-05,-7.3e-05,-0.000197,0.00027,0.000457,-9e-06,5.3e-05,0.000187,5e-05,-9.4e-05,-0.00029,-3.8e-05,-5.3e-05,-2.3e-05,-0.000121,0.000115,0.000157,-2.3e-05,0.000122,2.8e-05,-0.000187,6e-06,2.8e-05,5.8e-05,0.000125,-5e-06,3.8e-05,4.2e-05,-1.5e-05,4.7e-05,2.7e-05,-7e-06,5e-06,-1.6e-05,-2.9e-05,2.6e-05,-1.2e-05,-2.2e-05,0,-1.6e-05,1.5e-05,-2e-05,5e-06,2.4e-05,3e-06,-3e-06,-2e-06,-5e-06,-2e-06,1e-05,-2e-06,5e-06,-2e-06,-4e-06,-1e-06,1.9e-05,1e-05,4e-06,8e-06,-1e-06,-1e-06,-3e-06,-5e-06,1e-06,-1e-06,3e-06,-1e-06,-7e-06,-2e-06,3e-06,0,-4e-06,-2e-06,2e-06,4e-06,-4e-06,4e-06,1e-06,1e-06,2e-06,-1e-06,-1e-06,1e-06,2e-06,3e-06,1e-06,8e-06,-2e-06,5e-06,-2e-06
1e-06,-1e-06,4e-06,1e-06,1e-06,0,-1e-06,-1e-06,0,0,-8e-06,1.1e-05,-9.8e-05,0,7.9e-05,-6.9e-05,0,6.4e-05,2.6e-05,-8.5e-05,0.000115,-4.9e-05,9.9e-05,-5.8e-05,-3.4e-05,-6.1e-05,0.000134,2.4e-05,5.7e-05,1.8e-05,-5e-06,-1.5e-05,-0.00014,0.000306,-0.000175,-0.000141,7.2e-05,-6.9e-05,0.000277,3.2e-05,0.000131,0.000276,-7e-05,-7.7e-05,2.4e-05,0.00012,4.7e-05,-0.000166,-0.000134,-0.000228,5e-06,0.000195,5.9e-05,-0.000101,-3.8e-05,-3.7e-05,3.5e-05,-1e-05,1.2e-05,-4e-06,2e-05,9e-06,-2.2e-05,9e-06,6e-06,-5e-06,-2.4e-05,2e-06,1.5e-05,9e-06,1.1e-05,9e-06,2e-05,7e-06,-3.4e-05,1e-06,-6e-06,4e-06,-1e-05,-2e-06,-1e-05,1.3e-05,6e-06,0,2e-06,7e-06,-7e-06,-1e-05,-6e-06,0,2e-06,-1e-06,1e-06,1e-06,-1e-06,-4e-06,0,-1e-05,2e-06,-3e-06,-1e-06,4e-06,1e-06,4e-06,-3e-06,-2e-06,3e-06,-4e-06,-5e-06,2e-06,-4e-06,-1e-06,-2e-06,-3e-06,0,-2e-06,1e-06,-1e-06,-6e-06,1e-06,1e-06
-1e-06,-2e-06,-4e-06,1e-06,0,0,0,2e-06,0,0,-1.6e-05,-2.1e-05,7e-06,3e-06,-1.2e-05,3.8e-05,-3e-06,-4.8e-05,-3.8e-05,-6.2e-05,1.1e-05,-0.000124,1.7e-05,-0.000105,6e-06,-6e-06,-7.3e-05,2.4e-05,6.5e-05,9.8e-05,-1.7e-05,2.6e-05,6.9e-05,-0.000204,1e-04,-0.000179,-8.5e-05,-5.3e-05,-0.000125,-2.5e-05,0.000117,-0.000238,6.2e-05,-6.6e-05,4.4e-05,0.000137,-0.000124,0.000142,-0.000113,0.000193,-4.1e-05,-9.1e-05,-4.2e-05,-3e-05,-2.2e-05,8e-06,-4.4e-05,-3.1e-05,-2.2e-05,-7e-06,-1e-05,-3.4e-05,-2.9e-05,6e-06,-1.2e-05,2.5e-05,-7e-06,0,-6e-06,3e-06,0,-1.2e-05,-1.5e-05,-1.1e-05,-2e-06,1e-06,1.3e-05,1.3e-05,-5e-06,-9e-06,4e-06,-6e-06,-2e-06,3e-06,3e-06,-2e-06,6e-06,1e-05,-2e-06,4e-06,-2e-06,1e-06,4e-06,-3e-06,-3e-06,2e-06,1e-06,1.2e-05,-1e-06,5e-06,4e-06,-2e-06,3e-06,-3e-06,-1e-06,3e-06,2e-06,8e-06,2e-06,0,-2e-06,-1e-06,-2e-06,-4e-06,-2e-06,-1e-06,-3e-06,-7e-06,7e-06,0,0
1e-06,1e-06,-2e-06,-2e-06,1e-06,-1e-06,-1e-06,-2e-06,1e-06,0,-1e-06,1.5e-05,5.1e-05,4e-06,3.5e-05,-2.7e-05,-5e-06,1e-06,3.2e-05,3.8e-05,0.000122,-1e-04,4.3e-05,7.9e-05,-2.6e-05,-6.4e-05,-0.000261,-7.9e-05,-7.9e-05,-4.2e-05,-8.3e-05,-6.8e-05,-1.5e-05,0.000158,1e-05,0.000203,-7.6e-05,6.2e-05,-0.000241,-5.8e-05,-7e-06,0.000185,4e-06,3.2e-05,5.1e-05,4.8e-05,3e-06,-6.5e-05,3.9e-05,-0.00017,3.4e-05,6.9e-05,-4.4e-05,8.4e-05,4.7e-05,4.5e-05,-7e-06,-1.5e-05,-9e-06,-1e-05,-1.3e-05,5e-06,-2.3e-05,-1.1e-05,4e-06,1e-06,9e-06,1.3e-05,1.6e-05,-1e-06,-1e-05,5e-06,7e-06,8e-06,8e-06,0,-1.3e-05,7e-06,1e-06,-1e-06,0,-5e-06,-7e-06,1e-06,-2e-06,-3e-06,-8e-06,-7e-06,-4e-06,0,0,1e-06,0,-2e-06,1e-06,1e-06,-1e-06,-5e-06,-2e-06,-4e-06,-5e-06,-1e-06,-1e-06,1e-06,2e-06,-5e-06,1e-06,7e-06,-1e-06,-1e-06,-2e-06,0,2e-06,-1e-06,1e-06,0,2e-06,2e-06,-1e-06,-3e-06,-1e-06
-1e-06,-1e-06,2e-06,1e-06,1e-06,-1e-06,-1e-06,3e-06,-1e-06,0,0,1.1e-05,-1e-05,-1e-06,-3.3e-05,-1.6e-05,-2e-06,-7e-06,-6e-06,2.4e-05,-4.8e-05,-7e-05,-2.8e-05,2.6e-05,0.000115,-4.3e-05,-9.7e-05,5e-05,-5.4e-05,-1e-05,0.000115,0.000102,2.4e-05,-0.000264,-9.4e-05,-8.4e-05,3e-06,3.9e-05,-6.3e-05,-4.1e-05,8e-06,-6.5e-05,-2.9e-05,3.3e-05,-6.6e-05,-6.6e-05,-5.3e-05,5.7e-05,8.6e-05,0.000188,-2.8e-05,-6.6e-05,2.7e-05,1.1e-05,-3.8e-05,-6.4e-05,1.8e-05,0,2.1e-05,1.4e-05,1e-06,1.1e-05,-3e-06,9e-06,6e-06,-1.4e-05,0,2.8e-05,-3e-06,-7e-06,5e-06,1.6e-05,2e-06,-1.7e-05,4e-06,4e-06,4e-06,-1.4e-05,2e-06,-4e-06,-6e-06,3e-06,1e-06,-4e-06,-3e-06,2e-06,-9e-06,3e-06,0,0,-2e-06,0,2e-06,-2e-06,-1e-06,1e-06,-2e-06,1e-06,2e-06,3e-06,5e-06,0,-1e-06,2e-06,0,2e-06,0,-2e-06,1e-06,-1e-06,1e-06,0,-4e-06,-2e-06,-1e-06,1e-06,0,-7e-06,-2e-06,-2e-06,0
1e-06,-2e-06,-2e-06,-1e-06,0,0,-1e-06,-2e-06,1e-06,0,-1.2e-05,-7e-06,3e-06,-1.3e-05,-2.4e-05,2.6e-05,1e-06,2.7e-05,-4e-06,-5.5e-05,-0.000113,0.000109,-0.000114,-3e-05,-4.2e-05,-5e-06,1.9e-05,-1.4e-05,5.4e-05,-5.6e-05,-7.3e-05,1.4e-05,1.8e-05,0.000187,0.000203,3e-05,-6.1e-05,-2.7e-05,0.000151,1e-04,-0.000164,-2.5e-05,-3e-06,-2.3e-05,-1e-05,-0.000154,-1.7e-05,-1.4e-05,2e-05,-0.000183,3.8e-05,0.000112,3.7e-05,-6.6e-05,-1e-05,4.2e-05,-2.9e-05,2.2e-05,-2.9e-05,-1.7e-05,1.3e-05,-2e-06,1.5e-05,-1e-05,-6e-06,-3e-06,-1e-06,-8e-06,-2e-06,-6e-06,4e-06,8e-06,-7e-06,2e-06,-8e-06,-4e-06,6e-06,-1.1e-05,2e-06,-4e-06,3e-06,-1e-06,0,-2e-06,2e-06,4e-06,1.1e-05,1e-06,8e-06,-5e-06,2e-06,1e-06,3e-06,1e-06,0,-1e-06,2e-06,1e-06,-3e-06,1e-06,-3e-06,-1e-06,0,-1e-06,-1e-06,-1e-06,3e-06,3e-06,-2e-06,-1e-06,3e-06,0,3e-06,-1e-06,-2e-06,0,-1e-06,9e-06,-1e-06,-2e-06,-1e-06
0,0,0,1e-06,1e-06,0,-1e-06,2e-06,-1e-06,0,-4e-06,1.1e-05,-1.9e-05,4e-06,-3.2e-05,-7.2e-05,2e-06,-1.2e-05,-6e-06,-5.7e-05,1.9e-05,0.000179,-4e-06,-9.5e-05,5e-05,-1.4e-05,0.00016,0.000148,-6e-06,-3.2e-05,6.6e-05,-4e-06,-8e-05,-8.8e-05,-6e-06,-0.000142,2.1e-05,-4.9e-05,0.000126,-1.6e-05,-8.6e-05,1.2e-05,5.4e-05,4.3e-05,-7.3e-05,-1.5e-05,3.6e-05,-3.4e-05,-4.5e-05,0.000122,2e-05,-0.000124,2.8e-05,7e-06,3.8e-05,-1.8e-05,1e-06,2.6e-05,-1.5e-05,1.7e-05,-3e-06,-6e-06,3.2e-05,-8e-06,3e-06,7e-06,3e-06,-1e-05,0,3e-06,-9e-06,-3e-06,7e-06,5e-06,4e-06,0,-1.1e-05,-5e-06,4e-06,-2e-06,1e-06,5e-06,8e-06,3e-06,1e-06,-1e-06,-6e-06,-1.1e-05,1e-06,3e-06,-1e-06,0,1e-06,1e-06,1e-06,0,0,2e-06,1e-06,-2e-06,0,2e-06,1e-06,0,0,1e-06,0,1e-06,0,-2e-06,2e-06,1e-06,-1e-06,1e-06,1e-06,-1e-06,0,-5e-06,4e-06,3e-06,0
0,0,-1e-06,-2e-06,-1e-06,0,0,1e-06,1e-06,0,0,-1.6e-05,1.9e-05,-2e-06,2.2e-05,9e-06,-7e-06,5e-06,-1e-06,1.9e-05,-4.8e-05,-3.7e-05,4e-06,3.4e-05,-6.1e-05,-1.8e-05,6e-06,-7.8e-05,-6.8e-05,-3e-06,-4e-05,-4.7e-05,-5.4e-05,0.000143,-0.000209,0.000154,1.9e-05,-3.1e-05,2.1e-05,-4.5e-05,5.7e-05,2.4e-05,-2.8e-05,-2.6e-05,9e-06,8.8e-05,-1e-06,1.5e-05,-4.8e-05,-0.000111,-4.2e-05,6.1e-05,-3.7e-05,3.5e-05,-1.6e-05,9e-06,3e-06,1e-06,1.7e-05,-1.1e-05,-1.3e-05,1.1e-05,1.8e-05,3e-06,-3e-06,-4e-06,1e-06,-1e-06,-8e-06,5e-06,6e-06,-9e-06,-1e-06,-2e-06,5e-06,-1e-06,8e-06,8e-06,1e-06,-2e-06,-1e-06,-8e-06,0,-4e-06,0,-5e-06,6e-06,8e-06,0,1e-06,-3e-06,-1e-06,1e-06,1e-06,1e-06,-1e-06,1e-06,-4e-06,2e-06,-1e-06,2e-06,1e-06,0,0,0,1e-06,-2e-06,-2e-06,0,-1e-06,0,0,3e-06,0,-1e-06,0,0,4e-06,-2e-06,0,0
0,-1e-06,0,1e-06,1e-06,0,-1e-06,0,-1e-06,0,-7e-06,2e-06,-1.6e-05,-3e-06,-2e-06,-1.5e-05,-4e-06,-9e-06,1.1e-05,2.1e-05,2.4e-05,-0.000144,-0.000132,3.2e-05,3e-05,-2.6e-05,-6.3e-05,-3e-06,7e-06,1.8e-05,6.4e-05,-1e-06,-0.000106,-0.000105,0.000292,-8e-06,-4.4e-05,-1.2e-05,-0.000139,5.8e-05,-2.8e-05,-0.000126,-4.5e-05,-6.5e-05,4.6e-05,8.2e-05,5.5e-05,-3.2e-05,5.6e-05,0.000112,-2e-06,-1e-05,-5.1e-05,-7e-06,-2.4e-05,-1e-05,2.1e-05,-1.9e-05,1.1e-05,1.5e-05,-5e-06,-6e-06,2e-06,-4e-06,4e-06,5e-06,-6e-06,3e-06,1e-05,7e-06,2e-06,1.2e-05,-6e-06,1.4e-05,-1.6e-05,-1e-06,-3e-06,5e-06,-1e-06,-1e-06,-2e-06,1e-06,-6e-06,-3e-06,-1e-06,0,-9e-06,-6e-06,0,0,3e-06,-1e-06,1e-06,0,0,0,2e-06,3e-06,-2e-06,0,0,-2e-06,-1e-06,0,0,-1e-06,-2e-06,2e-06,0,0,-2e-06,0,-2e-06,-4e-06,0,0,-1e-06,0,1e-06,2e-06,0
0,0,-1e-06,0,-2e-06,0,0,1e-06,0,0,-6e-06,2e-06,-1.3e-05,5e-06,3.3e-05,-3.4e-05,2e-06,-2e-06,-5e-06,-2.9e-05,8.3e-05,-3.8e-05,3.1e-05,-1.2e-05,-5.4e-05,-3.6e-05,-0.000171,-9.7e-05,1.5e-05,3e-06,-5e-06,-1.4e-05,-2.4e-05,2.8e-05,-0.000179,-8.5e-05,-0.000108,6e-06,-0.000139,-9.4e-05,8.8e-05,0.000169,5.3e-05,-3.1e-05,1.2e-05,1e-06,1.6e-05,0.000131,5.5e-05,-5.5e-05,4e-06,2e-06,5.8e-05,1.7e-05,2.8e-05,6e-06,-1.9e-05,-1e-05,1.6e-05,-1e-05,1.5e-05,-1.1e-05,-1.3e-05,1e-06,-1e-06,2e-06,1e-06,-3e-06,-6e-06,-7e-06,-8e-06,3e-06,7e-06,-1.2e-05,5e-06,-3e-06,0,2e-06,-3e-06,1e-06,3e-06,1e-06,-2e-06,0,1e-06,4e-06,1.3e-05,5e-06,-3e-06,-3e-06,0,0,-1e-06,0,1e-06,0,1e-06,-2e-06,-1e-06,1e-06,1e-06,0,0,-1e-06,0,1e-06,1e-06,-4e-06,0,0,-2e-06,-1e-06,1e-06,0,0,-1e-06,1e-06,-1e-06,0,-2e-06,0
0,0,-2e-06,1e-06,1e-06,0,0,1e-06,-1e-06,0,-1e-06,-2e-06,3.5e-05,0,-4e-06,1e-06,-2e-06,-2e-06,1e-06,-3.1e-05,-1.5e-05,8.8e-05,7e-05,1.1e-05,2.3e-05,-1.4e-05,8.1e-05,8.5e-05,-4.4e-05,-3.7e-05,-5.8e-05,-1e-06,-4e-06,-2.8e-05,8.7e-05,6.1e-05,5.9e-05,1.7e-05,6.7e-05,5.3e-05,4.2e-05,-0.000139,-2e-05,5.5e-05,2.4e-05,-8e-05,-3.8e-05,-0.000127,2.9e-05,4.7e-05,8e-06,-4.2e-05,1.4e-05,-2.4e-05,5e-06,-9e-06,1e-05,-1.2e-05,-2e-05,1.6e-05,1e-05,9e-06,-2e-05,1e-06,-1e-06,-5e-06,-1e-06,-8e-06,1e-06,-1e-06,8e-06,-3e-06,-5e-06,4e-06,1e-05,0,-1e-06,4e-06,-2e-06,-3e-06,-5e-06,1e-06,1e-06,0,0,-1e-06,-4e-06,0,1e-06,1e-06,-1e-06,0,-1e-06,-2e-06,-1e-06,0,1e-06,-1e-06,1e-06,-2e-06,-2e-06,0,1e-06,1e-06,0,-2e-06,0,-2e-06,-1e-06,1e-06,0,0,1e-06,-3e-06,0,0,0,3e-06,-1e-06,0,0
0,-2e-06,1e-06,-2e-06,-1e-06,0,1e-06,-1e-06,0,0,-4e-06,1.3e-05,-2.6e-05,4e-06,4e-06,-6e-05,-1e-06,2e-06,-7e-06,-8e-06,-2e-06,6.5e-05,-7.8e-05,-5.9e-05,2.2e-05,1.9e-05,0.00015,1.3e-05,-1.1e-05,-4e-06,5.2e-05,-6e-06,-1.2e-05,7e-06,3.2e-05,-7e-06,-1.1e-05,-1.5e-05,0.000172,1e-05,-4.1e-05,0.000149,-7e-06,6e-06,-3.6e-05,-5.3e-05,1.8e-05,4.1e-05,-7.9e-05,-5.6e-05,-2e-06,3.7e-05,-2.3e-05,-2.8e-05,-3.3e-05,-9e-06,2.5e-05,1e-05,-3e-06,-1.6e-05,-7e-06,5e-06,-1.5e-05,7e-06,0,-2e-06,0,-1e-05,-7e-06,-8e-06,-1e-06,-3e-06,3e-06,1e-06,-1e-06,-2e-06,0,-2e-06,-3e-06,1e-06,2e-06,2e-06,4e-06,-1e-06,0,-3e-06,-3e-06,-1e-06,2e-06,1e-06,-1e-06,0,0,-2e-06,-1e-06,0,-1e-06,3e-06,-1e-06,1e-06,3e-06,-1e-06,0,0,0,1e-06,-2e-06,0,1e-06,1e-06,0,0,-4e-06,1e-06,1e-06,0,0,-6e-06,3e-06,-2e-06,0
0,0,-2e-06,1e-06,0,0,1e-06,0,0,0,-6e-06,-1e-05,-1.4e-05,-2e-06,-3.8e-05,1.5e-05,-1e-06,6e-06,8e-06,1.3e-05,-4e-06,1e-06,-8e-06,-5e-06,6e-06,-2.8e-05,4.7e-05,-1.3e-05,4.6e-05,-3e-06,-3.9e-05,1.3e-05,2.5e-05,1.2e-05,-8.8e-05,2.8e-05,-4.2e-05,-6e-06,4.2e-05,3e-06,3.2e-05,-9.3e-05,-3e-06,-1.4e-05,-1.4e-05,-8e-06,-1.3e-05,-7e-06,-4.5e-05,2.4e-05,-2.8e-05,3e-05,0,3e-05,2.9e-05,2e-05,-1.8e-05,2.4e-05,4e-06,1.7e-05,-1.1e-05,-1.1e-05,-1.1e-05,0,-3e-06,5e-06,1e-06,-1e-06,6e-06,7e-06,-4e-06,1e-06,-3e-06,-6e-06,-1.6e-05,-1e-06,3e-06,-7e-06,0,-1e-06,3e-06,-7e-06,2e-06,2e-06,-1e-06,0,3e-06,-1e-06,-4e-06,1e-06,1e-06,0,0,0,0,0,0,1e-06,-1e-06,1e-06,-3e-06,1e-06,0,0,0,0,0,-5e-06,0,1e-06,2e-06,0,3e-06,-2e-06,0,0,1e-06,4e-06,-2e-06,2e-06,0
0,0,-1e-06,0,0,0,1e-06,0,0,0,-3e-06,4e-06,2.7e-05,0,5e-06,1e-06,-3e-06,2e-06,-1e-06,-1.2e-05,-5.8e-05,-4.7e-05,-3.5e-05,1.8e-05,1.2e-05,8e-06,-8.7e-05,-3e-06,6e-06,1.3e-05,3.1e-05,-1e-06,-3e-05,-8e-05,6e-05,-8.3e-05,-1e-06,2.7e-05,-0.000105,6e-06,-2.9e-05,9e-06,3.2e-05,9e-06,-4e-06,8.3e-05,-2e-06,1.1e-05,3.5e-05,-3e-06,1.9e-05,-4.5e-05,-5e-06,2.3e-05,-4e-06,-2.8e-05,5e-06,4e-06,-9e-06,-1.9e-05,-2e-06,1e-06,6e-06,1e-06,4e-06,1e-06,0,0,-1e-06,1e-06,5e-06,1.1e-05,0,8e-06,6e-06,-1e-06,-6e-06,-9e-06,2e-06,-1e-06,-2e-06,3e-06,-3e-06,1e-06,0,3e-06,-3e-06,-2e-06,0,0,-2e-06,0,2e-06,1e-06,0,0,0,-4e-06,0,0,1e-06,0,0,0,-1e-06,0,2e-06,-1e-06,0,0,0,0,-3e-06,1e-06,0,0,0,-4e-06,-1e-06,0,0
0,-1e-06,0,1e-06,0,0,1e-06,-1e-06,0,0,-3e-06,-7e-06,8e-06,2e-06,-1e-05,-3.8e-05,0,-7e-06,1e-06,-1.7e-05,8e-06,-5.8e-05,-3e-05,2.1e-05,-1.7e-05,-3.2e-05,-7.6e-05,6e-06,-2.5e-05,3.3e-05,-4.9e-05,-9e-06,-2.1e-05,3.9e-05,0.000112,8.1e-05,-2.1e-05,2.3e-05,-0.000125,-5.4e-05,-2.3e-05,-6e-06,-3.9e-05,2e-06,2.3e-05,5.4e-05,1.1e-05,-5e-06,5.9e-05,6e-06,9e-06,4.1e-05,1.2e-05,-2.7e-05,-3e-06,2.5e-05,6e-06,-1e-06,6e-06,1.8e-05,6e-06,9e-06,1.7e-05,6e-06,-1e-06,-5e-06,2e-06,1e-06,3e-06,6e-06,-1e-06,-2e-06,3e-06,-1.1e-05,1e-05,0,6e-06,2e-06,3e-06,-1e-06,2e-06,0,-3e-06,-1e-06,0,-1e-06,0,1e-06,0,-1e-06,1e-06,0,-2e-06,0,0,0,-1e-06,2e-06,-1e-06,-1e-06,-1e-06,0,1e-06,1e-06,0,1e-06,1e-06,1e-06,-1e-06,1e-06,0,0,4e-06,-2e-06,1e-06,0,-1e-06,3e-06,1e-06,3e-06,0
0,0,-1e-06,-1e-06,0,0,0,0,-1e-06,0,-6e-06,0,-8e-06,-4e-06,2.5e-05,3.1e-05,-1e-06,1e-06,-5e-06,-1.2e-05,3.7e-05,-1e-06,7e-06,2e-06,5e-06,-1e-06,-5.3e-05,4.4e-05,2.3e-05,-5e-06,4.4e-05,1.3e-05,-5.4e-05,-7.2e-05,-0.000204,-2.2e-05,-4.3e-05,-1.7e-05,-1.7e-05,2.7e-05,4.2e-05,1.3e-05,1.3e-05,-1.9e-05,1e-05,-2e-06,-4.2e-05,-2.5e-05,1.5e-05,1.4e-05,-3e-06,-4e-05,-1.4e-05,-7e-06,-1.1e-05,-6e-06,0,-6e-06,-2e-06,-1.9e-05,1e-05,-5e-06,1.9e-05,-4e-06,1e-06,-1e-06,-1e-06,5e-06,-3e-06,-5e-06,-4e-06,-4e-06,-2e-06,6e-06,-6e-06,-1e-06,-3e-06,9e-06,2e-06,-1e-06,0,3e-06,-1e-06,-4e-06,0,-2e-06,-2e-06,-2e-06,-1e-06,0,0,0,-1e-06,1e-06,1e-06,0,0,1e-06,-1e-06,1e-06,0,0,0,0,1e-06,0,-1e-06,-1e-06,0,0,-1e-06,0,-1e-06,0,0,0,0,0,1e-06,-2e-06,0
0,0,-1e-06,1e-06,0,0,0,-1e-06,1e-06,0,-5e-06,6e-06,-2.5e-05,1e-06,-2e-06,-4.3e-05,-2e-06,9e-06,2e-06,3e-06,-7e-06,7.7e-05,-5.8e-05,-1.8e-05,-2.7e-05,-1.4e-05,0.000107,-4.3e-05,1.4e-05,-1.2e-05,-2.5e-05,-1e-06,-5.1e-05,0.000124,0.000184,-3e-05,-4e-06,-1.1e-05,0.000145,-1.9e-05,9e-06,-3.2e-05,7e-06,-1.6e-05,-1e-05,-8.1e-05,2e-06,4.4e-05,-3.8e-05,-3.8e-05,1e-06,2.1e-05,-9e-06,2.3e-05,2.9e-05,-9e-06,-1.2e-05,-1.2e-05,1.4e-05,1.6e-05,-7e-06,-7e-06,1e-05,1e-06,0,2e-06,0,-3e-06,-1e-06,-2e-06,5e-06,4e-06,0,1e-06,-6e-06,0,-1e-06,4e-06,2e-06,-2e-06,-2e-06,-2e-06,4e-06,-3e-06,-1e-06,0,2e-06,3e-06,4e-06,-2e-06,-1e-06,0,0,2e-06,0,0,0,-2e-06,1e-06,-1e-06,0,-1e-06,0,0,0,0,0,2e-06,0,0,-1e-06,0,0,-3e-06,0,0,0,-1e-06,-2e-06,0,0
0,-1e-06,0,-1e-06,1e-06,0,0,0,0,0,-4e-06,-4e-06,0,0,2e-05,-1.2e-05,-1e-06,-4e-06,5e-06,-1e-05,1.9e-05,6.5e-05,-2e-06,-2.7e-05,2.7e-05,1.3e-05,8.2e-05,-2.3e-05,-4.3e-05,-5e-06,-1e-06,1e-06,-1.3e-05,-6.7e-05,-2.9e-05,4.3e-05,2.2e-05,1.6e-05,9.6e-05,5.8e-05,1.4e-05,8.1e-05,3e-06,4.5e-05,2e-06,-7.1e-05,-5e-06,-2.6e-05,-4.3e-05,3.2e-05,-7e-06,-2.7e-05,3.2e-05,-1.4e-05,-3e-05,1.3e-05,4e-06,-1e-06,6e-06,-1.7e-05,-4e-06,6e-06,-3e-06,-1e-06,-2e-06,3e-06,1e-06,-2e-06,4e-06,-5e-06,-2e-06,4e-06,2e-06,-2e-06,5e-06,0,3e-06,-1e-06,-1e-06,-2e-06,1e-06,-4e-06,4e-06,2e-06,1e-06,3e-06,-2e-06,-1e-06,0,3e-06,1e-06,0,0,-1e-06,0,0,0,0,-1e-06,0,-1e-06,0,0,0,-1e-06,0,1e-06,0,0,-1e-06,0,0,2e-06,0,0,0,0,2e-06,0,-2e-06,0
0,-1e-06,-1e-06,1e-06,-1e-06,0,-1e-06,0,1e-06,0,-5e-06,6e-06,1.7e-05,-1e-06,-2.1e-05,1e-05,0,1e-06,-2e-06,-4e-06,6e-06,-3.2e-05,5e-06,-7e-06,-2e-05,-3.8e-05,-3.9e-05,0,-2e-06,9e-06,2e-06,-7e-06,-1.6e-05,9.6e-05,-6.8e-05,-3.7e-05,-4.2e-05,-3e-06,-5.4e-05,-1.3e-05,-1.1e-05,-0.000116,-2.8e-05,-3e-06,-8e-06,4.4e-05,3e-06,3e-05,2e-06,-4e-05,8e-06,6.1e-05,4e-06,-1.1e-05,1.5e-05,-1e-05,1.2e-05,4e-06,-1.3e-05,1.7e-05,0,3e-06,-1.3e-05,-5e-06,2e-06,-2e-06,1e-06,4e-06,-4e-06,5e-06,-3e-06,3e-06,-3e-06,7e-06,4e-06,1e-06,-4e-06,-5e-06,-2e-06,-2e-06,0,4e-06,-2e-06,1e-06,-1e-06,0,3e-06,-2e-06,-2e-06,-2e-06,0,0,0,-1e-06,0,0,1e-06,1e-06,0,-1e-06,2e-06,0,0,0,0,0,-1e-06,0,0,0,0,0,-4e-06,-2e-06,0,0,0,-4e-06,1e-06,2e-06,0
