-0.000165,-0.000146,-0.000149,-0.000195,-0.000176,-0.000241,-0.000141,-0.000133,-0.000157,-0.000158,-0.000115,-0.000131,-0.000131,-8.4e-05,-0.000101,-0.000116,-0.000116,-0.000148,-0.000155,-0.000122,-0.000113,-8.8e-05,-0.000115,-9.6e-05,-0.000105,-9.4e-05,-7.6e-05,-7.4e-05
-0.000167,-0.000139,-0.000202,-0.00021,-0.000167,-0.00022,-0.000165,-0.00021,-0.000154,-7.4e-05,-0.000109,-0.00013,-0.000116,-0.000108,-0.000122,-0.00014,-0.00015,-0.000214,-0.000198,-0.00013,-0.000114,-0.000109,-0.000194,-9.7e-05,-9.4e-05,-0.000138,-9e-05,-6.7e-05
-4.3e-05,-6.2e-05,-0.000106,-6.4e-05,-5.3e-05,1e-05,-4.6e-05,-0.000142,-7.2e-05,8e-06,-3.6e-05,-1e-06,0,-0.000104,-9.4e-05,-0.000112,-1e-04,-0.000132,-0.000123,-9.6e-05,-6.3e-05,-8.3e-05,-0.000185,-7.2e-05,-3.7e-05,-8.8e-05,-9.7e-05,-5.2e-05
0.000116,3.4e-05,7.3e-05,0.000132,9.9e-05,0.000205,0.000108,7.2e-05,6.8e-05,2e-05,1.5e-05,8.4e-05,5.2e-05,-2.7e-05,3.8e-05,8.9e-05,6.2e-05,2.6e-05,3.5e-05,2e-05,4e-05,2e-05,3.2e-05,9.2e-05,6.8e-05,4e-05,-6e-06,2.8e-05
2.7e-05,1.9e-05,5.1e-05,7.7e-05,4.2e-05,-2.7e-05,-6e-06,0.00011,5.8e-05,-2.7e-05,-2.2e-05,-1.4e-05,1e-06,4.2e-05,3.2e-05,3.8e-05,5.9e-05,9.2e-05,9.7e-05,3.2e-05,1.9e-05,4.6e-05,0.000101,5e-06,2.9e-05,5.8e-05,6.1e-05,2e-06
4.7e-05,7.4e-05,8.6e-05,5.5e-05,8e-06,-0.000154,-4.6e-05,0.000102,4.6e-05,-1e-06,5e-06,-5.4e-05,3.1e-05,0.00014,0.000102,7.5e-05,5.7e-05,0.000145,0.000129,7.3e-05,3.3e-05,8.1e-05,0.000199,5.3e-05,1.2e-05,6.9e-05,9.5e-05,3.2e-05
-2.4e-05,1e-06,-3.2e-05,-9.6e-05,-5.9e-05,-8.8e-05,-2.7e-05,-1.6e-05,-1.9e-05,-1e-06,0,-5.1e-05,-2.5e-05,1.2e-05,-2.1e-05,1e-06,5e-06,4.4e-05,8e-06,2.2e-05,5e-05,4.9e-05,7.6e-05,0,-3e-05,1e-05,1.6e-05,-8e-06
-5.6e-05,7e-06,-1.3e-05,-5.4e-05,0,0.000135,8.8e-05,-6.6e-05,-3.7e-05,2.7e-05,4e-06,2.7e-05,-5e-06,-6.8e-05,-6.8e-05,-4.8e-05,-4e-06,-9e-06,-6.4e-05,-2.9e-05,3.8e-05,-1.1e-05,-7.9e-05,-3.2e-05,-7e-06,-1.7e-05,-2.9e-05,-2.8e-05
-1.1e-05,-7e-06,-1e-06,4e-06,3e-05,0.000188,9e-05,-7.1e-05,-3.2e-05,1.3e-05,-1.2e-05,4.5e-05,-4e-06,-8.2e-05,-5e-06,-1.9e-05,-1.1e-05,-7e-05,-8.6e-05,-4e-05,-2e-05,-5e-05,-0.000117,8e-06,1.3e-05,-4.5e-05,-5.4e-05,1e-05
-6.5e-05,-8.5e-05,-7.2e-05,-7.6e-05,-9.7e-05,-9.7e-05,-7.7e-05,-7e-05,-6.2e-05,-7.7e-05,-7.7e-05,-2.4e-05,-3.1e-05,-7.8e-05,-5.3e-05,-0.000121,-1e-04,-0.000136,-9.1e-05,-0.000105,-0.00012,-0.000105,-0.000181,-0.000102,-5.5e-05,-9e-05,-9e-05,-3.7e-05
1.2e-05,-2.9e-05,-3e-06,-5e-06,-4.1e-05,-0.000193,-0.000126,2.7e-05,1.8e-05,-6.1e-05,-7.7e-05,-6.6e-05,-4.9e-05,1e-06,-4.1e-05,-5.8e-05,-7.4e-05,-0.000106,-3e-05,-5.4e-05,-8.4e-05,-3.4e-05,-7e-06,-1.5e-05,-2.6e-05,-1.8e-05,1.2e-05,9e-06
4e-05,2.8e-05,2.7e-05,5.2e-05,6.7e-05,-3.6e-05,-4.1e-05,6.6e-05,7.5e-05,3.6e-05,1.8e-05,-2.4e-05,-4e-06,6.6e-05,4.9e-05,7.3e-05,1.1e-05,4.4e-05,7.9e-05,6.1e-05,4.8e-05,7.2e-05,0.000127,5.3e-05,2e-05,5.7e-05,7.9e-05,4.8e-05
9e-06,3.2e-05,1.4e-05,2.8e-05,8.2e-05,0.000158,8.5e-05,5.7e-05,6.4e-05,7.7e-05,6.8e-05,5.3e-05,9.3e-05,0.000113,7e-05,9.2e-05,9.7e-05,0.000197,0.000149,0.000127,0.000106,8.3e-05,0.000147,6.3e-05,3.9e-05,8.4e-05,5.5e-05,2.1e-05
3e-06,-1.2e-05,-4.7e-05,-3.3e-05,3.8e-05,0.000194,0.000134,1.2e-05,8e-06,4.7e-05,5e-05,5.7e-05,8.1e-05,7.6e-05,6.3e-05,8.4e-05,0.000128,0.000147,5.4e-05,8.1e-05,8e-05,6.1e-05,9.7e-05,6.2e-05,4.9e-05,4.9e-05,2.7e-05,1.1e-05
-6.8e-05,-4.8e-05,-7.5e-05,-9.2e-05,-7.3e-05,-7.1e-05,-5e-06,-8e-05,-9.5e-05,-5.5e-05,-2.8e-05,-4.6e-05,-6.8e-05,-7.4e-05,-6e-05,-5.5e-05,-1.9e-05,-4.3e-05,-9.2e-05,-7e-05,-3.7e-05,-4.2e-05,-8.3e-05,-8.4e-05,-4.1e-05,-3.4e-05,-4.1e-05,-4.9e-05
-1.6e-05,2.1e-05,1.7e-05,-9e-06,-7.3e-05,-0.000172,-7.4e-05,-4.2e-05,-6.7e-05,-3.6e-05,-3.2e-05,-5.7e-05,-7.8e-05,-8.2e-05,-4.8e-05,-9.2e-05,-0.000117,-0.00015,-0.000119,-8.6e-05,-5.9e-05,-8.4e-05,-0.000136,-5.5e-05,-3.7e-05,-7.3e-05,-7.5e-05,-4.2e-05
-7e-06,5.1e-05,0.000113,0.000124,2.7e-05,-5.5e-05,-4.9e-05,2.7e-05,2.8e-05,3.3e-05,3.1e-05,3.3e-05,-3e-06,-3.8e-05,-2.3e-05,-3.5e-05,-7.5e-05,-0.000132,-4.3e-05,0,-1.5e-05,-5.8e-05,-9.8e-05,-1.3e-05,2e-06,-4.6e-05,-2.6e-05,0
1.7e-05,1.9e-05,8.3e-05,9.2e-05,6.2e-05,9.8e-05,1.6e-05,5.1e-05,6e-05,3e-06,1.8e-05,8.3e-05,5.2e-05,-1e-06,-1.1e-05,3.2e-05,3.1e-05,-1.8e-05,5e-05,2e-05,-4.2e-05,-2.8e-05,3e-06,1.7e-05,2.6e-05,1.9e-05,1.8e-05,1e-05
5.1e-05,-1e-05,-4e-06,-1.9e-05,1.4e-05,9.1e-05,3.1e-05,4e-05,3.2e-05,-3.7e-05,-1.2e-05,1.6e-05,8e-06,3.9e-05,4.6e-05,6.7e-05,7.1e-05,9.8e-05,0.000103,3.7e-05,-1.6e-05,2.5e-05,8.4e-05,5.5e-05,2.3e-05,4e-05,2.8e-05,1e-05
