5e-06,-6.3e-05,-0.000362,-0.00013,-9.4e-05,-6e-05,-0.000376,-0.000633,-0.000542,-0.000409,-0.000418,-0.00136,-0.000382,-5e-05,-0.001016,-0.001668,-0.001039,-0.005248,-0.003908,-0.002551,-0.004178,-0.004298,-0.00376,-0.007868,-0.010475,-0.009966,-0.008392,-0.007078,-0.005553,-0.009183,-0.011483,-0.010279,-0.005509,-0.003957,-0.008356,-0.008355,-0.003773,-0.00522,-0.011434,-0.009274,-0.013631,-0.010747,-0.001782,-0.021556,-0.021805,-0.014469,-0.009369,-0.014632,-0.009546,-0.007431,-0.014523,-0.008196,-0.005271,-0.010617,-0.013266,-0.020476,-0.016687,-0.010067,-0.015329,-0.010567,-0.017745,-0.005364,-0.004647,-0.000754,-0.00479,-0.000783,-0.004376,-0.001769,-0.00219,0.00122,-0.002635,-0.008208,-0.00384,0.001302,-0.001382,-0.005433,-0.009456,-0.006219,-0.003188,-0.007568,-0.014007,-0.002433,-0.004672,-0.006648,-0.00169,-0.000655,-0.00103,-0.008587,-0.006521,-0.006671,-0.00207,-0.002182,0.001524,0.004412,-0.000223,-0.005761,-0.013764,-0.009548,-0.012153,-0.007715,-0.006159,-0.001836,-0.001301,-0.000928,-0.003077,-0.006361,-0.008071,-0.016737,-0.016151,-0.006499,-0.006657,-0.010591,-0.007338,-0.005026,-0.00536,-0.006185,-0.006684,-0.004256,-0.011708,-0.005247,-0.002883
2e-05,-2.8e-05,8.6e-05,0.000236,0.000261,0.000138,0.000177,0.000247,-4e-06,-0.000126,-5.3e-05,9.6e-05,0.00047,0.000523,0.000778,-0.001142,-0.001692,0.001898,0.001418,0.00072,-0.000713,0.000738,-0.00023,0.001912,0.009279,0.005824,0.00455,0.003311,0.000979,0.000699,0.001835,0.004548,0.001753,-5.3e-05,0.005848,0.004353,0.001651,0.002143,0.008373,0.006247,0.005959,-0.002012,0.004828,0.004857,0.012112,0.009392,0.001875,0.005907,0.008573,-0.000112,0.006586,0.002948,0.004335,0.000775,0.005189,0.013518,0.009093,0.00549,0.00793,0.012551,0.014016,0.006995,0.005379,0.001313,0.003408,-0.000657,-0.001677,6e-06,0.000444,-0.001759,-0.001263,0.004755,-0.000891,-0.001194,-0.001898,0.002132,0.004047,0.001879,0.003753,0.001513,0.002123,-0.000793,-0.001696,0.008591,0.011337,0.00581,0.007211,0.010944,0.004736,-0.002,0.005705,0.00834,0.014308,0.013235,0.013261,0.005947,0.008148,0.005851,0.007508,0.011139,0.005647,0.0051,0.001451,-0.003007,0.003282,0.002114,0.006315,0.01082,0.010926,0.004283,0.002872,-0.001935,0.002407,0.000763,0.006253,0.004976,0.007444,0.007202,0.004377,0.002225,-0.001446
-7.3e-05,-7.6e-05,-3.3e-05,-0.000108,-0.000187,-4.9e-05,-0.000127,0.000164,0.000253,0.000159,4e-06,-0.000116,-0.000134,-0.00022,-0.00064,0.001166,0.002391,-0.00037,-0.000706,-0.000624,-0.000618,0.000988,0.002602,-0.000747,-0.004901,-0.000545,-0.006486,-0.003246,-0.002191,0.000846,0.004565,-0.002078,-0.003601,-0.004313,-0.002106,-0.006025,-0.006079,0.002033,-0.004022,-0.00066,-0.00276,-0.001733,-0.000966,-0.003448,-0.008865,-0.006457,-0.001447,-0.00375,-0.004174,-0.007743,-0.006093,-0.008476,-0.00319,-0.001076,-0.002758,-0.007595,-0.005721,-0.003774,-0.005855,-0.007413,-0.011977,-0.012317,-0.009234,-0.009961,-0.008468,-0.002571,-0.006611,-0.002061,-0.000891,-0.004238,-0.001768,-0.003552,-0.006613,-0.001621,-0.006205,-0.00262,-0.002748,0.000126,-0.006212,-0.002843,0.002523,-0.00631,-0.003705,-6.2e-05,-0.013582,-0.009786,-0.009235,-0.009494,-0.000336,0.000677,-0.003378,-0.008809,-0.004091,-0.009472,-0.007396,-0.001922,-0.003704,-0.003237,-0.005335,-0.013107,-0.005541,-0.004872,-0.005542,6.9e-05,-0.001412,-0.001978,0.00081,-0.006571,-0.012327,-0.012868,-0.001801,0.000131,-0.003702,-0.00034,-0.002655,-0.005397,-0.008373,-0.006266,-0.004191,-0.007292,-0.004578
-6e-06,2.4e-05,3.2e-05,1.7e-05,6.5e-05,4.1e-05,8.6e-05,-6.8e-05,-0.000108,-0.000129,8.6e-05,-1.4e-05,-0.000316,-4.4e-05,0.000208,0.000204,-0.000941,-0.00045,0.000236,9.1e-05,0.000746,-0.001628,-0.0025,0.001165,0.002884,-0.001021,0.00437,0.001237,0.002588,0.001227,-0.000489,0.001837,-0.001344,0.002234,0.000796,0.00592,0.003289,0.001854,0.002808,0.003836,-0.002186,0.002491,-0.001295,0.00323,0.008974,0.000979,-0.000205,0.000368,0.00467,0.007066,0.003282,0.005876,0.003407,-0.000244,0.000641,0.005619,0.003274,0.003795,0.004253,0.000505,0.00331,0.004908,0.000601,-0.001318,0.000982,-0.001325,-0.000237,-0.00091,0.000584,0.001663,0.002519,0.002335,0.005218,0.002805,-0.00095,0.003078,0.000243,-0.000764,0.00135,0.002539,0.000347,0.004651,0.003094,0.00288,0.000737,-0.001173,0.006073,-0.000185,-0.001799,0.002002,0.000972,-0.00092,0.001111,0.001114,0.001376,0.003347,0.001757,0.004213,0.002099,0.005004,0.000471,-0.001571,0.002939,6.9e-05,-0.002336,-0.001247,0.005562,0.00334,0.00738,0.007443,0.001361,0.003198,0.004763,0.001563,0.002544,-4.2e-05,0.003682,0.000259,-0.000234,-3e-05,-0.002765
4.9e-05,6.8e-05,5.3e-05,4e-05,-0.000116,1e-06,6e-05,-1e-06,0.000111,0.000142,-5.3e-05,2.8e-05,0.000143,3.3e-05,-0.000345,-6.2e-05,-4.3e-05,-0.000816,-0.000768,-0.000159,-0.000181,0.000998,0.001821,-0.000433,-0.001979,0.000866,-0.003023,-0.003749,-0.000385,-0.003533,-0.003925,-0.000833,0.001768,-0.002386,0.001916,-0.001885,-0.006412,-0.006647,-0.004987,-0.003449,-0.001481,-0.000557,-0.001773,-0.003317,-0.005321,-0.003171,-0.001332,0.002593,-0.002259,-0.004217,-1.6e-05,-0.003092,-0.002365,0.002012,-0.001276,-0.00122,-0.000696,-0.003821,-0.001546,-0.001217,0.002143,-0.005793,-0.008561,-0.001582,-0.004614,-0.002107,-0.000929,-0.006148,-0.001413,-0.003527,0.00157,-0.004227,0.002446,-0.001979,-0.001158,-0.00017,-0.000465,-0.000444,-0.001661,-0.005699,-0.00291,0.000933,0.003048,-0.005332,0.00088,-0.010034,-0.0037,-0.003404,-0.004188,-0.003239,-0.005158,-0.003056,-0.006942,-0.002239,-0.009397,-0.004301,-0.000793,-0.001127,-0.00508,-0.004352,0.000524,-0.00016,-0.002386,-0.000485,-0.002078,-0.002464,-0.003952,-0.006497,-0.006346,-0.006427,-0.001357,-0.001692,-0.007853,-0.004546,-0.002261,-0.004796,-0.001113,-0.000471,-0.0057,-0.00098,-0.000497
-4e-06,2.5e-05,-1.6e-05,-6e-06,3.7e-05,-5.8e-05,4.5e-05,3.1e-05,1.1e-05,0.000128,5e-05,-3e-06,6.4e-05,-0.000104,-0.000484,-8e-06,0.00052,0.00049,0.00035,0.000775,0.000509,-0.00046,-0.000558,0.00024,8.6e-05,-0.000946,0.000414,0.002672,-0.000746,0.002573,0.004599,-0.000642,-0.001037,-0.001382,-0.002898,0.000751,0.003435,0.001006,-0.001191,-0.002687,-0.000316,-0.000813,-0.00427,-0.002155,-0.001736,0.001792,0.001075,-0.001091,0.000863,-3e-05,0.000243,0.002134,-0.000758,-0.002856,-0.001189,0.000196,-0.000644,-0.001216,-0.001884,-0.002228,9.3e-05,0.000325,0.005662,0.003966,0.0023,-0.001519,3e-04,-0.001418,0.002967,-0.000395,-0.001178,0.004767,0.000919,-0.003311,0.002204,0.000455,0.000397,0.001144,-0.001231,-0.002686,0.001858,-0.000247,-0.001874,-0.003452,-0.004899,0.001615,-0.001267,0.000992,-0.000889,-0.000973,-0.001233,0.000416,0.001078,-0.00206,-0.00076,-0.000434,-0.000251,0.003169,0.004142,0.002847,-0.000595,-0.000444,-0.000288,0.000421,0.00048,0.003748,5e-04,0.000585,-0.000563,0.005301,0.000641,0.001459,0.005284,0.003688,0.003214,0.003712,0.00406,0.004296,0.003123,0.004784,0.007029
-5e-06,-8.3e-05,-7.6e-05,-8.9e-05,-6.4e-05,-4.5e-05,-8.6e-05,-4e-05,-8.7e-05,-0.00021,4.3e-05,0.000104,-1.6e-05,-0.000359,-0.000149,6.1e-05,-0.000609,-0.000294,0.00069,0.000197,5.7e-05,2.7e-05,-0.000294,-0.000959,-0.000768,1e-05,0.000499,-0.001467,0.000315,8.2e-05,-0.002604,0.001107,0.000402,0.000574,0.001339,-0.001682,-0.000915,-0.002254,-0.000868,0.001703,0.001227,0.002601,0.003918,0.002824,-0.000633,0.001987,0.003218,0.000486,-0.001961,-4e-05,6.6e-05,-0.000269,-0.000387,0.001064,0.002862,0.000301,-0.000439,0.003886,-0.000989,0.003074,0.001467,0.001657,-0.00038,0.000769,0.003222,0.004166,0.004406,0.002837,-0.002659,-0.000741,0.004076,-0.000461,-0.001768,0.001153,-0.000679,-0.000701,0.002416,-0.0012,0.000195,-0.002798,-0.001099,0.001285,-0.002036,0.002422,-0.003272,-0.000212,0.005199,-0.000968,-0.000351,-0.000145,-0.000259,0.000773,-0.000806,-0.004063,-0.001252,-0.00157,-0.001886,-0.00705,-0.000689,-0.00268,-0.002787,-0.000286,-0.002717,-0.000824,-0.001599,-0.001178,6.1e-05,-0.003822,-0.000839,-0.00278,0.002426,-0.003426,-0.001975,-0.002892,-0.002415,-0.003317,-0.002311,-0.001651,-0.000678,-0.003153,-0.003541
-3e-05,-3.9e-05,4.3e-05,-3e-06,5.5e-05,-8.2e-05,6e-05,-4.2e-05,-3.2e-05,5e-05,-6.1e-05,-0.000113,4e-06,-0.00014,8.7e-05,-0.00029,-0.000381,0.000163,-0.000544,-0.000557,-0.00037,0.000931,-0.000374,0.000501,0.00019,-0.000784,-0.000847,0.001198,-0.000315,-0.001028,-0.000127,-0.000477,-0.001008,-9.2e-05,-0.001084,0.001309,0.000683,0.000569,-0.001653,-0.001661,0.000817,-0.002734,0.000125,0.000944,0.000148,-0.004679,-0.003922,0.000584,0.00051,-0.000408,-0.003626,-7.2e-05,0.001112,-0.000624,0.000548,-0.000643,-0.00213,-0.00228,0.002651,-0.002065,-0.001219,-0.001162,0.000739,0.000315,-0.001688,-0.00074,-0.002309,0.000767,-0.001347,-0.000303,-0.000273,0.000384,0.000602,0.002784,0.000998,0.000713,0.000666,0.000584,-0.001157,0.001819,0.001168,0.001287,0.001104,0.000118,-0.002111,-0.004568,0.001553,-0.000366,-0.00482,-0.004179,0.002843,0.001298,-0.000772,-0.002357,-0.002415,-0.000264,0.001572,0.002722,0.000347,0.000622,-0.001279,0.000462,-0.001979,-0.001996,-0.000363,0.000934,-0.000975,0.000678,0.000702,0.00165,-0.000969,0.000451,2e-05,-0.00082,0.001587,0.001037,0.000769,0.002323,0.002258,0.001671,0.000248
-2e-05,1.5e-05,0,-1.9e-05,-4.9e-05,1.1e-05,8e-05,-2.7e-05,1.7e-05,-5e-06,2e-05,3.6e-05,-3.6e-05,-0.000302,-0.000145,-0.000107,0.000152,-7.2e-05,0.000321,9.5e-05,-3.1e-05,-0.000463,0.000852,9.6e-05,0.000807,-0.00049,0.000317,-0.000825,-0.001082,0.000252,0.000563,0.000182,0.001497,0.002649,0.000216,-0.001092,-0.002229,-0.002718,0.000131,0.001699,-0.000329,-0.000777,-3.2e-05,0.001355,-0.000364,0.003326,0.00238,-0.001606,0.001197,0.000621,0.001262,-0.000607,-0.001451,-0.000936,-0.001784,-0.000995,-0.00027,-8.8e-05,-0.00169,0.000731,0.00087,0.000664,-3e-04,-0.001038,-0.000515,0.001506,-0.000106,-0.000474,9.6e-05,-0.000452,0.000177,-0.000544,-0.000444,-0.00305,0.001109,0.000474,-0.000343,0.001305,-0.000584,0.001239,-0.00256,-0.001984,-0.00021,-0.00131,-0.000251,0.000785,0.001453,0.001397,0.004079,0.001722,-0.003822,0.001249,0.001295,-0.001955,-8e-06,-0.002952,-0.001919,-0.002254,-0.000803,-0.002447,0.000537,-0.002538,0.000407,-7.5e-05,0.000977,-0.000193,0.000676,0.001452,-0.000131,-0.000194,-0.001649,-0.000473,-0.001029,-0.001998,-0.003882,-0.001097,-0.00178,-0.002323,-0.001591,-0.000531,-0.000567
-4e-06,5e-06,5.1e-05,2.2e-05,1.6e-05,7e-06,7e-05,3.1e-05,-2.6e-05,-3.9e-05,3.6e-05,2e-05,1e-06,0.000291,2.3e-05,-4.4e-05,0.000142,0.000162,0.000102,-0.000599,0.000225,-7.6e-05,-0.000394,2.1e-05,-0.00049,0.000655,0.000664,0.000649,0.000205,-0.000204,-0.000256,0.001071,-0.000766,-0.000708,0.000328,-0.002335,0.000696,0.002746,0.000792,0.000541,0.001004,0.001517,-0.000978,-0.000458,0.000506,-0.001743,-0.001072,-0.000739,-0.000558,-0.000147,0.000128,-0.000105,0.000135,0.001188,0.001088,0.00039,0.000944,-0.000858,0.002891,0.000334,-0.001109,-0.002152,0.000373,-0.00153,-0.000648,-0.001971,0.000437,-0.000681,-0.000704,-0.001036,-0.001417,-8.2e-05,0.000862,0.000112,0.000621,0.000109,-0.001062,-0.002357,0.000227,0.000356,0.000841,0.00141,0.001942,-0.000226,-0.000116,-9.4e-05,-0.005303,-0.002087,0.000162,0.000333,0.001118,3.4e-05,-0.000246,-0.001839,-0.00138,-7.6e-05,-4e-06,0.000407,0.001817,0.000114,0.000743,0.002034,0.000544,-0.000502,-0.001177,-0.002199,-0.000239,-0.000193,0.002237,0.001133,-0.001867,-0.001008,-0.000526,0.002492,-0.000333,-0.00069,-0.000619,0.000628,-0.000636,-0.002051,-0.000342
-2e-05,-1e-05,8e-06,1.3e-05,-5e-06,8e-06,3.1e-05,-1e-05,5.4e-05,-4.4e-05,-5.5e-05,4.5e-05,-3.4e-05,0.00011,-3.4e-05,-1e-04,0.000114,7.2e-05,-0.000284,0.000104,0.000195,-0.000495,9.3e-05,0.000471,-0.000507,-0.000313,-0.000415,-0.000202,-0.00046,0.000574,0.000604,-0.000691,-0.000307,-0.001171,-0.000227,0.001014,0.000771,-0.000705,-0.000264,0.000743,-0.001067,-0.000848,0.000459,0.000506,-1.4e-05,2e-06,-0.000278,0.00034,-0.000126,0.001444,-0.001044,0.00225,0.000892,0.000781,-0.000908,0.002171,-0.000493,-0.001122,-0.000982,-0.001894,-0.000902,0.000376,0.000915,-0.000591,0.00086,-0.00053,-0.001755,-0.000994,-0.00179,-0.001596,-0.000761,0.001574,0.000211,-0.001127,-0.002226,-0.001039,0.000303,-0.000308,-0.000186,-0.00067,-0.000484,-0.000937,-0.000713,0.000664,0.00018,0.000254,-0.001855,-0.00191,0.000873,0.000816,0.000752,-0.000248,4.8e-05,0.002235,0.000112,-0.001356,-0.001494,0.000835,0.000189,0.000147,-0.000802,-0.00026,0.001467,-3e-04,-0.000585,-0.001415,-0.000587,-0.000466,-0.000167,-0.000579,-0.00107,0.001628,0.000416,-0.001481,0.000237,0.00014,-0.000839,0.001088,-0.000692,-0.00097,0.000376
1.3e-05,1.8e-05,-8e-06,-1.8e-05,1.3e-05,-2.3e-05,-2.3e-05,-1.7e-05,-3.8e-05,9e-06,1.1e-05,-1.3e-05,3e-06,-7.7e-05,4.2e-05,-3.7e-05,-0.000168,-0.000203,0.000167,0.000237,-3.1e-05,0.000401,0.000127,-0.000419,0.000443,0.001183,0.000859,-4.3e-05,-0.000367,-0.000213,-0.000614,-0.000366,5.5e-05,0.000948,0.000184,0.000334,-0.000529,0.00086,0.000311,5.2e-05,0.000818,0.000245,0.000232,-0.000918,0.000473,0.000723,6.3e-05,0.001111,0.00037,-0.000411,-0.000125,-0.000961,-0.001,0.000754,0.000488,-0.001569,-0.00015,0.001067,0.000561,-0.000311,0.000276,0.001721,-0.001343,-0.000467,-0.000536,-0.001415,0.000627,-0.000137,0.001316,0.000767,-0.001173,-0.000101,-0.000208,0.000969,0.000964,-0.00175,-0.000211,-7e-06,-0.000479,7.2e-05,-0.000217,-0.000332,0.000872,-0.000412,0.000322,0.000119,-0.002854,-0.000868,-0.00022,-0.000249,0.000645,-0.000814,-0.000147,0.000739,0.000796,0.000422,-0.00078,-0.001108,0.002853,-0.00017,0.000696,0.000888,0.000599,-0.001441,7.5e-05,-0.000214,0.000312,4.1e-05,0.000578,-5.9e-05,0.001057,-0.000675,-0.000356,0.000801,0.000538,-0.000478,7.5e-05,-0.000255,0.00135,0.000911,0.000222
6e-06,-6e-06,-8e-06,-1.5e-05,2e-06,2e-06,5e-06,-3e-05,-8e-06,-1.5e-05,-1.1e-05,-1e-05,-3.6e-05,-5.7e-05,9.5e-05,-8.3e-05,0.000146,3.7e-05,-0.000106,-9.9e-05,1.4e-05,-0.000103,-0.000132,4.1e-05,-0.00031,-0.000642,-0.000654,0.00028,0.00089,0.000487,0.000583,0.000604,0.000445,-0.000566,7.2e-05,0.000299,0.000389,-0.001178,0.000293,0.000749,-0.00079,0.000762,0.000457,-0.000857,-0.000225,0.000729,-2.8e-05,-0.00074,-0.00083,-3.4e-05,0.001143,-6.6e-05,0.000228,-0.00123,-0.000714,0.000217,0.000261,1.4e-05,0.000613,0.001854,0.000314,-0.000183,0.001323,0.000227,0.000332,0.000738,-0.000679,0.00077,0.001186,-0.000298,0.000108,0.001438,-0.001144,0.000347,0.000908,-7.6e-05,2.9e-05,0.000128,0.000815,-0.000671,-0.000876,0.000305,-0.000809,-0.000132,-0.000848,-0.000372,-0.000416,0.000364,-0.000575,0.00108,0.000244,0.001494,-0.000148,0.000397,6.7e-05,0.000662,-0.001051,0.000658,-0.001318,-0.000428,-0.000423,-0.001403,-0.000824,0.00041,0.000849,-0.000838,-0.000132,0.000641,-4.1e-05,0.000694,-0.000554,-0.000576,-0.000181,-0.000261,-0.00155,0.000111,-0.000221,-1.8e-05,9.6e-05,0.000217,-0.000516
-1.7e-05,2e-06,2.6e-05,2.7e-05,-1.5e-05,-2.4e-05,-3.7e-05,-2.1e-05,-2e-06,-1.1e-05,7e-06,-2.3e-05,-3e-06,-5.8e-05,6.9e-05,2.6e-05,-0.00012,4e-05,3.7e-05,0.000161,-0.000124,-5.3e-05,-0.000235,-0.000129,0.000438,-7e-06,0.000153,-0.000329,0.000257,-0.000297,-0.000507,-0.000566,-0.000848,0.000518,0.000247,0.000447,-2e-06,5e-04,0.000482,-0.000295,0.000324,1.5e-05,0.000311,0.000991,0.000212,-0.000616,-0.000373,0.000268,6.8e-05,0.000395,-0.000443,-6.7e-05,0.000141,0.000363,-0.000185,0.000327,-7.5e-05,-0.000131,-5e-04,-0.000607,-0.00088,-0.000145,-0.000126,-0.000272,-0.000318,3.1e-05,0.000725,-0.000333,-0.000734,-4.1e-05,-0.000717,-0.000295,-2.2e-05,-0.000388,-0.000366,0.000198,-0.000101,-0.000307,-0.001131,0.001222,-0.000462,-0.00061,0.000367,-0.000103,-8.3e-05,-2.4e-05,0.00149,0.000135,-0.000234,-0.000214,0.000227,-0.000534,-0.00021,-0.000392,-0.000273,0.00035,0.000344,-0.000799,0.000508,6.2e-05,-0.000481,0.001107,1.9e-05,-4e-06,-0.000497,0.000539,-0.000661,-0.00033,-0.000164,-0.000579,0.001134,-0.000714,-0.000139,-0.000262,-4.5e-05,0.000889,2.4e-05,-0.000133,9.1e-05,-0.000318,0.000618
-4e-06,-7e-06,-1.5e-05,-7e-06,7e-06,8e-06,-6e-06,-5e-06,1.7e-05,-2e-06,-1.3e-05,2.9e-05,3e-06,5e-06,-4.3e-05,1.7e-05,0.00013,-8.1e-05,8e-06,-1.1e-05,-0.000121,-0.000221,3.7e-05,0.000126,0,-0.000272,1.3e-05,5e-05,6.7e-05,0.000668,-4.8e-05,6.6e-05,0.000503,-6.2e-05,-9e-05,-2e-05,0.000372,-0.000435,-0.000492,-5.8e-05,-0.000316,-6.7e-05,-0.000162,-3.6e-05,-0.000168,0.000701,0.000158,-0.000412,0.00023,-0.000517,0.000125,-0.000264,-0.000492,-0.000648,-0.000788,-0.000401,-0.000692,0.000237,0.000792,7.6e-05,0.000694,-0.000105,-0.00012,-9.1e-05,0.000482,0.000354,-0.000161,-0.000273,5.8e-05,0.00073,-0.000131,-0.000239,3e-06,-0.000787,-0.000713,-8.2e-05,0.000168,-0.000225,0.000345,0.00037,0.001026,-2.5e-05,-0.00081,0.000402,-0.000275,0.000693,-0.00058,-3.5e-05,0.000941,0.000293,-0.000495,-0.000457,0.000127,-0.000888,3.9e-05,-0.000327,0.000255,0.000167,0.000679,0.000325,0.00022,-0.000383,-0.000539,0.000361,-0.000243,0.000108,0.000348,-0.000205,7.3e-05,1e-04,-0.000734,0.000189,2.3e-05,1.1e-05,0.000872,-0.000898,0.00024,-0.000268,-0.000105,0.000153,-0.000435
1e-06,2e-06,5e-06,-1.2e-05,-2e-06,4e-06,-1.5e-05,-4e-06,5e-06,1e-06,-1e-06,4e-06,-2e-06,-3.4e-05,-2.3e-05,2.7e-05,-8.2e-05,1.1e-05,-8e-05,-9.3e-05,3.1e-05,8.3e-05,0.000134,-5.6e-05,-0.00026,0.00027,-0.000195,5.6e-05,-0.000125,-0.000477,0.000426,0.00028,-2.8e-05,-0.000206,-4e-05,-0.000151,-0.000194,0.000346,-0.000424,0.000136,0.000209,-0.00028,-0.00015,-1.9e-05,-0.000293,-5.9e-05,3.9e-05,-2.2e-05,0.000224,0.000465,-1e-04,-9.4e-05,0.000323,0.000542,0.000108,-0.00015,0.000603,-0.000235,-0.000256,-5.7e-05,-0.000243,-0.000166,0.000265,0.000492,5.7e-05,-0.00049,-4e-06,-9.6e-05,-0.000117,-7.4e-05,0.00042,2e-05,0.000127,0.00025,0.000423,-1.7e-05,-0.000174,0.000581,-0.000111,0.000185,-6.1e-05,-0.000405,0.000768,-0.000394,-0.000138,-0.000658,-0.000162,0.000107,-6.1e-05,-0.000457,-9.3e-05,-5e-06,-0.000159,-0.000235,-0.000158,-0.000458,0.000382,-0.000269,-0.000636,0.000103,0.000357,3.9e-05,0.000365,0.000469,0.000155,-0.000223,-0.000448,0.000185,8.2e-05,0.000239,0.001116,0.000446,-8.3e-05,-0.000101,-0.000398,4.7e-05,-5.9e-05,0.000147,-8e-05,0.000315,-0.000183
-2e-06,0,5e-06,0,7e-06,1e-06,-9e-06,1e-06,-1.2e-05,4e-06,-2e-06,-5e-06,0,1.7e-05,-3e-06,2e-06,0.000108,2e-05,9.4e-05,-3.3e-05,1.7e-05,0.000115,2.4e-05,0.000142,-3.3e-05,-4e-05,3.9e-05,-0.000101,-0.000303,1.7e-05,-0.000263,-0.000339,-0.000104,-0.00011,-0.000174,-2.8e-05,-0.000254,0.000367,0.000246,-5.6e-05,-0.000224,-3.8e-05,0.000173,-0.000483,0.00015,0.000434,-0.000128,5.9e-05,1.3e-05,9.4e-05,0.000248,-6.8e-05,-0.000285,-0.000229,-0.00015,0.00017,-0.000386,0.000245,0.000351,0.000513,-8e-06,0.000466,-0.000661,-0.000119,-6e-06,0.000115,-0.000308,0.000161,-0.000239,-8e-05,-8.4e-05,-0.000299,-1.4e-05,0.000293,-2.2e-05,0.00037,3.9e-05,-0.000167,-0.000139,-0.00015,0.000176,-0.000406,-0.000532,1.3e-05,6.9e-05,4.1e-05,0.001213,0.000232,0.000586,-0.000158,0.000529,8e-05,-4e-05,-1.1e-05,0.000188,1.5e-05,0.000391,-0.00024,0.000294,-4.4e-05,-0.000141,-8.1e-05,5.7e-05,-2e-04,0.000166,9.9e-05,-9.8e-05,1.8e-05,8e-06,-0.000215,-3.2e-05,0.000131,-0.000228,4e-05,7.4e-05,0.00015,0.000135,-0.000628,0.000563,-0.000237,-0.000345
1e-06,-4e-06,0,3e-06,-5e-06,-2e-06,-8e-06,2e-06,2e-06,-6e-06,-4e-06,2e-06,-1e-06,5.4e-05,6e-06,0,-2.2e-05,-4.4e-05,-6.1e-05,4.9e-05,-3.2e-05,-1.4e-05,0,0,0.000117,4.6e-05,0.000134,8.8e-05,0.000219,-9e-05,0.000168,0.000338,-5e-06,-1e-05,8.3e-05,-0.000231,0.000312,-0.000203,0.000364,-3.1e-05,0.000116,-4.8e-05,0.000287,-0.000167,-3e-06,-0.000289,0.000119,-0.000215,-0.000167,-1e-05,-0.000355,1e-06,0.000217,0.000319,0.000146,-0.000189,6.6e-05,0.000109,-0.000134,-0.000268,0.000114,-0.000323,0.000606,0.000242,7.8e-05,0.000101,0.000282,0.000227,-6.4e-05,-9.1e-05,0.000305,-0.000189,-0.000131,9.7e-05,-0.000325,1e-06,-4.6e-05,-0.000124,3.6e-05,-0.000176,-0.000131,0.000155,0.000259,-0.000186,1.4e-05,0.000304,0.000377,-0.000247,0.000254,0.000167,-0.000408,-5.9e-05,4.7e-05,-4.9e-05,1e-05,-6.4e-05,-0.000101,0.000519,-0.000557,0.000126,-4.4e-05,0.000169,0.000212,-4e-05,-0.000147,2e-04,0.000309,4.2e-05,-7.4e-05,0.000143,-0.000129,0.000463,-4.2e-05,0.000195,0.000221,9.5e-05,-0.000162,6.6e-05,0.000168,-0.00013,0.000173
1e-06,6e-06,-6e-06,-1e-05,-2e-06,-3e-06,-1.2e-05,2e-06,2e-06,1e-06,1.7e-05,-5e-06,3e-06,-7e-06,3.8e-05,-2.2e-05,1.8e-05,-2.6e-05,1.6e-05,-0.000139,2.2e-05,-5e-06,2.3e-05,-0.000148,5e-05,9.7e-05,-0.000187,-3.6e-05,-0.000247,0.00012,-0.000214,-0.000211,3.2e-05,-9.5e-05,-1.5e-05,-9.3e-05,-0.000153,6.5e-05,-0.000164,-9e-06,5.6e-05,4e-05,-0.000317,0.000114,0.000206,-1.4e-05,0.000169,-0.000112,-4.8e-05,-4.2e-05,-3.9e-05,0.000112,-0.000244,-0.000121,-7e-05,0.000198,-0.00023,-0.000456,-0.000246,2.1e-05,0.000141,-0.000263,-1.5e-05,-0.000104,0.00015,0.000302,-0.000251,-8.1e-05,-3.7e-05,5e-06,0.000141,-0.000307,-9.4e-05,2.7e-05,-6.2e-05,-3e-05,-3.9e-05,5.2e-05,-1.9e-05,0.000167,-0.000142,-3.8e-05,0.000104,0.000118,3e-06,-0.000303,0.000946,0.000214,-0.000201,0.000255,-0.000139,-0.000134,-4.7e-05,0.000302,-0.000176,-3.6e-05,-0.000102,-0.000266,7.4e-05,-9.7e-05,0.00013,7.2e-05,0.000144,-0.000112,-8.2e-05,0.000195,-8.6e-05,1.5e-05,-0.000189,-7.3e-05,-0.000501,-0.000274,1.8e-05,-0.00011,-0.000316,-0.000169,1.5e-05,9.4e-05,-0.000139,0.000161,-0.000101
-1e-06,-3e-06,-1e-06,1e-06,4e-06,-5e-06,-2e-06,-1e-06,2e-06,-2e-06,-9e-06,0,-3e-06,-2.1e-05,1.5e-05,2e-06,-2.6e-05,2.1e-05,3.7e-05,0.000111,3.2e-05,-6.7e-05,-2.4e-05,3.5e-05,-2.6e-05,-3.4e-05,9.7e-05,-8.6e-05,0.000102,8e-06,5.8e-05,-6.6e-05,2.2e-05,0.000269,1.3e-05,2e-06,8.8e-05,-0.000224,0.000142,-0.000162,-2.1e-05,-5.6e-05,-3.4e-05,0.00029,1.5e-05,0.000109,-6.5e-05,0.000265,-6.3e-05,1.4e-05,3e-06,-1.2e-05,0.000148,3.9e-05,5.1e-05,0.00017,0.00018,0.00013,-2.8e-05,0.000141,-0.00013,0.000365,-0.000433,2.6e-05,9e-06,-0.000161,-2e-06,-0.00022,5.8e-05,-7e-06,3e-05,0.000115,-5.9e-05,-0.000352,0.000317,4.3e-05,-2.3e-05,-1e-04,8.5e-05,0.000369,0.00016,-6e-06,-0.000328,1.3e-05,-0.000187,0.000144,-6.8e-05,-2e-06,-0.000265,0.000173,-3.3e-05,0.00012,-1.1e-05,0.000148,0.000105,-0.000153,-9.8e-05,0.000274,0.000115,0.000126,-0.000189,-0.000165,-3.2e-05,-0.000239,8e-05,-0.000355,-8e-06,-1e-05,-8.8e-05,5.1e-05,-0.000145,-0.000132,-0.000113,6.9e-05,5.4e-05,-0.000165,-7.2e-05,-1.6e-05,-9e-06,-0.000115,-0.00025
0,4e-06,-2e-06,6e-06,-2e-06,4e-06,-3e-06,-4e-06,-4e-06,-4e-06,-3e-06,5e-06,0,-1.7e-05,-1.7e-05,-1.4e-05,-1.3e-05,-8e-06,-5.3e-05,-0.000119,5e-06,5.5e-05,-8.4e-05,-2.1e-05,-2e-05,4.7e-05,3e-06,0.000124,-6.1e-05,-2e-05,0.000115,0.000206,-8.4e-05,-0.000234,4.5e-05,6.9e-05,2e-06,4e-05,7e-05,4.3e-05,7.8e-05,0.00012,-4.4e-05,0.000123,-9.2e-05,0.000138,-1.8e-05,5.2e-05,6.7e-05,4.9e-05,0.000174,-0.000117,-8.4e-05,-0.000139,4.1e-05,-0.000442,-0.000199,3.4e-05,-4.2e-05,-2.9e-05,-1.3e-05,-0.000193,0.000257,-0.000186,6.9e-05,-7e-06,-0.000144,-5.1e-05,-3.9e-05,-0.000116,-5.9e-05,-7.4e-05,6.1e-05,8.2e-05,-0.000151,-1e-05,8.1e-05,-1.1e-05,-0.000116,0.000289,-0.000353,0.000233,0.000241,-3.6e-05,-2.8e-05,-6.6e-05,-0.00068,-0.000111,0.000314,0.000155,0.000252,-5.4e-05,3.7e-05,-5.4e-05,4.6e-05,6.5e-05,-9.9e-05,-0.00024,-0.000438,0,-5.7e-05,0.000176,-0.000251,4.1e-05,0,-0.000185,2.9e-05,-8.2e-05,-0.000142,-2.6e-05,-7.5e-05,-0.000141,-1.4e-05,-3.9e-05,8.3e-05,0.000243,-0.000101,-2.9e-05,0.000104,-0.000141,0.000245
-2e-06,-3e-06,-4e-06,-4e-06,1e-06,-1e-06,4e-06,-3e-06,2e-06,-3e-06,8e-06,-7e-06,0,-4e-06,1e-06,7e-06,2.2e-05,-1.5e-05,4.9e-05,0.000133,-1.3e-05,-8e-06,3.5e-05,2e-05,-4.6e-05,-0.000185,-0.000133,-7.6e-05,0.00016,-9.2e-05,-0.00026,-0.000108,5.1e-05,-5.7e-05,-2.9e-05,0.000165,-9.1e-05,-2.9e-05,-0.000155,-6.1e-05,-1.2e-05,6.3e-05,0.000164,-0.000157,-0.000137,-0.000194,9.8e-05,-9.1e-05,7.4e-05,-8.1e-05,-4.2e-05,5.1e-05,2e-06,-8.4e-05,0.000144,0.000208,7.5e-05,-5e-06,0.000134,-0.00017,3e-06,3.1e-05,-0.000116,5.2e-05,-3.2e-05,-0.000183,-1.1e-05,0.000132,5.6e-05,4.3e-05,9e-06,2.7e-05,-6.3e-05,0.000157,-0.000296,1.8e-05,2.1e-05,-7.5e-05,-3.7e-05,-4.3e-05,0.000217,-4.4e-05,-0.000238,-7.9e-05,-5.7e-05,-0.000155,-0.000514,-0.000193,0.000192,-0.000166,-0.000249,-1.6e-05,-0.000107,-0.000138,-5.5e-05,1e-04,-0.000105,5e-06,-0.000309,-0.000118,7.1e-05,-0.00021,-2.1e-05,-3.9e-05,-8.7e-05,-8.3e-05,-0.000128,2.9e-05,-0.000124,-1e-05,8.3e-05,-0.000117,-0.000103,-6.3e-05,-0.00019,-0.000166,1.2e-05,-5.8e-05,0.000275,0.000109,2.1e-05
0,2e-06,5e-06,2e-06,-3e-06,2e-06,7e-06,1e-06,2e-06,-1e-06,-7e-06,6e-06,0,-3e-06,1e-05,-1e-06,-7e-06,6e-06,-1.9e-05,-4.5e-05,1e-06,2.7e-05,4.9e-05,1.4e-05,8e-06,8.4e-05,0.00013,3e-05,-8.4e-05,7e-05,0.00019,-2.7e-05,-1.5e-05,9.3e-05,-2.7e-05,-4.2e-05,0.000165,0.000212,-0.000117,-3.2e-05,0.000127,-1.4e-05,-5.7e-05,-4.9e-05,-5.9e-05,0.000257,-6.1e-05,0.000127,4e-06,-3.1e-05,5e-05,7.9e-05,-8e-06,6.5e-05,-1.2e-05,8.5e-05,-0.000143,0.000112,-0.000166,0.000188,-2.4e-05,0.000151,0.000122,-0.000133,7.6e-05,3.4e-05,-1.4e-05,5.8e-05,0.000103,1.1e-05,-0.000269,-9.2e-05,4.8e-05,4.6e-05,0.000238,-0.000123,-4e-05,2e-06,0.000128,-0.000104,-0.000116,5e-06,0.000238,7e-06,-5.3e-05,0.000199,-0.000152,-1.7e-05,0.00023,-0.000102,0.000183,-3.3e-05,9.6e-05,-0.000101,1.5e-05,-7.9e-05,-9.4e-05,-2.7e-05,-1.6e-05,0.000145,7.1e-05,0.000257,-1.6e-05,1.8e-05,5.3e-05,-2e-04,1.3e-05,6.1e-05,9e-06,-5e-06,5.4e-05,3.5e-05,-2.8e-05,9.5e-05,-0.00018,7e-06,-8.8e-05,0.000206,8.2e-05,0.000101,-8.1e-05
1e-06,-1e-06,-1e-06,-1e-06,2e-06,-3e-06,7e-06,0,0,-4e-06,6e-06,-7e-06,-1e-06,1.7e-05,0,8e-06,2e-05,-1e-05,-1.1e-05,1.5e-05,9e-06,-5.5e-05,0,3.6e-05,4.7e-05,-5.6e-05,-6.6e-05,-2.2e-05,0.000166,2.3e-05,-2.3e-05,0.000132,1.8e-05,-0.000122,1.1e-05,8.5e-05,-8.4e-05,-3e-05,0.00018,-5e-06,-7.4e-05,-3.3e-05,6.6e-05,-3.9e-05,7e-05,-0.00014,-4.4e-05,-0.000131,-2.7e-05,0.000122,4e-06,-7.1e-05,3.7e-05,7e-06,-5.9e-05,-0.000266,1e-04,-0.000117,-3.5e-05,7e-06,-5.4e-05,-0.000267,-7.7e-05,2.7e-05,3.3e-05,3.6e-05,-5.5e-05,-2.6e-05,2.3e-05,-2.6e-05,2.4e-05,-5e-06,3.6e-05,-0.000113,0.000156,-5.2e-05,-2.6e-05,-0.000102,-0.000166,-0.00011,6.4e-05,0.00015,-0.000195,9.1e-05,6.7e-05,-0.00011,-2.7e-05,2.9e-05,-7.3e-05,-6.4e-05,-0.000281,9.1e-05,-1e-05,-7.1e-05,-6.2e-05,5.6e-05,-5.6e-05,-0.000175,-0.000138,2.6e-05,-3.5e-05,-0.000193,6.5e-05,3.7e-05,3.6e-05,-5e-05,0.000138,5e-06,-9.9e-05,-1.4e-05,-0.000132,0.000158,1.6e-05,-0.000146,0.000297,5e-05,0.000101,-7e-05,-0.000122,-0.000142,-5.6e-05
-1e-06,-2e-06,-1e-06,-2e-06,0,2e-06,6e-06,0,-3e-06,1e-06,-1e-06,4e-06,0,2e-06,7e-06,-2e-06,-7e-06,-1e-05,3.1e-05,2.2e-05,-1.1e-05,-9e-06,-8e-06,-1.5e-05,9e-06,1e-04,-7e-06,-9e-06,-1e-04,-7.6e-05,4.2e-05,-0.000167,-8e-05,9.8e-05,6e-06,-2.6e-05,-1.4e-05,3.7e-05,8.2e-05,-1.6e-05,9.6e-05,-2.8e-05,-0.000192,0.000124,7.1e-05,9e-06,-8e-06,-2.8e-05,-5.7e-05,-0.000129,3.7e-05,6.2e-05,-7.7e-05,9.6e-05,2e-06,0.000227,-0.000111,-5.7e-05,-0.000101,-4.4e-05,-3.9e-05,0.000147,-0.000172,-0.000105,3e-06,1e-05,1.5e-05,-0.000134,-0.00021,6.1e-05,-0.000138,1.6e-05,4.9e-05,-4.5e-05,-0.00024,-6e-06,2.2e-05,-3.9e-05,4.3e-05,0.000199,-4.4e-05,-0.000141,0.000171,-7e-06,-7.6e-05,-0.000109,-0.000203,-1.4e-05,-7.4e-05,-1.7e-05,7.3e-05,2.2e-05,-8.1e-05,0,2.6e-05,-9.6e-05,-2.6e-05,0.000267,6.2e-05,-1.1e-05,-1.2e-05,8.9e-05,0.000142,-5e-06,-5.8e-05,1.6e-05,-5.7e-05,2e-06,-7e-05,4.2e-05,0.000402,5.5e-05,-7.8e-05,0.000162,-2e-06,-0.000126,-3.4e-05,8e-06,-2e-06,1.2e-05,0.000101
0,2e-06,0,2e-06,1e-06,-3e-06,1e-06,-1e-06,3e-06,-2e-06,-6e-06,0,0,-4e-06,2e-06,4e-06,2e-06,5e-06,-3.4e-05,-4.8e-05,1e-05,1.6e-05,-2.1e-05,-5.4e-05,-1e-05,8e-06,6e-05,5.2e-05,2e-05,-1.9e-05,-3.7e-05,0.000113,0.000113,4.4e-05,-1.5e-05,-0.000161,2.1e-05,-0.000134,-7.9e-05,-2e-05,-1.1e-05,-1.2e-05,7.9e-05,0.000149,6.3e-05,1.8e-05,-2.2e-05,3.1e-05,-2.2e-05,4.7e-05,-0.000127,-1.6e-05,8.1e-05,-6.3e-05,-1.3e-05,2e-05,6e-06,0.000138,-4.8e-05,-1.8e-05,6.3e-05,1.3e-05,0.000217,8.2e-05,-3e-06,-3.2e-05,3.1e-05,-1e-05,8e-06,8e-06,-5.5e-05,-5.7e-05,-6.5e-05,-1.3e-05,-1.5e-05,2.9e-05,9e-06,0.000163,5.3e-05,0.000155,-0.000124,3.6e-05,-6.6e-05,-8e-05,-4.6e-05,0.000146,-8e-06,-2.2e-05,5.5e-05,0.000107,7.8e-05,-0.000108,1e-04,6.2e-05,9.2e-05,-0.000107,7.6e-05,-0.000144,-0.000194,1.2e-05,3e-05,-7.5e-05,-1.3e-05,4.9e-05,-4.1e-05,-6.9e-05,-3.7e-05,-1.7e-05,-2.4e-05,-6.9e-05,-0.000114,-3e-06,-4.4e-05,-8.7e-05,-0.000189,7.4e-05,1.2e-05,6e-06,0.000164,0.000125,-2.5e-05
0,-2e-06,0,-1e-06,-1e-06,1e-06,2e-06,-2e-06,-2e-06,-1e-06,4e-06,-1e-06,-1e-06,1e-06,-8e-06,-4e-06,-5e-06,0,2e-05,1.8e-05,5e-06,1.6e-05,3e-06,1.3e-05,-2.2e-05,2.3e-05,-4.4e-05,-5.5e-05,-0.000124,-1e-05,-0.000122,-5e-06,-9.4e-05,-0.000113,1.9e-05,6.3e-05,3e-06,1.1e-05,-1.8e-05,2.1e-05,5.3e-05,-1.5e-05,4.2e-05,-3.1e-05,-2.8e-05,2.7e-05,-4.1e-05,-3.5e-05,2.3e-05,-1.1e-05,-4.6e-05,2e-06,-7.4e-05,4.6e-05,-5e-06,-0.000152,-3.5e-05,-5.1e-05,1.6e-05,3.4e-05,-1.1e-05,-0.000125,-9.8e-05,-7e-05,4e-05,-4.4e-05,2e-06,8.3e-05,0.000105,-3.4e-05,4.4e-05,8.7e-05,-2.3e-05,8.1e-05,0.000218,-1.8e-05,4e-06,-8e-05,-9.5e-05,0.000144,0.000156,2e-05,-1e-05,-1.7e-05,2.1e-05,-6.7e-05,4e-05,4.3e-05,-7.2e-05,5.8e-05,1.1e-05,4.7e-05,-4e-05,2.9e-05,-7.1e-05,3.7e-05,6.8e-05,9.1e-05,-9.9e-05,5.7e-05,-6.2e-05,9.3e-05,-1.2e-05,-5e-05,5.5e-05,5.7e-05,2e-05,2e-06,-6.9e-05,4.4e-05,0.000216,-7.9e-05,-3.4e-05,5.2e-05,0.000116,-4.9e-05,4.4e-05,-2.2e-05,0.000107,-3.9e-05,-8.5e-05
0,2e-06,-2e-06,0,0,-1e-06,1e-06,-1e-06,0,-1e-06,-1e-06,1e-06,1e-06,-6e-06,3e-06,1e-06,-1e-05,-6e-06,-1e-06,-2.6e-05,-6e-06,2e-06,-1.5e-05,0,-2.5e-05,-4.8e-05,-3e-06,3e-05,7.5e-05,2.3e-05,0.000167,-8.4e-05,4e-05,4.7e-05,-1.3e-05,-5.3e-05,8e-06,-7.6e-05,8.3e-05,-3e-06,-4.6e-05,-7e-06,5e-05,-9e-05,-5.9e-05,-0.000104,5.8e-05,-3.6e-05,5.8e-05,-6.5e-05,6e-05,3.7e-05,6.5e-05,-8e-05,-6.7e-05,0.00015,1.1e-05,1.4e-05,-3.5e-05,3e-05,1.1e-05,0.000172,1e-06,8.7e-05,3e-06,3.6e-05,-6e-06,3.1e-05,-0.000121,1.3e-05,4.5e-05,-5.3e-05,-4e-06,5.7e-05,-6.2e-05,2.3e-05,1.1e-05,-2.8e-05,3.2e-05,-0.000119,-4.6e-05,-0.000138,1.8e-05,2.7e-05,-4.2e-05,-6.3e-05,0.00015,-4e-06,-6e-06,3.1e-05,-7.6e-05,7.1e-05,-5e-05,1.1e-05,-2.6e-05,-1.2e-05,5.6e-05,-2.8e-05,0.000265,-1e-06,-1.3e-05,-4.2e-05,-4e-05,5.6e-05,1.5e-05,-1.8e-05,-6.4e-05,1.6e-05,-3e-05,3e-06,-0.000276,-4.5e-05,4e-06,-1.1e-05,5e-05,-2e-05,-4.9e-05,0.000126,-2e-05,-6.9e-05,-4e-06
0,-1e-06,2e-06,-1e-06,1e-06,1e-06,1e-06,-1e-06,0,-2e-06,0,-1e-06,0,-7e-06,8e-06,-6e-06,1e-05,-1e-06,-1.7e-05,8e-06,0,-3.8e-05,1.5e-05,1.2e-05,2.1e-05,-4.8e-05,5e-05,-2.6e-05,-6.8e-05,2.5e-05,-7.6e-05,9.4e-05,-2.4e-05,-5e-06,6e-06,-4.2e-05,-3.6e-05,0.000159,-9e-06,-4e-06,4.7e-05,2e-05,-0.000118,-8.2e-05,-5.6e-05,7e-06,-5.8e-05,8.3e-05,9e-06,2.3e-05,1.1e-05,-4.1e-05,-6.2e-05,2.2e-05,-5.1e-05,-3.6e-05,-6.4e-05,-2e-05,6.8e-05,-3.8e-05,2.6e-05,-0.000133,-2.4e-05,-3e-05,1.5e-05,6e-06,-5e-06,-3.3e-05,4.9e-05,-2.2e-05,-1e-06,0.000116,3.7e-05,-9.6e-05,-0.000158,2.1e-05,-6e-06,2.8e-05,2.3e-05,-0.000102,0.000126,8.3e-05,-5e-06,4.2e-05,-5e-06,9.5e-05,0.000492,-3.6e-05,0.000207,1.4e-05,-7.7e-05,-6.2e-05,7.7e-05,-9e-06,2.1e-05,2e-06,2.1e-05,-3.8e-05,-7e-06,-7e-06,4.1e-05,-2.5e-05,-1e-04,-7.7e-05,-5e-05,4.2e-05,3.1e-05,6e-06,3e-05,-3.3e-05,-1.5e-05,-1.1e-05,-5.2e-05,-3.9e-05,-9.7e-05,1.9e-05,3.5e-05,-0.000123,-8e-05,5.5e-05,7.5e-05
0,1e-06,1e-06,2e-06,-1e-06,0,0,0,1e-06,1e-06,0,1e-06,0,-2e-06,1e-06,0,-6e-06,-2e-06,2.4e-05,-6e-06,-1e-06,1e-05,1.2e-05,2.2e-05,3.3e-05,2.2e-05,-5.1e-05,1.9e-05,8.3e-05,-5.6e-05,-5e-06,-3.3e-05,4.1e-05,-2e-05,0,0.000118,4.3e-05,-1.3e-05,-3.2e-05,1.1e-05,1e-06,3.6e-05,2e-05,4e-06,0,-2.7e-05,8e-05,1e-06,-2.9e-05,8e-06,-1.5e-05,1.5e-05,3.6e-05,-4.3e-05,-3.3e-05,-0.000151,2e-06,-5e-05,-1.5e-05,-3.1e-05,1.4e-05,-2.6e-05,-1.5e-05,1.9e-05,-6e-06,6e-05,-1.1e-05,-6.4e-05,5.9e-05,7e-06,0.000131,3e-06,-6e-06,-1.5e-05,0.000138,1.3e-05,-2.6e-05,1e-05,-7.3e-05,-4.9e-05,-0.00012,-4.7e-05,-7e-06,-1e-05,-3.5e-05,-0.000111,6.1e-05,2.3e-05,-4e-06,-5.5e-05,0.000152,-1.5e-05,-4.2e-05,-4.2e-05,-6e-06,1.6e-05,-3.2e-05,1.1e-05,4e-06,4.2e-05,2.9e-05,5.2e-05,5.2e-05,5e-06,-7e-06,-3.6e-05,5.9e-05,5e-06,4e-06,1.5e-05,-8.8e-05,4.3e-05,-3e-05,4e-05,1.8e-05,-5.4e-05,-4.1e-05,-2.2e-05,-4e-06,1.3e-05,-5.8e-05
0,1e-06,0,0,1e-06,0,-1e-06,1e-06,0,-3e-06,0,0,0,7e-06,-3e-06,-3e-06,1e-05,-7e-06,-1.9e-05,2.7e-05,-5e-06,5e-06,9e-06,0,8e-06,-1.3e-05,2e-05,1.4e-05,-3.3e-05,2.8e-05,3.5e-05,-4.8e-05,-6.2e-05,8.1e-05,1e-06,5e-06,-3.4e-05,2.3e-05,-1e-06,0,-4e-06,-4e-06,7e-06,7e-05,2.2e-05,5.1e-05,-3.5e-05,-3e-05,-2.1e-05,-3e-05,5.7e-05,-1e-06,-7e-06,5.6e-05,3.2e-05,0.000161,-1.3e-05,5.9e-05,-1.9e-05,6.8e-05,-2e-06,0.000172,0.000108,-4.4e-05,8e-06,-5.4e-05,-1e-05,-2e-06,-4.8e-05,-7e-06,1e-06,1.7e-05,-2.3e-05,7e-06,9.1e-05,-5e-06,0,-4e-05,4.9e-05,0.000126,-3.5e-05,-6.4e-05,8e-06,-2.5e-05,-2.3e-05,2.6e-05,-9.5e-05,-7e-06,-0.000106,-7.3e-05,-8.6e-05,3.7e-05,-1e-05,-2.5e-05,3.5e-05,-4.3e-05,-4.7e-05,-0.000102,7.9e-05,-2e-06,-4.8e-05,-4e-05,8e-06,-2.9e-05,3.1e-05,-8e-05,-5.2e-05,-2e-06,6e-06,1e-05,4e-05,6e-05,-2.6e-05,-3.4e-05,4.5e-05,2e-05,-1.1e-05,8.9e-05,0.000113,-8.6e-05,-2.3e-05
0,-1e-06,1e-06,-2e-06,0,-1e-06,-2e-06,1e-06,0,0,0,-1e-06,0,7e-06,-2e-06,1e-06,-4e-06,0,7e-06,-2.5e-05,-2e-06,2.4e-05,-4e-06,-1.5e-05,-3.5e-05,4.2e-05,2e-05,-3.6e-05,6.9e-05,1.7e-05,-3.4e-05,8.7e-05,5.2e-05,-7.5e-05,1e-06,-1e-06,3.1e-05,-5e-05,1.8e-05,4e-06,-3e-06,2e-06,3.8e-05,4.3e-05,3.4e-05,-7.4e-05,5.7e-05,4.1e-05,-2.1e-05,-6e-06,1.3e-05,-9e-06,-1.9e-05,1e-05,-1.2e-05,-4e-06,-3.1e-05,1.2e-05,-6e-06,-2.8e-05,-1.2e-05,-0.000157,-0.000117,1.6e-05,7e-06,2.9e-05,-2.9e-05,4.1e-05,9e-06,-8e-06,5e-06,4.5e-05,4e-06,4.7e-05,-0.000137,-1e-06,2e-06,-2.3e-05,-1.7e-05,0.000109,1.7e-05,9.5e-05,1.3e-05,-1.1e-05,2.4e-05,4.1e-05,-5.6e-05,-3.7e-05,-2.1e-05,-1.9e-05,7.4e-05,4e-06,4.9e-05,-7e-06,-2.2e-05,7e-06,-4.8e-05,0.000147,0.000109,-7e-06,1.6e-05,4.9e-05,3.6e-05,-2e-06,-6e-06,-3.2e-05,-1e-05,0,2.9e-05,-6e-06,-3.3e-05,-1.1e-05,-2.7e-05,2.5e-05,-0.000109,-4.4e-05,1.7e-05,-7e-05,3.3e-05,2.3e-05,4e-06
0,1e-06,0,3e-06,0,0,-5e-06,0,-1e-06,-1e-06,1e-06,1e-06,0,-3e-06,-1e-06,-1e-06,-1e-06,1e-06,8e-06,3.1e-05,1e-06,-1.7e-05,-1.1e-05,-1e-05,-2.8e-05,-5e-06,-4.2e-05,2.5e-05,-6.2e-05,3e-06,7.5e-05,-6.5e-05,-3.6e-05,1.3e-05,-3e-06,2.6e-05,-1.5e-05,-3.7e-05,1.3e-05,1.1e-05,3e-06,-1.3e-05,-7e-06,-3.8e-05,2.2e-05,-1.9e-05,-4.9e-05,-3.8e-05,1.8e-05,7e-06,-2.2e-05,-5e-06,2.3e-05,1.4e-05,-5e-06,-0.000123,1e-06,-3.8e-05,2.1e-05,-3.9e-05,-2.1e-05,4e-05,3.3e-05,-2.9e-05,1e-06,-7.5e-05,7e-06,2.3e-05,2e-05,1.9e-05,4.5e-05,-5.2e-05,3e-06,8e-06,-5.4e-05,-2e-06,5e-06,4e-05,-3e-05,1.3e-05,-3e-05,-7.2e-05,-1.8e-05,1.7e-05,-1.5e-05,-0.000115,-0.000159,-2.9e-05,-4.3e-05,-1.4e-05,-0.000104,-3.6e-05,-6e-05,-9e-06,-2.9e-05,1.9e-05,-3.1e-05,-7.1e-05,0.000187,2.9e-05,9e-06,-7.4e-05,5.3e-05,-1e-05,-2.2e-05,-0.000113,1.3e-05,5e-06,8e-06,-1.2e-05,3.5e-05,-8e-06,1e-06,-1.1e-05,5.7e-05,2.3e-05,-3.8e-05,2.3e-05,-6.6e-05,6.6e-05,5e-06
0,-1e-06,-1e-06,-1e-06,0,-1e-06,-4e-06,-1e-06,1e-06,-1e-06,0,-1e-06,0,-3e-06,3e-06,2e-06,1e-06,-4e-06,-1.7e-05,-2.4e-05,0,-9e-06,-1.5e-05,-3e-06,2.2e-05,4.1e-05,2.9e-05,-1.2e-05,4.3e-05,-2.6e-05,-0.000108,6e-06,3.3e-05,2.9e-05,-2e-06,-4e-05,-2.4e-05,-9e-06,-2e-06,-5e-06,1.4e-05,-5e-06,-2.1e-05,-6.4e-05,-6e-06,8e-06,7.7e-05,-2.7e-05,3e-05,1.9e-05,-3e-05,1e-06,-1.2e-05,-2.3e-05,-4e-06,0.000151,-3.6e-05,1.6e-05,5.3e-05,4.2e-05,2e-06,6e-05,2.8e-05,3e-06,-1.4e-05,7.8e-05,0,-2.4e-05,-1.5e-05,-1.4e-05,-6.5e-05,5e-05,6e-06,-2.9e-05,0.000147,-2e-06,7e-06,-6.5e-05,3.6e-05,-0.000117,5.9e-05,4e-06,5e-06,5e-06,-1.6e-05,5.2e-05,-1.6e-05,1.4e-05,6.8e-05,4.5e-05,6.5e-05,2e-05,2.5e-05,2.2e-05,4.7e-05,-4.4e-05,-2.3e-05,2e-05,8e-06,2.2e-05,-2.7e-05,6.1e-05,-4.8e-05,4.4e-05,9e-06,-1.7e-05,-1.4e-05,6e-06,7e-06,2.1e-05,3.9e-05,-4.9e-05,-4.8e-05,5e-06,6.8e-05,-2.5e-05,2.9e-05,-3.8e-05,-7.3e-05,-3.7e-05,-2.1e-05
0,0,1e-06,-1e-06,0,1e-06,-1e-06,0,-1e-06,0,-1e-06,1e-06,0,1e-06,1e-06,0,-7e-06,-2e-06,1.6e-05,1.2e-05,2e-06,-1e-06,2e-06,-1e-06,3e-05,-4.1e-05,-1e-06,8e-06,-4.2e-05,0,3e-05,5.8e-05,-4.6e-05,-5.4e-05,4e-06,-3.3e-05,5.1e-05,1.8e-05,8e-06,7e-06,-2.4e-05,-1.2e-05,-2e-05,-3.1e-05,-2.1e-05,2.2e-05,-0.000102,1.7e-05,1.3e-05,-4.9e-05,-1.1e-05,2e-06,0,-1.6e-05,2.8e-05,-3.7e-05,1.3e-05,-1.1e-05,1e-06,1e-05,-2e-06,-0.000121,-1.9e-05,-2.6e-05,-1e-06,-5.8e-05,-3e-06,-3.3e-05,-4.2e-05,5e-06,-3.1e-05,-4.3e-05,-1.9e-05,-2.7e-05,4e-06,-1.2e-05,5e-06,-3.2e-05,-3.1e-05,-0.000109,-7.6e-05,7.8e-05,-1.1e-05,-1e-05,-4.8e-05,8e-06,-2.9e-05,-5e-06,9e-06,3.7e-05,-4e-05,2e-06,3.3e-05,2.7e-05,-2e-06,-1e-06,-2e-06,3e-05,-3.9e-05,-3.2e-05,-4e-06,-3.4e-05,-6e-06,-4.2e-05,7e-06,-3.1e-05,2.8e-05,5e-06,2.7e-05,-1.1e-05,5.9e-05,-2e-05,-2.1e-05,1e-05,-0.00011,-4e-05,-5e-06,2e-05,4e-06,-2.9e-05,-3e-05
0,0,1e-06,1e-06,0,-1e-06,0,0,0,-1e-06,1e-06,-1e-06,0,-5e-06,0,1e-06,9e-06,-1e-06,-8e-06,-6e-06,1e-06,1.5e-05,1.4e-05,1.9e-05,3e-06,-2e-05,-2.3e-05,3e-06,1.3e-05,1.2e-05,5.1e-05,-8.3e-05,4.5e-05,5.6e-05,0,-1.8e-05,-4.5e-05,6.5e-05,2e-05,1e-06,1.7e-05,-1e-06,2.3e-05,2.2e-05,-3.2e-05,-6.2e-05,9.4e-05,4e-06,-1.6e-05,2.4e-05,-4e-06,-1e-05,-1e-06,6e-06,1.9e-05,-0.000114,-4.4e-05,2.1e-05,7e-06,-3.5e-05,-2.2e-05,0.000129,3.5e-05,-1e-06,-3e-06,6.4e-05,9e-06,-2e-06,3e-06,7e-06,-2e-06,2e-05,1.5e-05,2.1e-05,-0.00015,-7e-06,-6e-06,8.2e-05,4e-06,3e-06,5.8e-05,-7.3e-05,2.3e-05,-3e-06,1.3e-05,-6.9e-05,-6.6e-05,-2.2e-05,-5.4e-05,1.1e-05,6.6e-05,0,-6.6e-05,0,-2.6e-05,-1.2e-05,8e-06,-6.2e-05,0.000141,2.7e-05,3e-05,2.7e-05,-3.4e-05,5.4e-05,-1.5e-05,-4.3e-05,9e-06,-1e-06,2e-05,-3e-06,6e-05,9e-06,-1e-05,-2.2e-05,1.4e-05,3.5e-05,-7e-06,4e-05,6.4e-05,5.4e-05,1.2e-05
0,0,-1e-06,-1e-06,0,1e-06,0,0,0,0,0,1e-06,0,2e-06,-1e-06,-1e-06,-7e-06,-4e-06,-4e-06,-1.2e-05,0,4e-06,1.6e-05,9e-06,-2.2e-05,-1.9e-05,2.5e-05,-2.1e-05,-4.1e-05,2.4e-05,-5.4e-05,4.7e-05,-3.1e-05,-7e-06,-1e-06,1.8e-05,1.9e-05,-3.9e-05,-1.7e-05,-1e-06,-7e-06,-1e-06,3.7e-05,5.9e-05,-1.8e-05,2e-05,-0.000105,-2.6e-05,-2.6e-05,2.4e-05,1.1e-05,1e-05,6e-06,-5e-06,1.5e-05,0.000134,1.4e-05,8e-06,-1.1e-05,1e-06,1.1e-05,-5e-05,-6.1e-05,-1.4e-05,-3e-06,-8.3e-05,-5e-06,2.2e-05,2.5e-05,-1.2e-05,-6.2e-05,-2e-05,4e-06,2.2e-05,6.1e-05,0,-1.1e-05,-2.1e-05,5e-06,8.7e-05,-3.1e-05,4.5e-05,-4e-05,9e-06,3.1e-05,3.2e-05,-4.6e-05,2e-06,3.8e-05,-4e-06,-2.9e-05,-1.4e-05,4.4e-05,-1.5e-05,-5e-06,-1e-05,1.6e-05,3e-05,5.9e-05,3.3e-05,-1e-06,-3e-05,-1.7e-05,-5.6e-05,-2e-06,1.4e-05,-2.8e-05,1e-06,4e-06,1e-05,-8.8e-05,2.2e-05,-2.2e-05,1.5e-05,9e-05,-4.2e-05,2.4e-05,-5.9e-05,-1.2e-05,-4e-06,-7e-06
0,1e-06,1e-06,0,0,-2e-06,0,0,0,-1e-06,-1e-06,-1e-06,0,4e-06,-2e-06,0,8e-06,-2e-06,1.3e-05,1.3e-05,1e-06,-1.4e-05,-9e-06,-9e-06,-2.1e-05,1.4e-05,-4e-06,2.1e-05,4.7e-05,-1.4e-05,5.4e-05,1.5e-05,1.5e-05,-4.4e-05,4e-06,1.3e-05,3e-06,3.9e-05,-3.2e-05,3e-06,3e-06,1.3e-05,-4.1e-05,2.8e-05,4e-06,-1.3e-05,7.4e-05,3.3e-05,-9e-06,-3.3e-05,-2e-06,-7e-06,-1e-05,1.1e-05,-1.5e-05,-5e-05,-4.5e-05,-3e-05,8e-06,2.9e-05,2.9e-05,-7.3e-05,4.7e-05,9e-06,-1.3e-05,7.1e-05,-8e-06,1.4e-05,1.7e-05,7e-06,-1.9e-05,5e-06,4e-06,-9e-06,0.000105,4e-06,1e-06,-3.9e-05,-2.1e-05,7.4e-05,9e-06,3.5e-05,4.4e-05,3e-06,-4.4e-05,-3e-06,1.3e-05,6e-06,-6e-06,-2.4e-05,-3.9e-05,8e-06,1.4e-05,-1.4e-05,0,2.2e-05,2.2e-05,-4.8e-05,-5.3e-05,-3.7e-05,-2.5e-05,1.6e-05,3.1e-05,4e-05,1.2e-05,-1.8e-05,-5e-06,5e-06,1.1e-05,-8e-06,6e-06,2.5e-05,-2.2e-05,-1.3e-05,-6.7e-05,-4e-06,-2.9e-05,2.8e-05,-9.5e-05,-5.6e-05,-8e-06
0,0,0,-1e-06,0,1e-06,0,0,1e-06,-1e-06,1e-06,1e-06,0,-2e-06,0,-2e-06,-6e-06,0,-1.5e-05,-1.1e-05,0,-5e-06,-8e-06,-8e-06,9e-06,2.4e-05,-1.4e-05,-8e-06,-1.9e-05,-1.8e-05,-5.6e-05,-5.7e-05,-2e-05,4.8e-05,-4e-06,-3e-06,-1.8e-05,-5.7e-05,2.5e-05,-2e-06,-8e-06,1.1e-05,-2e-06,-2.2e-05,2.6e-05,1.5e-05,-9.4e-05,1.5e-05,1.1e-05,1.3e-05,2.2e-05,3e-06,9e-06,-1e-05,-5e-06,-7.1e-05,2.3e-05,-3e-06,5e-06,-1e-05,-9e-06,0.00014,4e-06,-2e-06,-4e-06,-7.6e-05,4e-06,-9e-06,-2.6e-05,-8e-06,3.6e-05,2e-06,-1.5e-05,-6e-06,-9.6e-05,-2e-06,8e-06,5e-06,2.3e-05,-5.6e-05,2e-06,-7.5e-05,-2.7e-05,-4e-06,-1.9e-05,-5.4e-05,0.000131,-1.6e-05,-0.000108,-4.9e-05,3.4e-05,7e-06,-5.8e-05,-6e-06,2.4e-05,-8e-06,1.7e-05,5.7e-05,-6.7e-05,1.8e-05,1.4e-05,1.3e-05,1e-05,-5.2e-05,-7e-06,8e-06,2e-06,4e-06,1e-06,5e-06,-0.000102,-2e-06,-2.6e-05,9e-06,-3.3e-05,-9e-06,2.5e-05,-7e-06,-6.6e-05,2.8e-05,-1e-05
0,0,-1e-06,1e-06,0,0,0,0,0,-1e-06,-1e-06,0,0,0,2e-06,0,2e-06,-1e-06,9e-06,1.1e-05,0,5e-06,-7e-06,-2e-06,2.1e-05,7e-06,2.1e-05,2e-06,2.8e-05,1.5e-05,2.6e-05,5.4e-05,3e-05,-3e-05,1e-06,5.6e-05,2.5e-05,6e-06,3.1e-05,-2e-06,5e-06,-1e-06,-4e-06,-4e-05,3e-05,-1.5e-05,9.8e-05,-2.2e-05,2.2e-05,1.8e-05,2.2e-05,8e-06,-1e-05,2.2e-05,5e-06,0.000141,-5.6e-05,1.4e-05,8e-06,-2.4e-05,-1.1e-05,-0.000104,-1.7e-05,-6e-06,-1.1e-05,8.9e-05,-1.8e-05,-1.8e-05,0,3e-06,-4.6e-05,-1.7e-05,2e-06,-1.1e-05,-7.3e-05,2e-06,6e-06,4.7e-05,-2.6e-05,-0.000113,-1e-05,6.7e-05,2e-06,-7e-06,-4e-06,4.6e-05,2e-06,-1.7e-05,5.3e-05,-1.7e-05,-1.3e-05,-7e-06,5.3e-05,5e-06,4e-06,-8e-06,4e-06,-9e-06,-5.9e-05,2.7e-05,6e-06,-2.1e-05,2.4e-05,3.8e-05,-9e-06,-2.8e-05,1.1e-05,2e-06,-1.9e-05,-2e-06,4.3e-05,-1.2e-05,-1.9e-05,7e-06,7.8e-05,-1.4e-05,-1.1e-05,2e-05,1.6e-05,4e-05,0
0,0,0,0,0,0,1e-06,0,0,-1e-06,0,0,0,3e-06,-1e-06,0,-1e-06,-2e-06,1e-06,-4e-06,0,1.8e-05,1e-06,-8e-06,7e-06,2.2e-05,-9e-06,1e-06,-2e-05,1.5e-05,1.1e-05,-4e-06,-3.3e-05,1e-06,0,-1.8e-05,-1.6e-05,-2.6e-05,-2.7e-05,1e-06,-5e-06,-2e-06,3.3e-05,-2.4e-05,7e-06,1.3e-05,-0.000102,1.2e-05,1.2e-05,-1.4e-05,-1.6e-05,-8e-06,1.7e-05,-4e-06,0,-6.1e-05,2.8e-05,1.2e-05,1.5e-05,2.1e-05,2.1e-05,5e-06,7e-06,-5e-06,-4e-06,-7.6e-05,3e-06,-7e-06,3.3e-05,0,4.1e-05,1.4e-05,5e-06,1.2e-05,0.000128,2e-06,4e-06,-3e-05,3e-06,-9.3e-05,3.8e-05,-1.8e-05,1.3e-05,-1e-06,2e-05,-2.9e-05,3.1e-05,1.1e-05,1.9e-05,-1.2e-05,4.6e-05,-3e-06,-9e-06,1e-06,-2.3e-05,-5e-06,-1.1e-05,-1.4e-05,2.5e-05,-1.8e-05,-1.4e-05,1.9e-05,7e-06,-3.9e-05,7e-06,-3.7e-05,1e-05,0,-5e-06,-2e-06,-2.2e-05,-9e-06,-1.3e-05,-1.7e-05,-3.8e-05,-4e-06,-1.4e-05,-1.2e-05,3.4e-05,-4.2e-05,-3e-06
0,0,1e-06,-1e-06,0,0,3e-06,0,0,-1e-06,1e-06,1e-06,0,0,-1e-06,1e-06,-1e-06,-2e-06,-1e-05,0,0,-8e-06,3e-06,0,-8e-06,-3e-05,-1.3e-05,-1.3e-05,2.1e-05,-5e-06,-5.3e-05,-5.3e-05,2.1e-05,3.1e-05,1e-06,-4.4e-05,-4e-06,5e-05,-1.2e-05,-3e-06,0,-2e-06,-2.8e-05,2.1e-05,-2.2e-05,-1.4e-05,0.000117,-2e-06,-9e-06,1e-05,-1.9e-05,4e-06,-2.9e-05,5e-06,-1.7e-05,-7.2e-05,-5.1e-05,0,-2.1e-05,1.4e-05,2e-06,9.2e-05,-2.4e-05,-7e-06,-8e-06,7.8e-05,3e-06,7e-06,-1.1e-05,-5e-06,3.7e-05,-3.5e-05,1e-06,1e-06,2.3e-05,2e-06,-5e-06,-3.8e-05,1.9e-05,4e-05,-4.9e-05,-5.9e-05,-2e-05,3e-06,0,-5.1e-05,2.5e-05,-6e-06,-2.8e-05,2e-05,-7.2e-05,6e-06,-3.6e-05,0,0,-1e-05,-2.6e-05,4e-05,-5.9e-05,2e-06,-6e-06,-2.8e-05,-2.8e-05,3.4e-05,3e-06,-2.3e-05,-7e-06,2e-06,-4e-06,2e-06,4.7e-05,-5e-06,-1.7e-05,2.1e-05,-3.4e-05,-2.4e-05,2.4e-05,-3.3e-05,-4.6e-05,-1.5e-05,-1e-06
