0.006665,0.006426,0.006629,0.006464,0.006736,0.006783,0.007421,0.008273,0.008994,0.009439,0.008921,0.008919,0.009403,0.009643,0.009027,0.008589,0.008654,0.008578,0.009049,0.009539,0.009583,0.01118,0.012846,0.012905,0.013891,0.014647,0.015103,0.014811
0.007857,0.00758,0.007729,0.007785,0.008408,0.008368,0.008787,0.009602,0.010324,0.010857,0.010581,0.010808,0.011283,0.011227,0.010541,0.010235,0.01051,0.010468,0.010747,0.011304,0.011519,0.013213,0.015182,0.015398,0.016343,0.017024,0.017557,0.017423
0.009712,0.009369,0.009364,0.009929,0.011297,0.011077,0.010929,0.011581,0.012201,0.012904,0.013204,0.013909,0.014296,0.013594,0.012975,0.013098,0.013786,0.013756,0.013489,0.014208,0.014981,0.016746,0.019001,0.019521,0.020522,0.020948,0.02118,0.021589
0.010745,0.01042,0.010251,0.011288,0.013367,0.013092,0.012366,0.012824,0.013231,0.014047,0.015,0.016199,0.016413,0.01514,0.014919,0.01558,0.016626,0.016475,0.015302,0.016264,0.018362,0.020311,0.022129,0.022801,0.024188,0.024571,0.024057,0.025055
0.011341,0.011247,0.010871,0.011829,0.014116,0.014088,0.013268,0.013567,0.013829,0.01484,0.01622,0.017516,0.01797,0.01697,0.016942,0.017955,0.01947,0.01913,0.016828,0.017699,0.021417,0.024096,0.024986,0.025975,0.028512,0.029044,0.028376,0.030113
0.012074,0.01266,0.012758,0.013585,0.015627,0.015528,0.015017,0.015676,0.01598,0.017013,0.018156,0.019581,0.021728,0.021462,0.020915,0.022998,0.025351,0.024563,0.021219,0.021184,0.025716,0.030166,0.031031,0.033048,0.03806,0.039136,0.040122,0.042881
0.014462,0.01603,0.017702,0.019085,0.021078,0.020132,0.019741,0.021545,0.022387,0.022862,0.023293,0.025686,0.030566,0.031442,0.030838,0.035269,0.039018,0.036665,0.031939,0.032326,0.037223,0.042718,0.044812,0.049967,0.060417,0.062267,0.064645,0.068314
0.020315,0.023532,0.027529,0.029185,0.031499,0.029659,0.028871,0.032995,0.035674,0.035071,0.034315,0.038557,0.046386,0.048779,0.048028,0.054996,0.061992,0.057556,0.050281,0.05234,0.058859,0.066428,0.071252,0.080784,0.097376,0.099171,0.103722,0.108517
0.028935,0.035286,0.041331,0.043,0.046885,0.044223,0.042479,0.049708,0.05477,0.052437,0.050511,0.057291,0.067687,0.071987,0.069772,0.077905,0.089725,0.083993,0.074292,0.079005,0.089171,0.102158,0.111065,0.124139,0.143649,0.141064,0.148576,0.155141
0.039649,0.049731,0.055816,0.058044,0.064833,0.061063,0.058263,0.068897,0.076438,0.072854,0.071529,0.081309,0.091098,0.095901,0.091986,0.100124,0.115971,0.109342,0.098167,0.10602,0.121859,0.145244,0.159669,0.1747,0.191283,0.176258,0.185104,0.192531
0.052644,0.065116,0.068069,0.073467,0.084123,0.077388,0.073064,0.086597,0.096318,0.092956,0.09567,0.109294,0.11426,0.115904,0.111359,0.119487,0.137696,0.13187,0.119511,0.128718,0.149776,0.183697,0.202177,0.21669,0.226845,0.198816,0.209194,0.214221
0.064745,0.079543,0.078565,0.087722,0.100499,0.09031,0.087055,0.101822,0.110382,0.107973,0.115626,0.132363,0.132111,0.129207,0.126582,0.132022,0.146669,0.148179,0.139452,0.147389,0.168738,0.2049,0.224211,0.235948,0.241704,0.215098,0.233373,0.237055
0.07087,0.083833,0.082366,0.093453,0.10298,0.092496,0.094766,0.107721,0.110732,0.109993,0.122274,0.138124,0.133753,0.128729,0.132131,0.133529,0.137906,0.150381,0.151698,0.15756,0.175055,0.20462,0.220467,0.223288,0.223311,0.216023,0.253569,0.262397
0.067833,0.072711,0.076733,0.088073,0.089322,0.084818,0.094952,0.100233,0.096725,0.096706,0.110029,0.122399,0.117415,0.114,0.124976,0.123499,0.115983,0.136394,0.149114,0.154432,0.167919,0.183107,0.18453,0.18037,0.181482,0.19204,0.24186,0.254855
0.05749,0.058093,0.068593,0.07753,0.070614,0.071961,0.087391,0.084292,0.076439,0.076756,0.090995,0.104712,0.102892,0.100777,0.113469,0.112781,0.101835,0.119899,0.131513,0.132544,0.142258,0.148531,0.136201,0.139322,0.150809,0.155985,0.19389,0.20192
0.044042,0.046196,0.057403,0.065131,0.05997,0.060156,0.070345,0.070333,0.065719,0.06301,0.074908,0.087614,0.089243,0.089985,0.097158,0.098523,0.091598,0.099308,0.103775,0.099595,0.107814,0.124858,0.119265,0.124459,0.136616,0.126893,0.14476,0.148735
0.034542,0.040126,0.052064,0.064175,0.066026,0.057685,0.053697,0.061958,0.066078,0.059706,0.066951,0.075125,0.081649,0.090861,0.091435,0.091294,0.087563,0.08725,0.093207,0.089842,0.098398,0.128069,0.132942,0.145269,0.164315,0.147849,0.15138,0.145588
0.035832,0.042015,0.060543,0.075797,0.078675,0.068431,0.058196,0.069927,0.080018,0.0751,0.082429,0.086776,0.092252,0.105527,0.102588,0.103927,0.102324,0.096991,0.11296,0.119527,0.122076,0.143926,0.15059,0.18053,0.218715,0.208594,0.212577,0.195552
0.043004,0.045139,0.067991,0.082443,0.084962,0.083194,0.076379,0.089303,0.099706,0.098378,0.112474,0.11406,0.109414,0.121766,0.11782,0.127817,0.134176,0.119062,0.141484,0.158854,0.149002,0.153564,0.159523,0.212333,0.274664,0.281379,0.297976,0.266106
0.050995,0.049156,0.072056,0.087064,0.089961,0.09547,0.099795,0.118441,0.122736,0.118205,0.138421,0.144059,0.132915,0.137735,0.132379,0.155041,0.171369,0.143503,0.167683,0.19439,0.177603,0.175203,0.17402,0.244522,0.334362,0.354732,0.378164,0.328061
0.061736,0.056719,0.076326,0.098533,0.103842,0.104402,0.119462,0.149599,0.14249,0.125026,0.148387,0.166037,0.155786,0.147141,0.141271,0.172872,0.197042,0.166428,0.189459,0.215026,0.19884,0.203745,0.193031,0.278383,0.393819,0.407156,0.420589,0.360849
0.07733,0.06639,0.082408,0.111195,0.11821,0.108593,0.125876,0.16527,0.147803,0.119156,0.146135,0.178743,0.172225,0.150503,0.143201,0.168695,0.199925,0.182676,0.196881,0.210251,0.203493,0.225334,0.217235,0.300734,0.41357,0.420663,0.426993,0.374002
0.094286,0.079311,0.091417,0.11791,0.126174,0.116146,0.129112,0.163557,0.140213,0.110213,0.139655,0.183346,0.183195,0.163237,0.150227,0.160371,0.196958,0.194161,0.202635,0.211202,0.209674,0.237945,0.248492,0.308644,0.384753,0.394296,0.408843,0.384433
0.098144,0.086487,0.095317,0.111412,0.123926,0.130729,0.142163,0.159092,0.14145,0.11926,0.13541,0.184766,0.199367,0.196707,0.181999,0.186571,0.223054,0.216909,0.225328,0.234157,0.230779,0.257572,0.296659,0.33966,0.35006,0.340458,0.397015,0.420071
0.083039,0.082461,0.094984,0.102222,0.117347,0.138953,0.156494,0.154496,0.14593,0.149708,0.157017,0.206872,0.226313,0.236273,0.229941,0.247048,0.284624,0.249068,0.243009,0.248409,0.260236,0.304662,0.351144,0.370236,0.326842,0.315222,0.425651,0.462345
0.069194,0.074465,0.100058,0.109741,0.12157,0.138496,0.159415,0.150416,0.148851,0.180321,0.194012,0.256095,0.276612,0.262698,0.25497,0.310518,0.350854,0.270077,0.239851,0.243926,0.285207,0.3564,0.388874,0.393622,0.328107,0.30805,0.455088,0.497086
0.085065,0.089548,0.123737,0.133983,0.138004,0.148831,0.16562,0.157595,0.155678,0.194012,0.225333,0.313618,0.327733,0.256258,0.245717,0.356542,0.40533,0.290416,0.240183,0.244457,0.291905,0.37435,0.420083,0.441469,0.371715,0.314463,0.45637,0.515202
0.104071,0.112905,0.157361,0.166468,0.15721,0.166801,0.184231,0.17883,0.167364,0.192349,0.246237,0.362074,0.356888,0.225632,0.217612,0.361733,0.422382,0.319554,0.254953,0.251722,0.275079,0.332923,0.425241,0.497963,0.435045,0.326435,0.42034,0.48495
0.106588,0.118318,0.17766,0.202984,0.179165,0.178732,0.195752,0.195433,0.186806,0.193963,0.27042,0.390804,0.355945,0.218483,0.223321,0.346386,0.401785,0.348654,0.281639,0.257353,0.251366,0.288722,0.408728,0.513535,0.481719,0.356898,0.38001,0.430963
0.103827,0.106539,0.176881,0.235554,0.2072,0.193905,0.207472,0.206536,0.205195,0.197293,0.275533,0.380333,0.320263,0.220071,0.255896,0.343922,0.366332,0.351377,0.304288,0.275201,0.273457,0.28253,0.362641,0.459583,0.471722,0.388803,0.383402,0.422528
0.117366,0.105136,0.168846,0.252245,0.243101,0.234882,0.251771,0.237133,0.212262,0.186409,0.256194,0.367991,0.301436,0.232732,0.287461,0.306681,0.280545,0.30187,0.295377,0.282373,0.298465,0.32093,0.402812,0.478868,0.463657,0.425025,0.444939,0.476459
0.126851,0.113365,0.174761,0.250616,0.266117,0.267926,0.277379,0.27568,0.23093,0.188098,0.281881,0.427288,0.35208,0.289231,0.312239,0.25424,0.212155,0.243699,0.235628,0.234658,0.270685,0.368345,0.531661,0.577977,0.477055,0.438781,0.496391,0.558934
0.133677,0.116107,0.163715,0.214678,0.261448,0.269882,0.254442,0.279097,0.23314,0.185797,0.310913,0.492505,0.449957,0.36823,0.312246,0.21765,0.197746,0.215176,0.173133,0.162691,0.198906,0.375621,0.6251,0.612328,0.4523,0.418875,0.493534,0.628853
0.149245,0.116511,0.141168,0.177607,0.239166,0.248409,0.21169,0.234451,0.208672,0.17719,0.300504,0.483101,0.515344,0.416092,0.286422,0.204107,0.198578,0.19506,0.139882,0.120552,0.162882,0.357803,0.612089,0.53065,0.375026,0.360554,0.435212,0.628922
0.159299,0.128839,0.154923,0.182057,0.211711,0.224006,0.199545,0.191222,0.189622,0.185335,0.263272,0.405899,0.516547,0.408533,0.229961,0.182242,0.202228,0.208005,0.145637,0.108167,0.162275,0.344543,0.511224,0.398897,0.31122,0.303547,0.391311,0.544337
0.157399,0.146853,0.186282,0.199721,0.187414,0.214328,0.25883,0.25536,0.216784,0.194067,0.248968,0.36944,0.507139,0.384276,0.173952,0.152632,0.193054,0.215103,0.154923,0.109456,0.159352,0.315543,0.388647,0.316395,0.312101,0.300892,0.361914,0.440848
0.147109,0.160521,0.192711,0.190574,0.169945,0.215124,0.334576,0.369674,0.281256,0.199429,0.225335,0.382721,0.520996,0.35052,0.152461,0.142328,0.163029,0.190554,0.160122,0.123377,0.152679,0.256083,0.30262,0.301523,0.354736,0.363287,0.364284,0.423518
0.146768,0.157314,0.172552,0.172833,0.139856,0.18918,0.376484,0.466832,0.355087,0.198808,0.179599,0.370819,0.48975,0.284486,0.144975,0.165416,0.154974,0.154187,0.158713,0.149839,0.178713,0.243167,0.247317,0.276937,0.364499,0.443051,0.432684,0.459676
0.156447,0.142855,0.147115,0.177862,0.137968,0.163025,0.358598,0.492854,0.384762,0.203875,0.17783,0.336572,0.413594,0.249182,0.154683,0.18434,0.167057,0.142039,0.152167,0.182018,0.220597,0.285648,0.253877,0.240425,0.322891,0.505566,0.533536,0.47104
0.177094,0.141402,0.128906,0.168691,0.159521,0.159766,0.290899,0.429394,0.342397,0.208132,0.202974,0.272152,0.307633,0.25612,0.181843,0.172669,0.162244,0.132893,0.158246,0.246145,0.292702,0.320214,0.282187,0.210635,0.29849,0.525142,0.566218,0.46809
