0.000139,0.000167,0.000104,3e-05,0.000157,3e-04,0.000215,0.000211,9.8e-05,0.000103,0.000131,6.7e-05,0.000156,3.8e-05,0.000125,7.9e-05,0.000115,6.6e-05,4.3e-05,7.4e-05,7.9e-05,1.3e-05,3.3e-05,1.7e-05,0.000154,2e-05,8.9e-05,0.000268,3.7e-05,0.00011,2.4e-05,3.4e-05,0.000198,1.5e-05,7.8e-05,7.4e-05,0.000141,4.1e-05,0.00022,3.6e-05,0.000105,0.000164,4.6e-05,1.3e-05,0.000101,1.5e-05,0.000116,0.000168,0.000181,6.5e-05,0.000243,4.7e-05,8.7e-05,0.000228,5.3e-05,0.000104,4e-05,0.000136,0.000184,0.000289,3.1e-05,5.1e-05,3e-06,0.000115,0.000166,8.8e-05,0.000156,0.000288,6.7e-05,0.000265,0.000143,6.7e-05,1.5e-05,8.3e-05,3.7e-05,0.000179,0.00014,0.000174,3.5e-05,0.000165,2.6e-05,1.1e-05,0.000118,0.00016,0.00016,0.000108,8.9e-05,0.000253,0.000183,0.000315,4.6e-05,8e-06,3e-06,2.8e-05,6.6e-05,3.4e-05,3.9e-05,3.1e-05,0.00017,8.9e-05,4.5e-05,1.6e-05,6.5e-05,2.5e-05,5.8e-05,2.6e-05,8.5e-05,2.5e-05,3.4e-05,3.2e-05,3.7e-05,5e-06,0,8.5e-05,3.4e-05,0.000152,5.6e-05,4e-05,3.4e-05,4.3e-05,7e-05
0.000281,0.000271,0.00034,7.6e-05,0.000325,0.000758,0.000495,0.000351,0.000163,0.000428,0.000314,8.7e-05,0.000211,8e-06,0.000225,0.000251,0.000251,0.000177,0.000185,0.000259,0.000169,1.7e-05,0.000118,6.4e-05,0.000325,5.9e-05,0.000155,0.000607,5.9e-05,0.000241,0.00013,0.000121,0.000395,6.7e-05,0.00024,0.000279,0.000223,9.4e-05,0.000369,0.000191,0.000314,0.000358,9.8e-05,0.000103,0.000223,4.5e-05,0.000294,0.000442,0.000348,0.000205,0.000562,7.4e-05,0.000193,0.000455,9.9e-05,0.000198,9.3e-05,0.000326,0.000407,0.000652,0.000105,3.2e-05,7.4e-05,0.00025,0.000445,0.000205,0.000399,0.000613,0.000206,0.000559,0.000294,0.000147,0.000129,0.000158,8.4e-05,0.000433,0.000336,0.000299,0.000149,0.000355,0.000106,7.7e-05,0.000233,0.000408,0.000317,0.000187,0.000257,0.000552,0.000407,0.000723,0.000142,0.000101,0.000119,7e-05,0.000194,0.000127,8e-05,0.000146,0.00044,0.000216,0.000154,7.8e-05,0.000196,0.000114,0.000123,5.7e-05,0.000169,0.000137,0.000189,0.000121,8.3e-05,5.9e-05,6.3e-05,0.000213,8e-05,0.000373,0.00019,0.000133,0.000144,5.5e-05,0.000138
0.000241,0.000465,0.000539,0.000115,0.000198,0.000924,0.000692,0.000485,0.000447,0.000559,0.000321,0.000117,0.000555,0.000117,0.000274,0.000469,0.00017,0.000367,0.000283,0.000283,0.000359,8.5e-05,0.00039,0.000414,0.000295,0.000316,0.000169,0.000778,0.000417,0.000529,0.000256,2.1e-05,0.000486,0.000241,0.000321,0.000627,0.000275,0.000286,0.000711,0.000479,0.000453,0.000562,0.000141,0.00034,0.000487,0.000247,0.000426,0.000689,0.000572,0.000364,0.000548,0.000506,0.000402,0.000502,0.000504,0.000279,0.000288,0.000395,0.000469,0.000755,0.000157,0.000453,0.000247,0.000402,0.000748,0.00059,0.000767,0.000757,0.000267,0.000946,0.000494,0.000413,0.00024,0.000372,9.2e-05,0.000677,0.000268,0.000558,0.000358,0.000652,0.000396,0.000122,0.00014,0.000515,0.000529,0.000442,0.000627,0.001081,0.000752,0.00086,0.000301,0.000211,0.000144,0.000156,0.000278,9.9e-05,0.00021,0.000195,0.000426,0.000552,0.000191,0.000232,0.000265,0.000109,0.000428,8.3e-05,0.000273,0.000232,0.000138,0.000158,0.000181,0.000181,7.2e-05,0.000255,0.000266,0.000415,0.000199,0.000213,0.000137,0.000216,0.000208
0.000802,0.000605,0.000674,0.000967,0.000498,0.001715,0.001431,0.000879,0.000373,0.000827,0.000634,0.000591,0.000609,0.000614,0.000655,0.000925,0.000923,0.001116,0.000437,0.00065,0.000807,0.00073,0.000884,0.000683,0.001028,0.001054,0.000591,0.001213,0.001473,0.001649,0.001174,0.000785,0.001248,0.000559,0.000591,0.001016,0.001306,0.001198,0.001551,0.001487,0.001828,0.001511,0.0014,0.001219,0.001466,0.001051,0.001164,0.000822,0.000757,0.001539,0.001467,0.001626,0.001146,0.001457,0.001485,0.001619,0.000817,0.000953,0.000972,0.00217,0.001157,0.001281,0.000944,0.000404,0.001606,0.002055,0.00086,0.001405,0.001831,0.002229,0.00132,0.000955,0.001124,0.001246,0.000618,0.001045,0.001425,0.001272,0.001262,0.00182,0.001675,0.0012,0.00064,0.001323,0.001432,0.001205,0.001976,0.002438,0.001806,0.001474,0.001825,0.001227,0.000937,0.000436,0.000543,0.000974,0.000719,0.000698,0.000987,0.001329,0.001385,0.000876,0.00102,0.000744,0.001027,0.000773,0.000682,0.000625,0.000571,0.000568,0.000365,0.00045,0.000362,0.000602,0.000833,0.00107,0.000716,0.000394,0.000618,0.000559,0.000691
0.000982,0.001158,5e-04,0.000531,0.000625,0.001401,0.001052,0.000594,0.000585,0.00073,0.000941,0.000316,0.000816,0.000663,5e-06,0.00078,0.000669,0.000758,0.000713,0.000951,0.000527,0.000199,0.000559,0.000516,0.00088,0.000693,0.000467,0.001017,0.001234,0.001104,0.000329,0.000367,0.001263,0.000522,0.000401,0.000235,0.000769,0.000443,0.000955,0.000608,0.001012,0.000495,0.000666,5e-04,0.000466,0.000281,0.000496,0.000388,0.000414,0.001462,0.000319,0.001052,0.000733,0.001203,0.000714,0.000548,0.000665,0.00086,0.00066,0.001786,0.00189,0.000269,0.000716,0.000741,0.001468,0.0016,0.001346,0.001417,0.001679,0.000884,0.001246,0.001236,0.000958,0.000286,0.000369,0.001007,0.001741,0.000634,0.000342,0.000914,0.000412,5.6e-05,0.00022,0.000958,0.000651,0.000595,0.001215,0.000484,0.00026,0.000169,0.000843,0.000333,0.000284,0.000184,0.000495,0.000776,0.000418,0.000344,0.000376,0.000817,0.000426,0.000162,0.000699,0.000686,0.000238,0.000453,0.000172,0.000408,0.000216,0.00049,0.000329,0.000376,0.000518,0.00024,0.000547,0.000324,0.000749,0.000777,0.000361,0.000752,0.000408
0.000892,0.000486,0.000485,0.000621,0.000283,0.00025,0.000179,0.000696,0.000515,0.00018,0.000465,0.000197,0.000556,0.000719,0.000724,0.000208,0.000398,0.000108,0.000284,0.000319,0.00027,0.000358,0.00011,0.000278,0.000354,0.000317,0.000228,0.000238,0.000207,0.00062,0.000439,0.000514,0.000956,0.000642,0.000224,0.000463,0.000338,0.000537,0.000128,0.000407,0.000609,0.00022,0.000402,0.00073,0.000695,6.2e-05,0.000364,0.000601,0.000727,0.000584,0.000638,0.000577,0.001001,0.001001,0.001007,0.000316,0.00047,0.000344,0.000128,0.001371,0.00091,0.000624,0.00037,0.000643,0.001177,0.000869,0.00062,0.000826,0.000248,0.000519,0.000734,0.000925,0.000183,0.000318,0.000173,0.000557,0.000546,0.000463,0.000135,0.000302,0.000571,0.00052,0.000505,0.000831,0.000565,0.000442,0.0013,0.000914,0.000135,0.000493,0.000485,0.000196,9.3e-05,0.000153,0.000343,0.000358,7.4e-05,0.000511,0.00069,0.000132,0.000189,0.000262,0.000246,0.000389,0.000529,3.8e-05,0.000324,0.000233,0.000305,0.000149,0.000204,0.000493,0.000125,0.000424,3e-04,0.000376,0.000238,0.000121,0.00033,0.000549,0.000493
0.000702,0.000633,7.1e-05,0.000128,0.00055,0.000469,0.00035,0.000683,0.000209,0.000218,0.000715,0.00034,0.000805,0.000503,0.000133,0.000647,0.000241,0.000134,0.000169,0.000402,0.000357,0.00011,0.000428,0.000279,5.4e-05,0.000391,0.000589,0.000607,0.000451,0.000122,0.000385,0.000131,0.000569,0.00055,0.000298,0.000794,0.000531,0.000541,0.000898,0.001337,0.000767,0.00072,0.000755,0.000637,0.000286,0.000392,0.000292,0.000148,0.000741,0.000624,0.000491,0.000398,0.00088,5e-04,0.000653,0.000623,0.000235,0.000416,0.00018,0.001031,0.000278,0.000643,0.00073,0.001129,0.000663,0.000284,0.000927,0.000302,0.000358,0.000703,0.000689,0.000329,0.000225,0.000394,0.000158,0.00072,0.00059,0.000331,0.000728,9.4e-05,0.000885,0.000775,0.000896,0.00077,0.000713,0.000268,0.000639,0.001031,0.000312,0.000897,0.000349,0.000207,0.000422,0.00013,0.000459,0.000426,6.6e-05,0.00064,0.000345,0.000902,0.000521,3e-04,0.000323,0.000294,0.000445,0.000506,0.000379,0.000443,0.000124,9.1e-05,0.000245,0.000231,0.000474,0.000609,0.000164,0.000325,0.000296,0.000598,0.000425,0.000442,0.000394
0.00085,0.000155,0.000379,0.000653,0.000556,0.001446,0.001706,0.000361,0.001504,0.000252,0.001113,0.001304,0.000406,0.000849,0.000951,0.001462,0.001216,0.000687,0.000164,0.000509,0.001012,0.000716,0.000951,0.000283,0.00026,0.000266,0.000596,0.001289,0.000385,0.000111,0.000795,0.000686,0.001535,0.001698,0.000944,0.000899,0.00083,0.000387,0.001539,0.000758,0.000351,0.00129,0.00077,0.000461,0.000517,0.000505,0.000823,0.000882,0.000816,0.000676,0.000311,0.000812,0.00021,0.001138,0.001774,0.000817,0.001163,0.000866,0.000681,0.000895,0.000373,0.000982,0.000242,0.001805,0.000688,0.000364,0.001244,0.001642,0.000613,0.000723,0.001584,0.001344,0.000975,0.000344,0.000477,0.000784,0.000314,0.000254,0.00062,0.000557,0.001379,0.001757,0.001963,0.001128,0.000346,0.000296,0.000443,0.00139,0.001068,0.000514,0.000505,8.2e-05,0.000244,0.000485,0.001008,0.001493,0.000888,0.00067,0.000967,0.000805,0.000761,0.000409,0.000555,0.000759,0.001131,0.000362,0.000679,0.000594,0.000292,7.5e-05,0.000431,5e-04,0.000422,0.000281,0.000493,0.000397,0.000165,0.000765,0.000945,0.000144,0.000295
0.00065,0.001049,0.000827,0.000233,0.00039,0.001068,0.001672,0.002048,0.002835,0.00194,0.001809,0.000872,0.001327,0.000639,0.001073,0.001559,0.001206,6.6e-05,0.000336,0.000662,0.000641,0.00068,0.000281,0.000505,0.00037,0.000404,0.000852,0.000397,0.000733,0.00066,0.00086,0.00172,0.000957,0.001493,0.001352,0.00108,0.00114,0.001262,0.002289,0.001961,0.000377,0.001414,0.001323,0.000243,0.000895,0.00045,0.000708,0.000412,0.000132,0.000688,0.001009,0.000245,0.000208,0.001473,0.001385,0.001639,0.001345,0.001358,0.001933,0.001979,0.001764,0.000258,0.000669,0.001992,0.001465,0.000787,0.001293,0.001366,0.001513,0.001161,0.001207,0.001074,0.000685,0.000375,0.00068,0.000896,0.001232,0.000597,0.000113,0.000559,0.000827,0.002395,0.000996,0.001353,0.001338,0.000861,2e-04,0.000496,0.000686,0.000889,0.001191,0.000855,6.7e-05,0.000632,0.00093,0.001036,0.000626,0.000444,0.000429,0.000924,0.001139,0.000578,0.000557,0.000718,0.000337,0.001088,0.001723,0.000518,0.000465,0.000125,0.000717,0.000925,0.001389,0.000571,0.000102,0.000424,0.000701,0.00108,0.000839,0.001107,0.00047
0.000348,0.000962,0.000393,0.000464,0.000373,0.000738,0.001101,0.001638,0.001079,0.000495,0.000182,0.000753,0.001379,0.001299,0.00179,0.000335,0.000897,0.001085,0.000228,0.000621,0.000905,0.000169,0.000317,0.000575,0.000618,7e-04,0.000257,0.000318,0.000601,0.000609,0.001132,0.001411,0.002179,0.000766,0.000561,0.000472,0.001094,0.000702,0.001265,0.000957,0.00141,7.7e-05,0.001208,0.001188,0.001803,0.00108,0.000287,3.7e-05,0.000282,0.000203,0.000177,0.000598,0.000936,0.001478,0.000588,0.000863,0.001323,0.000167,0.001096,0.000911,0.001725,0.001414,0.000134,0.000986,0.000725,0.000431,0.000955,0.000959,0.000325,0.00082,0.000906,0.000358,0.000177,0.000271,0.000707,0.000349,0.000492,0.000647,0.000396,0.000824,0.000988,0.001659,0.001248,0.001639,0.001108,0.001175,0.00122,0.001664,0.001694,0.000729,0.00145,0.000714,0.000949,0.001024,0.000993,0.000619,0.000401,0.000376,0.000265,0.000603,0.000622,0.000563,0.000777,0.000209,0.000167,0.00097,0.001184,0.000909,0.001102,0.000559,0.000818,0.000122,0.001311,0.001158,0.000154,0.000171,0.000693,6.6e-05,0.000333,0.000871,0.000753
0.001127,0.000586,0.000418,0.000264,0.000932,0.001001,0.000855,0.000568,0.001295,0.001075,0.00122,0.001792,0.000571,0.000771,0.002729,0.002402,0.000635,0.000836,0.000594,0.000593,0.000986,0.000823,0.000268,0.000498,0.000271,0.000851,0.000867,0.000763,0.000974,0.00048,0.000332,0.001758,0.001015,0.000815,0.00082,0.000264,0.001278,0.001164,6.3e-05,0.00138,0.000947,0.000456,0.000983,0.001161,0.000553,0.001478,0.00117,0.00011,0.000653,0.000979,0.000579,0.000164,0.001343,0.000721,0.000764,0.001151,0.000237,0.000768,0.000405,0.001324,0.001955,0.000887,0.000757,0.00047,0.000421,0.000647,0.000603,0.001225,0.001203,0.001461,0.000763,0.000591,0.000631,0.000629,0.000261,0.000291,0.000472,0.000419,0.000774,0.001257,0.001179,0.000604,0.000846,0.000648,0.001245,0.000297,0.000608,0.001554,0.001582,0.000923,0.001275,0.001309,0.001754,0.00079,0.000569,0.000888,0.00057,0.000821,0.000594,0.000549,0.001,0.000795,7.6e-05,0.000537,0.000357,0.000724,0.000455,0.000355,0.000507,0.000319,0.000567,0.000518,0.000969,0.001013,0.00094,0.000655,0.000614,0.000583,0.001013,0.000538,5e-05
0.001031,0.000826,0.000663,0.000281,0.000926,5.9e-05,0.000415,0.000392,0.000168,0.000634,0.001014,0.001209,0.000913,0.000207,0.001336,0.000569,0.000369,0.00051,0.000541,2e-04,0.000639,0.00044,0.000364,0.000571,0.000399,0.000329,0.000372,0.000705,0.000231,0.000645,0.000613,0.001141,0.00048,0.000723,0.000697,0.000927,0.000255,0.000167,0.000589,0.000915,0.000562,0.000204,0.000646,0.000199,0.000594,0.000994,0.000727,0.000779,0.000901,0.000486,0.000587,0.000214,0.001298,0.000704,0.000653,0.000664,0.000668,0.000486,0.00033,0.001572,0.000669,0.000541,0.00021,0.000358,0.000862,0.000812,0.000614,0.000851,0.000634,0.000673,0.000865,0.000102,0.00047,0.000646,0.000728,0.00023,0.000135,0.00065,0.000608,0.000117,0.000393,0.000164,0.000606,0.000104,0.00075,0.000544,0.000368,0.000565,0.000686,0.001211,0.00061,0.000949,0.000492,0.000247,0.00064,0.000456,0.000207,0.000594,0.000351,0.000272,0.000631,0.000494,0.000445,0.000547,0.000584,0.000466,0.000248,0.000158,0.000222,0.000187,0.00051,0.000164,0.000669,0.00021,0.000174,0.000247,0.000309,0.00066,0.000574,0.000162,8.6e-05
0.000561,0.00042,0.000184,2.9e-05,0.000499,0.000314,0.000415,0.000448,0.000194,0.000545,0.000402,0.000352,0.000153,0.000504,0.000384,0.000441,0.000366,0.000574,0.000304,4.6e-05,0.000319,0.000104,0.000281,0.000159,0.000155,0.000436,0.000328,0.000473,0.000336,0.000305,0.000253,0.000413,0.000191,0.000202,0.00033,0.000504,0.000288,0.000183,0.000411,0.000296,0.000357,0.00024,0.000283,0.000357,0.000682,0.000413,0.000443,0.000489,0.000315,0.00042,9.9e-05,0.000395,0.000678,0.000407,0.00025,0.000452,0.000199,0.000284,0.000167,0.000833,0.000324,0.000418,0.000161,0.00027,0.000474,0.000104,0.000407,0.000291,0.000242,0.000569,0.000311,0.000425,0.000146,0.000153,0.000378,0.000273,0.000105,0.000452,0.00038,2e-04,9.7e-05,0.000391,0.00038,0.000155,0.000286,0.000118,0.000431,0.000404,0.000279,0.000524,0.000172,0.000628,0.000378,0.000211,0.000241,0.000239,0.000145,0.000231,0.000207,7.5e-05,0.000476,0.000119,0.000118,0.000313,0.000161,0.000317,0.000134,0.000229,0.000219,2.5e-05,0.00022,0.000187,0.00046,0.000373,0.000155,0.000232,0.000559,0.000345,0.000262,8e-05,0.000168
0.000425,0.000277,8.1e-05,0.000387,0.000122,0.000477,0.000335,0.00039,0.000522,0.000428,0.000352,0.000329,0.000373,0.000715,0.000617,0.000293,0.000282,0.000434,0.000231,0.000158,0.000287,0.000178,0.000282,0.000211,0.000294,0.000423,0.000403,0.000438,0.000309,0.000352,0.000555,0.000629,0.000194,0.000313,0.000272,8.6e-05,0.000495,0.000324,0.000224,0.000312,0.000442,0.000403,0.000377,0.000607,0.000288,0.000454,0.000233,8.5e-05,0.000324,0.000208,0.000229,0.000203,0.000778,0.000705,0.000356,0.000349,0.000441,0.000515,0.000357,0.000344,9.3e-05,0.000178,0.000557,0.00028,0.000384,6.2e-05,0.000428,0.000463,0.00031,0.000773,0.000411,0.000489,0.000359,0.000385,0.000434,0.000252,0.000303,0.000282,0.000487,0.00025,0.000156,0.000284,0.000594,0.000209,0.000294,0.000148,0.000341,0.000317,9.2e-05,0.000395,0.000396,0.000502,0.000146,0.000295,0.000147,0.00037,0.000194,0.000393,0.000151,0.000204,0.000528,0.000313,4.2e-05,0.000219,0.000152,0.000449,0.000331,0.000312,0.000221,0.000154,0.000284,0.000172,0.000266,0.000325,0.000165,0.000155,0.00034,0.00044,0.000219,0.000191,0.00027
3e-04,0.000438,0.000384,0.000786,4.4e-05,0.000639,0.000222,0.000411,0.000299,0.000384,0.000459,3.5e-05,0.000675,0.000125,0.000138,0.000582,0.000247,0.000157,0.000127,0.000164,0.000165,0.000651,0.000284,5.3e-05,0.000625,0.000481,6e-04,0.00066,4.1e-05,0.00035,0.000973,0.000489,0.000402,0.000127,0.000404,0.00036,0.000292,0.000183,0.000485,0.000724,0.000691,0.000247,0.000422,0.000653,0.000514,0.000225,0.000274,0.000541,0.000239,0.000727,0.000268,0.000437,0.001357,0.000121,0.000262,0.000386,0.000209,0.000463,0.000243,0.000104,0.000327,0.000144,0.000567,0.000208,0.000195,0.000426,0.000423,0.000478,0.000731,0.001308,0.000344,0.000803,0.000265,0.000379,0.000593,0.000331,0.000524,0.000831,0.000288,0.000241,0.000595,0.000528,0.000725,0.000225,0.000513,0.000227,0.000406,0.000399,0.000216,0.000606,0.000564,0.000704,0.000168,0.000105,0.000208,0.00051,7.5e-05,0.000296,0.000573,0.000315,0.000336,0.000264,0.000238,0.000111,0.000271,0.000151,0.000236,0.000232,0.000247,8.1e-05,0.000327,0.000249,0.000248,0.000303,0.000242,0.000286,0.000494,0.00026,0.000635,0.000177,0.000109
0.000741,0.001432,0.001135,0.001141,0.001379,0.000761,0.000735,0.001235,0.000419,0.000189,0.00072,0.000692,0.000656,0.001065,0.000868,0.000986,0.000385,0.000545,0.000416,0.000128,0.000354,0.000931,0.000569,0.000228,0.00081,0.000708,0.001175,0.000287,0.000366,6e-04,0.000901,0.001855,0.000889,0.000259,0.000577,0.000874,7e-04,0.000258,0.000469,0.001527,0.001529,0.001289,0.000793,0.001018,0.000261,0.000686,0.00032,0.000552,0.000448,0.000721,0.000621,0.001054,0.001479,0.001747,0.000867,0.000475,0.000696,0.000475,0.00102,0.00038,0.000155,0.000371,0.000798,0.00062,0.000525,0.000554,0.000451,0.001375,0.001987,0.001214,0.001454,0.000392,0.000786,0.000651,0.000558,0.000447,0.000384,0.000343,0.001286,0.000535,0.001113,0.000452,0.000899,0.001164,0.000428,4e-04,0.000547,0.000269,0.000468,0.000809,0.000467,0.000463,0.000839,0.000369,0.000311,0.000926,0.00071,0.00037,0.000834,0.000417,0.000487,0.000263,0.000763,0.000312,0.000218,0.000237,0.000694,0.000735,0.000434,0.000261,0.00036,0.000602,0.000375,9.9e-05,0.00034,0.000326,0.001024,0.000629,0.00053,0.000534,0.000428
0.00086,0.001965,0.002318,0.001197,0.001573,0.001059,0.000257,0.001641,0.001943,0.001132,0.000426,0.000357,0.000439,0.000684,0.000562,0.001298,0.001764,0.001762,0.001353,0.000931,0.000998,0.001414,0.001317,0.000826,0.001231,0.001262,0.001913,0.002006,0.001275,0.000939,0.00146,0.002771,0.002411,0.00134,0.000228,0.000487,0.000399,0.000547,0.001047,0.002242,0.002813,0.001684,0.00164,0.002586,0.002509,0.002137,0.001599,0.001151,0.00121,0.001477,0.000326,0.001808,0.00243,0.00142,0.000788,0.001284,0.001489,0.001824,0.001755,0.001423,0.000716,0.000593,0.001545,0.000849,0.00037,0.001046,0.001357,0.002427,0.003433,0.003812,0.002932,0.002458,0.001948,0.000983,0.000749,0.000897,0.000631,0.00048,0.001338,0.001984,0.001615,0.000964,0.001414,0.00185,0.001347,0.001511,0.001599,0.001498,0.001001,0.001589,0.001554,0.001179,0.001646,0.000813,0.000262,0.001408,0.001369,0.00041,0.000653,0.001134,0.000611,0.000428,0.000957,0.001083,0.000835,0.000407,0.000696,0.001058,0.000884,0.000701,0.000601,0.000774,0.00109,0.000782,0.000672,0.000955,0.000787,0.000671,0.000339,0.00024,0.000716
0.000893,0.000693,0.000356,0.000825,0.000433,0.000439,0.000615,0.000704,0.000903,0.00089,0.000576,0.000538,0.000226,0.000344,0.000904,0.000621,0.000612,0.000452,0.000236,0.000272,0.000453,0.000564,0.000389,9.3e-05,0.000482,0.000307,0.000843,0.000972,0.000472,0.000517,0.000511,0.001409,0.001003,0.000471,0.000331,0.000101,0.000536,0.00031,6e-04,0.001165,0.000601,5.2e-05,0.001098,0.000949,0.000679,0.000633,0.000533,0.000711,0.000904,0.000838,0.000918,0.001987,0.000867,0.000618,0.00023,0.000803,0.000649,0.000635,0.000537,0.000517,0.000327,0.000308,0.001125,0.00082,0.001046,0.000993,0.000682,0.000997,0.001271,0.000867,0.000484,0.000628,0.000487,0.000165,0.000567,0.000412,0.000139,0.000116,0.001026,0.000868,0.000264,0.000261,0.000751,0.000513,0.000303,0.000851,0.000929,0.00072,0.000982,0.00078,0.000153,0.000588,0.000803,0.000676,0.000501,0.000645,0.000566,0.000554,0.00011,0.000636,0.000196,0.000295,0.00051,0.000481,0.000136,0.000222,0.000198,0.000469,0.000179,0.000213,0.000576,0.000176,0.000385,0.000289,3e-04,0.000457,0.00037,0.000238,0.000115,0.000251,0.000311
0.000342,0.00038,0.000296,0.000524,0.000342,0.000322,0.000268,0.000365,0.00034,0.000482,0.000217,0.00013,0.000359,0.000195,0.000462,0.000173,0.000473,0.000398,0.00023,0.000188,0.000317,4.8e-05,0.000453,0.000361,0.000106,9.8e-05,0.000397,0.000332,0.000444,0.000139,0.000458,0.000883,8e-05,8e-05,0.000232,0.000262,0.000118,0.000283,0.000344,0.000287,0.000569,0.000238,0.000529,0.000204,0.000373,0.000189,0.000377,0.000706,0.000125,0.000534,0.000154,0.001187,0.000362,4.7e-05,8e-05,0.000442,0.000339,0.000608,0.000142,0.000483,0.00015,0.000178,0.000578,0.000213,0.000577,0.000164,0.000212,0.000545,0.001009,0.000931,9.4e-05,0.000387,0.000109,0.000175,0.00012,0.000154,0.000247,0.000134,0.000355,0.000212,0.000172,0.000173,0.000442,0.000182,0.000225,0.000193,0.000502,4.6e-05,0.000444,0.000314,0.000161,0.000429,0.000136,0.000197,1.4e-05,0.000288,0.000194,9e-05,2.5e-05,0.000364,0.000288,0.000155,0.000221,0.000201,0.000212,7e-05,0.000318,8.4e-05,0.000224,0.000323,0.00017,0.000202,0.000103,0.000105,0.000208,0.00017,0.000146,4e-05,9.5e-05,7.5e-05,9.8e-05
0.000233,0.000231,0.000355,0.000158,0.000183,0.000181,0.000227,0.00023,9.2e-05,0.000323,0.000243,0.000164,0.000189,7.1e-05,0.000337,0.000174,0.000279,8.9e-05,0.000112,0.000261,0.000183,8.4e-05,0.000218,0.000154,0.000293,0.000259,0.000199,0.000131,1.7e-05,0.000167,0.000143,0.000259,9.6e-05,0.000102,0.000224,0.000287,7.4e-05,0.000203,0.000288,0.000102,0.000262,0.000127,0.000228,0.000411,0.000272,8.3e-05,0.000161,0.000336,0.00024,0.000312,0.000181,0.000473,0.000306,0.000281,0.000171,0.000246,0.000213,0.000452,0.000185,0.000511,0.000197,0.000235,0.000242,0.000226,0.00026,6.6e-05,0.000345,0.000231,0.000218,0.000387,0.000106,0.000349,0.00026,6.6e-05,3.5e-05,0.000111,8.9e-05,0.000309,0.000463,0.000387,6.8e-05,0.00015,7.2e-05,7.4e-05,0.000207,0.000218,0.000165,0.000115,0.000133,0.000107,0.000106,0.000415,0.000269,0.000132,0.000137,0.000324,2.9e-05,0.000129,8e-05,2.3e-05,2.9e-05,9.9e-05,0.000235,7.7e-05,2.3e-05,9.2e-05,0.000174,0.000125,4e-05,0.000114,3e-05,8.4e-05,8.9e-05,3.3e-05,3.5e-05,0.00017,7.1e-05,5.9e-05,6.7e-05,6.6e-05,0.000108
0.000271,0.000198,0.000195,0.000194,6.8e-05,7.5e-05,0.000121,0.000215,0.000127,0.00027,8e-05,0.000195,0.000175,0.00017,0.000376,0.000119,0.000152,0.00015,0.000119,7.5e-05,0.000169,0.000132,0.000136,9.4e-05,0.000192,5.8e-05,0.000248,0.000138,0.000159,6.3e-05,9.5e-05,0.000303,0.000124,2e-04,0.000221,9.4e-05,0.00013,0.000133,0.000189,0.000192,0.000236,0.000162,0.000339,0.000222,0.000167,4.3e-05,0.00014,0.000187,7.5e-05,0.000114,4.5e-05,0.000163,5.9e-05,9.1e-05,5.7e-05,0.000221,0.000166,0.000339,0.000197,0.000331,8.3e-05,8.6e-05,0.000182,0.000233,0.000262,0.000141,0.00026,0.000107,0.000278,0.000268,0.000152,0.000293,6.5e-05,5.5e-05,9.3e-05,1.6e-05,3.7e-05,0.000189,0.000255,0.000339,0.00015,0.000159,0.000203,9.4e-05,0.000124,0.000221,0.000353,0.00012,6.8e-05,0.000239,8.5e-05,0.000201,0.000188,0.000189,6e-05,0.000202,3.6e-05,0.000101,0.000126,9.1e-05,6.7e-05,5.6e-05,0.000196,6.1e-05,6.6e-05,4.9e-05,0.000118,0.000131,2.1e-05,6.8e-05,4.5e-05,0.000153,7.6e-05,3.7e-05,7.3e-05,0.000199,0.000116,5.7e-05,0.000101,5e-05,0.000114
0.000136,0.000198,0.000145,0.000211,7.6e-05,9.7e-05,0.000176,0.000141,0.000153,0.000128,4.6e-05,2e-04,9.7e-05,9.5e-05,0.000288,4.4e-05,0.000185,0.000113,6.7e-05,9e-05,0.000139,2.6e-05,4.7e-05,5.4e-05,0.000106,5.3e-05,0.000173,2.9e-05,0.000157,5.3e-05,0.000121,0.000212,4.6e-05,0.00015,0.00013,0.000189,5.7e-05,6.1e-05,0.000168,0.000184,0.000104,8e-05,0.000192,0.000169,0.000157,4.3e-05,0.000125,0.000154,7.7e-05,6.4e-05,7.1e-05,0.000201,9.1e-05,6e-05,6.1e-05,0.000208,0.000142,0.000321,0.000165,0.000289,0.000111,7.5e-05,6.9e-05,0.000144,0.000271,5.9e-05,0.000156,0.00018,0.000201,0.000288,5.7e-05,0.000158,0.000147,2.6e-05,0.000101,9.2e-05,7e-06,9.8e-05,0.000265,0.000357,0.000111,0.000192,8.9e-05,0.000103,0.000162,0.000138,0.000308,4.3e-05,0.000176,0.000104,3.7e-05,0.000204,5.7e-05,9.9e-05,0.000128,2e-04,3.9e-05,0.000101,8.9e-05,9.8e-05,6.3e-05,1.6e-05,8.1e-05,5.8e-05,4.9e-05,5e-06,0.00012,5.4e-05,8e-06,3.7e-05,6.1e-05,8.4e-05,4.2e-05,3.5e-05,6.7e-05,0.000146,8.1e-05,1.8e-05,8.1e-05,6.9e-05,5.9e-05
4.9e-05,8.7e-05,4.7e-05,7.2e-05,4.6e-05,4.2e-05,8.5e-05,6e-05,5.1e-05,7.1e-05,1.4e-05,8e-05,5.3e-05,4.4e-05,0.000121,1.5e-05,7.7e-05,3.6e-05,2.5e-05,5.3e-05,3.5e-05,6e-06,2.1e-05,2.2e-05,5.6e-05,2.9e-05,6.6e-05,1.8e-05,6.5e-05,3.6e-05,4.7e-05,0.000119,2.9e-05,9e-05,6.1e-05,6.1e-05,1e-05,3.7e-05,5.9e-05,6.7e-05,4.6e-05,4.3e-05,5.9e-05,7.8e-05,4.4e-05,3.1e-05,2.8e-05,9.2e-05,5.1e-05,4.3e-05,4e-05,9.2e-05,3.6e-05,1.8e-05,2.1e-05,9.2e-05,4.9e-05,0.000139,6.2e-05,0.000102,1.7e-05,3.2e-05,2.2e-05,6.7e-05,0.000114,4.8e-05,5.7e-05,6.8e-05,7.4e-05,0.000149,4.1e-05,5.5e-05,4.9e-05,1.4e-05,3.1e-05,2e-05,1.5e-05,3.3e-05,7.2e-05,9.8e-05,6.1e-05,5.2e-05,3.3e-05,5e-05,4e-05,5.6e-05,0.000129,2.3e-05,8.2e-05,6.4e-05,7e-06,9.6e-05,1.9e-05,3.8e-05,4.1e-05,9.1e-05,9e-06,3.7e-05,2.6e-05,4.4e-05,2.2e-05,1.1e-05,4.2e-05,1.6e-05,2.2e-05,8e-06,4.8e-05,3.2e-05,1e-05,1.9e-05,2.4e-05,4.3e-05,3.2e-05,6e-06,3.6e-05,5.4e-05,4.6e-05,1.2e-05,2.9e-05,3e-05,2e-05
8.1e-05,7.1e-05,5.7e-05,9.8e-05,2.3e-05,2.2e-05,7.5e-05,5.4e-05,4e-05,7.6e-05,1.9e-05,5.9e-05,5.8e-05,3.5e-05,0.000103,2.7e-05,7.5e-05,6.8e-05,1.9e-05,6.1e-05,5.1e-05,1.3e-05,3.6e-05,5e-06,6.2e-05,2.7e-05,4.6e-05,2e-06,5.6e-05,2.3e-05,3.7e-05,7.1e-05,2.5e-05,9.7e-05,2.8e-05,6.6e-05,1.8e-05,5.4e-05,7.6e-05,7.4e-05,3.7e-05,3.2e-05,2.4e-05,5.4e-05,7.8e-05,1.8e-05,4e-05,5.1e-05,2.4e-05,1.7e-05,6.3e-05,6.2e-05,3.9e-05,3.2e-05,1.2e-05,7.2e-05,7e-05,0.000148,3.1e-05,0.000106,2.8e-05,1e-05,3.6e-05,7.2e-05,8.4e-05,5e-05,7.4e-05,5.4e-05,6.1e-05,0.000113,3.6e-05,8e-05,1.6e-05,3.1e-05,3.5e-05,4.6e-05,2.7e-05,2.6e-05,6.6e-05,0.000115,2.3e-05,7.4e-05,2.8e-05,4.2e-05,3.8e-05,4.6e-05,9.8e-05,2.1e-05,6.3e-05,5.3e-05,2.5e-05,8.8e-05,3.6e-05,4.6e-05,2.7e-05,8.9e-05,2.8e-05,3e-05,2.2e-05,3.7e-05,3.6e-05,1.1e-05,4.7e-05,1.5e-05,3.2e-05,3e-06,4.5e-05,2.5e-05,6e-06,1.1e-05,3.6e-05,2.8e-05,1.8e-05,1.8e-05,4e-05,5.8e-05,3.4e-05,2.2e-05,4.5e-05,1.6e-05,1.9e-05
7.6e-05,5.9e-05,7.7e-05,5.2e-05,4.7e-05,4.3e-05,7.1e-05,4.1e-05,6.5e-05,8.6e-05,4.2e-05,8.8e-05,8.4e-05,1.8e-05,0.000108,5e-05,8.4e-05,6.1e-05,2.4e-05,2.2e-05,2.1e-05,1.9e-05,5e-05,3.7e-05,6.2e-05,5.7e-05,8e-06,3.6e-05,5e-05,3.2e-05,4.3e-05,6.1e-05,3.3e-05,0.000114,7.7e-05,8.3e-05,1.5e-05,4.3e-05,4.2e-05,6.5e-05,8.7e-05,4.9e-05,5e-05,5e-05,3.3e-05,2e-05,3.9e-05,5.1e-05,1.6e-05,3.6e-05,2.7e-05,0.000103,8e-05,5.5e-05,2.2e-05,6.1e-05,2.7e-05,0.000114,4.9e-05,9.3e-05,2.6e-05,2.4e-05,8e-06,7.5e-05,0.000107,5.2e-05,5.4e-05,6.4e-05,8.7e-05,0.00013,2.3e-05,8.2e-05,6e-05,4e-06,4.9e-05,5.9e-05,5.6e-05,2.1e-05,4.8e-05,0.000112,4.4e-05,5.7e-05,2.9e-05,6.7e-05,4.9e-05,5e-05,9e-05,2.8e-05,6.7e-05,5.9e-05,3.7e-05,9.3e-05,5e-06,3.1e-05,1.6e-05,0.000102,4.4e-05,2.7e-05,1.1e-05,4.6e-05,4.3e-05,1.5e-05,3.8e-05,4.4e-05,8e-06,1.2e-05,2.4e-05,2.1e-05,9e-06,8e-06,3.2e-05,9e-06,6.4e-05,1.6e-05,4e-05,7.7e-05,2.7e-05,2e-05,4.4e-05,3.1e-05,5.2e-05
5.6e-05,7.7e-05,8.5e-05,0.000115,8e-05,5.5e-05,0.000109,2.7e-05,7.1e-05,5.6e-05,4.5e-05,3.7e-05,6.3e-05,9.2e-05,0.000113,7.8e-05,2.1e-05,8.8e-05,1.3e-05,4.4e-05,7.7e-05,3.9e-05,5.1e-05,4.4e-05,5.7e-05,6.7e-05,0.000102,2.3e-05,5.3e-05,4.8e-05,6.2e-05,8.1e-05,4.8e-05,7.8e-05,6.2e-05,6.2e-05,1.2e-05,3e-05,7e-05,6.9e-05,6.1e-05,4.1e-05,3.4e-05,6e-05,2.5e-05,4.6e-05,5.8e-05,5.3e-05,1.3e-05,1.1e-05,3.9e-05,0.000128,4.3e-05,7.2e-05,4.7e-05,6.7e-05,8.1e-05,0.000124,7e-06,8.7e-05,1e-05,6.4e-05,5e-06,7.4e-05,7.3e-05,6.3e-05,8.5e-05,8e-05,9e-05,9.1e-05,5.4e-05,6.8e-05,2.6e-05,4.2e-05,5.5e-05,6.9e-05,2.9e-05,2.8e-05,7.9e-05,9.8e-05,5.4e-05,1.8e-05,2.3e-05,7.1e-05,4.9e-05,4.5e-05,6.3e-05,4.1e-05,7.7e-05,5.5e-05,5.2e-05,8.2e-05,7e-05,1.9e-05,4.2e-05,5.3e-05,2.8e-05,4e-05,3e-06,6.1e-05,2e-05,7e-06,4.5e-05,4.3e-05,6.7e-05,3.9e-05,4e-05,3.5e-05,1.8e-05,2.7e-05,2.4e-05,5.5e-05,2.4e-05,5e-06,3.5e-05,3.2e-05,5.9e-05,4.7e-05,5e-06,2.7e-05,4.4e-05
5.8e-05,5.2e-05,0.000103,8.3e-05,9e-05,7.1e-05,6.3e-05,7.6e-05,2.2e-05,6.5e-05,3.8e-05,2.8e-05,2.8e-05,7.4e-05,0.000135,2.1e-05,6.6e-05,5.7e-05,6e-05,5.9e-05,8.8e-05,2.8e-05,5.2e-05,2.6e-05,4.6e-05,4e-05,4.2e-05,4.3e-05,8.5e-05,4.3e-05,1.8e-05,8.6e-05,4e-05,3.1e-05,9.2e-05,0.000113,3e-05,3e-06,5.5e-05,9.4e-05,3.5e-05,9e-06,8e-05,3.3e-05,4.8e-05,5e-06,3.9e-05,3.4e-05,1e-05,3.6e-05,3.5e-05,0.000108,0.000116,6e-05,5.6e-05,3.4e-05,9.2e-05,0.000112,2.5e-05,5.1e-05,1.5e-05,3.3e-05,5.6e-05,7.6e-05,8.3e-05,7.5e-05,0.000115,4.9e-05,7.4e-05,0.000132,5.8e-05,4.8e-05,2.5e-05,4.1e-05,3e-05,7.1e-05,6.5e-05,3e-05,7.9e-05,0.000129,2.3e-05,3.8e-05,7.5e-05,3.5e-05,4.3e-05,1.7e-05,7.5e-05,1.1e-05,8e-06,1.7e-05,3.8e-05,1.1e-05,4.2e-05,2.4e-05,6.3e-05,7.4e-05,2e-05,2.7e-05,4e-05,6.8e-05,4.6e-05,2.9e-05,6.5e-05,4.4e-05,7.5e-05,7e-05,9.6e-05,4e-05,2.6e-05,1.7e-05,4.2e-05,9.1e-05,7.3e-05,3.4e-05,2.6e-05,3.8e-05,3.4e-05,1.9e-05,3.5e-05,3.6e-05,1.4e-05
5.3e-05,5e-05,3.8e-05,6.8e-05,5.2e-05,1.2e-05,5.4e-05,3.7e-05,4.2e-05,4e-05,3.7e-05,2.8e-05,4.4e-05,3.6e-05,0.000113,3.3e-05,3.8e-05,4.5e-05,6.4e-05,5.4e-05,4.4e-05,2.1e-05,2.2e-05,5e-06,4.4e-05,5.9e-05,6.7e-05,2.8e-05,4.3e-05,3.9e-05,3.5e-05,8.1e-05,3.5e-05,6.1e-05,4.8e-05,8e-05,1.3e-05,2e-05,3.5e-05,7.9e-05,5e-05,8e-06,6.6e-05,2e-05,4e-05,2.2e-05,3e-05,2.4e-05,1.1e-05,3.5e-05,3.5e-05,7.8e-05,7e-05,1e-05,1.9e-05,3.5e-05,4.3e-05,0.000108,6.3e-05,9.2e-05,3.1e-05,2e-05,4.6e-05,3.1e-05,7.7e-05,2.8e-05,6.7e-05,3.9e-05,4.6e-05,7.9e-05,9e-06,6.4e-05,2.5e-05,2e-05,1.6e-05,2.8e-05,4e-06,4.2e-05,3.2e-05,7.9e-05,5e-05,4.9e-05,5.9e-05,2.4e-05,2.2e-05,4.2e-05,8.7e-05,2.1e-05,3.7e-05,2.1e-05,2.1e-05,3.6e-05,2.2e-05,2.2e-05,3.7e-05,7.4e-05,1.6e-05,2.2e-05,4e-05,1.3e-05,2.5e-05,2.7e-05,6.4e-05,5.6e-05,1.5e-05,3.4e-05,4.8e-05,4.7e-05,1.3e-05,3.9e-05,1.4e-05,3.2e-05,4.8e-05,2.8e-05,1.5e-05,2.1e-05,2.2e-05,1.8e-05,3.2e-05,3.2e-05,3.2e-05
3.2e-05,2.5e-05,6.2e-05,6.2e-05,4.8e-05,2.3e-05,5.3e-05,3e-05,7e-06,5.8e-05,4.2e-05,4.8e-05,1.4e-05,2.5e-05,1e-04,5e-05,5.1e-05,5.9e-05,3.4e-05,2.1e-05,2.1e-05,2.1e-05,4.6e-05,2.9e-05,5.4e-05,5.9e-05,5.9e-05,5.9e-05,6.6e-05,3.8e-05,1.4e-05,7e-05,2.4e-05,4.5e-05,4.5e-05,5.9e-05,1.7e-05,4.8e-05,1.8e-05,8.3e-05,2.4e-05,2.1e-05,3.2e-05,4.3e-05,2.4e-05,1e-05,1.4e-05,1.5e-05,2.8e-05,3.3e-05,5e-06,7.9e-05,6.6e-05,9e-06,2e-05,3.5e-05,2.5e-05,0.000109,5.7e-05,7.3e-05,1.1e-05,3.2e-05,2.9e-05,4.3e-05,7.6e-05,5.2e-05,8.1e-05,3.8e-05,3.9e-05,7.9e-05,3.3e-05,5.5e-05,8e-06,4.7e-05,2.2e-05,1.1e-05,2.6e-05,4.5e-05,4.3e-05,6.8e-05,3.9e-05,6.5e-05,4.7e-05,3.1e-05,5.3e-05,4.1e-05,8.3e-05,2.1e-05,3.5e-05,2.7e-05,5.1e-05,3.9e-05,2.1e-05,2.8e-05,3.2e-05,7e-05,1.9e-05,1.1e-05,2.6e-05,1.7e-05,3.4e-05,1.4e-05,5.2e-05,3.3e-05,3.1e-05,2.3e-05,5e-05,1.8e-05,2e-06,3.8e-05,1.8e-05,4.9e-05,3.7e-05,2.8e-05,2.3e-05,3.7e-05,3e-05,1.1e-05,1.6e-05,1.3e-05,3.8e-05
6.8e-05,3.5e-05,3.2e-05,3.3e-05,2e-05,2e-05,1.1e-05,1.7e-05,1.8e-05,5.2e-05,3.9e-05,5.2e-05,5e-06,3.4e-05,6.7e-05,1e-05,0.000115,1e-04,5e-05,1e-05,4.4e-05,4.1e-05,4.2e-05,3.3e-05,1.4e-05,4.1e-05,3e-05,2.1e-05,7e-05,3.3e-05,4.1e-05,9.3e-05,6.4e-05,7.3e-05,3.1e-05,2.4e-05,2e-05,4.3e-05,5e-05,5.1e-05,4.2e-05,2.6e-05,6.7e-05,2.3e-05,2.2e-05,3.1e-05,5.5e-05,5.2e-05,7.4e-05,6.4e-05,2.9e-05,5.1e-05,7.2e-05,3.1e-05,5.5e-05,8.8e-05,6.9e-05,8.4e-05,4.6e-05,9.9e-05,4e-05,2.4e-05,5.2e-05,9.2e-05,6.1e-05,9e-05,4.9e-05,6.8e-05,3e-05,4.5e-05,2.8e-05,7.6e-05,4.9e-05,4.5e-05,4.6e-05,2.3e-05,3e-05,1.7e-05,2.1e-05,4.9e-05,2.5e-05,6.7e-05,1.6e-05,2.5e-05,3.2e-05,2.2e-05,5.6e-05,1.6e-05,6.2e-05,3.5e-05,4.3e-05,7.8e-05,2.4e-05,1.4e-05,1.9e-05,8.2e-05,2e-05,1.6e-05,1.1e-05,2e-06,1.2e-05,1.7e-05,4.7e-05,4.1e-05,2.4e-05,2.4e-05,9e-06,1.5e-05,8e-06,1e-05,8e-06,4e-05,3.5e-05,1.2e-05,1.5e-05,4.6e-05,1.9e-05,4e-06,2e-05,4e-06,1.9e-05
1.4e-05,2.3e-05,5.4e-05,3e-05,5.7e-05,1.1e-05,5.7e-05,4.2e-05,1.3e-05,6.4e-05,6.5e-05,1e-04,5.7e-05,1.8e-05,6.6e-05,2.1e-05,0.000111,8.3e-05,3.3e-05,2.6e-05,8.8e-05,8.7e-05,6.6e-05,4.6e-05,3.3e-05,4.5e-05,1e-05,1.9e-05,3.7e-05,6.4e-05,9.6e-05,7.4e-05,4.8e-05,5.4e-05,1.1e-05,6.1e-05,5e-05,4.2e-05,2.5e-05,3.6e-05,3.5e-05,3e-05,6e-05,8.5e-05,7.8e-05,4.5e-05,2.3e-05,6.9e-05,5.3e-05,3.2e-05,1.8e-05,1.2e-05,4.6e-05,3.8e-05,3e-05,6.3e-05,6.2e-05,7.6e-05,3.6e-05,6.1e-05,3.2e-05,2.5e-05,4.7e-05,5.6e-05,8.5e-05,7e-05,8.1e-05,3.8e-05,5.6e-05,9.9e-05,2.2e-05,4.9e-05,3.2e-05,1.8e-05,6.6e-05,3.5e-05,3.3e-05,3.4e-05,4.3e-05,4.9e-05,2.5e-05,4e-05,2.8e-05,3.1e-05,4.1e-05,3.2e-05,5.7e-05,2.5e-05,7.6e-05,5.7e-05,4.3e-05,1.6e-05,2.7e-05,5e-06,4.5e-05,5.7e-05,6.6e-05,2.4e-05,3.5e-05,4.5e-05,5.5e-05,2.9e-05,3e-05,3.9e-05,7e-06,1.4e-05,2e-05,2.4e-05,1.7e-05,2.1e-05,2.1e-05,2.7e-05,4.6e-05,1.9e-05,3e-06,3.1e-05,4.1e-05,4.3e-05,1.8e-05,3.4e-05,3.1e-05
4.9e-05,1.2e-05,3.4e-05,7.3e-05,1.9e-05,1.5e-05,7.6e-05,2.1e-05,2.8e-05,6.4e-05,2.9e-05,4.8e-05,4.1e-05,3.6e-05,5.4e-05,1.4e-05,5.8e-05,4.4e-05,3.5e-05,2e-05,8.5e-05,4.1e-05,4.3e-05,2.4e-05,1.2e-05,6.4e-05,3.7e-05,4.8e-05,4.2e-05,4.4e-05,7e-05,3.2e-05,4.6e-05,6.7e-05,4.4e-05,8.4e-05,7e-06,6e-06,1.9e-05,6e-05,4.7e-05,2.8e-05,1e-05,6.1e-05,2.9e-05,3.2e-05,3.2e-05,4.1e-05,1.5e-05,2e-05,2.9e-05,6.9e-05,1.7e-05,5.2e-05,2.2e-05,4.5e-05,4.2e-05,7.8e-05,5.8e-05,6.3e-05,3e-05,4.8e-05,7e-06,8.7e-05,1.9e-05,2.8e-05,4.8e-05,3.1e-05,6.5e-05,9.5e-05,1.4e-05,4.9e-05,5e-06,1.7e-05,3.8e-05,4.9e-05,1.4e-05,4.4e-05,1.7e-05,6.5e-05,1.1e-05,3.7e-05,4.8e-05,1.9e-05,2e-05,1.3e-05,6.3e-05,6e-05,3.4e-05,2.1e-05,1.7e-05,4.8e-05,5e-05,2.3e-05,5.7e-05,2e-05,3.5e-05,2.3e-05,2.1e-05,4e-05,4.7e-05,2.4e-05,5.3e-05,4.6e-05,3.2e-05,1.6e-05,3.3e-05,1.8e-05,1.5e-05,2e-05,3.2e-05,5.4e-05,4e-05,2.2e-05,2.1e-05,2.7e-05,4.6e-05,2.7e-05,1e-06,3.8e-05,3e-06
7e-05,2e-05,7.5e-05,4.5e-05,1.9e-05,4.4e-05,8e-06,1.1e-05,4.2e-05,9.5e-05,1.9e-05,5.6e-05,2.2e-05,8.3e-05,2.6e-05,3e-05,7.4e-05,7.6e-05,4.4e-05,3.9e-05,6.2e-05,4.8e-05,2.6e-05,5.3e-05,4.1e-05,5.4e-05,6.8e-05,6.3e-05,4.8e-05,4.8e-05,4.7e-05,2.7e-05,2.2e-05,8.2e-05,6.1e-05,4.5e-05,1.1e-05,1.3e-05,4e-05,1.5e-05,3.9e-05,3.5e-05,1.1e-05,5.4e-05,5e-05,1.9e-05,1.6e-05,9.5e-05,7.1e-05,1.6e-05,2.8e-05,8.5e-05,6.8e-05,6.2e-05,2e-05,1.5e-05,3.9e-05,5.6e-05,3.5e-05,4.5e-05,2.4e-05,4.1e-05,3.3e-05,6.5e-05,5.3e-05,3.2e-05,3e-05,1.3e-05,5e-05,9.6e-05,2.7e-05,3.6e-05,5e-06,3.4e-05,4e-05,4.4e-05,6.7e-05,4.2e-05,6.1e-05,6.1e-05,5.4e-05,2.6e-05,6.5e-05,5e-05,6e-06,3.2e-05,4.5e-05,5.5e-05,3.5e-05,4.9e-05,4.3e-05,8.5e-05,2.2e-05,1.7e-05,3.5e-05,3.4e-05,1.3e-05,2.2e-05,2.6e-05,5.1e-05,6.6e-05,4.3e-05,2.4e-05,3.5e-05,4e-06,2e-05,4.5e-05,2.9e-05,1.5e-05,2.6e-05,2.9e-05,3e-06,5.6e-05,1.6e-05,2.1e-05,3.2e-05,6.1e-05,2.9e-05,1.5e-05,3.1e-05,2e-05
8.4e-05,2.9e-05,0.000109,8.7e-05,1.4e-05,6e-05,6.7e-05,7e-06,1.2e-05,7.3e-05,1.1e-05,1.4e-05,2.6e-05,8e-05,9.7e-05,1.6e-05,5.9e-05,1e-05,3.3e-05,6.2e-05,8.3e-05,7.9e-05,7.9e-05,7.1e-05,3.9e-05,6.2e-05,2.3e-05,3.4e-05,9.8e-05,7.7e-05,4.3e-05,5.6e-05,2.3e-05,4e-05,2.9e-05,0.000113,4.8e-05,1.8e-05,6.8e-05,5e-06,8.3e-05,5.8e-05,7e-05,1.7e-05,2.7e-05,1e-05,2e-05,7.4e-05,3.9e-05,3.9e-05,7e-06,2.3e-05,8.5e-05,4.6e-05,4.7e-05,5.7e-05,0.000106,1e-05,4.6e-05,6.1e-05,4.2e-05,3.1e-05,2.4e-05,6.6e-05,2.3e-05,6.1e-05,7.5e-05,7.7e-05,0.000116,3.5e-05,4e-06,4.4e-05,7e-06,6.8e-05,3.8e-05,5.5e-05,4.4e-05,6.7e-05,3.5e-05,6.9e-05,1.4e-05,4.4e-05,4.2e-05,2.1e-05,6.5e-05,5.8e-05,6.5e-05,1.5e-05,2.1e-05,3.2e-05,2.3e-05,8.1e-05,1.8e-05,1e-05,3.5e-05,5.6e-05,1.7e-05,4.4e-05,1.7e-05,2.3e-05,2.5e-05,1.2e-05,2.4e-05,1.1e-05,1.5e-05,3.2e-05,4.6e-05,3.1e-05,3.1e-05,2.8e-05,2.2e-05,9e-06,3.4e-05,9e-06,1.2e-05,2e-06,3e-05,5e-06,2.3e-05,2.3e-05,5e-06
1.3e-05,2.9e-05,6.4e-05,3.9e-05,2.8e-05,3.8e-05,3.6e-05,5e-06,1.2e-05,6.1e-05,3.6e-05,5.2e-05,1.1e-05,3.6e-05,5.2e-05,1.1e-05,1e-05,3.3e-05,3.4e-05,5e-05,3.2e-05,1.5e-05,4e-05,2.5e-05,9e-06,2.2e-05,3.4e-05,2.1e-05,5.8e-05,4.3e-05,5e-06,4.4e-05,2.7e-05,3.1e-05,1.5e-05,8.3e-05,1.4e-05,1.3e-05,3.2e-05,6.2e-05,3e-05,2.7e-05,2.6e-05,3.5e-05,1.6e-05,6e-06,3.1e-05,7.5e-05,1.7e-05,4.2e-05,1.6e-05,6.7e-05,4.5e-05,1.6e-05,2.7e-05,5.7e-05,3.2e-05,8.5e-05,8e-06,6.3e-05,1.4e-05,2.4e-05,4e-06,2.8e-05,5.9e-05,1.9e-05,1.6e-05,7.9e-05,3.1e-05,9.5e-05,2e-05,3.7e-05,2e-05,4.6e-05,2.8e-05,1.4e-05,1.8e-05,2.9e-05,5e-05,7.4e-05,4.3e-05,2.6e-05,2.9e-05,1.2e-05,3.7e-05,5e-06,6.6e-05,3e-05,1.4e-05,2e-05,1.8e-05,4.3e-05,1.2e-05,4e-06,3.9e-05,5.2e-05,1e-05,3.6e-05,1.1e-05,1.9e-05,1.5e-05,1.8e-05,9e-06,2.6e-05,1.6e-05,1.2e-05,1e-06,5e-06,1e-05,1.4e-05,2.1e-05,3.2e-05,3e-05,3e-06,1e-05,1e-05,3.8e-05,5e-06,1.7e-05,2.5e-05,2.4e-05
4.6e-05,3.7e-05,6.5e-05,4.9e-05,1.5e-05,8e-06,2.3e-05,4e-06,2.3e-05,6.1e-05,3.1e-05,3.3e-05,1.2e-05,2.7e-05,4.5e-05,1.7e-05,4.3e-05,1.7e-05,2.7e-05,5.1e-05,3.2e-05,2.9e-05,1.5e-05,1.3e-05,2.5e-05,1.2e-05,3.3e-05,3e-05,5.9e-05,1.7e-05,9e-06,2.5e-05,1.1e-05,4.3e-05,1.9e-05,6.7e-05,1.7e-05,3e-05,2.3e-05,4.3e-05,1.6e-05,1.5e-05,2.9e-05,3.2e-05,3.7e-05,1.3e-05,3.2e-05,4.7e-05,2.3e-05,1.6e-05,1.9e-05,4.5e-05,4.4e-05,2.4e-05,3e-05,7e-05,3.9e-05,5.9e-05,3.1e-05,7.1e-05,3.8e-05,3.3e-05,1.8e-05,5.5e-05,7.3e-05,1.1e-05,1.6e-05,5.3e-05,8e-06,4.4e-05,2e-06,1.2e-05,2e-05,3e-05,1.3e-05,1.7e-05,8e-06,1.5e-05,3.7e-05,8.2e-05,3.3e-05,3.9e-05,2.6e-05,1.3e-05,2.1e-05,1.2e-05,5.6e-05,2.4e-05,2.9e-05,1.7e-05,1.5e-05,5.1e-05,1.8e-05,2.2e-05,2.7e-05,4.1e-05,8e-06,2.4e-05,7e-06,2.7e-05,2.9e-05,1.7e-05,3.7e-05,2.4e-05,9e-06,1.4e-05,1.6e-05,1.1e-05,1.4e-05,1.1e-05,2.6e-05,1.9e-05,2.9e-05,1.1e-05,8e-06,2.5e-05,2.6e-05,2e-06,1.8e-05,1.8e-05,2.2e-05
1.2e-05,3.3e-05,4.7e-05,4e-05,3.9e-05,3.3e-05,2.8e-05,1.3e-05,4.5e-05,4.2e-05,3.4e-05,4.8e-05,2.3e-05,2.9e-05,7.4e-05,2e-06,2e-05,2.7e-05,4e-05,2.2e-05,1.8e-05,1.1e-05,2e-05,1e-06,1.6e-05,2.1e-05,1.5e-05,1.7e-05,6e-05,5.8e-05,2.3e-05,1.7e-05,3.9e-05,2.8e-05,1.5e-05,8.3e-05,2.2e-05,3e-05,2.9e-05,2.9e-05,3.9e-05,8e-06,9e-06,4.2e-05,2.6e-05,2.4e-05,3.5e-05,5.5e-05,2.4e-05,3.7e-05,1.4e-05,5.1e-05,3.5e-05,1.5e-05,1.9e-05,3.1e-05,3.3e-05,8.2e-05,3.6e-05,6.4e-05,4.7e-05,7e-06,1.5e-05,4.7e-05,4.9e-05,8e-06,1.4e-05,4.4e-05,2.3e-05,6.4e-05,2.4e-05,3.6e-05,1.9e-05,2.6e-05,2.9e-05,2.1e-05,1.9e-05,2.7e-05,4e-05,6e-05,2e-05,3e-05,1.1e-05,1.3e-05,3.1e-05,1.4e-05,6e-05,2e-06,1.3e-05,2.2e-05,1.5e-05,4.7e-05,2.5e-05,1.4e-05,3.9e-05,3.6e-05,1e-06,6e-06,1.9e-05,3.5e-05,8e-06,1.7e-05,3.2e-05,1.7e-05,8e-06,1.1e-05,8e-06,1.7e-05,1.7e-05,1.3e-05,9e-06,4.4e-05,2.6e-05,8e-06,6e-06,2.7e-05,2.9e-05,4e-06,1.3e-05,2.1e-05,1.7e-05
4.2e-05,2e-05,3.8e-05,1.9e-05,1.1e-05,2.4e-05,4.5e-05,1.7e-05,2.3e-05,5.8e-05,3.2e-05,6.4e-05,1e-05,2.9e-05,6.1e-05,2.5e-05,3.8e-05,1.3e-05,3.3e-05,3.3e-05,3.1e-05,1.8e-05,1.3e-05,8e-06,7e-06,9e-06,9e-06,9e-06,5.4e-05,4.1e-05,1.8e-05,3.5e-05,9e-06,3.8e-05,2.4e-05,4.9e-05,1.9e-05,1e-05,2.1e-05,3.4e-05,3.8e-05,2.5e-05,3.2e-05,4.1e-05,1.7e-05,1.6e-05,1.6e-05,3.5e-05,1.1e-05,3.3e-05,2.8e-05,5.5e-05,3.8e-05,7e-06,9e-06,4.8e-05,1.7e-05,9.2e-05,3.3e-05,8.3e-05,1.3e-05,1.9e-05,1.3e-05,3.3e-05,4.3e-05,2e-05,2.2e-05,2.6e-05,2.4e-05,6.9e-05,2.8e-05,2.2e-05,1.3e-05,1.8e-05,1.9e-05,1.1e-05,1.2e-05,2.7e-05,4.3e-05,5.5e-05,3.1e-05,2.7e-05,3.2e-05,9e-06,3.1e-05,1.8e-05,6.7e-05,1.2e-05,3.3e-05,1.3e-05,1.6e-05,2.3e-05,1.7e-05,2.8e-05,4e-06,4.1e-05,1.3e-05,2e-05,2.6e-05,1.8e-05,8e-06,1.3e-05,1.6e-05,1.9e-05,9e-06,1.8e-05,2.2e-05,2e-05,5e-06,8e-06,1.2e-05,4.1e-05,2.2e-05,1.6e-05,2e-05,2.8e-05,2.2e-05,5e-06,2e-06,1.4e-05,1.6e-05
3.1e-05,4e-06,3.2e-05,2.7e-05,1.6e-05,1.2e-05,3.9e-05,3e-06,1.7e-05,6.1e-05,2.7e-05,5.6e-05,2.6e-05,1.7e-05,5.4e-05,2e-05,2e-05,1.1e-05,2.2e-05,2e-05,2e-05,1.4e-05,3e-05,8e-06,6e-06,6e-06,3e-06,1.1e-05,5.1e-05,2.3e-05,2e-05,2.6e-05,1.3e-05,4.7e-05,3.4e-05,4.5e-05,1.2e-05,1e-05,2.7e-05,4.5e-05,3.2e-05,4e-06,2.7e-05,4.7e-05,2.7e-05,1.1e-05,8e-06,4.5e-05,2e-05,2.5e-05,2e-05,5.8e-05,3.9e-05,1.3e-05,7e-06,3.6e-05,1e-05,9.1e-05,4e-05,7.8e-05,1.5e-05,1.9e-05,6e-06,3e-05,5.5e-05,8e-06,1.7e-05,4.2e-05,4.3e-05,6.2e-05,2.5e-05,3.3e-05,3.3e-05,1.7e-05,2e-06,6e-06,1.1e-05,3e-05,3.8e-05,7.3e-05,1.6e-05,2e-05,3.3e-05,5e-06,2.5e-05,2.1e-05,6.1e-05,2e-05,1.6e-05,1.1e-05,2.4e-05,3.3e-05,1e-05,1.8e-05,2.9e-05,4e-05,2e-06,2.6e-05,2.9e-05,3.7e-05,1.6e-05,1.5e-05,2.5e-05,1.9e-05,2e-06,1.2e-05,1.5e-05,3e-06,9e-06,1e-06,5e-06,3.5e-05,2e-05,1.9e-05,2e-06,2e-05,2.9e-05,1e-05,2.2e-05,1.3e-05,1.8e-05
3.2e-05,1.3e-05,3.6e-05,4.3e-05,1e-05,1.3e-05,4.1e-05,1.2e-05,2.8e-05,4.6e-05,2.9e-05,5.1e-05,2.2e-05,3e-05,5.6e-05,1e-05,2.9e-05,2.2e-05,1.4e-05,2.7e-05,2.3e-05,2e-06,1.9e-05,4e-06,1.2e-05,5e-06,6e-06,8e-06,3.9e-05,1.2e-05,1e-05,3.6e-05,1.5e-05,3.4e-05,2.9e-05,5.8e-05,8e-06,1.2e-05,3.1e-05,3.3e-05,1.9e-05,1.4e-05,1.2e-05,3.3e-05,3.2e-05,3e-06,1.4e-05,4.3e-05,1.7e-05,2.4e-05,1.5e-05,4.4e-05,4.1e-05,1.7e-05,4e-06,3e-05,2.5e-05,8.1e-05,2.7e-05,7.6e-05,1.8e-05,1.3e-05,3e-06,3.9e-05,5.7e-05,6e-06,1.3e-05,5.4e-05,1.4e-05,6.9e-05,1.5e-05,3.1e-05,1.6e-05,1.1e-05,5e-06,5e-06,4e-06,1.9e-05,4.2e-05,7.2e-05,2.4e-05,2.5e-05,2.5e-05,6e-06,1.9e-05,1.6e-05,5.5e-05,1.8e-05,1.7e-05,7e-06,1e-05,4.3e-05,1.1e-05,2e-05,1.9e-05,3.5e-05,3e-06,2.2e-05,1.5e-05,2.3e-05,1.3e-05,5e-06,2.7e-05,1.5e-05,6e-06,5e-06,7e-06,9e-06,4e-06,7e-06,3e-06,3.1e-05,1.6e-05,1.2e-05,7e-06,2.2e-05,2.8e-05,4e-06,1.7e-05,1.4e-05,1.9e-05
2.9e-05,1.2e-05,3.3e-05,4.2e-05,1.4e-05,1e-05,4.1e-05,3e-06,1.9e-05,4.5e-05,2.5e-05,4.8e-05,1.5e-05,2.5e-05,4.6e-05,1.8e-05,3.1e-05,2.6e-05,2e-05,1.9e-05,2.3e-05,3e-06,2.1e-05,3e-06,1.1e-05,3e-06,3e-06,8e-06,4.1e-05,1.7e-05,8e-06,2.7e-05,1.5e-05,4.9e-05,2.7e-05,5.9e-05,1.4e-05,1.8e-05,2.4e-05,2.9e-05,1.4e-05,4e-06,4e-06,3.1e-05,2.3e-05,1.4e-05,1.1e-05,4.2e-05,1.6e-05,2.2e-05,1.2e-05,4.7e-05,3.8e-05,2e-05,2e-06,3.8e-05,2e-05,7.8e-05,2.2e-05,7.2e-05,2.1e-05,1.8e-05,1e-06,3.6e-05,5.6e-05,5e-06,1.8e-05,3.9e-05,1.7e-05,6.4e-05,9e-06,3.7e-05,1.9e-05,1.2e-05,4e-06,2e-06,1e-06,2e-05,3.6e-05,6.6e-05,2.2e-05,2.9e-05,2.7e-05,6e-06,2.6e-05,1.6e-05,5.5e-05,2.5e-05,1.7e-05,3e-06,1.7e-05,4.1e-05,5e-06,1.4e-05,2.8e-05,3.4e-05,5e-06,1.9e-05,1.1e-05,2.2e-05,1.4e-05,1e-06,2.1e-05,1.3e-05,2e-06,5e-06,1e-05,1.2e-05,5e-06,4e-06,3e-06,3e-05,1.6e-05,1.4e-05,3e-06,2e-05,2.1e-05,5e-06,1.4e-05,1.4e-05,2.1e-05
2.7e-05,9e-06,3.3e-05,3.5e-05,1.2e-05,1.1e-05,3.7e-05,5e-06,2e-05,5e-05,2.7e-05,4.2e-05,1.6e-05,2.4e-05,5e-05,1.4e-05,2.7e-05,1.9e-05,2e-05,2.2e-05,2.6e-05,5e-06,1.6e-05,3e-06,1.5e-05,6e-06,8e-06,7e-06,4e-05,1.7e-05,5e-06,2.8e-05,1.9e-05,4.4e-05,2.5e-05,5.8e-05,9e-06,1.3e-05,2.3e-05,3.5e-05,2.1e-05,1e-05,3e-06,3.5e-05,2.5e-05,9e-06,1.5e-05,4.1e-05,1.6e-05,2.1e-05,9e-06,5.3e-05,3.4e-05,1.6e-05,1e-06,4e-05,1.9e-05,7.6e-05,1.7e-05,7.2e-05,2.1e-05,1.5e-05,0,3.6e-05,5.3e-05,4e-06,2.2e-05,3.8e-05,2.2e-05,6.7e-05,3e-06,3.1e-05,1.7e-05,1.2e-05,4e-06,1e-06,5e-06,2.1e-05,3.7e-05,7e-05,1.7e-05,2.8e-05,2.5e-05,4e-06,2.3e-05,1.2e-05,5.7e-05,2.2e-05,1.8e-05,1e-06,1.3e-05,3.9e-05,2e-06,1e-05,2.4e-05,4.1e-05,3e-06,2e-05,1.2e-05,2.4e-05,1.5e-05,1e-06,2.4e-05,1.3e-05,3e-06,6e-06,1e-05,8e-06,2e-06,3e-06,2e-06,3e-05,1.9e-05,8e-06,6e-06,2e-05,2.4e-05,1e-06,1.4e-05,1.4e-05,1.9e-05
