-0.000305,-0.000152,-5.8e-05,-0.000295,-0.000451,-0.00011,-0.00038,-0.000306,-0.000156,-0.000162,-0.000358,-0.000214,-0.000127,-0.000106,-0.000275,-0.000142,-0.000132,-0.00013,-0.000295,-0.000241,-0.00041,-0.000243,-0.000418,-0.000202,-0.000138,-0.000132,-0.000146,-0.000193,-0.000195,-0.000184,-0.000289,-0.000328,-0.000308,-0.000181,-0.000116,-5.6e-05,-8.6e-05,-0.000106,-0.00015,-0.000348,-0.000145,-0.000247,-0.000135,2.8e-05,-0.000103,-0.000417,-0.000248,-0.000192,-0.000284,-0.000272,-0.000217,-0.000245,-0.000248,-0.000291,-0.000244,-0.000286,-0.000312,-4.8e-05,-7e-05,-0.00018,-0.000203,-0.000144,-3.8e-05,-0.000306,-0.000181,-0.000194,-1.4e-05,-2.5e-05,-0.00011,-0.000164,-9.9e-05,-0.000156,-0.000121,-0.000225,-0.000152,-5.7e-05,-0.000218,-0.000221,-0.000188,-0.000231,-0.000173,-2.8e-05,-0.000178,-0.000128,-1.5e-05,-0.000214,-0.000151,-0.000153,-1.3e-05,9.3e-05,-7.5e-05,-0.000128,-4.7e-05,-0.000324,-2.4e-05,-0.000207,-0.000168,-0.000194,-0.000199,-0.000229,-0.000181,-8.2e-05,-8e-06,-0.000283,-6.8e-05,-2e-06,-7.2e-05,-0.000183,-1.9e-05,-0.000104,-0.000272,-0.000104,-0.000255,-0.000136,-0.000183,-4.3e-05,-0.000259,-0.00014,-0.000103,-0.00011,-0.000145
-6.2e-05,-0.000198,-0.000146,-8.1e-05,6.8e-05,8.1e-05,2.2e-05,5.8e-05,-6.2e-05,-0.000126,5.3e-05,-6e-05,-0.000238,-0.000382,7.4e-05,-8.9e-05,-0.000178,-0.00031,-8.6e-05,-0.000171,-9e-06,-8.6e-05,1.6e-05,6e-05,-0.000124,-0.000271,-5.5e-05,-7e-05,-0.000225,-2.1e-05,8.1e-05,0.000165,1.2e-05,3.1e-05,-1.3e-05,-0.000117,-3.7e-05,-0.000155,2e-06,0.000121,-6.8e-05,1.4e-05,-0.000112,-8.2e-05,-2.2e-05,5.2e-05,2.9e-05,2.8e-05,-5.7e-05,-0.000116,-7e-06,0.000108,-8.2e-05,5.6e-05,5e-05,-3e-06,5e-05,-0.000175,-0.000119,-0.000123,4.6e-05,-7.1e-05,-0.000229,-1.3e-05,1.4e-05,-0.00012,1.2e-05,-8e-05,9e-05,-0.000149,3.4e-05,-7.6e-05,-8.1e-05,0.000119,8.1e-05,-0.000101,-2.8e-05,7.6e-05,2.4e-05,4.4e-05,3.9e-05,-8.4e-05,-2e-05,4e-06,-0.000138,-2.9e-05,-2.7e-05,-5.6e-05,-0.00018,-0.000184,-0.000145,2e-05,-0.000237,0.00011,-3.4e-05,-0.000105,-4.5e-05,1.5e-05,0,-1e-06,2.5e-05,-0.000103,-8.3e-05,-9e-05,-8.5e-05,-9.6e-05,-0.00014,-8.2e-05,2.5e-05,-7e-05,-1.4e-05,-9e-05,-0.000152,-0.000141,-4.4e-05,1.6e-05,-0.000112,-0.000124,-0.000115,-0.000113,3e-05
4.2e-05,1e-04,9e-06,7.8e-05,-0.000154,-0.000176,-0.000182,-0.000101,6.4e-05,-2.8e-05,-0.000123,2.7e-05,1.4e-05,0.000233,-4e-06,-3.5e-05,1.2e-05,6.3e-05,1.1e-05,-4.1e-05,-5.4e-05,-0.000181,-4.7e-05,7e-06,2.2e-05,-5e-05,-6.7e-05,-0.000182,1e-06,-1.5e-05,-0.000155,-8.1e-05,-9.8e-05,-4.3e-05,-5.4e-05,-7e-05,-2.8e-05,6.9e-05,-3.6e-05,-6.1e-05,-0.000117,-0.000105,5.6e-05,-9.2e-05,-0.000101,-0.000247,-0.000148,-7.4e-05,-2e-05,-2e-06,-5.7e-05,-4.9e-05,-7.9e-05,-5.5e-05,-6.5e-05,-1.6e-05,-8e-05,-0.000169,-0.000143,-0.000112,-5.2e-05,-3.7e-05,-3e-06,-0.000148,-4e-05,-5e-06,-0.000149,-0.000162,-7e-05,-0.000243,-0.000143,-0.000263,-7e-06,-0.000178,-0.000208,-5.6e-05,2e-06,-7.6e-05,1.9e-05,-0.00016,-0.000181,-0.000151,-0.000127,-2.3e-05,7e-05,-6.4e-05,-8.4e-05,-1e-04,-7.2e-05,-0.000183,-0.000149,-6.1e-05,-1.4e-05,-9.9e-05,-0.000191,-2.4e-05,-3.7e-05,-7.1e-05,3.1e-05,-8.3e-05,-0.000161,-7.7e-05,-0.000181,-7.3e-05,-2.3e-05,-9.1e-05,-7e-05,-3.1e-05,-0.000217,-0.000193,-3.5e-05,-0.000121,-0.000117,-0.000215,-0.000123,2.5e-05,-0.000166,-0.000149,-1e-04,-6.4e-05,-0.000109
-4.5e-05,-0.000123,-1.2e-05,-7.5e-05,7.4e-05,8e-06,-9.6e-05,0.000118,-0.000159,1e-04,6.4e-05,-0.000137,-9.1e-05,-0.000243,-4.3e-05,3e-05,5e-06,-1.7e-05,-9.8e-05,0.000103,7e-06,-3e-05,-0.000111,-0.000126,-0.000233,0.00011,-0.000115,7e-06,1.5e-05,-7e-06,6.6e-05,-0.000107,1.7e-05,-2.7e-05,-5e-05,-3.1e-05,2.7e-05,-9.2e-05,-0.000132,-0.000115,-0.000188,-3.3e-05,-0.000177,-0.000111,-2.6e-05,0.000148,-5.2e-05,-2.9e-05,2e-06,-4.1e-05,-2.4e-05,-7e-05,-2.3e-05,-0.000103,-1e-05,-6.4e-05,-7e-05,7.1e-05,-9.1e-05,4.6e-05,-8.2e-05,-6.8e-05,-0.00017,7e-06,-6.3e-05,3.2e-05,-6.4e-05,1.6e-05,2e-06,5.8e-05,-0.000113,5e-05,-7e-05,-3.1e-05,0,-2.6e-05,-3.7e-05,8.3e-05,-6e-06,-0.00013,2.2e-05,5.2e-05,6e-06,-4e-05,-0.000191,-7.2e-05,-2.1e-05,2e-05,-5e-05,-0.000112,-3.5e-05,-3e-06,1.8e-05,-5.9e-05,7e-05,-2.9e-05,-6e-05,0,-2.1e-05,-7.2e-05,-8e-05,-8.2e-05,-4.5e-05,1.2e-05,-0.000239,-0.000121,-5.7e-05,-1.4e-05,-5.8e-05,5e-05,-5.3e-05,-6.7e-05,-0.000114,-2.3e-05,6.1e-05,-0.000162,0.000141,8e-06,-1e-06,-2e-05,5.2e-05
0,4.5e-05,0.000166,3e-05,5.2e-05,-2e-05,8.4e-05,-0.000126,-6e-06,-3.1e-05,-1.5e-05,6.5e-05,0.000195,7.3e-05,8.2e-05,3.2e-05,3.1e-05,-0.000118,5.4e-05,-4.7e-05,8.7e-05,0.000118,7.5e-05,8.3e-05,8.5e-05,-4.5e-05,1e-04,9.2e-05,3e-06,3.9e-05,-1.6e-05,9.7e-05,3.8e-05,7.2e-05,6.3e-05,0.000104,3.3e-05,7.9e-05,6.6e-05,0.000138,0.000247,4.5e-05,0.00016,0.000162,7.8e-05,6.2e-05,0.000107,4.2e-05,8.4e-05,0.00018,-1.2e-05,7.6e-05,4.4e-05,9.2e-05,-9.3e-05,8e-05,3e-06,9e-05,0.000141,9.6e-05,0.000147,8.7e-05,9.5e-05,0.000118,5.2e-05,-2.3e-05,0.000109,0.000158,4.7e-05,7.7e-05,0.00014,0.000119,0.00018,4.4e-05,0.000125,9e-05,0.000127,-2.7e-05,8.5e-05,0.000126,-5e-06,7.5e-05,5.4e-05,7.7e-05,1.1e-05,0.000137,5.3e-05,3e-05,9.4e-05,9.7e-05,-1.4e-05,-3.5e-05,-0.000114,-5.3e-05,-7.2e-05,6.4e-05,8e-06,3.1e-05,-2e-05,0.000158,9.3e-05,0.000192,0.000109,4.3e-05,0.000104,4e-06,6.8e-05,4e-06,7.2e-05,-6.4e-05,8.6e-05,0.00022,0.000264,0.000204,5e-05,6.9e-05,-2.3e-05,1.9e-05,7.6e-05,8.4e-05,-2.4e-05
8e-06,3e-06,-3.2e-05,8.5e-05,-6.7e-05,-9e-06,5.6e-05,0.000167,3e-06,2.2e-05,-8e-06,-4.5e-05,-7.5e-05,3.9e-05,2e-06,-9e-06,2.9e-05,7.3e-05,2.7e-05,1.2e-05,-3.5e-05,-3.7e-05,-2e-05,-4.2e-05,3.1e-05,-7e-06,5.8e-05,1.9e-05,1.7e-05,3.1e-05,7e-06,-1.8e-05,-1.7e-05,-5.2e-05,-6e-06,1e-06,6.9e-05,-3.3e-05,-1.6e-05,1.4e-05,-9.9e-05,5.6e-05,1.9e-05,-1e-06,1.4e-05,-2.5e-05,-2.2e-05,5.4e-05,2.4e-05,-0.000119,4e-06,-9e-06,7e-06,2.5e-05,1.4e-05,-2.2e-05,4e-05,-0.000143,3.9e-05,-4.1e-05,-1.3e-05,2.5e-05,5e-05,8.1e-05,-2.8e-05,-9.2e-05,-4.4e-05,-0.000101,-9e-06,-3.3e-05,2.8e-05,8.3e-05,-1.3e-05,-2.9e-05,-3.7e-05,4.5e-05,2.4e-05,9.4e-05,-3.9e-05,2.2e-05,2.6e-05,4.9e-05,3.4e-05,-8.8e-05,-2.7e-05,-0.000103,6.6e-05,5e-06,3.8e-05,9.1e-05,5.7e-05,4.5e-05,-1.7e-05,-4e-06,4.7e-05,5e-05,0,-1.3e-05,2e-06,-3.4e-05,4e-05,-5.2e-05,1.8e-05,6.2e-05,-1.8e-05,0.000153,3.5e-05,-2.5e-05,-7.5e-05,9.7e-05,-5.5e-05,-0.000188,-0.000118,-5e-05,6.8e-05,3e-06,4.1e-05,8.6e-05,-6.4e-05,-4.3e-05,-3.9e-05
1.1e-05,-0.00013,-0.000119,-1.1e-05,1.4e-05,-5e-05,8e-06,-0.000104,-9e-06,-1.7e-05,7.8e-05,0.000123,3e-05,-5.7e-05,-3.4e-05,-3.9e-05,-7e-06,3.4e-05,-1.8e-05,-7.8e-05,-4.1e-05,2.1e-05,2.4e-05,4.1e-05,-6e-06,-3.3e-05,-5.3e-05,-2.9e-05,-7.1e-05,2.5e-05,-2.7e-05,-5.3e-05,-1e-05,-1.5e-05,3.4e-05,-4.5e-05,-3.4e-05,-3e-05,9e-05,5e-05,3.3e-05,-0.000146,-3.8e-05,-4.5e-05,-2e-06,7e-06,3.2e-05,-1e-06,-7.6e-05,1.9e-05,5.8e-05,-3.2e-05,1.8e-05,4e-06,-4.2e-05,9.2e-05,-1.3e-05,4.3e-05,1e-05,-6e-06,7.8e-05,-2.8e-05,-3e-06,-0.000131,6.2e-05,7.4e-05,2.2e-05,5.3e-05,-5.8e-05,6.6e-05,6e-05,-4.1e-05,-7.3e-05,5.2e-05,-4e-06,4.5e-05,-0.000102,-2.4e-05,-4.2e-05,-4.9e-05,-2.1e-05,-2.4e-05,-3.8e-05,1.4e-05,0,-3.2e-05,-6.5e-05,-3e-05,-6.4e-05,-3.7e-05,4.4e-05,-1.9e-05,8.2e-05,3.4e-05,9e-06,0,-1.3e-05,1.8e-05,3e-06,3.2e-05,-6.6e-05,1.9e-05,-2.6e-05,-5.6e-05,-8.1e-05,-6e-06,9.1e-05,3.6e-05,4.2e-05,0,8.4e-05,7e-05,6e-05,-1.6e-05,-9.5e-05,8.1e-05,7e-06,-6.9e-05,1.5e-05,3.2e-05,-3.5e-05
5e-05,9.9e-05,2.4e-05,-9.7e-05,4e-06,3.1e-05,-4e-06,2.5e-05,-1.9e-05,-0.000118,-0.000112,-0.000108,-1e-06,-1.3e-05,-4e-05,5.3e-05,-4e-05,-5e-06,9e-06,6.9e-05,2.8e-05,-4.7e-05,-6.2e-05,-9.1e-05,1.3e-05,-3.8e-05,1.1e-05,-0.000102,-2.3e-05,-5.1e-05,-6e-06,1.8e-05,1.5e-05,-3e-05,-1.2e-05,-2.2e-05,-5.2e-05,4.1e-05,-7.7e-05,-0.000137,-3.4e-05,-2.3e-05,-7.4e-05,2.9e-05,0,-4.8e-05,-5.1e-05,-3.6e-05,2.9e-05,-2.3e-05,-7.3e-05,-2.9e-05,-7.2e-05,-5e-05,-2e-05,-1.2e-05,4.2e-05,-6e-05,-8.5e-05,-6e-05,-0.00011,2.1e-05,-3.2e-05,-4e-06,-1.5e-05,-3.1e-05,-9.6e-05,-6e-05,-4.7e-05,-6.8e-05,-7.4e-05,-3.4e-05,-2.3e-05,-9.7e-05,-7.5e-05,-4.8e-05,4e-06,-0.000115,-4e-06,1.2e-05,-5.7e-05,-2e-06,5e-06,-5.8e-05,6.4e-05,1.3e-05,4e-06,1.6e-05,-3.1e-05,-5.4e-05,-6.4e-05,-3.9e-05,9e-06,1.9e-05,8e-06,1e-06,-3e-06,-3e-05,2e-06,-9e-06,-5e-06,-2.5e-05,-5e-06,-3.5e-05,-5.6e-05,-1e-06,-7.1e-05,-4.3e-05,3e-06,3.1e-05,-1.3e-05,0,-0.000102,-9.4e-05,-5e-06,-6.5e-05,-5.2e-05,-0.000101,-3.5e-05,-7.6e-05,3e-06
-6e-05,2.5e-05,-3.9e-05,2.6e-05,-3.8e-05,-2.9e-05,-1.5e-05,1.3e-05,7.3e-05,8.9e-05,-5e-06,2.8e-05,-8.8e-05,-9.6e-05,-6.8e-05,7e-06,-3e-06,-1.5e-05,1.8e-05,-3.2e-05,-4.7e-05,1.6e-05,8.7e-05,3.9e-05,-3.9e-05,0.000101,2.4e-05,3.7e-05,1.2e-05,-4.3e-05,-3.5e-05,-0.000126,-4.7e-05,3.2e-05,-4e-05,-2.7e-05,-2e-05,8e-06,-7e-06,8.4e-05,3e-06,-1.8e-05,1.1e-05,-6.1e-05,-2.8e-05,-4.8e-05,-1.5e-05,-1.8e-05,-5.4e-05,1.4e-05,-1e-06,8e-06,5e-05,-5e-06,0.000103,-5.6e-05,-2.1e-05,1.8e-05,2e-06,1e-05,-1.6e-05,5e-06,2.1e-05,2.9e-05,-2e-05,-4.4e-05,5e-05,5.5e-05,-8e-06,5.7e-05,4e-06,-1.9e-05,4.4e-05,4.4e-05,2.5e-05,-3.7e-05,-7e-06,1.9e-05,3.4e-05,-2.1e-05,1e-05,1.2e-05,-4.2e-05,3.8e-05,-3.5e-05,-5.2e-05,-5.3e-05,-5.7e-05,5e-06,1.3e-05,3.3e-05,1.2e-05,4e-06,0,2.3e-05,-4e-05,-3.8e-05,4.2e-05,2.2e-05,-7e-06,-6e-06,-4.9e-05,-2.8e-05,6e-06,6.6e-05,-3.3e-05,-2.7e-05,3.3e-05,0,-2.9e-05,-3.5e-05,-1.1e-05,5e-05,5.3e-05,-2.7e-05,-2.2e-05,1.3e-05,1.8e-05,-2.1e-05,1.3e-05,5.8e-05
4.7e-05,-2.8e-05,-2e-05,4e-05,9e-06,3.4e-05,1.8e-05,-4.3e-05,-3.2e-05,-1.9e-05,7e-05,-1.1e-05,8.4e-05,0.000113,2.4e-05,-1.8e-05,2.5e-05,-3.7e-05,-1.2e-05,4.5e-05,4.3e-05,-6e-06,-7.6e-05,2.2e-05,2.8e-05,3.9e-05,9e-06,1e-05,2.8e-05,2.4e-05,-2e-06,5.8e-05,6.9e-05,6e-06,4.2e-05,1.1e-05,5e-06,3.8e-05,9e-06,-4.5e-05,2.1e-05,1.6e-05,-2.3e-05,2.6e-05,2.9e-05,4.7e-05,-2e-05,1.3e-05,5.2e-05,1.3e-05,7e-06,-8e-06,9e-06,-5e-06,-9.3e-05,0,-3.5e-05,1.2e-05,3.2e-05,5.6e-05,9e-06,-2e-06,9e-06,8e-06,-2.8e-05,6.6e-05,6.1e-05,-5e-06,1.1e-05,-1e-05,6e-06,-3.6e-05,3e-05,8e-06,-1.6e-05,3.1e-05,3.2e-05,-2.4e-05,-2e-06,4.9e-05,3.5e-05,-3e-06,2.4e-05,1.5e-05,2e-06,2e-05,7.3e-05,6.5e-05,3.9e-05,2e-05,-6e-06,6.3e-05,-4e-06,2e-05,-8e-06,-2e-06,2.9e-05,-6.4e-05,3.9e-05,2.5e-05,-5e-06,3.9e-05,1e-05,2.6e-05,1.2e-05,-2.3e-05,-1e-05,3.3e-05,4.2e-05,2e-06,-8.6e-05,3.7e-05,-4e-06,0,3.7e-05,2.9e-05,1.2e-05,9.6e-05,5.5e-05,4.2e-05,-2.3e-05
-1.1e-05,3e-05,2.4e-05,4.1e-05,5.2e-05,-2e-05,-2e-05,3.8e-05,5.2e-05,5.1e-05,-2e-06,4e-06,-1.7e-05,-5e-06,3.4e-05,-2.6e-05,-1e-05,5e-06,2e-06,1.8e-05,-3.5e-05,1.9e-05,5.5e-05,3e-05,-1e-05,-5e-06,-1.2e-05,2.5e-05,-1.1e-05,1.9e-05,-1.3e-05,-3e-06,-3e-05,4e-06,-1.9e-05,3e-06,2.4e-05,7e-06,1.5e-05,-3e-06,1.7e-05,6.1e-05,4.2e-05,3.1e-05,-1.2e-05,1e-05,-7e-06,-1e-05,-2.2e-05,-2e-06,2.4e-05,8.1e-05,-7e-06,9e-06,2.7e-05,3.2e-05,-2.7e-05,5e-05,-3.6e-05,1.9e-05,-1e-06,6.3e-05,3e-06,3.9e-05,4e-05,-4e-05,-3.2e-05,2.2e-05,2.7e-05,1.3e-05,-1.7e-05,5.6e-05,2.2e-05,4e-06,1.7e-05,-2e-06,-7e-06,-1.2e-05,-3e-05,-5.3e-05,5e-06,2.6e-05,-2e-06,-1.3e-05,-1.7e-05,1.9e-05,-2.5e-05,-1.8e-05,3e-06,-1e-06,-1.3e-05,4.5e-05,2.8e-05,1.8e-05,-4e-05,-1.5e-05,2.3e-05,5.9e-05,-8e-06,-2e-06,3.4e-05,3.8e-05,9e-06,-1e-06,5e-06,-6e-06,9e-06,-3.4e-05,-2.7e-05,8e-06,7e-05,-9e-06,-3.3e-05,2.2e-05,-2e-06,4e-05,2.9e-05,-4e-05,-1.3e-05,5.2e-05,2.2e-05
-3.1e-05,-3.4e-05,-2.8e-05,-5.6e-05,-1.7e-05,-8e-06,2.3e-05,-1.2e-05,-3.4e-05,0,-1.8e-05,6e-06,1.2e-05,-1.5e-05,1.7e-05,9e-06,-2.2e-05,2.1e-05,1.5e-05,-8e-05,2.9e-05,7e-06,-2.9e-05,8e-06,3.1e-05,-2e-06,-2.3e-05,1.7e-05,2e-06,-3e-05,4.2e-05,4.2e-05,-1.3e-05,-3e-06,6e-06,-1e-06,-2.4e-05,-1.4e-05,-1.8e-05,3.2e-05,-1.9e-05,-5.5e-05,-6.1e-05,-1.7e-05,-9e-06,-1.6e-05,9e-06,2e-05,4e-06,-3.2e-05,-3e-05,-4.6e-05,3e-06,8e-06,-4.2e-05,-8.1e-05,-3e-06,-4.4e-05,-3e-06,-3.7e-05,-1.5e-05,-6e-05,-1.9e-05,-1.1e-05,-1.1e-05,3e-05,4e-06,-1.9e-05,-6e-06,-2.3e-05,6e-06,-1.7e-05,-4.5e-05,-8e-06,-3e-06,-1e-06,9e-06,1.9e-05,-1.6e-05,2e-05,1e-05,-4.1e-05,5e-06,-1.3e-05,2.2e-05,1e-06,-5.3e-05,1e-05,-7e-06,-1.5e-05,1.4e-05,-1.2e-05,-3.1e-05,-1.4e-05,6e-06,1.6e-05,-1e-05,-3.6e-05,-1.2e-05,-2.9e-05,-4.1e-05,-3.4e-05,-1.9e-05,-4e-06,-3.3e-05,0,-1.2e-05,-8e-06,3e-06,-3.7e-05,0,-8e-06,3e-05,-2.8e-05,-2.3e-05,-3e-05,-1.7e-05,1.5e-05,-8e-06,2e-05,-1.6e-05
2.2e-05,-1.1e-05,3.9e-05,3e-06,3e-06,-1.4e-05,-7.8e-05,2e-05,6e-06,-1.9e-05,-1e-06,1.8e-05,-1.2e-05,-9e-06,-2.1e-05,-2e-05,3.2e-05,-1e-06,-7e-06,2.7e-05,-8e-06,-9e-06,9e-06,-1.9e-05,-2.3e-05,-3.9e-05,-4e-06,-4e-05,-2.9e-05,3e-06,-1.4e-05,-2e-05,-7e-06,7e-06,-7e-06,5e-06,9e-06,-7e-06,5e-06,-2.6e-05,1e-06,3e-05,3e-06,-9e-06,5e-06,1e-06,-6e-06,-5.1e-05,-1.4e-05,1.5e-05,-9e-06,2.3e-05,-3.6e-05,-1.3e-05,2.4e-05,7e-06,7e-06,3.1e-05,-2.2e-05,3e-06,-3e-06,7e-06,2e-06,-1e-06,1e-05,-2.3e-05,1.2e-05,-9e-06,1.1e-05,-2.2e-05,-8e-06,-1.4e-05,1.5e-05,-1.7e-05,-1e-06,-2.9e-05,-1.7e-05,-1.5e-05,-1.8e-05,-1.5e-05,-5e-06,-1.1e-05,-8e-06,1.5e-05,-1.3e-05,-3e-06,4.3e-05,3e-06,-3e-06,4e-06,-7e-06,-2.8e-05,2.2e-05,-8e-06,-4e-06,-5e-06,-4.3e-05,4e-06,2.2e-05,9e-06,2.8e-05,1.6e-05,1e-05,-1e-06,-1.8e-05,-3.6e-05,2.6e-05,-4e-06,-1e-05,2.1e-05,1.7e-05,-1.2e-05,-7e-06,9e-06,9e-06,4e-06,3e-06,-3.1e-05,-7e-06,-5e-05,-5e-06
-1e-05,8e-06,2e-06,-5e-06,6e-06,9e-06,3.8e-05,-2e-06,-2.3e-05,2e-06,-2.2e-05,-2.8e-05,1.1e-05,7e-06,-1e-06,6e-06,-2.2e-05,-1.3e-05,-7e-06,1.5e-05,-5e-06,5e-06,-8e-06,-2.2e-05,-2e-06,7e-06,-1.2e-05,2e-05,1.7e-05,5e-06,-2.7e-05,1.2e-05,-6e-06,-2.1e-05,-1.2e-05,-2e-06,-8e-06,-1e-06,4e-06,2.3e-05,-1e-06,-2.2e-05,-8e-06,-8e-06,-3e-06,-8e-06,0,2e-05,-9e-06,-2.6e-05,1.9e-05,-7e-06,8e-06,9e-06,6e-06,2e-05,-7e-06,-1.2e-05,2.6e-05,1e-05,1.2e-05,-2.2e-05,-2e-06,-3.1e-05,-2.1e-05,7e-06,2e-06,7e-06,-2.2e-05,-1.5e-05,2.3e-05,4e-06,-2.2e-05,-9e-06,7e-06,4e-06,-2.2e-05,1.7e-05,6e-06,5e-06,1e-05,-7e-06,1.3e-05,-2e-05,-7e-06,-5e-06,-1.9e-05,4e-06,-7e-06,-1e-06,2e-06,-1.7e-05,-3.3e-05,9e-06,-1.8e-05,8e-06,4e-06,-1.5e-05,-3e-05,1.1e-05,-1.3e-05,-3e-06,-2.3e-05,2e-06,-2e-06,-4e-06,-1e-05,1.5e-05,-7e-06,-1.6e-05,-1.9e-05,-5e-06,-1e-05,0,-3e-06,-2.9e-05,1e-06,2e-05,1.7e-05,6e-06,8e-06
1.4e-05,1.1e-05,-1.2e-05,-1.3e-05,-3e-06,-4e-06,-8e-06,-1.8e-05,1.5e-05,-5e-06,7e-06,5e-06,-1.6e-05,1e-06,5e-06,2.4e-05,-4e-06,-5e-06,-4e-06,-7e-06,2.3e-05,-1.1e-05,2e-06,7e-06,-1.4e-05,-1e-06,1e-06,3e-06,-6e-06,2e-05,2.9e-05,5e-06,-1.5e-05,1.1e-05,2.7e-05,4e-06,7e-06,1.4e-05,1.6e-05,-9e-06,-9e-06,-2e-06,2.4e-05,-3e-06,-6e-06,3e-06,3e-06,-9e-06,1.7e-05,2e-05,-2e-06,-2.8e-05,7e-06,1e-06,-2e-06,-7e-06,-6e-06,-5e-06,-2e-05,-1.5e-05,-6e-06,1.1e-05,2e-06,1.9e-05,-9e-06,-7e-06,-1.2e-05,0,5e-06,2e-05,-8e-06,7e-06,-4e-06,1.9e-05,-1e-06,-3e-06,3e-05,5e-06,1.9e-05,-1.4e-05,4e-06,6e-06,1e-06,1.4e-05,-9e-06,-1e-05,-1.2e-05,7e-06,-1e-06,-1.1e-05,8e-06,8e-06,-2e-06,4e-06,7e-06,1e-05,6e-06,-5e-06,7e-06,-3e-06,1.4e-05,-5e-06,1e-05,1e-05,7e-06,1.3e-05,1e-05,-8e-06,1.7e-05,-1e-06,1e-06,1.3e-05,1.5e-05,-1.3e-05,3e-06,8e-06,-4e-06,-1.2e-05,-1.4e-05,5e-06,-8e-06
-1.1e-05,1.1e-05,-1.1e-05,-3e-06,2e-06,1.2e-05,-3e-06,1.6e-05,9e-06,-1.1e-05,6e-06,2e-06,1.3e-05,-7e-06,-1e-06,-7e-06,-7e-06,8e-06,3e-06,6e-06,-1.4e-05,1.1e-05,2e-06,1.7e-05,1e-05,2.4e-05,6e-06,-3e-05,6e-06,2e-06,-1.3e-05,-1.6e-05,-1e-06,-4e-06,-2.2e-05,-6e-06,-1.3e-05,-3e-06,-3e-06,3e-06,4e-06,0,1e-06,4e-06,1e-05,6e-06,3e-06,-3e-06,-1e-05,-1e-05,-4e-06,2.9e-05,-1e-05,0,-9e-06,1.7e-05,1.1e-05,1e-05,1.2e-05,3e-06,8e-06,-1e-06,6e-06,-1.8e-05,-3e-06,2e-06,6e-06,-1.6e-05,-1e-05,-1.2e-05,5e-06,-8e-06,1.3e-05,-1.3e-05,3e-06,2e-06,-6e-06,-3e-06,5e-06,1.7e-05,-1.1e-05,1.3e-05,0,5e-06,2e-06,-6e-06,1.1e-05,-5e-06,2e-06,1.9e-05,-1.2e-05,5e-06,3e-06,1e-06,-1e-06,0,-1e-06,1e-05,-3e-06,-4e-06,-1e-05,2e-06,-7e-06,-6e-06,3e-06,0,-1e-06,7e-06,9e-06,1.9e-05,7e-06,1.8e-05,1e-06,-3e-06,-6e-06,1e-06,8e-06,-1e-06,2e-06,-2.2e-05,-7e-06
3e-06,-2.2e-05,5e-06,-1.2e-05,5e-06,-7e-06,-8e-06,-1.4e-05,3e-06,5e-06,-1.3e-05,1.3e-05,-4e-06,-2e-06,-7e-06,1e-06,0,6e-06,-2e-06,1.5e-05,0,-7e-06,2e-06,-6e-06,-4e-06,-6e-06,-1e-06,1.5e-05,-4e-06,-1.2e-05,-7e-06,1.5e-05,7e-06,3e-06,1.2e-05,-4e-06,8e-06,-4e-06,5e-06,-1e-06,6e-06,5e-06,4e-06,-5e-06,-5e-06,-1.1e-05,-1e-06,2e-06,1e-05,5e-06,-5e-06,-1e-06,1.2e-05,-5e-06,-4e-06,-1.5e-05,1e-06,1e-05,1e-05,2e-06,-4e-06,-7e-06,-1e-06,0,6e-06,-7e-06,8e-06,1.2e-05,-1e-06,6e-06,2e-06,-5e-06,9e-06,1.1e-05,-1e-06,-2e-06,-2e-06,8e-06,0,-1.3e-05,3e-06,6e-06,1e-06,6e-06,2e-06,9e-06,7e-06,3e-06,-6e-06,-9e-06,1.3e-05,5e-06,9e-06,-4e-06,0,1e-06,6e-06,3e-06,-3e-06,3e-06,6e-06,3e-06,3e-06,3e-06,-5e-06,0,-5e-06,1e-06,-1.4e-05,-1.2e-05,0,-6e-06,-1e-06,7e-06,9e-06,9e-06,-6e-06,6e-06,-1e-06,2e-05,-1e-05
2e-06,8e-06,-1.1e-05,2.4e-05,-6e-06,1.6e-05,4e-06,7e-06,-3e-06,1e-06,1.7e-05,-1.1e-05,-2e-06,1e-05,5e-06,-6e-06,-3e-06,-7e-06,1e-06,-1.6e-05,-1e-06,6e-06,-8e-06,-1e-06,6e-06,-7e-06,2e-06,2e-06,2e-06,-1e-06,5e-06,-1.2e-05,-4e-06,-1e-06,1e-06,0,5e-06,-6e-06,-2e-06,-6e-06,-1.2e-05,7e-06,2e-06,-8e-06,-3e-06,5e-06,0,3e-06,-4e-06,-3e-06,2e-06,-1.2e-05,-2e-06,-2e-06,0,8e-06,0,-2e-06,-6e-06,3e-06,4e-06,8e-06,-3e-06,1.2e-05,-4e-06,6e-06,-3e-06,-3e-06,7e-06,-2e-06,6e-06,1e-05,0,3e-06,-4e-06,7e-06,4e-06,-1.1e-05,-7e-06,1e-06,7e-06,7e-06,0,-5e-06,-1e-06,0,2e-06,0,3e-06,4e-06,-9e-06,7e-06,7e-06,-8e-06,5e-06,-3e-06,-2e-06,-5e-06,2e-06,2e-06,0,-4e-06,0,1e-06,0,3e-06,-6e-06,-8e-06,6e-06,8e-06,-9e-06,-1e-06,-2e-06,-2e-06,-2e-06,-1.2e-05,0,4e-06,1e-06,-9e-06,8e-06
-2e-06,-2e-06,8e-06,-2e-06,4e-06,-1.7e-05,5e-06,-4e-06,6e-06,1e-05,-1e-06,5e-06,3e-06,0,4e-06,-2e-06,0,1e-06,0,5e-06,-2e-06,-2e-06,1.1e-05,3e-06,-7e-06,-3e-06,0,-1e-06,-4e-06,7e-06,2e-06,1.3e-05,3e-06,-2e-06,2e-06,-2e-06,-5e-06,0,0,9e-06,7e-06,-5e-06,5e-06,9e-06,1e-06,2e-06,0,-4e-06,-1e-06,2e-06,8e-06,1.3e-05,4e-06,-1e-06,7e-06,7e-06,-2e-06,8e-06,3e-06,0,-7e-06,-9e-06,1e-06,-3e-06,3e-06,-1e-06,-5e-06,-4e-06,3e-06,3e-06,-6e-06,-2e-06,-9e-06,-4e-06,3e-06,4e-06,3e-06,-1e-06,2e-06,0,-1e-06,0,1e-06,1e-06,-1e-06,1e-06,-1e-06,1e-06,-3e-06,0,-5e-06,-3e-06,-8e-06,3e-06,-3e-06,-5e-06,2e-06,3e-06,-5e-06,-4e-06,-2e-06,5e-06,1e-06,1e-06,-5e-06,7e-06,-1e-06,-7e-06,2e-06,-3e-06,-9e-06,-1e-06,1e-06,-4e-06,3e-06,4e-06,4e-06,-6e-06,0,5e-06,2e-06
3e-06,-1e-06,3e-06,0,5e-06,8e-06,-1e-06,-1e-06,-7e-06,-7e-06,-5e-06,-3e-06,0,-4e-06,-1e-06,2e-06,8e-06,-1e-06,2e-06,1e-06,-2e-06,-2e-06,-1e-05,2e-06,3e-06,-1.1e-05,3e-06,2e-06,-1e-06,-6e-06,-4e-06,4e-06,3e-06,-1e-06,-2e-06,3e-06,0,-1e-06,-2e-06,-3e-06,1e-06,9e-06,-1e-05,-3e-06,1e-06,-4e-06,0,5e-06,1e-06,-6e-06,-5e-06,-1e-06,-1e-06,0,-2e-06,-3e-06,-1e-06,-2e-06,3e-06,-1e-06,-3e-06,7e-06,1e-06,-1e-06,3e-06,-1e-06,1e-06,4e-06,0,1e-06,-3e-06,-2e-06,2e-06,-1e-06,-1e-06,4e-06,-5e-06,-1e-06,-2e-06,-2e-06,0,0,-1e-06,-3e-06,-3e-06,3e-06,-2e-06,-6e-06,-1e-06,2e-06,8e-06,-9e-06,4e-06,2e-06,3e-06,2e-06,-1e-06,-3e-06,-1e-06,2e-06,3e-06,-1e-06,-1e-06,-2e-06,-3e-06,-3e-06,-6e-06,2e-06,-7e-06,2e-06,9e-06,-4e-06,0,4e-06,-5e-06,5e-06,-4e-06,-3e-06,-1e-06,1e-06,-4e-06
-5e-06,6e-06,5e-06,-3e-06,-7e-06,2e-06,0,8e-06,4e-06,-3e-06,1e-06,6e-06,-2e-06,-1e-06,-1e-06,-2e-06,-4e-06,1e-06,-3e-06,-1e-06,3e-06,-2e-06,6e-06,-2e-06,1e-06,3e-06,-1e-06,2e-06,-2e-06,-5e-06,6e-06,-4e-06,-1e-06,-3e-06,-1e-06,0,-4e-06,0,0,-1e-06,-6e-06,-1.2e-05,-2e-06,-5e-06,-1e-06,1e-06,-4e-06,3e-06,-5e-06,5e-06,-3e-06,-3e-06,0,0,-2e-06,-8e-06,-3e-06,0,-3e-06,-1e-06,-4e-06,-2e-06,-1e-06,-5e-06,2e-06,0,4e-06,-2e-06,-2e-06,1e-06,1e-06,6e-06,-8e-06,-1e-06,-1e-06,-5e-06,1e-06,-4e-06,2e-06,1e-06,-1e-06,-1e-06,1e-06,3e-06,4e-06,-4e-06,0,4e-06,-1e-06,-5e-06,-4e-06,-9e-06,-2e-06,-6e-06,1e-06,-7e-06,-8e-06,4e-06,1e-06,-3e-06,-3e-06,-4e-06,-2e-06,1e-06,-5e-06,-2e-06,4e-06,4e-06,3e-06,0,7e-06,1e-06,-2e-06,-5e-06,4e-06,3e-06,4e-06,1e-06,1e-06,-8e-06,3e-06
6e-06,-2e-06,-1e-06,7e-06,-1e-06,-6e-06,0,-5e-06,-4e-06,-3e-06,-4e-06,-6e-06,2e-06,6e-06,-1e-06,1e-06,7e-06,2e-06,1e-06,6e-06,0,2e-06,-4e-06,-9e-06,1e-06,3e-06,2e-06,0,3e-06,3e-06,-8e-06,3e-06,1e-06,4e-06,2e-06,3e-06,2e-06,1e-06,0,3e-06,3e-06,5e-06,0,4e-06,2e-06,-1e-06,0,-4e-06,2e-06,-4e-06,0,-4e-06,1e-06,0,-3e-06,4e-06,-2e-06,1e-06,-3e-06,0,4e-06,1e-06,0,3e-06,-2e-06,-3e-06,-3e-06,0,-3e-06,2e-06,2e-06,-3e-06,-2e-06,-1e-06,3e-06,2e-06,1e-06,4e-06,4e-06,-4e-06,0,-5e-06,0,0,-1e-06,-3e-06,0,-3e-06,1e-06,1e-06,-1e-06,3e-06,7e-06,-3e-06,-3e-06,5e-06,-3e-06,-8e-06,2e-06,2e-06,5e-06,3e-06,1e-06,1e-06,3e-06,-4e-06,-1e-06,0,1e-06,-3e-06,1e-06,1e-06,0,1e-06,-1e-06,-1e-05,-4e-06,2e-06,0,-3e-06,-5e-06
-5e-06,-2e-06,0,-3e-06,4e-06,5e-06,3e-06,2e-06,2e-06,-3e-06,5e-06,3e-06,0,-2e-06,-1e-06,-2e-06,-4e-06,-2e-06,-1e-06,-5e-06,-1e-06,1e-06,4e-06,7e-06,-3e-06,4e-06,1e-06,-4e-06,-1e-06,6e-06,5e-06,-2e-06,2e-06,-3e-06,-2e-06,-1e-06,-1e-06,-1e-06,2e-06,-2e-06,1e-06,-6e-06,3e-06,2e-06,0,-1e-06,2e-06,2e-06,-1e-06,2e-06,3e-06,0,0,0,0,-4e-06,0,5e-06,-3e-06,-1e-06,2e-06,3e-06,1e-06,-5e-06,0,2e-06,-2e-06,0,-3e-06,2e-06,-5e-06,-3e-06,8e-06,5e-06,0,-3e-06,-2e-06,-1e-06,-2e-06,4e-06,-1e-06,0,0,1e-06,2e-06,2e-06,-5e-06,-1e-06,-1e-06,3e-06,3e-06,7e-06,-1e-06,3e-06,3e-06,-4e-06,6e-06,5e-06,-2e-06,0,-2e-06,1e-06,-2e-06,0,-2e-06,0,1e-06,-3e-06,-2e-06,4e-06,-7e-06,0,1e-06,-1e-06,-4e-06,1e-06,1e-06,-1e-06,0,4e-06,1e-06
4e-06,-1e-06,-4e-06,-6e-06,-4e-06,-3e-06,-2e-06,-3e-06,-2e-06,4e-06,2e-06,-1e-06,-2e-06,0,1e-06,-1e-06,-1e-06,-1e-06,0,-1e-06,3e-06,-3e-06,-2e-06,4e-06,2e-06,0,-1e-06,3e-06,1e-06,-2e-06,-4e-06,5e-06,-1e-06,4e-06,2e-06,-2e-06,-1e-06,0,-2e-06,0,-2e-06,4e-06,-3e-06,-5e-06,-1e-06,2e-06,-2e-06,-5e-06,2e-06,-4e-06,0,2e-06,-1e-06,0,0,3e-06,0,-2e-06,3e-06,0,0,-3e-06,0,4e-06,-2e-06,-1e-06,4e-06,-1e-06,0,-3e-06,1e-06,0,2e-06,-4e-06,-1e-06,0,1e-06,3e-06,-3e-06,-2e-06,-5e-06,-2e-06,0,2e-06,-3e-06,-1e-06,-1e-06,1e-06,1e-06,-4e-06,-3e-06,2e-06,2e-06,1e-06,-2e-06,4e-06,2e-06,-2e-06,3e-06,-1e-06,1e-06,-5e-06,0,0,0,-2e-06,6e-06,0,1e-06,-5e-06,0,0,0,0,4e-06,6e-06,0,-2e-06,-1e-06,0,1e-06
-3e-06,0,-1e-06,2e-06,0,0,0,0,3e-06,2e-06,-3e-06,3e-06,2e-06,-3e-06,-1e-06,1e-06,-1e-06,0,1e-06,1e-06,-2e-06,1e-06,-1e-06,0,-1e-06,-5e-06,0,0,-3e-06,-4e-06,0,-7e-06,-1e-06,-3e-06,-2e-06,0,3e-06,-1e-06,0,-2e-06,0,4e-06,1e-06,4e-06,1e-06,0,1e-06,3e-06,1e-06,3e-06,-3e-06,0,0,0,4e-06,-5e-06,-3e-06,1e-06,-2e-06,3e-06,2e-06,2e-06,-1e-06,5e-06,3e-06,1e-06,0,1e-06,3e-06,3e-06,3e-06,0,1e-06,1e-06,1e-06,-4e-06,2e-06,2e-06,-1e-06,-1e-06,1e-06,-1e-06,0,-2e-06,1e-06,0,5e-06,-2e-06,1e-06,2e-06,2e-06,0,0,-1e-06,-1e-06,1e-06,-2e-06,0,0,-2e-06,0,2e-06,0,0,-4e-06,-3e-06,-3e-06,1e-06,0,4e-06,1e-06,0,0,0,-2e-06,2e-06,-1e-06,4e-06,1e-06,-1e-06,0
1e-06,2e-06,-1e-06,2e-06,1e-06,2e-06,-3e-06,0,-3e-06,3e-06,1e-06,-5e-06,-1e-06,4e-06,1e-06,0,0,2e-06,1e-06,-1e-06,1e-06,0,2e-06,-5e-06,-1e-06,0,-1e-06,-4e-06,0,1e-06,3e-06,3e-06,1e-06,2e-06,0,-2e-06,2e-06,1e-06,2e-06,1e-06,3e-06,-3e-06,2e-06,0,-1e-06,-1e-06,1e-06,-1e-06,-1e-06,-3e-06,2e-06,2e-06,0,1e-06,-2e-06,4e-06,1e-06,2e-06,0,1e-06,0,-2e-06,-1e-06,0,-1e-06,-1e-06,-2e-06,0,2e-06,-3e-06,0,-2e-06,-5e-06,1e-06,-1e-06,1e-06,-1e-06,-2e-06,3e-06,0,1e-06,-1e-06,0,-2e-06,-1e-06,3e-06,-3e-06,1e-06,0,0,-1e-06,-3e-06,-2e-06,0,2e-06,2e-06,-1e-06,2e-06,-3e-06,4e-06,0,1e-06,-1e-06,1e-06,1e-06,-1e-06,2e-06,-1e-06,0,-2e-06,2e-06,-1e-06,1e-06,2e-06,2e-06,-6e-06,2e-06,-2e-06,-1e-06,0,1e-06
1e-06,-1e-06,1e-06,-1e-06,-3e-06,-4e-06,2e-06,0,2e-06,2e-06,1e-06,3e-06,0,-1e-06,2e-06,2e-06,-4e-06,0,-1e-06,0,-1e-06,1e-06,-1e-06,0,1e-06,-3e-06,1e-06,5e-06,1e-06,5e-06,-4e-06,0,-3e-06,-2e-06,1e-06,0,0,1e-06,0,1e-06,-3e-06,4e-06,1e-06,-4e-06,0,1e-06,0,-2e-06,1e-06,3e-06,2e-06,-3e-06,-1e-06,-1e-06,-2e-06,0,1e-06,-1e-06,0,-1e-06,0,1e-06,1e-06,1e-06,-1e-06,1e-06,1e-06,-1e-06,1e-06,1e-06,-3e-06,0,1e-06,-3e-06,0,-1e-06,-1e-06,0,1e-06,1e-06,-2e-06,1e-06,-1e-06,0,1e-06,-2e-06,-1e-06,-1e-06,0,-1e-06,-1e-06,-2e-06,2e-06,1e-06,-2e-06,0,-2e-06,-1e-06,3e-06,-2e-06,0,-2e-06,1e-06,-1e-06,-2e-06,0,0,0,0,-2e-06,-5e-06,0,-1e-06,-2e-06,-2e-06,-1e-06,-4e-06,0,1e-06,1e-06,-1e-06
-2e-06,2e-06,2e-06,-5e-06,0,4e-06,-1e-06,2e-06,-1e-06,-3e-06,-4e-06,0,0,-2e-06,0,0,3e-06,-1e-06,1e-06,3e-06,-1e-06,-2e-06,-1e-06,3e-06,1e-06,4e-06,0,-2e-06,0,-1e-06,2e-06,1e-06,-2e-06,2e-06,0,0,-2e-06,0,-2e-06,-2e-06,1e-06,-7e-06,0,2e-06,0,0,-2e-06,0,-2e-06,-2e-06,-2e-06,1e-06,2e-06,0,-1e-06,5e-06,-1e-06,-1e-06,2e-06,0,-3e-06,-1e-06,0,-1e-06,-1e-06,-1e-06,0,3e-06,-1e-06,-1e-06,1e-06,1e-06,-1e-06,1e-06,0,1e-06,-1e-06,-2e-06,1e-06,-1e-06,-1e-06,2e-06,0,2e-06,-1e-06,-3e-06,5e-06,0,0,1e-06,2e-06,-2e-06,-2e-06,3e-06,1e-06,-1e-06,-1e-06,1e-06,-1e-06,0,-1e-06,1e-06,-1e-06,0,-1e-06,2e-06,-4e-06,2e-06,-1e-06,3e-06,0,0,0,2e-06,2e-06,4e-06,2e-06,-1e-06,0,0,2e-06
2e-06,-2e-06,1e-06,2e-06,1e-06,-1e-06,-2e-06,-2e-06,1e-06,-1e-06,2e-06,2e-06,0,0,-2e-06,-1e-06,-2e-06,0,-1e-06,-2e-06,0,2e-06,2e-06,1e-06,0,3e-06,0,-1e-06,0,-4e-06,1e-06,2e-06,1e-06,-2e-06,0,1e-06,2e-06,0,0,1e-06,1e-06,3e-06,-1e-06,0,0,-1e-06,1e-06,1e-06,1e-06,2e-06,-1e-06,1e-06,-1e-06,-1e-06,1e-06,-6e-06,-1e-06,1e-06,-1e-06,-1e-06,0,0,-1e-06,0,1e-06,1e-06,0,-2e-06,-3e-06,-1e-06,2e-06,-1e-06,-2e-06,1e-06,0,0,1e-06,-1e-06,0,0,0,0,0,0,0,1e-06,-1e-06,0,0,-1e-06,-2e-06,1e-06,2e-06,0,0,0,0,0,0,0,3e-06,0,0,0,-2e-06,-1e-06,1e-06,0,2e-06,-3e-06,2e-06,0,0,0,-1e-06,1e-06,0,2e-06,0,-2e-06,-2e-06
-2e-06,-2e-06,-1e-06,2e-06,-2e-06,-2e-06,0,1e-06,-1e-06,-3e-06,-1e-06,-3e-06,0,2e-06,-1e-06,0,1e-06,1e-06,-1e-06,-1e-06,-1e-06,-1e-06,-2e-06,-3e-06,-1e-06,-1e-06,0,3e-06,0,1e-06,-2e-06,-3e-06,-2e-06,2e-06,-1e-06,0,-2e-06,0,1e-06,1e-06,-2e-06,-5e-06,1e-06,-2e-06,0,1e-06,0,-1e-06,-1e-06,-2e-06,0,-5e-06,1e-06,0,2e-06,4e-06,0,-1e-06,1e-06,0,-1e-06,1e-06,0,-3e-06,0,0,-1e-06,1e-06,-1e-06,1e-06,-2e-06,1e-06,5e-06,-1e-06,1e-06,2e-06,0,0,-2e-06,0,-1e-06,1e-06,0,1e-06,0,-1e-06,-1e-06,0,0,2e-06,0,3e-06,0,-2e-06,-1e-06,-2e-06,1e-06,0,1e-06,1e-06,-1e-06,-2e-06,-1e-06,0,0,1e-06,-1e-06,-1e-06,-1e-06,2e-06,5e-06,0,0,0,-1e-06,-3e-06,0,-1e-06,0,1e-06,0
3e-06,2e-06,0,-2e-06,0,4e-06,0,-1e-06,1e-06,1e-06,0,2e-06,1e-06,1e-06,1e-06,-1e-06,0,0,0,0,1e-06,0,1e-06,0,1e-06,2e-06,0,-2e-06,0,2e-06,0,3e-06,-1e-06,-1e-06,1e-06,0,0,0,0,-1e-06,2e-06,2e-06,-1e-06,1e-06,0,-1e-06,-2e-06,1e-06,1e-06,1e-06,2e-06,5e-06,1e-06,0,0,-1e-06,0,-1e-06,-1e-06,0,1e-06,-2e-06,0,2e-06,0,-1e-06,0,0,0,-1e-06,-1e-06,1e-06,1e-06,2e-06,0,1e-06,-1e-06,-1e-06,-1e-06,0,-1e-06,0,0,-1e-06,0,-1e-06,0,0,0,-1e-06,1e-06,3e-06,0,1e-06,2e-06,0,1e-06,0,-1e-06,-1e-06,0,1e-06,0,0,-1e-06,0,-1e-06,-1e-06,-1e-06,-1e-06,-1e-06,-1e-06,0,0,0,-1e-06,1e-06,0,0,1e-06,1e-06
-2e-06,0,-1e-06,-1e-06,1e-06,-4e-06,0,0,-1e-06,3e-06,3e-06,0,-1e-06,-2e-06,1e-06,-1e-06,1e-06,0,0,0,0,0,-1e-06,3e-06,-1e-06,-3e-06,0,0,0,-1e-06,1e-06,-1e-06,1e-06,1e-06,-1e-06,0,0,0,-1e-06,0,0,2e-06,0,0,0,0,0,-1e-06,0,-2e-06,0,0,-1e-06,0,-1e-06,2e-06,-1e-06,2e-06,2e-06,1e-06,-1e-06,1e-06,0,1e-06,-1e-06,0,1e-06,0,1e-06,0,2e-06,-1e-06,0,-2e-06,0,1e-06,1e-06,2e-06,0,-1e-06,-1e-06,0,0,1e-06,0,2e-06,1e-06,1e-06,0,1e-06,-2e-06,-1e-06,1e-06,1e-06,-1e-06,-1e-06,0,-1e-06,0,2e-06,0,0,0,0,-1e-06,1e-06,3e-06,1e-06,2e-06,1e-06,-2e-06,0,0,1e-06,0,3e-06,-2e-06,0,0,0,-2e-06
1e-06,1e-06,-1e-06,2e-06,-1e-06,3e-06,0,0,2e-06,0,-3e-06,1e-06,0,1e-06,0,1e-06,-2e-06,0,0,1e-06,0,1e-06,1e-06,1e-06,0,1e-06,0,1e-06,0,-2e-06,-2e-06,0,0,0,0,-1e-06,1e-06,0,0,0,-1e-06,-1e-06,-2e-06,-1e-06,0,1e-06,1e-06,0,0,1e-06,-1e-06,-3e-06,1e-06,0,-1e-06,-5e-06,-1e-06,-1e-06,-2e-06,0,1e-06,-1e-06,0,-1e-06,0,0,-1e-06,-1e-06,2e-06,1e-06,0,0,-4e-06,0,0,0,0,1e-06,1e-06,0,1e-06,0,0,-2e-06,0,0,-1e-06,-1e-06,0,-1e-06,1e-06,-3e-06,-2e-06,-1e-06,0,-1e-06,-1e-06,2e-06,1e-06,-2e-06,0,-1e-06,0,0,-1e-06,-1e-06,-1e-06,0,-1e-06,0,-1e-06,0,0,-1e-06,0,1e-06,2e-06,1e-06,0,1e-06,1e-06
-1e-06,-1e-06,0,2e-06,0,-2e-06,1e-06,0,-1e-06,1e-06,0,-2e-06,0,0,0,0,0,-1e-06,1e-06,0,0,0,-1e-06,-2e-06,-1e-06,1e-06,0,0,0,0,2e-06,-1e-06,-1e-06,0,0,0,1e-06,0,0,1e-06,1e-06,3e-06,2e-06,2e-06,0,0,-1e-06,1e-06,1e-06,-1e-06,0,5e-06,0,0,0,3e-06,1e-06,-1e-06,0,0,1e-06,0,0,1e-06,1e-06,0,-1e-06,1e-06,1e-06,-1e-06,-1e-06,1e-06,0,1e-06,0,0,-1e-06,0,0,0,0,-1e-06,0,1e-06,0,-1e-06,-1e-06,0,0,1e-06,0,-2e-06,2e-06,0,1e-06,1e-06,-2e-06,-1e-06,-1e-06,1e-06,0,1e-06,0,0,0,0,2e-06,0,-1e-06,-1e-06,2e-06,0,0,1e-06,-1e-06,-2e-06,-1e-06,-1e-06,0,-2e-06,0
0,-1e-06,1e-06,-1e-06,1e-06,1e-06,0,1e-06,0,-2e-06,2e-06,1e-06,0,1e-06,0,0,0,0,0,0,0,-1e-06,-1e-06,-2e-06,1e-06,0,0,0,1e-06,2e-06,-2e-06,1e-06,2e-06,0,0,0,-1e-06,0,0,-1e-06,0,-4e-06,-1e-06,-1e-06,0,0,0,-1e-06,-1e-06,2e-06,0,-3e-06,0,0,1e-06,-3e-06,-1e-06,0,0,-1e-06,0,1e-06,0,-1e-06,1e-06,0,1e-06,-1e-06,0,2e-06,0,-1e-06,1e-06,-2e-06,0,-1e-06,0,1e-06,0,-1e-06,-1e-06,0,0,0,0,1e-06,1e-06,1e-06,0,0,-1e-06,1e-06,-2e-06,0,-1e-06,-1e-06,0,0,0,-1e-06,0,0,0,0,-1e-06,-1e-06,0,0,2e-06,1e-06,0,0,0,0,1e-06,-1e-06,1e-06,1e-06,0,1e-06,0
0,0,0,-1e-06,-1e-06,1e-06,0,-1e-06,-1e-06,-2e-06,-2e-06,-1e-06,0,-2e-06,1e-06,0,-1e-06,0,0,-1e-06,0,1e-06,1e-06,2e-06,-1e-06,1e-06,0,0,0,0,1e-06,1e-06,1e-06,0,0,-1e-06,1e-06,0,0,0,-1e-06,2e-06,1e-06,-1e-06,0,0,1e-06,0,1e-06,-1e-06,0,-2e-06,0,0,0,4e-06,-1e-06,0,0,0,0,-1e-06,0,-1e-06,-1e-06,0,0,1e-06,-2e-06,0,1e-06,0,-2e-06,1e-06,0,-1e-06,0,-1e-06,0,0,0,0,0,1e-06,0,-1e-06,1e-06,0,0,-1e-06,1e-06,2e-06,2e-06,1e-06,0,2e-06,1e-06,0,1e-06,1e-06,2e-06,-1e-06,0,0,-1e-06,-1e-06,-1e-06,0,-1e-06,-2e-06,-3e-06,0,0,-1e-06,0,2e-06,0,0,0,0,1e-06
-1e-06,-1e-06,1e-06,1e-06,0,-2e-06,0,1e-06,1e-06,0,1e-06,1e-06,0,1e-06,0,0,1e-06,0,0,0,0,0,0,2e-06,1e-06,-1e-06,0,1e-06,0,-2e-06,0,-2e-06,-1e-06,0,0,0,-1e-06,0,0,1e-06,1e-06,-3e-06,-1e-06,2e-06,0,0,0,0,-1e-06,1e-06,-1e-06,3e-06,0,0,-1e-06,-4e-06,0,-2e-06,0,0,-1e-06,1e-06,0,-1e-06,0,-1e-06,-1e-06,0,-1e-06,0,0,0,3e-06,0,0,-1e-06,-1e-06,-1e-06,-1e-06,0,0,0,0,-1e-06,0,-1e-06,0,0,0,1e-06,0,1e-06,-1e-06,0,0,0,-1e-06,-1e-06,-1e-06,-2e-06,0,1e-06,0,0,0,0,0,-1e-06,0,2e-06,-1e-06,0,0,1e-06,0,-1e-06,-1e-06,-1e-06,0,-1e-06,-1e-06
1e-06,1e-06,0,1e-06,1e-06,1e-06,0,-2e-06,-1e-06,0,1e-06,-1e-06,0,0,-1e-06,1e-06,-1e-06,-1e-06,0,0,0,0,0,-1e-06,0,0,0,-1e-06,0,0,-1e-06,1e-06,1e-06,0,1e-06,0,0,0,0,-1e-06,0,2e-06,2e-06,-1e-06,0,0,-1e-06,0,1e-06,-1e-06,0,-2e-06,0,0,-1e-06,3e-06,0,1e-06,0,0,0,0,0,1e-06,0,0,0,1e-06,0,1e-06,-1e-06,0,0,-1e-06,0,0,1e-06,-1e-06,0,0,0,0,0,0,0,1e-06,-1e-06,0,0,-1e-06,0,1e-06,1e-06,-1e-06,-1e-06,1e-06,0,1e-06,0,1e-06,0,0,0,0,-1e-06,-1e-06,-1e-06,0,1e-06,-1e-06,2e-06,0,0,0,-1e-06,0,1e-06,0,0,0,1e-06
-1e-06,-1e-06,0,-1e-06,0,-1e-06,0,1e-06,1e-06,2e-06,-1e-06,1e-06,0,1e-06,0,0,1e-06,0,0,-1e-06,0,0,0,-2e-06,1e-06,-1e-06,0,-1e-06,0,2e-06,1e-06,0,0,0,0,0,0,0,0,0,-1e-06,1e-06,-2e-06,-1e-06,0,0,0,0,0,1e-06,1e-06,0,0,0,0,-2e-06,0,-1e-06,0,0,-1e-06,1e-06,0,0,0,0,0,-1e-06,1e-06,-1e-06,1e-06,-1e-06,-1e-06,1e-06,0,0,1e-06,-1e-06,1e-06,0,0,0,0,0,0,0,1e-06,0,0,0,1e-06,-1e-06,0,0,1e-06,0,0,-1e-06,1e-06,-1e-06,0,-1e-06,0,0,0,0,-1e-06,1e-06,-1e-06,0,2e-06,0,0,0,1e-06,0,-1e-06,0,0,1e-06,0
1e-06,0,-1e-06,-1e-06,1e-06,0,0,0,-1e-06,1e-06,2e-06,-1e-06,0,-1e-06,1e-06,0,0,1e-06,0,1e-06,0,0,0,0,-1e-06,0,0,1e-06,0,-1e-06,-1e-06,0,-2e-06,0,0,0,0,0,0,0,1e-06,0,2e-06,2e-06,0,0,0,0,0,-1e-06,0,1e-06,0,0,1e-06,3e-06,0,-1e-06,0,0,1e-06,0,0,0,0,0,0,1e-06,1e-06,0,1e-06,1e-06,-2e-06,-1e-06,0,0,-1e-06,0,1e-06,0,0,0,0,1e-06,0,-1e-06,1e-06,0,0,1e-06,-1e-06,-2e-06,-1e-06,0,-1e-06,0,-2e-06,0,-1e-06,1e-06,0,1e-06,0,0,-1e-06,0,0,1e-06,0,1e-06,-1e-06,0,0,0,0,1e-06,0,1e-06,0,0,0
-1e-06,1e-06,0,2e-06,1e-06,1e-06,0,-1e-06,1e-06,0,-1e-06,0,0,1e-06,1e-06,0,0,0,0,0,0,-1e-06,0,2e-06,1e-06,1e-06,0,-1e-06,0,-1e-06,0,0,0,0,0,0,1e-06,0,0,0,0,2e-06,-2e-06,-1e-06,0,0,-1e-06,0,1e-06,1e-06,-1e-06,-1e-06,0,0,0,-4e-06,0,0,0,0,-1e-06,0,0,1e-06,0,0,0,0,0,0,-1e-06,0,0,0,0,0,0,0,0,0,1e-06,0,0,-1e-06,0,1e-06,-2e-06,0,0,-1e-06,0,-1e-06,1e-06,0,0,0,0,0,0,-1e-06,0,0,0,0,0,0,0,0,0,-1e-06,-2e-06,0,0,0,-1e-06,-1e-06,0,-1e-06,0,0,0
1e-06,-1e-06,0,0,0,-1e-06,0,2e-06,-1e-06,-1e-06,-1e-06,-1e-06,0,-1e-06,0,0,-1e-06,0,0,-1e-06,0,0,-1e-06,0,-1e-06,-1e-06,0,-1e-06,0,0,0,0,0,0,-1e-06,0,0,0,0,0,0,-3e-06,2e-06,-1e-06,0,0,0,0,-1e-06,-1e-06,0,0,0,0,-1e-06,3e-06,0,1e-06,0,0,2e-06,1e-06,0,-1e-06,0,0,0,0,-1e-06,-1e-06,0,0,2e-06,1e-06,0,1e-06,0,0,0,0,1e-06,0,0,1e-06,0,0,0,0,0,0,1e-06,1e-06,-1e-06,0,1e-06,-1e-06,1e-06,0,1e-06,1e-06,0,0,0,0,-1e-06,0,1e-06,0,0,1e-06,0,0,0,-1e-06,1e-06,1e-06,-1e-06,0,0,0,-1e-06
