-0.001164,-0.000983,-0.000851,-0.000662,-0.000914,-0.001597,-0.00141,-0.001265,-0.001951,-0.000961,-0.000868,-0.00105,-0.001801,-0.001226,-0.001255,-0.00086,-0.000491,-0.001929,-0.003283,-0.002031,-0.002639,-0.002628,-0.001948,-0.002127,-0.001213,-0.001088,-0.002102,-0.001472,-0.002984,-0.002598,-0.001775,-0.001715,-0.001604,-0.001975,-0.002002,-0.002125,-0.002401,-0.003987,-0.003288,-0.001753,-0.00086,-0.002179,-0.00313,-0.002754,-0.001994,-0.003513,-0.002468,-0.002576,-0.002348,-0.001934,-0.001161,-0.00273,-0.002374,-0.002552,-0.002063,-0.003163,-0.002828,-0.00235,-0.00152,-0.002039,-0.002459,-0.00523,-0.003782,-0.00243,-0.002194,-0.003428,-0.004147,-0.004155,-0.003232,-0.003868,-0.002588,-0.003733,-0.002911,-0.001503,-0.004065,-0.002288,-0.001336,-0.001888,-0.002436,-0.001814,-0.002724,-0.002803,-0.003956,-0.003591,-0.002305,-0.001909,-0.002066,-0.003083,-0.002175,-0.003283,-0.002199,-0.003167,-0.003821,-0.003694,-0.002514,-0.002201,-0.002241,-0.001981,-0.001822,-0.002713,-0.002189,-0.002337,-0.001784,-0.001805,-0.001885,-0.001812,-0.002142,-0.002226,-0.002788,-0.002185,-0.001964,-0.001987,-0.0015,-0.001614,-0.002134,-0.002495,-0.002449,-0.001914,-0.000977,-0.002288,-0.00201
0.000162,0.000558,0.000196,9.9e-05,0.000116,0.000576,0.000414,0.000281,0.001268,0.000671,0.000171,0.000344,0.00026,0.00053,0.000446,2.2e-05,-1e-06,0.000913,0.001378,0.00087,0.00092,0.001404,0.000459,0.000821,0.000344,0.000204,0.000816,0.001057,0.001583,0.001486,0.000632,0.000119,0.000576,0.000519,0.001099,0.001269,0.001228,0.001796,0.002011,0.001175,0.000142,0.000959,0.002208,0.000968,2.8e-05,0.001076,0.000607,0.000139,0.000634,0.000463,-0.000194,0.000966,0.000401,0.001143,0.000674,0.000875,0.000631,0.000623,0.000336,0.000211,0.00102,0.003245,0.001949,0.000801,0.000651,0.001476,0.002556,0.002233,0.001146,0.002044,0.000209,0.002051,0.000985,-0.000144,0.002688,0.001862,0.000372,-0.000245,0.000792,0.000311,0.00121,0.001541,0.001924,0.001827,0.000813,-9e-05,0.000758,0.001764,0.000491,0.000746,0.001254,0.001966,0.001697,0.002123,0.000946,0.001502,0.001228,0.00062,0.000795,0.001739,0.001203,0.001235,0.001118,0.000626,0.000858,0.000967,0.000491,0.001115,0.001204,0.001222,0.001159,0.00108,0.000795,0.000312,0.001043,0.001566,0.001165,0.000569,-7.2e-05,0.000717,0.000813
-0.000139,-0.000414,-8.6e-05,-4.8e-05,-7.5e-05,-0.00025,-0.000233,-0.000202,-0.000689,0.000104,-0.000534,1.4e-05,-4.2e-05,-5.3e-05,-0.000358,0.000116,0.000208,-0.000334,-0.000266,-9.4e-05,0.000249,-0.00073,0.00046,-0.000381,-0.000193,-0.000315,-0.000831,-0.001221,-0.000961,-0.001077,-6.1e-05,0.000135,-0.000367,3.7e-05,-0.000546,-0.001234,-0.001132,-0.000463,-0.000593,-0.00022,-0.000185,-0.00043,-0.000341,0.000218,0.000332,-7e-05,0.000403,0.000779,0.000151,0.000167,0.000287,-0.000373,-9e-05,-0.000213,0.000472,-8.9e-05,0.000266,-5.4e-05,-0.000195,-2.6e-05,-0.000528,-0.002095,-0.000739,-0.000173,-0.000128,-0.000503,-0.000792,-0.00063,0.000195,-0.00048,0.000539,-0.000425,0.00034,0.000281,-0.001088,-0.00118,-0.000505,0.000666,9.8e-05,0.000181,-0.001167,-0.001102,-0.000936,-0.000449,-0.000152,0.000257,0.000217,-0.000522,3e-06,0.00054,-0.000501,-0.001548,-0.000197,-0.000418,0.000309,-0.00097,-0.000731,0.000331,0.000271,-0.001224,-0.000765,-0.00069,-0.000692,5.6e-05,-9.6e-05,-0.000791,-0.000375,-0.000728,-0.000859,4e-06,-0.000841,-0.000953,-0.000527,-0.000129,-0.000297,-0.000707,-0.000351,-0.000116,0.000265,-0.00019,0.000246
6.4e-05,0.000217,2.7e-05,-9.3e-05,-1.3e-05,6.4e-05,0.000288,8e-05,0.000163,-0.000183,0.000126,-0.000132,-0.000295,-0.000399,0.000153,-0.000291,-0.000304,9.7e-05,-0.000614,-0.000602,-0.000521,-1.2e-05,-0.000677,-2.5e-05,-0.000192,0.000109,0.000358,0.000689,0.000347,0.00068,0.000107,0.000208,0.000195,-0.000426,0.000257,0.00098,0.000775,0.000111,-0.000638,-0.000136,-8.3e-05,0.000362,-0.000737,-0.001075,-0.000305,-0.000434,-0.000512,-0.000869,-0.000758,-0.000378,-6e-04,0.000124,-0.000259,-0.000102,-0.001024,-0.000839,-0.000744,-0.000112,-0.00025,-0.000966,0.000105,0.000963,-0.000193,-0.000406,-0.000314,-0.000576,-0.00077,-0.000556,-0.000773,2e-06,-0.000433,-0.000524,-0.000976,-0.000749,0.000263,8.2e-05,1e-04,-0.000469,-0.000619,-0.000442,0.000751,0.000368,0.000266,-0.000807,-1.2e-05,-5e-06,-0.000358,-0.00042,-0.000528,-0.000961,-0.000447,0.000327,-0.000535,-0.000718,-0.000721,0.000295,0.000581,-0.000406,-6.5e-05,0.000409,7e-06,0.000132,6.7e-05,-0.000356,6.3e-05,9.4e-05,0.000564,0.000967,0.000891,-0.000439,0.000687,0.000616,0.000174,-0.000505,0.000145,-0.00025,-0.000103,-9.8e-05,-0.00034,3.9e-05,-0.001286
0.000222,-6e-06,-0.000192,-0.00027,-0.00012,-0.000294,-0.000304,-0.000418,-0.000182,-0.000194,0.000117,0.000136,0.00011,0.00026,7.2e-05,0.000222,-8.2e-05,6.6e-05,0.000794,0.000404,0.000146,4.4e-05,0.000555,-2.2e-05,0.000241,0.000177,-0.000181,-0.000367,-0.000359,-0.000634,-0.000279,-0.000132,9.4e-05,0.000331,-0.000402,-0.000994,-0.000526,-0.000145,0.000828,0.000294,2e-05,-0.000521,0.000512,0.000477,0.000267,0.000567,-0.00018,2e-05,0.000497,4e-05,0.000517,-0.000216,0.000361,0.000311,0.000761,0.000814,0.000142,-0.000405,0.000243,0.000928,-0.000143,-0.000584,-0.000285,0.000553,0.000169,0.000645,0.001231,0.000711,0.000347,-0.000409,-0.000466,0.00037,0.000775,0.000818,-4.3e-05,7.6e-05,0.00023,6.8e-05,0.000257,0.000135,2e-06,0.000121,-0.000143,0.000357,3.3e-05,-0.000151,0.000235,0.000597,0.000192,0.000447,6.7e-05,-4.7e-05,0.000194,0.000252,0.000397,-0.000199,-0.000416,0.000327,-0.000129,5.8e-05,0.000117,4.4e-05,-0.000131,-0.00011,-0.000269,-6.7e-05,-0.000213,-0.000868,-0.000456,0.000594,-0.000774,-0.000216,-9.9e-05,0.000459,-0.00045,0.000252,5.4e-05,0.000192,0.000212,0.00016,0.00134
0.000143,0.000225,0.000316,0.000271,0.000384,0.000354,0.000458,0.000405,0.000284,0.00027,3.4e-05,-3.3e-05,0.000267,0.000218,4.4e-05,-0.000158,6.4e-05,0.000196,-0.000247,3.2e-05,-9.4e-05,0.000282,-0.000137,2.2e-05,-0.00012,3e-05,0.000138,0.000176,0.000255,0.00059,0.000392,-0.000184,-0.000175,-0.000208,7.6e-05,0.000433,5.4e-05,0.000418,-0.000474,-0.000208,0.000114,0.000327,-0.000316,0.00024,-0.00042,-0.000204,0.000412,0.000194,-0.000206,-4.3e-05,-0.000307,1e-05,-8e-06,-0.000222,-0.000152,-0.000365,0.000286,0.000308,0.000537,-0.000293,-2.5e-05,0.000316,0.000832,0.000131,0.000275,-0.000103,-0.000578,-1.2e-05,0.000321,0.000584,0.000772,-1.7e-05,-0.000102,-0.000248,8.8e-05,7.3e-05,0.000148,4.6e-05,0.000176,-0.000364,-0.000184,-4.4e-05,8.9e-05,0.000153,-9.5e-05,0.000111,3.6e-05,-0.000338,-0.000176,-0.000153,0.000264,0.000254,-6.4e-05,0.000439,0.000113,0.000185,0.000407,-0.000181,-1.3e-05,-0.000339,9e-05,-0.000106,6.6e-05,5.6e-05,0.000455,0.000327,-0.000324,0.00023,0.000376,-0.00011,0.000127,-0.000105,-9.3e-05,0.000205,0.000338,0.000217,-0.000391,-0.000125,6.9e-05,4.1e-05,-0.00068
-0.000201,-0.000146,-0.000244,-0.000175,-3.9e-05,-1.4e-05,-0.000275,-0.000149,-0.000222,-0.000239,-0.000104,2e-04,-0.000411,-0.000225,-0.000152,0.000133,0.000253,-0.000269,0.000169,-0.000168,-5.2e-05,-0.000411,0.000172,-0.00016,5.3e-05,0.000132,-2e-05,-0.000136,-0.000118,-0.000413,-0.000357,0.00025,0.000275,0.000288,0.000314,-1.5e-05,1.8e-05,-0.000358,8.8e-05,3.4e-05,-3e-04,-0.000231,0.000117,-0.000376,0.000262,0.00011,-0.000115,0.000238,0.000151,7.6e-05,0.00048,0.000129,-0.000143,0.000208,-7.4e-05,3.8e-05,-0.000179,-7e-05,-1e-04,-0.000142,1.2e-05,-0.000356,-0.000726,-0.000298,-0.000424,-0.000148,3.9e-05,-0.000523,-0.000608,-0.000172,-0.000326,0.000301,-0.000444,-0.000281,-0.000478,-0.000177,-0.000267,2.2e-05,0.000182,0.000497,9.7e-05,0.000268,-7.9e-05,-0.000205,-0.000175,3.1e-05,-0.000228,0.000129,0.000166,4.2e-05,-0.00032,-0.000133,4.4e-05,-0.000288,-0.000273,-0.000178,-0.000181,0.000202,7e-06,0.000584,5.5e-05,0.000214,-0.000125,-1.9e-05,-0.000371,-7e-06,0.000324,0.000198,-0.000353,-0.000212,0.000157,0.000198,0.000299,-1.1e-05,-0.000241,9.2e-05,0.000621,3.1e-05,-5e-06,-0.000145,0.000272
4.4e-05,-7.1e-05,0.000108,4e-05,-7.9e-05,-0.000128,9.9e-05,-2.7e-05,0.000258,0.000167,5e-05,-0.000375,0.000206,1.7e-05,-4.5e-05,-9.5e-05,-0.000389,3e-05,-7.4e-05,0.000226,0.000176,0.000251,-0.000243,0.000212,2.6e-05,-1.7e-05,0.000115,3.6e-05,0.000317,5.4e-05,0.000296,-0.000105,-0.000103,-0.000186,-0.000513,4.8e-05,-2.8e-05,0.00047,-7.7e-05,0.000152,0.000122,-3.4e-05,-0.00012,0.000346,0.00011,0.000114,-8.7e-05,-0.00036,-8e-05,-0.000193,-0.000281,-0.000178,-0.000279,-0.000181,-0.000198,-0.000255,2.6e-05,-4e-06,-0.000111,0.000333,-0.000119,0.000334,0.000503,0.000323,-1.4e-05,0.000133,0.000109,0.00082,0.000487,-0.000148,-0.000147,-0.000394,0.000355,0.000331,0.00021,4.5e-05,6.2e-05,3e-05,-0.000119,-0.00045,-0.000293,0.000191,5.5e-05,0.00026,0.000126,0.000121,0.000283,-9e-06,-7.9e-05,-0.00016,0.000149,0.000297,0.000144,-5e-06,2.8e-05,0.000221,-3.2e-05,-9.5e-05,-4.7e-05,-0.000127,-0.000277,-0.00032,-3.3e-05,-0.000174,0.000282,-0.000218,6e-06,-0.000224,0.000275,0.000419,-7.6e-05,-0.000144,-0.00018,-5.9e-05,-0.000114,-0.000143,-0.000284,4.1e-05,-6.7e-05,8.9e-05,-2e-05
0.000145,8e-06,-0.000178,7.1e-05,3.2e-05,3.7e-05,2.7e-05,2.1e-05,-9.6e-05,-0.000111,-4.7e-05,2e-04,-2.3e-05,-0.000115,0.000105,-3.5e-05,0.000117,4.8e-05,-0.000284,-0.000101,-9.2e-05,2.9e-05,0.00029,-5.7e-05,8.3e-05,-0.000282,-0.000146,-4e-05,-0.000244,4.4e-05,-0.000106,-3.5e-05,-2e-06,7.8e-05,0.000353,-0.000154,-0.000143,-0.000316,0.000315,-4e-05,-3.3e-05,0.000159,0.000104,-0.00024,-0.00033,-0.00021,-2.9e-05,0.000106,5.9e-05,0.000342,0.000168,0.000218,0.000724,0.000133,0.000138,0.000322,0.000415,0.000192,0.000151,-5.8e-05,0.000429,-0.000403,-0.000408,-0.000111,0.000183,5.9e-05,-0.000132,-0.000573,-0.000203,0.000416,0.000374,0.000519,4.1e-05,-9.9e-05,-0.000147,-4.6e-05,0.000255,-8e-06,-2.7e-05,0.000259,0.000194,-0.000229,-0.000314,-0.000295,-0.000198,-0.000266,6.3e-05,-0.000103,-3e-05,0.000279,-1e-06,-0.000445,-6.3e-05,0.000319,0.000252,0.000287,0.000111,0.000193,-3.2e-05,0.000123,0.000159,0.000356,4e-06,0.000228,-6.9e-05,0.000193,1.9e-05,2.4e-05,-0.000148,-0.000344,0.000281,0.000133,0.000147,1.2e-05,8.2e-05,0.000118,-1e-06,1.3e-05,6.1e-05,-0.000148,0.000131
3e-05,-3.2e-05,0.000211,3.8e-05,-3e-06,3.1e-05,-2e-06,7.4e-05,-3e-06,8.4e-05,6e-06,-3.5e-05,8e-06,6.5e-05,-0.000163,-0.00012,6.1e-05,2.9e-05,0.000169,-0.000122,-0.000136,-7.5e-05,-0.000271,-0.000236,-0.000106,0.000201,-5e-06,-0.000142,-1.1e-05,3.4e-05,0.000126,0.000154,-5.4e-05,0.000164,-0.000125,-0.000189,4.7e-05,0.00029,-0.000256,-9.9e-05,9e-06,0.000158,-0.000132,5.7e-05,0.000128,0.000159,-9.4e-05,0.000199,-1.5e-05,-0.000177,-0.000114,-0.000279,-0.000467,-0.000233,-0.000261,-0.000193,-0.000612,-0.000155,-6.5e-05,-1e-04,-0.000338,0.000146,0.000336,-0.000378,-0.000298,8.6e-05,0.000248,0.000162,0.000122,-0.000146,-0.000179,-0.000235,-2.6e-05,0.000107,0.000255,6e-05,-0.000355,0.000194,-3.8e-05,-1e-06,-1e-05,-8.8e-05,0.000379,0.000363,0.000277,0.000133,-0.000128,-6e-05,0.000117,2.5e-05,6.3e-05,0.00027,0.00013,-0.000205,-0.000174,-0.000503,-0.000113,-0.000242,-1.8e-05,-5.9e-05,-3.4e-05,-0.000291,2.1e-05,-8.9e-05,-5.4e-05,-1.5e-05,-0.000114,0.00017,4.3e-05,0.000196,-4.9e-05,8.8e-05,-0.000122,2.3e-05,-0.000198,-0.000233,0.000152,-5.9e-05,-1.9e-05,0.000113,-0.000191
-9.5e-05,-4.7e-05,-0.000126,-8e-05,-6.1e-05,-6.1e-05,-7.8e-05,-0.000152,-6.3e-05,-1e-05,-4.8e-05,0.000107,2.9e-05,-5.3e-05,0.000123,2.4e-05,-5.3e-05,-1e-04,1.7e-05,5.7e-05,0.000151,5.1e-05,0.000158,0.000275,2e-06,6.3e-05,3.1e-05,1.5e-05,-2.4e-05,-0.000115,-0.000138,-0.000177,0.000177,-0.000149,-1.5e-05,0.000228,0.000105,-0.000227,0.000261,0.000106,-4.1e-05,-2e-05,0.000227,4.2e-05,8.8e-05,-3e-05,2.6e-05,-0.000323,-6e-06,2.5e-05,0.000146,0.000126,0.000124,0.000143,0.000333,2.3e-05,0.000447,3.3e-05,-0.000232,-7e-06,8.2e-05,9.1e-05,-0.000102,0.00028,0.000298,-4.2e-05,-4.9e-05,0.000153,-6.1e-05,-0.000126,5.5e-05,-5e-06,4e-06,-0.000214,-9.4e-05,-7.9e-05,0.000253,9.5e-05,7.8e-05,7e-05,2e-06,0.000109,-0.000186,-0.000262,9e-06,0.000188,-1e-06,9.2e-05,-0.000139,-0.000192,4.4e-05,-9.2e-05,4.6e-05,0.000176,-1.8e-05,0.000276,0.000105,0.000213,1e-05,0.000263,-4.1e-05,7.6e-05,-5.4e-05,1.2e-05,-0.000158,-0.00018,5.5e-05,-5.2e-05,4e-05,-0.000267,-0.000149,-0.000166,7e-06,3.5e-05,0.000185,6.5e-05,-1.2e-05,9.1e-05,-4e-05,-6.1e-05,-1e-05
7.7e-05,3.5e-05,0.000111,0,-3e-06,8e-05,8e-06,0.000163,5e-05,-1.5e-05,-1e-05,-5.2e-05,-6.2e-05,7.7e-05,1.5e-05,4.7e-05,5.6e-05,0.000117,-7.9e-05,-2.2e-05,1e-06,-3.8e-05,-0.000121,-6.3e-05,0.000109,-0.000138,8.3e-05,0.000139,-1.2e-05,5.4e-05,7.8e-05,9e-06,-5.9e-05,-4e-06,0.000138,-6.4e-05,-5e-06,8.9e-05,-0.000237,-4.5e-05,8.3e-05,-8.7e-05,-0.000112,-7e-06,-0.000147,-4.3e-05,-1.3e-05,0.000112,-3.7e-05,0,-0.000249,-6.4e-05,-3.8e-05,-6.1e-05,-0.000321,-1.1e-05,-0.00022,1.1e-05,0.000128,-1.8e-05,0.000145,-0.000129,-6.5e-05,-0.000159,-0.00018,2.6e-05,0,-0.000278,-2e-06,0.000112,-7.5e-05,2e-06,-7e-05,0.000269,-0.000157,0.000237,-8.6e-05,-9.3e-05,3e-06,-8.4e-05,6.7e-05,-0.000106,0.00019,2e-04,-0.000109,-0.00015,-2e-06,6e-06,0.000141,0.000104,-5.9e-05,5.2e-05,-8.4e-05,-0.000411,0.000187,-7e-06,-3.1e-05,-0.00014,-5.3e-05,-0.000301,-6.2e-05,-1.9e-05,-5e-06,1.6e-05,-8.8e-05,0.000155,-9.9e-05,5.2e-05,-1.3e-05,0.000257,0.000232,-8.9e-05,8.7e-05,-6.1e-05,0.00012,2e-06,-0.000221,-9.3e-05,4.9e-05,0.000113,5e-05
-8.8e-05,-2.1e-05,-5.8e-05,-7e-06,-4.6e-05,-1.1e-05,-1.7e-05,-6.9e-05,-7.4e-05,-6.6e-05,2.9e-05,-6.1e-05,-2.1e-05,-6.2e-05,-9.2e-05,2e-06,-4.9e-05,-3.7e-05,-5e-05,0.000113,-5e-05,2.6e-05,3.8e-05,-4.1e-05,-0.00013,0.000138,2.1e-05,-7.2e-05,4.1e-05,-1.6e-05,-1.7e-05,6.9e-05,1.2e-05,3e-05,-9e-05,-3.1e-05,-4.6e-05,5.6e-05,0.000199,3e-06,-0.000178,-3e-05,5.6e-05,1e-04,9.3e-05,6.7e-05,2.8e-05,-7.4e-05,4.7e-05,-3e-05,6.1e-05,0.000111,0.000129,-3.6e-05,0.000153,-1.1e-05,0.000201,-3e-06,-3e-06,-8.3e-05,-0.000175,-1.1e-05,3.4e-05,0.000159,0.000114,-0.000161,-4.4e-05,8.8e-05,1.9e-05,-8.5e-05,3e-06,2.2e-05,-3.6e-05,-0.00025,0.00022,-7.2e-05,4.2e-05,-6.4e-05,-6.2e-05,-3e-05,4.9e-05,2.2e-05,1.7e-05,-8.6e-05,0.000111,0.000164,-3.5e-05,-0.000142,-3.2e-05,-4.4e-05,-4.3e-05,-7e-05,5.4e-05,0.000306,-2.1e-05,-6.3e-05,-7.4e-05,5.5e-05,5.8e-05,0.000172,0.000106,3.2e-05,1.8e-05,-6e-06,0.000113,-3.9e-05,4.3e-05,-0.000111,-9.5e-05,-0.000218,-7.7e-05,6.4e-05,-8e-05,0.000103,-9.6e-05,-0.000113,0.000149,-1e-06,-1e-05,-2.6e-05,1e-06
-2.1e-05,-3e-06,1.3e-05,5e-06,1.6e-05,5.1e-05,-1.5e-05,1.5e-05,2e-05,2.5e-05,-7e-06,-3.9e-05,-6e-06,5.3e-05,7.6e-05,2.4e-05,3.9e-05,-4.4e-05,3.6e-05,-5e-05,6e-05,-4e-06,1.4e-05,-1.5e-05,3.8e-05,-8.9e-05,-5.9e-05,2.2e-05,-8.5e-05,2.2e-05,-9e-06,-8.3e-05,-4.5e-05,-6.2e-05,2.1e-05,5.4e-05,-6e-06,-0.000113,-8.4e-05,-5.1e-05,0.00011,-8e-06,-6.3e-05,-0.000188,2.5e-05,-1.4e-05,3.6e-05,2.9e-05,2.4e-05,2.5e-05,8.8e-05,1.7e-05,-6.7e-05,3.4e-05,-5.8e-05,2.8e-05,-8.9e-05,-7.6e-05,-8e-06,-1.8e-05,4.7e-05,4.2e-05,-3e-05,-8.1e-05,-2.5e-05,8e-06,8.3e-05,-7.7e-05,2e-06,6e-05,3.9e-05,-9.8e-05,-7.1e-05,0.00018,-0.000132,-1e-06,-3.2e-05,-0.000108,3e-06,-7.6e-05,-9.4e-05,8.8e-05,-1e-05,0.000106,-0.000111,-7e-05,7e-05,3.7e-05,0,-3.9e-05,4e-05,0.000117,2.7e-05,-0.000184,-5.3e-05,8.7e-05,0,-3.7e-05,-8.6e-05,-3.2e-05,0,8e-06,9e-06,2.6e-05,-5.9e-05,-6.6e-05,8.2e-05,4e-05,3.8e-05,0.000132,8e-05,4.7e-05,-2.9e-05,-0.000119,1.3e-05,1.8e-05,-4.6e-05,6.5e-05,-3.3e-05,-3.3e-05,-5.4e-05
5.5e-05,1.4e-05,-5e-06,-4.2e-05,-1e-05,-3.1e-05,3.1e-05,3.2e-05,1.4e-05,-5e-06,6e-06,4.5e-05,6.2e-05,2.6e-05,-7.1e-05,-3e-06,-7.1e-05,5.3e-05,2e-06,-1.5e-05,-8.8e-05,0,3e-05,2.8e-05,-1.6e-05,4.9e-05,1.6e-05,7e-06,4.9e-05,-2e-05,3.3e-05,3.5e-05,6.1e-05,2.5e-05,-3e-05,-7.2e-05,8e-06,7.1e-05,-3e-06,5.8e-05,2.9e-05,-1.4e-05,-1.3e-05,0.000161,-5.1e-05,-4.3e-05,-6e-05,7.4e-05,-3.7e-05,-6e-06,-6.4e-05,-3.2e-05,-4.5e-05,-5e-06,3.3e-05,-2.3e-05,-2.2e-05,7e-05,8e-06,5.9e-05,3.6e-05,3.5e-05,5.7e-05,3.8e-05,4e-06,-9e-06,-3.2e-05,7.9e-05,3e-06,4e-06,3.7e-05,2.4e-05,5.6e-05,-9e-05,5.4e-05,-2.9e-05,-5.3e-05,0.000188,-3.3e-05,7.3e-05,2.6e-05,-9e-05,-4.3e-05,-6.5e-05,5.5e-05,-8e-06,-9.8e-05,3.8e-05,1.1e-05,8.4e-05,2.3e-05,-5.3e-05,-5.9e-05,1.2e-05,-1.4e-05,-5.9e-05,3.8e-05,2.4e-05,4.9e-05,-0.000118,-3e-05,-9.9e-05,-9.6e-05,-1.3e-05,0.000126,7.1e-05,-1.9e-05,7.7e-05,5.6e-05,-8e-05,-4.4e-05,-0.000118,5e-05,0.000103,-3.6e-05,-6.4e-05,-1e-05,-4.2e-05,1.3e-05,7e-06,4e-05
2.9e-05,-1e-05,5e-06,3.1e-05,3.8e-05,2e-06,-3e-06,-3.3e-05,-4e-06,8.1e-05,1.2e-05,-5.2e-05,-5e-05,-6e-06,4.4e-05,2e-06,-3e-06,-3.7e-05,2.5e-05,1.2e-05,1.7e-05,-1e-05,-4.7e-05,-3.8e-05,-1.7e-05,-3.2e-05,8e-06,-3.8e-05,-5e-05,-7e-06,-5.4e-05,-9e-06,-5.8e-05,-3e-06,1.7e-05,1.3e-05,2.2e-05,-0.000102,1.9e-05,-1.3e-05,-7.2e-05,4.1e-05,-1.1e-05,-9.3e-05,2.9e-05,1.4e-05,-1.2e-05,-5.1e-05,1.7e-05,-9e-06,-3.9e-05,5.1e-05,2.2e-05,-7e-06,9e-06,-2e-06,1e-05,-5e-05,2.6e-05,-6.4e-05,-8.8e-05,-3.6e-05,-6.6e-05,6.6e-05,-3e-05,3.3e-05,-1.1e-05,-5.9e-05,-1.9e-05,-2.2e-05,1.7e-05,1.5e-05,-1.2e-05,6e-05,-4.4e-05,1.4e-05,5.3e-05,-8.5e-05,-1.6e-05,-5e-06,4e-06,-2e-06,-4.8e-05,-1.1e-05,-2.6e-05,-3.6e-05,3.3e-05,1e-06,-1e-05,-8.5e-05,-1.4e-05,-1e-05,2.2e-05,-6.3e-05,2.5e-05,-4.5e-05,-2.7e-05,-6.3e-05,-7e-06,6.3e-05,1.8e-05,1.7e-05,8.2e-05,2.2e-05,-7e-05,-1e-06,-2e-05,-8e-05,-3e-05,1.9e-05,-3e-05,0.000166,3.1e-05,-6.1e-05,2.2e-05,9.1e-05,2.8e-05,1.2e-05,3.2e-05,-9e-06,1e-05
5e-06,-1e-05,-1e-05,-3.5e-05,-2.7e-05,9e-06,-1.5e-05,3.2e-05,1.1e-05,-9e-05,-1.7e-05,4e-05,1.1e-05,0,3e-06,-4e-06,2.8e-05,3.1e-05,-1.9e-05,3.2e-05,-2.6e-05,-2e-05,7e-06,4.1e-05,8e-06,2.6e-05,4e-06,2.5e-05,-8e-06,2.5e-05,3.1e-05,-1.2e-05,7e-06,3.3e-05,3e-06,4.5e-05,7e-06,1.6e-05,-1.2e-05,-3.8e-05,4.1e-05,-3.6e-05,2.5e-05,5e-05,-4.3e-05,3.3e-05,4.5e-05,2.4e-05,2.1e-05,2.3e-05,7.4e-05,-2.7e-05,5.4e-05,1.6e-05,-2.5e-05,1.2e-05,8e-06,-9e-06,1.3e-05,3.7e-05,1e-04,4.6e-05,2.9e-05,-0.000113,2.3e-05,-3.4e-05,4e-06,1e-05,3e-06,2.8e-05,-2.9e-05,-1.8e-05,2.2e-05,-9.8e-05,4.2e-05,1.9e-05,-1.6e-05,5.4e-05,1.6e-05,8e-06,-3.1e-05,5.4e-05,7.9e-05,2.3e-05,1.5e-05,6e-06,0,-3.3e-05,1.6e-05,7e-06,2.1e-05,9.4e-05,-1.2e-05,7.2e-05,-2.9e-05,8.9e-05,-2e-06,9.5e-05,-2.2e-05,-1.2e-05,1e-05,5.5e-05,-5.8e-05,0,1.2e-05,2.2e-05,-3e-05,-1.8e-05,-2e-06,3.3e-05,3e-05,-3.9e-05,-9e-06,2.2e-05,2.9e-05,-1e-06,-1.5e-05,-1.7e-05,-6e-06,3e-06,-3.8e-05
-2e-06,1e-06,6e-06,-1e-06,1e-05,-9e-06,-5e-06,-2.4e-05,7e-06,6.5e-05,-1e-06,8e-06,-2e-06,-9e-06,-4e-05,-1.4e-05,2e-06,-2.5e-05,1.1e-05,-1e-05,4.4e-05,2.3e-05,-6e-06,-8e-06,-1.5e-05,-4.5e-05,-6e-06,4.2e-05,4.7e-05,-2.5e-05,-3e-05,1.1e-05,7e-06,-2.5e-05,3e-06,-3.3e-05,1.6e-05,-9e-06,3.2e-05,3.2e-05,-3.2e-05,1.4e-05,-1.2e-05,-2.6e-05,4.1e-05,0,2.1e-05,-2e-06,-6e-06,-2.4e-05,-3.3e-05,-2e-05,-7.1e-05,6e-06,8e-06,1.9e-05,0,-5e-06,-9e-06,-1.4e-05,-1.7e-05,-2.3e-05,-1.9e-05,8.5e-05,-1.6e-05,1.7e-05,-1e-06,3.7e-05,4e-06,-3.1e-05,2.8e-05,1.6e-05,-6e-06,7.6e-05,-4e-06,-2.1e-05,-2.4e-05,-4.2e-05,-5e-06,-1.7e-05,4e-06,-2.3e-05,-3.8e-05,-2.8e-05,3.6e-05,-9e-06,1e-06,1.9e-05,2.1e-05,1.7e-05,-1e-06,-5.1e-05,-9e-06,3.5e-05,-1.5e-05,-3.7e-05,1.8e-05,-5.6e-05,1.9e-05,-6.4e-05,-1e-06,-4e-05,1.8e-05,-1.5e-05,-1e-06,1.6e-05,4.7e-05,1.4e-05,3.6e-05,-4.9e-05,-7e-06,-4e-06,-1e-06,-1.9e-05,-3.9e-05,1.7e-05,-2.7e-05,1.9e-05,-1.9e-05,-3e-06,2e-05
-1e-05,-2e-06,7e-06,-1e-06,7e-06,-3e-06,4e-06,6e-06,1e-05,-4e-05,-1.4e-05,9e-06,1.3e-05,1.4e-05,4.3e-05,-9e-06,9e-06,1.9e-05,1.7e-05,-1.3e-05,-9e-06,-1.6e-05,1.5e-05,-2e-06,8e-06,2.7e-05,1.8e-05,-3.5e-05,-2.8e-05,8e-06,3.2e-05,9e-06,-2e-05,-3e-06,-2e-06,-9e-06,-2e-06,4e-06,-3.6e-05,-8e-06,3.6e-05,-2.1e-05,-9e-06,-8e-06,-6.7e-05,-1.9e-05,4e-06,-6e-06,3e-06,-1e-06,2e-05,1.3e-05,5e-05,-1e-05,1e-06,6e-06,6e-06,8e-06,-2.6e-05,1.5e-05,-6e-06,-1e-06,-4e-06,-6.3e-05,8e-06,8e-06,-1.8e-05,-5.4e-05,4e-06,-1e-06,-1e-05,-2.3e-05,-1.6e-05,-5.1e-05,-4e-05,2.1e-05,3.5e-05,3.4e-05,6e-06,1.6e-05,3.6e-05,-2.4e-05,1.7e-05,5e-06,-2.5e-05,-6e-06,-4.6e-05,4e-06,-2.2e-05,-2.1e-05,-2e-06,-2.6e-05,-4e-06,-3.3e-05,3.3e-05,2.2e-05,-6e-06,3.2e-05,-1.5e-05,3.3e-05,-1.8e-05,-2e-06,3e-06,1.9e-05,4e-06,-1.4e-05,-6.2e-05,7e-06,-2.8e-05,3.8e-05,-8e-06,-1e-05,-2e-06,7e-06,3.2e-05,-2.1e-05,4.1e-05,-2e-06,3e-06,4e-06,-7e-06
-1.1e-05,0,-1.7e-05,4e-06,3e-06,-3e-06,2e-06,3e-06,-6e-06,3.1e-05,2e-06,-2.2e-05,-3.2e-05,-5e-06,-7e-06,1e-06,-3.1e-05,-4e-06,-2e-05,1.7e-05,-5e-06,7e-06,-1.5e-05,-5e-06,2e-06,2e-06,-7e-06,3e-06,-1e-06,-5e-06,-9e-06,-1.6e-05,7e-06,-1.4e-05,1.6e-05,8e-06,-7e-06,7e-06,2.1e-05,-1e-06,-3.3e-05,-1.8e-05,2e-06,3.3e-05,5.9e-05,7e-06,-2.1e-05,-2e-06,-4e-06,-5e-06,-2.9e-05,-3.2e-05,-1.4e-05,-1.1e-05,-9e-06,-5e-06,-3.3e-05,6e-06,2e-05,-6e-06,3e-05,-2e-06,2.3e-05,4.9e-05,-3e-06,-4e-06,-1.6e-05,4e-05,-3.2e-05,3.3e-05,-8e-06,2.3e-05,3.6e-05,3.7e-05,2.8e-05,-1.1e-05,-3.8e-05,-3.4e-05,6e-06,-1.1e-05,-1e-06,2.9e-05,-4e-06,-1.5e-05,2.3e-05,1.8e-05,2.5e-05,0,5e-06,1.6e-05,-7e-06,3.1e-05,-2e-06,-2.7e-05,-5e-06,1.8e-05,-1.7e-05,-4.3e-05,-2e-06,6e-06,-6e-06,1.9e-05,-1.6e-05,9e-06,1.6e-05,9e-06,6.4e-05,1.4e-05,6e-06,-3.9e-05,1.8e-05,4.9e-05,1.2e-05,1.8e-05,-2e-06,3.4e-05,2e-06,4e-06,1.4e-05,-3e-06,1.6e-05
-6e-06,-2e-06,1.3e-05,0,-3e-06,4e-06,-2e-06,3e-06,1e-06,-1.8e-05,-1e-05,-4e-06,3.1e-05,-1e-06,-1.9e-05,7e-06,1.8e-05,-3e-06,-8e-06,-1.6e-05,-8e-06,-1e-06,4e-06,5e-06,-1.4e-05,-3.4e-05,0,2.2e-05,4e-06,4e-06,-2e-06,1.4e-05,5e-06,2.2e-05,-1e-06,-2e-06,-4e-06,-2.9e-05,-1.7e-05,-9e-06,1.6e-05,2.1e-05,8e-06,-4.7e-05,-2.3e-05,2e-06,-6e-06,1.1e-05,-3e-06,1.3e-05,3e-05,2e-05,3.4e-05,2e-05,2.7e-05,1.7e-05,3.1e-05,6e-06,-6e-06,4e-06,-3.4e-05,-5e-06,-3e-05,-5.6e-05,1.5e-05,-5e-06,1.3e-05,-2.4e-05,3e-05,-1.8e-05,1.2e-05,-5e-06,-4.1e-05,-2.9e-05,-1.3e-05,1e-06,3e-05,-2e-05,0,-1e-06,-1e-05,-1.8e-05,2e-06,2.6e-05,-2.7e-05,-1.3e-05,2e-06,-1.1e-05,5e-06,8e-06,4e-06,-1e-06,0,6.1e-05,-2e-05,-6e-05,3e-06,2.8e-05,2.1e-05,-1.5e-05,9e-06,-3.3e-05,7e-06,-3e-06,-1.9e-05,-5e-06,-3.1e-05,-1.6e-05,1.4e-05,4.3e-05,-2.8e-05,-3.8e-05,-1.1e-05,-2.7e-05,-4e-06,-1.6e-05,-4e-06,2e-06,-2e-06,4e-06,-3.9e-05
0,2e-06,-2.2e-05,-5e-06,-8e-06,5e-06,5e-06,2e-06,0,2e-06,8e-06,-2e-06,-1.6e-05,-7e-06,3.1e-05,1e-05,1.1e-05,-3e-06,0,2e-05,6e-06,-4e-06,5e-06,8e-06,1.9e-05,3e-05,1.1e-05,-1.9e-05,-3e-06,1e-06,1e-05,-7e-06,2e-06,-1e-05,-1.5e-05,5e-06,1e-05,2.8e-05,1.2e-05,1e-05,-6e-06,-4e-06,-1.2e-05,4e-05,-1e-05,-6e-06,9e-06,-1.4e-05,1.7e-05,-2e-06,-4e-06,1e-06,-3.8e-05,6e-06,-1.6e-05,-1.3e-05,-2e-05,-7e-06,-8e-06,-2e-06,2.4e-05,-5e-06,2.6e-05,3.9e-05,-7e-06,1.5e-05,8e-06,1.1e-05,-1.6e-05,1.3e-05,-2.2e-05,-2e-06,3.2e-05,2.8e-05,3.1e-05,0,-2e-05,1e-06,1e-06,-2.3e-05,1e-06,-1e-05,3e-06,-3.1e-05,-4e-06,-1e-06,1.8e-05,-9e-06,-1.1e-05,-9e-06,-2e-06,-2.9e-05,0,-2.3e-05,4e-06,4.4e-05,7e-06,-1.4e-05,-2.9e-05,8e-06,0,3.8e-05,4e-06,7e-06,2e-06,-6e-06,6e-06,-6e-06,-2.4e-05,-3.3e-05,-1.3e-05,1.2e-05,-6e-06,1.7e-05,6e-06,1.8e-05,9e-06,-9e-06,-5e-06,-3e-06,3.7e-05
1e-05,4e-06,1.6e-05,6e-06,8e-06,-9e-06,-3e-06,-8e-06,-4e-06,1e-06,6e-06,1e-05,9e-06,8e-06,-1.3e-05,-2e-06,-1.9e-05,2e-06,4e-06,-1.9e-05,-1e-06,6e-06,-5e-06,-1.7e-05,-2e-06,-6e-06,2e-06,0,1e-06,-1.3e-05,-1.7e-05,-5e-06,-1.4e-05,-1e-06,1e-06,-1e-06,0,-9e-06,-1e-05,-1e-06,9e-06,8e-06,1.3e-05,-3.1e-05,1.3e-05,6e-06,-1e-06,-2e-06,-7e-06,-1e-06,-1.9e-05,-1e-06,1.2e-05,-4e-06,1.7e-05,7e-06,2.8e-05,-1.1e-05,-1e-06,-2e-06,-1e-06,-2e-06,-1.6e-05,-6e-06,1e-06,1.4e-05,-2e-06,-1.3e-05,1.2e-05,-4e-06,1.7e-05,0,-1.1e-05,-9e-06,-2.5e-05,1e-06,2e-06,4.3e-05,-1e-06,1.7e-05,1.1e-05,3e-05,-1.8e-05,2.3e-05,7e-06,-3e-06,-2.8e-05,9e-06,1.1e-05,-1e-06,5e-06,2.2e-05,3e-06,1.7e-05,1e-05,5e-06,0,2.4e-05,1.9e-05,2.7e-05,-6e-06,-1.9e-05,-9e-06,-1.4e-05,-7e-06,6e-06,-1.3e-05,2.9e-05,1.1e-05,8e-06,2.4e-05,-1.8e-05,-2e-06,-4e-06,-9e-06,-3.7e-05,7e-06,1.2e-05,-6e-06,1e-06,-2e-05
-9e-06,-4e-06,-1.4e-05,1e-06,-6e-06,-4e-06,-1e-06,9e-06,-4e-06,1e-05,-2e-06,-1.1e-05,-9e-06,3e-06,-3e-06,-1e-06,3e-06,0,-4e-06,1.8e-05,7e-06,-8e-06,1e-06,2e-06,-5e-06,-1.2e-05,-5e-06,8e-06,-7e-06,1e-05,2e-05,9e-06,1.4e-05,4e-06,1e-05,-4e-06,1.6e-05,1.7e-05,1.3e-05,-8e-06,-3e-06,-2e-06,-1.3e-05,2.4e-05,3e-06,-9e-06,-4e-06,8e-06,-2e-06,-2e-06,1.3e-05,1.4e-05,-6e-06,2e-06,-1.5e-05,2e-06,-3e-05,1.3e-05,-7e-06,3e-06,-2e-05,4e-06,1.2e-05,2e-06,7e-06,-1.6e-05,-5e-06,0,6e-06,-1.5e-05,-9e-06,5e-06,0,-3e-06,5e-06,-6e-06,1.8e-05,-6e-06,1e-06,1.2e-05,2e-06,-1.6e-05,2.2e-05,-1.7e-05,-6e-06,7e-06,1.7e-05,2e-06,-5e-06,1e-06,-2e-06,-6e-06,0,-4.5e-05,-2.3e-05,-2.3e-05,2e-06,-2.7e-05,-4e-06,-1.9e-05,9e-06,-2e-06,-3e-06,1.7e-05,2e-06,-6e-06,1.9e-05,-2.2e-05,-2e-06,4e-06,-7e-06,1.5e-05,0,-1e-06,1.1e-05,2.4e-05,-1.7e-05,2e-06,8e-06,0,1.5e-05
-5e-06,-1e-06,1.5e-05,-5e-06,8e-06,4e-06,0,-5e-06,0,-1.3e-05,5e-06,1.2e-05,3e-06,-7e-06,3e-06,0,0,-4e-06,-1e-06,-1.1e-05,-1.4e-05,9e-06,-6e-06,7e-06,9e-06,1.1e-05,-8e-06,-9e-06,5e-06,-3e-06,-1.7e-05,-6e-06,-1e-06,6e-06,-1e-05,-1e-06,-5e-06,-7e-06,-1.5e-05,3e-06,-2e-06,-4e-06,9e-06,-1.3e-05,-1e-06,1e-06,-4e-06,-1.4e-05,0,-3e-06,-5e-06,-1.4e-05,1.5e-05,-4e-06,-1e-06,-6e-06,1.4e-05,-1.1e-05,1.5e-05,-1.7e-05,2.3e-05,-1.1e-05,-1e-06,-1.6e-05,-8e-06,-4e-06,7e-06,8e-06,-1.7e-05,1.5e-05,-3e-06,-5e-06,0,2e-06,1e-06,7e-06,-2.1e-05,0,2e-06,-3e-06,-1.5e-05,-1e-05,-1.4e-05,1.4e-05,1.7e-05,-1.7e-05,-8e-06,-6e-06,8e-06,-8e-06,-4e-06,2e-06,0,3.6e-05,1e-05,8e-06,8e-06,1.9e-05,-2e-06,1.1e-05,7e-06,1.2e-05,8e-06,-5e-06,1e-05,0,-1e-06,-8e-06,-1e-06,-1.1e-05,0,-2.3e-05,5e-06,6e-06,2e-06,-2.3e-05,5e-06,-1.5e-05,2e-06,-1e-06,-2.1e-05
4e-06,2e-06,-7e-06,2e-06,-7e-06,-2e-06,3e-06,7e-06,1e-06,7e-06,-1e-06,-4e-06,0,-1e-06,-5e-06,1e-06,1.3e-05,5e-06,2e-06,-1e-06,2e-06,1e-06,1e-05,7e-06,-5e-06,-2e-06,8e-06,3e-06,-1.3e-05,3e-06,1.5e-05,-1e-06,-3e-06,-5e-06,6e-06,7e-06,2e-06,2e-06,1.6e-05,7e-06,-5e-06,6e-06,4e-06,-6e-06,-8e-06,6e-06,1e-06,5e-06,6e-06,3e-06,7e-06,7e-06,-3e-05,6e-06,0,9e-06,-7e-06,2e-06,-5e-06,8e-06,-1.7e-05,5e-06,-8e-06,2.1e-05,-5e-06,6e-06,2e-06,-8e-06,2.2e-05,-3e-06,1.2e-05,3e-06,-1.4e-05,4e-06,-7e-06,-5e-06,6e-06,-2.2e-05,0,-5e-06,1e-05,2e-05,4e-06,-1.1e-05,-7e-06,1.3e-05,9e-06,-1e-06,-9e-06,5e-06,6e-06,1e-06,1e-06,-3e-06,5e-06,-8e-06,-7e-06,-1.9e-05,4e-06,1.7e-05,-3e-06,-1.7e-05,-6e-06,7e-06,2e-06,3e-06,-9e-06,1.1e-05,-8e-06,1.6e-05,-8e-06,2.2e-05,-3e-06,-1.2e-05,-5e-06,1.3e-05,2e-06,1.5e-05,-6e-06,-1e-06,2.8e-05
-4e-06,-3e-06,9e-06,2e-06,6e-06,-6e-06,-1e-06,-4e-06,-1e-06,-1e-05,-3e-06,2e-06,-6e-06,1e-06,6e-06,-2e-06,-1.2e-05,0,6e-06,1.2e-05,0,-3e-06,-7e-06,-1e-05,3e-06,-4e-06,1e-06,8e-06,6e-06,1e-06,-1.5e-05,2e-06,0,-7e-06,0,2e-06,-6e-06,3e-06,-2.1e-05,-7e-06,0,-5e-06,-6e-06,2e-05,1.2e-05,4e-06,-3e-06,4e-06,-5e-06,0,-3e-06,-6e-06,2.6e-05,-3e-06,-1e-05,-4e-06,6e-06,7e-06,2e-06,-9e-06,1e-06,4e-06,1.3e-05,-1.2e-05,3e-06,-1.1e-05,-8e-06,1.1e-05,-2e-05,-3e-06,-1.5e-05,-3e-06,1.6e-05,-1.4e-05,3e-06,4e-06,1e-06,1.2e-05,-2e-06,-6e-06,1e-05,-6e-06,1e-06,6e-06,6e-06,-3e-06,-1.1e-05,0,9e-06,-3e-06,-4e-06,4e-06,-2e-06,-1.8e-05,1e-05,5e-06,-7e-06,2.4e-05,-6e-06,-1.6e-05,0,1.2e-05,2e-06,-3e-06,3e-06,-2e-06,1.3e-05,-1e-06,9e-06,-1.9e-05,-8e-06,-2e-06,0,1.5e-05,3e-06,-1.5e-05,-1e-06,-6e-06,0,3e-06,-2.2e-05
7e-06,-2e-06,-6e-06,-1e-06,0,-2e-06,-1e-06,-3e-06,2e-06,1.5e-05,-4e-06,-9e-06,1.3e-05,5e-06,1e-06,-2e-06,-2e-06,0,1e-06,-1.4e-05,1.1e-05,3e-06,6e-06,1e-06,-2e-06,2e-06,-3e-06,-4e-06,6e-06,-4e-06,4e-06,0,5e-06,3e-06,-3e-06,-5e-06,5e-06,-2e-06,1.8e-05,-3e-06,1e-05,4e-06,-2e-06,-1.9e-05,-1.3e-05,-7e-06,0,0,6e-06,4e-06,-6e-06,-4e-06,-1.3e-05,-3e-06,9e-06,3e-06,2e-06,-1.5e-05,-3e-06,4e-06,1.6e-05,-1e-06,-1.3e-05,-2e-06,3e-06,-9e-06,-2e-06,-1.2e-05,1.1e-05,8e-06,1.1e-05,2e-06,-1.6e-05,1.4e-05,-2e-06,-3e-06,-1e-06,-5e-06,-2e-06,4e-06,-1.2e-05,-1e-05,1e-06,-3e-06,-6e-06,5e-06,3e-06,5e-06,-8e-06,0,-3e-06,0,-1e-06,-5e-06,-1.7e-05,-5e-06,4e-06,-2e-05,1e-06,4e-06,-1e-06,7e-06,-4e-06,-2e-06,-6e-06,3e-06,-1.7e-05,9e-06,1e-06,1.7e-05,2e-05,1e-06,0,-1.2e-05,-7e-06,1.4e-05,1e-06,-6e-06,-1e-06,-1e-06,9e-06
8e-06,3e-06,2e-06,-3e-06,1e-06,2e-06,0,7e-06,2e-06,-5e-06,-1e-06,2e-06,-1.4e-05,-1e-06,-3e-06,-1e-06,3e-06,-1e-06,-8e-06,1.3e-05,-2e-06,-3e-06,-1e-05,2e-06,-1e-06,4e-06,-2e-06,-2e-06,-8e-06,7e-06,2e-06,-3e-06,-4e-06,1e-06,1e-05,-2e-06,0,1.2e-05,-1.3e-05,7e-06,-1e-05,-1e-06,-1e-06,2.2e-05,4e-06,4e-06,6e-06,-4e-06,-5e-06,0,9e-06,4e-06,1.8e-05,-5e-06,-3e-06,4e-06,-7e-06,1.4e-05,5e-06,-8e-06,-1.8e-05,-3e-06,1.2e-05,2e-06,-5e-06,5e-06,6e-06,3e-06,-9e-06,-1e-05,-7e-06,-1e-06,1.3e-05,-9e-06,1e-05,2e-06,8e-06,4e-06,0,-4e-06,-4e-06,1.1e-05,-1e-06,3e-06,-6e-06,3e-06,3e-06,-1e-06,5e-06,-2e-06,0,-6e-06,-1e-06,1.3e-05,8e-06,1e-06,0,1.6e-05,4e-06,8e-06,0,-1.9e-05,5e-06,1e-06,-2e-06,1e-06,5e-06,-1.2e-05,-8e-06,-1.5e-05,-4e-06,9e-06,4e-06,8e-06,0,-1e-05,-2e-06,7e-06,0,0,-5e-06
0,0,-2e-06,2e-06,1e-06,4e-06,-1e-06,-5e-06,1e-06,-4e-06,-1e-06,2e-06,1e-05,-3e-06,0,0,9e-06,1e-06,2e-06,-1.6e-05,-7e-06,5e-06,9e-06,-2e-06,4e-06,-1.1e-05,2e-06,3e-06,1e-06,-4e-06,-4e-06,6e-06,1e-06,1e-06,-8e-06,2e-06,2e-06,-6e-06,1.2e-05,-1e-06,6e-06,-1e-06,4e-06,-2.1e-05,3e-06,0,2e-06,5e-06,2e-06,-2e-06,2e-06,-7e-06,-2.1e-05,-1e-06,6e-06,-2e-06,2e-06,-5e-06,1e-06,1e-05,1e-05,1e-06,-8e-06,4e-06,3e-06,3e-06,4e-06,0,1e-06,1e-06,-2e-06,-1e-06,-4e-06,6e-06,-1e-05,1e-06,-1.5e-05,0,0,1e-06,9e-06,-4e-06,-7e-06,1e-06,5e-06,2e-06,6e-06,-4e-06,-6e-06,-2e-06,6e-06,1.3e-05,0,2e-06,-1e-06,7e-06,3e-06,-1.8e-05,-2e-06,-1.3e-05,-5e-06,1.2e-05,-8e-06,3e-06,2e-06,-1e-06,2e-06,-5e-06,9e-06,9e-06,-7e-06,-2e-06,1e-06,-2e-06,5e-06,1.1e-05,-6e-06,-2e-06,3e-06,1e-06,1e-05
-2e-06,-1e-06,-2e-06,1e-06,-4e-06,-2e-06,1e-06,0,0,2e-06,-2e-06,2e-06,-8e-06,3e-06,-2e-06,1e-06,-1.3e-05,-2e-06,2e-06,1.4e-05,-4e-06,-1e-06,-7e-06,-2e-06,-6e-06,1e-05,-1e-06,1e-06,0,0,6e-06,-5e-06,2e-06,-2e-06,-2e-06,0,2e-06,2e-06,-9e-06,-7e-06,-5e-06,0,-4e-06,1.2e-05,0,-3e-06,-4e-06,-4e-06,0,-3e-06,-8e-06,6e-06,1.5e-05,6e-06,3e-06,3e-06,3e-06,-9e-06,-4e-06,-1e-05,-1e-06,-3e-06,3e-06,1e-06,4e-06,-7e-06,-5e-06,-1e-06,4e-06,2e-06,8e-06,1e-06,0,-3e-06,5e-06,-3e-06,8e-06,1.1e-05,-1e-06,-5e-06,1e-06,-8e-06,1e-05,-2e-06,-7e-06,-2e-06,-8e-06,-1e-06,5e-06,1e-06,-2e-06,-9e-06,1e-06,-7e-06,-6e-06,-1.4e-05,-1e-06,1.6e-05,0,-2e-06,-1e-06,-4e-06,7e-06,-2e-06,1e-06,0,4e-06,1.7e-05,-1e-06,-4e-06,8e-06,-7e-06,-4e-06,-3e-06,-5e-06,-7e-06,2e-06,-4e-06,-3e-06,-1e-06,-1.1e-05
-3e-06,1e-06,1e-06,-3e-06,2e-06,-1e-06,0,0,0,-4e-06,3e-06,-1e-06,8e-06,1e-06,0,1e-06,3e-06,0,-6e-06,-4e-06,2e-06,-3e-06,6e-06,2e-06,1e-06,-2e-06,-3e-06,-3e-06,0,0,-7e-06,1e-06,0,2e-06,4e-06,0,0,-4e-06,6e-06,6e-06,2e-06,-4e-06,2e-06,-1e-06,-6e-06,1e-06,-2e-06,-1e-06,2e-06,1e-06,4e-06,0,-1e-05,-2e-06,-1e-06,1e-06,-4e-06,1.1e-05,-3e-06,5e-06,-1.1e-05,-2e-06,0,-9e-06,0,3e-06,-1e-06,2e-06,-5e-06,0,-9e-06,1e-06,3e-06,1e-06,-1e-06,3e-06,4e-06,-2e-06,0,1.1e-05,-1e-05,1e-05,-1e-05,2e-06,1.2e-05,0,4e-06,5e-06,-2e-06,-1e-06,-2e-06,-5e-06,1e-06,-1.1e-05,0,6e-06,2e-06,-1.4e-05,-2e-06,5e-06,4e-06,-1e-06,-3e-06,2e-06,0,0,-6e-06,-7e-06,-5e-06,-4e-06,-6e-06,8e-06,1e-06,5e-06,2e-06,1.1e-05,6e-06,6e-06,1e-06,1e-06,4e-06
-4e-06,0,-2e-06,0,-3e-06,2e-06,0,-1e-06,-1e-06,1.1e-05,2e-06,1e-06,-9e-06,1e-06,-1e-06,1e-06,1e-06,0,-2e-06,-4e-06,4e-06,1e-06,-6e-06,2e-06,2e-06,-7e-06,2e-06,0,1e-06,-3e-06,7e-06,1e-06,-5e-06,0,-4e-06,0,0,2e-06,-3e-06,1e-06,0,4e-06,-1e-06,-3e-06,7e-06,1e-06,3e-06,3e-06,-4e-06,2e-06,2e-06,1e-06,1.3e-05,-3e-06,2e-06,-4e-06,7e-06,-1e-05,2e-06,0,1.2e-05,1e-06,-5e-06,1.2e-05,-4e-06,7e-06,3e-06,-4e-06,6e-06,4e-06,8e-06,-1e-06,-8e-06,4e-06,0,-2e-06,-7e-06,-1e-05,0,-2e-06,1e-06,-1e-06,8e-06,-3e-06,-3e-06,2e-06,0,-1e-06,0,-1e-06,2e-06,8e-06,1e-06,2.2e-05,1.2e-05,8e-06,-6e-06,1.6e-05,1e-06,-7e-06,-2e-06,1e-05,0,-6e-06,-3e-06,1e-06,0,-6e-06,5e-06,1.1e-05,2e-06,-1e-05,2e-06,-5e-06,2e-06,-8e-06,-2e-06,-2e-06,1e-06,0,3e-06
-1e-06,-1e-06,3e-06,2e-06,1e-06,2e-06,-1e-06,1e-06,-1e-06,-1.1e-05,1e-06,-2e-06,7e-06,-3e-06,3e-06,1e-06,6e-06,1e-06,2e-06,8e-06,3e-06,-1e-06,7e-06,-2e-06,-3e-06,8e-06,-1e-06,4e-06,0,3e-06,-7e-06,-1e-06,5e-06,-2e-06,3e-06,-3e-06,-3e-06,0,0,-3e-06,-2e-06,-1e-06,0,9e-06,-3e-06,-4e-06,4e-06,-4e-06,4e-06,2e-06,3e-06,3e-06,-2.1e-05,0,-2e-06,2e-06,-8e-06,0,2e-06,1e-06,-6e-06,-3e-06,6e-06,-5e-06,3e-06,-3e-06,0,1e-06,-3e-06,-3e-06,-5e-06,0,9e-06,-1.1e-05,1e-06,1e-06,6e-06,-4e-06,1e-06,4e-06,7e-06,-9e-06,-4e-06,4e-06,1e-06,-4e-06,1e-06,-4e-06,2e-06,1e-06,-1e-06,-4e-06,0,-5e-06,-1e-05,-9e-06,-2e-06,-1.7e-05,1e-06,-4e-06,2e-06,-1e-05,0,4e-06,0,0,5e-06,5e-06,-1e-06,-1.4e-05,6e-06,-4e-06,-1e-06,6e-06,0,5e-06,0,-3e-06,0,-1e-06,-4e-06
1e-06,-1e-06,-3e-06,0,-3e-06,0,-1e-06,0,-1e-06,6e-06,1e-06,1e-06,-3e-06,-2e-06,2e-06,0,-9e-06,0,2e-06,-1.2e-05,-6e-06,1e-06,-6e-06,0,2e-06,-3e-06,-1e-06,-3e-06,-1e-06,-2e-06,6e-06,1e-06,-1e-06,-1e-06,1e-06,2e-06,1e-06,-3e-06,0,-1e-06,-1e-06,0,4e-06,-1.7e-05,0,1e-06,-3e-06,2e-06,-4e-06,0,-1e-05,-4e-06,2e-05,3e-06,-2e-06,0,5e-06,7e-06,-6e-06,-4e-06,0,0,-6e-06,1e-06,0,-2e-06,-5e-06,-2e-06,4e-06,-1e-06,1e-06,0,-7e-06,1e-05,-5e-06,-1e-06,-4e-06,3e-06,1e-06,-1.2e-05,-5e-06,8e-06,2e-06,-4e-06,1e-06,1e-06,-3e-06,-1e-06,-3e-06,-1e-06,1e-06,-3e-06,-1e-06,-4e-06,1e-06,5e-06,3e-06,1.5e-05,1e-06,6e-06,2e-06,1e-06,0,-2e-06,1e-06,-1e-06,-6e-06,-2e-06,-4e-06,1.4e-05,-5e-06,1e-05,-1e-06,-5e-06,2e-06,-4e-06,2e-06,3e-06,3e-06,1e-06,1e-06
2e-06,1e-06,3e-06,-1e-06,1e-06,-1e-06,1e-06,-2e-06,0,-4e-06,0,-3e-06,0,2e-06,-6e-06,-1e-06,-1e-06,1e-06,1e-06,1.5e-05,-1e-06,-1e-06,3e-06,3e-06,0,-2e-06,-2e-06,-2e-06,-4e-06,1e-06,-3e-06,1e-06,-2e-06,1e-06,-1e-06,2e-06,-2e-06,1e-06,-1e-06,3e-06,2e-06,1e-06,-3e-06,1.7e-05,-1e-06,3e-06,-3e-06,-3e-06,2e-06,-2e-06,4e-06,2e-06,-1.4e-05,1e-06,1e-06,-1e-06,-2e-06,-9e-06,1e-06,2e-06,5e-06,-1e-06,5e-06,-5e-06,-3e-06,7e-06,0,2e-06,-3e-06,1e-06,4e-06,0,4e-06,-1e-05,3e-06,0,3e-06,8e-06,-1e-06,4e-06,-7e-06,2e-06,1e-06,2e-06,-8e-06,2e-06,2e-06,2e-06,2e-06,-1e-06,-1e-06,4e-06,-1e-06,-5e-06,2e-06,-1e-06,1e-06,-1.2e-05,-1e-06,-2e-06,1e-06,5e-06,-1e-06,2e-06,0,0,6e-06,6e-06,2e-06,-1.2e-05,4e-06,-1e-05,0,3e-06,-4e-06,2e-06,-1e-06,1e-06,-2e-06,-1e-06,-1e-06
1e-06,1e-06,-2e-06,1e-06,1e-06,1e-06,0,1e-06,0,5e-06,-2e-06,3e-06,-1e-06,1e-06,6e-06,-2e-06,6e-06,0,-1e-06,-1.4e-05,-1e-06,-1e-06,-3e-06,-5e-06,0,3e-06,3e-06,6e-06,3e-06,1e-06,2e-06,-2e-06,-1e-06,0,4e-06,-2e-06,3e-06,-3e-06,2e-06,1e-06,4e-06,-2e-06,0,-1.3e-05,3e-06,-3e-06,0,2e-06,-2e-06,0,5e-06,-2e-06,1.3e-05,-1e-06,-5e-06,1e-06,-1e-06,6e-06,3e-06,-1e-06,-6e-06,-1e-06,-4e-06,5e-06,0,0,5e-06,0,0,-1e-06,-6e-06,0,-3e-06,1.1e-05,-2e-06,0,-1e-06,-2e-06,0,-4e-06,5e-06,-8e-06,-3e-06,-2e-06,5e-06,-2e-06,4e-06,1e-06,-3e-06,0,1e-06,0,-1e-06,1.1e-05,0,-4e-06,2e-06,1.4e-05,-1e-06,-4e-06,-1e-06,-4e-06,1e-06,-1e-06,2e-06,0,-2e-06,-6e-06,0,1e-05,-4e-06,1e-06,1e-06,-1e-06,1e-06,-3e-06,-1e-06,-3e-06,-2e-06,0,6e-06
0,-1e-06,4e-06,1e-06,1e-06,1e-06,1e-06,1e-06,0,-4e-06,-3e-06,0,0,-2e-06,0,-1e-06,1e-06,-1e-06,2e-06,9e-06,5e-06,1e-06,4e-06,0,0,0,0,-4e-06,0,-1e-06,-3e-06,0,4e-06,0,-3e-06,0,0,2e-06,-2e-06,-4e-06,-5e-06,2e-06,1e-06,1e-05,-4e-06,2e-06,0,-1e-06,2e-06,-1e-06,-7e-06,-1e-06,-1.7e-05,0,4e-06,-2e-06,2e-06,2e-06,2e-06,-4e-06,4e-06,0,2e-06,-3e-06,4e-06,-7e-06,1e-06,0,-1e-06,1e-06,7e-06,-1e-06,0,-1.2e-05,3e-06,0,-5e-06,-1e-06,1e-06,7e-06,6e-06,6e-06,5e-06,2e-06,-4e-06,1e-06,-1e-06,-2e-06,3e-06,-1e-06,0,-1e-06,0,0,-6e-06,8e-06,0,-1.5e-05,0,6e-06,-4e-06,2e-06,1e-06,-1e-06,0,1e-06,-4e-06,-4e-06,-2e-06,-6e-06,-3e-06,8e-06,1e-06,0,2e-06,0,2e-06,2e-06,2e-06,1e-06,-1e-05
0,1e-06,-2e-06,-2e-06,1e-06,1e-06,0,-2e-06,0,2e-06,-1e-06,1e-06,3e-06,-2e-06,-5e-06,1e-06,-6e-06,-1e-06,2e-06,-3e-06,-1e-06,0,-3e-06,4e-06,-1e-06,-3e-06,-2e-06,-3e-06,-1e-06,1e-06,0,0,-2e-06,1e-06,-2e-06,-1e-06,-2e-06,0,2e-06,2e-06,1e-06,-2e-06,1e-06,-5e-06,-1e-06,0,-2e-06,-2e-06,-3e-06,1e-06,2e-06,1e-06,1.7e-05,-1e-06,-3e-06,2e-06,-3e-06,-9e-06,-3e-06,2e-06,-2e-06,0,1e-06,0,-2e-06,3e-06,-4e-06,1e-06,-1e-06,0,-5e-06,0,0,1.4e-05,-1e-06,0,9e-06,-1e-06,0,-7e-06,-6e-06,2e-06,-7e-06,-1e-06,5e-06,-2e-06,-3e-06,-1e-06,-3e-06,-1e-06,0,0,0,-9e-06,2e-06,-5e-06,-1e-06,1.1e-05,0,0,2e-06,-4e-06,-1e-06,-1e-06,-1e-06,0,1e-06,1.3e-05,-1e-06,2e-06,1e-05,0,-1e-06,0,-3e-06,1e-06,1e-06,0,0,-1e-06,9e-06
1e-06,1e-06,3e-06,-1e-06,0,-1e-06,-1e-06,1e-06,0,-5e-06,0,-1e-06,-6e-06,1e-06,5e-06,1e-06,1e-06,-1e-06,0,-2e-06,-3e-06,0,2e-06,1e-06,2e-06,3e-06,0,7e-06,-1e-06,-1e-06,3e-06,0,-2e-06,0,0,0,-2e-06,0,-3e-06,3e-06,-1e-06,1e-06,-1e-06,-4e-06,5e-06,-1e-06,0,4e-06,3e-06,1e-06,2e-06,-1e-06,-1.3e-05,1e-06,3e-06,0,1e-06,7e-06,-1e-06,-1e-06,-1e-06,1e-06,-2e-06,-2e-06,-1e-06,3e-06,-1e-06,0,0,0,2e-06,0,-3e-06,-1.2e-05,0,0,-3e-06,-2e-06,-1e-06,9e-06,-3e-06,-8e-06,8e-06,0,2e-06,1e-06,-1e-06,1e-06,2e-06,1e-06,-1e-06,3e-06,0,-3e-06,7e-06,-1e-06,-3e-06,-1.1e-05,1e-06,-3e-06,-1e-06,1e-06,1e-06,1e-06,-1e-06,0,2e-06,-5e-06,3e-06,5e-06,-5e-06,-4e-06,0,0,1e-06,0,-3e-06,-1e-06,0,1e-06,-6e-06
-1e-06,-1e-06,-2e-06,2e-06,1e-06,0,-1e-06,-1e-06,0,1.1e-05,-1e-06,0,7e-06,2e-06,-2e-06,0,3e-06,0,-3e-06,8e-06,-4e-06,0,-2e-06,-3e-06,-1e-06,0,0,-4e-06,-2e-06,0,-4e-06,0,1e-06,-1e-06,0,1e-06,-3e-06,-1e-06,4e-06,-3e-06,2e-06,1e-06,-2e-06,1e-05,-6e-06,0,3e-06,-3e-06,-3e-06,0,-3e-06,1e-06,1.2e-05,1e-06,0,-1e-06,1e-06,-2e-06,4e-06,0,2e-06,-1e-06,2e-06,5e-06,2e-06,-5e-06,4e-06,1e-06,-1e-06,-1e-06,2e-06,0,4e-06,1.2e-05,1e-06,0,-5e-06,-5e-06,-1e-06,-4e-06,8e-06,5e-06,-9e-06,0,-2e-06,-1e-06,4e-06,2e-06,-1e-06,-2e-06,0,-1e-06,0,1.1e-05,-5e-06,3e-06,-1e-06,1.5e-05,0,3e-06,-2e-06,3e-06,-1e-06,-1e-06,0,0,4e-06,-5e-06,-1e-06,-9e-06,-3e-06,4e-06,1e-06,0,1e-06,-2e-06,0,1e-06,-2e-06,0,7e-06
-1e-06,-1e-06,0,0,-1e-06,0,0,-1e-06,0,-1.2e-05,1e-06,0,-7e-06,0,-2e-06,0,5e-06,0,-2e-06,-1.1e-05,2e-06,0,2e-06,0,-1e-06,-4e-06,1e-06,-3e-06,0,1e-06,4e-06,1e-06,1e-06,0,1e-06,-1e-06,1e-06,-1e-06,-4e-06,-1e-06,-1e-06,-2e-06,3e-06,-1.3e-05,4e-06,2e-06,0,-2e-06,2e-06,0,5e-06,1e-06,-1.6e-05,-1e-06,0,0,-2e-06,-5e-06,-1e-06,-3e-06,-2e-06,-2e-06,-3e-06,-5e-06,1e-06,-2e-06,0,0,2e-06,0,-6e-06,0,-4e-06,-1.3e-05,-3e-06,0,4e-06,4e-06,0,4e-06,1e-06,3e-06,9e-06,0,3e-06,2e-06,-1e-06,-1e-06,1e-06,0,1e-06,-3e-06,1e-06,-3e-06,-4e-06,-2e-06,2e-06,-1.3e-05,-1e-06,2e-06,2e-06,-2e-06,2e-06,1e-06,1e-06,0,-7e-06,4e-06,-2e-06,1.2e-05,4e-06,-3e-06,-1e-06,0,0,1e-06,0,0,-1e-06,0,-1e-05
