-0.004185,-0.005132,-0.007545,-0.00572,-0.003938,-0.0045,-0.003085,-0.002596,-0.002542,-0.002908,-0.003188,-0.002667,-0.002258,-0.00282,-0.002739,-0.002508,-0.002894,-0.001934,-0.001795,-0.002427,-0.001905,-0.001901,-0.002943,-0.002805,-0.00323,-0.002357,-0.001756,-0.002394
-0.001184,-0.00148,-0.002846,-0.00285,-6.7e-05,0.001052,0.001141,0.001442,-0.000456,-0.001816,-0.00283,-0.002144,-0.00097,-0.001485,-0.000892,-0.001088,-0.001363,-0.001093,-0.000902,-0.002203,-0.001538,-0.001795,-0.003199,-0.002873,-0.002861,-0.00153,-0.001038,-0.001884
-0.000718,-0.000523,-1.9e-05,-0.000194,-2.8e-05,0.000474,-0.000902,-0.000978,-0.001261,-0.001814,-0.002325,-0.001804,-0.001014,-0.000858,-0.000378,-0.000504,-0.001341,-0.00104,-0.001512,-0.001509,-0.001137,-0.00108,-0.00097,-0.000653,-0.000163,2.7e-05,5e-06,0.000328
-0.00026,0.000419,0.002173,0.00196,-0.000882,-0.00137,-0.002357,-0.002757,-0.001214,-0.000916,-0.000343,-3e-04,-0.000711,5e-06,8.1e-05,0.000419,-0.000513,-0.000766,-0.001406,-0.000417,-0.000456,0.000123,0.001898,0.001617,0.001829,0.000986,0.000475,0.00156
0.002963,0.003872,0.005719,0.004152,0.00244,0.002627,0.002287,0.001898,0.001829,0.00207,0.002741,0.002326,0.001513,0.00206,0.00203,0.002223,0.002304,0.000745,0.000823,0.00104,0.000917,0.001278,0.002816,0.00202,0.001679,0.00125,0.000738,0.000961
-3.3e-05,-0.00054,-0.001563,-0.001222,0.000648,0.000253,0.000433,0.000592,0.000119,0.000448,0.000708,0.000572,0.000413,0.000162,-2.6e-05,-0.000157,-6.1e-05,-0.000241,-8e-06,-0.000281,0.000106,-2.3e-05,-0.000399,-0.000693,-0.001111,-0.000682,-0.000359,-0.001009
-0.003525,-0.004599,-0.007767,-0.005588,-0.00281,-0.003755,-0.002886,-0.00243,-0.001679,-0.001636,-0.001589,-0.001483,-0.001187,-0.001837,-0.002263,-0.002484,-0.002467,-0.000718,-0.000675,-0.000636,-0.000265,-0.000974,-0.002949,-0.002235,-0.002182,-0.001622,-0.000874,-0.001367
0.000762,0.001151,0.000794,0.000267,0.000795,0.001617,0.001763,0.001892,0.001609,0.001257,0.000881,0.000523,0.000824,0.000738,0.00052,7.3e-05,0.001153,0.001719,0.001893,0.001901,0.001473,0.000701,-0.000904,0.00016,0.000785,0.00065,0.000626,0.000537
0.002687,0.003119,0.005785,0.004219,0.002211,0.003234,0.002655,0.002434,0.001674,0.002106,0.00173,0.001136,0.001096,0.00148,0.00163,0.001504,0.002473,0.001645,0.001695,0.001617,0.000899,0.001397,0.001794,0.002011,0.00241,0.001532,0.00091,0.001157
-0.000232,-0.000848,0.000533,0.001197,-0.001392,-0.002437,-0.001559,-0.001702,-0.001056,-0.000373,-4.1e-05,-9e-05,-0.00079,-0.000816,-0.000503,0.000326,4.1e-05,-0.000562,-0.00052,-0.000682,-0.000962,0.000289,0.00218,0.001041,0.000308,-0.000186,-0.000415,-4e-06
0.000179,-4e-06,-0.00084,-0.000373,-0.000396,-0.001322,-0.000221,2.9e-05,-0.000135,-0.000597,-0.000386,0.000181,-0.000238,-0.000627,-0.000251,0.000402,-6.9e-05,-0.00054,-0.000217,-0.000627,-0.000423,-0.000138,0.001071,-0.000273,-0.001278,-0.000646,-0.000427,-0.000438
0.000156,0.000333,-0.001291,-0.001551,0.001197,0.001757,0.000866,0.001128,-0.000164,-0.000771,-0.001211,-0.000536,0.000289,0.000115,0.000127,-0.000455,-0.000968,-0.000575,-0.000595,-0.000547,-0.000119,-0.00078,-0.001434,-0.001417,-0.001096,-0.000187,0.000103,-0.000202
-0.002657,-0.002529,-0.003871,-0.003228,-0.001632,-0.00119,-0.002307,-0.002439,-0.00181,-0.002029,-0.00222,-0.001743,-0.00079,-0.000536,-0.00106,-0.00191,-0.00285,-0.00139,-0.001876,-0.001291,-0.001109,-0.001646,-0.002949,-0.001819,-0.000694,-0.000517,-0.000368,-0.000259
-0.00089,1.1e-05,0.000923,0.000559,-0.000742,-0.000508,-0.000896,-0.00107,0.000307,-0.000267,-0.000129,-0.000122,-0.000156,0.000492,0.000219,8.8e-05,-0.000114,-8.9e-05,-0.000303,-0.000183,-0.000255,-0.000281,-0.000708,-3.9e-05,0.000354,-0.000119,-0.000197,0.000115
0.002357,0.002754,0.005356,0.003903,0.002063,0.002463,0.001996,0.001891,0.001573,0.001741,0.001931,0.001237,0.000709,0.001147,0.001513,0.001903,0.002507,0.000898,0.000916,0.000751,0.000857,0.001289,0.00192,0.001481,0.001078,0.00052,0.000598,0.000513
0.000773,-0.000272,-8.9e-05,0.00029,-0.000279,-0.000923,-0.000224,-0.000254,-0.00051,0.000668,0.001413,0.000631,-0.000118,-0.000683,-0.000336,0.000349,0.000608,1e-04,9.8e-05,0.000331,0.000618,0.000914,0.001651,0.000718,0.000154,2.4e-05,0.00044,0.000208
-0.000701,-0.001011,-0.003403,-0.00228,-0.001396,-0.002377,-0.000802,-0.000556,-0.000286,0.000121,0.00061,0.000494,-0.000122,-0.00106,-0.001095,-0.000709,-0.000409,0.00026,0.000538,0.000633,0.000452,0.00015,0.00011,-0.000261,-0.000401,-9.2e-05,-8.1e-05,-0.000199
1.4e-05,0.000598,-0.000465,-0.000578,0.001047,0.001657,0.001675,0.001623,0.000805,0.00061,-0.00034,-8.3e-05,0.000408,0.000295,0.000178,-0.000485,0.000143,0.000686,0.001029,0.000677,-8.2e-05,-0.000306,-0.001172,-0.000435,0.000234,0.000411,-0.000303,-0.000333
-0.000533,-0.000917,0.000113,0.000275,0.000323,0.001206,0.000518,0.000148,-0.000117,-0.000288,-0.001456,-0.001114,-0.00022,0.000296,0.000279,-0.00055,-0.000629,-0.000105,-0.000123,-0.000534,-0.001015,-0.000574,-0.001271,-0.000531,-2.7e-05,-0.000126,-0.000578,-0.000271
