-0.000345,-2.5e-05,-0.000314,-0.000153,-0.000574,-0.000762,-0.000652,-0.000247,-0.000478,-0.000744,-0.000282,-0.000684,-0.000156,-4e-05,-0.000531,-0.000459,-0.000494,-0.000474,-0.000111,-0.00036,-0.000407,-0.000488,-0.000568,-0.000489,-0.00059,-0.00075,-0.000684,-0.000516,-0.000382,-0.000657,-0.000482,-0.000167,-0.00034,-0.000767,-0.000259,-0.000476,-0.00034,-7.4e-05,-0.000249,-0.000391,-0.00021,-0.000535,-0.000487,-0.000568,-0.000372,-0.000717,-0.000687,-0.000379,-4e-05,-0.000444,-0.000355,-0.000253,-0.000263,-0.000367,-0.000262,-0.000255,-0.00018,-0.000389,-0.000262,-0.000289,-0.000617,-0.000412,-0.000234,-0.000371,-0.000143,-0.000361,-0.00035,-0.000276,-0.000202,-0.00031,-0.00015,-0.000171,-0.000166,-0.000148,0.000128,-0.000357,-0.000267,-0.000285,-0.000238,9.6e-05,-1.9e-05,-9.5e-05,-0.000345,-0.000349,-0.000368,-4.8e-05,-0.00031,-0.000347,-0.000127,-0.000188,-0.000225,-0.000421,-0.000304,-5.1e-05,1.2e-05,-0.000294,-0.000336,-0.000184,-0.000222,-9.3e-05,-0.000508,-0.000221,0.000218,5e-06,-0.000552,-0.000354,-0.000211,-0.000205,-0.000364,-0.000398,-4e-06,-2.9e-05,2.5e-05,-0.000193,-0.000167,-0.000247,-0.000237,-0.000219,-0.000158,-0.00014,-0.000241
5.4e-05,-0.000474,-0.000433,-0.000373,0.000374,9.5e-05,7.4e-05,3.6e-05,5e-05,0.000234,-4.8e-05,0.000326,0.000183,2.2e-05,0.000159,9.2e-05,0.000356,5.7e-05,-0.000153,7e-06,0.000344,0.000369,0.00039,5.7e-05,-0.000147,0.000377,0.000302,0.000158,0.000194,0.000223,1.8e-05,-0.000144,0.000213,0.000537,0.000113,-0.000302,-0.000191,-5.8e-05,-0.000105,6.9e-05,-0.000146,8.8e-05,0.000251,1.7e-05,-0.000144,0.000198,0.000274,-4e-05,-2.8e-05,-2.2e-05,0.000158,5.7e-05,-0.000165,-0.000311,-0.000326,-1e-06,3e-05,-0.000133,4.8e-05,0.000102,0.000357,5.1e-05,0.000118,0.00019,-0.000266,8.8e-05,7.5e-05,-3e-05,1e-04,-3.7e-05,6.1e-05,-3.2e-05,-2.8e-05,-0.00011,-0.000158,8.4e-05,-0.000134,-0.000219,-0.000101,-0.000172,-0.000104,-0.000176,-0.000109,-3e-05,6.7e-05,-0.000145,-0.000118,0.000254,0.000245,1.6e-05,-0.000101,0.000108,-2.6e-05,0.000177,2.7e-05,0.000116,0.00029,0.000124,0.000229,-1.7e-05,0.000185,-0.000188,3.1e-05,1e-06,0.000289,9.2e-05,-1.2e-05,-6e-06,0.000117,0.000112,0.00012,-0.000355,-0.000148,9.1e-05,0.000102,0.000114,0.000231,-1e-05,8.8e-05,6e-06,-5.1e-05
-0.000207,1.8e-05,0.000155,0.000142,-0.000147,-0.000284,1.2e-05,-0.00016,-5.3e-05,-0.000254,0.000114,-0.000256,-9.5e-05,-0.000195,-3.3e-05,0.000202,-0.000129,-0.00028,-0.000297,-0.00018,-0.000221,-0.000263,-0.000389,-0.000289,2.3e-05,-0.000301,-0.000243,-0.000221,-0.00046,-0.000153,-2.8e-05,-6.6e-05,4.1e-05,-0.00047,2.6e-05,0.000451,0.000193,-0.000122,-2.2e-05,0.000167,-6e-06,-0.000127,-0.000388,0.000145,7e-05,-0.000201,-0.000237,-0.000137,-0.000103,1.5e-05,-9.1e-05,7.8e-05,0.000237,0.00035,0.000242,9.4e-05,0.000108,0.000208,-1e-06,0.000168,-0.000495,-0.000287,-1e-06,-8.6e-05,-8.7e-05,-0.000256,-7.6e-05,0.000125,9.1e-05,0.000103,-0.000128,-0.000388,-7.9e-05,-0.000116,-6.7e-05,4.6e-05,-1.8e-05,2.3e-05,7.3e-05,5e-06,-0.000129,5.2e-05,5.6e-05,0.000101,2.2e-05,0.000121,1.3e-05,-0.000319,-0.000281,-0.000256,-2.6e-05,-0.000175,-4.3e-05,-0.000274,-0.00016,-0.000125,-0.000429,-2e-04,-0.000178,-0.000167,-5.8e-05,0.000161,-0.000121,-0.000144,-0.000202,-0.000146,-0.00028,-0.000116,-7.5e-05,6.8e-05,8e-06,-0.000128,-0.000167,-0.000114,-4.7e-05,-0.00013,-0.000122,0.000101,6.8e-05,0.000123,-6e-05
-0.000191,-0.000229,-0.000198,-0.000381,-0.000157,0.00021,-1e-05,2.2e-05,0,-0.000106,-0.000113,0.000164,-0.000149,-0.000232,-0.000379,-0.000311,-0.000379,-2.6e-05,-0.000126,-4.5e-05,-0.000155,-6.7e-05,0.000273,0.000552,0.000222,0.000243,1e-06,0.000332,0.000267,-3.4e-05,-0.000381,-3.4e-05,-3.7e-05,0.000203,-0.000139,-0.000346,-0.000126,2.3e-05,-0.000217,-0.000476,-8e-06,0.000117,0.000163,-0.000114,-0.000162,9.5e-05,0.000103,-1.9e-05,-2.7e-05,4.8e-05,-8e-05,-8.8e-05,-5e-05,-0.00026,-0.000355,-0.000132,-0.000138,-2e-05,-0.000139,-0.000224,-6.1e-05,0.000121,4.3e-05,-0.000152,4.6e-05,8e-06,-0.000144,-3.2e-05,-6.2e-05,-0.000107,-3.4e-05,0.000143,-9.6e-05,6.6e-05,-8.7e-05,-0.000125,6.7e-05,-9e-06,-0.000107,-0.000144,-9.1e-05,-4.5e-05,-0.000188,-0.000366,-0.000144,-0.000101,-3.7e-05,0.000159,-0.000121,-6.8e-05,-0.000128,-2.5e-05,3.2e-05,-0.000105,-1e-05,-2.2e-05,0.000144,-0.000105,-2.7e-05,-0.000161,-8.6e-05,-9.7e-05,-0.000169,-8.9e-05,9.1e-05,6.1e-05,0.000136,0.000108,3.8e-05,-0.000175,-0.000265,-0.00015,-6.7e-05,-1.4e-05,6e-05,3.6e-05,-6.5e-05,-0.000101,-4e-05,-0.000199,0.000164
0.000248,0.000202,0.000424,0.000297,-2e-05,-0.000228,-7.1e-05,-9e-05,4.1e-05,8.8e-05,0.000143,-0.000244,-0.000208,0.000169,0.00028,0.000294,0.000187,-0.000149,-7.4e-05,0.000154,0.000247,0.000164,-0.000254,-0.000185,-0.000188,-0.000251,-0.000184,-0.00044,-2e-04,-2.8e-05,0.000307,0.000231,-5.3e-05,-0.000232,-0.000223,-1.7e-05,-3.9e-05,-4.3e-05,1.3e-05,0.000207,-1.6e-05,2.9e-05,-1.7e-05,-4.9e-05,0.000209,0.000133,-3.9e-05,0.000117,9.7e-05,-0.000149,0.000139,0.000132,5.1e-05,0.000219,0.000292,-2.7e-05,7e-06,-0.000152,7e-05,7.6e-05,0.000459,9.7e-05,-9.4e-05,-3.9e-05,4e-06,-3.4e-05,0.000178,-2.5e-05,-1.3e-05,-2e-05,-9.7e-05,-8e-05,-1.3e-05,4e-06,-9e-06,4.3e-05,0.000172,-8.7e-05,8.2e-05,8.8e-05,3.2e-05,0.00016,8.1e-05,0.000205,0.000149,-0.000173,0.000119,-6.7e-05,4e-06,0.000332,0.000223,9.8e-05,-8.3e-05,3e-05,-0.000102,7.4e-05,2.5e-05,-0.000138,-1.8e-05,6.8e-05,0.000181,0.000104,1.8e-05,3.4e-05,-1e-06,-7.4e-05,2.5e-05,-2.4e-05,5.5e-05,6.2e-05,0.000251,0.000396,0.000274,-4.8e-05,-5.5e-05,-3.5e-05,8e-06,-2.9e-05,3.4e-05,-1.5e-05,-5.2e-05
-0.000162,9.8e-05,-0.000147,0,1.3e-05,6.9e-05,2.8e-05,1.8e-05,-8.5e-05,-6e-06,-0.000177,8.9e-05,0.000141,0.000169,-0.00018,-7e-05,-0.000136,4.2e-05,0.000256,-0.000101,-0.000329,-0.000133,9.1e-05,7.3e-05,0.000113,-1.6e-05,9.7e-05,0.000209,0.000251,-0.000213,-0.000174,-0.000253,-0.000106,1.2e-05,0.000129,-4.3e-05,0.000108,1.1e-05,-5.4e-05,-0.000143,-3.3e-05,-0.000334,0.000203,2.8e-05,-3.4e-05,-0.000153,7.1e-05,1.2e-05,-5e-05,7.2e-05,-0.000118,-0.000156,2.1e-05,-0.00019,-0.000111,6.2e-05,3.2e-05,7.4e-05,-0.000131,-0.000167,-0.000259,-0.00024,-2.6e-05,0.000149,8e-05,7.1e-05,-5.9e-05,5.6e-05,-1e-06,-0.000136,0.000238,8.2e-05,0.000157,-2.1e-05,0.000132,0.000101,-9.6e-05,3.8e-05,-0.00011,-2.4e-05,2.6e-05,3.6e-05,-1.7e-05,-1.6e-05,5.9e-05,0.000217,-0.000117,3.5e-05,0.000169,-0.000135,-0.000231,-5.6e-05,0.000139,3.2e-05,0.000152,0.000143,-7.4e-05,-6e-05,-0.000192,0.000163,1.4e-05,-7e-06,-2.5e-05,-6.4e-05,-5.9e-05,-6.4e-05,5.1e-05,0.000111,-7.1e-05,-4e-05,-0.000183,-0.000125,-0.000107,6.4e-05,-2.2e-05,5.1e-05,-7.7e-05,5.9e-05,0.000103,9.4e-05,7e-06
0.000198,7.9e-05,-5.8e-05,-0.000184,-0.000175,-0.000111,-0.000125,3.5e-05,-4.5e-05,-5.1e-05,2e-04,2.3e-05,-4.6e-05,0.000142,-0.000124,4.7e-05,-1.1e-05,0.000121,7.6e-05,0.000155,0.000141,0.000289,6.9e-05,6.3e-05,9.7e-05,-0.00015,0.000115,-0.000127,-0.000277,-5e-06,8.6e-05,0.00022,6.1e-05,8e-05,-5.4e-05,-3.4e-05,-0.000216,-8.2e-05,0.000305,0.000158,0.000159,0.000209,-0.000151,5e-05,-0.000132,-4.4e-05,-0.00016,2e-06,0.000175,-3.3e-05,0.000145,3.1e-05,9.1e-05,-4.4e-05,-0.000109,-5.8e-05,-9.5e-05,-9.3e-05,8.9e-05,0.000123,0.00026,0.000127,-1.8e-05,5e-06,-8.2e-05,0.000122,0.000199,-6.1e-05,-0.000109,8.6e-05,-0.000154,5.9e-05,4.6e-05,-3.1e-05,-2e-06,-0.000109,9.2e-05,9.7e-05,5e-06,6.2e-05,9.3e-05,-1.9e-05,0.000122,-3.9e-05,-0.000191,-0.000129,-3.8e-05,-5.5e-05,-3.4e-05,8.1e-05,6.2e-05,1.8e-05,-0.000163,-0.000106,0.000182,-3e-06,7.1e-05,0.000173,9.3e-05,-9e-05,-3e-06,-0.000117,8e-05,8e-06,-3.6e-05,8e-05,-3.4e-05,-0.000105,3e-06,2.4e-05,8.4e-05,4.2e-05,-2.6e-05,1e-05,5e-05,-4.4e-05,8e-05,5e-06,-0.000105,-3.1e-05,-6.5e-05
-0.000183,-3e-05,7e-05,7e-06,6e-05,0.000106,-2.9e-05,-0.00014,-2.6e-05,5.6e-05,-0.00017,-0.000142,7e-05,-0.000164,3e-05,-4.2e-05,0.000118,0.000144,-0.000287,-7.1e-05,-0.000179,0.00012,-4.3e-05,-5e-06,-7.1e-05,8e-06,-7.6e-05,-5.9e-05,0.000211,0.000244,9.7e-05,-2.1e-05,6.5e-05,-1.9e-05,8.2e-05,8e-05,0.000173,-1e-06,-5.3e-05,-1.7e-05,-6.6e-05,-1.4e-05,8.4e-05,1.5e-05,6.7e-05,0.000113,0.000121,5e-06,-8e-06,2.8e-05,-9e-06,-4.7e-05,-9.8e-05,6.7e-05,6.2e-05,-2e-05,8e-06,7.5e-05,4.1e-05,-9.1e-05,-0.000243,-2.2e-05,9e-05,3.4e-05,-2.9e-05,-1.7e-05,-0.00021,8e-06,9e-05,-0.000114,7.3e-05,-4.6e-05,0.000106,1.6e-05,-6.6e-05,-4.3e-05,4e-05,-8.2e-05,8.5e-05,7e-06,5.3e-05,-5.8e-05,-9.6e-05,-7.1e-05,0.00015,0.000142,9.3e-05,1.2e-05,0.000126,-5.4e-05,-0.000154,-4.6e-05,4.5e-05,2e-05,-5.5e-05,-5.2e-05,-0.000111,-3.3e-05,-5.1e-05,0.000146,-1.6e-05,9.4e-05,-4.4e-05,-0.000133,5.3e-05,-3.7e-05,7.9e-05,-6.9e-05,6e-06,-8e-06,-6.3e-05,-0.000126,4e-06,4.9e-05,-6.5e-05,1.7e-05,-2.8e-05,-5.3e-05,5.8e-05,0.000104,7e-06
0.000114,-0.000125,-0.000105,3.4e-05,8.2e-05,-3e-06,5.3e-05,0.000225,0.000131,2.6e-05,0.000137,0.000166,1.6e-05,0.000154,0.000147,-9.9e-05,-8e-06,-8.3e-05,0.000172,5.2e-05,0.000173,-0.000155,1.8e-05,-2.1e-05,6e-05,0.000226,8.5e-05,0.000225,-6.4e-05,-0.000111,-7e-06,0.000147,5.7e-05,1.7e-05,-0.00013,7.5e-05,-0.000114,5.2e-05,3e-06,6.8e-05,0.000105,-7e-06,3.5e-05,6.3e-05,-2.3e-05,-0.000127,-1e-05,-4.6e-05,-0.000143,-0.000111,-0.000108,-4.6e-05,-3e-06,-1.5e-05,-1.6e-05,9.1e-05,5.4e-05,1.8e-05,-0.000108,0.000107,-2e-06,9.9e-05,7e-06,-1e-06,9e-06,-8.8e-05,8.7e-05,1.8e-05,-3.7e-05,9.1e-05,5e-06,-2.2e-05,-3.8e-05,4.7e-05,6.6e-05,1.2e-05,-2.4e-05,2.4e-05,2e-05,-2.7e-05,-0.00011,-2e-05,-4.7e-05,-1.2e-05,-0.000232,-0.000163,-0.000149,3.6e-05,-8.5e-05,-6.7e-05,0.000151,8.9e-05,-1.3e-05,3.8e-05,5e-06,2e-05,4.6e-05,2.8e-05,7.9e-05,-0.000135,-5.8e-05,-0.000149,-3e-05,2.9e-05,-6.4e-05,-3.2e-05,-0.000116,4.1e-05,-2.1e-05,1e-05,1.1e-05,-3.8e-05,-3.9e-05,-0.000104,-4.4e-05,1.7e-05,3.3e-05,-1.8e-05,-3.2e-05,-5.2e-05,6e-05
6.4e-05,0.000144,7.6e-05,0.000107,4.9e-05,1e-05,7e-06,-0.000197,-7.7e-05,5.5e-05,-6.7e-05,-7.3e-05,-1.1e-05,-0.000159,-1.5e-05,6.9e-05,0.000145,7.2e-05,-0.000137,-2.9e-05,-1.5e-05,3.9e-05,-0.000114,4.5e-05,5.7e-05,-0.00037,-0.00016,-6.4e-05,1.3e-05,8.8e-05,-4.3e-05,-0.00014,-0.000184,-6.4e-05,0.000238,-6.8e-05,2.9e-05,-5e-06,-8.5e-05,-6.7e-05,-5.8e-05,8e-06,1e-06,-0.000101,-2e-06,0.000122,-1.2e-05,5.1e-05,8.5e-05,8.1e-05,1.8e-05,8e-06,6.9e-05,-4.5e-05,2.1e-05,5e-06,-6.6e-05,3e-06,1.7e-05,-2.6e-05,1.8e-05,1.7e-05,-0.00015,-3.3e-05,-1e-06,4.8e-05,-3.1e-05,2.7e-05,2e-06,1.5e-05,1.3e-05,5.5e-05,-5.5e-05,-1.6e-05,-2.9e-05,-5.2e-05,2.7e-05,-2.8e-05,-3e-05,5.9e-05,7.4e-05,5.5e-05,0.000152,0,0.000152,6.4e-05,0.000134,-1.5e-05,-2.8e-05,3.5e-05,2.1e-05,2e-06,7.5e-05,-6.7e-05,-0.000113,-6.7e-05,5e-05,-0.000136,6.9e-05,0.000142,1e-04,9.7e-05,9.8e-05,7.8e-05,-5e-05,1.6e-05,9.8e-05,3.8e-05,-2e-06,-5e-06,2e-06,1.7e-05,6.3e-05,-1.5e-05,-7e-06,-2.8e-05,-2.1e-05,-5.1e-05,4.5e-05,5.9e-05,1.2e-05
-9.1e-05,-0.000127,1.9e-05,-7e-05,1e-05,8.4e-05,2e-05,7.3e-05,5.3e-05,-5.3e-05,-2.4e-05,7.4e-05,-8e-06,-1e-05,-4.4e-05,-5e-06,-3.5e-05,-0.000103,8e-06,0.000115,-5e-06,-4.5e-05,-3e-06,-5.1e-05,1e-06,0.000208,2.1e-05,-6e-06,-3.2e-05,-0.000113,-1.3e-05,-3e-06,5.5e-05,4e-05,-0.00015,-9e-06,3.6e-05,-0.000117,8.5e-05,-3.3e-05,-8.3e-05,-7e-06,-6.9e-05,9.5e-05,-2e-06,-0.000106,-6.2e-05,-1e-05,-7e-05,-1e-05,0.000104,2.5e-05,-7.1e-05,-4e-06,-2.5e-05,3e-05,8.1e-05,7.1e-05,-6e-06,-2e-05,-3.1e-05,-6.6e-05,0.000126,-4e-06,5.5e-05,9e-06,-3.4e-05,6.3e-05,3.7e-05,-1.9e-05,-3.2e-05,-5.3e-05,-3.2e-05,4.8e-05,1.4e-05,3.3e-05,-3e-05,5.6e-05,5.1e-05,1.9e-05,-5e-06,-3e-05,-4e-06,-1.5e-05,-6.4e-05,4.9e-05,-1.4e-05,4.5e-05,3.2e-05,-2.8e-05,-5.7e-05,1.2e-05,-2e-06,5.1e-05,4.2e-05,4.5e-05,-2e-05,3.5e-05,4.4e-05,-0.000176,-6.5e-05,-3.7e-05,-5.3e-05,-2.3e-05,-3e-06,-2.1e-05,-8.8e-05,-5.5e-05,1.1e-05,-3.7e-05,-1.9e-05,-6.9e-05,-4e-06,8.3e-05,2.7e-05,-1.8e-05,-2.1e-05,-5e-06,-4.4e-05,1.4e-05,-1.5e-05
1.6e-05,0.000108,0,-2.2e-05,-1.2e-05,-1.9e-05,-1e-06,9.8e-05,1.4e-05,-6e-06,-3.6e-05,-0.000163,-1e-06,-3.7e-05,-7.4e-05,-7.3e-05,-7e-06,5.5e-05,1.2e-05,-0.000151,-2.8e-05,4.7e-05,-8e-05,1.2e-05,7e-06,-3.2e-05,1.5e-05,-2.8e-05,-1.6e-05,2.4e-05,-4e-06,-4.1e-05,-6.5e-05,1.7e-05,1.8e-05,-4e-06,4.2e-05,0.000119,-1.4e-05,9e-06,1.2e-05,-5.6e-05,-7e-05,-3.6e-05,4.5e-05,-1.5e-05,2.1e-05,-4.5e-05,9.2e-05,1.8e-05,-8.2e-05,-2.6e-05,1.9e-05,1e-06,-1.8e-05,-6.2e-05,-5.5e-05,1e-05,-1.8e-05,3.3e-05,2.7e-05,-3.9e-05,-0.000106,-1e-05,0,1e-05,3.5e-05,-5.1e-05,-4.2e-05,-2.3e-05,-5.2e-05,3.6e-05,6e-05,-3.4e-05,-2.6e-05,-2.9e-05,-5.2e-05,-5.5e-05,-5.7e-05,-4.6e-05,0,-1.7e-05,-5e-06,3.6e-05,9e-06,-2.4e-05,-1.3e-05,4e-06,5.1e-05,3.4e-05,1.3e-05,-3.1e-05,-2.9e-05,-5.7e-05,1e-05,3.6e-05,4.1e-05,5e-05,-3.6e-05,3.2e-05,7e-06,4.9e-05,2.9e-05,-3.3e-05,-8e-06,3.2e-05,8.2e-05,4.3e-05,-3.4e-05,6e-06,2.2e-05,5e-05,3e-05,-2.5e-05,3.2e-05,-5e-06,4e-06,1.4e-05,1.5e-05,-1e-06,-2.7e-05
-3.5e-05,-9.7e-05,-3.1e-05,-4e-06,-2.3e-05,-4.4e-05,-5e-06,-3.9e-05,-3.7e-05,2.2e-05,1.3e-05,0.00011,-1.7e-05,4.6e-05,-3e-05,4e-06,-6e-06,-5.3e-05,5e-06,9.1e-05,-4.3e-05,-8.7e-05,-5e-06,-3.6e-05,-5e-06,-2.4e-05,-6.2e-05,9e-06,-4.9e-05,3.5e-05,4.3e-05,2e-06,4.3e-05,-3e-05,-2.8e-05,3.3e-05,1.7e-05,-7.4e-05,-2.9e-05,8e-06,4e-06,9e-06,8e-05,2.1e-05,-9e-06,2.7e-05,1.9e-05,8e-06,-1.5e-05,1.6e-05,1.3e-05,-4e-06,-4.6e-05,-5.3e-05,2.2e-05,-3e-06,-3e-05,-6e-06,5.1e-05,9e-06,4e-06,-9e-06,0.000116,4.6e-05,1e-06,-4.3e-05,1.3e-05,1.3e-05,0,2.7e-05,3e-05,-3e-06,-8e-06,-1e-04,-1.8e-05,-2e-06,5.7e-05,1.1e-05,-1.6e-05,-1.5e-05,5e-06,6e-06,-2.2e-05,-3.3e-05,-2.6e-05,4e-06,8e-06,-4.3e-05,-9.9e-05,-2e-05,-3.4e-05,-1.3e-05,-1.1e-05,1.4e-05,-5.1e-05,1.9e-05,-1e-05,-3.5e-05,-5.4e-05,-1.7e-05,-1.1e-05,-6e-05,-7e-06,6e-06,5.5e-05,-2.8e-05,-3.8e-05,-9e-06,3.1e-05,2.4e-05,-9e-06,-3.1e-05,1.2e-05,3e-06,-1.9e-05,1.1e-05,-9e-06,-5e-06,-3.4e-05,9e-06,-1.9e-05
-4.2e-05,5.2e-05,-6e-06,8e-06,4.8e-05,-1e-05,6e-06,7e-06,4.1e-05,-1.5e-05,9e-06,-3e-05,-4.3e-05,-3.4e-05,9e-06,3.9e-05,-1.7e-05,2e-06,8.9e-05,8e-06,-1.3e-05,9e-06,7.9e-05,3.4e-05,9e-06,-1e-05,5e-06,-6e-06,8e-06,3.2e-05,-3.1e-05,-4.2e-05,-2.1e-05,-1.1e-05,-1.8e-05,-1.3e-05,-9e-06,0,-4.1e-05,-1.7e-05,0,1.8e-05,-6.3e-05,-4.9e-05,-2.1e-05,-1.6e-05,-2.1e-05,1.1e-05,-9e-06,-2.6e-05,-4e-06,3e-06,1.8e-05,2.3e-05,-1e-06,2.8e-05,2.9e-05,-4e-06,-1e-06,-2.4e-05,1.2e-05,7e-06,-9.1e-05,-3.8e-05,-2.2e-05,1.6e-05,-6e-05,-4.2e-05,-3.2e-05,-2.2e-05,-6.3e-05,1.1e-05,-3.5e-05,3e-05,1.8e-05,-1.2e-05,4e-06,-4e-06,8e-06,2.5e-05,-5e-06,1e-06,1.2e-05,-5e-06,2.7e-05,-3.2e-05,-1.4e-05,2.7e-05,4.7e-05,-4e-06,-1.7e-05,3e-06,-1e-05,3e-06,-1.6e-05,-1.4e-05,-2.4e-05,-9e-06,6e-06,-1.1e-05,1.5e-05,-4e-06,-2.3e-05,1e-06,1.5e-05,-5e-06,2e-05,1.1e-05,-6e-06,-3.4e-05,8e-06,2.8e-05,8e-06,-2.8e-05,1e-05,-3e-06,1.1e-05,9e-06,-1.1e-05,1e-05,-1e-05
4.2e-05,6e-06,1.2e-05,-2.4e-05,-7e-06,-1.5e-05,-1.8e-05,7e-06,-3.2e-05,-1.2e-05,1.9e-05,2.2e-05,2.6e-05,3.9e-05,1.1e-05,9e-06,3.7e-05,-4e-06,-7e-05,-2.8e-05,2.5e-05,-5.6e-05,-3.7e-05,-2e-06,-1.6e-05,3.6e-05,-4.3e-05,1.8e-05,5.3e-05,-4.2e-05,1.5e-05,5.3e-05,-2.4e-05,2.9e-05,1.8e-05,-2e-06,0,4.5e-05,3e-06,-1.3e-05,2.9e-05,-3.1e-05,1.8e-05,2.4e-05,-9e-06,7e-06,7e-06,-2e-06,1.6e-05,1.9e-05,0,-9e-06,-2e-06,1.8e-05,-7e-06,-1.4e-05,-1.4e-05,-3e-06,5e-06,2e-05,6e-06,2.3e-05,7.2e-05,-1.6e-05,5e-06,-1.1e-05,3.6e-05,3.8e-05,2.4e-05,2.4e-05,2.7e-05,5e-06,6e-06,1.2e-05,-1.4e-05,1.6e-05,-7e-06,0,1.3e-05,-7e-06,9e-06,-3e-06,2.5e-05,3e-05,-2.3e-05,-3e-06,-1.2e-05,-2e-05,-1.9e-05,-1.5e-05,3.6e-05,-1.6e-05,8e-06,1e-05,1.1e-05,-8e-06,1.4e-05,-1.6e-05,4.2e-05,3e-05,-6e-06,1e-06,1.1e-05,-1.3e-05,-9e-06,3e-05,1.5e-05,-2.8e-05,-1.4e-05,-1.6e-05,-1.7e-05,-6e-06,-1e-05,1e-05,-3e-06,-2.7e-05,-1.9e-05,-8e-06,3e-06,-1.4e-05,1e-06
1e-05,-1e-06,-2.1e-05,2.8e-05,1.4e-05,2.7e-05,2e-06,-3e-06,3.3e-05,2.6e-05,-2.4e-05,1.6e-05,7e-06,-9e-06,2.2e-05,-8e-06,-2.5e-05,2.5e-05,1.3e-05,1.2e-05,8e-06,6.5e-05,6e-06,-9e-06,-2e-06,-9e-06,1.8e-05,4.3e-05,-3.6e-05,3.2e-05,-9e-06,-1.1e-05,3.7e-05,-1.1e-05,-1.7e-05,5e-06,-3e-05,-2.2e-05,2e-05,3e-06,-8e-06,3.5e-05,-5e-06,-7e-06,-1.4e-05,1.5e-05,-8e-06,0,-6e-06,-1.8e-05,-5e-06,-1e-05,0,-3e-05,1.2e-05,-6e-06,1.4e-05,2e-06,2.3e-05,-8e-06,-1e-06,2e-06,-1.3e-05,1.8e-05,-5e-06,1.9e-05,1.2e-05,3e-06,-6e-06,-2.1e-05,-5e-06,-1e-05,5e-06,6e-06,3e-06,-1.4e-05,-7e-06,9e-06,-1e-05,-1e-06,2e-06,4e-06,8e-06,1e-06,7e-06,1.4e-05,2.4e-05,9e-06,3.4e-05,3.6e-05,-1.1e-05,-3e-06,-9e-06,-4e-06,2e-05,3e-06,6e-06,2e-06,1.7e-05,-1e-06,-1e-06,2.5e-05,-7e-06,-9e-06,-3.3e-05,0,-5e-06,9e-06,5e-06,9e-06,9e-06,5e-06,4e-06,1.2e-05,-2.1e-05,1e-05,8e-06,-4e-06,-4e-06,1.8e-05,9e-06
-2.1e-05,-6e-06,1.6e-05,6e-06,-1.6e-05,-1e-06,5e-06,3e-06,-1.6e-05,-4e-06,1.7e-05,-3.7e-05,4e-06,2.2e-05,-1.6e-05,-2.8e-05,-1.2e-05,4e-06,3.2e-05,8e-06,-3e-06,-1e-06,2e-06,-3e-06,-1.5e-05,-1.5e-05,1.5e-05,-5e-06,1.3e-05,-1.2e-05,-3e-06,1.8e-05,-3e-06,1.6e-05,3e-05,-2.1e-05,3.2e-05,1.7e-05,-1e-05,1.4e-05,4e-06,-3e-06,3.9e-05,8e-06,1.1e-05,3e-06,-2e-06,1e-06,-2e-06,1.4e-05,1.3e-05,5e-06,1.1e-05,5e-06,3e-06,0,-1.6e-05,2e-06,-3e-06,2e-06,-1.7e-05,-1.7e-05,9e-06,9e-06,2e-06,-2.1e-05,-1.2e-05,-3e-06,-1e-06,9e-06,8e-06,-1e-06,4e-06,-5e-06,3e-06,-1e-06,-2.3e-05,-1.4e-05,-4e-06,6e-06,8e-06,5e-06,-9e-06,-1.7e-05,1.1e-05,-6e-06,-1.1e-05,1e-06,-2.6e-05,-3.4e-05,1.6e-05,3e-06,1.3e-05,-3e-06,-2e-06,-1.1e-05,-1e-06,2.8e-05,-7e-06,3.9e-05,1.4e-05,-1.3e-05,-1e-06,4e-06,5e-06,4e-06,1.2e-05,0,5e-06,7e-06,0,-9e-06,-2e-06,-7e-06,0,-1.2e-05,3e-06,-6e-06,1.8e-05,-8e-06,2e-06
1.1e-05,1e-06,2e-06,-6e-06,7e-06,-5e-06,0,-1.1e-05,-2e-06,-1.2e-05,-6e-06,1.8e-05,-2.3e-05,-2.4e-05,-2.4e-05,2.7e-05,6e-06,1.3e-05,-4e-05,-2.4e-05,-3e-06,-3e-06,-3e-06,-1.2e-05,-3e-06,2.3e-05,-5e-06,-1.3e-05,5e-06,1.3e-05,1.4e-05,-2e-06,9e-06,-1e-05,-2.5e-05,1.7e-05,-1.5e-05,-2e-06,-2e-05,-7e-06,-5e-06,-2.3e-05,-3.5e-05,-1.9e-05,-2e-06,-2.3e-05,-4e-06,-2e-06,6e-06,0,-1.4e-05,-4e-06,3e-06,-1e-06,-7e-06,8e-06,9e-06,-5e-06,-1.1e-05,0,2e-06,-3e-06,-3e-06,-1e-05,3e-06,2e-06,-3e-06,6e-06,5e-06,-1e-06,-6e-06,0,2e-06,4e-06,1e-06,-4e-06,-8e-06,5e-06,-1e-06,2e-06,-1e-05,3e-06,0,7e-06,-1.3e-05,-1e-05,-8e-06,-1e-06,1.6e-05,1.7e-05,-1.1e-05,-5e-06,-4e-06,4e-06,-1e-05,-2.3e-05,1.3e-05,-6e-06,-1.2e-05,-3e-05,5e-06,1.2e-05,7e-06,3e-06,6e-06,-9e-06,-1e-05,-8e-06,-7e-06,-4e-06,-3e-06,3e-06,0,-9e-06,2e-06,-1e-06,-1e-06,-8e-06,-8e-06,1e-06,-4e-06
-8e-06,-1e-06,-1e-06,-1.4e-05,-9e-06,-1.1e-05,-4e-06,1.1e-05,-1e-05,3e-06,5e-06,-6e-06,5e-06,2.3e-05,2e-06,-9e-06,-5e-06,-1e-06,1e-05,1.2e-05,-6e-06,-1.5e-05,1.8e-05,-2e-05,-6e-06,1.3e-05,2e-06,4e-06,-7e-06,1.9e-05,-9e-06,1.8e-05,4e-06,-5e-06,1.8e-05,-4e-06,1.7e-05,-2e-06,2e-06,3e-06,-8e-06,1.4e-05,1.5e-05,8e-06,5e-06,1.1e-05,1e-05,3e-06,-1.9e-05,6e-06,0,2e-06,2e-06,-5e-06,4e-06,-1e-05,-4e-06,-8e-06,1.4e-05,3e-06,-4e-06,0,-1.1e-05,-1e-05,2e-06,1e-05,1e-06,-1.8e-05,-6e-06,-4e-06,7e-06,-8e-06,3e-06,-1.5e-05,3e-06,2e-06,9e-06,-5e-06,-5e-06,-2e-06,1.1e-05,-3e-06,5e-06,1e-05,6e-06,-3e-06,2e-05,1e-06,-1.1e-05,-2e-06,-1.1e-05,-2e-06,3e-06,-8e-06,5e-06,1e-06,-6e-06,-1.6e-05,-5e-06,2.4e-05,-4e-06,-8e-06,-9e-06,-9e-06,-4e-06,-3e-06,1e-05,4e-06,6e-06,-5e-06,-9e-06,-1.6e-05,-4e-06,-6e-06,2e-06,7e-06,-2e-06,0,8e-06,-7e-06,-6e-06
5e-06,-1.2e-05,2e-06,1e-05,-1e-06,1e-06,2e-06,0,2e-06,5e-06,0,-4e-06,8e-06,-2e-05,9e-06,-1.2e-05,-1.1e-05,7e-06,-1.3e-05,-1e-05,-4e-06,3.4e-05,-1.8e-05,1e-05,0,-3.7e-05,-1.1e-05,0,0,-1.1e-05,6e-06,-3e-06,-1.8e-05,1.2e-05,-2.1e-05,5e-06,-1e-06,6e-06,1.4e-05,-2e-06,1.1e-05,3e-06,1.6e-05,-6e-06,4e-06,-8e-06,2e-06,0,1.1e-05,3e-06,1.9e-05,-3e-06,-8e-06,1e-06,5e-06,-2e-06,-8e-06,-5e-06,-3e-06,-3e-06,-6e-06,9e-06,-1e-06,6e-06,2e-06,2e-06,8e-06,-4e-06,1e-06,3e-06,8e-06,2e-06,-7e-06,3e-06,-5e-06,-4e-06,-2e-06,6e-06,1e-06,0,-9e-06,-4e-06,-8e-06,-7e-06,-6e-06,1.2e-05,-1.8e-05,-5e-06,1.6e-05,0,-4e-06,-1e-06,-1.5e-05,1e-06,4e-06,5e-06,2e-06,8e-06,-1e-06,-6e-06,-3e-06,2e-06,2e-06,-2e-06,0,7e-06,-1.5e-05,9e-06,-2e-06,-1e-06,1.4e-05,2e-06,6e-06,1.3e-05,1.3e-05,-6e-06,2e-06,-3e-06,-5e-06,3e-06,-1e-06
5e-06,9e-06,-1e-06,-3e-06,6e-06,-1e-06,-1e-06,-1.5e-05,-3e-06,-5e-06,-3e-06,2.1e-05,-5e-06,6e-06,-1e-06,6e-06,5e-06,4e-06,7e-06,-5e-06,5e-06,0,-2e-05,-6e-06,-2e-06,3e-05,7e-06,1.4e-05,2e-06,-3e-06,-8e-06,2e-06,6e-06,-3e-06,1.8e-05,-1e-05,1e-06,-8e-06,4e-06,5e-06,-8e-06,-1.1e-05,-1.2e-05,1.1e-05,-3e-06,-3e-06,-1e-05,0,-2e-06,1e-06,-1.7e-05,0,0,2e-06,-1e-06,5e-06,8e-06,-4e-06,-5e-06,1e-06,9e-06,1.4e-05,5e-06,6e-06,-4e-06,2e-06,-6e-06,1e-06,-2e-06,2e-06,-1e-05,-1e-06,5e-06,1e-06,5e-06,-2e-06,2e-06,-7e-06,1.5e-05,2e-06,2e-06,1e-06,-1.1e-05,-5e-06,8e-06,-9e-06,4e-06,3e-06,-8e-06,-5e-06,8e-06,2e-06,3e-06,1e-06,9e-06,1e-06,2e-06,3e-06,5e-06,3e-06,1e-06,-7e-06,1e-06,-2e-06,-1e-06,-2e-06,1.2e-05,-2e-06,-4e-06,0,-1.1e-05,-5e-06,-4e-06,-4e-06,-8e-06,3e-06,-1e-06,-2e-06,0,-5e-06,5e-06
-7e-06,-1.8e-05,-2e-06,-1e-06,1e-06,-2e-06,-6e-06,2e-05,9e-06,-2e-06,-1e-06,-1.1e-05,5e-06,-8e-06,1e-06,5e-06,5e-06,-1e-06,1e-05,5e-06,3e-06,-1e-06,-5e-06,6e-06,1e-06,0,5e-06,3e-06,7e-06,-3e-06,7e-06,-4e-06,2e-06,1e-06,-4e-06,3e-06,-2e-06,6e-06,-2e-06,-2e-06,-5e-06,1.7e-05,-2e-06,-6e-06,1e-06,4e-06,0,1e-06,2e-06,3e-06,0,-4e-06,-3e-06,-6e-06,1e-06,3e-06,-3e-06,-3e-06,9e-06,-3e-06,0,-2e-06,1e-06,-4e-06,0,-4e-06,-1e-06,2e-06,7e-06,-3e-06,7e-06,-2e-06,6e-06,4e-06,-1e-06,2e-06,6e-06,3e-06,-8e-06,0,-2e-06,-1e-06,1e-06,8e-06,-1.3e-05,1e-06,1e-06,-2e-06,0,9e-06,-4e-06,3e-06,2e-06,-1e-06,-1.1e-05,6e-06,-4e-06,8e-06,6e-06,-1e-05,-2e-06,-1e-06,-3e-06,2e-06,2e-06,-1e-06,-1.2e-05,-5e-06,3e-06,-1e-06,3e-06,0,-1e-06,-3e-06,9e-06,-3e-06,1e-06,3e-06,-1e-06,1e-06,3e-06
5e-06,2e-05,0,2e-06,-7e-06,5e-06,1e-06,-1.5e-05,-1.2e-05,5e-06,-1e-06,3e-06,-7e-06,6e-06,1e-06,-1e-06,-8e-06,1e-06,-2.5e-05,1e-06,0,-8e-06,-3e-06,3e-06,3e-06,-6e-06,-1.2e-05,-1e-06,-1.3e-05,8e-06,-2e-06,-1e-06,5e-06,-2e-06,-5e-06,0,-9e-06,5e-06,-7e-06,5e-06,3e-06,-1e-05,-8e-06,2e-06,-7e-06,0,4e-06,-1e-06,-6e-06,-2e-06,7e-06,2e-06,-2e-06,-1e-06,3e-06,-4e-06,3e-06,-4e-06,-4e-06,3e-06,1e-06,-8e-06,0,-2e-06,-2e-06,4e-06,1e-06,9e-06,-3e-06,2e-06,-7e-06,2e-06,-4e-06,0,-1e-06,-3e-06,-1e-06,-2e-06,2e-06,0,-2e-06,-2e-06,3e-06,3e-06,1.2e-05,-3e-06,-3e-06,0,-7e-06,-1e-05,1.1e-05,1e-06,2e-06,0,-7e-06,5e-06,4e-06,-8e-06,3e-06,2e-06,-4e-06,1e-06,3e-06,-4e-06,7e-06,1e-06,5e-06,1e-06,0,1e-06,4e-06,2e-06,2e-06,-1e-06,-1.1e-05,-1e-06,1e-06,-3e-06,2e-06,-2e-06,3e-06
2e-06,-1.5e-05,2e-06,4e-06,-7e-06,-2e-06,1e-06,1e-06,9e-06,2e-06,0,-1.6e-05,3e-06,-9e-06,-1.2e-05,-4e-06,1e-06,-4e-06,2.7e-05,-9e-06,-3e-06,-9e-06,3e-06,-5e-06,2e-06,-3e-06,-5e-06,-2e-06,4e-06,0,0,-1.6e-05,-5e-06,-3e-06,6e-06,3e-06,0,-1.1e-05,6e-06,-5e-06,-5e-06,-9e-06,1.4e-05,-6e-06,1e-06,-6e-06,-3e-06,-1e-06,1e-05,4e-06,-2e-06,-3e-06,-1e-06,-2e-06,0,-2e-06,-3e-06,2e-06,0,-3e-06,5e-06,-3e-06,-5e-06,2e-06,0,2e-06,4e-06,-3e-06,-2e-06,-2e-06,5e-06,-2e-06,-5e-06,-1e-06,0,0,5e-06,2e-06,-2e-06,-3e-06,-2e-06,1e-06,-2e-06,-4e-06,-1e-05,5e-06,2e-06,2e-06,1.2e-05,4e-06,-7e-06,2e-06,3e-06,1e-06,5e-06,0,-1e-06,-3e-06,-4e-06,0,-1e-06,2e-06,-3e-06,-3e-06,2e-06,-1e-06,-2e-06,0,-2e-06,0,-4e-06,2e-06,-3e-06,0,-2e-06,5e-06,-1e-06,2e-06,0,1e-06,-4e-06
-9e-06,1.3e-05,-1e-06,-3e-06,4e-06,2e-06,0,-1e-06,-1.1e-05,-4e-06,2e-06,1e-05,-2e-06,9e-06,-6e-06,-4e-06,5e-06,-1e-06,-5e-06,9e-06,-1e-06,7e-06,0,7e-06,3e-06,1.6e-05,2e-06,-9e-06,0,4e-06,2e-06,8e-06,-4e-06,9e-06,-7e-06,3e-06,-5e-06,1.1e-05,7e-06,0,6e-06,9e-06,-2e-05,9e-06,-2e-06,3e-06,-1e-06,1e-06,-1.1e-05,-3e-06,-6e-06,1e-06,0,-3e-06,0,2e-06,-1e-06,-1e-06,7e-06,1e-06,-2e-06,-1e-06,7e-06,0,1e-06,-3e-06,-1e-05,-1e-06,1e-06,2e-06,-9e-06,1e-06,1e-06,-5e-06,-1e-06,-2e-06,3e-06,-2e-06,1e-06,2e-06,2e-06,3e-06,-9e-06,2e-06,7e-06,1e-06,5e-06,-2e-06,-3e-06,3e-06,-2e-06,1e-06,-3e-06,0,2e-06,-3e-06,-3e-06,-1e-06,-8e-06,-8e-06,3e-06,6e-06,2e-06,3e-06,-7e-06,2e-06,1e-06,-3e-06,3e-06,-3e-06,1e-06,-2e-06,0,5e-06,-1e-06,-8e-06,1e-06,-2e-06,-2e-06,-1e-06,-4e-06
4e-06,-1e-05,2e-06,-3e-06,1e-06,-3e-06,-1e-06,5e-06,4e-06,-1e-06,-3e-06,6e-06,1e-06,-8e-06,5e-06,1.1e-05,0,-1e-06,-1.1e-05,-1e-06,-1e-06,3e-06,4e-06,-6e-06,3e-06,-8e-06,-3e-06,2e-06,-3e-06,-9e-06,-4e-06,-6e-06,0,-5e-06,7e-06,-5e-06,5e-06,-4e-06,-1e-06,-2e-06,0,-1e-06,4e-06,-3e-06,4e-06,1e-06,4e-06,-1e-06,9e-06,4e-06,6e-06,-1e-06,2e-06,0,1e-06,2e-06,0,-1e-06,-5e-06,1e-06,-2e-06,6e-06,-6e-06,-1e-06,0,-2e-06,8e-06,-5e-06,-1e-06,0,4e-06,0,2e-06,-4e-06,2e-06,2e-06,-4e-06,0,-2e-06,0,-1e-06,0,-1e-06,3e-06,-5e-06,-2e-06,-7e-06,1e-06,-7e-06,-6e-06,-5e-06,-1e-06,1e-06,-1e-06,-3e-06,1e-06,4e-06,9e-06,-3e-06,6e-06,1e-06,-6e-06,-2e-06,-2e-06,-7e-06,0,0,0,0,0,2e-06,1e-06,0,-3e-06,-1e-06,1e-06,-2e-06,-3e-06,1e-06,1e-06,-2e-06
0,9e-06,0,2e-06,-1e-06,1e-06,0,-7e-06,-1e-06,3e-06,1e-06,-3e-06,0,8e-06,2e-06,-7e-06,-1e-06,-1e-06,9e-06,-5e-06,1e-06,-1.2e-05,-4e-06,6e-06,2e-06,-5e-06,1e-06,6e-06,3e-06,-1e-06,3e-06,-2e-06,3e-06,0,-9e-06,1e-06,-2e-06,-3e-06,-8e-06,6e-06,-2e-06,-4e-06,4e-06,3e-06,1e-06,-2e-06,-3e-06,-1e-06,-4e-06,-1e-06,-4e-06,1e-06,0,-1e-06,1e-06,-3e-06,-1e-06,-1e-06,-1e-06,0,1e-06,3e-06,9e-06,2e-06,1e-06,0,-2e-06,-1e-06,0,-2e-06,0,0,-2e-06,3e-06,-2e-06,-2e-06,-1e-06,0,5e-06,-2e-06,-1e-06,0,3e-06,-2e-06,4e-06,-1e-06,2e-06,0,4e-06,6e-06,2e-06,-1e-06,-6e-06,1e-06,-4e-06,-2e-06,-3e-06,-4e-06,5e-06,-1e-06,-1e-06,3e-06,1e-06,-2e-06,-1e-06,-2e-06,-1e-06,5e-06,-3e-06,2e-06,-4e-06,-3e-06,0,-1e-06,6e-06,2e-06,1e-06,-1e-06,-3e-06,-2e-06,2e-06
-4e-06,-6e-06,-1e-06,1e-06,-1e-06,-1e-06,-2e-06,3e-06,4e-06,-1e-06,1e-06,2e-06,-3e-06,-5e-06,-2e-06,0,2e-06,-2e-06,-8e-06,6e-06,1e-06,-8e-06,3e-06,-4e-06,2e-06,1.5e-05,-4e-06,1e-06,0,2e-06,-2e-06,7e-06,4e-06,0,9e-06,-3e-06,4e-06,7e-06,1e-06,-3e-06,3e-06,8e-06,3e-06,-7e-06,1e-06,3e-06,-2e-06,1e-06,-4e-06,1e-06,0,-3e-06,3e-06,-2e-06,0,0,3e-06,1e-06,4e-06,0,-2e-06,-5e-06,-9e-06,0,-1e-06,3e-06,-1e-06,5e-06,0,2e-06,-2e-06,1e-06,0,1e-06,1e-06,1e-06,-2e-06,1e-06,0,0,3e-06,0,0,1e-06,-3e-06,0,4e-06,-1e-06,1e-06,-3e-06,0,-1e-06,2e-06,-1e-06,1e-06,-3e-06,0,1e-06,5e-06,1e-06,1e-06,-5e-06,0,0,2e-06,2e-06,1e-06,1e-06,4e-06,0,1e-06,-2e-06,0,0,-1e-06,-5e-06,0,-2e-06,1e-06,2e-06,3e-06
5e-06,3e-06,0,0,1e-06,3e-06,-1e-06,-1e-06,-3e-06,-3e-06,0,-9e-06,4e-06,5e-06,-3e-06,-1e-06,1e-06,2e-06,9e-06,0,0,1.2e-05,3e-06,1e-06,1e-06,-4e-06,-1e-06,-1e-06,1e-06,1e-06,1e-06,-2e-06,-3e-06,-1e-06,-7e-06,5e-06,-6e-06,-6e-06,3e-06,-1e-06,-3e-06,-6e-06,-6e-06,5e-06,0,-1e-06,2e-06,0,7e-06,0,4e-06,0,0,-2e-06,1e-06,2e-06,-1e-06,2e-06,-4e-06,0,0,-4e-06,6e-06,-2e-06,0,-2e-06,-3e-06,-1e-06,2e-06,-1e-06,2e-06,0,-1e-06,1e-06,1e-06,-1e-06,-3e-06,-1e-06,-6e-06,1e-06,-4e-06,1e-06,-4e-06,1e-06,2e-06,3e-06,-8e-06,1e-06,0,1e-06,4e-06,0,0,-1e-06,5e-06,3e-06,1e-06,-7e-06,1e-06,0,2e-06,4e-06,0,-1e-06,3e-06,-1e-06,-3e-06,-1e-06,-2e-06,-3e-06,3e-06,-2e-06,0,3e-06,5e-06,2e-06,0,0,-1e-06,0,2e-06
-2e-06,-2e-06,0,-1e-06,0,1e-06,0,0,3e-06,3e-06,2e-06,5e-06,-3e-06,-6e-06,-4e-06,3e-06,-1e-06,-1e-06,-8e-06,-2e-06,-1e-06,1e-06,-5e-06,-1e-06,0,-7e-06,-2e-06,-3e-06,-3e-06,1e-06,-1e-06,4e-06,-2e-06,5e-06,6e-06,-2e-06,0,3e-06,2e-06,-1e-06,1e-06,-4e-06,4e-06,-2e-06,-2e-06,-2e-06,2e-06,0,-6e-06,0,-3e-06,-1e-06,2e-06,-2e-06,0,1e-06,0,2e-06,1e-06,0,1e-06,-3e-06,-5e-06,1e-06,-1e-06,-2e-06,6e-06,3e-06,-1e-06,0,-2e-06,0,1e-06,-2e-06,-1e-06,1e-06,1e-06,0,4e-06,0,3e-06,-1e-06,1e-06,0,-1e-06,-3e-06,7e-06,-1e-06,-2e-06,-1e-06,-3e-06,-1e-06,4e-06,0,0,4e-06,-2e-06,7e-06,-4e-06,2e-06,-1e-06,-3e-06,-1e-06,0,1e-06,0,4e-06,0,-1e-06,0,-5e-06,0,0,-1e-06,-5e-06,-2e-06,-1e-06,1e-06,2e-06,0,-2e-06
-2e-06,0,0,2e-06,-1e-06,0,1e-06,-2e-06,-4e-06,2e-06,-2e-06,-1e-06,1e-06,7e-06,-3e-06,0,0,1e-06,-2e-06,4e-06,0,4e-06,-1e-06,-1e-06,-1e-06,9e-06,3e-06,-3e-06,2e-06,-3e-06,-1e-06,3e-06,-1e-06,-2e-06,-2e-06,1e-06,-4e-06,-2e-06,-3e-06,4e-06,0,6e-06,1.1e-05,3e-06,-1e-06,-1e-06,-2e-06,0,3e-06,0,-2e-06,0,-2e-06,-1e-06,0,-2e-06,0,2e-06,2e-06,0,0,2e-06,4e-06,2e-06,0,0,-4e-06,-2e-06,-1e-06,1e-06,4e-06,1e-06,1e-06,0,1e-06,-1e-06,0,-1e-06,-2e-06,1e-06,-1e-06,-1e-06,3e-06,-1e-06,0,0,-2e-06,1e-06,3e-06,2e-06,-1e-06,-1e-06,-1e-06,-1e-06,-2e-06,0,1e-06,-2e-06,-3e-06,-1e-06,-1e-06,4e-06,1e-06,-2e-06,-2e-06,0,-5e-06,0,2e-06,2e-06,5e-06,-2e-06,0,-2e-06,0,0,1e-06,-1e-06,0,1e-06,-3e-06
2e-06,1e-06,0,-1e-06,1e-06,0,0,3e-06,2e-06,-3e-06,1e-06,2e-06,-2e-06,-7e-06,1e-06,-2e-06,1e-06,1e-06,1.3e-05,-1e-06,0,-6e-06,-8e-06,2e-06,-1e-06,1e-06,-2e-06,-1e-06,0,-1e-06,2e-06,2e-06,1e-06,-3e-06,-2e-06,-4e-06,-1e-06,-1e-06,-3e-06,-2e-06,-2e-06,-1e-06,-1e-05,-4e-06,-1e-06,0,-1e-06,0,0,-1e-06,4e-06,-1e-06,-2e-06,-1e-06,0,0,-1e-06,0,-4e-06,0,2e-06,6e-06,-1e-06,-1e-06,0,1e-06,0,-2e-06,1e-06,-1e-06,-4e-06,0,1e-06,-2e-06,-1e-06,0,-1e-06,1e-06,1e-06,0,0,0,1e-06,2e-06,1e-06,-1e-06,-1e-06,0,-4e-06,-5e-06,-2e-06,-1e-06,-1e-06,0,-2e-06,-1e-06,0,3e-06,0,1e-06,0,-2e-06,-1e-06,-1e-06,0,-1e-06,3e-06,-2e-06,0,0,-2e-06,1e-06,0,1e-06,-5e-06,0,0,0,0,0,-1e-06
-2e-06,-3e-06,1e-06,0,2e-06,-1e-06,0,-2e-06,-2e-06,-1e-06,0,4e-06,1e-06,4e-06,2e-06,1e-06,-1e-06,0,-1.2e-05,-2e-06,0,3e-06,-5e-06,-2e-06,-2e-06,-3e-06,-1e-06,3e-06,-1e-06,0,-1e-06,-2e-06,3e-06,3e-06,5e-06,2e-06,2e-06,3e-06,1e-06,0,1e-06,-2e-06,3e-06,2e-06,1e-06,-1e-06,1e-06,0,-2e-06,0,-1e-06,0,-1e-06,-1e-06,0,2e-06,0,1e-06,2e-06,0,-1e-06,1e-06,-1e-06,-2e-06,0,1e-06,0,1e-06,0,0,3e-06,0,-1e-06,2e-06,1e-06,-1e-06,1e-06,-1e-06,1e-06,-1e-06,0,0,-2e-06,0,-1e-06,1e-06,2e-06,0,5e-06,6e-06,0,-1e-06,-2e-06,0,2e-06,1e-06,-1e-06,-7e-06,2e-06,-2e-06,0,2e-06,0,1e-06,2e-06,1e-06,-2e-06,-1e-06,-2e-06,-1e-06,-1e-06,-1e-06,0,0,2e-06,-3e-06,0,0,-1e-06,1e-06,1e-06
1e-06,3e-06,0,0,0,0,0,1e-06,4e-06,2e-06,-2e-06,-5e-06,2e-06,-3e-06,-2e-06,2e-06,0,0,5e-06,3e-06,1e-06,3e-06,2e-06,2e-06,-2e-06,-1e-06,0,1e-06,1e-06,3e-06,1e-06,3e-06,-2e-06,-2e-06,-4e-06,-1e-06,-2e-06,-4e-06,3e-06,-1e-06,-1e-06,5e-06,0,-2e-06,1e-06,1e-06,-1e-06,0,3e-06,-1e-06,-3e-06,0,-2e-06,-1e-06,0,0,0,0,2e-06,0,0,-3e-06,2e-06,1e-06,0,-1e-06,1e-06,-1e-06,-1e-06,1e-06,-1e-06,0,0,0,0,0,0,0,2e-06,1e-06,1e-06,0,1e-06,-1e-06,2e-06,-1e-06,-1e-06,1e-06,-3e-06,-4e-06,1e-06,0,-1e-06,0,1e-06,-2e-06,1e-06,4e-06,2e-06,1e-06,-1e-06,-2e-06,1e-06,-2e-06,0,0,2e-06,2e-06,2e-06,0,2e-06,1e-06,0,1e-06,-2e-06,3e-06,0,-2e-06,-1e-06,0,2e-06
2e-06,-4e-06,0,2e-06,-1e-06,0,-1e-06,-2e-06,-3e-06,0,1e-06,-1e-06,-2e-06,3e-06,-3e-06,-2e-06,0,0,1e-06,-2e-06,0,5e-06,-1e-06,-2e-06,-1e-06,9e-06,0,-1e-06,-1e-06,-1e-06,0,-5e-06,-2e-06,3e-06,4e-06,2e-06,4e-06,3e-06,-1e-06,2e-06,0,-4e-06,3e-06,3e-06,1e-06,0,-2e-06,0,-2e-06,0,3e-06,0,0,-1e-06,0,-2e-06,1e-06,1e-06,-3e-06,0,1e-06,-2e-06,-2e-06,2e-06,0,0,-2e-06,2e-06,0,-2e-06,1e-06,0,0,1e-06,-1e-06,0,0,0,-3e-06,0,-2e-06,0,3e-06,1e-06,-2e-06,0,-2e-06,-1e-06,0,1e-06,1e-06,0,0,0,-1e-06,-3e-06,-1e-06,-3e-06,1e-06,-1e-06,-1e-06,1e-06,-1e-06,0,-3e-06,0,-1e-06,1e-06,-1e-06,0,0,-1e-06,1e-06,-1e-06,5e-06,-2e-06,0,0,0,1e-06,1e-06
-3e-06,4e-06,0,-1e-06,0,0,0,2e-06,2e-06,-2e-06,0,-3e-06,2e-06,-5e-06,-1e-06,0,-1e-06,-1e-06,-2e-06,-1e-06,0,-9e-06,1e-06,1e-06,-1e-06,-6e-06,-2e-06,-1e-06,0,0,-1e-06,1e-06,0,-2e-06,-4e-06,0,-1e-06,-1e-06,-2e-06,-1e-06,1e-06,-2e-06,-1e-05,-3e-06,1e-06,-1e-06,2e-06,0,1e-06,-1e-06,0,-1e-06,0,-1e-06,0,0,-1e-06,1e-06,1e-06,0,-1e-06,-1e-06,3e-06,-1e-06,0,1e-06,1e-06,0,1e-06,2e-06,-1e-06,0,1e-06,-1e-06,1e-06,0,2e-06,0,1e-06,0,1e-06,0,1e-06,2e-06,2e-06,0,3e-06,1e-06,-2e-06,2e-06,-1e-06,1e-06,1e-06,0,-2e-06,0,0,6e-06,-1e-06,1e-06,1e-06,-1e-06,1e-06,0,-2e-06,0,1e-06,0,-1e-06,0,-2e-06,0,0,0,2e-06,-1e-06,1e-06,-2e-06,0,0,-1e-06
2e-06,-3e-06,0,1e-06,1e-06,0,0,1e-06,-2e-06,1e-06,0,6e-06,-2e-06,6e-06,-1e-06,-2e-06,-1e-06,0,4e-06,2e-06,0,-3e-06,1e-06,-1e-06,-1e-06,-2e-06,1e-06,-3e-06,-1e-06,-2e-06,1e-06,-4e-06,1e-06,-1e-06,4e-06,-1e-06,1e-06,-2e-06,-1e-06,2e-06,-1e-06,5e-06,2e-06,1e-06,-1e-06,-1e-06,0,0,-1e-06,0,-1e-06,0,2e-06,-1e-06,0,1e-06,0,0,1e-06,0,-1e-06,3e-06,-2e-06,-1e-06,0,0,1e-06,-1e-06,-1e-06,-1e-06,0,0,-1e-06,-1e-06,-1e-06,0,0,1e-06,2e-06,0,0,0,-1e-06,-1e-06,-2e-06,0,-1e-06,0,6e-06,-2e-06,-1e-06,1e-06,3e-06,0,0,1e-06,1e-06,-5e-06,-3e-06,-1e-06,1e-06,1e-06,0,0,1e-06,0,-1e-06,1e-06,1e-06,0,2e-06,-2e-06,0,0,0,1e-06,0,0,1e-06,0,-1e-06
0,2e-06,0,0,0,0,0,-3e-06,1e-06,2e-06,2e-06,2e-06,1e-06,-5e-06,-1e-06,4e-06,1e-06,0,-9e-06,-1e-06,0,2e-06,0,1e-06,0,8e-06,-3e-06,0,1e-06,0,-1e-06,2e-06,2e-06,3e-06,-3e-06,0,-1e-06,3e-06,2e-06,-1e-06,0,-1e-06,4e-06,-1e-06,0,0,-2e-06,0,1e-06,-1e-06,1e-06,0,1e-06,-1e-06,0,0,0,0,-1e-06,0,1e-06,3e-06,1e-06,1e-06,0,-1e-06,-1e-06,0,-1e-06,-1e-06,1e-06,0,-1e-06,-1e-06,1e-06,0,0,-1e-06,-2e-06,0,-1e-06,0,0,0,1e-06,1e-06,-1e-06,0,-5e-06,0,-1e-06,0,-1e-06,0,2e-06,0,-1e-06,3e-06,-1e-06,2e-06,0,0,0,-1e-06,2e-06,0,0,0,0,0,-1e-06,0,0,0,-2e-06,-2e-06,0,0,0,0,-1e-06
-2e-06,-2e-06,0,1e-06,-1e-06,-1e-06,0,4e-06,-1e-06,-2e-06,-2e-06,-2e-06,-1e-06,3e-06,-1e-06,-3e-06,-1e-06,-1e-06,8e-06,-2e-06,0,3e-06,2e-06,0,0,-3e-06,-1e-06,1e-06,0,1e-06,1e-06,-6e-06,0,-1e-06,1e-06,-1e-06,-1e-06,-2e-06,2e-06,0,0,-2e-06,-6e-06,3e-06,-1e-06,0,1e-06,0,-1e-06,-1e-06,0,1e-06,1e-06,-1e-06,0,-1e-06,0,-1e-06,0,0,-1e-06,-1e-06,0,0,0,0,0,-1e-06,1e-06,1e-06,-2e-06,0,0,0,0,0,1e-06,1e-06,1e-06,0,1e-06,0,2e-06,1e-06,-1e-06,-1e-06,3e-06,0,1e-06,1e-06,-1e-06,0,-1e-06,0,0,2e-06,0,-4e-06,1e-06,0,0,0,1e-06,-1e-06,2e-06,0,1e-06,-2e-06,-1e-06,-1e-06,-1e-06,-1e-06,0,0,-4e-06,1e-06,0,-1e-06,0,0,1e-06
2e-06,1e-06,0,-1e-06,0,0,0,-3e-06,2e-06,-1e-06,2e-06,-2e-06,0,-2e-06,0,0,-1e-06,1e-06,-1e-06,2e-06,1e-06,-3e-06,0,-1e-06,1e-06,-4e-06,0,1e-06,0,0,0,6e-06,-2e-06,0,1e-06,2e-06,1e-06,1e-06,-1e-06,-1e-06,0,4e-06,0,-3e-06,0,-1e-06,1e-06,0,0,-1e-06,-2e-06,0,0,-1e-06,0,0,0,-1e-06,0,0,0,-3e-06,-1e-06,0,0,1e-06,-1e-06,0,0,-1e-06,1e-06,0,1e-06,1e-06,0,0,-1e-06,0,0,0,-1e-06,0,0,0,2e-06,0,-3e-06,0,0,-1e-06,1e-06,0,-2e-06,0,-1e-06,2e-06,0,5e-06,3e-06,-2e-06,0,1e-06,0,0,0,0,-2e-06,-1e-06,2e-06,0,2e-06,0,0,0,1e-06,-1e-06,0,1e-06,-1e-06,-1e-06,1e-06
0,-1e-06,0,1e-06,1e-06,0,0,1e-06,-1e-06,2e-06,0,-2e-06,1e-06,3e-06,-1e-06,1e-06,1e-06,0,-5e-06,-1e-06,0,-3e-06,-2e-06,1e-06,1e-06,6e-06,-1e-06,1e-06,1e-06,1e-06,0,-4e-06,-1e-06,0,-3e-06,-1e-06,0,0,-2e-06,3e-06,0,-3e-06,2e-06,1e-06,0,1e-06,-1e-06,0,1e-06,-1e-06,2e-06,0,0,-1e-06,0,1e-06,0,-1e-06,0,0,1e-06,-2e-06,2e-06,0,0,1e-06,1e-06,0,0,0,-1e-06,0,0,0,0,0,0,0,-1e-06,0,1e-06,0,-2e-06,-1e-06,-1e-06,0,1e-06,0,2e-06,-1e-06,0,0,0,0,0,-1e-06,0,-4e-06,1e-06,3e-06,0,-1e-06,-1e-06,0,-2e-06,0,2e-06,1e-06,-1e-06,1e-06,-1e-06,-1e-06,0,0,-3e-06,-1e-06,0,-1e-06,0,0,1e-06
-1e-06,1e-06,0,-1e-06,0,0,0,1e-06,1e-06,0,-1e-06,3e-06,-2e-06,-4e-06,-1e-06,0,0,0,6e-06,-1e-06,0,0,-3e-06,-1e-06,1e-06,1e-06,-2e-06,-1e-06,-1e-06,-1e-06,1e-06,5e-06,1e-06,-2e-06,3e-06,2e-06,2e-06,-1e-06,0,-1e-06,0,-2e-06,7e-06,-2e-06,0,-1e-06,-1e-06,0,-3e-06,0,0,0,-1e-06,-1e-06,0,0,0,-1e-06,0,0,0,1e-06,-3e-06,0,0,-1e-06,-1e-06,0,0,1e-06,1e-06,0,0,0,-1e-06,0,0,0,-1e-06,0,-1e-06,0,-1e-06,1e-06,1e-06,0,1e-06,0,-3e-06,3e-06,-1e-06,0,1e-06,0,0,-1e-06,0,4e-06,-1e-06,-2e-06,-1e-06,1e-06,1e-06,0,0,0,-2e-06,1e-06,0,0,0,0,0,0,4e-06,1e-06,0,-1e-06,0,-1e-06,-1e-06
