-0.00037,-0.000495,-0.00029,-0.000275,-0.000156,-0.000466,-0.000312,-0.000345,-0.006752,-0.006907,-0.00537,-0.004214,-0.00346,-0.002076,-0.001704,-0.002268,-0.001247,-0.002017,-0.000915,-0.016663,-0.012812,-0.007334,-0.010312,-0.010665,-0.013834,-0.012958,-0.014074,-0.011972,-0.012232,-0.01,-0.008801,-0.00987,-0.007294,-0.017281,-0.015469,-0.013007,-0.021108,-0.010323,-0.010345,-0.01193,-0.013446,-0.012595,-0.006796,-0.009043,-0.027687,-0.01965,-0.013314,-0.011474,-0.006322,-0.010717,-0.010664,-0.009343,-0.006743,-0.007101,-0.004635,-0.004234,-0.004446,-0.004571,-0.002241,0.002497,-0.000372,-0.001139,-0.002575,-0.000635,-0.002771,-0.001629,-0.001203,-0.00166,-0.000992,-0.001027,-0.000649,-0.000696,-0.000125,-0.000391,0.000747,0.000616,0.00012,-0.000526,-0.000626,-0.00082,-0.000705,-0.000696,-0.000366,-0.001038,-0.000925,-0.000715,-0.000517,-0.001121,-0.000529,-0.000189,-0.00029,-0.000367,-0.000468,-0.000449,-0.000629,-0.000715,-0.000689,-0.000659,-0.000622,-0.000315,-0.000186,-0.001864,-0.001405,-0.000701,-0.002907,-0.006126,-0.003361,-0.001774,-0.001307,-0.000735,-0.000424,-0.003496,-0.002049,-0.005228,-0.003005,-0.001035,-0.000407,-0.000618,-0.00031,-0.000447,0.000169
4.9e-05,0.000132,-2.4e-05,-0.000135,-0.000124,-0.000252,-0.000424,-0.000368,0.000948,-0.000909,-0.000146,0.001741,0.000791,-0.000258,-4.9e-05,0.001048,0.000194,-0.000142,0.001941,0.014449,0.011022,0.000681,0.001023,-0.002896,-0.006056,0.000463,-0.003076,-0.001501,-0.00552,-0.004026,-0.001653,0.002065,-0.002372,-0.000485,0.002934,-0.001721,0.002207,0.005937,0.000278,-0.002171,-0.002543,-0.005046,-0.002711,0.000261,0.011525,0.00216,-0.002117,-0.00248,-0.001758,0.001403,-0.000669,-0.000776,0.001058,-0.001914,-0.000691,0.001381,-0.002199,-0.000129,0.000367,-0.000305,0.001419,-0.00071,0.00229,0.001202,-0.000164,-0.001522,-0.001194,-0.000397,-0.001338,-0.000546,-0.000366,0.000135,-0.000617,-0.000754,-0.000808,-0.000388,9.2e-05,0.00044,5e-06,-0.000303,-0.000361,-8.9e-05,0.000224,0.000186,0.000284,4.1e-05,-0.00018,-0.000404,-0.000449,0.000151,0.000174,-0.000315,-0.000248,-0.000452,-0.000257,0.000148,0.000105,0.00015,-0.000227,-0.000117,-0.000298,0.000459,0.000815,0.000544,0.00124,0.002452,0.001499,0.001015,0.000472,-0.000235,-0.000393,0.000903,0.001177,0.004771,0.002882,0.000808,-0.000528,-0.000238,2.3e-05,0.002088,0.003701
8.1e-05,3.8e-05,0.000219,0.000141,0.000101,0.000275,0.000305,0.00013,-0.000344,0.001616,0.000603,0.000197,-1.8e-05,-0.000137,-0.000379,-0.000443,0.000125,0.000625,0.00155,-0.002525,-0.006728,-0.003336,-0.005252,-0.002696,-5.6e-05,-0.005113,-0.002864,-0.003391,-0.004365,0.000573,0.00353,1.7e-05,-0.00229,0.001737,-0.004923,-0.002533,-0.005239,-0.001716,-0.003068,-0.001834,0.000622,0.000858,-0.008012,-0.000655,-0.003256,-0.001643,0.00081,-0.00343,-0.001366,-0.002407,-0.003801,-0.001067,-0.002969,-0.001944,-0.001357,-0.002274,7e-06,0.000698,5e-05,0.000257,-0.000303,0.001027,-0.000395,-0.000671,-3.1e-05,0.000748,0.000828,0.000182,0.000674,0.00035,0.001085,0.000732,0.000353,-0.000184,-0.000821,-0.001214,-0.000656,0.000144,-0.000169,-0.00012,0.000189,0.000189,-0.000132,0.000211,0.000159,0.000109,0.000107,0.000563,0.000265,-0.000154,-0.000164,3.6e-05,-9e-06,0.000191,0.000453,-0.000387,-0.000147,-5.2e-05,0.000371,0.000347,0.00022,-0.001106,-0.001213,-0.000584,-0.000113,-0.001453,-0.00121,-0.000554,0.000129,0.000685,0.000286,-0.000877,-0.001693,-0.003489,-0.002074,-0.000528,0.000377,-5.8e-05,-0.000534,-0.001148,-0.000983
-5.8e-05,-0.000148,-0.000145,-9.4e-05,-0.000163,-0.000337,-0.000283,0.000131,-0.00038,-0.002896,-0.001271,0.000288,9.3e-05,-0.00091,-0.000238,0.000795,0.000134,-0.000288,-0.00015,0.001982,-0.001231,-0.000149,0.003461,0.003831,0.001565,-0.001636,0.000981,-0.000804,0.003809,0.001379,-0.001207,0.002835,0.000861,-0.002815,0.001883,0.00192,0.000317,-0.000769,-0.008243,-0.000943,-0.005138,0.001248,-0.00111,0.002575,-0.002003,0.003583,0.000614,-0.000417,0.000186,-0.002733,0.005833,0.000578,0.001575,0.00105,0.000397,0.000768,0.001984,0.001177,-0.000966,-0.003011,-0.001839,-0.000732,-0.000157,7e-05,-0.000491,-0.000517,-0.000493,0.000422,0.000285,3.1e-05,-0.000522,-0.000731,-0.000434,-0.000146,-0.000147,-5.5e-05,-0.000154,0.000224,0.000158,0.000239,3.7e-05,-0.000154,0.000266,-0.000129,-0.000207,-0.000153,1.2e-05,-0.000216,-0.000262,-0.000105,-8e-06,0.000102,0.000182,0.000105,-0.000136,5.6e-05,0.000157,0.000102,-0.000222,-0.000313,-1.7e-05,0.000704,0.00081,0.000381,-0.000232,0.000604,0.000531,0.000289,-0.000216,-0.000573,-0.000143,0.000554,0.000803,0.001404,0.001394,0.000456,-0.000145,-0.000161,0.000291,-0.001269,-0.002719
0.000338,0.00011,0.000155,3.6e-05,1.7e-05,7.9e-05,0.000117,-0.00021,0.000242,-0.000887,0.000376,0.000752,-0.001318,5.9e-05,0.000157,-0.000213,-0.000574,-2.2e-05,-0.000626,0.002182,-0.00461,0.003625,-0.001486,0.002693,0.000295,0.004098,0.002339,0.00388,0.001425,-0.006139,-0.003046,-0.001436,0.002511,0.001982,0.000239,-0.000661,0.001486,-0.001062,-0.001656,-0.000146,-0.001467,0.00017,0.002415,0.001685,-0.004337,-0.000531,0.001025,-0.002176,-0.002941,0.001212,-0.00038,-0.001203,-0.000684,-0.001337,-0.000717,-0.000787,-0.001467,-0.001876,-0.000816,2e-04,-0.000973,8e-04,-0.000208,-0.001105,-0.000505,0.00048,0.000771,1.7e-05,0.000435,0.000457,0.000158,0.000388,0.000367,-7.5e-05,-9.6e-05,-0.001354,-0.000865,-3.4e-05,6e-05,0.000201,-0.000322,-1.4e-05,-4.4e-05,9.3e-05,0.000459,-1.2e-05,6.5e-05,0.000107,0.00023,-0.000155,-5.3e-05,-6.2e-05,4.6e-05,3.6e-05,-4.2e-05,0.000131,-7.7e-05,-6e-06,-2.8e-05,-0.000113,0.00013,1.2e-05,-0.001,-0.000397,0.000339,1e-06,-0.000704,-0.00028,-0.00012,0.000233,-5e-05,-0.000901,-0.000798,-0.000193,-0.001225,-0.001006,-0.00079,-4.6e-05,-0.000684,-0.000659,-0.004083
-0.000245,-9.6e-05,-0.000141,-2.3e-05,1e-04,0.000156,0.000125,6.9e-05,0.000156,0.000917,0.000307,-0.000654,-0.000587,-9.1e-05,0.000174,-9e-05,0.000758,5.5e-05,0.000704,-0.004751,-0.002816,-0.001784,-0.005001,-0.001544,-0.002453,-0.003104,0.000946,-0.004928,0.000732,0.0026,-0.003633,-0.00053,0.001719,0.002753,-0.001195,-0.001269,-0.000847,3.5e-05,0.003896,0.001377,0.001704,-0.000851,-0.000561,-0.000269,0.001882,-0.001498,0.000969,0.002083,-0.00058,0.002038,0.000412,0.001271,-0.000951,0.00289,0.000594,0.001553,6.9e-05,0.000255,-4e-05,0.000198,-0.001714,-0.000408,-1e-04,4e-04,0.000885,-0.000367,-0.000637,-0.000123,-0.000264,-0.000134,-2.7e-05,-0.000664,-0.000653,-0.000152,-0.000198,-8.4e-05,-0.000162,0.000327,0.000293,-0.000212,0.00045,-0.000124,0.000265,4.2e-05,-0.000384,-0.000136,0.00013,0.000192,-2e-06,3.8e-05,-9.9e-05,0.000244,9e-05,-9e-06,8.1e-05,-2.1e-05,0.000186,4.5e-05,6e-06,0.000293,9.6e-05,2e-05,0.000431,0.000434,2.2e-05,-2.7e-05,0.000559,0.000466,3.2e-05,-5e-05,0.000223,0.000497,0.000823,-0.000568,7.7e-05,0.000156,0.000248,-0.000141,-2e-06,-0.000669,0.000377
6.9e-05,0.000172,0.00011,9.1e-05,-5.5e-05,-2.9e-05,-9.2e-05,-4.3e-05,-4.4e-05,-0.000768,0.000932,-0.000438,-5.6e-05,0.00014,0.000118,-0.000153,-0.000679,8.3e-05,-0.000397,-0.002075,-0.002439,-0.006482,-0.002896,0.000788,-0.000262,0.001072,-0.000974,0.001593,0.000117,0.001698,0.001292,-0.003079,0.000263,0.001432,-0.000265,0.000708,-0.000187,-0.001227,0.000122,0.000305,0.001449,0.003606,-0.00073,0.001037,0.001796,0.000893,-0.001552,0.001963,0.005368,0.000392,-0.000543,-0.001067,0.00107,-0.000619,-0.000407,-0.000633,-0.000223,0.000855,0.000612,-0.000375,0.00016,7e-06,-0.000304,-0.001015,-0.00013,0.00036,-0.000153,-0.000237,-0.000397,-0.00069,-0.000145,0.000183,0.000279,-0.00041,5.4e-05,-0.000359,-0.00031,-0.000127,-0.000269,0.000165,7.7e-05,-8.5e-05,-0.000133,-0.000172,0.00021,0.000141,-3e-05,-0.00018,-4.4e-05,1e-04,-0.000137,-0.000136,-0.000158,-0.000186,-5.8e-05,-2e-06,-8e-05,-0.000256,-9.2e-05,-3.4e-05,-0.000104,-6.3e-05,-0.000223,-6.5e-05,-0.000125,-0.000128,-6.7e-05,-0.000289,9.4e-05,9.6e-05,-0.000268,-5.9e-05,9.2e-05,-0.000481,-0.000444,1.7e-05,2.7e-05,3e-06,-7e-06,0.000226,0.00042
-4.4e-05,-0.000153,-6.8e-05,-9.6e-05,-4.4e-05,-8.1e-05,-6e-06,-1.5e-05,-2.8e-05,0.000267,-0.000458,0.000581,0.000381,-0.000124,-0.000144,-0.000276,-1e-06,-0.000284,-6.1e-05,0.001592,0.00128,-0.002199,-0.00117,-0.001024,-0.000303,0.002176,-0.003095,-0.000389,-0.001143,-0.000388,-0.006992,-0.001301,-0.002488,-0.001277,-0.000386,0.001283,0.001609,0.002153,0.000988,0.001348,0.001126,-0.001958,-0.001672,-0.002007,-0.000601,-0.002086,0.000564,-0.000923,-0.00042,-0.001467,0.000562,-8e-06,0.000278,0.000402,0.000755,0.000361,0.000466,-0.000287,0.000356,0.00038,4.7e-05,-0.000262,-0.000261,2e-04,0.000138,-3.5e-05,0.000736,0.00055,-0.000268,0.000166,0.000174,-3e-06,0.000104,0.000239,-0.000101,0.000194,8.6e-05,-2.8e-05,-0.000239,-0.000168,-4.5e-05,0.000146,7.7e-05,4.2e-05,-0.000189,-2e-06,-0.000195,-0.00011,-1e-04,-3.9e-05,2.6e-05,0.000136,2.6e-05,-1.5e-05,8.3e-05,-5e-05,-0.000155,0.000204,-4.6e-05,-1e-05,3.5e-05,-3.8e-05,-8.6e-05,-5.5e-05,-0.000125,-0.000207,-0.000123,-2.4e-05,-0.000213,-2.1e-05,0.000202,4.7e-05,-0.000441,0.000576,0.000319,-4.4e-05,5.2e-05,4.1e-05,-2.6e-05,-0.000569,-0.000422
-5.3e-05,5e-05,-2.7e-05,0,-1e-06,3.9e-05,2.6e-05,9.6e-05,-1.1e-05,0.00013,0.000448,-0.00054,-0.000323,-5e-05,0.000611,3.8e-05,-0.000244,9.1e-05,7.7e-05,-0.000189,-0.000455,-0.001991,-0.001197,-0.000198,0.001796,0.000176,-0.003849,-0.001545,-0.001778,-0.000501,0.001179,0.002266,-0.001207,0.000372,0.00043,0.000387,-0.00019,-9.9e-05,0.001234,-0.002767,0.000685,0.001701,0.001488,-0.002437,-0.00071,-0.000603,7.7e-05,-0.00081,0.000476,-0.000909,-0.000347,-0.001422,7.1e-05,-0.000833,0.000484,-0.000622,9.4e-05,-0.000513,-0.00017,6.8e-05,-0.000153,-0.000608,7e-06,-0.000647,4.9e-05,-0.000293,-0.000337,-0.000138,0.000124,6.1e-05,-0.000177,-0.00023,-0.000124,0.000275,-0.000341,-7.2e-05,-0.000893,-0.000514,-2e-06,0.000148,-0.000147,-0.000145,-0.000231,-0.000182,0.000136,1.8e-05,0.000121,4.4e-05,0.000104,4.9e-05,-1.6e-05,-0.000146,5.1e-05,9.4e-05,6.4e-05,7.5e-05,1.6e-05,-0.000194,1.4e-05,3e-06,-3.5e-05,-6.9e-05,5.6e-05,0.000164,-2e-04,6.6e-05,-4.7e-05,-0.000129,-8.9e-05,-3e-06,-4.7e-05,1.3e-05,-0.000166,0.000103,-0.000182,7.7e-05,0.000128,-4e-06,0.000146,0.00026,-9e-05
4.4e-05,-7e-05,2.9e-05,2.3e-05,4.4e-05,-6.2e-05,-3.3e-05,-3e-05,1e-06,-0.000273,-0.000578,-0.000618,0.000259,-0.000105,-0.000318,-0.000123,0.000112,-0.000152,-0.000166,0.00022,0.00174,-0.00081,0.002745,0.000978,-0.00012,-0.000362,0.001821,0.000277,-0.000118,0.000192,0.002648,-0.001327,-0.001119,-0.001043,-0.002018,-0.002039,-0.000419,-0.000116,-0.000603,-0.000925,-0.000944,6.7e-05,-0.001316,-0.000115,-0.001049,0.000132,0.001707,0.000383,-0.001823,0.001339,-0.000477,0.001143,0.001008,-0.00044,-0.001185,0.000219,0.000557,0.000295,-0.000108,-0.000121,0.000682,-0.00026,-0.000331,0.000246,0.000404,0.000428,9.4e-05,5e-05,-0.000174,-0.000119,-3.4e-05,9.8e-05,0.000133,0.000132,-4.2e-05,-0.000129,-0.000123,0.000123,4.7e-05,-6.2e-05,1.6e-05,1.2e-05,2.9e-05,7.4e-05,-0.000134,1.5e-05,3.8e-05,-1.7e-05,-4.4e-05,-5.8e-05,8.8e-05,8.2e-05,0,3.1e-05,-8e-05,1e-05,-1e-05,0.000146,5.5e-05,-9e-06,-4.1e-05,-5.8e-05,-8.2e-05,-0.000177,0.000175,-3.3e-05,8.5e-05,3.9e-05,3.1e-05,-7.5e-05,-0.000161,-0.00015,0.000179,-0.000164,0.00019,0.000356,3.4e-05,2.5e-05,-0.000151,6.5e-05,0.000126
-4.5e-05,-3.6e-05,2e-06,-5.8e-05,-3.1e-05,6.2e-05,5.4e-05,-5e-05,8e-06,-9.9e-05,0.000267,0.000169,-0.000526,3.5e-05,0.000176,9e-05,-8.6e-05,4.2e-05,0.000107,0.000567,-0.001573,0.000118,-0.002393,-0.000451,-0.000997,-0.000312,0.00132,0.000317,-0.000173,-0.001562,0.000212,-0.000586,-0.000837,0.000305,3.1e-05,0.001142,-0.001573,-0.000516,0.00028,-0.001625,-0.00091,0.000251,-0.000698,0.002159,-5e-05,-0.001594,-0.001418,-0.000384,-1.5e-05,-0.000598,-0.00042,-6.3e-05,-0.000276,0.000464,0.000126,-0.000145,-0.000402,-0.00011,-0.000118,4.2e-05,-0.000675,-0.000606,-0.000452,0.000292,-0.000287,0.000389,-4e-04,-4e-06,0.000342,8e-06,1.5e-05,9.8e-05,4.5e-05,-0.000197,1e-05,0.000107,0.000558,-7.6e-05,-0.000112,4.1e-05,0.000125,3.5e-05,3.5e-05,-3e-06,4e-06,2.4e-05,4.7e-05,1.9e-05,2.4e-05,-2.8e-05,3.7e-05,-7.1e-05,-1.4e-05,-3e-06,-8e-06,-1e-06,7.7e-05,-6.6e-05,2.5e-05,2.3e-05,0.000134,9.9e-05,4.1e-05,-0.000124,-0.000164,6.1e-05,0.000134,-0.000213,-5e-06,-6.1e-05,0.000227,0.000116,-8.6e-05,0.000247,0.000308,-0.000283,-8.9e-05,0.000364,8.1e-05,0.000216,0.000207
-3.1e-05,6.3e-05,8e-06,3.4e-05,3e-05,-4.8e-05,2.9e-05,2.5e-05,-2.7e-05,0.000197,-0.000432,-0.000272,-0.000284,0.000123,-5e-06,3.6e-05,2.6e-05,-0.000124,-0.00016,-0.000808,-0.000779,0.001401,-9.2e-05,0.000989,0.000656,0.000271,-0.001448,0.001523,0.00448,0.000755,2.1e-05,-0.001005,-0.001614,-0.000864,0.001374,-0.001552,0.000266,-3.7e-05,0.000828,5.6e-05,0.00048,9.9e-05,0.000459,6.9e-05,0.000277,6.8e-05,-1.4e-05,0.00074,-0.000119,-0.000134,-0.000386,-9.9e-05,-0.000534,0.00037,0.000795,-3.4e-05,9.4e-05,0.000605,0.000449,-0.000345,-0.000149,0.000156,-0.000106,-5e-06,0.000239,-0.000252,0.000151,-5.2e-05,-0.000161,4e-06,-0.000182,-0.000131,1.6e-05,1.2e-05,3.9e-05,2.4e-05,7.3e-05,-9e-05,4.9e-05,-0.000137,-5.7e-05,-7.2e-05,-0.00014,-2e-05,-9e-05,-2.8e-05,-5.2e-05,-2.4e-05,-9e-06,5.6e-05,2e-06,-6.7e-05,-2.8e-05,-2.7e-05,-2.2e-05,3.6e-05,-3.8e-05,3.8e-05,-6.4e-05,-4e-05,-5.5e-05,-5.7e-05,1.7e-05,-0.000214,0.000146,-1.6e-05,-9e-06,0.000358,1.6e-05,3.2e-05,-0.000122,-1.6e-05,6.8e-05,-0.000384,-0.000125,0.000382,7.7e-05,-0.000176,2.8e-05,-0.000261,3e-06
2.4e-05,-5.2e-05,-2.8e-05,-4.7e-05,1.1e-05,-4e-06,-3.6e-05,-3.6e-05,-2.6e-05,4.7e-05,5e-06,0.000424,5.4e-05,-0.000193,-6.5e-05,0.000235,6.5e-05,0.000183,2.4e-05,-0.000317,0.000717,0.00212,5e-04,-0.000116,-0.000745,-0.000768,0.000428,-0.000847,-0.000649,-0.000416,-0.000503,0.002636,-0.000754,0.000232,0.00012,0.000271,-0.000414,3e-04,-0.000275,0.000169,9.5e-05,-0.001844,0.000217,-0.000671,7.5e-05,0.000626,0.001423,-3.3e-05,7.5e-05,0.000784,0.000238,-0.000366,0.000456,0.000377,-0.000224,-0.000131,-0.000282,-0.000229,-0.000252,0.000263,0.000234,0.000115,-0.000121,0.000182,-0.000357,3.8e-05,-0.000178,0.000123,9.1e-05,4.7e-05,6.5e-05,3.8e-05,3.1e-05,-1.7e-05,0.000165,4.9e-05,0.00012,-0.000264,-6.8e-05,3e-06,2e-05,-1.9e-05,5.8e-05,3.7e-05,8.9e-05,7.8e-05,-5.4e-05,2.2e-05,-8e-06,3.9e-05,-7e-05,-1.2e-05,-1e-06,-3.5e-05,5e-06,-7.5e-05,1.3e-05,1e-06,4.3e-05,-3.9e-05,-1.9e-05,-4e-06,-5.3e-05,9.9e-05,-0.000139,-2.5e-05,-5.2e-05,-0.000388,-1.8e-05,2.4e-05,6e-05,-2.1e-05,-9.5e-05,0.000175,-2.9e-05,-0.000436,-8.9e-05,2.9e-05,-0.000141,3.2e-05,-5.3e-05
-2.5e-05,4e-06,-8e-06,4.3e-05,-1.7e-05,1.4e-05,-1e-06,4.9e-05,3.3e-05,-2.1e-05,4.2e-05,-1.1e-05,0.000208,0.000123,-2.6e-05,-0.000118,-1.6e-05,-0.000109,2.7e-05,0.000441,5.7e-05,-0.000722,0.001591,0.00129,0.00018,0.000662,-0.000233,-0.000163,-0.000312,0.001052,-0.001113,-0.001057,0.000333,-0.000242,-8.5e-05,-4e-06,0.001262,0.000105,0.000758,0.000598,0.000695,0.00071,-0.00036,0.000572,-5.8e-05,0.000852,-0.002316,-0.000387,1.7e-05,0.00124,0.000483,0.000195,-0.000327,-0.000166,0.000262,0.000233,4e-04,-1.7e-05,-0.000135,-6.2e-05,-8.3e-05,0.000422,-0.000114,-0.000252,0.000126,-6.2e-05,0.000178,9e-06,-0.000131,1e-06,3.3e-05,-2e-05,8e-06,1e-05,-5.4e-05,3e-06,-0.000247,4.3e-05,3.6e-05,-2.3e-05,2.7e-05,4.7e-05,1.5e-05,-5.8e-05,-8.4e-05,-3.5e-05,3.1e-05,-4.7e-05,-4e-06,-5.4e-05,2.1e-05,-3.1e-05,-3e-05,5e-06,2.1e-05,4.7e-05,4.4e-05,2.6e-05,-3.3e-05,-2.9e-05,1.2e-05,3.3e-05,7e-06,9.5e-05,6.4e-05,3.3e-05,-1.1e-05,0.000174,-4.9e-05,-8.8e-05,-4.4e-05,1.6e-05,0.000127,-1.8e-05,-0.000119,0.00042,9.2e-05,-5.2e-05,2e-06,3.9e-05,3e-06
3.2e-05,1.3e-05,-1.7e-05,-1.8e-05,9e-06,1.2e-05,6e-06,-1.4e-05,-1.3e-05,4.4e-05,0.000121,7.8e-05,0.000148,0.000101,3.8e-05,-1.4e-05,2.8e-05,9.1e-05,-2.8e-05,-1.8e-05,0.000351,-0.000312,0.000534,-0.001322,0.000255,3.1e-05,-8.5e-05,-0.000245,-0.000544,0.000236,0.000158,-0.000591,0.000508,-0.00025,-0.000226,-0.000683,-0.000554,0.000388,-0.000429,0.000266,0.000202,-0.000248,0.000648,-0.000194,0.00022,0.000783,0.001114,6.4e-05,9e-06,-0.000551,7.7e-05,0.000153,-5.9e-05,-6.2e-05,-0.000186,4.4e-05,0.000162,-4.5e-05,0.000171,-1.5e-05,5e-06,0.000168,5e-06,0.000215,-8.2e-05,-7e-06,6.7e-05,-4e-06,-2e-06,3.1e-05,-7e-05,6e-06,-1.6e-05,-2.8e-05,-1.9e-05,1.6e-05,-4.9e-05,-3e-05,3.6e-05,-2.8e-05,3.9e-05,2e-06,-6e-06,5.3e-05,5.4e-05,3.5e-05,-4e-05,1.6e-05,9e-06,6e-06,-2.2e-05,3.5e-05,-2e-06,0,-1.8e-05,4.4e-05,-3.6e-05,4e-06,1.7e-05,1.8e-05,1e-05,-4.1e-05,1.4e-05,-2.8e-05,-0.00016,-4e-06,2.1e-05,0.000122,-2.9e-05,-1e-06,4.2e-05,7e-06,-6.1e-05,0.000102,-1.6e-05,-0.00023,-9.2e-05,2.1e-05,3e-05,0,2.8e-05
5e-06,0,1e-06,6e-06,3e-06,-9e-06,-1.1e-05,-8e-06,3e-06,-1.7e-05,0.000105,-1e-06,-0.000157,2e-06,5.5e-05,1.9e-05,-0.000109,-5e-05,0,1e-06,-0.000149,-0.000193,0.000891,-2.4e-05,0.000695,-0.000221,-0.000384,0.000338,0.000421,-0.000298,-0.000749,0.000339,3.4e-05,-0.000822,-0.000406,0.000703,0.000589,-0.000387,0.000299,8.9e-05,0.000365,0.000382,0.000133,-9.7e-05,-0.000105,2.7e-05,-0.000416,9.5e-05,-4.6e-05,-0.000349,-1e-06,-3.5e-05,-0.00017,-0.000178,6.7e-05,-0.000414,0.000112,-0.000133,-0.000139,-2.5e-05,-6.9e-05,-0.00013,4.7e-05,5.5e-05,-9.4e-05,9.7e-05,5e-06,-2.6e-05,-3.7e-05,1.8e-05,-2.1e-05,2e-05,1.3e-05,4.7e-05,-8e-06,2.2e-05,7.7e-05,3.9e-05,-3.6e-05,-3.4e-05,-2.8e-05,-5e-05,1.8e-05,-1.1e-05,-3.4e-05,0,-1.4e-05,-1.5e-05,0,1.2e-05,1.8e-05,1.4e-05,6e-06,-2.2e-05,7e-06,-4.2e-05,-3e-06,-2.4e-05,-8e-06,0,-3e-05,1.5e-05,-1.4e-05,4.1e-05,8.9e-05,1.5e-05,-5e-06,-1.5e-05,7.7e-05,-2e-06,-8.3e-05,-1.3e-05,1.7e-05,5.6e-05,9.4e-05,-7.5e-05,2.9e-05,-5.3e-05,-8.1e-05,-1.9e-05,-1.5e-05
-2.2e-05,1.6e-05,5e-06,-2e-06,2e-06,1e-06,-1e-05,-7e-06,-4e-06,-3e-05,-0.000116,-9.7e-05,2.7e-05,9e-05,-7e-06,-5.7e-05,2.5e-05,-2e-06,1.3e-05,0.000132,-0.000379,-0.001329,-0.001178,-9e-05,0.000154,2.6e-05,-0.000381,-0.000555,-0.00036,-5.6e-05,0.000642,-0.000101,-8.3e-05,-0.000445,2.4e-05,-0.000132,-0.000127,-7.3e-05,-0.000101,0.000219,-0.00015,-0.000544,4.8e-05,-8.9e-05,1e-05,-0.000324,-0.000525,0.000135,-4.8e-05,0.000326,-0.000269,-0.000182,-0.000332,-5e-06,-0.000181,0.000254,-0.000206,0.000183,-5.6e-05,0.000162,-0.000113,-0.000127,-1.2e-05,6.6e-05,3.3e-05,2.7e-05,-9.6e-05,2.4e-05,5e-05,-5.3e-05,2.1e-05,5.7e-05,-5e-06,-2e-05,1e-06,-1.4e-05,-6e-06,6.7e-05,8e-06,-3.7e-05,-1.7e-05,-5e-06,-1.7e-05,-8e-06,2.3e-05,-1.1e-05,6e-06,1.9e-05,-3e-06,5e-06,2.6e-05,2.5e-05,-6e-06,5e-06,-1.5e-05,2.1e-05,3e-06,2.2e-05,2.4e-05,1.2e-05,3e-06,7e-06,1.6e-05,-1.7e-05,-6.6e-05,1.2e-05,-1.9e-05,-2.6e-05,-4.3e-05,2.1e-05,3.8e-05,5e-06,-2.9e-05,-0.000145,6.4e-05,7.2e-05,-1.2e-05,8.4e-05,3.9e-05,-1.1e-05,2.4e-05
8e-06,-1.3e-05,5e-06,2e-06,-9e-06,1e-05,5e-06,-3e-06,1.2e-05,-1.8e-05,0.000121,-8.2e-05,3.2e-05,-6.1e-05,-6.9e-05,-1.1e-05,-2.3e-05,7e-06,-1.2e-05,-0.000158,-5.4e-05,0.000315,0.000871,-0.000194,0.000356,3.9e-05,0.000389,0.000188,-0.000185,0.000474,0.000502,-0.000127,1e-04,0.000189,-5.7e-05,5.2e-05,-0.000156,8.6e-05,-3.6e-05,0.000176,-6.3e-05,6e-05,-3.2e-05,8.3e-05,0.000234,-0.000308,0.000289,-0.000201,-7.1e-05,-0.00013,-0.000159,-3e-05,0.000294,3e-06,0.000152,1.8e-05,3.6e-05,-3.5e-05,0.000147,-0.000187,2.8e-05,2.2e-05,-1e-05,7e-05,-3.3e-05,-5e-06,3.4e-05,-1.1e-05,-2e-06,-4e-05,2.9e-05,-2.6e-05,-3e-06,-6.4e-05,-1e-06,2.7e-05,-9e-06,9.7e-05,-5e-06,-6e-06,3e-06,0,-1.6e-05,0,-2.4e-05,-6e-06,0,-8e-06,1e-06,1e-06,-2.1e-05,-1e-06,1e-05,8e-06,8e-06,1.5e-05,3e-06,-1.9e-05,-2.1e-05,-1.4e-05,1.7e-05,-1.3e-05,-1.1e-05,2e-05,6e-06,-3e-06,-9e-06,-8.2e-05,6e-05,0,5e-06,1e-06,7e-06,-5e-06,-4.1e-05,1e-05,2e-06,-3.8e-05,-2e-05,2.9e-05,1.5e-05
3e-06,-2e-06,1e-06,-6e-06,4e-06,0,2e-06,1.4e-05,-1e-06,3.6e-05,-1e-06,8e-06,-2.4e-05,2e-05,1.4e-05,1.8e-05,4e-06,-1.5e-05,5e-06,-1e-04,0.000187,-8.3e-05,-0.000307,-2e-06,9.2e-05,-0.000117,6.3e-05,2.6e-05,-8.4e-05,-4e-06,-0.000425,-7e-05,-4.1e-05,0.000589,-0.000202,-5.9e-05,0.000167,6.8e-05,-0.000126,-0.000305,7.8e-05,9.1e-05,0.000137,2e-06,0.000102,-0.000113,-0.000466,-6.7e-05,-4.7e-05,-7.7e-05,0.000169,0.000149,0.000116,-0.000145,7.8e-05,1.9e-05,-9.8e-05,-2.3e-05,-7.5e-05,0.000107,-3e-06,-0.000109,-3.7e-05,6e-06,2.4e-05,4.3e-05,-6.3e-05,-8e-06,-1.6e-05,3.1e-05,-3e-06,-9e-06,1.2e-05,2.4e-05,-1.3e-05,-4e-06,-5.2e-05,3.3e-05,2.2e-05,1.4e-05,0,-1e-06,-2e-06,3e-06,2.3e-05,4e-06,1.8e-05,-2e-06,3e-06,-1.1e-05,-1.7e-05,3e-06,-4e-06,-1e-06,4e-06,-1.6e-05,0,5e-06,5e-06,1.6e-05,-2.4e-05,8e-06,-1.4e-05,3.2e-05,3.7e-05,2e-06,1.7e-05,7.4e-05,-3.6e-05,5e-06,-2.8e-05,1e-06,1.6e-05,4.4e-05,-3.3e-05,3.9e-05,1e-06,9e-06,5e-06,6e-06,1e-06
-2.1e-05,7e-06,1e-06,4e-06,1e-06,-1e-05,2e-06,-7e-06,-6e-06,-4.5e-05,-2.7e-05,3.8e-05,0,7e-06,-2.1e-05,-1.7e-05,0,1.3e-05,0,0.000133,0.000128,0.000818,0.000708,0.000123,4.3e-05,2.8e-05,-0.000104,8.6e-05,0.000149,3e-06,2e-06,0.000417,-0.000163,8.9e-05,0.000146,-0.000117,-3.3e-05,6.2e-05,-3e-05,-0.000132,0.000267,4e-06,-0.000182,8e-05,-3e-06,-0.000118,0.000627,2e-06,0.000194,-3.8e-05,7.7e-05,1.1e-05,-8.9e-05,7.2e-05,-0.000181,-0.000109,6.7e-05,3.8e-05,9e-06,-4.6e-05,-4.5e-05,2.7e-05,-1.9e-05,7.4e-05,-5e-06,-1.9e-05,5.4e-05,9e-06,8e-06,-1.5e-05,-8e-06,-3e-06,-7e-06,7e-06,4e-06,-2e-06,9.6e-05,-7.5e-05,-1.7e-05,1.3e-05,-1.1e-05,7e-06,2.5e-05,-3e-06,-2.4e-05,-1e-05,-1.2e-05,1e-05,0,1e-06,4e-06,6e-06,1.1e-05,-4e-06,3e-06,3e-06,1e-06,5e-06,-9e-06,-1.2e-05,2.1e-05,-5e-06,1.4e-05,-3.6e-05,1e-06,4e-06,3e-06,-6.6e-05,1.7e-05,-1.8e-05,1.4e-05,0,-1.7e-05,-1.6e-05,-6e-06,-8.3e-05,0,1e-06,-1e-06,-3e-05,-5e-06
1.4e-05,-8e-06,-4e-06,-8e-06,-1e-06,-1e-06,-5e-06,5e-06,3e-06,-4e-06,-3.1e-05,-4.3e-05,-3.8e-05,2.8e-05,0,-1.5e-05,1e-05,-1.4e-05,8e-06,-1.4e-05,-0.00011,-0.000119,0.000469,-0.000285,0.00016,0.000162,0.000129,-8.7e-05,0.000201,-5.3e-05,-0.000241,6e-06,-0.000452,0.000164,4.3e-05,0.000158,-6.7e-05,9.1e-05,6.9e-05,-0.000199,-1.1e-05,-5.2e-05,-8.3e-05,-1e-05,-4.3e-05,-2.2e-05,-0.000256,6.3e-05,0.000106,-8.6e-05,3e-05,-3.4e-05,-3.3e-05,-5.3e-05,0.000122,6.5e-05,1.8e-05,-6.8e-05,-1.6e-05,4.3e-05,2.9e-05,-5.4e-05,-5.9e-05,-2.8e-05,-2e-06,-2.9e-05,3.1e-05,-2.5e-05,-1.7e-05,1.4e-05,-1.1e-05,1e-06,-1e-06,2.1e-05,6e-06,3e-06,-2.7e-05,-2.2e-05,-4e-06,6e-06,-1.5e-05,-1.5e-05,-3.3e-05,-8e-06,8e-06,7e-06,-8e-06,-1e-06,-6e-06,4e-06,2e-06,-1.4e-05,-1e-06,1e-06,6e-06,-4e-06,8e-06,-5e-06,5e-06,1.1e-05,-5e-06,3e-06,-9e-06,-2e-06,-5e-06,0,-1.9e-05,3.1e-05,-1.2e-05,8e-06,-6e-06,0,-2e-06,3.1e-05,-1.1e-05,5.3e-05,-2.4e-05,-2.8e-05,-1.2e-05,5e-06,3e-06
4e-06,-4e-06,-2e-06,2e-06,0,0,2e-06,1e-06,1e-06,1.6e-05,-1.4e-05,2.7e-05,7.5e-05,3.7e-05,1.5e-05,-5e-06,6e-06,2.2e-05,-1e-05,-8e-06,-8.3e-05,0.000366,0.00022,0.000157,6.2e-05,-7.8e-05,-0.000142,-5e-06,-6e-06,-8.2e-05,-0.000388,-0.000361,-0.000212,-0.000188,2.8e-05,-0.00022,-0.000222,8e-05,-0.000206,-0.000241,-0.000328,0.000161,0.000109,3e-05,-1.7e-05,0.000152,0.000181,2.6e-05,5.3e-05,0.000244,-2.2e-05,-1e-05,1.9e-05,0.000127,-5.9e-05,5e-05,-3.6e-05,7.9e-05,5.3e-05,-7.7e-05,-6.4e-05,4.4e-05,-3e-05,4.4e-05,2.6e-05,-4e-06,-1.7e-05,1e-05,-2.1e-05,2.7e-05,1.2e-05,1.6e-05,4e-06,-2.4e-05,3e-06,1e-06,-1.4e-05,-6.3e-05,1.8e-05,3e-06,8e-06,-1.1e-05,1.1e-05,8e-06,-1.2e-05,-5e-06,1.2e-05,-3e-06,6e-06,1e-06,1e-06,4e-06,1e-06,-2e-06,-3e-06,1e-06,4e-06,-2e-06,0,-7e-06,-3e-06,-2e-06,0,-2.9e-05,-5e-06,-4e-06,1e-06,-2.3e-05,5e-06,4e-06,6e-06,1e-06,1.1e-05,1e-05,2e-05,-4.5e-05,1.5e-05,-5e-06,8e-06,2.1e-05,3e-06
-1e-05,-2e-06,-1e-06,-1e-06,0,2e-06,1e-06,-9e-06,-3e-06,5e-06,-5.1e-05,3.2e-05,1.6e-05,-1.2e-05,-9e-06,1.8e-05,-2.5e-05,-3.5e-05,1e-05,5.2e-05,-3.2e-05,-0.000583,-0.000317,0.000137,0.000125,-3.9e-05,-2.7e-05,5.6e-05,-3.8e-05,5.4e-05,0.000418,5.9e-05,-0.000105,-0.000135,8.5e-05,0.000147,2.3e-05,-0.000174,0.00016,0.000275,-0.000226,1e-06,-0.000185,-5.4e-05,5.9e-05,0.000116,-0.000172,3e-05,-9.2e-05,6e-06,-0.000102,0.000114,-2.4e-05,4.1e-05,8.8e-05,-0.000129,-7e-05,-6.3e-05,-8.2e-05,3.7e-05,-5.7e-05,1.3e-05,-2.5e-05,-6e-06,3.7e-05,1.2e-05,-1.5e-05,-2e-06,-5e-06,1e-06,3e-06,-6e-06,-5e-06,1.4e-05,3e-06,5e-06,-3.3e-05,1.9e-05,-3e-06,0,1e-05,8e-06,-4e-06,1e-06,1e-05,-4e-06,-1e-06,-2e-06,-2e-06,2e-06,1.1e-05,-1.4e-05,0,-6e-06,-3e-06,6e-06,-9e-06,5e-06,3e-06,4e-06,-2e-06,-1e-06,-3e-06,-2.6e-05,6e-06,-2e-06,1.5e-05,1.9e-05,-2.2e-05,-4e-06,-2e-06,-2e-06,1.5e-05,-4.3e-05,1.8e-05,3.9e-05,0,4e-06,-1.2e-05,-1.1e-05,-1e-06
1e-05,-2e-06,2e-06,-1e-06,0,-4e-06,0,8e-06,0,-3e-06,6.7e-05,-2.5e-05,-4.1e-05,6e-06,-1.4e-05,2e-06,-1.1e-05,3.5e-05,-5e-06,-4.8e-05,4.1e-05,0.000173,0.000203,-0.000104,-3.2e-05,4.3e-05,-0.000237,-2.8e-05,-0.000396,-3.2e-05,-0.000113,0.00018,-7.5e-05,-0.000118,2.8e-05,-2.4e-05,7e-06,-1.7e-05,-0.000312,6.7e-05,0.000114,-0.000153,8.2e-05,4e-05,1.9e-05,-1.4e-05,0.000422,-5.7e-05,-5.5e-05,-0.000101,2.5e-05,-1.3e-05,0.000137,-6.4e-05,-5e-05,2.9e-05,-1.6e-05,-1.2e-05,7.6e-05,-1e-05,5.9e-05,6.7e-05,-2.5e-05,2.4e-05,-4e-06,5e-06,2e-05,3e-06,6e-06,-3.5e-05,-1.2e-05,1e-05,0,-1.7e-05,-4e-06,-1e-05,-2.9e-05,-5e-06,-1.3e-05,4e-06,2e-06,-1e-06,1.1e-05,-3e-06,-7e-06,0,9e-06,1e-06,0,-7e-06,-3e-06,1e-06,2e-06,-2e-06,0,-8e-06,0,-2e-06,-6e-06,-1e-06,5e-06,1e-06,-1e-05,2e-05,-1.2e-05,-1e-06,-1e-06,1.7e-05,2.5e-05,-1.4e-05,-3e-06,1e-06,-2.4e-05,-3e-06,-2e-06,-2.5e-05,-4e-06,9e-06,3e-06,-6e-06,-5e-06
2e-06,7e-06,0,4e-06,-1e-06,1e-06,1e-06,-3e-06,3e-06,3e-06,-4.5e-05,-1.7e-05,-9e-06,3e-05,-1.8e-05,6e-06,1e-06,-3.5e-05,-1e-06,-4.1e-05,6.2e-05,-0.000548,-1.3e-05,-1.8e-05,3.6e-05,1e-06,-7.6e-05,-3.6e-05,3.9e-05,1.8e-05,0.000179,0.000116,-6.1e-05,8.9e-05,-4e-05,-0.000154,9.3e-05,-1.2e-05,0.000169,-0.000117,0.000124,7.6e-05,-7.1e-05,-0.000106,-5.2e-05,0.00017,-0.000533,-6.7e-05,-6.2e-05,-3e-06,6.9e-05,1.5e-05,-8.9e-05,-1.1e-05,-1.8e-05,-1.3e-05,2.3e-05,4e-05,-1.7e-05,2.7e-05,-2.8e-05,-1.5e-05,-2.4e-05,2.5e-05,6e-06,6e-06,-1.7e-05,-6e-06,2.9e-05,3e-06,0,-1.2e-05,2e-06,0,-3e-06,6e-06,6.9e-05,1.6e-05,7e-06,-2e-06,-1.4e-05,-5e-06,1e-06,2e-06,5e-06,-2e-06,-4e-06,-1e-06,-2e-06,0,-7e-06,-4e-06,-5e-06,2e-06,-5e-06,-4e-06,-2e-06,2e-06,4e-06,-1e-06,-4e-06,0,4e-06,-4e-06,3e-06,0,-1.3e-05,-1.4e-05,-7e-06,-1e-06,1e-05,1e-06,1.8e-05,1.7e-05,-9e-06,1.5e-05,8e-06,-8e-06,4e-06,3e-06,-5e-06
-1e-05,0,1e-06,0,0,2e-06,1e-06,2e-06,0,1.8e-05,5.3e-05,5e-06,-1.8e-05,2.8e-05,3.1e-05,1.2e-05,9e-06,3e-05,1e-06,4.7e-05,1.8e-05,7.3e-05,0.000439,-7e-06,5e-06,-4.7e-05,4.5e-05,-4.3e-05,-1e-06,4.6e-05,9.9e-05,-0.000387,1.8e-05,1.5e-05,-9.9e-05,0.000178,1.9e-05,-2e-06,-0.000213,0.000135,-7e-05,-9.7e-05,7.7e-05,9.4e-05,-8.4e-05,9.4e-05,0.000538,4.3e-05,0.000144,5e-06,1.1e-05,-8.2e-05,3e-06,-8.9e-05,-5.8e-05,5e-05,1.3e-05,-2.6e-05,-1.4e-05,-3.6e-05,-3.2e-05,1.1e-05,-2e-06,2e-06,9e-06,-2e-05,-2e-06,2e-06,2e-06,4e-06,0,4e-06,-2e-06,6e-06,1e-06,1e-06,-2.2e-05,2.7e-05,0,-7e-06,1e-06,2e-06,-1.1e-05,1e-06,1e-06,-3e-06,2e-06,-1e-06,4e-06,5e-06,-4e-06,2e-06,-1e-06,-1e-06,3e-06,3e-06,2e-06,0,-5e-06,-2e-06,-3e-06,0,2e-06,1.3e-05,-2e-06,0,2e-06,4.1e-05,1.5e-05,1e-06,-1.1e-05,0,-9e-06,-8e-06,-3e-06,-9e-06,-1.5e-05,9e-06,-1e-05,7e-06,0
8e-06,-1e-06,0,-1e-06,-1e-06,3e-06,-1e-06,1e-06,-2e-06,-2.3e-05,-8.4e-05,4e-06,1e-06,-1.5e-05,0,-8e-06,-8e-06,-2.8e-05,-2e-06,3e-06,-3e-05,0.000395,0.000166,6.5e-05,1.9e-05,5.7e-05,3.3e-05,0.000104,0.000185,1e-05,-0.000294,0.000205,6.7e-05,1.8e-05,-3.5e-05,-0.000169,0.000117,6e-05,3.7e-05,8.4e-05,-0.000123,-1e-06,-3e-06,-3e-06,-4.8e-05,-7.4e-05,-0.000416,2.3e-05,-1.4e-05,-1.8e-05,5e-06,7.4e-05,2.9e-05,2.6e-05,6e-06,-3e-06,3.2e-05,2.9e-05,1e-05,2.4e-05,1.3e-05,-5.5e-05,-8e-06,1.4e-05,-3e-06,-2.3e-05,2.6e-05,0,-8e-06,-5e-06,4e-06,2e-06,-4e-06,1.3e-05,2e-06,-4e-06,-6e-06,6e-06,-4e-06,-8e-06,9e-06,-2e-06,8e-06,0,0,2e-06,1e-06,2e-06,-3e-06,0,1e-06,4e-06,0,4e-06,-2e-06,4e-06,-2e-06,4e-06,3e-06,1e-06,9e-06,-1e-06,-7e-06,1.3e-05,7e-06,1e-06,1e-05,-5.7e-05,-1.9e-05,5e-06,8e-06,0,1e-05,1.5e-05,-1.5e-05,1.7e-05,1.3e-05,-8e-06,6e-06,-4e-06,1e-06
-2e-06,1e-06,-2e-06,0,2e-06,-1e-06,3e-06,-4e-06,0,1e-05,7.8e-05,-5e-05,-4.4e-05,7e-06,-1e-05,-4e-06,-7e-06,1.8e-05,3e-06,-1.3e-05,-6e-05,-0.000271,-0.000198,-9.8e-05,-1e-06,1.6e-05,-1.4e-05,-7.1e-05,-0.000154,-6.4e-05,1.6e-05,8e-05,-5e-06,-0.000126,3e-06,1.1e-05,-1.3e-05,-3.5e-05,-1.2e-05,-2.7e-05,3.9e-05,-5.6e-05,-1.7e-05,5.4e-05,1.7e-05,-0.000135,0.000268,4.1e-05,-3.6e-05,-1e-05,-6.9e-05,-1e-05,-3.3e-05,1e-05,4e-05,-1.4e-05,-2e-05,-2.1e-05,1.7e-05,-1e-05,-4.3e-05,3e-06,-1.6e-05,-1.2e-05,-1e-06,-2e-06,-1.6e-05,-2e-06,-6e-06,7e-06,1e-06,-7e-06,5e-06,-5e-06,0,2e-06,-1.8e-05,-1e-05,2e-06,-9e-06,0,-1.1e-05,-4e-06,-2e-06,0,-2e-06,-1e-05,-3e-06,1e-06,-2e-06,0,1e-06,-2e-06,1e-06,0,-2e-06,3e-06,-6e-06,-1e-06,1e-06,-5e-06,1e-06,2e-06,2e-06,-2e-06,0,-3e-06,1.7e-05,7e-06,-4e-06,-3e-06,0,-1.7e-05,1e-06,3e-06,-3.1e-05,-5e-06,-7e-06,-3e-06,-3e-06,-1e-06
-6e-06,0,-1e-06,-2e-06,-2e-06,-1e-06,-1e-06,3e-06,2e-06,-2e-06,-2.1e-05,1.7e-05,1.3e-05,-1.5e-05,0,-8e-06,6e-06,-1.7e-05,-4e-06,2e-05,2.9e-05,0.000551,0.000101,0.000164,3.8e-05,-4.4e-05,-4.1e-05,-2.3e-05,5.5e-05,6.1e-05,4e-06,-0.00013,-7.4e-05,-4.7e-05,-2.5e-05,1e-06,6e-06,2.1e-05,-0.000101,8.7e-05,-2.1e-05,7.3e-05,0.000115,-5e-05,2.9e-05,-0.000106,-0.000134,-5.3e-05,-3.6e-05,2.6e-05,-5.1e-05,-2.5e-05,4.7e-05,2.2e-05,-3e-06,1.5e-05,-2.3e-05,-2e-05,-3.3e-05,2.6e-05,-3e-06,-3.2e-05,-1.7e-05,7e-06,-1.5e-05,-7e-06,-7e-06,8e-06,-8e-06,9e-06,1e-06,1.1e-05,-2e-06,-9e-06,-2e-06,1e-06,1.8e-05,-2.5e-05,-3e-06,-1e-05,-6e-06,2e-06,7e-06,-1e-06,-2e-06,0,-2e-06,-1e-06,0,-1e-06,7e-06,6e-06,0,-1e-06,0,-7e-06,4e-06,4e-06,2e-06,-3e-06,0,0,-3e-06,1e-05,-3e-06,3e-06,-8e-06,9e-06,-5e-06,-5e-06,2e-06,0,1.4e-05,-2.8e-05,1.6e-05,2.6e-05,2e-06,7e-06,-4e-06,2e-06,0
6e-06,1e-06,0,0,1e-06,1e-06,-1e-06,-2e-06,0,-3e-06,-3e-06,1.6e-05,2.4e-05,1.5e-05,7e-06,-9e-06,-3e-06,1.7e-05,4e-06,-1.3e-05,2.4e-05,-0.000401,-0.000126,-5.8e-05,-2.4e-05,1e-05,-3e-06,2.4e-05,4.6e-05,-1.6e-05,-0.000131,8.5e-05,-8.5e-05,2e-05,-1.7e-05,-4.1e-05,-3.5e-05,-3e-06,9e-05,-0.000108,-6e-05,-7.2e-05,-5.8e-05,1.8e-05,-1.3e-05,-5.7e-05,-0.000155,-3e-06,-3.3e-05,-5e-05,1.5e-05,-2.3e-05,-1.6e-05,3e-06,-2.4e-05,4.3e-05,-2.7e-05,4e-05,3.1e-05,-2.6e-05,1e-05,3e-05,-9e-06,-5e-06,-1.1e-05,0,-2e-06,-3e-06,-3e-06,-5e-06,-5e-06,-4e-06,-2e-06,3e-06,0,0,1.2e-05,1.1e-05,3e-06,-4e-06,-3e-06,3e-06,-1e-05,0,3e-06,2e-06,-3e-06,0,2e-06,1e-06,-1e-06,-2e-06,-1e-06,-1e-06,-1e-06,5e-06,1e-06,-3e-06,-3e-06,4e-06,2e-06,-1e-06,1e-06,-1e-06,2e-06,2e-06,3e-06,-7e-06,1.3e-05,2e-06,-3e-06,0,-8e-06,6e-06,7e-06,-5e-06,1e-06,0,3e-06,3e-06,1e-06
-1e-06,-3e-06,0,-1e-06,1e-06,1e-06,0,2e-06,-1e-06,-6e-06,1.9e-05,-1.5e-05,-5e-06,8e-06,-4e-06,6e-06,-9e-06,-1.2e-05,-2e-06,-1.8e-05,-1.8e-05,0.000232,0.00016,-3.4e-05,1e-06,1.6e-05,-2.3e-05,5.7e-05,9.1e-05,6.5e-05,0.000214,-3.6e-05,-9.6e-05,4.7e-05,5.6e-05,4.7e-05,0,2.9e-05,-7.5e-05,-0.000143,8e-06,1.3e-05,2e-05,-8e-06,-3e-05,1.5e-05,0.000243,-7e-06,-9e-06,7.1e-05,2.5e-05,-1.3e-05,-2.2e-05,2.5e-05,1.4e-05,-4.5e-05,3.9e-05,-1.6e-05,-1.9e-05,2.3e-05,-2.1e-05,-3e-06,-1.7e-05,1.4e-05,3e-06,8e-06,-2e-06,0,-5e-06,-1e-05,-3e-06,3e-06,2e-06,-1e-06,1e-06,-1e-06,-2.4e-05,5e-06,-4e-06,-3e-06,6e-06,-2e-06,5e-06,0,-8e-06,-2e-06,3e-06,-1e-06,-3e-06,1e-06,-5e-06,2e-06,2e-06,-2e-06,2e-06,4e-06,-5e-06,-1e-06,0,-4e-06,-1e-06,1e-06,3e-06,-2e-06,-1e-06,0,6e-06,-1.4e-05,-1.1e-05,6e-06,1e-06,0,6e-06,1.3e-05,-6e-06,-1.3e-05,-3e-06,3e-06,-5e-06,-2e-06,1e-06
-3e-06,-3e-06,1e-06,0,-1e-06,-3e-06,0,0,-1e-06,3e-06,-7e-06,1e-06,-2.5e-05,-7e-06,0,2e-06,-8e-06,1.1e-05,0,1.7e-05,1.1e-05,-0.000456,0.000213,9.4e-05,-2.1e-05,-1.8e-05,-5.7e-05,-7.7e-05,-9.5e-05,-1.8e-05,-5.9e-05,6.4e-05,-1e-04,-1.8e-05,1.9e-05,-6.6e-05,-5.1e-05,-1e-05,0.000113,8.8e-05,5.8e-05,0,5e-06,2.3e-05,-5e-06,0.000117,-0.000317,1.1e-05,3e-05,6e-06,2.4e-05,6.2e-05,-1e-06,2e-06,2e-06,-4.6e-05,1.9e-05,-2e-06,1.1e-05,-2.1e-05,-2e-06,2.9e-05,-2.1e-05,-8e-06,-9e-06,-6e-06,-1e-05,-1e-06,1.4e-05,3e-06,4e-06,-5e-06,0,6e-06,1e-06,1e-06,0,1e-05,3e-06,1e-06,0,-3e-06,0,0,6e-06,1e-06,4e-06,1e-06,2e-06,-1e-06,0,-2e-06,0,-1e-06,1e-06,-6e-06,0,2e-06,-1e-06,6e-06,-1e-06,0,-4e-06,-1.2e-05,-2e-06,0,-3e-06,1e-06,5e-06,2e-06,1e-06,0,-6e-06,-6e-06,-6e-06,2.1e-05,1e-06,4e-06,1e-06,-3e-06,1e-06
7e-06,0,1e-06,1e-06,0,-1e-06,-1e-06,-2e-06,1e-06,6e-06,4e-06,1.4e-05,-3e-05,8e-06,8e-06,1e-06,4e-06,-9e-06,1e-06,7e-06,-1e-05,9.3e-05,-9e-06,-6.8e-05,-3.1e-05,1e-06,1.3e-05,-5e-06,-4.1e-05,-2.3e-05,3e-06,-0.000114,-0.000102,1.2e-05,1.4e-05,7.4e-05,-6.1e-05,-1e-06,-6.4e-05,6e-06,0,2.8e-05,-1.2e-05,-3.7e-05,2.7e-05,8.6e-05,0.00033,2.6e-05,2e-05,-3e-05,-8e-06,-4.6e-05,-1.6e-05,9e-06,-1.7e-05,5e-05,1.1e-05,-2e-06,-4e-06,1e-06,-1.3e-05,-1.1e-05,-1.4e-05,1e-06,-3e-06,0,1.7e-05,1e-06,0,2e-06,4e-06,-1e-06,-1e-06,-3e-06,-1e-06,2e-06,-1.2e-05,-1.1e-05,0,1e-06,-2e-06,-5e-06,0,0,-5e-06,2e-06,-3e-06,0,0,-1e-06,1e-06,-2e-06,0,-2e-06,1e-06,0,1e-06,-2e-06,1e-06,-5e-06,0,0,-2e-06,-1.6e-05,0,0,-4e-06,1.9e-05,-5e-06,-4e-06,-3e-06,0,1e-06,7e-06,-8e-06,-3e-05,4e-06,1e-06,0,3e-06,0
-3e-06,0,-1e-06,-1e-06,1e-06,1e-06,0,2e-06,0,-1e-05,1.2e-05,-9e-06,1.6e-05,-1.2e-05,-9e-06,6e-06,-3e-06,3e-06,-1e-06,-1.3e-05,-2.3e-05,-5.2e-05,-0.000199,-4.7e-05,-1.2e-05,2.3e-05,-2.8e-05,7e-05,-3e-06,-3e-06,6e-05,-3.2e-05,-7e-05,-3.5e-05,-8e-06,-6.9e-05,-3e-06,-9e-06,6.1e-05,-4.1e-05,-7.9e-05,-8e-06,8e-06,1.7e-05,4.2e-05,1e-05,-0.000312,-2.2e-05,1.2e-05,-2.8e-05,-3.7e-05,3.6e-05,1.1e-05,-1.6e-05,2.8e-05,-3e-06,-2.1e-05,-1.1e-05,5e-06,1.8e-05,-2.3e-05,2.1e-05,-1e-05,1e-06,0,-6e-06,0,0,5e-06,0,0,4e-06,0,6e-06,-1e-06,-3e-06,2.8e-05,0,-1e-06,3e-06,-1e-06,-2e-06,3e-06,0,8e-06,-1e-06,4e-06,1e-06,-1e-06,0,-1e-06,0,0,3e-06,1e-06,2e-06,-1e-06,2e-06,0,3e-06,4e-06,0,1e-06,1e-06,3e-06,-1e-06,2e-06,-4e-06,9e-06,-4e-06,2e-06,0,1e-06,1e-06,-1e-06,3.3e-05,-7e-06,-2e-06,-2e-06,0,0
-1e-06,0,0,0,0,1e-06,-1e-06,-1e-06,-1e-06,1e-05,-2.7e-05,-1.1e-05,9e-06,1.4e-05,-2e-06,-1e-06,-1e-06,0,2e-06,1e-05,2e-05,0.000191,3.1e-05,4.5e-05,-2.7e-05,-1.2e-05,4.7e-05,-2.5e-05,3.9e-05,1.9e-05,-0.000175,0.000159,-2.7e-05,2.1e-05,-4e-06,2e-06,1.1e-05,-4.8e-05,-3.9e-05,4.4e-05,-2.4e-05,-1e-06,-4.5e-05,-5e-06,2.8e-05,-1.3e-05,0.000296,3e-06,1.5e-05,8e-06,-1.2e-05,-3.8e-05,2.7e-05,-4.7e-05,-5.2e-05,-1e-05,-1.5e-05,3.2e-05,-9e-06,-9e-06,1e-05,-1.6e-05,-1.5e-05,-1.1e-05,3e-06,-2e-06,3e-06,-1e-06,-1.4e-05,-1e-06,-7e-06,-5e-06,0,-9e-06,0,0,-3e-06,-5e-06,2e-06,2e-06,3e-06,4e-06,-6e-06,0,-8e-06,3e-06,-1e-06,-1e-06,-1e-06,0,2e-06,-2e-06,1e-06,2e-06,-1e-06,1e-06,1e-06,-1e-06,1e-06,-2e-06,-5e-06,0,-4e-06,-2e-06,-1e-06,-1e-06,3e-06,9e-06,-3e-06,0,-1e-06,0,0,-1.1e-05,9e-06,-1.8e-05,6e-06,0,2e-06,-1e-06,-1e-06
3e-06,0,-1e-06,0,-1e-06,-1e-06,1e-06,1e-06,0,-3e-06,2e-06,7e-06,1.1e-05,-6e-06,8e-06,-2e-06,-7e-06,-1e-06,-2e-06,-2e-06,1.7e-05,3.8e-05,-0.000241,-4.5e-05,-1.1e-05,-9e-06,-1.4e-05,-7.2e-05,5.2e-05,-2e-05,7.6e-05,-6e-05,-5e-06,4.6e-05,-5e-06,5.3e-05,2.4e-05,2.2e-05,8.8e-05,-1.2e-05,5.1e-05,2.7e-05,1.2e-05,2.5e-05,2e-06,-1e-06,-0.000218,-1.1e-05,-2e-05,3.8e-05,2.2e-05,5.9e-05,-3.4e-05,3e-06,2.7e-05,-1.6e-05,-4e-06,-9e-06,9e-06,-2.3e-05,-3e-06,9e-06,-1.2e-05,6e-06,6e-06,5e-06,-1e-06,1e-06,1e-06,2e-06,-3e-06,7e-06,-1e-06,1e-06,0,1e-06,-1.9e-05,-7e-06,1e-06,4e-06,0,1e-06,6e-06,0,1e-05,-1e-06,-1e-06,0,1e-06,1e-06,1e-06,1e-06,-1e-06,0,0,1e-06,1e-06,2e-06,-1e-06,2e-06,2e-06,0,2e-06,9e-06,0,-1e-06,-2e-06,-1.1e-05,-1e-06,4e-06,1e-06,0,-1e-06,4e-06,3e-06,-2e-06,-1e-06,5e-06,-2e-06,-1e-06,-1e-06
-3e-06,1e-06,0,0,1e-06,0,-1e-06,0,1e-06,2e-06,-6e-06,1e-06,-1e-06,-7e-06,0,0,8e-06,2e-06,2e-06,-9e-06,-1.4e-05,7.3e-05,0.000258,-2e-05,-2.7e-05,1.1e-05,-1.6e-05,3.3e-05,4e-06,-3e-06,3.1e-05,-1.4e-05,1.2e-05,5.4e-05,-2.7e-05,-0.000105,2.7e-05,-1.4e-05,-3.1e-05,-3e-06,3.9e-05,-3e-05,-1.4e-05,-2.1e-05,-8e-06,-2.5e-05,0.000141,6e-06,1e-06,-4.9e-05,3.9e-05,-2.2e-05,6e-06,0,-3.3e-05,4.2e-05,2.5e-05,-1.6e-05,-1.3e-05,2.9e-05,-1.8e-05,-2.7e-05,-8e-06,-1.4e-05,3e-06,6e-06,-4e-06,-2e-06,-6e-06,-4e-06,3e-06,-4e-06,0,1e-06,1e-06,-1e-06,-2e-06,-4e-06,-3e-06,2e-06,-3e-06,-7e-06,-4e-06,0,-9e-06,0,2e-06,0,0,0,-3e-06,0,0,0,-1e-06,-4e-06,2e-06,-2e-06,0,-2e-06,1e-06,0,-3e-06,6e-06,0,-2e-06,-2e-06,7e-06,-4e-06,-1e-06,-1e-06,0,-3e-06,6e-06,1e-06,1.2e-05,-3e-06,-5e-06,0,1e-06,-1e-06
-1e-06,2e-06,0,0,0,1e-06,0,-1e-06,0,-4e-06,-1.3e-05,-5e-06,0,-8e-06,-9e-06,-2e-06,-6e-06,-5e-06,-1e-06,4e-06,5e-06,-1.5e-05,-2.6e-05,3.2e-05,-1.9e-05,-4e-06,-1.3e-05,6.9e-05,-6e-06,1.2e-05,-8.3e-05,-4.7e-05,-3e-06,-8e-06,-2.5e-05,7.4e-05,4e-05,3.5e-05,1.1e-05,7.2e-05,1.6e-05,1e-06,-1e-06,1e-05,-1e-06,-3.1e-05,-5.2e-05,1.2e-05,-1.5e-05,3e-06,2.8e-05,3e-06,2.2e-05,2.9e-05,5.8e-05,-1e-06,1.8e-05,1.1e-05,7e-06,-1.4e-05,-4e-06,3e-06,-9e-06,8e-06,1e-06,4e-06,-4e-06,1e-06,8e-06,-2e-06,7e-06,1e-06,0,4e-06,0,-1e-06,4e-06,8e-06,3e-06,2e-06,0,-2e-06,3e-06,-1e-06,8e-06,0,-2e-06,-1e-06,-1e-06,-1e-06,0,2e-06,0,-1e-06,-1e-06,0,-1e-06,2e-06,-1e-06,1e-06,-3e-06,0,-3e-06,-1e-06,0,-1e-06,1e-06,-1.4e-05,6e-06,-5e-06,1e-06,0,6e-06,2e-06,-1e-06,-6e-06,4e-06,8e-06,0,1e-06,-1e-06
3e-06,1e-06,1e-06,-1e-06,0,1e-06,0,1e-06,-1e-06,2e-06,2.7e-05,9e-06,-2e-06,-4e-06,0,3e-06,-9e-06,4e-06,0,9e-06,0,-0.000218,-0.000102,3e-05,-2.5e-05,-5e-06,-3.5e-05,-6.2e-05,-8.2e-05,-2.1e-05,0.000115,5.6e-05,-2.2e-05,-5e-05,8e-06,-3.8e-05,2.1e-05,1.7e-05,2e-05,-7e-06,-1.5e-05,1e-06,1.3e-05,-1.9e-05,8e-06,-4.5e-05,-4e-06,-9e-06,3.1e-05,3e-05,-9e-06,4e-06,-3.2e-05,2.5e-05,-4e-06,-3.2e-05,-1.1e-05,-1.5e-05,3e-06,4e-06,-1.1e-05,-1.4e-05,-1.1e-05,-6e-06,5e-06,-2e-06,5e-06,0,0,3e-06,-1e-06,-1e-06,0,-1e-06,0,0,1.3e-05,1.8e-05,-4e-06,-1e-06,3e-06,1e-06,-3e-06,1e-06,-1e-05,0,5e-06,1e-06,0,1e-06,0,0,-1e-06,-2e-06,0,4e-06,-2e-06,0,0,-2e-06,1e-06,0,1e-06,1.4e-05,0,0,2e-06,6e-06,-1e-06,-3e-06,0,0,-6e-06,1e-06,-2e-06,1e-06,-6e-06,-6e-06,-2e-06,-2e-06,0
-4e-06,0,1e-06,-1e-06,0,0,0,-1e-06,0,2e-06,-2.5e-05,6e-06,-2e-05,-1e-06,1e-05,1e-06,-4e-06,-5e-06,0,-1.1e-05,-1.7e-05,6.7e-05,-0.000138,-3.3e-05,-1.6e-05,9e-06,-2.2e-05,-4.2e-05,3.6e-05,2.8e-05,-8.9e-05,2e-06,-4.1e-05,-1e-04,6e-06,-2.2e-05,5e-06,-1e-06,-2.6e-05,-5.4e-05,-9e-06,1.9e-05,-8e-06,1.1e-05,6e-06,-4.6e-05,8.5e-05,2e-06,3e-06,-1e-05,-2.6e-05,-1.6e-05,2.7e-05,-1e-06,-2.2e-05,4e-06,-1.9e-05,1.7e-05,-6e-06,-3e-06,-4e-06,1.5e-05,-1.1e-05,-3e-06,0,0,4e-06,1e-06,1.1e-05,5e-06,-5e-06,-1e-06,-1e-06,-4e-06,0,1e-06,-9e-06,3e-06,1e-06,-2e-06,0,-1e-06,-1e-06,1e-06,1e-05,0,0,0,1e-06,0,0,1e-06,0,-2e-06,0,-1e-06,-1e-06,-1e-06,0,1e-06,0,0,-1e-06,1e-06,-1e-06,0,-1e-06,3e-06,1e-06,3e-06,-2e-06,0,5e-06,-6e-06,-5e-06,-3e-06,5e-06,4e-06,1e-06,0,0
2e-06,-1e-06,0,0,0,-1e-06,0,0,1e-06,-6e-06,2.1e-05,1e-06,-1.1e-05,-1e-05,-4e-06,0,0,8e-06,-1e-06,8e-06,1.8e-05,-0.000196,-6.5e-05,1e-05,-2e-05,-1e-06,-2e-06,7.6e-05,1.9e-05,-2.6e-05,8e-06,-3.2e-05,-4.5e-05,-1.5e-05,-1.3e-05,3.6e-05,-1.8e-05,6e-06,7e-05,2e-06,0,-1.8e-05,-2e-06,-1.3e-05,-7e-06,-7e-06,-0.000141,-3e-06,1.7e-05,-5e-06,-1.9e-05,4e-05,1e-06,-9e-06,3.6e-05,1.4e-05,-1.3e-05,2e-06,2e-06,2e-06,-4e-06,-9e-06,-1e-05,4e-06,-3e-06,1e-06,3e-06,0,-4e-06,-2e-06,-4e-06,2e-06,1e-06,2e-06,0,-2e-06,-1.2e-05,-3e-06,0,-3e-06,-3e-06,1e-06,5e-06,-1e-06,-1.1e-05,-1e-06,-2e-06,0,-1e-06,0,1e-06,0,0,0,0,-3e-06,1e-06,2e-06,0,0,1e-06,0,0,-3e-06,1e-06,1e-06,-1e-06,-1.9e-05,-5e-06,3e-06,2e-06,0,-4e-06,-2e-06,0,1e-06,0,-7e-06,-1e-06,1e-06,1e-06
2e-06,-1e-06,0,-1e-06,0,0,1e-06,1e-06,0,5e-06,-1.4e-05,-3e-06,-1e-06,1e-06,0,-2e-06,2e-06,-9e-06,1e-06,0,7e-06,0.000303,-0.000193,4.5e-05,-1.5e-05,-5e-06,-2e-05,2.7e-05,3.2e-05,2.5e-05,6.4e-05,3.7e-05,-7.8e-05,4.3e-05,1.1e-05,-5e-05,-2.4e-05,-2.7e-05,-8e-05,1e-05,1.2e-05,1.5e-05,1.8e-05,1.6e-05,-2.1e-05,5e-05,0.000138,-2e-06,-3.2e-05,-1.9e-05,1e-06,-4.7e-05,-2.7e-05,-5e-06,-4.9e-05,1.1e-05,1e-05,-1.5e-05,6e-06,-3e-06,-9e-06,1.7e-05,-1.2e-05,-1.2e-05,0,2e-06,-6e-06,0,0,-2e-06,1e-06,-3e-06,1e-06,-2e-06,0,0,1e-06,-1.1e-05,0,-3e-06,0,-1e-06,-4e-06,0,1.1e-05,1e-06,1e-06,0,-1e-06,0,1e-06,-1e-06,0,2e-06,0,0,0,-1e-06,-1e-06,0,-3e-06,0,2e-06,-2e-06,0,1e-06,0,1.4e-05,3e-06,0,-1e-06,0,7e-06,3e-06,4e-06,1e-06,-1e-06,7e-06,-1e-06,1e-06,1e-06
