0.019679,0.016704,0.016472,0.019233,0.017181,0.013936,0.013355,0.013539,0.013385,0.01274,0.012881,0.01369,0.013466,0.011835,0.011678,0.012458,0.011458,0.010343,0.01048,0.012289,0.011734,0.00981,0.011307,0.012685,0.012092,0.010949,0.010382,0.010188
0.023591,0.020514,0.020538,0.023891,0.021599,0.017595,0.016479,0.016356,0.016594,0.016452,0.016341,0.016759,0.016277,0.014343,0.014417,0.015185,0.013758,0.01258,0.012955,0.014852,0.013853,0.011451,0.01288,0.014579,0.014195,0.012946,0.012377,0.012195
0.030693,0.027707,0.028279,0.032616,0.030414,0.024902,0.021953,0.021069,0.022572,0.02389,0.023219,0.022751,0.021573,0.01889,0.019495,0.020239,0.017969,0.016718,0.017578,0.019489,0.017691,0.014536,0.015331,0.017181,0.017193,0.015856,0.015312,0.015092
0.039103,0.036746,0.037358,0.042218,0.04104,0.033368,0.026609,0.024733,0.028845,0.032785,0.031426,0.029457,0.027026,0.023468,0.024787,0.025595,0.022357,0.020839,0.02265,0.024456,0.021719,0.018296,0.017567,0.018177,0.018157,0.016957,0.016543,0.01624
0.047206,0.045913,0.046049,0.050544,0.050811,0.041069,0.030073,0.027502,0.034559,0.041059,0.038858,0.035401,0.031794,0.027656,0.029169,0.029752,0.026009,0.024246,0.027293,0.029522,0.026329,0.02287,0.021047,0.019732,0.018171,0.016919,0.016773,0.016278
0.049673,0.049734,0.049336,0.052829,0.054509,0.044456,0.031455,0.028629,0.036673,0.044116,0.041834,0.037509,0.033319,0.029724,0.031643,0.031924,0.028193,0.02629,0.029365,0.032791,0.030992,0.02775,0.026494,0.024045,0.019832,0.017734,0.017309,0.016638
0.044719,0.045604,0.045143,0.047745,0.050069,0.041944,0.030571,0.027645,0.03346,0.039988,0.039042,0.034511,0.030115,0.027781,0.030351,0.032227,0.030351,0.027526,0.028361,0.033046,0.034597,0.033448,0.034894,0.031416,0.023814,0.020273,0.018772,0.017362
0.040782,0.040775,0.040545,0.041851,0.042879,0.038119,0.02986,0.026668,0.029828,0.033889,0.035171,0.03272,0.027475,0.024488,0.027495,0.032793,0.03371,0.029799,0.028143,0.033613,0.039235,0.043101,0.047286,0.040747,0.02996,0.025339,0.02274,0.020288
0.051018,0.049574,0.048465,0.049071,0.046938,0.042943,0.035991,0.031863,0.033889,0.035076,0.037801,0.039071,0.031949,0.026505,0.029607,0.036487,0.039516,0.035407,0.031902,0.0365,0.04419,0.05427,0.059414,0.048747,0.037677,0.032973,0.029626,0.026238
0.079376,0.078313,0.078898,0.082529,0.075711,0.066045,0.054602,0.046043,0.047723,0.048722,0.052258,0.055847,0.046644,0.040295,0.042035,0.0457,0.049671,0.046531,0.042377,0.045457,0.05263,0.065067,0.067927,0.056382,0.050374,0.044748,0.038142,0.034883
0.130972,0.132147,0.140908,0.151799,0.136553,0.111737,0.087856,0.072117,0.073985,0.076792,0.081694,0.085436,0.072478,0.068594,0.069316,0.064817,0.067319,0.067382,0.065734,0.07005,0.075114,0.078501,0.074782,0.070204,0.072439,0.062317,0.048929,0.047281
0.212758,0.220047,0.245575,0.26884,0.236115,0.17994,0.133492,0.109338,0.111174,0.117401,0.127698,0.129951,0.110313,0.114043,0.116259,0.09867,0.096873,0.101994,0.103424,0.11301,0.119176,0.104487,0.085912,0.092503,0.106888,0.089043,0.066145,0.066823
0.315099,0.335796,0.388767,0.427854,0.365124,0.258332,0.181717,0.152066,0.154095,0.166114,0.186111,0.185263,0.159398,0.176303,0.179347,0.14497,0.139964,0.148988,0.148782,0.166046,0.178406,0.144525,0.104943,0.119439,0.149173,0.126629,0.094477,0.096208
0.394564,0.436314,0.525832,0.577232,0.477432,0.318385,0.218911,0.192523,0.195032,0.211684,0.241401,0.236172,0.207804,0.238532,0.239454,0.190413,0.183685,0.192756,0.186882,0.211644,0.231908,0.180378,0.118061,0.135311,0.18065,0.161494,0.123716,0.124542
0.406291,0.467443,0.583012,0.626778,0.504299,0.334402,0.241921,0.228465,0.226203,0.237116,0.265977,0.253317,0.230624,0.268316,0.269257,0.216966,0.204279,0.209599,0.200218,0.223483,0.244316,0.188413,0.11709,0.128327,0.176038,0.168481,0.136313,0.136421
0.379542,0.436893,0.536988,0.537578,0.432197,0.319259,0.257746,0.256204,0.246134,0.243846,0.261447,0.242889,0.229043,0.248403,0.250561,0.218033,0.197575,0.191451,0.176722,0.190743,0.209806,0.167665,0.110574,0.111726,0.139728,0.142197,0.123442,0.12129
0.395426,0.424884,0.482908,0.432917,0.356719,0.315579,0.288273,0.294889,0.280229,0.265388,0.281272,0.274604,0.254882,0.220985,0.216267,0.215992,0.192662,0.170202,0.144514,0.159063,0.182056,0.150457,0.121644,0.123288,0.118862,0.120416,0.113091,0.100463
0.445701,0.448315,0.465296,0.39774,0.338989,0.328301,0.315792,0.3247,0.312768,0.297762,0.332931,0.358858,0.324845,0.241302,0.228392,0.251986,0.227566,0.181653,0.145181,0.167563,0.186112,0.155477,0.15652,0.1599,0.130803,0.130494,0.127512,0.10416
0.496892,0.478762,0.485477,0.429425,0.358263,0.340348,0.331248,0.335551,0.332166,0.335144,0.388684,0.443615,0.38631,0.265674,0.277728,0.331396,0.291513,0.212859,0.155884,0.170689,0.191292,0.180601,0.208617,0.200527,0.153614,0.151537,0.145837,0.124093
0.552334,0.532471,0.549242,0.505754,0.422736,0.385844,0.378406,0.372908,0.365929,0.404101,0.478246,0.521873,0.422733,0.293711,0.359433,0.439922,0.361572,0.24039,0.160615,0.16674,0.204365,0.223368,0.262454,0.22994,0.171696,0.167112,0.160238,0.149179
0.591729,0.575157,0.582014,0.549937,0.488561,0.455762,0.450207,0.420371,0.400646,0.469408,0.548438,0.549394,0.429712,0.327191,0.416226,0.500356,0.400663,0.261265,0.171888,0.17474,0.229277,0.264073,0.299179,0.243062,0.182861,0.17972,0.177215,0.176623
0.544882,0.548081,0.542937,0.536598,0.507088,0.478444,0.46656,0.415811,0.402399,0.490202,0.531948,0.47982,0.396046,0.350314,0.401508,0.44381,0.365916,0.269133,0.201633,0.208354,0.256039,0.279709,0.307454,0.238367,0.181833,0.181148,0.183687,0.188607
0.453098,0.483775,0.492699,0.517913,0.495772,0.447912,0.420707,0.368684,0.385872,0.486488,0.451259,0.36288,0.339221,0.338463,0.336306,0.319082,0.297417,0.27141,0.233027,0.253564,0.279743,0.267701,0.274914,0.210685,0.163891,0.16047,0.16939,0.176048
0.402948,0.41784,0.446679,0.501225,0.48233,0.38744,0.336122,0.325261,0.369111,0.439616,0.350881,0.263528,0.279266,0.312594,0.303429,0.282522,0.303798,0.280568,0.245505,0.291174,0.307247,0.258859,0.224848,0.175595,0.152295,0.146904,0.15563,0.163496
0.355919,0.368789,0.474203,0.538336,0.471886,0.330161,0.291014,0.3325,0.370166,0.385852,0.316345,0.27595,0.305608,0.336038,0.326091,0.313323,0.330676,0.282964,0.250014,0.314854,0.325868,0.268725,0.208915,0.182524,0.18768,0.172026,0.163216,0.168871
0.332989,0.385984,0.566783,0.608722,0.495654,0.321162,0.309045,0.37933,0.3943,0.395975,0.383188,0.360093,0.37343,0.393339,0.368133,0.325829,0.330479,0.287334,0.259587,0.326416,0.334964,0.290087,0.229835,0.239352,0.258585,0.220006,0.205825,0.215384
0.409872,0.459802,0.626058,0.651587,0.565527,0.391152,0.391863,0.45705,0.420686,0.440529,0.49912,0.456256,0.434246,0.477116,0.44907,0.329022,0.298346,0.284572,0.271748,0.340061,0.366174,0.329318,0.266391,0.326349,0.35485,0.274427,0.262733,0.275623
0.534904,0.50614,0.604118,0.657954,0.639646,0.480083,0.495668,0.558279,0.445442,0.453035,0.571282,0.507238,0.456483,0.517169,0.521583,0.355795,0.254921,0.252019,0.256957,0.317625,0.391502,0.385277,0.30461,0.400438,0.454975,0.329622,0.303892,0.317659
0.641989,0.513966,0.545724,0.600275,0.608955,0.514346,0.542192,0.604367,0.469431,0.427736,0.544881,0.485008,0.434544,0.479102,0.543143,0.415246,0.2366,0.21606,0.232671,0.287341,0.409417,0.420139,0.31979,0.427066,0.505968,0.360743,0.30481,0.328469
0.693091,0.548129,0.525182,0.505607,0.48732,0.494193,0.508655,0.536841,0.455251,0.395869,0.477901,0.415507,0.353569,0.381281,0.486882,0.440604,0.2506,0.204452,0.221398,0.274998,0.404239,0.415927,0.310775,0.383147,0.454407,0.337425,0.271975,0.313851
0.629274,0.579056,0.552135,0.439764,0.389919,0.461703,0.445929,0.407176,0.370447,0.390215,0.438263,0.324053,0.265521,0.294147,0.38276,0.392934,0.249872,0.183503,0.197535,0.265585,0.376251,0.379047,0.286206,0.284132,0.307769,0.251488,0.225305,0.284105
0.465809,0.522816,0.519099,0.391185,0.369402,0.437246,0.396669,0.313047,0.268943,0.360476,0.38727,0.258656,0.202555,0.239595,0.293388,0.300564,0.218221,0.147388,0.158868,0.228547,0.309134,0.306657,0.24707,0.196965,0.172742,0.168984,0.186747,0.233832
0.311701,0.408691,0.421001,0.358459,0.382395,0.372574,0.321981,0.282387,0.246704,0.32267,0.33936,0.240269,0.185598,0.222793,0.231137,0.226007,0.199866,0.126257,0.119193,0.176432,0.245222,0.248242,0.214151,0.188232,0.173185,0.154912,0.161157,0.182678
0.22055,0.300292,0.298203,0.317248,0.374304,0.286306,0.223998,0.230211,0.229343,0.264473,0.266413,0.208465,0.16713,0.199777,0.194983,0.213958,0.208551,0.119862,0.095142,0.142128,0.184285,0.192257,0.189888,0.202599,0.201136,0.163796,0.163597,0.174794
0.209509,0.226881,0.191818,0.271871,0.329564,0.21926,0.160916,0.166494,0.17507,0.192207,0.176001,0.155251,0.142138,0.155522,0.156923,0.196866,0.204498,0.134513,0.104588,0.14091,0.161335,0.176844,0.184277,0.200285,0.198682,0.151254,0.150933,0.160083
0.194465,0.185448,0.153988,0.236075,0.267152,0.163475,0.132286,0.143984,0.126357,0.147564,0.13139,0.122834,0.124846,0.121254,0.118232,0.14714,0.167291,0.141584,0.124778,0.148412,0.177534,0.202331,0.17649,0.164497,0.164358,0.12005,0.116098,0.122315
0.158452,0.162519,0.145532,0.185389,0.192854,0.109606,0.110653,0.152089,0.11965,0.111657,0.115209,0.132474,0.125166,0.111972,0.112637,0.104553,0.110062,0.124619,0.13732,0.141851,0.174289,0.218568,0.170934,0.123231,0.13009,0.106242,0.084042,0.094349
0.124551,0.140178,0.145489,0.140172,0.132029,0.073404,0.103727,0.165028,0.14105,0.092597,0.087651,0.129527,0.129026,0.11136,0.117164,0.092055,0.064057,0.091648,0.129133,0.113566,0.138395,0.199858,0.150282,0.086752,0.113048,0.122228,0.087139,0.0878
0.102944,0.13096,0.151621,0.129235,0.112977,0.070065,0.093868,0.162911,0.161045,0.081315,0.062445,0.106574,0.11657,0.097294,0.110293,0.097733,0.053413,0.068235,0.104975,0.081309,0.092206,0.151438,0.11459,0.063831,0.102549,0.142325,0.103635,0.084504
0.08214,0.116372,0.14758,0.129073,0.10412,0.069043,0.076694,0.144051,0.164191,0.082105,0.054019,0.077522,0.09441,0.073633,0.087074,0.097692,0.061008,0.058898,0.080828,0.069926,0.073451,0.103521,0.076396,0.042638,0.088465,0.146886,0.10546,0.069891
