1.3e-05,2e-06,4e-06,9e-06,1.6e-05,1.2e-05,2e-06,2e-06,2.3e-05,9e-06,0,1.7e-05,1.8e-05,1.2e-05,6e-06,3.3e-05,1.4e-05,2.1e-05,1.1e-05,1.1e-05,2.9e-05,5e-06,3.9e-05,1.1e-05,4.3e-05,8.1e-05,8e-06,0.000119,2.4e-05,0.00011,3.2e-05,1e-05,0.000137,6e-06,2.2e-05,2.3e-05,3.3e-05,0.000125,9.6e-05,2.7e-05,8e-05,1.4e-05,7.2e-05,1.8e-05,4.6e-05,6.8e-05,7.4e-05,0.000103,3.6e-05,2e-06,1.1e-05,0.000118,2.1e-05,1.8e-05,1.3e-05,4.4e-05,0.000116,3e-06,2.5e-05,0.000168,3e-06,0.000104,5.4e-05,6.8e-05,2.5e-05,2.7e-05,6.1e-05,0.000114,3.7e-05,4e-05,8.5e-05,1e-04,1.9e-05,0.00021,0.000139,0.000106,0.000109,0.000204,3.4e-05,6.3e-05,1.8e-05,5.1e-05,2.4e-05,9.3e-05,3e-05,4.4e-05,3.2e-05,0.000128,5.8e-05,0.000143,7.3e-05,0.000197,5e-05,4e-06,8.6e-05,0.000141,7.8e-05,5e-05,0.000192,0.000243,2.1e-05,0.000138,9e-05,6.9e-05,0.000169,0.000132,0.000209,9e-06,7.4e-05,0.000101,2e-05,0.000209,3e-05,4.9e-05,8.6e-05,2.7e-05,0.000174,0.000186,2.8e-05,6e-05,0.000181
1.6e-05,1.5e-05,1.2e-05,1.8e-05,2.7e-05,4.3e-05,1.3e-05,3.2e-05,3.9e-05,4.9e-05,1.9e-05,2.6e-05,4.4e-05,1.2e-05,3.5e-05,5.9e-05,2.6e-05,8.8e-05,3.2e-05,5.1e-05,7.6e-05,4.5e-05,3.4e-05,6e-06,0.000104,0.00013,9.5e-05,0.000194,0.000139,0.000213,8e-05,8.2e-05,0.000275,9e-05,0.000118,2e-05,8.9e-05,0.000172,0.000247,0.000221,0.00024,3.4e-05,4.1e-05,0.000136,9e-05,0.000176,0.000209,0.000172,0.000192,0.000201,4e-05,0.000162,0.000129,1.9e-05,9.4e-05,0.000171,0.000187,0.000217,0.000363,0.000289,5.4e-05,0.000176,3.9e-05,0.00013,9.7e-05,0.00016,0.000104,0.000225,9.9e-05,0.000134,0.000167,0.000247,2.9e-05,0.000508,0.000235,0.000301,0.000351,0.000391,0.00029,0.000278,3.8e-05,0.000127,6.4e-05,9.9e-05,0.000109,0.000215,8e-05,0.000327,0.000198,0.000352,7.5e-05,0.000439,4.3e-05,9.6e-05,0.000262,0.000433,0.000325,0.000346,0.000473,0.000671,4e-05,0.000327,0.000289,0.000272,0.000415,0.000329,0.000502,9.4e-05,0.000249,0.000231,8.3e-05,0.00036,0.000161,0.000137,0.000393,5.6e-05,0.000552,0.000593,3.3e-05,0.00014,0.000501
4.2e-05,1.5e-05,2.8e-05,2e-05,9e-06,2.9e-05,3.1e-05,5.3e-05,4.2e-05,9.6e-05,3.2e-05,2e-05,2.2e-05,5.8e-05,7.3e-05,7.3e-05,3.7e-05,0.000109,7.4e-05,0.000145,0.000101,6.8e-05,0.000148,0.00011,0.000154,0.000122,0.000127,0.000242,0.00027,0.00032,0.000151,9.1e-05,0.000197,6.1e-05,0.000147,1e-04,6.5e-05,0.000234,3.3e-05,6.3e-05,0.000179,0.000143,0.00018,0.000107,8.2e-05,0.000146,0.000285,0.000137,0.000199,5.5e-05,0.00022,0.000103,6.6e-05,0.000163,0.000122,0.00034,0.000188,0.000151,0.000452,0.000508,0.000235,0.000345,0.000113,0.000293,0.000314,8.6e-05,0.000212,0.000394,0.000314,4.5e-05,0.000247,0.000377,0.000159,0.000362,0.000314,0.000164,0.000363,0.000538,0.000268,0.000327,0.000206,0.00017,0.000101,0.000223,0.000158,0.000213,0.000427,0.000439,0.000105,0.000595,0.000443,0.000778,0.000419,0.000111,0.000242,0.000279,0.000194,0.000262,0.000377,0.000192,0.000451,0.000468,0.000452,0.00032,0.000597,0.000536,0.000228,0.000391,0.000244,0.000328,0.000213,0.000454,0.000201,0.000504,0.000195,0.000465,0.000774,0.000272,0.000565,0.000776,0.000852
1.6e-05,2.5e-05,5.1e-05,3.5e-05,2.8e-05,5.2e-05,2.5e-05,7e-05,5.3e-05,3.4e-05,5.2e-05,9.1e-05,1.9e-05,7.7e-05,6.5e-05,0.000151,6.2e-05,0.000138,8.1e-05,0.000141,0.000218,8.6e-05,0.000189,0.000197,0.000297,0.000162,9.6e-05,0.000311,0.000372,3e-05,0.00026,7.1e-05,0.000396,0.000147,0.000169,0.000154,6.5e-05,0.00027,0.000431,0.000293,0.000201,0.000125,0.000323,0.000141,0.000115,0.000213,0.000295,0.000235,0.000278,0.000168,0.000275,0.000358,0.000192,0.000206,0.000279,0.000398,0.000131,0.000185,0.000942,0.000484,0.000425,0.00051,0.000108,0.000703,0.000228,0.000113,0.000287,0.000172,0.000241,0.000532,0.000456,0.000612,0.000648,0.000641,0.000491,0.000722,0.000328,0.000615,0.000214,0.000407,0.000297,0.000743,0.000311,0.000391,0.000423,0.000614,0.000563,0.000262,0.000391,0.000925,4e-06,0.000675,0.000273,0.000302,0.00013,0.000365,0.000722,0.000123,0.000226,0.001067,0.000618,0.000149,0.000817,0.000442,0.000696,0.000446,0.000488,0.000431,0.000858,0.000544,0.000419,0.000902,0.000431,0.000383,0.000495,0.000636,0.000238,0.000453,0.000775,0.00041,0.000652
3.5e-05,4e-05,1.2e-05,6.3e-05,7.2e-05,2.5e-05,2.6e-05,8e-05,8.8e-05,3.9e-05,8.2e-05,8.3e-05,9e-05,4.5e-05,7.3e-05,3.3e-05,0.000116,0.000107,8.1e-05,0.000125,9.3e-05,0.000288,0.000285,0.000429,0.000153,0.000228,0.000203,0.000483,0.000399,0.000556,0.000574,0.000427,0.000609,0.000437,0.000549,0.000439,0.000232,0.000161,0.000329,0.000392,0.000457,0.000347,0.000287,0.00032,5e-05,0.000463,0.001049,0.000995,0.000394,0.000125,0.000346,0.000151,0.000456,0.000234,0.000516,0.00047,0.000829,0.000339,0.001289,0.00177,0.001148,0.000341,0.000655,0.001221,0.001442,0.000691,0.000233,0.00029,0.000432,0.000632,0.000964,0.00043,0.000488,0.000721,0.000891,0.00152,0.001682,0.001171,0.000716,0.000166,0.000629,0.001471,0.000939,0.000734,0.000428,0.000473,0.000335,0.000941,0.000515,0.000652,0.001544,0.000722,0.000906,0.000158,7.6e-05,0.000375,0.000873,0.001231,0.000653,0.000782,0.000992,0.001423,0.001483,0.001212,0.001589,0.001557,0.000981,0.000555,0.000917,0.000584,0.000437,0.000582,0.00032,0.000434,0.00022,0.000145,0.000582,0.000995,0.001357,0.001319,0.001388
2.5e-05,3.2e-05,3.2e-05,5.7e-05,2.8e-05,2.3e-05,3.1e-05,6.7e-05,8.8e-05,4.6e-05,7e-05,0.000128,5.1e-05,8.8e-05,8.3e-05,0.000118,8.9e-05,9.2e-05,9.5e-05,0.000123,0.000173,0.000268,0.000255,0.000124,0.000342,0.000307,0.000575,0.000306,0.00048,0.000505,0.000293,0.000324,0.000629,0.000399,0.000239,0.000335,0.00031,0.000437,0.000494,0.000271,0.000432,0.000418,0.000334,5e-04,0.000812,0.000434,0.000508,0.000448,0.00076,0.000683,0.000314,0.000648,0.000955,0.000683,0.000684,0.000479,0.000405,0.00046,0.001066,0.001278,0.00144,0.001759,0.001259,0.001043,0.001099,0.001011,0.001035,0.000592,6e-04,0.00039,0.000548,0.000439,0.000135,0.000704,0.001437,0.000441,0.000603,0.000507,0.00031,0.000568,0.00038,0.001627,0.000841,0.000354,0.000428,0.000916,0.001147,0.001584,0.000743,0.000766,0.002029,0.00134,0.000715,0.001167,0.001037,0.000524,0.000726,0.000803,0.000309,0.001064,0.000454,0.00065,0.000731,0.000377,0.001024,0.001186,0.000512,0.000253,0.001757,0.001367,0.000666,0.000366,0.000634,0.000564,0.000506,0.000599,0.001046,0.000737,0.000329,0.000328,0.000581
3e-05,5.5e-05,5e-06,1.4e-05,4.1e-05,4.4e-05,4.7e-05,1.6e-05,0.000105,6.2e-05,8.1e-05,2.7e-05,8.4e-05,8.9e-05,0.000292,0.000223,0.000172,4.6e-05,0.000188,0.00018,5.5e-05,0.000114,0.000117,5.1e-05,0.000292,0.000251,0.000346,0.000398,0.000188,0.000243,0.000358,0.00038,0.00044,0.000167,0.000245,0.000269,0.000346,0.000223,0.000654,0.000191,0.000165,0.000288,0.000455,0.000182,0.00093,0.000397,0.00013,0.000179,0.000404,0.000545,0.000291,0.00077,0.000585,0.000436,0.000694,0.000246,0.000205,0.000237,0.000869,0.000289,0.000354,0.000891,0.000525,0.000644,0.000995,0.000264,0.000536,0.000335,0.000828,0.000626,0.000354,0.000423,0.000734,6e-05,0.000298,0.001023,0.00022,0.001229,0.000469,0.00027,0.000999,7e-04,0.00062,0.000581,0.000941,0.001574,0.000673,0.000661,0.000555,0.000828,0.001236,0.000515,0.000574,0.00084,0.000461,0.000443,0.000991,0.000566,0.000828,0.001103,0.000863,0.000237,0.000572,0.000406,0.000455,0.000108,0.000598,0.000303,0.001492,0.000645,0.000442,0.000707,0.000259,0.000199,0.00032,0.000984,0.000553,0.000516,0.000365,0.000886,0.000318
0.000106,3.7e-05,5.7e-05,6.7e-05,3.1e-05,7.2e-05,5e-05,5.4e-05,0.000131,9.3e-05,6.9e-05,6.2e-05,0.000118,8.4e-05,0.000296,0.000224,0.000326,0.000254,0.000123,0.000156,0.000209,0.000135,0.000269,4e-04,0.000648,0.000658,0.000399,0.000675,0.00077,0.000494,0.000704,0.000809,0.000434,0.000178,0.00032,0.000783,0.000661,0.000273,0.001002,0.000669,0.000172,0.000715,0.000856,0.000616,0.001001,0.001317,0.000997,0.000614,0.00058,0.000599,0.000408,0.000864,0.001635,0.000714,0.000772,0.000834,6.3e-05,0.000407,0.000479,0.000779,0.001106,0.000802,0.000303,0.000639,0.001279,0.001061,0.001058,0.000516,0.00062,0.001164,0.000894,0.001066,0.001539,0.001284,2.2e-05,0.001492,0.001589,0.001684,0.002048,0.001361,0.001512,0.001985,0.000985,0.000813,0.000574,0.000763,0.002269,0.002332,0.001239,5.3e-05,0.000763,0.000423,0.000336,0.000825,0.00152,0.000916,0.001751,0.001146,0.001613,0.002361,0.001946,0.000452,0.000863,0.0013,0.001562,0.001173,0.001603,0.001415,0.001425,0.002006,0.001568,0.001685,0.00088,0.000383,0.001116,0.001235,0.001235,0.001119,0.000658,0.001151,0.001473
9e-05,0.00015,6.6e-05,1.8e-05,6.3e-05,7.5e-05,0.000103,1.8e-05,0.000103,0.000205,0.000107,0.000112,4.4e-05,5.8e-05,0.000301,0.00034,7.6e-05,0.000236,0.000192,0.000359,0.000536,0.000471,0.000192,0.000414,0.00075,0.000708,0.000728,0.000432,0.001361,0.000918,0.000158,0.000691,0.000463,0.000912,0.000938,0.000988,0.000769,0.000626,0.001512,0.001664,0.001299,0.001051,0.001038,0.000463,0.001137,0.001259,0.000592,0.000308,0.00061,0.000434,0.000324,0.001006,0.001599,0.00125,0.001583,0.001205,0.001511,0.001134,0.001439,0.001188,0.000411,0.000553,0.000809,0.000713,0.000327,0.000627,0.000878,0.000798,0.000479,0.001135,0.001021,0.000709,0.002203,0.002571,0.002353,0.000565,0.000819,0.000763,0.002045,0.001063,0.000561,0.001542,0.001055,0.000446,0.001015,0.001331,0.001798,0.002429,0.001941,0.00088,0.000626,0.000702,0.00143,0.000594,0.001049,0.000694,0.001661,0.001399,0.001162,0.001088,0.001405,0.001351,0.001355,0.001704,0.003155,0.002232,0.001687,0.001789,0.001314,0.002424,0.001986,0.002093,0.002054,0.001554,0.001558,0.001564,0.001356,0.000647,0.000138,0.000966,0.001597
0.000154,0.000197,0.00012,8e-05,0.000106,5.6e-05,4.7e-05,4.6e-05,9.8e-05,0.000191,1e-04,7.9e-05,7e-05,2.9e-05,0.000177,4.5e-05,0.000157,0.000207,0.000243,0.000322,0.000225,0.000113,0.000121,0.000168,4e-04,0.000168,0.000572,0.000817,0.000715,0.000266,0.000207,0.000228,0.000188,0.000862,0.000685,0.000278,0.000376,2.7e-05,0.000938,0.000394,0.000488,0.000403,0.000331,0.000495,0.000624,0.000433,0.000557,0.000496,0.000529,0.000262,0.000306,0.000247,0.000555,0.000217,0.000637,0.000305,0.000944,0.000343,0.001026,0.000669,0.000909,0.000143,0.000457,0.000376,0.000644,0.000563,0.00078,0.000237,0.000461,0.000663,0.000615,0.000878,0.001159,0.00048,0.000927,0.001026,0.000482,7.6e-05,0.001463,0.001002,0.000743,0.000533,0.00051,0.001273,0.000255,0.000445,0.000802,0.001405,0.000354,0.000562,0.001105,0.001226,0.000847,0.001152,0.000562,0.000659,0.001549,0.000701,0.000799,0.001245,0.000928,0.000136,0.000715,0.000955,0.001835,0.000674,0.001476,0.000675,0.00041,0.001184,3.2e-05,0.00179,0.001318,0.000213,0.00085,0.001495,0.000818,0.000894,0.000516,0.000772,0.001407
0.000103,9.4e-05,6.4e-05,2.9e-05,9.7e-05,7.3e-05,4.7e-05,2.3e-05,5.1e-05,0.000113,5.1e-05,2.1e-05,6e-06,3.1e-05,8.2e-05,5.2e-05,9.7e-05,9.8e-05,0.000179,7.8e-05,0.000143,1.8e-05,3.3e-05,0.000175,6.7e-05,6.2e-05,0.000475,7.2e-05,5.7e-05,5.7e-05,6.1e-05,7.6e-05,7.6e-05,0.000543,0.00024,0.000129,0.000384,0.000329,0.000338,0.000588,1.2e-05,9.7e-05,0.000243,0.000294,0.00028,0.000119,0.000468,0.000144,0.000263,0.000129,0.00038,0.000683,0.000381,0.000103,0.000365,0.000388,0.000733,0.000709,0.000512,0.000652,0.000145,0.000203,0.000333,0.000225,0.000661,0.000636,0.000703,0.000475,0.000395,0.000354,0.000916,0.000656,0.000629,0.000889,0.000359,0.000306,0.000796,0.001102,0.000405,0.000363,0.000894,0.000699,0.000411,0.000752,0.000588,0.000379,0.000127,0.001006,0.000969,0.000545,0.001647,0.001433,0.001772,0.000676,0.000581,0.000743,0.000773,0.000843,0.000669,0.000594,0.000267,0.000161,0.000727,0.000554,0.001395,0.001005,0.001457,0.000739,0.000348,0.001221,0.00084,0.001526,0.000285,0.000291,0.000636,0.000562,0.000529,0.001098,0.00086,0.000277,0.000994
4.8e-05,1.9e-05,2.9e-05,6.3e-05,2.3e-05,4.3e-05,3.8e-05,3.2e-05,4.3e-05,2.6e-05,2.2e-05,4.2e-05,1.8e-05,2.8e-05,3.3e-05,2.2e-05,7.7e-05,4.3e-05,5.4e-05,4.5e-05,8.1e-05,2.7e-05,3.8e-05,0.000215,7.6e-05,0.000196,0.000188,0.000445,0.000229,1.8e-05,9.1e-05,0.000109,8.9e-05,0.000161,5e-06,9.7e-05,0.000166,4.9e-05,8.4e-05,0.000114,8.8e-05,0.00025,0.000211,0.000207,0.00029,0.000135,0.000208,0.000218,0.000134,4.4e-05,0.000217,0.000339,0.000182,0.000198,0.00042,0.000357,0.000144,0.00049,0.000302,0.000349,0.000524,4.3e-05,0.000108,0.000138,0.000419,5.4e-05,0.000172,0.000103,0.000276,0.000243,0.000537,0.000362,0.000225,0.000365,0.000207,0.000235,0.000531,0.000293,0.000259,0.000414,0.000535,0.000245,0.000265,0.000378,0.000181,0.000125,0.000424,0.00013,0.000203,0.000379,0.001049,0.00038,0.000524,0.000279,0.000425,0.000219,0.000323,0.000873,0.000494,0.000251,6.2e-05,0.00042,0.000459,0.000614,0.001016,0.000477,0.000314,5.6e-05,0.000153,0.000574,0.000415,0.000508,0.000455,0.000343,0.000121,0.000452,0.000434,0.000324,0.000245,0.000311,0.000368
5.3e-05,6.3e-05,2.1e-05,2.4e-05,3.8e-05,4e-06,2.3e-05,1.5e-05,5.5e-05,3.1e-05,1.1e-05,2.2e-05,4e-06,3e-06,3.4e-05,2.6e-05,2.8e-05,2.3e-05,2.9e-05,7e-05,6.4e-05,5.5e-05,5.1e-05,0.000122,5e-05,0.000125,0.000114,0.000192,9.5e-05,3.5e-05,9.5e-05,6.2e-05,0.000147,8.1e-05,0.000165,2.2e-05,0.000108,7.4e-05,0.000136,0.000136,5.9e-05,0.000153,0.000149,9.8e-05,0.000219,0.000117,9e-05,6.4e-05,0.000102,5.2e-05,0.000141,0.000346,2.4e-05,0.000206,0.000228,0.000161,0.000143,0.000313,0.00013,0.000185,0.000217,0.000148,8.6e-05,0.000126,9.5e-05,8e-05,5e-06,9e-05,0.000141,0.00027,4e-04,0.000138,0.000179,0.000169,0.000208,0.000333,0.000251,0.00026,0.000113,0.000242,0.000429,0.000155,0.000235,0.00015,8.7e-05,0.000153,0.000297,6.7e-05,0.00018,4e-05,0.000487,0.000267,0.000208,8.3e-05,0.000439,0.000109,0.000216,0.000343,9.6e-05,0.000237,6.7e-05,0.000364,8.9e-05,0.000352,0.00058,0.000153,0.000195,0.000214,0.000123,0.000325,7.1e-05,0.000347,0.000107,0.000213,0.000107,0.000281,0.000211,0.000123,8.6e-05,2.9e-05,0.000246
7.7e-05,5.2e-05,1.4e-05,1.9e-05,6.6e-05,6.2e-05,3e-05,2.5e-05,5.9e-05,3.1e-05,3.2e-05,1.9e-05,1.4e-05,1.1e-05,2.8e-05,2.7e-05,6.3e-05,1.9e-05,2.9e-05,4.1e-05,7.1e-05,8.1e-05,4.8e-05,5.8e-05,4.8e-05,6.6e-05,4.2e-05,5.4e-05,4.8e-05,2.3e-05,0.000102,8e-05,9.4e-05,1.8e-05,0.000102,3.2e-05,9.2e-05,7.3e-05,0.000127,0.000147,5.8e-05,0.000101,9.2e-05,6.1e-05,0.000182,9.1e-05,0.000107,5.1e-05,8.5e-05,1e-05,0.000107,0.000267,8.4e-05,0.000173,0.000171,0.000132,0.000124,0.000162,6.5e-05,0.000146,0.000257,8.3e-05,0.000119,7.5e-05,8.6e-05,8.8e-05,9.5e-05,9.9e-05,6.3e-05,0.000184,0.000289,0.000189,0.000133,0.000105,0.000211,0.000277,9.8e-05,0.000265,7.7e-05,0.00022,0.000365,0.000139,0.00023,0.00011,2.1e-05,0.000237,0.000352,0.000159,0.000168,2.8e-05,0.000236,0.00021,0.000229,3.6e-05,0.000341,0.000171,0.000105,0.000204,0.000206,0.000145,9.5e-05,0.000119,0.000134,0.000259,0.00038,0.000173,0.000143,0.00019,0.000105,0.000258,0.000133,0.000289,0.000103,0.000156,0.000254,0.00024,0.000217,4e-05,0.000133,5.4e-05,0.000241
0.000142,0.000116,2.6e-05,4.8e-05,8.4e-05,2.7e-05,2.3e-05,4e-05,4.2e-05,5.4e-05,6.9e-05,3.8e-05,1.2e-05,1.4e-05,4e-05,5.8e-05,2.4e-05,2.8e-05,4.3e-05,7.4e-05,5.4e-05,2.4e-05,4.4e-05,7.6e-05,6.9e-05,9.7e-05,6.3e-05,9.2e-05,9e-05,5.9e-05,0.000148,9.7e-05,8.6e-05,8.8e-05,0.000143,3e-05,5.9e-05,9.6e-05,7.6e-05,0.000173,7.3e-05,9.3e-05,8.7e-05,7.9e-05,9.4e-05,0.000111,6.2e-05,0.000133,0.000197,0.000154,7.7e-05,0.000327,4e-05,0.000193,0.000141,0.000167,0.000152,0.000139,7.7e-05,0.000169,0.000147,6.9e-05,0.000189,0.000147,0.000127,0.000112,1.8e-05,0.000221,5e-05,0.000244,0.000149,0.000194,0.000124,5.8e-05,0.000157,0.000289,0.00017,0.00016,0.000186,0.000299,0.000375,0.000133,0.000266,0.000119,6e-05,0.000214,0.000267,0.000137,0.000148,7.1e-05,0.000292,0.000174,0.000317,0.000116,0.000277,0.000208,0.000234,0.000226,0.000105,9.9e-05,0.000163,0.000145,0.000144,0.000355,0.000357,0.00022,0.000214,0.000213,0.000206,0.000452,0.000272,0.000201,1.6e-05,5.1e-05,0.000156,0.000196,0.000306,0.000107,0.000121,7.3e-05,0.000289
7.9e-05,0.00011,0.000112,4.5e-05,9.8e-05,9.6e-05,7e-06,1.4e-05,7.3e-05,8.9e-05,2.6e-05,2.1e-05,2.5e-05,1.9e-05,4.6e-05,3.9e-05,3.7e-05,1e-05,2e-05,4.5e-05,4.4e-05,9.2e-05,6.6e-05,7.4e-05,3.9e-05,9.3e-05,9.1e-05,1e-04,0.000141,2.3e-05,0.000189,7.1e-05,0.000105,8.3e-05,0.000142,8.4e-05,5.6e-05,6.5e-05,0.000124,0.000158,6e-05,7.9e-05,0.000137,8.9e-05,0.000134,0.000135,0.000239,0.000113,0.000242,0.000122,0.000163,0.000261,6.3e-05,0.000183,0.000264,4.8e-05,9.9e-05,0.000146,0.000165,6.8e-05,0.000184,7.8e-05,0.000198,0.000202,0.000135,4e-05,8.2e-05,0.000321,0.000188,0.000159,0.000107,0.000189,0.000147,2.5e-05,9e-05,0.000146,4.9e-05,0.000201,0.000237,0.000275,0.000319,2e-04,0.000418,0.00014,0.000198,2e-04,9.7e-05,0.000275,0.000153,0.000138,0.000319,0.000455,0.000343,0.000119,0.00033,0.000133,0.000162,0.000239,0.000221,0.00025,0.000253,0.000257,0.000221,1.8e-05,0.000247,0.000297,1.6e-05,0.000208,0.000253,0.000552,0.000253,0.000154,0.000223,0.000314,7e-06,0.000247,0.000284,0.000106,0.000164,6.6e-05,0.000349
0.000217,9.8e-05,9.3e-05,5.3e-05,6.6e-05,7.1e-05,8.4e-05,6.4e-05,0.000109,0.000164,8.2e-05,4.2e-05,7.2e-05,6.3e-05,2.3e-05,3e-05,1.3e-05,4.1e-05,3.2e-05,4.8e-05,5.6e-05,0.000178,0.000151,3.8e-05,0.000125,0.000212,0.000289,2.9e-05,0.000263,0.000257,0.000299,0.000196,0.000174,3.9e-05,0.000208,0.000127,0.000141,0.000255,0.00013,4.5e-05,0.000177,0.000263,0.000229,0.000143,0.000169,0.000175,0.000205,0.000297,0.00023,0.000113,0.000167,0.000443,0.000391,5e-05,0.000197,0.000122,0.000277,0.000211,0.000323,0.000352,0.000205,0.000343,0.000613,0.000112,6.3e-05,0.000225,0.000156,0.000385,0.00027,4e-05,0.000148,0.000123,0.000134,0.000149,0.000218,0.000303,0.000149,0.00038,0.000257,0.000252,0.000444,0.000232,0.000463,0.000551,0.00034,0.000181,0.00046,0.00033,2e-04,0.000408,0.000136,0.000679,0.000421,0.000244,0.000503,0.000354,0.00015,0.000586,0.000411,0.000425,0.000312,0.000132,0.000216,0.000464,0.000465,0.000182,0.000714,0.00016,0.000325,0.001137,0.000606,0.000126,0.000666,0.000138,0.000207,0.00046,0.000473,0.000634,0.000599,0.000248,0.000133
9.5e-05,0.000113,3.4e-05,4.9e-05,1e-05,6.4e-05,4.3e-05,5.7e-05,6.4e-05,0.000111,6.8e-05,3e-05,5.7e-05,3e-05,2.1e-05,3.6e-05,8.3e-05,0.000131,0.000134,4.7e-05,4.2e-05,0.000278,0.000314,0.000287,0.000326,0.000232,0.000245,0.000473,0.000435,0.000445,5.1e-05,0.000157,0.000294,0.000306,0.000317,0.000285,0.000193,0.000323,0.000448,0.000534,0.000203,0.000515,0.000436,0.00036,0.000241,0.000435,0.000388,0.000457,0.000555,0.000314,0.000327,0.000626,0.000932,0.000716,0.000545,0.000209,0.000286,0.000295,0.00042,0.000785,0.00076,0.000616,0.000358,0.00069,0.000425,0.000601,0.000336,0.000249,0.000438,0.000462,0.000491,0.000674,0.000249,0.000298,0.000473,0.000648,0.000548,0.000445,0.000313,0.000218,0.000736,0.00091,0.000121,0.000881,0.001142,0.000662,0.000864,0.000432,4.9e-05,0.00035,4e-04,0.001182,0.001532,0.000693,0.000451,0.000621,0.000534,0.000304,0.00068,0.000912,0.001287,9e-04,0.000461,0.000886,0.000254,8.7e-05,0.001093,0.000802,0.000301,0.001166,0.001703,0.001279,0.001431,0.000965,0.000341,5.9e-05,0.000692,0.001162,0.00125,0.000733,2e-04
0.000102,4.4e-05,9e-06,2.3e-05,1.1e-05,5.4e-05,3.5e-05,4.9e-05,4.2e-05,1e-04,4.1e-05,1.1e-05,3.2e-05,5.3e-05,3.5e-05,3.4e-05,0.000105,9.7e-05,6.8e-05,6.6e-05,6.2e-05,0.00018,2.5e-05,0.000174,0.000102,8.3e-05,0.000182,0.00041,0.000583,0.000271,0.000189,0.000138,0.000207,0.000167,3.2e-05,0.000353,0.000499,0.000694,0.000546,0.000254,0.000393,0.000357,0.000429,0.000247,0.000142,0.000381,0.000492,0.000467,7.9e-05,0.000132,0.000361,0.000333,0.000378,0.000314,0.000243,0.000374,0.00056,0.000368,0.000697,0.000626,0.000492,0.000652,0.001071,0.000934,0.000349,0.000439,0.000541,0.000301,0.000516,0.000372,0.000188,0.000444,0.000527,0.000678,0.000371,0.000208,0.000702,0.000739,0.000494,0.000369,0.000729,0.000913,0.000853,0.000786,0.000973,0.000587,0.000736,0.000632,0.000511,0.000326,0.000454,0.00074,0.000774,0.001007,0.000913,0.000636,0.000181,0.00029,0.000891,0.000611,0.00067,0.000565,0.000511,0.00047,0.000666,0.000382,0.000935,0.000944,0.000885,0.000317,0.000848,3e-04,0.000771,0.000542,0.000391,0.000272,0.000643,0.000729,0.000217,9.2e-05,0.000279
9.1e-05,8.9e-05,6.2e-05,3.4e-05,1.8e-05,3.7e-05,2.6e-05,2.7e-05,5.3e-05,5.2e-05,2.4e-05,1.6e-05,6e-06,2.6e-05,8e-06,3.9e-05,4e-05,4.4e-05,4.3e-05,4.1e-05,8e-05,7.2e-05,0.000101,5.7e-05,7.7e-05,7.9e-05,5.1e-05,0.000215,0.00023,7e-05,5.5e-05,5.4e-05,0.00018,0.000165,4.7e-05,0.000235,0.000109,0.000224,8.6e-05,9.1e-05,0.000253,7.5e-05,0.000144,6.5e-05,4.6e-05,0.000221,0.000276,0.000157,3.9e-05,0.000139,0.000244,0.00012,0.000306,8.1e-05,0.000184,0.000257,0.000335,0.000261,0.000513,0.000183,0.000167,6.6e-05,0.000552,0.000144,0.000153,0.000324,0.000108,0.00024,0.000254,0.000263,0.000127,0.000179,6.7e-05,0.000346,0.000164,0.000217,0.00037,5e-05,0.000134,0.000144,0.000298,0.000228,0.000245,0.000362,0.000355,0.000216,0.000271,0.000247,0.000258,0.000393,0.000102,0.000328,0.000285,0.000396,0.000424,0.000219,0.000166,0.000323,0.000529,0.000299,0.000493,0.000333,0.000316,0.000274,5e-04,6.4e-05,0.000574,0.000405,4.1e-05,0.000174,0.000531,0.000417,0.000354,2.3e-05,0.000188,0.00024,0.000507,0.000139,0.000232,2e-04,0.000438
1.6e-05,1e-05,1.2e-05,1.5e-05,8e-06,2.6e-05,4e-06,1.7e-05,6.5e-05,4.2e-05,2.3e-05,2.9e-05,1.6e-05,2.8e-05,1.8e-05,2.5e-05,4.5e-05,2.6e-05,3.1e-05,2e-05,4.5e-05,2.8e-05,7.2e-05,8.6e-05,2.4e-05,8.7e-05,0.00012,9.4e-05,0.000205,3.9e-05,4.2e-05,6.2e-05,3e-05,7.7e-05,4.4e-05,7.8e-05,4.5e-05,5.4e-05,1e-04,7.1e-05,0.000144,8.1e-05,1.5e-05,6.2e-05,7.4e-05,0.000177,0.000189,0.000189,6.3e-05,5.3e-05,8.8e-05,0.000112,8.5e-05,2.3e-05,0.000167,0.000146,0.000119,0.000122,0.000243,0.000195,0.000131,0.000103,0.000284,8.7e-05,9.7e-05,0.000164,7.8e-05,0.000157,5e-05,0.000198,0.000177,3.9e-05,0.000156,1.3e-05,0.000149,5.7e-05,0.000232,0.000182,0.000108,2.5e-05,0.000164,0.000175,0.000149,0.000293,0.000179,0.000187,0.000191,0.000203,3.5e-05,0.000152,0.000169,0.000238,0.000112,0.000265,7e-05,0.000107,6.4e-05,0.000112,0.000166,0.000197,0.000174,0.000238,0.000174,0.00026,0.000242,0.000105,0.000329,9.3e-05,8.2e-05,0.00012,0.00011,0.000183,0.00017,4.7e-05,0.000223,0.000122,0.000156,0.000156,2.8e-05,0.000136,0.000322
4e-05,8e-05,8.4e-05,3.5e-05,2.2e-05,3e-05,1.4e-05,2.1e-05,8.9e-05,5.7e-05,3.9e-05,1.2e-05,4.2e-05,6.4e-05,3.1e-05,1.4e-05,3.5e-05,1.4e-05,1.7e-05,1.4e-05,5.2e-05,4.3e-05,9e-05,4.9e-05,1.3e-05,7.8e-05,7.3e-05,1.3e-05,0.000178,6.4e-05,2.2e-05,2.5e-05,8.3e-05,3.9e-05,2.9e-05,4.3e-05,2.5e-05,6.3e-05,2.9e-05,9.4e-05,0.000124,6e-05,2.3e-05,3.7e-05,2.3e-05,0.000135,0.000106,8.7e-05,5.9e-05,4.4e-05,4.9e-05,0.000115,0.000106,2.2e-05,0.000107,0.000132,1.8e-05,0.000112,0.000274,0.000115,7.3e-05,8e-05,0.000176,1.9e-05,0.000109,7.7e-05,0.000102,0.000136,4.5e-05,0.000174,0.000124,4.8e-05,9.4e-05,0.000136,7.8e-05,9.7e-05,1e-04,5e-06,3.6e-05,7.3e-05,0.000145,1.8e-05,8.2e-05,0.000193,9.6e-05,5.7e-05,0.000256,0.000175,0.000102,7.7e-05,0.000144,0.000167,1.4e-05,0.000112,1.4e-05,3.3e-05,5.4e-05,8.7e-05,0.000113,0.000205,3.8e-05,0.000158,9.7e-05,0.000319,0.000303,8e-05,0.000237,0.000121,9.9e-05,0.000155,4.5e-05,0.000206,4.3e-05,5.4e-05,0.000132,0.00015,0.000288,7.3e-05,8.5e-05,0.000123,0.000323
2.8e-05,6.3e-05,7.3e-05,4e-05,1.7e-05,1e-05,1.3e-05,2.1e-05,3.2e-05,4.5e-05,4.1e-05,2.5e-05,4e-06,2.6e-05,1.6e-05,1.8e-05,1.8e-05,8e-06,6e-06,1.3e-05,4e-05,4.6e-05,1.3e-05,5.1e-05,1.1e-05,3.8e-05,2.7e-05,3e-05,7.1e-05,4e-06,2.2e-05,1.8e-05,4e-05,4.5e-05,2.5e-05,2.9e-05,1.8e-05,2.9e-05,1.5e-05,2.5e-05,8.7e-05,3.1e-05,2.2e-05,4e-05,2.9e-05,6.6e-05,4.4e-05,3.3e-05,2.5e-05,1.6e-05,2.7e-05,6.2e-05,3.6e-05,2e-05,6.3e-05,5.8e-05,2.5e-05,1.2e-05,9.4e-05,3.2e-05,2.9e-05,3.1e-05,8.2e-05,1.2e-05,5e-05,1e-05,3.5e-05,2.5e-05,3.2e-05,8.1e-05,6.5e-05,2.8e-05,6.7e-05,3.8e-05,1.8e-05,3.1e-05,9e-06,1.8e-05,2.5e-05,3.1e-05,4.3e-05,2.6e-05,3.7e-05,6.2e-05,3.5e-05,2.9e-05,9.9e-05,4.8e-05,3.9e-05,2.7e-05,4.9e-05,6.1e-05,3.8e-05,5.2e-05,2.4e-05,1.6e-05,3.3e-05,4.4e-05,5.3e-05,0.000105,7.4e-05,4.6e-05,1.4e-05,0.000128,0.000113,3.5e-05,7.3e-05,6.7e-05,1.8e-05,9e-06,5e-05,5.4e-05,4.8e-05,4.3e-05,3.5e-05,3.6e-05,1.4e-05,1.1e-05,3.9e-05,1.8e-05,8.8e-05
3e-05,4.8e-05,3e-06,4e-06,1.8e-05,1.1e-05,1e-05,1.6e-05,4.5e-05,2.3e-05,1.3e-05,8e-06,9e-06,1.6e-05,1.5e-05,1.1e-05,9e-06,1.2e-05,2e-06,1.8e-05,1.6e-05,3.4e-05,1.4e-05,2.9e-05,1.9e-05,4.2e-05,2.4e-05,1.3e-05,3.8e-05,1.3e-05,2e-05,1.1e-05,2.3e-05,2e-05,1.4e-05,5e-06,1.5e-05,3.4e-05,2.6e-05,6.8e-05,4.1e-05,1.9e-05,1.2e-05,3.4e-05,2.3e-05,5.8e-05,3.7e-05,3.3e-05,2.2e-05,1.8e-05,1.4e-05,6.5e-05,5.4e-05,3.8e-05,4.8e-05,3.5e-05,3.9e-05,1e-05,8.4e-05,4.7e-05,3.1e-05,4.8e-05,2.1e-05,3.5e-05,8.4e-05,6.2e-05,3.9e-05,2.4e-05,6e-06,9e-05,7.7e-05,1.1e-05,7.4e-05,6.1e-05,3.8e-05,4.4e-05,2.5e-05,3e-05,3.7e-05,4.3e-05,3.6e-05,8e-06,4.9e-05,7.6e-05,6.7e-05,3.2e-05,4.5e-05,5.7e-05,7e-06,8e-06,7.2e-05,7.4e-05,3.8e-05,6e-05,3.1e-05,2.2e-05,2.5e-05,7e-06,5.5e-05,4.8e-05,2.5e-05,3.2e-05,7e-06,0.000134,0.000174,1e-04,0.000158,3.2e-05,4.2e-05,5.9e-05,3.1e-05,6e-06,2.8e-05,5.3e-05,8e-06,4.4e-05,5.5e-05,8.4e-05,8.8e-05,4.2e-05,3.3e-05
3.2e-05,3.5e-05,2.4e-05,9e-06,2.1e-05,1.2e-05,1e-05,1.5e-05,3.3e-05,2.9e-05,8e-06,1e-05,9e-06,1.4e-05,1.3e-05,9e-06,1e-05,1e-05,3e-06,1.9e-05,3.1e-05,9e-06,2.1e-05,1.5e-05,1.6e-05,2.7e-05,8e-06,1.9e-05,5.3e-05,2.2e-05,8e-06,5e-06,1.6e-05,2e-05,6e-06,1.7e-05,2.5e-05,1.5e-05,2.5e-05,4e-05,3.7e-05,1.1e-05,1.7e-05,6e-06,1.7e-05,5.4e-05,3.5e-05,4.4e-05,2.3e-05,4e-06,2e-05,2.8e-05,1e-05,2e-06,5.3e-05,3.8e-05,3e-05,3.2e-05,9.2e-05,5.5e-05,4.2e-05,4.7e-05,4.5e-05,2.8e-05,4.9e-05,2e-05,2.1e-05,2.2e-05,1.4e-05,9.2e-05,4.6e-05,2.3e-05,5.9e-05,6.3e-05,3.5e-05,3.1e-05,3e-05,2.6e-05,4.1e-05,4.3e-05,5.1e-05,1.3e-05,3.1e-05,3.8e-05,3.3e-05,4.3e-05,7.7e-05,5.7e-05,3.7e-05,2.7e-05,8.8e-05,6e-06,2.2e-05,6.4e-05,3.4e-05,8e-06,3.1e-05,3.7e-05,5.8e-05,3e-05,1.7e-05,2.1e-05,6.1e-05,3.3e-05,0.000116,4.5e-05,0.000104,5.4e-05,4.3e-05,7.9e-05,1.4e-05,2.6e-05,2.7e-05,2.4e-05,4.4e-05,3.1e-05,4.5e-05,9.2e-05,4.1e-05,4.9e-05,5.8e-05
3.3e-05,2.3e-05,2.8e-05,3e-06,1.1e-05,6e-06,9e-06,7e-06,4e-05,4.3e-05,2.2e-05,2e-06,3e-06,1.1e-05,8e-06,4e-06,1e-05,6e-06,9e-06,1.9e-05,2e-05,1.4e-05,2.4e-05,3.1e-05,7e-06,3e-05,7e-06,2.5e-05,5.4e-05,1.4e-05,2.2e-05,5e-06,1.6e-05,2.4e-05,4e-06,1.1e-05,1.9e-05,2.5e-05,2.3e-05,4.1e-05,3.4e-05,5e-06,8e-06,8e-06,1.9e-05,4.3e-05,2.5e-05,3.3e-05,1.1e-05,1.5e-05,1.2e-05,2.1e-05,2.3e-05,9e-06,4.3e-05,3.8e-05,2.3e-05,3e-05,8e-05,3.7e-05,1.9e-05,1.7e-05,3.3e-05,7e-06,3.6e-05,1.2e-05,1.4e-05,1.9e-05,1.4e-05,6e-05,6.8e-05,2.5e-05,3.7e-05,4.8e-05,2.1e-05,3.6e-05,3.2e-05,2.3e-05,4.3e-05,1.6e-05,2.8e-05,2.3e-05,4.8e-05,4.6e-05,1.4e-05,2.3e-05,9e-05,4.7e-05,2.2e-05,1.4e-05,6.7e-05,1.8e-05,1e-05,5.2e-05,3.5e-05,1.9e-05,2.5e-05,3.8e-05,4e-05,4.6e-05,5.1e-05,6.2e-05,3e-05,4.7e-05,0.000112,5.3e-05,7.9e-05,3.6e-05,4e-05,5.1e-05,5e-05,3.7e-05,5.6e-05,1.3e-05,2.6e-05,2.9e-05,3.5e-05,7.3e-05,2.2e-05,8e-06,8.6e-05
8e-06,2.8e-05,8e-06,1.9e-05,1.6e-05,1e-05,6e-06,4e-06,3.3e-05,2.3e-05,1.7e-05,3e-06,3e-06,1e-05,9e-06,8e-06,2.1e-05,1.1e-05,5e-06,4e-06,1.9e-05,2.3e-05,1.2e-05,2.4e-05,1e-05,2.5e-05,6e-06,2.1e-05,5.1e-05,1.5e-05,1.6e-05,3e-06,1e-05,2e-05,8e-06,1.4e-05,1.1e-05,1.4e-05,1e-05,3.2e-05,4.4e-05,8e-06,4e-06,5e-06,1.4e-05,4.5e-05,3.1e-05,3.4e-05,1e-06,7e-06,8e-06,2.2e-05,1.4e-05,1.6e-05,3.7e-05,3.4e-05,1.9e-05,2.3e-05,7.8e-05,3e-05,3.1e-05,2.4e-05,3.6e-05,1.7e-05,3.5e-05,1e-05,2.5e-05,1.1e-05,1.5e-05,5.5e-05,7e-05,9e-06,4.7e-05,3.7e-05,2.5e-05,2.3e-05,9e-06,8e-06,1.5e-05,2.1e-05,3.6e-05,1.3e-05,1.6e-05,2.4e-05,1.4e-05,2e-05,7.3e-05,3.4e-05,3.4e-05,2.6e-05,5.9e-05,1.9e-05,2.4e-05,4.5e-05,1.3e-05,2.1e-05,2.4e-05,3.2e-05,3.6e-05,3.1e-05,4e-05,5.1e-05,3.8e-05,5.2e-05,0.000106,4.1e-05,6.4e-05,3.8e-05,1.4e-05,4e-05,3.2e-05,2.1e-05,3.3e-05,2.2e-05,1.8e-05,1.2e-05,3.9e-05,5.3e-05,2.1e-05,1.2e-05,8.4e-05
5e-06,1.9e-05,1.7e-05,2e-05,1e-06,5e-06,8e-06,8e-06,3.3e-05,2.8e-05,1.2e-05,5e-06,3e-06,1.1e-05,1.5e-05,7e-06,1.9e-05,8e-06,1e-06,7e-06,1.4e-05,1.2e-05,1.4e-05,2e-05,9e-06,2.7e-05,4e-06,1e-05,4e-05,6e-06,1.5e-05,9e-06,1.4e-05,1.6e-05,1.5e-05,1.4e-05,1.2e-05,2.4e-05,6e-06,2.3e-05,2.9e-05,6e-06,2e-06,8e-06,1.9e-05,4.8e-05,3.5e-05,2e-05,7e-06,1.5e-05,9e-06,2.4e-05,1.2e-05,1e-05,3.8e-05,2.6e-05,2.2e-05,2.5e-05,8.4e-05,2.5e-05,2.5e-05,2.3e-05,4e-05,8e-06,3.7e-05,1.1e-05,2e-05,1.5e-05,1.6e-05,5.6e-05,5.8e-05,8e-06,3.5e-05,3.4e-05,4e-06,3.1e-05,1.5e-05,1.4e-05,1.2e-05,2e-05,3.4e-05,1.4e-05,1.8e-05,3.6e-05,1.3e-05,1.1e-05,7.8e-05,3.9e-05,3.1e-05,1.6e-05,5.2e-05,2.1e-05,2.1e-05,3.8e-05,3.1e-05,1.2e-05,2.1e-05,2.3e-05,1.8e-05,2.9e-05,3.2e-05,4.2e-05,2.4e-05,5.7e-05,0.000106,2e-05,6.2e-05,2.6e-05,1.9e-05,3.6e-05,1e-05,4e-05,2.2e-05,2e-06,2.9e-05,7e-06,2.3e-05,6.1e-05,1.7e-05,6e-06,8.4e-05
1.3e-05,2.7e-05,1e-05,7e-06,7e-06,3e-06,8e-06,4e-06,3.5e-05,1.1e-05,5e-06,3e-06,4e-06,5e-06,4e-06,2e-06,2e-06,2e-06,4e-06,1.3e-05,9e-06,3e-06,9e-06,2.1e-05,7e-06,2.4e-05,7e-06,8e-06,2.9e-05,1.3e-05,2e-05,5e-06,1.1e-05,1.5e-05,1.6e-05,1.8e-05,8e-06,1.4e-05,1.2e-05,3e-05,2.9e-05,1e-06,5e-06,5e-06,1.1e-05,4.6e-05,3.5e-05,2e-05,1.6e-05,8e-06,1.1e-05,2.3e-05,9e-06,4e-06,3.4e-05,3.7e-05,1.9e-05,2.6e-05,7.8e-05,2.9e-05,3.2e-05,1.6e-05,3.3e-05,6e-06,3.5e-05,1.2e-05,1.5e-05,1.2e-05,1.2e-05,5.6e-05,4.7e-05,1.8e-05,3.3e-05,2.3e-05,3e-05,2.1e-05,2e-06,5e-06,2e-05,2e-05,4.3e-05,1.2e-05,3e-06,2.7e-05,2.1e-05,1.2e-05,7.5e-05,3.1e-05,2.4e-05,1.3e-05,5.9e-05,1.8e-05,1e-05,3.9e-05,4e-05,2e-05,2.1e-05,1.6e-05,2e-05,1.9e-05,1.3e-05,2.9e-05,1.8e-05,6.6e-05,9.5e-05,3.2e-05,4.8e-05,4.8e-05,2.4e-05,3e-05,1.7e-05,2e-05,1.6e-05,1e-05,2.2e-05,1.8e-05,2.9e-05,3.3e-05,7e-06,1.1e-05,6.3e-05
7e-06,2.1e-05,2.2e-05,1.1e-05,1.1e-05,1.2e-05,1.7e-05,1.3e-05,2.9e-05,2.5e-05,1.4e-05,8e-06,6e-06,8e-06,8e-06,6e-06,1.4e-05,4e-06,9e-06,1.1e-05,1.8e-05,3e-06,1e-05,1.6e-05,6e-06,1.8e-05,1.1e-05,2.1e-05,3.8e-05,8e-06,1.9e-05,6e-06,1.9e-05,1.4e-05,8e-06,1.2e-05,6e-06,1.3e-05,8e-06,3e-05,3.6e-05,2e-06,5e-06,5e-06,1.3e-05,4.6e-05,3e-05,1.8e-05,6e-06,1.4e-05,1.5e-05,2e-05,1.6e-05,9e-06,3.5e-05,3.3e-05,2.9e-05,1.6e-05,6.3e-05,1.1e-05,2.3e-05,1.8e-05,2.1e-05,1.3e-05,2.6e-05,2e-06,2.5e-05,1.7e-05,1.9e-05,4.9e-05,3.9e-05,6e-06,4.1e-05,2.7e-05,4.1e-05,1.1e-05,2.8e-05,2.1e-05,3e-05,1.6e-05,3.2e-05,2e-06,2e-06,3e-05,1.8e-05,1.3e-05,8.1e-05,2.8e-05,2.6e-05,6e-06,5.6e-05,2.6e-05,1.4e-05,3.5e-05,2.7e-05,5e-06,3.2e-05,2.4e-05,2.5e-05,2.1e-05,3.7e-05,2.8e-05,2.8e-05,5.1e-05,9.5e-05,1.8e-05,3.2e-05,3e-05,2.3e-05,1.9e-05,1.9e-05,3.6e-05,3e-05,1.1e-05,3.8e-05,1.2e-05,1.7e-05,5e-05,1.6e-05,1e-06,3.2e-05
3e-06,5e-06,9e-06,1.3e-05,9e-06,2e-05,3e-06,8e-06,2.1e-05,2.3e-05,3e-06,4e-06,4e-06,9e-06,9e-06,7e-06,1.3e-05,7e-06,6e-06,4e-06,1.7e-05,9e-06,4e-06,2.1e-05,2e-06,1.8e-05,1e-05,6e-06,4.9e-05,1.2e-05,2e-05,1e-06,2.1e-05,2.9e-05,1.3e-05,4e-06,7e-06,1.4e-05,1.1e-05,4.4e-05,3.3e-05,1.4e-05,9e-06,4e-06,1.4e-05,3.7e-05,3.5e-05,2.9e-05,1.1e-05,1.9e-05,1.4e-05,3.3e-05,4e-06,9e-06,4.7e-05,3e-05,2.3e-05,1.2e-05,6.1e-05,2.6e-05,2.1e-05,5e-06,3.2e-05,4e-06,1.4e-05,8e-06,1.5e-05,1.4e-05,2.6e-05,5.4e-05,4.8e-05,1.8e-05,3.7e-05,2.9e-05,1.5e-05,3.7e-05,1.3e-05,1.4e-05,2.2e-05,1.8e-05,4.6e-05,2.4e-05,6e-06,2.8e-05,1.5e-05,2.8e-05,6.5e-05,3.2e-05,3.7e-05,2.1e-05,5.1e-05,3e-05,1.1e-05,4.9e-05,1.9e-05,1.3e-05,2e-05,1.4e-05,3.4e-05,5.4e-05,2.2e-05,3.2e-05,2.2e-05,4.9e-05,9.4e-05,3e-05,2.6e-05,3.8e-05,2.8e-05,4.5e-05,2.5e-05,4.3e-05,4.7e-05,5e-06,3.8e-05,2.4e-05,2.1e-05,5.2e-05,2e-05,1.3e-05,3.2e-05
2.7e-05,3.6e-05,5e-06,1.2e-05,5e-06,7e-06,5e-06,2e-06,1.4e-05,1.2e-05,9e-06,9e-06,9e-06,6e-06,8e-06,6e-06,7e-06,8e-06,3e-06,9e-06,1.5e-05,1.3e-05,1.2e-05,2.4e-05,1e-05,2.7e-05,1.2e-05,1.2e-05,4.7e-05,9e-06,1.7e-05,1e-05,1.1e-05,1.2e-05,2.3e-05,6e-06,3e-06,1.5e-05,1.3e-05,3.8e-05,2.8e-05,3e-06,7e-06,6e-06,9e-06,3e-05,1.6e-05,1.6e-05,1.5e-05,1.5e-05,1.4e-05,2.8e-05,1e-05,6e-06,4.6e-05,3.7e-05,1.2e-05,3e-05,5.6e-05,1.4e-05,2.2e-05,8e-06,2.8e-05,6e-06,4.1e-05,2.2e-05,2.9e-05,1.4e-05,7e-06,4.8e-05,6.5e-05,8e-06,3e-05,2.6e-05,1.6e-05,3.1e-05,2.5e-05,9e-06,2.3e-05,1.5e-05,4.9e-05,1.9e-05,2.3e-05,4.7e-05,3.7e-05,1.9e-05,7.1e-05,2.6e-05,3.2e-05,2e-05,4.6e-05,3.9e-05,2e-05,5.1e-05,3.1e-05,1.9e-05,1.9e-05,2.4e-05,1.2e-05,4.7e-05,3e-05,3.7e-05,2.4e-05,5.6e-05,7.7e-05,2.9e-05,4.1e-05,1.9e-05,1.2e-05,4.3e-05,2.7e-05,2.8e-05,1.4e-05,1.3e-05,2.9e-05,1.4e-05,1.5e-05,1.8e-05,3e-05,1.6e-05,4.7e-05
3.3e-05,3.2e-05,5.2e-05,4.5e-05,2e-05,1.6e-05,5e-06,5e-06,5e-06,1.7e-05,1.9e-05,7e-06,9e-06,4e-06,4e-06,9e-06,2.4e-05,1e-05,9e-06,5e-06,2.1e-05,9e-06,6e-06,1.3e-05,1.4e-05,3e-05,1.7e-05,9e-06,3.7e-05,4e-06,1.7e-05,1.2e-05,1.9e-05,1.7e-05,1.5e-05,5e-06,1e-06,2.3e-05,1.1e-05,2.2e-05,1e-05,1.7e-05,1.3e-05,1.4e-05,1.4e-05,3.2e-05,3.1e-05,7e-06,4e-06,1.1e-05,1.9e-05,2.2e-05,1.2e-05,1e-05,2.9e-05,3e-05,1.5e-05,2.1e-05,5.4e-05,1.7e-05,2.2e-05,1.3e-05,1.8e-05,1.2e-05,4e-05,7e-06,3.2e-05,7e-06,1.6e-05,4.7e-05,5.9e-05,2.6e-05,3.5e-05,6e-06,2.5e-05,4.2e-05,2.2e-05,1.1e-05,2.4e-05,1.7e-05,4e-05,2.5e-05,1.7e-05,3.8e-05,2.2e-05,2.8e-05,8e-05,5.3e-05,2.1e-05,6e-06,4.5e-05,2.8e-05,2e-05,4.6e-05,1.9e-05,1.1e-05,9e-06,1.9e-05,2.5e-05,2e-05,2.1e-05,2.6e-05,1.1e-05,6.5e-05,8.8e-05,1.3e-05,6.7e-05,3e-05,3e-05,3e-05,2.7e-05,3.4e-05,3.8e-05,1.2e-05,1.2e-05,2e-05,5e-06,1.3e-05,2.9e-05,6e-06,5.4e-05
1.3e-05,5.4e-05,5.1e-05,3.7e-05,1.9e-05,1.7e-05,1.4e-05,5e-06,5e-06,1.8e-05,1.5e-05,8e-06,3e-06,5e-06,3e-06,5e-06,2.2e-05,1.1e-05,2e-06,1.3e-05,2.9e-05,1.4e-05,1.1e-05,1.7e-05,1.5e-05,1.1e-05,7e-06,1.8e-05,3.5e-05,1.1e-05,9e-06,1e-05,1.4e-05,1.3e-05,2.1e-05,1e-05,1e-06,2e-05,2.8e-05,4.1e-05,2.1e-05,8e-06,4e-06,6e-06,1.2e-05,3.3e-05,2.7e-05,2.2e-05,1.6e-05,8e-06,1.8e-05,1.8e-05,1.6e-05,3e-06,3.7e-05,1.7e-05,2e-05,1.3e-05,5.4e-05,2.2e-05,1.3e-05,2.1e-05,2.2e-05,1.1e-05,2.6e-05,1.3e-05,1.3e-05,1.2e-05,1.2e-05,4.1e-05,4.7e-05,1.3e-05,2.9e-05,1e-05,3e-05,5.1e-05,2.8e-05,2.2e-05,1.6e-05,9e-06,3e-05,4e-05,1.7e-05,2.1e-05,1.4e-05,1.4e-05,9.8e-05,2.6e-05,1.1e-05,1.2e-05,2.7e-05,9e-06,3.4e-05,3.3e-05,3.8e-05,2.3e-05,1.8e-05,2.9e-05,3.7e-05,2.1e-05,3.7e-05,3.1e-05,9e-06,6.6e-05,7.7e-05,1.3e-05,3.1e-05,3e-05,4.3e-05,2.6e-05,3.9e-05,4e-06,2.4e-05,6e-06,1.3e-05,1.9e-05,1.8e-05,2.4e-05,1e-05,1.9e-05,5.6e-05
3.2e-05,4.2e-05,3.6e-05,1e-06,1e-05,1.4e-05,1.7e-05,9e-06,4e-06,2.9e-05,1.9e-05,1.4e-05,9e-06,5e-06,8e-06,2e-06,1.4e-05,4e-06,6e-06,2.3e-05,1.2e-05,3e-06,5e-06,2.9e-05,2e-06,1.2e-05,1.3e-05,1.6e-05,2.3e-05,1.8e-05,1.4e-05,1.7e-05,9e-06,1.2e-05,1.3e-05,6e-06,1.1e-05,2e-06,2e-05,1.7e-05,3.8e-05,1.2e-05,6e-06,1.4e-05,2.2e-05,2.8e-05,2.8e-05,3.5e-05,7e-06,8e-06,1.6e-05,3.5e-05,3.6e-05,2.4e-05,1.8e-05,3.5e-05,3.7e-05,2.3e-05,4.3e-05,2.3e-05,2.2e-05,2.1e-05,3e-05,2.1e-05,5.1e-05,1.8e-05,2.1e-05,2e-05,1.9e-05,3.4e-05,5.9e-05,7e-06,2.8e-05,1.3e-05,2.8e-05,2.5e-05,1.3e-05,1e-05,1.8e-05,2.5e-05,2.6e-05,2.9e-05,2.6e-05,3.3e-05,1.7e-05,3e-05,6.5e-05,6.8e-05,3.7e-05,3.9e-05,2.6e-05,3.3e-05,2.8e-05,5.1e-05,3.2e-05,2e-06,1.3e-05,1.2e-05,4.9e-05,5.2e-05,6e-05,4.2e-05,3.3e-05,3.7e-05,8.8e-05,2.1e-05,3.6e-05,1.2e-05,3.2e-05,2.6e-05,3.7e-05,3.5e-05,2.7e-05,1.8e-05,2.4e-05,3.4e-05,1.3e-05,4.7e-05,1.4e-05,1.1e-05,3.3e-05
4.1e-05,1.8e-05,2.6e-05,2.9e-05,2e-05,2.3e-05,1.2e-05,1.5e-05,9e-06,2.3e-05,6e-06,6e-06,9e-06,1.1e-05,1.2e-05,1.1e-05,1.6e-05,6e-06,7e-06,1.5e-05,1.7e-05,4e-06,4e-06,2.6e-05,2e-06,2.3e-05,2e-06,6e-06,1.9e-05,1.6e-05,3e-06,1.3e-05,8e-06,1.3e-05,8e-06,1e-06,6e-06,2e-06,2.2e-05,2.8e-05,3.1e-05,4e-06,9e-06,1.1e-05,3e-06,4e-05,1.7e-05,3.3e-05,8e-06,5e-06,1.8e-05,3.9e-05,1.5e-05,1.6e-05,2e-05,2.1e-05,3.5e-05,2.9e-05,6e-05,2e-05,3.9e-05,1.5e-05,2.4e-05,1.8e-05,3.1e-05,1.6e-05,1.3e-05,1.1e-05,1.3e-05,5.7e-05,4.6e-05,9e-06,1.2e-05,7e-06,2.6e-05,2.4e-05,7e-06,5e-06,6e-06,1.3e-05,1.3e-05,4e-06,2.3e-05,9e-06,2e-05,5e-06,6.7e-05,5.7e-05,3.6e-05,1.5e-05,3.6e-05,1.7e-05,1.8e-05,2.5e-05,2.1e-05,1.2e-05,8e-06,1.3e-05,6e-06,2.5e-05,3.3e-05,2.1e-05,2.6e-05,5e-05,8e-05,7e-06,6.4e-05,3.8e-05,1.3e-05,2.9e-05,1.2e-05,1.7e-05,3e-05,1.2e-05,1.6e-05,3.5e-05,2.2e-05,3.7e-05,1.7e-05,9e-06,4.2e-05
3.8e-05,2.1e-05,2.4e-05,8e-06,1.2e-05,7e-06,3e-06,1.1e-05,1e-05,1.9e-05,1.6e-05,8e-06,1.1e-05,1.4e-05,1.1e-05,1.1e-05,6e-06,1e-05,8e-06,1.4e-05,1.4e-05,9e-06,3e-06,1.2e-05,6e-06,2.1e-05,6e-06,3e-06,2.2e-05,2.5e-05,1.6e-05,1.1e-05,9e-06,1.7e-05,1.1e-05,2e-06,2e-06,5e-06,1.9e-05,2.3e-05,2.8e-05,6e-06,5e-06,1.5e-05,1.8e-05,4e-05,2.5e-05,1.8e-05,1.6e-05,8e-06,8e-06,2.8e-05,1.5e-05,2.5e-05,2e-05,2.7e-05,1.9e-05,2.9e-05,5.3e-05,2.3e-05,3e-05,6e-06,3e-05,1e-05,2.1e-05,6e-06,1.3e-05,5e-06,1.7e-05,3.8e-05,4.6e-05,9e-06,2.8e-05,6e-06,1.3e-05,1.6e-05,1e-06,7e-06,1.2e-05,4e-06,1.9e-05,1.5e-05,1.5e-05,3.1e-05,1.5e-05,1.3e-05,7.5e-05,3e-05,1.6e-05,1.7e-05,3.4e-05,2.9e-05,1.4e-05,1.6e-05,1.1e-05,1e-05,7e-06,1.2e-05,6e-06,3.8e-05,2.6e-05,2.4e-05,2.1e-05,5.8e-05,7.8e-05,1.3e-05,5e-05,2.6e-05,1.9e-05,2.9e-05,1.9e-05,3e-06,9e-06,2.6e-05,2.8e-05,3.6e-05,8e-06,3e-05,2.5e-05,1.6e-05,3.2e-05
1.9e-05,4.5e-05,5.4e-05,4.8e-05,2.9e-05,1.1e-05,4e-06,7e-06,5e-06,1.3e-05,5e-06,8e-06,8e-06,6e-06,1.3e-05,8e-06,1.5e-05,1.1e-05,1e-06,5e-06,1.3e-05,6e-06,1.2e-05,2.5e-05,1e-05,2.3e-05,4e-06,5e-06,3.6e-05,4e-06,1.9e-05,6e-06,2e-06,1.7e-05,9e-06,6e-06,3e-06,1e-05,1.1e-05,2.3e-05,3.4e-05,9e-06,6e-06,6e-06,2e-05,3.3e-05,3e-05,2.3e-05,1.8e-05,1.1e-05,7e-06,2.1e-05,3e-06,1.6e-05,4.3e-05,3.7e-05,1.4e-05,1.8e-05,5.3e-05,1.3e-05,1.7e-05,5e-06,2.3e-05,1.1e-05,2.6e-05,1.1e-05,2.3e-05,1.1e-05,1.3e-05,5.7e-05,3.6e-05,1.5e-05,3.3e-05,8e-06,1.2e-05,3.6e-05,9e-06,1.9e-05,1.6e-05,1e-05,4.3e-05,8e-06,5e-06,2.6e-05,4e-06,1.6e-05,6e-05,3.5e-05,2.1e-05,1.8e-05,4.1e-05,1.2e-05,1.8e-05,1e-05,2.7e-05,1.8e-05,1e-05,8e-06,3e-06,2.1e-05,2.6e-05,2.1e-05,1.4e-05,6e-05,8.8e-05,1.5e-05,4.9e-05,3.1e-05,1.3e-05,2.5e-05,1.4e-05,1.9e-05,2.2e-05,1.1e-05,2.5e-05,3.4e-05,1.9e-05,4.6e-05,1.7e-05,1.3e-05,2.7e-05
1.2e-05,2.8e-05,2.1e-05,2.3e-05,1.6e-05,9e-06,3e-06,5e-06,1.1e-05,1e-05,5e-06,9e-06,1.4e-05,5e-06,1.3e-05,1.1e-05,1.9e-05,7e-06,1e-06,4e-06,1.3e-05,4e-06,5e-06,2.5e-05,8e-06,1.3e-05,6e-06,4e-06,3.3e-05,5e-06,1e-05,2e-06,3e-06,1.9e-05,1.7e-05,5e-06,1e-06,9e-06,1.5e-05,2.4e-05,2.3e-05,2e-06,5e-06,1e-06,2e-05,3.7e-05,3.4e-05,2.7e-05,2e-05,8e-06,1.2e-05,2.6e-05,7e-06,7e-06,2.6e-05,3.2e-05,2.2e-05,2.6e-05,5.2e-05,2e-05,3e-05,2e-05,3.8e-05,9e-06,2.6e-05,1e-05,1.2e-05,3e-06,1.4e-05,4.1e-05,2.7e-05,1.3e-05,3.1e-05,8e-06,1.2e-05,2.4e-05,2.4e-05,4e-06,1.1e-05,1.5e-05,3.4e-05,9e-06,5e-06,1.6e-05,1.6e-05,5e-06,6.4e-05,2.7e-05,1.7e-05,9e-06,3.7e-05,1.2e-05,1.6e-05,2.5e-05,1.5e-05,9e-06,1.6e-05,1.3e-05,1.8e-05,1.8e-05,2.4e-05,2.3e-05,1.4e-05,4.9e-05,7.2e-05,2e-05,2.6e-05,1.5e-05,1.2e-05,2.1e-05,1.8e-05,1.3e-05,1.8e-05,8e-06,3.5e-05,2.6e-05,2.1e-05,3.9e-05,5e-06,5e-06,3.3e-05
4e-06,1.6e-05,1.2e-05,1.2e-05,3e-06,3e-06,3e-06,4e-06,4e-06,3e-06,4e-06,3e-06,6e-06,0,8e-06,6e-06,1.4e-05,7e-06,2e-06,6e-06,1.4e-05,4e-06,4e-06,2e-05,7e-06,1.7e-05,7e-06,8e-06,3.3e-05,5e-06,8e-06,6e-06,4e-06,2e-05,1e-05,3e-06,2e-06,5e-06,1.8e-05,1.4e-05,3.1e-05,5e-06,3e-06,4e-06,2e-05,2.8e-05,2.4e-05,2.2e-05,1.2e-05,3e-06,9e-06,2.4e-05,1e-05,2e-06,3.1e-05,2.7e-05,1.9e-05,2e-05,4.8e-05,1.9e-05,3.1e-05,1.5e-05,3e-05,1.3e-05,3.2e-05,9e-06,1.3e-05,5e-06,1.2e-05,5e-05,4e-05,1.2e-05,2.7e-05,9e-06,1.9e-05,2.5e-05,1.8e-05,1.3e-05,1e-05,1.2e-05,3.2e-05,3e-06,1.4e-05,1.4e-05,6e-06,3e-06,6e-05,2.5e-05,2.2e-05,7e-06,4.6e-05,9e-06,7e-06,2.5e-05,2e-05,8e-06,8e-06,1.8e-05,1.2e-05,2.1e-05,2e-05,2.3e-05,1.3e-05,5.5e-05,7.6e-05,2.7e-05,3.9e-05,1.8e-05,1.5e-05,1.5e-05,1e-05,7e-06,2.3e-05,5e-06,2.3e-05,2.3e-05,1.5e-05,3.6e-05,9e-06,3e-06,4e-05
1e-06,8e-06,1e-05,5e-06,1e-06,1e-06,3e-06,4e-06,5e-06,0,3e-06,1e-06,5e-06,0,5e-06,2e-06,1.3e-05,6e-06,1e-06,6e-06,1.5e-05,2e-06,4e-06,2.1e-05,7e-06,1.4e-05,8e-06,5e-06,3.6e-05,1e-05,1e-05,4e-06,5e-06,1.7e-05,1e-05,4e-06,2e-06,8e-06,1.4e-05,1.7e-05,2.4e-05,2e-06,2e-06,6e-06,1.9e-05,3.5e-05,2.2e-05,2e-05,7e-06,4e-06,8e-06,2.4e-05,9e-06,3e-06,2.7e-05,2.5e-05,1.6e-05,2.1e-05,4.9e-05,2e-05,3e-05,1.8e-05,3.4e-05,5e-06,3.2e-05,8e-06,1.3e-05,7e-06,1e-05,4.9e-05,3.9e-05,1e-05,2.7e-05,7e-06,1.8e-05,2.3e-05,1.7e-05,1.2e-05,1.8e-05,1.4e-05,2.8e-05,4e-06,8e-06,1.6e-05,8e-06,5e-06,6.1e-05,2.7e-05,1.9e-05,7e-06,4.7e-05,7e-06,5e-06,2.3e-05,2.4e-05,5e-06,1e-05,1.3e-05,1.1e-05,2.1e-05,2.2e-05,1.9e-05,1e-05,4.8e-05,8e-05,1.8e-05,3.9e-05,1.7e-05,2.5e-05,2.2e-05,1.4e-05,1.2e-05,1.9e-05,6e-06,1.9e-05,2.3e-05,1.5e-05,2.6e-05,5e-06,2e-06,4.3e-05
2e-06,5e-06,8e-06,4e-06,1e-06,2e-06,2e-06,3e-06,4e-06,1e-06,2e-06,0,5e-06,0,3e-06,2e-06,1.2e-05,5e-06,1e-06,7e-06,1.5e-05,2e-06,3e-06,2.1e-05,5e-06,1.6e-05,5e-06,8e-06,3.4e-05,8e-06,1.1e-05,6e-06,4e-06,1.7e-05,1.2e-05,3e-06,1e-06,9e-06,1.4e-05,1.8e-05,2.3e-05,2e-06,4e-06,5e-06,1.5e-05,3.2e-05,2.3e-05,2.1e-05,1e-05,1e-06,8e-06,2.4e-05,1e-05,5e-06,2.7e-05,2.6e-05,1.6e-05,2.4e-05,4.8e-05,1.7e-05,2.4e-05,1.6e-05,3.1e-05,1.1e-05,2.9e-05,1e-05,1.3e-05,5e-06,1e-05,4.8e-05,3.8e-05,1e-05,2.6e-05,4e-06,1.6e-05,2.3e-05,1.3e-05,9e-06,1.1e-05,1.2e-05,2.9e-05,3e-06,6e-06,1.7e-05,8e-06,2e-06,6.2e-05,2.7e-05,1.6e-05,7e-06,4.5e-05,6e-06,4e-06,2.6e-05,2.1e-05,8e-06,8e-06,1.5e-05,1.3e-05,2.3e-05,2.1e-05,2.2e-05,1.1e-05,4.4e-05,7.9e-05,1.5e-05,3.8e-05,2.2e-05,1.7e-05,2.4e-05,7e-06,1.1e-05,1.6e-05,4e-06,2e-05,2.2e-05,1.2e-05,2.7e-05,3e-06,3e-06,4.2e-05
