-0.008192,-0.005597,-0.00466,-0.005648,-0.004619,-0.005204,-0.006766,-0.007487,-0.008723,-0.007028,-0.005449,-0.004015,-0.004079,-0.00389,-0.005269,-0.005419,-0.00607,-0.006515,-0.004195,-0.003873,-0.003312,-0.003366,-0.004266,-0.005997,-0.006376,-0.004924,-0.006168,-0.006474
-0.007777,-0.00444,-0.001714,-0.002995,-0.005117,-0.004458,-0.005923,-0.007602,-0.001779,-0.003768,-0.005478,-0.003657,-0.003954,-0.003398,-0.00524,-0.005493,-0.008541,-0.008343,-0.002377,-0.001792,-0.002816,-0.003663,-0.004656,-0.00641,-0.002925,-0.00175,-0.004268,-0.006229
-0.000365,-0.000965,-0.001171,-0.000863,-0.00293,-0.003107,-0.00206,-0.002088,-0.001705,-0.001424,-0.00148,-0.001899,-0.002734,-0.00208,-0.002053,-0.002123,-0.003177,-0.002079,-0.000569,-0.001449,-0.002527,-0.00258,-0.002997,-0.005519,-0.003096,-0.002057,-0.00194,-0.002705
0.003891,0.001373,-0.000196,0.00057,0.000123,0.000425,0.003334,0.004678,-0.000133,0.001698,0.003156,0.001048,0.000283,4e-04,0.001897,0.00234,0.004219,0.005503,0.001443,-5.2e-05,-0.000629,-0.000345,-0.000378,-0.00221,-0.001896,-0.002034,0.001068,0.002604
0.001412,0.001422,0.002217,0.001878,0.002152,0.004147,0.00579,0.006776,0.006942,0.00526,0.004301,0.003425,0.003727,0.003217,0.003656,0.004144,0.006222,0.006482,0.002977,0.002614,0.002224,0.001741,0.001927,0.002881,0.003946,0.002392,0.004511,0.005964
-0.003987,-0.002177,-0.001703,-0.002324,-0.000396,-0.00028,-0.001875,-0.001396,-0.001552,-0.002084,-0.001562,5.7e-05,0.000972,0.000306,-0.001064,-0.001331,5.5e-05,-0.001188,-0.001338,-0.001186,-4.6e-05,-0.000103,-0.000448,-0.00028,-0.000463,-0.000144,-0.000571,-0.000551
-0.001544,-0.000937,-0.00206,-0.0021,-0.000652,-0.002402,-0.005914,-0.006778,-0.007329,-0.006134,-0.004616,-0.002384,-0.00168,-0.002174,-0.003251,-0.004136,-0.004928,-0.006604,-0.00352,-0.002804,-0.00098,-0.000438,-0.001091,-0.001523,-0.003859,-0.002361,-0.004292,-0.005673
0.006069,0.004724,0.00406,0.00452,0.0033,0.002875,0.001088,-0.000744,0.004656,0.002986,0.000487,0.000236,0.000476,0.000877,0.0016,0.000992,-0.002064,-0.00239,0.001217,0.002529,0.002471,0.002529,0.002932,0.005983,0.004652,0.00375,0.001611,-0.000536
0.004263,0.002584,0.002111,0.002586,0.002581,0.002615,0.004408,0.004228,0.005194,0.005238,0.003756,0.000775,5e-05,0.001405,0.00303,0.003481,0.002659,0.004,0.002564,0.002768,0.001879,0.001928,0.002828,0.00616,0.005241,0.00338,0.003397,0.003189
-0.003696,-0.00334,-0.002876,-0.003271,-0.001335,-0.001438,0.00154,0.002824,-0.003774,-0.000853,0.001747,-0.000197,-0.001384,-0.000545,0.000309,0.001348,0.003607,0.005012,-0.000161,-0.000531,-0.000772,-0.000726,-0.000538,-0.00071,-0.002103,-0.002489,-0.000203,0.002442
-0.004512,-0.002764,-0.000812,-0.001379,-0.00225,-0.001767,-0.000918,-5.9e-05,-0.000618,-0.001701,-0.001085,0.000885,0.000931,0.000436,-0.000531,-0.000353,0.000905,0.000807,-0.000478,-6.3e-05,-0.000628,-0.001085,-0.000813,-0.002364,-0.001292,-0.00055,8.2e-05,0.001892
-0.000488,-8.2e-05,-9.2e-05,0.00049,-0.002767,-0.003292,-0.004699,-0.004457,-0.000806,-0.003144,-0.004002,-0.000185,0.001046,-2.7e-05,-0.002157,-0.003046,-0.003487,-0.004873,-0.001268,-0.001444,-0.001791,-0.001719,-0.001579,-0.004217,-0.001457,0.000351,-0.001554,-0.002369
0.001079,0.000514,-0.001664,-0.001137,-0.002561,-0.003031,-0.004582,-0.005244,-0.005157,-0.004119,-0.003453,-0.002049,-0.001358,-0.002152,-0.002989,-0.003617,-0.004806,-0.005594,-0.001804,-0.00295,-0.002599,-0.002139,-0.003192,-0.006227,-0.005179,-0.003956,-0.004358,-0.005573
0.000325,0.000675,0.000178,-0.000532,0.000864,0.003062,0.003057,0.002202,0.003517,0.003633,0.002378,-0.000259,-0.000597,-0.000455,0.000962,0.00127,-0.000496,0.000586,0.001539,0.000737,0.000363,-5.8e-05,-0.000855,-0.000123,6.2e-05,-0.001515,0.000697,-1e-05
-0.00125,-0.000652,0.000387,-0.000512,0.002734,0.004618,0.00592,0.006848,0.006762,0.006154,0.004896,0.001121,0.000368,0.001338,0.003073,0.003885,0.004081,0.005652,0.002315,0.001892,0.001935,0.001484,0.001791,0.004385,0.004475,0.00297,0.004659,0.004432
-0.000111,-0.000555,1.6e-05,-0.000225,0.001905,0.000529,0.000966,0.002304,-0.002689,-0.00121,0.00109,0.000415,4e-06,0.000427,0.000924,0.001539,0.003931,0.003724,-0.000971,-0.000422,0.001393,0.001717,0.001872,0.001793,0.000385,0.001551,9e-04,0.001856
0.004208,0.002841,0.003084,0.003711,0.001775,-0.000617,-0.002198,-0.002972,-0.00229,-0.002687,-0.00214,0.000617,0.001351,0.000715,1e-06,-0.000371,0.000408,-0.001422,-0.001195,0.000683,0.001624,0.001734,0.001952,0.001938,0.000519,0.001461,-0.001065,-0.000462
0.003566,0.002518,0.00208,0.003298,0.000636,-0.000955,-0.002552,-0.00443,0.001115,-0.000292,-0.002333,0.000159,0.001074,0.00045,-0.000874,-0.001972,-0.002952,-0.004213,0.000288,0.001104,8.9e-05,1.2e-05,0.000305,0.002326,0.002389,0.001355,-9e-04,-0.002017
-0.002747,-0.002031,-0.002759,-0.002231,-0.001412,-0.001483,-0.001013,-0.002108,-0.002944,-0.001031,-0.000409,-0.000693,-0.001507,-0.001625,-0.002057,-0.002461,-0.003156,-0.002403,0.000124,-0.000951,-0.002061,-0.001739,-0.002315,-0.001401,-0.001503,-0.002833,-0.002126,-0.002748
