-0.000407,-0.000188,-0.000394,-0.000146,-0.000118,-1e-05,-0.000114,-0.000268,0.000209,0.000159,-0.00011,0.000189,-0.000317,6.6e-05,-0.000138,0.00014,0.000204,0.000114,0.000594,7.9e-05,6.8e-05,9.6e-05,-7.8e-05,0.000293,-6e-05,-0.000467,-0.000275,-0.000262,-0.000431,-0.000536,-0.000264,-0.000278,-0.000165,-0.000298,-0.000269,-0.00027,-0.000872,-0.000763,-0.000173,-0.000121,-0.000515,-0.000484,-0.00048,-0.000438,-0.000233,-0.000251,-0.000118,4.9e-05,-7.7e-05,-5.8e-05,-0.000138,0.000245,0.000296,-0.000128,-0.000215,0.000484,0.000467,0.00044,0.000169,-0.00025,0.000132,4.8e-05,0.000362,0.000326,0.000388,0.000136,3.4e-05,0.000207,8.3e-05,-8e-06,-1.1e-05,-6e-06,0.000135,3.4e-05,0.000299,0.000567,0.000379,0.000132,7.2e-05,0.000332,9.7e-05,0.000191,0.000486,0.000283,0.000338,0.000265,0.000289,0.000416,0.000124,7.3e-05,-6e-05,0.000456,0.000591,0.000225,9.9e-05,0.000321,0.000128,-9e-05,0.000401,0.000392,0.000445,4.6e-05,3.3e-05,0.000505,0.000521,0.000497,0.000482,0.000214,0.000328,0.000719,0.00047,0.000246,0.000285,0.000582,0.000351,0.000128,-4.5e-05,-4.1e-05,0.000256,0.000297,0.000441
0.00021,-5e-05,0.000137,0.000164,-0.00035,-5.6e-05,-4.9e-05,0.000187,-0.000243,-0.000473,-0.000341,-0.000147,-0.00017,-0.000235,-0.00019,-0.000286,-0.000598,-0.001465,-0.001425,-0.001024,-0.000676,-0.000606,-0.001077,-0.00135,-0.000797,-0.000414,4.3e-05,0.000121,-0.000175,-5.7e-05,-0.000226,-0.000233,-7.3e-05,9.8e-05,3.7e-05,3.4e-05,0.000372,1e-05,-0.000226,-6e-05,0.000216,0.000137,0.000145,7.3e-05,-0.000121,2.1e-05,0.000116,0.000119,7.2e-05,0.000216,-0.00028,-0.00023,1.7e-05,-4.5e-05,-0.000302,-0.000115,-0.00013,-0.00019,-0.000612,-0.00061,-0.000633,-0.00044,-0.000133,-2.1e-05,-0.000248,-0.000453,-5.9e-05,-0.000255,-0.000585,-0.000467,-0.000248,-9.6e-05,7.3e-05,-0.000234,-0.000392,-0.000579,-0.000424,-0.000456,-0.000679,-0.000383,-0.00014,-0.000356,3.9e-05,-0.000263,-0.000241,-0.000271,-0.000232,-8.7e-05,-0.000219,-0.000568,-0.000595,-0.000642,-0.000779,-0.000972,-0.000618,-0.000602,-0.000627,-0.000627,-0.000294,-0.000238,-0.000152,-0.000662,-0.000968,-0.001175,-0.001037,-0.00086,-0.000614,-0.000456,-0.000277,-0.000326,-0.000372,-0.000686,-0.001036,-0.001017,-0.001041,-0.000524,-0.000577,-0.000807,-0.000595,-0.000505,-0.000389
-0.000161,-0.000186,-0.000434,-0.000334,-0.000161,-0.000236,-0.000158,-4.3e-05,-0.000614,-0.000449,-0.000272,-3e-04,-6.8e-05,-0.000118,-7.6e-05,0.000258,0.000423,0.000775,0.00042,0.000177,-0.000199,0.000178,0.000538,-0.000187,-0.000123,0.000154,9.9e-05,-0.000156,0.000252,-4.8e-05,-0.000485,-0.000349,-0.000352,-6.7e-05,-0.000181,8.1e-05,-0.000602,-5.4e-05,-0.000438,-0.000254,-0.000166,-0.000215,-0.000334,-0.000282,-0.000224,-4.1e-05,-8e-05,2.8e-05,-0.000593,-0.000413,-8.5e-05,4e-06,-0.000368,-8.3e-05,0.000305,-9.8e-05,-0.000354,-0.000135,3.7e-05,0.000248,0.000455,0.00023,-2e-04,-0.000346,9.6e-05,0.000209,0.000131,-3.2e-05,0.000229,0.000136,-2.1e-05,8.8e-05,-0.000146,-9e-05,-0.00044,-0.000475,-0.000176,-0.000165,0.000219,3.5e-05,-9.2e-05,-0.000255,-9.9e-05,-6e-06,-0.000167,-0.000403,-0.000229,-8.2e-05,-2.8e-05,0.000224,0.000376,0.000132,-0.000181,6e-05,0.000112,0.000485,0.000374,0.000255,0.000315,0.000154,-0.00016,-0.000207,-1.8e-05,0.000166,3.7e-05,-0.000113,7e-06,-0.000106,-6.6e-05,9e-06,-0.00033,2.3e-05,9.9e-05,0.000222,0.000461,0.000684,0.000449,0.000423,0.000229,-1.5e-05,-0.000125
0.000122,-0.00012,3e-04,-6.4e-05,0.000189,4e-05,0.000272,-4.4e-05,7.7e-05,-9e-06,7e-06,-8.1e-05,-2.9e-05,-0.000155,-0.000214,5.4e-05,7e-05,0.000178,0.000154,0.000682,0.000508,0.000261,8e-05,0.000351,0.000138,0.000115,5.1e-05,-2.9e-05,-0.000389,0.000151,0.000271,0.000116,-5e-05,-0.000295,0.000209,0.000233,6e-04,0.000339,0.000121,5.9e-05,-0.000245,0.000186,-1.8e-05,0.000142,0.00024,-1.5e-05,-0.000127,8.4e-05,-5.4e-05,-7.9e-05,-3.7e-05,-0.000108,-0.000124,-0.000231,-0.000281,-0.000565,-0.00045,-0.000596,-0.000342,-6.9e-05,-0.000232,1e-06,-0.000403,-0.000511,-0.000226,-0.00042,-0.000191,-0.000372,-0.000202,-0.000137,-9.6e-05,-5.3e-05,-7.3e-05,-0.00041,-3.7e-05,-0.000132,-0.000352,-0.000101,5.6e-05,-8.8e-05,-2.7e-05,6.2e-05,-0.000334,-7e-05,-4.9e-05,-1.2e-05,-9.1e-05,-0.000289,-0.000534,-8.5e-05,-3.5e-05,-0.000232,-0.00043,-0.000354,-0.000244,-0.000189,-0.000402,-0.000429,-0.00038,-0.000419,-0.00039,0.000169,0.000217,-0.000196,-0.00047,-0.000308,-0.000252,-0.000402,1.4e-05,-0.000515,-0.00044,-0.000145,-0.000222,-0.00039,-0.000152,-0.000347,-0.000366,-8.1e-05,-9.6e-05,0.000106,-0.000202
-1.4e-05,-8e-05,-0.000219,-5.3e-05,-0.000102,-0.000138,-1e-04,-2e-06,-0.000229,-0.000168,8.5e-05,-6.3e-05,-0.000345,0.000261,-3.3e-05,-0.000622,-0.000357,-0.000434,-0.001014,-0.000702,-0.000401,-0.000299,-0.000395,-0.000318,-0.000734,-0.000453,-0.000361,-0.000296,7.6e-05,-2e-06,-0.000187,-0.000442,-0.00031,-1.9e-05,-0.000277,-0.000164,-0.000259,-0.000329,-7.7e-05,6.1e-05,0.000131,-0.000165,-8.8e-05,-6e-05,-0.000131,-1.8e-05,-2.3e-05,-3e-05,-1.1e-05,0.000212,-1.2e-05,-0.000262,-8.3e-05,9e-05,3.6e-05,8e-05,0.000236,5.7e-05,-0.000222,-0.000143,-0.000383,-0.00025,4.1e-05,-0.000141,0.000151,2.5e-05,7.4e-05,5.9e-05,0.000169,-0.000156,-7.5e-05,-6.4e-05,-5.5e-05,9.1e-05,6.9e-05,4.1e-05,4.8e-05,0.000131,-7.1e-05,-0.000383,-0.000325,-4.3e-05,-0.000129,-7.1e-05,-2.8e-05,0.000179,2.6e-05,-0.000198,4.1e-05,-3.3e-05,-0.000145,-7.9e-05,-3.7e-05,0.000104,-3.5e-05,-0.000312,-0.000227,-0.000108,-0.000264,-0.000231,-0.000233,-7e-05,-0.000211,-5.3e-05,-0.000424,-0.000273,-0.000296,-0.000247,3.9e-05,-8.1e-05,0.00012,3.1e-05,3.1e-05,-0.000294,-0.000458,-0.00016,-0.000187,-9.7e-05,-0.000367,-0.000153,-4.5e-05
-0.000392,-0.000145,-0.000319,-0.000312,-0.000343,-0.000164,2.3e-05,-0.000165,-2e-05,0.000158,1.5e-05,-0.000122,-0.000142,-0.000152,-0.000141,-2.9e-05,-1.1e-05,-0.000255,0.000399,-0.000133,-4.7e-05,-0.000149,4.9e-05,6.5e-05,0.000515,0.000365,0.000197,0.000128,0.000116,-0.000105,0.00021,0.000399,0.000348,0.000144,0.000166,7.6e-05,9.6e-05,6.9e-05,1.4e-05,-1.3e-05,2.7e-05,0.000193,0.000248,4.7e-05,0,4.8e-05,6.3e-05,6.3e-05,-3.9e-05,0.00012,8.4e-05,6.8e-05,0.000213,0.000244,0.000146,0.000212,0.000414,0.00048,0.000361,0.000265,0.000377,0.000329,0.000155,0.000222,0.000209,0.000188,-3.7e-05,2.3e-05,0.000173,0.000242,0.000103,0.000113,0.000113,0.000153,0.000155,0.000268,0.00045,0.000329,0.000261,0.000306,0.00034,0.000126,0.000122,-1.7e-05,0.000136,0.000107,0.000168,0.000149,0.000126,0.000153,0.000195,0.000353,0.000476,0.000508,0.000622,0.000484,0.000548,0.000553,0.000532,0.000518,0.000577,0.000284,0.000491,0.000553,0.000725,0.000621,0.000548,0.000425,-0.000156,6.3e-05,0.000312,9.5e-05,0.000356,0.00046,0.000496,0.000411,0.000271,0.000303,0.000464,0.000389,0.000222
7.9e-05,0.000272,0.00013,0.000305,9.2e-05,0.000134,0.000103,6.3e-05,7.9e-05,0.000406,0.000179,0.000118,0.000319,0.000125,0.000169,4.2e-05,3e-05,0.000375,0.000401,0.000348,0.000161,0.000131,0.000142,0.000515,0.000512,0.000162,0.000176,6e-06,0.000108,0.000193,7.2e-05,4.1e-05,9.8e-05,0.000171,6e-05,-3.1e-05,-8.6e-05,0.000131,0.000108,-7e-06,-4.1e-05,-0.000104,-0.000217,6.7e-05,9.6e-05,6e-06,-6.7e-05,-0.000149,-2.2e-05,-7.8e-05,-7.3e-05,2.7e-05,8e-05,0.000181,8e-06,-0.000168,-3.9e-05,-1.5e-05,-6.6e-05,-0.000215,-1e-04,-0.000148,-0.000268,1e-04,-6.7e-05,-0.00017,-0.000248,6.4e-05,-0.000101,4.4e-05,0.000186,4.7e-05,-4.2e-05,1.2e-05,2.9e-05,6e-05,4.5e-05,-0.000187,-9.9e-05,2.8e-05,0.000195,0.000128,7.3e-05,-0.000114,-3.4e-05,5.9e-05,5.2e-05,9.3e-05,0.000118,-6.5e-05,-0.000156,-0.00022,-0.000116,-7.1e-05,-0.000321,-0.000122,-0.00015,-0.000192,-0.000133,8.1e-05,-4.4e-05,-2.8e-05,-0.000325,-0.000263,3.6e-05,8.6e-05,0.000225,0.000121,-7.1e-05,3.7e-05,7e-05,-9.1e-05,-0.000238,8.4e-05,0.000283,-0.000119,-0.000123,-0.000123,-6.5e-05,-7.1e-05,-0.00012
-9e-06,-0.000182,2e-06,-0.000167,-2.5e-05,-3.2e-05,-0.000181,-5.4e-05,6e-05,-3.7e-05,-0.000114,1e-05,-9e-06,-1.3e-05,-4.1e-05,0.000122,-0.000209,-0.000266,-0.000208,-0.000107,6.1e-05,0.000262,-0.000132,-0.000237,-0.000164,-9.7e-05,-0.00016,8.7e-05,-0.000149,-0.000237,-0.000165,7e-06,3.1e-05,-0.000112,9.5e-05,2.3e-05,3.8e-05,-1.7e-05,0.000158,6e-05,-0.000124,-0.000136,0.000112,0.000113,3.1e-05,-0.000134,2.8e-05,-9e-06,8.6e-05,-0.000168,-2.9e-05,7.8e-05,1e-04,-0.000128,-8.4e-05,1.2e-05,-8e-06,-0.000178,-7.2e-05,-0.000279,-4.4e-05,-0.000313,8.6e-05,0.000325,-2e-05,-3.4e-05,-2.3e-05,5.7e-05,-8e-06,-1.8e-05,-0.000164,-0.000134,2e-06,-6.6e-05,-1.6e-05,-0.000121,-0.000108,-2.8e-05,-0.000121,-0.000161,-0.000136,3.8e-05,3.4e-05,3.4e-05,-6.8e-05,-2.3e-05,-0.000137,4.6e-05,0.000123,5.7e-05,-0.00012,4e-06,-1.2e-05,-0.000104,-0.000131,-9.8e-05,2.1e-05,4.6e-05,4.2e-05,-0.000106,-0.000105,-0.00016,-0.000158,-5.7e-05,-1.4e-05,-0.000134,-7.7e-05,-0.000182,0.000145,-6.7e-05,0.000129,1e-05,-2.9e-05,-0.000146,-0.000181,-0.00027,-1.4e-05,-8e-05,-8.4e-05,-0.000247,-0.000231
0.000128,4.4e-05,7.9e-05,-5e-06,3.9e-05,4.3e-05,-1.2e-05,6.9e-05,-3.1e-05,-4.2e-05,2.6e-05,9.4e-05,1.6e-05,-0.000104,8.2e-05,-4e-06,0.000128,9.9e-05,1.1e-05,-1.3e-05,-0.000391,-0.000122,-9.3e-05,-9.3e-05,-0.00016,-0.000265,-2e-05,-5.1e-05,-7e-06,1e-04,3.8e-05,-0.000122,-3.9e-05,9.9e-05,1.4e-05,-9.9e-05,-0.000159,-0.000114,-0.000327,-0.000106,0.000145,0.000102,-6.1e-05,2.4e-05,5e-06,2.7e-05,-4.6e-05,-1.8e-05,3e-06,-3.8e-05,-6.8e-05,6.7e-05,-7e-05,-5.3e-05,-4.7e-05,-5.7e-05,-0.000157,-0.000169,-2.6e-05,0.000204,1.7e-05,9.7e-05,-6e-06,-0.000124,-0.000237,-1.5e-05,8.7e-05,1.7e-05,-4.1e-05,-6e-05,-4.3e-05,-3.6e-05,4.7e-05,3.5e-05,-0.000132,-5.4e-05,-8.2e-05,-6.9e-05,-1.2e-05,-1e-05,-4.4e-05,-0.000155,-9.6e-05,-5e-06,9.5e-05,-2.1e-05,-8.7e-05,-3e-06,-5.2e-05,-2.2e-05,0.000103,9e-05,4.3e-05,-6.9e-05,0,-2.4e-05,0.000112,4.6e-05,-5.2e-05,6.4e-05,1.2e-05,2.9e-05,4.3e-05,5.5e-05,-3.4e-05,9.3e-05,4.7e-05,-3.8e-05,7.3e-05,-4.1e-05,-4.6e-05,-0.000188,6.3e-05,-4e-06,3e-05,0.00014,0.000143,7.5e-05,5.1e-05,-1.1e-05,5.3e-05
-2.3e-05,0.000144,7.5e-05,0.000118,9.7e-05,3e-05,7e-06,-6.5e-05,2.8e-05,-0.000102,-7.8e-05,-0.000132,-0.000105,-0.000163,-2.5e-05,5.3e-05,0.000184,5.4e-05,0.000147,0.000283,0.000105,-3.4e-05,2.4e-05,4.7e-05,4.8e-05,0.00015,7.1e-05,-5.9e-05,-0.00012,-2.4e-05,5e-06,6.9e-05,2.7e-05,-0.000129,-6.1e-05,0.000134,5.5e-05,4.9e-05,0.000352,0.000103,1.9e-05,-2.6e-05,0.000148,-7.4e-05,2.4e-05,6.1e-05,2.9e-05,3.2e-05,3e-05,-1.9e-05,9.1e-05,-1.8e-05,-0.000117,-5.9e-05,5e-05,1.2e-05,8e-06,4.3e-05,3e-06,3.6e-05,3.2e-05,-1.7e-05,-6e-05,-6.6e-05,-7.6e-05,1.5e-05,4.2e-05,8e-06,-2.9e-05,-3.9e-05,6.3e-05,4.1e-05,1e-06,-5e-06,-3.5e-05,5.2e-05,0,-3.3e-05,4e-05,-2e-05,8e-06,5.9e-05,-9.4e-05,-1.3e-05,2e-06,2.5e-05,1.4e-05,-5.8e-05,-7.1e-05,-1.6e-05,1e-05,-2e-06,-6.2e-05,-0.000129,-2e-05,-6.1e-05,-0.000115,-0.000161,-0.000126,-1e-04,-9.2e-05,-5e-06,0.000177,-3e-05,-1.5e-05,-0.000218,-0.000144,-3.4e-05,0.000171,0.000116,-4e-06,0.00018,7.1e-05,-0.000144,-0.000156,1e-06,-8.7e-05,-8.2e-05,-3.3e-05,-7e-06,4.3e-05
6.7e-05,1e-05,-3.8e-05,0.000102,1.7e-05,1.5e-05,1.2e-05,-2.9e-05,5.4e-05,-1.7e-05,-1.9e-05,-0.000141,1.2e-05,3.7e-05,-0.000144,-1.6e-05,-4e-06,4.1e-05,8.9e-05,-0.000134,0.000133,7.2e-05,3.3e-05,-1.8e-05,5.1e-05,-0.000108,-4.3e-05,2.2e-05,6.7e-05,2e-06,7e-05,-5.8e-05,-0.000115,-2.3e-05,-8.9e-05,-9.6e-05,-8e-06,-2e-05,-0.000194,-3.5e-05,8.4e-05,4.9e-05,-0.000125,-7.3e-05,-4.4e-05,-3.8e-05,3e-05,9.1e-05,-6e-06,-1.2e-05,-3.6e-05,-9.2e-05,5.3e-05,5.7e-05,4e-05,5.4e-05,-3.4e-05,0.000151,2.6e-05,4.4e-05,2.8e-05,3.3e-05,7.2e-05,4e-06,0.00013,1e-06,4.8e-05,8.9e-05,-1.8e-05,6.6e-05,-9e-05,-6e-06,1.4e-05,-1e-06,4.3e-05,-1e-06,-8e-06,5.1e-05,8.5e-05,2.2e-05,-7.1e-05,-1.8e-05,8e-06,3.8e-05,-5.4e-05,-1.9e-05,5.7e-05,-1.6e-05,1.9e-05,1.3e-05,4e-06,8e-06,2.9e-05,5e-05,8.5e-05,9e-05,-5e-06,4.6e-05,6.1e-05,2.5e-05,2.4e-05,-2.7e-05,3.5e-05,7.3e-05,7e-05,-0.000101,-5.5e-05,-9.5e-05,1.8e-05,6.3e-05,-1.8e-05,6.6e-05,6.4e-05,7.1e-05,-5.3e-05,5e-06,3.4e-05,-4e-06,1.7e-05,-1.3e-05,-2.3e-05
-3.9e-05,-6.8e-05,-3.7e-05,-1e-05,1.1e-05,2.1e-05,-6.8e-05,6e-06,-5.9e-05,-3.9e-05,3.5e-05,5e-05,1.6e-05,4.3e-05,0.000153,-2.2e-05,2.3e-05,-2.3e-05,-0.00012,-4.8e-05,7e-06,2.2e-05,1e-06,-4.2e-05,-7.5e-05,6e-06,6.5e-05,-8e-06,-5.8e-05,2.8e-05,-5.6e-05,4.4e-05,4.1e-05,1e-05,6e-06,-1e-06,-2e-06,2e-06,2.7e-05,1.4e-05,-7.3e-05,-2.6e-05,7.2e-05,8.7e-05,-9e-06,8e-06,-2e-05,7e-06,-2.9e-05,1.8e-05,4.4e-05,-7e-06,-4.2e-05,-4.2e-05,5.5e-05,-1.6e-05,-2.5e-05,-2.9e-05,-1.9e-05,1.1e-05,9.1e-05,8.2e-05,7.9e-05,5.3e-05,1.7e-05,3e-05,-1.3e-05,-9.5e-05,1.1e-05,5.5e-05,2e-05,-3e-06,5.1e-05,-2e-06,-3.9e-05,2.8e-05,1.4e-05,2.7e-05,2.7e-05,3.3e-05,0,-5e-06,8e-06,-7e-06,-9.1e-05,-2.2e-05,-3.6e-05,4.8e-05,-2.2e-05,-1.4e-05,-3.6e-05,3.6e-05,2.3e-05,3.8e-05,5.5e-05,0.000114,9.8e-05,5.8e-05,4e-05,5.9e-05,6.5e-05,6.4e-05,1.4e-05,3.4e-05,7.1e-05,0.000119,0.000103,8.1e-05,-0.000128,-0.00014,-2.6e-05,-8.6e-05,-4.2e-05,5e-06,5.7e-05,0.00012,9.9e-05,3.2e-05,4e-05,5.4e-05,0.000141
-4e-06,-6e-06,-1.1e-05,-4.5e-05,-7.4e-05,-2.5e-05,4.2e-05,3e-06,-5e-06,-2.8e-05,-2.4e-05,0.000124,2.6e-05,8e-06,0,-4e-05,-3.5e-05,4e-05,-2e-06,-6.5e-05,4e-05,-7.7e-05,-6e-05,3e-06,5.1e-05,4.7e-05,4e-06,6e-06,-2e-06,1.8e-05,2.7e-05,8e-06,2.1e-05,1e-05,3.5e-05,-3.7e-05,2e-06,1.5e-05,-5.5e-05,-8e-06,2.3e-05,3e-06,-5.3e-05,-8e-05,-4.6e-05,4.4e-05,9e-06,-4.8e-05,-8e-06,3.6e-05,-4.1e-05,1.3e-05,-7.8e-05,3.2e-05,7e-06,-1.5e-05,-3.2e-05,2.9e-05,-1e-06,-7.9e-05,-2.7e-05,3.3e-05,-3.6e-05,-5.3e-05,0.000101,4.7e-05,-3.8e-05,-1.8e-05,3e-06,5e-06,4.2e-05,2.2e-05,-6.2e-05,1e-06,3.2e-05,1.8e-05,-1.7e-05,-3.3e-05,-0.000115,-2.5e-05,-1.1e-05,1.5e-05,-4e-06,-4.3e-05,-6.5e-05,2e-06,7e-06,1.9e-05,-2.1e-05,-1.2e-05,-3.6e-05,-3.4e-05,-3.8e-05,-3e-05,-9e-06,-0.000124,-2.3e-05,-2.5e-05,-3e-05,-4.3e-05,1.9e-05,-2.6e-05,-1.8e-05,-7.8e-05,-2.4e-05,-1.7e-05,6e-06,2.9e-05,-7.5e-05,-1.8e-05,-5.4e-05,-4.3e-05,-1.8e-05,-4.8e-05,1e-05,1.5e-05,-3.7e-05,-5.4e-05,-1.1e-05,3.4e-05,-3.8e-05
0,1e-05,1.8e-05,-3.4e-05,6.7e-05,-1.4e-05,3.2e-05,4.2e-05,1.7e-05,-1e-06,5e-06,-1.9e-05,-3.4e-05,1.9e-05,-2e-05,-1.2e-05,-1.3e-05,-5.2e-05,6e-06,1.4e-05,-4.3e-05,0.00011,5.5e-05,-4.2e-05,-2.3e-05,-2e-06,5.2e-05,1.4e-05,4.8e-05,-2e-06,-4e-06,-3.7e-05,-3e-06,-1e-05,2.2e-05,-1.5e-05,9e-06,-1.8e-05,6.4e-05,-1e-05,-3.3e-05,2.1e-05,-1.6e-05,2.6e-05,-1.8e-05,1.7e-05,-5e-06,1.6e-05,6e-06,4.6e-05,4.1e-05,1.4e-05,7.4e-05,4.5e-05,-5e-06,-2.7e-05,4.5e-05,1.3e-05,1.2e-05,6e-06,-3.6e-05,-3.4e-05,-6e-06,-4e-05,2e-05,-1.1e-05,-1.1e-05,-2e-05,3.7e-05,-3e-05,-2.9e-05,-1.3e-05,-1.8e-05,3e-06,7e-06,-2e-05,1.3e-05,-2.7e-05,2e-06,-1.3e-05,-2.5e-05,9e-06,-2.1e-05,-4e-06,1.3e-05,-1.1e-05,1.3e-05,-2e-06,1.6e-05,8e-06,2e-05,-9e-06,1.1e-05,2.2e-05,-3.6e-05,-4.3e-05,-4.6e-05,1.3e-05,5e-06,2.8e-05,-4e-06,-5e-06,-3.4e-05,-4e-05,-1.3e-05,-7e-06,-9e-06,1.6e-05,6.1e-05,-1e-05,-3e-05,-3.3e-05,-7e-05,-3.6e-05,-2.3e-05,-6e-05,-3e-05,1.9e-05,-2e-06,-1.3e-05,-4.3e-05
1e-06,7e-06,9e-06,2.2e-05,-2.3e-05,2e-06,1e-05,-2e-06,0,-3e-06,1.7e-05,-1.5e-05,1e-06,1.4e-05,0,3.6e-05,-2.7e-05,-1.3e-05,-1.4e-05,2.9e-05,-3.9e-05,-2.1e-05,-1.6e-05,2.4e-05,1.7e-05,3.5e-05,-4.4e-05,-1.2e-05,3.4e-05,5e-05,-1.2e-05,2.7e-05,-1.7e-05,9e-06,1e-06,4.5e-05,-2.2e-05,7e-06,-5.4e-05,-4e-06,-3e-06,-1.2e-05,2.9e-05,-3.3e-05,1.4e-05,-2.9e-05,1.8e-05,-3.3e-05,2e-06,-4.3e-05,3e-06,-1e-05,8e-06,-1.2e-05,-2.7e-05,2.3e-05,-3.5e-05,-3.5e-05,-3e-06,-3.4e-05,1.3e-05,-4e-05,3.1e-05,-3.3e-05,-1.3e-05,-2.1e-05,2e-05,-1.7e-05,5e-06,-1e-06,2.2e-05,-1e-05,2e-06,-1e-06,3e-06,5e-06,9e-06,2.5e-05,-2.3e-05,-2.1e-05,8e-06,-1.8e-05,2e-05,1.8e-05,-1e-06,1e-05,2e-06,-2.1e-05,1.7e-05,4e-06,1.3e-05,1.3e-05,1.1e-05,2.4e-05,-3e-05,-4e-06,-2.3e-05,2.2e-05,1.4e-05,-1.1e-05,2.4e-05,1.3e-05,3.2e-05,1.5e-05,2.9e-05,-2.7e-05,1e-05,-3e-06,3e-06,2e-06,-3e-06,-3.2e-05,-2.5e-05,1.6e-05,-1.8e-05,-6.4e-05,1e-05,1.3e-05,0,-2.4e-05,1.1e-05
2.3e-05,-1.6e-05,-2e-06,1.2e-05,1.3e-05,-2e-06,6e-06,-9e-06,-6e-06,2.6e-05,-3e-06,5e-06,1.7e-05,-1e-06,-3e-06,4.5e-05,-7e-06,-1.4e-05,9e-06,-2.8e-05,-8e-06,-3.7e-05,1e-05,-2.4e-05,0,-1.2e-05,-2.2e-05,-8e-06,-3.5e-05,-3.3e-05,1.9e-05,-3.4e-05,-5e-06,1.4e-05,-1.8e-05,1.5e-05,1e-05,1e-06,-4e-06,2e-06,8e-06,-1e-06,-1.2e-05,5e-06,-2e-06,-6e-06,-2.1e-05,1e-05,3e-06,3e-05,-1.9e-05,-1e-05,-2e-06,-2.1e-05,-1e-06,-1e-06,-6e-06,-1.4e-05,-7e-06,3.2e-05,-6e-06,-1.9e-05,-2.5e-05,1.6e-05,-2.8e-05,-3e-06,2.2e-05,-7e-06,2e-05,6e-06,-2.4e-05,-1e-06,0,1e-06,5e-06,-7e-06,2e-06,-8e-06,2.6e-05,1.6e-05,-8e-06,1.7e-05,-6e-06,2e-06,1.6e-05,-9e-06,0,-3e-06,-2.1e-05,-3e-06,2.7e-05,7e-06,8e-06,1.1e-05,-2.2e-05,5.3e-05,1.6e-05,0,3e-06,-9e-06,-9e-06,-7e-06,-9e-06,1.2e-05,9e-06,3.6e-05,-1e-06,6e-06,5.2e-05,6e-06,-5e-06,3e-06,2.9e-05,2.7e-05,-7e-06,-5e-06,2e-05,3e-06,-1e-06,1e-06,-1e-06
-1.8e-05,-1.8e-05,-2.1e-05,-1.1e-05,-2.5e-05,0,-1.9e-05,-1.1e-05,-1e-06,5e-06,2e-05,-3.2e-05,2e-06,-4e-06,-2e-05,-5.1e-05,2.6e-05,1.1e-05,-4e-05,-9e-06,-4e-06,-1.1e-05,-1.6e-05,-2e-06,-3.6e-05,-1.1e-05,-1.6e-05,-9e-06,3e-06,9e-06,-1.6e-05,3.4e-05,1.9e-05,-1e-06,-1e-06,8e-06,-3e-06,-3e-06,-1e-06,-6e-06,1.3e-05,-5e-06,6e-06,1.1e-05,9e-06,-1e-06,4e-06,1.8e-05,1e-06,-2.7e-05,9e-06,-1.9e-05,-1e-06,1e-05,-3e-06,1e-05,4.2e-05,-1.4e-05,-8e-06,4e-06,3e-06,-7e-06,-9e-06,3e-06,-2.9e-05,0,8e-06,-1e-06,-9e-06,-4e-06,7e-06,-5e-06,-1e-06,1.4e-05,-4e-06,1e-06,-6e-06,-8e-06,7e-06,1e-06,9e-06,-1.2e-05,-9e-06,1e-06,1.4e-05,-1.1e-05,-1.7e-05,9e-06,-2e-06,9e-06,6e-06,-7e-06,-8e-06,-3e-06,-1e-06,-8e-06,1.5e-05,-1e-06,-2e-05,-4e-06,8e-06,-1e-06,3.6e-05,-1.7e-05,-9e-06,2.2e-05,1e-06,1.9e-05,2e-06,2e-06,-7e-06,1e-05,4e-06,4e-06,3.6e-05,2.2e-05,-1.7e-05,-1e-06,-3e-06,-7e-06,-7e-06
6e-06,2.3e-05,-5e-06,4e-06,9e-06,-1e-06,1.5e-05,1.2e-05,-7e-06,2.9e-05,-4e-06,6e-06,-1e-06,-7e-06,1e-06,-1.9e-05,1.6e-05,6e-06,3e-05,9e-06,-1.6e-05,-9e-06,5e-06,1e-05,1.9e-05,0,-3e-06,9e-06,8e-06,-6e-06,2e-05,-2.2e-05,-6e-06,4e-06,-2e-06,-1.4e-05,2e-06,1e-06,-3.2e-05,0,0,6e-06,-1.6e-05,8e-06,-1e-06,4e-06,3e-06,-2e-06,-3e-06,-3e-06,-2e-06,1.1e-05,8e-06,-9e-06,4e-06,6e-06,-5e-06,1e-06,1e-06,1.7e-05,-2.7e-05,1e-06,1.3e-05,-1.5e-05,-2.3e-05,-3e-06,8e-06,4e-06,-2e-06,-1.7e-05,1.9e-05,-1e-06,-2e-06,3e-06,-5e-06,-3e-06,4e-06,6e-06,1.5e-05,-1e-06,5e-06,-1e-06,-5e-06,0,3e-06,2e-06,1e-05,-7e-06,1.5e-05,-2e-06,-4e-06,-5e-06,1.2e-05,-9e-06,-1e-06,-1.3e-05,-9e-06,1.4e-05,0,-5e-06,-1.1e-05,-1.2e-05,1.3e-05,9e-06,-1.5e-05,-2.6e-05,-1.8e-05,-9e-06,-4.5e-05,0,5e-06,1e-06,0,-1.1e-05,-1.5e-05,-2e-06,7e-06,-4e-06,-7e-06,-9e-06,-4e-06
-1e-05,-2e-06,4e-06,-3e-06,-1.1e-05,-6e-06,-1.6e-05,1e-06,-1e-06,-3e-06,4e-06,9e-06,-1e-05,-1.4e-05,-7e-06,-4e-06,-5e-06,-2e-06,-8e-06,-1.5e-05,2.3e-05,5e-06,3e-06,1e-06,-1e-05,-1.1e-05,1.8e-05,4e-06,-1e-05,-1.4e-05,-1e-06,0,-3e-06,-7e-06,1.4e-05,-1.1e-05,4e-06,-5e-06,4.9e-05,1e-06,-1e-06,6e-06,1.4e-05,2.3e-05,5e-06,-1.6e-05,-2e-06,4e-06,1e-06,-1.5e-05,8e-06,7e-06,-8e-06,-1e-05,4e-06,1e-06,-2.3e-05,3e-06,-3e-06,1e-06,1e-05,1.1e-05,3e-06,-9e-06,-9e-06,-1e-06,-9e-06,-7e-06,-1.4e-05,-5e-06,-2.4e-05,3e-06,1.2e-05,-7e-06,-8e-06,-4e-06,4e-06,6e-06,1e-05,-1e-06,-3e-06,-1e-06,-2e-06,-2e-06,0,-7e-06,0,-7e-06,3e-06,3e-06,-1.3e-05,6e-06,2e-06,-2e-06,1.6e-05,1.1e-05,-3e-06,3e-06,3e-06,1e-05,2e-06,7e-06,1.1e-05,6e-06,5e-06,1.2e-05,-1e-06,-8e-06,-3.5e-05,1e-06,1.1e-05,1.1e-05,-6e-06,1.1e-05,-7e-06,2e-06,1e-05,7e-06,3e-06,-5e-06,1.6e-05
-8e-06,-1.2e-05,7e-06,4e-06,5e-06,-2e-06,-6e-06,2e-06,0,1.7e-05,3e-06,-5e-06,1e-06,-3e-06,0,2.3e-05,-1.6e-05,-1.1e-05,7e-06,1e-05,2e-06,2.1e-05,0,1e-05,0,-1e-05,-2.3e-05,-6e-06,-6e-06,8e-06,-1.2e-05,7e-06,-3e-06,7e-06,-6e-06,-7e-06,-1e-06,-1e-06,-4.9e-05,-3e-06,-6e-06,-1.2e-05,-8e-06,-1e-05,1e-05,1e-05,0,-9e-06,3e-06,6e-06,-7e-06,-3e-06,3e-06,-1.3e-05,8e-06,1e-06,1.9e-05,3e-06,-3e-06,-1.6e-05,-3e-06,2.1e-05,-9e-06,1.6e-05,1.6e-05,5e-06,-1.4e-05,7e-06,-3e-06,5e-06,2e-06,4e-06,-1.1e-05,6e-06,1.1e-05,3e-06,-1e-06,0,-8e-06,4e-06,1.2e-05,-8e-06,1e-06,-2e-06,-2e-06,-4e-06,-1e-06,-5e-06,-5e-06,-1e-06,-1.2e-05,-6e-06,0,-9e-06,1.5e-05,1.3e-05,1e-06,-1.4e-05,-2e-06,-1.1e-05,4e-06,3e-06,-7e-06,2e-06,1e-06,-9e-06,1e-06,5e-06,1.1e-05,-2e-06,1.2e-05,-5e-06,7e-06,2e-06,-1.3e-05,2.4e-05,-2e-06,-7e-06,0,1.4e-05,1.1e-05
1.4e-05,-1e-06,4e-06,-1.2e-05,-5e-06,0,-2e-06,-4e-06,-7e-06,-9e-06,-8e-06,-1.1e-05,6e-06,6e-06,-1.4e-05,2e-05,-5e-06,1e-06,-3e-06,8e-06,4e-06,-1.2e-05,2e-06,-4e-06,-9e-06,0,7e-06,-6e-06,-1.6e-05,-2e-06,1.7e-05,-8e-06,6e-06,-1.1e-05,-1.6e-05,5e-06,0,2e-06,2.6e-05,5e-06,3e-06,8e-06,-2e-06,5e-06,2e-06,4e-06,-5e-06,-1e-06,1e-06,1.3e-05,8e-06,-1e-06,1e-06,8e-06,1e-06,-5e-06,8e-06,-4e-06,0,-1.1e-05,2e-06,2e-06,5e-06,1.6e-05,1.6e-05,2e-06,-5e-06,-4e-06,-8e-06,5e-06,9e-06,6e-06,-2e-06,9e-06,-1.2e-05,0,-6e-06,-2e-06,-1.4e-05,6e-06,-1e-05,5e-06,-2e-06,2e-06,6e-06,2e-06,-4e-06,3e-06,1e-06,0,2e-06,-1e-06,-1e-06,-5e-06,3e-06,2e-06,4e-06,1e-06,0,1e-06,-5e-06,-7e-06,-1.5e-05,-7e-06,-8e-06,3e-06,-1.1e-05,5e-06,6e-06,-8e-06,6e-06,-1.1e-05,-1.3e-05,5e-06,1e-05,3e-06,-1e-05,-4e-06,0,3e-06,-1.6e-05
-8e-06,6e-06,-2e-06,-3e-06,3e-06,-2e-06,4e-06,-2e-06,0,1e-06,3e-06,-5e-06,2e-06,1e-06,4e-06,-2e-05,1e-06,-3e-06,-5e-06,-1e-06,7e-06,-1.6e-05,-6e-06,-1e-06,-6e-06,0,7e-06,3e-06,1.1e-05,1e-06,-1.4e-05,9e-06,0,5e-06,0,5e-06,0,0,-7e-06,-3e-06,-4e-06,1e-06,2e-06,5e-06,4e-06,-2e-06,6e-06,-6e-06,0,-1.2e-05,-3e-06,-6e-06,-1.8e-05,6e-06,-4e-06,5e-06,-2.7e-05,7e-06,0,-3e-06,-8e-06,-1.2e-05,5e-06,-5e-06,1.2e-05,-3e-06,1.3e-05,7e-06,2e-06,-5e-06,-7e-06,-3e-06,7e-06,-1e-06,7e-06,-2e-06,1e-06,4e-06,-1.1e-05,-6e-06,2e-06,-2e-06,-2e-06,0,-1e-06,-1e-06,3e-06,5e-06,3e-06,-1e-06,6e-06,0,2e-06,-2e-06,-4e-06,-1.8e-05,2e-06,4e-06,-2e-06,7e-06,7e-06,7e-06,-3e-06,4e-06,-8e-06,-3e-06,5e-06,4e-06,2.7e-05,1.2e-05,1e-05,-1e-06,2e-06,-1.1e-05,5e-06,-1.6e-05,6e-06,0,-1e-06,-1e-06,2e-06
1e-05,3e-06,-6e-06,1e-06,-6e-06,0,9e-06,2e-06,-1e-06,-8e-06,-6e-06,1e-05,-3e-06,4e-06,1e-06,-1e-05,6e-06,4e-06,1.6e-05,7e-06,-2.4e-05,7e-06,9e-06,7e-06,1e-05,8e-06,5e-06,4e-06,3e-06,7e-06,6e-06,-1.2e-05,-3e-06,-5e-06,2e-06,2e-06,0,0,9e-06,1e-06,3e-06,-3e-06,5e-06,-7e-06,-2e-06,-7e-06,-3e-06,1e-06,1e-06,1.8e-05,5e-06,2e-06,1e-05,2e-06,-5e-06,-3e-06,1.2e-05,-1e-06,-2e-06,7e-06,-2e-06,-1.2e-05,-1.1e-05,1e-06,6e-06,-2e-06,8e-06,4e-06,5e-06,-8e-06,6e-06,-2e-06,-4e-06,-4e-06,-1e-06,-1e-06,3e-06,-7e-06,-2e-06,-1e-06,0,1e-06,-4e-06,0,-6e-06,2e-06,4e-06,-3e-06,2e-06,0,7e-06,2e-06,1e-06,1e-06,-8e-06,-7e-06,-4e-06,-4e-06,2e-06,-2e-06,-4e-06,0,-7e-06,-1e-06,-3e-06,-4e-06,-2e-06,0,-2e-06,-4e-06,4e-06,0,0,2e-06,-7e-06,-1.8e-05,-1e-06,-1e-06,0,-2e-06,4e-06
-1e-05,-5e-06,-2e-06,1.2e-05,1e-06,1e-06,-1e-06,2e-06,-2e-06,-7e-06,-2e-06,4e-06,-5e-06,3e-06,-5e-06,-7e-06,4e-06,0,-8e-06,-1e-05,1e-06,5e-06,-5e-06,-4e-06,-3e-06,1e-06,-5e-06,-1e-06,6e-06,-8e-06,-2e-06,9e-06,2e-06,3e-06,1e-05,0,0,0,-9e-06,0,3e-06,-3e-06,-6e-06,-2e-06,-4e-06,1e-06,1e-06,7e-06,0,-5e-06,-4e-06,3e-06,4e-06,-3e-06,-3e-06,4e-06,1e-06,-6e-06,-2e-06,6e-06,3e-06,-1e-05,4e-06,0,-6e-06,2e-06,1e-06,2e-06,5e-06,3e-06,-6e-06,0,-2e-06,6e-06,-2e-06,1e-06,-1e-06,-1e-06,9e-06,1e-06,-6e-06,0,4e-06,1e-06,-4e-06,3e-06,-3e-06,-2e-06,0,-1e-06,2e-06,-1e-06,-1e-06,6e-06,-4e-06,1.1e-05,-1e-06,-3e-06,0,3e-06,3e-06,-2e-06,8e-06,1e-06,1e-06,4e-06,4e-06,3e-06,-1.8e-05,0,0,1e-06,7e-06,0,-6e-06,9e-06,-4e-06,1e-06,1e-06,1e-06,-6e-06
-1e-06,-3e-06,2e-06,-7e-06,-4e-06,-1e-06,5e-06,2e-06,-1e-06,-5e-06,2e-06,-5e-06,2e-06,1e-06,-2e-06,1.4e-05,2e-06,1e-06,3e-06,1e-06,0,3e-06,4e-06,-4e-06,4e-06,2e-06,-9e-06,0,-7e-06,2e-06,-7e-06,-4e-06,0,-3e-06,0,-5e-06,0,0,1e-05,-1e-06,1e-06,-1e-06,0,-4e-06,-2e-06,2e-06,-2e-06,-1e-06,0,1e-06,3e-06,3e-06,-8e-06,6e-06,0,-2e-06,-5e-06,-1e-06,0,4e-06,0,-3e-06,4e-06,9e-06,-1.1e-05,-1e-06,-2e-06,0,7e-06,3e-06,0,-2e-06,6e-06,4e-06,4e-06,-1e-06,-1e-06,0,4e-06,1e-06,4e-06,3e-06,0,0,-5e-06,-1e-06,0,0,-3e-06,0,-4e-06,0,0,3e-06,-2e-06,9e-06,0,3e-06,1e-06,-8e-06,-4e-06,2e-06,-3e-06,0,-3e-06,-7e-06,2e-06,7e-06,-1.7e-05,-5e-06,-2e-06,1e-06,-2e-06,3e-06,1e-06,5e-06,0,0,-1e-06,-4e-06,0
1e-06,6e-06,4e-06,2e-06,1e-06,0,-1e-06,-2e-06,-1e-06,-5e-06,-3e-06,0,4e-06,-1e-06,3e-06,9e-06,-1e-06,1e-06,-2e-06,4e-06,-1e-06,-1e-06,-5e-06,0,-2e-06,1e-06,6e-06,-3e-06,7e-06,-1e-06,1e-05,2e-06,0,3e-06,-5e-06,-2e-06,-1e-06,1e-06,-5e-06,1e-06,-3e-06,7e-06,2e-06,-8e-06,-4e-06,-4e-06,1e-06,3e-06,1e-06,-9e-06,-1e-06,-5e-06,-1e-06,3e-06,1e-06,0,1e-06,4e-06,-1e-06,-2e-06,2e-06,5e-06,-6e-06,0,-7e-06,-1e-06,-4e-06,2e-06,1e-06,1e-06,9e-06,-1e-06,-1e-06,-3e-06,-3e-06,1e-06,0,-1e-06,3e-06,0,-7e-06,-5e-06,-2e-06,-1e-06,-1e-06,3e-06,0,1e-06,-1e-06,-1e-06,-4e-06,1e-06,-1e-06,3e-06,2e-06,-4e-06,3e-06,1e-06,-3e-06,7e-06,2e-06,-1e-06,6e-06,0,-4e-06,6e-06,0,-1e-06,5e-06,5e-06,-4e-06,-1e-06,0,-3e-06,5e-06,0,3e-06,3e-06,0,-3e-06,2e-06
-2e-06,1e-06,3e-06,-7e-06,0,0,-1e-06,-1e-06,-1e-06,1e-06,4e-06,-1e-06,1e-06,-1e-06,-4e-06,-4e-06,-3e-06,0,1e-06,-2e-06,3e-06,-2e-06,4e-06,-2e-06,6e-06,1e-06,6e-06,2e-06,2e-06,-5e-06,-1e-05,-3e-06,0,0,-1e-06,2e-06,1e-06,0,0,1e-06,-1e-06,-4e-06,-1e-06,3e-06,-1e-06,1e-06,1e-06,-3e-06,0,2e-06,1e-06,0,6e-06,-4e-06,2e-06,1e-06,3e-06,-1e-06,0,-4e-06,-3e-06,1e-05,-1e-06,-3e-06,-7e-06,1e-06,-8e-06,-1e-06,0,-4e-06,-9e-06,-2e-06,-3e-06,-1e-06,4e-06,-1e-06,2e-06,-1e-06,-2e-06,-3e-06,1e-06,6e-06,-3e-06,0,-1e-06,1e-06,1e-06,2e-06,5e-06,-1e-06,-2e-06,-1e-06,-1e-06,1e-06,5e-06,-8e-06,0,-2e-06,0,0,-1e-06,-1e-06,-8e-06,-2e-06,-1e-06,1e-06,3e-06,1e-06,7e-06,-3e-06,-6e-06,-4e-06,-2e-06,-1e-06,2e-06,4e-06,-3e-06,0,0,1e-06,3e-06
7e-06,-2e-06,-3e-06,6e-06,1e-06,0,-5e-06,0,-1e-06,0,1e-06,-3e-06,-3e-06,-3e-06,2e-06,-4e-06,-3e-06,0,5e-06,5e-06,4e-06,-6e-06,-1e-06,0,2e-06,-3e-06,-4e-06,2e-06,-2e-06,2e-06,6e-06,0,2e-06,1e-06,3e-06,3e-06,0,-1e-06,6e-06,-1e-06,1e-06,-2e-06,-2e-06,-3e-06,-1e-06,1e-06,-1e-06,-3e-06,0,0,0,-1e-06,-1e-06,-5e-06,1e-06,-2e-06,-5e-06,-1e-06,-1e-06,-6e-06,3e-06,9e-06,5e-06,-8e-06,3e-06,1e-06,1e-06,-1e-06,-5e-06,0,2e-06,5e-06,1e-06,4e-06,-5e-06,1e-06,1e-06,2e-06,-4e-06,3e-06,3e-06,-4e-06,3e-06,1e-06,2e-06,-2e-06,-1e-06,-1e-06,-1e-06,1e-06,2e-06,0,0,0,4e-06,1e-06,-2e-06,0,1e-06,-2e-06,-1e-06,0,-5e-06,1e-06,2e-06,-2e-06,-4e-06,2e-06,1.8e-05,2e-06,-5e-06,-3e-06,-1e-06,1e-06,-4e-06,7e-06,-4e-06,0,0,2e-06,-2e-06
-5e-06,-3e-06,-4e-06,-1e-06,-1e-06,0,-5e-06,2e-06,-1e-06,5e-06,1e-06,1e-06,-3e-06,-2e-06,-2e-06,-4e-06,1e-06,-1e-06,-8e-06,-4e-06,-3e-06,8e-06,0,-3e-06,-1e-06,-3e-06,-4e-06,-1e-06,-8e-06,-1e-06,-1e-06,2e-06,-1e-06,-1e-06,2e-06,2e-06,-1e-06,0,-1.4e-05,1e-06,0,3e-06,1e-06,4e-06,-1e-06,3e-06,0,0,0,-4e-06,-1e-06,0,-3e-06,2e-06,1e-06,1e-06,8e-06,1e-06,-1e-06,1e-06,-1e-06,0,-1e-06,5e-06,5e-06,0,7e-06,-1e-06,-3e-06,5e-06,3e-06,2e-06,2e-06,1e-06,4e-06,0,-1e-06,2e-06,-3e-06,-1e-06,-3e-06,2e-06,0,0,2e-06,1e-06,-2e-06,-2e-06,-4e-06,-1e-06,3e-06,1e-06,0,-2e-06,0,7e-06,-1e-06,0,1e-06,-1e-06,1e-06,0,-7e-06,0,1e-06,2e-06,2e-06,1e-06,3e-06,-3e-06,-5e-06,-3e-06,-2e-06,3e-06,-1e-06,-3e-06,3e-06,0,0,1e-06,-1e-06
1e-06,4e-06,0,-1e-06,0,0,3e-06,1e-06,-1e-06,2e-06,3e-06,2e-06,2e-06,1e-06,2e-06,0,3e-06,0,7e-06,-4e-06,2e-06,1e-06,0,1e-06,2e-06,-1e-06,4e-06,0,1e-06,0,-3e-06,-2e-06,-1e-06,0,2e-06,-1e-06,0,0,1.1e-05,0,-1e-06,0,1e-06,2e-06,2e-06,-2e-06,0,0,0,4e-06,2e-06,3e-06,5e-06,1e-06,-1e-06,-2e-06,-5e-06,3e-06,0,2e-06,3e-06,-5e-06,-5e-06,1e-06,9e-06,0,4e-06,0,-4e-06,3e-06,-5e-06,-1e-06,-2e-06,-3e-06,-4e-06,0,0,-2e-06,-2e-06,0,3e-06,0,0,0,0,-2e-06,1e-06,1e-06,1e-06,1e-06,2e-06,0,0,-4e-06,-2e-06,-1e-06,1e-06,-1e-06,-2e-06,1e-06,-1e-06,0,-3e-06,0,0,-1e-06,-1e-06,0,-1.3e-05,3e-06,-3e-06,-1e-06,1e-06,-1e-06,2e-06,-9e-06,-1e-06,-1e-06,0,1e-06,3e-06
-2e-06,-1e-06,3e-06,-1e-06,0,0,-3e-06,0,0,6e-06,-2e-06,-2e-06,2e-06,1e-06,-2e-06,5e-06,2e-06,0,-6e-06,3e-06,-4e-06,0,-1e-06,2e-06,-1e-06,-1e-06,2e-06,-2e-06,2e-06,3e-06,6e-06,3e-06,0,0,-4e-06,-3e-06,0,0,-7e-06,-1e-06,1e-06,-1e-06,-3e-06,-1e-06,1e-06,0,1e-06,2e-06,0,4e-06,-2e-06,-2e-06,-4e-06,-2e-06,-1e-06,2e-06,-3e-06,-1e-06,-1e-06,5e-06,-3e-06,-8e-06,5e-06,-3e-06,4e-06,0,-1e-06,-2e-06,1e-06,-1e-06,4e-06,-2e-06,-1e-06,0,1e-06,1e-06,0,2e-06,4e-06,0,-1e-06,0,-3e-06,0,1e-06,-1e-06,0,0,4e-06,0,-1e-06,-1e-06,0,-1e-06,-3e-06,-5e-06,1e-06,0,0,2e-06,2e-06,0,2e-06,0,1e-06,2e-06,1e-06,0,-1.1e-05,-1e-06,-1e-06,1e-06,-1e-06,0,2e-06,-1e-06,-1e-06,0,0,1e-06,-2e-06
-1e-06,0,2e-06,4e-06,0,0,4e-06,-1e-06,-1e-06,1e-06,1e-06,0,0,1e-06,1e-06,1e-06,0,1e-06,4e-06,-2e-06,-7e-06,-1e-06,3e-06,-1e-06,3e-06,3e-06,0,0,0,-1e-06,-7e-06,-4e-06,1e-06,-1e-06,-3e-06,-2e-06,0,0,0,1e-06,1e-06,-3e-06,1e-06,7e-06,2e-06,0,-1e-06,1e-06,0,-1e-06,1e-06,-1e-06,0,-1e-06,-1e-06,-1e-06,7e-06,-2e-06,-1e-06,0,2e-06,-6e-06,1e-06,-4e-06,1e-06,0,-2e-06,0,0,-2e-06,-3e-06,0,3e-06,3e-06,1e-06,0,0,0,4e-06,-1e-06,1e-06,-2e-06,2e-06,0,0,0,0,1e-06,-1e-06,0,-3e-06,0,0,0,-2e-06,-2e-06,-1e-06,1e-06,2e-06,-1e-06,-3e-06,1e-06,-1e-06,1e-06,3e-06,-2e-06,-1e-06,2e-06,-2e-06,0,1e-06,0,0,-1e-06,0,3e-06,-1e-06,-1e-06,0,0,-1e-06
3e-06,-3e-06,0,0,1e-06,0,1e-06,0,-1e-06,2e-06,-1e-06,1e-06,-2e-06,2e-06,1e-06,4e-06,-2e-06,0,-2e-06,1e-06,5e-06,-1e-06,-2e-06,0,-3e-06,0,-6e-06,1e-06,-2e-06,1e-06,5e-06,4e-06,0,1e-06,2e-06,1e-06,0,0,-1e-06,-1e-06,-1e-06,3e-06,0,-3e-06,2e-06,0,0,0,0,-2e-06,-2e-06,0,3e-06,4e-06,0,0,-2e-06,0,0,-1e-06,-1e-06,-1e-06,-4e-06,1e-06,-4e-06,0,-3e-06,-1e-06,4e-06,1e-06,0,1e-06,-2e-06,-1e-06,-2e-06,0,0,0,3e-06,1e-06,2e-06,1e-06,-1e-06,0,0,-2e-06,0,-1e-06,-2e-06,0,-2e-06,0,0,0,0,5e-06,0,0,0,-2e-06,2e-06,-1e-06,4e-06,-1e-06,2e-06,-1e-06,0,1e-06,7e-06,-1e-06,2e-06,-1e-06,-1e-06,1e-06,-3e-06,0,2e-06,0,0,-1e-06,2e-06
-2e-06,3e-06,-2e-06,0,0,0,2e-06,1e-06,0,-2e-06,-2e-06,0,-1e-06,0,0,-4e-06,-1e-06,0,-2e-06,2e-06,-3e-06,-1e-06,2e-06,2e-06,-2e-06,2e-06,2e-06,-1e-06,2e-06,0,-3e-06,-3e-06,-1e-06,-1e-06,0,2e-06,0,0,0,0,-1e-06,2e-06,0,3e-06,0,-2e-06,0,-1e-06,0,1e-06,1e-06,0,-3e-06,2e-06,1e-06,1e-06,-6e-06,2e-06,-1e-06,-3e-06,1e-06,5e-06,2e-06,3e-06,-5e-06,0,-4e-06,0,3e-06,3e-06,4e-06,-2e-06,-1e-06,-2e-06,3e-06,0,-1e-06,-1e-06,-1e-06,-1e-06,-3e-06,-1e-06,1e-06,0,0,0,0,-1e-06,1e-06,0,0,0,0,1e-06,1e-06,2e-06,0,0,-1e-06,3e-06,0,0,-4e-06,0,1e-06,1e-06,0,-1e-06,1.2e-05,1e-06,3e-06,-1e-06,1e-06,-1e-06,0,-1e-06,-2e-06,0,0,-1e-06,0
2e-06,-1e-06,-2e-06,-2e-06,0,0,3e-06,1e-06,-1e-06,-1e-06,1e-06,0,2e-06,0,-1e-06,-5e-06,0,-1e-06,3e-06,-2e-06,3e-06,3e-06,-2e-06,0,0,1e-06,3e-06,0,5e-06,-2e-06,-1e-06,2e-06,0,0,2e-06,1e-06,0,0,-3e-06,1e-06,1e-06,-3e-06,-2e-06,-1e-06,0,1e-06,1e-06,-1e-06,0,-1e-06,-1e-06,1e-06,0,-2e-06,1e-06,0,5e-06,-2e-06,0,-2e-06,-1e-06,7e-06,2e-06,1e-06,-6e-06,0,2e-06,0,2e-06,0,-5e-06,1e-06,2e-06,1e-06,-3e-06,0,0,0,-3e-06,1e-06,1e-06,0,-3e-06,0,-1e-06,1e-06,1e-06,1e-06,1e-06,0,2e-06,0,0,2e-06,2e-06,-3e-06,0,0,-1e-06,-1e-06,0,1e-06,1e-06,0,1e-06,-2e-06,0,1e-06,4e-06,0,4e-06,-1e-06,-1e-06,0,0,5e-06,0,0,0,0,0
-1e-06,1e-06,0,0,0,0,-4e-06,0,-1e-06,-4e-06,-2e-06,-1e-06,2e-06,0,1e-06,0,0,0,-4e-06,0,2e-06,1e-06,2e-06,0,-2e-06,-1e-06,-2e-06,-1e-06,-1e-06,1e-06,4e-06,-1e-06,0,-1e-06,-2e-06,0,0,0,4e-06,0,1e-06,0,1e-06,-3e-06,-1e-06,2e-06,-1e-06,0,0,-2e-06,0,1e-06,1e-06,-1e-06,1e-06,1e-06,2e-06,0,0,0,0,4e-06,-2e-06,-1e-06,0,0,5e-06,0,0,-2e-06,2e-06,1e-06,-1e-06,1e-06,3e-06,0,1e-06,0,-3e-06,0,0,1e-06,2e-06,0,0,-1e-06,-1e-06,0,0,0,2e-06,0,0,1e-06,2e-06,-3e-06,0,0,1e-06,1e-06,0,-1e-06,-4e-06,0,1e-06,1e-06,0,1e-06,-1e-05,-1e-06,3e-06,-1e-06,1e-06,0,2e-06,1e-06,1e-06,1e-06,0,0,0
-1e-06,-2e-06,2e-06,3e-06,0,0,1e-06,-1e-06,0,-3e-06,0,1e-06,0,-1e-06,-1e-06,2e-06,1e-06,0,4e-06,-1e-06,-2e-06,-2e-06,-1e-06,0,1e-06,0,-1e-06,0,-3e-06,-1e-06,-6e-06,0,0,1e-06,-1e-06,-2e-06,0,0,-3e-06,0,-1e-06,1e-06,0,0,-1e-06,-1e-06,0,0,0,-1e-06,0,-1e-06,1e-06,2e-06,0,-2e-06,-6e-06,1e-06,0,1e-06,1e-06,0,-2e-06,-2e-06,0,0,2e-06,0,-2e-06,0,1e-06,2e-06,-1e-06,-3e-06,-3e-06,0,0,-1e-06,-1e-06,-1e-06,-1e-06,-1e-06,-1e-06,0,-1e-06,1e-06,0,0,-1e-06,0,1e-06,0,0,0,0,1e-06,0,0,0,-2e-06,0,0,1e-06,0,1e-06,0,0,0,-7e-06,1e-06,2e-06,-1e-06,0,1e-06,-1e-06,-4e-06,0,0,0,1e-06,0
0,2e-06,2e-06,-3e-06,-1e-06,0,-4e-06,0,-1e-06,-2e-06,1e-06,0,-2e-06,-1e-06,0,8e-06,0,0,-3e-06,0,-1e-06,-1e-06,0,1e-06,-2e-06,-2e-06,0,0,-2e-06,0,6e-06,1e-06,0,0,2e-06,-1e-06,0,0,-1e-06,0,0,1e-06,-1e-06,-4e-06,0,-1e-06,0,0,0,4e-06,0,-1e-06,-2e-06,0,-1e-06,1e-06,2e-06,1e-06,0,2e-06,-1e-06,-4e-06,3e-06,3e-06,6e-06,0,-1e-06,0,-3e-06,1e-06,-3e-06,-1e-06,1e-06,-2e-06,2e-06,0,0,0,1e-06,0,2e-06,1e-06,2e-06,0,0,1e-06,0,0,0,0,-1e-06,0,0,0,-1e-06,2e-06,0,0,0,1e-06,1e-06,0,1e-06,0,0,0,0,0,-6e-06,-1e-06,1e-06,0,1e-06,0,0,-3e-06,-1e-06,0,0,0,0
-1e-06,-1e-06,-1e-06,1e-06,1e-06,0,-1e-06,0,-1e-06,-2e-06,-1e-06,0,-1e-06,0,0,-2e-06,0,0,2e-06,2e-06,-1e-06,0,0,0,0,0,4e-06,0,3e-06,1e-06,-3e-06,-1e-06,0,0,-1e-06,1e-06,0,0,5e-06,-1e-06,1e-06,-3e-06,0,1e-06,-1e-06,1e-06,0,1e-06,0,-1e-06,0,1e-06,1e-06,-2e-06,-1e-06,0,2e-06,-1e-06,0,0,1e-06,-6e-06,-1e-06,2e-06,2e-06,0,-2e-06,1e-06,-2e-06,1e-06,3e-06,-2e-06,0,2e-06,0,0,0,0,3e-06,0,-3e-06,-1e-06,-3e-06,0,0,-1e-06,0,-1e-06,2e-06,0,-1e-06,0,0,0,-2e-06,0,0,0,-1e-06,1e-06,-1e-06,0,3e-06,0,-1e-06,0,0,0,7e-06,2e-06,0,0,-1e-06,0,0,3e-06,1e-06,0,0,0,-1e-06
2e-06,1e-06,-2e-06,-2e-06,-1e-06,0,0,0,-1e-06,1e-06,1e-06,0,1e-06,0,0,-5e-06,-1e-06,0,1e-06,-1e-06,-3e-06,1e-06,-1e-06,-1e-06,1e-06,0,-1e-06,0,-2e-06,0,1e-06,1e-06,0,0,1e-06,1e-06,0,0,-5e-06,1e-06,0,0,0,-1e-06,0,1e-06,0,0,0,0,0,-1e-06,0,-1e-06,0,0,-1e-06,0,0,0,-1e-06,-4e-06,-2e-06,-1e-06,4e-06,0,-3e-06,-1e-06,-1e-06,-1e-06,-2e-06,0,-1e-06,0,-1e-06,0,0,0,2e-06,0,1e-06,2e-06,2e-06,0,0,1e-06,0,1e-06,0,0,-1e-06,0,0,0,-1e-06,-1e-06,0,0,0,0,0,0,4e-06,0,0,0,0,0,9e-06,-2e-06,-1e-06,-1e-06,0,0,2e-06,1e-06,1e-06,0,0,0,1e-06
0,-2e-06,-1e-06,3e-06,1e-06,0,-1e-06,0,-1e-06,1e-06,0,-1e-06,1e-06,0,-1e-06,-4e-06,-1e-06,0,-3e-06,0,-1e-06,1e-06,2e-06,0,0,0,-3e-06,0,-1e-06,0,2e-06,-1e-06,0,0,0,1e-06,0,0,2e-06,0,-1e-06,3e-06,0,0,0,-2e-06,-1e-06,0,0,2e-06,1e-06,1e-06,-1e-06,2e-06,0,0,-2e-06,1e-06,0,-1e-06,1e-06,0,2e-06,-3e-06,-2e-06,0,-2e-06,1e-06,0,-2e-06,0,0,1e-06,-3e-06,2e-06,0,0,0,1e-06,-1e-06,1e-06,-2e-06,-1e-06,0,0,0,-1e-06,0,-2e-06,0,0,0,0,0,0,-1e-06,0,0,1e-06,-2e-06,0,0,0,0,0,1e-06,-1e-06,-1e-06,6e-06,2e-06,-2e-06,-1e-06,0,0,0,-3e-06,-1e-06,0,0,0,0
0,2e-06,1e-06,-2e-06,-1e-06,0,3e-06,0,-1e-06,3e-06,-1e-06,0,0,0,0,1e-06,0,0,4e-06,1e-06,3e-06,0,-2e-06,0,2e-06,1e-06,1e-06,0,0,0,-5e-06,1e-06,0,0,-1e-06,-1e-06,0,0,1e-06,0,0,-1e-06,-1e-06,3e-06,0,0,1e-06,0,0,-1e-06,-1e-06,0,1e-06,0,1e-06,-1e-06,2e-06,0,0,0,-1e-06,4e-06,0,1e-06,-2e-06,0,2e-06,-1e-06,3e-06,0,3e-06,1e-06,0,-1e-06,-3e-06,0,0,0,-2e-06,0,-2e-06,2e-06,2e-06,0,0,-1e-06,0,0,0,0,1e-06,0,0,0,1e-06,0,0,0,0,0,1e-06,0,3e-06,0,-1e-06,0,1e-06,0,-8e-06,-2e-06,-3e-06,-1e-06,0,0,0,0,1e-06,0,0,0,0
