0.006435,0.005997,0.0059,0.005576,0.005594,0.005395,0.005772,0.006394,0.005366,0.004456,0.005091,0.005883,0.005093,0.004433,0.004629,0.004964,0.005801,0.006113,0.00591,0.006116,0.006537,0.006602,0.006226,0.006058,0.006108,0.006086,0.005867,0.006029
0.007766,0.007359,0.007307,0.00677,0.006683,0.006462,0.006794,0.007445,0.006349,0.005356,0.006192,0.007148,0.006085,0.005341,0.005685,0.006025,0.006834,0.007178,0.007022,0.007316,0.007812,0.007819,0.007271,0.007137,0.007446,0.007616,0.00721,0.007057
0.009794,0.00952,0.009583,0.008638,0.008286,0.008076,0.00828,0.008947,0.007949,0.006961,0.008172,0.009243,0.007652,0.006844,0.007443,0.007752,0.008382,0.008769,0.008822,0.009206,0.009699,0.009624,0.008863,0.008805,0.009474,0.010021,0.009437,0.008599
0.010715,0.010774,0.011011,0.009744,0.008987,0.00887,0.009068,0.009774,0.009149,0.008426,0.010039,0.010963,0.008979,0.008081,0.008761,0.009118,0.009375,0.009629,0.009936,0.01021,0.010447,0.010479,0.009876,0.009834,0.0104,0.011202,0.010824,0.009492
0.01049,0.011124,0.011405,0.00991,0.008908,0.009178,0.00982,0.01063,0.010027,0.009416,0.011455,0.012209,0.01033,0.009315,0.009608,0.00994,0.009967,0.01022,0.01053,0.010325,0.010342,0.01077,0.010566,0.010239,0.010172,0.010901,0.010843,0.009699
0.010704,0.011933,0.011904,0.009902,0.009305,0.010288,0.011663,0.012676,0.011355,0.010482,0.013016,0.013935,0.012534,0.011121,0.010584,0.011022,0.011022,0.011523,0.011912,0.011108,0.010941,0.011435,0.011343,0.010825,0.01061,0.011122,0.010788,0.010068
0.012966,0.014328,0.013717,0.011339,0.011206,0.012631,0.014811,0.015779,0.013404,0.012314,0.015416,0.01686,0.015847,0.014199,0.013161,0.013424,0.013067,0.013752,0.014367,0.01338,0.013369,0.013735,0.013284,0.012762,0.012956,0.013477,0.012699,0.012171
0.017457,0.018831,0.017447,0.014531,0.014427,0.016287,0.019396,0.020007,0.016183,0.014645,0.018558,0.020796,0.019806,0.01852,0.018106,0.01755,0.016215,0.016873,0.017754,0.017385,0.017489,0.017568,0.016985,0.016537,0.016865,0.017066,0.016002,0.015859
0.022951,0.023882,0.021203,0.017665,0.017768,0.020185,0.024101,0.0248,0.019528,0.016878,0.021513,0.024682,0.024204,0.023744,0.02452,0.023084,0.020455,0.020664,0.021485,0.022196,0.022306,0.021929,0.021919,0.02176,0.022088,0.021851,0.020128,0.020103
0.02745,0.027189,0.023675,0.020248,0.020562,0.023214,0.027604,0.029095,0.022916,0.018809,0.023601,0.027836,0.028695,0.028413,0.02983,0.028357,0.025435,0.025377,0.025394,0.026808,0.027286,0.026081,0.026677,0.027212,0.027501,0.027579,0.025012,0.023646
0.029458,0.027722,0.024762,0.022639,0.022881,0.024948,0.028793,0.030719,0.024964,0.020731,0.025714,0.030365,0.031395,0.030579,0.031775,0.03056,0.0291,0.029603,0.028096,0.029315,0.031104,0.029504,0.030328,0.031891,0.031424,0.031391,0.028016,0.024819
0.030126,0.028076,0.026115,0.025352,0.024883,0.025491,0.028387,0.029817,0.025525,0.022984,0.02769,0.031456,0.031604,0.030716,0.03139,0.030175,0.030311,0.031447,0.028279,0.027658,0.031263,0.031814,0.033748,0.035857,0.033965,0.032549,0.028097,0.025267
0.03099,0.029852,0.02798,0.028363,0.027086,0.025361,0.02739,0.028679,0.026304,0.025162,0.028653,0.031699,0.032392,0.032482,0.03197,0.028724,0.028054,0.029245,0.02543,0.023315,0.028312,0.031947,0.035571,0.037468,0.034105,0.031464,0.027477,0.026434
0.029507,0.03003,0.028538,0.029268,0.028343,0.025488,0.02583,0.026829,0.026522,0.025846,0.026906,0.029544,0.03215,0.032813,0.030952,0.026312,0.023786,0.024409,0.022368,0.020286,0.023996,0.028855,0.033295,0.035029,0.031743,0.028972,0.026899,0.026659
0.029203,0.030625,0.029461,0.028399,0.028062,0.02666,0.026235,0.027981,0.029416,0.026813,0.024621,0.026021,0.029186,0.03016,0.028253,0.024107,0.021032,0.022625,0.024174,0.021969,0.021316,0.026151,0.032272,0.034178,0.031278,0.027366,0.026864,0.027266
0.038433,0.039142,0.03565,0.030337,0.030655,0.032074,0.032701,0.0372,0.039011,0.031629,0.027173,0.028926,0.031974,0.032066,0.031487,0.029272,0.027051,0.030461,0.033093,0.030412,0.026353,0.029967,0.039427,0.043424,0.039699,0.031553,0.031305,0.033722
0.05645,0.056151,0.047596,0.037156,0.037982,0.043231,0.045491,0.052289,0.055785,0.043796,0.036788,0.039493,0.042448,0.04104,0.041283,0.039697,0.040447,0.047466,0.048021,0.044238,0.038699,0.041183,0.053215,0.059569,0.056187,0.044346,0.043067,0.048257
0.07587,0.074656,0.06107,0.044445,0.044814,0.05528,0.059952,0.068099,0.074607,0.060262,0.050008,0.052271,0.054009,0.050523,0.051661,0.050594,0.057897,0.069946,0.066097,0.061159,0.055209,0.056401,0.067948,0.074548,0.073223,0.061066,0.057909,0.064773
0.090513,0.091204,0.075257,0.052621,0.052949,0.067739,0.073295,0.079505,0.088595,0.078724,0.067543,0.065949,0.062594,0.055062,0.057643,0.059011,0.076148,0.093078,0.082866,0.075691,0.070267,0.070591,0.078191,0.082794,0.085111,0.076142,0.06985,0.076519
0.095168,0.102214,0.085656,0.059725,0.063137,0.078546,0.079134,0.080334,0.093164,0.094879,0.086241,0.077168,0.066628,0.056649,0.061082,0.066194,0.089631,0.106078,0.091206,0.083122,0.079867,0.079748,0.082737,0.086396,0.088803,0.082244,0.075283,0.079894
0.091322,0.102412,0.084,0.06247,0.07198,0.082884,0.07678,0.077211,0.091128,0.100583,0.095905,0.078911,0.065036,0.059162,0.063579,0.071422,0.094521,0.103832,0.08724,0.080581,0.082367,0.082421,0.083062,0.087794,0.084098,0.077102,0.075676,0.078732
0.083658,0.093263,0.07425,0.061834,0.074811,0.079453,0.072852,0.077775,0.086649,0.094677,0.094601,0.075473,0.066012,0.067598,0.066,0.074724,0.098396,0.100618,0.079216,0.071789,0.078084,0.079479,0.080087,0.082673,0.074124,0.071202,0.077431,0.079587
0.077569,0.078945,0.063412,0.062531,0.074521,0.072963,0.068786,0.073875,0.077718,0.081964,0.083456,0.069977,0.068206,0.07447,0.065442,0.072743,0.095019,0.092628,0.073801,0.068841,0.070433,0.071037,0.075012,0.076091,0.074776,0.076512,0.077899,0.082353
0.077271,0.073294,0.061449,0.064962,0.072156,0.065089,0.063646,0.068411,0.070155,0.070055,0.070979,0.066423,0.069336,0.075234,0.06404,0.067154,0.08583,0.083336,0.069712,0.067585,0.061572,0.062939,0.071921,0.073822,0.083417,0.085231,0.076283,0.083787
0.07434,0.074784,0.067171,0.072747,0.076664,0.0622,0.064486,0.069807,0.068693,0.065464,0.063268,0.063274,0.067312,0.076197,0.072153,0.066627,0.077589,0.07418,0.061777,0.063,0.056278,0.063144,0.078668,0.079301,0.089692,0.088933,0.074153,0.079507
0.072878,0.083629,0.076325,0.082823,0.085173,0.060265,0.066978,0.08142,0.082153,0.071469,0.059426,0.062428,0.066495,0.077051,0.082923,0.075167,0.08198,0.073934,0.055865,0.06004,0.056984,0.068561,0.091062,0.0901,0.08947,0.084359,0.07231,0.074503
0.074519,0.087675,0.079725,0.085598,0.089549,0.059147,0.067138,0.095833,0.102429,0.084809,0.064159,0.064639,0.068391,0.076969,0.087113,0.082821,0.092838,0.089273,0.066693,0.067998,0.063268,0.070099,0.093551,0.091297,0.081241,0.078981,0.07255,0.072924
0.078136,0.080069,0.069621,0.072606,0.079802,0.058293,0.069074,0.10398,0.112087,0.091746,0.069359,0.066032,0.069211,0.070165,0.08088,0.085295,0.095404,0.09935,0.080807,0.077034,0.07192,0.077188,0.089987,0.079599,0.064542,0.071403,0.071931,0.070355
0.079008,0.068627,0.059958,0.059974,0.063109,0.054252,0.069042,0.100109,0.100578,0.084871,0.070199,0.068653,0.071997,0.066117,0.076728,0.084092,0.086529,0.093216,0.084347,0.074177,0.072385,0.081715,0.078409,0.062583,0.051218,0.06186,0.063339,0.062361
0.07738,0.071466,0.070261,0.062097,0.051265,0.043993,0.058062,0.078911,0.072249,0.0683,0.070066,0.074893,0.079118,0.070448,0.072825,0.074237,0.066226,0.070273,0.073239,0.06397,0.066559,0.074398,0.061267,0.04894,0.043138,0.050481,0.050602,0.053896
0.066389,0.075313,0.090477,0.075558,0.047377,0.036412,0.04836,0.05982,0.054613,0.060366,0.075962,0.084399,0.081267,0.069972,0.064948,0.068606,0.057496,0.047926,0.059671,0.062853,0.061583,0.05962,0.05003,0.046535,0.043158,0.04337,0.040407,0.047805
0.051258,0.069724,0.102991,0.089967,0.05018,0.036876,0.048632,0.052713,0.053465,0.062873,0.079573,0.088403,0.075121,0.062447,0.061182,0.069527,0.061051,0.044148,0.058112,0.069967,0.059467,0.047743,0.047586,0.053011,0.047356,0.043456,0.036852,0.04257
0.037487,0.055802,0.097258,0.090787,0.048773,0.036106,0.04639,0.045525,0.054029,0.060767,0.070955,0.081773,0.066213,0.050154,0.051,0.062472,0.056941,0.040557,0.053833,0.068648,0.054827,0.037681,0.043067,0.052318,0.043807,0.038984,0.032883,0.03706
0.030377,0.045563,0.076168,0.074919,0.043857,0.034561,0.042986,0.038609,0.046622,0.050392,0.052494,0.060934,0.048396,0.033112,0.033603,0.04392,0.043364,0.035199,0.04412,0.054033,0.042037,0.024651,0.030996,0.040876,0.032568,0.029195,0.026348,0.028803
0.028566,0.038465,0.057101,0.057538,0.038469,0.031537,0.03586,0.033005,0.035319,0.03744,0.035695,0.036594,0.029607,0.023213,0.021349,0.024478,0.033373,0.04089,0.041435,0.037124,0.02943,0.016413,0.017345,0.026398,0.026319,0.024015,0.021789,0.023023
0.029878,0.031408,0.043788,0.043532,0.030175,0.027438,0.026504,0.025901,0.02377,0.022306,0.024621,0.025408,0.020494,0.021776,0.020587,0.016059,0.029533,0.046731,0.044088,0.034963,0.026125,0.013571,0.009965,0.01588,0.023279,0.023818,0.020627,0.022682
0.027466,0.024755,0.032195,0.030697,0.022193,0.024274,0.020525,0.018642,0.014671,0.01279,0.017461,0.019834,0.01845,0.022273,0.021928,0.017485,0.030657,0.045517,0.042318,0.035706,0.024782,0.010841,0.008846,0.015218,0.02299,0.024187,0.019485,0.020721
0.020737,0.019348,0.024675,0.024413,0.01852,0.01953,0.017505,0.015347,0.01327,0.013157,0.013609,0.014545,0.016404,0.021101,0.022012,0.021642,0.029549,0.035396,0.032908,0.030311,0.021207,0.008485,0.009578,0.016528,0.020713,0.021098,0.016013,0.015609
0.014662,0.015576,0.020128,0.022455,0.01688,0.01675,0.015843,0.013626,0.016298,0.019026,0.016348,0.01274,0.012308,0.019225,0.024702,0.026689,0.025365,0.02272,0.024372,0.022976,0.018136,0.009137,0.01193,0.016883,0.015927,0.017882,0.014802,0.011379
0.012124,0.016384,0.022428,0.025089,0.018911,0.017603,0.016449,0.013897,0.021384,0.026575,0.021039,0.011095,0.009469,0.019868,0.027971,0.029357,0.020643,0.014945,0.021985,0.022286,0.017942,0.010428,0.014423,0.018207,0.015151,0.019309,0.017188,0.010816
