-0.00153,-0.050248,-0.101497,-0.023942,-0.002627,-0.003003,-0.016894,-0.050125,-0.093914,-0.050462,-0.002029,-9.1e-05,-0.00073,-0.037917,-0.103653,-0.032171,-0.007167,-0.006852,-0.018493,-0.090269,-0.130369,-0.024335,-0.001007,-0.005189,-0.066207,-0.174931,-0.109498,-0.019189
3.9e-05,-0.01532,-0.031924,-0.001853,0.000745,-0.000694,-0.005804,-0.012494,-0.044883,-0.031658,-0.001001,1e-06,0.000201,-0.01208,-0.053643,-0.015959,-0.001691,-0.002033,-0.006626,-0.053073,-0.090924,-0.015615,-0.000399,-0.002596,-0.017069,-0.080769,-0.073785,-0.010876
2.5e-05,-0.009386,-0.025546,-0.007431,-0.000378,0.000554,-0.004271,-0.017198,0.022391,0.023438,0.000754,1.6e-05,-0.000381,-0.01207,-0.003483,0.004891,-0.002435,-0.001942,-0.008693,-4.2e-05,0.043972,0.010524,0.000633,0.001463,0.013023,0.051236,0.045604,0.003906
0.000553,0.015909,0.049763,0.015947,0.001458,0.002441,0.005748,0.010294,0.068736,0.044506,0.001597,8.6e-05,0.000365,0.032499,0.099805,0.028998,0.004554,0.004368,0.007426,0.059489,0.111809,0.022493,0.001187,0.004158,0.04308,0.138114,0.099934,0.017222
0.000708,0.032598,0.067935,0.017691,0.001366,0.000851,0.011729,0.035256,0.018014,-0.000781,9e-05,7.8e-05,0.000754,0.035124,0.067217,0.011449,0.006614,0.006172,0.015439,0.036128,0.018791,0.003218,0.000265,0.00117,0.017165,0.026375,0.008786,0.007359
-0.000771,-0.01782,-0.072662,-0.027467,-0.0028,-0.002906,-0.005679,-0.014821,-0.082577,-0.04907,-0.001734,-9.2e-05,-0.000713,-0.034507,-0.105084,-0.038523,-0.005754,-0.00452,-0.009166,-0.059251,-0.09992,-0.020543,-0.001028,-0.004017,-0.055505,-0.147704,-0.093965,-0.018191
-0.00051,-0.026006,-0.053208,-0.010334,-0.000329,-0.00075,-0.006232,-0.011395,-0.0263,-0.016093,-0.000277,-3e-05,-0.000189,-0.019155,-0.063465,-0.017941,-0.003903,-0.004204,-0.00729,-0.029792,-0.041055,-0.008614,-0.000234,-0.001775,-0.02202,-0.047937,-0.039032,-0.011792
0.000344,0.001399,0.024653,0.013141,0.001769,0.001539,0.004334,0.016179,0.061158,0.036989,0.001397,8.7e-05,0.000329,0.014595,0.047439,0.022578,0.001868,0.001306,0.006639,0.046303,0.076543,0.015303,0.000968,0.002057,0.030574,0.091659,0.060179,0.009101
0.000285,0.001217,0.002076,0.000776,-9.3e-05,0.000848,0.000865,-0.008517,0.0239,0.026241,0.000651,2.5e-05,-0.000314,0.001287,0.040523,0.016981,0.000543,0.001374,0.001335,0.024496,0.056846,0.012922,0.000576,0.002506,0.019969,0.050886,0.051117,0.01205
2.2e-05,0.008909,0.026824,0.009904,0.000435,0.000385,-0.000785,-0.011972,-0.025834,-0.016618,-0.000671,9e-06,0.00039,0.011482,0.025252,0.004363,0.002854,0.002173,-0.002511,-0.026314,-0.041135,-0.005402,-0.000214,0.000302,0.000603,-0.028981,-0.022756,0.003808
-0.000266,0.007284,0.000674,-0.004535,-0.000584,-0.001217,-0.001356,-0.00097,-0.037452,-0.030895,-0.000951,-2e-05,0.000183,-0.012514,-0.053726,-0.014681,0.000872,0.000545,-0.004098,-0.039794,-0.074537,-0.014633,-0.000621,-0.002893,-0.027852,-0.071254,-0.055013,-0.009214
-5.6e-05,-0.010106,-0.044569,-0.016805,-0.001264,-0.001232,-0.005534,-0.004045,-0.003728,2.7e-05,0.000314,-1.9e-05,-0.000539,-0.029433,-0.068928,-0.013032,-0.002685,-0.0022,-0.005378,-0.005754,-0.001552,-0.002864,-0.000112,-0.00122,-0.015278,-0.00826,-0.006731,-0.009273
0.000191,-0.000305,0.028513,0.014918,0.001487,0.001208,0.001875,0.015298,0.053164,0.031593,0.001165,5e-05,0.000194,0.020406,0.060556,0.021625,-0.000604,-0.001311,0.003705,0.045503,0.07929,0.014016,0.000749,0.001988,0.024836,0.066416,0.041271,0.00614
-2.9e-05,0.007608,0.036591,0.011219,0.00065,0.000945,0.007938,0.016454,0.022767,0.012863,4.7e-05,4.5e-05,0.000125,0.020986,0.066535,0.017391,0.000366,0.000513,0.01267,0.037606,0.036277,0.007559,0.000267,0.001423,0.013554,0.009596,0.016206,0.008431
-7.8e-05,-0.002515,-0.015572,-0.007781,-0.001259,-0.000507,0.000748,-0.009844,-0.042815,-0.023594,-0.00087,-1.8e-05,-0.000207,-0.009244,-0.022134,-0.013942,0.00029,0.001112,0.003088,-0.023138,-0.058961,-0.010123,-0.000577,-0.000292,-0.007695,-0.035671,-0.023191,-0.002038
-0.00013,0.000317,0.002866,0.001966,0.000275,-0.000147,-0.001863,-0.005323,-0.025732,-0.020241,-0.000416,-1.8e-05,0.000286,-0.012275,-0.050328,-0.014416,0.001315,0.000611,-0.00905,-0.043513,-0.060044,-0.011266,-0.000314,-0.001243,-0.006877,-0.003012,-0.01498,-0.005273
2.2e-05,0.005546,-0.006534,-0.007394,1.3e-05,-0.00048,-0.003446,-0.003257,0.014209,0.00861,0.000256,-1.3e-05,-8e-05,-0.018473,-0.048173,-0.006395,-0.000369,-0.000218,-0.006589,-0.004066,0.014369,0.000954,0.000143,-0.000933,-0.008848,0.006256,0.007761,-0.002747
0.000305,-0.000146,-0.013969,-0.006088,-0.000328,-8.7e-05,-0.003755,-0.008751,0.022719,0.02075,0.000631,7e-06,-0.000227,0.005934,0.024185,0.004693,-0.001196,-0.000411,-0.001109,0.028614,0.063163,0.010629,0.000233,0.001014,0.005188,0.001587,0.007565,0.001672
3.1e-05,-0.003904,0.013366,0.011659,0.000701,0.000579,0.001035,0.000707,0.005258,0.002895,0.000157,1.1e-05,0.000186,0.027049,0.067119,0.011262,-0.001684,-0.001566,0.002525,0.012767,0.023832,0.005897,-4.2e-05,0.000443,0.005335,-0.01318,-0.007093,0.003983
