0.051024,0.17457,0.205351,0.204687,0.521618,1.104204,1.295063,1.128991,0.96707,0.853976,0.849019,0.800869,0.855055,0.803991,0.497422,0.25189,0.135889,0.120519,0.134541,0.12828,0.113451,0.221737,0.247304,0.103836,0.063159,0.055687,0.03824,0.028816
0.06352,0.21713,0.250988,0.241933,0.616202,1.289433,1.508377,1.293696,1.067506,0.924186,0.932873,0.915071,0.992846,0.932331,0.580839,0.292894,0.157537,0.143769,0.159721,0.150891,0.133708,0.252173,0.278492,0.118185,0.07541,0.066655,0.045164,0.034887
0.082004,0.279236,0.317974,0.293954,0.747518,1.551905,1.840059,1.543082,1.175195,0.987813,1.03316,1.068054,1.164075,1.081805,0.682316,0.34435,0.186366,0.176234,0.192222,0.179654,0.16271,0.289,0.311459,0.134474,0.09473,0.083648,0.054722,0.044161
0.090311,0.303421,0.34472,0.314069,0.798142,1.661474,2.070221,1.728084,1.18598,1.013272,1.123308,1.154609,1.166801,1.032537,0.66664,0.346207,0.193564,0.186663,0.194529,0.180745,0.171114,0.280342,0.289109,0.128027,0.104309,0.0918,0.057259,0.048904
0.090935,0.295832,0.339242,0.321089,0.807676,1.701706,2.276886,1.933727,1.262119,1.184722,1.349513,1.258223,1.062594,0.837612,0.560603,0.315403,0.186477,0.180036,0.177191,0.164541,0.162105,0.23972,0.234023,0.109,0.102677,0.090781,0.056216,0.05016
0.101384,0.320599,0.37364,0.354007,0.836101,1.807,2.49605,2.194942,1.599196,1.632534,1.792969,1.552653,1.107107,0.726812,0.477005,0.287883,0.183468,0.181146,0.178092,0.162253,0.158833,0.226666,0.215621,0.101826,0.098168,0.090083,0.062532,0.058102
0.129377,0.405029,0.482166,0.412799,0.872539,1.99141,2.783572,2.679713,2.44059,2.555829,2.637522,2.266491,1.524367,0.896135,0.559463,0.331955,0.213607,0.207486,0.217813,0.192882,0.176549,0.257474,0.243037,0.111932,0.110861,0.107535,0.084092,0.081391
0.184155,0.559173,0.658125,0.509501,1.026796,2.529297,3.688167,3.945076,4.147437,4.387538,4.39006,3.870531,2.66655,1.536055,0.934582,0.532579,0.319483,0.27277,0.287266,0.246216,0.211064,0.333036,0.315558,0.140034,0.147959,0.147657,0.118947,0.119107
0.275792,0.792383,0.876802,0.64753,1.44384,3.836374,5.833777,6.444018,6.931433,7.24713,7.160771,6.513815,4.628075,2.664414,1.59977,0.89313,0.501667,0.356988,0.354747,0.304841,0.251764,0.421936,0.402174,0.177047,0.197462,0.197364,0.158272,0.162196
0.376149,1.041134,1.075776,0.764182,2.023832,5.738055,8.954094,9.965054,10.628872,10.828328,10.576681,9.919645,7.281317,4.223817,2.490954,1.373626,0.748909,0.454557,0.411246,0.364447,0.289425,0.483285,0.467375,0.217514,0.250974,0.245086,0.188633,0.192893
0.438391,1.216556,1.200403,0.811293,2.644546,7.808472,12.258047,13.719975,14.481419,14.274165,13.640974,12.994185,9.823751,5.75202,3.29712,1.830271,1.019729,0.556526,0.458396,0.440672,0.336941,0.488301,0.473884,0.240989,0.283441,0.270844,0.197947,0.197587
0.417759,1.202001,1.176985,0.783483,3.166917,9.4104,14.488544,16.202283,16.938807,16.16617,14.97696,14.090042,10.814048,6.368256,3.504059,1.984014,1.180189,0.63993,0.504059,0.521337,0.387992,0.427441,0.40194,0.225842,0.279251,0.274083,0.198171,0.190506
0.320029,0.956261,0.972216,0.736243,3.384662,9.54743,13.951753,15.294063,15.807481,14.935737,13.741572,12.504988,9.454344,5.518398,2.861949,1.648067,1.072504,0.623302,0.512595,0.558071,0.407443,0.321233,0.277674,0.180188,0.247402,0.255618,0.197136,0.1867
0.220038,0.666871,0.735924,0.670767,3.111114,7.990105,10.778862,11.243437,11.255669,10.618979,9.8599,8.80836,6.573926,3.708112,1.747512,1.009639,0.726658,0.469536,0.438192,0.506327,0.370633,0.226474,0.17596,0.143445,0.2279,0.227277,0.179008,0.179299
0.198699,0.6636,0.795772,0.675742,2.593128,5.903237,7.177232,6.925366,6.513584,5.948454,5.442316,4.95552,3.77615,2.045838,0.910245,0.513688,0.384753,0.292148,0.341753,0.418626,0.31758,0.185776,0.138498,0.155082,0.279296,0.239232,0.159873,0.176146
0.237603,0.897014,1.149261,0.866262,2.270334,4.713621,5.14268,4.392054,3.811219,3.237501,2.947154,2.724359,2.000496,1.050071,0.531533,0.337302,0.231312,0.215273,0.308948,0.382974,0.309238,0.195346,0.144441,0.201725,0.38721,0.305682,0.183508,0.223433
0.29829,1.257095,1.691093,1.226666,2.408757,4.821879,4.870676,3.614144,2.950947,2.487983,2.400399,2.117086,1.400859,0.741883,0.464084,0.340691,0.224736,0.247249,0.385174,0.464128,0.373432,0.22341,0.152931,0.25303,0.516637,0.403081,0.250261,0.327255
0.364542,1.642758,2.242678,1.603225,2.765051,5.253578,5.249,3.628804,2.657761,2.467188,2.678376,2.25084,1.511158,0.932842,0.587283,0.419407,0.274847,0.323123,0.500762,0.576707,0.453595,0.259042,0.164874,0.302459,0.643236,0.495924,0.321025,0.441912
0.434718,1.934106,2.574657,1.793429,3.137604,5.844497,5.878232,4.026378,2.711997,2.742048,3.27523,2.685594,1.844231,1.271984,0.802533,0.534025,0.338857,0.409537,0.600719,0.634687,0.484918,0.271559,0.165028,0.319439,0.693322,0.527801,0.36342,0.519145
0.462932,1.982045,2.566392,1.714097,3.306236,6.666435,7.197418,5.079863,3.117769,3.065371,3.827063,3.143273,2.180683,1.601816,1.037981,0.636022,0.373935,0.468531,0.643984,0.610385,0.450684,0.255712,0.154986,0.286796,0.620425,0.470267,0.351932,0.51226
0.417873,1.716083,2.189066,1.394011,2.967066,6.898348,8.517403,6.295368,3.44851,3.313902,4.232032,3.385189,2.377073,1.841906,1.192206,0.678294,0.36129,0.478118,0.641149,0.56996,0.403824,0.228113,0.145668,0.225012,0.466653,0.362082,0.290812,0.415622
0.32029,1.184463,1.538072,1.020378,2.417808,6.361113,9.047547,7.012759,3.48493,3.489404,4.591899,3.571665,2.466383,1.907927,1.161334,0.631306,0.323185,0.440374,0.585124,0.529587,0.375709,0.196555,0.128876,0.162775,0.298764,0.241768,0.2063,0.28212
0.228217,0.673406,0.965284,0.795489,2.09381,5.674068,8.880393,7.108101,3.315877,3.369277,4.508789,3.507532,2.270496,1.659933,0.937048,0.50263,0.263445,0.372556,0.478358,0.438429,0.31726,0.161639,0.119504,0.137287,0.197965,0.161614,0.141148,0.178605
0.187264,0.413096,0.619892,0.659097,1.910044,5.052194,8.024983,6.370719,2.992996,2.992514,3.786351,2.985225,1.83127,1.263208,0.769364,0.427435,0.223473,0.303953,0.356554,0.325729,0.249547,0.132744,0.114011,0.133049,0.151464,0.121762,0.108007,0.120231
0.194801,0.395257,0.506143,0.583677,1.888007,4.917808,7.061471,5.14994,2.506206,2.519502,3.088412,2.419255,1.4267,0.997574,0.68256,0.406324,0.226369,0.25464,0.281116,0.272627,0.219749,0.116712,0.106598,0.119262,0.116959,0.096125,0.083228,0.080735
0.18996,0.419015,0.470413,0.527008,1.870419,4.479203,5.545553,3.7475,1.984522,2.014038,2.629332,2.165897,1.250997,0.923227,0.666932,0.416061,0.245595,0.217294,0.229725,0.230468,0.185916,0.103164,0.097783,0.094074,0.076882,0.067196,0.067155,0.065123
0.160121,0.418244,0.463758,0.479037,1.86327,3.820443,3.809611,2.484182,1.622276,1.592317,2.060999,1.79468,1.086877,0.802207,0.588325,0.40011,0.258016,0.221744,0.224407,0.201198,0.155222,0.097924,0.098096,0.078503,0.056355,0.050975,0.060097,0.064532
0.129245,0.399917,0.467381,0.490525,1.960907,3.470336,2.849776,2.098778,1.761296,1.525512,1.706166,1.439998,0.966672,0.662308,0.464318,0.36177,0.256469,0.264274,0.27874,0.223298,0.15846,0.09498,0.094402,0.068275,0.047046,0.042879,0.053857,0.06128
0.109216,0.367007,0.464884,0.495298,1.947027,3.323841,2.737167,2.306254,2.067289,1.557989,1.402212,1.178621,0.924241,0.583575,0.351735,0.325411,0.262785,0.307444,0.343211,0.287233,0.199193,0.088468,0.075344,0.055544,0.042855,0.040381,0.045797,0.049445
0.100039,0.318724,0.438019,0.456208,1.730329,3.040273,2.64889,2.339017,2.169375,1.53451,1.174162,0.950451,0.779854,0.529903,0.297724,0.276066,0.248078,0.334935,0.396713,0.359697,0.244358,0.072705,0.052701,0.0502,0.046119,0.047949,0.050346,0.04968
0.102671,0.260337,0.365281,0.429088,1.686789,3.063294,2.644541,2.05915,1.877977,1.351559,1.05343,0.881507,0.654978,0.463273,0.286297,0.230228,0.212493,0.361192,0.431393,0.405918,0.281363,0.071578,0.047148,0.058258,0.058628,0.062489,0.065908,0.06307
0.105506,0.235138,0.302819,0.420737,1.955452,3.409947,2.588715,1.657603,1.424573,1.148984,1.124252,1.00039,0.646493,0.414292,0.275832,0.190929,0.171565,0.364451,0.445537,0.409654,0.282129,0.07607,0.049924,0.066562,0.068783,0.073206,0.078048,0.073742
0.094903,0.218053,0.275697,0.425856,2.160284,3.608559,2.484527,1.38002,1.125933,0.977676,1.124179,1.029162,0.65662,0.438064,0.285086,0.193147,0.153757,0.328044,0.418045,0.359734,0.231702,0.066546,0.044887,0.062537,0.064819,0.068477,0.073765,0.068502
0.075979,0.200558,0.271466,0.39831,2.023347,3.296885,2.200791,1.157835,0.928463,0.827706,1.02302,0.937571,0.609965,0.452923,0.290615,0.200296,0.142002,0.259097,0.340351,0.27525,0.16036,0.047274,0.03211,0.045563,0.046107,0.048567,0.053714,0.049171
0.064811,0.184161,0.240571,0.2953,1.574151,2.52874,1.826144,1.186377,0.867242,0.723701,0.927606,0.83142,0.518763,0.406792,0.311192,0.221685,0.137618,0.181544,0.234412,0.213672,0.141719,0.042935,0.027483,0.030997,0.025071,0.027173,0.036216,0.037514
0.051153,0.160599,0.213012,0.212922,1.13774,1.931907,1.712761,1.258625,0.763876,0.670339,0.812809,0.639851,0.361951,0.299788,0.305822,0.255709,0.151987,0.126472,0.153913,0.179006,0.145,0.046053,0.034452,0.030816,0.015947,0.01751,0.031262,0.038033
0.040674,0.139007,0.202395,0.228139,0.935783,1.680759,1.722898,1.207734,0.700668,0.704781,0.677676,0.45254,0.238846,0.219303,0.261403,0.26036,0.171389,0.098149,0.108924,0.164609,0.146758,0.04838,0.044952,0.037723,0.018211,0.020445,0.033021,0.038951
0.034739,0.114157,0.175108,0.263647,0.862745,1.391301,1.52451,1.166353,0.761464,0.747265,0.571346,0.416854,0.248984,0.220984,0.206267,0.22217,0.180584,0.089251,0.101584,0.190966,0.155322,0.047476,0.053171,0.041888,0.02314,0.029098,0.032403,0.033684
0.035703,0.098319,0.154578,0.26726,0.82632,1.187732,1.388605,1.246888,0.926088,0.778113,0.59871,0.549138,0.343721,0.247681,0.161526,0.169181,0.179851,0.112194,0.143269,0.242836,0.177175,0.048019,0.055795,0.041536,0.02745,0.039127,0.029326,0.026119
0.037674,0.092538,0.15532,0.232117,0.858757,1.48817,1.635751,1.377448,1.108852,0.789525,0.686041,0.698458,0.445224,0.300175,0.155915,0.142041,0.185618,0.155082,0.196582,0.292276,0.208747,0.054725,0.057671,0.045129,0.035587,0.049466,0.030797,0.023143
