-0.124913,-0.145542,-0.090055,-0.050874,-0.033366,-0.036095,-0.044337,-0.015618,-0.008734,-0.004471,0.001727,0.005486,-0.002334,-0.076954,-0.147262,-0.259824,-0.3258,-0.350826,-0.346527,-0.348531,-0.35471,-0.352764,-0.406398,-0.43812,-0.385419,-0.321341,-0.321745,-0.290855
-0.327417,-0.331321,-0.21436,-0.131457,-0.092138,-0.087305,-0.106823,-0.050162,-0.028156,-0.022649,-0.028606,-0.04693,-0.17385,-0.464912,-0.586734,-0.623805,-0.587729,-0.608073,-0.624925,-0.566878,-0.591452,-0.606199,-0.624335,-0.633143,-0.622388,-0.572567,-0.579534,-0.532767
-0.222207,-0.188312,-0.133367,-0.090363,-0.066029,-0.054516,-0.065663,-0.038084,-0.021819,-0.021606,-0.037406,-0.070196,-0.23251,-0.522589,-0.616886,-0.49476,-0.337249,-0.290623,-0.288396,-0.257244,-0.266771,-0.24755,-0.189413,-0.157102,-0.237561,-0.254367,-0.246076,-0.240171
0.045,0.095637,0.049459,0.020107,0.009987,0.020978,0.026995,-3.9e-05,0.000155,-0.006989,-0.025976,-0.056803,-0.162222,-0.261064,-0.229865,0.021851,0.174095,0.264986,0.305577,0.256986,0.258323,0.313842,0.364819,0.372468,0.281284,0.263199,0.312039,0.226452
0.188609,0.209513,0.144915,0.090224,0.058614,0.059844,0.074511,0.023419,0.015005,0.005663,-0.00868,-0.020674,-0.027175,0.102827,0.26575,0.473893,0.503899,0.529004,0.542895,0.468107,0.472034,0.493833,0.441602,0.399541,0.42068,0.429456,0.481989,0.36818
0.083712,0.055248,0.072902,0.060797,0.036973,0.026593,0.033247,0.011882,0.009302,0.00635,0.002318,0.01672,0.089162,0.328779,0.476185,0.444985,0.331758,0.249377,0.211268,0.178721,0.193494,0.161366,0.06996,0.061006,0.156384,0.128758,0.122436,0.094853
-0.106832,-0.15866,-0.065953,-0.024437,-0.022185,-0.034774,-0.04553,-0.01645,-0.007959,-0.000384,0.006803,0.041751,0.148579,0.336144,0.343565,0.059016,-0.152347,-0.25152,-0.282287,-0.248952,-0.223571,-0.26267,-0.263817,-0.203342,-0.166838,-0.249774,-0.319301,-0.226522
-0.154878,-0.176161,-0.115873,-0.074818,-0.052683,-0.054271,-0.072734,-0.026274,-0.016579,-0.003343,0.010925,0.048793,0.144928,0.190271,0.066018,-0.266044,-0.407875,-0.424245,-0.434196,-0.341386,-0.32133,-0.348808,-0.284504,-0.234479,-0.262837,-0.314789,-0.393948,-0.25125
-0.010231,0.025403,-0.030991,-0.0439,-0.023059,-0.01043,-0.016561,-0.003223,-0.006385,0.002265,0.017163,0.037742,0.085349,-0.016584,-0.192998,-0.310582,-0.218442,-0.126705,-0.122652,-0.059869,-0.046569,-0.05243,-0.040183,-0.101706,-0.117048,-0.030603,-0.041898,0.008632
0.174996,0.226491,0.0907,0.032636,0.035695,0.05052,0.065153,0.0315,0.01332,0.01018,0.02057,0.013358,-0.004737,-0.194303,-0.303756,-0.114659,0.104581,0.222389,0.263867,0.214501,0.202239,0.243084,0.19239,0.066678,0.073284,0.26701,0.345089,0.247431
0.199271,0.206292,0.118347,0.076095,0.061713,0.062984,0.087242,0.043283,0.023339,0.010455,0.014013,-0.016781,-0.092371,-0.269149,-0.220239,0.131886,0.256314,0.267668,0.318298,0.213944,0.171267,0.228341,0.19096,0.175109,0.1487,0.253022,0.33757,0.203781
0.034654,-0.013449,0.026997,0.045809,0.02886,0.013349,0.026778,0.019354,0.014245,0.001511,-0.002059,-0.040826,-0.139341,-0.210943,-0.059936,0.190281,0.170007,0.05935,0.054118,0.002639,-0.024961,-0.015686,0.011644,0.153774,0.093191,-0.025751,-0.020573,-0.053217
-0.144744,-0.201125,-0.083225,-0.02336,-0.027684,-0.04676,-0.056616,-0.019968,-0.005561,-0.008544,-0.018021,-0.046002,-0.116071,-0.041043,0.087189,0.049829,-0.066417,-0.176729,-0.234234,-0.187045,-0.168656,-0.226183,-0.170653,-0.032585,-0.033931,-0.270554,-0.33559,-0.237091
-0.172673,-0.177876,-0.101849,-0.064014,-0.054148,-0.058949,-0.084071,-0.041698,-0.019597,-0.011322,-0.023623,-0.02894,-0.034855,0.153536,0.194666,-0.073512,-0.219626,-0.207052,-0.253196,-0.162742,-0.120622,-0.186887,-0.18382,-0.215024,-0.116358,-0.233703,-0.289463,-0.161971
-0.047581,0.006866,-0.020104,-0.041977,-0.029189,-0.014733,-0.033175,-0.02904,-0.017151,-0.005226,-0.016118,0.001666,0.056991,0.257788,0.202109,-0.065135,-0.098113,0.01111,0.004615,0.05248,0.073052,0.068776,0.015036,-0.159956,-0.064953,0.049186,0.062756,0.080566
0.089356,0.145355,0.069273,0.015458,0.019402,0.039092,0.04206,0.003681,-0.002235,0.003426,-0.00214,0.029974,0.111188,0.207191,0.104339,0.02788,0.135197,0.196198,0.227051,0.199019,0.189116,0.254945,0.217685,0.092809,0.050106,0.263082,0.325543,0.21794
0.096326,0.094475,0.071978,0.048208,0.0411,0.046766,0.065456,0.024333,0.009821,0.005962,0.008118,0.040607,0.101548,0.028099,-0.043314,0.081305,0.165595,0.113853,0.181945,0.105248,0.090808,0.158617,0.170483,0.231802,0.080212,0.18738,0.221783,0.097997
-0.012068,-0.070226,-0.008148,0.026401,0.016386,0.003199,0.017937,0.016162,0.008826,0.001135,0.01023,0.029513,0.043504,-0.160295,-0.188957,0.008945,-0.002924,-0.096554,-0.045839,-0.095482,-0.11521,-0.122584,-0.07334,0.09072,0.002174,-0.075227,-0.107489,-0.12845
-0.094077,-0.149423,-0.07735,-0.02096,-0.024155,-0.042121,-0.044911,-0.006175,-0.000477,-0.004067,0.007539,0.006228,-0.020352,-0.231781,-0.237862,-0.109226,-0.154016,-0.182077,-0.216116,-0.190019,-0.199441,-0.284367,-0.234161,-0.133845,-0.064576,-0.246357,-0.309087,-0.19636
