5.5e-05,5e-06,2e-05,3e-05,1.1e-05,5e-06,1.7e-05,2.1e-05,3.7e-05,3.9e-05,2.4e-05,3.1e-05,4.4e-05,4e-05,9e-05,1e-06,3.2e-05,2e-06,3.5e-05,2.6e-05,2.2e-05,4e-06,2e-05,2e-06,2.3e-05,1.3e-05,3.3e-05,1.2e-05,1.9e-05,2.3e-05,2.9e-05,4e-06,8.8e-05,0.000145,4.9e-05,0.002271,0.001167,0.000271,0.000309,0.000622,0.001395,0.00035,0.000388,0.000729,0.001409,0.001149,0.00076,0.000494,0.00046,0.000543,0.001235,0.001592,9.6e-05,0.000476,0.000176,0.00031,5.5e-05,3.9e-05,3e-05,3e-05,0.000177,4e-05,0.000193,4.5e-05,3.7e-05,0.000156,0.000599,0.000251,8.8e-05,0.00034,0.000327,0.000104,9.7e-05,1e-05,9.7e-05,0.000162,4.9e-05,4.5e-05,7.3e-05,4.7e-05,2.7e-05,4.1e-05,8.2e-05,0.000114,3e-05,1e-04,8e-06,0.00047,0.000542,7.6e-05,0.000489,0.000123,0.000207,0.000165,0.000129,6e-06,6.4e-05,8.6e-05,6.4e-05,2.7e-05,3.5e-05,5.8e-05,1.2e-05,2.3e-05,5e-06,3.6e-05,2e-06,4e-05,2.6e-05,2.9e-05,2.8e-05,1e-06,4e-06,0.00011,2.9e-05,9.4e-05,4.4e-05,7.7e-05,9e-06,3.6e-05,7e-05
0.000105,0.000103,8.8e-05,8.9e-05,7.1e-05,5e-05,5.7e-05,9.3e-05,1e-04,0.000161,0.00013,0.000142,0.000178,0.000118,0.00023,0.000207,0.000129,9e-05,7e-06,6.5e-05,9.7e-05,3.9e-05,9.5e-05,1.5e-05,4.3e-05,5.4e-05,8.6e-05,0.000105,0.000177,0.000125,0.000143,0.000105,0.000314,0.000544,0.000447,0.004313,0.003138,0.002996,0.001794,0.001508,0.003547,0.001757,0.00109,0.001539,0.00369,0.002012,0.001132,0.00401,0.003907,0.000682,0.002289,0.006513,0.003493,0.002411,0.000574,0.000515,0.000514,0.00065,0.000954,0.001579,0.000927,0.00083,0.000463,0.000461,0.000162,0.000517,0.001485,0.001286,0.001129,0.001258,0.000346,0.000311,0.000341,6.6e-05,0.000231,0.000278,0.000179,0.000249,0.00011,0.00021,0.000217,0.000105,0.00012,0.000344,0.000326,0.000208,0.000238,0.000841,0.001683,0.001484,0.000409,0.000834,0.000908,0.000877,0.000408,0.000242,0.000128,0.000179,0.000351,0.000293,1.4e-05,7.4e-05,0.000134,5.2e-05,4.5e-05,8e-05,0.000106,0.000114,7.8e-05,6.8e-05,1.8e-05,4e-05,9.5e-05,0.000157,0.000237,0.000158,0.000231,0.000116,0.000157,0.000122,0.000175
1.1e-05,2.4e-05,4.6e-05,1.8e-05,2.8e-05,6.4e-05,6.1e-05,5.4e-05,5.7e-05,5.1e-05,5.4e-05,6.7e-05,0.000132,6.5e-05,0.000103,9.8e-05,5e-05,3.1e-05,5.4e-05,1.8e-05,5.7e-05,7.3e-05,0.000129,6.9e-05,1.7e-05,5.4e-05,5.6e-05,4.4e-05,0.000203,0.000101,9e-05,8e-06,0.000486,0.001,0.000332,0.004418,0.004275,0.006388,0.002754,0.001139,0.002072,0.004672,0.002224,0.001933,0.002216,0.00477,0.00236,0.003942,0.003422,0.004027,0.002531,0.005114,0.002108,0.001103,0.001165,0.000677,0.000535,0.000923,0.000574,0.000918,0.000761,0.000342,0.000709,0.000876,0.000513,0.000888,0.000716,0.000454,0.001082,0.00083,0.001436,0.000414,0.000297,0.000161,3.4e-05,0.000501,0.000329,0.000137,9.9e-05,0.000176,0.000106,0.000126,0.000153,0.000308,0.000159,8.2e-05,0.000224,0.000688,0.001258,0.000473,0.000607,0.000602,0.000561,0.000139,0.000125,0.000284,8.8e-05,0.000335,0.000562,0.000267,6.2e-05,3.5e-05,0.000114,5.6e-05,1e-05,3.2e-05,6.7e-05,5.6e-05,1.8e-05,1.5e-05,3.4e-05,0.000155,0.000107,4.3e-05,0.00013,4.5e-05,8.7e-05,2.5e-05,1e-04,7e-05,4.4e-05
6.2e-05,3.9e-05,3e-06,5.4e-05,3.5e-05,8.5e-05,8.6e-05,9.3e-05,0.000119,4.6e-05,4.4e-05,3.3e-05,0.000124,7.5e-05,5.5e-05,6.8e-05,0.000109,4.3e-05,0.000107,6.7e-05,5.2e-05,6.2e-05,4.1e-05,8e-05,8.2e-05,1.3e-05,7.3e-05,7.2e-05,0.000268,0.000237,0.000147,1.4e-05,0.000697,0.00079,0.00127,0.00266,0.005868,0.003138,0.001464,0.000438,0.001948,0.004847,0.003401,0.004887,0.001355,0.002333,0.002378,0.004602,0.002949,0.004557,0.001972,0.004469,0.004615,0.000203,0.001092,0.001206,0.000413,0.00146,0.001894,0.002217,0.001129,0.000427,0.001084,0.000705,0.001337,0.002108,0.001895,0.000205,0.001266,0.000732,0.000464,0.000861,0.000374,0.000555,0.000468,0.00057,0.000263,0.000124,5.1e-05,0.000111,0.000147,0.000326,0.000374,0.000357,0.000132,1e-04,0.00024,0.000633,0.000491,0.000654,0.000285,0.000262,0.000488,0.000432,0.000285,9.5e-05,6.3e-05,0.00044,0.000329,7.5e-05,2.4e-05,2.9e-05,7.4e-05,9e-05,6.6e-05,6.2e-05,5.4e-05,1e-04,0.000133,0.000124,7.8e-05,0.000248,1e-04,0.000176,0.000112,9.2e-05,9.4e-05,4.2e-05,4.1e-05,6.4e-05,6e-05
4.5e-05,5.5e-05,6.5e-05,4.2e-05,6e-06,5.4e-05,3.7e-05,2.7e-05,3.5e-05,6.3e-05,1.6e-05,4.4e-05,4.8e-05,5.9e-05,9.3e-05,8.4e-05,1.1e-05,4.6e-05,3.7e-05,3.1e-05,1.6e-05,5.9e-05,0.000132,7.9e-05,1.2e-05,3e-05,4.6e-05,2.9e-05,0.000154,0.000154,9.4e-05,7.8e-05,0.001018,0.000354,0.000759,0.0029,0.006489,0.004319,0.00174,0.000767,0.001351,0.003955,0.002146,0.00362,0.004409,0.003789,0.00317,0.002678,0.004194,0.001494,0.000848,0.003419,0.003477,0.004211,0.003513,0.001715,0.001987,0.003219,0.002271,0.001575,0.001004,0.001545,0.000748,0.00089,0.000912,0.001282,0.000688,0.000548,0.000613,0.000683,0.001438,0.000543,0.000978,0.001077,0.000723,0.000655,0.000468,6.4e-05,0.000169,0.000265,0.000423,0.000458,0.000411,0.000175,0.000158,0.00016,0.000422,0.000495,0.000201,0.000423,0.000267,0.00015,0.000496,0.000297,0.000127,6.5e-05,7.1e-05,0.00065,0.000329,0.00012,4.8e-05,3.5e-05,4.6e-05,4.5e-05,1.9e-05,6e-05,1.2e-05,3.9e-05,0.000142,4.5e-05,5e-05,0.000281,0.000131,0.00013,4.4e-05,3e-05,3e-05,4.7e-05,7.2e-05,5.6e-05,8.4e-05
8.8e-05,2.4e-05,8.5e-05,0.000149,9.7e-05,3e-05,2.8e-05,6.2e-05,6.4e-05,9.5e-05,4e-05,6e-05,6.6e-05,4.3e-05,0.000147,6.9e-05,7.3e-05,6.6e-05,7.8e-05,0.000125,7.8e-05,6.8e-05,0.000166,0.000104,3.2e-05,5.1e-05,3e-05,8.1e-05,9e-05,0.000133,0.000234,0.000128,0.001172,0.000924,0.001163,0.002959,0.001853,0.001958,0.000695,0.000739,0.001322,0.0035,0.002747,0.00562,0.000667,0.00367,0.002838,0.004776,0.004844,0.00186,0.000392,0.002359,0.002663,0.003486,0.001441,0.00041,0.001093,0.003347,0.002221,0.003759,0.001887,0.00188,0.001857,0.001033,0.001483,0.001925,0.001018,0.000538,0.00123,0.001678,0.001408,0.00205,0.000813,0.000606,0.00038,4e-04,4.1e-05,0.000164,0.00013,0.000221,0.000193,0.000144,0.000106,9.6e-05,0.000205,0.000235,0.000417,0.000562,0.000958,0.000863,0.000686,0.000181,0.001373,0.000337,9.8e-05,0.000189,0.000176,0.000941,0.000411,0.000343,0.000191,8.7e-05,0.000184,7.4e-05,6.6e-05,5.5e-05,0.000115,6.2e-05,0.000151,8.8e-05,2.6e-05,0.000424,8e-05,0.000114,5.4e-05,1.6e-05,5.7e-05,8.6e-05,2.3e-05,4.2e-05,5e-06
0.00018,0.000125,7e-05,9.6e-05,7.2e-05,0.000106,8.8e-05,5.5e-05,6.5e-05,3.8e-05,2.2e-05,5.4e-05,9e-05,7.7e-05,5.5e-05,0.000178,3.1e-05,5.4e-05,0.000218,6.8e-05,6.3e-05,3.6e-05,0.000109,0.000117,9.1e-05,0.000119,9.4e-05,9.9e-05,7.7e-05,4.6e-05,0.000193,0.000116,0.001161,0.001884,0.000727,0.001503,0.006287,0.003394,0.0013,0.000638,0.001074,0.004088,0.005168,0.005174,0.00806,0.003266,0.00238,0.008006,0.005113,0.00221,0.002203,0.005862,0.001265,0.00337,0.002373,0.000799,0.001347,0.004646,0.006227,0.001831,0.002217,0.000524,0.002639,0.003215,0.002584,0.004717,0.001407,0.000444,0.002084,0.002104,6e-04,0.002095,0.000997,0.000733,0.000702,0.000749,0.000583,0.000433,0.000144,0.000419,0.000557,0.000593,0.000339,0.000264,0.000179,0.000244,0.000617,0.000366,0.001319,0.000741,0.001469,0.000929,0.001306,0.001173,0.000458,0.000179,0.000144,0.000903,0.000744,0.000522,0.000233,0.000202,0.000518,0.000189,7.3e-05,0.000118,0.000176,0.000185,0.000279,4.4e-05,4.3e-05,0.000524,0.000389,0.000165,6.3e-05,7.8e-05,7.9e-05,0.000106,8.6e-05,0.000116,0.000164
0.000132,2.8e-05,7.3e-05,5.9e-05,0.000117,0.000118,0.00011,2.1e-05,6.6e-05,0.000107,9e-05,8.5e-05,0.000203,0.000143,9.9e-05,0.000114,0.000215,8.7e-05,0.000265,6.1e-05,7.4e-05,0.000135,0.000133,1.8e-05,4.2e-05,4.3e-05,9.8e-05,0.00021,0.000167,8.4e-05,0.000189,0.000216,0.001356,0.001937,0.002337,0.002541,0.011313,0.006615,0.0018,0.000287,0.000992,0.005071,0.005556,0.007998,0.004649,0.008198,0.010889,0.016404,0.014545,0.015115,0.006505,0.008774,0.009909,0.009155,0.006404,0.004322,0.004154,0.002642,0.007081,0.008659,0.005894,0.004581,0.000704,0.002869,0.005674,0.003039,0.006902,0.005169,0.003539,0.005092,0.00248,0.000836,0.001207,0.001288,0.001254,0.000873,0.000187,0.000559,0.000723,0.000394,0.000335,0.000852,0.000548,6e-04,0.000675,0.00023,0.000474,0.000693,0.001166,0.001006,0.00174,0.001857,0.001782,0.001182,0.000834,0.00037,0.000111,0.001061,0.001961,0.001007,0.000227,9.9e-05,0.000573,0.000447,0.000291,5.7e-05,0.000247,0.000144,0.00024,0.000354,7.2e-05,0.000752,0.000447,0.000482,0.000296,0.00021,0.000247,0.000287,7.6e-05,0.00019,0.000305
0.000173,1e-04,0.000138,2.9e-05,0.000178,7.1e-05,0.000165,9.4e-05,0.000106,0.000193,0.000252,0.000254,0.000165,1e-04,0.000168,0.000125,0.000268,0.000207,0.000253,0.00024,0.000104,0.000282,0.000114,0.000188,0.000165,3.6e-05,3.1e-05,0.000152,5.1e-05,0.000211,0.000425,0.000111,0.001458,0.002275,0.002026,0.001764,0.00903,0.011145,0.006971,0.002732,0.001088,0.004249,0.004422,0.002925,0.002997,0.005867,0.006902,0.004996,0.00322,0.011385,0.00735,0.0058,0.004646,0.002989,0.001702,0.000951,0.002547,0.004876,0.0045,0.001682,0.001901,0.001384,0.001612,0.001968,0.002273,0.004804,0.005349,0.002085,0.002079,0.003874,0.002541,0.00137,0.002098,0.000847,0.000765,0.000487,0.000284,0.000368,0.000357,0.000487,0.000542,0.000697,0.000407,0.00036,0.000454,0.000326,0.000211,0.000255,0.001288,0.001128,0.001645,0.000202,9.5e-05,0.000458,0.000172,0.000149,0.00015,0.001196,0.002416,0.00174,0.001101,0.000362,0.000686,0.000632,0.000367,0.000155,0.000281,0.000209,0.000306,0.000366,0.000301,0.00098,0.000582,0.000471,0.000416,0.000178,9.7e-05,0.000151,0.000216,0.00024,0.000205
0.000563,0.00043,0.000216,0.000195,0.000241,0.000115,0.000118,0.000155,0.000149,7.5e-05,0.000223,0.000238,0.000271,0.000237,0.000271,0.000407,0.000164,0.000128,0.000394,0.000554,0.000237,0.000254,0.000289,0.000262,0.000176,0.000137,9e-05,0.000117,0.000149,0.000266,0.000411,0.000272,0.001378,0.005056,0.00287,0.001266,0.002286,0.006008,0.004505,0.001508,0.000966,0.003815,0.001205,0.003383,0.001304,0.002528,0.002038,0.003566,0.005827,0.004818,0.002007,0.003422,0.001249,0.004798,0.002025,0.001698,0.00256,0.001175,0.001511,0.00177,0.001401,0.00239,0.00126,0.000817,0.001257,0.004138,0.002182,0.000553,0.00132,0.001323,0.000557,0.001047,0.000626,0.001044,0.000588,0.000553,0.000376,3.7e-05,1.3e-05,0.000199,0.000382,7e-06,0.000178,0.000358,0.000169,0.000208,0.000348,0.000159,0.000753,0.000472,0.000723,0.001003,0.000554,0.000166,0.000139,0.000261,0.00026,0.001109,0.001781,0.000478,0.000548,0.000239,0.000629,0.000409,0.000161,0.000268,7.9e-05,0.000105,0.000407,0.000268,0.000129,0.000868,0.000761,0.000403,0.000389,0.000228,0.000236,0.000188,0.000176,0.000106,0.000433
0.000284,0.00034,0.000112,0.000234,0.000313,0.000286,0.000116,0.000242,7.4e-05,9.5e-05,8.6e-05,0.000122,0.000189,0.000284,0.00054,0.00069,0.000456,0.000188,0.000151,0.000362,0.000239,8.8e-05,0.000153,5.2e-05,0.000106,6e-06,6.8e-05,0.000161,0.000177,8.4e-05,0.000179,6e-05,0.001465,0.005259,0.002577,0.000564,0.003728,0.007297,0.003497,0.000765,0.00043,0.002259,0.000876,0.000299,0.003136,0.003633,0.003024,0.001867,0.002728,0.002689,0.001918,0.000667,0.001262,0.002997,0.001239,0.001535,0.001588,0.001381,0.001764,0.002768,0.001048,0.001508,0.002244,0.000608,0.000611,0.002684,0.001705,0.001055,0.000305,0.000456,0.000379,0.000713,0.00044,0.000563,0.000234,9.3e-05,0.000238,0.000164,0.000192,0.000147,0.000613,0.000538,0.000277,0.000174,8.1e-05,0.000127,0.000122,0.000321,0.000485,0.00034,0.000372,0.000496,7.7e-05,0.000242,0.000293,0.00024,0.000318,0.000562,0.001697,0.001251,0.00031,0.000153,0.000484,0.000229,0.000144,0.00037,0.000226,5.3e-05,0.00019,0.000246,0.000212,0.000433,0.000124,0.000129,0.000191,0.000245,2.9e-05,0.000105,8.4e-05,0.000276,0.000382
0.000324,0.000118,0.000151,0.000107,5.6e-05,0.000132,4.4e-05,0.000278,0.000216,9.3e-05,2.6e-05,8.7e-05,0.000181,0.000165,0.00025,0.000281,3e-05,6e-05,6.6e-05,0.000237,0.000134,0.000105,0.000164,0.000143,4.1e-05,1e-05,6.8e-05,0.000139,2.4e-05,0.000157,6.2e-05,6.5e-05,0.001403,0.002358,0.001589,0.000241,0.005975,0.004652,0.005154,0.003698,0.001596,0.001099,0.000641,0.002251,0.001458,0.002416,0.003766,0.0024,0.000331,0.001272,0.001471,0.003244,0.003076,0.004464,0.002357,0.001606,0.001294,0.001089,0.001942,0.000973,0.000483,0.001841,0.001348,0.001247,0.001051,0.00244,0.002589,0.00099,0.00056,0.000164,0.000407,0.00083,0.000232,0.00045,0.00024,4.1e-05,0.000149,0.000192,4.9e-05,0.000128,0.000585,0.000295,0.000197,7e-06,0.000148,6.4e-05,0.000117,0.000694,0.000305,0.000562,0.000345,0.000284,0.000175,0.000196,4.7e-05,3.5e-05,0.000205,0.000812,0.001339,0.000659,0.000258,2.4e-05,0.000214,8.2e-05,0.000208,0.000287,0.000228,9.1e-05,5.6e-05,0.000334,0.00033,0.000332,0.000194,0.000243,5e-06,7.1e-05,0.000173,0.000147,0.000205,0.000243,0.000177
8.3e-05,0.000227,0.000232,0.000177,0.000168,3e-05,2.5e-05,0.000154,7.3e-05,0.000122,0.000145,3.9e-05,0.000111,5.8e-05,0.000219,5.5e-05,0.000145,5.4e-05,0.000164,0.000158,4.7e-05,8.5e-05,0.000139,8.7e-05,2.8e-05,3.8e-05,9.5e-05,8e-05,5.7e-05,0.000102,1e-04,6.7e-05,0.001242,0.001181,0.000907,0.000654,0.005365,0.002497,0.002322,0.000471,0.000237,0.001569,0.001046,0.00239,0.00256,0.002144,0.001169,0.001789,0.002373,0.001792,0.001522,0.003278,0.003438,0.001437,0.000738,0.00226,0.002552,0.002017,0.001386,0.000239,0.001745,0.001114,0.001923,0.001667,0.002442,0.001305,0.002681,0.000626,0.000106,0.001174,0.000962,0.000864,0.000812,0.000661,0.000354,0.000217,0.000311,0.000117,9e-05,0.000225,0.000552,0.000318,0.000101,0.000109,2.3e-05,0.00017,0.000172,0.000783,0.00031,0.000592,0.000126,0.000249,0.000214,0.000121,0.000129,0.00013,7.1e-05,0.000952,0.00076,0.000471,6e-05,4.8e-05,0.000413,0.000151,0.000174,0.000106,0.000125,8.9e-05,0.00015,0.000146,0.000136,0.000456,0.000201,0.000186,4.3e-05,5.2e-05,8.9e-05,0.000193,0.00012,0.000425,0.000256
9.4e-05,0.00017,0.000101,0.000126,0.000185,0.000153,9.6e-05,8e-05,5.1e-05,0.000134,0.000159,2.9e-05,6.3e-05,0.000145,0.000237,3.9e-05,7.3e-05,9.4e-05,0.000256,0.000171,5.2e-05,5.4e-05,0.000112,6.5e-05,6.1e-05,4.2e-05,4.5e-05,6.4e-05,2.5e-05,0.000139,6e-05,6e-05,0.001091,0.001264,0.000381,0.001157,0.005077,0.005365,0.002607,0.000909,0.000537,0.002728,0.001959,0.002147,0.003443,0.002769,0.001994,0.001124,0.002082,0.001406,0.002505,0.00317,0.002651,0.00322,0.002455,0.001547,0.003265,0.000281,0.001541,0.002652,0.003283,0.001071,0.001534,0.001821,0.002883,0.002306,0.002599,0.001791,0.001357,0.002123,0.001014,0.000708,0.000687,0.000497,0.000589,0.000612,0.000623,0.000307,0.000314,0.000299,0.000322,0.000327,0.000202,0.000284,0.00026,7.8e-05,0.000298,0.000378,0.000288,0.000447,0.00022,0.000273,0.00011,4.3e-05,1e-04,1.8e-05,8.1e-05,0.000918,0.000661,0.000166,0.000332,0.00024,0.000447,0.000146,3.5e-05,0.000104,9e-05,0.000121,0.000138,8e-06,0.000182,0.00031,0.000246,0.000224,0.000108,0.000147,0.000109,0.000236,0.000145,0.000328,0.000132
0.000129,0.000121,0.000226,9.7e-05,0.000119,0.000144,5.5e-05,0.000237,0.000243,3.8e-05,0.000168,0.000191,0.000101,9.7e-05,0.00015,0.000137,4.4e-05,8.9e-05,0.000411,0.000164,1e-04,8.1e-05,4.3e-05,5e-05,3e-05,0.000106,9.3e-05,2e-06,3.1e-05,0.000196,7e-05,2.2e-05,0.000862,0.001119,0.000438,0.001091,0.003594,0.003434,0.00056,9.7e-05,0.000452,0.003758,0.001068,0.003065,0.000679,0.002731,0.004386,0.003543,0.005519,0.006858,0.002272,0.001177,0.004372,0.003188,0.002111,0.004409,0.00354,0.003031,0.001608,0.003217,0.002684,0.003504,0.0013,0.00196,0.002408,0.002147,0.00458,0.003731,0.001834,0.001122,0.001537,0.000767,0.003051,0.001622,0.001307,0.000481,0.00011,0.000533,0.000193,0.000505,0.000701,0.00072,0.00031,0.000542,0.000259,0.000624,0.000153,0.000316,4.2e-05,0.000305,0.000735,0.000241,0.000205,0.000157,0.000202,0.000247,0.000234,0.000832,0.000973,0.000604,1e-04,8.2e-05,0.000403,0.000436,3e-04,0.000217,0.000224,0.00014,8.2e-05,7.4e-05,0.000286,1e-04,0.000221,9.6e-05,9.3e-05,0.00013,3.7e-05,0.000193,0.00011,0.000536,0.000222
0.000204,8.3e-05,0.00018,0.000244,0.000199,0.000191,0.000295,0.000238,2.8e-05,0.000116,0.000166,0.00018,0.000234,0.000107,8.9e-05,3.8e-05,5.7e-05,5.3e-05,0.000404,0.000195,6.8e-05,2.3e-05,3.3e-05,3.5e-05,4.1e-05,9.5e-05,3e-05,4.4e-05,6.6e-05,0.000216,0.00017,0.00011,0.000583,0.000656,0.000765,0.00097,0.000821,0.005715,0.004335,0.001684,0.000631,0.002696,0.002862,0.005579,0.006202,0.002421,0.006397,0.005243,0.002821,0.002224,0.009003,0.005745,0.003116,0.003534,0.004572,0.006861,0.010155,0.004745,0.001935,0.004831,0.004288,0.004405,0.006653,0.001623,0.004432,0.004966,0.002052,0.001198,0.001825,0.001206,0.000954,0.002402,0.004602,0.002918,0.004095,0.002806,0.000738,0.00074,0.000692,0.000823,0.000936,0.000455,0.00029,0.000916,0.000449,0.000863,0.000777,0.000364,0.000464,0.000155,0.001143,0.000655,0.000178,9.8e-05,0.00015,0.000311,0.000124,0.000759,6e-04,0.000263,0.000301,0.000187,0.00021,0.000208,3.8e-05,6e-05,0.000118,6.2e-05,0.000182,0.000101,0.000292,0.000339,7.1e-05,3.1e-05,5.7e-05,3.1e-05,6e-05,0.000158,0.000193,0.00067,0.000269
0.000162,0.000102,8.6e-05,0.000193,0.000204,0.000191,0.000268,0.000129,9.5e-05,0.000154,0.000303,0.000105,7e-05,0.000128,5.3e-05,0.000117,0.000111,0.000125,0.00037,0.000186,7.3e-05,3.5e-05,9.4e-05,3.7e-05,4.8e-05,0.000156,8.9e-05,7.4e-05,5.4e-05,0.000204,3.1e-05,8.5e-05,0.000389,0.002362,0.001026,0.000815,0.000789,0.003405,0.00304,0.001741,0.000439,0.001236,0.002461,0.003454,0.008895,0.010283,0.009768,0.005759,0.004708,0.005202,0.009642,0.008039,0.004877,0.006546,0.011033,0.011109,0.005712,0.009402,0.00974,0.00484,0.009211,0.004415,0.009653,0.010949,0.003277,0.003905,0.004589,0.005971,0.000813,0.004049,0.005177,0.00252,0.005749,0.003163,0.003315,0.003728,0.002341,0.000698,0.000422,0.000921,0.000257,0.000153,0.000231,0.000557,0.000705,0.001085,0.000512,0.000728,0.000562,0.000572,0.001085,0.001155,0.000775,0.000353,0.000171,0.00019,7.9e-05,0.00046,0.000827,0.000849,0.000271,0.000172,9.3e-05,0.00026,0.00018,0.000126,0.000121,0.000144,0.000107,7.1e-05,0.000165,0.000444,0.000351,0.000362,6.6e-05,1.4e-05,0.000109,0.000198,0.000114,0.000487,0.000521
0.000312,0.000208,9.3e-05,9.8e-05,0.000243,3.3e-05,0.000226,0.000155,2.2e-05,6e-05,0.000235,0.000341,0.000316,0.000213,0.000153,2e-04,9.8e-05,6.8e-05,0.000486,0.00044,0.000234,5.5e-05,6.6e-05,3.9e-05,4e-05,0.000188,1e-05,6.6e-05,4.2e-05,0.000206,0.000131,0.000127,0.000387,0.003429,0.002469,0.001567,0.000394,0.000207,0.001163,0.000975,0.000419,0.000961,0.005181,0.004166,0.006156,0.004738,0.003101,0.002792,0.001613,0.003822,0.002923,0.003173,0.005877,0.006502,0.004117,0.000991,0.003697,0.00498,0.002084,0.007262,0.006856,0.00844,0.002138,0.006481,0.00566,0.004382,0.005238,0.002275,0.006615,0.00364,0.003586,0.006245,0.0022,0.000428,0.002415,0.002123,0.000691,0.000775,0.001337,0.001943,0.001897,0.001071,0.000959,0.000345,0.000948,0.001627,0.001025,0.00064,0.000132,0.000329,0.000782,0.000946,0.000441,0.000115,0.000158,9.9e-05,7.4e-05,0.000318,0.001059,0.000523,0.00041,0.000199,0.000312,0.000175,0.000238,0.000278,0.00017,0.000102,0.000144,0.000144,0.000267,0.000313,0.000174,0.000213,0.000192,3.3e-05,0.00013,0.000262,0.000204,0.000592,0.000787
0.000228,0.000105,4.5e-05,8.7e-05,0.000226,0.000309,0.000416,0.000153,0.000144,0.000129,0.00012,0.00011,0.000138,0.000199,0.000337,0.000323,0.000168,7.4e-05,0.000577,0.000433,0.000176,3.9e-05,9.1e-05,0.000112,9.9e-05,0.000301,0.00029,0.00013,6.9e-05,0.000157,0.000268,0.000112,0.000367,0.003225,0.001678,0.001266,0.002327,0.001378,0.000714,0.001453,0.000656,0.00203,0.006882,0.006565,0.005607,0.001934,0.002729,0.002413,0.002799,0.002885,0.001807,0.002661,0.007734,0.003685,0.003894,0.004906,0.006047,0.002892,0.002215,0.003672,0.004125,0.00401,0.004178,0.002541,0.002069,0.000863,0.003546,0.005667,0.003449,0.003568,0.001122,0.002428,0.000423,0.000485,0.001423,0.002811,0.002119,0.001465,0.000776,0.000987,0.000517,0.001117,0.000747,0.000688,0.001046,0.000561,0.000177,0.000182,0.000111,0.000192,0.000647,0.000471,0.000167,6.6e-05,0.000151,6.1e-05,0.000127,0.000271,0.001044,0.000583,0.00043,0.000231,0.000463,0.000281,4.8e-05,0.000248,0.000223,0.000354,0.000269,0.000251,5.4e-05,0.000307,0.000103,0.000203,0.000138,0.000164,0.000154,0.000166,0.000188,0.000513,0.000722
0.000185,0.000191,0.000115,0.000121,0.000261,0.000344,0.000131,0.000157,0.000105,0.000107,0.000122,7.7e-05,0.000154,2.5e-05,0.000328,0.000142,1.8e-05,4.9e-05,0.000578,0.000227,7.9e-05,5.2e-05,4.7e-05,0.000132,9.4e-05,0.000187,0.000244,0.000198,0.000111,0.000126,0.000317,0.000166,0.000443,0.002366,0.001203,0.000887,0.003298,0.001516,0.000828,0.000953,0.001458,0.002695,0.006331,0.002294,0.002814,0.003127,0.001675,0.001105,0.003516,0.001191,0.001714,0.003022,0.00405,0.003031,0.002096,0.004161,0.001158,0.002215,0.00421,0.001508,0.001479,0.002216,0.001621,0.002048,0.002625,0.003671,0.004989,0.002114,0.003438,0.003368,0.002829,0.000922,0.001479,0.001306,0.001201,0.000452,0.000482,0.000374,0.000604,0.000871,0.001023,0.001093,0.001003,0.000298,0.000439,0.000113,0.000257,0.000299,0.000177,0.000187,0.00036,7.8e-05,2e-05,8.6e-05,4.3e-05,7.1e-05,9.6e-05,0.000416,0.000668,0.000476,9.9e-05,1.9e-05,0.000413,0.00033,0.000224,0.000118,5.1e-05,0.000154,3.6e-05,0.000131,0.000193,0.000628,0.000396,0.000144,2.4e-05,9e-05,0.000178,0.000179,7.5e-05,0.000527,0.000475
8.3e-05,0.000165,0.000217,0.000302,0.000173,0.000126,0.000278,0.000298,0.000211,4.1e-05,0.000121,8.1e-05,0.000116,9.5e-05,0.000308,0.000118,0.000106,7.8e-05,0.000616,0.000348,0.000151,1.9e-05,0.000101,6.9e-05,1.9e-05,0.000127,3.9e-05,4.3e-05,6.7e-05,0.000201,0.000211,0.000142,0.000496,0.001891,0.001277,0.00014,0.003423,0.002575,0.002427,0.001453,0.000964,0.001386,0.001212,0.002611,0.000626,0.000769,0.000847,0.001559,0.003633,0.001518,0.001314,0.003242,0.000641,0.00359,0.002582,0.002452,0.001785,0.002866,0.002381,0.0014,0.001435,0.000992,0.002586,0.003323,0.004891,0.0043,0.001175,0.001647,0.001732,0.002446,0.002799,0.000891,0.001779,0.001918,0.001073,0.000185,0.000333,0.000194,0.00036,0.000472,0.000152,0.000671,0.000203,0.000176,0.000268,0.000266,0.000129,0.000219,0.000133,0.00019,0.000268,4.8e-05,0.000112,7.6e-05,9.7e-05,0.000119,4.8e-05,0.000373,0.000521,0.000364,0.000213,5.7e-05,0.000359,0.000176,4.6e-05,3.3e-05,0.000125,6.2e-05,2.1e-05,7e-05,0.000121,0.000873,0.000652,0.000278,6.6e-05,0.000113,4.3e-05,0.000238,0.000145,0.000338,0.000218
0.000115,0.000168,7.8e-05,0.000276,0.000249,8.1e-05,7.9e-05,4.9e-05,4.5e-05,7.6e-05,8.7e-05,8.7e-05,8.9e-05,5.5e-05,0.000249,7.9e-05,0.000129,9.2e-05,0.000478,0.000232,0.000117,3.6e-05,5.5e-05,1.6e-05,2.9e-05,3.5e-05,5.7e-05,3.2e-05,6.3e-05,7.8e-05,6.3e-05,0.000104,0.00042,0.001508,0.000561,0.000228,0.00241,0.000901,0.000497,0.000762,0.000326,0.000975,0.001468,0.00262,0.002164,0.000929,0.000165,0.000319,0.002327,0.001014,0.000642,0.002554,4e-05,0.002281,0.001284,0.000849,0.00173,0.001644,0.001177,0.000993,0.000498,0.000679,0.001429,0.001934,0.002103,0.002609,0.00209,0.000897,0.001017,0.002459,0.001692,0.001636,0.001315,0.000757,0.000646,0.000641,0.000339,0.000237,0.00015,0.000159,0.000448,0.000409,0.00017,1.3e-05,0.000187,0.000308,0.000203,0.000135,0.000189,0.000125,0.000252,1.8e-05,0.000128,8.5e-05,8.6e-05,2.1e-05,1.2e-05,0.000244,0.000618,0.000334,4.8e-05,0.000146,0.000317,0.000145,6.5e-05,5.8e-05,0.000171,6.1e-05,5.4e-05,4.4e-05,9.7e-05,0.000987,0.000587,0.000252,3.9e-05,0.000115,0.000177,0.000316,0.000176,0.000256,0.000112
0.000121,5.4e-05,4.6e-05,6.2e-05,7.4e-05,4e-05,2.1e-05,1.4e-05,1.4e-05,2.3e-05,5.1e-05,6.5e-05,3.2e-05,4.4e-05,2e-05,4.5e-05,5.1e-05,2.4e-05,0.000156,9.3e-05,3.4e-05,1.7e-05,2.8e-05,7e-06,1.3e-05,1.2e-05,1.6e-05,4e-05,5.7e-05,4.4e-05,6.1e-05,9.7e-05,0.000249,0.00084,0.000483,0.000182,0.000501,0.000384,0.000169,0.000271,0.000276,0.000522,0.000711,0.000484,0.000261,0.000598,0.000238,0.000659,0.000402,9e-05,0.000201,0.000923,0.000769,0.001126,0.000591,0.000288,0.00066,0.000297,0.000491,0.000661,0.000368,6e-04,0.000617,0.000923,0.000483,0.000444,0.00055,0.000314,0.000347,0.000764,0.000451,0.000376,0.000135,0.000259,9.8e-05,9.4e-05,9.4e-05,6.6e-05,1.3e-05,7.2e-05,0.00013,0.000116,4.8e-05,9.8e-05,4.9e-05,8.1e-05,2.5e-05,3.5e-05,6e-05,1.5e-05,0.000103,4.6e-05,6e-06,2.7e-05,2.2e-05,7e-06,1.1e-05,0.000115,0.000297,0.000155,6.4e-05,3.1e-05,0.000127,7.2e-05,6.5e-05,2e-05,7.6e-05,9.2e-05,7.5e-05,4.2e-05,5e-05,0.000408,0.000167,5.4e-05,2.7e-05,1.4e-05,5.3e-05,9e-05,3.1e-05,0.000134,3.9e-05
3.3e-05,4.6e-05,2.6e-05,1.8e-05,4.6e-05,2.2e-05,1.6e-05,5.7e-05,4.3e-05,9e-06,2.2e-05,2e-05,1.4e-05,3.3e-05,5.3e-05,1e-05,2.7e-05,1e-05,6e-05,4.8e-05,9e-06,1e-05,9e-06,1.8e-05,1.4e-05,4e-06,1.2e-05,4.2e-05,1.4e-05,3.7e-05,6.7e-05,7e-06,0.00022,0.000688,0.000353,0.00032,0.000147,0.000383,0.000184,0.000244,3.7e-05,0.000459,0.000105,0.000184,0.000262,0.000388,0.00059,0.000711,0.000379,0.000563,0.000404,0.000675,0.000565,0.000471,0.000423,0.000429,0.000354,0.000182,0.000769,0.000552,0.000648,0.000764,0.000729,0.000361,0.000578,0.000466,0.000346,0.000257,0.000437,0.00014,0.000112,0.000166,0.000215,0.000144,0.000148,4.8e-05,8.1e-05,8.4e-05,8.2e-05,6.6e-05,8.6e-05,0.000142,9.1e-05,3.6e-05,4.8e-05,2.6e-05,2.9e-05,3.8e-05,8e-06,6.5e-05,5.4e-05,3e-05,3.5e-05,3.2e-05,2.4e-05,1.7e-05,4e-06,0.000148,0.00019,8.8e-05,4e-05,4.6e-05,5.6e-05,6e-05,2.2e-05,2.7e-05,3.4e-05,1.5e-05,1.9e-05,1.1e-05,6.8e-05,0.000203,0.000115,4.2e-05,3.4e-05,3.1e-05,1.5e-05,5.8e-05,4.9e-05,9e-05,2e-05
7e-06,5e-06,1.6e-05,3.2e-05,4.1e-05,5e-05,3.3e-05,2.7e-05,9e-06,2e-05,4.3e-05,2e-05,2.2e-05,2.8e-05,5.1e-05,1.7e-05,1.3e-05,3e-06,8.2e-05,3.7e-05,1.8e-05,1.8e-05,1.3e-05,1.9e-05,9e-06,1.2e-05,1.3e-05,2.5e-05,9e-06,2.3e-05,2.7e-05,4.3e-05,0.000166,0.000227,7.9e-05,0.000279,0.000349,0.000158,8.3e-05,0.00012,0.000213,0.000284,0.000401,0.000271,0.000301,6e-04,0.000918,0.000358,0.000557,0.000627,0.000852,0.000293,0.000664,0.000244,0.000393,0.000477,0.000278,0.000244,0.000394,0.00026,0.000238,0.000628,0.000534,0.000134,0.000301,0.000774,0.000696,0.000195,0.000413,0.000415,0.00015,0.000152,0.000206,8.3e-05,7.9e-05,9.4e-05,6.4e-05,7.2e-05,4.5e-05,2.2e-05,8.1e-05,4.5e-05,4.8e-05,2.5e-05,4e-05,4.9e-05,1.4e-05,1.8e-05,2.1e-05,4.6e-05,4.5e-05,3.9e-05,5e-05,2.6e-05,5.1e-05,2.7e-05,1.4e-05,0.00015,3.4e-05,1.7e-05,1.1e-05,4.9e-05,1.7e-05,1.3e-05,3e-05,1.1e-05,3.7e-05,2.5e-05,3.1e-05,1.2e-05,6.2e-05,7.1e-05,3.7e-05,2.5e-05,1.9e-05,3.6e-05,2.1e-05,3.6e-05,1.2e-05,8.3e-05,3.8e-05
1.1e-05,4.1e-05,2.2e-05,2.3e-05,3.6e-05,4e-05,2.9e-05,7e-06,1e-05,2.6e-05,2e-05,8e-06,1e-05,6e-06,3.7e-05,4.2e-05,2.1e-05,4e-06,8.7e-05,5.2e-05,2e-05,1.6e-05,4e-06,1.5e-05,7e-06,1.4e-05,1.1e-05,2e-05,3e-06,3.1e-05,2.3e-05,2.9e-05,0.000158,0.000156,0.000124,0.000264,5.7e-05,0.000424,0.000365,0.000184,0.000106,0.000162,0.000282,8.4e-05,0.000383,0.000468,0.000469,0.000195,0.000721,0.000592,0.000174,0.000551,0.000124,0.000282,0.000689,0.000105,0.000163,0.000461,0.000554,0.000115,0.000747,0.000859,0.000189,0.000588,0.000398,0.000704,0.000243,0.000273,0.000402,0.00016,0.000127,0.000131,0.000199,0.000112,9.3e-05,6.4e-05,3.4e-05,3.3e-05,4.1e-05,3.2e-05,8e-05,2.2e-05,4.2e-05,2.2e-05,3.3e-05,4.4e-05,5e-06,1.5e-05,2.4e-05,3.2e-05,4.3e-05,6e-06,1.1e-05,1.2e-05,3.4e-05,2.5e-05,2.2e-05,0.000156,7.5e-05,4.1e-05,1.6e-05,3.3e-05,4.2e-05,5.2e-05,1.8e-05,2.3e-05,3e-05,1.8e-05,2.6e-05,7e-06,5.9e-05,8.9e-05,5.8e-05,1.7e-05,7e-06,2.3e-05,1.5e-05,5.5e-05,4.7e-05,4.2e-05,5.2e-05
1.1e-05,4.4e-05,3.2e-05,2e-05,2.5e-05,2.5e-05,1.2e-05,2.2e-05,1.7e-05,1.3e-05,1.4e-05,2.6e-05,5e-06,4e-06,4.9e-05,1.9e-05,4e-06,1.6e-05,5.5e-05,2.8e-05,1.6e-05,5e-06,7e-06,1e-05,7e-06,5e-06,1.2e-05,2.7e-05,1.3e-05,3.7e-05,1.9e-05,1.2e-05,0.000128,0.000291,0.000168,0.00021,0.000438,0.000278,8.3e-05,4.2e-05,9.1e-05,0.000156,0.000169,0.000243,0.000118,0.000549,0.000631,0.000357,0.000508,0.000417,0.000327,0.000592,0.000101,0.00022,0.000351,0.000487,0.000166,0.000284,0.000284,0.000535,0.000613,0.000504,0.000261,0.000619,0.000192,0.000509,8.8e-05,0.000162,0.000224,0.000165,0.000154,8.4e-05,8.9e-05,6.3e-05,0.000119,4e-05,3.9e-05,3.5e-05,2.1e-05,1.3e-05,5.1e-05,3.6e-05,5.8e-05,1.7e-05,5e-05,2.6e-05,5e-06,3.6e-05,2.1e-05,3.3e-05,5.3e-05,4.4e-05,7e-06,1.5e-05,1.5e-05,4e-06,7e-06,0.000147,0.000101,7.6e-05,3.9e-05,2.2e-05,6e-06,1.5e-05,2.5e-05,1.4e-05,4.2e-05,2.8e-05,1.9e-05,8e-06,5.9e-05,6.3e-05,1.5e-05,1.2e-05,1.7e-05,1e-06,1e-05,5.8e-05,1.5e-05,1.6e-05,2.4e-05
1.2e-05,1.7e-05,1.3e-05,1.2e-05,3e-05,2.8e-05,1.4e-05,2.4e-05,2.4e-05,2.2e-05,2.2e-05,1e-06,1.4e-05,8e-06,6.7e-05,3.4e-05,1.7e-05,1.6e-05,6.1e-05,3.9e-05,9e-06,5e-06,3e-06,6e-06,1.7e-05,9e-06,1.4e-05,1.4e-05,7e-06,3.9e-05,4e-06,2.5e-05,7.9e-05,0.000398,0.000188,0.00017,0.000368,0.000439,0.000112,1.8e-05,9.5e-05,0.000146,0.000153,0.00045,0.000253,0.000492,7.4e-05,0.000253,0.000239,0.00029,9.7e-05,0.000285,0.000201,0.000323,0.000149,0.000251,0.000374,5.8e-05,0.000166,0.000565,0.000274,0.000371,0.00028,0.000151,0.000351,0.000392,0.000302,0.000106,0.000296,0.000241,1.8e-05,0.000164,6.4e-05,0.000147,0.000124,3.4e-05,2.7e-05,1.8e-05,1.9e-05,3e-05,6.5e-05,2e-05,8e-05,1.8e-05,7.1e-05,3.5e-05,1.1e-05,3.2e-05,2.1e-05,4.1e-05,8.4e-05,3.7e-05,1e-05,1.4e-05,8e-06,1.1e-05,2e-05,0.000124,0.000113,6.8e-05,3e-05,5e-06,4.2e-05,4.1e-05,1.6e-05,1.4e-05,3.5e-05,1.9e-05,1.5e-05,2.7e-05,3.3e-05,3e-05,4.4e-05,1.4e-05,3.2e-05,1.4e-05,3.6e-05,5.5e-05,4.1e-05,1.4e-05,2.2e-05
1.2e-05,2e-06,8e-06,6e-06,3.2e-05,1.3e-05,7e-06,1.2e-05,9e-06,7e-06,1e-05,4e-06,2e-05,1.1e-05,3.5e-05,2.2e-05,1.3e-05,1.7e-05,7e-05,2.6e-05,6e-06,6e-06,2e-05,7e-06,9e-06,6e-06,1.6e-05,1.2e-05,1.5e-05,1.9e-05,1.1e-05,3.6e-05,6.8e-05,0.000436,0.000269,6.8e-05,0.000132,0.000169,0.000346,0.000181,7.4e-05,0.000248,0.000358,0.000381,0.000107,0.000284,0.000237,0.000218,0.000259,0.00016,0.000273,0.000287,0.000247,0.000616,6.9e-05,0.000285,0.000174,0.000282,0.00079,0.000148,0.000147,7.5e-05,0.000264,0.000206,0.000546,0.000519,0.000584,0.000336,0.000159,0.000505,9.8e-05,0.00013,0.00021,0.000155,0.000123,4.5e-05,5.6e-05,9.5e-05,8.1e-05,7.4e-05,8.8e-05,1.2e-05,7.8e-05,6e-05,6.4e-05,6.7e-05,3.9e-05,2e-05,2.3e-05,4.2e-05,7.5e-05,4.7e-05,7.3e-05,6.1e-05,2.8e-05,1.3e-05,1.6e-05,0.000117,7.2e-05,1.4e-05,2.7e-05,2.5e-05,6.1e-05,5.8e-05,3.5e-05,2.4e-05,5.3e-05,3.3e-05,4.5e-05,1.3e-05,2.8e-05,7e-05,4.8e-05,2.9e-05,3.9e-05,2.6e-05,2.5e-05,3.3e-05,1.1e-05,3.1e-05,2.5e-05
1.5e-05,1.3e-05,7e-06,1.3e-05,2.8e-05,1.5e-05,4e-06,1.8e-05,7e-06,1.2e-05,1.7e-05,2.4e-05,1.4e-05,1.5e-05,1.6e-05,2.7e-05,1.7e-05,1.3e-05,6.2e-05,3e-05,1.4e-05,1e-05,1.9e-05,1.3e-05,9e-06,7e-06,7e-06,8e-06,2e-06,2.3e-05,1.2e-05,1.9e-05,2.1e-05,0.000403,0.000238,9.8e-05,0.000405,0.000394,4e-04,0.000311,0.000235,0.00045,6.8e-05,0.00068,0.000806,0.000504,0.000251,0.000429,0.000499,0.000141,0.000166,0.000164,0.000869,0.000538,0.000288,0.000274,0.000255,0.000335,0.000812,0.000765,0.000264,0.000257,0.000164,5.4e-05,0.00046,0.000325,0.000203,0.000285,0.000295,0.000231,0.00036,0.000335,0.000157,0.000125,0.000195,0.000177,0.000114,6.1e-05,0.000149,0.000132,0.000114,6.9e-05,0.00011,7.9e-05,4.6e-05,0.000117,7.8e-05,7.9e-05,5.5e-05,4e-05,8.8e-05,8.2e-05,6.9e-05,4.2e-05,2.3e-05,3.2e-05,1e-05,0.000108,4.9e-05,6.4e-05,8e-06,7e-06,4.7e-05,6e-06,1.6e-05,2.2e-05,3e-05,2.3e-05,4e-05,4.3e-05,1.4e-05,9.8e-05,7.9e-05,2e-05,2.6e-05,4e-06,1.3e-05,2.1e-05,8e-06,5.1e-05,2.7e-05
1.3e-05,1.4e-05,1.8e-05,1.7e-05,2.8e-05,1.6e-05,1.1e-05,1.4e-05,2.6e-05,2.1e-05,6e-06,2.2e-05,2.3e-05,3.3e-05,5e-05,3.2e-05,1.3e-05,1.1e-05,5.1e-05,2e-05,9e-06,6e-06,1.6e-05,1e-06,1.3e-05,5e-06,6e-06,8e-06,7e-06,3.2e-05,1.5e-05,1.5e-05,4.2e-05,0.000203,0.000114,0.00011,0.000325,0.000283,0.000376,0.000133,2.5e-05,0.000498,0.000423,0.000712,0.000138,0.000312,0.000311,0.000392,0.00018,0.000155,0.000242,0.000297,0.00054,0.000323,0.000127,0.000166,0.000295,0.000428,0.000193,0.000208,0.000225,0.000371,0.000141,1.7e-05,0.000358,0.000607,0.000234,0.000396,0.000486,0.00067,0.00061,0.000165,0.000141,2.1e-05,0.000311,8.1e-05,0.000118,9.7e-05,0.000198,5.6e-05,0.000182,4.5e-05,5.6e-05,0.00011,0.000107,3.5e-05,1.5e-05,7.3e-05,1.2e-05,5.3e-05,7.7e-05,6.4e-05,3.1e-05,2e-06,2.5e-05,8e-06,1.9e-05,7.7e-05,7.3e-05,1.7e-05,2.1e-05,3.2e-05,1.9e-05,9e-06,3.1e-05,8e-06,3.9e-05,3.3e-05,1e-05,1e-06,1.2e-05,0.000123,5.8e-05,4.9e-05,2.5e-05,5e-06,1.9e-05,3.7e-05,2.1e-05,8.1e-05,3.7e-05
2.9e-05,5e-06,2.6e-05,1.4e-05,2.7e-05,2e-05,2e-06,1.1e-05,1.7e-05,1e-05,1.1e-05,9e-06,8e-06,3.2e-05,6.9e-05,1.8e-05,4e-06,5e-06,2.9e-05,4.1e-05,1e-05,4e-06,2e-06,1e-05,1.1e-05,4e-06,9e-06,6e-06,7e-06,2.1e-05,9e-06,1.5e-05,4.2e-05,7.1e-05,0.000114,0.000187,0.000157,0.000163,0.000178,0.000158,0.000122,0.000534,0.000358,0.000369,0.000476,0.000154,7.6e-05,0.000309,4.9e-05,0.000201,0.000165,0.000396,0.000276,0.00028,0.000182,0.000142,0.000239,0.000398,0.000225,0.000134,0.000233,7.3e-05,0.000185,0.000106,0.000143,0.000161,0.000281,0.000326,0.000159,0.00037,0.000129,0.000304,0.000344,0.000215,0.000313,0.000149,0.000142,0.000126,4.7e-05,3.7e-05,0.000144,0.000129,0.000107,0.00015,8.4e-05,7.8e-05,5e-05,6.6e-05,4e-05,4.6e-05,0.000113,8.3e-05,4.2e-05,2.8e-05,1.7e-05,1.4e-05,2.7e-05,8.4e-05,0.000103,4.2e-05,3.1e-05,3.1e-05,3.5e-05,2.3e-05,3.9e-05,2.8e-05,4.8e-05,2.1e-05,6e-06,1e-05,1.9e-05,0.000108,9e-06,1.5e-05,1.2e-05,4e-06,2.4e-05,4.8e-05,3.3e-05,8e-05,4.4e-05
1.7e-05,3.1e-05,1.6e-05,2.9e-05,1.6e-05,9e-06,1.7e-05,8e-06,1.2e-05,2.1e-05,2.3e-05,2e-05,3e-05,2.6e-05,1.6e-05,2e-05,1.9e-05,8e-06,3.5e-05,4e-05,2.3e-05,7e-06,2.1e-05,1.9e-05,4e-06,1.1e-05,1.6e-05,1.2e-05,2e-05,9e-06,2.2e-05,2.2e-05,7.5e-05,9.1e-05,0.000166,0.000179,0.000372,0.000282,0.000215,6.5e-05,5.6e-05,0.000473,0.000461,0.00031,0.000241,0.000234,0.000244,0.000163,4.3e-05,0.000265,9.8e-05,0.000228,0.000201,0.000146,0.000194,0.000228,0.000332,0.000391,0.000302,0.000458,0.000136,0.00015,0.000246,0.000187,5.6e-05,0.000135,0.000301,0.000183,0.000115,0.000192,0.00014,0.000189,0.000259,0.000211,5.7e-05,5.2e-05,9.8e-05,2.1e-05,6.2e-05,6.3e-05,8.3e-05,8e-05,0.000122,5.2e-05,6.4e-05,4e-06,2.4e-05,4.5e-05,6.1e-05,8e-06,0.000104,6.6e-05,3.4e-05,3.2e-05,2.5e-05,2.7e-05,2.8e-05,7e-05,0.000115,8.6e-05,4.2e-05,2.3e-05,3.3e-05,2.5e-05,3.9e-05,1.6e-05,3.4e-05,2.4e-05,2.3e-05,1.6e-05,3.7e-05,3.6e-05,3.6e-05,1.7e-05,2.2e-05,1.5e-05,3.1e-05,6.3e-05,2.2e-05,7.9e-05,3.3e-05
1.1e-05,4.2e-05,3.1e-05,4.3e-05,3.7e-05,4.3e-05,1.2e-05,2.9e-05,4.1e-05,2.3e-05,7e-06,1.6e-05,3.4e-05,7e-06,4.5e-05,2.1e-05,2.5e-05,8e-06,7.6e-05,3.2e-05,1.6e-05,1.2e-05,2.2e-05,9e-06,4e-06,1.5e-05,1e-05,1.1e-05,2.7e-05,8e-06,3.1e-05,3.9e-05,8e-05,0.000199,0.000116,0.000113,0.000334,0.000499,0.00022,0.000118,7.5e-05,0.000413,0.000275,0.000395,0.000404,0.000287,0.000345,0.000182,0.000494,0.000535,0.000328,0.000242,0.000289,0.000172,1e-04,0.000318,0.000253,0.000142,0.000221,0.000262,9.7e-05,0.000117,0.000164,0.000205,0.000197,0.000294,0.000319,0.000119,9.6e-05,0.000144,9.8e-05,0.000102,0.000103,0.00012,2.7e-05,0.000147,3.3e-05,6.4e-05,9e-05,4.6e-05,7.2e-05,6.1e-05,0.000134,0.000101,6.5e-05,2.7e-05,2.4e-05,5.4e-05,9e-05,9e-05,5.7e-05,5.2e-05,1.2e-05,6.6e-05,5.7e-05,5.2e-05,3.4e-05,7.2e-05,2e-04,8.4e-05,3.4e-05,6e-06,3.5e-05,3.7e-05,4.4e-05,9e-06,6.4e-05,9e-06,3.5e-05,1.2e-05,2.7e-05,7.9e-05,4.2e-05,3.9e-05,2.3e-05,2.6e-05,4e-05,8.2e-05,5.4e-05,6.6e-05,9e-06
4.1e-05,6.5e-05,5.5e-05,2.4e-05,3.9e-05,9.5e-05,6.1e-05,1.9e-05,3.2e-05,2.5e-05,9e-06,3.9e-05,1.1e-05,2.7e-05,8.5e-05,4.2e-05,3.9e-05,1.6e-05,0.000128,4.3e-05,1.5e-05,1.9e-05,2.3e-05,3.1e-05,1.1e-05,7e-06,2.2e-05,2.6e-05,1e-05,1.8e-05,2.8e-05,3.6e-05,8.5e-05,0.000251,0.000142,0.000106,0.000413,0.000781,0.000403,0.000277,0.000159,0.000232,3.7e-05,0.000334,0.000167,0.000186,0.000142,0.000347,0.000594,0.000241,0.000211,0.000191,0.000236,0.000256,0.000148,0.000232,8.8e-05,0.000193,0.000225,8.8e-05,0.000238,0.000126,0.000321,0.000192,0.00029,0.000293,0.000118,0.000118,9.5e-05,9e-05,3.5e-05,0.000137,0.000223,1.9e-05,5.4e-05,8.6e-05,7.4e-05,6.6e-05,8.4e-05,3.8e-05,4.9e-05,6.2e-05,8.5e-05,7.9e-05,2.4e-05,4.5e-05,8e-06,2.7e-05,5.7e-05,1.3e-05,1.9e-05,6e-05,6.7e-05,6.8e-05,2.1e-05,5e-05,4.4e-05,9.1e-05,0.000248,0.000139,3.5e-05,7e-06,1.6e-05,2.7e-05,3e-05,2e-05,7.7e-05,9.9e-05,9.2e-05,4.4e-05,4e-06,4.5e-05,7.2e-05,2.9e-05,1.8e-05,3.4e-05,4e-05,0.000143,7.6e-05,6.1e-05,7.4e-05
3.1e-05,4.9e-05,3e-05,1.7e-05,4.6e-05,8.2e-05,6.9e-05,5.4e-05,5.3e-05,4.3e-05,4.6e-05,3.9e-05,3.6e-05,2.5e-05,0.00013,5.6e-05,2.1e-05,1.4e-05,0.000149,8.7e-05,3.3e-05,8e-06,1.8e-05,1.2e-05,2e-05,6e-06,8e-06,2e-05,1.6e-05,1.5e-05,3.3e-05,1.3e-05,9.7e-05,0.000184,0.000248,0.000145,0.000398,0.000637,0.00037,0.000125,0.00014,0.000266,5.7e-05,0.000181,0.000311,0.000246,7.9e-05,0.000283,0.000252,0.000196,0.000124,0.000187,0.000229,0.000122,0.000139,0.000177,0.000276,0.000291,0.000218,0.000196,4e-05,0.000103,0.000214,0.000128,0.000198,0.000102,0.00041,0.000342,0.000277,0.000144,0.000106,4.6e-05,0.000168,0.000108,2.8e-05,3.8e-05,3.3e-05,1.2e-05,2.9e-05,3.4e-05,5.2e-05,5.3e-05,5e-05,1.3e-05,3.7e-05,7e-05,2.8e-05,5.2e-05,1.3e-05,3.3e-05,6.5e-05,5.1e-05,1.5e-05,5e-05,7.2e-05,5.7e-05,3.8e-05,9e-06,0.000115,6.7e-05,4.4e-05,1.7e-05,4.5e-05,3.3e-05,5.1e-05,1.7e-05,6.4e-05,7.1e-05,1.2e-05,9e-06,1e-05,6.8e-05,7e-06,7e-06,1.4e-05,1.5e-05,3.9e-05,0.00013,7.5e-05,7.9e-05,0.000112
3.8e-05,3.7e-05,2.7e-05,1.4e-05,6.2e-05,1.9e-05,3e-05,8e-06,2.3e-05,1e-05,2.4e-05,1.7e-05,1e-05,1e-05,0.000105,5.7e-05,1.6e-05,5e-06,0.000152,0.000111,5.1e-05,1.5e-05,1.6e-05,1.5e-05,2.8e-05,1.7e-05,1.3e-05,1e-05,1.5e-05,2.9e-05,3e-05,2.1e-05,0.000141,9.7e-05,0.000272,0.000137,0.000243,0.000397,3e-06,3.7e-05,5.8e-05,0.000254,0.000303,0.000133,0.000237,0.000342,0.000168,0.000246,0.000452,0.000331,0.000225,0.000271,2.1e-05,0.000198,0.000224,0.000166,0.000235,0.000208,0.000118,0.000396,0.000165,0.000116,2.2e-05,0.00015,1e-04,0.000174,0.000309,1.8e-05,0.000225,3.4e-05,7e-05,9.4e-05,0.00015,0.000111,0.000155,9.6e-05,6e-05,4.1e-05,1e-04,7.4e-05,0.000118,2.5e-05,3.1e-05,8.4e-05,6e-05,2.3e-05,7.5e-05,4.7e-05,4.6e-05,3.6e-05,8.9e-05,0.000116,6.7e-05,6e-05,4.3e-05,5.6e-05,2.1e-05,2.4e-05,0.000198,8.6e-05,5.6e-05,8.6e-05,0.000101,4.7e-05,8.5e-05,6.5e-05,1.9e-05,2.3e-05,2.4e-05,1.5e-05,1.7e-05,0.000174,8.1e-05,2.6e-05,2e-05,2.4e-05,1.9e-05,8.9e-05,4.5e-05,9.9e-05,0.000123
1.6e-05,1.9e-05,3.8e-05,3.2e-05,3.5e-05,4.3e-05,2e-05,1.6e-05,1.2e-05,1.6e-05,2.4e-05,1.5e-05,1.8e-05,1e-05,7.7e-05,7.8e-05,3e-05,1.5e-05,0.000118,0.000108,5.7e-05,1.9e-05,2e-06,3e-06,1.8e-05,1.6e-05,4e-06,2.4e-05,7e-06,2.1e-05,3.7e-05,1.9e-05,0.000147,0.000251,0.000322,0.000257,0.00019,0.000233,0.000173,0.000114,0.000156,0.000141,0.000212,0.000267,0.000105,0.000441,0.000184,0.000297,0.000451,0.000302,0.000116,0.00033,0.00014,3.6e-05,0.000151,0.000326,0.000162,0.000194,0.000194,0.000295,0.000235,0.000201,0.000136,0.000144,2.5e-05,0.000259,0.000276,0.000205,0.000314,0.000229,0.000239,9.4e-05,0.000175,5.9e-05,0.000117,0.000121,0.000108,2.3e-05,9.2e-05,3.4e-05,8e-05,8.2e-05,5.3e-05,0.000108,8.3e-05,3.9e-05,6.9e-05,7.4e-05,2.2e-05,3.6e-05,0.000105,0.000106,4.9e-05,1e-04,9.5e-05,9.2e-05,5.4e-05,7.3e-05,0.000351,0.000179,7e-05,0.000117,3.7e-05,3.4e-05,4.1e-05,2.7e-05,4e-06,3.1e-05,3.2e-05,2.9e-05,4.7e-05,0.000152,0.000164,9.4e-05,9e-06,1.8e-05,2.5e-05,7e-05,5.2e-05,0.000102,0.000108
1.9e-05,2e-05,2.7e-05,1.1e-05,3.5e-05,2.5e-05,8e-06,4e-06,1.4e-05,2.4e-05,1.1e-05,5e-06,1.6e-05,1.4e-05,4.8e-05,3.5e-05,1.8e-05,1.7e-05,7.3e-05,5.6e-05,2.1e-05,1.2e-05,6e-06,3e-06,1e-05,6e-06,1.4e-05,1e-05,2e-06,9e-06,1.3e-05,2.3e-05,0.000117,0.00022,0.000265,5.9e-05,0.000444,0.000537,0.00018,0.000113,6.6e-05,0.00014,0.000154,0.000174,0.000199,0.000179,0.000266,0.000741,0.000379,0.000311,0.000329,0.000351,0.000271,0.000177,4.8e-05,0.000268,0.000168,0.000101,0.000153,0.00021,0.000136,0.000154,0.000199,0.000318,7e-05,0.000234,0.000169,0.000227,0.000273,0.000305,0.000148,7.5e-05,8.5e-05,3.7e-05,4.2e-05,9.2e-05,4.7e-05,1.9e-05,4e-05,1.4e-05,6.4e-05,8.1e-05,8.4e-05,1.9e-05,5.5e-05,8.1e-05,7e-05,1.2e-05,2.8e-05,3.3e-05,8.6e-05,4.7e-05,3.3e-05,7.8e-05,8.8e-05,7.9e-05,5.7e-05,2.5e-05,0.000284,0.000196,6.4e-05,6e-05,6.1e-05,3.4e-05,3.5e-05,1.4e-05,2.6e-05,2.4e-05,2.4e-05,6e-06,4.3e-05,9.4e-05,0.000102,3.4e-05,1.3e-05,1.2e-05,1.2e-05,4.6e-05,4.1e-05,7.9e-05,7.4e-05
8e-06,9e-06,8e-06,7e-06,2.6e-05,1.8e-05,1.8e-05,9e-06,1.8e-05,8e-06,5e-06,6e-06,8e-06,1e-05,2.8e-05,7e-06,5e-06,8e-06,5e-05,9e-06,6e-06,3e-06,3e-06,3e-06,7e-06,2e-06,7e-06,1.4e-05,3e-06,1e-05,4e-06,1.4e-05,0.000113,0.000218,9.5e-05,9.3e-05,0.000584,8.5e-05,0.000175,5.2e-05,6.1e-05,0.000196,5.3e-05,0.000164,0.000448,0.000459,0.000405,0.000356,0.000216,0.000246,0.000244,0.000134,0.000207,0.000168,0.00019,0.000112,0.000162,0.000116,0.000167,0.000249,0.000163,0.000108,0.000128,0.000224,0.000142,0.000122,5.7e-05,8e-05,5.5e-05,0.000171,0.000157,2.1e-05,8.2e-05,3.3e-05,8.3e-05,6.6e-05,5.3e-05,4.2e-05,7.6e-05,3.6e-05,9e-05,3e-05,2.2e-05,2.1e-05,3.4e-05,4e-05,3.3e-05,2.4e-05,1e-05,3e-05,7.5e-05,1.7e-05,5e-06,4.7e-05,3.2e-05,1e-05,1.5e-05,3.1e-05,0.000137,3.4e-05,9e-06,1.4e-05,3.8e-05,1.1e-05,2e-06,5e-06,2e-05,1.3e-05,6e-06,1.5e-05,3.3e-05,5.9e-05,8e-06,8e-06,1.3e-05,6e-06,5e-06,2.2e-05,8e-06,7.1e-05,1.4e-05
2e-06,7e-06,1e-06,0,1.4e-05,6e-06,6e-06,3e-06,1.2e-05,5e-06,3e-06,3e-06,4e-06,7e-06,1.7e-05,4e-06,2e-06,3e-06,2.4e-05,9e-06,1e-05,2e-06,4e-06,3e-06,5e-06,2e-06,6e-06,1.1e-05,4e-06,1.5e-05,1e-06,1.2e-05,0.000105,0.000248,0.000105,7.6e-05,0.000417,0.000222,0.00018,3.3e-05,7e-05,0.000151,0.000125,0.000209,0.000267,0.00035,0.000264,0.000108,0.000279,6.3e-05,2.7e-05,0.000208,0.000255,0.000169,0.000209,0.000194,0.000264,0.000317,0.000169,8.8e-05,9.7e-05,0.000128,7.5e-05,7.1e-05,4.1e-05,0.000204,5.5e-05,2.8e-05,2.8e-05,0.000149,1e-04,6.4e-05,9.1e-05,2.3e-05,9e-05,1.7e-05,3.4e-05,2.8e-05,6e-05,1e-05,7.8e-05,3.8e-05,4e-06,1.3e-05,1.4e-05,1.7e-05,1.9e-05,5e-06,1.8e-05,3.8e-05,6.8e-05,1.1e-05,7e-06,3.6e-05,2e-05,6e-06,1.1e-05,2.9e-05,1.1e-05,3.4e-05,2.3e-05,1.8e-05,2.3e-05,1.3e-05,7e-06,4e-06,1.3e-05,1.1e-05,8e-06,1.1e-05,3.6e-05,3.7e-05,2.9e-05,1e-05,6e-06,3e-06,5e-06,1.1e-05,5e-06,6.1e-05,9e-06
2e-06,3e-06,3e-06,1e-06,1.1e-05,4e-06,3e-06,2e-06,8e-06,2e-06,5e-06,3e-06,2e-06,7e-06,1.4e-05,4e-06,2e-06,2e-06,1e-05,2e-06,1.1e-05,6e-06,6e-06,5e-06,4e-06,1e-06,3e-06,1.2e-05,3e-06,1.6e-05,2e-06,1e-05,9.2e-05,0.00019,4.6e-05,2.8e-05,0.000289,0.000191,9.1e-05,1.8e-05,8.2e-05,0.000122,5e-05,7.8e-05,0.000388,0.00018,0.000224,0.000144,3e-04,6e-05,4.3e-05,0.000209,0.000225,0.000152,0.000116,0.000167,0.00023,0.000283,0.00019,8.1e-05,6.4e-05,2.7e-05,5.3e-05,0.000104,8e-06,0.000155,5.4e-05,4.3e-05,2.2e-05,0.000134,7.1e-05,4.4e-05,9e-05,2.6e-05,8.1e-05,1.7e-05,2.4e-05,2.4e-05,4.8e-05,1e-05,6.4e-05,3.3e-05,7e-06,9e-06,7e-06,1e-05,1.9e-05,2e-06,1.4e-05,3.5e-05,6e-05,1.5e-05,8e-06,2.7e-05,1e-05,5e-06,1.2e-05,2.4e-05,2.5e-05,2.6e-05,2e-05,1.3e-05,1.6e-05,1.4e-05,2e-06,2e-06,8e-06,1.1e-05,7e-06,9e-06,3.3e-05,1.9e-05,1.2e-05,2e-06,3e-06,2e-06,6e-06,6e-06,2e-06,5.4e-05,3e-06
