2.2e-05,4.9e-05,1.1e-05,2.4e-05,3.4e-05,2.2e-05,6.3e-05,4.4e-05,3.8e-05,4.3e-05,1.1e-05,3.6e-05,1.8e-05,2e-05,8e-06,3.6e-05,1.8e-05,1.3e-05,1.2e-05,6e-06,4.6e-05,9e-06,3e-05,6e-06,1.5e-05,0.000145,0.000318,6e-05,2.5e-05,0.000215,0.000167,0.000314,0.000175,0.000405,0.000721,0.000749,0.000729,0.000813,0.000949,9.8e-05,0.000162,0.000167,0.001341,0.00181,0.000914,0.000843,0.000551,4.6e-05,0.000102,0.000255,9.9e-05,0.00045,0.000208,0.000552,0.000143,0.000207,0.001043,0.000312,0.000458,0.000248,0.000134,0.000155,0.000278,2.3e-05,9.4e-05,4.1e-05,1.5e-05,2.8e-05,0.000259,3e-06,9.7e-05,6.1e-05,3e-05,0.000122,0.000131,4.8e-05,3.7e-05,5.6e-05,0.000163,3.2e-05,0.000205,0.000323,0.000423,0.000406,0.00013,0.000105,0.000121,0.000105,4.4e-05,0.000368,9.1e-05,7.3e-05,0.000142,0.000112,5.9e-05,6.6e-05,0,7e-06,2.3e-05,3.8e-05,5.4e-05,2.6e-05,8e-06,3.5e-05,2.8e-05,6e-06,4e-06,3e-06,2e-05,3e-06,1.1e-05,4.8e-05,4.2e-05,5.7e-05,6.1e-05,7.8e-05,5.8e-05,3e-05,6.4e-05,4.4e-05,3e-05
7.6e-05,0.000105,0.000106,5.8e-05,3.8e-05,9e-06,9.9e-05,4.4e-05,0.000109,9.6e-05,0.000109,6.8e-05,7.9e-05,2.1e-05,3.3e-05,5.4e-05,1.6e-05,2.7e-05,5.9e-05,3.5e-05,6.3e-05,9.3e-05,7.6e-05,8.2e-05,9.7e-05,0.000229,0.000639,0.000479,0.000819,0.001279,0.000983,0.00023,0.000932,0.000235,0.00236,0.002843,0.004663,0.001914,0.00311,0.000323,0.001003,0.001994,0.003955,0.001044,0.003677,0.001795,0.001542,0.001563,0.000366,0.000176,0.000809,0.000414,0.000883,0.000754,0.001616,0.000966,0.001656,0.001303,0.000227,0.00032,0.000302,0.000677,0.001118,0.001087,0.00086,0.00041,0.000476,0.000452,0.000951,0.00042,0.00023,9.1e-05,0.000269,0.000211,0.000369,0.000119,6.2e-05,3.6e-05,0.000297,0.000295,0.000682,0.001411,0.000771,0.001158,0.001349,0.000602,0.000191,0.000308,0.000116,0.000691,0.000669,0.000562,0.000229,0.000387,0.000233,0.000252,0.000181,0.000152,0.000156,0.00013,0.000157,9.6e-05,0.000124,3.3e-05,6.4e-05,1e-04,7.8e-05,5.7e-05,5.9e-05,3.1e-05,8.1e-05,0.000118,0.000111,0.000172,0.000167,0.000229,0.000123,8.2e-05,3.1e-05,3.2e-05,9.8e-05
3.4e-05,2.8e-05,4.2e-05,9e-06,5.8e-05,4e-05,3.9e-05,1.4e-05,5.4e-05,8e-06,8.2e-05,1.1e-05,3.1e-05,3.3e-05,3.2e-05,5.1e-05,5.1e-05,3.2e-05,5.1e-05,4.8e-05,3.5e-05,2.1e-05,4.6e-05,3.9e-05,6.9e-05,0.00018,0.000397,0.001082,0.000469,0.001387,0.000858,0.000351,0.001363,0.001554,0.003078,0.004138,0.005501,0.003921,0.004123,0.002276,0.001053,0.002977,0.004778,0.003667,0.003263,0.001947,0.000585,0.001058,0.000539,0.001449,0.000361,0.00048,0.001007,0.001085,0.002207,0.002314,0.001949,0.000557,0.001482,0.001598,0.000221,0.001294,0.001094,0.000306,3.1e-05,0.001114,0.001182,0.000376,0.000853,0.00052,0.000226,0.000201,0.000301,0.000374,0.000125,0.000289,0.00023,6.6e-05,0.000165,0.000293,0.00044,0.001328,0.000663,0.000154,0.000838,0.000482,0.000224,0.000349,0.000296,0.000666,0.001071,0.00045,0.000305,6.7e-05,5e-05,0.000105,6.2e-05,0.00011,0.000109,1.8e-05,4e-05,3.1e-05,8.6e-05,1.9e-05,2.7e-05,6.5e-05,4e-05,3.5e-05,2.2e-05,5.3e-05,5.8e-05,9.4e-05,8.3e-05,7.3e-05,8.7e-05,2.4e-05,1.3e-05,4.9e-05,3.5e-05,3.4e-05,5.3e-05
6.9e-05,6.8e-05,0.000131,9e-05,0.000129,9e-05,2.8e-05,4e-05,4.9e-05,5.7e-05,9.5e-05,6.9e-05,3.6e-05,3.1e-05,6.3e-05,7.2e-05,6.7e-05,5.6e-05,5.3e-05,7.3e-05,8.2e-05,8.7e-05,8.4e-05,9e-05,0.000126,0.000192,0.000896,0.000255,0.001464,0.00013,0.001125,0.000959,0.001609,0.001794,0.002948,0.005342,0.003318,0.003471,0.002272,0.002391,0.004777,0.004615,0.001204,0.000942,0.00028,0.001185,0.002551,0.000879,0.001818,0.001151,0.000524,0.001313,0.00073,0.000786,0.001609,0.001853,0.001488,0.001834,0.001717,0.001066,0.00075,0.001943,0.000881,0.000696,0.000761,0.001865,9e-04,0.000818,0.000719,0.000164,6.9e-05,0.000228,0.000224,0.000321,0.000623,0.000584,0.000276,0.000329,5.4e-05,0.00018,0.000526,0.000383,0.000563,0.000578,0.000642,0.000516,0.000416,0.000305,0.000386,0.000645,0.000678,0.000447,0.00036,0.000368,0.000111,3.1e-05,8.2e-05,8e-06,0.000113,7.8e-05,0.000146,7.9e-05,0.00011,3.3e-05,4.1e-05,4.5e-05,7.5e-05,7.3e-05,9e-05,8.1e-05,0.000104,0.000113,3.7e-05,3.7e-05,8.8e-05,5.1e-05,1.7e-05,6.7e-05,6.7e-05,5.8e-05,6.3e-05
3.4e-05,3e-05,0.000124,3.8e-05,0.000122,3.1e-05,6.1e-05,3.2e-05,2e-05,7.7e-05,8.5e-05,3.5e-05,1.8e-05,1.6e-05,3.2e-05,2.1e-05,2.9e-05,2.7e-05,2e-05,6.9e-05,5e-06,4e-05,4.9e-05,2.7e-05,4.6e-05,0.000375,0.001576,0.000588,0.00145,0.001186,0.001472,0.000636,0.00264,0.000214,0.001874,0.004024,0.004337,0.002659,0.001226,0.002892,0.002656,0.002224,0.002566,0.002575,0.001169,0.00115,0.00282,0.001937,0.002391,0.001836,0.00074,0.00117,0.002892,0.00139,0.002205,0.002896,0.000291,0.002134,0.001355,0.001538,0.001722,0.000553,0.000845,0.000553,0.00043,0.002552,0.000732,0.000129,0.000318,0.000251,0.000266,0.000198,9.7e-05,0.000238,0.00037,4e-04,0.000226,0.000298,0.000228,0.000349,0.000171,0.000392,0.000858,0.000532,0.00084,0.00028,0.00028,0.000239,0.000326,0.000713,3e-04,0.000171,0.000302,5.7e-05,7.9e-05,6.3e-05,5.1e-05,7.2e-05,0.00014,0.000132,3.6e-05,3.5e-05,6.7e-05,1.7e-05,1.8e-05,5.5e-05,1.2e-05,1.8e-05,5.5e-05,3.8e-05,7e-05,1.5e-05,1.9e-05,2.3e-05,2.2e-05,3.6e-05,9e-06,3.9e-05,5.6e-05,5.8e-05,2.5e-05
2.1e-05,1.8e-05,8.1e-05,0.000123,3.4e-05,5.7e-05,1e-04,2.5e-05,3.4e-05,6.4e-05,1.5e-05,3.1e-05,2.1e-05,2.2e-05,1.9e-05,4.7e-05,1.8e-05,3.5e-05,2.4e-05,6e-05,3.4e-05,1.9e-05,4.8e-05,1.3e-05,1.3e-05,0.000541,0.000327,0.00037,0.001687,0.003274,0.000902,0.000517,0.003381,0.002002,0.003102,0.004123,0.001292,0.002774,0.003147,0.004479,0.003143,0.002417,0.002634,0.001288,0.002433,0.003589,0.000408,0.000844,0.002738,0.000999,0.001605,0.001644,0.002244,0.000651,0.002301,0.002297,0.002936,0.002295,0.001156,0.003258,0.000966,0.000995,0.001364,0.000508,0.000888,0.00288,0.002067,0.001058,0.000132,0.000616,0.000491,0.000156,0.00027,0.000186,0.000902,0.000482,0.000393,0.000129,0.000151,0.000226,0.00041,0.000718,0.001607,0.000518,0.001206,0.001038,0.000621,8.6e-05,0.000293,0.000557,0.000559,0.000248,0.000168,0.000125,5.2e-05,3.4e-05,4.4e-05,5.1e-05,6.5e-05,4.5e-05,0.000106,6.6e-05,6.9e-05,5.8e-05,4.5e-05,6e-05,3.8e-05,6.5e-05,4.6e-05,6.3e-05,4.7e-05,2.1e-05,1.3e-05,1.7e-05,5.1e-05,4.4e-05,3e-05,6.1e-05,5.7e-05,3.6e-05,4.1e-05
5e-06,9e-06,0.000208,0.000217,0.00011,3.8e-05,0.000223,8.8e-05,6.5e-05,0.000107,0.00026,0.000161,7.5e-05,1.5e-05,3.6e-05,7.3e-05,8.5e-05,7.3e-05,3.9e-05,5e-05,4.4e-05,5e-05,2.1e-05,4.8e-05,7e-05,0.000655,0.003768,0.001637,0.001724,0.006729,0.004082,0.001445,0.002053,0.002125,0.002598,0.001556,0.001769,0.00386,0.001783,0.007687,0.012311,0.003877,0.005462,0.00458,0.002616,0.003471,0.002075,0.002007,0.001881,0.004646,0.001211,0.001857,0.001057,0.001473,0.002597,0.001575,0.006016,0.001283,0.00312,0.00439,0.002344,0.002363,0.001028,0.002042,0.000967,0.001753,0.002794,0.001194,0.000526,0.00058,0.000838,0.000746,0.000776,0.000265,0.000819,0.000609,0.000345,7.3e-05,0.000406,0.000298,0.000455,0.000798,0.001448,0.001778,0.001188,0.000766,0.000753,0.000345,0.000888,0.000269,0.000503,0.000413,0.000118,0.000244,0.000175,9.6e-05,0.000114,0.000102,8.9e-05,0.000107,0.000206,0.00018,6.4e-05,5.3e-05,5.9e-05,0.000106,5.3e-05,1.4e-05,5.7e-05,4.5e-05,9.5e-05,6.5e-05,3.4e-05,8.6e-05,3.8e-05,7e-06,3.2e-05,0.000114,0.000104,5.8e-05,2.4e-05
4.4e-05,2.1e-05,0.000484,8e-05,0.000108,0.000127,0.000273,0.000167,3.2e-05,7e-05,0.000681,0.000234,4.2e-05,9.3e-05,4.2e-05,4.6e-05,6.1e-05,1.1e-05,1.2e-05,2.9e-05,7.7e-05,4.3e-05,5.2e-05,8.4e-05,2.7e-05,0.00062,0.007071,0.004157,0.000208,0.007058,0.004298,0.001637,0.002072,0.003249,0.000743,0.000581,0.000566,0.003853,0.006947,0.013616,0.019342,0.014125,0.009334,0.002272,0.002807,0.002221,0.001787,0.001192,0.000568,0.003254,0.003775,0.003209,0.004749,0.004842,0.007915,0.005222,0.006008,0.006132,0.006516,0.006292,0.002606,0.002099,0.00331,0.001316,0.001996,0.00182,0.001498,0.0014,0.001132,0.001119,0.001025,0.000536,0.000337,0.000305,0.000708,0.000597,0.000252,0.000477,0.000285,0.00017,0.000764,0.001018,0.001205,0.000664,0.001242,0.000624,0.000947,0.000277,0.00111,0.00123,0.00221,0.000864,0.000599,0.000309,0.000183,0.000109,0.000294,0.000114,0.000294,0.000183,0.000528,0.000314,0.000353,0.000149,0.00011,0.000132,6.9e-05,5e-05,7e-05,0.000196,0.000187,0.00036,0.000282,0.00029,0.000115,4.6e-05,6e-05,0.000121,4.5e-05,5.3e-05,0.000111
3.5e-05,5.3e-05,0.000679,0.000643,0.000431,0.000242,0.000301,0.000338,0.000198,9.2e-05,0.000965,0.000727,0.000371,5.6e-05,3.2e-05,2.6e-05,5.5e-05,5e-05,2.3e-05,2.6e-05,8.9e-05,8.8e-05,2.1e-05,6.9e-05,6.6e-05,0.000578,0.009202,0.005232,0.002258,0.002998,0.001124,0.000919,0.002248,0.002963,0.002334,0.000916,0.001773,0.003567,0.004371,0.00747,0.006396,0.004621,0.005222,0.005473,0.005233,0.004559,0.003914,0.001313,0.00088,0.001126,0.001489,0.004035,0.00118,0.002819,0.006939,0.004617,0.005303,0.005197,0.001443,0.002497,0.001842,0.001523,0.00162,0.001663,0.001787,0.001515,0.00051,0.00108,0.000496,0.00056,0.000164,0.000157,0.000313,0.00042,0.000675,0.000902,0.00113,0.000797,0.000773,0.000695,0.001044,0.000309,0.001947,0.00193,0.000937,0.000614,0.00133,0.001122,0.001529,0.000654,0.002434,0.001967,0.001138,0.000663,0.000545,0.000201,0.000426,0.000315,0.000482,0.000388,0.000369,0.000386,0.000456,0.000272,0.000142,0.000193,9.2e-05,0.000144,6.3e-05,0.000229,0.000556,0.000519,0.000228,0.000255,0.000234,9.3e-05,6.3e-05,0.000201,0.000231,0.000122,6.3e-05
3.6e-05,1.9e-05,0.000588,0.00037,1e-04,0.000129,0.000454,0.000325,0.000106,0.000112,0.000888,0.000553,0.00022,1.6e-05,2.5e-05,2.9e-05,1.5e-05,1.7e-05,2e-05,5.8e-05,5.1e-05,1.4e-05,4.8e-05,1.7e-05,6e-06,0.000394,0.00875,0.005246,0.003463,0.001448,0.000575,0.000323,0.001602,0.000674,0.000536,0.001859,0.004175,0.001192,0.002899,0.005258,0.006814,0.002597,0.004315,0.000373,0.001389,0.000385,0.001074,0.000821,0.000305,0.000861,0.000586,0.001847,0.001654,0.000676,0.005945,0.001473,0.002678,0.00044,0.002758,0.001298,0.000342,0.001818,0.000704,0.001008,0.000718,0.000174,0.000157,0.001129,0.000157,0.000436,0.000127,0.000168,0.000258,0.000256,0.00039,0.000318,0.000483,8.4e-05,0.000213,0.000196,0.000282,0.000272,0.001957,0.000546,0.000233,0.000206,0.000884,0.000369,0.000645,0.000822,0.001696,0.000972,0.001461,0.000442,0.00045,0.000202,0.000523,0.000298,0.000344,0.000339,0.000586,0.000688,0.000129,0.000239,0.000134,0.000208,0.000338,0.000316,0.000165,0.000149,0.000455,0.000347,0.000159,0.000375,0.000307,0.000254,0.000164,0.000159,0.000288,0.000193,6.5e-05
1.1e-05,2.6e-05,0.000348,0.000156,4.6e-05,8.7e-05,0.00023,5.9e-05,3.9e-05,0.000111,0.000444,0.000135,2.8e-05,7e-06,3e-06,2.8e-05,1.5e-05,7e-06,9e-06,3.5e-05,1.7e-05,1.3e-05,3.1e-05,2.9e-05,2.3e-05,0.000154,0.005707,0.003832,0.003179,0.00288,0.001443,0.000373,0.001713,0.001492,0.001143,0.002986,0.005287,0.003824,0.000441,0.001951,0.003964,0.001791,0.000259,0.002392,0.001654,0.001039,0.000278,0.000797,0.000309,0.001054,0.00065,0.00113,0.000269,0.000721,0.003597,0.001841,0.001377,0.001075,0.002375,0.001209,0.000125,0.000984,0.000419,0.000739,9.4e-05,0.000322,0.000217,0.000692,0.000462,0.000411,0.000169,0.000225,0.000156,0.000108,0.000104,0.000106,0.000349,0.000177,6.8e-05,5.3e-05,0.000589,0.000643,0.001198,0.001226,0.000655,0.000299,0.000363,0.000317,7.5e-05,0.000785,0.0013,0.000609,0.00073,0.000916,0.00045,0.000256,0.000418,0.000266,0.00024,0.000185,0.000602,0.00036,0.000349,0.000284,0.00023,0.000142,0.000144,3.7e-05,4.9e-05,0.000151,0.000164,0.000455,0.000253,0.000306,1.2e-05,6.8e-05,4.2e-05,0.000226,0.000115,3.1e-05,2.8e-05
1.8e-05,3.5e-05,4.9e-05,3.2e-05,1.3e-05,3.3e-05,8.5e-05,2.7e-05,1.4e-05,9.1e-05,5.3e-05,7.5e-05,9e-06,1.5e-05,1.9e-05,1.3e-05,1.6e-05,8e-06,6e-06,1.7e-05,5e-06,3e-05,1.6e-05,1.5e-05,1.3e-05,7.4e-05,0.002784,0.000805,0.00164,0.002654,0.001271,0.000544,0.001381,0.001107,0.000567,0.001471,0.004189,0.000242,0.000445,8e-04,0.004101,0.000886,0.001787,0.000635,0.001638,0.001258,0.001589,0.000401,0.00078,0.001454,0.000624,0.00071,0.000941,0.000793,0.002717,0.001233,0.001314,0.001541,0.00124,0.001287,0.00116,0.001636,0.000486,0.000223,0.000293,0.000187,0.000145,0.000739,0.000435,0.000626,1.4e-05,5.5e-05,0.000139,0.000146,0.000216,0.000301,0.000461,0.000235,0.000131,0.000201,0.00095,0.000334,0.000923,0.001229,0.000498,0.000122,0.000103,0.000199,0.000157,0.000564,0.001121,0.000277,0.000458,9.7e-05,9.2e-05,7.3e-05,0.000255,8.5e-05,0.000105,0.000116,0.000469,0.000199,0.000209,7.6e-05,5.3e-05,9e-06,9.8e-05,6.6e-05,4.3e-05,1.2e-05,4.4e-05,0.000278,0.000174,9.4e-05,6.1e-05,7.5e-05,1.2e-05,0.000133,5.4e-05,1.1e-05,6e-06
2.9e-05,6e-06,0.000103,8e-05,7.4e-05,5.3e-05,1.2e-05,3.9e-05,2.3e-05,0.000102,0.000279,0.000129,4.1e-05,9e-06,3e-05,2.3e-05,9e-06,1.6e-05,1.9e-05,1.6e-05,1.2e-05,1.4e-05,2.5e-05,2.3e-05,3e-06,0.000218,0.00089,0.00037,0.002101,0.002649,0.00182,0.000872,0.00105,0.000534,0.00091,0.000902,0.00117,0.001485,0.000701,0.00133,0.00088,0.001141,0.001543,0.000714,0.000435,0.002086,0.002124,0.001174,0.001983,0.001554,0.00297,0.001275,0.000947,0.001277,0.001021,0.001729,0.000179,0.000733,0.001457,0.001126,0.001722,0.000623,0.000564,0.000985,8.8e-05,0.000116,0.000299,0.000919,0.000162,0.000231,1.6e-05,7.1e-05,0.000264,5.7e-05,0.000161,0.000327,0.000367,0.000155,0.000214,8.5e-05,0.000782,0.001145,0.001427,0.001113,0.000513,0.000167,0.000316,0.000179,0.000371,0.000652,0.000283,0.000451,0.000198,0.000379,0.000121,9.2e-05,0.000167,0.000136,9.5e-05,9.9e-05,0.000573,0.000301,0.000143,2.6e-05,2.8e-05,5.8e-05,4.3e-05,9.1e-05,3.7e-05,6.7e-05,0.000139,0.000294,0.000245,5.2e-05,6.5e-05,9.9e-05,6.5e-05,7.5e-05,3.4e-05,3.4e-05,4.2e-05
2.2e-05,3.1e-05,0.00016,9.2e-05,3.3e-05,2.2e-05,7.8e-05,2.4e-05,9e-06,0.000109,0.000288,0.000106,5.1e-05,3e-05,2.5e-05,2e-06,1.7e-05,1.6e-05,2e-06,1.4e-05,2.3e-05,7e-06,2.5e-05,5e-06,7e-06,0.000209,0.000174,0.000493,0.001957,0.001834,0.000249,0.000266,0.000172,0.000145,0.000634,0.003786,0.003808,0.001165,0.001699,0.003378,0.001134,0.000912,0.001912,0.000318,0.001501,0.004189,0.004781,0.001624,0.003297,0.002303,0.002798,0.001381,0.001104,0.000975,0.001584,0.002379,0.000871,0.000813,0.001228,0.000406,0.002328,0.002473,0.000697,0.001133,0.001708,0.00044,0.000384,0.001082,0.000691,0.001136,0.000886,0.000386,0.000177,0.000103,0.000391,0.000435,0.000541,0.000179,4.5e-05,0.000213,0.000531,0.001241,0.000467,0.000655,0.000349,0.000136,0.000412,0.000201,0.000249,0.00032,0.00105,0.000394,0.000394,0.000548,0.000269,4.1e-05,0.000253,8.5e-05,0.000147,6e-06,0.000454,0.000257,0.000121,1e-05,3.8e-05,3.8e-05,4.9e-05,6.9e-05,7.6e-05,4.7e-05,0.000133,0.000285,6.9e-05,0.000129,5.6e-05,5.5e-05,2.3e-05,3.8e-05,5.4e-05,2.7e-05,3.2e-05
1.8e-05,8e-06,0.000161,3.4e-05,4.7e-05,3.7e-05,0.000109,2.7e-05,1.1e-05,9.5e-05,0.000148,0.000117,4.6e-05,4e-06,3.3e-05,2.2e-05,1.8e-05,3.4e-05,2.9e-05,3.8e-05,4e-05,4e-05,4.3e-05,1.4e-05,1.2e-05,0.000146,0.001036,0.000128,0.002296,0.003588,0.002948,0.001145,0.000976,0.001263,0.00042,0.006683,0.005028,0.004199,0.003481,0.002025,0.000847,0.002903,0.005432,0.001791,0.002186,0.005596,0.009491,0.006163,0.004394,0.00099,0.003691,0.003501,0.00228,0.003506,0.0017,0.001261,0.001521,0.002548,0.001219,0.00436,0.001298,0.002415,0.000929,0.0016,0.00157,0.002385,0.001407,0.001777,0.000709,0.002134,0.000564,0.000449,0.000274,0.000447,0.000398,0.000715,0.000783,0.000414,0.000225,0.000492,0.000463,0.001187,0.001357,0.001571,0.001218,0.000661,0.000827,0.00047,0.000371,0.000555,0.001229,0.000871,0.000446,0.000259,0.00018,6.2e-05,0.000243,0.00018,5.3e-05,7e-05,0.00035,0.000269,0.000103,0.000122,4.3e-05,5.2e-05,2.5e-05,3.6e-05,5.2e-05,0.000111,0.000169,0.000302,0.000218,0.000216,0.000163,5.5e-05,1.1e-05,2.7e-05,4.3e-05,9e-06,3.8e-05
3.6e-05,5.2e-05,9.6e-05,0.000112,9e-06,1e-05,0.000112,7.5e-05,4.5e-05,0.000111,0.000182,0.000102,4.9e-05,1.4e-05,1.5e-05,1e-05,5e-06,2.5e-05,2.9e-05,6e-06,1.6e-05,2.5e-05,7e-06,4e-06,7e-06,0.000161,0.001108,0.000654,0.002086,0.003211,5e-04,0.000506,0.002119,0.00042,0.000604,0.007211,0.011092,0.006074,0.002361,0.001645,0.002637,0.006324,0.003363,0.008732,0.004723,0.006472,0.003927,0.002442,0.008595,0.010747,0.010281,0.010598,0.003662,0.006038,0.001632,0.0054,0.004542,0.004589,0.003046,0.006347,0.005905,0.006311,0.00645,0.005848,0.003519,0.002947,0.00098,0.000793,0.001482,0.002474,0.003168,0.00138,0.000175,0.000813,0.000837,0.000349,3e-04,0.000337,0.000244,0.000689,0.000352,0.000826,0.000319,0.001681,0.001174,0.000353,0.000946,0.000546,0.000361,0.000387,0.00028,0.000508,0.00037,0.000371,0.00023,0.000142,0.000201,2.8e-05,7.6e-05,0.000106,0.000154,0.000114,0.000105,7.6e-05,5.1e-05,5.1e-05,6.3e-05,0.000105,4.6e-05,7.3e-05,0.000186,0.000323,0.000216,0.00014,3.1e-05,3.5e-05,3.6e-05,2.2e-05,2e-05,3.2e-05,2.7e-05
2e-06,5.3e-05,0.000189,9.4e-05,1.9e-05,3.5e-05,7.4e-05,4.6e-05,1.1e-05,0.000137,0.000287,0.000122,5.3e-05,8e-06,4e-06,1.2e-05,5e-06,1.8e-05,2e-05,1.4e-05,8e-06,4e-06,1.5e-05,1.7e-05,9e-06,0.000183,0.000544,0.000346,0.002341,0.001282,0.001803,0.00106,0.002405,0.001761,0.001179,0.005174,0.004325,0.005491,0.004851,0.007312,0.000643,0.006936,0.009526,0.010978,0.011261,0.009626,0.003551,0.003425,0.006981,0.009764,0.009842,0.008044,0.008169,0.006677,0.005497,0.009324,0.011418,0.006818,0.004985,0.008089,0.010029,0.003176,0.005827,0.000716,0.003447,0.002854,0.000273,0.001295,0.002818,0.004867,0.004363,0.002511,0.000964,0.001527,0.00113,0.001061,0.001284,0.000693,0.000176,0.000477,0.000298,0.000275,0.000448,0.001721,0.001171,0.000747,0.001327,0.000597,0.000153,0.000385,0.000837,0.000792,0.000418,0.000232,8e-05,0.000159,0.000195,0.000152,1.7e-05,5.8e-05,8.7e-05,8.5e-05,7.6e-05,1.1e-05,5.7e-05,9.5e-05,4.2e-05,6.2e-05,2.8e-05,5.2e-05,0.000221,0.000109,7.4e-05,4.7e-05,7.5e-05,3.6e-05,7.1e-05,0.000104,3.1e-05,2.8e-05,4.1e-05
5e-06,4.2e-05,0.000244,7e-05,4e-05,2e-06,5.7e-05,4.5e-05,2.3e-05,0.000133,0.000183,8e-05,3.1e-05,1.7e-05,1.5e-05,1.8e-05,1e-05,1.8e-05,3.4e-05,2.8e-05,1.4e-05,2.4e-05,3.2e-05,3.7e-05,3.5e-05,0.000179,0.000517,0.000668,0.002409,0.002452,0.002069,0.000797,0.002484,0.001095,0.000748,0.003396,0.002014,0.006577,0.009799,0.004966,0.003673,0.006891,0.004548,0.004212,0.006,0.006467,0.00163,0.006725,0.003563,0.005195,0.002439,0.002469,0.008079,0.008988,0.007685,0.005772,0.002354,0.001564,0.003976,0.007117,0.003354,0.004836,0.003825,0.003809,0.001333,0.00306,0.002873,0.001711,0.003508,0.003364,0.000642,0.001069,0.000434,0.001258,0.002008,0.002238,0.001177,0.000831,0.000451,0.000332,0.000237,0.000288,0.00058,0.000628,0.000703,0.000181,0.000763,0.00049,0.000219,0.000207,0.001161,0.000518,5.3e-05,0.000123,9.2e-05,9.1e-05,5e-05,3.5e-05,0.000101,0.000151,0.000141,4.6e-05,7.4e-05,2.6e-05,9.5e-05,5.5e-05,1.8e-05,6.7e-05,3.8e-05,7e-06,0.000151,0.00017,0.00016,6.7e-05,1e-04,3.8e-05,5.6e-05,2.1e-05,2.1e-05,4e-05,3.1e-05
1.5e-05,2.6e-05,0.000181,0.000159,9.3e-05,4.3e-05,7.1e-05,1e-05,2.8e-05,0.000158,0.00013,9.5e-05,4.3e-05,1.6e-05,1.3e-05,1.6e-05,2e-05,1.7e-05,2.4e-05,3.8e-05,1.9e-05,2.3e-05,2.3e-05,3.6e-05,1.2e-05,0.000163,0.000369,0.00076,0.001716,0.003663,0.001331,0.000514,0.002194,0.00105,0.001215,0.002267,0.002107,0.005286,0.00219,0.000667,0.000444,0.002846,0.00284,0.002287,0.004269,0.002592,0.001726,0.00713,0.006731,0.002948,0.000961,0.002308,0.006426,0.002774,0.004275,0.004702,0.0029,0.002629,0.000946,0.002627,0.003044,0.004204,0.002254,0.00296,0.002639,0.001646,0.001476,0.002547,0.002776,0.003949,0.002459,0.000884,0.000379,0.000485,0.000776,0.000406,0.000485,0.000594,0.000319,0.00018,0.000139,0.000412,4.2e-05,0.000825,0.000461,0.000309,0.000361,0.000529,0.000157,9.5e-05,0.001034,0.000562,0.000138,0.000257,4.4e-05,8.2e-05,2e-04,0.000134,0.00011,0.000132,0.000192,0.000153,0.000149,9.8e-05,8.1e-05,3.7e-05,5e-05,0.000106,0.000153,9.5e-05,0.000218,0.000234,0.000236,0.000203,0.000113,0.000111,6.7e-05,0.000106,6.9e-05,0.000117,4.8e-05
3e-05,3.3e-05,0.000231,9.6e-05,4.1e-05,3e-06,8e-05,5.6e-05,3.7e-05,0.000137,0.000291,0.000142,7.3e-05,2.2e-05,1e-05,1.5e-05,2.8e-05,1.1e-05,1.2e-05,2.5e-05,2e-05,1e-05,4.2e-05,3.1e-05,2.6e-05,0.00013,7.5e-05,0.000507,0.002293,0.003361,0.002028,0.000983,0.001466,0.00119,0.000409,0.000728,0.001,0.003569,0.003124,0.001952,0.001594,0.002061,0.003201,0.002114,0.001967,0.002382,0.003084,0.003308,0.001841,0.001416,0.000973,0.002438,0.002872,0.003957,0.001085,0.00039,0.001026,0.004241,0.003659,0.002241,0.003787,0.005119,0.004984,0.002578,0.001313,0.0015,0.000575,0.001249,0.000903,0.001457,0.000485,0.000686,0.000808,0.000493,0.000122,0.000387,0.000348,0.000277,0.000395,0.00037,0.000376,0.000396,0.000579,0.001343,0.00092,0.000568,0.000411,0.000483,0.000305,0.000263,0.000534,0.000237,0.000226,0.000137,0.000199,0.000183,0.000292,0.000145,0.000229,0.000168,0.000157,0.000121,7.5e-05,0.000176,0.000149,0.000108,8.4e-05,0.000182,0.000208,0.000157,0.000274,0.000128,4.5e-05,0.000181,0.000123,6.4e-05,0.000128,7.8e-05,5.5e-05,6.8e-05,8.6e-05
1.7e-05,2.2e-05,0.000286,0.00015,3.4e-05,2.6e-05,6.5e-05,4.5e-05,4.2e-05,0.000121,0.000301,0.000224,6.1e-05,8e-06,2.2e-05,2.5e-05,2.5e-05,2.3e-05,1.6e-05,2.6e-05,7e-06,1.1e-05,3.6e-05,6e-06,2.8e-05,0.000155,0.000337,0.00021,0.001497,0.001574,0.000939,0.000152,0.001268,0.001135,0.000831,0.001022,0.002216,0.002105,0.00164,0.002098,0.002024,0.00215,0.001305,0.001506,0.001074,0.002404,0.001667,0.002628,0.001453,0.000968,0.001677,0.000676,0.001829,0.001822,0.001056,0.001866,0.001049,0.004342,0.001972,0.001011,0.003117,0.00138,0.000876,0.001354,0.000376,0.001395,0.001835,0.000626,0.000713,0.000411,0.000186,0.00014,0.000647,0.000259,0.000564,0.000858,0.000335,0.000227,0.000169,0.000119,0.000154,6e-04,0.000557,0.000652,0.00114,0.000642,0.000543,0.000592,0.000299,0.000414,0.000395,0.000245,0.000134,8.9e-05,0.000181,0.000119,6.5e-05,4.6e-05,0.000217,0.000206,6e-05,6.6e-05,8.6e-05,0.000102,4e-05,0.000104,0.000157,0.000119,6.5e-05,0.00013,7.3e-05,5.4e-05,0.000168,0.000231,0.000134,8.3e-05,0.000178,0.000203,0.00014,8e-05,2.7e-05
3.1e-05,3.7e-05,0.000227,0.000135,6.7e-05,1.4e-05,6.9e-05,2.4e-05,1.3e-05,8.8e-05,0.000221,9e-05,2.2e-05,7e-06,1e-05,8e-06,7e-06,8e-06,5e-06,1.5e-05,9e-06,2.3e-05,2.6e-05,1.6e-05,2.3e-05,0.000173,0.000182,7.4e-05,0.001214,0.000875,0.00071,0.000369,0.000777,0.000964,0.000717,0.000305,0.00241,0.002255,8.4e-05,0.001474,0.001248,0.00176,0.001109,0.001565,0.001599,0.000278,0.002479,0.000806,0.000477,0.000386,0.000814,0.001589,0.002597,0.001593,0.00062,0.000744,0.001313,0.002833,0.001515,0.000499,0.00253,0.001517,0.000973,0.0013,0.000832,0.001123,0.001311,0.000699,0.000269,0.000284,0.000126,0.000438,0.000442,0.000278,0.000463,0.000294,0.000282,7.9e-05,0.000118,7.7e-05,6e-05,0.000517,0.000379,0.000551,0.000729,0.000312,0.000537,0.000204,0.000101,0.000354,0.000141,8.8e-05,7.9e-05,7.2e-05,0.000152,8.5e-05,5.8e-05,7.8e-05,9e-05,8e-05,6.2e-05,7.2e-05,6.2e-05,6.6e-05,4e-05,0.000147,0.000156,0.000109,3.5e-05,8.5e-05,8.9e-05,9.2e-05,0.000227,0.000141,3.1e-05,4.6e-05,8.3e-05,7.1e-05,4.6e-05,3.3e-05,1.8e-05
1e-05,1.1e-05,6.5e-05,2.4e-05,2.2e-05,1.2e-05,2.6e-05,1.4e-05,4e-06,4.2e-05,6.8e-05,1.7e-05,6e-06,8e-06,1e-06,5e-06,0,3e-06,3e-06,7e-06,5e-06,6e-06,7e-06,4e-06,1e-06,8.2e-05,0.000123,2.1e-05,0.000609,0.000168,0.000191,0.000114,0.000295,0.000168,0.000159,0.000381,0.000672,0.000489,0.000599,0.000462,0.000415,0.00044,0.000517,0.000634,0.000508,0.000432,0.000312,0.000678,0.000503,0.000374,0.000519,0.000976,0.000527,0.000591,0.000232,0.000533,0.00045,0.000692,0.000199,0.000156,0.000717,0.000618,0.000438,0.000186,0.000113,0.000491,9.9e-05,0.000134,0.000175,8.1e-05,9.2e-05,0.000188,7.3e-05,9.5e-05,0.000102,4.8e-05,2.7e-05,1.6e-05,2e-05,3.2e-05,2.2e-05,0.000182,0.000174,0.000272,0.000106,2.9e-05,1e-04,3.4e-05,6e-06,0.000134,1e-04,7.8e-05,6e-05,3.4e-05,3.7e-05,3e-05,7.3e-05,2.2e-05,1.7e-05,2.2e-05,2.3e-05,6e-05,1.4e-05,2.9e-05,2e-05,4.6e-05,1.5e-05,4.6e-05,3e-05,3.3e-05,4.8e-05,2.1e-05,9.5e-05,3.2e-05,2e-05,1.1e-05,3.3e-05,2.9e-05,4e-05,1.8e-05,7e-06
2e-06,3e-06,5.1e-05,2.8e-05,1.9e-05,5e-06,8e-06,7e-06,8e-06,4.7e-05,4.4e-05,3.8e-05,9e-06,3e-06,5e-06,1e-06,3e-06,3e-06,2e-06,5e-06,0,5e-06,2e-06,7e-06,8e-06,9.4e-05,0.000202,0.000186,0.000508,0.000298,0.000281,7.3e-05,0.000238,0.00028,4.9e-05,0.000466,0.000531,0.000455,0.00024,0.000177,0.000479,0.000365,0.000387,0.000836,0.000525,0.000317,0.000227,0.000258,0.000651,0.000509,0.000388,0.001114,0.000884,0.000632,0.00024,0.000354,0.000503,0.000599,0.000293,0.000574,0.000615,0.000294,0.000349,0.000192,7.3e-05,0.000299,0.000132,0.000122,9e-05,0.00012,5.6e-05,6e-05,6.8e-05,9.2e-05,0.000116,1e-05,5.6e-05,1.2e-05,2.2e-05,3.6e-05,6.2e-05,0.000148,6.2e-05,0.000116,5.5e-05,3.1e-05,4.5e-05,5.1e-05,5.5e-05,0.000197,0.000181,8.8e-05,3.1e-05,5e-05,1.3e-05,4.5e-05,2.7e-05,9e-06,3e-05,2.9e-05,3.4e-05,1.4e-05,3.5e-05,6e-06,7e-06,2.7e-05,1.1e-05,4.1e-05,1.6e-05,1.8e-05,5.6e-05,5.9e-05,8e-06,1.6e-05,2e-05,6e-06,3.5e-05,1e-05,2e-06,9e-06,1.7e-05
7e-06,9e-06,4.9e-05,2.2e-05,8e-06,4e-06,1.3e-05,5e-06,6e-06,3.7e-05,6.5e-05,3e-05,5e-06,4e-06,5e-06,2e-06,3e-06,2e-06,0,5e-06,3e-06,1e-06,4e-06,6e-06,4e-06,9.6e-05,0.000234,0.000127,0.000507,0.000521,0.000282,0.000107,0.000188,0.000102,7e-05,0.00026,0.000121,9.8e-05,0.000662,0.000258,0.00052,0.000739,9e-06,0.000345,0.000574,0.000307,0.000122,0.000454,0.000648,0.000619,0.000337,0.000392,0.000552,0.000623,0.000525,0.000643,0.000961,0.000383,0.000163,0.000413,0.000426,0.000166,0.000274,0.00014,8.6e-05,0.000235,9.1e-05,8.9e-05,9.2e-05,8.6e-05,2.6e-05,6.2e-05,5.2e-05,6.9e-05,6.6e-05,1.9e-05,2e-05,1.4e-05,1e-05,2.1e-05,4e-05,6.4e-05,9.8e-05,4.3e-05,5.8e-05,1e-05,0.000104,3.4e-05,4.5e-05,0.000191,5.7e-05,2.1e-05,3.9e-05,1.4e-05,2e-06,3.5e-05,2.2e-05,7e-06,1.4e-05,2.3e-05,2.1e-05,5e-06,1.3e-05,1e-06,4e-06,4e-06,2.3e-05,2.5e-05,1.9e-05,2.2e-05,3.4e-05,3.2e-05,8e-06,3e-06,2.1e-05,2.6e-05,2.3e-05,1.9e-05,1.7e-05,2.2e-05,1e-05
3e-06,1.4e-05,4.2e-05,2.3e-05,1e-06,1.4e-05,2e-05,1.3e-05,3e-06,3.3e-05,6.2e-05,2.9e-05,7e-06,4e-06,5e-06,6e-06,4e-06,1e-06,1e-06,8e-06,6e-06,1e-06,3e-06,5e-06,5e-06,9.2e-05,0.000248,0.000141,0.000458,0.000382,0.000202,6.4e-05,0.000192,0.000108,5.9e-05,9.9e-05,6.3e-05,0.000226,0.000887,0.000787,0.000355,0.000791,0.000492,0.000636,0.000181,0.000617,0.000463,9e-05,0.00055,0.000334,0.000252,0.000458,0.000454,0.000185,0.000284,0.000729,0.000718,0.000723,0.00034,0.000483,0.00039,4.1e-05,0.000407,0.000229,0.000118,0.000262,3.8e-05,6e-05,4.7e-05,0.000149,5.6e-05,5.4e-05,5.1e-05,5.2e-05,9e-05,6.5e-05,2.4e-05,9e-06,2.2e-05,2.7e-05,3.4e-05,0.000116,6.7e-05,0.000121,9.3e-05,3.7e-05,0.000136,2.3e-05,1.8e-05,0.000188,7.7e-05,3.5e-05,4.4e-05,3.7e-05,2.6e-05,2.1e-05,2.3e-05,1.1e-05,2.5e-05,1.4e-05,1e-06,1.7e-05,1.4e-05,1.3e-05,1e-05,3e-06,1.3e-05,1.2e-05,1.2e-05,5e-06,3.9e-05,2.6e-05,2.1e-05,2.4e-05,2e-06,1.5e-05,4e-06,7e-06,2.1e-05,8e-06,1.8e-05
1e-06,1e-05,3.5e-05,2e-05,5e-06,9e-06,7e-06,3e-06,4e-06,3.8e-05,4.5e-05,2.9e-05,1.7e-05,7e-06,3e-06,6e-06,2e-06,2e-06,3e-06,6e-06,3e-06,6e-06,2e-06,6e-06,6e-06,8.7e-05,0.000233,0.000105,0.000511,0.000164,0.000113,2.4e-05,0.000216,5.3e-05,0.000104,0.000176,3.1e-05,9e-05,0.000599,0.000546,0.000448,0.000507,0.000227,0.000149,0.000108,0.000519,0.000156,0.000334,0.000138,0.000156,0.000106,0.000345,0.000337,0.000112,0.000639,0.000187,0.000429,0.000243,0.000236,0.000186,0.00042,0.000173,0.000264,0.000121,0.000111,0.000192,8.5e-05,2.9e-05,6.1e-05,0.000151,2.5e-05,2.3e-05,4.1e-05,4.7e-05,9.3e-05,5.2e-05,2.2e-05,3e-05,3.5e-05,6e-06,7e-06,0.000153,3.4e-05,0.00012,6.2e-05,4.6e-05,7.6e-05,6.6e-05,5.2e-05,0.000191,5.7e-05,2e-06,5.4e-05,2.7e-05,1.7e-05,4.1e-05,1.7e-05,1e-05,1.8e-05,2.1e-05,2.3e-05,1.4e-05,2e-05,1.1e-05,6e-06,1.2e-05,1.4e-05,1.3e-05,6e-06,7e-06,3.3e-05,3e-05,3e-05,1e-05,2e-05,2.2e-05,9e-06,8e-06,8e-06,1.2e-05,1.6e-05
1e-06,9e-06,1.8e-05,6e-06,5e-06,6e-06,3e-06,3e-06,2e-06,3.6e-05,2.9e-05,1.3e-05,1.1e-05,6e-06,2e-06,2e-06,1e-06,2e-06,1e-06,6e-06,1e-06,2e-06,3e-06,6e-06,5e-06,7.5e-05,0.000198,1e-04,0.000474,0.00028,0.000128,4.5e-05,0.000227,0.000115,6.1e-05,0.000183,0.00023,7.1e-05,0.000254,0.000281,0.000616,0.000225,0.000499,0.000326,0.000281,0.000268,2e-05,0.000365,0.000308,0.000329,0.000118,0.000166,0.00071,0.000245,0.000394,0.00022,0.000187,0.000439,0.000294,0.000146,0.000211,0.000226,0.000256,0.000182,9.3e-05,1e-04,4.1e-05,1.4e-05,6.2e-05,8.5e-05,2.7e-05,2.4e-05,4.5e-05,4.5e-05,4.4e-05,5.7e-05,2.2e-05,1.8e-05,2e-05,2.6e-05,2.2e-05,0.000161,8e-05,0.000134,7.4e-05,8e-06,3.6e-05,2e-05,2.6e-05,0.000196,4.1e-05,2.6e-05,2.7e-05,1.8e-05,1.4e-05,2.9e-05,2.2e-05,6e-06,1.5e-05,1.3e-05,2.9e-05,2.1e-05,5e-06,1e-05,2e-06,1.6e-05,9e-06,1e-05,6e-06,1e-05,2.2e-05,3.6e-05,2.1e-05,9e-06,1.9e-05,1.4e-05,1.6e-05,2.1e-05,1.7e-05,7e-06,1.6e-05
3e-06,1e-05,1.7e-05,1.6e-05,8e-06,1.3e-05,1e-06,1e-06,5e-06,3e-05,1.5e-05,1.4e-05,1.3e-05,3e-06,6e-06,6e-06,3e-06,4e-06,2e-06,6e-06,3e-06,4e-06,2e-06,6e-06,4e-06,6.7e-05,0.000179,0.00011,0.000436,0.000276,0.000142,2.7e-05,0.000269,0.000113,9.5e-05,0.000116,0.000319,0.000359,0.000262,0.000587,0.000368,0.000302,0.000369,0.000273,0.000298,0.000441,0.000487,0.000163,0.000386,0.000375,7.2e-05,0.000296,0.000402,0.00042,0.000437,0.000416,8.4e-05,0.000159,0.000244,0.000207,0.000211,0.000323,3.3e-05,4.3e-05,0.000113,0.000105,0.00015,5e-05,6.5e-05,4.1e-05,4.5e-05,3.2e-05,3.9e-05,8.2e-05,4.7e-05,3.8e-05,3.7e-05,6.2e-05,2.4e-05,2.9e-05,3.3e-05,0.000116,8.5e-05,0.000185,0.000107,3.9e-05,0.000113,4.8e-05,4.4e-05,0.000198,7.9e-05,2.4e-05,1.3e-05,1.3e-05,2.1e-05,4.1e-05,1.5e-05,1.8e-05,1.5e-05,8e-06,3.9e-05,1.5e-05,7e-06,3e-06,7e-06,1.7e-05,2.2e-05,1e-05,4e-06,7e-06,8e-06,3.9e-05,2.9e-05,2.1e-05,1.9e-05,2e-05,2e-05,1.7e-05,1.7e-05,1e-05,6e-06
3e-06,1.2e-05,1.3e-05,1e-05,3e-06,1.2e-05,9e-06,3e-06,4e-06,2.7e-05,2.6e-05,1.7e-05,6e-06,8e-06,5e-06,3e-06,3e-06,2e-06,0,3e-06,2e-06,6e-06,5e-06,5e-06,3e-06,7e-05,0.000229,0.000127,0.000402,0.000249,0.000102,4.1e-05,3e-04,0.000107,8e-05,7.4e-05,0.000254,0.000357,0.000191,0.000734,0.000321,0.000306,0.000334,0.000131,9.3e-05,0.00052,0.000369,0.000156,7.5e-05,0.000334,0.00012,0.000286,0.000207,0.000399,0.000507,0.000248,0.000198,0.000353,0.000245,0.000153,0.000191,0.000152,8.1e-05,0.000303,0.000227,0.00028,0.000119,0.000142,9.9e-05,0.000103,8.9e-05,5.5e-05,4.4e-05,9.4e-05,7.8e-05,8.9e-05,5.9e-05,9.4e-05,0.000114,7.1e-05,2.3e-05,5.5e-05,0.000122,0.000165,0.000213,8.4e-05,0.000135,7.4e-05,3.8e-05,0.000175,3.6e-05,1.1e-05,1.6e-05,3.1e-05,1.5e-05,1.8e-05,1.4e-05,2e-06,2.3e-05,1.9e-05,5.2e-05,2.6e-05,3e-06,1.1e-05,1.2e-05,9e-06,2.1e-05,2.8e-05,1.8e-05,2e-05,7e-06,6.3e-05,4.4e-05,1e-05,6e-06,8e-06,1.2e-05,2.2e-05,8e-06,7e-06,1.4e-05
2e-06,1e-05,2e-05,1.4e-05,6e-06,6e-06,6e-06,6e-06,7e-06,2.8e-05,2.6e-05,2.7e-05,1.4e-05,7e-06,4e-06,4e-06,0,3e-06,2e-06,4e-06,5e-06,1e-06,3e-06,5e-06,6e-06,6e-05,0.000213,0.000134,4e-04,0.000228,0.000147,7e-05,0.000284,0.000112,4.4e-05,0.000157,1e-04,0.000305,0.000313,0.000666,0.000595,0.000333,0.000339,0.000323,0.000321,0.000616,0.000497,0.000306,5.1e-05,0.00023,0.000107,0.000152,0.000402,0.000108,0.000466,0.000265,0.000181,0.000222,0.000311,0.000248,0.000295,0.000206,0.000375,0.000167,0.000164,0.000453,0.000369,0.00026,0.000127,0.000271,0.000109,2.4e-05,2.7e-05,5.9e-05,7.1e-05,6.5e-05,4.3e-05,5.3e-05,2.3e-05,4.4e-05,7.1e-05,0.000101,0.000155,0.000315,0.000199,0.00011,8e-05,1e-05,1.6e-05,0.000185,9.7e-05,5.7e-05,4e-05,5.2e-05,1.6e-05,2.2e-05,2.7e-05,1.6e-05,1.1e-05,2.7e-05,4e-05,3.2e-05,3.2e-05,4e-06,3e-06,1.7e-05,1.4e-05,4e-06,7e-06,9e-06,1.4e-05,7.4e-05,3.1e-05,2e-05,1.2e-05,2e-06,7e-06,8e-06,1.3e-05,2.1e-05,7e-06
4e-06,1.2e-05,4e-05,1.5e-05,1e-05,2e-06,9e-06,5e-06,1e-06,2.3e-05,3.7e-05,8e-06,7e-06,2e-06,1e-06,2e-06,0,4e-06,2e-06,4e-06,3e-06,2e-06,3e-06,2e-06,2e-06,5.2e-05,0.00014,6.8e-05,0.000367,0.00028,0.000201,6.4e-05,0.000309,0.000229,7e-05,7.1e-05,0.000195,5.9e-05,0.000195,0.000643,0.000244,0.000315,0.000449,0.000233,0.000302,0.000264,0.000293,0.000172,0.000104,0.000152,0.000131,0.000159,1.2e-05,0.000211,0.000207,0.000212,0.000188,0.000401,0.000151,0.000134,0.000214,0.000295,0.000213,0.000215,0.000205,0.000352,0.000174,0.000134,0.000136,0.000198,5.6e-05,4.7e-05,1.7e-05,6.6e-05,4.3e-05,4.4e-05,0.000106,5.8e-05,1.6e-05,6.1e-05,6.8e-05,8.3e-05,2e-05,0.000209,0.000133,6.4e-05,2.2e-05,4.9e-05,2.1e-05,0.000162,0.000114,6.6e-05,5.2e-05,3e-05,7e-06,3.8e-05,4e-06,1.3e-05,8e-06,5e-06,3.8e-05,1.8e-05,2e-05,3e-05,2.1e-05,3e-06,1.8e-05,1.9e-05,7e-06,9e-06,1.8e-05,5.9e-05,3.3e-05,1.8e-05,1.2e-05,5e-06,7e-06,1.4e-05,9e-06,2.3e-05,1e-05
6e-06,1.1e-05,4.6e-05,1.9e-05,7e-06,1e-05,8e-06,1e-06,5e-06,2.5e-05,4.5e-05,2.5e-05,1.1e-05,7e-06,2e-06,1e-06,2e-06,5e-06,2e-06,4e-06,3e-06,2e-06,1e-06,2e-06,2e-06,5.3e-05,0.000122,1.8e-05,0.000351,0.000365,9e-05,4.6e-05,0.000303,6e-04,0.000488,0.000284,0.000366,6.9e-05,0.000125,0.000312,0.000346,0.000144,0.000267,0.000168,5.5e-05,8.8e-05,0.000379,5.4e-05,0.000184,0.000231,0.000126,0.000278,0.000119,0.000313,0.000341,0.000265,0.000105,0.000253,0.00016,0.000279,0.000166,0.000102,0.000233,0.00029,0.000115,0.000281,4.5e-05,0.000153,0.000202,0.000165,0.000166,0.000102,0.000103,8.2e-05,0.000118,9.2e-05,9.8e-05,9.9e-05,5.8e-05,6e-05,3.6e-05,1.1e-05,3.9e-05,0.00016,4.2e-05,2.9e-05,4.7e-05,6.6e-05,3.7e-05,0.000136,0.00021,8e-05,7.4e-05,5e-05,3e-05,3.4e-05,6e-06,1.9e-05,1.9e-05,2.9e-05,4.1e-05,2.8e-05,1.2e-05,2.4e-05,1.5e-05,3e-06,1e-05,1.9e-05,1.8e-05,1.4e-05,1.4e-05,9e-05,4.2e-05,3.4e-05,1e-05,8e-06,1.2e-05,1.6e-05,3e-06,1e-05,1e-05
1e-05,1.4e-05,3.3e-05,2.9e-05,7e-06,7e-06,8e-06,7e-06,8e-06,1.8e-05,2.5e-05,1.3e-05,6e-06,6e-06,4e-06,4e-06,2e-06,3e-06,2e-06,5e-06,2e-06,2e-06,2e-06,3e-06,2e-06,5.2e-05,0.000122,0.000114,0.000278,0.00024,0.000197,9.6e-05,0.000317,0.000618,0.000326,0.000135,0.000126,0.000432,0.000305,0.000176,0.000313,0.000179,0.000149,0.000232,0.000361,4.6e-05,0.000348,0.000264,0.000185,0.000242,5.7e-05,0.000301,0.000137,0.000462,0.000564,2e-04,0.000179,1.4e-05,5.3e-05,0.000147,5.4e-05,0.000381,0.000282,0.000319,0.000264,0.000255,0.000119,0.00015,7.8e-05,7.8e-05,9e-05,8.9e-05,2.5e-05,6.1e-05,5.5e-05,9.9e-05,0.000113,8.4e-05,4.4e-05,5.7e-05,1.4e-05,4.3e-05,0.000127,0.000134,8.9e-05,4.7e-05,9e-05,6.8e-05,5e-05,0.000111,0.000258,0.00017,8.4e-05,3.8e-05,5e-06,2.1e-05,3.9e-05,4.2e-05,1.4e-05,2.9e-05,8.1e-05,6.1e-05,4.1e-05,1.9e-05,9e-06,8e-06,6e-06,2.8e-05,1.3e-05,1.3e-05,2.1e-05,0.000107,6.8e-05,2.5e-05,2.3e-05,5e-06,1.6e-05,1.5e-05,1.1e-05,2.2e-05,2e-05
3e-06,1e-05,2.5e-05,1e-05,4e-06,1e-05,2e-06,4e-06,8e-06,1.9e-05,3e-05,2.2e-05,6e-06,4e-06,4e-06,3e-06,3e-06,3e-06,1e-06,3e-06,1e-06,4e-06,1e-06,3e-06,4e-06,4.3e-05,8.6e-05,9.8e-05,0.000231,3e-05,7.9e-05,0.00011,0.000166,0.000322,0.000148,0.00011,0.000207,0.000248,8.6e-05,0.000114,0.000428,9e-05,4.7e-05,0.000243,0.00018,0.000191,0.000307,0.000216,0.000102,0.000234,4.4e-05,0.000266,0.000116,0.000257,0.000315,0.00024,0.000171,0.000326,0.000242,0.000246,6.2e-05,0.000343,0.000151,0.000264,7.9e-05,0.000124,5e-05,5e-05,5.1e-05,3.4e-05,2.7e-05,2.8e-05,2.8e-05,2.7e-05,7.6e-05,4.4e-05,9.5e-05,6.8e-05,8.3e-05,5.1e-05,4.9e-05,0.00014,9.7e-05,8.3e-05,7.1e-05,6.5e-05,4.7e-05,2.6e-05,4.8e-05,0.000134,0.00017,8.4e-05,6.9e-05,3.7e-05,2.6e-05,2.2e-05,4.5e-05,2.1e-05,4e-06,8e-06,6.1e-05,5.3e-05,8e-06,3.2e-05,1.7e-05,1.8e-05,7e-06,1.8e-05,1.1e-05,8e-06,1.6e-05,9.2e-05,4.1e-05,3.3e-05,1.9e-05,5e-06,1.1e-05,8e-06,8e-06,1.8e-05,4e-06
3e-06,1.3e-05,2.8e-05,1.3e-05,3e-06,7e-06,2e-06,4e-06,4e-06,2.1e-05,4.6e-05,2e-05,3e-06,1e-06,1e-06,1e-06,2e-06,1e-06,1e-06,1e-06,5e-06,3e-06,2e-06,4e-06,2e-06,3.7e-05,9e-05,5.6e-05,0.000192,0.000267,7.9e-05,1.7e-05,0.000144,0.000193,0.000111,0.000181,5.3e-05,0.000173,0.000142,0.000307,0.000389,0.000274,0.000137,0.000241,0.000206,0.000235,0.000446,0.000289,0.00016,0.000139,0.000129,0.000348,0.000185,0.000216,0.000328,0.000188,3.7e-05,0.00022,0.00027,6.9e-05,0.00025,0.000382,0.000225,0.000124,0.000119,0.000244,0.000173,9.2e-05,0.000122,4.2e-05,6.4e-05,6.6e-05,1.7e-05,5.7e-05,8.1e-05,6.4e-05,9.7e-05,0.000112,5.6e-05,1.5e-05,1.6e-05,0.000178,0.000116,5.1e-05,9.8e-05,2.8e-05,0.000111,1.1e-05,5.7e-05,0.000105,5.3e-05,7.9e-05,4.4e-05,3.2e-05,1.2e-05,3.6e-05,2.9e-05,3.5e-05,5e-05,2e-05,3.9e-05,7e-06,1.8e-05,2.2e-05,9e-06,1.2e-05,1.7e-05,8e-06,2e-06,1.3e-05,2.6e-05,5.1e-05,3.2e-05,1.3e-05,4e-06,1.2e-05,5e-06,1e-05,7e-06,3e-06,8e-06
3e-06,1.2e-05,2e-05,1.2e-05,8e-06,7e-06,3e-06,5e-06,3e-06,2e-05,3.5e-05,1.5e-05,3e-06,6e-06,3e-06,2e-06,1e-06,5e-06,3e-06,2e-06,5e-06,7e-06,4e-06,6e-06,7e-06,3.7e-05,8.8e-05,2.8e-05,0.000147,0.000335,0.000259,0.000117,0.00011,0.000183,0.000174,0.000194,0.000196,0.000239,0.000211,7.4e-05,0.000283,0.000321,3e-04,0.000126,0.000258,0.000191,0.000502,0.000338,0.000176,0.000207,0.000179,0.000277,0.000237,0.000265,0.000179,0.00015,1e-04,0.000254,0.000299,0.000277,0.000121,0.000314,0.000148,0.000132,0.000182,4.5e-05,0.00013,0.000187,0.000307,0.000181,3e-05,7.9e-05,4e-06,5.5e-05,2.1e-05,9.4e-05,6.4e-05,6.8e-05,8.1e-05,1.8e-05,5.1e-05,0.000182,0.000108,0.000185,8.3e-05,0.000124,9.6e-05,0.00012,9.2e-05,8e-05,0.000187,9.1e-05,2.7e-05,3.4e-05,4.4e-05,3.2e-05,3.4e-05,1.2e-05,4.4e-05,1.6e-05,2.6e-05,5e-06,8e-06,2e-05,9e-06,1.2e-05,1.5e-05,1.3e-05,6e-06,2.2e-05,3.8e-05,4.2e-05,2.6e-05,2.6e-05,9e-06,1.4e-05,1.5e-05,1.2e-05,1.1e-05,9e-06,1e-05
6e-06,9e-06,1.4e-05,1.2e-05,1.6e-05,8e-06,7e-06,1e-06,3e-06,2e-05,2.4e-05,3e-05,1.4e-05,3e-06,3e-06,3e-06,2e-06,5e-06,2e-06,4e-06,4e-06,4e-06,3e-06,4e-06,2e-06,3.7e-05,3.6e-05,5.7e-05,0.000157,0.00033,0.000401,0.000198,8.9e-05,0.000187,0.000209,0.000242,0.000125,0.000172,0.000139,5.9e-05,0.000578,0.000149,0.000154,0.000362,0.000117,0.000217,0.000359,0.000126,8.5e-05,0.000332,0.000137,0.000316,0.000188,0.000231,0.000185,0.000205,4.5e-05,0.000458,0.000459,0.00034,0.000195,0.000289,0.000343,4.4e-05,0.000102,9.4e-05,0.000174,0.000252,0.000341,0.000317,0.000236,0.00021,0.000113,0.000108,9.1e-05,0.000135,8.7e-05,1.5e-05,6.6e-05,5.3e-05,8.4e-05,0.000125,6.1e-05,0.000215,0.000181,4.8e-05,9.5e-05,0.000158,7e-05,8.3e-05,0.000299,0.000218,0.000103,1.6e-05,3.1e-05,3.3e-05,4e-05,3e-05,2e-05,1.3e-05,1.6e-05,2.2e-05,2.1e-05,3e-05,3.4e-05,1.4e-05,7e-06,8e-06,8e-06,1.2e-05,2.8e-05,3.1e-05,1.6e-05,2.5e-05,2.2e-05,4e-06,2e-06,1.3e-05,9e-06,8e-06,8e-06
4e-06,1.2e-05,6e-06,8e-06,1.3e-05,5e-06,2e-06,3e-06,3e-06,2.1e-05,2.4e-05,5e-06,3e-06,3e-06,2e-06,0,2e-06,1e-06,2e-06,4e-06,3e-06,3e-06,2e-06,2e-06,3e-06,3.7e-05,2.4e-05,4.3e-05,0.000148,0.000199,0.000186,0.000101,7.6e-05,9.4e-05,7.1e-05,7.9e-05,0.000149,0.000259,0.000194,0.000113,0.000461,0.000207,0.00033,0.00024,0.000261,0.000389,0.000157,8.2e-05,0.000171,0.000336,0.000264,0.000133,0.000294,0.000184,0.000305,0.000125,0.000283,0.000263,0.000204,0.000168,0.000155,3.9e-05,0.000101,0.000138,0.000144,0.000142,0.00015,1.9e-05,0.000226,0.000183,5.6e-05,8.9e-05,8.7e-05,2e-05,7.5e-05,5.6e-05,1e-05,6.6e-05,6.9e-05,3.6e-05,2.4e-05,0.000147,7.7e-05,0.00016,0.000155,9.8e-05,8.3e-05,6.9e-05,3e-05,0.000117,0.000235,0.000139,7e-05,2.7e-05,1.2e-05,1.8e-05,1.4e-05,7e-06,4e-06,5e-06,2e-05,2.9e-05,1.1e-05,1.3e-05,2.2e-05,1.5e-05,3e-06,7e-06,7e-06,1.4e-05,3.8e-05,1.4e-05,1.1e-05,1.4e-05,2e-06,6e-06,6e-06,4e-06,2e-06,6e-06,2e-06
1e-06,1e-05,4e-06,8e-06,6e-06,7e-06,1e-06,1e-06,2e-06,1.8e-05,1.9e-05,3e-06,4e-06,3e-06,0,1e-06,2e-06,1e-06,1e-06,3e-06,1e-06,2e-06,1e-06,1e-06,2e-06,3.7e-05,2.2e-05,3.7e-05,0.000184,7.9e-05,0.000102,4.2e-05,2.8e-05,5.3e-05,7.7e-05,4.3e-05,0.000141,0.000204,0.000332,0.000464,0.000559,0.000165,6.4e-05,0.000409,0.000119,0.00045,0.000285,0.000229,0.000224,3.7e-05,0.000148,0.000273,0.000256,0.000117,9.7e-05,0.000199,0.000334,0.000332,8e-06,0.000151,8.2e-05,8.4e-05,0.000127,9.2e-05,5e-05,2.7e-05,9.1e-05,0.000102,6.6e-05,9.3e-05,5.8e-05,8e-06,3.8e-05,3.3e-05,6.6e-05,2e-05,3.3e-05,5.3e-05,2.3e-05,2.3e-05,2.1e-05,0.000134,4e-05,8.1e-05,2.6e-05,2.1e-05,4.6e-05,1.4e-05,9e-06,9.4e-05,0.000137,6.5e-05,2.1e-05,1.2e-05,5e-06,8e-06,5e-06,7e-06,2e-05,1e-05,9e-06,1e-05,1.6e-05,6e-06,8e-06,3e-06,7e-06,5e-06,7e-06,8e-06,2.7e-05,4e-06,1e-06,9e-06,4e-06,2e-06,3e-06,5e-06,0,6e-06,2e-06
1e-06,9e-06,2e-06,3e-06,7e-06,3e-06,2e-06,2e-06,2e-06,1.7e-05,1e-05,4e-06,3e-06,1e-06,2e-06,2e-06,1e-06,1e-06,0,3e-06,1e-06,2e-06,1e-06,1e-06,2e-06,3.8e-05,2.1e-05,1.5e-05,0.000201,0.000192,5.7e-05,3e-05,1.1e-05,1.1e-05,3.3e-05,4.9e-05,0.000171,3.9e-05,0.000201,0.00019,0.000453,0.000181,8.9e-05,0.000385,0.000176,0.000317,0.000145,0.000103,0.000137,0.000113,4.3e-05,0.000227,0.000216,0.000156,0.000177,0.000168,0.000241,0.000133,6.9e-05,1e-04,0.000199,4.5e-05,6.1e-05,5.5e-05,3.7e-05,6e-05,1.3e-05,6.4e-05,3.9e-05,5.1e-05,1.9e-05,1.2e-05,3e-05,2.4e-05,6.6e-05,1.9e-05,2e-06,2e-05,1.4e-05,3e-06,4e-06,0.000112,1.9e-05,3.8e-05,1.8e-05,1.1e-05,1.4e-05,5e-06,4e-06,0.000102,4.1e-05,1.3e-05,8e-06,1.2e-05,7e-06,5e-06,9e-06,2e-06,1.4e-05,3e-06,1e-05,1.1e-05,8e-06,3e-06,4e-06,1e-06,5e-06,3e-06,4e-06,2e-06,2.8e-05,2e-06,2e-06,1e-05,4e-06,2e-06,2e-06,4e-06,0,4e-06,3e-06
1e-06,9e-06,2e-06,2e-06,6e-06,3e-06,0,2e-06,2e-06,1.7e-05,1.3e-05,3e-06,2e-06,1e-06,1e-06,3e-06,1e-06,1e-06,0,3e-06,1e-06,1e-06,2e-06,2e-06,2e-06,3.9e-05,5.1e-05,2.3e-05,0.000215,0.000162,4.7e-05,1.5e-05,9e-06,2.3e-05,3e-05,3.7e-05,0.000109,1.5e-05,0.000182,0.000193,0.000387,8.8e-05,8.1e-05,0.000388,0.00017,0.000288,8.7e-05,0.000132,0.000158,9.9e-05,3e-05,0.000233,0.000193,0.000241,6.4e-05,5.2e-05,0.000128,0.000182,7.3e-05,4.9e-05,0.000119,8.8e-05,7.7e-05,5.6e-05,3.3e-05,6.4e-05,1.1e-05,6e-05,1.7e-05,3.6e-05,1.4e-05,6e-06,2.8e-05,1.9e-05,6e-05,1.5e-05,3e-06,7e-06,1.3e-05,2e-06,7e-06,0.000104,6e-06,3.2e-05,1e-05,4e-06,3e-06,9e-06,6e-06,9.9e-05,2.5e-05,7e-06,3e-06,1.2e-05,1e-06,3e-06,1e-05,2e-06,1.6e-05,4e-06,1.4e-05,1e-05,7e-06,2e-06,3e-06,2e-06,5e-06,3e-06,4e-06,2e-06,2.7e-05,1e-06,2e-06,7e-06,2e-06,1e-06,3e-06,4e-06,2e-06,5e-06,3e-06
