0.107215,0.489868,0.691953,0.478637,0.333939,0.413506,0.598991,0.637128,0.588419,0.561128,0.576324,0.663096,0.680632,0.591001,0.485497,0.369167,0.241049,0.162833,0.113642,0.079855,0.080659,0.127399,0.116967,0.055961,0.040684,0.033798,0.020623,0.016435
0.121235,0.547494,0.77589,0.538379,0.371068,0.463291,0.669128,0.69733,0.646033,0.620361,0.636916,0.777129,0.83663,0.72899,0.598203,0.455991,0.295071,0.19785,0.139082,0.097585,0.100842,0.162951,0.146297,0.066409,0.04804,0.039518,0.023896,0.019339
0.139105,0.61517,0.876196,0.608913,0.410725,0.51951,0.753902,0.779552,0.73944,0.718738,0.739197,0.990475,1.143889,0.999292,0.810726,0.612582,0.389076,0.25905,0.184158,0.129009,0.137907,0.227489,0.196706,0.082273,0.059183,0.048065,0.028962,0.024364
0.153286,0.669296,0.932905,0.619746,0.404156,0.518686,0.793973,0.886993,0.88909,0.878064,0.906186,1.251716,1.4908,1.298519,1.040128,0.767147,0.469535,0.311507,0.223073,0.157226,0.172284,0.280057,0.231518,0.09061,0.065448,0.052313,0.032252,0.029097
0.182848,0.794517,1.045281,0.6231,0.397689,0.533975,0.912028,1.154723,1.201552,1.188379,1.20018,1.562471,1.825694,1.594132,1.284458,0.903792,0.517118,0.341264,0.239278,0.170968,0.189546,0.290987,0.230396,0.089218,0.064522,0.05016,0.03312,0.032687
0.230502,0.974243,1.229588,0.682521,0.426237,0.59493,1.186254,1.692862,1.808792,1.806942,1.787274,2.073066,2.2963,2.052856,1.690504,1.108405,0.565263,0.364311,0.246575,0.182996,0.19146,0.256235,0.199355,0.088653,0.06515,0.049208,0.034701,0.035774
0.307543,1.253812,1.553374,0.839253,0.49614,0.703463,1.678627,2.664083,2.933473,2.984458,2.968279,3.208251,3.434424,3.201183,2.748545,1.758374,0.818333,0.504834,0.349768,0.267828,0.241479,0.257385,0.200544,0.116638,0.088281,0.063906,0.044755,0.044385
0.429362,1.713812,2.085483,1.093587,0.622412,0.95269,2.60776,4.388865,4.995889,5.191417,5.149409,5.349237,5.663683,5.404363,4.688216,2.988246,1.374518,0.839167,0.595681,0.458272,0.384922,0.366046,0.283207,0.188225,0.14268,0.096846,0.067228,0.066
0.545673,2.154202,2.573222,1.318198,0.75105,1.31841,4.120334,7.143581,8.204281,8.625042,8.547685,8.530926,8.778071,8.393169,7.269349,4.60973,2.12491,1.318778,0.963205,0.738533,0.592815,0.53349,0.412562,0.292147,0.216944,0.138843,0.097007,0.097584
0.5953,2.386549,2.859076,1.476217,0.85636,1.732914,6.101722,10.794277,12.310581,12.887021,12.787245,12.253173,11.973432,11.333158,9.833246,6.198202,2.860734,1.820588,1.359174,1.040917,0.800447,0.692781,0.548089,0.409427,0.294549,0.180902,0.127936,0.13131
0.594023,2.44029,3.013012,1.642852,0.990166,2.153451,8.042471,14.312109,16.03965,16.484031,16.435046,15.381306,14.144809,13.048898,11.291987,7.107046,3.370262,2.197293,1.625125,1.236695,0.915415,0.77456,0.646887,0.512846,0.357208,0.215073,0.150963,0.155548
0.597026,2.463268,3.13457,1.794951,1.091856,2.366587,8.937498,15.870856,17.331524,17.187227,17.282454,16.107679,13.980682,12.455655,10.667825,6.743482,3.417656,2.311162,1.638361,1.215279,0.873497,0.755045,0.668759,0.546416,0.371801,0.225369,0.157487,0.164344
0.555439,2.257088,2.915217,1.710417,1.025408,2.142099,7.968234,14.059266,14.861054,14.067836,14.463453,13.783596,11.271369,9.720438,8.501345,5.433295,2.930029,2.040023,1.361777,0.963376,0.678237,0.619994,0.567564,0.469269,0.321116,0.197945,0.145138,0.163433
0.454248,1.786445,2.261596,1.303157,0.791362,1.66205,5.752008,9.692668,9.854185,9.018291,9.43665,9.240052,7.373951,6.295397,5.575022,3.591539,2.019216,1.399479,0.896424,0.624258,0.445719,0.437457,0.393523,0.315006,0.226196,0.141699,0.116225,0.148
0.316782,1.218236,1.519218,0.886696,0.583247,1.196231,3.639963,5.539908,5.49348,5.032033,5.024402,4.99399,4.210961,3.665999,3.140249,1.992912,1.089044,0.721275,0.459936,0.327843,0.262311,0.300678,0.251612,0.166025,0.134696,0.094061,0.084535,0.113938
0.222633,0.872173,1.140272,0.727155,0.50441,0.847882,2.277897,3.399935,3.594816,3.337132,2.987882,2.827443,2.503266,2.252454,1.891217,1.188684,0.558594,0.321714,0.22455,0.180211,0.176376,0.251346,0.204681,0.096751,0.084051,0.069475,0.059589,0.077386
0.217847,0.914399,1.238128,0.777825,0.533403,0.732834,1.545884,2.3619,2.932593,2.869157,2.346809,2.100942,2.02717,1.931709,1.549791,1.020638,0.509898,0.258618,0.18111,0.149034,0.16755,0.295198,0.245628,0.088122,0.066151,0.054759,0.044004,0.06248
0.269494,1.186382,1.577608,0.965576,0.717128,0.939628,1.691404,2.476032,3.054352,2.933372,2.373467,2.169075,2.258855,2.268101,1.800694,1.251868,0.691132,0.347374,0.241383,0.185096,0.21916,0.418379,0.34456,0.104506,0.070486,0.055439,0.042646,0.06732
0.328302,1.477342,1.954468,1.193996,0.932768,1.204539,2.071513,2.953062,3.370238,3.078937,2.638028,2.612495,2.853587,2.981017,2.389723,1.661127,0.942899,0.478768,0.332319,0.25119,0.30966,0.599706,0.489028,0.136311,0.08411,0.063937,0.050893,0.084796
0.348383,1.564599,2.120393,1.348238,1.076282,1.366211,2.331598,3.370483,3.713301,3.392892,3.203655,3.379576,3.860917,4.062702,3.07124,2.027452,1.181566,0.609825,0.404205,0.314545,0.40719,0.775061,0.633442,0.179006,0.107667,0.082653,0.070841,0.119659
0.315787,1.378975,1.97761,1.378616,1.119097,1.388449,2.337989,3.556204,4.133077,3.964294,3.935016,4.243393,5.045974,5.153962,3.51375,2.173311,1.321388,0.69973,0.422917,0.350854,0.479121,0.862215,0.700207,0.207881,0.129509,0.107411,0.099061,0.157732
0.265942,1.126337,1.719843,1.298167,1.009108,1.256323,2.10595,3.332627,4.162037,4.199445,4.277931,4.747914,5.905459,5.667112,3.362483,1.942675,1.276224,0.72974,0.400502,0.348364,0.49393,0.830369,0.667133,0.221606,0.145985,0.133156,0.129729,0.184086
0.217205,0.916387,1.456493,1.102631,0.766848,1.107514,1.929824,2.944572,3.847261,3.893,3.773286,4.441846,5.879532,5.365615,2.906023,1.604405,1.147003,0.724601,0.367411,0.326485,0.457057,0.699476,0.568678,0.234743,0.154695,0.150702,0.158674,0.198744
0.176285,0.653023,1.098462,0.850913,0.55009,1.066488,1.908489,2.533303,3.196803,3.156646,2.800813,3.548381,4.939207,4.418813,2.444547,1.381353,1.04017,0.699879,0.331147,0.314874,0.41871,0.538232,0.46135,0.251247,0.156658,0.157277,0.1809,0.212694
0.154216,0.434034,0.766253,0.67116,0.447734,1.034455,1.899348,2.130014,2.425846,2.521889,2.398879,2.959212,3.771126,3.396167,2.140237,1.313982,0.943461,0.631052,0.300632,0.305179,0.378466,0.403548,0.384725,0.2619,0.152178,0.153667,0.183233,0.205665
0.14985,0.354217,0.578847,0.526195,0.379969,0.95658,1.783224,1.779986,1.872426,2.187633,2.327975,2.535973,2.746245,2.53811,1.849574,1.185758,0.763517,0.502105,0.25585,0.265531,0.300877,0.275079,0.293776,0.233466,0.134424,0.13865,0.159161,0.166344
0.129929,0.297167,0.442875,0.383553,0.324813,0.910335,1.649471,1.559385,1.593227,1.912087,2.096932,2.217238,2.302236,2.16203,1.694975,1.123531,0.649025,0.396118,0.196125,0.215015,0.229721,0.176383,0.182873,0.162021,0.102233,0.10291,0.108061,0.109845
0.097126,0.214897,0.320961,0.287204,0.26817,0.781239,1.372717,1.241857,1.224237,1.511778,1.674291,1.77134,1.91673,1.842926,1.531299,1.108975,0.665729,0.371126,0.151543,0.164138,0.175561,0.120629,0.096951,0.083777,0.064283,0.062004,0.059759,0.064334
0.071697,0.172878,0.258744,0.251635,0.257262,0.741649,1.25056,1.041334,0.92835,1.327767,1.510015,1.420997,1.613811,1.625717,1.361993,1.076197,0.684127,0.347291,0.148084,0.156877,0.159096,0.097233,0.053868,0.038568,0.038718,0.040063,0.035277,0.036889
0.064922,0.170909,0.232471,0.234083,0.282147,0.832316,1.528191,1.301555,0.960812,1.268278,1.413424,1.276699,1.456362,1.546067,1.28737,0.969935,0.610732,0.31847,0.171426,0.159907,0.14964,0.092407,0.048079,0.035383,0.035019,0.033921,0.031664,0.03197
0.069117,0.170983,0.211703,0.224432,0.303345,0.933785,1.867679,1.637242,1.040024,1.123481,1.206648,1.12595,1.396275,1.653315,1.35778,0.848589,0.448977,0.264473,0.185745,0.164335,0.142844,0.08592,0.043001,0.04009,0.044479,0.04349,0.041204,0.038526
0.072705,0.162793,0.193253,0.205847,0.281831,0.945405,2.034827,1.819758,1.005781,0.97406,1.183129,1.126666,1.280369,1.591817,1.298489,0.743976,0.361949,0.215788,0.181592,0.175446,0.141649,0.082286,0.042505,0.043346,0.051448,0.052054,0.049274,0.045734
0.074524,0.148357,0.162467,0.16496,0.232927,0.88146,1.932928,1.705816,0.883577,0.958418,1.410881,1.364265,1.194656,1.291671,1.067888,0.708496,0.38783,0.211376,0.175926,0.166554,0.126772,0.080139,0.044119,0.040325,0.048281,0.049917,0.047087,0.044983
0.066645,0.123154,0.116579,0.114521,0.185211,0.801172,1.652535,1.344267,0.669146,0.864885,1.492126,1.583314,1.2383,1.001251,0.777209,0.617952,0.387376,0.221079,0.180137,0.147649,0.109596,0.079905,0.042951,0.034795,0.03702,0.037351,0.035209,0.034446
0.053069,0.107226,0.093363,0.085045,0.144282,0.655125,1.430426,1.183215,0.558654,0.808386,1.403513,1.556744,1.260053,0.869898,0.670969,0.55345,0.345698,0.201827,0.169699,0.128795,0.093107,0.076755,0.042618,0.029022,0.028135,0.029768,0.026809,0.02233
0.041097,0.094752,0.083019,0.063619,0.09702,0.508822,1.281819,1.263259,0.718073,0.854217,1.181243,1.30281,1.126984,0.758449,0.685093,0.609529,0.336834,0.156526,0.143113,0.110182,0.081964,0.071506,0.043925,0.027454,0.027099,0.032159,0.025117,0.015549
0.035517,0.086866,0.074794,0.045293,0.06071,0.413701,1.079592,1.237329,0.89026,0.828551,0.956421,1.162373,0.920473,0.693049,0.817677,0.708124,0.355693,0.141278,0.141282,0.122689,0.08399,0.063625,0.044596,0.029352,0.027209,0.032606,0.0216,0.011442
0.031935,0.08117,0.067345,0.033936,0.045084,0.364131,0.920016,1.125112,0.942969,0.739972,0.795769,1.1013,0.779877,0.645071,0.959065,0.769549,0.356032,0.159121,0.152163,0.137303,0.086256,0.055512,0.041307,0.029198,0.026887,0.02865,0.01555,0.008699
0.031,0.07647,0.058368,0.023798,0.037803,0.368225,1.053045,1.143781,0.854179,0.739086,0.905349,1.132938,0.731636,0.649933,0.989391,0.725099,0.315819,0.167823,0.14607,0.128501,0.08113,0.053058,0.037144,0.025633,0.025733,0.022686,0.012054,0.008432
0.028837,0.070297,0.053347,0.021854,0.035438,0.383319,1.219511,1.287944,0.818479,0.731732,1.058777,1.073126,0.65052,0.658266,0.874295,0.609847,0.296142,0.183284,0.123132,0.09495,0.066624,0.049114,0.032767,0.022355,0.024495,0.017644,0.011194,0.009841
