-5.5e-05,0.000699,-0.000185,0.000185,-0.000248,0.000235,-4e-04,-0.000693,-0.000451,-0.000682,-3.8e-05,0.000273,0.000625,-0.000137,-0.000586,-0.000197,-0.000306,0.000843,0.00076,0.000482,0.000497,0.000432,0.000102,0.00048,0.001278,0.001429,0.000628,-0.000225,0.001066,-0.000351,-0.000375,0.000368,0.001355,0.000691,8.4e-05,0.000538,0.000908,0.001652,0.000467,5.9e-05,0.002002,0.001043,0.000652,0.00041,0.000414,0.000527,-0.000517,0.000306,0.001915,0.001518,0.000264,0.000654,0.001219,0.000939,-4.4e-05,0.000544,0.00101,0.000917,-0.000701,-0.000155,0.000422,-5.9e-05,0.000401,0.000962,-0.000235,-6.1e-05,0.000112,0.000507,-1.3e-05,-6e-06,-0.000255,-0.000704,0.000251,0.000141,0.000376,0.000477,0.000266,-0.00105,-0.000917,-0.001299,-0.001617,-0.000873,-0.000589,0.000277,-0.000952,-0.000106,0.000217,-0.00087,-0.000465,-7.8e-05,1e-06,-0.000183,-0.000118,-0.000325,-1.7e-05,0.000711,0.000184,0.000131,-0.001183,-0.00016,-0.000882,-6.1e-05,-0.000553,-0.000735,1.4e-05,-0.000869,-0.001495,-0.001369,-0.001068,-0.000593,-0.000574,-0.000367,-0.000536,-0.001194,-0.000646,-0.000188,-0.00116,-0.000999,-0.000991,-0.001136,-0.001048
7.6e-05,0.000251,1.4e-05,0.000538,0.000343,8e-05,-5.1e-05,0.000674,0.000789,0.000576,0.000428,0.000583,0.000278,-1.2e-05,0.000262,0.000561,0.000597,0.000702,0.000832,7.3e-05,0.000943,0.00115,0.000912,0.000329,5.4e-05,0.00062,0.000722,0.000979,0.000857,0.00174,0.001258,0.000615,0.000501,0.000872,0.000984,0.000945,0.000241,0.000683,0.000222,0.000526,0.000706,-6e-06,0.000634,0.000721,0.000768,0.000747,0.000568,0.000752,0.001519,0.000705,0.000645,0.000536,0.001675,0.001198,0.000238,0.000483,0.000837,0.000615,0.001253,0.001146,0.001283,0.001319,4.8e-05,0.000507,0.001207,0.001343,0.000947,-0.000142,-0.000217,0.000409,-0.000637,7e-05,0.000761,0.000269,0.000439,0.001081,0.000745,0.001412,0.000328,0.000388,0.000927,5.6e-05,-0.000313,-3.8e-05,0.000501,0.000775,0.000159,0.000653,-0.000374,0.000329,-0.00018,0.000717,0.000539,0.000246,0.000224,0.000171,-6.5e-05,-5.5e-05,0.000337,0.000406,0.000606,-0.000113,0.000214,0.00025,-5.8e-05,-0.000119,0.000514,0.000242,0.000481,0.000282,0.000218,-5.5e-05,-0.000482,-5.2e-05,-0.000251,-0.000241,0.000102,0.000159,-0.000163,0.00044,0.001403
-0.000326,-0.000354,-0.000123,9.4e-05,-0.000103,-0.001095,-0.000808,-0.000797,-1.8e-05,-4.9e-05,-0.000418,-0.000159,-0.000165,0.000295,-0.000783,-0.001021,-0.000614,-0.000551,-0.000923,-0.000341,-0.000425,-5.8e-05,-0.000245,0.000172,0.000736,0.000169,-0.000975,-0.00089,-0.001241,-0.001011,-0.000955,-0.000511,-6.6e-05,-0.000203,-0.000612,-0.000553,0.000344,0.00029,6.4e-05,-0.000421,-0.000611,0.000112,-0.000952,-0.000673,-0.000104,2e-06,0.000267,0.000226,0.000368,-0.000188,-0.000358,-0.000392,0.000363,-0.000735,-0.000332,-0.000135,0.000631,-9.7e-05,-0.000459,1.9e-05,0.00026,0.000305,-0.000194,-0.000384,-0.000942,-0.000714,-0.000379,-0.000465,0.000309,0.000534,0.000213,-0.000149,-0.000957,-0.000424,5.9e-05,-0.000245,7.4e-05,0.00025,0.000363,-9.3e-05,-0.00014,-0.000916,-0.000289,-0.000772,-2.2e-05,-0.000543,0.00025,-0.000295,-0.000437,-0.000462,0.000366,-0.00047,-0.000167,0.000111,6.4e-05,-0.000235,-0.000678,-0.000264,-0.00018,-6.9e-05,-0.000357,-0.000899,-0.000686,-0.000411,-0.000424,-0.000224,0.000218,-0.000522,-0.000428,-0.000631,-0.000451,-0.000539,-0.000135,-0.000381,-0.000156,0.000269,-0.000463,-0.000188,0.000201,-0.000856,-0.000632
1.3e-05,-0.000376,-0.000144,-0.000277,-8.4e-05,-0.000343,0.000626,0.000641,6.7e-05,4.3e-05,5.4e-05,-0.000349,-0.000582,-0.000157,0.000706,0.000363,-0.000182,3e-05,-0.000609,-0.000279,-0.000483,-0.000443,-0.000486,-1e-04,8e-05,-0.000427,-0.000232,0.000139,0.000277,0.000152,-4.2e-05,-6.5e-05,-0.00012,-0.000344,0.000122,-0.000273,0.00018,-0.000393,-5.4e-05,-1e-06,-0.000462,-0.000225,-0.000169,-8.8e-05,0.000233,-0.000598,-0.000726,2.5e-05,-0.00014,-0.000782,-0.000319,0.000124,0.000472,-0.000417,-2.6e-05,-0.00046,-8.3e-05,-0.000839,-0.000215,7.8e-05,-8.4e-05,-0.000441,-0.000673,0.000118,-5.2e-05,0.000137,-7.6e-05,-0.00063,-0.000256,-0.000531,0.000156,-0.000263,-0.000108,-0.000421,-0.000114,-0.000217,-0.001098,-5.6e-05,-0.000508,-3.8e-05,0.000239,0.000127,-0.000275,-0.000716,0.000251,-6.1e-05,2.2e-05,-0.000433,0.000144,-2e-04,-0.000336,-0.000732,0.00011,-0.00017,-0.000113,-0.000577,-0.000585,-0.00019,0.000136,1e-06,0.000241,-0.000132,-0.00104,-0.000368,-0.000196,3.7e-05,0.000208,0.000464,0.001107,0.000422,-0.000412,0.000303,-0.000156,0.000257,0.000221,-4.7e-05,0.00039,0.000203,0.000138,0.000316,0.000843
-0.000436,-0.000164,0.000225,0.000169,0.000194,-0.000326,-0.000592,-0.000616,-0.000649,-0.000444,-0.000612,-0.000291,-0.000529,-0.000732,-0.00046,-0.000597,-0.000634,-0.000172,-0.00062,-7.4e-05,-0.000204,-0.000441,-0.000714,-0.000362,-0.000229,-0.000397,-0.000691,-0.000467,-0.000924,-0.000768,-0.000819,-2e-04,-0.000964,-0.000873,-0.000867,-0.000605,-0.000654,-0.000368,-0.001076,-0.000677,5.7e-05,-0.000385,-0.000697,-0.00059,-0.000462,-0.000264,-0.000466,-0.000704,-0.000732,-0.000913,-9.3e-05,-0.000173,-0.000343,-0.000621,-0.000627,-7.1e-05,1.8e-05,-0.000625,-0.000764,-0.000589,-0.00032,-2.3e-05,-0.000205,-0.000576,-0.000116,-0.000338,-0.00062,-0.000169,0.000186,0.000227,-0.000582,0.000164,-0.000483,0.00017,0.000451,-6.2e-05,-0.000216,-0.000402,0.000123,-0.000203,-0.000992,-0.000364,0.000274,7.4e-05,-8.7e-05,-0.001107,-0.000844,-0.000206,0.000641,-0.000261,3.6e-05,0.000364,-0.000463,7.3e-05,-0.000287,-0.00046,-0.000479,0.000277,-0.00018,-9.8e-05,-0.000533,0.000159,0.000295,0.000105,-7.2e-05,-0.000367,-0.001108,-0.000796,-0.000799,-0.000465,2e-05,1.2e-05,-0.000267,0.000132,-5.4e-05,0.000386,-7.2e-05,-0.00025,4.8e-05,-0.000284,-7e-04
1e-04,8.9e-05,-0.000284,-0.00018,-8.3e-05,6.5e-05,-0.000432,-1e-05,0.000249,0,-0.000187,-0.000323,-0.000155,-5.8e-05,-0.000108,9.3e-05,2.9e-05,-8.5e-05,-0.000241,-0.000253,-1.4e-05,-0.000657,-0.000271,-0.00027,-0.000502,-0.000576,-0.000626,-8.5e-05,8.5e-05,-0.00066,0.000157,6.1e-05,-0.000329,-0.000766,-0.000368,-0.000102,-0.000659,-0.000583,-0.000637,-6.6e-05,-0.000326,-0.000947,-0.000806,-9.4e-05,-0.000239,-0.00062,-0.000272,4.6e-05,-0.000147,-0.000443,0.000114,0.000294,-0.000672,-0.000492,-0.000348,-0.000356,-0.000299,6.3e-05,-0.000234,-1.2e-05,-0.000309,-0.000536,-0.000508,-5e-04,-0.000682,-3.3e-05,-1.6e-05,-0.000257,-0.000779,-0.00053,7.7e-05,-0.000471,0.000117,-0.000237,-0.000548,-0.00064,-0.000412,4.8e-05,-0.000267,0.000204,0.000357,-0.000309,0.000251,0.000125,-0.000213,0.000303,2e-06,-4.6e-05,-0.000377,-0.00024,-8.3e-05,-0.00012,2.8e-05,-0.000808,-0.000403,-0.000187,0.000134,8.3e-05,3.7e-05,-0.000281,0.000189,-0.000763,0.000313,0.000336,-5.2e-05,-0.000189,0.00034,0.000811,0.000245,0.000427,-1.3e-05,-0.000165,0.000277,-0.000372,0.000231,-1.1e-05,-2.9e-05,0.000514,-1.9e-05,0.000296,0.000728
-0.000243,-0.000341,-0.000178,5e-06,-0.00012,-7e-05,-0.000176,-0.000224,-0.000561,-0.000411,-3e-06,0.000106,-0.000226,-0.000539,-0.000308,-3.5e-05,0.00031,-0.000266,1.2e-05,-0.000174,-1e-04,-0.000295,-0.000298,-0.000257,-0.00037,-0.000241,-0.000317,-0.000879,-0.000393,-0.000924,-0.000648,-0.000677,-5.2e-05,-0.000273,-0.000562,-0.000272,-0.000195,-0.000854,-0.000583,-0.000362,-0.000284,-0.000834,-0.000131,-0.000146,-0.00018,-4.4e-05,-0.000412,-0.000398,-0.000304,-0.000484,-0.000648,0.000109,-1.1e-05,-0.000563,-0.000457,0.000225,-0.000533,-0.000518,-0.000173,-0.000164,-0.000125,-0.000574,-0.000254,9.3e-05,-3.5e-05,-0.000564,-0.000509,-0.000324,-0.000437,-0.000311,-0.000304,-2.2e-05,-0.000753,-0.000221,-0.000156,-3.4e-05,-3.8e-05,-0.000428,-0.000252,-4.7e-05,-0.000295,3.5e-05,-0.000306,-0.000299,-0.000289,-0.000157,-0.000574,0.000266,0.000247,0.000117,3.5e-05,-5e-06,-0.000741,-0.000177,-0.000126,2.4e-05,0.000135,-0.000276,-9.4e-05,0.000456,-0.000157,2.8e-05,0.000269,0,7.2e-05,-9.6e-05,-0.000296,-0.000288,-0.000148,-0.000341,1.2e-05,-0.00035,0.000527,0.000161,-5.2e-05,-0.000647,-1.4e-05,-0.000552,0.000115,-0.000232,-0.000335
0.000116,-0.000277,-0.000127,2.7e-05,-0.000462,-0.00022,-2e-06,0.000327,0.000349,-7.9e-05,-3e-05,-9.9e-05,4.8e-05,3.3e-05,0.000242,0.000317,0.000122,-0.000271,5.3e-05,-0.000111,-0.00016,-0.000111,-0.000102,-7.6e-05,0.000124,-0.000259,-0.000137,-1.9e-05,0.000397,0.000304,1.7e-05,0.000259,0.000149,-0.000112,-1.1e-05,0.000496,9.9e-05,0.000225,0.000148,7.6e-05,1e-05,-2.6e-05,-0.000273,0.000433,-7e-05,-0.000197,-8.3e-05,0.000305,-0.000265,-0.000111,-0.00054,-7.7e-05,-0.000634,-0.000266,0.000321,0.000314,-0.000363,-0.000325,-0.000271,-0.000108,-0.000245,-0.000235,0.000116,0.000252,-1.1e-05,-0.000357,0.000283,8.8e-05,0.000127,5.2e-05,5.2e-05,5.7e-05,0.000293,-8.3e-05,-0.00036,-5e-06,0.000101,-0.000184,-0.000193,0.00027,-5e-05,-1.9e-05,-0.000553,4.4e-05,-7.2e-05,-8.2e-05,-0.000178,-0.000169,-0.000303,3.8e-05,5.1e-05,5.1e-05,0.000408,5.4e-05,-6e-05,4.3e-05,0.000121,-0.000358,7e-06,-6.5e-05,-3.3e-05,-0.000155,-6.1e-05,0.000112,-2.3e-05,0.000391,-0.000233,0.000124,0.000112,-0.000315,0.000252,-6.3e-05,-0.000465,-0.000142,0.00016,0.00023,8.7e-05,0.00018,6.2e-05,1e-04,-0.000254
-6.9e-05,-6.9e-05,4.2e-05,2.6e-05,-6.8e-05,-0.000166,0.000142,-8.7e-05,-0.000195,-9e-06,0.000102,0.000242,8.7e-05,0.000123,-0.000307,-0.000258,-7.3e-05,-0.000126,-0.000222,4.7e-05,-3.3e-05,0.000183,6e-06,0.000245,0.000184,-0.000253,2.9e-05,2e-04,-8e-05,-7e-05,-0.000135,0.000164,9.7e-05,-0.00012,-3.6e-05,-0.000158,0.000115,-0.000247,-8.2e-05,0.00034,5.4e-05,0.000189,-0.000343,0.000161,0.000107,-6.4e-05,0.000167,0.000104,9.5e-05,-3.5e-05,-0.000258,0.000176,9.2e-05,-0.000217,-7.7e-05,-0.00013,-0.000164,-1.2e-05,0.000307,0.000265,0.000194,-0.000177,-0.000252,4.4e-05,0.000259,-0.000246,-0.000327,7.3e-05,0.000109,-2.7e-05,-8e-06,0.000268,-3.7e-05,-0.00016,-0.000202,0.000139,-2.7e-05,0.000129,-3.1e-05,-0.000105,4e-06,-1.3e-05,0.000165,-0.000138,-4.3e-05,-0.000122,0.000105,0.000213,4e-05,0.000119,-0.00021,8.9e-05,-3.3e-05,-4e-05,-7.6e-05,-4.1e-05,0.000154,3e-06,8.3e-05,-3.1e-05,1.5e-05,8.3e-05,-0.000234,-9.9e-05,0.000113,-0.000182,5e-05,-0.000115,5.3e-05,1.1e-05,-0.000185,0.000136,3.3e-05,3.3e-05,-0.000425,-5e-05,-0.00036,-8e-05,-2e-05,-2e-06,-7.6e-05
5.8e-05,0.000197,0.00037,0.000126,-2.7e-05,0.00011,0.000223,0.000216,0.000181,8.7e-05,-0.000111,6.5e-05,6.3e-05,0.000135,-2e-06,0.000121,0,-5.5e-05,4.7e-05,0.000124,-0.000162,5.9e-05,7.3e-05,0.000173,7.8e-05,0.000133,-8.4e-05,0.000304,6.6e-05,0.000239,0.000349,0.000321,-0.00015,0.000193,0.000146,0.000295,0.000197,-0.000193,-0.000139,0.000111,0.000201,6.3e-05,-2.5e-05,0.000235,6.2e-05,-0.000105,8.4e-05,0.00014,0.000204,5.2e-05,-0.000152,0.000271,8.1e-05,-7.3e-05,0.00012,0.000293,0.000171,-9.6e-05,5.7e-05,9.2e-05,-6.5e-05,2.8e-05,0.000156,0.000205,-0.000162,1.8e-05,0.000177,0.000327,0.000196,3.9e-05,-0.000164,1e-06,0.000113,0.000117,-2.7e-05,-0.000159,0.00021,-0.000315,-4.6e-05,-5.1e-05,6e-05,1e-04,0.000227,-0.000112,0.000105,2.8e-05,0.000283,0.000164,9.3e-05,-0.000467,-6.6e-05,0.000386,0.000194,2.8e-05,-0.000103,0.000307,4.6e-05,-0.000157,-0.000313,7.6e-05,0.000175,4.5e-05,0.000186,7.2e-05,-0.000301,9e-06,0.000137,0.000125,-8e-05,5.8e-05,-2.1e-05,4.5e-05,9.8e-05,0.000149,0.000376,-1.5e-05,-3.4e-05,-0.000148,-4e-06,-2.6e-05,-5.8e-05
-1e-06,1e-06,0.000125,8.6e-05,0.000218,-0.000153,-0.000101,0.000136,-0.000115,8e-06,0.00024,0.000162,4.4e-05,2.7e-05,0.000262,1e-04,0.000128,0.000152,7e-05,0.000128,0.000473,2.6e-05,0.00019,0.000222,3.6e-05,0.000126,-7.1e-05,0.000306,9.8e-05,-8e-05,-7e-06,0.000288,8.6e-05,6.5e-05,0.000279,0.000206,0.000125,0.000272,0.000139,0.000174,8.5e-05,-7.5e-05,0.000176,0.000141,0.000297,0.000122,-4.8e-05,0.000217,5.7e-05,-0.000149,7e-06,0.000181,0.000346,0.000131,-9.2e-05,0.000184,-2.6e-05,0.00013,-5.3e-05,0.00014,0.000177,0.000209,1.8e-05,4.6e-05,0.000128,0.000252,7.9e-05,4e-05,5.4e-05,8.6e-05,0.000128,0.000161,0.000156,-4.6e-05,0.000141,-3.8e-05,-8.2e-05,8.6e-05,-4e-06,-0.000115,4.4e-05,-1.5e-05,0.000274,0.000353,-5.5e-05,0.000159,-6.4e-05,3.4e-05,5.7e-05,0.000163,-4.3e-05,-0.000113,3.2e-05,6.7e-05,4.7e-05,7.7e-05,-4.3e-05,0.00016,4.9e-05,1.4e-05,-0.000103,9.6e-05,-0.000124,-3.2e-05,-2.2e-05,8e-06,0.000171,-0.000221,-2.4e-05,-0.000224,5.5e-05,0.00025,5.4e-05,0.000111,-4.8e-05,0.000112,0.000206,8.8e-05,-0.000128,2.4e-05,4.7e-05
-0.000114,4.3e-05,-2.8e-05,-7.1e-05,7e-06,0.000162,-2e-05,1.2e-05,0.000247,1.3e-05,-5.6e-05,-8.8e-05,-2.1e-05,4.9e-05,1e-05,9.3e-05,-7.8e-05,0.000213,0.000118,0.000146,5.7e-05,-6.2e-05,-8e-06,0.000106,1.5e-05,9e-05,0.000209,8.2e-05,0.000291,1.7e-05,-2.4e-05,9.4e-05,9.3e-05,-3.3e-05,7.6e-05,8.5e-05,-0.000123,0.000152,-1.7e-05,0.000126,5e-05,-1e-04,0.000197,0.00017,4.6e-05,6.9e-05,4e-05,-5e-06,0.000103,0.000137,0.000243,0.000118,-0.00017,-4.4e-05,-4.5e-05,-8e-06,0.000128,3.7e-05,1e-04,0.000138,-9.6e-05,-3e-06,0.000157,0.000143,-1.2e-05,0.000135,0.000128,2e-06,3.5e-05,8.8e-05,5e-05,-8.5e-05,-0.000322,2.5e-05,0.000145,0.000175,0.000113,0.000157,0.000136,2e-05,-6.1e-05,2.6e-05,-0.000105,1.1e-05,0.000185,9.7e-05,0.000106,4.6e-05,8.3e-05,8.7e-05,3.7e-05,-1.2e-05,-0.000247,-6.6e-05,4.6e-05,0.000108,5.6e-05,0.000146,5.2e-05,-8.4e-05,-3.8e-05,-3.6e-05,-0.000186,-4.3e-05,-1.8e-05,-5.9e-05,-1.2e-05,-9.5e-05,-2.9e-05,-5.3e-05,-5.7e-05,5.7e-05,-7.6e-05,-0.000111,-9.2e-05,-7.5e-05,-3.9e-05,-8.8e-05,9.9e-05,-8.8e-05,9.5e-05
3.6e-05,-2.4e-05,5e-06,-5.7e-05,-8.5e-05,6.1e-05,-2e-06,1e-05,-0.000124,1.3e-05,0.000178,-3.9e-05,5.2e-05,-5.1e-05,-3e-06,-7.4e-05,-3.5e-05,-3.6e-05,-3.5e-05,2e-06,4.3e-05,-6.6e-05,5e-06,1.2e-05,-1.9e-05,-0.00011,-2.8e-05,8.8e-05,3.5e-05,-0.00014,-8e-05,-2e-06,-1.2e-05,-8.8e-05,4e-05,-3e-05,3e-06,3.8e-05,3e-05,0,-6.9e-05,-0.000128,3.2e-05,4.3e-05,-1e-04,3e-06,-4e-06,2.7e-05,-0.000204,-3.6e-05,0.000103,5.3e-05,-0.000203,1.6e-05,9.1e-05,-0.000136,-3e-06,-1e-05,4.4e-05,1e-05,0.000168,-3e-06,9.3e-05,-9.8e-05,-0.00011,4e-05,9.6e-05,1e-06,-9.1e-05,1e-06,4.5e-05,-1e-06,0.000303,-3.5e-05,0.000105,0.000117,-9.5e-05,6.2e-05,-9.6e-05,-0.000136,-4.1e-05,2.6e-05,0.000271,-0.000164,-0.00017,-3e-06,-8.6e-05,-1.2e-05,-9.4e-05,3.6e-05,-5.4e-05,-1.5e-05,6.5e-05,7.6e-05,0.000131,-8.3e-05,-1.2e-05,6.4e-05,2.4e-05,-5.7e-05,2.9e-05,8.6e-05,-0.000114,4.1e-05,6.5e-05,5.5e-05,-0.000127,-1.9e-05,-3.4e-05,0.000173,0.00013,-1.5e-05,-0.000121,-4.4e-05,2.4e-05,-0.00012,-1.3e-05,8.7e-05,0.000114,0.000109,-0.000153
-5.2e-05,-1e-05,0.000105,-8.7e-05,5.7e-05,-7.4e-05,2e-06,-0.000109,-7.2e-05,-4.2e-05,-2.6e-05,6.7e-05,-7.7e-05,1.5e-05,1.2e-05,4.7e-05,2.8e-05,-3.1e-05,7.1e-05,8e-06,-9.8e-05,8.1e-05,-4e-05,-2.2e-05,-1.6e-05,-2.1e-05,-6e-05,-3.1e-05,-0.00015,-3.7e-05,3.5e-05,4.5e-05,-2.5e-05,-1.4e-05,2.6e-05,-3e-06,-6.3e-05,-6.8e-05,1e-06,8.3e-05,9.9e-05,4e-05,-0.000113,5.7e-05,-0.000234,-3.5e-05,0.000113,-6e-06,5.4e-05,-9.4e-05,8.5e-05,-6.9e-05,-0.000118,-0.000103,-4.1e-05,-0.000174,-9.7e-05,4.3e-05,4e-05,-5.6e-05,-0.000194,-5.9e-05,-5.7e-05,0.000113,9.3e-05,-6e-05,-6.3e-05,-4.5e-05,2.9e-05,-1.1e-05,-7.3e-05,-2.2e-05,-4.6e-05,2e-05,3.3e-05,-3.6e-05,5.9e-05,0.000154,1.7e-05,-1.9e-05,-1.8e-05,-2.2e-05,2.7e-05,4.8e-05,6.2e-05,-8.2e-05,-1.4e-05,-5.4e-05,-4.3e-05,-6.3e-05,6.7e-05,-2e-05,-5.7e-05,-3.5e-05,-8e-05,0.000155,2.4e-05,4.9e-05,-1.8e-05,-9.9e-05,6e-06,-8e-06,-3.7e-05,-6e-06,2.8e-05,-4.2e-05,9.7e-05,1e-05,6.8e-05,-3.5e-05,-6.5e-05,-1.1e-05,-0.00011,1.5e-05,-7.1e-05,-5e-06,8e-06,-5.1e-05,-0.000147,-9.9e-05,2.7e-05
-3.4e-05,-5.1e-05,2e-06,-5.4e-05,-7.8e-05,-3e-06,5.9e-05,-5.8e-05,-4.9e-05,1.5e-05,-4.2e-05,-1.4e-05,-1e-05,2.3e-05,-0.000121,2.1e-05,-3.9e-05,-5.7e-05,-5.4e-05,3.2e-05,-8e-06,3.9e-05,3e-06,3e-05,4e-06,-1.3e-05,3.6e-05,-1e-05,-4.9e-05,4.1e-05,-1e-06,-4.7e-05,-0.000154,-8e-06,2.2e-05,-3.7e-05,1.6e-05,1.2e-05,4.7e-05,2.6e-05,-0.000141,-2.9e-05,-5.3e-05,-1e-05,-7.1e-05,-5.1e-05,-2.1e-05,1.6e-05,-1.9e-05,-1.2e-05,-6.1e-05,-5.5e-05,1e-06,-5.8e-05,3.9e-05,-1.2e-05,-0.000146,-6.2e-05,7e-05,-4e-05,0.00011,-2.3e-05,-3e-06,-4.7e-05,-6.6e-05,-1.3e-05,6.3e-05,-8e-06,-1.3e-05,-1.6e-05,4e-05,1.8e-05,-0.000125,8e-06,-1.8e-05,3.7e-05,-1.3e-05,-7.6e-05,-4e-05,-4.3e-05,-7.8e-05,4.1e-05,-0.000158,-2.5e-05,-2.6e-05,1.1e-05,0,-5.2e-05,-0.000129,-7.1e-05,-5.9e-05,-0.000104,7e-05,-8.6e-05,-5e-06,1.1e-05,-7e-05,-6.9e-05,2e-06,8e-06,-4.9e-05,3.3e-05,2.8e-05,1.3e-05,2.4e-05,4.5e-05,-4.7e-05,1.3e-05,-5.5e-05,-7.3e-05,-8e-05,-2.3e-05,0.000142,1.3e-05,4.9e-05,4.3e-05,-1.6e-05,-2.7e-05,-1.4e-05,5.4e-05,-2e-06
-3.6e-05,-2e-06,-1e-06,-5e-06,-1.6e-05,1.2e-05,3.9e-05,7e-06,9.7e-05,-2e-05,5.1e-05,-2.9e-05,-1.7e-05,4e-06,-1e-06,-5.3e-05,1.9e-05,-6e-06,4.4e-05,2e-06,-3e-05,2.9e-05,6.8e-05,-3e-05,-2.8e-05,1.4e-05,-5.2e-05,8.9e-05,-2.6e-05,2.1e-05,-3.9e-05,1.7e-05,4e-06,6.6e-05,7e-06,8e-06,1.6e-05,-0.000107,-5.8e-05,5.2e-05,-7.2e-05,5.1e-05,3.7e-05,-3e-06,4.7e-05,2e-06,2.6e-05,-4.6e-05,-4.5e-05,-2.7e-05,-8.5e-05,-6.3e-05,4.1e-05,-4.1e-05,-2.5e-05,3.4e-05,2.2e-05,2.1e-05,1.2e-05,2.8e-05,-8.5e-05,-2.2e-05,7e-06,-1e-05,-1.5e-05,-6.4e-05,4e-05,2.3e-05,6.3e-05,2e-06,1.1e-05,-1e-05,3.2e-05,-3e-05,-8e-05,-4.9e-05,2.3e-05,1e-06,2.2e-05,-4.4e-05,6.6e-05,1.7e-05,-2.9e-05,-1.1e-05,-8e-06,2e-05,7.2e-05,5.8e-05,-0.000113,-2.6e-05,-9e-06,1.1e-05,-4.6e-05,1.2e-05,2.6e-05,-1.9e-05,5.5e-05,-5.2e-05,-4.3e-05,6.7e-05,-5e-06,2.9e-05,-7.3e-05,-2.6e-05,-2e-05,-2.3e-05,-3.5e-05,-2.7e-05,1e-05,1.7e-05,4.8e-05,1.5e-05,-2.9e-05,-2e-06,-3e-05,5.5e-05,-2e-06,3.6e-05,-2.7e-05,-3.6e-05,-2.5e-05
-4e-06,1.5e-05,4.4e-05,-1.2e-05,-4.1e-05,2e-06,-1.8e-05,-1.5e-05,-2.6e-05,-1.3e-05,2e-05,-1.1e-05,2.5e-05,4.5e-05,4.2e-05,-1.3e-05,-2.2e-05,-4.4e-05,-4.3e-05,1.6e-05,-4.4e-05,-8.5e-05,-1e-05,2.2e-05,-2.2e-05,-2.6e-05,1.8e-05,4.7e-05,-8e-06,-1.3e-05,3.5e-05,-9.1e-05,6e-06,-3.8e-05,4.4e-05,-3.3e-05,-1.8e-05,1.6e-05,-2.9e-05,7e-06,3.8e-05,-0.000102,1.2e-05,-3.7e-05,4e-06,-2.9e-05,2.5e-05,-8e-06,1.1e-05,1e-05,-6.3e-05,-4.1e-05,3.7e-05,2.9e-05,-2.2e-05,-6e-06,-2.1e-05,-1.3e-05,1.4e-05,-1e-06,1.2e-05,5.5e-05,2.2e-05,-5e-06,1.9e-05,-1.3e-05,6e-06,3.9e-05,-3.2e-05,3e-06,-1.7e-05,1.6e-05,3.1e-05,0,1.1e-05,1.7e-05,1.6e-05,-4.9e-05,1e-06,9.3e-05,-4.3e-05,-4e-06,-1.8e-05,-6.7e-05,1.8e-05,2e-06,3.8e-05,-6.2e-05,-1.2e-05,1.3e-05,7e-06,8e-06,-2.1e-05,1.1e-05,-1.8e-05,-4.6e-05,-5e-06,-4.4e-05,0,-6.7e-05,3.8e-05,2.7e-05,1e-06,1.5e-05,5e-06,7e-06,1.5e-05,3.8e-05,-2.8e-05,-1.1e-05,5e-06,2.8e-05,-2e-06,1.1e-05,5e-05,-7.1e-05,6e-06,-4.6e-05,-3e-05,-6e-06,-1e-05
-2.8e-05,2e-05,1.4e-05,6e-06,5e-06,-1.8e-05,-1.8e-05,2e-06,-8.5e-05,5e-06,-2e-06,0,-9e-06,-3.1e-05,1.4e-05,-2e-06,-1.8e-05,3.7e-05,4.6e-05,2.4e-05,2.5e-05,-2.4e-05,1e-05,-2e-06,-2.2e-05,-1.1e-05,-5e-06,5.3e-05,1.4e-05,-5.9e-05,2.2e-05,3.1e-05,1.4e-05,-3.5e-05,5.3e-05,-9e-06,-3.4e-05,6.6e-05,2e-05,-1e-06,-3.4e-05,-1.5e-05,7e-06,-3.7e-05,1.5e-05,7e-06,-7e-06,5e-06,-7e-06,-2.7e-05,-1.7e-05,-1e-05,-5.2e-05,-2.8e-05,0,-5.2e-05,1.7e-05,1.4e-05,2.2e-05,1.7e-05,-3e-06,3e-06,2.4e-05,-5e-06,-2.3e-05,4.3e-05,-6e-06,-3.6e-05,2e-05,2.1e-05,3.6e-05,-1.1e-05,-8e-06,1e-05,3e-06,2.8e-05,-1.9e-05,5e-06,-2e-06,-4.7e-05,3.4e-05,2.9e-05,7e-05,3.8e-05,1.6e-05,2e-06,-2.6e-05,-6e-06,-2.5e-05,4.5e-05,6e-06,-1.8e-05,-5e-06,3.9e-05,1e-05,3.6e-05,-8e-06,2e-06,2.2e-05,-1.1e-05,-2.6e-05,9e-06,5.4e-05,-3e-06,5e-06,-8e-06,3e-06,1.2e-05,-5e-06,-3.2e-05,-3e-05,3.8e-05,4.4e-05,2e-06,-2.5e-05,6.4e-05,-2e-05,1.4e-05,4.6e-05,1.9e-05,-4.1e-05
-1.6e-05,-1.9e-05,-1.8e-05,-1.8e-05,5.9e-05,1.5e-05,-8e-06,-3.4e-05,2.2e-05,1e-05,2.9e-05,-1e-06,-1.6e-05,7e-06,1e-06,-1.3e-05,2.4e-05,7e-06,-1.8e-05,4e-06,-6e-06,3e-06,1.1e-05,-1.7e-05,3e-06,1.9e-05,0,1.3e-05,-2.9e-05,-4.7e-05,-1.5e-05,-4.1e-05,-2.8e-05,-1e-06,9e-06,-1.7e-05,-1.5e-05,-1.9e-05,-5e-06,-1.3e-05,-5e-06,-6e-05,-7e-06,-1.7e-05,-3.5e-05,-7e-06,7e-06,-2.4e-05,1.1e-05,-7e-06,2.4e-05,-2.5e-05,-1e-05,-7e-06,6e-06,1e-06,1e-05,7e-06,2.2e-05,-3.1e-05,-9e-06,1.3e-05,1.6e-05,-1e-05,1.3e-05,3.4e-05,7e-06,1.6e-05,-4e-05,6e-06,-3.3e-05,-1.4e-05,-3.2e-05,4e-06,3.2e-05,2.2e-05,5e-06,4.3e-05,5e-06,2.7e-05,-5e-06,9e-06,-6.2e-05,-2.1e-05,-5e-06,-2.5e-05,-2.8e-05,-2.2e-05,3e-05,-4e-05,-2e-05,-2.4e-05,-4.4e-05,-2.1e-05,-8e-06,-4e-06,8e-06,2.6e-05,2e-06,-7e-06,5e-06,3.2e-05,1.5e-05,3e-06,-3e-06,7e-06,4.6e-05,2.7e-05,2.1e-05,-3.7e-05,-2.1e-05,1.1e-05,2.2e-05,4e-06,3.6e-05,-3.4e-05,-2e-06,-2e-05,-2e-05,-1.5e-05,5.3e-05
-1e-05,1.6e-05,-2.2e-05,-5e-06,-7e-06,-7e-06,4e-06,-3.2e-05,3e-06,-7e-06,-3e-05,-1.7e-05,3e-06,-7e-06,2.9e-05,-2e-06,-2e-06,1.5e-05,-1e-06,1e-06,1.1e-05,3.2e-05,-9e-06,-1e-05,1e-06,3e-06,1e-05,-3.3e-05,-2.5e-05,-1.3e-05,-2.3e-05,-1.9e-05,-3e-05,-3e-06,1.6e-05,-1e-06,1e-06,-7e-06,1.7e-05,-5e-06,2e-06,-8e-06,7e-06,-5.5e-05,-3.3e-05,8e-06,3e-05,2e-06,-2.2e-05,-1.5e-05,4.9e-05,-1.1e-05,-4.5e-05,-1e-05,2.2e-05,2e-06,1.3e-05,4e-06,2.3e-05,-2.2e-05,-5e-06,-1e-05,1.3e-05,-2e-06,-1.2e-05,2e-05,2.6e-05,-2.2e-05,1e-06,-9e-06,1.7e-05,-1.2e-05,4.1e-05,-2.4e-05,4.5e-05,-3e-05,-2e-06,-6e-06,-1.5e-05,3.7e-05,-2.5e-05,6e-06,5.7e-05,-2.1e-05,-4e-06,3.4e-05,-8e-06,1.2e-05,2.6e-05,-4.4e-05,8e-06,0,3.6e-05,1.1e-05,-1.6e-05,-5e-06,-1.4e-05,2.7e-05,-1.7e-05,1.4e-05,3e-06,-1e-06,3e-06,-7e-06,-1.5e-05,3e-06,-2.8e-05,-1.9e-05,-3e-06,2.2e-05,3.6e-05,-1.6e-05,2.7e-05,-1.5e-05,-1.7e-05,-1.8e-05,1.9e-05,1.3e-05,1.9e-05,1.9e-05,1.1e-05
-1.3e-05,-1.4e-05,-1.2e-05,7e-06,-2e-06,4e-06,2.1e-05,-1.1e-05,1.8e-05,-1e-05,1.5e-05,-1.5e-05,-1.3e-05,0,-2.1e-05,-1e-06,-1.1e-05,-7e-06,2.4e-05,-6e-06,7e-06,5e-06,1.9e-05,-2.7e-05,7e-06,-1.8e-05,-2.5e-05,-2.4e-05,1e-05,1.8e-05,6e-06,-4e-05,-3e-06,-1e-06,-1e-05,-3.4e-05,-4e-06,2.1e-05,-5e-06,-1.1e-05,-5e-06,8e-06,2e-05,-1.9e-05,-2.4e-05,-1.8e-05,7e-06,-1.4e-05,-2.5e-05,-2.3e-05,3.7e-05,-3e-06,-1.8e-05,-2.1e-05,-1.6e-05,1.5e-05,-2.7e-05,-2e-06,1.6e-05,-5e-06,1.2e-05,-2.4e-05,-6e-06,-1e-06,6e-06,-8e-06,1e-06,7e-06,2e-06,-3e-06,6e-06,4e-06,-1.9e-05,2.2e-05,2e-05,1e-06,2.7e-05,1e-06,1.1e-05,-2.6e-05,1.5e-05,1.8e-05,9e-06,1.7e-05,-1e-05,-5e-06,9e-06,-2.3e-05,4e-06,4.4e-05,-7e-06,1.1e-05,-9e-06,-6.1e-05,1.8e-05,-2.8e-05,1.7e-05,2.8e-05,2e-06,2.2e-05,-4e-06,1e-05,-1.6e-05,4e-06,3e-06,-7e-06,-5e-05,1.4e-05,-7e-06,7e-06,-3.4e-05,-1.5e-05,-2.6e-05,-8e-06,-1.2e-05,2e-06,-2e-06,-1e-06,-1.6e-05,-2.5e-05,-2.1e-05
1e-06,2e-06,-5e-06,-3e-06,-1.1e-05,2e-06,9e-06,-7e-06,-3.1e-05,1e-06,7e-06,1.6e-05,6e-06,2.2e-05,-3.1e-05,-1.6e-05,-8e-06,-4e-06,-1e-05,-4e-06,-2.8e-05,-3e-06,-9e-06,-9e-06,-1e-05,-1.5e-05,8e-06,-1.3e-05,-8e-06,1.3e-05,9e-06,1e-05,1.2e-05,4e-06,5e-06,-1e-06,1.9e-05,-2e-05,-1.8e-05,-1.8e-05,-2.5e-05,-1e-05,-8e-06,-4e-05,-8e-06,4e-06,1e-05,-6e-06,2.1e-05,-1e-06,1.5e-05,-1.6e-05,3e-06,-1.3e-05,-7e-06,-5e-06,-3.7e-05,3e-06,5e-06,-1.6e-05,-2.6e-05,-1.5e-05,2.4e-05,-1e-05,-1e-06,-1.7e-05,-3e-06,-1e-06,1.8e-05,-3e-06,-5e-06,-2e-06,-7e-06,-1.2e-05,-1.8e-05,1e-06,-2.9e-05,1.1e-05,-2e-05,1.3e-05,-1.1e-05,3e-06,-1.9e-05,-3e-05,2e-06,-9e-06,6e-06,1e-06,-2e-06,7e-06,-2e-06,-7e-06,2.3e-05,2e-06,1.8e-05,1e-05,-1e-05,6e-06,3e-06,-2e-05,4e-06,2.1e-05,3.2e-05,1e-06,-6e-06,6e-06,1.1e-05,-1.8e-05,7e-06,-3.2e-05,1.7e-05,-2.1e-05,5e-06,1.5e-05,2e-05,1.7e-05,-3e-06,-1.5e-05,3.1e-05,1.9e-05,0
-2.2e-05,-5e-06,-3e-06,6e-06,-1.8e-05,-9e-06,-3e-06,1.1e-05,8e-06,-1e-06,-1e-06,-6e-06,-3e-06,-4e-06,1.8e-05,2e-06,6e-06,-1.3e-05,-6e-06,-2e-06,-1e-05,-2.9e-05,8e-06,3e-06,-4e-06,2e-06,5e-06,6e-06,-9e-06,-1.3e-05,2e-06,-3.3e-05,4e-06,-7e-06,7e-06,1e-06,-7e-06,-2e-05,-3e-06,-5e-06,1.9e-05,-2.4e-05,-1.4e-05,-1.8e-05,5e-06,-1.5e-05,-4e-06,-3e-06,1.3e-05,-7e-06,-2.2e-05,4e-06,2.9e-05,-1.4e-05,-3e-06,-1e-06,-8e-06,-3e-06,3e-06,1.7e-05,2.6e-05,1e-05,-8e-06,-5e-06,-1.1e-05,-2e-05,0,2e-06,9e-06,1e-06,6e-06,7e-06,2e-06,7e-06,-7e-06,1.9e-05,1.6e-05,0,7e-06,1e-05,1e-06,1e-05,-7e-05,-1.1e-05,-2e-06,-4e-06,1.7e-05,-2e-06,4e-06,-1.4e-05,4e-06,-2e-06,-2.7e-05,1.5e-05,-9e-06,-4e-06,7e-06,-2.2e-05,6e-06,-2e-06,-1e-05,0,-1.3e-05,-2e-06,8e-06,-5e-06,1.1e-05,-1e-05,-1.7e-05,0,4e-06,-4e-06,4e-06,6e-06,-2.1e-05,1e-06,0,1e-05,-5e-06,-1.1e-05,1e-06
6e-06,3e-06,-9e-06,5e-06,-4e-06,2e-06,-4e-06,4e-06,-8e-06,-4e-06,-1.3e-05,-7e-06,-1e-06,3e-06,-1.9e-05,-2e-06,9e-06,-5e-06,1.2e-05,-4e-06,2e-06,-7e-06,1.8e-05,-2e-06,-5e-06,6e-06,-1.6e-05,1.9e-05,-3e-06,-2.2e-05,-1.3e-05,1.5e-05,-1e-05,-9e-06,1.1e-05,-1.3e-05,-1.1e-05,2.2e-05,-1e-06,-2.3e-05,-6e-06,-2.9e-05,1e-06,-1.5e-05,2.7e-05,3e-06,4e-06,5e-06,-2.1e-05,-9e-06,-3.2e-05,4e-06,3.5e-05,-8e-06,-4e-06,1.5e-05,5e-06,1e-06,1.5e-05,-3e-06,-2.3e-05,1e-05,1.6e-05,2e-06,1.4e-05,-2e-06,-1.7e-05,5e-06,-1e-05,3e-06,-5e-06,-6e-06,-3e-06,-3e-06,-2.1e-05,-8e-06,-1.2e-05,3e-06,-1.4e-05,-4.3e-05,7e-06,9e-06,-2e-05,2.2e-05,5e-06,-3e-06,2e-06,1e-05,-1.8e-05,5e-06,-2e-06,1.6e-05,0,1.8e-05,-1.4e-05,-1.1e-05,2e-06,-2.2e-05,-2e-06,1e-05,8e-06,1.1e-05,-1.8e-05,-1e-06,-1e-06,-1e-06,1.1e-05,-1e-05,1.2e-05,8e-06,-2.2e-05,1.1e-05,1.4e-05,3e-06,1.9e-05,8e-06,-1e-06,-1.3e-05,5e-06,3e-06,8e-06
-1.2e-05,1e-05,-9e-06,-3e-06,-1.5e-05,2e-06,-6e-06,6e-06,9e-06,1e-06,1.1e-05,2e-06,0,-4e-06,1.2e-05,-1e-06,-5e-06,7e-06,-8e-06,-1e-06,1.3e-05,4e-06,-7e-06,1e-06,6e-06,5e-06,5e-06,-3e-06,-2e-06,-2.3e-05,3e-06,-1.1e-05,-1.4e-05,5e-06,7e-06,1e-05,-2e-06,-1e-06,1e-05,-1.3e-05,-2e-06,-3e-05,6e-06,-1e-05,2.3e-05,-5e-06,1.6e-05,-4e-06,1e-05,-2.1e-05,-2.2e-05,4e-06,-1.7e-05,-8e-06,1e-05,1.2e-05,1.8e-05,3e-06,6e-06,-2e-06,1.1e-05,6e-06,2e-06,4e-06,-1.3e-05,5e-06,3e-05,-1.1e-05,-1.3e-05,3e-06,2e-06,-2e-06,1.9e-05,-2e-06,-1.4e-05,-6e-06,2.2e-05,-1.1e-05,1.1e-05,4e-06,-1e-05,3e-06,1e-05,-1.8e-05,5e-06,1.7e-05,-4e-06,4e-06,2.1e-05,-2.1e-05,-6e-06,7e-06,1e-06,-5e-06,-6e-06,-7e-06,-9e-06,-1.4e-05,-5e-06,-6e-06,0,1.5e-05,-2.1e-05,-1e-06,5e-06,4e-06,-5e-06,-1.2e-05,-2e-06,-1.2e-05,1.1e-05,6e-06,-2.7e-05,2e-06,-1.6e-05,-2e-06,-1e-06,-3e-06,-2.7e-05,5e-06,-5e-06
-6e-06,-7e-06,-9e-06,5e-06,1.4e-05,-3e-06,2e-06,2e-06,8e-06,1e-06,-1.5e-05,7e-06,-5e-06,-8e-06,2.3e-05,1e-06,-3e-06,-1e-06,1e-06,0,-1e-05,1.8e-05,2e-06,-6e-06,1e-06,-1.4e-05,-5e-06,-1.6e-05,8e-06,-8e-06,1.2e-05,1.2e-05,9e-06,-1.4e-05,-6e-06,-6e-06,2e-06,-1.7e-05,-9e-06,-1e-05,1.1e-05,-1e-06,1.2e-05,-2e-06,-9e-06,5e-06,-1e-06,0,-1.3e-05,8e-06,-6e-06,1.1e-05,-3.9e-05,-6e-06,1e-06,-3e-06,3e-06,-1e-06,-2e-06,2e-06,-5e-06,1e-06,5e-06,-6e-06,2e-06,1.2e-05,-1e-05,7e-06,-6e-06,0,-1e-06,-2e-06,-1.8e-05,0,1.3e-05,-2e-06,-1.9e-05,-8e-06,-8e-06,0,3e-06,7e-06,-1e-05,-1.3e-05,-1e-06,-8e-06,-1.8e-05,-1e-06,4e-06,-3e-06,1e-06,-1.1e-05,-7e-06,-6e-06,1.3e-05,-6e-06,7e-06,-2e-06,-7e-06,4e-06,-4e-06,0,1e-06,3e-06,-7e-06,-1e-06,-1.5e-05,1e-06,3e-06,-1.9e-05,5e-06,4e-06,2e-06,-4e-06,1e-05,-1.5e-05,1e-06,-2e-06,6e-06,-6e-06,-1.4e-05
-1e-06,3e-06,-1e-05,-7e-06,1.7e-05,0,1e-05,-2e-06,-7e-06,-2e-06,8e-06,-3e-06,7e-06,7e-06,-3e-06,-3e-06,-1e-06,6e-06,9e-06,-5e-06,2e-06,5e-06,-2e-06,-7e-06,6e-06,1e-06,-1e-06,-2.2e-05,3e-06,1.2e-05,-9e-06,-8e-06,6e-06,0,3e-06,4e-06,-1e-06,2.2e-05,-3e-06,-1.6e-05,-8e-06,-5e-06,1e-06,0,-3.1e-05,-7e-06,6e-06,3e-06,2.1e-05,-1.1e-05,1.3e-05,6e-06,-1e-05,-1.1e-05,-3e-06,-1.1e-05,8e-06,4e-06,7e-06,-6e-06,2e-06,-7e-06,9e-06,3e-06,7e-06,1.3e-05,-1e-05,-1.1e-05,3e-06,-3e-06,5e-06,3e-06,-1e-06,-2e-06,1.7e-05,1e-06,6e-06,1e-06,3e-06,-3.5e-05,4e-06,5e-06,4e-06,1.2e-05,-3e-06,-3e-06,5e-06,7e-06,1.2e-05,2.8e-05,4e-06,2e-06,1.8e-05,-2.2e-05,6e-06,8e-06,-6e-06,1.5e-05,3e-06,-5e-06,0,7e-06,-6e-06,-1e-06,2e-06,0,1e-05,-5e-06,-1e-06,-1e-06,-1e-05,-7e-06,-4e-06,-4e-06,-7e-06,-9e-06,-3e-06,-2e-06,-1e-06,6e-06,1.3e-05
-1e-05,1e-06,-1e-05,0,0,5e-06,2e-06,6e-06,-1.4e-05,-3e-06,3e-06,-4e-06,-4e-06,2e-06,-8e-06,4e-06,7e-06,-1e-06,-1e-05,-2e-06,1e-05,-8e-06,5e-06,0,-6e-06,5e-06,2e-06,-2.1e-05,-3e-06,8e-06,-7e-06,7e-06,1e-06,7e-06,-9e-06,-2e-06,1.1e-05,2e-06,-1.1e-05,-2e-06,-2e-06,-3e-06,-7e-06,4e-06,-7e-06,2e-06,7e-06,-3e-06,-1.9e-05,-6e-06,2.3e-05,5e-06,7e-06,-9e-06,-8e-06,8e-06,-1.3e-05,-1e-06,-2e-06,0,0,-1e-05,-4e-06,0,-1e-05,0,2e-06,7e-06,1e-05,-1e-06,-6e-06,0,1.4e-05,4e-06,7e-06,4e-06,-2e-06,6e-06,-6e-06,2.5e-05,-7e-06,1e-06,2.3e-05,-3e-06,-3e-06,-3e-06,3e-06,2e-06,6e-06,-2e-06,-5e-06,1e-05,-7e-06,-1.1e-05,-3e-06,-7e-06,2e-06,1.3e-05,5e-06,-1.1e-05,5e-06,8e-06,-1.7e-05,1e-06,0,-1e-06,-5e-06,7e-06,-6e-06,5e-06,1.1e-05,-1.1e-05,1.2e-05,2e-06,2e-06,1.5e-05,2e-06,1e-06,1.6e-05,-1.1e-05,7e-06
-2e-06,-2e-06,1e-06,-1e-06,1e-06,-6e-06,-1e-06,1e-06,8e-06,-2e-06,-1.6e-05,-2e-06,0,1e-06,-5e-06,4e-06,1e-06,4e-06,9e-06,-2e-06,-7e-06,-1.4e-05,9e-06,0,-1e-06,-3e-06,-8e-06,-3e-06,-1e-06,-6e-06,8e-06,0,-6e-06,-3e-06,2e-06,4e-06,-4e-06,-2.1e-05,4e-06,-8e-06,7e-06,-1.3e-05,3e-06,1.3e-05,3e-06,-4e-06,-2e-06,5e-06,1e-06,-8e-06,1.5e-05,4e-06,1.3e-05,-8e-06,0,0,-1.7e-05,0,-3e-06,-5e-06,3e-06,-2e-06,8e-06,-1e-06,6e-06,-7e-06,-4e-06,-5e-06,5e-06,0,4e-06,2e-06,-5e-06,-4e-06,1e-05,6e-06,6e-06,1e-05,-5e-06,-1e-05,0,5e-06,1.5e-05,-1.5e-05,-2e-06,6e-06,7e-06,-1e-06,-1.5e-05,-2.6e-05,1e-06,-3e-06,3e-06,2e-05,-1e-05,-4e-06,-2e-06,1.1e-05,1e-06,1.5e-05,-4e-06,-2e-06,-4e-06,-1e-06,-1e-06,1e-06,-1e-05,1e-06,3e-06,-1.2e-05,-9e-06,-1e-05,-7e-06,1e-06,2e-06,0,3e-06,-5e-06,-8e-06,1e-05,-2e-06
-7e-06,-2e-06,7e-06,0,-1.2e-05,4e-06,-3e-06,8e-06,1.6e-05,1e-06,5e-06,6e-06,-2e-06,3e-06,-5e-06,-5e-06,-9e-06,-8e-06,-5e-06,-3e-06,1e-06,-5e-06,-6e-06,6e-06,-3e-06,-3e-06,4e-06,5e-06,1e-06,-1.1e-05,4e-06,5e-06,-5e-06,-3e-06,-2e-06,0,-6e-06,1e-05,1e-06,-6e-06,1e-06,-2.4e-05,4e-06,8e-06,2.2e-05,0,1e-06,-1e-06,1e-05,-3e-06,2e-06,1e-06,1.3e-05,-8e-06,5e-06,5e-06,-4e-06,1e-06,5e-06,8e-06,-4e-06,5e-06,-5e-06,1e-06,-4e-06,-9e-06,1.2e-05,2e-06,-2e-06,-1e-06,0,0,-1.1e-05,3e-06,-7e-06,-9e-06,-4e-06,-3e-06,4e-06,-4e-06,3e-06,2e-06,-2.7e-05,4e-06,3e-06,3e-06,-1e-06,-1e-06,-1e-05,4e-06,0,-6e-06,-1.7e-05,-3e-06,1e-06,-1e-06,-1e-06,-1e-06,-5e-06,-3e-06,-1e-06,5e-06,6e-06,1e-06,-2e-06,0,9e-06,9e-06,2e-06,-9e-06,3e-06,-4e-06,0,4e-06,-5e-06,2e-06,0,-1e-06,3e-06,-7e-06,-5e-06
-1e-06,-2e-06,-2e-06,1e-06,-3e-06,1e-06,-4e-06,4e-06,-8e-06,1e-06,0,-2e-06,-1e-06,-7e-06,-8e-06,3e-06,1e-06,2e-06,0,-1e-06,-5e-06,9e-06,1e-06,2e-06,3e-06,-1e-06,-2e-06,5e-06,1e-06,-1.4e-05,-6e-06,6e-06,4e-06,-1e-06,0,3e-06,-1e-06,5e-06,2e-06,-1e-06,-9e-06,-1.1e-05,1e-06,1.2e-05,5e-06,-2e-06,2e-06,2e-06,1e-06,-4e-06,-1e-05,-1e-06,-1e-06,-3e-06,-1e-06,-1e-05,5e-06,-1e-06,-2e-06,6e-06,3e-06,4e-06,6e-06,3e-06,-1e-06,-2e-06,-1.7e-05,0,-8e-06,1e-06,-3e-06,0,1.3e-05,-5e-06,-1.5e-05,-3e-06,-4e-06,-7e-06,-7e-06,2.4e-05,-2e-06,0,-1.5e-05,4e-06,3e-06,-8e-06,-2e-06,3e-06,-2.4e-05,1.5e-05,-2e-06,3e-06,8e-06,6e-06,7e-06,9e-06,4e-06,-1.1e-05,0,-1.2e-05,2e-06,0,1e-06,0,3e-06,0,2e-06,-1e-06,-1e-06,4e-06,-1e-06,5e-06,3e-06,1e-06,8e-06,4e-06,-1e-06,-2e-06,-1.6e-05,3e-06,-5e-06
-8e-06,5e-06,-2e-06,-1e-06,-4e-06,-3e-06,2e-06,-3e-06,-1.5e-05,-1e-06,-7e-06,1e-06,3e-06,0,1.6e-05,2e-06,5e-06,-2e-06,3e-06,0,2e-06,1e-05,2e-06,3e-06,2e-06,2e-06,-5e-06,-2e-06,3e-06,-6e-06,-3e-06,5e-06,4e-06,-4e-06,0,1e-06,2e-06,-1.3e-05,-4e-06,-4e-06,9e-06,-1.2e-05,2e-06,1.5e-05,-2e-06,-1e-06,2e-06,0,-8e-06,-9e-06,-1.5e-05,1e-06,-4e-06,-7e-06,3e-06,-2e-06,1e-05,2e-06,-2e-06,-1e-06,-1e-06,5e-06,-1e-06,-3e-06,4e-06,1e-06,7e-06,-4e-06,-5e-06,1e-06,6e-06,-1e-06,1e-06,4e-06,-7e-06,4e-06,6e-06,-3e-06,7e-06,-6e-06,0,2e-06,0,-1.5e-05,1e-06,2e-06,-4e-06,-1e-06,-7e-06,-4e-06,0,3e-06,2e-06,-9e-06,4e-06,-4e-06,-2e-06,-1e-05,1e-06,9e-06,-1e-06,-3e-06,-3e-06,0,-4e-06,0,2e-06,6e-06,1e-06,-2e-06,5e-06,5e-06,8e-06,-1e-06,-8e-06,-3e-06,0,-5e-06,1.1e-05,1e-06,7e-06
-1e-06,-2e-06,1e-06,-1e-06,-4e-06,2e-06,3e-06,0,2e-06,-2e-06,9e-06,0,-2e-06,2e-06,3e-06,-2e-06,2e-06,2e-06,-4e-06,-1e-06,1e-06,1e-06,2e-06,-3e-06,2e-06,4e-06,3e-06,-1e-05,-2e-06,7e-06,4e-06,2e-06,0,2e-06,-5e-06,-1e-06,-2e-06,7e-06,-7e-06,3e-06,-5e-06,-1e-06,-1e-06,5e-06,-1.4e-05,-1e-06,1e-06,0,0,1e-06,-1e-05,-3e-06,-1.7e-05,-5e-06,-5e-06,-1e-06,5e-06,0,-1e-06,-3e-06,-1e-06,-1e-06,1e-06,1e-06,-4e-06,3e-06,-8e-06,4e-06,3e-06,0,-5e-06,1e-06,-1.2e-05,-2e-06,-1e-06,2e-06,-3e-06,2e-06,-1e-05,2e-06,0,-1e-06,7e-06,4e-06,0,-1e-06,-3e-06,-1e-06,-5e-06,-4e-06,2e-06,-4e-06,-2e-06,-5e-06,-6e-06,-2e-06,2e-06,-7e-06,3e-06,-1e-06,0,3e-06,-2e-06,0,2e-06,-1e-06,-6e-06,-2e-06,-2e-06,-1.1e-05,-9e-06,4e-06,-2e-06,-3e-06,8e-06,-7e-06,0,1e-06,-3e-06,-3e-06,-1e-06
-4e-06,-3e-06,1e-06,0,1e-05,-1e-06,2e-06,-7e-06,1.6e-05,0,-9e-06,3e-06,2e-06,-1e-06,-4e-06,2e-06,-3e-06,0,1e-06,-1e-06,2e-06,-9e-06,0,2e-06,-3e-06,-3e-06,-4e-06,-9e-06,-1e-06,8e-06,4e-06,1e-06,-5e-06,2e-06,1e-06,3e-06,7e-06,9e-06,-1e-06,0,-3e-06,-6e-06,3e-06,1.3e-05,-5e-06,0,-3e-06,1e-06,0,-9e-06,0,0,-5e-06,-5e-06,-3e-06,5e-06,4e-06,0,-5e-06,-6e-06,3e-06,-5e-06,2e-06,2e-06,4e-06,4e-06,8e-06,-5e-06,7e-06,-1e-06,3e-06,1e-06,7e-06,1e-06,2e-06,1e-06,3e-06,3e-06,5e-06,9e-06,-3e-06,0,-7e-06,6e-06,-3e-06,5e-06,2e-06,-2e-06,8e-06,-1e-06,-2e-06,-4e-06,6e-06,-1.1e-05,-7e-06,0,0,2e-06,-1e-06,-3e-06,-1e-06,-3e-06,6e-06,0,0,1e-06,-9e-06,-3e-06,0,-4e-06,5e-06,-1e-06,-3e-06,-2e-06,-8e-06,-2e-06,0,-1e-06,8e-06,4e-06,-6e-06
-5e-06,2e-06,-1e-06,-1e-06,5e-06,0,0,0,-4e-06,0,-1e-06,-2e-06,-2e-06,5e-06,5e-06,-1e-06,-4e-06,2e-06,5e-06,-1e-06,-1e-06,-8e-06,-4e-06,-2e-06,-1e-06,-4e-06,0,-4e-06,2e-06,-2e-06,-5e-06,4e-06,-1e-06,-6e-06,-6e-06,0,-3e-06,-1.3e-05,2e-06,3e-06,5e-06,-1.1e-05,4e-06,4e-06,-3e-06,0,1e-06,0,6e-06,-1e-06,9e-06,-4e-06,1e-06,-5e-06,3e-06,-3e-06,-9e-06,1e-06,-1e-06,4e-06,-5e-06,-2e-06,-5e-06,-1e-06,-3e-06,1e-06,4e-06,6e-06,2e-06,0,1e-06,1e-06,0,0,1.2e-05,-2e-06,-6e-06,0,-8e-06,-1.1e-05,3e-06,0,2.3e-05,-1.6e-05,1e-06,-2e-06,4e-06,0,7e-06,-8e-06,0,3e-06,-8e-06,9e-06,4e-06,8e-06,0,1e-05,-2e-06,7e-06,2e-06,-4e-06,-4e-06,0,1e-06,-1e-06,9e-06,-3e-06,1e-06,1e-06,0,-5e-06,0,0,4e-06,5e-06,0,-2e-06,-1.1e-05,-6e-06,0
-2e-06,-2e-06,5e-06,2e-06,4e-06,-1e-06,-2e-06,0,-1e-05,-1e-06,4e-06,-2e-06,0,-3e-06,-1e-05,1e-06,3e-06,0,-7e-06,1e-06,-3e-06,1e-06,3e-06,4e-06,0,4e-06,-2e-06,5e-06,-1e-06,-8e-06,-3e-06,-4e-06,3e-06,0,2e-06,-3e-06,-2e-06,0,-1e-06,3e-06,-1e-06,-1.4e-05,-1e-06,5e-06,6e-06,-2e-06,1e-06,0,-5e-06,-6e-06,1.1e-05,-1e-06,1.4e-05,-6e-06,1e-06,-2e-06,-9e-06,-1e-06,0,3e-06,4e-06,0,4e-06,-1e-06,1e-06,-1e-06,-1.4e-05,-5e-06,-2e-06,0,-2e-06,0,-2e-06,-1e-06,7e-06,-4e-06,6e-06,-1e-06,3e-06,-2e-06,1e-06,-2e-06,1.7e-05,2e-06,-1e-06,-4e-06,1e-06,-3e-06,9e-06,8e-06,1e-06,2e-06,3e-06,-1e-06,7e-06,-4e-06,1e-06,7e-06,-3e-06,-7e-06,-1e-06,2e-06,-5e-06,0,-1e-06,0,0,-5e-06,0,-5e-06,-5e-06,-4e-06,1e-06,2e-06,-2e-06,2e-06,-1e-06,-1e-06,8e-06,7e-06,3e-06
-3e-06,3e-06,5e-06,-1e-06,-2e-06,2e-06,-2e-06,-1e-06,-3e-06,-1e-06,-2e-06,0,1e-06,-3e-06,-4e-06,-1e-06,3e-06,-1e-06,3e-06,0,4e-06,8e-06,2e-06,0,2e-06,0,-3e-06,9e-06,0,-8e-06,6e-06,4e-06,1e-06,-1e-06,-3e-06,4e-06,-1e-06,1.1e-05,-2e-06,2e-06,-4e-06,-1.3e-05,1e-06,2e-06,7e-06,0,-1e-06,-1e-06,-3e-06,-1e-06,5e-06,-1e-06,1.1e-05,-4e-06,1e-06,1e-06,-6e-06,1e-06,-5e-06,2e-06,-3e-06,0,-5e-06,1e-06,3e-06,-3e-06,6e-06,4e-06,-5e-06,0,2e-06,0,-1e-06,1e-06,-1e-06,2e-06,-3e-06,0,-5e-06,0,-3e-06,-1e-06,-1e-06,8e-06,2e-06,1e-06,-2e-06,2e-06,0,1.1e-05,0,-4e-06,-6e-06,2e-06,0,-1e-06,-2e-06,4e-06,2e-06,-2e-06,0,-6e-06,-5e-06,0,2e-06,1e-06,-3e-06,-3e-06,2e-06,-7e-06,6e-06,-2e-06,0,1e-06,1e-06,4e-06,1e-06,-5e-06,-3e-06,-5e-06,3e-06
-4e-06,-5e-06,1e-06,1e-06,-7e-06,-2e-06,0,1e-06,8e-06,0,-2e-06,2e-06,-1e-06,1e-06,2e-06,0,-2e-06,0,2e-06,0,-2e-06,6e-06,-1e-06,2e-06,2e-06,-1e-06,2e-06,4e-06,0,-6e-06,2e-06,-5e-06,-1e-06,-2e-06,1e-06,-1e-06,1e-06,-1.1e-05,-5e-06,4e-06,2e-06,-9e-06,2e-06,-3e-06,7e-06,-2e-06,0,1e-06,9e-06,-5e-06,-3e-06,-1e-06,-2e-06,-5e-06,-3e-06,1e-06,4e-06,0,-2e-06,0,2e-06,3e-06,2e-06,1e-06,-3e-06,-2e-06,-2e-06,-2e-06,-3e-06,1e-06,0,-1e-06,2e-06,-1e-06,-5e-06,3e-06,2e-06,2e-06,-2e-06,-1.3e-05,1e-06,-1e-06,-1.6e-05,-1.3e-05,1e-06,1e-06,-1e-06,-1e-06,0,-1.4e-05,-1e-06,-1e-06,8e-06,0,-5e-06,1e-06,1e-06,-2e-06,2e-06,8e-06,-1e-06,-3e-06,-1e-06,0,-4e-06,0,5e-06,-3e-06,-2e-06,-1e-06,-2e-06,3e-06,-3e-06,0,0,0,0,1e-06,8e-06,2e-06,-3e-06
-4e-06,3e-06,-1e-06,-1e-06,-1e-06,1e-06,1e-06,-3e-06,5e-06,1e-06,5e-06,0,1e-06,-3e-06,6e-06,1e-06,-4e-06,-1e-06,-4e-06,1e-06,-2e-06,-2e-06,-2e-06,-3e-06,-1e-06,-1e-06,-4e-06,-1e-06,-1e-06,3e-06,-6e-06,4e-06,-2e-06,1e-06,-1e-06,-1e-06,-2e-06,-1e-06,-1e-06,3e-06,2e-06,-4e-06,1e-06,-2e-06,-6e-06,1e-06,0,-2e-06,-9e-06,-5e-06,-8e-06,-1e-06,-1.4e-05,-5e-06,0,2e-06,8e-06,0,-1e-06,-4e-06,-1e-06,1e-06,-2e-06,-1e-06,3e-06,0,7e-06,0,2e-06,0,-1e-06,0,-1e-06,1e-06,-7e-06,1e-06,-2e-06,0,0,2e-06,1e-06,-3e-06,-4e-06,-2e-06,-1e-06,3e-06,-2e-06,0,-5e-06,-5e-06,0,4e-06,-2e-06,-7e-06,-4e-06,4e-06,-1e-06,-9e-06,1e-06,-5e-06,0,0,-5e-06,0,2e-06,0,-3e-06,0,0,-1e-06,-4e-06,5e-06,0,-1e-06,-2e-06,-5e-06,0,-2e-06,-4e-06,0,-4e-06
-2e-06,0,0,0,-5e-06,1e-06,1e-06,-1e-06,-5e-06,-1e-06,-4e-06,1e-06,-1e-06,4e-06,1e-06,-2e-06,1e-06,1e-06,3e-06,1e-06,1e-06,-9e-06,0,0,-1e-06,-1e-06,-1e-06,-4e-06,1e-06,7e-06,0,-7e-06,0,0,-2e-06,2e-06,6e-06,1.2e-05,0,3e-06,-4e-06,-7e-06,3e-06,-7e-06,-8e-06,-2e-06,-1e-06,1e-06,5e-06,-1e-06,-7e-06,2e-06,-8e-06,-4e-06,-1e-06,-3e-06,6e-06,0,-5e-06,0,2e-06,-2e-06,-3e-06,-1e-06,-1e-06,2e-06,-4e-06,2e-06,5e-06,0,2e-06,0,1e-06,-1e-06,-8e-06,-2e-06,1e-06,-2e-06,-5e-06,-2e-06,-2e-06,-2e-06,-2e-06,9e-06,-1e-06,-3e-06,1e-06,-1e-06,-6e-06,1.3e-05,0,1e-06,-3e-06,-4e-06,4e-06,-2e-06,0,-5e-06,-2e-06,0,2e-06,-7e-06,-4e-06,0,-1e-06,0,1e-06,-1e-06,0,-5e-06,6e-06,4e-06,0,-2e-06,3e-06,-5e-06,0,0,0,0,2e-06
-5e-06,-1e-06,0,0,-1e-06,-1e-06,0,-1e-06,-6e-06,-2e-06,2e-06,-1e-06,0,1e-06,2e-06,1e-06,4e-06,-1e-06,0,0,0,-4e-06,3e-06,-3e-06,-2e-06,3e-06,0,0,1e-06,0,5e-06,4e-06,2e-06,-1e-06,1e-06,-1e-06,-2e-06,-8e-06,2e-06,2e-06,4e-06,-6e-06,1e-06,-6e-06,-8e-06,1e-06,-2e-06,0,-5e-06,-6e-06,-2e-06,-1e-06,-1e-06,-5e-06,1e-06,1e-06,4e-06,0,-1e-06,1e-06,-4e-06,0,1e-06,0,-1e-06,1e-06,-5e-06,-4e-06,3e-06,0,0,0,0,0,1e-06,-2e-06,0,-2e-06,4e-06,0,0,-3e-06,-1.1e-05,-9e-06,-1e-06,-1e-06,-1e-06,-1e-06,3e-06,-1e-06,0,-3e-06,5e-06,-4e-06,5e-06,-2e-06,1e-06,-1e-06,-1e-06,1e-06,-1e-06,-3e-06,-1e-06,0,1e-06,0,-5e-06,2e-06,0,-4e-06,-4e-06,1e-06,2e-06,-1e-06,-4e-06,3e-06,-1e-06,1e-06,-1e-05,2e-06,4e-06
-3e-06,2e-06,1e-06,0,5e-06,1e-06,-1e-06,1e-06,1e-06,0,3e-06,0,0,-3e-06,1e-06,1e-06,-1e-06,2e-06,-3e-06,1e-06,2e-06,3e-06,0,3e-06,2e-06,0,-3e-06,6e-06,-1e-06,-6e-06,0,-5e-06,-1e-06,-1e-06,-3e-06,1e-06,0,-4e-06,-5e-06,4e-06,0,-1.2e-05,0,-7e-06,7e-06,-2e-06,-2e-06,-1e-06,4e-06,-1e-06,5e-06,2e-06,7e-06,-5e-06,2e-06,-1e-06,-7e-06,0,-1e-06,0,5e-06,0,-5e-06,1e-06,3e-06,0,5e-06,5e-06,-3e-06,0,-2e-06,0,-4e-06,-1e-06,6e-06,0,-1e-06,1e-06,-7e-06,7e-06,1e-06,-3e-06,1e-05,-6e-06,0,1e-06,1e-06,2e-06,-4e-06,-5e-06,0,0,-5e-06,4e-06,-1e-06,0,-1e-06,4e-06,0,-3e-06,0,-2e-06,-1e-06,0,-1e-06,0,-3e-06,1e-06,1e-06,-3e-06,1e-06,-2e-06,-1e-06,1e-06,4e-06,1e-06,0,-5e-06,8e-06,-5e-06,0
