1.2e-05,1e-06,7e-06,5e-06,2.3e-05,7e-06,5e-06,2.8e-05,1e-05,2.3e-05,5e-06,4.6e-05,1.8e-05,4.5e-05,2e-06,5e-06,1.5e-05,2e-06,8e-06,3e-06,1.8e-05,8e-06,2.6e-05,3.2e-05,7e-06,2.4e-05,0.000232,1.1e-05,8.3e-05,0.000711,9.5e-05,1.1e-05,9.7e-05,6.1e-05,3.6e-05,8.3e-05,8.3e-05,0.00029,7e-05,0.000152,0.001164,0.000388,0.000349,8.5e-05,0.000184,0.000359,0.000866,0.001836,0.000309,0.000619,0.00037,0.000453,0.000225,0.00023,0.000242,3e-04,0.000292,0.000572,0.000133,5.3e-05,0.000111,0.000151,9.3e-05,0.000246,0.000415,0.000355,0.000164,0.000123,0.000302,3.4e-05,5.3e-05,9e-06,0.000195,7e-06,4.8e-05,1.8e-05,9.2e-05,0.000263,0.000286,0.000153,0.000111,0.00012,0.000223,5.5e-05,0.000191,6.6e-05,8.2e-05,7e-06,4.5e-05,1.4e-05,3e-06,2.6e-05,2.6e-05,3.6e-05,3.6e-05,1.4e-05,3.3e-05,9e-06,2e-06,7e-06,5.3e-05,0,7.5e-05,7e-06,6.8e-05,2.3e-05,4.3e-05,2.8e-05,1e-05,9e-06,4e-06,2.4e-05,1.4e-05,4.5e-05,1.8e-05,2.9e-05,5e-06,4e-06,7e-06,5e-06,1.4e-05
3.2e-05,2.8e-05,2.2e-05,4.8e-05,5.2e-05,3e-05,1.3e-05,2.7e-05,2.4e-05,8e-05,7.4e-05,6.2e-05,5.7e-05,8.3e-05,9.2e-05,4.6e-05,3.4e-05,3.1e-05,2.9e-05,3.8e-05,4.2e-05,2.1e-05,4.8e-05,9e-06,2.3e-05,5.6e-05,0.000542,0.000136,0.000212,0.001435,0.00024,0.000114,9.6e-05,0.00014,0.000203,0.000134,0.000356,0.00105,0.001061,0.000738,0.003171,0.00096,0.001274,0.002102,0.001977,0.000673,0.002014,0.005673,0.002117,0.001967,0.000974,0.00147,0.00018,0.000783,0.000594,0.000533,0.001192,0.001312,0.000625,0.000704,0.000739,0.000503,0.000504,0.000845,0.000944,0.001115,0.000557,0.000209,0.000548,0.000168,0.000314,9e-06,0.000285,0.000169,3.2e-05,0.000106,0.00029,0.000415,0.000992,0.001041,0.000489,0.000231,0.000318,0.000448,7.9e-05,0.000905,0.000738,0.000245,0.000156,0.000154,8.1e-05,5.8e-05,9.2e-05,5.8e-05,0.000137,9e-05,0.000107,8.3e-05,7.1e-05,6.8e-05,0.000123,0.00012,0.000114,0.000147,0.000124,0.000116,8e-05,4.3e-05,3.7e-05,3.6e-05,1.2e-05,3.4e-05,9.6e-05,6.1e-05,5e-05,5.8e-05,5.8e-05,3.2e-05,2e-05,2.9e-05,1.9e-05
7e-06,1.1e-05,1.7e-05,4.3e-05,2.4e-05,1.3e-05,9e-06,2.5e-05,4.3e-05,6.5e-05,4.9e-05,2.7e-05,1.9e-05,8e-06,3.1e-05,2e-05,2.2e-05,1.6e-05,1.3e-05,5.7e-05,2.5e-05,2.6e-05,2.3e-05,4.1e-05,3e-05,6.3e-05,0.00079,0.000711,0.000562,0.00189,0.000701,0.000532,0.000204,0.000163,0.000122,0.000365,0.000806,0.000548,0.000925,0.000365,0.0044,0.003197,0.001318,0.003079,0.000974,0.001371,0.002018,0.004428,0.003406,0.001182,0.001245,0.001214,0.001452,0.001251,0.000839,0.000217,0.000878,0.002993,0.000841,0.000677,8.2e-05,0.001291,0.001695,0.000866,0.001013,0.00096,0.000445,0.000221,0.000893,0.000529,0.000662,0.00065,0.000112,0.000283,0.000122,0.000265,0.000441,7.5e-05,0.000819,0.000254,7.2e-05,0.000401,0.000454,0.000548,0.000509,0.00231,0.000981,0.000272,3.6e-05,0.000126,0.00021,0.000201,0.000133,0.000103,0.000142,5.6e-05,0.000122,7.8e-05,8.1e-05,6.5e-05,0.000118,8.2e-05,8.6e-05,0.000103,8e-05,7.8e-05,6.3e-05,5.5e-05,1.2e-05,6e-05,6.7e-05,4e-05,9.2e-05,7.3e-05,7e-05,8e-06,4.1e-05,1.1e-05,1e-05,2.7e-05,5.9e-05
3e-05,3.9e-05,2.6e-05,4.9e-05,7.1e-05,5.9e-05,3.7e-05,4.8e-05,4.6e-05,7.6e-05,7.7e-05,6.8e-05,5.4e-05,5.2e-05,1.1e-05,2.4e-05,2.9e-05,3.2e-05,3.6e-05,3.4e-05,1.3e-05,1.9e-05,2.4e-05,4e-05,4.1e-05,7.3e-05,0.000871,0.000744,0.000485,0.001893,0.000968,0.000301,0.000268,0.000168,0.000132,0.000507,0.000894,0.001227,0.000309,2.2e-05,0.005027,0.00284,0.001426,0.003966,0.003352,0.00108,0.001665,0.003182,0.001983,0.000889,0.000444,3.1e-05,0.000594,0.001328,0.001052,0.001024,0.000411,0.002113,0.001625,0.000517,0.000484,0.001852,0.000961,0.000414,0.00121,0.000854,0.000777,0.000589,0.000538,0.000295,0.000636,0.000562,0.000539,0.000363,0.000422,0.000783,0.000273,3.8e-05,0.000477,0.000382,0.000164,0.000573,0.001007,0.000415,0.000413,0.002735,0.001656,0.000814,0.000237,0.000124,0.000195,9.8e-05,3.5e-05,8.3e-05,1.6e-05,1.6e-05,8.5e-05,9.4e-05,1.8e-05,2.3e-05,8e-05,4.4e-05,5.7e-05,2.4e-05,3.3e-05,4.2e-05,4.1e-05,2e-05,1.8e-05,8e-05,7e-05,5.2e-05,0.000101,8.8e-05,1.2e-05,2.6e-05,5.8e-05,5.3e-05,3.5e-05,5.4e-05,6.4e-05
1.7e-05,3.5e-05,1e-05,1.8e-05,3.2e-05,1e-05,2.4e-05,4.9e-05,6e-06,8e-06,2.7e-05,1.8e-05,3.6e-05,1.7e-05,3.5e-05,3.1e-05,1.5e-05,3e-05,3.6e-05,4.4e-05,2.5e-05,1.4e-05,3.8e-05,5.5e-05,4.2e-05,4.8e-05,0.000999,0.000447,0.000485,0.002397,0.001094,0.000474,0.000351,0.000227,0.000376,0.000469,0.000229,0.000943,0.000654,0.000451,0.004484,0.002727,0.000448,0.004128,0.002591,0.000304,0.001312,0.004158,0.000182,0.001362,0.001289,0.001364,9e-04,0.001374,0.002401,0.00076,0.001042,0.000819,8.8e-05,0.000579,0.000151,0.00263,0.001745,0.000562,0.001303,0.00127,0.000519,0.00104,0.000879,8e-05,0.000655,0.000213,0.000962,0.00044,0.000367,0.000746,0.000352,0.000197,0.000229,9.4e-05,0.000113,0.000476,0.000602,0.000317,0.000323,0.001911,0.000762,0.000221,7.4e-05,5.4e-05,0.000211,0.000107,3.1e-05,7.6e-05,5.3e-05,1.7e-05,4.1e-05,5.2e-05,4.5e-05,1e-05,4.9e-05,4.2e-05,5.2e-05,3e-05,2.5e-05,7e-06,2.2e-05,2.7e-05,2.5e-05,5.9e-05,1.6e-05,1.9e-05,4.9e-05,1.1e-05,3e-05,2.2e-05,3.3e-05,2e-05,1e-05,2.9e-05,2.3e-05
1.4e-05,2.4e-05,3.3e-05,1.2e-05,1.7e-05,2.1e-05,2e-05,2.3e-05,8e-06,3.4e-05,1.1e-05,3.5e-05,9e-06,8e-06,1.9e-05,0,8e-06,2.1e-05,2.1e-05,3.4e-05,2.8e-05,1.5e-05,3.3e-05,0.000107,4.9e-05,0.000126,0.000973,0.000321,0.000634,0.002641,0.00207,0.00101,0.000313,0.000241,0.000301,0.000429,0.000189,0.001017,0.000432,0.000388,0.003356,0.003356,0.002231,0.002961,0.004091,0.002422,0.001588,0.004346,0.003353,0.002499,0.001861,0.001959,0.000762,0.001992,0.001189,0.00285,0.001155,0.002823,0.001319,0.000821,0.001024,0.002636,0.002012,0.002653,0.003003,0.001416,0.001058,0.000868,0.001978,0.000989,0.000357,0.000603,0.001021,0.001324,0.000184,0.000403,0.000172,0.000181,0.000257,1e-04,0.000105,0.000493,0.00102,0.000546,0.000196,0.00211,0.001129,0.000221,8.1e-05,8.3e-05,0.000224,0.000122,9.7e-05,8e-06,3.5e-05,2e-06,1e-05,2.7e-05,3.9e-05,4.9e-05,3.6e-05,1.9e-05,4.9e-05,1e-05,6.4e-05,3.2e-05,1.1e-05,4.9e-05,2.4e-05,8e-06,1e-05,5e-06,6e-06,6e-06,3.5e-05,1.5e-05,1.6e-05,1.6e-05,1.7e-05,3.5e-05,2.6e-05
2.1e-05,2.9e-05,2.2e-05,1.1e-05,2.7e-05,1.1e-05,3.3e-05,4.1e-05,1.8e-05,3.6e-05,2.7e-05,5.4e-05,3.2e-05,2.6e-05,1.3e-05,1.8e-05,1e-06,5e-06,1.6e-05,6.6e-05,1.2e-05,2.6e-05,4e-06,0.000126,5.3e-05,0.000215,0.000912,0.000551,0.000696,0.002729,0.002518,0.00165,0.001008,0.00044,0.000431,7.5e-05,5e-05,0.000685,0.000556,0.000181,0.002136,0.000756,0.002301,0.00205,0.003629,0.001215,0.003952,0.00262,0.005566,0.004618,0.000723,0.003481,0.002276,0.002256,0.002061,0.003418,0.001112,0.003958,0.005137,0.001837,0.001556,0.004193,0.001404,0.002179,0.001284,0.000998,0.000973,0.001357,0.003264,0.000924,0.000789,0.001059,0.001765,0.00141,0.001623,0.000655,0.000546,0.000296,0.000108,8.3e-05,7.6e-05,0.000454,0.000725,0.000574,0.000511,0.003189,0.001542,0.00047,1e-04,3e-05,0.000298,9.5e-05,9.4e-05,3.3e-05,6.7e-05,2.9e-05,3.7e-05,3.1e-05,7.2e-05,2.6e-05,2.3e-05,7e-06,6.4e-05,4.8e-05,7.3e-05,3.4e-05,1.1e-05,8.9e-05,6e-05,3.8e-05,2e-05,6e-06,9e-06,3.6e-05,2e-05,9e-06,2e-05,2.1e-05,3.8e-05,4.4e-05,1e-05
2e-05,1.1e-05,1.7e-05,7e-06,4.1e-05,2.8e-05,3.9e-05,4.1e-05,2.5e-05,1.1e-05,3e-05,4.8e-05,1.9e-05,4.3e-05,5.6e-05,9e-06,1.5e-05,1.4e-05,4e-05,0.00011,4.5e-05,7.8e-05,5.3e-05,7.4e-05,4.1e-05,0.000338,0.000923,0.001153,0.001465,0.0034,0.007772,0.003236,0.001866,0.001293,0.001153,0.000614,0.000657,0.000552,0.000357,0.000428,0.001794,0.002015,0.002999,0.003309,0.006015,0.008436,0.003474,0.006213,0.007942,0.002195,0.003793,0.002653,0.0033,0.000427,0.000923,0.001843,0.002612,0.003903,0.005514,0.004795,0.003295,0.004308,0.00407,0.001871,0.002777,0.004021,0.003324,0.002758,0.003021,0.003353,0.002832,0.00239,0.001426,0.000993,0.001715,0.002436,0.00091,0.000413,0.000332,0.000196,7e-05,0.000387,0.0011,0.001048,0.000461,0.002984,0.001894,0.000791,0.000299,0.000113,0.000231,0.000227,0.000179,6.2e-05,7.4e-05,0.000153,0.000123,5.9e-05,0.000101,7.2e-05,1.8e-05,4.4e-05,3.2e-05,3e-05,5.1e-05,4.1e-05,0.000101,7.2e-05,7.2e-05,6.5e-05,3.1e-05,3.4e-05,1.5e-05,3.9e-05,4.5e-05,3.5e-05,4.9e-05,3e-05,4.5e-05,3.4e-05,2.6e-05
1.7e-05,1.6e-05,2.5e-05,1.9e-05,4.8e-05,5.1e-05,2e-05,5.2e-05,4.7e-05,2.7e-05,6.3e-05,6.5e-05,6.2e-05,4.3e-05,6e-06,2.3e-05,2e-05,4e-06,6.2e-05,9.4e-05,7.2e-05,0.000106,8.3e-05,0.000218,0.00018,0.000326,0.001149,0.001826,0.001051,0.004008,0.011399,0.006915,0.002615,0.001152,0.000429,0.00091,0.000386,0.000576,0.000343,0.000395,0.00177,0.001857,0.005099,0.001963,0.004058,0.006832,0.014007,0.011078,0.005104,0.005272,0.005281,0.003827,0.001817,0.0021,0.001444,0.002396,0.000709,0.003207,0.001358,0.001484,0.00108,0.002905,0.000487,0.000458,0.001952,0.002042,0.002589,0.001314,0.001447,0.002539,0.000885,0.001598,0.00155,0.00164,0.001878,0.001216,0.001118,0.00025,4.5e-05,4.8e-05,0.000218,0.000555,0.000552,0.000529,0.000263,0.001432,0.000306,4.9e-05,0.000123,8.2e-05,7.4e-05,0.00024,5.8e-05,0.000125,0.00013,0.000116,0.000109,5.3e-05,9.5e-05,3e-05,4.2e-05,6e-05,8.2e-05,5.5e-05,8.9e-05,1.6e-05,0.000144,0.000229,0.000155,5.9e-05,6e-05,5.6e-05,5.6e-05,1.3e-05,1.4e-05,9.1e-05,7e-05,8.3e-05,2.9e-05,5e-05,4.5e-05
3e-05,1.3e-05,8e-06,4e-06,2.4e-05,1.1e-05,3.7e-05,2.8e-05,3e-06,3.3e-05,4.3e-05,4e-06,2.9e-05,2.2e-05,1.3e-05,1.6e-05,1.4e-05,2.9e-05,6.8e-05,0.000167,0.000111,5.9e-05,6.2e-05,0.000351,0.000371,0.000473,0.000632,0.001693,0.002669,0.000407,0.009088,0.004526,0.001339,0.00083,0.000837,0.000576,0.001143,0.001073,0.000524,8.6e-05,0.001527,0.000368,0.003219,0.00415,0.0028,0.00372,0.009434,0.003924,0.001961,0.001235,0.000699,0.001233,0.00272,0.005016,0.003423,0.002251,0.0016,0.001961,0.002151,0.002413,0.001132,0.001604,0.002122,0.00124,0.001555,0.002486,0.000947,0.000717,0.000852,0.000854,0.000572,0.000715,0.000749,0.001073,0.000426,0.000901,0.000322,0.00035,0.000213,0.000101,0.000165,0.000647,0.000719,0.000387,0.000558,0.000181,0.00055,0.000439,0.000226,0.000159,0.000348,0.000395,0.00024,4.7e-05,8.2e-05,0.000168,8e-05,8.7e-05,7.6e-05,7.4e-05,9.3e-05,5.6e-05,5.8e-05,0.000127,0.000183,0.000131,0.000133,0.000161,9.6e-05,0.000119,7.4e-05,3.6e-05,5.6e-05,4.3e-05,7e-05,0.000124,9.5e-05,1.9e-05,2e-05,5.2e-05,4e-05
2.5e-05,2.5e-05,1.7e-05,1.7e-05,1.3e-05,1.3e-05,3.6e-05,1.9e-05,1e-05,2.4e-05,2.2e-05,1.2e-05,2e-05,6e-06,2e-05,5e-06,9e-06,2.3e-05,8.1e-05,0.00016,0.000117,9.8e-05,3.1e-05,0.000327,0.000159,0.000166,0.000624,0.000944,0.000743,0.002219,0.004625,0.002318,0.000238,4.9e-05,0.000658,0.000296,0.000582,0.000249,0.00013,9.4e-05,0.001518,0.001757,0.002854,0.002142,0.001695,0.004053,0.002994,0.003235,0.001391,0.00042,0.000756,0.002007,0.001378,0.003132,0.003699,0.002301,0.001186,0.001286,0.001032,0.001184,0.000963,0.000181,0.001509,0.000195,0.001573,0.000952,0.001812,0.000455,0.000293,0.000535,0.000441,0.000228,0.000479,0.000293,0.000484,0.00034,0.000179,0.000344,0.000169,9.6e-05,8.2e-05,0.001018,0.000523,0.000113,0.001057,0.001353,0.000773,0.00016,7.1e-05,0.000126,0.000486,0.000419,0.000188,3.6e-05,4.3e-05,7.1e-05,2.3e-05,0.000117,0.000129,7.5e-05,4.1e-05,2.5e-05,8.7e-05,7.1e-05,5.9e-05,6.9e-05,0.00012,8.7e-05,1.4e-05,6.6e-05,4.4e-05,5.1e-05,7.6e-05,3.9e-05,5.2e-05,4.9e-05,1.1e-05,3.5e-05,2.2e-05,4.2e-05,1.6e-05
1.4e-05,1.2e-05,8e-06,1.5e-05,9e-06,2.2e-05,1.7e-05,5e-06,1e-05,6e-06,1.8e-05,6e-06,1.2e-05,1.6e-05,1.3e-05,2.1e-05,1.3e-05,1.6e-05,3e-05,7.1e-05,4.4e-05,3.8e-05,1.8e-05,0.000226,0.000101,0.00011,0.000407,0.000676,0.000981,0.002172,0.000876,0.000595,0.000447,0.000252,0.000552,0.000382,0.000286,0.000363,0.000314,0.000212,0.001142,0.000487,0.00147,0.002162,0.00102,0.003137,0.002462,0.00097,0.000183,0.000407,0.00133,0.003417,0.001922,0.001883,0.001971,0.001498,0.001274,0.000517,0.000185,0.001298,0.001728,0.000307,0.001701,0.000793,0.001689,0.000925,0.000535,0.000658,0.000184,0.001242,0.00057,0.000537,0.000297,0.000552,0.000625,0.000377,0.000298,0.000111,0.000205,0.000114,9.2e-05,0.001155,0.000313,0.000157,0.001709,0.001816,0.000996,0.000283,0.000127,0.000128,0.000572,0.000271,8.1e-05,7.7e-05,8.4e-05,1.9e-05,3.2e-05,0.000117,2.1e-05,1.3e-05,3.1e-05,2.7e-05,4.1e-05,5.7e-05,1.9e-05,2.4e-05,4.5e-05,5.3e-05,5.1e-05,2.1e-05,4.4e-05,3.5e-05,3.3e-05,2e-05,3.9e-05,3e-05,3.6e-05,1.2e-05,6e-06,2.4e-05,1.9e-05
1e-05,1e-05,5e-06,7e-06,1.9e-05,1.2e-05,1.2e-05,8e-06,1e-05,1.5e-05,1.6e-05,1.1e-05,2e-06,2e-06,1.4e-05,5e-06,1.9e-05,2e-05,1.3e-05,1.5e-05,3.2e-05,5.6e-05,4.4e-05,6.2e-05,2.3e-05,8.9e-05,0.000234,0.000701,0.00098,0.001686,0.000526,0.000517,0.000465,0.00016,0.000241,0.001087,0.000401,0.00034,0.000142,8.8e-05,0.000943,0.001713,0.000362,0.000992,0.000692,0.001942,0.001938,0.001322,0.000757,0.000887,0.00122,0.002532,0.000616,0.002371,0.002148,0.001216,0.001276,0.000838,0.000685,0.000939,0.000987,0.002113,0.001443,0.000883,0.002192,0.00043,0.000877,0.000798,0.000249,0.001179,0.000747,0.000626,0.000525,0.000232,0.000327,0.000244,0.000199,0.000129,1.5e-05,3e-05,0.00014,0.00071,0.000719,0.000323,0.002169,0.000714,0.000262,0.000208,5.2e-05,6.1e-05,0.000509,2e-04,4.3e-05,5e-05,4.1e-05,1.7e-05,2.5e-05,4.4e-05,6.5e-05,1.9e-05,4.3e-05,3.1e-05,6e-06,2.9e-05,3.1e-05,2.1e-05,3.5e-05,1.7e-05,3.7e-05,8e-06,4.6e-05,2.2e-05,2.2e-05,1.6e-05,3.3e-05,2.4e-05,1.6e-05,9e-06,2.3e-05,1.6e-05,2.5e-05
1.2e-05,3e-06,6e-06,9e-06,5e-06,9e-06,6e-06,3e-06,1.3e-05,1.1e-05,7e-06,7e-06,8e-06,3e-06,6e-06,1.6e-05,1.6e-05,9e-06,3.1e-05,1.5e-05,2.8e-05,5.3e-05,2.9e-05,8e-05,2.7e-05,6.1e-05,0.000243,0.001178,0.000703,0.001804,0.000554,0.00046,0.000389,7.1e-05,0.000228,0.001411,0.000538,0.000473,0.000283,0.000105,0.000751,0.001819,0.00267,0.001371,0.002379,0.002081,0.003808,0.002195,0.002513,0.001017,0.001877,0.001584,0.001287,0.002713,0.001171,0.000827,0.00184,0.001072,0.002769,0.001626,0.000594,0.001585,0.000879,0.00186,0.002458,0.002004,0.001198,0.000348,0.000588,0.000911,0.000844,0.000766,0.000297,0.00166,0.00126,0.000448,0.000277,0.000206,5.2e-05,5e-05,0.000128,0.000498,0.000582,0.000518,0.002629,0.00115,0.000516,0.000194,6.8e-05,6.7e-05,0.000268,0.000102,2.8e-05,3.4e-05,4e-05,1.9e-05,2.3e-05,2.5e-05,2e-05,3.3e-05,3.9e-05,2.2e-05,2e-05,1e-05,1e-05,2.5e-05,2.8e-05,2.9e-05,1.9e-05,4.5e-05,1.1e-05,1.4e-05,8e-06,1.5e-05,4.3e-05,2.3e-05,1e-05,1.9e-05,2.9e-05,1.8e-05,2.4e-05
1.6e-05,1.6e-05,5e-06,1e-05,6e-06,9e-06,1.1e-05,1e-05,1.1e-05,2.4e-05,1.7e-05,1.4e-05,7e-06,9e-06,4e-06,7e-06,1.1e-05,1.7e-05,3e-05,3.6e-05,4.3e-05,8.4e-05,3.5e-05,0.000115,6.8e-05,0.000111,0.00034,0.000996,0.001052,0.001183,0.000321,0.000268,0.000345,0.00015,0.00031,0.001793,0.00221,0.001005,0.000464,0.000308,0.000624,0.00299,0.003934,0.002669,0.001972,0.003751,0.004086,0.004905,0.00732,0.00578,0.004915,0.005887,0.001357,0.0024,0.005182,0.003831,0.002145,0.000168,0.003437,0.001891,0.002532,0.003779,0.005534,0.002515,0.002192,0.000739,0.001167,0.000971,0.002038,0.00154,0.000426,0.00134,0.000682,0.002808,0.000718,0.000676,0.000512,0.000162,0.000127,0.000117,8.2e-05,0.001608,0.000125,0.000274,0.002311,0.001608,0.000937,0.00021,2.4e-05,5.2e-05,3.2e-05,0.000117,2e-05,4.1e-05,7e-05,3.9e-05,4.1e-05,2.7e-05,1.8e-05,4.6e-05,3.6e-05,4.5e-05,3.6e-05,2.9e-05,2.8e-05,2.2e-05,2.2e-05,2.1e-05,2.6e-05,4.5e-05,3.6e-05,3.1e-05,1e-05,2.5e-05,3.5e-05,2.2e-05,1.7e-05,2.4e-05,3e-06,1.3e-05,1e-05
1.1e-05,9e-06,1.2e-05,7e-06,2.3e-05,9e-06,1.7e-05,4e-06,3e-06,1.5e-05,3e-06,6e-06,7e-06,1.2e-05,1.3e-05,4e-06,6e-06,7e-06,1e-05,2.4e-05,1.9e-05,6.9e-05,5.4e-05,4.1e-05,1.6e-05,8.9e-05,0.000549,0.001141,0.000577,0.001167,0.00048,0.000343,0.000268,7.9e-05,0.000536,0.002051,0.002146,0.0013,0.000702,0.000399,0.000443,0.00627,0.003141,0.006432,0.002647,0.004789,0.003703,0.006871,0.00644,0.002193,0.004303,0.004806,0.007254,0.005857,0.00879,0.00305,0.003934,0.000526,0.003394,0.001889,0.006335,0.00178,0.006172,0.004773,0.003428,0.003469,0.001301,0.001879,0.002531,0.000417,0.002215,0.001693,0.00093,0.00295,0.002209,0.001386,0.00031,0.000238,0.00017,0.000116,0.000171,0.00229,0.002326,0.000995,0.002362,0.002513,0.000844,0.000123,9.8e-05,0.000101,0.000222,0.000118,0.000102,7.6e-05,6.4e-05,6.8e-05,2.8e-05,3.7e-05,5.9e-05,5.9e-05,8.3e-05,8.3e-05,3.6e-05,2.6e-05,2.1e-05,5.2e-05,3e-05,1.8e-05,1.3e-05,1.3e-05,1.6e-05,3.2e-05,3e-05,3.3e-05,5e-05,3.6e-05,3.6e-05,5.8e-05,4.3e-05,1.3e-05,1.4e-05
1e-05,1.3e-05,9e-06,2e-06,2.3e-05,3.3e-05,1.3e-05,1e-05,1.7e-05,3e-06,1.4e-05,2e-06,9e-06,1.9e-05,1.8e-05,1.7e-05,1e-05,1.4e-05,1.3e-05,1.2e-05,3e-05,6.4e-05,6.7e-05,4e-06,3.8e-05,9.8e-05,0.000556,0.002121,0.001031,9e-04,0.000407,7.9e-05,0.000414,0.000291,0.000936,0.001301,0.000459,0.000334,0.000172,0.000173,0.000663,0.00834,0.010993,0.005644,0.008244,0.009816,0.004464,0.003597,0.007622,0.010491,0.010884,0.006991,0.012006,0.003213,0.00616,0.00809,0.009221,0.005901,0.005223,0.003276,0.007731,0.009119,0.000728,0.008666,0.00884,0.00931,0.008708,0.002975,0.002308,0.003679,0.004492,0.002734,0.000874,0.001085,0.001913,0.002491,0.001835,0.001137,0.000535,0.000232,7.6e-05,0.002357,0.001474,0.000514,0.002244,0.002771,0.001547,0.000574,0.000196,0.000238,0.000206,0.000216,0.000159,6.7e-05,0.00016,0.000156,6.1e-05,5.3e-05,5.8e-05,7.2e-05,6.1e-05,1.4e-05,5.3e-05,1e-05,4.1e-05,4.6e-05,4e-05,1.4e-05,2.5e-05,1.1e-05,3.5e-05,4.5e-05,1.2e-05,3.2e-05,4e-05,4.2e-05,6.9e-05,4.9e-05,2.2e-05,4.9e-05,8e-06
2e-05,1.7e-05,5e-06,1.5e-05,1.3e-05,1e-05,3.7e-05,1.7e-05,1.8e-05,1.6e-05,2.2e-05,1.5e-05,5e-06,9e-06,1.8e-05,8e-06,4e-06,1.7e-05,4.3e-05,7.1e-05,8.4e-05,0.000121,7.5e-05,0.000148,5.5e-05,8.1e-05,0.000445,0.003283,0.002043,0.000669,0.000492,0.000281,7e-04,0.000542,0.000746,0.001945,0.001607,0.000644,0.000521,0.000463,0.000549,0.006723,0.004751,0.006231,0.010554,0.001181,0.002654,0.005182,0.002847,0.006805,0.007508,0.008293,0.002704,0.009492,0.004643,0.005058,0.009322,0.0109,0.002898,0.006575,0.009003,0.004274,0.004453,0.006854,0.007959,0.002848,0.005225,0.003345,0.003101,0.005204,0.003372,0.001438,0.0031,0.00234,0.000882,0.001202,0.000343,0.000159,1e-04,7.3e-05,0.000116,0.001551,0.001095,0.000309,0.002267,0.001289,0.000581,0.000226,5.7e-05,0.000177,0.000456,0.000369,0.000128,0.000111,7e-05,0.000118,9.2e-05,4.3e-05,4.1e-05,8.1e-05,4.5e-05,7.5e-05,6.3e-05,7e-05,6.1e-05,3.6e-05,3.4e-05,1.6e-05,4.8e-05,6e-05,3.7e-05,6.6e-05,4.1e-05,4.5e-05,1.2e-05,1.9e-05,4.2e-05,6.2e-05,6.7e-05,8.5e-05,7.1e-05
1.6e-05,1e-05,5e-06,2.5e-05,8e-06,7e-06,2.1e-05,1.7e-05,1.3e-05,1.2e-05,2.4e-05,1.7e-05,1.4e-05,1.5e-05,1.9e-05,1.6e-05,1.5e-05,1.3e-05,3.3e-05,6.2e-05,2.6e-05,5.9e-05,4.7e-05,0.000158,0.000134,0.000152,0.000386,0.00339,0.002992,0.001361,0.000552,0.000307,0.000339,0.000183,0.000778,0.001641,0.000299,0.000333,0.000321,5e-05,0.001039,0.002223,0.001616,0.004704,0.003763,0.005028,0.001822,0.00341,0.004069,0.002549,0.002334,0.00158,0.003947,0.00507,0.005606,0.004274,0.00515,0.003395,0.007323,0.009199,0.003581,0.001261,0.001711,0.004224,8.1e-05,0.001166,0.004356,0.003067,0.002284,0.002533,0.001355,0.0013,0.001963,0.000993,0.001147,0.001081,0.000494,0.00012,0.000245,0.000128,8.9e-05,0.000709,0.000644,0.001431,0.001668,0.000637,0.000286,0.000173,9.4e-05,4e-05,0.00028,0.000111,0.00011,9.7e-05,0.000103,4.7e-05,1.9e-05,4.2e-05,6.3e-05,6.5e-05,2.2e-05,6.3e-05,3.5e-05,3.2e-05,4e-06,3.3e-05,7.6e-05,3.9e-05,5.8e-05,2.9e-05,2.6e-05,4.3e-05,9e-06,3.4e-05,3.3e-05,1.6e-05,2.3e-05,5.8e-05,2.6e-05,6.7e-05,3.5e-05
2.5e-05,1.4e-05,1.6e-05,3.2e-05,1.9e-05,9e-06,2e-06,1.2e-05,9e-06,2.4e-05,2.6e-05,1.8e-05,1.5e-05,2.4e-05,3.7e-05,2.9e-05,2.5e-05,1.4e-05,1.4e-05,6.8e-05,4.6e-05,5.6e-05,9.5e-05,7.9e-05,0.000128,2.6e-05,0.000471,0.002857,0.002106,0.001159,0.000332,0.000223,0.000437,0.000188,0.000747,0.00045,0.000986,0.000413,0.000212,0.000176,0.001024,0.001137,0.001466,0.00331,0.002177,0.000893,0.001853,0.000945,0.002375,0.001597,0.000972,0.002234,0.002208,0.001303,0.003333,0.006274,0.003642,0.001937,0.00493,0.002162,0.003169,0.003084,0.002275,0.001708,0.001512,0.003387,0.001073,0.00161,0.000905,0.001211,0.000767,0.001057,0.00111,0.00078,0.00078,0.000514,0.000337,0.000349,0.000251,0.00015,4.8e-05,0.000769,0.000394,0.001389,0.002319,0.001486,0.000777,0.000203,7.6e-05,6.4e-05,0.000109,0.000113,6.9e-05,2e-05,9e-06,4.3e-05,8.7e-05,7.8e-05,4.6e-05,3.2e-05,4.1e-05,4e-05,7.2e-05,5.8e-05,1.9e-05,4.1e-05,7.4e-05,4.9e-05,5.4e-05,3.1e-05,2.3e-05,3.7e-05,4.5e-05,3.8e-05,3.3e-05,3.2e-05,1.4e-05,3.3e-05,5.7e-05,2.3e-05,4e-05
1.5e-05,1.1e-05,1.7e-05,2.3e-05,2.1e-05,1.3e-05,1.1e-05,1.5e-05,1.1e-05,2.2e-05,9e-06,2e-05,8e-06,2.9e-05,2.6e-05,1.1e-05,2.4e-05,2e-05,1.8e-05,6.7e-05,2.9e-05,6.4e-05,6.7e-05,0.000132,7.4e-05,8.2e-05,0.000606,0.002344,0.000513,0.001205,0.000331,0.000291,0.000247,0.000161,0.000631,0.000813,0.000855,0.000579,0.000299,0.000188,0.000934,0.00175,0.000962,0.000659,0.00058,0.002292,0.002465,0.003103,0.001044,0.001842,0.001008,0.001932,0.001324,0.001697,0.001558,0.00329,0.000986,0.001699,0.001264,0.00174,0.001304,0.001509,0.002179,0.001355,0.001562,0.002531,0.002338,0.000823,0.001479,0.001706,0.000665,0.000528,0.001268,0.001064,0.001014,0.000334,0.000199,0.00028,0.00022,7.2e-05,1.8e-05,0.000894,0.001275,0.001575,0.001907,0.001721,7e-04,0.000177,0.000147,0.000218,0.000224,0.000143,0.000107,8.5e-05,0.000104,5.1e-05,9.1e-05,1.1e-05,3.5e-05,4.6e-05,3.5e-05,4.5e-05,3.9e-05,5.3e-05,3.6e-05,5.6e-05,2.7e-05,3.1e-05,2.1e-05,1.8e-05,2.6e-05,2.4e-05,2.9e-05,3.9e-05,1.8e-05,3.1e-05,3.4e-05,1e-05,2.5e-05,5e-06,1.2e-05
6e-06,6e-06,6e-06,4e-06,1.1e-05,9e-06,1.3e-05,6e-06,1.2e-05,3e-06,1.6e-05,7e-06,1.1e-05,1.9e-05,5e-06,1.6e-05,9e-06,4e-06,1.8e-05,4.5e-05,3.8e-05,6.3e-05,3.4e-05,9.4e-05,9.9e-05,2.4e-05,0.000414,0.000823,0.00048,0.001202,0.000575,0.000472,0.000163,0.000125,0.000528,0.000485,0.000239,0.000301,0.00022,5.8e-05,0.000739,0.001235,0.000879,0.000814,0.00085,0.001428,0.000921,0.001718,0.001252,0.000763,0.000527,0.001018,0.001309,0.000624,0.00029,0.001587,0.001824,0.000791,0.000264,0.001178,0.000631,0.000744,0.001294,0.001,0.001118,0.001295,0.000569,0.000827,0.001138,0.000998,0.000846,0.000138,0.000514,0.000288,0.00024,0.000175,0.000196,7e-05,7e-05,4.2e-05,1.6e-05,0.000595,0.000544,0.000505,0.002069,0.001505,0.000711,0.000146,0.00012,6.1e-05,0.000192,7.4e-05,8e-05,1.1e-05,8.4e-05,6e-05,3.3e-05,4e-05,5.2e-05,2.6e-05,2.2e-05,7.1e-05,4.4e-05,6e-05,2.8e-05,4.4e-05,1.2e-05,3.2e-05,1.3e-05,9e-06,2.5e-05,2.2e-05,2.4e-05,3.1e-05,2.8e-05,2.9e-05,8e-06,5e-06,8e-06,1.5e-05,2.3e-05
2e-06,2e-06,3e-06,1e-06,3e-06,2e-06,6e-06,5e-06,5e-06,2e-06,7e-06,8e-06,6e-06,3e-06,3e-06,8e-06,6e-06,2e-06,5e-06,1.1e-05,4e-06,1.8e-05,1.6e-05,5.4e-05,1.9e-05,1.2e-05,5.1e-05,0.000299,0.000302,0.000412,0.000117,5.1e-05,0.000105,5.3e-05,0.000169,0.000234,0.000131,3.9e-05,4.2e-05,2.1e-05,0.000378,0.000289,0.000529,0.000416,0.00074,0.000462,1e-04,0.000841,0.000902,0.000868,0.000387,0.000772,0.000818,0.000784,0.000536,0.000664,0.000555,0.000412,0.000526,0.000256,0.000554,0.000341,0.000529,0.000527,0.000521,0.000219,0.000347,9.2e-05,0.000333,0.000544,0.000255,9.9e-05,8.9e-05,0.000209,9.1e-05,4.6e-05,4.6e-05,3.6e-05,2.8e-05,2e-05,1.9e-05,4e-05,0.00026,0.000202,0.000688,0.000474,0.000159,3e-05,1.8e-05,3.4e-05,0.000123,7.3e-05,1.5e-05,2.3e-05,3.4e-05,1.1e-05,1.1e-05,1.6e-05,1e-05,9e-06,1.3e-05,1.9e-05,1.6e-05,7e-06,7e-06,1e-05,6e-06,1.2e-05,1.2e-05,3e-06,2e-06,8e-06,4e-06,1.1e-05,9e-06,1.1e-05,3e-06,2e-06,4e-06,8e-06,8e-06
3e-06,2e-06,1e-06,2e-06,1e-06,3e-06,9e-06,7e-06,2e-06,4e-06,2e-06,2e-06,6e-06,7e-06,2e-06,2e-06,2e-06,3e-06,3e-06,8e-06,1e-05,2e-05,3e-06,3.1e-05,1e-05,1.2e-05,0.000158,0.000295,0.000336,0.000365,0.000128,0.000123,1.6e-05,3.5e-05,6.6e-05,0.000261,5.2e-05,5.3e-05,8.3e-05,4.6e-05,0.000317,0.000334,0.000696,0.00074,0.000307,0.001266,0.000385,0.000801,0.001114,0.000263,0.000125,0.000908,0.000132,0.000623,0.000733,0.000935,0.00039,0.00035,0.000453,0.000456,0.00045,0.000247,0.000413,0.000415,0.000341,0.000317,0.000101,0.000138,0.000169,0.000105,0.000173,5.4e-05,7.2e-05,0.000102,4.9e-05,8e-06,6.1e-05,4.6e-05,2.3e-05,9e-06,2.4e-05,0.000193,0.000421,0.000311,0.000441,0.000203,0.000123,2.4e-05,5e-06,1.8e-05,0.000112,7.1e-05,2.3e-05,6e-06,2e-06,1e-06,1.1e-05,3e-06,2e-06,8e-06,9e-06,2.4e-05,5e-06,1.1e-05,6e-06,5e-06,4e-06,3e-06,3e-06,8e-06,6e-06,2e-06,7e-06,1.1e-05,6e-06,1.2e-05,5e-06,2e-06,8e-06,1e-05,1.2e-05
2e-06,2e-06,2e-06,2e-06,1e-06,3e-06,6e-06,3e-06,1e-06,2e-06,3e-06,7e-06,2e-06,5e-06,3e-06,1e-06,1e-06,2e-06,3e-06,7e-06,3e-06,1.4e-05,1.2e-05,1e-05,1.3e-05,9e-06,0.000175,0.000251,0.000267,0.00046,0.000355,0.00011,2.2e-05,3.3e-05,8.8e-05,0.000224,0.000167,9.9e-05,1.5e-05,5e-06,0.000276,0.000305,0.000445,0.000431,0.000536,0.000981,0.00027,0.000673,0.000378,0.000734,0.000284,0.000437,0.00027,0.000218,0.000282,0.000717,0.000486,0.000329,0.000346,0.000345,0.000257,0.00039,0.000284,0.000413,0.000294,0.000257,0.00023,0.000149,0.000214,0.000181,0.000107,8.6e-05,9.8e-05,7.9e-05,7.2e-05,3.8e-05,7.4e-05,1.5e-05,2.2e-05,7e-06,3.1e-05,0.000228,0.000313,0.000239,0.000429,0.00019,6.7e-05,2e-05,1.5e-05,2.2e-05,9.3e-05,4.4e-05,2.5e-05,8e-06,1.9e-05,1.1e-05,0,6e-06,7e-06,1e-06,2e-06,1.4e-05,1e-05,1e-05,4e-06,7e-06,3e-06,7e-06,3e-06,6e-06,1e-06,5e-06,7e-06,5e-06,1e-05,1e-05,3e-06,4e-06,6e-06,7e-06,1.1e-05
1e-06,0,2e-06,2e-06,1e-06,3e-06,5e-06,1e-06,1e-06,2e-06,2e-06,3e-06,3e-06,0,1e-06,1e-06,2e-06,3e-06,2e-06,6e-06,1e-05,5e-06,3e-06,1e-05,7e-06,8e-06,9.9e-05,0.000221,0.000167,0.000179,2.8e-05,8.6e-05,3e-05,1.1e-05,9.7e-05,0.000146,2e-04,0.000125,5e-05,1.2e-05,0.000247,8.7e-05,3e-04,0.000288,0.00024,0.000403,0.000523,0.000586,0.000502,0.000378,0.000551,0.00052,0.000153,0.00047,0.000116,0.000119,0.000252,0.000399,0.000346,0.000323,0.000161,0.000354,0.000399,0.000316,0.000287,0.000163,0.000296,0.000234,0.000164,0.000141,6.5e-05,0.000129,8.4e-05,8.5e-05,8.3e-05,1.2e-05,6.5e-05,7.3e-05,3.7e-05,1.8e-05,3.2e-05,0.000208,0.000388,0.000321,0.00039,0.000175,0.000121,7.8e-05,4.1e-05,1.7e-05,9.1e-05,4.7e-05,1.5e-05,2e-06,2.1e-05,8e-06,3e-06,8e-06,1e-06,7e-06,6e-06,5e-06,6e-06,5e-06,6e-06,8e-06,5e-06,1.1e-05,1e-05,2e-06,4e-06,5e-06,2e-06,4e-06,5e-06,3e-06,2e-06,3e-06,4e-06,9e-06,4e-06
5e-06,5e-06,0,2e-06,3e-06,2e-06,1e-06,3e-06,3e-06,3e-06,2e-06,1e-06,5e-06,1e-06,2e-06,2e-06,2e-06,2e-06,3e-06,4e-06,6e-06,2e-06,6e-06,1.7e-05,6e-06,1.4e-05,2.5e-05,0.000114,0.000258,0.000387,0.000221,1.8e-05,4.7e-05,3e-05,0.00011,0.000181,7.8e-05,3.4e-05,2.4e-05,1.9e-05,0.000196,0.000235,0.000343,0.000648,0.000417,0.000287,0.000922,0.000514,0.000274,8.7e-05,0.000581,0.000112,0.000264,0.000674,0.000497,0.000435,0.000138,0.00066,0.000114,0.000597,0.000292,0.000276,0.000291,0.000336,0.000144,0.000381,6.3e-05,2.5e-05,0.000169,0.000141,4e-05,0.000118,6.2e-05,7e-05,0.000103,6.2e-05,5.8e-05,8.3e-05,4.6e-05,2.3e-05,2.2e-05,0.00018,0.000228,0.000235,0.000254,0.000148,2.2e-05,3.5e-05,3.2e-05,1.4e-05,8e-05,3.7e-05,4e-06,9e-06,4e-06,1e-06,1e-06,5e-06,4e-06,1.1e-05,7e-06,3e-06,6e-06,9e-06,4e-06,1e-06,3e-06,7e-06,5e-06,6e-06,7e-06,5e-06,2e-06,4e-06,5e-06,6e-06,1e-06,4e-06,4e-06,2e-06,6e-06
4e-06,5e-06,6e-06,4e-06,2e-06,2e-06,3e-06,3e-06,4e-06,5e-06,3e-06,3e-06,5e-06,5e-06,4e-06,4e-06,1e-06,2e-06,3e-06,4e-06,4e-06,5e-06,5e-06,2e-05,1.8e-05,8e-06,4.7e-05,0.000172,0.000156,0.000134,0.000152,0.00014,8.7e-05,3.5e-05,0.000102,0.000196,0.000135,2.6e-05,4.4e-05,3.3e-05,0.000193,0.00015,0.000148,0.000494,0.00059,0.000471,0.000426,0.000245,0.000302,0.000158,0.00018,0.000258,0.000383,0.00034,0.000174,0.000707,0.000558,0.000519,0.000192,0.000809,0.000505,0.000396,4e-04,0.00054,0.000338,0.000434,0.000162,0.000175,0.000169,0.000234,0.000196,0.00011,0.000172,2.6e-05,0.00011,3.3e-05,5.6e-05,4.6e-05,3.2e-05,9e-06,2e-05,0.000176,0.000357,0.000284,0.000291,0.000122,7e-05,6.4e-05,2.2e-05,4e-05,6.4e-05,5.6e-05,2.4e-05,1e-05,9e-06,1.4e-05,1e-05,6e-06,2e-06,4e-06,7e-06,4e-06,2e-06,6e-06,3e-06,3e-06,5e-06,6e-06,9e-06,8e-06,3e-06,2e-06,6e-06,3e-06,3e-06,4e-06,3e-06,1e-06,3e-06,5e-06,5e-06
2e-06,1e-06,6e-06,6e-06,2e-06,1e-06,3e-06,2e-06,0,2e-06,2e-06,3e-06,2e-06,3e-06,0,3e-06,2e-06,2e-06,3e-06,5e-06,4e-06,5e-06,6e-06,6e-06,5e-06,1.8e-05,5.6e-05,0.000214,0.000224,0.000322,0.000106,2.2e-05,2.3e-05,2.3e-05,5.7e-05,0.000223,0.000166,0.000114,3.3e-05,3.7e-05,0.000216,0.000123,0.000277,0.000335,0.000489,0.000216,0.000252,0.000174,0.000451,0.000166,0.000207,0.000664,8.4e-05,0.000308,0.00013,0.000628,0.000101,0.000547,0.000566,0.000189,0.000288,0.000397,8.8e-05,0.000427,0.000219,0.000171,0.000231,7.7e-05,9.8e-05,8.2e-05,0.000177,0.000158,0.000247,0.000157,0.000122,5.7e-05,2.2e-05,2.4e-05,1.9e-05,1.8e-05,1e-05,0.00012,0.000305,0.000263,0.000386,0.000136,7.8e-05,4.2e-05,1.8e-05,3e-05,8.9e-05,3.8e-05,9e-06,3e-06,8e-06,8e-06,3e-06,3e-06,5e-06,7e-06,8e-06,6e-06,5e-06,3e-06,3e-06,5e-06,4e-06,2e-06,1e-06,6e-06,9e-06,5e-06,8e-06,7e-06,5e-06,4e-06,4e-06,2e-06,6e-06,5e-06,3e-06
1e-06,3e-06,4e-06,2e-06,1e-06,1e-06,3e-06,3e-06,2e-06,1e-06,2e-06,5e-06,3e-06,2e-06,1e-06,2e-06,2e-06,2e-06,3e-06,2e-06,1e-06,4e-06,1e-06,7e-06,6e-06,1.6e-05,0.00012,0.000269,8.3e-05,0.000132,4.4e-05,8.1e-05,5.9e-05,1.2e-05,2e-05,0.000242,0.000219,0.000128,8.3e-05,4.7e-05,0.000215,0.000282,0.000301,0.000367,0.000629,0.000433,0.000342,0.000467,0.000503,0.000231,0.000252,0.000348,0.000365,0.000168,0.000183,0.000475,0.000383,0.000283,0.000292,0.000131,0.000145,0.000326,0.000591,0.000248,0.000141,0.000132,0.000146,0.000157,0.000104,0.000249,7.4e-05,0.000266,0.000451,0.000213,0.000124,5.3e-05,1.6e-05,3.6e-05,2.1e-05,1.4e-05,8e-06,2e-05,0.000184,0.000306,0.000276,9.7e-05,2e-05,2.9e-05,5e-06,1.2e-05,6e-05,4.5e-05,3.1e-05,1.9e-05,7e-06,1.3e-05,1.3e-05,1.1e-05,1.3e-05,5e-06,2e-06,7e-06,5e-06,4e-06,5e-06,1.1e-05,1e-05,5e-06,5e-06,1e-06,8e-06,9e-06,1.3e-05,6e-06,4e-06,6e-06,2e-06,6e-06,3e-06,6e-06,4e-06
1e-06,3e-06,2e-06,3e-06,1e-06,3e-06,2e-06,2e-06,3e-06,2e-06,3e-06,2e-06,5e-06,1e-06,1e-06,3e-06,4e-06,4e-06,1e-06,2e-06,0,5e-06,3e-06,1.1e-05,4e-06,1.1e-05,0.00013,0.000153,0.00011,0.000275,0.000182,6.3e-05,4.7e-05,2.4e-05,3.5e-05,0.000149,0.000182,7.3e-05,4.9e-05,1.6e-05,0.000202,0.000181,0.000223,0.000139,0.000451,0.000387,0.000272,0.000349,0.000253,0.000213,0.000131,0.000126,0.000217,0.000212,0.000168,0.000132,0.000225,3.3e-05,0.00015,0.000144,0.000351,0.000219,0.00019,0.000206,0.000166,9.3e-05,0.000164,0.000298,0.000171,0.000266,0.000102,0.000316,0.000105,0.000375,0.000399,0.000187,0.000121,1.7e-05,1.8e-05,2e-05,1.5e-05,4.4e-05,0.000264,0.000283,0.000203,0.000128,8.1e-05,1.9e-05,2.2e-05,1.4e-05,4.8e-05,1.3e-05,1.7e-05,8e-06,1.4e-05,1.1e-05,5e-06,9e-06,7e-06,1.1e-05,2e-06,6e-06,7e-06,6e-06,7e-06,7e-06,6e-06,1e-05,3e-06,4e-06,6e-06,1.5e-05,1e-06,5e-06,1e-06,6e-06,3e-06,2e-06,5e-06,2e-06,3e-06
2e-06,4e-06,3e-06,5e-06,2e-06,4e-06,4e-06,1e-06,1e-06,1e-06,1e-06,2e-06,3e-06,4e-06,5e-06,3e-06,2e-06,5e-06,4e-06,1e-06,3e-06,4e-06,5e-06,3e-06,8e-06,1e-05,7.4e-05,0.000131,8.3e-05,0.000189,0.000182,5.8e-05,2.2e-05,9e-06,4.5e-05,0.000117,0.000129,8.8e-05,6.8e-05,5.4e-05,0.000201,0.000177,0.000189,0.000312,0.00036,3.9e-05,0.000554,0.00049,0.000523,5.9e-05,7.7e-05,0.000122,0.000324,0.00043,2e-04,0.000347,0.000145,0.000197,0.000295,0.000308,0.000234,0.000226,0.000146,0.000249,0.000235,0.000282,0.000242,1.6e-05,0.000172,0.000368,0.00028,0.000173,0.000278,0.000327,0.000187,0.000172,0.000101,5.5e-05,5.6e-05,2.5e-05,1.5e-05,6.4e-05,0.000322,0.000108,0.000107,7.2e-05,2.2e-05,2e-05,1.2e-05,5e-06,4.6e-05,1.6e-05,1.2e-05,1.4e-05,1.9e-05,4e-06,7e-06,8e-06,5e-06,8e-06,4e-06,5e-06,3e-06,7e-06,3e-06,1.2e-05,1.2e-05,5e-06,7e-06,1e-06,2e-06,1.1e-05,1e-05,3e-06,3e-06,8e-06,7e-06,3e-06,8e-06,8e-06,7e-06
1e-06,1e-06,5e-06,2e-06,5e-06,3e-06,6e-06,4e-06,4e-06,3e-06,3e-06,4e-06,4e-06,1e-06,4e-06,1e-06,3e-06,2e-06,5e-06,1e-06,5e-06,3e-06,2e-06,1e-05,4e-06,9e-06,8.2e-05,0.000256,0.000126,0.000205,2.8e-05,6.4e-05,1.2e-05,9e-06,4.6e-05,0.00021,0.000141,6.9e-05,4.4e-05,1.4e-05,0.000148,0.000217,0.000389,0.000354,0.000363,0.000341,0.000109,0.000295,0.000233,0.000259,0.000231,0.000196,0.000166,0.000261,5e-05,0.000373,0.000278,0.000189,0.00025,0.000116,0.000115,0.000207,0.000445,0.000321,5.3e-05,0.00014,0.00018,0.000206,0.000135,0.00031,0.000199,0.000209,0.000234,4.2e-05,6.5e-05,4.4e-05,2.5e-05,2.4e-05,2.1e-05,1.2e-05,5e-06,9.5e-05,0.000195,0.000113,0.000269,0.000108,9.4e-05,5.4e-05,1e-05,3e-06,6.6e-05,2.8e-05,3e-06,1.3e-05,5e-06,6e-06,4e-06,1.8e-05,4e-06,9e-06,4e-06,9e-06,7e-06,8e-06,4e-06,1.1e-05,6e-06,5e-06,3e-06,6e-06,4e-06,9e-06,1e-05,2e-06,3e-06,6e-06,5e-06,4e-06,1.1e-05,7e-06,4e-06
0,1e-06,4e-06,7e-06,5e-06,5e-06,3e-06,3e-06,9e-06,6e-06,7e-06,1e-05,4e-06,2e-06,4e-06,3e-06,6e-06,6e-06,4e-06,4e-06,6e-06,6e-06,8e-06,2.6e-05,1.9e-05,5e-06,0.00014,0.000333,0.00018,0.000287,9.2e-05,6.9e-05,4.7e-05,3.4e-05,6.9e-05,0.000243,9.2e-05,9.5e-05,5.6e-05,3.5e-05,0.000184,0.000159,0.000412,0.000254,0.000552,0.00027,0.000235,0.000135,0.000106,7.6e-05,8.4e-05,0.000285,0.000264,0.00018,0.000101,0.000203,0.000116,0.000243,5.3e-05,0.000138,0.000208,0.000216,0.000474,0.000134,0.000129,0.000218,0.000176,8.3e-05,0.000216,9.6e-05,0.000116,0.000111,0.000235,0.000308,0.000227,0.000124,5e-05,1.2e-05,2.1e-05,9e-06,7e-06,0.000113,0.00022,0.000231,0.000203,0.000201,6.3e-05,4.5e-05,1.8e-05,3e-06,8.3e-05,5.3e-05,3e-05,1.1e-05,9e-06,5e-06,6e-06,1.4e-05,8e-06,1.1e-05,5e-06,8e-06,8e-06,7e-06,5e-06,2e-06,1.1e-05,4e-06,4e-06,3e-06,4e-06,4e-06,4e-06,9e-06,5e-06,2e-06,1.2e-05,3e-06,6e-06,4e-06,8e-06
4e-06,3e-06,5e-06,5e-06,8e-06,5e-06,2e-06,3e-06,6e-06,5e-06,7e-06,6e-06,4e-06,6e-06,8e-06,6e-06,4e-06,7e-06,8e-06,1.4e-05,1.7e-05,1.6e-05,4e-06,4.4e-05,2.2e-05,1.4e-05,0.000126,0.000142,0.000123,0.000161,0.000134,6.1e-05,7.7e-05,3.6e-05,4.4e-05,0.000124,0.000157,8e-06,2.5e-05,1.2e-05,0.00019,0.000217,0.000259,0.000104,0.00033,0.000326,0.000311,0.000455,6.3e-05,0.00014,0.000211,0.000247,6.2e-05,0.000289,4.6e-05,0.000175,0.000153,0.000196,0.000169,0.000279,0.000199,0.000157,0.000242,0.000283,0.00014,3.5e-05,1e-05,6.1e-05,0.000159,5.1e-05,6.8e-05,4.4e-05,0.000115,0.000234,3.4e-05,3.2e-05,4.6e-05,6.2e-05,7.6e-05,3.6e-05,1.4e-05,0.000109,9.8e-05,0.000428,0.000398,0.000267,0.000146,7.3e-05,2.3e-05,2.1e-05,9.6e-05,5.8e-05,2.6e-05,4e-06,5e-06,2e-06,8e-06,1.4e-05,1e-05,9e-06,1.1e-05,7e-06,8e-06,4e-06,3e-06,4e-06,9e-06,1.7e-05,7e-06,8e-06,1e-06,2e-06,4e-06,8e-06,1.1e-05,9e-06,1.3e-05,2e-05,1e-05,3e-06,1.2e-05
4e-06,2e-06,1e-06,2e-06,6e-06,1e-06,3e-06,6e-06,8e-06,6e-06,2e-06,4e-06,2e-06,3e-06,5e-06,2e-06,7e-06,2e-06,3e-06,1.5e-05,5e-06,9e-06,1.4e-05,4e-05,2.9e-05,1.3e-05,6.1e-05,0.000311,0.000104,0.000199,0.000107,6.4e-05,5.4e-05,6.7e-05,8.1e-05,0.000109,8.3e-05,7.9e-05,7.6e-05,3.2e-05,0.000145,0.000168,0.000121,0.000276,0.000357,0.000341,0.000125,0.000312,0.00036,0.000126,0.00026,0.000407,0.000228,9.5e-05,7.3e-05,0.000119,7.2e-05,0.000323,0.000133,0.000297,0.000219,0.000188,0.000499,0.000317,6e-05,0.000207,0.00016,0.000115,9.5e-05,0.000136,0.000135,0.000124,0.000166,0.000123,0.00011,0.00014,4.9e-05,9.8e-05,4.4e-05,2.8e-05,6e-06,9.3e-05,0.000257,0.00069,0.000228,0.000285,0.000131,6.6e-05,7e-06,1.1e-05,7.4e-05,5.4e-05,2.2e-05,8e-06,1.7e-05,1.6e-05,0,4e-06,2.4e-05,1e-05,8e-06,1.7e-05,1.5e-05,8e-06,5e-06,6e-06,3e-06,1.6e-05,9e-06,9e-06,1.2e-05,5e-06,9e-06,7e-06,2e-06,2e-06,3e-06,1.4e-05,5e-06,2e-06,5e-06
4e-06,4e-06,4e-06,3e-06,5e-06,5e-06,2e-06,4e-06,2e-06,4e-06,4e-06,2e-06,4e-06,4e-06,3e-06,2e-06,4e-06,7e-06,7e-06,7e-06,7e-06,6e-06,3e-06,3e-05,5e-06,8e-06,4.3e-05,0.000263,0.00035,0.000129,0.000128,8.3e-05,4.6e-05,5.9e-05,7.1e-05,0.000151,2e-04,0.000168,0.000105,3.6e-05,0.000174,0.00017,0.00028,0.000354,0.000219,0.000271,0.000199,0.000154,0.000391,0.000133,0.000139,0.000212,0.00021,0.000278,7e-05,0.000216,6.8e-05,0.000224,0.000204,0.000268,0.000119,9.5e-05,0.000299,0.000279,0.000287,0.000189,6.2e-05,0.000197,0.00022,0.000207,0.000415,9.5e-05,0.000161,0.000256,0.000283,5.2e-05,0.000118,7.9e-05,8.5e-05,3.4e-05,1.3e-05,9.1e-05,0.000118,0.000737,0.000585,0.00051,0.000224,8.6e-05,2.6e-05,1.3e-05,5.6e-05,3.9e-05,3e-05,9e-06,2.7e-05,5e-06,4e-06,3e-06,2.7e-05,1.9e-05,2.3e-05,6e-06,1.1e-05,7e-06,7e-06,2e-06,0,1.2e-05,7e-06,8e-06,1e-05,8e-06,7e-06,6e-06,5e-06,6e-06,7e-06,1.1e-05,8e-06,2e-06,3e-06
2e-06,5e-06,2e-06,1e-06,5e-06,5e-06,4e-06,6e-06,4e-06,5e-06,5e-06,6e-06,5e-06,3e-06,4e-06,2e-06,2e-06,4e-06,4e-06,5e-06,2e-06,5e-06,4e-06,1.4e-05,2.1e-05,2.5e-05,7.1e-05,8.1e-05,0.000125,0.000125,4.8e-05,4.8e-05,5.7e-05,1.4e-05,7.2e-05,4.7e-05,0.00023,0.00013,2.9e-05,6e-05,0.000171,0.000275,0.000324,0.000237,0.000167,0.000392,0.000259,0.000183,0.000148,0.000162,7.3e-05,0.000196,0.000234,0.000301,0.000223,0.00022,6.7e-05,6.6e-05,0.000101,3.4e-05,0.000123,0.00013,0.000184,0.000293,0.000404,0.000528,0.000245,0.000141,0.000149,0.000184,0.000179,0.000302,9.7e-05,0.000202,0.000333,0.000298,0.000155,6.7e-05,6.4e-05,3.4e-05,1.3e-05,0.000111,0.000105,0.000749,0.000399,0.000144,0.000105,2.9e-05,2.1e-05,7e-06,3.7e-05,6e-06,1.2e-05,1e-05,1.5e-05,1.4e-05,7e-06,7e-06,2.4e-05,1e-05,1.9e-05,1.1e-05,7e-06,1e-05,5e-06,8e-06,3e-06,1e-05,1e-05,2e-06,8e-06,8e-06,1.1e-05,1e-06,9e-06,9e-06,3e-06,6e-06,2e-06,4e-06,9e-06
1e-06,2e-06,3e-06,1e-06,5e-06,1e-06,2e-06,2e-06,2e-06,2e-06,3e-06,2e-06,2e-06,3e-06,3e-06,4e-06,2e-06,3e-06,5e-06,3e-06,3e-06,4e-06,5e-06,6e-06,8e-06,1.3e-05,6e-05,9.5e-05,0.00017,0.000307,0.000137,1.4e-05,8e-06,9e-06,5.1e-05,0.000108,0.000105,7e-05,6.5e-05,8e-06,0.000119,0.000197,0.000182,0.000232,0.000424,0.000617,0.000344,9.1e-05,2.1e-05,6.7e-05,0.000197,0.000334,0.000192,0.000265,0.000128,0.000253,1e-04,0.000148,2.2e-05,0.000135,0.000163,0.000181,0.000175,0.000126,0.000196,0.000277,0.000119,0.000185,4.7e-05,0.000203,0.000203,8.2e-05,0.000112,0.000108,9.5e-05,7.4e-05,8.5e-05,2.7e-05,2.9e-05,1.4e-05,1.7e-05,0.000119,0.000139,0.00052,0.00046,0.000191,8e-05,9e-06,2e-05,1.3e-05,2.2e-05,2.2e-05,9e-06,7e-06,1e-05,8e-06,7e-06,3e-06,1e-05,8e-06,7e-06,8e-06,1.2e-05,4e-06,2e-06,6e-06,8e-06,7e-06,1e-06,4e-06,4e-06,4e-06,2e-06,4e-06,7e-06,2e-06,5e-06,4e-06,3e-06,5e-06,3e-06
1e-06,1e-06,2e-06,1e-06,2e-06,2e-06,1e-06,2e-06,2e-06,2e-06,0,2e-06,1e-06,1e-06,1e-06,2e-06,0,3e-06,2e-06,2e-06,2e-06,1e-06,3e-06,3e-06,6e-06,7e-06,4.1e-05,0.00012,0.000188,0.000216,6.3e-05,3e-05,2e-05,5e-06,4.5e-05,0.000118,5.9e-05,3.9e-05,6e-06,2.8e-05,0.000143,0.000181,9.9e-05,0.000198,0.000329,0.000381,0.000153,0.000268,0.00012,0.000143,0.000107,0.00021,0.000163,0.000171,0.000108,0.000159,7.6e-05,0.00011,9.2e-05,0.00014,2e-04,0.000185,1.4e-05,0.000203,0.000173,0.000179,4.8e-05,0.000171,0.000151,3.7e-05,4e-05,6.4e-05,4.2e-05,7.2e-05,1.2e-05,6.6e-05,3.7e-05,2e-06,1e-05,8e-06,1.9e-05,9.4e-05,0.000174,0.000213,0.000128,2.2e-05,1.3e-05,1.4e-05,3e-06,5e-06,1.7e-05,2e-05,1e-05,8e-06,7e-06,3e-06,2e-06,1e-06,4e-06,1e-06,3e-06,5e-06,5e-06,5e-06,4e-06,2e-06,3e-06,5e-06,4e-06,3e-06,1e-06,3e-06,1e-06,2e-06,4e-06,1e-06,3e-06,2e-06,2e-06,4e-06,2e-06
1e-06,2e-06,1e-06,1e-06,2e-06,2e-06,0,0,1e-06,1e-06,1e-06,2e-06,0,1e-06,1e-06,1e-06,1e-06,2e-06,1e-06,2e-06,1e-06,1e-06,3e-06,0,4e-06,6e-06,2.5e-05,0.000102,3e-05,0.000163,5.1e-05,1.5e-05,5e-06,9e-06,3.5e-05,0.00011,4.3e-05,3.2e-05,6e-06,2.9e-05,0.000136,0.00023,0.000103,0.000195,0.000408,0.000265,0.000169,0.000141,0.000168,0.000133,0.000255,0.000168,9e-05,0.000278,2.7e-05,0.000119,1.3e-05,0.000111,0.00011,8e-05,0.00015,8.7e-05,0.000125,0.000214,9.1e-05,0.000144,9e-06,0.000145,0.000139,5.9e-05,3.9e-05,1.9e-05,8.6e-05,8.7e-05,2.9e-05,2.2e-05,4.2e-05,1.1e-05,8e-06,5e-06,8e-06,4e-05,0.000151,6.7e-05,0.00014,1.5e-05,7e-06,1.5e-05,8e-06,9e-06,1.6e-05,6e-06,4e-06,2e-06,7e-06,2e-06,2e-06,1e-06,2e-06,2e-06,1e-06,5e-06,4e-06,4e-06,2e-06,2e-06,3e-06,4e-06,4e-06,4e-06,1e-06,2e-06,1e-06,2e-06,3e-06,0,1e-06,3e-06,1e-06,2e-06,2e-06
1e-06,1e-06,1e-06,1e-06,2e-06,1e-06,1e-06,0,1e-06,1e-06,1e-06,2e-06,0,0,0,1e-06,1e-06,2e-06,2e-06,2e-06,1e-06,0,2e-06,2e-06,2e-06,6e-06,1.9e-05,9e-05,8.1e-05,0.000186,5.5e-05,5e-06,7e-06,2e-06,2.2e-05,0.00011,2.7e-05,2.4e-05,1e-06,2.6e-05,0.000126,0.00019,6.7e-05,0.000193,0.000336,0.00022,6.2e-05,1.5e-05,9.3e-05,0.000135,0.000148,0.000137,0.00022,0.000189,6.1e-05,0.00016,7.6e-05,0.000108,0.000148,0.000195,0.000184,3e-05,9.8e-05,2e-04,6.6e-05,0.000173,2.6e-05,0.000137,0.000147,6.6e-05,3.8e-05,2e-06,7.3e-05,5.9e-05,2.8e-05,1.3e-05,4.4e-05,1e-06,9e-06,3e-06,7e-06,2.1e-05,0.000142,5.3e-05,0.000122,2.9e-05,2e-06,4e-06,7e-06,6e-06,5e-06,8e-06,2e-06,4e-06,6e-06,1e-06,1e-06,0,1e-06,1e-06,1e-06,4e-06,3e-06,3e-06,2e-06,1e-06,2e-06,3e-06,3e-06,3e-06,0,2e-06,2e-06,1e-06,2e-06,0,1e-06,2e-06,1e-06,2e-06,1e-06
