-0.000151,-7.8e-05,7.3e-05,2.2e-05,9.2e-05,9.8e-05,2e-06,4e-05,-3e-05,-0.000146,0.00011,-0.000139,-0.000158,-0.000102,-0.00025,-0.000213,-0.000145,-0.000233,-0.000343,-0.000349,-0.000152,-0.000273,0.000157,-0.000227,-0.000373,-0.000207,-0.000237,-0.000203,-0.000158,-0.000343,-0.000222,-0.000322,-4.2e-05,-0.000168,-0.000131,-1.3e-05,-0.000561,-0.000459,-0.000347,-0.000178,-0.000247,-0.000287,6.7e-05,-2.4e-05,-5.7e-05,-0.000252,-0.000367,-0.000349,-0.000336,-0.000233,-0.000278,-0.000211,8.3e-05,-0.000205,-0.000108,-7.7e-05,-3e-06,-0.000288,-4.7e-05,-0.000103,-0.000126,-2.1e-05,-0.00014,-0.000306,-6.8e-05,0.000193,8e-06,-0.000126,-0.000253,2.2e-05,-2e-06,-7.7e-05,-0.00013,9e-05,-2.1e-05,5.2e-05,7.9e-05,0.000109,-0.00022,-0.000165,-0.000107,-0.000198,-0.000103,-0.000167,-0.000134,-0.000199,-0.000129,-7e-05,0.000145,7e-06,5.7e-05,-0.000125,4.6e-05,-8.8e-05,4.9e-05,-8e-05,0.000148,3.6e-05,-9.9e-05,-6.1e-05,-7.4e-05,-2.8e-05,-8.4e-05,-6.3e-05,0.000229,0.000119,-1.4e-05,4.9e-05,-6.8e-05,1.3e-05,0.000263,2.7e-05,3.7e-05,-4.9e-05,0.000286,0.000128,3.3e-05,-4e-06,2.6e-05,-1.1e-05,-0.000106
-6.9e-05,-0.000103,-8.1e-05,-0.00026,1.7e-05,-0.000231,-0.000117,-4.6e-05,-0.000172,0.000217,-6e-05,0.000204,6.1e-05,0.000117,7.3e-05,0.000206,0.000126,8.2e-05,-0.000108,0.000121,0.00014,-0.000181,-0.000156,-1.2e-05,0.000157,0.000135,-1.8e-05,3.7e-05,-9.9e-05,2.3e-05,0.000166,0.000285,0.000116,-0.000184,-7.9e-05,5.4e-05,0.000154,0.000139,2.4e-05,0.000198,4.4e-05,0.000243,-0.000331,-0.000126,-0.000207,2.4e-05,-2.1e-05,0.000127,0.00021,0.000246,-5e-05,-1.3e-05,-9.8e-05,8.2e-05,-9.6e-05,-0.000171,-0.000264,0.000142,-0.000141,-8.7e-05,-5.1e-05,-0.000124,-1.4e-05,3.2e-05,4.6e-05,-8e-05,-0.000112,-3.6e-05,0.000113,-5.5e-05,-0.000118,-0.000168,-0.000204,-0.000231,-0.000179,-0.000382,-0.000133,0.000155,5.1e-05,0.00011,-4.2e-05,-4.9e-05,-7.6e-05,-0.000106,-5.1e-05,-2.2e-05,-5.8e-05,-0.000142,-0.000179,-4.9e-05,-8.1e-05,4.4e-05,5.8e-05,-2.8e-05,4.4e-05,-6.3e-05,7.9e-05,-0.000152,-0.00011,-0.000136,-0.000109,2.4e-05,-8.3e-05,-5.5e-05,-0.000195,-0.000283,-0.000179,5.4e-05,8.4e-05,-8e-05,-0.000154,-0.000101,-0.000258,-0.000101,-0.000115,-9.3e-05,-0.000244,-4.6e-05,-0.000209,-0.000242,-8.5e-05
3.8e-05,-5.3e-05,-0.00012,3.9e-05,-1.4e-05,9.3e-05,8e-05,0.000198,-8.3e-05,-0.000166,-0.00035,-0.000445,-0.000333,-0.000449,-0.000334,-0.000443,-0.000298,-0.000359,-9.5e-05,-0.000453,-0.000268,9.6e-05,-0.000344,-0.000187,-0.000225,-8.9e-05,-0.000213,-0.000258,-0.00012,-0.00014,-0.00023,-0.00036,-0.000115,-0.000253,-0.000209,-0.000163,-0.000169,-0.000217,-0.000172,-0.00017,-2.5e-05,-0.000303,-0.000387,-0.000322,-1.4e-05,-0.000101,-0.000274,-0.000191,-0.000309,-0.00012,5e-06,-9.4e-05,-8.8e-05,-8.4e-05,-0.000189,-0.000126,-0.000157,-0.000227,-0.000253,-0.000221,-7.5e-05,-3.9e-05,-3.6e-05,-0.000252,-0.000181,-0.000131,4.7e-05,-0.000164,-0.00015,-0.000175,-0.000105,-2.9e-05,0.000104,2.7e-05,6e-06,3.7e-05,-6.6e-05,-0.000234,-0.000208,-0.000223,-0.000234,-0.000183,-0.000161,4.6e-05,-0.000141,-6.7e-05,4e-06,-0.000103,-0.000215,3.7e-05,-0.000122,-0.000263,-0.000203,-0.000173,7.3e-05,-0.000135,-0.000153,-9e-05,-0.000251,-3.2e-05,-6.2e-05,-5.9e-05,-0.000158,-0.000204,-0.000119,9e-05,5.7e-05,-0.000114,-0.00022,-0.000181,-0.000277,-0.000224,-6.5e-05,2.2e-05,-0.000239,-5.9e-05,0.000165,-0.000178,-0.000123,-0.000134,3.1e-05
-7e-05,-0.000119,-4.6e-05,9.7e-05,-0.00013,-2.2e-05,-4.1e-05,-0.000183,3e-06,0.000291,0.000413,0.000181,0.000169,0.000264,0.000137,0.000251,7.9e-05,4.7e-05,7e-05,0.000173,0.000226,6.6e-05,0.000251,0.00041,0.000284,0.000185,3.8e-05,9.7e-05,0.000197,0.000293,0.000119,0.000312,-0.000106,-7e-06,6.5e-05,-5.7e-05,0.000164,0.00029,0.000197,-5.9e-05,-4.9e-05,8.4e-05,0.000231,0.000112,0.000162,0.000129,0.000191,0.000122,0.000112,2.4e-05,7.1e-05,0.000211,7.1e-05,-2.3e-05,1e-04,2.2e-05,-4.8e-05,-8.9e-05,4.6e-05,0.000254,9.4e-05,1e-05,-2e-05,0.000236,6.5e-05,9.3e-05,9.5e-05,1.2e-05,6.6e-05,-2e-05,4.9e-05,0.00016,-0.000128,-0.000133,-5.3e-05,7.5e-05,-9.1e-05,-5.1e-05,0.00014,7.5e-05,0.000211,0.00026,6.3e-05,-5e-05,1e-05,4.2e-05,-0.000282,-0.000157,4.2e-05,5.5e-05,2.2e-05,3.2e-05,-3e-05,-9.5e-05,-0.000132,-1e-05,-0.000195,-0.000314,8.3e-05,5e-05,3e-06,3e-06,0.000306,0.000326,0.000122,9.5e-05,9e-06,-1.6e-05,-2.8e-05,0.000137,-3.5e-05,0.000104,0.000149,7e-05,-0.000246,-0.000143,0.000129,6.8e-05,1.2e-05,0.000274,-0.000121
6.5e-05,4.2e-05,6.3e-05,-5.8e-05,-1.4e-05,5e-05,5.6e-05,-4.6e-05,4.9e-05,-8.1e-05,-0.000208,-0.000198,-2.7e-05,-2.8e-05,-0.000105,-7.3e-05,0.000103,-1.9e-05,-3.7e-05,-0.000115,-0.000122,-0.000115,-0.000193,-0.000137,-8.9e-05,-0.000108,-0.000105,-6e-05,-9.6e-05,-0.000245,-0.000251,-0.000135,0.000146,0.000224,0.000168,-6.1e-05,-0.000229,-0.000271,-3.6e-05,-0.000102,-0.000118,2.7e-05,1e-04,-9.6e-05,-2.9e-05,-3.3e-05,-5e-05,-0.000255,-0.000138,4e-06,9.3e-05,-1e-06,1.4e-05,-1.3e-05,1.2e-05,0.00015,0.000107,-6.8e-05,0.000145,8.5e-05,6e-06,4e-05,2.5e-05,-9.4e-05,-7.4e-05,-3.5e-05,-1.6e-05,1.3e-05,-1.2e-05,5.3e-05,-0.000158,-0.000172,2.6e-05,-5.2e-05,-6.5e-05,4.4e-05,0.000138,0.000144,-2.7e-05,-5.5e-05,-6.7e-05,-0.000256,-0.000104,-8.3e-05,0.000115,3.6e-05,0.000194,3.7e-05,0.000124,-5.2e-05,0.000123,3.5e-05,1.6e-05,0.000104,3.6e-05,2.6e-05,-2.4e-05,6.9e-05,4.3e-05,-6.6e-05,4.4e-05,-4.7e-05,1.2e-05,-8.2e-05,-0.000124,-0.000265,-0.000145,-0.000102,-5.2e-05,3e-05,2.9e-05,1e-06,2.9e-05,0.000106,0.00012,5.1e-05,2.8e-05,5.1e-05,2.1e-05,-2e-06,4e-05
2.8e-05,1.5e-05,6.2e-05,-4.8e-05,-4.2e-05,-8.5e-05,-5.6e-05,1.1e-05,7.5e-05,0.000124,4.9e-05,2e-06,-7.2e-05,8.6e-05,0.000217,0.000117,-9e-06,3.8e-05,0.000242,0.000282,0.000126,-7.4e-05,-0.000119,-0.000108,-7.2e-05,8.5e-05,3e-06,0.000231,9.9e-05,1.1e-05,5.8e-05,0.000139,6.6e-05,-0.000117,3e-06,2.8e-05,-3e-06,0.00014,5.3e-05,0.000107,0.000141,-2.1e-05,-0.000108,2e-04,5.8e-05,3.3e-05,0.000102,0.000254,7.1e-05,-1.9e-05,-3.8e-05,-0.000107,-8.6e-05,-3.1e-05,-5.3e-05,5e-06,7.8e-05,0.000254,-3.4e-05,-9.7e-05,-8.6e-05,-6.6e-05,-5.8e-05,5.1e-05,1.7e-05,4.4e-05,-0.000134,-0.000138,3.5e-05,-8.4e-05,8e-06,-4.2e-05,6.5e-05,4e-05,2.6e-05,-3.1e-05,1.9e-05,-4.5e-05,0.000121,-1.6e-05,-8.6e-05,3e-06,0.000115,4.4e-05,-2.6e-05,-2.9e-05,-4e-06,8.8e-05,1e-05,-3.1e-05,-6.4e-05,1.2e-05,-2.3e-05,0.000133,8.6e-05,-0.00014,-9.2e-05,4.9e-05,5.9e-05,0.000137,-3.5e-05,0.000151,5.8e-05,-0.000129,4.1e-05,-6.5e-05,2e-05,3e-05,-3.9e-05,-5.7e-05,3.9e-05,-1.5e-05,5.6e-05,-0.000116,-0.000185,-2e-06,-6.9e-05,-0.000206,0.000128,-5.4e-05,-4.1e-05
-6.7e-05,3.4e-05,-7e-06,-7e-06,4.7e-05,-4.9e-05,4.1e-05,1.2e-05,-0.000111,6.1e-05,-2.5e-05,-7.6e-05,0.000149,-9.2e-05,-0.000124,5.1e-05,5.5e-05,2.9e-05,-0.000195,-0.000185,-6.1e-05,0.000122,8.9e-05,-2.2e-05,-6.2e-05,-0.00014,3e-06,-9.4e-05,-0.000135,0.000128,2.3e-05,-8.6e-05,1.1e-05,4.6e-05,-6.5e-05,-0.000131,-0.000122,-3.9e-05,-0.000233,-0.000125,-8e-06,2.3e-05,1.5e-05,-2.2e-05,-1e-05,-0.000181,-6.9e-05,-0.000106,-6.7e-05,-6.5e-05,7.1e-05,5.2e-05,5.2e-05,-4.5e-05,8e-06,-0.000111,-8.2e-05,-4.2e-05,-3.8e-05,-0.000132,9.6e-05,2.1e-05,-4e-06,-2.9e-05,-3.5e-05,5.8e-05,-5e-06,7.4e-05,-3.7e-05,-1.4e-05,0.000134,5.9e-05,3.8e-05,6e-06,0.00012,8.3e-05,-9.6e-05,-3.9e-05,-0.000101,-2.1e-05,2e-05,-2e-05,-2e-06,-1.6e-05,-4.1e-05,4e-06,-5.2e-05,-1.4e-05,1.8e-05,-3.6e-05,6.6e-05,1.9e-05,-0.000113,-9e-06,-1e-05,0.000142,0.000216,0.000119,3.6e-05,3.3e-05,-6.2e-05,3.2e-05,-8.2e-05,-1.8e-05,5e-05,6.8e-05,0.000172,9.5e-05,0.000107,-2.5e-05,-8.1e-05,-7.4e-05,-6.9e-05,-4.4e-05,4.3e-05,0.000135,3.8e-05,3.2e-05,-6.2e-05,-1.8e-05,-7.5e-05
7e-06,-2.9e-05,-0.000123,2.3e-05,6e-06,6.3e-05,7.4e-05,2.4e-05,-4.3e-05,-0.000146,-1.9e-05,7.8e-05,-6.9e-05,-0.000107,-1.9e-05,-4.6e-05,-0.000125,-0.000144,-0.000122,2e-06,-6.5e-05,-9.8e-05,3.4e-05,4.5e-05,6.1e-05,0.000131,6.6e-05,-4e-06,9.2e-05,-2.8e-05,3.2e-05,9.2e-05,-0.00011,-9.8e-05,-9.1e-05,-2.2e-05,0.000124,-4e-06,0.000196,5.9e-05,3.4e-05,6e-06,-0.000117,-5.5e-05,-1.2e-05,8.9e-05,-1e-06,2.7e-05,2e-05,-1.2e-05,-3.3e-05,7.6e-05,6.2e-05,5.1e-05,-2.5e-05,4.2e-05,-2.9e-05,-5.4e-05,-7.3e-05,6e-06,7e-06,-1e-05,2e-06,-3.1e-05,9e-06,3.7e-05,2e-05,4.7e-05,-1e-04,-3.3e-05,4e-06,3.4e-05,-7.9e-05,5e-06,-7.3e-05,-7.4e-05,1.7e-05,-0.000101,4.1e-05,0.000122,6.1e-05,0.000124,-2.3e-05,4.9e-05,5.2e-05,-5.8e-05,-2.8e-05,0.000111,1.9e-05,-2.7e-05,-0.000105,-0.000121,8e-05,-7e-05,0,-1.4e-05,-0.000103,3e-06,-8.8e-05,-0.000104,6.5e-05,-2.7e-05,-3.9e-05,6.2e-05,4e-06,5.1e-05,-6.7e-05,-5.5e-05,3e-06,-3e-06,-8.3e-05,-1e-05,-5e-05,-1.5e-05,7.6e-05,-2.9e-05,-0.00013,-3.3e-05,-8.7e-05,3.8e-05,-5.4e-05
-4.4e-05,-4.9e-05,2e-05,1.4e-05,-1.8e-05,-3.2e-05,-3.3e-05,-1.4e-05,-5e-05,-0.000123,-7.5e-05,-0.000118,-3.2e-05,9.9e-05,3e-05,-7.9e-05,6.3e-05,5.2e-05,1.3e-05,2.5e-05,-4.8e-05,4e-05,-0.000121,-0.00012,-7.3e-05,-5.6e-05,-3.8e-05,-4.1e-05,1.5e-05,-0.000106,-9.7e-05,-0.000123,0.000111,6.9e-05,9.1e-05,4e-05,2.9e-05,-4e-06,-9.8e-05,-4.4e-05,-9e-06,-8.6e-05,0.000128,0,-8.1e-05,-2.1e-05,-0.000102,-7.4e-05,-0.000122,-1.8e-05,9e-06,-0.000126,-1.9e-05,-3.1e-05,-5.4e-05,6.5e-05,-4.4e-05,-2e-06,-4.9e-05,2.4e-05,-1.2e-05,-3.7e-05,6.7e-05,1.1e-05,-3.8e-05,-7.6e-05,2.7e-05,-1.2e-05,6e-05,7.7e-05,-1.2e-05,-6e-06,8.2e-05,5.3e-05,2.2e-05,-4.3e-05,5e-06,-7.5e-05,-5e-06,-8.9e-05,-4.2e-05,-0.000115,2.2e-05,2.4e-05,-4.3e-05,2.8e-05,6.5e-05,-0.000136,-5.4e-05,-6.7e-05,-2.9e-05,6.2e-05,6e-06,-2.4e-05,-6.7e-05,8e-06,-2.7e-05,-4.5e-05,-9e-05,-6.3e-05,-6.4e-05,-3.6e-05,-7.5e-05,-2.2e-05,-0.000119,-3.5e-05,1.2e-05,-1.1e-05,-2.7e-05,-9e-06,3.9e-05,1.2e-05,3.9e-05,3.2e-05,8e-06,-8.7e-05,-8e-06,-1.7e-05,-7.1e-05,7e-06,0.000116
3.2e-05,0.000119,2.1e-05,1.6e-05,3e-06,3e-05,6.4e-05,-9e-06,-6.3e-05,9.8e-05,-6e-06,2.4e-05,-0.000119,-2.2e-05,2.9e-05,-4.1e-05,-2.4e-05,1.9e-05,7.2e-05,7.5e-05,0.000138,-3.1e-05,2.3e-05,4.7e-05,-5e-06,-1.1e-05,3.1e-05,3.4e-05,4.5e-05,4.4e-05,3.9e-05,-5.1e-05,2.5e-05,4e-06,-2.1e-05,5.7e-05,3.4e-05,2.8e-05,1.3e-05,8e-06,2e-06,2.8e-05,-4.9e-05,3e-06,0.000125,2.5e-05,6.8e-05,6.2e-05,6.3e-05,2e-06,-2.5e-05,3.7e-05,-1.8e-05,-1.9e-05,4e-06,-4.5e-05,8e-05,1.2e-05,1.9e-05,1.1e-05,-3.1e-05,-3.7e-05,-2e-06,-5e-06,1.3e-05,-4.1e-05,-2e-05,2.1e-05,-2e-06,-5.7e-05,-5e-06,2.3e-05,5e-06,-6.7e-05,-2e-06,7.6e-05,1.1e-05,5.6e-05,-5e-06,-3e-05,6.8e-05,4.5e-05,6e-06,-2e-05,-2.2e-05,2.4e-05,-1.1e-05,4e-05,1.2e-05,6.6e-05,-3.3e-05,-1.1e-05,9.6e-05,1.9e-05,-3e-06,2.7e-05,-5.4e-05,2.8e-05,6.4e-05,6.4e-05,6e-05,-2.3e-05,5.3e-05,-1e-06,-4e-05,2e-06,1.6e-05,-1.9e-05,-4.6e-05,3.9e-05,2.1e-05,1.6e-05,5.4e-05,0,-2.5e-05,3.3e-05,8e-06,2e-05,5.1e-05,7.1e-05,3e-05
2.1e-05,-4.7e-05,-2.4e-05,-2.6e-05,6.6e-05,3.8e-05,-1.2e-05,-4.2e-05,8e-06,-1.1e-05,-7.1e-05,8e-06,6.5e-05,4e-06,-8e-06,0.000117,6.5e-05,2.8e-05,-1.5e-05,-2e-05,-3.4e-05,-3.8e-05,0,1.5e-05,-2.3e-05,-2e-05,-2.5e-05,-7.5e-05,-6e-05,2.5e-05,1.9e-05,-3.7e-05,-6e-06,-1e-05,-4.7e-05,-2e-05,-5e-05,2.3e-05,1.2e-05,1.1e-05,-6.3e-05,3.7e-05,1e-06,5.3e-05,-2.6e-05,-6.5e-05,9e-06,-2e-06,-3.3e-05,-3e-05,9.3e-05,-5.4e-05,4.3e-05,4.8e-05,2.1e-05,3.9e-05,-4e-06,2.7e-05,8.4e-05,-4e-06,1.9e-05,3.9e-05,-1.1e-05,2.3e-05,1e-06,-2e-05,-1.6e-05,-1e-05,-2.2e-05,2e-05,2.2e-05,-7e-06,-4.2e-05,-2.6e-05,-3.4e-05,4.2e-05,-2.3e-05,2.5e-05,1.7e-05,1.1e-05,-1e-05,1.7e-05,-4.6e-05,-7.9e-05,2e-06,1e-06,-2.2e-05,1.5e-05,-1.9e-05,3.2e-05,-7e-06,-3e-06,-6.4e-05,-7.1e-05,-1.4e-05,-9e-05,1e-05,-3.9e-05,-5e-06,3.9e-05,2.1e-05,7.1e-05,-1.5e-05,-3.7e-05,6.6e-05,-2.6e-05,-3.9e-05,-1.3e-05,4.6e-05,3.5e-05,-2e-05,2e-06,-4.7e-05,-2e-06,3.7e-05,7e-06,-3.2e-05,-3.7e-05,-5e-06,-3.5e-05,-5.5e-05
1.3e-05,1.5e-05,3.3e-05,-4.4e-05,-6e-06,-1.6e-05,-4e-05,1e-06,1.2e-05,-2e-05,-3.1e-05,-3e-05,2e-05,-1.2e-05,-9e-06,-4.4e-05,-2.5e-05,-3.6e-05,5e-06,2.5e-05,-1.8e-05,4.8e-05,-1.5e-05,3e-06,-2.1e-05,-1.3e-05,6.6e-05,2e-05,-6.3e-05,-2.6e-05,-3.9e-05,3e-05,1e-05,-1.4e-05,5.6e-05,-4.3e-05,2.1e-05,5.4e-05,2.7e-05,2.2e-05,3e-06,5e-06,2.1e-05,-6.7e-05,-6.1e-05,2e-05,-3.3e-05,-1.1e-05,-1e-06,3e-05,-4.3e-05,-2.2e-05,-2.1e-05,-5.4e-05,4.8e-05,4e-06,-4.1e-05,-1.3e-05,-1.4e-05,-3e-06,4.3e-05,-3e-06,1.1e-05,-3e-05,-1.4e-05,4.3e-05,-3.3e-05,1e-06,1.3e-05,-1.4e-05,1.9e-05,-4.2e-05,-4.6e-05,5.2e-05,2.4e-05,-1.8e-05,2.6e-05,-1.7e-05,-2.7e-05,5.8e-05,1.1e-05,-2.2e-05,7e-06,4.6e-05,3e-06,-1e-05,-9e-06,-3e-06,1.8e-05,9e-06,-2.8e-05,1.4e-05,-2.5e-05,-1.4e-05,2.4e-05,-4e-06,-4e-06,3.4e-05,4.6e-05,-1.9e-05,-3.9e-05,-5.2e-05,3e-05,-1e-05,-1e-05,0,-3.1e-05,-1e-06,-5e-06,-7e-06,-1e-05,-2.3e-05,-4.8e-05,-1.2e-05,1.8e-05,-1.9e-05,-2.9e-05,-1.9e-05,-5.8e-05,-4.2e-05,-7e-06
5e-06,-3e-06,-1.2e-05,4.6e-05,-1.4e-05,-2e-05,-1.4e-05,3.5e-05,1.4e-05,-2e-06,3.7e-05,2.6e-05,-3e-06,-3e-06,-8e-06,0,1.8e-05,-1e-06,2.4e-05,-6.1e-05,-4e-06,7e-06,6e-06,-1.6e-05,3e-05,3e-05,-1.9e-05,2.6e-05,1.4e-05,2.1e-05,2.7e-05,2.1e-05,1.3e-05,1e-06,-3.6e-05,5e-06,1.9e-05,-2.1e-05,-3.1e-05,-4.1e-05,4e-06,8e-06,-2.9e-05,3.6e-05,-2.4e-05,-2.7e-05,2e-06,1.3e-05,7.5e-05,-1.9e-05,1.1e-05,2e-05,1.2e-05,2e-05,-3e-06,-1e-05,-2e-06,-1.2e-05,-8e-06,-1.5e-05,-1e-06,4e-06,1.3e-05,-2.9e-05,1.3e-05,-2.3e-05,-3e-06,-4e-06,2.6e-05,-3e-06,-9e-06,0,3.7e-05,-1.2e-05,-1.3e-05,-2e-06,-2e-05,-2e-05,1e-06,5.6e-05,-2.6e-05,4e-05,-1.5e-05,-9e-06,1e-06,-1.2e-05,4e-06,-2.5e-05,1e-06,-2.5e-05,-1.3e-05,1.7e-05,1.1e-05,-4e-06,-3.5e-05,1.4e-05,-2.2e-05,-1.5e-05,1.2e-05,0,-1.1e-05,-3.7e-05,-4.6e-05,4e-06,-4.7e-05,5e-06,-3e-06,-1e-06,-2.4e-05,-5e-06,6e-06,1.7e-05,-2e-06,-2e-06,1.7e-05,-3e-06,-2.4e-05,2e-06,4.1e-05,-7e-06,5.4e-05
-1e-05,-1.1e-05,2e-05,-2e-06,-1.4e-05,2e-06,-1.3e-05,-3.1e-05,-3e-06,-1e-05,4e-05,2e-06,-3.7e-05,-5.8e-05,-4e-06,-3e-06,-2.5e-05,7e-06,-2.2e-05,7e-06,-2e-06,9e-06,1.9e-05,4e-06,1.2e-05,-4e-05,8e-06,1.1e-05,1.5e-05,-4.2e-05,6e-06,-1.9e-05,-4e-05,1e-05,1.7e-05,7e-06,2.2e-05,-2.1e-05,-5e-06,3e-05,4e-06,7e-06,1e-06,-2.8e-05,4e-06,-7e-06,3.5e-05,-4e-06,-3.6e-05,-1e-06,-4.5e-05,-1.3e-05,-1.9e-05,-9e-06,-1.6e-05,1e-06,4.8e-05,1e-05,-1.3e-05,-9e-06,-2.8e-05,-2.8e-05,3e-06,9e-06,-9e-06,-1.6e-05,0,1e-05,-6e-06,3.9e-05,-2.9e-05,-1e-06,-1e-06,-7e-06,1e-06,-7e-06,-1e-05,1.2e-05,-1.6e-05,2e-06,-1e-06,-3.9e-05,2.5e-05,5e-06,1.9e-05,-2e-06,1.8e-05,2e-06,-1.9e-05,-1.8e-05,6e-06,-8e-06,9e-06,2.5e-05,-1e-06,-6e-06,3.3e-05,1.2e-05,-4e-06,-3.5e-05,1e-05,4.5e-05,2.4e-05,3.1e-05,3.9e-05,4.4e-05,-1e-06,8e-06,2.9e-05,-2.8e-05,2.6e-05,-5e-06,2.9e-05,2.2e-05,-3e-06,1.3e-05,5.5e-05,1.9e-05,3.1e-05,9e-06,1.4e-05
-1e-06,-5e-06,-2.2e-05,8e-06,1.3e-05,3e-06,1e-05,-1.7e-05,-1.2e-05,0,-2.4e-05,-3e-06,4e-05,5e-06,-1e-06,7e-06,-5e-06,1e-06,8e-06,1e-06,0,-4.4e-05,5e-06,-1.5e-05,7e-06,4e-06,5e-06,-6e-06,1.1e-05,2.2e-05,-2e-05,3.6e-05,-2.5e-05,-5e-06,-3e-06,3.2e-05,-9e-06,-1e-05,2.9e-05,-2e-05,-3.3e-05,-2.8e-05,2.9e-05,2.2e-05,2.1e-05,2.6e-05,-5e-06,1.7e-05,-3.6e-05,7e-06,4e-06,3e-06,3e-06,-8e-06,5e-06,2.1e-05,-2e-05,-3e-06,-1.4e-05,2.1e-05,-1.9e-05,1.6e-05,-7e-06,9e-06,1e-05,1.4e-05,2.9e-05,-1e-06,-1.3e-05,0,1.1e-05,1.1e-05,-4e-06,3e-06,7e-06,-2.6e-05,0,1.1e-05,1e-06,-3e-05,1.9e-05,1.3e-05,-2.9e-05,-1.4e-05,-7e-06,-4e-06,-1.3e-05,-3e-06,1.6e-05,-4e-06,3.3e-05,7e-06,1.6e-05,9e-06,3e-06,1.4e-05,2.7e-05,-2.4e-05,0,2e-06,9e-06,-2.1e-05,-4e-06,-4e-06,1.9e-05,-1e-05,2e-06,6e-06,-6e-06,-3e-06,-9e-06,-1e-06,7e-06,0,-1e-05,1.4e-05,3.9e-05,2e-06,6e-06,8e-06,-2.3e-05
2e-06,5e-06,1.4e-05,-4e-06,5e-06,-4e-06,5e-06,1.9e-05,1e-06,-7e-06,-3e-06,1.1e-05,-1.5e-05,1e-05,5e-06,1.9e-05,-3e-06,-1e-06,-2.1e-05,-1.6e-05,-1.2e-05,1.8e-05,2.2e-05,7e-06,-3e-06,1.1e-05,1e-05,1.4e-05,2.6e-05,2.8e-05,1.4e-05,0,-6e-06,8e-06,4e-06,-2e-06,-5e-06,-3e-06,-4.2e-05,1.1e-05,2e-06,-6e-06,-2.6e-05,-1.4e-05,-1.3e-05,-5e-06,-2e-06,-1.4e-05,3.4e-05,-3e-06,-2.5e-05,-1e-05,-1.4e-05,-4e-06,5e-06,3e-06,5e-06,1e-06,5e-06,3e-06,2.3e-05,-3e-06,1.8e-05,0,-3e-06,3e-06,7e-06,5e-06,-2e-06,-2e-06,5e-06,4e-06,0,2.1e-05,-9e-06,1e-06,1e-05,-2.1e-05,-7e-06,1.4e-05,8e-06,-6e-06,1.4e-05,6e-06,-7e-06,-3e-06,1.3e-05,7e-06,-4e-06,-2e-06,6e-06,1e-06,-1.6e-05,5e-06,1.3e-05,-5e-06,7e-06,3e-06,-1.8e-05,-4e-06,-7e-06,2.4e-05,-5e-06,-5e-06,2.3e-05,-5e-06,-7e-06,8e-06,-6e-06,5e-06,2.1e-05,1e-06,2.3e-05,-2e-06,-1e-06,1e-06,0,1e-06,-8e-06,1.1e-05,1.4e-05
0,-1.2e-05,1e-06,-1.3e-05,2e-06,3e-06,2e-06,1.4e-05,-1.7e-05,-2.2e-05,-1e-06,-2e-06,1.4e-05,3.6e-05,-8e-06,-1.1e-05,1.4e-05,9e-06,6e-06,1.9e-05,2e-06,-1.2e-05,-1.1e-05,-2e-06,-1e-05,-1.4e-05,4e-06,1.6e-05,-1.6e-05,-2e-06,-6e-06,-1.3e-05,8e-06,-6e-06,-4e-06,-6e-06,1e-06,5e-06,1.3e-05,-4e-06,9e-06,4e-06,2.3e-05,0,1e-05,-1.5e-05,-6e-06,4e-06,-2.5e-05,-2e-06,7e-06,-1e-06,7e-06,0,-8e-06,-2e-06,6e-06,-8e-06,-2e-06,-5e-06,-1e-05,8e-06,-1.2e-05,7e-06,5e-06,5e-06,-2e-06,-9e-06,2e-06,-3e-06,0,-1.4e-05,1.2e-05,1e-06,7e-06,-3e-06,-7e-06,-3e-06,-3e-06,7e-06,-2.2e-05,-2e-06,-4e-06,0,6e-06,1.2e-05,-1.2e-05,1e-06,-3e-06,1.1e-05,8e-06,2e-06,5e-06,1e-05,-1.3e-05,-1.9e-05,1.4e-05,-7e-06,-1.1e-05,4e-06,9e-06,-1.8e-05,-3e-06,-5e-06,-1.2e-05,-1e-05,-2e-06,-2e-06,4e-06,3e-06,-2e-06,-3e-06,-1e-06,-3e-06,4e-06,-9e-06,-3e-06,-3e-06,2e-06,-1.3e-05,3e-06
3e-06,1.5e-05,-1e-05,3e-06,-9e-06,-1e-06,-5e-06,-7e-06,1e-06,2e-05,-1e-06,-4e-06,-1.1e-05,-2e-06,0,-9e-06,-1.3e-05,3e-06,-4e-06,-9e-06,3e-06,2.5e-05,-8e-06,5e-06,-1e-05,1.2e-05,-3e-06,-1.2e-05,6e-06,-1.5e-05,-2e-06,5e-06,-3e-06,1e-06,-1e-06,4e-06,0,-6e-06,-4e-06,-3e-06,1.6e-05,-3e-06,-1.1e-05,8e-06,3e-06,0,-2e-06,1e-06,1.1e-05,3e-06,-1e-06,-5e-06,-9e-06,-3e-06,8e-06,-6e-06,7e-06,2e-06,-3e-06,4e-06,1.1e-05,-8e-06,-9e-06,5e-06,0,5e-06,-1.4e-05,4e-06,-5e-06,1e-06,-1.3e-05,-1e-06,-5e-06,-8e-06,-3e-06,3e-06,4e-06,1.8e-05,9e-06,7e-06,5e-06,9e-06,1.1e-05,4e-06,-5e-06,1e-06,0,-1.6e-05,1e-06,5e-06,-9e-06,0,-5e-06,1e-06,3e-06,1.5e-05,-1.5e-05,-6e-06,-2e-06,1.1e-05,-4e-06,8e-06,1e-06,-7e-06,-7e-06,1.2e-05,8e-06,0,2e-06,9e-06,-1e-06,0,7e-06,4e-06,-1e-06,4e-06,-1.5e-05,-9e-06,4e-06,6e-06,-3e-06
4e-06,-6e-06,6e-06,-2e-06,-1e-06,-3e-06,7e-06,-6e-06,-9e-06,1.6e-05,4e-06,4e-06,-1.2e-05,5e-06,1e-06,3e-06,1.7e-05,-3e-06,6e-06,3e-06,3e-06,-1.7e-05,7e-06,0,-1e-06,-4e-06,3e-06,-6e-06,-1.1e-05,-4e-06,1.1e-05,-1.5e-05,-6e-06,-6e-06,0,-5e-06,1e-05,-4e-06,-1.2e-05,8e-06,-7e-06,-3e-06,-1e-06,-5e-06,0,4e-06,0,3e-06,-2e-06,-4e-06,1e-05,1.9e-05,4e-06,-3e-06,0,0,-2e-06,4e-06,1.4e-05,-1.1e-05,-1.7e-05,1e-06,5e-06,-2e-06,-3e-06,-1.3e-05,-4e-06,-3e-06,-1e-06,0,1e-06,-1e-06,-1e-06,1e-06,0,9e-06,1e-06,-8e-06,-3e-06,-1e-05,-2e-05,-9e-06,-1e-05,4e-06,-6e-06,-1e-06,2e-06,1.1e-05,2e-06,6e-06,-4e-06,3e-06,-8e-06,-8e-06,0,-2e-06,7e-06,-8e-06,-2e-06,4e-06,-5e-06,9e-06,8e-06,7e-06,-2e-06,1.1e-05,7e-06,0,-4e-06,-1e-06,-3e-06,0,-1.6e-05,-7e-06,-1e-06,8e-06,-1.6e-05,3e-06,-1e-05,-1.2e-05,-4e-06
2e-06,0,-1e-06,1e-05,5e-06,1e-06,-1e-06,1e-06,1e-06,-9e-06,-3e-06,2e-06,2e-06,1e-06,-8e-06,5e-06,-7e-06,1e-06,8e-06,-5e-06,-9e-06,4e-06,-4e-06,0,4e-06,7e-06,-3e-06,2e-06,1e-05,7e-06,-1.2e-05,-8e-06,1.3e-05,5e-06,6e-06,-1e-06,3e-06,-1e-06,5e-06,-9e-06,1e-06,7e-06,4e-06,3e-06,-2e-06,-6e-06,-4e-06,0,-5e-06,-1e-06,-2e-06,-1.5e-05,-5e-06,1e-06,8e-06,-1.3e-05,-1e-06,-3e-06,-3e-06,-6e-06,0,-1e-06,-1e-06,-2e-06,5e-06,8e-06,5e-06,2e-06,1.1e-05,0,-3e-06,7e-06,1e-06,2e-06,5e-06,-2e-06,-2e-06,-5e-06,3e-06,-5e-06,5e-06,6e-06,8e-06,-2e-06,3e-06,-1e-06,-3e-06,-2e-06,-6e-06,-4e-06,-6e-06,3e-06,8e-06,-8e-06,6e-06,-2e-06,1.2e-05,1e-06,4e-06,8e-06,4e-06,-7e-06,-5e-06,6e-06,7e-06,-1e-06,1e-06,2e-06,3e-06,-4e-06,2e-06,0,2e-06,7e-06,-1e-06,-5e-06,-4e-06,-3e-06,-8e-06,3e-06,1.7e-05
-3e-06,2e-06,2e-06,-3e-06,0,-2e-06,4e-06,2e-06,1e-06,1e-06,-2e-06,-3e-06,9e-06,-9e-06,2e-06,-4e-06,4e-06,-1e-06,-4e-06,-2e-06,5e-06,-1e-05,1e-06,-3e-06,-1e-06,-1.2e-05,3e-06,1e-06,0,2e-06,5e-06,2e-06,-3e-06,-5e-06,-1.3e-05,6e-06,-4e-06,-3e-06,-2e-06,7e-06,0,-1e-06,-6e-06,-5e-06,-6e-06,4e-06,-1e-06,-4e-06,4e-06,1e-06,8e-06,9e-06,4e-06,-4e-06,4e-06,0,2e-06,-3e-06,-5e-06,3e-06,8e-06,2e-06,-6e-06,-2e-06,-5e-06,-5e-06,8e-06,-4e-06,2e-06,5e-06,6e-06,2e-06,7e-06,-4e-06,-6e-06,-2e-06,-1e-06,6e-06,-2e-06,0,3e-06,-7e-06,-4e-06,-3e-06,-2e-06,-4e-06,4e-06,2e-06,9e-06,-6e-06,-4e-06,2e-06,3e-06,-2e-06,-7e-06,8e-06,-1.2e-05,0,1e-05,-6e-06,-5e-06,0,4e-06,-3e-06,-2e-06,-5e-06,0,-2e-06,3e-06,-3e-06,2e-06,-2e-06,-2e-06,-4e-06,-3e-06,-3e-06,1e-06,2e-06,5e-06,4e-06,2e-06
-2e-06,-1e-06,-3e-06,-2e-06,-5e-06,1e-06,6e-06,1e-06,-3e-06,-3e-06,1e-06,4e-06,-9e-06,-1e-06,-3e-06,-6e-06,-1e-05,1e-06,5e-06,6e-06,-1e-06,8e-06,4e-06,-1e-06,4e-06,3e-06,-3e-06,-1e-05,-4e-06,-3e-06,1e-06,4e-06,-5e-06,3e-06,1.3e-05,7e-06,-6e-06,-5e-06,4e-06,-5e-06,5e-06,-3e-06,2e-06,7e-06,7e-06,4e-06,4e-06,4e-06,5e-06,-1e-06,-7e-06,-1e-05,-2e-06,-3e-06,-2e-06,2e-06,4e-06,2e-06,1e-06,3e-06,0,-3e-06,-1e-06,-1e-06,4e-06,5e-06,2e-06,2e-06,-7e-06,-3e-06,-1e-06,-2e-06,-8e-06,4e-06,3e-06,0,0,-4e-06,3e-06,8e-06,-6e-06,6e-06,4e-06,-2e-06,-1e-06,0,0,-8e-06,-7e-06,-4e-06,-2e-06,0,-3e-06,-5e-06,0,-9e-06,-1e-06,-3e-06,-3e-06,-1e-06,2e-06,-1e-05,-4e-06,0,-5e-06,-6e-06,0,-1e-06,-6e-06,-4e-06,-1e-06,2e-06,5e-06,4e-06,1e-06,1e-06,1.1e-05,0,1e-05,4e-06,-9e-06
-2e-06,0,1e-06,-4e-06,0,1e-06,-2e-06,0,3e-06,-1e-06,0,0,3e-06,2e-06,2e-06,6e-06,7e-06,0,-1e-05,-1e-06,0,1e-06,-5e-06,1e-06,-1e-06,5e-06,0,5e-06,-2e-06,-6e-06,-4e-06,1e-06,2e-06,-2e-06,-5e-06,-4e-06,-1e-06,-3e-06,-1.1e-05,3e-06,-2e-06,1e-06,4e-06,-4e-06,0,-4e-06,1e-06,-2e-06,-1.2e-05,0,6e-06,-1e-06,1e-06,2e-06,-1e-06,-8e-06,0,3e-06,-5e-06,3e-06,-3e-06,1e-06,0,1e-06,-2e-06,-8e-06,-3e-06,-3e-06,1e-06,-1e-06,-5e-06,-1e-06,-2e-06,-2e-06,1e-06,-4e-06,0,1e-06,-1e-06,0,4e-06,-4e-06,-5e-06,8e-06,4e-06,2e-06,-3e-06,7e-06,2e-06,0,2e-06,3e-06,1e-06,-2e-06,0,-1e-06,8e-06,2e-06,4e-06,-6e-06,2e-06,1.2e-05,2e-06,-4e-06,4e-06,5e-06,0,1e-06,4e-06,2e-06,2e-06,-2e-06,-5e-06,-4e-06,-1e-06,1e-06,6e-06,-2e-06,0,-2e-06,-1e-06
-1e-06,2e-06,2e-06,0,2e-06,1e-06,-2e-06,-2e-06,-6e-06,-4e-06,1e-06,-1e-06,-5e-06,1e-06,-1e-06,0,-6e-06,1e-06,0,2e-06,-1e-06,0,3e-06,-2e-06,-1e-06,-1e-05,-3e-06,6e-06,-5e-06,2e-06,5e-06,5e-06,7e-06,2e-06,-3e-06,-2e-06,3e-06,1e-06,1.1e-05,-1e-06,-5e-06,0,-7e-06,1e-06,-2e-06,-5e-06,-1e-06,2e-06,7e-06,-1e-06,-4e-06,1e-06,-1e-06,-3e-06,0,2e-06,-3e-06,-2e-06,-1e-06,4e-06,-3e-06,-2e-06,-4e-06,-1e-06,2e-06,4e-06,-4e-06,1e-06,1e-06,4e-06,2e-06,-3e-06,1e-06,-1e-06,-2e-06,3e-06,-2e-06,1e-06,-2e-06,-7e-06,-1e-06,1e-06,2e-06,-4e-06,1e-06,0,2e-06,-3e-06,1e-06,5e-06,2e-06,1e-06,-6e-06,0,3e-06,6e-06,-4e-06,0,-5e-06,6e-06,-2e-06,-3e-06,-5e-06,1e-06,2e-06,4e-06,-1e-06,1e-06,3e-06,4e-06,1e-06,1e-06,2e-06,3e-06,-1e-06,1e-06,1e-06,0,3e-06,-1e-06,8e-06
1e-06,-2e-06,-1e-06,3e-06,1e-06,0,-1e-06,-2e-06,0,-8e-06,2e-06,4e-06,7e-06,1e-06,0,0,6e-06,0,-3e-06,0,0,-5e-06,2e-06,5e-06,1e-06,8e-06,-2e-06,0,4e-06,5e-06,-5e-06,6e-06,-4e-06,-2e-06,5e-06,0,2e-06,5e-06,-7e-06,-1e-06,-2e-06,-3e-06,6e-06,0,-2e-06,1e-06,0,-3e-06,-2e-06,1e-06,5e-06,1e-06,3e-06,-3e-06,1e-06,1e-06,4e-06,-2e-06,4e-06,-5e-06,2e-06,3e-06,-2e-06,-1e-06,-1e-06,-1e-06,-1e-06,-1e-06,-4e-06,-4e-06,3e-06,2e-06,2e-06,1e-06,3e-06,0,3e-06,-4e-06,2e-06,-4e-06,-4e-06,1e-06,-3e-06,0,-1e-06,2e-06,-1e-06,2e-06,-1e-06,3e-06,3e-06,0,5e-06,4e-06,-2e-06,-5e-06,6e-06,2e-06,-4e-06,-4e-06,-1e-06,-5e-06,3e-06,3e-06,3e-06,3e-06,-3e-06,0,-5e-06,2e-06,1e-06,0,-2e-06,-5e-06,0,-2e-06,0,-1e-06,5e-06,-4e-06,-2e-06
1e-06,2e-06,-2e-06,1e-06,-2e-06,-1e-06,-3e-06,2e-06,-5e-06,7e-06,-1e-06,-2e-06,-1e-06,0,0,1e-06,-4e-06,1e-06,1e-06,1e-06,3e-06,-4e-06,-3e-06,-1e-06,-1e-06,-5e-06,-1e-06,-1e-06,0,0,1e-06,-2e-06,0,1e-06,-2e-06,2e-06,-1e-06,4e-06,-3e-06,1e-06,-3e-06,1e-06,-3e-06,-2e-06,0,0,0,3e-06,-5e-06,-1e-06,-2e-06,-3e-06,-2e-06,2e-06,0,-4e-06,0,2e-06,-1e-06,-3e-06,1e-06,-3e-06,3e-06,0,0,2e-06,3e-06,1e-06,-1e-06,4e-06,1e-06,2e-06,-4e-06,0,-2e-06,4e-06,-1e-06,3e-06,-2e-06,1e-06,6e-06,-3e-06,2e-06,-4e-06,2e-06,0,2e-06,-2e-06,0,1e-06,1e-06,1e-06,-2e-06,3e-06,-1e-06,3e-06,-2e-06,1e-06,-1e-06,4e-06,1e-06,3e-06,-1e-06,0,-4e-06,-4e-06,-3e-06,0,3e-06,1e-06,-2e-06,-2e-06,3e-06,4e-06,0,-1e-06,-1e-06,0,2e-06,0,-4e-06
0,0,2e-06,1e-06,-1e-06,0,0,3e-06,-1e-06,9e-06,-1e-06,0,-3e-06,-1e-06,1e-06,-4e-06,5e-06,-1e-06,6e-06,0,-2e-06,7e-06,3e-06,-1e-06,-3e-06,2e-06,-3e-06,3e-06,4e-06,-4e-06,2e-06,-2e-06,3e-06,-1e-06,-1e-06,0,-5e-06,0,7e-06,-1e-06,0,2e-06,1e-06,5e-06,2e-06,-1e-06,-1e-06,0,6e-06,-1e-06,2e-06,2e-06,2e-06,-3e-06,1e-06,1e-06,0,2e-06,1e-06,-2e-06,4e-06,2e-06,-1e-06,1e-06,1e-06,0,3e-06,-1e-06,4e-06,-2e-06,-2e-06,0,1e-06,0,0,0,-1e-06,1e-06,1e-06,2e-06,-3e-06,4e-06,-3e-06,3e-06,-1e-06,-2e-06,-1e-06,-1e-06,2e-06,-3e-06,0,1e-06,3e-06,1e-06,0,1e-06,-3e-06,1e-06,-2e-06,-1e-06,0,1e-06,3e-06,1e-06,3e-06,-2e-06,-1e-06,0,0,-1e-06,3e-06,1e-06,1e-06,-2e-06,0,2e-06,0,0,-4e-06,3e-06,4e-06
0,-2e-06,-1e-06,-4e-06,1e-06,-1e-06,2e-06,-1e-06,-1e-06,-2e-06,0,2e-06,-1e-06,-1e-06,-1e-06,4e-06,-6e-06,0,0,0,0,-3e-06,0,0,-1e-06,-1e-06,-1e-06,1e-06,0,-1e-06,-3e-06,-2e-06,0,1e-06,1e-06,0,-3e-06,0,-6e-06,1e-06,0,-1e-06,1e-06,-7e-06,-2e-06,2e-06,-1e-06,-1e-06,-1e-06,1e-06,-4e-06,1e-06,-2e-06,-1e-06,0,2e-06,-1e-06,-1e-06,2e-06,0,-5e-06,-3e-06,-2e-06,1e-06,-2e-06,0,1e-06,0,2e-06,1e-06,1e-06,0,2e-06,-1e-06,1e-06,1e-06,0,-3e-06,0,0,2e-06,-4e-06,2e-06,1e-06,-3e-06,-1e-06,-2e-06,1e-06,-1e-06,-2e-06,0,0,-2e-06,3e-06,1e-06,-5e-06,6e-06,1e-06,2e-06,2e-06,-1e-06,3e-06,0,-2e-06,-3e-06,0,0,1e-06,-1e-06,-4e-06,-2e-06,-1e-06,3e-06,3e-06,0,0,-3e-06,-1e-06,-4e-06,1e-06,2e-06
-1e-06,2e-06,-1e-06,0,2e-06,1e-06,-2e-06,-3e-06,-2e-06,-2e-06,0,-1e-06,1e-06,-1e-06,0,0,5e-06,0,4e-06,0,0,5e-06,-2e-06,-2e-06,-1e-06,-1e-06,-2e-06,-4e-06,0,4e-06,2e-06,-4e-06,-4e-06,-1e-06,-2e-06,2e-06,1e-06,0,4e-06,-1e-06,0,0,-2e-06,6e-06,2e-06,0,-1e-06,0,-4e-06,0,0,-3e-06,1e-06,0,2e-06,0,1e-06,-1e-06,-3e-06,4e-06,1e-06,2e-06,2e-06,1e-06,3e-06,0,-2e-06,0,-2e-06,-1e-06,0,-2e-06,1e-06,-1e-06,-2e-06,-3e-06,2e-06,2e-06,0,-3e-06,2e-06,3e-06,0,0,0,1e-06,3e-06,-1e-06,0,-2e-06,-2e-06,0,-1e-06,0,0,4e-06,-1e-06,1e-06,4e-06,-3e-06,2e-06,-4e-06,1e-06,-1e-06,3e-06,4e-06,0,0,0,0,1e-06,-1e-06,0,-2e-06,0,-2e-06,-3e-06,-1e-06,1e-06,1e-06,-4e-06
-1e-06,-1e-06,1e-06,0,-1e-06,0,1e-06,0,1e-06,0,0,1e-06,-1e-06,2e-06,0,-2e-06,-5e-06,0,-4e-06,-1e-06,1e-06,-9e-06,2e-06,0,0,5e-06,-1e-06,-1e-06,-1e-06,1e-06,-1e-06,-2e-06,0,0,3e-06,-2e-06,2e-06,0,-3e-06,0,-1e-06,2e-06,2e-06,-5e-06,1e-06,-3e-06,0,0,5e-06,-1e-06,-4e-06,6e-06,-2e-06,-2e-06,-2e-06,1e-06,0,1e-06,0,1e-06,-1e-06,-2e-06,1e-06,1e-06,-3e-06,0,-3e-06,0,0,0,1e-06,0,-2e-06,2e-06,2e-06,0,-1e-06,0,0,-1e-06,-2e-06,-2e-06,-1e-06,0,-1e-06,0,-2e-06,0,1e-06,0,-1e-06,1e-06,1e-06,-2e-06,-1e-06,-1e-06,-5e-06,-1e-06,1e-06,0,0,0,-1e-06,1e-06,-2e-06,1e-06,1e-06,0,0,1e-06,-1e-06,0,-2e-06,1e-06,0,1e-06,-2e-06,0,0,-1e-06,-1e-06
-1e-06,0,-1e-06,2e-06,-1e-06,0,0,3e-06,-2e-06,-1e-06,0,1e-06,2e-06,1e-06,0,0,4e-06,0,0,1e-06,-2e-06,4e-06,-1e-06,1e-06,3e-06,-7e-06,-2e-06,0,-1e-06,-2e-06,0,0,2e-06,0,-4e-06,-1e-06,0,1e-06,4e-06,0,2e-06,-1e-06,0,2e-06,0,-1e-06,0,2e-06,-3e-06,1e-06,1e-06,-5e-06,2e-06,-1e-06,0,1e-06,-1e-06,1e-06,0,1e-06,3e-06,1e-06,0,0,2e-06,1e-06,-1e-06,0,1e-06,1e-06,1e-06,1e-06,2e-06,-1e-06,-1e-06,-1e-06,0,-1e-06,0,2e-06,1e-06,0,1e-06,-3e-06,-1e-06,1e-06,0,-2e-06,-2e-06,2e-06,-1e-06,0,-3e-06,-3e-06,0,-2e-06,3e-06,0,1e-06,0,-1e-06,3e-06,-1e-06,0,-2e-06,-1e-06,1e-06,0,0,1e-06,1e-06,0,-2e-06,-1e-06,0,1e-06,0,-1e-06,0,-1e-06,4e-06
0,1e-06,2e-06,1e-06,0,0,-1e-06,0,0,-2e-06,0,-1e-06,-4e-06,0,0,1e-06,-4e-06,0,-3e-06,-1e-06,1e-06,-3e-06,-1e-06,0,1e-06,5e-06,-1e-06,0,0,-2e-06,1e-06,2e-06,-2e-06,0,2e-06,0,-2e-06,1e-06,-5e-06,0,1e-06,-1e-06,-2e-06,0,0,1e-06,0,-2e-06,-1e-06,0,-2e-06,2e-06,-2e-06,0,-1e-06,2e-06,0,-1e-06,-2e-06,-2e-06,-2e-06,-1e-06,2e-06,0,0,-2e-06,2e-06,0,-2e-06,-1e-06,-3e-06,1e-06,1e-06,0,0,1e-06,0,1e-06,0,1e-06,0,1e-06,-1e-06,2e-06,2e-06,1e-06,0,2e-06,2e-06,2e-06,0,0,4e-06,-2e-06,0,4e-06,-1e-06,0,0,1e-06,1e-06,-1e-06,0,1e-06,3e-06,-3e-06,1e-06,0,-1e-06,2e-06,0,0,-2e-06,1e-06,0,0,2e-06,0,1e-06,0,-1e-06
0,0,-3e-06,-1e-06,1e-06,0,2e-06,-2e-06,-2e-06,-5e-06,0,1e-06,2e-06,1e-06,-1e-06,0,4e-06,0,-1e-06,0,0,6e-06,2e-06,1e-06,-1e-06,-2e-06,-1e-06,-2e-06,1e-06,1e-06,-2e-06,2e-06,-2e-06,0,2e-06,1e-06,-2e-06,1e-06,0,0,2e-06,1e-06,2e-06,-3e-06,-2e-06,-1e-06,0,1e-06,3e-06,0,3e-06,-2e-06,1e-06,-1e-06,0,0,0,-1e-06,1e-06,-3e-06,0,1e-06,2e-06,-1e-06,-1e-06,1e-06,2e-06,0,-2e-06,1e-06,1e-06,0,0,0,1e-06,0,0,-2e-06,0,-1e-06,0,-1e-06,2e-06,-1e-06,1e-06,-1e-06,-1e-06,-2e-06,-2e-06,1e-06,0,0,-3e-06,-1e-06,1e-06,-3e-06,0,-1e-06,-3e-06,1e-06,-1e-06,-1e-06,-1e-06,0,-2e-06,-1e-06,1e-06,0,2e-06,0,0,0,1e-06,0,0,0,4e-06,1e-06,4e-06,1e-06,-3e-06
0,0,2e-06,-1e-06,0,0,1e-06,-1e-06,-1e-06,3e-06,0,1e-06,1e-06,-1e-06,1e-06,-1e-06,-4e-06,0,3e-06,0,0,-4e-06,-1e-06,0,-1e-06,0,0,2e-06,-1e-06,2e-06,2e-06,3e-06,2e-06,0,-4e-06,1e-06,0,0,3e-06,0,-1e-06,0,-1e-06,4e-06,1e-06,0,0,0,-3e-06,0,-1e-06,0,-2e-06,-1e-06,0,2e-06,0,1e-06,1e-06,0,-2e-06,-1e-06,0,-1e-06,1e-06,0,1e-06,0,2e-06,0,1e-06,-1e-06,-2e-06,-1e-06,-1e-06,1e-06,-1e-06,1e-06,1e-06,-1e-06,1e-06,2e-06,-1e-06,3e-06,0,-1e-06,2e-06,1e-06,1e-06,-1e-06,1e-06,0,1e-06,-1e-06,-1e-06,0,1e-06,-1e-06,0,0,0,-1e-06,1e-06,-1e-06,2e-06,2e-06,0,0,-1e-06,-1e-06,0,-1e-06,-1e-06,-1e-06,0,0,3e-06,-1e-06,2e-06,0,1e-06
0,1e-06,-1e-06,-1e-06,-1e-06,0,0,1e-06,-1e-06,7e-06,0,0,-1e-06,0,-1e-06,0,4e-06,0,0,0,0,0,0,0,-2e-06,2e-06,0,2e-06,0,0,-1e-06,2e-06,1e-06,0,3e-06,-1e-06,2e-06,-1e-06,-6e-06,0,-1e-06,-1e-06,0,-4e-06,-1e-06,1e-06,0,1e-06,0,0,3e-06,-1e-06,1e-06,0,1e-06,2e-06,-1e-06,1e-06,-1e-06,0,1e-06,1e-06,0,0,-1e-06,0,-1e-06,0,1e-06,-1e-06,0,-1e-06,1e-06,1e-06,1e-06,-1e-06,0,1e-06,0,0,0,-2e-06,1e-06,-3e-06,1e-06,0,-2e-06,-2e-06,0,-2e-06,0,0,0,0,0,3e-06,-2e-06,-1e-06,-2e-06,0,0,2e-06,0,0,-2e-06,2e-06,0,0,0,-1e-06,0,-1e-06,2e-06,1e-06,0,0,1e-06,0,-1e-06,1e-06,2e-06
0,-1e-06,0,1e-06,0,0,1e-06,1e-06,-2e-06,-1e-06,0,0,0,0,0,0,-4e-06,0,4e-06,0,0,-3e-06,1e-06,0,-1e-06,-3e-06,0,0,-1e-06,-2e-06,1e-06,-1e-06,-2e-06,0,0,0,1e-06,-2e-06,5e-06,0,0,1e-06,0,4e-06,0,-1e-06,0,-1e-06,3e-06,0,-1e-06,2e-06,-1e-06,-1e-06,0,-1e-06,0,-1e-06,1e-06,2e-06,1e-06,-1e-06,2e-06,0,1e-06,0,-1e-06,0,-1e-06,1e-06,-1e-06,0,0,0,0,1e-06,0,-2e-06,0,1e-06,0,2e-06,-1e-06,1e-06,0,0,0,1e-06,0,-1e-06,1e-06,0,-1e-06,2e-06,0,-4e-06,0,-1e-06,0,0,0,1e-06,1e-06,0,1e-06,0,0,0,1e-06,-1e-06,0,1e-06,-1e-06,-1e-06,0,0,-2e-06,0,0,-1e-06,-2e-06
0,1e-06,0,0,0,0,-1e-06,0,0,-2e-06,0,0,-1e-06,0,0,0,3e-06,0,-2e-06,0,1e-06,1e-06,-1e-06,-1e-06,1e-06,4e-06,0,0,1e-06,-1e-06,1e-06,-1e-06,1e-06,0,-1e-06,-1e-06,-1e-06,-1e-06,-3e-06,0,0,1e-06,-1e-06,-3e-06,0,-1e-06,0,0,-3e-06,0,2e-06,-2e-06,1e-06,-1e-06,0,0,0,-1e-06,-1e-06,1e-06,-1e-06,1e-06,0,0,-1e-06,-1e-06,0,0,0,-1e-06,-1e-06,1e-06,-1e-06,0,-1e-06,-2e-06,0,1e-06,0,1e-06,0,-2e-06,2e-06,-1e-06,-2e-06,0,1e-06,0,0,0,0,-1e-06,2e-06,2e-06,1e-06,1e-06,2e-06,-1e-06,1e-06,-1e-06,0,-3e-06,-1e-06,1e-06,0,-2e-06,-1e-06,0,-2e-06,0,0,-1e-06,2e-06,1e-06,0,0,-3e-06,-1e-06,0,-1e-06,-1e-06
0,0,-1e-06,1e-06,0,0,-1e-06,-1e-06,-1e-06,0,0,0,-1e-06,1e-06,0,0,-4e-06,0,0,0,0,3e-06,0,1e-06,1e-06,-4e-06,0,0,1e-06,2e-06,-2e-06,-2e-06,2e-06,0,2e-06,0,-2e-06,0,1e-06,0,-1e-06,-1e-06,1e-06,1e-06,0,1e-06,0,1e-06,0,0,-1e-06,0,-1e-06,0,-1e-06,1e-06,0,0,-1e-06,0,0,-1e-06,-1e-06,0,1e-06,0,1e-06,-1e-06,1e-06,1e-06,1e-06,1e-06,-1e-06,1e-06,1e-06,1e-06,0,1e-06,0,-1e-06,0,1e-06,-3e-06,1e-06,0,1e-06,-2e-06,0,0,1e-06,0,0,-1e-06,1e-06,-1e-06,1e-06,-2e-06,-1e-06,1e-06,0,0,1e-06,0,0,-1e-06,-1e-06,-1e-06,0,1e-06,1e-06,0,0,-2e-06,-2e-06,0,0,-2e-06,0,-1e-06,-1e-06,1e-06
0,0,1e-06,0,0,0,1e-06,-1e-06,0,-1e-06,0,1e-06,2e-06,0,0,-1e-06,4e-06,0,-3e-06,0,0,-2e-06,1e-06,0,0,3e-06,1e-06,0,1e-06,1e-06,2e-06,-2e-06,-1e-06,0,-2e-06,0,0,1e-06,-1e-06,0,-1e-06,0,-1e-06,0,0,0,0,0,2e-06,0,2e-06,1e-06,1e-06,-1e-06,-1e-06,-1e-06,-1e-06,1e-06,1e-06,-1e-06,-1e-06,1e-06,0,0,-1e-06,1e-06,1e-06,0,-2e-06,0,0,0,1e-06,-1e-06,-1e-06,-1e-06,0,-2e-06,0,-1e-06,0,0,2e-06,1e-06,0,0,1e-06,0,-1e-06,1e-06,-1e-06,-1e-06,1e-06,1e-06,0,-3e-06,-1e-06,0,2e-06,-1e-06,0,1e-06,-1e-06,-1e-06,1e-06,0,0,0,0,0,0,0,2e-06,2e-06,0,1e-06,-1e-06,0,-2e-06,1e-06,0
0,0,-1e-06,-1e-06,0,0,0,0,-1e-06,0,0,0,-2e-06,0,0,1e-06,-3e-06,0,-2e-06,0,0,1e-06,-1e-06,1e-06,0,0,1e-06,-1e-06,0,-1e-06,-1e-06,-1e-06,-1e-06,-1e-06,1e-06,0,2e-06,1e-06,0,0,0,1e-06,0,-2e-06,0,-1e-06,0,0,-3e-06,0,-1e-06,-2e-06,-1e-06,-1e-06,0,-1e-06,0,0,-1e-06,-1e-06,2e-06,-1e-06,0,0,1e-06,-1e-06,0,0,-2e-06,0,0,-1e-06,0,1e-06,0,1e-06,0,1e-06,0,1e-06,0,-1e-06,-2e-06,-2e-06,-1e-06,0,-1e-06,-1e-06,0,1e-06,0,-1e-06,-1e-06,0,-1e-06,3e-06,1e-06,0,0,1e-06,0,0,0,0,-1e-06,2e-06,0,0,0,1e-06,0,-1e-06,-2e-06,-2e-06,0,0,0,-1e-06,0,1e-06,-1e-06
0,0,1e-06,0,0,0,0,1e-06,-1e-06,-3e-06,0,0,0,0,0,0,4e-06,0,1e-06,0,1e-06,-5e-06,0,0,-1e-06,-3e-06,1e-06,1e-06,-1e-06,-2e-06,0,1e-06,2e-06,0,0,1e-06,2e-06,0,1e-06,0,0,-1e-06,0,2e-06,0,0,0,-1e-06,1e-06,0,1e-06,2e-06,1e-06,0,-1e-06,-1e-06,0,-1e-06,0,0,0,1e-06,-1e-06,0,0,2e-06,0,0,1e-06,0,-1e-06,-1e-06,-1e-06,0,0,-1e-06,0,0,0,1e-06,0,1e-06,2e-06,1e-06,1e-06,0,0,1e-06,0,0,0,-1e-06,0,-1e-06,1e-06,0,0,0,0,-1e-06,0,-1e-06,0,0,1e-06,1e-06,0,0,1e-06,0,0,0,2e-06,2e-06,0,0,1e-06,0,2e-06,1e-06,0
0,-1e-06,0,0,0,0,0,0,-1e-06,1e-06,0,0,1e-06,0,0,0,-3e-06,0,0,0,0,4e-06,1e-06,0,-1e-06,4e-06,1e-06,0,1e-06,1e-06,2e-06,2e-06,0,0,-2e-06,-1e-06,0,0,-4e-06,0,1e-06,0,0,-3e-06,0,0,0,1e-06,1e-06,0,-2e-06,-2e-06,-1e-06,-1e-06,0,-1e-06,0,0,0,1e-06,1e-06,-1e-06,-1e-06,0,-2e-06,-3e-06,0,-1e-06,1e-06,-1e-06,0,0,0,-1e-06,-1e-06,1e-06,0,-1e-06,0,0,0,-2e-06,-2e-06,-2e-06,1e-06,0,1e-06,-1e-06,-1e-06,-1e-06,0,-1e-06,1e-06,-1e-06,-1e-06,-2e-06,0,0,-1e-06,1e-06,0,-1e-06,0,0,0,0,0,0,-1e-06,-1e-06,0,0,-3e-06,-2e-06,0,0,1e-06,0,1e-06,-1e-06,1e-06
