-0.000618,-0.000557,-0.000612,-0.000578,-0.001261,-0.001315,-0.001125,-0.001394,-0.001243,-0.000828,-0.000694,-0.001614,-0.001577,-0.000869,-0.001451,-0.001294,-0.001618,-0.001716,-0.000827,-0.001936,-0.00153,-0.001485,-0.002224,-0.002224,-0.001947,-0.001935,-0.002427,-0.001857,-0.001715,-0.002463,-0.001937,-0.000995,-0.002063,-0.002123,-0.002653,-0.001931,-0.002696,-0.001955,-0.001946,-0.001425,-0.002515,-0.002016,-0.00265,-0.002791,-0.003845,-0.003561,-0.003933,-0.003575,-0.002129,-0.003043,-0.001932,-0.001911,-0.002705,-0.004271,-0.002312,-0.002284,-0.004265,-0.002721,-0.003553,-0.002642,-0.002675,-0.00271,-0.003516,-0.002646,-0.002707,-0.002535,-0.002794,-0.002393,-0.003839,-0.002837,-0.0035,-0.002075,-0.002297,-0.002023,-0.003235,-0.004211,-0.003392,-0.001948,-0.001979,-0.003179,-0.002427,-0.002118,-0.00263,-0.001948,-0.002576,-0.002035,-0.002769,-0.001727,-0.003246,-0.001376,-0.001944,-0.003865,-0.004905,-0.003628,-0.002761,-0.001358,-0.001307,-0.002162,-0.002988,-0.003897,-0.002583,-0.002215,-0.001531,-0.001249,-0.001793,-0.002536,-0.001767,-0.00257,-0.002333,-0.001278,-0.001312,-0.001114,-0.001958,-0.002279,-0.002151,-0.002543,-0.002213,-0.002587,-0.003007,-0.001717,-0.001137
0.000152,7.5e-05,0.000224,6.8e-05,0.00062,0.000576,0.000487,0.000154,0.00031,0.000146,-0.000331,0.000379,0.000436,0.00038,0.000889,0.000496,0.000286,0.000429,-3.4e-05,0.000507,0.000385,0.000724,0.00082,0.001051,0.00093,0.000347,0.001538,0.000955,0.000357,0.001272,0.001267,0.000595,0.001207,0.00084,0.001697,0.000481,0.001559,0.001221,0.000655,0.000499,0.000939,0.000867,0.00068,0.001203,0.001986,0.001741,0.001817,0.002004,0.000771,0.002083,0.000469,0.000712,0.001646,0.002514,0.001114,0.000565,0.002258,0.001152,0.002116,0.000933,0.000729,0.000887,0.000868,0.000913,0.000811,0.001234,0.001463,0.001086,0.002341,0.001295,0.001117,0.000842,0.00122,0.000668,0.001923,0.002668,0.001559,0.000641,0.000568,0.001394,0.001276,0.000615,0.000692,0.000971,0.001321,0.001594,0.001305,0.000475,0.001632,0.000872,0.000568,0.001685,0.002203,0.001702,0.001146,0.000544,0.000113,0.00112,0.001642,0.002608,0.001532,0.000632,-1.5e-05,3.1e-05,0.000171,0.000822,0.000173,0.001239,0.000921,0.00034,0.000227,0.000329,0.000832,0.000959,0.000699,0.000901,0.00072,0.001233,0.001432,0.000551,0.000164
-0.000271,2.3e-05,-0.000408,3e-05,-0.000213,-0.000409,-0.000524,0.000262,8.4e-05,8.5e-05,0.000264,0.000365,4.6e-05,-1.9e-05,-0.000606,-0.00039,0.000616,-2.1e-05,-0.00017,-7e-06,5.9e-05,-0.000522,-0.000203,-0.000438,-0.000402,-0.000491,-0.000979,-0.000284,0.000239,-0.000295,-0.000558,-0.000266,-0.001266,-0.000345,-0.001079,-0.00045,-0.0011,-0.000955,-0.000724,-0.000287,-0.000852,-0.000856,-2e-06,-0.000314,-0.000738,-0.00091,-0.000531,-0.001616,-0.000339,-0.001269,-2.1e-05,-0.000191,-0.001325,-0.001718,-9.9e-05,0.000235,-0.001135,-0.000311,-0.00094,2.6e-05,9.7e-05,-2.5e-05,0.000251,-0.000681,-9.4e-05,-0.000271,-0.001236,-0.000115,-0.001778,-0.000172,-0.000299,-0.000835,-0.000632,-0.000133,-0.00122,-0.001223,-0.001014,1.8e-05,-9.6e-05,2e-06,0.000219,-5.6e-05,-0.001403,-0.00133,-0.000833,-0.001553,-0.000675,-0.00029,-0.001098,-0.001025,-0.000392,-0.00047,-0.000173,-0.000545,-0.000212,-8e-06,-0.000175,-0.000316,-0.000421,-0.001785,-0.001137,0.00024,0.000232,-5.5e-05,0.000468,0.000363,1.8e-05,-0.000628,9e-05,-4.4e-05,-0.000425,1.6e-05,-4e-04,-0.000121,6.6e-05,-0.000291,-0.000249,-0.000631,-0.000518,-9.1e-05,5e-06
0.000301,-2.6e-05,9.5e-05,3.6e-05,1.6e-05,0.000233,0.00042,-0.000425,-0.000277,-0.000218,-0.00012,-0.000392,-0.000423,-0.000383,0.000432,0.000283,-0.000848,-3.2e-05,0.000385,-0.000137,-0.000228,-0.00012,8.5e-05,2.6e-05,0.000287,0.00089,0.00056,0.000137,-0.000109,5e-05,0.000293,0.000154,0.000783,-0.000496,0.000435,-6.9e-05,0.000777,0.000598,0.000447,0.000202,0.000371,0.000494,0.000242,-0.000447,-0.000539,-0.000122,-0.000161,0.000882,0.000585,0.000203,-0.000504,-0.000582,0.000285,0.001182,-0.000199,-0.000622,0.000115,2.8e-05,0.000503,3.5e-05,-0.00097,-0.000189,-0.000692,-0.000139,-0.000254,-0.000939,0.000581,-0.000329,0.001639,-0.000166,0.000345,0.000734,4e-06,-0.000194,0.000421,0.000458,-0.000188,-0.000452,-0.000276,-0.000303,-0.000298,-0.000538,0.001254,0.001204,0.000463,0.000668,0.000148,0.000422,4.2e-05,0.000643,0.000415,-0.000887,-0.000855,-0.000919,-0.000586,-0.000884,-0.000284,-0.000102,-0.000451,0.000447,0.000511,-0.00025,-0.000352,-0.000231,-0.001004,-0.000897,-0.000132,0.000127,-0.000941,-0.000246,-1.9e-05,-0.000535,-0.000176,-0.000214,-0.000291,-0.00011,-0.000376,-5e-06,-0.000125,-0.000413,-0.000119
-5.7e-05,-1e-06,0.000141,-0.000167,-3.6e-05,-0.000114,-0.000413,0.000263,0.000282,2.1e-05,8e-06,-1e-04,0.000126,0.000428,-0.000261,-0.000216,0.000413,-0.000213,-0.000271,-2.8e-05,0.000155,0.000362,-0.000132,0.000124,-5.9e-05,-0.00062,-0.000318,-0.000472,-0.000218,-0.000196,-0.000785,-0.000288,-0.000503,0.000416,-0.000588,-2.4e-05,-0.000279,-0.000186,-0.000225,-0.000146,-2.3e-05,7.4e-05,-0.000186,0.000578,0.000592,0.000914,0.000594,-0.001093,-0.000787,-5.6e-05,0.000321,0.000394,-0.000136,-0.001005,-0.000432,0.000369,0.000167,0.000117,-0.000595,-0.000298,0.001366,0.000329,-8.2e-05,0.000366,0.000123,0.000597,-8.8e-05,0.000596,-0.000765,0.000138,-0.000268,-0.000716,0.000134,0.00017,-0.000114,-4e-04,0.000463,0.000207,0.000195,-5.8e-05,-0.000574,0.00019,-0.000885,-0.001198,-0.000868,-0.000816,-0.000357,-0.000364,0.000184,-0.000237,-0.000557,0.000318,0.000109,0.001526,0.000802,0.000868,0.000574,-3.6e-05,0.000295,0.000265,-0.000457,0.00011,0.000661,-0.000247,0.000722,0.000571,5.9e-05,9.7e-05,0.000808,0.000255,0.000182,0.00048,1.9e-05,-0.000441,-0.000145,-8.5e-05,0.000496,-0.00017,0.000115,0.000229,7e-05
-1.9e-05,-6.1e-05,-0.000192,2.8e-05,0.000107,3.5e-05,0.000301,-0.000123,-0.000244,-2.8e-05,-4.4e-05,0.000281,0.000309,-0.000391,0.000187,0.000266,4.2e-05,0.000262,3.1e-05,-2.8e-05,-0.000143,-0.000454,0.000229,-0.000295,4.1e-05,0.000543,0.000116,0.000576,0.000342,0.00025,0.000903,0.000177,0.00014,-0.000461,0.000294,0.000446,0.000136,-0.000107,-0.000134,-6.6e-05,4.9e-05,-0.000562,2e-06,-0.000129,0.000188,-0.000948,-7e-04,0.001226,0.001241,4.1e-05,-0.000352,-9.7e-05,-2e-06,0.000679,0.000462,-0.000183,0.000302,-7.1e-05,0.00042,9.7e-05,-0.000364,-0.000365,8.2e-05,7e-05,0.000181,-0.000267,-5.7e-05,-0.000927,5.2e-05,1e-04,-0.000307,0.000304,-0.000204,-0.000394,-6.3e-05,0.000586,0.00024,-6.9e-05,0.000165,0.00027,0.000797,-4.8e-05,0.000625,0.000783,0.001123,0.001153,0.00038,0.00025,0.00013,0.000386,0.000382,5.1e-05,1.9e-05,-0.000883,-0.000463,-0.00049,-0.000379,3.3e-05,4.6e-05,-0.000269,0.000503,0.000148,-0.000527,0.000594,-0.000185,-0.000595,0.000221,0.000132,-0.00035,-0.000118,4.7e-05,0.000104,0.000108,0.000664,0.000449,0.000381,-0.000368,0.000392,7.7e-05,0.00015,-0.000212
-0.000164,5.3e-05,0.000194,0.000136,0.000171,-0.000278,-0.000211,0.000112,0.000303,7.8e-05,1.4e-05,-0.000105,-0.000457,0.000157,7e-06,-0.000204,3.8e-05,-0.000219,2.7e-05,0.000182,0.000556,0.000298,6.3e-05,0.000357,-0.000331,-0.000402,0.000124,-0.000682,-0.000292,-0.000334,-6e-04,-0.000212,-0.000202,0.000351,6.6e-05,-0.000461,3.6e-05,5.5e-05,8.2e-05,-4.6e-05,2.8e-05,0.000548,0.000353,0.000172,-0.000433,0.00074,0.000562,-0.00025,-0.001146,-0.000167,0.00036,8.7e-05,0.000314,-0.000495,-0.000276,0.000148,-0.000608,-3.9e-05,-7.9e-05,-6.4e-05,-0.000291,9.3e-05,3.3e-05,-0.00022,-0.000206,0.000225,-7.7e-05,0.000745,0.000169,-0.000238,0.000478,3.5e-05,-5.9e-05,0.000274,-0.000129,-0.000692,-0.000461,-0.000133,-0.000282,6.6e-05,-0.000603,9.7e-05,1.8e-05,-0.000156,-0.000642,-0.000644,-0.000406,-1.6e-05,-0.000375,-0.000174,-0.00035,0.00052,3.7e-05,0.000286,8e-06,0.000207,0.000172,-6.1e-05,-0.000181,-5.5e-05,-0.000296,-5.4e-05,0.000378,-0.000103,-0.000183,0.000555,-5.8e-05,-0.000279,9.8e-05,0.000127,-4e-06,-5e-05,-5.4e-05,-0.000229,-0.000349,-0.000339,0.000453,-0.00043,-4.1e-05,-0.000265,0.000101
5.8e-05,-0.000102,-0.000208,1.9e-05,-0.000175,0.000138,0.000214,-8.2e-05,-0.000278,-3.1e-05,-3.7e-05,5.7e-05,0.00037,1.6e-05,1e-05,0.000106,-9.8e-05,0.000136,-3.1e-05,-0.000306,-0.000801,-1e-04,-0.000262,-0.000196,0.000419,6.8e-05,-0.00013,0.000762,0.000182,0.000215,0.00012,0.000154,0.000104,-4.3e-05,-5.1e-05,0.000305,-0.000303,-0.000161,-0.000279,-8.3e-05,-0.000178,-0.000129,-0.000437,-0.000303,0.000387,-0.000228,-0.000256,-0.000385,0.000693,0.000239,-9.2e-05,-8.3e-05,-7.1e-05,0.000406,0.000237,-0.000463,0.000266,0.000188,5.5e-05,0.000353,0.000329,0.00026,0.000145,0.000163,-3.9e-05,-0.00014,0.000425,-0.000244,-0.000111,-4e-06,-1e-06,4.8e-05,-7.9e-05,-6e-05,0.000128,0.000606,0.000358,0.000333,0.000324,-0.000304,0.000363,5e-05,-0.000276,0.000278,0.000356,0.000135,0.000465,-0.000108,0.000539,0.000354,0.000321,-6e-04,0.000207,-0.00023,0.000592,0.000197,-0.000141,-1.4e-05,-1.1e-05,0.00041,0.000209,-8.6e-05,-0.000344,-0.00025,5.2e-05,-0.000247,-0.000259,7.7e-05,2.6e-05,-7.4e-05,-7.1e-05,-7e-06,0.000134,-0.000146,0.000196,0.000132,-0.000471,7.3e-05,-4.6e-05,0.000156,2.2e-05
-5e-05,-4e-05,0.000119,-4.5e-05,0.000151,-2e-05,-0.000233,4.3e-05,6.7e-05,-1.7e-05,4.9e-05,1.9e-05,-0.000321,-2.5e-05,2e-05,-2e-05,8.3e-05,8e-06,-2.6e-05,0.000212,0.000581,5.4e-05,7.1e-05,7.7e-05,-0.000382,3.6e-05,-0.000246,-0.000517,-0.000226,-2.3e-05,0.000247,-0.000207,-8.8e-05,-5.7e-05,0.000342,-0.000222,-0.000149,3.3e-05,0.000673,0.000136,0.000367,0.000102,7.5e-05,0.000131,-0.000367,-0.000267,-0.000107,0.000571,-0.000493,-5e-06,0.000162,0.000156,-0.000207,-0.000117,-0.000156,0.000576,0.000227,-0.000134,-2.3e-05,-0.000295,-0.000571,-0.000291,-0.000131,-5e-05,0.000668,0.000273,-0.000367,0.000127,-0.000101,-0.000215,-0.000125,-0.000118,0.000134,-7.2e-05,-0.000134,-0.000272,-0.000264,-3.8e-05,-0.000341,0.000414,-0.000137,0.000267,0.000442,-0.000275,-0.00034,1.2e-05,-0.000243,0.000175,-0.00055,-0.00049,-0.000385,0.000597,3.8e-05,0.000417,-0.000494,-0.00023,0.000113,-0.000149,-0.000106,-0.000432,-0.000134,-1.7e-05,0.000241,7.9e-05,4.2e-05,-0.000113,0.000298,-3e-06,-5e-06,-1.6e-05,0.000241,7.4e-05,-0.000235,0.000143,-6.2e-05,0.000158,0.00047,0.000102,-4e-06,-7e-06,6e-05
1.7e-05,6.2e-05,-6.7e-05,-4.7e-05,-7.5e-05,0,0.000256,-4e-06,9.7e-05,6.5e-05,-3e-06,2.3e-05,0.000122,4.8e-05,-4.9e-05,-1.2e-05,-1.8e-05,-6.1e-05,0.000136,-2.7e-05,-0.000191,2.4e-05,-5e-06,-2e-06,0.000185,7.2e-05,0.000166,0.000235,0.000359,7.7e-05,-0.000233,0.000274,0.000287,0.000103,-0.000375,0.000281,0.000403,-6e-05,-0.000469,-0.000122,-0.000106,1.3e-05,0.00028,4.1e-05,0.000376,0.000255,0.000334,-0.000521,0.00014,0,-0.000301,0.00013,0.000152,-0.00016,-0.000148,-0.000299,-0.000226,-0.000186,-9.9e-05,-1.4e-05,0.000501,-5.5e-05,6.2e-05,-2e-06,-0.000818,-7.7e-05,0.000477,0.000106,0.000265,0.000459,4e-04,-9.7e-05,0.000221,6.3e-05,0.000248,-0.000116,7.7e-05,-0.000193,0.000263,-0.000177,-4.9e-05,-0.000512,-0.000394,5.7e-05,0.000272,-5.6e-05,0.000234,-7.8e-05,0.000439,-0.000108,0.000342,-0.000455,3e-05,-0.000327,0.000185,0.000119,-6e-05,7.9e-05,0.00015,0.000179,-0.000119,0.000105,-0.00022,0.000268,0.000139,0.000201,-0.000309,-0.000115,-2.5e-05,4.7e-05,-0.000193,-0.000164,7.8e-05,-8e-05,0.00022,-0.000127,-0.000325,9.9e-05,2.5e-05,-7.9e-05,8.2e-05
-6.4e-05,-2.3e-05,0.000124,2.7e-05,2.4e-05,-1.2e-05,-0.000148,-2e-05,-5e-05,-2.1e-05,-2.1e-05,-2.3e-05,3.7e-05,7.9e-05,3e-06,0.000113,1.7e-05,-9e-06,-0.000164,7.4e-05,-7.2e-05,-9.9e-05,-0.000111,-8e-05,-0.000129,-0.000118,0.000136,-0.00014,-0.000292,-0.000123,0.000125,-0.000201,-0.000192,-7.3e-05,0.000206,-0.000155,-0.000268,0.000112,0.000205,4e-05,-2.4e-05,-0.000117,-0.000386,-0.000188,-0.000275,0.000106,-0.000345,0.000264,-0.000163,-2.7e-05,0.00019,-0.000333,-0.000195,0.000221,0.000381,2e-04,8.7e-05,0.000251,8.8e-05,2.4e-05,-0.000439,-4.3e-05,7.7e-05,-3e-05,0.000468,1e-06,-0.000317,-0.000261,-0.000115,-0.000296,-0.000467,1e-04,-0.000252,5.3e-05,-0.000166,0.000171,-0.000122,6.9e-05,-7.8e-05,-0.000171,0.000113,0.000393,0.000105,-0.000125,-0.00033,-0.000164,-0.000215,6e-05,-0.000283,0.000255,-2.3e-05,0.000104,-0.000162,0.000183,-8.7e-05,2.6e-05,5.4e-05,8.7e-05,-3.6e-05,-6.9e-05,0.000178,2.4e-05,1.4e-05,-0.000178,-7e-05,-1.4e-05,0.000367,0.00014,1e-05,1.4e-05,0.000137,1.9e-05,-3.3e-05,4.1e-05,-0.000223,-3.7e-05,7.8e-05,-0.000267,-1.4e-05,-4.7e-05,-0.000135
4.7e-05,-1e-05,-3e-05,2.4e-05,-7.1e-05,7e-06,0.000146,1.7e-05,3.1e-05,-7e-05,2.3e-05,-4.5e-05,-6.7e-05,-0.00011,-2.3e-05,-1.6e-05,-4.8e-05,-1e-05,9.2e-05,-0.000136,7e-05,0.000119,0.00013,-6e-06,7.4e-05,0.000138,-0.000167,8.3e-05,0.000292,1.7e-05,-6e-05,6.2e-05,7.8e-05,0.000129,-4.2e-05,0.000116,0.000227,5e-05,1.7e-05,-7.1e-05,4.9e-05,-9.2e-05,0.000194,0.000151,0.000119,-0.000406,0.000289,-6.8e-05,0.000256,2.7e-05,-6.4e-05,0.000241,1.8e-05,-0.000169,-0.000215,-0.000127,-3.2e-05,-3e-06,2e-06,1.2e-05,0.000516,0.000116,-7.1e-05,4.1e-05,-0.000135,8.9e-05,8.8e-05,0.000247,-3.1e-05,4.7e-05,0.000251,1e-06,0.000114,-3.3e-05,9.8e-05,-5.4e-05,0.000203,0,0.000122,0.000154,-8.8e-05,-0.00035,-1.1e-05,9e-06,0.000289,2e-04,-0.000128,0.000108,0.000265,-0.000131,-9e-06,4.5e-05,-4.7e-05,-0.000142,4.4e-05,-5.3e-05,1.2e-05,-0.000191,1.2e-05,9.4e-05,-0.000111,-0.000125,-1.7e-05,0.000121,4.8e-05,-8.9e-05,-8.8e-05,7.8e-05,1e-04,-0.000147,-0.000158,-3.6e-05,6.7e-05,2.2e-05,9.3e-05,0.000111,6.6e-05,0.000251,4.4e-05,3.2e-05,-2e-06
6e-06,1.1e-05,3e-06,-1.4e-05,5.9e-05,4e-05,-6e-05,-9e-06,-9e-06,7.6e-05,-4.7e-05,4.9e-05,2e-05,8.4e-05,6.9e-05,-1.3e-05,5.9e-05,3.7e-05,5e-05,6.3e-05,-1.7e-05,-0.000147,-3.8e-05,3.3e-05,0.000117,-0.000165,0.00012,0.000126,-0.000318,-1e-05,-3.2e-05,-1.6e-05,-1.9e-05,-9.1e-05,-8.9e-05,-6.4e-05,-0.000168,1.1e-05,-4.4e-05,0.000107,-9e-05,6.9e-05,-4.4e-05,-3.2e-05,-1.8e-05,0.000125,-0.000109,-6.1e-05,-4.1e-05,-5.4e-05,-3.8e-05,-0.000181,9e-05,9.6e-05,8.7e-05,6.2e-05,4.2e-05,-0.000114,-3.8e-05,4.7e-05,-0.000394,-1.1e-05,-9.3e-05,-2e-06,-5.8e-05,-0.00025,-3.6e-05,-0.000164,3e-05,1.9e-05,-2e-05,6e-06,4.6e-05,-6.3e-05,-5e-05,-4.8e-05,-0.000232,7.9e-05,-0.000191,-2.6e-05,0.000116,0.000329,-0.000194,0.000194,-4.2e-05,-1.6e-05,0.000307,-0.000138,-0.000336,-5.8e-05,-1.2e-05,5e-05,0.000143,0.000173,-3.2e-05,-2.6e-05,1.1e-05,0.000161,3.3e-05,-4.8e-05,-1.8e-05,3.8e-05,4.7e-05,6.4e-05,-0.000128,1.9e-05,3.6e-05,-0.000212,-0.000104,4.9e-05,0.000101,-1.9e-05,-2.6e-05,-6.5e-05,-1.5e-05,-0.000143,-0.00012,-0.000162,-7.8e-05,-1.3e-05,9.6e-05
6e-06,1.1e-05,1.3e-05,-2.3e-05,3e-06,-3.7e-05,-9e-06,0,-1.8e-05,-4.1e-05,2.4e-05,-2.5e-05,4.1e-05,-0.000106,-0.000108,1.2e-05,-4.8e-05,-3.8e-05,-0.000145,-2.7e-05,-3.8e-05,0.000192,1.3e-05,1.4e-05,-0.000148,0.000103,-1e-04,-0.000272,0.000153,-3.9e-05,9e-05,-3e-06,-2.6e-05,6.7e-05,0.000119,-6e-06,0.000117,-2.4e-05,4e-05,4.4e-05,4.4e-05,-1.3e-05,0.000124,-4.2e-05,-7.5e-05,0.000101,-8.2e-05,0.000192,-0.000148,1.5e-05,1.3e-05,9.8e-05,-5.8e-05,-4.5e-05,-0.000105,-3.2e-05,-6e-05,9.2e-05,-2e-06,-5e-06,0.000269,6.7e-05,9.3e-05,3.6e-05,8e-05,0.000124,-2.6e-05,4e-06,-1.6e-05,-8e-06,-3.7e-05,8.3e-05,-6.8e-05,2.3e-05,0,1.7e-05,0.000157,-4.2e-05,0.000112,-8.7e-05,-0.000113,-0.000195,0.000206,-0.000234,1.4e-05,-3.4e-05,-0.000101,4.7e-05,0.000307,0.000105,-6.6e-05,-0.000222,-0.000201,-0.000207,1.9e-05,-5.1e-05,-2.1e-05,-0.00012,-5.9e-05,1.1e-05,4.3e-05,3.2e-05,-7.6e-05,-0.000158,8.5e-05,1.5e-05,2.4e-05,0.000227,5.6e-05,4.4e-05,-4e-05,-2.2e-05,2.2e-05,6.8e-05,1.9e-05,1e-04,4.3e-05,0.000109,3e-06,6e-06,-0.000161
3.6e-05,-3e-06,4.6e-05,-1.1e-05,-1.9e-05,1.8e-05,4.4e-05,-1.8e-05,2.3e-05,3e-06,-5e-06,-2e-06,-6.2e-05,0.000113,9.2e-05,-1.9e-05,-2e-06,7e-06,0.000119,9e-06,6.1e-05,-0.000173,3e-05,1.1e-05,8.7e-05,-1e-04,3.3e-05,0.000134,-1.8e-05,7.7e-05,-3.9e-05,3e-06,1e-06,-8.1e-05,-7.3e-05,4.1e-05,-0.000103,8e-06,3.4e-05,-4.2e-05,-7.7e-05,3e-05,-3.7e-05,5e-06,0.000115,-6.9e-05,-6e-06,-0.000224,0.000246,-2e-06,1.2e-05,-1.7e-05,4.3e-05,1e-05,7e-06,0.000101,4.4e-05,-9.2e-05,8.4e-05,-1e-04,-0.000231,-2.3e-05,5.3e-05,-3.9e-05,5.5e-05,3.7e-05,1e-06,-5.6e-05,7e-06,1e-05,-5.3e-05,-5.4e-05,-2.1e-05,5e-05,2e-05,-3.1e-05,-2.2e-05,9e-06,-4.6e-05,0.00015,7.2e-05,6.3e-05,-3.6e-05,0.000135,-9.2e-05,6.6e-05,-6.8e-05,-9.6e-05,-0.000189,-4.8e-05,8.1e-05,0.000144,0.000177,8.4e-05,-6e-06,4e-05,4e-06,0.000133,4.3e-05,-5.4e-05,-6e-06,-7e-05,0.000111,0.000101,3.4e-05,2e-06,-4e-05,-0.000136,-5.2e-05,-6.1e-05,4e-06,-1.1e-05,-9e-06,-4e-05,2e-05,-5.1e-05,1.1e-05,-3.3e-05,2.7e-05,0,0.000162
-2.4e-05,-6e-06,-1.3e-05,-7e-06,-1.3e-05,9e-06,-4.1e-05,3e-05,-5.5e-05,1.2e-05,-2.1e-05,-2.8e-05,1.9e-05,-6.8e-05,-2.4e-05,-8e-06,-8e-06,1.8e-05,-4.5e-05,-3.4e-05,-5.2e-05,0.000102,-1.8e-05,2e-06,-6.9e-05,6.5e-05,3.7e-05,-7e-06,-8e-06,-1.5e-05,1.6e-05,-1.5e-05,3.8e-05,4.8e-05,2.2e-05,-0.000109,3.9e-05,0,-4.5e-05,-1e-05,6.7e-05,-5.8e-05,-2e-05,1.2e-05,-8.5e-05,-1.6e-05,0.000124,8.8e-05,-0.00023,2.3e-05,2e-06,-4e-06,6.2e-05,-2.6e-05,4.6e-05,-0.000167,1.4e-05,0.000113,-3.9e-05,4.6e-05,0.00017,-2.7e-05,-3.3e-05,3.3e-05,-8.5e-05,-3.4e-05,-1.6e-05,8.1e-05,-1e-05,-4.1e-05,2.6e-05,3e-05,8.1e-05,-3.5e-05,-2.3e-05,5.2e-05,-3.9e-05,-5e-06,3.8e-05,-0.000117,-1.5e-05,-4.3e-05,-0.000101,4.5e-05,5.5e-05,-5.4e-05,0.000146,6.8e-05,5.1e-05,7.7e-05,-7.5e-05,-3.5e-05,-6.8e-05,-4e-05,-5.8e-05,-1.6e-05,2.5e-05,-5.2e-05,-4.3e-05,-7e-06,2.1e-05,0.000137,-0.000121,-0.00012,-4.4e-05,7e-06,-1e-06,0.00011,6.6e-05,7.3e-05,1.6e-05,4.8e-05,0,3e-06,-2.3e-05,9e-06,-2.4e-05,1.1e-05,8e-06,2.4e-05,-6.4e-05
2.3e-05,6e-06,3e-06,1.2e-05,1.6e-05,-1.7e-05,1.2e-05,-1.1e-05,4.4e-05,-1.9e-05,2.7e-05,1.9e-05,-1e-05,-6e-06,-1.6e-05,4e-06,1.6e-05,-1.8e-05,6e-06,2.6e-05,5.4e-05,-4.8e-05,-1.1e-05,-7e-06,4.1e-05,-6.5e-05,-6.3e-05,1.7e-05,3.2e-05,5e-06,-2.9e-05,3.8e-05,-2.4e-05,-3.3e-05,-4e-06,8.9e-05,-2e-06,-4.9e-05,3e-05,2.6e-05,-4.5e-05,-1.5e-05,-5.4e-05,2.4e-05,1.8e-05,7.5e-05,-0.000109,6.2e-05,0.000145,-4.3e-05,3.3e-05,0,-2.5e-05,-9e-06,-2.2e-05,0.000121,-3.9e-05,-9.6e-05,-3.8e-05,2.3e-05,-8.5e-05,-2.8e-05,-1.8e-05,-1.2e-05,1e-06,-1e-06,3.3e-05,-5.7e-05,2e-06,6.4e-05,-2.6e-05,1.7e-05,-3.9e-05,1.9e-05,2e-06,-3.8e-05,6.1e-05,1.2e-05,-4.5e-05,4.2e-05,-4e-05,4.5e-05,0.000137,-1.5e-05,-2.3e-05,-3e-05,-0.000148,1.1e-05,8e-06,-7.6e-05,4e-05,2.2e-05,-2e-06,4.6e-05,3.9e-05,8e-06,-5.6e-05,-6e-06,4e-05,-5e-06,-3.4e-05,-8.3e-05,0.000143,8.5e-05,1.2e-05,-2.5e-05,-5.7e-05,-8.1e-05,-6.3e-05,-1.2e-05,-3.9e-05,1.1e-05,6e-06,2.3e-05,2.6e-05,2.8e-05,1.5e-05,3e-06,-2e-06,-2.5e-05,-1.1e-05
-3.4e-05,2e-06,2e-06,3e-06,1.4e-05,1.2e-05,-2.4e-05,3.4e-05,-2e-05,1.7e-05,-1.5e-05,1.6e-05,7e-06,1.1e-05,3.4e-05,-1.5e-05,-1.2e-05,1e-06,3e-05,4e-06,-4.4e-05,2.2e-05,-1.1e-05,3e-06,-1.9e-05,8.9e-05,1.3e-05,-9e-06,-5.8e-05,-4e-06,1e-05,-2e-06,2e-05,2.8e-05,-6e-06,-5e-05,-1.8e-05,3e-05,-6.1e-05,-2.7e-05,1.7e-05,5.7e-05,4.4e-05,-3e-05,7e-06,-4.6e-05,7e-06,-9.4e-05,-7.2e-05,3.9e-05,-3.8e-05,1.6e-05,-3.5e-05,2.6e-05,0,-6.8e-05,-1.2e-05,3.1e-05,2.9e-05,-7e-06,3.9e-05,2.8e-05,-3e-05,-1.6e-05,-2.6e-05,3.2e-05,-3.2e-05,8e-05,1.5e-05,-2.9e-05,4.8e-05,-2.5e-05,8e-06,-1.6e-05,-1e-05,3.2e-05,-3.5e-05,2e-05,3e-05,-7e-06,6.2e-05,7e-06,-9e-05,1.2e-05,8e-06,7.4e-05,4.5e-05,-2.6e-05,-8e-06,5.4e-05,-3e-06,-3.3e-05,-9e-06,-3.2e-05,-1.9e-05,1.7e-05,3.5e-05,1.1e-05,-4e-06,1.3e-05,3.3e-05,2.4e-05,-0.000122,-4.8e-05,3.4e-05,1e-06,3.4e-05,3.6e-05,4.6e-05,-2.1e-05,3.9e-05,-6e-06,-1.5e-05,-2.1e-05,-1.6e-05,-3.7e-05,2.1e-05,-3e-05,-9e-06,1.8e-05,4.7e-05
-6e-06,-6e-06,-6e-06,-1.4e-05,-4e-06,-7e-06,2.8e-05,-2.3e-05,6e-06,-6e-06,-3e-06,3e-06,-2e-06,1.2e-05,-3.2e-05,1e-05,-3e-06,8e-06,-3.3e-05,1e-06,-4e-06,-2.1e-05,1e-05,4e-06,2e-06,-6e-05,3.4e-05,-2.9e-05,3.3e-05,-1.8e-05,6e-06,-9e-06,-4e-06,-1.5e-05,2.6e-05,4.1e-05,5.8e-05,-6e-06,2e-05,1.2e-05,2e-06,-9e-06,-1.9e-05,-5e-06,-2.4e-05,-2.7e-05,2.6e-05,4.6e-05,2.6e-05,-4.3e-05,1.7e-05,-2.7e-05,4e-05,-3.6e-05,1.4e-05,2.7e-05,1.5e-05,1.3e-05,-2.1e-05,-1.5e-05,-2e-05,1.8e-05,-5e-06,1.5e-05,6.2e-05,-9e-06,3.3e-05,-7.1e-05,-2.6e-05,1.9e-05,-4e-05,3e-06,-4.9e-05,0,1.5e-05,-2.9e-05,5.5e-05,-3.2e-05,1.6e-05,1.3e-05,-5.3e-05,-1.7e-05,5.7e-05,-6e-05,-1.7e-05,-9e-06,2.2e-05,3e-05,3e-06,-2.9e-05,-1.3e-05,4.3e-05,1.4e-05,3.2e-05,2.9e-05,-1.9e-05,-3.1e-05,-2e-05,-1.8e-05,-6e-06,-1.1e-05,5e-06,7.7e-05,7e-06,-4.4e-05,2e-05,-3e-05,8e-06,-2.6e-05,1.3e-05,-1e-06,1e-05,6e-06,1.4e-05,-8e-06,1.4e-05,-2.4e-05,1.9e-05,-6e-06,-1.8e-05,-4.4e-05
7e-06,1e-06,6e-06,3e-06,-1.7e-05,1.9e-05,-1.2e-05,2.1e-05,-3e-06,-8e-06,3e-06,-7e-06,3e-06,-4.2e-05,1.9e-05,-8e-06,-3e-06,-4e-06,1.2e-05,-7e-06,3.6e-05,3e-05,0,-1e-05,2.7e-05,2.9e-05,-2.1e-05,2.7e-05,-7e-06,1.7e-05,3e-06,-1.1e-05,-1.4e-05,-1.1e-05,-2e-05,-2.5e-05,-3.9e-05,1.9e-05,4e-06,1.5e-05,1.5e-05,1.1e-05,-6e-06,1.1e-05,3.8e-05,5.3e-05,1e-05,-2.1e-05,2.9e-05,3.9e-05,2e-06,2.9e-05,-2.2e-05,4.3e-05,-1.9e-05,-8e-06,1.4e-05,-1.8e-05,2.2e-05,8e-06,-8e-06,-1.8e-05,8.4e-05,1.3e-05,-3e-05,-2.5e-05,-2.4e-05,4.5e-05,8e-06,-3.1e-05,1.7e-05,-4e-06,5e-05,1.4e-05,-1.2e-05,7e-06,-5.8e-05,1e-05,-2.9e-05,1.8e-05,2.4e-05,1.2e-05,3e-06,4.7e-05,1.1e-05,-1.5e-05,-2e-06,-2.8e-05,1.1e-05,1e-06,2.1e-05,-5e-06,3.6e-05,-1.1e-05,-3.4e-05,-3e-06,1.7e-05,2.8e-05,1.7e-05,-1e-05,3e-06,-2.8e-05,-4.4e-05,-2.1e-05,-7e-06,-1.5e-05,3.6e-05,-2.1e-05,2e-05,-7e-06,-8e-06,9e-06,-1e-06,-1e-06,6e-06,1.2e-05,4.8e-05,-1.7e-05,1e-05,2.1e-05,2.1e-05
-7e-06,4e-06,-6e-06,1e-06,1e-05,6e-06,6e-06,-1.8e-05,9e-06,1e-05,-1e-05,-7e-06,2e-06,3.9e-05,-1.8e-05,6e-06,1e-05,2e-06,1.2e-05,0,-3.1e-05,-4.8e-05,1e-06,-5e-06,-3.2e-05,-1.1e-05,-3e-06,-1.6e-05,0,-6e-06,-1.7e-05,1.5e-05,1.1e-05,1.3e-05,7e-06,1e-05,1e-06,3e-06,-9e-06,-9e-06,9e-06,1.2e-05,2.6e-05,-1e-06,-2.5e-05,-3e-05,-2.2e-05,-4e-06,-4.8e-05,-3.5e-05,5e-06,3e-06,-5e-06,-4.7e-05,1.2e-05,9e-06,-1.7e-05,-1.2e-05,-5e-06,-8e-06,4.7e-05,-1.2e-05,-8.4e-05,-1.2e-05,-1.6e-05,2.4e-05,1.6e-05,-3.1e-05,-8e-06,1.9e-05,-2.1e-05,6e-06,-2.9e-05,-6e-06,2e-06,1.8e-05,4.8e-05,-1.3e-05,1.3e-05,-2.8e-05,5e-06,-2.4e-05,-4.5e-05,-1.7e-05,8e-06,-7e-06,-8e-06,2e-06,-6e-06,3e-06,-3.2e-05,-5e-06,-3.5e-05,1.5e-05,1.3e-05,2.3e-05,-6e-06,-3.9e-05,-9e-06,1.2e-05,-8e-06,2.6e-05,3.4e-05,4e-05,3.2e-05,-5e-06,-2.8e-05,2e-06,-2.6e-05,-8e-06,1.4e-05,-9e-06,1.7e-05,0,-3e-06,-4e-06,-4.7e-05,3.3e-05,-1e-06,-2.1e-05,-4e-06
1.6e-05,-3e-06,-2e-06,6e-06,1e-06,-8e-06,-1.8e-05,1.2e-05,-1.1e-05,-5e-06,6e-06,3e-06,-1.8e-05,-2.3e-05,1.2e-05,3e-06,-2e-06,-6e-06,-1.8e-05,0,3e-06,5e-05,-3e-06,3e-06,2.5e-05,-1e-05,1.1e-05,1.8e-05,1e-06,9e-06,1.7e-05,-6e-06,-6e-06,-9e-06,1.9e-05,5e-06,2.4e-05,-7e-06,1e-05,-7e-06,-1.5e-05,-2e-05,-2.2e-05,-1.6e-05,3e-06,-3e-06,5e-06,4.2e-05,5e-05,2.9e-05,0,-1.9e-05,7e-06,3.9e-05,-9e-06,-1e-05,-4e-06,5.7e-05,-8e-06,1.3e-05,-6e-05,4e-06,4.5e-05,2e-06,3.8e-05,-2.3e-05,-1.2e-05,1.5e-05,8e-06,3e-06,1.8e-05,9e-06,1.8e-05,-8e-06,-4e-06,-3e-05,-3.4e-05,2.1e-05,-1.6e-05,-1.1e-05,-1.8e-05,2.7e-05,7.1e-05,-8e-06,-4e-06,1.5e-05,-2.7e-05,1.5e-05,-2.7e-05,-5e-06,2.1e-05,1e-05,3e-06,-2.6e-05,5e-06,-1.6e-05,0,2.2e-05,3e-06,-1e-06,2e-06,-1.4e-05,-2.7e-05,-1.7e-05,-9e-06,1.1e-05,1.6e-05,1e-05,1.7e-05,1e-06,-7e-06,-1.4e-05,-8e-06,1.2e-05,8e-06,6e-06,3.3e-05,-2.6e-05,-3e-06,7e-06,4e-06
-4e-06,-1e-06,-1e-06,-2e-06,1e-06,0,1.2e-05,-7e-06,6e-06,-6e-06,-4e-06,3e-06,2.9e-05,2e-06,-1.1e-05,-1.2e-05,-3e-06,7e-06,7e-06,4e-06,8e-06,-3.1e-05,9e-06,4e-06,-2.3e-05,1.8e-05,-1.6e-05,-2e-06,6e-06,-6e-06,-1.2e-05,-2e-06,7e-06,1.4e-05,-2.7e-05,-1.5e-05,-2.4e-05,7e-06,-1.1e-05,-1e-06,7e-06,1.1e-05,4e-06,1.2e-05,6e-06,7e-06,-5e-06,-5.1e-05,-6.1e-05,-1.9e-05,-1.2e-05,1.6e-05,-2e-05,-2.4e-05,1e-06,1.7e-05,2e-05,-7.2e-05,-4e-06,3e-06,4.1e-05,1.1e-05,-2.6e-05,8e-06,-4.3e-05,2.8e-05,9e-06,-1e-06,4e-06,-1.3e-05,-8e-06,-1e-05,-9e-06,5e-06,3e-06,2e-05,6e-06,1e-06,2.8e-05,2.7e-05,1.8e-05,-7e-06,-6.1e-05,4e-06,-3e-06,-8e-06,2.1e-05,-1.3e-05,4.9e-05,1.9e-05,-1.9e-05,7e-06,-5e-06,1.9e-05,0,-4e-06,1.2e-05,-1.3e-05,-5e-06,-2e-06,0,6e-06,3.1e-05,-7e-06,6e-06,4e-06,-6e-06,3e-06,2e-06,1.2e-05,-6e-06,4e-06,1e-06,-1.4e-05,-5e-06,-1.6e-05,-2.5e-05,2.2e-05,-1e-06,6e-06,-1.4e-05
3e-06,2e-06,-2e-06,-6e-06,-6e-06,-7e-06,-6e-06,4e-06,-1e-05,9e-06,0,-4e-06,-2.8e-05,9e-06,5e-06,1.3e-05,-1e-06,-5e-06,1.7e-05,-4e-06,-1e-06,2e-06,-6e-06,-1e-06,1.5e-05,-1.1e-05,1.9e-05,-2.5e-05,-1e-05,-2e-06,3e-06,6e-06,0,-2.3e-05,1.7e-05,2.3e-05,-2e-06,-1.4e-05,-6e-06,6e-06,3e-06,-3e-06,0,3e-06,-6e-06,8e-06,1e-05,1.6e-05,3.4e-05,1.4e-05,3e-06,1e-06,1e-05,3e-06,6e-06,-1.5e-05,-4e-06,5e-05,1e-05,-7e-06,-4e-05,3e-06,8e-06,-4e-06,2e-06,-2.4e-05,-3e-06,-1e-05,1e-06,9e-06,2.2e-05,4e-06,1e-05,5e-06,6e-06,-3e-06,1.4e-05,-7e-06,-2.9e-05,-1.4e-05,-1.8e-05,-3e-06,9e-06,3e-06,-2e-06,-2e-06,-1e-06,1.1e-05,-3.9e-05,-2.2e-05,1.5e-05,-2e-05,1.3e-05,-8e-06,1e-06,1.2e-05,-1.1e-05,9e-06,-3e-06,-8e-06,6e-06,1.1e-05,-3e-05,1.6e-05,-1.5e-05,-2e-06,-2e-05,-1.5e-05,-1e-05,-1.5e-05,1.4e-05,-1e-06,-2e-06,0,1e-06,1.5e-05,1e-05,-2.3e-05,0,-6e-06,2.2e-05
-4e-06,-1e-06,-4e-06,3e-06,1e-06,1.2e-05,1e-06,-5e-06,7e-06,-7e-06,-2e-06,-6e-06,5e-06,-1.1e-05,0,-5e-06,5e-06,0,-2.7e-05,0,2e-06,1e-05,0,-1e-06,-6e-06,1e-05,-4e-06,1.8e-05,5e-06,-5e-06,9e-06,-1.2e-05,-2e-06,2.4e-05,-1e-06,-1.7e-05,1.6e-05,3e-06,-3e-06,2e-06,0,-1e-06,5e-06,-9e-06,-1e-06,-2.8e-05,-6e-06,2.2e-05,-2.2e-05,-1.3e-05,-4e-06,-1e-05,8e-06,1.2e-05,-4e-06,1.4e-05,-1e-05,-2.6e-05,1e-06,-9e-06,4.8e-05,-1e-06,1.8e-05,-6e-06,4.6e-05,2.7e-05,-4e-06,2e-05,-5e-06,-1e-05,-1.9e-05,-1e-06,-2.3e-05,-3e-06,-8e-06,-7e-06,-3e-05,-3e-06,2.1e-05,2e-06,1.5e-05,2e-06,2.5e-05,1e-05,3e-06,5e-06,6e-06,-5e-06,2.2e-05,1.2e-05,3e-06,1e-06,-6e-06,5e-06,0,-5e-06,-3e-06,1e-06,4e-06,1.2e-05,-1e-06,-2.1e-05,2.7e-05,-1.5e-05,6e-06,-1e-05,1.9e-05,5e-06,6e-06,-2e-06,-1.6e-05,-2e-06,6e-06,3e-06,2e-06,7e-06,-6e-06,1.3e-05,3e-06,8e-06,-1.3e-05
-3e-06,-1e-06,-1e-06,1e-06,1e-06,-4e-06,4e-06,2e-06,-1e-06,1e-06,2e-06,3e-06,1.3e-05,4e-06,-6e-06,-2e-06,-3e-06,4e-06,2.3e-05,5e-06,-9e-06,3e-06,0,3e-06,-4e-06,-4e-06,-1.5e-05,-3e-06,-2e-06,4e-06,-1.5e-05,9e-06,1e-06,-2.1e-05,-6e-06,1.9e-05,-1.1e-05,-3e-06,9e-06,-3e-06,-6e-06,8e-06,-2e-06,0,5e-06,2e-05,-1e-06,-4e-05,1.6e-05,1.1e-05,1.4e-05,1e-05,-7e-06,-2.1e-05,4e-06,-1e-05,3e-06,1.5e-05,-9e-06,8e-06,-3.9e-05,-1e-05,-2.2e-05,2e-06,-3.5e-05,-2.4e-05,9e-06,-2.5e-05,-2e-06,1.7e-05,7e-06,-3e-06,1.6e-05,-4e-06,0,5e-06,3.2e-05,-8e-06,-1.7e-05,8e-06,-6e-06,-1e-05,-4.2e-05,-3e-06,0,-1e-06,6e-06,5e-06,-2.8e-05,7e-06,-1e-05,1.5e-05,-6e-06,-4e-06,9e-06,-5e-06,1e-05,-7e-06,-2e-06,-6e-06,-5e-06,1.5e-05,-2.8e-05,1.4e-05,-4e-06,1e-06,-1.8e-05,6e-06,-7e-06,2.3e-05,7e-06,-3e-06,-2e-06,-2e-06,-3e-06,-2.1e-05,5e-06,-1.2e-05,1e-06,-9e-06,0
0,1e-06,-3e-06,1e-06,-1e-06,3e-06,-5e-06,1e-06,0,2e-06,-5e-06,3e-06,-1.4e-05,0,1.3e-05,9e-06,2e-06,-6e-06,-6e-06,-1e-06,4e-06,-1.5e-05,-1e-06,0,1.1e-05,5e-06,1.7e-05,8e-06,-3e-06,1e-06,1.7e-05,-2e-06,-3e-06,1.7e-05,6e-06,-1.8e-05,1.1e-05,-1e-06,-1.3e-05,-1e-06,1e-06,-1e-05,0,7e-06,-1e-05,7e-06,8e-06,2.8e-05,-3e-06,-1e-05,-1.3e-05,-8e-06,5e-06,2.3e-05,-5e-06,9e-06,7e-06,-9e-06,6e-06,5e-06,2.3e-05,-6e-06,7e-06,7e-06,0,1.4e-05,-1.2e-05,2.6e-05,2e-06,-1.7e-05,-6e-06,7e-06,4e-06,1e-06,5e-06,-1e-06,-2.7e-05,1.4e-05,2e-05,-9e-06,-5e-06,1.1e-05,2.7e-05,-5e-06,3e-06,-4e-06,-2.6e-05,3e-06,3.1e-05,-1.6e-05,1e-05,-9e-06,1.1e-05,1e-05,-1.9e-05,6e-06,-1.6e-05,1.4e-05,0,-1e-06,6e-06,-5e-06,2.2e-05,-1.6e-05,9e-06,1.2e-05,1e-05,-2e-06,1.3e-05,-1.7e-05,-5e-06,8e-06,0,6e-06,4e-06,1.5e-05,-6e-06,1.1e-05,-2e-06,1.7e-05,9e-06
-2e-06,0,1e-06,-2e-06,2e-06,0,6e-06,-1e-06,0,-3e-06,2e-06,0,5e-06,-1e-06,-1.6e-05,-6e-06,-2e-06,4e-06,-1e-05,-3e-06,1e-05,1.2e-05,-1e-06,-4e-06,-1e-05,-1.3e-05,-2e-06,-9e-06,9e-06,1e-06,-1.4e-05,-2e-06,0,-4e-06,-4e-06,1.2e-05,-5e-06,5e-06,1.9e-05,0,5e-06,-9e-06,-9e-06,0,9e-06,-1.1e-05,-3e-06,-3e-06,-1e-06,9e-06,1e-06,6e-06,1e-06,-2.2e-05,1e-06,-7e-06,-3e-06,6e-06,-7e-06,-1e-06,-1.7e-05,6e-06,-1e-06,-4e-06,1.2e-05,-5e-06,5e-06,-2.9e-05,-4e-06,8e-06,1.1e-05,-5e-06,-2.1e-05,4e-06,1e-06,2e-06,2.5e-05,-1e-06,-1.8e-05,-1e-06,1.1e-05,-2e-06,-8e-06,3e-06,-8e-06,-1e-06,1.8e-05,-1.4e-05,-3e-05,1e-05,-1.3e-05,-1.7e-05,-1.2e-05,-6e-06,1.6e-05,0,7e-06,-1.1e-05,2e-06,1e-06,3e-06,-2e-06,-1.6e-05,1.3e-05,-1.1e-05,-5e-06,9e-06,-8e-06,-1.9e-05,5e-06,-6e-06,2e-06,-1e-06,-3e-06,-5e-06,-4e-06,1.3e-05,-4e-06,-2e-06,-1.6e-05,-1.3e-05
3e-06,0,-3e-06,-3e-06,1e-06,-2e-06,-7e-06,4e-06,1e-06,1e-06,-3e-06,0,0,-2e-06,1.4e-05,2e-06,0,-4e-06,1.8e-05,0,-2e-05,3e-06,2e-06,-1e-06,1.4e-05,8e-06,-1e-05,-9e-06,-8e-06,-1e-06,5e-06,3e-06,1e-06,-3e-06,5e-06,-9e-06,0,-3e-06,-1.1e-05,0,-4e-06,6e-06,6e-06,-5e-06,2e-06,-4e-06,-9e-06,-1.5e-05,9e-06,-7e-06,-2e-06,-3e-06,-4e-06,2.1e-05,4e-06,1e-06,-8e-06,-4e-06,4e-06,-7e-06,2e-05,9e-06,1.4e-05,-5e-06,-1.2e-05,-9e-06,-3e-06,2.8e-05,9e-06,-3e-06,-6e-06,-2e-06,2.7e-05,0,-5e-06,-4e-06,-2.1e-05,-1e-06,1.3e-05,4e-06,-1.2e-05,0,-9e-06,4e-06,6e-06,1e-05,-1.5e-05,1e-05,3.4e-05,-6e-06,1.1e-05,1.2e-05,9e-06,0,-3e-06,-3e-06,3e-06,1.1e-05,1e-06,6e-06,-4e-06,1.2e-05,1.5e-05,-7e-06,7e-06,-7e-06,-1e-05,1.3e-05,2.2e-05,9e-06,1.3e-05,-1e-06,0,1e-06,4e-06,-4e-06,-1.3e-05,1e-06,1e-06,9e-06,7e-06
-2e-06,1e-06,-1e-06,2e-06,-2e-06,-1e-06,7e-06,-3e-06,-1e-06,3e-06,2e-06,0,-2e-06,4e-06,-8e-06,4e-06,-2e-06,3e-06,-1.4e-05,0,1.7e-05,-1e-05,1e-06,3e-06,-1.2e-05,-9e-06,9e-06,2.2e-05,3e-06,0,4e-06,1e-06,1e-06,-2e-06,-6e-06,4e-06,-2e-06,9e-06,1e-06,2e-06,-5e-06,2e-06,3e-06,2e-06,-1.1e-05,2.1e-05,8e-06,2.2e-05,-1.1e-05,6e-06,1.2e-05,-2e-06,4e-06,-1.6e-05,-5e-06,1e-06,7e-06,9e-06,5e-06,0,-1.5e-05,-1e-06,-2.7e-05,5e-06,1.1e-05,1.1e-05,3e-06,-2.8e-05,-2e-06,3e-06,2e-06,3e-06,-1.9e-05,-4e-06,1e-06,5e-06,1.3e-05,-5e-06,-1.1e-05,0,9e-06,2e-06,2.1e-05,-1.3e-05,-2e-06,-6e-06,1.3e-05,-1e-06,-2.7e-05,7e-06,-7e-06,7e-06,-5e-06,-1e-06,1e-06,2e-06,-4e-06,-1.1e-05,0,-4e-06,-1e-06,-1.3e-05,-1.6e-05,4e-06,3e-06,4e-06,1.5e-05,-9e-06,-1.7e-05,-1.1e-05,-1.3e-05,1e-06,4e-06,3e-06,-4e-06,5e-06,8e-06,0,1e-06,-4e-06,3e-06
3e-06,0,1e-06,1e-06,0,2e-06,-3e-06,5e-06,1e-06,-6e-06,-1e-06,-1e-06,3e-06,-8e-06,2e-06,-4e-06,2e-06,-1e-06,3e-06,0,-8e-06,8e-06,0,0,5e-06,1.2e-05,-4e-06,-1.6e-05,4e-06,-1e-06,-8e-06,-1e-06,-1e-06,5e-06,2e-06,3e-06,-2e-06,-8e-06,6e-06,0,4e-06,4e-06,-2e-06,4e-06,1.2e-05,-1.6e-05,4e-06,-2.5e-05,9e-06,-3e-06,-7e-06,0,0,8e-06,4e-06,-1e-06,5e-06,-1.7e-05,-9e-06,4e-06,1e-06,-7e-06,2.1e-05,3e-06,-8e-06,0,-4e-06,3e-05,-1e-06,-1e-06,-6e-06,-4e-06,1.5e-05,-2e-06,2e-06,0,0,-3e-06,1e-05,2e-06,-3e-06,-1.1e-05,-2e-05,1.7e-05,3e-06,0,1.5e-05,-2e-06,1.5e-05,-7e-06,2e-06,-1.1e-05,5e-06,-1e-06,-1e-05,-1e-06,7e-06,3e-06,0,-1e-06,2e-06,9e-06,1.7e-05,-6e-06,-6e-06,5e-06,-9e-06,3e-06,1.1e-05,1e-06,4e-06,2e-06,-2e-06,-4e-06,3e-06,-7e-06,-5e-06,-5e-06,1e-06,3e-06,-6e-06
-1e-06,0,-3e-06,-1e-06,1e-06,2e-06,4e-06,-5e-06,-4e-06,5e-06,-1e-06,-1e-06,-3e-06,1e-05,2e-06,1e-06,0,-1e-06,7e-06,0,2e-06,-3e-06,1e-06,-1e-06,0,-8e-06,-1e-06,1.1e-05,-1.3e-05,-1e-06,8e-06,1e-06,0,3e-06,6e-06,-7e-06,1e-06,5e-06,-4e-06,-1e-06,1e-06,-4e-06,3e-06,-3e-06,-9e-06,-6e-06,-1.1e-05,1.7e-05,-1e-05,1e-06,-1e-06,4e-06,-2e-06,2e-06,-3e-06,0,-5e-06,1.5e-05,4e-06,3e-06,5e-06,-1e-06,-1.5e-05,-6e-06,1.3e-05,1e-06,5e-06,-2.6e-05,0,-4e-06,3e-06,3e-06,-1.8e-05,4e-06,-1e-06,-4e-06,-1e-05,6e-06,-5e-06,-4e-06,-2e-06,1.7e-05,1.7e-05,-8e-06,-4e-06,4e-06,-3.1e-05,5e-06,-7e-06,3e-06,2e-06,1e-06,0,2e-06,7e-06,0,-4e-06,-1e-06,-1e-06,1e-06,1e-06,-6e-06,-2e-05,9e-06,-6e-06,-3e-06,5e-06,-6e-06,-1.2e-05,1e-06,8e-06,-2e-06,2e-06,0,-1e-06,4e-06,-2e-06,5e-06,-2e-06,-3e-06,5e-06
0,0,2e-06,-1e-06,2e-06,1e-06,-5e-06,4e-06,4e-06,-2e-06,0,2e-06,3e-06,-1e-05,-6e-06,-1e-06,0,2e-06,-1e-05,0,-2e-06,4e-06,0,1e-06,-3e-06,8e-06,6e-06,-1.1e-05,1.8e-05,2e-06,-5e-06,-1e-06,-1e-06,-1e-05,-8e-06,9e-06,-4e-06,-4e-06,4e-06,-1e-06,-1e-06,-8e-06,-2e-06,-1e-06,0,1.2e-05,4e-06,1e-05,9e-06,0,-3e-06,-6e-06,1e-06,-1.1e-05,0,2e-06,-1e-06,-1.2e-05,-1e-06,-2e-06,-2e-06,4e-06,1.5e-05,-1e-06,-1.1e-05,-1.3e-05,-2e-06,2e-05,-3e-06,7e-06,0,0,1.5e-05,2e-06,-1e-06,6e-06,1.7e-05,-1e-06,2e-06,3e-06,5e-06,-1.6e-05,0,-3e-06,1e-06,-5e-06,8e-06,-5e-06,9e-06,6e-06,-4e-06,8e-06,-6e-06,-2e-06,-1e-06,1e-06,3e-06,-4e-06,1e-06,-1e-06,-2e-06,-1e-06,1.9e-05,-3e-06,6e-06,-4e-06,1e-06,9e-06,1.5e-05,0,-1e-05,-4e-06,-3e-06,-1e-06,0,1e-06,5e-06,-4e-06,-1e-06,-2e-06,-4e-06
0,0,0,0,-2e-06,-4e-06,4e-06,-5e-06,-2e-06,-1e-06,-2e-06,1e-06,-4e-06,7e-06,7e-06,-1e-06,-2e-06,-3e-06,2e-06,1e-06,2e-06,-4e-06,-1e-06,1e-06,4e-06,-9e-06,-6e-06,1e-06,-1.6e-05,0,-1e-06,0,0,1.1e-05,3e-06,-1.1e-05,8e-06,-3e-06,7e-06,-1e-06,-2e-06,8e-06,-1e-06,3e-06,8e-06,-1e-06,7e-06,-3.2e-05,-1e-05,0,7e-06,4e-06,-1e-06,1.5e-05,2e-06,-1e-06,3e-06,7e-06,1e-06,-6e-06,3e-06,3e-06,-7e-06,6e-06,-1.2e-05,1.7e-05,-2e-06,-1.5e-05,1e-06,-6e-06,1e-06,-1e-06,-7e-06,-3e-06,-2e-06,-3e-06,-2e-05,1e-06,-1e-06,2e-06,-5e-06,1.9e-05,-1.2e-05,8e-06,0,0,4e-06,3e-06,-1.4e-05,-1e-05,6e-06,-3e-06,5e-06,3e-06,-2e-06,0,-2e-06,5e-06,0,0,0,7e-06,-1.9e-05,-6e-06,9e-06,2e-06,-3e-06,-5e-06,-1.1e-05,-6e-06,1e-05,0,2e-06,-1e-06,0,-7e-06,-5e-06,6e-06,1e-06,8e-06,1e-06
-2e-06,0,-1e-06,2e-06,-1e-06,1e-06,-4e-06,4e-06,1e-06,2e-06,1e-06,-1e-06,3e-06,-4e-06,-8e-06,0,1e-06,3e-06,7e-06,0,1e-06,5e-06,-1e-06,-1e-06,-6e-06,9e-06,0,9e-06,1.3e-05,0,5e-06,3e-06,0,-1e-05,2e-06,1e-05,-2e-06,3e-06,-8e-06,2e-06,4e-06,6e-06,-1e-06,0,-1.2e-05,-1.2e-05,-3e-06,2.9e-05,9e-06,1e-06,-1e-06,1e-06,-2e-06,-1.6e-05,-3e-06,0,-1e-06,-4e-06,2e-06,3e-06,-7e-06,-1e-06,-6e-06,-2e-06,2.7e-05,-1.1e-05,4e-06,7e-06,0,5e-06,0,2e-06,3e-06,-3e-06,2e-06,0,2e-05,-2e-06,-1e-06,-4e-06,5e-06,-2.1e-05,1.6e-05,-9e-06,-1e-06,6e-06,3e-06,-2e-06,4e-06,5e-06,-7e-06,-4e-06,-3e-06,-1e-06,2e-06,0,-2e-06,-7e-06,0,0,0,-6e-06,1.7e-05,5e-06,-1e-05,5e-06,9e-06,0,3e-06,7e-06,-5e-06,0,-2e-06,3e-06,-1e-06,6e-06,7e-06,-4e-06,1e-06,-7e-06,-2e-06
1e-06,0,2e-06,0,0,0,2e-06,-4e-06,-1e-06,-2e-06,-1e-06,-3e-06,-1e-06,5e-06,8e-06,-2e-06,2e-06,-2e-06,-1.1e-05,-1e-06,-1e-06,-7e-06,1e-06,-1e-06,8e-06,-1e-05,7e-06,-1e-05,-6e-06,0,-5e-06,-5e-06,0,6e-06,-4e-06,-9e-06,-5e-06,-5e-06,9e-06,1e-06,2e-06,-1e-06,1e-06,-3e-06,1e-05,9e-06,-7e-06,-8e-06,-9e-06,0,-2e-06,-3e-06,2e-06,1.6e-05,1e-06,2e-06,-5e-06,4e-06,-4e-06,4e-06,7e-06,-3e-06,6e-06,-5e-06,-1.3e-05,4e-06,-3e-06,0,2e-06,-4e-06,-5e-06,-2e-06,-6e-06,3e-06,1e-06,2e-06,-1.8e-05,-1e-06,4e-06,1e-06,-3e-06,1.6e-05,-1.1e-05,1.1e-05,1e-06,-1e-06,5e-06,1e-06,4e-06,-1e-06,4e-06,8e-06,4e-06,0,-2e-06,0,2e-06,8e-06,1e-06,1e-06,0,4e-06,-1.4e-05,-2e-06,0,-1e-06,-5e-06,2e-06,1e-06,-1e-06,-1e-06,-1e-06,0,-1e-06,1e-06,-2e-06,-3e-06,3e-06,0,4e-06,4e-06
-2e-06,0,0,-1e-06,1e-06,1e-06,1e-06,2e-06,2e-06,-1e-06,0,-1e-06,-5e-06,-8e-06,-6e-06,1e-06,0,2e-06,7e-06,0,-7e-06,1.2e-05,-1e-06,1e-06,-7e-06,5e-06,-6e-06,1.2e-05,-1e-06,-1e-06,3e-06,3e-06,1e-06,0,1e-06,6e-06,9e-06,7e-06,-6e-06,-1e-06,-3e-06,-4e-06,0,1e-06,-2e-06,5e-06,5e-06,-1e-05,6e-06,1e-06,-3e-06,2e-06,1e-06,-1.4e-05,0,-3e-06,2e-06,-2e-06,1e-06,1e-06,-4e-06,-1e-06,1e-06,3e-06,-1.1e-05,-3e-06,1e-06,-4e-06,-1e-06,3e-06,4e-06,0,5e-06,2e-06,-2e-06,-2e-06,1.4e-05,2e-06,-6e-06,1e-06,0,-1.3e-05,-1e-06,-1e-05,0,-5e-06,-1e-05,3e-06,-8e-06,3e-06,-3e-06,-2e-06,-3e-06,-2e-06,1e-06,1e-06,0,-5e-06,0,-2e-06,1e-06,-1e-06,1.2e-05,2e-06,4e-06,-6e-06,5e-06,-2e-06,-1e-06,-7e-06,5e-06,1e-06,-1e-06,0,-1e-06,-1e-06,2e-06,-4e-06,-1e-06,-4e-06,-3e-06
2e-06,0,-1e-06,-1e-06,0,1e-06,-1e-06,-2e-06,-2e-06,3e-06,-1e-06,2e-06,9e-06,1.2e-05,5e-06,-1e-06,-2e-06,-1e-06,2e-06,0,1.5e-05,-1.4e-05,0,1e-06,3e-06,-1e-06,0,-1.4e-05,6e-06,0,-1e-06,-2e-06,0,-1e-06,1e-06,-3e-06,-6e-06,-4e-06,0,-1e-06,0,-5e-06,1e-06,2e-06,-5e-06,-1e-05,3e-06,2e-05,-3e-06,-2e-06,4e-06,0,-1e-06,9e-06,-1e-06,2e-06,4e-06,0,0,-5e-06,4e-06,2e-06,2e-06,4e-06,2.3e-05,2e-06,0,9e-06,0,-2e-06,0,1e-06,2e-06,-1e-06,0,1e-06,-9e-06,-1e-06,6e-06,-3e-06,3e-06,1.4e-05,7e-06,1e-06,0,1e-06,5e-06,-5e-06,1.2e-05,-6e-06,2e-06,-6e-06,0,3e-06,-1e-06,0,-2e-06,4e-06,0,0,-1e-06,-3e-06,-1e-05,-3e-06,1e-06,0,-5e-06,-1e-06,1e-06,9e-06,-6e-06,3e-06,1e-06,0,1e-06,3e-06,-2e-06,2e-06,0,5e-06,0
0,0,3e-06,0,0,-1e-06,2e-06,0,1e-06,-4e-06,0,1e-06,-7e-06,-1.4e-05,-2e-06,-1e-06,0,0,-9e-06,0,-1.4e-05,9e-06,1e-06,-1e-06,0,0,5e-06,7e-06,-8e-06,1e-06,-2e-06,0,-1e-06,-3e-06,1e-06,0,-1e-06,3e-06,4e-06,0,2e-06,4e-06,-2e-06,-1e-06,8e-06,4e-06,-4e-06,-2.3e-05,0,2e-06,0,0,2e-06,-2e-06,1e-06,-2e-06,-2e-06,0,2e-06,1e-06,-6e-06,3e-06,-9e-06,-4e-06,-1.7e-05,4e-06,1e-06,-1.2e-05,-1e-06,-1e-06,2e-06,-2e-06,-8e-06,-3e-06,2e-06,-1e-06,1e-06,1e-06,-7e-06,2e-06,-3e-06,-1e-05,-1e-05,7e-06,-2e-06,0,-1.2e-05,4e-06,-1.3e-05,2e-06,1e-06,3e-06,0,-3e-06,5e-06,-1e-06,4e-06,0,-1e-06,-1e-06,-1e-06,4e-06,9e-06,3e-06,-6e-06,7e-06,-1e-06,0,-5e-06,-1e-06,3e-06,1e-06,1e-06,-2e-06,-1e-06,-5e-06,1e-06,-1e-06,1e-06,-4e-06,3e-06
0,0,-2e-06,1e-06,0,0,-4e-06,1e-06,-1e-06,3e-06,-1e-06,-2e-06,2e-06,1.4e-05,-2e-06,2e-06,1e-06,1e-06,1e-05,0,6e-06,-3e-06,1e-06,0,-1e-06,4e-06,-5e-06,1e-06,9e-06,0,3e-06,2e-06,0,4e-06,-3e-06,4e-06,3e-06,1e-06,-4e-06,1e-06,1e-06,3e-06,1e-06,-2e-06,-7e-06,7e-06,-3e-06,1.8e-05,4e-06,-2e-06,1e-06,0,-2e-06,-5e-06,-1e-06,2e-06,-2e-06,1e-06,-1e-06,2e-06,5e-06,-1e-06,6e-06,-3e-06,0,-3e-06,-1e-06,1.6e-05,-1e-06,2e-06,-2e-06,2e-06,1e-05,1e-06,0,1e-06,7e-06,-1e-06,9e-06,1e-06,2e-06,6e-06,6e-06,-4e-06,1e-06,0,1e-05,-1e-06,1.3e-05,5e-06,-2e-06,7e-06,-1e-06,4e-06,-3e-06,1e-06,-1e-06,-1e-06,0,1e-06,0,-2e-06,-1e-05,0,3e-06,-1e-06,-1e-06,4e-06,1.2e-05,-5e-06,-2e-06,0,-1e-06,1e-06,0,6e-06,-4e-06,2e-06,0,-2e-06,-5e-06
1e-06,0,1e-06,0,0,-3e-06,3e-06,-2e-06,1e-06,-2e-06,0,-2e-06,2e-06,-1.2e-05,5e-06,-1e-06,1e-06,-2e-06,-3e-06,0,-1e-06,3e-06,-1e-06,1e-06,2e-06,-6e-06,1e-06,-5e-06,-7e-06,0,-2e-06,-2e-06,0,2e-06,2e-06,-6e-06,-3e-06,-3e-06,1e-06,1e-06,-3e-06,0,1e-06,2e-06,1e-06,-6e-06,6e-06,-1e-06,-9e-06,3e-06,-5e-06,1e-06,-1e-06,1.1e-05,0,-2e-06,3e-06,-4e-06,-2e-06,3e-06,-2e-06,-3e-06,-2e-06,5e-06,1.1e-05,1e-06,1e-06,-1.9e-05,0,-3e-06,-1e-06,0,-8e-06,2e-06,-1e-06,0,-1.3e-05,0,-1e-05,0,-1e-06,-8e-06,1e-06,0,1e-06,2e-06,1.1e-05,-2e-06,-1.2e-05,-6e-06,2e-06,-1e-05,3e-06,-2e-06,-1e-06,0,0,3e-06,0,0,1e-06,0,1e-05,0,4e-06,-5e-06,-3e-06,-3e-06,-1.4e-05,5e-06,0,0,0,0,0,-2e-06,6e-06,1e-06,0,5e-06,3e-06
-2e-06,0,1e-06,0,0,2e-06,-2e-06,2e-06,-1e-06,0,-1e-06,1e-06,-5e-06,1.1e-05,-8e-06,-1e-06,-1e-06,1e-06,-4e-06,0,0,-1.2e-05,0,0,-5e-06,4e-06,3e-06,9e-06,5e-06,0,1e-06,2e-06,0,-6e-06,3e-06,8e-06,2e-06,4e-06,1e-06,0,0,-1e-06,0,1e-06,5e-06,-4e-06,0,-2e-05,1.2e-05,-4e-06,3e-06,-1e-06,1e-06,-1.4e-05,0,2e-06,0,5e-06,2e-06,-2e-06,1e-06,0,6e-06,1e-06,-5e-06,-7e-06,0,2.2e-05,0,4e-06,2e-06,-1e-06,9e-06,0,1e-06,-1e-06,1.7e-05,1e-06,1e-05,0,-1e-06,7e-06,-4e-06,-3e-06,0,-1e-06,-1.3e-05,3e-06,1.7e-05,2e-06,-3e-06,0,-2e-06,2e-06,-2e-06,0,0,-6e-06,0,0,0,2e-06,-1.1e-05,-2e-06,-1e-06,1e-06,3e-06,0,1e-05,0,3e-06,-1e-06,-1e-06,0,0,-3e-06,-6e-06,-1e-06,0,-2e-06,0
