0.010443,0.012202,0.013124,0.051505,0.269439,0.49586,0.421377,0.385229,0.701546,1.150981,1.11771,0.807857,0.692171,0.707404,0.807812,0.864032,0.9244,0.821996,0.49851,0.322854,0.253246,0.213916,0.307419,0.205291,0.039732,0.029753,0.032051,0.031386
0.012938,0.015016,0.016022,0.060269,0.314568,0.579119,0.492183,0.44467,0.807033,1.3224,1.26503,0.906349,0.790686,0.809671,0.926856,1.000217,1.075053,0.943956,0.562046,0.361651,0.281339,0.240546,0.348363,0.233594,0.047046,0.035694,0.038715,0.038289
0.016656,0.019237,0.020542,0.07331,0.374802,0.687174,0.587351,0.523961,0.955636,1.583945,1.496164,1.055983,0.94465,0.964313,1.082758,1.174488,1.261697,1.082069,0.628313,0.404797,0.314154,0.273779,0.395927,0.265965,0.058273,0.045103,0.049096,0.04853
0.017959,0.020677,0.022991,0.079247,0.381565,0.69127,0.604999,0.544945,1.017045,1.766819,1.702152,1.209643,1.111548,1.108366,1.136041,1.184753,1.265556,1.055734,0.598143,0.390248,0.308402,0.278191,0.39166,0.260848,0.063893,0.050078,0.054476,0.052364
0.016972,0.019011,0.023352,0.081522,0.335871,0.59173,0.552667,0.539029,1.06542,1.947818,1.979197,1.472415,1.351602,1.306971,1.173306,1.10108,1.126324,0.907252,0.521742,0.361539,0.292313,0.267095,0.359139,0.234982,0.063924,0.050396,0.054782,0.050716
0.017734,0.01901,0.025311,0.095971,0.338308,0.579543,0.55907,0.56382,1.181365,2.192377,2.353309,1.85738,1.693456,1.619495,1.336767,1.127402,1.015345,0.766225,0.476806,0.35935,0.294966,0.267502,0.346836,0.222056,0.063132,0.049497,0.052533,0.048424
0.022375,0.022641,0.030165,0.133369,0.473737,0.798433,0.707092,0.646887,1.429026,2.565834,2.833819,2.499442,2.443395,2.337488,1.881662,1.603356,1.311526,0.836229,0.500171,0.386173,0.321134,0.295373,0.371408,0.234518,0.072513,0.054228,0.051457,0.048525
0.030138,0.030024,0.038998,0.188117,0.700633,1.162282,0.95857,0.874987,2.075739,3.480105,3.898741,3.937587,4.115794,3.904699,3.143135,2.765075,2.254628,1.316205,0.683729,0.483424,0.391222,0.366054,0.473365,0.301501,0.096844,0.067174,0.056172,0.055829
0.038757,0.039644,0.048945,0.23815,0.965943,1.596342,1.241805,1.244194,3.320204,5.352638,6.043653,6.571757,7.012675,6.599511,5.300461,4.655552,3.803234,2.173643,1.032423,0.65893,0.509713,0.461649,0.598431,0.385307,0.126113,0.081344,0.063504,0.06809
0.046434,0.048657,0.057128,0.262989,1.196863,2.023413,1.512713,1.726363,5.112026,7.953417,9.013272,10.296252,10.981177,10.240813,8.301653,7.167857,5.804557,3.375272,1.536481,0.872943,0.633692,0.538909,0.67527,0.437055,0.145379,0.089216,0.070085,0.080353
0.051311,0.053734,0.063183,0.266599,1.2739,2.210936,1.666478,2.264564,7.115524,10.571158,11.909834,14.203806,14.993389,13.852157,11.482975,9.643269,7.668091,4.651497,2.100365,1.130908,0.791988,0.568121,0.649804,0.422804,0.145488,0.087256,0.072562,0.087718
0.049602,0.053433,0.065653,0.245783,1.114119,1.98337,1.614167,2.681557,8.630503,12.288252,13.482541,16.527107,17.218576,15.667695,13.254961,10.835618,8.431431,5.350549,2.471552,1.356947,0.955877,0.547675,0.538055,0.358866,0.137311,0.080286,0.067867,0.085413
0.041672,0.048856,0.062861,0.203138,0.847931,1.55724,1.428522,2.701862,8.740468,12.246374,12.779061,15.464018,15.858712,14.210109,12.096977,9.534588,7.235985,4.774358,2.310482,1.381222,1.024124,0.497935,0.402262,0.270949,0.117047,0.06998,0.059429,0.073927
0.034034,0.043539,0.056646,0.166324,0.777169,1.49049,1.361123,2.265356,7.113954,9.949662,9.562671,10.863264,11.043382,9.794835,8.277968,6.312785,4.633788,3.086222,1.599911,1.139429,0.933586,0.441703,0.311778,0.199823,0.090567,0.059074,0.051851,0.058276
0.031588,0.04161,0.048566,0.136019,0.81647,1.685464,1.440923,1.666826,4.858722,6.971814,6.026327,5.747444,5.864985,5.266303,4.247714,3.173752,2.258704,1.460232,0.867653,0.81145,0.751433,0.417332,0.298614,0.171232,0.07675,0.056106,0.049204,0.045669
0.035521,0.044996,0.047715,0.13912,0.898653,1.965266,1.635029,1.294198,3.424512,5.220378,4.183094,2.854082,2.787808,2.728279,2.083728,1.525684,1.119061,0.815674,0.648963,0.709869,0.700193,0.477613,0.358562,0.186256,0.083132,0.063176,0.054622,0.046232
0.044012,0.052506,0.05681,0.179234,1.040445,2.319648,1.938724,1.245806,3.217765,5.387624,4.351578,2.200888,1.718415,1.867896,1.642174,1.311678,0.984881,0.842189,0.73707,0.846075,0.865744,0.640263,0.469035,0.220787,0.103399,0.078707,0.067644,0.05857
0.051482,0.05846,0.066303,0.225946,1.161625,2.577585,2.192698,1.355004,3.496038,6.793691,6.124028,2.839258,1.751559,1.991883,2.063624,1.774421,1.285912,1.052974,0.863702,0.995845,1.056736,0.875817,0.65242,0.285237,0.132907,0.09793,0.082092,0.072909
0.053643,0.05853,0.068656,0.252129,1.126399,2.45778,2.206201,1.510662,3.771197,8.576239,8.662248,3.94925,2.104212,2.487466,2.719584,2.375159,1.755189,1.328778,0.970383,1.096411,1.214482,1.13288,0.850733,0.344184,0.153317,0.112637,0.091641,0.081762
0.053372,0.054593,0.062067,0.242964,0.944006,2.008917,1.971987,1.676378,4.16173,10.28055,11.147428,5.299374,2.716839,3.059277,3.238313,2.901913,2.296842,1.631413,1.03835,1.155238,1.320944,1.268739,0.914831,0.342436,0.146962,0.113603,0.093234,0.082886
0.055786,0.051535,0.053128,0.206254,0.761724,1.588567,1.72763,1.827307,4.453828,10.898451,12.250571,6.389156,3.496577,3.48324,3.382609,3.166928,2.686052,1.829628,1.048007,1.140834,1.311929,1.16643,0.770714,0.285709,0.123737,0.094453,0.082145,0.075315
0.060632,0.053339,0.047245,0.156366,0.561274,1.158083,1.476232,1.869125,4.405421,10.208138,11.507987,6.656795,4.124672,3.645375,3.073052,2.853665,2.538424,1.734322,0.977962,1.108774,1.251315,0.906334,0.502899,0.197323,0.09574,0.069404,0.065946,0.064276
0.067628,0.063477,0.050683,0.11153,0.389449,0.834909,1.215021,1.777949,4.275153,8.931542,9.517111,5.923385,4.215197,3.588528,2.651152,2.108317,1.846458,1.352483,0.830664,0.998371,1.10265,0.64907,0.279317,0.115308,0.073519,0.063417,0.061933,0.056365
0.070406,0.073029,0.05781,0.086049,0.321567,0.740093,1.040746,1.612687,3.762302,6.816415,6.980603,4.73159,3.548061,3.075586,2.311646,1.534822,1.234106,1.050771,0.682995,0.79284,0.850819,0.429617,0.14718,0.067173,0.05792,0.066105,0.066001,0.054664
0.069261,0.077017,0.060054,0.073392,0.317364,0.750511,0.990089,1.528639,3.109075,4.843275,5.041572,3.719014,2.569802,2.317388,2.038364,1.328987,1.042159,0.937432,0.572295,0.636449,0.653175,0.295051,0.092794,0.049654,0.047676,0.059989,0.062839,0.051197
0.067061,0.078609,0.059732,0.073303,0.333816,0.725388,0.905654,1.418663,2.505164,3.46359,3.682839,3.079771,2.084637,1.779136,1.823548,1.23258,0.873023,0.733915,0.459246,0.536321,0.520683,0.224516,0.074354,0.047676,0.041306,0.045438,0.051429,0.043907
0.065718,0.081239,0.057167,0.074899,0.327368,0.615804,0.702647,1.338072,2.514841,3.191063,3.152764,2.720465,1.822172,1.472824,1.66394,1.213986,0.732723,0.50771,0.38748,0.556327,0.531518,0.221243,0.069295,0.048908,0.041025,0.03819,0.04645,0.044821
0.069681,0.088986,0.055888,0.07494,0.298483,0.521154,0.579089,1.437121,2.837602,3.289485,2.819628,2.191051,1.514905,1.381725,1.507843,1.118242,0.71949,0.471797,0.42768,0.664421,0.620022,0.25156,0.0757,0.04788,0.04371,0.040231,0.048202,0.050613
0.074501,0.09817,0.060997,0.072315,0.249378,0.433626,0.532162,1.52626,3.017522,3.352142,2.581699,1.653707,1.142384,1.240817,1.239433,0.925614,0.757137,0.567385,0.512607,0.735122,0.671635,0.274346,0.084865,0.047213,0.047823,0.046187,0.048353,0.052421
0.076525,0.102355,0.067908,0.070473,0.20134,0.340808,0.488185,1.461157,2.785146,3.034772,2.347936,1.439462,0.996101,1.126904,1.049122,0.813103,0.754867,0.647895,0.579294,0.767073,0.725367,0.317413,0.101047,0.052367,0.054593,0.05777,0.049848,0.053148
0.08193,0.102369,0.070408,0.072682,0.16557,0.24995,0.433621,1.471656,2.742078,2.832218,2.04785,1.238881,0.975347,1.212099,1.146414,0.852982,0.707475,0.636182,0.609731,0.756836,0.7288,0.342762,0.113568,0.063973,0.065808,0.071065,0.054196,0.056448
0.089138,0.101039,0.066957,0.075285,0.15052,0.202411,0.367678,1.439227,2.77878,2.58738,1.58691,1.025943,1.011704,1.356413,1.344747,0.970541,0.629946,0.527806,0.580627,0.691539,0.651247,0.315219,0.109684,0.074099,0.074652,0.074685,0.055082,0.059005
0.093334,0.105751,0.06717,0.069737,0.134693,0.190337,0.298186,1.181361,2.488707,2.232797,1.233883,1.008139,1.089849,1.293345,1.364636,1.074796,0.646253,0.460863,0.500912,0.63306,0.573133,0.257388,0.095569,0.072178,0.069877,0.062701,0.050078,0.055036
0.086637,0.106101,0.063371,0.052271,0.100092,0.156082,0.227728,0.849304,2.017449,2.021784,1.161614,1.014846,1.069162,1.036422,1.132356,0.995279,0.681941,0.505812,0.474993,0.56646,0.500718,0.224608,0.090824,0.065485,0.055258,0.040524,0.037075,0.041814
0.073869,0.100027,0.055002,0.032925,0.060765,0.111039,0.199839,0.737043,1.588103,1.602556,0.962354,0.882843,1.041996,0.924137,0.831434,0.729423,0.641643,0.552873,0.475518,0.549008,0.455282,0.221528,0.105425,0.064115,0.045076,0.025301,0.025265,0.031941
0.06905,0.095038,0.04786,0.026117,0.05269,0.110856,0.225747,0.71376,1.365616,1.277368,0.756848,0.74457,1.022842,0.86345,0.572176,0.525672,0.560501,0.535882,0.493328,0.54599,0.434162,0.249522,0.129393,0.068486,0.041975,0.021465,0.018353,0.028562
0.06159,0.083944,0.039136,0.022498,0.068264,0.149768,0.272602,0.752591,1.65336,1.607709,0.918522,0.722405,0.914608,0.71464,0.432959,0.507761,0.483697,0.439304,0.484339,0.497784,0.385245,0.264625,0.137893,0.063686,0.035827,0.019779,0.016415,0.028967
0.053395,0.068922,0.032963,0.020326,0.081484,0.186994,0.326239,0.814384,1.963718,2.135104,1.305897,0.78801,0.774974,0.564789,0.407225,0.483919,0.409027,0.358291,0.445665,0.441378,0.32905,0.247315,0.122416,0.050437,0.0321,0.019885,0.015906,0.034595
0.04735,0.059705,0.032938,0.019547,0.086231,0.202557,0.345303,0.815846,2.035169,2.518316,1.700653,0.917378,0.694012,0.481151,0.408999,0.430088,0.380474,0.371852,0.458059,0.469213,0.358964,0.244406,0.096937,0.041697,0.038374,0.022573,0.016035,0.040169
0.046891,0.059433,0.037585,0.021191,0.084959,0.189719,0.312312,0.699948,1.800222,2.527584,1.900527,1.042359,0.709532,0.452186,0.40008,0.422481,0.367854,0.356541,0.459809,0.553415,0.448687,0.261967,0.080572,0.039955,0.048087,0.029327,0.021991,0.046508
