-9e-05,-2.1e-05,0.000227,-0.00011,1e-04,7e-05,8.1e-05,-9.7e-05,-1.4e-05,-4.3e-05,2.7e-05,0.000145,5.4e-05,0.000141,-4.5e-05,-7.8e-05,-8.1e-05,-0.000174,-4.6e-05,3.1e-05,-0.000192,6.4e-05,-3.2e-05,6.9e-05,0.000161,9.6e-05,-4.6e-05,-0.000193,-0.000133,0.000262,0.000214,0.000234,0.000109,5.8e-05,8.4e-05,0.000244,0.000134,0.000527,0.000299,0.000401,0.00016,-3.7e-05,-6.6e-05,-7.2e-05,-3.6e-05,-3.8e-05,-3.8e-05,-0.000117,-0.001708,-0.009023,-0.005051,-0.001437,-0.007597,-0.004513,-0.002965,-0.002184,-0.008817,-0.00509,-0.002387,-0.001269,0.001364,-0.001567,-0.001494,0.002007,-0.009817,-0.006138,-0.006207,-0.007787,-0.015423,-0.010192,-0.010679,-0.015338,-0.015272,-0.021863,-0.015442,-0.009941,-0.011058,-0.010765,-0.009002,-0.01113,-0.010627,-0.014731,-0.010562,-0.012903,-0.019443,-0.007444,-0.010183,-0.008426,-0.013748,-0.015039,-0.01002,-0.012321,-0.009559,-0.01115,-0.012726,-0.010368,-0.004074,-0.003238,-0.002029,-0.001844,-0.001318,-0.002799,-0.003719,0.001983,0.00244,0.001534,0.00224,-0.008495,-0.00164,0.000399,0.000253,-8.9e-05,-0.00061,-0.000151,-0.000123,-0.000215,-0.000138,-0.0024,-0.001533,-0.000577,-0.00022
-2.3e-05,-0.000172,6e-06,-2.2e-05,6.3e-05,-1.2e-05,-3.9e-05,1.3e-05,8e-06,-0.00029,-0.000143,-8.9e-05,-3.4e-05,-6.1e-05,-4.5e-05,-0.000177,-0.000148,-2.2e-05,-2e-05,-4e-06,0.000155,3.8e-05,-5.7e-05,0.000126,0.000219,0.000206,-3e-06,-5e-06,-5.7e-05,7e-05,5.5e-05,1.1e-05,0.000145,-2.5e-05,-4.5e-05,0.000203,-0.000103,0.000169,8.2e-05,0.000161,9.3e-05,0.000177,-3.4e-05,2.7e-05,0.000166,-3.3e-05,0.00019,6.9e-05,-0.001954,0.004497,0.002542,-0.000519,0.003081,0.00207,0.002038,0.000705,0.004811,0.001377,-0.002318,-0.001521,-0.000976,0.00166,0.003699,-0.004039,0.001081,-0.004589,-0.000915,-0.001006,0.003573,-0.002613,-0.002608,-0.001136,-0.001396,0.00199,0.000652,0.003308,-0.007423,-0.007225,-0.005083,-0.000656,-0.002715,-0.003171,-0.009726,-0.005036,-0.008173,-0.0063,-0.003551,-0.004857,0.003265,0.010358,0.003021,-0.00018,-0.005811,0.003688,-0.00376,-0.003576,-0.005117,-0.001952,-0.000327,-0.001889,-0.000792,0.000249,0.000422,0.001316,0.001659,0.001398,0.000536,0.005256,0.000778,0.000244,0.000275,0.000653,0.000666,0.000268,0.000219,0.000345,0.00036,0.000448,0.000536,3.9e-05,9.1e-05
0.000227,0.000176,-6.2e-05,-0.000117,-4.2e-05,0.000127,0.000116,0.000113,4.9e-05,2.3e-05,8.6e-05,-4e-05,3e-06,-0.000132,-1.1e-05,0.000155,0.000316,0.000153,7.2e-05,-4e-06,-0.000138,-0.000245,1e-05,0.000104,5.8e-05,0.000148,0.00017,1.4e-05,0.000291,7.6e-05,0.000169,5.9e-05,0.000161,0.000127,0.000201,-0.000111,-0.000112,3.9e-05,0.000129,7.8e-05,0.000262,1.7e-05,3.8e-05,-2.9e-05,-0.000145,-3.5e-05,-0.000122,-0.000165,-0.000247,-0.005084,-0.00261,0.000121,-0.003646,-0.002051,-0.000761,0.000296,-0.002095,-0.001221,3.1e-05,-0.000554,-0.001592,-0.000611,-0.002191,-0.003516,-0.010431,-0.016183,-0.006752,-0.006085,-0.001282,0.000761,0.000336,-0.001051,-0.011776,-0.008663,-0.002444,-0.006597,-0.008848,-0.002192,4.5e-05,-0.003486,-0.000899,0.002565,0.006902,0.003907,0.006492,0.006394,0.000584,-0.002645,-0.002423,-0.009323,-0.005389,0.002561,0.002979,-0.006223,-0.001381,-0.001522,-0.001988,-0.001841,-0.001251,-0.00052,-0.00094,-0.000345,0.000544,-0.002432,-0.00192,-0.000767,-0.000561,-0.005379,-0.005709,-0.00251,-0.000939,-0.000214,-0.000124,-0.000188,5.6e-05,-0.000228,-0.00075,-0.00051,-0.000185,0.000232,5.3e-05
-0.000403,-0.000164,-0.000217,-0.000129,-0.000333,-0.000222,-3.5e-05,-4.5e-05,-0.00017,-4.3e-05,-0.000204,-0.000112,-4.3e-05,-9.2e-05,-0.000118,-0.000197,-0.000163,-0.000141,-0.000196,-0.000126,0.000107,-1.2e-05,-3.7e-05,1e-05,-0.000195,-0.000153,3e-05,-4.6e-05,-5e-06,-0.000316,-6e-06,0.000133,6.6e-05,-8.4e-05,-0.000146,-1.2e-05,-0.000122,-4.8e-05,-4.3e-05,-2.3e-05,-3.8e-05,-7e-06,-0.000103,-3.2e-05,-8.8e-05,7e-06,2.2e-05,2.7e-05,-8.3e-05,0.000502,0.000639,0.000352,0.001598,0.000932,-0.00025,-0.000364,-0.001056,0.000826,0.000611,-9.7e-05,0.000503,0.001188,-8.4e-05,-0.002589,0.002885,-0.001376,-0.00141,0.00487,0.004293,0.009451,0.001642,0.004485,0.008551,0.009734,0.004895,-0.005836,0.001477,-0.001238,0.001229,0.002882,0.001082,0.001966,-0.007274,0.000447,-0.005488,-0.006409,-0.002538,-0.003783,0.000822,0.003758,0.005024,-0.002915,0.000958,0.001123,0.002648,0.001115,0.001953,0.000579,-0.000465,-0.000259,0.000607,-0.000344,-0.000453,-0.00264,-0.000949,-0.000273,-0.001426,-0.001701,-0.002737,-0.001107,8.2e-05,0.000533,0.000192,9.6e-05,-6.8e-05,-0.000139,-0.000329,0.000398,0.000115,-0.000305,-0.000335
8.8e-05,3.6e-05,-4.1e-05,1e-06,0.000137,0.000193,0.00015,0.000163,4.6e-05,8.7e-05,5.8e-05,4.5e-05,2.7e-05,3.1e-05,6.8e-05,1.8e-05,0.00012,0.000223,0.000192,9.5e-05,-1.8e-05,3.3e-05,1.9e-05,0.000102,-6.6e-05,0.000137,1.7e-05,-3.5e-05,0.000123,7.6e-05,0.000194,3.7e-05,6.5e-05,-6e-06,0.000121,-2e-05,0.000231,0.000118,2.8e-05,3.3e-05,4.8e-05,8.7e-05,7.2e-05,0.000166,-4.3e-05,5.2e-05,0.000107,9.8e-05,1.8e-05,-0.001704,-0.000728,0.000207,0.000494,0.000844,0.000589,2.8e-05,0.001338,-0.000137,-0.00109,0.000292,-7.7e-05,-0.00103,-0.000386,-0.000565,-0.004405,-0.004665,-0.001623,-0.004846,-0.002428,-0.000637,0.00258,0.002289,-0.005128,-0.001039,0.000533,-0.000289,-0.001146,0.001308,0.000997,0.002354,0.002079,-0.000346,0.00302,0.001666,0.003585,0.006858,0.002819,0.000485,-0.000641,-0.006823,-0.005324,-0.003036,0.000944,0.001225,-0.001935,0.001274,0.001958,0.001344,-0.000425,-0.000572,-0.000474,0.000342,0.000309,0.000274,-0.001218,-0.000832,-8.7e-05,0.001201,0.003198,0.001403,-0.000127,-0.000223,-1.7e-05,0.000116,0.000124,0.000109,-0.000194,-3.3e-05,2.9e-05,0.000256,0.00024
-2.7e-05,-8e-06,7e-06,0.000138,-5e-05,-7.6e-05,-4.2e-05,-1.8e-05,-3.3e-05,-2.8e-05,0.000116,2.1e-05,-0.000112,1.5e-05,1.5e-05,4.6e-05,-0.000119,-0.000133,-7.8e-05,-4.5e-05,-4.4e-05,-1.1e-05,2e-06,9.1e-05,-0.000114,-6e-05,-8e-06,-0.000192,-1.5e-05,-2.4e-05,-2.5e-05,-9e-06,3.9e-05,-4.2e-05,8.4e-05,2.5e-05,9.4e-05,3.4e-05,-0.000137,1.2e-05,-0.000168,-0.000116,4e-06,-1.6e-05,9e-05,4.8e-05,-1e-06,3e-05,2.7e-05,0.001321,0.001239,0.000221,-1.5e-05,-0.001124,-0.000789,-0.000108,-0.000518,0.000426,-8.2e-05,0.000147,0.000145,0.000198,0.000846,-0.000345,-0.003058,0.000353,-0.002717,0.002263,-0.001131,-0.001082,0.001085,0.00057,0.001591,0.000925,-0.000758,0.002093,-0.001643,0.000875,-0.001025,-0.000841,0.000841,-0.000996,0.000575,0.00081,-0.001038,-0.002519,-0.000627,0.00141,0.003407,0.003014,0.002796,-0.001257,0.000803,0.001167,0.002113,0.00109,0.000199,0.000884,-7.3e-05,0.001014,0.000222,6e-06,0.000501,-0.000192,-0.002335,-0.001584,-0.000366,0.001305,0.000154,-0.000279,0.000316,0.000168,-0.000232,-0.000115,-6.1e-05,0.000367,1.5e-05,6e-05,-6.5e-05,-7.6e-05,-0.000227
-0.000156,-5.2e-05,3.2e-05,-3.7e-05,-6.5e-05,-5.8e-05,-0.000121,-3.1e-05,-6.5e-05,-3.8e-05,-9.7e-05,-7e-05,-6.2e-05,-1.7e-05,-1e-06,-5.8e-05,-1.7e-05,5.6e-05,-4.8e-05,-1.1e-05,-4.9e-05,4.3e-05,-0.000131,-6.2e-05,1.5e-05,-8.6e-05,-0.000174,-0.000121,-3.9e-05,-0.000132,-0.000149,-1.8e-05,-8e-06,-8e-05,-7.2e-05,-0.000227,-6.3e-05,4e-06,-0.000102,-5.1e-05,-8.5e-05,6e-05,-3.2e-05,-5.3e-05,-3.9e-05,-6e-06,-3.4e-05,-4.3e-05,1e-05,-0.000325,-0.000698,-0.000317,-0.000267,0.000208,-0.000191,-0.000589,0.000318,-6e-05,0.000522,7.3e-05,0.000172,0.000285,-0.000244,0.001456,0.000303,-0.002297,-0.000186,-0.000903,-0.006073,-0.003495,-0.002622,-0.001317,0.000656,-0.000272,-0.003311,-0.000636,7.8e-05,-0.000299,-0.001531,-0.001772,0.001385,-0.001864,0.001549,-0.004336,0.00197,0.000945,0.002008,0.001957,0.000119,-0.001386,-0.002904,0.001684,-0.002446,-0.002864,0.000804,-0.001876,-0.000278,0.000458,-0.000452,0.001226,0.000415,0.000481,-0.000876,-0.000492,-0.00217,-0.001433,-0.000446,0.000179,-0.000952,-0.000234,-0.00037,-0.000296,4.9e-05,-5.8e-05,-0.000293,-0.000107,0.000201,1.3e-05,0.000115,-0.000154,0.000178
0.000102,8.3e-05,-4.6e-05,1.3e-05,-0.000107,-5.6e-05,2e-06,2e-06,-2.7e-05,2.8e-05,-2.1e-05,-1e-04,-1.8e-05,4.2e-05,-4.1e-05,-2e-06,4.4e-05,7.3e-05,3.1e-05,-7.9e-05,-1.2e-05,-4.3e-05,-9.6e-05,-1.7e-05,-2e-06,-0.000117,-0.000158,3.2e-05,-4.3e-05,5.5e-05,-2e-05,-0.00016,-3.1e-05,1.8e-05,2.5e-05,2.8e-05,-0.000101,-4.7e-05,-0.000126,-9e-05,-0.000109,2.2e-05,5.8e-05,-1.9e-05,-4.9e-05,-8e-05,-2.7e-05,-0.000104,-8e-06,-0.000481,-0.00032,-0.000277,-0.000185,0.000361,0.000417,0.000632,-0.000195,-0.001554,-0.000493,-0.000153,-0.000281,-0.001501,0.00085,-0.001688,0.001649,0.001571,-0.00884,-0.0042,0.000771,0.000996,0.000858,-0.000665,0.000401,0.002854,0.002988,-0.001732,-0.001537,0.00026,0.002781,-0.000611,-0.001341,-0.000638,-0.000594,0.00235,-0.002052,-0.001491,0.000811,-0.000173,0.000181,-0.001256,0.001925,-0.002458,0.001682,0.00106,-0.001322,0.000668,-0.001206,-0.000811,0.000621,0.000798,0.000205,-0.000382,0.000249,-5.1e-05,0.000389,1.5e-05,-0.000405,0.000354,-0.000847,0.000239,0.000477,8.4e-05,-0.000232,-0.000183,-1.5e-05,0.00012,-0.000141,8.2e-05,-0.000199,4.5e-05,-1.7e-05
-0.000112,2.2e-05,7e-06,1.7e-05,-2.8e-05,-6.4e-05,-7.1e-05,-2.7e-05,-1.3e-05,-0.000106,-1.7e-05,-1.5e-05,3.5e-05,6e-05,-5.7e-05,8e-06,-0.000101,-6.7e-05,-4.3e-05,-8e-05,0,6.3e-05,7.7e-05,-1.1e-05,-0.000142,-1.3e-05,8e-06,-5.7e-05,2.6e-05,-0.000111,-0.000105,-0.000141,-2.5e-05,-7.3e-05,-3.5e-05,-9.1e-05,-8.8e-05,-0.000105,-0.000151,-3.4e-05,-0.00011,-5.4e-05,-7.6e-05,-5.1e-05,-1.9e-05,-4.9e-05,-1.3e-05,-3.4e-05,-3.9e-05,0.000264,-0.000651,-0.000178,-6.3e-05,1.8e-05,-0.000769,-0.000479,-0.000106,0.001031,0.000477,0.00024,-0.000465,-0.000246,0.000611,0.001527,-0.000704,0.000262,0.008037,0.000372,-0.003019,-0.000538,0.000689,9.6e-05,0.00102,-0.002357,-0.00037,-0.002801,-0.000947,0.002243,-0.001751,0.001336,0.001774,0.000506,-0.002038,-0.002532,6.3e-05,-0.001023,-0.002229,-0.000338,-0.002392,0.000808,-0.000567,0.001678,0.000161,-0.00014,1e-04,-0.000757,0.001116,-0.001917,-0.000828,-0.001293,-0.001152,-0.000138,-0.000173,-0.000146,0.000841,0.000403,0.00024,-1.5e-05,-0.00025,-0.000298,-0.000149,-6.4e-05,0.000151,-1.5e-05,-0.000165,0,-8.5e-05,-2e-04,0.000223,-0.00018,-8.8e-05
1e-04,2.6e-05,0.000103,1.9e-05,3e-05,3.6e-05,3e-06,2e-05,1.9e-05,5.5e-05,2e-05,-2e-06,-1.2e-05,2.7e-05,2.4e-05,4.6e-05,-1.1e-05,2.2e-05,1.2e-05,1.9e-05,-8e-06,2.1e-05,1.1e-05,-1.4e-05,1.9e-05,0,-6e-05,-2.6e-05,6e-06,-1.1e-05,4.4e-05,1.9e-05,0,-2.5e-05,-1.4e-05,2.9e-05,-2.8e-05,-7e-06,-4e-05,-9e-06,1.1e-05,1.6e-05,9.4e-05,5.6e-05,-3.9e-05,-3.7e-05,6.7e-05,0,5.1e-05,-0.000167,0.00045,0.000309,0.000172,-0.000271,0.00133,0.000225,1e-06,-0.000331,-0.000515,-0.000369,0.000425,0.000667,0.000329,-0.001271,0.001082,0.001916,0.000826,-0.006753,3.1e-05,-0.000914,0.000709,-0.000418,0.000512,0.000897,-0.000769,-0.000713,4.1e-05,2e-04,0.001483,-0.000401,-0.000712,-0.000324,-0.000598,0.000333,0.000387,-0.000279,0.001002,-0.002544,-0.001146,-0.000197,0.001189,0.000834,-0.002097,0.000302,0.000475,0.00046,-0.000481,0.000484,-9.5e-05,6.8e-05,-5.2e-05,-0.000148,0.000206,9e-06,0.000104,0.000438,0.000706,-0.000186,-0.000364,-0.000629,9e-05,1.5e-05,-0.000232,-4.6e-05,6.6e-05,8.7e-05,-5.1e-05,7.2e-05,-0.000142,5.3e-05,3.1e-05
-4.9e-05,4.6e-05,-6.8e-05,3e-06,7.5e-05,2.5e-05,-5.1e-05,-1.9e-05,-1.1e-05,-2.9e-05,-3.1e-05,2e-05,-7e-06,-5e-06,3.7e-05,2.4e-05,6e-05,-3.1e-05,-4.7e-05,-5e-06,2.2e-05,2.4e-05,3.8e-05,1.1e-05,-6.7e-05,2e-06,0,1.7e-05,-6.8e-05,-2.2e-05,2.3e-05,-7.4e-05,-5.7e-05,5.8e-05,-2.7e-05,1.5e-05,-2.5e-05,-6e-06,-4e-05,-4.3e-05,-3.7e-05,2.1e-05,0,-6e-06,5.4e-05,-1.8e-05,-7e-06,1e-06,2.2e-05,0.000146,-0.000163,0.000184,-0.000241,-6.3e-05,-0.001173,-0.000129,-0.000191,0.000148,-0.000111,-6.4e-05,7.1e-05,-2.8e-05,0.00035,0.000367,-0.000424,0.000428,-0.000611,0.003099,0.000465,-0.002282,-0.00117,-0.000401,0.000809,-0.003065,-0.00238,0.000843,-0.000631,-0.001941,0.001764,-0.000612,0.001131,0.000166,0.000495,0.000251,-0.000472,0.001498,0.000819,0.000849,0.00035,-0.000399,-0.00104,-6e-06,-0.000218,-0.000545,-0.000334,-8.7e-05,0.000468,0.000161,-0.000548,-0.000332,0.00013,0.000383,0.000141,2.6e-05,-0.000108,-0.000124,0.000654,-0.000129,7.7e-05,0.000542,-0.000333,-9.7e-05,6.9e-05,-4.7e-05,-0.000127,-9.3e-05,6.1e-05,-2e-05,-9.8e-05,-0.000194,-1e-06
4.6e-05,1e-06,-1e-06,-1.1e-05,-3e-05,4e-06,-4.8e-05,-3.6e-05,-2.7e-05,5e-06,2.2e-05,3.5e-05,-2.6e-05,-5e-06,-1e-05,-6e-06,-4e-06,7e-06,1.2e-05,3e-06,-4e-05,-1.4e-05,-1.1e-05,-4.8e-05,9e-06,2.2e-05,-3.9e-05,-2.8e-05,-7.7e-05,-3.2e-05,4e-06,-1.1e-05,-4e-06,-2.5e-05,-2e-05,-5.6e-05,-5.6e-05,-3.4e-05,5.5e-05,-4.4e-05,-2.4e-05,4e-06,4.6e-05,-9e-06,-1.3e-05,1.4e-05,-3.7e-05,-3.3e-05,-6e-05,-0.000199,0.000135,-0.000801,-8.8e-05,-2.3e-05,0.000423,0.000126,2.2e-05,8.3e-05,0.000222,-8e-05,-6.3e-05,0.000102,-6.4e-05,-0.000434,-0.000304,-0.001425,-0.001506,0.003385,-0.000449,-0.000364,0.001128,-0.000108,0.000627,0.001766,0.00198,-0.00082,0.000927,-0.001356,0.000624,0.000166,-0.000556,0.000795,-3e-06,-0.000322,0.000392,0.000619,-0.001211,-0.000523,0.000215,0.000149,6.9e-05,-9.6e-05,0.000114,-0.000951,0.000813,-2.1e-05,-0.000315,-5.1e-05,-0.000304,5e-06,0.000171,-0.000325,-0.000103,-6e-05,-0.000292,-5.6e-05,0.000342,-9.4e-05,0.000186,-0.000538,-7.9e-05,1e-06,-6.2e-05,-5.1e-05,5e-05,-4.3e-05,4.2e-05,-5.4e-05,1e-06,0.000178,2.3e-05
-2e-05,-6e-06,-1.4e-05,5e-06,-6e-06,-9e-06,-1.7e-05,1.4e-05,3e-06,6e-06,2.4e-05,-4.8e-05,-4e-06,-3e-06,-9e-06,-2.1e-05,1.2e-05,-2.1e-05,-1e-06,-2e-06,1.2e-05,0,-2.3e-05,-2.8e-05,-4e-06,-1.4e-05,-9e-06,3.7e-05,7e-06,-3.6e-05,-9e-06,-0.000101,-1.4e-05,-2.5e-05,2e-06,4e-06,3.9e-05,-1.9e-05,8e-06,-8e-06,4e-06,-2.8e-05,1.7e-05,3.1e-05,-1e-05,-1.8e-05,-1.5e-05,1.2e-05,-1.1e-05,6.3e-05,1.5e-05,-9.8e-05,-2e-06,-0.000128,-0.000243,-6e-06,-0.000102,-0.000251,0.000409,8e-05,3e-05,-8.5e-05,-0.000553,-8e-06,-7.4e-05,0.000138,0.001205,0.000696,-0.000472,-0.000619,-0.000578,-4.1e-05,0.000126,-7e-04,-0.000131,-0.001125,-8.4e-05,-0.000244,0.001922,-0.000299,-0.000399,-0.000739,-8.5e-05,4.2e-05,-0.001136,-7e-04,0.000171,0.000994,0.000312,-0.000429,-2.9e-05,0.000384,-0.000541,0.000265,-0.001068,-0.000731,3.5e-05,-0.000158,0.000517,-3.7e-05,5.2e-05,3.5e-05,-0.000123,-3.8e-05,-0.000212,-4.7e-05,0.000386,-0.000217,2.4e-05,0.000392,0.000307,-5.9e-05,3.8e-05,6e-06,-3.1e-05,-7.3e-05,0.000117,4.1e-05,4e-06,-7.2e-05,6e-06
-1.7e-05,3e-06,-1e-06,-9e-06,-1.1e-05,2e-06,1.4e-05,-1.3e-05,0,1e-06,1e-06,-8e-06,3e-05,-1.1e-05,5e-06,-9e-06,-7e-06,-1.9e-05,-7e-06,1e-05,-1.2e-05,-2e-06,-7e-06,1.4e-05,-1.2e-05,-1.4e-05,4e-06,3e-06,3e-06,6e-06,-1.2e-05,1.8e-05,0,-1.7e-05,-1.2e-05,-4e-06,-7e-06,2e-06,-2.3e-05,1.8e-05,-3.2e-05,-2.6e-05,1.7e-05,-1.9e-05,1.2e-05,9e-06,-1e-05,1e-06,-4.2e-05,5.7e-05,0,-8.1e-05,3.6e-05,4.4e-05,0.000256,7.7e-05,0.000124,0.000188,-0.000442,-0.00014,7.3e-05,-5.2e-05,-0.000149,-0.000137,0.000517,-0.000217,-0.000351,-0.001609,1.4e-05,-0.000342,2.8e-05,-0.000472,-0.00017,0.000733,-0.000276,0.000562,-0.000233,-0.000541,-0.003041,-1.5e-05,-0.000676,-1.5e-05,-0.000212,-0.000603,-0.000645,-0.000849,-0.000159,-0.000344,-0.000165,0.000626,-0.000496,0.000264,8.1e-05,8.3e-05,1e-06,0.000202,-0.000501,3e-05,0.000416,-0.000248,-1.6e-05,9.4e-05,-3e-05,4.2e-05,8.4e-05,-0.000226,3.2e-05,-0.000121,-0.000105,-0.000171,0.000124,-0.000147,-5.1e-05,1.1e-05,2e-05,-4e-05,-8.6e-05,-4.2e-05,1.2e-05,0.000115,-5.8e-05
5e-06,7e-06,1.6e-05,3e-06,-1.7e-05,-4e-06,3.3e-05,4e-06,1e-06,1e-05,-3e-06,5e-06,-7e-06,3e-06,-6e-06,-4e-06,-1.5e-05,1.8e-05,-4e-06,-2e-06,1.2e-05,-3e-06,-2.1e-05,1.8e-05,-2e-05,-1e-06,1.2e-05,-2.9e-05,-4e-06,-3e-06,-1.7e-05,3.8e-05,6e-06,2.2e-05,4e-06,-8e-06,2.2e-05,2e-06,-2.7e-05,2e-05,-7e-06,-1.2e-05,9e-06,-5e-06,-7e-06,3e-06,-1e-06,1e-06,4e-06,-0.000112,0.000129,-9.2e-05,2.5e-05,2.6e-05,-0.000205,-0.000134,3.5e-05,-0.000211,0.000265,0.000106,-1.1e-05,6.3e-05,2.7e-05,-6e-06,-0.000598,-0.000449,0.000399,-0.001013,0.000107,0.000437,0.000409,-0.000481,-3e-04,-0.000536,-0.000511,5.2e-05,0.000697,-1.6e-05,-1e-04,-0.000293,0.000313,-0.000211,-0.00012,0.000545,0.000617,-0.000216,-0.000585,-9.9e-05,-0.000263,0.00017,0.000807,-0.000368,0.000847,-0.000234,0.000345,0.000635,0.000449,0.000262,-2.7e-05,4.7e-05,9e-06,-8.2e-05,-8.6e-05,-3.1e-05,0.000256,0.000109,0.000183,7.8e-05,-1.1e-05,2.1e-05,-2.5e-05,-0.000121,8e-05,-1.3e-05,-2e-06,-1.1e-05,8.5e-05,1.4e-05,1.2e-05,-9.4e-05,4e-05
9e-06,-8e-06,-2e-06,-5e-06,-1.4e-05,8e-06,1.8e-05,1e-06,-2e-06,1e-06,7e-06,1e-06,2e-06,-1.2e-05,-1.2e-05,4e-06,4e-06,1.4e-05,7e-06,-1e-05,1.6e-05,1e-06,0,1e-05,2e-06,-6e-06,4e-06,1.3e-05,2.2e-05,2e-05,-4e-06,-6e-06,1e-06,-9e-06,1.1e-05,-1e-05,2.7e-05,4e-06,-4.2e-05,-1e-06,-5e-06,5e-06,2e-06,-1.5e-05,0,-6e-06,-1e-06,-8e-06,0,9.4e-05,-0.000236,0.000453,-8e-06,-0.000107,0.000127,7.4e-05,1.8e-05,-1e-06,-8.1e-05,-9.4e-05,-1e-06,-0.00011,-0.000121,1.2e-05,0.000325,-0.00017,-0.000853,-0.000474,0.000124,0.000271,-0.000312,-0.000172,-0.000123,0.000557,-0.000154,0.000381,-0.000352,0.000174,4e-04,8.7e-05,0.000213,-0.00017,0.000318,6e-05,-1.2e-05,-0.000119,0.000295,0.000636,-0.000472,-0.000357,-0.000478,-5.2e-05,-5.2e-05,0.000283,-0.00014,-0.000362,-8.7e-05,0.000153,-0.000161,9e-05,6.8e-05,-7.1e-05,5.5e-05,-1.2e-05,8.5e-05,0.000133,-0.000276,0.000126,-7.1e-05,-0.000104,-0.000341,-6e-05,-5.6e-05,-1.3e-05,7e-06,-3.6e-05,2.4e-05,7e-06,-1.1e-05,-9e-06,-2e-06
3e-06,-6e-06,5e-06,-5e-06,9e-06,-9e-06,3e-06,0,-1e-06,3e-06,5e-06,-6e-06,-6e-06,-4e-06,-1.5e-05,6e-06,6e-06,-8e-06,-8e-06,-9e-06,-1.9e-05,-8e-06,1.1e-05,4e-06,3e-06,7e-06,-6e-06,-4e-06,9e-06,-1.1e-05,3e-06,1e-05,-1e-06,4e-06,-5e-06,1.9e-05,-3e-06,-7e-06,-8e-06,-3e-06,-4e-06,6e-06,1e-06,2e-06,3e-06,-4e-06,1.1e-05,-1.2e-05,-9e-06,-7.8e-05,1e-04,-2e-05,-8.9e-05,8e-06,4.3e-05,-1.5e-05,2.6e-05,3.8e-05,-5.5e-05,9.5e-05,-5.9e-05,1.2e-05,-3.2e-05,-4e-05,4.5e-05,8.3e-05,0.001096,0.000341,0.000217,2e-05,-0.00052,6.9e-05,-0.000176,-0.000883,-0.00021,-0.000698,0.000419,-0.00027,0.000581,0.000621,-0.000208,-5.6e-05,0.000302,0.000344,-0.000416,0.000227,0.000241,-0.000301,-1e-06,0.000157,0.000302,-0.000188,5.7e-05,0.000219,-0.000205,9.8e-05,6.4e-05,-0.00028,-8.7e-05,3.8e-05,-4.1e-05,0.000111,-0.000102,-1.8e-05,-0.000116,2.4e-05,4.6e-05,9.9e-05,-0.000115,0.000114,0.000261,1.2e-05,1.5e-05,2e-06,-5e-06,1.7e-05,4e-06,1.1e-05,1e-05,-3e-05,-3.2e-05
-1.2e-05,-3e-06,2e-05,3e-06,0,5e-06,-2.6e-05,-3e-06,-2e-06,-5e-06,-6e-06,4e-06,-1.3e-05,-7e-06,-3e-06,-2e-06,-9e-06,6e-06,1e-06,4e-06,8e-06,0,-1e-06,4e-06,-1e-06,2e-06,-9e-06,-4e-06,-5e-06,8e-06,8e-06,-1.5e-05,0,-4e-06,-3e-06,-7e-06,-1e-05,2e-06,0,-3e-06,1e-06,-7e-06,-1.1e-05,-1.1e-05,-8e-06,-9e-06,3e-06,1e-06,1e-06,4.8e-05,-3.4e-05,0.000103,7.5e-05,5.7e-05,-0.000122,4e-05,-1e-05,-3.9e-05,0.000155,-1.4e-05,5.4e-05,1.5e-05,1.9e-05,0.000122,-0.000405,-8.9e-05,-0.000755,-0.000784,-0.000255,0.000226,-0.000185,-0.000124,-0.000191,0.000736,0.000632,-0.000206,0.000251,-9.3e-05,2.6e-05,-0.000226,-0.000167,-6.9e-05,-0.000365,-0.000225,0.000153,0.000116,-0.000238,0.000106,-9e-05,-5e-06,-0.000173,0.000566,-2.2e-05,0.000352,-0.000104,5.4e-05,-0.00012,-1.7e-05,0.000136,3.6e-05,-9.4e-05,3e-05,5.7e-05,1.5e-05,-1e-04,-9.1e-05,-6.3e-05,1e-04,-5.3e-05,-8.4e-05,-0.000123,2.2e-05,-1.1e-05,-1.1e-05,1.2e-05,-5e-06,-5e-06,-8e-06,-1.9e-05,2.8e-05,1.5e-05
1e-05,-6e-06,-1.1e-05,0,1e-06,2e-06,-7e-06,4e-06,-4e-06,3e-06,-6e-06,5e-06,4e-06,-4e-06,7e-06,-2e-06,-2e-06,3e-06,0,-2e-06,-9e-06,-2e-06,3e-06,-5e-06,-4e-06,2e-06,-1e-06,1e-05,-1.1e-05,-7e-06,3e-06,-1.5e-05,-4e-06,-4e-06,0,-8e-06,-4e-06,2e-06,5e-06,-6e-06,-7e-06,-4e-06,6e-06,3e-06,1e-06,-3e-06,-7e-06,-7e-06,-3e-06,-1.9e-05,-2e-06,-0.000126,2.1e-05,-2e-06,0.000125,-2.3e-05,-2.6e-05,0.000146,-0.000131,4.7e-05,2e-06,3.3e-05,-3.2e-05,-9.1e-05,0.000268,-0.000261,0.000349,0.000627,-0.000128,-0.000179,0.000151,5.6e-05,6.5e-05,-0.000144,0.000321,0.000245,-0.000203,0.000247,0.000162,-0.00022,0.000222,0.000127,-0.000218,1.8e-05,3.1e-05,-6.6e-05,0.00017,0.000192,9.2e-05,-4.9e-05,-1.3e-05,-0.000324,0.000178,-0.000232,-4.3e-05,-0.000117,1.5e-05,0.000112,4.9e-05,7e-06,-2.4e-05,-3.4e-05,2.1e-05,1.8e-05,-1.9e-05,-9e-06,1.8e-05,7.8e-05,-8e-06,2.4e-05,5.1e-05,6e-06,2e-06,-5e-06,-1.3e-05,2e-05,-1e-06,7e-06,1.7e-05,-2.4e-05,-1e-05
-3e-06,-5e-06,2e-06,-3e-06,-4e-06,-1e-06,-1.8e-05,-5e-06,-3e-06,-3e-06,1e-05,-3e-06,4e-06,-1e-06,0,-2e-06,5e-06,-6e-06,-1e-06,0,-3e-06,-3e-06,-8e-06,-1e-05,-1.3e-05,-1e-06,-8e-06,-4e-06,0,-2e-06,8e-06,-3e-06,2e-06,-2e-06,1e-06,6e-06,-1.2e-05,-3e-06,1e-06,-5e-06,-4e-06,4e-06,-1e-05,3e-06,8e-06,-6e-06,0,-3e-06,1e-06,-4.1e-05,2.3e-05,-1.2e-05,-3.5e-05,-9e-06,-0.000122,-6e-06,0,-7.1e-05,9.7e-05,-1.3e-05,-1.4e-05,-1.7e-05,-3.7e-05,3.1e-05,-3.8e-05,0.000105,-0.000567,0.00016,-2e-04,-0.000208,0.000249,6.8e-05,8e-06,0.000192,-0.000794,0.000111,0.000447,0.000304,0.000118,0.00018,0.00011,2.1e-05,-7.8e-05,-0.000234,0.000415,-0.000145,-0.000188,9.2e-05,8.9e-05,-0.000157,-8.3e-05,0.000127,-7.8e-05,0.000153,9.1e-05,0.000105,2.7e-05,-7.4e-05,-9e-05,-7e-06,2.7e-05,-8e-06,-8e-06,-1.5e-05,3.4e-05,-5.5e-05,-5.3e-05,2.9e-05,-3.1e-05,1e-06,9e-06,2.2e-05,-8e-06,-2e-06,5e-06,8e-06,8e-06,6e-06,6e-06,1.6e-05,1.3e-05
-1e-06,-4e-06,8e-06,1e-06,-1e-06,-4e-06,3e-06,1e-06,1e-06,1e-06,-2e-06,-8e-06,5e-06,0,-6e-06,-3e-06,2e-06,4e-06,-3e-06,-2e-06,4e-06,1e-06,-9e-06,-3e-06,6e-06,-2e-06,6e-06,-4e-06,2e-06,2e-06,-7e-06,-2e-05,-3e-06,4e-06,-3e-06,-7e-06,-8e-06,-3e-06,4e-06,1e-06,-6e-06,1e-06,2e-06,3e-06,-8e-06,2e-06,3e-06,-2e-06,-1e-06,5.7e-05,-5.7e-05,-6.1e-05,-2e-06,1.6e-05,0.000128,-1.7e-05,-6e-06,-7e-06,-2.9e-05,3e-06,9e-06,-3.6e-05,5.1e-05,-4e-05,-0.000161,-0.000163,0.000434,0.000288,0.000202,-0.000444,-0.00021,-5.7e-05,6.7e-05,-0.00019,-0.00022,-0.000247,-4.4e-05,0.000187,-0.00031,2.4e-05,5.4e-05,4.9e-05,0.000157,-8e-06,-2.6e-05,0.000212,-8.4e-05,-0.000217,1.4e-05,-9.9e-05,1e-05,-0.000367,-7.9e-05,-0.000131,-0.000183,-9.7e-05,-3.1e-05,-6.5e-05,1.2e-05,5e-05,3.5e-05,-2.3e-05,2.6e-05,-8e-06,7e-05,8e-06,-5e-05,1.6e-05,-2.2e-05,-5e-06,-2.8e-05,-2.8e-05,1.5e-05,-3e-06,-4e-06,1.9e-05,1.4e-05,-1.2e-05,-1.6e-05,-1e-05,-1.1e-05
-3e-06,-2e-06,-3e-06,2e-06,-3e-06,4e-06,7e-06,0,0,1e-06,-2e-06,1e-06,-2e-06,1e-06,0,1e-06,-2e-06,-1e-06,2e-06,2e-06,2e-06,-1e-06,0,2e-06,-1e-06,-3e-06,-2e-06,1e-06,-3e-06,-6e-06,-5e-06,-2e-06,0,-8e-06,-2e-06,1e-06,3e-06,1e-06,-1e-05,2e-06,-4e-06,-1e-06,-9e-06,-1e-06,-1e-06,-2e-06,-4e-06,5e-06,1e-06,-6e-05,9.8e-05,-3.7e-05,5e-06,-6e-06,-8.7e-05,2.9e-05,-8e-06,1e-05,-3.3e-05,-4e-06,9e-06,1e-05,3.6e-05,6.1e-05,0.000121,-8.7e-05,8.7e-05,5e-04,-7.8e-05,-4.4e-05,-2.5e-05,-2.6e-05,3e-05,-0.000168,0.000517,0.000129,6.1e-05,2.1e-05,0.000506,-8.4e-05,-0.000164,8.3e-05,-4.9e-05,-8.3e-05,-9e-05,-4.3e-05,0.000351,-9.1e-05,1e-05,0.000155,1e-05,0.00031,0.000102,-1e-04,-4.5e-05,-7.8e-05,-4.5e-05,3.8e-05,-2.1e-05,-3.1e-05,1.8e-05,3e-06,-5.1e-05,8e-06,2.2e-05,8.7e-05,-5.7e-05,8e-06,-4e-06,-3.2e-05,3e-06,-1.9e-05,-7e-06,-2e-06,4e-06,1e-06,-1e-05,7e-06,5e-06,1.4e-05,8e-06
5e-06,-2e-06,4e-06,-2e-06,0,-1e-06,6e-06,-1e-06,-3e-06,1e-06,1e-06,-1e-06,-6e-06,0,3e-06,2e-06,-2e-06,-5e-06,-1e-06,1e-06,2e-06,1e-06,-2e-06,2e-06,-2e-06,0,3e-06,1e-06,-5e-06,3e-06,-3e-06,1e-05,-1e-06,3e-06,1e-06,-2e-06,2e-06,-1e-06,-1.1e-05,0,-1e-06,-2e-06,-1e-06,-3e-06,6e-06,4e-06,0,-1e-06,0,3.4e-05,-5e-05,5.1e-05,3e-06,-1.8e-05,4.5e-05,2e-06,-4e-06,-8.1e-05,6.3e-05,-2.4e-05,-2.3e-05,2.1e-05,1.8e-05,-5.3e-05,-2.1e-05,0.000116,-0.000256,-0.000739,-5e-06,0.000129,2.4e-05,2.1e-05,-7.3e-05,-8.8e-05,4.2e-05,-9.6e-05,0.000153,3.7e-05,-0.000497,-8.1e-05,3e-05,-9.1e-05,3e-06,1.2e-05,8.8e-05,5e-06,4e-05,0.000188,-3e-05,0.000147,-2.5e-05,-0.000144,-0.000207,-4.1e-05,6.4e-05,0.000109,7.1e-05,8.1e-05,3e-06,-2.6e-05,3e-06,-7e-06,3.9e-05,7e-06,-4.2e-05,1.2e-05,-8.2e-05,-1.5e-05,-2.3e-05,5.3e-05,-3.2e-05,-6e-06,-1e-06,-3e-06,0,8e-06,-1e-06,-2e-06,-6e-06,-1.8e-05,-9e-06
-2e-06,-1e-06,-3e-06,1e-06,-2e-06,1e-06,0,0,-2e-06,2e-06,4e-06,0,-1e-06,3e-06,-4e-06,1e-06,-3e-06,1e-06,-1e-06,-3e-06,-2e-06,0,6e-06,0,-5e-06,1e-06,-1e-06,-2e-06,-2e-06,-2e-06,-1e-06,-1e-06,0,0,0,3e-06,6e-06,0,-1.2e-05,-1e-06,-2e-06,0,-7e-06,-1e-06,-4e-06,0,4e-06,-2e-06,1e-06,-1.5e-05,-5e-06,5.7e-05,-6e-06,1e-05,-4.4e-05,7e-06,-1e-06,8.4e-05,-2.6e-05,5e-06,2.1e-05,-2.3e-05,3.2e-05,3.9e-05,-0.000153,-2.8e-05,6.5e-05,-0.000652,-1.6e-05,-8.7e-05,-0.000198,-3e-05,-3.3e-05,7.8e-05,-0.000146,3.7e-05,2e-05,-0.000178,2e-04,5.1e-05,4.2e-05,-5.6e-05,-0.000203,8e-05,7.9e-05,-8.8e-05,-0.000202,-6.9e-05,5e-06,8e-05,6.8e-05,7.6e-05,9e-06,-1.5e-05,2.9e-05,3.3e-05,-3.8e-05,-8e-06,5.2e-05,-3.8e-05,6e-06,-2.4e-05,-3.4e-05,-4e-06,-3.6e-05,-2.3e-05,-6.1e-05,-1.6e-05,-2.9e-05,-4.4e-05,6.4e-05,3e-06,-2e-06,0,0,-5e-06,8e-06,-5e-06,0,1.5e-05,6e-06
0,0,0,0,2e-06,-2e-06,2e-06,0,1e-06,0,-4e-06,0,-2e-06,0,-5e-06,1e-06,0,1e-06,0,-4e-06,-1e-06,0,3e-06,0,-1e-06,1e-06,-3e-06,3e-06,0,-1e-06,3e-06,5e-06,0,2e-06,-1e-06,-4e-06,6e-06,0,-8e-06,1e-06,1e-06,4e-06,-2e-06,-2e-06,0,0,-1e-06,0,0,-1e-05,1.1e-05,-7.9e-05,0,-2e-06,3.6e-05,-1.9e-05,6e-06,-5.7e-05,-4e-06,-2.1e-05,-8e-06,1.3e-05,1.5e-05,-6.3e-05,0.000127,6e-06,0.000207,0.000117,-9.2e-05,0.000176,0.000338,-1.2e-05,-6.9e-05,6.9e-05,-1.9e-05,6.1e-05,0.000114,-4.4e-05,-0.000225,0.000124,6e-05,-8.1e-05,6.6e-05,-0.000151,-1.1e-05,2.2e-05,0.000121,0.000146,-1.3e-05,-3.3e-05,-0.000153,-0.000122,5.2e-05,7.2e-05,8.4e-05,-0.000161,5.6e-05,-5e-06,3.3e-05,-1.1e-05,1e-05,1.2e-05,1.4e-05,-8e-06,-6e-06,-4.1e-05,-2e-05,-1e-05,-1.4e-05,1.5e-05,-2.5e-05,6e-06,5e-06,1e-06,1e-06,-6e-06,0,2e-06,3e-06,-1.6e-05,1e-06
0,0,5e-06,1e-06,1e-06,1e-06,-4e-06,0,-1e-06,1e-06,0,0,6e-06,2e-06,0,-1e-06,3e-06,-1e-06,1e-06,3e-06,-3e-06,1e-06,-2e-06,2e-06,1e-06,1e-06,0,-2e-06,2e-06,-1e-06,6e-06,-6e-06,1e-06,-5e-06,0,3e-06,1e-06,-1e-06,1e-06,2e-06,-3e-06,1e-06,-3e-06,0,0,-1e-06,-3e-06,-3e-06,0,2.6e-05,-6e-06,1.3e-05,5e-06,-1.4e-05,-1.9e-05,-1e-06,8e-06,2.2e-05,0,3e-06,-1.4e-05,8e-06,-3.1e-05,6.9e-05,-2.5e-05,2e-06,-0.000289,0.000177,-1.1e-05,3.2e-05,-0.000226,-1.7e-05,-1.1e-05,8.6e-05,-6.1e-05,-0.000143,-1e-06,-5.5e-05,0.000155,-7.9e-05,-8.6e-05,-2.5e-05,0.000148,0.000107,-0.000187,6.2e-05,2e-05,-9.8e-05,1.5e-05,-7.2e-05,0.000181,8.6e-05,3.2e-05,2.8e-05,-9.3e-05,6e-05,-7.3e-05,-6.2e-05,-1.7e-05,9e-06,-2e-05,3.4e-05,2e-06,2e-06,1.6e-05,-2.4e-05,-1.3e-05,-1.1e-05,-1.7e-05,-1.3e-05,1e-05,-1e-06,-7e-06,-3e-06,-2e-06,-1e-05,-2e-06,-1e-06,-5e-06,2e-06,-3e-06
1e-06,1e-06,-5e-06,0,-1e-06,-1e-06,2e-06,0,-2e-06,-1e-06,0,-1e-06,-1e-06,1e-06,2e-06,0,-1e-06,1e-06,-1e-06,-2e-06,3e-06,0,-1e-06,1e-06,1e-06,0,-1e-06,-2e-06,2e-06,0,0,-1e-06,0,0,2e-06,-2e-06,0,1e-06,2e-06,-1e-06,-1e-06,-5e-06,-2e-06,1e-06,0,-3e-06,0,-1e-06,0,-3.5e-05,1e-05,-4.6e-05,2e-06,-3e-06,-8e-06,9e-06,3e-06,3e-05,1.5e-05,-5e-06,2.4e-05,-9e-06,-2e-06,-4.3e-05,-8.8e-05,-1.6e-05,0.000228,0.000218,4.1e-05,-0.000157,0.000156,0,0,2.8e-05,-4.1e-05,9.6e-05,6.6e-05,-4.4e-05,0.000112,-2.3e-05,-9.9e-05,3e-06,4e-06,-5.8e-05,-8.7e-05,8e-05,-8.2e-05,-6.9e-05,2e-05,-3.3e-05,-0.000143,-3.5e-05,8e-06,3.7e-05,-1e-06,4.3e-05,1.8e-05,4.4e-05,-1.3e-05,-7e-06,-3.3e-05,-1.6e-05,-1.6e-05,5e-06,2.4e-05,2.7e-05,2e-06,-2e-06,-2.2e-05,1.7e-05,-4e-05,0,1e-06,-2e-06,2e-06,-9e-06,-3e-06,-2e-06,4e-06,-8e-06,-2e-06
-3e-06,2e-06,0,-1e-06,-2e-06,1e-06,1e-06,0,-1e-06,0,2e-06,0,-1e-06,1e-06,0,0,-1e-06,1e-06,0,-2e-06,1e-06,1e-06,-4e-06,0,-3e-06,-1e-06,0,3e-06,5e-06,0,-3e-06,0,1e-06,0,-1e-06,-2e-06,-3e-06,0,4e-06,-1e-06,-2e-06,-2e-06,1e-06,2e-06,1e-06,-1e-06,2e-06,-2e-06,0,2.8e-05,-1.8e-05,3.8e-05,-9e-06,3e-06,3.9e-05,6e-06,-2e-06,-4.3e-05,-1.9e-05,3e-06,-8e-06,3e-06,1.6e-05,2.6e-05,9.1e-05,-6.9e-05,-0.00014,0.000101,9.7e-05,3.2e-05,-9.4e-05,-3e-06,3.9e-05,-0.000151,0.000153,-3.3e-05,7.5e-05,-7.3e-05,-0.000211,5.4e-05,1.1e-05,2.5e-05,-9.3e-05,0.000118,5.9e-05,-3.1e-05,6.6e-05,5.7e-05,8e-06,-2.7e-05,0.000101,-1.7e-05,2.9e-05,-1.5e-05,0.000129,-5.2e-05,-4e-06,-5e-06,-1e-05,7e-06,-4e-06,-1.1e-05,1.3e-05,0,9e-06,2.6e-05,-1.7e-05,3e-06,-1.3e-05,-2.2e-05,1.3e-05,-1.7e-05,1e-06,0,-2e-06,2e-06,-1e-06,1e-06,-4e-06,8e-06,2e-06
3e-06,2e-06,5e-06,1e-06,0,-1e-06,-5e-06,0,0,0,-3e-06,-1e-06,-2e-06,1e-06,-2e-06,0,1e-06,0,0,1e-06,0,0,-2e-06,0,-3e-06,0,2e-06,-2e-06,0,0,-2e-06,-6e-06,-1e-06,0,-1e-06,3e-06,-5e-06,-1e-06,-2e-06,0,-2e-06,2e-06,-1e-06,0,-1e-06,-2e-06,-1e-06,1e-06,0,-1.6e-05,6e-06,2.9e-05,-2e-06,-4e-06,-3.1e-05,0,-1e-06,3.9e-05,1.4e-05,1.5e-05,-9e-06,-1.6e-05,-1.9e-05,-3.6e-05,-2.1e-05,2.9e-05,5.1e-05,0.000101,-2.3e-05,-7.1e-05,9.1e-05,-2e-05,7.6e-05,9.9e-05,8.4e-05,-2.1e-05,2.6e-05,-9e-05,-0.000194,3.5e-05,3.4e-05,3e-05,-7.6e-05,-3.1e-05,4.7e-05,-5.8e-05,-3.9e-05,-1.2e-05,3.4e-05,1.5e-05,-3.1e-05,2.5e-05,-4.9e-05,1.1e-05,-4e-06,2.5e-05,1.9e-05,-4.6e-05,0,-6e-06,1.8e-05,7e-06,-8e-06,-5e-06,-1.7e-05,1.5e-05,1.5e-05,5e-06,-9e-06,1.9e-05,4.7e-05,-1.3e-05,-2e-06,0,2e-06,-7e-06,2e-06,3e-06,0,1e-06,1e-06
-1e-06,2e-06,-3e-06,-1e-06,0,0,-2e-06,0,-1e-06,0,0,-1e-06,-2e-06,0,0,1e-06,0,1e-06,0,0,2e-06,1e-06,2e-06,0,1e-06,-1e-06,-3e-06,0,-5e-06,0,-2e-06,0,0,-1e-06,1e-06,-2e-06,-2e-06,0,-5e-06,0,0,2e-06,2e-06,0,1e-06,1e-06,0,0,0,-1e-06,1.5e-05,2.5e-05,6e-06,2e-06,1e-05,-1e-05,-1e-06,-4.2e-05,-1e-06,-2e-06,1.2e-05,7e-06,0,3.5e-05,-6.4e-05,3.1e-05,0.000103,-4.3e-05,9e-06,-6.3e-05,-3.9e-05,8e-06,4.6e-05,-5.3e-05,-0.000142,-4e-06,5e-05,-5e-06,0.000171,-4e-05,0,3.7e-05,-4e-06,6.3e-05,-9.8e-05,-9.6e-05,-3.7e-05,8.5e-05,3.3e-05,1.4e-05,-4.4e-05,-4.6e-05,2.2e-05,-3e-06,-6e-05,-1e-06,1e-05,-1.5e-05,2.4e-05,1.7e-05,1.5e-05,4e-06,-2e-06,1e-06,-2e-05,-2e-06,-2e-06,7e-06,-1.4e-05,-1.4e-05,-5.5e-05,-1e-05,-1e-06,-1e-06,-2e-06,3e-06,-2e-06,-3e-06,5e-06,-2e-06,2e-06
-1e-06,1e-06,1e-06,0,0,-1e-06,-7e-06,0,-1e-06,1e-06,2e-06,0,2e-06,0,2e-06,0,0,-1e-06,-1e-06,-1e-06,-4e-06,0,0,-1e-06,0,1e-06,3e-06,1e-06,-3e-06,2e-06,0,-2e-06,0,0,0,1e-06,-1e-06,1e-06,-8e-06,-1e-06,-2e-06,0,0,-1e-06,-1e-06,-1e-06,1e-06,0,0,1e-05,-6e-06,1.9e-05,2e-06,2e-06,-1.1e-05,2e-06,-1e-06,-4e-06,-1.3e-05,1.2e-05,-6e-06,5e-06,1e-06,-1.2e-05,7.5e-05,-4.4e-05,-0.000154,-0.000203,-5.3e-05,7.7e-05,-4.8e-05,-3e-06,4.1e-05,8.4e-05,-5.6e-05,-5e-06,3.1e-05,1.9e-05,0.000163,-1e-05,9e-06,1.2e-05,5.2e-05,-1.6e-05,-3e-06,8.2e-05,1.1e-05,-5.7e-05,2e-06,3.8e-05,6.1e-05,4.6e-05,1.3e-05,-5.2e-05,4e-05,-2.7e-05,-3.2e-05,3.8e-05,-6e-06,1e-05,4e-06,-1.6e-05,9e-06,2e-06,1e-06,-3.5e-05,1.2e-05,4e-06,-1.4e-05,1e-05,2.8e-05,4e-06,4e-06,-1e-06,1e-06,0,-1e-06,3e-06,-3e-06,4e-06,-5e-06
0,2e-06,-1e-06,0,0,1e-06,2e-06,0,0,0,0,1e-06,2e-06,-1e-06,-1e-06,-1e-06,-1e-06,0,0,0,1e-06,0,2e-06,-1e-06,0,0,-3e-06,-1e-06,0,-4e-06,2e-06,-1e-06,0,-1e-06,-1e-06,-1e-06,0,-1e-06,-6e-06,0,0,-2e-06,3e-06,-1e-06,0,1e-06,1e-06,0,0,-1.9e-05,-1.4e-05,-5.7e-05,-1e-06,0,2.2e-05,1e-06,-2e-06,3.7e-05,2.4e-05,0,-5e-06,-6e-06,-1.3e-05,4e-06,-1.3e-05,2e-05,7e-06,-8.5e-05,-7.8e-05,-2.2e-05,4.8e-05,-4e-06,-2.1e-05,-3.9e-05,4.4e-05,-6e-06,2.4e-05,5.8e-05,-0.000235,3e-05,9e-06,-8e-06,2.7e-05,-6.8e-05,5.3e-05,2.2e-05,-2.8e-05,-4.3e-05,-1.5e-05,3.7e-05,-6.9e-05,-5.2e-05,3e-06,1.8e-05,-1.5e-05,2.1e-05,1.5e-05,8e-06,-2.4e-05,6e-06,-4e-06,-4e-06,-7e-06,0,1.1e-05,-1.7e-05,6e-06,3e-06,-1e-05,-7e-06,-3e-06,7e-06,-2e-06,-1e-06,0,7e-06,-1e-06,1e-06,2e-06,-6e-06,4e-06
1e-06,1e-06,0,-1e-06,0,0,3e-06,0,0,1e-06,-2e-06,-1e-06,1e-06,0,-3e-06,0,-1e-06,0,0,-2e-06,0,0,-1e-06,0,-2e-06,0,2e-06,-1e-06,0,3e-06,1e-06,3e-06,0,1e-06,0,1e-06,3e-06,0,-3e-06,0,-1e-06,-1e-06,1e-06,-1e-06,1e-06,0,-1e-06,-1e-06,0,1.8e-05,2.1e-05,6e-06,-3e-06,-1e-06,-1.4e-05,5e-06,-2e-06,-3.9e-05,-2.9e-05,1e-06,1.4e-05,5e-06,-9e-06,-1.5e-05,-5e-05,-2.5e-05,0.000111,-0.000199,-3.3e-05,1e-05,-1.4e-05,3e-06,-3.2e-05,-9e-06,4.3e-05,1.6e-05,3.2e-05,5e-05,0.000201,2.3e-05,7.9e-05,-4.1e-05,-6.7e-05,1.8e-05,9.4e-05,1.2e-05,-1.2e-05,1e-06,-7e-06,-3e-05,5.8e-05,5.7e-05,1.5e-05,1e-05,4.7e-05,3e-06,-1e-06,1.1e-05,5e-06,-7e-06,2e-06,1e-05,1.4e-05,-2e-06,7e-06,1.4e-05,1.8e-05,4e-06,-1.2e-05,3e-06,-1.9e-05,9e-06,-1e-06,0,0,-1e-06,-1e-06,-4e-06,-1e-06,4e-06,0
0,1e-06,2e-06,0,0,1e-06,6e-06,0,-1e-06,0,2e-06,-1e-06,-2e-06,-1e-06,-1e-06,0,1e-06,-1e-06,-1e-06,0,0,0,-2e-06,1e-06,-1e-06,0,-1e-06,2e-06,0,-1e-06,0,-3e-06,0,-2e-06,1e-06,-2e-06,3e-06,0,0,0,-1e-06,2e-06,3e-06,0,-2e-06,0,1e-06,0,0,-1.5e-05,-1.4e-05,-4.5e-05,0,1e-06,-2e-06,-3e-06,-1e-06,4.3e-05,1.7e-05,-2e-06,-1.3e-05,4e-06,1.2e-05,1.1e-05,7e-05,-2.8e-05,-7.2e-05,1.7e-05,1.3e-05,1.4e-05,-1.4e-05,4e-06,-4e-05,-8e-05,9.1e-05,-4.8e-05,1.9e-05,2.6e-05,-0.000211,-3.6e-05,-5e-06,-2.9e-05,-7.8e-05,-6.2e-05,-4.5e-05,-5.1e-05,6.9e-05,2.2e-05,4e-06,-2.3e-05,-6.5e-05,-4.6e-05,-5e-05,-1e-06,-1.8e-05,-4.4e-05,-8e-06,-1.9e-05,8e-06,0,7e-06,3e-06,-1e-05,-1e-06,2e-06,1.9e-05,2.1e-05,-2e-06,-1.3e-05,-7e-06,1.4e-05,4e-06,1e-06,0,0,4e-06,1e-06,3e-06,-1e-06,-8e-06,-1e-06
-2e-06,0,-2e-06,0,0,-1e-06,3e-06,0,-1e-06,0,0,0,-2e-06,0,2e-06,0,1e-06,0,0,0,2e-06,0,0,0,0,-1e-06,-1e-06,-1e-06,2e-06,0,1e-06,2e-06,0,1e-06,-1e-06,1e-06,2e-06,0,2e-06,0,0,1e-06,1e-06,1e-06,1e-06,-1e-06,0,-2e-06,0,4e-06,6e-06,1.4e-05,0,0,4e-06,-1e-06,2e-06,-2.9e-05,2e-06,-5e-06,2e-06,-5e-06,1e-06,8e-06,-2e-05,2e-06,-1.6e-05,0.000321,1.4e-05,-1.8e-05,4.2e-05,0,-3.9e-05,3.2e-05,-5.9e-05,1.4e-05,8e-06,1e-05,7e-06,3e-06,-8e-06,-2.4e-05,5.7e-05,4.3e-05,-7.2e-05,9e-06,-5.1e-05,2.5e-05,1.2e-05,-2e-06,5.2e-05,5.1e-05,2.2e-05,7e-06,-7.8e-05,1.4e-05,2e-05,8e-06,4e-06,-7e-06,-1.5e-05,-9e-06,-3e-06,2e-06,-5e-06,1.3e-05,4e-06,-4e-06,-1e-05,1e-05,5e-06,-1.1e-05,-1e-06,-1e-06,0,0,-1e-06,-2e-06,2e-06,8e-06,0
2e-06,0,0,0,0,0,-2e-06,0,0,0,-1e-06,-1e-06,0,0,0,0,0,0,0,-2e-06,-1e-06,0,-1e-06,0,1e-06,0,1e-06,0,0,1e-06,-2e-06,1e-06,0,-1e-06,0,0,1e-06,0,1e-06,0,-2e-06,-2e-06,2e-06,1e-06,1e-06,-1e-06,0,0,0,4e-06,-4e-06,2.4e-05,1e-06,-1e-06,-1e-06,-5e-06,2e-06,-2e-06,-1.3e-05,-2e-06,1e-05,0,2e-06,-9e-06,-3.3e-05,1.3e-05,2.1e-05,0.000158,9e-06,-1.8e-05,-4.7e-05,-8e-06,-2e-06,-1.1e-05,-0.000118,2e-05,2.2e-05,3e-06,9.6e-05,1.1e-05,-2.2e-05,-3e-06,5.5e-05,-4e-05,2.6e-05,-1.7e-05,-4.7e-05,-2.1e-05,1.2e-05,1.4e-05,-5e-05,-7.2e-05,-1.7e-05,5e-06,4.9e-05,2.1e-05,-2.1e-05,2e-05,8e-06,1e-06,-1.7e-05,-1e-06,6e-06,0,-8e-06,-6e-06,1.4e-05,-1e-06,-1e-05,-6e-06,1e-06,-8e-06,0,-1e-06,0,4e-06,-1e-06,-1e-06,-2e-06,-8e-06,-1e-06
-1e-06,0,2e-06,0,0,0,-5e-06,0,0,0,0,-1e-06,2e-06,0,-2e-06,0,-1e-06,0,0,0,0,-1e-06,0,0,0,0,-2e-06,0,-1e-06,-1e-06,-2e-06,-2e-06,0,1e-06,0,-1e-06,-2e-06,0,-1e-06,0,0,-1e-06,1e-06,0,-1e-06,-1e-06,0,-1e-06,0,-1.2e-05,-5e-06,1.5e-05,-1e-06,-1e-06,-1e-06,4e-06,0,2.4e-05,1.3e-05,-8e-06,-1.2e-05,-3e-06,2e-06,-3e-06,5.9e-05,2e-06,1e-06,-4.5e-05,3.6e-05,-1.5e-05,5e-06,6e-06,8e-06,8e-05,-2.7e-05,-1.7e-05,-1e-06,2.3e-05,-4e-06,-4e-06,-2.5e-05,1.5e-05,-1.7e-05,3.7e-05,5.1e-05,2.5e-05,8.1e-05,1.5e-05,-1e-06,2e-05,5.6e-05,4.7e-05,1e-05,1e-06,2.9e-05,-3.1e-05,2.3e-05,-1.9e-05,-9e-06,-8e-06,3e-06,6e-06,-1.4e-05,0,0,-2.2e-05,0,-3e-06,-1.1e-05,1e-06,-1.6e-05,-6e-06,0,0,0,-1e-06,0,2e-06,1e-06,8e-06,3e-06
0,0,-2e-06,0,0,1e-06,-3e-06,0,-1e-06,0,1e-06,0,1e-06,0,0,0,0,0,0,0,-1e-06,1e-06,2e-06,0,-1e-06,0,2e-06,-1e-06,0,1e-06,0,1e-06,0,-1e-06,1e-06,1e-06,-2e-06,0,-5e-06,0,-1e-06,2e-06,0,0,0,-1e-06,0,0,0,1.4e-05,2e-05,8e-06,0,0,-8e-06,2e-06,-1e-06,-4e-05,-6e-06,1e-06,2e-06,-1e-06,-4e-06,-3e-06,-1.8e-05,-1.9e-05,3.1e-05,-8.2e-05,-1e-06,-1e-06,2e-05,-4e-06,3.8e-05,-2e-06,0.000135,0,-9e-06,-1e-06,-5.6e-05,-1.2e-05,1.7e-05,3e-05,-4.3e-05,-1.3e-05,-3.7e-05,-1e-06,2e-06,-4.4e-05,-1.4e-05,-1.2e-05,-3.2e-05,-4e-06,2.8e-05,-1.3e-05,-4.7e-05,-3e-06,-2.3e-05,-1.2e-05,-3e-06,-5e-06,1.1e-05,6e-06,1.6e-05,-1e-06,7e-06,-1.3e-05,8e-06,-3e-06,-9e-06,-3e-06,1.2e-05,3e-06,1e-06,0,0,-3e-06,0,-2e-06,-1e-06,-7e-06,-3e-06
-1e-06,-1e-06,1e-06,0,0,0,-2e-06,0,-1e-06,0,0,0,0,0,2e-06,0,0,0,0,-1e-06,1e-06,-1e-06,-1e-06,0,-1e-06,1e-06,-1e-06,0,2e-06,-1e-06,2e-06,-3e-06,0,0,0,0,-2e-06,0,-5e-06,-1e-06,0,1e-06,0,-1e-06,1e-06,0,0,0,0,-1.2e-05,-2.3e-05,-1.9e-05,-1e-06,-1e-06,9e-06,3e-06,0,3e-05,-3e-06,-3e-06,1.1e-05,5e-06,2e-06,1.8e-05,-2.5e-05,1.7e-05,-6.4e-05,-0.000191,6e-06,-8e-06,-2.3e-05,-1e-06,3e-05,-4e-06,8.1e-05,-2.1e-05,1.2e-05,-1.1e-05,5.3e-05,-5e-06,4e-06,2.8e-05,-3.6e-05,-3e-06,-7e-05,-1.5e-05,-3.1e-05,7e-06,-7e-06,-1.3e-05,1.2e-05,1.7e-05,-2.2e-05,4e-06,-1e-05,8e-06,1.2e-05,2e-06,-1e-06,-5e-06,1e-05,-6e-06,-1e-05,1e-06,3e-06,1e-05,-8e-06,0,-8e-06,5e-06,-6e-06,6e-06,-1e-06,0,0,0,0,0,-1e-06,8e-06,3e-06
1e-06,-1e-06,0,0,0,0,1e-06,0,0,0,-1e-06,0,-2e-06,0,0,0,0,0,0,0,1e-06,1e-06,1e-06,0,0,0,0,0,1e-06,1e-06,0,0,0,-1e-06,0,0,-1e-06,0,-5e-06,0,0,-1e-06,-1e-06,-1e-06,-1e-06,-1e-06,0,0,0,5e-06,9e-06,-1.3e-05,0,0,2e-06,-5e-06,0,-1e-05,5e-06,2e-06,-1.2e-05,-2e-06,2e-06,-1.3e-05,5.1e-05,-2.3e-05,1.7e-05,-0.000117,8e-06,2.7e-05,5.3e-05,1e-06,1.7e-05,-2e-05,-0.000117,1.7e-05,-4e-06,-2.6e-05,2.6e-05,5e-06,1e-06,7e-06,1.5e-05,1.3e-05,2.3e-05,0,2.5e-05,2.8e-05,-3e-06,-1.4e-05,2.4e-05,-3.2e-05,-5e-06,-8e-06,-9e-06,-1.8e-05,-3e-06,5e-06,3e-06,2e-06,4e-06,-3e-06,8e-06,1e-06,-2e-06,1.8e-05,-3e-06,0,-9e-06,-5e-06,6e-06,6e-06,0,0,0,-4e-06,-1e-06,1e-06,1e-06,-7e-06,-2e-06
0,-1e-06,0,0,0,0,3e-06,0,0,0,1e-06,0,-1e-06,0,-2e-06,0,0,0,0,0,0,-1e-06,0,0,1e-06,0,2e-06,0,0,0,1e-06,0,0,1e-06,0,0,0,0,-2e-06,0,-1e-06,-2e-06,-1e-06,0,1e-06,0,0,0,0,3e-06,7e-06,2e-06,-1e-06,0,-8e-06,-3e-06,0,-7e-06,0,2e-06,4e-06,-2e-06,4e-06,3e-06,-1.9e-05,-2e-06,1e-06,4.3e-05,-1.3e-05,-3e-06,-9.5e-05,-3e-06,-4e-06,-1.6e-05,-6.4e-05,5e-06,-1e-05,-1.4e-05,-2e-06,-1e-06,-1.5e-05,0,5.7e-05,-1.6e-05,5.5e-05,3.2e-05,-1.1e-05,2e-06,-7e-06,-7e-06,-5.4e-05,1.1e-05,-6e-06,6e-06,2.7e-05,6e-06,2e-06,-5e-06,6e-06,8e-06,-9e-06,1.1e-05,2e-06,-1e-06,-2e-06,8e-06,0,0,-9e-06,4e-06,3e-06,1e-06,0,0,0,2e-06,0,-1e-06,0,6e-06,1e-06
0,-1e-06,1e-06,0,0,0,-1e-06,0,0,0,0,0,0,0,0,0,0,0,0,-1e-06,0,0,-1e-06,0,-1e-06,0,-2e-06,-1e-06,-1e-06,-1e-06,-1e-06,-1e-06,0,-1e-06,0,1e-06,2e-06,0,1e-06,0,0,0,-2e-06,1e-06,1e-06,0,0,-1e-06,0,-1e-05,-1.2e-05,-5e-06,1e-06,0,2e-06,1e-06,-1e-06,2.9e-05,-3e-06,2e-06,6e-06,1e-06,-4e-06,-1.2e-05,-2.2e-05,2.4e-05,9.1e-05,0.000103,-1.7e-05,-1.8e-05,0.000116,3e-06,-3.2e-05,-4e-06,-8e-06,-1e-05,-4e-06,-1.2e-05,7.6e-05,1e-06,-1e-05,-2.8e-05,-1.4e-05,2.6e-05,1.4e-05,-2.6e-05,-1.3e-05,6e-06,-1e-05,1.6e-05,7.4e-05,0,2e-06,6e-06,1.7e-05,4e-06,7e-06,7e-06,-1e-06,-4e-06,-6e-06,1e-06,-9e-06,1e-06,1e-06,-1e-05,-6e-06,1e-06,-8e-06,-4e-06,-1.8e-05,-7e-06,1e-06,0,0,-2e-06,1e-06,0,0,-7e-06,-1e-06
