5e-06,3.9e-05,5e-06,0.000109,3e-06,3.3e-05,0.000107,7.8e-05,3.9e-05,4.4e-05,1.8e-05,1.9e-05,1.6e-05,3.7e-05,4.1e-05,3.5e-05,4.2e-05,2e-05,3.7e-05,4.2e-05,9e-05,1.8e-05,2e-05,0.000107,6.8e-05,8.4e-05,2.5e-05,9.3e-05,8.3e-05,6.8e-05,4.2e-05,7.9e-05,0.000108,6.4e-05,7.7e-05,9.1e-05,3.6e-05,4.8e-05,0.000122,4.9e-05,0.000136,0.000118,3.7e-05,2.6e-05,8.3e-05,0.000175,1e-05,7e-06,4.5e-05,3.5e-05,8.2e-05,5e-05,6e-06,1.4e-05,7.1e-05,2e-06,2.6e-05,1.1e-05,5.6e-05,9.7e-05,6.7e-05,3.1e-05,5.5e-05,3.7e-05,3.2e-05,4.9e-05,2.3e-05,1.4e-05,7.7e-05,6.1e-05,0.000164,5.4e-05,6.8e-05,7e-06,6.5e-05,5.8e-05,2.8e-05,2e-05,1.5e-05,1.6e-05,3.5e-05,1.5e-05,5.1e-05,1.5e-05,9e-06,7e-06,1.9e-05,2.1e-05,7.2e-05,9e-06,1.1e-05,9.7e-05,3e-06,4.5e-05,4.9e-05,1e-05,2.6e-05,8.4e-05,1e-05,0.000102,8.8e-05,9.2e-05,5e-05,1.6e-05,6e-06,7.1e-05,9.2e-05,8.6e-05,6.7e-05,9e-06,3.5e-05,1.7e-05,5.8e-05,3.8e-05,3.7e-05,3.4e-05,3.9e-05,1.9e-05,5e-05,2.7e-05,3e-06
7e-05,5.1e-05,6.3e-05,0.000284,8.3e-05,4.7e-05,0.000248,0.000288,0.000233,4.7e-05,0.000181,0.000187,0.000227,0.000114,0.000211,6.3e-05,0.000332,0.000194,0.000214,0.000159,0.000202,7.5e-05,4.7e-05,0.000275,9.2e-05,0.000164,7.9e-05,0.000257,0.000204,0.000206,0.000266,0.000181,0.000311,8.7e-05,0.000127,0.000139,0.000352,0.000319,0.000386,0.000385,0.00056,0.000521,0.000377,0.000426,0.000288,0.000503,0.000211,0.000196,0.00025,0.000293,0.000173,0.000175,0.000113,0.000164,0.000317,0.000201,0.000194,0.000116,0.000142,0.000173,0.000213,1e-04,0.00014,0.000145,0.000237,0.00026,0.000127,0.000237,0.000204,0.000228,5e-04,0.000127,0.000226,0.000363,0.000271,0.000266,0.000265,0.000309,0.000242,0.000236,0.000155,0.000117,0.000186,0.00012,9.6e-05,0.000114,9e-05,9.2e-05,0.000279,3.1e-05,6.7e-05,0.000212,0.000132,0.00018,0.000269,0.000239,0.000265,0.000228,0.000273,0.000265,0.000357,0.000387,0.000324,0.00026,0.000242,0.000219,0.000262,0.000372,0.000392,0.000248,0.000362,0.000244,0.000187,0.000265,0.000262,0.000205,0.000223,0.00023,0.000285,0.000224,0.000184
0.000179,0.00014,0.000264,0.000124,0.000193,0.000202,0.000101,8.8e-05,0.000114,0.000172,0.000121,0.000185,0.000177,5.2e-05,0.00029,0.000376,0.000329,0.000254,0.000146,0.000409,0.000248,0.000143,2e-04,0.000484,0.000373,0.000142,0.000247,0.000529,0.000624,2.1e-05,0.000439,0.000663,0.000501,0.000392,0.000113,0.000364,0.000347,0.000323,0.000201,0.000444,3.7e-05,0.000313,1.2e-05,0.000381,0.000115,0.000285,0.000251,0.000125,0.000169,0.00031,0.000239,6.7e-05,8.7e-05,0.000168,0.000198,3.3e-05,0.000183,6.2e-05,5e-05,0.000175,0.000277,0.000175,5.9e-05,6.3e-05,0.000362,4.6e-05,0.000112,0.000281,0.000132,0.00011,0.000425,0.000161,0.000213,0.00027,7.5e-05,0.000104,0.000123,0.000407,0.000263,8.2e-05,5.3e-05,7e-05,0.000156,0.000294,0.000159,0.000207,0.000191,0.00012,0.00027,0.000257,2.4e-05,0.000219,0.000286,0.00018,0.000332,2.2e-05,0.000234,8.3e-05,0.000439,0.000363,0.000402,2.7e-05,0.000244,6.1e-05,0.00019,6.9e-05,2.8e-05,0.000307,0.000263,0.000137,0.000324,0.000199,8.6e-05,0.000249,0.000277,0.000106,0.00014,0.000205,0.000134,0.000222,8.7e-05
0.000166,0.000282,0.00027,0.000326,0.00013,0.000166,0.000201,4.8e-05,0.000125,0.000245,0.000122,0.000153,0.000333,0.000307,0.000166,0.000292,0.000347,0.000286,0.000378,0.000168,9.5e-05,5.3e-05,0.000274,0.000222,0.000233,0.000305,0.000372,0.000471,0.000149,0.000401,0.000252,0.00059,0.000273,0.000249,9.3e-05,0.000596,0.000548,0.000272,0.000265,0.000533,0.000343,0.000112,0.000425,0.000104,0.000215,0.000245,0.000319,0.000376,0.000287,0.000422,0.000216,0.000244,0.000232,0.000142,7.2e-05,0.000131,0.000151,0.000308,0.000263,0.000548,0.000442,0.000443,0.000418,0.000306,0.000549,0.000454,0.000264,4.8e-05,0.000188,0.00011,0.000496,0.00038,0.000527,0.000462,0.00023,0.000167,0.000211,0.000401,0.000197,0.000155,0.000191,3e-04,0.000302,0.000428,0.000196,0.000117,9.3e-05,0.000116,0.000184,0.000349,0.000325,0.000243,7.8e-05,0.000174,0.000262,0.000333,9.3e-05,8.1e-05,0.000418,0.000252,0.000213,0.000375,0.000207,7.4e-05,0.000121,0.00016,0.000284,0.000291,0.000214,4e-05,0.000391,0.000229,0.000264,0.000271,0.000184,7.3e-05,9.2e-05,9.7e-05,5e-05,0.00025,0.000192
0.000257,0.000269,0.000458,3e-04,0.000161,0.000178,0.000148,7.4e-05,0.000255,9.6e-05,0.000195,0.000253,0.00011,3.6e-05,0.000174,0.00028,0.000152,0.00032,0.000157,0.000297,0.000504,0.000186,0.000259,0.000157,0.000294,0.000201,0.00043,0.000289,0.000323,0.000295,0.000335,0.00036,0.000497,9.9e-05,0.000153,0.000477,0.000259,0.000221,0.000289,0.000189,0.000342,8.2e-05,0.000442,0.000547,0.000565,0.000207,0.000181,0.000127,6.8e-05,0.000356,0.000321,2e-04,6.8e-05,0.000108,0.000114,0.000166,0.000188,0.000416,2.3e-05,0.000402,0.000109,0.00014,0.000228,0.000305,0.000225,5.3e-05,0.000246,0.000301,0.00021,0.000167,0.000583,0.000601,0.000118,0.000157,7.1e-05,8.8e-05,2.8e-05,0.000394,0.00035,0.000289,0.000246,0.000158,0.000278,0.000191,0.000198,0.000203,0.000188,0.000132,0.000143,0.000313,8.4e-05,0.000191,0.000159,0.000308,0.000182,0.000213,0.000117,0.00019,7.4e-05,0.000139,0.000212,0.000166,0.000135,0.000246,0.000136,9.6e-05,0.000216,0.000143,0.000138,0.000158,0.000314,0.000108,0.000309,0.000231,0.00025,0.000227,0.000107,0.000169,0.00038,9.3e-05,0.000198
3.3e-05,0.000355,4e-04,0.000354,0.00064,0.000233,6.9e-05,0.000174,0.000412,0.00033,0.000217,0.000145,0.000279,0.000394,0.000249,0.000163,0.000212,0.000344,0.000252,0.000168,0.000192,0.000193,0.000291,0.000456,0.000527,0.00015,0.000272,0.000273,0.000335,0.000118,0.000496,0.000753,0.000565,0.000436,0.000198,0.000161,6.9e-05,8.3e-05,0.000379,0.000311,0.000283,7.9e-05,0.000408,0.000295,0.000364,0.000199,0.000108,0.000252,4.7e-05,0.000152,0.000297,0.000125,8.9e-05,0.00018,0.000167,0.000319,0.000277,0.000134,0.000339,0.000376,0.000255,0.000145,0.000362,0.000266,9.3e-05,0.000112,0.000133,0.000403,5.7e-05,0.000169,0.000432,0.000221,6.4e-05,9.1e-05,2.6e-05,2e-06,7.2e-05,0.000231,5e-05,6e-06,0.000137,0.000317,0.000126,0.000245,0.00026,0.000218,0.000178,0.00039,3e-04,0.000375,0.000397,0.000184,0.000509,0.000274,0.000243,8.4e-05,0.000157,0.000236,0.000212,0.000177,0.000172,0.000143,8e-05,0.000121,0.000165,0.000216,9.7e-05,0.000132,6.2e-05,0.00015,6.6e-05,0.00019,0.000246,4.2e-05,0.000169,3.1e-05,0.000105,0.00012,0.000381,0.00036,0.000133
0.00027,0.00013,0.000384,0.000661,0.000731,0.00055,0.000348,0.000259,0.00047,2.3e-05,0.000316,0.00012,0.000276,0.000502,0.000127,0.000322,0.000385,0.000194,0.00028,0.000143,0.000268,0.000289,0.000346,0.000336,0.000284,0.000377,0.000452,0.000698,0.000275,0.000475,0.000807,0.000555,0.000556,0.000409,5e-04,0.000567,5.7e-05,0.000239,0.000372,0.000224,0.000445,0.000301,0.000347,0.000462,1.9e-05,0.000315,0.000261,0.000129,0.000271,0.000194,0.000127,0.000273,0.000224,0.000319,0.000259,0.000443,0.000272,1.4e-05,3e-04,0.000195,0.00019,0.000234,0.000225,0.000438,0.000116,0.000122,7.6e-05,0.000355,0.00035,0.000185,0.000167,0.000294,0.000359,0.000133,0.000194,8.3e-05,0.00018,0.000257,0.000228,0.000273,0.000176,0.00026,0.00022,0.000266,0.000215,0.000244,0.000433,0.000339,0.000276,0.000135,0.000262,0.000527,0.000255,0.000405,9.6e-05,0.000152,0.000391,0.000123,0.000106,0.000269,0.00014,0.000159,0.000119,0.000127,5.9e-05,0.000123,9e-06,0.000244,0.000214,0.000237,0.000172,4.4e-05,0.00024,0.000229,0.000114,0.000167,6.1e-05,0.000148,0.000228,0.00012,8.8e-05
9.6e-05,6.6e-05,0.00097,0.00118,0.00044,6.1e-05,0.00044,0.000515,0.000787,0.000819,0.000979,0.000865,0.000732,0.001078,0.001099,0.00103,0.001269,0.00087,0.000808,0.000703,0.000807,0.000622,0.000839,0.000783,0.000857,0.000875,0.001253,0.001903,0.001858,0.001687,0.001935,0.002053,0.001943,0.002001,0.001771,0.001769,0.001319,0.000884,0.000591,0.000639,0.001197,0.001109,0.000927,0.000851,5e-04,0.000713,0.000612,0.000551,0.000147,0.000521,0.000302,0.000336,0.000485,0.000473,0.00048,0.000747,0.000494,0.00045,0.000519,0.000463,0.000291,0.000431,0.000408,0.000124,0.000324,0.000334,0.000283,0.000543,0.000647,0.000445,0.000515,0.000693,0.000872,0.000701,0.000306,0.000422,0.000145,0.000295,0.00027,0.000138,0.000147,0.000373,0.00018,0.000167,0.000326,0.000481,0.000408,0.000361,0.000392,0.00016,0.000333,0.000153,0.000506,6.6e-05,0.000103,6.5e-05,0.00034,0.000377,0.000189,0.00031,0.000201,0.00024,0.00016,0.000262,0.000201,0.000228,0.000114,0.00023,0.000169,0.000227,0.00022,0.000128,0.00012,0.000254,8.8e-05,0.000258,0.00024,0.000349,0.00029,0.000477,0.000196
6.9e-05,0.000208,0.001318,0.001271,0.000704,0.000305,0.000569,0.000135,0.000358,0.000317,0.000663,0.000189,0.000225,0.000541,0.000609,0.000443,0.000611,7e-04,6.2e-05,0.000376,0.000583,0.000495,0.000596,0.000586,0.000364,0.000262,0.000574,0.000944,0.000692,0.000487,0.000613,0.000614,9e-04,0.000838,0.000891,0.000351,0.000169,0.000146,0.000192,0.00026,0.00091,0.000801,0.000221,0.000308,0.000127,0.00057,0.000373,0.00025,0.000451,0.000725,0.000523,0.000209,0.000614,0.00032,0.000315,0.000386,0.00019,0.000349,0.000148,0.000218,0.000335,0.000132,0.000222,0.000364,0.000116,0.00027,0.000166,0.00036,0.000539,0.000195,0.000429,0.000633,0.000407,0.000453,0.000586,0.000289,0.000222,0.000108,0.000214,0.000319,0.000218,0.000142,0.00037,0.000264,0.000481,0.000547,0.000222,0.000202,0.000598,0.000347,0.000423,0.000395,0.000519,0.000563,0.000374,5.8e-05,0.000306,0.000712,0.000506,0.000432,0.000155,9.4e-05,0.000137,0.000284,0.00014,0.000148,3.5e-05,9e-05,8.3e-05,0.000209,9.6e-05,0.000128,7.1e-05,0.00036,0.000329,0.000174,0.000161,0.000255,0.000136,0.00037,0.000313
0.000402,0.000378,0.000847,0.000437,0.000162,0.000223,0.000239,0.000573,0.000377,0.000512,0.000396,0.000377,0.00023,0.000246,0.000132,0.000154,0.000642,4.5e-05,0.000245,0.00012,0.000416,0.000133,0.000523,0.000145,0.000247,0.000261,0.000236,0.000637,0.000184,0.000295,0.000354,0.000382,0.000336,0.000626,0.000205,0.000297,0.000344,0.000203,0.000119,0.000303,0.000309,8.6e-05,6.9e-05,9.3e-05,0.000175,0.000267,0.000168,0.000448,3.6e-05,0.000402,9.7e-05,0.000173,0.000464,0.000377,0.00031,0.000475,0.000494,0.000201,0.000354,0.000309,0.000378,0.000407,0.000118,0.000229,0.000196,0.000249,0.00013,0.000244,0.000177,0.000319,0.000327,0.000204,0.000102,0.000368,0.000228,0.000336,0.000311,9.7e-05,0.000243,0.000135,2.9e-05,0.000136,0.000173,0.000157,0.000232,0.000194,0.000189,9.1e-05,0.000439,0.00024,0.000156,0.00017,0.000164,0.000306,0.000585,0.000539,0.000391,0.000659,0.000369,7.5e-05,1e-04,2.8e-05,0.000204,9e-05,0.000128,8.6e-05,0.000211,0.000136,0.00013,0.000111,0.000128,9.3e-05,0.000221,0.000534,0.000267,0.000301,0.000207,0.000371,0.000233,0.000179,8.7e-05
0.000588,0.000293,0.000346,0.000496,0.000545,0.000566,0.000596,0.000747,0.000342,0.000285,0.000367,0.000353,0.000281,0.000322,0.000368,0.000166,0.000264,0.000283,9.2e-05,0.000118,0.000139,6.5e-05,0.000288,0.000155,0.000139,0.000266,0.000183,0.000306,8.3e-05,0.000177,0.000264,0.000433,0.000141,0.000202,0.000251,0.000291,0.00027,0.00017,0.000256,0.000313,0.000282,0.000124,8.1e-05,6.3e-05,0.000128,0.000138,0.000104,0.000272,0.000215,0.000255,0.000369,0.000422,0.000154,0.000105,0.000116,0.000164,0.000223,0.000189,0.00027,0.000176,4.3e-05,0.00015,0.000106,0.000211,5.3e-05,6.7e-05,2.1e-05,0.000104,7.9e-05,0.000204,0.000253,8.7e-05,0.000161,0.000119,6.9e-05,9.5e-05,0.000198,0.000252,0.000216,0.000248,0.000217,0.000168,0.000203,0.000151,0.000132,2.5e-05,0.000104,5.7e-05,0.000252,0.000188,0.000222,0.000275,0.000285,3.5e-05,0.000328,0.000248,2e-06,0.000319,8.4e-05,0.000232,0.000261,0.000149,0.00021,0.000222,5.9e-05,3.2e-05,0.000128,8.6e-05,0.000237,0.000131,0.000146,3.7e-05,0.000115,0.000263,0.000175,0.000246,6.4e-05,0.000306,0.000207,0.000229,0.000268
0.000204,0.000319,0.000383,0.000317,0.000105,0.00016,0.000205,0.000227,6.6e-05,0.00012,0.000253,0.000119,0.000107,0.000257,0.000219,5.9e-05,0.000167,0.000125,0.000143,7.9e-05,8.5e-05,0.000109,5.1e-05,3.1e-05,0.000205,6.6e-05,7.5e-05,0.000189,0.000147,0.00014,0.000189,0.000259,0.000117,0.000262,0.000218,0.000148,0.000123,9.5e-05,0.000107,0.000192,0.000138,6.9e-05,7.2e-05,2.8e-05,7.9e-05,0.000102,0.000113,9.6e-05,3.7e-05,8.3e-05,0.00018,0.000129,0.000146,5.2e-05,4e-05,0.000118,5.4e-05,7.9e-05,6.9e-05,6.5e-05,6.4e-05,6.9e-05,0.000118,9e-05,0.00014,0.000113,4.4e-05,0.000131,2.4e-05,0.000119,6.4e-05,9.7e-05,0.000146,0.00016,2.2e-05,8.2e-05,0.000112,5.4e-05,0.000102,4.7e-05,4.5e-05,4.1e-05,0.000144,5.8e-05,0.000136,5e-05,0.000108,0.000107,2.5e-05,4.6e-05,5.4e-05,9.6e-05,4.1e-05,8.9e-05,0.000101,7e-05,0.000118,9e-05,2.3e-05,0.000194,6.1e-05,7.3e-05,0.000113,3.4e-05,4.4e-05,3.5e-05,6.2e-05,6.2e-05,0.000129,2.5e-05,6.2e-05,7.7e-05,6.7e-05,8.6e-05,5.1e-05,6.1e-05,4.5e-05,0.000144,0.000178,6.2e-05,7.2e-05
0.000169,0.000281,0.000334,0.000124,0.000125,8.6e-05,7.8e-05,0.000167,0.000118,0.000154,0.000195,1.6e-05,5.4e-05,0.000259,0.000198,3.9e-05,0.000131,4.5e-05,0.000134,9.8e-05,3.4e-05,0.000124,0.000118,3.3e-05,0.000114,3.8e-05,1.8e-05,0.000164,6.7e-05,0.000167,0.000136,0.000166,0.000136,0.000209,0.00018,5.1e-05,7.2e-05,4.7e-05,8.9e-05,0.000177,0.000183,6e-05,4.7e-05,2e-05,7.2e-05,2.9e-05,7.5e-05,1.1e-05,5e-05,2.9e-05,5.2e-05,3.9e-05,5.4e-05,8.6e-05,9e-06,4.3e-05,2.2e-05,6.4e-05,0.000101,6.8e-05,7.8e-05,0.000103,4.4e-05,6.1e-05,5.7e-05,8.9e-05,5.7e-05,8.6e-05,1.7e-05,4.9e-05,6.2e-05,8.4e-05,0.000131,4.2e-05,2.7e-05,5.4e-05,9.5e-05,5.1e-05,4.2e-05,4.3e-05,5.8e-05,4.4e-05,6.5e-05,2.2e-05,0.000117,4.2e-05,3.9e-05,3.1e-05,5e-05,1.4e-05,4.1e-05,2.7e-05,3.1e-05,7.2e-05,6.4e-05,2.4e-05,5.9e-05,0.000121,3.9e-05,7e-05,4.4e-05,0.000117,4.5e-05,6.7e-05,3.7e-05,3.4e-05,5.5e-05,2.4e-05,0.000101,5.2e-05,1.7e-05,8.5e-05,7.6e-05,7.3e-05,2.3e-05,0.000119,8.8e-05,0.000108,7.7e-05,4.3e-05,6.2e-05
5.6e-05,0.000171,0.000347,3.4e-05,8.3e-05,0.000121,0.000151,0.000258,0.00013,0.00018,7.1e-05,0.000268,0.000125,0.000252,0.000189,0.000134,0.000116,6.4e-05,4.2e-05,7.8e-05,0.000197,6.5e-05,0.000235,0.000103,7.4e-05,4.7e-05,8.7e-05,0.000224,2.2e-05,0.000181,0.000191,0.000127,0.000117,0.000262,0.000223,7.7e-05,0.000121,0.000119,0.000102,0.000107,5.2e-05,3.1e-05,5e-05,4.9e-05,4.4e-05,1.6e-05,2.7e-05,8.2e-05,0.000127,0.000123,6.8e-05,8.8e-05,6.5e-05,1e-04,5.4e-05,7.1e-05,6.4e-05,1.8e-05,0.000189,2.5e-05,2.2e-05,6.1e-05,9.1e-05,7e-05,8.5e-05,4.1e-05,0.000105,6.8e-05,2.3e-05,5e-05,5.4e-05,2.5e-05,0.000102,1.7e-05,9.6e-05,3.4e-05,6e-05,0.000111,5.2e-05,3.8e-05,8.8e-05,7.1e-05,3.5e-05,7.8e-05,9.6e-05,0.00011,8.1e-05,6.9e-05,3.9e-05,6e-05,0.000104,0.000125,5.8e-05,3e-06,0.000156,6.5e-05,0.000144,4.9e-05,1e-04,0.000111,6e-05,8.1e-05,8.4e-05,0.000124,7.7e-05,5.5e-05,0.000117,8.7e-05,0.000129,6.3e-05,4e-05,8.8e-05,0.000111,8.8e-05,9.3e-05,9.1e-05,0.000168,5.7e-05,8.3e-05,2.2e-05,3.3e-05
0.000181,0.000285,4.1e-05,0.000275,0.000195,0.000167,0.000301,0.00015,0.000254,0.000153,0.000179,0.000339,0.000277,0.000189,0.000196,6.6e-05,0.000213,0.000113,2.4e-05,7.5e-05,0.000269,0.000243,0.00034,0.00013,0.000111,5.3e-05,6.2e-05,0.000117,0.000141,0.000171,2e-04,0.000304,1e-04,0.000193,0.000127,0.000129,0.000172,4.3e-05,0.000159,1.6e-05,7.9e-05,8.4e-05,9.3e-05,6.1e-05,0.000124,3e-05,0.000163,4.9e-05,0.000138,0.000164,0.000158,0.000128,0.000126,0.000121,9.4e-05,0.000156,6.9e-05,6.1e-05,0.000219,0.000163,0.000129,0.000112,3.9e-05,8.6e-05,5.7e-05,3.9e-05,0.000107,0.000178,5.2e-05,2.2e-05,9.7e-05,6.4e-05,0.000104,0.000108,0.000164,0.000115,6e-05,0.000118,7.7e-05,5.5e-05,4.6e-05,8.1e-05,6.9e-05,5.3e-05,5.7e-05,4.9e-05,5.5e-05,6.4e-05,2.4e-05,5.3e-05,6e-05,7.1e-05,4.3e-05,1.8e-05,0.000144,4.8e-05,0.000124,8.7e-05,9.5e-05,0.000182,8.8e-05,7.2e-05,0.000141,4.9e-05,7.1e-05,7.9e-05,0.000149,0.000133,2.2e-05,8.8e-05,5.1e-05,1.2e-05,4.5e-05,0.000104,9.9e-05,9.1e-05,0.000185,0.000175,8.4e-05,0.000147,8.7e-05
0.000245,0.00019,0.000403,0.000201,0.000173,3.9e-05,0.000303,0.000281,0.00033,0.00033,8.2e-05,2e-04,0.000397,0.00048,0.00045,0.000182,0.000211,0.000165,0.000207,0.000133,0.000212,0.000133,5.6e-05,0.000156,0.00019,0.000138,0.000155,6e-05,8.7e-05,7.2e-05,8.3e-05,0.000275,9.2e-05,1.9e-05,4.9e-05,0.000167,4.9e-05,6.3e-05,0.000262,0.000178,0.000136,6.5e-05,7.6e-05,9.5e-05,0.000116,0.000127,0.000267,0.000275,2.6e-05,0.000151,0.000161,3.9e-05,2.5e-05,0.000114,6.1e-05,5.7e-05,8.1e-05,5.4e-05,0.000151,0.000104,0.000138,5.8e-05,7.6e-05,0.000112,0.000103,3.3e-05,5.6e-05,0.000154,6.7e-05,7.8e-05,8.7e-05,9.7e-05,4.4e-05,0.000168,7.7e-05,7.5e-05,9.3e-05,9e-06,3.3e-05,7.1e-05,2e-05,1.4e-05,0.00015,0.000124,0.000145,1.3e-05,7.2e-05,0.000125,8e-05,5.1e-05,1.9e-05,0.000118,9.2e-05,5.8e-05,9.5e-05,7.8e-05,4.4e-05,8e-05,8.1e-05,0.000188,1.2e-05,0.000187,9.9e-05,0.00011,9e-05,0.000112,0.000106,2.8e-05,3.2e-05,3.2e-05,5.8e-05,0.000125,8.7e-05,0.000118,0.000141,6.9e-05,0.000156,7.9e-05,6.7e-05,9.6e-05,6.7e-05
0.000338,0.00018,0.00024,0.000463,0.000489,0.000316,0.000248,0.000468,0.000107,0.000151,0.000395,0.000346,0.000185,0.000247,0.000159,9.4e-05,8.6e-05,0.000313,0.000134,0.000251,9e-05,0.000279,3.9e-05,0.000166,0.000441,0.000158,0.000181,6.2e-05,0.000227,0.000235,0.000221,0.000305,0.000192,0.000225,0.000169,7.6e-05,0.000109,4.6e-05,0.000194,8.2e-05,9.4e-05,6.6e-05,4.2e-05,4e-05,7.1e-05,2.1e-05,0.000187,0.000195,0.000213,0.000128,0.000141,6.1e-05,0.000145,0.000145,0.000188,0.000114,0.00013,6.9e-05,6.1e-05,0.000178,0.000112,1.6e-05,0.000169,8.6e-05,0.000108,0.000163,5e-05,0.000108,7.3e-05,8.7e-05,4.8e-05,0.000124,0.000132,0.000126,8.2e-05,3.6e-05,7.5e-05,0.000118,9.6e-05,7.2e-05,5.8e-05,3.9e-05,0.000119,0.000114,9.2e-05,0.000109,0.000106,2.8e-05,9.2e-05,0.000196,0.000125,0.000123,3.3e-05,4e-05,6.9e-05,4.2e-05,5.6e-05,9.6e-05,8.9e-05,0.000115,0.000263,0.000218,0.000229,8.6e-05,9.8e-05,3.1e-05,1.1e-05,2.8e-05,2.8e-05,6.9e-05,3.8e-05,0.000189,0.000224,4.6e-05,0.000176,0.000135,0.000169,7.8e-05,8.4e-05,9.3e-05,3.8e-05
0.000304,0.000229,0.000123,0.000435,0.000131,0.000125,0.000329,0.000668,0.000804,0.000307,0.000394,0.00027,0.000158,0.00036,0.000634,0.000524,0.000197,0.000376,0.000189,0.000368,0.000159,0.00042,0.000418,0.00012,0.000287,0.00023,0.000143,0.00013,0.00018,2.2e-05,0.000415,0.000131,0.000355,0.00011,0.000498,0.00028,0.000113,5.8e-05,0.000148,0.000259,0.000104,0.000107,6.8e-05,1.8e-05,0.000127,0.000149,0.000163,0.000189,8.9e-05,0.000118,0.000291,0.000192,0.000347,0.000137,0.000157,7.2e-05,0.000231,3.4e-05,7.9e-05,0.000124,8.8e-05,6.5e-05,0.000168,0.000175,0.000167,0.000105,0.000169,0.000107,8.7e-05,0.000131,6.2e-05,5.9e-05,2e-05,0.000131,9.5e-05,0.000101,9.2e-05,8.9e-05,8.5e-05,4.9e-05,5e-05,6.6e-05,0.000148,7.4e-05,6.3e-05,1.3e-05,3.6e-05,0.000114,9.9e-05,0.000131,0.000103,0.000187,5.3e-05,0.000113,4.3e-05,6.6e-05,5.1e-05,1.5e-05,2.9e-05,4.4e-05,0.000185,0.000137,0.000232,0.000197,0.000136,9.1e-05,0.000106,3.4e-05,5e-05,0.000106,6.4e-05,0.000174,1e-04,9.5e-05,0.000176,0.000225,0.000136,9e-05,5.5e-05,5e-05,3.8e-05
0.000331,0.000121,6e-04,0.000606,0.000999,0.000595,0.000296,0.00052,0.000682,0.000539,0.000294,0.000361,8.3e-05,0.000322,0.000488,0.000419,0.000377,5e-05,0.000297,0.000365,0.000747,0.00062,0.000323,0.000239,8.6e-05,0.00015,0.000198,0.000303,0.000333,0.000285,0.000489,0.000268,0.000365,0.000183,0.000478,0.000301,3.5e-05,0.000148,0.000258,8.6e-05,0.000253,5.6e-05,5.1e-05,5.2e-05,9.5e-05,0.000258,0.000412,0.000567,0.000357,1e-04,0.000298,0.000324,9e-05,2e-04,0.000271,0.000242,0.000158,0.00027,0.000182,0.000149,0.000268,0.000237,0.000137,0.000113,0.000125,0.000112,0.000132,0.000176,0.00022,1.2e-05,5.5e-05,0.000128,0.000117,0.000108,0.000218,4e-05,2e-05,6.9e-05,7.7e-05,0.000122,0.000127,0.000153,0.000159,0.000203,0.000221,0.00013,6.6e-05,0.00016,0.000226,0.00017,4.7e-05,0.000117,0.000199,0.000216,0.00014,5.4e-05,0.000133,0.000106,9.9e-05,8.2e-05,5.8e-05,0.000152,6.3e-05,4.2e-05,0.000121,4.7e-05,0.000215,0.000141,2.6e-05,6.6e-05,5.1e-05,0.000182,0.000192,0.000147,0.000254,0.000107,0.000198,0.000255,0.000112,8.6e-05,0.000137
0.000135,0.000288,0.000584,0.000255,0.000959,0.000832,0.000773,0.00035,0.000444,0.000183,0.00028,0.000316,0.000243,0.000342,0.000385,0.000134,0.000231,0.000247,0.00038,0.000698,0.000675,0.000303,0.000221,0.000136,4.1e-05,0.000115,0.000255,7.3e-05,0.000207,8.8e-05,0.000149,0.000166,0.00013,0.000121,0.000387,0.000283,0.000225,0.000155,0.000227,0.000291,0.000285,0.000156,6.7e-05,1.2e-05,5.5e-05,0.000189,0.00018,0.000374,0.000218,0.000116,0.000231,0.00011,0.000188,0.000317,0.000104,0.000112,0.000224,0.00038,0.000287,0.000307,3e-04,0.000178,0.000162,0.000276,0.000221,0.000235,0.000134,0.000163,0.000136,0.000168,9.2e-05,0.000206,0.000179,0.000249,0.000117,9.8e-05,6.9e-05,9.7e-05,0.000154,0.000172,4.9e-05,0.000154,0.000324,0.000222,0.000125,9.1e-05,3.4e-05,0.000114,0.000115,6.1e-05,4.4e-05,0.00015,0.00025,0.000245,0.000119,0.000177,7.8e-05,8e-05,3.6e-05,7.7e-05,4.8e-05,0.00012,0.00013,3e-05,0.000141,0.000177,0.000315,0.000264,0.000233,0.000104,7.4e-05,0.00011,0.000209,4.7e-05,9.2e-05,0.000309,9.4e-05,0.000219,0.000147,0.000123,0.000193
8.7e-05,0.000339,0.000186,0.000317,0.000443,0.000154,0.000207,9.2e-05,0.000275,0.000187,0.000364,0.000367,0.000211,0.000254,0.000263,0.000109,9.5e-05,0.000158,0.000114,0.000299,4.3e-05,7.6e-05,0.000198,0.000176,0.000133,0.000138,0.000171,2e-04,0.000158,0.000154,3.1e-05,0.000147,0.000154,0.000141,0.000209,9.9e-05,7.4e-05,9.1e-05,3.3e-05,0.000131,4.6e-05,3e-05,3.9e-05,5e-05,0.000131,1.8e-05,9.5e-05,0.000157,5.9e-05,2e-06,0.000109,0.000116,8.5e-05,9.2e-05,0.00012,7.7e-05,6e-05,0.000186,6.5e-05,0.000132,8.2e-05,1.7e-05,7.7e-05,9.8e-05,3.7e-05,7.1e-05,4.6e-05,9e-06,5.9e-05,4.1e-05,4.9e-05,0.000126,5.7e-05,0.000161,8.1e-05,2.7e-05,1.4e-05,6.6e-05,0.000107,4.4e-05,4.9e-05,9e-05,0.000103,3.2e-05,0.00014,8.3e-05,1e-04,0.00012,6.1e-05,4.3e-05,8.3e-05,9.6e-05,7.4e-05,2.9e-05,1.8e-05,0.000122,8.3e-05,9e-05,5.3e-05,9.3e-05,3e-05,0.000113,4.5e-05,3.9e-05,7.4e-05,1e-04,0.000125,5.7e-05,0.000136,8.8e-05,7.9e-05,0.000198,9.6e-05,0.000121,7.5e-05,0.000206,0.00023,4.4e-05,6.7e-05,3.3e-05,9.9e-05
0.000159,0.000155,0.000284,0.000106,0.000268,0.000126,8e-05,0.000107,0.000147,0.000189,0.000176,0.000134,8.6e-05,5e-05,0.000116,0.000103,8e-05,0.000227,0.000114,1e-04,6.3e-05,8.8e-05,0.000154,2e-05,0.000101,0.000248,0.000332,0.000188,0.000162,0.000143,0.000122,0.000172,4.3e-05,0.000127,0.00014,3.1e-05,0.000139,9.7e-05,9.9e-05,1.2e-05,0.000121,6.6e-05,1.9e-05,1.8e-05,0.000153,0.000157,7.9e-05,8.3e-05,8.8e-05,9.4e-05,5.6e-05,5.4e-05,7.3e-05,4.2e-05,5.6e-05,0.000108,0.000127,5.8e-05,8.8e-05,0.000102,2.5e-05,7.6e-05,2.8e-05,3.6e-05,5.1e-05,4.2e-05,9.6e-05,8.4e-05,2.1e-05,6e-06,3.3e-05,4.2e-05,7.5e-05,5.9e-05,3.5e-05,7.3e-05,6.1e-05,7.2e-05,7.6e-05,5.5e-05,4.8e-05,9e-05,8.7e-05,2.8e-05,9.3e-05,2.3e-05,7.7e-05,3.1e-05,7.1e-05,7.7e-05,3.9e-05,8.5e-05,5.2e-05,3.8e-05,5.3e-05,9.5e-05,7.9e-05,0.000148,9.8e-05,0.000134,8.2e-05,5.1e-05,9.9e-05,2.6e-05,6.3e-05,5.1e-05,0.000102,4.2e-05,8.1e-05,8.1e-05,9.8e-05,0.000139,8.9e-05,0.000111,3.7e-05,0.000172,1.6e-05,7.7e-05,2e-05,3.7e-05,3.1e-05
2.5e-05,2.5e-05,7.1e-05,7e-05,0.00011,5.8e-05,2.7e-05,5.5e-05,3e-05,6.2e-05,9.2e-05,5.1e-05,5e-05,1.7e-05,9.5e-05,7e-06,1.5e-05,9e-05,2.1e-05,3.6e-05,7.7e-05,2.6e-05,7.7e-05,3.5e-05,3.3e-05,8.8e-05,4.6e-05,3.6e-05,3.8e-05,2.6e-05,2.4e-05,2.4e-05,6.9e-05,1.2e-05,3.6e-05,8e-06,6.2e-05,3.2e-05,5.7e-05,4.8e-05,4.9e-05,3.3e-05,3.4e-05,2.1e-05,3.9e-05,1.8e-05,3e-05,2.3e-05,1.9e-05,1.9e-05,2.8e-05,4.6e-05,3e-05,3.2e-05,1.8e-05,4.2e-05,6.1e-05,3.6e-05,3.3e-05,9.8e-05,3.1e-05,5.4e-05,5.1e-05,3.1e-05,3.1e-05,3.6e-05,3.4e-05,1.4e-05,1.9e-05,2.1e-05,1.5e-05,3.6e-05,2.7e-05,4.3e-05,2.3e-05,4e-05,1.9e-05,1e-05,3.5e-05,4.9e-05,3.5e-05,9e-06,1.6e-05,2.3e-05,5.6e-05,3.3e-05,2.3e-05,7e-06,5.6e-05,2.6e-05,2.2e-05,2.3e-05,3.4e-05,1.9e-05,2.6e-05,1.2e-05,1.9e-05,2.3e-05,1e-05,1e-05,1.3e-05,6e-06,8e-06,2.5e-05,6.2e-05,7.1e-05,7.4e-05,9e-06,1.8e-05,4.3e-05,7e-06,4.8e-05,1.4e-05,2.8e-05,2.6e-05,3.8e-05,3.4e-05,1.6e-05,2.3e-05,1.5e-05,1.9e-05
3.4e-05,5.7e-05,3.2e-05,3.4e-05,0.000109,1.7e-05,3.4e-05,1.6e-05,2.1e-05,2.1e-05,6.9e-05,6.3e-05,4.1e-05,1.3e-05,7.6e-05,3.6e-05,3.6e-05,2.3e-05,4.1e-05,6.7e-05,5.4e-05,5e-06,5.7e-05,2.2e-05,4.6e-05,4.6e-05,7.7e-05,3.8e-05,1.6e-05,2e-05,8e-06,1.9e-05,4.8e-05,4.7e-05,5.7e-05,2.4e-05,2.6e-05,1.9e-05,1e-05,1.5e-05,2.9e-05,2.5e-05,3.4e-05,1.4e-05,2.5e-05,2.4e-05,5.2e-05,1.9e-05,1.7e-05,3.3e-05,5.2e-05,1.2e-05,1.1e-05,5e-06,3e-05,3e-05,1.4e-05,2.2e-05,3.9e-05,5.5e-05,3.8e-05,3.5e-05,2.1e-05,4.1e-05,3e-05,2.4e-05,2e-06,2.1e-05,2.1e-05,2.9e-05,1.4e-05,4.2e-05,1.4e-05,2.1e-05,2.6e-05,7e-06,5.2e-05,1e-05,6e-05,4e-05,6e-06,1e-05,1.8e-05,1.5e-05,4.7e-05,1.5e-05,3.9e-05,3.2e-05,5.1e-05,9e-06,1.6e-05,3.7e-05,1e-05,2.2e-05,3.6e-05,1.2e-05,2.5e-05,4.1e-05,2.3e-05,2.8e-05,2.5e-05,1.8e-05,2.7e-05,3.7e-05,1.3e-05,2.8e-05,2e-05,3.5e-05,4.2e-05,2.6e-05,2.3e-05,3.4e-05,1.8e-05,2.3e-05,2e-06,3.7e-05,3.9e-05,2.6e-05,1.7e-05,3.1e-05,2.4e-05
5.8e-05,1.7e-05,4.2e-05,5.2e-05,7.5e-05,3.8e-05,2.8e-05,1.2e-05,7.4e-05,4.9e-05,6.2e-05,3.3e-05,2.2e-05,3.8e-05,6.2e-05,3.3e-05,4.2e-05,5.7e-05,3.7e-05,3.4e-05,7e-06,4.1e-05,5.4e-05,6.9e-05,4.2e-05,5.7e-05,3.7e-05,8e-05,1e-05,2.6e-05,2.1e-05,3.7e-05,2.9e-05,5.4e-05,0.000106,4.4e-05,7.4e-05,1.2e-05,2.6e-05,2.4e-05,4.1e-05,3.6e-05,1.7e-05,1.6e-05,2.7e-05,2.9e-05,6.4e-05,3.9e-05,1e-05,4.1e-05,7.6e-05,5.6e-05,1.5e-05,2.9e-05,4.8e-05,4.2e-05,4.4e-05,3.6e-05,3.2e-05,3.8e-05,3e-05,3.1e-05,2.5e-05,1.9e-05,2e-05,1.5e-05,2.8e-05,3.3e-05,1.2e-05,3e-05,1.4e-05,1.8e-05,6e-06,2e-05,2.4e-05,2.9e-05,6.1e-05,5.7e-05,3.8e-05,2.9e-05,9e-06,4.6e-05,7.4e-05,3.6e-05,3.2e-05,6.3e-05,4.5e-05,2.5e-05,7e-06,1.8e-05,1.5e-05,8e-06,8e-06,2.4e-05,2.2e-05,3.1e-05,8e-06,3.6e-05,4.3e-05,3.9e-05,2.6e-05,3.9e-05,4.7e-05,2.2e-05,9e-06,4.4e-05,5e-05,6e-05,6.8e-05,1.5e-05,2.6e-05,3.3e-05,1.1e-05,7e-06,3.5e-05,4.9e-05,5.7e-05,3.8e-05,1.2e-05,8e-06,4.5e-05
5.4e-05,3e-05,1e-05,3.7e-05,6.1e-05,1.7e-05,1.1e-05,3.5e-05,5.6e-05,1e-05,3.6e-05,4.1e-05,4.8e-05,6e-06,4e-05,3.4e-05,4.2e-05,2.9e-05,1.2e-05,2.5e-05,2.4e-05,6e-06,4.4e-05,4.5e-05,4.6e-05,4.2e-05,4e-05,6.5e-05,5.3e-05,2.5e-05,1.6e-05,5.4e-05,5.3e-05,5.9e-05,5.5e-05,1.8e-05,4.9e-05,4.3e-05,4.5e-05,1.7e-05,3.1e-05,2.6e-05,2.1e-05,3.1e-05,3.6e-05,3.2e-05,4.3e-05,2.6e-05,1.9e-05,3.6e-05,1.8e-05,1.8e-05,2.8e-05,3.5e-05,1.3e-05,1.1e-05,2.7e-05,1.6e-05,1.9e-05,5.2e-05,1.1e-05,9e-06,2.1e-05,2.5e-05,1.5e-05,1.3e-05,3.7e-05,2e-05,1.1e-05,1.4e-05,2.1e-05,5.5e-05,3.8e-05,5.7e-05,5.3e-05,2.7e-05,3.5e-05,5.8e-05,7.2e-05,4e-05,3.5e-05,6.6e-05,8.1e-05,4.3e-05,2.5e-05,2.8e-05,4.1e-05,1.9e-05,4e-06,1.2e-05,2e-05,1.5e-05,1.2e-05,2.6e-05,2.5e-05,4.1e-05,3.2e-05,5.7e-05,3e-05,5e-06,2.1e-05,3.7e-05,2.1e-05,9e-06,2.1e-05,4.2e-05,6e-06,3.8e-05,4e-05,3.4e-05,1.7e-05,2.9e-05,5.1e-05,2.8e-05,3.3e-05,7e-06,1.6e-05,1.5e-05,1.4e-05,1.5e-05,2e-05
3.1e-05,2.7e-05,4.2e-05,6.3e-05,2.9e-05,2.1e-05,2.4e-05,4e-05,4.8e-05,3.8e-05,1.6e-05,7e-06,2.4e-05,1.5e-05,1.6e-05,1.1e-05,1.4e-05,2.7e-05,4e-06,2.8e-05,3.1e-05,2.7e-05,2.4e-05,3.6e-05,4.3e-05,2e-05,3.6e-05,6.6e-05,3.3e-05,2.4e-05,1.8e-05,4.5e-05,3.8e-05,5.2e-05,3.2e-05,2.1e-05,1.2e-05,2.2e-05,7e-06,3.7e-05,3.2e-05,4e-06,1e-05,2.7e-05,6e-06,2.1e-05,2.4e-05,4.6e-05,1.7e-05,1.4e-05,1.4e-05,2.4e-05,2.8e-05,2.2e-05,2.1e-05,2e-05,8e-06,1.8e-05,3e-05,1.9e-05,1.9e-05,2.2e-05,1.4e-05,2.8e-05,1.3e-05,1.8e-05,2.5e-05,1.3e-05,4e-06,1.9e-05,2.3e-05,3.8e-05,4e-05,4.5e-05,2.6e-05,3.7e-05,4.2e-05,1.4e-05,2.6e-05,8e-06,2.6e-05,2.3e-05,2.2e-05,4e-06,7e-06,9e-06,1.6e-05,1.6e-05,1.1e-05,3.4e-05,1.6e-05,5e-06,1.3e-05,2.6e-05,2.4e-05,1.6e-05,1.3e-05,5.6e-05,1.9e-05,1.7e-05,7e-06,3e-06,3.5e-05,3.5e-05,2e-05,2.3e-05,2.9e-05,1.8e-05,2.1e-05,2e-05,3.8e-05,1.7e-05,1.3e-05,1.5e-05,3e-05,2.4e-05,1.5e-05,2e-05,3e-05,1.8e-05,7e-06
7e-06,4.4e-05,3.7e-05,6.9e-05,7.7e-05,1.3e-05,2.2e-05,3.6e-05,4.5e-05,4e-05,2.7e-05,1.4e-05,1.9e-05,2.6e-05,3.7e-05,1.9e-05,1.2e-05,1.8e-05,2.3e-05,3.1e-05,3.6e-05,8e-06,2.2e-05,2.3e-05,2.5e-05,1.1e-05,3.7e-05,2.3e-05,1.9e-05,1.6e-05,1.8e-05,3.3e-05,3e-05,2.7e-05,2.9e-05,7e-06,3.4e-05,1.6e-05,1e-05,2.6e-05,1e-05,1.6e-05,1.1e-05,3.3e-05,2.3e-05,2e-05,1.9e-05,1.9e-05,1.4e-05,9e-06,1.2e-05,7e-06,1e-05,1.5e-05,1.6e-05,2.5e-05,6e-06,1.6e-05,3.1e-05,4.2e-05,2.4e-05,2.4e-05,3e-06,1.5e-05,1.5e-05,9e-06,1.1e-05,1.6e-05,2.1e-05,2.7e-05,5e-06,2.3e-05,3e-05,2.6e-05,4.2e-05,6e-06,2e-05,1.8e-05,3.7e-05,5e-05,3e-05,2e-05,4e-06,1.3e-05,2e-05,2e-05,1.5e-05,1.7e-05,2.8e-05,3.9e-05,3.1e-05,2e-05,2.5e-05,5e-06,8e-06,5e-06,1.9e-05,3.5e-05,6e-06,1.3e-05,9e-06,1.6e-05,4.4e-05,1.4e-05,8e-06,1.3e-05,3.3e-05,1.2e-05,1.4e-05,1.9e-05,1e-05,2.4e-05,2.5e-05,1.6e-05,2.8e-05,5e-06,1.9e-05,5e-06,1.2e-05,4e-06,1.5e-05
3.9e-05,5.9e-05,5.5e-05,7.1e-05,4.2e-05,1.5e-05,1.4e-05,1.3e-05,2.9e-05,5e-06,2.9e-05,1.6e-05,7e-06,5e-06,5e-05,2.7e-05,1.3e-05,2.2e-05,1e-05,3e-05,4e-05,1.5e-05,2.4e-05,4e-05,4.8e-05,3.1e-05,1.9e-05,3.3e-05,7e-06,2.2e-05,8e-06,4e-06,4.4e-05,2e-05,3.7e-05,1.5e-05,3.8e-05,2.3e-05,2e-06,1.3e-05,5e-06,1.6e-05,2e-05,9e-06,1.2e-05,2.9e-05,1.6e-05,1.6e-05,7e-06,4e-06,2.1e-05,1e-05,1.1e-05,8e-06,1.8e-05,2.4e-05,3.1e-05,2.5e-05,3.9e-05,2e-05,7e-06,1.4e-05,1.4e-05,5e-06,2.1e-05,2.4e-05,1.6e-05,2.9e-05,1.3e-05,1.2e-05,1.6e-05,1.7e-05,1.3e-05,2.7e-05,3.1e-05,2.8e-05,3.5e-05,2.5e-05,1.5e-05,4.8e-05,1.8e-05,1e-05,1.2e-05,1.8e-05,4e-06,4e-06,8e-06,1.3e-05,5.5e-05,1e-05,1.6e-05,1.4e-05,7e-06,3e-06,9e-06,1.6e-05,2e-05,1.8e-05,1.4e-05,1.9e-05,1.1e-05,2e-05,8e-06,1e-05,1.4e-05,9e-06,3e-05,2.4e-05,3.5e-05,2e-05,1.5e-05,1.2e-05,9e-06,4e-05,1.4e-05,1.8e-05,1.3e-05,2.3e-05,1.9e-05,3e-06,1.6e-05
3.9e-05,3.7e-05,2.7e-05,2.8e-05,4.5e-05,3.2e-05,1.7e-05,8e-06,2e-05,1.9e-05,7e-06,3.1e-05,2.4e-05,1e-05,4.3e-05,4e-06,8e-06,1.7e-05,9e-06,2.5e-05,3.2e-05,7e-06,1.3e-05,1.8e-05,2.9e-05,2.3e-05,2.2e-05,2.8e-05,2.1e-05,2.3e-05,2e-06,2.3e-05,3.6e-05,7e-06,2.7e-05,1.5e-05,2.7e-05,1.2e-05,1.7e-05,2e-05,2.7e-05,8e-06,1.4e-05,1.4e-05,2.1e-05,1.8e-05,1e-05,1.2e-05,1.5e-05,1.5e-05,1.9e-05,8e-06,1.1e-05,3.5e-05,6e-06,1.9e-05,1.2e-05,9e-06,2.8e-05,2.7e-05,8e-06,7e-06,1.8e-05,8e-06,1.9e-05,1e-05,4e-05,6e-06,8e-06,2e-05,1.6e-05,2.3e-05,2.1e-05,2.5e-05,1.3e-05,1.3e-05,2e-05,1.2e-05,3e-06,3.6e-05,2.6e-05,2.3e-05,1.8e-05,1.7e-05,1.7e-05,1.5e-05,1e-05,2e-06,4.6e-05,3.2e-05,1.6e-05,2.1e-05,2.2e-05,8e-06,1.6e-05,1.7e-05,2e-05,2.2e-05,8e-06,1.9e-05,7e-06,1e-05,2.3e-05,1.5e-05,2.5e-05,9e-06,2.8e-05,1.4e-05,4.4e-05,1.3e-05,8e-06,2.4e-05,1.3e-05,4e-05,2.8e-05,3.6e-05,1.6e-05,2.4e-05,1e-05,1.6e-05,4e-06
2.7e-05,2.1e-05,5.4e-05,2.2e-05,6.6e-05,3.4e-05,2.5e-05,2.8e-05,1.4e-05,2.9e-05,2.9e-05,1e-05,2.2e-05,7e-06,1.3e-05,8e-06,1.4e-05,1.2e-05,1.5e-05,2.5e-05,9e-06,1.7e-05,4e-06,1.5e-05,2e-05,1.3e-05,1.3e-05,2.5e-05,3.9e-05,2e-05,2.1e-05,2.9e-05,3.9e-05,3.9e-05,3.4e-05,2.2e-05,1e-05,3.8e-05,1.5e-05,2.9e-05,1.8e-05,1.9e-05,2.2e-05,1.2e-05,2.1e-05,2.7e-05,1.6e-05,6e-06,2.1e-05,1.6e-05,8e-06,3e-06,2.6e-05,1.8e-05,1.6e-05,1.1e-05,1.4e-05,1.8e-05,1.5e-05,2.9e-05,3e-06,6e-06,1.4e-05,2.2e-05,1.4e-05,8e-06,2.9e-05,3.4e-05,2.6e-05,2.4e-05,2.1e-05,2.1e-05,1.6e-05,4.6e-05,8e-06,2.3e-05,6e-06,1.7e-05,3.3e-05,5e-06,6e-06,1.7e-05,2e-05,1.1e-05,1.3e-05,1.1e-05,2.6e-05,1.9e-05,2.4e-05,6e-06,6e-06,1.6e-05,1.9e-05,1.5e-05,1.7e-05,1e-05,5e-06,2.1e-05,2e-06,1.4e-05,4e-06,6e-06,2.7e-05,2.8e-05,6e-06,1e-05,2e-05,3e-05,2.7e-05,2.7e-05,1.2e-05,2e-05,1.1e-05,2.8e-05,1e-05,1.9e-05,1e-06,1.8e-05,1.2e-05,1.9e-05,1.3e-05
3e-05,1.6e-05,6.1e-05,4.1e-05,5.5e-05,1.8e-05,2.2e-05,2.3e-05,2.5e-05,2.7e-05,2.2e-05,1.4e-05,2.2e-05,1.7e-05,3.2e-05,1.2e-05,1.6e-05,3e-06,9e-06,2.9e-05,1.4e-05,2.1e-05,1.6e-05,3e-05,1.2e-05,1.8e-05,2.6e-05,4e-05,2.6e-05,2.8e-05,2.8e-05,3.7e-05,9e-06,1.3e-05,2.7e-05,2.7e-05,2.1e-05,1.8e-05,1e-05,2.4e-05,2.4e-05,1.3e-05,1.7e-05,1.1e-05,1.8e-05,2.3e-05,9e-06,1.2e-05,2e-05,3e-06,1.2e-05,1.9e-05,2.4e-05,2.7e-05,1.9e-05,1.9e-05,7e-06,2e-05,1.2e-05,2.6e-05,1.9e-05,7e-06,1.7e-05,1.8e-05,1.5e-05,7e-06,5e-06,1.5e-05,1e-05,1.7e-05,2e-05,1.4e-05,9e-06,3.7e-05,2.1e-05,4e-06,6e-06,1.7e-05,2.6e-05,2.3e-05,1.7e-05,5e-06,1.8e-05,1.6e-05,9e-06,6e-06,1.7e-05,9e-06,9e-06,2.1e-05,2.1e-05,1.6e-05,7e-06,1.1e-05,1.3e-05,3e-06,2.2e-05,3.5e-05,1.3e-05,1.1e-05,1.1e-05,1.5e-05,1.4e-05,1.3e-05,4e-06,4e-06,1.3e-05,8e-06,2.3e-05,1.5e-05,1.8e-05,2.1e-05,1.2e-05,1.6e-05,1.2e-05,2e-06,1.5e-05,1.8e-05,2.2e-05,4e-06,3e-06
3.3e-05,5e-06,4.8e-05,4e-05,5e-05,2.1e-05,4.1e-05,1e-05,2.4e-05,2.6e-05,5.4e-05,1.5e-05,4.5e-05,4.8e-05,5.1e-05,1.3e-05,1.1e-05,1.2e-05,1.4e-05,2.3e-05,8e-06,9e-06,2e-05,4.5e-05,4.8e-05,2e-05,5e-06,5.9e-05,4e-06,1.7e-05,1.9e-05,2e-05,1.7e-05,3.6e-05,2.6e-05,3.1e-05,1.3e-05,9e-06,1.5e-05,1.7e-05,4e-06,2e-05,1.1e-05,1.1e-05,8e-06,1.9e-05,1.4e-05,2e-05,1.4e-05,1.1e-05,7e-06,2.3e-05,1.5e-05,2.4e-05,5e-06,1.3e-05,1.3e-05,1.9e-05,5e-06,4e-06,1.4e-05,1.2e-05,2e-06,7e-06,1.4e-05,3e-06,1.4e-05,1.5e-05,8e-06,2.1e-05,1.1e-05,1.6e-05,1e-05,1.5e-05,9e-06,1e-05,1e-06,1.6e-05,2.8e-05,1e-05,1.4e-05,1.1e-05,1.3e-05,1.2e-05,1.7e-05,1.9e-05,3e-06,5e-06,2e-05,8e-06,1.6e-05,4e-06,1.2e-05,6e-06,1.2e-05,8e-06,2.3e-05,2.4e-05,8e-06,1.4e-05,1.6e-05,1.2e-05,2.4e-05,1.3e-05,2e-05,1e-05,9e-06,7e-06,7e-06,9e-06,1.5e-05,9e-06,8e-06,1.7e-05,7e-06,5e-06,1e-05,1.2e-05,1.4e-05,2e-06,9e-06
5e-05,1.4e-05,5.3e-05,8.6e-05,6.6e-05,3.9e-05,4.9e-05,6.7e-05,5.1e-05,3e-05,5.8e-05,7.1e-05,3.1e-05,4.3e-05,1.3e-05,3.1e-05,3e-05,1.5e-05,2.9e-05,4.2e-05,3.6e-05,4.7e-05,4.8e-05,1.5e-05,4.1e-05,2.2e-05,2.2e-05,4.5e-05,4e-05,1.6e-05,1.4e-05,1.4e-05,2.5e-05,2.5e-05,3.5e-05,1.8e-05,3.2e-05,3e-06,1.8e-05,1.2e-05,1.7e-05,1.3e-05,7e-06,2.2e-05,1.5e-05,3.1e-05,3.3e-05,2.4e-05,1.9e-05,1.4e-05,1.3e-05,1.1e-05,2.9e-05,3e-05,1e-05,1.5e-05,1.7e-05,3e-06,1e-05,1.9e-05,1.2e-05,7e-06,1e-05,9e-06,2.3e-05,1.2e-05,1.7e-05,1.6e-05,2.1e-05,3.3e-05,2.3e-05,1.5e-05,1.1e-05,2.4e-05,3e-06,1.9e-05,1.6e-05,2.2e-05,1e-05,3.2e-05,1.3e-05,7e-06,8e-06,2.1e-05,9e-06,1.1e-05,3e-06,2e-06,2.1e-05,8e-06,3e-05,2.6e-05,7e-06,1.8e-05,3.4e-05,9e-06,1e-05,2.6e-05,2.2e-05,1.7e-05,4e-05,2.8e-05,1.5e-05,1.7e-05,2.2e-05,3.4e-05,8e-06,7e-06,1.1e-05,1.7e-05,8e-06,7e-06,1.3e-05,1.6e-05,1.2e-05,7e-06,5e-06,5e-06,1.5e-05,2.4e-05,4e-06
3.8e-05,5.3e-05,2.9e-05,5.6e-05,9.5e-05,9.7e-05,0.000103,9.2e-05,4.6e-05,3.2e-05,5.1e-05,2.2e-05,3.8e-05,1.7e-05,2.9e-05,6e-06,8e-06,3e-05,2.2e-05,5.7e-05,5.7e-05,5.1e-05,4.8e-05,3.1e-05,2.3e-05,1.2e-05,1.8e-05,3.1e-05,1.4e-05,4.7e-05,2.2e-05,1.8e-05,9e-06,1e-05,4.6e-05,1.1e-05,3.1e-05,1.6e-05,1.9e-05,2.5e-05,2e-05,2.4e-05,1.1e-05,2e-05,3.5e-05,1.5e-05,3e-05,2.4e-05,1.6e-05,1.2e-05,2.3e-05,2.8e-05,1.7e-05,1.2e-05,1.9e-05,8e-06,1.9e-05,1.6e-05,2.5e-05,1.4e-05,9e-06,1.4e-05,2.1e-05,6e-06,1.5e-05,1.9e-05,2.7e-05,1e-05,2.7e-05,3.8e-05,2e-05,1.6e-05,1.9e-05,2.6e-05,1.9e-05,1.7e-05,1.1e-05,1.7e-05,2e-05,2.5e-05,1.4e-05,1e-06,1.1e-05,1e-05,9e-06,9e-06,1.2e-05,1.1e-05,1.6e-05,2.4e-05,5e-05,2.3e-05,1e-05,2.3e-05,1.8e-05,1.7e-05,2.2e-05,1.2e-05,2.3e-05,2.2e-05,2.9e-05,1.6e-05,6e-06,1.5e-05,9e-06,2.3e-05,3.3e-05,1.9e-05,7e-06,1.5e-05,6e-06,1.2e-05,1.5e-05,2.2e-05,2e-05,1.9e-05,1.6e-05,2.4e-05,1.9e-05,3.8e-05,3.1e-05
3.9e-05,5.3e-05,4.6e-05,2.3e-05,6.1e-05,0.000113,2.9e-05,4.1e-05,5.4e-05,4.4e-05,3.1e-05,2.5e-05,3.7e-05,2.6e-05,3.7e-05,5.3e-05,3e-05,7e-06,4.7e-05,2.9e-05,1.8e-05,8.5e-05,5.8e-05,2.6e-05,4.4e-05,4.6e-05,3.8e-05,2.4e-05,3.5e-05,4.7e-05,5.2e-05,3.8e-05,4.2e-05,3.7e-05,2.7e-05,5.6e-05,4.6e-05,3.1e-05,3.3e-05,1.1e-05,1.2e-05,2.5e-05,2.5e-05,2.5e-05,1.7e-05,2.8e-05,3e-05,3.6e-05,2.7e-05,1.1e-05,3.4e-05,1.4e-05,4e-06,1.4e-05,3e-05,2e-05,1.8e-05,1.3e-05,1.5e-05,1.8e-05,3e-06,8e-06,1.8e-05,1.8e-05,2.4e-05,2.5e-05,1.4e-05,1.9e-05,2.5e-05,1.1e-05,2.2e-05,1.5e-05,1.7e-05,3.2e-05,1.8e-05,1.2e-05,1.6e-05,1.3e-05,1.7e-05,6e-06,1.8e-05,1.3e-05,1.1e-05,1.4e-05,8e-06,8e-06,2e-05,1e-05,1.1e-05,1.7e-05,3e-05,1.9e-05,1e-06,2.2e-05,3.4e-05,7e-06,7e-06,1.6e-05,1.7e-05,1.2e-05,2.2e-05,2.7e-05,1.5e-05,1.5e-05,1.4e-05,1.5e-05,1.9e-05,1.2e-05,1e-05,7e-06,1.4e-05,1.6e-05,7e-06,1e-05,1e-05,1.9e-05,1.8e-05,1.5e-05,1.5e-05,1.8e-05,1.3e-05
2.7e-05,6.4e-05,7.1e-05,3.6e-05,4e-05,3.6e-05,4.2e-05,1.4e-05,4.1e-05,3.7e-05,1.5e-05,1.3e-05,2.6e-05,2.4e-05,2.5e-05,4.8e-05,4.5e-05,3.6e-05,2.1e-05,4.2e-05,5e-06,4.6e-05,2.6e-05,1.6e-05,4.3e-05,5.5e-05,1e-06,9e-06,2.3e-05,6e-06,2.5e-05,4.5e-05,2.5e-05,4e-05,4.1e-05,2.2e-05,8e-06,1.1e-05,3e-06,2.9e-05,3.8e-05,2.8e-05,1.5e-05,3.2e-05,1.4e-05,1.4e-05,3e-05,1.8e-05,7e-06,1.2e-05,1e-05,4.5e-05,1e-05,1.7e-05,2.9e-05,1.7e-05,2.3e-05,1.6e-05,2.3e-05,9e-06,1.5e-05,1.6e-05,7e-06,2.1e-05,1.5e-05,1.4e-05,1.7e-05,9e-06,2.6e-05,2.5e-05,4e-06,1.3e-05,6e-06,4e-06,6e-06,2e-05,1.6e-05,2.4e-05,1.2e-05,1.4e-05,1e-05,1.6e-05,1.1e-05,6e-06,1.1e-05,1.2e-05,1.4e-05,5e-06,1.4e-05,9e-06,2.3e-05,2e-05,1.5e-05,4e-06,1.4e-05,1.6e-05,1.6e-05,2.3e-05,7e-06,1.4e-05,1.7e-05,2.5e-05,3.3e-05,3.5e-05,1e-05,6e-06,1.9e-05,1.6e-05,1.4e-05,6e-06,2.8e-05,1e-05,6e-06,6e-06,6e-06,8e-06,1.1e-05,2.1e-05,9e-06,1.5e-05,1.1e-05
2.1e-05,3.3e-05,5.8e-05,3.3e-05,1.9e-05,3.4e-05,3.2e-05,1.1e-05,4e-05,4.7e-05,4e-05,2.6e-05,1.1e-05,1.7e-05,1e-05,1.3e-05,1.4e-05,9e-06,1e-05,2.1e-05,4.7e-05,3.7e-05,4.6e-05,5.4e-05,6.1e-05,1.9e-05,5.2e-05,3.8e-05,2.2e-05,1.5e-05,4e-06,3.7e-05,1.2e-05,3.6e-05,4e-06,4.3e-05,3e-05,1.5e-05,3e-06,3.6e-05,3.2e-05,1.3e-05,1.3e-05,2.9e-05,3e-05,2.1e-05,1.4e-05,7e-06,1.2e-05,1e-06,1.4e-05,3.7e-05,3.6e-05,3e-05,7e-06,1.7e-05,7e-06,1.3e-05,2.8e-05,2.8e-05,2.4e-05,1.9e-05,2.3e-05,1.2e-05,9e-06,9e-06,2e-05,1e-05,1.3e-05,7e-06,1.4e-05,1.1e-05,1e-05,1.4e-05,1.7e-05,1.8e-05,2.1e-05,2e-05,1.5e-05,6e-06,1.1e-05,2.4e-05,2.5e-05,2.2e-05,6e-06,1.8e-05,2.4e-05,1.1e-05,1.7e-05,1.7e-05,2.7e-05,2e-05,1.4e-05,1.6e-05,1.2e-05,1.4e-05,1.4e-05,2e-05,2e-05,1.5e-05,1.4e-05,1.9e-05,4e-06,2.3e-05,1.4e-05,1.6e-05,5e-06,1.4e-05,3e-06,9e-06,2e-05,8e-06,5e-06,1.2e-05,4e-06,6e-06,1e-05,1.6e-05,3e-06,1.1e-05,1.3e-05
3.5e-05,1.5e-05,5e-05,5.6e-05,5.4e-05,3.5e-05,2.6e-05,2.6e-05,7e-06,2.6e-05,2.9e-05,4.3e-05,2.9e-05,2.6e-05,3.4e-05,2.4e-05,4e-06,3e-06,1.9e-05,5e-06,4.2e-05,3e-05,5e-06,3e-05,1.2e-05,2e-05,3.8e-05,2e-05,2e-05,1e-05,6e-06,2.3e-05,1.3e-05,2.3e-05,1.7e-05,3.1e-05,3.3e-05,1.6e-05,2.3e-05,2.2e-05,5e-06,1.9e-05,1.9e-05,1.3e-05,8e-06,9e-06,1.2e-05,1.3e-05,1.6e-05,2.5e-05,2.5e-05,3.3e-05,1.8e-05,3e-06,1.1e-05,1.2e-05,8e-06,4e-06,1e-05,1.3e-05,5e-06,6e-06,7e-06,5e-06,1.1e-05,9e-06,1.7e-05,1.7e-05,1.7e-05,1.1e-05,1.5e-05,6e-06,1.2e-05,1.4e-05,2.1e-05,3e-06,1e-05,7e-06,1.3e-05,1e-05,1.3e-05,1.3e-05,7e-06,1.4e-05,3e-06,1.5e-05,9e-06,4e-06,4e-06,1.8e-05,7e-06,4e-06,9e-06,1.1e-05,3e-06,1.5e-05,5e-06,1.5e-05,1e-05,1.8e-05,9e-06,7e-06,1.2e-05,9e-06,9e-06,9e-06,4e-06,5e-06,9e-06,9e-06,1e-06,1e-05,5e-06,9e-06,5e-06,8e-06,4e-06,7e-06,2e-06,1.1e-05,7e-06
3.1e-05,1e-05,7e-06,2.9e-05,2.9e-05,1e-05,1.1e-05,6e-06,1.7e-05,2.2e-05,8e-06,1.9e-05,1.4e-05,6e-06,2.1e-05,8e-06,9e-06,1e-06,1.2e-05,1e-05,1.8e-05,1.7e-05,8e-06,1.4e-05,2.1e-05,1e-05,3.4e-05,2.2e-05,3e-06,9e-06,6e-06,2.2e-05,1.8e-05,1.6e-05,1.7e-05,9e-06,2.4e-05,6e-06,1.2e-05,2.8e-05,1.4e-05,2e-06,5e-06,5e-06,1e-05,8e-06,9e-06,5e-06,1e-05,8e-06,9e-06,7e-06,3e-06,5e-06,1.1e-05,3e-06,3e-06,2e-06,4e-06,1.2e-05,8e-06,3e-06,6e-06,6e-06,1.3e-05,5e-06,5e-06,3e-06,3e-06,2e-06,8e-06,8e-06,1e-06,1.4e-05,1e-05,7e-06,2e-06,5e-06,7e-06,4e-06,6e-06,6e-06,5e-06,6e-06,6e-06,9e-06,7e-06,3e-06,4e-06,2e-06,6e-06,5e-06,6e-06,3e-06,1.3e-05,1e-05,1e-05,1.3e-05,7e-06,1.4e-05,8e-06,8e-06,7e-06,4e-06,5e-06,3e-06,7e-06,5e-06,6e-06,2e-06,5e-06,3e-06,6e-06,1.1e-05,1e-06,4e-06,4e-06,1e-05,2e-06,7e-06,6e-06
2.3e-05,1e-05,1e-05,3.1e-05,2.2e-05,1.1e-05,1.2e-05,9e-06,1.4e-05,2e-05,1.7e-05,1.2e-05,1.4e-05,3e-06,1.7e-05,1e-06,5e-06,4e-06,1.1e-05,1.3e-05,1.3e-05,1.7e-05,1e-05,1.2e-05,1.9e-05,1e-05,2.6e-05,2.1e-05,2e-06,6e-06,5e-06,2.4e-05,1.7e-05,6e-06,2.2e-05,9e-06,2e-05,5e-06,7e-06,2.5e-05,1.1e-05,7e-06,8e-06,3e-06,4e-06,1.2e-05,9e-06,7e-06,7e-06,1e-05,3e-06,3e-06,1e-06,6e-06,9e-06,3e-06,2e-06,1e-06,7e-06,8e-06,5e-06,2e-06,3e-06,2e-06,1e-05,4e-06,0,3e-06,2e-06,1e-06,9e-06,5e-06,3e-06,1.5e-05,1e-05,4e-06,2e-06,1e-06,7e-06,2e-06,5e-06,3e-06,2e-06,4e-06,2e-06,2e-06,5e-06,3e-06,7e-06,6e-06,2e-06,4e-06,5e-06,2e-06,1e-05,9e-06,9e-06,1.3e-05,1e-05,1.3e-05,4e-06,6e-06,7e-06,5e-06,3e-06,2e-06,5e-06,5e-06,7e-06,1e-06,6e-06,3e-06,7e-06,1.3e-05,2e-06,2e-06,3e-06,1e-05,2e-06,8e-06,4e-06
1.8e-05,9e-06,9e-06,2.6e-05,2e-05,1.1e-05,1.3e-05,7e-06,1.5e-05,2.1e-05,1.4e-05,1.6e-05,1.2e-05,2e-06,2e-05,3e-06,5e-06,2e-06,1.2e-05,1.4e-05,1e-05,1.7e-05,1e-05,9e-06,1.9e-05,9e-06,2.4e-05,2.1e-05,3e-06,9e-06,5e-06,2.1e-05,1.6e-05,8e-06,2.4e-05,8e-06,1.9e-05,4e-06,6e-06,2.3e-05,1.3e-05,4e-06,7e-06,2e-06,4e-06,1.3e-05,9e-06,5e-06,5e-06,8e-06,1e-06,3e-06,3e-06,5e-06,8e-06,4e-06,1e-06,1e-06,6e-06,9e-06,5e-06,1e-06,2e-06,2e-06,7e-06,3e-06,1e-06,2e-06,1e-06,1e-06,8e-06,3e-06,4e-06,1.5e-05,1e-05,3e-06,1e-06,1e-06,6e-06,2e-06,6e-06,2e-06,3e-06,8e-06,3e-06,2e-06,5e-06,1e-06,7e-06,6e-06,2e-06,4e-06,5e-06,2e-06,1e-05,8e-06,9e-06,1.4e-05,1e-05,1.4e-05,2e-06,5e-06,8e-06,5e-06,2e-06,4e-06,5e-06,5e-06,5e-06,2e-06,5e-06,4e-06,7e-06,1.1e-05,0,2e-06,3e-06,1e-05,3e-06,8e-06,2e-06
