1.8e-05,2e-06,3e-05,1e-06,1.7e-05,1.1e-05,1.9e-05,0,4.6e-05,1.6e-05,1.1e-05,2.6e-05,3e-06,7e-06,2.2e-05,0,2.3e-05,1e-05,3.5e-05,7e-06,9e-06,3e-06,3.1e-05,1.8e-05,1.9e-05,4e-06,2.9e-05,3e-05,2.6e-05,7e-06,6e-06,1.6e-05,1.1e-05,1.2e-05,1e-05,2e-06,1.7e-05,3e-06,7e-06,1.5e-05,1.4e-05,2.7e-05,1e-05,4.7e-05,2.2e-05,1.2e-05,1.9e-05,2.5e-05,2e-05,2e-05,3.7e-05,3e-06,2e-05,3.7e-05,1.1e-05,9e-06,1e-05,7e-06,0,1.3e-05,1.7e-05,6e-06,4e-06,2.7e-05,0,1.3e-05,1.7e-05,1.8e-05,2e-06,2e-06,0,3.7e-05,3.5e-05,2.3e-05,1e-05,1.4e-05,5e-06,2.1e-05,0,1.4e-05,5e-06,6e-06,2.5e-05,0,1e-06,7e-06,4.6e-05,3.3e-05,6e-06,1e-05,2e-06,7e-06,0,3.1e-05,1.6e-05,3.1e-05,2.4e-05,7e-06,1.9e-05,1.4e-05,2e-06,1.4e-05,2.6e-05,1.7e-05,6e-06,1.9e-05,1e-06,3.2e-05,4e-06,1.1e-05,2e-05,5e-06,9e-06,2.4e-05,2.4e-05,2e-06,2.6e-05,6e-06,8e-06,5e-06,8e-06
4.7e-05,2.4e-05,6.6e-05,1.5e-05,5.3e-05,4.3e-05,9e-06,5e-05,9e-05,5.5e-05,7.5e-05,9.2e-05,8.4e-05,0.000103,8.2e-05,3e-05,5.3e-05,5.3e-05,0.000106,6e-05,8.5e-05,3.9e-05,3.5e-05,5.1e-05,4.5e-05,4.7e-05,8e-05,0.000104,0.000101,8.7e-05,5.4e-05,7.2e-05,1.6e-05,6.5e-05,5.1e-05,4.7e-05,5.5e-05,4.5e-05,4.8e-05,5.9e-05,3.6e-05,9.1e-05,2.9e-05,0.000114,1.9e-05,3.4e-05,6.1e-05,2.6e-05,5.5e-05,1e-05,6.3e-05,2.4e-05,5.2e-05,9.4e-05,1.4e-05,2.7e-05,6.9e-05,4.8e-05,2.2e-05,3.5e-05,3.6e-05,4.5e-05,5.6e-05,5.3e-05,4.2e-05,3.5e-05,1.1e-05,7.5e-05,9.2e-05,6.2e-05,5.6e-05,9e-05,0.000108,0.000112,2.9e-05,9.5e-05,4.6e-05,5.9e-05,5.3e-05,5.5e-05,4.3e-05,3.9e-05,0.000113,6.2e-05,4.2e-05,6.5e-05,9.2e-05,0.000105,7.9e-05,3.2e-05,4.5e-05,4.1e-05,2.1e-05,2.9e-05,8.6e-05,7.7e-05,2.7e-05,1.1e-05,6.6e-05,6.1e-05,6.6e-05,5.1e-05,4e-05,6.3e-05,2.8e-05,7e-05,2.2e-05,4.5e-05,4.8e-05,2.8e-05,4.8e-05,5.2e-05,4.8e-05,4.3e-05,7.4e-05,3.1e-05,6.3e-05,3.6e-05,2.2e-05,3.8e-05,3.8e-05
7.6e-05,7e-06,7.6e-05,3.8e-05,5.5e-05,2.7e-05,5.1e-05,4e-05,7.2e-05,0.000157,2.3e-05,6.5e-05,6.2e-05,8e-05,6e-05,2.7e-05,5.5e-05,3.6e-05,0.000171,0.000169,2.5e-05,7.3e-05,7.3e-05,0.00011,7.1e-05,3.9e-05,4.1e-05,3.4e-05,6.3e-05,8.6e-05,6.8e-05,9.1e-05,0.000123,1e-04,4.1e-05,5.3e-05,2e-05,3.4e-05,3.1e-05,0.000104,4.3e-05,8e-05,4e-05,0.000128,3.9e-05,8.1e-05,0.000113,7e-05,7.2e-05,6.2e-05,7.2e-05,5e-05,7.6e-05,7e-05,7.5e-05,2.1e-05,5.8e-05,6.2e-05,5.7e-05,2e-05,5.2e-05,2.2e-05,7.2e-05,9.9e-05,8.7e-05,6e-06,4e-05,7.2e-05,8.1e-05,7.3e-05,3.8e-05,3.6e-05,1.3e-05,7e-05,4.9e-05,9.6e-05,6.6e-05,6.6e-05,0.000113,3.5e-05,7.2e-05,2.9e-05,0.000105,9e-05,5e-05,0.000104,2.1e-05,5.1e-05,6e-05,7.3e-05,0.00011,7.8e-05,6e-06,4e-05,7.6e-05,6e-05,0.000114,5.7e-05,8.5e-05,8.8e-05,9.6e-05,0.000119,5e-05,9e-05,0.000122,0.000107,9.5e-05,5.5e-05,3.7e-05,6e-05,9.8e-05,5.9e-05,0.000128,7.6e-05,5.8e-05,2e-05,6.8e-05,9.6e-05,7.4e-05,3.7e-05,1.7e-05
7.9e-05,2.3e-05,0.000116,0.000142,5.9e-05,8.5e-05,0.000136,6.7e-05,1e-05,0.000163,0.000115,0.000119,2.1e-05,0.000119,0.000158,4.5e-05,8.8e-05,7.9e-05,0.000129,6.3e-05,7.4e-05,9.1e-05,2.7e-05,0.000144,0.000175,6.6e-05,9.6e-05,0.000102,0.000124,0.000124,0.000196,0.000185,0.000112,0.000172,0.000173,5.6e-05,1e-04,0.000122,9.4e-05,7.2e-05,0.000104,0.000165,1.4e-05,0.000202,6.9e-05,9.1e-05,0.000149,0.00015,2.8e-05,1.7e-05,0.00017,0.000162,0.000108,4e-05,0.000105,9.4e-05,1.4e-05,5.5e-05,3.4e-05,7.8e-05,5.6e-05,5.2e-05,4.3e-05,0.00011,3.1e-05,7.1e-05,2.7e-05,0.000105,0.000148,4.9e-05,0.000134,0.000125,0.000104,6.9e-05,2.3e-05,6.2e-05,8.6e-05,4.9e-05,9.9e-05,7.6e-05,0.000153,7.6e-05,6.4e-05,1.7e-05,0.000114,2.2e-05,1.9e-05,0.000158,0.000105,8.1e-05,4.7e-05,9.5e-05,0.000126,2.3e-05,0.000108,0.000112,0.000119,8.7e-05,6.3e-05,0.000123,0.000144,0.000165,0.000147,6e-06,0.000116,9.3e-05,0.000117,4.8e-05,5.1e-05,2.4e-05,7.3e-05,6.1e-05,9.7e-05,6.9e-05,9e-05,5.4e-05,3.5e-05,7.9e-05,6.4e-05,6.4e-05,2e-05
0.000254,0.000109,8.3e-05,0.000123,7.3e-05,0.000105,9.1e-05,0.000178,8.8e-05,9.1e-05,0.000239,5.5e-05,4.6e-05,9.6e-05,0.000179,8.1e-05,0.00017,0.000244,0.000135,8e-05,4.8e-05,7.8e-05,0.000135,0.000172,0.000113,0.000107,0.000133,0.00017,0.000197,0.000264,0.000204,0.000127,0.000246,0.000345,0.000223,0.000183,0.000121,8.7e-05,6.2e-05,8.5e-05,7.3e-05,7.2e-05,0.000145,0.000248,0.000243,0.000191,7.2e-05,0.000144,0.000204,5.6e-05,0.000105,0.000156,4.6e-05,8.7e-05,0.000131,2.4e-05,5.3e-05,0.000111,7.3e-05,0.000101,0.00015,8.2e-05,1e-05,8.5e-05,7.1e-05,0.000128,7.9e-05,9.6e-05,0.000144,0.000178,0.000147,7.4e-05,1e-04,0.000166,0.000145,7.1e-05,6.7e-05,3e-05,8.6e-05,6.2e-05,0.000137,0.000182,0.00018,5.3e-05,0.000128,6.1e-05,4.7e-05,0.000151,0.000215,0.000152,5.8e-05,5.1e-05,8.8e-05,5.1e-05,0.000113,0.00011,6.4e-05,4.8e-05,7.7e-05,0.000119,6.5e-05,0.000112,0.000172,9e-05,0.000143,6.3e-05,0.000151,8.3e-05,0.000115,9.3e-05,0.000147,0.000176,0.000164,4.4e-05,8.5e-05,5.6e-05,8.9e-05,8e-06,7.7e-05,7.8e-05,1e-05
8.4e-05,0.000152,0.00012,3.6e-05,5.4e-05,9.2e-05,6.9e-05,0.000184,0.000152,2.1e-05,0.000184,0.000159,9e-05,8.6e-05,0.000137,0.000173,0.00024,0.000129,6.4e-05,9.1e-05,0.000135,0.000126,6.9e-05,0.00011,1e-05,4.3e-05,8.2e-05,7.1e-05,9.8e-05,0.000156,0.00011,5.1e-05,0.000266,2.1e-05,6.2e-05,0.000101,4.9e-05,0.00016,9.3e-05,8e-05,3.5e-05,0.000116,0.000228,8.2e-05,8e-05,7.1e-05,0.000108,0.000133,0.000119,0.000155,8e-05,6.7e-05,9.1e-05,3.4e-05,6.7e-05,8.8e-05,6.2e-05,4.9e-05,8.1e-05,5.8e-05,3.9e-05,1.5e-05,2.5e-05,0.000102,8.5e-05,3e-05,7e-05,7.4e-05,3.7e-05,7.4e-05,1.7e-05,8.7e-05,7.1e-05,5.2e-05,6.9e-05,6.8e-05,0.000136,0.00011,0.000105,4.7e-05,0.000146,8.1e-05,0.000158,0.000123,3.6e-05,4.8e-05,6e-05,0.000117,5.2e-05,0.000128,3.3e-05,6.4e-05,0.000115,7.2e-05,8.6e-05,3.9e-05,7e-05,3.1e-05,6.3e-05,6.4e-05,8.1e-05,5.4e-05,8.7e-05,0.000152,1.9e-05,0.000177,0.000197,0.000128,0.000115,6e-05,0.000117,0.000223,0.00012,3.2e-05,8.4e-05,0.00011,8.6e-05,9.7e-05,5.4e-05,6.3e-05,8.9e-05
3.5e-05,0.000157,0.000107,5e-05,7.3e-05,5.2e-05,8.7e-05,8.9e-05,5.1e-05,8.5e-05,3.1e-05,2.6e-05,1e-05,5.5e-05,8.9e-05,0.000272,1.9e-05,4.1e-05,0.00014,0.00018,0.000137,2.2e-05,0.000119,0.000153,0.000102,0.000101,9e-05,0.000114,0.000128,0.000141,0.000158,6.1e-05,0.00017,0.000167,9.5e-05,0.000123,0.000137,0.00024,0.00011,3.7e-05,5e-05,0.000168,0.000159,8.4e-05,2.3e-05,9.3e-05,2.9e-05,0.000128,0.000206,0.000185,0.000118,0.000159,6e-05,8.5e-05,0.000124,5e-05,0.000109,8.8e-05,5.5e-05,2.9e-05,2.8e-05,4.1e-05,1e-05,8.8e-05,9.2e-05,6.3e-05,6.6e-05,9.4e-05,8.9e-05,1.2e-05,4.3e-05,5.5e-05,0.000102,6.6e-05,4.3e-05,9.8e-05,5.8e-05,2.5e-05,3.6e-05,3.3e-05,0.00014,8.5e-05,0.00013,9e-05,5e-05,3.8e-05,2.7e-05,1.5e-05,5.7e-05,6.2e-05,0.000134,4.6e-05,4.8e-05,0.000108,0.000167,0.00019,8.3e-05,3.5e-05,4.5e-05,8.6e-05,0.000176,9.4e-05,0.000111,0.000167,0.000148,0.000107,3.2e-05,7.2e-05,5.8e-05,4.6e-05,0.000129,5.6e-05,0.000155,9.6e-05,8.5e-05,7.4e-05,7.5e-05,8.2e-05,0.000143,6.4e-05,4.5e-05
0.000118,0.000213,6.5e-05,0.000121,9.1e-05,0.000156,7.9e-05,4e-05,2.8e-05,5.4e-05,0.000145,6.8e-05,2.1e-05,8.2e-05,9.4e-05,0.000299,0.00032,0.000113,2e-04,0.000141,2.7e-05,5.5e-05,7.6e-05,6.4e-05,0.000166,2.3e-05,4.6e-05,2.6e-05,0.000184,1e-04,5.4e-05,0.000121,0.00012,1.9e-05,5.9e-05,7.1e-05,2.4e-05,8.2e-05,0.000182,0.000163,3.8e-05,0.000158,5.5e-05,0.000197,0.000256,0.000199,0.000103,0.000141,0.000188,0.000167,0.000238,0.000176,0.000144,0.000111,0.000122,0.000202,0.000268,0.000118,4.9e-05,1.9e-05,6e-05,8.4e-05,0.00011,6.7e-05,0.00016,0.000201,2.8e-05,0.000111,0.000215,0.000259,4e-05,4.9e-05,0.000202,0.000172,0.000142,0.000104,8.3e-05,4.2e-05,4.7e-05,5.8e-05,0.000133,0.000117,0.000148,2.4e-05,3.8e-05,6.4e-05,2.8e-05,8.9e-05,5.4e-05,6.1e-05,0.000174,0.000124,9e-05,0.000105,0.000113,0.000228,0.000248,0.000167,6.9e-05,0.000115,9e-05,7.4e-05,0.000162,0.000162,4.7e-05,0.000144,0.000132,1.3e-05,0.000112,4.5e-05,0.000112,0.000115,0.00011,0.000122,1e-04,0.000146,8.2e-05,5.5e-05,0.000131,0.000116,4.9e-05
8.6e-05,8.9e-05,7.9e-05,0.000145,0.000146,3.8e-05,8.7e-05,2.5e-05,5.5e-05,4.1e-05,0.000213,0.000191,9.8e-05,0.000119,0.000134,0.000121,0.000118,0.000192,0.000107,3.3e-05,9.3e-05,3.8e-05,9.2e-05,0.00011,0.000141,0.000149,9e-06,3.4e-05,0.000114,0.00013,0.000158,7.6e-05,8.2e-05,2.5e-05,4.3e-05,7.5e-05,4.2e-05,4.3e-05,0.000141,0.000117,0.000135,0.000111,5.8e-05,0.000233,0.000228,9.6e-05,8.3e-05,0.000111,0.000145,9.1e-05,5.9e-05,7.5e-05,0.000184,0.000126,4.5e-05,0.000146,0.000125,0.000192,0.000177,9e-05,5.5e-05,2.2e-05,8.4e-05,0.000109,0.000141,8.2e-05,0.000113,0.000179,0.000204,0.000262,0.000246,0.00015,0.000155,0.000132,7e-05,0.000211,8.5e-05,8.4e-05,0.000139,0.000101,0.000145,1.7e-05,4.5e-05,9.2e-05,9.9e-05,5.3e-05,9.4e-05,0.000139,1e-04,6.1e-05,0.000141,0.000105,4.9e-05,0.000105,0.000162,7.2e-05,0.000163,0.000178,0.000165,0.000127,8.6e-05,9.5e-05,0.000164,8.7e-05,7.4e-05,8.1e-05,3.2e-05,8.9e-05,0.000189,0.000123,0.000103,4.8e-05,6.9e-05,5.8e-05,6.6e-05,4.7e-05,5.9e-05,9.8e-05,0.000161,4.5e-05,7.7e-05
5.6e-05,3e-05,3.2e-05,4.7e-05,1.2e-05,4.8e-05,9.9e-05,6.1e-05,9e-05,9e-05,0.000157,2.7e-05,4e-06,9e-05,4.6e-05,4.2e-05,0.000119,0.000152,0.000111,2.4e-05,4.9e-05,1.7e-05,7.5e-05,0.000106,0.000113,8.8e-05,7.1e-05,1.2e-05,4.1e-05,8.4e-05,2.7e-05,6.8e-05,8.1e-05,6e-06,8.6e-05,6.8e-05,8.5e-05,0.000101,2.8e-05,2.5e-05,7.9e-05,8.2e-05,2.5e-05,0.000152,5e-05,4.6e-05,8.5e-05,4.8e-05,7.1e-05,7.2e-05,7.5e-05,6.2e-05,0.000112,6.7e-05,3.6e-05,0.000113,0.00012,8.2e-05,5.6e-05,1.8e-05,5.4e-05,3.4e-05,7.3e-05,7e-05,4.2e-05,6.3e-05,7.8e-05,0.000161,0.000118,0.000121,7.8e-05,1.9e-05,0.000125,3.2e-05,8.9e-05,8.6e-05,0.000106,5.9e-05,5.7e-05,5.9e-05,5.3e-05,6.1e-05,1.4e-05,5.3e-05,3e-05,5.7e-05,0.000107,0.000109,3.8e-05,2.2e-05,6.2e-05,2.1e-05,9.1e-05,6.3e-05,2.7e-05,7.1e-05,7.3e-05,6.4e-05,9.7e-05,3e-05,7.2e-05,6.8e-05,3.4e-05,6.3e-05,8.3e-05,2.5e-05,6.4e-05,6.8e-05,7.8e-05,0.000122,8.7e-05,0.000119,8.7e-05,1.6e-05,4.6e-05,1.3e-05,7.3e-05,8.9e-05,8.3e-05,0.000116,0.000122
7.5e-05,5.3e-05,8.7e-05,4.9e-05,2.7e-05,4.9e-05,5.3e-05,2.3e-05,5.7e-05,4.1e-05,7.5e-05,0.000102,7.5e-05,3.7e-05,4.2e-05,3.4e-05,5e-05,1.8e-05,3e-06,4.3e-05,7e-06,1.9e-05,5e-05,3.1e-05,7.8e-05,9.9e-05,6.1e-05,5.2e-05,7.5e-05,4.4e-05,4.4e-05,5.2e-05,6.5e-05,0.000104,0.000126,0.000143,4.6e-05,9.7e-05,0.000103,5.7e-05,4.5e-05,4e-05,3.6e-05,7.1e-05,0.000117,0.000101,8.4e-05,4e-06,4.5e-05,2.9e-05,3.2e-05,1.4e-05,9.9e-05,2.7e-05,3e-05,3.1e-05,5.8e-05,0.000111,4.8e-05,1.5e-05,4.8e-05,5.3e-05,6.3e-05,0.000103,9.2e-05,7.7e-05,3.1e-05,0.000116,0.000138,0.00011,4.7e-05,6.7e-05,3.3e-05,2.1e-05,2.3e-05,3.9e-05,5.1e-05,6.4e-05,2.2e-05,2.1e-05,3.8e-05,3.5e-05,3.5e-05,2.4e-05,5e-06,2.9e-05,5.7e-05,3.3e-05,8.4e-05,8.4e-05,4.5e-05,1.5e-05,3.4e-05,3.5e-05,2.4e-05,3e-05,6.2e-05,8.7e-05,5.4e-05,7e-05,5.2e-05,4.5e-05,2.5e-05,7.7e-05,7.3e-05,3.4e-05,8.2e-05,8.4e-05,3.3e-05,7.3e-05,1.8e-05,4.7e-05,4.2e-05,4.7e-05,3.7e-05,6.7e-05,8e-05,2e-05,3.9e-05,5.6e-05,6.8e-05
3.7e-05,1.7e-05,5.4e-05,5.5e-05,1.8e-05,5.1e-05,2e-05,2.1e-05,1e-05,3.6e-05,2.8e-05,1.7e-05,3e-05,5.1e-05,3.6e-05,2.3e-05,1.1e-05,1.4e-05,2.4e-05,8e-06,1.2e-05,1.8e-05,2.6e-05,1.7e-05,5e-05,2e-05,6e-06,2.7e-05,2.1e-05,2.8e-05,2.9e-05,8e-06,3.1e-05,4.5e-05,4.6e-05,2.2e-05,9e-06,5.3e-05,6e-05,1.4e-05,2.3e-05,2e-05,1.2e-05,5.1e-05,7.7e-05,2.2e-05,1.8e-05,2.9e-05,6.6e-05,2.2e-05,2.7e-05,1e-05,4.4e-05,3.6e-05,1.9e-05,1e-05,2.1e-05,2.7e-05,1.1e-05,9e-06,2.9e-05,1.4e-05,3.2e-05,3.7e-05,4.8e-05,3.1e-05,1.6e-05,4.9e-05,3.1e-05,2.4e-05,2.8e-05,3e-05,3.7e-05,2.2e-05,2e-05,2e-05,4.8e-05,5.7e-05,1.3e-05,7e-06,2.1e-05,2.1e-05,1.6e-05,3.8e-05,1.2e-05,2.4e-05,3.5e-05,5e-06,4.8e-05,1e-05,1.3e-05,2.4e-05,3.4e-05,1.8e-05,2.6e-05,1.1e-05,3e-05,3.9e-05,1.5e-05,3.6e-05,2.8e-05,1.8e-05,3.1e-05,3.9e-05,1.5e-05,2.5e-05,3.3e-05,6.9e-05,5.1e-05,1.1e-05,3.5e-05,3.4e-05,3.8e-05,1.3e-05,5.5e-05,2.5e-05,4.8e-05,4e-05,4.6e-05,6e-06,4.1e-05
3.9e-05,6e-06,5.2e-05,3.2e-05,2.9e-05,1.7e-05,1.7e-05,1.4e-05,3.2e-05,4.4e-05,1.2e-05,2.9e-05,1.3e-05,2.5e-05,4.9e-05,1.5e-05,1.5e-05,7e-06,1.8e-05,1.8e-05,6e-06,1.6e-05,2.2e-05,2.1e-05,1.5e-05,2.3e-05,2.4e-05,1.6e-05,3.4e-05,1e-05,1.5e-05,1e-05,1e-05,2.1e-05,2.4e-05,1.9e-05,1.7e-05,4.6e-05,2.7e-05,2.4e-05,3e-06,6e-06,1.3e-05,5.6e-05,2.6e-05,2.5e-05,9e-06,1.2e-05,4.7e-05,6e-06,7e-06,1.6e-05,1.5e-05,1.3e-05,2.3e-05,1.5e-05,2.5e-05,1.1e-05,9e-06,1.1e-05,1.2e-05,1.4e-05,7e-06,2.7e-05,1.1e-05,3.2e-05,1.5e-05,3.3e-05,1.2e-05,2.3e-05,2e-05,3.7e-05,1.2e-05,2.8e-05,1.1e-05,1.8e-05,3.5e-05,2.6e-05,1e-06,1.7e-05,2e-05,1e-05,8e-06,3.5e-05,6e-06,2.7e-05,3.6e-05,2.4e-05,1.3e-05,2.7e-05,1.1e-05,6e-06,1.3e-05,1e-05,2.2e-05,3.4e-05,1.3e-05,2.7e-05,1.1e-05,3.2e-05,1.6e-05,3.1e-05,1.9e-05,1.5e-05,2.3e-05,1.7e-05,2.1e-05,3.5e-05,1.7e-05,1e-05,1e-05,1.6e-05,2e-06,1.4e-05,2.8e-05,1.7e-05,4.7e-05,3.4e-05,2.2e-05,1.1e-05,2.3e-05
1.4e-05,2.4e-05,4.1e-05,3.5e-05,9e-06,1.2e-05,5e-06,2.2e-05,3.6e-05,8e-06,2.3e-05,3.9e-05,2.5e-05,2.2e-05,2.8e-05,3.3e-05,9e-06,1.4e-05,2e-05,1.1e-05,7e-06,2e-05,1.3e-05,3.2e-05,1.7e-05,1.6e-05,1.3e-05,1.5e-05,2.8e-05,1.1e-05,1.3e-05,1.1e-05,1.6e-05,3.5e-05,1.2e-05,2.5e-05,1.7e-05,2.9e-05,1.3e-05,2.3e-05,2.8e-05,1.8e-05,1.6e-05,6.8e-05,5.7e-05,2.5e-05,2.8e-05,2.3e-05,4e-05,9e-06,1.9e-05,2.2e-05,1.1e-05,1.4e-05,1.7e-05,1.1e-05,2.3e-05,8e-06,3e-06,1e-06,2.6e-05,1.4e-05,5e-06,2.5e-05,2.9e-05,3.3e-05,2.2e-05,1.5e-05,3.3e-05,3e-05,1.8e-05,3.7e-05,3.4e-05,1.3e-05,3.1e-05,3.7e-05,2.9e-05,3.1e-05,7e-06,1.1e-05,1.3e-05,3.8e-05,1.5e-05,1.8e-05,1.2e-05,2.4e-05,4.6e-05,1.9e-05,3e-05,2.6e-05,7e-06,1.3e-05,2.7e-05,2.4e-05,5.1e-05,5.3e-05,4.7e-05,3.8e-05,9e-06,2e-05,2.6e-05,5.6e-05,3.6e-05,2.1e-05,1.1e-05,2.5e-05,2.2e-05,1.1e-05,1.9e-05,2.5e-05,1.4e-05,1.8e-05,3.7e-05,7e-06,2.5e-05,1.7e-05,3.1e-05,3.3e-05,9e-06,2e-05,4e-06
4.1e-05,5.3e-05,4.7e-05,3.1e-05,3.3e-05,6e-06,1.2e-05,2.5e-05,3.4e-05,2.4e-05,2.1e-05,1.1e-05,3.6e-05,3.9e-05,3.4e-05,4.4e-05,2.7e-05,1.3e-05,3.5e-05,2.9e-05,8e-06,1.2e-05,3.7e-05,5e-06,1.3e-05,2.7e-05,2.4e-05,1.1e-05,1.3e-05,1.8e-05,3e-05,1.5e-05,2.8e-05,3.7e-05,2.1e-05,2.5e-05,1.5e-05,2.7e-05,2.8e-05,2.8e-05,5e-06,1e-05,3.1e-05,6.3e-05,3e-06,7e-06,4.2e-05,2.8e-05,2.8e-05,1.4e-05,5e-05,1.6e-05,1e-05,1e-05,2e-06,3.5e-05,1.2e-05,2.2e-05,1.5e-05,8e-06,2.1e-05,2.2e-05,1.7e-05,3.6e-05,2e-05,2.4e-05,3.1e-05,3.1e-05,4.3e-05,5e-06,3e-05,2.1e-05,2e-05,2.7e-05,4.6e-05,5.4e-05,4e-05,1e-05,3.6e-05,3.3e-05,2.5e-05,5.3e-05,2e-05,9e-06,3e-05,3.4e-05,3e-05,4.7e-05,9e-06,2.2e-05,3.2e-05,3.8e-05,7.8e-05,4.9e-05,4e-06,1.6e-05,1.8e-05,2.5e-05,2.3e-05,2e-06,2.8e-05,4.4e-05,2.5e-05,3.6e-05,2.6e-05,3e-05,1.1e-05,8e-06,2.2e-05,2e-05,2.6e-05,1.9e-05,3e-05,2.1e-05,4e-05,1.5e-05,3.3e-05,2.2e-05,3.5e-05,2e-05,1.8e-05
2e-06,2.7e-05,3e-05,6e-06,2e-06,1.5e-05,3.1e-05,3.5e-05,3.8e-05,1.7e-05,2e-05,2.5e-05,4.6e-05,8e-06,1.3e-05,1.5e-05,2.4e-05,2.2e-05,3.7e-05,2.6e-05,1.5e-05,2.3e-05,3e-05,2.3e-05,2.5e-05,4.1e-05,1e-05,1.5e-05,1.9e-05,1.6e-05,3.2e-05,2e-05,3.5e-05,4e-05,2.9e-05,2.4e-05,1.9e-05,2.7e-05,5.2e-05,2.6e-05,2.1e-05,2e-05,1.9e-05,4.6e-05,1.6e-05,1.4e-05,5.5e-05,6e-05,5.3e-05,1.4e-05,5.7e-05,3.3e-05,1.4e-05,7e-06,4e-06,1.6e-05,2.8e-05,2.4e-05,3.9e-05,4.9e-05,4.2e-05,4.8e-05,1.8e-05,3e-05,2.7e-05,5e-06,1.6e-05,1.7e-05,3.9e-05,4.1e-05,4e-06,2.1e-05,1.8e-05,3.9e-05,6.8e-05,1.4e-05,1.2e-05,1.8e-05,3.8e-05,7e-06,1.6e-05,5.8e-05,2e-05,6e-06,2.6e-05,2.3e-05,2.1e-05,1.5e-05,3.8e-05,1.2e-05,1.4e-05,1.9e-05,5e-05,1.9e-05,1.9e-05,2.6e-05,2.6e-05,5.3e-05,3e-05,3.2e-05,2.5e-05,1.8e-05,3.2e-05,3e-05,1.8e-05,3.3e-05,1.7e-05,1.2e-05,1.4e-05,2.3e-05,4.6e-05,2.5e-05,1.1e-05,3.1e-05,4e-05,1.6e-05,5.9e-05,3.4e-05,3.5e-05,4.2e-05,1.9e-05
7e-06,1.5e-05,2.9e-05,1.6e-05,2.2e-05,2.4e-05,3.6e-05,1.5e-05,5.5e-05,4.3e-05,1.6e-05,4.4e-05,2.8e-05,4e-05,1.2e-05,3.2e-05,6e-06,2.1e-05,2.3e-05,1e-05,2.2e-05,2.2e-05,1.5e-05,3.3e-05,4.6e-05,1.2e-05,3.2e-05,2.7e-05,3.2e-05,1.7e-05,1.6e-05,1.7e-05,3.6e-05,8.5e-05,2.1e-05,2.2e-05,1.6e-05,3.2e-05,3e-05,2.1e-05,4e-05,1.3e-05,2.1e-05,2.6e-05,2.5e-05,4.4e-05,1.2e-05,1.9e-05,4.1e-05,3.6e-05,5.1e-05,7e-06,3.2e-05,5e-06,1.5e-05,3.3e-05,5.5e-05,4.2e-05,1.8e-05,3.7e-05,1.4e-05,4.3e-05,2.5e-05,2e-05,3e-05,2.7e-05,4.9e-05,1.4e-05,1.5e-05,3.6e-05,3.9e-05,3.1e-05,2.7e-05,3e-05,1.7e-05,1e-05,2.4e-05,5e-06,2e-05,3.3e-05,3.5e-05,2.9e-05,3.3e-05,2.3e-05,2.1e-05,4.8e-05,1e-05,2.6e-05,2.6e-05,2e-05,1.8e-05,2.7e-05,5.8e-05,3.7e-05,1.3e-05,3.5e-05,3.5e-05,4.1e-05,3.7e-05,3.7e-05,4.8e-05,4.4e-05,3.5e-05,3.6e-05,2.3e-05,3e-05,5.3e-05,2.3e-05,4.1e-05,4.7e-05,5.5e-05,1.9e-05,2.5e-05,2.5e-05,3.3e-05,3.7e-05,6e-05,8.4e-05,0.000101,2.7e-05,5e-05
2.1e-05,2.2e-05,2.5e-05,1.6e-05,5.1e-05,2.3e-05,3.5e-05,3e-05,6.2e-05,2.2e-05,1.5e-05,5.2e-05,2.7e-05,3e-05,2.5e-05,2.3e-05,2.2e-05,1.8e-05,2.9e-05,3e-06,2.8e-05,2.5e-05,3.1e-05,4.2e-05,2.8e-05,1.1e-05,2.8e-05,2.6e-05,2.1e-05,3.7e-05,2.5e-05,3.2e-05,3.1e-05,2.6e-05,2.4e-05,6e-06,1.5e-05,5.5e-05,5e-05,6.2e-05,1.2e-05,1.9e-05,2.7e-05,1.7e-05,3.1e-05,1.3e-05,6e-06,3.7e-05,5.2e-05,3.4e-05,2.3e-05,1.6e-05,5.5e-05,3e-05,3.7e-05,5.4e-05,2.9e-05,3.9e-05,3.9e-05,2.8e-05,3.6e-05,1e-05,1.4e-05,3.3e-05,2.5e-05,7.6e-05,4.7e-05,2.2e-05,3.6e-05,6.7e-05,5.6e-05,1.4e-05,4e-06,3.4e-05,5.4e-05,2.8e-05,3.8e-05,4.9e-05,2.2e-05,9e-06,4.1e-05,2.9e-05,1.4e-05,1.7e-05,2.9e-05,4.6e-05,6.3e-05,3.7e-05,4.4e-05,4.4e-05,1.9e-05,3.1e-05,5.3e-05,5e-05,1.3e-05,3.6e-05,9e-06,6e-05,4e-05,1.1e-05,6.3e-05,1.9e-05,6.7e-05,3.8e-05,2.8e-05,2.6e-05,8.5e-05,4.7e-05,4.2e-05,7.6e-05,5e-05,3.3e-05,3e-05,3.1e-05,1.5e-05,1.3e-05,3.6e-05,7.4e-05,6.6e-05,3.1e-05,7.7e-05
1.9e-05,2.4e-05,2.2e-05,7e-06,5.1e-05,9.7e-05,9.3e-05,2.9e-05,6.3e-05,6.7e-05,4.4e-05,5.3e-05,4.4e-05,4.5e-05,9e-06,3e-05,3.8e-05,3.1e-05,1e-05,2.1e-05,4.4e-05,5.8e-05,3.3e-05,5.9e-05,5.5e-05,3.4e-05,3.1e-05,2.7e-05,3.8e-05,2.7e-05,4.6e-05,5.7e-05,3.6e-05,1.8e-05,1.1e-05,1.1e-05,3e-05,4.8e-05,6.5e-05,5.6e-05,7e-05,5.1e-05,7.4e-05,4.6e-05,2.7e-05,3.3e-05,1.8e-05,4.5e-05,9.5e-05,6.3e-05,5.4e-05,9e-06,5.7e-05,4.2e-05,7.1e-05,0.000109,8.8e-05,6.2e-05,4.4e-05,3.9e-05,9e-06,1e-05,2.5e-05,4.2e-05,5.2e-05,7.5e-05,0.000126,0.000117,4.5e-05,5.4e-05,0.000132,0.00013,8.3e-05,4.8e-05,7.9e-05,0.000103,2.5e-05,6.9e-05,5.8e-05,3e-05,2.9e-05,1.6e-05,3.4e-05,1.7e-05,2.5e-05,6.5e-05,0.000121,9e-05,5.1e-05,2e-05,5e-05,6.9e-05,4.3e-05,4.8e-05,5.2e-05,4.8e-05,6.1e-05,7e-05,9.1e-05,4.7e-05,6.1e-05,4.4e-05,6.4e-05,7.1e-05,2.4e-05,3.6e-05,0.000144,8.1e-05,4.1e-05,0.000124,0.000105,4e-05,5.4e-05,4.5e-05,9.5e-05,4.7e-05,7.5e-05,8e-06,0.00014,0.000128,2.1e-05
3.2e-05,1e-05,3.3e-05,2.4e-05,3.7e-05,4.1e-05,4.8e-05,7.2e-05,3.3e-05,2.1e-05,3.9e-05,2.9e-05,5e-06,1.2e-05,3.4e-05,2.2e-05,2.7e-05,1.3e-05,3.8e-05,3.1e-05,3.4e-05,2.2e-05,3.4e-05,8.4e-05,4.1e-05,1.4e-05,1.6e-05,1.4e-05,2.1e-05,2.8e-05,5e-05,6.7e-05,5.9e-05,4.3e-05,2.5e-05,2.5e-05,2.7e-05,3.7e-05,2.1e-05,4.3e-05,1.6e-05,6e-06,5.9e-05,4.3e-05,2.5e-05,2.4e-05,5.5e-05,6.2e-05,3.8e-05,4.2e-05,7.8e-05,7.7e-05,7.3e-05,2.8e-05,5.4e-05,6.7e-05,3.4e-05,2.2e-05,2.6e-05,8e-06,2.6e-05,3.1e-05,2.4e-05,3.2e-05,2e-05,9.5e-05,9.4e-05,9e-06,5.9e-05,6.8e-05,0.00012,6.5e-05,3.9e-05,4.1e-05,6.6e-05,7.2e-05,7.2e-05,6.5e-05,2.9e-05,3.7e-05,2.9e-05,2.3e-05,6.2e-05,6.2e-05,3.6e-05,5.7e-05,7.4e-05,6.2e-05,1.4e-05,7e-06,4.3e-05,7e-05,4.6e-05,3.1e-05,3.6e-05,8.9e-05,7.8e-05,6.7e-05,5.2e-05,5.3e-05,5.9e-05,4.5e-05,3.3e-05,4.9e-05,5.3e-05,5.9e-05,0.00012,0.000101,8.7e-05,9.7e-05,0.000102,8.9e-05,3.6e-05,2.5e-05,8.3e-05,0.000111,0.000127,1e-04,0.000177,0.00014,0.000111
3.4e-05,1.3e-05,1.8e-05,2.9e-05,3.8e-05,2.5e-05,3e-05,3.3e-05,2.3e-05,1.7e-05,2.4e-05,4.1e-05,3.6e-05,1.9e-05,3.2e-05,2.9e-05,3.3e-05,1.7e-05,3.7e-05,3.4e-05,1.8e-05,1.7e-05,4.2e-05,3.8e-05,6e-06,1.9e-05,2.5e-05,1.2e-05,9e-06,2e-05,1.6e-05,4.4e-05,4.3e-05,3.7e-05,1.4e-05,8e-06,1.2e-05,2.8e-05,2.2e-05,4e-06,2e-06,1.7e-05,2.8e-05,4.2e-05,4.3e-05,6e-06,3.8e-05,1.7e-05,4.1e-05,2e-05,4.8e-05,4.9e-05,1.2e-05,7e-06,2.9e-05,1e-05,1.5e-05,1.8e-05,1e-06,1.7e-05,1.5e-05,2.7e-05,1.6e-05,1.5e-05,2.2e-05,8.1e-05,1.5e-05,1.7e-05,4.4e-05,4.1e-05,1.8e-05,2.5e-05,1.5e-05,2.3e-05,7.6e-05,2.4e-05,3.9e-05,1.4e-05,1.2e-05,2.5e-05,1e-05,8e-06,4.2e-05,1.6e-05,4e-05,4.7e-05,2.1e-05,3e-05,3.3e-05,2.5e-05,2.8e-05,1.8e-05,4.3e-05,3e-05,3e-06,6.5e-05,1.8e-05,4e-05,3.7e-05,4.5e-05,2.8e-05,6e-05,2.3e-05,7e-06,2.7e-05,4.2e-05,3.3e-05,1.7e-05,3.5e-05,2.5e-05,3.9e-05,1.8e-05,4e-06,7e-06,4.9e-05,5.5e-05,1e-05,2e-05,7.6e-05,2.1e-05,4.7e-05
1.6e-05,2e-05,8e-06,6e-06,1.8e-05,1.3e-05,6e-06,2.9e-05,1.1e-05,3.9e-05,6e-06,2e-05,1.8e-05,6e-06,1.4e-05,1.4e-05,5e-06,1e-05,2.8e-05,5e-06,1.9e-05,7e-06,2.5e-05,1.9e-05,1.3e-05,1.3e-05,7e-06,1.3e-05,6e-06,9e-06,1.4e-05,2e-05,1.1e-05,2.4e-05,1.4e-05,2.3e-05,1e-05,1.3e-05,1.2e-05,2.5e-05,1.1e-05,1.9e-05,2.2e-05,1.9e-05,1.9e-05,2.7e-05,2.1e-05,8e-06,1.9e-05,1.9e-05,7e-06,3.3e-05,1.9e-05,1.1e-05,2.7e-05,1e-05,1.2e-05,2e-06,4e-06,1.6e-05,2.1e-05,2.4e-05,1.1e-05,4e-06,1.5e-05,2.6e-05,1.1e-05,1.4e-05,1.6e-05,6e-06,1.2e-05,1.2e-05,5e-06,1.2e-05,3.1e-05,1e-05,1.1e-05,3e-06,1.9e-05,1.8e-05,1.7e-05,7e-06,3.3e-05,3.4e-05,8e-06,3.2e-05,2.3e-05,2.1e-05,2.1e-05,1.2e-05,2.2e-05,5e-06,3.6e-05,3.3e-05,2.1e-05,2.5e-05,2.9e-05,2.2e-05,3.2e-05,8e-06,4e-06,4.8e-05,4e-05,2.5e-05,2e-05,2e-05,1.9e-05,1.8e-05,3.4e-05,2.7e-05,1.2e-05,2.1e-05,1.3e-05,1.8e-05,2.4e-05,4.7e-05,2.7e-05,1.2e-05,2.2e-05,1.8e-05,2.9e-05
5e-06,8e-06,7e-06,3e-06,1.1e-05,1.4e-05,1.3e-05,8e-06,9e-06,8e-06,1e-06,7e-06,9e-06,5e-06,4e-06,9e-06,7e-06,5e-06,6e-06,3e-06,1.4e-05,7e-06,6e-06,6e-06,1e-05,6e-06,8e-06,1.1e-05,1e-05,8e-06,1.1e-05,1e-06,3e-06,9e-06,6e-06,6e-06,7e-06,5e-06,7e-06,1.6e-05,1e-05,8e-06,5e-06,6e-06,1.1e-05,1.2e-05,1.8e-05,1.2e-05,8e-06,1e-06,7e-06,1e-05,7e-06,8e-06,3e-06,7e-06,1.4e-05,1e-05,9e-06,1.2e-05,5e-06,2e-06,0,6e-06,6e-06,1.4e-05,7e-06,1.2e-05,1.1e-05,1e-06,9e-06,4e-06,3e-06,5e-06,4e-06,1.2e-05,7e-06,4e-06,1e-05,5e-06,6e-06,1.1e-05,1.9e-05,3e-06,7e-06,1.5e-05,3e-06,7e-06,8e-06,5e-06,1e-05,7e-06,9e-06,1e-06,1.3e-05,1.1e-05,1.1e-05,1.8e-05,4e-06,1.1e-05,5e-06,1.5e-05,5e-06,1.6e-05,5e-06,5e-06,3e-06,1e-06,2e-06,6e-06,7e-06,6e-06,3e-06,6e-06,7e-06,2e-05,8e-06,8e-06,1.4e-05,5e-06,8e-06
1.2e-05,8e-06,2e-06,8e-06,1.5e-05,1.3e-05,9e-06,1.8e-05,1.3e-05,1.5e-05,5e-06,9e-06,9e-06,4e-06,2e-06,1.4e-05,1.2e-05,1.1e-05,5e-06,4e-06,1e-05,6e-06,1.3e-05,4e-06,6e-06,4e-06,1e-05,2e-06,1e-05,2e-06,2e-06,6e-06,1.1e-05,1.2e-05,6e-06,6e-06,6e-06,4e-06,7e-06,1e-05,7e-06,3e-06,5e-06,3e-06,6e-06,6e-06,1e-05,1e-05,1.5e-05,2e-06,6e-06,1e-05,3e-06,3e-06,2e-06,1.2e-05,1.1e-05,5e-06,1e-06,6e-06,7e-06,9e-06,2e-06,1.1e-05,1.2e-05,1e-06,4e-06,4e-06,2e-06,7e-06,1e-06,5e-06,6e-06,1e-05,2e-06,5e-06,3e-06,6e-06,4e-06,4e-06,8e-06,4e-06,2e-06,7e-06,8e-06,1e-06,1e-06,4e-06,8e-06,7e-06,1.2e-05,7e-06,1.2e-05,1.1e-05,1e-05,2e-06,1.6e-05,6e-06,9e-06,1.2e-05,7e-06,3e-06,1.3e-05,4e-06,6e-06,2e-06,7e-06,7e-06,8e-06,1e-06,5e-06,5e-06,3e-06,5e-06,3e-06,1.3e-05,1.2e-05,1e-05,1.1e-05,4e-06,1.4e-05
8e-06,2e-06,8e-06,6e-06,5e-06,1e-05,3e-06,1.4e-05,6e-06,8e-06,6e-06,2e-06,9e-06,1.3e-05,5e-06,1.9e-05,1e-06,9e-06,9e-06,7e-06,7e-06,7e-06,1.2e-05,1.4e-05,8e-06,7e-06,4e-06,3e-06,8e-06,7e-06,1.2e-05,1.1e-05,1.1e-05,7e-06,8e-06,5e-06,9e-06,6e-06,2e-06,9e-06,7e-06,4e-06,8e-06,5e-06,1.1e-05,4e-06,5e-06,3e-06,8e-06,4e-06,5e-06,4e-06,2e-06,6e-06,1.1e-05,7e-06,5e-06,6e-06,3e-06,6e-06,5e-06,8e-06,8e-06,7e-06,5e-06,5e-06,8e-06,6e-06,4e-06,4e-06,9e-06,6e-06,7e-06,4e-06,8e-06,8e-06,1e-06,1e-06,1e-06,1e-06,6e-06,2e-06,7e-06,1.5e-05,2e-06,9e-06,6e-06,4e-06,1e-06,3e-06,9e-06,5e-06,6e-06,4e-06,2e-06,5e-06,1.3e-05,1.1e-05,8e-06,1.4e-05,1.2e-05,5e-06,9e-06,4e-06,6e-06,5e-06,1.1e-05,2e-05,6e-06,8e-06,1.1e-05,2e-06,5e-06,7e-06,7e-06,1e-06,1e-05,8e-06,1e-06,5e-06,3e-06
1e-05,7e-06,9e-06,5e-06,6e-06,1.2e-05,5e-06,2e-06,1.3e-05,7e-06,7e-06,3e-06,6e-06,1.3e-05,1.1e-05,7e-06,8e-06,9e-06,1.2e-05,3e-06,1e-06,8e-06,9e-06,1.1e-05,4e-06,1e-06,4e-06,1.2e-05,1.1e-05,4e-06,1.2e-05,8e-06,5e-06,1.4e-05,1e-06,5e-06,3e-06,6e-06,1e-05,7e-06,6e-06,4e-06,5e-06,6e-06,9e-06,4e-06,3e-06,6e-06,1.5e-05,4e-06,6e-06,1.1e-05,7e-06,8e-06,2e-06,4e-06,6e-06,4e-06,4e-06,4e-06,4e-06,4e-06,6e-06,6e-06,1e-06,7e-06,5e-06,4e-06,5e-06,8e-06,9e-06,6e-06,6e-06,7e-06,7e-06,2e-06,2e-06,4e-06,3e-06,3e-06,4e-06,2e-06,1e-05,1.2e-05,7e-06,9e-06,7e-06,1e-06,6e-06,4e-06,1.1e-05,8e-06,3e-06,5e-06,9e-06,9e-06,7e-06,7e-06,6e-06,6e-06,1e-05,9e-06,7e-06,1e-05,9e-06,5e-06,1.5e-05,1.9e-05,1e-05,1.3e-05,5e-06,9e-06,1e-05,6e-06,1.1e-05,6e-06,5e-06,1.1e-05,1.8e-05,1.1e-05,1.2e-05
1e-05,1.5e-05,1.8e-05,1e-05,9e-06,5e-06,1.2e-05,1.2e-05,1.9e-05,1.5e-05,6e-06,1e-05,6e-06,7e-06,1.2e-05,1.5e-05,8e-06,5e-06,1.6e-05,6e-06,1e-06,7e-06,6e-06,1.4e-05,9e-06,1.2e-05,1.2e-05,5e-06,2e-06,7e-06,1.8e-05,8e-06,4e-06,9e-06,5e-06,5e-06,2e-06,2e-06,8e-06,8e-06,4e-06,4e-06,2e-06,1e-05,1.6e-05,7e-06,3e-06,4e-06,9e-06,3e-06,6e-06,2e-06,5e-06,2e-06,3e-06,4e-06,3e-06,6e-06,9e-06,5e-06,4e-06,6e-06,6e-06,3e-06,9e-06,7e-06,0,1e-06,7e-06,2e-06,3e-06,7e-06,3e-06,3e-06,6e-06,3e-06,3e-06,6e-06,2e-06,3e-06,3e-06,3e-06,1.1e-05,1.2e-05,5e-06,1.3e-05,8e-06,4e-06,3e-06,1e-06,8e-06,1e-06,3e-06,2e-06,3e-06,5e-06,2e-06,8e-06,3e-06,1.4e-05,2e-06,1.3e-05,7e-06,1.1e-05,4e-06,4e-06,1.5e-05,2e-06,5e-06,3e-06,1e-05,7e-06,1e-06,5e-06,2e-06,8e-06,1e-06,1e-05,9e-06,8e-06,7e-06
8e-06,8e-06,2e-06,2e-06,5e-06,7e-06,7e-06,4e-06,8e-06,1e-05,6e-06,9e-06,2e-06,4e-06,8e-06,7e-06,5e-06,2e-06,1e-05,5e-06,5e-06,1e-06,4e-06,4e-06,4e-06,7e-06,0,3e-06,7e-06,6e-06,1.3e-05,8e-06,2e-06,8e-06,3e-06,4e-06,5e-06,3e-06,1e-05,6e-06,3e-06,4e-06,6e-06,5e-06,1.1e-05,6e-06,8e-06,1e-06,8e-06,3e-06,3e-06,3e-06,3e-06,2e-06,5e-06,1e-05,3e-06,5e-06,2e-06,2e-06,5e-06,1e-06,7e-06,6e-06,8e-06,7e-06,3e-06,2e-06,5e-06,4e-06,4e-06,9e-06,3e-06,4e-06,5e-06,4e-06,2e-06,4e-06,1e-06,6e-06,7e-06,2e-06,8e-06,7e-06,2e-06,6e-06,3e-06,4e-06,4e-06,4e-06,4e-06,4e-06,1e-06,3e-06,2e-06,2e-06,3e-06,8e-06,3e-06,8e-06,1e-06,9e-06,9e-06,1.3e-05,8e-06,0,1.5e-05,1.1e-05,3e-06,1e-06,1e-05,2e-06,2e-06,2e-06,5e-06,6e-06,3e-06,6e-06,8e-06,7e-06,8e-06
3e-06,6e-06,4e-06,3e-06,2e-06,3e-06,2e-06,2e-06,5e-06,1.3e-05,8e-06,2e-06,5e-06,4e-06,8e-06,4e-06,3e-06,2e-06,4e-06,3e-06,1e-06,2e-06,7e-06,0,1e-06,4e-06,3e-06,6e-06,1.2e-05,6e-06,8e-06,4e-06,1e-06,5e-06,2e-06,3e-06,3e-06,1e-06,8e-06,4e-06,0,1e-06,4e-06,5e-06,9e-06,4e-06,6e-06,3e-06,7e-06,4e-06,2e-06,2e-06,2e-06,2e-06,4e-06,1e-05,4e-06,2e-06,3e-06,2e-06,2e-06,1e-06,3e-06,2e-06,8e-06,4e-06,2e-06,5e-06,6e-06,5e-06,2e-06,7e-06,4e-06,5e-06,8e-06,1e-06,2e-06,6e-06,3e-06,6e-06,6e-06,2e-06,2e-06,1e-05,1e-06,4e-06,3e-06,3e-06,3e-06,5e-06,2e-06,1e-06,2e-06,2e-06,1e-06,6e-06,4e-06,9e-06,0,5e-06,5e-06,1e-06,7e-06,1.1e-05,4e-06,4e-06,6e-06,2e-06,9e-06,1e-06,8e-06,5e-06,5e-06,4e-06,9e-06,4e-06,3e-06,6e-06,5e-06,9e-06,5e-06
3e-06,3e-06,4e-06,2e-06,4e-06,6e-06,4e-06,4e-06,8e-06,8e-06,1e-06,5e-06,3e-06,1e-06,9e-06,2e-06,2e-06,5e-06,6e-06,4e-06,2e-06,3e-06,6e-06,4e-06,3e-06,2e-06,4e-06,9e-06,4e-06,3e-06,1e-05,7e-06,3e-06,7e-06,1e-06,5e-06,1e-06,1e-06,4e-06,4e-06,1e-06,3e-06,2e-06,2e-06,1e-05,6e-06,3e-06,2e-06,8e-06,4e-06,2e-06,3e-06,3e-06,1e-06,2e-06,8e-06,6e-06,5e-06,4e-06,4e-06,4e-06,2e-06,2e-06,2e-06,4e-06,7e-06,5e-06,2e-06,5e-06,6e-06,5e-06,5e-06,4e-06,5e-06,6e-06,4e-06,5e-06,2e-06,1e-06,3e-06,4e-06,2e-06,4e-06,7e-06,3e-06,5e-06,4e-06,2e-06,2e-06,3e-06,1e-06,6e-06,1e-06,1e-06,3e-06,6e-06,5e-06,5e-06,4e-06,1.1e-05,1e-06,4e-06,3e-06,6e-06,6e-06,6e-06,6e-06,6e-06,5e-06,2e-06,3e-06,4e-06,3e-06,7e-06,1e-06,7e-06,6e-06,2e-06,2e-06,2e-06,1e-05
2e-06,2e-06,2e-06,3e-06,6e-06,6e-06,1e-06,5e-06,5e-06,7e-06,2e-06,4e-06,5e-06,3e-06,7e-06,7e-06,3e-06,5e-06,7e-06,1e-06,2e-06,2e-06,7e-06,1e-06,3e-06,4e-06,0,5e-06,1e-05,8e-06,4e-06,4e-06,5e-06,4e-06,3e-06,5e-06,2e-06,2e-06,3e-06,4e-06,4e-06,5e-06,4e-06,5e-06,6e-06,1e-06,2e-06,4e-06,5e-06,2e-06,6e-06,5e-06,2e-06,5e-06,3e-06,6e-06,3e-06,2e-06,1e-06,3e-06,4e-06,0,3e-06,4e-06,8e-06,5e-06,1e-06,2e-06,2e-06,3e-06,3e-06,3e-06,0,3e-06,6e-06,1e-06,6e-06,6e-06,3e-06,3e-06,4e-06,2e-06,3e-06,7e-06,3e-06,7e-06,6e-06,4e-06,5e-06,5e-06,3e-06,4e-06,1e-06,2e-06,2e-06,5e-06,2e-06,6e-06,2e-06,6e-06,4e-06,6e-06,2e-06,5e-06,3e-06,2e-06,6e-06,5e-06,4e-06,2e-06,4e-06,3e-06,3e-06,6e-06,1e-06,6e-06,2e-06,2e-06,3e-06,4e-06,4e-06
2e-06,3e-06,3e-06,3e-06,2e-06,1e-05,6e-06,7e-06,5e-06,7e-06,2e-06,2e-06,3e-06,6e-06,5e-06,7e-06,5e-06,5e-06,6e-06,2e-06,2e-06,2e-06,3e-06,4e-06,1e-06,1e-06,2e-06,5e-06,5e-06,2e-06,8e-06,2e-06,3e-06,7e-06,4e-06,1e-06,2e-06,2e-06,4e-06,3e-06,4e-06,2e-06,1e-06,6e-06,6e-06,1e-06,3e-06,3e-06,8e-06,3e-06,3e-06,2e-06,3e-06,2e-06,5e-06,8e-06,3e-06,4e-06,2e-06,2e-06,5e-06,4e-06,2e-06,5e-06,7e-06,3e-06,2e-06,3e-06,3e-06,2e-06,3e-06,1e-06,4e-06,1e-06,5e-06,2e-06,6e-06,1e-06,1e-06,2e-06,2e-06,3e-06,3e-06,4e-06,2e-06,3e-06,1e-06,6e-06,1e-06,1e-06,6e-06,2e-06,2e-06,2e-06,0,4e-06,3e-06,7e-06,5e-06,9e-06,4e-06,6e-06,4e-06,5e-06,4e-06,1e-06,6e-06,5e-06,4e-06,1e-06,1e-06,1e-06,0,5e-06,2e-06,9e-06,5e-06,4e-06,2e-06,5e-06,4e-06
1e-06,4e-06,4e-06,3e-06,4e-06,8e-06,2e-06,3e-06,2e-06,8e-06,2e-06,3e-06,2e-06,1e-06,6e-06,7e-06,4e-06,2e-06,6e-06,2e-06,4e-06,2e-06,4e-06,4e-06,1e-06,5e-06,1e-06,3e-06,6e-06,1e-06,8e-06,7e-06,2e-06,4e-06,3e-06,1e-06,3e-06,4e-06,7e-06,3e-06,3e-06,1e-06,3e-06,5e-06,8e-06,4e-06,5e-06,2e-06,5e-06,3e-06,5e-06,6e-06,1e-06,1e-06,4e-06,6e-06,5e-06,2e-06,1e-06,1e-06,3e-06,2e-06,3e-06,2e-06,4e-06,3e-06,4e-06,4e-06,1e-06,4e-06,3e-06,3e-06,2e-06,1e-06,4e-06,2e-06,3e-06,2e-06,3e-06,4e-06,2e-06,3e-06,5e-06,6e-06,2e-06,3e-06,3e-06,3e-06,3e-06,2e-06,5e-06,2e-06,1e-06,1e-06,3e-06,3e-06,3e-06,1e-06,8e-06,5e-06,3e-06,1e-05,6e-06,0,0,2e-06,5e-06,2e-06,2e-06,2e-06,5e-06,1e-06,2e-06,5e-06,1e-06,8e-06,1e-06,2e-06,6e-06,6e-06,8e-06
3e-06,1e-06,6e-06,2e-06,3e-06,5e-06,2e-06,1e-06,4e-06,9e-06,5e-06,4e-06,4e-06,4e-06,6e-06,4e-06,4e-06,2e-06,5e-06,2e-06,2e-06,1e-06,5e-06,5e-06,3e-06,4e-06,4e-06,3e-06,6e-06,1e-06,6e-06,4e-06,1e-06,5e-06,1e-06,4e-06,2e-06,3e-06,5e-06,4e-06,4e-06,3e-06,3e-06,5e-06,8e-06,3e-06,6e-06,3e-06,7e-06,3e-06,4e-06,4e-06,2e-06,2e-06,1e-06,5e-06,2e-06,4e-06,4e-06,2e-06,2e-06,1e-06,2e-06,2e-06,3e-06,1e-06,4e-06,4e-06,4e-06,6e-06,0,4e-06,1e-06,4e-06,5e-06,3e-06,3e-06,4e-06,4e-06,4e-06,5e-06,7e-06,3e-06,5e-06,2e-06,3e-06,5e-06,3e-06,1e-06,3e-06,8e-06,7e-06,2e-06,1e-06,2e-06,3e-06,1e-06,7e-06,4e-06,8e-06,3e-06,6e-06,4e-06,4e-06,6e-06,4e-06,5e-06,7e-06,6e-06,2e-06,4e-06,1e-06,3e-06,5e-06,4e-06,9e-06,3e-06,0,4e-06,6e-06,6e-06
2e-06,2e-06,2e-06,4e-06,3e-06,5e-06,1e-06,3e-06,3e-06,9e-06,1e-06,4e-06,2e-06,1e-06,6e-06,6e-06,4e-06,2e-06,5e-06,3e-06,1e-06,1e-06,4e-06,3e-06,2e-06,2e-06,2e-06,3e-06,5e-06,1e-06,6e-06,2e-06,4e-06,8e-06,3e-06,4e-06,2e-06,3e-06,5e-06,3e-06,4e-06,2e-06,3e-06,2e-06,6e-06,4e-06,3e-06,3e-06,8e-06,3e-06,4e-06,3e-06,2e-06,3e-06,4e-06,6e-06,4e-06,3e-06,1e-06,3e-06,3e-06,1e-06,4e-06,1e-06,5e-06,4e-06,2e-06,3e-06,6e-06,1e-06,3e-06,1e-06,3e-06,2e-06,6e-06,6e-06,2e-06,4e-06,3e-06,1e-06,7e-06,1e-06,4e-06,5e-06,2e-06,4e-06,5e-06,3e-06,3e-06,6e-06,3e-06,2e-06,4e-06,4e-06,3e-06,5e-06,3e-06,3e-06,7e-06,8e-06,7e-06,1e-05,4e-06,8e-06,9e-06,2e-06,7e-06,9e-06,5e-06,3e-06,7e-06,3e-06,2e-06,4e-06,5e-06,7e-06,3e-06,3e-06,2e-06,3e-06,7e-06
5e-06,0,4e-06,3e-06,4e-06,5e-06,3e-06,3e-06,4e-06,6e-06,4e-06,2e-06,3e-06,1e-06,6e-06,5e-06,3e-06,5e-06,3e-06,1e-06,1e-06,1e-06,4e-06,2e-06,1e-06,2e-06,4e-06,2e-06,7e-06,4e-06,7e-06,3e-06,1e-06,4e-06,2e-06,4e-06,3e-06,5e-06,9e-06,1e-06,3e-06,4e-06,2e-06,4e-06,7e-06,3e-06,2e-06,4e-06,2e-06,1e-06,2e-06,1e-06,2e-06,2e-06,5e-06,4e-06,5e-06,5e-06,6e-06,5e-06,8e-06,2e-06,2e-06,2e-06,4e-06,5e-06,1e-06,1e-06,7e-06,4e-06,7e-06,5e-06,3e-06,1e-06,3e-06,4e-06,5e-06,7e-06,7e-06,4e-06,3e-06,4e-06,2e-06,6e-06,2e-06,7e-06,3e-06,0,2e-06,2e-06,1e-06,5e-06,6e-06,7e-06,6e-06,6e-06,5e-06,8e-06,1e-05,1.9e-05,1.7e-05,2e-05,1.9e-05,2.1e-05,2e-05,1.5e-05,1.7e-05,1.4e-05,1.5e-05,1.3e-05,1.9e-05,1.6e-05,1.1e-05,8e-06,4e-06,1.2e-05,7e-06,8e-06,4e-06,9e-06,1.6e-05
4e-06,5e-06,8e-06,6e-06,3e-06,5e-06,4e-06,6e-06,1e-06,6e-06,5e-06,2e-06,3e-06,5e-06,9e-06,7e-06,3e-06,5e-06,8e-06,3e-06,4e-06,2e-06,8e-06,5e-06,4e-06,2e-06,4e-06,4e-06,1e-06,5e-06,6e-06,2e-06,1e-06,8e-06,2e-06,2e-06,3e-06,3e-06,5e-06,3e-06,5e-06,4e-06,4e-06,6e-06,3e-06,5e-06,5e-06,5e-06,5e-06,5e-06,2e-06,5e-06,3e-06,8e-06,4e-06,5e-06,4e-06,5e-06,5e-06,4e-06,5e-06,3e-06,5e-06,4e-06,5e-06,2e-06,6e-06,6e-06,9e-06,3e-06,9e-06,4e-06,4e-06,5e-06,4e-06,8e-06,8e-06,9e-06,1e-05,5e-06,2e-06,6e-06,6e-06,4e-06,3e-06,6e-06,4e-06,2e-06,2e-06,4e-06,3e-06,2e-06,6e-06,3e-06,8e-06,4e-06,2e-06,8e-06,2e-06,1.4e-05,8e-06,1e-06,5e-06,1.1e-05,4e-06,6e-06,5e-06,0,4e-06,1e-05,1.3e-05,1.4e-05,9e-06,5e-06,6e-06,8e-06,1.1e-05,5e-06,4e-06,8e-06,1.1e-05
5e-06,5e-06,8e-06,5e-06,5e-06,4e-06,5e-06,6e-06,4e-06,7e-06,4e-06,4e-06,5e-06,1e-06,1e-05,4e-06,3e-06,6e-06,2e-06,5e-06,5e-06,3e-06,9e-06,1.1e-05,6e-06,5e-06,5e-06,5e-06,2e-06,9e-06,7e-06,4e-06,5e-06,1.3e-05,9e-06,1.1e-05,8e-06,8e-06,1e-05,5e-06,1e-05,1.3e-05,1.4e-05,1.6e-05,9e-06,9e-06,1.2e-05,1.4e-05,1.2e-05,1.3e-05,8e-06,8e-06,8e-06,1.4e-05,1.5e-05,1.7e-05,1.7e-05,1.6e-05,1.7e-05,1.5e-05,1.5e-05,1e-05,1.4e-05,1.3e-05,1.7e-05,1.7e-05,1.6e-05,1.4e-05,1.8e-05,1.7e-05,1.6e-05,1.6e-05,1.5e-05,1.6e-05,1.7e-05,1.8e-05,2.1e-05,2.4e-05,2.8e-05,2.3e-05,1.4e-05,1e-05,9e-06,6e-06,3e-06,1.1e-05,6e-06,7e-06,6e-06,8e-06,8e-06,3e-06,6e-06,6e-06,2e-06,4e-06,4e-06,5e-06,5e-06,2e-06,7e-06,5e-06,1e-06,6e-06,6e-06,2e-06,2e-06,3e-06,3e-06,5e-06,1e-05,5e-06,1e-06,5e-06,5e-06,7e-06,6e-06,2e-06,2e-06,5e-06,1e-06
2e-06,3e-06,5e-06,1e-06,5e-06,4e-06,4e-06,2e-06,6e-06,7e-06,2e-06,3e-06,2e-06,5e-06,5e-06,3e-06,2e-06,2e-06,7e-06,3e-06,3e-06,3e-06,2e-06,3e-06,2e-06,5e-06,2e-06,1e-06,4e-06,4e-06,5e-06,1e-06,4e-06,5e-06,4e-06,4e-06,1e-06,2e-06,4e-06,2e-06,4e-06,7e-06,7e-06,2e-06,1e-05,4e-06,3e-06,6e-06,1.2e-05,5e-06,7e-06,4e-06,4e-06,7e-06,4e-06,1.1e-05,6e-06,5e-06,5e-06,5e-06,8e-06,5e-06,6e-06,8e-06,1e-05,1e-05,8e-06,1.1e-05,7e-06,6e-06,7e-06,9e-06,1.1e-05,1e-05,1.2e-05,1.2e-05,1.6e-05,1.5e-05,1.3e-05,8e-06,6e-06,7e-06,5e-06,7e-06,4e-06,4e-06,6e-06,6e-06,4e-06,2e-06,4e-06,3e-06,1e-06,1e-06,2e-06,3e-06,5e-06,9e-06,5e-06,9e-06,5e-06,3e-06,4e-06,1e-06,4e-06,4e-06,2e-06,4e-06,5e-06,4e-06,3e-06,7e-06,4e-06,2e-06,4e-06,9e-06,6e-06,2e-06,2e-06,2e-06,2e-06
2e-06,2e-06,2e-06,1e-06,3e-06,5e-06,1e-06,2e-06,4e-06,8e-06,3e-06,2e-06,2e-06,4e-06,5e-06,3e-06,3e-06,2e-06,7e-06,4e-06,1e-06,2e-06,2e-06,2e-06,1e-06,3e-06,2e-06,1e-06,5e-06,2e-06,5e-06,2e-06,4e-06,4e-06,3e-06,5e-06,1e-06,1e-06,5e-06,1e-06,3e-06,4e-06,5e-06,2e-06,8e-06,3e-06,1e-06,3e-06,1e-05,2e-06,5e-06,4e-06,2e-06,3e-06,3e-06,6e-06,3e-06,2e-06,2e-06,3e-06,3e-06,1e-06,3e-06,4e-06,7e-06,5e-06,1e-06,6e-06,1e-06,1e-06,3e-06,2e-06,3e-06,4e-06,6e-06,4e-06,4e-06,4e-06,5e-06,1e-06,2e-06,3e-06,3e-06,5e-06,2e-06,3e-06,4e-06,2e-06,2e-06,3e-06,2e-06,2e-06,1e-06,2e-06,3e-06,2e-06,4e-06,7e-06,2e-06,6e-06,3e-06,1e-06,2e-06,2e-06,3e-06,3e-06,1e-06,3e-06,2e-06,2e-06,4e-06,5e-06,2e-06,4e-06,2e-06,5e-06,4e-06,1e-06,3e-06,2e-06,3e-06
1e-06,2e-06,2e-06,1e-06,3e-06,4e-06,1e-06,1e-06,4e-06,6e-06,2e-06,2e-06,2e-06,4e-06,5e-06,4e-06,2e-06,1e-06,5e-06,3e-06,0,1e-06,3e-06,3e-06,0,3e-06,1e-06,1e-06,4e-06,1e-06,5e-06,2e-06,3e-06,5e-06,1e-06,4e-06,1e-06,0,5e-06,0,2e-06,3e-06,4e-06,2e-06,7e-06,3e-06,1e-06,2e-06,9e-06,2e-06,4e-06,3e-06,1e-06,2e-06,1e-06,5e-06,2e-06,2e-06,1e-06,1e-06,2e-06,1e-06,2e-06,3e-06,7e-06,3e-06,1e-06,4e-06,0,0,1e-06,2e-06,2e-06,3e-06,5e-06,2e-06,3e-06,2e-06,2e-06,1e-06,1e-06,3e-06,3e-06,5e-06,1e-06,3e-06,4e-06,2e-06,2e-06,2e-06,3e-06,2e-06,0,1e-06,1e-06,3e-06,4e-06,7e-06,1e-06,5e-06,3e-06,1e-06,1e-06,1e-06,1e-06,2e-06,0,2e-06,2e-06,2e-06,2e-06,4e-06,1e-06,3e-06,1e-06,4e-06,4e-06,1e-06,3e-06,2e-06,2e-06
1e-06,2e-06,3e-06,1e-06,3e-06,5e-06,1e-06,1e-06,3e-06,6e-06,2e-06,1e-06,1e-06,3e-06,5e-06,3e-06,2e-06,1e-06,5e-06,2e-06,0,1e-06,3e-06,3e-06,0,3e-06,1e-06,0,4e-06,1e-06,5e-06,1e-06,3e-06,5e-06,1e-06,4e-06,0,0,5e-06,0,3e-06,3e-06,4e-06,1e-06,6e-06,3e-06,1e-06,2e-06,8e-06,2e-06,4e-06,2e-06,1e-06,2e-06,1e-06,5e-06,3e-06,1e-06,1e-06,1e-06,3e-06,1e-06,2e-06,3e-06,6e-06,2e-06,0,4e-06,0,0,0,1e-06,2e-06,3e-06,5e-06,1e-06,1e-06,1e-06,2e-06,1e-06,2e-06,2e-06,2e-06,5e-06,1e-06,2e-06,4e-06,1e-06,1e-06,2e-06,2e-06,2e-06,1e-06,1e-06,1e-06,3e-06,4e-06,7e-06,1e-06,6e-06,2e-06,1e-06,1e-06,1e-06,1e-06,1e-06,1e-06,2e-06,2e-06,2e-06,2e-06,3e-06,1e-06,3e-06,1e-06,5e-06,4e-06,1e-06,2e-06,2e-06,2e-06
