-0.002957,-0.004151,-0.006873,-0.008433,-0.00724,-0.007238,-0.008356,-0.009424,-0.008697,-0.015862,-0.019172,-0.01268,-0.00931,-0.008577,-0.012156,-0.01338,-0.012807,-0.01132,-0.010982,-0.012038,-0.010884,-0.00731,-0.006812,-0.010633,-0.010419,-0.013458,-0.017875,-0.0137
-0.002476,-0.002127,-0.002016,-0.00166,-0.000737,-0.00574,-0.00387,-0.000916,0.000597,0.003815,0.003455,0.000234,0.002645,-0.003677,-0.005831,-0.002084,-0.004368,-0.004242,-0.00486,-0.002647,-0.00241,-0.00468,-0.001025,-0.003715,0.001076,0.001958,0.008909,0.007118
-0.000543,-0.001207,-0.001125,-0.003094,-0.00481,-0.003112,-0.003706,-0.004458,-0.003404,-0.006004,-0.008925,-0.008124,-0.006298,-0.005937,-0.008059,-0.008692,-0.007176,-0.005803,-0.003661,-0.00556,-0.004702,-0.003368,-0.003914,-0.004375,-0.003978,-0.004903,-0.007906,-0.006234
0.002528,0.002497,0.003344,0.002984,0.00153,0.004334,0.00325,0.002082,0.001353,0.000625,0.001296,-0.000917,-0.00497,-0.000991,-0.000402,-0.003036,-0.000749,0.000704,0.003843,0.001674,0.000654,0.002369,-0.001668,-0.000139,-0.002809,-0.004067,-0.010532,-0.007535
0.002752,0.003847,0.004859,0.007916,0.008834,0.006788,0.008767,0.01097,0.0085,0.015981,0.024074,0.016953,0.010182,0.00792,0.01115,0.013364,0.012922,0.01184,0.01144,0.014815,0.012193,0.007774,0.00764,0.009584,0.010503,0.014569,0.020687,0.016086
-0.001498,-0.002582,-0.005029,-0.005195,-0.004111,-0.00309,-0.003347,-0.005071,-0.006057,-0.01072,-0.011375,-0.004308,-0.002074,-0.001796,-0.003018,-0.003356,-0.002243,-0.003291,-0.004685,-0.003245,-0.002028,-0.001984,-0.000667,-0.002569,-0.001909,-0.000362,-0.001055,-0.002038
-0.002567,-0.002917,-0.003392,-0.004497,-0.00437,-0.00478,-0.005872,-0.00759,-0.005912,-0.010832,-0.018346,-0.011696,-0.005447,-0.003881,-0.005843,-0.007388,-0.008774,-0.010177,-0.011497,-0.011864,-0.009439,-0.007203,-0.006953,-0.009357,-0.009665,-0.012541,-0.017226,-0.013547
-0.000202,0.001385,0.004396,0.004619,0.004021,0.000509,0.001857,0.004571,0.006272,0.013702,0.013177,0.007644,0.009918,0.006713,0.008994,0.012206,0.007849,0.005391,0.002892,0.00377,0.003412,0.000662,0.003106,0.005607,0.006843,0.007073,0.014934,0.01153
0.000847,0.000589,0.000407,-0.001204,-0.001651,0.000615,-0.000588,-0.000923,-0.000325,-0.001476,-0.000501,9.2e-05,-0.000452,0.002304,0.003296,0.002379,0.003703,0.004866,0.005089,0.001433,0.000431,0.002644,0.00328,0.006126,0.004006,0.003491,0.00449,0.003242
0.001678,0.001229,-0.000436,-3.8e-05,0.000586,0.002504,0.001024,0.000169,-0.001431,-0.006092,-0.003347,-0.002502,-0.008034,-0.003311,-0.003821,-0.007077,-0.004082,-0.000222,0.002596,-0.000777,-0.002243,0.001944,-0.00178,-0.001858,-0.005488,-0.00866,-0.016022,-0.010412
0.000842,0.001246,0.001406,0.004095,0.004199,0.002624,0.005097,0.007338,0.004464,0.008571,0.013968,0.008935,0.004479,-0.000132,0.000263,0.003706,0.003423,0.003796,0.004485,0.008176,0.007588,0.002991,0.002121,0.001927,0.004296,0.006594,0.00993,0.008589
-0.001871,-0.002858,-0.002933,-0.003536,-0.004762,-0.002753,-0.001924,-0.003673,-0.003109,-0.004555,-0.010125,-0.006763,-0.00155,-0.00448,-0.006753,-0.005373,-0.003868,-0.005576,-0.005475,-0.002997,-0.000344,-0.003468,-0.00146,-0.003363,0.000536,0.004361,0.004822,0.00185
-0.001524,-0.001656,-0.001065,-0.002678,-0.00288,-0.002937,-0.003919,-0.005708,-0.003013,-0.005289,-0.011941,-0.01043,-0.006416,-0.00488,-0.007004,-0.00987,-0.009752,-0.010026,-0.009026,-0.009414,-0.008664,-0.006156,-0.006501,-0.009808,-0.009667,-0.011215,-0.016593,-0.012791
0.000503,0.001363,0.001852,0.001517,0.003196,-0.000221,0.000131,0.003226,0.004215,0.009597,0.015764,0.009575,0.006627,0.004766,0.006613,0.006994,0.004045,0.004217,0.003628,0.004558,0.00168,0.001811,0.002427,0.003058,0.002246,0.001701,0.007276,0.005723
0.001113,0.000518,-0.001209,-0.001699,-0.000565,0.000563,-0.001093,-0.001653,-0.001224,-0.002432,0.00085,0.003872,0.002903,0.004958,0.006347,0.00466,0.005359,0.006057,0.005113,0.002567,0.00228,0.004474,0.005514,0.007992,0.006043,0.006462,0.009172,0.005317
0.001416,0.001695,0.001723,0.003131,0.002285,0.003355,0.002159,-1.2e-05,-0.001371,-0.004374,-0.006334,-0.002128,-0.002363,0.001078,0.001667,-6.2e-05,-0.000114,0.000112,-0.000422,-0.003135,-0.000998,0.001811,-0.000808,-0.000442,-0.002942,-0.006553,-0.012977,-0.008283
-5.6e-05,0.000976,0.003108,0.004966,0.003442,0.002576,0.004985,0.006539,0.003734,0.00861,0.00959,0.005922,0.005678,0.002046,0.003556,0.009364,0.005942,0.002709,0.001016,0.004239,0.005237,0.000831,0.00046,0.000907,0.002973,0.002666,0.004751,0.005622
-0.002253,-0.003047,-0.003218,-0.004261,-0.004689,-0.002913,-0.002223,-0.003306,-0.002554,-0.004099,-0.008124,-0.006117,-0.002303,-0.002193,-0.003454,-0.001297,0.000419,-0.002161,-0.002801,-0.001085,-0.000632,-0.002942,0.000453,0.000135,0.003178,0.007172,0.009547,0.004962
-0.00097,-0.00149,-0.002655,-0.004053,-0.003105,-0.003669,-0.004926,-0.005578,-0.003311,-0.009181,-0.010246,-0.008601,-0.009105,-0.005439,-0.00737,-0.012509,-0.009334,-0.006062,-0.004514,-0.005461,-0.006928,-0.003682,-0.004262,-0.006196,-0.008201,-0.008437,-0.012819,-0.01016
