0.004534,0.004549,0.004475,0.004626,0.004807,0.005524,0.005897,0.005183,0.004538,0.004088,0.004101,0.004492,0.004544,0.005115,0.006073,0.005349,0.004077,0.004591,0.005427,0.005216,0.004816,0.005095,0.004994,0.004507,0.004258,0.004409,0.004596,0.004585
0.005409,0.005375,0.005293,0.005596,0.005814,0.006522,0.006936,0.006169,0.005455,0.004909,0.00498,0.005472,0.005521,0.006162,0.00722,0.006423,0.005041,0.0056,0.006541,0.006358,0.005882,0.006125,0.005954,0.005399,0.00517,0.005355,0.005515,0.005532
0.006796,0.006648,0.006597,0.007184,0.007417,0.007941,0.008345,0.007638,0.006922,0.006182,0.006349,0.007077,0.007115,0.007731,0.008823,0.00804,0.006635,0.007218,0.008222,0.008077,0.00756,0.007736,0.007454,0.006832,0.006616,0.006797,0.00696,0.007125
0.007526,0.007393,0.007451,0.00821,0.008397,0.008449,0.008667,0.008299,0.007882,0.006922,0.006995,0.007976,0.008123,0.008551,0.009332,0.008737,0.007587,0.008045,0.008906,0.008775,0.008475,0.008638,0.008207,0.007671,0.007455,0.007412,0.007707,0.008252
0.007475,0.007466,0.007759,0.0085,0.00863,0.008274,0.008186,0.008122,0.008106,0.007011,0.006656,0.007677,0.008136,0.008534,0.008972,0.008646,0.007731,0.007842,0.00857,0.008443,0.008447,0.008807,0.008283,0.007864,0.007554,0.007111,0.007567,0.008475
0.007017,0.006964,0.007484,0.008205,0.008179,0.007857,0.007837,0.007745,0.007777,0.006773,0.006189,0.006954,0.00753,0.008071,0.00866,0.008717,0.007811,0.007479,0.007945,0.007828,0.007986,0.008636,0.008336,0.007988,0.007511,0.006692,0.007052,0.008022
0.006765,0.006465,0.006996,0.007915,0.007688,0.007401,0.007653,0.00755,0.00743,0.00652,0.006062,0.006607,0.006993,0.007621,0.008664,0.009161,0.008031,0.007244,0.007618,0.007767,0.007855,0.00846,0.008378,0.008131,0.007913,0.006972,0.006871,0.007485
0.006738,0.006395,0.006922,0.007752,0.007166,0.006799,0.007308,0.007434,0.007365,0.006629,0.00641,0.006917,0.006954,0.007279,0.00851,0.009238,0.007961,0.0071,0.007867,0.008718,0.008534,0.008401,0.008133,0.007931,0.008173,0.007253,0.006814,0.007303
0.006717,0.006691,0.007502,0.008122,0.007368,0.006881,0.007227,0.007584,0.007827,0.007231,0.006958,0.007784,0.007854,0.007499,0.008203,0.008983,0.008145,0.007492,0.008427,0.010434,0.010338,0.008857,0.008173,0.008115,0.008601,0.007522,0.007177,0.008131
0.007088,0.007459,0.008523,0.009078,0.008483,0.007899,0.007852,0.008405,0.008785,0.007897,0.007349,0.008521,0.008714,0.00767,0.007813,0.008806,0.008683,0.008349,0.009345,0.012829,0.013176,0.010099,0.009108,0.009349,0.009459,0.007849,0.007795,0.009572
0.007722,0.008454,0.009603,0.010232,0.009891,0.009289,0.008987,0.00982,0.010301,0.008931,0.00812,0.009057,0.008902,0.00758,0.007733,0.009119,0.009326,0.009045,0.010334,0.014988,0.015553,0.011435,0.010283,0.01051,0.009901,0.00781,0.008175,0.010953
0.00837,0.009234,0.010218,0.010773,0.010356,0.009598,0.009241,0.010327,0.011351,0.010283,0.00924,0.009528,0.008954,0.007898,0.008286,0.009861,0.010118,0.00959,0.01099,0.015705,0.016496,0.012404,0.010745,0.010692,0.010005,0.007904,0.00848,0.011872
0.008948,0.009913,0.010497,0.010653,0.009994,0.009277,0.00899,0.009903,0.011612,0.011469,0.010123,0.009856,0.009297,0.008712,0.009201,0.010507,0.01051,0.009944,0.011166,0.014449,0.015603,0.012934,0.010558,0.010063,0.010075,0.008671,0.009525,0.012871
0.009352,0.010818,0.011217,0.010898,0.010296,0.009926,0.009368,0.009398,0.01134,0.011949,0.010288,0.010005,0.00992,0.009557,0.010033,0.010949,0.010735,0.010352,0.011147,0.01306,0.014618,0.013145,0.010717,0.010253,0.010451,0.009785,0.011192,0.013707
0.010181,0.011891,0.01142,0.010652,0.011032,0.011245,0.009974,0.008966,0.01038,0.011076,0.00985,0.010528,0.011121,0.010227,0.010678,0.011413,0.011342,0.011571,0.011512,0.012036,0.013332,0.012458,0.011333,0.011573,0.010671,0.010284,0.01236,0.013032
0.011423,0.013051,0.011588,0.01061,0.011897,0.012499,0.010748,0.009035,0.009178,0.009358,0.00938,0.011317,0.012327,0.010775,0.011196,0.012117,0.012221,0.013007,0.012169,0.011489,0.012481,0.012205,0.012244,0.012614,0.010638,0.010575,0.012833,0.011749
0.010961,0.012316,0.010961,0.010264,0.011616,0.012107,0.010469,0.008812,0.008342,0.008044,0.008637,0.010985,0.012117,0.01056,0.010675,0.01135,0.011383,0.012315,0.011528,0.010752,0.011583,0.011678,0.011832,0.011698,0.009727,0.009852,0.011706,0.010509
0.008895,0.009995,0.010114,0.010217,0.010497,0.010121,0.009125,0.008197,0.007746,0.007868,0.008782,0.010367,0.011509,0.010328,0.009363,0.009133,0.009,0.009908,0.009619,0.009749,0.010556,0.011293,0.010952,0.009403,0.008169,0.008341,0.009355,0.009087
0.007942,0.008888,0.010314,0.01148,0.010627,0.009339,0.008773,0.007944,0.007672,0.008887,0.010222,0.010923,0.012238,0.01127,0.008957,0.007724,0.007959,0.009283,0.009023,0.010103,0.010867,0.012117,0.011717,0.008975,0.008318,0.008775,0.009164,0.009045
0.008465,0.009319,0.010894,0.012668,0.011869,0.010369,0.009917,0.008962,0.008891,0.010332,0.011239,0.011477,0.012809,0.011646,0.008972,0.007734,0.00881,0.01074,0.009856,0.010707,0.011256,0.012615,0.012447,0.0094,0.0088,0.009429,0.009693,0.009428
0.009736,0.010272,0.011266,0.012969,0.012926,0.011976,0.012083,0.011731,0.011497,0.011933,0.011849,0.011682,0.012457,0.011225,0.009398,0.008797,0.010322,0.012519,0.01142,0.011484,0.011515,0.012138,0.012207,0.009985,0.009257,0.009875,0.010297,0.009742
0.01361,0.013199,0.013001,0.014644,0.01622,0.015779,0.015335,0.016258,0.016165,0.015661,0.015868,0.015821,0.014969,0.012876,0.012108,0.011852,0.012964,0.01453,0.013486,0.013718,0.01438,0.014305,0.014174,0.013183,0.012371,0.01296,0.014008,0.012656
0.019366,0.018176,0.016616,0.017835,0.021209,0.021546,0.020093,0.022092,0.022471,0.021307,0.021943,0.022351,0.019769,0.016194,0.016338,0.016536,0.017136,0.017458,0.016522,0.018402,0.020237,0.020046,0.019685,0.018836,0.017676,0.018408,0.019922,0.017777
0.023169,0.021711,0.01946,0.020443,0.024814,0.025657,0.023598,0.025946,0.02673,0.025279,0.026012,0.02699,0.023705,0.018982,0.019301,0.01987,0.020377,0.019959,0.01895,0.021841,0.024494,0.024362,0.023747,0.022837,0.02145,0.022218,0.023871,0.021382
0.021418,0.020366,0.018898,0.02003,0.023611,0.024112,0.021972,0.023804,0.024763,0.023538,0.024126,0.025486,0.022463,0.017565,0.017776,0.018832,0.019458,0.018577,0.01753,0.020278,0.022957,0.022921,0.022206,0.021589,0.020325,0.020847,0.022179,0.020246
0.014609,0.01444,0.01618,0.018625,0.018715,0.017118,0.015209,0.016107,0.017174,0.016667,0.016921,0.017934,0.015875,0.012214,0.012539,0.014535,0.015068,0.013382,0.012367,0.014005,0.015756,0.015818,0.015477,0.015522,0.01449,0.014525,0.015406,0.015239
0.00957,0.010477,0.015221,0.018812,0.015697,0.011307,0.009493,0.010156,0.011733,0.012584,0.012394,0.011567,0.010129,0.008679,0.009212,0.011704,0.012142,0.010102,0.009158,0.009441,0.009552,0.009458,0.009953,0.010444,0.009568,0.009673,0.01013,0.01084
0.010962,0.01259,0.01657,0.019138,0.015639,0.01081,0.009674,0.010611,0.011983,0.013782,0.013399,0.012525,0.011788,0.010843,0.011142,0.012811,0.012816,0.011672,0.011564,0.011908,0.01109,0.010217,0.011267,0.012153,0.011561,0.012286,0.012266,0.011334
0.018044,0.019631,0.021046,0.021246,0.019211,0.016316,0.016242,0.016136,0.015928,0.018049,0.018887,0.019877,0.019472,0.017864,0.01819,0.01877,0.018599,0.018371,0.018841,0.019372,0.017911,0.016313,0.017437,0.018947,0.019253,0.019817,0.018847,0.016431
0.029929,0.031822,0.030777,0.02678,0.02644,0.026389,0.027127,0.026512,0.024605,0.026778,0.029053,0.03162,0.031605,0.029493,0.029841,0.030241,0.030256,0.030213,0.030841,0.031518,0.029158,0.026635,0.028265,0.030576,0.031628,0.03226,0.030398,0.026579
0.04374,0.046107,0.0438,0.035331,0.035483,0.038152,0.039488,0.038278,0.035364,0.038085,0.041616,0.045082,0.045533,0.043213,0.043354,0.043661,0.043979,0.044061,0.044559,0.045261,0.041986,0.038323,0.040651,0.0443,0.045958,0.046544,0.043856,0.038593
0.05279,0.05533,0.052747,0.041666,0.041375,0.045723,0.047288,0.045363,0.042287,0.045342,0.049679,0.053453,0.054441,0.052408,0.052152,0.05226,0.052833,0.053098,0.05304,0.05352,0.049963,0.045499,0.048207,0.053371,0.055297,0.055465,0.052331,0.046312
0.049781,0.051965,0.050094,0.039562,0.038589,0.043069,0.044237,0.041817,0.039492,0.042229,0.046319,0.049493,0.0509,0.049675,0.049021,0.048849,0.049539,0.050042,0.049219,0.049264,0.046398,0.042177,0.044786,0.050634,0.052085,0.051518,0.048718,0.043354
0.034865,0.036362,0.036018,0.031308,0.029867,0.030502,0.030652,0.028415,0.027315,0.029238,0.031948,0.033749,0.035126,0.034821,0.034204,0.033784,0.034305,0.035108,0.033885,0.03347,0.03182,0.029064,0.031826,0.03653,0.036454,0.035294,0.033483,0.029972
0.018306,0.019048,0.019951,0.023847,0.021893,0.016006,0.01513,0.013861,0.014065,0.015477,0.015915,0.016121,0.017082,0.017592,0.017817,0.017004,0.016971,0.01853,0.017548,0.016497,0.01574,0.015505,0.020697,0.022006,0.01865,0.017274,0.016404,0.014798
0.012028,0.011417,0.012462,0.020212,0.018028,0.008394,0.006625,0.007218,0.008531,0.010067,0.007426,0.005916,0.007146,0.009707,0.011622,0.009648,0.008569,0.011316,0.010256,0.008846,0.008407,0.010262,0.016195,0.015373,0.009584,0.008746,0.008829,0.00738
0.010922,0.009488,0.010248,0.017713,0.018329,0.007277,0.004967,0.006414,0.007181,0.007704,0.004657,0.003447,0.005456,0.008539,0.00964,0.009327,0.008765,0.008613,0.00747,0.00687,0.007855,0.010088,0.012604,0.012231,0.008737,0.008511,0.010225,0.007524
0.01005,0.009412,0.010979,0.0175,0.019114,0.008538,0.005269,0.006047,0.005891,0.005898,0.004133,0.003287,0.005076,0.007657,0.00785,0.009772,0.00977,0.006767,0.005768,0.006078,0.008341,0.010143,0.009354,0.010474,0.009116,0.008977,0.011802,0.008047
0.009056,0.009664,0.012506,0.01839,0.018228,0.009804,0.006584,0.007159,0.006568,0.004837,0.004365,0.003856,0.004851,0.007278,0.009109,0.011844,0.010978,0.006871,0.005744,0.005827,0.008086,0.010955,0.010393,0.010299,0.008899,0.009122,0.011853,0.009049
0.009059,0.008823,0.01235,0.017194,0.014887,0.01043,0.00813,0.00911,0.008462,0.004616,0.005423,0.005047,0.004808,0.007375,0.011856,0.013924,0.012468,0.008809,0.007005,0.006588,0.007943,0.011614,0.012181,0.009204,0.007665,0.00868,0.010691,0.010553
