0.000554,0.000649,0.000898,0.000496,0.000601,0.000674,0.001056,0.000898,0.00049,0.00029,0.000138,0.000781,0.001087,0.000421,0.000313,0.000693,0.00039,0.000183,8.8e-05,0.000447,0.000556,0.000881,0.000424,0.000323,0.000247,0.000167,0.000857,0.000565,0.00033,0.001734,0.0015,0.001011,0.000673,0.001034,0.001043,0.000323,0.001075,0.001235,0.000303,0.000116,0.00066,0.001351,0.002449,0.001115,0.000166,0.001512,0.000886,0.000594,0.000418,0.001288,0.001628,0.00177,0.002511,0.001457,0.000738,0.000531,0.002267,0.001607,0.003112,0.001478,0.001215,0.000673,0.000994,0.000265,0.000646,0.00087,0.000925,0.00024,0.000764,0.000707,0.000322,0.001296,0.000938,0.00052,-0.000164,0.001083,0.001042,0.001067,0.001016,0.002248,0.001258,-0.000416,0.000242,0.000176,0.000431,0.001276,0.000921,0.00171,0.00071,0.000368,0.000758,0.002526,0.001156,0.00133,0.000372,0.00292,0.001814,0.001187,0.000655,0.000635,-3.1e-05,2e-05,-2e-05,-0.000185,0.000851,0.001014,-0.000127,-0.000195,0.003315,0.002981,0.00212,0.001162,0.000798,0.002354,0.001518,0.000155,-0.000689,-0.000669,0.000695,0.000329,-9e-04
-9.9e-05,-0.000332,0.000395,0.000372,0.000296,-0.000448,0.000319,0.000575,0.000143,2e-06,-0.000149,0,-0.000152,0.000141,2.5e-05,0.000308,3e-05,-0.000228,-0.000138,-0.000404,-0.000376,-0.000227,-6.3e-05,-0.00017,-3.1e-05,0.000159,0.00034,-3.4e-05,-8.7e-05,0.000107,0.000648,0.000302,-0.000153,0.000182,0.000138,0.000537,0.001243,0.00042,0.000221,-0.000179,0.000283,0.000715,5.5e-05,0.000109,0.000116,-0.000282,-0.000223,-0.000456,-0.00051,0.000329,-0.000294,0.001143,0.001973,0.00109,0.000947,-0.000441,-0.000602,0.000753,0.000179,-4.9e-05,0.000186,0.000279,0.000206,0.000227,-0.000286,-0.000382,0.000611,0.00069,-0.000332,-7e-05,0.000384,-0.00059,0.000212,-0.000435,-0.000137,-0.000483,0.000277,-0.000483,-0.000207,-0.000331,-0.000449,6.7e-05,-0.000121,-0.0011,-0.000115,0.00018,-6.6e-05,-7e-05,-0.000533,-9.3e-05,0.000111,-0.001098,-0.0019,-0.001393,-0.000374,-0.001215,-0.000126,0.000256,-0.000258,3.5e-05,0,0.000253,-4.7e-05,9.6e-05,0.000298,0.000208,9.8e-05,-0.000339,-0.001003,0.000605,0.000287,-0.00015,0.001068,0.00159,0.001661,0.000448,-0.000458,-0.000845,-0.00041,-0.000994,0.000472
-0.000115,-5e-04,-8e-06,3.2e-05,3.3e-05,-0.000397,0.000326,0.00015,3e-05,-6e-05,-0.000113,-0.000299,-0.000566,-0.000506,-0.000281,-3.1e-05,-0.000127,-7e-05,8.3e-05,0.000243,-0.000234,-0.000685,-0.00036,0.000142,8.7e-05,5.2e-05,0.000172,-3.5e-05,4.2e-05,-0.000109,-0.000399,-0.000179,-0.000197,-0.000129,-0.000402,8.7e-05,0.000224,-0.000391,-3.2e-05,-0.000628,-0.000689,4e-05,-0.000299,-0.000766,-0.000408,-0.00052,-0.000398,-0.000438,-0.000588,-0.000357,-0.001952,-0.000386,-3.7e-05,8e-06,0.000112,-9.5e-05,-0.000271,0.000244,-0.001097,-0.000768,-0.000963,-0.000203,-0.000919,-0.000577,-0.000673,1.5e-05,-0.000407,0.000223,-0.000877,-0.000663,-9.1e-05,-0.000818,-0.000418,6.1e-05,0.000138,-0.001392,-0.000922,-0.001029,-0.00026,-0.001217,-0.000692,0.000458,-0.000561,-0.000265,-0.000549,0.000307,1.3e-05,-0.000982,-0.00151,-0.00014,-0.000401,-0.001713,-0.000952,-0.001541,-0.000552,-0.001672,0.000372,0.000577,0.000171,-0.001344,-0.000854,0.000312,-0.000564,-0.000243,0.000627,2.8e-05,-0.001296,-0.000503,-0.001178,-0.000624,-0.00044,0.001021,0.000558,0.000887,0.001048,-0.00094,0.001143,0.000466,0.000128,-0.000689,-0.002169
0.000143,-0.000265,-0.000216,1e-05,-3.3e-05,8e-05,0.000134,-0.000272,-7.9e-05,4.4e-05,-2.7e-05,-0.000134,-0.00049,-0.000307,-0.000135,4.6e-05,-4.7e-05,-1.1e-05,-0.000141,0.000206,6.3e-05,-0.000641,-0.000234,-0.000137,-3.7e-05,3.5e-05,-0.000342,-7.8e-05,-0.000104,-0.000169,-0.000153,-0.000321,-5.9e-05,-0.000374,-0.000177,-0.000126,-0.000408,-0.000442,-0.000576,-0.000311,-0.000502,-6.3e-05,0.000189,-0.000374,-0.000235,-9.8e-05,-0.000146,0.000166,0.000334,-0.000475,-0.000903,0.00013,-0.000517,-0.000708,-0.000148,-2e-04,-0.000556,-0.000245,-0.000195,-0.000388,-0.000501,-0.000302,-0.00039,5.4e-05,-0.000359,-0.00022,-0.000179,-0.000928,-0.000165,-0.000298,-0.000206,0.000122,4e-05,0.000219,-0.000563,0.000272,0.000345,0.000554,-0.001287,-0.000884,-0.000706,-0.000433,-0.000361,-0.00024,-0.000127,-0.000655,0.000122,-0.000148,-0.001083,-0.001007,-0.000734,-0.000483,0.000579,0.000261,0.000835,-0.0013,7.2e-05,-3.8e-05,-0.000944,-0.000444,-0.00086,-0.000389,-0.000194,0.000183,-0.000168,-0.00083,-0.00022,0.000147,-0.001181,-0.001581,-0.001241,-0.001104,-0.000631,0.000732,-4.1e-05,-0.000712,-0.001178,-0.000129,0.000141,0.001221,0.000174
0.000111,-4.4e-05,-0.000127,-0.000183,-0.000104,0.000146,5.2e-05,-0.000305,-0.000247,-2.8e-05,4.8e-05,-0.000131,-0.000377,-0.000208,4.6e-05,0.000238,-2.9e-05,4e-05,0.000194,2e-06,-0.000246,-0.000217,7e-06,-9.3e-05,-0.000168,4.8e-05,-0.000283,-0.000277,5.3e-05,0,-0.000229,-0.000238,-0.000335,-0.000427,-0.000497,0.000228,2e-06,-0.000641,-0.000399,0.000102,-0.000258,-0.000157,1e-06,7.8e-05,0.000151,-0.000242,-0.000346,-3.2e-05,0.000241,2.1e-05,-0.000281,0.000164,-0.000665,-0.00077,-7.4e-05,0.000537,-0.000779,-0.000182,-0.000564,-0.000286,-0.000128,-0.000204,-0.000226,-0.000567,0.000242,-0.00047,0.000267,-0.000548,-0.000455,7.4e-05,8.8e-05,8e-06,0.000297,-0.000336,-2.7e-05,-0.000252,-0.00103,0.000222,-0.000565,-0.000142,-0.000433,-0.000433,-0.000101,0.00048,0.000618,-0.000599,-0.001015,-0.000245,0.000219,0.000498,-6.4e-05,0.000305,0.000446,0.00059,0.000485,0.000183,1.2e-05,-0.000799,-0.000907,-4.1e-05,-0.001041,-8.2e-05,-0.000311,-0.000145,-0.000201,-0.000279,-0.00021,0.000297,-0.00013,-0.001195,-0.001815,1.7e-05,9.7e-05,-0.000546,-0.001173,-0.000228,-0.00031,-0.000655,0.000147,-0.000213,-2e-05
-0.000127,4.3e-05,-3.5e-05,-0.000255,8.7e-05,0.000117,-3.9e-05,-0.000302,-0.000162,4.7e-05,0.000143,2e-06,-0.000382,-4.7e-05,-0.000166,-0.000106,-3.7e-05,0.000159,0.000142,-0.00017,0.000178,0.000447,0.000351,1.8e-05,-2e-04,5.5e-05,3.1e-05,-0.000251,-5.8e-05,0.00017,-0.00023,-0.000321,0.000292,-0.000162,-0.000538,-4e-06,-0.000183,-0.000346,-0.000135,0.000191,0.000229,-0.000391,-0.000196,0.000252,-8e-06,-0.000296,-0.000315,-0.000185,-8.8e-05,9.4e-05,4.8e-05,0.000507,-2.1e-05,-0.000883,0.000198,0.000153,0.000267,0.000262,-0.000182,-8.7e-05,-0.000123,-0.000221,-0.000242,-0.000345,-0.000439,-0.000225,0.000222,-0.000507,-0.000186,-2.6e-05,-0.00022,-6.2e-05,0.000427,-4e-05,-0.000244,-0.00044,-0.001061,-0.000334,2.3e-05,-0.000146,-0.000112,0.000166,-0.00028,0.000118,0.000336,-2.7e-05,-0.000974,-0.001212,0.000449,0.000266,1.1e-05,0.000203,7.4e-05,-0.000888,0.000314,-6.2e-05,-0.000864,-0.000539,-1.6e-05,5.9e-05,0.000519,0.000175,0.000266,0.000168,-3.8e-05,-0.000679,0.000106,3.4e-05,3.8e-05,-0.001017,-0.000605,1.6e-05,-6e-05,-0.000266,-0.000935,-0.000686,0.000341,0.000601,-0.000789,-0.000664,7e-05
-0.000225,3.9e-05,-6.5e-05,-0.000213,-6.6e-05,0.000131,-0.000165,-0.000188,-0.000229,-1.5e-05,9.2e-05,0.000137,3.8e-05,2.3e-05,-0.000115,-0.000104,-0.000133,-6.1e-05,-6.9e-05,-3e-05,-0.000284,3e-05,0.000185,6.2e-05,-6.8e-05,0.000166,1.8e-05,-0.000164,-0.000195,-2.6e-05,-0.000287,-0.000475,0.000293,5.4e-05,-0.000277,-0.000146,6.5e-05,-0.000142,-3.6e-05,-0.000105,0.00011,-0.000273,-0.000433,5.7e-05,-0.000143,9.5e-05,-0.000121,3.6e-05,-7.7e-05,1.1e-05,0.000267,-0.000307,-0.000301,-0.000389,-0.000317,-0.000134,0.000105,-0.000577,-0.000151,-0.000988,-0.000467,-0.000102,-0.000208,-0.000189,-0.000269,3e-04,-0.000256,-3.2e-05,-0.000713,2.4e-05,-0.000116,-0.000153,-0.000283,-0.000347,-0.000314,-0.000266,-0.000125,-0.000682,-0.00039,-6.7e-05,8.8e-05,0.000103,0.000293,-0.000156,-0.000389,0.000126,0.000167,0.000133,-7.7e-05,-0.000235,7.4e-05,0.000293,-0.000787,-7.6e-05,-0.000608,-0.000457,-0.000114,-0.000189,0.000173,0.00015,0.000163,0.000185,-9.9e-05,5e-05,-0.000261,-0.000194,9.3e-05,0.000265,-1.2e-05,0.000737,0.000549,-0.000437,-4e-06,-0.000631,-0.000553,-0.000488,-1.5e-05,-0.000492,-0.000255,-0.000362,-0.000475
-0.000116,-0.000126,8.2e-05,-0.000143,-4.7e-05,-1.7e-05,-0.00014,-0.000143,-1.4e-05,-2.6e-05,-3.5e-05,-9e-06,0.000165,0.000161,-0.000112,-0.000215,-0.000189,-0.000127,-5.2e-05,-2.1e-05,-0.000247,-8.9e-05,-0.000154,-3.9e-05,-2.4e-05,2.2e-05,-6.3e-05,-2.9e-05,-0.000191,-0.000156,-2e-05,-0.000392,5.7e-05,0.000155,-5.9e-05,-0.000212,-3e-04,-8.5e-05,0.000206,0.000146,-8.4e-05,-0.000191,-0.000608,-0.000266,0.000102,-0.000152,0.000113,-1e-06,8.9e-05,-0.000137,0.000161,-0.000262,-0.000439,-0.000104,-0.000425,-0.000353,4.5e-05,-0.000346,-0.000538,-0.000473,-0.000411,-0.000231,-0.000165,0.00026,-0.000139,6e-06,-0.00016,-3e-05,0.000533,0.000468,-0.000115,-3.6e-05,-0.000348,3.3e-05,0.000112,0.000422,0.000466,-0.000213,4.7e-05,0.000695,0.000243,-0.000458,-0.000255,-0.00053,-0.000268,0.000268,-0.000261,-0.000504,-0.000231,1e-05,-4.8e-05,7e-06,0.000106,0.00062,-0.000515,-0.00035,-0.000516,-0.000544,7e-05,0.000314,0.000242,-0.000606,-0.000117,0.000217,-2.7e-05,0.000301,1.2e-05,-0.000719,-0.000191,0.000718,0.00072,-0.00058,7e-06,-0.000363,-0.000558,-0.000216,-8e-06,-0.000174,0.000217,-0.000143,-0.000291
-8.9e-05,-5e-06,0.000108,-1.2e-05,-0.000169,-6.2e-05,0.000142,-0.000151,2.8e-05,-6e-05,-3.7e-05,-9e-05,-3e-06,0.000119,0.000128,1.4e-05,-4.8e-05,-0.000135,0.00016,1e-06,8.5e-05,0.000129,-0.000114,1.1e-05,-4.8e-05,-3.6e-05,-5e-05,-0.000135,2.4e-05,-9.6e-05,-7.2e-05,-0.000108,-6e-06,-4e-05,-1.8e-05,-4.2e-05,-0.000244,3e-05,0.000143,7e-05,4.8e-05,0.000132,-0.000234,-1.6e-05,0.000255,0.000151,-6.2e-05,-0.000391,-5.3e-05,-0.000295,2e-06,-0.000354,-0.000587,-1e-05,-0.000626,-0.000436,-0.000284,-8.5e-05,-0.000321,6.5e-05,-0.000105,0.000224,-7.9e-05,0.000103,-1.4e-05,-0.000121,-0.000289,-0.00014,5e-05,5e-05,-0.000291,-0.000157,-0.000315,-0.000151,1e-04,-2e-06,-0.000132,-0.00024,0.000154,0.000256,0.000246,-0.000266,4.3e-05,0.000189,0.000268,-0.000364,0.000246,-0.000149,0.000353,0.000299,-2.4e-05,-0.000316,0.000175,0.000409,0.000388,1.9e-05,-0.00024,-0.000407,0.000171,0.000274,6.5e-05,-1.7e-05,-9.7e-05,-0.000182,-0.000207,-0.000205,0.000215,0.000323,-0.000258,-9.3e-05,0.00055,-0.000373,-0.000402,-0.000428,-0.000329,0.000444,0.000494,0.000351,-0.000209,0.000141,0.000537
-9e-06,0.000102,-1.5e-05,0,-9.7e-05,-9.4e-05,0.000114,-1.9e-05,4.4e-05,-8.3e-05,3.5e-05,-2.4e-05,5e-05,9.8e-05,0.000141,4e-06,-1.9e-05,-1e-06,6e-05,8.9e-05,7.9e-05,9.6e-05,-3e-06,-0.000144,2.6e-05,-5.9e-05,-5e-05,9.2e-05,4.6e-05,-0.000106,-1.2e-05,0.000259,-9.2e-05,-6.2e-05,7.9e-05,-3.7e-05,-0.00015,-5.7e-05,8e-06,-0.000203,-5.2e-05,0.000167,-5e-05,0.00012,0.000163,-0.000176,-4.9e-05,-0.000269,2.8e-05,-5.8e-05,-6.2e-05,0.00019,-8.8e-05,-7.4e-05,-0.000182,-0.000377,-0.000308,-0.000219,-0.000499,-8.6e-05,0.000558,0.000259,0.000112,-6.8e-05,-0.000172,-0.000133,-0.00027,-0.000275,-0.000115,0.000169,0.000124,-1e-04,5.6e-05,-0.000254,-7.3e-05,0.000179,0.000174,-0.00028,-0.000173,0.00013,-0.000134,-6.5e-05,6.5e-05,-8.4e-05,0.000229,-3e-06,0.000132,-0.00012,0.000135,9.8e-05,0.000497,-2.8e-05,9.8e-05,-0.000287,1.6e-05,0.000229,0.000122,6.6e-05,0.000316,-0.000282,-0.000295,-8.8e-05,0.000226,-0.000141,0.000209,-5.6e-05,-0.000126,0.000251,0.000119,-0.000165,-0.000432,-0.000658,-0.000279,-1.1e-05,0.000228,-0.000222,-1e-06,-0.000169,5.8e-05,-0.000165,0.00047
-7e-06,6.7e-05,3.6e-05,-4.3e-05,-4.3e-05,-5.5e-05,-1.2e-05,-2.2e-05,-1.4e-05,-0.000117,1.6e-05,-1.8e-05,-3e-05,-1.5e-05,0.000108,-5.9e-05,9e-06,1.1e-05,4.8e-05,-0.000106,0,1.6e-05,-0.000112,-0.000106,6e-06,3.6e-05,-4.8e-05,-5e-06,1.7e-05,-1.1e-05,2.9e-05,0.000161,1.7e-05,-0.000124,3.3e-05,-9.1e-05,-4.3e-05,-4.7e-05,-8.5e-05,-0.000138,-6.6e-05,0.00011,-9e-05,-3.9e-05,-4.7e-05,9e-05,2.5e-05,3.7e-05,6.2e-05,0.000187,7.4e-05,0.000109,6.6e-05,-0.000145,-5.8e-05,-7e-05,-6.5e-05,-7.6e-05,-0.000197,-9.5e-05,0.000287,0.000182,0.000194,-3.5e-05,0.000123,0.000141,-0.000157,-9.7e-05,0.000275,-1.8e-05,0.000139,-7.1e-05,-0.000169,-0.000291,-7e-06,3.9e-05,-0.000253,4.9e-05,-5e-06,-6e-06,-6e-06,2.7e-05,2e-05,-9.4e-05,-9.2e-05,-0.000238,-8.1e-05,0.000323,-0.000221,4.9e-05,0.000103,-9.3e-05,0.000119,-0.000275,-0.000232,0.000286,3e-06,0.000235,-2.5e-05,-5.2e-05,-5.3e-05,0.000271,0.000111,-5.5e-05,-4.4e-05,0.000167,-2.3e-05,0.000157,-3.9e-05,-8.6e-05,0.000264,3.8e-05,-4.4e-05,-8.7e-05,-5.5e-05,0.000249,-5.7e-05,0.000152,0.000105,5.7e-05,-5.8e-05
-5.6e-05,9e-06,-6e-06,-1.2e-05,-1.2e-05,-5.2e-05,-7.3e-05,-2.5e-05,-2.1e-05,-6.5e-05,8e-06,1e-06,-2.3e-05,4.2e-05,-2.8e-05,2.3e-05,-3.9e-05,2.7e-05,1.6e-05,-3.3e-05,-5.8e-05,8e-06,8.4e-05,5.4e-05,-1.2e-05,-0.000139,-5.6e-05,-4.1e-05,2.6e-05,-1.8e-05,-1.8e-05,-2.3e-05,-4.7e-05,-0.000187,1.5e-05,-3.5e-05,4.2e-05,-3.4e-05,6.1e-05,-0.000129,9e-06,-0.000156,0,-1e-06,-0.000246,7.4e-05,-7.2e-05,0.000209,9.6e-05,5.1e-05,5.6e-05,7.5e-05,0.000236,-5.1e-05,-7.7e-05,-0.000125,-6.8e-05,5e-05,0.000292,0.000147,0.000207,-4.3e-05,9.3e-05,-2.2e-05,0.000205,3e-05,0.000128,-5e-06,-0.000159,-0.000104,0.00011,-6.8e-05,-3e-05,-0.000163,1.2e-05,-0.000115,0.000185,0.000352,0.000274,-0.000203,1.8e-05,0.00018,9.2e-05,0.000238,-4.7e-05,0.000235,-2.9e-05,0.000193,-1e-06,-3.7e-05,-1e-06,-2.2e-05,8.2e-05,-0.000283,0.000162,-0.000156,0.000154,0.000136,-1e-05,-5.8e-05,-1.7e-05,-1.3e-05,0,-7.8e-05,6e-06,-4.4e-05,5.8e-05,-0.000171,0.000188,0.000168,-4.2e-05,0.000537,-9e-05,1e-04,-2.3e-05,-4.9e-05,-0.00021,0.000134,-0.000282,0.000136,-0.000109
-7e-06,1e-05,-5e-06,2.4e-05,7e-06,-4.5e-05,-8.3e-05,1.1e-05,-9e-06,-3.9e-05,-1.4e-05,1.5e-05,-6e-06,2.9e-05,-3.4e-05,2.7e-05,-1.8e-05,6e-06,2.8e-05,3.3e-05,6.1e-05,-1.8e-05,3e-06,0.000105,-2.3e-05,-6.9e-05,-9e-06,1.2e-05,4.3e-05,-4.2e-05,-2.5e-05,-3e-05,-0.000133,-7.9e-05,-0.000168,3e-05,5.3e-05,7.3e-05,-4.6e-05,-3e-06,1.3e-05,-2.7e-05,6.4e-05,-2.8e-05,-0.000204,2.3e-05,6.6e-05,0.000121,1.1e-05,-0.000112,6e-06,0.000114,8.6e-05,7.1e-05,0.000272,-6.1e-05,2.4e-05,7.1e-05,5.4e-05,-3.7e-05,8e-05,1.2e-05,-6.9e-05,6.7e-05,0.000156,3.8e-05,0.000102,-1e-05,-3.9e-05,8.2e-05,-9.7e-05,-9.9e-05,4.5e-05,0.00019,5.7e-05,0.000146,-3.9e-05,0.000112,0.00024,-1.2e-05,-9.8e-05,0.000191,0.000128,4.4e-05,-0.000142,0.000126,-0.000195,3.5e-05,0.000121,-4.1e-05,-0.000117,2.6e-05,-0.000168,6.3e-05,0.000236,-4.9e-05,-2.3e-05,5e-06,4.2e-05,-0.000211,3.5e-05,4e-06,0.000179,-9e-06,-0.000189,2.4e-05,-8.9e-05,-0.000132,-0.000161,0.000244,-9.9e-05,0.00034,0.000102,-0.000169,-0.00013,-0.00013,-0.000314,9.4e-05,0.000164,-0.000128,0.000207
-1.4e-05,1.5e-05,2e-06,2e-06,7e-06,-4.3e-05,-5.8e-05,-4e-06,-1.9e-05,5e-06,-2.5e-05,-6e-06,5.5e-05,-2.3e-05,-4.7e-05,1.1e-05,6e-06,-1.7e-05,-2.3e-05,-3.1e-05,6e-06,-2.7e-05,3.4e-05,4.6e-05,-3.9e-05,1.9e-05,1.4e-05,-3e-05,-8e-05,-1.4e-05,4.6e-05,-5.4e-05,-0.000127,1.5e-05,1.9e-05,1.1e-05,4.9e-05,5.1e-05,-1e-05,0.000107,1.7e-05,-4.4e-05,0.000111,-1.5e-05,-1.9e-05,-9e-05,-6.5e-05,3.8e-05,2e-06,-1.4e-05,8e-06,2.2e-05,-4.5e-05,7.3e-05,8e-05,-7.5e-05,-3e-06,-8.8e-05,5.7e-05,-8.1e-05,-2.2e-05,5.7e-05,-0.00011,5.4e-05,-8e-06,-4.3e-05,1.7e-05,4.7e-05,-6.5e-05,-0.000154,-9.9e-05,8.9e-05,9e-06,0.000158,8.9e-05,-2.7e-05,2e-06,4.2e-05,1.5e-05,0.000212,1e-06,7.3e-05,5.8e-05,-1.7e-05,-0.000125,-0.000216,9.6e-05,8.1e-05,-0.000168,-4.6e-05,-0.000104,-4.6e-05,-6e-06,0.000166,-9.4e-05,4.8e-05,-1.5e-05,2.5e-05,-1e-06,-7e-05,-5.9e-05,-2.8e-05,-0.00016,1.3e-05,1.1e-05,4e-05,3.8e-05,-0.000155,-2.8e-05,1.8e-05,0.000115,3.6e-05,0.000173,3e-05,0.000153,2.8e-05,3.3e-05,-0.000349,3.7e-05,8.9e-05,-0.00012
-1.4e-05,1.4e-05,1.4e-05,-6e-05,5.6e-05,-1.7e-05,-2e-05,-8.6e-05,2.9e-05,2.5e-05,-9e-06,-7e-06,-4e-06,1.4e-05,-1.1e-05,2.4e-05,-3e-06,5e-06,0,-3e-06,-3.3e-05,-3.4e-05,2.1e-05,1.3e-05,1.7e-05,-2.7e-05,-9e-06,7e-06,-1.2e-05,3.8e-05,1e-05,-3.9e-05,-9.4e-05,-1.9e-05,-3.5e-05,3e-06,2.7e-05,-1.1e-05,-1.1e-05,6.5e-05,1e-05,2.6e-05,-4e-06,-3.8e-05,-3.8e-05,-8.6e-05,1.3e-05,1.8e-05,7e-06,5.9e-05,-0.000106,-7.9e-05,-5.7e-05,9e-06,9.2e-05,4.9e-05,4e-06,-6.8e-05,9e-05,-1e-06,2.3e-05,-1e-06,-1.4e-05,-2.7e-05,-4.3e-05,1.9e-05,4.5e-05,-3.1e-05,7.9e-05,-2e-05,-8e-05,5.5e-05,-2.5e-05,-1.5e-05,7.5e-05,-5.2e-05,-1.7e-05,-7.1e-05,-7.2e-05,-0.000152,-2.1e-05,-2.3e-05,-4e-05,1e-06,-2.6e-05,-8.3e-05,8.1e-05,-8e-05,-0.000107,-1.7e-05,9e-06,7.4e-05,2.5e-05,7.7e-05,-0.000109,-2.3e-05,-4e-06,5e-06,-4.1e-05,5.3e-05,2.1e-05,1.9e-05,-6.8e-05,-4.8e-05,-8e-06,6e-06,-2e-06,-0.000187,-8.7e-05,-0.000231,-5.5e-05,-0.000103,7e-06,-1.1e-05,7e-05,3.1e-05,-0.000199,-6.6e-05,-0.000125,1.8e-05,-1.9e-05
-6e-06,8e-06,-1.4e-05,-1.5e-05,2e-05,1e-06,2.8e-05,-2.2e-05,0,2e-05,-3.3e-05,-4e-06,3e-06,-6e-06,7e-06,4e-06,-1.4e-05,-1.2e-05,-7e-06,-4e-06,1.4e-05,-4e-06,2.3e-05,-5.7e-05,3.6e-05,3.1e-05,-2e-06,1e-06,-2e-06,3.5e-05,-3e-06,9e-06,3.5e-05,-1.2e-05,2.2e-05,2.2e-05,1.8e-05,-9e-06,-1.8e-05,3.4e-05,3e-06,2.6e-05,-4.4e-05,-1.7e-05,-6.9e-05,-4.3e-05,-9e-06,5e-06,2e-06,-1.6e-05,-2e-05,-4.8e-05,-1.8e-05,-6.2e-05,-0.000117,-5e-06,1.2e-05,6e-06,-7.6e-05,5e-05,-4e-06,-2.6e-05,-9e-06,-3.3e-05,-6e-06,2.2e-05,3.1e-05,-3e-05,-9e-06,1.2e-05,9e-06,5.2e-05,-3.2e-05,-4.5e-05,3.3e-05,4.1e-05,-7e-05,-1e-04,0.000148,-0.000109,-3.2e-05,-0.000131,-3.1e-05,7e-06,6.5e-05,5.4e-05,2.9e-05,-4.9e-05,3.4e-05,-3.5e-05,7e-05,6e-05,3.8e-05,-4.3e-05,-2.6e-05,-2.5e-05,-5e-06,-1.9e-05,-5.4e-05,-2.6e-05,2.2e-05,-3.3e-05,2.8e-05,3e-05,4.8e-05,-8.7e-05,-3.5e-05,-5.5e-05,5.2e-05,6.5e-05,-7e-06,-2.8e-05,-5e-05,-6.1e-05,-6e-06,9e-06,-2.7e-05,2e-06,6.3e-05,-8.7e-05,1.1e-05
-4e-06,2e-06,-1.2e-05,-1.4e-05,-1.3e-05,1.6e-05,2.5e-05,2.1e-05,-7e-06,1.4e-05,-1.6e-05,4e-06,3e-06,-9e-06,2.4e-05,-2.2e-05,-7e-06,-1.2e-05,-3e-06,-2.3e-05,-1.1e-05,-1.6e-05,3e-06,1e-06,1.1e-05,1.2e-05,1.6e-05,1.3e-05,1.5e-05,1e-06,1.3e-05,4.1e-05,3.8e-05,-1e-05,2.3e-05,1.8e-05,1.1e-05,-1.1e-05,-1.4e-05,5e-05,3e-06,3e-05,-3.1e-05,2e-06,1e-06,4.5e-05,-1.4e-05,-2.4e-05,-3e-06,-4.9e-05,4.4e-05,-4e-06,-2e-05,-5.4e-05,-8.3e-05,1.5e-05,1.7e-05,7e-06,1.8e-05,5e-06,6.1e-05,-2e-05,8e-06,-2.1e-05,-2.9e-05,9e-06,-3e-05,6e-06,-2.4e-05,-6.7e-05,-2e-05,-2.1e-05,-8e-06,-6.4e-05,1.5e-05,-1.4e-05,2e-05,-7.3e-05,-2e-06,6e-06,-1.1e-05,-5.3e-05,-7e-06,-1.5e-05,3.4e-05,8.1e-05,-2.8e-05,6.4e-05,1.3e-05,-1.7e-05,2.1e-05,2.5e-05,3.1e-05,-2e-05,-3.2e-05,2.2e-05,-1e-06,-3.7e-05,-2.9e-05,-4.4e-05,-9e-06,-4.6e-05,3.9e-05,3.9e-05,-8e-06,6.4e-05,3.6e-05,2.8e-05,-2.3e-05,7.2e-05,-1.5e-05,-0.000183,2e-06,5.9e-05,-1.9e-05,-2.1e-05,-6.4e-05,-2.1e-05,2.3e-05,6.8e-05,2.5e-05
-6e-06,1.1e-05,8e-06,-2e-06,-2.3e-05,1.7e-05,-7e-06,4e-06,-1.5e-05,2e-06,-8e-06,4e-06,-6e-06,-1.4e-05,6e-06,-1e-06,0,-1e-05,-2.4e-05,4e-06,1.6e-05,-2.2e-05,-1e-05,6e-06,-1.1e-05,1.8e-05,5e-06,-1.4e-05,4e-06,2e-06,-2e-06,4.3e-05,-2e-06,2e-06,4e-06,-3e-05,-2.4e-05,1.5e-05,-2e-06,3.7e-05,2e-06,-2.1e-05,-2.9e-05,-7e-06,-5e-06,1.1e-05,-3e-06,-1.6e-05,0,-7e-06,-3.7e-05,-6e-06,-4.5e-05,1.8e-05,-5.3e-05,1.3e-05,1.1e-05,-3.4e-05,-4.2e-05,-3.6e-05,9.2e-05,-2.5e-05,-3e-06,1.7e-05,3.7e-05,-1.8e-05,-3.7e-05,8e-06,4e-05,-1e-05,1.2e-05,-1.5e-05,-2e-06,-1.3e-05,2.6e-05,-2.3e-05,1.1e-05,2.4e-05,9e-06,-1.4e-05,1e-06,1.2e-05,2.3e-05,-2.9e-05,4.1e-05,7e-06,-6.6e-05,-2.4e-05,-7.3e-05,-1.1e-05,2.8e-05,1e-05,1.7e-05,-3.3e-05,-3.8e-05,1.8e-05,2.7e-05,1e-06,-3.3e-05,5.8e-05,1.2e-05,-6e-06,-3.3e-05,-1.1e-05,1e-05,6e-06,-3.5e-05,0.000114,3.2e-05,4e-05,-1.5e-05,-0.000133,-2e-06,-2.7e-05,-2.3e-05,1.8e-05,2.9e-05,0.000103,-0.000104,-8e-06,-1.8e-05
-2e-06,1e-06,-1e-06,1.3e-05,-8e-06,1.4e-05,-2.3e-05,-1.9e-05,1e-06,-8e-06,-1e-06,-5e-06,1.4e-05,-8e-06,-1.4e-05,-6e-06,-4e-06,1e-06,-3e-06,-2e-06,-1.3e-05,-6e-06,-1.5e-05,5e-06,-1.7e-05,2.2e-05,-6e-06,1.1e-05,9e-06,2e-06,-1e-06,2e-06,1.3e-05,2e-05,-2.3e-05,-1.1e-05,-1.7e-05,1.8e-05,-1e-06,-1e-05,-3e-06,-2e-05,4e-06,-1e-06,-4e-05,1.4e-05,-5e-06,-3.1e-05,-4e-06,2.4e-05,-2.5e-05,2.5e-05,4e-06,3e-05,-2.3e-05,-2.1e-05,-1.1e-05,6e-06,-1.1e-05,3.1e-05,2.9e-05,-8e-06,-3e-06,2.7e-05,1.7e-05,-4e-06,-6e-06,-1.5e-05,-8.5e-05,1.9e-05,9e-06,-1.1e-05,-2.7e-05,-2e-06,1.1e-05,1.5e-05,-4e-06,1.8e-05,1.3e-05,-4.5e-05,-4e-06,0,-8e-06,6e-06,4e-06,-4.4e-05,-8e-06,5.9e-05,-3e-05,-1.5e-05,1e-05,0,1.3e-05,3.8e-05,3.7e-05,-9e-06,-8e-06,6.1e-05,-3.7e-05,1.2e-05,-7e-06,3.8e-05,2.5e-05,2.3e-05,-1.5e-05,-1.3e-05,6e-06,2.3e-05,-1.8e-05,-1e-05,1e-05,1e-05,-2.6e-05,1e-05,2.4e-05,1.1e-05,4e-06,-4e-05,4.2e-05,-9e-06,-5.4e-05
-5e-06,2e-06,-6e-06,-7e-06,6e-06,1e-05,-1.5e-05,-1.8e-05,0,-1.2e-05,7e-06,-1e-06,7e-06,-1.5e-05,-2e-05,3e-06,-9e-06,2e-06,-1e-05,-3e-06,8e-06,-6e-06,4e-06,-2e-05,-3e-06,2e-06,-5e-06,-1.3e-05,7e-06,-2e-06,5e-06,-2.4e-05,2.2e-05,5e-06,-3e-06,1.1e-05,1.9e-05,-6e-06,-3e-06,1e-06,-1e-06,-7e-06,1e-06,-2e-06,1.6e-05,-1.5e-05,-4e-06,2.1e-05,-4e-06,1.4e-05,6e-06,-3e-06,3.7e-05,1.3e-05,-1.6e-05,-4.7e-05,-4e-06,2e-05,1.8e-05,-8e-06,1e-06,-4.6e-05,-7e-06,6e-06,2.5e-05,1.2e-05,-1.4e-05,-2.6e-05,3e-05,-2e-05,1.8e-05,-1.3e-05,-1.2e-05,-9e-06,2.1e-05,-2e-06,-1.5e-05,4.5e-05,4e-05,3.8e-05,-6e-06,8e-06,-2e-06,2.4e-05,6e-06,-3.3e-05,4.4e-05,1.4e-05,5.2e-05,-1e-06,-3.3e-05,1e-05,-3.6e-05,4e-05,7.8e-05,-1.1e-05,4e-06,5.4e-05,-2.9e-05,-1.8e-05,-4e-06,2.4e-05,-2e-06,-1.5e-05,9e-06,1.4e-05,1.1e-05,-1e-06,2.5e-05,-9.3e-05,-2.2e-05,6.3e-05,-5e-06,-1.8e-05,1.8e-05,-4.7e-05,8e-06,3.4e-05,3.3e-05,3.3e-05,-1e-05
-9e-06,-1e-06,4e-06,-1.4e-05,-9e-06,0,0,-4e-06,3e-06,-1.6e-05,6e-06,3e-06,-3e-06,-1e-05,-9e-06,7e-06,-1e-06,2e-06,-7e-06,9e-06,3e-06,-5e-06,-1.3e-05,-6e-06,6e-06,-1e-05,3e-06,-2e-06,-1.3e-05,-3e-06,5e-06,-2e-05,3.2e-05,-1.3e-05,-7e-06,-3e-06,8e-06,-1e-06,-1.9e-05,1e-06,-3e-06,-1e-06,1.5e-05,2e-06,6.8e-05,0,-8e-06,3.9e-05,0,-1.4e-05,-2.3e-05,3e-05,1.7e-05,-2.6e-05,3.7e-05,-3.5e-05,-6e-06,-1e-05,-1.8e-05,-2.8e-05,-1.1e-05,-4e-06,-1.9e-05,-1.5e-05,-3e-06,1e-05,-3e-06,-1.3e-05,4e-06,7e-06,-2.7e-05,1e-06,2.4e-05,-3.4e-05,1.9e-05,-2.2e-05,2e-06,4.1e-05,6e-06,-1.5e-05,2e-06,3.2e-05,6e-06,-7e-06,-2.7e-05,4.3e-05,1.4e-05,-1.3e-05,-2.4e-05,5e-06,1.3e-05,-1e-05,5e-06,-4e-06,4e-06,8e-06,1.8e-05,-6e-06,-9e-06,3.2e-05,-6e-06,-2.6e-05,-6e-06,-5e-06,-3.1e-05,2e-06,-2.3e-05,-2.2e-05,-9e-06,1.6e-05,3.5e-05,6.2e-05,-9e-06,2e-06,1.5e-05,3.4e-05,2.8e-05,-2.5e-05,-5.8e-05,-2.9e-05,-3e-06
-1e-06,2e-06,0,-8e-06,1e-06,-5e-06,9e-06,6e-06,2e-06,-1.3e-05,8e-06,-1e-06,1e-06,-1e-05,1e-06,-1e-06,-2e-06,3e-06,-6e-06,-7e-06,-8e-06,-8e-06,-5e-06,3e-06,8e-06,-5e-06,2e-06,1e-05,-1.4e-05,-2e-06,-6e-06,-1e-06,5e-06,-7e-06,6e-06,-6e-06,-8e-06,3e-06,1.6e-05,-2.8e-05,-1e-06,1.2e-05,6e-06,-2e-06,3.2e-05,7e-06,2e-06,4.1e-05,-5e-06,-2e-05,-6e-06,-8e-06,-1.8e-05,-2.5e-05,6.1e-05,-3.7e-05,6e-06,-2.4e-05,3.9e-05,8e-06,-1e-05,1.4e-05,-7e-06,-2e-05,2.1e-05,-3e-06,2e-05,0,-7e-06,2.6e-05,-2.5e-05,-4e-06,-1.2e-05,-2.2e-05,9e-06,1.9e-05,-3.6e-05,4e-06,0,-4e-05,-4e-06,4.3e-05,2e-06,1e-05,3e-06,2.3e-05,1.1e-05,1.1e-05,-3e-05,1e-06,-4e-06,-9e-06,-6e-06,-2.7e-05,-3.7e-05,-6e-06,-2.5e-05,-2.2e-05,-2.7e-05,1.1e-05,-5e-06,-2e-06,-3e-06,-5e-06,2e-05,-1.2e-05,2.1e-05,7e-06,9e-06,6.6e-05,-4.5e-05,5.5e-05,1e-06,-1.7e-05,6e-06,-1e-06,5.3e-05,-1e-05,3.8e-05,2.6e-05,-4e-05
-5e-06,-1e-06,-4e-06,-1e-05,2e-06,-1.2e-05,1.5e-05,-9e-06,-3e-06,-8e-06,7e-06,0,8e-06,-8e-06,8e-06,3e-06,-3e-06,0,8e-06,-1e-06,6e-06,5e-06,9e-06,2.4e-05,1e-06,-3e-06,-3e-06,-1.1e-05,2e-06,2e-06,3e-06,7e-06,-1.3e-05,-5e-06,4e-06,7e-06,9e-06,2e-06,-7e-06,-1.3e-05,1e-06,1.4e-05,2e-06,-1e-06,3e-06,-1e-05,-9e-06,1.8e-05,-3e-06,1e-05,5e-06,-1.5e-05,-1.9e-05,-9e-06,1.8e-05,-2e-05,-7e-06,9e-06,0,1.7e-05,-2.8e-05,-2.6e-05,-4e-06,4e-06,-1.2e-05,-2e-06,1.9e-05,3e-06,-3e-06,-7e-06,-2.3e-05,1e-06,-5e-06,0,6e-06,-7e-06,3.8e-05,-1.8e-05,3.4e-05,4.2e-05,3e-06,6e-06,-4e-06,6e-06,1.2e-05,-6e-06,-2.4e-05,-1e-06,1.5e-05,3e-06,1.5e-05,3e-06,3e-06,-1.7e-05,2e-06,4e-06,8e-06,-1.5e-05,-1.6e-05,-2.3e-05,-4e-06,-2e-06,-2.8e-05,-7e-06,-4e-06,1.5e-05,-1.3e-05,-1e-05,-1.2e-05,-8e-06,1.8e-05,1.2e-05,2.7e-05,1.7e-05,1e-06,-1.6e-05,-1.5e-05,-1e-06,6e-06,-2.3e-05,-9e-06
-4e-06,-1e-06,1e-06,6e-06,1e-05,-1.1e-05,4e-06,-1.2e-05,-2e-06,-5e-06,2e-06,0,-4e-06,-3e-06,7e-06,0,-4e-06,-2e-06,-1e-06,1e-06,-7e-06,4e-06,-3e-06,4e-06,-3e-06,-1.3e-05,-3e-06,8e-06,7e-06,0,5e-06,1.1e-05,-5e-06,-6e-06,2e-06,8e-06,6e-06,5e-06,0,9e-06,0,-7e-06,-6e-06,0,4e-06,6e-06,1e-06,1e-06,-3e-06,2e-05,-1.8e-05,-9e-06,5e-06,2.9e-05,-1.3e-05,-3e-06,4e-06,5e-06,-9e-06,-2e-05,1e-05,-1.2e-05,1e-06,1.7e-05,-6e-06,-8e-06,0,-6e-06,-4e-06,1.4e-05,1.9e-05,4e-06,8e-06,2.8e-05,5e-06,-1e-05,-2e-05,-3.1e-05,-1.2e-05,-5e-06,1e-06,-3.7e-05,-7e-06,-5e-06,2e-06,-3.1e-05,-2.3e-05,-1.5e-05,1.8e-05,5e-06,1.3e-05,0,1e-05,2e-06,-2e-06,-1e-06,1e-06,1.4e-05,-7e-06,5e-06,-5e-06,1.5e-05,2.2e-05,-6e-06,1.6e-05,0,-2e-06,4e-05,4e-06,-1.9e-05,0,-5e-05,-1e-06,-1.6e-05,-1e-05,2.1e-05,3.2e-05,-9e-06,-4.6e-05,1.2e-05,9e-06
0,-2e-06,3e-06,1e-06,2e-06,-1.2e-05,-7e-06,2e-06,-5e-06,5e-06,1e-06,-1e-06,9e-06,-8e-06,0,-5e-06,-3e-06,-4e-06,1e-06,-2e-06,7e-06,-3e-06,1.1e-05,-5e-06,-2e-06,-1.2e-05,2e-06,-5e-06,1e-06,1e-06,-5e-06,1.3e-05,-4e-06,-1e-06,-5e-06,-6e-06,-2e-06,2e-06,-1e-06,3e-06,0,-6e-06,-6e-06,0,-1e-05,-1e-06,-5e-06,-1.4e-05,-1e-06,-1.2e-05,1e-06,6e-06,5e-06,7e-06,-2.6e-05,6e-06,-4e-06,-1.7e-05,2.3e-05,-3e-06,-4e-06,-2e-06,2e-06,8e-06,-7e-06,7e-06,2e-06,-1.4e-05,4e-06,1.2e-05,9e-06,1e-06,-5e-06,2.3e-05,5e-06,1.4e-05,3e-06,-2.1e-05,-1.6e-05,-1.3e-05,-4e-06,-3.4e-05,-4e-06,-8e-06,-3e-06,-8e-06,9e-06,1.8e-05,-2.4e-05,1e-05,-1e-05,-2e-06,-2e-06,1.1e-05,-3.6e-05,-2e-06,-2e-06,6e-06,3e-06,7e-06,0,-2.2e-05,-5e-06,-7e-06,-1.6e-05,-9e-06,1.4e-05,9e-06,-2e-06,-2.2e-05,-1.5e-05,-6.7e-05,-8e-06,1.8e-05,-4e-06,-1.4e-05,-3.7e-05,2.5e-05,3.3e-05,8e-06,-1.9e-05
-3e-06,-1e-06,-2e-06,-5e-06,-4e-06,-7e-06,-1.3e-05,1e-06,4e-06,5e-06,0,1e-06,2e-06,3e-06,-7e-06,2e-06,0,-2e-06,2e-06,1e-06,-4e-06,2e-06,-6e-06,-1.4e-05,-3e-06,5e-06,1e-06,1e-06,4e-06,1e-06,3e-06,1e-06,-6e-06,-3e-06,-5e-06,-3e-06,2e-06,-2e-06,2e-06,8e-06,-1e-06,-8e-06,-1e-06,-1e-06,-1.9e-05,-1e-06,-2e-06,-8e-06,-1e-06,-1.7e-05,6e-06,-1e-06,-9e-06,-6e-06,-1.9e-05,6e-06,4e-06,-2e-06,-2.5e-05,1.2e-05,3e-06,8e-06,-2e-06,-6e-06,5e-06,5e-06,3e-06,-8e-06,-2.8e-05,-5e-06,1.2e-05,1e-06,-1e-06,-2.2e-05,2e-06,-8e-06,-1e-06,-8e-06,1.5e-05,2.8e-05,1e-06,-6e-06,-1e-06,-2e-06,-4e-06,2.5e-05,7e-06,-8e-06,-1.6e-05,-4e-06,-1.1e-05,4e-06,-1e-06,1.2e-05,2e-06,5e-06,1e-05,-3e-06,-3e-06,-2e-05,-1e-06,1e-06,3e-06,1.1e-05,-2e-06,4e-06,-1.5e-05,2.2e-05,4e-06,-5e-06,3.3e-05,-1.4e-05,3e-06,-1e-05,9e-06,5e-06,1.1e-05,-1e-06,7e-06,-1.7e-05,-1.3e-05
-3e-06,-2e-06,-1e-06,-4e-06,0,-3e-06,-5e-06,-6e-06,-1e-06,7e-06,-1e-06,0,-3e-06,-2e-06,-7e-06,1e-06,-2e-06,0,7e-06,1e-06,-1e-06,4e-06,5e-06,0,1e-06,-1e-06,-1e-06,-3e-06,3e-06,0,2e-06,-1e-05,-1.3e-05,-4e-06,2e-06,5e-06,-3e-06,-1e-06,-3e-06,2.2e-05,1e-06,2e-06,-3e-06,0,-9e-06,8e-06,-3e-06,-1e-05,1e-06,9e-06,-1.1e-05,-4e-06,-6e-06,-2.6e-05,-2.5e-05,3e-06,0,1.3e-05,7e-06,-4e-06,-9e-06,-1e-06,-6e-06,-1.5e-05,3e-06,-6e-06,-1e-05,1e-06,2.2e-05,8e-06,-1.1e-05,2e-06,-5e-06,-2.7e-05,1e-06,-2e-06,-1.4e-05,1.4e-05,9e-06,4e-06,-2e-06,8e-06,-1e-06,0,-7e-06,1.7e-05,1.7e-05,8e-06,2.8e-05,2e-06,7e-06,4e-06,-7e-06,-4e-06,3.6e-05,-3e-06,-8e-06,6e-06,-4e-06,-6e-06,-3e-06,3e-06,3e-06,-4e-06,2e-06,5e-06,1e-05,-3.3e-05,1e-06,3.8e-05,-2.9e-05,-1.4e-05,-2e-06,3e-06,1.1e-05,-7e-06,-2.8e-05,1.9e-05,-3.4e-05,1.7e-05,5e-06
-1e-06,-2e-06,2e-06,-3e-06,-1e-06,2e-06,4e-06,-1e-06,2e-06,4e-06,-3e-06,-1e-06,5e-06,2e-06,-1e-06,-3e-06,-3e-06,1e-06,-2e-06,-4e-06,3e-06,3e-06,-1e-06,3e-06,3e-06,6e-06,-1e-06,4e-06,-4e-06,1e-06,-2e-06,-1e-05,-1.2e-05,-1e-06,-5e-06,0,-3e-06,3e-06,-2e-06,9e-06,0,4e-06,2e-06,0,-1.2e-05,-2e-06,-2e-06,-4e-06,0,1.3e-05,1e-06,1.2e-05,8e-06,-3e-06,-1.2e-05,-4e-06,2e-06,-3e-06,5e-06,-1.9e-05,-2.9e-05,-1.1e-05,1e-06,-1e-06,3e-06,-2e-06,-8e-06,-1e-06,-7e-06,1e-06,0,-1e-06,-4e-06,-2.3e-05,0,7e-06,1e-05,2.1e-05,-1.7e-05,-2.7e-05,1e-06,5e-06,-1e-06,1e-06,-8e-06,-1.5e-05,0,1e-06,-1e-05,4e-06,-1.2e-05,2e-06,0,-9e-06,3e-06,-2e-06,4e-06,1.5e-05,3e-06,1.1e-05,-5e-06,1.8e-05,-2e-06,6e-06,-1e-06,-5e-06,0,-3.1e-05,-1e-06,6e-06,1.1e-05,3e-06,-7e-06,1e-06,3e-06,8e-06,-2.5e-05,-2.1e-05,3.3e-05,-1e-06,-1e-06
-2e-06,-1e-06,-1e-06,-2e-06,0,5e-06,7e-06,-1e-06,-2e-06,-1e-06,-3e-06,1e-06,2e-06,4e-06,4e-06,4e-06,-1e-06,1e-06,2e-06,1e-06,-4e-06,-2e-06,-4e-06,7e-06,3e-06,5e-06,1e-06,-4e-06,-8e-06,0,0,0,0,-1e-06,6e-06,-6e-06,6e-06,1e-06,6e-06,-1e-06,0,6e-06,0,0,-1.9e-05,-5e-06,-2e-06,7e-06,0,-6e-06,0,0,8e-06,6e-06,1.7e-05,-1.2e-05,-2e-06,-1.2e-05,-1.4e-05,8e-06,0,1.4e-05,-4e-06,1.1e-05,5e-06,2e-06,1e-06,-7e-06,-9e-06,-1e-05,-1.2e-05,-1e-06,7e-06,2e-06,-4e-06,-4e-06,0,1.2e-05,-6e-06,2.5e-05,-1e-06,8e-06,2e-06,0,1e-06,-2e-05,-1.4e-05,2e-06,-2.1e-05,0,5e-06,-3e-06,1e-06,-3e-06,-8e-06,2e-06,0,5e-06,7e-06,-9e-06,0,-1.1e-05,-3e-06,4e-06,6e-06,2e-06,-8e-06,-2.3e-05,0,-2.6e-05,-1e-06,2.8e-05,2e-06,-8e-06,-1.1e-05,0,-9e-06,-1.1e-05,-2e-06,-1.5e-05,1e-06
-2e-06,-2e-06,-1e-06,-1e-06,-4e-06,7e-06,5e-06,-5e-06,-1e-06,-2e-06,-3e-06,0,-1e-06,4e-06,6e-06,0,-2e-06,0,2e-06,-1e-06,3e-06,1e-06,-1e-06,-6e-06,1e-06,2e-06,0,1e-06,1e-06,0,1e-06,6e-06,6e-06,0,-1e-06,2e-06,-1e-06,0,-5e-06,1e-05,0,-1e-06,4e-06,-1e-06,-1.8e-05,3e-06,-3e-06,1.7e-05,1e-06,-1e-05,-9e-06,1e-06,-3e-06,2.2e-05,2.6e-05,-1.6e-05,2e-06,6e-06,1.9e-05,6e-06,-2.2e-05,8e-06,-2e-06,6e-06,-5e-06,5e-06,3e-06,-9e-06,6e-06,7e-06,-3e-06,-2e-06,-6e-06,6e-06,-2e-06,-2e-06,-5e-06,2e-06,3e-06,3e-06,-3e-06,1.4e-05,0,6e-06,9e-06,5e-06,-7e-06,-4e-06,6e-06,-3e-06,2e-06,2e-06,-1e-06,5e-06,1e-05,-1e-06,0,-1.2e-05,4e-06,-6e-06,-2e-06,-2e-06,-3e-06,-5e-06,-7e-06,4e-06,1.2e-05,-1.1e-05,-1e-06,-1e-05,-6e-06,3.3e-05,3e-06,9e-06,-3e-06,-9e-06,-1.4e-05,5e-06,-2.9e-05,2e-05,3e-06
0,-1e-06,2e-06,0,0,6e-06,-1e-06,-1e-06,0,-6e-06,-2e-06,0,3e-06,5e-06,3e-06,-1e-06,-1e-06,0,3e-06,0,-4e-06,3e-06,0,-2e-06,-3e-06,8e-06,-1e-06,2e-06,3e-06,0,-1e-06,5e-06,3e-06,0,-2e-06,4e-06,-3e-06,1e-06,-1e-06,-4e-06,0,-4e-06,-2e-06,0,-1.8e-05,-6e-06,0,1.5e-05,0,1e-06,5e-06,-8e-06,-7e-06,-8e-06,1.5e-05,-1.5e-05,-1e-06,7e-06,-9e-06,-1.3e-05,-7e-06,-9e-06,2e-06,-3e-06,-1e-06,-5e-06,-2e-06,-5e-06,-6e-06,-7e-06,-5e-06,0,-2e-06,-5e-06,-1e-06,5e-06,1e-06,-9e-06,4e-06,-2e-05,1e-06,7e-06,0,-1e-06,2e-06,1.7e-05,0,2e-06,6e-06,-2e-06,-4e-06,0,3e-06,4e-06,-4e-06,1e-06,-3e-06,-1.1e-05,0,1.3e-05,0,-4e-06,5e-06,7e-06,8e-06,-5e-06,-1e-05,6e-06,3e-06,1e-05,1.9e-05,8e-06,-3e-06,-7e-06,5e-06,1.1e-05,-1.2e-05,-1e-05,2.8e-05,-1.5e-05,9e-06
-2e-06,-1e-06,0,-3e-06,1e-06,5e-06,-5e-06,1e-06,0,-6e-06,-1e-06,0,2e-06,5e-06,-1e-06,2e-06,-2e-06,0,-3e-06,2e-06,3e-06,-2e-06,-2e-06,-1e-06,-2e-06,0,0,-6e-06,2e-06,0,0,3e-06,1e-06,-1e-06,-1e-06,-3e-06,5e-06,-1e-06,2e-06,-1.2e-05,0,-3e-06,1e-06,0,-6e-06,5e-06,-4e-06,5e-06,1e-06,7e-06,1e-06,3e-06,-1e-06,-1.1e-05,0,-1.1e-05,1e-06,-9e-06,3e-06,-1e-06,1e-06,1e-06,-2e-06,-8e-06,-4e-06,3e-06,5e-06,-1e-06,-3e-06,-9e-06,9e-06,-1e-06,6e-06,-9e-06,-2e-06,-3e-06,-1e-06,-1.5e-05,-2.1e-05,1.5e-05,0,-8e-06,-1e-06,0,3e-06,7e-06,9e-06,-3e-06,-1.5e-05,2e-06,4e-06,-2e-06,-2e-06,3e-06,-2e-05,-1e-06,4e-06,4e-06,4e-06,1e-06,0,1e-05,-2e-06,-6e-06,-6e-06,1e-06,3e-06,1.6e-05,-4e-06,1.3e-05,-2.1e-05,-1.4e-05,4e-06,6e-06,4e-06,-7e-06,7e-06,1.5e-05,-3e-06,5e-06,6e-06
-1e-06,-1e-06,-1e-06,-3e-06,2e-06,1e-06,-5e-06,-1e-06,2e-06,-4e-06,-1e-06,0,-3e-06,5e-06,-4e-06,-1e-06,-1e-06,0,1e-06,0,-1e-06,-1e-06,3e-06,8e-06,0,-3e-06,1e-06,6e-06,0,0,2e-06,0,3e-06,-2e-06,0,-2e-06,0,0,0,-3e-06,0,-1e-06,-3e-06,-1e-06,1.3e-05,-2e-06,0,-5e-06,0,3e-06,-6e-06,-2e-06,3e-06,-1.6e-05,-4e-06,-9e-06,-2e-06,-4e-06,1e-05,8e-06,-5e-06,5e-06,0,-3e-06,1e-06,-4e-06,5e-06,-1e-06,-3e-06,1e-05,7e-06,0,-5e-06,-1.1e-05,-2e-06,-1e-06,-6e-06,-8e-06,5e-06,0,-1e-06,-1.3e-05,-1e-06,-1e-06,0,-1.5e-05,7e-06,2e-06,-1.4e-05,-3e-06,-5e-06,-2e-06,0,-4e-06,-4e-06,0,-5e-06,9e-06,3e-06,-7e-06,-2e-06,-5e-06,3e-06,-1e-06,2e-06,3e-06,4e-06,1.4e-05,3e-06,6e-06,1.4e-05,-1.5e-05,2e-06,-5e-06,1e-06,0,-1.3e-05,-5e-06,-2.2e-05,4e-06,-1e-06
-1e-06,-1e-06,1e-06,1e-06,1e-06,-1e-06,0,-2e-06,-1e-06,-3e-06,1e-06,0,5e-06,2e-06,-3e-06,0,0,-1e-06,-1e-06,-1e-06,-1e-06,1e-06,-2e-06,0,2e-06,-2e-06,0,-5e-06,3e-06,0,-1e-06,-3e-06,6e-06,0,-3e-06,4e-06,-3e-06,2e-06,-1e-06,-1e-06,0,4e-06,1e-06,0,1.4e-05,2e-06,-2e-06,-1.1e-05,1e-06,-7e-06,3e-06,0,1e-06,1e-05,-1.5e-05,-1e-06,1e-06,9e-06,-1.5e-05,-8e-06,0,1e-05,0,4e-06,-2e-06,2e-06,-2e-06,-4e-06,7e-06,-1.1e-05,2e-06,1e-06,-1e-06,4e-06,-3e-06,4e-06,1.2e-05,2e-06,-2e-06,-1.9e-05,0,-7e-06,0,0,-2e-06,-1.1e-05,-4e-06,0,1.5e-05,-3e-06,-2e-06,2e-06,0,-3e-06,1.2e-05,1e-06,7e-06,1e-06,2e-06,6e-06,-1e-06,-2e-06,-1e-06,-1e-06,-4e-06,-3e-06,-9e-06,5e-06,-2e-06,-1.7e-05,-6e-06,-1.7e-05,-3e-06,4e-06,0,4e-06,2.3e-05,7e-06,2.5e-05,-6e-06,7e-06
-2e-06,0,1e-06,-1e-06,-2e-06,-4e-06,3e-06,-3e-06,1e-06,1e-06,2e-06,0,0,5e-06,0,1e-06,-2e-06,-1e-06,-1e-06,1e-06,3e-06,0,4e-06,-2e-06,2e-06,-2e-06,-1e-06,3e-06,-2e-06,0,-1e-06,-4e-06,3e-06,0,2e-06,1e-06,3e-06,0,-2e-06,-8e-06,0,0,-2e-06,0,8e-06,-2e-06,-2e-06,-1e-05,0,-5e-06,-1e-06,-1e-06,-3e-06,8e-06,-1.7e-05,-2e-06,-1e-06,0,1.3e-05,-8e-06,-8e-06,-1e-05,-3e-06,6e-06,3e-06,2e-06,-2e-06,-6e-06,-1e-05,-1e-06,-7e-06,0,1e-06,7e-06,-2e-06,-3e-06,-1.2e-05,8e-06,-7e-06,1.5e-05,-1e-06,0,0,-2e-06,-3e-06,7e-06,-6e-06,3e-06,-4e-06,1e-06,3e-06,0,-1e-06,-1e-06,6e-06,-2e-06,-4e-06,-4e-06,-1e-06,4e-06,-2e-06,-1e-06,2e-06,-2e-06,3e-06,0,9e-06,-6e-06,4e-06,-1e-05,-3e-06,-1.4e-05,2e-06,-5e-06,-2e-06,-5e-06,-3e-06,-4e-06,-4e-06,5e-06,8e-06
-1e-06,0,-1e-06,-1e-06,1e-06,-5e-06,4e-06,0,-2e-06,2e-06,2e-06,0,-1e-06,0,3e-06,-2e-06,-1e-06,0,-3e-06,-1e-06,-3e-06,-2e-06,0,-8e-06,-1e-06,-2e-06,0,-1e-06,-4e-06,0,1e-06,0,-2e-06,-1e-06,-1e-06,-4e-06,0,0,2e-06,4e-06,0,2e-06,0,0,1.3e-05,2e-06,0,-5e-06,1e-06,7e-06,-4e-06,5e-06,0,1e-05,-8e-06,0,2e-06,-9e-06,-5e-06,8e-06,-1e-06,-4e-06,0,1e-06,-1e-06,0,1e-06,-4e-06,2e-06,9e-06,-7e-06,0,-2e-06,-1e-06,-2e-06,-1e-06,6e-06,9e-06,-5e-06,6e-06,0,2e-06,-1e-06,1e-06,1e-06,1.4e-05,-2e-06,-4e-06,-1.9e-05,-1e-06,2e-06,-1e-06,1e-06,2e-06,-1e-06,1e-06,1e-06,3e-06,0,-7e-06,-1e-06,6e-06,-1e-06,3e-06,0,2e-06,-4e-06,-9e-06,-6e-06,1.8e-05,1.2e-05,4e-06,-1e-06,4e-06,-1e-06,4e-06,1.1e-05,-5e-06,-1.9e-05,-3e-06,-2e-06
-1e-06,0,0,-1e-06,1e-06,-6e-06,1e-06,2e-06,1e-06,3e-06,2e-06,0,3e-06,2e-06,3e-06,1e-06,-1e-06,1e-06,1e-06,0,2e-06,-1e-06,-2e-06,3e-06,-2e-06,-5e-06,0,0,-1e-06,0,0,3e-06,-3e-06,-1e-06,-1e-06,1e-06,-3e-06,0,-2e-06,8e-06,0,-3e-06,0,0,1e-05,-2e-06,-3e-06,2e-06,0,6e-06,1e-06,0,2e-06,-1.6e-05,6e-06,-3e-06,-1e-06,3e-06,-5e-06,-1e-06,-3e-06,1.1e-05,0,-5e-06,0,-4e-06,-1e-06,-2e-06,2e-06,-1e-05,-2e-06,0,1e-06,-1.3e-05,-2e-06,3e-06,-2e-06,6e-06,-2e-06,-2.2e-05,0,3e-06,1e-06,0,1e-06,0,2e-06,3e-06,4e-06,0,-1e-06,1e-06,-1e-06,1e-06,4e-06,0,-1e-06,4e-06,1e-06,1e-06,-1e-06,1e-06,-2e-06,-2e-06,1e-06,-2e-06,-2e-06,5e-06,3e-06,4e-06,-1.6e-05,1e-05,-3e-06,-3e-06,3e-06,-3e-06,1.2e-05,1e-06,2.5e-05,0,2e-06
-1e-06,0,1e-06,-3e-06,0,-5e-06,-1e-06,-3e-06,0,4e-06,1e-06,0,0,-1e-06,1e-06,0,-2e-06,1e-06,-1e-06,1e-06,-2e-06,1e-06,3e-06,2e-06,-1e-06,0,0,-1e-06,3e-06,0,0,2e-06,0,-2e-06,-1e-06,3e-06,3e-06,0,0,-1e-06,0,-1e-06,1e-06,0,0,1e-06,1e-06,6e-06,0,-6e-06,-2e-06,-3e-06,1e-06,-8e-06,1.3e-05,-3e-06,1e-06,7e-06,1.3e-05,-1.1e-05,6e-06,-2e-06,-1e-06,-4e-06,-1e-06,3e-06,-4e-06,-2e-06,-6e-06,4e-06,1e-06,0,-1e-06,-1.8e-05,-2e-06,-2e-06,-4e-06,-3e-06,3e-06,1.2e-05,0,6e-06,1e-06,2e-06,-1e-06,-1.3e-05,6e-06,-2e-06,7e-06,-2e-06,2e-06,1e-06,2e-06,1e-06,4e-06,-1e-06,0,-3e-06,-2e-06,5e-06,-1e-06,-4e-06,1e-06,3e-06,-3e-06,0,7e-06,1e-06,-3e-06,-8e-06,1.4e-05,8e-06,2e-06,2e-06,1e-06,3e-06,-4e-06,-3e-06,-9e-06,5e-06,3e-06
-1e-06,0,0,1e-06,-2e-06,-2e-06,-3e-06,-4e-06,0,1e-06,1e-06,0,-1e-06,-2e-06,-2e-06,-1e-06,0,0,0,-1e-06,1e-06,-1e-06,-4e-06,4e-06,1e-06,0,0,1e-06,0,0,0,0,0,-1e-06,0,-2e-06,1e-06,0,1e-06,2e-06,0,0,1e-06,0,4e-06,-2e-06,-2e-06,9e-06,0,-6e-06,-2e-06,2e-06,-2e-06,-5e-06,1.1e-05,-7e-06,-1e-06,-6e-06,-1.3e-05,1e-06,0,-6e-06,1e-06,0,-1e-06,1e-06,2e-06,-3e-06,0,7e-06,4e-06,0,-1e-06,-5e-06,-2e-06,-1e-06,8e-06,-7e-06,-1e-05,8e-06,-1e-06,5e-06,0,-1e-06,0,-7e-06,-1e-06,0,-1.1e-05,2e-06,-2e-06,-1e-06,-1e-06,-2e-06,-1.2e-05,1e-06,1e-06,-7e-06,-3e-06,-3e-06,0,-1e-06,1e-06,-2e-06,3e-06,2e-06,-8e-06,1.7e-05,5e-06,-3e-06,-8e-06,9e-06,2e-06,0,0,-2e-06,7e-06,6e-06,-1.6e-05,-8e-06,-3e-06
-1e-06,0,0,0,0,0,-2e-06,1e-06,1e-06,1e-06,0,0,3e-06,-1e-06,-2e-06,2e-06,-1e-06,0,-1e-06,0,0,-1e-06,2e-06,-4e-06,1e-06,1e-06,0,0,1e-06,0,0,-1e-06,-1e-06,0,-2e-06,-2e-06,-3e-06,1e-06,-1e-06,6e-06,0,1e-06,-2e-06,0,4e-06,1e-06,-1e-06,5e-06,0,4e-06,1e-06,-2e-06,-1e-06,1.6e-05,8e-06,-5e-06,1e-06,-5e-06,7e-06,6e-06,8e-06,-3e-06,-1e-06,5e-06,-2e-06,-2e-06,2e-06,-4e-06,2e-06,-8e-06,4e-06,0,2e-06,4e-06,-2e-06,2e-06,-6e-06,-5e-06,0,-1.8e-05,0,0,0,1e-06,0,9e-06,-4e-06,1e-06,-1.1e-05,0,1e-06,-1e-06,0,-1e-06,-1.1e-05,-1e-06,0,0,-3e-06,-3e-06,-1e-06,0,0,2e-06,-5e-06,-2e-06,5e-06,2e-06,-4e-06,-4e-06,0,5e-06,-2e-06,-2e-06,0,0,-7e-06,1e-06,2.5e-05,8e-06,-3e-06
-1e-06,0,1e-06,0,2e-06,3e-06,0,1e-06,-1e-06,-2e-06,-1e-06,0,0,-4e-06,-1e-06,-1e-06,-1e-06,0,2e-06,0,-1e-06,1e-06,-1e-06,-1e-06,0,1e-06,0,-3e-06,2e-06,0,0,0,-2e-06,0,0,3e-06,2e-06,0,0,-7e-06,0,0,2e-06,0,-1.1e-05,-2e-06,-1e-06,0,0,5e-06,-2e-06,1e-06,1e-06,4e-06,0,-7e-06,-1e-06,8e-06,2e-06,-9e-06,7e-06,6e-06,-1e-06,3e-06,0,0,-2e-06,-4e-06,-3e-06,4e-06,2e-06,0,-2e-06,4e-06,-2e-06,-1e-06,2e-06,-2e-06,1e-06,9e-06,0,-3e-06,0,-1e-06,-1e-06,1.1e-05,-3e-06,1e-06,1e-05,-1e-06,-3e-06,1e-06,0,0,8e-06,0,-2e-06,6e-06,-2e-06,4e-06,-1e-06,3e-06,0,1e-06,6e-06,0,1e-06,4e-06,4e-06,9e-06,5e-06,-3e-06,0,4e-06,-3e-06,2e-06,-9e-06,2e-06,-1.2e-05,-2e-06,-2e-06
-1e-06,1e-06,0,-1e-06,0,4e-06,2e-06,-2e-06,1e-06,-4e-06,-2e-06,0,-2e-06,-3e-06,1e-06,-1e-06,-1e-06,0,0,0,2e-06,0,0,-1e-06,0,0,0,4e-06,0,0,0,0,0,-1e-06,0,1e-06,1e-06,0,-2e-06,-6e-06,0,1e-06,-2e-06,0,-1.6e-05,3e-06,-2e-06,-8e-06,0,-1e-06,-2e-06,-2e-06,1e-06,-1e-06,-9e-06,-4e-06,1e-06,2e-06,-1e-05,-4e-06,-3e-06,3e-06,0,-2e-06,0,2e-06,0,-3e-06,-5e-06,5e-06,-3e-06,0,-1e-06,-5e-06,-2e-06,-1e-06,1e-06,4e-06,-2e-06,9e-06,0,-3e-06,0,0,0,-4e-06,2e-06,-3e-06,1e-06,2e-06,2e-06,0,-1e-06,1e-06,6e-06,1e-06,1e-06,1e-06,-3e-06,1e-06,-1e-06,-2e-06,1e-06,-4e-06,-7e-06,1e-06,-6e-06,-1.5e-05,-4e-06,3e-06,-1.1e-05,-1e-05,2e-06,-5e-06,0,-3e-06,1e-06,-2e-06,-1.2e-05,-5e-06,-4e-06
