-0.003129,-0.00261,-0.003293,-0.004627,-0.003194,-0.003316,-0.005252,-0.005372,-0.003776,-0.009974,-0.007922,-0.000647,-0.001849,-0.003579,-0.003194,-0.002002,-0.004772,-0.004653,-0.004181,-0.007152,-0.00672,-0.004477,-0.000997,-0.001554,-0.002986,-0.002171,-0.00256,-0.002804,-6.7e-05,-0.00421,-0.006217,-0.003961,0.002254,0.001557,-0.003449,-0.004571,-0.003057,-0.002001,-0.000677,-0.000943,-0.004683,-0.005419,-0.005125,-0.00491,-0.003687,-0.000183,-0.001124,-0.001353,-0.003735,-0.00083,-0.001569,-0.002432,-0.006078,-0.003944,-0.004316,-0.002266,-0.001016,-0.002309,-0.000609,0.001818,-0.002418,-0.002505,-0.00086,0.00043,-0.000905,0.000453,-0.003748,-0.001712,-0.005098,-0.005382,-0.003128,-0.004015,-0.008256,-0.009656,-0.005146,-0.00267,-0.003069,-0.003106,-0.003726,-0.005982,-0.000883,-0.003127,-0.004628,-0.005372,-0.002817,-0.002581,-0.002692,-0.003818,-0.004182,-0.005499,-0.003203,-0.003201,-0.00272,-0.005276,-0.004204,-0.002287,-0.005252,-0.004558,-0.00454,-0.002486,-0.002154,-0.002316,-0.001632,-0.004943,-0.005137,-0.004805,-0.004665,-0.00493,-0.001662,-0.003263,-0.004052,-0.004175,-0.00335,-0.005009,-0.003368,-0.004559,-0.002536,-0.003897,-0.003352,-0.005811,-0.004155
-0.000965,-0.003499,-0.00313,-0.000818,0.000248,-0.002247,0.000919,0.001462,-0.000727,-4e-06,0.000339,4e-05,-0.004445,-0.002769,-0.001189,-0.001012,-0.000841,0.001071,0.000241,0.00223,0.000567,-0.001119,-0.001708,-0.000771,-0.002439,-0.004927,-0.001123,-0.00295,-0.00231,-0.001194,0.001757,0.001366,-0.002957,-0.008599,-0.008785,-0.003728,-0.002077,-0.00288,-0.002474,-0.003083,-0.002487,-0.001584,0.000726,0.001948,-0.000281,-0.004027,-0.00328,-0.003335,-0.001761,-0.000866,-0.002777,-0.002439,-0.001157,-0.002822,-0.002362,-0.001441,-0.003362,-0.002924,-0.003664,-0.006688,-0.002719,-0.005392,-0.00534,-0.004312,-0.004213,-0.00385,0.000255,-0.00086,0.001439,0.001284,-0.00168,0.001449,0.003315,0.004123,0.002195,-0.001023,-0.001127,-0.001839,-0.001711,5.2e-05,-0.002317,-0.000928,-0.000704,0.003762,0.00052,-0.001773,-0.002793,-0.002019,-0.001079,-0.001594,-0.001654,-0.001243,-0.000901,-0.001144,-0.004488,-0.003924,0.003777,-0.000109,-0.001321,-0.001213,0.000579,-0.001833,-0.005739,-0.003728,-0.001712,-0.001274,-0.001674,-0.005124,-0.00339,-0.003475,-0.001719,-0.001435,-0.000441,-0.002933,-0.002934,-0.002987,0.000101,-0.00294,-0.00327,-0.000173,0.000262
-0.002078,-0.000443,-0.001271,-0.000947,-0.002372,-0.000937,-0.003199,-0.004757,-0.000722,-0.002433,-0.002059,-0.002826,-0.001008,0.000959,-0.00046,-0.000465,-0.000272,-0.000776,-0.003871,-0.003909,-0.001571,-0.000102,-0.001163,0.000679,-0.0012,-0.000342,-0.001857,-0.002614,-0.004741,-0.002096,-0.00259,-0.002829,-0.000275,0.001287,0.003111,0.000852,0.001892,-0.00243,-0.002656,-0.000161,-0.002553,-0.00103,-0.004591,-0.003861,-0.001962,-0.003,0.000478,-0.000881,-0.005429,-0.002551,0.00065,-0.004788,-0.002626,0.001334,-0.001935,-0.001431,0.001095,-0.0037,-0.001054,0.001283,-0.002884,-0.001562,-0.001088,-0.001775,-0.001346,-0.003906,-0.002363,-0.002398,-0.00092,-0.001093,0.000414,0.002684,-0.003518,-0.001934,-0.00341,-0.001784,-0.001078,0.000365,-0.000583,-0.002075,0.000675,0.000724,0.00098,-0.002607,-0.002811,-0.003122,0.000552,-0.001194,-6.4e-05,-0.001012,-0.000499,-0.000123,0.002052,0.00172,0.001373,0.002173,-0.002476,-0.000951,0.001448,0.003141,-0.000703,-0.000106,0.000671,0.000289,-0.000563,-0.00125,-0.000454,0.001397,-1.7e-05,0.001732,-0.001356,-0.002831,-0.001026,0.002258,0.001573,0.000404,-0.000491,-0.000947,0.000697,0.001245,0.000394
0.002945,0.00172,0.003693,0.002332,0.002473,0.003374,0.003049,0.002175,0.001231,0.003984,0.004821,0.002558,0.003032,0.000798,-0.000301,-8.3e-05,-0.00053,-0.000482,0.001612,0.002569,0.001442,0.001925,0.000968,-0.001007,0.001293,0.000933,0.002685,0.004118,0.003245,0.003897,-0.000521,0.001396,0.001861,0.00422,0.004146,0.002626,-0.000785,0.002773,0.002099,0.003174,0.003541,0.000439,0.00193,0.002673,-0.000111,0.002227,0.001867,0.004937,0.003559,0.002744,0.000604,0.001728,0.003126,0.001881,0.001348,0.000391,0.000936,0.000383,0.002671,0.002797,0.002443,0.002541,0.004056,0.00219,0.003397,0.00353,0.000954,-0.000112,0.001584,-0.002186,-0.001558,-0.00387,0.001743,0.001618,0.001,0.001743,0.003253,-0.000134,-0.00042,0.00189,0.000981,-0.000178,-0.000271,0.000932,0.002697,0.003269,-0.000884,0.002248,-0.001321,0.000844,0.00141,-0.001477,0.001155,-0.001534,0.001624,0.004024,0.002385,0.001654,-0.00044,-0.000573,-0.000857,-0.001622,0.001406,-0.000869,0.002166,-0.000332,0.000741,0.002142,0.004377,0.003062,0.002569,0.002599,0.002319,0.000122,0.002096,0.001813,0.001148,0.003786,0.00353,0.000462,-0.000515
-7e-04,-0.001294,0.000463,-0.001062,-0.000493,-0.001399,-0.002388,-0.00117,-0.000696,-7e-06,-0.003955,-0.002521,-0.003796,-0.001512,0.000845,-0.00145,-0.001802,-0.00143,-0.00027,-0.003446,-0.00242,-0.003351,-0.002244,-0.000385,-0.001634,-0.002602,-0.003105,-0.001949,-0.000246,-0.003343,-0.000281,-0.001868,-0.001775,-0.000511,-0.002846,-0.003832,-0.00331,-0.00229,4e-06,-0.003612,-0.004154,-0.000633,-0.001358,-0.002273,-0.000364,-0.001409,-0.001783,-0.00305,-0.000863,-0.001636,-0.002671,-0.000329,-0.001572,-0.002373,-0.0017,4.5e-05,-0.000451,0.00183,-0.003154,-0.002211,0.001112,-0.001855,-0.003,0.001546,-0.001073,0.000527,4.2e-05,-0.000598,-0.001934,0.000442,-0.000885,-0.000986,-0.00161,-0.003886,-0.001104,-0.00199,-0.003737,-0.002209,-0.001596,-0.002095,-0.001515,-0.002521,-0.001406,-0.000718,-0.000644,-0.001991,0.00054,-0.001824,-0.00057,-0.001261,0.00032,0.001496,-0.002078,-0.002404,-0.00112,-0.001977,-0.003194,-0.0028,-0.001092,-0.001411,-0.001295,-5.8e-05,-0.001511,-0.001965,-0.004867,-0.002131,-0.002277,-0.002895,-0.004119,-0.004148,-0.002247,-0.001209,-0.002435,-0.001378,-0.002512,-0.000272,-0.000189,-0.001989,-0.003798,-0.001161,-0.000502
-0.000415,0.001857,-0.001671,0.001482,0.001449,0.000261,0.002649,0.002307,-0.000488,-0.001399,0.00185,0.000962,0.001317,0.001111,-0.00052,-7.8e-05,9.3e-05,0.002268,-0.001605,0.001468,0.002613,0.001352,0.000518,0.000767,0.000293,0.00087,-0.001173,-0.000719,6.6e-05,-0.001203,-0.001573,0.000439,-0.000748,-0.001592,-0.002264,-0.000771,0.000841,0.000976,-0.001957,-0.000888,0.000514,-0.000924,-0.000331,0.000541,0.000813,6.2e-05,-0.002313,-0.001024,-0.001589,-0.001082,0.000461,0.000992,0.00044,-0.001397,0.00043,-0.002098,-0.001821,0.000191,-0.000306,-0.00164,0.000231,0.000562,-0.001242,0.000199,-0.000675,-0.00219,-0.000336,0.000146,-0.000302,1.4e-05,0.000344,0.000856,0.000583,0.002185,-0.000125,-0.00011,-0.000153,0.00143,0.000713,0.000161,5.5e-05,0.000478,0.000819,-0.000355,0.000439,-0.000999,-0.001363,0.000532,0.000166,0.000716,-0.002488,-0.001397,0.000147,0.000744,-0.000916,-0.001111,0.000247,0.001061,-0.001449,5.6e-05,0.000713,-0.00033,-0.000128,0.002754,0.001833,0.001995,0.000751,0.000248,-0.001402,-0.000222,0.000378,-0.000566,0.000477,-5.6e-05,0.001085,-0.001532,-0.00094,0.000447,0.001538,0.000135,0.000287
-0.000136,-0.001513,0.000379,-0.002223,-0.00133,-0.000928,-0.000478,-0.001618,4.9e-05,2.8e-05,-0.00017,-0.001034,-8.3e-05,0.000956,9e-06,-3.1e-05,0.00172,-0.001526,0.001312,0.00102,-0.000633,-0.00038,0.000552,-0.000282,0.000749,0.000812,0.000926,-0.000384,-0.002046,0.000925,0.002664,0.000702,0.000543,8.8e-05,0.000982,0.002053,0.000825,0.000803,0.000738,0.000629,0.000537,-0.000106,-0.000545,-5e-04,0.00032,0.000478,-0.000259,-0.000569,0.000409,-0.001606,0.00045,0.000186,-0.001767,0.000647,-9.6e-05,-0.000237,-0.001297,-0.001071,0.0011,0.000768,-0.000703,5.3e-05,0.000255,-0.002824,0.001057,0.000364,-0.000771,-0.000641,0.000699,0.000756,0.000568,0.000111,-0.001501,-0.001277,-0.000121,0.000753,0.000759,0.000683,0.001514,0.002005,0.000176,0.001244,-0.000936,0.000516,0.000908,0.001852,-2.3e-05,0.000426,0.000496,0.000472,0.000641,4.5e-05,-0.00071,0.000304,0.001326,0.001909,-7.8e-05,-0.000386,0.0019,0.000747,-0.000102,0.001481,0.000299,-0.000183,0.000528,0.000131,0.00147,0.000193,0.002336,0.001705,0.000455,0.001369,0.001251,0.000295,-5.5e-05,0.000843,0.001414,1.5e-05,0.000536,0.000448,0.000387
0.001381,0.000176,0.000332,0.00092,0.000275,0.001545,-0.001675,6e-04,0.000563,0.000339,0.000419,0.001456,0.001019,0.000529,0.000752,0.001277,-0.000349,0.001492,0.000368,-0.000417,-0.000529,0.000595,2.6e-05,-0.000774,-0.000156,0.000959,0.002249,0.001059,0.002428,0.001582,-0.00016,-0.000251,0.000527,7.9e-05,0.00154,0.00116,3e-06,-0.000678,0.00189,0.001668,0.001033,0.003172,0.001977,0.001103,0.000506,0.000102,0.003038,0.000988,0.002518,0.002576,0.000959,0.000744,0.001808,0.000931,0.001137,0.002546,0.001511,0.002199,0.001768,0.001092,1.9e-05,0.002178,0.001404,0.002148,0.00072,0.000647,0.00062,0.001609,-0.000406,0.000235,0.001064,0.000956,0.002754,0.001347,0.000915,0.000617,0.00096,-0.001599,-0.000741,1.6e-05,-0.000699,-0.000998,0.000567,0.000642,-0.00125,-0.000431,0.00065,-0.000487,0.000834,0.001494,8.8e-05,0.001079,0.000292,-0.000329,-0.001375,-0.001938,-5.6e-05,0.000517,0.000761,-0.000586,0.00047,-0.000536,0.000315,-0.001127,0.000458,-0.00024,0.000654,0.000421,0.000332,-0.00034,0.000122,0.000567,0.001105,0.001525,-0.000228,-0.000702,-0.000691,-0.000321,-0.000393,-0.001059,-0.000339
-0.00135,-0.000733,-0.000574,0.000211,-0.000379,-0.000571,0.00013,-0.000592,0.000539,-1.3e-05,2.4e-05,-0.001449,-0.000471,-0.001026,-5.3e-05,-0.000981,6e-06,-0.000337,0.000683,0.00025,0.001081,0.000614,0.000932,0.001066,0.000499,-0.000778,-0.001319,-0.000494,0.000449,1.1e-05,-0.000304,0.001063,-0.000316,-0.000572,-0.001312,-0.001747,0.001094,0.000328,-0.000773,-0.000202,-0.000444,-0.001832,0.000303,0.000426,0.000734,0.001328,-0.000436,-0.000317,-0.001428,0.000869,-0.000474,0.001122,0.000813,3.6e-05,-0.000422,1.4e-05,0.00042,4e-04,0.000119,-0.000806,0.000963,0.000225,-0.00027,-0.000169,0.000231,0.00021,0.000352,-1e-06,0.000466,0.000381,-0.000576,0.000322,-0.000926,2.3e-05,0.000265,0.001128,-3.7e-05,0.001495,-0.000143,-0.00041,0.00092,0.000689,-0.000329,-0.000863,-0.000309,0.000906,0.001753,0.001342,0.000232,-0.001767,0.00037,-5.1e-05,0.000813,0.001025,0.001,0.000596,0.001514,0.000772,-0.000369,0.000485,0.000117,0.000716,0.000747,0.000206,0.000473,0.001068,-0.000816,-0.000378,-0.000621,-0.000218,-0.000383,-3.9e-05,-0.000725,-0.001335,4.1e-05,0.000121,-0.001238,-0.000454,-0.000542,0.000715,0.000478
0.000839,0.001366,0.000651,-0.000127,0.001209,0.000196,0.00109,0.000483,-0.000114,-0.000138,-0.000903,0.00049,7.5e-05,-0.000626,-0.000929,-0.000465,0.000633,-0.000349,-0.000406,-0.000258,-0.000767,-0.000962,-0.000565,0.000198,0.000127,-0.000101,0.000302,9.1e-05,-0.00049,-0.000674,0.00031,0.000122,0.000978,0.000344,4e-05,0.000689,-0.000768,-0.000495,0.000115,-0.000752,0.000202,0.000106,-0.000275,-0.000222,-0.000834,-0.000797,-1e-04,-0.000122,0.000399,-0.000755,0.000487,-0.001216,9.6e-05,-0.000367,5.7e-05,-0.000194,0.000873,-0.000798,-0.001572,0.000921,-0.001416,-0.00128,0.000222,-0.000807,-0.001969,-0.000479,-0.000631,-0.000339,-1.4e-05,-2e-04,-6.9e-05,-0.000622,-0.000143,-0.000318,-0.000531,-0.001418,-4e-04,0.00018,0.000836,0.000141,0.000763,-0.000372,0.001002,0.000705,0.000359,-0.000801,-0.001678,-0.001254,-0.000495,0.00012,0.000661,-0.000256,-0.000111,6.4e-05,0.001006,-0.000198,-0.000311,-0.000619,0.000437,0.000272,-0.000254,-0.000828,-0.000535,0.001011,-0.00041,0.000185,-6.6e-05,0.000916,0.000347,0.000417,0.000987,-0.000379,-0.000202,-0.000113,0.000626,0.000538,0.00061,0.000814,-6.8e-05,-0.000323,2e-04
-0.000449,-0.000166,-0.000146,4.5e-05,-0.000454,-0.000744,-0.000443,-0.000132,-0.00098,0.000196,0.000858,0.000456,-0.000236,-0.000142,0.000462,9.4e-05,-0.000408,0.000152,-0.000248,0.000382,-0.000286,3.4e-05,0.000629,-0.000494,-8e-04,-0.000113,-0.000487,0.000433,-0.001053,-0.000346,-0.000167,-0.001286,-0.000872,0.000536,0.000148,0.00032,-0.000503,0.000122,-0.000306,0.000556,-0.000521,-0.000342,-0.000623,-0.000214,-0.000412,7.3e-05,-0.000333,0.001065,-0.000301,-0.000261,-0.000782,-0.000635,-0.000947,0.000231,0.000366,-0.00049,-0.000734,-0.000478,-0.000124,-5.7e-05,-0.000274,-0.000738,6.1e-05,-0.000257,7.3e-05,0.000382,0.000143,-0.000527,0.000275,0.000169,-0.000244,0.000137,0.000408,0.000324,2e-04,0.000566,5.2e-05,-0.00027,-0.001182,-0.000374,-0.000681,0.000454,-0.000309,8.6e-05,5.6e-05,0.000208,0.00026,0.000168,-0.00073,0.000627,-0.000317,0.000495,0.00088,-0.00058,-0.000543,0.00062,-0.000485,0.000156,-0.000501,0.000322,0.000343,0.000182,0.000221,-0.000633,-0.000443,-0.000866,-0.001784,-0.00036,-0.000365,3e-06,-0.000486,0.000194,-0.000188,-0.000267,0.000209,-0.000103,6e-04,-0.000332,0.000483,8.8e-05,-0.000391
0.000212,-0.00076,-0.000342,-0.000652,-0.000447,0.000324,-6.4e-05,0.000238,0.000269,0.000301,-0.00014,-0.000189,5.5e-05,0.000658,-0.000406,0.000585,-0.00035,-0.000375,-0.000368,-0.000257,0.000455,0.000104,-0.000455,0.000343,0.000178,-0.00019,3.1e-05,7.5e-05,0.000612,0.000668,6.5e-05,6e-05,0.000538,0.00011,8.5e-05,-0.000193,0.000266,0.000232,-0.000479,-0.000114,0.000414,0.000256,0.000407,0.000269,0.000111,0.000259,-0.000707,4.6e-05,1e-06,0.000166,0.00074,0.000745,0.000215,1.1e-05,-0.000335,2.9e-05,-0.000248,-0.000234,0.000493,-8.2e-05,0.000823,0.000741,0.000118,0.00105,0.000556,6e-06,-3.8e-05,0.000144,-0.000469,-0.000416,-0.000124,-0.000232,-0.000989,-0.000292,-0.000284,-0.000795,-0.000304,-0.000563,0.000751,-0.000154,-0.000416,-0.000263,-0.000172,-0.000814,9.6e-05,-0.000106,7.8e-05,-2.9e-05,0.000819,-0.000704,-0.000398,-0.000345,-0.001094,-0.000448,-1.3e-05,6.4e-05,0.000164,0.000193,-2.8e-05,-0.000807,-0.000523,0.000233,-0.000951,-0.000361,-6.6e-05,-8.9e-05,0.001061,-0.000105,0.000419,-0.000412,9e-06,-0.000502,-0.000171,0.000695,-0.000706,-0.000501,0.000192,4.8e-05,-8.4e-05,6.1e-05,0.000718
-0.000149,4.5e-05,3e-05,0.000311,3e-04,-0.000321,-6.5e-05,-1e-04,0.000351,-2.6e-05,-8.1e-05,0.000192,-7.1e-05,0.000212,-0.000416,-7.9e-05,0.000314,2e-04,0.000454,-0.00015,-4.8e-05,0.000142,-0.000119,-6.6e-05,0.000153,4.3e-05,9e-05,-0.000249,-0.000561,-0.000352,-0.000439,0.000422,-0.000436,-6e-06,0.000272,-2e-06,0.000216,-8e-06,-0.000196,-0.00029,-0.000166,-0.000234,-0.000377,-0.000473,0.000209,-0.000804,0.000645,-0.000294,-0.00052,-0.000255,-0.00081,-0.000492,0.000196,-0.000499,-6e-06,-0.000171,0.000178,-0.000182,-0.000253,-0.000402,-0.000165,0.000314,-0.000211,-0.000343,8.6e-05,-0.000499,0.000102,0.000495,0.000406,-5.3e-05,-0.000137,-0.000219,0.000622,-0.000654,3.9e-05,9e-05,8.2e-05,0.000281,-0.000346,0.000241,-0.000218,-2.3e-05,-4.3e-05,0.000181,3e-05,0.000122,-0.000288,4.2e-05,-0.000186,-0.000168,-3.4e-05,-0.000378,-0.000415,7.5e-05,0.000297,-7.1e-05,0.000334,-0.000461,-1.9e-05,-0.000183,6.2e-05,-0.000195,1e-06,-0.000259,0.000377,0.00016,0.00017,-0.000141,-2.7e-05,-0.000102,0.00013,0.000368,7.5e-05,-0.000212,-2.8e-05,0.000496,-0.00027,5.4e-05,0.000204,2e-06,-0.000137
0.000122,0.00043,0.000204,-7.9e-05,0.000165,0.000358,0.00055,0,-9.7e-05,-0.000268,0.000138,-0.000374,5.2e-05,-0.000215,0.000398,-0.000393,-8.5e-05,-0.000273,-0.000426,-0.000238,-0.000202,7e-06,-0.000211,-0.00018,-9e-05,-0.00011,0.000105,0.000171,-0.000284,7.7e-05,0.000384,2.7e-05,-0.000177,-0.000267,-0.000165,-0.000143,-0.000154,-0.00016,0.000502,-8e-05,-9.8e-05,0.000282,-0.000311,0.000221,-0.000142,0.000408,-0.00013,-0.000315,0.000327,-7.7e-05,0.000119,-0.000326,-0.000411,-0.000344,-0.000193,0.000171,-0.00044,0.000292,0.000157,-0.000348,5.1e-05,-0.000565,-0.00043,4.1e-05,0.000125,0.000121,-0.000153,-0.000126,-0.000391,2.1e-05,0.000183,0.00031,-1.6e-05,0.000751,0.000109,9.3e-05,-0.000168,0.000112,-2.3e-05,-7.6e-05,7.8e-05,-0.000271,-9.2e-05,1.6e-05,-5.3e-05,-0.000149,-0.00012,-3.9e-05,0.000149,0.00027,-0.000112,0.000165,0.000247,0.000449,-0.000422,-0.000171,-0.000305,8.7e-05,0.000121,0.00013,-2.8e-05,-0.000129,-8.9e-05,0.000459,0.000163,0.000285,-6.8e-05,-0.000175,-0.000188,0.000117,-0.000202,-7.1e-05,-0.000252,0.000376,0.000301,-0.000484,6.2e-05,0.000175,-6.2e-05,-0.000268,-2e-05
0.00012,-0.000188,-5.3e-05,3.6e-05,-0.000157,-0.000153,-0.000197,0.000102,0.000183,-0.000268,-0.00039,0.000287,-0.000144,-1.2e-05,0.000241,0.000297,9.8e-05,0.000217,0.000422,0.000445,-7.7e-05,-0.000222,0.000146,-0.000232,-2.3e-05,-3.6e-05,-8.6e-05,-0.000333,0.000815,-0.000284,-0.000135,-0.000217,3.8e-05,-0.000191,-0.000147,-0.000152,-0.000246,-3.1e-05,-0.00017,1e-06,0.000203,-0.00024,0.000363,3.3e-05,5e-06,-0.000195,-4.9e-05,-0.000281,-6.4e-05,0.000386,0.000227,3.5e-05,0.000185,0.000125,0.000109,-6e-06,9e-06,-0.000137,-3e-04,0.000334,0.000166,0.000173,0.000188,0.000364,-0.000134,-0.000378,-8e-06,-0.000291,0.000126,0.000121,6.2e-05,-4.6e-05,-7.4e-05,-0.000243,1.4e-05,-9.5e-05,0.000138,3.1e-05,4.8e-05,-0.000138,0.000294,6.9e-05,0.000312,-0.000113,-0.000101,8.7e-05,0.000157,6.6e-05,-0.000131,0.000152,0.000166,0.000154,0.000137,-0.000192,5.1e-05,-0.00038,1.5e-05,0.000228,-0.000429,-1.1e-05,0.000163,0.00031,0.00024,4.1e-05,-0.000409,-0.00029,-0.000187,0.000102,0.000153,0.000134,0.000122,0.000109,0.000144,-6e-06,1.5e-05,0.000229,-3e-06,-0.000125,-0.000289,5.8e-05,-0.00013
-0.000283,-0.000124,2e-06,0.000103,-0.000164,-0.000173,-0.000131,-0.000111,-0.000125,1.9e-05,0.000281,-5.6e-05,-6.5e-05,5.1e-05,-4.6e-05,-2.4e-05,-4.1e-05,8.5e-05,-0.000206,-7.9e-05,2e-04,4.1e-05,0.000164,0.000314,1e-06,0.000117,2.4e-05,6.2e-05,-0.000173,0.000155,0.000189,-1.3e-05,0.000184,-2e-05,1.8e-05,0.000237,0.000173,-8e-06,9e-05,0.00017,-0.000279,-5.2e-05,3e-04,-0.000138,4e-05,0.000239,-8.8e-05,0.000201,-0.000108,-5.4e-05,-8.5e-05,0.000292,4.5e-05,0.000382,0.000105,-0.000126,0.000378,-4.6e-05,7.9e-05,0.00024,5e-06,-0.00013,0.000203,-0.000302,3.4e-05,0.000237,0.000212,3.6e-05,0.000185,-0.000149,5e-06,7.1e-05,-0.000138,0.000164,-6.8e-05,-2e-05,7.3e-05,-0.000262,-7.2e-05,0.000184,7.6e-05,0.000235,-0.000216,0.000186,-3.4e-05,-0.000193,0.000105,7.7e-05,4e-05,-0.000279,5.1e-05,-0.000227,0.00025,-1.8e-05,2.5e-05,8.3e-05,9.6e-05,-0.000203,0.000548,0.000241,7e-06,-0.000178,-7.5e-05,-0.000136,-4e-06,9.1e-05,0.000222,0.000367,-0.000117,-5.1e-05,-2e-05,5.8e-05,1.7e-05,-3.1e-05,-7.5e-05,-6.9e-05,6.1e-05,-0.000252,0.000311,5.3e-05,0.000202
0.000254,2.3e-05,-1.3e-05,-7.9e-05,2.4e-05,0.000154,-4e-05,5.9e-05,-0.000274,7.2e-05,-8.1e-05,-4.9e-05,3.9e-05,0.000228,-3.3e-05,0.000151,-0.000266,-0.000181,-7.5e-05,-0.000139,-8.6e-05,2.6e-05,-0.000186,-0.000124,-2.6e-05,-6e-06,4.6e-05,0.000196,-0.000109,0.000117,-0.000333,8.5e-05,1.1e-05,6e-06,-3e-06,6.7e-05,0.000102,0.000137,8.8e-05,8.4e-05,0.000257,0.000249,-0.000318,4.6e-05,-2.7e-05,2e-05,-0.000109,0.000142,0.000202,-0.000306,4.4e-05,-0.000138,-9e-05,0.000237,-3.4e-05,-6.5e-05,4e-05,0.000152,0.000136,1e-06,-0.000211,6.5e-05,-1e-06,-0.000175,0.000164,0.000159,-0.000177,4.7e-05,-0.000188,-2.6e-05,0.000111,-8.1e-05,0.000192,-0.000171,-3.3e-05,0.000126,-4.1e-05,0.000151,0.000235,-0.000112,-2.4e-05,5.4e-05,0.00012,-7.9e-05,-5.6e-05,9.8e-05,-0.000201,-3e-05,1e-05,0.000142,-0.000125,7.2e-05,-0.000218,-4.5e-05,-2.7e-05,0.000136,0.000144,-8.7e-05,-0.000256,-0.000209,-0.000102,8e-06,-4.5e-05,0.000132,0.000119,0.000101,0.000119,-2.8e-05,0.000133,-0.000144,-2.5e-05,-1e-05,7e-06,8.3e-05,-0.000116,-4.5e-05,-0.000122,8.8e-05,-0.000134,0.000115,-6.2e-05
-0.000168,0.000109,-1.3e-05,-1.3e-05,-4e-06,-6.3e-05,0.00011,1.3e-05,0.000136,9.1e-05,-0.000112,4.1e-05,-7.3e-05,-0.000199,1.1e-05,-0.000101,0.000109,0.000175,0.000184,4e-06,-8.3e-05,4.6e-05,-0.000102,-5.8e-05,9.5e-05,6.2e-05,-1e-05,-0.000109,0.000226,0.000146,0.000203,-1.2e-05,-1.8e-05,0.00023,2.5e-05,-0.000188,-0.000108,-8.9e-05,-0.000188,-1.1e-05,-0.000124,-0.00013,8.6e-05,5.1e-05,4.9e-05,-0.000121,0.00015,0.000126,-0.000142,0.00017,-0.000172,1.8e-05,-9.1e-05,-0.000193,5.5e-05,0.000127,-0.000202,-2.7e-05,7e-05,-0.00013,-6.8e-05,0.000104,6e-06,0.00012,2.8e-05,-1.6e-05,4.7e-05,4.2e-05,3.7e-05,8.4e-05,-2e-06,-1.6e-05,-0.000112,-5.9e-05,2.5e-05,-0.000159,3.9e-05,6.4e-05,-0.000146,0.000121,-2.5e-05,-0.000131,-0.000113,-3e-06,0.000102,4.8e-05,8.7e-05,3.2e-05,6.6e-05,-1e-05,0.000143,5.6e-05,2.8e-05,3e-05,9.6e-05,-6.1e-05,-0.000162,8.6e-05,0.000174,8.5e-05,7.6e-05,6.8e-05,0.000112,0.000108,0.000122,-4.5e-05,9.1e-05,-1.9e-05,2.2e-05,-4e-05,3.9e-05,-7.8e-05,6.6e-05,-1.1e-05,1.6e-05,2.7e-05,-1.6e-05,2.2e-05,7.3e-05,-9.5e-05,-0.000151
4.6e-05,-2.6e-05,-8e-05,-1.6e-05,0,7e-05,-1e-05,3.3e-05,7.3e-05,5.7e-05,0.000123,-6.8e-05,4.3e-05,-0.000148,-0.000121,-8.2e-05,0.000115,0,-4.1e-05,4.3e-05,2.4e-05,3.4e-05,0.000109,-2.1e-05,-2.3e-05,-4.4e-05,7.4e-05,3.7e-05,-1.7e-05,-0.000132,-1.3e-05,3e-06,4.6e-05,-1e-06,8e-06,-3.5e-05,-5e-06,-1.6e-05,0.000178,-7.3e-05,-4e-06,0.000134,6.7e-05,-2.8e-05,0.00016,0.000109,4.3e-05,-2.9e-05,-1.2e-05,3.4e-05,0.000131,0.000237,1.7e-05,-0.000147,-4.2e-05,-1.9e-05,-3.7e-05,3.5e-05,2.9e-05,-0.000108,0.000135,4.5e-05,-0.000155,-6.1e-05,-9.2e-05,0,0.000104,5e-05,4.2e-05,1e-06,5.3e-05,0.000105,-2e-05,0.000101,-4.3e-05,2e-04,-1.2e-05,-3.5e-05,-3.2e-05,1.7e-05,-0.000146,3.6e-05,6e-05,4.4e-05,-1e-06,2.6e-05,-5e-06,4.6e-05,-7e-06,-9.1e-05,-0.000287,-3.3e-05,-2.3e-05,8e-06,-5.6e-05,0.000195,-1.4e-05,-8e-06,-3.6e-05,-7.1e-05,-3e-05,-0.00011,-1.6e-05,4.5e-05,-3.7e-05,-5.4e-05,-2.1e-05,1e-06,-8.7e-05,0.000132,-6.3e-05,2.9e-05,-2.6e-05,-8.6e-05,1.3e-05,4.2e-05,4.5e-05,7.3e-05,-5.5e-05,-2.3e-05,9.9e-05
2.5e-05,-0.000107,6.7e-05,5e-06,-2.6e-05,4.1e-05,-0.00017,-5e-05,5e-05,-2.2e-05,-0.000153,9.6e-05,-2.5e-05,-2.8e-05,8.4e-05,7.9e-05,-0.000129,-2.5e-05,-4.8e-05,7.9e-05,9.3e-05,-5.6e-05,-4e-06,0.000163,4e-06,-3.2e-05,-6.3e-05,-9e-06,-0.000104,-4.7e-05,3.3e-05,9.2e-05,-0.000107,2.8e-05,-3.3e-05,8.8e-05,8.8e-05,8e-06,-3.4e-05,3.1e-05,5e-05,-8.6e-05,-9.3e-05,-2e-05,-1.3e-05,-3.5e-05,7.3e-05,-8.6e-05,9.1e-05,-2.6e-05,-4.5e-05,-0.000112,4.4e-05,-1.8e-05,6.6e-05,8e-06,3e-05,0.000109,-8.1e-05,5.8e-05,-0.000135,-5.9e-05,-1.3e-05,-0.000143,-0.000215,-2.3e-05,-1e-04,-4.1e-05,-3.7e-05,3e-06,-7.3e-05,-2.3e-05,0.000218,7.1e-05,0.000102,-9.8e-05,1.6e-05,-0.000105,0.000135,-0.000112,3.3e-05,-5e-06,-3e-05,-2e-05,-3.8e-05,-1.8e-05,-2.1e-05,-5.2e-05,-4.5e-05,0.000222,0.000219,-1e-06,-6.6e-05,2.2e-05,-8.4e-05,-8.5e-05,0.000182,1.2e-05,-4e-06,1e-06,3.1e-05,8.4e-05,0.000119,-0.000107,-0.000141,4.8e-05,-0.000197,-7e-06,1.5e-05,7.9e-05,2.3e-05,-2.2e-05,8.8e-05,0.000118,-4e-06,-5.8e-05,7.7e-05,-1.7e-05,-4.4e-05,-2e-06,-2.2e-05
-3e-06,5.2e-05,1.7e-05,1.3e-05,5.5e-05,-6.2e-05,0.000114,5.6e-05,-2.7e-05,-2.4e-05,0.000175,-5e-05,4e-06,1.5e-05,1e-05,1.5e-05,-3.1e-05,3.6e-05,0.000117,-7.9e-05,-6.9e-05,-4e-05,3e-05,-5.4e-05,5e-06,1.2e-05,2e-06,2e-05,8.6e-05,-1.7e-05,-2.6e-05,-2.9e-05,0.000121,-0.000114,1.6e-05,5e-06,7e-06,7.1e-05,1e-06,2.8e-05,-4e-05,-6.3e-05,0.000112,5.7e-05,-0.000119,-1e-05,-0.000124,-1.2e-05,-4e-06,9.1e-05,0.000149,-7.9e-05,2.6e-05,0.000159,-7.2e-05,4.1e-05,-3e-06,2.1e-05,8e-06,6.5e-05,-1.1e-05,-8e-05,7.8e-05,0.000145,1.9e-05,-6.8e-05,1.5e-05,-8.2e-05,7.1e-05,7e-06,5.4e-05,1.2e-05,-0.000209,2.7e-05,-2.3e-05,0.000126,7.5e-05,0.000129,-1e-05,7.9e-05,0.00012,5.1e-05,-1.8e-05,1.3e-05,2.5e-05,-3.1e-05,1.5e-05,2.4e-05,-3.6e-05,-0.000133,0,4.4e-05,0.000102,1.3e-05,3.6e-05,-4.5e-05,-0.000103,1.9e-05,-9e-05,1.2e-05,-6e-06,-5.4e-05,4.5e-05,1.4e-05,2.2e-05,0.000124,-8e-06,2.1e-05,-5.1e-05,-7.2e-05,6.9e-05,2.8e-05,-5.7e-05,-0.000104,-6.2e-05,1.2e-05,-1.2e-05,-1.9e-05,7.2e-05,4.7e-05,1.8e-05
-2.3e-05,2.9e-05,-1.1e-05,6e-06,7.4e-05,-1.8e-05,2.6e-05,-1.1e-05,-8.5e-05,0,3e-06,1.1e-05,2.5e-05,0.000126,-8.8e-05,1.6e-05,3.7e-05,-4.5e-05,-0.000156,-5.1e-05,6e-06,3e-05,-4.3e-05,-0.00013,-3.1e-05,-1e-06,1.6e-05,2.7e-05,0,0.000149,-2.3e-05,-6.4e-05,-6.4e-05,-7e-06,1.4e-05,-5e-06,-2.5e-05,1e-05,0,1.1e-05,2.9e-05,0.000127,4.8e-05,2.9e-05,-3e-06,5.1e-05,1e-06,-7.1e-05,-2e-05,3e-06,-0.00016,0.000167,-2.9e-05,0.000116,5e-06,-5.3e-05,0.000116,-7.7e-05,5e-05,1.5e-05,0.00012,0.000113,-1.2e-05,8.3e-05,7.9e-05,8.3e-05,4.5e-05,-5e-06,-0.00011,2e-05,-6.3e-05,-3.1e-05,7.3e-05,-0.000106,-1e-05,-5.9e-05,-7e-06,1.8e-05,-3.8e-05,-4e-06,2e-06,-2.2e-05,7.3e-05,4.1e-05,5.7e-05,-3.2e-05,0.000115,-1.9e-05,2.2e-05,-3e-05,6.2e-05,-3.4e-05,-2.5e-05,-5.6e-05,-6e-06,2.2e-05,-4.7e-05,-1.6e-05,0.000178,7.6e-05,-2.1e-05,5.6e-05,-4.9e-05,5.1e-05,5.5e-05,-0.000124,-0.000129,-2.5e-05,4.6e-05,-4e-05,-0.000133,-1e-06,1.9e-05,-2.6e-05,4.4e-05,-1.8e-05,-5.1e-05,2.9e-05,2e-05,-9e-06,-0.000124
2.9e-05,-2e-06,-3e-06,-3.5e-05,-0.000102,2.1e-05,-4.8e-05,-6e-06,1e-05,-2e-05,-5.9e-05,-1.9e-05,-1.5e-05,-4.3e-05,2e-06,1.3e-05,-1.3e-05,3.6e-05,3e-05,6.1e-05,4.2e-05,1.9e-05,2.9e-05,0.000119,3.1e-05,1.9e-05,-2e-06,-3.2e-05,-0.000118,-1e-05,2.5e-05,3e-05,3.8e-05,-4.5e-05,2.6e-05,3.5e-05,2.4e-05,-5.9e-05,-9e-06,-1.7e-05,-7e-06,-4.8e-05,-0.000122,-3.7e-05,6e-05,-9.8e-05,2.2e-05,6.1e-05,3.6e-05,-9.5e-05,5.1e-05,-6.5e-05,-4e-06,-4.7e-05,2.7e-05,-1.3e-05,2.4e-05,-5.1e-05,-3.1e-05,1.2e-05,-2.4e-05,6e-06,5e-05,-0.000123,-3.1e-05,-3.2e-05,-2.9e-05,0.000104,1.3e-05,1.3e-05,3e-05,-1.6e-05,-1.2e-05,3.7e-05,-3e-05,-2.3e-05,-4.6e-05,-4.8e-05,-1.8e-05,-5.5e-05,5e-06,-2.7e-05,-4.1e-05,-5.8e-05,-3.8e-05,5.7e-05,-0.000159,-1.4e-05,3.3e-05,6.6e-05,-2.6e-05,-1.2e-05,6.8e-05,-6.4e-05,2.5e-05,-8.8e-05,3.3e-05,3e-06,-0.000121,2.9e-05,2.2e-05,-6.7e-05,3e-06,5e-06,4.8e-05,-2e-05,0.000101,-1.4e-05,2.7e-05,2e-05,5.7e-05,-3.5e-05,-3.1e-05,4e-05,4.3e-05,-2.3e-05,-1e-05,-2.8e-05,-2.2e-05,-2.1e-05,0.000111
6e-06,-4.6e-05,2.9e-05,1.7e-05,2.2e-05,-3.6e-05,-1.9e-05,2.5e-05,6.2e-05,5e-06,8.9e-05,1.7e-05,-1.4e-05,0,4.3e-05,-4.4e-05,4.1e-05,-2.5e-05,4e-06,2.2e-05,-3.2e-05,2.2e-05,4.6e-05,2.9e-05,1.3e-05,-1.2e-05,-6e-06,-1.1e-05,4.3e-05,-3.2e-05,-8e-06,3.9e-05,-1.2e-05,4.5e-05,-2.7e-05,-5e-05,2.3e-05,1.6e-05,-5.8e-05,-1e-05,-1.1e-05,0,-2.2e-05,7e-06,-3.2e-05,8e-05,0,1.8e-05,-5e-06,-2.2e-05,-4e-06,-8.8e-05,3.3e-05,-8.4e-05,1.4e-05,4.6e-05,-1.9e-05,-6e-06,1.3e-05,-1e-05,-6e-06,1e-06,-5.2e-05,5.3e-05,5.8e-05,4.1e-05,2e-06,-2.1e-05,3e-05,2e-06,-2.3e-05,3.4e-05,1e-05,3.1e-05,4.7e-05,4.3e-05,-1.9e-05,-5.3e-05,1.2e-05,3.7e-05,-6.3e-05,2.2e-05,1.1e-05,2.2e-05,-2e-06,-4.1e-05,5.4e-05,2.4e-05,-6.5e-05,2.1e-05,-7.1e-05,3.6e-05,-2.7e-05,2.7e-05,2.1e-05,7.8e-05,1.8e-05,1e-05,8.7e-05,-7e-06,8e-06,4.1e-05,-7.7e-05,-4.4e-05,-1.3e-05,6.5e-05,-4.1e-05,-2.5e-05,-4.8e-05,2.4e-05,-1e-05,-9e-06,-4.3e-05,2.9e-05,-6.2e-05,5.1e-05,2.3e-05,-6.5e-05,-6.1e-05,-1.7e-05,-6.3e-05
-4e-05,8e-06,-3.8e-05,-2.6e-05,4.3e-05,4.3e-05,1.2e-05,-8e-06,2.3e-05,5e-06,-8.3e-05,8e-06,2e-05,1.3e-05,-3.3e-05,9e-06,-1.3e-05,1e-06,-2e-06,-1.1e-05,-6e-06,-2.5e-05,-8.1e-05,-6.2e-05,-1.5e-05,-2.2e-05,2e-06,1.5e-05,1.4e-05,-7.1e-05,7e-06,-1.8e-05,-2.8e-05,3.9e-05,-4e-06,-3e-06,-4.1e-05,4e-05,3.3e-05,-4e-06,5e-06,-1.4e-05,7.4e-05,4.7e-05,-4.4e-05,-5.3e-05,0.000106,2.7e-05,-2.8e-05,0.000105,-6e-06,3.2e-05,-2.4e-05,-3.2e-05,-1.1e-05,2e-05,-9.8e-05,-2.4e-05,-5.3e-05,-4.1e-05,4.5e-05,-4.5e-05,-1.3e-05,7.2e-05,-4.8e-05,-4.7e-05,1.6e-05,-3.5e-05,1.4e-05,-7e-06,-6e-06,-2.6e-05,-1e-05,1.5e-05,-5.4e-05,-6e-05,4e-05,6.9e-05,1.6e-05,-2.7e-05,-5.5e-05,8e-06,-4.1e-05,1.9e-05,-1.8e-05,2.4e-05,-3e-06,-2.8e-05,3.7e-05,-7.9e-05,-1e-05,-2.5e-05,-7.7e-05,6.4e-05,-6e-06,3.6e-05,-2.2e-05,-1e-06,-7.7e-05,-0.000121,9e-06,-1e-05,7e-06,1.4e-05,-5.9e-05,3.5e-05,-5e-06,1e-06,2.9e-05,9e-06,6e-06,-1.1e-05,3.1e-05,-4.1e-05,-2.8e-05,-6.1e-05,1.2e-05,5.4e-05,4.2e-05,3.3e-05,-7e-06
5.2e-05,2e-05,2e-06,1.4e-05,-4.1e-05,-3.3e-05,3.8e-05,7e-06,8e-06,3.2e-05,5.8e-05,-3.1e-05,-8e-06,3.4e-05,1.6e-05,5.1e-05,-3.7e-05,1.9e-05,2.2e-05,-3.6e-05,2.5e-05,-2.4e-05,6.8e-05,-2.4e-05,3e-06,-1.4e-05,0,1.8e-05,-3e-05,1.3e-05,-1.5e-05,-2.3e-05,2.4e-05,3.1e-05,-1.7e-05,5e-05,8e-06,-1.9e-05,7e-06,1.7e-05,1.6e-05,1.1e-05,-1.4e-05,-4.4e-05,7e-06,0,-0.000103,2.7e-05,5e-06,-1.9e-05,4e-05,1.8e-05,2.8e-05,3.1e-05,-8e-06,-4.9e-05,3e-06,4e-06,1.2e-05,-7e-06,8e-06,-6e-06,2e-05,-0.000127,5e-05,3.3e-05,1e-05,-2e-06,-3.5e-05,5e-06,1.3e-05,1.5e-05,2.6e-05,-4e-05,6.3e-05,1.3e-05,1e-06,9e-06,-1.7e-05,-1.6e-05,5.1e-05,-2e-06,2.4e-05,-4.2e-05,-9e-06,1.2e-05,-1e-06,2.4e-05,-3.1e-05,-1e-05,4.8e-05,8e-06,4.7e-05,0,-1.6e-05,-3e-06,-3.8e-05,-1e-06,5e-06,5.2e-05,-3.4e-05,3.1e-05,-3.9e-05,3.4e-05,-6e-06,-7.4e-05,1.8e-05,8e-06,-1e-05,-1.7e-05,-3e-06,-3.9e-05,-5e-05,-8e-06,3.3e-05,4e-05,-2.8e-05,3e-06,-9e-06,1e-06,0
-4.2e-05,-1.2e-05,2.3e-05,1.4e-05,1.5e-05,7e-06,-3.9e-05,-1.4e-05,-3.8e-05,-7e-06,-1.1e-05,4.3e-05,-1e-05,3.7e-05,3.3e-05,-3.2e-05,4.4e-05,-4.6e-05,-1.7e-05,0,-1.1e-05,1.4e-05,-2.7e-05,7.6e-05,-4e-06,7e-06,2e-06,-2e-05,1.2e-05,5.2e-05,3.2e-05,6e-06,6e-06,-1e-05,1.4e-05,-2.3e-05,3.4e-05,-5e-06,-3.2e-05,0,-4.2e-05,-1.6e-05,-3.2e-05,-7e-06,-1.5e-05,3.3e-05,-1.1e-05,-4.6e-05,6e-06,-3e-05,-6.6e-05,-4.5e-05,-4e-06,2.8e-05,9e-06,1.8e-05,3.4e-05,1.1e-05,2.1e-05,1.8e-05,-5.8e-05,-8e-06,-2e-05,-1e-06,1.4e-05,-3.8e-05,-6e-06,-1.1e-05,-1e-05,8e-06,-3.7e-05,1.1e-05,-1.8e-05,-9e-06,5e-06,4.1e-05,-1.3e-05,-3.8e-05,-3.7e-05,3.1e-05,2e-05,-8e-06,2.2e-05,3.5e-05,3.8e-05,-2.6e-05,-3.8e-05,-8e-06,2.6e-05,5.8e-05,-3.7e-05,1e-05,-2.3e-05,-6.7e-05,-3e-06,4.4e-05,7.6e-05,-8e-06,-1e-06,-2e-05,3e-06,-6.7e-05,1e-06,3e-06,1.9e-05,-1.6e-05,6.2e-05,3e-05,0,-1.2e-05,-2.7e-05,2.8e-05,3e-05,-1.5e-05,3.3e-05,-1.5e-05,2e-06,-2e-06,4.6e-05,-8e-06,1.4e-05
2e-05,-1.1e-05,-1.3e-05,-1.9e-05,-1.9e-05,-6e-06,1.3e-05,1.5e-05,-4.6e-05,3e-06,-5.4e-05,-2.3e-05,1.5e-05,-8.8e-05,-2.4e-05,2.6e-05,2e-06,4.7e-05,2e-06,4.4e-05,8e-06,1.3e-05,1.7e-05,-1.5e-05,0,2.2e-05,-3e-06,-1.3e-05,2.9e-05,2.4e-05,-5.7e-05,1e-06,-1.6e-05,-1.1e-05,1.1e-05,-3.5e-05,-7e-06,2e-05,5.4e-05,-1.1e-05,4.7e-05,2.6e-05,2.7e-05,2.5e-05,-2.1e-05,-5.2e-05,1e-05,-2e-06,-2.9e-05,2.7e-05,4.3e-05,-4.7e-05,8e-06,6e-06,4e-06,-1.2e-05,4.4e-05,-3e-05,-1.2e-05,1.3e-05,-3e-06,1.3e-05,2.3e-05,5.3e-05,-3e-06,-1e-05,-1e-06,3.1e-05,2.9e-05,-1e-05,4.4e-05,-1.7e-05,-4.3e-05,1.5e-05,-2.1e-05,-8.8e-05,2e-06,-2.2e-05,7.8e-05,-1.5e-05,-2e-06,-6e-06,-2e-05,9e-06,6e-06,1.4e-05,5.3e-05,0,-2.1e-05,-6.6e-05,3.4e-05,-5e-06,5.3e-05,-3.9e-05,3e-06,-7.4e-05,-1.1e-05,8e-06,3.5e-05,9.6e-05,7e-06,6.6e-05,4e-06,-2.7e-05,4.7e-05,6.4e-05,3.5e-05,1.6e-05,3e-05,1e-05,3.8e-05,1.1e-05,-8e-06,-5e-06,-1e-05,-8e-06,1.8e-05,3.4e-05,-2.6e-05,-1.9e-05,3e-06
-1e-05,8e-06,-1.5e-05,2.3e-05,5e-06,2e-06,2e-05,-8e-06,3.3e-05,-1.5e-05,3.8e-05,-1.9e-05,-2.4e-05,-2.6e-05,-3e-06,-4.9e-05,-3.6e-05,-1.8e-05,2.7e-05,1e-06,-1.5e-05,1e-05,-2.5e-05,-6e-05,6e-06,-2e-06,-1e-05,3.5e-05,0,-3.4e-05,3.8e-05,-1.6e-05,1.1e-05,-4.7e-05,-6e-06,3.9e-05,-3.7e-05,-2.4e-05,-3.2e-05,1e-06,-3.7e-05,1.8e-05,-1.2e-05,-2.4e-05,4.1e-05,4.7e-05,1e-06,-2.8e-05,-2e-06,-3.2e-05,-2.2e-05,7.5e-05,-6e-06,-6e-06,-1.4e-05,0,1.5e-05,1.3e-05,1.2e-05,1e-05,1.5e-05,9e-06,-3e-06,-1.7e-05,-1.4e-05,2.5e-05,1.5e-05,-5e-06,-6e-06,-9e-06,-3.4e-05,-7e-06,8.8e-05,4e-06,-2.5e-05,7.2e-05,-1e-06,5.3e-05,-6.6e-05,1e-06,2.4e-05,1.3e-05,8e-06,-3.3e-05,-1.7e-05,8e-06,-3.5e-05,1e-05,2.8e-05,1.5e-05,4e-05,-1.9e-05,-2.3e-05,5.3e-05,4e-06,-2.1e-05,-6.6e-05,-1e-06,-3.8e-05,-3.2e-05,5e-06,-4.2e-05,-2.5e-05,1e-06,-4e-06,-1e-05,0,-1.6e-05,-3.4e-05,-1e-05,1e-06,-7e-06,4e-06,1.3e-05,-2.7e-05,-9e-06,1.1e-05,-3.5e-05,-4.1e-05,1.2e-05,-3.9e-05
7e-06,6e-06,2.2e-05,-1.9e-05,1.8e-05,1.4e-05,-1.2e-05,3e-06,2.2e-05,-9e-06,-4.3e-05,3.2e-05,6e-06,-9e-06,1e-05,2.3e-05,3e-05,-6e-06,-6.4e-05,-4.2e-05,5e-06,-1e-05,1.9e-05,3.6e-05,-3e-06,-1e-05,1.4e-05,-1.2e-05,-3.5e-05,-3.5e-05,-2.8e-05,4e-06,1e-06,3e-06,1e-06,-1e-06,1.1e-05,8e-06,4e-06,-4e-06,1.4e-05,-6.9e-05,-2.6e-05,-9e-06,2.3e-05,-2.4e-05,5.9e-05,1.2e-05,1.2e-05,-1.7e-05,2.1e-05,-2.3e-05,-1.3e-05,7e-06,5e-06,1e-06,-2.7e-05,1.6e-05,-1.7e-05,-1.1e-05,-2.3e-05,-3.3e-05,-8e-06,-2.5e-05,-4.2e-05,-1.5e-05,-1.2e-05,-8e-06,8e-06,3e-06,3.8e-05,-1e-06,-7.7e-05,-3.1e-05,2.8e-05,-3.6e-05,-6e-06,-1e-06,4.7e-05,1.4e-05,-3.8e-05,6e-06,-1e-05,2.4e-05,2e-06,-2e-05,-2.1e-05,-8e-06,-3.3e-05,1e-05,-7.7e-05,1.5e-05,-2.3e-05,2.2e-05,3e-06,1e-06,4.2e-05,-1.5e-05,3.7e-05,-1.1e-05,1.4e-05,2.1e-05,3.3e-05,2e-05,-5.6e-05,-5e-05,-1.6e-05,-2.1e-05,1.2e-05,6e-06,-3.3e-05,1.6e-05,3.2e-05,-3.1e-05,1e-06,1e-05,-1.1e-05,3e-06,4.1e-05,1.4e-05,6.1e-05
-3e-06,-9e-06,-5e-06,2e-06,-2.3e-05,-6e-06,2e-06,-2e-06,-4e-06,-7e-06,2.8e-05,-1.7e-05,-1e-05,4.2e-05,-1.8e-05,2.6e-05,5e-06,1.9e-05,4.4e-05,6e-06,1.3e-05,-2e-05,-1.2e-05,4e-05,-5e-06,-9e-06,2e-06,-6e-06,3.3e-05,1e-05,3e-05,2.2e-05,-8e-06,-8e-06,-1.3e-05,-2.7e-05,1.9e-05,1.3e-05,9e-06,8e-06,8e-06,6.4e-05,2.5e-05,2.2e-05,-3.5e-05,2e-06,-4.9e-05,2.3e-05,-7e-06,3.5e-05,-3e-05,-3.9e-05,9e-06,-1e-05,-3e-06,2.2e-05,-3.9e-05,-3e-06,1e-05,-8e-06,6e-06,6e-06,1e-05,5.9e-05,7e-06,1.7e-05,-8e-06,-6e-06,-1.9e-05,2e-06,-2.5e-05,1.8e-05,3.7e-05,1.7e-05,-1.7e-05,1e-05,9e-06,-2.8e-05,-2.3e-05,-1.6e-05,-2.3e-05,-1.5e-05,7e-06,1e-06,-5e-06,5e-06,1e-06,4e-06,2.1e-05,-2.9e-05,3.7e-05,-3e-06,1.4e-05,-1.4e-05,2e-06,-8e-06,1.7e-05,1.2e-05,-2.8e-05,-2.4e-05,-1.4e-05,-1e-05,-2e-06,-1e-06,-1e-06,1e-05,-3.5e-05,-1.3e-05,-3e-06,2e-06,1.9e-05,-7e-06,-1.8e-05,6e-06,1.9e-05,-1.6e-05,-1.3e-05,3e-06,-8e-06,1e-06,-2.9e-05
0,-2e-06,-1.4e-05,-5e-06,1e-06,4e-06,-1.7e-05,-4e-06,-4e-06,6e-06,1e-06,-5e-06,2e-06,1.7e-05,-2e-06,-2.4e-05,-2.3e-05,-2.3e-05,1e-05,2.4e-05,-2.7e-05,1e-05,9e-06,-4.8e-05,3e-06,0,-7e-06,5e-06,1.9e-05,2.9e-05,-1.2e-05,-9e-06,-2e-06,4.1e-05,8e-06,2.4e-05,-1e-06,-3e-06,-5e-06,-2e-06,-2.5e-05,-3.1e-05,2.2e-05,-7e-06,3e-06,2.4e-05,5e-06,-2e-06,2e-06,2.4e-05,3.8e-05,7e-05,7e-06,-1.4e-05,9e-06,-2.9e-05,-1.8e-05,3e-05,1e-05,-1.2e-05,2.9e-05,2e-06,-1.7e-05,5e-06,5e-06,7e-06,9e-06,-1.3e-05,-3e-06,-6e-06,1e-05,1.5e-05,2e-06,8e-06,2.3e-05,1.7e-05,1e-05,-9e-06,0,1.5e-05,2.7e-05,0,0,-1.9e-05,-6e-06,2e-06,3.9e-05,-2e-06,-9e-06,1.2e-05,-4.1e-05,0,-2e-05,-3.3e-05,-9e-06,5.3e-05,-2.6e-05,3e-06,2e-06,-3.1e-05,-6e-06,4e-06,2.3e-05,-1e-05,2.6e-05,5e-05,-9e-06,-4e-06,-1.1e-05,0,1.2e-05,-9e-06,3.5e-05,-9e-06,5e-06,1.4e-05,-1e-06,-2.5e-05,2.2e-05,-1.3e-05,1.9e-05
4e-06,1e-06,1.7e-05,-8e-06,2.1e-05,-3e-06,2.3e-05,4e-06,-2.7e-05,7e-06,-3.1e-05,2.9e-05,-8e-06,-2.5e-05,1.6e-05,4e-06,4e-06,2.7e-05,-3.9e-05,7e-06,1.5e-05,1e-05,-3.4e-05,-2.5e-05,-2e-06,1.2e-05,-3e-06,-1e-05,-5.2e-05,1.3e-05,-9e-06,-1.6e-05,8e-06,8e-06,3e-06,1e-06,-1.1e-05,-1.7e-05,-4e-06,-3e-06,3.1e-05,6e-06,-2.9e-05,-1e-05,3.7e-05,-3.4e-05,-2.5e-05,1.3e-05,1.3e-05,-3.2e-05,-1.8e-05,-2e-06,-6e-06,-5e-06,-5e-06,3e-06,3.3e-05,1.1e-05,-4e-06,2e-06,-6e-06,1.9e-05,6e-06,-5e-05,2e-06,-2.4e-05,-6e-06,2.9e-05,3e-05,-2e-06,2e-06,-1.7e-05,-2.5e-05,1.8e-05,-1e-06,-2.6e-05,-7e-06,3.3e-05,1.8e-05,-1e-06,-2e-06,3e-06,-1.1e-05,2.2e-05,2.3e-05,2e-06,-3.7e-05,-5e-06,1e-05,1.5e-05,3.9e-05,5e-06,3.2e-05,3e-06,-2e-06,-2e-06,-1.1e-05,-1.1e-05,2e-05,3.3e-05,1e-06,-5e-06,1e-06,-1e-06,1.7e-05,-2.7e-05,-3.9e-05,6e-06,2.1e-05,0,-9e-06,2.2e-05,-1.4e-05,3e-06,-1.7e-05,-1.1e-05,6e-06,1.9e-05,-2.4e-05,-2e-06,-2.2e-05
-6e-06,7e-06,5e-06,2.2e-05,-1.2e-05,-3e-06,-6e-06,-3e-06,7e-06,2e-06,3.3e-05,-2.8e-05,9e-06,1.4e-05,-1.2e-05,-1.2e-05,-6e-06,-2.1e-05,2.9e-05,-1.7e-05,1.5e-05,3e-06,5.9e-05,5.9e-05,4e-06,0,4e-06,1.5e-05,2.3e-05,-1.9e-05,-9e-06,1.2e-05,-8e-06,6e-06,3e-06,-2e-05,5e-06,-6e-06,1.2e-05,1e-06,-2.8e-05,1.6e-05,-7e-06,1.4e-05,-1e-05,2.9e-05,1.2e-05,-2e-05,-4e-06,-7e-06,0,-2.1e-05,-8e-06,1.7e-05,4e-06,9e-06,3.1e-05,-1.7e-05,2e-06,2.1e-05,-1.1e-05,-3e-06,5e-06,2.8e-05,1.6e-05,1.4e-05,-5e-06,-1e-06,-2.4e-05,3e-06,-1.8e-05,-8e-06,1.9e-05,-1.8e-05,-1.4e-05,3.2e-05,-6e-06,-5e-06,-3.1e-05,-1.4e-05,1.9e-05,1.4e-05,1.9e-05,-8e-06,-1.2e-05,3e-06,1e-06,2e-06,-9e-06,-1e-05,1.3e-05,-3e-06,-2e-06,-1e-06,-4e-06,5e-06,2.1e-05,8e-06,-1.6e-05,1.9e-05,5e-06,5e-06,-4e-06,9e-06,-4e-06,-3.9e-05,0,1e-05,-2.2e-05,-5e-06,6e-06,-6e-06,1e-06,1.2e-05,1e-06,5e-06,5e-06,1.1e-05,-2.3e-05,3e-06,4.1e-05
5e-06,-1e-05,-1.7e-05,-9e-06,-9e-06,3e-06,-2.4e-05,0,2.8e-05,-1e-06,-1.3e-05,1e-06,-1.3e-05,1e-05,-3e-06,2e-05,-1e-06,4e-06,1.7e-05,-2e-05,-2.2e-05,-4e-06,-5.4e-05,-6e-06,-1e-06,-9e-06,6e-06,-1.2e-05,2.2e-05,-1.6e-05,1.4e-05,1.2e-05,1e-05,-1.3e-05,1e-06,2e-05,0,2.9e-05,-4e-06,-2e-06,1.8e-05,-2.7e-05,2.7e-05,5e-06,-2.2e-05,-1.8e-05,3.3e-05,-2e-06,-2e-06,1.4e-05,1.6e-05,1.6e-05,4e-06,2.4e-05,-2e-06,0,9e-06,-6e-06,-1e-05,5e-06,1.2e-05,0,-2e-06,-5e-06,-1.1e-05,-3e-06,5e-06,-1.3e-05,-2e-06,1e-06,2.3e-05,-4e-06,-6e-06,-1e-05,-4e-06,-2e-05,3e-06,-2.2e-05,2.7e-05,1.3e-05,5e-06,-5e-06,-1.2e-05,-1.1e-05,-7e-06,-1e-06,2.1e-05,-4e-06,2e-06,-8e-06,-2.3e-05,-7e-06,-5e-06,5e-06,-2e-06,-7e-06,1.5e-05,-1e-06,3e-06,2.4e-05,1e-06,1e-06,1e-06,-4e-06,-2.1e-05,3e-05,-8e-06,6e-06,9e-06,-4e-06,-7e-06,5e-06,0,-3e-06,1.6e-05,-4e-06,-6e-06,-1.9e-05,3.3e-05,8e-06,-2.1e-05
-4e-06,2e-06,7e-06,-5e-06,1.7e-05,1e-06,1.7e-05,-1e-06,2e-06,-3e-06,1.2e-05,2.6e-05,0,2.7e-05,9e-06,-5e-06,1.2e-05,9e-06,-3.2e-05,2.2e-05,1.5e-05,-1.2e-05,3.3e-05,-4.8e-05,0,-1e-05,-2e-06,-5e-06,-4.4e-05,-2e-06,7e-06,-9e-06,-5e-06,-2.7e-05,-6e-06,0,0,-2.2e-05,-1.1e-05,2e-06,-6e-06,1e-05,-1.4e-05,-1.3e-05,1.5e-05,-4e-06,-2.2e-05,0,6e-06,-1.8e-05,-2.7e-05,9e-06,0,-3e-06,-4e-06,-2e-06,-2.3e-05,-4e-06,3e-06,-6e-06,-1e-06,-2e-06,7e-06,-2.1e-05,9e-06,-5e-06,3e-06,-4e-06,0,0,-2.8e-05,6e-06,1.6e-05,1.7e-05,1.3e-05,-4e-06,1e-06,-3e-06,-1.3e-05,-5e-06,-3.2e-05,-1.1e-05,7e-06,1.4e-05,4e-06,-4e-06,-2.3e-05,4e-06,1e-06,2.8e-05,-3e-06,4e-06,6e-06,7e-06,7e-06,-3.6e-05,-3.4e-05,-7e-06,-5e-06,-1.2e-05,0,-8e-06,-2e-05,-8e-06,-9e-06,3.5e-05,2.1e-05,0,4e-06,1.3e-05,2.2e-05,1.8e-05,-2.7e-05,-1e-05,-6e-06,-6e-06,-1e-06,2.6e-05,-6e-06,-6e-06,1e-06
4e-06,1e-06,9e-06,-3e-06,-9e-06,-7e-06,2e-06,2e-06,-4e-06,-1e-06,9e-06,-2.9e-05,2e-06,-2e-05,-2e-06,-1e-06,-2e-05,-1.9e-05,1.1e-05,1.5e-05,-2e-06,4e-06,-3.1e-05,1.8e-05,-1e-06,-1e-06,-7e-06,1.4e-05,1.3e-05,2e-05,-6e-06,-5e-06,0,0,1e-06,-2.5e-05,2e-06,-5e-06,1.1e-05,-2e-06,-2e-06,0,-1.2e-05,-1e-06,-2e-06,2.3e-05,1.5e-05,-5e-06,-3e-06,1e-05,2.8e-05,-1.1e-05,-3e-06,-2.5e-05,0,4e-06,-2.6e-05,-6e-06,7e-06,-1.2e-05,-1.3e-05,1e-06,-8e-06,6e-06,6e-06,1.5e-05,-1e-06,-4e-06,1e-06,0,2.5e-05,8e-06,-3e-05,7e-06,-1.1e-05,3e-05,-1e-06,2.4e-05,-4e-06,-5e-06,7e-06,-4e-06,-1.2e-05,-7e-06,1e-06,-2e-06,0,-1e-06,-3e-06,-1.3e-05,1.2e-05,4e-06,-3.3e-05,2e-06,-2e-06,2e-06,8e-06,7e-06,1.4e-05,-4.9e-05,1e-06,1.2e-05,8e-06,-1e-06,1e-05,-3.9e-05,2.3e-05,-5e-06,-9e-06,0,-9e-06,-1.8e-05,1.4e-05,3e-06,-1.6e-05,-3e-06,8e-06,-1.5e-05,2e-05,-4e-06,7e-06
-4e-06,1e-06,-1.6e-05,-1e-06,0,7e-06,4e-06,-2e-06,-1.7e-05,-3e-06,-1.5e-05,3e-06,-5e-06,-3e-05,-1e-06,-1.1e-05,-4e-06,2.1e-05,6e-06,-1.7e-05,-1.1e-05,8e-06,4.3e-05,4.4e-05,2e-06,8e-06,2e-06,-5e-06,2.4e-05,3e-06,-6e-06,4e-06,4e-06,-7e-06,-1e-06,2e-05,2e-06,1.3e-05,-1.2e-05,-2e-06,4e-06,1.1e-05,2e-05,1.4e-05,-2.4e-05,-3.2e-05,-4.2e-05,1.3e-05,-6e-06,2.4e-05,-1.2e-05,-2.4e-05,0,-1.9e-05,1e-06,-2e-06,-4e-06,3e-06,-6e-06,-1e-06,5e-06,1e-05,-1e-06,2e-05,-4e-06,-1.5e-05,3e-06,1.7e-05,5e-06,1e-06,-1.7e-05,-1e-06,2.7e-05,-6e-06,8e-06,-4.6e-05,3e-06,-1e-06,1.4e-05,1e-05,5e-06,1.3e-05,7e-06,-5e-06,4e-06,3e-06,4e-06,2e-06,8e-06,-6e-06,-2e-05,-3e-06,2e-05,-2.5e-05,-2e-06,4e-06,3.3e-05,0,-1.4e-05,-6e-06,-2e-06,-1.6e-05,-1.5e-05,4e-06,2.1e-05,-2.2e-05,2e-05,-6e-06,1.6e-05,-7e-06,-1.5e-05,-3e-06,-2.4e-05,6e-06,5e-06,8e-06,3e-06,-9e-06,-3.2e-05,2e-06,2e-06
3e-06,-3e-06,2e-06,1.3e-05,7e-06,-7e-06,-7e-06,-1e-06,-8e-06,2e-06,1.7e-05,2.4e-05,3e-06,-1.6e-05,6e-06,1.3e-05,1.7e-05,-1.7e-05,-5e-06,-1.2e-05,1.8e-05,1e-06,-4.1e-05,-3.6e-05,-1e-06,0,8e-06,0,-2.6e-05,-5e-06,-1.2e-05,-2e-06,-1e-05,3.1e-05,1e-06,1.1e-05,-9e-06,-7e-06,3e-06,1e-06,-4e-06,-2.1e-05,-5e-06,-9e-06,8e-06,2.9e-05,2e-05,-6e-06,-1e-06,-9e-06,-5e-06,1.8e-05,2e-06,7e-06,0,-9e-06,1.4e-05,-2e-06,2e-06,3e-06,0,-2e-06,2e-06,-8e-06,-1e-06,1.1e-05,4e-06,-6e-06,-1e-05,1e-06,8e-06,1e-06,-1.6e-05,-3e-05,8e-06,3.7e-05,-2e-06,-1.6e-05,-1.2e-05,-7e-06,-1.1e-05,4e-06,3e-06,1.3e-05,8e-06,-3e-06,1e-05,1e-06,-1e-05,6e-06,2.2e-05,2e-06,-4e-06,-1.7e-05,4e-06,1.4e-05,-3.2e-05,-5e-06,2.6e-05,1.8e-05,4e-06,2.5e-05,-1e-06,-1e-06,0,4e-05,1.3e-05,-5e-06,-1.3e-05,-3e-06,1.8e-05,1.3e-05,1.1e-05,8e-06,1.5e-05,-1.1e-05,-9e-06,1.9e-05,-6e-06,7e-06,1e-06
-2e-06,-2e-06,1.5e-05,-6e-06,-1.1e-05,5e-06,-5e-06,1e-06,1.8e-05,2e-06,-9e-06,-2.8e-05,-6e-06,6e-06,-4e-06,-3e-06,-1e-05,5e-06,-1.3e-05,4e-06,-1.3e-05,-4e-06,2.7e-05,-2.8e-05,1e-06,-6e-06,-3e-06,-2e-06,3e-06,-1.1e-05,2.2e-05,-3e-06,8e-06,-1e-06,1e-06,-2.5e-05,0,-3e-06,8e-06,-1e-06,5e-06,1.8e-05,-1.8e-05,-1.1e-05,1.5e-05,-1.3e-05,1.4e-05,5e-06,3e-06,-2.5e-05,7e-06,-3e-06,3e-06,2.6e-05,-1e-06,1.5e-05,2.2e-05,-9e-06,-4e-06,7e-06,-1e-05,-4e-06,0,-5e-06,-1.2e-05,-1.1e-05,-3e-06,1e-06,0,0,2e-06,-9e-06,1e-06,1e-05,-1.5e-05,-1.5e-05,-3e-06,-1e-06,7e-06,0,2.4e-05,-5e-06,-5e-06,-1.2e-05,-1.7e-05,7e-06,-2.6e-05,-1e-06,1.1e-05,-3e-06,-1e-05,-1e-06,1.7e-05,1.4e-05,-6e-06,2.5e-05,-1.1e-05,4e-06,-3.8e-05,2.4e-05,-4e-06,-3.1e-05,0,-2e-06,-1.8e-05,1.2e-05,3e-06,-2e-06,5e-06,0,-5e-06,-1.5e-05,-2e-06,-5e-06,-4e-06,8e-06,-4e-06,-2.2e-05,1.9e-05,-2e-06,-2.2e-05
1e-06,7e-06,-1.1e-05,-5e-06,7e-06,1e-06,1.5e-05,0,9e-06,2e-06,0,8e-06,5e-06,2.5e-05,-1e-06,-9e-06,-5e-06,8e-06,1.5e-05,1.7e-05,2e-06,-6e-06,-2.5e-05,4.6e-05,-2e-06,-6e-06,-6e-06,2e-06,1.3e-05,0,-6e-06,4e-06,-7e-06,1.8e-05,-1e-06,8e-06,7e-06,8e-06,-3e-06,1e-06,-7e-06,-4e-06,1.8e-05,1.4e-05,-1.6e-05,-7e-06,-6e-06,0,-3e-06,5e-06,-5e-06,-1.4e-05,-7e-06,1.5e-05,2e-06,-7e-06,8e-06,3e-06,2e-06,5e-06,4e-06,-8e-06,3e-06,1.3e-05,3e-06,6e-06,-1e-06,-4e-06,8e-06,-1e-06,-1.3e-05,-9e-06,1.7e-05,2.2e-05,-1e-06,-8e-06,2e-06,2e-05,1e-06,4e-06,-1e-06,-1.1e-05,9e-06,3e-06,0,-2e-06,1.6e-05,0,-1.4e-05,-3e-06,4e-06,-4e-06,9e-06,2.8e-05,1e-06,-3e-06,2.6e-05,-1e-06,2.7e-05,3.5e-05,-3e-06,3e-05,-7e-06,0,-8e-06,-3.8e-05,-1e-06,1e-06,3e-06,8e-06,-1.1e-05,4e-06,-6e-06,-3e-06,-1.3e-05,-4e-06,6e-06,4e-06,2e-06,-6e-06,2.7e-05
-1e-06,-4e-06,-6e-06,4e-06,4e-06,-4e-06,-2e-06,-1e-06,-7e-06,-1e-06,6e-06,1.8e-05,-1.1e-05,-3e-06,1e-06,1.6e-05,7e-06,-1.5e-05,5e-06,-1e-06,1.1e-05,1e-06,4.1e-05,9e-06,1e-06,1e-06,1e-06,6e-06,-7e-06,1e-06,7e-06,1e-06,8e-06,-2.5e-05,1e-06,1.2e-05,1e-06,4e-06,-2e-06,-1e-06,6e-06,-1.8e-05,7e-06,4e-06,-1e-06,2.1e-05,2e-05,-5e-06,-1e-06,1.3e-05,-6e-06,1.2e-05,2e-06,-1.2e-05,-2e-06,5e-06,-1e-05,9e-06,3e-06,-3e-06,6e-06,2e-06,-1e-06,-5e-06,3e-06,-4e-06,0,-9e-06,0,-1e-06,2.1e-05,7e-06,-2.4e-05,-1e-06,5e-06,2.3e-05,1e-06,-3e-06,-1.1e-05,-2e-06,-1.7e-05,5e-06,-1.5e-05,6e-06,5e-06,-5e-06,-1e-05,-2e-06,1.5e-05,-1e-05,2.5e-05,0,-2.1e-05,-1e-05,5e-06,-1e-05,-1e-06,-2e-06,-1.9e-05,-4.9e-05,3e-06,-2.5e-05,1.4e-05,-1e-06,6e-06,-9e-06,-2.4e-05,4e-06,-1.1e-05,0,5e-06,7e-06,2.2e-05,4e-06,1e-06,1e-06,2e-06,1.1e-05,1.1e-05,-1e-06,-2.4e-05
