0.000629,0.000803,0.000516,0.000588,0.000202,0.000689,0.000558,0.000428,0.00049,0.000517,0.00064,0.001014,0.000649,0.000604,4.3e-05,8.1e-05,0.000319,0.000294,0.000285,0.000298,4e-05,0.00049,0.000238,0.000182,2e-04,0.000315,0.000352,0.000598,0.000333,0.00022,0.000355,0.000292,0.000133,0.000344,0.000416,0.00035,0.000225,-1.3e-05,-5.8e-05,-0.00019,9.8e-05,0.000127,-1.6e-05,5.6e-05,0.000307,0.000231,0.000151,0.000145,0.000164,0.000218,0.000144,0.000297,6.9e-05,0.000127,0.000315,0.000374,0.00015,0.000378,0.000167,0.000364,0.000156,-3.9e-05,-1.5e-05,0.00011,-2e-06,2.6e-05,-7.2e-05,-0.004557,-0.011498,-0.006566,-0.002073,-0.006462,-0.00597,-0.005727,-0.002772,-0.002107,-0.00137,-0.00224,-0.00112,-0.00148,-0.000923,-0.001128,-0.002483,-0.001383,-0.001599,-0.001697,-0.001272,-0.001398,-0.001852,-0.001034,-0.00048,-0.000727,-0.000797,-0.000776,-0.000568,0.000269,-1.8e-05,-0.000284,-0.000667,-0.003659,-0.002078,-0.000842,-0.000681,-0.000698,-0.00021,-0.000649,-0.000421,-0.000655,-0.000204,-6e-05,5e-06,9.2e-05,-0.000113,-4.3e-05,0.000184,6e-06,-8.1e-05,6.5e-05,3.6e-05,3.3e-05,1.5e-05
-0.000524,-0.001767,-0.000756,-0.001091,-0.000535,-0.000949,-0.000827,-0.000871,-7.3e-05,-0.000488,-0.000979,-0.001151,-0.000794,-0.000662,-0.000373,4.6e-05,-0.000176,-2.7e-05,-0.00021,0.000159,-0.000203,-0.000398,-0.000252,-0.000245,-0.000162,4e-06,-0.000199,-0.000151,-1e-04,-9.2e-05,-6.1e-05,-2.4e-05,-3.7e-05,-8.7e-05,9.7e-05,-0.000158,-0.000133,-9.9e-05,6.6e-05,0.000237,0.000229,0.000107,0.000161,7.5e-05,0.000115,9.6e-05,-2e-06,-2.5e-05,-5.6e-05,4.8e-05,-0.000114,-8.6e-05,6.9e-05,-0.000129,2.1e-05,0.000215,-5.4e-05,-0.000101,3.6e-05,4e-05,0.000138,1.2e-05,-6.1e-05,-8.7e-05,6.2e-05,2e-04,0.000185,-5.3e-05,0.006355,0.003305,-0.000189,0.001721,0.002087,0.003031,0.000597,-0.000818,0.000621,0.000981,-0.000112,0.000626,0.000493,0.000196,0.000789,0.000941,0.000509,0.001128,0.000241,0.000309,0.000521,0.000351,0.000488,0.000736,0.000365,0.000754,0.000472,0.000105,9.3e-05,0.000104,0.000262,0.002123,0.001379,0.000825,0.001037,0.000639,0.000635,0.000555,0.000303,0.000293,3e-06,0.000215,0.000209,3e-05,4.3e-05,6.3e-05,8.4e-05,0.000233,0.000195,0.000114,-1e-05,0.000205,7.9e-05
-0.000158,-0.001034,-0.000173,0.000237,-0.000517,-0.000696,-0.00046,-0.000209,-0.000346,-0.000711,-0.000826,-0.000849,-0.00034,-0.000365,-0.000132,-0.000282,-0.000245,-5.7e-05,-0.000242,-0.000549,-0.000145,-0.000236,5.1e-05,-7.1e-05,-0.000198,-8.8e-05,-0.000306,-0.000456,-0.000288,-0.000262,-0.000309,-2.7e-05,-8.7e-05,-0.000118,-0.000103,-0.000213,-8.5e-05,9e-05,-3.6e-05,-0.000125,-5.4e-05,-7.8e-05,-9.6e-05,-0.000102,-5.6e-05,-4.1e-05,-2.8e-05,-7.4e-05,-5.1e-05,-3.3e-05,1.3e-05,-0.000193,-0.000102,-0.000106,-0.000143,1.9e-05,7e-05,-0.000185,-9.9e-05,-4.8e-05,-5e-05,6.8e-05,-1.8e-05,-1e-06,3e-05,2.9e-05,-3.3e-05,-0.000243,-0.002588,-0.000799,0.000385,-0.000387,0.000644,-0.000503,-0.000358,0.000949,0.00113,-0.000849,-0.000229,-0.00058,-0.000434,-0.000181,0.000181,-0.000703,-0.000275,-0.000932,-0.000116,0.000454,0.000377,-0.000462,-0.000137,-0.000639,-0.000366,-9.7e-05,-0.000308,-0.000334,2.3e-05,-0.000229,-4.3e-05,-0.001233,-0.000824,-0.000382,-0.000265,-0.000397,-0.000214,-0.000269,-0.000244,-0.000207,-0.000156,-5.9e-05,-9e-05,-4.4e-05,-0.000107,-0.000101,1.7e-05,1.2e-05,-5.3e-05,-0.00016,-4.5e-05,-6.1e-05,-0.000232
0.000815,0.000952,0.000727,0.000598,0.000425,-0.000158,0.000322,0.000218,-7.8e-05,-1.5e-05,0.000768,7.2e-05,-5.9e-05,3e-04,0.00021,3.1e-05,0.000169,0.000156,9.8e-05,4.8e-05,0.000321,0.000372,0.000114,8.6e-05,-8.8e-05,-4.1e-05,-7.9e-05,-5.9e-05,0.000246,1e-05,-8.5e-05,-8.8e-05,9.3e-05,-0.00012,9.7e-05,-4.4e-05,2.3e-05,-0.000117,-5.9e-05,0.000123,0.000139,-7.1e-05,6.3e-05,0.000182,7.7e-05,-2.7e-05,-2e-05,-9.9e-05,-7.8e-05,3.6e-05,-0.000144,-6.4e-05,-4e-05,-9.3e-05,-3.8e-05,-2e-05,-7e-05,-9.2e-05,-8e-05,-2.2e-05,2.5e-05,2.4e-05,5e-06,-1.7e-05,-3e-05,-2.6e-05,-4.6e-05,2e-06,0.002328,0.000955,-0.000394,-0.000474,-0.002513,-0.001444,-0.000408,-0.000834,-0.001109,-0.000331,-0.000207,0.000388,-0.000486,-0.000279,-0.00065,0.000721,5e-06,3e-04,-0.000235,-0.00086,-0.000256,4.2e-05,6e-06,-7.9e-05,0.00021,0.000227,0.000131,-0.000445,-0.000441,-0.000102,-0.00037,0.00045,0.000234,-4e-06,-0.00025,0.000156,0.000171,0.00023,0.000118,4.1e-05,-7.5e-05,-1.1e-05,9.3e-05,-3.8e-05,-3e-05,-0.000145,-3.5e-05,-4.3e-05,4e-05,5e-06,3e-05,9.3e-05,2.8e-05
-7.5e-05,0.000597,-5e-05,-0.000367,0.000397,0.000239,0.000415,-2.6e-05,-0.000169,0.000186,5.7e-05,0.000522,-0.000371,0.000193,0.000235,5.5e-05,-0.000189,8e-05,-1.3e-05,-4.8e-05,-0.000517,-0.000148,-0.000157,-3.1e-05,6.3e-05,0.000105,0,0.000106,0.000104,0.000139,7.5e-05,0.000103,7.4e-05,-6.9e-05,0.000122,-4.4e-05,-0.000112,-3.8e-05,4.2e-05,-5.3e-05,3.7e-05,-6.5e-05,-9.4e-05,-4.4e-05,-0.000126,-5e-05,1.8e-05,-7e-05,-1e-06,0.000135,2e-06,1.7e-05,2.8e-05,-5e-05,0.000136,0.000135,2e-06,-9.8e-05,-0.000105,7e-06,4.4e-05,4e-06,8.7e-05,8.8e-05,1.7e-05,4e-06,5.1e-05,-2.5e-05,-0.001551,-0.002828,-0.002661,-0.000655,0.001059,-0.000154,-0.000455,-7.1e-05,-0.000405,-0.000344,-0.000195,-0.000564,-1.5e-05,0.000435,0.000353,-0.000377,-0.000394,0.000464,0.000364,0.000478,-0.000209,-0.000283,-0.000372,-0.000436,-1e-05,7.1e-05,0.000215,-0.000179,-9.3e-05,-0.000117,0.000282,0.000161,2.4e-05,3.3e-05,0.000217,0.000331,-3.9e-05,-0.000331,1e-05,0.000102,-0.000182,1.4e-05,-4e-06,-6.5e-05,2.9e-05,7.4e-05,-4.4e-05,1.9e-05,-0.000168,-0.000228,-0.000132,4.9e-05,-9.1e-05
-0.000347,-0.000649,-0.000354,-6.5e-05,0.000133,0.000319,1.3e-05,-0.000195,-2e-06,0.000242,-0.00035,0.000274,0.00015,-0.000157,-0.000222,3e-06,-0.000317,-0.000148,-0.000159,-0.000173,-9.9e-05,-8.1e-05,1.5e-05,-0.000106,4.2e-05,2.8e-05,-3.9e-05,-2.8e-05,-7.6e-05,7.6e-05,5.4e-05,-1.2e-05,-4.6e-05,2.9e-05,-5e-05,5.9e-05,6.8e-05,0.000119,-1.1e-05,-0.000105,2.3e-05,-4.3e-05,-6.8e-05,2.2e-05,8.8e-05,-8.5e-05,-3.7e-05,2.8e-05,-4.1e-05,2.8e-05,2.3e-05,-1.6e-05,-0.000115,2.7e-05,4.8e-05,-4.8e-05,-9.2e-05,-3.3e-05,-2e-05,-3.6e-05,-4.6e-05,7.7e-05,2.8e-05,4.5e-05,7.9e-05,-5.3e-05,-4.5e-05,-0.00011,0.001187,0.002852,0.001158,0.001622,-0.000215,0.000479,0.000558,0.000785,0.000141,-0.000498,0.000238,0.000287,-0.000508,-1.9e-05,0.000202,0.000148,0.000112,-0.000327,-0.000265,-0.000521,0.000258,0.000384,-5.3e-05,-6.7e-05,0.000127,-5e-05,-2e-04,3e-05,-0.000134,0.000135,0.000282,-0.000106,-7.4e-05,-0.000102,-0.000199,-0.000255,1.1e-05,-4.4e-05,-7e-06,-0.000182,0.00017,9e-05,-0.00012,-5.7e-05,6.2e-05,5e-06,-6.1e-05,-1.9e-05,-3e-06,3e-05,-0.000152,-1.6e-05,4.8e-05
-0.000304,0.000279,0.000201,2.5e-05,-0.000208,-0.000203,-0.000271,-0.000119,0.000268,1.2e-05,-0.000331,-0.00045,0.000106,-3.3e-05,-0.000104,9.7e-05,8e-05,0.000238,9.9e-05,6e-06,-2.4e-05,8.2e-05,6e-06,-1.7e-05,4.9e-05,-5.8e-05,-8e-05,-0.000136,-0.000248,-0.00023,-7.5e-05,-0.000195,-6.1e-05,-1.7e-05,-9.6e-05,-0.00013,4e-05,3.7e-05,-3.5e-05,-5.6e-05,-5.2e-05,-3e-05,-4.8e-05,-1.4e-05,-8.9e-05,-0.000182,-0.00015,-4.9e-05,-0.000115,-8.9e-05,-2.3e-05,-5.8e-05,-8.7e-05,-4.8e-05,-8.8e-05,-0.000186,-0.000126,-1.6e-05,-0.000152,-8.8e-05,-0.000128,-2.8e-05,-7.5e-05,-4.3e-05,-4e-05,0,-0.000111,-7.1e-05,-0.000134,-0.002165,-0.000768,-0.001014,-0.000369,0.000441,-0.000447,-0.000162,-0.000136,0.000313,0.000323,0.000387,0.000596,0.000386,-0.000441,-8.9e-05,0.000192,6.5e-05,0.00011,0.000321,-6.2e-05,-0.000456,6.7e-05,0.000112,-5.2e-05,6.6e-05,0.000122,-2.6e-05,-0.000102,-9e-05,-0.000119,-1.3e-05,3.4e-05,-4.2e-05,-0.000126,6.3e-05,-0.000102,-0.000223,-0.000123,-8.1e-05,-0.000193,-0.000109,3.4e-05,-4.4e-05,-7e-05,1.6e-05,-2.1e-05,-0.000108,-9.9e-05,-7e-05,-3.3e-05,-0.000107,-8.2e-05
-3.2e-05,0.000319,0.000221,-0.000272,1e-04,-0.000322,-0.000159,0.000301,7.5e-05,7.6e-05,1.8e-05,-0.00011,3.9e-05,3.7e-05,8.5e-05,6.9e-05,-9.2e-05,0.000182,1.9e-05,0.000176,0.00017,-6.8e-05,-0.000212,-4e-05,-0.000154,-5.4e-05,-6.6e-05,-0.000133,-0.000156,-8.3e-05,-0.000107,-0.000141,-6.6e-05,-0.00012,-0.000125,-8e-05,-0.000141,-5e-05,8e-06,1.2e-05,-3.8e-05,-8.1e-05,-6.3e-05,-1.9e-05,-5.5e-05,-4.3e-05,-9.1e-05,-2.2e-05,-3.1e-05,-1.5e-05,-5.3e-05,-0.000105,1.4e-05,-9e-06,-4e-05,-0.000124,-3.9e-05,-0.000119,-1e-06,-7.1e-05,-0.000125,-6e-05,-4e-06,9e-06,-4e-06,-4.7e-05,-4e-05,2.7e-05,-0.000455,0.00105,0.000196,0.000251,0.000525,-0.000843,0.000425,4.4e-05,-8.7e-05,0.000137,-0.000353,-0.000183,-0.000126,-0.000452,0.000289,0.000211,-0.00026,-7.3e-05,-0.000437,-0.000141,-0.000194,0.000278,5e-06,-2.9e-05,-5e-06,-0.000113,-2.8e-05,-8.4e-05,0.000141,0.000181,2e-06,8.8e-05,2.8e-05,0.000186,-1.4e-05,-9.9e-05,-6.2e-05,4.8e-05,5.2e-05,4.1e-05,6.4e-05,4.4e-05,-0.000137,-0.000109,-2e-06,-3e-06,-5e-06,-0.000127,-2.6e-05,-8.4e-05,-3.3e-05,-1e-06,-6.7e-05
0.000135,-0.000185,-0.000268,-0.000246,0.000196,-3.6e-05,-2e-06,3.9e-05,-0.000187,-0.000134,0.000126,0.00025,-5.9e-05,-0.00011,1.8e-05,-0.000118,0.000112,3e-05,-5.9e-05,0.000185,3.9e-05,-0.000139,-0.000106,-0.000117,-6.8e-05,-7e-06,3.1e-05,-4.7e-05,4.8e-05,5e-06,-8.7e-05,7e-06,-3e-06,-7.6e-05,-8e-05,-1e-05,-0.000159,-6.8e-05,2e-06,6e-06,-4e-05,3e-06,-7.5e-05,-3.2e-05,-1.5e-05,-5e-06,-4.4e-05,-3e-05,2.2e-05,-2.7e-05,-5e-05,-4.1e-05,9.3e-05,2.4e-05,-3.1e-05,-3.6e-05,-2.7e-05,-5.1e-05,1.4e-05,-1.9e-05,-3.6e-05,-3.8e-05,-1.1e-05,-1.7e-05,-2e-06,-6.6e-05,-4.5e-05,4.5e-05,3.4e-05,-0.000789,0.000108,0.000264,0.000357,0.000727,0.000106,-0.000194,0.000246,-0.000175,-1.6e-05,4e-05,0.000138,0.000324,-0.000186,-0.00017,0.000473,0.000115,0.000417,0.000153,0.000406,-0.000104,1e-04,0.000285,-0.000107,-2e-05,-0.000113,-0.000102,2.3e-05,-3.5e-05,-5.7e-05,1.4e-05,-0.000124,-0.000281,-2.9e-05,-0.000121,-4.9e-05,-0.000102,-0.000134,-5e-06,-5e-05,-7.7e-05,-1.1e-05,-3.8e-05,-3.2e-05,-7.3e-05,7.1e-05,-6.5e-05,-3.3e-05,8e-06,6.3e-05,1e-06,-6.1e-05
0.000249,-0.000203,-0.000418,0.000217,-0.00024,0.000166,0.000141,-0.000305,-0.000111,-0.000106,0.000124,3.6e-05,-0.000163,-6.6e-05,-2.5e-05,-0.000128,-6.8e-05,-0.000107,-0.000136,-2.2e-05,-2e-05,-7.6e-05,8.4e-05,7.7e-05,2.8e-05,1.4e-05,9.6e-05,-2.2e-05,9.5e-05,4.8e-05,4e-05,5.6e-05,6.9e-05,4.8e-05,1e-06,4.6e-05,-3.9e-05,1.3e-05,6.2e-05,3.3e-05,-4e-06,-3.4e-05,1.7e-05,-1.1e-05,1.8e-05,3.2e-05,2.3e-05,1.8e-05,1.7e-05,-2.1e-05,-1e-05,-2.3e-05,1.8e-05,5.7e-05,-2.9e-05,5.1e-05,2.4e-05,2.3e-05,2.1e-05,5.6e-05,-2.5e-05,-2.1e-05,-2.2e-05,4.1e-05,1.5e-05,7e-06,3.8e-05,-2.1e-05,-0.000218,0.000315,0.000528,-0.000187,-0.000156,-0.000822,9e-06,0.000102,-0.000271,0.000358,-0.000128,-0.00027,9.8e-05,-5.4e-05,1.9e-05,0.000138,-9e-05,-5e-06,-0.000274,-0.000167,-0.000252,0.000116,7.7e-05,-0.000195,-4.9e-05,-0.000206,-5.7e-05,-5.7e-05,9.1e-05,4.1e-05,-2.1e-05,-6.7e-05,-1.6e-05,0.00031,4.7e-05,0.000107,-7.2e-05,8e-06,-3.8e-05,-9e-06,7.1e-05,8e-06,-4.5e-05,3.4e-05,2e-06,7e-06,-2.8e-05,9e-06,-4.9e-05,8.3e-05,2.1e-05,-7e-06,-5e-06
9.6e-05,-9.1e-05,0.000127,0.000208,2.9e-05,4.5e-05,4.6e-05,-5.2e-05,-3e-06,-3.4e-05,-1.2e-05,-3e-04,-3e-06,0.000416,7.6e-05,0.000148,2e-06,-1.3e-05,-5e-05,-7e-05,-1.9e-05,-2.2e-05,4.7e-05,5.8e-05,1.7e-05,1.6e-05,4.7e-05,-2.6e-05,-3.2e-05,-4.1e-05,8.1e-05,6e-05,-1e-06,2.3e-05,3.6e-05,1.6e-05,5e-06,-4.8e-05,2.9e-05,-9e-06,-5.9e-05,-1e-06,4.3e-05,-2.9e-05,-4e-05,2.4e-05,5e-06,3.8e-05,4.5e-05,-1.3e-05,3.7e-05,1.9e-05,4e-06,1.6e-05,1.4e-05,-6e-06,6e-06,2.7e-05,-2.1e-05,4.3e-05,1.1e-05,1e-05,-6e-06,-2e-06,1e-05,-1.8e-05,0,6.5e-05,0.00013,0.00026,-0.000605,-0.000516,0.000282,0.000185,-7e-05,-0.000428,2.4e-05,0.000154,-8.2e-05,6.5e-05,2.7e-05,-0.000167,-9.1e-05,-0.000149,8.4e-05,9.1e-05,9.8e-05,9.7e-05,0.000224,-1.9e-05,-0.000102,7.1e-05,1.5e-05,0.000194,5.9e-05,3.1e-05,4.1e-05,-2.2e-05,-1.2e-05,-7.9e-05,5.5e-05,-0.000178,1.9e-05,-7.4e-05,1e-05,6.1e-05,-1.6e-05,-7e-06,3.4e-05,1.5e-05,-3.6e-05,-8e-06,-2e-05,9e-06,6e-06,1.5e-05,2e-05,3.1e-05,2.5e-05,2.6e-05,1.1e-05
-9e-06,-1.8e-05,4.9e-05,-0.000136,-6.2e-05,-0.00016,-2e-06,7.4e-05,-4.4e-05,0.000135,-7.2e-05,1.4e-05,0.000116,8e-05,-1.3e-05,2.9e-05,-6.8e-05,-6.8e-05,4.1e-05,3.1e-05,3.8e-05,4.8e-05,-7.8e-05,-4.4e-05,-4e-05,2.8e-05,-2e-06,-1.7e-05,-2e-05,-2.5e-05,-1.1e-05,6e-06,-3.2e-05,-2.6e-05,1.6e-05,-1.7e-05,5.4e-05,2.9e-05,-1.5e-05,-1.6e-05,-1.6e-05,-7e-06,3.7e-05,-2e-05,1e-06,-8e-06,-9e-06,1.6e-05,-2e-06,-9e-06,-3.4e-05,1.5e-05,1.2e-05,-2.7e-05,1.5e-05,-1e-05,-1.3e-05,4.9e-05,2.8e-05,-2.5e-05,1.9e-05,-1.6e-05,-9e-06,-3.2e-05,-2e-05,0,-2e-05,-1e-06,-4.6e-05,-0.000125,0.000187,0.000105,-6.5e-05,-0.000175,-0.000358,5e-05,-0.000106,-0.000519,-6.3e-05,-0.000184,-3.2e-05,0.000188,2.5e-05,-8.1e-05,-4.9e-05,-3.5e-05,-0.000186,3.2e-05,-6.4e-05,2.9e-05,4.5e-05,-5e-05,1.8e-05,-0.000139,-6.7e-05,-3.6e-05,-1.9e-05,-0.000194,6e-06,7e-06,-2.6e-05,4.9e-05,-1e-05,9e-06,-8.8e-05,-5e-06,-1.3e-05,-3.7e-05,-1.4e-05,8e-06,-9e-06,-1.6e-05,-9e-06,7e-06,-1.5e-05,5e-06,-1e-05,3.6e-05,-3e-05,-4.1e-05,6e-06
-0.000229,-2.1e-05,8.4e-05,-0.000243,-9.5e-05,3e-06,4e-06,6.9e-05,-6.4e-05,1e-05,-9e-05,-1.6e-05,-2.2e-05,-5.9e-05,-4.5e-05,-6.8e-05,-2.9e-05,-7.7e-05,-5.1e-05,-5.3e-05,-2.5e-05,1e-05,8e-06,-2.6e-05,1.8e-05,-1.6e-05,-3.8e-05,-6e-06,-1.5e-05,-1.3e-05,5e-06,-1.1e-05,1e-06,5e-06,-1.2e-05,2.5e-05,1.3e-05,9e-06,-8e-06,1e-05,5e-06,-1e-05,-3e-06,-2.3e-05,1e-06,-3e-05,3.4e-05,1e-05,-7e-06,0,-4e-06,-4e-06,3e-06,-2.2e-05,-1e-06,-2.2e-05,2e-06,8e-06,-9e-06,6e-06,9e-06,-2.8e-05,-4.9e-05,5e-06,1.4e-05,4e-06,1.3e-05,3.9e-05,-1.4e-05,5.4e-05,0.000113,0.000182,-0.000116,0.000198,0.000329,-0.000126,-7e-06,0.000241,0.000125,0.000242,-7.9e-05,-5.1e-05,4.1e-05,8.2e-05,0.000197,-0.000148,-1.7e-05,1.5e-05,-5.9e-05,-8e-05,4.5e-05,7.2e-05,4.9e-05,9.7e-05,-2.3e-05,-3.7e-05,3.9e-05,-3.4e-05,1.7e-05,3.1e-05,-3e-05,-9e-06,3e-05,1.5e-05,4.5e-05,-3.6e-05,1.2e-05,6.3e-05,-4.2e-05,-9e-06,4.5e-05,-1.6e-05,-2e-06,6e-06,-1e-05,0,8e-06,7e-06,2.4e-05,3.1e-05,-1.3e-05
7e-06,0.000159,0.000116,1e-04,-3.8e-05,0.000168,-1.8e-05,4.4e-05,-2.4e-05,-0.000118,-4.9e-05,3e-06,-7.2e-05,-4.1e-05,-2e-05,-2.9e-05,1e-05,-7e-06,-3e-06,-1.6e-05,-2.5e-05,4e-06,1e-05,1.8e-05,2e-05,3e-06,5e-06,7e-06,-2.5e-05,3e-06,9e-06,-2e-05,-2.1e-05,7e-06,9e-06,-8e-06,-1e-06,-1.2e-05,-1.1e-05,-5e-06,2.5e-05,2.4e-05,-1.2e-05,3e-05,4e-06,-2e-06,2.4e-05,1e-06,-7e-06,1.9e-05,-1e-06,-4e-06,2.8e-05,1.1e-05,1.6e-05,-1.5e-05,0,1.2e-05,-5e-06,-4e-06,-7e-06,-2e-06,-9e-06,-8e-06,-1e-05,-9e-06,-1e-05,6e-05,6.5e-05,-0.000118,0.000201,-0.000268,1.7e-05,4.1e-05,-0.000168,0.000125,4e-05,6e-05,7.9e-05,-0.000176,0.000159,-3.6e-05,-3.8e-05,-4.3e-05,-0.000201,-2.4e-05,0.000147,8.7e-05,5.2e-05,4.5e-05,-7.5e-05,-0.000102,-2.7e-05,-9.8e-05,2e-05,6.2e-05,4e-05,2.6e-05,5.5e-05,1.4e-05,1.1e-05,5.8e-05,-3.1e-05,4.2e-05,-1.1e-05,-3.7e-05,2.2e-05,-2.2e-05,2.1e-05,8e-06,2e-06,7e-06,-3.2e-05,1.4e-05,2.5e-05,2.7e-05,2.3e-05,1.1e-05,0,-9e-06,4e-06
-9.3e-05,-1.4e-05,-5e-05,0.000157,5.8e-05,-0.000127,6e-06,-3.3e-05,4.5e-05,5.1e-05,2.1e-05,1e-05,5e-06,-7.6e-05,-3.6e-05,2.2e-05,4.5e-05,-3.9e-05,-3e-06,1.6e-05,1.9e-05,2e-05,-8e-06,-1.4e-05,8e-06,1.6e-05,1e-05,1.9e-05,-5e-06,1e-05,3.9e-05,0,1.3e-05,2e-05,0,-2e-06,1.1e-05,-3.1e-05,-5e-06,7e-06,7e-06,-2e-05,-2e-06,1.7e-05,0,0,-6e-06,1.3e-05,3e-06,1.3e-05,3e-06,4e-06,2.1e-05,7e-06,5e-06,-1e-05,-2e-06,2.9e-05,3e-05,-5e-06,1e-06,2.4e-05,-4e-06,-9e-06,3e-06,-6e-06,-2e-06,-1.3e-05,-3.6e-05,7.7e-05,-0.000364,0.000262,6.7e-05,3.6e-05,0.00014,1e-05,7.2e-05,-3.6e-05,2e-05,9.7e-05,1.8e-05,-4.1e-05,-6e-06,3.2e-05,0.000232,1e-05,-2e-05,-0.000137,-4.5e-05,-4.3e-05,7.2e-05,-5e-06,4e-05,-5.5e-05,3.4e-05,-7e-06,2.2e-05,1.2e-05,-4.8e-05,3.1e-05,1.7e-05,-3.9e-05,-5e-06,-3e-05,-7e-06,2e-05,2.3e-05,3.7e-05,2.3e-05,1e-06,-4e-06,2e-06,1.6e-05,2e-06,-4e-06,-2.6e-05,-6e-06,3.1e-05,1.5e-05,1.2e-05,1.7e-05
0.000108,1.3e-05,5.8e-05,1e-05,3.2e-05,2e-06,-2.8e-05,-5.5e-05,2.3e-05,-8e-06,4.8e-05,4.8e-05,4.2e-05,1e-06,6e-06,3e-05,-2.8e-05,3e-06,-5e-06,-1.5e-05,-1.6e-05,-9e-06,-1e-05,0,-5e-06,-1e-06,-4e-06,-6e-06,1.3e-05,5e-06,-1.8e-05,1.9e-05,4e-06,-2e-06,-2e-06,5e-06,7e-06,-4e-06,-5e-06,-1e-06,-1.1e-05,1.5e-05,1.2e-05,1e-05,-4e-06,5e-06,-5e-06,3e-06,5e-06,4e-06,-3e-06,-4e-06,1.3e-05,-4e-06,-1e-06,1.3e-05,-6e-06,3e-06,-1.3e-05,1e-06,-1.1e-05,1.3e-05,-1e-06,-5e-06,-3e-06,-2e-06,1e-06,5e-06,3.4e-05,2.3e-05,0.00016,6.2e-05,-0.000119,-5e-05,-7.2e-05,4.5e-05,-7.3e-05,5.8e-05,2.8e-05,-1.5e-05,1.2e-05,9e-06,-1.9e-05,-1e-06,-0.000182,-3.3e-05,-9.2e-05,9.9e-05,4.7e-05,1e-05,-2.5e-05,6.8e-05,-1e-05,4.3e-05,7e-06,-1.6e-05,2.7e-05,4e-06,2.2e-05,-6e-06,8e-06,6e-06,2.1e-05,1.7e-05,3e-05,1.1e-05,8e-06,2e-06,-3.4e-05,8e-06,1.1e-05,9e-06,0,3e-06,9e-06,-2.5e-05,-5e-06,-1e-06,-9e-06,1e-06,-1.5e-05
8.9e-05,-5e-06,-3.1e-05,4e-06,-3e-05,1.7e-05,9e-06,0,-2.6e-05,-2.3e-05,2.3e-05,-1.6e-05,7e-06,5.4e-05,-1.1e-05,0,-1.2e-05,2.1e-05,5e-06,-1.5e-05,9e-06,-4e-06,-5e-06,-1e-06,6e-06,-2e-06,2e-05,-1e-05,2.1e-05,1e-06,3e-06,1.1e-05,3e-06,-1.1e-05,1e-06,1e-06,-1.2e-05,1.1e-05,9e-06,-7e-06,8e-06,-1.3e-05,-1e-06,-1e-06,9e-06,9e-06,-5e-06,1e-06,1e-06,0,-9e-06,2e-06,-9e-06,-3e-06,-7e-06,1e-05,4e-06,4e-06,3e-06,7e-06,-8e-06,-2e-06,-6e-06,3e-06,2e-06,-6e-06,6e-06,-1e-06,-2e-05,-6.6e-05,-0.000146,-4.5e-05,-6.6e-05,1e-04,-3.1e-05,1.1e-05,6e-05,-2.5e-05,9e-06,2.1e-05,-2.7e-05,-5.9e-05,-4e-05,-1.5e-05,0.000116,1.3e-05,1.6e-05,2.6e-05,-2.9e-05,2.2e-05,-8e-06,-3.2e-05,-1.4e-05,-2e-06,-1.8e-05,4e-06,1e-06,1.1e-05,-4.2e-05,-2.1e-05,-7e-06,3.1e-05,-3.5e-05,-2e-05,-2.6e-05,1.9e-05,-1.1e-05,-1e-06,2e-05,-8e-06,-3.3e-05,-4e-06,-4e-06,-1e-06,-6e-06,-3e-06,-7e-06,1.5e-05,-4e-06,8e-06,-7e-06
0,-2.9e-05,-3e-05,-4.1e-05,6.1e-05,1.7e-05,5e-06,2.5e-05,-1.2e-05,-6e-06,-8e-06,-2.3e-05,-1.3e-05,0,1.1e-05,-1.8e-05,-1.7e-05,1.5e-05,8e-06,-2e-05,-1.1e-05,-1.3e-05,2.2e-05,-5e-06,3e-06,7e-06,5e-06,-4e-06,-1e-06,5e-06,4e-06,4e-06,8e-06,2e-06,1e-06,6e-06,-2.8e-05,0,-4e-06,-4e-06,-8e-06,5e-06,8e-06,-6e-06,-4e-06,3e-06,-2e-06,5e-06,1e-06,-5e-06,-1e-06,-3e-06,-3e-06,3e-06,-1e-06,1.1e-05,1e-06,5e-06,-7e-06,2e-06,0,-2e-06,1.2e-05,-6e-06,0,1e-06,6e-06,1e-06,1e-06,3e-06,0.000283,-4.6e-05,4.1e-05,-8.8e-05,3.5e-05,2.8e-05,-7e-06,-5.2e-05,-1.1e-05,1.2e-05,2.9e-05,4e-06,3.3e-05,-6e-06,-8.1e-05,3.3e-05,-3.4e-05,6e-06,-2e-05,-3.2e-05,8e-06,-1.5e-05,-1.3e-05,3.7e-05,1.8e-05,3e-06,0,1.7e-05,-7e-06,-2e-06,-1.2e-05,-3.2e-05,2.1e-05,-5e-06,3e-06,-1.7e-05,-1.7e-05,1e-06,-2e-05,1e-06,1.1e-05,-3e-06,-2e-06,-2e-06,-4e-06,4e-06,4e-06,9e-06,-1.1e-05,-8e-06,-1e-06
-2.4e-05,2.4e-05,-2.4e-05,-2e-06,-2.3e-05,-2.6e-05,5e-06,1.2e-05,1.1e-05,-1e-05,-2.5e-05,4e-06,-1.1e-05,4e-06,1e-06,-6e-06,4e-06,1.5e-05,-2e-05,-1e-06,-1e-06,-9e-06,8e-06,9e-06,-2e-06,0,-2e-06,-1e-05,-9e-06,-8e-06,9e-06,-1e-06,-8e-06,5e-06,5e-06,-1e-06,-1e-05,-1.1e-05,-6e-06,4e-06,-1.1e-05,-3e-06,8e-06,-4e-06,1e-06,-5e-06,1e-06,6e-06,-2e-06,-5e-06,2e-06,1e-06,-1e-06,-2e-06,0,-1e-05,1e-06,2e-06,5e-06,2e-06,6e-06,0,-4e-06,-1e-06,-1e-06,-1e-06,-7e-06,-1e-06,1.1e-05,4.2e-05,-0.000245,4e-05,-2.7e-05,6.8e-05,-4.4e-05,1.4e-05,8e-06,6.9e-05,-1.9e-05,-5e-06,-2.8e-05,-8e-06,-4.8e-05,1.3e-05,3e-05,-8e-06,-8e-06,-2.4e-05,8e-06,3.5e-05,-1e-06,1.9e-05,-3e-06,-7e-06,-2.8e-05,1e-06,1.3e-05,1e-06,-2.6e-05,1e-06,-1e-06,1.6e-05,-8e-06,-9e-06,-1e-06,-1.6e-05,-4e-06,-5e-06,2e-05,1e-06,-9e-06,0,1e-06,-1e-06,5e-06,1e-06,2e-06,3e-06,3e-06,0,-3e-06
-6.2e-05,-3.4e-05,-2.8e-05,1e-05,2e-06,5e-06,0,-2.3e-05,9e-06,0,-2.2e-05,-2e-06,4e-06,1.7e-05,-6e-06,1.5e-05,2e-06,1.5e-05,-2e-06,-3e-06,2e-06,-2e-06,-1.8e-05,-5e-06,-6e-06,-2e-06,-1e-06,-4e-06,-8e-06,-2e-06,-3e-06,-3e-06,-4e-06,-4e-06,4e-06,2e-06,1.1e-05,-1e-06,-2e-06,0,2e-06,1e-06,6e-06,-3e-06,0,-7e-06,1.2e-05,5e-06,-3e-06,-3e-06,-3e-06,2e-06,4e-06,-3e-06,-3e-06,-5e-06,-2e-06,1.4e-05,-1e-06,-3e-06,4e-06,-7e-06,-2e-06,0,3e-06,-2e-06,0,0,-1.4e-05,-1.4e-05,0.000148,5.6e-05,-8.3e-05,-3.4e-05,6.7e-05,-1.7e-05,3e-06,1.1e-05,-1.3e-05,-1.9e-05,3.3e-05,2.8e-05,1.4e-05,0,-3e-05,-1.1e-05,-6e-06,1e-05,-2.4e-05,-3.6e-05,-5e-06,-1.4e-05,0,-9e-06,1.3e-05,-6e-06,3e-06,3.8e-05,1.8e-05,-1e-06,7e-06,6e-06,1.9e-05,1.3e-05,-2e-06,2e-06,-1.1e-05,7e-06,-1.8e-05,-1e-06,3e-06,-3e-06,0,1e-06,0,9e-06,-3e-06,5e-06,-1e-06,2e-06,1e-06
-2.4e-05,-7e-06,1.1e-05,-3.2e-05,3e-06,-6e-06,1e-06,-8e-06,-5e-06,-1e-06,-4e-06,-1e-06,6e-06,-9e-06,3e-06,1e-05,-2e-06,1.2e-05,-1e-06,-2e-06,-1e-06,1e-06,-4e-06,-1e-05,1e-06,1e-06,-2e-06,-1e-06,-8e-06,1e-06,1e-06,-9e-06,2e-06,-4e-06,-2e-06,1e-06,8e-06,1.2e-05,-1e-06,4e-06,0,-4e-06,4e-06,-4e-06,2e-06,0,7e-06,-1e-06,-1e-06,2e-06,-5e-06,-1e-06,3e-06,-1e-06,4e-06,-6e-06,1e-06,2e-06,-2e-06,-2e-06,1e-06,-9e-06,-4e-06,1e-06,-3e-06,1e-06,0,1e-06,1.1e-05,2.8e-05,-0.000126,-9.2e-05,1.5e-05,-3.7e-05,-7e-05,-3.1e-05,7e-06,-5.5e-05,-3e-06,1.3e-05,-2.3e-05,-1e-06,-4e-06,-7e-06,4e-06,1.2e-05,1.2e-05,-9e-06,1.8e-05,3.4e-05,2e-05,5e-06,-1e-06,-4e-06,-7e-06,-3e-06,4e-06,-4e-06,-9e-06,-4e-06,-4e-06,-2.2e-05,-2.2e-05,-1e-06,-2e-06,-5e-06,4e-06,3e-06,-3e-06,1e-06,3e-06,-3e-06,-1e-05,0,0,3e-06,2e-06,-1e-06,3e-06,-1e-06,-2e-06
3.4e-05,4e-06,2.4e-05,1.4e-05,-1e-05,1.9e-05,-6e-06,-6e-06,-1.4e-05,6e-06,1.1e-05,-1.8e-05,1e-06,-5.9e-05,-7e-06,-1.7e-05,-3e-06,-1e-05,-5e-06,7e-06,6e-06,5e-06,2e-06,2e-06,4e-06,-1e-06,1e-06,-4e-06,0,-1e-06,5e-06,-1e-06,-2e-06,5e-06,0,0,3e-06,1e-06,-1e-06,1e-06,-1e-06,4e-06,-6e-06,2e-06,-2e-06,1e-06,6e-06,3e-06,-1e-06,0,0,2e-06,4e-06,3e-06,2e-06,-2e-06,-2e-06,1e-06,3e-06,1e-06,0,-3e-06,-3e-06,2e-06,2e-06,-1e-06,-1e-06,-1e-06,-6e-06,-6.6e-05,9.6e-05,4.6e-05,2e-05,4e-05,5.3e-05,-1.1e-05,-1.5e-05,5.5e-05,-4e-06,-1.5e-05,0,-3e-06,-1e-06,7e-06,-2.2e-05,0,1e-05,3e-05,-2e-06,-3.2e-05,-2.6e-05,1.6e-05,1.2e-05,2e-06,-3e-06,4e-06,-4e-06,3e-06,1.1e-05,-3e-06,-6e-06,2.4e-05,5e-06,8e-06,-1e-06,5e-06,8e-06,3e-06,5e-06,-2e-06,2e-06,3e-06,4e-06,0,3e-06,-4e-06,-1e-06,3e-06,-4e-06,2e-06,0
1.7e-05,-1.5e-05,8e-06,3.1e-05,-3e-06,-1.6e-05,-6e-06,1.6e-05,-6e-06,0,1e-05,1.4e-05,-5e-06,6e-06,4e-06,-4e-06,-8e-06,9e-06,-3e-06,-7e-06,-3e-06,2e-06,3e-06,0,0,1e-06,5e-06,-1e-06,7e-06,3e-06,0,4e-06,3e-06,1e-06,0,1e-06,0,-8e-06,1e-06,-5e-06,4e-06,-3e-06,-4e-06,0,1e-06,4e-06,-4e-06,1e-06,1e-06,4e-06,-1e-06,-1e-06,-8e-06,-1e-06,-3e-06,2e-06,0,7e-06,-1e-06,1e-06,-4e-06,6e-06,-7e-06,1e-06,-2e-06,-1e-06,-1e-06,-1e-06,4e-06,3.1e-05,-6.3e-05,-1e-06,-3e-05,-9e-06,-2.6e-05,-1.7e-05,4e-06,-1.7e-05,3e-06,-9e-06,-8e-06,1.7e-05,3e-06,-1e-05,6e-06,-6e-06,-2.5e-05,-1.2e-05,-2e-06,2.3e-05,8e-06,-1.1e-05,2e-06,-1.3e-05,5e-06,-4e-06,-1e-06,-3e-06,-3e-06,-1e-06,2e-06,-8e-06,0,-1e-06,3e-06,-1e-06,3e-06,4e-06,-2e-06,1e-06,-2e-06,0,-2e-06,3e-06,-7e-06,-3e-06,2e-06,2e-06,-5e-06,2e-06,1e-06
4.3e-05,1.8e-05,1.9e-05,1e-06,-2.1e-05,-7e-06,2e-06,6e-06,7e-06,-5e-06,2e-06,-1e-05,-4e-06,-4e-06,3e-06,7e-06,0,-1.9e-05,1e-06,-1e-06,0,1e-06,-4e-06,-3e-06,-1e-06,-1e-06,-1e-06,-2e-06,5e-06,-1e-06,1e-06,5e-06,3e-06,0,-1e-06,1e-06,1e-06,-4e-06,1e-06,0,-1e-06,0,5e-06,1e-06,-1e-06,3e-06,-2e-06,2e-06,0,1e-06,0,0,-4e-06,-1e-06,2e-06,8e-06,0,-1e-06,0,-1e-06,-6e-06,6e-06,0,-1e-06,0,0,2e-06,0,2e-06,1.1e-05,5.3e-05,-6e-06,-4e-06,5e-06,1.3e-05,2e-06,-1e-06,-2.5e-05,1.2e-05,2.7e-05,-1e-05,8e-06,-1.2e-05,3e-06,-1.6e-05,1.8e-05,-3e-06,-3e-06,6e-06,-1.2e-05,7e-06,-1.3e-05,1e-06,-6e-06,-1e-06,-1e-06,-8e-06,-1.9e-05,1.2e-05,4e-06,3e-06,-1e-06,1e-06,0,-4e-06,4e-06,8e-06,0,-2e-06,0,7e-06,0,-3e-06,0,6e-06,-8e-06,-1e-06,-2e-06,-6e-06,-1e-06,-3e-06
-1.4e-05,6e-06,-1.5e-05,-1.2e-05,1.3e-05,1.2e-05,-4e-06,-3e-06,3e-06,5e-06,-8e-06,-2e-06,2e-06,3e-06,3e-06,4e-06,-2e-06,-1e-05,-7e-06,7e-06,-6e-06,-1e-06,-2e-06,2e-06,1e-06,1e-06,3e-06,-4e-06,2e-06,2e-06,-3e-06,2e-06,-1e-06,-4e-06,0,1e-06,0,2e-06,0,0,2e-06,1e-06,6e-06,3e-06,1e-06,-1e-06,-1e-06,0,0,1e-06,-5e-06,0,-3e-06,-2e-06,0,1e-06,1e-06,2e-06,-2e-06,2e-06,-1e-06,1e-06,-3e-06,1e-06,1e-06,-1e-06,4e-06,0,-4e-06,-8e-06,-2.8e-05,-1e-06,2.5e-05,2.5e-05,-2e-06,-1e-05,1.4e-05,3.3e-05,9e-06,-2.5e-05,8e-06,-1.1e-05,5e-06,1e-06,4e-06,-5e-06,7e-06,-9e-06,-1.3e-05,3e-06,-1e-05,1.1e-05,1e-06,9e-06,6e-06,0,-6e-06,-6e-06,-6e-06,9e-06,-1e-06,-4e-06,-2e-06,-4e-06,1e-06,-2e-06,0,0,-1e-06,0,-8e-06,-2e-06,-3e-06,-1e-06,-4e-06,-2e-06,-1e-06,0,1e-06,-1e-06,-1e-06
-2.5e-05,-2e-06,7e-06,-1.2e-05,-1.4e-05,1e-06,7e-06,-1.2e-05,-6e-06,2e-06,-1e-05,4e-06,5e-06,3.3e-05,1e-06,-2e-06,0,-5e-06,4e-06,-2e-06,7e-06,-2e-06,8e-06,-3e-06,3e-06,-1e-06,-2e-06,-1e-06,-5e-06,-1e-06,2e-06,0,0,2e-06,1e-06,0,-8e-06,1e-06,0,1e-06,1e-06,-2e-06,3e-06,0,0,-3e-06,0,0,-1e-06,-2e-06,0,-1e-06,2e-06,1e-06,-2e-06,-2e-06,-1e-06,1e-06,3e-06,0,2e-06,0,-2e-06,-1e-06,0,0,-3e-06,0,4e-06,1.4e-05,6e-06,2e-05,1e-06,-2.4e-05,-2.3e-05,2.1e-05,-1.2e-05,1e-06,3e-06,1.2e-05,-1.1e-05,3e-06,-1.4e-05,2e-06,-8e-06,-1e-05,-6e-06,1e-06,9e-06,2e-06,1e-05,1.2e-05,-4e-06,1.2e-05,0,0,0,-2e-06,1e-06,5e-06,-1e-06,1e-05,3e-06,0,2e-06,-8e-06,-2e-06,1e-06,-1e-06,0,2e-06,-1e-06,2e-06,0,3e-06,6e-06,1e-06,-2e-06,0,1e-06,-1e-06
-2.3e-05,9e-06,-1.2e-05,0,7e-06,-9e-06,-1e-06,0,-3e-06,-4e-06,-6e-06,4e-06,0,-4e-06,-2e-06,-5e-06,1e-06,-7e-06,-3e-06,2e-06,-3e-06,-2e-06,0,-2e-06,-1e-06,0,-2e-06,-3e-06,-5e-06,-1e-06,-1e-06,-1e-06,-2e-06,1e-06,1e-06,0,-9e-06,-3e-06,0,2e-06,-4e-06,2e-06,0,2e-06,-1e-06,-2e-06,2e-06,1e-06,-1e-06,1e-06,-1e-06,1e-06,-1e-06,0,1e-06,-4e-06,0,-1e-06,-3e-06,-1e-06,2e-06,0,-2e-06,-1e-06,0,1e-06,-1e-06,0,-3e-06,-4.2e-05,-2.9e-05,4e-06,3e-06,1.5e-05,4.8e-05,1.1e-05,4e-06,-2.7e-05,-4e-06,1e-05,-1e-06,3e-06,-1e-06,-2e-06,9e-06,-1e-06,-2e-06,1.5e-05,0,-3e-06,-2e-06,-1.2e-05,-3e-06,-3e-06,-3e-06,0,-8e-06,3e-06,-6e-06,-4e-06,-1e-06,-9e-06,0,-4e-06,-1e-06,-5e-06,-3e-06,3e-06,0,0,-1e-06,1e-06,-2e-06,0,0,1e-06,-1e-06,-3e-06,2e-06,0,-1e-06
-1.3e-05,-7e-06,-1e-05,1.3e-05,1e-05,1e-06,1e-06,4e-06,2e-06,-1e-06,3e-06,-4e-06,-4e-06,-1.5e-05,-3e-06,0,-3e-06,-2e-06,-1e-06,1e-06,2e-06,-2e-06,-3e-06,1e-06,0,0,1e-06,-3e-06,-1e-06,1e-06,1e-06,-5e-06,-2e-06,-1e-06,1e-06,0,-1e-06,-1e-06,0,0,0,-1e-06,-2e-06,0,1e-06,0,6e-06,0,0,-2e-06,-1e-06,0,0,-1e-06,0,-1e-06,0,4e-06,2e-06,0,2e-06,0,1e-06,1e-06,-1e-06,-1e-06,0,0,2e-06,3.4e-05,5.2e-05,-1.8e-05,2.3e-05,8e-06,-5e-05,8e-06,1e-06,2.3e-05,-4e-06,-1.1e-05,-7e-06,-9e-06,-1e-06,4e-06,-1.2e-05,-3e-06,-7e-06,-1.1e-05,5e-06,5e-06,-1e-05,-4e-06,-3e-06,4e-06,1e-06,-3e-06,-7e-06,-9e-06,3e-06,-6e-06,0,-4e-06,-1e-06,1e-06,-1e-06,0,-3e-06,0,2e-06,0,-2e-06,-2e-06,-3e-06,0,-2e-06,-1e-06,1e-06,-1e-06,-3e-06,0,0
3.1e-05,1e-06,-1e-06,0,-4e-06,4e-06,1e-06,4e-06,2e-06,2e-06,5e-06,-1e-06,0,0,-2e-06,5e-06,-3e-06,5e-06,-3e-06,-2e-06,-1e-06,0,-5e-06,-3e-06,-1e-06,0,-2e-06,-2e-06,0,0,-1e-06,-1e-06,3e-06,-2e-06,0,0,4e-06,1e-06,1e-06,-2e-06,0,1e-06,2e-06,-2e-06,-1e-06,1e-06,1e-06,0,0,-1e-06,-2e-06,0,-3e-06,0,0,-1e-06,0,-2e-06,-1e-06,0,1e-06,-3e-06,-2e-06,0,1e-06,1e-06,1e-06,0,0,-7e-06,-3.2e-05,7e-06,3e-06,-1.7e-05,3.6e-05,1e-06,0,-6e-06,-3e-06,1.1e-05,4e-06,-2e-06,-7e-06,-4e-06,2.1e-05,-8e-06,-3e-06,-1e-06,4e-06,-9e-06,8e-06,4e-06,1e-06,-2.3e-05,-1e-06,-2e-06,-6e-06,1.1e-05,-3e-06,-3e-06,2e-06,1.3e-05,-3e-06,4e-06,1e-06,4e-06,-5e-06,0,-8e-06,1e-06,2e-06,0,1e-06,0,1e-06,4e-06,0,-3e-06,-2e-06,1e-06,-1e-06
1.7e-05,-2e-06,-4e-06,-4e-06,1.2e-05,0,-4e-06,-1e-06,-1e-06,-1e-06,2e-06,6e-06,2e-06,-7e-06,0,1e-06,1e-06,5e-06,0,1e-06,-1e-06,1e-06,4e-06,-2e-06,2e-06,-1e-06,2e-06,-3e-06,3e-06,0,-1e-06,2e-06,0,1e-06,-1e-06,0,4e-06,0,0,0,-2e-06,-2e-06,-1e-06,0,1e-06,2e-06,1e-06,-1e-06,0,0,-1e-06,0,-2e-06,0,0,2e-06,0,-1e-06,0,0,-1e-06,-2e-06,-1e-06,0,-1e-06,-1e-06,0,0,-1e-06,7e-06,2e-05,1e-06,-2e-06,1.7e-05,-2e-05,-1e-06,1e-06,-1.6e-05,-3e-06,-1.4e-05,-1e-05,0,1e-06,0,-2.1e-05,7e-06,2e-06,-1e-05,-6e-06,1e-05,-2e-06,4e-06,2e-06,1e-05,-2e-06,0,-5e-06,3e-06,1e-06,-1e-06,-1e-06,-1.2e-05,4e-06,0,-1e-06,4e-06,1e-06,0,8e-06,0,1e-06,-1e-06,-1e-06,0,-1e-06,-2e-06,0,-1e-06,-2e-06,-1e-06,0
8e-06,-6e-06,6e-06,2e-06,-6e-06,-4e-06,0,-5e-06,-3e-06,0,-1e-06,-8e-06,1e-06,-6e-06,0,-4e-06,-2e-06,4e-06,-2e-06,-1e-06,3e-06,0,1e-06,2e-06,-1e-06,1e-06,-1e-06,-2e-06,3e-06,0,2e-06,3e-06,0,2e-06,0,0,1e-06,0,0,0,1e-06,3e-06,-2e-06,-1e-06,-1e-06,0,-2e-06,0,0,0,-1e-06,0,-1e-06,1e-06,1e-06,2e-06,0,1e-06,0,1e-06,-3e-06,0,0,0,0,0,0,0,2e-06,-5e-06,-1.7e-05,-6e-06,1.5e-05,-8e-06,6e-06,0,2e-06,2.3e-05,-2e-06,4e-06,9e-06,-2e-06,-6e-06,2e-06,3.1e-05,4e-06,-5e-06,1.2e-05,1e-06,-1.2e-05,-2e-06,-3e-06,1e-06,-3e-06,-3e-06,0,-6e-06,4e-06,1e-06,1e-06,-2e-06,8e-06,1e-06,0,-1e-06,-5e-06,2e-06,0,-6e-06,0,-1e-06,0,-3e-06,0,0,-6e-06,0,-1e-06,1e-06,1e-06,0
-6e-06,3e-06,9e-06,-3e-06,6e-06,0,-1e-06,-1e-06,0,1e-06,-4e-06,4e-06,-3e-06,1.3e-05,1e-06,-2e-06,2e-06,1e-05,1e-06,1e-06,-4e-06,1e-06,0,-2e-06,0,0,0,-1e-06,-1e-06,0,-2e-06,0,1e-06,-1e-06,0,0,-1e-06,0,0,1e-06,1e-06,-2e-06,1e-06,0,1e-06,-1e-06,0,-1e-06,0,0,-1e-06,0,2e-06,-1e-06,0,1e-06,0,-2e-06,-1e-06,0,-2e-06,1e-06,-1e-06,0,0,0,2e-06,0,-1e-06,-1.5e-05,-1e-05,-5e-06,5e-06,-2e-06,4e-06,-1.1e-05,-2e-06,-1e-05,0,8e-06,-1e-05,0,1e-06,0,-2.4e-05,-5e-06,2e-06,-2e-06,-2e-06,1.2e-05,7e-06,-2e-06,2e-06,6e-06,6e-06,-1e-06,-2e-06,1.2e-05,2e-06,2e-06,0,-4e-06,-1e-06,2e-06,1e-06,-2e-06,1e-06,1e-06,4e-06,0,2e-06,-1e-06,-1e-06,1e-06,2e-06,-1e-06,-1e-06,-3e-06,0,0,-1e-06
-2.7e-05,-4e-06,-2e-06,0,-6e-06,4e-06,2e-06,2e-06,2e-06,-1e-06,-5e-06,-5e-06,-1e-06,1.5e-05,1e-06,3e-06,-2e-06,1e-06,-4e-06,-1e-06,4e-06,0,-2e-06,-2e-06,0,-1e-06,0,-3e-06,-2e-06,0,0,-1e-06,-2e-06,0,0,0,0,0,0,1e-06,0,1e-06,2e-06,1e-06,-1e-06,-1e-06,-1e-06,-1e-06,0,1e-06,-2e-06,0,-1e-06,0,-1e-06,-2e-06,0,1e-06,2e-06,0,0,1e-06,-1e-06,0,0,0,-1e-06,0,1e-06,1.8e-05,3.6e-05,4e-06,-1.2e-05,5e-06,-1.4e-05,-5e-06,-1e-06,-1.2e-05,1e-06,-1e-05,5e-06,-1e-06,-4e-06,-2e-06,2.8e-05,3e-06,-1e-06,0,2e-06,-1e-05,-8e-06,2e-06,0,4e-06,-4e-06,-1e-06,-3e-06,1e-06,0,1e-06,1e-06,2e-06,1e-06,-2e-06,-1e-06,-4e-06,5e-06,0,-2e-06,0,-2e-06,-1e-06,0,0,-2e-06,1e-06,0,-1e-06,1e-06,0,0
-8e-06,3e-06,8e-06,-1e-06,-2e-06,-4e-06,-1e-06,3e-06,-1e-06,0,-1e-06,5e-06,1e-06,-7e-06,0,1e-06,0,1e-06,1e-06,-2e-06,-3e-06,-1e-06,3e-06,0,1e-06,1e-06,-1e-06,-2e-06,-2e-06,-1e-06,-1e-06,-1e-06,0,0,1e-06,0,-2e-06,-2e-06,0,-1e-06,1e-06,0,2e-06,-1e-06,1e-06,0,0,-1e-06,0,1e-06,-1e-06,0,0,1e-06,1e-06,-2e-06,0,-1e-06,-2e-06,0,1e-06,0,-1e-06,0,0,0,-2e-06,0,0,-5e-06,-3.7e-05,-3e-06,4e-06,-2e-06,1.9e-05,-4e-06,0,1.7e-05,2e-06,3e-06,-1e-06,2e-06,-4e-06,2e-06,-1.9e-05,3e-06,-2e-06,-1.1e-05,2e-06,1e-05,1e-06,0,0,-1e-06,2e-06,-1e-06,-3e-06,1e-06,-1e-06,0,-1e-06,-3e-06,0,-3e-06,0,0,-1e-06,0,-1e-06,0,-1e-06,0,-2e-06,0,1e-06,0,0,-1e-06,-2e-06,0,-1e-06
3e-06,2e-06,-7e-06,0,3e-06,2e-06,3e-06,-1e-06,-3e-06,0,2e-06,-4e-06,0,4e-06,-1e-06,-1e-06,-1e-06,-2e-06,-1e-06,1e-06,1e-06,0,-1e-06,-2e-06,-1e-06,-1e-06,0,-2e-06,-1e-06,0,2e-06,-1e-06,1e-06,1e-06,0,0,-4e-06,0,0,-1e-06,0,0,0,2e-06,-1e-06,0,1e-06,-1e-06,0,-1e-06,-1e-06,0,-1e-06,-1e-06,0,0,0,-1e-06,1e-06,0,2e-06,1e-06,-1e-06,0,-1e-06,0,0,0,0,4e-06,3.8e-05,-5e-06,7e-06,5e-06,-2.5e-05,0,2e-06,-7e-06,2e-06,0,1e-06,2e-06,0,-2e-06,2e-05,-5e-06,-5e-06,6e-06,-1e-06,-8e-06,7e-06,-1e-06,-2e-06,-2e-06,4e-06,-1e-06,-1e-06,-4e-06,1e-06,1e-06,-1e-06,4e-06,-1e-06,3e-06,0,1e-06,0,-1e-06,2e-06,0,2e-06,0,-2e-06,0,0,3e-06,0,-1e-06,-1e-06,0,0
1.5e-05,-1e-06,0,6e-06,-1e-05,-3e-06,-3e-06,-2e-06,0,0,2e-06,2e-06,-1e-06,-3e-06,0,-2e-06,-1e-06,-4e-06,-1e-06,-1e-06,-3e-06,0,-1e-06,-1e-06,0,0,0,-2e-06,1e-06,0,-2e-06,-1e-06,-1e-06,-1e-06,0,0,-4e-06,1e-06,0,0,0,-1e-06,-3e-06,0,0,1e-06,2e-06,0,0,0,-1e-06,0,0,0,-1e-06,1e-06,0,1e-06,-1e-06,0,2e-06,1e-06,-2e-06,0,1e-06,0,1e-06,0,1e-06,-6e-06,-4.4e-05,5e-06,-1.4e-05,5e-06,3e-05,2e-06,-1e-06,-1e-05,1e-06,-1e-06,0,-2e-06,-5e-06,0,-1.4e-05,2e-06,-1e-06,1e-06,0,6e-06,-6e-06,2e-06,-1e-06,-4e-06,-5e-06,-2e-06,1e-06,-1e-06,-1e-06,2e-06,0,-2e-06,-1e-06,-2e-06,0,0,-1e-06,-1e-06,-1e-06,0,-3e-06,0,0,0,-1e-06,2e-06,0,0,-1e-06,0,0
2.3e-05,4e-06,0,-2e-06,7e-06,3e-06,2e-06,-1e-06,1e-06,0,1e-06,0,0,-1.9e-05,-1e-06,0,0,-7e-06,0,0,3e-06,0,-2e-06,0,-1e-06,0,0,-2e-06,2e-06,0,0,1e-06,1e-06,-1e-06,0,0,0,0,0,0,0,1e-06,-1e-06,-1e-06,0,1e-06,1e-06,-1e-06,0,0,-1e-06,0,0,-1e-06,1e-06,1e-06,0,-2e-06,1e-06,0,0,0,0,0,0,0,0,0,-1e-06,-3e-06,4e-05,0,-6e-06,-7e-06,-2.5e-05,4e-06,0,1.6e-05,-1e-06,1e-06,0,1e-06,-1e-06,1e-06,1.3e-05,6e-06,-1e-06,4e-06,-3e-06,-3e-06,3e-06,0,0,-2e-06,4e-06,0,0,-8e-06,0,0,0,-2e-06,3e-06,-1e-06,0,0,-3e-06,0,-1e-06,0,2e-06,0,-1e-06,0,2e-06,-1e-06,0,-1e-06,1e-06,0,-1e-06
-8e-06,-3e-06,-6e-06,-3e-06,-6e-06,0,-1e-06,2e-06,0,0,-1e-06,0,1e-06,1.1e-05,1e-06,1e-06,0,-2e-06,-1e-06,1e-06,0,0,1e-06,-1e-06,1e-06,1e-06,0,-1e-06,1e-06,0,0,1e-06,0,0,0,0,3e-06,-1e-06,0,1e-06,0,0,1e-06,1e-06,0,0,0,0,0,0,-1e-06,0,2e-06,1e-06,0,0,0,0,-1e-06,0,-1e-06,-2e-06,-2e-06,0,0,0,-1e-06,0,0,8e-06,-3.9e-05,-1e-06,9e-06,4e-06,1.2e-05,7e-06,-1e-06,-6e-06,-1e-06,0,3e-06,2e-06,-4e-06,0,-1e-05,-4e-06,2e-06,-4e-06,0,-1e-06,0,-3e-06,0,-2e-06,-2e-06,0,3e-06,0,-1e-06,-3e-06,0,4e-06,0,4e-06,0,0,-1e-06,-1e-06,1e-06,0,0,0,-2e-06,0,-2e-06,0,0,0,0,0,0
-7e-06,3e-06,3e-06,1e-06,3e-06,-3e-06,-2e-06,1e-06,-1e-06,1e-06,-2e-06,1e-06,-1e-06,6e-06,1e-06,1e-06,-1e-06,-2e-06,-2e-06,-1e-06,0,0,1e-06,-1e-06,-1e-06,-1e-06,0,-2e-06,-1e-06,0,-1e-06,0,-1e-06,1e-06,0,0,3e-06,0,0,0,0,-1e-06,1e-06,-1e-06,1e-06,-1e-06,-1e-06,-1e-06,0,0,0,0,0,0,0,0,0,0,0,0,-1e-06,-1e-06,0,0,0,0,1e-06,0,0,-2e-06,4.8e-05,-2e-06,-5e-06,-2e-06,-2e-06,1e-06,0,-9e-06,-1e-06,-1e-06,1e-06,-4e-06,-1e-06,-1e-06,6e-06,-1e-06,-5e-06,-4e-06,0,4e-06,-5e-06,2e-06,1e-06,6e-06,0,-1e-06,3e-06,-1e-06,2e-06,-2e-06,0,-4e-06,-1e-06,2e-06,1e-06,-2e-06,0,0,-1e-06,0,-1e-06,0,0,0,2e-06,-2e-06,0,1e-06,0,0,0
-2.1e-05,-1e-06,-1e-06,-2e-06,1e-06,0,2e-06,0,-1e-06,-1e-06,-2e-06,-2e-06,0,-2e-06,0,-1e-06,0,-2e-06,1e-06,0,1e-06,0,0,0,1e-06,1e-06,-1e-06,-1e-06,-2e-06,0,1e-06,0,0,0,0,0,0,1e-06,0,-1e-06,0,2e-06,1e-06,1e-06,-1e-06,-1e-06,0,0,0,1e-06,-1e-06,0,0,0,0,-1e-06,0,-1e-06,0,0,-1e-06,0,-1e-06,0,0,0,0,0,0,0,-4.8e-05,5e-06,-1e-05,4e-06,-8e-06,2e-06,0,1.4e-05,-1e-06,5e-06,1e-06,3e-06,-1e-06,2e-06,-6e-06,4e-06,-1e-06,5e-06,2e-06,-6e-06,7e-06,3e-06,1e-06,2e-06,0,-2e-06,1e-06,-4e-06,-1e-06,-1e-06,-1e-06,2e-06,-2e-06,-4e-06,-1e-06,-2e-06,-1e-06,0,0,0,1e-06,-1e-06,0,0,-2e-06,-3e-06,0,0,-2e-06,0,0
-5e-06,-1e-06,-1e-06,2e-06,-3e-06,3e-06,-2e-06,-1e-06,0,0,0,3e-06,0,6e-06,0,-1e-06,-2e-06,4e-06,-1e-06,0,-2e-06,0,-1e-06,-1e-06,0,-1e-06,0,-2e-06,-1e-06,0,-1e-06,1e-06,-1e-06,-1e-06,0,0,-2e-06,0,0,0,0,-2e-06,-1e-06,0,1e-06,0,0,-1e-06,0,0,-1e-06,0,0,0,0,0,0,0,-1e-06,0,0,0,0,0,0,0,-1e-06,0,0,-2e-06,4e-05,-2e-06,7e-06,1e-06,1.7e-05,-3e-06,0,-7e-06,0,-3e-06,-4e-06,-1e-06,-3e-06,-1e-06,1e-06,-5e-06,-1e-06,1e-06,2e-06,8e-06,0,-4e-06,0,1e-06,0,-1e-06,5e-06,6e-06,1e-06,0,0,-1e-06,1e-06,3e-06,0,-1e-06,0,-1e-06,2e-06,0,0,0,-2e-06,0,1e-06,2e-06,0,1e-06,-1e-06,0,0
1.2e-05,2e-06,6e-06,2e-06,7e-06,-3e-06,2e-06,0,0,1e-06,1e-06,-5e-06,0,-2e-06,-1e-06,0,1e-06,3e-06,-1e-06,0,3e-06,0,0,-1e-06,1e-06,1e-06,-1e-06,-2e-06,1e-06,0,2e-06,-1e-06,0,1e-06,0,0,-2e-06,0,0,0,0,1e-06,-1e-06,-1e-06,-1e-06,0,1e-06,0,0,0,-1e-06,0,1e-06,-1e-06,0,0,0,-1e-06,1e-06,0,1e-06,1e-06,-2e-06,0,0,0,0,0,0,-2e-06,-4.4e-05,0,3e-06,0,-2.3e-05,-2e-06,1e-06,-7e-06,1e-06,-1e-06,6e-06,-1e-06,-1e-06,0,-3e-06,-2e-06,-1e-06,3e-06,-2e-06,-1e-05,-5e-06,-1e-06,-1e-06,0,1e-06,0,4e-06,3e-06,-2e-06,1e-06,0,1e-06,0,0,1e-06,0,2e-06,-1e-06,-4e-06,0,-2e-06,0,-1e-06,0,0,2e-06,0,1e-06,0,0,0
