4e-06,4e-06,2.9e-05,0,5e-06,5e-06,2.5e-05,3e-06,1.6e-05,0,6e-06,1.5e-05,7e-06,0,2.2e-05,9e-06,1.1e-05,1e-05,1e-06,3e-05,1.2e-05,4e-06,3.2e-05,1e-05,3e-06,6e-06,9e-06,7e-06,2e-05,3.1e-05,6e-06,2.3e-05,2.2e-05,2.4e-05,8e-06,1e-06,1.5e-05,2e-05,9e-06,1.5e-05,5e-06,6e-06,3e-05,2e-06,5e-06,1.1e-05,1.4e-05,1.9e-05,1.2e-05,4e-06,8e-06,1.1e-05,2.1e-05,0,7e-06,2.8e-05,4.7e-05,8e-06,3.1e-05,8e-06,1.9e-05,1e-06,1.8e-05,8e-06,2.4e-05,2e-06,4e-06,0,2.2e-05,9e-06,2.4e-05,5e-06,1.6e-05,2.8e-05,1.2e-05,1e-05,1e-06,9e-06,1e-06,1.1e-05,6e-06,2e-06,1e-06,5e-06,9e-06,2e-06,1.2e-05,1.9e-05,3e-06,4e-06,1.4e-05,1.5e-05,4e-06,7e-06,3e-06,8e-06,1e-05,1.4e-05,1.7e-05,1e-05,1.2e-05,1.2e-05,2e-06,4e-06,2.3e-05,2.4e-05,4e-06,3.7e-05,3.1e-05,1e-06,1e-05,2.1e-05,7e-06,1e-06,3.1e-05,2e-06,1.6e-05,3e-06,1.9e-05,2.5e-05,5e-06
5.6e-05,3e-06,5.9e-05,2.8e-05,1.7e-05,3.1e-05,7.6e-05,3.4e-05,9e-06,9e-06,4e-06,2.2e-05,3.7e-05,1.4e-05,3.7e-05,3.6e-05,6.5e-05,2.9e-05,1.6e-05,4e-05,3.4e-05,4.8e-05,5.3e-05,3.7e-05,1e-05,2.9e-05,2e-05,3.8e-05,3.6e-05,5.3e-05,2.8e-05,2.5e-05,3.7e-05,4.8e-05,1.7e-05,3.2e-05,4e-05,7e-05,4.6e-05,3.8e-05,5e-05,3.9e-05,6.2e-05,1.6e-05,3.1e-05,4.5e-05,3.2e-05,4.2e-05,5e-05,4.9e-05,4e-05,6.5e-05,5.2e-05,4.6e-05,5e-05,3.9e-05,9.9e-05,0.000114,5.6e-05,3.2e-05,3.6e-05,4.4e-05,5.6e-05,5.8e-05,6.6e-05,7.1e-05,4.7e-05,2.3e-05,6e-05,7.1e-05,3.6e-05,3.3e-05,2.6e-05,9.3e-05,6.3e-05,6.7e-05,1.4e-05,3.7e-05,2.8e-05,3.3e-05,3.4e-05,3e-06,1.5e-05,7e-06,3.9e-05,5e-05,4e-05,7.1e-05,2.4e-05,1.8e-05,9e-06,2.8e-05,2.6e-05,2.7e-05,1.5e-05,4.8e-05,5.1e-05,5.9e-05,5.3e-05,5.9e-05,2.2e-05,4.4e-05,4.3e-05,2.6e-05,3.5e-05,1.6e-05,2.3e-05,4.4e-05,7.9e-05,1.1e-05,3.5e-05,4.6e-05,8.7e-05,3.9e-05,1.2e-05,3.2e-05,2e-05,1.9e-05,1.6e-05,6.4e-05,4.6e-05
1.6e-05,3.4e-05,5e-05,3.4e-05,3.3e-05,3.5e-05,8.5e-05,8.8e-05,6.4e-05,3e-05,3.2e-05,3.1e-05,2.6e-05,3.2e-05,4.3e-05,4.3e-05,4.7e-05,3.6e-05,4.5e-05,7.3e-05,3.7e-05,3.1e-05,4.8e-05,6.7e-05,4.4e-05,5e-06,2.2e-05,4.9e-05,2.5e-05,4.5e-05,2.1e-05,3.5e-05,7.6e-05,3.2e-05,6.5e-05,4.2e-05,3e-05,9.2e-05,5e-05,3.4e-05,5.3e-05,7.4e-05,5e-05,8.7e-05,6.1e-05,1.5e-05,2.2e-05,2.2e-05,3.5e-05,9.5e-05,9e-05,9.1e-05,5.6e-05,4.2e-05,1.1e-05,6.1e-05,9e-05,7e-05,7.3e-05,5.7e-05,6e-05,7.6e-05,9.7e-05,4.6e-05,4.2e-05,3.1e-05,5e-06,5.7e-05,3.5e-05,4.5e-05,6.6e-05,1.6e-05,7.3e-05,7.2e-05,6.1e-05,3.7e-05,5e-05,6.9e-05,6e-06,9e-06,2.2e-05,2.9e-05,2e-05,3.2e-05,4.2e-05,6e-05,3.9e-05,5.7e-05,1.6e-05,4.4e-05,3.1e-05,1.6e-05,2.1e-05,5.4e-05,9.6e-05,7.3e-05,4.9e-05,2e-05,3.4e-05,3.1e-05,2.6e-05,3.7e-05,0.000101,6e-05,1.1e-05,1.5e-05,2.7e-05,3.6e-05,6.2e-05,3.3e-05,6.1e-05,4.3e-05,9.7e-05,2e-05,3.2e-05,1.7e-05,1.1e-05,1.8e-05,1.9e-05,5.5e-05,3.2e-05
3.3e-05,8e-06,9.2e-05,0.000105,2.6e-05,3.2e-05,0.000113,1.4e-05,7.2e-05,1.3e-05,7.3e-05,1.7e-05,4.6e-05,0.000102,5e-05,5.9e-05,9e-05,7.2e-05,4.8e-05,0.000102,0.000112,6.2e-05,3.4e-05,7.4e-05,4.8e-05,1.3e-05,6.3e-05,4.2e-05,1.7e-05,0.00014,9e-05,3.3e-05,6.6e-05,0.000144,0.000127,7.9e-05,5.6e-05,8.6e-05,6.7e-05,2.1e-05,6.1e-05,0.000164,0.000189,0.000173,4.6e-05,4.7e-05,0.000116,1.8e-05,2.2e-05,0.00014,5.4e-05,7.4e-05,7.8e-05,4.6e-05,4.8e-05,9.5e-05,2.3e-05,7.5e-05,7.2e-05,0.000116,5.4e-05,4.8e-05,1.9e-05,6.1e-05,5e-05,4e-05,6.1e-05,8.1e-05,6.2e-05,2.9e-05,0.000148,0.00013,7.4e-05,0.000122,9.4e-05,7e-05,4.2e-05,0.000124,6.3e-05,4e-05,1.8e-05,1.9e-05,2.7e-05,9e-06,6.5e-05,1.3e-05,5.3e-05,0.000108,2.7e-05,5.1e-05,2.4e-05,6.5e-05,3.6e-05,0.000104,0.000106,0.000123,5.7e-05,5.4e-05,3.4e-05,3.3e-05,5.8e-05,5.9e-05,8.9e-05,3.3e-05,4.2e-05,1.9e-05,5.1e-05,0.000112,8.2e-05,8.9e-05,4.3e-05,7.9e-05,0.000109,8.2e-05,2.2e-05,1.6e-05,4.2e-05,6e-05,5e-05,6e-05,0.00011
5.9e-05,4.6e-05,0.000111,8.8e-05,7.8e-05,0.000126,5.7e-05,8.7e-05,0.000118,6.8e-05,7.8e-05,5.3e-05,3.9e-05,0.000126,0.000103,8.2e-05,8.5e-05,0.000103,4.3e-05,0.000148,0.000137,6.1e-05,2.2e-05,4.7e-05,6.9e-05,8.4e-05,0.000126,0.000118,0.000132,0.000272,0.000156,5.1e-05,7.3e-05,0.000114,5.1e-05,4.3e-05,6.7e-05,3.7e-05,6.8e-05,5.2e-05,8.3e-05,0.000175,5.6e-05,0.000168,0.000167,6.1e-05,0.00012,0.000149,5.9e-05,0.000131,0.000149,8.9e-05,2.8e-05,5.2e-05,5.6e-05,0.000157,0.000138,0.000122,6.5e-05,0.000152,0.000182,0.000107,7e-05,5.8e-05,9e-05,7.8e-05,0.000115,6.6e-05,1.6e-05,3.5e-05,0.000137,0.000164,0.000133,3e-05,6.1e-05,3.8e-05,4.3e-05,7.9e-05,0.000103,0.000132,6.2e-05,1.7e-05,3.4e-05,2e-05,7.3e-05,5.3e-05,4.9e-05,0.000104,0.000103,5.7e-05,4.5e-05,0.00011,0.00011,7.3e-05,6.9e-05,0.000128,0.000175,9.4e-05,7.2e-05,5e-05,8.2e-05,9e-05,5e-06,2.7e-05,3e-05,6.2e-05,6.4e-05,9.3e-05,0.000204,0.000232,9.2e-05,7.9e-05,0.000227,0.000215,0.00012,0.000102,7e-05,0.000119,0.000133,0.000129,0.000132
4.2e-05,7.5e-05,5.8e-05,1.4e-05,5e-05,0.000123,0.000119,5.9e-05,5.9e-05,9.3e-05,5.3e-05,4.2e-05,7.5e-05,0.000114,0.000101,6.4e-05,0.000131,4e-05,6.2e-05,5.9e-05,7.1e-05,4.3e-05,5.4e-05,7.8e-05,5.7e-05,0.000126,0.00016,0.000126,0.000117,0.000158,0.000131,2.6e-05,7.1e-05,4.9e-05,9.4e-05,6.4e-05,6.7e-05,6.5e-05,1.3e-05,2.3e-05,0.000112,6e-05,0.000118,0.000116,3.4e-05,7.2e-05,0.000107,8.7e-05,6e-05,8.9e-05,4.1e-05,3.4e-05,8.1e-05,5e-05,0.000107,8.6e-05,2.5e-05,5.4e-05,3.4e-05,0.000147,9.2e-05,8.5e-05,9e-06,2.1e-05,8.1e-05,0.000136,4.2e-05,2.6e-05,1.2e-05,2e-05,8.7e-05,6.6e-05,2.5e-05,4e-05,6.3e-05,5.3e-05,9.3e-05,9.8e-05,0.000112,2.8e-05,3.2e-05,3.6e-05,2.3e-05,2.8e-05,5.8e-05,5.5e-05,8.9e-05,5.2e-05,8.6e-05,1.3e-05,4e-05,3.8e-05,8.4e-05,0.000122,0.000136,0.000103,0.000109,3e-05,3.9e-05,2.3e-05,5.4e-05,1e-05,8.6e-05,4.7e-05,3e-05,8.1e-05,2.3e-05,0.00012,0.000167,0.000113,0.000167,6.6e-05,0.000153,6.5e-05,9e-05,0.000122,7.4e-05,0.000107,4.1e-05,2.8e-05,4.8e-05
5.2e-05,6.4e-05,0.000114,8.8e-05,8.5e-05,0.000184,9.8e-05,6.4e-05,5.9e-05,6.9e-05,2.5e-05,5e-05,8.9e-05,0.000113,2.2e-05,3.7e-05,0.000114,6.6e-05,0.000117,8e-05,8.6e-05,0.000156,0.000135,6.7e-05,0.00011,5.9e-05,0.000129,0.000197,0.000185,0.000102,2.5e-05,0.000128,0.000124,0.000143,0.000126,8.1e-05,0.000109,2.1e-05,3.6e-05,5e-05,0.000108,0.000101,2.2e-05,2.8e-05,2.7e-05,8.6e-05,5.9e-05,5.1e-05,5e-06,5.7e-05,7.5e-05,4e-05,9e-05,7.4e-05,1e-04,8.4e-05,6.7e-05,3.2e-05,1.9e-05,0.000137,0.000107,0.000123,7.9e-05,7.4e-05,3.5e-05,0.000146,0.000146,5.9e-05,5.3e-05,4.7e-05,0.000106,4.8e-05,2e-05,6.1e-05,4e-05,4.2e-05,8.6e-05,2.3e-05,5.4e-05,6.6e-05,0.000125,0.000123,8.2e-05,2.2e-05,5.7e-05,6e-05,5.5e-05,8e-05,4.3e-05,7.3e-05,4.1e-05,1.9e-05,0.000147,9e-05,6e-06,8.8e-05,0.000157,0.000135,3.6e-05,3.5e-05,6.9e-05,3e-05,0.00015,8.6e-05,1.3e-05,9.9e-05,7e-05,9.1e-05,9e-06,6e-06,0.000136,0.000166,0.000133,4.3e-05,0.000117,9.5e-05,7.3e-05,0.000122,0.000102,0.000119,0.000134
6.3e-05,2.9e-05,9.8e-05,5.7e-05,0.000149,8.3e-05,7.7e-05,2.6e-05,7.8e-05,3.9e-05,6e-06,8e-05,0.000181,0.000167,0.000126,0.000166,4.3e-05,6.7e-05,0.000127,3e-05,5e-05,0.000138,8.8e-05,1.1e-05,7.7e-05,8e-05,0.000157,3.6e-05,0.000131,0.000136,0.000121,2e-04,0.000147,8e-05,6e-05,5.8e-05,3.8e-05,4.4e-05,4.4e-05,2.2e-05,0.000104,0.000104,0.00014,8.8e-05,0.000142,0.00014,0.000102,0.000138,9.2e-05,5e-05,1.2e-05,3.2e-05,5.6e-05,6.8e-05,3.7e-05,5.3e-05,4.2e-05,8.5e-05,5.8e-05,0.000113,0.000101,0.000103,5.8e-05,6.7e-05,8.6e-05,0.000102,0.000158,0.000113,0.000111,2.8e-05,0.000147,6.8e-05,5.3e-05,0.000128,6.4e-05,3.6e-05,0.000146,0.000141,7.1e-05,0.000101,0.000186,7.9e-05,9e-05,5.5e-05,4.2e-05,2.3e-05,8.3e-05,8.8e-05,2.7e-05,6.1e-05,2.9e-05,6.6e-05,0.000134,0.000124,4.1e-05,0.000103,7.5e-05,0.000126,9.4e-05,3e-06,9.1e-05,9e-05,0.00014,6.9e-05,2.9e-05,7.5e-05,5.7e-05,3.2e-05,2.6e-05,7.7e-05,8.5e-05,0.000127,7.2e-05,3.1e-05,6.8e-05,5.7e-05,7.2e-05,0.000122,8.6e-05,6.7e-05,0.000108
3e-05,9.1e-05,9.7e-05,4.9e-05,0.000132,9.9e-05,0.00015,0.000138,6.5e-05,2.4e-05,7e-06,6.4e-05,8.7e-05,2.5e-05,5.7e-05,0.000118,8.5e-05,8.1e-05,5.9e-05,7.8e-05,5.4e-05,8.4e-05,0.000139,0.000125,7.3e-05,4e-05,5.5e-05,1e-04,5.3e-05,1.4e-05,8.1e-05,0.00012,7e-05,1.6e-05,7.1e-05,7e-05,8e-05,7.2e-05,0.000107,7.8e-05,3.8e-05,1e-05,0.000121,8.1e-05,0.000132,6.5e-05,1.1e-05,8.6e-05,2.8e-05,2.5e-05,1.9e-05,3.7e-05,6e-06,3.4e-05,7.5e-05,1.7e-05,3.6e-05,0.000123,7.2e-05,2.5e-05,7.7e-05,0.000151,0.000114,8e-05,0.000102,0.000165,4.3e-05,6.2e-05,5.3e-05,9.4e-05,7.7e-05,5.2e-05,4.4e-05,9.6e-05,8.6e-05,0.00011,0.000241,0.000124,1.3e-05,0.000135,0.000114,7.2e-05,0.000104,6.4e-05,2e-05,3.5e-05,3.5e-05,6.2e-05,5.9e-05,5.3e-05,7.3e-05,6.6e-05,0.000113,3.9e-05,6.5e-05,0.000106,3.9e-05,0.000132,9.7e-05,4.8e-05,0.000141,0.000115,0.000106,9.4e-05,1e-04,5.9e-05,6.9e-05,7.2e-05,4.1e-05,8e-05,0.000111,0.000117,8.1e-05,5e-05,5.4e-05,1.6e-05,3.5e-05,3.1e-05,4e-05,7e-05,0.000103
5e-05,5.1e-05,4e-05,6.3e-05,3.5e-05,3.5e-05,6.9e-05,3.4e-05,1.3e-05,3.4e-05,4.6e-05,1.9e-05,8.9e-05,3.7e-05,1.4e-05,8.4e-05,5.2e-05,2.4e-05,5.2e-05,1.3e-05,7.8e-05,6.5e-05,9.1e-05,7.5e-05,4.4e-05,1.7e-05,3.9e-05,7.4e-05,9.6e-05,4.8e-05,8.6e-05,0.000107,7.9e-05,1.2e-05,6.7e-05,2.6e-05,5.8e-05,5e-05,7.8e-05,2.9e-05,4.7e-05,4.4e-05,9.8e-05,9e-05,2.8e-05,3.6e-05,2.9e-05,5.6e-05,4.4e-05,2.4e-05,2.7e-05,3.8e-05,1.2e-05,1.2e-05,6.4e-05,5.9e-05,6.5e-05,0.000104,4.5e-05,2.2e-05,6.1e-05,6.1e-05,2.3e-05,4.1e-05,7.2e-05,7.7e-05,4.3e-05,5.5e-05,2.5e-05,7.2e-05,4.7e-05,1.4e-05,2.9e-05,7e-05,1.8e-05,3.4e-05,0.000146,8.1e-05,2.7e-05,0.000152,9e-05,4e-05,7.3e-05,4.1e-05,4.9e-05,1.4e-05,2.8e-05,8.2e-05,5.8e-05,5.8e-05,3.3e-05,0.000101,5.9e-05,8.7e-05,6.3e-05,3.9e-05,1.7e-05,9.5e-05,8e-06,2.4e-05,0.000119,4.9e-05,7.3e-05,2.9e-05,6.4e-05,5.6e-05,9.8e-05,4e-05,5.3e-05,7.9e-05,3.3e-05,5e-05,1.8e-05,3e-05,2.8e-05,7.3e-05,3.1e-05,1.6e-05,7.3e-05,7.7e-05,0.000119
3.1e-05,4.8e-05,5.7e-05,3e-05,3.1e-05,4.6e-05,2.2e-05,3.2e-05,2.7e-05,5.8e-05,2.5e-05,3e-06,4.9e-05,4.1e-05,3.8e-05,2.8e-05,4.3e-05,4.2e-05,2.9e-05,4.2e-05,7.1e-05,4.4e-05,8.7e-05,4.6e-05,2.6e-05,1.2e-05,2.5e-05,7.4e-05,0.000101,6.2e-05,6.6e-05,0.000104,4.2e-05,5e-05,2.6e-05,5.6e-05,1.9e-05,1.2e-05,4e-05,4e-05,3.5e-05,5.1e-05,0.000112,3.7e-05,4.8e-05,5.1e-05,5.9e-05,4.3e-05,4.2e-05,4.4e-05,2.8e-05,5.1e-05,5.7e-05,3.5e-05,3.6e-05,1.3e-05,6.4e-05,4.5e-05,2.1e-05,8e-06,4.4e-05,8.1e-05,9.2e-05,8.8e-05,4.4e-05,4.9e-05,4e-05,5.1e-05,1.3e-05,4.1e-05,2.7e-05,4.2e-05,4.9e-05,9e-06,5.7e-05,3.1e-05,7.3e-05,3.7e-05,2.2e-05,8.4e-05,7.8e-05,5.8e-05,8.4e-05,6.1e-05,4.3e-05,2.2e-05,2.8e-05,5.4e-05,2.8e-05,2.2e-05,2.7e-05,0.000103,7.3e-05,7.5e-05,2.3e-05,4e-05,5.7e-05,3.7e-05,4.5e-05,2.9e-05,5.6e-05,3.9e-05,5.2e-05,4.1e-05,1.6e-05,5.3e-05,3.7e-05,5.8e-05,6.4e-05,2.9e-05,3.3e-05,4.8e-05,6.9e-05,4.5e-05,3e-05,3.3e-05,5.4e-05,6.5e-05,7.5e-05,4.6e-05,2e-05
1.3e-05,9e-06,1.4e-05,7e-06,1.2e-05,3.6e-05,2.2e-05,1.5e-05,2.3e-05,2.9e-05,2.7e-05,9e-06,2.8e-05,2.9e-05,2.4e-05,2e-05,3.3e-05,7e-06,5e-06,2.1e-05,2e-05,2.5e-05,2.1e-05,2.7e-05,1.5e-05,8e-06,8e-06,5.2e-05,1.8e-05,2.1e-05,3.8e-05,4.4e-05,2.3e-05,4.3e-05,1.9e-05,2.4e-05,1.4e-05,3.2e-05,9e-06,1.5e-05,5.2e-05,1.5e-05,3.2e-05,7e-06,4.1e-05,2.9e-05,1.6e-05,1.1e-05,2.7e-05,7e-06,1.6e-05,4.4e-05,3.4e-05,9e-06,2.4e-05,2.6e-05,4.7e-05,3.1e-05,2e-05,1.9e-05,1.6e-05,2.6e-05,4.6e-05,4e-06,3.4e-05,3.5e-05,2.3e-05,9e-06,3e-05,2.9e-05,1.1e-05,1.8e-05,1.4e-05,1.3e-05,3.9e-05,6e-06,6e-06,1.3e-05,3.3e-05,2.7e-05,4.9e-05,9e-06,2.7e-05,1.4e-05,1.6e-05,1.8e-05,1.9e-05,1.6e-05,1.3e-05,1.5e-05,8e-06,5.3e-05,9e-06,3.9e-05,2.4e-05,1.2e-05,4.7e-05,2.1e-05,1.9e-05,9e-06,2.3e-05,1.5e-05,2e-06,2.5e-05,2.8e-05,5.2e-05,2.1e-05,3e-05,2e-05,2.1e-05,3.4e-05,2.4e-05,2.1e-05,1.2e-05,1.5e-05,2.6e-05,1.7e-05,2e-05,5.9e-05,3.2e-05,2.2e-05
7e-06,9e-06,1.1e-05,2e-06,1e-05,8e-06,1.4e-05,6e-06,9e-06,1.6e-05,1.4e-05,1e-05,8e-06,2e-05,1.8e-05,2.1e-05,2.8e-05,2.2e-05,2.2e-05,2e-05,2.7e-05,3.3e-05,1.8e-05,1.8e-05,1.5e-05,1.2e-05,1.8e-05,2.4e-05,8e-06,1.2e-05,1.8e-05,2.9e-05,1.3e-05,2.2e-05,1.6e-05,1.1e-05,8e-06,1.9e-05,1.5e-05,8e-06,2.7e-05,2.7e-05,2.6e-05,1.7e-05,2.7e-05,1.7e-05,9e-06,1.5e-05,1.2e-05,8e-06,1.3e-05,1.8e-05,1.3e-05,6e-06,1.7e-05,6e-06,4e-05,1.1e-05,1.3e-05,2.1e-05,1.6e-05,1.8e-05,2e-05,2.3e-05,3e-06,1.1e-05,1.4e-05,1e-05,8e-06,2.5e-05,3e-06,8e-06,4e-06,2e-06,6e-06,1.9e-05,2.5e-05,2.1e-05,1.9e-05,4.5e-05,9e-06,2.3e-05,1.7e-05,2.1e-05,1.3e-05,6e-06,1.6e-05,1.7e-05,4e-06,1.9e-05,1.7e-05,9e-06,1.8e-05,2.3e-05,1.8e-05,1.6e-05,3.3e-05,6e-06,1.3e-05,1.9e-05,3.4e-05,5e-06,2.6e-05,7e-06,9e-06,8e-06,7e-06,1.1e-05,1.4e-05,9e-06,2e-05,1.9e-05,1e-05,1.5e-05,3.1e-05,1.1e-05,2.2e-05,1.4e-05,1.7e-05,2.6e-05,8e-06
1.9e-05,7e-06,2.4e-05,1.2e-05,1.7e-05,7e-06,1.9e-05,1.2e-05,1.5e-05,1.2e-05,9e-06,2.8e-05,2.8e-05,5e-06,1.3e-05,1.7e-05,1.1e-05,1.7e-05,5e-05,3e-05,1.3e-05,2.6e-05,1.8e-05,4e-05,2.1e-05,2.8e-05,1.3e-05,3.3e-05,5e-06,2.1e-05,4e-06,1.4e-05,8e-06,2e-05,2e-05,3.7e-05,2.1e-05,3.1e-05,2e-05,1.8e-05,2.5e-05,1.2e-05,2.2e-05,1.4e-05,2.6e-05,2.1e-05,1e-05,9e-06,7e-06,1.5e-05,1e-05,4e-06,8e-06,1.1e-05,7e-06,1.5e-05,2.7e-05,1.7e-05,1.6e-05,1.6e-05,1.7e-05,2.1e-05,1.5e-05,2.1e-05,1.2e-05,1.6e-05,6e-06,1.3e-05,5e-06,1.6e-05,1.9e-05,2.1e-05,1e-05,7e-06,1.4e-05,1.8e-05,2.4e-05,1.7e-05,8e-06,3e-05,4e-06,1.3e-05,3.3e-05,1.8e-05,1.8e-05,1.6e-05,2.2e-05,4e-06,5e-06,2.2e-05,1.8e-05,3.8e-05,2.4e-05,1.4e-05,6e-06,2.1e-05,1.5e-05,7e-06,9e-06,1.8e-05,3.8e-05,2e-05,2.5e-05,3e-05,4e-06,1.8e-05,1.1e-05,2e-06,3e-05,2.2e-05,1.5e-05,2.2e-05,9e-06,2.4e-05,2.1e-05,1.3e-05,9e-06,2.6e-05,1.8e-05,1.6e-05,1e-05
3.2e-05,2.4e-05,2.2e-05,1.9e-05,8e-06,2.2e-05,3.2e-05,1.3e-05,2e-05,2.6e-05,2e-05,3.3e-05,1.6e-05,1.3e-05,2.1e-05,3e-06,2.7e-05,8e-06,4.6e-05,4.5e-05,5.3e-05,3.8e-05,3.9e-05,2.7e-05,2.2e-05,3.9e-05,5.8e-05,1.4e-05,1.3e-05,2.9e-05,3.4e-05,1.2e-05,9e-06,2.3e-05,1.6e-05,4.2e-05,2e-05,3.2e-05,9e-06,1.3e-05,8e-06,3.5e-05,2.9e-05,2.6e-05,2.2e-05,6e-06,3.4e-05,4e-05,3.1e-05,1.4e-05,2.8e-05,1.4e-05,1.6e-05,8e-06,1.5e-05,2.3e-05,7e-06,1.6e-05,9e-06,2.1e-05,2.1e-05,2e-06,1.9e-05,1.8e-05,1.1e-05,2.2e-05,1.5e-05,2.1e-05,2e-06,1.3e-05,2.9e-05,3.1e-05,2.1e-05,1.2e-05,1.6e-05,9e-06,1.8e-05,1e-05,2.1e-05,3.9e-05,1.4e-05,1.1e-05,3.7e-05,4.2e-05,2e-05,4e-06,2.6e-05,1.3e-05,5e-06,1.7e-05,2.9e-05,3e-05,1.4e-05,2.2e-05,1.8e-05,2.9e-05,1e-05,2.5e-05,1.3e-05,1.3e-05,1.6e-05,2.8e-05,2.5e-05,2e-05,2.6e-05,1.4e-05,2.6e-05,1.3e-05,1.9e-05,8e-06,2.4e-05,2.7e-05,1.1e-05,3.9e-05,4.6e-05,2.4e-05,9e-06,2.9e-05,4e-06,2e-05,5.6e-05
2.5e-05,1e-05,3.3e-05,1.8e-05,6e-06,1.2e-05,1.2e-05,1.3e-05,1.6e-05,8e-06,1.8e-05,1.9e-05,2.3e-05,1.4e-05,1.7e-05,6e-06,1.9e-05,1.1e-05,2.2e-05,3.6e-05,2.3e-05,2.5e-05,4.2e-05,1.3e-05,2.6e-05,6e-06,3.2e-05,3e-05,3.7e-05,1e-05,2.9e-05,3.2e-05,3.4e-05,4.2e-05,3.9e-05,7e-06,5e-06,2e-05,1.8e-05,1e-05,6e-06,3.6e-05,5e-05,7e-06,3.2e-05,2.6e-05,2.1e-05,5.3e-05,2.7e-05,1.8e-05,1e-05,2.2e-05,2e-05,6e-06,1.8e-05,2e-05,1.3e-05,1.1e-05,1.1e-05,2.2e-05,2.3e-05,1.7e-05,6e-06,2.7e-05,2.4e-05,2.3e-05,8e-06,2.6e-05,1.4e-05,1.4e-05,2e-05,1.8e-05,2.1e-05,2.2e-05,3.8e-05,2.7e-05,1.9e-05,2.8e-05,2e-05,3.2e-05,1.6e-05,1.9e-05,2e-05,8e-06,2.7e-05,9e-06,1e-05,1.3e-05,1.4e-05,2.5e-05,8e-06,3.5e-05,2.4e-05,2.8e-05,5e-06,2.2e-05,2.3e-05,2.1e-05,2.3e-05,1.8e-05,2.1e-05,1.2e-05,1.7e-05,1.9e-05,2.5e-05,2e-05,4.4e-05,2.5e-05,1.2e-05,6e-06,3.5e-05,1.5e-05,2.6e-05,1.7e-05,7e-06,1.2e-05,2e-06,3.1e-05,4e-06,2.8e-05,4.6e-05
1.2e-05,1e-05,1.9e-05,2.4e-05,3e-05,4e-06,4e-06,1.7e-05,1.6e-05,5e-06,1.4e-05,9e-06,7e-06,2.2e-05,1.3e-05,2e-05,2.1e-05,2.2e-05,1.9e-05,2.7e-05,4.1e-05,1.4e-05,3e-05,1.7e-05,2.5e-05,4e-06,7e-06,1.2e-05,4.7e-05,4.7e-05,9e-06,2.8e-05,3e-05,3.7e-05,2.5e-05,1e-05,1.3e-05,3e-05,2.7e-05,3.5e-05,3e-05,3.7e-05,6e-06,2e-06,5.9e-05,1.8e-05,3.1e-05,3.3e-05,9e-06,4e-06,6e-06,2.4e-05,1.5e-05,1.2e-05,2.1e-05,2e-05,1.8e-05,1.3e-05,1.6e-05,2.2e-05,3.1e-05,8e-06,2.3e-05,2.2e-05,1.4e-05,2e-05,1.8e-05,4e-06,1.7e-05,1.7e-05,2.5e-05,1.6e-05,1.9e-05,7e-06,1.8e-05,1.4e-05,5e-06,2.5e-05,2.5e-05,5e-06,2.7e-05,1.1e-05,1.9e-05,2.2e-05,2.1e-05,3.8e-05,2.9e-05,4e-06,2e-06,3.9e-05,2.4e-05,2.3e-05,2.7e-05,1.5e-05,1.5e-05,1.1e-05,1.5e-05,2.6e-05,3.1e-05,2.3e-05,2.6e-05,3.8e-05,3.7e-05,2.2e-05,1.9e-05,1.3e-05,3.6e-05,4.7e-05,1.6e-05,2.4e-05,4.2e-05,2.4e-05,2.9e-05,1.9e-05,1.1e-05,5e-06,5e-06,3.9e-05,2.7e-05,3.3e-05,7e-05
2.3e-05,1.9e-05,1.6e-05,2.6e-05,3.9e-05,3.4e-05,1.2e-05,1.9e-05,8e-06,1.8e-05,2.2e-05,2e-05,2.3e-05,3.8e-05,4.7e-05,1.9e-05,1.3e-05,1.7e-05,2.7e-05,8e-06,4.4e-05,4.8e-05,1.8e-05,3.2e-05,1.7e-05,2e-05,3.8e-05,4.9e-05,5e-06,2e-06,2e-06,4.1e-05,4e-06,1.9e-05,5e-06,2.9e-05,4.3e-05,3e-06,3.5e-05,7e-06,8e-06,2e-05,2e-05,2.6e-05,4.1e-05,3.1e-05,2e-05,4.7e-05,2.5e-05,1.1e-05,1.7e-05,1e-05,2.8e-05,2.5e-05,3.5e-05,2.8e-05,2.7e-05,3.3e-05,3.5e-05,2e-05,1.5e-05,2.4e-05,2e-05,2.3e-05,8e-06,3.3e-05,1e-05,1.9e-05,1.9e-05,5e-06,2.1e-05,2.6e-05,2e-05,3e-06,2.3e-05,9e-06,1.8e-05,3e-06,1.4e-05,1.9e-05,1.2e-05,1.2e-05,1.2e-05,1.9e-05,1.5e-05,3e-05,2e-06,3.8e-05,3.4e-05,4.4e-05,2.9e-05,1.9e-05,1.6e-05,3e-05,2.5e-05,1.2e-05,2e-06,7e-06,3.1e-05,2.3e-05,1.5e-05,4.4e-05,1.7e-05,2.8e-05,3.4e-05,2.6e-05,2.9e-05,1.7e-05,2.5e-05,3.2e-05,2.9e-05,1.1e-05,2.2e-05,7e-06,5e-06,8e-06,2.2e-05,3.5e-05,3.5e-05,2.7e-05,3.5e-05
3.4e-05,1.6e-05,3.6e-05,1.6e-05,4.4e-05,2.1e-05,1.4e-05,2.2e-05,2.5e-05,3.9e-05,9e-06,3.1e-05,2.2e-05,1.5e-05,3.5e-05,1.5e-05,1.1e-05,2.8e-05,3.5e-05,3.9e-05,7e-05,4.9e-05,4.9e-05,4.5e-05,7e-06,1.6e-05,4.1e-05,7.4e-05,4.4e-05,3.2e-05,2.3e-05,2.9e-05,3.4e-05,2.1e-05,1.3e-05,2.7e-05,5.9e-05,4.7e-05,4.3e-05,2.9e-05,1.6e-05,1.3e-05,3e-06,5.1e-05,2.4e-05,1.1e-05,2.5e-05,2.8e-05,3.2e-05,2.7e-05,2.7e-05,2e-05,2.8e-05,6e-06,1.1e-05,2.3e-05,1.3e-05,2.7e-05,1.5e-05,1e-05,3.5e-05,2.4e-05,3.2e-05,2.1e-05,2e-05,4e-05,3.9e-05,3.4e-05,2.5e-05,1.5e-05,2.7e-05,4.1e-05,1.6e-05,9e-06,3.8e-05,3.6e-05,2.7e-05,1.5e-05,1.5e-05,1.2e-05,3.4e-05,1.2e-05,1.2e-05,3.2e-05,3.1e-05,1.2e-05,2.2e-05,5e-05,4.7e-05,1.7e-05,1.1e-05,8e-06,2.3e-05,1.8e-05,3.9e-05,2.5e-05,6e-06,1.1e-05,3.8e-05,2.7e-05,3e-05,2.2e-05,4.9e-05,4.1e-05,6e-06,1.4e-05,1.2e-05,2.2e-05,4.5e-05,2.4e-05,2.9e-05,4e-05,3e-05,1e-05,1.8e-05,2.5e-05,3.9e-05,1.6e-05,1.2e-05,1e-05,3.6e-05
4.6e-05,2.5e-05,3.7e-05,2.6e-05,2.5e-05,2.5e-05,2.2e-05,8e-06,1.7e-05,2.6e-05,2.7e-05,1.7e-05,2.5e-05,1.6e-05,2.3e-05,1.8e-05,1.4e-05,1.5e-05,1.4e-05,1.2e-05,4.5e-05,3.7e-05,3.7e-05,7e-06,1e-05,2.9e-05,2e-06,3.8e-05,2.2e-05,3.1e-05,2.2e-05,3.3e-05,4.2e-05,4e-05,1.8e-05,1.1e-05,3.7e-05,1.2e-05,2.6e-05,3.6e-05,2.6e-05,1.5e-05,4e-06,4.1e-05,1.8e-05,2.2e-05,1.7e-05,1.1e-05,2.4e-05,4e-06,2.4e-05,3e-05,4.4e-05,4.5e-05,3.9e-05,2.8e-05,2.4e-05,2.1e-05,1.5e-05,1.2e-05,4.9e-05,4.5e-05,2.8e-05,1.5e-05,2.4e-05,1.2e-05,5e-06,3.3e-05,1.8e-05,1.8e-05,1.4e-05,3.6e-05,3.4e-05,2.8e-05,5.7e-05,3.9e-05,3.1e-05,7e-06,1.4e-05,1.6e-05,3.4e-05,3.3e-05,2.5e-05,2.2e-05,3.3e-05,4.2e-05,4.1e-05,3.2e-05,2.3e-05,2.4e-05,1.2e-05,9e-06,3e-05,4.8e-05,4.9e-05,1.6e-05,5e-06,1.4e-05,2.2e-05,2.2e-05,1.2e-05,2.1e-05,4.6e-05,1.6e-05,1.7e-05,2.9e-05,2.4e-05,1.9e-05,4.1e-05,2.4e-05,2.3e-05,2.7e-05,3.1e-05,4.5e-05,5.5e-05,3.2e-05,5.2e-05,3.1e-05,2.4e-05,2.9e-05,5e-06
3.5e-05,1.9e-05,1e-05,1.2e-05,1.5e-05,2.6e-05,9e-06,8e-06,1.2e-05,5e-06,5e-06,1.8e-05,3e-05,3.3e-05,3.9e-05,2.6e-05,3e-05,1.5e-05,5e-06,1.1e-05,1.9e-05,3.8e-05,2.3e-05,1.3e-05,1e-06,2.5e-05,3.4e-05,1.8e-05,9e-06,2.4e-05,1.7e-05,3e-06,1.7e-05,1.7e-05,6e-06,1.3e-05,2e-05,2.4e-05,2.7e-05,2.4e-05,1.9e-05,1.7e-05,1.1e-05,2e-05,1.8e-05,1.4e-05,7e-06,1.4e-05,1.7e-05,1.7e-05,9e-06,1.9e-05,3.1e-05,7e-06,2.4e-05,1.5e-05,1.6e-05,1.4e-05,6e-06,2.3e-05,8e-06,1.9e-05,1.6e-05,4e-05,1.5e-05,1.5e-05,3.3e-05,2.4e-05,2.5e-05,3.3e-05,1.9e-05,1.5e-05,1.9e-05,1.8e-05,1.8e-05,5e-06,2e-05,1.9e-05,4e-06,2.2e-05,1.8e-05,2.9e-05,2.8e-05,3.5e-05,1.1e-05,1.3e-05,1.3e-05,1.3e-05,6e-06,8e-06,2.3e-05,2e-05,2.3e-05,1.6e-05,1.1e-05,1.4e-05,1.2e-05,2.5e-05,2e-05,8e-06,1.1e-05,2.1e-05,1.5e-05,6e-06,2.2e-05,8e-06,7e-06,1.4e-05,2.4e-05,1.5e-05,6e-06,2.2e-05,3.9e-05,9e-06,2.7e-05,2.9e-05,1.3e-05,1.2e-05,1.8e-05,1.1e-05,3e-05
1.4e-05,1.1e-05,7e-06,5e-06,1.3e-05,9e-06,9e-06,2.6e-05,2.7e-05,1.7e-05,1.4e-05,1.1e-05,1.4e-05,7e-06,1e-05,2.2e-05,2.1e-05,4e-06,3e-06,3e-06,2.2e-05,2.9e-05,1.3e-05,8e-06,7e-06,8e-06,2.6e-05,1.5e-05,8e-06,1.7e-05,1.7e-05,1.9e-05,1.2e-05,8e-06,1e-05,1.2e-05,8e-06,5e-06,1.3e-05,1.1e-05,1.9e-05,1.7e-05,1.8e-05,1.4e-05,1.6e-05,3e-06,1.5e-05,1e-05,2.1e-05,5e-06,1.1e-05,2e-05,4e-06,2.1e-05,2e-06,9e-06,1.9e-05,9e-06,2.2e-05,6e-06,1e-05,1.3e-05,2.4e-05,1.6e-05,1.2e-05,1.2e-05,2.1e-05,3e-05,1.9e-05,2.2e-05,1.9e-05,1.5e-05,8e-06,2.6e-05,9e-06,3e-06,1.6e-05,1.2e-05,2.1e-05,2.2e-05,2.1e-05,1.3e-05,5e-06,2e-05,2.1e-05,1.3e-05,5e-06,2.6e-05,1.3e-05,1.2e-05,2.5e-05,5e-06,1.7e-05,2.4e-05,6e-06,6e-06,9e-06,1.2e-05,6e-06,1.5e-05,2.4e-05,5e-06,9e-06,1.5e-05,2.5e-05,1.9e-05,1.9e-05,7e-06,6e-06,2.3e-05,5e-06,2.5e-05,2.5e-05,2.4e-05,4e-06,1.9e-05,1.6e-05,1.6e-05,1e-05,1e-05,1.6e-05
1e-05,7e-06,6e-06,7e-06,5e-06,1e-05,8e-06,7e-06,5e-06,3e-06,8e-06,7e-06,6e-06,3e-06,1.6e-05,2e-06,1e-06,4e-06,6e-06,6e-06,1.1e-05,7e-06,8e-06,1.2e-05,1.3e-05,8e-06,6e-06,3e-06,8e-06,9e-06,8e-06,3e-06,5e-06,3e-06,4e-06,5e-06,1e-06,4e-06,2e-06,2e-06,9e-06,3e-06,3e-06,2e-06,5e-06,8e-06,1.3e-05,8e-06,1.2e-05,8e-06,5e-06,1.3e-05,8e-06,1.1e-05,4e-06,5e-06,9e-06,3e-06,1e-05,1.1e-05,3e-06,6e-06,4e-06,4e-06,6e-06,1e-06,5e-06,1.1e-05,7e-06,5e-06,9e-06,9e-06,5e-06,7e-06,6e-06,5e-06,2e-06,8e-06,6e-06,1e-05,1.9e-05,6e-06,3e-06,5e-06,5e-06,4e-06,1e-06,1.2e-05,1e-06,7e-06,6e-06,4e-06,5e-06,3e-06,2e-06,3e-06,5e-06,6e-06,1.2e-05,7e-06,1.5e-05,1.5e-05,4e-06,1e-06,8e-06,7e-06,1e-06,5e-06,8e-06,1.1e-05,7e-06,9e-06,1.1e-05,1.2e-05,6e-06,2e-06,8e-06,4e-06,8e-06,4e-06,8e-06
8e-06,2e-06,7e-06,1.3e-05,9e-06,1.1e-05,1.5e-05,1.7e-05,1.1e-05,1.1e-05,1.4e-05,9e-06,7e-06,9e-06,1.3e-05,1.2e-05,8e-06,4e-06,6e-06,1.3e-05,9e-06,4e-06,5e-06,9e-06,5e-06,2e-06,8e-06,7e-06,3e-06,6e-06,3e-06,3e-06,7e-06,3e-06,4e-06,7e-06,3e-06,6e-06,5e-06,4e-06,3e-06,4e-06,5e-06,5e-06,3e-06,7e-06,8e-06,7e-06,3e-06,3e-06,8e-06,7e-06,1e-06,5e-06,4e-06,4e-06,7e-06,7e-06,8e-06,8e-06,3e-06,1.1e-05,1e-06,9e-06,4e-06,2e-06,5e-06,5e-06,1e-06,3e-06,4e-06,7e-06,3e-06,1e-05,1.1e-05,8e-06,6e-06,1e-05,8e-06,2e-06,8e-06,4e-06,7e-06,8e-06,5e-06,4e-06,2e-06,1.2e-05,9e-06,6e-06,8e-06,8e-06,5e-06,4e-06,4e-06,1.2e-05,6e-06,2e-06,7e-06,5e-06,6e-06,7e-06,1.1e-05,9e-06,1e-06,6e-06,3e-06,8e-06,2e-06,1e-05,6e-06,8e-06,8e-06,3e-06,1.1e-05,6e-06,5e-06,1e-06,2e-06,4e-06,1.2e-05
1e-06,2e-06,4e-06,7e-06,6e-06,3e-06,4e-06,7e-06,5e-06,5e-06,4e-06,5e-06,3e-06,7e-06,1.3e-05,4e-06,8e-06,3e-06,8e-06,6e-06,7e-06,1.2e-05,7e-06,3e-06,7e-06,4e-06,8e-06,4e-06,2e-06,2e-06,7e-06,8e-06,4e-06,7e-06,1e-06,9e-06,7e-06,3e-06,1e-06,6e-06,7e-06,2e-06,4e-06,4e-06,5e-06,7e-06,3e-06,4e-06,7e-06,8e-06,9e-06,7e-06,3e-06,3e-06,5e-06,5e-06,4e-06,6e-06,5e-06,4e-06,5e-06,1e-05,1.1e-05,9e-06,5e-06,4e-06,8e-06,7e-06,4e-06,6e-06,3e-06,7e-06,1e-06,5e-06,5e-06,6e-06,4e-06,6e-06,1e-06,1.1e-05,5e-06,1.1e-05,0,6e-06,9e-06,5e-06,7e-06,6e-06,3e-06,8e-06,5e-06,3e-06,5e-06,2e-06,1e-06,1.4e-05,4e-06,2e-06,3e-06,4e-06,1e-06,7e-06,4e-06,3e-06,5e-06,6e-06,6e-06,7e-06,1e-06,5e-06,3e-06,6e-06,1.2e-05,9e-06,1.1e-05,5e-06,4e-06,1e-06,2e-06,3e-06,1e-05
7e-06,4e-06,1e-06,6e-06,2e-06,3e-06,6e-06,3e-06,3e-06,2e-06,2e-06,4e-06,6e-06,6e-06,8e-06,4e-06,5e-06,7e-06,5e-06,8e-06,1.1e-05,1e-05,4e-06,7e-06,7e-06,6e-06,3e-06,4e-06,5e-06,5e-06,5e-06,3e-06,7e-06,7e-06,9e-06,1.1e-05,3e-06,1e-06,5e-06,9e-06,1.6e-05,8e-06,3e-06,5e-06,5e-06,6e-06,1e-05,7e-06,9e-06,8e-06,8e-06,6e-06,6e-06,9e-06,7e-06,7e-06,1e-05,1.2e-05,1.4e-05,1.6e-05,9e-06,1.6e-05,1.4e-05,1.9e-05,1e-05,8e-06,2e-06,8e-06,6e-06,1.3e-05,1.2e-05,1e-05,7e-06,5e-06,5e-06,9e-06,1.1e-05,9e-06,9e-06,1.1e-05,1.5e-05,1.4e-05,1e-05,9e-06,1.1e-05,1.1e-05,8e-06,7e-06,7e-06,9e-06,1.2e-05,9e-06,1e-05,1.1e-05,6e-06,1.4e-05,1.1e-05,5e-06,4e-06,5e-06,9e-06,1e-05,1e-05,2e-06,3e-06,7e-06,8e-06,7e-06,5e-06,5e-06,5e-06,4e-06,6e-06,5e-06,9e-06,9e-06,2e-06,5e-06,2e-06,7e-06,5e-06
3e-06,2e-06,2e-06,3e-06,4e-06,6e-06,2e-06,4e-06,4e-06,1e-06,2e-06,3e-06,4e-06,3e-06,5e-06,3e-06,3e-06,2e-06,3e-06,3e-06,1.1e-05,7e-06,2e-06,5e-06,6e-06,7e-06,1.3e-05,4e-06,5e-06,6e-06,2e-06,7e-06,6e-06,4e-06,6e-06,4e-06,4e-06,3e-06,7e-06,4e-06,6e-06,3e-06,6e-06,2e-06,4e-06,5e-06,1e-05,4e-06,7e-06,1e-06,8e-06,4e-06,2e-06,6e-06,5e-06,4e-06,1.1e-05,3e-06,4e-06,6e-06,5e-06,9e-06,5e-06,6e-06,1.1e-05,6e-06,5e-06,3e-06,3e-06,8e-06,2e-06,1e-06,6e-06,7e-06,3e-06,4e-06,6e-06,2e-06,6e-06,5e-06,4e-06,3e-06,2e-06,5e-06,4e-06,7e-06,4e-06,3e-06,5e-06,3e-06,2e-06,4e-06,3e-06,5e-06,3e-06,5e-06,8e-06,5e-06,4e-06,5e-06,6e-06,2e-06,7e-06,2e-06,1e-06,1e-06,4e-06,6e-06,7e-06,4e-06,4e-06,3e-06,9e-06,7e-06,4e-06,3e-06,8e-06,4e-06,2e-06,5e-06,8e-06
4e-06,4e-06,2e-06,4e-06,0,4e-06,3e-06,5e-06,3e-06,5e-06,1e-06,3e-06,4e-06,5e-06,5e-06,1e-06,2e-06,6e-06,6e-06,5e-06,1.1e-05,5e-06,2e-06,4e-06,4e-06,9e-06,7e-06,4e-06,2e-06,2e-06,3e-06,1e-05,5e-06,5e-06,9e-06,8e-06,8e-06,2e-06,4e-06,3e-06,4e-06,2e-06,6e-06,6e-06,1e-05,1.1e-05,1e-06,9e-06,1e-06,4e-06,2e-06,1e-06,5e-06,5e-06,5e-06,8e-06,6e-06,1e-06,1e-06,3e-06,6e-06,3e-06,6e-06,5e-06,4e-06,4e-06,5e-06,2e-06,2e-06,6e-06,5e-06,4e-06,5e-06,4e-06,3e-06,2e-06,2e-06,5e-06,5e-06,8e-06,5e-06,2e-06,2e-06,2e-06,6e-06,2e-06,3e-06,3e-06,2e-06,1e-06,2e-06,5e-06,3e-06,2e-06,4e-06,6e-06,6e-06,3e-06,1e-06,7e-06,5e-06,2e-06,5e-06,5e-06,3e-06,1e-06,6e-06,4e-06,6e-06,4e-06,1e-06,1e-06,8e-06,6e-06,3e-06,3e-06,5e-06,3e-06,1e-06,3e-06,6e-06
2e-06,2e-06,3e-06,7e-06,5e-06,2e-06,7e-06,4e-06,4e-06,2e-06,2e-06,3e-06,0,2e-06,4e-06,4e-06,4e-06,2e-06,1e-06,4e-06,2e-06,1e-06,5e-06,2e-06,7e-06,2e-06,8e-06,5e-06,5e-06,3e-06,3e-06,9e-06,1e-05,9e-06,9e-06,6e-06,6e-06,7e-06,2e-06,5e-06,1e-05,4e-06,5e-06,6e-06,4e-06,8e-06,6e-06,9e-06,5e-06,4e-06,2e-06,4e-06,6e-06,3e-06,9e-06,1e-06,6e-06,4e-06,5e-06,6e-06,8e-06,8e-06,5e-06,2e-06,2e-06,2e-06,5e-06,2e-06,4e-06,6e-06,6e-06,9e-06,4e-06,5e-06,6e-06,6e-06,8e-06,6e-06,7e-06,5e-06,4e-06,3e-06,2e-06,3e-06,6e-06,4e-06,7e-06,4e-06,5e-06,4e-06,3e-06,5e-06,4e-06,5e-06,3e-06,4e-06,9e-06,3e-06,4e-06,7e-06,6e-06,5e-06,6e-06,2e-06,4e-06,6e-06,9e-06,1.1e-05,2e-06,5e-06,7e-06,5e-06,2e-06,9e-06,1e-06,3e-06,9e-06,7e-06,7e-06,3e-06,1e-06
3e-06,1e-06,3e-06,4e-06,3e-06,4e-06,2e-06,3e-06,3e-06,3e-06,1e-06,3e-06,1e-06,2e-06,5e-06,4e-06,3e-06,3e-06,2e-06,4e-06,3e-06,3e-06,1e-06,3e-06,6e-06,4e-06,7e-06,1e-06,2e-06,4e-06,3e-06,4e-06,2e-06,6e-06,2e-06,5e-06,2e-06,6e-06,5e-06,3e-06,8e-06,5e-06,7e-06,2e-06,6e-06,5e-06,1e-06,2e-06,2e-06,4e-06,1e-06,4e-06,2e-06,2e-06,4e-06,4e-06,1e-05,3e-06,1e-06,5e-06,5e-06,3e-06,1e-06,5e-06,4e-06,2e-06,4e-06,4e-06,3e-06,6e-06,3e-06,4e-06,1e-06,8e-06,4e-06,2e-06,5e-06,3e-06,3e-06,8e-06,2e-06,2e-06,3e-06,2e-06,2e-06,4e-06,2e-06,5e-06,5e-06,2e-06,1e-06,4e-06,2e-06,6e-06,7e-06,4e-06,5e-06,3e-06,3e-06,5e-06,3e-06,4e-06,4e-06,5e-06,3e-06,4e-06,3e-06,4e-06,3e-06,2e-06,5e-06,5e-06,2e-06,4e-06,2e-06,0,5e-06,3e-06,5e-06,3e-06,7e-06
0,1e-06,1e-06,4e-06,1e-06,3e-06,4e-06,2e-06,4e-06,1e-06,1e-06,3e-06,2e-06,2e-06,6e-06,2e-06,5e-06,2e-06,0,1e-06,2e-06,6e-06,5e-06,3e-06,4e-06,2e-06,5e-06,5e-06,2e-06,1e-06,2e-06,5e-06,2e-06,5e-06,3e-06,2e-06,1e-06,5e-06,1e-06,3e-06,8e-06,1e-06,6e-06,1e-06,5e-06,4e-06,2e-06,3e-06,2e-06,2e-06,1e-06,3e-06,2e-06,1e-06,1e-06,7e-06,7e-06,2e-06,0,3e-06,0,3e-06,1e-06,4e-06,0,0,5e-06,3e-06,5e-06,6e-06,3e-06,2e-06,2e-06,6e-06,2e-06,2e-06,3e-06,7e-06,3e-06,9e-06,3e-06,2e-06,4e-06,3e-06,1e-06,2e-06,3e-06,4e-06,5e-06,6e-06,5e-06,3e-06,4e-06,2e-06,4e-06,4e-06,3e-06,6e-06,4e-06,3e-06,5e-06,2e-06,5e-06,3e-06,2e-06,5e-06,5e-06,5e-06,1e-06,2e-06,5e-06,5e-06,6e-06,4e-06,5e-06,1e-06,2e-06,5e-06,3e-06,3e-06,4e-06
4e-06,3e-06,3e-06,4e-06,1e-06,2e-06,3e-06,2e-06,3e-06,2e-06,2e-06,2e-06,2e-06,3e-06,4e-06,2e-06,4e-06,2e-06,1e-06,1e-06,2e-06,4e-06,3e-06,0,1e-06,4e-06,3e-06,2e-06,1e-06,5e-06,4e-06,6e-06,4e-06,3e-06,2e-06,5e-06,1e-06,4e-06,4e-06,3e-06,3e-06,3e-06,7e-06,1e-06,5e-06,4e-06,1e-06,3e-06,1e-06,2e-06,4e-06,4e-06,2e-06,3e-06,2e-06,7e-06,8e-06,1e-06,3e-06,5e-06,3e-06,5e-06,2e-06,5e-06,3e-06,1e-06,4e-06,3e-06,1e-06,3e-06,2e-06,3e-06,5e-06,7e-06,2e-06,2e-06,1e-06,3e-06,2e-06,5e-06,1e-06,1e-06,6e-06,3e-06,3e-06,2e-06,1e-06,3e-06,3e-06,4e-06,2e-06,3e-06,1e-06,2e-06,4e-06,4e-06,4e-06,7e-06,1e-06,3e-06,6e-06,3e-06,5e-06,1e-06,1e-06,2e-06,2e-06,0,3e-06,3e-06,4e-06,6e-06,6e-06,7e-06,3e-06,2e-06,5e-06,5e-06,2e-06,4e-06,6e-06
1e-06,1e-06,1e-06,5e-06,2e-06,3e-06,2e-06,0,3e-06,2e-06,3e-06,4e-06,2e-06,4e-06,4e-06,1e-06,6e-06,4e-06,1e-06,1e-06,4e-06,4e-06,2e-06,2e-06,1e-06,1e-06,2e-06,2e-06,2e-06,3e-06,2e-06,6e-06,3e-06,4e-06,3e-06,2e-06,1e-06,2e-06,2e-06,3e-06,6e-06,4e-06,3e-06,1e-06,7e-06,4e-06,2e-06,2e-06,1e-06,0,3e-06,1e-06,1e-06,4e-06,2e-06,5e-06,5e-06,3e-06,4e-06,4e-06,3e-06,3e-06,4e-06,4e-06,3e-06,2e-06,2e-06,3e-06,2e-06,3e-06,4e-06,2e-06,2e-06,6e-06,1e-06,4e-06,2e-06,0,3e-06,5e-06,3e-06,2e-06,3e-06,3e-06,1e-06,0,0,1e-06,2e-06,3e-06,2e-06,2e-06,3e-06,2e-06,2e-06,2e-06,1e-06,4e-06,4e-06,3e-06,4e-06,3e-06,5e-06,1e-06,2e-06,2e-06,2e-06,5e-06,7e-06,0,2e-06,1e-06,4e-06,7e-06,6e-06,4e-06,3e-06,3e-06,3e-06,1e-06,5e-06
1e-06,3e-06,2e-06,3e-06,2e-06,1e-06,2e-06,2e-06,4e-06,2e-06,2e-06,3e-06,4e-06,2e-06,4e-06,1e-06,5e-06,4e-06,3e-06,1e-06,2e-06,4e-06,1e-06,3e-06,2e-06,1e-06,2e-06,3e-06,4e-06,5e-06,1e-06,6e-06,3e-06,5e-06,0,3e-06,3e-06,1e-06,0,0,5e-06,4e-06,6e-06,3e-06,5e-06,3e-06,2e-06,2e-06,2e-06,2e-06,3e-06,3e-06,2e-06,2e-06,1e-06,3e-06,6e-06,2e-06,3e-06,3e-06,4e-06,3e-06,3e-06,2e-06,2e-06,3e-06,2e-06,1e-06,2e-06,4e-06,4e-06,4e-06,3e-06,5e-06,3e-06,3e-06,2e-06,2e-06,3e-06,4e-06,3e-06,2e-06,2e-06,3e-06,2e-06,1e-06,3e-06,4e-06,4e-06,1e-06,4e-06,1e-06,3e-06,2e-06,2e-06,4e-06,6e-06,2e-06,4e-06,4e-06,1e-06,2e-06,3e-06,2e-06,1e-06,1e-06,1e-06,4e-06,6e-06,3e-06,1e-06,3e-06,5e-06,4e-06,3e-06,3e-06,3e-06,4e-06,5e-06,1e-06,4e-06
2e-06,4e-06,4e-06,2e-06,4e-06,3e-06,1e-06,2e-06,2e-06,0,1e-06,3e-06,3e-06,3e-06,8e-06,3e-06,2e-06,2e-06,2e-06,2e-06,4e-06,1e-06,3e-06,3e-06,1e-06,3e-06,3e-06,4e-06,2e-06,6e-06,4e-06,4e-06,3e-06,2e-06,3e-06,1e-06,2e-06,1e-06,1e-06,2e-06,2e-06,4e-06,4e-06,0,5e-06,4e-06,3e-06,3e-06,5e-06,6e-06,1e-06,5e-06,3e-06,3e-06,1e-06,2e-06,9e-06,1e-06,2e-06,5e-06,3e-06,1e-06,1e-06,4e-06,1e-06,3e-06,5e-06,3e-06,2e-06,3e-06,1e-06,5e-06,1e-06,4e-06,2e-06,3e-06,4e-06,4e-06,3e-06,2e-06,2e-06,2e-06,2e-06,1e-06,2e-06,2e-06,3e-06,1e-06,2e-06,3e-06,3e-06,4e-06,4e-06,3e-06,3e-06,3e-06,3e-06,6e-06,6e-06,8e-06,4e-06,4e-06,4e-06,4e-06,2e-06,2e-06,1e-06,1e-06,5e-06,4e-06,4e-06,1e-06,3e-06,3e-06,3e-06,2e-06,3e-06,5e-06,4e-06,4e-06,6e-06
1e-06,2e-06,1e-06,2e-06,3e-06,3e-06,4e-06,0,2e-06,2e-06,1e-06,2e-06,1e-06,2e-06,7e-06,4e-06,3e-06,3e-06,2e-06,1e-06,6e-06,5e-06,2e-06,2e-06,3e-06,5e-06,1e-06,3e-06,1e-06,7e-06,2e-06,3e-06,1e-06,3e-06,2e-06,1e-06,1e-06,2e-06,2e-06,3e-06,2e-06,3e-06,4e-06,2e-06,5e-06,4e-06,0,1e-06,2e-06,2e-06,2e-06,4e-06,2e-06,3e-06,2e-06,2e-06,7e-06,2e-06,4e-06,2e-06,2e-06,3e-06,2e-06,4e-06,2e-06,2e-06,4e-06,4e-06,1e-06,1e-06,0,3e-06,3e-06,4e-06,2e-06,0,2e-06,2e-06,3e-06,6e-06,3e-06,1e-06,3e-06,2e-06,3e-06,2e-06,4e-06,4e-06,1e-06,4e-06,3e-06,2e-06,3e-06,0,1e-06,4e-06,2e-06,3e-06,3e-06,4e-06,4e-06,2e-06,4e-06,2e-06,2e-06,2e-06,3e-06,4e-06,3e-06,1e-06,1e-06,0,4e-06,5e-06,4e-06,1e-06,4e-06,4e-06,1e-06,1e-06,4e-06
1e-06,1e-06,2e-06,2e-06,4e-06,5e-06,4e-06,1e-06,3e-06,3e-06,1e-06,2e-06,1e-06,4e-06,6e-06,1e-06,3e-06,1e-06,3e-06,3e-06,4e-06,2e-06,2e-06,4e-06,4e-06,1e-06,2e-06,2e-06,1e-06,4e-06,2e-06,3e-06,2e-06,2e-06,2e-06,1e-06,0,1e-06,1e-06,2e-06,4e-06,5e-06,6e-06,4e-06,4e-06,4e-06,2e-06,2e-06,3e-06,3e-06,2e-06,1e-06,1e-06,1e-06,1e-06,4e-06,5e-06,1e-06,2e-06,4e-06,2e-06,2e-06,1e-06,2e-06,4e-06,4e-06,2e-06,3e-06,2e-06,2e-06,3e-06,3e-06,3e-06,6e-06,1e-06,2e-06,2e-06,3e-06,5e-06,3e-06,2e-06,3e-06,4e-06,1e-06,3e-06,2e-06,2e-06,1e-06,2e-06,3e-06,3e-06,3e-06,1e-06,1e-06,1e-06,4e-06,1e-06,2e-06,3e-06,3e-06,3e-06,1e-06,4e-06,1e-06,3e-06,1e-06,3e-06,2e-06,3e-06,0,4e-06,2e-06,3e-06,5e-06,3e-06,2e-06,4e-06,5e-06,3e-06,4e-06,4e-06
1e-06,1e-06,2e-06,4e-06,3e-06,3e-06,6e-06,2e-06,3e-06,2e-06,1e-06,1e-06,0,3e-06,2e-06,5e-06,5e-06,1e-06,3e-06,2e-06,5e-06,1e-06,1e-06,1e-06,5e-06,7e-06,3e-06,2e-06,2e-06,4e-06,2e-06,2e-06,2e-06,2e-06,3e-06,1e-06,0,1e-06,1e-06,2e-06,8e-06,2e-06,3e-06,7e-06,6e-06,3e-06,5e-06,4e-06,4e-06,3e-06,1e-06,4e-06,4e-06,3e-06,3e-06,0,6e-06,1e-06,1e-06,2e-06,1e-06,3e-06,2e-06,4e-06,3e-06,3e-06,3e-06,3e-06,1e-06,3e-06,4e-06,5e-06,0,2e-06,4e-06,3e-06,1e-06,4e-06,5e-06,9e-06,1e-06,3e-06,1e-06,1e-06,3e-06,2e-06,2e-06,3e-06,1e-06,1e-06,5e-06,5e-06,2e-06,2e-06,2e-06,1e-06,2e-06,1e-06,0,2e-06,1e-06,4e-06,2e-06,2e-06,1e-06,3e-06,2e-06,5e-06,6e-06,3e-06,5e-06,5e-06,4e-06,4e-06,2e-06,3e-06,2e-06,3e-06,5e-06,1e-06,3e-06
1e-06,2e-06,1e-06,2e-06,2e-06,1e-06,1e-06,1e-06,3e-06,1e-06,1e-06,1e-06,2e-06,4e-06,2e-06,5e-06,2e-06,1e-06,2e-06,2e-06,3e-06,5e-06,5e-06,4e-06,4e-06,7e-06,4e-06,3e-06,4e-06,3e-06,3e-06,3e-06,3e-06,2e-06,1e-06,1e-06,1e-06,1e-06,1e-06,1e-06,4e-06,1e-06,4e-06,3e-06,4e-06,1e-06,3e-06,1e-06,3e-06,2e-06,2e-06,2e-06,3e-06,4e-06,3e-06,3e-06,5e-06,1e-06,1e-06,3e-06,0,2e-06,1e-06,3e-06,2e-06,2e-06,3e-06,3e-06,2e-06,3e-06,2e-06,1e-06,2e-06,3e-06,3e-06,1e-06,1e-06,4e-06,1e-06,6e-06,3e-06,2e-06,1e-06,1e-06,1e-06,1e-06,1e-06,2e-06,0,1e-06,4e-06,2e-06,2e-06,1e-06,1e-06,2e-06,2e-06,2e-06,2e-06,3e-06,1e-06,3e-06,2e-06,3e-06,0,2e-06,2e-06,2e-06,3e-06,2e-06,3e-06,1e-06,4e-06,6e-06,3e-06,1e-06,1e-06,2e-06,3e-06,2e-06,3e-06
1e-06,0,1e-06,2e-06,1e-06,2e-06,1e-06,0,2e-06,1e-06,0,1e-06,2e-06,1e-06,2e-06,3e-06,3e-06,0,2e-06,2e-06,1e-06,4e-06,2e-06,2e-06,4e-06,3e-06,3e-06,2e-06,1e-06,3e-06,1e-06,2e-06,1e-06,4e-06,1e-06,2e-06,0,0,1e-06,2e-06,4e-06,2e-06,4e-06,1e-06,4e-06,1e-06,1e-06,2e-06,0,2e-06,1e-06,2e-06,1e-06,2e-06,1e-06,3e-06,5e-06,1e-06,0,3e-06,1e-06,3e-06,1e-06,3e-06,1e-06,1e-06,2e-06,0,0,3e-06,1e-06,1e-06,1e-06,2e-06,1e-06,1e-06,1e-06,1e-06,1e-06,4e-06,1e-06,1e-06,1e-06,0,1e-06,1e-06,1e-06,2e-06,1e-06,0,3e-06,0,1e-06,1e-06,1e-06,1e-06,3e-06,1e-06,2e-06,3e-06,0,1e-06,2e-06,1e-06,0,0,1e-06,1e-06,3e-06,1e-06,0,1e-06,5e-06,4e-06,2e-06,0,1e-06,1e-06,2e-06,1e-06,2e-06
1e-06,1e-06,0,2e-06,1e-06,2e-06,1e-06,1e-06,2e-06,1e-06,1e-06,1e-06,1e-06,2e-06,2e-06,3e-06,2e-06,1e-06,1e-06,1e-06,1e-06,3e-06,3e-06,1e-06,3e-06,3e-06,3e-06,2e-06,1e-06,3e-06,0,1e-06,0,3e-06,1e-06,1e-06,0,1e-06,1e-06,1e-06,3e-06,1e-06,5e-06,2e-06,4e-06,2e-06,1e-06,2e-06,1e-06,2e-06,1e-06,1e-06,1e-06,2e-06,1e-06,3e-06,5e-06,0,0,3e-06,1e-06,2e-06,0,3e-06,2e-06,1e-06,1e-06,1e-06,0,3e-06,1e-06,1e-06,1e-06,3e-06,1e-06,1e-06,1e-06,1e-06,2e-06,5e-06,1e-06,1e-06,1e-06,1e-06,1e-06,0,0,2e-06,1e-06,0,3e-06,0,0,0,1e-06,1e-06,3e-06,2e-06,2e-06,2e-06,1e-06,0,2e-06,2e-06,1e-06,1e-06,1e-06,2e-06,3e-06,1e-06,0,1e-06,3e-06,4e-06,2e-06,1e-06,2e-06,1e-06,2e-06,1e-06,2e-06
1e-06,1e-06,0,2e-06,2e-06,1e-06,2e-06,1e-06,2e-06,1e-06,0,0,1e-06,2e-06,2e-06,2e-06,3e-06,0,1e-06,1e-06,2e-06,3e-06,2e-06,1e-06,3e-06,3e-06,3e-06,1e-06,1e-06,3e-06,0,2e-06,0,3e-06,0,2e-06,1e-06,0,1e-06,1e-06,4e-06,1e-06,4e-06,1e-06,4e-06,2e-06,1e-06,2e-06,1e-06,2e-06,1e-06,1e-06,1e-06,2e-06,2e-06,3e-06,5e-06,0,0,3e-06,1e-06,3e-06,1e-06,3e-06,2e-06,1e-06,1e-06,0,0,3e-06,0,1e-06,0,3e-06,2e-06,1e-06,1e-06,1e-06,1e-06,5e-06,1e-06,1e-06,1e-06,0,1e-06,0,0,2e-06,0,0,2e-06,0,0,0,1e-06,1e-06,2e-06,1e-06,1e-06,2e-06,1e-06,1e-06,2e-06,1e-06,1e-06,1e-06,0,2e-06,3e-06,1e-06,0,1e-06,3e-06,4e-06,3e-06,0,2e-06,1e-06,2e-06,1e-06,3e-06
