0.12375,0.139981,0.132899,0.106144,0.095004,0.105579,0.11283,0.110948,0.119886,0.119044,0.107092,0.109508,0.112958,0.125605,0.12988,0.119056,0.141665,0.156168,0.147874,0.143602,0.143587,0.137321,0.142234,0.174246,0.201407,0.187598,0.173602,0.166286
0.14609,0.162154,0.155712,0.126431,0.112248,0.126241,0.138402,0.13395,0.141449,0.14331,0.130124,0.131986,0.135754,0.150243,0.156679,0.144613,0.171727,0.186144,0.173484,0.170631,0.172064,0.164386,0.168987,0.207645,0.245934,0.231521,0.210864,0.200054
0.175892,0.188899,0.18568,0.156782,0.137846,0.157577,0.179155,0.16834,0.171187,0.178907,0.165044,0.166028,0.170108,0.186162,0.197306,0.184127,0.216118,0.228614,0.2093,0.211861,0.216301,0.205901,0.208516,0.25435,0.31101,0.297863,0.265608,0.249301
0.182431,0.186887,0.188141,0.171206,0.152602,0.173485,0.200473,0.184324,0.18125,0.191566,0.179656,0.181391,0.184251,0.195123,0.210155,0.201419,0.229254,0.237429,0.218982,0.229237,0.235648,0.225461,0.226159,0.266007,0.328452,0.319637,0.279263,0.262201
0.184994,0.178745,0.182967,0.18517,0.173284,0.183752,0.202402,0.199822,0.203685,0.197813,0.181452,0.186158,0.186334,0.187049,0.205308,0.20566,0.217117,0.227069,0.220883,0.231837,0.242671,0.23795,0.233451,0.250685,0.294525,0.288653,0.245991,0.23368
0.246052,0.24495,0.263158,0.278499,0.259196,0.250818,0.263049,0.297364,0.322782,0.268058,0.224257,0.249052,0.252242,0.237147,0.269466,0.275703,0.26646,0.29863,0.298379,0.301474,0.3384,0.332365,0.300372,0.282104,0.300689,0.294798,0.240032,0.228024
0.414686,0.428882,0.478383,0.508814,0.463451,0.445021,0.46409,0.542577,0.604378,0.473362,0.378253,0.443635,0.451892,0.419109,0.491746,0.493283,0.46099,0.537667,0.5248,0.531968,0.633554,0.605816,0.507828,0.444707,0.461146,0.454129,0.359019,0.341196
0.692381,0.732024,0.827842,0.892311,0.812011,0.782476,0.81266,0.959781,1.094892,0.854662,0.680999,0.807538,0.809911,0.75119,0.908647,0.898276,0.817024,0.964451,0.925603,0.968978,1.209701,1.135654,0.908598,0.763774,0.803985,0.813302,0.636975,0.591059
1.043394,1.101964,1.254058,1.383412,1.272429,1.23413,1.2784,1.525363,1.776323,1.400672,1.132464,1.332344,1.312643,1.227916,1.534205,1.51006,1.328308,1.570185,1.497968,1.625294,2.115085,1.982898,1.534661,1.230511,1.312152,1.361822,1.075922,0.998582
1.341524,1.389454,1.584698,1.805308,1.694933,1.662343,1.719609,2.067418,2.448978,1.970131,1.637692,1.884507,1.825017,1.740322,2.243495,2.210188,1.88423,2.224537,2.128238,2.385437,3.20507,3.030204,2.292199,1.751996,1.88676,2.000337,1.620582,1.534063
1.380802,1.396983,1.598995,1.896029,1.830199,1.811467,1.873356,2.264213,2.72247,2.262853,1.952569,2.161099,2.049877,2.020605,2.694521,2.663173,2.208544,2.599774,2.51261,2.900707,3.98301,3.817417,2.858681,2.113586,2.289986,2.46454,2.075165,2.009396
1.081481,1.06509,1.230246,1.530831,1.536662,1.522928,1.570915,1.907313,2.325583,2.028158,1.820126,1.896936,1.754272,1.832317,2.53201,2.488616,1.996023,2.341031,2.321122,2.760413,3.816922,3.721205,2.789331,2.025012,2.226038,2.455687,2.179364,2.136621
0.686906,0.63432,0.732797,0.96506,1.007668,0.971392,1.00658,1.20748,1.453399,1.354315,1.278785,1.230272,1.107802,1.259908,1.765571,1.700128,1.32588,1.53865,1.587296,1.938766,2.638517,2.621076,2.003281,1.47485,1.654519,1.873124,1.784571,1.778155
0.571294,0.514836,0.597316,0.798128,0.757311,0.627381,0.696745,0.78702,0.782069,0.746307,0.795482,0.732577,0.636157,0.749466,0.945004,0.873673,0.741809,0.856828,0.914926,1.078353,1.31767,1.315705,1.113122,0.919178,1.005472,1.138948,1.17858,1.228528
0.888554,0.818635,0.960064,1.262473,1.081025,0.820776,0.9969,1.093968,0.886546,0.770926,0.944032,0.907458,0.734492,0.783157,0.834271,0.754647,0.804631,1.016227,1.02458,1.003194,1.034992,0.975353,0.970748,0.97686,0.985918,1.079602,1.161197,1.268964
1.472987,1.37369,1.594642,2.046389,1.705322,1.321272,1.640468,1.785586,1.425654,1.225963,1.515377,1.44729,1.124721,1.173017,1.254926,1.151075,1.287591,1.621235,1.590386,1.519264,1.550471,1.472932,1.518853,1.558359,1.524989,1.644543,1.744881,1.938241
2.198418,2.045404,2.308461,2.841277,2.316518,1.887261,2.377754,2.544312,2.028109,1.74824,2.133261,2.023124,1.541162,1.578861,1.737597,1.676732,1.919558,2.317678,2.19789,2.081009,2.158386,2.083094,2.196039,2.275448,2.177397,2.337298,2.511131,2.860963
2.875235,2.627251,2.809168,3.250734,2.624536,2.335701,2.959898,3.091581,2.530849,2.189696,2.505996,2.395422,1.839873,1.799048,2.057343,2.162088,2.505844,2.868231,2.629021,2.459967,2.602896,2.547695,2.73398,2.871983,2.778106,3.030874,3.245633,3.797261
3.323989,2.969787,2.947146,3.13529,2.62235,2.715184,3.385458,3.367569,3.012408,2.620424,2.468655,2.393709,1.98383,1.863345,2.239376,2.487506,2.758212,3.050161,2.762035,2.54395,2.761544,2.752348,2.981612,3.196324,3.303936,3.776076,3.920286,4.628839
3.451368,2.97624,2.879779,2.98036,2.650319,3.127159,3.78958,3.431417,3.372862,3.010516,2.227312,2.230506,2.112799,1.979202,2.484946,2.620512,2.513175,2.797272,2.671731,2.466253,2.735084,2.828828,3.063305,3.269272,3.725431,4.535722,4.569049,5.239727
3.341091,2.69186,2.551584,2.827143,2.707776,3.328469,3.85004,3.188796,3.316726,3.061604,2.026248,2.168641,2.247725,2.025353,2.428905,2.348231,2.013078,2.329221,2.393042,2.311748,2.616175,2.73943,2.877693,2.979981,3.65901,4.702825,4.795288,5.300634
2.753309,2.071731,1.908878,2.305361,2.406395,2.943831,3.240309,2.521874,2.581676,2.491239,1.777023,1.993286,2.042174,1.73175,1.894738,1.807634,1.666079,1.862895,1.821899,1.861139,2.150673,2.232644,2.349112,2.393042,2.98417,3.848122,3.938471,4.282312
1.821695,1.363713,1.284533,1.540357,1.693941,2.02812,2.092187,1.55616,1.510826,1.542768,1.298344,1.489969,1.456562,1.20622,1.253662,1.284756,1.430391,1.495252,1.291778,1.408041,1.631998,1.620909,1.651558,1.724851,2.10181,2.477797,2.493133,2.614728
1.242005,1.006921,1.084094,1.070324,1.106994,1.33041,1.306659,1.104,1.101386,1.103084,1.142023,1.174807,0.975524,0.964269,1.107618,1.184185,1.33569,1.2091,1.064721,1.196153,1.229382,1.272242,1.260588,1.285879,1.561663,1.68281,1.596132,1.445467
1.397067,1.124538,1.141826,0.962604,0.884573,1.101558,1.218505,1.240066,1.319728,1.364332,1.573693,1.42519,1.022499,1.165622,1.355286,1.470395,1.461901,1.176263,1.342268,1.470418,1.198313,1.268044,1.324709,1.276094,1.56986,1.75367,1.592524,1.304084
1.766222,1.414732,1.344556,1.089864,0.892293,1.133373,1.513945,1.65376,1.65252,1.764825,2.230476,1.9471,1.293691,1.49061,1.694002,1.86073,1.741627,1.324594,1.742412,1.918907,1.390517,1.430826,1.603318,1.538347,1.827029,1.985839,1.727053,1.46853
1.956765,1.612882,1.570671,1.288698,0.959124,1.135162,1.7416,2.041157,1.875522,1.978573,2.699408,2.369839,1.511552,1.625325,1.826277,2.069019,1.949164,1.486707,1.94613,2.136784,1.549521,1.687445,1.912097,1.825046,2.187104,2.236975,1.775084,1.609793
1.742259,1.498955,1.556144,1.338158,0.924386,1.016518,1.698264,2.141304,1.882076,1.818099,2.586187,2.337373,1.446532,1.374445,1.528392,1.818281,1.80312,1.45304,1.794997,2.043759,1.599405,1.788592,1.962259,1.874904,2.461917,2.484498,1.805008,1.62251
1.173622,1.071465,1.267313,1.185281,0.744927,0.744499,1.298331,1.790277,1.604889,1.32673,1.847329,1.779029,1.101367,0.881561,0.972313,1.262619,1.362646,1.179038,1.416227,1.727015,1.471613,1.607143,1.713965,1.716374,2.44587,2.393386,1.603631,1.430641
0.629583,0.643345,0.857075,0.853654,0.521789,0.481151,0.799856,1.175761,1.124587,0.800135,0.971728,1.036797,0.700921,0.540518,0.594608,0.836505,0.986625,0.832308,0.941511,1.247583,1.163357,1.195797,1.268538,1.324151,2.03613,2.055789,1.286633,1.160156
0.392359,0.446935,0.51851,0.487884,0.309643,0.315144,0.506326,0.666076,0.636433,0.496649,0.531503,0.564525,0.42895,0.39128,0.452091,0.562158,0.648025,0.551415,0.517906,0.693124,0.753167,0.757868,0.79293,0.826945,1.422486,1.631734,1.054758,0.97588
0.390644,0.412037,0.363895,0.316366,0.250053,0.267224,0.380624,0.436865,0.372598,0.329524,0.406813,0.382467,0.280398,0.301632,0.376916,0.369085,0.369769,0.364892,0.293856,0.341881,0.521468,0.617814,0.579008,0.549729,1.029721,1.253125,0.824228,0.790211
0.376819,0.35148,0.299484,0.289926,0.273465,0.265301,0.368443,0.415501,0.329034,0.296619,0.354282,0.290362,0.201557,0.247357,0.304533,0.2565,0.239168,0.245841,0.205896,0.262852,0.446355,0.571064,0.493876,0.415115,0.915439,1.135673,0.700014,0.655086
0.299287,0.233964,0.213938,0.267599,0.309678,0.272339,0.339179,0.383178,0.303518,0.279911,0.326294,0.281096,0.208579,0.253133,0.254104,0.21404,0.213231,0.180896,0.153904,0.250616,0.384705,0.448978,0.375777,0.310029,0.869061,1.226643,0.775299,0.572914
0.219586,0.156721,0.161067,0.2431,0.328921,0.295634,0.292211,0.305588,0.246498,0.240356,0.286352,0.277949,0.230559,0.235488,0.191613,0.191583,0.249696,0.201271,0.143337,0.221931,0.336824,0.326088,0.242468,0.22668,0.761257,1.211571,0.782782,0.448006
0.196089,0.144627,0.135873,0.190486,0.300827,0.304618,0.24192,0.242702,0.211161,0.207433,0.243294,0.234806,0.212366,0.190321,0.155482,0.195941,0.284294,0.220334,0.126401,0.175426,0.292623,0.250648,0.154708,0.145674,0.582702,1.008648,0.644171,0.358618
0.164457,0.116634,0.112886,0.149955,0.236661,0.287462,0.23822,0.231542,0.196664,0.171242,0.186131,0.173493,0.180003,0.183018,0.175715,0.209995,0.298359,0.23067,0.120396,0.167577,0.278284,0.230571,0.128007,0.11647,0.458658,0.726555,0.438013,0.297287
0.118259,0.074068,0.093673,0.154736,0.190886,0.236999,0.240643,0.235736,0.190321,0.128625,0.153408,0.162664,0.197393,0.217083,0.202696,0.223586,0.29126,0.24352,0.152263,0.194164,0.262807,0.206021,0.144319,0.127576,0.362675,0.473783,0.265353,0.252231
0.104301,0.058084,0.098286,0.166836,0.146653,0.166323,0.202073,0.204426,0.163709,0.085298,0.119713,0.151127,0.213603,0.229151,0.198332,0.216726,0.250211,0.227045,0.183523,0.224417,0.22667,0.178774,0.174268,0.143827,0.273112,0.33156,0.172896,0.208728
0.138302,0.073812,0.108347,0.165672,0.115805,0.107686,0.144902,0.161718,0.13446,0.074928,0.095406,0.123377,0.198539,0.203621,0.16315,0.177959,0.181043,0.175151,0.186581,0.23699,0.193114,0.169595,0.202779,0.163756,0.215042,0.286916,0.166222,0.186697
