0.003632,0.001585,0.001035,-0.00073,-0.005886,-0.006431,-0.003297,-0.002572,-0.005277,-0.002924,-0.004643,-0.005209,-0.004928,-0.002064,-0.003292,-0.001702,-0.004086,-0.00463,-0.003411,-0.002607,-0.001835,8e-05,-0.002422,0.000246,0.002354,-0.00267,-0.006755,-0.004071,-0.003574,-0.00562,-0.003653,-0.000759,-0.001434,-0.009055,-0.004506,-0.002739,-0.001355,-0.005269,-0.007355,-0.00596,-0.003444,-0.004952,-0.003277,-0.007833,-0.003212,-0.000871,-0.005817,-0.003854,-0.002061,-0.00257,-0.005353,-0.003997,-0.003656,-0.000783,-0.003103,0.00047,-0.000124,0.000919,-5e-04,-0.000107,-0.001775,-0.002545,-0.002433,-0.002207,-0.002169,-0.004969,-0.006578,-0.003913,-0.003443,-0.002424,-0.003271,-0.00033,0.001327,-0.000985,-0.005714,-0.002957,-0.003853,-0.002157,-0.001335,-0.001096,-0.001055,-0.003242,-0.002179,-0.002065,-0.001009,-0.003343,-0.000471,-0.001846,-0.003188,0.00088,-0.002169,-0.000392,-0.000417,-0.00044,-0.001133,0.001315,0.001614,0.000629,-0.001749,-0.00201,-0.002854,-0.002864,-0.001371,-0.000587,0.001145,0.001097,-0.000265,-0.002859,-0.003104,-0.00264,0.000623,-8e-05,-0.000593,-0.002739,-0.003096,-0.0025,-0.001188,-0.001482,-4e-04,-0.001264,-0.000158
-0.005832,-0.006164,-0.002474,-0.003385,-0.00158,-0.001527,0.005206,0.001342,0.003017,0.001604,0.002367,-0.001581,-0.001108,-0.000731,0.001682,-0.002092,-0.004123,0.002125,0.001299,-0.004158,-0.001739,-0.003309,-0.002147,-0.00314,-0.003305,-0.002469,0.005221,0.002057,-0.000349,0.000568,-0.002571,-0.003855,-0.002073,0.002748,0.004271,0.000857,0.001003,0.002598,0.003396,0.003795,0.000226,0.001225,0.001572,0.005158,0.001689,-0.001451,-0.000383,0.000568,0.000858,-0.002133,0.00042,0.001872,-0.000584,-0.00099,-0.000783,0.001199,0.001151,-0.002051,-0.002458,-0.001204,-0.002885,-0.00203,-0.00529,-0.003444,0.000448,-0.00067,-0.000219,0.001489,0.000563,-0.000429,-0.001704,-0.003564,-0.002596,-0.002121,0.003493,0.001047,-0.001319,-0.001741,-0.001996,-0.002578,-0.001338,-0.000673,-0.000851,-0.001547,0.000142,0.0025,0.000236,-0.001192,-0.000355,-0.002181,-0.006451,-0.005001,-0.004146,-0.002604,-0.002076,-0.00088,-0.00659,-0.005043,-0.001333,-0.000728,0.00025,-0.000356,9.5e-05,-0.001532,0.000552,-0.006404,-0.004023,-0.000591,-0.001608,-0.000511,-0.00165,-0.000993,-0.002437,0.000996,0.000686,0.00198,0.000316,-0.001367,-4.2e-05,-0.001093,-0.003674
-0.00359,-0.002738,-0.004578,0.00097,0.000284,0.002894,-0.002933,-0.002057,-0.003662,-0.002097,-0.000489,2.6e-05,0.001478,-6e-05,0.000258,-0.000603,-0.001307,-0.007142,-0.005138,-0.002534,-0.002116,-0.001441,0.000937,-0.000779,-0.002063,-0.005538,-0.00662,-0.004269,-0.001638,-0.000706,0.002203,-0.005163,-0.002359,-0.008217,-0.004778,-0.003242,-0.005808,-0.003713,-0.004232,-0.004326,-0.002796,-0.004467,-0.001703,-0.004703,-0.005476,-0.002655,-0.003461,-0.003319,-0.002166,-0.00188,-0.002331,-0.002015,0.000213,0.000934,-3e-04,-0.002963,-0.00136,-0.002568,-0.001443,0.000727,-0.002311,-0.002057,-0.000569,-0.001028,-0.000881,-8.7e-05,-0.001431,-0.00155,0.000752,-0.000949,-0.00137,0.001161,-0.00065,-0.001185,-0.003261,-0.003413,0.00148,-0.000394,-0.003469,0.000979,-0.000137,0.00018,-8e-04,-0.0023,-0.001509,-0.004393,-0.003433,-0.001953,-0.000741,-0.00245,0.000526,-0.000989,-0.002309,-0.000833,0.000669,0.00019,-0.000451,-0.001479,-0.00162,-0.000492,-0.001634,-2.4e-05,-0.001254,-0.00073,-0.000715,-0.000602,-0.000228,-0.001875,0.000195,-0.000448,-0.00088,-0.00322,-0.001537,-0.001716,-0.001913,-0.0017,-0.001809,-0.001626,-0.001193,-0.002006,-0.001423
0.001147,0.003572,-0.000347,-0.004052,-0.000366,-0.002864,0.001509,-0.00241,-2e-06,-0.000242,-0.000763,0.001402,0.000376,-0.000201,0.001639,0.003208,0.004949,0.001916,0.005353,0.008098,0.003224,-0.001855,0.000817,-0.001712,-0.001008,0.003323,0.003799,0.005302,0.000703,0.004151,0.000714,0.005128,0.002683,0.006863,0.004555,0.002569,0.001715,0.001113,-0.001285,0.001458,-1e-05,0.000796,0.001809,0.001648,0.002741,0.001662,0.001989,0.002749,0.003427,0.001264,0.002247,0.002475,-0.00067,0.001464,0.000722,0.002648,0.001857,-0.000893,0.000744,9.5e-05,0.000989,0.001854,0.001198,0.001423,0.002707,0.002111,0.002611,0.002701,0.000286,-0.001394,0.001446,-0.000826,0.000688,0.000768,0.001185,0.001541,-0.000593,0.000164,0.001486,-0.000159,-0.001808,0.001109,0.001335,0.001452,0.002775,0.000531,0.000931,0.000517,0.000945,0.003911,0.003938,0.004751,0.00371,0.001379,0.000314,0.001369,0.002075,0.002667,0.000476,-0.00037,0.000484,-0.000704,-0.000266,-6e-06,-0.000308,0.000885,0.000572,0.001434,0.001845,0.001649,-0.001078,0.00175,0.000568,0.000992,0.001383,0.000955,0.000245,0.001408,0.000128,0.001948,0.000552
-0.000404,0.001279,0.000939,-0.001065,0.00162,0.001654,-0.003509,-0.000491,-0.001235,-0.003181,-0.000665,3.2e-05,-0.002881,-5.3e-05,-0.00307,-0.000736,5.7e-05,-0.000707,-0.005596,-0.005467,-0.00183,0.000202,-0.002128,-0.000649,0.003713,-0.004342,-0.002555,-0.002687,-0.001837,-0.00288,-0.0042,-0.000322,-0.000231,3e-05,-0.002998,-0.000489,-0.000152,0.000154,-0.000428,-0.000802,-0.001716,-0.001295,-0.001614,-0.003303,-0.001482,0.000571,-0.001012,-0.001714,-0.000922,-0.000908,-0.004143,-0.002541,-0.000436,-0.001427,-0.002026,-0.001484,-0.001018,-0.001315,-0.001544,-0.002251,0.000736,-0.001177,-0.002102,-0.001143,-0.002278,-0.00319,-0.002901,-0.003564,-0.002263,0.00225,0.000894,-0.001339,-0.000792,0.000621,0.000685,0.000271,0.000324,0.000832,0.001715,0.003499,0.003121,0.001125,-0.001421,5.5e-05,-0.001787,-0.000444,-0.000814,0.000608,-0.000766,-0.000865,-0.003944,-0.003188,0.000671,-0.001228,0.000144,0.000736,0.000777,-0.002199,0.001306,0.000832,0.000258,-0.000314,5e-04,-0.000294,0.000313,0.000102,0.000311,-0.000225,-0.001523,-0.001545,-0.000576,0.000265,0.001221,-7.4e-05,-0.000189,-0.001908,-0.000644,-0.000521,-6.4e-05,-0.000308,0.000519
0.001031,-0.001825,-0.000202,0.001117,-0.001778,-0.000811,0.000791,-0.001901,-0.000571,-3.8e-05,-0.000678,-0.001616,6e-05,0.000989,0.001278,0.001264,-0.000475,-0.003295,0.002553,0.002153,0.001769,-0.00044,0.000488,0.000443,-0.000703,0.001154,0.003068,0.003846,0.001736,-0.000586,-0.000517,-0.001045,-0.00012,-0.001907,0.001766,-0.001171,0.002599,0.000332,0.00307,0.001709,0.000568,0.001385,0.000208,0.002476,0.002702,-0.000682,-0.000801,0.001276,0.000872,0.000308,0.000576,0.002625,0.000734,-0.000107,0.000131,4.2e-05,-0.00143,0.001341,-0.000822,0.000247,-0.000179,0.000765,0.000106,-0.000165,-0.000874,0.000929,0.001074,0.002136,0.001181,-0.002003,-0.000966,0.001082,6.8e-05,0.001348,-0.000524,0.000191,-6.6e-05,-0.000629,-0.002254,-0.002136,-0.001794,-0.001198,0.000267,-0.00029,0.001367,0.000691,0.00143,0.000465,0.001502,0.000477,0.001334,0.000366,-0.000292,0.000842,-0.001182,-0.00087,-0.000588,-0.001291,-0.001144,0.000541,-0.000382,0.000435,0.000207,0.000216,0.000261,0.000168,-0.001125,-0.000828,-0.000334,8.6e-05,0.000674,-0.001383,-0.000772,-0.000292,-0.001108,0.000266,0.000778,0.00022,-0.000424,3.5e-05,-0.000814
-0.001257,-0.000358,-0.001995,0.001485,0.000747,-0.001312,-0.001486,-0.000211,-0.000947,-0.001438,0.001072,0.001509,0.000552,-0.000241,-0.000127,-0.001354,-0.001027,0.000599,0.000489,-0.00054,-0.000774,0.000894,0.001271,0.000248,-0.00163,0.002506,0.001005,-0.002541,-0.001337,-0.000906,0.002241,0.001199,-0.001936,-0.000634,-0.000957,0.000248,-0.002141,-0.002395,-0.001593,-0.000421,-0.000279,0.000124,-0.000729,-0.000505,-0.000218,-0.000218,0.00024,-0.001752,-0.002448,-0.000526,0.000608,-0.001626,-0.00076,0.001741,0.00094,-0.000339,-0.001538,-0.000335,0.000909,7e-04,0.000704,-0.001583,0.000383,0.002539,0.000686,-0.000538,0.000356,-0.000964,-0.001466,0.001537,0.000371,0.000244,7.8e-05,-0.000451,-0.000751,-0.001245,0.001081,-0.000751,0.001905,2e-05,-0.001339,0.000601,0.001208,0.000316,3.2e-05,0.000534,-0.001984,-0.00045,-0.001444,-0.00018,0.000488,0.000361,-0.000954,-0.001331,0.000309,-0.00094,-0.000506,0.001638,0.000757,0.000155,3.6e-05,-0.000176,-6.5e-05,-0.000264,-0.000721,-0.000547,-0.001539,-0.000816,0.00026,0.000126,-0.000434,-0.0014,-0.000497,-0.000584,0.000764,-0.000159,-0.00088,-0.000916,8e-06,-0.000827,-0.000776
0.001555,0.000932,1.5e-05,0.000487,-0.000819,-0.000604,-0.000157,0.000837,-0.000334,-0.000688,-0.000772,1.3e-05,-0.001051,0.000243,-3e-05,-0.000895,0.001174,0.000977,0.001879,0.000252,0.000983,-0.000572,-0.001678,-0.00185,0.000202,-0.000516,-6.5e-05,-0.000906,-0.000447,-0.000162,-0.002442,-0.000898,0.002049,0.001407,0.001668,-0.00125,8e-04,0.00033,0.000346,0.001219,0.000897,0.001114,0.000121,0.000343,-0.00057,-7e-04,0.001284,0.00299,0.000698,0.000968,0.000521,0.000615,0.000304,-0.000955,-0.000798,4.8e-05,0.001661,0.000842,8.5e-05,0.000775,-0.000353,0.000222,0.000648,0.000216,0.001436,0.00091,-0.000225,0.000884,0.000206,-9e-06,-0.000143,-0.000496,-0.001661,-0.001413,-0.00034,0.001945,-0.000113,0.00111,4.2e-05,-0.000839,-1.3e-05,-0.000103,-0.00127,-0.000106,-0.001315,-5.6e-05,-2.4e-05,0.000416,0.000682,0.000141,0.000604,0.000491,0.001487,-7.1e-05,-0.000941,0.000746,-0.000184,0.001208,0.000452,-0.000599,0.000414,-0.000402,0.000107,-8.5e-05,0.000926,0.00046,0.002207,0.000886,0.000307,0.00022,-0.000312,0.000195,-0.000271,-6.2e-05,-0.000658,-0.000864,0.000983,0.000414,0.000173,-0.000135,0.000372
0.001398,9.7e-05,0.002333,-0.000103,1.4e-05,0.000669,-3.5e-05,-0.001166,-0.002365,0.00094,0.000813,-0.001097,0.000527,0.000778,-0.000126,-0.001041,-0.000741,0.000428,0.000465,-0.00075,0,0.000142,0.000241,0.000243,-0.001302,-9.3e-05,-0.001627,-0.000665,5.5e-05,-6.4e-05,0.000714,-0.001671,-0.000494,-0.000175,-0.001296,0.000512,0.000925,0.001019,0.000377,-0.002391,-0.000626,-0.000631,-0.001338,2.5e-05,-0.000428,0.000443,-6e-05,-0.001554,-0.000224,-0.000442,-0.000939,0.000274,-0.000169,0.000724,0.000275,-0.000972,-0.000449,0.000505,0.001518,-0.001051,-0.000388,0.001322,-0.000523,-0.000302,-0.000664,-0.001663,-0.000811,-0.000639,-0.000326,0.000359,0.000318,-0.000745,-0.000293,0.000604,-0.000197,-0.001818,-0.001182,-0.001765,7.8e-05,0.001091,-0.000194,6.8e-05,1.4e-05,-1.4e-05,-0.000563,-0.000182,-0.000584,-0.000356,0.00024,-0.000597,-0.001014,-0.000764,0.000458,0.000118,0.000124,-0.000417,4.5e-05,0.000324,-0.000339,-0.000472,-0.000314,0.000755,-0.000285,0.00015,-0.000474,-0.000246,-8.4e-05,-0.000388,0.00025,-4.5e-05,0.000194,-0.000125,0.000568,0.00105,0.000535,0.000541,-0.000302,-4e-05,0.000294,0.000228,-9.3e-05
-0.000846,-0.000314,0.000188,-0.000485,0.000645,0.000716,-0.00101,0.000725,0.001889,-0.000178,-0.001644,0.000713,0.000451,-0.001613,-0.000483,0.000438,0.000204,-0.002991,-0.000654,0.000416,0.001176,-0.000908,-0.000467,0.000117,-0.000609,-0.001198,-5.8e-05,0.000666,0.001982,-0.00054,-0.000206,0.00068,-0.000251,-0.000261,-0.00138,-0.000917,-0.000978,0.000245,0.000882,0.000275,0,0.00064,0.001457,0.000442,6.3e-05,-0.000138,-0.001093,-0.000334,-0.000148,-0.000164,-0.000517,-0.000721,-0.000505,-0.000728,-9.8e-05,-2.3e-05,0.000606,0.000931,-0.000107,0.000845,-0.000193,-0.000164,2.5e-05,4.3e-05,-0.000992,0.000966,0.000704,0.000257,0.000773,-0.000219,0.000134,-0.000112,0.000256,0.000486,8.8e-05,-0.000505,0.000778,0.000511,3.1e-05,-0.001487,0.000808,0.00023,-0.000495,-0.000122,0.000726,0.000972,0.00073,0.000914,-0.000633,0.000164,-5.3e-05,0.00065,-0.001369,-5.2e-05,0.000813,-0.000269,-0.000338,-0.000655,-0.00066,0.000441,7.4e-05,-0.000176,0.000193,-0.000334,-0.00096,-7.4e-05,-0.000387,-5.1e-05,-0.000367,-0.000334,0.000263,0.000632,-0.000228,-0.000257,-0.000387,-0.000124,0.000244,0.000221,-0.000391,-0.000246,0.000226
-0.00115,-6.2e-05,-0.001247,0.00046,0.000502,-0.00175,0.000427,0.00047,-3e-05,-2.5e-05,0.000635,0.000382,-0.000445,0.000814,0.000239,-0.000193,-0.000143,0.001186,0.001373,3.5e-05,-0.000548,0.000203,2.6e-05,-0.001502,0.000814,0.001095,-0.000785,0.000194,-0.000379,0.000324,0.000449,0.00023,0.000732,-0.000259,0.00049,0.001085,0.000253,-0.000526,-0.000322,-0.00019,-0.000778,-0.000573,0.001147,7e-04,0.000201,0.000745,0.000478,0.000143,0.000185,-0.000988,-0.000284,-0.000638,0.000987,-5e-05,-0.000125,0.000284,-0.000378,-0.00088,-0.000306,-0.000158,0.000316,-0.000379,0.000152,-0.000566,0.000407,1.3e-05,-0.000197,-0.000224,-0.00079,0.00061,-0.000327,0.000957,-0.000208,-0.000838,0.00015,-0.000405,-0.000227,0.000222,-0.000642,-0.000684,-0.001047,-0.001294,0.000313,0.000408,0.000574,0.000276,0.000416,-0.000476,-0.000554,-0.000405,0.000393,-0.000178,0.000406,0.000316,0.000312,-1.5e-05,-0.000504,-0.000325,0.000349,-1e-05,-0.000448,-9e-06,-7e-05,-0.000124,0.000396,0.000229,-7.7e-05,-0.000377,2.4e-05,0.00033,-0.00072,0.000296,2.1e-05,0.000152,-0.000335,0.000122,-0.000155,-0.00014,-0.000441,-0.000194,2e-04
-0.000166,-0.000294,-0.000642,0.000188,0.000162,0.00018,-0.000304,-0.000326,0.001375,0.000945,-0.000122,-0.000311,7e-06,-0.000177,0.000149,0.000601,-0.000859,-7.9e-05,-0.000371,-2e-04,-0.000375,0.000486,0.000538,0.00025,-0.000466,0.000729,-6.6e-05,-0.000658,0.000236,0.000914,0.000443,-2.6e-05,-0.000816,-6e-05,0.000861,-0.000916,-0.000511,-0.000272,-0.000152,0.000495,0.000547,-6.3e-05,-0.000573,-0.001177,-3e-06,-0.000408,0.000232,0.000164,0.000194,0.000726,0.000304,3.7e-05,-0.000621,2e-05,-0.000345,6.9e-05,4.5e-05,-0.000297,6.8e-05,0.000124,-0.000218,0.000236,2.3e-05,-4.9e-05,-0.000876,-7.1e-05,0.000394,0.000167,0.000602,-0.000782,0.000788,-0.00041,0.000449,-0.000495,-0.000381,0.000516,-3.8e-05,2.6e-05,0.000371,0.000578,0.000114,0.000368,-0.000338,0.000224,-0.000291,-0.000131,-0.000282,0.000574,0.00023,0.000315,0.000316,0.000173,0.000354,-0.000182,-0.000897,0.000168,0.000609,0.000161,-0.000209,-0.00021,-0.000201,-0.000103,3.8e-05,0.000172,0.000232,-9.8e-05,-9.4e-05,0.000545,9.3e-05,0.000164,0.000242,-0.000216,-0.000215,-0.000285,0.000363,-0.00022,-0.00036,7.4e-05,-3.9e-05,0.000355,-0.000173
0.000792,0.000203,0.000894,-0.000306,-0.000562,0.000579,0.00082,0.00049,-0.000598,-0.000609,0.000173,0.000532,-0.000275,-0.00063,1e-05,-0.000221,0.000321,0.000542,-0.000588,-0.000893,-0.000163,-0.000456,-0.000238,0.000869,-0.000115,-0.000403,0.000245,0.000288,-0.000516,-0.000513,-0.000311,0.000772,-0.000478,0.000255,-0.000461,0.000148,0.000235,-0.000145,-0.000359,-0.000517,-0.000376,7.8e-05,-0.000868,0.000271,9.5e-05,-8.7e-05,-0.00011,0.000249,-0.000128,-0.000371,-0.000105,0.000572,0.000125,-0.000107,0.000282,-9e-05,4.6e-05,4.7e-05,-0.000172,-0.000249,0.000145,-0.00035,0.000542,-0.000591,0.000136,-0.000179,-4.6e-05,0.000282,-6e-05,0.000216,-0.000583,1.3e-05,-0.000346,0.000497,-3.2e-05,2e-04,-0.00022,-0.000473,-4e-05,-0.000254,-0.000498,-0.00012,-0.000601,-0.00028,-4e-06,0.000238,0.000407,-0.000392,0.000494,0.000114,5.8e-05,-7.5e-05,-0.000524,-7e-06,0.000409,-0.000175,-0.000212,3e-06,0.000157,6.6e-05,0.000269,0.000263,-0.000223,-0.000105,0.000172,-0.000186,-0.000217,0.000667,-9.1e-05,6e-06,0.000254,-1.7e-05,-0.000159,7.5e-05,0.000181,3.5e-05,-0.000145,-0.000199,0.000119,-8e-06,-9.7e-05
-0.000509,-0.000288,-0.000372,-0.000755,-0.000115,0.00032,-0.000322,0.000202,0.000179,0.000362,-0.000318,0.000431,0.00024,1.8e-05,-0.000149,0.000204,0.00027,-0.000332,4.1e-05,7.3e-05,-0.000109,-0.000561,0.000185,-0.000117,0.00033,-0.000194,-0.000225,3.2e-05,0.000122,9.7e-05,4.6e-05,0.000222,0.000403,8e-06,-0.000118,-0.000173,-0.000371,0.000106,3.7e-05,0.000526,0.000596,-0.000289,0.00021,-0.000163,2.4e-05,-6.4e-05,-1.5e-05,-0.000221,0.000261,0.000116,6.7e-05,-3e-05,0.000314,9e-06,-5.2e-05,0.000255,9e-05,-2.6e-05,-0.00012,-0.000453,-7.4e-05,-0.000114,-0.000531,0.000129,0.000453,-6.3e-05,0.00027,-0.00022,-0.000322,-0.000249,7.8e-05,-0.000434,-2.1e-05,-0.000188,0.000131,0.00027,0.000117,0.000244,-0.000269,-3.9e-05,0.000448,-0.000149,8.7e-05,0.000125,-2.8e-05,-0.000195,2.5e-05,0.000133,4.3e-05,-0.000191,2.2e-05,-9.4e-05,-3.8e-05,0.000118,7.1e-05,0.000336,0.000159,-1.8e-05,0.000378,-0.000126,0,-8.3e-05,0.000316,0.000153,-0.000158,-2.2e-05,0.000289,-0.000635,8.5e-05,-1.6e-05,-0.000288,0.000102,4.8e-05,-0.000151,-0.000219,8.1e-05,-0.000151,9.5e-05,7.6e-05,-0.000104,0.000235
0.000254,0.00016,9.1e-05,0.000165,3.5e-05,-0.000349,8e-06,-0.000249,-0.000255,5.2e-05,0.000138,-0.000242,0.000151,0.000389,0.000276,-4.7e-05,-0.00018,-8.6e-05,0.00037,1.6e-05,0.000164,0.000383,-6.1e-05,0.00015,1e-05,-0.000278,0.000322,-0.000292,0.00012,0.000102,0.000217,5.5e-05,-0.000368,3.1e-05,6.3e-05,0.000526,4e-06,-0.00012,0.000127,0,-6e-05,4.4e-05,-0.000591,4e-05,0.000235,-2.3e-05,-0.000172,0.000253,-0.000407,-0.000158,-2.9e-05,-0.00027,-5.5e-05,-2.4e-05,0.000258,-0.000117,0.000381,-0.000262,-2.9e-05,0.000508,0.000104,0.000161,6e-06,-8.1e-05,-0.000335,0.000198,-0.000135,0.000172,-0.000161,-0.000241,-4.4e-05,0.000338,0.000135,-0.00017,-9.1e-05,-8e-06,-8.3e-05,-0.000179,0.000241,0.000418,-0.000157,9.1e-05,-5.9e-05,-1.5e-05,7.6e-05,-0.000226,2.3e-05,-3.1e-05,-0.000175,-0.000181,4.9e-05,0.000232,0.000372,-4.5e-05,0.00011,0.000138,2.1e-05,-0.000218,-0.000102,8.5e-05,5.1e-05,-0.000328,-9.4e-05,-0.000134,-9e-06,-1.8e-05,0.000188,-0.000207,-7.2e-05,-9.3e-05,-0.000125,-0.00028,-6e-06,-6e-05,-7.7e-05,0,0.000151,-0.000285,-2e-06,-0.000139,-0.000216
-0.000264,3.8e-05,0.000407,0.000547,0.000137,0.000433,-9.7e-05,1e-04,8e-06,-9.9e-05,-1.6e-05,0.000103,1.1e-05,-8e-05,-2.9e-05,-3.3e-05,0.00041,0.000162,-0.000277,-0.000119,0.000141,0.000262,4.2e-05,-0.000209,-0.000376,0.00038,4.2e-05,0.000157,7e-06,0.000152,-0.000162,-0.000178,0.000321,6.9e-05,-0.000217,-9.1e-05,0.00013,0.000196,-0.000114,0.000162,-0.000108,-0.000178,0.000373,0.000192,-2.9e-05,7.2e-05,-0.000151,-0.000365,0.00023,-7.9e-05,0.00018,9.2e-05,-0.000253,-0.000219,-0.000218,-0.000131,-0.000106,-0.000128,-3.9e-05,-0.000199,-6.4e-05,0.000204,0.000149,0.000122,0.000289,-5.7e-05,-0.000108,-0.000138,0.000178,2.2e-05,-3e-06,8e-06,-0.000169,0.000261,-4e-06,-4.8e-05,6.8e-05,8.4e-05,-0.000187,-2.6e-05,0.000325,-0.000195,0.000237,-4.9e-05,-0.000245,0.000202,0,-0.000118,0.000104,-8.3e-05,4e-05,1.8e-05,-0.000366,-1.6e-05,-9.5e-05,-0.000316,-2e-05,-0.000148,-3.3e-05,5e-06,-3.7e-05,0.000244,-5e-06,0.000137,-9.7e-05,5e-05,-0.000308,0.000224,4.3e-05,0.000105,0.00018,0.000165,5.1e-05,9.3e-05,2.7e-05,-6.4e-05,-0.000196,0.000277,3e-06,1.3e-05,0.000118
0.000229,6.1e-05,-0.000253,-0.000237,1.8e-05,-0.000313,0.000223,0.000175,-0.000199,3.8e-05,0.00027,-0.000425,-0.000207,-9.7e-05,3.3e-05,-0.000155,-0.000147,3.3e-05,-0.000292,0.000236,-9.3e-05,-0.000233,-8.5e-05,0.000138,0.000237,-7.5e-05,0.000176,4e-06,0.000242,3.1e-05,0.000128,5.2e-05,1.9e-05,-9e-05,0.000485,0.000129,-0.000209,0.000109,3.6e-05,7.6e-05,-6.6e-05,1.2e-05,0.000103,-0.000338,-0.000153,1.1e-05,3.3e-05,0.000176,-0.000164,0.000159,7e-05,-2.4e-05,-7.3e-05,1e-04,-0.000101,0.000121,-9.7e-05,0.000134,6.7e-05,0.000154,-5e-05,-1.6e-05,-7.8e-05,7e-06,5.2e-05,5.2e-05,6.4e-05,-1.4e-05,7.2e-05,0.000123,-0.000115,-0.000139,0.000167,9.2e-05,9.9e-05,0.000219,-0.000223,-3.7e-05,-8.5e-05,-0.000145,-2.2e-05,6e-06,-0.000123,-5.6e-05,-7.5e-05,-0.000119,9.7e-05,0.00011,-0.000134,0.000105,-2.9e-05,7.3e-05,5.4e-05,7e-06,-2.3e-05,5.8e-05,6.9e-05,-9e-06,0.000122,-2.3e-05,-0.000123,-2.3e-05,2.1e-05,-9.6e-05,0.000131,1.2e-05,8.1e-05,-0.000217,-6.6e-05,2.3e-05,-4.7e-05,0.000126,-1.3e-05,-2.5e-05,-4.9e-05,4.7e-05,-4e-06,-0.000112,-5.9e-05,3e-06,-3.3e-05
-0.000187,6.5e-05,-0.000181,-0.000243,2.5e-05,-0.000415,0.000175,-0.000128,0.000182,-2.8e-05,-0.000159,-0.000158,0.000263,0.000246,-1.5e-05,4.7e-05,-0.000189,0.000462,-0.000186,-0.000132,2.4e-05,-6e-06,0.000113,-7.5e-05,0.000128,-0.000219,0.000142,0.000246,-0.000162,-1.3e-05,-0.000129,-0.000317,0.000135,-1.7e-05,-0.000154,-0.000182,8.5e-05,-0.000118,-7.7e-05,-0.000242,6.4e-05,-2e-06,3.9e-05,0.00026,7.1e-05,8.3e-05,7.2e-05,8e-06,9.1e-05,-1e-05,-6.2e-05,-5.2e-05,0.000207,5.6e-05,0.000147,-7.7e-05,-8e-06,1.1e-05,-7.8e-05,-0.00017,-2.9e-05,-0.000206,0.000145,0.000132,-0.000119,-0.000137,-4.3e-05,7e-06,-5.6e-05,-0.000131,0.000196,2.5e-05,-0.000123,4.2e-05,-6.8e-05,-0.000127,8.9e-05,-2.3e-05,0.000206,-1e-06,-0.000115,9.7e-05,-0.000129,-4.8e-05,0.00017,-0.000151,4.4e-05,-0.000142,4.1e-05,4.9e-05,-5.5e-05,-9e-06,0.000206,5.3e-05,2e-05,2.9e-05,-9.4e-05,0.000102,-9.8e-05,-2.9e-05,0.000124,7e-06,4.5e-05,8.8e-05,6.1e-05,7e-06,-9e-05,0.000205,-2.3e-05,-2.9e-05,6e-06,1.9e-05,3e-06,-0.000126,0.000145,3.7e-05,6.5e-05,2.4e-05,3.2e-05,2.7e-05,1.6e-05
0.00025,6.8e-05,6e-05,-1.4e-05,2e-06,4.7e-05,-0.000267,6e-05,0.000364,6.5e-05,4e-05,-0.000166,-4.8e-05,-7e-06,-4.9e-05,7e-06,0.00011,-0.00019,5.6e-05,0.000199,-0.00015,-3.3e-05,-0.000144,-0.000142,-0.000208,-5.6e-05,-0.000184,-1.7e-05,5.9e-05,-0.000122,8.5e-05,0.000136,-0.000176,8e-05,-0.000264,0.000103,3.9e-05,-0.000224,6e-06,-0.00012,-1.6e-05,-2e-05,7.4e-05,-0.00015,-0.000111,-0.000121,-1.9e-05,-1e-06,-3e-05,9.6e-05,-9.6e-05,2.4e-05,-0.000111,-4.5e-05,-2.7e-05,5.7e-05,-5.5e-05,-6.5e-05,5e-06,3e-05,1.5e-05,7.6e-05,-0.000102,9.3e-05,0.00019,0.00013,5.1e-05,-2.7e-05,-6.3e-05,1.9e-05,-0.000198,-5e-06,4.9e-05,-0.000165,-8e-06,-3.2e-05,0.00012,-2.9e-05,-0.00015,-5.8e-05,-0.000208,-5.2e-05,0.000131,2.1e-05,6e-05,3.2e-05,1.1e-05,6.4e-05,3.7e-05,1.3e-05,-6.4e-05,-4.4e-05,-0.00014,-2e-06,4.3e-05,-3.3e-05,4.7e-05,8.1e-05,-6.9e-05,0.000163,2.9e-05,-1.7e-05,-3.2e-05,-3.5e-05,-8.5e-05,8e-06,2.9e-05,0.000112,3.5e-05,-1.1e-05,-3e-05,1.7e-05,-2.5e-05,-1.5e-05,-5e-05,-2.2e-05,-4.3e-05,7.3e-05,3.8e-05,6.8e-05,-3.8e-05
2.6e-05,-8.1e-05,0.000193,0.000193,-7.5e-05,0.000397,0.00016,9.7e-05,-0.000135,6.5e-05,-0.000145,0.000218,-2.3e-05,-0.000159,-2.3e-05,6.1e-05,-0.000208,-0.000229,0.000108,-0.000144,1.6e-05,9.2e-05,7.2e-05,6.3e-05,0.00016,-0.000183,-7.8e-05,-0.000158,-0.000246,-3e-06,7.6e-05,9e-06,4.9e-05,-6.4e-05,2.2e-05,-0.000125,-6.2e-05,0.000209,-6.8e-05,3.5e-05,4e-05,7.1e-05,2.2e-05,4.1e-05,-9e-06,0.000163,-0.000121,-5.1e-05,2.9e-05,-0.000153,-1.3e-05,-2.6e-05,6.3e-05,9.3e-05,2.8e-05,6.1e-05,0.000112,4.2e-05,3.9e-05,7.6e-05,-2e-06,-1.9e-05,-3.1e-05,0.000143,1e-06,-9e-06,3.5e-05,5e-05,1.6e-05,0.000109,0.000112,0.000133,-3e-05,-5e-06,4e-05,-0.000138,2.7e-05,3.9e-05,1.6e-05,-0.000113,0.000137,2.9e-05,-5.3e-05,-5.7e-05,-6e-05,-3.1e-05,4.5e-05,-9.1e-05,-4.9e-05,1.3e-05,-2.5e-05,1.1e-05,-5.1e-05,1.4e-05,-0.000158,4.2e-05,-4.8e-05,-4.1e-05,3.1e-05,-8.4e-05,-3e-06,3.9e-05,-1.6e-05,1.6e-05,-2.9e-05,5e-06,6.6e-05,-6e-05,2e-05,-4.8e-05,5.3e-05,-3e-06,3e-06,1.2e-05,1.3e-05,-5.2e-05,8.7e-05,-7e-05,1e-05,3.7e-05,1.5e-05
-0.000121,-5e-06,-5.5e-05,3.8e-05,-1e-05,-8.5e-05,-8.4e-05,-1e-06,8e-05,-0.000131,0.000112,-0.000134,5.4e-05,0.000115,5.4e-05,2.5e-05,2.5e-05,0.000312,-1e-04,4.9e-05,5.9e-05,-0.000103,-3.1e-05,8.5e-05,5e-05,0.000266,2e-06,8.8e-05,2.7e-05,9e-05,-6.7e-05,1.7e-05,0.00012,5e-06,7.9e-05,0.000109,3.7e-05,3.7e-05,1.2e-05,9e-06,-0.000122,-1.3e-05,-0.000383,7.1e-05,1.3e-05,-0.000194,2e-05,6.8e-05,-1.2e-05,3.4e-05,7e-05,-3.2e-05,4e-06,-0.00018,-6.8e-05,-5.4e-05,8.2e-05,8.5e-05,-1.1e-05,-7e-06,-2e-06,1.8e-05,3.9e-05,5e-06,-0.000158,-2.4e-05,-7e-06,-5e-05,1e-06,-0.000115,-4.4e-05,-7.4e-05,-1e-06,4.5e-05,-4.6e-05,4.4e-05,-3.2e-05,7e-06,8.7e-05,-1.5e-05,-6.2e-05,-3.7e-05,-3.4e-05,-1.3e-05,-3.7e-05,-4.2e-05,-1.3e-05,3.4e-05,-0.000113,-5e-06,2e-05,1e-06,0.000161,2.5e-05,0.000144,8.8e-05,2e-05,-4.8e-05,-7.9e-05,2.9e-05,-2e-06,8e-06,3.7e-05,-2.5e-05,5.1e-05,8e-06,5.9e-05,-0.000125,1.2e-05,4.6e-05,-1.4e-05,-6.2e-05,-6e-06,-1e-06,-4.2e-05,2.5e-05,1.8e-05,8.1e-05,-5.1e-05,-5.8e-05,3.1e-05
1.8e-05,3.1e-05,-0.000106,-8.7e-05,1.2e-05,-9.1e-05,6.2e-05,1.3e-05,-0.000236,6.6e-05,-2e-06,6.2e-05,2.9e-05,4e-06,5.5e-05,-1.9e-05,0.000141,-1.1e-05,1.6e-05,-1.5e-05,6e-06,7.9e-05,2.5e-05,-0.000124,-0.00016,-0.000136,-0.000112,-0.000102,1e-05,4.4e-05,5e-06,0.00025,-0.000175,3.4e-05,9.6e-05,-5.9e-05,-2.2e-05,-8.6e-05,9.3e-05,-0.000165,0.000126,6.2e-05,0.000152,-5.1e-05,-4.7e-05,0.000161,4.4e-05,-1.3e-05,-9e-06,-2.6e-05,2.2e-05,-6.9e-05,-1e-06,0.000122,-6e-06,1.1e-05,-9e-06,1e-06,5.9e-05,2e-06,-8e-06,5.7e-05,1.5e-05,-2.6e-05,-1.4e-05,-3.9e-05,2.8e-05,3.1e-05,-3.5e-05,0.000144,-2e-06,-6.1e-05,-1.3e-05,-0.000114,-8e-06,-1.2e-05,-4e-05,-9.1e-05,-8.5e-05,9.4e-05,4.8e-05,-0.000141,-5.2e-05,2.5e-05,2.4e-05,-2e-06,2.5e-05,-3.5e-05,-7e-06,-1.9e-05,0,-3.9e-05,-2.3e-05,-1.3e-05,4.8e-05,-0.000103,4e-06,4.5e-05,0,-2.5e-05,-5.5e-05,-8.5e-05,-3.5e-05,2e-06,3e-06,-3e-06,-8.5e-05,9.6e-05,-9e-06,6e-06,-4.7e-05,7e-06,-1.5e-05,2.7e-05,-5e-06,2.3e-05,2.8e-05,-7.5e-05,4e-06,4e-06,-8e-05
-3.6e-05,-4.6e-05,0.000107,-6e-05,0,3.3e-05,1.6e-05,4.7e-05,5.6e-05,-1.5e-05,3e-05,1.9e-05,1.3e-05,-0.00014,-8e-05,1.8e-05,-8.3e-05,3.3e-05,-5e-06,-5.8e-05,8.1e-05,-9.4e-05,-6e-06,5.6e-05,0.000109,-0.000166,4e-06,-1e-06,2.3e-05,8e-06,-3e-06,-0.000128,0.000182,-6.8e-05,-4.7e-05,7.1e-05,5.9e-05,7.4e-05,-3.6e-05,0.000176,-8.3e-05,1e-05,4.5e-05,9.9e-05,5.8e-05,-0.000128,-3.6e-05,-6.5e-05,3.2e-05,-6e-06,-2.6e-05,0.000102,2e-06,-4.4e-05,3.6e-05,5.8e-05,-1e-04,-2.8e-05,-1e-05,-6.9e-05,3.2e-05,3.8e-05,1e-06,-3.9e-05,1e-05,9e-06,-6e-06,-2.2e-05,3.6e-05,-1.3e-05,2.8e-05,1.4e-05,-1.1e-05,-4.1e-05,2.4e-05,0.000163,6.4e-05,4.5e-05,4.3e-05,6e-06,-1.4e-05,5.8e-05,-5.3e-05,-7e-06,3e-06,-2.8e-05,-2.7e-05,2.1e-05,0.000111,1.4e-05,-4.5e-05,3.2e-05,-0.000124,-5e-06,-3.2e-05,4.3e-05,-3e-06,5.7e-05,4.4e-05,2.3e-05,2.7e-05,5.5e-05,1.3e-05,-3e-05,1e-05,1.1e-05,-5e-05,-3.6e-05,-1.9e-05,-4e-05,2.7e-05,6.3e-05,6e-06,4.3e-05,-5e-06,-2.7e-05,-2.3e-05,4.1e-05,-2.1e-05,-2.5e-05,5.1e-05
9.7e-05,5e-06,2.9e-05,6.4e-05,9e-06,2e-06,-2e-06,-7e-06,-4e-05,-3.5e-05,-7.8e-05,-5.8e-05,0,3.3e-05,1e-06,-4.2e-05,7.1e-05,7.9e-05,6.2e-05,8.8e-05,-9.1e-05,2.5e-05,3.8e-05,4.6e-05,3e-06,0.000112,-9e-06,5e-06,7e-06,-3e-05,6e-06,8.9e-05,-7.1e-05,4.4e-05,-7e-05,-6.5e-05,-5e-05,3.9e-05,1.3e-05,5.6e-05,7e-05,2.4e-05,9.1e-05,-0.000111,3e-06,0.000133,3.3e-05,1e-04,-2.1e-05,-1e-06,-4e-05,7.9e-05,-4e-06,2.7e-05,-5.4e-05,-5.4e-05,-1.7e-05,3.2e-05,1.2e-05,7.6e-05,1e-06,-9.3e-05,-3e-06,-8.1e-05,-2e-05,3.2e-05,-3.1e-05,3.2e-05,-2e-06,2.3e-05,-5e-06,1.6e-05,1.1e-05,6.8e-05,-1.8e-05,1e-05,-2.9e-05,-3.8e-05,2.9e-05,5e-06,4.8e-05,-5e-06,4.9e-05,-3.4e-05,-3.7e-05,6.4e-05,3.2e-05,4e-06,2.7e-05,-1.2e-05,-2.1e-05,-3.6e-05,0.000126,7e-06,-6.1e-05,8e-06,3.3e-05,3.4e-05,1.9e-05,-3e-05,2e-06,3.9e-05,-7e-06,3.5e-05,-3e-06,3e-06,5e-05,2e-06,9e-06,4e-06,2.8e-05,-3.7e-05,-2e-06,-1.4e-05,3e-05,-2.8e-05,-7e-06,-1e-05,2.3e-05,-1.4e-05,-2.4e-05
-0.000101,5e-06,-0.000194,8.6e-05,3.7e-05,-0.000109,2.2e-05,1.4e-05,7.9e-05,5.9e-05,2.1e-05,-1.2e-05,-3.3e-05,5.8e-05,6e-05,2e-05,3.4e-05,-2.6e-05,4.2e-05,-8.7e-05,5.1e-05,-6e-06,-5.1e-05,-3e-06,-6.8e-05,-4.3e-05,-1.1e-05,1.7e-05,-8e-05,-1.1e-05,4.4e-05,-0.000142,-7.4e-05,1.1e-05,-1.6e-05,2.8e-05,-1.4e-05,-0.000139,-1.3e-05,5.4e-05,-3e-05,4e-06,2.2e-05,5.8e-05,-2.2e-05,-0.000101,-1e-05,-9.5e-05,-1.1e-05,-5.8e-05,3.7e-05,-6.4e-05,-2.3e-05,-7e-06,4.2e-05,9e-06,9e-06,3.4e-05,4e-06,-1.3e-05,2e-06,-2.6e-05,-3.2e-05,-3.8e-05,7.9e-05,-1.6e-05,-1.7e-05,-1.7e-05,5e-06,-2.5e-05,1.3e-05,3e-05,-1.9e-05,3.2e-05,-2e-06,1.9e-05,-2e-06,9e-06,-6.2e-05,5.8e-05,-0.000107,1.2e-05,-6e-05,2.6e-05,-1.9e-05,2.8e-05,-1.7e-05,-1e-05,-1.4e-05,-1.7e-05,-2e-06,1.2e-05,-3.5e-05,1.5e-05,-5e-06,-1.2e-05,-2.3e-05,-2e-06,-7e-06,2e-06,9e-06,-3.4e-05,9e-06,-2.1e-05,-2.7e-05,-1.1e-05,-3.8e-05,-1.3e-05,3e-06,-2e-05,-3.2e-05,6.4e-05,-1.7e-05,-4e-05,-6.8e-05,2.4e-05,0,-5e-06,-6e-06,1e-05,1.3e-05
5.9e-05,-2e-06,0.000115,-3.8e-05,-3.2e-05,6.2e-05,-6.9e-05,-4e-06,-5.8e-05,-4.9e-05,7e-06,-6.2e-05,4.3e-05,-7.5e-05,-3.9e-05,-4e-05,-5.5e-05,-3.1e-05,-8e-06,8e-06,-5.8e-05,4e-05,6.2e-05,-2.1e-05,3.6e-05,9.3e-05,0.000126,8.9e-05,1.9e-05,-1.6e-05,-5.4e-05,1.7e-05,8.6e-05,-3.8e-05,8.2e-05,-5.1e-05,3.4e-05,1.1e-05,4.4e-05,-1.6e-05,-2.6e-05,1e-06,-4.5e-05,-3.1e-05,2.8e-05,8.4e-05,-3.2e-05,7.2e-05,0,2.4e-05,4.6e-05,-3e-05,1.1e-05,-4.2e-05,-3e-06,4.9e-05,2.5e-05,-1.8e-05,-5e-06,9e-06,-2e-06,2.7e-05,4.3e-05,-6.9e-05,-5e-06,-6e-06,-2.5e-05,-9e-06,-2.4e-05,6.8e-05,2.5e-05,-7e-05,2.5e-05,-1.9e-05,2.1e-05,4.5e-05,-9.8e-05,-1.5e-05,5.2e-05,8e-06,6.7e-05,3.3e-05,-2.2e-05,-1e-06,5.3e-05,-2.9e-05,6e-06,4.9e-05,-1.7e-05,6e-06,-1e-05,-9e-06,-6.7e-05,1.2e-05,4e-06,-1.4e-05,1.7e-05,-3.8e-05,5.5e-05,-2.5e-05,1e-05,-2e-05,-1.4e-05,1.7e-05,4e-06,1e-06,6.3e-05,2e-06,9e-06,2.4e-05,-1.2e-05,-2e-06,1e-06,1e-05,4.6e-05,1.8e-05,-6.4e-05,1.6e-05,2e-06,1.1e-05,-2.7e-05
-4.5e-05,-1e-05,9.8e-05,-8.7e-05,-1.4e-05,0.000121,8.1e-05,-9e-06,0.000141,6e-06,4.5e-05,-3e-06,5.6e-05,1.3e-05,1.1e-05,2.9e-05,4e-05,0.000104,2.6e-05,-4.8e-05,1.8e-05,-7.2e-05,-4e-05,-2.6e-05,4.3e-05,-3.6e-05,0,-3.9e-05,-7.8e-05,-2e-06,7e-06,-0.000114,-7.4e-05,3.5e-05,9e-06,5.7e-05,-3e-05,7.5e-05,-1.4e-05,-3e-06,2.9e-05,-1.2e-05,-5.8e-05,-1.6e-05,-2e-06,-7.3e-05,1.3e-05,-3.8e-05,-1.6e-05,-2.8e-05,9e-06,-5e-06,3.2e-05,1.7e-05,-1.9e-05,-5.4e-05,6.8e-05,-2.7e-05,1.2e-05,-4e-05,-2e-06,1.5e-05,-1.1e-05,-1.2e-05,-7.2e-05,4e-06,1e-06,8e-06,1.3e-05,-0.000121,-5e-06,2.3e-05,-1.9e-05,9e-06,-1.2e-05,-2.4e-05,5.8e-05,0,-2.1e-05,-6.5e-05,-4.3e-05,-4.4e-05,-1.3e-05,6e-06,2.4e-05,6e-05,2e-06,-3.6e-05,-7e-06,3e-06,-1.3e-05,-2.2e-05,4.4e-05,5e-06,4.2e-05,3.2e-05,-2.5e-05,-4e-06,-4.6e-05,3.6e-05,-2.2e-05,2.1e-05,1.6e-05,-2.4e-05,3.5e-05,-1e-05,-3e-06,4.4e-05,-7e-06,7e-06,2e-05,-4.9e-05,-2e-06,1.8e-05,-2.6e-05,-2.4e-05,1.7e-05,-2.1e-05,-3e-05,1.9e-05,2.7e-05
2e-05,3e-06,-0.000109,1.1e-05,0,-7.4e-05,-2.9e-05,2.5e-05,-5.2e-05,2.3e-05,-4e-05,-5.4e-05,-5.3e-05,8e-05,-7e-06,-1.4e-05,-8e-06,9.3e-05,-1e-06,0,2.4e-05,2.5e-05,1.8e-05,3.1e-05,-5.7e-05,-4.4e-05,2e-06,9e-06,4.9e-05,5e-06,9e-06,5.7e-05,3.6e-05,-6e-06,-3e-06,-2.9e-05,-8e-06,-8e-06,-2.2e-05,-9.9e-05,-4.2e-05,-2.3e-05,-2.7e-05,4.7e-05,-2.8e-05,4.2e-05,1.6e-05,4.3e-05,1e-06,3.4e-05,-2.5e-05,7e-06,-2.3e-05,2.3e-05,-1.3e-05,3e-05,-4.8e-05,1.2e-05,-3e-06,2e-05,-4e-06,1.7e-05,4e-06,1e-06,6.9e-05,2.7e-05,8e-06,-1.8e-05,-1.7e-05,7.2e-05,1e-06,1e-05,1.4e-05,3.5e-05,-7e-06,-4.3e-05,2e-06,-3.6e-05,-1.5e-05,2e-06,4.2e-05,2e-06,6e-06,-1e-06,-2.2e-05,2.6e-05,-6e-06,4.3e-05,-2e-05,1e-05,5e-06,2.4e-05,2.6e-05,3e-06,-1.3e-05,-2.3e-05,2.2e-05,0,2e-06,5e-06,5e-06,1.2e-05,-5e-06,2.2e-05,-5e-06,-2e-06,-2.5e-05,-2.5e-05,-3e-06,-3e-05,-3e-06,2.6e-05,1e-06,3e-06,3e-05,-1.7e-05,-3.4e-05,1.3e-05,1.5e-05,-1e-06,-1.7e-05
-6e-06,1.7e-05,-1.9e-05,6.3e-05,1e-06,-0.000117,1.9e-05,-1.5e-05,-5.1e-05,-3.5e-05,-1.6e-05,0.000115,8e-06,-3.7e-05,-1.6e-05,3.1e-05,-5e-05,-0.000106,2.4e-05,2.1e-05,-1.7e-05,5e-06,-1.1e-05,-6e-06,1.7e-05,5.4e-05,2.8e-05,-1.6e-05,-1.5e-05,9e-06,5e-06,0,4e-06,-1.8e-05,-0.00011,3.8e-05,4e-06,-1e-05,3.2e-05,1.1e-05,2.9e-05,-1e-05,-9e-06,-6.9e-05,1e-05,-2.1e-05,-1e-05,-5.2e-05,1.5e-05,-3.1e-05,-7e-06,-3e-06,-1e-06,-1.5e-05,6e-06,2.1e-05,-2.8e-05,1e-05,-1.1e-05,3.7e-05,-2e-06,-3e-06,-2.1e-05,3.2e-05,2e-05,-1.4e-05,9e-06,2.5e-05,-5e-06,-5.6e-05,1.4e-05,1.8e-05,-2.1e-05,-2e-06,1.5e-05,-4.3e-05,2.2e-05,2.7e-05,3.7e-05,-5e-06,-2.6e-05,2.5e-05,1.4e-05,2.7e-05,-2e-05,-2.6e-05,3e-06,-2.1e-05,1.4e-05,-2e-06,5e-06,-2e-05,-6.6e-05,5e-06,2.1e-05,-1.2e-05,-1.7e-05,2e-06,-1e-05,-1.6e-05,0,-3.5e-05,0,-8e-06,-3.4e-05,1e-06,-3.7e-05,2.1e-05,0,3e-06,-5e-06,-1.1e-05,5e-06,7e-06,-8e-06,2e-05,-3.2e-05,-1.5e-05,-7e-06,-4e-06,-1.7e-05
1e-05,-5e-06,4.7e-05,2.5e-05,1.6e-05,4e-05,-3e-05,9e-06,-7e-06,6e-06,3e-06,5.8e-05,1.5e-05,-3.2e-05,3.9e-05,-1.6e-05,-2e-06,5.3e-05,-1.5e-05,8e-06,2.6e-05,3e-06,6e-06,-3e-05,4.5e-05,2.9e-05,-3.8e-05,-2.9e-05,4.7e-05,7e-06,6e-06,6.2e-05,3e-06,2.3e-05,4.4e-05,-2.4e-05,-7e-06,5e-06,-5e-06,-2.8e-05,-2.2e-05,-2.2e-05,3.9e-05,7.4e-05,2e-06,3e-06,-1.7e-05,5e-06,2e-06,7e-06,1.5e-05,-1.6e-05,1.8e-05,2.4e-05,1.6e-05,-4.3e-05,-2e-05,-2.8e-05,8e-06,-2.9e-05,-5e-06,8e-06,9e-06,4e-05,-3.8e-05,-2e-06,3e-06,-1.9e-05,2.9e-05,-4e-06,-3.8e-05,-1.4e-05,1.3e-05,-3.6e-05,-9e-06,-8e-06,-3.6e-05,-1.3e-05,-3.2e-05,-4.5e-05,1e-05,-1e-05,-3.9e-05,2e-06,-2e-06,4e-05,-1.7e-05,1.6e-05,4e-06,0,5e-06,1.4e-05,4.6e-05,3e-06,-7e-06,3.3e-05,1e-06,-1.1e-05,-7e-06,2.2e-05,1.6e-05,7e-06,2e-06,-1e-06,1.2e-05,-2e-06,3.1e-05,-2e-05,0,-1.7e-05,2e-06,-1e-06,-6e-06,1e-06,1.1e-05,9e-06,1.2e-05,5e-06,1.7e-05,-2e-06,2.7e-05
2.4e-05,-4e-06,0,-6e-05,1e-06,0.000107,1.2e-05,1.1e-05,-3.3e-05,9e-06,3.6e-05,3.7e-05,1.2e-05,5.2e-05,-4e-06,1.1e-05,-1.6e-05,4.2e-05,-1.8e-05,2e-06,-4.4e-05,-1.6e-05,-1.8e-05,2.2e-05,-5.8e-05,3.2e-05,-2e-06,1.1e-05,4e-06,6e-06,-2.1e-05,3.7e-05,1.3e-05,-8e-06,8e-05,2.4e-05,9e-06,-1.2e-05,-7e-06,-5.7e-05,9e-06,-1e-05,5.1e-05,-5.2e-05,-1.1e-05,6e-06,-3e-06,3.9e-05,2e-05,-8e-06,8e-06,1.5e-05,-6e-06,-4.1e-05,-1.4e-05,2.3e-05,1.1e-05,-1.1e-05,-1.8e-05,-1e-06,1e-06,-4.9e-05,4e-06,5.3e-05,2.8e-05,-1.8e-05,-1.2e-05,1.1e-05,1.1e-05,-1e-05,3.2e-05,-1.6e-05,-1e-05,-6e-06,-6e-06,-4.7e-05,2.3e-05,-1.3e-05,1e-06,7e-06,-3.1e-05,2.3e-05,-1.1e-05,-8e-06,1.7e-05,-5e-06,1.2e-05,0,-3.2e-05,-4e-06,1.5e-05,-1e-05,1.8e-05,4e-06,-3.5e-05,-1.5e-05,4e-06,-3.6e-05,-3.1e-05,-6e-06,-1e-06,2.8e-05,-2e-06,4e-06,1.1e-05,3e-06,7e-06,-3.2e-05,0,9e-06,6e-06,2e-05,-4e-06,-2.3e-05,-1.7e-05,-2e-05,-2e-05,1e-05,-9e-06,-1.7e-05,-1.9e-05
-5.9e-05,4e-06,-2.5e-05,-3.3e-05,2e-06,-4.3e-05,1.7e-05,-8e-06,3.9e-05,-1e-05,8e-06,4.9e-05,3e-06,2e-06,-2.3e-05,-1.5e-05,-5e-06,-1.1e-05,6e-06,8e-06,1.8e-05,-2e-06,2.8e-05,1.3e-05,1.6e-05,-6.3e-05,-3.2e-05,-1.9e-05,-2.7e-05,-9e-06,-2e-06,-4.7e-05,-5e-05,-9e-06,-5.4e-05,-2.9e-05,-1.1e-05,-1.4e-05,-2.7e-05,5e-05,-8e-06,-5e-06,1.3e-05,2.8e-05,1.7e-05,-7e-06,9e-06,-4e-05,-1.8e-05,-1.4e-05,-1e-06,-1.9e-05,-1.9e-05,1.4e-05,5e-06,9e-06,3.7e-05,2.1e-05,1.1e-05,-1.6e-05,1e-06,9e-06,5e-06,3.2e-05,-3.2e-05,1.2e-05,-4e-06,-6e-06,-1.1e-05,2.7e-05,-2.8e-05,2.2e-05,4e-06,1e-05,1.2e-05,7.2e-05,2.5e-05,-3e-06,2.1e-05,4.4e-05,-2e-06,-1.7e-05,-3e-06,1.2e-05,-1.2e-05,-2.7e-05,-1.4e-05,-1.3e-05,-5e-06,-1e-06,1.7e-05,0,-3.9e-05,5e-06,-1.3e-05,-9e-06,-1e-06,1e-06,3.9e-05,-3e-06,-1.5e-05,-2.3e-05,0,-8e-06,-4e-06,1e-06,-1e-06,1.6e-05,2e-06,6e-06,-8e-06,5e-06,-2e-06,-1.4e-05,2.5e-05,-1e-05,1.2e-05,-8e-06,9e-06,1e-06,4e-06
5.8e-05,7e-06,-9e-06,3.1e-05,-1.6e-05,-2.8e-05,-2.9e-05,0,1.1e-05,1.8e-05,-2.7e-05,-3.2e-05,-1e-06,-4.7e-05,0,3e-06,4.7e-05,3.6e-05,4e-06,-1.1e-05,-1.1e-05,3e-06,-2.6e-05,-1.6e-05,3.1e-05,3e-05,-3.9e-05,3.1e-05,1.3e-05,-9e-06,1.7e-05,5.5e-05,6.9e-05,1.3e-05,2.2e-05,1.9e-05,6e-06,-5e-06,1.7e-05,5.9e-05,-5e-06,-1e-06,-3.6e-05,-2e-06,-1.3e-05,9e-06,-1.2e-05,5.2e-05,1.5e-05,1e-05,-8e-06,1e-05,4e-06,1.7e-05,-1.3e-05,-3.6e-05,7e-06,3e-06,-8e-06,9e-06,4e-06,1.8e-05,-6e-06,2.4e-05,-3.7e-05,5e-06,-4e-06,0,-1.9e-05,-4.7e-05,6e-06,5e-06,7e-06,-1.5e-05,-7e-06,2.5e-05,4e-06,-3e-06,-2.3e-05,-5e-06,1.1e-05,-2.2e-05,-1.3e-05,1e-05,-1e-05,2.1e-05,8e-06,1.5e-05,2.8e-05,5e-06,8e-06,1e-06,1e-05,4e-06,2.4e-05,1e-05,1.5e-05,1.2e-05,-1.6e-05,-9e-06,8e-06,-1e-05,-3e-06,2e-06,5e-06,3e-06,2.3e-05,2.9e-05,2e-06,-2.7e-05,1e-06,-2e-05,-1e-06,1.1e-05,-2.1e-05,1.8e-05,-4e-06,8e-06,-1.4e-05,5e-06,-6e-06
-4.4e-05,-1.7e-05,4.9e-05,2.9e-05,3e-06,4.1e-05,3.7e-05,1.1e-05,1.3e-05,-1.7e-05,-1.3e-05,-2.4e-05,-1.3e-05,2e-05,1e-05,-5e-06,1.8e-05,2.6e-05,-1.5e-05,7e-06,6e-06,-5e-06,1.8e-05,4e-06,-4e-05,1e-05,1.7e-05,4e-06,-2e-05,-1e-06,-3e-06,-0.000104,-5.8e-05,-8e-06,-4.6e-05,-1.2e-05,2e-06,3.1e-05,6e-06,2.2e-05,1.1e-05,7e-06,-6e-05,-2.4e-05,1e-05,-1.3e-05,-3e-06,-5.1e-05,-2.7e-05,-2.7e-05,1e-06,3e-05,4e-06,-2.1e-05,-1e-06,2.4e-05,-1e-05,-1.8e-05,3e-06,1.3e-05,-2e-06,1.3e-05,-2e-06,-5e-06,4.9e-05,-4e-06,-1.1e-05,5e-06,-1e-06,4.4e-05,-2e-06,-1e-06,-2.6e-05,-1.6e-05,-5e-06,2.5e-05,-1.7e-05,-4e-06,1.2e-05,9e-06,0,1.7e-05,-8e-06,-1.7e-05,1.6e-05,-2.8e-05,-5e-06,-2.4e-05,2.7e-05,0,5e-06,-1e-06,3.7e-05,3e-06,1.9e-05,-1e-06,-2e-05,4e-06,2.7e-05,-3e-06,-8e-06,1.5e-05,3e-06,-7e-06,-3e-06,1e-06,-3.9e-05,-8e-06,2e-06,8e-06,3e-06,1.1e-05,-4e-06,1.2e-05,2.4e-05,5e-06,1.9e-05,-9e-06,1.5e-05,2e-06,1.8e-05
4.4e-05,5e-06,-2.4e-05,-1.1e-05,0,-2.7e-05,-3.1e-05,-2e-05,-1.6e-05,-4e-06,0,-4.5e-05,2.4e-05,1.3e-05,6e-06,2e-06,-1.1e-05,-3.2e-05,-2.4e-05,-2e-06,1e-05,9e-06,-3e-06,2e-06,1.4e-05,-1.1e-05,1e-06,-1e-06,4.2e-05,1e-06,1e-06,1.9e-05,2.1e-05,-4e-06,-2e-06,2e-05,-2e-06,2.4e-05,-2.1e-05,1.5e-05,-1.3e-05,1.1e-05,3.2e-05,4.5e-05,1.2e-05,1.5e-05,5e-06,2.5e-05,2e-06,1.2e-05,1.4e-05,-7e-06,-6e-06,2.5e-05,8e-06,4e-06,-3.6e-05,5e-06,-1e-06,-2.2e-05,-1e-06,-9e-06,-1e-06,-2.3e-05,3e-06,1e-06,-3e-06,-9e-06,6e-06,-3e-06,-5e-06,-2e-05,3.2e-05,1.2e-05,9e-06,2e-05,-2.4e-05,1e-06,5e-06,2.7e-05,2.9e-05,-5e-06,-2.8e-05,-4e-06,1.2e-05,-1.9e-05,-5e-06,1.5e-05,-5e-06,-3e-06,8e-06,1e-06,-4.3e-05,4e-06,4e-06,-1.8e-05,1.9e-05,1.1e-05,-4e-06,-5e-06,9e-06,7e-06,-5e-06,1.3e-05,-8e-06,2e-06,0,-1.1e-05,-5e-06,-3e-06,3e-06,-4e-06,0,0,-2.5e-05,-2.1e-05,-1e-06,3e-06,-6e-06,9e-06,-2.6e-05
-4.1e-05,5e-06,-4.3e-05,-3e-05,3e-06,-8e-05,1.3e-05,0,2.2e-05,1.2e-05,3.1e-05,1e-05,-7e-06,-3.6e-05,-6e-06,3e-06,2.4e-05,1.3e-05,1.7e-05,-1.9e-05,-5e-06,-1.5e-05,-3e-06,5e-06,1.7e-05,2.1e-05,1e-05,1e-05,-1.3e-05,0,-1.2e-05,-4.6e-05,3.3e-05,1.1e-05,6.2e-05,-2.4e-05,7e-06,-4e-05,3e-06,1.9e-05,-1e-06,1.3e-05,-1.2e-05,-4.9e-05,-2.3e-05,-1.8e-05,-1.4e-05,-3.2e-05,-1e-06,-2.2e-05,8e-06,-2e-05,2e-06,-3.2e-05,5e-06,-3.2e-05,3e-06,1.8e-05,1e-06,1.3e-05,1e-06,4e-06,1e-05,-3.2e-05,-2.2e-05,6e-06,4e-06,6e-06,0,-9e-06,-5e-06,5e-06,-2.8e-05,1.5e-05,-3e-06,7e-06,2.4e-05,-6e-06,-1.7e-05,-2.2e-05,-3.1e-05,1.1e-05,-1e-06,1e-05,-9e-06,1.5e-05,6e-06,-1.8e-05,-9e-06,0,3e-06,4e-06,4e-06,3e-06,-1e-05,2.1e-05,-1.5e-05,-4e-06,1.6e-05,1.5e-05,4e-06,-1.8e-05,4e-06,-5e-06,6e-06,0,2e-06,1e-05,-2e-06,9e-06,-8e-06,-1.9e-05,-1e-06,-3e-06,7e-06,-6e-06,-8e-06,4e-06,9e-06,-1e-06,1.7e-05
2.3e-05,-3e-06,3.9e-05,4e-06,-3e-06,6.5e-05,-8e-06,2e-05,-5.2e-05,-9e-06,-1e-05,-3e-05,-1.4e-05,4e-06,-1e-06,-3e-06,-2.1e-05,5.3e-05,-6e-06,2.6e-05,5e-06,6e-06,3e-06,-9e-06,-2.2e-05,-6.3e-05,2.6e-05,-2.1e-05,3.1e-05,1e-06,1e-06,3.4e-05,-7.1e-05,-9e-06,-2e-06,9e-06,-8e-06,-1.3e-05,4e-06,-5.1e-05,-1e-06,1e-05,4.6e-05,3.8e-05,1.2e-05,2.4e-05,-3e-06,4e-05,2e-06,8e-06,0,-6e-06,2e-06,9e-06,-5e-06,2.9e-05,1.8e-05,-6e-06,-2e-06,-8e-06,-1e-06,-1.1e-05,-1e-05,-4e-05,2.2e-05,5e-06,7e-06,-1e-05,5e-06,3.4e-05,1.1e-05,9e-06,1.8e-05,-2e-06,-4e-06,-4.2e-05,-5e-06,-1.6e-05,1.5e-05,-1.9e-05,5e-06,2e-06,-3e-06,-5e-06,-1.2e-05,-3.2e-05,-6e-06,1.2e-05,-5e-06,1e-06,1e-06,-2e-06,2.5e-05,3e-06,-1.4e-05,-6e-06,1e-05,4e-06,-2.7e-05,-1.1e-05,-1e-05,-2e-06,-1e-06,2e-06,7e-06,-3e-06,1.9e-05,-1.4e-05,1e-06,1.1e-05,2e-06,2.6e-05,-1e-06,-8e-06,-1.2e-05,1.7e-05,2.8e-05,-8e-06,-1.2e-05,-1e-06,4e-06
-5e-06,-4e-06,2e-05,2.4e-05,8e-06,8.9e-05,1.2e-05,-2.5e-05,1.5e-05,1e-06,-5e-06,4.9e-05,1.2e-05,3.3e-05,-4e-06,7e-06,-3.3e-05,-1.5e-05,-1e-06,-2.9e-05,-9e-06,-7e-06,5e-06,-6e-06,4e-06,3e-05,6e-06,7e-06,-1.2e-05,0,1e-05,1.7e-05,6.3e-05,-1e-06,-6e-05,-1.5e-05,1e-06,2.7e-05,9e-06,-2e-05,-7e-06,9e-06,6e-06,-2.6e-05,5e-06,-2.5e-05,8e-06,-6e-06,1e-05,-1e-05,-8e-06,5e-06,-3e-06,1.5e-05,-1.7e-05,-5e-06,1.8e-05,-1e-05,5e-06,1.6e-05,-1e-06,-1.3e-05,7e-06,-3e-05,-2.2e-05,-8e-06,6e-06,7e-06,5e-06,-8e-06,-1.5e-05,-7e-06,-5e-06,0,6e-06,-2.5e-05,-6e-06,9e-06,-3e-06,2e-06,-2.7e-05,-1.6e-05,-1.6e-05,-9e-06,1e-06,0,2e-06,-1.1e-05,-1.3e-05,-1e-06,2e-06,2e-06,-2.4e-05,-1e-06,0,-5e-06,-7e-06,1.3e-05,1.7e-05,6e-06,7e-06,1.9e-05,1e-06,-1.1e-05,-1e-05,0,-2e-06,5e-06,6e-06,-1.8e-05,4e-06,-8e-06,0,-8e-06,1e-05,2e-06,-2.4e-05,7e-06,5e-06,-4e-06,-1.3e-05
-1.1e-05,5e-06,-4.5e-05,1e-05,-1e-06,-6.2e-05,0,-1e-06,5e-06,4e-06,-2.6e-05,3.5e-05,1.3e-05,-1.2e-05,9e-06,-8e-06,7e-06,-1.6e-05,-3e-06,1.8e-05,4e-06,1.4e-05,-1.2e-05,1e-05,1.7e-05,2.2e-05,1.8e-05,-9e-06,-9e-06,3e-06,-1e-06,2.9e-05,-3.4e-05,9e-06,1.3e-05,1.6e-05,4e-06,-1.1e-05,-1.8e-05,-3.1e-05,6e-06,3e-06,-2.2e-05,1.3e-05,-1.8e-05,2.9e-05,-6e-06,-1.3e-05,1e-06,-4e-06,-4e-06,2e-06,1e-06,-1.1e-05,1.2e-05,-2.2e-05,0,1.2e-05,-5e-06,0,-2e-06,1.4e-05,-8e-06,-2.1e-05,-1.1e-05,-2e-06,0,-5e-06,-4e-06,-3e-06,1.6e-05,-8e-06,-1.2e-05,1.3e-05,-1e-06,-1.6e-05,-2.7e-05,-4e-06,-8e-06,-1.3e-05,2.6e-05,8e-06,-1e-05,4e-06,1e-05,2.1e-05,-3e-06,3e-06,-1e-06,2e-06,-2e-06,2e-06,-1.4e-05,4e-06,-3e-06,7e-06,1e-06,-1e-06,-3.1e-05,1.2e-05,-9e-06,-1.3e-05,0,1e-05,-3e-06,0,-2e-06,7e-06,0,1.2e-05,-2e-06,-1e-05,-3e-06,5e-06,-1.2e-05,-1.8e-05,4e-06,-6e-06,-9e-06,-5e-06,5e-06
2e-05,3e-06,8e-06,-1.8e-05,-1.3e-05,-7e-05,-1.2e-05,2.4e-05,7e-06,-4e-06,2.7e-05,-6e-06,-1.2e-05,-1.7e-05,-2e-06,7e-06,-2.3e-05,4.5e-05,2e-06,-1e-05,1e-06,-2e-05,1.2e-05,0,-2e-05,-3.4e-05,2e-06,1e-06,-1e-06,3e-06,-3e-06,1.9e-05,-1e-06,-1e-05,1.3e-05,-1.3e-05,-1e-06,-9e-06,1e-06,-2.9e-05,-8e-06,-4e-06,-1.4e-05,7e-06,9e-06,-3.4e-05,-8e-06,1.5e-05,5e-06,1e-06,9e-06,-1.4e-05,1e-06,4e-06,5e-06,3.1e-05,-2.1e-05,8e-06,6e-06,-1.1e-05,1e-06,9e-06,6e-06,3e-06,4.5e-05,-5e-06,0,-1e-06,-7e-06,7e-06,-8e-06,1e-06,1.8e-05,3e-06,-3e-06,-4e-05,1.6e-05,-9e-06,1.2e-05,-1.1e-05,-2e-05,0,-1.1e-05,8e-06,-1e-06,-2.8e-05,3e-06,7e-06,-2e-06,-1e-06,-5e-06,-2e-06,3.4e-05,3e-06,1.3e-05,-1e-06,7e-06,3e-06,1.3e-05,-7e-06,8e-06,-1e-05,1e-06,-1e-05,1e-05,-2e-06,-7e-06,-5e-06,-5e-06,3e-06,-3e-06,1.5e-05,-1e-06,1.3e-05,1.2e-05,-3e-06,-1e-06,2e-06,1e-05,1e-06,6e-06
-2.8e-05,-6e-06,2.1e-05,-2e-05,6e-06,4.9e-05,1.2e-05,-1.9e-05,5e-06,6e-06,2e-06,7e-06,-1.2e-05,2.2e-05,-8e-06,-1.1e-05,1.7e-05,-1.4e-05,1e-05,-1.7e-05,-2e-06,1.4e-05,-7e-06,-8e-06,5e-06,5e-06,-1.2e-05,6e-06,-2e-05,1e-06,-4e-06,-2.1e-05,2.8e-05,3e-06,1.3e-05,1.3e-05,-6e-06,3.4e-05,1.9e-05,2e-05,4e-06,-5e-06,-4e-06,-2.6e-05,1e-06,3.9e-05,1e-06,-3.7e-05,-2e-06,-1.5e-05,9e-06,6e-06,-2e-06,2e-06,-7e-06,-1.1e-05,-1.1e-05,-1.5e-05,-5e-06,1.1e-05,2e-06,6e-06,-1e-06,1.7e-05,-1e-05,7e-06,4e-06,3e-06,-1e-06,3e-06,6e-06,1e-05,-1.2e-05,-1.4e-05,3e-06,2.7e-05,1.2e-05,-8e-06,-6e-06,1.3e-05,2.5e-05,1e-06,-3e-06,-1.3e-05,-9e-06,1.8e-05,-1e-06,-1.2e-05,-4e-06,-1e-06,-4e-06,5e-06,-2.1e-05,3e-06,8e-06,-2e-06,-1.3e-05,-8e-06,-1.4e-05,-1e-06,5e-06,1.4e-05,0,1.3e-05,-1e-06,2e-06,-1.6e-05,-1e-06,-6e-06,6e-06,4e-06,-1.1e-05,0,4e-06,-1.3e-05,1.6e-05,-1.9e-05,3e-06,-6e-06,0,3e-06
4e-05,1e-06,-1.3e-05,9e-06,-2e-06,2.8e-05,-1.6e-05,-1.3e-05,2e-06,1e-06,1.2e-05,-3.9e-05,1e-06,5e-06,3e-06,1e-05,2.8e-05,-1.1e-05,-7e-06,2.7e-05,2e-06,-1.4e-05,-1e-06,3e-06,1.5e-05,-5e-06,-9e-06,-8e-06,2.3e-05,-3e-06,-1e-06,2.7e-05,-3.6e-05,6e-06,2.3e-05,-1.2e-05,1e-06,1e-06,-5e-06,4.2e-05,-6e-06,-9e-06,-2.2e-05,3.5e-05,-4e-06,-4.1e-05,-1e-06,3.5e-05,-9e-06,9e-06,0,6e-06,2e-06,-2.1e-05,2e-06,-1.5e-05,4e-06,-4e-06,3e-06,-1.6e-05,-1e-06,-1.6e-05,-1e-06,3.2e-05,-2.3e-05,3e-06,0,-7e-06,5e-06,-3.6e-05,2e-06,0,9e-06,-6e-06,1e-06,2.2e-05,8e-06,4e-06,-6e-06,1.1e-05,-2.2e-05,1e-06,-8e-06,-3e-06,2e-06,2.6e-05,-1e-06,1.8e-05,7e-06,0,-7e-06,-5e-06,-7e-06,2e-06,-1e-06,0,1.5e-05,-1e-05,2.7e-05,1e-06,-9e-06,1e-06,-2e-06,-1.5e-05,-3e-06,-1e-06,1.5e-05,-5e-06,3e-06,1e-05,0,-5e-06,-1e-06,-6e-06,1.7e-05,0,2e-06,-6e-06,6e-06,1e-06,-1.4e-05
