-0.000519,-9e-04,-0.000699,-0.000618,-0.000546,-0.000667,-0.000779,-0.000673,-0.000725,-0.000663,-0.000689,-0.000827,-0.000931,-0.000924,-0.000713,-0.000442,-0.000651,-0.000679,-0.000709,-0.000748,-0.000646,-0.000665,-0.000969,-0.000905,-0.000762,-0.000746,-0.000585,-0.000566
-2.5e-05,3e-05,-0.000156,6.8e-05,7.3e-05,0.000252,2e-04,0.000106,0.00019,2.1e-05,-0.000276,-0.000269,-0.000277,-0.000242,-0.000111,1.7e-05,-0.000177,-6.6e-05,4e-06,-5.4e-05,6.6e-05,0.000139,-8.6e-05,-0.000453,-0.000319,-0.000174,-0.000211,-0.000271
-4.5e-05,5.6e-05,-1.5e-05,8.2e-05,1.3e-05,-5.1e-05,-8.5e-05,7.2e-05,0.000134,8.2e-05,1.7e-05,-0.000113,-0.000107,6e-05,0.000174,9.8e-05,5e-05,4.4e-05,0.000114,0.000151,5.2e-05,0.000111,0.000178,9.2e-05,2.4e-05,0.000111,0.000147,9.5e-05
-0.000286,-0.000293,4.1e-05,-0.000186,-0.000181,-0.00019,-7.4e-05,-0.000126,-0.000262,-0.00017,9.9e-05,0.000213,0.000283,0.000229,2e-05,-0.000176,3.9e-05,-1.3e-05,-0.000165,-0.000126,-0.000185,-0.000153,-0.000103,0.00013,6.3e-05,-7.9e-05,3.2e-05,5.3e-05
0.000179,0.000475,0.000521,0.000277,0.000314,0.000537,0.00067,0.000367,0.000311,0.000315,0.000418,7e-04,0.000776,0.000488,0.000252,0.000137,0.000335,0.000375,0.000263,0.000187,0.000264,0.000223,0.00028,0.000409,0.000406,0.000308,0.000131,8.5e-05
0.000202,0.000307,9.7e-05,0.00022,0.00015,-7e-05,-0.000191,7.1e-05,0.00022,0.000193,9.1e-05,-0.000101,-0.000157,-8.7e-05,6.2e-05,0.000178,0.000108,6.7e-05,0.000285,0.000296,0.000183,2.3e-05,0.000273,0.000289,0.000203,0.000322,0.000153,1e-04
-0.000249,-0.000622,-0.000573,-0.000284,-0.00028,-0.000455,-6e-04,-0.000407,-0.000338,-0.00029,-0.000415,-0.000619,-0.000583,-0.000312,-0.000238,-3e-05,-0.000238,-0.000354,-0.000234,-8.1e-05,-9.8e-05,-0.000204,-0.000198,-3e-04,-0.000283,-0.000281,-0.00014,-2e-05
-0.000114,-0.000243,-0.000232,-0.000262,-0.000124,0.000138,0.000226,-4.5e-05,-0.00018,-0.000196,-0.000286,-0.000234,-0.000256,-0.000265,-0.000271,-0.00018,-0.000274,-0.000193,-0.000312,-0.000343,-0.000153,5e-06,-0.000391,-0.000561,-0.000391,-0.000463,-0.000299,-0.000206
-2.7e-05,0.000247,0.000253,0.000103,2.5e-05,2.9e-05,7.1e-05,9.2e-05,5.6e-05,1.2e-05,9.1e-05,9.2e-05,-0.000122,-0.000253,-2.8e-05,-0.000135,-7.2e-05,2e-05,-2.3e-05,-0.000198,-0.00019,-2.3e-05,-0.000223,-0.000174,-0.000123,8e-06,-1.2e-05,-0.000157
-0.000119,2e-05,0.000259,0.000292,0.000146,9e-06,0,8e-05,0.00018,0.000186,0.000409,0.000612,0.000663,0.000556,0.000438,0.000172,0.000356,0.000287,0.00026,0.000283,0.000154,0.000137,0.000392,0.000536,0.000422,0.00046,0.000343,0.00019
0.000249,0.000193,0.000101,3.1e-05,0.000165,0.000261,0.000317,0.000153,0.000131,0.00014,0.000186,0.000354,0.000609,0.000595,0.000202,8.5e-05,0.000183,0.000186,9.8e-05,0.000211,0.000203,0.00018,0.000428,0.000415,0.000342,0.000147,0.000131,0.000183
0.000327,0.000212,-0.00015,-0.000202,-9.5e-05,-0.000162,-0.000239,-6.2e-05,-0.000149,-8.5e-05,-0.000197,-0.000554,-0.000637,-0.00048,-0.000354,-9.3e-05,-0.000257,-0.000192,-0.000128,-0.000167,-0.000151,-0.000276,-0.000238,-0.000194,-0.000233,-0.000283,-0.000216,-0.000107
-0.000212,-0.000326,-0.000244,-1.1e-05,-0.00017,-0.000306,-0.000383,-0.00022,-0.000122,-0.000151,-0.000302,-0.000473,-0.000594,-0.000578,-0.000287,1.1e-05,-0.000128,-0.000197,-3.1e-05,-5e-05,-2.5e-05,-0.000184,-0.000268,-0.00032,-0.000289,-0.000146,-0.000167,-0.000114
-0.000275,-0.000276,-5e-06,6.4e-05,0,0.00017,0.000247,9e-06,0.000118,4.1e-05,-1.1e-05,0.000193,0.000208,0.000146,0.000178,0.000121,0.000149,6.6e-05,6.9e-05,0.000142,0.000177,0.000307,0.000127,-1.6e-05,0.000124,0.000116,5.7e-05,0.000111
0.000115,0.00018,0.000153,-0.000132,7e-06,0.00015,0.000242,0.000131,-6.5e-05,1e-06,0.00012,0.000201,0.000194,0.000244,0.000117,-0.000195,-4e-05,5.7e-05,-0.000117,-0.000123,-0.00022,4e-05,-3.6e-05,2.3e-05,3e-05,-9.3e-05,7.2e-05,0.000105
9.7e-05,0.000112,9.8e-05,7.5e-05,5.7e-05,-2.2e-05,-2.6e-05,7.9e-05,-2.6e-05,2.2e-05,0.000138,0.000268,0.000336,0.000222,0.000126,-1.4e-05,5.2e-05,0.000142,-8e-06,-0.000102,-6.8e-05,-0.000133,4e-06,0.000113,-1.2e-05,6.8e-05,0.000116,-2.6e-05
1.5e-05,7.3e-05,2.2e-05,0.000181,9.2e-05,-3.6e-05,-7e-05,-3e-06,0.000224,7.8e-05,3e-06,5.8e-05,0.000137,3e-06,-2.7e-05,0.00012,8.1e-05,4.2e-05,0.000174,0.000112,0.000203,6.3e-05,0.000198,0.000115,8.3e-05,0.000268,2.2e-05,-0.000149
0.000115,0.000118,-7.1e-05,-0.000123,-3e-05,-6.8e-05,-0.00017,-9.3e-05,-5.4e-05,-1e-06,-8.1e-05,-0.000417,-0.000484,-0.000227,-0.00018,-6e-06,-0.000135,-0.00024,-4.3e-05,5.6e-05,-2e-05,-5.4e-05,-0.000106,-7.6e-05,-4.5e-05,-0.000131,-0.000191,-0.000107
-3.4e-05,-0.000172,-0.00011,-0.00015,-0.000107,-1.7e-05,-4.7e-05,-8.4e-05,-0.000264,-0.000107,-8.8e-05,-0.00027,-0.000309,-0.000126,-0.000125,-0.000106,-0.000144,-0.000151,-0.000177,-3.9e-05,-9.6e-05,-0.000111,-0.000182,-0.000168,-0.000157,-0.000354,-0.000159,6.1e-05
