2.5e-05,6.4e-05,4.7e-05,1.9e-05,9e-06,3.4e-05,2.3e-05,5e-05,3.1e-05,2.4e-05,5.1e-05,3.4e-05,4.6e-05,1.3e-05,1.4e-05,4.9e-05,3.3e-05,2.7e-05,2.6e-05,4e-06,0.000291,5.6e-05,2.8e-05,0.000196,6e-06,5.6e-05,5e-06,0.000125,0.000107,0.000175,6.2e-05,1.1e-05,0.000206,0.000737,0.000683,0.001236,0.000927,0.000491,0.000161,0.000371,0.000429,0.001009,9.3e-05,0.00041,0.000482,0.000594,0.000626,9.3e-05,0.000116,0.000331,0.000745,5e-06,0.000571,5.6e-05,0.000276,0.000188,0.000309,0.00052,0.000369,0.000167,6.7e-05,0.000154,0,0.000133,0.000106,0.000112,1.4e-05,9.9e-05,8e-05,9.4e-05,6.1e-05,9.9e-05,2.7e-05,6e-06,1.8e-05,2e-05,2.3e-05,2.2e-05,7.4e-05,0.000122,2.2e-05,7.8e-05,3.6e-05,1.2e-05,1.5e-05,9e-06,0.000176,1.9e-05,0.000106,3.6e-05,1.5e-05,0.00024,9e-05,1e-06,2.5e-05,2e-06,2.4e-05,2e-05,2e-06,4.2e-05,3e-05,2e-06,1e-05,0.000122,4.6e-05,3.7e-05,3.5e-05,2.1e-05,8e-05,3.3e-05,3.9e-05,1.7e-05,4.7e-05,3.5e-05,7.4e-05,2.2e-05,1e-05,2.2e-05,4.4e-05,1.2e-05,6.8e-05
6e-05,0.000106,0.000192,0.000158,3.8e-05,6.2e-05,9.5e-05,0.000118,6.9e-05,3.7e-05,9.4e-05,7.9e-05,0.000112,0.000112,4.1e-05,0.000103,8.9e-05,9.5e-05,7.4e-05,3.6e-05,0.000455,0.000191,6.2e-05,0.000306,7.7e-05,0.000119,0.000386,0.000225,1e-04,0.000348,0.000464,0.001008,0.000745,0.002737,0.002811,0.00178,0.002041,0.002421,0.001799,0.000429,0.001716,0.00282,0.000405,0.000777,0.000535,0.000944,0.000415,0.000831,0.000727,0.000618,0.001601,0.000714,0.000729,0.000316,0.000328,0.000281,0.000696,0.000133,0.000759,0.000466,0.000335,0.000183,0.000158,0.000179,0.000354,0.000159,0.000229,0.000309,0.000399,0.000347,0.000121,0.000237,0.000201,0.000175,8.1e-05,0.000106,9.2e-05,4.4e-05,0.000124,0.000355,0.000376,0.000131,0.000198,0.000163,0.000185,9.8e-05,0.000577,0.000464,0.000283,0.000257,0.000309,0.000497,0.000544,0.000371,0.000139,0.000107,6.6e-05,0.000101,0.000104,6.8e-05,1.5e-05,4.5e-05,3.4e-05,0.000182,0.000171,0.00017,0.000145,7.7e-05,0.000177,7.6e-05,4.8e-05,3.2e-05,8.7e-05,7.4e-05,0.000146,0.000109,0.000111,9.2e-05,8.4e-05,9.7e-05,0.000115
8.7e-05,1e-05,0.000102,5.8e-05,8.5e-05,2.9e-05,7.5e-05,6.3e-05,6.8e-05,2.2e-05,2.9e-05,3.5e-05,7.1e-05,3.6e-05,7.6e-05,3.6e-05,2.1e-05,1.3e-05,5e-05,3.4e-05,0.000105,0.000774,0.000465,0.000199,8.4e-05,0.000161,0.000532,0.000389,1e-04,0.000139,7.8e-05,0.001102,0.000444,0.003821,0.004575,0.005202,0.002954,0.001083,0.001109,0.000969,0.000861,0.003522,0.003082,0.001695,0.001186,0.00036,0.000768,0.000821,0.001493,0.001114,0.001583,0.000905,0.001615,0.000965,0.000383,0.000404,0.000871,0.001788,0.000834,0.00092,0.000368,0.000326,0.00039,0.000239,0.000531,0.000516,0.000371,0.00011,0.000304,0.000227,0.000127,0.000149,0.000153,4e-05,0.000129,9.1e-05,0.000135,0.000125,0.000186,0.000287,0.000238,0.000194,0.000128,0.000135,0.000108,0.000481,0.000564,0.000154,2.3e-05,0.000236,0.000313,0.000431,0.000782,0.000272,2.2e-05,7.4e-05,8.8e-05,0.000151,9.7e-05,7.3e-05,6.5e-05,4e-05,2.8e-05,0.000153,7.1e-05,7.7e-05,2.5e-05,2.7e-05,0.000145,2.4e-05,1.1e-05,2.3e-05,5.8e-05,1.9e-05,8.7e-05,7.4e-05,4.6e-05,0.000114,6.3e-05,7.2e-05,3.7e-05
0.000135,0.000113,1e-05,7.6e-05,8.7e-05,0.000105,0.000125,0.000145,7.7e-05,6.3e-05,5e-05,5e-05,4.8e-05,7.8e-05,9.1e-05,0.00011,5.8e-05,3.5e-05,4.7e-05,2.7e-05,0.000876,0.000794,0.000427,0.00023,0.000177,0.000195,0.00044,0.000249,0.000127,0.000237,0.000338,0.000766,0.000435,0.004274,0.001017,0.000407,0.001921,0.002008,0.003065,0.004081,0.002654,0.000697,0.003231,0.00166,0.000469,0.000626,0.000646,0.001014,0.001582,0.000617,0.002269,0.000967,0.001712,0.001201,0.001135,0.00116,0.00083,0.001717,0.000827,0.000761,0.000599,0.000552,0.000673,0.000613,0.000152,0.000269,0.000524,0.000309,8.9e-05,0.000494,0.00023,0.000132,0.000123,0.000261,0.000277,0.000249,0.000141,0.000144,7.9e-05,0.000338,0.000183,5.4e-05,9.5e-05,7.9e-05,0.000214,0.000655,0.000561,0.00051,0.000374,0.000359,0.000471,0.00093,0.000675,0.000467,0.00015,0.000102,4.1e-05,8.2e-05,0.000224,0.000112,7.5e-05,3.1e-05,4e-05,0.000208,4.1e-05,3.4e-05,4.2e-05,2.7e-05,0.000116,8.5e-05,5.9e-05,4.9e-05,6.5e-05,6e-05,7.7e-05,2.2e-05,6.7e-05,4.7e-05,7e-06,4e-06,2.8e-05
5.3e-05,3.6e-05,3.4e-05,7.1e-05,2.4e-05,4e-05,1.8e-05,5.7e-05,1.2e-05,2.5e-05,4.9e-05,3.7e-05,2e-06,5.4e-05,1.9e-05,4.3e-05,9e-06,2.7e-05,1e-05,4e-05,0.001713,0.000933,0.000266,0.000621,8.5e-05,0.000375,0.000338,0.000162,0.000235,0.00049,0.000345,0.00035,0.000138,0.003567,0.003814,0.003906,0.001611,0.002747,0.002015,0.002766,0.00183,0.000772,0.003195,0.002431,0.001681,0.000926,0.001063,0.000987,0.0011,0.000348,0.003183,0.002064,0.0023,0.00097,0.000511,0.001559,0.001165,0.000962,0.00067,0.000843,0.001333,0.000933,0.001214,0.000569,9.2e-05,0.000327,0.000461,0.000325,0.000289,0.000436,0.000306,6e-05,9.4e-05,0.000211,0.000207,0.000264,0.000241,0.000216,0.00015,0.000487,0.000131,0.000125,0.000119,5e-05,0.000249,0.000238,0.000417,0.000191,7e-05,5e-05,0.000128,0.000833,0.000297,0.000286,7.2e-05,4.9e-05,0.000103,5e-05,0.000257,0.000108,0.000103,3.7e-05,5.2e-05,0.000182,0.000137,5.8e-05,5.6e-05,3e-05,0.000106,8.1e-05,3.6e-05,3e-05,3.6e-05,2.5e-05,6.1e-05,4.3e-05,1.4e-05,5.6e-05,4e-05,4.1e-05,1.5e-05
2.5e-05,7.2e-05,3.3e-05,4.2e-05,3.8e-05,1.7e-05,5e-06,2.6e-05,3.4e-05,2.1e-05,4.1e-05,2.4e-05,2.6e-05,3.5e-05,2.8e-05,2e-05,4.4e-05,1.5e-05,1.1e-05,4.1e-05,0.002488,0.000491,0.000253,0.000511,7.8e-05,0.000364,0.000351,0.000412,0.000362,0.000386,0.001359,0.000524,0.000326,0.002266,0.001933,0.002679,0.000271,0.005005,0.005609,0.001854,0.002835,0.001122,0.004977,0.001556,0.002063,0.000889,0.000841,0.001533,0.001094,0.002449,0.004725,0.002471,0.001543,0.002022,0.000827,0.001178,0.001237,0.001449,0.001029,0.002373,0.000977,0.000624,0.000597,0.000164,0.000264,0.00012,0.000466,0.000133,0.000229,0.000749,0.000508,0.000503,0.00036,0.000176,4e-05,0.000195,8.6e-05,0.000195,0.000344,4e-04,0.000223,0.000238,0.000139,8.5e-05,0.000248,0.000977,0.00044,0.000298,4.4e-05,3.8e-05,6.7e-05,0.001106,0.000647,0.000542,0.000198,0.000146,0.000139,3e-05,0.000243,0.000127,6e-05,3.8e-05,3.3e-05,0.000151,0.000108,7.9e-05,3.7e-05,3.5e-05,3.6e-05,5.8e-05,5.4e-05,4.3e-05,2.5e-05,4.5e-05,3.9e-05,5.8e-05,4.7e-05,2.7e-05,1.1e-05,2e-05,5e-06
1.6e-05,5.7e-05,4.4e-05,1.9e-05,3.3e-05,2.6e-05,3.8e-05,2.9e-05,1.7e-05,1.7e-05,2.6e-05,4.7e-05,3.5e-05,2.3e-05,2.7e-05,3e-05,2.5e-05,3.1e-05,7e-06,5.9e-05,0.003101,0.001214,0.000422,0.000814,0.00025,0.000318,0.000571,0.000514,2e-04,0.000694,0.001565,0.000765,0.000444,0.000512,0.002569,0.004258,0.002423,0.006698,0.003709,0.001553,0.005645,0.002976,0.005307,0.004026,0.003105,0.001474,0.000972,0.001664,0.002444,0.001638,0.003557,0.003246,0.00287,0.001364,0.002716,0.001092,0.001399,0.002799,0.001831,0.003286,0.004343,0.002856,0.000644,0.001155,0.000239,0.00073,0.000758,0.000722,0.000709,0.00071,0.000554,0.000429,0.000251,0.000371,0.000132,0.000195,1.9e-05,0.000289,0.000112,0.000461,0.000421,9e-05,8.5e-05,5.8e-05,0.000236,0.001512,0.000813,0.000518,0.000198,0.000103,0.000259,0.001054,0.000573,0.000482,0.000282,0.000143,0.000167,0.000181,0.000244,0.000175,9e-05,6e-05,5.9e-05,0.000161,0.000178,0.000118,5.2e-05,1.6e-05,0.000108,5.7e-05,8e-05,1.3e-05,2.2e-05,2.3e-05,3.8e-05,4.5e-05,1.7e-05,4.9e-05,4.6e-05,2.8e-05,2.5e-05
4e-05,4.6e-05,3.6e-05,3.6e-05,7.2e-05,7.1e-05,5.9e-05,3.2e-05,9e-06,4.5e-05,5.7e-05,5.8e-05,1.3e-05,3e-05,3.1e-05,3e-06,2.3e-05,4.1e-05,4.1e-05,9e-05,0.003265,0.000678,6.5e-05,0.001995,0.001333,0.000872,0.000898,0.000436,0.000577,0.000909,0.001841,0.001471,0.000744,0.00101,0.001569,0.007836,0.008238,0.002834,0.009706,0.005399,0.005867,0.010834,0.009971,0.006206,0.002251,0.001275,0.001186,0.001281,0.002991,0.004177,0.007469,0.007795,0.003301,0.000544,0.001972,0.002317,0.001461,0.004395,0.003342,0.004131,0.00312,0.004357,0.005226,0.003494,0.001742,0.001842,0.001951,0.000857,0.000266,0.000938,0.001621,0.000618,0.000272,0.000383,0.000294,0.000228,0.000233,0.000357,0.000344,0.000125,7.1e-05,7e-05,0.000134,0.000162,0.000264,0.001546,0.000952,0.000373,0.000142,6.9e-05,0.000418,0.001288,0.000863,0.000322,0.000236,0.000132,7.6e-05,0.000196,0.000343,0.000216,8.1e-05,7.8e-05,9.3e-05,0.000234,0.000527,0.000193,8.9e-05,5.1e-05,0.000218,0.00013,3.5e-05,3e-05,3.7e-05,6.5e-05,5.8e-05,1e-04,7.4e-05,0.000101,7e-06,3.9e-05,4.9e-05
2.9e-05,3.4e-05,4.8e-05,2.1e-05,5.2e-05,9.1e-05,0.000114,6.2e-05,1.9e-05,2.3e-05,5.3e-05,3.4e-05,1.9e-05,2.7e-05,8e-06,2.8e-05,2.7e-05,3.9e-05,2e-05,0.000114,0.002998,0.005257,0.002871,0.002056,0.002094,0.000611,0.00073,0.000811,0.000821,0.000953,0.0026,0.002324,0.00097,0.001618,0.00345,0.007768,0.00524,0.005268,0.008254,0.007475,0.0031,0.00825,0.006453,0.002634,0.001579,0.002087,0.001698,0.001613,0.000628,0.001454,0.005518,0.001428,0.001941,0.001547,0.001571,0.00067,0.001115,0.003646,0.002881,0.00097,0.002328,0.003273,0.001813,4e-04,0.000404,0.00146,0.001262,0.000935,0.000632,0.00068,0.000708,0.000625,0.000491,2.8e-05,0.000179,0.00014,9.6e-05,0.000524,0.000213,0.000142,0.000144,7e-05,0.000162,0.000275,6.6e-05,0.001187,0.001122,0.000505,0.000219,0.000173,0.000428,0.000644,0.000368,0.000204,0.000119,3.6e-05,9.7e-05,9.7e-05,0.000348,0.000541,0.000503,0.000269,7.4e-05,0.00016,0.000785,0.000517,0.000227,9.1e-05,0.000234,0.000121,7.5e-05,3.2e-05,5.1e-05,0.000156,0.000132,0.000268,0.000123,0.000227,0.000128,0.000108,1.2e-05
1.3e-05,5.7e-05,4.3e-05,2.3e-05,4.1e-05,1.7e-05,3e-05,1.6e-05,2.6e-05,1.2e-05,3.3e-05,3e-05,3.9e-05,1.1e-05,1.5e-05,2.8e-05,3.5e-05,1e-05,7e-06,0.000127,0.002162,0.006924,0.003836,0.001501,0.00138,0.000525,0.000601,0.000527,0.000335,0.001336,0.001319,0.000806,0.000299,0.001531,0.003784,0.004134,0.003424,0.005254,0.002719,0.003687,0.005667,0.004183,0.002222,0.001887,0.000722,0.001101,0.001489,0.000733,0.000598,0.00086,0.003159,0.004117,0.002013,0.002039,0.000573,0.000855,0.000186,0.001861,0.000592,0.000236,0.001939,0.001284,0.000539,0.000343,0.000179,0.00077,0.000417,0.00026,0.000166,0.000173,0.000247,0.000158,0.000142,0.000159,0.000134,7e-06,7.1e-05,0.000778,0.00047,0.000269,9.7e-05,4.2e-05,0.000175,0.000201,0.000108,0.000484,0.000528,0.000296,0.000186,9e-05,0.000308,0.000612,0.000343,0.000291,0.000422,0.000252,0.000126,0.000139,0.000398,0.000625,0.000154,0.000328,0.000309,0.000156,0.000727,0.000303,7.2e-05,6.1e-05,0.000274,0.000288,8.6e-05,2.2e-05,9.5e-05,0.000129,1e-04,0.00028,0.000148,0.000279,0.000277,0.000114,2.4e-05
4e-06,3.9e-05,3.3e-05,2.3e-05,2.9e-05,2.1e-05,3.2e-05,7e-06,2.1e-05,3e-05,1.7e-05,2.5e-05,3.2e-05,3e-05,8e-06,1.6e-05,1.9e-05,3.8e-05,1.5e-05,0.000122,0.001203,0.004505,0.002566,0.002596,0.000707,0.000145,0.000433,0.000781,0.000766,0.001467,0.001778,0.000644,0.000192,0.000732,0.003708,0.005338,0.002784,0.002656,0.003702,0.000467,0.003365,0.002169,0.002681,0.003802,0.00233,0.002504,0.001405,0.000831,0.000849,0.000727,0.001385,0.002737,0.001666,0.001927,0.001577,0.001479,0.000362,0.00123,0.001907,0.000981,0.00139,0.000916,0.000546,0.000499,0.00044,0.000472,0.000427,0.000379,0.000405,6.5e-05,0.000159,0.000128,0.000135,8.3e-05,9.9e-05,6.3e-05,3.6e-05,0.000777,0.00035,0.000117,7.2e-05,7.7e-05,0.000286,0.000114,6.3e-05,0.000292,0.00031,0.000267,0.000101,0.000134,0.000181,0.000243,7.5e-05,0.000175,0.000433,0.000281,0.000152,7.8e-05,0.000334,0.000313,0.000272,0.000282,9.6e-05,0.000129,5e-04,0.000304,7.2e-05,2.6e-05,0.000262,0.000329,0.00032,0.000229,0.000225,7.7e-05,0.000125,0.000176,9.4e-05,0.000266,0.000262,0.000135,4.5e-05
1.9e-05,4.3e-05,3.6e-05,1.2e-05,2.7e-05,2e-06,2.5e-05,1.1e-05,2.1e-05,2e-06,1.8e-05,1.4e-05,1.2e-05,6e-06,2.4e-05,1.2e-05,2e-06,2.6e-05,1.1e-05,0.000104,0.000638,0.001556,0.000403,0.000757,0.000389,0.000117,0.000361,0.000105,0.000367,0.000769,0.00134,0.000552,0.000439,0.00029,0.001287,0.001045,0.001018,0.002615,0.001393,0.001795,0.002672,0.001573,0.002499,0.001834,0.000596,0.003434,0.002316,0.000873,0.000495,0.001076,0.000916,0.002251,0.000518,0.001776,0.002179,0.000863,0.000593,0.001671,0.001287,0.000873,0.00104,0.000909,0.001079,0.000379,0.000211,0.000401,0.000209,8.5e-05,0.000294,0.000154,0.00023,0.000212,0.000134,0.000149,0.000104,7.3e-05,7.9e-05,0.000423,0.000316,0.00018,0.000137,0.000118,0.000244,0.000196,0.000115,0.00034,8.3e-05,0.00011,4.5e-05,0.000138,0.000207,0.000287,0.000123,0.000248,0.000425,0.000155,3.9e-05,2e-05,0.000259,3.9e-05,7e-05,0.000115,0.000116,0.000117,0.000108,4.6e-05,2.5e-05,6.4e-05,0.00022,0.000152,5.2e-05,7.6e-05,8.5e-05,1e-04,6.7e-05,9.3e-05,5.2e-05,0.000197,1e-04,4.3e-05,1.4e-05
2.9e-05,1.8e-05,3e-06,1.4e-05,1e-05,6e-06,1.4e-05,3e-06,1.7e-05,1.5e-05,1.3e-05,1.4e-05,8e-06,1.2e-05,1.4e-05,1e-05,8e-06,1.2e-05,1e-05,0.000104,0.001171,0.001405,0.000605,0.000217,0.000298,0.000229,0.000159,0.000418,0.000166,0.000941,0.000145,0.00029,0.00021,0.000327,0.00024,0.00044,0.001552,0.001743,0.001766,0.001611,0.001653,0.001323,0.00321,0.002934,0.003041,0.002786,0.000961,0.002594,0.000579,0.001393,0.00071,0.000312,0.002868,0.002022,0.000794,0.001914,0.001771,0.001473,0.002509,0.00245,0.002063,0.000953,0.000962,0.000407,0.000166,0.000306,0.000211,0.000165,0.000324,0.000257,0.000247,0.000202,0.000128,0.000206,9.5e-05,9e-05,0.000101,0.000121,6.3e-05,0.000139,6.2e-05,9.8e-05,9.2e-05,9.2e-05,3.5e-05,0.000238,7.1e-05,1.8e-05,4.2e-05,0.000122,0.000242,6.7e-05,3.1e-05,0.00024,0.000178,9.6e-05,4.9e-05,4.5e-05,0.000242,1.6e-05,7.4e-05,1.6e-05,6.9e-05,0.000106,3.4e-05,4.9e-05,4.5e-05,2.7e-05,0.000182,5.3e-05,6.3e-05,5.7e-05,7.9e-05,1.6e-05,2.9e-05,5.9e-05,4.2e-05,0.000148,4.4e-05,1.9e-05,1.4e-05
2.1e-05,2.5e-05,1.3e-05,8e-06,2.3e-05,1.3e-05,2.6e-05,1.2e-05,1.2e-05,6e-06,9e-06,8e-06,7e-06,6e-06,1e-05,7e-06,3e-06,1.8e-05,1.9e-05,0.000121,0.001794,0.001887,0.000828,0.000358,0.000337,0.000323,3.6e-05,0.000261,0.000391,0.001416,0.001293,0.000696,0.000407,0.000292,0.000937,0.000451,0.002399,0.002137,0.001142,0.002813,0.004401,0.002687,0.0039,0.002483,0.00241,0.002238,0.003299,0.004714,0.002849,0.001604,0.000923,0.002316,0.002259,0.000993,0.002057,0.001871,0.001393,0.001231,0.002207,0.001492,0.002436,0.000837,0.00104,0.000861,0.000454,0.000895,0.000416,8.3e-05,0.000623,0.000439,0.000619,0.000271,0.000213,0.000273,0.000295,0.000278,0.000147,7.1e-05,3.5e-05,0.000337,8.4e-05,0.000122,0.000126,8.5e-05,0.000106,0.000379,0.000136,9.5e-05,2.5e-05,9.9e-05,7.8e-05,0.000131,1e-06,0.000177,0.000107,5.9e-05,2.2e-05,3.1e-05,0.000229,7.9e-05,9.7e-05,3.2e-05,3.8e-05,6.6e-05,1.8e-05,4e-05,3.2e-05,1.1e-05,3.6e-05,9.1e-05,2.9e-05,5.7e-05,4e-05,4.2e-05,2.9e-05,7.9e-05,5.8e-05,6.4e-05,1.8e-05,3.1e-05,1.8e-05
9e-06,2.3e-05,4.5e-05,1.4e-05,4.3e-05,1.7e-05,1.6e-05,1.2e-05,1e-05,1e-06,1.7e-05,1.1e-05,1e-05,2e-06,1.3e-05,1.1e-05,1.3e-05,3.4e-05,2.6e-05,0.00015,0.002039,0.000527,0.000439,0.00022,0.000165,0.000162,4.4e-05,0.000172,0.00019,0.001378,0.000361,0.000374,1.5e-05,0.001032,0.001731,0.003088,0.001361,0.005834,0.003025,0.001662,0.003091,0.00362,0.006013,0.006477,0.003564,0.003336,0.001534,0.004376,0.004973,0.00418,0.00299,0.004611,0.002112,0.004381,0.003961,0.001021,0.002414,0.003867,0.005176,0.003003,0.003437,0.002714,0.000793,0.001158,0.000846,0.001079,0.000592,0.000885,0.000523,0.000799,0.000928,0.000365,0.000355,8.2e-05,0.000303,0.00026,0.000126,0.000215,0.000172,0.000456,0.000295,0.000186,0.000183,0.00017,9e-05,0.000471,0.000256,0.000153,6.6e-05,0.000124,0.000286,0.000119,0.000128,0.000261,0.000247,7.6e-05,4.7e-05,6e-05,0.000187,8.1e-05,2.7e-05,5.1e-05,4e-05,6.9e-05,4.3e-05,2.7e-05,4.5e-05,1.2e-05,0.000147,0.000137,9e-05,2.3e-05,2.2e-05,3.8e-05,4.1e-05,0.000106,5.5e-05,7.2e-05,6.2e-05,1.3e-05,1.3e-05
2.3e-05,6e-05,1.8e-05,2.8e-05,3e-05,3.8e-05,3.3e-05,1.4e-05,1.4e-05,9e-06,1.7e-05,1.5e-05,3.2e-05,2.1e-05,2.4e-05,2.2e-05,2.7e-05,2.4e-05,1.1e-05,0.000132,0.0024,0.001137,0.000392,0.000518,0.000269,6.9e-05,6.9e-05,0.000166,0.000255,0.000985,0.001709,0.001191,0.000476,0.001858,0.002991,0.004363,0.004348,0.00823,0.008531,0.002087,0.002447,0.004241,0.006252,0.011697,0.014238,0.014177,0.009986,0.005066,0.001575,0.004213,0.005055,0.004375,0.006206,0.007473,0.002674,0.004056,0.008692,0.008154,0.005861,0.002343,0.002009,0.00237,0.002994,0.001228,0.000403,0.00078,0.002858,0.001055,0.001452,0.000927,0.001001,0.000875,0.000309,0.000787,0.000336,0.000642,0.000375,0.000384,0.000278,0.000448,0.000345,5.4e-05,0.000205,9.1e-05,2.9e-05,0.000395,0.00017,6.2e-05,0.00012,2.1e-05,0.000483,0.000485,0.000162,0.000197,0.000128,0.000185,7.1e-05,5.4e-05,0.00023,0.000123,3.8e-05,5.5e-05,6.6e-05,7.3e-05,7e-05,1.8e-05,3.2e-05,5.1e-05,0.000283,0.000133,6.6e-05,2.7e-05,6.4e-05,3.4e-05,7e-05,8.2e-05,7.3e-05,0.000153,8.7e-05,4.9e-05,1.6e-05
2.5e-05,3.8e-05,5.5e-05,4.3e-05,4.8e-05,2.1e-05,3e-05,2.8e-05,1.1e-05,2.1e-05,1.7e-05,2.2e-05,2.5e-05,3.4e-05,1.3e-05,1.3e-05,1.8e-05,3e-05,2.4e-05,0.000134,0.00237,0.001231,0.000338,0.001118,0.000703,0.000281,7e-05,0.000118,0.000198,0.000475,0.000967,0.000527,0.000303,0.002028,0.003843,0.004382,0.00904,0.004515,0.004014,0.008756,0.009365,0.006058,0.000676,0.005962,0.004731,0.006038,0.008122,0.011975,0.011662,0.008515,0.006576,0.004696,0.006725,0.008193,0.010503,0.008484,0.004398,0.007235,0.007792,0.005431,0.003238,0.003272,0.000943,0.002267,0.001251,0.000242,0.003168,0.001743,0.00156,0.001752,0.000781,0.002271,0.0016,0.000959,0.001352,0.001189,0.00059,0.000846,0.000722,0.000621,0.000244,0.000231,0.000236,0.000373,0.000249,0.000525,0.000536,0.000248,6.9e-05,5.1e-05,0.000457,0.000118,0.000115,0.000196,0.000146,0.000175,0.000153,6.4e-05,0.000178,0.00024,0.000146,7.4e-05,6.8e-05,5.2e-05,5.7e-05,2.9e-05,1.6e-05,5.5e-05,0.000301,0.000289,0.000132,3.4e-05,7e-05,2.1e-05,8e-05,2.4e-05,3.3e-05,0.000292,0.000125,4e-05,2e-05
1.1e-05,2.5e-05,2.4e-05,8e-06,9e-06,9e-06,2.3e-05,2.4e-05,2.1e-05,6e-06,1.3e-05,2.4e-05,3.8e-05,5e-06,1e-05,2e-05,1.2e-05,2.6e-05,1.2e-05,0.00013,0.001846,0.002552,0.001511,0.001402,0.000936,0.000504,9.8e-05,5.1e-05,0.000217,8.2e-05,0.000768,0.000628,0.00045,0.001608,0.004013,0.003654,0.005543,0.003678,0.001422,0.005303,0.002557,0.005649,0.006953,0.001586,0.003226,0.001959,0.005841,0.002849,0.006222,0.010443,0.006102,0.004678,0.009044,0.004723,0.007561,0.003231,0.007201,0.003622,0.005292,0.00945,0.012045,0.006872,0.001653,0.00252,0.002511,0.000541,0.003441,0.002397,0.001928,0.002482,0.001878,0.001396,0.001708,0.000995,0.000455,0.000194,0.000137,0.000422,9.8e-05,0.00055,0.000515,0.000505,0.000167,0.000274,0.000263,0.000342,0.000461,0.000227,6.4e-05,0.000173,0.000322,0.000315,0.000122,0.000158,0.000195,0.000115,0.000111,4.4e-05,7.9e-05,0.000115,7.2e-05,4.8e-05,8.7e-05,7.2e-05,0.000122,6.3e-05,2.4e-05,3.1e-05,0.000265,0.000593,0.000303,0.000118,5.4e-05,0.000111,1e-04,8.4e-05,9.1e-05,0.000244,0.000167,7.9e-05,2.5e-05
2.8e-05,3.2e-05,1.9e-05,1.2e-05,1.5e-05,1.2e-05,1.6e-05,1.8e-05,1.1e-05,1.2e-05,6e-06,6e-06,3.1e-05,2.7e-05,2.5e-05,6e-06,1.7e-05,2e-06,2.2e-05,1e-04,0.001869,0.002348,0.000964,0.000626,0.000481,0.000277,0.00015,0.000153,0.000132,0.000642,0.000527,0.00074,0.000294,0.000531,0.004167,0.002362,0.003584,0.002013,0.001157,0.002164,0.002458,0.002402,0.003519,0.000671,0.000292,0.000694,0.003528,0.001128,0.005063,0.001307,0.003122,0.004905,0.001524,0.002424,0.003542,0.000888,0.00311,0.002713,0.005402,0.003215,0.004532,0.001758,0.001465,0.001171,0.001912,0.001985,0.002874,0.001534,0.001324,0.00188,0.000663,0.00107,0.000266,9.5e-05,0.000485,0.000708,0.000475,0.000292,5.3e-05,0.000566,0.000334,0.00013,0.000113,0.000141,0.000166,0.000515,0.000186,8.4e-05,6.2e-05,0.000135,0.00041,9e-05,6.8e-05,0.000161,0.000115,9.9e-05,9e-05,8.9e-05,7.5e-05,5.6e-05,1.5e-05,4.8e-05,6.3e-05,2.1e-05,0.000184,0.000109,4.6e-05,1.6e-05,0.000278,0.00065,0.000445,0.000173,4e-05,9.7e-05,6.2e-05,2.4e-05,5.2e-05,0.000222,0.000163,5.2e-05,1.5e-05
1.8e-05,3.9e-05,3e-05,3.1e-05,3.6e-05,2.3e-05,2.5e-05,4e-06,2.1e-05,5e-06,5e-06,6e-06,1.5e-05,6e-06,2.3e-05,2.4e-05,1.1e-05,3e-06,2.5e-05,0.000121,0.001715,0.000653,0.000468,4.1e-05,0.000143,5.8e-05,0.000159,0.000111,0.00016,0.001203,0.000822,0.000328,0.000185,0.000404,0.003486,0.00065,0.002072,0.002066,0.001947,0.000986,0.00141,0.001841,0.000537,0.001659,0.001328,0.000745,0.000489,0.001985,0.000633,0.000583,0.003969,0.004085,0.003383,0.002436,0.002424,0.001649,0.00093,0.003061,0.00141,0.003472,0.002163,0.000645,0.000482,0.000421,0.001332,0.00127,0.000792,0.000319,0.00074,0.000462,0.000144,0.000424,0.000285,0.000216,0.000308,0.000406,0.000141,0.000496,0.000426,0.000315,6.8e-05,0.000105,0.000155,0.000211,4.1e-05,0.000415,0.00034,0.000203,9.1e-05,9e-05,0.000577,0.000338,0.000119,0.000229,0.000152,0.000103,0.000105,0.000108,6.1e-05,2.7e-05,3.3e-05,3.5e-05,4e-05,6.1e-05,0.000127,0.000116,6e-05,4.6e-05,0.000387,0.000564,0.000189,5e-05,6.3e-05,4e-05,3.5e-05,3.6e-05,6e-05,7.9e-05,4.9e-05,3.8e-05,3e-05
1.5e-05,1.5e-05,1.2e-05,1.5e-05,7e-06,1.5e-05,7e-06,1.2e-05,1.2e-05,1.9e-05,3e-06,6e-06,7e-06,1.5e-05,1.9e-05,3e-06,8e-06,1.4e-05,1.3e-05,0.000131,0.001019,0.000303,0.000349,0.000221,2e-05,0.000127,0.000192,0.000106,0.000142,0.001382,0.001044,0.000612,0.000283,0.000717,0.001762,0.002794,0.001233,0.000809,0.00196,0.000759,0.001084,0.001655,0.001621,0.001672,0.000406,0.000984,0.001181,0.001545,0.001328,0.001626,0.002949,0.002029,0.001648,0.002777,0.002085,0.000234,0.001981,0.002475,0.001324,0.001589,0.000695,0.001123,0.001156,0.000784,0.001062,0.000232,0.000323,0.000118,0.000633,0.000157,0.000294,0.000232,0.000284,8.6e-05,0.000203,0.000141,0.000236,0.000535,0.000171,0.000141,0.000146,9.4e-05,0.000191,0.000229,0.000209,0.000432,0.000396,0.000116,0.000117,8.8e-05,0.000575,0.000358,0.000149,0.000231,0.000319,0.000156,0.000106,2.3e-05,7.6e-05,7.2e-05,7.1e-05,5.9e-05,4e-05,5.4e-05,0.000214,0.000165,6.4e-05,2.9e-05,0.000578,0.000569,0.000289,7.3e-05,2.1e-05,3.5e-05,3.6e-05,9.6e-05,4.2e-05,0.000105,9.3e-05,5.9e-05,3.8e-05
2e-05,1.3e-05,8e-06,1.7e-05,1e-05,4e-06,1e-06,1e-05,1.8e-05,1.3e-05,1.5e-05,3e-06,1e-05,9e-06,1e-05,1.8e-05,1.3e-05,1e-05,7e-06,0.000146,0.000793,0.000438,0.000372,0.000558,0.000268,0.00014,8.3e-05,0.000109,7.9e-05,0.000992,0.001025,0.000402,0.000208,0.000708,0.001746,0.002062,0.001747,0.000879,0.001469,0.002306,0.003176,0.001515,0.002079,0.001818,0.000877,0.000793,0.000467,0.000658,0.001966,0.000593,0.001683,0.002828,0.001585,0.002567,0.000891,0.000389,0.000951,0.001415,0.001335,0.001279,0.000572,0.000145,0.000831,0.000395,0.000208,0.000143,0.000486,0.000285,0.000686,0.000188,0.00013,0.000415,5.9e-05,6.1e-05,0.000101,8.4e-05,0.00018,0.000195,0.000123,2.9e-05,4.5e-05,0.000102,2e-04,7.2e-05,9.3e-05,0.000598,0.000296,7e-05,0.000115,0.000106,0.000312,8.2e-05,5.8e-05,0.000135,0.000246,9.2e-05,5.1e-05,4.9e-05,4.3e-05,5e-05,3.3e-05,4.3e-05,6.4e-05,3.5e-05,0.000199,6.9e-05,4e-05,2e-05,0.000593,0.000565,0.00024,5.1e-05,3e-05,2.3e-05,3.8e-05,9.5e-05,3.7e-05,0.000111,3.4e-05,3.5e-05,3e-05
1.2e-05,9e-06,2e-06,4e-06,3e-06,3e-06,2e-06,5e-06,6e-06,3e-06,2e-06,3e-06,4e-06,7e-06,4e-06,6e-06,3e-06,4e-06,4e-06,7.5e-05,0.000319,0.000258,0.000107,0.000335,0.000208,7.8e-05,4e-05,5.1e-05,8.8e-05,0.000207,0.000226,7.9e-05,5e-05,0.000284,0.00064,0.000219,0.000286,0.000692,0.000962,0.000342,0.000754,0.000809,0.000394,0.000536,0.000481,0.000264,0.00025,0.000431,0.000734,0.00041,0.000561,0.000124,0.000328,0.00075,0.000407,7.5e-05,0.000647,0.000314,0.000417,0.000148,0.000159,0.000153,0.000298,0.000128,0.000132,7e-05,0.000145,5.7e-05,0.000229,3.7e-05,9.4e-05,0.000109,4.9e-05,4.9e-05,8.1e-05,3.4e-05,5.2e-05,0.000107,7.2e-05,2.3e-05,2.6e-05,2.8e-05,3.9e-05,3.8e-05,3.6e-05,2e-04,8.6e-05,2.2e-05,1.7e-05,1.6e-05,7.8e-05,5.4e-05,6e-06,4.6e-05,8.9e-05,6.3e-05,1e-05,1.8e-05,3.3e-05,1.9e-05,1.6e-05,9e-06,3e-05,5.2e-05,3.4e-05,2.1e-05,1.7e-05,2.1e-05,0.000241,0.000165,9.7e-05,2.4e-05,1.1e-05,1.2e-05,1.3e-05,2.6e-05,2.6e-05,2.4e-05,4e-06,6e-06,3e-06
1e-05,6e-06,9e-06,6e-06,4e-06,2e-06,2e-06,1e-06,4e-06,1e-06,3e-06,2e-06,3e-06,4e-06,3e-06,5e-06,3e-06,1e-06,4e-06,6.4e-05,8.2e-05,1e-04,2.1e-05,0.000372,0.000153,5e-05,1.7e-05,4.1e-05,5.7e-05,4.1e-05,0.00023,5.4e-05,6.5e-05,0.000155,0.000555,0.000828,0.00049,0.000604,0.000221,8e-04,0.000314,0.000724,0.00025,0.000578,0.00066,0.000536,0.000184,0.000394,0.000327,0.00045,0.000237,0.00052,0.000132,0.000432,0.000505,0.000385,0.000576,0.000126,0.000375,0.000359,0.000345,5.3e-05,0.00017,6.5e-05,0.000123,6.9e-05,0.000123,2.3e-05,0.000246,9.9e-05,9.9e-05,7.7e-05,7.1e-05,1.1e-05,5.7e-05,5.8e-05,7.1e-05,6.9e-05,2.5e-05,3.6e-05,1.1e-05,2.8e-05,1.6e-05,2.3e-05,1.3e-05,0.000112,2.9e-05,3.9e-05,2.4e-05,2.5e-05,9.4e-05,5.7e-05,1.1e-05,6.8e-05,9.1e-05,3.9e-05,1.2e-05,2.4e-05,8e-06,1.7e-05,1.6e-05,1.3e-05,1.8e-05,3.6e-05,3.3e-05,1.9e-05,3e-06,1.8e-05,0.000226,0.000126,5.1e-05,1.4e-05,2e-05,1.7e-05,1.8e-05,1.9e-05,6e-06,1.2e-05,1.5e-05,7e-06,5e-06
6e-06,5e-06,7e-06,7e-06,0,2e-06,2e-06,3e-06,2e-06,3e-06,4e-06,3e-06,2e-06,5e-06,3e-06,5e-06,1e-06,3e-06,5e-06,6.3e-05,5.3e-05,0.000187,4.8e-05,0.000222,0.000106,3.5e-05,3.8e-05,9e-06,1e-05,7.5e-05,0.000255,0.000126,5.5e-05,0.000114,0.000238,0.000377,8e-05,0.000586,0.000656,0.000921,0.000476,0.000687,0.000718,0.000635,0.000187,0.000202,0.000233,0.000497,0.000395,6.5e-05,0.000468,0.000737,0.000469,0.000282,0.000276,0.000539,0.000523,0.000292,0.000251,0.000397,8.6e-05,2.8e-05,0.000108,7.2e-05,0.000111,6.3e-05,0.000137,7.8e-05,0.000202,1.1e-05,2.3e-05,9.1e-05,5.3e-05,2.2e-05,1.1e-05,2.1e-05,4.7e-05,1.9e-05,3.1e-05,2.1e-05,1.7e-05,2.6e-05,1.7e-05,2.3e-05,5e-06,5.8e-05,1.5e-05,2.3e-05,8e-06,1.4e-05,0.000101,5.8e-05,3e-05,7.5e-05,7.6e-05,2.8e-05,7e-06,1.2e-05,1.3e-05,7e-06,1.8e-05,1.1e-05,5e-06,5.1e-05,2.6e-05,1e-05,1.2e-05,1.4e-05,0.000214,9.2e-05,3.7e-05,1.4e-05,1.1e-05,5e-06,1.5e-05,1.3e-05,2e-06,8e-06,7e-06,4e-06,3e-06
2e-06,2e-06,2e-06,2e-06,4e-06,3e-06,1e-06,4e-06,2e-06,3e-06,1e-06,2e-06,4e-06,5e-06,2e-06,3e-06,5e-06,4e-06,2e-06,6.4e-05,5.7e-05,4.3e-05,0.000103,5e-05,4.6e-05,2.4e-05,2.8e-05,1.6e-05,4.5e-05,8.2e-05,0.000126,5.2e-05,5.7e-05,0.000131,0.000435,0.000356,0.000348,0.000715,0.000226,0.000604,0.000631,0.000876,0.001124,0.00056,9e-05,0.000241,0.000265,0.000137,0.000335,0.000125,6e-04,0.000163,0.00012,0.000289,0.000161,9.3e-05,0.000411,0.000635,0.000528,0.000514,0.000276,0.000183,0.000123,1.7e-05,0.000105,4.9e-05,0.000126,4.3e-05,0.000186,8e-05,5.3e-05,9.8e-05,6.6e-05,6e-06,3.1e-05,2.2e-05,6.6e-05,7.2e-05,2.1e-05,2.1e-05,3e-06,2.6e-05,5e-06,1e-05,2.6e-05,4.6e-05,6e-06,3.4e-05,2.5e-05,2.9e-05,5.6e-05,4e-05,1.6e-05,7.8e-05,6.3e-05,4.1e-05,1.3e-05,5e-06,3e-05,3.1e-05,1.2e-05,1.6e-05,2.7e-05,7.6e-05,3.9e-05,1.9e-05,1.6e-05,1e-05,0.000224,9.8e-05,3.9e-05,1.2e-05,3e-05,7e-06,1.4e-05,5e-06,1.6e-05,2.8e-05,1.5e-05,5e-06,1e-06
4e-06,4e-06,3e-06,4e-06,2e-06,2e-06,1e-06,2e-06,6e-06,2e-06,4e-06,2e-06,3e-06,5e-06,2e-06,2e-06,3e-06,1e-06,1e-06,6.3e-05,0.000163,0.00017,7.4e-05,0.000153,7.7e-05,5.9e-05,4e-05,2.3e-05,3.9e-05,6.1e-05,0.000119,5.3e-05,6.1e-05,0.00018,0.000645,0.000825,0.000548,0.000373,0.000248,0.000216,0.000291,0.000383,0.000159,0.00028,0.000242,0.000321,0.000163,0.00016,0.00044,0.000271,0.000147,0.000447,0.000365,0.000279,0.000514,0.000371,0.000139,4e-04,0.00035,0.000356,0.00026,0.000122,0.00014,5.9e-05,4.4e-05,4.3e-05,8e-05,5e-05,0.000113,8.5e-05,8.6e-05,7.7e-05,3.4e-05,1.5e-05,3.7e-05,2.6e-05,6.3e-05,3.1e-05,1.5e-05,1.4e-05,2e-06,1.5e-05,9e-06,2e-06,4.5e-05,5.7e-05,1.9e-05,2.1e-05,3.6e-05,1.1e-05,2.6e-05,2.9e-05,8e-06,7.6e-05,5.9e-05,1.6e-05,1.3e-05,1.5e-05,4.5e-05,2.7e-05,1.4e-05,9e-06,2.1e-05,5.7e-05,1.5e-05,3e-06,1.3e-05,1.5e-05,0.000208,0.000139,7.8e-05,2.3e-05,1e-05,1.4e-05,9e-06,5e-06,1.2e-05,3.8e-05,1.4e-05,9e-06,3e-06
5e-06,3e-06,2e-06,4e-06,4e-06,0,5e-06,4e-06,2e-06,3e-06,4e-06,3e-06,2e-06,4e-06,1e-06,2e-06,1e-06,1e-06,2e-06,5.5e-05,0.000183,8.5e-05,2.8e-05,0.000139,7.1e-05,3.1e-05,2.5e-05,2.4e-05,1.7e-05,0.000148,0.00019,9.1e-05,1.2e-05,0.000203,0.000455,0.000663,1.7e-05,0.000338,0.000411,0.000192,0.000278,3e-04,4e-04,0.00033,0.000194,0.000124,0.000132,0.000322,0.000389,0.000518,0.000162,0.00025,7.4e-05,0.000131,0.000439,0.000196,0.000254,0.00022,0.00045,0.000259,0.000154,0.000166,0.000248,6.2e-05,0.00012,0.00012,6.1e-05,5.8e-05,0.000169,6.7e-05,7.3e-05,2.5e-05,4.7e-05,2.3e-05,2.6e-05,2.6e-05,4.6e-05,1.9e-05,1.2e-05,1.1e-05,6e-06,7e-06,2.7e-05,2.6e-05,1.2e-05,4.3e-05,2.3e-05,2.2e-05,2.2e-05,1.7e-05,1.4e-05,1.2e-05,7e-06,7.1e-05,3.9e-05,3.1e-05,2.1e-05,7e-06,2.6e-05,7e-06,1.3e-05,3e-06,1e-05,7e-05,2.5e-05,5e-06,1e-05,1.5e-05,0.000166,8.9e-05,4.7e-05,7e-06,8e-06,1.1e-05,8e-06,1.2e-05,3e-06,3.1e-05,1.1e-05,6e-06,7e-06
4e-06,6e-06,4e-06,2e-06,2e-06,3e-06,5e-06,4e-06,3e-06,2e-06,1e-06,1e-06,3e-06,2e-06,2e-06,3e-06,3e-06,2e-06,5e-06,5.5e-05,0.00027,0.000121,2.7e-05,0.000144,8.6e-05,4.5e-05,2.2e-05,1.5e-05,1.4e-05,0.000189,1.8e-05,4.8e-05,8e-06,0.000127,0.000518,0.000103,0.000503,0.000481,0.000372,0.000234,0.000313,0.000315,0.000343,0.000381,0.000174,0.000145,0.000169,0.000262,0.000448,0.000309,0.000123,0.000216,0.000306,0.000162,0.000289,0.00013,0.000296,0.000218,0.000179,0.000414,0.000487,9.3e-05,0.000205,0.000129,0.00021,9e-05,9.5e-05,1.4e-05,0.00011,1.3e-05,8.3e-05,8.3e-05,1.8e-05,1.6e-05,3.9e-05,9e-06,3.5e-05,4.8e-05,4e-06,1.4e-05,1.9e-05,1.3e-05,3.5e-05,1.7e-05,2.7e-05,7.4e-05,2.2e-05,1.8e-05,2.1e-05,7e-06,3.2e-05,3.4e-05,1.6e-05,7.2e-05,2.6e-05,1.3e-05,1.7e-05,9e-06,7e-06,1.1e-05,1.6e-05,1.8e-05,5e-06,5.9e-05,1.2e-05,5e-06,1.1e-05,5e-06,0.00015,9.5e-05,3.9e-05,1.5e-05,5e-06,3e-06,1.5e-05,3e-06,6e-06,1.1e-05,7e-06,3e-06,5e-06
2e-06,9e-06,1.1e-05,2e-06,1e-06,5e-06,4e-06,3e-06,2e-06,2e-06,3e-06,3e-06,3e-06,5e-06,5e-06,3e-06,6e-06,6e-06,5e-06,5.1e-05,0.000295,7.4e-05,8.4e-05,0.000254,8.1e-05,5.5e-05,2.2e-05,2.4e-05,5.1e-05,0.000152,6.3e-05,6e-05,1.8e-05,0.000126,0.000611,0.000484,0.000585,0.000382,0.000417,0.000406,0.00042,0.000595,7.3e-05,0.000352,8.6e-05,0.000123,0.00015,0.000177,0.000188,0.000256,0.000186,0.000265,7.7e-05,8.2e-05,0.000158,0.000317,0.000151,0.000313,6.6e-05,0.000515,0.000167,0.000245,3.9e-05,0.00011,0.000302,0.000187,5.8e-05,7.3e-05,0.000154,1e-04,0.000123,8.9e-05,5e-06,5.4e-05,6.5e-05,4.7e-05,4.3e-05,5.3e-05,1.5e-05,3.1e-05,1.1e-05,4.7e-05,3.6e-05,4e-05,3.8e-05,7.8e-05,1.7e-05,1.3e-05,1e-06,3.2e-05,8.4e-05,3.2e-05,2.4e-05,5.2e-05,3.2e-05,2.1e-05,3e-05,1.8e-05,2.1e-05,3.6e-05,3.8e-05,3.8e-05,2.3e-05,5.5e-05,7.7e-05,4.5e-05,1.4e-05,5e-06,0.000135,0.000116,5.7e-05,2.2e-05,6e-06,5e-06,3e-06,1.2e-05,1e-06,5e-06,1.2e-05,6e-06,1e-05
2e-06,1.3e-05,8e-06,8e-06,5e-06,5e-06,1.1e-05,9e-06,5e-06,4e-06,8e-06,5e-06,7e-06,2e-06,3e-06,4e-06,6e-06,4e-06,7e-06,4.8e-05,0.000255,0.000141,3.2e-05,0.000182,0.000112,3e-05,2.1e-05,2.5e-05,3.7e-05,7.7e-05,8.1e-05,3.6e-05,1.5e-05,0.000192,0.000422,0.000611,0.000322,0.000496,0.000402,0.000527,0.000926,0.00035,0.000157,0.000123,0.000156,0.000166,0.000146,0.000201,0.00028,0.000273,3e-04,0.00019,0.000181,0.000151,0.000304,0.000112,0.000272,0.000219,0.000413,0.000143,0.00024,6.3e-05,0.000206,0.000163,8.6e-05,2.9e-05,0.000147,0.00012,0.000235,0.000137,0.000106,0.000102,7e-05,3e-05,1.6e-05,5.8e-05,3.5e-05,4.7e-05,6.9e-05,2.1e-05,3.8e-05,4.3e-05,7.2e-05,6e-05,4.7e-05,1e-05,5.1e-05,5.4e-05,1.1e-05,3.2e-05,5.9e-05,3.3e-05,2.5e-05,6e-05,4.1e-05,3.4e-05,1.7e-05,2e-05,1.8e-05,2e-05,8e-06,2.4e-05,1.4e-05,4e-05,7.9e-05,3.7e-05,1.4e-05,1.3e-05,0.000114,8.8e-05,4.9e-05,1.9e-05,9e-06,9e-06,3e-06,1.1e-05,1.4e-05,9e-06,1.7e-05,9e-06,1.4e-05
3e-06,9e-06,7e-06,9e-06,4e-06,8e-06,1e-05,0,2e-06,2e-06,5e-06,3e-06,2e-06,3e-06,1e-06,3e-06,4e-06,4e-06,4e-06,4.2e-05,0.000267,0.00014,6.8e-05,9.5e-05,5.9e-05,3.4e-05,2.6e-05,2e-05,2.6e-05,1.7e-05,1.9e-05,2.4e-05,1.7e-05,0.000198,0.000257,0.000504,0.000259,0.000121,0.000115,0.000206,0.000678,0.000554,0.000509,0.000315,7.1e-05,0.000109,6.5e-05,0.000201,0.000258,0.000259,0.000248,0.000427,0.000138,0.000161,0.000241,0.000192,0.000228,0.000214,0.000195,3.2e-05,7.5e-05,0.000237,0.000256,0.000159,0.000121,8.4e-05,7.7e-05,4e-05,0.000133,0.000159,0.000172,0.000123,7.5e-05,4.3e-05,2.4e-05,3.4e-05,6.1e-05,2.9e-05,4.9e-05,3.7e-05,2.7e-05,5.5e-05,4.8e-05,5.4e-05,6.3e-05,1.1e-05,5.1e-05,1.6e-05,2e-05,2.2e-05,4e-05,3.3e-05,1.3e-05,6e-05,4.9e-05,3e-05,1e-05,1.7e-05,2.2e-05,2.6e-05,1.4e-05,1.7e-05,1.4e-05,2.4e-05,2.5e-05,1.1e-05,7e-06,1.5e-05,9.3e-05,6e-05,3.4e-05,1.1e-05,1.2e-05,2.4e-05,2.2e-05,1e-05,6e-06,1e-05,1.6e-05,1e-06,1.3e-05
5e-06,4e-06,4e-06,6e-06,5e-06,8e-06,4e-06,2e-06,3e-06,5e-06,1e-06,4e-06,4e-06,3e-06,2e-06,3e-06,2e-06,4e-06,1e-06,4.4e-05,0.00022,8.4e-05,3.3e-05,0.00017,7.6e-05,3.1e-05,6e-05,2.1e-05,4e-06,2.4e-05,7.9e-05,4e-05,2.2e-05,0.000125,0.000108,0.000383,0.000301,0.000373,0.000166,0.000255,0.000289,0.000301,0.000384,6e-05,0.000191,0.000196,0.000159,0.000146,0.000274,0.000241,0.00013,0.000121,0.000168,0.000234,0.000416,0.000127,0.000118,6.2e-05,0.000177,0.000138,6e-06,0.000195,0.000112,1e-04,8.6e-05,0.000205,0.000167,0.000155,0.000157,0.00013,0.000133,7e-06,8.6e-05,6e-05,9.4e-05,8.4e-05,6e-05,2.8e-05,2e-05,2e-06,5e-05,5.6e-05,3.7e-05,6.2e-05,2.7e-05,6e-05,3.4e-05,3.3e-05,2.3e-05,1.5e-05,2.6e-05,3.2e-05,7e-06,4.8e-05,6.2e-05,2.4e-05,4e-06,7e-06,3e-05,2.2e-05,5e-06,1.4e-05,4e-06,1.6e-05,1.9e-05,5e-06,9e-06,9e-06,7.3e-05,4.1e-05,2.1e-05,7e-06,8e-06,8e-06,1.4e-05,1.3e-05,5e-06,1.6e-05,1.4e-05,1.2e-05,1.7e-05
4e-06,4e-06,5e-06,1e-06,2e-06,3e-06,4e-06,2e-06,1e-06,3e-06,1e-06,3e-06,1e-06,2e-06,1e-06,3e-06,2e-06,3e-06,5e-06,4.4e-05,0.000171,0.000129,5e-05,0.000154,5.7e-05,1.8e-05,7.3e-05,3.4e-05,2.6e-05,4.1e-05,8.4e-05,9e-06,1.8e-05,0.000118,0.00039,0.000257,2.6e-05,0.000487,0.000243,0.000564,0.000219,0.000365,0.000352,0.000236,0.000158,0.000191,8.8e-05,5.1e-05,0.000111,0.000286,5.5e-05,9.6e-05,0.000127,0.000353,0.000518,0.000358,0.000196,8.2e-05,0.000299,0.000179,0.000131,0.00017,0.000136,3.4e-05,0.000159,7.3e-05,0.000143,4.3e-05,0.000125,0.000124,5.2e-05,5.9e-05,4.1e-05,6.9e-05,7.1e-05,6.6e-05,4.2e-05,2.8e-05,3.5e-05,1.8e-05,5.6e-05,3.4e-05,3.6e-05,4.1e-05,6.2e-05,0.000123,5.2e-05,1.6e-05,1.5e-05,2.3e-05,5e-05,4.1e-05,2.5e-05,2.7e-05,6.9e-05,4.2e-05,1.4e-05,9e-06,8e-06,2e-05,1.6e-05,8e-06,3e-06,8e-06,1.6e-05,8e-06,1e-05,1.3e-05,5.7e-05,2.6e-05,1e-05,7e-06,1.5e-05,8e-06,6e-06,1.7e-05,2.1e-05,2.2e-05,1.2e-05,6e-06,1e-05
0,2e-06,2e-06,2e-06,3e-06,4e-06,6e-06,4e-06,2e-06,5e-06,2e-06,3e-06,4e-06,4e-06,2e-06,1e-06,3e-06,4e-06,7e-06,4.8e-05,0.000203,0.000171,0.000117,4.3e-05,7.8e-05,1e-05,5.7e-05,3.5e-05,2.1e-05,0.000105,5.3e-05,2.4e-05,1.2e-05,0.000141,0.000462,0.000227,6.9e-05,0.000154,0.000175,0.000371,0.000608,0.00039,0.000172,0.000149,6.6e-05,0.000124,0.000117,0.000143,0.000284,0.000199,0.000113,0.000126,4.9e-05,0.000251,0.000209,0.000247,0.000177,0.000172,0.000277,0.000211,0.000166,7.8e-05,0.000117,4.7e-05,0.000156,6.8e-05,9.9e-05,0.00014,7.8e-05,3.9e-05,3e-05,3e-05,6.8e-05,3.7e-05,3.6e-05,1.9e-05,1.1e-05,2.4e-05,2.8e-05,1.7e-05,3.9e-05,1.8e-05,2.5e-05,4.5e-05,1.1e-05,6e-05,3.3e-05,2.4e-05,4.7e-05,2e-05,4.9e-05,1.8e-05,2.1e-05,2.6e-05,7.3e-05,3.5e-05,2.1e-05,9e-06,9e-06,1e-06,2e-05,2.3e-05,1.8e-05,1.2e-05,3e-06,8e-06,8e-06,1.4e-05,4.7e-05,6e-06,1.3e-05,1.5e-05,1.4e-05,2.3e-05,2.5e-05,1.1e-05,1.4e-05,2.5e-05,2.4e-05,8e-06,2e-06
1e-06,3e-06,3e-06,1e-06,2e-06,3e-06,6e-06,4e-06,1e-06,4e-06,2e-06,2e-06,2e-06,1e-06,1e-06,2e-06,2e-06,2e-06,4e-06,4.7e-05,9.6e-05,0.000274,9.8e-05,8.8e-05,2.7e-05,1.9e-05,5.3e-05,4.7e-05,4e-05,9.9e-05,5.3e-05,3.9e-05,3.3e-05,0.00016,0.000251,0.000223,0.000139,0.000546,0.000278,0.000149,0.000195,0.000401,0.000223,0.000162,1.5e-05,0.000125,0.000128,0.000141,0.000251,0.000174,0.000105,9.3e-05,0.000159,0.000263,0.000159,5e-04,0.00032,8.1e-05,0.000112,0.000312,9.2e-05,0.000179,1.8e-05,7.2e-05,0.000146,0.000101,7.1e-05,9.1e-05,6.7e-05,3.8e-05,0.000117,7.7e-05,5.3e-05,5.9e-05,4.5e-05,1.4e-05,1.5e-05,1.5e-05,6e-06,1.1e-05,9e-06,2.3e-05,1.4e-05,1.1e-05,1.3e-05,2.8e-05,2.5e-05,3.2e-05,2.1e-05,2.7e-05,3.9e-05,6.3e-05,1.5e-05,3.8e-05,6.9e-05,4.5e-05,2.5e-05,1e-05,2.6e-05,2.2e-05,2e-05,6e-06,6e-06,9e-06,4e-06,1.1e-05,1e-05,1.1e-05,1e-05,2.2e-05,7e-06,3.3e-05,1.5e-05,1.3e-05,1.3e-05,2.2e-05,1.5e-05,2.9e-05,2.6e-05,1.8e-05,8e-06
1e-06,3e-06,3e-06,1e-06,3e-06,0,2e-06,2e-06,3e-06,4e-06,3e-06,1e-06,2e-06,2e-06,2e-06,2e-06,1e-06,1e-06,2e-06,4.6e-05,8.2e-05,0.000152,8.2e-05,0.000131,4.5e-05,3.8e-05,4e-05,2.1e-05,1.2e-05,0.000139,0.000222,7.9e-05,4.8e-05,0.000113,0.00032,0.000151,0.000196,0.000725,0.000203,0.000168,0.000361,0.000254,0.000351,0.000418,0.000251,6.8e-05,2.6e-05,0.000179,0.000189,0.000219,0.000149,0.000109,0.000108,0.000251,8.5e-05,0.000344,0.000242,8.8e-05,0.00033,0.000478,9.6e-05,0.000358,0.000244,0.000103,0.000206,0.00038,0.00028,7e-05,0.000124,0.000104,0.000109,0.000144,7e-05,0.000123,2.7e-05,5.3e-05,4e-05,1.4e-05,3.1e-05,3.2e-05,2.7e-05,4.4e-05,3.2e-05,1.7e-05,1.2e-05,3.9e-05,3e-05,1.5e-05,2.1e-05,1.7e-05,7.5e-05,8e-06,3.2e-05,4.1e-05,3.4e-05,6e-06,2.9e-05,1.8e-05,1.8e-05,5e-06,7e-06,8e-06,8e-06,1.6e-05,1.4e-05,7e-06,7e-06,8e-06,1.3e-05,1.6e-05,1e-05,3.2e-05,8e-06,6e-06,1.6e-05,7e-06,1.3e-05,2.2e-05,4e-06,4e-06,6e-06
1e-06,3e-06,3e-06,2e-06,3e-06,2e-06,5e-06,3e-06,1e-06,2e-06,4e-06,1e-06,2e-06,2e-06,1e-06,2e-06,1e-06,1e-06,2e-06,4.3e-05,0.000165,0.000182,0.000113,0.000117,9.6e-05,3.8e-05,2.1e-05,2.6e-05,2.2e-05,0.000144,0.000188,9.9e-05,4.3e-05,0.00013,0.000382,0.000214,0.000116,0.000385,0.000457,0.000297,0.000498,0.000252,0.00032,0.000411,0.000237,0.00025,0.000148,0.000204,0.000142,0.000143,0.000155,9.7e-05,5.9e-05,0.000165,0.000256,0.000296,0.000403,0.000121,0.00022,0.000302,0.000195,0.000434,0.000281,0.00021,0.000186,0.000187,7.6e-05,5.1e-05,2e-05,0.000139,0.000201,9.3e-05,0.000108,0.000111,8.8e-05,5.3e-05,2.9e-05,1.3e-05,2.7e-05,7.4e-05,4.1e-05,4e-05,1.9e-05,4.4e-05,5.7e-05,4.6e-05,2.3e-05,1.9e-05,1.6e-05,1.6e-05,9.5e-05,8.4e-05,7.1e-05,3.3e-05,2e-05,2.3e-05,2e-06,9e-06,1.4e-05,8e-06,1.2e-05,1e-05,3e-06,1.8e-05,3.6e-05,2.8e-05,9e-06,2e-06,1.5e-05,1.8e-05,1.6e-05,2.5e-05,2.5e-05,1.7e-05,1.8e-05,2.5e-05,1.5e-05,3.2e-05,1.9e-05,1e-05,3e-06
2e-06,1e-06,2e-06,1e-06,1e-06,0,4e-06,2e-06,3e-06,2e-06,2e-06,1e-06,1e-06,2e-06,1e-06,1e-06,2e-06,1e-06,2e-06,4.1e-05,0.000126,0.000263,0.000142,4.3e-05,5e-05,3.7e-05,3.9e-05,9e-06,1.5e-05,0.000123,4.8e-05,2.2e-05,4e-06,0.000136,0.000267,0.000408,0.000254,0.000124,0.000347,0.000206,0.000597,0.00032,0.000169,0.000208,0.000178,4.4e-05,8.3e-05,0.000141,0.000256,0.000254,0.000138,0.000175,0.000113,9.6e-05,0.000157,0.000144,6.6e-05,0.000236,0.000248,0.000239,3.3e-05,0.000239,0.000128,0.000144,0.000119,0.000198,0.000196,0.000123,0.000163,9.4e-05,1.8e-05,4.1e-05,5.2e-05,5e-05,3.2e-05,1.7e-05,1.1e-05,2.9e-05,1.8e-05,3.1e-05,5e-06,9e-06,2.1e-05,3.3e-05,1.2e-05,3.7e-05,7e-06,6e-06,7e-06,8e-06,6.9e-05,1.7e-05,2.3e-05,2.3e-05,2.1e-05,1e-05,7e-06,8e-06,1.9e-05,1.2e-05,8e-06,4e-06,4e-06,1.7e-05,2e-05,9e-06,9e-06,5e-06,1.4e-05,2.2e-05,1e-05,8e-06,8e-06,1.2e-05,6e-06,1.2e-05,6e-06,1.8e-05,5e-06,3e-06,5e-06
2e-06,1e-06,2e-06,1e-06,1e-06,0,4e-06,1e-06,0,2e-06,2e-06,0,2e-06,2e-06,1e-06,2e-06,1e-06,1e-06,1e-06,4.1e-05,8.6e-05,0.000176,4.7e-05,1.6e-05,8e-06,1.9e-05,2.6e-05,5e-06,9e-06,8.9e-05,8.6e-05,1.5e-05,1.4e-05,0.000109,0.000241,3e-04,0.000351,0.000211,0.000201,7.8e-05,0.000476,0.000362,0.000448,0.000376,0.000121,0.000153,6.1e-05,4.6e-05,0.000152,0.000338,7.6e-05,0.000162,6.4e-05,0.00012,0.000162,5e-06,0.00022,7.3e-05,0.000128,0.000121,1e-04,4.7e-05,4e-05,6.3e-05,2.6e-05,5.8e-05,6.5e-05,4.8e-05,0.000134,2.2e-05,6.5e-05,4e-05,1.7e-05,1.4e-05,7e-06,2.2e-05,2.3e-05,1.7e-05,1.3e-05,2e-05,3e-06,2.2e-05,8e-06,1.1e-05,1.8e-05,3.6e-05,8e-06,2e-06,7e-06,4e-06,3e-05,2.4e-05,4e-06,7e-06,1e-05,7e-06,3e-06,3e-06,1.9e-05,2e-06,8e-06,6e-06,6e-06,6e-06,1.3e-05,4e-06,3e-06,1e-06,8e-06,1.9e-05,1.5e-05,9e-06,1.1e-05,4e-06,3e-06,5e-06,3e-06,1.1e-05,5e-06,1e-06,1e-06
2e-06,1e-06,1e-06,0,0,1e-06,3e-06,1e-06,1e-06,2e-06,2e-06,0,2e-06,2e-06,1e-06,1e-06,1e-06,1e-06,2e-06,4e-05,9.1e-05,6e-06,2.8e-05,8e-06,4e-06,2.2e-05,2.2e-05,3e-06,1.1e-05,6e-05,3.8e-05,8e-06,6e-06,7.9e-05,0.000152,0.000174,0.000174,0.000195,3.7e-05,9.1e-05,0.000447,0.000246,0.000273,0.000167,3.4e-05,7.1e-05,6.1e-05,2.7e-05,0.000253,0.000384,8.4e-05,0.000136,7.3e-05,0.000185,0.000196,0.000102,0.000172,5.7e-05,0.000165,0.000189,0.000114,6.7e-05,1.1e-05,5.2e-05,2.7e-05,2.2e-05,3.8e-05,2.1e-05,0.000112,9e-06,3.9e-05,3.3e-05,2.2e-05,6e-06,1e-05,1.5e-05,2e-05,1.9e-05,1.1e-05,1.6e-05,3e-06,1.8e-05,4e-06,5e-06,1.4e-05,2.6e-05,3e-06,4e-06,5e-06,4e-06,1e-05,6e-06,6e-06,8e-06,4e-06,5e-06,5e-06,4e-06,1.4e-05,3e-06,5e-06,3e-06,4e-06,4e-06,1.2e-05,3e-06,4e-06,2e-06,5e-06,1.1e-05,6e-06,6e-06,7e-06,3e-06,2e-06,4e-06,5e-06,1e-05,3e-06,2e-06,2e-06
1e-06,0,1e-06,0,0,0,3e-06,1e-06,1e-06,2e-06,2e-06,0,1e-06,2e-06,1e-06,1e-06,1e-06,1e-06,1e-06,4e-05,6.7e-05,9.8e-05,1e-05,1.5e-05,5e-06,1.4e-05,2.3e-05,2e-06,1e-05,3.3e-05,5.1e-05,3e-06,6e-06,7.4e-05,6.7e-05,0.000203,8.5e-05,5.9e-05,5.9e-05,2.2e-05,0.000353,0.000302,0.000248,0.000166,3.6e-05,8.2e-05,5.6e-05,2.4e-05,0.00022,0.000264,2.4e-05,0.000124,4.7e-05,0.000115,0.000186,8.3e-05,0.000178,3.5e-05,0.000151,0.000204,4.4e-05,2.1e-05,1.3e-05,4.3e-05,2.7e-05,1.5e-05,2.7e-05,3e-05,0.000117,8e-06,3.6e-05,3.3e-05,2.5e-05,1e-06,1.5e-05,1.5e-05,1.8e-05,1.8e-05,1e-05,1.7e-05,3e-06,1.6e-05,5e-06,6e-06,1e-05,3e-05,1.1e-05,8e-06,4e-06,2e-06,1e-05,7e-06,2e-06,8e-06,5e-06,2e-06,3e-06,2e-06,1.5e-05,2e-06,4e-06,3e-06,1e-06,1e-06,1e-05,1e-06,2e-06,1e-06,5e-06,6e-06,2e-06,2e-06,2e-06,2e-06,1e-06,3e-06,3e-06,1e-05,2e-06,1e-06,1e-06
