-0.000314,-0.000304,-0.000516,-0.000219,-0.000251,-0.000273,-0.00011,-0.000186,-0.000522,-0.000505,-0.000219,-0.000332,-0.000296,5.2e-05,-0.000773,-0.000446,-0.000241,-0.000351,-0.000286,-0.000121,-0.000268,-0.00039,-0.000243,-0.000439,-0.000611,-0.000782,-0.000453,-0.000352,-7.7e-05,-0.000234,-0.000218,-0.000729,-0.00038,-0.000434,-0.000758,-0.00064,-0.000355,-0.000414,-0.000521,-0.000651,-3e-05,-0.000524,-0.000668,-0.000881,-0.00066,-0.000783,-0.000596,-0.000768,-0.000186,-0.000683,-0.000729,-0.00069,-9.7e-05,-0.000253,-0.000534,-0.000597,-0.000335,-0.000609,-0.000677,-0.000729,-0.000679,-0.000762,-0.000478,-0.00052,-0.000702,-0.001064,-0.000661,-0.000147,-0.000273,-0.000826,-0.000763,-0.000451,-0.000488,-0.00028,-0.000432,-0.000176,-0.00039,-0.00054,-0.000706,-0.000426,-0.000316,-0.000646,-0.00125,-0.000682,-0.000649,-0.000818,-0.000435,-0.000702,-0.001058,-0.000518,-0.001077,-0.001099,-0.000516,-4.1e-05,-0.001012,-0.00076,-0.000729,-0.000501,-0.000714,-0.000392,-0.001003,-0.000696,-0.000621,-0.000952,-0.000843,-0.000582,-0.000609,-0.000646,-0.000521,-0.00073,-0.000594,-0.001348,-0.001022,-0.000908,-0.000978,-0.00083,-0.000445,-0.000413,-0.000527,-0.000254,-0.000847
-0.000214,-0.000169,-1.8e-05,-0.000313,-0.000305,1.8e-05,-0.000389,-3.9e-05,-6.7e-05,0.000275,0.000169,1.1e-05,-9.1e-05,-0.000275,0.000155,-0.000216,-0.000144,-0.000288,-0.000271,5.9e-05,0.000131,-5.3e-05,-0.000141,-3.8e-05,-0.000147,0.000308,-0.000212,-0.000192,6.4e-05,-0.000118,-0.000453,2.8e-05,-0.000403,5e-06,0.000292,4e-04,0.000205,0.00032,-4.4e-05,-0.000494,-0.000982,-0.000178,8.4e-05,0.000351,4e-05,-0.000164,-6.2e-05,-5.1e-05,-0.00028,-0.000238,6.4e-05,-3.2e-05,-0.000174,-0.000187,-0.000185,0.000185,-0.000574,-0.000839,-0.000288,4.1e-05,3.8e-05,0.00027,-5.7e-05,-0.000364,-0.000145,-0.000293,-0.00019,-0.000507,-0.000445,-8.7e-05,0.000438,-2e-06,3e-05,-0.000383,7.3e-05,1.7e-05,-0.000326,-0.000218,-0.000468,-0.000162,1.5e-05,0.000278,0.000282,7.9e-05,-0.000278,-0.000205,-0.000549,-5.6e-05,0.000219,-0.000245,-0.000145,9.7e-05,0.000154,-0.000679,-0.000897,-0.000763,-0.000206,-0.000208,-0.000159,-0.000186,-0.00013,0.000347,-0.000104,-0.000499,-0.000834,-0.000414,-3.5e-05,-3.7e-05,0.000347,-0.00053,-0.000305,5.8e-05,2.1e-05,0.00039,0.000187,-2.8e-05,-0.000181,-0.000143,0.00014,-8.8e-05,-9.8e-05
0.000101,0.00015,0.000107,0.000166,7.3e-05,-0.000107,-0.000158,-6.2e-05,-6.8e-05,-0.000113,-0.000465,-9.6e-05,-2.4e-05,-0.000105,-0.000312,1.3e-05,0.000168,0.000368,-4e-05,-0.000316,-9.4e-05,0.000121,-3.4e-05,-0.000148,0.00018,1.2e-05,5.8e-05,0.000138,2.5e-05,-0.000137,-9.1e-05,0.000144,8.1e-05,1.2e-05,0.000136,8.3e-05,-1.1e-05,-0.000323,-0.000243,0.000461,0.000449,-0.000127,-0.000243,-9.4e-05,8.3e-05,0.000569,-0.000149,0.000134,0.000108,0.00027,0.000184,-0.000489,-0.000744,-0.000314,-4.8e-05,-0.000162,8.2e-05,0.000571,0.00042,8.3e-05,0.000251,-0.000306,-9.9e-05,0.000431,0.000252,0.000134,0.000339,-0.00031,6.7e-05,0.000228,3.9e-05,-0.000215,-0.000143,1e-05,0.000509,-5.2e-05,0.000545,-4e-05,-3.1e-05,-1e-06,8e-06,-9.1e-05,0.000431,0.000455,0.00016,0.000468,0.000405,0.00045,1.6e-05,4.6e-05,-0.000224,0.00011,-8.3e-05,-0.000362,0.00052,0.000478,-0.000174,-0.000149,-7.6e-05,-5.7e-05,0.000105,-0.000273,-0.000177,0.000471,0.000426,0.000277,9.4e-05,6e-06,-0.000467,0.000481,-9.9e-05,-0.000238,-4.5e-05,-6.7e-05,-0.000161,-4e-05,2.1e-05,-0.000281,-0.00022,-6e-05,-0.000109
-8.7e-05,-0.00012,-0.000205,-1.4e-05,0.000137,0.000185,0.000206,9.2e-05,0.000155,-0.000131,-1.1e-05,-0.000119,-0.000183,-0.000106,-2.7e-05,4e-06,-9.5e-05,-0.000249,1e-04,0.000123,-7.9e-05,-0.000218,-0.000177,4.2e-05,-7.1e-05,-0.000263,-0.000178,-2.7e-05,4.1e-05,-0.00045,-0.000322,-0.000291,-0.00016,-6.8e-05,-0.000102,-0.000177,-0.000246,-6.9e-05,6.8e-05,-0.000172,-0.000255,7.4e-05,-0.000225,-0.000214,-0.000455,-0.000544,-2e-06,-0.000201,0.000112,-0.000136,-0.000244,0.000109,0.000177,4.7e-05,5.2e-05,4.8e-05,6.1e-05,-0.000366,-0.000265,-0.000262,-0.000423,0.000395,4e-05,-0.000297,-0.000188,-7e-06,-0.000424,-1e-04,-0.000126,-0.000259,-0.000467,7.1e-05,-1e-04,-5.3e-05,-0.000594,8.6e-05,-0.000299,-0.000382,4e-05,0.000179,-4.5e-05,-0.000192,-0.000287,-0.000364,-0.000683,-0.000449,-0.000907,-0.000735,-0.000224,-0.000392,0.000552,-0.000357,-0.000395,-0.000234,-0.000399,0.000197,0.00029,0.00028,8.9e-05,-0.00018,3.1e-05,0.00044,0.000181,4e-05,-0.000188,-0.000114,4e-05,-0.000188,-0.000176,-3.6e-05,-0.000358,0.000129,-0.000222,-3.2e-05,-9e-05,-6.7e-05,-0.000286,-0.000382,3.7e-05,-0.000296,-9.3e-05
0.000155,7.2e-05,5.1e-05,-8e-05,-0.000209,2.2e-05,-2.5e-05,9e-06,8.1e-05,8.1e-05,-3.8e-05,4.6e-05,0.000105,0.000104,0.000121,-2.3e-05,-0.000124,-9.3e-05,0.000129,0,-3.7e-05,3.2e-05,0.000264,0.000134,-2e-05,0.000333,7.1e-05,-0.000179,-4.1e-05,0.000196,0.000467,0.000433,0.000139,1.8e-05,-1.2e-05,0.000241,7e-05,-4.5e-05,7.6e-05,5.8e-05,-0.000141,-0.000131,0.000239,0.000589,0.000196,0.000154,3.5e-05,0.000277,-0.000143,2e-06,0.000111,3e-06,0.000151,-2e-06,-7.5e-05,-5.6e-05,9.5e-05,-7.5e-05,-4.8e-05,0.000326,0.000392,-7e-05,0.000231,-1e-05,0.000176,-0.000143,0.000229,0.000142,0.000153,0.000264,0.000424,-0.000223,-0.000195,-3.3e-05,0.000384,0.000188,1e-06,0.000392,2.9e-05,0.000119,0,6e-05,0.000121,0.000414,0.000407,9.4e-05,0.000242,0.000228,-6e-05,0.000136,-0.000331,0.000488,0.000494,0.000204,-5.4e-05,-0.00024,-0.00035,-9.1e-05,0.000266,7.5e-05,4.2e-05,-0.000217,-4e-06,-4.9e-05,0.000633,0.000264,0.000157,0.000181,0.000344,0.000136,0.000392,0.000329,0.000373,-0.000159,-7.3e-05,5.8e-05,0.000398,0.000479,0.000265,0.000157,0.000236
6e-06,3.1e-05,0.000135,9e-06,0.00015,-0.000117,-9e-05,-3.5e-05,-0.00013,-8e-06,0.000103,9.2e-05,1.1e-05,-0.000165,0.000116,6.4e-05,0.000209,9e-06,-0.000101,-1.7e-05,-0.000294,-0.000192,-9.7e-05,0.000149,0.00033,-5.8e-05,-1.3e-05,2.2e-05,-7.2e-05,2.5e-05,-0.000197,-0.000278,4.4e-05,-0.000156,-0.000288,-0.000389,-0.000275,1.9e-05,-5e-06,-0.000191,0.000279,0.000206,-0.000164,-0.000289,-0.000398,-0.000141,0.000104,-8.7e-05,0.000165,0.000104,-0.000143,2.6e-05,-7.6e-05,1.9e-05,0.000174,0.000127,-8e-05,0.000377,0.000384,-0.000276,-0.000321,-0.000207,-1e-05,5e-06,-0.000135,-0.000177,8.3e-05,-3e-06,5.8e-05,-0.00013,-0.000346,6.2e-05,4.5e-05,-0.000143,-0.000325,-0.000239,-0.000284,-0.000251,-0.000279,-0.000122,-5.5e-05,-0.000132,-0.000116,-0.000467,-0.000177,-4.4e-05,0.000201,-0.000216,0.000126,0.000134,8e-05,-0.000594,-0.000267,0.000126,-0.000279,-0.00017,2.4e-05,-0.00047,-0.000239,1e-06,-1.3e-05,-0.000321,-0.000209,-0.000127,-0.00055,-9.8e-05,-0.000119,-2.5e-05,-9.8e-05,-0.000274,6.4e-05,-0.000218,-0.000205,-0.000239,3.4e-05,0.000163,-0.00032,-0.000135,-4.6e-05,-3.9e-05,-0.00045
-4.6e-05,-0.000172,-9.9e-05,-6.3e-05,-3.4e-05,-4.6e-05,0.000142,-0.000117,4.7e-05,0.000109,-1.9e-05,8e-06,4.4e-05,0.000113,-0.000106,-0.00022,-0.000228,-2.6e-05,-8e-06,-2.7e-05,0.000121,4.9e-05,-0.00015,-0.000265,-0.000171,-8e-05,-0.000143,8.3e-05,-2.4e-05,1e-06,-0.00017,1.1e-05,-3.4e-05,-5.4e-05,8.1e-05,7.8e-05,3.7e-05,-6.8e-05,-4e-06,0.000192,-0.000147,-4.3e-05,0.000166,6e-05,7.7e-05,0.000108,-8.7e-05,0.000187,-8.7e-05,-0.000174,-7e-05,-0.000185,-0.000445,-0.000119,-0.000259,-0.000187,0.000171,-0.000188,-0.000506,-7.7e-05,0.000182,3e-06,-7.5e-05,5.6e-05,-0.000162,0.000273,-6.5e-05,-9e-06,-0.000209,-0.00019,0.000178,2e-05,-3.8e-05,9.5e-05,0.000113,-0.000198,0.000151,0.000241,-5.2e-05,-0.000197,6.1e-05,-0.000128,-1.4e-05,6.1e-05,0.000202,-3.6e-05,-0.000156,-5.6e-05,-0.000308,-6.3e-05,-0.00026,0.000174,0.000284,-0.000144,3e-04,0.000317,0.000178,0.000124,-3.4e-05,0.000117,-0.00014,0.000247,0.000307,-4.6e-05,-3.8e-05,-8.3e-05,2.1e-05,4.6e-05,0.000147,0.000359,-0.000312,0.000146,-0.000105,8.3e-05,-0.000168,-0.000393,7e-05,4.8e-05,-0.000286,-8.4e-05,-0.000208
-6.6e-05,7.5e-05,2e-06,5e-06,-9.6e-05,5.2e-05,3e-06,-8.9e-05,-8.5e-05,-0.000128,-2.2e-05,-8.8e-05,1.9e-05,3e-05,5e-06,0.00016,0.000114,4e-05,5e-06,-0.000125,-8e-05,-0.000108,4.4e-05,7e-06,0.00014,-3e-05,0.000185,-7e-05,6.4e-05,-2.4e-05,1.1e-05,0.000112,7e-06,9e-05,-4e-05,-0.000105,-0.000126,-0.000223,-0.000144,-9.3e-05,6.3e-05,-3.4e-05,-2.8e-05,6.1e-05,3e-05,-0.000181,-0.000256,-0.000206,-0.000116,-4.7e-05,6e-06,7.4e-05,4.7e-05,-0.000106,2.9e-05,0.000127,-3e-06,-0.000235,6.3e-05,6.4e-05,-0.000111,-0.000142,-0.000165,-0.00017,3.2e-05,-0.000259,-0.000231,-0.000153,-0.000125,2e-06,-7.7e-05,-9.1e-05,7e-05,-5.1e-05,-0.000155,-0.000154,-0.000238,-0.000128,7.2e-05,5.5e-05,-0.000116,-4.2e-05,-0.000161,2.6e-05,1.4e-05,-0.000206,-4.6e-05,0.000156,0.000285,-1e-04,-0.000109,-0.000147,-6.9e-05,-1.1e-05,0.000212,-8e-06,-0.000307,-8.9e-05,-9.5e-05,-2.9e-05,-9.3e-05,-3.8e-05,-0.00016,-2.6e-05,0.000217,0.000126,-8.8e-05,-4.9e-05,-0.000146,-0.00018,8.6e-05,-0.000397,2.9e-05,-9.2e-05,0.000142,0.000481,0.000136,2e-05,0.000163,6e-05,1.8e-05
1.6e-05,-4.4e-05,2.9e-05,3.7e-05,-9e-06,7.8e-05,-9e-06,0.000113,0.000114,2.5e-05,9e-06,8.7e-05,-7.2e-05,-5e-05,6.1e-05,-0.00013,8.2e-05,-2.8e-05,-8.3e-05,1.4e-05,9.3e-05,-2.8e-05,-9.3e-05,-4e-05,-0.000134,6.1e-05,-2.6e-05,2.7e-05,-8.6e-05,3.2e-05,4.6e-05,4e-06,-8.9e-05,-1.5e-05,4.3e-05,-4.2e-05,7.5e-05,7.1e-05,3e-05,-0.000211,-7.8e-05,7.9e-05,6.8e-05,-0.000203,1e-04,-3.3e-05,9.8e-05,8.6e-05,0.000217,9e-05,-3.2e-05,6.1e-05,0.000172,0.000212,0.000161,-4.9e-05,-7.3e-05,0.000134,8.8e-05,2.1e-05,-2.3e-05,0.000152,0.000109,-4.7e-05,-7.9e-05,0.000162,0.000191,0.000148,0.000143,0.00013,-5e-06,0.00014,-2.3e-05,0.000256,7.6e-05,0.000163,0.000124,9.4e-05,-2.6e-05,3e-06,2e-06,8.7e-05,-4.6e-05,-0.000208,-0.000162,0.000281,0.000101,-2e-04,-5.1e-05,-2e-06,0.000411,0.000139,-8e-06,2.5e-05,-5.5e-05,6.2e-05,0.000154,0.000218,9.9e-05,-5.2e-05,0.000144,-0.000191,-6.1e-05,-4.2e-05,-0.000174,-0.000155,1e-06,-4.2e-05,-5.2e-05,-5.6e-05,8.3e-05,0.000279,1.3e-05,0.000177,9.1e-05,-0.000144,-0.000141,3.1e-05,7.7e-05,-0.000122,1.6e-05
3.2e-05,5.4e-05,-3.4e-05,-3.3e-05,2.5e-05,-7.6e-05,-5.6e-05,4.9e-05,-2e-05,3.1e-05,-3.4e-05,1.4e-05,-2e-05,3.5e-05,-5.6e-05,7.3e-05,-4.6e-05,-6.7e-05,3e-06,6.6e-05,-2.8e-05,0.000139,-1.7e-05,-1.9e-05,-1.6e-05,-2.4e-05,-7.9e-05,-7.5e-05,0.000129,1.2e-05,0.000119,5.9e-05,-4.1e-05,-2.6e-05,2.1e-05,-1.6e-05,-0.000101,-0.000133,1e-06,8.2e-05,1.8e-05,-7.1e-05,-1.3e-05,0.000111,4.5e-05,7e-05,-4.1e-05,-6.8e-05,-0.000145,-3.6e-05,8.6e-05,-7e-06,-0.000112,-7.3e-05,-5e-06,2.7e-05,-4.4e-05,1.3e-05,-1.5e-05,5.9e-05,2.3e-05,-2.9e-05,9e-06,0.000177,0.000103,-1e-04,-0.000139,-4e-05,0.000161,-1.1e-05,-1.7e-05,-0.000109,1.5e-05,-9.3e-05,-8.7e-05,-8.4e-05,1.8e-05,-6.4e-05,0.000215,-1e-05,-4.4e-05,4.2e-05,5.4e-05,0.00012,0.000115,5e-06,0.00013,0.00012,2.9e-05,5.1e-05,-0.000119,-0.000164,-4e-05,-0.000122,-7.4e-05,-0.000132,0.000134,-0.000113,-0.000138,5.5e-05,-6.1e-05,8.7e-05,-7.1e-05,5e-06,-6.3e-05,4.9e-05,6.8e-05,2.6e-05,0.000113,-5.5e-05,-0.000168,-0.000173,3e-05,4.1e-05,-0.000159,0.000161,0.000119,-4.3e-05,7.2e-05,9.4e-05,0.000129
3.5e-05,-5.4e-05,2.4e-05,0,4.1e-05,7e-05,-1.4e-05,-5.9e-05,-8.5e-05,-4e-06,4.6e-05,5e-06,-2e-05,-3.5e-05,-2.7e-05,-1e-06,-7e-05,7.1e-05,1e-06,-4.7e-05,-7.4e-05,-1.4e-05,1.5e-05,3.6e-05,7.1e-05,2.3e-05,6.6e-05,-8e-06,3e-05,-3.4e-05,7.3e-05,-5.3e-05,9.9e-05,-1e-05,-7.3e-05,6.6e-05,4e-05,0.00016,-8.4e-05,-1.1e-05,-4e-05,1.1e-05,-3.4e-05,-0.000109,-0.000175,-7.6e-05,-8e-06,-1.9e-05,-3.7e-05,-5.7e-05,-8.1e-05,-0.000107,5e-05,-2e-05,-8.5e-05,-2.3e-05,0.000105,-7e-06,1.3e-05,-0.000147,-5.1e-05,1.6e-05,-7.4e-05,-2.8e-05,-5e-06,2.6e-05,2.4e-05,7.1e-05,-7.7e-05,-1.8e-05,6.2e-05,1.6e-05,3e-06,3.3e-05,8.5e-05,7.4e-05,5.3e-05,-6.3e-05,-0.000148,4e-06,0.000173,1.9e-05,-1.7e-05,8e-06,-5.3e-05,-1.3e-05,-0.000208,4.8e-05,2.8e-05,7e-06,2.6e-05,0.000224,-0.000128,0.000213,-4.7e-05,3e-05,-0.000142,0.000163,-2.2e-05,7.5e-05,0.00011,1e-05,0.000108,1.7e-05,0.000127,-5.2e-05,-0.000289,-8.7e-05,-7.8e-05,-3.2e-05,2.3e-05,5e-05,-0.000103,-0.000177,0.000186,-0.000199,-0.000121,3.8e-05,1.2e-05,2.7e-05,-2.2e-05
-8.2e-05,3.2e-05,-4.7e-05,-6e-06,-2.5e-05,-2.2e-05,5.8e-05,3.4e-05,3.6e-05,5.1e-05,1e-06,2.3e-05,5.3e-05,-3e-05,0,-9e-06,-1.4e-05,-1.5e-05,1.7e-05,-6.1e-05,1.9e-05,-9e-06,5e-05,-6.1e-05,-1e-05,-6.6e-05,-2.7e-05,3.3e-05,-7.4e-05,-4.7e-05,-2.8e-05,3.4e-05,-2.3e-05,2.7e-05,6.6e-05,7e-06,5.8e-05,-4.8e-05,1.4e-05,9e-05,-5.4e-05,3.1e-05,-0.00013,5.4e-05,3.1e-05,0.000163,4.2e-05,7.7e-05,-7.5e-05,4.6e-05,-3e-06,9.2e-05,8.1e-05,2.1e-05,-0.000106,4e-06,-8e-05,-2e-06,-2.5e-05,4.8e-05,4.4e-05,2.4e-05,1.3e-05,2.4e-05,-1e-05,0.00014,5.9e-05,-8e-06,3e-06,-6e-06,2.7e-05,4e-05,4.6e-05,4.7e-05,-6e-06,7.2e-05,1.5e-05,8.2e-05,8.7e-05,6.3e-05,-1.7e-05,1.2e-05,1.1e-05,-1.9e-05,-4.1e-05,-5.2e-05,0.000154,-3.7e-05,-3.8e-05,7.8e-05,-2.3e-05,-3e-05,0.000102,-0.000126,7.2e-05,-8.8e-05,-8.1e-05,-0.000137,6.1e-05,-7.1e-05,-6.9e-05,-4.1e-05,-1.6e-05,3.3e-05,-9e-06,5.4e-05,0.000275,3.8e-05,6.4e-05,0.000155,4.4e-05,5.1e-05,8.2e-05,0.000144,-9.1e-05,4.6e-05,5.6e-05,-4.5e-05,-0.000127,-0.000172,2e-06
-2e-05,-4.6e-05,-5e-06,1.2e-05,3e-05,-4.4e-05,-6e-06,4e-06,3e-06,-3.8e-05,-8e-06,-3.8e-05,-1.7e-05,3.4e-05,4.5e-05,-4.3e-05,-2.6e-05,-3e-05,0,4.9e-05,4.8e-05,-3.4e-05,-1.1e-05,4.7e-05,-5.6e-05,1.8e-05,4.5e-05,-4.8e-05,-1.1e-05,6.7e-05,1.6e-05,-9e-06,9e-06,-2e-05,-4.7e-05,2.3e-05,-3.1e-05,6e-05,-2.3e-05,-8.6e-05,6.3e-05,-3.8e-05,0.000157,-8e-06,7.2e-05,-8.5e-05,3.7e-05,-3.3e-05,4.7e-05,-1.4e-05,5.2e-05,-7.9e-05,-7e-06,3.4e-05,3e-05,3e-06,3e-05,1e-06,-2.9e-05,6.5e-05,-2.4e-05,-3.6e-05,9e-06,-7e-05,-3.5e-05,-0.000187,-2e-05,-1.5e-05,2.7e-05,8e-06,-2.6e-05,-1.3e-05,-4.5e-05,-0.000129,1.2e-05,-4.1e-05,-5e-06,-5e-06,-3.3e-05,-4.2e-05,-0.000114,-4.7e-05,2.4e-05,7.3e-05,-5e-06,-2.6e-05,-0.00013,-5.2e-05,-4.2e-05,1.9e-05,-8.9e-05,1e-05,-4.6e-05,0.000166,7.5e-05,-6.6e-05,-7e-06,-3.8e-05,4.1e-05,8.9e-05,5.1e-05,6.8e-05,-6.9e-05,1.8e-05,-2.1e-05,-1.3e-05,-3.2e-05,-5.2e-05,2e-06,-2.4e-05,3.9e-05,-5.7e-05,-0.000141,-0.000103,-1e-06,-7.4e-05,5.4e-05,6.3e-05,1e-05,6.6e-05,-7.3e-05
5e-05,3e-06,0,7e-06,-3.8e-05,2e-05,-1.9e-05,-1.9e-05,-4e-06,7e-06,-1.3e-05,1.5e-05,7e-06,-1.2e-05,-2.9e-05,4.7e-05,1.9e-05,2e-06,-1.3e-05,-3e-05,2.1e-05,-7e-06,9e-06,4e-06,6e-06,1e-05,-2.1e-05,4e-06,9e-06,-5.1e-05,1e-05,-2e-05,-8.8e-05,7e-06,-1.2e-05,-3.9e-05,9e-06,-5e-06,9e-06,-4e-06,-3e-06,4.7e-05,6.2e-05,4.7e-05,3.4e-05,-9e-06,6e-06,-4.9e-05,4e-05,-1e-05,-5.2e-05,4.2e-05,-4e-06,-4.1e-05,2.3e-05,3.6e-05,-4.9e-05,3.8e-05,-1e-06,-3e-05,-3.1e-05,-1.1e-05,6.1e-05,6.5e-05,4.7e-05,0.000115,-2.8e-05,1e-06,-9.7e-05,6.5e-05,-3.1e-05,1e-06,4.6e-05,1e-05,2.1e-05,-2.2e-05,1.2e-05,-2.2e-05,-4.2e-05,4e-06,4.6e-05,4e-06,2.6e-05,9e-06,-5e-06,3.1e-05,2.4e-05,3.2e-05,0,2.1e-05,7.8e-05,-6.7e-05,-6.5e-05,-4.1e-05,-4.3e-05,3.3e-05,4e-06,4.1e-05,1.8e-05,-3e-05,-2e-05,-2.4e-05,4.3e-05,4.9e-05,2.7e-05,7e-06,-4.9e-05,2e-05,-3.2e-05,-3.6e-05,-4.4e-05,4.2e-05,7.2e-05,0.000163,8.2e-05,5e-06,-4e-06,-5e-05,-4.3e-05,1.5e-05,1e-05
-1e-06,1.3e-05,9e-06,4e-06,1.4e-05,2e-05,-7e-06,-2.7e-05,7e-06,4e-06,2.1e-05,-1.9e-05,-1.3e-05,1.4e-05,0,5e-06,2.4e-05,2.6e-05,1.2e-05,-8e-06,-1.8e-05,2.5e-05,3.8e-05,-1.7e-05,0,1.3e-05,3e-06,2.7e-05,3.9e-05,1.2e-05,-4.2e-05,-1.8e-05,4.6e-05,2.6e-05,3.4e-05,1e-05,-3e-06,6e-06,1.6e-05,-3.7e-05,2e-06,-6.4e-05,-6.1e-05,-4.3e-05,4.3e-05,7e-06,-7e-06,3.1e-05,-2.6e-05,-6e-05,1.6e-05,-1.3e-05,2.4e-05,7e-06,2.3e-05,-2.2e-05,3e-05,-4.9e-05,1.5e-05,3e-06,4.9e-05,2.5e-05,-2.5e-05,-4e-06,-1.1e-05,-4.6e-05,-9e-06,4e-06,3.9e-05,6e-06,1.6e-05,-5e-06,-3.6e-05,-1.4e-05,-6e-06,9e-06,-3e-06,7e-06,1.5e-05,2e-05,3.9e-05,-5e-06,-1e-05,-6e-06,-5e-06,-2.6e-05,7e-06,2e-06,1.1e-05,-6.3e-05,-5e-06,-1e-05,3e-06,-3.7e-05,-6.2e-05,8.4e-05,-8e-06,4.8e-05,-6.6e-05,-2.2e-05,-3.6e-05,-2.1e-05,3.3e-05,1e-06,4e-06,-1.4e-05,1.4e-05,3.5e-05,-1.8e-05,1.9e-05,6e-06,-3.2e-05,-1.7e-05,-7e-05,-7.4e-05,3e-06,1e-06,1.7e-05,3.6e-05,-7e-06,3e-06
-1.1e-05,0,1.3e-05,-4e-06,-2e-06,-2.1e-05,-1e-06,2.3e-05,-2e-06,-2e-06,-1e-05,3e-06,1.1e-05,-6e-06,2.5e-05,-1.6e-05,-1e-05,7e-06,5e-06,2.3e-05,-2.4e-05,1.5e-05,-2.7e-05,2.7e-05,1e-06,-1.8e-05,-3e-06,4e-06,-1e-06,1.3e-05,2.2e-05,-1.3e-05,-2.5e-05,-3.3e-05,-2.3e-05,1.2e-05,4e-06,4e-06,4.5e-05,4.2e-05,-1.6e-05,4.8e-05,2.5e-05,-3e-06,-4e-05,9e-06,3.3e-05,-2e-06,1.7e-05,2.6e-05,-1e-06,-2.1e-05,-6.5e-05,1.5e-05,-1.2e-05,-4.5e-05,-2.1e-05,-5e-06,2.9e-05,2.6e-05,-4.6e-05,3e-06,3.7e-05,-1.2e-05,8e-06,-7e-06,3.6e-05,0,-2.6e-05,-6.7e-05,1.5e-05,-1.7e-05,2.3e-05,1.6e-05,-1.3e-05,-2e-06,0,3.6e-05,3e-06,-2.8e-05,-2.5e-05,2.9e-05,-1.1e-05,5e-06,1.9e-05,3.4e-05,4.4e-05,-9e-06,5e-06,4.7e-05,2.2e-05,2.1e-05,5.1e-05,4.5e-05,-4e-06,2.3e-05,2e-06,-5.1e-05,2.9e-05,-1.1e-05,2.1e-05,2.8e-05,-4.4e-05,-2.7e-05,-3.3e-05,9e-06,-2.2e-05,0,1.5e-05,-2.1e-05,2.2e-05,-1e-06,3.8e-05,-2.1e-05,3.1e-05,-7e-06,-1.1e-05,-2.3e-05,1.2e-05,2.3e-05,2.1e-05
1.8e-05,-4e-06,-3e-06,7e-06,-8e-06,-3e-06,1e-06,2e-05,1e-05,-2e-06,6e-06,5e-06,3e-06,0,-1.1e-05,4e-06,-7e-06,-1e-06,-2e-05,-4e-06,5e-06,-8e-06,-1.8e-05,0,-1.1e-05,1.1e-05,6e-06,7e-06,-5e-06,2e-06,3.2e-05,-2e-05,3e-06,-1.7e-05,1.4e-05,-3e-06,6e-06,-1.2e-05,-3.1e-05,-4e-06,-5e-06,-2.8e-05,4.2e-05,6e-06,5e-06,-1.2e-05,-1.1e-05,2e-06,-1.6e-05,1.6e-05,1e-06,1.4e-05,4e-05,1e-06,-3e-06,3e-06,2.8e-05,2.1e-05,-1.1e-05,-4.2e-05,5.2e-05,6e-06,-2e-05,-3.2e-05,8e-06,3.8e-05,-5e-06,3e-06,4.8e-05,-4e-06,4e-06,2.5e-05,-1e-05,-2.5e-05,3e-06,1e-06,1.6e-05,-9e-06,1.5e-05,-1e-06,0,2e-06,-1e-06,1e-06,-6e-06,2.7e-05,-6e-05,1.2e-05,-6e-06,-4.3e-05,-1.9e-05,1.7e-05,-1e-05,-3.4e-05,2.2e-05,-3.2e-05,2.2e-05,2.6e-05,-3.3e-05,-3e-05,6e-06,-5e-06,3.4e-05,2e-06,2.2e-05,-5e-06,2.9e-05,-9e-06,-2.2e-05,1.1e-05,-4.4e-05,1.9e-05,-4.4e-05,4e-06,-7e-06,3.9e-05,-3.3e-05,1.1e-05,1.8e-05,-3e-05,-1.5e-05
9e-06,-5e-06,1e-06,1e-06,9e-06,3e-06,-2e-06,-6e-06,-1.2e-05,1e-06,6e-06,-3e-06,-2e-06,-7e-06,-8e-06,6e-06,-1.1e-05,-2.5e-05,-1e-06,1.1e-05,2.3e-05,-2e-06,7e-06,2e-06,1e-06,-1e-06,0,6e-06,-8e-06,-1.1e-05,-1.3e-05,1.1e-05,-1.4e-05,2.4e-05,2e-06,-1.8e-05,-8e-06,8e-06,2.8e-05,-3e-06,1.5e-05,3e-06,-3.9e-05,-9e-06,3e-06,3.8e-05,-9e-06,-1e-05,1.3e-05,1e-06,-7e-06,1e-05,-1.6e-05,-1.8e-05,-1e-06,-1.2e-05,-2.1e-05,9e-06,1e-06,1.5e-05,-3.1e-05,1e-05,-7e-06,2.8e-05,-6e-06,-3.5e-05,-1.8e-05,-7e-06,-1.5e-05,-1e-06,-2.2e-05,-1.5e-05,0,1.6e-05,-1.3e-05,2.2e-05,-9e-06,1.3e-05,-9e-06,2.2e-05,-1e-06,-1e-05,5e-06,-2.3e-05,1.9e-05,-3.6e-05,2.1e-05,-2.2e-05,-9e-06,-1.4e-05,-8e-06,1.3e-05,3.1e-05,2e-05,3.1e-05,-1.9e-05,9e-06,5e-06,3e-06,1.5e-05,1.4e-05,-9e-06,-2.2e-05,-1.9e-05,0,1e-05,4e-06,1.7e-05,2e-06,-1.1e-05,1.1e-05,-2.3e-05,2.2e-05,-4e-06,-6e-06,-4.8e-05,2.7e-05,-4e-06,-2e-05,3.6e-05,1.4e-05
-1.4e-05,1.2e-05,-8e-06,0,-1e-06,-1.2e-05,0,-9e-06,3e-06,-5e-06,-3e-06,-4e-06,-7e-06,2e-06,5e-06,-1e-06,1e-06,1e-05,5e-06,-1.1e-05,1e-06,-1e-06,0,-4e-06,1.4e-05,2e-06,0,-1.3e-05,9e-06,-2e-06,1e-05,7e-06,5e-06,-5e-06,-7e-06,2e-05,1.1e-05,6e-06,-2.1e-05,-1e-05,-1.5e-05,1.8e-05,2.1e-05,3e-06,1.9e-05,-2.2e-05,1e-06,3e-06,4e-06,2.4e-05,1e-05,-4e-06,0,2.3e-05,-1.2e-05,8e-06,1.5e-05,-1.6e-05,4e-06,2.5e-05,1.5e-05,-6e-06,-1.4e-05,1.5e-05,-1e-05,1.9e-05,1.8e-05,7e-06,-1e-05,-7e-06,-4e-06,5e-06,-7e-06,-1.3e-05,5e-06,-5e-06,8e-06,-1.2e-05,8e-06,-1.2e-05,1.1e-05,-5e-06,6e-06,2.6e-05,-1.9e-05,-2e-06,-5e-06,7e-06,9e-06,1.7e-05,-3.5e-05,-1.8e-05,6e-06,-2.1e-05,-1.9e-05,3.5e-05,-5e-06,-1.2e-05,-1.1e-05,-1.4e-05,-1.2e-05,8e-06,-5e-06,1.8e-05,-8e-06,-8e-06,-2.8e-05,-9e-06,1e-06,-4e-06,2e-05,1.5e-05,-2.1e-05,5.4e-05,8e-06,4.3e-05,-1.6e-05,5e-06,-2.4e-05,-2.2e-05,-1.4e-05
-1.1e-05,-1.7e-05,1e-06,3e-06,5e-06,-4e-06,4e-06,7e-06,2e-06,-1e-06,3e-06,-2e-06,-3e-06,0,1e-06,-1.1e-05,2.9e-05,1e-06,-3e-06,2e-06,0,-8e-06,-8e-06,-2e-06,1e-05,-8e-06,4e-06,7e-06,-5e-06,1.2e-05,-3e-06,2e-06,1e-06,5e-06,5e-06,1.2e-05,-8e-06,-7e-06,-5e-06,7e-06,7e-06,-2.1e-05,4e-06,-9e-06,2e-05,1e-05,4e-06,1.4e-05,-1.2e-05,-9e-06,-2e-06,8e-06,1.2e-05,-3e-06,1.3e-05,1.1e-05,-8e-06,1.1e-05,-1.1e-05,-3e-06,-1.1e-05,-1.7e-05,1.5e-05,-1.7e-05,2e-06,-2e-06,5e-06,-5e-06,-3e-06,2.2e-05,4e-06,0,1.1e-05,6e-06,4e-06,-8e-06,1e-06,1e-06,-2.1e-05,8e-06,2e-06,-5e-06,-1e-06,2e-06,2e-05,-6e-06,5e-06,1.3e-05,-7e-06,-1.8e-05,6e-06,1e-06,-1.2e-05,8e-06,-3.2e-05,2.3e-05,-1e-05,9e-06,3e-06,0,-3e-06,-1.1e-05,2.4e-05,5e-06,3e-06,-2e-06,1.3e-05,2e-06,2e-06,3e-06,-1.8e-05,7e-06,8e-06,-3.1e-05,-6e-06,1e-06,3e-06,2e-06,1.8e-05,5e-06,-4e-06
2e-06,9e-06,1e-06,1e-06,-9e-06,1.9e-05,0,-5e-06,-3e-06,2e-06,-1e-06,4e-06,5e-06,-5e-06,-9e-06,1.1e-05,-2.3e-05,9e-06,3e-06,7e-06,-6e-06,2e-06,1.4e-05,1e-06,-6e-06,6e-06,-9e-06,-3e-06,-5e-06,-3e-06,-1.6e-05,5e-06,4e-06,-2e-06,1e-06,-9e-06,-4e-06,2.3e-05,-8e-06,1.2e-05,-7e-06,1.4e-05,0,7e-06,2e-06,-3e-06,6e-06,-4e-06,7e-06,-1.7e-05,-5e-06,-1.5e-05,-6e-06,-3e-06,1.6e-05,9e-06,7e-06,-5e-06,8e-06,-4e-06,1.3e-05,9e-06,-1.4e-05,-1e-06,3e-06,-1.5e-05,-1.4e-05,4e-06,-9e-06,1.5e-05,6e-06,-7e-06,-5e-06,-4e-06,4e-06,-3e-06,-6e-06,-7e-06,1.5e-05,7e-06,-6e-06,2e-06,0,1e-06,-5e-06,1.1e-05,-2e-06,-9e-06,1e-05,-1e-06,2.4e-05,-1.7e-05,6e-06,1.1e-05,0,-3e-06,1e-06,2.1e-05,2.1e-05,-3e-06,3e-06,6e-06,-1.4e-05,1.3e-05,5e-06,2e-06,-1e-06,-1.5e-05,5e-06,1.2e-05,1e-06,-1.6e-05,-1.4e-05,5e-06,9e-06,1.8e-05,-5e-06,1e-06,-6e-06,-1e-06,-2e-06
3e-06,-7e-06,-1e-06,1e-06,3e-06,-5e-06,5e-06,-1.2e-05,0,2e-06,4e-06,-2e-06,-3e-06,4e-06,-2e-06,-5e-06,5e-06,-8e-06,5e-06,-9e-06,-5e-06,4e-06,3e-06,-1e-06,-6e-06,2e-06,4e-06,-1.1e-05,1.6e-05,-4e-06,1e-06,7e-06,-1e-06,-4e-06,-1e-06,-7e-06,1.3e-05,-8e-06,8e-06,-1.9e-05,7e-06,-9e-06,-1.6e-05,-2e-06,-1.4e-05,-3e-06,0,-8e-06,-1.3e-05,-3e-06,3e-06,1.1e-05,-5e-06,4e-06,-5e-06,-8e-06,-6e-06,5e-06,5e-06,-3e-06,-1.2e-05,-3e-06,1.6e-05,-1e-06,2e-06,2.1e-05,1e-06,-2e-06,-7e-06,-1.4e-05,-5e-06,8e-06,3e-06,1.1e-05,-1e-06,-3e-06,7e-06,6e-06,-1.5e-05,-6e-06,-7e-06,4e-06,0,4e-06,-3e-06,1e-05,-3e-06,-1.5e-05,-6e-06,1.2e-05,-3e-06,1.9e-05,0,-2.1e-05,1.3e-05,-3.4e-05,1.7e-05,-2.7e-05,-9e-06,3e-06,-2e-06,8e-06,-1.2e-05,-1.5e-05,-5e-06,4e-06,-9e-06,2e-06,-4e-06,4e-06,4e-06,1.3e-05,2.2e-05,-1e-06,-1e-05,-4e-06,4e-06,1e-06,1.6e-05,8e-06,3e-06
0,9e-06,-2e-06,0,4e-06,-4e-06,-3e-06,7e-06,1e-06,-2e-06,-6e-06,-2e-06,1e-06,0,6e-06,4e-06,-8e-06,2e-06,3e-06,1e-06,6e-06,4e-06,-6e-06,6e-06,2e-06,-1e-06,-1e-06,7e-06,-8e-06,-1e-06,0,-4e-06,-1.1e-05,1e-06,2e-06,-2e-06,-7e-06,5e-06,-1.4e-05,-3e-06,-7e-06,4e-06,-1e-06,1.2e-05,6e-06,4e-06,7e-06,5e-06,6e-06,6e-06,-4e-06,0,-1.3e-05,2e-06,-1.6e-05,-8e-06,4e-06,-8e-06,0,1e-06,1.1e-05,4e-06,-8e-06,1.1e-05,1e-06,-1.7e-05,9e-06,-3e-06,1.5e-05,-1.3e-05,-4e-06,-4e-06,-2e-06,-3e-06,-2e-06,5e-06,3e-06,-3e-06,1.4e-05,-4e-06,5e-06,4e-06,0,-2e-06,2e-06,-6e-06,9e-06,1.5e-05,1.1e-05,-9e-06,5e-06,-1e-05,-5e-06,2.2e-05,1.4e-05,-1.1e-05,-1.5e-05,6e-06,1e-05,8e-06,4e-06,-5e-06,1.8e-05,3e-06,-1e-06,1e-06,3.2e-05,-9e-06,1e-06,-2e-06,8e-06,-1.5e-05,-1.9e-05,-1.9e-05,1e-06,4e-06,-5e-06,0,3e-06,-9e-06,4e-06
-2e-06,-5e-06,-3e-06,3e-06,-7e-06,8e-06,-1e-06,8e-06,-1e-06,0,2e-06,2e-06,-4e-06,0,-4e-06,-6e-06,2e-06,2e-06,-4e-06,5e-06,6e-06,3e-06,3e-06,0,4e-06,-4e-06,2e-06,1e-06,-5e-06,6e-06,-3e-06,7e-06,2e-06,1e-06,-4e-06,7e-06,3e-06,-5e-06,1.9e-05,-7e-06,1e-06,5e-06,-8e-06,-6e-06,1.1e-05,3e-06,3e-06,-1e-06,2e-06,3e-06,6e-06,-9e-06,1.4e-05,-5e-06,-5e-06,8e-06,-5e-06,-3e-06,-4e-06,5e-06,-1e-05,9e-06,1.4e-05,-1.2e-05,2e-06,5e-06,-5e-06,1e-06,1.2e-05,-5e-06,1e-06,0,0,3e-06,-2e-06,-1e-06,-7e-06,-3e-06,-6e-06,5e-06,7e-06,-1e-06,0,-9e-06,-9e-06,5e-06,-1.1e-05,2e-06,-8e-06,-9e-06,-1e-05,1.2e-05,-1.5e-05,-2.5e-05,-9e-06,5e-06,-1e-06,5e-06,-9e-06,-7e-06,-2e-06,-1e-06,-1.1e-05,-2e-06,5e-06,0,-2.6e-05,5e-06,2e-06,-1.1e-05,-1.4e-05,2e-06,2e-06,2.3e-05,7e-06,-1.1e-05,7e-06,0,-3e-06,-1e-06,-1e-06
3e-06,2e-06,1e-06,0,6e-06,-9e-06,1e-06,-4e-06,1e-06,-1e-06,2e-06,1e-06,4e-06,0,-2e-06,7e-06,2e-06,6e-06,0,1e-06,-1e-06,-7e-06,2e-06,0,-2e-06,2e-06,-3e-06,1e-06,3e-06,-4e-06,3e-06,-3e-06,-1e-06,3e-06,-1e-06,-1e-06,1e-06,1e-06,-7e-06,1.7e-05,3e-06,-1.1e-05,1.9e-05,0,9e-06,-4e-06,-6e-06,-1e-06,1e-06,1e-06,-5e-06,1.3e-05,-1.1e-05,0,6e-06,-3e-06,2e-06,7e-06,0,-3e-06,6e-06,-5e-06,-7e-06,-2e-06,-1e-06,7e-06,-7e-06,4e-06,-1e-05,8e-06,8e-06,3e-06,2e-06,-1e-06,-3e-06,7e-06,2e-06,-1e-06,3e-06,-6e-06,-5e-06,0,0,9e-06,5e-06,-9e-06,4e-06,-4e-06,0,1.1e-05,-1e-05,-1.1e-05,2e-06,1.8e-05,-1.5e-05,1e-06,3e-06,-6e-06,3e-06,6e-06,5e-06,-3e-06,7e-06,4e-06,-7e-06,-1e-06,1e-06,-3e-06,-4e-06,0,1e-06,3e-06,0,7e-06,-1.1e-05,-6e-06,-3e-06,0,-1.3e-05,-2e-06,-5e-06
4e-06,-2e-06,1e-06,1e-06,-4e-06,-2e-06,-3e-06,-3e-06,0,1e-06,-2e-06,1e-06,0,1e-06,6e-06,-6e-06,3e-06,-3e-06,-1e-06,-3e-06,-2e-06,0,-6e-06,6e-06,-7e-06,0,0,5e-06,1e-06,-2e-06,0,-1e-06,-3e-06,-3e-06,2e-06,-3e-06,-1e-06,5e-06,4e-06,-3e-06,-2e-06,1.4e-05,-1.7e-05,0,0,4e-06,1e-06,-2e-06,4e-06,5e-06,1e-06,-1.5e-05,-1e-06,2e-06,2e-06,3e-06,-2e-06,0,-1e-06,1e-06,-1e-06,-4e-06,3e-06,2e-06,-3e-06,-1.5e-05,9e-06,-3e-06,2e-06,7e-06,-2e-06,-6e-06,-1e-06,1e-06,3e-06,0,-1e-06,2e-06,-2e-06,4e-06,-7e-06,-3e-06,-2e-06,-4e-06,-5e-06,-5e-06,-2e-06,-2e-06,-1e-06,-8e-06,0,1.5e-05,3e-06,-1.1e-05,0,3e-06,-6e-06,4e-06,-1.4e-05,-2e-06,-4e-06,1e-06,2e-06,-1e-06,2e-06,-2e-06,9e-06,9e-06,1e-06,1e-06,1.2e-05,-4e-06,0,-5e-06,6e-06,4e-06,-3e-06,0,-4e-06,1.2e-05,-2e-06
-2e-06,-1e-06,1e-06,1e-06,2e-06,8e-06,-1e-06,5e-06,1e-06,1e-06,0,0,1e-06,0,1e-06,3e-06,2e-06,-2e-06,-2e-06,2e-06,-4e-06,0,-1e-06,-2e-06,2e-06,2e-06,1e-06,-4e-06,2e-06,3e-06,-8e-06,-2e-06,-1e-06,-3e-06,-2e-06,2e-06,4e-06,-3e-06,2e-06,-2e-06,0,-1.3e-05,-6e-06,-6e-06,-6e-06,3e-06,0,1e-06,-6e-06,-5e-06,2e-06,1.1e-05,2e-06,4e-06,2e-06,1e-06,1e-06,-2e-06,0,2e-06,-1e-06,-1e-06,-6e-06,1.1e-05,0,1.6e-05,2e-06,0,-9e-06,1e-06,-6e-06,4e-06,1e-06,0,-1e-06,-9e-06,-3e-06,0,-1e-06,1e-06,1e-05,-1e-06,0,-1e-06,6e-06,4e-06,1e-05,0,1e-06,-2e-06,8e-06,-1.8e-05,-1e-06,-5e-06,1.1e-05,-1e-06,2e-06,1e-05,0,3e-06,-2e-06,6e-06,-8e-06,-6e-06,0,3e-06,-8e-06,-1e-06,2e-06,2e-06,-1.1e-05,8e-06,-8e-06,-8e-06,2e-06,-1e-06,6e-06,-1e-06,6e-06,-1.4e-05,0
-3e-06,1e-06,0,1e-06,0,0,2e-06,-1e-06,0,-1e-06,1e-06,0,-2e-06,-2e-06,-2e-06,1e-06,-6e-06,-2e-06,-2e-06,-1e-06,1e-06,3e-06,4e-06,-1e-06,4e-06,-3e-06,-1e-06,-1e-06,1e-06,2e-06,1e-06,-1e-06,-4e-06,4e-06,2e-06,3e-06,-4e-06,2e-06,-2e-06,-7e-06,-2e-06,6e-06,5e-06,6e-06,-1e-06,-4e-06,-1e-06,2e-06,2e-06,-4e-06,-2e-06,-5e-06,2e-06,-6e-06,1e-06,-1e-06,-1e-06,3e-06,1e-06,-9e-06,0,-2e-06,2e-06,-7e-06,-1e-06,-1.3e-05,-7e-06,0,5e-06,-2e-06,-1e-06,-1e-06,-2e-06,-1e-06,3e-06,6e-06,3e-06,-3e-06,0,2e-06,0,1e-06,2e-06,3e-06,-5e-06,4e-06,-1.9e-05,2e-06,1e-06,1e-05,8e-06,7e-06,-1e-06,6e-06,6e-06,-2e-06,-3e-06,-1.2e-05,6e-06,1e-06,2e-06,-3e-06,6e-06,1e-06,-1e-06,-1e-06,9e-06,6e-06,-2e-06,0,0,-1e-06,7e-06,-1.2e-05,-9e-06,0,-9e-06,2e-06,2e-06,1.2e-05,-1e-06
3e-06,-2e-06,0,0,-2e-06,-4e-06,-2e-06,-4e-06,-1e-06,-1e-06,2e-06,0,-1e-06,3e-06,1e-06,-1e-06,-2e-06,4e-06,3e-06,-1e-06,5e-06,0,-2e-06,1e-06,-1e-06,1e-06,1e-06,3e-06,-1e-06,-3e-06,1e-06,-2e-06,3e-06,2e-06,-1e-06,-3e-06,3e-06,2e-06,-6e-06,4e-06,2e-06,2e-06,2e-06,-3e-06,4e-06,5e-06,0,-1e-06,-2e-06,-2e-06,2e-06,0,-1.1e-05,3e-06,-2e-06,-3e-06,1e-06,0,1e-06,5e-06,1e-06,3e-06,-8e-06,-7e-06,4e-06,4e-06,2e-06,2e-06,-4e-06,-6e-06,5e-06,-1e-06,3e-06,3e-06,-1e-06,-5e-06,1e-06,3e-06,-2e-06,-2e-06,-4e-06,3e-06,3e-06,0,1e-06,5e-06,1.4e-05,4e-06,-2e-06,-6e-06,-2e-06,-6e-06,8e-06,-8e-06,-5e-06,4e-06,1e-06,-2e-06,4e-06,-4e-06,0,-3e-06,1e-06,-2e-06,0,1e-06,-7e-06,-3e-06,0,1e-06,7e-06,0,-1e-06,1.6e-05,7e-06,-9e-06,9e-06,-1e-06,5e-06,-1.2e-05,2e-06
2e-06,5e-06,1e-06,0,2e-06,3e-06,0,2e-06,1e-06,0,-3e-06,-1e-06,1e-06,-3e-06,2e-06,-1e-06,1e-06,-2e-06,1e-06,0,1e-06,2e-06,0,-1e-06,-3e-06,1e-06,-1e-06,-4e-06,-2e-06,0,-6e-06,2e-06,-4e-06,-3e-06,-2e-06,0,-2e-06,-1e-06,4e-06,3e-06,-2e-06,-7e-06,-1.4e-05,1e-06,6e-06,-7e-06,1e-06,0,2e-06,3e-06,-1e-06,1e-06,4e-06,2e-06,-4e-06,3e-06,1e-06,-2e-06,-1e-06,6e-06,-2e-06,3e-06,6e-06,6e-06,2e-06,4e-06,4e-06,-1e-06,8e-06,-2e-06,2e-06,3e-06,-2e-06,-3e-06,1e-06,2e-06,-1e-06,-3e-06,4e-06,0,0,1e-06,1e-06,-2e-06,1e-06,-5e-06,-4e-06,-6e-06,2e-06,-3e-06,-4e-06,9e-06,-1e-06,8e-06,-9e-06,3e-06,8e-06,7e-06,1e-06,6e-06,1e-06,1e-06,-7e-06,4e-06,0,-3e-06,-4e-06,1e-06,2e-06,2e-06,-2e-06,2e-06,-7e-06,6e-06,-2e-06,3e-06,-8e-06,1e-06,0,1.3e-05,0
-4e-06,-5e-06,-1e-06,0,-2e-06,1e-06,2e-06,3e-06,-1e-06,0,1e-06,1e-06,0,1e-06,-3e-06,0,7e-06,0,-1e-06,0,-3e-06,-2e-06,4e-06,0,1e-06,0,1e-06,1e-06,1e-06,1e-06,5e-06,-2e-06,1e-06,2e-06,1e-06,0,-2e-06,2e-06,-5e-06,-6e-06,1e-06,9e-06,1e-05,-2e-06,1e-06,2e-06,2e-06,2e-06,1e-06,-1e-06,1e-06,1e-06,1e-06,-5e-06,2e-06,2e-06,0,-1e-06,-2e-06,-4e-06,4e-06,0,-4e-06,1e-06,-4e-06,-8e-06,-4e-06,0,3e-06,7e-06,-3e-06,-3e-06,2e-06,1e-06,-4e-06,4e-06,1e-06,2e-06,-5e-06,-2e-06,3e-06,-2e-06,-2e-06,4e-06,1e-06,-3e-06,0,-4e-06,-4e-06,9e-06,-4e-06,-6e-06,0,-7e-06,-2e-06,7e-06,-7e-06,-5e-06,0,-4e-06,-3e-06,-1e-06,6e-06,-1e-06,0,1e-06,9e-06,-5e-06,-1e-06,1e-06,-3e-06,-6e-06,3e-06,-7e-06,-2e-06,0,7e-06,-1e-06,-7e-06,-9e-06,0
-2e-06,3e-06,-1e-06,0,3e-06,-7e-06,0,-2e-06,0,0,0,-1e-06,0,0,-2e-06,2e-06,-4e-06,-1e-06,1e-06,3e-06,-1e-06,0,-1e-06,0,4e-06,-1e-06,-1e-06,2e-06,-1e-06,0,2e-06,1e-06,-6e-06,-1e-06,0,0,3e-06,-3e-06,-2e-06,-1e-06,-1e-06,-1e-05,-4e-06,4e-06,-6e-06,1e-06,0,-1e-06,-3e-06,3e-06,-1e-06,-3e-06,-7e-06,2e-06,7e-06,-4e-06,1e-06,-2e-06,1e-06,-2e-06,-4e-06,-1e-06,6e-06,0,0,9e-06,-2e-06,0,-2e-06,3e-06,-4e-06,1e-06,-2e-06,-2e-06,2e-06,-4e-06,0,-2e-06,4e-06,-2e-06,-1e-06,-1e-06,-3e-06,-4e-06,2e-06,0,-4e-06,7e-06,2e-06,-4e-06,-4e-06,6e-06,5e-06,0,8e-06,-2e-06,0,0,1e-06,0,2e-06,3e-06,-2e-06,2e-06,-1e-06,0,-7e-06,-1e-06,-1e-06,-2e-06,0,2e-06,-1e-06,-1e-06,3e-06,7e-06,-6e-06,1e-06,-4e-06,4e-06,-3e-06
2e-06,-5e-06,-1e-06,0,-2e-06,5e-06,-1e-06,-2e-06,1e-06,0,-1e-06,0,-2e-06,0,2e-06,-4e-06,0,3e-06,1e-06,-2e-06,-1e-06,-2e-06,-3e-06,0,0,-1e-06,1e-06,-2e-06,1e-06,-2e-06,-5e-06,-1e-06,2e-06,-4e-06,1e-06,2e-06,-1e-06,2e-06,5e-06,0,2e-06,7e-06,-3e-06,-3e-06,-6e-06,2e-06,-1e-06,0,2e-06,0,0,5e-06,4e-06,3e-06,1e-06,1e-06,-1e-06,3e-06,0,2e-06,4e-06,-3e-06,-3e-06,-7e-06,1e-06,-6e-06,4e-06,0,-5e-06,-1e-06,2e-06,1e-06,1e-06,2e-06,0,4e-06,-2e-06,2e-06,-5e-06,-1e-06,1e-06,0,0,-1e-06,-2e-06,0,7e-06,2e-06,-2e-06,-4e-06,6e-06,-2e-06,-2e-06,3e-06,4e-06,-2e-06,3e-06,5e-06,-2e-06,1e-06,0,0,0,-2e-06,1e-06,2e-06,3e-06,-4e-06,0,-1e-06,6e-06,-1e-06,-2e-06,-1e-05,-4e-06,0,7e-06,-1e-06,4e-06,-1e-06,-1e-06
1e-06,3e-06,0,0,1e-06,4e-06,0,2e-06,-1e-06,-1e-06,0,0,1e-06,1e-06,-1e-06,3e-06,2e-06,0,-2e-06,-1e-06,3e-06,1e-06,2e-06,0,-3e-06,1e-06,0,2e-06,0,0,4e-06,0,-2e-06,4e-06,0,1e-06,1e-06,-1e-06,-5e-06,8e-06,-3e-06,-2e-06,-3e-06,2e-06,3e-06,-2e-06,1e-06,1e-06,-2e-06,1e-06,0,-5e-06,-2e-06,-2e-06,-4e-06,-2e-06,1e-06,0,2e-06,0,-4e-06,-2e-06,3e-06,5e-06,-2e-06,2e-06,0,0,0,-4e-06,3e-06,-2e-06,-1e-06,-2e-06,3e-06,-4e-06,0,-2e-06,3e-06,3e-06,-2e-06,0,2e-06,1e-06,1e-06,3e-06,-5e-06,-5e-06,3e-06,8e-06,5e-06,-4e-06,-3e-06,-4e-06,-3e-06,-1e-06,-2e-06,-4e-06,-5e-06,-2e-06,-1e-06,-4e-06,3e-06,-2e-06,-1e-06,-1e-06,4e-06,-1e-06,0,-1e-06,-5e-06,0,-2e-06,9e-06,3e-06,4e-06,-6e-06,1e-06,3e-06,3e-06,0
-1e-06,-2e-06,0,0,1e-06,-6e-06,-1e-06,0,1e-06,0,0,0,0,-1e-06,-1e-06,0,-5e-06,1e-06,-2e-06,1e-06,2e-06,1e-06,0,1e-06,-1e-06,0,0,0,-2e-06,1e-06,-1e-06,0,0,1e-06,-1e-06,-1e-06,0,0,3e-06,-4e-06,2e-06,-2e-06,5e-06,-1e-06,4e-06,1e-06,-2e-06,0,2e-06,-2e-06,-1e-06,6e-06,-2e-06,1e-06,-3e-06,0,-2e-06,0,0,0,3e-06,1e-06,-3e-06,2e-06,1e-06,2e-06,-3e-06,1e-06,0,-5e-06,0,2e-06,1e-06,1e-06,-1e-06,1e-06,0,1e-06,-3e-06,1e-06,1e-06,0,3e-06,0,-1e-06,2e-06,0,-2e-06,-2e-06,-4e-06,0,0,0,6e-06,-6e-06,-6e-06,0,-3e-06,-1e-06,2e-06,-1e-06,2e-06,-3e-06,1e-06,0,0,-1e-05,0,0,1e-06,-1e-06,3e-06,5e-06,2e-06,-2e-06,-5e-06,4e-06,-1e-06,1e-06,-6e-06,0
0,2e-06,0,0,-3e-06,2e-06,0,-2e-06,0,1e-06,0,1e-06,1e-06,0,2e-06,0,4e-06,-3e-06,1e-06,-1e-06,-1e-06,1e-06,-2e-06,0,1e-06,0,0,-3e-06,2e-06,0,-3e-06,1e-06,-1e-06,-2e-06,0,-1e-06,-1e-06,2e-06,1e-06,-4e-06,-1e-06,6e-06,-2e-06,-3e-06,1e-06,-4e-06,-1e-06,0,0,-2e-06,1e-06,-3e-06,0,0,1e-06,1e-06,2e-06,2e-06,0,1e-06,-3e-06,2e-06,2e-06,1e-06,1e-06,-4e-06,2e-06,-1e-06,1e-06,3e-06,-3e-06,-2e-06,-1e-06,0,0,1e-06,-1e-06,-1e-06,2e-06,0,1e-06,1e-06,0,-1e-06,0,0,1e-06,3e-06,1e-06,-3e-06,-3e-06,0,0,-8e-06,-2e-06,0,1e-06,5e-06,2e-06,-3e-06,-1e-06,2e-06,1e-06,1e-06,0,-1e-06,8e-06,2e-06,0,0,5e-06,-1e-06,-7e-06,0,0,0,-3e-06,1e-06,1e-06,6e-06,0
2e-06,0,0,0,2e-06,2e-06,0,1e-06,0,0,-1e-06,-1e-06,-1e-06,-1e-06,1e-06,-2e-06,-1e-06,1e-06,0,1e-06,-1e-06,-1e-06,1e-06,-1e-06,1e-06,-1e-06,-1e-06,2e-06,-2e-06,-1e-06,4e-06,1e-06,-1e-06,1e-06,0,1e-06,2e-06,-1e-06,0,-4e-06,1e-06,-8e-06,3e-06,3e-06,-7e-06,2e-06,1e-06,0,-1e-06,0,-1e-06,-2e-06,1e-06,0,1e-06,3e-06,-2e-06,0,-1e-06,0,2e-06,1e-06,-3e-06,-7e-06,1e-06,4e-06,2e-06,0,3e-06,6e-06,-1e-06,0,1e-06,1e-06,-3e-06,-3e-06,1e-06,1e-06,-1e-06,2e-06,1e-06,1e-06,-2e-06,3e-06,1e-06,-3e-06,0,1e-06,-1e-06,7e-06,-4e-06,4e-06,-3e-06,5e-06,4e-06,3e-06,0,-3e-06,0,1e-06,2e-06,-1e-06,1e-06,2e-06,-1e-06,1e-06,0,2e-06,0,0,-2e-06,1e-06,1e-06,2e-06,2e-06,0,0,-1e-06,-4e-06,-7e-06,0
0,-1e-06,0,0,-2e-06,-4e-06,0,3e-06,0,-1e-06,2e-06,0,0,1e-06,-1e-06,3e-06,3e-06,-1e-06,0,0,-1e-06,0,1e-06,1e-06,-1e-06,1e-06,1e-06,0,-1e-06,0,-1e-06,2e-06,0,0,0,0,-1e-06,0,-2e-06,5e-06,-1e-06,7e-06,-5e-06,0,-6e-06,1e-06,-1e-06,1e-06,2e-06,0,1e-06,4e-06,-3e-06,-1e-06,1e-06,-2e-06,2e-06,-1e-06,0,-1e-06,-2e-06,0,1e-06,2e-06,1e-06,-2e-06,-3e-06,0,1e-06,2e-06,2e-06,1e-06,0,-1e-06,1e-06,5e-06,1e-06,0,0,-2e-06,-3e-06,0,-2e-06,-2e-06,-3e-06,-2e-06,0,-1e-06,0,-4e-06,-2e-06,-6e-06,-1e-06,-3e-06,3e-06,-1e-06,1e-06,1e-06,2e-06,-2e-06,-1e-06,0,-2e-06,-2e-06,1e-06,1e-06,-5e-06,2e-06,0,0,-2e-06,0,-1e-06,-1.1e-05,-3e-06,2e-06,2e-06,1e-06,-3e-06,9e-06,0
-2e-06,1e-06,0,0,1e-06,0,0,-1e-06,0,-1e-06,-1e-06,0,0,-1e-06,0,-1e-06,-1e-06,1e-06,1e-06,0,0,-1e-06,-1e-06,0,-2e-06,0,0,-1e-06,2e-06,1e-06,0,0,-2e-06,-1e-06,1e-06,-1e-06,1e-06,-1e-06,6e-06,4e-06,-1e-06,-5e-06,5e-06,0,-3e-06,-1e-06,2e-06,0,-1e-06,2e-06,-1e-06,-4e-06,-2e-06,-1e-06,1e-06,-1e-06,-3e-06,-1e-06,1e-06,-1e-06,2e-06,-1e-06,-3e-06,5e-06,-2e-06,1e-06,0,0,-2e-06,-1e-06,2e-06,-2e-06,1e-06,0,0,-3e-06,-1e-06,0,0,-1e-06,2e-06,-1e-06,0,0,0,2e-06,-2e-06,-3e-06,1e-06,-3e-06,2e-06,6e-06,0,2e-06,-1e-06,-1e-06,-1e-06,1e-06,1e-06,1e-06,0,-1e-06,2e-06,0,0,0,6e-06,2e-06,-1e-06,0,2e-06,-2e-06,2e-06,5e-06,3e-06,0,-3e-06,0,1e-06,-8e-06,-1e-06
-1e-06,-3e-06,0,0,0,5e-06,1e-06,-1e-06,0,0,-1e-06,0,0,0,1e-06,-1e-06,-3e-06,-2e-06,2e-06,0,1e-06,1e-06,0,-1e-06,0,1e-06,0,2e-06,0,0,2e-06,0,0,0,-1e-06,0,0,0,-7e-06,-4e-06,1e-06,1e-06,3e-06,0,4e-06,1e-06,-1e-06,0,1e-06,0,0,4e-06,5e-06,2e-06,-2e-06,2e-06,2e-06,-1e-06,0,2e-06,-1e-06,-2e-06,2e-06,-3e-06,-1e-06,1e-06,2e-06,-1e-06,-4e-06,-5e-06,-2e-06,1e-06,0,1e-06,2e-06,0,1e-06,0,-2e-06,0,1e-06,-1e-06,2e-06,0,1e-06,2e-06,5e-06,0,-1e-06,6e-06,5e-06,-6e-06,1e-06,1e-06,-3e-06,-2e-06,-2e-06,-1e-06,2e-06,0,0,-1e-06,-1e-06,-1e-06,-1e-06,0,-5e-06,0,0,1e-06,2e-06,0,-6e-06,3e-06,-2e-06,-4e-06,6e-06,1e-06,5e-06,6e-06,0
1e-06,3e-06,0,0,-1e-06,-3e-06,-1e-06,2e-06,0,1e-06,2e-06,0,0,1e-06,-1e-06,2e-06,3e-06,1e-06,-1e-06,-1e-06,1e-06,-1e-06,1e-06,0,2e-06,-2e-06,0,-1e-06,0,0,-1e-06,0,-2e-06,0,0,2e-06,-1e-06,1e-06,4e-06,-3e-06,-2e-06,4e-06,-1e-06,0,1e-06,-2e-06,0,0,0,2e-06,0,-3e-06,-7e-06,-1e-06,-3e-06,-2e-06,-2e-06,1e-06,0,0,0,0,-1e-06,-1e-06,1e-06,-2e-06,-1e-06,0,0,-3e-06,-2e-06,0,0,-1e-06,0,1e-06,0,-1e-06,2e-06,0,0,0,1e-06,0,0,1e-06,-5e-06,4e-06,2e-06,-3e-06,1e-06,5e-06,0,-2e-06,-1e-06,2e-06,2e-06,-1e-06,-3e-06,-1e-06,0,2e-06,1e-06,1e-06,0,-1e-06,2e-06,-1e-06,0,0,-2e-06,0,5e-06,1e-06,0,2e-06,-6e-06,-1e-06,1e-06,-5e-06,0
0,-3e-06,0,0,2e-06,-3e-06,-1e-06,0,0,0,0,0,-1e-06,-1e-06,-1e-06,0,-1e-06,0,-1e-06,0,-1e-06,1e-06,0,0,0,2e-06,0,-1e-06,-1e-06,0,0,-1e-06,1e-06,0,0,0,1e-06,-1e-06,-3e-06,-2e-06,3e-06,-7e-06,-3e-06,-2e-06,-3e-06,0,1e-06,0,-1e-06,-2e-06,-1e-06,0,2e-06,-2e-06,1e-06,1e-06,3e-06,1e-06,-1e-06,0,0,1e-06,2e-06,-2e-06,0,2e-06,-1e-06,0,1e-06,3e-06,0,-1e-06,0,0,0,-3e-06,0,1e-06,-3e-06,-1e-06,-2e-06,0,-1e-06,-1e-06,0,-1e-06,2e-06,0,-2e-06,-3e-06,-3e-06,-7e-06,1e-06,3e-06,1e-06,2e-06,1e-06,3e-06,-1e-06,2e-06,1e-06,0,1e-06,0,0,1e-06,5e-06,-3e-06,0,-1e-06,-2e-06,0,-4e-06,2e-06,3e-06,-2e-06,5e-06,1e-06,-3e-06,5e-06,0
