8e-06,1.9e-05,4.9e-05,6.6e-05,4e-06,0.000179,3.2e-05,0.000212,0.000146,0.000145,6.7e-05,0.000227,2.1e-05,5.9e-05,2.3e-05,5.5e-05,3.5e-05,0.000174,3.1e-05,0.000104,3.7e-05,9.5e-05,0.00012,5.4e-05,0.00015,3e-06,9e-06,0.000172,3.7e-05,1e-05,4.6e-05,1e-06,1.1e-05,5e-05,8.5e-05,0.000153,5.6e-05,5.3e-05,3.8e-05,0.000176,5.6e-05,0.000189,3e-05,0.000123,2.7e-05,5e-06,8.3e-05,0.000115,2.8e-05,0.000161,7.4e-05,1.8e-05,0.000111,4.6e-05,0.000176,0.000175,6e-05,0.000152,0.000125,0.000105,1.3e-05,4.8e-05,0.000116,0.00011,0.000217,6e-06,8.1e-05,0.000172,4.9e-05,1e-06,4.7e-05,2.1e-05,7.1e-05,0.00023,5e-06,0.000139,1.4e-05,0.000134,0.000194,0.000255,0.000164,3.5e-05,0.000111,0.00027,6e-06,8.7e-05,4.6e-05,3.6e-05,6.3e-05,7.2e-05,6.7e-05,6.2e-05,0.000135,1.6e-05,8.9e-05,0.000409,4.5e-05,0.000194,8.2e-05,8e-05,0.000136,7e-06,6e-05,5e-06,0.000204,0.000134,1.7e-05,2.7e-05,0.000158,2.6e-05,0.000148,2.5e-05,1.6e-05,9e-05,0.000184,2.2e-05,0.000141,9e-05,0.000213,0.000161,1.6e-05
0.000177,0.000158,0.000105,0.000167,5.8e-05,0.000448,0.000152,0.000433,0.000319,0.000312,0.000144,0.000363,4.7e-05,0.000185,2.1e-05,0.000131,9.3e-05,0.000372,5.2e-05,0.000267,0.000157,0.000116,0.000328,0.000103,0.000259,0.000127,0.000135,0.000373,2.4e-05,4.6e-05,0.000125,4.8e-05,0.000105,1e-05,0.000193,0.000263,0.000141,0.000182,5.7e-05,0.000365,8.8e-05,0.000425,8.9e-05,0.000261,6.6e-05,5e-05,0.000245,0.000285,0.000113,0.00046,7.1e-05,0.000134,0.000189,0.000115,0.000348,0.000426,0.000182,0.000368,0.00033,0.000237,4.4e-05,0.000127,0.000216,0.000211,0.000489,0.000115,0.000113,0.000357,0.000148,7.7e-05,3.8e-05,6.1e-05,0.000112,0.000486,3.2e-05,0.000324,0.000118,0.000323,0.000359,0.000529,0.000431,5.4e-05,0.000234,0.000531,3.3e-05,0.000149,0.000139,6e-05,0.000124,0.000161,7.1e-05,0.000133,0.000186,0.000116,0.000231,0.000783,9.7e-05,0.000372,0.00014,0.000196,0.000293,5.6e-05,0.000141,2.7e-05,0.000505,0.000232,3.8e-05,6.3e-05,0.000364,8.5e-05,0.000272,0.000257,0.000138,0.000116,0.000368,0.000133,0.000253,0.000242,0.000439,0.000323,0.000141
0.000157,0.000158,0.000115,0.000161,0.000122,0.000463,0.000326,0.000643,0.000501,0.000263,0.000385,0.000432,3.5e-05,0.00019,5.9e-05,0.000253,0.000247,0.000469,0.000127,0.000139,0.000171,0.000121,0.00028,0.000244,0.000317,0.000218,0.000148,0.000434,7.3e-05,0.000118,0.000154,0.000152,0.000184,7.5e-05,0.000158,0.000346,7.9e-05,0.000236,1.4e-05,0.000404,2e-04,0.000601,0.000261,0.000338,0.000235,4.7e-05,0.000276,4e-04,0.000279,0.000385,0.000165,0.000128,0.00021,9.5e-05,0.000497,0.000273,0.000258,0.000559,0.000372,0.000205,0.000156,0.000132,0.000152,0.000176,0.000437,7.3e-05,0.000233,0.000457,0.000265,0.000238,0.00018,8.7e-05,0.00021,0.000551,0.000127,0.000276,0.00025,4e-04,0.000349,0.000612,0.000427,0.000101,0.000319,0.000449,0.00016,0.000181,0.000151,2.3e-05,0.000237,6.1e-05,0.000112,0.000165,0.00016,0.000155,0.000203,0.000926,9.1e-05,0.000573,0.000267,0.000357,0.000361,0.000156,0.000116,0.000216,0.00047,0.000505,0.000231,0.000185,0.00033,0.000116,0.000158,3.4e-05,0.000304,0.000286,0.000354,0.00031,2e-04,0.000459,0.000381,0.000436,0.000232
0.000171,0.000636,0.000427,0.00024,0.000179,0.000186,0.000883,0.000309,0.000466,0.00062,0.000233,0.000813,9.1e-05,0.000151,0.000333,0.000473,1.5e-05,0.00077,0.000302,0.00022,0.000572,0.000315,9.6e-05,0.000307,0.000459,0.000628,0.000295,0.000772,0.000184,0.000402,0.000536,0.00038,0.000408,0.000229,0.000306,0.000477,0.000402,0.000392,0.000203,0.00045,0.000438,0.000325,0.00016,0.000499,0.000354,0.000405,0.000419,0.000872,0.000219,0.000493,5.8e-05,0.000248,0.000407,0.000129,0.00073,3e-06,0.000645,0.000741,0.000207,0.000394,0.000317,0.000313,0.000353,0.000354,0.000734,0.00038,0.000525,0.000524,0.000373,0.000247,0.000349,0.000507,0.000498,0.00052,4.8e-05,0.000633,0.000232,0.00062,0.000692,0.000802,0.001174,0.000707,0.000482,0.000968,0.000269,0.000524,0.000133,0.000321,0.000332,0.000196,0.000305,0.000248,0.000487,0.000135,9.2e-05,0.001032,0.00033,0.000634,0.000644,0.000977,0.000896,0.000334,0.000394,0.000165,0.000359,0.000288,0.000218,0.000311,0.000599,0.000508,0.000599,0.000286,0.000622,0.000475,0.000374,0.000459,0.000547,0.000597,0.000559,0.000217,0.000435
0.001081,0.001347,0.001654,0.000578,0.000375,0.000447,0.000996,0.001364,0.000889,0.000738,0.000757,0.000756,0.000472,0.000235,0.000442,0.000943,0.000774,0.001183,0.001437,0.001425,0.000227,0.00038,0.000261,0.000822,0.000426,0.001616,0.001273,0.0014,0.000631,0.00077,0.001063,0.000529,0.000382,0.000406,0.000512,0.000632,0.000921,0.001112,0.000796,0.000694,7e-04,0.000348,0.000471,0.00054,0.000793,0.001317,0.000842,0.001323,0.001416,0.000974,0.000679,0.000383,0.00089,0.000346,0.001244,0.001169,0.000646,0.001354,0.001039,0.000689,0.00084,0.000411,0.000343,0.000348,0.000457,0.000289,0.00027,0.000457,0.000373,0.000243,0.000749,0.000172,0.000651,0.001277,0.000501,0.000913,0.000828,0.000708,0.000666,0.001376,0.001746,0.001437,0.000852,0.000934,0.00066,0.000508,0.000694,0.000856,0.000193,0.000652,0.000121,0.000369,0.001072,0.000477,0.000426,0.001418,0.001552,0.001556,0.00206,0.000856,0.000296,0.000243,0.000969,0.000879,0.000263,9.3e-05,0.000634,0.000416,0.000101,0.000172,0.000891,0.000483,0.000989,0.001059,0.001316,0.000833,0.00139,0.000814,0.00128,0.001061,0.000854
0.000709,0.000237,0.000773,0.000801,0.000717,0.000244,0.000609,0.000413,0.000235,0.000406,0.000552,0.00033,0.000513,0.000806,0.000454,0.000908,0.000756,0.001012,0.000766,0.000523,0.001189,0.000439,0.000113,0.000917,0.000907,0.00111,0.001047,0.000696,0.000448,0.00036,0.000733,0.000629,0.000443,0.000551,0.000442,0.000474,0.000926,0.000935,0.001176,0.000669,0.000374,0.000928,0.000651,0.000554,0.000632,0.000953,0.000883,0.001097,4e-04,0.00038,0.000545,0.000384,0.000759,0.000378,0.001146,0.001769,0.000859,0.000666,0.000907,0.000573,0.000419,0.000441,0.000662,0.000556,0.000892,0.000398,9.6e-05,0.000673,0.00072,0.000394,0.00099,0.001216,0.000995,0.000409,0.000512,7e-06,0.00041,0.000609,0.000255,0.000387,0.000441,0.00071,0.000235,0.000452,0.000223,0.000945,0.001244,0.000699,0.000699,0.000477,0.000481,0.000476,0.000601,6.6e-05,0.000688,0.000808,0.0015,0.000937,0.000841,0.000797,0.00039,0.000293,0.001132,0.000498,0.001027,0.000569,0.000204,0.000858,0.000487,0.000262,0.000639,0.00039,0.000608,0.000303,0.00094,0.000744,0.000808,0.000366,0.000362,0.001138,0.000772
0.00049,0.000747,0.000627,0.000566,0.000509,0.000953,0.000354,5e-04,0.001045,0.000439,0.000326,0.000506,0.000109,0.000387,0.000636,0.000999,0.000423,0.000677,0.000523,0.000656,0.001257,0.001137,0.000521,0.000775,0.001046,0.001226,0.000512,0.000908,0.000328,0.000333,0.000888,0.000368,0.000467,0.00116,0.000384,0.000295,0.001104,0.00036,0.001684,0.000364,0.000449,0.001044,0.000507,0.00052,0.000225,0.001205,0.000537,0.000943,0.000936,0.000884,0.000778,0.000392,0.000596,0.000323,0.000868,0.000533,0.000985,0.000449,0.001288,0.000857,0.00046,0.000245,0.000897,0.000431,0.000922,0.000312,0.000416,0.000709,5.5e-05,0.000119,0.00072,0.000695,0.000642,0.001095,0.000551,3e-04,0.000114,0.000961,0.000982,0.00106,0.000377,0.000823,0.000321,0.001393,0.000629,0.001358,0.000325,0.000589,0.001086,0.000628,0.000375,7.9e-05,0.000784,0.000541,0.001583,0.000854,0.000355,0.001004,0.001336,0.001071,0.000556,0.000218,0.00122,0.000876,0.001741,0.000704,0.000386,0.000718,0.001125,0.000573,0.000526,0.000196,0.000411,0.00075,0.00017,0.001202,0.001189,0.000517,0.000916,0.001421,0.000667
0.001154,0.000849,0.000976,0.000561,0.000376,0.001567,0.000868,0.000357,0.002296,0.001373,0.000986,0.000801,0.000901,0.000721,0.001213,0.002542,0.002427,0.000638,0.00123,0.00156,0.000171,0.000618,0.001952,0.000741,0.002078,0.000966,0.001488,0.001449,0.001326,0.00105,0.000697,0.000881,0.000659,0.000812,0.001651,0.001513,0.000806,0.001271,0.001938,0.00266,0.001863,0.000848,0.002389,0.001666,0.000871,0.001294,0.000804,0.000898,0.000984,0.000477,0.001733,0.001614,0.001942,0.001393,0.000982,0.001587,0.002014,0.000668,0.001266,0.002077,0.001844,0.000554,0.001032,0.000759,0.000426,0.000801,0.000675,0.00064,0.001646,0.000771,0.000813,0.00107,0.001385,0.001355,0.00094,0.00091,0.000459,0.001273,0.000909,0.001062,0.000809,0.001509,0.001059,0.001683,0.00197,0.000924,0.000601,0.001643,0.001322,0.00117,0.000301,0.000234,0.000846,0.001218,0.001973,0.002173,0.000759,0.001393,0.000858,0.003007,0.001868,0.000355,0.001403,0.001278,0.00089,0.002272,0.000989,0.000525,0.001644,0.001164,0.000134,0.000264,0.00079,0.000933,0.000494,0.002061,0.002515,0.001939,0.00161,0.001664,0.002284
0.000491,0.000419,0.00071,0.001935,0.001475,0.001418,0.001222,0.000813,0.002784,0.002825,0.001658,0.001091,0.00091,0.001039,0.002229,0.002925,0.001823,0.001693,0.002507,0.001679,0.001522,0.000509,0.001415,0.001461,0.00175,0.001823,0.000877,0.001743,0.002066,0.000933,1.9e-05,0.000833,0.00152,0.001415,0.00146,0.000583,0.000668,0.001567,0.002112,0.002846,0.001332,0.001668,0.002476,0.00253,0.001899,0.001263,0.001332,0.000855,0.002359,0.001654,0.001493,0.001761,0.001064,0.001084,0.000611,0.001401,0.002554,0.001546,0.000648,0.000664,0.001295,0.001292,0.001382,0.001437,0.000559,0.001851,0.001453,0.00121,0.002322,0.001376,0.001963,0.001896,0.001678,0.002676,0.003278,0.00323,0.00194,0.001793,0.00178,0.001794,0.001145,0.001252,0.001419,0.00148,0.002418,0.001716,0.000495,0.001696,0.000522,0.001238,0.000923,0.000744,0.000539,0.000917,0.002592,0.004039,0.003912,0.003149,0.002199,0.00322,0.003484,0.002118,0.000697,0.000465,0.001025,0.001663,0.001673,0.001048,0.001844,0.001907,0.001242,0.000509,0.000942,0.000917,0.000855,0.00167,0.000289,0.00082,0.000499,0.00224,0.002776
0.000337,0.000937,0.001064,0.001998,0.001536,0.001369,0.000917,0.001626,0.002059,0.000838,0.001311,0.001593,0.001413,0.001175,0.00161,0.001144,0.00066,0.000613,0.000873,0.000421,0.000944,0.000594,0.000667,0.001093,0.000976,0.001754,0.001403,0.000243,0.001159,0.001511,0.001076,0.00022,0.001229,0.000843,0.001008,0.001639,0.001736,0.001469,0.000596,0.001108,0.001053,0.000274,0.001281,0.001326,0.00104,7.7e-05,0.001312,0.000931,0.00145,0.001579,0.001179,0.000996,0.000904,0.000414,0.000478,0.000822,0.001649,0.001172,0.000347,0.000586,0.00036,0.000502,0.000297,0.000676,0.001222,0.00261,0.002421,0.000872,0.000725,0.000497,0.001779,0.000765,0.001117,0.000923,0.001974,0.000447,6e-04,0.000798,0.001135,0.000516,0.000599,0.001006,0.000838,0.001453,0.001654,0.001491,0.000809,0.001526,0.001392,0.000379,1.4e-05,0.00072,0.000776,0.000726,0.001766,0.001828,0.002071,0.00081,0.001795,0.002667,0.001805,0.000973,0.000735,0.001462,0.000957,0.000708,0.000503,0.00034,0.000869,0.001008,0.00041,0.000802,0.000584,0.000702,0.001052,0.00138,0.001439,0.000403,0.00091,0.001494,0.00069
0.000149,0.001174,0.000911,0.001444,0.000805,0.001425,0.000817,0.001858,0.00135,0.000232,0.000598,0.00048,0.000117,0.00061,0.000382,0.000568,0.001045,0.000862,0.00035,0.000549,0.00133,0.000735,0.000581,0.000395,0.001152,0.001488,0.001059,0.000842,0.001232,0.000206,5.7e-05,0.000371,0.001284,0.000988,0.000415,0.001108,0.000378,0.000526,0.00059,0.000726,0.000844,0.001104,0.000991,0.000966,0.001337,0.000842,0.001133,0.000712,0.000929,0.000371,0.001535,0.000905,0.000576,4.8e-05,0.000511,0.000453,0.00148,0.001421,0.001042,0.001332,0.001176,0.00039,0.000253,0.000492,0.000886,0.001958,0.000462,0.001546,0.001067,0.000712,0.000824,0.000345,0.000698,0.001095,0.001148,0.001413,0.000238,0.000862,0.001498,0.001052,0.000546,0.000351,0.000975,0.001181,5e-04,0.000565,0.000851,0.000433,0.000842,0.001168,0.000821,0.000644,0.002179,0.001938,0.001912,0.002699,0.001464,0.000376,0.001325,0.001632,0.00105,0.001269,0.001806,0.00203,0.001491,0.001532,0.00111,0.000862,0.000978,0.001581,0.00132,0.001449,0.001293,0.000444,0.001239,0.000758,0.001661,0.001644,0.002337,0.001404,0.00042
0.000128,0.000746,9.3e-05,0.000701,0.000179,0.000686,0.000904,0.001197,0.00142,0.000909,0.000318,0.000434,7.9e-05,0.00059,0.000551,0.000441,0.00047,0.000514,0.000292,0.000403,0.000371,0.000365,0.000638,0.000828,0.001464,0.000232,0.000853,0.000496,7.5e-05,0.000165,0.000159,8.9e-05,0.000585,0.000273,5.1e-05,0.000391,0.000876,0.000116,0.000342,0.000492,0.00043,0.000708,0.000413,0.000583,0.000232,0.000351,0.000668,0.000571,0.000787,0.000892,0.001188,0.000719,0.000145,0.000141,0.000201,0.000409,0.000474,0.000481,0.000561,0.000613,7e-05,0.000193,0.00029,0.00023,0.000884,0.000291,0.000596,0.000821,0.000218,0.000286,0.000138,0.000269,0.000637,0.00109,0.000219,0.000225,0.000374,0.000626,0.000725,0.000112,0.000136,0.000557,0.000106,0.000411,0.000419,0.000663,0.000497,0.000773,0.00068,0.000256,0.000352,0.000838,0.001503,0.001229,0.000513,0.001186,0.000567,0.000822,0.000475,0.000582,0.000398,0.000895,0.000551,0.000505,0.000517,0.000817,0.000979,0.000619,0.000431,0.000402,0.000548,0.000621,0.000122,0.000378,0.00043,0.000487,0.000767,0.000968,0.000841,0.000983,0.000939
0.000142,0.000283,0.000193,0.000184,0.000174,0.000354,0.000549,0.000547,0.000506,4.9e-05,0.00037,0.000262,0.000333,0.000455,0.000298,6.7e-05,0.000142,3.8e-05,0.000213,0.000167,0.000201,0.000237,0.00034,0.000429,0.000515,0.000433,0.000376,0.000436,0.000178,0.000167,0.000178,0.000182,0.000292,4e-05,0.000158,0.000166,0.000495,0.000119,0.000492,0.000213,0.000243,0.000211,0.000562,0.00017,0.000144,0.000293,0.000417,0.000325,0.000265,0.000556,0.000401,9e-05,0.000273,0.000219,0.000148,0.000213,0.000206,0.000268,0.000443,8.8e-05,0.000199,0.000253,0.000251,0.000111,0.000447,0.000344,0.00027,0.000145,0.000222,0.000276,0.000234,2e-04,0.000343,0.000447,0.000159,0.000151,0.000208,0.00023,0.000293,0.000172,0.000318,0.000239,0.000367,0.000262,1e-04,0.000392,0.000384,0.000335,0.00023,0.000316,5.4e-05,0.000419,0.00075,0.000496,0.000426,0.000603,0.00032,0.000452,0.000146,0.000513,0.000304,0.000362,0.000443,4.7e-05,0.000334,0.000217,0.000487,0.000205,0.000343,0.000149,0.000246,0.000516,0.000232,0.000198,0.000318,0.000296,0.000395,0.000484,0.000575,0.000465,0.000466
0.000393,0.000241,0.000366,0.000128,0.000155,0.000408,0.000525,0.000507,0.000498,0.000293,0.000343,0.000476,0.000237,0.000343,0.000182,0.000309,5.3e-05,0.000119,0.000413,0.000197,0.000346,0.000249,0.000457,0.000623,0.00045,0.000423,0.000693,0.000435,0.00035,0.000218,0.000281,0.000484,0.000199,0.000137,3.9e-05,0.000127,0.000522,0.000324,0.000294,9.2e-05,0.00024,0.000497,0.000599,4.7e-05,0.000305,0.000262,0.000379,0.000479,0.000166,0.000474,0.000249,0.000309,0.00029,0.000139,0.000193,0.000303,0.000388,0.000294,0.000261,0.00018,0.000186,0.000223,9.6e-05,0.000207,7.7e-05,0.000454,0.000171,0.000393,0.000218,0.000272,0.000258,0.000121,0.000203,0.000292,0.000166,0.000243,0.000136,0.00029,6.1e-05,0.000129,0.000172,0.000316,0.000289,0.000256,0.00012,0.000588,0.000319,0.000329,0.000541,0.000539,0.000126,0.000237,0.000316,0.000461,0.000211,0.000324,0.000237,0.000425,0.000243,3.4e-05,0.000324,0.000278,0.000245,0.000122,0.000445,0.000304,0.000297,0.000206,1.8e-05,0.000444,0.000303,0.000251,0.000202,0.000373,0.000174,0.00034,0.000335,0.00058,0.000455,0.000435,0.00028
0.000384,0.000538,0.00033,0.000436,0.000322,0.000171,0.000459,0.000284,0.000294,0.00054,3e-04,0.000732,0.000735,0.000928,0.000407,0.000521,0.000433,0.000204,0.000771,0.000431,9e-04,0.000394,0.000859,0.000434,0.000321,0.000755,0.001031,0.000221,0.000654,0.00031,0.000288,0.000401,0.000408,0.000371,0.000218,0.000251,0.000532,0.00047,0.000708,6.7e-05,0.000546,0.000441,0.000359,0.000165,0.000562,0.000811,0.00051,0.000508,0.00062,0.000129,0.000749,0.000235,0.000366,0.000449,0.00022,0.000264,0.000628,0.000494,0.000355,0.000238,9.4e-05,0.000137,0.000245,0.000347,0.00069,0.000271,0.000373,0.000278,0.000223,0.000333,0.000273,0.00042,0.00019,0.000395,0.00033,0.000536,0.000267,0.000413,0.000415,0.000299,0.00026,0.000228,0.00053,0.000532,3.8e-05,0.000814,0.000698,0.000472,0.000679,0.000267,0.000835,0.000244,0.000545,0.00076,0.000489,0.000557,8.7e-05,0.000298,0.000534,0.000419,0.000217,0.00019,0.00028,0.000172,0.000424,0.000301,0.00053,0.000296,0.000466,0.000666,0.000283,0.000183,0.000534,0.000423,0.000241,0.000267,0.000657,0.000762,9.8e-05,0.000435,0.00038
0.000647,0.000236,0.000685,0.000503,0.000137,0.000441,0.001012,0.000788,0.000732,0.000663,0.001062,0.000939,0.001257,0.001817,0.001206,0.000377,0.000779,0.000809,0.000721,0.001113,0.00078,0.000699,0.000651,0.001195,0.00119,0.001068,0.00202,0.001567,0.001043,0.000647,0.000362,0.000591,0.001268,0.001655,0.000753,0.000759,0.00078,0.000923,2e-05,0.000504,0.000621,0.000385,0.000847,0.000425,0.00103,0.00147,0.001683,0.001412,0.001438,0.000797,0.000763,0.000724,0.00066,0.001105,0.001038,0.000154,0.001006,0.000745,0.000863,0.000308,0.000376,0.000234,0.000486,0.000718,0.00061,0.001141,0.001109,0.000791,0.000715,0.000161,0.00027,0.000266,0.000765,0.000926,0.000864,0.000542,0.000816,0.000913,0.000253,0.000357,0.000576,0.000542,0.000592,0.000543,0.000498,0.001299,0.001922,0.001518,0.001823,0.001668,0.001847,0.001082,0.000479,0.000512,0.000601,0.000256,0.000519,0.000413,0.000853,0.001277,0.000767,0.000244,0.000272,0.000168,0.000252,0.000739,0.001116,0.001106,0.000829,0.000982,0.001231,0.000903,0.000826,0.001349,0.001627,0.000651,0.001365,0.001387,0.000851,0.000821,0.001094
0.000884,0.001085,0.000486,0.00082,0.000184,0.000365,0.000469,0.00015,0.000664,0.001332,0.001683,0.001829,0.000941,0.000888,0.000832,0.000869,0.000261,0.000672,0.001462,0.001292,0.001793,0.001156,0.001323,0.001173,0.000355,0.000812,0.001577,0.001758,0.000901,0.000229,0.000589,0.000683,0.001933,0.001878,0.00134,0.000169,0.00024,0.000382,0.000585,0.000722,0.001219,0.001101,0.000845,0.000134,0.000813,0.000563,0.000828,0.001021,0.000914,0.000527,0.000397,0.000563,0.00055,0.000578,0.000867,0.001358,0.001361,0.000876,0.000644,0.000482,0.000745,0.000501,0.000403,0.000493,0.001107,0.000801,0.00054,0.000146,0.000337,0.00039,0.00013,0.000451,0.001085,0.000405,0.00056,0.000608,0.000823,0.000483,0.000278,0.000533,0.000336,0.000768,0.000381,0.000283,0.000181,0.001167,0.001062,0.000181,0.000804,0.001231,0.001127,0.000771,0.000186,0.000621,0.000715,0.00041,0.000353,0.000295,0.000534,0.001248,0.000942,0.000906,0.000726,0.000374,0.000469,0.000839,0.000656,0.00124,0.000674,0.000843,0.000403,0.000748,0.000923,0.000765,0.001161,0.001423,0.000924,0.000716,0.000536,0.000192,0.000801
0.000596,0.000199,0.000338,0.000837,0.00095,0.000655,0.000405,0.000219,0.000558,0.000358,0.000612,0.000833,0.000792,0.000221,0.000304,0.000407,0.000458,0.000115,0.00079,0.000389,0.000809,0.000854,0.000307,0.000431,0.000622,0.000251,0.000495,0.000495,0.000411,0.000408,0.000104,5e-04,0.001298,3.8e-05,0.000464,0.00038,0.000117,3e-05,0.000206,0.000214,0.000652,0.000271,0.000968,0.000829,0.00016,0.000118,0.000877,0.000863,0.000228,0.000248,0.000315,0.000308,0.000218,0.000635,0.000317,0.000668,0.000304,0.000361,0.000303,0.000429,0.000248,0.00032,0.000512,0.000335,0.000332,0.000418,0.000208,0.000415,5.5e-05,0.00038,3e-04,0.000168,0.000643,0.000313,0.00029,0.000183,0.000227,0.00021,0.000319,0.000353,0.000267,0.00081,0.000526,0.000264,0.00012,0.000539,0.000243,0.000315,0.000433,0.000647,0.000247,0.000295,0.000467,0.00025,0.000361,0.000386,0.000396,2.7e-05,0.000426,0.000384,0.000545,0.000376,0.000285,0.000644,0.000347,0.000376,0.000157,0.000772,0.000534,0.000211,0.000499,0.000291,0.000334,0.000358,0.00072,0.000317,0.0011,0.000542,0.000235,0.000122,0.000879
0.000323,0.000444,0.000342,0.000289,0.000353,0.000101,0.00044,0.000653,0.000311,0.000389,0.000201,0.000453,0.000644,0.000284,0.000314,0.000273,0.000207,0.000161,0.000444,0.000107,0.000658,0.000362,0.000108,0.000276,5.6e-05,0.000198,0.000141,0.00025,0.00015,0.000201,0.000165,0.000502,0.000478,2e-05,2e-04,9.9e-05,0.000187,0.000307,0.000115,0.000288,0.00018,0.000392,0.000528,0.000306,0.000403,0.000123,0.000638,0.000713,0.000402,0.000343,0.000142,0.000382,0.00013,0.000269,4e-04,0.000604,0.00031,0.000387,0.000331,9.3e-05,0.000408,2.5e-05,0.000279,0.000244,0.000233,0.000393,0.000398,0.000508,0.000442,0.000158,0.000137,7.5e-05,0.000467,0.000177,4.9e-05,8e-05,0.000247,0.000349,0.000341,4.4e-05,0.000538,0.000561,0.000175,0.000185,0.000302,0.000474,0.000541,0.00039,0.000137,0.000217,0.00021,6.7e-05,0.000205,0.000174,0.000198,0.000345,0.000625,0.000472,0.000205,0.000379,0.000394,0.00047,0.000164,0.000395,0.000536,0.000808,0.000608,0.000299,0.000267,0.000334,0.000333,0.000331,0.000303,0.00041,8.7e-05,0.000263,0.000189,0.000299,0.000307,0.000193,0.000419
0.000169,0.00041,0.000147,0.000169,0.000263,0.000423,0.000217,0.000286,7.7e-05,0.000178,0.00021,0.000452,0.000341,0.000478,0.000506,0.000589,0.00026,0.000503,0.00042,0.000282,0.000169,0.000267,0.000479,0.000133,0.000182,0.000112,0.000142,0.000446,0.000274,0.000164,0.00013,0.000437,0.000127,0.000442,0.000257,0.000115,0.000178,0.000327,0.000218,0.000138,0.000128,0.000175,0.000391,0.000413,0.000386,0.000389,0.000112,0.000164,0.000468,0.00022,0.00024,0.000117,0.000104,8.3e-05,0.000121,0.000424,0.00023,0.000103,0.000139,0.000155,0.000356,0.000188,0.00011,0.00018,0.000167,0.000205,7e-05,0.000248,0.000147,0.000243,0.000209,2.8e-05,0.00023,0.000329,0.000136,0.000223,0.000295,0.000218,0.000534,0.000238,0.000328,0.000285,0.000253,0.000232,0.000381,0.000318,0.000338,0.000195,0.000354,0.000492,0.000322,5e-05,7.1e-05,0.00024,9.4e-05,0.00029,0.000359,0.000326,0.000249,0.00013,0.000169,1.7e-05,0.000248,7.8e-05,0.000455,0.000378,0.000376,0.00036,0.000465,0.000202,0.000398,0.000465,0.000219,0.000618,0.000146,4.7e-05,0.000264,0.000266,0.00026,9.2e-05,0.000227
0.000178,0.000315,0.000217,0.000211,0.000142,0.000367,0.000233,0.00012,0.000318,0.000371,0.000107,0.000215,0.00014,0.000241,0.000412,0.000134,0.000243,0.000372,0.000332,0.000149,0.000305,8.6e-05,0.000378,0.000215,0.000141,8.5e-05,5.2e-05,0.000422,0.000309,0.000112,0.000124,0.000272,0.000414,8e-05,3.1e-05,0.000166,8.9e-05,0.000322,0.000202,0.000115,0.000124,0.00019,0.000198,0.000173,0.000219,0.000351,0.000238,0.000216,0.000286,0.000198,0.00041,7.6e-05,0.000137,9.1e-05,9.9e-05,0.000442,5.2e-05,0.000129,8.6e-05,4.8e-05,0.00019,0.000235,0.000187,6.2e-05,7.2e-05,0.000147,6.3e-05,5.9e-05,0.000294,0.000208,0.000123,6.3e-05,0.000177,0.000454,0.00023,0.000209,0.000105,7.4e-05,0.000274,0.000282,0.000384,0.000138,7.1e-05,0.000157,0.000114,0.000324,0.000305,0.000112,0.000365,0.000192,0.000222,0.000181,0.000228,6.3e-05,9.1e-05,8.6e-05,0.000257,9.7e-05,0.000215,0.000235,0.000179,0.000168,0.000151,0.00011,0.000317,0.000153,0.000418,0.000122,0.00033,0.000228,0.000245,0.000263,0.000233,0.000312,0.00024,0.000154,0.00032,0.000206,0.000231,0.000336,0.000189
0.000175,0.00038,0.000224,0.000215,0.00033,8.2e-05,8.9e-05,3e-05,0.000208,0.000192,0.000151,0.00016,3.7e-05,0.000147,0.000251,0.000245,0.000267,0.000144,0.000135,0.000246,0.000254,9.4e-05,8.6e-05,0.000123,7.1e-05,5e-06,0.000144,0.000126,8.3e-05,7.3e-05,1.6e-05,0.000248,0.000445,0.000149,0.000128,0.000147,0.000143,0.000264,0.000164,4.8e-05,0.000162,6.2e-05,0.000135,0.00025,0.000302,0.000165,9.9e-05,0.000129,2.4e-05,0.00014,0.000174,0.000211,0.000127,6.1e-05,2e-05,0.000245,0.000205,0.000313,8.9e-05,0.000191,7.8e-05,0.000196,0.000339,0.000129,4e-05,0.000203,0.000188,0.000141,0.000255,8.8e-05,6.9e-05,6.9e-05,0.000132,7.2e-05,6.8e-05,0.000154,0.000284,0.000133,0.00014,0.000207,0.00034,7.6e-05,4.4e-05,0.000145,0.000168,8.6e-05,6.5e-05,6.2e-05,0.000384,0.000324,0.000266,0.000351,2.6e-05,0.000162,0.000103,2.2e-05,6.2e-05,0.000143,0.000175,0.000221,6.8e-05,0.000196,0.000116,0.000185,0.000264,4.1e-05,0.000178,0.000224,0.00026,0.000202,0.000422,0.000245,0.000172,0.00028,0.000227,9.9e-05,0.000137,0.000362,6.6e-05,7.6e-05,0.000234
0.000108,4.7e-05,0.00012,0.000172,8.5e-05,0.000124,6.8e-05,5.2e-05,2.8e-05,0.000101,8.3e-05,0.000118,9.3e-05,4e-05,0.000108,0.000104,2.5e-05,2.5e-05,5e-05,6.9e-05,8.7e-05,5.9e-05,8.7e-05,6.5e-05,8.7e-05,0.000107,5e-05,3.1e-05,4.1e-05,1.5e-05,3.2e-05,9.7e-05,5.2e-05,0.000198,8.5e-05,8.2e-05,0.000106,0.000127,9.5e-05,8.1e-05,4.6e-05,0.000103,3.4e-05,0.000121,2.1e-05,6.7e-05,1.6e-05,5.3e-05,9.2e-05,4e-06,8.8e-05,0.000101,0.000149,1e-04,8.7e-05,0.000115,6.3e-05,5e-05,8.8e-05,2.9e-05,2.7e-05,7.2e-05,7.1e-05,0.000121,7.3e-05,2.2e-05,9e-05,5.9e-05,8.7e-05,1.1e-05,7e-06,5.4e-05,0.000102,3.3e-05,7.8e-05,0.000162,8.4e-05,0.00016,0.000122,6e-05,0.000217,9.9e-05,0.000124,0.000123,0.000112,0.000154,6.3e-05,0.000152,9.2e-05,0.00011,0.000116,5.9e-05,0.000162,0.000142,8.3e-05,7.5e-05,3.5e-05,6.3e-05,9.7e-05,0.000207,0.000105,7.8e-05,0.000101,9.7e-05,7.4e-05,4.9e-05,0.000104,9.7e-05,0.000113,3.9e-05,0.00013,0.000157,0.000107,0.00013,6.8e-05,0.000109,7.5e-05,2e-04,6.7e-05,7.7e-05,0.000128
6.7e-05,7e-05,5.6e-05,8e-05,2.3e-05,7.9e-05,7.3e-05,1.7e-05,2.6e-05,5.3e-05,3.2e-05,0.000104,2.2e-05,6e-05,7.4e-05,3.2e-05,4.8e-05,3.7e-05,7.3e-05,3.4e-05,7.4e-05,2.5e-05,4.5e-05,2.7e-05,5.8e-05,5.7e-05,3.5e-05,5.8e-05,5.4e-05,1.2e-05,4.8e-05,9e-06,0.000124,8.4e-05,2.8e-05,8.4e-05,9.3e-05,7.9e-05,2.7e-05,4e-05,1.9e-05,4.6e-05,7.2e-05,6.4e-05,7.4e-05,3e-05,2.8e-05,1.1e-05,5.1e-05,6e-06,5.7e-05,6.6e-05,1.1e-05,3.1e-05,7.3e-05,9.1e-05,3.5e-05,3.1e-05,4.1e-05,5.2e-05,3.4e-05,5.2e-05,5.5e-05,2.8e-05,4.5e-05,3.9e-05,1.8e-05,3.5e-05,4.6e-05,3.6e-05,1e-05,6.6e-05,4.5e-05,2.9e-05,1.8e-05,8.9e-05,5.5e-05,7.2e-05,8.1e-05,3.3e-05,8.8e-05,3.5e-05,6.4e-05,8.4e-05,4.7e-05,0.000121,0.000101,6.8e-05,4.4e-05,0.000118,4.9e-05,1.3e-05,0.000119,5.8e-05,3.2e-05,5.1e-05,2.8e-05,3.1e-05,2.1e-05,0.000151,3.5e-05,8e-06,2.7e-05,3.5e-05,6e-05,8e-05,6.8e-05,6.9e-05,8.3e-05,4.1e-05,3.8e-05,1.1e-05,4e-05,9.9e-05,2.1e-05,4.1e-05,9.7e-05,9.1e-05,2.7e-05,8.3e-05,8e-05
6.4e-05,8.8e-05,2.4e-05,7e-05,3.1e-05,5.9e-05,6e-05,2e-05,4.7e-05,4.7e-05,1.9e-05,6.4e-05,3.1e-05,5.7e-05,7e-05,2.7e-05,4.1e-05,1.2e-05,5.6e-05,2.7e-05,8.9e-05,2.3e-05,3.8e-05,1.2e-05,3e-05,3e-05,1.7e-05,4.7e-05,5e-05,1.9e-05,2.1e-05,3.5e-05,0.000133,6.3e-05,2.8e-05,4.6e-05,6.6e-05,4.8e-05,3.4e-05,2.4e-05,1.9e-05,3.8e-05,6.6e-05,3.7e-05,5.3e-05,3e-05,3.6e-05,2.2e-05,4e-05,1.6e-05,1.2e-05,2.4e-05,3.7e-05,2.2e-05,2.9e-05,7.3e-05,1.5e-05,2.3e-05,3.4e-05,3.5e-05,2.7e-05,3.2e-05,4e-05,3.2e-05,6.4e-05,2.5e-05,3e-06,2e-05,3e-05,1.5e-05,1.3e-05,3.7e-05,5e-05,3.5e-05,2.3e-05,4.1e-05,5.5e-05,3.6e-05,5.7e-05,1.9e-05,6.5e-05,1.7e-05,2.9e-05,5.8e-05,2.2e-05,7.6e-05,6.5e-05,5.2e-05,4.9e-05,8.2e-05,4.6e-05,2.6e-05,7.8e-05,4.2e-05,4.7e-05,4.6e-05,3.4e-05,1.3e-05,2.9e-05,0.000133,3.2e-05,1.3e-05,5.7e-05,2.1e-05,6.5e-05,8.2e-05,7.1e-05,3e-05,9.4e-05,3.6e-05,2.7e-05,1.7e-05,3.6e-05,9.3e-05,3.3e-05,5.4e-05,8.8e-05,7e-05,1.8e-05,5.4e-05,6.3e-05
4.6e-05,7.3e-05,2.2e-05,5.7e-05,2.3e-05,4.5e-05,5e-05,2.1e-05,4.1e-05,4e-05,1.8e-05,5.6e-05,2.9e-05,4.6e-05,5.1e-05,5e-06,4.2e-05,1.9e-05,5.5e-05,2.3e-05,8.8e-05,2e-05,2.4e-05,1.1e-05,4.3e-05,2.3e-05,2.6e-05,3.7e-05,4.6e-05,2.7e-05,1e-05,4.7e-05,0.000106,6.4e-05,1e-05,4e-05,5.8e-05,3e-05,2.6e-05,3e-05,1.8e-05,3.9e-05,5.4e-05,3.9e-05,5.4e-05,3.4e-05,2.5e-05,1.7e-05,6.5e-05,8e-06,2.2e-05,1.5e-05,3.6e-05,1.1e-05,2.5e-05,6.7e-05,2e-05,4e-06,3.3e-05,4.2e-05,2e-05,9e-06,3.4e-05,2.7e-05,3.6e-05,2.5e-05,1.3e-05,2.2e-05,1.6e-05,3.5e-05,3.3e-05,2.7e-05,4.5e-05,4.4e-05,1.4e-05,4.9e-05,3.5e-05,3.9e-05,4.7e-05,8e-06,5.4e-05,3.4e-05,3.1e-05,5.8e-05,8e-06,6.4e-05,6.3e-05,5.3e-05,3e-05,5.7e-05,3.2e-05,2.4e-05,7e-05,1.5e-05,3.9e-05,3.8e-05,1.3e-05,2.2e-05,2e-05,0.000143,2.9e-05,4e-05,4.3e-05,5e-06,6.6e-05,7.1e-05,8.4e-05,2.3e-05,1e-04,4.5e-05,1.4e-05,3.5e-05,4.8e-05,0.000102,1.8e-05,4.4e-05,8.3e-05,7.8e-05,1.5e-05,6.6e-05,5.3e-05
6.7e-05,7.2e-05,2.7e-05,3e-05,2.2e-05,4.6e-05,5.4e-05,3.2e-05,3.1e-05,4e-05,1.3e-05,5.3e-05,3.1e-05,5.8e-05,5e-05,2.2e-05,4.5e-05,1e-06,5.4e-05,1.2e-05,6.3e-05,1.8e-05,2.1e-05,2.9e-05,3.1e-05,3.9e-05,4.1e-05,5e-06,3.8e-05,1e-06,1.3e-05,3.7e-05,0.000106,4e-05,6e-06,3.8e-05,5.7e-05,2.5e-05,1.7e-05,4.8e-05,3.5e-05,2.9e-05,6.9e-05,3.6e-05,3.8e-05,2.6e-05,2.5e-05,1.8e-05,4.1e-05,1.4e-05,1.3e-05,2.5e-05,1.7e-05,7e-06,1.5e-05,7.7e-05,1.8e-05,1.9e-05,2.3e-05,3.7e-05,3.5e-05,1.6e-05,4.3e-05,1.8e-05,3.8e-05,3.5e-05,1.8e-05,1e-05,3.1e-05,4.6e-05,4e-06,2.3e-05,3.8e-05,4.2e-05,3e-05,2.1e-05,3.3e-05,4.1e-05,3.8e-05,9e-06,5.2e-05,1.7e-05,2.3e-05,3.3e-05,1e-05,5.9e-05,5.7e-05,5.1e-05,2.3e-05,6.4e-05,3.7e-05,2.6e-05,6.8e-05,3.3e-05,1.3e-05,1.6e-05,1.5e-05,9e-06,2.2e-05,0.000141,2.4e-05,3.1e-05,4.9e-05,2.3e-05,6e-05,5.7e-05,7.6e-05,4e-05,7.8e-05,3.5e-05,2.8e-05,3.7e-05,2.4e-05,9e-05,2.3e-05,4.4e-05,6.9e-05,9.2e-05,1.6e-05,5e-05,5.3e-05
4.5e-05,8.2e-05,2.4e-05,5.1e-05,2.2e-05,4.2e-05,4.1e-05,3.4e-05,4.6e-05,5e-05,1e-06,2.9e-05,2e-05,4.7e-05,3.2e-05,1.8e-05,4.1e-05,1.8e-05,3.9e-05,1.6e-05,7.8e-05,1e-05,3.1e-05,1.8e-05,3.8e-05,3.6e-05,2.1e-05,2.1e-05,2.6e-05,3e-05,1.7e-05,1.9e-05,0.000109,5.3e-05,1.4e-05,3.4e-05,5.5e-05,2.9e-05,2.6e-05,4.6e-05,1.3e-05,4.1e-05,6.7e-05,1.2e-05,6.2e-05,2.1e-05,2.9e-05,1.2e-05,4.6e-05,3e-06,7e-06,3.6e-05,2.2e-05,1e-05,3e-05,7e-05,1.8e-05,1.2e-05,2.8e-05,2.2e-05,2.8e-05,2e-05,3.5e-05,1.8e-05,2.7e-05,4.6e-05,4e-06,7e-06,2.7e-05,3.1e-05,2.2e-05,3.3e-05,4.6e-05,3.4e-05,1.7e-05,2.2e-05,4e-05,4e-05,5.1e-05,1.7e-05,5.4e-05,2e-05,1.1e-05,3.7e-05,2e-05,4.7e-05,5.2e-05,4.8e-05,2.6e-05,6.6e-05,1.8e-05,1.7e-05,4.6e-05,3e-05,3.5e-05,1.6e-05,5.5e-05,3.1e-05,1.1e-05,0.000134,3e-05,1.6e-05,5.2e-05,1.6e-05,3.7e-05,8e-05,6.9e-05,3.6e-05,9.6e-05,3.3e-05,2.2e-05,1.6e-05,2.8e-05,8.8e-05,1.9e-05,4.4e-05,6.1e-05,5.9e-05,3.4e-05,5.3e-05,6.2e-05
4.9e-05,6e-05,1.8e-05,4.4e-05,1.7e-05,3.7e-05,3.2e-05,2.5e-05,2.3e-05,3.1e-05,2.3e-05,3.6e-05,1.1e-05,3.6e-05,5.1e-05,3.5e-05,4.5e-05,2.3e-05,5.7e-05,2e-06,7.3e-05,5e-06,2.1e-05,1.5e-05,5e-05,2.1e-05,4e-05,1.6e-05,2.2e-05,3.1e-05,1.4e-05,2.8e-05,0.000128,3.6e-05,3.1e-05,3.7e-05,5.5e-05,3.3e-05,3.7e-05,2.5e-05,2.4e-05,4.1e-05,4e-05,2.5e-05,5.9e-05,2.3e-05,1.3e-05,2e-06,6.8e-05,1.4e-05,1e-05,3.8e-05,4.2e-05,1.4e-05,2.6e-05,6.1e-05,1e-05,1.7e-05,1.8e-05,2.5e-05,3.5e-05,1.6e-05,4.8e-05,1.4e-05,3.2e-05,4.8e-05,1.4e-05,7e-06,1.6e-05,3.2e-05,2.9e-05,2.2e-05,3.2e-05,2.3e-05,1.3e-05,1.4e-05,3.3e-05,3.1e-05,5.2e-05,1.5e-05,4.9e-05,1.9e-05,2.1e-05,2.9e-05,7e-06,5.4e-05,4.1e-05,6.7e-05,4e-05,6e-05,2.4e-05,3.1e-05,5.6e-05,3.9e-05,4.1e-05,1.4e-05,5.5e-05,2.6e-05,8e-06,0.000101,4.5e-05,2.9e-05,5.1e-05,1.4e-05,3.5e-05,8.7e-05,4.9e-05,4.7e-05,8.7e-05,3.7e-05,1.9e-05,5e-06,8e-06,5.6e-05,2.2e-05,4.1e-05,5.8e-05,6.9e-05,2e-05,4.3e-05,4.5e-05
4.3e-05,6.7e-05,2e-05,3.3e-05,3.9e-05,2.3e-05,6.3e-05,5.2e-05,6.6e-05,2.8e-05,4.3e-05,4.4e-05,1.4e-05,2.4e-05,5.3e-05,3.5e-05,3.1e-05,2e-05,4.9e-05,2.2e-05,8e-05,3.6e-05,6.7e-05,2.5e-05,1.8e-05,2.6e-05,2.3e-05,6.3e-05,4e-05,3.5e-05,3.5e-05,2.3e-05,0.000101,4.9e-05,3.4e-05,8e-06,0.000118,3.5e-05,2.1e-05,3e-06,2.2e-05,4.2e-05,3.3e-05,2.2e-05,8.6e-05,8e-06,2e-05,2.1e-05,6.2e-05,6.3e-05,5.9e-05,4.3e-05,3.7e-05,1.4e-05,9e-06,4.3e-05,2.9e-05,2.7e-05,5.2e-05,1.2e-05,4.4e-05,2.2e-05,3.6e-05,3.3e-05,2.2e-05,3.8e-05,1.2e-05,9e-06,5e-06,3.1e-05,2.8e-05,2.2e-05,4.1e-05,4.3e-05,4e-06,2.4e-05,6.7e-05,2.6e-05,3.2e-05,3.7e-05,1.5e-05,2.1e-05,5e-06,2.1e-05,1.6e-05,6.7e-05,2.7e-05,3.3e-05,4e-05,7.8e-05,1.5e-05,2.5e-05,6.1e-05,2.9e-05,4.4e-05,4.6e-05,7.2e-05,4.9e-05,2.9e-05,0.00011,4.8e-05,3.2e-05,7.2e-05,2.8e-05,4e-06,0.000106,9.4e-05,3.6e-05,0.000111,1.8e-05,3.6e-05,3.2e-05,4.1e-05,0.000114,4.4e-05,1.8e-05,5.2e-05,8.5e-05,8e-06,4.7e-05,1.9e-05
4.3e-05,0.000108,5e-06,3.8e-05,4e-05,7.5e-05,8.1e-05,1.5e-05,4e-05,5.7e-05,3.1e-05,7.5e-05,9.6e-05,3.4e-05,5.7e-05,5.1e-05,9.9e-05,3.9e-05,7.1e-05,4.9e-05,2.8e-05,4e-06,6.1e-05,3.7e-05,2.7e-05,4.5e-05,6.3e-05,6.4e-05,6.1e-05,4.8e-05,6.4e-05,2.4e-05,8.9e-05,4.9e-05,1.3e-05,3.5e-05,0.000117,9.1e-05,6e-05,1.6e-05,3.5e-05,7.8e-05,1.7e-05,7.8e-05,5.3e-05,9.1e-05,8.7e-05,3.8e-05,6.4e-05,8.5e-05,5.3e-05,1.4e-05,4.6e-05,4.9e-05,6.4e-05,7.9e-05,3.6e-05,4.2e-05,4.9e-05,7.5e-05,2.2e-05,4.3e-05,4.4e-05,2.7e-05,1.4e-05,1.5e-05,4.3e-05,2.3e-05,1.3e-05,8e-05,7e-05,2.5e-05,7.8e-05,5.1e-05,4.3e-05,3.6e-05,4.7e-05,3.3e-05,5.6e-05,6.9e-05,4.4e-05,5.3e-05,3.7e-05,3.1e-05,6e-06,5.2e-05,6.7e-05,4.3e-05,5e-05,5.3e-05,8.2e-05,4.4e-05,9.8e-05,2.2e-05,3e-05,1.6e-05,7e-05,6.1e-05,9e-06,0.000126,4.7e-05,3.5e-05,9.6e-05,0.000106,7e-05,6.4e-05,1.4e-05,2.5e-05,0.000109,7e-05,1.9e-05,4.7e-05,2.8e-05,7.2e-05,2.5e-05,5.4e-05,2.3e-05,0.000135,8.3e-05,9.5e-05,3e-05
8e-06,4.8e-05,2.2e-05,4.3e-05,1.3e-05,3.7e-05,2.1e-05,3e-06,1.8e-05,2.6e-05,2.7e-05,7.1e-05,4.9e-05,6.7e-05,4e-05,6.4e-05,7.5e-05,4.9e-05,4.5e-05,2.1e-05,4.3e-05,1.3e-05,3.6e-05,7e-06,1.6e-05,1.9e-05,8e-06,7.1e-05,6.2e-05,6.1e-05,1.4e-05,4.1e-05,8.6e-05,7.8e-05,4.5e-05,3.6e-05,4.2e-05,3.2e-05,4.2e-05,3e-05,1e-05,2.4e-05,5.8e-05,3.8e-05,8.9e-05,8.5e-05,9e-06,2.2e-05,6.1e-05,3.4e-05,1.6e-05,2.3e-05,5e-05,5e-05,6e-06,4.5e-05,2e-06,4.7e-05,1.8e-05,5.4e-05,4.4e-05,3.5e-05,5.4e-05,5e-06,1.4e-05,2.1e-05,2.6e-05,3.1e-05,3.8e-05,4.1e-05,1.7e-05,7.6e-05,5.5e-05,1.8e-05,2.7e-05,3.6e-05,2.4e-05,1.6e-05,7.6e-05,2e-05,5.3e-05,4.2e-05,3.2e-05,3.3e-05,6e-06,3.4e-05,6e-05,4.5e-05,3.5e-05,2.9e-05,3.3e-05,2.1e-05,6.4e-05,4.3e-05,2.9e-05,6.3e-05,4.9e-05,3.7e-05,4.8e-05,0.000117,2.9e-05,2.1e-05,4.3e-05,6.5e-05,4.3e-05,2.3e-05,6.3e-05,4.1e-05,7.4e-05,3.2e-05,1.6e-05,4.2e-05,8.1e-05,8.9e-05,2.3e-05,7.3e-05,6.4e-05,9.8e-05,8.5e-05,2.1e-05,5.4e-05
1.3e-05,7.4e-05,7e-06,5.4e-05,1e-06,1.9e-05,5.2e-05,3.9e-05,3.4e-05,3.7e-05,1.3e-05,3.4e-05,8e-06,2.5e-05,5e-05,4.2e-05,3e-05,1.3e-05,5e-05,1.2e-05,5.5e-05,1e-05,1e-05,3e-05,1.5e-05,1.2e-05,3.3e-05,4.8e-05,2.5e-05,2.9e-05,2.3e-05,3.9e-05,6.7e-05,2.8e-05,5e-06,1.1e-05,3.3e-05,1.7e-05,2.8e-05,2.5e-05,2.4e-05,1.6e-05,4.8e-05,2.6e-05,4.8e-05,3.1e-05,1.6e-05,2.2e-05,4.9e-05,2.3e-05,2.6e-05,3.5e-05,1.4e-05,1.8e-05,2e-05,2.9e-05,2.6e-05,4.4e-05,1.2e-05,3.9e-05,1.4e-05,1.2e-05,4.8e-05,2.4e-05,5e-06,3.9e-05,3.1e-05,1.9e-05,4.3e-05,4.1e-05,2.4e-05,3.5e-05,6.4e-05,2.3e-05,1.6e-05,2.2e-05,2.9e-05,3.6e-05,5.6e-05,1.7e-05,7.3e-05,2.4e-05,1.4e-05,2.9e-05,4e-06,5.2e-05,4.6e-05,3.9e-05,1e-06,1.9e-05,3e-05,2.1e-05,4.6e-05,4.1e-05,2.5e-05,4.2e-05,9e-06,1.9e-05,2.4e-05,8.7e-05,3.9e-05,5.3e-05,2.9e-05,2e-05,4.5e-05,4.7e-05,3.5e-05,1.8e-05,3.4e-05,2.4e-05,3.9e-05,2.3e-05,4.6e-05,5.4e-05,1.4e-05,6.5e-05,5.8e-05,9.2e-05,3.5e-05,6.4e-05,8.1e-05
2.3e-05,7.2e-05,1e-05,5.9e-05,2.1e-05,5e-06,4e-05,2.5e-05,1.6e-05,2.4e-05,6e-06,3.9e-05,1.8e-05,2.4e-05,5.9e-05,1.5e-05,3.7e-05,6e-06,4.6e-05,3.9e-05,5.7e-05,1.8e-05,1.1e-05,9e-06,1.6e-05,8e-06,3.8e-05,4.6e-05,4.2e-05,1.6e-05,1.3e-05,4.4e-05,6.9e-05,3.1e-05,8e-06,1.6e-05,3.5e-05,1.1e-05,3.8e-05,1.3e-05,1.9e-05,2.5e-05,5.1e-05,1.7e-05,3e-05,3.7e-05,2.1e-05,2.6e-05,5.8e-05,4e-05,3.1e-05,3.5e-05,1e-05,2.3e-05,2.3e-05,3e-05,1e-05,3.1e-05,1.4e-05,2e-05,2e-05,7e-06,2.6e-05,6e-06,2.3e-05,3.2e-05,1.9e-05,6e-06,3.4e-05,2.7e-05,2.3e-05,2.6e-05,3e-05,2.1e-05,1.1e-05,2.4e-05,3.1e-05,2.1e-05,4e-05,1.8e-05,5.5e-05,2e-05,5e-06,2e-05,8e-06,3.3e-05,3.9e-05,4.2e-05,1.2e-05,2.5e-05,3.2e-05,1e-05,4.8e-05,3.6e-05,1.3e-05,3.3e-05,6e-06,2.1e-05,9e-06,0.000109,3.9e-05,3.3e-05,1.7e-05,1.2e-05,3.8e-05,5.1e-05,3e-05,3.8e-05,4.4e-05,1.5e-05,4e-05,4e-06,4.4e-05,5.7e-05,1.6e-05,4.7e-05,3.9e-05,7.8e-05,3.6e-05,4.5e-05,5.7e-05
3e-05,7.4e-05,2e-05,4.6e-05,2.3e-05,6e-06,4.5e-05,1.9e-05,3e-05,2.7e-05,1.1e-05,5.3e-05,1.7e-05,2.9e-05,3.7e-05,3e-05,2.1e-05,1.2e-05,2.9e-05,1.5e-05,4.9e-05,1.5e-05,3.3e-05,2.8e-05,2e-05,8e-06,1.8e-05,1.9e-05,3.8e-05,2.1e-05,1.9e-05,2.3e-05,7.7e-05,2.6e-05,3e-06,1.3e-05,3.4e-05,2.2e-05,4.6e-05,2.6e-05,7e-06,3.3e-05,5e-05,1.8e-05,3.1e-05,3.9e-05,9e-06,1.5e-05,2e-05,2.2e-05,3.1e-05,2.1e-05,6e-06,2.9e-05,2.3e-05,2.7e-05,2e-05,3.3e-05,1.6e-05,3.3e-05,2.2e-05,1.1e-05,3.5e-05,1e-05,2.5e-05,3.4e-05,5e-06,3e-06,2.4e-05,3.9e-05,1.4e-05,2.1e-05,3.3e-05,1.7e-05,1.1e-05,2.4e-05,4.3e-05,2.5e-05,5.4e-05,9e-06,6e-05,2.2e-05,1.4e-05,2.6e-05,2.6e-05,3.7e-05,1.9e-05,3.5e-05,1.1e-05,2.4e-05,1e-05,1.2e-05,5.5e-05,2.9e-05,2.2e-05,2.3e-05,2e-06,1.7e-05,1.2e-05,9.5e-05,2.8e-05,3.8e-05,2.4e-05,9e-06,2.7e-05,4.5e-05,4e-05,2e-05,5.5e-05,1.4e-05,3.6e-05,5e-06,3.8e-05,6e-05,1.2e-05,5.3e-05,3.7e-05,6.4e-05,2.7e-05,2e-05,5.3e-05
2.6e-05,6.5e-05,1.2e-05,5.3e-05,1.2e-05,2.3e-05,3.5e-05,1.5e-05,2e-05,3.5e-05,1.8e-05,3.8e-05,3e-06,2.9e-05,2.3e-05,1.6e-05,1.8e-05,3e-06,2.7e-05,2.2e-05,5.8e-05,1.2e-05,2.6e-05,2.5e-05,2e-05,1e-05,2.3e-05,2.7e-05,3.5e-05,1.3e-05,1.1e-05,3.8e-05,8.4e-05,1e-05,2.4e-05,2.1e-05,3.6e-05,2.1e-05,2.6e-05,1.2e-05,1.5e-05,2.2e-05,4.4e-05,8e-06,3.7e-05,2.7e-05,6e-06,1.5e-05,2.3e-05,1.7e-05,2.2e-05,2.1e-05,9e-06,1.8e-05,2.8e-05,3.8e-05,1.1e-05,2.8e-05,1.3e-05,2e-05,2.2e-05,5e-06,3.7e-05,1.3e-05,1.5e-05,2.6e-05,2e-06,1.2e-05,2.8e-05,3.8e-05,2.1e-05,2.6e-05,4e-05,2.4e-05,8e-06,2.5e-05,3.2e-05,2.1e-05,3.8e-05,6e-06,4.9e-05,1.7e-05,1.4e-05,1.5e-05,2.9e-05,2.7e-05,3.8e-05,2.5e-05,5e-06,2.5e-05,1.1e-05,9e-06,4.9e-05,1.6e-05,1.2e-05,1.7e-05,1.2e-05,2e-05,8e-06,9.2e-05,1.7e-05,3.6e-05,2.4e-05,8e-06,3.5e-05,5e-05,5.3e-05,2.8e-05,5.5e-05,2.3e-05,3.1e-05,9e-06,2.9e-05,6.8e-05,1.5e-05,4.5e-05,4.9e-05,7.5e-05,3e-05,4.5e-05,4.2e-05
3.9e-05,7.1e-05,1.3e-05,5.1e-05,1.2e-05,1.8e-05,4.6e-05,4e-06,2.4e-05,2.2e-05,1.1e-05,3.4e-05,8e-06,3.4e-05,3.8e-05,1.3e-05,3e-05,8e-06,3e-05,1.2e-05,4.9e-05,1.4e-05,1.6e-05,1.3e-05,1.7e-05,1.8e-05,1.6e-05,3e-05,3.1e-05,2.1e-05,6e-06,4.3e-05,5.1e-05,3.1e-05,5e-06,1.6e-05,3.2e-05,7e-06,3.5e-05,1.6e-05,1.1e-05,2.4e-05,5e-05,9e-06,2.3e-05,1.3e-05,9e-06,2.7e-05,2.7e-05,1.1e-05,1.6e-05,1.9e-05,8e-06,1.4e-05,1.9e-05,4.4e-05,2.2e-05,3.4e-05,1.1e-05,2.1e-05,3.1e-05,1.4e-05,2.3e-05,7e-06,2.8e-05,2.5e-05,5e-06,1.1e-05,1.1e-05,4.1e-05,1e-05,2.3e-05,5e-05,1.3e-05,3e-06,2.1e-05,2.7e-05,1.2e-05,5.4e-05,3e-06,5e-05,2.5e-05,5e-06,1.5e-05,1.4e-05,3.8e-05,4e-05,4e-05,1.9e-05,3.7e-05,2.1e-05,1.1e-05,4.8e-05,2.3e-05,1.6e-05,1.1e-05,8e-06,2.4e-05,4e-06,8.3e-05,3.6e-05,3.9e-05,3.4e-05,8e-06,4.7e-05,4.8e-05,5e-05,1.9e-05,4.5e-05,2.2e-05,2.7e-05,5e-06,3.2e-05,5.3e-05,1.1e-05,4.6e-05,4.8e-05,7.1e-05,3.9e-05,3.8e-05,3.3e-05
4.6e-05,6.2e-05,7e-06,3e-05,1.3e-05,2.7e-05,3.6e-05,9e-06,9e-06,4.4e-05,1e-06,2.5e-05,6e-06,3.1e-05,5.1e-05,1.7e-05,2.6e-05,1.3e-05,3.8e-05,1.5e-05,3.6e-05,7e-06,2.2e-05,7e-06,1.1e-05,1.1e-05,1.1e-05,2e-05,1.8e-05,8e-06,1e-05,3.5e-05,8.3e-05,2.5e-05,8e-06,7e-06,2.6e-05,9e-06,3.6e-05,2e-05,7e-06,2.5e-05,5.9e-05,2.7e-05,3.5e-05,1.8e-05,6e-06,1.4e-05,2.8e-05,2.3e-05,2.6e-05,2.6e-05,6e-06,1.1e-05,1.1e-05,4.2e-05,2.2e-05,4e-05,1.9e-05,2.6e-05,3.2e-05,8e-06,2.5e-05,2e-06,2.6e-05,3.1e-05,7e-06,5e-06,1.1e-05,3.2e-05,2.5e-05,1.9e-05,4.8e-05,3.3e-05,1.5e-05,1.1e-05,3.1e-05,2.3e-05,5.2e-05,9e-06,4.8e-05,2.8e-05,1.9e-05,2.1e-05,2e-05,3.1e-05,3.8e-05,3.8e-05,1.2e-05,3.3e-05,9e-06,7e-06,5.1e-05,3.1e-05,2e-05,1.2e-05,4e-06,1.5e-05,8e-06,9.3e-05,3.4e-05,4.8e-05,1.4e-05,8e-06,2.9e-05,4.4e-05,4.6e-05,2.2e-05,4.2e-05,3.1e-05,2.2e-05,1e-06,3.3e-05,5.1e-05,1.3e-05,5.9e-05,5.3e-05,6.4e-05,1.9e-05,3.5e-05,3.9e-05
4.1e-05,6.8e-05,1.8e-05,3.9e-05,1e-05,1.4e-05,4e-05,1.3e-05,2.4e-05,2.9e-05,1.4e-05,2.5e-05,5e-06,1.8e-05,3.3e-05,1.1e-05,2e-05,7e-06,3.9e-05,6e-06,4.6e-05,1.2e-05,1.7e-05,2.2e-05,1.1e-05,2.7e-05,2.7e-05,3.1e-05,2.2e-05,1.1e-05,8e-06,2.7e-05,9.5e-05,2.3e-05,1.1e-05,1.7e-05,2.8e-05,1.4e-05,3.1e-05,6e-06,1.1e-05,1.8e-05,5.2e-05,8e-06,3.4e-05,2.4e-05,2.2e-05,2.1e-05,3.1e-05,2.2e-05,1.4e-05,2.6e-05,2e-06,1.6e-05,1.7e-05,4.6e-05,1e-06,3.8e-05,7e-06,2.2e-05,2.1e-05,7e-06,3.2e-05,7e-06,1.8e-05,4.1e-05,6e-06,9e-06,2.8e-05,3.9e-05,2.3e-05,2.3e-05,3.9e-05,1.4e-05,7e-06,2.8e-05,2.2e-05,2.1e-05,4.5e-05,2e-06,4.8e-05,1.8e-05,1.1e-05,1.2e-05,1.7e-05,4.1e-05,4.9e-05,3.8e-05,1.5e-05,3.3e-05,1.4e-05,1.5e-05,4.1e-05,1.4e-05,1.6e-05,1.9e-05,7e-06,1e-05,3e-06,8.7e-05,2.1e-05,2.2e-05,2.9e-05,1.9e-05,4.3e-05,5.1e-05,5.6e-05,2.3e-05,4.2e-05,2.4e-05,2.7e-05,6e-06,3.5e-05,6.2e-05,1.3e-05,4.6e-05,5.7e-05,6.2e-05,2.6e-05,3.8e-05,4.5e-05
3.3e-05,7.3e-05,6e-06,3.7e-05,8e-06,1.3e-05,3.7e-05,6e-06,3.1e-05,2.7e-05,8e-06,1.5e-05,6e-06,2.6e-05,3.3e-05,1.1e-05,1.3e-05,1.5e-05,4.5e-05,1.5e-05,4.2e-05,5e-06,1e-05,1.9e-05,2.1e-05,1.5e-05,1.9e-05,2.2e-05,2.3e-05,4e-06,8e-06,3e-05,7.1e-05,2.4e-05,0,1.3e-05,3.1e-05,7e-06,3.8e-05,1.1e-05,1.4e-05,2.6e-05,3.9e-05,2.2e-05,3.2e-05,2.7e-05,1.4e-05,1.1e-05,2.8e-05,2.3e-05,2.6e-05,1.4e-05,3e-06,1.2e-05,1.2e-05,5.5e-05,2e-05,2.9e-05,7e-06,2.9e-05,2.8e-05,3e-06,2.7e-05,4e-06,2.1e-05,3.2e-05,1.2e-05,7e-06,1.9e-05,3.6e-05,1.9e-05,1.8e-05,3.7e-05,1.6e-05,5e-06,2.2e-05,3.2e-05,2.3e-05,4.1e-05,3e-06,4.5e-05,1.9e-05,1.2e-05,2e-05,1.1e-05,3.1e-05,4e-05,3.9e-05,1.6e-05,3.1e-05,1.9e-05,9e-06,3.7e-05,2.4e-05,1.2e-05,1.4e-05,9e-06,1e-05,8e-06,8.8e-05,1.3e-05,3.2e-05,2.9e-05,1.7e-05,3.1e-05,5.1e-05,4.7e-05,2.5e-05,4.3e-05,1.8e-05,2.5e-05,4e-06,3.1e-05,6.4e-05,9e-06,4.9e-05,4.8e-05,6e-05,2.1e-05,4e-05,4e-05
3.5e-05,6.3e-05,3e-06,4.4e-05,5e-06,1.5e-05,3.6e-05,1.2e-05,2.6e-05,2.7e-05,3e-06,1.6e-05,1e-06,2.6e-05,3.8e-05,1.4e-05,1.6e-05,5e-06,3.4e-05,8e-06,3.9e-05,1.4e-05,1.4e-05,1.5e-05,2.1e-05,1.3e-05,1.5e-05,2.6e-05,1.5e-05,8e-06,4e-06,3.2e-05,6.6e-05,1.7e-05,5e-06,1.4e-05,3.1e-05,9e-06,3.8e-05,8e-06,1.2e-05,2.2e-05,4e-05,1.6e-05,3.1e-05,2.9e-05,1.3e-05,1.3e-05,3.2e-05,2.3e-05,2.5e-05,2.6e-05,2e-06,9e-06,1.4e-05,4.8e-05,1.6e-05,3.2e-05,5e-06,2.1e-05,2.9e-05,4e-06,2.8e-05,8e-06,1.8e-05,2.3e-05,6e-06,7e-06,1.8e-05,3.1e-05,2.3e-05,1.8e-05,3.5e-05,1.4e-05,8e-06,1.5e-05,3.1e-05,2.3e-05,4.6e-05,5e-06,4.2e-05,1.8e-05,1.2e-05,2.2e-05,1.5e-05,2.6e-05,3.7e-05,3.5e-05,1.2e-05,2.9e-05,1.8e-05,1.1e-05,4.1e-05,2.3e-05,1.3e-05,1.4e-05,7e-06,1e-05,8e-06,8.3e-05,1.9e-05,2.7e-05,3.1e-05,1.1e-05,3.8e-05,4.1e-05,4.5e-05,2.3e-05,5.2e-05,1.6e-05,2.4e-05,3e-06,3e-05,6.6e-05,1.3e-05,4.5e-05,4.1e-05,5.2e-05,2.6e-05,3.7e-05,4.1e-05
3.3e-05,6.8e-05,3e-06,4e-05,7e-06,1.5e-05,3.3e-05,8e-06,2.5e-05,2.6e-05,1e-06,1.9e-05,3e-06,2.5e-05,3.1e-05,1.7e-05,2.1e-05,5e-06,3.3e-05,7e-06,3.8e-05,1.2e-05,1.4e-05,1.5e-05,1.6e-05,1.1e-05,1.9e-05,2.6e-05,2.2e-05,5e-06,5e-06,3e-05,7.4e-05,2.5e-05,7e-06,1.7e-05,2.9e-05,1.2e-05,3.3e-05,1e-05,1.3e-05,1.9e-05,4.3e-05,1.4e-05,3.2e-05,2.5e-05,1.3e-05,1.1e-05,2.7e-05,1.9e-05,2.3e-05,2.1e-05,6e-06,1.2e-05,1.4e-05,4.5e-05,1.8e-05,2.4e-05,4e-06,1.9e-05,2.5e-05,8e-06,2.7e-05,5e-06,1.6e-05,2.7e-05,5e-06,5e-06,1.8e-05,2.8e-05,2.1e-05,1.8e-05,3.5e-05,1.6e-05,8e-06,2e-05,3.2e-05,2.3e-05,4.4e-05,5e-06,4.3e-05,1.5e-05,1.4e-05,2.3e-05,1.1e-05,3.3e-05,4e-05,3.3e-05,1.2e-05,2.6e-05,2.2e-05,9e-06,4.2e-05,2.3e-05,1.6e-05,1e-05,1.1e-05,1e-05,3e-06,8.8e-05,1.8e-05,3.2e-05,3.1e-05,7e-06,3.4e-05,4.7e-05,4.6e-05,1.6e-05,5.2e-05,1.8e-05,2.5e-05,2e-06,2.8e-05,6.2e-05,6e-06,4.9e-05,5e-05,5.6e-05,2.4e-05,3.6e-05,4.6e-05
