0.000173,0.000267,0.000131,8.5e-05,0.000154,5e-06,-2.8e-05,0.000166,0.000136,7.6e-05,0.000104,6.3e-05,0.000165,0.000145,4.2e-05,0.000115,5.6e-05,4.7e-05,0.000224,0.000111,9.7e-05,-4.7e-05,-0.000873,-0.000365,-0.003989,-0.012301,-0.009394,-0.007493,-0.003231,-0.000666,-0.000638,0.000477,-0.001206,-0.001455,-0.003254,-0.004132,-0.002988,0.001036,0.000429,-0.000508,-0.001176,-0.001251,-0.00104,-0.008838,-0.002764,-0.010041,-0.013098,-0.001525,-0.009068,-0.013323,-0.010329,-0.012486,-0.009558,-0.005463,-0.009686,-0.003436,-0.022413,-0.019597,-0.018098,-0.008887,-0.008258,-0.007037,-0.005321,-0.021337,-0.015856,-0.006986,-0.018693,-0.013302,-0.006044,-0.006917,-0.012171,-0.014702,-0.016165,-0.004043,-0.00784,-0.006614,-0.009774,-0.005066,-0.002391,-0.002111,-0.004468,-0.002888,0.000491,-0.001656,-0.001272,-0.001244,-0.002086,-0.00172,-0.001046,-0.001009,-0.000425,-0.000387,-0.000475,-0.001533,-0.000621,0.000193,0.000323,0.000883,0.000776,-0.000284,-0.00288,-0.001678,-0.000203,0.00297,0.002039,0.000383,-0.000182,-0.001007,-0.001305,-0.000852,-0.000974,-0.001709,-0.001162,-0.002091,-0.001371,-0.001641,-0.001243,-0.000872,-0.000337,0.000165,-0.000293
4e-05,0.000162,1e-06,-5.1e-05,-1.6e-05,-3e-05,-2.7e-05,-2.1e-05,9e-06,-1e-05,-0.000101,5e-06,-5.3e-05,-4.9e-05,-6.1e-05,-0.000123,-7.7e-05,3.7e-05,-1.5e-05,-4e-05,-3.6e-05,-0.000202,0.000448,0.000392,-0.000733,0.000178,-0.001855,0.000844,0.000312,-0.000342,0.000718,0.000784,0.000225,-1.8e-05,-0.000786,0.000814,0.001462,-0.000882,0.000375,0.00032,0.000625,-0.000378,-0.000539,0.003591,-0.01813,-0.009074,-0.013436,0.00616,-0.009251,-0.000903,0.001067,0.000491,-0.000103,-0.013471,-0.007699,-0.004888,0.00362,-0.000524,0.006211,0.004234,0.001015,-0.004137,0.005058,-0.003186,-0.002907,-0.007931,-0.003983,0.004115,-0.00083,0.004427,-0.002935,0.00265,0.001625,-0.005458,-0.001793,-0.004332,-0.002524,-0.002873,-0.000969,-0.000996,-0.001631,-0.002078,-0.001686,-0.004042,-0.002218,-0.002862,-0.001861,-0.000183,-0.000868,-0.001956,-0.001276,-0.000875,-0.000534,-0.001201,-0.002759,-0.002075,-0.001478,-0.001534,0.000924,-0.000554,0.000605,0.000867,0.00055,-0.002075,-0.000565,-4e-05,0.000203,0.000184,0.000676,0.000479,8.1e-05,9.1e-05,0.000191,0.000837,0.000435,0.000732,0.000439,0.000665,0.000283,-4.9e-05,0.000197
5.7e-05,2.9e-05,-4.6e-05,-1.4e-05,-5.5e-05,8.7e-05,5.2e-05,-0.000168,-4.1e-05,-5.4e-05,-1e-04,-0.000218,-0.000155,-0.000165,-8.3e-05,-8.6e-05,-5.8e-05,-5.7e-05,-0.000111,-9.5e-05,-6.2e-05,-1.2e-05,-0.000314,-0.000302,-0.000215,-0.003293,0.001511,-0.000239,-5e-04,-0.000445,5e-05,0.000124,8.2e-05,7.7e-05,0.000218,-0.000656,-0.000903,-0.001962,-0.000475,5.7e-05,-0.000368,0.000302,-0.000436,-0.005307,0.007137,0.000531,0.000782,-0.013864,-0.006989,-0.004332,-0.004141,0.002991,0.003212,0.001317,-0.007399,-0.004821,-0.002891,-0.003983,-0.00904,-0.000745,-0.002879,-0.008564,-0.000904,0.001919,-0.004366,0.00817,-0.001948,-0.00406,-0.00536,-0.000653,0.001283,-0.001314,0.000543,-0.005808,-0.002069,-0.002318,-0.000135,0.003834,-0.000277,-0.000787,0.00127,0.001241,-0.001318,-0.0026,-0.001876,-0.000101,-0.001151,-0.000495,7.7e-05,0.000246,-0.000451,-0.000759,-1e-04,0.000647,-0.000252,0.001051,0.000134,-0.001141,-8e-05,-0.001396,-0.001214,-0.001005,-0.001021,-0.002978,-0.000983,-5.2e-05,0.000519,-0.000424,-0.000988,-0.000124,-0.000262,0.000524,0.000343,-0.000829,-0.000453,-0.000542,-0.00076,-0.000555,0.000187,-0.000229,-0.000237
-3.5e-05,-7.8e-05,3.3e-05,5.6e-05,-0.000104,-6.6e-05,-0.000121,-8.2e-05,4.3e-05,-0.000111,3e-05,-1e-05,-3.5e-05,-8.1e-05,-2.8e-05,0,-5.5e-05,-2.9e-05,4.4e-05,-1.9e-05,-2.9e-05,4.3e-05,6.8e-05,0.000181,-5.8e-05,0.001957,-0.00113,-0.001219,-0.000714,-0.000301,0.000406,0.000639,9.3e-05,0.000352,0.000343,0.000481,0.000383,0.000862,-0.000182,-0.000757,-0.000431,-0.000852,-0.000742,-0.001993,-0.002811,-0.003579,-0.000784,-0.003276,-0.000886,-0.005875,-0.000984,-0.010775,-0.002997,0.003956,0.003608,-0.003021,-0.005974,-0.003244,-0.000621,0.002365,-0.000864,-0.004478,-0.000883,-0.003735,-0.005427,-0.005345,0.005867,-0.009222,0.001912,-0.003499,-0.005455,0.000779,-0.002072,0.001006,0.001565,0.000494,-0.001954,-0.005165,-0.00066,0.000601,-0.000753,-0.001219,-0.001608,0.001793,0.000507,-0.002676,-0.000473,-0.000769,0.000684,0.000131,0.000635,-1.4e-05,-0.000518,-0.000312,0.000133,-0.000982,-0.000673,0.000235,-0.001309,-0.001608,-0.000628,0.000344,0.000221,-0.00016,0.000447,0.000141,-0.000124,0.000222,0.000798,0.000357,5.5e-05,-0.000495,-0.000113,0.000672,0.000339,-0.000114,0.000206,0.000271,0.000234,-0.00011,0.00011
-3.7e-05,-2.3e-05,9e-06,-3.6e-05,1.2e-05,5.2e-05,0.000153,5.7e-05,0.000111,6.6e-05,9.8e-05,5.1e-05,0.000113,7.9e-05,6.2e-05,8.7e-05,8.2e-05,-4e-06,-2.1e-05,2.3e-05,-1.5e-05,4.7e-05,-4.8e-05,-0.000197,0.000171,8.8e-05,0.001436,0.000729,0.000403,-7.9e-05,-0.000269,-0.000628,-0.000297,-3.1e-05,-0.00012,8e-06,-0.00088,-6.6e-05,5e-05,-0.000485,-6.1e-05,0.000602,3.2e-05,0.0024,0.00074,-0.002819,0.00762,-0.002002,0.005801,0.008672,0.001611,0.000286,0.003506,-0.000785,0.00417,-0.00053,0.002305,0.007693,-0.000784,-0.003057,0.004879,0.003837,-0.002085,-0.001464,0.006677,-0.00056,-0.002572,0.006487,0.005432,0.000623,0.003787,0.001213,0.004192,0.003213,0.001562,0.001716,0.0044,0.003417,0.001597,0.001669,0.002048,0.001502,0.000644,0.001705,0.000757,0.002015,0.001916,0.000565,-0.000485,-0.000605,-0.001105,0.000386,0.000448,0.000342,3.1e-05,0.000539,-0.000217,-1.9e-05,-0.000844,-0.001778,5.7e-05,-0.001223,-6.6e-05,-0.000198,-0.000378,-0.000159,7.4e-05,-8.1e-05,-0.000278,-0.00024,-0.000249,0.000106,0.000225,-0.00022,-9.8e-05,0.00011,-0.000438,-0.000231,-0.000159,8.8e-05,-0.000214
2.4e-05,-5.9e-05,-0.000125,8.6e-05,4.8e-05,-8.1e-05,-7.6e-05,9e-06,5.3e-05,-1.5e-05,-2.9e-05,6.3e-05,-3.2e-05,4.4e-05,2e-06,-2.1e-05,1.6e-05,1.7e-05,-8.7e-05,1e-05,5.7e-05,-3e-06,1.2e-05,0.000186,-7.4e-05,-0.001333,-0.000849,-0.00059,-0.00014,0.000177,0.000166,-0.000215,-0.00051,0.000717,0.000179,0.00049,0.001115,-0.000415,-0.001249,-0.001133,8.3e-05,-0.000515,-0.000708,-0.000929,-0.002201,-0.007121,0.000773,0.001505,-0.006727,-0.007012,-0.00255,0.000931,0.000843,-0.001339,-0.005743,-0.001309,0.003184,-0.005933,0.003746,-0.00227,-0.002241,-0.005324,-0.001023,0.00055,-0.003441,-0.002764,-0.002309,-0.002238,-0.007146,-0.004201,-0.002303,0.000217,-0.003858,-0.00048,-0.001446,-0.000285,-0.00425,-0.003253,-0.002601,-0.000382,-0.001804,-0.001721,-0.001225,-0.001956,-0.001308,-8.8e-05,-0.00033,0.000449,0.00039,0.000383,0.000295,0.000426,-0.000272,-1.7e-05,0.000532,0.000845,-9.3e-05,0.000759,-0.000368,-0.00081,0.000653,-0.000344,0.000485,-0.000265,-0.000551,-0.000383,-6.1e-05,0.000296,0.000103,0.000151,0.00018,6e-06,-0.000298,-0.000243,0.000196,-4e-05,0.000624,0.000171,0.000114,-8.5e-05,-0.000117
-3e-05,-7.7e-05,-0.000112,1e-05,-1.4e-05,-6e-05,-2.8e-05,2.3e-05,-3.1e-05,-3.9e-05,0,-6.7e-05,-3.6e-05,-1e-05,-5.3e-05,-3.3e-05,-4.7e-05,1.6e-05,-1.4e-05,-6.4e-05,-9.3e-05,-3.2e-05,3.6e-05,-0.000119,-2e-06,0.000473,0.001176,0.000463,0.000469,0.000358,6.1e-05,-0.000253,-0.000417,-0.000767,0.000217,0.000113,-0.000513,0.00029,-9.9e-05,0.000215,-0.000664,0.00027,0.000199,-0.000317,0.000773,0.006282,0.0018,0.006643,-0.000668,0.004473,-0.003249,-0.002369,-0.003268,-0.001158,-0.0027,0.006911,0.000145,0.004108,-0.001865,-0.001043,-0.001982,0.002612,0.004513,0.000429,0.002544,0.003211,0.000921,0.002734,0.001361,-0.000158,0.002953,0.002708,0.001532,0.00211,0.000715,-0.000616,-0.000357,0.003076,0.0031,-0.00097,0.00067,-0.00032,0.001394,0.000192,0.000563,0.000823,0.000179,-0.00026,-0.000108,0.000155,0.000406,8.8e-05,8e-06,-0.000118,-9.2e-05,-0.000745,0.000103,-0.000273,0.00034,0.000579,-0.001366,-0.001111,0.000169,-6.6e-05,-9.4e-05,-7.1e-05,0.00015,-4.2e-05,-0.000116,-0.000248,-0.000292,-0.000143,0.000369,0.000154,-0.000462,0.000216,-0.000186,-0.000263,-0.000301,-0.000265,-0.000439
7e-06,-6.1e-05,-5.4e-05,-3.8e-05,-1e-05,4e-06,-1.6e-05,-2.8e-05,-3.8e-05,-4.7e-05,-3.8e-05,-3e-05,-9.5e-05,-3.1e-05,-5.1e-05,-1e-05,-1.8e-05,-7.1e-05,-3.3e-05,2e-06,-6.5e-05,-3.5e-05,-3.1e-05,1.9e-05,-0.000156,0.000145,-0.003554,-0.001291,-9.9e-05,-0.000206,-0.000177,-2.4e-05,4.6e-05,-0.000106,3.3e-05,-0.000544,0.000219,-0.000429,0.000699,-0.000369,-0.000521,-0.000191,0.000343,0.000375,-0.000757,0.003328,-0.003087,-0.004563,-0.00325,-0.001477,0.002568,-0.001291,-0.000779,0.003387,0.00115,-0.00406,-0.001415,-0.003405,0.001495,0.004813,0.000507,0.004416,-0.000405,0.000247,-0.005018,-0.004488,-0.006294,-0.00088,-0.003789,0.000404,-0.002293,-0.005316,-0.001742,-0.001235,0.001179,-0.000645,0.001424,-0.002536,0.000497,0.001467,-0.000913,0.00012,-0.000728,-0.000743,-0.000708,-0.000154,-0.001454,-0.000547,-0.000655,-0.000122,2.7e-05,-0.000156,3.8e-05,-7.4e-05,0.000161,-5.9e-05,0.000383,-0.000529,0.000496,0.001764,-0.000496,0.000467,1.1e-05,-0.000468,-9.4e-05,-0.000209,-2.1e-05,-3.4e-05,-9.8e-05,0.000398,0.000261,-5.1e-05,-0.000285,-9.3e-05,0.000164,-0.000207,9.9e-05,6.8e-05,-3.5e-05,2.8e-05,-2e-05
-5e-06,-9.6e-05,-4.7e-05,-3.1e-05,1.4e-05,3e-06,-2.1e-05,7e-06,-4.9e-05,-1.7e-05,1.8e-05,-2.2e-05,-1.6e-05,-2.3e-05,1e-06,-1e-06,-1e-06,-6e-06,1.1e-05,4e-06,-2.6e-05,-7e-06,-2.7e-05,-5.8e-05,5.3e-05,-0.000147,0.002654,0.000643,1.4e-05,-2.4e-05,-0.000236,-0.000131,-0.000194,-0.00035,0.000146,-0.000313,-0.000508,0.000543,0.000331,0.000114,3e-04,0.000245,2.9e-05,0.000481,0.000553,0.003077,0.001264,-0.003415,-0.000403,-0.000123,-0.006259,-0.000781,-0.000448,-0.001548,-0.00207,-0.000426,0.001428,0.001526,-0.003066,-0.001336,-0.001402,-0.000686,0.001308,0.000611,0.004607,0.003746,0.003366,-0.001298,0.005018,0.003631,0.000957,0.002445,-0.001285,0.000375,0.000777,0.000143,0.001023,1.6e-05,-0.000687,-0.001771,0.001143,0.000817,-0.000349,-0.000753,-6.1e-05,-0.000575,0.00109,0.000494,0.000469,-0.000299,-0.000243,-0.000229,9.2e-05,-0.00024,-0.000106,0.000474,-3.3e-05,-0.000413,-0.000125,-0.000667,-0.000729,-0.000227,-0.000517,0.000108,0.000111,1.7e-05,1.5e-05,0.000229,-8.2e-05,-0.000298,7.7e-05,-5.4e-05,0.000161,3e-05,-0.000127,9.9e-05,6.6e-05,-0.000166,6.5e-05,-0.000181,0.000142
7e-06,7.3e-05,4.9e-05,4.3e-05,-3.4e-05,4.1e-05,-2.2e-05,-4e-06,1.4e-05,2e-06,5.7e-05,2.3e-05,2.3e-05,3e-05,4.9e-05,2.1e-05,2.4e-05,-8e-06,1.9e-05,1.7e-05,3e-05,1.7e-05,6e-06,-1.5e-05,-1.9e-05,0.000262,-0.000944,-0.000372,-0.000479,-0.000136,0.000113,-8.5e-05,0.000136,-4.4e-05,0.00012,0.00033,0.000201,-0.000137,-0.000574,0.000339,-0.000517,5e-05,-0.000116,3.9e-05,-0.000522,-0.00176,0.001872,0.000888,0.000685,-0.006094,0.000814,0.001473,-0.002034,-0.00053,0.000431,-0.002073,-0.002534,-0.000722,0.001192,6e-05,-0.000548,-0.000802,-0.005661,-0.002357,-0.004109,-0.003483,0.000292,0.000131,-0.000413,-0.004961,0.00123,-0.00223,0.000275,-0.000167,-0.001941,-0.001167,-0.001448,0.000356,-9.7e-05,0.000775,-0.000129,-0.000541,0.000831,0.000694,0.000183,-0.000301,0.00031,-0.000842,-0.000466,0.000341,5.4e-05,4e-05,-0.000198,0.000181,-8.2e-05,-0.000256,-0.000134,0.000202,-0.000344,-0.000318,0.000738,8.6e-05,-8.8e-05,-8.2e-05,-5.6e-05,-5.7e-05,9e-05,-6.6e-05,-3e-05,0.000362,-3.3e-05,0.000165,-2e-06,-9e-06,0.000182,-0.000215,-3.4e-05,2.3e-05,-8.2e-05,-1.9e-05,-5.8e-05
-1.3e-05,1.1e-05,-5e-06,-1.9e-05,-6e-06,-2.2e-05,-2.9e-05,2.8e-05,-7e-06,1e-05,-6e-06,-2.2e-05,2.1e-05,-2e-06,3.7e-05,-6e-06,-1.7e-05,3.8e-05,5e-06,-2.5e-05,1.8e-05,6.2e-05,3e-05,5.6e-05,6e-05,-3e-06,-0.000249,0.000171,0.000183,2e-05,0.000131,-8.6e-05,-8.5e-05,-0.000146,0.000326,-0.000278,0.00019,0.000266,0.000453,-0.000135,0.000362,0.000364,-0.000118,6.3e-05,9e-05,0.000702,-0.001078,-0.00033,0.001684,0.003316,-0.000425,-0.001786,-0.000163,0.002626,0.001917,0.002411,0.000566,0.001944,0.001009,0.000271,0.00114,-0.001274,0.000337,-0.000809,-0.000209,0.001431,0.000241,0.001557,0.000106,0.003545,0.000133,-0.000602,0.001,1.2e-05,0.000464,0.000138,0.001019,0.000467,-0.000177,-0.000667,-0.000504,3e-05,-0.000216,1.9e-05,0.000144,7.2e-05,-0.000451,0.000573,0.000306,-0.00022,-0.000146,-0.000465,-0.000183,-7.8e-05,5e-06,7.9e-05,-0.000317,-0.000354,-0.000143,0.000497,0.000537,-0.000191,-0.000283,0.000237,1.1e-05,6.7e-05,6e-06,8.9e-05,-5.4e-05,-0.000279,-7.8e-05,-6.3e-05,3.6e-05,5.4e-05,-0.000131,-2.6e-05,1.1e-05,0.000114,5.8e-05,-5.9e-05,-1.9e-05
-1.1e-05,-9e-06,1e-05,-4e-05,1e-06,-2.7e-05,-1e-05,-1.8e-05,1.9e-05,-1e-06,9e-06,-1.6e-05,-2.6e-05,-2e-06,2e-06,-2.3e-05,1e-06,1.9e-05,-1.8e-05,1.9e-05,7e-06,-1.5e-05,1e-05,-1.9e-05,-8.6e-05,-0.000129,-0.000413,-4e-05,0.000174,9.2e-05,7.7e-05,-2.6e-05,7e-06,-0.000111,5.6e-05,0.000202,-0.000361,-0.000125,-0.000268,-0.000148,-0.000228,-0.000137,-0.000101,0.000225,-0.000414,0.000158,0.000876,0.000411,0.000377,4e-04,0.002404,-0.001449,0.001163,-0.002096,-0.00216,-0.000424,0.000259,-0.001773,-0.001097,-0.001277,0.000223,-7.5e-05,4e-04,-0.000418,-0.000638,-0.001082,-8.8e-05,-0.000107,0.000659,-0.001072,0.000333,-0.000696,-0.000675,-5.9e-05,-0.001274,0.001534,-0.00065,-0.000791,-0.000586,0.000741,-8.8e-05,-2.5e-05,0.000728,0.00045,0.000339,0.000226,0.000485,4.4e-05,0.000133,0.000295,-6.4e-05,0.000304,-9.6e-05,8.8e-05,-0.000123,-0.000102,0.000145,0.000196,0.000257,-0.000111,-0.000111,-0.000177,-0.000243,-0.000128,-2.3e-05,-0.000174,-6.7e-05,-1.8e-05,-8e-06,0.000145,4.8e-05,-7e-06,8.2e-05,-0.000161,5.9e-05,0.00024,8e-06,-2.7e-05,-0.000182,-1e-06,-5.1e-05
-1.6e-05,-5e-06,-1.8e-05,-4.6e-05,-4e-06,-1.1e-05,3e-06,-1.5e-05,1.7e-05,1e-06,-2.9e-05,9e-06,-1e-06,-8e-06,0,-7e-06,5e-06,-1.6e-05,4e-06,-5e-06,2e-06,0,-1.6e-05,-6e-06,0.000107,0.000187,0.000414,9.8e-05,-0.000218,-7.1e-05,6.2e-05,0.000157,-1.9e-05,0.000136,-7.5e-05,-3.4e-05,0.000281,-0.000117,4e-05,2.8e-05,0.000428,0.000141,4.4e-05,-0.000166,0.000264,0.00126,0.002299,-0.000156,-0.002627,0.000311,0.000722,0.000119,0.000411,0.003491,0.001643,-0.00244,-0.000808,-0.000572,0.000283,0.002,-0.001083,0.001258,0.000795,0.001578,0.001323,-0.002043,0.00023,0.000792,-0.002137,0.001359,-0.000425,0.001076,-2.4e-05,0.000635,0.001506,-0.000666,0.000972,0.000634,0.000571,-0.00027,0.000329,7.9e-05,-0.000435,-7.5e-05,-0.000116,-5.9e-05,-0.000267,3.8e-05,-0.000148,-0.000143,-5.7e-05,0.000129,0.000173,-0.000125,0.000122,0.00021,0.000175,0.000336,0.00014,0.000133,0.000216,0.000255,-0.00026,9.6e-05,-1.5e-05,-8.2e-05,-8.9e-05,3.8e-05,6e-06,5.6e-05,-7.3e-05,-4.6e-05,-4.8e-05,8.3e-05,-4.6e-05,-0.00021,8e-05,-4e-05,0.000106,1e-06,7e-06
-5e-06,0,4e-06,-2.5e-05,-2.4e-05,7e-06,1e-05,3e-06,-7e-06,-1.2e-05,-7e-06,-1.8e-05,-7e-06,-3e-06,-1.1e-05,1.3e-05,-2e-06,-4e-06,6e-06,-5e-06,0,6e-06,-7e-06,-2e-06,-8.8e-05,-3.1e-05,-0.000328,-9.1e-05,-5.9e-05,0.000108,-0.000142,-1.6e-05,5e-06,4.4e-05,4e-06,-9e-05,-1e-04,0.00014,4.2e-05,-3.6e-05,-0.00016,8.7e-05,8.7e-05,1.1e-05,2e-06,0.000178,-0.00355,-0.001489,0.000895,0.000463,-0.001322,-0.000405,-0.000822,-0.001566,0.000148,0.001244,-0.001064,0.000598,-0.000425,-3.1e-05,-0.000423,-0.000547,0.00024,0.00045,-0.000327,0.001335,-9.2e-05,0.001291,0.000491,-0.000725,0.000364,0.001173,0.000677,5.1e-05,-0.000849,-0.000744,0.000278,-0.000197,-0.000295,-0.000628,-0.000326,0.000186,-0.000122,0.000221,2e-06,0.000118,-0.000104,8e-05,-8.2e-05,-4e-05,4.1e-05,-0.000167,9.6e-05,7.3e-05,-8.2e-05,-4.4e-05,-7.9e-05,-0.000181,1.2e-05,0.000134,-0.000265,0.000187,-1e-06,-0.00016,0,-8.6e-05,-7.2e-05,-3.4e-05,-2.6e-05,-4.8e-05,8e-05,7.9e-05,4.8e-05,-4.2e-05,1e-06,1.5e-05,-2e-05,4.4e-05,-4e-06,1.6e-05,7e-06
-6e-06,-1.3e-05,1e-06,6e-06,8e-06,-4e-06,1.5e-05,-1.3e-05,1.3e-05,-1e-06,7e-06,1.2e-05,2e-06,-4e-06,1e-06,7e-06,-1e-06,1e-06,7e-06,2e-06,-1e-06,3e-06,3e-06,3e-06,5e-05,-1.8e-05,0.000418,0.000116,3.9e-05,1.5e-05,2.7e-05,-3.8e-05,-1e-06,2.4e-05,4e-06,1.8e-05,-5e-05,4e-06,6.6e-05,-1.1e-05,5.3e-05,-8.7e-05,6.9e-05,5.3e-05,6.2e-05,-0.000487,-0.00151,0.000248,-0.00088,0.000178,-0.001697,-0.000894,-0.000227,0.000299,-9e-05,-0.00019,0.000601,-0.000817,0.001594,-0.000912,0.000355,0.000634,-2.1e-05,-0.00064,0.001596,-0.000202,-0.000576,-0.001606,0.000458,-0.001065,-0.000648,-5.8e-05,-0.000242,-0.000276,0.000472,0.000269,-0.000171,0.000133,-0.000209,0.000604,0.000325,-7.9e-05,0.000259,-0.000339,1.5e-05,-0.000155,-0.000138,-0.000245,-5.2e-05,5.9e-05,-2.3e-05,4.6e-05,-7.9e-05,-2.9e-05,6.2e-05,-1.1e-05,-7.5e-05,0.000127,-3.3e-05,-0.000141,-0.000108,0.000181,0.000478,4.8e-05,2e-05,7.1e-05,-0.000175,-1.9e-05,1.2e-05,-2e-05,-1.9e-05,-5e-05,-6.7e-05,-5.9e-05,1.8e-05,-1.3e-05,1.1e-05,-6.9e-05,1e-06,1.2e-05,-1.2e-05
-3e-06,0,-7e-06,-1e-06,8e-06,1.1e-05,3e-06,-1e-05,-1.4e-05,-7e-06,-1.2e-05,3e-06,-6e-06,2e-06,-5e-06,9e-06,3e-06,5e-06,8e-06,3e-06,-1.5e-05,-4e-06,-1e-05,6e-06,4e-06,6.9e-05,-0.000381,2.5e-05,1.9e-05,-0.00014,-0.000106,-1.3e-05,-3.9e-05,-2.1e-05,6e-06,-0.000194,7.9e-05,2.4e-05,-0.000182,6.4e-05,-3.7e-05,3.7e-05,6.2e-05,-3.9e-05,-7.7e-05,-0.000525,-0.000535,0.000354,0.000233,-0.000326,0.000196,-1.6e-05,0.000185,-0.000639,0.000633,-0.000346,0.000476,0.000436,-0.000582,4.8e-05,-3.7e-05,-0.000459,0.000501,-0.000215,-0.00065,-9e-05,-4.4e-05,-0.000229,-0.000693,0.000601,0.000314,-0.000456,-0.000295,0.000796,-0.000596,-2.6e-05,0.000143,-2.4e-05,-0.000224,-0.000453,-2e-06,-0.000185,3.4e-05,3.9e-05,-5.9e-05,0.000203,0.000204,1e-04,6.2e-05,-7.4e-05,-5e-06,5.6e-05,-2e-06,4.5e-05,-1e-05,3.6e-05,-4.6e-05,-0.000107,-2e-05,-3.5e-05,-0.000144,-6.5e-05,-0.000123,-0.000107,-9e-06,9e-05,1e-06,1.5e-05,-1.5e-05,-8.2e-05,2e-05,-9e-06,-4.2e-05,7e-05,-3.6e-05,9.5e-05,-1.5e-05,3.3e-05,-1e-06,-2.5e-05,6.3e-05
-1e-06,-1e-06,3e-06,7e-06,-3e-06,-1e-06,-7e-06,-5e-06,-5e-06,1e-06,-1e-06,0,4e-06,-4e-06,9e-06,-1e-06,1e-06,-4e-06,-9e-06,-4e-06,1e-06,-3e-06,-6e-06,-1e-05,0,-3.9e-05,0.000357,0.000113,1e-06,0.000209,9.3e-05,-3.2e-05,-9e-06,-4e-06,-5.9e-05,4.4e-05,-4.1e-05,5e-05,5.7e-05,-8.5e-05,-0.000205,-3.5e-05,-1e-05,2e-06,6.5e-05,8.4e-05,-0.000533,-0.000378,0.000684,-7.1e-05,0.000603,0.000669,-0.000509,-0.000209,-0.000128,0.000118,-0.000613,-0.000153,0.000832,-0.000365,-0.000313,-0.000189,7.8e-05,0.000247,0.000111,0.000304,0.000171,0.000946,0.000582,0.000442,0.000113,8.3e-05,0.000259,-0.000552,-7.3e-05,0.000256,-0.000156,-0.000144,9.4e-05,0.000251,3.8e-05,4e-05,-0.000166,-8.9e-05,3.2e-05,0.000138,8.2e-05,-1.2e-05,-1.2e-05,4.4e-05,2.1e-05,-6.7e-05,6.6e-05,-6.2e-05,2.7e-05,2.9e-05,4.1e-05,-3.4e-05,2.9e-05,0.000196,5.7e-05,-0.000113,6e-06,-2e-05,-9e-06,-1.2e-05,-1.5e-05,-1.8e-05,-1.4e-05,4.7e-05,-5.3e-05,-2e-06,1.9e-05,-5.5e-05,3.9e-05,-3.6e-05,-1e-05,-2.1e-05,0,1.8e-05,-2.7e-05
0,4e-06,4e-06,1.4e-05,-2e-06,-9e-06,-6e-06,-4e-06,-6e-06,-2e-06,3e-06,-1e-06,5e-06,0,8e-06,1e-06,-1e-06,-6e-06,-3e-06,3e-06,7e-06,-3e-06,-2e-06,5e-06,-5e-06,-1.7e-05,-0.000166,-2.1e-05,-2e-05,-5.7e-05,7e-06,1.4e-05,1.3e-05,-1.8e-05,-6.4e-05,8e-06,2e-06,-2.3e-05,5.2e-05,-5e-05,0.000135,-4.2e-05,4.9e-05,6e-05,-5.7e-05,0.000285,0.000253,-0.00034,-0.000242,0.000206,-4.9e-05,0.000154,-0.000262,0.000183,0.000199,3.2e-05,-0.000348,0.000342,-0.000269,0.000468,0.00056,0.000598,-0.000348,0.000404,-0.000635,-0.000135,0.000228,-0.000657,-0.000614,-0.000129,-0.000292,-0.00041,-0.000532,0.000359,0.000301,-0.000159,-8.4e-05,9.9e-05,0.000182,0.000132,-0.000126,-8e-06,0.000171,2.9e-05,2e-05,-2.1e-05,-0.000121,-3e-05,5e-06,-2.4e-05,1.6e-05,-1.9e-05,-4.3e-05,2.3e-05,-1.2e-05,-4.4e-05,4.1e-05,0,5e-06,-7.2e-05,0.000124,3.2e-05,0.000183,-6e-05,1.1e-05,-2.6e-05,-5.3e-05,1.3e-05,-5e-06,-5.7e-05,2.4e-05,-1.2e-05,-1e-06,2e-05,-3.4e-05,-1e-06,5e-06,1.1e-05,-2e-06,-2.4e-05,-1.1e-05
1e-06,6e-06,-5e-06,6e-06,5e-06,-5e-06,-7e-06,-1e-06,0,1e-06,-7e-06,0,0,2e-06,4e-06,-2e-06,0,1e-05,1e-06,-1e-06,3e-06,1e-06,0,2e-06,-2e-06,3.7e-05,0.000229,4.1e-05,1e-06,-2.9e-05,3.4e-05,1.7e-05,-1.6e-05,-5.9e-05,-6.7e-05,3.9e-05,1.8e-05,-7e-05,-7.2e-05,3e-05,-4.7e-05,-1.5e-05,3.5e-05,5e-06,-1.9e-05,-0.000285,0.000731,0.000175,0.000273,-0.000636,0.000479,-0.000528,0.000343,-0.000457,0.000622,0.000446,0.000487,-0.000523,0.000391,0.000467,-0.000286,-0.000117,3.4e-05,1e-04,0.000266,0.000618,0.000176,-0.000366,-0.000269,0.000188,0.00034,0.000109,0.000169,-2.3e-05,-3.6e-05,7.3e-05,-1e-05,0.000158,0.000183,7.4e-05,-2.7e-05,7e-05,-0.000268,0.00015,5e-06,-5.5e-05,-3.2e-05,-4e-06,4.5e-05,1.4e-05,3e-06,-3.4e-05,-5e-06,-1.9e-05,7e-06,-1e-06,1.2e-05,-2.7e-05,-5e-06,-4e-05,8.1e-05,2.2e-05,-4e-05,-3.3e-05,-1.2e-05,-2.1e-05,1e-05,-8e-06,-1.5e-05,4.9e-05,-7e-06,2.1e-05,-1.6e-05,-1.1e-05,3.7e-05,-9e-06,-1.9e-05,-1e-06,-1.9e-05,2e-06,-1.1e-05
-1e-06,-5e-06,1e-06,2e-06,2e-06,0,-4e-06,-1e-06,1e-06,-3e-06,2e-06,-1e-06,-2e-06,-2e-06,-3e-06,-1e-06,2e-06,2e-06,-2e-06,1e-06,-1e-06,0,0,-3e-06,3e-06,-3.1e-05,-0.000181,-3.6e-05,4.2e-05,1e-06,1e-05,1.7e-05,-3e-06,8e-06,-2e-05,1.3e-05,-6e-06,9.4e-05,3.9e-05,-9e-06,7.3e-05,-2.4e-05,9e-06,-3e-05,3.2e-05,-0.000579,0.000878,0.000245,-0.000132,-1.6e-05,-0.000123,-7.8e-05,7.5e-05,0.000408,-0.000331,0.000111,9.7e-05,0.000778,-7.9e-05,-0.000424,0.000118,-5e-05,-0.000348,-0.00019,-0.000339,-0.000334,-0.000163,0.000435,0.000285,-0.000867,-0.000326,-0.000126,5.8e-05,-0.000235,0.000133,-0.000106,0.000314,-0.000161,-8.8e-05,-9.2e-05,0.000138,1.5e-05,0.000234,5e-06,3e-06,5.3e-05,0.000142,-9e-06,-9e-06,-1e-05,-7e-06,-2.3e-05,4.9e-05,1.6e-05,0,7e-06,-1.9e-05,2.3e-05,-6e-06,8.5e-05,9e-06,0.000134,-2.2e-05,-1.4e-05,6e-06,-2.4e-05,1.5e-05,-2e-06,-3e-06,-2.9e-05,2.6e-05,-3.2e-05,1.7e-05,-1.9e-05,-3.2e-05,1.7e-05,-3e-06,1.9e-05,3e-06,3e-06,4e-06
0,-6e-06,-2e-06,-4e-06,-5e-06,3e-06,-2e-06,-1e-06,5e-06,0,-2e-06,-5e-06,-1e-06,0,-6e-06,-1e-06,0,-2e-06,3e-06,-3e-06,0,-4e-06,-3e-06,1e-06,-2e-06,1e-06,0.000123,-1.4e-05,1e-05,-4.8e-05,-5e-06,-1.9e-05,4e-06,2e-06,-1.6e-05,-2.5e-05,-2.6e-05,-9.4e-05,1e-05,3.2e-05,-4.2e-05,-2.1e-05,1.6e-05,-1.4e-05,2.3e-05,-0.000547,0.000119,1.5e-05,-0.000149,0.000267,6.8e-05,0.000199,-0.000138,-0.000553,0.000221,-0.000546,-0.000161,-0.000786,-0.000173,-0.00011,-2.6e-05,0.000286,3.3e-05,-0.000189,0.000274,0.00014,7e-05,-0.000186,-0.000265,0.000638,0.000261,0.000237,-0.000254,0.000149,-0.000274,-5.2e-05,-1.1e-05,-2.6e-05,-1.2e-05,0.000127,-4.9e-05,-1.4e-05,-0.000107,-1.4e-05,-1e-06,-4e-06,-0.000111,9e-05,1.6e-05,1.6e-05,-2e-06,-4e-06,-3.6e-05,-1.4e-05,-1.8e-05,6e-06,-1.9e-05,3.2e-05,6e-06,-2.5e-05,-7.6e-05,6.3e-05,-8.9e-05,-3.5e-05,-2e-06,1.3e-05,2.6e-05,1e-06,-3e-06,0,-3.5e-05,0,-1.3e-05,1e-05,1.4e-05,-2.9e-05,-1.2e-05,-1.9e-05,2e-06,-1e-05,8e-06
0,4e-06,-4e-06,0,2e-06,3e-06,3e-06,-1e-06,5e-06,-2e-06,0,1e-06,0,0,-5e-06,2e-06,0,-3e-06,1e-06,2e-06,1e-06,-1e-06,-2e-06,-3e-06,3e-06,1.7e-05,-0.000101,-1.8e-05,-4e-05,6.3e-05,-2.1e-05,-3e-06,-8e-06,2e-05,9e-06,3.7e-05,8.4e-05,7.3e-05,-4e-05,-5e-06,5.5e-05,-2.3e-05,1.2e-05,2.1e-05,5e-06,0.000116,-0.000154,-0.000203,-7.3e-05,0.000257,-0.000166,-0.000204,0.000203,0.00043,0.000267,0.000214,0.000105,0.000246,0.000341,-5.4e-05,0.000107,-0.000121,5.1e-05,-0.000106,-2.5e-05,0.000165,9.8e-05,-0.000493,0.00049,-1.8e-05,-0.000224,8e-06,0.000219,-0.000117,4.3e-05,0.000166,-0.000168,7.8e-05,6e-05,-0.000141,2.8e-05,-5e-05,-4.1e-05,3e-05,-8e-06,1e-06,-5.8e-05,-6.4e-05,-3e-05,-1.8e-05,8e-06,-2.8e-05,-2.9e-05,1e-05,1.7e-05,-2.7e-05,1.9e-05,-1.2e-05,9e-06,2.7e-05,-2.1e-05,-3e-05,-6.4e-05,-7e-06,-2e-06,-5e-06,3e-06,-4e-06,-4e-06,3e-06,3.5e-05,1.3e-05,1.6e-05,-2.1e-05,-1.1e-05,2.5e-05,0,0,1.2e-05,1.6e-05,0
0,-1e-06,4e-06,-2e-06,2e-06,0,0,1e-06,0,0,4e-06,-1e-06,-1e-06,0,-2e-06,-1e-06,1e-06,-1e-06,-2e-06,0,-4e-06,-1e-06,0,2e-06,-2e-06,-2.6e-05,0.000136,5e-06,-1.5e-05,-8e-06,-2.1e-05,-1e-06,2e-06,1e-06,-1e-06,-5.5e-05,-7.9e-05,-5.4e-05,1.8e-05,-4e-05,-6e-06,-1.5e-05,-4e-06,1.3e-05,5e-06,0.000128,3.2e-05,-4.5e-05,0.000121,-0.000292,2.8e-05,-0.000342,-9e-06,-0.000186,-2.1e-05,0.000106,0.000158,-0.000174,-0.000266,0.000105,-0.000221,-0.00025,1.5e-05,9.6e-05,0.000272,-0.000201,8.3e-05,0.000447,-9e-05,6.6e-05,1e-04,-9.3e-05,6.8e-05,1.2e-05,-1.6e-05,-0.000149,0.00011,-8e-06,-8e-06,-7.2e-05,-1.5e-05,-1.9e-05,2e-05,-9.5e-05,0,-2.5e-05,7.9e-05,1e-06,-1.8e-05,8e-06,6e-06,6.7e-05,1.4e-05,-3e-06,-1.4e-05,1.9e-05,7e-06,8e-06,0,5.5e-05,-5.3e-05,-8e-06,4e-06,-3.3e-05,7e-06,2e-06,-4e-06,7e-06,-2e-06,-1.5e-05,-2.9e-05,-9e-06,-6e-06,1e-05,1e-05,-2.7e-05,-6e-06,4e-06,-8e-06,-1.3e-05,1.1e-05
0,-2e-06,-2e-06,-3e-06,-3e-06,-4e-06,3e-06,0,1e-06,-2e-06,-1e-06,0,1e-06,-1e-06,1e-06,1e-06,1e-06,5e-06,0,-1e-06,-2e-06,-2e-06,-1e-06,1e-06,2e-06,2e-06,-0.000111,-1.5e-05,1.8e-05,-1.1e-05,-1e-06,1.3e-05,-2e-06,-5e-06,-1e-06,-2e-05,0,3.2e-05,1.2e-05,7e-06,-7.2e-05,-2.2e-05,1e-05,-1.1e-05,-3.5e-05,6.5e-05,2.4e-05,0.000156,-4.9e-05,0.000308,-0.000487,2.7e-05,-0.000267,-0.000111,0.000188,0.00013,-0.000117,0.000254,0.000322,0.000119,0.000231,0.000293,-1e-06,0.000121,-4e-06,0.000145,0.00017,3.8e-05,-0.000243,-9.4e-05,-3.8e-05,9.5e-05,-0.000112,2e-05,0.000111,-3e-05,-4.8e-05,2.2e-05,3.3e-05,2.5e-05,5e-06,4.4e-05,1.1e-05,-2.2e-05,-7e-06,2e-06,2e-06,3.4e-05,4e-06,-9e-06,-4e-06,-6e-06,2e-05,2e-06,5e-06,0,1e-06,1.1e-05,-8e-06,-3.3e-05,4e-06,-7e-06,-7e-06,-1.4e-05,-9e-06,9e-06,1e-05,-3e-06,-3e-06,2.7e-05,9e-06,0,-1.3e-05,-6e-06,1e-06,-1.8e-05,1e-06,-7e-06,0,7e-06,-1.2e-05
0,2e-06,1e-06,-6e-06,-1e-06,-3e-06,2e-06,-1e-06,-5e-06,0,1e-06,-2e-06,0,1e-06,3e-06,-1e-06,-1e-06,-2e-06,-1e-06,0,0,-1e-06,-1e-06,-1e-06,-2e-06,5e-06,1.4e-05,-6e-06,8e-06,1.8e-05,6e-06,-3e-06,-4e-06,9e-06,1e-05,-1e-06,5.2e-05,-1.7e-05,-4e-06,-1e-05,2.9e-05,1e-06,0,-1.2e-05,1.5e-05,-0.000365,-0.000269,-3.3e-05,0.000129,-0.000194,0.000139,7.5e-05,-0.000145,0.000279,8.6e-05,-0.000222,2.4e-05,-0.000238,-0.000294,-0.000106,-9e-06,0,-5.1e-05,-9.9e-05,0.000155,-0.000196,0.000162,-0.000214,9.8e-05,-0.000151,9.1e-05,4.7e-05,-3e-05,-1.4e-05,5.5e-05,3.5e-05,9e-06,-6.4e-05,-6e-05,-1.8e-05,-6.2e-05,2.7e-05,-4.3e-05,4e-05,7e-06,-7e-06,-1.3e-05,-4.3e-05,-3e-06,7e-06,-4e-06,-1.3e-05,-1e-05,-7e-06,-1e-05,0,-1.9e-05,-3.3e-05,2e-06,-2.4e-05,3.5e-05,6.4e-05,-1.9e-05,-2.5e-05,5e-06,-1.4e-05,6e-06,0,-4e-06,-1.7e-05,3e-06,-4e-06,1.5e-05,-5e-06,-7e-06,3.2e-05,-3e-06,3e-06,0,-4e-06,-5e-06
0,0,1e-06,-3e-06,2e-06,0,0,1e-06,-2e-06,-1e-06,2e-06,0,1e-06,-1e-06,2e-06,1e-06,0,-2e-06,0,0,3e-06,0,0,0,2e-06,-1.7e-05,-4e-05,-7e-06,-1e-05,-2.9e-05,1.9e-05,-1e-05,0,-2.2e-05,1.7e-05,1.1e-05,-6.1e-05,-9e-06,-5e-06,-1.3e-05,-1.5e-05,1e-06,-1e-06,6e-06,-6e-06,-0.000108,6.3e-05,-0.000108,-5.9e-05,4.8e-05,0.000151,-0.000151,0.000173,-0.000344,-4.4e-05,-0.000137,0.000153,0.000368,0.000237,-5.5e-05,-8.7e-05,-0.000186,8.8e-05,-0.000178,-2.2e-05,-6.1e-05,4.8e-05,0.00019,-0.000281,0.00013,-1.5e-05,-0.000105,7.7e-05,-4.5e-05,-9.9e-05,0.000102,0.000109,6e-05,-8.3e-05,2.2e-05,6.8e-05,-1.7e-05,8.5e-05,-2.9e-05,1e-06,3.6e-05,-1.1e-05,1.7e-05,2.6e-05,4e-06,-9e-06,3.1e-05,-4e-06,-2e-06,8e-06,-9e-06,-4e-06,2e-05,6e-06,5.4e-05,4.6e-05,3.3e-05,4.4e-05,-1.1e-05,4e-06,-6e-06,-7e-06,2e-06,-6e-06,1.3e-05,5e-06,5e-06,-4e-06,4e-06,1.1e-05,3e-06,1e-06,2e-06,-1e-06,-2e-06,2e-06
0,1e-06,-2e-06,-1e-06,-1e-06,2e-06,-3e-06,0,-2e-06,0,-3e-06,1e-06,-1e-06,1e-06,-1e-06,0,1e-06,1e-06,1e-06,0,-1e-06,1e-06,0,-1e-06,-1e-06,7e-06,5.9e-05,1.9e-05,-1.7e-05,6e-06,5e-06,2e-06,3e-06,-5e-06,1e-05,1.8e-05,4.3e-05,1.8e-05,5e-06,1.7e-05,6e-06,-4e-06,2e-06,1e-05,7e-06,5.7e-05,0.000319,-7e-06,-4e-05,-4.1e-05,0.000173,-9.7e-05,2.6e-05,0.000352,0.000136,0.000169,-8.5e-05,-0.00023,-0.000112,-5e-05,-1.5e-05,0.000179,4.3e-05,-7e-06,-2.1e-05,0.000128,-0.000127,-9.7e-05,0.000269,7.3e-05,1e-05,-8.1e-05,-0.000117,0.000112,-2.7e-05,-3.2e-05,-9.4e-05,1.5e-05,-8e-06,2.2e-05,-1.8e-05,-7e-06,-0.000112,5.4e-05,-8e-06,-2.5e-05,2.2e-05,3e-06,-6e-06,-9e-06,0,-5e-06,0,4e-06,-3e-06,1.2e-05,1e-05,-1.7e-05,5e-06,-1.2e-05,1.4e-05,1.4e-05,5.2e-05,-1.8e-05,-8e-06,-2e-06,-1.3e-05,-1e-06,-4e-06,-1.2e-05,-1e-05,-2e-06,2e-06,-1.3e-05,-1e-05,-7e-06,2e-06,2e-06,-1e-06,5e-06,4e-06
0,-1e-06,-1e-06,-1e-06,-2e-06,3e-06,-2e-06,-1e-06,0,-1e-06,2e-06,-2e-06,0,0,-4e-06,1e-06,0,1e-06,0,-1e-06,0,1e-06,1e-06,2e-06,1e-06,3e-06,-4.8e-05,2e-06,2e-06,-1.8e-05,0,0,0,-8e-06,2.2e-05,-1.2e-05,-2.8e-05,-1.4e-05,-1e-06,-2.3e-05,1e-06,1.1e-05,1e-06,-3e-06,8e-06,0.000341,-8.9e-05,3.2e-05,-4e-05,1.6e-05,8.9e-05,0.000101,-8.4e-05,-0.000239,1e-04,2.1e-05,-9.3e-05,3.7e-05,6.5e-05,0.000174,8.3e-05,-5.4e-05,-3.7e-05,0.000121,-5.9e-05,-0.000173,-0.000111,-0.000103,0.000124,-8.4e-05,4e-06,-5.1e-05,-1.5e-05,-0.000138,-1.9e-05,-3.8e-05,-2.7e-05,-4e-06,2.9e-05,3.1e-05,4.4e-05,-2.1e-05,7e-05,3.5e-05,9e-06,1.2e-05,-1.4e-05,9e-06,-2e-06,8e-06,6e-06,-3e-05,-1e-06,0,6e-06,0,9e-06,1e-06,-2e-06,-2.5e-05,-2.4e-05,-1e-05,6.5e-05,-6e-06,8e-06,3e-06,-2e-06,0,-3e-06,1.1e-05,6e-06,-8e-06,3e-06,3e-06,8e-06,-8e-06,0,-3e-06,3e-06,-6e-06,3e-06
0,-2e-06,0,2e-06,2e-06,0,-3e-06,0,2e-06,0,0,1e-06,0,0,-3e-06,-1e-06,0,2e-06,-1e-06,1e-06,1e-06,0,0,0,-1e-06,-9e-06,4e-06,1.2e-05,1.6e-05,-1.6e-05,-7e-06,0,1e-06,1.1e-05,1e-05,1.2e-05,6e-06,1.2e-05,-3e-06,5e-06,1.6e-05,3e-06,7e-06,-9e-06,-3e-06,6.9e-05,-0.000131,5.8e-05,1.1e-05,-0.000169,-0.00015,3e-05,0.000131,0.000306,-6.5e-05,-2.2e-05,0.000108,-1e-06,-6.2e-05,4e-05,-7.1e-05,-0.000103,-6.4e-05,0.000101,-2.1e-05,0.000129,-2.6e-05,0.000286,-0.000147,6.5e-05,-6.9e-05,6.1e-05,8.9e-05,8.1e-05,8.8e-05,-1.7e-05,-2.5e-05,-5.8e-05,-2.3e-05,-2.5e-05,-5.8e-05,4e-06,-1e-05,-4.8e-05,-5e-06,-4e-06,-2.1e-05,-1.6e-05,1e-06,-4e-06,-2e-06,0,2e-06,3e-06,0,-3e-06,1e-06,1.1e-05,-7e-06,1.9e-05,-2.4e-05,-3.1e-05,-4.4e-05,-1.6e-05,-6e-06,3e-06,-1e-05,1e-06,-3e-06,0,-6e-06,0,-5e-06,-9e-06,-9e-06,1.3e-05,5e-06,6e-06,0,4e-06,-2e-06
0,0,-1e-06,3e-06,1e-06,-2e-06,-2e-06,0,2e-06,-1e-06,-2e-06,0,0,0,-2e-06,0,0,-3e-06,1e-06,0,0,0,-1e-06,-1e-06,0,7e-06,-4e-06,8e-06,2e-06,9e-06,-1.2e-05,0,2e-06,4e-06,2e-06,-6e-06,2.8e-05,-1e-05,6e-06,9e-06,3.2e-05,1.1e-05,-2e-06,4e-06,0,-6e-06,-0.000273,-2.6e-05,4.5e-05,0.000137,-3.4e-05,-0.000171,2e-05,-0.000199,1.7e-05,-6e-06,-2.4e-05,-8.7e-05,1.9e-05,-0.000101,-7.2e-05,0.000134,-3.9e-05,0,1.6e-05,-0.000111,-1e-06,-5e-05,0.000195,-0.000194,9.4e-05,2e-05,-8.9e-05,-1.9e-05,4.3e-05,0,1e-05,4.8e-05,3.7e-05,2.5e-05,2.6e-05,2.5e-05,-9e-06,1.9e-05,-3e-06,1.2e-05,2.5e-05,-3e-06,-1.6e-05,4e-06,2e-06,-6e-06,2e-06,-6e-06,-5e-06,-1e-06,-9e-06,-8e-06,-3e-06,-1.8e-05,-2.1e-05,2.4e-05,-1.2e-05,-9e-06,0,-1e-06,-1e-05,1e-06,-2e-06,-3e-06,7e-06,4e-06,5e-06,1e-06,5e-06,-4e-06,0,-8e-06,0,-5e-06,0
0,2e-06,1e-06,4e-06,-2e-06,-2e-06,0,-1e-06,2e-06,0,2e-06,-1e-06,-1e-06,0,1e-06,-1e-06,0,-1e-06,0,0,-1e-06,0,0,1e-06,0,-1e-06,2.8e-05,1e-05,-1.3e-05,-1e-05,1e-06,2e-06,-1e-06,3e-06,4e-06,-1.6e-05,-1.8e-05,1.1e-05,-2e-06,-1.2e-05,-4.6e-05,4e-06,4e-06,7e-06,-1.1e-05,-7e-05,-0.000233,-3.7e-05,-5.6e-05,3.8e-05,-0.000115,-7.4e-05,-0.000121,8.7e-05,0.000121,-3e-06,-0.000151,3.1e-05,6.8e-05,-1.6e-05,0.000138,8e-06,3.6e-05,-6.2e-05,-3e-06,8.4e-05,7.2e-05,-0.000233,-0.000223,0.000177,-0.000108,2.7e-05,7.1e-05,-3.2e-05,-4.7e-05,2.8e-05,5e-06,0,-1.6e-05,-2.6e-05,-2.5e-05,-3e-06,1.6e-05,-1.9e-05,0,-2e-06,2.5e-05,2.5e-05,5e-06,-5e-06,2e-06,-1e-05,6e-06,3e-06,3e-06,5e-06,-2e-06,1.1e-05,3e-06,1e-06,2e-06,1.9e-05,4.7e-05,-1.6e-05,4e-06,-1e-05,-5e-06,-1e-06,-1e-06,2e-06,-5e-06,-4e-06,-4e-06,2e-06,-1e-06,0,3e-06,3e-06,-6e-06,3e-06,-4e-06
0,-2e-06,0,1e-06,0,0,1e-06,0,0,-1e-06,-2e-06,-1e-06,0,0,3e-06,0,0,3e-06,0,0,-1e-06,0,0,0,0,-5e-06,-6e-06,1e-06,-7e-06,2e-06,0,-2e-06,0,8e-06,-2e-06,-1.8e-05,-1e-05,-9e-06,-1e-06,7e-06,1.1e-05,1.5e-05,-1e-06,-2e-06,2e-06,0.00019,-0.000132,6e-06,6.4e-05,-3.4e-05,-1.1e-05,5.2e-05,-3.3e-05,4.8e-05,-8e-05,4.9e-05,2.9e-05,0.000102,-0.000134,-9.4e-05,-0.000139,-7e-05,2.8e-05,7e-06,9.2e-05,3.8e-05,6.5e-05,0.000203,-3.1e-05,4.3e-05,0.000111,5.2e-05,2e-05,5.7e-05,-2.3e-05,1.4e-05,4.4e-05,-1e-06,5e-06,2.4e-05,2.5e-05,-1e-05,-1.5e-05,-4.2e-05,-3e-06,0,-3.4e-05,-2.2e-05,-6e-06,3e-06,-2e-06,1.6e-05,-6e-06,-5e-06,-2e-06,-3e-06,3e-06,-4e-06,5e-06,2.1e-05,1.3e-05,2.7e-05,-7.4e-05,-1.1e-05,-6e-06,3e-06,0,1e-06,-3e-06,-5e-06,3e-06,-4e-06,-1e-06,-8e-06,1e-06,-1.1e-05,2e-06,0,8e-06,-2e-06,-1e-06
0,0,-1e-06,0,2e-06,1e-06,1e-06,0,-1e-06,0,0,0,0,0,2e-06,0,0,0,1e-06,0,2e-06,0,0,0,0,6e-06,-2.1e-05,0,1.1e-05,2e-05,7e-06,-2e-06,0,-3e-06,-6e-06,5e-06,7e-06,1e-05,-1e-06,-7e-06,-1.3e-05,4e-06,-1e-06,-5e-06,4e-06,0.000195,3.1e-05,3.4e-05,-3.7e-05,3.1e-05,-3.3e-05,-2.7e-05,5.4e-05,-0.000143,5.1e-05,-4.8e-05,7.3e-05,7.7e-05,0.000112,0.000106,4.9e-05,6e-05,2e-06,6.7e-05,2.5e-05,-6.9e-05,5.3e-05,-3.6e-05,0.000132,-9.5e-05,-6.6e-05,-1.5e-05,-6.1e-05,-4.7e-05,-5.5e-05,-2.7e-05,1.4e-05,-3.6e-05,3.5e-05,-3.4e-05,-9e-06,-1.1e-05,-1.3e-05,4.2e-05,1e-06,-1.1e-05,1e-06,-1e-06,7e-06,-3e-06,-1e-06,1e-06,-8e-06,4e-06,3e-06,-1e-06,3e-06,-2e-06,-2e-06,-1.5e-05,2.1e-05,-3e-06,-4.4e-05,-1.2e-05,6e-06,-3e-06,2e-06,0,-3e-06,4e-06,0,3e-06,3e-06,7e-06,0,0,1e-06,0,-8e-06,0,3e-06
0,1e-06,0,-1e-06,-1e-06,2e-06,1e-06,0,-3e-06,-1e-06,1e-06,0,0,0,0,0,0,-1e-06,0,0,0,1e-06,-1e-06,0,0,-1e-06,2.1e-05,-1e-05,6e-06,-1.9e-05,4e-06,3e-06,0,-3e-06,-6e-06,1e-05,1e-05,-1.3e-05,0,-7e-06,2e-06,1.2e-05,1e-06,1e-06,3e-06,0.000112,0.000229,7e-06,1.1e-05,1.1e-05,1e-04,-9.9e-05,-4.8e-05,0.000175,2.1e-05,-3.1e-05,-0.000109,-0.000119,-0.000112,6e-05,2.1e-05,3.3e-05,-1.6e-05,7e-06,9e-05,8.8e-05,-3e-06,-0.000194,-0.000132,-2.3e-05,5.5e-05,-1.9e-05,4.7e-05,2e-05,5.8e-05,-3.3e-05,-0.000102,2.3e-05,1.1e-05,3.6e-05,1.8e-05,-6e-06,5e-05,-5e-06,0,8e-06,3.3e-05,9e-06,8e-06,2e-06,-1e-06,2.3e-05,4e-06,-3e-06,-1e-06,2e-06,1e-06,-2e-06,-5e-06,-1.9e-05,1e-05,-2.4e-05,1.5e-05,-7e-06,-4e-06,4e-06,3e-06,0,-3e-06,-7e-06,-6e-06,-1e-06,-3e-06,-7e-06,-3e-06,-4e-06,2e-06,0,1.1e-05,1e-06,1e-06
0,0,-1e-06,-1e-06,-1e-06,1e-06,1e-06,0,-1e-06,0,-2e-06,-1e-06,0,0,-2e-06,0,0,-2e-06,0,0,0,1e-06,-1e-06,0,0,-1e-06,2e-06,-3e-06,-1e-05,7e-06,1e-06,2e-06,-1e-06,-1e-05,-6e-06,4e-06,-1.9e-05,1.2e-05,2e-06,-1e-06,5e-06,-1e-06,0,5e-06,2e-06,-9.9e-05,0.00023,-3.6e-05,-3.4e-05,-5e-05,5.2e-05,6e-06,-2.4e-05,-0.000197,-9.8e-05,5.1e-05,-6.6e-05,8.6e-05,0.000119,-6.1e-05,-2.8e-05,-8.3e-05,-3e-06,-3.1e-05,2e-06,2.6e-05,-6.5e-05,0.000248,0.000161,-1.3e-05,-3.3e-05,-3.3e-05,-7e-06,-1.6e-05,9e-06,3e-05,4e-05,1.2e-05,-1.9e-05,-2.1e-05,-2e-05,1.6e-05,-4.9e-05,-6e-06,2e-06,-4e-06,-1.6e-05,-2e-06,-4e-06,0,1e-06,-7e-06,8e-06,5e-06,0,1e-06,-6e-06,3e-06,-3e-06,1.1e-05,-8e-06,-3e-06,-1.9e-05,-1.1e-05,-1e-06,-4e-06,4e-06,0,-4e-06,8e-06,6e-06,1e-06,2e-06,0,4e-06,8e-06,0,2e-06,-9e-06,-4e-06,0
0,0,0,-2e-06,2e-06,-1e-06,-1e-06,0,-1e-06,-1e-06,2e-06,1e-06,0,0,-2e-06,0,0,1e-06,0,0,-1e-06,0,0,0,0,5e-06,1.8e-05,-8e-06,-6e-06,5e-06,-4e-06,1e-06,0,-1e-06,-7e-06,1e-05,1.7e-05,-9e-06,-1e-06,-5e-06,-4e-06,8e-06,-1e-06,0,-5e-06,-6.9e-05,0.000173,6e-06,9e-06,7e-06,7.9e-05,3.8e-05,0.000107,0.000178,8.5e-05,0,9.5e-05,-0.000144,-7.8e-05,8e-06,-2.5e-05,3.8e-05,5.1e-05,-4.1e-05,3.2e-05,-3.7e-05,-4.2e-05,5.9e-05,-7.3e-05,5.7e-05,-1.2e-05,5e-06,-3.3e-05,1.4e-05,3.2e-05,3.2e-05,3.7e-05,1e-06,7e-06,-1e-05,1e-06,1e-06,2.2e-05,4.4e-05,-2e-06,2e-06,-1.8e-05,-2e-06,5e-06,-2e-06,2e-06,2e-06,-6e-06,-4e-06,-3e-06,0,-1e-06,-4e-06,1e-06,1e-06,-1.7e-05,-3e-06,3e-05,-9e-06,3e-06,1e-06,1e-06,-2e-06,-3e-06,-5e-06,-2e-06,-4e-06,0,0,-4e-06,0,1e-06,-2e-06,8e-06,5e-06,-2e-06
0,0,0,-2e-06,0,-2e-06,-2e-06,0,1e-06,0,0,0,0,0,-1e-06,0,0,2e-06,0,0,1e-06,0,0,0,0,-2e-06,-4e-05,-7e-06,1e-06,-9e-06,-2e-06,-2e-06,0,0,-7e-06,-3e-06,-1.4e-05,6e-06,-2e-06,2e-06,2.4e-05,-4e-06,2e-06,-4e-06,0,4.7e-05,0.000108,-2e-06,2e-05,5.1e-05,-2.4e-05,-5.9e-05,2.6e-05,-0.00015,-2.6e-05,-1.3e-05,1e-06,7.6e-05,2.4e-05,-4.2e-05,7.4e-05,6.9e-05,1.4e-05,-5e-05,-8e-05,5.8e-05,-2.4e-05,-0.000257,-8.9e-05,6.7e-05,1.3e-05,-1e-06,6e-06,-8e-06,-5.1e-05,-1e-05,-4.9e-05,-2.2e-05,-2.6e-05,1.4e-05,0,-5e-06,0,-2.7e-05,-1e-06,-6e-06,9e-06,-2e-06,-8e-06,1e-06,1e-06,-2e-06,-4e-06,3e-06,1e-06,-2e-06,1e-06,5e-06,2e-06,-1.7e-05,-1.2e-05,2.9e-05,2e-05,-1.2e-05,-5e-06,-5e-06,3e-06,1e-06,-2e-06,0,0,-1e-06,-1e-06,-6e-06,4e-06,-3e-06,0,1e-06,-1e-05,-5e-06,-1e-06
0,0,-1e-06,-1e-06,-1e-06,-1e-06,-2e-06,0,2e-06,-1e-06,-1e-06,0,0,0,1e-06,0,0,-2e-06,0,0,0,0,0,0,0,-1e-06,3e-05,-5e-06,4e-06,1.9e-05,-2e-06,0,-1e-06,2e-06,-3e-06,2e-06,8e-06,-4e-06,1e-06,2e-06,-1.9e-05,5e-06,-1e-06,0,-2e-06,0.000124,-3.1e-05,9e-06,9e-06,-9.1e-05,-9.9e-05,-7.4e-05,-9.2e-05,7.9e-05,-9.6e-05,-2.8e-05,-9.5e-05,-5.6e-05,-1e-06,4.7e-05,-4.2e-05,-7.4e-05,-4e-05,1e-05,4.1e-05,-7.2e-05,-1.9e-05,0.000118,0.000122,-0.000107,-2.8e-05,-3e-06,1.7e-05,1e-05,-3.3e-05,-2.3e-05,4.7e-05,7e-06,-1e-06,-2.1e-05,2e-06,-7e-06,-2.2e-05,-1.3e-05,-1e-06,7e-06,1.6e-05,1e-05,1e-06,-1e-06,1e-06,-1.3e-05,3e-06,-4e-06,1e-06,5e-06,6e-06,-2e-06,2e-06,1e-06,3e-06,7e-06,2e-06,-1e-05,4e-06,3e-06,2e-06,0,-2e-06,1e-06,-1e-06,3e-06,2e-06,5e-06,-3e-06,3e-06,0,0,7e-06,5e-06,-1e-06
0,0,0,-1e-06,1e-06,1e-06,-1e-06,0,2e-06,0,2e-06,0,0,0,2e-06,0,0,-1e-06,0,0,-1e-06,0,0,0,0,3e-06,-1.8e-05,-2e-06,2e-06,-2e-05,1e-06,1e-06,0,4e-06,-1e-06,-1.7e-05,8e-06,1e-06,0,2e-06,4e-06,-9e-06,-1e-06,3e-06,2e-06,1e-06,-0.000179,-1.4e-05,-1.1e-05,3e-05,-6.3e-05,8e-06,-3e-06,-3e-06,6.5e-05,1.7e-05,4.9e-05,0.000111,-2e-06,2.8e-05,-9e-06,-2e-06,-3.2e-05,3.3e-05,-6.1e-05,8e-05,2e-06,0.000104,-0.000133,2.8e-05,4.4e-05,2.2e-05,-4.2e-05,-1.2e-05,8e-06,-1.2e-05,-8e-06,2.3e-05,7e-06,8e-06,4e-06,-8e-06,4e-05,2e-05,1e-06,-5e-06,-7e-06,-7e-06,0,2e-06,-2e-06,-9e-06,-2e-06,3e-06,-1e-06,-3e-06,-1e-06,1e-06,-1e-06,-9e-06,1e-05,-1.1e-05,5.1e-05,-9e-06,-2e-06,-5e-06,4e-06,-1e-06,-2e-06,-1e-06,1e-06,-5e-06,-2e-06,-4e-06,3e-06,1e-06,-1e-06,-2e-06,-6e-06,-3e-06,0
0,0,-1e-06,0,1e-06,2e-06,-2e-06,0,1e-06,-1e-06,-1e-06,0,0,0,2e-06,0,0,0,0,0,0,0,0,0,0,-3e-06,3.1e-05,2e-06,-4e-06,6e-06,2e-06,0,-1e-06,3e-06,-1e-06,-9e-06,-1.6e-05,3e-06,-3e-06,0,-7e-06,2e-06,2e-06,0,2e-06,-0.00016,-1e-04,-5e-06,-1.6e-05,3.8e-05,1e-06,-4e-06,2.9e-05,-7.6e-05,-8.8e-05,2.4e-05,8.2e-05,-9.2e-05,3.3e-05,-5.5e-05,4.1e-05,7e-05,2.4e-05,-2.3e-05,4.5e-05,-6.4e-05,1.2e-05,-0.000171,0.000122,-3.5e-05,-2.6e-05,2.1e-05,2e-05,1e-06,3.6e-05,2.6e-05,-3.7e-05,-9e-06,-1.8e-05,5e-06,-6e-06,1.3e-05,-2.7e-05,-4e-05,0,6e-06,-1.6e-05,-4e-06,-1e-06,-1e-06,-3e-06,-3e-06,-1e-06,-3e-06,2e-06,1e-06,-4e-06,3e-06,-2e-06,-9e-06,1.3e-05,-1.6e-05,1e-05,-8e-06,0,7e-06,-1e-06,1e-06,-2e-06,2e-06,-3e-06,1e-06,0,1e-06,-1e-06,2e-06,-1e-06,1e-06,7e-06,0,2e-06
0,-1e-06,0,1e-06,-1e-06,1e-06,1e-06,0,0,0,0,0,0,0,1e-06,0,0,1e-06,0,0,1e-06,0,0,0,0,1e-06,-4.4e-05,5e-06,-6e-06,8e-06,0,0,-1e-06,1e-06,4e-06,6e-06,8e-06,-5e-06,2e-06,-4e-06,-3e-06,-1.1e-05,-1e-06,-3e-06,1e-06,-0.000163,-1e-05,1.7e-05,2.9e-05,-3e-06,3.6e-05,-7.1e-05,-6.3e-05,0.000129,-9e-06,2e-06,-5.8e-05,0.000122,-7.3e-05,-2.1e-05,-2.7e-05,-5.4e-05,2.5e-05,-1.9e-05,-1.5e-05,5e-06,1.1e-05,0.000111,3.5e-05,4.2e-05,3.6e-05,-7e-06,2e-06,-1e-06,3.1e-05,1.8e-05,1e-05,-1.3e-05,1e-06,1e-05,9e-06,7e-06,-6e-06,1e-05,0,-2e-06,1.5e-05,8e-06,3e-06,0,1e-06,4e-06,6e-06,4e-06,-3e-06,0,-2e-06,-3e-06,0,1e-05,4e-06,-1.7e-05,-4e-05,-9e-06,2e-06,-3e-06,-6e-06,0,-2e-06,-2e-06,5e-06,0,2e-06,0,1e-06,-4e-06,-1e-06,0,-5e-06,3e-06,1e-06
0,0,0,2e-06,0,-1e-06,1e-06,0,-1e-06,-1e-06,1e-06,-1e-06,0,0,-1e-06,0,0,0,0,0,0,0,0,0,0,2e-06,2.9e-05,3e-06,1e-06,-1.3e-05,1e-06,-2e-06,-1e-06,-3e-06,5e-06,2e-06,0,5e-06,2e-06,-2e-06,1e-05,0,1e-06,0,1e-06,-2.5e-05,-6e-06,-8e-06,-2.2e-05,-6.3e-05,4e-06,-2.1e-05,5e-06,-0.000169,2.5e-05,-1.1e-05,-1.1e-05,-0.000112,7.3e-05,1.1e-05,1.2e-05,-2.4e-05,-1e-06,2.9e-05,9.3e-05,1.8e-05,2e-06,7.1e-05,-0.000131,6.4e-05,-3.7e-05,-1e-05,-3.7e-05,-8e-06,-2.9e-05,-6e-06,7e-06,-4e-06,1.7e-05,-2e-05,-8e-06,-6e-06,2.4e-05,2.8e-05,1e-06,-3e-06,4e-06,-4e-06,-3e-06,-1e-06,1e-06,-2e-06,1e-06,-3e-06,2e-06,1e-06,1e-06,2e-06,1e-06,-2e-06,-8e-06,9e-06,-1.1e-05,-1e-05,-3e-06,1e-06,-2e-06,0,-3e-06,3e-06,-5e-06,-3e-06,-2e-06,-5e-06,-2e-06,1e-06,-2e-06,0,5e-06,-5e-06,-1e-06
