-2.3e-05,-3.4e-05,-0.00268,-0.022617,-0.014228,-0.005528,-0.028726,-0.140767,-0.19864,-0.195103,-0.173764,-0.161925,-0.141516,-0.099322,-0.061236,-0.029711,-0.026643,-0.018766,-0.004347,-0.00081,-0.001818,-0.001064,-0.000688,-0.000339,-6.6e-05,-5.8e-05,-7.6e-05,-0.004847
3.2e-05,3.1e-05,-0.000164,-0.005247,-0.004932,-0.002991,0.023782,0.022785,0.020705,0.119872,0.132194,0.147331,0.127583,0.095579,0.053761,0.02391,0.025201,0.016987,0.004365,-0.000316,-0.001558,-0.000558,0.000355,0.000403,7.8e-05,6.9e-05,4.7e-05,-0.002921
-2e-06,-7e-06,0.000547,0.006422,0.004246,0.000346,-0.016118,-0.034578,-0.000779,0.031559,0.007454,0.011834,-0.004721,-0.003013,0.002381,-0.004888,-0.00474,0.000759,-0.000239,-0.000492,-0.000675,0.000252,0.000117,-6e-06,2e-06,6e-06,3e-06,-0.000261
-3.4e-05,-4.1e-05,0.000489,0.008519,0.006493,0.000716,-0.040013,-0.070098,-0.076008,-0.15492,-0.159244,-0.158656,-0.126222,-0.092605,-0.058221,-0.024085,-0.022231,-0.018471,-0.005628,-0.000805,0.000214,0.000348,-0.000332,-0.000372,-7.7e-05,-6.8e-05,-3.6e-05,0.003516
2.1e-05,2.8e-05,0.00091,0.006704,0.004721,0.005441,0.025467,0.135702,0.153096,0.109108,0.120774,0.111176,0.120681,0.087431,0.046403,0.029716,0.02765,0.015566,0.00392,0.001276,0.001505,0.000166,0.000406,0.000317,5.3e-05,4.8e-05,5.8e-05,0.004271
1.6e-05,2e-05,-0.001014,-0.011148,-0.008026,-0.003807,0.002367,0.053825,0.107282,0.124454,0.104482,0.094159,0.053092,0.038176,0.032671,0.008229,0.003865,0.008857,0.00219,-0.001003,-0.000281,-0.000169,8.3e-05,0.000119,3.3e-05,3.8e-05,1.1e-05,-0.002393
-2.9e-05,-3.9e-05,-0.001376,-0.01217,-0.007954,-0.004194,-0.037999,-0.145788,-0.175482,-0.169325,-0.162352,-0.15538,-0.150217,-0.106489,-0.05948,-0.030889,-0.02898,-0.021748,-0.005282,-0.000629,-0.00099,-0.000309,-0.000626,-0.000413,-7.6e-05,-6.8e-05,-6.9e-05,-0.004697
8e-06,6e-06,0.001079,0.010103,0.005864,0.000267,0.015756,-0.028733,-0.100392,-0.055362,-0.005372,0.00389,0.03476,0.0246,0.001812,0.008431,0.01227,0.004342,0.00095,5e-04,6.1e-05,0.000178,0.000272,0.00018,2e-05,1.2e-05,1.4e-05,-0.000166
2.2e-05,2.7e-05,0.001048,0.010762,0.006097,-0.000282,0.020185,0.05775,0.089422,0.145961,0.124169,0.121129,0.090816,0.064294,0.042652,0.015012,0.01286,0.014853,0.00394,0.000592,7.9e-05,0.000101,0.000442,0.000249,5.6e-05,5.3e-05,4.1e-05,0.0024
-1.6e-05,-2.1e-05,-0.000503,-0.005016,-0.002839,8e-04,-0.023435,-0.036153,0.002856,-0.035335,-0.085085,-0.085056,-0.088384,-0.057506,-0.026993,-0.014599,-0.015021,-0.013188,-0.003319,-0.000465,-0.000629,-0.000361,-0.000455,-0.000315,-4.9e-05,-4e-05,-1.5e-05,0.002534
-4e-06,-4e-06,-0.000214,-0.004646,-0.003282,0.001111,0.00756,0.039345,-0.000909,-0.081199,-0.049666,-0.045959,-0.001437,-0.000181,-0.013565,0.003154,0.004504,-0.001912,-0.000355,0.000327,0.000255,-4e-05,-0.000108,1.9e-05,-1.2e-05,-1.7e-05,-1.5e-05,0.000432
2.4e-05,3.2e-05,-0.000371,-0.001705,-0.001288,-0.002714,0.016963,0.07681,0.079661,0.093882,0.116347,0.115704,0.085522,0.051587,0.033733,0.011665,0.010306,0.014914,0.003888,-5.9e-05,0.000393,0.000483,0.000421,0.000259,5.4e-05,5.3e-05,1.5e-05,-0.00302
0,-3e-06,-0.000376,-0.000645,0.000728,-0.000817,-0.025896,-0.079902,-0.043405,0.009294,-0.025794,-0.03268,-0.063612,-0.045564,-0.012062,-0.014002,-0.013887,-0.008624,-0.001896,4.5e-05,1e-06,-5.3e-05,-0.000207,-0.00021,-2.4e-05,-1.6e-05,-8e-06,-0.002189
-1.3e-05,-2e-05,0.001136,0.007306,0.004094,0.002618,-0.004223,-0.069691,-0.107758,-0.104166,-0.086913,-0.090822,-0.040253,-0.026598,-0.029072,-0.006012,-0.005527,-0.010444,-0.002367,0.000177,-0.000243,-0.000443,-0.000177,-5.9e-05,-3.4e-05,-4e-05,-1.7e-05,0.001414
1.2e-05,1.5e-05,0.000363,0.001695,-8.4e-05,-0.000489,0.022211,0.050027,0.036124,0.052501,0.085295,0.090001,0.08501,0.053896,0.023926,0.014736,0.014832,0.014516,0.003078,-0.000409,-0.000495,-7.3e-05,0.000322,0.00024,4.1e-05,3.6e-05,1.7e-05,0.00224
1e-06,2e-06,-0.00143,-0.009598,-0.003776,0.001686,-0.009463,0.009558,0.067997,0.072298,0.030172,0.034844,-0.007212,0.000872,0.015875,4.7e-05,0.001101,0.001298,-3.6e-05,-0.00016,-0.000227,0.000229,-0.000108,-0.000137,-2e-06,6e-06,1.1e-05,0.000945
-1.9e-05,-2.5e-05,-0.000214,-0.000763,2.8e-05,-0.00066,-0.004472,0.001043,-0.011378,-0.082338,-0.099416,-0.103599,-0.064026,-0.032893,-0.023034,-0.009252,-0.009692,-0.012119,-0.002988,-0.000326,0.000134,-8e-05,-0.000267,-0.000118,-3.8e-05,-4.3e-05,-2.6e-05,-0.001161
-1e-06,2e-06,0.001171,0.00841,0.003354,-0.001726,0.020697,0.064546,0.01618,-0.015538,0.03121,0.029533,0.036613,0.017324,0.001502,0.005095,0.003863,0.006778,0.0019,0.000256,0.000502,1e-06,0.000284,0.000202,2.2e-05,1.8e-05,-3e-06,-0.002188
7e-06,1.1e-05,9.3e-05,-0.000593,-0.000637,3.4e-05,-0.006181,-0.018895,0.011453,0.074382,0.066012,0.07177,0.017784,0.005501,0.016111,0.001622,0.002824,0.004652,0.000943,1.3e-05,6.9e-05,5.1e-05,7.7e-05,-5.5e-05,8e-06,1.8e-05,1.6e-05,-0.000495
