0.018769,0.018554,0.017198,0.015785,0.014629,0.015453,0.015997,0.014637,0.014372,0.015117,0.015348,0.016778,0.016338,0.014704,0.015219,0.015301,0.01391,0.013496,0.014479,0.01465,0.013937,0.012931,0.012642,0.014444,0.015739,0.014553,0.014056,0.014318
0.02494,0.023789,0.022272,0.021288,0.019657,0.020732,0.021722,0.019842,0.019645,0.020213,0.019877,0.022229,0.021496,0.019201,0.020678,0.021181,0.018837,0.017555,0.018685,0.019199,0.018098,0.016817,0.017119,0.019655,0.020998,0.019145,0.01813,0.018122
0.037839,0.034344,0.032669,0.032863,0.030262,0.032134,0.034398,0.031644,0.031449,0.031224,0.029561,0.033688,0.032176,0.028489,0.031902,0.033474,0.029091,0.02589,0.027517,0.028625,0.026618,0.024755,0.026118,0.030347,0.032022,0.028664,0.026494,0.026273
0.053075,0.047128,0.047785,0.049458,0.044035,0.047677,0.053152,0.049376,0.047833,0.045369,0.042211,0.048076,0.045238,0.039879,0.045241,0.047967,0.041582,0.037361,0.039717,0.040165,0.03673,0.034921,0.03748,0.043765,0.045747,0.040598,0.038144,0.038525
0.069688,0.064142,0.074102,0.076981,0.063496,0.070577,0.083237,0.077037,0.06992,0.062378,0.058714,0.066166,0.061596,0.05386,0.06027,0.063674,0.056055,0.054589,0.057939,0.053245,0.047406,0.048089,0.05184,0.060958,0.06319,0.056411,0.057293,0.06022
0.09693,0.094494,0.120261,0.123271,0.096559,0.110399,0.134488,0.123067,0.103623,0.0866,0.085287,0.095393,0.087814,0.076002,0.082097,0.085904,0.078849,0.085412,0.09093,0.074348,0.062974,0.068511,0.074673,0.090281,0.093726,0.084899,0.09226,0.099215
0.141485,0.14185,0.182478,0.18405,0.141918,0.164664,0.204868,0.187629,0.15205,0.12416,0.125607,0.139395,0.127783,0.110327,0.117612,0.122005,0.114789,0.13061,0.138991,0.107828,0.08829,0.099599,0.110564,0.135219,0.140122,0.128115,0.143289,0.155355
0.183404,0.186566,0.234795,0.233827,0.181128,0.209514,0.263281,0.24325,0.197396,0.164577,0.165346,0.179504,0.165616,0.143538,0.151664,0.156624,0.150198,0.173501,0.183371,0.141894,0.11731,0.131701,0.145322,0.176509,0.183801,0.170518,0.191525,0.207888
0.195103,0.203171,0.246687,0.244195,0.191278,0.21345,0.267623,0.251045,0.208746,0.184248,0.182322,0.188481,0.176605,0.157342,0.162495,0.166679,0.164611,0.188343,0.196714,0.157156,0.134326,0.145609,0.156678,0.186435,0.196512,0.186897,0.207656,0.224302
0.175545,0.193805,0.223581,0.222224,0.178019,0.178711,0.213061,0.203543,0.180099,0.173543,0.171949,0.169296,0.161079,0.149106,0.148091,0.152031,0.156849,0.173048,0.178669,0.151475,0.134987,0.137017,0.140069,0.162453,0.174279,0.16831,0.182557,0.196422
0.16381,0.189284,0.20279,0.204576,0.175914,0.152325,0.159404,0.15939,0.155241,0.159123,0.163355,0.158977,0.145859,0.136331,0.133992,0.136627,0.144882,0.157273,0.16802,0.150313,0.134935,0.127106,0.119306,0.137533,0.149294,0.143648,0.149181,0.155311
0.184435,0.209735,0.205507,0.20579,0.188197,0.148108,0.13855,0.148647,0.157225,0.164853,0.169336,0.162105,0.142531,0.134766,0.134885,0.126517,0.127363,0.14167,0.164627,0.154248,0.137885,0.129045,0.116476,0.136005,0.14528,0.138535,0.138223,0.132956
0.207086,0.223467,0.202393,0.200469,0.187457,0.142834,0.130421,0.145655,0.160903,0.171286,0.171226,0.160577,0.145124,0.140889,0.139488,0.124055,0.116235,0.131333,0.159623,0.151283,0.135547,0.132432,0.119546,0.134761,0.144617,0.138618,0.129334,0.116637
0.210575,0.211203,0.17595,0.172025,0.165829,0.132834,0.120443,0.134738,0.155772,0.164957,0.160133,0.152659,0.149839,0.147238,0.139232,0.125607,0.116881,0.135685,0.160367,0.145961,0.130802,0.129396,0.120511,0.133356,0.141834,0.134643,0.121087,0.104136
0.197031,0.184866,0.15117,0.149321,0.153225,0.13535,0.121993,0.127861,0.146399,0.157604,0.156001,0.16278,0.170537,0.154849,0.135973,0.130602,0.123532,0.141453,0.16089,0.147801,0.137308,0.13255,0.130822,0.143586,0.152088,0.15063,0.137751,0.113116
0.210302,0.204069,0.173469,0.172909,0.184051,0.174575,0.159237,0.149236,0.1632,0.183982,0.18499,0.208302,0.228099,0.193358,0.152973,0.152679,0.149701,0.164726,0.193419,0.194705,0.18861,0.174161,0.162334,0.166878,0.183435,0.204906,0.197248,0.161741
0.286896,0.292849,0.253216,0.2568,0.269962,0.256387,0.240664,0.216749,0.231006,0.267248,0.263608,0.286961,0.322375,0.280077,0.212185,0.208897,0.203458,0.218954,0.26943,0.283023,0.2753,0.247731,0.214129,0.215812,0.251225,0.290231,0.282558,0.237375
0.397467,0.414274,0.352281,0.358129,0.376775,0.363136,0.351835,0.314394,0.320475,0.368659,0.359256,0.36261,0.412218,0.377995,0.295902,0.298729,0.28203,0.285334,0.350716,0.371923,0.358261,0.321491,0.273575,0.284305,0.33698,0.365385,0.352177,0.316079
0.496268,0.51358,0.42051,0.425893,0.472533,0.474212,0.461268,0.414067,0.40071,0.437708,0.419865,0.402042,0.451083,0.425016,0.361293,0.393783,0.358999,0.325003,0.385307,0.423957,0.416464,0.372855,0.32846,0.35753,0.399188,0.383255,0.369901,0.372699
0.550945,0.558962,0.448198,0.438348,0.512983,0.542613,0.52917,0.479799,0.451249,0.445886,0.407879,0.411063,0.445205,0.393788,0.370865,0.444301,0.396921,0.330652,0.362994,0.409932,0.427385,0.387189,0.362641,0.405089,0.406871,0.345185,0.348171,0.398885
0.5357,0.552699,0.457772,0.413734,0.475974,0.518113,0.507607,0.464073,0.43744,0.388864,0.329708,0.379581,0.408558,0.326073,0.327333,0.425889,0.387329,0.308977,0.307496,0.333123,0.367335,0.361988,0.356621,0.383342,0.368673,0.326851,0.348618,0.400304
0.484058,0.509592,0.43595,0.374437,0.399288,0.420162,0.410031,0.380549,0.35995,0.301101,0.254326,0.325036,0.343683,0.269525,0.283237,0.373848,0.355466,0.280442,0.260958,0.255143,0.277341,0.308755,0.311318,0.312302,0.30625,0.314648,0.333497,0.353794
0.402834,0.419257,0.370511,0.31774,0.316179,0.312873,0.30656,0.295888,0.271989,0.224741,0.200105,0.248772,0.247171,0.213699,0.246467,0.3005,0.307823,0.257196,0.228026,0.222361,0.226118,0.247525,0.251296,0.252603,0.246504,0.271295,0.270258,0.253038
0.321476,0.333418,0.300559,0.245667,0.235685,0.230884,0.220314,0.220565,0.208548,0.181658,0.159768,0.169269,0.171191,0.192946,0.226033,0.229466,0.250298,0.227588,0.199424,0.201171,0.186849,0.185916,0.194042,0.205582,0.194622,0.217491,0.208311,0.173677
0.223681,0.240607,0.232413,0.178383,0.16481,0.158163,0.145298,0.154234,0.159839,0.152006,0.132197,0.119242,0.124237,0.171467,0.201084,0.18403,0.200722,0.210048,0.212991,0.198499,0.156434,0.140649,0.138959,0.149872,0.151398,0.162511,0.148566,0.131547
0.139778,0.153995,0.174834,0.146701,0.13331,0.117071,0.096759,0.111839,0.125514,0.124706,0.117394,0.10157,0.101178,0.138309,0.161085,0.15653,0.161831,0.179542,0.216303,0.194961,0.131435,0.1089,0.099099,0.106544,0.123551,0.116498,0.099637,0.107596
0.112327,0.116169,0.129491,0.127349,0.126332,0.104258,0.085483,0.099761,0.10366,0.101383,0.111091,0.101459,0.098498,0.115528,0.11661,0.127491,0.14088,0.14685,0.182688,0.171154,0.107549,0.082909,0.079801,0.090721,0.111176,0.096443,0.08078,0.101085
0.092919,0.094466,0.094953,0.09945,0.111435,0.099554,0.0915,0.091993,0.079834,0.074214,0.093146,0.092971,0.089203,0.093698,0.084183,0.097159,0.112478,0.106211,0.12127,0.119598,0.081746,0.064196,0.063556,0.075497,0.094138,0.08365,0.069605,0.086484
0.065303,0.06917,0.074998,0.078077,0.088435,0.087485,0.087364,0.082794,0.068205,0.058445,0.069686,0.072349,0.068415,0.071589,0.061647,0.062153,0.072718,0.06773,0.071741,0.071043,0.056243,0.052041,0.050833,0.054284,0.066619,0.065735,0.060934,0.071598
0.054411,0.049693,0.065256,0.066635,0.0644,0.070614,0.072835,0.071683,0.066724,0.058429,0.053199,0.050927,0.051649,0.055227,0.050819,0.043179,0.045401,0.047311,0.058434,0.06024,0.046814,0.044064,0.041247,0.040369,0.052678,0.05832,0.062348,0.070694
0.059394,0.043093,0.063478,0.063404,0.054616,0.063603,0.05679,0.05654,0.064508,0.061543,0.047023,0.040677,0.045216,0.05556,0.05846,0.04661,0.043264,0.049362,0.069535,0.073148,0.05461,0.048037,0.041859,0.04152,0.053349,0.061287,0.071758,0.076869
0.064702,0.044646,0.065807,0.067067,0.057421,0.058294,0.043696,0.044697,0.060309,0.061163,0.047305,0.044057,0.048891,0.060097,0.06531,0.051536,0.048511,0.058524,0.082205,0.0848,0.064037,0.054642,0.044683,0.048306,0.061583,0.068559,0.076976,0.078375
0.06174,0.043679,0.059302,0.063506,0.057534,0.050777,0.035421,0.036439,0.052195,0.053549,0.042451,0.04371,0.051233,0.058437,0.059232,0.045802,0.044653,0.057514,0.080657,0.083983,0.06652,0.05508,0.042631,0.052252,0.065609,0.069519,0.070004,0.068514
0.049467,0.03809,0.046514,0.055213,0.052386,0.039637,0.025054,0.027534,0.041045,0.041894,0.031907,0.037191,0.053292,0.053291,0.042962,0.032075,0.031492,0.043469,0.062849,0.072798,0.064281,0.053665,0.040971,0.051418,0.060601,0.061588,0.054346,0.048025
0.037663,0.033785,0.035573,0.046491,0.049282,0.033983,0.019949,0.029747,0.041074,0.037272,0.027342,0.032309,0.053397,0.049102,0.032779,0.025145,0.020481,0.02812,0.045195,0.059979,0.055879,0.047043,0.037469,0.043281,0.050253,0.054067,0.045669,0.036544
0.033264,0.032335,0.026735,0.032997,0.042246,0.030048,0.019601,0.036152,0.041042,0.031641,0.027315,0.034877,0.05339,0.04742,0.032191,0.024406,0.020437,0.027713,0.038225,0.045376,0.039791,0.035172,0.033115,0.033586,0.035798,0.044701,0.044749,0.042277
0.032425,0.029965,0.018672,0.019053,0.033885,0.029843,0.020868,0.03979,0.037943,0.022858,0.022972,0.034413,0.046346,0.041879,0.034026,0.02542,0.023712,0.02816,0.030432,0.029109,0.027639,0.028404,0.027983,0.028877,0.029823,0.035954,0.043479,0.047879
0.043008,0.031734,0.015889,0.013583,0.03156,0.034421,0.023634,0.038915,0.035055,0.016214,0.015434,0.028599,0.034663,0.033234,0.034318,0.029517,0.026495,0.023634,0.023187,0.019829,0.024716,0.031175,0.02607,0.026013,0.028729,0.029218,0.037992,0.04685
0.056315,0.037815,0.017762,0.012455,0.031782,0.04075,0.026547,0.034788,0.028837,0.010865,0.011659,0.022745,0.026766,0.027672,0.029553,0.031845,0.027463,0.019134,0.020619,0.016174,0.022279,0.031633,0.02251,0.020699,0.02413,0.021024,0.029198,0.04281
0.063688,0.044204,0.021315,0.010415,0.03039,0.04521,0.029665,0.029992,0.022199,0.010895,0.013561,0.018027,0.019523,0.02116,0.021338,0.029633,0.029348,0.021722,0.022033,0.01557,0.020578,0.026924,0.016335,0.014514,0.017506,0.016078,0.028152,0.044491
