-0.000297,-0.000267,-0.000312,-0.000332,-0.000167,-0.000761,-0.000802,-0.000124,-0.000304,-0.000148,-0.000348,-0.000838,-0.000435,-0.001764,-0.001212,-0.000758,-0.000524,-0.000212,-0.000408,-0.000212,-0.000555,-0.000477,-0.000481,-0.000327,-4.9e-05,-0.000164,-0.000226,-8.4e-05,-0.000423,-0.000372,-0.000376,-0.000405,-0.000362,-0.000519,-0.000299,-0.000423,-5.2e-05,-0.000144,-0.00022,-2.8e-05,-0.000266,-0.000209,-8.5e-05,-0.000213,0.000213,-0.00029,-0.000149,-0.000282,-0.000142,-0.000319,-0.000453,-0.000141,-0.000116,-0.000359,-0.000502,-0.00017,-0.000341,-0.000186,-0.000223,-0.000371,-0.000676,-0.000721,-0.000494,-0.000597,-0.000236,-0.000365,-0.000347,-0.000122,-0.000195,-0.000242,-0.000148,-7e-05,0.000105,-0.000705,-0.000642,-0.000718,-0.000531,-0.00036,-0.000214,-0.000572,-0.00075,-0.000939,-0.000442,-0.000288,-0.000464,-0.000427,-0.000247,-0.000557,-0.000347,-0.000745,-0.000509,-0.000761,-0.000666,-0.000109,-0.000251,-0.000296,5.7e-05,-0.000213,-0.000272,-0.000208,-0.000322,-6.6e-05,-0.000299,-0.00053,-0.000594,-0.000469,-0.000463,-0.000274,-0.000863,-0.000581,-0.000406,-0.000598,-0.000124,-0.000315,-0.000353,-0.000422,-0.000362,-0.000189,-0.000134,-0.000298,-0.000212
-0.000322,-9.4e-05,-0.000124,0.000169,-0.000494,-0.000122,0.000452,0.000207,-3.8e-05,-9.1e-05,0.000138,0.000359,-0.000104,0.000483,0.000243,0.000249,-5.8e-05,-0.000335,-0.000172,-0.000116,-0.00013,-0.000189,0.000178,0.000105,-0.000596,-0.000486,-0.000122,3.7e-05,-7.6e-05,-0.000152,-0.000188,4.9e-05,0.000372,0.000256,0.000153,0.000152,-0.000295,-0.000158,0.000108,0.000124,2.7e-05,7.9e-05,-0.000197,1e-05,-9.8e-05,-1.7e-05,6e-06,0.000203,0.000125,0.000243,-4e-06,-0.000132,-0.000184,2.4e-05,0.000147,-2.7e-05,-9.4e-05,0.000131,-0.000185,5e-06,0.000162,2.8e-05,6.3e-05,0.000108,0.000143,-0.000127,0.000247,-2e-05,6e-06,-0.000351,0.000221,-0.000173,-0.000317,0.000259,0.000255,-7.1e-05,2.4e-05,-3e-04,-8e-06,-4e-05,0.000331,0.000474,0.000133,0.000373,-6.1e-05,-0.000172,0.000269,0.000499,0.000345,-0.000163,0.000184,-1.8e-05,-0.00033,2.6e-05,-0.000325,-0.000175,-0.000248,7.2e-05,-0.000459,-0.000118,0.000143,-0.000677,-0.000148,-2.9e-05,0.000296,0.000289,-7.5e-05,-3.1e-05,-0.000232,5e-05,0.00025,0.000408,0.000262,7.8e-05,0.000149,1.8e-05,-0.000119,-2e-06,-0.000281,0.000128,2e-05
0.000181,-5.5e-05,8.4e-05,0.000311,0.000107,0.00011,-0.000445,-0.000293,-0.000427,-0.000368,-0.000188,-0.000221,-2.4e-05,-0.000125,-0.000202,5.9e-05,8.3e-05,0.000321,0.000213,-0.000104,0.000233,0.00022,-0.00024,-0.000148,0.000346,9.2e-05,9.1e-05,-0.000241,0.000463,5.7e-05,0.000153,4.1e-05,-0.00044,-0.000133,-0.000267,-1e-05,-0.000209,8e-06,-0.000172,-0.000227,-0.000176,-0.00015,9.2e-05,5e-05,-0.00013,-0.000103,-0.000159,-0.000131,-0.000178,-9.6e-05,8.8e-05,-2.6e-05,-5.8e-05,-0.000231,7e-06,-0.000214,6.1e-05,-2.4e-05,5.8e-05,-0.000169,5.2e-05,0.000277,5.4e-05,0.000193,2.5e-05,0.000286,0.000136,2.8e-05,0.000123,0.000271,-6.8e-05,0.00016,0.000222,-0.000136,-0.000434,0.000128,1e-04,5.5e-05,6e-05,-0.00026,-0.000281,-0.000565,-0.000103,-9.7e-05,-0.000312,-4e-05,-0.00043,-0.000576,-0.000102,0.000131,0.000125,-0.000355,0.00014,-0.000135,-5.1e-05,-9e-06,0.000285,-1.4e-05,0.000586,0.000378,-0.000187,0.000164,-1e-06,-5.6e-05,-0.000397,-0.000129,0.000194,0.000374,0.000568,0.000508,-0.000118,-0.000214,-0.000296,-0.000236,-2e-04,7.1e-05,-1.5e-05,1e-06,0.000562,0.000106,8e-06
-1.7e-05,1.7e-05,-0.000113,-0.000476,-0.000128,7e-05,0.000149,8.8e-05,0.000269,0.000165,-2.2e-05,-7.7e-05,0.000323,0.00014,-0.000205,-0.000352,-7.8e-05,-0.000329,-6.8e-05,-0.00019,-0.000201,-0.000249,0.000182,7.6e-05,-0.000522,-0.000493,-0.000335,-0.000102,-0.000254,-4.8e-05,-0.00051,-0.000297,0.000144,3.1e-05,2.3e-05,-0.000166,-0.000207,7.5e-05,0.000183,3.1e-05,2.5e-05,4.2e-05,3.1e-05,-0.000151,-0.000137,-0.000191,-1.8e-05,-9.8e-05,-3.9e-05,7.7e-05,-0.000123,-0.000165,-8.2e-05,0.000183,-0.000193,-5.1e-05,-7.4e-05,0.000141,-0.000158,1.4e-05,5.5e-05,-0.000149,3.3e-05,-0.000267,-3.3e-05,-0.000168,-0.000136,-0.000188,-0.000413,-0.000254,-0.000128,-0.000346,-0.000411,7.8e-05,0.000299,-2e-06,-1e-06,-3e-06,1.8e-05,0.000305,0.000152,0.000592,9.8e-05,-3.2e-05,-3.1e-05,7e-06,0.000351,-1.7e-05,0.000271,-0.000249,-0.000519,0.000199,-0.000162,-0.000231,8.3e-05,0.000153,-6.3e-05,6.3e-05,-0.00045,-0.000203,2.5e-05,0.000233,-5.6e-05,-0.000221,-0.000111,1.1e-05,-0.000103,-6e-05,-0.000306,-0.00055,-0.000253,2.9e-05,0.00012,-0.000129,5.9e-05,0.000114,0,-0.000179,-0.000372,-5.6e-05,-3.7e-05
-4.4e-05,-3.8e-05,-3.1e-05,0.000273,0.000267,0.000157,6.6e-05,-0.000172,-1.2e-05,5.1e-05,0.00011,-4.5e-05,-0.000397,-0.000299,0.000221,0.000317,0.000126,6.6e-05,-9.4e-05,0.000165,0.000109,-2.6e-05,6.2e-05,1.3e-05,2.9e-05,0.000529,0.000327,4.6e-05,4e-06,-0.00014,8.4e-05,0.000223,-5.9e-05,-8.2e-05,7e-05,0.000127,0.000132,3.3e-05,-0.000181,1.4e-05,-3.3e-05,7.2e-05,-1e-06,0.000102,5e-05,0.000275,0.000251,9e-05,0.000157,2.8e-05,4.3e-05,6.7e-05,0.000125,0.000114,0.000194,0.000146,3e-05,-0.000102,-0.000244,-0.000131,-0.00025,-3.3e-05,-0.000347,0.000179,8.8e-05,-7.3e-05,0.000155,-0.000131,9.2e-05,0.000221,7e-06,-5e-05,-3.1e-05,5.8e-05,-0.000197,-0.000233,-0.000109,1.6e-05,-0.000236,-0.000313,-0.000333,-0.000387,-0.000178,-6.8e-05,-3.1e-05,-0.00011,-0.000203,-1.9e-05,-1.9e-05,7.3e-05,0.000386,6.6e-05,-0.00014,0.000264,0.000227,0.000125,-0.000237,-0.000113,1.9e-05,0.000224,0.000109,-1.8e-05,-0.000123,2.1e-05,-2.9e-05,0.000167,-9.8e-05,-0.000233,-0.000131,0.000241,0.00022,-7.8e-05,-7.1e-05,0.000116,-0.000108,-0.000229,-0.00026,6.4e-05,3.7e-05,-8.2e-05,-3.6e-05
3.7e-05,0.000128,0.000134,-4e-05,-5.9e-05,-0.000167,-0.000128,0.000218,0.000126,6.4e-05,-7.2e-05,0.000203,0.000258,6.4e-05,0.000103,-7e-05,-9.5e-05,9.8e-05,0.000238,3e-05,-9.9e-05,0.000128,4.2e-05,-0.000142,0.000103,0.000106,4.7e-05,-0.000144,-0.000117,0.000142,0.000118,-0.000202,1.4e-05,5.8e-05,-0.000113,-2.4e-05,-0.00023,-0.000186,-1.2e-05,0.000304,0.000193,7.4e-05,1.4e-05,4.4e-05,0.000176,8.3e-05,3.3e-05,-0.000107,3e-06,-0.000175,8.9e-05,8.8e-05,7.2e-05,-6.7e-05,-0.000115,-0.000202,-8e-06,8.9e-05,0.000129,0.000212,0.000335,-8e-05,0.000311,0.000101,0.000213,-4.8e-05,-0.000114,3.1e-05,-2.1e-05,-0.000121,3.8e-05,-2e-05,0.00019,-1.1e-05,5.5e-05,0.000291,0.000108,7e-05,0.000148,0.000283,0.000274,8.6e-05,0.000154,-2.9e-05,0.000138,-0.000164,0.000165,0.000315,0.000169,0.000101,0.000116,0.000226,0.000296,-0.00024,-0.000382,-0.000325,-8.9e-05,0.000227,-0.000136,-9.5e-05,-0.000229,0.000119,0.000171,-2e-05,0.000119,-0.000131,-5.8e-05,0.000126,0.000289,1.9e-05,-3.5e-05,-8e-06,0.000145,0.000105,7.7e-05,-7.2e-05,0.000229,8.5e-05,-8.2e-05,6.3e-05,0.000194
-3.7e-05,-0.00012,-6.1e-05,-3.4e-05,-9e-05,6e-06,-2.4e-05,-0.000175,-0.000106,-0.00021,1.4e-05,-0.000126,-0.000209,-5.2e-05,-0.000196,-0.000231,1e-06,-3.1e-05,-0.00019,-8.4e-05,0.000188,7.4e-05,-9.2e-05,-4.9e-05,-3.5e-05,-0.000251,-8.7e-05,4.8e-05,2.1e-05,0.000139,-3.2e-05,0.000185,-8e-06,-0.000257,-3.7e-05,-1.7e-05,0.000134,0.000294,4.9e-05,-0.000136,-6.3e-05,-0.000105,-2.5e-05,-0.000123,2.8e-05,-5.6e-05,1.8e-05,5.5e-05,9.3e-05,9.6e-05,-2.7e-05,-6.5e-05,5.7e-05,1.1e-05,7e-05,0.000203,6.2e-05,-5.2e-05,-9e-06,-0.000202,-0.000272,-4.5e-05,-9.6e-05,-0.000195,-0.000239,-3e-06,6.9e-05,-0.000132,0.00012,-6.9e-05,-1.1e-05,0.000149,-0.000103,-0.000335,-0.000101,-0.000209,-6.6e-05,-2.4e-05,2.8e-05,-0.000145,-0.000251,1.7e-05,-8.8e-05,-1.3e-05,1.2e-05,0.000248,0.000124,-8e-05,-2e-04,-0.00023,3.5e-05,-0.000251,-7.6e-05,0.000366,-4.7e-05,5.6e-05,8.3e-05,-2.1e-05,9.4e-05,-2.4e-05,0.000128,-0.000186,-0.000101,-0.000212,-7.1e-05,0.000126,0.000168,9.8e-05,-8.6e-05,-0.000108,-3.5e-05,-4e-06,-3.4e-05,-2.7e-05,-4.3e-05,7.2e-05,4.1e-05,-2e-05,2.5e-05,-0.000216,4.9e-05
-3.4e-05,3.7e-05,-1.1e-05,-2.9e-05,-2e-06,0.000146,0.000139,9.2e-05,-9.9e-05,9.9e-05,-7.9e-05,5.4e-05,0.000123,6.2e-05,5e-05,0.000219,1.5e-05,-0.000123,1.5e-05,3.1e-05,-0.000117,-0.000127,5.9e-05,0.000118,-3.3e-05,0.000162,7.7e-05,-4.2e-05,-0.000156,-0.000177,-0.000172,-8.9e-05,-1.3e-05,0.000186,-4.2e-05,6.5e-05,-3e-06,-3.1e-05,-6e-06,9.5e-05,4e-06,-0.000103,5e-05,-2e-05,4.8e-05,-0.000117,-7.2e-05,-1.7e-05,-8e-06,-2e-06,6e-06,-5.3e-05,-0.000107,-0.000164,-8e-05,-0.000127,-0.000106,-2.1e-05,-2.7e-05,0.000228,0.000102,7.6e-05,8.3e-05,0.000148,0.000199,7.2e-05,-6e-05,5.5e-05,-0.000155,-8e-05,0.000143,9.9e-05,1.1e-05,0.000266,9.2e-05,0.000183,2.9e-05,-5.8e-05,-0.000167,-5.9e-05,4.9e-05,-4.6e-05,5.9e-05,0.000204,0.000173,0.000122,-7.7e-05,0.000198,0.000119,3.4e-05,3.1e-05,0.00016,-6.8e-05,-0.000113,9.1e-05,0.000241,0.000114,6.9e-05,-2.7e-05,7.1e-05,-7e-05,7.7e-05,2e-06,-1.4e-05,-3.1e-05,-0.000134,-0.000135,-0.000128,0.000154,6.2e-05,0.000123,-9e-05,0.000114,-5.3e-05,-5.6e-05,1.2e-05,1.6e-05,0.000121,2.3e-05,-8.2e-05,-0.00012
9.2e-05,1.9e-05,5e-06,5e-06,-1.9e-05,-0.000192,-6.7e-05,-1.5e-05,-0.000126,-2.1e-05,0.000119,1.9e-05,9e-05,-7.7e-05,0.000216,-5e-05,6e-06,2.5e-05,2.8e-05,-8e-06,-9.6e-05,6.1e-05,-0.00012,-7.9e-05,3.6e-05,-5.8e-05,-6.1e-05,5.8e-05,2e-06,0.000267,3.2e-05,6.2e-05,0.000138,-3e-05,-2.5e-05,-4.2e-05,3.4e-05,4.6e-05,-0.00011,-4.4e-05,-7.5e-05,4.9e-05,-6.5e-05,-3e-06,-3.8e-05,-0.000102,-9.5e-05,-0.000126,1e-04,5.4e-05,9.3e-05,6e-05,-3e-06,0.000112,-1e-06,5.7e-05,4e-05,1.9e-05,-1.7e-05,-0.000108,-0.000105,-0.000202,-2.6e-05,-9.7e-05,-3.7e-05,-0.000131,2.5e-05,-4.6e-05,-0.00012,4.3e-05,-0.000118,7.1e-05,-6e-05,-9.5e-05,0.000139,-0.00023,-5.8e-05,-2.3e-05,6.4e-05,9.1e-05,-2.8e-05,-9e-06,-8.4e-05,-0.00024,-9.9e-05,-9.3e-05,3.6e-05,-0.000215,-0.000171,8.5e-05,-7e-05,-0.000212,-8e-05,-0.000101,7.2e-05,-0.000206,-0.00018,1.6e-05,-6.6e-05,-2.6e-05,1.3e-05,-4.7e-05,-0.000119,-1.5e-05,2.1e-05,2.1e-05,4e-06,0.00012,3.4e-05,4.2e-05,-0.000222,-8.4e-05,-9.7e-05,1.2e-05,-6.6e-05,2.6e-05,-3.8e-05,-0.000197,-6.8e-05,5e-06,9.3e-05
1.4e-05,-2.3e-05,3.7e-05,-4e-06,-2.7e-05,8.6e-05,-5.9e-05,-6.6e-05,0.000131,4e-05,-2.3e-05,-8.5e-05,-6.8e-05,7.4e-05,-0.000139,-3.4e-05,-0.00014,1.4e-05,-6.6e-05,2e-05,2.6e-05,-5.1e-05,8.2e-05,3.4e-05,5.3e-05,-4.8e-05,1.6e-05,8e-06,8e-06,-5.6e-05,1.4e-05,0.000199,-6.9e-05,5.4e-05,1.7e-05,0.000117,2.6e-05,-8.3e-05,5.7e-05,3.9e-05,0.000105,3.7e-05,0.000104,2e-06,8e-06,8e-06,5e-05,-3e-05,-4.2e-05,-0.000103,-5.5e-05,-9.3e-05,3.2e-05,4.9e-05,-4.1e-05,4e-06,-3.6e-05,3.2e-05,6.9e-05,-0.000175,-2.7e-05,0.000247,0.000184,6.5e-05,5.1e-05,5.9e-05,-9.4e-05,-4.9e-05,-4.4e-05,0.000121,1.1e-05,-9e-06,-7.4e-05,8.5e-05,-0.000117,0.000271,8.7e-05,6.1e-05,1.5e-05,4.3e-05,0.000155,0.000175,8.5e-05,0.000107,4e-05,3e-06,7.2e-05,0.000173,-4e-05,-6e-06,4.6e-05,0.000152,9.8e-05,-2.8e-05,-1.9e-05,0.000112,2.4e-05,-0.000142,-9e-06,0.000101,-2e-05,0.000174,8.4e-05,-3.5e-05,-6.2e-05,-0.000166,-8.5e-05,-1e-05,3.3e-05,-1e-06,0.000213,-3.5e-05,-6.8e-05,-1.6e-05,-7.2e-05,3e-06,2.2e-05,3.8e-05,2.6e-05,0.000139,4.7e-05
-5e-06,7e-06,-0.000103,6.6e-05,1.4e-05,-4.6e-05,-7e-06,3.4e-05,-5.8e-05,4.4e-05,5.6e-05,2.1e-05,2.6e-05,-4.1e-05,-3.9e-05,8.1e-05,0.000121,-5.3e-05,5.1e-05,-9e-06,4e-06,3.9e-05,2e-05,-0.000134,-2.4e-05,5e-05,-8e-06,2.7e-05,7.5e-05,4.4e-05,-9e-05,-0.000139,5e-06,-5.6e-05,-5.3e-05,-9.9e-05,-5.5e-05,1.5e-05,7.4e-05,-5.9e-05,-9.8e-05,-6e-06,-0.000106,-2.7e-05,2e-06,-5e-06,1.9e-05,5e-06,-0.000124,-3.7e-05,-2.6e-05,4.1e-05,-7.8e-05,-4.8e-05,1.3e-05,-5e-06,3.5e-05,-7.3e-05,-7.7e-05,-6e-06,4.5e-05,-0.000167,-9.5e-05,-3.6e-05,4.3e-05,-8e-06,3.6e-05,5.9e-05,8e-06,-3.2e-05,0.000113,6e-05,-5.4e-05,0.000104,-8e-05,-0.000169,-8.9e-05,-0.00013,3.1e-05,-2.4e-05,-0.000105,-0.000158,-0.000103,9e-06,-3.9e-05,-7.6e-05,-7.1e-05,-6e-05,-2e-05,3.2e-05,-8.2e-05,5e-05,8e-06,0.00011,-6.5e-05,-0.000142,3e-06,3.7e-05,0.000186,6e-06,-5e-06,6e-06,-9e-06,0.000206,8.7e-05,2.8e-05,8.1e-05,-9.3e-05,-0.000131,4.6e-05,-0.00016,-2.7e-05,2.3e-05,-2e-06,3.3e-05,2.6e-05,-3.4e-05,2.4e-05,7e-06,1.4e-05,-0.000112
-6.9e-05,-3.4e-05,0.000128,-1.7e-05,-1.7e-05,5.1e-05,8.6e-05,-3.7e-05,8.5e-05,-1.8e-05,-6e-05,-3.5e-05,-5e-05,5.7e-05,2.8e-05,-6.9e-05,-2.3e-05,3e-05,-3.8e-05,-3.7e-05,1.1e-05,-3.9e-05,4.8e-05,9.9e-05,-6e-06,5.8e-05,-1.8e-05,-0.000124,-3.8e-05,4e-06,2e-05,1.3e-05,-5.3e-05,1.2e-05,1.6e-05,8.8e-05,-1.6e-05,-5.2e-05,-0.000151,-2.9e-05,4.2e-05,-8e-06,3.6e-05,-1.4e-05,-1.5e-05,1.5e-05,0,-3e-05,2.8e-05,-0.000104,-3.3e-05,-2.3e-05,6.8e-05,1e-05,1.3e-05,-7.7e-05,-3.4e-05,-8e-06,6.6e-05,5.2e-05,3.4e-05,4.1e-05,3.4e-05,-1.9e-05,-7.6e-05,-3.8e-05,-1e-05,-7.6e-05,-7.3e-05,-3e-06,-5.8e-05,-4.7e-05,5.2e-05,-0.000109,0.000124,0.000119,4.4e-05,0.00012,-6e-06,-5.5e-05,9e-06,0.000105,5.4e-05,-2.7e-05,2.5e-05,-1e-06,-9.7e-05,-1.6e-05,-5e-05,-0.000105,-3.8e-05,-1.7e-05,7.6e-05,-1e-04,5.3e-05,9.9e-05,-2.3e-05,-2.3e-05,-3.6e-05,-2.6e-05,-1.9e-05,-3.3e-05,1.2e-05,-0.000108,-2.8e-05,-6.1e-05,-1e-04,-6.7e-05,6.9e-05,2.3e-05,4.6e-05,3.9e-05,-4e-06,-3e-05,3.4e-05,2e-05,4e-06,-1e-06,-2e-05,-4e-05,5.6e-05
-1.5e-05,1.4e-05,-6.8e-05,-2.7e-05,8e-06,-1.1e-05,-5e-06,1e-05,-4.7e-05,-6.3e-05,2.2e-05,5.8e-05,1.3e-05,-5.7e-05,1.6e-05,7.2e-05,2e-06,-3.9e-05,6e-06,2.5e-05,4.2e-05,3.4e-05,-5.1e-05,-3e-06,1.5e-05,-4.9e-05,4e-06,3.2e-05,9e-06,1.3e-05,-1.3e-05,3.6e-05,-6.3e-05,6e-06,7.5e-05,-2.1e-05,2.3e-05,5e-06,-1.9e-05,2e-05,-1.6e-05,-4e-05,-3.6e-05,3e-06,-2.1e-05,-1e-06,-3.1e-05,8e-06,-1.3e-05,6.5e-05,3.2e-05,1e-05,-5e-05,-6e-06,-5e-06,2.1e-05,5e-06,5.2e-05,-1.8e-05,-3.3e-05,-6.2e-05,-2.9e-05,4.6e-05,-4e-06,4e-06,2.6e-05,1.4e-05,3.4e-05,4.2e-05,3e-06,-5.2e-05,4.1e-05,4.3e-05,1.9e-05,-9.1e-05,-0.000111,-5e-06,-5.1e-05,-4.8e-05,5.8e-05,-6.3e-05,1e-05,-4e-06,1.2e-05,-4.8e-05,-1.4e-05,2.4e-05,3.5e-05,3.1e-05,6.6e-05,-9.8e-05,5e-06,-0.000119,8.7e-05,-8.4e-05,-1e-05,-2.7e-05,-1.4e-05,5.5e-05,-6e-06,-3.1e-05,-4e-05,-5.9e-05,-0.00012,1.5e-05,3.5e-05,6.4e-05,1.3e-05,-2.3e-05,-1e-06,2.7e-05,-3.2e-05,-1.6e-05,4.6e-05,2.6e-05,-3e-05,-2.1e-05,-7e-06,5.7e-05,-2.8e-05,-6.2e-05
-1e-06,7e-06,2e-06,-2e-06,1.1e-05,-5.5e-05,-3.6e-05,-1.3e-05,3e-05,2.2e-05,1.8e-05,6e-06,1.3e-05,1.7e-05,-5.4e-05,-4.8e-05,0,4.2e-05,-6e-06,4e-06,-6.3e-05,0,3.5e-05,-2.1e-05,2e-05,2.1e-05,1.8e-05,2.8e-05,-3.4e-05,-3.1e-05,4.2e-05,2.6e-05,2.1e-05,-5e-05,-2.5e-05,2.2e-05,-1e-06,-1.2e-05,-3.6e-05,-5e-05,2e-05,-4e-06,2e-05,-1.6e-05,-2.7e-05,4e-06,7e-06,-3e-06,1.6e-05,-3.7e-05,-2e-06,7e-06,3.1e-05,-1.3e-05,2e-06,-1e-05,4e-06,3.8e-05,2e-06,-2.6e-05,2.3e-05,1.1e-05,-4.9e-05,-1.9e-05,6e-06,-4.2e-05,-1.7e-05,-1.1e-05,-5.2e-05,1.3e-05,-1.4e-05,5.2e-05,4.1e-05,1.1e-05,4.5e-05,4.5e-05,5e-06,2.3e-05,1.5e-05,-1.4e-05,4e-06,-2.8e-05,1.4e-05,-1e-06,3.2e-05,7.1e-05,2.5e-05,-1.2e-05,4.7e-05,2.5e-05,9e-06,-3.7e-05,7.4e-05,-8.5e-05,2.7e-05,8e-06,-2e-05,-1.4e-05,2.7e-05,-1.1e-05,2.6e-05,1e-05,6e-06,0.00013,-1.6e-05,4e-05,-1.3e-05,4e-06,-8e-06,6e-06,-3.9e-05,7e-05,-4.3e-05,-2.2e-05,-1.1e-05,4.3e-05,1.6e-05,3.9e-05,-3.9e-05,1.4e-05,-5e-05
-3e-06,1.2e-05,1e-05,1.5e-05,1e-06,1.7e-05,-1e-05,2e-06,-1.1e-05,-1.3e-05,-1.7e-05,-2.1e-05,8e-06,-2.8e-05,1.6e-05,3.5e-05,-4.2e-05,-1.9e-05,-3e-06,-1.5e-05,3.3e-05,-5.6e-05,-3.7e-05,4.1e-05,2.6e-05,3.4e-05,-2e-06,8e-06,1.8e-05,-4.5e-05,-1.3e-05,-2.8e-05,1.7e-05,5.4e-05,2.1e-05,-3e-05,-8e-06,-9e-06,4.6e-05,1.1e-05,-1.3e-05,-2e-05,-2.1e-05,-7e-06,1.2e-05,-4.6e-05,-6e-06,-2.6e-05,-3.6e-05,2e-05,-9e-06,1.4e-05,-1.3e-05,-1e-06,-7e-06,1.5e-05,-1e-05,0,8e-06,4.4e-05,-4.5e-05,4.2e-05,1.3e-05,2e-05,-2.2e-05,2.6e-05,2.4e-05,1.1e-05,8.1e-05,-9e-06,1.9e-05,-3.5e-05,4e-06,-2e-06,3.7e-05,2.9e-05,-1.9e-05,6e-06,-2.1e-05,-3e-06,3.6e-05,1.8e-05,2e-06,9e-06,-3e-05,-1.9e-05,4e-06,-1.2e-05,-2.2e-05,1.5e-05,-2.4e-05,1e-06,-1.9e-05,1.5e-05,4.3e-05,-3.6e-05,3e-06,8e-06,4e-06,6e-06,-1e-05,-6.6e-05,-2e-05,-2.9e-05,-2.9e-05,1e-06,3e-06,-5e-06,-5e-06,-1.2e-05,-2.5e-05,-7e-05,-2.7e-05,-6e-06,-1.3e-05,1.6e-05,2e-06,-4e-06,-1.8e-05,4e-06,3.7e-05
8e-06,0,-3e-06,-1e-05,-9e-06,-7e-06,1.1e-05,-1.4e-05,-1.3e-05,-5e-06,-9e-06,-1.3e-05,1.4e-05,2.7e-05,4.5e-05,-3.3e-05,1.5e-05,-4e-06,-2e-06,1.9e-05,8e-06,2.7e-05,-1.5e-05,-5.3e-05,-4.4e-05,-3.5e-05,3e-06,1e-05,8e-06,-3.5e-05,6e-06,1.8e-05,-6e-06,-2.7e-05,-8e-06,8e-06,6e-06,9e-06,5e-06,1.2e-05,0,1.4e-05,4e-06,3e-06,-4e-06,2e-06,-1e-05,-1e-06,-1.6e-05,1.5e-05,-7e-06,-4e-06,5e-06,1.5e-05,4e-06,-5e-06,3e-06,-2.7e-05,-9e-06,-7e-06,-1.2e-05,-1.8e-05,-5e-06,-3.8e-05,2.9e-05,1e-06,-1.4e-05,-1.5e-05,-4.4e-05,5.1e-05,-2.5e-05,-1e-05,1.3e-05,4e-05,-7.1e-05,-6.1e-05,-9e-06,-1.1e-05,1.6e-05,5e-06,-9e-06,-7e-06,1e-05,-7e-06,-9e-06,-6e-06,1.2e-05,5e-06,-5e-06,3e-06,-4e-06,-6.1e-05,1.1e-05,4.6e-05,1e-06,0,-4e-06,3.1e-05,-1.6e-05,-2.5e-05,-1.4e-05,7e-06,2e-06,7e-06,2.2e-05,3.1e-05,2e-05,-9e-06,-1.2e-05,6e-06,6e-05,1.4e-05,1.3e-05,1.1e-05,4e-06,-5e-06,3e-06,-3.2e-05,1e-05,-3e-06,-1.1e-05
6e-06,-1e-05,-1e-06,8e-06,-3e-06,7e-06,3e-06,6e-06,-1.6e-05,1.5e-05,1.2e-05,2.1e-05,-2e-05,-4e-06,-2.3e-05,3e-06,5e-06,6e-06,-5e-06,1e-06,-1e-05,-2.1e-05,7e-06,-8e-06,2.9e-05,-1.2e-05,1.7e-05,-1.2e-05,-2.6e-05,1.4e-05,3e-06,-1.2e-05,-2e-05,1.1e-05,-8e-06,-6e-06,-9e-06,1.3e-05,-8e-06,5e-06,1e-05,7e-06,1e-05,-5e-06,-1e-06,-2e-05,-4e-06,6e-06,2.1e-05,-2.3e-05,-5e-06,-5e-06,8e-06,6e-06,3e-06,1e-05,-5e-06,5e-06,1e-06,-1.1e-05,-6e-06,-1.5e-05,-1e-06,1.3e-05,1e-06,-4e-06,1.4e-05,0,-3e-06,9e-06,4.1e-05,-6e-06,-3e-06,1.2e-05,1.7e-05,2.5e-05,1.6e-05,6e-06,-9e-06,0,3e-06,-9e-06,-9e-06,1.2e-05,1.3e-05,1.3e-05,-1e-05,2.3e-05,-9e-06,-1.1e-05,1.4e-05,2.8e-05,9e-06,-4.6e-05,-2.5e-05,8e-06,4e-06,-2.8e-05,2.5e-05,-9e-06,9e-06,3e-06,0,-6e-06,5e-06,-8e-06,-1.7e-05,1e-06,-8e-06,-7e-06,-3.6e-05,7e-06,-3e-06,-1e-06,4e-06,-1.5e-05,2e-06,1.9e-05,5e-06,1.9e-05,2.4e-05
-5e-06,4e-06,-4e-06,0,-7e-06,-4e-06,1.3e-05,3e-06,1.2e-05,-2e-06,-4e-06,2e-06,2e-06,8e-06,3e-06,3e-06,9e-06,1.7e-05,5e-06,-6e-06,-1.3e-05,1.8e-05,-4e-06,1.8e-05,-3e-06,1.3e-05,-4e-06,-8e-06,8e-06,-2.7e-05,1e-05,-4e-06,2.3e-05,-4e-06,1e-05,-1.3e-05,9e-06,-1e-06,-6e-06,-1.3e-05,-7e-06,-1e-06,4e-06,-1e-06,-2e-06,-1.3e-05,9e-06,-7e-06,-2.3e-05,1.2e-05,-2e-06,-2e-06,8e-06,-5e-06,-6e-06,-1.2e-05,-2e-06,-1e-06,1e-06,2.9e-05,4e-06,-1e-06,-1.2e-05,6e-06,-1.1e-05,-1e-05,-1.1e-05,4e-06,-4e-06,1.2e-05,-3.8e-05,2e-05,-4e-06,-1.2e-05,-3e-06,-2.5e-05,-1e-06,-1.1e-05,-2e-06,7e-06,-2.2e-05,3.1e-05,1.1e-05,-1.7e-05,-4e-06,2.6e-05,1.3e-05,-2.9e-05,-1.5e-05,-2e-06,6e-06,-2.5e-05,-8e-06,3.4e-05,1.1e-05,-1e-06,5e-06,1.2e-05,-9e-06,-5e-06,-1e-05,9e-06,-2e-06,1.7e-05,-1.1e-05,5e-06,-7e-06,-1.2e-05,-1.1e-05,1.1e-05,-1.2e-05,-4.1e-05,4e-06,-2e-06,-1.7e-05,-1.6e-05,2e-06,-1.8e-05,0,-3e-06,0
-3e-06,-1e-05,-3e-06,-3e-06,-4e-06,1.7e-05,-6e-06,-6e-06,6e-06,-8e-06,-5e-06,-1.2e-05,-5e-06,-1.3e-05,7e-06,3e-06,-6e-06,-1.1e-05,-3e-06,2e-06,1e-06,-1.4e-05,1.5e-05,-2e-06,3e-06,-7e-06,-8e-06,8e-06,1.4e-05,-2e-06,-2.1e-05,-1.6e-05,-1.4e-05,-6e-06,0,-1e-06,-4e-06,9e-06,7e-06,1e-06,3e-06,1e-06,0,-2e-06,4e-06,-3e-06,3e-06,-6e-06,2.9e-05,0,1e-06,6e-06,-8e-06,-2e-06,-2e-06,1.5e-05,1e-06,-2e-06,0,-1.8e-05,9e-06,8e-06,-8e-06,3e-06,-6e-06,0,3e-06,-1.6e-05,6e-06,-1.7e-05,2e-06,-1.5e-05,2e-06,-2.4e-05,1e-05,4.8e-05,1e-06,-3e-06,1e-05,-1.5e-05,1.4e-05,-1.3e-05,-1e-06,7e-06,0,1.4e-05,-9e-06,3e-06,-1.2e-05,-1.1e-05,2.7e-05,1.6e-05,2.3e-05,-1.4e-05,-1.6e-05,2.2e-05,-3e-06,3e-06,1.2e-05,1e-06,0,4e-06,4e-06,-1e-05,2e-06,-9e-06,4e-06,3e-06,9e-06,-7e-06,2.6e-05,2.2e-05,0,-1e-05,3e-06,2e-06,8e-06,4e-06,-1e-06,-2e-06,-7e-06
1e-06,-1e-06,1.4e-05,0,-1e-06,-1.5e-05,-1.4e-05,8e-06,2e-06,0,1e-05,-1e-06,6e-06,5e-06,5e-06,5e-06,-3e-06,1e-06,-1e-06,5e-06,5e-06,-8e-06,-1.1e-05,-1e-06,-3e-06,-1.8e-05,9e-06,-2e-06,4e-06,1e-06,7e-06,-8e-06,0,1.1e-05,3e-06,1e-06,3e-06,0,1e-06,1.1e-05,-7e-06,-8e-06,-3e-06,0,4e-06,8e-06,-1e-06,2e-06,-2e-06,-1e-06,5e-06,-8e-06,1e-05,0,1e-06,-8e-06,-4e-06,2e-06,3e-06,-1.6e-05,-5e-06,-6e-06,-6e-06,-1e-05,7e-06,2e-06,-4e-06,1.5e-05,-1.1e-05,1e-05,2.6e-05,-4e-06,0,4e-06,1e-06,-4.1e-05,-2e-06,7e-06,-2e-06,1.2e-05,-2e-06,-5e-06,-2e-06,1.3e-05,9e-06,-7e-06,-6e-06,8e-06,4e-06,5e-06,-1.3e-05,1.5e-05,-7e-06,-1e-06,8e-06,-2.3e-05,-1e-06,-5e-06,-6e-06,-3e-06,4e-06,-7e-06,-7e-06,-4e-06,-2e-06,-1.1e-05,3e-06,2e-06,3e-06,2e-06,-2e-05,-1.6e-05,7e-06,2e-05,2e-06,5e-06,0,0,-2e-06,-1.7e-05,2.6e-05
6e-06,2e-06,-1.7e-05,-1e-06,0,7e-06,8e-06,-1e-05,1.6e-05,1e-06,0,3e-06,5e-06,-9e-06,-1.2e-05,-1e-05,3e-06,0,-4e-06,2e-06,8e-06,1.6e-05,1.6e-05,-5e-06,-5e-06,1.3e-05,-5e-06,4e-06,-1.4e-05,0,1e-06,1.5e-05,1.2e-05,-9e-06,1.2e-05,-7e-06,1e-06,-1e-06,-1.4e-05,-1.3e-05,6e-06,-3e-06,7e-06,-3e-06,-2e-06,-1e-06,-2e-06,-6e-06,2e-06,-1e-06,0,3e-06,-5e-06,-3e-06,-1e-06,1e-06,2e-06,3e-06,2e-06,-2e-06,6e-06,7e-06,1e-06,7e-06,-1e-06,1e-06,4e-06,-1.5e-05,-7e-06,-9e-06,-1.4e-05,-1.7e-05,3e-06,-3e-06,-1.9e-05,2e-05,5e-06,-9e-06,-8e-06,4e-06,0,1.1e-05,4e-06,-2.1e-05,-3e-06,8e-06,4e-06,-4e-06,3e-06,4e-06,1.4e-05,-7e-06,1e-06,5e-06,5e-06,1e-06,-1e-06,5e-06,3e-06,-2e-06,-7e-06,4e-06,1e-06,4e-06,2e-06,-1.4e-05,-2e-06,5e-06,1e-06,-4e-06,1e-05,2e-06,3e-06,-1.6e-05,6e-06,3e-06,2e-06,3e-06,1e-06,1e-06,-1.5e-05
3e-06,-4e-06,9e-06,1e-06,1e-06,-2e-06,8e-06,1e-05,-1.2e-05,-6e-06,2e-06,-2e-06,-3e-06,8e-06,3e-06,9e-06,0,4e-06,1e-06,-5e-06,-8e-06,-1.1e-05,-1.9e-05,-7e-06,1.1e-05,3e-06,-9e-06,2e-06,-4e-06,7e-06,1e-06,-1.6e-05,-6e-06,1e-05,-4e-06,-1e-06,-1e-06,-1e-06,9e-06,4e-06,-3e-06,-3e-06,-8e-06,-1e-06,3e-06,3e-06,0,-2e-06,0,-1.2e-05,-4e-06,1e-06,-3e-06,-1e-06,0,3e-06,-2e-06,-2e-06,-3e-06,9e-06,-1.3e-05,2e-06,3e-06,7e-06,-4e-06,-1e-06,-3e-06,5e-06,-4e-06,1.3e-05,-5e-06,2e-06,2e-06,4e-06,2.1e-05,-1.6e-05,-3e-06,8e-06,6e-06,-9e-06,5e-06,-2e-05,-5e-06,1.4e-05,1e-06,-1.5e-05,-4e-06,0,1e-06,1e-06,-3e-06,1.1e-05,-2e-06,5e-06,4e-06,-2e-06,3e-06,-6e-06,-9e-06,6e-06,1e-06,-1.1e-05,-1e-06,-6e-06,-1e-06,9e-06,-1e-06,1e-06,-2e-06,-3e-06,-5e-06,8e-06,-4e-06,9e-06,3e-06,-5e-06,-2e-06,-7e-06,2e-06,1.1e-05,-1e-06
0,3e-06,1e-06,-1e-06,2e-06,-4e-06,-5e-06,-7e-06,5e-06,9e-06,-7e-06,0,1e-06,-3e-06,6e-06,-2e-06,-7e-06,-2e-06,-7e-06,5e-06,-1e-06,9e-06,6e-06,4e-06,-9e-06,-1e-05,6e-06,-4e-06,4e-06,5e-06,-3e-06,-7e-06,-2e-06,-3e-06,5e-06,4e-06,0,-4e-06,-1e-06,0,0,1e-06,5e-06,0,-2e-06,-2e-06,-1e-06,0,-3e-06,-2e-06,1e-06,0,1e-06,2e-06,0,-2e-06,-1e-06,-3e-06,3e-06,-1.7e-05,-1e-06,-8e-06,-1.1e-05,-1.4e-05,1.1e-05,-5e-06,4e-06,-2e-06,8e-06,1e-06,5e-06,-1e-06,5e-06,1.3e-05,-1.9e-05,2.1e-05,0,-1e-06,-4e-06,1e-06,-1e-06,4e-06,6e-06,-5e-06,4e-06,1e-05,-1e-06,-3e-06,1e-05,-2e-06,-7e-06,-4e-06,3e-06,-1.9e-05,-6e-06,6e-06,-4e-06,-2e-06,5e-06,1e-06,-1e-06,1.7e-05,-4e-06,1.8e-05,-5e-06,-2e-06,3e-06,-1.1e-05,9e-06,-1e-06,-4e-06,-1.5e-05,0,-1.1e-05,-6e-06,-2e-06,1e-06,1e-05,0,3e-06,1e-05
-3e-06,-3e-06,-5e-06,3e-06,0,0,-2e-06,1e-06,-1e-05,2e-06,8e-06,5e-06,-1e-05,6e-06,-1e-05,-7e-06,5e-06,-3e-06,5e-06,0,3e-06,-1.1e-05,-7e-06,3e-06,1e-06,6e-06,-1e-06,-4e-06,5e-06,5e-06,2e-06,1e-06,-3e-06,-6e-06,7e-06,1e-06,2e-06,-1e-06,1e-06,2e-06,-1e-06,5e-06,-3e-06,-1e-06,1e-06,-8e-06,-3e-06,-5e-06,8e-06,3e-06,3e-06,1e-06,-5e-06,3e-06,0,-6e-06,0,5e-06,0,-5e-06,-7e-06,9e-06,9e-06,7e-06,-4e-06,3e-06,-5e-06,-4e-06,-2e-06,7e-06,9e-06,-1e-06,2e-06,-5e-06,-1e-06,-1.1e-05,0,1e-06,5e-06,1e-06,-1e-06,4e-06,-4e-06,-2e-06,-1e-06,1e-06,-7e-06,2e-06,-3e-06,-3e-06,-1e-05,1.1e-05,4e-06,2.1e-05,-3e-06,3e-06,1e-06,0,-1.1e-05,-1e-06,-2e-06,-1e-05,1e-06,-6e-06,7e-06,1.2e-05,-2e-06,3e-06,4e-06,-1e-06,7e-06,1.1e-05,-5e-06,1.7e-05,1e-06,-4e-06,-2e-06,2e-06,-1e-06,-2e-06,-1.2e-05
-3e-06,2e-06,3e-06,-3e-06,-2e-06,0,0,2e-06,-3e-06,-5e-06,-5e-06,-1e-06,5e-06,-2e-06,-2e-06,7e-06,-8e-06,5e-06,-3e-06,0,3e-06,8e-06,3e-06,0,1e-06,7e-06,-4e-06,4e-06,-2e-06,1.3e-05,0,6e-06,2e-06,4e-06,-6e-06,-4e-06,0,-5e-06,-4e-06,-3e-06,2e-06,1e-06,3e-06,-1e-06,-3e-06,-5e-06,0,-2e-06,-8e-06,0,1e-06,1e-06,4e-06,-1e-06,-1e-06,6e-06,-1e-06,2e-06,0,1.2e-05,2e-06,-1.1e-05,-2e-06,-2e-06,-6e-06,-1e-06,4e-06,3e-06,-9e-06,-7e-06,-1.2e-05,-2e-06,0,-7e-06,2.6e-05,0,1e-06,1e-06,-2e-06,4e-06,-6e-06,-7e-06,4e-06,4e-06,0,-2e-06,4e-06,3e-06,-1e-06,1e-06,-1.3e-05,-1.3e-05,-3e-06,-1.4e-05,0,-1e-06,-2e-06,1e-06,-1e-06,0,0,1.5e-05,-2e-06,-7e-06,-4e-06,4e-06,3e-06,0,3e-06,4e-06,2e-06,-1.2e-05,0,-1.4e-05,-2e-06,4e-06,-1e-06,-1.2e-05,1e-06,0,1e-06
-2e-06,0,-1e-06,2e-06,-2e-06,3e-06,-1e-06,-5e-06,6e-06,2e-06,1e-06,-5e-06,3e-06,-1e-06,2e-06,-3e-06,9e-06,-2e-06,1e-06,-1e-06,-2e-06,0,2e-06,0,-3e-06,-1e-05,5e-06,0,-1e-06,-2e-06,0,-4e-06,-3e-06,-2e-06,4e-06,5e-06,0,1e-06,-7e-06,-2e-06,-1e-06,-2e-06,-4e-06,0,0,-7e-06,1e-06,1e-06,-4e-06,3e-06,-1e-06,1e-06,-3e-06,-2e-06,0,-2e-06,0,-2e-06,1e-06,-8e-06,0,9e-06,2e-06,0,4e-06,0,-1e-06,-7e-06,3e-06,0,1.3e-05,-2e-06,0,-2e-06,-2.3e-05,4e-06,-1e-06,-1e-06,-4e-06,-5e-06,3e-06,4e-06,-4e-06,0,-2e-06,-8e-06,4e-06,-4e-06,-3e-06,2e-06,4e-06,1.6e-05,-1e-06,8e-06,1e-06,-8e-06,3e-06,1e-06,-5e-06,2e-06,-2e-06,-9e-06,0,4e-06,0,3e-06,0,3e-06,-2e-06,-3e-06,-1.7e-05,-1e-06,0,6e-06,0,2e-06,-1e-06,8e-06,0,-3e-06,-7e-06
1e-06,-2e-06,2e-06,-2e-06,-2e-06,-1e-06,3e-06,6e-06,-3e-06,0,-3e-06,1e-06,1e-06,-3e-06,-1e-06,2e-06,-2e-06,2e-06,0,2e-06,-3e-06,-5e-06,4e-06,-1.2e-05,3e-06,2e-06,2e-06,2e-06,3e-06,7e-06,0,-1e-06,0,4e-06,3e-06,0,0,-2e-06,5e-06,6e-06,0,-3e-06,4e-06,0,-1e-06,-5e-06,1e-06,-2e-06,0,-2e-06,-1e-06,0,4e-06,0,0,-1e-06,-1e-06,-4e-06,0,2e-06,3e-06,1e-06,1e-06,-1e-06,-2e-06,-1e-06,0,6e-06,2e-06,-7e-06,-1.4e-05,0,0,-2e-06,2e-06,2e-06,-1e-06,-1e-06,6e-06,0,1e-06,-2e-06,5e-06,-4e-06,1e-06,-1e-06,-2e-06,0,-5e-06,-1e-06,-1.2e-05,-1e-05,2e-06,-4e-06,2e-06,1e-06,-3e-06,-1e-06,1e-06,1e-06,0,6e-06,-1e-06,3e-06,2e-06,-1e-06,-4e-06,-1e-06,-3e-06,1e-06,2.1e-05,2e-06,-1e-06,-1e-06,1e-06,-1e-06,0,-3e-06,1e-06,0,-3e-06
1e-06,3e-06,-3e-06,2e-06,-1e-06,0,2e-06,-5e-06,7e-06,-4e-06,4e-06,3e-06,0,-2e-06,-2e-06,-5e-06,-1e-06,-4e-06,-1e-06,0,-1e-06,2e-06,2e-06,6e-06,-5e-06,6e-06,-2e-06,0,0,3e-06,1e-06,5e-06,4e-06,-1e-06,-3e-06,1e-06,0,1e-06,4e-06,-5e-06,1e-06,-2e-06,-3e-06,-1e-06,0,3e-06,-1e-06,-2e-06,-2e-06,-1e-06,-1e-06,-1e-06,1e-06,0,-1e-06,3e-06,-1e-06,-1e-06,0,2e-06,0,-4e-06,3e-06,1e-06,-2e-06,-1e-06,0,-7e-06,-1e-06,2e-06,3e-06,3e-06,-1e-06,2e-06,8e-06,6e-06,1e-06,1e-06,-3e-06,3e-06,1e-06,-6e-06,-4e-06,4e-06,1e-06,6e-06,2e-06,4e-06,-1e-06,0,5e-06,2e-06,-1e-06,4e-06,2e-06,4e-06,0,1e-06,-5e-06,-2e-06,0,-1.1e-05,-2e-06,-3e-06,-3e-06,-2e-06,2e-06,-3e-06,-2e-06,-1e-06,-7e-06,-1.1e-05,0,2e-06,-1e-06,1e-06,0,-1e-06,0,-1e-06,8e-06
1e-06,-3e-06,1e-06,-3e-06,0,-2e-06,-4e-06,3e-06,2e-06,2e-06,-3e-06,-1e-06,-6e-06,1e-06,3e-06,5e-06,-1e-06,5e-06,2e-06,-1e-06,4e-06,-3e-06,-4e-06,5e-06,3e-06,-4e-06,3e-06,-3e-06,-3e-06,-6e-06,-1e-06,4e-06,-5e-06,0,6e-06,0,0,1e-06,0,2e-06,-1e-06,0,3e-06,0,0,0,1e-06,1e-06,-2e-06,2e-06,-1e-06,1e-06,0,0,0,-2e-06,-1e-06,2e-06,1e-06,0,-4e-06,3e-06,1e-06,-1e-06,5e-06,1e-06,1e-06,4e-06,-8e-06,1e-06,8e-06,5e-06,-1e-06,4e-06,-9e-06,-1.4e-05,0,-2e-06,-3e-06,-1e-06,-1e-06,3e-06,3e-06,2e-06,-2e-06,-2e-06,0,-1e-06,0,-2e-06,0,0,0,-7e-06,-2e-06,0,1e-06,1e-06,1e-06,0,-1e-06,4e-06,1e-06,1e-06,3e-06,-6e-06,0,2e-06,-2e-06,2e-06,-1e-05,9e-06,-2e-06,-2e-06,1e-06,-2e-06,0,-1e-06,-1e-06,2e-06,-5e-06
-1e-06,1e-06,0,2e-06,0,2e-06,-2e-06,-3e-06,-1e-06,1e-06,1e-06,-3e-06,2e-06,2e-06,4e-06,0,1e-06,-4e-06,-4e-06,2e-06,0,4e-06,3e-06,-6e-06,-2e-06,-2e-06,0,1e-06,-2e-06,3e-06,1e-06,-2e-06,1e-06,1e-06,0,1e-06,0,3e-06,-2e-06,0,1e-06,0,-3e-06,0,-1e-06,1e-06,0,-2e-06,4e-06,2e-06,0,-1e-06,1e-06,1e-06,0,-1e-06,-1e-06,1e-06,-1e-06,-8e-06,-1e-06,-5e-06,-1e-06,-1e-06,-2e-06,0,-2e-06,-3e-06,1e-06,1e-06,-5e-06,0,0,0,9e-06,1.1e-05,0,2e-06,4e-06,-1e-06,-1e-06,-1e-06,-2e-06,-7e-06,-1e-06,4e-06,1e-06,-2e-06,3e-06,1e-06,1e-05,-8e-06,-2e-06,1.1e-05,-3e-06,0,0,1e-06,-4e-06,1e-06,0,-4e-06,-2e-06,2e-06,-2e-06,-3e-06,-1e-06,-2e-06,0,-2e-06,1.2e-05,-7e-06,3e-06,-1e-06,1e-06,0,0,4e-06,0,5e-06,4e-06
-1e-06,0,1e-06,-1e-06,0,-2e-06,4e-06,1e-06,0,-3e-06,-1e-06,1e-06,0,2e-06,-3e-06,-2e-06,-1e-06,3e-06,2e-06,0,-2e-06,-4e-06,-7e-06,6e-06,0,6e-06,-3e-06,1e-06,1e-06,-5e-06,-1e-06,-2e-06,3e-06,-5e-06,-1e-06,1e-06,1e-06,0,1e-06,2e-06,-1e-06,2e-06,3e-06,0,1e-06,1e-06,0,-2e-06,-1e-06,-1e-06,0,0,0,1e-06,0,2e-06,-1e-06,0,0,2e-06,-4e-06,5e-06,2e-06,3e-06,-1e-06,-1e-06,2e-06,-1e-06,0,-2e-06,-3e-06,0,0,-3e-06,-4e-06,-7e-06,0,0,-3e-06,-1e-06,0,0,2e-06,6e-06,1e-06,-3e-06,-1e-06,1e-06,1e-06,-1e-06,3e-06,2e-06,1e-06,-9e-06,1e-06,-3e-06,0,-1e-06,1e-06,-1e-06,-1e-06,4e-06,0,-1e-06,0,-1e-06,-1e-06,2e-06,-3e-06,2e-06,-1e-06,0,0,5e-06,0,1e-06,0,-3e-06,1e-06,-2e-06,4e-06
0,-1e-06,-2e-06,1e-06,0,1e-06,1e-06,0,-5e-06,2e-06,2e-06,2e-06,3e-06,-1e-06,1e-06,4e-06,1e-06,-3e-06,-1e-06,0,-1e-06,0,3e-06,-8e-06,0,-1e-06,0,-1e-06,3e-06,-3e-06,-2e-06,9e-06,-2e-06,5e-06,5e-06,-2e-06,0,2e-06,0,-1e-06,1e-06,1e-06,-3e-06,0,-1e-06,-2e-06,-1e-06,0,3e-06,0,0,1e-06,-2e-06,0,0,0,0,0,1e-06,2e-06,1e-06,-2e-06,-2e-06,-4e-06,1e-06,-1e-06,-2e-06,1e-06,3e-06,-2e-06,2e-06,1e-06,0,-1e-06,2e-06,9e-06,1e-06,0,3e-06,1e-06,-1e-06,3e-06,-1e-06,-1e-06,0,1e-06,-1e-06,2e-06,3e-06,0,1e-06,-7e-06,0,4e-06,1e-06,-3e-06,1e-06,0,-3e-06,-1e-06,0,-3e-06,0,0,2e-06,1e-06,1e-06,0,-2e-06,0,-9e-06,4e-06,-1e-06,-5e-06,0,1e-06,0,2e-06,0,-2e-06,-3e-06
1e-06,1e-06,3e-06,-1e-06,0,1e-06,-3e-06,-1e-06,-1e-06,1e-06,-2e-06,0,0,-2e-06,2e-06,-1e-06,-2e-06,3e-06,0,-1e-06,1e-06,1e-06,-3e-06,0,1e-06,-3e-06,1e-06,1e-06,0,1e-06,2e-06,-2e-06,1e-06,-1e-06,-3e-06,1e-06,0,-1e-06,0,-1e-06,0,-1e-06,2e-06,0,1e-06,-4e-06,0,-2e-06,-2e-06,-3e-06,-1e-06,0,1e-06,-1e-06,0,-2e-06,0,0,-1e-06,-9e-06,-1e-06,2e-06,3e-06,2e-06,-1e-06,1e-06,1e-06,-4e-06,-9e-06,-4e-06,7e-06,4e-06,0,-1e-06,-1e-06,-1.4e-05,0,2e-06,-1e-06,-1e-06,1e-06,-1e-06,0,-4e-06,-1e-06,-1e-06,1e-06,-2e-06,0,0,7e-06,6e-06,-1e-06,2e-06,1e-06,6e-06,-1e-06,0,0,0,0,3e-06,-1e-06,0,-3e-06,5e-06,0,-1e-06,-1e-06,0,8e-06,-9e-06,0,3e-06,-2e-06,0,0,2e-06,0,-1e-06,4e-06
1e-06,-1e-06,-2e-06,0,0,-1e-06,0,3e-06,2e-06,-3e-06,0,-1e-06,-2e-06,-2e-06,-2e-06,-1e-06,3e-06,-1e-06,0,1e-06,1e-06,-1e-06,5e-06,5e-06,1e-06,3e-06,-2e-06,-1e-06,-2e-06,-9e-06,0,-2e-06,1e-06,0,0,0,0,0,-1e-06,3e-06,0,-1e-06,-2e-06,0,-1e-06,-3e-06,0,-1e-06,2e-06,0,0,1e-06,-2e-06,0,-1e-06,4e-06,0,0,0,2e-06,2e-06,-2e-06,-2e-06,0,0,0,0,3e-06,4e-06,-2e-06,-1.1e-05,1e-06,0,0,-8e-06,9e-06,0,-2e-06,-2e-06,0,0,1e-06,0,5e-06,0,3e-06,-1e-06,1e-06,-2e-06,0,-4e-06,-6e-06,-1e-06,-5e-06,0,-1e-06,0,-1e-06,-2e-06,0,-1e-06,-1e-06,0,-1e-06,3e-06,2e-06,0,0,2e-06,-1e-06,-1e-06,5e-06,0,-2e-06,0,-1e-06,0,-5e-06,0,0,-1e-06
1e-06,1e-06,0,0,-1e-06,0,1e-06,-3e-06,1e-06,1e-06,0,1e-06,0,1e-06,-1e-06,-1e-06,-3e-06,0,-1e-06,0,-1e-06,0,-3e-06,-3e-06,-2e-06,1e-06,1e-06,-1e-06,-1e-06,3e-06,-1e-06,1e-06,-1e-06,1e-06,3e-06,1e-06,0,-1e-06,0,-3e-06,0,-1e-06,1e-06,0,1e-06,-4e-06,1e-06,0,2e-06,2e-06,1e-06,0,0,0,0,-2e-06,0,0,1e-06,1e-06,-1e-06,0,-1e-06,-1e-06,1e-06,0,0,-5e-06,-2e-06,1e-06,8e-06,1e-06,0,3e-06,1.4e-05,-4e-06,0,2e-06,4e-06,1e-06,1e-06,0,0,-2e-06,1e-06,-3e-06,0,1e-06,0,0,1e-06,9e-06,-1e-06,5e-06,0,0,0,0,2e-06,-1e-06,0,-1e-06,-1e-06,1e-06,-1e-06,3e-06,0,-2e-06,2e-06,0,-3e-06,-5e-06,1e-06,3e-06,0,-1e-06,0,4e-06,0,2e-06,-1e-06
0,0,0,0,-1e-06,0,0,3e-06,2e-06,2e-06,0,1e-06,-2e-06,1e-06,1e-06,2e-06,3e-06,0,0,0,-2e-06,-1e-06,3e-06,3e-06,1e-06,-3e-06,1e-06,1e-06,1e-06,-3e-06,0,3e-06,-1e-06,-3e-06,-4e-06,-2e-06,0,-1e-06,2e-06,1e-06,0,0,0,0,0,-2e-06,0,-1e-06,-5e-06,-1e-06,0,0,1e-06,0,0,0,0,1e-06,0,-1e-06,0,0,0,0,2e-06,0,0,3e-06,3e-06,1e-06,-4e-06,-2e-06,-1e-06,1e-06,-7e-06,4e-06,0,-2e-06,-3e-06,-1e-06,-1e-06,0,1e-06,-3e-06,0,-3e-06,0,0,-2e-06,0,-9e-06,-4e-06,0,-2e-06,-1e-06,-2e-06,0,0,0,0,0,0,0,1e-06,-1e-06,0,-1e-06,1e-06,2e-06,1e-06,5e-06,-2e-06,-1e-06,-4e-06,0,0,0,-1e-06,0,1e-06,1e-06
-1e-06,-1e-06,0,0,-1e-06,0,1e-06,-3e-06,1e-06,-2e-06,0,-1e-06,3e-06,2e-06,0,0,-1e-06,0,-1e-06,0,0,1e-06,-1e-06,-3e-06,-2e-06,0,-1e-06,0,1e-06,-3e-06,1e-06,-2e-06,2e-06,3e-06,2e-06,0,0,-2e-06,-1e-06,-1e-06,0,0,0,0,0,0,0,-1e-06,3e-06,0,0,0,0,0,0,1e-06,-1e-06,-1e-06,1e-06,-3e-06,-1e-06,-1e-06,-1e-06,0,-3e-06,0,0,-3e-06,-8e-06,1e-06,0,1e-06,0,-1e-06,-5e-06,-5e-06,0,0,0,0,0,0,-1e-06,4e-06,-1e-06,-1e-06,1e-06,0,1e-06,0,1e-06,4e-06,0,0,0,-1e-06,0,0,2e-06,0,0,-2e-06,0,-2e-06,2e-06,-2e-06,0,0,1e-06,0,-5e-06,3e-06,0,2e-06,0,1e-06,0,-1e-06,0,0,-3e-06
0,1e-06,-1e-06,0,0,-1e-06,0,2e-06,-2e-06,1e-06,0,0,0,0,-3e-06,-1e-06,-1e-06,1e-06,0,0,1e-06,0,-2e-06,-3e-06,2e-06,2e-06,1e-06,0,-1e-06,5e-06,-1e-06,-2e-06,0,-3e-06,1e-06,1e-06,0,0,-1e-06,1e-06,0,0,1e-06,0,0,0,0,0,-4e-06,0,0,0,1e-06,0,0,0,0,-1e-06,0,3e-06,-1e-06,2e-06,0,1e-06,2e-06,0,0,1e-06,4e-06,-1e-06,2e-06,0,0,-1e-06,1.1e-05,-1e-06,0,0,2e-06,0,0,0,1e-06,-1e-06,0,-1e-06,1e-06,-1e-06,0,1e-06,-5e-06,0,-1e-06,0,0,2e-06,0,0,0,0,0,4e-06,-1e-06,1e-06,-2e-06,-4e-06,1e-06,0,1e-06,0,4e-06,-7e-06,0,0,0,0,0,0,0,1e-06,1e-06
0,-1e-06,0,0,0,1e-06,-2e-06,-1e-06,0,1e-06,1e-06,1e-06,0,-1e-06,1e-06,1e-06,0,-1e-06,-1e-06,0,1e-06,-1e-06,0,3e-06,-1e-06,-2e-06,2e-06,1e-06,0,-4e-06,0,2e-06,-1e-06,3e-06,-4e-06,-1e-06,0,0,0,-1e-06,0,1e-06,-2e-06,0,0,1e-06,0,0,1e-06,-1e-06,0,0,0,0,0,-3e-06,0,0,0,-2e-06,-1e-06,-2e-06,0,-1e-06,0,0,1e-06,0,-3e-06,0,-1e-06,0,0,0,-1e-05,6e-06,0,0,-3e-06,1e-06,0,1e-06,-1e-06,-3e-06,1e-06,1e-06,-1e-06,1e-06,2e-06,0,-3e-06,-2e-06,0,2e-06,0,1e-06,0,1e-06,1e-06,0,-1e-06,-4e-06,0,1e-06,2e-06,-2e-06,0,0,1e-06,0,2e-06,5e-06,-1e-06,0,1e-06,0,0,2e-06,0,-2e-06,-1e-06
1e-06,0,0,0,0,0,0,-1e-06,-2e-06,-2e-06,0,0,-1e-06,-2e-06,1e-06,0,1e-06,2e-06,0,0,-1e-06,0,-2e-06,-1e-06,0,0,-2e-06,-1e-06,1e-06,4e-06,1e-06,0,1e-06,0,3e-06,-1e-06,0,0,0,-1e-06,0,0,3e-06,0,1e-06,0,0,-1e-06,-1e-06,2e-06,0,0,1e-06,0,-1e-06,4e-06,-1e-06,1e-06,1e-06,-4e-06,-1e-06,1e-06,0,0,-2e-06,0,-1e-06,-2e-06,4e-06,-3e-06,-2e-06,-2e-06,0,0,3e-06,-6e-06,0,0,2e-06,0,0,0,1e-06,4e-06,0,-2e-06,0,0,1e-06,0,1e-06,3e-06,0,-4e-06,0,0,0,0,0,0,0,5e-06,0,-1e-06,-1e-06,-2e-06,0,0,0,0,-8e-06,-3e-06,0,-2e-06,0,-1e-06,0,-1e-06,0,-1e-06,-1e-06
0,0,0,0,0,0,2e-06,2e-06,-1e-06,1e-06,0,-1e-06,-2e-06,0,-1e-06,-1e-06,-1e-06,-2e-06,0,0,-1e-06,0,3e-06,1e-06,1e-06,1e-06,1e-06,-1e-06,1e-06,2e-06,0,-3e-06,-1e-06,-2e-06,-1e-06,1e-06,0,0,1e-06,2e-06,0,-1e-06,-3e-06,0,0,-2e-06,0,0,-1e-06,0,0,0,-1e-06,0,0,-2e-06,0,0,0,3e-06,0,0,-1e-06,0,2e-06,-1e-06,0,2e-06,-8e-06,1e-06,0,-1e-06,0,1e-06,5e-06,5e-06,0,0,0,-1e-06,0,0,-1e-06,-1e-06,-1e-06,1e-06,0,-1e-06,0,0,1e-06,-5e-06,0,5e-06,0,-3e-06,0,0,1e-06,0,0,-4e-06,0,0,-1e-06,1e-06,0,0,-1e-06,-1e-06,5e-06,-3e-06,0,2e-06,-1e-06,0,0,-1e-06,0,0,1e-06
0,-1e-06,-1e-06,0,0,0,0,-3e-06,3e-06,1e-06,-1e-06,0,2e-06,0,1e-06,0,1e-06,3e-06,0,0,0,0,-3e-06,1e-06,-2e-06,0,1e-06,1e-06,-1e-06,-2e-06,-1e-06,-3e-06,0,3e-06,-3e-06,1e-06,0,1e-06,0,-1e-06,0,0,4e-06,0,0,-3e-06,0,0,4e-06,-1e-06,0,0,-1e-06,0,0,0,0,0,0,-2e-06,-1e-06,-1e-06,1e-06,0,0,0,0,-4e-06,4e-06,0,7e-06,-1e-06,0,0,-6e-06,-9e-06,0,0,-2e-06,0,0,1e-06,2e-06,-3e-06,-1e-06,0,0,0,0,0,7e-06,5e-06,0,-6e-06,0,3e-06,0,0,0,0,0,4e-06,0,0,2e-06,2e-06,0,0,-2e-06,0,6e-06,3e-06,0,-1e-06,0,0,0,3e-06,0,0,0
