0.000307,8.5e-05,9.7e-05,3.6e-05,1.6e-05,0.000103,3.6e-05,0.000154,1.6e-05,0.000344,0.000239,4.7e-05,7.3e-05,0.000245,7.7e-05,0.000138,9.6e-05,0.000132,2.8e-05,0.000168,6.5e-05,0.000183,8.6e-05,0.000174,0.000228,8.4e-05,0.000129,3e-05,1.6e-05,9e-06,0.000128,0.000144,0.000104,0.000149,6.1e-05,2.3e-05,0.000502,6.7e-05,8.5e-05,7.6e-05,0.000312,0.000143,1.5e-05,1.2e-05,1.3e-05,0.000115,6.8e-05,0.000437,0.000157,3e-06,7e-05,0.000204,5.2e-05,0.00024,7e-06,7.8e-05,0.000191,0.00021,0.000203,0.00012,0.00014,0.000198,6.6e-05,0.000153,2.5e-05,0.000292,7.8e-05,0.000151,8.6e-05,5.9e-05,0.000108,0.000113,7.9e-05,3.7e-05,0.000132,9.7e-05,9e-05,0.000102,0.00014,4.7e-05,0.000157,2.3e-05,0.000141,0.000157,8.9e-05,0.000111,5.3e-05,0.000131,1.2e-05,3.9e-05,0.000175,0.000139,0.000119,0.00026,2.8e-05,0.000293,0.000227,0.000305,6.1e-05,0.000108,8.3e-05,0.000127,1.6e-05,2.2e-05,0.000101,0.000101,6.6e-05,6.2e-05,0.000145,0.000126,1.1e-05,2.7e-05,5.5e-05,0.000211,1.8e-05,0.000126,7e-06,7e-06,4e-05,0.000142,0.000178
0.000634,0.000218,0.000154,0.000118,0.000105,9.4e-05,0.000147,0.000319,0.000137,0.000725,0.000452,7.3e-05,7.8e-05,0.000476,0.000224,0.000352,0.000219,0.00021,0.000263,0.000307,0.000247,0.000309,0.000274,0.000313,0.000474,0.000111,0.00036,0.00021,0.000166,4.3e-05,0.000258,0.000333,0.000202,0.000379,0.000126,7.6e-05,0.000995,0.000194,0.000231,0.000123,0.00068,0.000395,5.1e-05,8.8e-05,0.000124,0.000194,0.000208,0.000979,0.000366,0.000127,9.2e-05,0.000383,0.000104,0.00062,0.000124,0.000108,0.000304,0.000472,0.000488,0.000197,0.000215,0.000502,0.000175,0.00035,0.000151,0.000594,0.000102,0.000373,0.000216,1.4e-05,0.000173,0.000246,0.000301,0.000165,0.000333,0.000191,0.000196,0.00026,0.000316,0.000152,0.00026,6.1e-05,0.000354,0.000447,0.000161,0.000347,0.000172,0.000251,3.7e-05,5.8e-05,0.000424,0.000149,0.000293,0.000467,0.000119,0.000556,0.000515,0.000638,0.000235,0.00019,3e-04,0.000203,0.000201,9.3e-05,0.000187,0.000143,9.5e-05,0.000195,0.00025,0.000222,4.9e-05,3.5e-05,0.000168,0.000466,8.3e-05,0.000205,8.6e-05,7.1e-05,0.000235,0.000374,0.000326
0.000826,0.000408,0.000468,0.000241,0.000145,0.000433,0.000135,0.000371,0.00026,0.001243,0.000452,0.000403,0.000333,0.000554,0.000393,0.000172,0.000321,0.000251,0.000339,0.000306,0.000314,0.000525,0.000123,0.000297,0.000482,0.000102,0.000371,0.000193,0.000128,0.000297,0.000352,0.00026,0.000158,0.000173,0.000412,0.000289,0.000907,0.000264,0.000268,0.000414,0.00104,0.00056,0.00013,0.000303,0.000158,0.000502,0.000206,0.000722,0.000523,0.000196,0.000251,0.000367,0.00044,0.000591,0.00017,0.000271,0.000666,0.000576,0.000377,0.000126,0.000423,0.000441,0.000325,0.000774,0.00035,0.001082,3.7e-05,0.000613,0.000202,0.000192,0.000343,0.000331,0.000639,0.000254,0.000156,0.000147,0.000667,0.000329,0.000344,0.000285,0.000388,0.000342,0.000188,0.000272,0.000202,0.00044,0.000226,0.000241,0.000336,7.1e-05,0.000331,0.000288,0.000294,0.000662,4.3e-05,0.000729,0.00057,0.000876,0.000388,0.000226,0.000217,0.000399,0.000419,0.000322,0.00024,0.000237,0.000235,0.000404,0.000576,0.000569,0.00016,0.000231,0.00021,0.000856,0.000347,0.000163,2.8e-05,0.000151,0.000447,0.000358,0.000404
0.000998,0.00058,0.000873,0.000507,0.000374,0.000968,0.000447,0.000404,0.000291,0.000983,0.001917,0.001372,0.000322,0.001352,0.000266,0.000484,0.000116,0.00073,0.000653,0.000396,0.00036,0.001066,0.000347,0.000678,0.00052,0.000418,0.000401,0.000557,0.00045,0.000499,0.000486,0.000706,0.000318,0.000148,0.000651,0.000255,0.001652,0.000293,0.000386,0.000235,0.002234,0.001415,0.000409,0.000211,0.000347,0.001039,0.000809,0.001375,0.000206,9e-04,0.000262,0.000972,0.000383,0.000413,0.000218,0.000529,0.001455,0.000826,0.001214,0.000446,0.000493,0.000739,0.000187,0.000868,0.000611,0.00114,0.001086,0.000306,0.000709,0.000354,0.000405,7e-04,0.000743,0.000544,0.000552,0.000433,9e-04,0.001121,0.000256,8.6e-05,0.000926,0.000144,0.000574,0.000645,0.00022,0.000732,0.000545,0.000603,0.000597,0.000828,0.000643,0.000679,0.000288,0.000376,0.000713,0.001103,0.00157,0.000566,9.5e-05,0.000386,0.000319,0.000254,0.000222,0.001096,0.000612,0.00107,0.000294,0.001003,0.001394,0.001204,0.00086,0.000895,9e-04,0.001561,0.001554,0.001235,0.000493,0.00048,0.000482,0.001267,0.000267
0.001849,0.001334,0.00061,0.000535,0.000925,0.000652,0.000414,0.000561,0.000283,0.000708,0.002446,0.000846,0.000557,0.001459,0.001407,0.00076,0.000829,0.00028,0.000636,0.000918,0.000603,0.000718,0.000715,0.000373,0.000386,7.8e-05,0.001006,0.001289,0.000391,0.001143,0.000628,0.000776,0.001115,0.000633,0.000446,0.001009,0.002179,0.001472,0.001176,0.001154,0.003527,0.004592,0.003602,0.002069,0.000401,0.001066,0.001011,0.00064,0.001906,0.001671,0.001267,0.001432,0.001225,0.001574,0.000399,0.000741,0.001699,0.001929,0.002593,0.001894,0.001043,0.000365,0.001355,0.001222,0.001436,0.001704,0.001909,0.001321,0.001921,0.001924,0.001648,0.000299,0.000653,0.000445,0.001229,0.000922,0.001585,0.001462,0.00105,0.00074,0.0011,0.000761,0.00077,0.000823,0.001291,0.001499,0.001416,0.001737,0.001467,0.001486,0.001738,0.000283,0.000879,0.00104,0.000614,0.000445,0.00099,0.001733,0.001397,0.000172,5e-05,0.000889,0.000396,0.001645,0.001043,0.001342,0.000645,0.001294,0.000674,0.000739,0.00209,0.001906,0.000471,0.001312,0.000536,0.000594,0.000218,0.000242,0.000391,0.001679,0.001365
0.000745,0.001283,0.000524,0.000302,0.000371,0.000344,0.000905,0.001506,0.000783,0.000159,0.001297,0.001435,0.001437,0.000537,0.000517,0.000886,0.001207,0.000536,0.001064,0.000936,0.000942,0.000703,0.000863,0.000906,0.001465,0.000545,0.001143,0.000795,0.001139,0.001533,0.000448,0.000814,0.000824,0.000423,0.000445,0.000808,0.001649,0.001984,0.000619,0.000724,0.001591,0.002419,0.001594,1e-04,0.000789,0.001297,0.000736,0.000318,0.001188,0.002169,0.001389,0.000537,0.000677,0.000655,0.001004,0.000284,0.000817,0.000408,9e-04,0.001054,0.00046,0.000812,0.001571,0.001004,0.000533,0.000617,0.000562,0.001393,0.001675,0.001212,0.000468,0.000563,0.000558,0.001244,0.001655,0.001559,0.000382,0.000467,0.000293,0.000167,0.000488,0.000587,0.000688,0.000822,0.000305,0.00058,0.00093,0.001162,0.001311,0.000594,0.000214,0.000517,0.00087,0.00127,0.000942,0.000533,0.001245,0.000926,0.001108,0.000819,0.000623,0.001337,0.0015,0.001078,0.000723,0.000657,0.000971,0.00104,0.000719,0.000604,0.001634,0.000461,0.000228,0.000278,0.000871,0.001013,0.000613,0.00048,0.00019,0.001031,0.001025
0.000539,0.001332,0.000328,0.000547,0.000476,0.00022,0.001227,0.000586,0.000731,0.000512,0.000222,0.000136,0.000488,0.00065,8.7e-05,0.000131,0.000605,0.000751,0.000499,0.001058,0.000662,0.000426,0.000647,0.000965,0.001316,0.000573,0.001395,0.000748,0.000936,0.000315,0.001017,0.000271,0.001202,0.000513,0.000565,0.001198,0.001395,0.000744,0.001199,0.001126,0.001504,0.001375,0.000435,0.001003,0.001124,0.000646,0.000587,0.001117,0.001153,0.001251,0.000711,0.000941,0.000629,0.000824,0.001215,0.000527,0.00054,0.000382,0.000406,0.001131,0.000487,0.000445,0.000168,0.001278,0.00036,0.000603,0.000492,0.001235,0.00076,0.000467,0.00101,0.000375,0.000522,0.001236,0.000489,0.000509,8.2e-05,0.000819,0.000511,0.000667,0.001182,0.000707,0.000216,0.001486,0.000283,0.000981,0.000564,0.000843,0.000752,0.001413,0.001204,0.00094,0.00021,0.001282,0.000709,0.001414,0.000637,0.000988,0.000768,0.000948,0.000679,0.00104,0.000364,0.000545,0.000377,0.000738,0.001011,0.001109,0.000145,0.000403,0.001062,0.000334,0.000145,0.001262,0.001714,0.000504,0.000472,0.000555,0.000508,0.000192,0.000792
0.000879,0.001578,0.001564,0.000931,0.002355,0.000829,0.001789,0.002003,0.002143,0.00148,0.001195,0.001085,0.000267,0.001682,0.00118,0.0013,0.000542,0.00129,0.000425,0.000449,0.000443,0.001499,0.001509,0.001551,0.001792,0.000919,0.001233,0.00166,0.001152,0.000966,0.001012,0.001409,0.001571,0.001324,0.000901,0.000847,0.001256,0.001033,0.000559,0.001093,0.002853,0.00293,0.001401,0.00209,0.000557,0.000362,0.001347,0.000793,0.002819,0.002126,0.00143,0.001469,0.000243,0.001338,0.000809,0.001591,0.000682,0.000638,0.001613,0.00321,0.002136,0.000771,0.001131,0.000831,0.001516,0.000529,0.000701,0.000588,0.001588,0.000499,0.001822,0.001739,0.000618,0.001815,0.000823,0.000425,0.000311,0.001255,0.001104,0.002218,0.002448,0.002094,0.00159,0.001255,0.001804,0.001665,0.001677,0.001396,0.00053,0.002013,0.003077,0.002802,0.001298,0.000366,0.001583,0.00232,0.001808,0.001682,0.001169,0.001987,0.000926,0.000233,0.000852,0.000518,0.00056,0.000821,0.000602,0.000347,0.00074,0.000178,0.000767,0.001787,0.001056,0.00191,0.000179,0.001151,0.00018,0.000881,0.001472,0.001842,0.001227
0.002205,0.001423,0.001367,0.001831,0.0041,0.003565,0.003501,0.002356,0.002192,0.002535,0.002268,0.002519,0.001966,0.002822,0.002022,0.001574,0.002128,0.00097,0.002635,0.002382,0.001166,0.002501,0.002731,0.001902,0.001401,0.001402,0.000608,0.000678,0.000332,0.001772,0.001347,0.000917,0.002271,0.002341,0.001488,0.001211,0.003067,0.002501,0.002083,0.001573,0.003919,0.003499,0.002607,0.002955,0.002464,0.001748,0.002248,0.002337,0.002575,0.003504,0.001593,0.00182,0.003045,0.002656,0.001185,0.002101,0.001702,0.001917,0.00101,0.00354,0.002878,0.001982,0.002096,0.000335,0.001751,0.003153,0.002978,0.003123,0.002547,0.002999,0.003129,0.002406,0.002124,0.001832,0.001654,0.001938,0.00144,0.000537,0.000637,0.00202,0.003488,0.001318,0.001528,0.001849,0.002663,0.002013,0.001731,0.002956,0.003213,0.003773,0.00444,0.00228,0.001716,0.000965,0.001454,0.00125,5.8e-05,0.001054,0.001543,0.000903,0.001401,0.001311,0.001131,0.002433,0.001871,0.000827,0.001533,0.001462,0.001098,0.001899,0.00182,0.003271,0.002815,0.00318,0.003118,0.0016,0.000706,0.000714,0.001613,0.001468,0.002013
0.002312,0.001581,0.001581,0.001196,0.002592,0.001064,0.002342,0.001929,0.000906,0.002826,0.003483,0.00316,0.000414,0.001468,9.7e-05,0.002972,0.002016,0.002727,0.004883,0.001547,0.000339,0.002223,0.000182,0.00069,0.000589,0.001428,0.001802,0.001645,0.001057,0.002231,0.000395,0.001101,0.001603,0.000989,0.000704,0.001024,0.001868,0.001739,0.000798,0.000979,0.001463,0.001814,0.003116,0.000483,0.00103,0.001117,0.001114,0.000115,0.001307,0.002575,0.002296,0.001758,0.002743,0.001936,0.003715,0.000209,0.002063,0.001343,0.001437,0.001993,0.001226,0.000833,0.000442,0.002417,0.002191,0.001543,0.002187,0.002015,0.001284,0.001863,0.001367,0.000234,0.001859,0.001719,0.001448,0.000876,0.00106,0.001742,0.001096,0.001423,0.00109,0.001291,0.001598,0.000321,0.002152,0.000486,0.001107,0.002089,0.002287,0.003347,0.002017,0.000957,0.000834,0.001596,0.001734,0.001556,0.002451,0.001425,0.002037,0.002828,0.001481,0.000284,0.000152,0.002352,0.002282,0.000786,0.001467,0.00184,0.000966,0.002596,0.00154,0.001437,9.9e-05,0.002664,0.001951,0.001664,0.001708,0.000445,0.00224,0.001074,0.00238
0.000867,0.000471,0.00048,0.000251,0.001488,0.001171,0.00186,0.002959,0.002554,0.001096,0.001526,0.001694,0.00243,0.00219,0.001493,0.002028,0.000978,0.001522,0.003104,0.003543,0.002845,0.000118,0.001391,0.001763,0.002402,0.002316,0.000216,0.000751,0.001403,0.001645,0.001941,0.000881,0.001612,2.6e-05,0.000816,0.001759,0.003019,0.002897,0.001729,0.001168,0.000785,0.001396,0.000979,0.002278,0.001015,0.000884,0.001577,0.002074,0.004226,0.002806,0.001183,0.001083,0.00297,0.002637,0.003975,0.004253,0.001429,0.00228,0.001892,0.002293,0.001363,0.001442,0.001165,0.003339,0.002274,0.002301,0.001063,0.003066,0.001268,0.001884,0.0027,0.001394,0.001775,0.00146,0.002268,0.001612,0.001007,0.001201,0.000375,0.000621,0.002196,0.003043,0.003727,0.003556,0.00284,0.003201,0.00181,0.001858,0.004486,0.003003,0.00204,0.001573,0.001495,0.002108,0.001934,0.004045,0.0046,0.003327,0.002679,0.002933,0.003068,0.002031,0.001023,0.001751,0.000626,0.001132,0.000701,0.000523,0.001692,0.002595,0.00179,0.000227,0.000527,0.00239,0.004426,0.004123,0.004327,0.003424,0.00203,0.00062,0.002521
0.000377,0.001046,0.001147,0.00128,0.000459,0.000476,0.001209,0.000923,0.000823,0.001446,0.000524,0.000577,0.001522,0.000868,0.000247,0.00098,0.001183,0.001721,0.000939,0.000928,0.000368,0.000794,0.000697,0.00063,0.002086,0.001547,0.001334,0.001277,0.001266,0.001624,0.001338,0.001026,0.001425,0.000599,0.000408,0.000991,0.001515,0.001481,0.001191,0.001052,0.000666,0.00082,0.000125,0.000861,0.000393,0.000675,0.001316,0.001416,0.002245,0.001436,0.001898,0.000599,0.001116,0.001543,0.001061,0.001345,0.001328,0.001482,0.000684,0.001036,0.000505,0.00028,0.000835,0.001908,0.000471,0.000418,0.00107,0.00129,0.001046,0.001707,0.000895,0.000703,0.001043,0.000956,0.001951,0.001133,0.000472,0.000888,0.000432,0.000704,0.002441,0.001775,0.000775,0.001111,0.000818,0.001114,0.000273,0.000913,0.002397,0.000597,0.000342,0.000387,0.000735,0.000602,0.001387,0.001936,0.001212,0.001091,0.001183,0.0022,0.002224,0.000713,0.000216,0.000879,0.000595,0.001139,0.001417,0.001611,0.001667,0.000522,0.001064,0.000645,0.000277,0.001358,0.002226,0.000274,0.002607,0.001957,0.000911,0.001299,0.001839
0.000393,5e-04,0.000429,0.00054,0.000199,0.000213,0.000426,0.000436,0.000342,0.000428,0.000453,0.000274,0.000915,0.000121,0.000186,0.000236,0.000423,0.001085,0.000641,0.000362,0.000117,9.5e-05,0.000541,0.000495,0.000878,0.000231,0.000378,0.000661,0.000623,2.7e-05,0.000999,0.000335,0.000283,0.000246,0.000377,0.000527,0.001137,0.000567,0.000471,2e-04,0.000639,0.000571,0.00014,0.000154,0.000304,0.00028,0.000764,0.00085,0.001011,0.000588,0.000732,0.000527,0.000279,0.001002,0.000669,0.000631,0.000756,0.000138,0.000234,0.000543,0.000517,0.000376,0.000541,0.000642,0.000427,0.000305,0.000326,0.000299,0.000201,0.000456,0.00019,0.000192,0.000255,0.000916,0.000956,0.000166,0.000238,0.000264,0.000127,0.000898,0.001089,0.000581,0.000483,0.000872,0.000449,0.000459,0.000314,0.00042,0.001252,0.00039,0.000219,0.000129,0.000371,0.000631,0.000831,0.001277,0.000376,0.000741,6e-05,0.001136,0.000694,0.000332,0.000169,0.000648,0.000514,0.000376,0.000417,0.000493,0.000513,0.000163,0.000399,0.000199,0.000319,0.000851,0.000902,0.000724,0.001265,0.000296,0.000209,0.000641,0.000733
0.000324,0.000477,0.000318,0.000689,0.00053,0.000426,0.000376,0.000341,0.00017,0.000279,0.000384,0.000258,0.000572,0.000115,0.000216,2.4e-05,0.000184,0.000668,0.000456,0.000429,0.00021,0.000211,0.000368,0.000349,0.000575,4.7e-05,0.000474,0.000576,0.000598,8.1e-05,0.000525,0.000142,0.000694,0.000268,0.000236,0.000314,0.000634,0.000219,0.000312,0.000287,0.000675,0.000342,0.000143,6.6e-05,0.000507,0.000177,0.000534,0.000716,0.000703,0.000468,0.00056,0.000317,0.000435,0.000636,0.000426,0.000831,0.000532,0.000132,0.000322,0.000549,0.000152,0.000427,0.000406,0.000391,0.000364,0.000344,0.00016,0.000144,0.000181,0.000227,0.000284,6.4e-05,0.000245,0.000582,0.000949,0.000272,0.000313,0.000355,0.000315,0.000914,0.000907,0.000533,0.00053,0.000823,0.000304,0.000457,0.000352,0.000289,0.001244,0.00039,0.000202,0.000102,0.000578,0.000746,0.00087,0.000838,0.000317,0.00042,2.7e-05,0.000712,0.000641,0.000169,0.000375,0.000411,0.000624,1e-04,0.000214,0.000252,0.000274,6.1e-05,0.000352,0.000153,0.000133,0.000668,0.00048,0.000623,0.001061,0.000373,0.000563,0.000678,0.000577
0.000254,0.000265,9.6e-05,0.000623,0.000446,0.000546,0.000501,0.000474,0.000336,0.000278,0.000498,0.000351,0.000465,0.000307,0.000383,0.000402,0.000357,0.000874,0.000422,0.000385,0.000391,0.000579,0.000498,0.000149,0.000799,0.000167,0.000168,4.3e-05,0.00046,0.000239,0.000489,0.000241,0.000622,0.000352,0.000183,0.000431,0.000752,0.000321,0.000292,0.000457,0.000901,0.000352,0.000655,0.000391,0.000837,0.000573,0.000794,0.000515,0.000811,0.000757,0.000639,0.00067,0.000241,0.000394,0.000623,0.000963,0.000855,3.5e-05,0.000672,0.000383,0.000818,0.000409,0.00052,0.000245,0.000587,0.00044,0.000316,0.000348,0.000283,0.000483,0.000519,0.000396,0.000186,0.000462,0.001116,0.00084,0.000847,0.000511,0.000352,0.000965,0.00069,0.000496,0.000635,0.001203,0.000458,0.000902,0.000248,0.000547,0.001421,0.000246,0.000655,0.000156,0.000594,0.00138,0.001115,0.001204,7.5e-05,0.000494,0.000274,0.000901,0.000949,0.00022,0.000786,0.001011,0.000657,0.000784,0.000354,0.000379,0.000594,0.000437,0.000618,0.000489,0.000248,0.000838,8.4e-05,0.001338,0.000812,0.000977,0.000481,0.001015,0.000907
0.000632,0.00094,0.000109,0.000485,0.001038,0.000981,0.000971,0.001044,2.3e-05,0.00067,0.001184,0.000249,0.000489,0.00069,0.001109,0.001052,0.000445,0.001592,0.000799,0.000697,0.001052,0.00036,0.000733,0.000463,0.000987,0.001235,0.000685,0.000546,0.000794,0.000305,0.001025,0.00035,0.000223,0.000582,0.000228,0.00071,0.001114,0.000299,0.001056,0.000657,0.000352,0.000885,0.001028,0.000995,0.000856,0.000716,0.00076,0.001343,0.001587,0.002344,0.001683,0.001408,0.000868,0.001428,0.001073,0.001424,0.001256,0.001098,0.000428,0.001191,0.001686,0.001899,0.001703,0.000653,0.000808,0.000494,0.000401,0.00059,0.000427,0.000856,0.000565,0.000143,0.000344,0.000587,0.000933,0.001693,8e-04,0.000872,0.00036,0.000861,0.001704,0.00092,0.000824,0.001119,0.000386,0.000925,0.001554,0.001977,0.00077,0.000742,0.001174,0.000701,0.000625,0.000946,0.00248,0.002788,0.001916,0.001049,0.00174,0.001283,0.00177,0.001158,0.001357,0.002721,0.002412,0.002358,0.001149,0.001046,0.000657,0.000912,0.001019,0.001655,0.001028,0.00233,0.001946,0.000792,0.002083,0.0028,0.002239,0.00129,0.002208
0.001971,0.00255,0.001532,0.000761,0.001265,0.002619,0.003433,0.003795,0.002249,0.000404,0.001312,0.002187,0.002264,0.001771,0.00123,0.001522,0.002442,0.002779,0.001849,0.000538,0.002016,0.002023,0.00159,0.000915,0.001316,0.000595,5e-04,0.000628,0.001298,0.000747,0.001238,0.001292,0.001643,0.001235,0.001242,0.0015,0.001035,0.001497,0.001701,0.001631,0.001048,0.001475,0.002491,0.002662,0.002395,0.002062,0.000922,0.001253,0.002407,0.001238,0.000797,0.00124,0.000825,0.001478,0.000859,0.001063,0.000509,0.000905,0.001405,0.000792,0.000537,0.001358,0.00201,0.001669,0.001288,0.000488,0.00045,0.000165,0.000257,0.001022,0.001539,0.001459,0.001421,0.001347,0.001314,0.001076,0.00065,0.001045,0.000998,0.000695,0.001638,0.001716,0.001157,0.000743,0.00039,0.001045,0.001863,0.001423,0.001882,0.001517,0.000136,0.000765,0.000503,0.000236,0.001537,0.001283,0.000393,0.001657,0.001688,0.000908,0.00128,0.001301,0.000534,0.002757,0.001828,0.000478,0.000765,0.000879,0.001089,0.001611,0.000705,0.001185,0.000587,0.002331,0.002514,0.002841,0.001505,0.000977,0.000854,0.000717,0.002163
0.000247,0.001808,0.001588,0.000757,0.000946,0.002009,0.00117,0.001838,0.00129,0.000861,0.000652,0.001542,0.000655,0.000278,0.000784,0.000655,0.002101,0.000369,0.000867,0.001008,0.001054,0.001449,0.001074,0.000563,0.001258,0.001034,0.000773,0.000768,0.000677,0.000961,0.001405,0.000716,0.000977,0.000885,0.000244,0.000696,0.000215,0.00101,0.000345,0.000513,0.000437,0.000642,0.001435,0.000544,0.000681,0.000915,0.000729,0.000726,0.001277,0.000544,4e-05,0.00083,0.000173,0.000814,0.000391,0.000789,0.000878,0.001205,0.000365,0.001068,0.000958,0.000541,0.000967,0.000348,0.000575,0.000293,0.000185,4.5e-05,0.000266,0.000835,0.000919,0.000323,0.000616,0.000439,0.000887,0.000594,0.000663,0.000445,0.000824,0.000628,0.000639,0.000203,1.8e-05,0.000708,0.000628,0.001183,0.000344,0.001064,0.00083,0.000624,0.000624,0.000403,0.000724,0.000517,0.000749,7.4e-05,0.000449,0.000935,0.000477,0.000258,0.000635,0.000634,0.001172,0.001261,0.000456,0.00081,0.001084,0.000256,0.000468,3e-04,0.000384,0.001231,0.00083,0.001392,0.000883,0.000484,0.00035,0.000669,0.000294,0.000944,0.001131
0.000188,0.001124,0.00041,0.000486,0.00049,0.00076,0.00073,0.000986,0.000488,0.000672,0.000772,0.000256,0.000444,0.000283,0.000461,0.000892,0.000931,0.000747,0.000332,0.000153,0.000427,0.000478,0.000296,0.000467,0.000404,6e-04,0.000381,0.000471,4.3e-05,0.000476,0.000361,0.000539,0.000242,0.000131,0.000407,0.000459,0.000337,0.00042,0.000411,0.000645,0.000343,0.000565,0.000643,0.000477,0.000295,0.000364,0.000114,0.000412,0.000923,0.000394,0.000635,0.00065,0.000524,0.000406,0.000226,0.000391,0.000596,0.000667,0.000386,0.000895,0.000728,0.000375,0.000679,5e-04,0.00018,0.000472,0.000498,0.000218,6.4e-05,0.000485,0.000132,0.000236,0.000477,0.000565,0.000137,0.000403,0.000169,0.00041,0.000205,0.000231,0.000459,0.000408,0.000161,0.000338,0.000562,0.000173,0.000191,0.000846,0.000222,0.000213,0.000403,0.000195,0.000508,0.000243,0.000236,0.000187,0.000454,0.000735,0.000539,0.000684,0.000681,0.000261,0.00067,0.000451,0.000279,0.000561,0.00052,0.000388,9e-06,0.000198,0.000362,0.000511,0.000573,0.000943,0.00014,0.000499,0.000724,0.000632,0.000498,0.000507,0.000309
0.000599,0.000461,0.000179,0.000465,0.000427,0.000214,0.000205,0.000298,0.000176,0.000317,0.000797,0.000592,0.000452,0.000201,0.000238,0.000713,0.000203,0.000265,0.000313,0.000375,0.000417,0.00032,0.000284,0.000218,0.000386,0.000217,0.000144,8.5e-05,0.000246,0.000301,0.00028,0.000482,0.000321,0.000384,0.00017,0.000256,0.000105,0.000352,0.000268,0.000613,0.00057,0.000642,0.000518,0.000114,0.000377,0.000559,0.000456,0.000297,0.00029,0.000461,0.000231,0.000281,0.000118,0.000274,0.000197,0.000312,0.000268,0.000208,0.000323,0.000265,0.000174,0.00026,0.00036,0.000227,0.000379,0.000446,0.000408,0.000264,0.000215,0.000134,0.000141,0.000483,0.000517,0.000375,0.000236,0.000421,0.000238,0.000108,0.000159,0.000161,0.000374,0.00015,0.000339,0.000652,0.000359,0.000414,0.000624,0.000277,0.000111,0.000238,0.000142,0.000236,0.000445,0.000439,0.000235,0.000261,0.000262,0.000416,0.000415,0.000543,0.000266,0.000469,0.000233,0.000176,0.000253,0.000246,0.000634,0.000543,0.000351,0.000452,0.000156,6.7e-05,0.000573,0.000361,3.5e-05,0.000629,0.000473,0.000105,0.000306,0.000472,0.000183
0.000368,0.000306,0.000232,2e-04,0.000463,0.000326,0.000533,0.000205,0.000388,0.000264,0.000654,0.000224,0.000443,0.000149,0.000237,0.000518,2e-04,0.000146,3.6e-05,0.000235,0.000178,0.000316,0.000284,8.2e-05,0.000373,7.7e-05,0.000357,0.000335,0.000164,0.000165,0.000144,0.000341,0.000431,0.000344,8.5e-05,8.6e-05,0.000388,0.000111,0.000331,0.000339,0.000432,0.000136,0.000275,0.000169,0.00054,0.000281,0.000119,0.000254,0.000544,7.1e-05,0.00015,7.1e-05,0.000131,0.000337,0.000436,0.00041,0.000155,0.000413,0.000136,0.000163,5e-05,0.000407,0.000348,0.000643,0.000318,7.7e-05,0.000425,0.000269,0.000212,0.000225,0.00018,0.000447,0.000427,0.000392,0.000174,0.000147,0.000121,0.000115,0.000105,5.1e-05,0.000412,0.000247,0.000308,0.000553,0.000428,0.000816,0.000155,0.000455,0.000215,0.000373,0.000185,0.000232,0.000175,0.000439,0.000209,0.00025,0.000101,0.000566,0.000309,0.000267,0.000337,9.9e-05,0.000459,0.000266,0.000269,0.000181,0.000434,0.000111,7.4e-05,6.1e-05,0.000294,0.000409,0.00048,0.000693,0.000119,0.000601,0.000238,0.000276,3.3e-05,5.8e-05,0.000348
0.000161,0.000224,0.000145,0.000271,0.000265,0.000149,0.000351,0.000218,0.000202,0.000437,0.000291,0.000431,0.000482,0.000219,0.000227,0.000473,6.6e-05,0.000179,0.000225,0.000118,0.000229,0.000198,0.00021,0.000103,0.000319,0.000139,0.000233,5e-05,7.3e-05,7.9e-05,0.000208,0.000229,0.000454,0.000152,2.8e-05,5.8e-05,0.000226,0.000117,7.8e-05,0.000268,0.000262,0.00013,0.000169,0.000133,0.000397,0.000256,0.000112,0.000123,0.00062,0.000269,0.000115,0.000226,0.000116,0.000214,3e-04,8.3e-05,4.9e-05,0.000251,0.000234,0.000109,0.000232,0.000242,4.6e-05,0.000277,0.000165,6.1e-05,0.000132,0.000152,0.000166,6.8e-05,0.000107,0.000297,4.8e-05,0.000189,0.000131,9.6e-05,0.000195,0.000229,5.7e-05,4.7e-05,0.000395,0.000289,0.000229,0.000641,0.000329,0.000397,0.000201,0.000405,2.6e-05,0.000297,0.000179,0.000132,0.000185,0.000187,0.000319,0.000152,0.000307,0.000493,0.000266,0.00044,0.000134,0.000162,0.000363,0.000323,6.8e-05,0.00017,0.000185,0.000215,5e-05,0.00021,0.000445,0.000213,0.000318,0.000489,0.000272,0.000493,0.00029,0.000222,7.3e-05,0.000137,4.7e-05
8.7e-05,6.5e-05,5.1e-05,0.000106,7.7e-05,5.7e-05,0.000105,9.6e-05,4.4e-05,0.000106,2.9e-05,0.000109,0.000155,1.1e-05,2.1e-05,0.000178,4.4e-05,7.6e-05,7.1e-05,0.000105,6e-05,6.1e-05,9e-05,4.1e-05,7.9e-05,4.7e-05,1.5e-05,2.4e-05,5.8e-05,6.2e-05,7e-05,5.6e-05,4.4e-05,2.7e-05,4.9e-05,4.3e-05,2.9e-05,9.7e-05,5.7e-05,0.000157,0.000141,2.7e-05,2.5e-05,7e-05,0.000118,6.6e-05,4.5e-05,5.6e-05,0.000382,7.5e-05,7.9e-05,0.000103,5.8e-05,0.000115,5.5e-05,6.9e-05,3.6e-05,3.5e-05,6.3e-05,1.6e-05,0.000117,6.8e-05,3.9e-05,0.000164,2.8e-05,0.000103,1.7e-05,8e-06,6.8e-05,0.000103,0.000106,0.000112,7.6e-05,1e-04,4e-05,6e-06,5.6e-05,0.000102,9.2e-05,2e-05,5.9e-05,6.3e-05,3.1e-05,0.000223,8.2e-05,0.000128,5.8e-05,0.000128,0.000121,7.6e-05,6.4e-05,5.5e-05,5.8e-05,5.1e-05,6.1e-05,7e-05,0.000109,0.00015,0.000101,0.000197,4.3e-05,5.6e-05,6.5e-05,6.9e-05,7e-05,2.9e-05,1.8e-05,9e-05,8.8e-05,9.2e-05,0.000134,8.5e-05,0.000104,0.000186,5.7e-05,0.000245,6.7e-05,6.2e-05,2.9e-05,0.000111,5.2e-05
6.9e-05,1e-04,4.8e-05,0.000124,5.9e-05,2.1e-05,0.000142,8.7e-05,5.4e-05,0.00012,9e-05,9e-05,0.000137,5.2e-05,3.7e-05,0.000153,4.4e-05,2.2e-05,4e-05,4e-05,7.6e-05,4.7e-05,5.9e-05,2.3e-05,2.4e-05,2e-05,5.4e-05,0.000106,7.4e-05,1e-04,3.2e-05,2.8e-05,1.7e-05,2.5e-05,5.2e-05,1.1e-05,5.7e-05,2e-05,3.8e-05,9.5e-05,9e-05,4.8e-05,7.2e-05,3.3e-05,7.9e-05,4.2e-05,5.4e-05,7.7e-05,0.000264,2.6e-05,9.2e-05,0.000151,0.000105,6.8e-05,4.8e-05,4.1e-05,6.3e-05,1.8e-05,7.8e-05,4.1e-05,4.5e-05,0.000122,6.5e-05,0.000125,3.6e-05,0.000108,9.3e-05,1.3e-05,2.1e-05,6.7e-05,6.1e-05,1.5e-05,3.3e-05,8.5e-05,1.2e-05,0.000101,2.5e-05,6.9e-05,3.1e-05,2.1e-05,7.9e-05,3.7e-05,7.1e-05,0.00012,5.6e-05,7.1e-05,6.2e-05,6.2e-05,7.1e-05,4.3e-05,3e-05,6.3e-05,4.5e-05,6.6e-05,3.7e-05,8e-05,7.8e-05,0.000215,0.000123,0.000142,0.000126,2.4e-05,8.4e-05,6.7e-05,4.5e-05,2.7e-05,3.2e-05,5.9e-05,9e-06,9e-05,0.000101,0.000126,0.000203,0.000181,5e-05,0.000112,0.000132,7.5e-05,5.5e-05,3.8e-05,7.5e-05
9.9e-05,5.3e-05,7.5e-05,6.4e-05,0.000132,7.7e-05,0.000145,2e-06,2.3e-05,0.000128,0.000148,0.000148,0.00014,6.5e-05,6.4e-05,0.000129,2.9e-05,6.1e-05,3.4e-05,4.5e-05,8.6e-05,7.3e-05,8.1e-05,5.9e-05,9.4e-05,3.3e-05,6.2e-05,4.1e-05,6.2e-05,6.9e-05,5.2e-05,8e-05,1.8e-05,3.7e-05,2.5e-05,5e-05,0.000102,3.8e-05,5.7e-05,8.4e-05,0.000127,4.7e-05,2.2e-05,4.9e-05,6.9e-05,5.8e-05,6.2e-05,6.6e-05,0.000225,1.8e-05,6.8e-05,7e-05,3.3e-05,7.2e-05,3.2e-05,0.000121,6.4e-05,5.2e-05,3e-05,4e-05,5.5e-05,0.000125,0.000113,5e-05,1.8e-05,9e-05,3.7e-05,7.1e-05,9.1e-05,0.000108,0.000125,0.00012,1.8e-05,6.9e-05,4e-05,9.3e-05,0.000117,6.5e-05,2.1e-05,2.6e-05,9.4e-05,6.7e-05,5.2e-05,0.000103,4.5e-05,0.000119,0.000142,9.4e-05,6e-05,6.4e-05,6.7e-05,0.000111,4.4e-05,8.1e-05,0.000113,8.4e-05,2.4e-05,0.000176,7.6e-05,7.6e-05,0.000158,0.00015,6.4e-05,3.2e-05,6.8e-05,6.3e-05,4.7e-05,2.4e-05,2.4e-05,8.8e-05,8.7e-05,8.6e-05,0.000184,7e-05,1e-05,0.000115,3.4e-05,5.9e-05,4.6e-05,9.1e-05,3.6e-05
7.5e-05,6.3e-05,9.7e-05,0.000114,3.5e-05,8.5e-05,0.000147,5.7e-05,4.4e-05,0.000126,0.000116,9.3e-05,0.00011,2.9e-05,5.5e-05,0.00014,3.5e-05,9.4e-05,2.2e-05,1.5e-05,9.7e-05,8.8e-05,6.8e-05,8.8e-05,8.1e-05,4.3e-05,0.000121,0.000122,2.5e-05,4.5e-05,5.7e-05,5.4e-05,0.000116,7.6e-05,3.7e-05,3.1e-05,5.3e-05,2.3e-05,8.4e-05,0.000104,9.7e-05,7e-05,5e-05,5.1e-05,8.7e-05,8.5e-05,4e-05,6.9e-05,0.000202,2.8e-05,2e-05,3.9e-05,4.5e-05,7.5e-05,3.1e-05,6.4e-05,7e-05,6.1e-05,4e-05,3.8e-05,3.9e-05,2.8e-05,2.8e-05,0.000122,4.3e-05,5e-05,9.9e-05,0.000112,7e-05,2.9e-05,8.7e-05,9.9e-05,6e-05,7.5e-05,3.8e-05,6.1e-05,7.7e-05,5.4e-05,5.8e-05,4.9e-05,6.8e-05,3.7e-05,3.3e-05,0.000112,4.1e-05,0.000128,0.000141,0.000129,7.5e-05,7.3e-05,5.1e-05,3.9e-05,4.5e-05,5.1e-05,7.5e-05,3.6e-05,1.8e-05,0.00015,3.3e-05,5.9e-05,2.8e-05,7e-05,0.000109,4.4e-05,7.8e-05,0.000104,2.7e-05,3.9e-05,2.1e-05,8.2e-05,0.000115,2.1e-05,0.000162,0.00015,5.6e-05,0.000125,3.7e-05,1.9e-05,7.4e-05,4.6e-05,3e-05
6.3e-05,3.4e-05,4.7e-05,0.000191,8.5e-05,0.000135,0.00014,3.6e-05,6.6e-05,4.5e-05,6.6e-05,0.000167,0.000113,4.8e-05,7.5e-05,0.000148,1.2e-05,0.000119,8.3e-05,3.4e-05,7.9e-05,3.4e-05,7e-05,8.3e-05,5.4e-05,3.6e-05,8.8e-05,5.3e-05,4.3e-05,6.8e-05,2.1e-05,1e-05,8.4e-05,5.4e-05,2.1e-05,4.7e-05,9.5e-05,8e-05,6.8e-05,0.000134,8.4e-05,6.3e-05,2.8e-05,1.4e-05,5.9e-05,0.000116,4.5e-05,3.8e-05,0.000182,3.9e-05,5.2e-05,6.5e-05,1.6e-05,0.000106,3e-06,7e-05,5.8e-05,4e-05,7.5e-05,3.8e-05,2.4e-05,6.1e-05,2.6e-05,0.000143,5.9e-05,5.1e-05,6.2e-05,0.000173,4.4e-05,6.4e-05,6.9e-05,7e-05,3.5e-05,1.6e-05,6.7e-05,9.5e-05,7e-05,4.1e-05,2.2e-05,1e-05,8.6e-05,1.3e-05,2.2e-05,0.000108,2.4e-05,0.000142,2.6e-05,2.7e-05,6.6e-05,5.8e-05,3e-06,2.5e-05,9e-06,5.1e-05,7e-06,8.4e-05,6.9e-05,0.000114,4e-05,6.2e-05,6e-05,3.1e-05,9.6e-05,6e-05,0.00017,1.4e-05,3.8e-05,4.9e-05,4.9e-05,8.5e-05,0.000117,2.6e-05,0.000124,0.000121,4.5e-05,8e-05,6.9e-05,4.2e-05,3.1e-05,4.6e-05,6.7e-05
3e-06,3e-05,6.7e-05,0.000113,6e-05,7.9e-05,0.000111,3.3e-05,3.8e-05,0.000149,5.7e-05,9.3e-05,0.00011,2.5e-05,2.7e-05,0.000115,1.7e-05,9.3e-05,6.5e-05,0.000102,5.1e-05,9.5e-05,4.8e-05,4.3e-05,7.4e-05,3.8e-05,5.3e-05,9.8e-05,2.7e-05,5.5e-05,1.2e-05,3.1e-05,6.3e-05,7.6e-05,3e-05,5.2e-05,8.7e-05,6.1e-05,5.6e-05,0.000122,9.3e-05,4.6e-05,3.3e-05,0.000108,8.4e-05,9.9e-05,2.2e-05,6.3e-05,0.000132,6e-05,5.2e-05,4.6e-05,2.1e-05,8.7e-05,7.6e-05,6.6e-05,2.3e-05,4.7e-05,2.6e-05,3.5e-05,6.2e-05,2.3e-05,1.9e-05,0.000135,5.6e-05,2.6e-05,6.1e-05,0.000144,4.2e-05,8.4e-05,8.6e-05,4.3e-05,7.5e-05,9.4e-05,1.6e-05,7.1e-05,6.4e-05,2.1e-05,3e-05,1.2e-05,7.7e-05,3.7e-05,3.1e-05,5e-05,5.8e-05,0.00011,4.2e-05,8.2e-05,7e-05,8.4e-05,3.5e-05,2.8e-05,1.2e-05,3.6e-05,4.7e-05,0.000101,2.5e-05,0.000103,5.4e-05,3.6e-05,2.4e-05,3.5e-05,0.000109,4.2e-05,0.000103,5.5e-05,1e-05,5.2e-05,5.3e-05,9.6e-05,7.4e-05,4.9e-05,0.000152,0.000112,5.8e-05,0.000127,6.2e-05,6.4e-05,3e-06,5.7e-05,7.2e-05
6.9e-05,9.7e-05,1.6e-05,0.000105,4.4e-05,2.8e-05,7.9e-05,6.4e-05,3.2e-05,0.000115,4.3e-05,9.1e-05,9.9e-05,3.2e-05,6.5e-05,0.000139,6.2e-05,2.2e-05,1.5e-05,5.2e-05,7.8e-05,7.8e-05,9.9e-05,7.5e-05,8.2e-05,7.3e-05,3.8e-05,9.5e-05,6.1e-05,4.3e-05,6e-05,4.4e-05,3.1e-05,5.5e-05,1.1e-05,4e-05,8.8e-05,0.000111,4.6e-05,8.6e-05,0.000126,5.6e-05,6.4e-05,8.2e-05,4.1e-05,4.4e-05,9e-05,5e-05,0.000225,1.2e-05,5.8e-05,8.1e-05,5.3e-05,8.5e-05,4.7e-05,9.3e-05,3.8e-05,6.8e-05,7e-05,5.4e-05,8.8e-05,1e-04,6e-06,0.000132,7.8e-05,4.9e-05,4.7e-05,8.4e-05,6.2e-05,0.00011,8.7e-05,4.2e-05,7.3e-05,3.7e-05,4.6e-05,4.6e-05,4.3e-05,7.4e-05,3.9e-05,4e-05,9.3e-05,4e-05,3.5e-05,5.1e-05,6.2e-05,0.000117,6.9e-05,9.3e-05,7.4e-05,9.6e-05,1.1e-05,8e-06,3.9e-05,4.6e-05,7.9e-05,6.7e-05,5.3e-05,0.000112,1.5e-05,8.1e-05,5.8e-05,1.7e-05,7.5e-05,3.1e-05,0.000101,2e-05,7.4e-05,5.7e-05,6.9e-05,9.5e-05,7.5e-05,5.9e-05,0.000157,0.000147,5.8e-05,0.000149,6.2e-05,2.6e-05,1.2e-05,4.6e-05,7.6e-05
5.4e-05,5e-05,3.2e-05,8.6e-05,7.2e-05,4e-05,8.7e-05,5.5e-05,4.9e-05,8.4e-05,4.6e-05,0.000112,0.000101,7.8e-05,1e-04,0.000134,7.1e-05,8e-06,5.9e-05,1e-05,9.9e-05,2.7e-05,9.7e-05,8.6e-05,0.000117,1e-04,8.1e-05,4.2e-05,2e-05,4.7e-05,7.7e-05,6.5e-05,1.7e-05,7.1e-05,5.2e-05,5e-05,8.1e-05,7.9e-05,8.3e-05,5.7e-05,0.000106,3.4e-05,5.5e-05,9e-05,3.4e-05,2.7e-05,0.000124,0.000105,0.000259,6e-05,3.4e-05,7.5e-05,0.00013,4.4e-05,0.000102,0.000102,0.000156,0.000194,9.1e-05,3.8e-05,0.000117,5.6e-05,8.9e-05,0.000105,0.000133,0.000148,6.7e-05,0.000243,0.000155,9.4e-05,0.000125,8.6e-05,6.5e-05,9.8e-05,0.000121,9.7e-05,0.000147,7.4e-05,7e-05,0.000123,0.000141,1e-05,3.5e-05,0.000137,0.000146,0.000103,0.000103,8.7e-05,4.1e-05,7.1e-05,6e-05,2.8e-05,9.4e-05,6.3e-05,5.8e-05,0.000144,6e-06,5.2e-05,5.2e-05,0.000118,4.6e-05,0.000118,6e-05,4.4e-05,0.000156,0.000112,0.000115,7.9e-05,5.5e-05,0.000107,0.000101,4.4e-05,0.000152,6.1e-05,8.3e-05,0.000199,7.5e-05,0.000113,3.4e-05,4.2e-05,5.8e-05
8.2e-05,0.000102,2.9e-05,2.8e-05,7.2e-05,4.3e-05,0.000122,3.5e-05,3e-05,0.000114,5.8e-05,0.000129,7.5e-05,0.000115,4.9e-05,0.000166,6.7e-05,8.9e-05,7e-05,4.6e-05,0.00015,0.000147,0.000153,5.3e-05,0.000115,0.00015,0.00012,9.4e-05,3.8e-05,5.1e-05,5.8e-05,0.000132,0.000161,0.000159,7.7e-05,7.4e-05,0.00019,9.7e-05,0.000132,0.000217,0.000126,9.3e-05,8.7e-05,9.9e-05,0.000209,0.000205,0.000109,9.5e-05,0.000213,5.8e-05,4.8e-05,0.000118,0.000268,0.000278,3e-04,0.00015,9e-05,0.000134,0.000238,0.000212,0.000265,0.000263,0.000238,0.000218,3.7e-05,0.000128,6.7e-05,0.000188,0.00024,0.000275,0.000261,0.000184,0.00014,0.000149,5.9e-05,0.000187,0.000147,0.000202,0.00028,0.000353,0.000203,0.000244,0.000122,0.000248,0.00016,0.000146,0.000107,0.000162,0.000131,7.9e-05,9.2e-05,9.3e-05,0.000149,0.000147,0.000128,0.000148,0.000197,5.2e-05,7.2e-05,0.000122,5.9e-05,0.000175,0.000231,9.5e-05,5.7e-05,2.5e-05,8.7e-05,0.00019,0.000154,0.000124,0.000182,0.000126,7.7e-05,0.000166,0.000175,0.000217,0.000237,0.000241,0.000149,6.8e-05,9.3e-05
0.000104,5.8e-05,8.4e-05,0.000119,4.7e-05,0.000114,0.000105,9e-05,0.000106,0.00015,6.1e-05,4.5e-05,3.7e-05,8.3e-05,0.000162,0.000201,0.000133,0.000109,0.000128,5.5e-05,8.7e-05,5.3e-05,0.000217,0.00022,8.2e-05,0.000137,0.000114,0.000183,0.000111,1.1e-05,0.000132,0.000183,7.6e-05,6e-05,8.9e-05,0.000102,0.000126,0.000131,6.6e-05,0.000134,0.000112,6.3e-05,3.3e-05,6.5e-05,0.00013,5.5e-05,0.000171,8.8e-05,0.000188,6.8e-05,5.3e-05,9e-05,0.000214,0.000166,7.5e-05,2.8e-05,3e-05,0.000159,0.000156,4.3e-05,0.000101,0.000162,8.8e-05,4.6e-05,0.000126,4e-05,5.3e-05,6.4e-05,6.5e-05,0.000171,0.000125,3.9e-05,5.7e-05,0.000241,0.000119,0.000156,0.000123,0.000143,0.000151,0.000124,5.2e-05,0.00014,0.00012,0.000133,7.5e-05,0.000112,0.000125,0.000165,0.000107,8.8e-05,9e-05,9.4e-05,0.000112,2.5e-05,0.000111,1e-04,8.4e-05,0.000255,0.000131,7.6e-05,6.6e-05,0.000165,0.000122,6.6e-05,7.2e-05,3.5e-05,9e-05,0.000128,0.000131,0.000148,3.4e-05,3.3e-05,0.000114,0.000112,0.000125,8.4e-05,5.5e-05,8.6e-05,6.8e-05,9e-05,5.7e-05
6.4e-05,0.000131,0.000123,4.3e-05,7.7e-05,4.3e-05,8.6e-05,0.000115,0.000118,1.9e-05,5.1e-05,0.000105,0.000155,0.000118,7.5e-05,2.5e-05,0.000155,0.000112,2.8e-05,5.6e-05,3e-05,0.000108,9.2e-05,0.00013,0.000165,6.6e-05,7.5e-05,8.7e-05,4.8e-05,2.6e-05,0.000119,3.9e-05,6e-05,3.1e-05,8.3e-05,4.1e-05,6.4e-05,3.6e-05,0.000101,9.2e-05,5.9e-05,4.8e-05,1.9e-05,7.4e-05,0.000121,6.4e-05,5.9e-05,6.3e-05,0.000202,5.1e-05,9e-06,5.5e-05,8.5e-05,2.6e-05,2.4e-05,7.1e-05,4e-06,8.6e-05,1.9e-05,3.2e-05,2.9e-05,9.1e-05,6.5e-05,1e-04,2.5e-05,2.2e-05,1.2e-05,5.6e-05,2.2e-05,9.8e-05,2.6e-05,3.5e-05,2.9e-05,0.000102,3.7e-05,4.8e-05,7.4e-05,4.3e-05,7.8e-05,4.6e-05,3.4e-05,6.1e-05,5.7e-05,0.000144,5.4e-05,7.3e-05,6.3e-05,1.3e-05,4.2e-05,4.4e-05,7.6e-05,1.4e-05,4.1e-05,2.6e-05,1e-04,7.4e-05,7.6e-05,0.00015,3.9e-05,0.000102,6.7e-05,5.4e-05,9.5e-05,3.5e-05,7.7e-05,4.6e-05,5.1e-05,5.6e-05,4.6e-05,0.000102,1.1e-05,2.2e-05,3.5e-05,0.000133,5.9e-05,9e-05,7.4e-05,4.3e-05,3.3e-05,7.1e-05,2.2e-05
1.2e-05,9.3e-05,3.6e-05,8e-06,4.6e-05,3.4e-05,5.3e-05,4e-06,7.6e-05,0.000137,9.3e-05,0.000105,0.000121,2.1e-05,5.8e-05,4.2e-05,8e-05,8e-06,3.7e-05,2.9e-05,6e-05,2.2e-05,6.4e-05,3.8e-05,1.4e-05,9e-06,5.9e-05,2.7e-05,4e-05,2.5e-05,7.1e-05,3.8e-05,3.6e-05,5.2e-05,2.3e-05,3.3e-05,3.1e-05,6.2e-05,5.1e-05,4.6e-05,8.1e-05,7.7e-05,2e-05,6.2e-05,9.8e-05,3.5e-05,5.1e-05,3.7e-05,0.000144,2.8e-05,2.5e-05,2.4e-05,5.7e-05,1.6e-05,5.6e-05,7e-05,2.1e-05,3.1e-05,2.9e-05,3.8e-05,3.8e-05,4.9e-05,5.4e-05,6.8e-05,4.7e-05,3.5e-05,8e-06,5.6e-05,3.7e-05,3.9e-05,3.2e-05,2.6e-05,1.9e-05,7.4e-05,1.5e-05,2.1e-05,5.2e-05,3.1e-05,4.6e-05,3.9e-05,5.6e-05,4.5e-05,2e-05,0.000122,5.6e-05,9.1e-05,2.9e-05,3.1e-05,5e-05,7.2e-05,1.4e-05,1.2e-05,2.6e-05,2.8e-05,4.7e-05,4.6e-05,1.3e-05,0.000137,3e-05,8.7e-05,3.6e-05,3.4e-05,6.3e-05,3.1e-05,3.8e-05,7e-06,3.5e-05,5.1e-05,3.7e-05,6.5e-05,3e-05,3.6e-05,8.8e-05,0.000129,5.5e-05,4.8e-05,6e-05,2.4e-05,1.6e-05,2.3e-05,2.4e-05
2.2e-05,5.4e-05,4.8e-05,4e-05,4.9e-05,4e-05,3.5e-05,5.3e-05,1.1e-05,0.000117,5.8e-05,9.8e-05,8.7e-05,3.7e-05,3e-05,5.1e-05,6.1e-05,1.3e-05,2.6e-05,1.6e-05,2.7e-05,1.3e-05,1e-06,3e-05,5.4e-05,2.8e-05,5.8e-05,2.6e-05,3.7e-05,2e-05,1.8e-05,8e-06,2.5e-05,2.7e-05,8e-06,4.4e-05,3.3e-05,7.1e-05,2.7e-05,6.1e-05,5.9e-05,6.2e-05,4e-06,5.6e-05,7.9e-05,4.3e-05,3.9e-05,4.6e-05,0.000142,1.4e-05,4.1e-05,3.3e-05,3.4e-05,2e-05,4.3e-05,4.3e-05,1.5e-05,1.8e-05,1.7e-05,6.9e-05,1.8e-05,1.1e-05,2.6e-05,7.8e-05,4.5e-05,1.6e-05,1.8e-05,3.3e-05,2.8e-05,3.6e-05,3.3e-05,5e-05,2.2e-05,9.8e-05,1.3e-05,1.3e-05,6.2e-05,4.9e-05,3.8e-05,3.6e-05,5.4e-05,7e-05,2.9e-05,0.000133,4.9e-05,6.6e-05,3.7e-05,4e-05,9.4e-05,3.2e-05,2.9e-05,3.1e-05,1e-05,4.6e-05,1.5e-05,2.5e-05,2.3e-05,0.000134,3e-05,0.000106,1.8e-05,1.4e-05,6.8e-05,4e-05,5e-05,2.1e-05,4.3e-05,2.6e-05,2.1e-05,5.5e-05,4.4e-05,2e-05,6.9e-05,0.000118,2.5e-05,4.4e-05,3.6e-05,1.5e-05,3e-05,3.8e-05,1.2e-05
3.9e-05,1e-05,9e-06,5.1e-05,2.1e-05,2.2e-05,4.3e-05,5.1e-05,2.6e-05,9.2e-05,4.5e-05,9.2e-05,9.5e-05,3.2e-05,1.9e-05,5.9e-05,2.6e-05,4e-06,2.5e-05,1.3e-05,1.8e-05,1.1e-05,1.7e-05,6e-06,2.7e-05,4.1e-05,4.7e-05,2.7e-05,2.3e-05,1.1e-05,2e-05,1e-05,1.4e-05,1.9e-05,2.1e-05,2.6e-05,9e-06,2.1e-05,6.2e-05,7.4e-05,6e-05,7.3e-05,3.6e-05,4.9e-05,6.4e-05,5.6e-05,3.1e-05,3.9e-05,0.000157,6e-06,5.4e-05,8e-06,3.4e-05,8e-06,1.4e-05,5.7e-05,2e-05,4e-06,1.6e-05,5.2e-05,1.5e-05,1.4e-05,1.9e-05,7.5e-05,3.9e-05,3.2e-05,8e-06,5.1e-05,1.8e-05,3.3e-05,2.4e-05,3e-05,1.9e-05,8.9e-05,1.1e-05,2.4e-05,6.2e-05,2.7e-05,4.9e-05,4.8e-05,9e-06,4.3e-05,2.6e-05,0.000108,1.8e-05,9e-05,1.6e-05,5.2e-05,6.2e-05,2.9e-05,2.1e-05,3.3e-05,3.8e-05,3.3e-05,3.7e-05,2.5e-05,1.1e-05,0.000116,7e-06,8.7e-05,2.7e-05,1.6e-05,7.3e-05,3.8e-05,2.8e-05,1.3e-05,2.3e-05,3.1e-05,2.9e-05,5.5e-05,3.6e-05,4.4e-05,7.9e-05,0.00012,3.2e-05,6.8e-05,4.1e-05,2.5e-05,4.3e-05,3.7e-05,2.6e-05
3.8e-05,2.9e-05,1.5e-05,5.3e-05,1.3e-05,1.1e-05,8.7e-05,4.5e-05,2.4e-05,0.000101,4e-05,1e-04,9.7e-05,1.3e-05,1.2e-05,6.4e-05,1.5e-05,1.7e-05,1.6e-05,3e-05,1.1e-05,2.4e-05,7e-06,1.9e-05,9e-06,2.5e-05,2e-05,3e-05,2.5e-05,9e-06,3.5e-05,1.1e-05,1.8e-05,1.4e-05,3.5e-05,2.9e-05,3.4e-05,3.2e-05,2.4e-05,5.4e-05,6.6e-05,7.1e-05,2.9e-05,5.6e-05,5.4e-05,5.9e-05,3.2e-05,4.6e-05,0.000152,3.2e-05,1.8e-05,1.7e-05,2.1e-05,1.8e-05,4.2e-05,5.7e-05,3e-05,7e-06,1.4e-05,1.8e-05,3.3e-05,3e-05,4.8e-05,8.2e-05,3.5e-05,2.6e-05,3e-06,4.7e-05,2.2e-05,1.3e-05,1.4e-05,3.6e-05,2.7e-05,8.2e-05,1.6e-05,1.3e-05,6.8e-05,3.4e-05,3.1e-05,2.8e-05,3.1e-05,7.2e-05,3e-05,1e-04,3.2e-05,9.3e-05,3.1e-05,3.1e-05,3.8e-05,4e-05,1.7e-05,1.7e-05,1.9e-05,1.7e-05,2.7e-05,3.2e-05,6e-06,0.00011,9e-06,8.9e-05,2e-05,1.5e-05,7.1e-05,3.6e-05,4.2e-05,1.7e-05,8e-06,9e-06,2e-05,4.8e-05,5e-06,3.3e-05,5.4e-05,0.000101,1.8e-05,9e-05,2.9e-05,2.9e-05,3.2e-05,4.4e-05,3.1e-05
2.6e-05,3e-05,3e-05,4.4e-05,2.2e-05,3e-05,5.1e-05,3e-05,2.5e-05,9.6e-05,5.6e-05,6e-05,9.2e-05,2.5e-05,1.4e-05,7.9e-05,2.5e-05,1.1e-05,3.3e-05,1.7e-05,4e-05,4e-05,8e-06,1.9e-05,2.5e-05,1.7e-05,4.8e-05,3.3e-05,7e-06,1.8e-05,2.8e-05,1.3e-05,1.3e-05,1.5e-05,2.8e-05,5e-06,2.2e-05,3.8e-05,7e-06,4.7e-05,6.5e-05,5.3e-05,1e-05,4.8e-05,6.6e-05,3.5e-05,4.3e-05,5.1e-05,0.000132,3.1e-05,1.4e-05,1.4e-05,3.1e-05,8e-06,2.1e-05,5e-05,3e-05,1.6e-05,1.5e-05,8e-06,8e-06,2.3e-05,2e-05,5e-05,2.9e-05,3.4e-05,7e-06,2.4e-05,1.8e-05,4.1e-05,4e-05,3e-05,1.2e-05,7.5e-05,1.5e-05,1.3e-05,5.9e-05,8e-06,3.5e-05,1.8e-05,3.4e-05,5e-05,5e-06,8.6e-05,4.8e-05,9.3e-05,7e-06,5.7e-05,6.9e-05,2.6e-05,1.1e-05,2.4e-05,2.1e-05,2.8e-05,2.6e-05,1.2e-05,2.8e-05,9.8e-05,2.8e-05,7.1e-05,1.2e-05,6e-06,8.2e-05,6.7e-05,5.1e-05,4.8e-05,1.8e-05,2.8e-05,2.8e-05,5.9e-05,2.4e-05,2.8e-05,6.5e-05,0.00012,7e-06,6.1e-05,3.4e-05,4.1e-05,1.7e-05,3.6e-05,2.2e-05
7e-06,1.2e-05,2.1e-05,6.4e-05,1.7e-05,2.1e-05,1.7e-05,2.3e-05,4e-06,9.5e-05,6.2e-05,7.1e-05,7.7e-05,7e-06,1.7e-05,5.5e-05,4.3e-05,7e-06,1.7e-05,2e-05,2.8e-05,2.1e-05,2.9e-05,1.9e-05,9e-06,1.4e-05,3.6e-05,3.4e-05,1.7e-05,1.1e-05,1.6e-05,1.3e-05,7e-06,2.2e-05,9e-06,2.3e-05,1.6e-05,3.2e-05,1.2e-05,5.3e-05,4.8e-05,5e-05,1.8e-05,5.8e-05,5.3e-05,4.1e-05,3.8e-05,3.8e-05,0.000138,3e-05,2.9e-05,1.8e-05,3.2e-05,1.3e-05,3.2e-05,6.6e-05,1.6e-05,2e-05,2e-05,2e-05,2.5e-05,3e-06,6e-06,7.8e-05,5.5e-05,5.6e-05,1.9e-05,1.9e-05,2e-05,2.7e-05,2e-05,1.5e-05,2.5e-05,7.9e-05,2.2e-05,1.6e-05,4.3e-05,1.6e-05,2.1e-05,2.8e-05,5.3e-05,6.2e-05,3e-05,0.000102,3.3e-05,0.000106,3.6e-05,5.7e-05,6.7e-05,3e-05,1.5e-05,2e-05,2.8e-05,1.8e-05,1.6e-05,2.5e-05,1.5e-05,0.00011,2.4e-05,7.1e-05,5e-06,9e-06,5.9e-05,4.1e-05,2.1e-05,1.8e-05,8e-06,1.7e-05,3.8e-05,6.4e-05,1.9e-05,1.7e-05,8.6e-05,9.9e-05,8e-06,7.2e-05,2.3e-05,3.9e-05,1.4e-05,2.3e-05,1.5e-05
7e-06,2.4e-05,1.6e-05,4.8e-05,6e-06,2.5e-05,4.7e-05,1e-05,1e-05,9.5e-05,4.8e-05,7.2e-05,7.9e-05,1e-05,1.1e-05,5.2e-05,2.7e-05,1.2e-05,1.7e-05,1.5e-05,2.9e-05,1.4e-05,2.2e-05,9e-06,1.5e-05,5e-06,2.2e-05,2.5e-05,1.4e-05,1.4e-05,1.8e-05,3e-06,4e-06,1e-05,1.2e-05,8e-06,1.3e-05,4.7e-05,2.6e-05,6e-05,6e-05,3.4e-05,1.1e-05,3.4e-05,7e-05,3.8e-05,3.3e-05,3.4e-05,0.000144,1e-05,1.2e-05,1.5e-05,2.2e-05,2.3e-05,2.6e-05,5.9e-05,2.6e-05,9e-06,1.9e-05,2.7e-05,1.3e-05,8e-06,1e-05,7.1e-05,5.5e-05,3.4e-05,5e-06,1.8e-05,9e-06,8e-06,2.1e-05,2e-05,2.6e-05,6.4e-05,7e-06,8e-06,4.7e-05,2.2e-05,3e-05,2.9e-05,6e-05,3.7e-05,2.4e-05,9.3e-05,3e-05,0.000111,1.6e-05,5.4e-05,6.6e-05,5e-05,4e-06,1.3e-05,1.5e-05,2.7e-05,1.4e-05,2.5e-05,1.3e-05,0.000105,1.2e-05,8.7e-05,1.5e-05,1.5e-05,4.6e-05,5.4e-05,4e-05,1.9e-05,1.3e-05,1e-05,2.1e-05,5.5e-05,3e-05,3.6e-05,7.6e-05,9.8e-05,4e-06,7.8e-05,3.9e-05,2.6e-05,2.4e-05,3.4e-05,1.9e-05
8e-06,2.4e-05,8e-06,4.9e-05,2.1e-05,2.2e-05,4.9e-05,7e-06,1.3e-05,9.7e-05,5.6e-05,7.3e-05,7.8e-05,1.3e-05,6e-06,6.4e-05,2.9e-05,1.8e-05,1.7e-05,2.4e-05,3.2e-05,4e-06,2.1e-05,2e-06,1.6e-05,5e-06,2.7e-05,2.3e-05,2.2e-05,9e-06,1.9e-05,3e-06,7e-06,7e-06,7e-06,1.2e-05,8e-06,3.2e-05,1.7e-05,6.2e-05,5.8e-05,4.2e-05,5e-06,3.7e-05,6.7e-05,5.1e-05,4.3e-05,4.3e-05,0.000142,7e-06,1.6e-05,6e-06,3.9e-05,1.3e-05,2.1e-05,5.1e-05,1.9e-05,1e-05,1.9e-05,3.4e-05,2.3e-05,4e-06,8e-06,6.7e-05,3.6e-05,2.7e-05,1.2e-05,2.7e-05,1.7e-05,7e-06,1.9e-05,2.4e-05,1.9e-05,6.6e-05,9e-06,1.6e-05,5.2e-05,1.6e-05,2.7e-05,2e-05,5.4e-05,4.9e-05,2.1e-05,9.5e-05,3.4e-05,0.000106,1.8e-05,4.5e-05,4.6e-05,3.4e-05,1.8e-05,1.1e-05,1.4e-05,2.5e-05,1.4e-05,2.1e-05,1.2e-05,0.000103,1.2e-05,7.8e-05,1.7e-05,3e-06,5.9e-05,4.2e-05,1.9e-05,1.7e-05,7e-06,1.6e-05,2e-05,6.3e-05,2.6e-05,3.2e-05,7.4e-05,9.5e-05,3e-06,6.5e-05,4.5e-05,1.8e-05,2.2e-05,3.4e-05,1.1e-05
6e-06,1.9e-05,5e-06,4.2e-05,1.8e-05,1.6e-05,5.1e-05,2e-06,3e-06,8.7e-05,5.6e-05,7.9e-05,7.9e-05,5e-06,1.4e-05,6.1e-05,2e-05,2.2e-05,1e-05,2e-05,2.6e-05,9e-06,1.6e-05,2e-06,1.3e-05,2e-06,2.6e-05,2.7e-05,2.5e-05,8e-06,1.3e-05,6e-06,8e-06,8e-06,6e-06,1.4e-05,1e-05,3e-05,1.2e-05,6.2e-05,5.9e-05,4.5e-05,8e-06,2.9e-05,6e-05,4.1e-05,3.4e-05,3.4e-05,0.000139,6e-06,1.3e-05,1.4e-05,3.3e-05,1.6e-05,1.8e-05,5.4e-05,1.5e-05,9e-06,1.7e-05,2.3e-05,5e-06,7e-06,4e-06,7.2e-05,3.6e-05,2.9e-05,6e-06,3.3e-05,1.4e-05,1e-05,2.7e-05,2e-05,1.8e-05,6.6e-05,1.2e-05,1.2e-05,4.3e-05,1.6e-05,2.8e-05,1e-05,4.9e-05,3.3e-05,2.6e-05,9.5e-05,3.3e-05,0.000101,2.2e-05,3.7e-05,5.4e-05,3.2e-05,1.8e-05,9e-06,1.5e-05,2.6e-05,8e-06,2.6e-05,8e-06,0.000101,2e-05,7.9e-05,1.5e-05,2e-06,5.1e-05,2.3e-05,2.4e-05,1.9e-05,9e-06,1.2e-05,2.4e-05,6.4e-05,1.8e-05,2.7e-05,6.9e-05,9.8e-05,2e-06,6.5e-05,3.7e-05,2.5e-05,2.5e-05,2.9e-05,1.8e-05
