0.004859,0.004702,0.004257,0.004511,0.005055,0.005002,0.004588,0.004625,0.005481,0.005685,0.00548,0.005502,0.005231,0.004809,0.004561,0.004532,0.004678,0.005399,0.005176,0.004699,0.004856,0.004949,0.005442,0.005164,0.005065,0.005803,0.005828,0.005287
0.005793,0.005672,0.005144,0.005522,0.006307,0.006202,0.00561,0.005686,0.006629,0.006755,0.006655,0.006867,0.006431,0.00579,0.005559,0.005525,0.005606,0.006396,0.006126,0.005739,0.006025,0.005938,0.006387,0.006132,0.006054,0.006872,0.006956,0.006418
0.007275,0.007237,0.006552,0.00712,0.008351,0.008193,0.007335,0.00746,0.008409,0.008305,0.008403,0.00901,0.008332,0.007352,0.007153,0.007084,0.007071,0.007903,0.007542,0.007379,0.007926,0.007436,0.007714,0.007609,0.007533,0.008308,0.008562,0.00821
0.008196,0.008218,0.007351,0.008043,0.009742,0.009595,0.008562,0.008704,0.009324,0.008785,0.009017,0.010069,0.009315,0.008196,0.008134,0.008122,0.008076,0.008759,0.008318,0.008256,0.009004,0.008169,0.008085,0.008332,0.008253,0.008684,0.009233,0.009342
0.00826,0.00817,0.007194,0.007959,0.010085,0.010023,0.008808,0.00893,0.009107,0.008143,0.0084,0.009678,0.00898,0.008034,0.008318,0.008628,0.00869,0.008959,0.008418,0.008145,0.008702,0.00791,0.007685,0.008253,0.008034,0.007967,0.008994,0.009778
0.007933,0.007602,0.006725,0.007443,0.009387,0.009376,0.008259,0.008458,0.008494,0.007389,0.007743,0.009053,0.008225,0.007467,0.008042,0.008619,0.00885,0.008692,0.008177,0.007762,0.007663,0.007122,0.007313,0.008012,0.007553,0.00738,0.008912,0.010096
0.00756,0.007149,0.006539,0.007217,0.008486,0.008464,0.007931,0.008252,0.008275,0.007286,0.00753,0.008719,0.008097,0.007548,0.008045,0.008368,0.00838,0.008031,0.007897,0.007901,0.007309,0.006648,0.007381,0.00827,0.007746,0.007762,0.009252,0.010148
0.007343,0.006943,0.006777,0.007572,0.008291,0.008435,0.008607,0.008915,0.008687,0.007848,0.007787,0.008528,0.008493,0.008392,0.008456,0.008162,0.007964,0.007852,0.007944,0.008364,0.007946,0.007143,0.007938,0.008832,0.008363,0.00841,0.009266,0.009562
0.007779,0.007228,0.007855,0.009085,0.009182,0.009339,0.010108,0.010484,0.009894,0.009005,0.008637,0.008857,0.009166,0.009629,0.009392,0.00858,0.008568,0.008761,0.008704,0.009037,0.00901,0.008379,0.008906,0.00965,0.009311,0.009258,0.009281,0.009094
0.009141,0.008309,0.0098,0.01185,0.01144,0.01121,0.012594,0.013324,0.012218,0.010761,0.010114,0.010382,0.010525,0.011114,0.010695,0.009779,0.010629,0.011243,0.010573,0.010017,0.010396,0.010359,0.010434,0.010901,0.010584,0.010577,0.010306,0.009699
0.010995,0.010077,0.012097,0.014753,0.014144,0.013478,0.015278,0.016654,0.015302,0.012941,0.011808,0.012317,0.012144,0.012616,0.012251,0.011634,0.013243,0.014367,0.013281,0.011551,0.011932,0.012769,0.012622,0.012429,0.011783,0.011612,0.011552,0.010908
0.012323,0.011674,0.013663,0.0162,0.015722,0.015083,0.016834,0.01848,0.017475,0.014767,0.012995,0.013449,0.013424,0.014036,0.014021,0.013765,0.015198,0.016757,0.015617,0.012795,0.013009,0.014575,0.014634,0.013823,0.01271,0.012188,0.012143,0.011536
0.012372,0.01205,0.013661,0.01529,0.015038,0.015257,0.016511,0.017263,0.016861,0.014766,0.012648,0.013042,0.013635,0.014323,0.014819,0.014819,0.015556,0.017451,0.016274,0.012737,0.012755,0.014519,0.01481,0.013799,0.012635,0.012056,0.012065,0.01183
0.011903,0.011908,0.012974,0.013185,0.012603,0.013902,0.014709,0.013869,0.013856,0.012895,0.011263,0.012079,0.013078,0.013408,0.014084,0.013928,0.014255,0.016366,0.015393,0.012077,0.011608,0.012927,0.013522,0.01287,0.011893,0.011275,0.011142,0.011647
0.011661,0.012376,0.013117,0.01236,0.011025,0.012001,0.012646,0.011824,0.011739,0.010716,0.009626,0.010791,0.011778,0.012031,0.01252,0.012114,0.012484,0.014026,0.013758,0.011875,0.010763,0.011059,0.011758,0.012157,0.01166,0.010913,0.010331,0.010767
0.011877,0.013003,0.013513,0.012755,0.010999,0.011283,0.012328,0.012307,0.011658,0.010007,0.009589,0.010884,0.011478,0.011998,0.012574,0.012091,0.012332,0.012557,0.01271,0.012501,0.011182,0.01039,0.01032,0.011534,0.01209,0.011464,0.010509,0.010778
0.011302,0.013443,0.014248,0.012919,0.011068,0.011964,0.013789,0.013253,0.011669,0.010214,0.01025,0.01162,0.012211,0.012673,0.013547,0.013103,0.013169,0.013476,0.013549,0.013283,0.012318,0.011523,0.010481,0.011498,0.012847,0.012777,0.011579,0.011967
0.010918,0.01437,0.015294,0.013147,0.012038,0.01452,0.016488,0.014492,0.012662,0.011874,0.011963,0.013533,0.014247,0.014145,0.014935,0.015129,0.015517,0.015659,0.015255,0.015274,0.014604,0.013327,0.012684,0.014157,0.015427,0.015733,0.014092,0.01482
0.012767,0.017211,0.017893,0.015155,0.014918,0.018366,0.019679,0.017224,0.016785,0.016819,0.016366,0.017838,0.018663,0.017131,0.015759,0.016589,0.018485,0.01875,0.018217,0.019185,0.018367,0.015818,0.016414,0.018911,0.020119,0.020484,0.017798,0.019069
0.014888,0.020024,0.02117,0.018467,0.017783,0.0204,0.02137,0.020708,0.022875,0.024126,0.022534,0.022067,0.0223,0.019833,0.016188,0.017601,0.02222,0.023337,0.021671,0.023373,0.022622,0.018217,0.019923,0.023251,0.024265,0.024367,0.02119,0.023544
0.01606,0.020721,0.022835,0.021783,0.020051,0.019478,0.020673,0.024387,0.029194,0.031478,0.029356,0.02519,0.023131,0.021243,0.017411,0.019073,0.026265,0.028883,0.024832,0.025437,0.025783,0.020729,0.022031,0.025833,0.026941,0.025369,0.021936,0.026025
0.01701,0.020722,0.023302,0.02373,0.022171,0.018908,0.019598,0.02684,0.033402,0.036568,0.034731,0.027698,0.023383,0.022282,0.019612,0.020962,0.028711,0.033062,0.027158,0.023918,0.025245,0.0222,0.022036,0.026117,0.029173,0.025916,0.021321,0.026346
0.017902,0.021906,0.025364,0.025077,0.025182,0.022524,0.021329,0.027652,0.033089,0.035932,0.034739,0.029625,0.026428,0.024784,0.022345,0.022925,0.028611,0.032858,0.028119,0.021654,0.022367,0.022571,0.022188,0.026786,0.030622,0.025897,0.021277,0.026537
0.018826,0.023754,0.027693,0.026137,0.02793,0.025965,0.022222,0.025434,0.028256,0.030674,0.029481,0.027667,0.028213,0.02694,0.024311,0.024389,0.028183,0.030062,0.027471,0.021994,0.021263,0.022997,0.023243,0.026886,0.029586,0.024979,0.021617,0.026819
0.01912,0.023313,0.026451,0.025344,0.028675,0.026194,0.020194,0.021434,0.022934,0.025754,0.024872,0.024059,0.026517,0.026477,0.0238,0.023479,0.026853,0.026675,0.024186,0.020676,0.019499,0.021008,0.021384,0.024297,0.027048,0.024465,0.021384,0.024364
0.01874,0.02066,0.022261,0.02212,0.026317,0.023734,0.016817,0.016879,0.01758,0.020677,0.020649,0.020172,0.022844,0.023279,0.020752,0.019818,0.023621,0.024236,0.020371,0.016894,0.016036,0.016474,0.016906,0.019086,0.024436,0.027374,0.02458,0.022817
0.018475,0.018028,0.01945,0.020034,0.023437,0.021914,0.016549,0.016272,0.01721,0.020815,0.019496,0.018336,0.021457,0.021036,0.01847,0.01742,0.02038,0.022018,0.018431,0.014098,0.012942,0.013555,0.015158,0.01621,0.022432,0.030376,0.029483,0.024321
0.018725,0.018025,0.021121,0.023916,0.026127,0.022777,0.017052,0.017838,0.021032,0.02407,0.020302,0.017986,0.02085,0.020254,0.018452,0.01796,0.020978,0.022902,0.019195,0.013766,0.011888,0.014247,0.017597,0.01843,0.022757,0.030384,0.030956,0.025417
0.020835,0.021727,0.026036,0.028896,0.02863,0.022197,0.018007,0.021974,0.027623,0.028746,0.023447,0.019415,0.021691,0.024176,0.022574,0.021178,0.023229,0.024953,0.023408,0.018304,0.015081,0.017524,0.021221,0.021945,0.023528,0.029557,0.031887,0.026435
0.029983,0.032267,0.033176,0.032018,0.029233,0.02194,0.022232,0.030233,0.036214,0.034824,0.029248,0.024533,0.028644,0.035895,0.032716,0.029328,0.02983,0.031915,0.034483,0.029328,0.021756,0.022948,0.027672,0.027613,0.028297,0.03488,0.03664,0.028173
0.043226,0.046359,0.042843,0.036206,0.029717,0.023749,0.029638,0.041168,0.047263,0.042643,0.035363,0.032185,0.039742,0.050813,0.04579,0.040123,0.040399,0.043067,0.048554,0.04331,0.030201,0.030284,0.035217,0.032506,0.035985,0.046075,0.045818,0.032295
0.052616,0.056871,0.049987,0.041697,0.031394,0.025038,0.035078,0.048715,0.056301,0.048937,0.037845,0.036241,0.047543,0.060924,0.055094,0.047003,0.046773,0.049534,0.05721,0.053923,0.037233,0.03726,0.040578,0.03576,0.042147,0.053624,0.052921,0.036579
0.050507,0.055816,0.046996,0.042031,0.031857,0.023579,0.033384,0.046048,0.054828,0.046613,0.032694,0.032373,0.045402,0.058058,0.053197,0.043638,0.042442,0.044694,0.05291,0.054067,0.038536,0.038793,0.04091,0.035724,0.040939,0.049915,0.050118,0.034094
0.036374,0.041957,0.033911,0.033963,0.030123,0.021923,0.025099,0.032627,0.040688,0.03454,0.022833,0.022952,0.033112,0.041881,0.03903,0.030384,0.028597,0.030362,0.036952,0.042948,0.035444,0.03411,0.036587,0.032758,0.031348,0.035078,0.036177,0.024077
0.019221,0.024703,0.021506,0.022563,0.024254,0.019281,0.015822,0.017039,0.022174,0.020438,0.016696,0.016967,0.02026,0.023172,0.021934,0.015989,0.014836,0.018639,0.021716,0.026977,0.027759,0.024759,0.027532,0.026681,0.021113,0.019324,0.019281,0.01284
0.009683,0.013345,0.014991,0.014646,0.016457,0.016125,0.012003,0.009163,0.010335,0.013437,0.017286,0.017494,0.015448,0.015373,0.014201,0.009563,0.009223,0.015183,0.014536,0.01515,0.019046,0.017988,0.020692,0.023906,0.018815,0.013972,0.011161,0.007982
0.008576,0.011597,0.014518,0.0112,0.010529,0.014847,0.012651,0.008203,0.007411,0.012194,0.019736,0.017305,0.012375,0.012279,0.011035,0.008641,0.009768,0.013044,0.011147,0.010569,0.01297,0.014476,0.01849,0.021631,0.017244,0.014949,0.012574,0.009178
0.009572,0.011908,0.014944,0.011458,0.009874,0.014839,0.013008,0.008595,0.006778,0.011817,0.020077,0.015134,0.008541,0.008323,0.008471,0.009497,0.011116,0.01066,0.009906,0.010713,0.011315,0.011013,0.014642,0.016627,0.01329,0.015327,0.015494,0.011989
0.009458,0.010406,0.013476,0.011955,0.012538,0.016014,0.011712,0.009661,0.008456,0.011397,0.017487,0.012926,0.006556,0.005765,0.008,0.011683,0.011639,0.008938,0.01089,0.012094,0.012623,0.010847,0.011136,0.012021,0.01075,0.014209,0.016123,0.0138
0.008907,0.009317,0.010298,0.010554,0.014293,0.01647,0.010696,0.011669,0.010962,0.01019,0.013004,0.009617,0.00525,0.0052,0.008528,0.012611,0.011067,0.008828,0.012705,0.01242,0.014311,0.013426,0.010732,0.012507,0.010752,0.011441,0.013532,0.013987
