9e-06,3.5e-05,3.3e-05,1.1e-05,1e-06,6e-06,1.5e-05,3e-06,8e-06,5.2e-05,2e-06,2.1e-05,3.1e-05,1.9e-05,2e-06,2.8e-05,3.2e-05,1.3e-05,2e-06,1.6e-05,1.8e-05,1.1e-05,2e-06,8e-06,1.9e-05,1.5e-05,2.7e-05,1.4e-05,2.6e-05,2.8e-05,1.1e-05,2.4e-05,1.2e-05,1.1e-05,3.6e-05,2.1e-05,9e-06,0,6.7e-05,1.1e-05,5e-05,2.3e-05,1.2e-05,9e-06,8e-06,5.2e-05,1.4e-05,2.3e-05,2.5e-05,2.4e-05,3e-05,4e-06,2.7e-05,3.7e-05,1.1e-05,1.2e-05,9e-06,1.6e-05,2.4e-05,3e-05,1.7e-05,3e-05,2e-06,1.8e-05,8e-06,4e-06,8e-06,1.6e-05,0,3.8e-05,2e-05,4.4e-05,0,9e-06,1.6e-05,5e-05,1.1e-05,3e-06,1.5e-05,4e-05,4.5e-05,1.5e-05,4e-06,1.4e-05,2.6e-05,1e-06,3.9e-05,3.1e-05,9e-06,7e-06,4.1e-05,2.7e-05,6.3e-05,1.7e-05,5e-05,8e-06,3e-06,3e-06,2.6e-05,0,5e-06,1.4e-05,2.8e-05,3.7e-05,2.7e-05,7e-06,6e-06,1.9e-05,9e-06,5e-06,3.1e-05,4.2e-05,1.9e-05,2.9e-05,1.9e-05,2.3e-05,8e-06,2.9e-05,1.4e-05,8e-06,3.3e-05
0.000163,8.8e-05,6.7e-05,9e-05,5.8e-05,3.7e-05,2.2e-05,6e-06,3.3e-05,0.000118,5.4e-05,8.5e-05,7.3e-05,3.7e-05,9.2e-05,9.5e-05,5.6e-05,6.2e-05,7e-05,3.6e-05,3.6e-05,2.6e-05,4.2e-05,7.4e-05,8.1e-05,0.00011,5.5e-05,1.9e-05,7.5e-05,3.9e-05,5e-06,1.6e-05,5.9e-05,0.000109,6.2e-05,6.2e-05,7.8e-05,6.2e-05,0.000101,5.4e-05,8.9e-05,0.000194,0.000176,4.9e-05,3.8e-05,7.2e-05,7.4e-05,7.6e-05,6.3e-05,0.000115,4.8e-05,2.1e-05,7.4e-05,2.6e-05,3.1e-05,6.9e-05,4.3e-05,8.5e-05,0.000103,6.2e-05,8e-05,5e-05,2.3e-05,7.3e-05,3.2e-05,4.3e-05,7.7e-05,5.8e-05,8e-05,0.000103,5.9e-05,9.4e-05,5.4e-05,3.2e-05,1.8e-05,4.4e-05,7.6e-05,7.5e-05,9.4e-05,0.000121,7.7e-05,2.5e-05,7e-05,1.8e-05,5.7e-05,4.2e-05,5e-05,9.2e-05,3.8e-05,5.1e-05,3.9e-05,8.8e-05,7.1e-05,6.9e-05,4.1e-05,6.1e-05,3.3e-05,4.5e-05,8.7e-05,2.9e-05,3.7e-05,2.1e-05,5.2e-05,7e-05,5.2e-05,1.9e-05,5.4e-05,5.3e-05,2e-05,1.2e-05,6.6e-05,0.000119,3.6e-05,5.3e-05,0.000119,2.5e-05,9.5e-05,4e-05,3.8e-05,3.8e-05,9.2e-05
0.000126,6.4e-05,8.4e-05,3.9e-05,5e-06,2.9e-05,8.3e-05,2.5e-05,7e-05,0.00017,0.000135,7.3e-05,5.7e-05,5.7e-05,0.000102,0.000112,2.8e-05,5.5e-05,5e-05,5.9e-05,7.2e-05,4.4e-05,9.7e-05,3.6e-05,9e-05,5.8e-05,9.9e-05,5.4e-05,0.00012,0.00016,8e-05,3.5e-05,7.4e-05,4.9e-05,5.7e-05,0.000148,2.8e-05,0.000126,9.9e-05,8.5e-05,0.00014,0.000146,4.1e-05,0.00013,4.7e-05,8.3e-05,0.000109,6.5e-05,4.3e-05,0.000129,0.000136,0.000127,0.000102,6.1e-05,3.3e-05,0.000107,7.3e-05,8.2e-05,8.7e-05,9.2e-05,9e-05,8.6e-05,2e-05,4.5e-05,7.9e-05,7.7e-05,9.2e-05,4.9e-05,0.00014,1.9e-05,5.1e-05,0.000106,2.3e-05,7.8e-05,5.5e-05,8e-05,7.2e-05,3.5e-05,8.5e-05,1.5e-05,0.000177,0.000116,2.5e-05,5.1e-05,4.8e-05,7e-05,4.2e-05,0.000129,9.1e-05,3.3e-05,4.6e-05,9.8e-05,6.8e-05,5.3e-05,4e-06,2.5e-05,2.9e-05,4.9e-05,9.7e-05,0.000159,0.000113,6e-05,5.2e-05,0.000101,1.9e-05,4.2e-05,9.9e-05,5.8e-05,6.5e-05,6.3e-05,0.000111,8.5e-05,7e-05,9.9e-05,0.000128,1.7e-05,0.000112,9e-06,8.6e-05,0.000122,7.8e-05
7.5e-05,0.000124,5.9e-05,7.4e-05,6.9e-05,9.3e-05,0.000139,0.000105,4.2e-05,0.000162,7.1e-05,0.000176,0.000166,0.000171,0.00012,3.6e-05,6.6e-05,6.4e-05,6.1e-05,9.4e-05,8.1e-05,6.6e-05,0.000122,0.000118,4e-05,9.5e-05,0.000108,0.000148,9.1e-05,0.000115,5.4e-05,0.000114,0.000146,0.000125,0.000105,0.000144,0.000116,0.000136,0.000107,0.000201,0.000187,0.000294,0.000198,0.000271,0.000135,0.000144,8.8e-05,0.000132,0.000166,2.8e-05,0.000116,4.7e-05,9e-05,0.000147,5.5e-05,0.000158,2.5e-05,0.000126,5.6e-05,3.6e-05,6.2e-05,0.00011,0.000109,0.000128,9.9e-05,9e-05,0.000128,9e-05,4.6e-05,9.8e-05,0.000221,7.2e-05,0.00014,0.000175,5e-05,0.000173,2.4e-05,5e-05,9.4e-05,6.4e-05,0.000187,7.5e-05,6.4e-05,4.7e-05,6.5e-05,3e-05,3.4e-05,5.9e-05,0.000112,7.4e-05,0.000124,0.00016,0.000107,4.1e-05,0.000111,2.6e-05,3.2e-05,4.9e-05,7.3e-05,0.000236,8.7e-05,4.3e-05,0.000121,7.6e-05,8e-05,3e-05,6.8e-05,7.8e-05,0.000146,6.5e-05,0.000123,1e-04,5.9e-05,0.00013,0.000179,9.7e-05,5.7e-05,0.000124,0.000127,4.2e-05,0.000127
3e-05,0.000173,8.8e-05,0.000109,0.00012,6.7e-05,4.4e-05,0.00011,0.000123,0.000179,0.000103,4.4e-05,0.000161,0.000149,0.000198,0.000116,3.5e-05,0.000189,9e-05,0.000155,6.2e-05,6.6e-05,0.000198,4e-05,0.000103,0.000131,0.000148,0.000156,0.000299,0.000159,9.7e-05,6.1e-05,0.000104,4.7e-05,6.5e-05,3.3e-05,8.3e-05,4.6e-05,8.1e-05,0.000138,8.3e-05,0.000207,0.000199,0.000146,0.00015,8.7e-05,0.000124,0.000185,1.7e-05,6e-05,0.000151,6.6e-05,0.000128,0.000205,0.000124,0.000204,0.000155,0.000199,4.5e-05,1.7e-05,0.000162,0.000108,0.000248,2e-05,1.5e-05,0.000146,0.000151,4.3e-05,8.7e-05,0.000234,0.000116,0.000192,0.000214,0.000127,7.8e-05,0.000169,0.000267,4.9e-05,7.8e-05,0.000135,8.6e-05,0.000141,0.000153,0.000133,4.7e-05,0.000136,3.9e-05,0.000198,2.4e-05,0.00012,1.8e-05,0.000293,0.000258,0.000219,4e-05,0.000154,9.1e-05,3.9e-05,9.3e-05,0.000229,0.000213,0.000252,0.000186,0.000125,0.000105,8.2e-05,5.2e-05,0.00021,3e-05,0.000109,0.000103,0.000126,6.5e-05,1e-04,0.00016,0.000127,9.9e-05,0.000108,0.000161,0.000133,0.000102
7.5e-05,9.8e-05,0.000149,0.000109,4.6e-05,1.8e-05,8.7e-05,0.000147,0.000126,0.000159,0.000285,0.000356,0.000288,0.000122,0.000126,0.000264,0.000252,0.000217,0.000174,0.000169,0.000277,0.000141,0.00032,0.000433,0.00016,0.000161,0.000362,0.000101,0.000357,9.2e-05,0.00022,0.00018,5.9e-05,9.1e-05,0.000171,0.000151,0.000148,0.000146,5.4e-05,0.000103,9.2e-05,0.000164,6.5e-05,0.000253,0.000215,0.000241,0.000349,0.000231,8.6e-05,0.000228,0.000319,0.000149,3.4e-05,0.000133,9.2e-05,0.000208,4.5e-05,5.2e-05,0.000116,9.7e-05,0.000234,0.000179,0.000309,0.000309,0.000147,0.000188,0.000276,0.000206,0.000286,0.000276,0.000267,0.000119,8.5e-05,7e-06,8.4e-05,2.9e-05,0.000254,0.000275,0.00014,0.000153,0.000251,0.000284,0.000116,5.1e-05,0.000144,0.000272,0.000293,0.000157,0.00015,0.000331,0.000135,0.000344,0.000168,0.000287,0.000239,0.000245,0.00017,0.000134,2e-04,0.000239,0.00019,0.00022,0.000131,5.6e-05,2.9e-05,6.5e-05,0.000286,8.7e-05,4.2e-05,0.000143,0.000166,0.00022,0.00019,0.000205,0.000273,0.000147,7.4e-05,7.2e-05,4e-05,8.3e-05,9.6e-05
0.00016,0.000157,0.000136,0.000222,0.000214,6.2e-05,0.000139,0.000237,0.000189,0.000185,0.000253,0.000285,0.000618,0.000571,0.000391,0.00041,0.000489,0.000602,0.000457,0.000262,0.000423,0.000172,0.000385,0.000213,0.000406,0.000473,0.000535,0.000347,0.000282,0.000541,0.000441,4.6e-05,0.000102,7.9e-05,0.000217,1e-04,9.2e-05,0.000239,0.000121,0.000211,0.000316,0.000287,0.00015,0.000197,4e-05,0.000157,0.000289,0.000231,0.000204,0.000239,9.2e-05,8.5e-05,6.3e-05,9.9e-05,0.000122,0.00017,8.4e-05,5.6e-05,0.000146,7.5e-05,0.000281,5e-05,0.000226,0.000284,0.00028,0.000318,0.000355,0.000349,0.000258,0.00047,0.000396,0.000322,0.000353,0.000204,0.00021,0.000234,0.00035,8.7e-05,0.000153,0.000127,0.00019,0.000128,8.5e-05,2.7e-05,0.000232,0.000174,0.000186,0.000134,0.000203,0.00036,0.000342,0.000225,7.4e-05,5.3e-05,0.000145,8.4e-05,0.000113,8.7e-05,0.000106,0.000395,0.000288,0.000207,0.000331,2.6e-05,0.000104,0.000191,0.00034,0.000302,0.000219,0.000258,0.000208,0.000363,0.000155,0.000102,0.000295,0.000272,0.000182,0.000236,0.000188,0.000196,0.000347
3e-05,8.3e-05,0.000217,7.4e-05,0.000162,0.000216,0.00015,0.000221,0.000169,0.000245,0.000138,0.000214,0.000358,5.8e-05,0.000247,0.000175,0.000291,0.000161,8.2e-05,0.000183,0.000413,0.000281,0.00043,0.000281,0.000258,0.000169,0.000343,8.7e-05,0.000292,0.000507,0.000378,0.000328,0.000335,0.000183,8.4e-05,0.000194,0.000113,0.000192,0.00013,0.000192,0.000168,0.000125,5.8e-05,0.000127,0.000202,7.9e-05,0.000179,0.000309,0.00016,0.000271,0.000364,0.000167,8.3e-05,0.000161,9.3e-05,0.000199,0.000159,0.00013,0.000123,0.000204,0.000178,0.000418,0.000388,0.000187,0.000248,7.7e-05,0.000121,0.000115,9.7e-05,0.000265,0.000338,9.5e-05,0.000264,0.000133,6.8e-05,0.000234,8.1e-05,0.00017,0.000105,0.000202,0.000173,0.000209,0.000203,0.000199,0.00029,0.000358,0.00029,8.6e-05,0.000332,0.000122,0.000312,7.6e-05,0.000158,0.00022,0.000161,0.000167,0.000182,0.000299,0.000221,0.000271,8.5e-05,0.000135,0.00041,0.000287,6.1e-05,0.000208,0.000285,0.000162,0.000317,8.6e-05,0.000293,0.000146,0.000221,0.000104,0.000176,8.6e-05,0.000188,0.000191,0.000264,0.000305,0.000223
0.000248,0.000118,4.6e-05,0.000211,0.000167,8e-05,0.000256,7.4e-05,0.000242,6.6e-05,0.000297,0.000333,0.00039,0.000197,0.000237,4e-04,0.000201,5.7e-05,0.000228,0.000125,0.000479,0.000212,5.2e-05,0.000213,0.000189,8.7e-05,0.000346,0.00051,0.000484,0.000648,0.000246,0.000208,0.000352,0.000178,7.4e-05,0.000128,0.000108,7.5e-05,0.000117,0.00017,0.000138,0.000199,0.00015,0.00014,0.000191,0.00028,7.1e-05,0.000278,0.000109,0.000236,0.000298,0.000343,0.000117,0.000433,0.00025,0.000369,0.000429,0.000142,4.7e-05,0.000234,0.000205,0.000537,0.000566,0.000314,0.000309,0.000433,0.000199,0.000209,0.000257,0.000179,0.000177,0.000294,0.000284,0.000107,8.8e-05,0.000108,0.000127,0.000255,0.000259,0.000314,0.000426,0.000398,0.000565,0.000167,0.00017,0.000142,0.000331,0.000487,0.000587,0.000496,0.000141,0.000438,0.000456,0.000423,0.000165,0.000109,0.000223,0.000252,0.00018,0.000275,0.000396,0.000278,0.000385,0.000345,0.000181,0.000374,0.000389,0.000203,0.000324,0.000453,9.2e-05,0.000161,0.000207,5.7e-05,0.000316,0.000353,0.000188,0.000258,0.000137,0.00022,0.000602
0.000282,0.000221,0.000199,0.000199,2.2e-05,0.000113,0.000221,0.000294,0.000243,0.000301,0.000457,0.000307,0.000138,0.000222,1.1e-05,0.000142,0.000186,6.5e-05,0.000322,0.000311,0.00059,0.000366,0.000317,0.000295,0.000688,0.000553,0.000547,0.000307,0.000372,0.000201,0.000251,0.000246,0.000234,0.000232,0.000225,0.000332,0.000118,0.000227,0.000155,0.000231,5.4e-05,0.000186,0.000259,0.000142,0.000247,0.000508,0.000477,0.000466,0.000331,0.000266,0.000103,0.00021,0.000184,0.000573,0.000335,6.8e-05,0.000371,0.000349,8.3e-05,0.000174,0.000184,0.000398,0.000197,0.000227,0.000447,0.000118,0.000142,0.000293,0.000363,0.000394,0.000295,0.000379,0.000231,0.000132,0.000176,0.000216,0.000249,0.000176,0.000464,0.000325,0.000453,0.000327,0.000438,0.000388,0.000246,0.000257,0.000197,0.000416,0.000195,0.000207,0.000364,0.000593,0.000319,0.000306,0.00048,0.000178,0.000201,0.000361,0.000368,0.000491,0.000581,0.000629,0.00039,0.000207,0.000325,0.000497,0.000188,6.2e-05,3.5e-05,0.000402,0.000499,0.000355,0.000301,0.000155,0.000403,0.000333,0.000359,0.000147,0.000286,0.000295,0.000474
0.00018,0.000236,0.000329,0.000233,9.6e-05,2e-05,0.000182,0.000239,0.000182,0.000175,0.000286,0.000141,0.00013,0.000228,1.7e-05,6.1e-05,0.000165,0.000124,0.000341,0.000148,0.000239,0.000232,0.000241,0.000565,0.00066,0.000116,0.000288,0.000279,0.000233,0.000115,0.000118,0.000104,0.000307,0.000184,2e-05,0.000168,0.000295,9.1e-05,0.000139,0.000306,0.000181,0.000122,0.000129,0.000198,0.000335,1.1e-05,0.000174,0.000233,0.000309,0.000143,9.7e-05,0.000229,0.000125,0.000392,0.000269,3.9e-05,0.000195,6.7e-05,0.000107,0.000249,8e-05,0.000121,0.000284,0.000241,0.000121,0.000194,0.000154,0.000251,0.000286,0.000145,7.4e-05,0.000185,0.00012,0.000165,0.000166,0.000269,0.000142,0.000244,0.000436,0.000309,0.000352,0.000302,7.7e-05,0.000157,2.7e-05,0.000223,0.000371,3.2e-05,0.000138,0.000201,0.000291,0.000102,0.000128,0.000315,0.000335,0.000334,0.000139,0.000177,1e-04,0.000247,0.000114,0.000247,0.000136,0.000264,0.000129,0.000226,0.00029,0.000239,0.000145,0.000355,0.000261,0.000121,5.6e-05,0.000131,0.000175,4.5e-05,9.1e-05,0.000132,0.000337,0.000198,0.000482
0.000176,0.000173,0.000269,0.000258,0.000126,0.000114,0.000168,8.3e-05,0.000139,0.00017,0.000325,0.000302,0.000367,0.000462,0.000388,0.000396,0.000105,9.9e-05,0.000116,0.000192,3.7e-05,9.4e-05,0.000353,0.00022,0.000222,0.000189,0.000196,0.000258,9.3e-05,0.000156,0.000128,0.000186,0.000288,0.000154,0.000167,0.000168,0.000148,0.000203,0.000221,0.000341,0.000247,0.000131,2.7e-05,0.000223,9.6e-05,0.00011,0.000127,0.000226,6.4e-05,6.8e-05,9.2e-05,0.000106,0.000105,0.000189,0.000184,0.000184,0.00017,0.00021,0.000165,0.000226,0.000217,0.000133,0.000169,4.8e-05,7.5e-05,0.00011,8.4e-05,0.000129,0.000129,0.000176,0.000136,8.3e-05,6.6e-05,6.2e-05,0.000106,0.000143,0.00019,0.000169,0.00015,2e-05,0.000306,0.000278,0.000202,5.3e-05,7e-05,7.7e-05,8.8e-05,0.000144,0.000162,9.6e-05,5e-05,0.00012,5.3e-05,0.000229,0.000103,9.8e-05,1.9e-05,0.000116,0.000217,7.9e-05,9.8e-05,0.000156,0.000136,4.7e-05,0.000106,5.8e-05,0.000123,6.2e-05,0.000251,1.8e-05,8.6e-05,0.000173,0.000113,6.7e-05,0.000176,0.000219,0.000138,0.000204,0.000251,5.3e-05,0.000183
0.000208,0.000126,4.9e-05,0.000218,8.8e-05,7.2e-05,0.000224,0.000167,0.000125,0.000183,0.000146,9.1e-05,0.000164,0.000271,0.000295,8.8e-05,3.7e-05,7.1e-05,8.7e-05,0.000134,0.00011,2.4e-05,0.000218,0.000232,8.4e-05,0.000168,0.000109,0.000148,7.1e-05,0.000244,0.000112,0.000165,5.8e-05,1e-04,9.9e-05,2.8e-05,0.000116,3.4e-05,6.7e-05,4.5e-05,4.2e-05,0.000223,0.000184,0.000187,9.9e-05,0.000148,9.7e-05,4e-05,9e-05,5.5e-05,0.000116,5.3e-05,9.4e-05,0.000101,0.000106,9.9e-05,0.000219,0.000246,0.000118,0.000105,4.3e-05,0.000149,2.5e-05,3.9e-05,8.1e-05,0.000188,0.000156,8.4e-05,8.8e-05,0.000178,0.000189,0.000283,0.000109,2.8e-05,0.00016,6.2e-05,7.1e-05,6.1e-05,0.000159,0.000172,0.000257,0.000177,2.2e-05,3.3e-05,3.1e-05,3.2e-05,5.1e-05,7.2e-05,1.8e-05,0.000141,0.000149,8e-05,0.000116,3.8e-05,4.4e-05,0.000108,2.4e-05,8.5e-05,0.000166,0.000112,9.9e-05,0.000262,0.000108,0.00018,0.000261,0.000287,9.4e-05,5.4e-05,0.000137,0.000146,3.7e-05,0.000188,8.5e-05,7.1e-05,0.000115,0.000152,5e-05,0.000186,0.000173,7.9e-05,1.3e-05
0.000268,8.3e-05,0.00019,0.000236,0.00021,7.6e-05,0.000219,4.3e-05,6.8e-05,0.000148,8.2e-05,0.000155,0.000203,0.000185,2.3e-05,0.000182,0.000226,0.000132,0.000172,4.5e-05,5.1e-05,7.3e-05,0.000136,0.000222,0.000112,0.000172,0.000159,0.000207,8e-05,0.000175,0.000181,6.3e-05,0.000143,5.8e-05,0.00016,0.000104,0.000157,0.000138,5.9e-05,9.7e-05,4.4e-05,0.000154,6.7e-05,1.4e-05,5.2e-05,0.000133,6.2e-05,0.00015,0.000128,6.3e-05,0.000124,2e-04,0.000168,9.4e-05,3.8e-05,0.000137,0.000179,0.000233,0.000172,0.000139,2e-05,0.000107,4.5e-05,2.4e-05,2.4e-05,0.000141,0.000103,0.000117,5.7e-05,0.000117,0.000101,0.000172,0.000122,4.6e-05,0.000198,3.2e-05,9e-05,0.000113,0.000128,3.2e-05,0.000164,0.000138,4.6e-05,9e-05,0.000121,3.1e-05,0.000141,3.6e-05,3.8e-05,0.00017,4.7e-05,5.5e-05,0.000165,0.000242,0.000214,0.000144,9.3e-05,9.6e-05,0.000185,0.00018,2e-05,0.00026,0.000123,0.00016,0.000161,0.000125,6.3e-05,7.8e-05,0.000154,9.1e-05,0.000118,0.000245,6.6e-05,3.9e-05,0.000109,5.8e-05,0.000124,0.000162,0.000312,0.000226,0.000224
0.000222,0.000242,0.000247,0.000303,4.6e-05,0.000123,0.000117,0.000134,9.5e-05,9.2e-05,0.00016,0.000194,0.000155,5e-05,3.2e-05,0.000137,0.000161,2e-05,0.000194,5.5e-05,1.5e-05,0.000111,5.1e-05,0.000245,0.000156,0.000134,1.7e-05,9.4e-05,7.6e-05,5.9e-05,6.6e-05,2.8e-05,0.000107,0.000125,0.000153,0.000166,0.000135,0.000126,0.000145,4.1e-05,0.000116,0.00013,0.000109,0.000168,0.000107,9.3e-05,0.000149,7.2e-05,0.000261,0.000263,0.00018,0.000159,0.000115,0.000153,9.9e-05,8.8e-05,0.000258,0.00011,0.000121,0.000186,0.000162,3.5e-05,0.000129,0.000151,0.000152,0.000136,0.000102,0.000171,0.000115,0.00014,0.000135,0.000176,7.8e-05,0.000113,0.000105,0.000134,0.000224,1.4e-05,0.000132,0.000107,0.000121,0.000172,8.1e-05,6.7e-05,8.7e-05,0.000103,0.000174,7.6e-05,1e-04,6.3e-05,4.8e-05,2e-05,0.000156,0.000275,4.2e-05,0.000119,0.000142,0.000126,0.000196,0.000274,0.000161,0.000134,8.9e-05,0.000179,9.4e-05,0.000161,0.000243,8.7e-05,0.000173,0.000115,5.9e-05,0.000187,0.000191,9.4e-05,9.8e-05,5e-05,0.000107,0.000131,0.000101,9.3e-05,0.000199
0.000144,0.000153,0.000177,0.000132,0.000233,0.000267,0.000321,0.000237,3.7e-05,0.000139,0.000122,0.000181,0.000111,2.6e-05,0.000104,0.000106,0.000136,6.7e-05,0.000143,0.000249,0.000137,0.000112,6.4e-05,0.000182,0.000176,0.000105,0.000119,6e-05,4.4e-05,2.2e-05,0.000128,5.5e-05,2.4e-05,9.5e-05,0.000131,0.000222,0.000139,0.000148,5e-05,0.00015,0.000122,0.000151,3.7e-05,0.000169,0.000127,3.8e-05,0.000134,0.000143,0.000263,6e-05,7.4e-05,8.2e-05,0.000175,0.000112,5e-05,6.2e-05,0.000214,0.000137,7.2e-05,4.9e-05,5.7e-05,0.000123,8.5e-05,0.000134,0.000103,0.000118,7.1e-05,0.000129,6.5e-05,0.000117,0.000179,4.3e-05,0.000173,9.6e-05,0.000108,7.5e-05,0.000163,0.000139,0.000112,4.5e-05,0.000212,1e-04,0.000117,1.9e-05,4.2e-05,0.000124,0.000102,3.3e-05,0.000103,0.000166,0.000105,5.7e-05,0.000185,8.4e-05,8.6e-05,9.7e-05,8.4e-05,0.000141,0.000163,0.000204,0.000133,0.000178,0.00013,3.3e-05,0.000114,9e-05,9.2e-05,6e-05,0.000129,2e-05,0.000108,0.000219,0.000234,9.1e-05,0.000127,6.8e-05,0.000205,0.000114,3.4e-05,0.000208,8.9e-05
0.000236,0.000159,0.000143,8.7e-05,0.000185,3.5e-05,0.000199,0.000236,0.00017,4.3e-05,7.4e-05,7.3e-05,3.7e-05,7.7e-05,0.000152,9.1e-05,0.000293,0.000283,0.000185,0.000189,0.000172,0.000264,0.000173,0.000139,4.8e-05,8.2e-05,8.7e-05,7.7e-05,3.1e-05,6e-06,9.7e-05,9.5e-05,7.8e-05,4.2e-05,5.9e-05,0.000109,0.000218,0.000101,3.4e-05,0.000127,9e-05,8.9e-05,5.7e-05,0.000153,0.000136,7.9e-05,0.000145,7e-05,0.000122,9.8e-05,4.1e-05,0.000115,0.000262,0.000199,9.4e-05,3.6e-05,0.000131,0.000121,5.8e-05,0.000261,0.000135,5.4e-05,0.000152,0.000151,0.000185,0.000186,7.6e-05,2.8e-05,3.9e-05,9.8e-05,0.000174,0.000145,0.000201,0.000161,7.5e-05,3.8e-05,0.00018,8.4e-05,8.5e-05,1.7e-05,0.000175,0.000118,4.3e-05,0.000107,0.000114,0.000173,7e-05,0.000152,0.000124,0.000194,0.000216,0.000211,0.000153,0.000161,2.1e-05,0.000112,5.8e-05,0.000204,0.000334,0.000244,4e-05,0.000193,0.000127,0.000117,7.4e-05,0.000135,0.000198,7.9e-05,7.1e-05,0.00016,0.000172,5.3e-05,0.000115,0.00011,7.5e-05,7.2e-05,0.000179,0.000167,0.000158,0.000216,0.000249
0.000126,0.000221,0.000188,0.00014,6.8e-05,3.7e-05,8.2e-05,3.9e-05,3.8e-05,5.5e-05,7.7e-05,5.2e-05,4.6e-05,0.000106,0.000205,0.000143,0.000177,1.7e-05,0.000167,0.000109,0.000219,0.000122,2e-04,2.4e-05,6e-05,0.000139,4.9e-05,9.3e-05,8.4e-05,6.4e-05,5.7e-05,0.000126,0.000197,0.000153,1e-04,0.000119,0.000135,7.9e-05,3.7e-05,4.7e-05,0.000167,0.000116,0.000117,9.8e-05,7.3e-05,0.000152,3.5e-05,9.1e-05,2.7e-05,4.3e-05,0.000101,0.000104,0.00017,0.00015,2.4e-05,4.7e-05,7.2e-05,9.7e-05,0.000248,0.00037,0.000266,0.000166,0.000299,0.000143,6.2e-05,3.1e-05,9.4e-05,5.5e-05,6e-05,8.6e-05,0.000121,5e-05,0.000195,0.000346,0.000175,6.6e-05,0.000201,0.000205,0.000134,0.000109,0.000181,0.000101,9.2e-05,0.00013,0.000239,0.00034,0.00035,0.000252,0.000107,0.000127,0.000258,9.9e-05,0.000255,0.000237,0.000191,0.000125,0.00012,0.000165,0.000366,0.000281,0.000177,0.000163,0.000224,0.000108,2.4e-05,0.000115,4.7e-05,0.000134,0.000217,0.000307,0.000231,8.6e-05,7.8e-05,0.000127,0.00012,5.3e-05,0.000111,5.8e-05,0.000171,6e-06,0.000155
0.000123,0.000133,5.5e-05,8.6e-05,4.5e-05,3.4e-05,4.2e-05,3.2e-05,3.6e-05,6e-05,5.4e-05,9.1e-05,4.7e-05,8.1e-05,7.7e-05,6.7e-05,7.3e-05,0.000138,0.000116,7.3e-05,0.000118,1e-04,0.000114,0.000145,7.1e-05,0.000144,8.1e-05,6.7e-05,2.2e-05,5.1e-05,9e-05,0.000122,5.8e-05,5.9e-05,3.4e-05,0.000125,5.6e-05,2.5e-05,6.7e-05,7.1e-05,0.00014,3.9e-05,6.8e-05,6.4e-05,7.9e-05,9.8e-05,4.5e-05,4.9e-05,5.2e-05,1.1e-05,5.2e-05,1.4e-05,7.5e-05,4.4e-05,8.8e-05,0.000114,0.00016,4.9e-05,0.000166,6.8e-05,5.1e-05,1.9e-05,0.000154,4.5e-05,8.4e-05,9.1e-05,0.000126,4e-05,8.3e-05,5.1e-05,3.8e-05,2.4e-05,0.000165,0.000255,0.000198,0.000121,5.5e-05,0.000146,6.8e-05,6e-05,9.3e-05,5.8e-05,3.5e-05,3.5e-05,0.000151,0.000193,1.8e-05,7.2e-05,5.1e-05,0.000101,0.000114,0.000118,0.000222,0.000149,3.9e-05,6.7e-05,6.8e-05,0.00018,5.4e-05,8.7e-05,5.3e-05,0.000113,0.000166,4.6e-05,8.4e-05,3.4e-05,8.4e-05,6.3e-05,0.000126,1e-04,5.6e-05,6.5e-05,7.2e-05,6.9e-05,3.4e-05,9e-06,4.8e-05,2.4e-05,0.000104,7.2e-05,8.2e-05
7.9e-05,8.9e-05,3.7e-05,3.3e-05,2.3e-05,5.1e-05,4.5e-05,3.4e-05,3.6e-05,2e-05,8.2e-05,3.7e-05,9e-05,2.3e-05,6.7e-05,6.6e-05,5.8e-05,8.2e-05,5.5e-05,6.2e-05,0.00014,0.000161,3.7e-05,9.1e-05,8.7e-05,1.3e-05,2.7e-05,6.7e-05,5.2e-05,5.1e-05,2.6e-05,5.4e-05,3.1e-05,4.1e-05,2.7e-05,8.4e-05,3.8e-05,4.2e-05,6.5e-05,3.4e-05,4.9e-05,4.2e-05,3.9e-05,5.2e-05,4e-05,9.4e-05,5.5e-05,0.000123,5.7e-05,1.6e-05,2.7e-05,3.5e-05,6.5e-05,5.9e-05,7.6e-05,4.4e-05,9e-05,4.6e-05,0.000108,8.7e-05,4.4e-05,7.8e-05,7.8e-05,1e-05,3.2e-05,5.2e-05,3.2e-05,4.4e-05,3.5e-05,7e-06,6.7e-05,6.1e-05,7e-05,8.8e-05,4.9e-05,5.1e-05,5.2e-05,8.4e-05,8.6e-05,4e-06,5.5e-05,2.8e-05,1.1e-05,4.8e-05,6.5e-05,9.7e-05,2.2e-05,6.1e-05,2.1e-05,7.1e-05,7.6e-05,8.2e-05,6.2e-05,4.7e-05,2.2e-05,1.7e-05,0.000104,6.6e-05,0.000102,2.3e-05,8.9e-05,9.2e-05,6.8e-05,7.3e-05,8.3e-05,0.000114,7.4e-05,0.000115,2.4e-05,9.2e-05,6.9e-05,5.4e-05,6.3e-05,2.2e-05,3.6e-05,3.3e-05,2.9e-05,4.7e-05,3.3e-05,3.9e-05,5.4e-05
2e-05,5e-05,6.5e-05,6.2e-05,2.8e-05,2.8e-05,4.3e-05,4.4e-05,6.1e-05,1.8e-05,4.1e-05,2.7e-05,2.8e-05,2.5e-05,3.5e-05,3.4e-05,6.7e-05,4.7e-05,9.9e-05,5.7e-05,8.6e-05,6.4e-05,4.6e-05,7.4e-05,3.8e-05,1.4e-05,2.1e-05,3e-05,2.6e-05,4.5e-05,2.8e-05,8.1e-05,5e-05,6e-05,3.8e-05,3.8e-05,4.8e-05,3.3e-05,2.1e-05,1.4e-05,6.9e-05,5.6e-05,3.4e-05,6.6e-05,5.9e-05,5.4e-05,1.9e-05,0.00011,5.8e-05,3.9e-05,5.7e-05,3.5e-05,2e-05,9e-06,1.9e-05,5.3e-05,4.3e-05,3.6e-05,4.7e-05,0.000124,1.8e-05,9e-05,3.1e-05,9e-06,4.2e-05,3.1e-05,2.9e-05,3.6e-05,4.4e-05,1.5e-05,7.3e-05,4.3e-05,5.5e-05,4.3e-05,4.6e-05,5.8e-05,0.000117,1.6e-05,4.1e-05,4.8e-05,3e-05,5.5e-05,4.4e-05,5.8e-05,6.6e-05,4.3e-05,3.8e-05,4.3e-05,6.3e-05,6e-05,1e-04,4.6e-05,5.8e-05,4.9e-05,6.4e-05,4.3e-05,7.5e-05,9e-06,7.6e-05,2.6e-05,6.9e-05,7e-05,2.1e-05,3.2e-05,1.3e-05,5.9e-05,5.8e-05,9.7e-05,4.4e-05,5.6e-05,3.9e-05,2.8e-05,4e-05,4.3e-05,4.2e-05,3.1e-05,3.6e-05,2.2e-05,2.6e-05,3.4e-05,1.6e-05
2.2e-05,8.5e-05,4.6e-05,5.1e-05,2.2e-05,1.5e-05,6.6e-05,2.8e-05,4.8e-05,3.4e-05,3.6e-05,3.4e-05,3e-05,2.4e-05,1.5e-05,2.9e-05,5.5e-05,9.2e-05,6.2e-05,1.8e-05,9.5e-05,3.1e-05,2.6e-05,4e-05,4.6e-05,3e-05,1.8e-05,2.7e-05,9e-06,3.3e-05,1.1e-05,5.2e-05,2e-05,2.6e-05,4.1e-05,2.5e-05,2e-05,4.3e-05,5.6e-05,2.1e-05,8.2e-05,3.8e-05,3.8e-05,4e-05,4.4e-05,4.6e-05,3e-05,8.5e-05,1.9e-05,3.4e-05,2.4e-05,1.5e-05,2.5e-05,4.3e-05,2.5e-05,4.7e-05,3.3e-05,5.2e-05,6e-05,9.4e-05,4.3e-05,6.5e-05,5.9e-05,2.4e-05,6.1e-05,1.7e-05,4e-05,1.4e-05,5.2e-05,2.3e-05,3.1e-05,5e-05,7.2e-05,6.6e-05,7.7e-05,2e-05,7.5e-05,2.3e-05,2.7e-05,4.3e-05,2.7e-05,6.2e-05,3.6e-05,4.6e-05,5.7e-05,3e-05,1.4e-05,5.6e-05,4.6e-05,3.5e-05,5.2e-05,2.9e-05,6.6e-05,7.7e-05,1.2e-05,5.4e-05,7e-05,2.4e-05,8.7e-05,3.8e-05,4.5e-05,1.1e-05,3.7e-05,8e-05,5.3e-05,2.8e-05,4.2e-05,4.5e-05,1.6e-05,8.1e-05,5.2e-05,1e-05,4.7e-05,2.7e-05,2e-05,2e-05,5.3e-05,4.4e-05,2e-05,3.4e-05,2.4e-05
2.1e-05,4.8e-05,1.9e-05,1.7e-05,2.1e-05,2.1e-05,2e-06,6e-06,2.1e-05,2.2e-05,2.7e-05,1.5e-05,8e-06,2.1e-05,2.7e-05,1.4e-05,8e-06,4.1e-05,1.6e-05,2.5e-05,3.6e-05,1e-05,1.4e-05,1.1e-05,8e-06,4e-06,1.4e-05,2.3e-05,1.8e-05,2.4e-05,1.3e-05,8e-06,8e-06,1.3e-05,1.5e-05,2e-06,1.6e-05,1.2e-05,1.7e-05,2.4e-05,2.1e-05,2.1e-05,1.6e-05,2.5e-05,1.4e-05,1.8e-05,2.5e-05,4.8e-05,3.5e-05,8e-06,1e-05,6e-06,4e-06,3.1e-05,2.7e-05,1.8e-05,1e-05,9e-06,3.5e-05,4.6e-05,2e-05,7e-06,5e-06,2e-05,2.4e-05,2e-06,2.1e-05,1.8e-05,2.5e-05,2.2e-05,2.2e-05,2.7e-05,2.8e-05,1.9e-05,1.9e-05,1.5e-05,1.1e-05,1.4e-05,1.1e-05,3.3e-05,6e-06,2.8e-05,1.5e-05,3.2e-05,1.5e-05,9e-06,2.2e-05,2e-05,1.7e-05,1.7e-05,2.1e-05,2.2e-05,2.7e-05,2.7e-05,1.2e-05,2.8e-05,3.8e-05,1.6e-05,2.6e-05,1.2e-05,5e-06,5e-06,7e-06,1.1e-05,1.2e-05,1.7e-05,2.2e-05,1.4e-05,9e-06,2.8e-05,2e-05,8e-06,1.1e-05,1.5e-05,1.1e-05,1.1e-05,4.3e-05,1.7e-05,1.5e-05,5e-06,9e-06
4e-06,3.6e-05,9e-06,2.6e-05,1.8e-05,1.7e-05,2.6e-05,1.5e-05,1.4e-05,4.4e-05,6e-06,2e-05,2.5e-05,9e-06,3.2e-05,2.6e-05,3e-06,4.1e-05,2.8e-05,2.6e-05,3.5e-05,3.3e-05,3.1e-05,3.1e-05,1.8e-05,5e-06,2.1e-05,2.1e-05,9e-06,1.2e-05,1.4e-05,3.3e-05,9e-06,1.3e-05,1.4e-05,3.3e-05,2.1e-05,2e-05,1.8e-05,1.5e-05,1.7e-05,3.4e-05,1.9e-05,1.8e-05,2.4e-05,4.2e-05,2.3e-05,4.9e-05,1.8e-05,1.4e-05,7e-06,1.1e-05,2e-05,1.8e-05,2.1e-05,4.1e-05,3.5e-05,8e-06,4.2e-05,4.6e-05,1.5e-05,1.3e-05,2.2e-05,1.7e-05,2.2e-05,6e-06,4e-06,1.3e-05,1.3e-05,1.5e-05,1.1e-05,4.3e-05,2.9e-05,1.1e-05,9e-06,1.7e-05,2.4e-05,1.9e-05,1e-05,1.4e-05,2.6e-05,7e-06,1.5e-05,4.4e-05,7e-06,2.1e-05,2.3e-05,1.5e-05,2.5e-05,1.2e-05,6e-06,1.2e-05,5e-06,2e-05,2e-06,1.5e-05,1.4e-05,4.2e-05,4.9e-05,9e-06,1.2e-05,2.1e-05,9e-06,2.3e-05,7e-06,1e-05,1.5e-05,1.1e-05,7e-06,1e-06,5.1e-05,1.6e-05,1.8e-05,8e-06,5e-06,2.1e-05,4.6e-05,4e-06,1.8e-05,4.1e-05,1.9e-05
3.5e-05,3e-05,4e-05,4.8e-05,4.4e-05,2.6e-05,1.3e-05,2.2e-05,2.3e-05,4.3e-05,2.6e-05,2.1e-05,3.2e-05,4e-05,2.4e-05,2.4e-05,2e-05,2.5e-05,1.9e-05,2.1e-05,1.1e-05,4.5e-05,1.3e-05,4.1e-05,2.1e-05,8e-06,1.1e-05,4.4e-05,6.2e-05,2e-05,3e-05,4.7e-05,4e-05,1.4e-05,1e-05,5e-05,6.6e-05,6.6e-05,4.7e-05,2.7e-05,4.6e-05,5.9e-05,5e-05,1.7e-05,3.6e-05,5.8e-05,4.9e-05,7.2e-05,5.7e-05,2.8e-05,8e-06,1.8e-05,5e-05,5.8e-05,1e-05,3.5e-05,5e-06,1.5e-05,2.8e-05,3.8e-05,3.6e-05,1.9e-05,2.9e-05,2.6e-05,3.4e-05,1e-05,4.2e-05,9e-06,1.8e-05,3.6e-05,3.8e-05,2.4e-05,4.3e-05,7e-06,2.3e-05,3.1e-05,1.2e-05,2.5e-05,7e-06,3e-06,2.1e-05,5.1e-05,2e-05,4.4e-05,4.1e-05,1e-05,6.1e-05,1.9e-05,2.1e-05,5.3e-05,2.1e-05,1.7e-05,1.1e-05,6.1e-05,4.2e-05,4e-06,5e-05,3.9e-05,2.4e-05,2.7e-05,1.8e-05,4.8e-05,5.5e-05,4.1e-05,2.8e-05,5e-05,3e-05,9e-06,2.3e-05,1.6e-05,5.8e-05,3.5e-05,3.4e-05,1.1e-05,1e-05,3.7e-05,1e-06,6.6e-05,4.1e-05,3.9e-05,2.9e-05
9.3e-05,5.5e-05,1.3e-05,2.2e-05,6.6e-05,4.5e-05,2.9e-05,4.3e-05,4.1e-05,6.8e-05,4.6e-05,3e-05,4.6e-05,6.9e-05,4.2e-05,4.3e-05,4.2e-05,5.5e-05,1.3e-05,1.3e-05,5e-05,7.9e-05,6.7e-05,7.1e-05,3.1e-05,1.9e-05,9e-06,4.6e-05,6.2e-05,6.3e-05,5e-05,4e-05,2.2e-05,4.1e-05,3.7e-05,7.1e-05,2.2e-05,1.7e-05,7.3e-05,4e-05,3.8e-05,1.6e-05,3.1e-05,7.7e-05,3e-05,6.4e-05,5.4e-05,4.7e-05,2.2e-05,2.4e-05,2e-05,4.1e-05,5e-05,1.1e-05,8.1e-05,3.4e-05,3e-05,4e-05,2e-05,4.3e-05,4.6e-05,1.8e-05,2.7e-05,3.9e-05,6.7e-05,3.8e-05,5.3e-05,4.9e-05,4.3e-05,3.3e-05,1.4e-05,3e-05,8.4e-05,4.5e-05,2.4e-05,4.4e-05,1.5e-05,5.5e-05,5.1e-05,2.7e-05,4.6e-05,7e-05,7.3e-05,4.1e-05,5.3e-05,3.1e-05,7.7e-05,5.5e-05,3.6e-05,6.4e-05,9.2e-05,6.1e-05,4.9e-05,5.7e-05,3e-05,1.8e-05,0.000106,7.6e-05,0.000113,8.5e-05,2.2e-05,5e-05,8.5e-05,5.5e-05,2.3e-05,6.3e-05,8e-06,2.2e-05,2.9e-05,4.9e-05,9.2e-05,5.2e-05,4.3e-05,2.4e-05,2.6e-05,3.5e-05,4e-05,0.000104,4.9e-05,4.2e-05,3.2e-05
6.1e-05,3.1e-05,2.4e-05,7.2e-05,7.8e-05,2.9e-05,5.5e-05,6e-05,6.5e-05,3.1e-05,3.9e-05,2.6e-05,4.8e-05,0.000138,9e-05,8.1e-05,9.9e-05,5.9e-05,7.8e-05,3.6e-05,0.000108,3.3e-05,8.6e-05,3.5e-05,4.1e-05,4.7e-05,5.7e-05,5.3e-05,8.7e-05,0.000105,3.3e-05,5.5e-05,6.8e-05,7.6e-05,6.9e-05,0.000133,9e-05,5.7e-05,9.1e-05,0.000127,0.000101,6.5e-05,5e-06,8.1e-05,8.3e-05,0.00011,5.2e-05,1.7e-05,5.9e-05,6.5e-05,7.1e-05,5.2e-05,3.5e-05,2.9e-05,0.000107,9e-05,6e-05,2.4e-05,3.8e-05,8.5e-05,5.4e-05,4.7e-05,8.2e-05,9.5e-05,8.6e-05,9.8e-05,8.5e-05,4e-05,0.000125,0.000108,5.1e-05,6.7e-05,0.000113,6.1e-05,3.9e-05,1.7e-05,4.7e-05,7e-05,0.000116,8.6e-05,5.3e-05,2.8e-05,0.000108,0.000125,9.9e-05,7e-05,7.6e-05,0.000119,3e-05,4.7e-05,8.9e-05,1.3e-05,4.8e-05,4.6e-05,5.6e-05,4.4e-05,0.000123,0.000103,6.8e-05,0.000133,0.000101,9.7e-05,4.9e-05,7e-05,5.8e-05,8.4e-05,9.3e-05,8.5e-05,6.3e-05,7.2e-05,2.1e-05,8.9e-05,1.9e-05,8e-05,9.2e-05,9.1e-05,1.4e-05,6.2e-05,6.9e-05,7.2e-05,9.4e-05
5.7e-05,0.000122,8e-05,6.5e-05,7.4e-05,2.8e-05,4.4e-05,0.000119,5.9e-05,6e-05,6.3e-05,1.9e-05,4.1e-05,6.2e-05,0.000105,9.2e-05,5e-05,6.7e-05,5.9e-05,8.5e-05,4.3e-05,0.000121,7.7e-05,3.4e-05,8.4e-05,3.6e-05,2e-05,3e-05,8.1e-05,4.5e-05,4.4e-05,5.1e-05,8.6e-05,6.9e-05,1.9e-05,8.4e-05,3.7e-05,4.2e-05,0.000132,0.000122,9.1e-05,6.9e-05,7.9e-05,2.2e-05,6.1e-05,8.5e-05,0.000122,0.000123,0.000129,5.4e-05,8e-06,1.1e-05,2.7e-05,2.2e-05,7e-05,3.9e-05,2e-05,4.4e-05,2.7e-05,6.8e-05,0.000138,8.8e-05,0.000102,2.7e-05,4.1e-05,6.4e-05,2.8e-05,4.7e-05,0.000122,8.2e-05,3.3e-05,0.000105,8.9e-05,5.2e-05,1.1e-05,2.4e-05,3.3e-05,8.2e-05,9.2e-05,6.2e-05,4e-05,6.4e-05,8.5e-05,7.7e-05,6.7e-05,5e-06,6.7e-05,0.000125,0.000122,0.000103,6e-05,7.9e-05,7.6e-05,7.8e-05,7.6e-05,5e-05,9e-05,0.000138,0.000113,2.9e-05,3.5e-05,5.1e-05,9.5e-05,8.8e-05,1.5e-05,3.2e-05,4.3e-05,5.5e-05,2.8e-05,3.7e-05,5.5e-05,8.6e-05,7.9e-05,0.00012,5.6e-05,1.8e-05,5.2e-05,3.2e-05,4.3e-05,1e-05,6.3e-05
7e-06,8.3e-05,6e-05,3e-05,3.5e-05,4.1e-05,6e-06,6.4e-05,4.8e-05,5.5e-05,4.4e-05,3.1e-05,3.4e-05,4.6e-05,4.3e-05,5.1e-05,3.5e-05,4.8e-05,1.6e-05,6e-05,7.1e-05,8.9e-05,2.1e-05,1.1e-05,3.7e-05,5.4e-05,2.3e-05,5.5e-05,4.2e-05,3.5e-05,1.9e-05,3.8e-05,4.2e-05,4.3e-05,3.9e-05,2.8e-05,2e-05,4.1e-05,5.6e-05,7e-06,4.3e-05,8e-06,2.6e-05,3.7e-05,3.4e-05,1e-05,5.5e-05,6.2e-05,3.4e-05,3e-05,2.1e-05,2.3e-05,4e-05,3.1e-05,4e-05,4.9e-05,1.9e-05,2.1e-05,1.4e-05,2.9e-05,8.4e-05,3.6e-05,6.2e-05,4.9e-05,2.7e-05,3.1e-05,2.1e-05,4.4e-05,5.2e-05,3.2e-05,1.7e-05,6.5e-05,2.5e-05,1.6e-05,3.9e-05,3.7e-05,2.6e-05,3.6e-05,3.1e-05,1.6e-05,2.1e-05,3.9e-05,2.2e-05,2.7e-05,3.2e-05,2.7e-05,4.6e-05,6.2e-05,5.2e-05,4.3e-05,3.4e-05,4e-05,3.5e-05,2.2e-05,1.6e-05,1.9e-05,5.4e-05,7.2e-05,1.6e-05,4.9e-05,3.8e-05,2.2e-05,5.6e-05,2.2e-05,2.9e-05,1.3e-05,2.5e-05,3.3e-05,2.3e-05,1.1e-05,2.9e-05,4.3e-05,1.8e-05,6.8e-05,2.1e-05,2.2e-05,3.2e-05,3.9e-05,2e-05,3.3e-05,2.9e-05
1.7e-05,3.6e-05,1e-06,6e-06,4.2e-05,1.5e-05,1.7e-05,2e-05,8e-06,4.3e-05,6e-06,1.8e-05,6e-06,2.2e-05,1.6e-05,1.3e-05,2.9e-05,2.9e-05,2.3e-05,2.2e-05,2.1e-05,1.3e-05,2e-05,1.7e-05,1.1e-05,3.7e-05,2.5e-05,3.6e-05,2.3e-05,3e-06,1.7e-05,3.1e-05,8e-06,1.6e-05,1.3e-05,2.7e-05,2.4e-05,2e-05,1.9e-05,2.1e-05,3.5e-05,1.6e-05,7e-06,3.1e-05,5e-06,2.5e-05,2.3e-05,3.8e-05,1.2e-05,2.1e-05,3.9e-05,1.4e-05,3.2e-05,4.8e-05,3.3e-05,2.4e-05,2.5e-05,1e-05,1.1e-05,4.4e-05,1.6e-05,3.1e-05,4.1e-05,2e-05,1e-05,1.7e-05,8e-06,3.5e-05,3.1e-05,3.3e-05,1e-05,1.9e-05,5e-06,3.2e-05,2.1e-05,1.7e-05,2.3e-05,4.3e-05,9e-06,1.5e-05,1.4e-05,1.6e-05,1.3e-05,9e-06,1e-05,6e-06,3.3e-05,2.9e-05,2.5e-05,3.9e-05,9e-06,3.2e-05,1.2e-05,2.7e-05,1.1e-05,1.4e-05,4.4e-05,3.1e-05,7e-06,2.4e-05,1.6e-05,1.5e-05,7e-06,2.3e-05,1.8e-05,1.4e-05,8e-06,2.1e-05,1.4e-05,3e-05,3e-06,2.8e-05,1.9e-05,4.2e-05,9e-06,8e-06,4.4e-05,7e-06,2e-06,3.2e-05,2e-05
1.5e-05,1.3e-05,7e-06,2.7e-05,4.8e-05,3.8e-05,2.5e-05,2.8e-05,1.4e-05,1.8e-05,4e-06,2e-05,1e-05,3.1e-05,3e-05,3.9e-05,3e-05,3.9e-05,5e-06,2e-06,2.1e-05,1e-05,1.4e-05,1.8e-05,2.1e-05,2.3e-05,1.6e-05,3.2e-05,1.1e-05,1.2e-05,1.4e-05,1.8e-05,4e-06,5e-06,2.8e-05,1.7e-05,1.5e-05,3.7e-05,2.2e-05,0,3.6e-05,1.7e-05,1.6e-05,4e-05,1.7e-05,1.5e-05,1.8e-05,1.4e-05,1.5e-05,2.3e-05,2.2e-05,1.4e-05,2.3e-05,2e-05,9e-06,1.8e-05,1.4e-05,2e-06,2.4e-05,2.6e-05,2e-05,2.7e-05,1.9e-05,1.2e-05,1.6e-05,1.2e-05,1.3e-05,3.5e-05,1.6e-05,1e-05,7e-06,3e-05,2e-05,3.1e-05,2e-05,2.5e-05,1.1e-05,1.9e-05,1.7e-05,1.9e-05,3e-05,3.2e-05,7e-06,2.1e-05,1.8e-05,1.4e-05,2.4e-05,1.2e-05,1.7e-05,2.1e-05,1.5e-05,1.4e-05,6e-06,1.3e-05,1.3e-05,2.7e-05,1.9e-05,9e-06,8e-06,1.4e-05,1.7e-05,1.7e-05,2.4e-05,3.3e-05,2.2e-05,2.3e-05,8e-06,1.7e-05,2.3e-05,1.1e-05,1.6e-05,1.3e-05,3e-06,3.2e-05,2.5e-05,2e-05,3.6e-05,1.7e-05,2e-06,2.6e-05,1.2e-05
1.8e-05,2.5e-05,1.2e-05,3.1e-05,6e-05,3.8e-05,2.1e-05,1.8e-05,2.2e-05,7e-06,3e-05,2.7e-05,1e-05,3.7e-05,1.5e-05,2.1e-05,9e-06,5.2e-05,2e-05,9e-06,1.2e-05,1.3e-05,1.6e-05,9e-06,2.4e-05,1.2e-05,4e-06,2.3e-05,1.9e-05,1.5e-05,2.9e-05,2.8e-05,4e-06,8e-06,2.2e-05,2.7e-05,2.7e-05,2.2e-05,1.6e-05,1.1e-05,3.1e-05,6e-06,1.7e-05,4.1e-05,1.3e-05,2.1e-05,1.3e-05,9e-06,1.1e-05,2.6e-05,2.6e-05,5e-06,2e-05,5e-06,9e-06,2.1e-05,1e-05,1.5e-05,2.8e-05,1.5e-05,1.6e-05,1e-06,1.9e-05,2.2e-05,3e-06,2.4e-05,1.2e-05,1.8e-05,2e-05,2.7e-05,1.2e-05,3.9e-05,1.3e-05,7e-06,1.4e-05,7e-06,8e-06,1.6e-05,2.3e-05,1.9e-05,1.6e-05,6e-06,1e-05,5e-06,2.7e-05,2.9e-05,1.5e-05,2.6e-05,7e-06,1.1e-05,1.7e-05,6e-06,6e-06,1.1e-05,6e-06,1.1e-05,8e-06,2.2e-05,8e-06,1.8e-05,3.1e-05,5e-06,1.8e-05,4.7e-05,3e-05,4e-06,6e-06,8e-06,7e-06,9e-06,1.6e-05,1.2e-05,1e-05,3e-05,3.8e-05,1.8e-05,1.6e-05,1.3e-05,4e-06,6e-06,1.1e-05
1.8e-05,2e-06,7e-06,3e-05,1.8e-05,2.5e-05,3e-06,5e-06,1.4e-05,2.4e-05,2.2e-05,2.2e-05,1.5e-05,4.5e-05,3.6e-05,1.6e-05,2.3e-05,3.5e-05,5e-06,1.3e-05,1.2e-05,2.6e-05,3.1e-05,1.1e-05,7e-06,2e-06,1.2e-05,2.2e-05,6e-06,2e-06,1.7e-05,1.4e-05,1.5e-05,1.1e-05,1.9e-05,7e-06,1.5e-05,2.1e-05,2e-05,3.2e-05,3.8e-05,6e-06,2e-06,2.5e-05,1.9e-05,1.9e-05,1.9e-05,1e-05,1e-05,1.8e-05,1.7e-05,2.3e-05,1.1e-05,5e-06,1.6e-05,1e-05,1.3e-05,2.5e-05,2.5e-05,8e-06,7e-06,1.2e-05,3.1e-05,5e-06,6e-06,1.7e-05,1.4e-05,2e-05,1.6e-05,8e-06,1e-05,3e-05,2.1e-05,1.2e-05,1.3e-05,3.1e-05,1.1e-05,2.5e-05,1.4e-05,2.5e-05,1e-05,7e-06,9e-06,8e-06,9e-06,1.4e-05,6e-06,2.4e-05,2.1e-05,2.2e-05,9e-06,1.3e-05,3e-06,1.1e-05,1e-05,8e-06,2.6e-05,7e-06,5e-06,1.8e-05,9e-06,2e-05,2.1e-05,3.1e-05,2e-05,1.5e-05,1e-05,1.6e-05,1.1e-05,1.8e-05,2.3e-05,1e-05,1.1e-05,1.8e-05,2.6e-05,1.3e-05,9e-06,2.2e-05,1.1e-05,1.1e-05,3e-05
9e-06,2e-05,1.1e-05,3e-05,3e-05,3.8e-05,1.6e-05,1.5e-05,1.2e-05,2.8e-05,2e-06,2.7e-05,6e-06,1.6e-05,1.5e-05,2.2e-05,2.6e-05,4.7e-05,1.8e-05,1.9e-05,1.6e-05,3.6e-05,2.8e-05,4.5e-05,2.1e-05,1.8e-05,1e-06,1.1e-05,1.3e-05,7e-06,9e-06,1.3e-05,1.7e-05,1.5e-05,1.9e-05,9e-06,1.5e-05,1.6e-05,1.2e-05,1.8e-05,3e-06,2.5e-05,2.3e-05,2.7e-05,1.5e-05,7e-06,7e-06,1.9e-05,1.1e-05,1.4e-05,1.3e-05,1.3e-05,1.6e-05,6e-06,1.8e-05,1.6e-05,1.4e-05,1.5e-05,2.9e-05,2e-05,6e-06,1e-05,2.5e-05,1.2e-05,8e-06,1.4e-05,1.8e-05,2.2e-05,5e-06,2e-05,1.7e-05,1.8e-05,9e-06,2e-05,1.1e-05,2.5e-05,2.3e-05,3.8e-05,1.8e-05,1.7e-05,8e-06,5e-06,1.6e-05,2.1e-05,1.5e-05,1.1e-05,3e-05,3.5e-05,3.3e-05,1.6e-05,9e-06,1.3e-05,5e-06,1.5e-05,1.8e-05,1.3e-05,2.8e-05,1.7e-05,1.4e-05,2.1e-05,1.2e-05,2e-05,1.4e-05,2.1e-05,1.2e-05,1e-05,2e-06,1.4e-05,2.6e-05,3e-06,1.3e-05,1e-05,1.4e-05,1.5e-05,1.6e-05,2.1e-05,2.5e-05,1.7e-05,1.2e-05,1.7e-05,1.4e-05
7e-06,1e-05,2e-06,1.6e-05,2.6e-05,2.4e-05,1.7e-05,2.7e-05,1.3e-05,6e-06,1.6e-05,3.3e-05,4.2e-05,3e-05,3e-05,1.5e-05,2.4e-05,5.1e-05,8e-06,3.5e-05,3e-05,2.2e-05,1.1e-05,4.9e-05,2e-05,3e-05,9e-06,5e-06,1.1e-05,1.2e-05,1.4e-05,1.7e-05,3.2e-05,9e-06,3.5e-05,8e-06,1.2e-05,8e-06,2e-05,1.1e-05,1.1e-05,1.7e-05,1.5e-05,2.8e-05,1.7e-05,7e-06,1.1e-05,2.6e-05,1.6e-05,3.5e-05,8e-06,3.3e-05,8e-06,1.6e-05,1.7e-05,2e-05,2.6e-05,1.6e-05,2.9e-05,5e-06,2.4e-05,8e-06,1.9e-05,2.4e-05,3e-05,6e-06,2.1e-05,2.6e-05,2.4e-05,2.9e-05,2.9e-05,1.5e-05,8e-06,1e-05,1.1e-05,2.2e-05,2.5e-05,1.9e-05,9e-06,1.4e-05,1.3e-05,1.9e-05,2e-05,2e-05,1.7e-05,4e-06,1.1e-05,2.2e-05,8e-06,5e-06,1.1e-05,5e-06,1.3e-05,1.1e-05,6e-06,1e-05,2e-05,8e-06,9e-06,1.8e-05,4e-06,2.3e-05,2e-06,2e-06,1.5e-05,1.3e-05,1.9e-05,1.1e-05,2.2e-05,1.4e-05,2e-06,1e-06,9e-06,1.3e-05,6e-06,1.4e-05,1.9e-05,8e-06,1.3e-05,1.4e-05,2.1e-05
2.7e-05,2.8e-05,2.7e-05,1e-05,3e-05,5.9e-05,3e-05,4.5e-05,2.5e-05,2e-06,2.9e-05,3.6e-05,2.7e-05,1.2e-05,2.7e-05,1.3e-05,1.2e-05,3.6e-05,6.2e-05,6.1e-05,1.4e-05,1.8e-05,1.3e-05,3.7e-05,1.8e-05,4.4e-05,2.3e-05,7e-06,1.8e-05,2e-05,2.2e-05,3.4e-05,1.7e-05,2e-05,4.2e-05,4.7e-05,1.6e-05,8e-06,1.1e-05,1e-05,2.8e-05,2.3e-05,3e-05,2e-05,2.8e-05,1.8e-05,1.4e-05,2.2e-05,2.2e-05,5e-05,3.9e-05,4.1e-05,4.4e-05,5.4e-05,3.8e-05,6e-06,3.8e-05,3.1e-05,1.2e-05,9e-06,3.8e-05,3.7e-05,4e-05,3.2e-05,4e-05,4.2e-05,3.1e-05,1.2e-05,3.5e-05,2.5e-05,6.1e-05,1.8e-05,5e-06,2.5e-05,2e-05,3.6e-05,3.4e-05,3.4e-05,2.5e-05,2.9e-05,2e-05,1.7e-05,3.3e-05,3.7e-05,3.4e-05,1.4e-05,2e-05,5e-06,2.5e-05,1e-05,4e-06,6e-06,1.4e-05,8e-06,2.3e-05,8e-06,1.5e-05,4e-06,1.5e-05,2.7e-05,2.7e-05,4.8e-05,4.9e-05,2.1e-05,2.5e-05,4.1e-05,3.1e-05,3.4e-05,1.3e-05,2.7e-05,1.5e-05,8e-06,1.8e-05,1.2e-05,3.3e-05,3.8e-05,2.7e-05,3.7e-05,3e-06,2.2e-05,3.9e-05
5.3e-05,6.5e-05,3.3e-05,3.4e-05,5.9e-05,8.5e-05,0.000104,0.000128,8.9e-05,5.5e-05,6.1e-05,3e-05,1.1e-05,1.8e-05,1.6e-05,2e-05,4.2e-05,4.8e-05,7.7e-05,6.6e-05,7.9e-05,7.4e-05,4.3e-05,2.8e-05,1.3e-05,3.9e-05,5.1e-05,4.3e-05,2.9e-05,2e-05,3.1e-05,1.3e-05,2.8e-05,2.4e-05,2.5e-05,6e-05,4.9e-05,1.6e-05,9e-06,1.8e-05,1.4e-05,5e-06,3.9e-05,6.3e-05,6.2e-05,5.9e-05,4.3e-05,4.8e-05,3.2e-05,5.8e-05,6.1e-05,7.9e-05,5.4e-05,3.4e-05,6.2e-05,7.5e-05,5.7e-05,2.8e-05,1.6e-05,6e-06,4.1e-05,6.2e-05,2.1e-05,3.4e-05,2.1e-05,2.7e-05,1.5e-05,4.4e-05,5.8e-05,7e-05,9.9e-05,8.8e-05,4.5e-05,3.8e-05,2.5e-05,4e-05,5.7e-05,4.6e-05,5.3e-05,2.2e-05,6e-06,3.3e-05,6.3e-05,8.1e-05,6.6e-05,5.2e-05,5.2e-05,2.9e-05,4.3e-05,3.2e-05,1.2e-05,1e-05,1.4e-05,1.5e-05,2.5e-05,3.4e-05,2.9e-05,1.2e-05,2.4e-05,2.5e-05,1.6e-05,6.2e-05,6.7e-05,7e-05,4.4e-05,4.7e-05,3.3e-05,2.8e-05,1.3e-05,2.9e-05,3.9e-05,2.1e-05,1e-05,1.9e-05,2.9e-05,4.5e-05,3.4e-05,4e-05,4e-05,3.1e-05,7.2e-05
1.2e-05,4e-05,7e-06,2.4e-05,3.6e-05,1.4e-05,5.5e-05,3.7e-05,1.2e-05,4.2e-05,2.6e-05,2.2e-05,2.6e-05,1.9e-05,1.9e-05,2.4e-05,3.3e-05,3.6e-05,1.1e-05,2.7e-05,5e-05,1.8e-05,1.7e-05,2.2e-05,5e-06,3e-05,1.3e-05,1.8e-05,5e-06,2.9e-05,2.9e-05,3.2e-05,1.1e-05,7e-06,1.6e-05,2.7e-05,1.5e-05,9e-06,8e-06,2e-06,7e-06,1.3e-05,2.1e-05,2.2e-05,3.6e-05,3e-05,2.8e-05,1.9e-05,1.3e-05,2.5e-05,1.7e-05,2.6e-05,1.4e-05,3.7e-05,2.2e-05,2.7e-05,1.2e-05,5e-06,1.3e-05,1.2e-05,3.1e-05,7e-06,1.5e-05,1.7e-05,3.1e-05,1.2e-05,9e-06,3.7e-05,1.3e-05,3.9e-05,3.3e-05,1.6e-05,9e-06,3.7e-05,1.4e-05,1.6e-05,2.2e-05,8e-06,1e-05,3e-06,1.2e-05,2e-05,3.8e-05,1e-05,2.2e-05,2.4e-05,8e-06,1.4e-05,2.2e-05,7e-06,5e-06,1.1e-05,1.3e-05,8e-06,2.2e-05,2.4e-05,1.2e-05,8e-06,1.3e-05,6e-06,2.2e-05,4.9e-05,9e-06,1.7e-05,2.3e-05,1e-05,2.8e-05,1.6e-05,8e-06,2.6e-05,2.4e-05,2e-05,6e-06,2.6e-05,1.5e-05,2.1e-05,7e-06,2.4e-05,2.2e-05,2.4e-05,3.4e-05
1.5e-05,1.2e-05,7e-06,1.3e-05,1.3e-05,2.2e-05,2.2e-05,2.3e-05,1.5e-05,1.5e-05,2.1e-05,1.5e-05,6e-06,6e-06,4e-06,9e-06,2.4e-05,1.7e-05,5e-06,7e-06,3e-05,1.9e-05,1.2e-05,6e-06,1.4e-05,3e-06,8e-06,1.5e-05,9e-06,1.5e-05,3e-06,7e-06,2e-06,5e-06,1.1e-05,6e-06,5e-06,7e-06,8e-06,1.7e-05,1.8e-05,1.5e-05,5e-06,1.3e-05,1.5e-05,1.8e-05,8e-06,2.2e-05,4e-06,1.4e-05,6e-06,1.2e-05,5e-06,1.7e-05,2e-06,2.3e-05,3e-06,1e-05,3e-06,3e-06,1.4e-05,1.6e-05,1.6e-05,9e-06,1.8e-05,2e-06,6e-06,1.6e-05,1.1e-05,2e-05,1.1e-05,1.2e-05,9e-06,1.3e-05,1.3e-05,1.2e-05,1.2e-05,9e-06,8e-06,4e-06,1e-05,2.2e-05,1.6e-05,8e-06,1.6e-05,2.2e-05,2.1e-05,4e-06,8e-06,1.1e-05,6e-06,7e-06,3e-06,6e-06,1.3e-05,8e-06,9e-06,6e-06,9e-06,1e-06,2.7e-05,2.3e-05,1.3e-05,6e-06,8e-06,7e-06,1.1e-05,1e-05,8e-06,9e-06,1e-05,1e-05,6e-06,1.7e-05,1.1e-05,6e-06,7e-06,1.3e-05,4e-06,3e-06,2.1e-05
1.4e-05,1.6e-05,6e-06,1.1e-05,3e-06,1.3e-05,1.4e-05,8e-06,1.1e-05,1.2e-05,1.5e-05,7e-06,6e-06,5e-06,4e-06,1.2e-05,1.4e-05,1.8e-05,2e-06,4e-06,1.6e-05,1.3e-05,5e-06,8e-06,1.2e-05,3e-06,6e-06,1.3e-05,1e-05,1.2e-05,2e-06,9e-06,4e-06,3e-06,4e-06,2e-06,5e-06,1.1e-05,4e-06,1.1e-05,1.7e-05,1e-05,5e-06,1.3e-05,1e-05,1.6e-05,1.2e-05,1.7e-05,2e-06,6e-06,8e-06,8e-06,3e-06,1.1e-05,3e-06,1.7e-05,3e-06,1.1e-05,8e-06,3e-06,7e-06,1.2e-05,1.5e-05,8e-06,1.1e-05,4e-06,2e-06,7e-06,9e-06,1.4e-05,7e-06,9e-06,8e-06,1e-06,8e-06,6e-06,1e-05,9e-06,7e-06,7e-06,7e-06,1e-05,9e-06,6e-06,1.2e-05,1.7e-05,1.5e-05,6e-06,5e-06,7e-06,4e-06,3e-06,3e-06,7e-06,5e-06,1.2e-05,6e-06,6e-06,5e-06,3e-06,1.9e-05,2.2e-05,1.4e-05,5e-06,7e-06,3e-06,4e-06,7e-06,5e-06,5e-06,7e-06,9e-06,4e-06,1.5e-05,6e-06,7e-06,8e-06,8e-06,4e-06,3e-06,1.5e-05
1.1e-05,1.2e-05,5e-06,1.1e-05,3e-06,1.1e-05,1.1e-05,6e-06,9e-06,1.3e-05,1.3e-05,7e-06,8e-06,4e-06,7e-06,1.2e-05,1.6e-05,1.8e-05,3e-06,3e-06,1.5e-05,1.2e-05,6e-06,9e-06,1.2e-05,2e-06,4e-06,1.2e-05,8e-06,5e-06,1e-06,6e-06,1e-06,1e-06,4e-06,4e-06,4e-06,8e-06,5e-06,9e-06,1.4e-05,9e-06,3e-06,1.2e-05,9e-06,1.2e-05,1.1e-05,1.8e-05,5e-06,3e-06,6e-06,2e-06,2e-06,7e-06,2e-06,1.6e-05,2e-06,1e-05,7e-06,1e-06,4e-06,1.1e-05,1.6e-05,7e-06,9e-06,4e-06,2e-06,9e-06,7e-06,1.1e-05,2e-06,5e-06,4e-06,5e-06,8e-06,5e-06,6e-06,9e-06,7e-06,6e-06,3e-06,1.1e-05,9e-06,1e-06,1.2e-05,1.5e-05,1.3e-05,4e-06,1e-06,7e-06,3e-06,2e-06,1e-06,9e-06,6e-06,1.1e-05,5e-06,4e-06,4e-06,3e-06,1.8e-05,1.9e-05,1e-05,9e-06,9e-06,3e-06,7e-06,4e-06,5e-06,4e-06,2e-06,5e-06,1e-06,1.5e-05,4e-06,7e-06,4e-06,7e-06,1e-06,2e-06,1.3e-05
1e-05,1.1e-05,4e-06,9e-06,1e-06,8e-06,9e-06,4e-06,1e-05,1.1e-05,1.3e-05,7e-06,1e-05,2e-06,6e-06,1.1e-05,1.6e-05,1.8e-05,3e-06,3e-06,1.4e-05,1e-05,3e-06,1e-05,1.1e-05,2e-06,3e-06,1.2e-05,6e-06,6e-06,3e-06,6e-06,2e-06,1e-06,3e-06,3e-06,5e-06,3e-06,5e-06,9e-06,1.3e-05,8e-06,2e-06,1.3e-05,8e-06,1e-05,1e-05,1.9e-05,1e-06,3e-06,3e-06,3e-06,2e-06,4e-06,2e-06,1.5e-05,3e-06,9e-06,7e-06,1e-06,3e-06,1.1e-05,1.6e-05,8e-06,1e-05,5e-06,1e-06,9e-06,7e-06,8e-06,1e-06,6e-06,4e-06,3e-06,6e-06,3e-06,8e-06,7e-06,6e-06,7e-06,4e-06,9e-06,1e-05,3e-06,1.1e-05,1.5e-05,1.1e-05,3e-06,2e-06,7e-06,1e-06,0,2e-06,9e-06,4e-06,1.1e-05,5e-06,5e-06,4e-06,1e-06,1.7e-05,1.9e-05,8e-06,6e-06,7e-06,4e-06,5e-06,3e-06,6e-06,4e-06,3e-06,7e-06,1e-06,1.4e-05,3e-06,6e-06,4e-06,6e-06,1e-06,1e-06,1.3e-05
