-0.115319,-0.128702,-0.121588,-0.117501,-0.114059,-0.099503,-0.086728,-0.088199,-0.097317,-0.140601,-0.102106,-0.037329,-0.02822,-0.035841,-0.048153,-0.03489,-0.037823,-0.030674,-0.035555,-0.033962,-0.035388,-0.021385,-0.022457,-0.042495,-0.056756,-0.035908,-0.03779,-0.037399
-0.057131,-0.069296,-0.033757,-0.057202,-0.065512,-0.045233,-0.066942,-0.086875,-0.094009,-0.131749,-0.102548,-0.036412,-0.028558,-0.039702,-0.056627,-0.039872,-0.038909,-0.036202,-0.039699,-0.039483,-0.042353,-0.023617,-0.02604,-0.048258,-0.072799,-0.040532,-0.0403,-0.044282
0.001722,0.002312,0.007152,-0.010166,-0.005289,0.004888,-0.019139,-0.039979,-0.039574,-0.016612,-0.011464,-0.010398,-0.011602,-0.010911,-0.012078,-0.006566,-0.003587,-0.008428,-0.002998,-0.00392,-0.006701,-0.007935,-0.011675,-0.016235,-0.022791,-0.010152,-0.008759,-0.009079
0.0189,0.016901,-0.014845,0.007306,0.021798,0.017112,0.034014,0.029844,0.035343,0.089763,0.072976,0.017023,0.008996,0.021405,0.038122,0.028512,0.028634,0.02254,0.029329,0.026326,0.029332,0.010895,0.00606,0.024338,0.04352,0.025635,0.02633,0.030756
0.061207,0.066802,0.06468,0.088728,0.071636,0.056423,0.079258,0.096464,0.100328,0.118306,0.086514,0.033862,0.030181,0.034494,0.046051,0.030692,0.027294,0.02515,0.025366,0.02667,0.032306,0.01864,0.018768,0.040674,0.061194,0.035771,0.034457,0.034785
0.020511,0.03759,0.063058,0.059458,0.031778,0.018336,0.015848,0.042464,0.033965,-0.002515,-0.003991,0.007186,0.011879,0.005495,-0.002914,-0.007329,-0.010455,-0.006084,-0.009013,-0.000929,-0.002358,0.002123,0.01061,0.006157,0.00373,0.001875,-0.000964,-0.005251
-0.051374,-0.062269,-0.076943,-0.087237,-0.07298,-0.060541,-0.063992,-0.057132,-0.061686,-0.116504,-0.082328,-0.020814,-0.015833,-0.023602,-0.037094,-0.028368,-0.0283,-0.023146,-0.026968,-0.024172,-0.031412,-0.014184,-0.006071,-0.029533,-0.047355,-0.030862,-0.030183,-0.033741
-0.023385,-0.047813,-0.065751,-0.084614,-0.059815,-0.031231,-0.036087,-0.056146,-0.041665,-0.059145,-0.046225,-0.014412,-0.014105,-0.014437,-0.017516,-0.006897,-0.000763,-0.002242,-0.005543,-0.012431,-0.015508,-0.005961,-0.005632,-0.014601,-0.028907,-0.017826,-0.014276,-0.014001
0.019293,0.029464,0.050168,0.033931,0.034762,0.030568,0.009546,-0.014029,-0.000761,0.049815,0.024852,-0.003652,-0.00682,-0.00115,0.008488,0.013023,0.016199,0.014388,0.017215,0.008586,0.012628,0.006251,-0.002156,0.009932,0.014796,0.010568,0.011186,0.016207
0.003057,0.031515,0.040221,0.065424,0.063988,0.023355,0.024523,0.020445,0.008102,0.071647,0.054338,0.006723,0.002143,0.009683,0.019889,0.015913,0.0138,0.015716,0.017159,0.012952,0.021225,0.008608,-0.002043,0.014908,0.034683,0.02217,0.019884,0.02565
-0.011624,-0.005724,-0.02338,0.012975,0.010956,-0.001176,0.029024,0.043087,0.018032,0.016658,0.027005,0.013608,0.014052,0.010503,0.009878,0.001494,-0.004152,-0.002515,-0.003953,0.000749,0.005102,0.0014,-0.002408,0.001243,0.011081,0.005699,0.005111,0.006297
0.011199,-0.005642,0.00289,-0.01212,-0.028682,-0.001196,0.00285,0.019385,0.006107,-0.047374,-0.024033,0.005326,0.010245,0.002379,-0.00874,-0.014986,-0.017992,-0.021067,-0.017815,-0.005234,-0.013816,-0.007304,0.001785,-0.011253,-0.022967,-0.015054,-0.014671,-0.0214
0.021583,-0.006541,0.006048,-0.027986,-0.030062,-0.010524,-0.033153,-0.025791,-0.008221,-0.050907,-0.042652,-0.008005,-0.00734,-0.008287,-0.013873,-0.012879,-0.009958,-0.014048,-0.011243,-0.002611,-0.01444,-0.007654,0.004959,-0.011127,-0.027664,-0.015515,-0.016071,-0.024897
-0.015298,-0.027997,-0.047167,-0.045312,-0.027551,-0.018971,-0.022656,-0.028338,0.008473,0.00494,-0.015941,-0.011591,-0.011923,-0.007494,-0.0042,0.003624,0.009443,0.007831,0.004857,-0.001773,0.000243,-4e-04,0.00125,0.001147,-0.001473,0.001442,0.001335,0.003104
-0.026733,-0.000617,-0.0068,0.007964,0.006636,0.002799,0.011794,-0.004686,0.013194,0.055369,0.026989,-0.002142,-0.003347,-0.000218,0.006959,0.013237,0.014264,0.019306,0.015991,0.001576,0.014638,0.007637,-0.000522,0.01577,0.026411,0.015403,0.01519,0.025803
0.014553,0.050389,0.060154,0.068073,0.056619,0.021831,0.022058,0.011118,-0.012617,0.040687,0.040964,0.010575,0.005194,0.005401,0.010848,0.008979,0.004753,0.010238,0.011382,0.003259,0.008878,0.006443,-0.001602,0.008307,0.021547,0.011171,0.013137,0.017561
0.018356,0.023839,0.020248,0.02894,0.0295,0.00725,0.0102,0.023453,-0.020102,-0.031997,-0.000628,0.008952,0.009657,0.005961,0.002541,-0.001758,-0.00595,-0.007611,-0.005405,-0.000541,-0.007255,-0.002243,-0.004174,-0.008016,-0.007433,-0.006309,-0.005002,-0.010016
-0.018699,-0.04605,-0.038944,-0.046548,-0.045806,-0.012743,-0.009941,0.003331,-0.013546,-0.07095,-0.046909,-0.007819,0.001399,-0.002046,-0.010952,-0.012479,-0.013272,-0.017505,-0.017519,-0.004646,-0.014787,-0.008786,-0.003283,-0.010443,-0.021892,-0.017016,-0.019052,-0.027124
0.003133,-0.0296,-0.010057,-0.040147,-0.042708,-0.009738,-0.015913,-0.02074,0.007808,-0.007451,-0.017209,-0.009714,-0.008516,-0.004126,-0.007278,-0.007028,-0.000141,-0.003676,-0.008911,0.001015,-0.001073,-0.002357,0.006112,0.000132,-0.008834,-0.004222,-0.006578,-0.010028
