-0.001165,-0.001782,-0.002257,-0.001465,-0.001527,-0.001164,-0.001297,-0.000561,-0.002626,-0.00258,-0.001112,-0.004075,-0.002439,-0.004255,-0.002049,-0.001794,-0.004177,-0.007672,-0.006487,-0.003985,-0.002348,-0.001864,-0.001655,-0.002374,-0.003066,-0.000828,-0.006523,-0.005805,-0.004384,-0.004262,-0.004085,-0.002872,-0.000915,-0.002306,-0.00418,-0.002922,-0.003739,-0.004552,-0.006363,-0.00495,-0.005327,-0.005091,-0.002847,-0.006044,-0.004371,-0.004582,-0.004147,-0.006792,-0.006997,-0.002268,-0.005668,-0.004396,-0.002358,-0.005437,-0.005046,-0.007024,-0.00536,-0.005742,-0.00387,-0.008624,-0.008078,-0.003824,-0.005934,-0.005619,-0.004403,-0.003356,-0.010758,-0.007597,-0.007775,-0.006291,-0.006298,-0.004681,-0.004709,-0.006484,-0.003513,-0.003269,-0.00315,-0.001757,-0.006974,-0.005876,-0.006863,-0.003304,-0.005554,-0.004331,-0.007528,-0.00435,-0.004837,-0.007915,-0.006048,-0.002185,0.000594,9.2e-05,-0.004886,-0.006431,-0.005844,-0.005471,-0.005464,-0.008375,-0.008179,-0.004655,-0.002763,-0.003609,-0.00273,-0.000283,-0.002453,-0.004026,-0.004378,-0.005427,-0.004853,-0.004015,-0.00405,-0.00569,-0.002013,-0.006833,-0.00738,-0.004282,-0.005352,-0.006502,-0.005116,-0.000512,-0.002847
0.000637,0.000351,0.001005,0.000128,0.001081,-0.003946,-0.002301,-0.001371,-0.000354,0.000351,0.000449,0.00042,-0.001024,0.000235,-0.000617,4.8e-05,-0.000981,0.001773,0.000598,0.001159,0.00133,0.000513,-0.001261,0.000311,0.000886,0.000152,0.00137,0.001883,0.001918,0.001298,0.002033,0.001252,-0.000414,-0.000498,-2.8e-05,0.000317,0.001117,0.000867,0.001025,0.001683,-0.000202,8.9e-05,-0.000399,0.002216,2.7e-05,0.00014,-0.001963,0.000455,0.001516,-0.001669,-0.000629,-0.002219,-0.001202,0.001475,0.000162,0.002384,0.000497,0.000977,0.001278,0.001049,0.000266,-0.001632,0.000921,0.001534,-5.3e-05,-0.001516,0.001914,-0.001056,0.001616,0.002216,-4.5e-05,0.001403,-0.000954,0.000778,-0.000628,-0.000401,-0.002823,-0.001424,-0.003677,-0.001398,0.000228,0.000958,0.00158,0.000958,0.002106,0.001418,0.001156,0.002398,-0.000182,-0.00243,-0.00385,-0.006817,-0.004457,0.000367,-0.003349,-0.000211,-0.000885,0.001332,0.002568,-0.002166,-0.001565,-0.002094,-0.001417,-0.00157,-0.003367,-0.001606,-0.000396,0.000876,0.001356,0.001459,-0.001569,-0.001514,-0.003337,0.00339,0.002317,-0.000949,-0.001208,-8.4e-05,0.000535,-0.002015,-0.002368
-0.000584,-0.000379,-0.000617,-0.001071,-0.000736,0.001365,0.000954,0.001325,-0.000567,-0.000906,-0.000205,-0.00036,-0.001558,-0.00019,-0.000359,-0.000278,-0.002208,-0.00503,-0.001996,-0.001512,-0.001557,-0.001436,0.000959,0.000228,-0.00099,-0.001651,-0.00087,-0.00218,-0.001174,-0.001231,-0.001342,-0.000511,-0.001229,-1.9e-05,0.000629,7.5e-05,-0.000674,-0.000934,-0.002546,-0.00102,0.000407,0.00013,0.001298,-0.002191,-0.000553,0.000127,0.001379,3.3e-05,-0.000797,0.001171,-0.001582,0.00151,0.000276,-0.001422,0.001385,-0.000826,-0.000472,-0.001647,-0.002104,0.00031,-0.000255,-0.000886,0.001025,-0.000909,0.000418,0.001746,9.6e-05,0.001751,-0.001847,-0.000223,-0.000148,-0.002378,0.000755,-0.000558,0.001231,-0.000288,0.002013,-0.000545,0.001166,0.002246,0.000856,-0.001459,-0.001155,-0.000993,-0.000947,-0.001181,-0.000676,2.1e-05,0.000567,-0.001048,0.000124,0.000815,0.003433,0.000351,0.001024,0.000216,-0.000266,-0.001159,-0.00043,0.000277,-0.001454,-0.000433,0.001707,0.000544,0.001773,0.000724,0.000488,-0.001877,-0.000886,-0.001508,-0.000404,0.001284,0.000261,-0.002346,-0.00235,-0.003611,-0.000334,-0.000987,-0.001708,-0.000136,1.5e-05
0.000697,0.00053,0.00079,0.001486,0.000425,0.00071,0.001741,0.000217,0.00094,0.001204,0.000115,-0.000184,0.002915,0.001662,0.000586,-0.00028,0.000804,0.006328,0.004272,0.002744,0.001601,0.000383,-0.000335,0.000844,0.00119,0.001508,0.001795,0.002558,0.001644,0.001008,0.001404,0.000483,0.000383,-0.000699,-2.7e-05,-0.000528,5.1e-05,0.001919,0.002977,0.001597,0.001161,0.001825,-0.00082,0.00176,0.001863,-4.4e-05,0.001209,0.000758,0.001136,0.000707,0.003092,0.000294,0.00083,0.000596,-0.000638,0.000837,0.003012,0.003585,0.002447,0.001607,0.001213,0.002044,-0.001068,-0.000516,0.001359,0.000564,0.001791,0.00124,0.001194,-0.000609,0.000527,0.003363,0.001216,0.002987,0.000231,0.000407,0.001592,0.002536,0.003543,0.002062,0.000516,-0.000226,0.001591,0.001782,0.000824,-0.000406,0.002341,-0.00043,0.001178,0.003466,0.003721,0.003491,-0.001193,0.000476,0.002777,0.003106,0.002595,0.003847,-0.000336,0.002023,0.00323,0.002237,0.00058,-4e-06,0.001082,0.000575,-0.000419,0.0014,7.4e-05,0.000903,-0.000493,-0.000181,0.000493,0.001952,0.002783,0.003756,0.001237,0.002392,0.000768,0.00194,0.001952
-0.000661,-0.000397,-0.001031,-0.000822,0.000132,-0.000149,-0.001866,-0.001477,-0.000919,-0.001192,-0.000724,-5.7e-05,-0.001404,-0.001139,-0.001105,-4.1e-05,0.000616,-0.004933,-0.005385,-0.003191,-0.00135,-0.000419,-0.000421,-0.001145,-0.000877,-0.000625,-0.001469,-0.002068,-0.001701,0.000247,-0.000597,-0.000187,0.00041,0.000594,-0.000831,0.000163,0.000519,-0.001474,-0.000582,-0.002594,-0.001347,-0.000663,-0.000678,-0.000642,-0.00138,-0.000566,-0.001063,-0.001131,-0.002324,-0.001821,-0.001225,-0.002731,-0.001483,-0.001053,0.000185,-0.001671,-0.002642,-0.002751,-0.002229,-0.002285,-0.003374,-0.002327,-0.000802,1.1e-05,-0.002333,-0.00049,-0.002206,-0.003263,-0.000539,0.000584,-0.001924,-0.002033,-0.001086,-0.002787,-0.002091,-0.002284,-0.002081,-0.002455,-0.003589,-0.003956,-0.001866,0.001403,-0.002089,-0.000995,0.000384,0.001557,-0.001098,-0.000603,-0.002214,-0.002204,-0.001707,-0.003396,0.001523,-6.7e-05,-0.002288,-0.002167,-0.002125,-0.0032,0.000858,-0.001076,-2e-04,-0.001011,-0.000981,0.000581,-0.001071,6.4e-05,0.000522,-0.000111,-0.000266,-2e-06,0.002183,-0.000873,0.00026,-0.000878,-0.00213,-0.001323,-0.002157,-0.001846,-0.000166,-0.001222,0.000783
0.000457,0.000462,0.000329,0.000232,-0.000247,-0.000512,-3.9e-05,0.00045,0.000793,0.00097,-2e-06,0.000707,0.000563,0.001015,0.001423,0.00021,-0.000375,9.1e-05,0.002197,0.001726,0.000157,0.00035,0.00032,0.000699,-3.4e-05,0.000315,0.000239,0.000722,0.001341,-0.000762,0.001074,0.000109,-0.000269,0.000674,0.000946,0.000151,-0.000461,0.000598,-0.000107,0.001935,-4.8e-05,-0.001217,0.000371,-0.000313,0.000331,0.000626,-0.000319,-0.00043,0.001174,0.001854,-0.000395,0.001271,0.001858,0.000837,0.000179,0.000602,0.001558,-0.00045,0.000621,0.000969,0.002603,-9.3e-05,0.000549,6.2e-05,0.001869,-0.000362,-0.000257,0.002261,0.000654,0.000346,0.00125,0.000396,-0.000626,8.1e-05,0.000836,0.003092,0.000254,0.000142,0.001683,0.001302,0.000933,-0.001286,0.001185,0.000635,-0.001443,-0.001509,-0.000461,-0.001916,0.002236,0.000998,-0.000549,0.00144,-0.001656,-0.000834,0.001184,-0.000764,0.002265,-0.000103,-0.001429,0.000742,-0.00101,-0.000715,-0.000257,-0.000171,-0.000333,2.6e-05,-0.001118,-0.001008,0.001707,-0.000527,-0.000387,0.002259,0.000142,0.000235,0.002101,0.001065,0.002975,0.001067,-0.000206,0.000317,-0.000392
-0.000389,-0.000215,-3.2e-05,-0.000104,-0.000111,0.000387,0.001167,0.000435,0.000167,-0.000846,0.000706,-0.000438,-0.000438,-0.001447,-0.001132,0.000169,-9.3e-05,0.001075,-2.5e-05,-0.000975,-4.3e-05,0.000312,0.000826,4.5e-05,0.000146,-0.000581,-0.000131,0.000536,-0.000159,0.000599,-0.001685,-0.000357,-0.000214,-0.000208,-1.4e-05,-0.000235,0.00042,-0.000383,-0.000279,-0.000627,0.000692,0.001774,-0.000446,0.000342,0.000894,0.000297,0.000867,0.002255,0.001947,-4.5e-05,0.000877,0.001045,0.000722,-7.8e-05,0.00045,0.000359,-0.001213,0.000244,-0.000107,-0.000659,-0.000967,0.000663,0.000405,0.001605,0.000113,0.001011,0.000212,-0.001041,0.000317,-0.000643,1e-04,-0.00051,-0.00123,0.000393,0.000238,-0.000745,-0.000261,0.000441,-0.001203,0.00197,0.000324,0.000749,0.00041,0.000301,0.001007,-1.9e-05,-0.000923,0.00218,-0.001036,0.000508,3e-06,6.4e-05,-4.4e-05,-5.2e-05,-0.000979,0.001288,-0.001085,0.000335,0.000555,-0.000382,-0.001004,0.000169,0.001321,0.000152,1.3e-05,-0.001127,0.000628,0.001551,-0.001449,0.000881,-0.001184,-0.001668,0.000165,6.5e-05,-0.0018,-0.001277,-0.000158,-0.001147,-0.000252,-0.000993,-0.001759
9.5e-05,-0.000191,0.000118,0.000203,0.000456,-0.00046,-0.000668,-0.000255,-0.000214,0.000418,-0.000567,3e-04,-7e-06,0.000892,0.00138,0.000312,1.6e-05,-0.000732,0.000553,0.001418,-0.001011,8.8e-05,-0.000386,-0.00014,0.000155,0.000634,0.000708,-0.000222,8.5e-05,-0.000515,0.000769,0.000228,0.000544,-0.000103,-3.2e-05,0.000362,0.000101,0.000411,0.000482,0.001056,0.000183,-0.001214,0.000233,-0.000311,-0.001434,-0.001086,-0.001249,-0.000583,-0.002309,-0.000944,-0.00053,-0.00017,-0.001062,0.000374,-0.001131,-0.000894,0.00047,0.00014,0.00051,0.001383,-0.000305,5.1e-05,-0.000134,-0.001854,0.000156,-0.000809,0.000997,-7.5e-05,-0.000755,0.000231,-0.000171,0.00144,0.002141,4e-06,-0.000975,-0.000801,-0.000887,-0.00094,0.000971,-0.001706,-7.2e-05,-2.1e-05,-0.000363,-0.000838,-0.000595,0.000359,0.000513,-0.000494,-0.000212,-0.000218,0.001528,-3.8e-05,0.000503,-0.000128,0.00048,-0.000873,-0.001433,5.1e-05,5.4e-05,-0.000426,0.001805,0.001239,-0.000736,0.000457,0.000629,0.000869,-0.000248,-0.000829,-4.5e-05,-0.000309,0.000838,0.000957,-0.000485,-0.000213,0.000224,0.001256,-0.000426,0.000524,0.000789,0.001302,0.002041
-0.000153,0.000147,-0.00011,-0.000172,-0.000207,0.00023,0.000389,-0.000651,-7.5e-05,0.000469,0.000588,-4.6e-05,0.000301,-0.000375,-0.000991,-0.000744,-0.000304,0.000736,-0.001198,-0.00089,0.000697,-9.3e-05,3.8e-05,0.000167,-0.00062,0.000157,-1e-04,-0.000668,-0.000404,0.000265,0.000126,0.000153,-0.000303,-0.000263,-6e-05,-0.000295,-0.000242,-0.000102,-0.00035,-0.000712,-0.0012,0.000159,0.000153,0.000371,0.000894,0.000832,0.000868,-0.000592,0.001393,0.000333,4.3e-05,-0.001083,-0.000263,-0.000652,0.00041,0.001088,-0.000312,-1.1e-05,-0.000406,-0.000714,3.7e-05,0.000407,0.000575,0.001303,-0.000432,0.000254,-0.001132,0.000516,0.000946,-0.001049,-4.6e-05,-0.002124,-0.001447,0.000137,0.000172,0.000862,-0.00021,-0.000152,-0.000463,-0.001101,-0.001012,-5.8e-05,-0.000299,5.6e-05,0.000528,0.000658,0.000574,0.000287,0.000311,-0.00033,-0.001449,-0.000924,0.000896,0.001842,-9e-04,0.001005,0.001097,-0.000691,0.000812,0.001038,-0.00121,-0.001262,-0.000372,-0.000455,0.000241,0.000719,0.000543,-6.5e-05,0.000553,-3.8e-05,-0.000489,-0.001105,-0.000129,-0.000482,0.000286,-0.000658,-0.001324,-1.4e-05,-0.000486,-0.000261,-0.001244
8e-05,2.1e-05,7.8e-05,0.000103,-0.000188,-8.2e-05,-0.00054,0.00096,0.000169,-0.000481,-0.000643,-0.000737,4.1e-05,0.000585,-0.000113,0.000555,0.000372,-0.000511,0.001156,0.000285,3.2e-05,-0.00032,-0.000387,-2.1e-05,0.000438,-0.000107,-0.000106,0.000651,-0.00011,0.000323,-0.000216,-0.000284,-0.000241,0.000324,-0.000462,4.4e-05,-0.000291,-0.000425,0.000155,-0.000372,0.000588,3.1e-05,0.000433,0.000219,-0.000236,-0.000163,-0.000437,-0.000113,-0.000888,-0.000341,0.000365,0.000898,0.000523,-0.000389,-0.000665,-0.000837,-3.5e-05,-9e-06,0.000514,0.000577,0.00044,0.000203,-0.000105,-0.000813,-0.000445,-9e-05,0.000506,4.7e-05,-0.000711,0.001204,0.000516,0.001067,0.000179,0.000102,0.000435,-0.000217,0.000957,0.000524,0.000354,0.001137,0.001509,0.000956,-5.6e-05,-0.000131,-6.6e-05,-0.000445,0.000261,0.000168,0.00046,0.000426,5e-06,0.000199,-0.000987,-0.001852,0.000905,-0.000706,0.000134,0.000748,-0.000764,-0.000663,0.000101,-0.000253,-0.00033,-0.000299,-0.000466,-0.001005,5.4e-05,-0.000288,-0.000715,-0.000616,6e-04,0.000383,0.001011,0.000131,0.000143,0.000672,0.001116,0.000746,0.000738,0.000435,-0.00036
1.3e-05,-1e-06,-0.000121,4.5e-05,-6e-05,0,0.000212,-0.000392,-0.000255,-0.00028,0.000447,0.000741,-1e-04,-0.000707,0.000466,-0.000569,-1.8e-05,0.000186,-0.000306,-0.000453,-9.6e-05,-2.8e-05,0.000271,-0.00018,-0.000101,-1.5e-05,-0.00027,-0.000144,0.000209,-0.000864,-0.000158,-0.000341,0.000256,-0.000147,0.000342,-5.6e-05,0.000496,0.000324,3e-06,0.000432,0.000295,0.000423,-0.000817,-0.000709,0.000239,0.000174,-5.8e-05,0.00048,0.000483,-0.000372,-0.00047,-0.000244,-0.000926,0.000343,0.000552,0.000103,0.000219,-3e-05,0.000577,-0.000604,-0.00032,-0.000194,0.000225,-0.000233,0.000298,-3.5e-05,-4.2e-05,-0.000217,-5e-06,-0.000906,-0.000696,-0.000563,0.000205,-1.5e-05,-0.000579,-0.000744,-0.000206,2e-05,-0.000147,-0.00027,-0.000501,-0.001012,0.000124,0.00035,-0.000251,-0.000341,-0.000792,0.000121,0.000421,-0.000535,-4.7e-05,0.000568,0.000896,0.000295,-7.2e-05,0.000226,-0.000346,-0.000388,0.000138,1e-04,2.9e-05,-3.7e-05,0.000478,0.000616,0.00018,-0.000214,-0.000549,0.000296,0.000547,0.000573,-7.7e-05,0.000239,-0.00045,0.000629,-0.000297,-0.00039,-0.000168,-0.000247,-0.000863,-0.000837,0.000678
9.4e-05,-7e-06,1e-05,-3.4e-05,0.000262,0.000144,0.000182,-0.000263,9e-05,0.000311,-7.9e-05,-0.000204,4.2e-05,0.000378,8.9e-05,0.000533,0.00031,3.2e-05,-5.2e-05,-0.000545,-0.000353,-0.000204,-0.000138,-4.1e-05,-0.000142,-1e-06,0.000319,0.000186,-7.7e-05,0.000556,0.00031,0.000596,-2.8e-05,-0.000123,9.5e-05,0.000193,-0.000272,-1.9e-05,-4e-06,-4e-05,-0.000465,-0.000237,0.000254,0.000604,2.1e-05,-0.000108,0.000185,-0.000157,-0.000718,0.000903,9.6e-05,2.6e-05,0.000765,0.00074,5.8e-05,0.000494,-5.1e-05,0.000152,-0.000703,3.1e-05,-6.3e-05,0.000393,-0.000251,0.000242,-0.000445,-0.000248,-0.00021,0.00023,0.000291,6e-04,0.000644,-5.7e-05,-0.00011,0.000753,0.000144,0.000391,0.000255,0.00029,1.3e-05,0.000336,-0.000135,3e-04,-9e-05,-0.000105,-0.000319,0.000577,0.000704,-7.3e-05,-0.000504,8.2e-05,-5.6e-05,-0.000355,-0.000455,0.001102,7.1e-05,-0.000398,-3.2e-05,0.000217,0.000667,0.000323,-0.000127,0.000367,-0.000254,-1e-05,0.000128,0.000306,0.000869,8e-05,-0.000203,0.000142,0.000115,-3e-04,-0.000139,-0.000359,-0.000219,-0.000198,-5.5e-05,-0.000726,0.000494,0.000664,-3.4e-05
-0.000115,9.1e-05,6.8e-05,8e-06,-0.000147,-0.000176,-0.000151,0.000209,-0.000133,-0.000142,-8e-05,-3.6e-05,-0.000215,-9.6e-05,-0.000315,-0.00022,-0.000378,-0.000181,-0.000216,-2.8e-05,0.000328,9.8e-05,7.5e-05,0.000185,0.000247,5.1e-05,-0.000151,-0.000254,-0.000111,-0.000334,-0.000389,-0.000287,0.000119,-1e-06,5.7e-05,6.8e-05,-3.1e-05,0.000114,-5.4e-05,-0.000102,0.00044,6.1e-05,0.000192,-0.000315,-8.4e-05,8.4e-05,-0.000172,0.000133,0.000492,-0.000244,6.8e-05,1.7e-05,-0.000333,-0.000226,-5.1e-05,2.7e-05,0.000251,9.8e-05,0.000128,4e-05,-0.000192,-9.6e-05,-0.00012,0.000431,0.000704,4.6e-05,0.000467,-0.000208,-8.3e-05,-2e-05,9.3e-05,0.000597,-0.00032,-0.000681,-0.000207,-0.000194,-0.000167,0.00035,0.000552,-0.000245,-1.9e-05,5.8e-05,-0.00024,-0.000234,0.00028,-0.000244,-0.000438,-0.00045,8.5e-05,0.000131,-2.2e-05,-9.6e-05,-0.000116,-0.000598,-0.000248,0.00035,4e-04,0.00036,-0.000618,-0.000175,-0.000159,-0.000122,0.000168,-0.000326,-4.7e-05,-0.000135,-0.000203,-0.000236,6.4e-05,-0.000188,-0.000389,7.3e-05,-2.5e-05,2.8e-05,0.000245,0.00028,-0.000443,0.000112,1.6e-05,-0.000314,5.1e-05
6.7e-05,-1.1e-05,-3e-05,-4e-06,0.000106,0.000116,4.1e-05,-4.8e-05,4.1e-05,-4.4e-05,-0.000169,-4e-05,-4.9e-05,-9.8e-05,-1e-05,5e-06,-2.4e-05,0.000276,-2.1e-05,-0.000153,-0.000115,-9e-06,3.9e-05,0.000111,-0.000101,-0.000184,0.000117,-5.7e-05,0.000141,0.000321,0.000207,0.000179,-0.000247,0.000197,-8.9e-05,-0.000203,7.2e-05,7e-05,-4.2e-05,1.2e-05,-8.7e-05,-0.000241,-0.000285,6.8e-05,-4e-06,-2.8e-05,0.000111,-0.00019,0.000326,2e-05,-0.000148,-0.000248,0.000308,-0.000176,-7e-06,-0.000447,-0.000339,-0.000104,5.8e-05,0.000107,0.000253,4.1e-05,7.5e-05,-0.000453,-0.000418,7.3e-05,-0.000289,0.00032,2.2e-05,-0.000112,-2e-04,-0.000162,0.000371,0.000258,0.000234,2.8e-05,-0.000691,-6.2e-05,-0.000226,-0.000332,0.000135,-1e-04,0.000207,4e-05,1.9e-05,-5.2e-05,9.2e-05,0.000263,-0.000168,-1.1e-05,0.000243,0.00016,1.3e-05,-0.00041,-0.000316,-0.000393,-0.000316,-0.000667,0.000257,-0.000122,0.000725,5e-06,-0.000248,-0.000127,-2e-06,7.4e-05,-0.000326,0.000142,4.4e-05,3.6e-05,0.00012,-0.000136,-0.000217,0.000206,0.000297,-0.000165,0.000349,0.000309,-0.000203,-3.1e-05,0.000108
-5.3e-05,-1e-05,1.2e-05,-1.9e-05,-5.6e-05,-8.2e-05,-0.000138,0.000242,3.3e-05,0.000189,0.00026,0.000124,0.000189,0.000123,0.000148,4.3e-05,0.000113,-0.000281,0.000189,0.00054,-1.4e-05,-3.9e-05,-8e-06,-3.5e-05,-3.1e-05,-3e-06,-4.7e-05,0.000154,-3.2e-05,-0.000184,2e-06,-0.000144,0.000111,-0.000176,-1e-04,9.8e-05,1e-04,-8.4e-05,-5.9e-05,-6.7e-05,-7.9e-05,0.000229,0.000129,3.6e-05,-6.8e-05,-4.8e-05,-1e-06,-0.000237,-0.000255,-0.000179,0.000219,0.000276,-0.00032,5.2e-05,-6.9e-05,0.000122,0.000108,-0.000136,-7.2e-05,-0.000105,-9.4e-05,-8.2e-05,-0.000139,0.000451,0.000159,3.3e-05,0.000116,-0.000207,-5.5e-05,2.7e-05,-3.7e-05,-3e-06,-3.5e-05,3e-06,-1e-05,-0.000232,9.6e-05,-0.000133,0.000239,0.000597,-7.7e-05,-0.000134,0.000102,5.1e-05,-0.00011,4.2e-05,6.3e-05,0.000269,-8.8e-05,-0.000177,-0.000196,4.1e-05,0.000388,0.000397,0.000382,0.00039,-2.3e-05,8.6e-05,-0.00012,-8.4e-05,-0.000711,2e-06,0.000138,0.000264,0.000207,0.000152,0.000153,-0.000178,-0.000291,-0.000317,-1e-06,0.000211,0.000228,-0.000222,-0.000306,6.9e-05,0.000138,3.2e-05,0.000155,-7.2e-05,-0.000391
3e-06,1.6e-05,-1.2e-05,1.6e-05,7e-06,0.000143,3.5e-05,-0.00029,1e-06,-8e-06,-1.1e-05,-6.1e-05,-5.5e-05,-7.3e-05,-6.8e-05,3.1e-05,-6.2e-05,0.000132,-7.3e-05,9.5e-05,-7.2e-05,-5.6e-05,-3e-05,-5.8e-05,3.4e-05,0.000123,2.3e-05,7e-06,3.9e-05,0.00016,-4.2e-05,5.4e-05,-1.6e-05,2.8e-05,0.000192,-8.4e-05,-0.000133,-0.000164,7.7e-05,0.000124,1.6e-05,-8.8e-05,-1.4e-05,-5.5e-05,-3.1e-05,1.8e-05,-2e-05,0.000227,-0.000137,0.000188,-5.4e-05,-5.3e-05,0.000245,6.7e-05,4e-05,1.9e-05,-5.2e-05,0.000126,5.5e-05,-0.000237,1.9e-05,1.8e-05,-3.2e-05,-0.000117,2e-06,0.000124,-3.6e-05,0.000121,-4.1e-05,-0.000169,8.8e-05,8.4e-05,0.000142,-0.00011,-1.8e-05,0.000237,0.000444,-3.2e-05,-0.000261,-0.000153,2.4e-05,0.00016,-4.7e-05,-0.000113,9.2e-05,6.6e-05,-0.000152,-8.5e-05,-0.000179,8.9e-05,3.5e-05,0.000111,-0.000164,-0.000376,-0.000267,-0.000241,8.4e-05,0.000157,-1.6e-05,9.3e-05,0.000293,-2.4e-05,-0.000112,-0.000206,-4e-05,-0.00014,5.5e-05,0.000194,0.000196,0.000383,-6.7e-05,-9.8e-05,-4.1e-05,0.000115,6.6e-05,-5.2e-05,1e-06,5.4e-05,-0.000244,0.000166,-6.4e-05
3.4e-05,-1.8e-05,9e-06,-7e-06,-8e-05,-0.000148,8.4e-05,2.8e-05,-6.5e-05,-0.000145,-5.5e-05,-1.4e-05,8.7e-05,7.1e-05,-1.6e-05,-8.2e-05,4.8e-05,-5e-06,2.6e-05,-0.000277,0.000126,0.000146,1.3e-05,-6.4e-05,-5.4e-05,-0.000133,1.2e-05,-9.2e-05,-7e-06,-5.3e-05,1.8e-05,-3e-06,-5.3e-05,9e-06,-0.000103,1.9e-05,4.9e-05,1e-04,-5e-06,2.5e-05,-5.3e-05,9.8e-05,0.000205,7e-05,-3.5e-05,2e-05,5e-05,2.5e-05,0.000152,-0.000193,-3.4e-05,-4.5e-05,1.2e-05,-0.000102,4.3e-05,1.4e-05,3.1e-05,-8.9e-05,-0.000214,0.00017,1.3e-05,-4.3e-05,-4.7e-05,9.5e-05,-6.5e-05,-0.000111,7e-06,-7.7e-05,0.000133,0.000192,-8.4e-05,-0.000137,-2.5e-05,0.000232,-3.5e-05,-8.9e-05,-0.000138,-6.5e-05,1.6e-05,-4.4e-05,-0.000139,-0.000113,-1.2e-05,7.3e-05,-7.6e-05,-4e-06,0.000163,-0.00017,0.000158,-0.000193,0.000141,-0.000147,-3.9e-05,0.000252,0.000143,0.000142,9.9e-05,-0.000135,9e-06,-0.000118,-0.000146,0.000106,3.6e-05,7.1e-05,-4.4e-05,-7.3e-05,1.3e-05,-5e-06,-8.1e-05,-0.000158,8.8e-05,4.7e-05,-0.000132,-8.8e-05,8.9e-05,-4.5e-05,-0.000196,1e-06,7.1e-05,-5.6e-05,0.000137
-1.7e-05,7e-06,6e-06,-5e-06,0.000128,8.3e-05,-6.9e-05,6.3e-05,8.1e-05,2.5e-05,-0.000109,1.1e-05,-2e-05,-8.5e-05,4.8e-05,5.4e-05,2.1e-05,-8.5e-05,-8.9e-05,0.000105,4.1e-05,1e-06,-5.7e-05,1.4e-05,-1.4e-05,1.8e-05,-8e-06,3.5e-05,-4e-06,5.5e-05,-3.5e-05,3.4e-05,6.1e-05,6.4e-05,-2.1e-05,8e-06,2.8e-05,-3e-06,3.2e-05,-0.000116,8.9e-05,-4.8e-05,-0.000244,-6.1e-05,5.8e-05,5.6e-05,1e-06,-7.4e-05,-1.1e-05,5.8e-05,0.000101,-9e-06,-0.000104,-2e-05,3.6e-05,-6.4e-05,3.8e-05,0.00016,6.2e-05,-5.7e-05,-1.8e-05,2.8e-05,-3.5e-05,-0.000106,4.9e-05,5.4e-05,1.5e-05,8.2e-05,-7.2e-05,-0.00017,5e-05,5.4e-05,0,-0.000118,0.000102,2e-06,0.000319,0.000107,-1.4e-05,4e-05,2.6e-05,-3.1e-05,4.3e-05,4e-05,5e-05,-8.7e-05,-8.7e-05,-3.2e-05,1.7e-05,0.000159,-0.000112,8.4e-05,3e-05,7.7e-05,-0.000116,-3e-05,-0.000129,0.00023,6.6e-05,0.000142,-4.5e-05,1.5e-05,-4.8e-05,1e-05,-4.3e-05,6.5e-05,7e-05,-2.8e-05,-7e-06,5.4e-05,-5.2e-05,-2.4e-05,0.00014,8.3e-05,-0.000144,0.000104,8.4e-05,-7.9e-05,-6e-06,9e-06,-1e-05
2.6e-05,-3.3e-05,-5e-06,1e-05,-0.000114,-4e-05,1.9e-05,6.3e-05,2e-06,9.4e-05,9.2e-05,-1.8e-05,-5.5e-05,9.4e-05,-5.7e-05,2.2e-05,-2.5e-05,0.000134,0.000116,-1.3e-05,-3.8e-05,-3.9e-05,-5e-06,2.6e-05,3e-05,3.9e-05,5.7e-05,1e-06,3.8e-05,-0.000127,0.000148,1.5e-05,-1e-06,-3.7e-05,-7.7e-05,1.2e-05,-1.4e-05,9e-06,4e-06,2.8e-05,-5.2e-05,2.9e-05,3.8e-05,-2.8e-05,-2e-06,-6e-05,-3.3e-05,7e-06,0.000105,4.2e-05,-0.000179,4.5e-05,-1.2e-05,1.9e-05,-4.7e-05,1e-06,-4.1e-05,-0.000145,0.000172,7.9e-05,3.7e-05,2.1e-05,-1.6e-05,1.2e-05,-8e-05,-0.000117,1.8e-05,-9.3e-05,3.3e-05,0.000127,-9e-06,3.8e-05,-0.000179,-5.4e-05,-4e-06,-2.9e-05,-0.000284,4e-06,-5.1e-05,-2.4e-05,7.3e-05,0.000145,-6e-05,-2.4e-05,-2.4e-05,0.000142,-3.7e-05,3.8e-05,2.4e-05,-4.6e-05,1.4e-05,-5.9e-05,-4.6e-05,-0.000172,9.8e-05,1e-06,0,-0.000228,-0.000112,-8e-05,0.000105,-7.1e-05,3.3e-05,-9.4e-05,5e-05,6.1e-05,-0.00016,-2.5e-05,0.000121,-0.000102,9e-06,0,-5.6e-05,-8e-06,4.2e-05,-5.5e-05,6.3e-05,-6.1e-05,0.000126,-7e-06,-1.7e-05
-2.5e-05,1.2e-05,9e-06,-1e-05,5.8e-05,2e-06,-3.9e-05,-7.1e-05,-1.3e-05,-1.7e-05,1.8e-05,-1.6e-05,4.3e-05,-5.8e-05,1e-05,-7.8e-05,1.3e-05,-0.000111,-6.2e-05,0.000103,-3e-06,3e-05,-1.5e-05,-1.9e-05,-4.1e-05,-1.5e-05,-2.5e-05,1.4e-05,-4.2e-05,9.2e-05,-0.000178,-3.7e-05,-2e-05,-5.3e-05,7.4e-05,1e-05,1.1e-05,2.8e-05,1e-06,3e-05,-6e-06,-4.8e-05,6.1e-05,7.5e-05,-3.2e-05,2.9e-05,4.6e-05,-4.7e-05,-0.000239,-1.7e-05,0.000141,2.6e-05,-2.3e-05,3.4e-05,5e-06,5.3e-05,6.9e-05,9.7e-05,-0.000222,2.3e-05,-5.9e-05,-1e-04,5e-06,5.2e-05,8.9e-05,8.6e-05,-7.6e-05,9e-05,-4e-06,-0.000127,-1e-04,-0.000129,0.000229,3.7e-05,-8.2e-05,4.6e-05,4.5e-05,0,8.2e-05,0.000163,-0.000119,-9.1e-05,7.5e-05,4.3e-05,4.7e-05,-0.000152,4.9e-05,0.000162,-4e-06,1.2e-05,4e-05,8.2e-05,2.4e-05,-2.5e-05,2e-06,-6.3e-05,1e-04,-0.000115,7.4e-05,0.000102,2.6e-05,1.2e-05,2e-06,6.1e-05,-1e-05,-1.4e-05,5.5e-05,-4.2e-05,-0.000123,1.3e-05,-5e-06,5.1e-05,-3.6e-05,-9.1e-05,-3.9e-05,7.9e-05,5e-06,2.3e-05,-0.000119,-3.7e-05,0.000172
1.4e-05,1.1e-05,-5e-06,1e-06,-2.7e-05,-3e-06,1.4e-05,-2e-05,2.1e-05,-3.5e-05,-1.3e-05,3.8e-05,-3.9e-05,2.3e-05,6.3e-05,0.000122,-1.3e-05,5.2e-05,3.7e-05,-3.9e-05,3.9e-05,-7.5e-05,-9e-06,1.4e-05,3e-05,-1.7e-05,3e-06,7e-06,-1.1e-05,-2.6e-05,1e-04,-2.4e-05,-2.1e-05,6.2e-05,5.9e-05,-8e-06,-1.3e-05,-3.8e-05,-2e-06,8e-06,4.4e-05,2.6e-05,3e-06,-6.6e-05,5.9e-05,-4e-06,-4e-05,6.8e-05,0.00014,3.9e-05,2e-05,-8e-06,5.3e-05,2.1e-05,3.7e-05,-0.000107,-7.9e-05,-8.3e-05,6e-06,-5.3e-05,2.9e-05,4.2e-05,3.8e-05,-3e-06,-0.000111,-6.2e-05,4.6e-05,-7.8e-05,-5.9e-05,0.000169,8.1e-05,0.000148,-0.000113,-1.4e-05,6.6e-05,6.3e-05,-8.4e-05,3.4e-05,-0.000139,-9.2e-05,5e-05,3.4e-05,-5.1e-05,-2.6e-05,-2.5e-05,6.5e-05,1.4e-05,-5.7e-05,-8.3e-05,4.1e-05,-5.3e-05,-6.2e-05,2.8e-05,7e-06,-3.5e-05,4.5e-05,1.6e-05,0.000183,-2.7e-05,-9.5e-05,-6.2e-05,1e-06,1.5e-05,5.8e-05,5e-06,-3.2e-05,5.6e-05,8.3e-05,8.3e-05,5.9e-05,1.7e-05,-7.1e-05,6.4e-05,6.2e-05,0.000118,-2.9e-05,-0.000171,2.8e-05,4.7e-05,5.8e-05,-0.000109
-1.3e-05,1e-06,1e-06,1e-06,3.8e-05,1.9e-05,6.4e-05,4.8e-05,-1.6e-05,2.1e-05,-4.6e-05,-2.4e-05,2.8e-05,1e-06,-6.4e-05,-0.00014,3e-06,-2e-06,-7.3e-05,-9.1e-05,1.8e-05,2.9e-05,4e-06,3e-06,-6e-06,3.5e-05,-3.6e-05,-5.5e-05,7e-06,-5.5e-05,-1e-05,5.6e-05,2.7e-05,7e-06,-4.7e-05,1.4e-05,-3.4e-05,5.4e-05,-5e-06,2.7e-05,-4.7e-05,-6.1e-05,-4.3e-05,1.2e-05,-5.6e-05,2.9e-05,2.4e-05,3e-05,-1.8e-05,-3.6e-05,-0.000112,-5.3e-05,-1.5e-05,-2.3e-05,5e-06,5.4e-05,4.3e-05,3.6e-05,0.00013,2e-05,-1e-05,-6.4e-05,-2.2e-05,-0.000155,0.000114,4.2e-05,2.5e-05,8e-05,3.9e-05,-8.8e-05,-2.7e-05,-7.1e-05,4e-05,-2.1e-05,-4.5e-05,-0.000155,-1.8e-05,-1.2e-05,5e-05,-0.000134,-3.2e-05,1.2e-05,-6.7e-05,-1e-06,2.4e-05,9e-06,-4.8e-05,-6.1e-05,5.7e-05,-1.9e-05,3.9e-05,1.1e-05,2.5e-05,0.000197,-4.8e-05,-7.9e-05,-9e-05,-8.9e-05,3e-06,1.5e-05,-2.2e-05,5e-06,-4.2e-05,-7.3e-05,-1.1e-05,2.6e-05,-3e-05,-1.3e-05,-2.6e-05,-1e-06,-2.9e-05,7e-06,-1.5e-05,2.8e-05,-3e-05,1.5e-05,5.8e-05,6.9e-05,1.7e-05,-1.9e-05,-5.8e-05
9e-06,-4e-06,0,-6e-06,-5.6e-05,-1.4e-05,-5.7e-05,-1.3e-05,-2e-06,-2.8e-05,1.6e-05,-8e-06,8e-06,-8e-06,-8e-06,0.000103,-4e-06,-3.2e-05,3.9e-05,2e-05,-3.1e-05,-1.9e-05,1.3e-05,5e-06,-2.9e-05,-9e-06,-9e-06,2.7e-05,0,7.4e-05,-2.5e-05,-6e-06,1.8e-05,-3e-05,5e-06,-6e-06,5.2e-05,-3.8e-05,3e-06,-6.9e-05,3e-05,4.9e-05,-1e-06,3.3e-05,4.7e-05,-4.9e-05,-8e-06,-5.3e-05,1e-05,4.6e-05,9.8e-05,-1e-06,-3.5e-05,-2.4e-05,-6.5e-05,3.4e-05,-5.1e-05,-1e-05,-8.8e-05,-1.4e-05,1.2e-05,4.5e-05,2.9e-05,0.000189,-1.4e-05,-2.9e-05,-3.5e-05,-2.1e-05,-2.2e-05,-1.4e-05,-4e-05,4e-06,2e-05,2.5e-05,9.5e-05,9.9e-05,7.8e-05,-1.3e-05,-0.000104,0.000157,2.2e-05,4.5e-05,7.5e-05,-1.5e-05,-4e-05,0,7.8e-05,-4.3e-05,-8.2e-05,2.8e-05,-6e-06,2.3e-05,-9e-05,-0.000125,1.4e-05,9.2e-05,-7e-06,2.9e-05,-1e-05,1e-06,9.8e-05,3.7e-05,1.6e-05,7e-06,-1e-05,-4e-05,2.4e-05,-7.3e-05,-3.7e-05,-4.7e-05,2.7e-05,-6e-06,-1.4e-05,-3.6e-05,-7.2e-05,5e-06,7.4e-05,-2.1e-05,-5.7e-05,1.9e-05,6.5e-05
-8e-06,2e-06,0,6e-06,6.8e-05,3e-06,8e-06,2.1e-05,-7e-06,-1.7e-05,1.8e-05,2.3e-05,-1.6e-05,2e-06,4.9e-05,-2.2e-05,6e-06,5.8e-05,3e-05,-8.6e-05,2.5e-05,-1.8e-05,1e-06,1e-06,2.8e-05,-1e-05,3e-06,3e-05,-2e-06,-4.5e-05,4e-06,-2.4e-05,-3e-05,-9e-06,-2.5e-05,3e-06,-2.4e-05,-1.2e-05,-4e-06,1.8e-05,1.8e-05,2e-06,7.8e-05,-5e-05,-2.2e-05,2.7e-05,-7e-06,-6e-06,-2.5e-05,-4.3e-05,-6e-05,5.3e-05,5.4e-05,1.3e-05,4.6e-05,-8.8e-05,4.1e-05,3.6e-05,3.2e-05,3.5e-05,-5e-06,-3.5e-05,3e-05,-8.1e-05,3e-06,1.4e-05,4.8e-05,-5.5e-05,2e-05,5.6e-05,3.4e-05,4.3e-05,-6e-05,-5.4e-05,-8.5e-05,-2.3e-05,9.9e-05,-5e-06,4.7e-05,6e-06,3e-06,-9.9e-05,-1.5e-05,1.5e-05,3.2e-05,-4.1e-05,-8.4e-05,6.5e-05,0.000122,-1.4e-05,-3e-05,-9e-06,6.3e-05,-0.000127,3.6e-05,-5.9e-05,5.8e-05,4.5e-05,2.1e-05,-1.2e-05,-0.000132,-3.5e-05,-4e-05,4.1e-05,-2.2e-05,-1.3e-05,-9e-05,5.7e-05,6.5e-05,0,1.1e-05,1.4e-05,6.2e-05,1e-05,9.4e-05,-3.2e-05,-1.9e-05,-4.8e-05,9.6e-05,-3.7e-05,-6.1e-05
1.1e-05,-7e-06,0,0,-4.7e-05,7e-06,-2.5e-05,-6.7e-05,-8e-06,4.7e-05,6e-06,-8e-06,1.6e-05,-3e-06,-1e-05,-2.8e-05,-3e-06,-6.1e-05,-1.3e-05,1.7e-05,2e-06,-1.5e-05,8e-06,1e-06,-1.1e-05,6e-06,-5e-06,-2.4e-05,5e-06,4.9e-05,1.8e-05,1.6e-05,2.3e-05,2.6e-05,4.7e-05,-1.5e-05,-1.6e-05,2.5e-05,1e-06,2.3e-05,-4.2e-05,1.9e-05,-8.2e-05,3.4e-05,-3.4e-05,1e-06,1.3e-05,7e-06,-6e-06,3.9e-05,-5e-06,-2.8e-05,1e-05,1.3e-05,-1.5e-05,3e-06,1e-06,-3.5e-05,1.7e-05,-1.5e-05,-1e-05,-2.3e-05,1.3e-05,4e-06,7e-06,5e-06,-5.8e-05,4.9e-05,7e-06,-9.3e-05,-3.1e-05,-1.7e-05,5.6e-05,1.4e-05,2.8e-05,-2.1e-05,-2.8e-05,-1.1e-05,-1e-05,-2.4e-05,-5e-06,8.8e-05,-8e-06,-7e-06,-3e-06,3.8e-05,3.4e-05,2.2e-05,2.1e-05,-2e-06,2.9e-05,1.2e-05,-3.9e-05,0.000206,-3.4e-05,8.5e-05,5e-06,-0.000122,-3e-06,4.9e-05,0.000114,8e-06,2e-05,-1.4e-05,-1.5e-05,7.1e-05,3.5e-05,-4.5e-05,-7.4e-05,4.3e-05,-1.7e-05,6e-06,-7.1e-05,1.2e-05,-5.3e-05,4e-05,-4.6e-05,-3.3e-05,-7.2e-05,3e-05,6e-06
-5e-06,-2e-06,1e-06,-1e-06,7e-06,-2e-05,2.1e-05,6.3e-05,-2e-06,1.4e-05,-2e-05,-6e-06,-2.6e-05,9e-06,-2.3e-05,2.9e-05,3e-06,4.3e-05,-2e-06,2.7e-05,5e-06,8e-06,1e-06,-6e-06,-1e-05,5e-06,2e-06,-1.4e-05,-6e-06,-4.5e-05,5e-06,-1.9e-05,-1.9e-05,1.5e-05,-1.7e-05,2.2e-05,1.5e-05,-4.6e-05,-2e-06,-1e-05,0,-3.9e-05,3.5e-05,-1.5e-05,6.9e-05,6e-06,-1.1e-05,1.7e-05,4.8e-05,-7.3e-05,5e-05,2e-06,-4.7e-05,-2.2e-05,1.3e-05,5.3e-05,-1e-05,2e-05,-3.4e-05,-7e-06,1.1e-05,4.6e-05,4e-06,4.1e-05,-4.3e-05,1e-06,2.6e-05,-1.3e-05,-2.6e-05,8.6e-05,-2.1e-05,-2.1e-05,-4.2e-05,4.3e-05,8e-06,8e-06,1e-06,1.1e-05,-1.3e-05,1e-06,6e-06,-1.6e-05,1.9e-05,-1.3e-05,1.6e-05,-3e-06,2.1e-05,-2.2e-05,1.5e-05,-9e-06,2e-06,-1.8e-05,2.8e-05,-0.000127,4.8e-05,-7.3e-05,-3.8e-05,5e-05,-3.2e-05,-2e-05,-7.4e-05,1.1e-05,-1e-05,-3.4e-05,9e-06,-2.8e-05,4e-05,4.4e-05,5.8e-05,-1e-06,-1.1e-05,-2.6e-05,1.7e-05,-4.4e-05,-2.7e-05,-4.2e-05,-8e-06,5e-06,4.7e-05,-2.8e-05,7.5e-05
4e-06,-6e-06,1e-06,3e-06,0,2.2e-05,3.6e-05,-6e-06,-2e-06,-3.7e-05,-9e-06,5e-06,1.2e-05,-1.1e-05,5e-06,-1.6e-05,-5e-06,-1.4e-05,-1.9e-05,3.1e-05,-9e-06,7e-06,-5e-06,-1.1e-05,1.1e-05,-1e-06,-1.7e-05,1e-05,1.3e-05,3.6e-05,-3.1e-05,2.8e-05,1.1e-05,-3.3e-05,-2.6e-05,-1e-05,9e-06,3.6e-05,-1e-06,1.2e-05,2.2e-05,8e-06,-1.3e-05,-5e-06,-4.9e-05,-3e-05,-3e-06,7e-06,-3.3e-05,8.6e-05,-5.9e-05,-1.6e-05,6.4e-05,4e-06,-1.1e-05,-7e-06,3.2e-05,-3.4e-05,4.7e-05,-1.9e-05,-1.1e-05,-4.2e-05,8e-06,-1.3e-05,5.2e-05,1.3e-05,6e-06,-1.1e-05,7e-06,-9.4e-05,5.1e-05,2.4e-05,2.6e-05,-6.4e-05,2e-06,-2.2e-05,-0.000125,-2e-06,1.8e-05,-8.6e-05,1.5e-05,-4e-05,-9e-06,1.9e-05,-1.2e-05,-2.3e-05,-5.3e-05,-2.2e-05,-1.3e-05,-1.3e-05,-2.6e-05,6e-06,-3.3e-05,2.6e-05,-4.6e-05,3.7e-05,8e-06,4.4e-05,5e-05,9e-06,3.5e-05,-2e-06,-3e-06,5e-05,1e-05,-3.6e-05,-5.2e-05,0,-4e-06,-1e-05,1.8e-05,1.3e-05,3.7e-05,1.1e-05,2.7e-05,1.3e-05,8.6e-05,2.9e-05,-3.6e-05,2.9e-05,-4.6e-05
-4e-06,4e-06,-1e-06,-3e-06,1.8e-05,-1.5e-05,-3.7e-05,-2e-05,3e-06,-8e-06,1.9e-05,-1e-06,5e-06,1.9e-05,1.5e-05,6e-06,3e-06,-1.8e-05,2.5e-05,2.4e-05,1.9e-05,-3e-06,4e-06,1e-06,-1.3e-05,-1e-05,0,7e-06,-1e-06,-2.5e-05,3e-05,-2.1e-05,-1.9e-05,0,0,-4e-06,-2e-06,9e-06,-1e-06,-3e-05,-5e-06,-1.6e-05,2.3e-05,1.9e-05,2.4e-05,2.3e-05,1.3e-05,-2.9e-05,-2.3e-05,-7.6e-05,4.2e-05,1.5e-05,-7.1e-05,1.3e-05,2.1e-05,-3.1e-05,-5.1e-05,4.1e-05,-2.5e-05,6e-06,1e-05,2.6e-05,9e-06,-3.2e-05,-6.8e-05,-2e-05,0,6e-06,2e-06,9.9e-05,-2.6e-05,-1.5e-05,-9e-06,3.1e-05,0,4.1e-05,2.8e-05,4e-06,-5.5e-05,0.00013,-8e-06,2.6e-05,3e-06,-2e-06,-3e-06,1.9e-05,4.8e-05,2.3e-05,-4.8e-05,9e-06,6e-06,4e-06,5.9e-05,7.7e-05,2.4e-05,-4.7e-05,1.4e-05,-6.2e-05,-2.5e-05,-2.8e-05,-4.2e-05,1e-06,2.1e-05,-4e-05,-2e-06,3.3e-05,1.4e-05,-1.1e-05,-5e-05,-2.2e-05,6e-06,1.2e-05,-6.7e-05,4.2e-05,-1.8e-05,-2e-06,-3e-05,1.7e-05,2.6e-05,-3e-05,-2e-06
-2e-06,0,0,2e-06,-3.1e-05,5e-06,1e-06,-3e-06,5e-06,2.2e-05,6e-06,-3e-06,-7e-06,-1.7e-05,-1.4e-05,-1e-06,-3e-06,3.9e-05,-1.6e-05,-3.7e-05,-1.4e-05,1.5e-05,-9e-06,1.1e-05,-3e-06,8e-06,4e-06,6e-06,-3e-06,1e-06,-1.1e-05,1.2e-05,1.4e-05,2.1e-05,8e-06,9e-06,-2e-06,-1e-05,0,1.1e-05,-1.6e-05,1.8e-05,-2.9e-05,-2.7e-05,-5e-06,1e-06,-1.6e-05,-4e-06,4.6e-05,7e-05,-4e-06,1.4e-05,5.8e-05,2e-06,-1.2e-05,-5e-06,4e-05,-2.9e-05,-2.5e-05,1.7e-05,-4e-06,-2e-06,-1e-05,1.7e-05,6.7e-05,1.9e-05,-8e-06,9e-06,9e-06,-5.7e-05,-1.8e-05,-1.3e-05,-1.2e-05,-2e-06,-1.9e-05,-3.1e-05,5e-06,2e-06,5.9e-05,-2e-06,-7e-06,5e-06,1.9e-05,-1.7e-05,-2e-06,-3e-06,-1.3e-05,1e-06,9e-06,-4e-06,1.6e-05,-1e-05,-6.5e-05,-0.000126,-1.9e-05,4.6e-05,-5e-06,1.8e-05,-7e-06,5e-06,8e-05,-8e-06,-7e-06,1.2e-05,-4e-06,-1.2e-05,2.6e-05,-1.2e-05,6.8e-05,2.6e-05,-1.3e-05,-9e-06,4.9e-05,-2.1e-05,3.1e-05,-1.9e-05,-3.1e-05,4e-06,1e-06,3e-05,2.2e-05
4e-06,4e-06,-1e-06,1e-06,2.3e-05,-4e-06,-9e-06,2e-06,1e-06,-1e-06,-8e-06,-1e-06,1.5e-05,1e-05,1e-05,0,2e-06,-4e-05,8e-06,2.1e-05,1.4e-05,-1.9e-05,2e-06,5e-06,1.4e-05,4e-06,9e-06,-1.6e-05,-2e-06,-1.1e-05,8e-06,-1e-05,1.8e-05,-1e-06,4e-05,-5e-06,-1.1e-05,1.5e-05,1e-06,2.3e-05,2.2e-05,-3e-06,4e-06,2e-05,-2.1e-05,-6e-06,1.1e-05,1.6e-05,-3e-05,-5.1e-05,-3.1e-05,-1.9e-05,-5.8e-05,-7e-06,-8e-06,2.5e-05,-3.5e-05,1.7e-05,4.1e-05,-1e-05,0,2e-06,-1e-05,-3.8e-05,-5.9e-05,-2.7e-05,2e-06,-1.1e-05,3e-06,2.4e-05,4.1e-05,3.9e-05,2.3e-05,-1.3e-05,3.4e-05,-3e-06,7.1e-05,-6e-06,-2.2e-05,-0.000108,1.9e-05,-1.3e-05,-2.9e-05,1.6e-05,6e-06,6e-06,-9e-06,-2.2e-05,-3.6e-05,-5e-06,-1.2e-05,9e-06,3.5e-05,6.3e-05,-3e-06,-1.7e-05,-3e-06,-1.3e-05,1.3e-05,-1e-06,-0.000102,-1e-06,-5e-06,7e-06,-4e-06,-5e-06,-2.2e-05,-4e-06,-4.7e-05,-2.5e-05,1e-06,4e-06,-3e-06,-1.6e-05,-3.1e-05,2e-05,-1.7e-05,-1.4e-05,-1.7e-05,-2.9e-05,-1.9e-05
-4e-06,3e-06,0,-3e-06,-1e-06,1.1e-05,1.3e-05,3e-05,6e-06,-3e-06,-1.9e-05,2e-06,-1.1e-05,-6e-06,2e-06,-1.2e-05,-1e-06,2.5e-05,-1.2e-05,-9e-06,-1.2e-05,1.2e-05,-5e-06,-5e-06,-1.5e-05,-1.5e-05,5e-06,-3e-06,-4e-06,3.1e-05,-3.2e-05,3e-06,-4.3e-05,-1.7e-05,-2.7e-05,3e-06,9e-06,-2.5e-05,3e-06,-2.1e-05,-4e-06,1.4e-05,3.5e-05,-7e-06,4.1e-05,-8e-06,-3e-06,6e-06,2e-05,3.7e-05,4.9e-05,-2e-06,3.8e-05,6e-06,8e-06,-1.5e-05,2.4e-05,-1.3e-05,-2e-06,9e-06,3e-06,7e-06,-6e-06,4.9e-05,2e-05,2.4e-05,-5e-06,5e-06,-1e-05,-2e-06,-1.9e-05,-4.8e-05,-4.4e-05,3.5e-05,-2.8e-05,2.2e-05,2.8e-05,-1e-06,5.3e-05,6e-05,-1.1e-05,-2.1e-05,0,3e-06,-2e-06,-2.9e-05,1.2e-05,5e-06,1.7e-05,2.1e-05,-1e-06,-1.1e-05,-1.5e-05,1e-05,-8e-06,1.2e-05,2e-06,-9e-06,3e-06,1.3e-05,8.3e-05,0,7e-06,0,-6e-06,2.3e-05,2.2e-05,2.5e-05,1e-05,3.4e-05,4e-06,-2.1e-05,-4.2e-05,1e-05,1.5e-05,-1.7e-05,5.8e-05,-3.1e-05,2.7e-05,2.4e-05,-1.5e-05
6e-06,3e-06,1e-06,3e-06,-1.6e-05,-1.4e-05,2.3e-05,-2.7e-05,5e-06,7e-06,1.8e-05,-2e-06,1e-06,1e-06,-2e-05,2.9e-05,0,-5e-06,1.3e-05,5e-06,2.4e-05,-3e-06,7e-06,-5e-06,1e-06,8e-06,-5e-06,1.4e-05,6e-06,-2.5e-05,5.5e-05,1e-06,3.1e-05,-2e-06,-1e-05,-4e-06,1e-05,6e-06,0,2e-06,-1.7e-05,-1e-05,-3.9e-05,-1e-05,-3.9e-05,1.4e-05,-1e-06,-5e-06,-3.4e-05,-3.7e-05,-4.2e-05,3e-06,-1.1e-05,-4e-06,-2e-06,-1.2e-05,-3e-06,2e-06,-2.7e-05,-1.4e-05,-9e-06,-5e-06,-5e-06,-5.1e-05,2.7e-05,-2e-05,3e-06,-1.8e-05,-1e-06,-1.6e-05,-1e-06,3.3e-05,4.7e-05,-3.2e-05,2.1e-05,-1.2e-05,-3.3e-05,0,-2e-06,-2e-06,8e-06,5.4e-05,1.9e-05,-1e-05,0,4.4e-05,-1e-05,1.9e-05,4e-06,-2.4e-05,1e-06,1.1e-05,1.6e-05,-8e-06,1.4e-05,-1.3e-05,-1e-06,4.2e-05,-1.7e-05,0,-3.7e-05,4e-06,-1.7e-05,-1.7e-05,0,-7e-06,-2.4e-05,-3e-06,1.5e-05,-3.3e-05,1e-06,1.9e-05,4.9e-05,7e-06,2.7e-05,1.1e-05,-1.9e-05,2e-06,-3.3e-05,-1.5e-05,2.2e-05
-4e-06,-3e-06,0,-1e-06,1.2e-05,1.1e-05,-3.1e-05,-4e-06,-3e-06,-9e-06,7e-06,0,1e-06,1e-06,1.5e-05,-3.2e-05,0,-1.3e-05,-2e-06,9e-06,-2.4e-05,-8e-06,-4e-06,1e-06,5e-06,4e-06,-4e-06,3e-06,-2e-06,1.2e-05,-5.2e-05,3e-06,-9e-06,1.6e-05,0,4e-06,-1.4e-05,4e-06,0,-3e-06,1.6e-05,6e-06,1.6e-05,1.4e-05,1.3e-05,-1e-06,5e-06,-1e-05,3e-05,3e-05,6e-06,8e-06,2e-06,-7e-06,-4e-06,2.4e-05,-8e-06,9e-06,2.6e-05,0,9e-06,1e-05,-1.1e-05,1.1e-05,-3.5e-05,2.1e-05,1.1e-05,2.8e-05,0,3.2e-05,3.1e-05,-3e-06,-2.1e-05,4e-06,-2.6e-05,-2e-06,-2.8e-05,-1e-06,2e-06,2e-05,-8e-06,-5.7e-05,-2.1e-05,5e-06,-1e-06,-3.6e-05,-2e-06,1.2e-05,3e-05,2.2e-05,6e-06,-3e-06,-2.4e-05,1.7e-05,1.6e-05,1e-05,-5e-06,-4.1e-05,1.4e-05,0,-5e-06,0,1e-05,1.3e-05,1.1e-05,-1.4e-05,6e-06,-3e-05,-3.5e-05,6e-06,-2e-06,-3e-06,-2.3e-05,-7e-06,-4.4e-05,-1e-06,-2.4e-05,1.4e-05,2.9e-05,1.1e-05,-8e-06
5e-06,-3e-06,0,-1e-06,5e-06,-6e-06,3e-06,1e-06,-1e-06,-1e-05,-3e-06,3e-06,-3e-06,4e-06,6e-06,1.9e-05,0,2e-05,3e-06,-2.8e-05,9e-06,-3e-06,7e-06,3e-06,-1e-05,-9e-06,-2e-06,-9e-06,-5e-06,8e-06,2.4e-05,-8e-06,0,-2e-06,1.4e-05,-1e-06,-1.5e-05,-1.3e-05,0,3e-06,2e-06,-1.4e-05,-1.1e-05,-1.2e-05,3e-06,-1e-05,-4e-06,0,3e-06,-1.9e-05,2.3e-05,-5e-06,0,6e-06,4e-06,-1.4e-05,2.1e-05,-7e-06,-1.3e-05,1e-05,-5e-06,3e-06,-9e-06,2.9e-05,4.6e-05,-1.5e-05,-1.6e-05,-1.7e-05,1e-06,-6.5e-05,-2.6e-05,-5e-06,-4e-06,2e-05,3.1e-05,-1e-06,-3.7e-05,2e-06,1.8e-05,8e-06,-2e-06,3.9e-05,8e-06,8e-06,-3e-06,1.4e-05,2.2e-05,-2.7e-05,-7e-06,-8e-06,3e-06,-1e-06,3.3e-05,-7.3e-05,-2.5e-05,-2e-05,6e-06,-1.7e-05,-4e-06,-6e-06,1.6e-05,-4e-06,7e-06,1.1e-05,7e-06,1e-06,1.4e-05,1.4e-05,5.1e-05,1e-06,-3e-06,-1.2e-05,-2.2e-05,-1e-06,2.4e-05,-2e-06,-6e-06,1e-05,-2e-05,-9e-06,-1.5e-05
-4e-06,-1e-06,-1e-06,2e-06,-1e-05,1e-06,-2e-06,2.1e-05,3e-06,1e-05,-2.1e-05,-4e-06,6e-06,-2e-06,-1.2e-05,0,0,-1.9e-05,-9e-06,-1.2e-05,1e-06,-9e-06,-7e-06,0,4e-06,5e-06,4e-06,-4e-06,1e-06,-1.5e-05,0,8e-06,7e-06,-1.3e-05,1e-05,-2e-06,2.6e-05,1.9e-05,-1e-06,1.5e-05,-1.5e-05,6e-06,3e-05,1e-06,-7e-06,3e-06,2e-06,9e-06,-1.8e-05,1.2e-05,-3.5e-05,-4e-06,6e-06,5e-06,4e-06,-1.7e-05,-3e-05,0,-2e-05,3e-06,1e-06,-3e-06,-2e-06,-2.2e-05,-4.9e-05,1.3e-05,8e-06,-2e-06,3e-06,7.3e-05,5e-06,3e-06,2.5e-05,-2.1e-05,-2.3e-05,1.1e-05,2e-06,1e-06,-1.8e-05,-8.7e-05,1e-06,-1.5e-05,3e-06,-8e-06,3e-06,0,-3e-05,-1.5e-05,-1.7e-05,-5e-06,-7e-06,5e-06,-2.6e-05,8.3e-05,1.5e-05,2.5e-05,7e-06,2.4e-05,-3e-06,-2e-06,-6e-06,3e-06,-2.1e-05,-2.6e-05,1e-06,1.3e-05,-3.1e-05,-7e-06,-4.2e-05,1.5e-05,1e-06,8e-06,5.9e-05,1.1e-05,-7e-06,8e-06,3.8e-05,7e-06,1.7e-05,6e-06,3.1e-05
2e-06,1e-06,0,-2e-06,-7e-06,5e-06,1.1e-05,-1.1e-05,-6e-06,8e-06,1.5e-05,0,-4e-06,-2e-06,1e-06,-1.1e-05,0,1.2e-05,-2e-06,-4e-06,1.5e-05,5e-06,8e-06,1e-06,1e-06,1e-06,2e-06,4e-06,5e-06,9e-06,-6e-06,-5e-06,-1.1e-05,2e-06,-3.3e-05,2e-06,1e-06,-6e-06,0,-1.7e-05,6e-06,-2e-06,-3.9e-05,6e-06,1.8e-05,5e-06,2e-06,4e-06,8e-06,-4e-06,2.7e-05,1e-06,-5e-06,-5e-06,-4e-06,2.5e-05,2.7e-05,1e-06,4.1e-05,1e-06,3e-06,1e-06,0,-8e-06,3.4e-05,-8e-06,-6e-06,9e-06,1e-06,-5.6e-05,2.7e-05,-5e-06,-3.5e-05,1.8e-05,6e-06,-1.4e-05,4.1e-05,-1e-06,4.1e-05,6.2e-05,-4e-06,3e-06,-1e-05,-2e-06,-2e-06,0,1.6e-05,1.4e-05,-1.8e-05,1e-05,-2e-06,-8e-06,5e-06,-2.5e-05,-1.5e-05,-2.7e-05,-8e-06,-2e-05,1e-06,3e-06,-5e-06,1e-06,1.6e-05,1.7e-05,-5e-06,1e-06,1.9e-05,1.6e-05,4e-06,-7e-06,4e-06,-1.2e-05,-5.5e-05,-1.8e-05,-5e-06,-6e-06,-3e-06,-8e-06,-1.2e-05,1e-06,-7e-06
-2e-06,0,1e-06,0,2.5e-05,-7e-06,1.5e-05,-1.2e-05,-4e-06,-8e-06,5e-06,3e-06,3e-06,2e-06,6e-06,1e-05,0,-2e-06,9e-06,1.8e-05,-2.5e-05,-6e-06,-8e-06,-3e-06,-8e-06,-1e-06,-3e-06,7e-06,0,-8e-06,1e-06,1e-06,1.6e-05,1.1e-05,4e-06,0,-2.5e-05,-3e-06,0,-2e-06,1e-05,1.1e-05,1.8e-05,-1.1e-05,-2.6e-05,-2e-06,-4e-06,-6e-06,-2e-06,-9e-06,3e-06,7e-06,4e-06,-5e-06,2e-06,0,-2.6e-05,-1e-06,-3.1e-05,-1e-05,-7e-06,1e-05,-3e-06,2.7e-05,-2.5e-05,2e-06,3e-06,-1e-06,-4e-06,4.1e-05,-2.7e-05,4e-06,3.9e-05,2e-06,1e-06,2e-06,2.8e-05,0,-1.7e-05,4.3e-05,-3e-06,0,1.6e-05,5e-06,3e-06,-3e-06,4e-06,2.5e-05,-7e-06,-9e-06,1e-05,9e-06,8e-06,-3.7e-05,-4e-06,2.9e-05,-7e-06,2.6e-05,4e-06,2e-06,6e-06,1e-06,-9e-06,1e-06,-4e-06,-1.2e-05,1.2e-05,-4e-06,3.2e-05,-1.5e-05,-1e-06,2e-05,1.7e-05,-3e-06,1.6e-05,1e-05,-2.7e-05,-1.4e-05,4e-06,-7e-06,-1.3e-05
1e-06,2e-06,0,1e-06,-2.6e-05,4e-06,-2.9e-05,6e-06,1e-06,-3e-06,3e-06,-3e-06,0,-5e-06,-2e-06,-3e-06,0,-6e-06,-6e-06,1.6e-05,1.3e-05,5e-06,6e-06,-3e-06,3e-06,-1e-06,-3e-06,-3e-06,-2e-06,6e-06,-3e-06,2e-06,-2e-05,-1e-06,7e-06,-2e-06,1.3e-05,1.4e-05,0,9e-06,-1.1e-05,-5e-06,1.2e-05,1e-05,1.9e-05,-8e-06,5e-06,-5e-06,1.1e-05,2.1e-05,-2.3e-05,-2e-06,-1e-05,7e-06,-1e-06,-2.4e-05,1.7e-05,2e-06,-1.4e-05,1e-06,8e-06,-1.4e-05,-1e-06,-2.4e-05,1.3e-05,2e-06,2e-06,-1.3e-05,0,-2.6e-05,5e-06,2e-06,-3.3e-05,-1.8e-05,-1e-06,9e-06,1.1e-05,0,1.9e-05,-6.2e-05,3e-06,4e-06,-3e-06,-2e-06,-2e-06,-2e-06,-1.5e-05,-7e-06,2.1e-05,3e-06,1e-06,-9e-06,-4e-06,7.4e-05,2e-06,-2.8e-05,9e-06,-5e-06,-3e-06,3e-06,1.8e-05,0,0,-9e-06,-1e-06,8e-06,-1.5e-05,-8e-06,-4.6e-05,2.1e-05,-2e-06,-1.4e-05,3e-05,2.5e-05,-2e-05,-8e-06,3e-06,-2e-06,3e-06,1e-05,1.3e-05
0,2e-06,0,-1e-06,1.4e-05,-1e-06,6e-06,7e-06,-2e-06,3e-06,-1.9e-05,0,-3e-06,4e-06,-5e-06,-4e-06,0,1e-05,2e-06,-1.1e-05,-3e-06,-5e-06,-8e-06,2e-06,2e-06,0,-1e-06,-9e-06,-1e-06,-6e-06,1.6e-05,-2e-06,7e-06,-9e-06,2e-05,0,1.5e-05,-1.8e-05,0,-2e-06,-2e-06,1e-06,-1.6e-05,-8e-06,-5e-06,9e-06,-4e-06,3e-06,-9e-06,-2.8e-05,3.5e-05,-7e-06,3e-06,1e-06,1e-06,5e-06,-4e-06,2e-06,5.6e-05,1e-06,-7e-06,1e-05,5e-06,1.5e-05,0,-5e-06,-4e-06,1.4e-05,-2e-06,8e-06,1.8e-05,-9e-06,2.1e-05,1.9e-05,9e-06,-1.1e-05,-2.5e-05,-1e-06,-1.7e-05,9e-06,1e-06,0,-1.1e-05,-5e-06,0,1.3e-05,1.8e-05,-2.1e-05,1.1e-05,3e-06,-1.1e-05,5e-06,-5e-06,-7.6e-05,7e-06,2.1e-05,4e-06,-4.5e-05,-5e-06,-3e-06,-5.3e-05,-1e-06,1e-05,6e-06,4e-06,1e-06,1e-05,-6e-06,3.8e-05,-8e-06,-1e-06,1e-06,-5.7e-05,-5e-06,2.4e-05,6e-06,2.1e-05,7e-06,-8e-06,-1.3e-05,-8e-06
-1e-06,2e-06,-1e-06,1e-06,-3e-06,3e-06,3e-06,3e-06,-1e-06,1e-06,1.1e-05,1e-06,4e-06,0,9e-06,3e-06,0,-8e-06,-1e-06,-2e-06,1.5e-05,0,7e-06,4e-06,-5e-06,3e-06,4e-06,4e-06,2e-06,6e-06,-2.7e-05,4e-06,1.1e-05,1e-06,-7e-06,2e-06,-1.7e-05,4e-06,0,4e-06,1.6e-05,-1e-05,1e-06,3e-06,-1e-06,0,2e-06,2e-06,-9e-06,3.2e-05,-2.2e-05,3e-06,1.2e-05,-3e-06,-6e-06,1.3e-05,-5e-06,-5e-06,-4.6e-05,5e-06,2e-06,-4e-06,4e-06,-2e-05,-1.7e-05,8e-06,2e-06,-3e-06,5e-06,2.2e-05,-2.8e-05,3e-06,-2e-06,-1.5e-05,-1.8e-05,6e-06,-4.5e-05,-1e-06,-1.5e-05,-1.4e-05,-3e-06,-1.3e-05,1.2e-05,5e-06,-1e-06,-1.8e-05,-1.5e-05,-1e-06,1.9e-05,-5e-06,2e-06,-3e-06,1e-05,2.9e-05,-3e-06,-1.8e-05,-3e-06,3.7e-05,9e-06,0,6.6e-05,0,-1.3e-05,-1e-06,6e-06,-1.3e-05,-1.1e-05,5e-06,-2e-05,3e-06,2e-06,3e-06,4.9e-05,-1.5e-05,-9e-06,-2e-06,4e-06,1e-05,1.1e-05,1.8e-05,-8e-06
2e-06,0,0,0,6e-06,-8e-06,8e-06,-1.6e-05,3e-06,1e-06,3e-06,-1e-06,-1e-06,2e-06,-4e-06,5e-06,0,2e-06,7e-06,3e-06,-2.6e-05,3e-06,-7e-06,1e-06,1e-06,-3e-06,4e-06,6e-06,0,-6e-06,2.6e-05,-7e-06,-1.6e-05,9e-06,-2.3e-05,-2e-06,1e-06,1e-06,0,-7e-06,-1.2e-05,5e-06,-4e-06,0,4e-06,-2e-06,0,2e-06,1.9e-05,-3.4e-05,0,3e-06,-3e-05,-2e-06,7e-06,-9e-06,1.6e-05,4e-06,2e-06,2e-06,3e-06,-8e-06,0,1.4e-05,2.6e-05,-1.2e-05,-3e-06,-2e-06,2e-06,-4.7e-05,9e-06,1.1e-05,-1.7e-05,0,1.9e-05,-1e-06,-3e-06,1e-06,3e-06,3.5e-05,0,2.5e-05,-3e-06,-1e-06,3e-06,1.6e-05,7e-06,1.8e-05,-3e-06,3e-06,6e-06,1e-06,-3e-06,3.1e-05,1e-06,2.4e-05,-7e-06,-1e-06,-6e-06,-4e-06,-5.6e-05,1e-06,-5e-06,5e-06,2e-06,1.4e-05,1e-05,9e-06,-6e-06,-8e-06,1e-06,-4e-06,-9e-06,6e-06,-9e-06,-5e-06,-2.9e-05,8e-06,-1.3e-05,-2.1e-05,1.1e-05
-3e-06,-2e-06,0,0,-2.3e-05,1e-05,9e-06,4e-06,2e-06,0,7e-06,0,-1e-06,-3e-06,-6e-06,-1.2e-05,0,3e-06,-8e-06,-3e-06,1.3e-05,-7e-06,9e-06,-2e-06,0,-2e-06,0,-1e-06,-2e-06,9e-06,-1.6e-05,5e-06,1.1e-05,0,1.2e-05,0,6e-06,-8e-06,0,-4e-06,-8e-06,-2e-06,2.7e-05,-5e-06,-1.5e-05,-5e-06,-2e-06,0,-1.1e-05,3.5e-05,1.6e-05,2e-06,4.4e-05,2e-06,-3e-06,-6e-06,-2.4e-05,-1e-05,3.4e-05,-4e-06,-7e-06,1.2e-05,3e-06,7e-06,-2.7e-05,1.3e-05,3e-06,2e-06,-4e-06,5e-05,1.3e-05,-1.6e-05,2.7e-05,1.6e-05,-1.6e-05,-2e-06,8e-06,0,-2.7e-05,2.7e-05,0,-3.1e-05,-7e-06,-2e-06,-2e-06,-9e-06,6e-06,1e-06,-1.1e-05,-1e-06,-1e-06,2e-06,-1.1e-05,-4.6e-05,7e-06,-2.1e-05,2e-06,-2.7e-05,0,4e-06,4e-05,1e-06,1.6e-05,-1.9e-05,-4e-06,6e-06,1.1e-05,1e-06,3.4e-05,5e-06,-1e-06,1.1e-05,-3.5e-05,5e-06,1.6e-05,8e-06,6e-06,-5e-06,1.2e-05,2e-05,1e-06
