-4.3e-05,-1.1e-05,-2.2e-05,-5.5e-05,-6.7e-05,-0.000272,-0.003435,-0.008182,-0.041715,-0.103618,-0.172636,-0.197832,-0.16518,-0.1824,-0.168868,-0.118437,-0.059934,-0.015556,-0.005177,-0.003211,-0.001722,-0.003704,-0.008324,-0.008238,-0.001879,-0.000461,-0.000495,-0.001683
-3.7e-05,-6e-06,-1.2e-05,-5e-05,-7.3e-05,3.4e-05,-0.001109,-0.004508,-0.015165,0.020849,-0.06202,-0.015263,0.145488,0.127523,0.122888,0.111965,0.054004,0.014546,0.006626,0.001921,0.000615,0.000571,0.001253,-0.000343,-0.000929,-0.000342,-0.000713,-0.002736
2.4e-05,5e-06,-5e-06,-4e-06,-1.8e-05,1.9e-05,0.001068,0.002562,-0.009557,-0.035271,-0.080665,-0.069643,-0.013778,-0.003208,-0.011375,-0.018413,-0.012152,-0.005642,-0.00337,-0.001018,-0.00023,0.001551,0.005051,0.003468,0.00037,7.8e-05,-0.000119,-2.6e-05
5.4e-05,1.3e-05,1.6e-05,4.9e-05,5.2e-05,-5.3e-05,0.001398,0.005614,-0.008298,-0.078403,-0.017614,-0.0402,-0.129558,-0.140179,-0.130823,-0.090229,-0.041933,-0.011723,-0.004738,-0.001761,-0.000195,0.000322,-0.000686,-0.000303,0.000747,0.000317,0.000334,0.001572
1.8e-05,9e-06,3e-05,6.4e-05,8e-05,0.000168,0.000488,0.001096,0.016455,0.068764,0.179332,0.182933,0.135873,0.141095,0.136286,0.104409,0.059678,0.017875,0.007501,0.003624,0.001262,0.000246,-0.001133,0.000651,0.000864,0.00021,-0.00016,-0.000684
-4.7e-05,-1.2e-05,1e-06,1.6e-05,2.2e-05,6.9e-05,-0.001424,-0.005321,-0.008708,0.009542,0.037872,0.03981,0.041887,0.073653,0.060981,0.014741,0.003768,0.001203,-0.001127,-0.000133,-0.00075,-0.001045,0.000817,0.001557,-0.000109,-0.000229,-0.001,-0.003788
-3.7e-05,-9e-06,-8e-06,-2e-05,-3.6e-05,-0.000153,-0.000889,-0.002398,-0.027216,-0.10997,-0.151346,-0.154652,-0.157568,-0.173931,-0.158089,-0.101117,-0.056564,-0.014981,-0.00468,-0.003314,-0.000989,-0.000193,0.000413,-0.000816,-0.00063,-0.000146,-0.000638,-0.002774
2.5e-05,8e-06,-4e-06,-2.4e-05,-4.7e-05,-4.5e-05,0.001003,0.003394,0.021176,0.018745,-0.042564,-0.013115,0.040741,0.023629,0.023802,0.040552,0.026589,0.00797,0.004106,0.001393,0.000902,0.001326,0.00066,-0.000778,-0.000174,0.000117,0.000286,0.000833
4.7e-05,9e-06,-1.1e-05,-1.5e-05,-2.3e-05,6.6e-05,0.000748,0.002683,0.033473,0.063549,0.021096,0.057723,0.093628,0.11125,0.09233,0.040595,0.018955,0.002793,-0.000501,0.001064,-0.00012,-0.000514,-0.000499,0.000596,0.00039,7.5e-05,0.000352,0.001684
1.3e-05,3e-06,9e-06,1.8e-05,2.4e-05,5e-06,-0.00029,-0.00032,-0.008599,-0.047323,-0.004112,-0.002423,-0.069934,-0.092322,-0.073274,-0.043238,-0.025664,-0.006266,-0.002531,-0.001336,-0.000323,-0.000401,-0.000299,0.000483,0.000371,5.6e-05,-0.000147,-0.000469
-2.9e-05,-3e-06,2.2e-05,3.8e-05,4.5e-05,2.9e-05,-0.000678,-0.002697,-0.014627,-0.00736,0.062105,0.026059,-0.006072,-0.009166,-0.006193,0.006179,0.011976,0.002508,0.002093,0.000697,0.000398,0.000263,6.1e-05,-0.000537,-0.000206,-6.7e-05,-0.000418,-0.001776
-1.5e-05,1e-06,9e-06,2.9e-05,3.5e-05,7.2e-05,-8.5e-05,-0.001544,-0.003968,0.03285,0.0352,0.01031,0.061485,0.114162,0.081562,0.0233,0.011354,0.003309,0.000674,0.000832,-8e-05,0.000329,0.001791,0.001253,-3e-06,-4.9e-05,-8.5e-05,-0.000482
2.6e-05,9e-06,-2e-06,1e-06,-1e-06,-4.5e-05,0.000749,0.002222,-0.017965,-0.065787,-0.065338,-0.043586,-0.054814,-0.059708,-0.04405,-0.019837,-0.023931,-0.004868,-0.00203,-0.001824,-0.000147,0.000501,0.000455,-5.1e-05,0.000103,2.9e-05,0.000453,0.001552
3.3e-05,7e-06,-9e-06,-3.2e-05,-4.3e-05,-4.9e-05,0.000263,0.001709,-0.003391,-0.037904,-0.028182,0.010516,-0.03633,-0.079911,-0.057406,-0.007065,0.004662,0.000145,-0.000148,-0.000142,0.000172,-0.001168,-0.003142,-0.002276,-0.000269,2.3e-05,0.00035,0.001581
-5e-06,-5e-06,-1.3e-05,-3.2e-05,-4.2e-05,2.9e-05,-0.000601,-0.001506,0.020949,0.079949,0.046395,0.054064,0.074318,0.079393,0.053587,0.017761,0.020639,0.005384,0.001159,0.00177,0.000131,-0.000772,-2.8e-05,0.000998,6.5e-05,-2.4e-05,-0.000163,-0.000323
-3e-05,-9e-06,0,4e-06,5e-06,9e-06,-0.000314,-0.001378,-5.1e-05,0.020732,-0.009852,-0.024426,0.008802,0.012074,0.011767,0.003429,-0.010722,-0.001283,-0.000187,-0.000571,0.000193,0.001972,0.003959,0.002874,0.000542,0.000117,-0.000252,-0.001247
-2.3e-05,-6e-06,4e-06,2.5e-05,2.7e-05,-2.6e-05,0.000169,0.00011,-0.014572,-0.053825,-0.061544,-0.089576,-0.061272,-0.061639,-0.047805,-0.022814,-0.00973,-0.002865,-0.000577,-0.001198,-0.000273,-5.4e-05,-0.000623,-0.000576,-6.6e-05,-4.7e-05,4.7e-05,2.5e-05
1.5e-05,7e-06,8e-06,2.4e-05,2.5e-05,8e-06,0.000319,0.001473,0.01404,0.021476,0.005765,-0.010677,0.01491,0.050861,0.032987,0.002648,0.008579,0.000487,0.001089,0.001027,-0.000462,-0.001763,-0.002787,-0.001778,-0.000268,-8.3e-05,0.000296,0.001179
1.7e-05,4e-06,2e-06,2e-06,-1e-06,-2e-06,9.9e-05,0.001128,0.014022,0.019855,0.030429,0.067407,0.028562,0.02238,0.03388,0.024883,-0.003178,-0.000267,-3.1e-05,-2.2e-05,0.000274,0.000195,0.000258,-0.000492,-0.000261,1e-06,0.000126,0.00046
