-5.7e-05,0.00016,-8.9e-05,0.000158,2e-05,1.5e-05,-0.000172,-1e-05,-5.5e-05,-4.9e-05,5e-06,4.5e-05,0.000232,5.4e-05,0.000111,-8.7e-05,-0.000101,-0.00012,-9.7e-05,-4.7e-05,-7.5e-05,0.00013,4.1e-05,-8.4e-05,3.8e-05,7.2e-05,1.1e-05,0.000155,0.000189,6.9e-05,-8.8e-05,9.3e-05,0.000196,0.000167,-9e-06,0.000126,0.000167,-4.8e-05,-0.000194,-4.2e-05,-2.6e-05,-9.8e-05,0.000246,8e-05,0.000166,0.000157,6.7e-05,-0.000216,-0.000275,2.1e-05,0.000104,9.3e-05,0.000218,6.6e-05,-0.000117,4.9e-05,9.6e-05,9.1e-05,-0.000122,7e-05,3.6e-05,-1.7e-05,-2e-05,0.000132,-3.8e-05,-7.7e-05,-0.000219,-0.000111,-0.000245,-0.000102,6e-06,2.7e-05,0.000115,0.000286,0.000143,0.000221,0.000141,-0.000108,-0.00012,-6.5e-05,0.000163,-1e-06,0.000132,-7.1e-05,-0.000121,-4.2e-05,-8.6e-05,9e-05,-5.1e-05,-1.8e-05,7.7e-05,-9.7e-05,-2.3e-05,-0.000118,-9.4e-05,-8.6e-05,-0.000186,-7e-06,-7e-05,-0.000228,-0.000166,-0.000134,-0.000118,-0.000214,-3.4e-05,2.2e-05,-6.8e-05,-5e-06,-2.1e-05,-6.1e-05,-3.1e-05,2.8e-05,-3e-05,-0.000331,-0.000119,-5.7e-05,-0.000137,-0.000133,8.7e-05,9e-06,0.000142
-0.000274,-0.00024,-0.000242,-0.000327,-0.000327,-2e-05,6.6e-05,7e-06,-2.1e-05,-0.000137,-0.000178,-0.000181,-0.000277,-0.000114,-0.000296,-0.000217,-9.3e-05,1.3e-05,-0.00015,-0.000132,-0.000102,-0.000275,-0.000156,-1.9e-05,-0.000253,-0.00022,-0.000294,-0.00025,-0.00018,-0.00016,1.4e-05,-0.000235,-7.1e-05,-0.000271,-7.9e-05,-0.000194,-0.000366,-0.000183,-0.000148,0.000101,-0.000226,-4.6e-05,-0.00013,-0.000438,-0.000329,-0.000293,-0.000111,0.000112,-7e-06,-0.000163,-2.9e-05,-0.000152,-0.000332,-0.000191,-8.7e-05,1e-06,-0.000185,-7.3e-05,2.4e-05,-0.000383,-0.000223,-0.000167,2.6e-05,-0.000266,-0.000277,-0.000118,7.3e-05,0.000103,-7.8e-05,-5e-06,-8.4e-05,-7.7e-05,-0.000228,-0.000415,-0.000247,-7.5e-05,-1e-04,-1.9e-05,-1e-05,-0.000105,-0.000164,-0.000222,-0.00022,-9.2e-05,2e-06,0.000133,-5.3e-05,-0.000188,-0.000162,-4e-05,-0.000124,-0.000177,0.00011,8.8e-05,-0.000239,-0.000122,-9.2e-05,-0.000373,-0.000219,-0.000148,7.6e-05,-5.3e-05,-6.4e-05,8.9e-05,7.3e-05,-1.3e-05,0.000264,0.000263,-1.2e-05,-8.8e-05,-6e-05,-0.000126,7e-06,0.000262,-0.000212,-0.000148,-0.000116,-3.5e-05,-0.000191,-2.7e-05,-0.000188
-8.8e-05,0.000144,-0.000148,-0.000195,-6.2e-05,1e-04,-7.1e-05,-0.00011,-9.6e-05,6.3e-05,-0.000206,-0.00013,7.5e-05,-3e-06,-0.00013,-5.7e-05,0,-8.3e-05,4.2e-05,-6.5e-05,9.8e-05,8.3e-05,2.5e-05,-9.5e-05,-1.9e-05,0.00012,-0.000194,0.000112,3e-06,8.1e-05,0.000168,-2.1e-05,-4.1e-05,-0.000146,-0.000171,-0.000223,-0.000188,-7e-05,-0.000136,-0.000143,-3.8e-05,8e-06,-0.000212,0.000197,0.000109,-0.000104,-8.1e-05,-3e-06,6.1e-05,-0.000154,-0.000184,-6e-05,-5.6e-05,-1e-06,5.1e-05,-1.7e-05,-0.00025,-0.000165,-0.000138,4.7e-05,0.000139,-4.4e-05,-0.000128,-0.000116,-9.5e-05,-4e-06,-0.000289,-0.000225,5.7e-05,1.7e-05,-3.5e-05,-0.000155,-0.000206,-0.000189,2.2e-05,8e-06,-0.000161,-0.00019,-0.00014,7e-06,-5.3e-05,-0.000201,1.1e-05,2.9e-05,-0.000157,-0.000119,-6.8e-05,-0.000211,1.9e-05,-5.4e-05,3e-06,0.000117,0,3e-05,0.000305,0.000115,1.3e-05,-0.000147,2.5e-05,0.000109,4.2e-05,2.9e-05,0.000138,-6.1e-05,2.4e-05,-9e-06,-7.1e-05,-0.000325,-3.2e-05,0.000131,-4.4e-05,-0.000116,-8.2e-05,-0.000231,-3.1e-05,1.3e-05,-2.1e-05,-2.4e-05,-0.000284,-0.000149,-0.000188
0.000118,6e-06,0.000115,-9.1e-05,7.7e-05,-1.2e-05,1.1e-05,1.5e-05,1.7e-05,0.000146,0.000169,0.000331,-9e-06,-5e-06,0.000226,-4.1e-05,-5.1e-05,4.1e-05,8e-06,8e-06,-0.000133,0.000165,5.8e-05,2.4e-05,0.000203,9e-05,0.000156,-9e-05,0.00013,-8.7e-05,-0.000264,-9.4e-05,4.1e-05,0.000101,2.6e-05,-4.3e-05,-4.2e-05,6e-06,0.000231,7.7e-05,-6e-05,-9.7e-05,-0.00011,0.00013,0.000142,-8.6e-05,5e-05,-1e-04,-7.8e-05,0.000106,-4.9e-05,1.8e-05,6.2e-05,0.000145,1.2e-05,-4.9e-05,3.4e-05,-1.3e-05,-2.9e-05,-3.7e-05,1e-06,-0.000146,8.3e-05,-1.4e-05,0.000134,0.000117,0.000153,-4e-06,1.3e-05,8.5e-05,4.4e-05,0.000117,-4.9e-05,5.4e-05,-7.5e-05,-1e-04,-0.00014,-0.00011,0.00014,6.1e-05,3.6e-05,0.000155,7.8e-05,7.9e-05,7.1e-05,7.2e-05,-6e-05,0.000164,3.8e-05,5.4e-05,0.00011,0.000117,8.3e-05,8e-06,-1.1e-05,-0.00012,-4.3e-05,0.000123,7e-06,-1.6e-05,-1.1e-05,4.7e-05,-3e-05,8.6e-05,2.4e-05,-0.000241,-5.8e-05,6.9e-05,-6e-06,-0.000113,-0.000213,-0.000164,-0.000113,9e-05,0.000162,6e-05,2.7e-05,5.4e-05,7.7e-05,0.000137,8.5e-05
-4.4e-05,-0.00013,8e-05,0.000104,1.7e-05,8.2e-05,2.7e-05,-6.5e-05,4.9e-05,-6.2e-05,7.9e-05,-0.00014,-0.000173,4.2e-05,8.1e-05,-6.5e-05,1.3e-05,-6.5e-05,5e-06,9e-06,5.5e-05,-9.8e-05,-0.000151,-2.1e-05,-8e-06,-0.000124,3e-06,-4.6e-05,-1.1e-05,5.3e-05,0.000135,8.8e-05,-4.1e-05,1.6e-05,4.8e-05,-3.3e-05,0.000107,-0.000124,-0.000126,-5.7e-05,3.6e-05,0.000156,6.2e-05,-6.8e-05,-0.000136,7.3e-05,4.7e-05,5.6e-05,-7.7e-05,8e-06,2.5e-05,4.9e-05,-1.4e-05,-0.000113,-3.7e-05,-7.5e-05,8.4e-05,5.1e-05,0.000229,0.000102,-2.2e-05,0.000106,5.9e-05,-0.000119,5.5e-05,-7.5e-05,-5e-05,-5.1e-05,-6.6e-05,6e-06,-0.000105,-7.7e-05,-8.7e-05,9.9e-05,5.8e-05,-6e-06,2e-06,0.000196,0.000152,-4.8e-05,-2.6e-05,0.000114,-0.00011,3.3e-05,8.7e-05,0.000113,-5.7e-05,7.9e-05,4.9e-05,4.1e-05,5.9e-05,-5.5e-05,-2.3e-05,1.5e-05,9.9e-05,-4.5e-05,-1.7e-05,-3.4e-05,4.7e-05,-5.1e-05,-2.7e-05,2e-06,-6.9e-05,-9.8e-05,-0.000224,-5.9e-05,-3.3e-05,-0.000238,5.9e-05,-2.2e-05,7.1e-05,9e-05,7.2e-05,-6.5e-05,-0.000131,-4.8e-05,2.2e-05,-6.9e-05,-9.1e-05,-7.3e-05,-1.3e-05
-1.4e-05,6.2e-05,-6.2e-05,5.4e-05,0.000142,2.9e-05,-3.1e-05,0.000131,-6.4e-05,1.6e-05,-9e-05,-7.9e-05,-7.2e-05,1.8e-05,-2e-06,-1.8e-05,0.000116,4.3e-05,-4e-05,-2e-05,0.000108,-6.1e-05,-0.000129,-5.8e-05,-1e-04,-3e-05,-0.000113,0.000107,-0.00015,-9.4e-05,-0.000203,-9.5e-05,3.9e-05,6.4e-05,-0.000115,2e-05,8.7e-05,0.000169,-1e-05,5.2e-05,-1.3e-05,-8.5e-05,9e-06,-0.000116,-7.7e-05,9.8e-05,0.000184,-5.8e-05,-4e-06,2e-06,6.9e-05,-1.3e-05,0.000149,4.4e-05,-7e-06,0.000117,9.5e-05,0.000142,7.2e-05,-6.9e-05,-5.7e-05,1e-05,-7e-05,3.8e-05,-8.2e-05,2e-05,-5.5e-05,-2e-05,1.2e-05,-8.2e-05,-1.2e-05,-3.6e-05,0.000204,1e-05,8.3e-05,0.000189,0.000171,2.2e-05,-1.2e-05,-1.5e-05,-9.1e-05,-3.4e-05,-9.1e-05,-0.000124,-6.4e-05,6.9e-05,4.4e-05,-4.1e-05,-3e-06,-8.7e-05,-0.000105,-0.000103,-1.8e-05,-0.000112,-2.2e-05,8.8e-05,9.7e-05,3.7e-05,-5e-06,0.000119,5.6e-05,-5.6e-05,-3.1e-05,6e-05,0.00012,0.000111,4.8e-05,3.6e-05,3.8e-05,-3.6e-05,-3.5e-05,0.000132,0.000127,-3.2e-05,-4e-05,-7.3e-05,-7e-06,-1.3e-05,2.7e-05,0.000105,5.1e-05
-7.2e-05,7.7e-05,1.8e-05,-9.4e-05,-6.9e-05,-1.6e-05,-2.7e-05,-5.7e-05,-8e-05,8.4e-05,-4e-05,-7.8e-05,3.9e-05,1.4e-05,-4.4e-05,-1e-06,-1e-06,-0.000122,-1.6e-05,6e-05,-8.8e-05,1.3e-05,2e-05,-6.5e-05,4.4e-05,0.000124,0.000108,0.000125,3.1e-05,-0.000107,-7.2e-05,5e-06,0.000149,3.4e-05,-9.5e-05,0.000109,-0.000109,-1.7e-05,5e-05,0.000136,4.2e-05,-3e-05,-1.1e-05,3.4e-05,0.000222,-2.2e-05,-0.000144,1.2e-05,-0.000178,-2.2e-05,1.1e-05,-5.4e-05,3e-06,1.2e-05,8.9e-05,-5e-06,2.8e-05,-1.7e-05,-4.8e-05,-6.6e-05,0.00014,-7.9e-05,-8.2e-05,3.1e-05,-5e-06,8.1e-05,6.1e-05,8.7e-05,5.3e-05,-1e-06,-1.2e-05,-0.000175,-6.5e-05,2.1e-05,-0.000228,-5.6e-05,4.3e-05,-5.7e-05,-0.000129,-2.5e-05,1.1e-05,-9.1e-05,6.4e-05,-6.8e-05,-0.000141,-2.6e-05,2.7e-05,-5.2e-05,-2e-06,4.2e-05,2.8e-05,6.9e-05,-1.8e-05,-6e-06,6e-06,1.9e-05,3.5e-05,-8e-06,3.1e-05,-5.8e-05,9.7e-05,8.8e-05,-8e-06,4.9e-05,-2.4e-05,-5.6e-05,-1e-04,-0.000113,-0.000141,-3.2e-05,4.4e-05,-5.9e-05,-0.000164,-7.3e-05,-7.5e-05,1.9e-05,-0.00014,-9e-06,3.1e-05,-1e-06,-9.7e-05
1e-05,-4.8e-05,9e-06,-6.6e-05,-6.1e-05,-8e-05,-1.5e-05,1.2e-05,1.9e-05,7e-06,5.9e-05,9.3e-05,-4e-05,-0.000194,-5.3e-05,-3e-06,-0.000102,-6.5e-05,-4e-05,1.5e-05,-5.8e-05,-9.9e-05,8e-05,-4.9e-05,-3.8e-05,-1.5e-05,-3.9e-05,-5.9e-05,-5.5e-05,7.6e-05,6.8e-05,-6.1e-05,-5e-05,-8.2e-05,6.3e-05,-1.2e-05,-7.7e-05,-1.7e-05,-4.3e-05,-5.8e-05,-4.1e-05,-5.2e-05,-2e-06,8.1e-05,-6.4e-05,5.1e-05,-3.7e-05,-7e-05,0.000149,6.7e-05,-3.9e-05,3e-06,-3e-05,-9e-06,-6e-05,-8.7e-05,-8e-06,-9.5e-05,-8.2e-05,-5.7e-05,-0.000203,4.6e-05,-5e-05,4e-06,1e-06,-5.1e-05,7e-06,-1e-06,2.9e-05,3.2e-05,2e-05,2.8e-05,-5.1e-05,-8e-05,-0.000114,-9.5e-05,3.5e-05,-2.1e-05,6.3e-05,6e-05,1.1e-05,3.2e-05,9.4e-05,4.4e-05,-3e-06,-8e-05,-0.000104,-2.5e-05,-6.1e-05,-6.2e-05,1.4e-05,3e-06,-3e-06,-9.3e-05,-5.9e-05,-0.000159,-0.000157,-0.000132,-9.6e-05,5.4e-05,-0.000122,-4.3e-05,3.8e-05,-6.6e-05,1.9e-05,6.1e-05,6.1e-05,-2.1e-05,-7e-05,-2.8e-05,5.6e-05,6.9e-05,-2.9e-05,-2.1e-05,-3.2e-05,-1.8e-05,1.8e-05,1.6e-05,-2.1e-05,-5e-05,4.7e-05
-4e-06,-0.00017,-0.000116,1.4e-05,1.1e-05,-8.5e-05,3.9e-05,-6e-05,2e-06,-6.6e-05,-5.8e-05,-1e-06,-6e-05,-1e-06,-3.6e-05,-3.6e-05,-7.7e-05,8.6e-05,4.2e-05,-7.6e-05,-2e-06,7e-05,-3.1e-05,0.00013,5.4e-05,-8.8e-05,-7.5e-05,-0.000103,-4.7e-05,-5.2e-05,-1e-06,-4.5e-05,-3.9e-05,-7.1e-05,4.2e-05,-5e-05,-1.7e-05,-4.6e-05,2.9e-05,-5.5e-05,-3.9e-05,-2.8e-05,-5.5e-05,1.7e-05,-0.000135,-2.3e-05,5.4e-05,-2.2e-05,-8.3e-05,-6.2e-05,-3.4e-05,-6.8e-05,2e-06,-2.6e-05,3.4e-05,7.7e-05,-1.2e-05,-1.7e-05,-2.8e-05,1.1e-05,-8.2e-05,4e-06,4.6e-05,-1.6e-05,-0.000118,-0.000103,-6.1e-05,-7.2e-05,-1.1e-05,-5.5e-05,-7.5e-05,8e-06,6.1e-05,-6.4e-05,6.4e-05,7.1e-05,1.1e-05,-5.3e-05,-1.3e-05,-9.6e-05,-5.9e-05,-6e-05,-6.4e-05,-7.5e-05,7e-06,0,1.5e-05,-4e-05,-8e-06,-5.3e-05,-2e-05,-3.7e-05,1.7e-05,3.3e-05,-2.7e-05,3.3e-05,6.1e-05,8e-05,4.2e-05,-3.3e-05,6.3e-05,5e-05,-9e-06,7.3e-05,-3.2e-05,2e-05,-3.5e-05,1.5e-05,-7.9e-05,-2.5e-05,-4.3e-05,-3.5e-05,4.1e-05,8.3e-05,3.7e-05,4e-06,5.1e-05,3.5e-05,-8.1e-05,-5e-05,-6.6e-05
1.7e-05,6.4e-05,7.4e-05,0.000131,-1.8e-05,8.3e-05,4e-06,-1e-05,3.5e-05,-3.5e-05,-1.9e-05,-2.4e-05,-5.6e-05,2.6e-05,1.2e-05,3e-05,1.7e-05,1.1e-05,-6e-06,5e-06,5.5e-05,3.9e-05,1.1e-05,-8e-06,-5.3e-05,-4.2e-05,4.8e-05,8.4e-05,0.000101,-8.3e-05,-4.5e-05,-6.2e-05,1.2e-05,2.5e-05,4.8e-05,4.2e-05,-2.2e-05,-1.7e-05,7.1e-05,5.8e-05,-1.9e-05,3.6e-05,2.4e-05,-3.6e-05,3e-06,2.8e-05,-1.7e-05,4.3e-05,6.3e-05,1.2e-05,4.3e-05,6.2e-05,5.7e-05,-1e-05,8.3e-05,-3.6e-05,-1.1e-05,2.6e-05,2e-06,1.6e-05,0.000122,2.2e-05,3.3e-05,-4e-06,1.7e-05,1.1e-05,2.2e-05,2.8e-05,2.7e-05,-1.4e-05,-4.1e-05,-6e-06,1.7e-05,2e-05,0.00011,1.4e-05,-3.7e-05,-3.2e-05,6.6e-05,-9e-06,1.8e-05,-3.4e-05,-6.9e-05,-4.1e-05,-1.4e-05,1.2e-05,-5.3e-05,2.8e-05,-5.7e-05,3.9e-05,1.4e-05,1e-05,-4.8e-05,5e-06,1.3e-05,-6e-06,5e-06,2.4e-05,-1.5e-05,-0.000119,-4e-05,4.2e-05,-7.6e-05,6.9e-05,2e-05,-3.3e-05,-1.9e-05,4.8e-05,-2.5e-05,-3.5e-05,8.3e-05,2e-06,3.5e-05,1.4e-05,-3.3e-05,-4e-05,-3.5e-05,7e-06,4.6e-05,1e-05,3e-05
1e-05,2.4e-05,7e-06,-4.9e-05,1.5e-05,4.5e-05,-8e-06,3.3e-05,1e-05,3.1e-05,3.5e-05,-3.2e-05,3.6e-05,-3.2e-05,1.3e-05,5.2e-05,2.6e-05,-7.1e-05,-2.2e-05,6.2e-05,-1.8e-05,-5.1e-05,-5.5e-05,-4.7e-05,-7e-06,3.3e-05,2.7e-05,1.3e-05,-3.4e-05,-2.9e-05,-2.1e-05,5e-05,-2.9e-05,2.6e-05,1.3e-05,2.5e-05,3.1e-05,2.9e-05,1e-06,2.2e-05,5.2e-05,1.7e-05,1e-05,-1.5e-05,-2.9e-05,-3.8e-05,1.2e-05,4.3e-05,2.6e-05,-6e-05,-1.7e-05,2e-05,3.2e-05,-2.4e-05,-3.6e-05,-3.8e-05,3.9e-05,5e-05,4e-06,0,1.1e-05,6e-06,-2.2e-05,9.5e-05,4e-06,4.5e-05,-2.3e-05,1.6e-05,-2.6e-05,0,6.3e-05,1.3e-05,3.1e-05,0,-3.9e-05,-3.3e-05,2.6e-05,4.8e-05,-2e-05,1.9e-05,2.1e-05,-2.3e-05,-9e-06,6.8e-05,-5.6e-05,-1.9e-05,3.1e-05,4.2e-05,5.4e-05,4.4e-05,-1.2e-05,-6e-06,-1.1e-05,-1.6e-05,-3.1e-05,6e-06,-6.5e-05,-4e-05,5e-06,4.8e-05,-7e-06,4e-06,5.3e-05,0,-2.5e-05,5e-06,4.2e-05,5.5e-05,6e-06,-2.4e-05,-4.8e-05,-2e-05,5.3e-05,-8.2e-05,3.6e-05,-3.1e-05,-4.6e-05,-1.3e-05,-3e-06,1e-06,6e-06
-1.8e-05,-8e-06,-1.5e-05,-4.1e-05,-3.1e-05,-6.9e-05,1e-05,-3.7e-05,-2.6e-05,-4.7e-05,-3.3e-05,1e-05,-1.2e-05,8e-06,-7.8e-05,-1.9e-05,-2.5e-05,3.4e-05,-6e-06,1e-05,1.2e-05,2.7e-05,4.5e-05,8.2e-05,7e-06,-3.6e-05,-5.5e-05,-3.5e-05,-2.7e-05,7.1e-05,0,1.2e-05,7e-06,-2.4e-05,-2.4e-05,-1.4e-05,2.1e-05,5e-06,-5.8e-05,-3.7e-05,-4.2e-05,7e-06,-2.2e-05,-5.2e-05,-2.5e-05,5.7e-05,7e-06,-3.6e-05,2.9e-05,-2e-06,-1e-05,-1.6e-05,-2.2e-05,-4e-06,-6.7e-05,-5e-06,-4.6e-05,-2.2e-05,5.3e-05,-7e-06,5.4e-05,5e-05,3.3e-05,-1.4e-05,-1.3e-05,0,-6.9e-05,-2.2e-05,9e-06,1.2e-05,-4.6e-05,2.7e-05,-5.3e-05,-4.3e-05,-2.6e-05,-4.2e-05,5.8e-05,1.8e-05,-1.6e-05,6e-06,-3.4e-05,1e-05,3.2e-05,1.4e-05,1.4e-05,-3.3e-05,2e-05,-2.5e-05,-5.6e-05,-4.9e-05,5e-06,1.1e-05,1.7e-05,-3.7e-05,-5e-06,-1.6e-05,3.6e-05,1.7e-05,2e-06,4e-05,-6e-06,-3.1e-05,-7.1e-05,-2e-05,1.4e-05,2.3e-05,-7e-06,3e-06,3.1e-05,1.6e-05,-4e-05,-7e-06,1.1e-05,2.7e-05,3e-06,5e-06,6.5e-05,2.4e-05,-9e-06,2e-06,-3.2e-05
1e-06,-2.4e-05,-1.8e-05,7.2e-05,1.4e-05,-1.7e-05,-4.9e-05,-9e-06,-9e-06,1.3e-05,-2.4e-05,-1.9e-05,1.1e-05,3.3e-05,-3.3e-05,9e-06,-1.9e-05,-4.7e-05,5e-06,-7e-06,3.4e-05,-8e-06,-7e-06,-1.2e-05,1.7e-05,1.2e-05,-5e-06,-8e-06,-3.1e-05,0,2.6e-05,-1e-06,-2.4e-05,-1.2e-05,-1.9e-05,-5.6e-05,3.2e-05,-1e-06,-3.3e-05,-1e-05,1.3e-05,-2.1e-05,-3.4e-05,2.6e-05,-3.7e-05,-1e-05,3.8e-05,7e-06,-3.7e-05,-3e-06,2.4e-05,-1.6e-05,-2.7e-05,-6e-06,2.2e-05,-4e-06,0,2.5e-05,-4.6e-05,-5e-06,-3.8e-05,-8e-05,-1.2e-05,0,1.5e-05,-2.7e-05,1.5e-05,-5e-06,-5e-05,7e-06,2e-06,-9e-06,-4e-06,3e-05,1e-05,-4.2e-05,-3.6e-05,3.4e-05,-4e-06,1e-06,3e-06,-6e-06,3e-06,-3e-05,2.1e-05,-1.4e-05,-2.7e-05,8e-06,9e-06,-2.6e-05,5e-06,0,-3e-06,3.2e-05,-3.5e-05,-7e-06,-3.4e-05,-1.7e-05,-1.3e-05,-1.7e-05,-7e-06,-4e-06,3.8e-05,-3e-06,3.2e-05,-5e-06,-1.5e-05,-4.1e-05,4e-06,4e-06,1e-05,1.1e-05,-2.5e-05,2.6e-05,3.7e-05,-1.1e-05,-1.5e-05,1.2e-05,8e-06,-3e-06,-9.3e-05
9e-06,3e-06,1.5e-05,-3.6e-05,1.4e-05,2e-06,2e-05,1e-06,3e-06,-5.2e-05,-1.1e-05,1e-05,-3.8e-05,4e-06,3.9e-05,-7e-06,3.4e-05,-3e-05,-1e-05,8e-06,-3.4e-05,2e-06,1.6e-05,-4.6e-05,-1.7e-05,-4.8e-05,-1e-06,2e-05,-1e-06,-9e-06,-1.8e-05,2e-06,-3.6e-05,1.1e-05,9e-06,-7e-06,-3.1e-05,-1.9e-05,-8e-06,0,0,1.2e-05,-2.4e-05,1.8e-05,-2.4e-05,-2.5e-05,-2.3e-05,-2e-05,8e-06,3e-06,8e-06,5e-06,-2.3e-05,-1e-06,2.1e-05,-2.1e-05,1e-05,2.7e-05,-2e-06,-1.2e-05,-4e-06,1e-05,-2.3e-05,-1.9e-05,3e-06,-4e-06,0,4e-06,2.7e-05,6e-06,1.6e-05,-1.6e-05,1e-05,-4e-06,-3.6e-05,4e-06,-2.3e-05,4e-06,-2e-06,-3.1e-05,-1.1e-05,-7e-06,-1e-06,6e-06,-1.7e-05,2.8e-05,-1.1e-05,-6e-06,-5e-06,6e-06,4e-05,4e-06,-1.1e-05,-1.6e-05,6e-06,4e-06,1.1e-05,-1.4e-05,1e-05,-4.9e-05,9e-06,4e-06,-2.2e-05,8e-06,-1e-05,-2.4e-05,1.5e-05,1.8e-05,3.3e-05,2.5e-05,3e-06,-2.8e-05,-4e-06,-7e-06,-2.6e-05,1.9e-05,-2.2e-05,-1.4e-05,-1.6e-05,1.3e-05,2e-06
-1.6e-05,3e-05,-5e-06,-1.7e-05,-9e-06,1.9e-05,2.9e-05,2.2e-05,4e-06,2.9e-05,-6e-06,1e-05,1.2e-05,-1.4e-05,-1.1e-05,6e-06,2.3e-05,5.8e-05,2e-06,-4e-06,-6e-06,5e-06,-1.2e-05,-3e-06,-1.6e-05,2.7e-05,-2e-06,5e-06,1.6e-05,2.1e-05,2e-06,-1e-06,1.9e-05,6e-06,2.1e-05,2.2e-05,-1e-06,8e-06,2.9e-05,1.9e-05,-3e-06,-2.4e-05,2e-05,-3e-06,4.9e-05,-7e-06,-5e-06,-1e-05,7e-06,2.5e-05,1e-06,8e-06,-1.6e-05,-2e-06,9e-06,1e-05,-2e-05,-1.9e-05,1.7e-05,0,3.3e-05,2e-05,0,-1e-06,8e-06,9e-06,7e-06,3e-06,3e-06,-2.1e-05,-1.1e-05,1.3e-05,-1.7e-05,1.3e-05,-5e-06,1.1e-05,1.6e-05,0,1.2e-05,-1.1e-05,2.4e-05,1.8e-05,-1.8e-05,-2.6e-05,1.7e-05,-1.5e-05,1.3e-05,-1.4e-05,6e-06,2.6e-05,-1.8e-05,-6e-06,-3e-06,-1.2e-05,-4e-06,3e-06,0,1e-05,-1e-05,2.9e-05,2e-05,-2e-06,1.3e-05,1.6e-05,1.1e-05,1.6e-05,-6e-06,-2.6e-05,3e-06,-1e-05,-1.2e-05,1.3e-05,-2.3e-05,7e-06,-2.3e-05,-4e-06,7e-06,1e-06,1.2e-05,-6e-06,1.8e-05
1.6e-05,1.5e-05,7e-06,1.8e-05,1.8e-05,-1e-06,-2.1e-05,-1.2e-05,8e-06,3e-06,-3e-06,-1.5e-05,-5e-06,-2.1e-05,2.9e-05,0,-8e-06,4e-06,3e-06,1.4e-05,1.9e-05,-1.2e-05,-1.1e-05,2.3e-05,5e-06,1.1e-05,1e-05,-5e-06,3e-06,-3.3e-05,1.4e-05,-2e-06,-1.8e-05,-8e-06,1.3e-05,-6e-06,2e-06,-1e-06,8e-06,9e-06,0,8e-06,-8e-06,-6e-06,2.1e-05,1e-06,6e-06,1.8e-05,3e-05,1.8e-05,-1e-06,-1.5e-05,5e-06,-2e-06,-1.6e-05,1.9e-05,-4e-06,-8e-06,1e-05,-5e-06,-8e-06,-1.1e-05,7e-06,1.6e-05,-4e-06,1e-05,3e-06,-1e-06,-1e-05,-1e-05,1.2e-05,1e-05,-5e-06,5e-06,1.6e-05,1.3e-05,-5e-06,5e-06,7e-06,1e-05,-2e-06,-8e-06,3e-06,-4e-06,8e-06,2e-06,-8e-06,1.5e-05,-5e-06,4e-06,-4e-06,0,9e-06,6e-06,1.3e-05,-2e-06,-6e-06,6e-06,9e-06,-5e-06,-3.7e-05,6e-06,-8e-06,-2.9e-05,1.8e-05,-3e-06,-1e-05,8e-06,-2e-06,5e-06,-1.4e-05,7e-06,4e-06,-1.3e-05,9e-06,9e-06,1.5e-05,5e-06,2e-06,-1e-06,-1e-05
-1.6e-05,-1.3e-05,-7e-06,1.1e-05,-6e-06,-3e-06,3e-06,-2e-06,4e-06,2.3e-05,6e-06,0,6e-06,1.2e-05,7e-06,-5e-06,-1.6e-05,4e-06,-6e-06,-1.1e-05,1.1e-05,7e-06,4e-06,1e-06,-6e-06,8e-06,-8e-06,-1.1e-05,-6e-06,-1.2e-05,-1.4e-05,2e-06,3e-06,0,6e-06,-6e-06,-1.7e-05,-3e-06,-1.3e-05,-7e-06,0,1e-06,-1.1e-05,-1.5e-05,-3e-06,-2.2e-05,-2e-06,-4e-06,-5e-06,1e-06,-6e-06,9e-06,0,5e-06,-8e-06,-1.3e-05,8e-06,2e-06,-2.1e-05,5e-06,-1.5e-05,-7e-06,0,-9e-06,-5e-06,-7e-06,-2e-05,-1e-06,3e-06,-5e-06,-9e-06,4e-06,-4e-06,-1e-06,4e-05,1e-06,-9e-06,-1e-06,-1e-06,6e-06,-2e-06,-1e-06,6e-06,1.4e-05,-1.4e-05,3e-06,6e-06,-5e-06,8e-06,-9e-06,-1e-06,1e-06,-5e-06,8e-06,-2e-06,3e-06,8e-06,4e-06,-5e-06,3e-06,1.2e-05,-1e-06,8e-06,3e-06,0,-4e-06,2e-06,1.7e-05,-1.6e-05,-1.1e-05,-8e-06,-1.3e-05,8e-06,-7e-06,0,-1e-06,-1.5e-05,-7e-06,-3e-06,1e-06,1.7e-05
1.4e-05,-8e-06,3e-06,-1.2e-05,2e-06,5e-06,6e-06,1.3e-05,-3e-06,-1.2e-05,-3e-06,-6e-06,-1.2e-05,-2e-06,9e-06,-3e-06,1e-06,-2.3e-05,0,-2.3e-05,-8e-06,-1e-06,5e-06,-8e-06,4e-06,-8e-06,3e-06,6e-06,6e-06,1.9e-05,-5e-06,-7e-06,4e-06,-1e-06,-9e-06,-2e-06,-3e-06,-2e-06,0,1e-06,-6e-06,7e-06,9e-06,2e-06,-3e-06,-1e-05,-7e-06,-1e-06,-8e-06,9e-06,1e-05,1e-06,6e-06,-1e-06,1e-06,-2e-06,-9e-06,-2e-06,2e-06,-4e-06,1.4e-05,1.3e-05,5e-06,-4e-06,-5e-06,-1e-05,7e-06,-6e-06,0,3e-06,-2e-06,0,1.3e-05,-3e-06,-8e-06,-1e-06,-7e-06,-7e-06,-1.4e-05,-5e-06,-9e-06,-8e-06,9e-06,2e-06,-6e-06,1.1e-05,-1.6e-05,-4e-06,-7e-06,1e-05,2e-06,-1e-06,1e-06,-9e-06,7e-06,-3e-06,-3e-06,0,3e-06,9e-06,5e-06,-1e-05,2e-06,-3e-06,-7e-06,-1e-06,1.1e-05,-7e-06,-1.6e-05,4e-06,-6e-06,1e-06,2e-06,-7e-06,1.2e-05,1e-06,1.1e-05,4e-06,0,-5e-06,-7e-06
-1e-05,1.4e-05,-1e-06,-2e-06,-5e-06,1.6e-05,-1.3e-05,-1e-05,-4e-06,5e-06,0,2e-06,-2e-06,-9e-06,-4e-06,-4e-06,9e-06,-4e-06,-4e-06,1e-05,-5e-06,-6e-06,4e-06,1.1e-05,7e-06,-6e-06,8e-06,1.2e-05,-1e-05,-1e-06,7e-06,2e-06,-1e-06,4e-06,-1e-05,4e-06,2e-06,-3e-06,-8e-06,1e-05,8e-06,2e-06,-6e-06,6e-06,-1.3e-05,-3e-06,0,5e-06,3e-06,-4e-06,-6e-06,2e-06,1e-06,3e-06,-5e-06,-2e-06,3e-06,-4e-06,7e-06,1e-06,9e-06,-5e-06,-1e-06,-2e-06,-2e-06,5e-06,0,5e-06,-1e-06,4e-06,-5e-06,4e-06,-1.3e-05,6e-06,-1.1e-05,3e-06,-6e-06,2e-06,-1e-06,-9e-06,7e-06,-7e-06,-5e-06,2e-06,4e-06,-1.3e-05,4e-06,1e-05,1e-06,4e-06,4e-06,0,2e-06,0,-9e-06,6e-06,0,-1e-06,-3e-06,-2.2e-05,-3e-06,1e-06,-8e-06,-9e-06,1e-06,6e-06,-1.3e-05,4e-06,1e-06,-4e-06,1e-05,5e-06,1e-06,4e-06,4e-06,-2e-06,9e-06,-5e-06,2e-06,4e-06,3e-06
4e-06,2e-06,2e-06,3e-06,-4e-06,-1.7e-05,3e-06,3e-06,-1e-06,-2e-06,1e-06,3e-06,-3e-06,5e-06,-7e-06,-2e-06,-1e-05,6e-06,2e-06,-4e-06,1.1e-05,9e-06,-3e-06,-3e-06,-4e-06,5e-06,-5e-06,-7e-06,-5e-06,-9e-06,2e-06,-3e-06,7e-06,-1e-06,0,8e-06,0,5e-06,0,-9e-06,-1.2e-05,3e-06,-2e-06,7e-06,8e-06,-2e-06,1.1e-05,-2e-06,-8e-06,-4e-06,-4e-06,-1e-06,4e-06,-2e-06,-3e-06,1e-05,9e-06,1e-06,-8e-06,-4e-06,9e-06,-8e-06,-3e-06,0,-1e-06,7e-06,-3e-06,1e-06,6e-06,3e-06,5e-06,-2e-06,4e-06,-1e-05,-3e-06,-5e-06,-6e-06,1e-05,-1.3e-05,-1e-06,-5e-06,-5e-06,-9e-06,1e-06,-4e-06,-1e-06,2e-06,-6e-06,-7e-06,-9e-06,3e-06,0,-5e-06,-7e-06,-2e-06,-1.2e-05,-3e-06,3e-06,2e-06,0,3e-06,-2e-06,2e-06,-7e-06,6e-06,-2e-06,3e-06,-4e-06,2e-06,0,-1.1e-05,-3e-06,-3e-06,1.7e-05,-1e-06,1e-06,-1.1e-05,-1e-06,-2e-06,-2e-06,-6e-06
-3e-06,-5e-06,-3e-06,3e-06,1e-06,-1.5e-05,5e-06,-4e-06,1e-06,-2e-06,-1e-06,0,4e-06,9e-06,-1e-05,-3e-06,-9e-06,-1.1e-05,-2e-06,-4e-06,-1e-06,-7e-06,-5e-06,-1.7e-05,4e-06,5e-06,0,-8e-06,3e-06,5e-06,-9e-06,5e-06,0,-3e-06,3e-06,-4e-06,0,-3e-06,6e-06,-4e-06,5e-06,-6e-06,1e-06,-3e-06,-2e-06,0,-8e-06,-6e-06,1.7e-05,1e-06,5e-06,-2e-06,0,-2e-06,1e-05,-7e-06,-3e-06,5e-06,-6e-06,0,-1e-05,8e-06,-5e-06,-2e-06,-1e-06,-2e-06,-2e-06,-5e-06,1e-06,-2e-06,-2e-06,-1e-06,0,5e-06,-4e-06,-1e-06,3e-06,0,5e-06,1e-06,5e-06,-2e-06,0,-5e-06,-3e-06,0,-5e-06,-1e-06,2e-06,-2e-06,-3e-06,-1e-06,2e-06,4e-06,-7e-06,6e-06,-2e-06,-2e-06,-4e-06,7e-06,-1.2e-05,2e-06,-2e-06,-3e-06,1e-06,-5e-06,4e-06,-4e-06,9e-06,1e-06,6e-06,-3e-06,-1e-06,-1e-05,-1e-06,-3e-06,-3e-06,-1e-06,0,-1e-06,-2e-06
1e-06,-4e-06,1e-06,-4e-06,-2e-06,1e-05,-1e-06,2e-06,2e-06,-3e-06,-2e-06,-1e-06,-5e-06,-1e-06,0,-2e-06,6e-06,1.5e-05,0,0,-9e-06,5e-06,0,8e-06,-3e-06,-5e-06,3e-06,4e-06,1e-06,4e-06,2e-06,-3e-06,-4e-06,3e-06,6e-06,-2e-06,-2e-06,1e-06,6e-06,0,-2e-06,-3e-06,-6e-06,-6e-06,-1.4e-05,0,1e-06,2e-06,-7e-06,-7e-06,1e-06,1e-06,1e-06,1e-06,3e-06,-4e-06,5e-06,0,5e-06,-3e-06,-1.2e-05,-1e-06,-1e-06,-4e-06,5e-06,-6e-06,-2e-06,2e-06,-4e-06,-1e-06,-6e-06,3e-06,4e-06,-1e-06,-4e-06,2e-06,0,5e-06,5e-06,0,-3e-06,-1e-06,5e-06,-4e-06,5e-06,3e-06,-2e-06,2e-06,-8e-06,2e-06,2e-06,1e-06,0,-2e-06,-3e-06,-3e-06,-3e-06,1e-06,3e-06,3e-06,1e-05,5e-06,0,9e-06,-2e-06,5e-06,-4e-06,1e-06,8e-06,0,2e-06,2e-06,-2e-06,-9e-06,-5e-06,2e-06,6e-06,-1e-06,1e-06,4e-06,-4e-06
-2e-06,1e-06,-1e-06,-3e-06,3e-06,6e-06,0,0,2e-06,-1e-05,-1e-06,-3e-06,-2e-06,-3e-06,-4e-06,-1e-06,1.1e-05,2e-06,-2e-06,-3e-06,1e-06,-2e-06,4e-06,9e-06,1e-06,-6e-06,-3e-06,6e-06,3e-06,-4e-06,3e-06,2e-06,5e-06,-1e-06,1e-06,7e-06,1e-06,-3e-06,5e-06,1e-06,-1e-06,-1e-06,3e-06,-2e-06,0,5e-06,1e-06,0,6e-06,0,-4e-06,0,3e-06,-3e-06,-5e-06,6e-06,5e-06,-2e-06,3e-06,1e-06,1.3e-05,-1e-06,2e-06,-2e-06,-1e-06,-1e-06,-4e-06,-2e-06,5e-06,0,6e-06,2e-06,-2e-06,0,6e-06,-1e-06,-4e-06,4e-06,5e-06,-5e-06,3e-06,0,5e-06,-3e-06,1e-06,-8e-06,0,-4e-06,6e-06,4e-06,-3e-06,1e-06,2e-06,2e-06,2e-06,4e-06,-1e-06,2e-06,-2e-06,-1.2e-05,-1e-06,0,2e-06,1e-06,0,1e-06,-2e-06,2e-06,5e-06,3e-06,-1e-06,1e-06,-2e-06,4e-06,2e-06,-2e-06,1e-06,1e-06,-2e-06,-2e-06,0
2e-06,9e-06,0,6e-06,2e-06,1e-06,0,-3e-06,0,4e-06,0,-2e-06,-2e-06,-4e-06,3e-06,-1e-06,0,-7e-06,1e-06,-3e-06,6e-06,0,1e-06,-7e-06,1e-06,-2e-06,2e-06,-4e-06,1e-06,1e-06,-6e-06,-3e-06,-4e-06,0,-6e-06,1e-06,-4e-06,1e-06,-2e-06,2e-06,2e-06,0,-1e-06,1e-06,0,-1e-06,0,2e-06,-5e-06,1e-06,3e-06,1e-06,1e-06,1e-06,-8e-06,-2e-06,-5e-06,-2e-06,-3e-06,-2e-06,-2e-06,0,2e-06,0,2e-06,5e-06,-1e-06,1e-06,-3e-06,-2e-06,-4e-06,0,0,2e-06,1.6e-05,-2e-06,4e-06,-2e-06,1e-06,-5e-06,-2e-06,2e-06,-6e-06,1e-06,-2e-06,4e-06,-2e-06,1e-06,-5e-06,3e-06,1e-06,-2e-06,-2e-06,-1e-06,4e-06,-5e-06,-2e-06,-1e-06,2e-06,-3e-06,-5e-06,-1e-06,-3e-06,-4e-06,-2e-06,-4e-06,4e-06,1e-06,-3e-06,-1e-06,-1e-06,-3e-06,4e-06,-3e-06,1e-06,3e-06,-5e-06,-1e-06,1e-06,1e-06,1e-06
-3e-06,-3e-06,0,-1e-06,2e-06,-5e-06,-1e-06,4e-06,-1e-06,-1e-06,-2e-06,2e-06,1e-06,3e-06,0,0,-7e-06,-6e-06,-2e-06,5e-06,-1e-06,1e-06,-1e-06,0,-3e-06,8e-06,0,-5e-06,-6e-06,3e-06,1e-06,1e-06,-1e-06,-1e-06,-7e-06,-1e-06,-3e-06,0,-8e-06,-4e-06,-2e-06,4e-06,-4e-06,4e-06,4e-06,3e-06,-3e-06,1e-06,4e-06,1e-06,-1e-06,-2e-06,1e-06,-1e-06,4e-06,-2e-06,3e-06,1e-06,4e-06,1e-06,-3e-06,6e-06,2e-06,2e-06,-1e-06,1e-06,0,0,0,-2e-06,-2e-06,1e-06,2e-06,1e-06,-3e-06,-3e-06,5e-06,-2e-06,-1e-06,2e-06,1e-06,0,-2e-06,2e-06,0,1e-06,1e-06,2e-06,5e-06,-3e-06,-1e-06,0,0,1e-06,1e-06,1e-06,3e-06,0,-1e-06,6e-06,4e-06,-1e-06,3e-06,3e-06,4e-06,0,-1e-06,0,-4e-06,2e-06,5e-06,1e-06,2e-06,3e-06,3e-06,-1e-06,8e-06,-1e-06,1e-06,-1e-06,-9e-06
3e-06,-5e-06,-1e-06,-4e-06,0,1e-06,-2e-06,-3e-06,-1e-06,3e-06,-1e-06,0,-1e-06,-3e-06,6e-06,-2e-06,3e-06,4e-06,1e-06,-8e-06,-3e-06,0,-3e-06,5e-06,2e-06,-1e-06,-3e-06,2e-06,2e-06,-6e-06,4e-06,-3e-06,0,-1e-06,-2e-06,-2e-06,1e-06,-2e-06,-1e-06,-1e-06,-1e-06,1e-06,0,1e-06,2e-06,1e-06,-1e-06,-1e-06,-7e-06,3e-06,1e-06,2e-06,-2e-06,0,8e-06,1e-06,1e-06,-1e-06,1e-06,-2e-06,0,-8e-06,1e-06,-3e-06,-2e-06,-3e-06,-4e-06,-3e-06,1e-06,0,3e-06,1e-06,0,-2e-06,-7e-06,2e-06,1e-06,0,-3e-06,2e-06,-1e-06,-1e-06,0,3e-06,0,3e-06,-2e-06,-1e-06,-2e-06,-2e-06,1e-06,0,1e-06,-6e-06,0,0,-4e-06,0,0,0,-3e-06,-1e-06,-4e-06,5e-06,0,4e-06,-4e-06,0,-7e-06,-3e-06,-2e-06,2e-06,0,3e-06,2e-06,1e-06,-2e-06,1e-06,-2e-06,0,-1e-06
-4e-06,2e-06,1e-06,2e-06,0,6e-06,3e-06,3e-06,0,1e-06,0,1e-06,-1e-06,-3e-06,-1e-06,-1e-06,5e-06,-3e-06,-2e-06,2e-06,3e-06,-2e-06,-1e-06,-3e-06,-1e-06,0,2e-06,5e-06,-2e-06,-1e-06,-4e-06,2e-06,-3e-06,1e-06,1e-06,0,-4e-06,0,2e-06,5e-06,2e-06,2e-06,-1e-06,-3e-06,-3e-06,3e-06,6e-06,-1e-06,3e-06,3e-06,-2e-06,-1e-06,-1e-06,1e-06,0,2e-06,-5e-06,-2e-06,-3e-06,0,2e-06,4e-06,-3e-06,0,-1e-06,-2e-06,3e-06,1e-06,-2e-06,1e-06,-5e-06,-1e-06,-1e-06,4e-06,-4e-06,0,1e-06,-2e-06,-2e-06,-1e-06,0,-3e-06,5e-06,1e-06,-2e-06,-4e-06,-2e-06,0,2e-06,4e-06,-1e-06,0,-1e-06,1e-06,1e-06,2e-06,3e-06,0,0,1e-06,2e-06,1e-06,5e-06,3e-06,-4e-06,-2e-06,5e-06,-3e-06,-3e-06,2e-06,0,-2e-06,0,-2e-06,1e-06,0,-1e-06,-1e-06,1e-06,1e-06,-2e-06
2e-06,3e-06,0,2e-06,-1e-06,-3e-06,3e-06,0,1e-06,2e-06,-1e-06,-1e-06,-2e-06,4e-06,4e-06,0,-4e-06,7e-06,1e-06,1e-06,1e-06,3e-06,2e-06,-6e-06,0,-5e-06,0,-2e-06,1e-06,5e-06,-3e-06,-2e-06,2e-06,0,2e-06,2e-06,1e-06,-2e-06,3e-06,-1e-06,-3e-06,-2e-06,-1e-06,-2e-06,3e-06,-1e-06,-4e-06,0,-2e-06,1e-06,0,0,-2e-06,-1e-06,-4e-06,0,0,1e-06,0,-2e-06,6e-06,0,-2e-06,0,-1e-06,3e-06,-3e-06,1e-06,0,2e-06,2e-06,0,0,-4e-06,2e-06,0,3e-06,-1e-06,3e-06,-4e-06,1e-06,-3e-06,0,-3e-06,-1e-06,2e-06,1e-06,1e-06,-3e-06,0,0,1e-06,1e-06,0,-3e-06,-3e-06,-3e-06,0,-1e-06,-4e-06,1e-06,2e-06,-3e-06,1e-06,1e-06,-2e-06,-2e-06,1e-06,1e-06,-2e-06,-1e-06,1e-06,-1e-06,-2e-06,0,0,-2e-06,1e-06,0,-3e-06,1e-06
-2e-06,1e-06,0,-2e-06,-1e-06,-8e-06,-5e-06,-1e-06,1e-06,2e-06,0,-2e-06,0,2e-06,0,0,-7e-06,-1e-06,-2e-06,1e-06,-3e-06,-4e-06,1e-06,5e-06,1e-06,4e-06,-2e-06,-4e-06,3e-06,-1e-06,2e-06,2e-06,0,0,1e-06,-2e-06,-1e-06,2e-06,2e-06,-2e-06,2e-06,-1e-06,-1e-06,0,2e-06,2e-06,1e-06,-1e-06,5e-06,2e-06,1e-06,-1e-06,-1e-06,1e-06,0,-3e-06,-1e-06,3e-06,1e-06,0,-5e-06,0,0,1e-06,-1e-06,2e-06,-2e-06,-1e-06,1e-06,1e-06,-2e-06,1e-06,-1e-06,2e-06,0,1e-06,2e-06,2e-06,-1e-06,-2e-06,-2e-06,-3e-06,-2e-06,-1e-06,1e-06,0,-2e-06,-1e-06,1e-06,-2e-06,0,0,-1e-06,1e-06,0,1e-06,2e-06,0,0,-1e-06,-5e-06,0,2e-06,1e-06,0,3e-06,-2e-06,0,2e-06,2e-06,-2e-06,0,-2e-06,-3e-06,-2e-06,0,5e-06,0,-1e-06,3e-06,-2e-06
0,-4e-06,-1e-06,-1e-06,0,4e-06,2e-06,0,0,0,0,1e-06,-1e-06,-1e-06,-1e-06,0,1e-06,-1e-06,1e-06,1e-06,0,3e-06,0,5e-06,-1e-06,2e-06,2e-06,1e-06,-2e-06,-2e-06,2e-06,-2e-06,-1e-06,0,-3e-06,-2e-06,-1e-06,-2e-06,-3e-06,1e-06,-3e-06,-3e-06,0,2e-06,-2e-06,-1e-06,1e-06,0,-3e-06,-1e-06,0,1e-06,0,-1e-06,1e-06,3e-06,-3e-06,0,-2e-06,-1e-06,-6e-06,-2e-06,1e-06,1e-06,1e-06,-2e-06,1e-06,0,-1e-06,-1e-06,1e-06,1e-06,2e-06,-1e-06,3e-06,1e-06,-1e-06,0,3e-06,1e-06,1e-06,-2e-06,-2e-06,-1e-06,0,-1e-06,-1e-06,-1e-06,-3e-06,1e-06,1e-06,-1e-06,0,-1e-06,-1e-06,-1e-06,-2e-06,1e-06,0,1e-06,6e-06,-1e-06,-1e-06,3e-06,1e-06,1e-06,2e-06,-1e-06,6e-06,-1e-06,1e-06,1e-06,0,4e-06,0,0,-3e-06,0,1e-06,-1e-06,1e-06
0,-1e-06,1e-06,2e-06,-1e-06,7e-06,2e-06,0,-1e-06,0,0,-1e-06,0,0,-1e-06,0,6e-06,-2e-06,-2e-06,2e-06,3e-06,-2e-06,-1e-06,-6e-06,1e-06,-1e-06,-1e-06,4e-06,-1e-06,2e-06,-3e-06,2e-06,2e-06,0,-4e-06,0,0,0,-3e-06,0,1e-06,1e-06,-1e-06,1e-06,-2e-06,0,1e-06,1e-06,-2e-06,-1e-06,-2e-06,-1e-06,0,0,-1e-06,-2e-06,2e-06,-2e-06,0,0,2e-06,4e-06,1e-06,-1e-06,0,-2e-06,-2e-06,0,1e-06,-1e-06,-2e-06,0,-3e-06,0,7e-06,0,0,0,-2e-06,0,-1e-06,-1e-06,0,-1e-06,-1e-06,-2e-06,-1e-06,1e-06,1e-06,2e-06,-1e-06,0,0,1e-06,1e-06,3e-06,0,0,0,2e-06,-3e-06,-1e-06,0,-2e-06,-1e-06,-3e-06,1e-06,2e-06,2e-06,1e-06,-2e-06,-1e-06,1e-06,3e-06,0,0,1e-06,1e-06,0,-1e-06,-1e-06
-1e-06,3e-06,-1e-06,1e-06,1e-06,-2e-06,-5e-06,1e-06,0,-5e-06,0,1e-06,-1e-06,0,-3e-06,0,0,-6e-06,1e-06,-1e-06,0,1e-06,0,0,-1e-06,-3e-06,-1e-06,0,0,0,0,-2e-06,-1e-06,0,-2e-06,0,-2e-06,0,-1e-06,1e-06,0,1e-06,0,0,-2e-06,-1e-06,-2e-06,0,-2e-06,-1e-06,1e-06,1e-06,1e-06,0,1e-06,0,0,1e-06,3e-06,-1e-06,3e-06,-3e-06,1e-06,1e-06,1e-06,1e-06,0,0,1e-06,-1e-06,1e-06,0,2e-06,-1e-06,-2e-06,-1e-06,-1e-06,0,0,-1e-06,1e-06,0,2e-06,3e-06,0,1e-06,-1e-06,-1e-06,-2e-06,0,0,0,0,-2e-06,-1e-06,-3e-06,-1e-06,0,0,-1e-06,0,-1e-06,1e-06,-3e-06,-1e-06,1e-06,-3e-06,-1e-06,1e-06,0,-1e-06,0,1e-06,-4e-06,2e-06,0,2e-06,0,-1e-06,2e-06,-2e-06
1e-06,1e-06,1e-06,-1e-06,0,-5e-06,3e-06,-2e-06,0,1e-06,0,0,-1e-06,0,-1e-06,0,-4e-06,8e-06,-2e-06,3e-06,-2e-06,0,1e-06,5e-06,0,-1e-06,1e-06,-4e-06,-1e-06,-2e-06,1e-06,1e-06,0,0,1e-06,0,1e-06,0,1e-06,-1e-06,-1e-06,2e-06,-1e-06,-2e-06,0,0,-1e-06,0,-1e-06,-2e-06,0,0,0,-1e-06,2e-06,-1e-06,-1e-06,1e-06,0,0,-1e-06,0,0,0,0,2e-06,-1e-06,0,-1e-06,0,0,0,-1e-06,1e-06,-6e-06,0,-2e-06,-2e-06,-1e-06,-2e-06,-1e-06,0,0,1e-06,0,1e-06,0,0,2e-06,-2e-06,-1e-06,0,1e-06,0,1e-06,2e-06,0,0,1e-06,-5e-06,2e-06,1e-06,-2e-06,0,1e-06,2e-06,2e-06,-1e-06,-2e-06,0,0,1e-06,0,0,2e-06,0,1e-06,0,1e-06,-2e-06,0
-1e-06,-2e-06,-1e-06,0,1e-06,1e-06,3e-06,1e-06,0,-3e-06,-1e-06,-1e-06,0,-2e-06,-1e-06,0,2e-06,-3e-06,2e-06,1e-06,1e-06,0,1e-06,-4e-06,0,3e-06,-1e-06,0,1e-06,1e-06,-2e-06,-2e-06,1e-06,-1e-06,2e-06,-1e-06,-2e-06,1e-06,3e-06,-1e-06,1e-06,0,-1e-06,-1e-06,1e-06,-1e-06,3e-06,0,3e-06,-1e-06,-1e-06,0,1e-06,1e-06,0,1e-06,2e-06,-1e-06,0,-1e-06,0,1e-06,-1e-06,1e-06,0,-1e-06,-2e-06,-1e-06,1e-06,1e-06,-2e-06,0,1e-06,-2e-06,-3e-06,1e-06,-1e-06,-1e-06,1e-06,-1e-06,1e-06,0,-1e-06,-1e-06,-1e-06,-1e-06,-1e-06,2e-06,-2e-06,0,1e-06,0,-1e-06,-1e-06,0,-2e-06,-1e-06,0,-1e-06,2e-06,-3e-06,1e-06,3e-06,-1e-06,1e-06,-2e-06,2e-06,0,-4e-06,0,0,-1e-06,0,1e-06,1e-06,0,-2e-06,0,0,1e-06,-2e-06
0,-2e-06,0,1e-06,0,4e-06,-4e-06,0,0,1e-06,0,0,0,-1e-06,1e-06,0,5e-06,4e-06,-2e-06,-1e-06,1e-06,-1e-06,0,-3e-06,0,1e-06,0,4e-06,1e-06,1e-06,0,1e-06,-1e-06,0,2e-06,0,0,-2e-06,2e-06,2e-06,-1e-06,-1e-06,0,1e-06,-1e-06,-1e-06,-2e-06,0,-2e-06,1e-06,1e-06,-1e-06,1e-06,-1e-06,-4e-06,0,1e-06,0,1e-06,0,-3e-06,0,-1e-06,0,-1e-06,-1e-06,0,0,0,1e-06,1e-06,0,-1e-06,2e-06,2e-06,-1e-06,-1e-06,-1e-06,0,0,-1e-06,0,-2e-06,0,-1e-06,0,-1e-06,-2e-06,2e-06,2e-06,0,0,0,1e-06,0,2e-06,0,0,0,1e-06,3e-06,0,-3e-06,-2e-06,0,-1e-06,-4e-06,-1e-06,-3e-06,0,-1e-06,0,0,-1e-06,0,0,2e-06,0,0,0,0
0,2e-06,0,0,0,1e-06,1e-06,-1e-06,0,0,0,0,-1e-06,2e-06,1e-06,0,-1e-06,-2e-06,1e-06,1e-06,-2e-06,1e-06,-1e-06,5e-06,0,-2e-06,1e-06,0,-1e-06,-2e-06,2e-06,-1e-06,1e-06,0,-1e-06,1e-06,0,1e-06,-1e-06,0,-1e-06,-2e-06,-1e-06,1e-06,0,0,0,0,1e-06,0,-1e-06,0,0,0,-1e-06,-2e-06,1e-06,1e-06,0,-1e-06,3e-06,-1e-06,1e-06,0,0,0,-1e-06,1e-06,0,1e-06,0,0,0,-2e-06,2e-06,0,-2e-06,-1e-06,1e-06,0,1e-06,-1e-06,1e-06,-2e-06,0,1e-06,0,1e-06,-2e-06,0,0,0,0,0,0,-2e-06,0,0,0,0,-1e-06,-1e-06,3e-06,-3e-06,-2e-06,2e-06,1e-06,1e-06,-1e-06,0,1e-06,0,-1e-06,1e-06,-1e-06,0,1e-06,0,0,-1e-06,-2e-06
0,2e-06,0,-1e-06,1e-06,-6e-06,1e-06,0,0,1e-06,-1e-06,0,-1e-06,0,2e-06,0,-5e-06,-2e-06,-2e-06,0,0,-2e-06,0,1e-06,-1e-06,-1e-06,-1e-06,-3e-06,0,0,0,1e-06,0,0,-2e-06,0,-2e-06,-1e-06,-2e-06,-1e-06,1e-06,-1e-06,0,0,1e-06,-1e-06,0,0,-2e-06,1e-06,1e-06,0,1e-06,0,3e-06,2e-06,2e-06,0,-2e-06,0,0,0,0,1e-06,-1e-06,1e-06,-1e-06,0,0,0,-2e-06,0,1e-06,1e-06,2e-06,0,-1e-06,0,0,-1e-06,0,-2e-06,1e-06,-1e-06,-1e-06,1e-06,-1e-06,0,1e-06,-1e-06,1e-06,0,0,0,1e-06,1e-06,0,0,0,0,-2e-06,-1e-06,-2e-06,-1e-06,0,0,2e-06,0,1e-06,-1e-06,0,0,0,1e-06,0,1e-06,-2e-06,0,0,1e-06,0
0,-1e-06,0,1e-06,-1e-06,2e-06,-3e-06,0,0,2e-06,0,1e-06,0,-1e-06,1e-06,0,0,-2e-06,2e-06,0,1e-06,2e-06,1e-06,-4e-06,0,1e-06,0,1e-06,-1e-06,1e-06,-3e-06,-1e-06,-1e-06,0,-1e-06,0,1e-06,1e-06,-1e-06,0,-1e-06,0,0,0,1e-06,0,1e-06,0,1e-06,1e-06,0,0,0,-1e-06,2e-06,0,0,0,0,-1e-06,-3e-06,1e-06,0,0,0,0,-1e-06,0,0,0,1e-06,0,-1e-06,-1e-06,2e-06,0,0,1e-06,-1e-06,-2e-06,0,-2e-06,0,1e-06,-1e-06,-1e-06,0,-1e-06,-2e-06,1e-06,-1e-06,0,0,-1e-06,-1e-06,-1e-06,0,0,0,-1e-06,3e-06,0,2e-06,1e-06,1e-06,-2e-06,-2e-06,0,3e-06,1e-06,0,0,0,0,1e-06,-1e-06,2e-06,0,0,-2e-06,-1e-06
1e-06,-2e-06,0,0,0,5e-06,1e-06,0,0,1e-06,0,-1e-06,0,1e-06,1e-06,0,4e-06,0,-2e-06,-1e-06,0,-2e-06,0,1e-06,0,2e-06,1e-06,3e-06,0,-1e-06,0,1e-06,1e-06,0,2e-06,0,-2e-06,-1e-06,1e-06,0,1e-06,1e-06,-1e-06,-1e-06,1e-06,0,-1e-06,0,-1e-06,0,0,0,0,1e-06,-2e-06,0,0,0,0,0,1e-06,-2e-06,0,0,0,-1e-06,0,0,0,-1e-06,-1e-06,0,0,1e-06,-2e-06,0,0,0,0,0,0,-2e-06,-1e-06,1e-06,0,1e-06,-1e-06,1e-06,1e-06,0,1e-06,0,0,1e-06,-1e-06,2e-06,-1e-06,0,0,0,-3e-06,0,-1e-06,-1e-06,0,1e-06,0,1e-06,3e-06,-1e-06,0,0,0,-1e-06,1e-06,0,0,0,0,2e-06,-1e-06
-1e-06,1e-06,0,0,0,-1e-06,2e-06,-1e-06,0,1e-06,0,0,0,0,-1e-06,0,0,5e-06,2e-06,0,-1e-06,1e-06,0,3e-06,0,-1e-06,-1e-06,0,1e-06,-1e-06,2e-06,-1e-06,-1e-06,0,3e-06,0,0,-1e-06,2e-06,0,-1e-06,2e-06,0,0,-1e-06,1e-06,-1e-06,0,2e-06,1e-06,0,0,0,0,-2e-06,0,0,0,0,-1e-06,0,2e-06,0,0,0,0,-1e-06,0,0,-1e-06,0,0,0,-1e-06,-4e-06,0,0,0,-2e-06,0,0,-1e-06,0,1e-06,0,-1e-06,-1e-06,-1e-06,-2e-06,-1e-06,-1e-06,0,0,-1e-06,1e-06,-2e-06,1e-06,0,0,0,2e-06,1e-06,0,1e-06,0,2e-06,2e-06,-1e-06,2e-06,1e-06,-1e-06,0,0,-1e-06,1e-06,0,2e-06,0,0,-1e-06,-1e-06
1e-06,2e-06,0,0,0,-5e-06,-1e-06,0,0,-2e-06,0,0,-1e-06,-1e-06,0,0,-4e-06,-2e-06,-2e-06,-1e-06,0,-1e-06,0,-4e-06,0,-2e-06,0,-3e-06,0,1e-06,-1e-06,1e-06,0,0,2e-06,0,0,1e-06,1e-06,-1e-06,0,0,-1e-06,0,-1e-06,0,2e-06,0,-1e-06,-1e-06,0,0,0,0,1e-06,0,-1e-06,0,0,0,2e-06,-2e-06,0,0,0,1e-06,-1e-06,0,0,0,0,0,0,1e-06,-1e-06,1e-06,1e-06,0,1e-06,0,1e-06,-1e-06,0,0,-1e-06,1e-06,0,0,1e-06,0,1e-06,0,0,1e-06,-1e-06,2e-06,-1e-06,0,0,0,0,0,0,2e-06,-1e-06,-2e-06,-2e-06,0,0,-1e-06,0,0,0,2e-06,0,0,-1e-06,0,0,0,-1e-06
-2e-06,0,0,0,1e-06,1e-06,0,1e-06,0,1e-06,0,0,0,0,-2e-06,0,1e-06,1e-06,2e-06,1e-06,0,0,0,-1e-06,0,0,1e-06,0,0,0,-1e-06,-1e-06,1e-06,0,0,0,-2e-06,-1e-06,-1e-06,0,1e-06,-1e-06,-1e-06,0,0,1e-06,-1e-06,0,1e-06,-1e-06,-1e-06,-1e-06,0,0,1e-06,1e-06,-1e-06,0,1e-06,-1e-06,0,2e-06,0,0,0,0,0,0,0,0,0,0,0,-1e-06,2e-06,0,1e-06,-1e-06,0,-1e-06,-1e-06,0,0,-1e-06,0,-1e-06,-1e-06,1e-06,-1e-06,0,-1e-06,0,0,-1e-06,0,-2e-06,1e-06,0,0,-1e-06,-2e-06,-1e-06,0,1e-06,0,-1e-06,-1e-06,0,-3e-06,0,0,0,0,1e-06,0,0,2e-06,0,0,2e-06,0
