0.003344,0.00458,0.006823,0.006899,0.005053,0.003947,0.003594,0.004255,0.004762,0.003861,0.003255,0.003373,0.00382,0.004551,0.004822,0.005605,0.006078,0.005383,0.004734,0.003893,0.003098,0.00304,0.00361,0.004063,0.004403,0.004915,0.00504,0.005726
0.004184,0.005309,0.007301,0.007397,0.005765,0.004689,0.0043,0.004839,0.005219,0.004393,0.003888,0.004013,0.004381,0.005094,0.00563,0.006668,0.007097,0.006269,0.005584,0.004622,0.003645,0.003533,0.004116,0.004665,0.005208,0.005911,0.006039,0.006477
0.005633,0.006433,0.007939,0.008098,0.006854,0.005957,0.005602,0.005874,0.005996,0.005331,0.004972,0.005038,0.005273,0.005987,0.006915,0.008273,0.008651,0.007682,0.006916,0.005703,0.004408,0.004213,0.004834,0.005571,0.00647,0.00747,0.007587,0.007615
0.006678,0.007076,0.008449,0.008781,0.007611,0.007046,0.006954,0.006887,0.006754,0.006202,0.005768,0.00562,0.005801,0.006547,0.00759,0.008971,0.009282,0.008291,0.007481,0.006101,0.004623,0.004411,0.005058,0.006012,0.007237,0.008344,0.008378,0.008198
0.007008,0.007061,0.008544,0.009025,0.007792,0.007817,0.008144,0.007789,0.007573,0.007047,0.006324,0.005897,0.00607,0.006826,0.007724,0.008805,0.008898,0.00791,0.007148,0.005783,0.004283,0.004139,0.004922,0.006168,0.00769,0.008843,0.008619,0.008185
0.00703,0.006944,0.008527,0.009068,0.007701,0.008147,0.008807,0.008422,0.008409,0.008025,0.007131,0.006486,0.006506,0.007059,0.007915,0.008993,0.008983,0.007903,0.007059,0.005762,0.004345,0.004293,0.005223,0.006601,0.008257,0.009394,0.008772,0.008051
0.00746,0.007253,0.008869,0.009507,0.007953,0.008165,0.008776,0.008708,0.009079,0.008825,0.00785,0.007233,0.007335,0.007645,0.008633,0.010366,0.010547,0.009126,0.008102,0.006645,0.004968,0.004876,0.005879,0.007328,0.009159,0.010218,0.009194,0.008231
0.008384,0.007656,0.00905,0.009998,0.008456,0.007949,0.008096,0.008507,0.009278,0.009132,0.008353,0.008128,0.008692,0.008994,0.010063,0.012854,0.013237,0.011031,0.010008,0.008266,0.005922,0.005556,0.006429,0.007969,0.010077,0.011175,0.010049,0.009046
0.009464,0.008157,0.009136,0.01044,0.009196,0.008018,0.007783,0.008637,0.009674,0.009924,0.009794,0.01005,0.010826,0.010843,0.011451,0.014848,0.015422,0.012637,0.011771,0.009777,0.006959,0.006171,0.00647,0.008139,0.010792,0.012281,0.011477,0.010424
0.010139,0.008826,0.010133,0.011835,0.010442,0.008525,0.00813,0.009321,0.01052,0.011093,0.011413,0.011955,0.012672,0.012275,0.01208,0.015333,0.016204,0.013358,0.012598,0.010642,0.007919,0.006843,0.00641,0.008031,0.011446,0.013974,0.013592,0.012205
0.01058,0.010008,0.012138,0.014074,0.012086,0.009122,0.008561,0.009936,0.011081,0.011855,0.012464,0.012948,0.013367,0.012818,0.012325,0.01526,0.016783,0.014652,0.013457,0.011102,0.008646,0.007613,0.006885,0.008378,0.012422,0.01623,0.015961,0.013929
0.011448,0.011819,0.014237,0.015879,0.01359,0.009994,0.009327,0.010694,0.011745,0.012551,0.013219,0.013178,0.012803,0.012377,0.012739,0.015724,0.017608,0.01642,0.014601,0.011354,0.008735,0.008096,0.008103,0.009894,0.014478,0.01948,0.018716,0.015616
0.013147,0.014279,0.015831,0.016544,0.014781,0.011489,0.010646,0.011454,0.012338,0.01293,0.013046,0.0122,0.011175,0.011249,0.012781,0.015824,0.017638,0.016926,0.014512,0.010706,0.007989,0.008008,0.009298,0.011654,0.016415,0.021617,0.020618,0.017304
0.013993,0.015817,0.01661,0.016471,0.01546,0.012882,0.011814,0.011502,0.011938,0.012677,0.012217,0.010908,0.010274,0.01094,0.012548,0.015314,0.017054,0.016463,0.014259,0.010764,0.00787,0.007991,0.009938,0.012513,0.016424,0.02006,0.019356,0.01727
0.012937,0.014883,0.015927,0.015617,0.014631,0.012929,0.012416,0.011339,0.010877,0.011779,0.011357,0.010281,0.010302,0.011046,0.01162,0.013096,0.015206,0.015606,0.014258,0.011551,0.00855,0.008206,0.009805,0.011835,0.014414,0.016314,0.016099,0.0159
0.010922,0.012663,0.014713,0.014536,0.013396,0.013086,0.013501,0.012047,0.010922,0.012221,0.012298,0.011192,0.011397,0.012055,0.01139,0.01137,0.013898,0.015165,0.014653,0.012774,0.009601,0.008747,0.009847,0.011249,0.013712,0.016105,0.015669,0.015844
0.00961,0.011935,0.015492,0.015746,0.013829,0.013177,0.013845,0.013068,0.012527,0.01453,0.014758,0.013255,0.013572,0.014386,0.012502,0.011134,0.014146,0.015883,0.015676,0.014068,0.010514,0.009278,0.010393,0.011594,0.014726,0.019663,0.019482,0.018154
0.009164,0.012265,0.01722,0.018141,0.01541,0.014383,0.015795,0.015328,0.014693,0.017056,0.017132,0.015502,0.016258,0.017298,0.014322,0.011642,0.014479,0.016538,0.017315,0.015812,0.011112,0.009467,0.011295,0.012611,0.017285,0.025765,0.025719,0.021992
0.010855,0.013799,0.019004,0.020772,0.018758,0.01887,0.021313,0.019182,0.016889,0.018711,0.018148,0.0171,0.018581,0.019716,0.01674,0.014115,0.015977,0.017215,0.019221,0.018087,0.012175,0.010362,0.012819,0.01414,0.021362,0.033947,0.032627,0.02573
0.013618,0.016681,0.020481,0.02228,0.023359,0.026873,0.030258,0.025279,0.021115,0.021974,0.019751,0.018729,0.0207,0.021786,0.01968,0.01826,0.018559,0.01807,0.020718,0.020131,0.014429,0.013226,0.01553,0.017484,0.026723,0.039771,0.036287,0.028484
0.016798,0.021037,0.022294,0.022387,0.02711,0.035106,0.039543,0.032847,0.027711,0.028069,0.02379,0.021163,0.022852,0.023888,0.022442,0.021986,0.02125,0.019632,0.022201,0.021261,0.01611,0.016241,0.018592,0.021486,0.030483,0.039412,0.034705,0.029306
0.020208,0.025244,0.02457,0.023257,0.029852,0.039445,0.043604,0.037887,0.033079,0.032381,0.027061,0.022975,0.024309,0.025857,0.024802,0.025389,0.024388,0.022015,0.024822,0.023841,0.018471,0.018973,0.022091,0.025656,0.032724,0.037334,0.032199,0.029407
0.024022,0.028103,0.025688,0.023958,0.030139,0.037045,0.039821,0.037251,0.033295,0.030769,0.025903,0.022015,0.024244,0.027353,0.027452,0.028743,0.027689,0.02467,0.026049,0.025186,0.019844,0.019788,0.023734,0.02715,0.032525,0.036165,0.032052,0.030179
0.026588,0.03049,0.027957,0.026272,0.030908,0.034451,0.035741,0.033921,0.02968,0.026042,0.022619,0.020419,0.022774,0.026157,0.027422,0.028189,0.027515,0.025364,0.023463,0.021632,0.018077,0.018049,0.022344,0.024516,0.028051,0.034975,0.033677,0.029524
0.025713,0.030088,0.031131,0.030197,0.030646,0.031486,0.031144,0.027532,0.02418,0.023625,0.022541,0.020402,0.021606,0.02415,0.024285,0.023028,0.023551,0.02371,0.018993,0.015191,0.013911,0.015907,0.022126,0.022546,0.022216,0.031927,0.033697,0.028387
0.025966,0.028593,0.03187,0.034039,0.030346,0.024704,0.021819,0.02024,0.020189,0.021636,0.021151,0.019323,0.021043,0.022985,0.02082,0.018566,0.021574,0.024019,0.01865,0.01273,0.011353,0.01603,0.024944,0.02349,0.020837,0.03164,0.035129,0.031583
0.028513,0.027389,0.030711,0.035387,0.029141,0.017372,0.013093,0.01698,0.019746,0.018347,0.016416,0.015162,0.017334,0.019673,0.018362,0.018176,0.02292,0.025075,0.019992,0.012999,0.00935,0.014378,0.024584,0.02322,0.022903,0.036931,0.040126,0.036011
0.028782,0.025713,0.030126,0.036685,0.02946,0.015341,0.010225,0.016045,0.019865,0.016912,0.014239,0.011788,0.012373,0.015181,0.017099,0.01954,0.023954,0.026224,0.022117,0.014547,0.008716,0.011734,0.020842,0.021271,0.024707,0.039993,0.042641,0.037735
0.025965,0.022538,0.028802,0.03752,0.029761,0.016525,0.013357,0.018546,0.021855,0.020277,0.016899,0.012086,0.010998,0.012342,0.016488,0.022955,0.027409,0.029618,0.026004,0.017679,0.010198,0.011579,0.021035,0.022931,0.025385,0.037106,0.040772,0.037736
0.024353,0.021286,0.029258,0.038107,0.029853,0.020808,0.020815,0.024496,0.025548,0.023724,0.019345,0.014095,0.014074,0.015176,0.02082,0.032569,0.038307,0.038825,0.034718,0.024138,0.0135,0.013824,0.023358,0.024948,0.027349,0.038193,0.04389,0.040267
0.028644,0.025368,0.031238,0.039954,0.03464,0.028286,0.029458,0.031094,0.028966,0.025094,0.020737,0.016901,0.017644,0.01894,0.027296,0.045262,0.050544,0.046432,0.043382,0.032177,0.018184,0.017695,0.02516,0.025651,0.033718,0.052574,0.058901,0.045142
0.03472,0.032426,0.037546,0.04248,0.037406,0.033283,0.034375,0.035812,0.032889,0.024982,0.020139,0.01919,0.019778,0.021811,0.032431,0.053193,0.057331,0.048765,0.046576,0.036412,0.021601,0.020282,0.023714,0.022932,0.037566,0.06512,0.071545,0.048871
0.034462,0.035914,0.048352,0.047575,0.034327,0.030717,0.031237,0.033675,0.033709,0.025792,0.021517,0.023436,0.022824,0.024266,0.033541,0.050178,0.054015,0.046681,0.042262,0.032718,0.021677,0.020247,0.020508,0.018709,0.03461,0.064957,0.070049,0.046362
0.026215,0.032524,0.058251,0.0566,0.029299,0.02095,0.021312,0.025544,0.030191,0.025992,0.026153,0.031416,0.030561,0.02931,0.032634,0.03878,0.040691,0.037907,0.031073,0.022793,0.019335,0.019215,0.016722,0.015064,0.026879,0.050042,0.053261,0.03822
0.016533,0.025843,0.061798,0.061849,0.023565,0.01073,0.012963,0.020763,0.030327,0.028671,0.030024,0.037054,0.036942,0.032107,0.028701,0.026685,0.029493,0.030833,0.021616,0.015058,0.016989,0.016912,0.013542,0.011983,0.017972,0.029887,0.035525,0.03123
0.012918,0.022864,0.058501,0.060605,0.023343,0.008526,0.01128,0.021582,0.033459,0.033536,0.031796,0.03523,0.036791,0.029526,0.022106,0.021671,0.02733,0.029056,0.019768,0.014318,0.014851,0.012787,0.010313,0.009449,0.012855,0.016457,0.023839,0.025218
0.010976,0.02282,0.050294,0.052376,0.024866,0.01105,0.012718,0.021637,0.032317,0.035551,0.029765,0.026071,0.029684,0.024747,0.018996,0.02378,0.027091,0.027898,0.023088,0.018058,0.013176,0.008626,0.007255,0.008937,0.01207,0.013159,0.02008,0.020576
0.011332,0.023916,0.043226,0.043469,0.023368,0.01372,0.016618,0.021405,0.025909,0.032611,0.028198,0.017525,0.020794,0.021712,0.019115,0.027361,0.029644,0.030014,0.029732,0.02514,0.014674,0.008033,0.007468,0.010279,0.014173,0.016319,0.021864,0.01903
0.013754,0.023891,0.046478,0.045523,0.019488,0.014892,0.019872,0.021937,0.021373,0.026848,0.027503,0.01522,0.016501,0.02042,0.018989,0.027069,0.030684,0.032147,0.0368,0.033508,0.018538,0.009089,0.009674,0.013331,0.017147,0.020835,0.023651,0.018711
0.015047,0.020459,0.048392,0.051041,0.018669,0.014735,0.020219,0.022328,0.023306,0.023116,0.023841,0.015472,0.02041,0.025596,0.019908,0.022934,0.028752,0.034388,0.043407,0.039004,0.022005,0.010694,0.012389,0.016396,0.018492,0.023671,0.02335,0.022235
