0.047221,0.029656,0.026673,0.03784,0.050683,0.065137,0.071476,0.089852,0.18382,0.346675,0.463448,0.467943,0.577489,0.964926,1.145846,0.980504,0.856266,0.80192,0.864888,0.90076,0.630686,0.337839,0.39807,0.52056,0.343586,0.121169,0.045385,0.02402
0.054848,0.035115,0.032634,0.04621,0.061839,0.080536,0.086852,0.104053,0.212447,0.40596,0.545452,0.553488,0.663124,1.069156,1.251815,1.076694,0.952807,0.889421,0.960027,0.999626,0.702158,0.385312,0.453955,0.591116,0.393934,0.140951,0.054003,0.030088
0.064824,0.042942,0.041875,0.058773,0.078156,0.104927,0.111595,0.122784,0.2468,0.485967,0.65947,0.668805,0.772771,1.188106,1.374393,1.214541,1.103045,1.01475,1.070679,1.101699,0.779329,0.440365,0.511582,0.66201,0.45141,0.166644,0.066296,0.040481
0.065992,0.045515,0.045993,0.062403,0.081057,0.115752,0.125863,0.126667,0.240105,0.498615,0.690775,0.687979,0.807831,1.244748,1.456823,1.362091,1.270465,1.128305,1.097973,1.073224,0.75633,0.427213,0.477985,0.617979,0.438752,0.171007,0.07071,0.047855
0.0639,0.046206,0.046119,0.05619,0.06852,0.107907,0.125056,0.120403,0.207062,0.471765,0.683646,0.648433,0.821246,1.377716,1.672476,1.616624,1.505391,1.327255,1.202658,1.068136,0.718499,0.383622,0.417003,0.548423,0.401973,0.162728,0.067948,0.04994
0.075371,0.0562,0.052288,0.054138,0.060945,0.105069,0.129253,0.122988,0.191899,0.483577,0.738935,0.664902,0.905552,1.678761,2.125198,2.073872,1.900268,1.685286,1.487674,1.211147,0.758989,0.39077,0.428712,0.55265,0.391943,0.161711,0.066646,0.049396
0.108418,0.079948,0.069331,0.06809,0.076845,0.135681,0.165301,0.149122,0.228998,0.593909,0.90583,0.814068,1.187989,2.170758,2.781458,2.873118,2.669309,2.332376,2.065872,1.621812,0.978543,0.511237,0.530454,0.651598,0.425293,0.172649,0.072747,0.05116
0.158805,0.110398,0.09014,0.089804,0.104641,0.193175,0.234548,0.203357,0.313249,0.770481,1.111266,1.014099,1.703895,3.097858,4.043958,4.330769,4.041609,3.614558,3.349179,2.682944,1.599357,0.77715,0.702123,0.844311,0.512067,0.198965,0.09157,0.062092
0.222491,0.141877,0.10847,0.111174,0.132164,0.255831,0.313258,0.273041,0.440096,1.013669,1.34799,1.21632,2.501525,4.875949,6.42961,6.684143,6.234725,5.958482,5.642037,4.456351,2.614571,1.16262,0.903575,1.068294,0.630722,0.24802,0.126025,0.084852
0.286238,0.16654,0.11574,0.11998,0.148859,0.309501,0.380875,0.326412,0.546702,1.226196,1.537978,1.371543,3.501423,7.346928,9.69247,9.89668,9.474723,9.530526,8.929652,6.815575,3.900587,1.605629,1.085664,1.240625,0.733736,0.306696,0.166744,0.115126
0.314732,0.166775,0.102804,0.107257,0.145429,0.337093,0.417289,0.346193,0.58028,1.308847,1.629856,1.469895,4.593236,10.078729,13.07018,13.285634,13.140088,13.544245,12.394966,9.088504,5.043534,1.978853,1.285889,1.377159,0.795361,0.353793,0.201014,0.143647
0.280623,0.138072,0.080249,0.082546,0.121972,0.321987,0.407598,0.347189,0.541135,1.186935,1.554348,1.5331,5.637448,12.344457,15.096024,15.093511,15.567032,16.192992,14.31293,10.033827,5.350688,2.042366,1.468799,1.512605,0.821742,0.371827,0.215809,0.153518
0.205327,0.100099,0.064353,0.064442,0.091377,0.270681,0.365595,0.344231,0.458856,0.939032,1.38875,1.566609,5.914481,12.59879,14.423577,13.989917,14.888234,15.446637,13.203618,8.842616,4.460059,1.678784,1.440198,1.489447,0.762314,0.335014,0.196745,0.13554
0.145076,0.071064,0.051271,0.053479,0.073267,0.221634,0.320355,0.360385,0.430787,0.821045,1.367795,1.559963,4.913456,10.075176,11.36259,10.878779,11.448879,11.402406,9.300505,6.019514,2.868303,1.108974,1.184448,1.260561,0.631709,0.26155,0.144142,0.099981
0.107035,0.055717,0.045331,0.051837,0.069803,0.190579,0.299798,0.456309,0.516971,0.942264,1.692081,1.646153,3.274337,6.378011,7.320323,7.074345,7.272793,6.631248,4.98006,3.144982,1.439734,0.648496,0.857503,0.942752,0.532195,0.225716,0.094254,0.070249
0.103417,0.060542,0.054361,0.065727,0.080586,0.208271,0.355976,0.651189,0.705963,1.274578,2.407305,2.031296,2.197656,4.162638,5.056894,4.752246,4.517877,3.718197,2.634363,1.693491,0.833367,0.497487,0.705556,0.8154,0.572438,0.279033,0.087611,0.066285
0.145549,0.086293,0.075157,0.090722,0.106298,0.281537,0.48967,0.944472,0.994218,1.815575,3.608388,2.895432,2.134017,4.181653,5.494653,4.844493,3.993888,3.043927,2.173725,1.506175,0.888174,0.571258,0.776313,0.927282,0.693081,0.351757,0.108088,0.084686
0.204054,0.121515,0.100448,0.117946,0.136594,0.384252,0.666304,1.271538,1.318728,2.487694,5.05812,3.951897,2.585713,5.213775,6.866587,5.99215,4.835433,3.503314,2.522548,1.911874,1.196775,0.676004,0.846476,1.021055,0.767263,0.402542,0.144383,0.11205
0.258234,0.154574,0.116976,0.132608,0.156544,0.46237,0.789622,1.441826,1.504647,3.052686,6.14882,4.63459,2.994298,6.543431,8.894504,7.939887,6.345228,4.508549,3.405151,2.688147,1.603461,0.783614,0.883827,1.041741,0.75619,0.405982,0.177306,0.133978
0.284354,0.168008,0.112507,0.121871,0.153483,0.480635,0.794809,1.32929,1.414152,3.172268,6.202129,4.501028,3.152473,7.603397,10.65532,9.811111,7.995206,5.743306,4.415041,3.506469,2.044131,0.940591,0.896493,0.972877,0.679428,0.368785,0.188419,0.138998
0.280058,0.153232,0.091587,0.095746,0.133788,0.435678,0.697023,1.029105,1.109063,2.737387,5.145175,3.64344,3.040104,7.752012,10.828378,10.211751,8.568689,6.23019,4.901613,4.016131,2.377926,1.055491,0.852964,0.856291,0.57655,0.306855,0.178439,0.130375
0.245913,0.12519,0.075029,0.08137,0.1167,0.352245,0.575068,0.810765,0.839599,2.002042,3.634612,2.692981,2.739056,6.520948,8.801249,8.619852,7.5305,5.519199,4.596699,4.004432,2.39611,0.998657,0.736471,0.746151,0.500165,0.256636,0.168328,0.126523
0.200709,0.11998,0.087205,0.087868,0.109779,0.269337,0.461277,0.64867,0.620383,1.333298,2.42961,2.153959,2.342276,4.583456,6.089327,6.217724,5.76852,4.620082,4.053394,3.618044,2.142783,0.774661,0.556935,0.619577,0.431452,0.229424,0.173597,0.136702
0.171436,0.131113,0.107863,0.097457,0.099616,0.198094,0.355738,0.524444,0.468716,0.884244,1.76521,1.915033,1.927282,3.023522,4.251495,4.648673,4.525872,4.055763,3.467633,2.843566,1.6807,0.567518,0.405291,0.492173,0.360127,0.201187,0.166344,0.136805
0.157445,0.139588,0.117579,0.095497,0.086401,0.152278,0.274751,0.406477,0.335809,0.657006,1.506209,1.740714,1.664284,2.544475,3.463702,3.770105,3.836212,3.590324,3.036827,2.199325,1.262482,0.508508,0.402983,0.462282,0.309424,0.167627,0.132976,0.11006
0.13628,0.128274,0.107679,0.08026,0.069662,0.126409,0.22287,0.323766,0.249187,0.516483,1.291842,1.543966,1.676031,2.663556,3.207775,3.069511,3.023415,2.880199,2.612279,1.994338,1.13969,0.531513,0.487367,0.512105,0.298858,0.142645,0.094118,0.073395
0.1116,0.099442,0.080214,0.063039,0.055367,0.107669,0.185677,0.272155,0.210644,0.428051,1.082351,1.423729,1.826741,2.685501,2.742346,2.250293,2.147615,2.072731,2.13266,1.968778,1.173184,0.557997,0.567724,0.578874,0.3019,0.114652,0.06421,0.046636
0.081784,0.067222,0.052793,0.051115,0.051117,0.091075,0.152823,0.218621,0.176806,0.358205,0.860351,1.186444,1.708084,2.457876,2.35866,1.690394,1.427961,1.404903,1.56785,1.614486,1.016579,0.511526,0.585346,0.595444,0.291009,0.092089,0.049297,0.034714
0.06146,0.046147,0.04145,0.053052,0.056567,0.078198,0.132238,0.174289,0.139263,0.287387,0.653064,0.878134,1.41222,2.22945,2.240871,1.521584,1.11058,1.079428,1.168957,1.09603,0.689319,0.443925,0.568778,0.544021,0.261591,0.08505,0.046148,0.032731
0.070357,0.051875,0.054651,0.075481,0.074663,0.085332,0.137047,0.1499,0.113265,0.218258,0.476681,0.673199,1.345654,2.146893,2.195711,1.607297,1.06402,1.024897,1.144469,0.863164,0.45719,0.441955,0.622623,0.568867,0.26694,0.07976,0.043802,0.032784
0.087605,0.064262,0.074826,0.10288,0.098493,0.110788,0.157176,0.146162,0.110204,0.189227,0.412044,0.707444,1.507977,2.080742,1.957655,1.533272,1.080771,1.134992,1.255193,0.825637,0.376057,0.45657,0.705214,0.627417,0.273711,0.070186,0.041014,0.034251
0.095162,0.071443,0.087923,0.117306,0.110257,0.13132,0.175886,0.1634,0.124695,0.177462,0.388241,0.779336,1.788672,2.302037,1.795129,1.317715,1.121402,1.285436,1.267573,0.777146,0.353402,0.443385,0.732558,0.612568,0.243213,0.06319,0.041242,0.037527
0.083051,0.064769,0.082334,0.105385,0.098185,0.132248,0.176312,0.183366,0.143605,0.160447,0.392223,0.827647,1.942129,2.454043,1.735968,1.289141,1.281798,1.320952,1.162582,0.755999,0.363182,0.438535,0.663143,0.50845,0.199145,0.060379,0.039398,0.036408
0.055117,0.044737,0.058105,0.070913,0.066408,0.112434,0.158681,0.188389,0.148906,0.142052,0.384502,0.867444,1.958821,2.392025,1.643927,1.394715,1.470486,1.168838,0.93709,0.728834,0.394543,0.401791,0.506005,0.401609,0.189039,0.059691,0.035739,0.032132
0.027716,0.023387,0.030765,0.03557,0.035021,0.087703,0.141039,0.180503,0.134802,0.138828,0.353149,0.813465,1.720724,2.226105,1.75617,1.554843,1.540242,0.997572,0.708609,0.638692,0.417026,0.328014,0.341052,0.33272,0.199287,0.056873,0.03385,0.030182
0.017544,0.014861,0.01786,0.019199,0.021152,0.068072,0.118875,0.160113,0.114002,0.147293,0.351872,0.681445,1.265203,1.89298,1.741028,1.562731,1.491181,0.846638,0.585696,0.535015,0.398041,0.303608,0.279117,0.279834,0.191978,0.052422,0.032706,0.030956
0.019753,0.013173,0.012264,0.012405,0.014338,0.052589,0.101346,0.14159,0.098397,0.159357,0.363951,0.50626,0.95996,1.729049,1.533695,1.500018,1.59333,0.817746,0.503248,0.473159,0.351956,0.304008,0.294715,0.259311,0.168287,0.042195,0.03014,0.029709
0.020943,0.012458,0.011303,0.011338,0.013473,0.043057,0.079423,0.118855,0.089997,0.17249,0.353477,0.394357,0.869468,1.561178,1.26094,1.501455,1.708145,0.855487,0.477977,0.497697,0.386739,0.359437,0.384336,0.307487,0.160283,0.032016,0.029032,0.027737
0.021555,0.013535,0.013943,0.015268,0.017688,0.039772,0.058143,0.096211,0.088907,0.183191,0.33981,0.420365,0.873744,1.279673,1.083649,1.455901,1.641712,0.863925,0.484366,0.495978,0.432038,0.47962,0.536893,0.411777,0.187285,0.03449,0.03088,0.026737
0.023967,0.01489,0.016884,0.021598,0.022544,0.042234,0.053965,0.091326,0.088298,0.180541,0.340957,0.472244,0.87147,0.989736,0.967766,1.307114,1.469482,0.880289,0.580586,0.469518,0.415877,0.576854,0.703674,0.52709,0.212602,0.042158,0.03644,0.030528
