0.109986,0.09377,0.104334,0.123097,0.12178,0.110644,0.10011,0.100728,0.097365,0.090128,0.088996,0.085901,0.087559,0.087583,0.080619,0.072923,0.076207,0.087096,0.086673,0.079177,0.073174,0.074501,0.079582,0.074521,0.069454,0.07073,0.08143,0.085719
0.138689,0.118703,0.132874,0.156584,0.155025,0.141827,0.127437,0.128157,0.124655,0.114016,0.111671,0.107393,0.11063,0.113704,0.104397,0.094064,0.098482,0.11225,0.111694,0.101275,0.091827,0.093121,0.099551,0.092309,0.085864,0.08863,0.102998,0.107558
0.186283,0.16063,0.180439,0.210698,0.209376,0.194632,0.175262,0.176768,0.173058,0.155155,0.150884,0.144181,0.149289,0.158761,0.145845,0.131629,0.138904,0.157295,0.15622,0.140888,0.125153,0.126447,0.135519,0.125597,0.11617,0.120526,0.142478,0.148246
0.217063,0.190697,0.210693,0.239809,0.242131,0.231515,0.210091,0.212867,0.209448,0.183276,0.178463,0.173604,0.178864,0.191062,0.175397,0.161999,0.173367,0.192477,0.190282,0.171451,0.150732,0.152709,0.165961,0.157861,0.144602,0.148268,0.177791,0.184767
0.230557,0.205171,0.217182,0.239311,0.248423,0.243652,0.222771,0.226045,0.224242,0.195748,0.191704,0.194258,0.19746,0.202366,0.18473,0.178847,0.194223,0.207136,0.205141,0.187445,0.164852,0.166033,0.185073,0.18928,0.177057,0.175527,0.201611,0.205313
0.277903,0.233619,0.24399,0.282128,0.297983,0.275576,0.246689,0.255018,0.260531,0.236035,0.220776,0.227197,0.238098,0.232628,0.206946,0.208635,0.232119,0.243003,0.241153,0.223691,0.199352,0.193299,0.215682,0.243067,0.238746,0.227047,0.242697,0.236511
0.424732,0.32781,0.34642,0.447261,0.493132,0.414473,0.349306,0.369937,0.390694,0.363141,0.310428,0.313046,0.351082,0.339879,0.297021,0.303765,0.344007,0.366831,0.348221,0.314653,0.299956,0.293659,0.321224,0.371941,0.373111,0.345571,0.363392,0.355407
0.712238,0.519559,0.552843,0.775768,0.89578,0.710393,0.582207,0.621857,0.654221,0.619141,0.497968,0.496198,0.598422,0.56172,0.464131,0.480219,0.561425,0.623705,0.567987,0.484938,0.497339,0.503165,0.541943,0.621951,0.623591,0.575577,0.611698,0.612179
1.162339,0.828425,0.897678,1.320919,1.546196,1.185789,0.973238,1.031929,1.062634,1.020309,0.804066,0.813321,1.027311,0.940578,0.737203,0.756872,0.916896,1.072455,0.962658,0.78011,0.820818,0.836503,0.905033,1.038783,1.029932,0.945303,1.009668,1.033409
1.722541,1.237439,1.362661,2.029748,2.358798,1.786634,1.498069,1.553587,1.543524,1.499892,1.206536,1.267345,1.640555,1.483186,1.110624,1.111817,1.402954,1.71373,1.533473,1.215218,1.262593,1.264509,1.386609,1.596022,1.571266,1.457589,1.5564,1.600179
2.163625,1.594646,1.784542,2.637473,2.997559,2.276042,1.993619,2.002937,1.890193,1.857847,1.576925,1.740461,2.261012,2.017864,1.452937,1.416297,1.860937,2.359913,2.108524,1.66166,1.694706,1.662791,1.84822,2.111295,2.07066,1.97965,2.112879,2.131952
2.194098,1.680883,1.922377,2.764167,3.002931,2.332579,2.203397,2.127738,1.875296,1.845393,1.686062,1.966058,2.521745,2.220593,1.562585,1.513433,2.041478,2.628189,2.342928,1.87895,1.907816,1.817078,2.000632,2.240452,2.207529,2.233115,2.382206,2.303885
1.764812,1.421089,1.6388,2.213308,2.231879,1.819138,1.903387,1.782914,1.496759,1.461267,1.436394,1.746638,2.1509,1.866687,1.337675,1.348061,1.788388,2.231116,2.002056,1.689926,1.736414,1.594918,1.670328,1.811869,1.821728,1.986699,2.120889,1.926793
1.161531,0.993389,1.115581,1.339144,1.236073,1.111282,1.269895,1.186017,1.017499,1.002036,1.019407,1.224114,1.380234,1.168688,0.921925,1.012057,1.22901,1.38258,1.309154,1.212133,1.221151,1.100666,1.090991,1.150589,1.202317,1.371156,1.42237,1.204641
0.879375,0.747206,0.764816,0.826466,0.782116,0.773756,0.820667,0.808297,0.735611,0.719963,0.741815,0.841329,0.871919,0.71565,0.632279,0.70606,0.775888,0.771235,0.782074,0.791093,0.764214,0.744284,0.777795,0.844436,0.827609,0.820417,0.831882,0.762474
1.097582,0.880994,0.805585,0.850718,0.918509,0.880613,0.766131,0.808346,0.806669,0.790909,0.827879,0.868053,0.879787,0.767271,0.683534,0.684541,0.771259,0.799193,0.792638,0.812947,0.768803,0.76011,0.815892,0.891347,0.776282,0.65487,0.759914,0.825969
1.489954,1.195195,1.068331,1.120559,1.267561,1.201157,0.961716,1.040876,1.083101,1.008158,1.015727,1.041926,1.062125,0.997477,0.925262,0.912225,1.052132,1.087398,1.025562,1.040681,1.003038,0.989132,1.03561,1.085978,0.943937,0.767249,0.895794,1.041141
1.788529,1.536494,1.381901,1.380087,1.572469,1.516451,1.255472,1.410875,1.4581,1.2453,1.171011,1.234225,1.280612,1.239372,1.207891,1.234153,1.381248,1.394754,1.275202,1.255784,1.282349,1.307945,1.337973,1.345478,1.23912,1.049088,1.135382,1.386985
1.919309,1.88856,1.669596,1.525606,1.695162,1.649445,1.489504,1.753667,1.794871,1.446556,1.255796,1.337367,1.390802,1.380938,1.424227,1.516958,1.615964,1.646736,1.588387,1.540803,1.623032,1.692396,1.683915,1.658455,1.657249,1.486071,1.468065,1.799921
1.863414,2.149919,1.870623,1.634173,1.755028,1.661667,1.694618,2.043031,2.025962,1.621107,1.33729,1.291735,1.248009,1.346986,1.520819,1.649678,1.660873,1.741182,1.843036,1.800014,1.855819,1.879614,1.842222,1.882241,2.041533,1.917962,1.818283,2.231118
1.62599,2.063085,1.873036,1.766516,1.928273,1.699278,1.758439,2.101326,2.031299,1.646793,1.327509,1.120227,0.960961,1.173919,1.406038,1.55092,1.52075,1.615914,1.860572,1.82738,1.778496,1.668515,1.581319,1.736235,2.09119,2.083276,2.012785,2.518699
1.318207,1.663522,1.57537,1.629361,1.881619,1.595793,1.52299,1.739351,1.720342,1.489458,1.185381,0.904862,0.745233,0.973542,1.15435,1.31096,1.2589,1.252508,1.497777,1.48188,1.383657,1.172354,1.021884,1.251624,1.736245,1.866761,1.839722,2.318305
0.944088,1.150571,1.129382,1.244154,1.482896,1.253287,1.08648,1.155429,1.212287,1.165563,0.939467,0.711188,0.670455,0.836202,0.893439,1.00111,0.989646,0.903175,0.982262,0.990011,0.958482,0.757792,0.667714,0.944817,1.342561,1.504067,1.460451,1.708738
0.74576,0.934788,0.956915,0.980789,1.087897,0.940252,0.846633,0.941672,1.042006,0.984358,0.823762,0.69145,0.753658,0.838845,0.72618,0.771434,0.896902,0.843824,0.71366,0.688337,0.744728,0.60075,0.644824,1.025328,1.239582,1.322477,1.414513,1.435784
0.863102,1.012338,1.046974,1.106654,1.155574,0.911688,0.830946,1.020884,1.181773,1.078342,0.932595,0.813259,0.903852,0.998449,0.738768,0.790396,1.104178,1.042432,0.701521,0.619155,0.766146,0.657102,0.81312,1.317674,1.354089,1.343977,1.695077,1.677262
1.076013,1.124026,1.200129,1.484307,1.501768,1.004481,0.924555,1.260331,1.432885,1.246531,1.101876,1.009228,1.131042,1.223486,0.846862,0.949423,1.469249,1.366243,0.80157,0.670422,0.913453,0.802727,1.053026,1.72476,1.649287,1.554399,2.054253,1.970075
1.18496,1.13425,1.264303,1.765067,1.761058,1.04601,0.978764,1.462655,1.642835,1.383221,1.231709,1.19568,1.363343,1.396263,0.950148,1.074934,1.691606,1.579422,0.929328,0.805621,1.10399,0.961136,1.213168,2.022253,1.869748,1.593078,2.073619,1.953635
1.127052,1.078807,1.211315,1.704389,1.733623,1.021953,0.904448,1.382793,1.58134,1.339772,1.178499,1.221535,1.448725,1.37253,0.897696,0.996464,1.549962,1.494389,0.969611,0.87654,1.153524,1.03343,1.181135,1.934417,1.789447,1.335447,1.622896,1.503132
1.024313,1.029296,0.998271,1.250352,1.360089,0.886153,0.686028,0.987197,1.204714,1.083185,0.991161,1.087161,1.331637,1.211016,0.735852,0.74622,1.118943,1.203044,0.907291,0.774104,0.957278,0.935102,0.984224,1.481232,1.425285,0.997509,1.045313,0.913269
0.902906,0.94354,0.730297,0.690541,0.810198,0.647459,0.518689,0.592775,0.764436,0.775702,0.742707,0.838814,0.988424,0.886219,0.573975,0.540692,0.713213,0.866683,0.742048,0.580915,0.634798,0.689055,0.744095,0.977984,0.950745,0.722803,0.655367,0.511084
0.700131,0.715631,0.478385,0.397481,0.461695,0.457822,0.504889,0.453872,0.512149,0.578811,0.556045,0.602292,0.609779,0.58191,0.562213,0.573068,0.535144,0.572161,0.542235,0.465983,0.430995,0.438564,0.485693,0.600991,0.614228,0.516569,0.431688,0.337754
0.435636,0.477743,0.382488,0.394598,0.427982,0.437604,0.489337,0.39406,0.464094,0.555438,0.491184,0.493317,0.478329,0.562718,0.7871,0.857311,0.661645,0.508959,0.49075,0.534512,0.484771,0.364779,0.319842,0.392026,0.5024,0.478216,0.374671,0.287874
0.334149,0.430905,0.388243,0.405765,0.397643,0.401089,0.397102,0.295136,0.447846,0.56875,0.469287,0.500969,0.606692,0.804034,1.084209,1.170928,0.913663,0.698252,0.71643,0.788817,0.654958,0.412817,0.305443,0.335423,0.442191,0.4281,0.351011,0.256856
0.358882,0.410144,0.366018,0.383134,0.357617,0.324017,0.297137,0.238449,0.413899,0.521983,0.455186,0.560476,0.780932,1.035074,1.246388,1.320188,1.144948,0.977895,1.020796,1.092647,0.902841,0.549723,0.344473,0.309457,0.352542,0.348144,0.347256,0.267678
0.403232,0.42628,0.399119,0.409263,0.397822,0.330587,0.299321,0.301372,0.427262,0.49373,0.52326,0.690817,0.910382,1.093069,1.128598,1.163814,1.172851,1.150921,1.21995,1.280316,1.118945,0.731352,0.421105,0.301599,0.301244,0.341875,0.367718,0.285518
0.505445,0.543877,0.541986,0.551179,0.5502,0.467568,0.412696,0.410517,0.497283,0.554374,0.607112,0.742403,0.866671,0.902695,0.772787,0.768925,0.937274,1.071572,1.154733,1.195141,1.152822,0.869818,0.540497,0.365346,0.345966,0.395531,0.398699,0.299752
0.642678,0.681344,0.663458,0.684053,0.698068,0.596232,0.51042,0.487214,0.543841,0.593899,0.600967,0.632855,0.634886,0.562004,0.400366,0.382816,0.566556,0.751891,0.825538,0.846841,0.93814,0.85122,0.606704,0.440833,0.398281,0.401308,0.371471,0.27822
0.7006,0.715505,0.661506,0.698081,0.737221,0.626764,0.51635,0.469289,0.490625,0.519811,0.468703,0.408527,0.346304,0.265919,0.204281,0.218108,0.278117,0.380842,0.425619,0.439315,0.582523,0.655199,0.549372,0.440899,0.378829,0.326805,0.279279,0.224045
0.616246,0.597973,0.513888,0.559636,0.622629,0.522377,0.412414,0.351189,0.344995,0.350132,0.278354,0.19917,0.150991,0.133717,0.124821,0.148463,0.141622,0.144228,0.154471,0.173635,0.273918,0.383477,0.3844,0.347811,0.283773,0.215892,0.2004,0.202513
0.423024,0.387286,0.304414,0.344759,0.411252,0.340042,0.257764,0.20126,0.183938,0.175343,0.134062,0.104677,0.083971,0.081809,0.089257,0.091863,0.101985,0.082238,0.066313,0.080526,0.108979,0.168529,0.20662,0.214458,0.16576,0.148337,0.1903,0.217293
