-7e-06,-1.1e-05,-0.005863,-0.031858,-0.017939,-0.010273,-0.062628,-0.17312,-0.200861,-0.212055,-0.179464,-0.149598,-0.106667,-0.063138,-0.069835,-0.07844,-0.026113,-0.001515,-0.000533,-0.000826,-0.000711,-0.000411,-0.000558,-0.000165,-5.8e-05,-3.2e-05,8e-06,1.8e-05
-5.2e-05,-4.3e-05,-0.002475,-0.017609,-0.013833,-0.01208,0.010213,0.01979,0.070784,0.080311,0.101458,0.071361,0.090081,0.055954,0.069963,0.09103,0.027374,0.00129,-0.000808,-0.001397,-0.000518,0.001027,0.001521,0.000153,0.000106,0.000104,3.3e-05,8e-06
-6e-05,-5.4e-05,0.002311,0.012844,0.005017,-0.002248,-0.012507,-0.027591,-0.010327,0.018186,-0.006823,-0.031924,-0.016777,-0.001211,0.007046,0.005762,-0.00041,-0.000364,-0.000754,-0.000534,0.000268,-0.00069,-0.00094,8e-06,-1.1e-05,-2.7e-05,-5e-06,-1e-06
-2e-05,-2e-05,0.003731,0.024193,0.015735,0.007291,-0.034159,-0.075887,-0.117112,-0.112144,-0.121448,-0.079062,-0.081963,-0.055207,-0.075982,-0.095673,-0.028834,-0.001442,-0.000467,0.000285,0.000545,-0.000109,-0.000366,2e-06,1.2e-05,-6e-06,2e-06,6e-06
3.3e-05,2.8e-05,0.000561,0.003228,0.004651,0.005546,0.050216,0.160604,0.153991,0.136558,0.139026,0.151346,0.099936,0.050929,0.052094,0.064321,0.02402,0.002208,0.000659,0.000465,0.000124,0.000871,0.001306,0.000132,8.6e-05,9.3e-05,4.1e-05,1.8e-05
6e-05,4.6e-05,-0.00477,-0.02636,-0.013583,-0.006814,0.021394,0.091574,0.107518,0.103325,0.074643,0.041992,0.028037,0.024767,0.042221,0.047402,0.013726,0.000911,0.000278,-7e-05,-0.000315,-0.000622,-0.000825,-0.000125,-5.4e-05,-1.3e-05,1.8e-05,1.2e-05
4.9e-05,3.6e-05,-0.001455,-0.01072,-0.009685,-0.010942,-0.071244,-0.177431,-0.177892,-0.190815,-0.166927,-0.148574,-0.095535,-0.057974,-0.07731,-0.095464,-0.032587,-0.002955,-0.001308,-0.000727,-0.000146,-6.2e-05,-0.000216,-2.8e-05,-4e-06,-2.8e-05,-5e-06,5e-06
5e-06,6e-06,0.003406,0.017361,0.006358,-0.000429,-0.010041,-0.05477,-0.04926,-0.064021,-0.004266,0.007199,0.024213,0.009005,0.006743,0.018154,0.006255,-0.000755,-0.00101,-0.000574,0.000213,0.000581,0.000896,0.000161,8e-05,7.4e-05,1.4e-05,1e-06
-4.2e-05,-3.5e-05,0.001861,0.013922,0.010546,0.008132,0.045034,0.088667,0.110477,0.140473,0.088672,0.05008,0.029231,0.029551,0.058248,0.073649,0.021545,0.000537,2.4e-05,-0.000226,-8.1e-05,-0.00043,-0.000561,-1.2e-05,-2.7e-05,-3.2e-05,-1.4e-05,-6e-06
-5.6e-05,-4.5e-05,-0.00133,-0.005321,0.00109,0.004283,-0.018985,-0.043255,-0.027814,0.005013,-0.050941,-0.034447,-0.03607,-0.021563,-0.039721,-0.066291,-0.021274,-0.001257,-0.000436,-0.000167,-0.000223,-6.3e-05,-0.000195,-5.2e-05,-6e-06,-3e-05,-2.2e-05,-5e-06
-2.7e-05,-1.9e-05,-0.001749,-0.012376,-0.007824,-0.002567,-0.003597,0.008688,-0.019845,-0.04756,0.006345,0.045356,0.027554,0.00334,-0.018639,-0.021584,-0.003677,-0.000344,-0.000794,-4.6e-05,8.3e-05,0.000268,0.00047,1e-06,1.2e-05,4.6e-05,6e-06,2e-06
2.4e-05,2.8e-05,-0.000368,-0.0037,-0.00521,-0.003439,0.042974,0.107992,0.075267,0.044244,0.058327,0.030634,0.016722,0.016676,0.050611,0.078672,0.024669,0.001004,-0.000243,0.000261,0.000417,-0.000103,-0.000182,-4e-06,-2.8e-05,-1.5e-05,4e-06,9e-06
5.7e-05,4.9e-05,0.001326,0.007996,0.003201,-0.000337,-0.029338,-0.079206,-0.046612,-0.031978,-0.052511,-0.078718,-0.04368,-0.020579,-0.021502,-0.035999,-0.014256,-0.001247,-0.000242,1.7e-05,-1.3e-05,-1.1e-05,-0.000161,4.4e-05,3e-05,-1.4e-05,-5e-06,1.3e-05
4.9e-05,4.1e-05,0.001196,0.007464,0.005635,0.002794,-0.038951,-0.109169,-0.085239,-0.07998,-0.035418,-0.014581,0.006645,-0.004028,-0.038343,-0.052932,-0.015518,-0.00143,-0.000252,-7.4e-05,-0.000291,0.000124,0.000312,2.5e-05,-2e-06,1.2e-05,0,6e-06
9e-06,7e-06,-0.000751,-0.003918,1e-04,0.001789,0.041431,0.087265,0.059335,0.06261,0.049718,0.049872,0.02144,0.01572,0.043338,0.07,0.023234,0.001047,0.000521,0.000221,-0.000239,-0.00012,-9e-05,-5.6e-05,-5.9e-05,-3.7e-05,-1.4e-05,-8e-06
-3.5e-05,-3.5e-05,-0.001257,-0.007522,-0.004416,-0.003106,0.011244,0.042136,0.061367,0.090534,0.013886,0.00512,-0.012423,-0.004099,0.0126,0.005603,-0.000307,0.000154,0.000266,0.000394,0.000178,-0.000137,-0.000292,-1e-05,9e-06,-3.4e-05,-3.1e-05,-1.8e-05
-5.3e-05,-4.6e-05,0.000288,0.001001,-0.001935,-0.004884,-0.032365,-0.058403,-0.037934,-0.043312,-0.013022,-0.000871,0.011017,-0.000516,-0.042766,-0.068455,-0.020667,-0.001173,-0.000791,-5.4e-05,0.000272,0.000128,0.000198,1.1e-05,-1.1e-05,-1.3e-05,-2.6e-05,-2.3e-05
-3.4e-05,-2.4e-05,0.001323,0.007176,0.003033,-0.000272,0.020589,0.043643,-0.014832,-0.066252,-0.000577,-0.001427,0.003183,0.002772,0.014477,0.041572,0.014457,0.000348,-0.000235,-0.000101,9.1e-05,6.9e-05,0.000108,-1.2e-05,-3.7e-05,-1.5e-05,-1.1e-05,-1.6e-05
5e-06,5e-06,-0.000518,-0.000716,0.001755,0.002616,0.015688,0.029456,0.021822,0.014379,-0.011369,-0.031302,-0.027496,-0.012348,0.024986,0.036028,0.008552,5.1e-05,0.000367,2.9e-05,-0.00021,-0.000263,-0.000455,-3.8e-05,4e-06,-1.9e-05,-9e-06,-2e-06
