-0.002804,-0.002825,-0.002968,-0.002983,-0.002183,-0.001194,-0.002943,-0.00362,-0.002446,-0.001773,-0.001216,-0.004567,-0.003691,-0.003049,-0.002306,-0.003116,-0.001322,-0.006528,-0.007911,-0.003535,-0.005546,-0.004203,-0.003429,-0.006116,-0.003395,-0.002329,-0.000514,-0.002981,-0.003173,-0.00066,-0.007641,-0.006269,-0.005841,-0.005588,-0.005622,-0.006767,-0.004029,-0.005006,-0.005966,-0.0057,-0.006316,-0.004379,-0.00588,-0.006402,-0.007138,-0.007077,-0.004568,-0.006015,-0.006177,-0.00668,-0.008087,-0.006243,-0.006678,-0.006279,-0.00561,-0.008916,-0.004104,-0.005415,-0.003824,-0.004927,-0.005268,-0.006594,-0.00093,-0.000964,0.001082,-0.002966,-0.003918,-0.005258,-0.006355,-0.004122,-0.000837,-0.007375,-0.003455,-0.006769,-0.00884,-0.007484,-0.005618,-0.000844,-0.005662,-0.00632,-0.003958,-0.007182,-0.007876,-0.006586,-0.003852,-0.005811,-0.004376,-0.008194,-0.007816,-0.004968,-0.005175,-0.006559,-0.007673,-0.006911,-0.004462,-0.009764,-0.007777,-0.002058,-0.004752,-0.006215,-0.004022,-0.004434,-0.003639,0.000506,-0.001456,-0.002699,-0.004864,-0.004525,-0.005824,-0.006122,0.006554,0.005575,0.001592,-0.002981,0.00192,-0.000923,-0.00308,-0.002295,-0.000978,6.5e-05,-0.001183
0.002737,0.001666,0.00246,0.001443,0.000983,-0.001201,0.001806,0.00103,0.002173,-0.000419,0.00062,0.002309,0.003147,0.001522,0.000449,0.001183,-0.001871,0.002772,0.003247,0.002993,0.002091,0.003222,0.00053,0.003036,0.001921,0.000173,-0.001768,-0.000186,-0.001551,-0.002596,0.002151,0.002735,0.000187,0.000835,0.001016,0.001131,0.001106,0.00125,-0.001097,0.000199,0.002022,-0.000482,0.002853,0.004066,0.003381,0.000221,-0.001165,-0.000768,-0.001482,-0.000473,0.000479,0.001628,0.001106,0.000415,-0.003217,-0.001534,-0.001264,-0.002264,-0.003657,-0.002196,-0.000746,0.002358,-0.000899,-0.002987,-0.005537,-0.00286,-0.002767,0.001529,8.6e-05,0.00091,-0.006546,-0.000545,-0.001012,0.000876,0.002839,-0.003088,-0.00232,-0.003185,-0.007662,-0.005074,-0.002834,-2.2e-05,0.003583,0.001375,0.000326,0.000928,-0.002402,0.00017,-0.00134,-0.001979,-0.002457,-0.005207,-0.002452,-0.003889,-0.006566,-5.7e-05,0.001728,-0.003283,-0.000895,-0.001157,-0.002306,0.000732,-0.002117,-0.006596,-0.006204,-0.003734,-0.002947,-0.004161,-0.001633,-0.003281,-0.012602,-0.009306,-0.005111,-0.000836,-0.00557,-0.001498,1.2e-05,0.002314,-0.000175,-0.00612,-0.001774
-0.001582,-0.001553,-0.001678,-0.001315,-0.000564,2.2e-05,-0.001089,-0.001296,-0.002153,-0.002327,-0.001513,-0.003156,-0.002256,-0.001751,-0.000879,-0.000746,0.000569,-0.002322,-0.002363,-0.003291,-0.000668,-0.002176,-0.001197,-0.001425,-0.001215,-0.001008,-0.000365,-0.001481,0.000706,0.001257,-0.002342,-0.002228,-0.001055,-0.000542,-0.000573,-0.002228,-0.00077,8.3e-05,0.000584,-0.001017,-0.001985,-0.000851,-0.002131,-0.00368,-0.001973,-0.001826,0.001804,0.002004,0.001667,0.000348,0.002609,0.000883,-0.001705,-0.001551,0.000493,0.001276,-0.003665,0.000649,0.000667,0.001381,0.00249,1.6e-05,-0.005961,-0.001581,-0.001101,0.004373,-0.002157,-0.004352,-0.002423,-0.000309,0.000371,-0.000602,0.000107,2.5e-05,-0.001786,0.003447,0.001838,0.003447,0.004825,0.004539,-0.000449,-0.002172,-0.001281,0.000417,-0.000949,-0.003571,0.000664,-0.000728,0.002072,-5.2e-05,-0.000886,0.00047,0.001984,0.001001,0.002197,-0.000873,-0.001232,-0.000114,-0.000786,0.000722,-0.001672,-0.00152,0.000342,-7.6e-05,0.0023,-6.4e-05,-0.002398,-0.000281,-0.000632,0.000419,-0.002259,-0.003978,-0.003832,-0.003624,-0.007756,-0.011097,-0.007126,-0.003948,-0.000859,-0.004059,-0.001599
1.3e-05,0.001355,0.000907,0.000778,0.001272,0.000744,0.001159,0.001516,0.002443,0.002544,0.001724,0.00201,0.001965,0.001564,0.000139,0.000444,0.000317,0.001804,0.002997,0.002912,-5.1e-05,0.000627,0.002205,0.000692,0.00096,0.000171,0.001391,0.000279,0.000933,0.000592,0.003071,0.002319,0.000218,0.000702,1.2e-05,0.002021,0.001041,-0.000707,0.000829,0.001745,-0.000309,0.00174,0.00192,0.001684,0.002779,0.004366,0.0025,-0.001662,-0.00152,0.000809,-0.001807,0.000359,0.000789,0.001597,0.002142,0.000526,0.005941,0.003119,0.00168,-0.000766,-0.00064,0.002091,-0.001112,-0.002279,0.000885,0.000277,0.00447,0.002019,-5.5e-05,-0.000202,0.001108,0.003793,0.001205,-0.000381,-0.000366,-0.000135,0.001313,0.002981,9e-05,0.001158,0.001239,0.002743,0.000834,0.001799,-0.001172,0.00352,0.004371,0.002353,-8.7e-05,0.003576,-0.000621,0.006856,-0.001381,0.001382,0.003063,0.003912,0.001853,0.002017,0.001703,0.00217,0.003152,0.000685,0.001269,0.003019,0.002065,0.00251,0.003709,0.00436,0.002492,0.000297,0.001695,-0.000462,1.4e-05,0.003336,0.005035,0.00063,-0.000126,-0.001639,-0.002794,0.001447,0.00233
8e-05,-0.000852,-0.001174,-0.000753,-0.000487,-0.000531,-0.001146,-0.000602,-0.001246,-0.001023,-0.00075,-0.000526,-0.001612,-0.001742,-2.7e-05,-0.00052,-0.001169,-0.00057,-0.002333,-0.001757,0.00034,0.000821,-0.000829,7.9e-05,-0.001213,0.000306,-0.000263,0.001365,-0.001112,-0.000792,-0.002246,-0.003841,0.000876,-0.001307,0.000503,-0.000394,0.000201,0.000235,-0.000478,-0.001305,0.000295,-0.001348,-0.000883,-9e-04,-0.002514,-0.003601,-0.002387,-0.000513,-1.7e-05,-0.002444,0.000281,-0.000821,-0.002172,0.000383,-0.00346,-0.002327,-0.004617,-0.004223,-0.00224,0.000354,-0.00123,-0.001377,0.00097,-0.001413,-0.00112,-0.002326,-0.000528,0.000932,0.001407,0.000794,-0.00043,-0.003068,-0.00173,-0.001359,-0.002681,-0.003165,-0.001342,-0.003018,-0.004549,-0.002881,-0.001041,-0.003037,0.000464,-0.00037,0.000873,0.000562,-0.003452,-0.003269,0.000363,-0.001463,-0.000531,-0.004862,0.000174,-0.000659,-0.002517,-0.003557,-0.003503,-0.001475,-0.001467,-9e-04,-0.000114,-0.002489,0.000564,-0.001725,-0.002577,-0.001149,-0.001345,-0.00335,-0.00046,-0.00069,-0.000844,-0.005055,0.000681,-0.004195,-0.003508,0.000503,-0.000162,-0.001235,0.003365,-0.000132,-0.002707
-0.000419,0.000686,0.000638,0.001199,0.000425,-0.000322,0.000185,7e-06,0.000952,0.000592,0.00015,-0.000148,0.001139,0.000917,0.001307,0.001153,0.001341,0.000549,0.001647,0.001166,0.000353,-0.00055,0.000218,-0.000702,0.000837,-0.000118,-0.000317,-0.000882,0.00107,4.4e-05,-6.3e-05,0.003125,-0.000377,0.001221,0.00059,0.000601,0.00161,0.000543,0.000719,5.6e-05,0.000839,0.001063,0.001426,0.001479,0.001358,0.001067,-7.8e-05,0.000261,0.001425,0.003563,0.000901,-0.000128,0.000448,-0.000279,0.001336,0.002891,0.001898,0.000303,0.001298,-0.00065,0.000736,-0.000712,-0.001489,0.002398,-0.000625,-0.000354,0.000671,-0.001972,-0.002843,-0.003031,0.001484,0.000611,0.000149,0.000178,0.001032,0.001073,-0.002185,-0.001616,0.001045,-0.001012,0.000285,0.001968,-9e-06,-0.001132,-0.001033,0.000778,0.00112,0.00116,-0.001046,8e-06,0.002743,0.002349,0.001588,-0.001563,0.001221,-0.000407,0.00149,-0.001252,-0.001616,-0.00124,-0.002545,0.00184,-0.002996,9.8e-05,-0.000907,-0.000247,0,1e-06,-0.002231,-0.000265,-0.002267,0.00236,-0.000861,-0.000611,0.000583,0.003719,0.005703,0.003673,0.00112,0.000958,0.000821
0.000722,-0.000825,-0.000708,-0.000442,-0.000593,-0.000161,5e-05,-0.000625,-0.000841,-5.8e-05,-0.000269,0.000242,-0.000393,-0.000704,-0.001268,-0.000918,-0.001295,-0.000868,-0.001798,-0.00155,-0.001404,-4.2e-05,-0.000684,0.000203,-0.000404,-0.000601,-0.000499,-0.000437,7.3e-05,0.000444,0.001421,-0.000598,0.000677,0.000524,-0.000472,-0.000669,-0.001547,-0.000734,-0.000107,0.002351,0.000577,-0.001573,-0.001105,-0.000362,-0.00196,-0.000828,0.000725,-0.000552,-0.00086,-0.00179,-0.000792,-0.000499,0.000584,0.001711,0.000659,-0.00045,0.000133,0.001529,0.00096,0.000236,0.000133,0.001385,-0.000298,-7.3e-05,0.002028,0.001031,-0.001538,0.000797,0.002081,0.000852,-3.9e-05,-0.000187,0.000516,-0.00074,-0.000418,-0.000146,0.000367,-0.000434,-0.000225,0.000831,0.000502,0.000616,0.001264,0.000502,0.000314,-0.000277,0.000687,0.000127,0.000129,0.000756,-1.3e-05,-0.001245,-3.1e-05,0.00269,-6.7e-05,0.002964,0.000358,0.000539,0.001739,0.000804,0.002478,-0.00011,0.001129,0.002201,0.003109,0.000918,-0.000538,0.000166,0.002531,0.002232,0.004035,0.002182,0.002376,0.001174,0.000691,-0.002342,-0.001144,-0.001119,0.000286,0.001411,0.00289
-0.000682,0.000288,0.000598,-0.000122,0.000279,0.000103,-0.000616,0.000212,0.000152,-8.4e-05,-2.2e-05,0.000659,0.00049,0.001,0.000888,0.000441,0.00037,-0.000371,0.001433,0.000238,-0.000248,0.000157,0.000834,5.9e-05,-0.000266,0.000589,-5.3e-05,0.001027,-0.001562,-0.000511,-0.000766,-0.000515,-0.00136,-0.001031,0.000101,-0.000397,0.000284,0.000927,-0.000235,-0.001307,-0.000513,-0.000206,-0.000475,-0.000263,0.001179,9.5e-05,8.6e-05,-1e-05,0.000977,0.00065,0.000848,0.000309,0.00033,-0.001517,-0.001099,-0.002392,-0.000565,-0.000143,-0.001648,0.000772,-0.000198,-0.001435,0.000917,0.000184,0.000522,0.001056,0.000507,0.001201,0.001589,0.00182,1.4e-05,-0.000958,-0.000418,-0.001543,-0.000106,-0.000603,-0.000664,0.001228,0.000705,-6.2e-05,-0.001313,-0.000371,-0.001917,-0.001364,8.7e-05,-0.00128,0.000512,0.000182,0.00035,-0.00079,-0.001677,-0.000324,-0.002444,-0.002055,-0.000468,-0.002176,-0.001072,-0.000409,-0.000451,-0.000136,-0.000482,-0.001011,-0.000564,-0.001583,-0.000835,-0.000446,0.001695,0.000843,-0.000579,-0.000886,-0.002042,-0.002102,-0.000112,0.000249,0.002036,0.001278,-0.001098,0.000457,0.000516,-0.001977,0.000128
0.000559,0.000344,-0.000456,0.000153,1.9e-05,0.000464,0.000332,-0.000514,-6.4e-05,-2e-05,-0.000402,-0.000545,-0.00026,-0.000732,-0.001484,-0.000233,-0.000212,4e-06,-0.000243,0.000203,0.000824,0.000151,-0.000636,-0.000163,-0.000303,-0.00059,0.000208,-6.9e-05,0.000515,9.7e-05,-0.000245,0.000186,0.001278,0.000394,6.2e-05,0.000316,-0.000914,-0.00051,0.000165,-6.2e-05,-0.00012,0.00102,0.000141,0.000596,0.000769,-5.4e-05,-0.000124,0.001744,0.000711,0.000386,-8.5e-05,-0.000108,-0.000204,0.000324,0.000928,0.001193,4.7e-05,-0.000437,0.000297,-0.000765,0.000515,6e-04,-9.4e-05,-0.001572,0.000491,3.1e-05,-0.000578,0.000328,-0.001207,0.000289,0.001456,0.000968,-0.000707,0.001068,0.000629,0.001249,0.000953,0.000656,-0.000401,-0.000803,0.000304,-0.001563,6.8e-05,0.001255,0.000756,0.000783,-0.002359,-0.001355,-0.000959,-9e-06,0.000623,0.000959,0.001627,0.000748,-0.000792,-0.000804,0.00025,-0.000249,7.5e-05,-0.000514,-0.000411,-0.000244,0.000129,-0.000558,-0.000891,-0.000902,-0.001871,-0.000368,-0.000151,-0.00098,0.000211,0.000442,-0.002702,0.001381,-0.001325,-0.000268,-0.002004,-0.002208,-0.001374,-0.000269,-0.001478
-0.000476,-0.000308,0.000266,-0.000197,-9.9e-05,-0.000312,-0.000236,0.000771,0.000348,8.5e-05,0.000706,0.000191,-0.000356,0.000537,0.001134,-6e-05,0.000507,0.000202,-0.000651,-0.000184,-0.000771,-0.000257,-0.000238,2.8e-05,1.4e-05,0.000176,-7.1e-05,-0.000199,3.1e-05,1.3e-05,0.000526,-2.3e-05,-0.000941,-4.6e-05,-1.1e-05,0.000345,0.000791,-0.000163,-1.2e-05,0.000147,-0.000358,-0.000648,0.000173,-0.000112,-0.001166,-2.6e-05,-0.000259,-0.001444,-0.000993,-0.001517,-0.000483,0.001062,-0.00019,-0.000401,-0.000392,0.00063,-0.000375,0.000586,0.001331,-0.000225,-0.000239,0.00026,-0.000396,0.002177,-0.000243,-0.000119,-0.001256,-0.002386,0.000284,-0.001293,-0.000266,-0.000721,0.001117,0.001582,8.6e-05,0.000449,0.000627,-0.000388,0.000855,0.002036,0.001325,0.001865,0.000516,-0.000313,0.000161,0.000324,0.000309,0.000964,5.2e-05,-0.000845,0.000797,-0.00123,0.000382,0.00073,0.000333,0.001073,0.000591,0.000813,0.000232,-6.2e-05,-0.00052,0.000627,0.000857,-0.000365,0.000304,-2e-06,0.000375,0.000261,-0.000836,0.000663,-0.00064,-0.001213,-0.000358,-0.000781,-0.000252,-0.000579,-0.000113,0.00083,-0.000436,0.000304,-0.001221
0.000171,0.000329,-4.7e-05,-0.000124,0.000117,0.000484,2e-06,-0.000378,-0.00058,-0.000406,-0.000266,-0.000156,0.000152,-0.000307,9.3e-05,8.3e-05,-0.000368,-0.000196,-4.4e-05,-1.5e-05,0.000773,2.7e-05,0.000428,0.000159,0.000458,-0.000278,-0.000214,0.000332,0.000841,-0.000375,-2e-04,4.2e-05,0.000868,-0.000189,-0.000429,-0.000269,-0.00026,-0.000336,-0.000281,-6e-06,0.000313,0.00057,-0.000189,-0.000168,0.00015,0.000297,5e-05,-7.2e-05,2.3e-05,0.00069,-1.2e-05,-0.001288,0.000245,-0.000253,0.000601,-0.000252,0.000194,-0.000561,-0.000593,0.000678,0.000923,-0.000148,0.00016,-0.000629,-0.002231,-0.000554,0.00118,0.000458,0.000757,0.000797,-0.001185,0.00065,0.000191,-0.001218,3.1e-05,-3.7e-05,-0.000368,0.000561,-0.000399,-0.000195,-0.000234,-0.000641,0.000859,-8.3e-05,-0.000187,-3e-04,0.000275,-0.000409,6e-04,-0.000129,-0.000204,-0.000554,0.00011,-0.001237,0.000237,-7.3e-05,-0.000696,-1.7e-05,-3.9e-05,0.000347,0.000734,-0.000162,0.000344,0.00062,-0.000188,0.000775,0.000519,5.4e-05,0.000832,0.00028,0.000275,0.001648,0.003559,0.000585,0.000414,-0.000298,0.000832,5e-05,-0.000113,0.000773,-0.000131
-0.000235,-0.000238,-0.000128,4.1e-05,-4.4e-05,-0.000478,-7.7e-05,8.6e-05,0.000212,0.000232,0.000154,0.000445,-4.1e-05,5.1e-05,1.6e-05,0.00025,0.000119,0.000328,0.000478,-6e-05,-0.000496,-0.000428,-0.000316,-0.000171,-0.000212,0.000355,8.1e-05,-0.000278,-0.000212,0.000234,-0.000237,-8.1e-05,-0.000587,0.000151,0.000679,-2.2e-05,0.000226,0,-1.2e-05,2.7e-05,2.8e-05,-0.000925,-0.00056,-4.5e-05,-0.000294,0.00025,-0.000127,0.000455,-0.000438,-0.000229,0.000463,0.000646,-0.000235,-0.000451,-0.000344,-0.000679,0.00012,0.000215,0.000318,-0.000335,-0.00079,-0.000146,0.000225,-0.000352,0.000206,-0.000511,0.000424,-0.000454,-0.000285,-0.000815,-0.000345,0.000448,-4e-05,0.00051,0.000421,-0.000341,0.000558,-0.000243,-4.1e-05,0.000385,-0.000147,-0.000704,-0.00064,6.2e-05,0.000287,0.000454,0.000133,0.000846,-0.000115,0.000401,0.000451,0.00058,-0.000788,0.000105,-0.000782,4.9e-05,7.1e-05,-4.2e-05,0.000114,-0.000168,-0.000587,0.000103,-0.000701,0.000684,5e-05,-0.000157,-0.000354,0.000123,-0.000379,-0.000265,-0.000279,-0.001345,-0.000323,-0.001235,-0.001011,0.000355,-6e-06,0.000819,0.000313,0.00068,0.000734
0.000206,0.000116,-9.8e-05,-9.9e-05,3.3e-05,0.000499,1.6e-05,0.000313,-0.000127,-0.000115,-0.000107,-0.000322,-3.4e-05,0.000133,-0.000184,-0.000343,-0.000185,-0.000314,-0.000422,-5.8e-05,9.2e-05,2.7e-05,0.000158,0.000204,-0.000135,-0.000561,3.4e-05,-5.8e-05,-0.000665,0.000329,0.000306,1.2e-05,0.000474,0.00012,-0.000388,-0.000293,-0.000102,-0.000101,-5.1e-05,-7.1e-05,-0.000118,0.000297,0.000287,0.000174,0.000105,-0.000384,-0.000168,0.000601,-8.7e-05,-4.9e-05,8e-06,4.6e-05,0.000123,0.000426,0.000183,0.000804,0.000481,8.8e-05,-0.000774,-0.000394,-0.000224,0.000246,-0.00035,0.000121,0.000191,0.000355,-0.000483,0.000869,-0.000365,0.000674,0.000269,-0.000481,-3e-04,-0.000147,0.000202,-0.000319,-3e-04,-0.000184,-0.000645,-0.000398,0.000355,0.000753,6e-06,-0.000215,-5e-05,-0.00034,0.000435,-0.000573,-0.000191,-0.000199,-0.000376,0.000557,-4.1e-05,0.000993,0.000786,0.000269,0.000517,-4.6e-05,0.000408,-0.000433,0.000227,-1.9e-05,-2.5e-05,4.3e-05,0.000368,0.000125,3.3e-05,-0.000482,0.000523,-0.000363,-1.4e-05,0.000728,-0.000781,-0.000982,-0.000654,0.000233,-0.000698,7.2e-05,-8.9e-05,-0.000619,5.5e-05
9.2e-05,-7.4e-05,0.000148,7.8e-05,-1.8e-05,-0.000139,5.8e-05,-0.000276,-9.1e-05,6e-06,-1.7e-05,-8.2e-05,8e-05,-6.1e-05,0.000177,0.000198,3.4e-05,0.000314,0.000216,0.000381,1.5e-05,0.00019,4.8e-05,-9.5e-05,9.9e-05,0.000461,-2.1e-05,1e-06,0.000214,5e-06,-2.7e-05,0.000197,-0.000288,-0.000242,3.8e-05,8.2e-05,-0.000103,0.000378,8.8e-05,-0.000173,0.00022,-0.000149,0.000233,-0.000121,0.000314,-0.000286,5.4e-05,-0.000641,0.000368,0.000257,6.3e-05,-0.000136,-0.000107,0.000192,-0.000245,3e-05,2.7e-05,-4.7e-05,0.000501,0.000621,0.000269,-0.000378,0.000229,0.000347,0.000806,2.8e-05,-1e-05,-5e-05,-6e-05,-0.000354,0.00061,0.000235,-0.000141,-0.000548,-0.000445,0.000256,-8e-05,0.000164,0.000491,-0.000211,0.000194,-0.000618,-0.000576,-2.2e-05,1e-06,1.9e-05,-0.000449,0.000114,0.000369,0.000422,0.000114,0.000384,0.000287,-0.000661,-0.000401,-0.000281,-0.000258,0.000299,4.2e-05,0.000195,-1.8e-05,0.000372,0.00046,-0.000293,-4.8e-05,-0.000388,0.000456,0.000219,-0.000372,0.000285,0.000209,-0.00026,0.00068,0.000735,-0.000213,-0.000435,0.000793,-0.000533,-2.9e-05,0.000446,1e-06
-3.6e-05,3.7e-05,2e-05,2.1e-05,-9.7e-05,-2.5e-05,4.2e-05,0.00019,0.000165,3.2e-05,-4.2e-05,-7.5e-05,-8.8e-05,0.000111,-0.000151,-9.6e-05,0.000177,-8.4e-05,0.000108,-0.000412,6.8e-05,-0.000158,-0.000124,7e-06,4.2e-05,-5.1e-05,1.3e-05,-3.5e-05,3.8e-05,-7.2e-05,-2.5e-05,-0.000203,0.000242,8.9e-05,3.8e-05,2.4e-05,0.00033,-0.000182,-8e-06,0.00029,-0.000126,-6e-06,-0.000242,-7.1e-05,-0.000267,0.000324,-0.00018,8.6e-05,2.7e-05,4e-06,-0.000168,3.8e-05,5.6e-05,0.000176,0.000174,-0.00051,-0.000137,0.000122,-0.000279,-0.000527,0.000123,1.9e-05,5.7e-05,-2.8e-05,5.4e-05,0.000144,1e-04,0.000136,0.000279,-0.000103,-0.000727,1e-05,0.000333,0.000403,4.8e-05,-2.4e-05,-0.000231,-0.000144,0.000145,-0.000135,-0.000482,0.000141,0.00035,8.6e-05,1e-04,-0.000413,-0.000184,-5.7e-05,-0.000183,7.9e-05,-0.000182,-0.000516,4.2e-05,2e-05,0.000269,0.000425,0,-0.000384,-0.000301,-5.4e-05,7e-06,-7.6e-05,-2.2e-05,2.4e-05,-7e-06,0.000172,-0.000276,-7.5e-05,0.00014,8.8e-05,8.7e-05,0.00015,-0.000224,-1.7e-05,0.00042,0.000148,0.000634,8.1e-05,-5.8e-05,-0.000188,-0.000107
-8.5e-05,6.9e-05,3.7e-05,-1.4e-05,2.4e-05,-4.3e-05,-6e-05,-9.2e-05,-1.2e-05,4.3e-05,-3.7e-05,7.2e-05,4.4e-05,-0.000142,-5.5e-05,-4.3e-05,-0.000154,-3.9e-05,-0.000332,0.00015,-1e-04,0.000155,8.3e-05,1e-05,2.6e-05,-3.5e-05,2.4e-05,-5.6e-05,-0.000167,-0.000278,-0.000133,1.3e-05,-0.000188,4e-06,-3e-06,-3.9e-05,-0.000358,-3.7e-05,-4e-06,-9.8e-05,5e-06,0.000252,0.000152,-5.6e-05,7.3e-05,-5.5e-05,0.00012,0.000194,-8.7e-05,0.000203,2.7e-05,0.000164,-0.000273,-0.00018,-0.000182,0.000164,-0.000234,-9.9e-05,2.7e-05,0.000169,-7e-06,-2.4e-05,-0.000266,-0.000409,-0.000192,0.000134,-0.000418,-3.8e-05,-1.1e-05,-0.000176,0.000547,-0.00014,-0.000254,0.000369,0.00012,-5.8e-05,-1.5e-05,0.000117,-0.000296,7e-05,-0.000159,0.000268,-5.8e-05,-0.000103,-7.6e-05,-0.000144,3.1e-05,-7e-05,4.9e-05,0.000118,-6.1e-05,1.9e-05,-0.000321,-4.5e-05,0.000194,-0.000133,-0.000132,0.000143,-7.6e-05,0.00033,-0.000113,-0.000426,-6.9e-05,-0.00017,-7.7e-05,0.00013,-0.000162,-0.000203,-0.000227,-0.000109,-0.000369,6.7e-05,0.000371,-6e-05,0.000285,0.000383,-0.000574,-8.6e-05,0.000123,6.4e-05,5.5e-05
6.2e-05,-6e-06,-5.9e-05,-1.1e-05,1.4e-05,0.00011,-1.4e-05,6.9e-05,6e-06,-2.4e-05,7e-05,-1.4e-05,-7e-06,6.6e-05,5.1e-05,3e-06,8.2e-05,1.6e-05,0.000196,-1e-05,3e-05,-6.3e-05,5.3e-05,-1.3e-05,-7e-05,2.7e-05,-3.5e-05,-1.3e-05,-1.5e-05,0.000132,2.3e-05,0.000167,9.6e-05,-2.3e-05,2.2e-05,6.7e-05,1e-04,3.4e-05,-1e-05,-0.000102,-6.3e-05,-5e-06,2.1e-05,-7.5e-05,-0.000229,5.2e-05,1.4e-05,-4.3e-05,-5.8e-05,-0.000121,-3.3e-05,-0.000228,0.000266,0.000168,0.000214,5.7e-05,0.000138,0.000104,2.9e-05,8.7e-05,-0.000182,1.7e-05,0.000226,0.000333,0.000103,-8.3e-05,9.8e-05,3.1e-05,0.000251,6.1e-05,-0.000193,1e-05,1.3e-05,-0.000262,5.3e-05,-0.000121,9.7e-05,-0.000165,-3e-06,0.000265,-4.6e-05,-0.000158,-5.4e-05,8.2e-05,1.5e-05,8.6e-05,0.000281,0.000135,-1e-06,-0.000125,-7e-05,0.000162,0.000141,-9e-05,-0.000374,-0.000237,0.000129,5.3e-05,0.000153,4e-06,0.000115,0.000377,6.6e-05,1e-05,-0.00017,-7.9e-05,0.000226,5.6e-05,0.000286,-9.3e-05,0.000309,-0.000163,-9.2e-05,-2.8e-05,-0.000168,-0.000177,-0.000247,-0.000118,-0.000104,-9.4e-05,0.000256
7e-06,-1.3e-05,1.1e-05,4e-05,2.2e-05,-2.3e-05,-2.2e-05,5.8e-05,1e-06,0.000117,-2.9e-05,5.9e-05,3.8e-05,-1e-06,-6e-05,3.1e-05,-2.2e-05,-5.7e-05,3.6e-05,6e-05,-1.2e-05,5.9e-05,4.8e-05,2.7e-05,-1.3e-05,-4.3e-05,1.9e-05,-2.2e-05,0.000134,2.4e-05,-4.5e-05,-9.5e-05,-1.2e-05,4e-06,-9.1e-05,6.6e-05,-4.7e-05,3.8e-05,1e-06,4.9e-05,1.3e-05,-7.7e-05,-0.000157,2.8e-05,9.3e-05,6.3e-05,6.8e-05,-6.3e-05,0.000254,3.8e-05,-6e-05,0.000208,-3.9e-05,-6.6e-05,-0.000191,-4.3e-05,4.3e-05,9e-06,5.3e-05,2e-05,6.8e-05,0.00021,-6.7e-05,-9.5e-05,0.000266,0.000161,0.000269,6e-05,-0.000157,0.000158,0.000193,7.6e-05,9.5e-05,-0.00016,4e-06,-8.2e-05,0.000118,4e-06,-2.1e-05,0.000146,1.3e-05,7.7e-05,0.000117,5.1e-05,1.4e-05,-4e-06,-0.000223,-5.5e-05,4e-05,-3.6e-05,-7.5e-05,-0.000251,7.5e-05,0.000284,0.00017,2e-04,9.2e-05,2.2e-05,0.000159,-0.000135,-7.2e-05,-3.6e-05,-9.9e-05,3.7e-05,0.00012,-3e-06,-0.000171,-0.000146,-0.000185,4.3e-05,-0.00013,0.000154,-0.000374,-0.000319,-0.000108,-3.4e-05,0.000178,-0.000189,5.3e-05,-5.2e-05,1e-06
4e-06,-2.9e-05,1.4e-05,-6.6e-05,-2.2e-05,2.5e-05,6.4e-05,-4.9e-05,3.5e-05,-8.1e-05,5.1e-05,-4e-05,-1.4e-05,-4.9e-05,7.4e-05,5e-06,-2.3e-05,3.8e-05,-1.4e-05,-1e-05,9.3e-05,-4.6e-05,-3.6e-05,-2.2e-05,4.8e-05,5.3e-05,8e-06,-2.3e-05,0.000128,7.7e-05,3.9e-05,-1e-06,1e-06,-3.2e-05,0.000157,-8.6e-05,3.1e-05,-4.7e-05,8e-06,-1.6e-05,-4.6e-05,-0.000141,1.5e-05,8e-06,0.000178,-7e-05,0,0.000146,-2.5e-05,-4.3e-05,-2.6e-05,-0.000155,-0.000131,-2.8e-05,1e-05,3e-06,-0.000164,-6.8e-05,-8.6e-05,-0.000158,-5.6e-05,-9.1e-05,-9.2e-05,0.000183,4.1e-05,-8.2e-05,-0.000245,-3.4e-05,-8.8e-05,-0.000142,-0.000135,6.2e-05,-7.3e-05,-7.9e-05,-7.8e-05,1e-06,9e-06,-0.000141,0.000121,-0.00021,1.8e-05,0.000203,0.000145,-1.5e-05,-6e-05,7e-05,-0.000147,4.1e-05,-7e-05,-3e-05,-2.9e-05,0.000285,-7e-05,-9.2e-05,-0.000242,-0.000101,-0.000179,-1.7e-05,-9.1e-05,0.000103,3.6e-05,5.6e-05,-9.6e-05,-7.6e-05,2e-05,2.2e-05,4.2e-05,8.9e-05,0.000126,1e-05,4e-05,-1.1e-05,-2e-06,0.000286,9.2e-05,7.2e-05,-2.4e-05,7.3e-05,-1.9e-05,0.000128,-0.000173
0,-1.2e-05,-4e-06,5.2e-05,2.7e-05,-3.4e-05,-2.6e-05,2.8e-05,-4.7e-05,3.6e-05,-6.7e-05,-4.6e-05,-1.6e-05,3.3e-05,1e-05,-3.9e-05,-5e-06,5e-06,-9.5e-05,-2.2e-05,-0.000128,8.2e-05,-3.3e-05,1.1e-05,-1.2e-05,-9.9e-05,-2.4e-05,7e-05,-8e-05,-4.6e-05,3.1e-05,-5.3e-05,-1.4e-05,1.9e-05,-0.000129,-1.5e-05,-5.5e-05,7.6e-05,1e-06,8.9e-05,1.6e-05,-5.2e-05,3.2e-05,-7e-06,-6.8e-05,5.9e-05,-2.2e-05,-0.000101,5e-06,-5.9e-05,-7.8e-05,0.000129,7.9e-05,-9.2e-05,1.2e-05,-0.000124,6.1e-05,0,-6.3e-05,0.000188,4e-06,-8.1e-05,0.000103,-0.000292,2.1e-05,3.5e-05,0.000189,-0.000101,5.3e-05,8.6e-05,2.7e-05,-9.6e-05,1.5e-05,0.000109,5.2e-05,-1.4e-05,-0.000107,0.000275,-6.9e-05,-0.000171,-9e-05,-0.000177,-0.000123,3e-05,-4.4e-05,0.000151,0.000174,-7.5e-05,9.4e-05,-7.7e-05,0.000106,-0.000199,-8.4e-05,-0.000113,0.000101,1.1e-05,4.8e-05,-5.4e-05,-9.4e-05,-0.000127,-1.7e-05,-0.000181,-3.4e-05,2.4e-05,-2.3e-05,4.3e-05,9.2e-05,6.4e-05,-0.000138,3.2e-05,-2.6e-05,-8.2e-05,0.000574,0.000185,-9.9e-05,2e-05,-0.000252,0.000112,2.4e-05,-9e-06,-4.5e-05
-1.6e-05,6e-06,1e-06,-5.7e-05,-2.5e-05,5.8e-05,-1e-05,-1e-06,1.8e-05,-1.5e-05,4.1e-05,7.1e-05,2.3e-05,-1.9e-05,-3.1e-05,4.5e-05,-3e-06,1.9e-05,5.5e-05,5.4e-05,7.7e-05,-8.1e-05,3.6e-05,-1e-06,0,0.000118,2.2e-05,-3.6e-05,-0.000104,-8e-06,-4.3e-05,5.9e-05,-1.5e-05,-1.2e-05,5.4e-05,3.3e-05,-1e-06,-6.2e-05,3e-06,-4e-06,-2.3e-05,0.000112,3.2e-05,-1.1e-05,4e-06,-0.000112,-5.1e-05,-0.000113,4.9e-05,0,8.1e-05,-1.4e-05,-3.4e-05,-4.6e-05,-5.7e-05,0.00012,4.4e-05,-3.3e-05,8.2e-05,-0.000117,4.7e-05,5.4e-05,-4.3e-05,0.000125,-0.000154,-4.1e-05,0.000112,1.7e-05,4e-05,5.4e-05,5.1e-05,3.9e-05,-2.9e-05,8.5e-05,-5.1e-05,4.7e-05,-1.6e-05,-0.000109,9e-06,-1.9e-05,8.4e-05,9.3e-05,-5.8e-05,-3.3e-05,4e-06,-1.8e-05,1.2e-05,0.00012,-4.2e-05,-2.5e-05,-7e-06,0.000102,7.6e-05,0.000118,-2.4e-05,7.8e-05,7.3e-05,-1.5e-05,-1.4e-05,4.4e-05,3.9e-05,0.00012,8.9e-05,7.9e-05,-1.2e-05,-2.8e-05,-4.8e-05,-3.4e-05,0.000111,-1.6e-05,2.5e-05,0.000122,-0.000376,0.000105,-2e-05,-8.6e-05,-7.7e-05,-1.2e-05,3.1e-05,-3.3e-05,0.000131
1e-06,8e-06,-6e-06,2.6e-05,-1.5e-05,-0.000101,1e-05,-3e-06,2e-06,-1.6e-05,-3.9e-05,1.6e-05,-2e-05,1.1e-05,-2.8e-05,-6e-06,1.4e-05,1.4e-05,-1.7e-05,-5e-05,-2.8e-05,5.1e-05,-4.2e-05,-6e-06,-1e-05,-8.6e-05,-1e-06,2e-06,-3.7e-05,1.7e-05,1e-05,7.2e-05,2.1e-05,5.3e-05,-2.9e-05,-2.3e-05,0.000186,-6e-05,6e-06,-0.000111,1.7e-05,-1.4e-05,-5.1e-05,2.4e-05,-0.000107,1.7e-05,6.4e-05,8.7e-05,-5.6e-05,-3.3e-05,3e-06,-3e-05,3.3e-05,-5e-06,5.5e-05,3.4e-05,-1.1e-05,-1.4e-05,-7.2e-05,1.6e-05,1.1e-05,-2.2e-05,-3.2e-05,9.9e-05,-8.9e-05,-9e-06,-0.000188,-2.4e-05,-5.7e-05,-0.000175,-0.000123,1.6e-05,-1.3e-05,-6.1e-05,-1.1e-05,4.5e-05,-9.8e-05,1.7e-05,2e-05,-5.5e-05,-2.5e-05,3.9e-05,-6.9e-05,-1.6e-05,-5.1e-05,2.5e-05,8e-05,-7.2e-05,-1.5e-05,1.6e-05,-5.7e-05,-5e-05,0.000106,-0.000114,2.6e-05,-0.000111,-6e-05,-4e-06,4.4e-05,-4e-05,-7.7e-05,5.6e-05,5.3e-05,-5e-05,-3.3e-05,-6.4e-05,-3.7e-05,2.5e-05,-0.000108,-4.6e-05,-6e-05,-0.000129,-0.000141,-6.1e-05,-3e-05,-1.2e-05,7.9e-05,1.4e-05,1.2e-05,5e-06,8.7e-05
1.9e-05,6e-06,1.6e-05,-1.3e-05,1.6e-05,7.5e-05,-1.7e-05,-1.7e-05,-1.3e-05,2.4e-05,5e-06,-3.4e-05,6e-06,-2.7e-05,3.1e-05,-1.9e-05,-2e-06,-1.3e-05,-2.8e-05,4e-06,1.4e-05,-4.6e-05,2.8e-05,2e-06,9e-06,3.6e-05,-7e-06,3.7e-05,0.000112,-9e-06,9e-06,-0.000112,-4e-05,-8.1e-05,4e-06,1e-06,-0.000133,-2.7e-05,-6e-06,8.1e-05,-3.4e-05,3.8e-05,4.2e-05,2.2e-05,-3e-06,1.5e-05,-1.3e-05,0.00011,3.5e-05,2.2e-05,4.5e-05,-5e-06,-2e-06,4.8e-05,-7e-06,-0.000145,-2.2e-05,3.9e-05,0.000149,1.1e-05,6.3e-05,1.4e-05,4.3e-05,-7e-05,-6.9e-05,-1.1e-05,2.4e-05,1e-04,-6e-06,0.000201,-1.3e-05,-6.8e-05,5.2e-05,6.8e-05,2.7e-05,-4.3e-05,0.000126,-6.8e-05,0,0.000211,-5.4e-05,-0.000138,8.2e-05,1.7e-05,-1.2e-05,-4.5e-05,7e-06,-1.1e-05,2.3e-05,6.4e-05,-1.3e-05,9e-06,-9.9e-05,2.4e-05,7.8e-05,6.5e-05,1e-05,3.1e-05,4.3e-05,2.1e-05,4e-05,-6.7e-05,-4.2e-05,1.4e-05,3.6e-05,2e-06,5.2e-05,-4.8e-05,0.000135,5.5e-05,6.3e-05,0.000129,0.000101,-0.00011,-7e-05,4.3e-05,0.000242,-8.6e-05,1.2e-05,-6.2e-05,-4.8e-05
-9e-06,0,-1.6e-05,1e-05,-6e-06,-3.5e-05,1.8e-05,4.1e-05,1.5e-05,-1.9e-05,4e-05,1.2e-05,1e-06,1.6e-05,-3e-05,1.6e-05,4e-06,-1e-06,8.4e-05,2.2e-05,-2.3e-05,-1e-06,2e-06,1e-06,1e-05,-1.7e-05,2e-06,3e-06,-1.7e-05,2.1e-05,-1.9e-05,2e-05,3.8e-05,4.8e-05,-1.1e-05,-9e-06,-1.4e-05,5.3e-05,-6e-06,1.6e-05,2.9e-05,-4.7e-05,-1.9e-05,7e-06,0.000109,5e-06,-5e-06,-0.000122,-9.8e-05,-1e-06,-4.9e-05,3.8e-05,-3.4e-05,-9e-06,-4.8e-05,2.3e-05,4.7e-05,-1.6e-05,-0.000172,4.5e-05,-9.6e-05,1.8e-05,-6e-06,-6.7e-05,2.4e-05,-2.5e-05,1e-06,-8.3e-05,0,-8.5e-05,3.1e-05,1.8e-05,-1.4e-05,4.8e-05,9e-06,-3e-06,-3.8e-05,1.8e-05,-1.5e-05,-1.3e-05,3.6e-05,0.000114,1.8e-05,-4.7e-05,-8e-06,-6.4e-05,-0.000134,1.5e-05,0,4.4e-05,5.5e-05,0.00019,2e-06,9e-05,-7.4e-05,4.2e-05,-8e-06,-2.7e-05,-5.9e-05,3e-05,1.1e-05,-4.2e-05,-1.5e-05,-2.9e-05,4e-05,2.7e-05,-2.9e-05,6e-06,-9.4e-05,1.1e-05,-5e-05,-9.4e-05,2.4e-05,-3.3e-05,-4.8e-05,-4.9e-05,1.4e-05,3.7e-05,-2.4e-05,3.1e-05,-0.000114
5e-06,-1.9e-05,4e-06,-9e-06,6e-06,2.1e-05,-7e-06,-3.1e-05,-2.1e-05,-2e-06,-5.8e-05,-5e-06,-4e-06,8e-06,1.3e-05,-9e-06,-1.7e-05,-1e-06,-4e-05,-2.3e-05,2.5e-05,-3e-06,-8e-06,-3e-06,-2.8e-05,3.4e-05,5e-06,-1.5e-05,-4.7e-05,-3.1e-05,1.5e-05,2.9e-05,-4e-05,-2e-05,-1.2e-05,-1.4e-05,3e-06,-2.5e-05,-2e-06,-3.7e-05,1.7e-05,-3.3e-05,-1.4e-05,4e-06,-1.9e-05,5.1e-05,-6e-06,-8.8e-05,4.1e-05,2.6e-05,2e-05,-6.5e-05,2.3e-05,4.4e-05,6.2e-05,0.000104,-3e-05,-9e-06,0.000139,-0.000123,-2.6e-05,-3.1e-05,-3.4e-05,1.3e-05,0.000138,-1e-06,-5.7e-05,0.000113,-2.3e-05,3.3e-05,-1.9e-05,3.2e-05,-1.8e-05,-0.000222,-2.1e-05,-1.3e-05,4.8e-05,7e-06,-2.3e-05,2.9e-05,1.1e-05,-6e-05,6e-06,3.5e-05,-2e-05,3.1e-05,-3.2e-05,0,-1.3e-05,-5e-06,2.3e-05,-8.9e-05,4.8e-05,-9.9e-05,0.000115,-9e-05,2.2e-05,5.9e-05,-6.7e-05,-3.3e-05,-2.4e-05,5.4e-05,-4.2e-05,-3.9e-05,-3.5e-05,2.1e-05,-3e-06,3.3e-05,7.7e-05,-3.7e-05,4.8e-05,6.9e-05,-5.1e-05,-4.5e-05,-2.2e-05,4e-06,-0.000174,6e-06,2.9e-05,-5.1e-05,3.6e-05
9e-06,-3e-06,-2e-06,1.8e-05,1.9e-05,-3.9e-05,1e-06,1.3e-05,1.2e-05,2.4e-05,6.5e-05,-4e-06,5e-06,-2e-05,1e-06,-4e-06,1.3e-05,-8e-06,-5.1e-05,3.1e-05,-1.1e-05,1e-05,1.2e-05,7e-06,1.9e-05,-4.9e-05,-4e-06,8e-06,8.4e-05,8e-06,1.2e-05,-7e-06,3.1e-05,9e-06,3.7e-05,7e-06,6.4e-05,1.2e-05,0,1.5e-05,1e-06,-3.3e-05,2.4e-05,-6e-06,2.6e-05,-1.6e-05,-2.4e-05,0.000101,-6.1e-05,1e-05,7e-06,5.2e-05,-1.6e-05,3.4e-05,-4.2e-05,-6.4e-05,-5.2e-05,-7e-06,-4e-05,0.00013,2.1e-05,2.4e-05,3.4e-05,0.000141,-8.3e-05,5e-06,1.3e-05,-7.7e-05,3e-06,-3.8e-05,1.6e-05,1.6e-05,2e-05,3.3e-05,-3.3e-05,3e-05,-1.9e-05,7.1e-05,2.3e-05,-7.4e-05,3e-06,0,-3.2e-05,4.2e-05,-3e-06,-8e-06,0.000136,1.4e-05,9e-06,2.9e-05,-3.4e-05,-7.8e-05,3.5e-05,1.7e-05,-0.00012,4.7e-05,0,-5.3e-05,4e-05,4.5e-05,7e-06,4.8e-05,1.6e-05,3.9e-05,-1e-06,-1.8e-05,3.1e-05,-1e-05,-8.2e-05,2.6e-05,-5.9e-05,-4.7e-05,6.3e-05,0.000136,-1.4e-05,1.5e-05,7.2e-05,-1e-05,-1.2e-05,-1.4e-05,8.2e-05
-2.5e-05,1.1e-05,9e-06,-1.3e-05,-1.9e-05,4.3e-05,3e-06,7e-06,-1e-06,-1.8e-05,-4.5e-05,2.9e-05,-5e-06,1.8e-05,1.3e-05,9e-06,-5e-06,9e-06,3.8e-05,-3.4e-05,1.3e-05,-7e-06,-9e-06,-6e-06,1e-06,3.6e-05,4e-06,-3e-06,-1.2e-05,-1e-05,-9e-06,1.2e-05,-4.4e-05,2e-06,-1.7e-05,-9e-06,-7e-05,-7e-06,-3e-06,-2.7e-05,-1.2e-05,1.3e-05,-5e-06,2e-06,-8.4e-05,-2.4e-05,2.6e-05,1.1e-05,1.5e-05,1.2e-05,5e-06,-4e-06,1.3e-05,-4e-06,1.3e-05,-5.6e-05,6e-05,-1.5e-05,0,-6.6e-05,4.9e-05,-1e-06,1e-06,-0.000148,2.4e-05,9e-06,8.1e-05,4e-05,7e-06,-4.8e-05,-2.5e-05,-4.8e-05,-2.7e-05,0.000119,1.2e-05,3.8e-05,-3.7e-05,-4.3e-05,1.5e-05,-7e-05,6e-06,1.1e-05,2.8e-05,-3.9e-05,0,3e-05,-4.9e-05,-4e-06,3e-06,-1.5e-05,-6e-06,-3.4e-05,-9.7e-05,1.7e-05,4.4e-05,-2.6e-05,-5e-05,2.6e-05,-1.5e-05,-1.5e-05,1.9e-05,-1e-04,1.3e-05,-1e-06,-2.9e-05,-3e-06,-3.9e-05,3.7e-05,7.6e-05,-2e-06,5.6e-05,2.2e-05,-0.000189,-9e-06,-4e-05,-8e-06,0.000134,-3e-06,-4e-06,2.6e-05,2.8e-05
1.1e-05,-4e-06,-4e-06,1.2e-05,4e-06,-3.7e-05,-1.2e-05,-2.6e-05,6e-06,9e-06,1.7e-05,-2.2e-05,5e-06,-7e-06,-5e-06,2e-06,-9e-06,2e-06,3.8e-05,1.5e-05,-2e-05,2.3e-05,1.4e-05,3e-06,-5e-06,6e-06,-2e-06,-1.5e-05,-9e-06,1.4e-05,-7e-06,-3.8e-05,5.4e-05,-1.7e-05,1.3e-05,-1e-05,-5.3e-05,-1e-05,0,3.1e-05,0,3.4e-05,-1.2e-05,-2e-06,-2.2e-05,-2e-06,3e-06,-6.4e-05,1e-05,-3e-06,-7e-06,-1.6e-05,1.6e-05,-1.1e-05,1.3e-05,7.7e-05,-2.2e-05,2e-06,0,-7e-06,1.7e-05,-2.5e-05,-3.1e-05,2.6e-05,-1.8e-05,6e-06,-2.6e-05,1.7e-05,-6e-06,7.6e-05,3.5e-05,2.9e-05,3e-05,-1.3e-05,-7e-06,-2.4e-05,7e-06,2.3e-05,-2e-06,-2.4e-05,1.4e-05,5e-06,-3.7e-05,1.4e-05,0,1.9e-05,-7.3e-05,-6e-06,-1.7e-05,-4.3e-05,2.2e-05,-1.3e-05,2.1e-05,-9e-06,-2.5e-05,-5e-06,4.6e-05,-3.2e-05,4e-06,2.8e-05,-1.3e-05,3.8e-05,4.2e-05,-6e-06,1.9e-05,-4e-06,8e-06,-6e-06,-7.4e-05,-1.5e-05,-3.2e-05,1.4e-05,0.000121,-6.9e-05,1.6e-05,-2e-05,-0.000132,-3e-06,-2.1e-05,-3.6e-05,-4.4e-05
1.2e-05,1.3e-05,-2e-06,-8e-06,1e-06,1.5e-05,6e-06,2.6e-05,-7e-06,3e-06,1e-06,-1.7e-05,0,-2e-06,9e-06,-6e-06,2.1e-05,5e-06,-5.9e-05,1.6e-05,1.1e-05,4e-06,-1.6e-05,-3e-06,2e-06,-4.2e-05,-1e-06,1.1e-05,-6.5e-05,9e-06,7e-06,2.4e-05,-4.5e-05,6e-06,3e-06,1.1e-05,0.000106,1.2e-05,0,1.5e-05,-8e-06,8e-06,1.3e-05,-2e-06,6e-05,-1.7e-05,-1e-05,2.1e-05,-8e-06,-1.9e-05,-2.3e-05,2.4e-05,-4.5e-05,-2.9e-05,-1.7e-05,4e-06,-4e-06,-4e-06,-1.3e-05,2.2e-05,-4.7e-05,1.9e-05,2.6e-05,4e-06,8.4e-05,-6e-06,-8e-06,-3.5e-05,3e-06,-3.3e-05,2.2e-05,1.2e-05,-9e-06,5e-06,-4e-06,2e-06,1e-05,-6.8e-05,-1.8e-05,3.7e-05,2.2e-05,7e-06,-2e-05,-4e-06,9e-06,-4.2e-05,5.2e-05,1e-06,2.1e-05,-8e-06,1.6e-05,8.9e-05,3e-05,3.6e-05,-5.2e-05,4.1e-05,5e-06,3e-05,-9e-06,-4e-06,-6e-06,-4e-06,-2.9e-05,3.1e-05,1.9e-05,9e-06,2.7e-05,0,6.6e-05,2.3e-05,7e-06,-4.3e-05,8.2e-05,-2.3e-05,2.2e-05,-7e-06,-0.000204,3.3e-05,2.5e-05,3.1e-05,-4.8e-05
-1e-05,-3e-06,-1e-06,-1e-06,-1.1e-05,-7e-06,-1e-06,-2.3e-05,1.2e-05,-1.2e-05,-1.8e-05,1.2e-05,1e-06,-2e-06,-1.5e-05,-6e-06,-1.7e-05,3e-06,3e-05,-3.2e-05,-1e-05,-1.7e-05,4e-06,1e-06,-1.4e-05,4.9e-05,4e-06,-7e-06,-1.6e-05,-9e-06,5e-06,1.1e-05,3.8e-05,4e-06,4e-06,3e-06,-6e-06,4e-06,0,-5.6e-05,2.1e-05,-1.3e-05,-1.1e-05,0,1.2e-05,1.3e-05,4e-06,2.2e-05,4.8e-05,1.1e-05,2.7e-05,-3.6e-05,1.4e-05,-8e-06,1.4e-05,-5.2e-05,-1e-06,1e-06,3.7e-05,2e-05,0,-1e-06,-1e-06,5.8e-05,-4e-06,3e-06,3.2e-05,5e-06,6e-06,3.2e-05,-4.2e-05,-4.6e-05,-2.4e-05,5e-06,-3e-06,-1e-05,1.6e-05,2.5e-05,-1.4e-05,9.7e-05,-1.8e-05,8e-06,0,-3.3e-05,1.1e-05,1e-06,1.3e-05,-3e-06,-1.2e-05,-1.6e-05,-9e-06,-1.2e-05,1.2e-05,-2.9e-05,7.5e-05,-4.7e-05,-3.5e-05,-2.2e-05,-3.8e-05,-2.3e-05,1.3e-05,4.8e-05,1.1e-05,-1.8e-05,-3e-06,-4e-06,-9e-06,1.5e-05,-6e-05,-1.5e-05,-3e-06,4.9e-05,-9.8e-05,-6.7e-05,-7e-06,1.3e-05,7.9e-05,-9e-06,-6e-06,-2.1e-05,1.3e-05
-5e-06,-9e-06,3e-06,2e-06,6e-06,1.5e-05,2e-06,1e-05,-7e-06,1.6e-05,2.2e-05,4e-06,-1e-06,3e-06,-2e-06,8e-06,7e-06,-5e-06,-1e-06,3e-05,1.8e-05,9e-06,6e-06,-2e-06,2.1e-05,-3.7e-05,-1e-06,-9e-06,8.6e-05,2e-06,-3e-06,-2.6e-05,-4.3e-05,9e-06,-1.6e-05,-1e-05,-2.3e-05,-1e-06,1e-06,1.5e-05,-4e-06,-4.7e-05,-4e-06,-6e-06,2.1e-05,6e-06,-3e-06,-5.6e-05,-1.8e-05,-2.9e-05,-2e-06,1.9e-05,3.4e-05,-8e-06,1.3e-05,1.9e-05,2.5e-05,8e-06,-2.6e-05,-6.8e-05,-1e-05,-5e-06,-2.6e-05,-5.7e-05,-1.2e-05,0,-4.5e-05,-1.5e-05,-4e-06,-4.1e-05,5.7e-05,2.9e-05,4.1e-05,-6.4e-05,-2e-06,-7e-06,-7e-06,3e-06,2.3e-05,2.5e-05,-9e-06,9e-06,4.1e-05,1.8e-05,9e-06,-2.1e-05,8e-06,7e-06,2e-06,0,-1.1e-05,-3.7e-05,-8.4e-05,-2.9e-05,-7.1e-05,8e-06,1.3e-05,2e-05,1.1e-05,9e-06,-1e-06,-6.2e-05,-4.3e-05,-6e-06,-8e-06,-6e-06,-2e-05,-2.7e-05,5.2e-05,-6e-06,1.7e-05,-4.9e-05,-7.6e-05,9e-05,-1.6e-05,-8e-06,0.00011,-4e-06,-1.1e-05,-1e-06,4.5e-05
6e-06,1e-06,1e-06,-4e-06,6e-06,-3e-05,1e-06,5e-06,-9e-06,-1.3e-05,-2.1e-05,1e-06,-2e-06,3e-06,1e-05,-5e-06,0,-1e-06,-3.9e-05,-2.4e-05,-8e-06,-6e-06,-9e-06,1e-06,-2e-06,2.5e-05,-1e-06,5e-06,-2.1e-05,-1.3e-05,0,1.8e-05,5.1e-05,-1.8e-05,4e-06,-2e-06,-2.5e-05,-1.7e-05,0,2.5e-05,-2e-05,8e-06,1.2e-05,-8e-06,-4.8e-05,8e-06,5e-06,2e-05,2.6e-05,1.4e-05,2e-05,-1e-06,-4.9e-05,-7e-06,-3e-05,1.1e-05,-1.6e-05,-1e-06,1.8e-05,7.3e-05,1.6e-05,1.3e-05,1.7e-05,-2.7e-05,-5.6e-05,3e-06,-1.6e-05,-3e-06,-7e-06,-1.1e-05,-5.2e-05,1e-06,-2.4e-05,-2.7e-05,-6e-06,1.4e-05,1.2e-05,4.9e-05,-2e-06,-1.4e-05,1.2e-05,3e-06,1.2e-05,4e-06,1.6e-05,-1.8e-05,3.9e-05,-2e-06,-2e-06,7e-06,-5e-06,7.4e-05,2.6e-05,3.1e-05,7.5e-05,3.4e-05,6e-06,-2.3e-05,5e-06,-2.2e-05,-1.7e-05,4e-06,1.2e-05,1.6e-05,-3e-06,4e-06,1.8e-05,1e-06,-5.3e-05,1.9e-05,-3.2e-05,3.5e-05,0.000125,4.6e-05,2e-06,-8e-06,-5.3e-05,-2e-05,0,1.3e-05,-4e-06
-3e-06,-2e-06,-2e-06,1e-06,-2e-06,3e-05,-7e-06,-1.3e-05,1.6e-05,1e-06,2.2e-05,-2e-06,5e-06,-7e-06,-1.1e-05,0,-1e-05,-3e-06,3.4e-05,2.2e-05,-2e-06,-2e-06,8e-06,0,-1.5e-05,-2.6e-05,3e-06,2e-06,-3e-06,1.3e-05,-5e-06,-4e-06,-4.1e-05,1.1e-05,-7e-06,3e-06,4.9e-05,-1.4e-05,1e-06,-3e-06,-1e-06,-1.4e-05,1e-06,-5e-06,-3.4e-05,1.1e-05,3e-06,5.2e-05,-1.7e-05,-7e-06,-2.4e-05,0,2.4e-05,0,2.3e-05,-5e-06,-7e-06,7e-06,-5.2e-05,-3.1e-05,5e-06,-1.1e-05,6e-06,4.4e-05,1.3e-05,2e-06,1.4e-05,1.5e-05,8e-06,4.9e-05,3.9e-05,-8e-06,-3e-06,3.3e-05,-1.1e-05,-6e-06,-4.4e-05,-3.8e-05,-1e-06,-8.7e-05,-2e-06,8e-06,-6e-06,5e-06,9e-06,1.7e-05,-4.5e-05,-5e-06,8e-06,2.3e-05,9e-06,-9e-05,3.3e-05,-9e-06,-2.5e-05,-3.7e-05,0,9e-06,-2e-06,1e-05,1.5e-05,2.5e-05,7e-06,-2.4e-05,-9e-06,4e-06,0,-2.1e-05,5.7e-05,-2.2e-05,3e-05,-1.7e-05,-4.7e-05,-1.3e-05,1e-06,-4e-06,-5.7e-05,7e-06,1.1e-05,-1.3e-05,-3.1e-05
6e-06,7e-06,0,0,2e-06,-1.7e-05,4e-06,8e-06,-1.2e-05,6e-06,-1.7e-05,-1.1e-05,-2e-06,8e-06,1.2e-05,5e-06,1.3e-05,1e-06,2.1e-05,-1.3e-05,1e-06,4e-06,-4e-06,1e-06,9e-06,3.2e-05,-1e-06,-5e-06,5e-06,-4e-06,-6e-06,-5e-06,3.4e-05,-1e-06,1e-06,1e-06,-1.7e-05,-9e-06,1e-06,-1e-06,1e-05,1.9e-05,-1e-05,7e-06,2.7e-05,-1.3e-05,-1.1e-05,-3e-05,1.7e-05,2e-06,2e-06,3e-06,5e-06,2.8e-05,-1e-05,5e-06,2.8e-05,-2e-06,6.9e-05,-1.3e-05,0,2e-06,-1.8e-05,1.4e-05,-3.4e-05,-8e-06,8e-06,8e-06,2e-06,-3.1e-05,-3.9e-05,-2e-06,1.8e-05,5.7e-05,6e-06,8e-06,3.5e-05,-3e-06,-7e-06,-1.8e-05,-1.1e-05,-2.2e-05,-1.1e-05,1.4e-05,9e-06,-2e-06,-6.6e-05,8e-06,-1.1e-05,1.5e-05,2e-06,7.3e-05,8e-06,6e-06,4e-06,1.8e-05,-6e-06,-6e-06,1.4e-05,4e-06,4e-06,6e-06,3.5e-05,5e-06,1.9e-05,5e-06,-5e-06,-1.6e-05,-4.8e-05,6e-06,-1.8e-05,-7e-06,1.4e-05,-2.4e-05,-2.1e-05,2e-06,6.8e-05,8e-06,-5e-06,1.2e-05,-1.5e-05
-3e-06,1e-06,0,1e-06,-1e-06,8e-06,-1e-06,-3e-06,6e-06,-1e-05,7e-06,8e-06,-1e-06,-3e-06,-7e-06,-5e-06,-7e-06,3e-06,-3.3e-05,-3e-06,1.1e-05,2e-06,0,0,-5e-06,-2.8e-05,0,2e-06,-2e-06,5e-06,7e-06,4e-06,-3.5e-05,4e-06,-6e-06,-3e-06,-4.5e-05,1.3e-05,0,-2.6e-05,6e-06,1.6e-05,5e-06,4e-06,2.6e-05,-8e-06,1e-06,-4.7e-05,-1e-05,1.5e-05,-6e-06,8e-06,-3.1e-05,-3e-06,1e-06,-2e-05,-3.6e-05,-7e-06,-7e-05,1.8e-05,1.1e-05,7e-06,1.4e-05,-2.5e-05,2.6e-05,3e-06,-3e-06,9e-06,-3e-06,1.1e-05,1.4e-05,5e-06,-2.1e-05,2.4e-05,5e-06,-8e-06,-3e-05,-2.6e-05,4e-06,-1.7e-05,2e-06,2.9e-05,1e-05,-1.5e-05,1.1e-05,3.3e-05,6.5e-05,-4e-06,7e-06,3e-06,-3e-06,-3.8e-05,-5e-05,3e-06,2.4e-05,1e-06,-8e-06,1e-06,-2.3e-05,-1e-06,-1.9e-05,-2.2e-05,-2.1e-05,1.3e-05,-5e-06,-7e-06,1e-06,4e-06,4.7e-05,1.2e-05,9e-06,2.9e-05,-1.8e-05,-6.3e-05,-1e-05,3e-06,8.8e-05,-3e-06,-1.1e-05,-3e-06,1.8e-05
-4e-06,0,0,-1e-06,-6e-06,-1.2e-05,1e-06,-1e-06,-1e-06,6e-06,-3e-06,8e-06,1e-06,-4e-06,6e-06,0,4e-06,0,-1.1e-05,1.9e-05,-1.1e-05,-1.2e-05,1e-06,1e-06,1e-05,1.2e-05,1e-06,2e-06,2e-06,-5e-06,-1e-06,-7e-06,4e-05,2e-06,9e-06,-5e-06,2.8e-05,4e-06,0,1.6e-05,-1.5e-05,-3.1e-05,5e-06,0,2.6e-05,-3e-06,3e-06,4.8e-05,-1.1e-05,-1.6e-05,8e-06,-2.1e-05,3.2e-05,2e-05,1.3e-05,1.3e-05,1.8e-05,4e-06,4.9e-05,1.5e-05,-1.9e-05,-1e-05,3e-06,-4.2e-05,3e-06,-2e-06,1.5e-05,-3.3e-05,0,-5e-06,7e-06,9e-06,1.6e-05,-5.7e-05,-1e-06,-1.1e-05,3.5e-05,1.9e-05,-1e-06,8.2e-05,5e-06,-4.6e-05,-1.4e-05,1e-06,5e-06,1.8e-05,1.9e-05,3e-06,-2e-06,0,-8e-06,-8e-06,2e-05,-1.8e-05,-5.4e-05,-1.7e-05,1.7e-05,7e-06,-2e-06,1.4e-05,1.3e-05,-1.2e-05,3e-06,-1.5e-05,0,-4e-06,-4e-06,-1e-05,-4.5e-05,-2.1e-05,-1.2e-05,-3.6e-05,-2e-06,3.3e-05,5e-06,-8e-06,-2.8e-05,1e-06,9e-06,3e-06,2.2e-05
3e-06,-2e-06,-2e-06,4e-06,1e-06,2.3e-05,2e-06,-1e-06,-1e-06,0,-4e-06,-3e-06,0,2e-06,-5e-06,2e-06,-3e-06,2e-06,3.4e-05,-2.4e-05,1e-06,9e-06,-1e-06,-1e-06,-1e-06,3e-06,-1e-06,-1e-06,-4.9e-05,1e-06,-3e-06,1.2e-05,-3e-05,-9e-06,4e-06,4e-06,1e-05,-1.3e-05,0,2.2e-05,-7e-06,8e-06,-9e-06,-4e-06,-3.1e-05,-3e-06,0,1.7e-05,-3e-06,2.5e-05,-2e-06,1.5e-05,-7e-06,-2e-05,-1.5e-05,2e-05,-4e-06,0,-2.5e-05,-4.3e-05,0,5e-06,-1.8e-05,6.4e-05,-7e-06,3e-06,1.3e-05,3.9e-05,2e-06,-1.5e-05,-1.9e-05,-2.4e-05,-3e-06,-3.2e-05,-7e-06,1e-05,4e-06,8e-06,-5e-06,4.1e-05,-6e-06,2.4e-05,-6e-06,-1e-06,0,-9e-06,-5.2e-05,-6e-06,-2e-06,-9e-06,-1e-06,1.7e-05,3e-05,6e-06,4.8e-05,2.1e-05,-3e-06,-5e-06,1.5e-05,-7e-06,4e-06,3.4e-05,-1.6e-05,1.3e-05,-2e-06,1e-06,8e-06,7e-06,4e-05,8e-06,1.9e-05,3.7e-05,2.4e-05,4e-05,-4e-06,-1e-06,-0.000106,-5e-06,0,1.1e-05,-9e-06
1e-06,-4e-06,0,-5e-06,2e-06,-2.6e-05,-6e-06,5e-06,-4e-06,-6e-06,1e-05,-3e-06,1e-06,1e-06,1e-06,1e-06,2e-06,0,-2e-05,1.8e-05,0,-5e-06,3e-06,1e-06,-1.3e-05,-9e-06,0,5e-06,1.8e-05,4e-06,6e-06,-3e-06,2.5e-05,5e-06,-4e-06,2e-06,2e-06,-5e-06,0,-1.9e-05,8e-06,-4.5e-05,4e-06,0,-3.6e-05,9e-06,2e-06,-3.8e-05,-1.7e-05,-2e-05,-1e-05,-1.3e-05,-2e-05,1e-05,-1e-06,-3.3e-05,2e-06,5e-06,-4e-06,3.3e-05,-3e-06,5e-06,1.1e-05,-3e-06,2.2e-05,0,-2.8e-05,-3e-05,-2e-06,3.2e-05,1.8e-05,1.7e-05,-1.3e-05,1e-05,1e-06,-5e-06,-1.4e-05,1.4e-05,8e-06,-2e-06,-4e-06,0,3e-06,-1.1e-05,3e-06,0,2.5e-05,4e-06,3e-06,-1.3e-05,7e-06,-6e-05,4e-06,1e-05,-5.4e-05,-5e-06,-1.8e-05,1.1e-05,5e-06,6e-06,-8e-06,-5e-06,0,4e-06,-8e-06,3e-06,1e-06,-1e-06,-4.4e-05,6e-06,-1.9e-05,-2.2e-05,3.6e-05,2.2e-05,-1.7e-05,3e-06,-3.4e-05,7e-06,-1e-06,-1.1e-05,-2.3e-05
-4e-06,4e-06,0,6e-06,0,1.7e-05,3e-06,-6e-06,4e-06,1.1e-05,-8e-06,-3e-06,-2e-06,1e-06,-2e-06,-1e-06,-3e-06,0,-1e-06,-1e-05,1.1e-05,2e-06,-3e-06,-1e-06,1.2e-05,5e-06,1e-06,0,3.7e-05,-3e-06,-2e-06,-1.3e-05,-2.8e-05,4e-06,8e-06,-7e-06,-1.5e-05,3e-06,0,-7e-06,9e-06,2.5e-05,4e-06,4e-06,7e-06,4e-06,-5e-06,7e-06,4e-06,9e-06,3e-06,1e-05,2.3e-05,-1.8e-05,6e-06,0,-5e-06,4e-06,2.6e-05,5e-06,1.3e-05,-7e-06,6e-06,-3.6e-05,-2.6e-05,-2e-06,0,1.5e-05,1e-06,-2.1e-05,-1.1e-05,2e-06,2.1e-05,-8e-06,3e-06,8e-06,8e-06,-5e-06,-2e-06,-3.4e-05,-1e-06,-3.7e-05,2.1e-05,1.4e-05,-3e-06,-2.6e-05,1.4e-05,-1e-06,-1e-06,-1.2e-05,4e-06,8.1e-05,-4e-05,-7e-06,2.9e-05,-1.4e-05,1.9e-05,-1.3e-05,1.6e-05,-4e-06,-2e-06,-1.5e-05,-1e-06,-1.7e-05,7e-06,1e-06,-7e-06,-4e-06,4.1e-05,-1.2e-05,1.2e-05,8e-06,-6.9e-05,-4e-06,2e-06,0,7.6e-05,0,-4e-06,1.1e-05,-4e-06
4e-06,2e-06,0,-6e-06,5e-06,-6e-06,0,4e-06,0,-8e-06,7e-06,3e-06,0,-1e-06,-1e-06,0,2e-06,-1e-06,2.2e-05,3e-06,-7e-06,6e-06,2e-06,1e-06,-3e-06,-5e-06,-2e-06,-4e-06,6e-06,3e-06,-3e-06,8e-06,2.8e-05,-3e-06,-3e-06,-1e-06,1.6e-05,1e-06,0,1e-06,-5e-06,1e-05,-6e-06,3e-06,2.5e-05,5e-06,1e-06,3.2e-05,-5e-06,0,0,-1e-06,-1.3e-05,6e-06,-5e-06,3.3e-05,4e-06,-2e-06,-3.9e-05,-3e-05,2e-06,6e-06,-1.5e-05,-6e-06,4.1e-05,1e-06,1e-06,-1e-06,2e-06,1.8e-05,6e-06,-1e-05,-1.6e-05,3.4e-05,3e-06,-2e-06,-3.4e-05,-1.4e-05,2e-06,-6.8e-05,6e-06,4.3e-05,-1e-06,3e-06,-9e-06,-3e-06,-2.8e-05,0,0,-3e-06,-6e-06,-1.8e-05,1e-05,2e-06,-2e-06,1.5e-05,-4e-06,1.6e-05,-1.2e-05,-2e-06,1.4e-05,-1.4e-05,2.1e-05,1.4e-05,1e-06,-1e-06,-1e-06,4e-06,-4.1e-05,1.4e-05,-4e-06,1.1e-05,2.7e-05,-5.4e-05,2e-06,-2e-06,-6e-06,-4e-06,9e-06,-3e-06,1.7e-05
-1e-06,1e-06,-1e-06,5e-06,0,7e-06,1e-06,1e-06,-4e-06,0,-5e-06,6e-06,1e-06,2e-06,4e-06,0,4e-06,-1e-06,-2.8e-05,6e-06,0,0,0,0,0,1.5e-05,1e-06,3e-06,-1.5e-05,-6e-06,1e-06,7e-06,-2.6e-05,-4e-06,1e-06,3e-06,8e-06,8e-06,0,1.3e-05,-1.1e-05,-1.3e-05,1e-06,-1e-06,2.9e-05,1e-06,3e-06,-3.2e-05,1e-05,-1.3e-05,1.4e-05,6e-06,1e-06,-1.4e-05,7e-06,-2.5e-05,7e-06,-1e-06,4.1e-05,1.7e-05,-1.2e-05,-3e-06,8e-06,3.9e-05,-1.5e-05,-1e-06,-1.2e-05,-1e-05,-2e-06,-1.6e-05,5e-06,9e-06,0,5.1e-05,3e-06,-5e-06,1.4e-05,-1.9e-05,-9e-06,-5e-06,-4e-06,-2e-05,-1.3e-05,-4e-06,-5e-06,4e-06,4.1e-05,1e-06,-1e-06,3e-06,-5e-06,1e-06,2.3e-05,-9e-06,-2.3e-05,-3e-06,-1e-05,-1.9e-05,-5e-06,3e-06,-1.2e-05,3.6e-05,-2e-06,-5e-06,3e-06,2e-06,8e-06,1e-06,4e-05,-7e-06,6e-06,-2.7e-05,1.6e-05,-1.8e-05,-1.3e-05,2e-06,-0.000105,-5e-06,-5e-06,-3e-06,1.9e-05
-1e-06,0,1e-06,-4e-06,-4e-06,-1.7e-05,1e-06,-8e-06,8e-06,6e-06,2e-06,-2e-06,-1e-06,0,-5e-06,-1e-06,-9e-06,1e-06,-7e-06,-1.7e-05,-2e-06,-8e-06,-3e-06,0,6e-06,-3e-05,1e-06,1e-06,-1.6e-05,6e-06,0,-3e-06,2.3e-05,1e-06,-7e-06,-2e-06,-1.5e-05,-8e-06,0,5e-06,-2e-06,1.9e-05,2e-06,-2e-06,-1.2e-05,-7e-06,-2e-06,-7e-06,6e-06,1.9e-05,-1e-05,-1.2e-05,1.1e-05,1.7e-05,-1e-06,-1.4e-05,-2.1e-05,-1e-06,-3.1e-05,2e-05,7e-06,-3e-06,6e-06,3e-06,1.3e-05,0,8e-06,1.1e-05,-1e-06,-3e-06,-1.4e-05,-5e-06,1.4e-05,-2.1e-05,-1e-06,7e-06,-3e-06,1.3e-05,7e-06,1.5e-05,-4e-06,-7e-06,-7e-06,2e-06,-8e-06,-3e-06,1.2e-05,-2e-06,4e-06,8e-06,3e-06,6e-06,2e-06,-3e-06,4.8e-05,-5e-06,8e-06,2e-05,1.5e-05,-7e-06,-3e-06,-6e-06,-4e-06,-8e-06,-2e-06,-1e-06,-1e-06,7e-06,-3.8e-05,-1e-05,-1.4e-05,3.4e-05,5e-06,2e-05,-2e-06,1e-06,1.4e-05,1e-06,4e-06,1e-05,-7e-06
