0.167209,0.155266,0.156497,0.17339,0.181761,0.178618,0.190057,0.199334,0.187237,0.187038,0.218605,0.28577,0.276693,0.212897,0.183336,0.160332,0.15774,0.171457,0.18128,0.156743,0.156209,0.165287,0.161566,0.186333,0.184514,0.173809,0.198327,0.221325
0.197542,0.183503,0.184264,0.207186,0.213258,0.210261,0.234237,0.24091,0.219608,0.22091,0.256688,0.326655,0.312608,0.243726,0.213654,0.189211,0.185836,0.201675,0.213279,0.183123,0.180002,0.19092,0.187387,0.216023,0.21495,0.203649,0.232735,0.255226
0.242217,0.228682,0.228297,0.260309,0.260375,0.258551,0.305849,0.306436,0.269076,0.271761,0.313735,0.381029,0.354534,0.284245,0.259249,0.235246,0.230145,0.246008,0.256367,0.219057,0.212071,0.224235,0.221149,0.25551,0.257099,0.248053,0.284423,0.300179
0.260963,0.254686,0.253257,0.289345,0.284638,0.286212,0.348214,0.343511,0.298326,0.298873,0.344776,0.393583,0.352846,0.304816,0.293047,0.270463,0.262288,0.267243,0.267861,0.233729,0.228383,0.237888,0.232341,0.264274,0.27071,0.275788,0.31903,0.313759
0.254409,0.25887,0.25537,0.286653,0.290967,0.292228,0.335387,0.336152,0.304332,0.301547,0.345043,0.369505,0.331017,0.317788,0.313745,0.292123,0.28195,0.273306,0.26674,0.244168,0.245831,0.257691,0.244953,0.265873,0.275453,0.285627,0.32914,0.309472
0.270594,0.281041,0.273041,0.291174,0.310407,0.310042,0.313844,0.320179,0.302895,0.29132,0.326699,0.347985,0.332712,0.328713,0.312769,0.294782,0.289992,0.27622,0.273307,0.268168,0.274258,0.294638,0.279622,0.284436,0.288918,0.286352,0.317632,0.307474
0.364583,0.360538,0.364443,0.383107,0.392755,0.398417,0.389977,0.381347,0.346727,0.320412,0.345475,0.367452,0.364123,0.344234,0.323775,0.327288,0.336268,0.336269,0.339877,0.333771,0.341298,0.36501,0.346257,0.334375,0.327808,0.316124,0.343268,0.351405
0.545378,0.511881,0.565061,0.59809,0.574971,0.606118,0.61005,0.558554,0.47544,0.431353,0.470251,0.497346,0.476671,0.439461,0.436784,0.462826,0.477449,0.516059,0.548354,0.517192,0.541704,0.581654,0.535208,0.501723,0.476393,0.444685,0.495182,0.536932
0.844032,0.762882,0.927177,0.995247,0.910119,0.981867,1.010847,0.888732,0.728279,0.652095,0.736474,0.809648,0.77173,0.696452,0.697731,0.746039,0.772571,0.882241,0.987726,0.915982,0.969682,1.046151,0.9279,0.849724,0.804196,0.728937,0.830228,0.933328
1.316815,1.157172,1.493374,1.64092,1.458294,1.558496,1.61754,1.408726,1.135904,1.001351,1.160457,1.313686,1.245033,1.10825,1.103019,1.174755,1.230026,1.456454,1.700805,1.58412,1.662222,1.771489,1.52346,1.365335,1.318502,1.222246,1.407285,1.577734
1.961522,1.686498,2.241272,2.523914,2.193815,2.276384,2.372702,2.092979,1.682999,1.461539,1.721091,1.956106,1.810866,1.59321,1.574517,1.669783,1.770133,2.136887,2.576208,2.430927,2.510335,2.627733,2.213217,1.953469,1.937135,1.867862,2.174145,2.404048
2.551008,2.159675,2.922679,3.369881,2.867672,2.879602,3.019042,2.70991,2.174594,1.864268,2.233743,2.522611,2.267781,1.953134,1.8875,2.006093,2.161409,2.617655,3.237189,3.109848,3.144198,3.229521,2.712932,2.392399,2.415342,2.402931,2.833526,3.078382
2.691735,2.26307,3.077393,3.640683,3.043549,2.946575,3.125623,2.889408,2.345806,2.011222,2.398263,2.660228,2.348574,1.957082,1.809064,1.922077,2.104607,2.520798,3.173817,3.12529,3.079746,3.090595,2.644369,2.382082,2.416716,2.446559,2.923726,3.106469
2.18095,1.877934,2.492553,3.012767,2.500628,2.306785,2.490865,2.433254,2.053142,1.768541,2.010593,2.184728,1.956355,1.587296,1.417789,1.490103,1.605582,1.834576,2.289824,2.329092,2.241331,2.202717,1.990693,1.907556,1.897746,1.895871,2.272842,2.335052
1.418022,1.354024,1.591996,1.969833,1.697681,1.412595,1.527884,1.634265,1.543273,1.381388,1.407504,1.501211,1.479842,1.265767,1.164355,1.183049,1.147035,1.179709,1.358494,1.398434,1.384853,1.415916,1.348576,1.40422,1.346611,1.255922,1.452137,1.40228
1.365876,1.515903,1.444836,1.687186,1.532459,1.077766,1.138648,1.348203,1.526686,1.53752,1.51959,1.710574,1.795803,1.567492,1.451707,1.457257,1.335309,1.265877,1.298176,1.294294,1.415621,1.592973,1.414819,1.435399,1.448957,1.356263,1.464663,1.234501
1.851267,2.12808,1.987244,2.149191,1.92613,1.338355,1.440242,1.774571,2.066592,2.119496,2.07053,2.30044,2.385082,2.131356,2.027337,1.993225,1.781765,1.625208,1.623318,1.6261,1.797912,2.033806,1.80385,1.813053,1.879664,1.850105,1.95856,1.630629
2.318997,2.704155,2.549121,2.526667,2.242696,1.692229,1.776062,2.135934,2.516316,2.665977,2.628307,2.849756,2.815217,2.517258,2.489705,2.407873,2.189638,1.966926,1.855025,1.857706,2.114199,2.415591,2.259981,2.250323,2.362071,2.441915,2.362376,1.957158
2.726329,3.179491,2.934681,2.623345,2.417428,2.038074,1.965092,2.241868,2.734013,3.133024,3.202026,3.518702,3.341128,2.69369,2.623492,2.661735,2.655169,2.419342,2.075538,1.996335,2.444197,2.916358,2.827679,2.761721,2.958746,3.109816,2.663206,2.161957
3.018638,3.588239,3.108866,2.506313,2.469592,2.362563,2.153616,2.279469,2.888447,3.558672,3.710442,4.075591,3.83062,2.716693,2.397503,2.698132,3.097637,2.960762,2.438885,2.249002,2.853914,3.392378,3.250168,3.286661,3.578437,3.682027,3.003123,2.367262
3.024417,3.564848,2.994106,2.307962,2.260676,2.409495,2.26509,2.252436,2.832571,3.525171,3.595209,3.876089,3.805917,2.627143,2.084704,2.506245,3.11173,3.088848,2.563742,2.363892,2.923453,3.229483,3.009223,3.267826,3.629604,3.731072,3.158107,2.456233
2.526758,2.860317,2.47605,1.950074,1.794913,2.022327,2.035043,1.908922,2.270119,2.764644,2.740974,2.876811,3.018751,2.28356,1.858966,2.168739,2.581192,2.570149,2.213084,2.107338,2.373257,2.333474,2.128026,2.515865,2.886675,2.9958,2.692289,2.152687
1.695819,1.775703,1.649089,1.408021,1.21402,1.354208,1.487389,1.389178,1.495043,1.693649,1.667186,1.773104,1.973853,1.68924,1.492333,1.747348,2.002917,1.893655,1.709753,1.597126,1.521556,1.398312,1.285906,1.537668,1.798489,1.867425,1.834694,1.632811
1.006311,0.933018,0.932229,0.920518,0.836388,0.951054,1.085758,0.984781,0.980608,1.051522,1.037629,1.139767,1.347181,1.336807,1.227117,1.357733,1.506275,1.374837,1.247096,1.070288,0.949173,0.888456,0.780742,0.887766,1.06698,1.093336,1.170607,1.136654
0.772048,0.749855,0.750769,0.804635,0.853381,1.057772,1.125849,0.887935,0.96819,1.130514,1.018718,0.943167,1.056969,1.187078,1.134154,1.155165,1.229437,1.109492,0.927916,0.723367,0.675829,0.71008,0.651895,0.657378,0.719437,0.838365,0.972767,0.879327
0.825293,0.974205,0.984796,0.977877,1.070063,1.409271,1.485184,1.074489,1.185299,1.459524,1.274632,0.996295,0.913938,1.040669,1.082156,1.07727,1.165327,1.116414,0.89577,0.618006,0.556232,0.735745,0.796029,0.659117,0.576279,0.781956,1.040298,0.910973
1.119492,1.410235,1.335275,1.183663,1.261169,1.786337,1.934658,1.314819,1.397793,1.76044,1.532605,1.079668,0.812257,0.910699,1.088007,1.066104,1.198006,1.331171,1.065568,0.656118,0.548579,0.877579,1.091163,0.840129,0.576538,0.718734,1.10184,0.996273
1.530101,1.816211,1.567128,1.227314,1.264683,1.954585,2.229243,1.494929,1.467732,1.799993,1.599848,1.117637,0.789484,0.889926,1.118967,1.070309,1.215122,1.537896,1.290354,0.793358,0.650033,1.029073,1.359444,1.006573,0.590202,0.667194,1.088414,0.997486
1.760407,1.894824,1.483142,1.034369,1.081709,1.790644,2.125033,1.471593,1.298005,1.456306,1.351642,1.047932,0.828324,1.003147,1.31257,1.251333,1.233462,1.600956,1.454002,0.937401,0.787986,1.103667,1.428451,1.047476,0.597325,0.685356,1.019091,0.908302
1.579145,1.529822,1.106884,0.753679,0.840604,1.355763,1.655176,1.286504,1.055183,0.971192,0.971957,0.995337,0.925812,1.11778,1.514234,1.44425,1.163542,1.419541,1.421762,1.005451,0.886577,1.10834,1.281997,0.913597,0.546099,0.701394,0.880507,0.749412
1.072122,1.036815,0.781842,0.593147,0.696903,0.899394,1.059063,1.072357,0.92232,0.662533,0.70303,0.917105,0.954636,1.045779,1.448909,1.409839,1.03623,1.121549,1.172267,0.947871,0.882874,1.089631,1.110147,0.715649,0.453433,0.670718,0.737038,0.609926
0.636158,0.713582,0.624844,0.560915,0.665736,0.562026,0.560321,0.821059,0.823287,0.516178,0.485086,0.722849,0.83476,0.799907,1.126776,1.134377,0.905639,0.968175,0.912931,0.814579,0.823006,1.045364,1.066421,0.686006,0.437609,0.590569,0.617019,0.543456
0.44661,0.601516,0.592493,0.592509,0.64509,0.413722,0.378687,0.646753,0.689679,0.426599,0.310587,0.471523,0.635902,0.644293,0.874025,0.947391,0.911515,0.903103,0.674182,0.61124,0.733988,0.901018,0.893024,0.643511,0.432644,0.45124,0.470131,0.517639
0.329274,0.498956,0.532955,0.579397,0.538719,0.341799,0.378801,0.571201,0.524335,0.303395,0.209347,0.293504,0.506418,0.592813,0.659314,0.77325,0.845666,0.786409,0.514513,0.443144,0.58857,0.645366,0.605784,0.522985,0.376548,0.314993,0.377836,0.484776
0.240896,0.35159,0.407472,0.47248,0.370972,0.256552,0.370793,0.49964,0.382838,0.202994,0.143408,0.180571,0.420164,0.516832,0.435515,0.528281,0.609958,0.57623,0.416858,0.336207,0.405532,0.413498,0.402259,0.419448,0.311081,0.249992,0.314772,0.391149
0.202373,0.262963,0.291092,0.317993,0.259636,0.225377,0.325335,0.362603,0.282203,0.196842,0.14817,0.169095,0.389748,0.452085,0.335814,0.323148,0.340067,0.410571,0.385022,0.266056,0.238952,0.241876,0.255583,0.312578,0.279784,0.245304,0.252419,0.261619
0.170322,0.199309,0.205099,0.196194,0.204148,0.237929,0.251133,0.209291,0.212932,0.229815,0.181681,0.227466,0.40627,0.385068,0.279891,0.210799,0.203284,0.351529,0.373778,0.214495,0.142253,0.143329,0.138872,0.221411,0.283008,0.250515,0.222052,0.204902
0.164277,0.150812,0.185118,0.199074,0.208126,0.233943,0.181268,0.120862,0.199355,0.268495,0.226395,0.308138,0.41299,0.321104,0.232092,0.179862,0.190678,0.31238,0.314169,0.175343,0.129501,0.118317,0.088543,0.151064,0.254295,0.222299,0.210408,0.212725
0.177746,0.134364,0.220751,0.291675,0.270541,0.208683,0.138113,0.08841,0.189138,0.28099,0.261493,0.376353,0.389357,0.275765,0.208836,0.160899,0.235247,0.311393,0.263084,0.182373,0.164866,0.124517,0.076002,0.111247,0.192282,0.181583,0.234862,0.230967
0.199933,0.153332,0.268311,0.386352,0.327635,0.168356,0.093801,0.071822,0.172994,0.249154,0.261846,0.397378,0.34361,0.220387,0.184988,0.178107,0.301223,0.359297,0.318393,0.249446,0.201688,0.142208,0.092339,0.092096,0.127953,0.132927,0.254481,0.241171
