-0.000216,-0.000167,-0.00031,-0.00024,-0.000542,-0.000226,-0.000369,9.5e-05,-0.000185,-0.000369,-0.000215,-2e-05,-0.000108,-0.000183,-0.000124,-0.000213,-0.000236,-0.000205,-0.000564,-0.000359,5.9e-05,-0.000168,-0.000451,-0.000196,-0.00025,-0.000283,-0.000105,-0.000203,-0.000158,-0.000255,-0.00023,-0.000404,-0.000722,-0.000536,-0.000437,-0.000409,-0.000472,-0.00035,-0.000301,-0.000462,-0.00106,-0.000405,-0.000555,-0.000442,-0.000322,-0.000776,-0.00054,-0.000457,-0.000469,-0.000442,-0.000554,-0.000714,-0.000496,-0.000306,-0.000494,-0.000637,-0.000462,-0.000359,-0.00044,-0.000486,-0.000526,-0.000874,-0.000705,-0.000422,-0.000417,-0.000518,-0.000814,-0.000976,-0.000418,-0.000415,-0.000492,-0.000969,-0.001086,-0.000575,-0.000443,-0.00054,-0.000492,-0.000438,-0.00034,-0.000139,-0.000114,-0.000857,-0.001235,-0.000753,-0.001019,-0.000804,-0.000447,-0.000568,-0.000451,-0.000416,-0.000767,-0.000617,-0.000694,-0.001445,-0.001186,-0.00086,-0.000738,-0.000966,-0.000549,-0.001422,-0.00099,-0.000823,-0.001057,-0.000978,-0.000551,-0.000254,-0.000521,-0.000657,-0.000521,-0.000914,-0.000635,-0.00075,-0.000499,-0.001317,-0.000781,-0.000619,-0.001169,-0.000781,-0.000566,-0.000341,-0.000607
4.5e-05,-0.000137,7.7e-05,0.00014,0.000346,7e-06,0.000143,0.000106,-8e-06,1e-05,3e-06,-0.000219,4e-06,-0.000142,-0.000109,2.8e-05,-2.8e-05,-0.000168,0.000262,0.000137,7.4e-05,6.9e-05,0.000321,0.000141,8.5e-05,-3.3e-05,-8.4e-05,3.3e-05,1.8e-05,-2.2e-05,-6.8e-05,7e-06,0.000224,-2.2e-05,-9.8e-05,-3.2e-05,0.00027,5.8e-05,7.2e-05,5.5e-05,0.000588,0.000272,8.8e-05,0.000188,-0.000456,0.000192,-8.4e-05,0.000112,-8.2e-05,-0.000173,-0.000131,0.000114,1e-04,-2.5e-05,0.000291,0.000139,0.000244,4.9e-05,4.3e-05,0.000285,5.4e-05,0.000405,0.000326,-1.7e-05,1.9e-05,0.000195,0.000312,0.000346,-6.8e-05,-0.000153,5.5e-05,0.000601,0.000484,0.000171,5.1e-05,0.00017,-9e-06,0.000292,7e-05,-3e-06,8e-06,0.000168,0.000175,6.2e-05,0.000373,0.00028,1e-04,0.000232,0.000156,-0.000161,0.00012,0.000122,0.000251,0.000738,0.000406,0.000168,0.000597,0.000199,6.3e-05,0.000875,0.000447,0.000227,0.000649,0.000583,-0.000171,-0.00021,-0.000186,1.5e-05,-0.000157,0.000539,0.000459,0.000558,4.5e-05,0.000705,0.000287,0.00049,0.000449,0.000836,2e-06,2.3e-05,-3e-05
-9.8e-05,4.7e-05,7e-06,-0.000109,-0.000299,-0.000166,-0.000142,-0.000107,-7.7e-05,-0.000185,-0.000183,0.000118,-4.7e-05,9.1e-05,3e-05,-0.000217,-0.000132,-0.000187,-9.4e-05,-0.000149,-3.2e-05,6.1e-05,-0.000253,-7.3e-05,-8.1e-05,3.4e-05,-1e-04,-0.00021,-0.000108,-4.6e-05,-1.5e-05,0,7e-06,-0.00031,-3.5e-05,-4.6e-05,-0.000125,-0.000154,-0.000148,-1.3e-05,-0.000569,-0.000453,-0.000256,-5.5e-05,0.000294,6.2e-05,0.000235,-0.000134,1.6e-05,-0.000327,-0.000203,0.000138,-1.8e-05,-9.8e-05,-0.000272,-0.000103,-0.000279,-7.4e-05,0.000192,-0.000115,0.000163,-0.000224,-0.000446,-0.000235,1.7e-05,-9.5e-05,-6.4e-05,-3.2e-05,0.000113,0.000234,-0.000198,-0.000584,-0.000313,-0.000289,-2.7e-05,1.3e-05,-2.5e-05,-0.000253,-0.000167,3e-06,7e-05,-0.000199,0.000139,0.000385,-9.8e-05,-0.000152,-9.5e-05,-2.8e-05,-8.1e-05,-6.4e-05,-0.000255,-0.000118,-4.3e-05,-0.000391,-0.000147,0.000118,-0.000569,-1.3e-05,-3.5e-05,-0.000489,-0.00022,-0.000299,-0.000826,-0.000619,0.000102,2e-05,0.000321,0.000255,0.000246,-0.000516,-0.000164,-0.000358,-0.000174,-0.000213,-0.000237,-0.000423,-2.3e-05,-0.000283,-0.000284,-0.000128,-0.000182
-0.000169,-0.000207,-4.2e-05,-0.000138,9.5e-05,0.000126,3.4e-05,-3.8e-05,-0.000206,4e-06,-0.00015,-0.000146,-0.000296,-0.000194,-7.4e-05,3.5e-05,1.5e-05,8.3e-05,2.7e-05,0.000102,4.7e-05,-0.000228,-1.8e-05,8.6e-05,-4.3e-05,-8.3e-05,-9e-05,-0.000177,0.000126,-0.000122,-1.5e-05,0.000265,-0.000269,0.00017,-5.4e-05,-6.4e-05,-1.9e-05,-0.000137,-0.00018,3e-05,0.000281,5.2e-05,0.000131,-0.000239,-0.000285,-0.000156,-0.000208,-0.000222,9e-06,0.00022,0.000188,-0.000259,-0.00014,-0.000138,7.9e-05,-7.7e-05,-2.7e-05,-4e-06,-0.000324,-0.00022,-0.000238,-0.000287,0.000141,0.000135,-0.000131,-0.000391,-0.000183,-0.000323,-0.000126,-0.00043,-9.9e-05,0.000268,0.000256,0.000309,-6.7e-05,-0.000269,9e-05,-7e-05,-0.000114,-0.000155,-0.000215,0.000153,-0.000353,-0.00028,-0.000111,-0.000197,-0.000107,0.00014,-0.000108,-1.7e-05,0.000217,0.000123,-0.00013,0.000117,-0.000144,-0.00011,0.000286,-0.000127,9.4e-05,0.00014,-3.4e-05,-2.6e-05,0.000338,0.000303,0.000114,0.000212,-0.000506,-0.000652,-0.000292,1.3e-05,0.00018,7.3e-05,0.000303,8.1e-05,-9.8e-05,-0.000159,-0.000413,5.7e-05,0.000141,-0.000132,0.000188
-2.5e-05,9.2e-05,7.1e-05,-2.4e-05,-0.000178,-0.000103,-0.000122,0.000112,5.3e-05,-1.2e-05,0.000133,0.000143,0.000166,9.4e-05,6.4e-05,3.5e-05,8.2e-05,0.000145,8.6e-05,-7.6e-05,-4.3e-05,6e-06,3.5e-05,6.8e-05,5.9e-05,6.3e-05,-3.7e-05,0.000212,8.8e-05,0.000242,-8.3e-05,-8.2e-05,4e-06,-2.9e-05,-3.1e-05,6e-05,2.7e-05,7.3e-05,0.000268,-4.9e-05,-2.2e-05,-1e-04,0.000232,0.000203,8.5e-05,5.3e-05,5.9e-05,0.000195,0.000205,-0.000303,-1.1e-05,0.000225,8.8e-05,0.000149,1.3e-05,-3.5e-05,-0.00014,-0.000209,4.8e-05,0.00018,-3.7e-05,0.000179,-9.1e-05,-0.000147,8.6e-05,0.00012,-2.4e-05,0.000337,0.00013,0.000235,0.000308,-9.1e-05,-0.000247,-0.000369,3.1e-05,0.000111,-0.000137,2.4e-05,0.000188,0.000189,1e-05,4.4e-05,0.000377,0.00014,0.000179,5.7e-05,0.000101,-8.3e-05,-0.000183,-4.5e-05,3.7e-05,1.4e-05,2.4e-05,-1.9e-05,0.00016,0.000189,-0.000237,-2.4e-05,-9.4e-05,-0.000218,4.2e-05,0.000103,-2e-04,-9.6e-05,0.000101,0.000109,0.000231,0.000392,4e-04,-3.1e-05,-4.9e-05,-0.000109,-0.00021,0.00017,-7.5e-05,-1.2e-05,0.000497,0.000107,-4.8e-05,0.000119,3.2e-05
6.8e-05,-8e-06,-5.2e-05,0,5.5e-05,6.9e-05,5.4e-05,-0.000131,6e-05,0.00016,8e-06,2.4e-05,7.3e-05,7e-05,5.2e-05,-3.5e-05,3.9e-05,-6.5e-05,1.7e-05,3.5e-05,-1e-06,-8.8e-05,-0.000147,-9.5e-05,-4.3e-05,-3e-05,0.000129,4.5e-05,6.7e-05,-9.6e-05,2.1e-05,6.3e-05,1.8e-05,-7.2e-05,0.000337,-3.3e-05,-7.2e-05,-9.4e-05,-0.000157,0.000178,8.9e-05,2.1e-05,-5.4e-05,-2e-04,5.3e-05,0.00013,-8e-06,-5.9e-05,-0.000191,0.000235,-0.00011,-7.6e-05,-3.4e-05,0.000118,5.5e-05,-0.000105,0.000215,3.2e-05,0.000158,4.3e-05,0.00016,-0.000181,0.000187,0.000213,6.5e-05,0.000134,-0.000105,-0.000408,-0.00027,-1.4e-05,-8.2e-05,0.000133,0.000181,0.000222,-0.000138,-0.000107,0.000175,-0.000107,0,7.9e-05,7e-05,-4.9e-05,-0.000202,-1.8e-05,-6e-06,-0.000143,-0.000283,-5.9e-05,-7.3e-05,6.3e-05,-0.00019,2.4e-05,-5.1e-05,-0.000187,5.9e-05,-0.000136,-3.5e-05,0.000216,-0.000128,0.000261,-6e-05,8.7e-05,0.000261,3.5e-05,-2.9e-05,-0.000335,1.9e-05,-0.000241,-0.00032,4e-05,0.000157,0.000127,0.000133,-0.000121,-1e-06,0.000171,-0.000286,-0.000226,0.000168,-0.000174,-5.5e-05
5.2e-05,3.3e-05,-3.4e-05,4.9e-05,7.6e-05,-1.5e-05,4.8e-05,4.1e-05,5.4e-05,-5.8e-05,-2.1e-05,-0.000107,3.9e-05,-4.4e-05,0.000106,2.8e-05,-5.8e-05,-1.5e-05,-2.3e-05,-2.8e-05,5.4e-05,-4e-06,9.1e-05,7.9e-05,-1.7e-05,-1.4e-05,-0.000132,4.3e-05,-0.000177,5.2e-05,-2.8e-05,7e-06,-6e-05,0.000258,-0.00022,-2.7e-05,6.9e-05,0.000143,1e-04,-4.2e-05,5.5e-05,-3e-06,6.3e-05,7.8e-05,-8.6e-05,-4.2e-05,0.000116,6.7e-05,5.3e-05,-7e-05,7e-05,1e-06,-8.1e-05,-8.1e-05,-8.4e-05,0.000286,-0.000105,-4.5e-05,-0.000253,-1.4e-05,-0.000101,0.000146,-4.8e-05,-0.000148,-0.000104,-9.5e-05,0.000256,0.000407,8.5e-05,-0.000129,-0.00013,-7.2e-05,-4.1e-05,-6.8e-05,1e-04,2.9e-05,-4.3e-05,0.000172,0.000164,-8.2e-05,-4.6e-05,5.9e-05,-7e-06,-1.5e-05,4.6e-05,2.4e-05,0.000163,-1.9e-05,0.000195,5.8e-05,0.000305,-3.6e-05,-3.5e-05,0.000173,-7.5e-05,-1.8e-05,-2.6e-05,-0.00021,0.000117,-0.000161,-3.6e-05,-7.5e-05,-8.5e-05,2.3e-05,5.5e-05,6.3e-05,2e-06,0.000116,7.9e-05,-1.9e-05,-9.2e-05,-0.000149,-0.000106,0.000123,-4.2e-05,-7.7e-05,-3e-06,0.000147,-0.000257,7.4e-05,0.000116
4.3e-05,-5.4e-05,-1.6e-05,-9.2e-05,-7.1e-05,-7e-06,-4.1e-05,-4.6e-05,-6e-06,1.4e-05,-3.4e-05,3.5e-05,-7e-06,6.8e-05,-3.7e-05,-4.1e-05,4.6e-05,-1.8e-05,-2.5e-05,3e-06,-5.2e-05,2.7e-05,-5.2e-05,-0.00013,-9.8e-05,-3.2e-05,5.9e-05,3e-06,5.6e-05,-6e-06,-2.9e-05,-9e-06,1e-06,-0.000172,-6.1e-05,-1.9e-05,-4.7e-05,-0.000148,-0.000167,-8.2e-05,-4.7e-05,0.000131,3.3e-05,-9e-06,0.000125,-7e-05,-0.000119,-0.000127,-0.000166,-5.6e-05,2.8e-05,-4.8e-05,1.3e-05,8.3e-05,-3e-06,-0.000225,-5.2e-05,4.6e-05,0.00025,6.1e-05,0.00012,5e-06,1e-06,2.4e-05,0.000113,0.00015,-0.000176,-0.000107,-2.3e-05,-2e-05,5e-05,4.3e-05,1.5e-05,1.1e-05,-5.2e-05,-5.9e-05,-6.9e-05,-0.000226,-1e-04,2e-06,1.2e-05,-0.000108,6.5e-05,-2.4e-05,6.1e-05,4.6e-05,-8.9e-05,7.7e-05,-0.000126,9.4e-05,-2.2e-05,-0.000111,-1.1e-05,3.3e-05,-0.000103,-4.7e-05,0.000115,0.000162,-0.000167,8.7e-05,0.000122,-0.000185,-1.3e-05,-0.000173,-0.00015,5.6e-05,-7.5e-05,-2.9e-05,2.9e-05,5e-05,7.3e-05,0.000163,0.000105,-8e-06,8.6e-05,-0.000255,8.6e-05,6e-06,0.000117,4.5e-05,-0.000119
-3e-05,-3.9e-05,5e-06,0.000115,7.6e-05,2.3e-05,2.9e-05,0,5e-06,-0.000122,-7e-06,-0.000106,-3.1e-05,-0.000135,-8.7e-05,-4e-05,2e-05,6e-05,7e-06,-6e-06,3.3e-05,9.6e-05,4e-05,7.7e-05,5.2e-05,-3.7e-05,-9e-06,-0.000125,-7.7e-05,5.3e-05,5.1e-05,-4e-05,4.1e-05,6e-06,-2.3e-05,-4.1e-05,-2.3e-05,0.000117,1.1e-05,-3.2e-05,-5.5e-05,-0.000164,-9.3e-05,5.5e-05,-0.000104,-7e-06,6.7e-05,-9e-06,0.000213,5e-05,-2.4e-05,-2.8e-05,-3.6e-05,-2.7e-05,4.8e-05,5.7e-05,4.2e-05,5.7e-05,-8.4e-05,-8.5e-05,-0.000195,-1.4e-05,-9e-06,-8e-05,-5.6e-05,-0.00012,7.6e-05,0.000112,8.6e-05,-1.9e-05,3.1e-05,-0.000171,3.7e-05,3.9e-05,7.7e-05,4.5e-05,1e-06,8.4e-05,5e-06,-5.5e-05,-3.2e-05,-3.3e-05,-7.8e-05,-4e-06,-0.000187,-1.1e-05,8.4e-05,-2.7e-05,5.6e-05,-7.3e-05,-1e-06,0.000165,0.000145,-6.1e-05,9.4e-05,0.000103,2.7e-05,-2e-04,0.000193,-5.5e-05,-0.000181,0.000273,-4.9e-05,8.3e-05,4.9e-05,-0.000144,6.7e-05,-0.000125,-6e-06,-0.000136,-0.000116,-0.000178,-1.3e-05,-2.6e-05,-4e-06,0.000148,8.1e-05,2.5e-05,-0.000133,-8.5e-05,9e-05
7.1e-05,-8e-06,1.3e-05,-0.000107,-7.1e-05,-8.7e-05,-3.8e-05,8e-06,3.6e-05,2.8e-05,1e-06,7.1e-05,4.1e-05,6.1e-05,1.7e-05,6e-06,8.1e-05,-3.3e-05,9e-06,5.1e-05,-2e-06,-4.1e-05,2.6e-05,-1e-06,5e-06,-1e-05,-1.4e-05,4e-06,9.4e-05,1.7e-05,-5.6e-05,0.000116,1.9e-05,2.5e-05,5.3e-05,0.000111,0.00011,-4.9e-05,2.8e-05,0,3.6e-05,-7e-06,0.000133,-4e-05,4e-05,-2e-06,9.3e-05,6.3e-05,-4.5e-05,-3.3e-05,3.1e-05,5.6e-05,-4e-06,-1.3e-05,5e-05,-4.3e-05,-0.000119,-2e-05,3.2e-05,6.1e-05,0.000126,0.000113,-6.2e-05,0.000112,4.9e-05,1e-05,1.5e-05,-0.000167,-3.8e-05,2.7e-05,4.3e-05,9.5e-05,-1.7e-05,-4.6e-05,-6.7e-05,2.7e-05,-9.9e-05,-4.7e-05,-2.7e-05,0.000142,-3.3e-05,-8.2e-05,1.5e-05,3e-06,4.1e-05,4.8e-05,-5e-06,-1.6e-05,-1e-06,-0.000101,1.5e-05,-0.000124,-8.4e-05,7.4e-05,-3.2e-05,-8.2e-05,1.6e-05,0.000178,-9.1e-05,9.2e-05,0.000113,-0.000102,1.4e-05,-1.9e-05,-4.3e-05,8.4e-05,-3e-06,0.000155,0.000102,8.2e-05,-6.8e-05,0.000138,-2.6e-05,-1.1e-05,-5.4e-05,-0.000151,4.2e-05,-1.6e-05,4.2e-05,-6.2e-05,1.4e-05
-8.1e-05,-1.2e-05,-6e-06,7.6e-05,2.3e-05,-1.9e-05,3e-05,5.5e-05,3e-05,1.7e-05,-6e-06,-2.2e-05,1e-05,1.7e-05,1.2e-05,1.3e-05,1e-06,4e-06,-8e-06,-1.4e-05,-5.1e-05,-2.1e-05,2.8e-05,1.9e-05,-1.5e-05,3.2e-05,4.7e-05,-2.4e-05,-7e-06,2.3e-05,1.3e-05,-1.7e-05,-4.1e-05,-4.8e-05,-2.4e-05,-5.8e-05,-5.1e-05,-3.4e-05,-4e-05,2e-06,0,-1e-06,-0.000143,-5.9e-05,-9e-05,-4.4e-05,-2.4e-05,1.7e-05,9e-06,0.000103,4e-06,3e-06,3e-06,-2.7e-05,3.9e-05,0.000113,3.3e-05,-5.6e-05,5.4e-05,-2e-05,-2.6e-05,8e-06,6e-06,-6.9e-05,-5.2e-05,3.4e-05,-0.000106,7.1e-05,-4.1e-05,-2.4e-05,-2e-06,1e-05,-1.5e-05,2.4e-05,1e-04,-3.2e-05,4.3e-05,4.6e-05,-1e-06,-2.5e-05,1.3e-05,-6.2e-05,-5.7e-05,0.000113,6e-06,9e-06,8e-06,6.7e-05,3.3e-05,5.6e-05,-8e-06,1.6e-05,9.8e-05,-2.1e-05,-5.5e-05,0.000113,-8e-06,-9e-05,-3.4e-05,-0.000194,-7.8e-05,7.1e-05,1e-05,-4e-06,5.6e-05,-2e-06,-4.1e-05,4.3e-05,-3.7e-05,8.6e-05,1.6e-05,-5.9e-05,2.1e-05,2.7e-05,-3e-06,3.9e-05,-1e-06,-3.2e-05,-2.5e-05,2.7e-05,3.3e-05
4e-06,4.4e-05,1.1e-05,2e-06,3e-06,2e-06,-6e-06,9e-06,-3.5e-05,-1.8e-05,4e-05,6e-06,-3.2e-05,-1e-05,2.9e-05,2.4e-05,-4.4e-05,-2.6e-05,4e-06,-2.8e-05,2.3e-05,-2e-06,-2.2e-05,2.5e-05,2.1e-05,1.1e-05,-1.1e-05,1e-05,2.9e-05,-3.1e-05,-6.9e-05,1.3e-05,2.2e-05,-2.2e-05,-3.6e-05,5.5e-05,2e-06,2.4e-05,3e-05,7e-06,-1e-06,7e-05,0.000154,3.5e-05,-2.8e-05,1e-05,2.8e-05,-3e-05,3.8e-05,-8.5e-05,-7.9e-05,2.7e-05,7e-06,-1e-06,7e-06,-6.2e-05,-4.1e-05,4.5e-05,5.6e-05,-1.6e-05,1.3e-05,-9.4e-05,-5.4e-05,5.1e-05,3.8e-05,6.4e-05,0.000102,-7.4e-05,1.9e-05,5.4e-05,2.4e-05,-1.6e-05,0,-4e-05,-0.000122,1.7e-05,0,-9.9e-05,-3.4e-05,4.3e-05,3.3e-05,5.4e-05,1.4e-05,-6.1e-05,-6.1e-05,-3.4e-05,-2e-06,-4.3e-05,-3.1e-05,-9.8e-05,-6.5e-05,5.5e-05,-5.3e-05,-1.4e-05,6.5e-05,-0.000143,-3.9e-05,0.000104,5.6e-05,0.000135,3.9e-05,3e-05,-2.3e-05,4.7e-05,-1e-06,-4.9e-05,5e-05,-2e-05,1.3e-05,-0.000122,4.7e-05,0.000125,-0.000104,3.1e-05,6.4e-05,-1.8e-05,-1e-06,2.5e-05,2.8e-05,4e-06,-5.6e-05
-2e-06,9e-06,-2.6e-05,-3.4e-05,-9e-06,3e-06,1.8e-05,-5.9e-05,1.2e-05,5e-06,-3.7e-05,-2e-05,-2e-06,3e-05,-4.1e-05,-4.9e-05,2.1e-05,0,-2.7e-05,-4e-06,-2.9e-05,1.5e-05,-2.7e-05,5e-06,-3.7e-05,-1.1e-05,-8e-06,-3e-05,-4.2e-05,2e-06,4.9e-05,-1.4e-05,1.3e-05,5e-06,6.2e-05,-4.3e-05,-2e-05,-1.2e-05,-1e-06,-7e-06,-1.6e-05,-3.3e-05,-0.000102,-9e-06,-2.6e-05,1e-05,-6e-06,1.5e-05,-9.4e-05,2.9e-05,5.3e-05,-1e-05,-1.9e-05,-2.2e-05,-5e-06,1.9e-05,7.8e-05,1.1e-05,-6.4e-05,1.4e-05,-2e-05,0.00011,3.8e-05,-5.1e-05,-5.8e-05,-3.5e-05,-5.2e-05,2.7e-05,-1.5e-05,-3.3e-05,-1.2e-05,1e-06,-4.5e-05,-1.8e-05,5.4e-05,-1.7e-05,-5e-06,4.6e-05,-2.1e-05,-3e-06,-2.9e-05,1.1e-05,-1e-06,8e-06,0.000103,-1.2e-05,-1.3e-05,3.8e-05,3e-06,7e-06,1.9e-05,-6.5e-05,2.7e-05,1e-05,-3.4e-05,9.1e-05,5.7e-05,-5e-06,-2e-05,-7.3e-05,-1e-05,-1.6e-05,-1.5e-05,-3.6e-05,-3.5e-05,5.1e-05,4e-06,2.5e-05,-1.5e-05,6.1e-05,-3.7e-05,-4.2e-05,7e-06,-5.8e-05,-2.1e-05,4.4e-05,-2.9e-05,-4.1e-05,2.4e-05,0.000115,7e-06
-2e-05,3e-06,9e-06,6e-06,-2e-06,4.2e-05,2e-06,5e-05,-1e-05,2.2e-05,-2e-06,0,-2.2e-05,-2e-06,1e-05,4.6e-05,-2e-06,-3e-06,2.1e-05,1.3e-05,-1.6e-05,9e-06,-2e-05,-3e-06,1.4e-05,7e-06,-1e-05,1.5e-05,-1e-05,-2.1e-05,1.5e-05,-6.3e-05,1.8e-05,-7e-06,-5e-06,2.4e-05,1.8e-05,3e-06,1.3e-05,-3.1e-05,2e-06,2.2e-05,9e-06,-9e-06,4e-05,-1.8e-05,-5.3e-05,3.6e-05,1.6e-05,-3.7e-05,-3.7e-05,-1.2e-05,-2.9e-05,-1.6e-05,-5e-06,-4e-05,-4.7e-05,1.6e-05,-2.8e-05,1.6e-05,1.2e-05,-3.3e-05,-1.2e-05,2e-06,2.9e-05,-7e-06,-3e-06,0,-3.5e-05,2.1e-05,1.4e-05,-2.1e-05,7.4e-05,7e-06,-2.3e-05,1e-06,2.3e-05,-4e-05,9e-06,-7e-06,-1.9e-05,3.1e-05,8e-06,-7e-06,-4e-05,1e-06,6e-06,-2.4e-05,-1.9e-05,4.4e-05,-2.8e-05,1.1e-05,5e-06,-4.4e-05,4.3e-05,-1.8e-05,-1.4e-05,-3.8e-05,2.3e-05,3.9e-05,2.3e-05,5.7e-05,-2.4e-05,8e-06,0,-5.7e-05,-3.3e-05,-2.6e-05,7e-06,-4.6e-05,2.5e-05,1.9e-05,-1e-06,4.3e-05,-2.1e-05,9e-06,7.4e-05,-2.2e-05,-7.5e-05,-3.3e-05,-1.6e-05
2e-05,-1e-06,-9e-06,0,1e-05,5e-06,1e-05,-3e-05,3e-06,1e-05,-7e-06,-8e-06,2e-06,-8e-06,-2e-06,-2e-05,-1.1e-05,5e-06,-2e-06,5e-06,1.8e-05,-3e-06,1.1e-05,-1.2e-05,-1.3e-05,1.2e-05,-7e-06,5e-06,-2.6e-05,4e-06,-2.6e-05,2.7e-05,3e-06,1.4e-05,-4.4e-05,-2.8e-05,6e-06,2.2e-05,-2.4e-05,4.2e-05,-1.3e-05,-1e-06,0,9e-06,1e-06,3e-05,2.4e-05,-7e-06,2.8e-05,2.5e-05,6e-06,-5e-06,3.1e-05,1.8e-05,-2.6e-05,4.3e-05,-1.4e-05,2.4e-05,2.3e-05,-1e-05,-1.1e-05,2.1e-05,1.4e-05,-7e-06,0,-3e-06,2e-05,2.8e-05,2.7e-05,-3.4e-05,2.4e-05,6.4e-05,-1.4e-05,-2.8e-05,1e-06,0,-1.2e-05,-8e-06,9e-06,-3.3e-05,-2e-06,-2e-06,2.6e-05,2e-05,2.3e-05,8e-06,-4e-06,-4e-06,1.6e-05,-1.1e-05,3.9e-05,1.6e-05,3.4e-05,-4e-06,-6.8e-05,-2.2e-05,4e-06,2e-06,-2.6e-05,-3e-06,-1.8e-05,-9.5e-05,3.1e-05,-1.8e-05,-3.1e-05,4.5e-05,4e-06,-4e-05,-3.8e-05,1.3e-05,3.9e-05,-1.9e-05,-3e-06,-1.7e-05,1.5e-05,3.4e-05,1e-06,1.2e-05,5.5e-05,1.8e-05,3.1e-05
-5e-06,-1e-05,1.2e-05,1.8e-05,-1e-05,-4e-06,-2e-06,6e-06,-1.3e-05,-3e-06,-6e-06,1e-06,-5e-06,4e-06,1.1e-05,-6e-06,2e-06,-1.3e-05,1e-06,-4e-06,-1.6e-05,-1.1e-05,-5e-06,-6e-06,-4e-06,-4e-06,1e-06,-1e-06,5e-06,-2e-06,1e-05,4e-06,2e-05,-4e-06,8e-06,1.1e-05,-1e-05,-2.5e-05,3e-06,-2.5e-05,1.3e-05,5e-06,-3e-06,1e-06,4e-06,-3.2e-05,-2e-05,1.3e-05,-1.8e-05,1.8e-05,4e-06,-9e-06,1.5e-05,-2.1e-05,9e-06,5e-06,2.6e-05,-1.9e-05,-2.2e-05,1.8e-05,1.5e-05,-2.1e-05,8e-06,-1.4e-05,-2.1e-05,2.4e-05,-1e-05,-6.1e-05,-1.4e-05,8e-06,-5e-06,-4.4e-05,-2.6e-05,2e-05,-1e-06,4e-06,2e-05,8e-06,-2e-06,6e-06,0,-2.3e-05,-1.5e-05,-2e-06,-2e-05,3e-06,5e-06,-2.1e-05,-1e-06,1.3e-05,9e-06,-9e-06,-1.4e-05,1.2e-05,3.4e-05,4e-05,-1e-05,-4.6e-05,-1e-06,-3.3e-05,1.8e-05,6.6e-05,-1.8e-05,-6e-06,1.9e-05,-1.2e-05,4e-05,3.3e-05,5e-06,6e-06,-4.6e-05,7e-06,1e-05,3.2e-05,1.8e-05,-7.6e-05,5e-06,1e-05,-3.4e-05,3e-06,-1.2e-05
-1e-05,-6e-06,3e-06,-9e-06,1.1e-05,-4e-06,-5e-06,5e-06,2e-06,7e-06,1e-06,9e-06,0,-3e-06,-5e-06,5e-06,-1e-06,-5e-06,-4e-06,1e-06,2e-06,-4e-06,-5e-06,-4e-06,0,-3e-06,4e-06,9e-06,1.2e-05,-3e-06,-5e-06,1e-05,-3e-06,2e-06,-4e-06,-3e-06,-9e-06,9e-06,-1e-06,1.6e-05,-1e-06,1.8e-05,-5e-06,-7e-06,-1.1e-05,3e-06,-7e-06,8e-06,1.4e-05,-3.4e-05,-2.4e-05,-2e-06,-1e-05,1.8e-05,2e-06,2e-05,-3e-06,5e-06,1.2e-05,1.3e-05,-1.4e-05,3e-06,1e-06,5e-06,2.3e-05,-3.2e-05,0,4.8e-05,2.1e-05,-1.5e-05,-3e-06,1.9e-05,7e-06,-7e-06,1.2e-05,-2e-06,-1.1e-05,-1.1e-05,-1e-06,-4e-06,5e-06,6e-06,1.8e-05,-9e-06,0,-1.9e-05,2e-06,1.8e-05,7e-06,1.3e-05,-7e-06,-3e-06,-1e-06,3e-06,-6e-06,-2.7e-05,-1.9e-05,4.4e-05,0,3.7e-05,-7e-06,-1.4e-05,3e-06,-1e-06,-3e-06,2e-06,-1.5e-05,1.7e-05,-1.9e-05,-1.1e-05,2.2e-05,4e-06,-1e-05,-1.9e-05,-8e-06,7e-05,-2e-06,-2e-06,-6e-06,8e-06,4e-06
1.5e-05,-7e-06,3e-06,-1e-05,-3e-06,3e-06,3e-06,-5e-06,-6e-06,-1.9e-05,2e-06,-3e-06,6e-06,-2e-06,-2e-06,-5e-06,-8e-06,-1e-06,3e-06,1e-06,9e-06,4e-06,-4e-06,-4e-06,1e-06,2e-06,-6e-06,-3e-06,3e-06,5e-06,1.1e-05,-3e-06,1e-05,9e-06,-9e-06,1e-05,5e-06,6e-06,-1e-05,-1.3e-05,0,5e-06,1e-06,4e-06,7e-06,-7e-06,1.9e-05,-4e-06,-5e-06,3.3e-05,1.4e-05,0,-1.6e-05,-3e-06,3e-06,-3e-05,-1.8e-05,3e-06,-5e-06,-1.6e-05,1e-06,-5e-06,1e-06,5e-06,-1.5e-05,-1e-06,4e-06,-1.6e-05,-2e-06,9e-06,7e-06,6e-06,4e-06,-5e-06,-2.1e-05,-1e-06,-9e-06,1.7e-05,1.1e-05,-4e-06,-7e-06,-9e-06,-1.5e-05,3e-06,-1.2e-05,1.1e-05,7e-06,-1.2e-05,-3e-06,8e-06,1.2e-05,3e-06,-1e-06,-8e-06,-2.8e-05,7e-06,2.2e-05,-2e-05,-1.6e-05,-2.6e-05,-5e-06,-8e-06,-6e-06,1.2e-05,1.2e-05,-2e-06,6e-06,-2.6e-05,0,-4e-06,-1.4e-05,-1.3e-05,1.3e-05,-1e-05,5e-06,-2.9e-05,-1.1e-05,-1.1e-05,1.1e-05,6e-06,-9e-06
-1e-06,1e-06,-5e-06,1.9e-05,-1e-06,-4e-06,2e-06,1e-06,-1e-06,1.3e-05,1e-06,0,0,0,1e-05,-1e-06,-1.1e-05,-4e-06,-1e-06,-3e-06,-1.4e-05,1.1e-05,-4e-06,8e-06,-4e-06,0,5e-06,0,1.6e-05,-9e-06,-1e-06,-8e-06,-6e-06,-4e-06,-2e-06,0,0,-9e-06,2e-06,7e-06,-3e-06,-7e-06,1.3e-05,0,0,-8e-06,-1.4e-05,3e-06,-1.3e-05,-1.6e-05,-4e-06,1.4e-05,2e-06,2e-06,0,2.7e-05,-7e-06,1.2e-05,-7e-06,0,7e-06,1.3e-05,-4e-06,0,6e-06,1e-05,-1.1e-05,2e-05,-8e-06,-3e-06,-1e-05,1e-06,3e-06,1e-05,2e-05,0,1e-06,-1.2e-05,-1e-06,5e-06,6e-06,-1e-05,8e-06,-8e-06,2e-06,3e-06,-1.8e-05,1e-05,8e-06,3e-06,9e-06,1.1e-05,0,2e-06,3.5e-05,-5e-06,1.3e-05,9e-06,1e-05,2.5e-05,8e-06,2e-06,2.1e-05,-1.1e-05,-4e-06,7e-06,-8e-06,7e-06,-1.3e-05,7e-06,-8e-06,3e-06,-7e-06,-9e-06,1e-05,4e-06,-6e-06,-1.1e-05,-6e-06,-6e-06,-1e-06
4e-06,-1e-06,0,-1.4e-05,2e-06,-1e-06,1e-06,1e-06,-5e-06,-9e-06,2e-06,-2e-06,-4e-06,0,-1e-06,1e-05,5e-06,-2e-06,2e-06,-1e-06,1.6e-05,-3e-06,-5e-06,-3e-06,3e-06,5e-06,-2e-06,-1e-05,-1.3e-05,8e-06,-4e-06,-1e-06,1.4e-05,2e-06,0,-7e-06,0,8e-06,-1e-06,6e-06,5e-06,8e-06,-1.7e-05,-1e-06,-7e-06,6e-06,2e-06,-2e-06,6e-06,2e-06,2e-06,-5e-06,-2e-06,6e-06,-7e-06,-6e-06,1e-06,8e-06,-1e-06,3e-06,-9e-06,-1.8e-05,-4e-06,-2e-06,-3e-06,-6e-06,5e-06,-1.1e-05,-1e-06,4e-06,-1.3e-05,5e-06,6e-06,-9e-06,-8e-06,-2e-06,-9e-06,1e-06,-5e-06,-2e-06,-2e-06,0,-1.3e-05,6e-06,-7e-06,-1.3e-05,2e-05,-4e-06,-2e-06,-7e-06,-9e-06,-8e-06,-1.1e-05,-5e-06,-2e-05,3e-06,-6e-06,2e-06,2.3e-05,-2.4e-05,-8e-06,4e-06,-2e-06,2.1e-05,1e-06,-6e-06,1e-05,2e-06,1e-05,9e-06,4e-06,-2e-06,2e-05,1.1e-05,-6e-06,1e-06,0,1.1e-05,1e-06,4e-06,-6e-06
1e-06,7e-06,-3e-06,1.1e-05,-5e-06,-4e-06,-1e-06,-2e-06,1e-06,-4e-06,-1e-06,1e-06,2e-06,0,-1e-06,-1e-05,-6e-06,6e-06,-3e-06,3e-06,-1.2e-05,-6e-06,3e-06,2e-06,-8e-06,1e-06,0,1e-06,2e-06,-5e-06,7e-06,0,-6e-06,-1e-06,2.3e-05,7e-06,0,-4e-06,8e-06,-1.2e-05,-1e-06,9e-06,1.8e-05,-8e-06,3e-06,2e-06,4e-06,-5e-06,-8e-06,7e-06,-2e-06,6e-06,-3e-06,-8e-06,-2e-06,9e-06,6e-06,-5e-06,1e-06,-5e-06,1.5e-05,2e-06,-6e-06,5e-06,6e-06,5e-06,1e-06,4e-06,1e-06,2e-06,8e-06,-9e-06,-1.2e-05,6e-06,2e-06,1e-06,8e-06,4e-06,0,0,-2e-06,-2e-06,2e-06,-8e-06,-4e-06,1.5e-05,-1.9e-05,-5e-06,4e-06,-4e-06,6e-06,-7e-06,9e-06,4e-06,1.3e-05,2e-06,-8e-06,3e-06,-3e-05,1.9e-05,0,-1.3e-05,-1.6e-05,-2e-05,-1e-05,4e-06,-1e-06,-1e-05,0,-2.3e-05,-9e-06,9e-06,-1.5e-05,0,2e-06,-6e-06,0,4e-06,-4e-06,-6e-06,2e-06
2e-06,3e-06,2e-06,-1e-05,7e-06,0,-1e-06,0,0,6e-06,-2e-06,-2e-06,5e-06,-1e-06,-6e-06,4e-06,2e-06,1e-06,1e-06,3e-06,5e-06,-3e-06,-2e-06,-2e-06,0,2e-06,1e-06,-5e-06,-1.3e-05,9e-06,-1e-05,-2e-06,6e-06,-4e-06,-1.3e-05,-1.3e-05,2e-06,0,-7e-06,3e-06,-1e-06,-7e-06,-7e-06,4e-06,-1.3e-05,-1e-06,-9e-06,1.1e-05,7e-06,-1.1e-05,8e-06,-1e-05,1e-06,6e-06,-3e-06,-1.4e-05,-1.4e-05,-9e-06,2e-06,-3e-06,-1.8e-05,1e-06,-3e-06,-1.4e-05,-5e-06,-1e-06,-6e-06,-1.6e-05,1e-06,-4e-06,-1.1e-05,-1e-06,1e-06,1e-06,-1e-06,-2e-06,2e-06,-7e-06,-3e-06,-1e-05,-1e-06,7e-06,9e-06,5e-06,1.7e-05,-9e-06,8e-06,5e-06,0,-1.1e-05,-5e-06,1.1e-05,-1.2e-05,2e-06,-6e-06,3e-06,-6e-06,-3e-06,2e-05,-1.4e-05,2e-06,5e-06,1.7e-05,7e-06,-5e-06,5e-06,-9e-06,2e-06,5e-06,1.7e-05,1.6e-05,-1.1e-05,1.4e-05,-3e-06,6e-06,1.8e-05,-1.1e-05,-2e-06,4e-06,1.4e-05,0
0,-1e-06,1e-06,3e-06,-4e-06,3e-06,1e-06,3e-06,3e-06,5e-06,0,0,-1e-06,2e-06,3e-06,-1e-06,4e-06,-1e-06,-2e-06,0,-2e-06,4e-06,1e-06,-6e-06,1e-06,0,-4e-06,0,6e-06,-5e-06,6e-06,3e-06,-4e-06,1e-06,-4e-06,7e-06,0,1e-06,2e-06,-4e-06,-1e-06,9e-06,2e-06,1e-06,7e-06,5e-06,1.1e-05,-7e-06,7e-06,1.5e-05,-9e-06,3e-06,-1e-06,-9e-06,0,1.2e-05,7e-06,4e-06,-7e-06,3e-06,1.1e-05,-7e-06,2e-06,1.3e-05,0,-3e-06,6e-06,1.6e-05,7e-06,0,-3e-06,7e-06,3e-06,-4e-06,7e-06,2e-06,0,0,-2e-06,1e-06,-1e-06,6e-06,-8e-06,3e-06,-4e-06,-2e-06,-2e-06,-3e-06,6e-06,-3e-06,-7e-06,-6e-06,0,3e-06,5e-06,-6e-06,2e-06,-9e-06,-9e-06,1.1e-05,0,-1.6e-05,-9e-06,-8e-06,-2e-06,-1e-05,7e-06,-7e-06,0,-4e-06,-4e-06,2e-06,-1.7e-05,-1e-06,1e-06,-1.3e-05,-4e-06,-3e-06,-3e-06,1e-05,4e-06
2e-06,-1e-06,3e-06,3e-06,0,3e-06,1e-06,-4e-06,1e-06,1e-06,-2e-06,0,-3e-06,-3e-06,2e-06,-1e-06,-1e-06,1e-06,1e-06,-3e-06,1e-06,1e-06,1e-06,2e-06,-2e-06,1e-06,1e-06,1e-06,-1e-06,9e-06,-1e-06,4e-06,6e-06,-2e-06,7e-06,-8e-06,-2e-06,0,-3e-06,6e-06,-2e-06,-5e-06,-1e-06,-1e-06,-1.3e-05,-2e-06,0,-1e-06,-4e-06,-1.3e-05,5e-06,-3e-06,0,0,5e-06,-5e-06,0,6e-06,7e-06,-1e-06,-2e-06,-7e-06,0,-1.5e-05,1e-06,0,-2e-06,-6e-06,-1.1e-05,-1e-06,1e-06,7e-06,-4e-06,2e-06,-1.2e-05,0,3e-06,1e-06,-2e-06,1e-06,5e-06,1e-06,1.3e-05,1e-06,5e-06,7e-06,0,3e-06,1e-06,2e-06,-1e-06,-4e-06,-6e-06,-2e-06,4e-06,5e-06,7e-06,4e-06,-2e-06,-1.1e-05,2e-06,1.8e-05,4e-06,-2e-06,4e-06,5e-06,0,1e-06,3e-06,-4e-06,5e-06,-1e-05,2e-06,1e-06,-3e-06,1e-06,-8e-06,-4e-06,0,-5e-06,0
-3e-06,-1e-06,-1e-06,-4e-06,1e-06,2e-06,-2e-06,2e-06,4e-06,3e-06,1e-06,0,2e-06,2e-06,1e-06,0,3e-06,-2e-06,0,-1e-06,-5e-06,3e-06,-1e-06,1e-06,-2e-06,-1e-06,0,0,8e-06,-6e-06,3e-06,-1e-06,-4e-06,-2e-06,-5e-06,8e-06,-1e-06,-4e-06,3e-06,-5e-06,-1e-06,1e-06,0,1e-06,9e-06,-3e-06,1e-06,6e-06,0,6e-06,2e-06,2e-06,-1e-06,0,1e-06,1.1e-05,-8e-06,2e-06,1e-06,2e-06,-2e-06,5e-06,3e-06,1.3e-05,-4e-06,0,-1e-06,1e-06,5e-06,3e-06,-6e-06,-1.2e-05,3e-06,-5e-06,8e-06,-3e-06,-1e-06,-5e-06,-1e-06,6e-06,-3e-06,0,-2e-06,-3e-06,-4e-06,-9e-06,-3e-06,-3e-06,1e-06,-3e-06,-2e-06,7e-06,-2e-06,0,-1.4e-05,-5e-06,3e-06,-4e-06,9e-06,1.2e-05,2e-06,-1.4e-05,-3e-06,-1e-06,4e-06,3e-06,-3e-06,9e-06,2e-06,8e-06,3e-06,1.2e-05,-5e-06,4e-06,6e-06,1e-05,2e-06,5e-06,-3e-06,0,1e-06
-1e-06,-2e-06,-1e-06,2e-06,-3e-06,0,0,0,2e-06,2e-06,0,-1e-06,2e-06,-1e-06,-5e-06,-2e-06,0,-3e-06,-1e-06,1e-06,6e-06,-4e-06,-1e-06,-1e-06,0,-1e-06,1e-06,2e-06,0,7e-06,1e-06,0,4e-06,2e-06,-3e-06,-4e-06,2e-06,8e-06,-9e-06,5e-06,3e-06,4e-06,0,0,-7e-06,1e-06,6e-06,-2e-06,-2e-06,0,-7e-06,1e-06,0,-4e-06,0,-1.2e-05,2e-06,2e-06,-3e-06,0,0,-2e-06,3e-06,-7e-06,3e-06,3e-06,3e-06,-5e-06,-2e-06,-3e-06,0,1.3e-05,2e-06,1e-06,-2e-06,2e-06,0,6e-06,1e-06,-4e-06,-1e-06,-5e-06,3e-06,-5e-06,-1e-06,5e-06,5e-06,-1e-06,-1e-06,6e-06,-1e-06,-2e-06,-2e-06,2e-06,1.1e-05,3e-06,-3e-06,5e-06,-1.2e-05,-7e-06,-3e-06,0,-4e-06,1e-05,4e-06,-8e-06,3e-06,-1e-06,1e-06,-8e-06,-8e-06,-8e-06,-2e-06,-3e-06,0,-3e-06,-2e-06,2e-06,-1e-06,1e-06,-1e-06
2e-06,-2e-06,-1e-06,-5e-06,3e-06,-1e-06,-1e-06,1e-06,2e-06,-4e-06,-1e-06,2e-06,-2e-06,0,2e-06,2e-06,2e-06,-2e-06,0,1e-06,-5e-06,-1e-06,1e-06,5e-06,-1e-06,2e-06,1e-06,1e-06,0,-7e-06,-5e-06,-3e-06,-3e-06,-1e-06,-4e-06,2e-06,1e-06,-1e-05,5e-06,-4e-06,-1e-06,1e-06,-3e-06,-1e-06,6e-06,-4e-06,-5e-06,-4e-06,-2e-06,-1e-06,8e-06,1e-06,-3e-06,4e-06,0,3e-06,-1e-06,-1.1e-05,1e-06,-2e-06,3e-06,-1e-06,2e-06,2e-06,-1e-06,-4e-06,-2e-06,1e-06,-1e-06,4e-06,-2e-06,-6e-06,-5e-06,-1e-06,-4e-06,-1e-06,-2e-06,-5e-06,3e-06,9e-06,-1e-06,-4e-06,-1e-06,1e-06,-4e-06,1e-06,-6e-06,4e-06,2e-06,4e-06,2e-06,-3e-06,0,-1e-06,-1e-06,-2e-06,-4e-06,0,1.1e-05,-3e-06,2e-06,8e-06,5e-06,-1e-05,-1e-06,9e-06,-1e-06,-7e-06,4e-06,2e-06,4e-06,4e-06,3e-06,-1e-06,-3e-06,-4e-06,5e-06,-4e-06,2e-06,-4e-06,1e-06
-5e-06,1e-06,0,3e-06,-1e-06,-1e-06,0,-3e-06,2e-06,3e-06,0,-2e-06,-1e-06,1e-06,1e-06,0,0,-1e-06,0,0,3e-06,-2e-06,-1e-06,-2e-06,-1e-06,0,-1e-06,2e-06,-4e-06,5e-06,6e-06,0,2e-06,1e-06,8e-06,-3e-06,-1e-06,6e-06,-1e-06,6e-06,0,-6e-06,4e-06,-2e-06,-5e-06,1e-06,2e-06,3e-06,6e-06,4e-06,-6e-06,2e-06,0,-2e-06,-2e-06,-3e-06,1e-06,0,-2e-06,2e-06,-1e-06,-1e-06,0,0,2e-06,0,0,-1e-06,-1e-06,-4e-06,1e-06,5e-06,2e-06,-2e-06,3e-06,1e-06,-2e-06,-1e-06,0,-3e-06,1e-06,-1e-06,1e-06,2e-06,1e-06,-4e-06,5e-06,-2e-06,2e-06,2e-06,1e-06,4e-06,0,-2e-06,-6e-06,3e-06,-2e-06,5e-06,-9e-06,9e-06,-1e-06,-8e-06,-2e-06,1.1e-05,-2e-06,-6e-06,1e-06,8e-06,0,4e-06,-7e-06,-6e-06,-1e-06,-1e-06,2e-06,3e-06,-3e-06,-2e-06,-2e-06,7e-06,-1e-06
1e-06,1e-06,0,3e-06,0,-1e-06,-1e-06,3e-06,0,-6e-06,-1e-06,1e-06,0,0,1e-06,0,2e-06,-2e-06,1e-06,0,1e-06,5e-06,1e-06,-1e-06,-1e-06,1e-06,-1e-06,-2e-06,-4e-06,-5e-06,-1e-06,2e-06,-3e-06,1e-06,2e-06,0,-1e-06,-2e-06,-1e-06,-3e-06,0,6e-06,-5e-06,2e-06,2e-06,2e-06,0,-3e-06,-2e-06,-7e-06,0,-2e-06,1e-06,3e-06,0,8e-06,-7e-06,4e-06,2e-06,-1e-06,-1e-06,0,0,-3e-06,-2e-06,5e-06,0,7e-06,3e-06,4e-06,0,-3e-06,-1e-06,2e-06,1e-06,-2e-06,1e-06,1e-06,1e-06,0,1e-06,-1e-06,-2e-06,1e-06,-2e-06,5e-06,-2e-06,3e-06,1e-06,4e-06,2e-06,1e-06,0,0,3e-06,-2e-06,4e-06,-4e-06,3e-06,-1e-05,-1e-06,6e-06,1e-06,-8e-06,-4e-06,2e-06,-3e-06,-2e-06,1e-06,-1e-06,0,6e-06,1e-06,3e-06,2e-06,-1e-06,0,1e-06,0,-5e-06,0
0,1e-06,2e-06,-7e-06,0,0,0,-2e-06,1e-06,-1e-06,0,-1e-06,2e-06,0,0,0,1e-06,-1e-06,0,0,-4e-06,1e-06,-1e-06,0,0,0,1e-06,0,1e-06,4e-06,1e-06,0,1e-06,-1e-06,-7e-06,0,0,1e-06,0,-2e-06,1e-06,-1e-06,3e-06,0,-2e-06,-1e-06,-4e-06,1e-06,1e-06,6e-06,1e-06,0,0,1e-06,0,-9e-06,1e-06,1e-06,-2e-06,-1e-06,-1e-06,2e-06,-2e-06,1e-06,1e-06,-2e-06,0,-1e-06,-1e-06,-5e-06,0,-6e-06,1e-06,-3e-06,-4e-06,1e-06,1e-06,1e-06,1e-06,-4e-06,-2e-06,2e-06,-3e-06,1e-06,2e-06,-5e-06,1e-06,-2e-06,-2e-06,-1e-06,2e-06,-4e-06,-1e-06,0,-2e-06,-1e-06,4e-06,-1e-06,4e-06,1.2e-05,0,-4e-06,-1e-06,1e-06,-1e-06,1e-06,2e-06,-2e-06,-2e-06,-5e-06,3e-06,-1e-06,3e-06,1e-06,-1e-06,3e-06,0,2e-06,0,-3e-06,-1e-06
-1e-06,1e-06,0,4e-06,-1e-06,0,0,-1e-06,-1e-06,1e-06,0,1e-06,-2e-06,0,-3e-06,-1e-06,-2e-06,1e-06,-1e-06,-1e-06,6e-06,0,-1e-06,-1e-06,-1e-06,1e-06,-1e-06,-1e-06,0,-4e-06,1e-06,0,-2e-06,1e-06,4e-06,-1e-06,0,-1e-06,1e-06,3e-06,1e-06,-3e-06,-1e-06,-1e-06,0,1e-06,3e-06,-1e-06,2e-06,-4e-06,-2e-06,-3e-06,-2e-06,0,0,3e-06,4e-06,1e-06,2e-06,1e-06,3e-06,1e-06,-1e-06,-2e-06,-1e-06,0,0,-4e-06,0,4e-06,4e-06,8e-06,2e-06,1e-06,4e-06,0,1e-06,-3e-06,0,3e-06,0,2e-06,5e-06,-1e-06,2e-06,1e-06,2e-06,-1e-06,2e-06,-1e-06,0,1e-06,3e-06,-1e-06,2e-06,1e-06,-2e-06,1e-06,-6e-06,-1.4e-05,0,5e-06,3e-06,-3e-06,1e-06,-2e-06,1e-06,4e-06,-1e-06,6e-06,-3e-06,0,0,-2e-06,0,-3e-06,4e-06,0,-1e-06,1e-06,0
2e-06,-1e-06,0,-3e-06,1e-06,0,0,3e-06,-1e-06,2e-06,0,-1e-06,-1e-06,0,3e-06,1e-06,2e-06,-1e-06,1e-06,-1e-06,-6e-06,-3e-06,-1e-06,0,-2e-06,0,0,-1e-06,6e-06,2e-06,-1e-06,0,1e-06,0,4e-06,4e-06,0,2e-06,-2e-06,-5e-06,0,3e-06,0,0,-2e-06,1e-06,-2e-06,-2e-06,-5e-06,3e-06,-1e-06,2e-06,0,1e-06,2e-06,-4e-06,-6e-06,-6e-06,-2e-06,-1e-06,-2e-06,-2e-06,-1e-06,0,0,1e-06,1e-06,2e-06,-3e-06,-3e-06,1e-06,-5e-06,-4e-06,1e-06,-1e-06,0,2e-06,2e-06,-1e-06,-2e-06,1e-06,1e-06,-3e-06,0,0,2e-06,-2e-06,2e-06,1e-06,-3e-06,1e-06,2e-06,-1e-06,1e-06,-2e-06,0,-3e-06,-4e-06,3e-06,1.4e-05,-1e-06,0,0,0,3e-06,0,-4e-06,-2e-06,-2e-06,-2e-06,4e-06,-1e-06,5e-06,-2e-06,1e-06,1e-06,4e-06,-3e-06,1e-06,3e-06,0
-2e-06,0,-1e-06,4e-06,0,1e-06,-1e-06,-3e-06,-2e-06,0,0,1e-06,2e-06,0,-2e-06,1e-06,-2e-06,0,0,1e-06,4e-06,1e-06,-1e-06,1e-06,0,0,0,0,-1e-06,-1e-06,2e-06,-1e-06,-2e-06,-1e-06,-5e-06,-3e-06,0,-3e-06,0,4e-06,-1e-06,-1e-06,1e-06,1e-06,-1e-06,-1e-06,-1e-06,1e-06,0,0,2e-06,-1e-06,0,-1e-06,0,6e-06,1e-06,-3e-06,-1e-06,-1e-06,1e-06,2e-06,-1e-06,0,2e-06,0,0,0,3e-06,2e-06,1e-06,2e-06,-1e-06,-2e-06,-3e-06,0,0,-1e-06,0,1e-06,1e-06,1e-06,5e-06,-1e-06,2e-06,-4e-06,2e-06,-1e-06,1e-06,-3e-06,0,-2e-06,3e-06,-1e-06,-1e-06,0,-2e-06,3e-06,0,-1e-05,1e-06,-2e-06,-1e-06,-2e-06,2e-06,0,2e-06,-1e-06,0,-3e-06,0,0,-2e-06,1e-06,-1e-06,3e-06,3e-06,1e-06,-1e-06,-3e-06,0
1e-06,0,0,-3e-06,0,1e-06,0,1e-06,-1e-06,4e-06,0,0,1e-06,0,1e-06,-2e-06,-1e-06,0,0,1e-06,-2e-06,-1e-06,-1e-06,0,-1e-06,0,-1e-06,0,3e-06,0,-1e-06,0,0,0,-3e-06,4e-06,0,3e-06,-1e-06,-4e-06,0,-3e-06,-1e-06,-1e-06,-1e-06,0,1e-06,1e-06,2e-06,-3e-06,-2e-06,2e-06,0,0,-1e-06,-5e-06,2e-06,2e-06,2e-06,1e-06,0,2e-06,1e-06,0,-1e-06,-1e-06,1e-06,1e-06,0,-2e-06,4e-06,-1e-06,2e-06,2e-06,4e-06,0,-1e-06,-1e-06,-1e-06,-1e-06,0,-1e-06,1e-06,-1e-06,0,3e-06,-2e-06,2e-06,-1e-06,0,-1e-06,-1e-06,0,0,5e-06,0,2e-06,-1e-06,-4e-06,7e-06,0,4e-06,1e-06,3e-06,0,0,0,2e-06,-2e-06,5e-06,0,3e-06,2e-06,2e-06,0,-1e-06,1e-06,3e-06,-1e-06,3e-06,0
1e-06,-1e-06,0,-2e-06,0,0,-1e-06,0,-2e-06,1e-06,0,-1e-06,-1e-06,0,-1e-06,2e-06,0,-1e-06,0,0,1e-06,2e-06,0,0,-1e-06,0,1e-06,1e-06,-5e-06,1e-06,1e-06,0,-1e-06,-1e-06,1e-06,-3e-06,0,-2e-06,-1e-06,2e-06,0,2e-06,1e-06,-1e-06,-1e-06,-1e-06,-2e-06,-2e-06,-2e-06,4e-06,0,0,-1e-06,-1e-06,0,2e-06,0,3e-06,-2e-06,0,-3e-06,1e-06,1e-06,-1e-06,1e-06,-2e-06,0,-1e-06,-1e-06,1e-06,-1e-06,2e-06,-1e-06,-1e-06,-1e-06,1e-06,0,1e-06,0,0,-2e-06,-1e-06,1e-06,1e-06,-1e-06,-2e-06,1e-06,-1e-06,-1e-06,-1e-06,-1e-06,2e-06,1e-06,1e-06,-4e-06,0,4e-06,3e-06,6e-06,-5e-06,0,0,0,-1e-06,-1e-06,1e-06,0,-1e-06,-1e-06,-4e-06,-1e-06,-1e-06,-4e-06,-1e-06,0,-1e-06,0,0,1e-06,-3e-06,0
-1e-06,0,1e-06,4e-06,-1e-06,0,0,1e-06,-1e-06,-2e-06,0,1e-06,-1e-06,0,1e-06,-1e-06,-1e-06,-1e-06,0,0,-1e-06,-1e-06,-1e-06,1e-06,0,1e-06,-1e-06,-1e-06,-1e-06,-1e-06,1e-06,1e-06,0,0,4e-06,2e-06,0,0,1e-06,-1e-06,1e-06,1e-06,-1e-06,1e-06,0,-1e-06,1e-06,1e-06,3e-06,-5e-06,2e-06,0,0,0,-1e-06,-4e-06,-4e-06,0,1e-06,-1e-06,3e-06,1e-06,0,1e-06,-1e-06,2e-06,0,1e-06,-1e-06,-1e-06,0,-1e-06,2e-06,-1e-06,-2e-06,0,-1e-06,-1e-06,0,-1e-06,0,-1e-06,1e-06,0,-1e-06,-1e-06,0,0,0,1e-06,-1e-06,0,1e-06,0,1e-06,0,0,0,-3e-06,4e-06,1e-06,-3e-06,-1e-06,2e-06,-2e-06,0,-1e-06,-2e-06,0,1e-06,-1e-06,1e-06,0,-2e-06,0,2e-06,1e-06,-2e-06,-1e-06,-2e-06,0
1e-06,1e-06,1e-06,-2e-06,1e-06,0,0,-1e-06,-1e-06,1e-06,0,-1e-06,2e-06,0,0,0,0,-1e-06,0,0,2e-06,0,0,-1e-06,0,0,0,1e-06,-2e-06,3e-06,-1e-06,1e-06,-1e-06,0,-3e-06,-2e-06,0,1e-06,-2e-06,2e-06,0,-3e-06,1e-06,0,-1e-06,1e-06,0,0,-1e-06,4e-06,-3e-06,0,-1e-06,-1e-06,0,5e-06,-1e-06,-2e-06,-1e-06,1e-06,-1e-06,0,1e-06,-3e-06,0,0,0,-5e-06,2e-06,-1e-06,2e-06,0,-1e-06,1e-06,3e-06,0,-1e-06,1e-06,0,-2e-06,0,-1e-06,-1e-06,1e-06,0,2e-06,1e-06,1e-06,1e-06,2e-06,-1e-06,-2e-06,0,0,1e-06,0,-2e-06,0,1e-06,-2e-06,-1e-06,4e-06,0,-1e-06,-1e-06,-1e-06,-1e-06,2e-06,0,2e-06,0,-3e-06,-3e-06,0,-1e-06,-1e-06,1e-06,-2e-06,0,3e-06,0
0,0,0,2e-06,0,-1e-06,0,0,0,-3e-06,0,1e-06,0,0,-1e-06,1e-06,-1e-06,0,0,0,-2e-06,-2e-06,0,0,-1e-06,0,0,0,1e-06,-2e-06,2e-06,0,0,0,-3e-06,1e-06,0,-2e-06,0,-1e-06,-1e-06,2e-06,-1e-06,-1e-06,1e-06,0,-1e-06,0,-2e-06,-2e-06,1e-06,-1e-06,0,0,0,-4e-06,3e-06,-4e-06,1e-06,0,-1e-06,0,1e-06,2e-06,0,-1e-06,0,6e-06,-2e-06,0,-1e-06,-3e-06,-2e-06,-1e-06,0,0,0,0,0,1e-06,0,0,0,-1e-06,0,-2e-06,-2e-06,-1e-06,-1e-06,2e-06,0,1e-06,1e-06,0,-2e-06,-1e-06,-2e-06,0,2e-06,-2e-06,0,-3e-06,0,-1e-06,1e-06,1e-06,3e-06,-1e-06,0,-2e-06,-2e-06,3e-06,0,1e-06,0,3e-06,1e-06,1e-06,0,0,0
0,0,-1e-06,-3e-06,0,0,0,0,0,-2e-06,0,-1e-06,-1e-06,0,-1e-06,-1e-06,1e-06,-1e-06,0,0,2e-06,2e-06,0,1e-06,0,0,-1e-06,0,3e-06,3e-06,-1e-06,0,0,0,6e-06,1e-06,0,1e-06,2e-06,1e-06,0,0,1e-06,0,-2e-06,0,1e-06,0,2e-06,0,0,0,-1e-06,0,0,2e-06,-4e-06,0,0,0,-1e-06,0,0,-2e-06,1e-06,2e-06,-1e-06,-2e-06,1e-06,-1e-06,0,2e-06,3e-06,0,-3e-06,0,0,-1e-06,1e-06,-1e-06,0,1e-06,-2e-06,0,1e-06,1e-06,3e-06,2e-06,-1e-06,2e-06,0,1e-06,-1e-06,0,2e-06,1e-06,0,-2e-06,-3e-06,4e-06,0,2e-06,-1e-06,0,2e-06,1e-06,-2e-06,-1e-06,0,-1e-06,1e-06,-1e-06,-1e-06,1e-06,0,-4e-06,-1e-06,2e-06,0,-3e-06,0
0,0,-1e-06,0,0,0,0,-1e-06,0,0,0,0,0,0,0,0,0,-1e-06,0,0,0,1e-06,0,-1e-06,-1e-06,0,1e-06,0,1e-06,-3e-06,1e-06,0,0,0,0,-1e-06,0,-2e-06,-2e-06,1e-06,0,-2e-06,-1e-06,1e-06,2e-06,1e-06,-1e-06,0,-2e-06,1e-06,-1e-06,0,0,0,1e-06,-3e-06,-2e-06,4e-06,0,1e-06,2e-06,-1e-06,0,1e-06,1e-06,0,1e-06,1e-06,-1e-06,1e-06,1e-06,0,-1e-06,0,4e-06,0,1e-06,0,-1e-06,1e-06,0,1e-06,0,0,0,-1e-06,-3e-06,-1e-06,0,0,0,-2e-06,0,0,-1e-06,-1e-06,3e-06,0,3e-06,-5e-06,-1e-06,-2e-06,1e-06,-3e-06,2e-06,-2e-06,0,2e-06,1e-06,3e-06,1e-06,1e-06,0,-1e-06,0,2e-06,-2e-06,-1e-06,0,3e-06,0
-1e-06,0,0,3e-06,0,0,0,1e-06,2e-06,0,0,0,1e-06,0,2e-06,1e-06,0,0,0,0,-1e-06,1e-06,0,0,-1e-06,0,0,0,2e-06,3e-06,1e-06,0,0,0,-4e-06,2e-06,0,2e-06,0,-2e-06,1e-06,0,0,-1e-06,-3e-06,0,0,0,1e-06,-2e-06,0,1e-06,-1e-06,1e-06,0,5e-06,3e-06,2e-06,1e-06,0,0,-1e-06,-1e-06,-1e-06,0,-1e-06,0,-3e-06,2e-06,-2e-06,-1e-06,-4e-06,0,-1e-06,-3e-06,0,1e-06,0,0,-1e-06,0,0,0,0,0,-1e-06,2e-06,-1e-06,0,-1e-06,0,1e-06,0,0,1e-06,0,1e-06,-1e-06,-2e-06,7e-06,0,0,0,1e-06,0,1e-06,2e-06,-2e-06,0,-1e-06,-1e-06,-3e-06,2e-06,-1e-06,0,0,-2e-06,-2e-06,-1e-06,-3e-06,0
-1e-06,0,0,-3e-06,0,0,1e-06,0,1e-06,0,0,0,0,0,-2e-06,-1e-06,2e-06,-1e-06,0,0,3e-06,-2e-06,0,1e-06,-1e-06,0,0,0,-3e-06,-3e-06,-1e-06,0,0,0,0,-2e-06,0,-2e-06,0,3e-06,0,1e-06,1e-06,0,2e-06,-1e-06,1e-06,1e-06,2e-06,2e-06,0,0,0,0,-1e-06,-3e-06,-1e-06,-1e-06,-1e-06,0,-1e-06,0,-1e-06,0,0,0,0,5e-06,-1e-06,2e-06,-2e-06,5e-06,1e-06,0,-1e-06,0,0,0,0,2e-06,0,0,1e-06,0,0,1e-06,-1e-06,1e-06,-1e-06,-1e-06,0,1e-06,-2e-06,0,0,0,-2e-06,1e-06,0,-1e-05,1e-06,3e-06,-1e-06,1e-06,-1e-06,0,-1e-06,0,1e-06,-2e-06,0,2e-06,0,0,0,-1e-06,-1e-06,1e-06,1e-06,0,0
