-0.000205,0.000175,-0.00107,-0.000722,-0.000275,-5.8e-05,2.2e-05,-0.000886,-5e-04,-3e-06,0.000157,0.000184,-0.000702,-0.000803,-0.000334,-8.1e-05,-0.000875,-0.000576,-0.00022,-0.000131,-0.000119,-0.000135,-0.000698,-0.002819,-0.002728,-0.017246,-0.01931,-0.011721,-0.008167,-0.004969,-0.002412,-0.00134,-0.002881,-0.009333,-0.005568,-0.001959,-0.001852,-0.001049,0.000611,-0.005778,-0.002807,0.006877,-0.013888,-0.008909,-0.009877,-0.008321,-0.014994,-0.009491,-0.017238,-0.015183,-0.020486,-0.010624,-0.005439,-0.00993,-0.017072,-0.010789,-0.013844,-0.012642,-0.008814,-0.009032,-0.016858,-0.011893,-0.014623,-0.016943,-0.015094,-0.008646,-0.002703,-0.006149,-0.006618,-0.011206,-0.008455,-0.008185,-0.00943,-0.010383,-0.005272,-0.003168,-0.003999,-0.003439,-0.007574,-0.006072,-0.003801,-0.002706,-0.002725,-0.003819,-0.00293,-0.003494,-0.001903,-0.000179,-0.000283,0.000392,0.000747,0.000836,0.000802,-0.001972,-0.001154,-0.000438,-0.000549,0.00022,8.2e-05,-7e-06,-0.000277,-0.0034,-0.004103,-0.001976,-0.000514,-7.1e-05,-0.00031,-0.000219,3.1e-05,6.8e-05,0.000109,-2e-06,-0.000107,-7.2e-05,-0.000196,-0.000564,-0.000285,-0.000151,3.4e-05,-0.000226,1.5e-05
0.000205,-7.7e-05,0.00031,0.000362,0.000142,8e-06,-1.7e-05,0.000437,0.00033,0.000324,0.000114,0.000183,0.000219,0.000452,0.000349,-0.000247,0.000292,0.000114,-0.000115,-0.000172,-0.000212,-0.000116,-0.000101,-0.000117,0.000319,0.010363,0.006026,0.00287,0.003745,0.003309,0.000943,0.000754,0.001399,-0.000555,-0.000177,0.002049,0.002547,0.001425,0.000645,6e-06,-0.007707,-0.014871,-0.009389,-0.0126,-0.00665,-0.001411,-0.008592,0.000819,0.014194,0.006586,-0.000344,0.002035,2.9e-05,-0.005292,-0.000866,-0.001819,-0.000853,-0.004776,-0.011023,-0.007627,-0.00333,-0.001967,0.001653,-0.00338,0.004182,-0.001837,-0.004678,-0.00266,0.000845,-0.002524,0.001421,0.000331,-0.000634,-0.000877,0.000619,-0.001,-0.002445,-0.002645,-0.000737,-0.00143,-0.001446,-0.000911,-0.003015,-0.002601,-0.00057,-0.000588,-0.000496,0.000461,0.000425,0.000109,-0.003784,-0.000534,0.000467,0.000164,-0.000288,-0.000221,-0.000149,7e-04,0.000638,0.000204,0.000396,0.000162,0.000817,0.000525,-6.6e-05,-0.000181,2.2e-05,-1.8e-05,5.5e-05,-7.6e-05,-2.2e-05,3.3e-05,3e-06,-9.9e-05,-0.000158,0.000154,0.00018,6.6e-05,-7.6e-05,0.000121,9e-06
-5.9e-05,0.000155,-0.000202,-0.000222,-0.000155,-4e-06,-0.000124,-0.000174,-0.000401,-3.2e-05,-3e-05,-1.9e-05,-0.000303,-0.000281,-8.6e-05,8e-05,-0.000338,-0.000128,5.5e-05,6e-06,-2.6e-05,9.8e-05,0.000126,-0.000713,-0.000477,-0.00888,-0.0046,-0.004939,-0.001136,-0.001131,-0.000624,-0.000452,0.001315,-0.000625,0.000156,-0.001203,-0.002204,-0.001223,-0.000946,-0.00133,-0.005908,-0.000595,-0.002832,0.005893,0.001259,-0.001887,-0.005471,0.000419,-0.006487,-0.006066,0.00064,0.004386,0.00107,-0.001638,-0.008252,-0.002173,-0.001987,-0.003314,-0.001884,0.001014,4.6e-05,0.002544,-0.006117,-0.00292,-0.005942,-0.004704,0.003292,0.000705,-0.006022,-0.000519,-0.001849,-0.001222,-0.006364,-0.004783,-0.001995,-0.003403,0.000883,-0.00042,-0.000977,0.000707,0.000207,0.001043,0.000773,0.002867,-0.000352,-0.000651,-0.000555,-0.000506,-0.000348,-0.000411,2.5e-05,-0.000977,-7.7e-05,-0.001146,-0.000121,-0.00034,-0.003219,-0.001396,-0.000332,9.6e-05,-0.000122,0.000833,0.000543,0.000331,-3.8e-05,-0.000212,-3.2e-05,8.9e-05,0.000112,1.1e-05,-5.2e-05,-0.000157,-9.9e-05,3.7e-05,6.2e-05,-0.000205,-5.6e-05,-0.00017,-5e-05,-2.7e-05,-9.2e-05
-0.000109,-5e-06,0.000281,0.000239,-6.8e-05,-4.2e-05,-2.4e-05,0.000113,0.000125,0.000115,9.4e-05,3.3e-05,-0.000138,0.000267,0.000127,-1e-06,0.000196,0.00015,-0.000217,-0.000231,-0.000107,-6.6e-05,-0.00022,0.000369,0.00032,0.004668,-0.001872,0.002797,-0.000197,0.000897,0.000474,0.001146,-0.002632,-0.00267,0.00032,-0.002058,-0.001135,0.001563,0.000838,0.00103,0.00185,0.001178,-0.003168,-0.005507,-0.00372,0.001988,-0.004083,0.003807,0.008891,-0.001704,0.001388,-0.000321,-0.001558,0.004342,0.001419,-0.00061,6e-04,-0.000678,0.002419,0.001685,0.000411,0.000186,0.000736,0.001632,0.004156,0.002897,0.00278,-0.002076,0.002755,0.001514,0.001573,0.000784,0.002786,0.001643,0.00154,0.001457,-0.002672,0.000274,0.000106,0.000223,0.001151,0.000441,-0.000602,-0.000131,0.000477,-0.001208,-0.000907,-0.000648,-0.000445,-0.00049,0.00093,0.000335,0.000335,0.000489,-0.000472,-0.000838,0.000146,-0.000136,-0.000172,0.000144,1e-04,0.000162,-0.000882,-0.000441,0.000154,7e-06,7.3e-05,-0.000149,-6.8e-05,-5.5e-05,-8.9e-05,-2e-06,-5.9e-05,-0.000185,-0.000137,-2e-05,-6.5e-05,-1.9e-05,-0.000105,0.000134,4e-05
-7.2e-05,3.6e-05,5.3e-05,-0.000132,-5.6e-05,-1.8e-05,0,0,-0.000189,-8.4e-05,-5e-06,1.9e-05,2.1e-05,-0.00019,-1.7e-05,0.00012,-0.00016,5.3e-05,0.00021,0.000226,0.000123,0.000139,0.000144,0.000786,0.000379,0.000979,0.003731,-0.003789,0.000246,0.000434,0.000683,-0.000385,0.000433,0.003003,-9e-05,-0.000186,0.001031,-0.001302,-0.000605,0.000205,-0.00253,-0.008928,0.001417,0.00136,0.002562,-0.001283,0.003658,0.004575,-0.006357,-0.010678,-0.004893,0.003715,0.002125,-0.003734,-0.00083,-0.004395,-0.004662,0.004904,0.003748,0.004928,0.001496,0.003305,0.000963,0.000678,-0.002278,0.000614,-0.001434,-0.000342,-0.003206,-0.002984,-0.003347,0.003505,0.000672,-0.001872,-0.00214,-0.000312,-0.001993,0.000856,0.000677,7.4e-05,-0.001986,-0.001013,-0.000939,-0.000246,0.00077,0.000585,0.000889,-0.000772,-0.000254,0.00033,-0.00032,1.4e-05,-5e-05,-0.000479,-5.5e-05,0.000441,0.00016,-0.000313,-1.4e-05,0.000175,8e-05,-0.000222,0.000723,0.000383,1.4e-05,6.6e-05,-7.7e-05,-1.9e-05,7.4e-05,-6.6e-05,4.1e-05,0.000165,0.000151,9.8e-05,0.000144,8.2e-05,0.000155,1.6e-05,-4.3e-05,-3.4e-05,-0.000161
-1e-06,1.5e-05,0,0.000139,0.000146,1.4e-05,2.1e-05,7.4e-05,0.000105,6e-05,-7.1e-05,1.3e-05,-1.4e-05,0.000184,1.8e-05,-5.2e-05,0.000103,-6.2e-05,-6.1e-05,4.4e-05,5.2e-05,-5.7e-05,-2.2e-05,-0.000121,-0.000183,-0.001799,-0.002965,0.000351,-0.000455,0.000131,-0.000678,0.000356,0.000233,-0.000743,0.001022,4e-06,-0.001022,-0.000445,0.000764,-0.000718,0.002831,0.000713,0.002497,0.001278,-0.003209,-0.004384,0.000565,-0.002244,0.000562,-0.000429,-0.003595,-0.003226,-0.005829,0.003135,0.004884,0.004011,-1e-04,-0.004898,-0.002848,-0.002224,-0.00363,-0.006672,-0.001662,-0.00216,-0.000609,-0.001083,-0.0015,-0.001044,-1.3e-05,0.00319,0.002682,-0.003733,0.000423,0.003584,0.002633,0.000193,0.000517,0.002738,0.000744,-0.000407,-0.00141,-0.001157,0.001424,0.001112,-0.000146,0.00079,0.000267,0.000352,-0.000131,0.000357,-0.000286,9e-05,-0.000494,0.000164,-0.000541,-9.6e-05,-0.00015,-0.000298,-0.000363,-0.000251,3.1e-05,-7.1e-05,4.3e-05,-6.8e-05,-8.1e-05,-9.9e-05,8.8e-05,2e-06,-4.2e-05,-4.1e-05,1.5e-05,-1e-05,-4.7e-05,-2e-06,-2e-05,6.8e-05,-3.8e-05,-2.3e-05,7.3e-05,7.3e-05,3.3e-05
-0.000174,-0.000181,-0.000155,-6e-06,-9.6e-05,-0.000136,-7e-06,-4.3e-05,-7.8e-05,-0.000151,-0.000126,-1.1e-05,-0.000184,-0.000101,-9e-05,-5.9e-05,4.6e-05,-5.5e-05,-9.8e-05,-8.2e-05,-4.4e-05,-3.3e-05,-5.9e-05,-6.4e-05,-0.000273,0.000556,0.002218,0.000206,-0.001038,-0.001084,2e-04,-0.000485,-0.000363,0.000423,0.001367,-0.000202,-0.001426,-0.001522,-0.00093,0.000429,-0.001759,0.00179,0.000391,-0.001005,-0.001703,-0.000641,0.002733,0.00462,-0.002113,-0.002729,0.003073,-0.001547,-0.002485,0.002123,-0.004587,-0.005951,-0.000349,0.003727,0.001027,-0.003563,0.003,0.003414,0.001812,0.001112,0.000593,-0.0011,0.00063,-0.000346,0.000432,-0.002311,-0.000889,0.000576,-0.001868,-0.000909,-0.001176,0.000423,0.001006,-0.002104,0.000273,8.1e-05,0.001673,0.000483,-0.000277,-0.001287,0.000348,-0.000152,0.000694,0.000473,-7.1e-05,-0.000282,-0.000586,-0.000373,-0.000567,-2.8e-05,0.000463,-0.000246,-0.000327,-0.000806,-0.000612,-7e-05,-5e-06,-0.000185,-8.8e-05,-5.3e-05,-1.7e-05,-9.5e-05,-8.1e-05,-3.3e-05,-0.000102,-4.7e-05,-5.1e-05,-2.4e-05,2.4e-05,1.1e-05,-0.000188,-3.8e-05,-7.7e-05,1.1e-05,-7.2e-05,-3.4e-05,-5.6e-05
-6e-06,-5.9e-05,-0.000103,-0.000119,-1.7e-05,2.8e-05,3.2e-05,-4.3e-05,1.6e-05,-2.5e-05,-7.9e-05,-6.2e-05,-2.1e-05,-2.2e-05,-2.8e-05,-0.000113,-0.000134,3.9e-05,7.8e-05,1.2e-05,5.9e-05,2.7e-05,0.000168,0.000209,7.8e-05,-0.000339,-0.00248,-0.001975,0.00108,0.00154,-0.000131,-0.000276,-0.000451,-0.000346,-0.000945,5.5e-05,-0.001503,0.000285,-0.00031,4.7e-05,-0.000106,0.000748,0.001046,0.001433,-0.001359,0.00159,0.002141,0.000594,-0.002028,-9.3e-05,-0.005219,0.002275,0.001346,0.00126,0.002572,0.005397,-0.002125,0.000299,-0.001945,8.7e-05,0.001543,0.000867,0.000352,0.000571,0.000416,0.000884,-0.001204,7e-05,0.001332,4.5e-05,0.00072,0.000317,0.00069,0.00014,-0.000183,0.001403,0.000144,0.002211,0.000292,-0.001565,-0.001813,0.00045,0.00025,-0.000146,-0.001565,-0.000403,-0.000854,-5.9e-05,-5e-06,0.000327,-0.000237,-0.000152,-0.000479,0.000305,0.000317,0.000477,-0.000399,0.000632,0.000246,1e-06,-0.000149,3.6e-05,9.3e-05,0.000281,0.000114,0.000192,-3e-05,-6.5e-05,-5e-06,-6.9e-05,-0.000119,-4.8e-05,-0.000137,-9.5e-05,4.5e-05,3e-06,3.4e-05,-0.000135,-9.5e-05,-3.8e-05,-9e-06
2.6e-05,-4.1e-05,-4.6e-05,0.000131,1.5e-05,1e-05,2e-06,-3.6e-05,-7e-05,-5e-06,-6.7e-05,-1.6e-05,-3.2e-05,-0.000205,-7.8e-05,-2.5e-05,2.1e-05,-2.8e-05,2e-05,-3.1e-05,-0.000105,-1.4e-05,-6.6e-05,-0.000141,0.000508,2.2e-05,0.00183,0.001747,-0.001915,-0.001381,8.2e-05,3.3e-05,-9.9e-05,-9e-06,-0.000965,-0.000946,-0.000143,-7.3e-05,-8.4e-05,3.5e-05,-0.000395,0.000665,-0.007089,-0.000858,0.00467,0.002453,-0.00256,-0.001283,0.001181,0.001015,0.004993,0.003494,-0.0016,0.002443,-0.00081,-0.001604,-7.4e-05,-0.00096,0.001473,0.000454,-0.002255,-0.001369,-0.000467,-0.000162,-0.000158,-0.000301,-0.002104,-0.000255,0.001574,0.000465,-0.000216,0.001059,0.002355,-0.00084,-0.000753,-0.001471,-0.000939,-0.001326,-0.001497,0.001003,0.000581,-0.000155,8.2e-05,-0.000125,-0.000508,0.000163,4e-05,-0.000287,-0.000297,-0.00013,9.1e-05,4e-05,0.000293,2.2e-05,-0.00063,-4.8e-05,0.000327,0.000219,-0.000223,-0.000113,-5.7e-05,-7e-06,-0.000189,-0.000301,-0.00023,-7e-06,4e-05,1.5e-05,-8.1e-05,3e-06,-3.3e-05,-8.3e-05,5.9e-05,9e-06,-3.1e-05,-1.2e-05,0,5.6e-05,-5.2e-05,-5e-05,-1.3e-05
-8.4e-05,-2e-06,-2.8e-05,7.1e-05,2.3e-05,-1.6e-05,2.6e-05,-8e-06,7.6e-05,6.8e-05,1.6e-05,-4e-05,6e-06,4.4e-05,9.2e-05,-2e-06,-2.7e-05,-3.1e-05,6.7e-05,4.1e-05,3.1e-05,3.8e-05,5.1e-05,-5e-05,-0.000567,0.000158,-0.002259,-0.00116,0.000899,0.000358,-0.00011,0.000387,-1e-04,0.000126,-0.000809,-2.9e-05,0.000751,9.3e-05,0.000406,-0.000362,0.00068,-0.000958,-0.000159,0.001687,-0.000145,-0.00225,-0.001324,-0.005061,-0.000651,0.000873,-0.001281,-0.002114,0.000397,-0.000739,0.000376,-0.001273,0.001704,0.000937,0.001774,0.000361,0.000434,-0.000628,0.000172,-0.002131,-0.00172,-0.000666,0.00013,-0.000384,-0.001301,-0.000199,0.000547,-0.001878,-0.002409,0.000225,0.000382,0.001255,-0.000673,-0.001486,0.000225,-0.000654,0.000222,-0.000425,-4.5e-05,0.000221,0.000468,0.000385,-0.000284,-0.000161,0.000161,0.000236,1.4e-05,-3e-05,-5.9e-05,-5e-06,-0.000216,-0.000436,4.1e-05,-0.000394,-0.000263,-0.000104,-0.000128,-3.6e-05,2.1e-05,8.3e-05,0.000132,7.2e-05,7.2e-05,3e-05,6.7e-05,-5e-06,8e-06,-8e-06,4e-05,1.7e-05,2.2e-05,2.4e-05,2.2e-05,6.1e-05,5.4e-05,-1.5e-05,-5.6e-05
8.9e-05,4.9e-05,-4e-06,2e-05,-1.2e-05,3.8e-05,6e-06,3e-06,-1.2e-05,2e-05,-1e-06,-1.3e-05,3.8e-05,-4e-05,-5.9e-05,-7.8e-05,5.7e-05,0.000147,-8e-05,-2.9e-05,5e-05,-2.9e-05,-8.1e-05,1.3e-05,-1e-06,-2.1e-05,0.001498,-6.3e-05,-0.001203,-0.000464,-0.000219,-0.000204,-0.000384,5.3e-05,0.000693,-0.000199,0.000134,-0.000263,-0.000603,-0.000377,-0.000365,-0.000405,0.006604,-0.000581,-0.003019,0.001493,-0.000592,0.000502,0.000723,0.000393,-0.000321,-0.000489,-0.000611,0.00016,-0.00129,0.000815,-0.001604,0.002237,-0.001562,-0.000535,-0.000975,-4.6e-05,0.001288,0.000916,0.000187,0.000117,-0.00015,-5.9e-05,-0.000135,-0.000134,-0.000824,0.001611,0.000827,-0.000293,0.000429,-0.000789,4e-04,5.8e-05,-0.000285,0.000254,0.000535,0.001362,-0.000613,-0.000223,-8e-05,6.3e-05,0.000275,2.8e-05,-4.2e-05,-7.2e-05,-2.6e-05,5.8e-05,-0.00022,0.000212,-0.000152,-0.000133,3.8e-05,0.000136,-9.4e-05,-0.000171,1.5e-05,-2.2e-05,6.9e-05,-7e-05,-2.8e-05,-3.2e-05,-1e-06,4.8e-05,7.1e-05,9e-06,1.2e-05,-7e-06,3e-06,6e-06,1.9e-05,2.6e-05,-4e-05,-4.6e-05,-2.8e-05,-1.1e-05,-2e-05
-7.4e-05,-3.2e-05,1.8e-05,-4.2e-05,-2.3e-05,-2.9e-05,-2.6e-05,2e-05,1e-05,-3.1e-05,1.2e-05,-5e-06,-6e-06,-1.2e-05,-2.5e-05,5e-06,0,-3.1e-05,2e-05,-2.6e-05,-3.4e-05,-1.6e-05,8e-06,-2.5e-05,0.000113,2e-05,-0.000583,0.001001,0.000512,2.9e-05,-3.7e-05,4.4e-05,4.6e-05,-8e-05,0.000315,0.000158,-0.000168,-1.9e-05,0.000111,-0.00043,4.3e-05,0.00076,-0.000622,-0.001533,0.001576,-0.000759,0.000649,0.000137,-0.002677,0.000253,-0.001087,-0.000337,-0.000252,-0.001083,0.000877,-0.000476,0.001602,-0.000808,0.000234,-6.2e-05,0.00185,0.00084,-0.001008,-0.000517,0.000338,0.000333,0.004223,0.000941,-0.000631,0.000824,0.000748,-0.000832,-0.000827,0.000277,0.000136,0.000708,0.000125,0.000151,-0.000485,-4e-05,0.000118,-0.000944,-5.9e-05,0.000218,0.000199,6e-05,-0.000194,0.000293,8.5e-05,-0.000118,4.5e-05,-3.3e-05,0.000138,3e-05,0.00013,2.5e-05,0.000151,6.9e-05,-3.6e-05,-3e-05,-0.000134,-5.8e-05,-2.8e-05,6.6e-05,4.7e-05,2.7e-05,-4.8e-05,-1.5e-05,-2e-06,2.9e-05,9e-06,-8e-06,2.5e-05,1e-05,-6e-06,-5.7e-05,1.6e-05,4.8e-05,1.3e-05,1.9e-05,-4e-06
6.9e-05,1.4e-05,-2.6e-05,-6.4e-05,-6.1e-05,-2e-06,-2.5e-05,-1e-06,-2e-06,1e-06,-3.5e-05,1.2e-05,-2e-06,3e-06,-6.8e-05,2.6e-05,-4.2e-05,3e-06,-2.5e-05,1.2e-05,7e-06,9e-06,3.5e-05,-1.4e-05,5.5e-05,0.000201,9.4e-05,-0.000393,-0.000246,-0.00011,-0.000147,-0.000231,-0.000107,0.000185,0.000315,0.000316,2.4e-05,0.000234,-0.000314,9.7e-05,0.000152,7.7e-05,-0.000314,-0.001414,-0.000833,0.001312,-0.000368,0.000876,0.001547,0.000567,0.000599,-0.00166,-0.000485,-0.000529,0.000354,0.000152,-0.001448,0.000377,-0.000667,-8.4e-05,0.000856,-0.000365,-0.000626,0.001085,-0.000128,0.000269,-0.002341,0.000554,0.000342,-0.000578,-0.000389,0.000361,0.000664,-0.00053,-0.000268,-0.000483,0.000115,-8.3e-05,0.000141,-0.000464,-0.000157,0.000329,8.1e-05,8e-06,0.000196,-0.000322,0.000129,-0.00012,-7.6e-05,-0.000251,-0.000203,-1.7e-05,0.000128,-1e-06,-9e-05,0.000173,-3.9e-05,-3e-06,0.000345,1.2e-05,-1.4e-05,6.2e-05,-3.3e-05,3.5e-05,6.4e-05,-1.7e-05,-1.2e-05,-2.9e-05,-1.2e-05,-1.9e-05,2e-06,-1.6e-05,-1.5e-05,-3.4e-05,-7e-06,-1e-05,-1.5e-05,-5.2e-05,-2.7e-05,-3.4e-05,4e-06
-2.4e-05,2.5e-05,2.4e-05,1.5e-05,1.7e-05,-4e-06,8e-06,8e-06,-3e-06,2e-06,2.1e-05,-3e-06,-4e-06,7e-06,1.3e-05,-3.9e-05,3.1e-05,-1.3e-05,1.3e-05,8e-06,-9e-06,-5e-06,1.8e-05,0,-0.000114,-0.000179,0.000129,-0.000275,-0.000185,0.000327,-7.4e-05,0.000113,9e-05,1.9e-05,-0.000239,-0.000522,-0.000172,5.4e-05,0.000397,-3.3e-05,0.000117,0.000245,0.001324,0.000643,0.00046,-0.000687,0.000189,0.000333,0.000293,-0.000529,-0.000431,9.3e-05,0.000582,-0.000905,0.000678,0.000332,0.001166,0.000441,-0.000195,0.000814,-0.000881,9.9e-05,0.000483,8.3e-05,-0.000389,7e-05,0.00038,-0.000144,-0.000196,-0.000329,-0.000266,-0.000844,3.8e-05,5.7e-05,-5.2e-05,0.000421,-0.000185,-0.000433,0.00047,0.000482,-0.000136,-3.1e-05,-6e-06,-0.000258,1.1e-05,-9.4e-05,0.000178,-2.7e-05,-4.4e-05,-1e-04,0,-1.7e-05,-0.000146,-0.000135,-2.2e-05,-0.000104,-3e-06,2e-06,2.8e-05,2.7e-05,5.5e-05,0,5.1e-05,1.4e-05,-0.000114,-7e-06,3.9e-05,-1.7e-05,3e-06,-8e-06,1.9e-05,1e-06,-7e-06,1.8e-05,-1.5e-05,1e-06,-3e-06,1.4e-05,3.1e-05,2e-06,2e-05
5e-06,-2.9e-05,5e-06,-5.6e-05,6e-06,1e-05,-7e-06,-4e-06,-4e-06,-1.3e-05,-9e-06,7e-06,1.9e-05,1.6e-05,1.7e-05,4.6e-05,4e-06,1e-06,-1e-05,1.1e-05,1.4e-05,1.5e-05,-4e-06,5e-06,5.9e-05,7.3e-05,-0.000207,0.000458,0.000793,-0.000318,-5.2e-05,-0.000148,-8.7e-05,3.6e-05,-1e-04,0.000272,-4e-06,2.7e-05,8e-06,-1.8e-05,5.2e-05,-0.000599,-0.00082,0.000445,-4e-05,-0.001255,0.000493,-0.000191,0.000243,2.3e-05,0.000687,-0.000337,-0.000501,-0.00105,0.000425,6.4e-05,-0.000585,-0.00055,-0.000169,0.00048,-6.4e-05,0.000549,2.3e-05,1.8e-05,-0.000258,0.000311,-0.000464,-0.000456,-0.000851,0.000279,0.000261,0.000755,-0.000203,0.000433,-0.000133,-0.000267,0.000452,0.000396,-0.000237,-0.000569,-0.00013,-0.000124,-0.000188,-9.3e-05,-6.6e-05,0.000176,0.000169,0,-5.8e-05,5e-06,-0.000105,-1e-06,-2.3e-05,-0.000244,-1e-05,4.2e-05,-6.4e-05,7.2e-05,-0.000164,2.7e-05,-5.4e-05,7.4e-05,3.8e-05,-1.6e-05,4.4e-05,2.8e-05,-3.3e-05,5e-06,9e-06,9e-06,-1e-05,1e-05,-1.1e-05,1.3e-05,2e-05,-1.2e-05,-7e-06,-1e-06,-8e-06,6e-06,-1.1e-05
-1e-06,0,-3e-06,-1e-05,8e-06,6e-06,4e-06,-7e-06,-1e-06,7e-06,-6e-06,-3e-06,6e-06,4e-06,-1e-05,-1.4e-05,-1.8e-05,-1e-06,4.1e-05,-1.3e-05,-1.5e-05,2e-06,-2.3e-05,-7e-06,-9.8e-05,-9.6e-05,0.000252,-0.000366,-0.000258,-3.2e-05,-3.8e-05,0.000125,-6.6e-05,1.4e-05,0.000111,-3e-05,-7.2e-05,-0.000202,-9.1e-05,0.000273,-5.1e-05,0.00022,0.000394,0.001158,0.000335,0.000996,-0.00014,9.7e-05,-8.3e-05,0.000501,-0.00085,0.000109,-7.5e-05,-3.8e-05,-0.000235,-0.000475,-0.000372,-0.00042,0.001032,-5e-05,-0.000291,-0.000397,-0.000284,0.000702,8.7e-05,-0.000247,0.000417,0.000249,0.000158,-0.00037,-0.000114,-0.000629,0.000115,-0.000111,3.2e-05,-0.000338,8.9e-05,-2.8e-05,0.000224,0.000569,0.000108,0.000246,0.00013,7.1e-05,-0.000154,-0.000147,7.3e-05,-7.8e-05,1.2e-05,3e-06,-3.3e-05,4e-06,0.000106,7.7e-05,8.5e-05,-3.8e-05,-6.8e-05,-5.4e-05,-4.3e-05,7.9e-05,3.8e-05,-4.8e-05,5e-06,1.6e-05,-1.7e-05,-1.1e-05,-2.5e-05,7e-06,-1.1e-05,-1.2e-05,-6e-06,3e-06,-1.5e-05,5e-06,-2e-06,8e-06,5e-06,-8e-06,1.5e-05,8e-06,-3e-06
-3e-06,-1e-06,6e-06,1.1e-05,-1.4e-05,-1.5e-05,-4e-06,-9e-06,4e-06,1.2e-05,-6e-06,3e-06,3e-06,7e-06,1.3e-05,1.8e-05,-3e-06,-5e-06,-1.8e-05,1.6e-05,4e-06,-7e-06,1e-06,2.1e-05,0.00013,-5.7e-05,-0.000278,6.2e-05,4e-06,0.000247,-1e-05,-4.3e-05,2e-05,7.3e-05,1.3e-05,-0.000185,0.000211,-1.9e-05,0.000131,4.6e-05,-4.7e-05,-1e-06,-0.000159,-0.000147,-0.000584,-0.000102,0.000341,-0.000395,-0.00086,-0.000217,0.000947,6.7e-05,-0.000396,3e-06,0.000327,-0.000377,0.000998,0.000682,0.000299,-0.000545,0.00022,-0.000125,-0.000149,-0.000388,5.5e-05,4.4e-05,-3e-04,-0.000115,-5.6e-05,0.000345,-0.000299,0.000379,-7.1e-05,0.000119,9.3e-05,0.000213,4e-05,-1e-06,-3.5e-05,-4.9e-05,0.00018,-0.000115,9e-06,0.000117,-1.4e-05,-0.000113,-7.4e-05,0.00014,9.2e-05,5.2e-05,-1.9e-05,3e-06,-6.7e-05,3.4e-05,3.9e-05,-2.3e-05,4.5e-05,-5.3e-05,1.5e-05,-1e-05,-7e-05,3.4e-05,1.9e-05,-6e-06,1.9e-05,-2e-06,1.9e-05,0,1.2e-05,-1e-06,-3e-06,-3e-06,1.3e-05,-4e-06,-3e-06,-2e-06,-2e-06,1.1e-05,-5e-06,-5e-06,-1e-06
-2e-06,0,-9e-06,-2e-06,7e-06,9e-06,-1e-06,-8e-06,-7e-06,5e-06,-8e-06,-6e-06,5e-06,-2.2e-05,-5e-06,-2.3e-05,-7e-06,1.3e-05,-7e-06,-5e-06,-9e-06,-4e-06,1e-06,7e-06,-6.5e-05,6.1e-05,7.7e-05,0.000245,-0.000316,3e-05,8e-05,-1.3e-05,-1e-05,-1e-05,-0.000342,6e-05,6.5e-05,2.6e-05,-4.3e-05,0.000136,-3e-06,9.4e-05,-0.000985,2e-06,0.000198,-3.2e-05,-0.000168,0.000159,0.000738,-5.9e-05,-0.000719,-6e-06,0.000326,0.000286,-2.2e-05,0.000504,3.9e-05,-0.000724,0.000368,-7.5e-05,0.000421,-2.3e-05,0.000124,0.000143,0.000261,0.000325,-0.000196,-7.4e-05,0.000137,-0.000239,-0.000132,-0.000196,0.000159,-0.000116,7.5e-05,0.000138,-0.000221,-6.6e-05,-1.9e-05,5.5e-05,1.7e-05,-0.00016,4.8e-05,-6.1e-05,0.00012,1e-05,-1.6e-05,-3.9e-05,-7e-05,2e-06,-1.1e-05,-9e-06,-3.1e-05,-6.1e-05,-1.8e-05,4.1e-05,-2.3e-05,6.6e-05,-2.3e-05,-1.4e-05,1.2e-05,-2e-05,1e-06,-2.3e-05,-9e-06,-2.5e-05,3e-06,1e-06,-1.4e-05,1e-06,-1e-06,4e-06,-1e-06,1e-05,3e-06,2e-06,2e-06,3e-06,-3e-06,1e-06,3e-06
-2e-06,8e-06,0,-1.2e-05,4e-06,-2e-06,2e-06,0,1e-05,-1.1e-05,5e-06,-1e-06,3e-06,9e-06,-3e-06,1.1e-05,8e-06,-1e-05,4e-06,-3e-06,6e-06,3e-06,9e-06,-2e-06,5.5e-05,7e-06,6e-06,-0.000395,3e-04,-1.9e-05,-2.4e-05,5.9e-05,-2.7e-05,3.6e-05,-3.2e-05,-5.4e-05,2.5e-05,4.5e-05,2.5e-05,4e-05,-1e-06,-3e-06,0.000577,-0.000379,0.000289,0.000422,0.000198,-0.000443,-0.00054,-0.000119,0.000123,5.4e-05,-0.000686,-1.6e-05,0.000327,-0.000362,-0.000297,-2.7e-05,-0.000499,-0.000345,-0.000109,-0.000263,0.000133,-2.2e-05,3.6e-05,-0.00012,0.000116,0.00013,-2.7e-05,0.000184,0.000376,0.000283,-0.000186,9.3e-05,-4.8e-05,-0.000272,0.000167,0.000159,1e-04,-5.2e-05,8.1e-05,0.000121,9.7e-05,-1.4e-05,1.3e-05,-4e-05,-4.7e-05,-3.4e-05,-3e-06,2.7e-05,2.1e-05,1e-06,6.2e-05,3.3e-05,-2.5e-05,1.5e-05,-7e-06,-1.1e-05,2.7e-05,-5.7e-05,9e-06,1e-05,-7e-06,1.1e-05,-1.6e-05,1.6e-05,-1.7e-05,-1e-06,1e-05,0,4e-06,-4e-06,-3e-06,-2e-06,-6e-06,6e-06,-7e-06,-4e-06,-4e-06,2e-06,1e-06
4e-06,0,0,-1e-05,-9e-06,-2e-06,0,3e-06,-9e-06,-4e-06,3e-06,-1e-06,-1e-06,-1.2e-05,-1.6e-05,-1.1e-05,0,9e-06,8e-06,-4e-06,0,-1e-06,-6e-06,5e-06,-3.8e-05,2.8e-05,-7.3e-05,0.000119,-0.000184,-6.9e-05,1.7e-05,-6.8e-05,-2.9e-05,1.7e-05,0.000161,-5e-06,-4e-05,8.9e-05,-7e-05,-1.3e-05,-3.6e-05,-0.000177,0.00124,0.00025,0.000148,-0.000655,-0.000141,-0.000447,0.000329,0.000482,1.5e-05,0.000359,0.000299,7.7e-05,-0.000376,7.8e-05,-0.000258,0.000121,0.000189,0.000128,-0.000253,0.00011,-8.4e-05,0.000168,-5e-05,-0.000136,0.000459,8.4e-05,4e-06,5.8e-05,-1.2e-05,-0.000414,3e-06,-3.6e-05,-8.8e-05,0.000298,0.000167,-0.000284,-5.3e-05,-4.5e-05,-2.3e-05,4.8e-05,1e-05,-7e-06,-9e-06,-3e-05,-6e-06,3.4e-05,2.6e-05,-1.3e-05,-2.1e-05,-2e-06,-1e-06,-5.7e-05,-1.4e-05,-2.5e-05,2e-06,-1.7e-05,3.7e-05,-1.3e-05,-2e-05,1.6e-05,2e-06,-1e-05,2.1e-05,-3e-06,5e-06,-6e-06,-3e-06,0,-1e-06,-4e-06,5e-06,1e-06,0,2e-06,3e-06,-2e-06,3e-06,-3e-06,-1e-06
2e-06,3e-06,-1e-06,1.5e-05,-6e-06,2e-06,3e-06,2e-06,4e-06,0,-2e-06,2e-06,2e-06,-3e-06,0,1e-05,-6e-06,-9e-06,-8e-06,8e-06,-6e-06,1e-06,1e-06,-3e-06,-9e-06,-2.2e-05,1.8e-05,0.000165,4.2e-05,9e-06,-5.1e-05,4.4e-05,1e-05,9e-06,3.2e-05,-1.1e-05,-9.9e-05,-6.1e-05,6.6e-05,-4.8e-05,2.3e-05,0.000165,-0.00054,-0.000209,-0.00024,-4.1e-05,8.9e-05,0.000303,0.000287,0.00025,0.000274,2.8e-05,-0.00029,0.000261,0.000221,-0.00013,2.5e-05,-0.000312,-5.3e-05,0.000219,-9.8e-05,0.000244,-5.4e-05,-4.1e-05,-6.1e-05,8.5e-05,-5e-05,-4.9e-05,0.000167,-0.000187,3.6e-05,0.000274,0.000283,1.8e-05,-6e-06,-0.000182,-8e-05,0.000148,-0.000154,5e-06,-3.1e-05,-9e-05,-5.1e-05,5e-06,4.4e-05,-6.7e-05,-5.4e-05,1.4e-05,-1.1e-05,4.3e-05,-8e-06,3e-06,-5.7e-05,3.1e-05,1.3e-05,-4.1e-05,-1.3e-05,1e-05,-7.3e-05,-1.2e-05,-3e-06,-1e-06,-4e-06,6e-06,-1.1e-05,-2e-06,7e-06,-6e-06,4e-06,-3e-06,2e-06,-2e-06,-5e-06,-3e-06,-2e-06,-1e-06,1e-06,-1e-06,0,-2e-06,-2e-06
-3e-06,-5e-06,3e-06,6e-06,4e-06,-1e-06,-1e-06,3e-06,-3e-06,5e-06,-1e-06,-1e-06,4e-06,3e-06,2e-06,1e-06,-2e-06,-7e-06,7e-06,-4e-06,7e-06,0,-3e-06,-7e-06,2.7e-05,-3.4e-05,4e-05,-0.000141,2.7e-05,-0.000109,4e-06,-5.3e-05,-3e-06,-6e-06,0.000102,9e-05,2.1e-05,-2.6e-05,1.7e-05,-4e-05,-7e-06,-0.000145,-0.000507,0.000322,0.000249,0.000214,-0.000221,0.000293,-0.000344,-0.000169,-0.000292,-0.000123,0.000288,0.000163,7e-05,-0.000114,0.000115,-1.6e-05,0.000227,5.4e-05,0.000122,-6.8e-05,3e-05,-2e-05,7e-05,3e-06,8.4e-05,-5.4e-05,-2.3e-05,1e-04,0.000197,-0.000177,-3e-04,-7.6e-05,5.4e-05,-6.1e-05,-8.1e-05,6e-05,1e-04,3e-05,-3.6e-05,-0.000104,-3.6e-05,-7e-06,4e-06,5.8e-05,9e-06,-5e-06,-1.3e-05,-6e-06,-1.1e-05,-3e-06,3.4e-05,8e-06,-7e-06,1.4e-05,-8e-06,-4e-06,-2e-06,1.1e-05,-8e-06,8e-06,-1e-05,-2e-06,1.2e-05,2e-06,-3e-06,1e-06,-7e-06,-2e-06,1e-06,0,-3e-06,4e-06,2e-06,4e-06,-1e-06,-1e-06,0,0,-3e-06
3e-06,0,1e-06,4e-06,7e-06,3e-06,3e-06,1e-06,0,1e-06,-3e-06,1e-06,1e-06,5e-06,7e-06,-6e-06,4e-06,3e-06,-1e-06,-5e-06,-4e-06,0,3e-06,-1e-06,-2.4e-05,3.9e-05,-0.000137,7.9e-05,-6.6e-05,9.6e-05,-3.8e-05,4.1e-05,-1.1e-05,9e-06,-1.1e-05,-0.000122,1.2e-05,-3.5e-05,-1.9e-05,-5.8e-05,3e-06,0.000163,0.00056,-0.000127,-1.5e-05,0.00018,-0.000117,3.6e-05,0.000248,-0.000298,0.000337,2.5e-05,-0.000364,0.000242,0.000116,-8e-06,7.2e-05,0.000145,0.00012,-7.5e-05,9.7e-05,-1.2e-05,-4.4e-05,0.00013,2.9e-05,-0.00013,-0.000432,2.8e-05,0.000192,-3.1e-05,-0.000101,0.000172,5.2e-05,3e-05,2.1e-05,0.000136,5.7e-05,-6.7e-05,-1.7e-05,2.2e-05,6e-06,0.000139,0.000106,-1e-06,-8.2e-05,4e-05,6e-06,-7e-06,-2e-06,1e-06,-1.8e-05,-2e-06,2.3e-05,3e-06,-8e-06,1.6e-05,-5e-06,4e-06,4.4e-05,9e-06,4e-06,-1.6e-05,6e-06,8e-06,-4e-06,-6e-06,-2e-06,6e-06,4e-06,3e-06,-2e-06,-1e-06,-2e-06,0,2e-06,-1e-06,-1e-06,3e-06,3e-06,-1e-06,1e-06
-2e-06,-2e-06,1e-06,1e-05,-1.1e-05,-1e-06,-1e-06,-2e-06,-1e-06,1e-06,-3e-06,0,2e-06,1e-06,-5e-06,8e-06,1e-06,-5e-06,2e-06,6e-06,4e-06,0,0,-3e-06,6e-06,-5e-06,0.000212,1.4e-05,2.7e-05,-2.5e-05,-1.5e-05,-1.6e-05,-1.2e-05,-4e-06,-0.000103,2.5e-05,2.8e-05,1.7e-05,-1.4e-05,-1e-05,-3e-06,-0.000105,-0.000224,5.4e-05,-0.000242,-6.1e-05,0.000152,0.000104,-0.000358,-3.6e-05,-0.000296,0.000114,0.000214,3.9e-05,-0.000188,5.5e-05,-0.000266,-0.000168,8.5e-05,-3.3e-05,4e-05,-3.6e-05,4.8e-05,-2.2e-05,1.3e-05,0.000114,-4.7e-05,-6.1e-05,-9.5e-05,6.8e-05,-0.000152,-0.000191,3.8e-05,1.8e-05,-4.1e-05,-0.000101,6.3e-05,-2.4e-05,-1.2e-05,4.5e-05,-1.5e-05,-0.000112,-3.5e-05,2.7e-05,-1.7e-05,0,3.8e-05,-1.9e-05,6e-06,3e-06,-2e-06,-2e-06,-3.3e-05,1e-05,-1.3e-05,-2.8e-05,-8e-06,-5e-06,-5e-06,1.5e-05,-7e-06,1e-05,4e-06,-2e-06,2e-06,-3e-06,-3e-06,1e-06,-1e-06,-5e-06,-1e-06,3e-06,1e-06,2e-06,-1e-06,-2e-06,3e-06,-3e-06,0,1e-06,3e-06
1e-06,-2e-06,0,1e-06,0,-2e-06,-1e-06,-2e-06,1e-06,2e-06,-1e-06,0,3e-06,2e-06,-4e-06,-3e-06,-6e-06,6e-06,-1e-05,2e-06,-4e-06,0,1e-06,-4e-06,1e-06,-2.8e-05,-0.000271,-0.000188,-9e-05,-1e-05,-1.4e-05,1.7e-05,6e-06,-5e-06,1e-04,6.3e-05,2.2e-05,2.4e-05,3.8e-05,-6e-06,-4e-06,2.9e-05,-0.000246,-0.000239,0.000156,-7.3e-05,-5.4e-05,-0.000157,0.000275,0.000215,0.000243,-0.00024,-0.000124,-0.000179,6.3e-05,9.2e-05,0.000138,4e-05,-0.00028,-1.4e-05,-0.000117,-0.000122,6.8e-05,7e-05,-7.9e-05,-1.2e-05,0.000104,-6e-06,-5.2e-05,5.6e-05,1e-06,0.00021,2.7e-05,1.6e-05,-2.6e-05,2e-06,1.5e-05,8.8e-05,6.5e-05,-3.1e-05,3.5e-05,5.9e-05,-8e-06,-1.6e-05,0,4.7e-05,-8e-06,1.1e-05,-1e-06,-1.3e-05,-1e-05,4e-06,-2e-06,1e-06,1e-06,2e-06,1e-06,1.4e-05,-2e-05,-9e-06,-1e-05,-5e-06,-3e-06,1.1e-05,-6e-06,4e-06,8e-06,-3e-06,-3e-06,3e-06,-1e-06,0,4e-06,-1e-06,2e-06,0,-1e-06,4e-06,3e-06,1e-06,-1e-06
-2e-06,5e-06,-2e-06,0,-2e-06,3e-06,1e-06,-2e-06,-1e-06,-4e-06,0,-1e-06,1e-06,2e-06,1e-06,-2e-06,-2e-06,0,9e-06,-6e-06,4e-06,0,-1e-06,2e-06,-4e-06,2.7e-05,0.000271,0.000201,9.2e-05,3.4e-05,1e-06,-2e-06,-3e-06,-9e-06,-3.5e-05,-8.9e-05,7e-06,1.7e-05,-1.4e-05,2.5e-05,1e-06,-1e-05,0.000119,0.000107,0.00022,-3e-06,0.000238,3.9e-05,-8e-06,3.4e-05,-0.000194,-5.7e-05,6.2e-05,-0.000127,5.3e-05,-0.000258,-7.6e-05,0.000238,-1.3e-05,6e-05,-9.7e-05,1.7e-05,-9.9e-05,2e-06,-2.1e-05,-0.000136,4.2e-05,4.8e-05,4.3e-05,-1.7e-05,5.2e-05,-0.000227,-7.7e-05,-1.9e-05,2.8e-05,7.1e-05,1.6e-05,7.1e-05,-5.2e-05,-1.9e-05,2.8e-05,1.1e-05,-8.1e-05,-1.8e-05,3.7e-05,2.3e-05,6e-06,1.4e-05,0,-1.1e-05,-8e-06,-2e-06,2.5e-05,2e-05,1.1e-05,1e-06,0,-1.1e-05,-1.2e-05,2.1e-05,7e-06,1.3e-05,6e-06,-1.2e-05,-1e-06,1e-06,1e-06,-2e-06,4e-06,0,0,1e-06,0,2e-06,-4e-06,-2e-06,-2e-06,-2e-06,-4e-06,0,-1e-06
4e-06,0,0,-7e-06,3e-06,-4e-06,-1e-06,-1e-06,-1e-06,-3e-06,0,0,1e-06,-7e-06,-2e-06,5e-06,4e-06,4e-06,-6e-06,3e-06,-4e-06,0,0,2e-06,1.7e-05,-2e-06,-0.000252,-5.5e-05,-8.9e-05,0,6e-06,-2.8e-05,-1e-05,-5e-06,-0.000143,4.3e-05,-1.3e-05,-1.6e-05,1.2e-05,3e-05,0,-1.4e-05,-0.000365,-3.5e-05,-5.5e-05,-5.7e-05,-0.000161,-9.6e-05,-1.5e-05,-6.9e-05,0.000147,0.000106,-1e-04,-0.00012,-0.000101,0.000133,5.4e-05,-0.000116,-0.000146,-8e-06,9.2e-05,1.3e-05,-5e-05,3e-06,-2e-05,0.00012,-4.3e-05,1.8e-05,-8.3e-05,-8e-06,1.7e-05,0.000158,-1.9e-05,-8e-06,4.2e-05,-2.1e-05,-2e-06,-0.000104,1.1e-05,-3e-06,1.9e-05,-0.000101,5.5e-05,5e-06,1.7e-05,2.5e-05,-1.3e-05,-1.6e-05,-7e-06,-1.6e-05,-5e-06,2e-06,-8e-06,-7e-06,9e-06,0,-4e-06,2e-06,-6e-06,-6e-06,-2e-06,-4e-06,6e-06,0,-2e-06,-1e-06,-7e-06,0,-1e-06,-2e-06,1e-06,0,-1e-06,0,1e-06,-1e-06,0,0,2e-06,0,-3e-06
-3e-06,-1e-06,-1e-06,-2e-06,-7e-06,3e-06,0,1e-06,2e-06,0,3e-06,0,2e-06,4e-06,1e-06,-5e-06,1e-06,-5e-06,5e-06,1e-06,3e-06,0,0,1e-06,-2.3e-05,-1.1e-05,0.000179,-7.6e-05,7.8e-05,2e-05,-1.2e-05,1.9e-05,-4e-06,-1e-05,6.8e-05,-3.7e-05,-1.2e-05,-3.4e-05,-2.4e-05,3.8e-05,-3e-06,5.3e-05,0.000286,0.000182,-0.000151,0.000194,4.3e-05,-3.4e-05,0.000141,-9.9e-05,-0.000101,-0.000107,7.2e-05,1.2e-05,-6.1e-05,-0.000113,6e-06,0.00011,7.4e-05,4.6e-05,4.9e-05,3.6e-05,0.000136,-2.9e-05,-2.1e-05,2.2e-05,3.3e-05,-1.5e-05,2.7e-05,5e-06,3.5e-05,-9.2e-05,8.1e-05,4.3e-05,-2.4e-05,-2.7e-05,-1.6e-05,7.5e-05,2.4e-05,-1.3e-05,-1.9e-05,9.4e-05,1.8e-05,1.6e-05,9e-06,1.3e-05,0,1.7e-05,-3e-06,5e-06,-1.3e-05,-2e-06,-1.9e-05,4e-06,-7e-06,-8e-06,1e-06,3e-06,1.2e-05,-1e-06,-4e-06,-3e-06,-4e-06,-1e-06,5e-06,-1e-06,3e-06,0,0,2e-06,0,0,2e-06,0,-1e-06,0,1e-06,-1e-06,-3e-06,0,2e-06
1e-06,3e-06,0,2e-06,4e-06,0,-2e-06,1e-06,-4e-06,4e-06,-1e-06,0,1e-06,-5e-06,0,3e-06,-3e-06,0,-4e-06,-1e-06,0,-1e-06,0,3e-06,2.7e-05,5e-06,-0.000107,0.00012,-3e-06,0,1.2e-05,-5e-06,3e-06,-8e-06,1.8e-05,3.6e-05,-7e-06,2e-05,3.1e-05,2.3e-05,-1e-06,-5.3e-05,0.000385,-2.9e-05,3.5e-05,-4e-05,-4.5e-05,9.7e-05,-0.000201,0.000167,3e-05,-7.4e-05,-0.000165,-5e-05,-0.000105,1.1e-05,-4e-05,4.8e-05,0.000115,-7.2e-05,4e-06,-2.4e-05,-2.6e-05,-8e-06,4.4e-05,-8.3e-05,5.8e-05,-4.4e-05,-3.3e-05,-2.8e-05,1.6e-05,0.000127,-7.9e-05,-2.4e-05,-3.6e-05,8.1e-05,-1.2e-05,9e-06,-3.1e-05,6.1e-05,-2.8e-05,1.2e-05,1e-05,-1e-05,9e-06,-1.6e-05,-1.6e-05,-2.4e-05,3e-06,-8e-06,-3e-06,2e-06,1.2e-05,-1.3e-05,-8e-06,5e-06,-3e-06,-7e-06,9e-06,-1.6e-05,-1e-05,-1e-06,-3e-06,-1e-06,-2e-06,1e-06,4e-06,-1e-06,-2e-06,-2e-06,0,-2e-06,-3e-06,0,0,-1e-06,1e-06,0,4e-06,0,0
-2e-06,-3e-06,1e-06,-3e-06,-1e-06,-1e-06,1e-06,1e-06,2e-06,0,-2e-06,0,0,-1e-06,3e-06,-1e-06,-1e-06,0,4e-06,-2e-06,-3e-06,0,1e-06,2e-06,-2.1e-05,3e-06,2.4e-05,-0.000106,6e-06,-1.2e-05,1e-06,7e-06,-2e-06,-9e-06,3.4e-05,-2.4e-05,5e-06,1e-06,1e-06,1.2e-05,2e-06,3.8e-05,-0.000458,3.1e-05,2.7e-05,-0.000133,2.8e-05,-0.000106,0.000126,7.1e-05,-1e-04,8.5e-05,0.000141,-8.5e-05,5.5e-05,2e-05,0.000153,-6.2e-05,7e-05,-2.4e-05,-5.8e-05,1.5e-05,-0.000102,1.4e-05,-1.6e-05,6.2e-05,8.2e-05,2.9e-05,9e-06,5e-05,-6e-05,-0.00015,3.2e-05,3e-06,-1.1e-05,-6.7e-05,4.8e-05,-3e-05,-1.3e-05,-2.1e-05,-3.1e-05,-6e-05,-3.9e-05,-1.1e-05,-1.1e-05,3e-06,-7e-06,2.2e-05,-4e-06,1.3e-05,-1e-05,-1e-06,1.1e-05,4e-06,3e-06,4e-06,-2e-06,6e-06,-6e-06,-7e-06,-2e-06,-5e-06,-1e-06,2e-06,1e-06,0,-4e-06,1e-06,2e-06,0,1e-06,0,0,0,1e-06,0,-1e-06,3e-06,-2e-06,-1e-06,1e-06
1e-06,-1e-06,0,-2e-06,1e-06,1e-06,-1e-06,1e-06,-2e-06,0,-1e-06,1e-06,1e-06,2e-06,-2e-06,2e-06,2e-06,-3e-06,-5e-06,2e-06,3e-06,0,-1e-06,-1e-06,9e-06,2e-06,1.6e-05,8e-06,-1.4e-05,-5.8e-05,-7e-06,-7e-06,-6e-06,-8e-06,6.5e-05,1.2e-05,2.7e-05,7e-06,-2.5e-05,-2e-06,-1e-06,-3.8e-05,-0.000108,-0.000111,0,6.6e-05,5.9e-05,7.9e-05,-0.000139,-0.000104,8.2e-05,6e-05,-0.000127,-8.1e-05,-6.5e-05,-2e-06,-0.000107,4.8e-05,-7.6e-05,-5e-06,-4.8e-05,-3e-06,7.3e-05,-2.8e-05,-4.1e-05,3.8e-05,-0.000138,2e-06,-2.2e-05,-1.5e-05,-6.1e-05,0.000118,8e-06,-6e-06,2.4e-05,4.7e-05,-7e-06,-2.3e-05,8e-06,4.5e-05,8e-06,4.1e-05,1.6e-05,1.2e-05,-3.5e-05,-2.8e-05,-3e-06,-1.7e-05,1e-06,-6e-06,-6e-06,1e-06,-1.8e-05,-2e-06,5e-06,-1.3e-05,0,-1e-06,-7e-06,-1.1e-05,8e-06,9e-06,-3e-06,1e-06,-1e-06,3e-06,-2e-06,1e-06,-1e-06,1e-06,-1e-06,0,0,0,-1e-06,1e-06,1e-06,-3e-06,2e-06,0,-1e-06
0,1e-06,1e-06,-3e-06,-3e-06,-2e-06,0,0,1e-06,-1e-06,-2e-06,0,1e-06,1e-06,-1e-06,-3e-06,0,5e-06,2e-06,-2e-06,-2e-06,1e-06,0,0,-8e-06,-1e-05,-3.8e-05,0.000109,-1.8e-05,3.8e-05,-8e-06,1.3e-05,0,-7e-06,-6.6e-05,-5e-06,1.8e-05,1e-06,2.3e-05,-2e-05,0,3.5e-05,0.000193,5.1e-05,4.2e-05,-3.5e-05,-8.2e-05,0.000103,0.000107,-0.000146,-7.9e-05,-6.4e-05,7.1e-05,5e-06,7e-06,-4.2e-05,3e-05,4.2e-05,-4.5e-05,2.8e-05,6e-06,-1.8e-05,2.6e-05,3e-06,2e-06,-5.1e-05,-0.000112,-2.5e-05,-8e-06,-2.1e-05,1.8e-05,-0.000107,-3.3e-05,1.1e-05,1.8e-05,-2.1e-05,-2.4e-05,6.2e-05,-2.1e-05,-3e-05,1.6e-05,-2e-06,-1e-06,1.2e-05,-4e-06,-1.5e-05,9e-06,-1.5e-05,-3e-06,4e-06,-3e-06,-2e-06,-1e-06,-1e-06,0,4e-06,-1e-06,-1e-06,-5e-06,1e-05,-7e-06,-3e-06,-1e-06,-1e-06,4e-06,0,2e-06,-1e-06,1e-06,-2e-06,-1e-06,-1e-06,2e-06,0,1e-06,0,0,2e-06,-2e-06,1e-06,-1e-06
-1e-06,0,0,1e-06,1e-06,2e-06,1e-06,-1e-06,-1e-06,-1e-06,0,0,0,-1e-06,-2e-06,6e-06,-2e-06,1e-06,1e-06,2e-06,2e-06,0,-1e-06,0,5e-06,-2e-06,2.7e-05,-0.00011,4.7e-05,1.6e-05,3e-06,-2.8e-05,1e-06,-5e-06,-2.3e-05,-2.3e-05,-1.3e-05,-1.5e-05,-1.6e-05,-1.7e-05,0,-1.8e-05,-8.5e-05,-6e-05,3.8e-05,7.5e-05,3.4e-05,-2.3e-05,-1e-05,4.3e-05,0.000107,-1.1e-05,-6.4e-05,9.8e-05,-1e-04,-9.1e-05,3.8e-05,-6.1e-05,-3.6e-05,3.1e-05,7.4e-05,-2e-05,-5e-05,1e-06,1.2e-05,7e-06,8.6e-05,1.6e-05,5.2e-05,2.5e-05,5e-05,9.1e-05,5e-05,-4e-06,3e-06,2.6e-05,1.4e-05,-7e-05,1.2e-05,1e-06,4e-06,-2e-06,3.2e-05,-9e-06,2e-06,-2.2e-05,8e-06,1.3e-05,-3e-06,0,-7e-06,2e-06,1.9e-05,-3e-06,-9e-06,0,0,-1e-06,-3e-06,6e-06,-2e-06,5e-06,0,0,-3e-06,0,1e-06,-2e-06,-1e-06,2e-06,0,0,1e-06,0,-1e-06,0,0,-1e-06,1e-06,0,0
2e-06,0,0,-1e-06,-2e-06,-1e-06,0,-1e-06,1e-06,-2e-06,1e-06,0,0,3e-06,2e-06,-5e-06,-1e-06,1e-06,0,-2e-06,-3e-06,0,1e-06,-2e-06,-1e-06,1.5e-05,-5e-06,1.9e-05,-2.5e-05,-1.2e-05,-1.2e-05,3.3e-05,-1e-06,-5e-06,5.4e-05,2.4e-05,-9e-06,-4e-06,1.9e-05,-1.8e-05,0,8e-06,-8.9e-05,8.5e-05,-7.6e-05,-4.4e-05,-9.3e-05,3.1e-05,-8.6e-05,0.000118,-7.1e-05,3.8e-05,4.9e-05,8e-05,4.1e-05,9.6e-05,-5.8e-05,4.6e-05,1.2e-05,2e-06,-1e-06,1.7e-05,3.7e-05,-8e-06,5e-06,3.4e-05,-1.3e-05,1e-05,-3e-05,-3.5e-05,1.8e-05,-7.9e-05,-2.5e-05,-1e-06,-1.7e-05,-2.7e-05,3.2e-05,3e-06,1.4e-05,-2e-06,5e-06,9e-06,-1.5e-05,-1.4e-05,2.1e-05,-1.3e-05,5e-06,1e-05,2e-06,6e-06,-3e-06,-1e-06,-8e-06,-3e-06,-3e-06,-4e-06,0,3e-06,1.3e-05,1.3e-05,-2e-06,-8e-06,-2e-06,4e-06,0,1e-06,-2e-06,0,-1e-06,-2e-06,0,1e-06,-1e-06,0,0,1e-06,-1e-06,0,-1e-06,0,1e-06
-2e-06,0,0,-1e-06,1e-06,0,1e-06,-1e-06,-1e-06,0,1e-06,0,1e-06,0,1e-06,1e-06,1e-06,-1e-06,-1e-06,0,3e-06,0,0,-1e-06,-3e-06,-5e-06,-2.9e-05,6e-05,1.7e-05,-1e-06,-4e-06,-2.9e-05,-3e-06,-3e-06,-6.6e-05,-2e-06,7e-06,1.3e-05,-1.5e-05,-7e-06,0,-5e-06,3.1e-05,-4.1e-05,-1.5e-05,-6.6e-05,8.2e-05,-9.4e-05,0.000119,0,5.8e-05,-3.9e-05,-4.5e-05,3.1e-05,-1.6e-05,-5.8e-05,-1.4e-05,1e-06,2.2e-05,-2.2e-05,-6e-05,-2.4e-05,7e-06,8e-06,6e-06,-5.2e-05,0.000156,-2.1e-05,1.2e-05,2.7e-05,-5e-06,0.00011,-3e-06,-3e-06,-1e-05,-1.7e-05,-2.5e-05,3.3e-05,-1e-06,4e-06,-1e-06,-4e-06,-2e-05,9e-06,6e-06,-3e-06,3e-06,2e-06,0,1e-06,-6e-06,1e-06,-1.2e-05,-1e-06,4e-06,-1e-06,-1e-06,0,-3e-06,1e-06,2e-06,2e-06,1e-06,-3e-06,0,0,-2e-06,1e-06,1e-06,0,0,0,0,0,0,0,1e-06,0,1e-06,0,0
1e-06,1e-06,0,5e-06,2e-06,1e-06,0,0,0,2e-06,0,0,0,-2e-06,0,3e-06,1e-06,-1e-06,0,1e-06,-3e-06,0,0,0,9e-06,-8e-06,5.1e-05,-9.5e-05,-5.5e-05,-1.4e-05,0,1.5e-05,-1e-06,-1e-06,-2.4e-05,-1e-06,-7e-06,1e-05,1e-06,2e-06,0,-1e-06,4.5e-05,2.5e-05,2.7e-05,3.1e-05,-4.4e-05,9e-06,-0.000114,-0.000101,-3.7e-05,-1.4e-05,-1.4e-05,-8e-06,-1.4e-05,3.4e-05,5e-06,-7.6e-05,3.9e-05,0,-6e-06,1.3e-05,-4.2e-05,-6e-06,-6e-06,-6e-06,-0.00012,0,1e-05,-5e-06,-5e-06,-0.000109,1.2e-05,2e-06,-2e-06,3.4e-05,-2.6e-05,-2.1e-05,-6e-06,2.1e-05,1e-06,-2.8e-05,1.1e-05,6e-06,1e-06,0,-1e-06,1e-06,-4e-06,-4e-06,-5e-06,-1e-06,1.4e-05,1e-06,3e-06,-2e-06,0,-4e-06,-1.4e-05,1e-06,0,-3e-06,3e-06,1e-06,0,2e-06,2e-06,1e-06,-1e-06,1e-06,0,0,0,-1e-06,-1e-06,0,0,-1e-06,-1e-06,0,0
-1e-06,-1e-06,0,3e-06,-3e-06,-1e-06,1e-06,1e-06,0,1e-06,0,0,0,2e-06,-1e-06,-3e-06,-1e-06,-1e-06,1e-06,0,1e-06,0,0,0,-4e-06,7e-06,-5.9e-05,7.4e-05,2.6e-05,-3e-06,-4e-06,2e-06,1e-06,0,8e-06,-2.1e-05,-1e-05,-1.5e-05,1.4e-05,1.1e-05,0,5e-06,7.7e-05,-5.7e-05,3e-06,-1.3e-05,5.8e-05,2.5e-05,7.6e-05,1e-06,3.1e-05,3.7e-05,5e-06,1.7e-05,-2.8e-05,-5.9e-05,1e-06,6.2e-05,2.1e-05,-1.3e-05,-1.1e-05,9e-06,3.8e-05,-5e-06,1.1e-05,3.5e-05,5.8e-05,1.8e-05,-6e-06,-6e-06,-3.2e-05,7.7e-05,1.7e-05,5e-06,7e-06,-4.9e-05,2.9e-05,-2.2e-05,9e-06,0,2e-06,3.9e-05,-2e-06,-1e-06,8e-06,1e-06,-1e-06,-4e-06,-2e-06,3e-06,-3e-06,0,5e-06,1e-06,-2e-06,1e-06,0,4e-06,3e-06,-9e-06,-7e-06,4e-06,0,-3e-06,0,-1e-06,0,0,1e-06,-1e-06,1e-06,0,-2e-06,0,1e-06,0,0,1e-06,0,0,-1e-06
1e-06,0,0,0,0,1e-06,-1e-06,1e-06,-1e-06,0,-1e-06,0,1e-06,-2e-06,0,1e-06,-1e-06,-1e-06,-2e-06,-2e-06,0,0,0,0,0,2e-06,4e-05,1.3e-05,-2.6e-05,2.5e-05,-1e-06,-1.1e-05,-1e-06,1e-06,2.4e-05,2.2e-05,1.4e-05,4e-06,-9e-06,1.4e-05,0,-6e-06,2.3e-05,1.8e-05,-9e-06,3.2e-05,-1.2e-05,-9.5e-05,-8e-05,9.6e-05,-2.9e-05,6e-06,-1e-05,5.5e-05,5e-06,-3.2e-05,1.9e-05,-3.7e-05,-4.6e-05,1.5e-05,3e-05,-1e-06,1.4e-05,-1.7e-05,-1.3e-05,-4.7e-05,-4.4e-05,-1e-05,3.1e-05,1.4e-05,-3.2e-05,-7e-05,-2.6e-05,-1e-06,9e-06,-2e-06,3.5e-05,1.4e-05,-2e-06,1e-05,-1.7e-05,2e-06,1.4e-05,-4e-06,-4e-06,8e-06,-8e-06,1e-06,3e-06,-4e-06,-7e-06,-1e-06,-1.7e-05,-1e-06,-3e-06,-7e-06,-1e-06,-1e-06,7e-06,-5e-06,2e-06,2e-06,0,1e-06,0,1e-06,-2e-06,0,-1e-06,1e-06,0,-1e-06,1e-06,0,-1e-06,0,0,1e-06,1e-06,0,1e-06
0,0,0,-1e-06,0,-1e-06,0,1e-06,1e-06,-2e-06,0,0,0,-1e-06,0,2e-06,1e-06,2e-06,1e-06,1e-06,-1e-06,0,0,1e-06,-1e-06,-6e-06,-8e-06,-9.6e-05,-3e-06,2.1e-05,-4e-06,2.1e-05,-2e-06,3e-06,4.8e-05,1e-06,7e-06,-2e-06,-2e-06,1.3e-05,0,8e-06,-0.000152,-2e-05,4.7e-05,-4e-06,-1.4e-05,7.5e-05,6.7e-05,2e-06,3.6e-05,-4.2e-05,-3e-05,1.8e-05,4e-05,1e-06,-6.5e-05,-5.8e-05,-2.5e-05,2e-06,3.6e-05,2e-06,-3.8e-05,-1e-05,1.7e-05,1e-06,2.9e-05,-9e-06,-2e-05,-1.9e-05,4.1e-05,8e-05,-5e-06,-2e-06,-2e-06,4.7e-05,-3.4e-05,2.3e-05,-1.2e-05,-1.5e-05,-5e-06,-5.1e-05,-2.4e-05,4e-06,-2.7e-05,6e-06,-3e-06,6e-06,-2e-06,2e-06,-3e-06,1e-06,6e-06,1e-06,-1e-06,3e-06,0,-1e-06,-4e-06,-8e-06,1e-06,-3e-06,1e-06,1e-06,4e-06,-2e-06,1e-06,0,2e-06,-1e-06,0,0,0,0,0,0,0,-2e-06,0,0,0
0,-1e-06,0,0,2e-06,0,0,1e-06,-1e-06,-1e-06,-1e-06,0,0,1e-06,-1e-06,-4e-06,0,1e-06,1e-06,0,1e-06,0,0,0,-4e-06,-1e-06,-4e-05,9e-05,4.1e-05,-2.3e-05,5e-06,-2.3e-05,0,4e-06,1.4e-05,-1.8e-05,-9e-06,-5e-06,-1e-06,5e-06,0,-1e-05,-1.9e-05,4e-05,-1.6e-05,-8e-06,2.9e-05,-3e-05,3.6e-05,-5.8e-05,-4e-05,-2.5e-05,-1e-06,-3.8e-05,-2.1e-05,1.2e-05,1.8e-05,8.4e-05,-2.1e-05,2e-06,-6e-05,-5e-06,9e-06,-1e-05,1e-05,3.9e-05,-6.3e-05,1.1e-05,-5e-06,1.5e-05,5.3e-05,-8.5e-05,4.2e-05,-1e-06,-4e-06,-5.9e-05,-2.3e-05,-4.9e-05,9e-06,6e-06,5e-06,3.8e-05,1.3e-05,-3e-06,-1e-06,9e-06,-4e-06,-9e-06,-2e-06,-3e-06,-5e-06,-1e-06,1.2e-05,0,2e-06,2e-06,-1e-06,1e-06,-1e-06,1e-06,-2e-06,0,0,0,-1e-06,1e-06,0,0,-1e-06,0,0,0,1e-06,-1e-06,0,0,0,1e-06,1e-06,0,0
0,1e-06,0,-1e-06,-5e-06,1e-06,-1e-06,0,1e-06,0,-1e-06,0,0,0,0,2e-06,-1e-06,0,0,-1e-06,-2e-06,0,0,0,5e-06,7e-06,8.2e-05,-1.7e-05,-2.6e-05,-6e-06,-6e-06,1.3e-05,1e-06,4e-06,-4.6e-05,8e-06,5e-06,1.2e-05,2e-06,-2e-06,0,1e-05,0.000153,-1.3e-05,-6.1e-05,-1.6e-05,-5.7e-05,-1.9e-05,-8.6e-05,-6.5e-05,3.3e-05,-4e-06,-1.2e-05,-5.1e-05,1.7e-05,1.6e-05,4.5e-05,-4.3e-05,1.7e-05,-1e-06,-2.1e-05,3e-06,1.5e-05,-7e-06,-4e-06,-2.2e-05,-3.1e-05,-2e-06,7e-06,4e-06,-1e-05,9.1e-05,-3.6e-05,7e-06,-8e-06,2.2e-05,2.5e-05,3.7e-05,-9e-06,-9e-06,8e-06,7e-06,-9e-06,-7e-06,6e-06,-4e-06,6e-06,-6e-06,-1e-06,-1e-06,-5e-06,1e-06,-1.4e-05,2e-06,2e-06,-7e-06,0,0,-3e-06,-1e-06,-5e-06,-5e-06,0,-2e-06,-4e-06,-1e-06,-1e-06,-1e-06,1e-06,1e-06,0,0,-1e-06,0,0,0,0,1e-06,-2e-06,0,-1e-06
0,1e-06,0,-2e-06,2e-06,-1e-06,0,-1e-06,-1e-06,1e-06,1e-06,0,0,-1e-06,-1e-06,0,0,-1e-06,0,-1e-06,3e-06,0,0,0,-8e-06,1e-06,-0.000116,-6e-05,1.5e-05,3e-06,0,-1e-05,-1e-06,4e-06,-3e-06,3e-06,5e-06,-1e-06,3e-06,-9e-06,0,-1.2e-05,1.6e-05,4e-06,-6e-06,1e-06,5.9e-05,5.8e-05,8e-05,3.9e-05,-4.2e-05,1.2e-05,-7e-06,-2.9e-05,-1.8e-05,-6.7e-05,-3.7e-05,-2.2e-05,2e-06,-1.3e-05,2.6e-05,-9e-06,-1.1e-05,4e-06,-1.1e-05,-4e-06,1.6e-05,-1e-05,-1.2e-05,-8e-06,-2.8e-05,-7.6e-05,-1.5e-05,-3e-06,3e-06,5.4e-05,1.1e-05,5e-06,-9e-06,1.6e-05,2e-06,-3e-05,2.2e-05,0,6e-06,7e-06,1e-06,-4e-06,-2e-06,-1e-06,-3e-06,-1e-06,-3e-06,-1e-06,-2e-06,1e-06,-1e-06,1e-06,-1e-06,7e-06,-2e-06,5e-06,0,1e-06,2e-06,0,0,0,-1e-06,-1e-06,0,0,0,0,1e-06,0,0,-1e-06,2e-06,0,0
