0.005458,0.005405,0.004752,0.004434,0.004799,0.005275,0.005618,0.005181,0.004862,0.005555,0.005823,0.005686,0.005069,0.004539,0.00462,0.004525,0.004849,0.005134,0.00502,0.004997,0.005138,0.005273,0.005118,0.005021,0.005399,0.005606,0.005433,0.00581
0.006499,0.006562,0.00583,0.005439,0.005798,0.006338,0.006698,0.006161,0.005969,0.006762,0.006953,0.006808,0.006117,0.005574,0.005776,0.005615,0.005863,0.006238,0.006256,0.006188,0.006182,0.00632,0.006239,0.006162,0.006584,0.006839,0.0067,0.007163
0.008253,0.008488,0.007656,0.007194,0.00748,0.008075,0.00845,0.007784,0.007841,0.008631,0.008549,0.008419,0.00781,0.007334,0.007712,0.007489,0.007565,0.008052,0.008352,0.008298,0.007965,0.008019,0.008084,0.008093,0.008572,0.008896,0.008918,0.009473
0.009738,0.010033,0.009293,0.008746,0.008823,0.009399,0.009789,0.009135,0.009391,0.009711,0.009031,0.008996,0.008954,0.008705,0.009005,0.008798,0.00875,0.009345,0.009987,0.010043,0.009395,0.00933,0.009456,0.009565,0.010141,0.01056,0.010823,0.011209
0.011356,0.011274,0.010711,0.010108,0.009911,0.010334,0.010752,0.010386,0.010741,0.010294,0.008841,0.008845,0.009515,0.009518,0.00933,0.00909,0.009294,0.010155,0.010838,0.010785,0.010087,0.010299,0.010479,0.010458,0.011278,0.011902,0.01213,0.012067
0.013909,0.012985,0.012289,0.01191,0.011395,0.011226,0.011648,0.0116,0.011909,0.011223,0.009248,0.00891,0.009945,0.010075,0.009139,0.008655,0.009474,0.010827,0.011169,0.010668,0.010173,0.010936,0.011247,0.011078,0.012153,0.012698,0.012508,0.012315
0.018071,0.015814,0.014489,0.014361,0.013051,0.011832,0.012545,0.012986,0.012813,0.012184,0.010237,0.009363,0.010243,0.010639,0.009467,0.008511,0.009485,0.01115,0.0114,0.010523,0.010099,0.01116,0.011557,0.011626,0.012901,0.012748,0.012063,0.012487
0.025116,0.020319,0.018173,0.017665,0.014676,0.012469,0.013562,0.014321,0.013461,0.013115,0.011815,0.010264,0.010816,0.011997,0.010841,0.009308,0.010062,0.0116,0.012029,0.011363,0.011245,0.012175,0.011856,0.012218,0.014258,0.013157,0.011844,0.013323
0.034768,0.026532,0.023177,0.021667,0.017334,0.014591,0.014773,0.015326,0.015262,0.01543,0.01461,0.012524,0.012632,0.014469,0.013534,0.011891,0.012182,0.013382,0.013632,0.013121,0.014105,0.015068,0.013312,0.013339,0.016111,0.01477,0.013259,0.015706
0.044509,0.033617,0.0288,0.026165,0.020859,0.017288,0.015696,0.0164,0.018714,0.019613,0.018914,0.016602,0.01603,0.018043,0.017459,0.015744,0.015428,0.016296,0.016343,0.016101,0.018279,0.019479,0.016768,0.016492,0.019497,0.0183,0.016904,0.01946
0.048941,0.037697,0.0322,0.028937,0.022737,0.01869,0.017033,0.018382,0.022696,0.024541,0.023447,0.020983,0.020404,0.022773,0.022023,0.019504,0.018342,0.019203,0.020066,0.020919,0.02373,0.024971,0.022191,0.021213,0.023976,0.023209,0.020994,0.022576
0.044499,0.035913,0.031579,0.027995,0.021169,0.01819,0.018966,0.021399,0.026018,0.028405,0.026941,0.024963,0.024783,0.026387,0.02501,0.021492,0.018968,0.020236,0.023172,0.025924,0.028561,0.029639,0.028007,0.025972,0.027311,0.026781,0.02354,0.024648
0.034963,0.030384,0.027901,0.024622,0.018547,0.016985,0.020338,0.024231,0.028002,0.030176,0.028726,0.027747,0.027484,0.026593,0.024328,0.020723,0.017379,0.019031,0.024444,0.029882,0.031728,0.031954,0.031949,0.028996,0.028302,0.027912,0.024093,0.02485
0.024955,0.023189,0.024089,0.022621,0.017641,0.015856,0.019683,0.025002,0.027808,0.028477,0.027277,0.02755,0.027085,0.023868,0.02064,0.01836,0.016104,0.017479,0.02349,0.030136,0.031269,0.030718,0.031493,0.028043,0.026174,0.026309,0.022872,0.022864
0.017735,0.017603,0.020507,0.020071,0.016682,0.015137,0.017267,0.021651,0.023778,0.023431,0.022719,0.023542,0.023032,0.019686,0.016304,0.015304,0.015096,0.016137,0.020487,0.025946,0.026622,0.025226,0.026698,0.025251,0.022749,0.022531,0.021369,0.021273
0.014793,0.015396,0.017459,0.017227,0.016524,0.016837,0.016722,0.017864,0.019208,0.019061,0.018959,0.019287,0.018966,0.016864,0.01403,0.013739,0.014536,0.015693,0.018506,0.021137,0.020783,0.019843,0.022348,0.023447,0.021356,0.020923,0.021847,0.022147
0.016642,0.01725,0.018377,0.018683,0.019168,0.019744,0.01856,0.018229,0.018927,0.01973,0.019709,0.018515,0.019005,0.017985,0.014733,0.014038,0.014889,0.016047,0.01836,0.021773,0.022086,0.021486,0.025877,0.028462,0.024585,0.022379,0.025526,0.028554
0.022231,0.022086,0.022441,0.023757,0.023081,0.022125,0.022257,0.023352,0.023336,0.023814,0.024681,0.022758,0.022667,0.021642,0.018347,0.018001,0.019136,0.019981,0.023854,0.034724,0.036895,0.031904,0.037478,0.041195,0.032605,0.028272,0.036581,0.043622
0.029872,0.029888,0.029546,0.0308,0.027501,0.025349,0.030143,0.03578,0.034408,0.031911,0.033376,0.030864,0.027749,0.025656,0.0236,0.025343,0.028318,0.02935,0.036804,0.060433,0.064097,0.048571,0.053713,0.059271,0.044766,0.038048,0.053291,0.065414
0.03783,0.038967,0.038994,0.038788,0.032478,0.029809,0.041263,0.053769,0.049973,0.042826,0.044225,0.040042,0.032972,0.030284,0.030875,0.034841,0.039881,0.041851,0.055288,0.097263,0.103297,0.071534,0.073253,0.083097,0.065181,0.053929,0.072302,0.089104
0.04561,0.046148,0.045973,0.044409,0.036131,0.034267,0.052264,0.070653,0.063055,0.051629,0.053702,0.047181,0.038493,0.037363,0.040463,0.045125,0.05025,0.052942,0.072705,0.133494,0.14357,0.095634,0.091988,0.109062,0.091514,0.074418,0.093588,0.116507
0.053141,0.05252,0.049988,0.047411,0.039261,0.038863,0.059045,0.078147,0.067209,0.054774,0.058168,0.050755,0.045566,0.047407,0.049775,0.053433,0.05657,0.058314,0.079851,0.147451,0.162969,0.110586,0.101265,0.12357,0.111435,0.09233,0.111612,0.138475
0.058579,0.061681,0.057345,0.051827,0.04388,0.045492,0.06296,0.077341,0.064984,0.052821,0.055635,0.050719,0.051529,0.055473,0.055832,0.058281,0.059423,0.060553,0.074934,0.125684,0.14663,0.110236,0.096007,0.114725,0.110902,0.096218,0.111208,0.134052
0.064069,0.076004,0.070877,0.058468,0.048866,0.054832,0.074257,0.080807,0.061113,0.045535,0.048437,0.05315,0.059968,0.062242,0.058931,0.059805,0.060389,0.059521,0.06064,0.080584,0.103885,0.097809,0.084575,0.092775,0.09756,0.091687,0.092831,0.098585
0.06864,0.083938,0.079015,0.062891,0.051939,0.06016,0.082829,0.081755,0.057152,0.040256,0.045168,0.064127,0.075627,0.072117,0.063771,0.060963,0.058912,0.054619,0.045978,0.044978,0.066818,0.082056,0.073456,0.074296,0.086786,0.088784,0.075556,0.059738
0.065625,0.074749,0.073363,0.062254,0.053447,0.057355,0.07535,0.070954,0.050576,0.040208,0.051354,0.08146,0.096535,0.085248,0.068206,0.059178,0.054401,0.049571,0.038475,0.038273,0.05792,0.069378,0.061217,0.062196,0.073449,0.075527,0.060451,0.03914
0.058715,0.05601,0.059058,0.058054,0.052493,0.049012,0.055805,0.052643,0.041319,0.038035,0.053182,0.087776,0.103361,0.085907,0.062575,0.050182,0.04626,0.044581,0.035887,0.037483,0.053568,0.056064,0.0468,0.04966,0.052835,0.052092,0.04664,0.032676
0.054458,0.048351,0.054594,0.054856,0.048658,0.042066,0.039231,0.037752,0.036078,0.035488,0.044663,0.072961,0.084571,0.068789,0.050038,0.039297,0.035793,0.036829,0.0334,0.035205,0.046625,0.044339,0.037102,0.04046,0.03784,0.035712,0.037924,0.032023
0.069635,0.066232,0.075302,0.062958,0.046951,0.039602,0.030741,0.032239,0.041204,0.040089,0.035266,0.048076,0.052803,0.047577,0.040713,0.031236,0.028343,0.032484,0.03187,0.031336,0.040013,0.040187,0.038206,0.040261,0.034684,0.034415,0.0401,0.03459
0.090944,0.090249,0.102361,0.076529,0.04941,0.041483,0.029835,0.037452,0.052169,0.047393,0.037774,0.045315,0.045974,0.04586,0.045725,0.033642,0.028733,0.035055,0.037198,0.03277,0.036513,0.044871,0.050612,0.047219,0.039006,0.048469,0.059703,0.046852
0.099886,0.103763,0.119246,0.086633,0.056283,0.047902,0.034708,0.046164,0.058048,0.050723,0.047667,0.059415,0.059545,0.057634,0.058955,0.045187,0.034859,0.042197,0.049163,0.038152,0.034312,0.050844,0.065804,0.063352,0.055134,0.073408,0.090548,0.070692
0.085704,0.0947,0.112246,0.080596,0.056697,0.05152,0.038994,0.050426,0.05387,0.045133,0.052138,0.069801,0.069458,0.067641,0.068371,0.054907,0.043957,0.050282,0.060476,0.044835,0.036124,0.057429,0.079255,0.081603,0.0753,0.097852,0.11949,0.098227
0.055234,0.067354,0.08399,0.061031,0.046674,0.044961,0.036919,0.045471,0.04349,0.035261,0.045508,0.066678,0.067133,0.068618,0.066563,0.054899,0.05179,0.054321,0.06183,0.047859,0.037561,0.056961,0.080989,0.089132,0.086367,0.105949,0.127777,0.114918
0.030162,0.042038,0.052701,0.039437,0.033156,0.032811,0.029464,0.033368,0.030567,0.026237,0.032639,0.050436,0.056367,0.063043,0.055738,0.044987,0.053172,0.051021,0.050438,0.041777,0.03268,0.045573,0.065711,0.077383,0.078299,0.088449,0.104839,0.106583
0.024477,0.025931,0.029878,0.025144,0.028352,0.030437,0.025352,0.02329,0.021439,0.025953,0.028083,0.033165,0.042908,0.055031,0.049766,0.037284,0.048489,0.046298,0.037816,0.031432,0.023548,0.029594,0.04227,0.051246,0.053003,0.054267,0.062808,0.074549
0.033275,0.024278,0.024984,0.025517,0.031795,0.035845,0.027835,0.02312,0.023859,0.034613,0.03506,0.031735,0.038814,0.045864,0.047903,0.041258,0.048177,0.043807,0.033722,0.028637,0.019807,0.024904,0.032498,0.029711,0.026914,0.025612,0.028243,0.038877
0.045636,0.031601,0.025879,0.030512,0.042994,0.048988,0.037225,0.028458,0.030595,0.048311,0.049238,0.039625,0.046061,0.042091,0.050266,0.054742,0.05266,0.047403,0.038737,0.033464,0.026888,0.036099,0.043323,0.029527,0.021045,0.022561,0.024281,0.025522
0.05588,0.043314,0.029731,0.035416,0.057169,0.0645,0.047817,0.032855,0.035672,0.060567,0.064106,0.051448,0.052646,0.041496,0.059748,0.069712,0.054217,0.049516,0.042584,0.037808,0.038637,0.054814,0.065999,0.046354,0.033332,0.035998,0.038673,0.038079
0.057665,0.053716,0.034455,0.036328,0.065576,0.073054,0.052034,0.031629,0.035065,0.064917,0.072503,0.061535,0.052346,0.038492,0.070285,0.085704,0.060151,0.049694,0.047137,0.045566,0.052728,0.075863,0.090058,0.066811,0.050606,0.053618,0.057826,0.057635
0.048771,0.056687,0.035,0.031338,0.062454,0.068524,0.04587,0.025182,0.028492,0.057531,0.06864,0.063286,0.044662,0.029815,0.071671,0.096462,0.072194,0.056144,0.053294,0.052573,0.062158,0.090104,0.104319,0.083155,0.066783,0.068681,0.074851,0.075581
