0.053144,0.049139,0.04017,0.041485,0.041586,0.038931,0.040503,0.041573,0.041024,0.038562,0.035695,0.034145,0.032183,0.031313,0.029794,0.028661,0.028864,0.024487,0.023268,0.026941,0.029084,0.030931,0.028354,0.026403,0.02843,0.0284,0.026087,0.024647
0.067473,0.062533,0.050113,0.051662,0.051895,0.049262,0.051415,0.053442,0.053789,0.050018,0.046195,0.044419,0.041088,0.039548,0.037397,0.035668,0.036077,0.030699,0.028664,0.032534,0.035015,0.037729,0.034552,0.032092,0.035397,0.036352,0.033572,0.031081
0.091305,0.084531,0.066427,0.068266,0.068784,0.06698,0.070354,0.073926,0.076613,0.071573,0.067087,0.064922,0.057791,0.053767,0.050397,0.047635,0.048376,0.041539,0.037726,0.041324,0.044162,0.048575,0.04485,0.041709,0.047209,0.049581,0.045602,0.04157
0.105183,0.096162,0.075958,0.077969,0.078978,0.079757,0.085225,0.09044,0.096205,0.093633,0.09169,0.088857,0.074957,0.064476,0.05942,0.055942,0.056367,0.049419,0.043768,0.046326,0.049246,0.053981,0.050626,0.04796,0.054438,0.056982,0.051707,0.047195
0.103395,0.091361,0.076014,0.078371,0.081182,0.086127,0.093618,0.100529,0.109083,0.114448,0.118859,0.114079,0.091875,0.07047,0.062061,0.058424,0.057325,0.052364,0.046444,0.046934,0.049027,0.051638,0.049616,0.048879,0.053644,0.054536,0.049026,0.045927
0.106603,0.090922,0.084886,0.086099,0.09089,0.098849,0.107932,0.116122,0.126632,0.139937,0.146538,0.13989,0.114612,0.082345,0.067801,0.064222,0.06042,0.057145,0.051957,0.050544,0.055039,0.057218,0.055488,0.054466,0.053523,0.054153,0.05189,0.049564
0.147757,0.124839,0.12394,0.122402,0.12573,0.135655,0.149268,0.154655,0.169886,0.190565,0.181048,0.169131,0.149373,0.111171,0.092149,0.087454,0.079674,0.076374,0.072078,0.069994,0.080346,0.086618,0.083324,0.076819,0.070362,0.075448,0.07688,0.07195
0.228448,0.193445,0.195161,0.192515,0.190668,0.209647,0.233062,0.221416,0.239865,0.271613,0.22931,0.205443,0.196399,0.155433,0.13507,0.127879,0.115887,0.112797,0.109586,0.107042,0.121434,0.132621,0.129356,0.116868,0.107121,0.116328,0.118149,0.109459
0.33948,0.29216,0.300783,0.294818,0.286397,0.33356,0.365937,0.310148,0.32015,0.370215,0.305817,0.273627,0.271048,0.220186,0.190232,0.177681,0.165061,0.163721,0.164778,0.162134,0.172979,0.187434,0.193404,0.177291,0.160076,0.1722,0.175807,0.163017
0.475926,0.419747,0.445912,0.425198,0.402188,0.494382,0.526723,0.404496,0.39029,0.463066,0.415136,0.394015,0.390368,0.31252,0.252496,0.231651,0.225398,0.225485,0.231774,0.233057,0.2306,0.24031,0.271754,0.259512,0.225665,0.241949,0.254941,0.236687
0.594463,0.5353,0.592581,0.555294,0.514123,0.643441,0.647123,0.462092,0.434499,0.532373,0.52357,0.52651,0.527966,0.414877,0.307037,0.283077,0.290202,0.283384,0.291312,0.301719,0.278113,0.273518,0.339095,0.337062,0.281856,0.304283,0.336455,0.314706
0.621764,0.57489,0.657491,0.609852,0.557148,0.687934,0.643489,0.443476,0.431302,0.540032,0.56314,0.585657,0.596713,0.466336,0.32358,0.303864,0.326516,0.309417,0.315622,0.332249,0.285505,0.264118,0.35094,0.361615,0.298893,0.325273,0.378948,0.361563
0.52648,0.497182,0.574767,0.533096,0.488079,0.574385,0.503583,0.354473,0.361429,0.447312,0.472911,0.499458,0.51944,0.41253,0.278653,0.265417,0.293477,0.271118,0.274806,0.292529,0.244586,0.216923,0.285768,0.29955,0.255309,0.282024,0.341705,0.333607
0.372704,0.35201,0.410578,0.40016,0.361002,0.371446,0.31495,0.250763,0.248901,0.277626,0.287974,0.308005,0.331666,0.280457,0.198204,0.190774,0.211217,0.193512,0.19846,0.20761,0.183998,0.170634,0.195572,0.201007,0.182199,0.198975,0.237824,0.234965
0.351106,0.325526,0.376969,0.415087,0.354102,0.302143,0.259046,0.246572,0.229738,0.188126,0.173401,0.181983,0.204611,0.203736,0.178373,0.168868,0.163042,0.15209,0.172737,0.16728,0.166386,0.17679,0.193011,0.196216,0.1559,0.14706,0.156749,0.160206
0.522146,0.4713,0.531422,0.607868,0.506411,0.423551,0.368193,0.358624,0.345856,0.258323,0.221041,0.227262,0.256332,0.266427,0.251793,0.236878,0.208242,0.189945,0.233675,0.222805,0.220901,0.245734,0.27845,0.290159,0.221087,0.200001,0.198208,0.19988
0.726544,0.648149,0.715542,0.82701,0.71298,0.61497,0.521788,0.493457,0.498493,0.38153,0.31811,0.332197,0.368268,0.369313,0.350974,0.337632,0.299293,0.268294,0.327994,0.313687,0.305485,0.343742,0.39447,0.407186,0.313083,0.290265,0.2953,0.290944
0.859849,0.769178,0.823501,0.952619,0.877865,0.796896,0.657893,0.592961,0.635196,0.511637,0.403499,0.422774,0.454638,0.435354,0.415783,0.415213,0.382709,0.337309,0.397855,0.384662,0.371465,0.426107,0.493432,0.503296,0.392871,0.365617,0.389189,0.379639
0.888709,0.837283,0.885647,0.979065,0.957076,0.907817,0.73158,0.634773,0.727134,0.634685,0.478642,0.475473,0.467409,0.427179,0.419663,0.454995,0.461581,0.400159,0.421009,0.406986,0.40558,0.486768,0.549615,0.548289,0.444594,0.402157,0.446915,0.44171
0.901329,0.907214,0.969695,0.986489,0.956521,0.918726,0.740295,0.656517,0.78318,0.719607,0.547849,0.504221,0.419242,0.368481,0.407397,0.506803,0.558703,0.48001,0.4475,0.423768,0.417452,0.511603,0.560989,0.548799,0.469609,0.409706,0.461616,0.477024
0.890064,0.902713,0.9397,0.937101,0.925608,0.892031,0.753679,0.704837,0.795758,0.704747,0.553488,0.490702,0.351807,0.309445,0.410926,0.568349,0.628946,0.524725,0.476012,0.442591,0.400298,0.479608,0.549495,0.556138,0.467544,0.3819,0.437619,0.484544
0.743934,0.719186,0.715785,0.737012,0.778359,0.793465,0.731703,0.683031,0.683933,0.578114,0.482032,0.452273,0.345327,0.285107,0.380281,0.550792,0.588651,0.466147,0.444049,0.429474,0.36001,0.398137,0.471564,0.497048,0.402439,0.314447,0.370315,0.443474
0.571624,0.50671,0.479136,0.514652,0.561062,0.617838,0.650364,0.607406,0.537086,0.469527,0.449193,0.431339,0.361695,0.282692,0.305643,0.418316,0.43063,0.341298,0.353082,0.360781,0.303868,0.31045,0.371022,0.386694,0.28024,0.215577,0.289488,0.375707
0.433274,0.392728,0.39691,0.452028,0.472431,0.505319,0.560063,0.525162,0.51107,0.50656,0.463634,0.435562,0.390169,0.304604,0.256041,0.2907,0.299353,0.272241,0.294685,0.29773,0.267542,0.256187,0.288271,0.295602,0.203581,0.16274,0.265611,0.356139
0.372659,0.40237,0.461644,0.494761,0.526627,0.57395,0.571912,0.48531,0.530229,0.574555,0.480352,0.463431,0.465958,0.376075,0.291392,0.296414,0.304459,0.270121,0.2652,0.29253,0.321258,0.290671,0.268649,0.284372,0.227007,0.177937,0.285086,0.370607
0.403667,0.497709,0.595569,0.574125,0.602762,0.705281,0.662117,0.484832,0.513253,0.596452,0.523568,0.533242,0.597616,0.505958,0.345127,0.324192,0.332268,0.268985,0.251842,0.309511,0.381073,0.340904,0.27551,0.292007,0.262818,0.210604,0.324969,0.427863
0.499995,0.622456,0.694786,0.603645,0.614852,0.748745,0.678534,0.459554,0.460415,0.574782,0.553056,0.583388,0.700091,0.629601,0.409116,0.350314,0.32876,0.246752,0.27045,0.339686,0.391584,0.351886,0.297841,0.315829,0.291566,0.237032,0.343484,0.482636
0.593415,0.703635,0.721283,0.595879,0.565447,0.639767,0.567394,0.403597,0.40721,0.521289,0.524225,0.565684,0.698772,0.656146,0.440425,0.344897,0.292021,0.230878,0.310477,0.37062,0.368043,0.313427,0.288855,0.307889,0.286283,0.251832,0.336498,0.48517
0.608033,0.650246,0.619646,0.552803,0.504626,0.478509,0.408067,0.336391,0.38893,0.455369,0.427582,0.469194,0.569074,0.569149,0.40587,0.292298,0.259515,0.258718,0.353974,0.392156,0.368139,0.288841,0.255461,0.254549,0.235326,0.253715,0.319072,0.42126
0.524883,0.474378,0.442277,0.481523,0.460012,0.401345,0.346736,0.33083,0.393323,0.379505,0.33006,0.370496,0.398319,0.423343,0.329387,0.215846,0.225223,0.31087,0.397049,0.384124,0.355206,0.278715,0.228586,0.201476,0.1693,0.231602,0.305489,0.33635
0.384613,0.321081,0.327585,0.424128,0.419177,0.345752,0.319747,0.347712,0.392041,0.301968,0.240634,0.296847,0.291688,0.284962,0.234221,0.164332,0.208355,0.341527,0.406937,0.356518,0.300481,0.239747,0.214278,0.177264,0.122752,0.188756,0.272881,0.265856
0.303483,0.256901,0.246095,0.31832,0.315552,0.251788,0.264979,0.316696,0.339891,0.23064,0.189142,0.249722,0.242953,0.206756,0.156587,0.137201,0.193901,0.306182,0.334988,0.281107,0.213613,0.171202,0.180008,0.149456,0.094629,0.14044,0.21113,0.208755
0.249232,0.203374,0.175379,0.22415,0.205411,0.158524,0.189563,0.247128,0.252735,0.171545,0.153459,0.196238,0.193421,0.166592,0.130794,0.118,0.14862,0.21108,0.214271,0.190818,0.148425,0.115671,0.12922,0.121209,0.091492,0.101291,0.134732,0.137863
0.210372,0.155213,0.138989,0.16439,0.132881,0.112614,0.13631,0.170048,0.165013,0.123909,0.113963,0.145729,0.149455,0.13078,0.116808,0.106056,0.101516,0.122583,0.137087,0.134133,0.110985,0.094306,0.101025,0.100659,0.08995,0.077801,0.093491,0.107471
0.187593,0.143731,0.142187,0.149469,0.108611,0.101621,0.117844,0.108798,0.094025,0.083123,0.075096,0.089484,0.102272,0.101711,0.097273,0.09824,0.092647,0.099862,0.120066,0.115932,0.117666,0.128502,0.127701,0.11484,0.106819,0.101731,0.113835,0.120928
0.214667,0.193384,0.185677,0.167506,0.137394,0.139584,0.15075,0.117188,0.077925,0.060478,0.053513,0.058406,0.075934,0.093151,0.088464,0.109848,0.130245,0.122303,0.150319,0.165206,0.180533,0.19708,0.189403,0.176273,0.165408,0.161578,0.16356,0.13997
0.275684,0.263316,0.256878,0.225462,0.199625,0.202889,0.209416,0.157597,0.089289,0.065712,0.06398,0.061564,0.085036,0.104642,0.090654,0.133803,0.178554,0.164176,0.204174,0.239893,0.262754,0.279823,0.268468,0.256155,0.241026,0.232821,0.219316,0.153977
0.331933,0.316711,0.314993,0.284981,0.26044,0.258252,0.257496,0.194313,0.094444,0.072073,0.085226,0.080706,0.105872,0.111039,0.0884,0.150297,0.210695,0.199661,0.246411,0.300385,0.326563,0.340618,0.32915,0.316671,0.299989,0.284948,0.258841,0.173566
0.335403,0.313465,0.318276,0.300866,0.281635,0.271876,0.263659,0.206317,0.096489,0.075597,0.102736,0.094508,0.114411,0.102106,0.074227,0.142566,0.206077,0.204373,0.246355,0.30945,0.332549,0.339073,0.33014,0.319003,0.305715,0.283625,0.252991,0.172313
0.269994,0.244838,0.25547,0.254299,0.243851,0.228043,0.215914,0.181931,0.092633,0.075379,0.10755,0.091229,0.101448,0.082779,0.061624,0.112834,0.162429,0.16761,0.197154,0.25476,0.268181,0.266474,0.261055,0.25348,0.247036,0.221742,0.197384,0.140243
