0.031233,0.032406,0.035338,0.044595,0.054207,0.06189,0.066712,0.075804,0.09377,0.104081,0.099669,0.094431,0.10393,0.120682,0.125775,0.127289,0.124663,0.106628,0.098971,0.106548,0.111049,0.113981,0.116117,0.133809,0.148123,0.139102,0.133073,0.122578
0.04043,0.04296,0.046859,0.059425,0.072902,0.079626,0.082645,0.095439,0.116432,0.126576,0.123666,0.118175,0.129468,0.153781,0.159265,0.158394,0.154224,0.13121,0.122122,0.128499,0.132601,0.137246,0.142111,0.166396,0.183293,0.171231,0.166562,0.156258
0.058287,0.063398,0.068581,0.087643,0.108703,0.112095,0.110271,0.129506,0.154421,0.163033,0.163353,0.15755,0.172419,0.21101,0.215557,0.208827,0.202351,0.172959,0.162575,0.165507,0.16826,0.175911,0.185809,0.221736,0.242508,0.225441,0.222989,0.213254
0.074139,0.082061,0.088556,0.112577,0.139252,0.13807,0.13135,0.156857,0.182015,0.185748,0.18862,0.181211,0.199014,0.25024,0.2508,0.237066,0.229631,0.198739,0.190795,0.18944,0.19035,0.200711,0.213592,0.254717,0.275155,0.257906,0.258398,0.248234
0.0789,0.089787,0.099666,0.122344,0.146853,0.147477,0.141844,0.165434,0.184813,0.186137,0.191852,0.181154,0.195155,0.246122,0.245618,0.229609,0.220084,0.196775,0.199145,0.196032,0.192694,0.20044,0.210937,0.247464,0.261939,0.253513,0.257533,0.243522
0.074856,0.090436,0.106493,0.120981,0.137341,0.152905,0.155788,0.167588,0.183019,0.189076,0.20559,0.198971,0.197835,0.234857,0.243005,0.234713,0.222522,0.207688,0.223575,0.221244,0.205465,0.207523,0.220516,0.245683,0.244445,0.25119,0.259848,0.239085
0.089247,0.111402,0.133015,0.142299,0.158597,0.200352,0.215087,0.216975,0.250007,0.270987,0.304952,0.314902,0.304913,0.344113,0.362895,0.351501,0.321396,0.305088,0.341802,0.327507,0.288859,0.301935,0.332574,0.360437,0.339769,0.346392,0.367527,0.361736
0.142671,0.17875,0.205719,0.217089,0.249243,0.328803,0.354384,0.352403,0.421992,0.457802,0.518125,0.55763,0.543562,0.607415,0.64437,0.616241,0.538636,0.515812,0.602088,0.547307,0.457593,0.514927,0.582714,0.61781,0.572807,0.589229,0.654903,0.679846
0.229998,0.287949,0.328997,0.351551,0.407531,0.538273,0.575473,0.567971,0.687187,0.73839,0.837356,0.921966,0.902103,0.996068,1.060978,1.008211,0.847523,0.826067,1.00932,0.868428,0.682359,0.839041,0.980028,1.021568,0.940399,0.990511,1.150152,1.222236
0.340392,0.422696,0.491675,0.53366,0.61635,0.796232,0.828022,0.813942,0.991297,1.066182,1.210686,1.342713,1.316031,1.429286,1.532343,1.451515,1.178659,1.184567,1.501374,1.232908,0.923334,1.234209,1.500951,1.554193,1.407431,1.511885,1.820709,1.954518
0.427959,0.525085,0.632677,0.698374,0.800187,0.99609,0.996706,0.983972,1.207747,1.310637,1.479017,1.627773,1.5946,1.700058,1.846445,1.748101,1.378653,1.443946,1.865979,1.490108,1.118333,1.575583,1.974286,2.048231,1.808043,1.965666,2.446096,2.633997
0.427323,0.518662,0.656445,0.739393,0.838866,0.992798,0.946741,0.946824,1.179763,1.298066,1.435618,1.549922,1.518339,1.579646,1.754735,1.688758,1.299409,1.403311,1.815804,1.430997,1.127679,1.641327,2.095311,2.18589,1.886437,2.056212,2.623237,2.821864
0.318532,0.385027,0.515329,0.597213,0.672874,0.751436,0.687106,0.698374,0.87609,0.980391,1.053376,1.107131,1.091421,1.105779,1.258605,1.268906,0.97192,1.026979,1.300598,1.054405,0.927903,1.334706,1.688012,1.782431,1.554911,1.676369,2.123894,2.263163
0.179383,0.217681,0.300971,0.355327,0.394663,0.432753,0.410442,0.410696,0.492544,0.565068,0.596898,0.621209,0.646015,0.690058,0.757692,0.774032,0.647792,0.618731,0.74148,0.746652,0.763994,0.900707,1.036551,1.145841,1.169946,1.250621,1.380802,1.362661
0.120252,0.139281,0.191259,0.246022,0.256608,0.275064,0.326311,0.341861,0.359891,0.402362,0.455497,0.50592,0.593416,0.769684,0.745539,0.662202,0.687875,0.652795,0.729173,0.909088,0.948226,0.888817,0.918907,1.114641,1.48343,1.559878,1.236958,0.923596
0.165225,0.190356,0.278122,0.378949,0.383153,0.398274,0.515227,0.582606,0.583283,0.573356,0.615041,0.705258,0.874449,1.164805,1.099212,0.979872,1.092135,1.035798,1.154833,1.471347,1.496778,1.364069,1.423268,1.806729,2.505088,2.614455,1.912713,1.26904
0.260872,0.308141,0.472322,0.643862,0.63664,0.664296,0.879992,1.02867,1.022974,0.921175,0.881292,0.983936,1.250544,1.624504,1.552594,1.505194,1.670083,1.488332,1.655714,2.138812,2.173301,2.003991,2.071311,2.651802,3.71626,3.879016,2.877079,1.929564
0.387503,0.479909,0.757921,1.007249,0.968402,1.030435,1.385651,1.658829,1.672987,1.424903,1.208927,1.286771,1.677357,2.055502,1.935875,2.056211,2.23725,1.816081,2.002335,2.692297,2.793198,2.623599,2.631182,3.253936,4.511516,4.779528,3.724593,2.587403
0.519018,0.690253,1.116414,1.410842,1.328948,1.458829,1.927397,2.318167,2.388483,2.020872,1.605638,1.667958,2.211736,2.497563,2.237428,2.50257,2.66724,1.95996,2.127903,3.056765,3.286534,3.172605,3.063949,3.346419,4.313079,4.749009,4.058493,3.005999
0.62534,0.879867,1.41999,1.706727,1.640297,1.879709,2.347464,2.726425,2.846379,2.528188,2.049463,2.07133,2.714552,2.953802,2.535545,2.834173,3.030254,2.123522,2.199241,3.193959,3.557824,3.587004,3.340368,3.008881,3.381588,4.018085,3.811613,3.009889
0.724828,1.004849,1.498197,1.733174,1.766884,2.094544,2.47841,2.705071,2.793684,2.652099,2.243391,2.16293,2.711599,2.917255,2.581997,2.943863,3.168146,2.272304,2.26379,3.038668,3.336859,3.578759,3.372454,2.633836,2.636146,3.399981,3.40585,2.735518
0.788728,0.981249,1.275628,1.476994,1.623389,1.903353,2.163041,2.247818,2.248,2.230864,1.977993,1.805113,2.044125,2.167777,2.144691,2.6008,2.772082,2.157404,2.118827,2.362351,2.453463,2.963862,2.896958,2.099959,2.024991,2.731945,2.838616,2.314296
0.734817,0.810758,0.880449,1.013303,1.212552,1.368949,1.492733,1.569131,1.55128,1.487292,1.351128,1.220496,1.186735,1.223778,1.473299,1.918793,2.018212,1.76692,1.743957,1.587655,1.474273,1.976572,2.040395,1.494495,1.411055,1.89485,2.019991,1.760824
0.575191,0.614268,0.585889,0.636419,0.8471,0.998705,1.03082,1.04645,1.014934,0.918731,0.884076,0.907723,0.820266,0.822526,1.04944,1.252269,1.323872,1.352533,1.459658,1.285318,0.999372,1.218707,1.283474,1.028717,1.020719,1.334752,1.473023,1.407932
0.433483,0.473803,0.512083,0.607307,0.844914,1.01168,0.899739,0.792454,0.797841,0.777816,0.838402,0.87664,0.795931,0.842093,1.006963,1.07058,1.06319,1.193721,1.446991,1.253189,0.875826,0.970478,0.968879,0.87037,0.988941,1.287179,1.487646,1.465928
0.370428,0.430492,0.545006,0.696171,0.965878,1.081593,0.911414,0.849384,0.889573,0.857666,0.918344,0.913152,0.879556,0.96815,1.088645,1.13244,1.108883,1.260562,1.432611,1.109224,0.744205,0.886233,0.913255,0.944567,1.176732,1.52108,1.728628,1.562689
0.361388,0.417048,0.546488,0.703418,0.92844,0.973968,0.841663,0.882441,0.901786,0.833432,0.885972,0.845556,0.911149,1.026803,1.036542,1.08845,1.091607,1.221466,1.242552,0.836433,0.565289,0.817887,0.951194,1.030903,1.244132,1.51653,1.690128,1.459741
0.301636,0.34837,0.474637,0.584195,0.700027,0.726851,0.676282,0.75082,0.745478,0.694129,0.724506,0.696215,0.841332,0.913288,0.813392,0.877007,0.916866,0.971665,0.94521,0.645812,0.449066,0.668759,0.881339,0.968237,1.061782,1.175669,1.320149,1.200977
0.237872,0.277982,0.370064,0.412457,0.427275,0.470011,0.518718,0.553068,0.534972,0.528228,0.518303,0.527727,0.66668,0.678913,0.56886,0.605659,0.657255,0.653977,0.61552,0.506376,0.409108,0.486803,0.673443,0.763328,0.766989,0.745476,0.824398,0.873152
0.194193,0.222282,0.267721,0.295989,0.277199,0.347373,0.449959,0.423837,0.361805,0.350923,0.349993,0.396284,0.48973,0.473703,0.366789,0.361088,0.461239,0.522568,0.439932,0.38313,0.368239,0.343716,0.427741,0.505929,0.505163,0.453548,0.517995,0.616838
0.138145,0.170668,0.215158,0.265241,0.232828,0.287216,0.389387,0.346279,0.253376,0.219332,0.240471,0.279183,0.33416,0.334523,0.257125,0.243297,0.340692,0.405272,0.319937,0.276688,0.29191,0.257334,0.261861,0.28278,0.327204,0.319874,0.374552,0.439971
0.097432,0.132203,0.184746,0.253535,0.229649,0.227633,0.273972,0.241781,0.191892,0.188822,0.202904,0.18102,0.221077,0.246935,0.209506,0.193257,0.223464,0.274987,0.267182,0.233491,0.206081,0.20486,0.236444,0.224209,0.239419,0.242459,0.250151,0.286497
0.097969,0.128856,0.153481,0.210983,0.21503,0.184742,0.176156,0.157296,0.179006,0.221379,0.226881,0.152745,0.174286,0.21184,0.204814,0.200456,0.149425,0.180518,0.24872,0.214974,0.157102,0.186095,0.263309,0.245462,0.186702,0.185042,0.180742,0.21958
0.105942,0.124039,0.125341,0.168156,0.177738,0.150243,0.142462,0.164684,0.200487,0.246148,0.25688,0.153811,0.162612,0.196482,0.200816,0.20744,0.133416,0.147021,0.218314,0.193785,0.14382,0.17788,0.279595,0.272752,0.170275,0.164298,0.16899,0.192749
0.105339,0.101555,0.095627,0.129274,0.124694,0.099931,0.113115,0.183718,0.209559,0.233928,0.255127,0.162135,0.163255,0.175117,0.18232,0.189949,0.136505,0.132816,0.161141,0.146599,0.124048,0.171784,0.262878,0.268613,0.190829,0.18765,0.172547,0.15991
0.088541,0.068948,0.071584,0.105123,0.088069,0.058409,0.09172,0.184723,0.189216,0.195295,0.212375,0.154655,0.161791,0.140015,0.145694,0.154311,0.122174,0.112669,0.113705,0.112183,0.107903,0.15357,0.204616,0.214214,0.188846,0.192398,0.169606,0.135706
0.068183,0.043026,0.050327,0.095224,0.080061,0.040594,0.073928,0.157206,0.151922,0.155275,0.157773,0.139604,0.15279,0.101296,0.107319,0.134107,0.105982,0.108407,0.122049,0.121014,0.115275,0.134883,0.130991,0.131739,0.149304,0.16035,0.148416,0.14036
0.068692,0.039497,0.040233,0.083939,0.072528,0.036469,0.071101,0.123293,0.11211,0.114801,0.112314,0.125328,0.138441,0.087254,0.087927,0.110901,0.096014,0.12434,0.15349,0.134361,0.129265,0.133186,0.084636,0.067956,0.096291,0.10886,0.11594,0.144816
0.06935,0.0407,0.034744,0.070331,0.061931,0.037832,0.071834,0.102185,0.110825,0.10632,0.07879,0.096969,0.112914,0.077007,0.073067,0.081983,0.088148,0.135613,0.16815,0.128913,0.129841,0.13798,0.073693,0.062801,0.081067,0.09001,0.097134,0.125711
0.060718,0.040955,0.040302,0.066944,0.054639,0.044659,0.068425,0.078334,0.112076,0.115655,0.071727,0.070277,0.090786,0.074491,0.066623,0.06821,0.09062,0.126964,0.15187,0.115337,0.127002,0.138288,0.073638,0.071147,0.081332,0.089434,0.080776,0.087081
