0.009883,0.009121,0.011764,0.017485,0.046287,0.135901,0.143008,0.082356,0.080822,0.126027,0.300766,0.67422,1.115376,1.170891,1.011399,0.951962,0.86579,0.795453,0.860055,0.947185,0.936275,0.670352,0.362644,0.240952,0.171746,0.227002,0.224662,0.132532
0.012132,0.011055,0.014097,0.020439,0.053864,0.159362,0.16854,0.09804,0.096898,0.149805,0.347932,0.766276,1.255456,1.305239,1.13522,1.075204,0.983579,0.914151,0.976244,1.058798,1.034195,0.748207,0.413375,0.270652,0.193812,0.260396,0.258609,0.154213
0.015759,0.014153,0.017915,0.02524,0.064588,0.190455,0.203967,0.122752,0.122061,0.183458,0.405498,0.878489,1.454187,1.5125,1.31753,1.244528,1.154497,1.097737,1.142335,1.199617,1.143136,0.842577,0.478578,0.302181,0.21773,0.29911,0.298783,0.1815
0.018034,0.01622,0.020558,0.02882,0.068722,0.195206,0.212437,0.135201,0.133742,0.192912,0.405355,0.908054,1.58754,1.677912,1.441676,1.352194,1.277489,1.232746,1.220481,1.207794,1.120765,0.845103,0.488488,0.294183,0.212771,0.290771,0.28957,0.179505
0.018344,0.017046,0.022045,0.031996,0.071013,0.19002,0.20704,0.133867,0.127588,0.178878,0.371922,0.922319,1.758488,1.925994,1.631978,1.538439,1.476304,1.38674,1.261344,1.158707,1.072658,0.809768,0.455095,0.266066,0.197055,0.265161,0.260708,0.15965
0.018427,0.017462,0.023929,0.036271,0.079229,0.198583,0.209724,0.133086,0.127524,0.17263,0.362102,0.993068,2.049974,2.395499,2.073628,1.945387,1.872331,1.689943,1.451046,1.270462,1.14926,0.827794,0.439474,0.260988,0.194411,0.272881,0.271664,0.1574
0.021965,0.020155,0.030099,0.046539,0.10414,0.240109,0.234626,0.147079,0.155881,0.199372,0.406711,1.243782,2.616348,3.116998,2.82927,2.678283,2.573768,2.370727,2.122317,1.881306,1.602012,1.079683,0.54586,0.317849,0.233246,0.349544,0.34577,0.177882
0.02944,0.026661,0.043374,0.06692,0.153956,0.347529,0.315083,0.183961,0.211527,0.258904,0.52676,1.779333,3.622819,4.281786,4.252203,4.21399,3.990102,3.759381,3.54491,3.21492,2.622361,1.707256,0.860552,0.481363,0.335749,0.49215,0.479603,0.222903
0.038447,0.036113,0.062488,0.096029,0.219295,0.495425,0.437387,0.241406,0.278695,0.333751,0.716335,2.641806,5.338924,6.449524,6.866891,6.962304,6.459525,6.132299,5.940119,5.305,4.116972,2.657539,1.387441,0.745463,0.494276,0.675362,0.640132,0.279338
0.047044,0.046716,0.08306,0.12783,0.283859,0.636032,0.561742,0.304993,0.333448,0.401529,0.938436,3.717427,7.720531,9.860594,10.704097,10.719231,9.950256,9.479712,9.165975,7.912896,5.846423,3.754015,2.048372,1.066823,0.688769,0.864537,0.780308,0.326248
0.053389,0.054527,0.097073,0.150524,0.329652,0.719704,0.634941,0.349309,0.362864,0.436684,1.096864,4.724822,10.191063,13.638848,14.68999,14.401949,13.575009,12.991125,12.249228,10.199373,7.293963,4.625232,2.658331,1.39549,0.894349,1.07278,0.924249,0.362321
0.054446,0.055161,0.098262,0.154616,0.337736,0.730418,0.647425,0.352655,0.349384,0.423659,1.101141,5.141321,11.624809,15.970146,16.721297,16.117334,15.660192,15.103329,13.588691,10.922291,7.830962,4.8653,2.884084,1.570869,1.008737,1.225837,1.036381,0.376104
0.048957,0.049441,0.089622,0.140714,0.301897,0.678264,0.61404,0.30811,0.280002,0.365519,0.944039,4.548605,10.71729,14.797314,15.034446,14.376651,14.472196,14.185465,12.085773,9.228519,6.677351,4.119327,2.510451,1.420868,0.917861,1.195358,1.018666,0.345234
0.043085,0.044465,0.083769,0.129755,0.248821,0.561982,0.527993,0.25289,0.201507,0.282976,0.713511,3.252323,7.699598,10.348048,10.393359,9.974207,10.0612,9.91282,8.042234,5.882139,4.430214,2.82491,1.754143,1.0139,0.668343,1.008932,0.877776,0.283754
0.046467,0.050608,0.102494,0.16469,0.263177,0.499585,0.476151,0.24625,0.166812,0.208855,0.504148,2.093977,4.743213,5.813803,5.780929,5.675755,5.406879,5.029463,3.892645,3.143381,2.940421,1.969772,1.075567,0.651301,0.444645,0.779058,0.686341,0.22566
0.063375,0.072443,0.145005,0.237642,0.36111,0.644788,0.615676,0.325452,0.209273,0.194086,0.404687,1.689111,3.791615,4.063284,3.496089,3.747089,3.846699,3.176253,2.126957,2.096093,2.682471,1.874727,0.829461,0.563851,0.383656,0.682155,0.612195,0.23352
0.092965,0.108097,0.207856,0.336044,0.510387,0.947907,0.89574,0.444377,0.283922,0.215059,0.406222,1.857212,4.283069,4.524129,3.496592,3.71632,4.273436,3.545447,2.033015,1.96816,3.040318,2.263665,0.997779,0.74068,0.473364,0.77622,0.69871,0.2923
0.12147,0.142062,0.263555,0.41661,0.638893,1.234637,1.150481,0.546981,0.35994,0.252018,0.46367,2.07572,4.918953,5.55893,4.465632,4.513569,5.300216,4.533796,2.47362,2.17532,3.392015,2.577207,1.250604,0.961529,0.587885,0.916437,0.816127,0.342693
0.13341,0.15616,0.282797,0.433884,0.688054,1.377008,1.268615,0.601763,0.406943,0.274056,0.512257,2.123136,5.622738,7.207691,5.883471,5.44862,6.46031,5.733174,3.102253,2.378006,3.445205,2.612857,1.419339,1.092576,0.628784,0.942414,0.841519,0.353678
0.128921,0.149206,0.269705,0.398069,0.649623,1.314627,1.198322,0.587668,0.400018,0.263594,0.548625,2.294487,6.803183,9.378969,7.416018,6.373875,7.492644,6.640785,3.683807,2.495654,3.081936,2.339199,1.447204,1.081599,0.568672,0.84763,0.796457,0.344368
0.112121,0.129989,0.237625,0.332049,0.534493,1.101138,1.005429,0.494382,0.335798,0.23699,0.591952,2.745469,8.175817,10.94414,8.081159,6.609138,7.768442,6.852373,3.99368,2.569818,2.630553,2.006724,1.312179,0.913141,0.451654,0.691502,0.720102,0.346413
0.085792,0.101744,0.187432,0.248661,0.386514,0.82182,0.762151,0.361612,0.237067,0.196135,0.578162,2.999328,8.418959,10.357181,7.091848,5.920886,7.157443,6.209759,3.765221,2.529655,2.251648,1.706546,1.107239,0.700943,0.348559,0.530254,0.630905,0.353534
0.066581,0.072109,0.135403,0.186307,0.290479,0.636076,0.590308,0.256782,0.158766,0.149367,0.486906,2.731092,6.892096,7.550679,4.912177,4.65779,5.858317,5.124705,3.392248,2.450782,1.997535,1.425479,0.877153,0.524681,0.30054,0.451674,0.553802,0.326173
0.063995,0.059032,0.099977,0.139948,0.229319,0.530206,0.49413,0.198812,0.118435,0.11553,0.386072,2.20353,4.886423,4.723145,3.157511,3.512057,4.424626,4.113457,3.067936,2.286667,1.718985,1.117151,0.702713,0.458063,0.311309,0.446946,0.469899,0.251335
0.058764,0.052068,0.077274,0.102281,0.174819,0.428914,0.411203,0.164762,0.096624,0.099561,0.316453,1.665358,3.35886,3.082634,2.514934,3.148064,3.620961,3.304662,2.719463,2.115476,1.389811,0.828738,0.570839,0.406232,0.301104,0.424701,0.369399,0.165994
0.045729,0.043418,0.063429,0.078391,0.140848,0.341451,0.338371,0.155883,0.092772,0.099038,0.337654,1.552222,2.90033,2.620374,2.362868,2.931386,3.071778,2.731568,2.522321,2.130448,1.283123,0.656663,0.445506,0.31487,0.260171,0.420906,0.356946,0.143328
0.038688,0.03637,0.057644,0.0703,0.125819,0.29492,0.304253,0.165495,0.096059,0.104573,0.432827,1.784394,3.032298,2.638886,2.196466,2.448061,2.618953,2.37814,2.189584,2.037424,1.342229,0.645292,0.384247,0.266455,0.241386,0.428417,0.383641,0.153425
0.039457,0.033509,0.051177,0.063926,0.119315,0.298533,0.332485,0.195815,0.09899,0.11429,0.542362,2.027105,3.040303,2.462653,1.969237,1.909647,2.056348,1.871783,1.545833,1.595851,1.242822,0.649253,0.392795,0.271186,0.251572,0.448756,0.421154,0.176892
0.042462,0.036455,0.048212,0.062195,0.111047,0.298657,0.358502,0.21455,0.100072,0.128228,0.593146,2.081703,2.939406,2.266527,1.769206,1.564176,1.556629,1.422965,1.119604,1.120776,0.929537,0.550491,0.354183,0.24511,0.260756,0.491727,0.479694,0.205126
0.047115,0.042958,0.048522,0.066489,0.113104,0.294549,0.356251,0.209708,0.101017,0.136098,0.563284,1.941612,3.08619,2.537502,1.755417,1.39793,1.252399,1.140957,0.968243,0.884751,0.629094,0.412249,0.298374,0.205808,0.242724,0.468443,0.494071,0.223224
0.056909,0.055664,0.055954,0.076561,0.124885,0.282018,0.337064,0.212145,0.110438,0.130614,0.490881,1.715348,3.173942,2.750648,1.697089,1.234625,0.966924,0.912389,0.84194,0.792324,0.539047,0.371128,0.305986,0.202649,0.193374,0.351352,0.419154,0.208762
0.063902,0.06579,0.064136,0.083624,0.123518,0.235177,0.301578,0.220882,0.117902,0.117945,0.400238,1.665794,3.365987,3.028091,1.825699,1.14641,0.74653,0.809134,0.811778,0.765329,0.564923,0.378709,0.318888,0.211027,0.140428,0.239698,0.323221,0.178962
0.059414,0.063522,0.060954,0.074352,0.101617,0.167111,0.23554,0.194702,0.102608,0.106346,0.347892,1.593833,3.240308,3.163329,1.971458,1.116428,0.766999,0.803905,0.704337,0.627008,0.563061,0.392095,0.285183,0.199119,0.13424,0.234238,0.28921,0.151808
0.044263,0.048438,0.046041,0.050971,0.073391,0.123986,0.178658,0.142274,0.069524,0.084947,0.340864,1.463033,2.819084,2.933132,1.852864,1.069092,0.864294,0.726566,0.501533,0.417301,0.51796,0.414628,0.234718,0.18118,0.154015,0.228503,0.252033,0.131354
0.032357,0.034377,0.033248,0.031379,0.045109,0.092285,0.135624,0.100768,0.044714,0.05636,0.34219,1.394426,2.581031,2.548644,1.541841,0.952839,0.880173,0.599854,0.330122,0.299595,0.476364,0.405987,0.203491,0.194509,0.205918,0.232134,0.204789,0.112166
0.025429,0.027984,0.029556,0.025283,0.031195,0.061031,0.092888,0.082687,0.038258,0.038023,0.332298,1.223869,2.063269,1.89888,1.183951,0.776103,0.788695,0.538546,0.257488,0.276388,0.448302,0.365323,0.202974,0.214448,0.266742,0.286893,0.190611,0.093521
0.021098,0.020738,0.025393,0.023889,0.031501,0.047753,0.061078,0.067654,0.036706,0.032877,0.297404,0.951039,1.412557,1.313689,0.846279,0.51069,0.578167,0.485324,0.310933,0.312712,0.393159,0.315879,0.203524,0.210952,0.311979,0.369395,0.219427,0.091934
0.021937,0.014896,0.020228,0.022273,0.033899,0.048779,0.059496,0.064336,0.035735,0.033185,0.232443,0.845072,1.254544,1.189881,0.737221,0.356438,0.416677,0.412833,0.392435,0.363552,0.328201,0.29738,0.239649,0.229543,0.358303,0.441775,0.251995,0.099538
0.025174,0.017016,0.01891,0.025916,0.038308,0.053869,0.066251,0.060433,0.030638,0.030364,0.16673,0.855319,1.564079,1.538022,0.853851,0.404072,0.435079,0.425237,0.467378,0.420859,0.315373,0.299631,0.318096,0.305551,0.455888,0.54139,0.303591,0.110933
0.028033,0.025499,0.022669,0.033775,0.044257,0.05309,0.066665,0.052904,0.021786,0.031884,0.168368,0.939137,1.866418,2.0702,1.21677,0.513696,0.461246,0.434325,0.4973,0.427798,0.303318,0.292374,0.386681,0.374912,0.547712,0.69207,0.411772,0.131089
