3.4e-05,0.000116,4.9e-05,0.000118,1.5e-05,1.5e-05,3.6e-05,7e-05,7.5e-05,8.6e-05,1e-06,0.000143,1.5e-05,8e-06,0.000215,0.000126,2.8e-05,1.4e-05,7.1e-05,5.3e-05,0.000268,2.3e-05,9.9e-05,2.4e-05,3.4e-05,0.000225,9.7e-05,4.5e-05,4e-05,9.9e-05,7e-05,0.000132,0.000145,5e-05,8.4e-05,4e-05,1.4e-05,2.2e-05,1.4e-05,1.7e-05,0.000118,5.1e-05,6e-06,4.9e-05,1.7e-05,0.000129,2.4e-05,4.4e-05,6e-05,9e-06,9.8e-05,4.7e-05,5e-05,0.000131,3.9e-05,0.000122,4.4e-05,3.5e-05,4.7e-05,8.1e-05,1e-06,0.000144,1.9e-05,9.6e-05,2.5e-05,0.00015,6.3e-05,1.7e-05,3.2e-05,0.000106,8.3e-05,2.2e-05,1.1e-05,7.2e-05,2e-05,4.6e-05,2.4e-05,0,1.6e-05,2.9e-05,2.6e-05,2.6e-05,4e-06,7.5e-05,1.6e-05,3.8e-05,0.000108,1.2e-05,4.6e-05,3e-06,3.1e-05,6.9e-05,2e-05,1.8e-05,0.000104,6.4e-05,0.000108,2.1e-05,2.9e-05,9.2e-05,2.8e-05,4.1e-05,5.6e-05,1.2e-05,1e-06,5.6e-05,6.1e-05,1e-05,7.8e-05,2e-06,3e-06,9.1e-05,1.2e-05,0.000115,7e-06,3.4e-05,0.000136,3.6e-05,5.1e-05,0.000103,2.5e-05
0.000132,0.000152,9.6e-05,0.000215,0.000102,0.000109,7.3e-05,9.3e-05,0.000129,0.000232,0.000102,0.00035,8.1e-05,6.8e-05,0.000391,0.000289,5.2e-05,0.000109,0.000122,7.8e-05,0.000548,6.4e-05,0.000235,7.5e-05,0.000116,0.000464,0.000265,0.000129,0.000187,0.000209,1e-04,0.000272,0.000129,0.000276,4.2e-05,6e-05,0.000213,0.000211,0.00017,0.000104,0.000236,0.000151,3.4e-05,9.1e-05,6.9e-05,0.000175,0.000194,0.000201,0.000131,0.000106,0.000185,0.000143,0.000171,0.000295,4.5e-05,0.000201,0.000146,7.5e-05,9.1e-05,0.000242,0.000103,0.000351,0.000177,0.000236,3.5e-05,0.000286,0.000147,1.9e-05,0.000109,0.000217,0.000148,6.5e-05,8.2e-05,0.000132,8.3e-05,5.1e-05,0.000103,3.9e-05,2.7e-05,5.6e-05,7.1e-05,3.8e-05,3.4e-05,0.000154,3.4e-05,7.7e-05,0.000148,3.1e-05,0.000185,7.2e-05,3.1e-05,9e-05,7.7e-05,9.8e-05,0.000283,0.000139,0.000231,3.6e-05,0.000125,0.000197,2.6e-05,6.6e-05,0.000114,7.6e-05,3.7e-05,0.000121,7.1e-05,0.000129,0.000128,3.7e-05,4.8e-05,0.000215,1.5e-05,0.000274,4.9e-05,6.5e-05,0.000345,0.000171,0.000137,0.000196,1.4e-05
2e-04,0.000338,0.000279,0.00027,0.000317,0.000179,0.000162,0.000239,0.000234,0.000407,0.000163,0.000202,0.000303,0.000237,0.000367,0.000322,0.000104,0.000221,6.4e-05,0.000257,0.000772,8e-05,0.000395,0.000146,0.00027,0.000578,0.000481,0.000298,0.000125,0.000391,0.000345,0.000358,0.000138,0.000445,0.00022,0.000122,0.000233,0.000119,0.000308,6.8e-05,0.000244,0.00036,0.000152,0.00016,0.000146,0.000208,0.000176,0.000111,0.000269,0.000121,9.1e-05,0.000347,0.000234,0.000295,0.000298,0.000441,0.000121,0.00017,0.000246,0.000342,8.2e-05,0.000423,0.000235,1e-04,0.000222,0.000466,9.8e-05,0.000129,3.5e-05,0.000407,0.00026,4e-05,0.000115,3.5e-05,0.000159,9.4e-05,0.000127,6.2e-05,7e-06,2.9e-05,4.8e-05,4.8e-05,0.000141,0.000202,3.2e-05,0.000115,0.000249,7.5e-05,0.000173,2.1e-05,6e-05,5.9e-05,7.2e-05,0.000189,0.000288,0.000132,0.000258,0.000135,9.7e-05,0.000271,0.000204,0.000111,1.9e-05,5.6e-05,8.9e-05,2e-04,3.7e-05,8.8e-05,0.000111,3.3e-05,0.000179,0.000306,0.000156,0.000336,0.000198,0.000153,0.000295,0.000111,0.000152,0.000444,8.6e-05
1.7e-05,0.000539,0.000364,0.000286,0.000285,0.000432,0.000618,0.000191,8.9e-05,0.000677,0.000277,0.000806,0.000377,0.000449,0.000454,0.000684,0.000218,0.000247,0.000409,0.000192,0.001051,0.000408,0.000496,0.000147,0.000465,0.000621,0.000647,0.000635,0.000606,0.000333,0.00051,0.000319,0.000242,0.000214,0.000274,5.4e-05,0.000251,0.000166,0.000309,0.000438,0.000134,0.000273,0.00025,0.000273,0.000244,0.000336,3e-05,0.000171,0.000383,0.000316,0.000465,0.00042,0.000308,0.000741,0.000356,0.000323,0.000195,0.000209,0.000413,0.000338,0.000331,0.000335,0.00075,0.000406,0.000216,0.000358,0.000149,0.000386,6.6e-05,0.000495,0.000251,0.000213,0.000354,0.000181,0.00023,0.000239,0.000138,4.8e-05,0.00014,5.1e-05,3.8e-05,0.000155,0.000154,0.000414,0.000172,0.00019,0.000436,0.000145,0.000397,0.000194,0.000169,0.000289,3.1e-05,0.000151,5e-04,0.000464,0.000315,0.000274,0.000149,0.000269,0.000156,0.000133,0.000168,0.000238,0.000322,6.7e-05,0.000315,0.000105,0.00018,8.1e-05,0.000159,0.000164,0.000132,0.000194,0.000525,0.000224,0.000463,0.00029,6.6e-05,0.000743,0.000568
0.000417,0.000881,0.000453,0.000452,0.000184,0.000362,0.000416,0.000875,0.001083,0.001339,0.001065,0.001382,0.001242,0.000623,0.000641,0.001016,0.000853,0.000681,0.000199,0.000354,0.001357,0.001449,0.00112,0.000676,0.000749,0.001409,0.001296,0.000418,0.000674,0.000302,5.2e-05,0.000756,0.000756,9e-04,0.00085,0.000305,0.000598,0.000546,0.000551,0.000682,0.00103,0.000427,9.5e-05,0.000343,0.000602,0.000451,0.000446,0.000223,0.000652,0.00086,0.001515,0.000996,0.000174,0.001037,0.001253,0.0013,0.000708,0.000203,0.000494,0.000755,0.000426,0.000396,0.001165,0.001018,0.000823,0.000525,0.000936,0.00093,0.001034,0.001084,0.00134,0.000742,0.000597,0.000259,0.000103,0.00047,0.000543,0.000176,0.000364,0.000596,0.00065,9.5e-05,0.000173,0.000578,0.000291,0.00023,0.000897,0.000749,0.000948,0.000404,0.000613,0.00047,0.000335,0.000147,0.000652,0.00102,0.001006,0.000444,0.000447,0.000305,0.000513,0.000378,0.000516,8.4e-05,0.00039,0.000157,0.000576,0.000538,0.000501,0.000264,0.000165,0.000334,0.000154,0.000293,0.000463,0.000774,0.001118,0.000716,0.000456,0.000836,0.001243
0.000339,0.000488,0.000549,0.000458,0.000346,0.000237,0.000446,9e-04,0.000416,0.000873,0.001168,0.000289,0.000384,0.000621,0.00069,0.00101,0.000778,0.000125,0.000427,8.7e-05,0.000438,0.00118,0.000456,0.000592,0.000495,0.000608,0.00088,0.000895,0.000744,0.000326,0.000604,0.000971,0.000563,0.000681,0.000818,0.001198,0.001145,0.000592,0.00023,0.000571,0.000633,0.000716,0.000367,0.000123,0.000194,0.000276,0.000745,0.000541,0.000657,0.000393,0.000917,0.000466,0.000397,0.00083,0.000972,0.000593,0.000558,0.000687,0.000325,0.000667,0.000684,0.000483,0.000631,0.000967,0.000369,0.000606,0.000467,0.000742,0.001335,0.000749,0.000305,0.000217,0.000986,0.001016,0.000411,0.000729,0.000916,0.000697,0.000578,0.000921,0.000202,0.000412,0.000346,0.000888,0.000303,0.000296,0.000949,0.00051,0.000122,0.000452,0.000722,0.000124,0.000358,0.000327,0.000718,0.000619,0.000563,8.9e-05,0.000404,0.000295,0.000207,0.000278,0.000538,0.000396,0.000342,0.000454,0.000487,0.000341,0.000413,0.000487,0.00024,0.000195,0.000161,0.000667,0.00027,0.000494,0.000459,0.000522,0.000451,0.00022,0.000831
0.000217,0.000632,0.000294,0.001383,0.000655,0.000288,0.000709,0.00038,0.001037,0.001334,0.000402,0.000378,0.000258,0.000243,0.000786,0.000901,0.000953,0.000419,0.000489,0.000678,0.001027,0.001102,0.000974,0.000625,0.000485,0.000543,0.000169,0.000283,0.000785,0.000617,0.000895,0.000665,0.000587,0.000533,0.000323,0.000965,0.000407,0.000577,0.000361,0.000332,0.000385,0.000479,0.000473,0.00028,0.000371,0.000502,0.000347,0.000435,0.000677,0.00052,0.000322,0.000785,0.000343,0.000913,0.000787,0.000248,0.000571,0.000959,0.000366,0.001022,0.000267,0.000492,0.00053,0.000496,0.001212,0.001203,0.00049,0.000975,0.000733,0.000565,0.000804,0.00045,0.000817,0.000433,0.000675,0.001135,0.000682,0.000316,0.000448,0.001234,0.001054,0.000861,0.000261,0.000791,0.000593,0.000343,0.000426,0.000347,0.000952,0.000553,0.000778,0.000311,0.000705,0.000118,0.000736,0.000497,0.000874,0.000735,0.00036,0.000484,0.000248,0.000606,0.000248,4.6e-05,0.000586,0.000172,0.000607,0.00029,0.00072,0.000715,9.6e-05,0.000165,0.000438,0.001203,0.000861,0.000747,0.000183,0.000868,0.000311,0.000418,0.000332
0.000959,0.001344,0.001887,0.002753,0.002437,0.001502,0.001452,0.001229,0.001287,0.00099,0.000675,0.000652,0.000871,0.000464,0.001792,0.001902,0.001038,0.000866,0.000736,0.001494,0.002472,0.00171,0.001165,0.000531,0.001227,0.001729,0.001332,0.000326,0.00069,0.0014,0.000659,0.001568,0.002052,0.001092,0.000556,0.00113,0.000688,0.000627,0.001239,0.001056,0.000393,0.000158,0.000531,0.000233,0.000834,0.001165,0.000657,0.000934,0.000176,0.000288,0.000361,0.000898,0.00148,0.002113,0.00252,0.001022,0.000134,0.000994,0.000885,0.000952,0.001216,0.000657,0.000892,0.000571,0.000809,0.002176,0.001909,0.000312,0.001198,0.00161,0.000282,0.001278,0.001157,0.001424,0.000872,0.000815,0.000631,0.001047,0.00071,0.001718,0.001015,0.000283,0.000101,0.000633,0.001215,0.001075,0.000521,0.000728,0.001802,0.001907,0.001923,0.001203,0.000909,0.000443,0.000776,0.000102,0.001462,0.002102,0.001229,0.000991,0.001316,0.001451,0.000977,0.000415,0.000469,0.000717,0.001073,0.000625,0.000684,0.001711,0.001138,0.000574,7.2e-05,0.000816,0.000739,0.000373,0.000701,0.001253,0.000552,0.000193,0.000435
0.000965,0.000921,0.001783,0.000716,0.000926,5.9e-05,0.000484,0.001027,0.000714,0.00051,0.000212,0.000854,0.00114,0.000734,0.002104,0.001064,0.000373,0.000578,0.001271,0.00086,0.001671,0.001091,0.000322,0.000817,0.002222,0.001031,0.000776,0.001065,0.001261,0.000656,0.001727,0.001615,0.001345,0.001602,0.001298,0.000347,0.000732,0.000586,0.000724,0.000675,0.001092,0.000766,0.000966,0.000775,0.000928,0.001507,0.000691,0.001226,0.000876,0.000441,0.00075,0.000743,0.001169,0.000469,0.001747,0.00124,0.000589,0.000399,4.2e-05,0.001187,0.001128,0.001324,0.00061,6.8e-05,0.000438,0.001644,0.001127,0.001534,0.001167,0.000691,0.001535,0.001654,0.001162,0.000237,0.000196,0.000846,0.000759,0.001364,0.000581,0.000741,0.000686,0.000154,0.000105,0.000358,0.000694,0.00057,0.000654,0.000411,0.002304,0.001916,0.001432,0.001256,0.000298,0.000305,0.000454,0.000547,0.001058,0.000902,0.001364,0.00108,0.00192,0.000936,0.000362,0.000712,0.000585,0.001058,0.001216,0.00039,0.000285,0.001192,0.001738,0.000605,0.000405,0.000589,0.00032,0.00073,0.001022,0.000372,0.001343,0.000618,0.000369
0.000486,0.000447,0.00058,0.001518,0.000672,0.000582,0.000464,0.00093,0.001411,0.001805,0.001033,0.000458,0.000493,0.000982,0.000682,0.000589,0.00031,0.000436,0.000773,0.000944,0.0017,0.000565,0.000416,0.000974,0.001036,0.001059,0.00035,0.000262,0.000345,0.00022,0.001293,0.000805,0.000445,0.000397,0.000394,0.000411,0.000423,0.000635,0.000412,0.000344,0.000502,0.000166,0.000936,5e-05,0.000829,0.000979,0.000666,0.001338,0.000647,5.7e-05,0.000733,0.000545,0.000911,0.000718,0.000739,0.000533,0.000238,0.000231,0.000167,0.001322,0.000856,0.000489,0.000601,0.000219,0.000804,0.000589,0.000526,0.000809,0.00039,0.000619,0.000616,0.000336,6.8e-05,0.000587,0.000571,0.000489,0.000371,0.001234,0.000967,0.000211,0.000718,0.000762,0.000666,0.000703,0.000912,0.000575,0.00052,0.000455,0.001329,0.000301,0.00084,0.000108,0.000525,0.00052,0.000575,0.000474,0.000976,0.00091,0.000896,0.001466,0.000543,0.000629,0.000284,0.000641,0.000353,0.000819,0.000429,0.000531,0.000463,0.000453,0.001044,0.000943,0.000796,0.000621,0.000828,0.001232,0.000508,0.000487,0.001362,0.001319,0.000609
0.000283,0.000416,0.000551,0.001274,0.001338,0.001303,0.000652,0.000754,0.000809,0.000868,0.000734,0.000848,0.000527,0.000255,0.000369,0.000736,0.00073,0.000637,0.000875,0.000901,0.000522,0.000377,0.000351,0.000411,0.000853,0.000785,0.000823,0.000804,0.000639,0.000726,0.000603,0.000574,0.000682,0.000319,0.000144,0.000157,0.000543,0.000799,0.000606,0.000458,0.000341,0.000581,0.000944,0.001064,0.000292,0.001067,0.001295,0.00102,0.000739,0.000667,0.000379,0.000223,0.000708,0.000773,7.9e-05,0.000293,0.000504,0.000414,0.000457,0.001021,0.000304,0.000179,0.000226,0.000463,0.000555,8.3e-05,0.000162,0.000821,0.000794,0.000689,0.000349,4.6e-05,0.00011,0.000585,0.000415,0.000649,0.000961,0.000376,0.000244,0.000435,0.000692,0.00012,0.000482,0.000129,0.000566,0.000451,0.000789,0.000651,0.000654,0.00076,0.00019,0.000189,0.00047,0.000428,0.000539,0.000507,0.000209,0.000463,0.000231,0.000767,0.000859,0.000674,0.001068,0.000791,0.000577,0.000833,0.00025,0.000592,0.000803,0.000963,0.000586,0.000321,0.000661,2.9e-05,0.00057,0.000426,0.000249,0.000402,0.001386,0.001043,0.000869
0.000359,0.000331,0.000535,0.000375,0.000439,0.000198,0.00046,0.000619,9.9e-05,0.000491,6.1e-05,0.000562,0.000316,0.000273,0.000329,0.000214,0.000233,0.000271,0.000206,6.7e-05,0.000443,7.4e-05,0.000432,0.000121,0.000318,0.000214,0.000307,0.00043,0.000374,0.000339,0.000154,0.000255,0.000225,2.6e-05,0.000144,0.000154,0.00027,0.000272,0.000207,3e-05,0.000134,0.00045,0.000288,0.000289,0.000482,0.001043,0.000368,0.000324,0.000114,0.000247,0.000251,0.000253,0.00053,0.000433,3e-04,0.000365,0.000115,0.000144,0.000153,0.000478,0.000253,9.4e-05,9.1e-05,0.000204,0.000184,0.000135,9.4e-05,0.000287,0.000253,0.000235,3.7e-05,0.000171,0.000168,0.000326,2e-04,9.3e-05,0.000369,0.000101,0.000239,0.000494,0.000317,0.000362,7.5e-05,0.000179,0.000296,6.4e-05,4e-04,0.000408,0.000403,0.000276,0.000226,0.000112,0.000316,0.000165,0.000175,0.000165,3e-05,0.000578,0.000305,0.000593,0.000337,0.000353,0.000702,0.000471,0.000192,0.000208,5e-05,0.00039,0.000253,0.000658,0.000241,0.000217,0.000245,0.000471,0.000156,0.00041,3.9e-05,0.000443,0.000406,0.000171,0.000311
0.000208,0.000326,0.000288,0.000293,0.000269,0.000153,0.000203,0.000288,0.000147,0.000179,4e-05,0.000343,0.000125,0.000346,0.000202,0.000165,8.2e-05,0.000162,0.000128,6.2e-05,0.00025,0.000107,2e-04,6.8e-05,0.000256,0.000227,0.00016,0.000345,0.000259,0.000143,0.000142,0.000176,7.8e-05,0.000173,0.000174,4.9e-05,0.00012,0.000168,0.000289,0.000149,0.000143,0.000375,4.5e-05,0.000328,0.00034,0.00034,5.4e-05,0.000104,0.000128,0.000157,0.000168,0.000192,0.000302,0.000253,0.000194,0.000188,6.3e-05,9.4e-05,0.000104,0.000166,7.8e-05,9e-06,8.9e-05,0.000104,0.000226,9.5e-05,0.000164,0.000177,0.000218,7.1e-05,0.000153,0.000102,0.000156,0.000209,0.00013,3e-05,0.000377,0.00017,5.5e-05,0.000282,7.6e-05,0.00011,0.000188,0.000136,0.00017,3e-05,0.000106,0.000253,0.00028,0.000104,0.000229,0.000164,0.000131,0.00012,0.000151,0.00019,0.000101,0.000371,0.00014,0.000274,0.000253,0.000207,0.000392,0.000189,2.2e-05,0.000151,8.9e-05,9e-05,0.000164,0.00049,0.000138,0.000117,0.000104,0.000247,8.8e-05,0.000242,9.7e-05,0.000192,0.000237,0.000215,0.000272
0.000182,0.000251,0.00028,0.000199,0.000218,0.000188,0.00012,0.000209,7.8e-05,0.000236,0.00013,0.000221,0.000111,0.000328,0.000231,0.000269,0.000154,0.000247,0.000139,0.000142,0.000311,0.000179,0.000224,0.000136,0.000183,0.00018,0.00013,0.000329,0.000253,8.4e-05,0.000105,0.000194,8.8e-05,0.000186,0.000156,4.6e-05,0.000125,0.000111,0.000297,0.000223,0.000151,0.000503,8.1e-05,0.000283,0.000186,0.000135,0.000138,0.000148,0.000132,4.1e-05,0.000208,7.5e-05,0.000285,0.000266,0.000155,0.000163,7.1e-05,0.000108,9.4e-05,0.000242,5.1e-05,6.6e-05,0.000112,5.4e-05,0.000273,9.2e-05,0.000149,0.000227,0.000214,0.000149,0.000124,0.000189,0.000148,1e-04,9.1e-05,9.7e-05,0.000377,0.000147,0.000126,0.000148,4.6e-05,0.000136,0.000234,7.4e-05,0.000189,0.000113,9.7e-05,0.000165,0.000302,0.000116,0.000163,0.000155,0.000106,9.5e-05,5.1e-05,0.000206,1e-04,0.00027,0.000104,0.000126,0.000136,0.00012,0.000256,0.00018,0.000138,0.000193,8.8e-05,4.2e-05,0.000165,0.000422,0.000187,0.000168,5.3e-05,0.000119,0.000146,0.000156,7.8e-05,0.000115,0.000161,0.00035,0.000262
0.000219,0.000298,0.000185,0.00011,0.000305,0.000131,0.000175,0.000208,0.000262,0.000156,0.000257,0.000281,7.3e-05,0.000449,0.000176,0.000325,0.000213,0.000364,3.4e-05,0.000423,8.8e-05,0.000233,0.00035,3.7e-05,0.000261,0.000146,0.000108,0.000408,0.000227,0.000193,0.000163,0.000187,0.000121,0.000173,0.000213,0.000134,0.000305,0.000348,0.000406,0.000147,0.000158,0.000546,0.000386,0.000213,9.1e-05,0.000118,2.4e-05,6.8e-05,0.000108,0.000217,0.000153,0.000131,0.000364,0.000217,0.000115,0.00027,5.1e-05,9.5e-05,6.7e-05,0.000224,0.000119,1e-05,0.000343,0.000103,0.000203,0.000248,0.000201,0.000234,0.000222,0.000152,0.000153,0.000193,8.9e-05,0.000202,0.000113,0.000168,0.000531,0.000304,5.2e-05,0.000271,3.1e-05,0.000191,0.000307,0.000119,0.000258,4.2e-05,0.000116,0.000445,0.000498,0.000185,0.000296,0.000204,0.000122,0.000145,4e-05,0.000234,3e-05,0.000419,0.00019,0.000388,0.000315,0.000166,0.000233,7.7e-05,9.6e-05,8.9e-05,0.000129,9.2e-05,0.000186,0.000312,0.000169,0.000157,0.000155,8.8e-05,7.7e-05,0.000195,9.6e-05,9.7e-05,0.000157,0.000434,0.00031
0.000537,0.000377,0.000474,0.000373,0.000237,7.8e-05,0.000176,2e-04,0.000555,0.000201,0.000428,0.00107,0.000362,0.000341,0.000431,0.00068,0.000108,0.000558,0.00068,0.000488,0.000281,0.00026,0.000256,0.000297,0.000332,0.000332,0.000346,0.000611,0.000659,0.000314,0.000157,0.000229,0.000156,4.3e-05,0.000472,0.000576,0.000781,0.00023,0.000758,0.000259,0.000299,0.00053,0.000185,8e-04,0.000208,0.000133,0.000223,0.000454,7.2e-05,0.000378,0.000252,0.000337,0.000316,0.000372,0.000256,0.000381,0.00046,0.000125,0.00031,0.000292,7.6e-05,0.000382,0.000487,0.000276,7.8e-05,0.000805,0.000223,0.000486,0.000387,9.3e-05,0.000537,0.000325,0.000253,0.000257,0.000185,0.00027,0.000396,0.000202,0.000292,0.000174,0.000236,0.000348,0.00018,0.000593,0.000151,0.000158,0.000445,6e-04,0.000174,0.000633,0.000675,0.000132,0.000158,0.000246,0.000327,0.000293,0.000139,0.000502,0.000482,9e-04,0.00012,0.000289,0.000218,0.000155,6.4e-05,7.9e-05,0.000173,0.000248,0.000313,0.000393,0.000341,0.000306,0.000242,0.000153,0.000145,0.000112,0.000345,0.000339,0.000202,0.000817,0.000676
0.000951,0.000568,0.000653,0.000255,0.000258,0.000491,0.000253,0.000422,0.00101,0.001444,0.000321,0.001622,0.00145,0.00024,0.000231,0.001042,0.001263,0.001066,0.001794,0.001866,0.001036,7.4e-05,0.000222,0.000335,0.00056,0.00048,3.1e-05,0.000854,0.001215,0.001676,0.001273,0.000889,0.000114,0.000307,0.000405,0.000473,0.000429,0.001077,0.001803,0.001738,0.001251,0.001241,0.00098,0.000971,0.001076,0.000287,0.000299,0.000934,0.000882,0.000303,0.000265,0.000474,0.000771,0.000335,9e-05,0.000519,0.000828,0.000945,0.000523,0.000273,0.000143,0.00087,0.000823,0.000681,0.000501,0.001235,0.001389,0.001507,0.001377,0.001158,0.00096,0.001186,0.001115,0.000437,0.000244,0.000517,0.000844,0.000829,0.000758,0.000574,0.000435,4.7e-05,0.000569,0.001168,0.001091,0.000741,0.001159,0.001659,0.001346,0.001185,0.001413,0.001256,0.001022,0.000633,0.000306,0.000665,0.000797,0.000106,0.000422,0.000622,0.001163,0.001046,0.000893,0.000591,0.000291,0.000275,0.000425,0.000283,0.000202,0.000469,0.000775,0.000913,0.000955,0.000933,0.000365,0.000157,0.000656,0.000236,0.000442,0.001454,0.002009
0.000351,0.000398,0.000558,0.000281,2.3e-05,0.000606,0.000425,0.00053,0.000713,0.001021,0.001174,0.000811,0.000827,0.000966,0.000499,0.000838,0.001319,0.001568,0.001019,8e-04,0.000486,0.000528,0.000111,0.000384,0.000454,0.000146,0.000406,0.000627,0.000283,0.001162,0.000913,0.000269,0.000886,0.00042,0.000521,0.000442,0.000798,0.001504,0.00169,0.000965,0.000363,0.000742,0.00109,0.00121,0.000585,0.000647,0.000127,0.000854,0.000501,0.000719,0.000487,0.00082,0.000663,0.000498,0.000122,0.000358,0.000364,0.000568,0.000381,0.000411,0.000329,0.000854,0.000507,0.000471,2e-04,0.000809,0.000667,0.000775,0.001106,0.000505,0.000718,0.000304,0.000382,0.000356,0.000394,0.000199,0.000436,0.000642,0.000314,0.000212,0.000124,0.000147,0.000529,0.000799,0.000186,0.000145,0.000775,0.00117,0.000943,0.000756,0.000755,0.000975,0.000537,0.000651,0.000982,0.000842,0.000238,0.000502,0.000375,0.000519,0.001041,0.000643,0.000318,0.000371,0.000247,0.000456,0.000504,0.000272,8.4e-05,0.000833,0.001175,0.000676,0.000339,0.000439,0.000277,0.000326,0.000332,0.000272,0.000507,0.000765,0.000801
0.000572,0.000206,0.000551,0.000429,0.000259,0.000505,0.000299,0.000408,0.000501,0.000423,0.000441,0.00116,0.000368,0.000525,0.000249,0.00032,0.000774,0.000144,0.000527,0.000181,0.000237,0.000208,0.000183,0.000428,0.00034,0.000325,0.000294,0.000314,0.000224,0.000767,0.000207,0.000104,0.000678,0.000537,0.000556,0.000408,0.000535,0.000519,0.000472,0.00026,4.8e-05,0.000676,0.000238,0.000262,0.000303,0.000194,0.000187,0.000599,0.000303,0.000589,0.000202,0.000655,0.000248,0.000191,0.000461,0.000216,0.000359,0.000142,1e-05,0.000226,0.000259,0.000688,0.000231,0.000248,0.000557,0.000779,0.000197,0.000578,0.000178,0.00052,0.000323,0.000484,0.000292,0.000226,0.000259,0.000148,0.000293,0.000265,0.000436,0.000289,3.4e-05,2.9e-05,0.000236,0.000141,0.00029,3.9e-05,0.000546,0.000701,0.000155,0.00021,0.000519,0.000214,0.000731,5.4e-05,0.000424,0.000342,0.000536,0.000339,6.1e-05,6.9e-05,0.000667,0.000229,0.000531,0.000242,0.000255,0.000654,0.000149,0.000122,0.000122,0.000594,0.000285,0.000289,6.7e-05,0.000463,0.000211,0.000234,0.000186,0.000123,0.000391,0.000302,0.000357
3.8e-05,8.6e-05,0.000325,0.000438,0.00042,0.000129,0.000124,5.4e-05,0.00034,0.000272,0.000174,0.00062,0.000677,0.00031,5.1e-05,0.000192,0.00039,0.000309,0.000332,2.1e-05,4e-05,0.000103,3.2e-05,0.000243,0.000173,5.5e-05,0.000305,0.000233,0.000183,0.000559,0.000284,0.000164,5e-04,0.000404,0.000113,0.000206,0.000348,0.000165,0.000111,8.5e-05,0.000124,0.000438,0.000553,0.000133,1.8e-05,6.9e-05,5.8e-05,1.7e-05,0.000128,0.000316,0.000217,0.000496,0.000167,6.2e-05,0.000269,0.000168,0.000444,0.000156,8.9e-05,0.000101,0.000117,8.9e-05,0.000201,0.000119,0.000207,0.000192,2.8e-05,0.000236,0.000193,0.000441,0.000336,0.000211,0.00019,0.000306,5.5e-05,0.000193,0.000167,0.000363,8.6e-05,0.000185,0.000151,0.000175,0.000222,0.00029,5.8e-05,0.00016,9e-05,0.00027,7.2e-05,0.000358,0.000413,7.1e-05,0.000369,0.000304,0.000364,0.000238,6e-05,0.000263,0.000261,0.000331,0.000373,0.00036,0.00024,0.000136,8.4e-05,0.000233,0.000186,0.000102,0.000152,0.000289,0.00034,0.000283,0.000211,0.000456,0.000323,0.000101,0.000112,0.000101,0.000178,7.4e-05,0.000117
0.00012,0.000123,0.000192,0.000298,9.9e-05,0.000146,0.000232,5.7e-05,0.000199,0.000272,0.000134,0.000326,0.000142,0.000163,0.000154,0.000403,0.000371,0.000157,0.000359,3e-05,5e-05,0.000116,0.000106,0.000141,0.000165,8.1e-05,9.7e-05,0.000152,9e-06,0.000177,0.000213,0.00011,0.000107,0.000118,0.000252,0.00025,0.000414,6.1e-05,4e-04,0.000268,6.2e-05,9.1e-05,0.000293,0.000104,0.00016,0.00024,0.000116,0.000311,8.4e-05,7.7e-05,6.7e-05,0.000252,0.000209,0.000189,8.1e-05,8.6e-05,0.000328,8.8e-05,0.000173,8.5e-05,0.000164,0.000261,4.6e-05,0.000157,0.000127,0.00015,0.000167,0.000153,0.000124,0.000236,0.000165,3.1e-05,0.000105,3e-04,0.000366,6.8e-05,5.4e-05,0.000217,0.000199,0.000172,0.000183,0.000201,0.000235,0.000152,7.8e-05,0.000153,0.000146,0.000349,7.5e-05,0.000301,0.000126,4.6e-05,8.6e-05,0.00014,0.000331,5.2e-05,7.6e-05,0.000317,0.000451,9.9e-05,0.000103,0.000294,0.000164,2.9e-05,1.2e-05,6.3e-05,0.00021,0.000264,0.000163,0.000225,0.00018,9.9e-05,0.000158,0.00022,9.3e-05,0.000151,2e-05,5.5e-05,0.000197,7.3e-05,0.000294
0.000134,0.000149,0.000161,5.3e-05,0.000121,7.7e-05,0.000183,9.1e-05,0.000233,0.000113,0.00011,1.5e-05,0.000285,0.000119,0.000133,0.000238,0.000169,0.000176,0.000302,0.000132,0.000196,0.000128,0.000109,0.000108,0.000111,6.2e-05,0.000141,0.00015,0.00018,0.000158,0.000149,5.1e-05,0.000167,4.4e-05,0.00013,9.5e-05,0.000182,0.000401,0.000181,8.7e-05,0.000223,0.000305,0.000122,0.000132,4.7e-05,0.000103,0.000192,2e-04,0.000261,6.8e-05,9.7e-05,0.000301,0.000221,9.1e-05,0.000145,5.6e-05,0.000246,0.000273,0.00031,0.000308,4.9e-05,0.000119,0.000142,0.000132,0.000151,0.00011,0.000139,0.000152,8.4e-05,0.000238,0.000158,0.000193,1.2e-05,0.000228,0.000102,0.000209,0.000187,0.000179,3.9e-05,6.6e-05,0.000136,0.000184,0.000151,0.000178,0.000107,9.5e-05,0.000204,0.000245,0.000184,5.9e-05,0.000225,0.000153,7.2e-05,0.000137,0.000387,0.000216,9e-05,0.000261,0.000202,0.000149,0.000134,9.7e-05,9.7e-05,9.6e-05,0.000108,0.000149,0.000165,0.000204,8.4e-05,0.000154,0.00012,0.000155,1e-04,0.000114,0.000148,0.000165,8.3e-05,5.9e-05,0.000177,8.8e-05,0.000211
4.3e-05,3.7e-05,0.000109,0.000122,8.1e-05,4.2e-05,5.7e-05,3.3e-05,6.4e-05,9.7e-05,7.2e-05,0.000104,0.000129,7.3e-05,5e-05,2.3e-05,8.1e-05,8.1e-05,7.2e-05,3.6e-05,8e-05,3.3e-05,6.3e-05,0.00011,0.00021,0.000112,3.5e-05,5.2e-05,6.6e-05,0.000135,0.000123,4.6e-05,8.2e-05,1.6e-05,1.3e-05,7.1e-05,7.4e-05,5.5e-05,5e-06,1.9e-05,9.2e-05,6.5e-05,8.3e-05,4.2e-05,4.3e-05,6.9e-05,0.000125,0.000129,0.000136,9.7e-05,9e-05,6.8e-05,5.1e-05,4.3e-05,9e-05,4.2e-05,7.2e-05,9.3e-05,5.1e-05,9e-05,0.000131,0.000106,8.8e-05,8.8e-05,0.00014,2.1e-05,5.3e-05,7.9e-05,4.1e-05,2.2e-05,2.9e-05,5e-05,4.8e-05,5.7e-05,0.000115,9.7e-05,0.000136,8.8e-05,4.1e-05,4.7e-05,4.4e-05,7.8e-05,8.4e-05,6e-05,2.1e-05,6e-05,2.3e-05,4.4e-05,4.4e-05,3.5e-05,0.000104,6.8e-05,5.5e-05,6.6e-05,0.000201,8.8e-05,3.7e-05,7.4e-05,3.1e-05,2.6e-05,0.000119,5e-06,7.5e-05,3.5e-05,3.2e-05,2.7e-05,2.3e-05,9.9e-05,6.2e-05,4.8e-05,5.3e-05,7.4e-05,6.4e-05,4.8e-05,8.6e-05,6.9e-05,1.9e-05,3.2e-05,1e-05,0.000111,6.8e-05
5.4e-05,4.2e-05,5.9e-05,2.1e-05,2.2e-05,5e-06,1.3e-05,3e-05,3.6e-05,7.3e-05,7.4e-05,0.000167,7.5e-05,7.6e-05,4.1e-05,8.6e-05,0.000108,5.1e-05,4.5e-05,7.5e-05,4.4e-05,5.3e-05,6.5e-05,4.6e-05,9.1e-05,3.7e-05,6.4e-05,9.1e-05,2e-05,0.000113,6.7e-05,4.8e-05,1.7e-05,6.5e-05,7.1e-05,9.7e-05,2.5e-05,4.9e-05,7.3e-05,3.9e-05,5.7e-05,3.5e-05,3e-05,5.1e-05,2.4e-05,5.4e-05,8.2e-05,8.8e-05,2.3e-05,6.4e-05,8e-06,8.6e-05,1.2e-05,3.9e-05,2.8e-05,6e-05,6e-05,3.3e-05,2.5e-05,7.4e-05,5e-06,6.1e-05,7.9e-05,2.2e-05,4.7e-05,5.4e-05,1.7e-05,6.4e-05,4.3e-05,2.5e-05,1.2e-05,9e-06,6.5e-05,1.3e-05,4.8e-05,2e-05,6.1e-05,3.8e-05,3e-05,5.1e-05,1.6e-05,2.5e-05,5.9e-05,1.2e-05,1e-05,3.5e-05,2.2e-05,2.9e-05,2.6e-05,1.4e-05,4.7e-05,2.5e-05,5e-05,5.1e-05,8.6e-05,6e-06,2e-05,5.2e-05,3.7e-05,2.3e-05,9.4e-05,4.5e-05,2.4e-05,4.6e-05,3.1e-05,5.5e-05,1.5e-05,2.9e-05,1.6e-05,4.2e-05,4.3e-05,2.8e-05,4.1e-05,1.7e-05,5.4e-05,6.7e-05,2.2e-05,3.5e-05,2.1e-05,4.7e-05,4.3e-05
4.5e-05,2.5e-05,8e-06,5.3e-05,2.3e-05,2.4e-05,3.2e-05,2.8e-05,3.8e-05,3.2e-05,2.2e-05,4.8e-05,3.8e-05,3.4e-05,3.5e-05,8e-05,5.9e-05,3.6e-05,4.2e-05,5.4e-05,1.7e-05,8e-06,5.8e-05,6.7e-05,4.9e-05,3.6e-05,3.3e-05,2.6e-05,3.7e-05,0.000103,6e-05,2.3e-05,1.7e-05,2.3e-05,5e-05,3.2e-05,3.6e-05,6.5e-05,7.2e-05,2.3e-05,3.5e-05,1.6e-05,6.8e-05,2.1e-05,4.6e-05,2.7e-05,5.4e-05,3.5e-05,5e-05,4.2e-05,3.6e-05,8e-05,1e-05,2.4e-05,2e-05,2.9e-05,6.7e-05,2.4e-05,2.7e-05,2.7e-05,2.2e-05,2.2e-05,2.6e-05,7e-06,3.2e-05,3.9e-05,8e-06,5.2e-05,7e-06,4.2e-05,2.4e-05,1.2e-05,3.1e-05,2.8e-05,2.5e-05,1e-05,3.2e-05,3.4e-05,1.8e-05,4.8e-05,1.1e-05,1.5e-05,5e-05,4e-05,8e-06,1.7e-05,1.5e-05,2.8e-05,2.6e-05,2.8e-05,1.2e-05,1e-05,4.9e-05,3e-05,8.2e-05,1.1e-05,2.2e-05,7.5e-05,2.3e-05,3.3e-05,8.2e-05,3.1e-05,6e-06,1.9e-05,2.3e-05,4.8e-05,2.9e-05,3e-05,1.3e-05,4.9e-05,2.1e-05,1.6e-05,1.5e-05,1.3e-05,3.7e-05,5.5e-05,6e-06,1.8e-05,4.4e-05,2.9e-05,3.8e-05
1.6e-05,2.9e-05,1.2e-05,4.9e-05,1.7e-05,3.5e-05,2.4e-05,2.8e-05,4.4e-05,2.3e-05,1e-05,2.8e-05,3.9e-05,1.6e-05,9e-06,6e-05,6.3e-05,3.6e-05,4.5e-05,3.9e-05,1.5e-05,2.3e-05,3.4e-05,3.9e-05,4.1e-05,2.8e-05,7e-06,1.3e-05,5e-06,7.1e-05,2.6e-05,1.7e-05,2.2e-05,1.7e-05,3.7e-05,3.9e-05,3.9e-05,6.1e-05,2.5e-05,3.4e-05,3.1e-05,9e-06,6.6e-05,1.5e-05,3.9e-05,4e-05,4.2e-05,9e-06,3e-05,4.8e-05,2.3e-05,8.3e-05,8e-06,1.3e-05,8e-06,1.6e-05,3.8e-05,1.3e-05,7e-06,3e-06,3.1e-05,3.8e-05,2e-05,7e-06,3.8e-05,3.6e-05,7e-06,5.9e-05,2.3e-05,2.4e-05,3.1e-05,4e-06,2.5e-05,2.7e-05,2.2e-05,1e-05,3.1e-05,4.7e-05,2.5e-05,5e-05,1e-05,1.1e-05,3.3e-05,1.8e-05,1.5e-05,2.2e-05,2.8e-05,2.6e-05,1.9e-05,4.2e-05,1.1e-05,1.5e-05,4.5e-05,1.5e-05,4.9e-05,3e-06,1.9e-05,6.6e-05,1.7e-05,3.2e-05,9.2e-05,3.5e-05,1.8e-05,3.2e-05,3.1e-05,4.9e-05,2.6e-05,4.4e-05,1.4e-05,6.2e-05,2.9e-05,2.9e-05,2.7e-05,2e-05,2.8e-05,5.3e-05,1.7e-05,1.4e-05,3.8e-05,3.5e-05,3.9e-05
2e-05,2.8e-05,1.3e-05,5.5e-05,1.3e-05,3.3e-05,2.8e-05,2.1e-05,2.8e-05,1.7e-05,1.1e-05,4.8e-05,4.1e-05,2.9e-05,2.3e-05,4.4e-05,5.7e-05,2.1e-05,5.5e-05,3.6e-05,1e-05,2.4e-05,2.3e-05,3.8e-05,5e-05,2.7e-05,2.3e-05,1.3e-05,7e-06,6.8e-05,2e-05,1.2e-05,6e-06,1.9e-05,1e-05,2.3e-05,3.1e-05,3.8e-05,5.3e-05,3.1e-05,1.9e-05,2.2e-05,4.2e-05,1.1e-05,3.4e-05,3.2e-05,5e-05,8e-06,2.8e-05,3.7e-05,1.8e-05,7.5e-05,1.4e-05,1e-05,2e-06,7e-06,5.4e-05,1.6e-05,2e-06,9e-06,2.4e-05,3.5e-05,2.9e-05,5e-06,4.6e-05,2.9e-05,2.4e-05,4.9e-05,3.1e-05,2.9e-05,1e-06,1.9e-05,1.9e-05,2.6e-05,2.4e-05,8e-06,2.7e-05,3.7e-05,1.7e-05,3.9e-05,1.1e-05,2.1e-05,2.5e-05,2.5e-05,1.2e-05,1.5e-05,1.3e-05,4.1e-05,2.6e-05,4e-05,2.8e-05,6e-06,3.7e-05,5e-06,6.2e-05,7e-06,2e-05,6.6e-05,1.1e-05,2.1e-05,7.6e-05,2.9e-05,2.2e-05,1.6e-05,1.6e-05,4.8e-05,2.9e-05,3.1e-05,2.6e-05,3.9e-05,1.3e-05,2.6e-05,1.6e-05,2.3e-05,1.6e-05,4.8e-05,1.7e-05,1.7e-05,3.5e-05,2.2e-05,3e-05
4.1e-05,1.8e-05,2.2e-05,4.3e-05,2.5e-05,1.7e-05,3.5e-05,2.6e-05,3.8e-05,2e-05,1e-05,5.3e-05,5.8e-05,3.3e-05,1.5e-05,3.5e-05,6.3e-05,5.3e-05,6.5e-05,1.5e-05,3.8e-05,2.6e-05,2.5e-05,2.2e-05,4.2e-05,2.6e-05,1.8e-05,1.7e-05,2.4e-05,6.9e-05,2.1e-05,3.6e-05,1.6e-05,2.3e-05,1.8e-05,1e-05,3.1e-05,4.2e-05,4.7e-05,3.9e-05,3.7e-05,2.8e-05,5.7e-05,1.9e-05,2.9e-05,3.8e-05,3.6e-05,1.4e-05,3.1e-05,3.6e-05,1.4e-05,6.1e-05,6e-06,1.4e-05,1.3e-05,2.9e-05,5.9e-05,6e-06,1e-05,7e-06,7e-06,2.2e-05,1.4e-05,2e-05,2.6e-05,2.7e-05,3.4e-05,5.1e-05,3.6e-05,3.3e-05,1.7e-05,2.1e-05,2.3e-05,3e-05,2.2e-05,9e-06,1.2e-05,3.3e-05,1.8e-05,4.1e-05,1.9e-05,1.4e-05,1.7e-05,2.6e-05,7e-06,5e-06,1.1e-05,4.1e-05,1.2e-05,2e-05,2e-05,1.2e-05,5.4e-05,1.7e-05,4.9e-05,7e-06,8e-06,6e-05,1.8e-05,2.7e-05,5.8e-05,3.5e-05,3e-05,2.7e-05,7e-06,4e-05,1.5e-05,4.4e-05,1e-05,3.5e-05,1.8e-05,1.7e-05,1.4e-05,1.8e-05,2.3e-05,5.4e-05,8e-06,8e-06,3.7e-05,2.5e-05,1.6e-05
2.7e-05,3.1e-05,3.1e-05,4.8e-05,2.9e-05,2.2e-05,3e-05,2.7e-05,3.7e-05,1.3e-05,1.8e-05,1.5e-05,4e-05,1.9e-05,1.8e-05,5.1e-05,7.9e-05,3e-05,5.4e-05,2.2e-05,3.7e-05,1.1e-05,2.7e-05,3e-05,3.8e-05,3.2e-05,7e-06,1.1e-05,2.1e-05,8.1e-05,3e-05,1.4e-05,2.7e-05,1.5e-05,1.3e-05,8e-06,4.3e-05,4.5e-05,3.9e-05,1.3e-05,2.9e-05,7e-06,4.9e-05,2e-05,2.2e-05,3.9e-05,5.6e-05,1.7e-05,1.6e-05,3.9e-05,1.7e-05,7.7e-05,2.6e-05,1e-05,2e-05,2.1e-05,4.6e-05,7e-06,1.8e-05,1.4e-05,1.4e-05,2.7e-05,1.8e-05,2.5e-05,3.2e-05,4.2e-05,1.6e-05,2.6e-05,2.5e-05,1.9e-05,1.2e-05,8e-06,2.4e-05,3e-05,1.7e-05,7e-06,1.7e-05,3.4e-05,1.6e-05,2.3e-05,2.8e-05,2.9e-05,2.6e-05,3.1e-05,2e-05,1e-05,1.6e-05,3.8e-05,2.7e-05,2.4e-05,2e-05,6e-06,4.4e-05,2.3e-05,4.9e-05,4e-06,9e-06,6.8e-05,2.3e-05,2.1e-05,6.2e-05,2.8e-05,3.7e-05,1.5e-05,1.2e-05,3.8e-05,4e-06,3.9e-05,1.9e-05,4.9e-05,4e-06,2.4e-05,1.8e-05,1.8e-05,2.1e-05,5.3e-05,1.9e-05,2.6e-05,5.5e-05,2.8e-05,3.8e-05
1.2e-05,1.3e-05,3.1e-05,3.3e-05,4.5e-05,2.5e-05,5.4e-05,2.4e-05,3.4e-05,3.6e-05,2.2e-05,1.7e-05,7.2e-05,5.6e-05,4.1e-05,5.4e-05,5.5e-05,3.8e-05,2.9e-05,1e-05,3.6e-05,1.8e-05,5.3e-05,1e-05,1.4e-05,1.6e-05,1.9e-05,1.9e-05,1.3e-05,7.1e-05,3.7e-05,4.8e-05,1.1e-05,3.3e-05,2.3e-05,2.6e-05,1.8e-05,5e-05,2.5e-05,3.8e-05,4e-05,4e-05,3.4e-05,4.6e-05,1.4e-05,3.4e-05,5.6e-05,3.2e-05,1.4e-05,5.8e-05,2.5e-05,6.4e-05,1.4e-05,2e-06,3.1e-05,5.1e-05,7.7e-05,7e-06,2.4e-05,6e-06,1.7e-05,1.1e-05,2.9e-05,2.8e-05,3.9e-05,6.3e-05,3.4e-05,5e-05,1.3e-05,2.4e-05,1.7e-05,2.7e-05,3.5e-05,4.1e-05,3.4e-05,2.5e-05,2.9e-05,4.5e-05,1.2e-05,4.4e-05,5e-06,4e-05,4.3e-05,1.5e-05,1.1e-05,3.1e-05,1.3e-05,3.5e-05,2.3e-05,5.6e-05,1.8e-05,1.5e-05,5.9e-05,4.3e-05,4.1e-05,1.4e-05,1.5e-05,8.1e-05,3.2e-05,3.8e-05,7.5e-05,3.7e-05,2.2e-05,3.9e-05,1.9e-05,3.2e-05,5e-06,5.2e-05,6.5e-05,5.4e-05,1.6e-05,1e-05,2.3e-05,2.1e-05,2.2e-05,6e-05,7e-06,3e-05,5.3e-05,4.4e-05,7.8e-05
4.8e-05,1.1e-05,4.7e-05,5.8e-05,5.5e-05,4.9e-05,2e-05,5e-06,2.8e-05,3.2e-05,5.5e-05,5.4e-05,6.4e-05,6.5e-05,2.5e-05,3.5e-05,2.8e-05,6e-05,1.9e-05,2e-05,4.9e-05,6e-05,6e-06,2.3e-05,3.8e-05,2.8e-05,4.4e-05,3.5e-05,5.5e-05,0.00013,2.6e-05,8.5e-05,5.9e-05,1.9e-05,7.6e-05,7.4e-05,5.5e-05,4.5e-05,1.2e-05,2.9e-05,5.4e-05,3.4e-05,2e-05,7.1e-05,8.6e-05,7.2e-05,6e-05,5.1e-05,3.8e-05,5.7e-05,3.1e-05,7e-05,3.8e-05,3.3e-05,2.8e-05,3.5e-05,0.000104,7.5e-05,1.1e-05,2.8e-05,1.9e-05,3.4e-05,5.9e-05,4.5e-05,6.3e-05,6.7e-05,2.6e-05,9.1e-05,8.1e-05,2.6e-05,3.4e-05,6.7e-05,7.7e-05,5.9e-05,6.2e-05,6.7e-05,5.2e-05,4.6e-05,7.1e-05,0.000117,6.6e-05,3.6e-05,6.4e-05,3.5e-05,3.3e-05,1.9e-05,3.4e-05,6e-05,1.8e-05,6.3e-05,5.4e-05,4.4e-05,6.4e-05,8.8e-05,0.000106,2.7e-05,2.3e-05,6.1e-05,6.7e-05,8.5e-05,7.4e-05,2.4e-05,3.2e-05,6.2e-05,4.7e-05,1.4e-05,4e-05,5.8e-05,9.1e-05,9.3e-05,9.5e-05,5.8e-05,2.3e-05,4.7e-05,1.8e-05,5.6e-05,4.9e-05,3.3e-05,4.8e-05,3e-05,5.5e-05
6.3e-05,7e-05,2.4e-05,6.8e-05,8e-06,2.8e-05,5.7e-05,5.1e-05,5.5e-05,5.9e-05,4.2e-05,8.1e-05,0.000119,4.5e-05,3.5e-05,4.6e-05,5.7e-05,6.4e-05,8.8e-05,6.6e-05,2.3e-05,5e-05,7.6e-05,1.2e-05,3.1e-05,3.7e-05,8e-06,1.2e-05,4e-05,1e-04,0.000137,8.7e-05,7.6e-05,8.6e-05,3.1e-05,4.9e-05,1.5e-05,3e-06,5.4e-05,4.1e-05,3.5e-05,2.1e-05,9.1e-05,3.5e-05,5.1e-05,3.6e-05,6.6e-05,3.4e-05,8e-06,4e-05,4.9e-05,9.9e-05,6.1e-05,4.2e-05,1.7e-05,3.1e-05,3.8e-05,6e-05,6.4e-05,5.2e-05,2.7e-05,2.9e-05,3.4e-05,4.6e-05,5.1e-05,5e-06,2.8e-05,6.8e-05,3.1e-05,4.5e-05,2.5e-05,5.7e-05,1.5e-05,3.6e-05,2.9e-05,2.9e-05,3.2e-05,8e-06,4e-05,4.4e-05,1.2e-05,5e-05,1.4e-05,1.5e-05,2.4e-05,3.8e-05,3e-05,5.3e-05,1.4e-05,3.1e-05,2.2e-05,2.5e-05,6e-05,6.1e-05,3.5e-05,3.5e-05,2e-05,3.6e-05,3.4e-05,2.5e-05,7.6e-05,3.9e-05,4.1e-05,2.7e-05,2.9e-05,3.6e-05,4e-05,2e-05,3e-05,3.6e-05,4.3e-05,1.2e-05,1.5e-05,2.2e-05,1.6e-05,2.9e-05,2.7e-05,1.3e-05,4.3e-05,1.6e-05,1.3e-05
5.4e-05,3.3e-05,3.8e-05,1.8e-05,1.6e-05,4.8e-05,4.4e-05,1.2e-05,4.6e-05,3.6e-05,4.1e-05,5.5e-05,4.8e-05,3.3e-05,1.4e-05,3.9e-05,8.2e-05,2.2e-05,6.1e-05,3.7e-05,1.5e-05,3.2e-05,3.8e-05,2.5e-05,5.2e-05,2.5e-05,1.8e-05,1.4e-05,1.5e-05,4.3e-05,9.2e-05,1.6e-05,3.5e-05,2.3e-05,1.9e-05,4.3e-05,3.3e-05,3.1e-05,2.3e-05,2e-05,4.9e-05,2e-05,9.1e-05,4.7e-05,2.1e-05,3.4e-05,4.9e-05,2.2e-05,1e-05,4e-06,5e-06,7.3e-05,2.7e-05,1.5e-05,1.3e-05,2.8e-05,2.4e-05,1.8e-05,1.3e-05,1.6e-05,1.7e-05,3.2e-05,1.5e-05,1.4e-05,4.5e-05,1.4e-05,7e-06,6.2e-05,1.5e-05,4.1e-05,1.8e-05,2.7e-05,2.6e-05,2.4e-05,1.3e-05,8e-06,4.7e-05,1.6e-05,2.5e-05,5.2e-05,1.2e-05,2e-05,2.2e-05,6e-06,1.2e-05,1.5e-05,1.7e-05,3e-05,3.7e-05,1.3e-05,1.2e-05,7e-06,4e-05,5e-06,4.4e-05,1.8e-05,1.8e-05,5e-05,3.1e-05,1e-05,6.2e-05,2e-05,3.8e-05,3.1e-05,1e-05,2.1e-05,2.1e-05,2.5e-05,2.8e-05,3.3e-05,1.7e-05,6e-06,1.9e-05,1.9e-05,2.3e-05,2.6e-05,3.1e-05,4e-06,4e-05,7e-06,1.6e-05
2.8e-05,2e-05,2.6e-05,2.6e-05,1.2e-05,4.8e-05,2.7e-05,2.2e-05,2.8e-05,2.7e-05,3.3e-05,4.2e-05,4.8e-05,3.6e-05,1.3e-05,3.1e-05,7.7e-05,2.1e-05,3.3e-05,3.1e-05,4.4e-05,1.6e-05,2.5e-05,1.2e-05,6.4e-05,1.7e-05,1e-05,2e-05,1.4e-05,5e-05,7.7e-05,1.5e-05,8e-06,2e-06,2.5e-05,2e-05,1.3e-05,4.1e-05,6e-06,2.9e-05,2.6e-05,1.7e-05,6e-05,2.5e-05,3e-05,2.7e-05,3.3e-05,1.7e-05,5e-06,9e-06,1.3e-05,5.3e-05,2.6e-05,1.6e-05,1.6e-05,1.5e-05,1.9e-05,1.5e-05,1.4e-05,3e-06,1.8e-05,2.6e-05,1.1e-05,6e-06,3.4e-05,1e-05,5e-06,3.7e-05,4e-06,2e-05,1.9e-05,2.3e-05,1.2e-05,2.5e-05,9e-06,6e-06,2e-05,1.4e-05,1.2e-05,4e-05,1.4e-05,4e-06,1.7e-05,8e-06,8e-06,1.7e-05,2.8e-05,3.4e-05,4.1e-05,1.2e-05,2.4e-05,1e-05,2.8e-05,2e-05,4.8e-05,1.6e-05,1.2e-05,4.5e-05,3e-05,4e-06,7e-05,2.5e-05,3.9e-05,1.9e-05,2.4e-05,3.1e-05,1.6e-05,1.8e-05,3e-05,2.5e-05,2.2e-05,1e-05,1.5e-05,2.3e-05,2.2e-05,4.3e-05,1.8e-05,9e-06,3.4e-05,1.7e-05,2.3e-05
1.6e-05,2.1e-05,3e-05,4.9e-05,9e-06,4.8e-05,4.2e-05,7e-06,2.3e-05,2.6e-05,2.1e-05,2.6e-05,4.5e-05,1.8e-05,1.2e-05,3.6e-05,6.3e-05,2.4e-05,2.9e-05,1.1e-05,1.4e-05,3.7e-05,1.9e-05,2.6e-05,3.9e-05,1.2e-05,1.3e-05,1e-05,2.4e-05,4.7e-05,5.8e-05,1e-05,2.2e-05,2.9e-05,9e-06,1.7e-05,2.4e-05,2.8e-05,2.3e-05,1e-05,2.3e-05,1.1e-05,3.6e-05,2.5e-05,1.7e-05,3.8e-05,3e-05,9e-06,2.2e-05,1.4e-05,1.6e-05,5e-05,2.8e-05,1.6e-05,9e-06,1.5e-05,1.5e-05,2.3e-05,2.3e-05,1.2e-05,1.1e-05,2.7e-05,7e-06,1e-05,3.3e-05,1.5e-05,9e-06,4.1e-05,8e-06,2.4e-05,1.4e-05,1.6e-05,1.9e-05,1.8e-05,1e-05,4e-06,1.9e-05,9e-06,1e-05,5.2e-05,1e-06,8e-06,1.2e-05,7e-06,7e-06,6e-06,1.8e-05,2.9e-05,2.9e-05,5e-06,6e-06,8e-06,1.7e-05,1.5e-05,5e-05,1.9e-05,1.1e-05,4.1e-05,1.3e-05,1.3e-05,5.4e-05,2.7e-05,3.9e-05,2e-05,1.8e-05,2.7e-05,1.3e-05,2.2e-05,2.5e-05,2.9e-05,2.6e-05,1.3e-05,1.2e-05,1.4e-05,1.3e-05,3.7e-05,1.6e-05,9e-06,3.6e-05,1.7e-05,2.3e-05
1.4e-05,1.2e-05,2.7e-05,4.5e-05,1.6e-05,3.6e-05,3.9e-05,1.4e-05,2e-05,2.5e-05,2.5e-05,2.9e-05,2.5e-05,2e-05,1.1e-05,3.9e-05,4.9e-05,2.8e-05,3.1e-05,2.3e-05,8e-06,3e-06,2.9e-05,2.3e-05,3.7e-05,2e-05,1.9e-05,1.9e-05,1.5e-05,4.5e-05,4e-05,1e-05,7e-06,2.6e-05,3e-05,8e-06,1.7e-05,2.5e-05,1.9e-05,1.7e-05,1.6e-05,1.1e-05,3.9e-05,1.1e-05,2e-05,3.5e-05,2.8e-05,4e-06,5e-06,1.3e-05,7e-06,6.1e-05,1.4e-05,2e-05,1.3e-05,1.7e-05,2.9e-05,2.4e-05,7e-06,4e-06,9e-06,2.2e-05,2.2e-05,1.3e-05,3.8e-05,2.3e-05,3e-06,3.1e-05,6e-06,3.1e-05,4e-06,1.1e-05,9e-06,1.2e-05,1.5e-05,1.3e-05,3e-05,1e-05,4e-06,3.9e-05,8e-06,4e-06,1.1e-05,1.2e-05,4e-06,9e-06,1.1e-05,3.4e-05,1.4e-05,1e-05,1.5e-05,1.2e-05,1.5e-05,7e-06,4e-05,1.7e-05,4e-06,3.4e-05,2.3e-05,2.1e-05,6.1e-05,1.8e-05,1.4e-05,4e-06,8e-06,2.8e-05,1.4e-05,2.2e-05,2e-05,2.3e-05,2.3e-05,5e-06,1.5e-05,2.3e-05,9e-06,3.7e-05,1.3e-05,1.2e-05,2.7e-05,3e-06,1.8e-05
1.6e-05,1.8e-05,2.5e-05,3.6e-05,6e-06,3e-05,3.5e-05,1.3e-05,1.1e-05,2.5e-05,2.5e-05,3.5e-05,3.9e-05,3.5e-05,1.6e-05,3.6e-05,5.8e-05,2.7e-05,3.3e-05,1.6e-05,1.3e-05,1.7e-05,2.7e-05,1.7e-05,4e-05,1.2e-05,1.3e-05,1.8e-05,9e-06,3.7e-05,5.1e-05,1e-05,1.6e-05,3.1e-05,2.1e-05,1e-05,1.4e-05,2.7e-05,2.9e-05,1.1e-05,1.8e-05,1.2e-05,3.2e-05,1.9e-05,2.2e-05,3.3e-05,3.2e-05,1e-05,1.6e-05,1.6e-05,3e-06,5.8e-05,2.1e-05,1.4e-05,1.4e-05,1.4e-05,1.9e-05,1.3e-05,7e-06,5e-06,1.4e-05,1e-05,5e-06,1.2e-05,4.1e-05,1.1e-05,8e-06,3.4e-05,8e-06,2.6e-05,1.4e-05,1.1e-05,9e-06,2.5e-05,1.3e-05,9e-06,1.9e-05,1e-05,4e-06,4e-05,6e-06,1.6e-05,1.6e-05,1.2e-05,8e-06,2e-06,8e-06,3.3e-05,2.2e-05,1.5e-05,1.3e-05,5e-06,2.5e-05,1e-05,4.6e-05,1.5e-05,1e-05,3.7e-05,1.7e-05,2.1e-05,5.8e-05,9e-06,1.7e-05,1.6e-05,1e-05,1.7e-05,2.9e-05,2.3e-05,1.6e-05,3e-05,5e-06,2.1e-05,1e-05,2.5e-05,2e-05,4.4e-05,1.6e-05,4e-06,1.9e-05,4e-06,2e-05
2.1e-05,2.1e-05,2.8e-05,3.2e-05,1.1e-05,3.2e-05,3.8e-05,1.8e-05,2.8e-05,2.2e-05,1.6e-05,3.3e-05,4.1e-05,3.3e-05,1.3e-05,3.4e-05,5.7e-05,2.2e-05,4.5e-05,1.3e-05,1.4e-05,1.6e-05,3.6e-05,2.4e-05,3.7e-05,1.3e-05,7e-06,1e-05,1e-05,4.9e-05,4.6e-05,4e-06,1.3e-05,2.5e-05,1.2e-05,1.4e-05,9e-06,4.1e-05,2.5e-05,5e-06,1.7e-05,9e-06,5.6e-05,8e-06,1.8e-05,3.3e-05,1.9e-05,8e-06,1.9e-05,8e-06,3e-06,6e-05,2e-05,8e-06,1.5e-05,6e-06,1.6e-05,1e-05,2.1e-05,1.8e-05,1.2e-05,1.6e-05,1.2e-05,7e-06,3e-05,9e-06,5e-06,2.8e-05,9e-06,1.7e-05,1e-05,1.1e-05,1.6e-05,2e-05,8e-06,3e-06,2e-05,5e-06,2e-06,3.6e-05,4e-06,6e-06,2e-05,6e-06,8e-06,1e-05,7e-06,2.5e-05,2.8e-05,2.3e-05,1.9e-05,3e-06,2.5e-05,1e-05,4.6e-05,1.8e-05,1.6e-05,3.3e-05,1.5e-05,1.6e-05,5.8e-05,1.2e-05,2.2e-05,1.4e-05,1.2e-05,2.7e-05,2.7e-05,2.4e-05,1.2e-05,2.9e-05,6e-06,1.3e-05,1.3e-05,1.8e-05,1.6e-05,3.9e-05,8e-06,1.2e-05,2.8e-05,2e-06,2.8e-05
1.8e-05,1.8e-05,2e-05,3.5e-05,5e-06,3.9e-05,2.6e-05,5e-06,4e-05,4.2e-05,1.9e-05,3.5e-05,3.1e-05,2.6e-05,1.4e-05,3.5e-05,3.9e-05,1.9e-05,4.3e-05,1.8e-05,2.1e-05,1.3e-05,2.7e-05,2e-05,3.2e-05,2.6e-05,1.4e-05,1.2e-05,9e-06,5.2e-05,4.9e-05,9e-06,4e-06,2.2e-05,1.4e-05,1.7e-05,1.4e-05,3.5e-05,1.9e-05,1.1e-05,1.2e-05,9e-06,4.6e-05,6e-06,1.7e-05,2.8e-05,1.8e-05,1.1e-05,5e-06,1.6e-05,5e-06,5.8e-05,1.4e-05,1e-05,1.8e-05,9e-06,1.8e-05,5e-06,1.2e-05,3e-06,1.1e-05,1.4e-05,1.1e-05,6e-06,3.9e-05,1.4e-05,6e-06,3.8e-05,1.3e-05,2e-05,1.4e-05,5e-06,1.2e-05,1.8e-05,6e-06,4e-06,1.9e-05,1.1e-05,4e-06,3.5e-05,4e-06,4e-06,1.9e-05,9e-06,7e-06,9e-06,1.2e-05,3e-05,2.6e-05,8e-06,1.1e-05,5e-06,2.6e-05,9e-06,5e-05,4e-06,2e-06,4.2e-05,1.7e-05,2.3e-05,6.2e-05,2e-05,2.6e-05,1e-05,1.4e-05,3e-05,3.2e-05,2.5e-05,1.3e-05,2.3e-05,1.1e-05,1e-05,9e-06,2.4e-05,1.8e-05,2.6e-05,1.8e-05,9e-06,2.6e-05,7e-06,1.7e-05
1e-05,1.5e-05,2e-05,2.7e-05,8e-06,3.7e-05,3e-05,3e-06,2.5e-05,1.9e-05,8e-06,2.6e-05,3.1e-05,2.4e-05,1.2e-05,4e-05,4.7e-05,2.5e-05,3.1e-05,8e-06,1.4e-05,1.7e-05,2.8e-05,1.5e-05,3.1e-05,1.4e-05,1.2e-05,1.3e-05,6e-06,4.5e-05,4.8e-05,6e-06,6e-06,2.1e-05,1e-05,9e-06,1.7e-05,3.2e-05,2.3e-05,8e-06,1.3e-05,5e-06,3.1e-05,1.1e-05,1.8e-05,2.9e-05,2.3e-05,7e-06,1.3e-05,2.2e-05,2e-06,5.6e-05,2.3e-05,7e-06,5e-06,1e-05,2e-05,5e-06,8e-06,3e-06,4e-06,2.2e-05,1.4e-05,7e-06,4.3e-05,9e-06,2e-06,3.6e-05,1.1e-05,1.9e-05,1.1e-05,4e-06,1.8e-05,1.8e-05,1e-06,2e-06,2.4e-05,1.4e-05,4e-06,3.3e-05,6e-06,3e-06,1.6e-05,7e-06,7e-06,6e-06,1e-05,2.7e-05,2.7e-05,1e-05,1.2e-05,1e-06,2.5e-05,1.1e-05,4.7e-05,8e-06,1e-06,3.7e-05,1.8e-05,1.9e-05,4.9e-05,1.3e-05,1.8e-05,1.2e-05,8e-06,2.7e-05,1.8e-05,1.3e-05,8e-06,3.2e-05,1.7e-05,2e-06,1.9e-05,1.9e-05,2e-05,2.8e-05,8e-06,5e-06,2.3e-05,2e-06,1.1e-05
1.5e-05,1.3e-05,2.1e-05,3.1e-05,9e-06,3e-05,3.4e-05,8e-06,1.9e-05,1.5e-05,1.4e-05,2.7e-05,3.6e-05,2.6e-05,1.4e-05,3.3e-05,5e-05,2.3e-05,3.3e-05,1.2e-05,2.1e-05,2.4e-05,2.4e-05,1.3e-05,2.8e-05,1.8e-05,1.4e-05,1.2e-05,1e-05,4.7e-05,4.7e-05,2e-06,5e-06,2e-05,1.2e-05,1.3e-05,2e-05,3e-05,2.5e-05,1.1e-05,1.2e-05,2e-06,3.8e-05,8e-06,1.8e-05,3.1e-05,2.1e-05,1e-05,9e-06,1.4e-05,1e-06,5.8e-05,1.8e-05,4e-06,9e-06,6e-06,2.2e-05,3e-06,9e-06,5e-06,8e-06,1.9e-05,7e-06,6e-06,3.7e-05,1.6e-05,8e-06,2.9e-05,1.1e-05,1.7e-05,2e-06,4e-06,1.3e-05,1.9e-05,3e-06,2e-06,2.4e-05,4e-06,5e-06,3.2e-05,6e-06,3e-06,1.6e-05,3e-06,0,1e-06,1.4e-05,3e-05,2.8e-05,1e-05,6e-06,5e-06,2.8e-05,4e-06,4.6e-05,7e-06,3e-06,3.5e-05,2.1e-05,2.2e-05,5.1e-05,1.9e-05,1.9e-05,1.3e-05,6e-06,3.2e-05,1.4e-05,2.1e-05,1.2e-05,2.9e-05,1.5e-05,1e-05,1.8e-05,2.2e-05,1.2e-05,3.1e-05,1.5e-05,7e-06,2.5e-05,2e-06,1.5e-05
1.4e-05,1.2e-05,2.4e-05,3.1e-05,7e-06,3e-05,3.1e-05,7e-06,1.8e-05,1.6e-05,9e-06,2.7e-05,3.6e-05,2.6e-05,1.1e-05,3.5e-05,4.8e-05,2.2e-05,3.1e-05,1.7e-05,1.8e-05,2.2e-05,2.6e-05,1.4e-05,3e-05,1.4e-05,1.2e-05,1.1e-05,8e-06,5.1e-05,4.8e-05,5e-06,4e-06,1.7e-05,1.2e-05,1.1e-05,1.8e-05,3.1e-05,2.1e-05,1e-05,1.2e-05,2e-06,3.9e-05,6e-06,1.7e-05,2.8e-05,2.1e-05,8e-06,9e-06,1.3e-05,5e-06,5.4e-05,1.6e-05,5e-06,1e-05,7e-06,2.1e-05,3e-06,1e-05,6e-06,9e-06,1.9e-05,8e-06,5e-06,3.6e-05,1.2e-05,3e-06,2.6e-05,8e-06,1.5e-05,9e-06,4e-06,1.6e-05,1.9e-05,2e-06,1e-06,2.2e-05,1e-05,1e-06,3.3e-05,5e-06,4e-06,1.7e-05,6e-06,1e-06,2e-06,1.1e-05,2.7e-05,2.9e-05,9e-06,8e-06,3e-06,2.4e-05,7e-06,4.8e-05,7e-06,1e-06,3.9e-05,1.6e-05,2e-05,5.4e-05,1.7e-05,1.8e-05,1.2e-05,9e-06,2.8e-05,1.9e-05,1.7e-05,1.2e-05,2.7e-05,1.5e-05,6e-06,1.3e-05,1.6e-05,1.4e-05,3.2e-05,1.5e-05,8e-06,2.7e-05,4e-06,1.3e-05
