-0.002237,-0.002635,-0.001605,-0.001663,-0.000975,-0.00238,-0.001685,-0.001734,-0.002616,-0.002839,-0.003708,-0.003993,-0.004838,-0.005111,-0.004082,-0.002792,-0.002832,-0.002826,-0.003667,-0.003427,-0.00284,-0.002703,-0.004443,-0.003586,-0.003665,-0.003066,-0.004875,-0.003477,-0.003225,-0.00256,-0.002403,-0.003787,-0.003638,-0.004915,-0.00375,-0.003387,-0.003314,-0.003498,-0.005654,-0.004506,-0.00464,-0.003683,-0.005881,-0.004424,-0.001798,-0.003994,-0.003524,-0.002695,-0.003536,-0.002966,-0.006132,-0.002738,-0.005007,-0.003968,-0.002169,-0.003667,-0.002809,-0.006898,-0.005319,-0.003087,-0.001786,-0.004474,-0.003485,-0.003274,-0.004684,-0.003921,-0.006889,-0.00597,-0.003735,-0.004862,-0.00526,-0.003313,-0.002755,-0.004545,-0.003936,-0.003331,-0.004036,-0.003171,-0.002365,-0.003766,-0.005178,-0.002888,-0.001796,-0.001879,-0.002537,-0.003502,-0.004496,-0.002718,-0.002655,-0.001981,-0.002212,-0.004261,-0.004019,-0.002905,-0.002834,-0.004756,-0.003273,-0.003438,-0.002634,-0.002148,-0.002114,-0.003196,-0.002468,-0.002814,-0.002348,-0.003851,-0.002528,-0.00233,-0.003024,-0.003615,-0.003694,-0.002733,-0.001967,-0.00229,-0.004004,-0.002224,-0.004848,-0.004266,-0.002967,-0.003029,-0.002963
0.001375,0.001073,0.000699,0.000207,0.000131,0.000651,0.000378,0.001021,0.001302,0.00075,0.001842,0.001701,0.00235,0.003112,0.001439,0.001545,0.000953,0.001831,0.002097,0.002125,0.002132,0.002064,0.002975,0.001414,0.001277,0.001754,0.002533,0.002186,0.003046,0.001786,0.000604,0.002432,0.002706,0.002867,0.002681,0.001875,0.001742,0.002022,0.004009,0.002898,0.002393,0.001574,0.003008,0.002326,0.000608,0.002446,0.001968,0.000368,0.001198,0.001545,0.003981,0.001132,0.004523,0.002454,0.000967,0.00084,0.00141,0.005064,0.003344,0.001864,0.000648,0.002413,0.002124,0.001647,0.002869,0.00267,0.003851,0.004112,0.001374,0.002381,0.002728,0.002079,0.001467,0.002105,0.002114,0.001243,0.002484,0.001938,0.000929,0.001739,0.003143,0.001238,0.000492,1.1e-05,0.000304,0.000514,0.003142,0.001666,0.001054,-2.3e-05,0.000729,0.003037,0.002479,0.001286,0.001052,0.002595,0.001538,0.001881,0.001534,0.001113,0.000323,0.001141,0.001263,0.00196,0.001162,0.001736,0.000376,0.000485,0.001871,0.002046,0.00262,0.001097,0.000386,0.000706,0.002937,0.001432,0.002778,0.003139,0.001592,0.002183,0.001763
-0.00068,-0.000371,-0.000212,0.000558,-0.000161,0.000334,0.000485,-0.000141,-0.000848,0.000371,-0.001462,-0.000382,-0.000662,-0.002177,-0.00013,-0.000276,-0.000165,-0.000154,-0.000751,-0.001128,-0.001296,-0.00207,-0.00206,-0.000894,0.00037,-0.001201,-0.000879,-0.00152,-0.002242,-0.001141,-0.000587,-0.000532,-0.00067,-0.000819,-0.001494,-0.000971,-5.2e-05,-0.000621,-0.003061,-0.001275,-0.001324,-9.2e-05,-0.000753,-0.000453,0.000805,-0.001279,-0.000903,-3.9e-05,-0.000434,-0.000579,-0.002423,0.000593,-0.002436,-0.00126,-0.00043,0.000506,0.000116,-0.00319,-0.001363,-0.000476,0.000302,-0.000396,-0.000115,-0.00098,-0.000666,-0.001625,-0.001917,-0.003534,-0.000632,-0.000549,-0.000429,-0.000727,-0.000343,-0.000632,-0.000282,0.000172,-0.002173,-0.001228,-0.00048,-0.001032,-0.001915,-0.00072,-0.000351,-6.9e-05,-9.5e-05,0.000314,-0.001645,-0.000527,-0.00027,-4.2e-05,-0.000647,-0.002686,-0.00173,-0.000774,0.000285,-0.000619,-0.000466,-0.001398,-0.001072,-0.000272,0.000348,-0.000687,-0.000126,-0.001134,-0.000664,-0.000859,0.000618,-3.4e-05,-0.000966,-0.000549,-0.001622,0.000175,0.000165,0.000161,-0.001552,-0.000999,-0.001043,-0.001549,-0.000579,-0.001408,-0.000953
0.000189,-0.000393,-0.000144,-0.00068,0.000296,-0.000385,-0.000734,-0.000226,0.000286,-0.000327,0.000598,-0.000683,-0.000326,0.000677,-7.5e-05,-0.000701,-0.000705,-0.000734,5.5e-05,1.9e-05,0.000701,0.001888,0.001201,0.00074,-0.001017,0.000597,-0.00027,0.000907,0.001806,0.001025,0.00019,-0.000892,-0.000343,-0.000357,0.000277,0.000965,-0.000295,-0.000366,0.001995,-8.5e-05,0.00047,-0.000423,-6.5e-05,-0.00075,-0.001535,9e-06,-5e-05,-0.000285,0.000259,-0.000239,0.000509,-0.001576,0.000832,-0.000129,-0.000532,-0.001173,-0.000919,0.001651,-0.000204,-7.4e-05,-0.00064,-3.6e-05,-0.000379,0.000362,-0.000807,8e-04,0.000322,0.00255,0.000798,-0.000307,-0.00089,-0.001142,-0.000545,-0.000165,-0.000767,-0.00055,0.001013,0.000305,0.000103,0.000853,0.000881,-0.000185,-0.000124,-0.000168,-4.6e-05,-0.000485,2.7e-05,-0.000112,6.1e-05,-2e-05,0.000427,0.001536,0.001194,0.000686,-0.000487,-0.000435,-0.000728,0.000558,0.000206,-0.000211,-0.000532,0.000108,-0.001327,0.000601,6.8e-05,0.000216,-0.000536,-0.000568,0.001024,-0.000605,0.000625,-0.000389,-0.000316,-0.000397,8.4e-05,0.000913,-0.000278,-2e-06,0.000213,0.00052,0.001072
-0.000148,0.000638,2.9e-05,0.000364,-0.000315,-3.4e-05,0.000402,-0.000108,0.000156,-1.3e-05,-0.000221,0.001285,0.001013,0.000567,-0.000186,0.001057,0.000533,0.000921,0.000816,0.000517,-2.8e-05,-0.001664,-0.000733,-0.000174,0.000772,-0.000538,0.00057,-0.001143,-0.001273,-0.000734,-0.000555,0.00044,0.000612,0.000201,-0.000362,-0.000691,0.000328,0.000436,-0.001257,0.000926,0.000179,-0.000167,-9.6e-05,0.00088,0.000485,1.9e-05,0.000318,0.000305,0.000181,3e-04,0.000394,0.001278,-3.2e-05,0.000382,0.000844,0.001372,0.00181,-0.000675,0.000239,-0.000431,2.8e-05,-0.000176,-1.1e-05,-0.000704,0.001432,-0.000198,9.4e-05,-0.001782,-0.00144,0.000134,0.000823,0.001032,0.00101,0.000578,0.000779,0.000453,0.000358,-0.000177,-0.000392,-0.000685,-0.00037,0.000633,0.00028,0.000299,-0.000281,0.000507,0.000671,0.000447,-2.5e-05,0.00019,-0.000201,-0.001087,-0.001444,-0.000647,-0.000204,0.000162,0.001128,-0.000349,0.000261,0.000402,0.00028,-4e-06,0.001278,-9.1e-05,-8.2e-05,-0.000151,2.4e-05,0.000631,-0.000894,0.000952,0.000124,8e-05,0.000135,0.000222,0.000634,-0.001037,3e-04,0.000548,-0.000282,-0.000344,-0.000913
0.000226,-0.000637,0.000294,8.9e-05,0.000548,0.00015,-0.000166,-5.1e-05,-0.000122,0.000479,-0.000152,-0.001528,-0.00144,-0.000614,0.000546,-0.000839,-4.1e-05,-0.000696,-0.001035,-0.00079,-0.000817,0.000819,0.000624,-0.00047,-4.2e-05,5.7e-05,-0.00063,0.001148,0.000941,0.000578,0.000433,-0.000333,-0.000517,0.000544,0.000665,0.000245,-4.5e-05,-0.000523,0.000882,-0.001388,-0.000497,0.000405,-0.00018,-0.000589,0.000346,-7e-06,-0.000286,-0.000577,-0.000548,-0.000422,-0.001016,-0.001111,-6.6e-05,-0.001177,-0.001324,-0.000838,-0.001742,-0.000269,0.00023,0.000833,-0.000105,0.000321,0.000183,0.000748,-0.001266,-0.000228,-0.000235,0.001443,0.001453,-0.000451,-0.000106,0.000298,-0.000714,-0.000312,-0.000715,-0.000159,-0.00046,0.000668,0.000642,0.000328,-5.6e-05,-0.000425,-0.000288,-1.6e-05,0.000372,-3.7e-05,-0.000406,-0.000571,-0.000151,-5.7e-05,-0.000394,0.000596,0.001397,0.000642,0.000491,0.000261,-0.000926,0.000599,-0.000211,-0.000464,-0.000403,3e-04,-0.001091,-0.000202,-0.000103,0.000315,0.000393,-6e-05,0.000303,-0.000838,-0.000374,-0.00013,-3.4e-05,-0.000202,-0.000708,0.000902,0.000112,-0.000631,-1.3e-05,9.9e-05,0.000744
-0.000398,0.000724,-0.00025,-0.000243,-0.000385,-0.000121,-0.000259,0.00012,9.3e-05,-0.00068,0.000212,0.001139,0.001385,0.000431,-0.000328,0.00078,0.00011,0.000285,0.000639,0.000463,0.000947,-5.4e-05,-0.000748,0.00068,9.7e-05,0.000106,0.00068,-0.000406,-0.000887,-0.000888,-0.000638,0.00038,-8e-06,-0.001057,-0.000863,-0.000116,-0.00052,0.000343,-0.000227,0.000945,6e-05,-0.000199,0.000263,0.000385,-0.000256,-7.7e-05,0.000251,0.00072,0.000523,5.9e-05,0.001274,0.001077,0.000203,0.001188,0.001132,0.000414,0.000754,0.000366,-0.000649,-0.001099,7.4e-05,-0.000535,-0.000439,-0.000205,0.000552,0.000438,0.000582,-0.000423,-0.001011,0.00072,0.000295,-0.000851,-0.000244,9.6e-05,0.000232,-6.1e-05,0.000405,-0.000847,-0.000533,-0.000341,-5.1e-05,0.000498,0.000542,0.000158,0.000122,-0.000267,-0.000376,0.000183,0.00015,-3.5e-05,0.000634,0.000206,-0.000817,-0.000965,-0.000589,-0.000423,0.000753,-0.000509,3e-06,0.000359,0.000535,-7.7e-05,0.000743,0.000328,0.000427,-0.000245,-2.2e-05,-4.9e-05,8.8e-05,0.000589,0.000288,4.9e-05,-0.000163,-6.9e-05,0.000369,-0.000696,-0.000126,0.000457,9.7e-05,-8.5e-05,-0.000732
0.000408,-0.000581,-8.2e-05,0.000125,4.4e-05,-7.6e-05,0.000429,7.3e-05,-5.4e-05,0.000721,-5.2e-05,-0.000792,-0.000826,-0.000159,-7.4e-05,-0.000654,-0.000535,-0.000146,-0.000568,0.000159,-0.000376,-0.000335,0.000662,-0.000934,-0.000372,-0.000605,-0.001036,-0.000142,0.000698,0.000658,0.000686,5.7e-05,0.000133,0.000567,0.00088,0.000184,0.000688,0.000116,-0.000224,-0.000858,0.00025,-9e-05,-0.000745,-0.000292,2.5e-05,-2.7e-05,0.000222,-0.000547,-0.000234,8e-06,-0.000997,-0.001115,-0.000273,-0.000699,-0.000326,-0.000416,-2.8e-05,-0.000427,0.000967,0.000952,-0.00047,0.000184,1.8e-05,0.000233,-1.9e-05,-0.000383,-0.000687,-0.000252,0.000415,-0.000526,-0.000463,0.000767,0.000462,3.7e-05,0.000189,-0.000341,-0.000357,0.000625,5.2e-05,6e-05,0.00027,-0.000538,-0.000254,-0.000205,-0.000172,0.000385,0.000554,1e-04,-0.000117,0.000384,-0.000241,-0.000122,0.000711,0.000647,0.000412,0.000291,-0.00043,0.000232,-7.4e-05,-0.000107,-0.000491,-0.000205,-9.1e-05,-0.00034,-0.000465,0.000177,-0.000209,0.000303,-0.000143,-0.00052,-9.6e-05,7e-06,0.000119,-0.000222,-0.000104,0.00043,-0.000238,-0.000189,5.9e-05,-5.4e-05,0.000673
-0.000334,0.000319,7.6e-05,-2.5e-05,0.000277,2.3e-05,-0.000354,-4.1e-05,-0.000115,-0.000759,-0.000229,0.000719,0.000276,2.9e-05,0.000498,0.00047,0.000884,0.000103,0.000163,-0.000238,6.1e-05,0.000329,-0.000472,0.000525,0.000294,0.000509,0.000875,0.000301,-0.000624,-0.000454,-0.000595,-4.5e-05,-0.000226,-0.000116,-0.000478,-0.000476,-0.000827,-0.000226,0.000554,0.000795,1.1e-05,0.000159,0.000813,6.4e-05,-0.000145,0.000395,-0.000175,0.000299,0.000213,0.000224,0.000686,0.000801,0.000501,0.000555,-0.000134,0.000167,-0.000197,0.000463,-0.000981,-0.000637,0.000449,-0.000266,-8e-06,-0.000404,0.000144,0.000269,0.000933,0.000292,-0.00033,7.5e-05,0.000283,-0.000382,0.000154,7.1e-05,-2e-05,0.000968,4.8e-05,-0.000446,0.000118,0.000126,-7.1e-05,0.000495,0.000119,0.000187,9e-06,-0.000262,-0.000344,-0.000184,0.000565,-0.00035,0.000258,-0.000188,-0.000268,-0.000319,-0.000231,-8.5e-05,5e-05,-0.000104,0.000319,1.5e-05,0.000293,0.000287,2.3e-05,8.7e-05,0.000469,-0.000103,9.6e-05,-0.000273,0.000232,0.000438,-0.000167,-0.000217,2.3e-05,0.00038,5.1e-05,-0.000212,0.000523,3.4e-05,-0.000193,-4e-06,-0.000548
0.000143,-0.000181,-0.000109,-8e-06,-0.000365,-6.2e-05,7.5e-05,0.000101,0.000195,0.000438,0.000343,-0.00044,6.6e-05,6.6e-05,-0.00023,-0.000395,-0.000718,-6.9e-05,9.4e-05,0.000285,1.1e-05,-0.000225,0.000314,-0.000142,-7.4e-05,-0.000156,-0.000175,-5.8e-05,0.000199,0.00023,0.000642,7.4e-05,-2e-06,-0.000233,0.000125,0.000457,0.000568,0.000322,-0.000677,-0.00047,-0.000261,-0.000236,-0.000739,-0.000166,0.000309,-0.000289,0.000209,-5e-06,-0.000266,-0.000334,-0.000333,-0.000399,-0.000813,-0.000556,0.000463,5.1e-05,0.000255,4.5e-05,0.00065,0.000311,-0.000295,0.000146,9.4e-05,0.000825,-3.1e-05,2.4e-05,-0.000951,-0.000397,0.00041,6.5e-05,-0.000403,1.4e-05,-0.000336,-0.000456,-0.000279,-9e-04,-4.2e-05,0.000371,9e-06,2.7e-05,-7e-06,-0.000506,-0.000326,-0.000288,-0.00012,-0.000104,0.000286,0.000146,-0.000445,0.000186,-0.000335,0.000319,2e-06,-9e-06,0.000146,9.7e-05,-2.9e-05,-0.000175,-0.000161,-5.6e-05,-0.000127,-0.000102,-0.000136,-0.000116,-0.00028,0.000123,1.8e-05,-0.000129,-0.000377,-0.000521,0.000186,0.000269,-1.9e-05,-4.9e-05,5e-05,-4e-05,-0.000663,-0.00017,0.00021,0.000301,0.000204
-0.000105,0.000133,4.6e-05,-3e-06,0.000316,9.5e-05,3.2e-05,-0.000125,-0.000161,-5.3e-05,-0.000225,0.00027,-0.000128,-0.000328,-0.000109,0.000272,0.000284,0.000188,-0.000146,-0.000316,-0.000213,0.000141,-0.000113,3e-05,-0.000208,9.7e-05,0.00011,2e-05,0.000219,-9.7e-05,-0.000437,-8e-06,-3.6e-05,0.000407,8e-05,-0.000205,-0.000405,-0.000193,0.000449,0.000361,0.000561,0.000241,0.00046,2e-04,-6.9e-05,-9.3e-05,-4.6e-05,0.000162,0.000323,0.00018,0.000202,0.000201,0.000655,0.000466,-0.000161,-0.000279,-0.000234,-0.000113,-0.000264,-9.1e-05,0.000145,0.000179,-4.2e-05,-0.000711,-5.3e-05,-0.000211,0.000615,0.00018,-0.000526,-9e-06,0.000365,0.000144,0.000135,0.000304,0.000405,0.000516,0.000248,-6.3e-05,-0.000162,-0.000115,-2.5e-05,0.00024,0.00034,0.000266,0.000111,4.1e-05,-0.000248,-7.4e-05,0.000251,3.3e-05,9.4e-05,-9.9e-05,9.4e-05,4.5e-05,2.3e-05,-0.000138,0.000207,0.00031,1.9e-05,6.3e-05,-7.2e-05,1.8e-05,0.000242,9e-05,0.000218,8.3e-05,6e-06,0.000256,7.4e-05,0.000374,-5.3e-05,2.1e-05,9.5e-05,-4.9e-05,-0.000139,0.000219,0.000586,0.000229,-0.00012,-0.000349,-0.000203
3.2e-05,-0.000174,3e-06,1.3e-05,-0.000119,-1e-06,-3.8e-05,0.000193,5.5e-05,-3.8e-05,0.00015,-0.000189,0.000255,0.000381,0.00017,-0.000225,-7e-06,-0.00016,0.000109,0.000103,0.000156,-0.000226,-5.1e-05,-3.1e-05,2e-04,9.3e-05,-0.000213,-1.3e-05,-0.000148,0.000183,0.000164,-0.000107,9.7e-05,-0.000218,4e-06,4.3e-05,0.000156,-5.5e-05,-2e-04,-0.000242,-0.000699,-0.000204,-0.000256,-8.5e-05,0.000153,0.000174,-8.4e-05,-0.000243,-0.000447,3.2e-05,-0.000115,-3.6e-05,-0.000316,-0.000324,0.000135,0.000247,7e-05,-0.000122,0.000148,-5.6e-05,-4.7e-05,-0.000166,0.000194,0.000377,-4.1e-05,0.000142,-0.000311,-1.8e-05,0.00047,-2.1e-05,-0.000181,-0.000361,-0.000108,3.9e-05,-0.000309,-0.000163,-0.000306,-0.000176,0.000248,-0.000129,1e-05,-4.5e-05,-0.000209,-0.000194,2.1e-05,-0.000101,6.5e-05,0.000113,1e-05,-9.2e-05,3.8e-05,-9.2e-05,-0.00027,0.000107,-3.1e-05,9.9e-05,-0.000278,-0.000188,-6.2e-05,5.8e-05,0.000136,-1.3e-05,-0.000211,-2.5e-05,2e-06,-7e-05,-3.6e-05,-0.000137,5.8e-05,-0.000201,-2.9e-05,-7.5e-05,-0.000163,7.9e-05,0.000133,-0.000171,-0.000439,-5.1e-05,-8.7e-05,0.000293,0.000156
-2e-05,0.000256,6.3e-05,-0.000107,-1.5e-05,-3.3e-05,-1.6e-05,-0.000247,3.7e-05,1.4e-05,-0.000129,0.000142,-0.000305,-0.000258,-0.00028,0.000179,-0.000261,-5.5e-05,-1.6e-05,1e-06,-7.6e-05,0.000264,9.2e-05,0.000178,-0.000183,-0.000144,3e-04,0.000124,2.7e-05,-9.3e-05,3.9e-05,0.00016,0.000131,4.5e-05,-0.000155,9.4e-05,-4.6e-05,0.000166,9e-06,0.00015,0.000502,6e-05,0.00033,-4.4e-05,-7.9e-05,-0.000132,-0.000113,0.000211,0.000301,-2.9e-05,5e-05,3.2e-05,8.6e-05,0.000238,-0.00022,8.6e-05,-3e-05,0.000218,4.6e-05,8.2e-05,0.000136,0.000228,-0.00011,-6e-05,2.3e-05,8e-06,9.3e-05,3.2e-05,-0.000135,9.5e-05,0.000145,0.00046,-4e-05,0,0.000121,-1.8e-05,0.000321,0.000277,-0.000268,0.000235,2.5e-05,6.8e-05,7.5e-05,6.2e-05,-7.5e-05,0.000141,3.9e-05,-0.000117,-0.000148,6e-06,-0.000128,0.000109,0.000111,-7.7e-05,-3.9e-05,-9e-05,0.000107,-1.3e-05,4.2e-05,-0.000216,-2.3e-05,3.5e-05,3.1e-05,7.6e-05,-0.000159,4.8e-05,-5.5e-05,-0.000116,-0.000102,0.000117,4.5e-05,2.6e-05,0.000149,-3.3e-05,-0.000154,8.8e-05,0.000293,-0.000103,9.7e-05,-0.000196,-0.000126
-5.1e-05,-0.000243,-8.4e-05,6.5e-05,5.1e-05,-2e-05,4e-05,0.000134,-4e-06,-0.000135,5.4e-05,-0.000158,7.9e-05,7.7e-05,0.000255,-0.000209,0.000155,0.000162,7.1e-05,-7e-05,4.6e-05,-8.8e-05,-0.000113,-0.000311,0.00015,0.000186,-0.00024,-0.000134,1.5e-05,2.6e-05,-6.5e-05,-0.000231,-0.000104,7.3e-05,8.6e-05,-5.5e-05,0.000117,-0.000173,0.000131,-9.2e-05,-0.000373,5.3e-05,-0.000328,7.9e-05,7.6e-05,0.000147,0.000101,-0.000178,-0.000184,-1.1e-05,-0.000113,-3e-06,-0.000101,0,0.000139,-0.000117,0.000124,-0.000138,-0.000131,-6.3e-05,-0.000215,-0.000134,7.1e-05,-0.000172,-0.000177,2.5e-05,-2.4e-05,-9.6e-05,-2.4e-05,4e-05,6.6e-05,-0.000306,0.000161,3.9e-05,-6.3e-05,9.6e-05,-0.000111,-0.000253,0.000205,-0.000105,-1.4e-05,-5.1e-05,8e-06,-1.1e-05,3e-05,-2.6e-05,-3.3e-05,3.3e-05,0.000148,-7.9e-05,8.8e-05,-7.3e-05,5.6e-05,5e-05,3.7e-05,9.5e-05,4.9e-05,6.1e-05,-3.5e-05,0.000168,-4.2e-05,-8.7e-05,0.000107,4e-05,0.000103,-0.000153,1.8e-05,0.000177,0.000138,-2.5e-05,3.7e-05,-1.5e-05,-8.7e-05,-6.8e-05,2.9e-05,-6.8e-05,-0.000214,0.000122,-7.5e-05,3.5e-05,9.6e-05
0.000154,0.000158,7.1e-05,-9e-06,-8.1e-05,5e-06,-3.4e-05,-1.2e-05,-3e-05,7.4e-05,2.2e-05,0.000181,-6e-06,1.6e-05,-0.000176,9.3e-05,-5.9e-05,-9.5e-05,-8.1e-05,9.6e-05,-2e-06,3.6e-05,8.2e-05,0.00028,-3.9e-05,-0.000192,0.000168,2.1e-05,-6e-05,-2.6e-05,3.5e-05,0.000164,5.1e-05,-0.000117,-0.000101,-4e-06,-3.3e-05,2.4e-05,-2.6e-05,-3e-05,0.000183,-0.000102,0.000118,-5.4e-05,-0.000163,-0.000195,-5.7e-05,7e-05,5e-05,1.3e-05,0.00012,1.9e-05,9.2e-05,-0.00015,-0.000156,0.000108,-5.4e-05,7.3e-05,7.1e-05,6.9e-05,0.000212,4.8e-05,1.4e-05,0.000103,0.000123,4.9e-05,4e-05,0.000105,0.000131,-0.000166,-0.000154,0.000208,-0.000111,-0.000153,9.1e-05,-0.000144,-7.9e-05,0.000132,-0.00015,3.6e-05,-2.1e-05,0.000141,2.4e-05,-2.1e-05,-8e-06,2.9e-05,-7.3e-05,3.9e-05,-9e-05,-2e-06,0,6.8e-05,-0.000186,-9e-06,4.2e-05,-6.4e-05,-4.1e-05,-1e-06,9.8e-05,-4.2e-05,7e-05,-8e-06,-0.000158,-3.6e-05,-8.9e-05,8.1e-05,2.5e-05,-2.5e-05,-5.4e-05,-1.3e-05,-0.000131,-3.2e-05,1.1e-05,9e-05,4.6e-05,4.9e-05,0.000157,-6.4e-05,4.2e-05,6.8e-05,-5.3e-05
-6.8e-05,-0.000114,-5e-05,-2e-06,7.8e-05,-1e-05,1e-06,-5.3e-05,1.7e-05,1e-06,-3e-05,-0.000139,2e-05,-3e-05,3.1e-05,-2.6e-05,-6e-06,-1.8e-05,3e-06,-0.000105,3e-05,-7.5e-05,1.6e-05,-0.000174,-6e-06,0.00013,-5.6e-05,-4.7e-05,4.8e-05,2.4e-05,-1.9e-05,-0.000156,-2e-06,0.000126,1.4e-05,-2.8e-05,-5.1e-05,-1.8e-05,3.5e-05,9.9e-05,-1e-06,9.5e-05,-5.9e-05,4.8e-05,9.5e-05,8.1e-05,1.7e-05,-7e-06,3.4e-05,-1e-06,-4.9e-05,-7.3e-05,1.5e-05,7.4e-05,0.000179,-2.1e-05,2.3e-05,7e-06,-0.000113,-6e-05,-0.000156,1.6e-05,-0.000103,-4.9e-05,-1.5e-05,-3.3e-05,-1.7e-05,-4.7e-05,-0.000163,0.000222,5.8e-05,-7.7e-05,9.7e-05,7.4e-05,-5.4e-05,0.000118,6.7e-05,-3.7e-05,9.5e-05,-2.2e-05,1.5e-05,-9.6e-05,-1.8e-05,2.8e-05,9e-06,4e-06,0.000116,-4.2e-05,-4e-06,-2.6e-05,-7.9e-05,-6.6e-05,0.000137,7e-06,-4e-05,2.3e-05,1e-06,-6.3e-05,-5.2e-05,4.8e-05,-6.9e-05,2.6e-05,4.5e-05,-1.9e-05,3.8e-05,-2.1e-05,1.3e-05,-6.9e-05,2.1e-05,1.5e-05,4.5e-05,9.3e-05,4.6e-05,-4.2e-05,0,-2.1e-05,-5.9e-05,4.8e-05,-3.7e-05,-6.6e-05,5e-05
3.3e-05,8.7e-05,3.5e-05,1.4e-05,-5.1e-05,4e-06,3.7e-05,1e-06,7e-06,1.4e-05,3.3e-05,6.9e-05,0,3.2e-05,8.5e-05,6.4e-05,3.6e-05,5e-05,6e-06,9.5e-05,-2.9e-05,2.1e-05,-3.8e-05,5e-05,4.3e-05,-6.2e-05,-2.4e-05,6.1e-05,-6e-06,-4.2e-05,2.4e-05,0.000111,-2.9e-05,-0.000101,6.2e-05,3.6e-05,7.2e-05,1.7e-05,-4.6e-05,-6.4e-05,-5.2e-05,-4.9e-05,7.1e-05,-3.8e-05,-6.6e-05,-7e-06,2.3e-05,-4.9e-05,-3.9e-05,-2.5e-05,-5.8e-05,5.8e-05,-2.9e-05,6.2e-05,-0.000104,-1.8e-05,-2e-06,-9.1e-05,0.000127,1.5e-05,7.7e-05,0,7.3e-05,3e-06,-1.6e-05,-4.6e-05,-7e-06,-9e-06,0.000123,-0.000192,-3.8e-05,-4.6e-05,-7.1e-05,-1e-06,2.1e-05,1.6e-05,-4e-05,-1.8e-05,-4.1e-05,1.2e-05,6e-06,3.4e-05,3e-05,1e-06,2.2e-05,-2.8e-05,-8.1e-05,1e-05,-2.1e-05,6.4e-05,6.4e-05,1.2e-05,-5.6e-05,-3.1e-05,3.7e-05,-1.4e-05,1.7e-05,0.000101,1.9e-05,-8.8e-05,3.9e-05,1e-05,1.3e-05,-4e-06,4e-06,8e-06,5e-06,5.1e-05,1e-05,1.5e-05,3.6e-05,-3.6e-05,-5e-05,1.6e-05,-1e-05,-2.8e-05,4.5e-05,-3.6e-05,-3e-06,5e-05,-5e-06
-2.4e-05,-7.2e-05,-2.8e-05,1.1e-05,2.2e-05,8e-06,-4.6e-05,2e-06,-1.7e-05,-8e-06,-3e-05,-6.4e-05,1.1e-05,-1.4e-05,-8.9e-05,-8.3e-05,-6.2e-05,-2.2e-05,1.6e-05,-6.9e-05,1.2e-05,2.9e-05,2.3e-05,9e-06,-6e-06,-2e-06,4.1e-05,-5.3e-05,1.6e-05,2.1e-05,-2.2e-05,-6.6e-05,1.3e-05,3.3e-05,-8.4e-05,-4.1e-05,-5.2e-05,-2.6e-05,3.2e-05,3.9e-05,8.7e-05,3.3e-05,-6.6e-05,1.6e-05,2.4e-05,-2.6e-05,-5.6e-05,-1e-06,4.6e-05,1.1e-05,4.4e-05,-5.5e-05,-1.2e-05,-5.2e-05,-3.8e-05,-4.7e-05,8e-06,6.4e-05,-9.6e-05,2.4e-05,-1e-05,-2.5e-05,-2.4e-05,-3.8e-05,4e-06,4.7e-05,-1.2e-05,0,-5.5e-05,9e-05,-3.1e-05,0.000102,1.8e-05,-7e-06,-3.2e-05,-9.4e-05,-2.3e-05,4.7e-05,7.6e-05,-6e-06,-1.7e-05,-4.3e-05,-4.2e-05,7e-06,-3.5e-05,1e-06,-5e-06,2.1e-05,8e-06,-5.7e-05,-9e-06,7e-06,1.2e-05,-5.1e-05,-3.8e-05,-8e-06,1.1e-05,-9.1e-05,-2.3e-05,8e-05,-1e-05,-2.8e-05,3.4e-05,-7e-06,-4.6e-05,8e-06,-1.2e-05,-3.3e-05,-2.9e-05,2e-05,-2.5e-05,5e-06,4e-05,1.1e-05,2.1e-05,3e-05,-5.3e-05,2.8e-05,1.5e-05,-2.2e-05,-3.2e-05
1.4e-05,5.2e-05,1.8e-05,-2.1e-05,-1e-05,-9e-06,7e-06,6e-06,9e-06,4e-06,1.2e-05,3.5e-05,-2.6e-05,-3e-06,2.3e-05,7.8e-05,7.6e-05,-1.6e-05,-8e-06,3.2e-05,-1e-05,-4.6e-05,-1.7e-05,1.1e-05,-1.6e-05,5.4e-05,-4.5e-05,-2.5e-05,-6e-06,1.7e-05,-7e-06,6.8e-05,-2.4e-05,5.5e-05,6.7e-05,1.1e-05,2.9e-05,2.5e-05,-1.7e-05,-3.6e-05,-8.6e-05,-1.8e-05,2.7e-05,2e-05,-1.7e-05,3.1e-05,3.5e-05,1.3e-05,8e-06,7e-06,1.6e-05,4.7e-05,4.7e-05,4.6e-05,7.1e-05,2.4e-05,-3e-05,-3.7e-05,4.7e-05,-4.3e-05,-3e-06,2.2e-05,1.3e-05,8.9e-05,1e-05,-4.2e-05,2.2e-05,-2.3e-05,-3e-06,-4.5e-05,6.5e-05,-0.000142,1.5e-05,3.6e-05,1.8e-05,8.5e-05,3.2e-05,-5.2e-05,-0.000101,1e-05,4e-06,2.6e-05,2.4e-05,1.1e-05,3.1e-05,-3e-06,4.7e-05,-1.4e-05,-4e-06,3e-05,-1.2e-05,-1.9e-05,6.6e-05,5.2e-05,2.3e-05,-3e-06,-3.2e-05,5.9e-05,1.3e-05,-6.4e-05,9e-06,5e-06,-4.5e-05,-9e-06,3.5e-05,-2.3e-05,1.5e-05,5.1e-05,3.8e-05,-2.7e-05,-2.4e-05,-2.5e-05,-3.5e-05,-1.9e-05,-7e-06,-1.7e-05,3.1e-05,-5e-06,1e-05,1.3e-05,5.6e-05
1.2e-05,-5.2e-05,-4e-06,1.6e-05,-5e-06,1e-05,2.9e-05,1e-05,3e-06,1.5e-05,6e-06,-2.9e-05,2.5e-05,8e-06,3.7e-05,-5e-05,-3.5e-05,1.5e-05,1.3e-05,-4e-06,8e-06,5.3e-05,9e-06,-4.4e-05,-2e-06,-6.9e-05,1e-05,5.1e-05,-1.3e-05,-3e-06,2.2e-05,-6.6e-05,5e-05,-7.6e-05,-1e-06,1.5e-05,-2.7e-05,4e-06,-1.1e-05,3.7e-05,3.9e-05,-1.5e-05,-3.2e-05,-2.7e-05,-5e-06,-9e-06,-2.1e-05,-1.2e-05,-3.1e-05,-1.7e-05,-4e-05,-2.8e-05,-3.2e-05,-6.9e-05,-8.9e-05,-8e-06,1.9e-05,1.9e-05,-2.2e-05,5.4e-05,-1.5e-05,3e-06,1.6e-05,-9.8e-05,3.2e-05,1.6e-05,-7e-06,2.4e-05,1.4e-05,2.6e-05,-7.2e-05,0.000108,-2.2e-05,-5.1e-05,-3e-05,-4.5e-05,4e-06,5.6e-05,8.8e-05,-3e-06,1.7e-05,-7e-05,-2.3e-05,-1.6e-05,-2.3e-05,7e-06,-2.2e-05,-8e-06,2.2e-05,2e-05,3.9e-05,-1e-05,-6.3e-05,-7e-06,-4.6e-05,-1.6e-05,6.1e-05,-1.1e-05,1.8e-05,3.5e-05,-2.7e-05,1.8e-05,3e-05,8e-06,1.2e-05,0,-6e-06,-4.8e-05,-3.9e-05,2.2e-05,5.1e-05,3.2e-05,2.1e-05,-1e-05,-2e-06,1.1e-05,-3.2e-05,-2e-05,3e-06,-2e-05,-7.2e-05
-4.1e-05,5.3e-05,-2e-06,-3.1e-05,1.6e-05,-1e-06,-1.5e-05,-2.3e-05,-1.3e-05,-1.3e-05,-1.1e-05,3.6e-05,-4e-06,-7e-06,-6.2e-05,3.5e-05,-1.1e-05,1e-06,-9e-06,-4e-06,-2.7e-05,-4.1e-05,-2e-06,7.2e-05,-1e-05,4.7e-05,2.6e-05,-3.3e-05,2.2e-05,7e-06,-1.6e-05,4.9e-05,-5e-05,6.1e-05,-3.9e-05,1e-06,2.4e-05,-1.8e-05,2.3e-05,-4.3e-05,0,3.9e-05,5.3e-05,1.6e-05,1.4e-05,-2.2e-05,6.6e-05,-2.8e-05,3.9e-05,6e-06,3.2e-05,2e-05,1.7e-05,4.8e-05,5.6e-05,7e-06,-1.6e-05,5e-06,1.1e-05,-5.3e-05,4.7e-05,-7e-06,-2.1e-05,7.4e-05,-3.6e-05,2e-06,4e-06,-1.1e-05,1e-05,-1.9e-05,7.7e-05,-7.3e-05,3.2e-05,2.8e-05,4.1e-05,1.3e-05,-9e-06,-4.3e-05,-8.2e-05,0,-2e-05,3.6e-05,2e-05,-4e-06,3.4e-05,-1.9e-05,8e-06,1.1e-05,-3.8e-05,-1.8e-05,-4.3e-05,2.4e-05,3.6e-05,5e-06,3.7e-05,1.1e-05,-7.3e-05,-3.2e-05,-2e-05,-1.1e-05,2.9e-05,7e-06,-1.8e-05,9e-06,-4.6e-05,4e-06,-1.6e-05,1.6e-05,3e-06,-2.4e-05,-3.1e-05,-3.3e-05,-3e-06,5e-06,-6e-06,2e-06,2.8e-05,2.8e-05,-1.2e-05,2.3e-05,5.6e-05
4.5e-05,-4.6e-05,1e-06,2.8e-05,-2e-05,-7e-06,-1.3e-05,1.1e-05,9e-06,-2.5e-05,4e-06,-3.3e-05,-1.3e-05,2e-06,6.5e-05,-2e-05,5e-05,2e-06,-2e-06,1.1e-05,4.5e-05,1e-05,-5e-06,-6.8e-05,0,-2.3e-05,-2.5e-05,1.7e-05,-3.4e-05,-1.5e-05,2.1e-05,-3.5e-05,3.5e-05,-4.1e-05,2.8e-05,-5e-06,6e-06,1.5e-05,-4.6e-05,4.9e-05,-2.6e-05,-2.4e-05,-4.3e-05,-1.2e-05,-1.9e-05,9e-06,-4e-05,2.5e-05,-3.3e-05,6e-06,-4e-06,-1.5e-05,-6e-06,2e-06,-2.6e-05,1.4e-05,1.5e-05,-1.2e-05,-1e-05,3.9e-05,-6.2e-05,-2e-06,1.1e-05,1.2e-05,2.4e-05,-1.6e-05,-1e-06,2e-06,-2.7e-05,5.1e-05,-4.2e-05,3.1e-05,-5.9e-05,-3e-06,-3e-05,6e-06,1.3e-05,1.2e-05,6.9e-05,3e-06,5e-06,0,-2.3e-05,2e-05,-3.1e-05,1.8e-05,-8e-06,-2e-06,5.2e-05,-1e-06,1.7e-05,-9e-06,-1.4e-05,1e-06,-3.5e-05,0,5.3e-05,5.1e-05,5e-06,1e-05,-3.1e-05,-8e-06,9e-06,6e-06,4.6e-05,-2e-06,5e-06,6e-06,1.7e-05,2.2e-05,4e-06,2e-05,-1.1e-05,-7e-06,-1.1e-05,-5e-06,-2.6e-05,-3.4e-05,3e-06,-1.7e-05,-3.3e-05
-3.5e-05,4.4e-05,-1e-06,-7e-06,1.5e-05,0,1.7e-05,7e-06,-2e-06,2.1e-05,4e-06,8e-06,1.7e-05,5e-06,-3.7e-05,2e-06,-4.6e-05,-1.1e-05,-4e-06,-1.4e-05,-4.9e-05,2e-05,1.2e-05,4e-05,-6e-06,-5e-06,4e-06,-1.8e-05,2.4e-05,-2e-06,-1.7e-05,2.1e-05,-2e-05,3e-06,1.8e-05,-4e-06,-2.2e-05,-5e-06,4.1e-05,-4.6e-05,5.7e-05,3e-06,2.2e-05,6e-06,3e-06,6e-06,9e-06,-2.4e-05,1.7e-05,-7e-06,-7e-06,1.2e-05,-6e-06,-6e-06,2.7e-05,-5e-06,-1.3e-05,1.1e-05,-1e-06,-1.4e-05,4.5e-05,-1e-06,-1.5e-05,-3.8e-05,-9e-06,9e-06,6e-06,1.7e-05,4.2e-05,-6.9e-05,2.3e-05,1.3e-05,5.2e-05,-2e-06,1.5e-05,-1.6e-05,2e-06,1.2e-05,-4.2e-05,-1.3e-05,9e-06,6e-06,1.3e-05,-1.8e-05,9e-06,-2e-06,-1e-06,-4e-06,-4.3e-05,1.7e-05,-1e-06,-3e-06,1.3e-05,7e-06,3.1e-05,2e-06,-2.7e-05,-5.6e-05,4e-06,-1.4e-05,2.5e-05,-1e-06,1e-06,-7e-06,-4.4e-05,1e-06,1e-05,-1e-06,-2e-05,-2.3e-05,6e-06,-1e-05,1.7e-05,1.6e-05,1.9e-05,5e-06,3.4e-05,9e-06,1e-06,9e-06,1.5e-05
2.6e-05,-4e-05,-2e-06,-1e-06,-7e-06,-3e-06,-3e-06,-4e-06,-3e-06,-1.3e-05,-4e-06,0,-1.6e-05,-1.1e-05,-5e-06,-3e-06,2.2e-05,1.2e-05,1e-06,2.4e-05,4.2e-05,-3.7e-05,-1.5e-05,-1.1e-05,6e-06,1.7e-05,3e-06,1.8e-05,-4e-06,-1e-06,2e-06,-7e-06,1.8e-05,2.2e-05,-5.9e-05,5e-06,2.3e-05,1.1e-05,-1.9e-05,4.4e-05,-7.1e-05,-3e-06,-2e-05,-5e-06,-4e-06,1.7e-05,2.4e-05,2.2e-05,-4e-06,-1e-06,1.3e-05,-1.5e-05,-1e-06,1.8e-05,-3.7e-05,1e-05,1.6e-05,-1.6e-05,3e-06,0,-1.4e-05,-3e-06,-2e-06,5.3e-05,1.3e-05,3e-06,-1.1e-05,-1.2e-05,-2.3e-05,4.6e-05,2e-06,-3.1e-05,-4.1e-05,-3e-06,-7e-06,2e-05,-1.3e-05,-2.7e-05,2.6e-05,9e-06,-1.2e-05,-8e-06,1e-06,1e-05,9e-06,2e-06,9e-06,-7e-06,3.2e-05,-1.3e-05,-5e-06,2e-06,1.1e-05,-1e-06,-1.6e-05,-6e-06,2.9e-05,5.3e-05,-5e-06,4e-06,-1e-06,1.7e-05,4e-06,2e-06,4.7e-05,7e-06,6e-06,-1.7e-05,2.9e-05,2.7e-05,7e-06,6e-06,-1.4e-05,-8e-06,-4e-06,3e-06,-3.4e-05,1.6e-05,2e-06,3e-06,-4e-06
-1e-05,3.6e-05,1e-06,7e-06,1e-06,4e-06,-1e-05,2e-06,5e-06,2.6e-05,1e-06,-2e-06,1.9e-05,1.2e-05,3.5e-05,9e-06,1e-06,-7e-06,-1e-06,-3.2e-05,-1.9e-05,4.2e-05,8e-06,-3e-06,4e-06,-1.9e-05,-1.3e-05,-2e-06,-3e-06,9e-06,1.2e-05,-2e-06,-1.3e-05,-3.7e-05,5.7e-05,-2.3e-05,-3.6e-05,-1.1e-05,8e-06,-3.6e-05,6.4e-05,0,1.5e-05,4e-06,1.3e-05,-1.8e-05,-2.8e-05,-7e-06,-5e-06,5e-06,-4e-06,1.9e-05,1.8e-05,-4.2e-05,4.3e-05,-1.5e-05,-6e-06,2.1e-05,-1.4e-05,1.4e-05,-6e-06,-2e-06,8e-06,-2.2e-05,-2.4e-05,-1e-05,1.1e-05,9e-06,-3e-06,-8e-06,-3.5e-05,4.8e-05,8e-06,-1.1e-05,1.6e-05,-2.6e-05,-3e-06,3.4e-05,-2.4e-05,3e-06,6e-06,2.6e-05,0,-1e-06,-2.2e-05,1e-05,-4e-06,1.8e-05,-5e-06,-8e-06,1e-05,-7e-06,-3.4e-05,-1.6e-05,1.4e-05,-5e-06,-5e-05,-3.9e-05,-2e-06,2e-06,-7e-06,-4e-06,-3e-06,-3e-06,-2.4e-05,-5e-06,-3e-06,1.6e-05,-2.2e-05,-2.3e-05,-1.9e-05,-9e-06,8e-06,0,-1.3e-05,-1.7e-05,3.2e-05,-1.5e-05,0,-1.1e-05,1e-06
4e-06,-3.1e-05,0,-1.3e-05,2e-06,0,1.5e-05,-8e-06,-2e-06,-1.9e-05,0,2e-06,-1.4e-05,-9e-06,-4.4e-05,-1.3e-05,-1.7e-05,7e-06,4e-06,2.5e-05,1.1e-05,-2.9e-05,-3e-06,-1e-06,6e-06,1.6e-05,1e-05,-7e-06,1.2e-05,-9e-06,-1.8e-05,8e-06,-7e-06,3.7e-05,-1.3e-05,2.1e-05,3.1e-05,7e-06,1.6e-05,2.8e-05,-4.1e-05,1.1e-05,-9e-06,-3e-06,-1.5e-05,-1.4e-05,8e-06,1.3e-05,1e-06,-1e-06,1e-06,-1.4e-05,-1.9e-05,3e-05,-1.9e-05,1e-06,4e-06,-1e-05,2.2e-05,-2.8e-05,1.4e-05,3e-06,-1e-05,-6e-06,1.7e-05,1.3e-05,-6e-06,-8e-06,2.2e-05,-1.3e-05,4.6e-05,-5.6e-05,3.5e-05,2.5e-05,-2.3e-05,1.1e-05,0,-3.2e-05,3.6e-05,-7e-06,3e-06,-2.3e-05,-5e-06,-7e-06,1.8e-05,-5e-06,-2.4e-05,-6e-06,-5e-06,1.7e-05,-1e-05,1.8e-05,1.4e-05,9e-06,-6e-06,7e-06,5.1e-05,1.5e-05,7e-06,-1.4e-05,5e-06,-1.2e-05,0,-8e-06,7e-06,1.1e-05,-8e-06,6e-06,5e-06,2.5e-05,4e-06,1e-06,-8e-06,5e-06,1.3e-05,2.3e-05,-3.1e-05,1e-05,5e-06,1.7e-05,1e-06
1.2e-05,3e-05,2e-06,1e-05,-4e-06,1e-06,-1e-05,7e-06,-2e-06,-2e-06,-1e-06,3e-06,0,5e-06,2.9e-05,6e-06,1.7e-05,-8e-06,2e-06,-1.8e-05,-1.2e-05,3e-06,1e-06,1.4e-05,-3e-06,-6e-06,-1.3e-05,7e-06,-1.2e-05,1.2e-05,2.2e-05,-1.1e-05,1.8e-05,-1.3e-05,-2.8e-05,-6e-06,-1.7e-05,-4e-06,-2.5e-05,-2.7e-05,0,-1.5e-05,7e-06,1e-06,9e-06,1.5e-05,-7e-06,-1.1e-05,-2e-06,-3e-06,0,1.2e-05,4e-06,-1e-06,-1.5e-05,-6e-06,-9e-06,4e-06,-1.7e-05,3.4e-05,-2e-06,-7e-06,1e-05,4e-06,-7e-06,-8e-06,1e-06,0,-3e-05,1.5e-05,-4.7e-05,4.1e-05,-3.5e-05,-1.6e-05,1.2e-05,1.2e-05,7e-06,2.2e-05,-3.9e-05,4e-06,-1e-05,1.3e-05,1e-05,1e-05,-1.9e-05,0,4.2e-05,-8e-06,4e-06,-1.5e-05,-4e-06,-1.2e-05,-1.2e-05,2e-06,-8e-06,3e-06,-3.1e-05,4e-06,-3e-06,2.2e-05,0,3e-06,2e-06,0,-8e-06,-1.1e-05,2e-06,-2.5e-05,1.1e-05,-3e-05,9e-06,-9e-06,4e-06,-1.3e-05,-2e-06,-2.4e-05,2.8e-05,-1.3e-05,-6e-06,-1.7e-05,0
-2e-05,-2.9e-05,-1e-06,-1.1e-05,7e-06,-1e-06,-7e-06,1e-06,3e-06,1.5e-05,2e-06,4e-06,5e-06,0,-1e-06,4e-06,-1.9e-05,5e-06,-2e-06,1.1e-05,1.5e-05,1.3e-05,5e-06,-2.3e-05,8e-06,-6e-06,1e-05,0,4e-06,0,-2e-05,1.4e-05,-1.7e-05,-9e-06,3.8e-05,5e-06,4e-06,2e-06,2.3e-05,2.8e-05,3.3e-05,6e-06,-8e-06,2e-06,1e-06,5e-06,1.2e-05,2.4e-05,2e-06,3e-06,1e-06,-1.1e-05,0,-1e-06,4.2e-05,0,6e-06,-1e-06,1.2e-05,-3e-05,-1.6e-05,6e-06,-1e-06,9e-06,0,-2e-06,3e-06,0,1.5e-05,-1.7e-05,3.2e-05,-1.9e-05,2e-05,4e-06,-1e-06,-2.2e-05,-8e-06,-6e-06,2.9e-05,-1e-06,7e-06,-1.5e-05,-8e-06,-7e-06,1.1e-05,-5e-06,-1.6e-05,6e-06,3e-06,-5e-06,8e-06,-3e-06,8e-06,-9e-06,1.1e-05,-1e-06,2.1e-05,-1e-05,-1e-06,-1.8e-05,-8e-06,1e-06,-4e-06,4e-06,2.1e-05,0,4e-06,2.5e-05,-2.1e-05,2.7e-05,-1.3e-05,8e-06,3e-06,1e-06,-7e-06,1.2e-05,-2.4e-05,1.8e-05,0,7e-06,0
2.6e-05,2.7e-05,1e-06,1.1e-05,-9e-06,0,1.3e-05,-3e-06,-2e-06,-1.8e-05,0,-9e-06,-5e-06,-2e-06,-2.3e-05,-9e-06,1e-05,-3e-06,0,4e-06,-2.1e-05,-1.3e-05,-5e-06,1.7e-05,-7e-06,1.4e-05,-4e-06,2e-06,0,-7e-06,1.7e-05,-1.3e-05,1.3e-05,1.8e-05,-2.5e-05,5e-06,-3e-06,-7e-06,-1.7e-05,-2.9e-05,-4.4e-05,2e-06,6e-06,-2e-06,9e-06,0,-2.3e-05,-1.3e-05,0,1e-06,-3e-06,7e-06,2e-06,0,-4.2e-05,4e-06,-4e-06,-9e-06,-9e-06,2.3e-05,2.3e-05,0,-8e-06,-3.2e-05,-5e-06,3e-06,-5e-06,1e-06,0,3e-06,-6e-06,-9e-06,-7e-06,2e-06,-2e-06,1.6e-05,2e-06,-1.6e-05,-1.8e-05,-2e-06,1e-06,2e-06,1e-06,2e-06,-4e-06,-3e-06,-2e-05,-3e-06,-1e-05,1e-05,-9e-06,9e-06,6e-06,5e-06,-1.9e-05,-2e-06,-2.3e-05,6e-06,-3e-06,1e-05,1.3e-05,-6e-06,3e-06,0,-2.4e-05,0,-2e-06,-1.2e-05,2.4e-05,-2.1e-05,9e-06,2e-06,-9e-06,8e-06,7e-06,6e-06,2e-05,-5e-06,3e-06,3e-06,-5e-06
-2.7e-05,-2.5e-05,0,-7e-06,9e-06,1e-06,-4e-06,2e-06,2e-06,2e-05,0,1.2e-05,6e-06,-1e-06,3e-05,1.1e-05,3e-06,3e-06,0,-1.4e-05,2.3e-05,8e-06,5e-06,-7e-06,-1e-06,-1.8e-05,2e-06,-6e-06,1e-06,-1e-06,-1.6e-05,1.5e-05,-1.2e-05,-2.8e-05,6e-06,-2e-06,3e-06,6e-06,3e-06,2.5e-05,4.1e-05,-1e-06,-7e-06,0,-1.1e-05,-5e-06,7e-06,7e-06,1e-06,-3e-06,-2e-06,-6e-06,2e-06,-1.1e-05,3.2e-05,1e-06,4e-06,1e-05,7e-06,-1.5e-05,-1.4e-05,-2e-06,8e-06,2.7e-05,7e-06,-3e-06,5e-06,4e-06,-6e-06,5e-06,-1.2e-05,2.9e-05,-3e-06,-3e-06,-2e-06,-1e-06,1.6e-05,2.8e-05,1e-06,3e-06,-7e-06,-1.2e-05,2e-06,2e-06,-2e-06,-2e-06,2.6e-05,-2e-06,1.3e-05,0,1.1e-05,-7e-06,-2.6e-05,4e-06,2.3e-05,0,2.1e-05,-5e-06,-1e-06,-1.3e-05,-9e-06,-9e-06,-5e-06,2e-06,2.8e-05,0,-4e-06,5e-06,-1.5e-05,2.1e-05,0,0,1.1e-05,-5e-06,-3e-06,-1.9e-05,-9e-06,-9e-06,0,-5e-06,1e-05
1.3e-05,2.3e-05,0,1.3e-05,-6e-06,-1e-06,-7e-06,-2e-06,0,-2.3e-05,0,-1.1e-05,-6e-06,3e-06,-2e-05,-1e-05,-1.2e-05,-5e-06,-2e-06,1.8e-05,-1.9e-05,-3e-06,-4e-06,-4e-06,-5e-06,1.5e-05,-7e-06,8e-06,-1e-06,4e-06,1e-05,-1.4e-05,1.3e-05,1.8e-05,-1e-06,-4e-06,9e-06,-2e-06,6e-06,-1.5e-05,-2.3e-05,3e-06,6e-06,0,8e-06,-6e-06,-1e-06,-2e-06,2e-06,1e-06,1e-06,3e-06,-8e-06,5e-06,-2.7e-05,4e-06,-1e-06,-6e-06,-5e-06,4e-06,-2e-06,2e-06,-5e-06,-1.2e-05,-1e-06,7e-06,-3e-06,-3e-06,6e-06,5e-06,2.6e-05,-3.7e-05,7e-06,-4e-06,1.2e-05,-7e-06,-1.8e-05,-2.7e-05,1.6e-05,0,6e-06,1.1e-05,-4e-06,-6e-06,9e-06,1e-06,2e-06,3e-06,-1.2e-05,-1.3e-05,-4e-06,3e-06,2e-05,2e-06,-2.1e-05,2e-06,-1.4e-05,6e-06,5e-06,1.8e-05,-1e-06,5e-06,6e-06,3e-06,-3.6e-05,6e-06,2e-06,-1.6e-05,-1e-06,-1.9e-05,0,-2e-06,-9e-06,4e-06,-2e-06,2.5e-05,6e-06,1.1e-05,-1e-06,-3e-06,-1.1e-05
-3e-06,-2.1e-05,1e-06,-1.6e-05,1e-06,0,7e-06,1e-06,0,1.8e-05,0,1.2e-05,3e-06,-4e-06,1e-06,8e-06,1.5e-05,5e-06,0,-1.8e-05,1.1e-05,0,1e-06,6e-06,1e-06,-6e-06,8e-06,-5e-06,-1e-06,-4e-06,-2e-06,1.2e-05,-1e-05,-3e-06,1.1e-05,-6e-06,-1.4e-05,0,-1.2e-05,1e-05,2e-06,-5e-06,0,-2e-06,-3e-06,3e-06,-6e-06,0,-3e-06,3e-06,2e-06,-3e-06,5e-06,8e-06,3.4e-05,-1e-06,2e-06,5e-06,4e-06,7e-06,1.7e-05,-1e-06,-1e-06,-1.2e-05,-3e-06,-1e-06,1e-06,5e-06,2e-06,-1.9e-05,-3.3e-05,3.6e-05,1e-06,9e-06,-1.2e-05,8e-06,6e-06,2.1e-05,-1.8e-05,-2e-06,-1e-06,3e-06,2e-06,6e-06,-9e-06,3e-06,-2.1e-05,0,5e-06,1.5e-05,-5e-06,0,-1e-06,-4e-06,2.4e-05,-1e-06,1.2e-05,-8e-06,-3e-06,-1.7e-05,4e-06,5e-06,-3e-06,-1e-06,3.9e-05,-5e-06,1e-06,2.9e-05,1.1e-05,1.5e-05,-1e-06,2e-06,7e-06,1e-06,4e-06,-2.3e-05,-7e-06,-1.2e-05,-1e-06,6e-06,1.1e-05
1e-06,1.9e-05,0,1e-05,3e-06,0,1e-06,3e-06,0,-5e-06,1e-06,-8e-06,-1e-06,2e-06,1.6e-05,-8e-06,-1e-05,-2e-06,1e-06,9e-06,-9e-06,-1e-06,1e-06,-2e-06,-1e-06,-2e-06,-4e-06,-1e-06,3e-06,0,-1e-06,-1.1e-05,1e-06,-5e-06,-2e-05,5e-06,1.5e-05,-2e-06,1.2e-05,-7e-06,1.1e-05,4e-06,-4e-06,2e-06,4e-06,4e-06,9e-06,-4e-06,4e-06,-2e-06,-6e-06,3e-06,0,-8e-06,-4.6e-05,0,-3e-06,-2e-06,0,-1.5e-05,-2.1e-05,0,4e-06,2.7e-05,1e-06,-4e-06,1e-06,-4e-06,-9e-06,2.3e-05,2.3e-05,-2.4e-05,-7e-06,-6e-06,3e-06,-7e-06,7e-06,-1e-05,1.1e-05,3e-06,-5e-06,-3e-06,-1e-06,-4e-06,1.1e-05,1e-06,1.4e-05,-2e-06,0,-1e-06,6e-06,-3e-06,-4e-06,0,-2.1e-05,-1e-06,-1e-05,1.1e-05,3e-06,1.1e-05,-5e-06,-6e-06,3e-06,-2e-06,-2.9e-05,0,-1e-06,-2.9e-05,-1.6e-05,-1.2e-05,-1e-06,0,-4e-06,-5e-06,-4e-06,1.3e-05,3e-06,1e-05,-2e-06,0,-1e-05
7e-06,-1.8e-05,0,-9e-06,-6e-06,1e-06,-8e-06,-4e-06,-1e-06,-3e-06,-1e-06,1e-05,1e-06,-1e-06,-2.3e-05,1e-05,2e-06,1e-06,0,-1e-06,1e-05,3e-06,-2e-06,-3e-06,2e-06,9e-06,4e-06,1e-06,-2e-06,4e-06,6e-06,8e-06,7e-06,1.5e-05,1.4e-05,-6e-06,-1.3e-05,6e-06,-8e-06,3e-06,-1.7e-05,-4e-06,0,-2e-06,-2e-06,4e-06,-2e-06,1e-06,-4e-06,-1e-06,2e-06,-4e-06,-2e-06,6e-06,4.8e-05,-3e-06,1e-06,-1e-06,-2e-06,1.7e-05,1.2e-05,0,-2e-06,-1.8e-05,3e-06,4e-06,-2e-06,3e-06,1.1e-05,-1.5e-05,-1.2e-05,9e-06,3e-06,4e-06,2e-06,6e-06,-1.6e-05,-3e-06,-6e-06,-1e-06,4e-06,-2e-06,2e-06,1e-06,-6e-06,3e-06,3e-06,3e-06,-6e-06,-1e-05,-6e-06,2e-06,1.4e-05,4e-06,1.6e-05,2e-06,-1e-06,-1.3e-05,-3e-06,-7e-06,3e-06,-2e-06,-1e-06,-2e-06,2.3e-05,-3e-06,-2e-06,1.3e-05,1.6e-05,1e-05,3e-06,0,0,1e-06,3e-06,-1e-06,-4e-06,-5e-06,1e-06,-7e-06,9e-06
-1.8e-05,1.7e-05,0,5e-06,7e-06,0,9e-06,0,2e-06,6e-06,1e-06,-1.4e-05,-2e-06,0,2e-05,-1.3e-05,5e-06,-1e-06,0,-1e-06,-1e-05,-4e-06,1e-06,6e-06,1e-06,-1.1e-05,1e-06,-1e-06,1e-06,-1e-06,-9e-06,-6e-06,-8e-06,-1.6e-05,6e-06,1.1e-05,9e-06,-4e-06,3e-06,-1e-06,1.6e-05,1e-06,5e-06,0,0,-3e-06,6e-06,-6e-06,3e-06,3e-06,2e-06,4e-06,7e-06,-1.6e-05,-3.6e-05,-2e-06,-1e-06,2e-06,5e-06,-1.7e-05,0,0,2e-06,5e-06,0,-1e-06,1e-06,-3e-06,-7e-06,7e-06,-5e-06,1.1e-05,-7e-06,-6e-06,-1e-06,-4e-06,5e-06,1.1e-05,5e-06,-1e-06,0,1.9e-05,-5e-06,1e-06,0,0,-8e-06,-2e-06,9e-06,1.1e-05,5e-06,0,-1.5e-05,-5e-06,-1.4e-05,2e-06,1.1e-05,1.4e-05,-3e-06,4e-06,2e-06,8e-06,0,-1e-06,-2.7e-05,1e-06,1e-06,1e-06,-8e-06,-7e-06,-8e-06,2e-06,5e-06,2e-06,3e-06,-9e-06,5e-06,-7e-06,1e-06,5e-06,-6e-06
2.4e-05,-1.7e-05,1e-06,1e-06,-6e-06,0,-1e-06,1e-06,-2e-06,-1.4e-05,0,1.3e-05,0,2e-06,-8e-06,1.6e-05,-7e-06,1e-06,0,2e-06,1e-05,2e-06,-1e-06,-4e-06,3e-06,9e-06,1e-06,2e-06,0,0,8e-06,3e-06,6e-06,6e-06,-2.6e-05,-1e-06,-6e-06,1e-06,3e-06,0,-1e-05,3e-06,-3e-06,2e-06,1e-06,-8e-06,-5e-06,-3e-06,-2e-06,0,-2e-06,-2e-06,-9e-06,1.4e-05,1.6e-05,1e-06,0,-4e-06,-4e-06,1.4e-05,-6e-06,-1e-06,-1e-06,9e-06,-5e-06,-1e-06,0,-2e-06,0,0,1.7e-05,-2.5e-05,5e-06,9e-06,-4e-06,-2e-06,9e-06,-1.9e-05,-6e-06,2e-06,-3e-06,-1.6e-05,5e-06,-3e-06,3e-06,-1e-06,2e-06,0,-7e-06,-2e-06,1e-06,0,7e-06,0,7e-06,0,-1e-05,-1.2e-05,3e-06,-1e-06,-4e-06,5e-06,-3e-06,1e-06,2.6e-05,2e-06,2e-06,0,-2e-06,6e-06,7e-06,-1e-06,-8e-06,-1e-06,-6e-06,1.5e-05,-4e-06,1.1e-05,-1e-06,0,4e-06
-1.8e-05,1.7e-05,0,-1e-06,4e-06,0,-8e-06,1e-06,0,1.9e-05,-1e-06,-1.3e-05,1e-06,0,-7e-06,-1.6e-05,6e-06,0,0,-2e-06,-1e-05,3e-06,1e-06,-1e-06,-1e-06,-5e-06,1e-06,-4e-06,-4e-06,-2e-06,-7e-06,-2e-06,-8e-06,0,3.3e-05,2e-06,1e-06,-2e-06,-6e-06,2e-06,8e-06,-1e-06,2e-06,-3e-06,-1e-06,2e-06,9e-06,3e-06,0,-2e-06,0,1e-06,3e-06,-4e-06,-2e-06,0,0,4e-06,2e-06,-9e-06,1e-06,0,-1e-06,-8e-06,4e-06,2e-06,0,1e-06,4e-06,-6e-06,-2.4e-05,2.9e-05,-3e-06,-6e-06,9e-06,3e-06,-1.3e-05,2.2e-05,1.1e-05,-1e-06,4e-06,-1e-06,-3e-06,3e-06,-6e-06,0,-7e-06,-2e-06,2e-06,-7e-06,-5e-06,1e-06,5e-06,2e-06,-1e-06,-2e-06,6e-06,5e-06,1e-06,1e-06,3e-06,-4e-06,2e-06,0,-2.3e-05,-2e-06,2e-06,-5e-06,1e-05,-4e-06,-7e-06,2e-06,7e-06,2e-06,3e-06,-1.4e-05,7e-06,-6e-06,0,1e-06,-1e-06
8e-06,-1.6e-05,0,4e-06,-1e-06,0,7e-06,0,1e-06,-1.4e-05,1e-06,1.3e-05,-1e-06,1e-06,1.7e-05,1.4e-05,-3e-06,0,0,-1e-06,9e-06,-8e-06,0,5e-06,0,0,-1e-06,3e-06,4e-06,1e-06,6e-06,-1e-06,9e-06,-8e-06,-1.8e-05,-3e-06,-2e-06,3e-06,6e-06,-5e-06,-4e-06,-1e-06,-2e-06,2e-06,0,6e-06,-3e-06,-4e-06,1e-06,1e-06,3e-06,0,7e-06,0,-3e-06,1e-06,1e-06,-4e-06,-2e-06,3e-06,1.2e-05,-1e-06,1e-06,-3e-06,-1e-06,-3e-06,1e-06,-1e-06,-8e-06,0,2.5e-05,-2.9e-05,9e-06,2e-06,-6e-06,0,4e-06,-1.7e-05,-2.1e-05,0,-1e-06,3e-06,3e-06,0,5e-06,-2e-06,9e-06,1e-06,2e-06,5e-06,3e-06,-2e-06,-9e-06,3e-06,-3e-06,-1e-06,-1.2e-05,3e-06,1e-06,1e-06,-1e-06,-2e-06,1e-06,2e-06,2.6e-05,2e-06,-2e-06,6e-06,-1.3e-05,1e-06,7e-06,-3e-06,-6e-06,0,2e-06,9e-06,-8e-06,8e-06,-1e-06,-4e-06,-2e-06
-4e-06,1.5e-05,1e-06,-6e-06,-2e-06,0,2e-06,-2e-06,-3e-06,7e-06,0,-1.1e-05,1e-06,0,-1.8e-05,-1.2e-05,0,1e-06,0,2e-06,-5e-06,8e-06,0,-5e-06,-1e-06,3e-06,0,0,0,0,-4e-06,1e-06,-3e-06,1.1e-05,-4e-06,-4e-06,-1e-06,-4e-06,-6e-06,7e-06,0,-2e-06,-2e-06,-1e-06,-1e-06,2e-06,0,1e-06,-2e-06,0,-3e-06,0,-8e-06,-4e-06,1e-06,2e-06,0,2e-06,2e-06,1e-06,-2.2e-05,-1e-06,-3e-06,1.3e-05,-1e-06,2e-06,-1e-06,2e-06,4e-06,9e-06,-1.6e-05,1.7e-05,-8e-06,1e-06,-1e-06,-2e-06,1.1e-05,1.1e-05,2.7e-05,1e-06,-2e-06,-3e-06,-5e-06,0,-6e-06,-2e-06,0,3e-06,-3e-06,4e-06,-3e-06,-1e-06,8e-06,-4e-06,9e-06,2e-06,2.1e-05,-7e-06,-1e-06,-5e-06,-1e-06,7e-06,-1e-06,2e-06,-3.3e-05,-3e-06,-1e-06,3e-06,1.1e-05,0,-2e-06,1e-06,3e-06,-2e-06,-4e-06,-3e-06,6e-06,-9e-06,1e-06,2e-06,5e-06
-2e-06,-1.5e-05,0,5e-06,3e-06,0,-7e-06,1e-06,2e-06,-1e-06,0,1e-05,-1e-06,0,1e-05,1.2e-05,1e-06,0,0,0,5e-06,-4e-06,0,4e-06,0,-3e-06,2e-06,-1e-06,-3e-06,-1e-06,3e-06,-1e-06,-3e-06,-4e-06,1.7e-05,-1e-06,4e-06,1e-06,2e-06,-8e-06,1e-06,1e-06,4e-06,0,3e-06,-5e-06,3e-06,0,0,-2e-06,2e-06,-1e-06,-1e-06,2e-06,-3e-06,1e-06,-1e-06,0,-2e-06,-5e-06,2.2e-05,1e-06,3e-06,-1.2e-05,-1e-06,0,0,-1e-06,0,-9e-06,4e-06,-1e-06,-1e-06,-2e-06,2e-06,-2e-06,-1.5e-05,-1e-06,-2.8e-05,-1e-06,4e-06,-5e-06,6e-06,0,3e-06,-1e-06,-1.5e-05,-2e-06,2e-06,-1e-05,3e-06,1e-06,-5e-06,1e-06,-1.2e-05,0,-2.1e-05,7e-06,-1e-06,1e-05,2e-06,1e-06,1e-06,0,3.1e-05,1e-06,1e-06,-1e-05,-5e-06,-1e-06,1e-06,-2e-06,0,0,3e-06,-2e-06,-7e-06,3e-06,1e-06,5e-06,-6e-06
9e-06,1.4e-05,0,-9e-06,-2e-06,0,3e-06,1e-06,0,-5e-06,0,-1.3e-05,0,0,3e-06,-1.4e-05,-2e-06,1e-06,0,-2e-06,-7e-06,-1e-06,0,-2e-06,-2e-06,3e-06,-3e-06,1e-06,1e-06,1e-06,-1e-06,3e-06,4e-06,0,-1.4e-05,-4e-06,-6e-06,0,0,9e-06,-6e-06,3e-06,-2e-06,1e-06,-5e-06,-4e-06,-4e-06,4e-06,1e-06,1e-06,0,1e-06,5e-06,-1e-06,1.4e-05,-1e-06,0,-2e-06,0,8e-06,-1.4e-05,0,-1e-06,1e-06,3e-06,-2e-06,0,0,1e-06,0,1e-05,-1.3e-05,9e-06,2e-06,-1e-06,1e-06,6e-06,-1e-05,2.4e-05,0,-2e-06,6e-06,-6e-06,-1e-06,1e-06,0,1.3e-05,1e-06,3e-06,5e-06,2e-06,1e-06,-1e-06,1e-06,1.6e-05,-1e-06,1.8e-05,-6e-06,-1e-06,-1e-05,-1e-06,-8e-06,0,-1e-06,-2.7e-05,1e-06,1e-06,1.2e-05,-3e-06,2e-06,1e-06,4e-06,-4e-06,-1e-06,0,5e-06,5e-06,7e-06,0,-6e-06,5e-06
-1.6e-05,-1.4e-05,0,9e-06,2e-06,0,5e-06,-1e-06,-1e-06,1.1e-05,0,1.3e-05,0,1e-06,-1.4e-05,1.5e-05,3e-06,0,0,6e-06,7e-06,6e-06,0,0,1e-06,-1e-06,1e-06,-1e-06,0,1e-06,0,-3e-06,-5e-06,6e-06,1e-06,7e-06,7e-06,2e-06,-3e-06,-9e-06,1e-05,-3e-06,-2e-06,-1e-06,1e-06,2e-06,2e-06,-3e-06,-3e-06,1e-06,-1e-06,-1e-06,-1e-06,4e-06,-2.6e-05,-1e-06,0,3e-06,0,-9e-06,3e-06,0,-2e-06,1.2e-05,-2e-06,1e-06,0,-1e-06,-1e-06,8e-06,-2e-05,2.4e-05,-1.9e-05,-2e-06,-4e-06,6e-06,9e-06,1.9e-05,-1.8e-05,0,-2e-06,-3e-06,5e-06,0,-5e-06,1e-06,1.1e-05,0,-6e-06,6e-06,-4e-06,0,5e-06,3e-06,-1.8e-05,0,-2.1e-05,8e-06,1e-06,8e-06,-1e-06,-1e-06,1e-06,-1e-06,2.8e-05,-2e-06,-1e-06,-1e-05,1e-05,-2e-06,-1e-06,-2e-06,7e-06,0,-2e-06,-6e-06,-5e-06,-9e-06,1e-06,-1e-06,-4e-06
