1.5e-05,0.000182,7.1e-05,8.3e-05,0.000154,4.1e-05,9.2e-05,9e-06,0.000115,2.3e-05,0.000209,4.4e-05,1e-04,0.000112,6e-06,4.8e-05,0.000101,0.000298,0.00012,0.000171,9.5e-05,0.000111,4.2e-05,0.000193,9e-06,0.000227,9e-05,0.000145,0.000191,0.000152,0.000101,6e-05,9.6e-05,2.2e-05,7.3e-05,5.2e-05,3.8e-05,0.000121,8e-06,0.000392,0.000119,4.7e-05,0.000169,0.000125,7e-05,5.6e-05,4.6e-05,0.000244,7e-06,5.2e-05,0.000111,3.5e-05,6.9e-05,4.1e-05,7.3e-05,9.7e-05,6.1e-05,6.7e-05,4.3e-05,0.000248,4.6e-05,0.000125,0.000117,7.8e-05,5.2e-05,0.000119,7e-06,0.00012,0.000142,8e-06,0.000122,0.000197,0.000113,0.000113,0.000204,0.000324,7.8e-05,5.5e-05,1.1e-05,0.000107,6.1e-05,0.000253,1e-04,1.6e-05,4.5e-05,7e-06,3.1e-05,3.7e-05,0.000144,0.000355,0.000178,5.9e-05,8.1e-05,2.8e-05,5.6e-05,0.000211,1.2e-05,8.1e-05,1.7e-05,0,0.00011,0.000221,2.2e-05,8.2e-05,0.000133,0.000121,0.000109,0.000163,2.3e-05,6e-06,4.3e-05,0.00017,6.3e-05,9e-05,2.3e-05,6.5e-05,1.1e-05,8e-06,5.1e-05,3.3e-05,5.6e-05
9.6e-05,0.000403,0.000168,0.000235,0.000414,9.2e-05,0.000184,0.000111,0.000197,0.000109,0.000439,8.2e-05,0.000208,0.000238,6.7e-05,0.00015,0.000185,0.000561,0.000272,0.000418,0.000214,0.00025,0.000206,0.000478,0.00014,0.000309,0.000145,0.000174,0.000422,0.000261,0.000288,0.000236,0.000169,9.1e-05,0.000205,9.4e-05,0.000176,0.000233,0.000252,0.000902,0.000383,0.000134,0.000455,0.000249,0.000352,0.000249,0.000117,0.000538,0.00022,7.2e-05,0.000215,0.000114,0.00015,0.000257,0.000176,0.000264,0.000173,6.6e-05,7e-06,0.000514,0.000198,0.000447,0.000265,7.6e-05,0.000142,0.000292,3.4e-05,0.000263,0.000262,0.000123,0.00029,0.000319,0.000195,1.4e-05,0.000335,0.000497,0.000236,0.000106,0.00011,0.00022,0.00017,0.000527,0.000357,0.000276,0.000125,9.8e-05,9.9e-05,0.000165,0.000426,0.000588,0.000357,0.000291,0.000264,5e-05,0.000154,0.000372,1.9e-05,0.000301,0.000229,0.00017,4.2e-05,0.000439,0.000156,0.000217,0.00018,9.9e-05,0.000331,0.000256,7.3e-05,9e-06,0.000135,0.000312,0.00027,2.9e-05,0.000215,0.000196,0.000159,8.8e-05,0.000159,0.000113,8.3e-05
2.7e-05,0.000407,0.000318,0.000107,0.00048,0.000188,0.000246,0.000262,0.00023,0.000232,0.000636,0.000102,0.000242,0.000317,0.000274,0.000415,0.00016,0.000725,0.000173,0.000263,0.000213,0.000524,0.000357,0.000475,0.000392,0.000558,0.000522,0.000163,0.000439,0.000476,0.000232,0.000301,0.000243,0.00015,0.000361,0.00031,0.000328,0.000113,0.000387,0.001038,0.00069,0.000266,0.000501,0.000158,0.000312,0.000105,0.000141,0.000583,0.000167,0.000136,0.000336,0.000491,0.000294,0.000343,0.000419,0.000364,0.000196,0.000112,0.000411,0.000664,0.00017,0.000495,0.00067,0.000675,0.000161,0.000448,0.000134,0.000773,0.000486,0.000329,0.000316,0.000332,0.000478,0.000311,0.000539,0.000681,0.000248,0.000492,0.000236,6.7e-05,0.000284,0.000517,0.000403,6.4e-05,1e-04,0.000297,0.000265,2e-04,0.000513,0.000732,0.000168,0.000389,3e-04,0.000186,0.000189,0.000551,8.5e-05,0.000397,0.000175,0.000293,0.000304,0.000676,0.000149,0.000501,0.000475,0.000139,0.000512,0.000482,0.000127,0.000183,0.000182,0.000212,0.000247,0.000326,0.00023,0.000123,0.000203,0.000294,0.000175,2.5e-05,0.000224
0.00034,0.000723,0.000539,0.000844,0.000219,0.000528,0.000105,0.000143,0.000694,0.000162,0.001127,0.001073,0.000732,0.00051,0.000682,0.000271,6.9e-05,0.001395,0.000659,0.000366,0.000819,0.000726,0.000273,0.000788,0.001171,0.001827,0.001144,0.000638,0.000794,0.000719,0.001119,0.000414,0.000383,0.000347,0.000956,0.00045,0.000641,0.000347,0.000752,0.002044,0.001919,0.000709,0.000532,0.000334,0.000782,0.000532,0.000205,0.000708,0.000737,0.000306,0.000391,0.00041,0.000328,0.000316,0.000539,0.000592,0.000723,0.000582,0.000416,0.00057,0.000521,0.000425,0.001026,0.000316,0.001025,0.000745,0.000957,0.000656,0.000896,0.000383,0.000691,0.000232,0.000211,0.00105,0.001454,0.001667,0.000479,0.001152,0.00093,0.000514,0.000338,0.000518,0.000615,0.000515,0.000404,0.000438,0.00035,0.000345,0.001133,0.001616,0.000663,0.000666,0.000744,0.000392,0.000176,0.001046,0.000585,0.000507,0.000745,0.000247,0.000441,0.000734,0.000747,0.000559,0.001034,0.000669,0.000626,0.001001,0.00071,0.000338,0.000545,0.000513,0.000302,0.00021,0.000204,0.000762,5.7e-05,0.000342,0.000463,0.000122,0.000293
0.000562,0.000952,0.000851,0.00029,0.00071,0.00092,0.000359,0.00013,0.000993,0.000787,0.000874,0.002071,0.001618,0.000891,0.000633,0.001149,0.00089,0.001385,0.002042,0.001872,0.002118,0.002342,0.001911,0.001791,0.000866,0.000696,0.001536,0.00088,0.000661,0.001041,0.000871,0.000851,0.000947,0.000348,0.001071,0.001869,0.001621,0.001209,0.000787,0.001125,0.002845,0.002177,0.001198,0.00015,0.001744,0.00127,0.001086,0.000914,0.00082,0.000918,0.000559,0.000275,0.000662,0.000353,0.00078,0.000479,0.000497,0.001401,0.001579,0.001801,0.001445,0.00134,0.000374,0.001579,0.002279,0.002663,0.002494,0.001696,0.001324,0.00071,0.000702,0.000857,0.000636,0.001085,0.001256,0.001907,0.002294,0.001412,0.001362,0.000684,0.000366,0.001141,0.001334,0.001194,0.000602,0.000726,0.00127,0.000916,0.001409,0.002661,0.002472,0.002108,0.001314,0.001133,0.00081,0.000656,0.001443,0.000914,0.000306,0.001022,0.000958,0.001578,0.001556,0.001892,0.002169,0.001734,0.000798,0.001327,0.001169,0.000298,0.000699,0.00076,0.000468,0.00084,0.000194,0.000917,0.001024,0.000377,0.00072,0.000828,0.000286
0.000341,0.00045,0.000175,0.000415,0.000245,0.000426,0.000617,0.000269,0.000705,0.000718,0.001082,0.001366,0.000716,0.00042,8e-04,0.000821,0.00118,0.001115,0.000791,0.000745,0.000784,0.000584,0.000603,0.000566,0.000665,0.000207,0.000831,0.000754,0.000878,0.00045,0.001042,0.000319,0.000367,0.000764,0.000506,0.001459,0.000623,0.000931,0.000596,0.001199,0.001434,0.000625,0.000411,0.000848,0.002016,0.001672,0.000871,0.000332,0.000369,0.000973,0.000637,0.000512,0.000889,0.001063,0.000434,4.1e-05,0.000947,0.001476,0.000335,0.001571,0.001613,0.00038,0.000942,0.001422,0.001116,0.001552,0.000375,0.000647,0.000351,0.000615,0.000631,0.000373,0.000146,0.000861,0.000148,0.000838,0.000714,0.001097,0.000807,0.000668,0.00022,0.000508,0.001318,0.000457,0.000443,0.000627,0.00058,0.000781,0.001235,0.000942,0.00013,0.000274,0.000487,0.001014,0.000663,0.000334,0.000726,0.000434,0.000128,0.000865,8.1e-05,0.000933,0.000673,0.000869,0.000752,0.00039,3.8e-05,0.001004,0.000103,0.00056,0.000456,0.001223,0.000891,0.000473,0.000698,0.000855,0.000167,0.001044,0.00069,0.000678,0.000508
0.00065,0.000754,0.000316,0.000388,0.000397,0.000377,0.000218,5.3e-05,0.000371,0.000289,0.000396,0.000331,0.000643,0.000585,0.000722,0.00112,0.00044,0.000427,0.000974,0.000185,0.000593,0.000624,0.00087,0.000344,0.000212,0.00042,0.000851,0.000266,0.000115,0.000903,0.000425,0.000266,0.000105,0.00071,0.000533,0.000707,0.000205,0.000741,0.000616,0.000843,0.000742,0.001126,0.000191,0.000967,0.000754,0.000802,0.000471,0.000388,0.000528,0.000342,0.000432,0.000545,0.000207,0.000455,0.000863,0.000736,0.001137,0.000507,0.000286,0.001098,5.2e-05,0.000217,0.001312,0.000634,0.001468,0.001323,0.000703,0.000906,0.001332,0.001002,0.000443,0.000827,0.000386,0.000852,0.000395,0.000161,0.000176,0.000871,0.000848,0.000897,0.001231,0.000472,0.000271,0.000958,0.00045,0.00066,0.000927,0.000747,0.000374,4e-04,0.000675,0.001042,0.000414,0.00093,0.00033,0.00068,0.000346,0.000991,0.000431,0.000704,0.00095,0.000489,0.000803,0.000567,0.001536,0.000694,0.000262,0.000705,0.00075,0.000689,0.000718,0.000441,0.00097,0.000949,0.000526,0.000446,0.000646,0.00114,0.000591,0.000589,0.000267
0.001486,0.002482,0.001771,0.001145,0.000635,0.00023,3e-04,0.000466,0.001254,0.000943,0.000886,0.000448,0.00082,0.00122,5.5e-05,0.001128,0.001068,0.000731,0.002148,0.001335,0.000629,0.000585,0.001437,0.001302,9e-04,0.000812,0.000562,0.000508,0.000282,0.001279,0.001523,0.001587,0.000596,0.000398,0.000349,0.000427,0.000682,0.001769,0.000874,0.00085,0.001247,0.001863,0.001911,0.00155,0.001064,0.001371,0.001268,0.000223,0.000665,0.000458,0.000461,0.000974,0.000777,0.00039,0.000273,0.000502,0.001846,0.001732,0.000878,0.00069,0.000253,0.000273,0.001467,0.002378,0.000911,0.001314,0.001558,0.000981,0.001741,0.001519,0.000972,0.001402,0.001622,4e-04,0.000353,0.000663,0.000943,0.000808,0.000741,0.001283,0.001369,0.00168,0.002511,0.002391,0.001946,0.00159,0.000507,0.001126,0.00055,0.000644,0.001081,0.001949,0.001947,0.000747,0.001546,0.001855,0.001509,0.001127,0.000629,0.000655,0.001442,0.000952,0.000586,0.000152,0.001267,0.00127,0.000677,0.001166,0.000216,0.000392,0.00029,0.000429,0.001272,0.000873,0.000889,0.000593,0.000548,0.001572,0.000898,0.000338,0.000591
0.000746,0.001739,0.001315,0.000177,0.000276,0.000309,0.000689,0.001076,0.000922,0.000438,0.000594,0.000623,0.000548,0.000818,0.000933,0.000513,0.000417,0.000251,0.002243,0.001769,0.001047,0.00053,0.001589,0.001463,0.000688,0.000802,0.001263,0.001591,0.001009,0.001134,0.000565,0.001239,0.001719,0.001123,0.000803,0.000486,0.001022,0.001156,0.001199,0.00096,0.000926,0.001558,0.002322,0.001368,0.000764,0.000458,0.001073,0.00117,0.00151,0.000392,0.000252,0.000642,0.000474,0.000347,0.000687,0.000509,0.00103,0.001394,0.001088,0.000742,0.000846,0.000769,0.001864,0.002443,0.001304,0.001269,0.001762,0.000955,0.001868,0.000703,0.000365,0.00102,0.000681,0.000901,0.001361,0.001401,0.000338,0.000995,0.000305,0.00146,0.001225,0.000993,0.001936,0.001308,0.000638,0.000539,0.000955,0.000903,0.001062,0.000756,0.001169,6e-04,0.001201,0.001799,0.000255,0.001528,0.001448,0.001577,0.0012,0.000762,0.001592,0.000856,0.000907,0.000992,0.001338,0.000696,0.001544,0.001247,0.001086,0.000723,0.000772,0.000732,0.000978,0.000992,0.000336,0.000228,5e-04,0.001396,0.001173,0.000709,0.000483
0.000467,0.001523,0.001036,0.00012,0.000765,0.001084,0.000402,0.000685,0.000687,0.000281,0.000432,0.00035,0.000345,0.000829,0.000237,0.00049,0.000537,0.000639,0.001312,0.000138,0.000334,0.00017,0.001347,0.000293,0.00012,0.000754,0.001318,0.000585,0.000831,0.000232,0.001517,0.000516,0.00145,0.000926,0.000713,0.000917,0.000359,0.001338,0.000464,0.000719,3e-04,0.000651,0.000925,0.000643,0.000556,0.000419,0.000419,0.00036,0.000878,0.001047,0.000876,0.000834,0.000285,0.00061,0.001335,0.001525,0.000619,0.000517,0.000239,0.000591,0.000707,0.000955,0.001088,0.001178,0.001046,0.001598,0.001267,0.000639,0.001209,0.001093,0.000646,0.000422,0.000497,0.001004,0.000654,0.000282,0.000898,0.001199,0.0014,0.001515,0.001206,0.000574,0.001165,0.000675,0.000484,0.000533,0.001015,0.001236,0.001608,0.000551,0.001008,0.001229,0.000602,0.000799,0.00101,0.000148,0.000597,0.000667,0.000461,0.000428,0.001227,0.000276,0.000423,0.00068,0.00021,0.000863,0.001843,0.000728,0.000873,0.000514,0.001015,0.000306,0.000798,0.000351,0.000593,0.000488,0.000811,0.001279,0.00081,0.000755,0.000997
0.000537,0.000824,0.000847,0.00126,0.000947,0.000244,0.000567,0.00022,0.000258,0.000211,0.000635,0.000683,0.000666,0.000423,7e-04,0.001057,0.001037,0.000483,0.000887,0.001216,0.001153,0.001006,0.000618,0.000421,0.000392,0.000926,3e-05,0.00059,0.001298,0.00116,0.001813,0.001696,3e-04,0.000797,0.001062,0.000638,0.000181,0.00079,0.00078,0.000631,0.000844,0.000482,0.000308,0.000211,0.000207,0.000563,0.000341,8.8e-05,0.000723,0.00018,0.000687,0.000136,0.000149,0.000507,0.000345,0.001107,0.000913,0.000856,0.000672,0.000447,0.000979,0.000615,0.001034,0.000887,0.000691,0.000445,0.000876,0.000646,0.001129,0.000598,0.000368,0.000504,0.00048,0.000583,0.001249,0.001015,0.001497,0.000642,0.000468,0.000507,0.000403,0.00025,0.000415,0.000682,0.000164,0.000278,0.001155,0.001592,0.000902,0.001321,0.002055,0.001188,0.000713,0.000983,0.000534,0.000502,0.000254,0.000422,0.000809,0.000689,0.00066,0.001249,0.000551,0.000529,0.000283,0.000703,0.000906,0.000659,0.000284,0.000725,0.00029,0.000483,0.000783,0.000358,0.000261,0.000597,0.000787,0.000488,0.000827,0.000564,9.4e-05
0.000108,0.000334,0.000515,0.000799,0.000504,0.000353,0.000174,0.000154,0.000517,0.000532,8.9e-05,0.000405,0.000213,0.000118,0.000486,0.000314,0.000715,0.000692,0.000762,0.001119,0.000109,0.000514,0.000673,0.000459,0.000631,0.000154,0.000357,0.000555,0.000799,0.000179,0.000545,0.000193,0.000373,0.000277,0.000433,0.000184,0.000401,0.000364,0.000281,0.000694,7.4e-05,0.000408,0.000514,0.000168,6e-05,9.1e-05,0.000265,6.6e-05,0.000496,0.000701,0.000336,0.000318,0.000228,0.000153,0.000333,0.00071,0.000316,0.000399,0.000393,0.000552,0.000101,0.000185,0.000235,0.000357,0.00046,0.000771,0.000228,0.00073,0.000434,0.000378,0.000336,0.000233,0.000414,0.00014,0.000598,0.000354,0.00059,0.000417,0.000638,0.000288,0.000165,0.000464,0.000726,0.000379,0.000303,0.000203,0.000315,0.000701,0.000108,0.000723,0.000994,0.000969,0.000881,0.000414,0.000211,5e-04,0.000313,0.000156,0.000608,0.00031,0.000298,0.000649,0.000312,0.000486,0.000288,0.000624,0.000613,0.000134,0.00032,0.000336,0.00045,0.000189,0.000255,0.000449,0.000593,0.000238,0.000151,0.000247,0.000366,0.000299,0.000327
0.000215,0.000548,0.000386,0.000286,0.000241,0.000217,0.000366,0.00018,0.000505,0.000353,0.000336,0.000234,0.00015,0.000189,0.000557,0.000417,0.000286,0.00045,0.000327,0.000364,0.000493,0.000269,0.000336,7.8e-05,0.000537,0.000184,9.2e-05,0.000441,0.000204,0.000132,0.000152,0.000209,9.7e-05,0.000317,0.000265,5e-05,0.000231,0.000166,0.00031,0.000379,0.00016,0.000318,0.000392,0.00063,0.000165,0.000333,0.000222,0.000234,0.000247,0.000131,4.8e-05,6.4e-05,0.000111,0.000128,0.00025,0.000329,9.3e-05,0.000659,3.7e-05,0.000228,0.000603,0.000256,0.000484,0.000101,0.000379,0.000539,0.000477,0.000593,0.000427,0.000262,2.1e-05,0.000271,0.000209,0.00013,0.00022,6.9e-05,0.000222,0.000527,0.000237,0.000218,0.000193,0.000275,0.000707,0.000246,0.000105,0.00034,0.000332,0.000162,0.000145,0.000177,0.000458,0.000637,0.000184,0.000265,0.000135,0.000451,0.000532,0.000252,0.00028,0.000526,0.000269,0.000311,0.000165,3.5e-05,0.000263,0.000163,0.000169,0.000269,0.000111,0.000212,0.000149,0.000239,0.000218,0.000259,0.000257,0.000309,0.000106,0.00037,0.000282,0.000284,0.000175
6.4e-05,0.000514,0.000241,0.000262,0.000395,0.000109,0.000106,0.000276,0.000251,0.000149,0.000432,0.000176,0.000241,0.000123,0.000517,0.000283,0.000435,0.000143,0.000348,0.000361,0.000292,0.00022,0.000273,8e-05,0.000581,0.000317,0.000427,9.7e-05,4.2e-05,0.000449,0.000522,0.000296,0.000211,0.000158,0.00027,0.000194,8e-05,0.000188,0.000402,0.000404,0.000346,0.000105,0.000184,0.000364,0.000371,0.000164,0.000156,0.000139,0.000396,0.000106,0.000215,5e-05,0.00019,6.6e-05,3.5e-05,0.000198,0.000292,0.000582,0.000281,8.3e-05,0.000559,0.000172,0.00014,0.000139,5.5e-05,0.000455,0.000405,0.000709,0.000374,0.000449,0.000429,0.000249,0.000404,0.000391,0.000314,0.000188,0.000487,0.00063,0.00018,0.000162,0.000114,0.000123,0.000143,0.000178,0.000339,0.000577,0.000696,0.000167,0.000161,0.000312,0.000451,0.000576,0.000314,0.00045,0.000207,0.000389,0.000344,0.000358,8.9e-05,8.1e-05,8.4e-05,0.00038,0.000129,0.000233,0.000228,0.000173,0.000155,0.000147,5e-05,3.2e-05,0.000204,0.000174,0.000217,0.00017,0.000332,0.000275,0.00046,0.000208,0.000126,0.000274,0.00022
8.7e-05,0.000396,0.000469,0.00016,0.000587,7.9e-05,0.000396,0.000362,0.000322,0.000611,0.000318,0.000641,0.000179,0.000312,0.000687,0.000497,0.00073,0.000219,0.000309,0.00054,0.000892,0.000315,0.000329,0.000191,0.000642,0.000284,0.000752,0.000439,0.000363,0.000402,0.000311,0.000371,0.000267,0.000357,0.000608,0.000171,0.000221,0.000284,0.000436,0.000558,0.000198,0.000487,0.000168,8.4e-05,0.000279,0.000205,6.6e-05,0.000124,0.000339,0.000533,0.000112,0.00015,0.000555,9.1e-05,0.000139,0.000298,0.000502,0.000932,0.000368,0.000102,0.000495,0.000192,0.00025,0.000231,0.000432,0.000559,0.000282,0.000396,0.000399,0.000444,0.000783,0.000729,0.000166,0.000265,0.000228,0.000279,0.000369,0.000651,0.000151,0.000309,0.00041,5e-04,0.000388,0.000335,0.000268,0.000451,0.000623,0.000596,0.000299,0.000538,0.000444,0.000147,0.000589,0.001014,0.000216,0.000405,0.00044,0.000185,0.000218,0.000415,4.4e-05,0.000461,0.000263,0.00029,0.000162,0.000743,0.000382,0.000391,9.9e-05,0.000212,3.2e-05,0.000419,9.7e-05,0.000455,0.000309,0.000178,0.00033,0.000225,0.000252,0.000219,0.000305
0.000123,0.000126,3e-04,0.000404,0.000769,0.000657,0.000381,0.000103,0.000392,0.000708,0.00043,0.000582,0.000829,0.000587,0.000155,0.000304,0.000479,0.000888,0.000138,0.000683,0.001236,0.001057,0.000392,0.00053,0.000732,0.000879,0.000728,0.000665,0.000269,0.000757,0.000577,0.000499,0.000116,0.000373,0.000297,0.000148,0.000371,0.000168,0.000542,0.000477,2.1e-05,0.000862,0.000472,0.001034,0.000304,0.000241,0.000307,0.000459,0.000381,0.000986,0.000324,0.000296,0.000774,0.000478,0.000302,0.00016,0.000893,0.000961,0.000513,0.000362,0.000559,0.000822,0.000368,0.000481,9e-04,0.001098,0.000469,0.00118,0.000146,0.001184,0.000324,0.000667,0.00077,0.000163,0.00047,0.000364,0.001007,0.000807,0.000774,0.000885,0.000645,0.000407,0.000636,0.000328,0.000257,0.000661,0.000259,0.000477,0.000362,0.000518,0.000329,0.001086,0.001049,0.000745,0.000509,0.000512,0.00053,0.00066,0.000255,0.000643,0.000699,0.000678,0.000672,7.3e-05,0.000152,0.001045,0.000537,0.001036,0.000935,0.000219,0.000535,0.00059,0.000348,0.000411,0.000446,0.000569,0.000848,0.000151,0.000348,0.000166,0.000746
0.000772,0.000696,0.000656,0.00122,0.000596,0.001268,0.001034,0.000983,4e-04,0.000646,0.000853,0.000614,0.000838,0.000366,0.000287,0.000248,0.000385,0.000935,0.001218,0.000791,0.000514,0.000337,0.001136,0.001569,0.000554,0.001546,0.001067,0.001049,0.001061,0.000392,0.001077,0.001057,0.000747,0.000549,0.000891,0.000649,0.000363,0.000427,0.000979,0.000422,0.000474,0.001066,0.000509,0.001238,0.001699,0.001162,0.00062,0.000487,0.000551,0.001208,0.001239,0.000216,0.001068,0.000717,0.000474,0.000603,0.000982,0.00133,0.001566,0.001371,0.000643,0.001328,0.00133,0.001805,0.002284,0.002006,0.001745,0.000746,0.001079,0.002163,0.002115,0.001907,0.000891,0.000807,0.000443,0.000406,0.001201,0.00245,0.00278,0.001993,0.002016,0.001086,0.001299,0.001616,0.000683,0.000704,0.001281,0.00125,0.00047,0.000767,0.001111,0.000878,0.002011,0.002651,0.001987,0.001123,0.000993,0.001329,0.001215,0.00091,4e-04,0.000324,0.000771,0.000993,0.000598,0.00116,0.000817,0.000914,0.001158,0.000762,0.001074,0.001054,0.000796,0.000442,0.000149,0.001237,0.002069,0.001462,0.001383,0.000948,0.001015
0.000536,0.000881,0.001573,0.001687,0.001628,0.001237,0.000633,0.000792,0.001072,0.001148,0.000435,0.000361,0.000308,0.000228,0.000238,0.000179,0.000337,0.00081,0.001017,0.001147,0.001013,0.000821,0.001123,0.000675,0.001017,0.001956,0.002382,0.000728,0.000334,0.001015,0.001081,0.000902,0.001128,0.000717,0.001171,0.001524,0.001133,0.000703,0.000908,0.000804,0.001196,0.000988,0.001128,0.001641,0.000634,0.000558,0.000418,0.000785,0.000845,0.001276,0.000559,0.001124,0.001936,0.001689,0.001659,0.000975,0.001267,0.002213,0.002199,0.001834,0.00102,0.00072,0.000437,0.001195,0.001762,0.002639,0.002368,0.001792,0.001312,0.000916,0.000534,0.000279,0.000564,0.000652,0.000467,0.000255,0.001325,0.002885,0.002669,0.002512,0.002253,0.002083,0.002572,0.000948,0.000672,0.000794,0.000626,0.000508,0.000883,0.001159,0.000488,0.001165,0.000958,0.00135,0.001159,0.000898,0.001033,0.001751,0.001222,0.000392,0.000592,0.000975,0.000742,0.000596,0.00067,0.000815,0.000356,0.000424,0.000256,0.000148,0.000673,0.000303,0.000333,0.000529,0.000809,0.001563,0.000785,0.00052,0.000857,0.00042,0.001093
0.000355,0.000327,0.000895,0.000288,0.000375,0.000319,0.000247,0.000883,0.000346,0.000211,0.000285,0.000221,0.000413,0.000192,0.000176,0.00021,0.000582,0.000273,0.000578,0.000245,5e-04,0.000346,0.000191,0.00055,0.000237,0.001021,0.000628,0.000707,0.000131,0.000759,3.5e-05,0.000783,0.000487,0.000139,0.000608,0.000749,0.000475,0.000643,0.000279,0.000188,0.000747,0.000368,0.000691,0.000357,0.000382,0.000238,9.1e-05,0.000498,0.000287,0.000574,0.000213,0.000841,0.000828,0.000418,0.000352,0.000427,0.000443,0.000943,0.000276,0.000766,0.000399,0.000364,0.000338,0.000832,0.000281,0.001278,0.000188,0.000205,0.000261,0.000537,0.000576,0.000384,0.000321,0.000318,0.000255,0.000272,0.000919,0.001032,0.000676,0.000771,0.00065,0.000822,0.00059,0.000442,0.000448,0.001013,0.000669,0.000403,0.000192,0.000566,0.000149,0.000771,9.1e-05,0.001167,0.000321,0.000292,0.000445,0.000624,0.000158,0.000332,0.000343,0.000538,0.000385,0.000756,0.000118,0.000392,0.000314,6.9e-05,0.000131,0.000257,0.000395,0.000189,0.000369,0.000267,0.000289,0.000626,0.000481,0.000223,0.000876,0.000612,0.000656
8.4e-05,0.000207,0.000228,0.000229,0.00027,9.9e-05,0.000374,0.000366,0.000346,0.000334,0.000189,0.000144,9.8e-05,0.000141,0.000208,0.00041,0.000207,0.000366,0.000216,2.4e-05,0.000393,0.000304,0.00027,0.000303,0.000379,0.000552,0.000278,0.000424,0.000372,0.000403,0.000263,0.00075,0.000198,0.000187,0.000412,0.000249,5.4e-05,0.000375,0.000226,0.000132,0.000358,0.00028,0.000276,0.000294,0.000304,0.000125,0.000269,0.000407,0.000218,0.000337,0.000189,0.000389,0.000243,0.000382,0.000415,0.00038,0.000567,0.000312,0.00025,0.000356,0.000169,0.000311,0.000185,0.000484,0.000188,0.000545,0.000504,0.000389,0.000423,0.000172,0.000137,0.00045,0.000282,0.000238,0.000218,0.000316,0.000179,0.000487,0.000582,0.000607,0.000538,0.00042,0.000154,8.3e-05,0.00019,0.000312,0.000398,0.000409,0.000196,0.000213,0.000183,0.000376,0.000334,0.000229,4.1e-05,0.000212,0.000247,0.000179,0.000148,0.000168,0.000161,0.000576,9.5e-05,0.000258,0.00011,0.000108,0.000214,0.000391,8.6e-05,0.000101,3.5e-05,0.000203,0.00012,0.00012,4.6e-05,0.000307,0.000157,0.000337,2e-04,0.000201,0.000238
0.000195,0.000207,0.000403,0.000212,5.7e-05,0.000183,5e-06,0.000285,0.000218,0.000171,6.3e-05,1.4e-05,9.4e-05,0.000172,0.000158,0.000232,0.000198,0.000155,0.000103,0.000153,7.4e-05,9.9e-05,9.1e-05,0.000158,0.000307,0.000418,0.000293,9.5e-05,0.000125,0.000437,8.4e-05,0.000467,0.000122,0.000151,0.000203,0.000182,0.000116,0.000189,0.000216,0.00014,0.000114,0.000105,0.000258,0.000248,0.000185,7.5e-05,0.000216,5e-05,0.000293,0.000395,7.2e-05,0.000168,0.000282,0.000286,0.000276,0.000209,0.000177,0.000311,0.000328,0.000137,0.000121,2e-04,0.000172,0.000414,0.000195,0.000384,0.000244,0.000112,0.00028,0.000177,0.000238,0.000216,0.000179,0.000242,0.000154,0.000113,0.000241,0.000275,0.000396,0.000289,0.000297,0.000309,0.000287,0.000291,0.000176,8.1e-05,0.000308,0.000322,1e-04,6.6e-05,0.000124,0.000175,0.000503,0.000328,8.6e-05,0.000169,0.000186,0.00019,3.5e-05,5.3e-05,0.000254,9.8e-05,0.000121,0.000131,9.9e-05,4.8e-05,0.000216,0.000105,7.4e-05,6.2e-05,0.00013,0.000168,0.000281,0.000278,0.000102,0.000195,1e-04,9.2e-05,0.000107,0.000228,0.000271
0.000225,3.5e-05,0.00034,5.7e-05,0.000113,0.000124,6e-05,0.000183,0.00013,8.2e-05,0.000149,3.7e-05,0.000149,8e-05,2.7e-05,0.000174,1.7e-05,0.000154,0.000109,0.000183,0.000167,5.6e-05,4.2e-05,0.000183,0.000212,0.00034,0.000148,0.000111,7.1e-05,0.000104,0.000143,0.000281,9.1e-05,0.000135,6.8e-05,4.9e-05,4.2e-05,2e-04,0.000105,1.3e-05,0.000106,6.1e-05,0.000261,0.000129,0.000101,3.1e-05,0.000107,0.000253,0.000229,0.000193,5.7e-05,0.000251,0.000225,0.000208,9.6e-05,0.000156,0.000263,0.000223,0.000276,8.3e-05,7e-05,0.00016,0.000151,0.000315,0.000158,0.000298,6.9e-05,0.000104,0.000183,8e-05,0.000131,0.00021,0.000147,0.000172,5.1e-05,0.000129,0.000155,0.000282,0.000245,0.000166,0.000332,0.000278,0.000306,0.000156,3.1e-05,0.000148,0.000129,0.000252,6.5e-05,0.000135,0.000103,0.000248,3e-04,0.000187,6.7e-05,0.000182,0.000124,0.00018,7.6e-05,0.000116,0.000153,0.000206,0.000164,8.2e-05,5.5e-05,3.7e-05,0.000143,0.000116,6.8e-05,3.9e-05,9.2e-05,0.000127,7.4e-05,0.000194,3.2e-05,0.000175,7.2e-05,0.000126,0.000108,0.000163,8.5e-05
6e-05,5.6e-05,0.000134,7.3e-05,5.4e-05,3.6e-05,3.9e-05,6.9e-05,1.9e-05,5.2e-05,1.6e-05,2.9e-05,6.6e-05,4.4e-05,8e-06,5.1e-05,3.8e-05,9.7e-05,5.6e-05,6.5e-05,6.6e-05,5e-05,3e-05,5.3e-05,7.1e-05,0.000143,0.000115,7e-05,2.3e-05,4.8e-05,3.1e-05,0.00011,4e-05,6.8e-05,2.7e-05,2.5e-05,2.5e-05,8.4e-05,4.4e-05,2.3e-05,2.9e-05,3.1e-05,0.000123,6.2e-05,6.8e-05,1.3e-05,1.9e-05,8.2e-05,9.3e-05,7.2e-05,3e-05,9.2e-05,9e-05,0.000106,9.7e-05,6.5e-05,0.000117,0.000111,0.000119,1.6e-05,1.7e-05,6.5e-05,4.4e-05,0.000145,5.4e-05,0.000124,7e-05,6.3e-05,0.000125,8e-05,4.6e-05,9.4e-05,2.7e-05,9.9e-05,4.4e-05,3.5e-05,6.1e-05,0.000114,8e-05,7.4e-05,0.000119,0.000131,0.000123,1.3e-05,1.7e-05,5.4e-05,5.8e-05,8.2e-05,1.8e-05,2.4e-05,2.1e-05,0.000106,0.000108,8.6e-05,4.5e-05,0.00011,5.5e-05,9.8e-05,3.4e-05,4e-05,6e-06,9.6e-05,5.1e-05,4.9e-05,2.3e-05,7e-06,4.5e-05,6.9e-05,2.6e-05,3e-05,3.5e-05,7e-05,4.8e-05,8.1e-05,2.1e-05,1e-04,6.3e-05,3.8e-05,3.9e-05,5.1e-05,8.9e-05
8.3e-05,3.4e-05,0.000112,7.1e-05,9.1e-05,1.1e-05,1.5e-05,5.1e-05,4.9e-05,6.3e-05,0.000104,7.4e-05,8.1e-05,1.7e-05,3.1e-05,8.2e-05,2.2e-05,0.000125,6.9e-05,8.3e-05,8.4e-05,1e-05,3e-05,2e-05,8.3e-05,9.2e-05,0.000133,2e-05,5.1e-05,8.9e-05,4.2e-05,9.4e-05,1.8e-05,4.8e-05,4.1e-05,5.4e-05,3.3e-05,7.3e-05,4.2e-05,2.6e-05,2.3e-05,8.3e-05,0.000121,0.000137,6e-05,0.000104,8.3e-05,1.7e-05,6.3e-05,8.4e-05,4e-05,0.000115,0.000116,6.4e-05,0.000108,5.8e-05,9.7e-05,6.8e-05,0.00013,6e-05,2.3e-05,8.2e-05,4.8e-05,0.000111,6e-06,8.1e-05,7.8e-05,5.3e-05,5.4e-05,0.000129,6.3e-05,6.8e-05,2.1e-05,0.000106,9e-05,4.7e-05,4.8e-05,0.00014,8.2e-05,6.1e-05,5.4e-05,9.8e-05,0.000111,7.8e-05,2.3e-05,5.8e-05,8.1e-05,5.4e-05,6.8e-05,4.1e-05,7.5e-05,0.000135,5e-05,2.5e-05,7.9e-05,0.000125,4.8e-05,8e-05,6.7e-05,4.1e-05,4.4e-05,4.6e-05,2.4e-05,9e-05,5.6e-05,3.6e-05,5e-05,0.000106,5.1e-05,5.6e-05,6.9e-05,0.000101,5.7e-05,8.5e-05,8e-06,0.00011,5.4e-05,7.9e-05,4.8e-05,6.3e-05,8e-05
1.7e-05,2.2e-05,0.000108,1.9e-05,7.1e-05,6.7e-05,2.1e-05,3.4e-05,7.4e-05,4.3e-05,0.000113,4.7e-05,3.7e-05,4.4e-05,5.9e-05,0.000121,7.1e-05,0.000137,2.5e-05,4.6e-05,3.4e-05,5.2e-05,2.5e-05,2.5e-05,2.3e-05,8.6e-05,0.000134,7.4e-05,8.3e-05,6e-06,6.4e-05,0.000145,6.9e-05,4.8e-05,7.6e-05,2.8e-05,1.9e-05,1.1e-05,2.4e-05,2.9e-05,2e-05,8.6e-05,6.4e-05,7.9e-05,2e-05,5.9e-05,3.1e-05,9.2e-05,3.4e-05,3.9e-05,2e-05,0.00012,3.2e-05,9.6e-05,0.000113,2.6e-05,7.9e-05,5.5e-05,0.00015,2.5e-05,3.4e-05,0.000116,7.7e-05,0.000143,5.9e-05,3.7e-05,4e-05,9.1e-05,0.000117,0.000128,6.8e-05,8.5e-05,0.000113,6.4e-05,3.3e-05,3.9e-05,3e-05,0.00014,7.2e-05,8.3e-05,0.000127,0.00012,0.00011,0.000111,8.9e-05,2.1e-05,8.1e-05,3.3e-05,2.7e-05,4.3e-05,9.9e-05,0.000102,0.000107,2.5e-05,3.3e-05,2e-05,4.4e-05,1.3e-05,6.2e-05,0.000114,8.8e-05,0.000111,2.5e-05,0.000128,4.4e-05,1.3e-05,2.8e-05,6.7e-05,3.1e-05,1.3e-05,1.7e-05,5.6e-05,5.1e-05,5.2e-05,2.9e-05,4.2e-05,5.9e-05,6.4e-05,7.6e-05,1e-05,8.8e-05
4.6e-05,2.1e-05,7.4e-05,1e-05,4.3e-05,2.7e-05,4.9e-05,4.7e-05,4.8e-05,1.3e-05,8.7e-05,4.4e-05,1.2e-05,3.1e-05,5.8e-05,1.8e-05,2.1e-05,9.5e-05,8.7e-05,4e-05,4.8e-05,4e-05,4e-06,6.3e-05,6.5e-05,5.1e-05,3.5e-05,6.6e-05,4.4e-05,3.2e-05,5e-06,6.5e-05,3.6e-05,2.2e-05,3.4e-05,5.5e-05,4.2e-05,4e-05,4.1e-05,1.6e-05,6e-06,2.1e-05,6e-05,5.9e-05,2.8e-05,1.5e-05,6.2e-05,8.8e-05,6.1e-05,5.4e-05,4.6e-05,8.5e-05,2.7e-05,4.1e-05,9e-05,8.9e-05,7.7e-05,5.7e-05,7.4e-05,5.8e-05,4e-05,6.9e-05,4e-05,0.000112,6.1e-05,8.5e-05,1.9e-05,2.7e-05,6.3e-05,8e-05,4.3e-05,7.2e-05,9.2e-05,4.8e-05,2.7e-05,3.2e-05,7.9e-05,9.7e-05,5.2e-05,6.5e-05,0.000129,9.4e-05,9.2e-05,5.8e-05,3.6e-05,2.4e-05,7e-05,4.4e-05,5.7e-05,8e-05,4.1e-05,9.4e-05,0.000127,9.3e-05,3.8e-05,6.4e-05,5.9e-05,6.5e-05,4.9e-05,6.1e-05,5e-05,3.8e-05,4.2e-05,4.7e-05,1.7e-05,2e-05,1.3e-05,1.3e-05,1.4e-05,1.4e-05,9e-06,2.1e-05,8e-06,4.7e-05,3.7e-05,6e-05,4.9e-05,4.4e-05,6.1e-05,1.4e-05,4.1e-05
4.1e-05,2.3e-05,9.8e-05,3.3e-05,2.7e-05,9e-06,3e-06,4.7e-05,3.7e-05,2.4e-05,4e-05,2.6e-05,3.5e-05,1.3e-05,3.6e-05,6.6e-05,3e-05,6e-05,3.4e-05,2.2e-05,6.3e-05,5.9e-05,3.4e-05,4.7e-05,7.6e-05,5.4e-05,1.5e-05,4.5e-05,4.9e-05,5.3e-05,3.6e-05,6.3e-05,2.3e-05,2.6e-05,2.2e-05,1.8e-05,3e-05,2.4e-05,2.8e-05,2.2e-05,2.2e-05,2.1e-05,6.8e-05,4.2e-05,4.4e-05,2.8e-05,5.4e-05,5.9e-05,4.8e-05,8.7e-05,2.6e-05,6.9e-05,5.8e-05,5.1e-05,6.8e-05,5.6e-05,3.4e-05,1.8e-05,7.9e-05,3e-05,2e-06,4.1e-05,3e-05,9e-05,4.1e-05,8.2e-05,2.5e-05,2.8e-05,6.7e-05,7e-05,6e-06,8.5e-05,5.3e-05,4.4e-05,3.4e-05,1.4e-05,6.3e-05,8.6e-05,1.5e-05,8.3e-05,9.8e-05,8.1e-05,0.000112,1.5e-05,4.3e-05,2.8e-05,3.7e-05,4.6e-05,4.6e-05,5.3e-05,7.1e-05,0.000128,8.4e-05,7e-05,1.4e-05,5.7e-05,3.4e-05,3.8e-05,1.4e-05,6.2e-05,2e-05,4e-05,2.8e-05,4.6e-05,2.5e-05,1.2e-05,2.8e-05,4.1e-05,1.1e-05,1.3e-05,2.4e-05,1.5e-05,2e-05,6e-05,2.2e-05,6.5e-05,3.5e-05,2.3e-05,7e-05,1e-05,5e-05
5.6e-05,8e-06,8.8e-05,7e-06,2.6e-05,1.7e-05,2e-05,3.9e-05,1.7e-05,1.9e-05,5.4e-05,2.8e-05,2.9e-05,1.1e-05,3.7e-05,4.4e-05,1.9e-05,6.5e-05,1.4e-05,3.8e-05,6.4e-05,2.5e-05,1.9e-05,1e-05,3.7e-05,5.5e-05,1.5e-05,2e-05,1.9e-05,3.8e-05,2.5e-05,7.3e-05,1.3e-05,3.5e-05,1.9e-05,6e-06,7e-06,4.4e-05,1.2e-05,6e-06,1.9e-05,2.2e-05,5.6e-05,1.9e-05,2.8e-05,5e-06,3.5e-05,6e-05,2.6e-05,5.7e-05,3.1e-05,6.9e-05,4.7e-05,4.3e-05,5.4e-05,5.3e-05,4.4e-05,2.2e-05,7.4e-05,3.9e-05,2.2e-05,5e-06,1.7e-05,9e-05,1e-05,8.4e-05,5.7e-05,1.3e-05,5.9e-05,6.8e-05,2.8e-05,9.3e-05,5.3e-05,4.4e-05,3.8e-05,1.6e-05,6.7e-05,7.6e-05,9e-06,3.7e-05,8.9e-05,6.8e-05,8.2e-05,4e-05,1.5e-05,2.3e-05,2.5e-05,5.5e-05,3.3e-05,4.8e-05,5.1e-05,0.000107,8.3e-05,4e-05,1.8e-05,4.5e-05,2.8e-05,3.5e-05,1.1e-05,6.1e-05,2.9e-05,3.5e-05,3.5e-05,6.7e-05,8e-06,1.9e-05,3.2e-05,2.6e-05,1.7e-05,9e-06,4e-06,2.9e-05,2.1e-05,3.8e-05,1.4e-05,6.5e-05,1.8e-05,1.3e-05,7.9e-05,2.7e-05,3.7e-05
4.2e-05,2e-06,8.4e-05,1e-05,3.1e-05,1.5e-05,1.2e-05,3.1e-05,2e-05,1.9e-05,2.1e-05,2e-05,1.8e-05,5e-06,3.5e-05,3.2e-05,1.6e-05,6e-05,2.6e-05,1.5e-05,6e-05,4.9e-05,8e-06,2.6e-05,6.2e-05,5.7e-05,2.4e-05,3.4e-05,1.5e-05,4.1e-05,2.2e-05,5.7e-05,1e-05,3.2e-05,2.6e-05,8e-06,6e-06,5e-05,1.7e-05,2.5e-05,2.1e-05,1.9e-05,5.7e-05,3.2e-05,1.6e-05,5e-06,4.8e-05,4.2e-05,3.6e-05,6.6e-05,1.2e-05,5.9e-05,2.4e-05,1.4e-05,7.9e-05,3.8e-05,5.8e-05,3.1e-05,8.3e-05,2.8e-05,1.3e-05,1.3e-05,2.2e-05,7.5e-05,1.9e-05,6.3e-05,4.2e-05,1.1e-05,5.5e-05,6.2e-05,1.7e-05,8.3e-05,3.4e-05,3.3e-05,2e-05,1e-05,4.5e-05,6.5e-05,1.7e-05,5.1e-05,9.2e-05,5e-05,0.000136,6.7e-05,2.2e-05,2.9e-05,2.9e-05,6.6e-05,1.8e-05,3.6e-05,5.7e-05,6.7e-05,9.5e-05,4.3e-05,3.1e-05,5.5e-05,2.4e-05,2.4e-05,1.2e-05,5.9e-05,1.2e-05,5.1e-05,2.9e-05,6.7e-05,1e-05,4e-06,1.5e-05,2.8e-05,1.8e-05,9e-06,1.6e-05,1.9e-05,3.9e-05,5.3e-05,1e-05,7e-05,6e-06,2.3e-05,4.8e-05,1.3e-05,3.8e-05
5.7e-05,2.4e-05,9.1e-05,4.5e-05,1.2e-05,2e-05,2.9e-05,2.9e-05,4.6e-05,2.5e-05,5e-05,3.8e-05,4.1e-05,2.2e-05,3.3e-05,3.1e-05,1.5e-05,4.3e-05,2.5e-05,5e-06,7.2e-05,3.7e-05,6e-06,3.6e-05,5.4e-05,4.7e-05,3.1e-05,3e-05,1.1e-05,5.6e-05,2.3e-05,4.8e-05,2.8e-05,4.4e-05,3.5e-05,7e-06,1.3e-05,4.1e-05,3.9e-05,3.6e-05,2.8e-05,3.5e-05,5.6e-05,5.9e-05,4e-05,1.5e-05,3.7e-05,4.6e-05,5.5e-05,5.6e-05,1.6e-05,6.6e-05,1.9e-05,4e-05,4.6e-05,1.8e-05,4.9e-05,2.4e-05,7.6e-05,1.1e-05,1e-05,3.4e-05,2.7e-05,7.2e-05,1.7e-05,3.9e-05,1.5e-05,2.7e-05,8.8e-05,5.8e-05,2.4e-05,8e-05,3.5e-05,3.3e-05,2.5e-05,1.6e-05,2.5e-05,0.000111,3.3e-05,4.2e-05,7.6e-05,4.3e-05,0.000103,1.8e-05,2.3e-05,3.3e-05,1.7e-05,4.3e-05,3.7e-05,2.1e-05,6.8e-05,8.7e-05,4.7e-05,3.2e-05,3.2e-05,3.7e-05,4.6e-05,2.1e-05,1.6e-05,5.1e-05,2.8e-05,8.1e-05,2.8e-05,5.3e-05,2.8e-05,2.1e-05,3.3e-05,3.9e-05,2.1e-05,1.2e-05,1.8e-05,7e-06,2.9e-05,7.1e-05,2e-05,7.6e-05,3.1e-05,2.9e-05,6.7e-05,1e-05,4.2e-05
7.1e-05,3.9e-05,9.1e-05,5.9e-05,6.4e-05,3.3e-05,3e-05,7.9e-05,2e-05,2.4e-05,2.8e-05,2.3e-05,6.8e-05,3.8e-05,3.5e-05,6.4e-05,2.8e-05,5.2e-05,1.3e-05,2.3e-05,4.3e-05,5.8e-05,1.6e-05,1.3e-05,4.3e-05,5.1e-05,3.8e-05,4.1e-05,1.8e-05,7.4e-05,5.2e-05,2e-05,1.7e-05,5.3e-05,3.2e-05,2.1e-05,3.8e-05,1.8e-05,2.4e-05,4e-05,2.6e-05,4e-05,6.4e-05,6.1e-05,3.7e-05,1.8e-05,2.1e-05,3.4e-05,4.1e-05,5.4e-05,1.5e-05,8.6e-05,5e-05,2.1e-05,4.7e-05,2.5e-05,2.2e-05,7e-06,8.6e-05,2.2e-05,1.2e-05,4.2e-05,1.1e-05,7.1e-05,3.3e-05,4.9e-05,3.5e-05,1e-05,7.5e-05,2.6e-05,4.8e-05,7.5e-05,3.9e-05,2.4e-05,2.1e-05,2.4e-05,1.8e-05,6.1e-05,5e-05,5.9e-05,6.9e-05,6.6e-05,8.3e-05,5.9e-05,1.5e-05,3.2e-05,2.2e-05,6e-06,2.9e-05,5.7e-05,4e-05,0.000125,5.9e-05,5.3e-05,5.8e-05,4.3e-05,2.6e-05,5.2e-05,1.7e-05,2.7e-05,2.2e-05,5.2e-05,3.2e-05,3.7e-05,4.5e-05,4e-05,5.9e-05,1.4e-05,3.4e-05,9e-06,1.6e-05,2.9e-05,2.2e-05,6.3e-05,2e-05,5.7e-05,9e-06,1.5e-05,6.8e-05,5e-06,2.7e-05
2.5e-05,2e-05,6.2e-05,2.3e-05,2.5e-05,3.3e-05,2.2e-05,3.5e-05,1.6e-05,1.4e-05,3.9e-05,1.2e-05,1.9e-05,1.8e-05,4e-05,7.3e-05,2.1e-05,4.7e-05,1e-05,2.7e-05,5.2e-05,4.3e-05,2.6e-05,7e-06,5.3e-05,5e-05,5.7e-05,1.2e-05,2.2e-05,4.5e-05,3.5e-05,5.4e-05,1.9e-05,5.9e-05,3.5e-05,4e-06,3.6e-05,5.8e-05,2.3e-05,1.5e-05,9e-06,2.4e-05,5.9e-05,3.4e-05,3.6e-05,2.7e-05,1.6e-05,5.8e-05,6e-05,4.6e-05,1.6e-05,6.3e-05,2.7e-05,4.6e-05,3.1e-05,2.5e-05,3.2e-05,2.5e-05,9.6e-05,1e-05,3.2e-05,5.6e-05,5e-05,6.3e-05,5.1e-05,1.5e-05,5.8e-05,3.9e-05,3.2e-05,2.2e-05,3.7e-05,5.2e-05,4.7e-05,7e-06,5.4e-05,2.2e-05,2.9e-05,2.7e-05,2.5e-05,2.1e-05,7.6e-05,9e-05,5.7e-05,3.4e-05,6.8e-05,8e-06,2.3e-05,3.8e-05,1.9e-05,7.3e-05,7.9e-05,0.000132,6e-05,0.000103,2.2e-05,4.9e-05,4.8e-05,4e-05,5.2e-05,7.4e-05,2.2e-05,3.1e-05,1.4e-05,5.6e-05,4.6e-05,2.8e-05,6.1e-05,6.2e-05,1.6e-05,2.9e-05,1.2e-05,1.7e-05,5e-05,3.7e-05,3.3e-05,8.8e-05,3.1e-05,2.8e-05,8.9e-05,2.4e-05,3e-05
2.4e-05,2.4e-05,7.4e-05,2.8e-05,1.2e-05,1.3e-05,2.3e-05,5.1e-05,1.9e-05,1.8e-05,4.5e-05,1.8e-05,3e-05,8e-06,9e-06,8.9e-05,2.5e-05,2.5e-05,2e-05,3.3e-05,3.1e-05,3.7e-05,9e-06,2.5e-05,4e-05,3.2e-05,5.2e-05,8e-06,3.5e-05,2e-05,3.6e-05,9.9e-05,1.6e-05,6.9e-05,3.1e-05,4.9e-05,9e-06,5e-05,3.1e-05,1.3e-05,3.3e-05,1.4e-05,3.4e-05,1.5e-05,3.7e-05,3e-05,5.7e-05,7.3e-05,1.6e-05,3.2e-05,2.6e-05,5.2e-05,7e-05,2.3e-05,3.4e-05,4e-05,2.3e-05,9e-06,5.6e-05,7e-06,3.8e-05,3.3e-05,8e-06,0.000107,6e-06,2.5e-05,1.7e-05,3.9e-05,5.8e-05,5.5e-05,4.8e-05,9.5e-05,3.7e-05,1.8e-05,4.1e-05,2.8e-05,3e-05,4.1e-05,1.7e-05,2.3e-05,5.8e-05,9.1e-05,0.000105,2.5e-05,4.8e-05,5.4e-05,3.7e-05,2.5e-05,2.1e-05,7.1e-05,6.1e-05,0.00011,0.000109,4.8e-05,2.9e-05,5.2e-05,2.7e-05,2.4e-05,4.1e-05,7e-05,3.9e-05,7.4e-05,5e-06,5.7e-05,1.6e-05,3.7e-05,2.5e-05,1.6e-05,4.3e-05,2.4e-05,1e-05,9e-06,4.9e-05,1.8e-05,1.9e-05,6.4e-05,4e-05,1.2e-05,8.1e-05,5.1e-05,3.9e-05
1.2e-05,3.5e-05,5.1e-05,2.8e-05,3.5e-05,6e-06,1.1e-05,6e-05,3.8e-05,3e-05,6.5e-05,5e-05,6.7e-05,1.7e-05,3.7e-05,7.2e-05,2.5e-05,3.2e-05,4e-05,2.7e-05,4e-06,2.5e-05,2.5e-05,2.5e-05,4.2e-05,1.7e-05,2e-05,4.6e-05,4.4e-05,3.6e-05,2.3e-05,6.8e-05,1.2e-05,3.3e-05,2.8e-05,2.1e-05,3.2e-05,4.5e-05,2.9e-05,3.5e-05,4.9e-05,2.3e-05,1.4e-05,4.8e-05,3e-05,6e-06,3.5e-05,2.2e-05,5e-06,6.6e-05,2.9e-05,4.4e-05,6e-05,6.2e-05,7.1e-05,6e-05,1.1e-05,2.5e-05,7.5e-05,4.4e-05,1.5e-05,1.1e-05,2e-05,9.6e-05,3.3e-05,3.5e-05,5e-05,2e-05,4.7e-05,5.2e-05,5.4e-05,2.3e-05,3.7e-05,2.8e-05,2.6e-05,2e-05,6.1e-05,0.000105,4.8e-05,5.2e-05,9.3e-05,3.8e-05,9.9e-05,3.9e-05,6e-05,2e-05,6e-06,1.6e-05,7.1e-05,6.6e-05,3.9e-05,9.6e-05,5.8e-05,3.4e-05,7e-06,4.1e-05,3.1e-05,2.2e-05,2.4e-05,4.3e-05,3.9e-05,6.4e-05,5.5e-05,2.7e-05,2.3e-05,1.1e-05,3.4e-05,3.4e-05,5.6e-05,2.5e-05,2.3e-05,1.7e-05,2.4e-05,2.5e-05,5.7e-05,9.6e-05,2.4e-05,2.7e-05,3.3e-05,2.6e-05,7.1e-05
3.3e-05,1.4e-05,6.4e-05,2e-05,1.2e-05,2.4e-05,1.8e-05,3.6e-05,3.4e-05,3.1e-05,3.3e-05,3.3e-05,5.6e-05,2.6e-05,2.7e-05,4.6e-05,1.5e-05,6e-05,4.5e-05,4.4e-05,3.7e-05,1.6e-05,1.1e-05,1.8e-05,5.6e-05,2.6e-05,1.4e-05,4.2e-05,4.5e-05,2.6e-05,3.2e-05,6.9e-05,2.4e-05,3.1e-05,1e-05,1.2e-05,1.3e-05,2.9e-05,8e-06,1.5e-05,1e-05,1.9e-05,3e-05,1.3e-05,4e-05,1.8e-05,8e-06,4.7e-05,4.1e-05,3.8e-05,1.6e-05,3.1e-05,4.6e-05,5e-05,5.6e-05,3.1e-05,3.9e-05,3.4e-05,8.5e-05,2.4e-05,3.3e-05,1.5e-05,3.2e-05,7.7e-05,1.6e-05,6.3e-05,1.7e-05,4e-06,4.4e-05,3.5e-05,3.2e-05,5.2e-05,4.1e-05,8e-06,2.3e-05,1.5e-05,2.5e-05,7e-05,1.2e-05,5.8e-05,8.5e-05,6.3e-05,8.3e-05,2.3e-05,1.3e-05,4.6e-05,5.6e-05,6.1e-05,3.5e-05,6e-05,4.2e-05,9.3e-05,7.9e-05,5.2e-05,2.1e-05,3.2e-05,4e-06,2e-05,3.4e-05,4.3e-05,3.7e-05,3.7e-05,2.5e-05,2.9e-05,1.2e-05,2e-05,1e-05,1.3e-05,3.3e-05,1.6e-05,2.1e-05,2.3e-05,3e-05,5e-05,1.5e-05,6e-05,2e-05,3.5e-05,5.4e-05,2.6e-05,4.9e-05
4e-05,1.1e-05,4.5e-05,3.3e-05,1.8e-05,2.7e-05,2.3e-05,5e-06,1.2e-05,1.4e-05,3.9e-05,1.6e-05,3.9e-05,1e-05,1.5e-05,6.4e-05,1.1e-05,4.7e-05,4.6e-05,1.4e-05,4.6e-05,1.6e-05,1e-05,1.4e-05,4.3e-05,3.1e-05,3.4e-05,1.5e-05,1.8e-05,2e-05,4e-06,5e-05,2.8e-05,2.4e-05,3e-05,2.4e-05,2.5e-05,1.6e-05,7e-06,6e-06,9e-06,2.9e-05,3.4e-05,2.4e-05,3.1e-05,1.5e-05,2.2e-05,5.6e-05,4.8e-05,4.6e-05,2.6e-05,2.5e-05,5e-05,3.7e-05,3.6e-05,3.7e-05,3.9e-05,4e-05,0.000108,1.4e-05,2e-05,1.9e-05,2.6e-05,7.1e-05,5e-06,4.2e-05,3.7e-05,4.1e-05,3.6e-05,5.4e-05,2e-06,4.5e-05,2.7e-05,1.3e-05,1.9e-05,9e-06,1.6e-05,6e-05,1.4e-05,4.9e-05,9e-05,3.1e-05,6.9e-05,3e-06,1.3e-05,1.9e-05,3.8e-05,3.3e-05,4.1e-05,3.8e-05,7.1e-05,7.2e-05,7e-05,4e-05,1.6e-05,4.4e-05,1.9e-05,9e-06,2.2e-05,3.6e-05,2.2e-05,3.5e-05,3.6e-05,2.8e-05,1.3e-05,8e-06,2e-06,2e-05,2e-05,1.6e-05,2.2e-05,5e-06,2.1e-05,5e-05,2e-05,5.8e-05,2.9e-05,2.2e-05,4.7e-05,2.8e-05,4.7e-05
2.4e-05,2.1e-05,3.3e-05,1e-06,1.2e-05,3.8e-05,2.6e-05,2.9e-05,1.5e-05,5e-06,5.5e-05,3.3e-05,4.8e-05,1.5e-05,1.4e-05,1.6e-05,3.3e-05,5.5e-05,4.2e-05,1.9e-05,3.2e-05,6e-06,2.8e-05,2.6e-05,5.5e-05,2.9e-05,5.1e-05,1e-05,3.3e-05,2.2e-05,7e-06,4.8e-05,4e-06,2.1e-05,3.5e-05,3e-06,2e-06,1.6e-05,1.3e-05,2.1e-05,2.4e-05,3.6e-05,5e-05,3.9e-05,1.6e-05,1.7e-05,2.2e-05,3.7e-05,2.9e-05,4.8e-05,2.8e-05,3.6e-05,2.9e-05,2e-05,4.8e-05,3.7e-05,1.4e-05,2.3e-05,5.1e-05,1.7e-05,2e-05,3e-05,8e-06,8.3e-05,3e-06,3.8e-05,6.5e-05,1.8e-05,4.4e-05,6.2e-05,1.6e-05,3.5e-05,3e-05,2.6e-05,2.8e-05,2.1e-05,2.2e-05,4e-05,6e-06,5.4e-05,9e-05,5.5e-05,9e-05,3.5e-05,1.9e-05,3e-05,2.2e-05,5.1e-05,4.1e-05,3.2e-05,4.1e-05,7.7e-05,6.3e-05,2.4e-05,1.2e-05,5.2e-05,2.8e-05,1.7e-05,1.7e-05,5.7e-05,1.7e-05,3.7e-05,4.6e-05,4.9e-05,9e-06,9e-06,9e-06,1.5e-05,8e-06,1.6e-05,9e-06,1.4e-05,1.3e-05,3.1e-05,2.9e-05,7.4e-05,1e-05,3.2e-05,5.5e-05,1.2e-05,2e-05
1.7e-05,9e-06,4.6e-05,3e-05,6e-06,1.9e-05,1.6e-05,3e-05,1.5e-05,2e-05,3.7e-05,1.4e-05,2.9e-05,2e-05,4.2e-05,3.8e-05,1.7e-05,3.4e-05,2.3e-05,1.6e-05,3.2e-05,2.7e-05,2.9e-05,2.3e-05,3.4e-05,2.8e-05,3.6e-05,3.9e-05,1.5e-05,2e-05,3.4e-05,7.1e-05,8e-06,1.9e-05,2.1e-05,1.5e-05,1.6e-05,2e-05,2.2e-05,1.7e-05,2.4e-05,3e-06,6.2e-05,1.6e-05,1.6e-05,1.2e-05,1.7e-05,2.8e-05,3.3e-05,3.2e-05,2.6e-05,1.9e-05,5.1e-05,2.7e-05,3e-05,3e-05,2.5e-05,2.2e-05,6.9e-05,1.4e-05,1.6e-05,7e-06,6e-06,6e-05,2e-05,4.8e-05,5.2e-05,1.4e-05,3.5e-05,4.4e-05,2.7e-05,6.5e-05,1.8e-05,2e-05,2e-06,3.5e-05,2.3e-05,4.1e-05,1.6e-05,3.8e-05,0.000105,4.7e-05,7.6e-05,3.3e-05,1.5e-05,2.2e-05,5.2e-05,4.9e-05,1.9e-05,3.2e-05,5.4e-05,7.3e-05,7e-05,3.3e-05,2.1e-05,4.4e-05,1.4e-05,1.9e-05,1.6e-05,4.2e-05,1.4e-05,3.5e-05,2.6e-05,3.4e-05,1.3e-05,1e-05,2e-06,1.7e-05,1.8e-05,1.6e-05,2.1e-05,1.2e-05,2.2e-05,3.3e-05,3.1e-05,4.6e-05,8e-06,2.2e-05,2.7e-05,1.5e-05,2.6e-05
3.3e-05,7e-06,5.3e-05,2.1e-05,8e-06,2.3e-05,1.1e-05,2.7e-05,1.1e-05,1.4e-05,3.6e-05,1.9e-05,1.7e-05,7e-06,3.3e-05,3.9e-05,1.3e-05,2.7e-05,1.8e-05,3e-05,2.1e-05,2.2e-05,1e-05,4e-06,4.6e-05,2.4e-05,3.7e-05,3.1e-05,7e-06,6e-06,7e-06,5.7e-05,1.2e-05,2.2e-05,8e-06,1e-05,9e-06,2.3e-05,1.4e-05,9e-06,7e-06,1.5e-05,3.6e-05,1.6e-05,3.1e-05,1e-06,2.4e-05,3.1e-05,3.7e-05,4.4e-05,1.5e-05,5.1e-05,3e-05,4.2e-05,4.8e-05,1.1e-05,2e-05,1.2e-05,6.5e-05,1.1e-05,9e-06,4e-06,8e-06,6.8e-05,6e-06,5.2e-05,4.1e-05,2e-06,4.4e-05,2.4e-05,8e-06,6.3e-05,2.9e-05,2.4e-05,8e-06,2e-05,2.1e-05,4.1e-05,1.2e-05,1.7e-05,7.9e-05,7.1e-05,7.5e-05,3.6e-05,1.4e-05,1.9e-05,3.8e-05,3.9e-05,2.9e-05,3.5e-05,4.8e-05,7.6e-05,6.4e-05,3e-05,1.5e-05,4.1e-05,1.1e-05,1.3e-05,8e-06,3.9e-05,8e-06,3.7e-05,9e-06,4.5e-05,9e-06,1.5e-05,4e-06,2.4e-05,8e-06,1e-05,1.1e-05,1.3e-05,2e-05,3.6e-05,1.7e-05,5.6e-05,1e-05,7e-06,3.7e-05,3e-06,2.6e-05
2.7e-05,4e-06,4.3e-05,9e-06,2.1e-05,1.7e-05,1e-05,2.9e-05,1.1e-05,2e-06,3.2e-05,1.6e-05,2.2e-05,8e-06,1.9e-05,3.2e-05,1.3e-05,4.2e-05,2.9e-05,3.3e-05,3.8e-05,2.8e-05,1.6e-05,2.1e-05,4.8e-05,3.5e-05,2.7e-05,3.3e-05,1.6e-05,1e-06,7e-06,5.5e-05,1.6e-05,3.3e-05,2e-05,2e-06,9e-06,2.1e-05,9e-06,5e-06,7e-06,9e-06,4.6e-05,1.6e-05,2.3e-05,5e-06,2.2e-05,3.4e-05,4.1e-05,3.6e-05,9e-06,4e-05,2.7e-05,3.5e-05,4.7e-05,1.3e-05,3.1e-05,1e-05,6.6e-05,7e-06,4e-06,2e-06,9e-06,7.8e-05,1.6e-05,3.3e-05,4.1e-05,1.2e-05,4.1e-05,3e-05,4e-06,5.9e-05,1.7e-05,2.1e-05,1.3e-05,8e-06,2e-05,6.3e-05,1.8e-05,2.5e-05,7.6e-05,5.7e-05,6.3e-05,1.8e-05,2.1e-05,1.3e-05,4e-05,4.9e-05,2.4e-05,3.9e-05,4.7e-05,7.3e-05,6.5e-05,2.9e-05,1.1e-05,4.6e-05,1e-06,1.9e-05,3e-06,4.4e-05,1.5e-05,2.9e-05,2e-05,4.1e-05,2e-06,1e-05,3e-06,2.3e-05,7e-06,8e-06,4e-06,7e-06,1.4e-05,3.1e-05,1.2e-05,5.2e-05,1.7e-05,1.7e-05,4.1e-05,8e-06,2.4e-05
2.1e-05,1e-06,4.2e-05,1e-05,1.5e-05,1.1e-05,1.2e-05,2.5e-05,1e-05,2e-06,2.9e-05,1.7e-05,2e-05,8e-06,2e-05,3.8e-05,6e-06,4e-05,2.4e-05,2.2e-05,3.2e-05,3.1e-05,1e-05,1.9e-05,3.9e-05,3.4e-05,2e-05,1.7e-05,1.6e-05,8e-06,1.4e-05,6.3e-05,1.1e-05,2.3e-05,1.7e-05,5e-06,1.1e-05,1.7e-05,1.3e-05,6e-06,3e-06,2e-06,3.8e-05,1.4e-05,2.3e-05,7e-06,1.7e-05,3.1e-05,4.2e-05,3.8e-05,6e-06,4e-05,3.1e-05,3.8e-05,4.2e-05,1.2e-05,2.2e-05,7e-06,7.1e-05,8e-06,5e-06,3e-06,6e-06,7.4e-05,5e-06,3.8e-05,3.1e-05,8e-06,3.7e-05,3.3e-05,4e-06,5.8e-05,2.2e-05,2.2e-05,1.3e-05,5e-06,2.1e-05,5.8e-05,3e-06,2.8e-05,7.1e-05,5.6e-05,7.4e-05,1.9e-05,2e-05,1e-05,3.7e-05,4.2e-05,2.8e-05,3.6e-05,4.5e-05,7.2e-05,6.8e-05,3.2e-05,1.8e-05,4.2e-05,4e-06,1.2e-05,7e-06,4e-05,1.2e-05,3.1e-05,2.2e-05,3.5e-05,3e-06,1.1e-05,5e-06,2.6e-05,7e-06,3e-06,5e-06,9e-06,1.5e-05,3.2e-05,1.3e-05,4.9e-05,9e-06,1.8e-05,4.1e-05,2e-06,2.5e-05
2.8e-05,3e-06,4.5e-05,5e-06,1.5e-05,1.3e-05,1.3e-05,3e-05,7e-06,2e-06,3.1e-05,1.6e-05,2.2e-05,7e-06,2.1e-05,3.7e-05,7e-06,3.7e-05,2.4e-05,2.4e-05,3.7e-05,2.6e-05,1e-05,1.7e-05,4e-05,3.5e-05,2.4e-05,1.5e-05,1.4e-05,1e-06,1e-05,5.8e-05,1.2e-05,2e-05,1.7e-05,4e-06,5e-06,1.8e-05,1.1e-05,2e-06,6e-06,1e-06,3.8e-05,1.3e-05,2.2e-05,7e-06,1.6e-05,3.7e-05,3.6e-05,3.7e-05,2e-06,3.7e-05,3.3e-05,3.4e-05,4.3e-05,1.7e-05,2.2e-05,6e-06,7e-05,9e-06,6e-06,7e-06,8e-06,6.8e-05,9e-06,3.7e-05,3.3e-05,1e-05,3.7e-05,3.2e-05,2e-06,5.5e-05,2.2e-05,2.4e-05,1.5e-05,1e-06,2.2e-05,5.1e-05,9e-06,3.6e-05,7.2e-05,5.6e-05,7e-05,2e-05,2.1e-05,1e-05,3.3e-05,3.9e-05,2e-05,4.3e-05,3.9e-05,7e-05,6.2e-05,2.9e-05,9e-06,4.7e-05,2e-06,1.2e-05,3e-06,4.2e-05,9e-06,3.4e-05,1.6e-05,3.6e-05,4e-06,1.2e-05,3e-06,2.6e-05,1e-05,8e-06,5e-06,1.1e-05,1.3e-05,3.2e-05,1.5e-05,5.2e-05,9e-06,1.5e-05,4.3e-05,2e-06,2.6e-05
