0.006289,0.005465,0.005869,0.00597,0.007532,0.014734,0.098706,0.418905,0.520124,0.513959,0.691962,0.71971,0.672358,0.752247,0.904407,0.738202,0.37859,0.205459,0.193952,0.181716,0.1405,0.118662,0.274265,0.466862,0.408913,0.436204,0.54899,0.358245
0.007514,0.006667,0.007228,0.007351,0.009016,0.01784,0.117145,0.480605,0.595651,0.57808,0.777144,0.824609,0.770096,0.867634,1.034501,0.829227,0.426636,0.233412,0.218746,0.203847,0.161133,0.14212,0.319659,0.536285,0.466311,0.494945,0.638016,0.426752
0.009333,0.008571,0.009361,0.009614,0.011254,0.022466,0.141355,0.548601,0.679705,0.640503,0.868839,0.983575,0.93109,1.051825,1.224059,0.939114,0.484983,0.272519,0.251614,0.230103,0.186089,0.17613,0.387282,0.638627,0.545329,0.562996,0.751445,0.52318
0.010502,0.009779,0.010456,0.010963,0.012158,0.02393,0.142941,0.520911,0.648596,0.598892,0.842329,1.092265,1.105367,1.22427,1.329085,0.947722,0.495934,0.290175,0.256195,0.226003,0.183579,0.185985,0.416691,0.688217,0.582447,0.558151,0.744872,0.538441
0.011838,0.010576,0.010536,0.01153,0.012349,0.022124,0.125552,0.447443,0.571297,0.545207,0.808127,1.207293,1.344574,1.421102,1.38144,0.908868,0.486403,0.294169,0.236753,0.199536,0.16265,0.171204,0.405839,0.675206,0.572724,0.513399,0.655881,0.481897
0.015026,0.012199,0.011533,0.013407,0.014479,0.021319,0.115372,0.436033,0.577482,0.60827,0.944295,1.482065,1.749679,1.707958,1.444526,0.881278,0.46435,0.281899,0.213066,0.170265,0.142137,0.151767,0.403226,0.671566,0.55488,0.479151,0.59123,0.435392
0.02155,0.015627,0.015282,0.017633,0.019158,0.025405,0.129817,0.541351,0.723866,0.771334,1.237827,2.014617,2.475204,2.319318,1.810031,1.079874,0.544904,0.302499,0.224421,0.175255,0.146433,0.151175,0.46606,0.784138,0.60673,0.471883,0.586271,0.453983
0.031528,0.021177,0.021846,0.024107,0.026163,0.034579,0.168936,0.749146,0.980707,0.996568,1.714893,3.038218,3.948672,3.786642,2.963462,1.814051,0.91404,0.465288,0.333346,0.267156,0.20884,0.200201,0.620954,1.051522,0.797353,0.565337,0.694532,0.557152
0.042622,0.028118,0.030134,0.032265,0.035529,0.046352,0.232608,1.056165,1.326387,1.220093,2.319799,4.705664,6.556971,6.373457,4.912933,3.057363,1.566417,0.762902,0.55098,0.456535,0.332793,0.296954,0.806012,1.354213,1.082137,0.80151,0.975516,0.779741
0.049207,0.033562,0.03722,0.03951,0.04545,0.058561,0.31108,1.425047,1.731684,1.407534,3.001623,7.044146,10.304593,9.821296,7.245594,4.570327,2.408494,1.117851,0.825875,0.714538,0.502967,0.42153,0.967057,1.597167,1.37728,1.109154,1.333206,1.044948
0.046274,0.03428,0.039667,0.043064,0.053184,0.070293,0.382346,1.722737,2.057425,1.497731,3.522514,9.377936,14.124791,12.983678,9.063532,5.830408,3.184925,1.390439,1.053009,0.967086,0.676163,0.535194,1.091277,1.759737,1.608471,1.40259,1.65455,1.254524
0.036628,0.030714,0.036758,0.041542,0.054302,0.07566,0.425252,1.825918,2.137464,1.445119,3.667589,10.530933,15.930478,14.022017,9.260241,6.106501,3.489831,1.450312,1.108603,1.07342,0.761484,0.576433,1.096163,1.730775,1.644037,1.540343,1.78033,1.293553
0.028372,0.026539,0.030838,0.035532,0.046855,0.069399,0.417198,1.694269,1.938084,1.320735,3.424594,9.657121,14.159458,11.957719,7.620319,5.109557,3.035382,1.253042,0.943031,0.923567,0.689839,0.525981,0.919051,1.425741,1.397875,1.405445,1.639932,1.151304
0.025377,0.024551,0.024481,0.027207,0.034697,0.054645,0.355213,1.352565,1.510074,1.148004,2.796953,7.155946,9.951716,8.107008,5.180626,3.43025,1.978375,0.845417,0.621648,0.59266,0.495883,0.414504,0.773279,1.247396,1.158107,1.14241,1.401311,0.976544
0.027038,0.025781,0.021457,0.021391,0.025743,0.041634,0.272231,1.031177,1.170151,0.958631,2.064831,4.623584,5.92398,4.498518,2.843712,1.82153,0.967455,0.468199,0.354819,0.334678,0.354506,0.338033,0.769441,1.310609,1.135436,1.089503,1.311166,0.870564
0.036457,0.032316,0.023729,0.021865,0.027086,0.046015,0.257493,1.047693,1.2615,0.98068,1.725071,3.140325,3.474211,2.466184,1.57225,0.968884,0.527871,0.370947,0.306718,0.274347,0.355484,0.368657,0.872429,1.483008,1.303894,1.279001,1.384553,0.86426
0.051238,0.044106,0.029072,0.025499,0.037028,0.066556,0.30564,1.252691,1.572961,1.218701,2.01409,3.295396,3.073457,1.960455,1.387033,0.902021,0.536839,0.454424,0.369359,0.316172,0.443063,0.467518,0.940101,1.589553,1.583331,1.682732,1.718816,1.085963
0.064329,0.056119,0.035278,0.02966,0.049494,0.090968,0.347441,1.436108,1.913731,1.583462,2.562964,4.124552,3.649981,2.403423,1.975026,1.274814,0.707417,0.54864,0.414831,0.351435,0.52467,0.547131,0.884485,1.527165,1.826464,2.156622,2.238567,1.513485
0.068874,0.061917,0.040526,0.033381,0.058556,0.106948,0.359499,1.583012,2.279117,2.040783,3.22967,5.137705,4.62747,3.355737,2.862715,1.724873,0.86855,0.586819,0.412899,0.355612,0.584159,0.606302,0.788701,1.452646,2.013859,2.454723,2.585935,1.89994
0.063649,0.06199,0.045591,0.035253,0.058977,0.107617,0.379826,1.773214,2.615972,2.406693,3.769177,5.954248,5.652148,4.5641,3.844585,2.139198,0.972817,0.577288,0.38757,0.344895,0.627818,0.669804,0.741658,1.403921,2.052963,2.422498,2.512754,1.993207
0.056807,0.063888,0.052441,0.036488,0.052357,0.093792,0.389627,1.770636,2.565271,2.417446,3.825141,6.013712,6.121628,5.475793,4.565269,2.449504,1.053322,0.583642,0.385608,0.340877,0.65968,0.718694,0.690917,1.252651,1.849743,2.122673,2.136583,1.780821
0.049798,0.062113,0.053301,0.035811,0.042303,0.073574,0.37527,1.587357,2.145221,2.035035,3.306598,5.077556,5.706533,5.764297,4.797424,2.646697,1.16539,0.594714,0.388442,0.331016,0.644487,0.694454,0.630224,1.114292,1.561976,1.818486,1.865131,1.525134
0.03915,0.049713,0.044755,0.032825,0.031958,0.049507,0.331869,1.376515,1.694155,1.50448,2.58099,3.853021,4.751327,5.252677,4.414052,2.652932,1.221546,0.528985,0.322425,0.269881,0.525187,0.560162,0.540232,1.009231,1.328009,1.517293,1.577642,1.218225
0.03067,0.03529,0.033266,0.028391,0.02542,0.033879,0.268868,1.046554,1.194735,1.067308,2.052082,3.033855,3.72048,4.148272,3.564392,2.309472,1.10986,0.432921,0.239865,0.186161,0.343185,0.371495,0.461779,0.936758,1.140788,1.20059,1.22715,0.890851
0.026661,0.026532,0.025458,0.025893,0.025347,0.030885,0.203864,0.689242,0.759545,0.878833,2.031802,3.052978,3.19034,3.15396,2.717361,1.716916,0.844767,0.373395,0.207481,0.131395,0.208765,0.2383,0.419415,0.853261,0.934189,0.929935,0.970765,0.657765
0.022131,0.020242,0.021063,0.024594,0.027083,0.029609,0.170986,0.554532,0.606645,0.835358,2.176044,3.137137,2.809885,2.460756,2.086209,1.209899,0.568989,0.330505,0.188552,0.099375,0.154258,0.1817,0.386821,0.737389,0.773381,0.827681,0.847904,0.497981
0.019265,0.019684,0.021609,0.025765,0.030603,0.031524,0.143603,0.469749,0.536511,0.77609,2.083353,2.807997,2.486426,2.348597,1.93487,0.997234,0.377786,0.250276,0.155763,0.08364,0.140909,0.165766,0.346998,0.640397,0.715454,0.851728,0.83567,0.451139
0.020501,0.025296,0.027415,0.02823,0.0349,0.037649,0.122521,0.403975,0.477894,0.648978,1.709774,2.285996,2.245946,2.5264,2.133248,1.024992,0.318899,0.180632,0.134663,0.088851,0.152968,0.179597,0.339202,0.606472,0.721065,0.837424,0.789245,0.46385
0.027037,0.033912,0.033793,0.029401,0.036373,0.043295,0.111035,0.370001,0.425462,0.516905,1.400916,2.030764,2.146099,2.500116,2.125655,1.011705,0.322052,0.168385,0.143114,0.10296,0.173259,0.206133,0.405132,0.687203,0.830118,0.984614,0.935364,0.578486
0.038211,0.045575,0.042314,0.035189,0.04074,0.047963,0.114829,0.393565,0.421545,0.487534,1.450953,2.063524,1.89345,2.047246,1.78571,0.95303,0.380572,0.192368,0.165477,0.117407,0.18413,0.216893,0.465328,0.75485,0.945954,1.291475,1.24731,0.740302
0.051613,0.060259,0.055709,0.04814,0.053618,0.059051,0.125747,0.402081,0.409032,0.545612,1.66305,2.026773,1.475299,1.564026,1.351447,0.791732,0.417655,0.225593,0.194638,0.129035,0.175427,0.198344,0.458271,0.755134,0.979446,1.493834,1.488818,0.870861
0.059095,0.06787,0.06457,0.058046,0.062943,0.06739,0.133157,0.373885,0.356785,0.571428,1.720832,1.898794,1.317778,1.359334,1.04837,0.611574,0.384243,0.24445,0.215482,0.13509,0.148789,0.154523,0.377521,0.656412,0.898681,1.461328,1.54857,0.974729
0.053311,0.059873,0.059441,0.055476,0.058532,0.061602,0.117725,0.312248,0.29452,0.526536,1.645014,2.013631,1.458343,1.170558,0.834645,0.468941,0.313147,0.237071,0.211086,0.123889,0.112149,0.112252,0.288209,0.532942,0.893857,1.384599,1.452564,1.017362
0.036365,0.039251,0.040696,0.039373,0.040393,0.042017,0.084388,0.250097,0.254511,0.424115,1.535868,2.373454,1.721009,0.991512,0.763376,0.483228,0.322686,0.225257,0.179448,0.098939,0.085595,0.099899,0.27298,0.480405,0.927796,1.349427,1.336035,0.987845
0.021631,0.020547,0.020655,0.020314,0.020227,0.021937,0.061125,0.219629,0.231425,0.330405,1.59114,2.834675,2.03452,0.97908,0.779463,0.550617,0.368974,0.210791,0.141544,0.079132,0.071471,0.098541,0.286986,0.495017,0.947806,1.230146,1.069554,0.834468
0.016705,0.014469,0.014304,0.013349,0.011863,0.013533,0.048564,0.194049,0.220938,0.318484,1.747017,3.131604,2.10941,1.028621,0.80946,0.540917,0.376436,0.210867,0.12059,0.069992,0.068847,0.093637,0.275708,0.450233,0.8751,1.196722,0.887381,0.638759
0.015191,0.014121,0.015634,0.014794,0.012568,0.012783,0.042326,0.16436,0.199454,0.387521,1.888187,3.065427,1.826025,0.93166,0.731814,0.427692,0.315056,0.199118,0.103498,0.06075,0.069095,0.092077,0.234941,0.372229,0.711586,1.171404,0.940241,0.617745
0.015997,0.013532,0.01612,0.016038,0.014234,0.013697,0.042641,0.136471,0.156648,0.453218,1.925409,2.678242,1.419711,0.756166,0.635764,0.298388,0.208515,0.156867,0.083402,0.045949,0.05812,0.078317,0.188274,0.333771,0.573868,1.164534,1.09691,0.625313
0.015799,0.013771,0.015988,0.016751,0.016016,0.015153,0.047043,0.111012,0.109815,0.475642,1.74039,2.099838,1.053169,0.594072,0.530471,0.220771,0.135029,0.104854,0.065905,0.032951,0.039671,0.053637,0.190187,0.321302,0.541422,1.194186,1.140602,0.560374
0.014878,0.015147,0.015725,0.016498,0.018266,0.017642,0.049777,0.091513,0.082192,0.456576,1.345454,1.460397,0.761133,0.427701,0.395193,0.199447,0.135913,0.084156,0.051915,0.026532,0.030084,0.035086,0.210755,0.330691,0.504321,1.115678,1.027475,0.460783
