-0.006416,-0.010744,-0.012194,-0.012065,-0.010793,-0.011263,-0.013662,-0.008365,-0.009218,-0.009664,-0.006742,-0.008842,-0.011467,-0.011449,-0.008117,-0.008716,-0.012621,-0.011836,-0.00896,-0.008073,-0.009653,-0.008985,-0.009148,-0.008189,-0.007909,-0.00673,-0.006014,-0.008318
0.001541,0.009168,0.009045,0.002441,-0.001309,0.000225,0.003595,0.000422,0.00576,0.005565,0.001114,0.006258,0.004954,-0.000832,-0.000483,0.000895,0.00373,0.001965,0.00042,-0.002506,0.004404,0.003406,0.002833,0.001972,0.001318,0.000428,-0.001985,0.000294
-0.007546,-0.006027,-0.005083,-0.004022,-0.001619,-0.004323,-0.005238,-0.00229,-0.002909,-0.003196,-0.001868,-0.002686,-0.005528,-0.006749,-0.003267,-0.002378,-0.002653,-0.002538,-0.002649,-0.004059,-0.003405,-0.001807,-0.002585,-0.002352,-0.001155,-0.00119,-0.00279,-0.002867
-0.013157,-0.012726,-0.01061,-0.007292,-0.003549,-0.007321,-0.01052,-0.004697,-0.008243,-0.007976,-0.0037,-0.009589,-0.011542,-0.009425,-0.005019,-0.003204,-0.005765,-0.005785,-0.003752,-0.003237,-0.008131,-0.006109,-0.005699,-0.004102,-0.0038,-0.002354,-0.001896,-0.004106
0.000674,0.008898,0.012195,0.008869,0.004185,0.007014,0.010505,0.004104,0.006535,0.007433,0.004189,0.006315,0.008823,0.00723,0.004598,0.008,0.012599,0.009604,0.007685,0.006648,0.007631,0.006399,0.007589,0.007541,0.005702,0.004876,0.003883,0.006109
-0.00023,-0.003018,-0.002121,-0.001939,-0.002937,0.000419,0.001337,-0.000806,-0.000586,-0.000818,-0.001268,0.000246,0.001011,0.001736,0.000183,-0.000134,0.001581,0.00225,0.00129,0.001629,0.001122,0.001152,0.001234,0.000892,0.00144,-4.5e-05,-0.000995,6.8e-05
-0.002912,-0.011522,-0.013992,-0.013458,-0.008859,-0.009276,-0.012695,-0.006195,-0.008036,-0.009156,-0.006647,-0.009865,-0.010691,-0.007941,-0.00605,-0.00999,-0.014754,-0.010675,-0.007943,-0.006608,-0.008718,-0.007314,-0.00799,-0.008119,-0.007353,-0.006805,-0.005062,-0.006918
0.011894,0.012868,0.010967,0.007448,0.006601,0.007339,0.008875,0.005255,0.008109,0.008275,0.004082,0.006851,0.009703,0.008687,0.005,0.003011,0.003969,0.004391,0.003493,0.00206,0.006227,0.005601,0.00497,0.003322,0.002087,0.002052,0.003066,0.004934
0.009989,0.007036,0.006607,0.01091,0.010052,0.010216,0.010074,0.00578,0.005327,0.006285,0.005346,0.007262,0.009352,0.010841,0.007023,0.006617,0.008908,0.008068,0.005722,0.005679,0.006009,0.005514,0.004925,0.00488,0.006024,0.005689,0.005545,0.005863
-0.003935,-0.007615,-0.008279,-0.003283,-0.002438,-0.00434,-0.008121,-0.003619,-0.007053,-0.006483,-0.00193,-0.006359,-0.006921,-0.003447,-0.001794,-0.001842,-0.004815,-0.005166,-0.00335,-0.00069,-0.005972,-0.006861,-0.006356,-0.003679,-0.002671,-0.000832,0.001238,-0.0034
0.000701,0.007949,0.007858,0.003697,-0.00099,-0.000593,0.003037,0.000909,0.003402,0.003595,0.001993,0.004205,0.004379,0.001246,0.000857,0.002507,0.003077,0.000476,0.000921,0.000775,0.002547,-5.2e-05,0.001204,0.001617,-0.000576,0.000297,0.000957,0.000704
0.000468,0.002514,0.00261,0.001946,0.001501,0.000248,0.004117,0.002557,0.003945,0.002242,0.001046,0.006074,0.003299,0.000163,0.000366,0.000757,0.002454,0.002247,0.000673,-0.000517,0.002781,0.003519,0.003802,0.001878,0.002167,0.00053,-0.002637,0.000213
-0.010239,-0.011911,-0.012996,-0.011647,-0.00532,-0.010408,-0.014151,-0.004716,-0.007146,-0.0093,-0.005691,-0.009667,-0.014761,-0.014059,-0.007877,-0.008754,-0.012733,-0.009907,-0.007849,-0.007344,-0.008866,-0.005352,-0.005898,-0.006425,-0.004622,-0.005014,-0.006617,-0.007569
-0.003698,0.003826,0.004447,8.8e-05,-0.000837,-0.000216,-0.00028,-0.000688,0.000901,0.00224,0.000702,-0.002017,-0.002018,-0.005574,-0.002995,0.000254,0.000342,-0.001026,0.000254,-0.001444,-0.000103,0.000601,-2.5e-05,6.9e-05,-0.001482,-0.000962,-0.000405,0.000165
0.002762,0.003207,0.006311,0.007605,0.004574,0.010147,0.01271,0.003045,0.003219,0.005552,0.003829,0.006175,0.008873,0.006862,0.003568,0.007015,0.012561,0.010701,0.007495,0.006172,0.006523,0.005819,0.005414,0.005725,0.005398,0.004407,0.004138,0.006784
-0.002683,-0.010796,-0.009735,-0.005803,-0.002832,-0.001628,-0.00452,-0.003038,-0.006796,-0.006857,-0.003988,-0.006222,-0.004866,0.000696,-0.000229,-0.00304,-0.002903,0.000278,-0.000949,0.00176,-0.002788,-0.003692,-0.002922,-0.001582,-0.000326,-0.000362,8e-04,-0.000464
0.002655,0.002721,0.001688,-0.002529,-0.003355,-0.002683,-0.003096,-0.001063,0.000762,0.000453,-0.002144,-0.002656,0.000346,0.002886,0.001736,-0.00207,-0.004049,-0.002819,-0.001258,-0.000443,0.000279,-0.00194,-0.00086,-0.001558,-0.003249,-0.002103,-0.000114,-8.9e-05
0.008576,0.006632,0.005786,0.004724,0.002841,0.005526,0.007185,0.003498,0.006714,0.006589,0.003001,0.007519,0.009287,0.008457,0.004927,0.003619,0.003909,0.002046,0.002388,0.001175,0.004605,0.004559,0.004315,0.001899,0.001904,0.001295,0.000205,0.002656
-7.4e-05,-0.005667,-0.007176,-0.003841,0.000227,-0.001912,-0.006479,-0.001754,-0.003797,-0.004511,-0.000615,-0.002259,-0.004176,-0.001116,-0.001507,-0.00293,-0.005762,-0.005535,-0.004113,-0.002534,-0.004735,-0.002622,-0.0034,-0.002542,0.000463,-7.9e-05,-0.001245,-0.004097
