-0.000924,0.001273,-0.000551,-0.000984,-0.001334,-0.001576,-0.001515,-0.00184,-0.000696,0.000386,-0.001406,-0.001536,-0.001082,3e-04,-0.00162,-0.00072,-0.000137,-0.001261,-0.000801,-0.001706,-0.000744,-0.001137,-0.002657,-0.000559,-0.002291,-0.001465,-0.000918,-0.000147,-0.001208,-0.001673,-0.001924,-0.000616,-0.000697,0.000704,-0.000614,0.000212,0.000418,-0.001221,-0.002091,-0.001556,-0.00035,-0.001456,-0.001441,-0.002333,-0.002098,-0.001666,1e-04,-0.000457,-0.001922,-0.001095,-0.001453,-0.000891,-0.001912,-0.000424,-0.000982,-0.001575,-0.002335,-0.002043,-0.001449,-0.001003,-0.000953,-0.001443,0.000408,-0.001299,-0.000776,-2.8e-05,-0.000516,-0.00019,-0.000425,5e-05,-0.000981,-0.002188,-0.000774,-0.000538,-0.000761,-0.000267,-0.00131,-0.001327,-0.000637,-0.000366,4e-06,-0.000865,-0.000426,-0.001023,0.000102,-0.000484,-0.000848,-0.000862,-0.000581,-0.000374,-0.000104,-0.000979,-0.00037,-0.000969,-0.000274,-0.000922,-0.000344,-0.001563,-0.001072,-0.000567,-7.2e-05,-0.000132,-0.000421,-0.000358,-0.000268,-0.000988,-0.000456,-0.000341,0.000164,-9.1e-05,0.000119,-0.00121,-0.001183,-0.000881,-0.000755,-0.000659,-0.000608,-0.000824,-0.000462,-0.001324,-0.000609
6.8e-05,-0.000542,-0.00207,-0.000363,0.00011,-0.001121,-0.000129,-0.000205,-0.00105,-0.002141,-0.000289,-0.000333,-0.001623,-0.00077,-0.000706,7.8e-05,-0.00078,0.000284,0.000817,-0.000693,-0.001153,-0.00043,-0.000296,-0.002248,-0.001307,-0.000746,-0.000944,-0.001929,0.000889,0.001436,0.000961,-0.000209,-0.000577,-0.00179,-0.000439,-0.001514,-0.002782,-0.001028,-8.4e-05,-0.000191,0.000292,-0.000833,-0.000175,0.000761,0.000125,0.000159,-0.000525,-0.00041,0.000869,0.000988,0.000194,-0.000702,0.000466,-0.001249,-0.001214,0.000368,0.000826,0.00021,-0.00023,-0.000232,-0.001493,0.000291,-0.000259,-8.1e-05,-0.000203,-0.000943,-0.001382,-0.000222,-0.000869,-0.000834,-0.000672,0.000372,0.000744,-0.00093,-0.000183,-0.000646,4.7e-05,0.000105,-0.000405,-0.000862,-0.000324,-0.000618,0.000109,1.5e-05,-0.000303,-0.000387,0.000367,-2.4e-05,-0.000276,-0.000253,-0.000688,0.000454,-0.000684,1e-05,-0.000284,-8.6e-05,0.001212,0.000557,0.000529,7e-05,-0.000495,-0.000919,-0.000233,-0.00015,-0.000454,-0.000289,-0.000939,-0.000712,-0.000819,-0.000455,-0.000602,-0.000812,-8e-06,-9.1e-05,-3.9e-05,0.000163,9e-05,-0.000361,0.000299,0.000479,-0.000207
-0.000147,-0.002386,-0.000562,-0.000827,-0.001328,5e-06,-0.002861,-0.000905,-0.000256,-0.000594,-0.000251,6.6e-05,0.000114,-0.000338,-0.001682,-0.000679,-0.000869,-0.002121,-0.001925,-0.000845,-0.00096,-0.000411,0.000323,-0.000338,-0.001762,-0.001329,-0.001017,-0.000461,-0.001305,-0.002344,-0.001524,-0.000941,-0.000668,-0.000496,0.000132,-0.000349,0.000539,-0.001134,-0.000938,-0.000162,-0.000286,-0.000393,-0.000132,-0.000893,-0.000905,-0.001742,-0.002742,-0.001428,-0.001011,-0.000911,-0.001653,-0.000983,-0.001615,0.000267,-7.9e-05,-0.001299,-0.001343,-0.001242,-0.000844,3.6e-05,0.000157,-0.001458,-0.001008,-0.000664,-0.000863,-0.000693,0.000208,-0.000702,-0.000979,-0.000905,0.000117,-0.000875,-0.002281,-0.001588,-0.000988,-0.000986,-0.001653,-0.000479,-0.000318,0.000179,0.000157,-0.000573,-0.000663,-0.00022,-0.000474,-0.000388,-0.000561,-0.000325,-6.9e-05,-0.000161,-0.000704,-0.000375,-0.000733,-0.000704,-0.000819,-0.000386,-0.0016,-0.001304,-0.000857,-0.000443,-0.001407,-0.000284,-0.000194,-0.000243,-0.000408,-0.000296,-0.000453,-5.3e-05,-0.000232,-0.000184,0.000229,0.000206,-0.001086,-0.000628,-0.000604,-0.000391,-0.00017,6.7e-05,-0.000157,-0.000785,-0.001733
0.000396,0.001819,0.001848,0.001059,0.001055,0.001099,0.001788,0.001046,0.000654,-0.000292,-0.000253,-0.000165,0.000553,-0.000298,0.000908,9.4e-05,-0.000351,0.000451,0.000606,0.000847,0.000213,0.000586,-4e-06,0.000391,0.003086,0.001855,0.001184,0.000274,0.000797,0.00076,0.000775,0.000619,0.000183,0.000335,2.5e-05,0.001728,0.000944,0.000348,0.001205,0.000319,0.000471,0.000564,0.000261,0.000511,0.000751,0.002007,0.001257,0.001153,0.001054,0.000469,0.001253,0.001425,0.000719,0.000713,0.000381,0.001058,-0.000135,0.00158,0.00095,0.000398,0.000469,0.000906,0.000747,0.001012,0.001061,0.001485,0.001202,0.00059,0.001299,0.000489,-0.000456,0.001544,0.001985,0.001445,0.000632,0.000828,0.00116,0.000327,6.4e-05,-0.000484,-0.000185,0.000793,0.000655,0.001017,0.000445,0.00056,0.000255,0.000372,0.000305,0.000142,0.000399,-9.3e-05,0.000442,0.00032,0.000295,0.000394,0.00046,0.000946,0.000882,0.000834,0.000499,0.000667,0.000144,0.000153,0.000102,0.000473,0.000443,0.000412,0.000242,-0.000424,0.000219,-4.2e-05,0.00043,0.00068,0.000523,3.4e-05,-8.3e-05,0.000215,-4.5e-05,5.5e-05,0.000455
-0.000138,-0.000176,-0.000674,-0.00083,-0.00011,-0.000747,0.000154,-0.00063,-3.7e-05,0.000286,0.000477,0.000218,-0.000109,0.00059,0.000926,-0.000192,0.00036,0.000608,-7.9e-05,0.000221,-0.000463,-0.000456,-0.000347,0.000674,-0.000245,-0.000816,0.000324,-2.8e-05,-0.000687,-0.000505,-0.000402,0.000293,0.000539,-0.000424,-0.000877,-0.001041,-0.000871,0.000861,-0.001022,-0.000553,-0.000906,0.000227,-4.5e-05,-0.000341,-5.2e-05,-0.000632,0.000458,0.000356,-0.000355,0.000162,-0.000204,-5.8e-05,0.001082,-0.000324,-0.000211,-0.000363,0.000605,-0.001244,-0.00086,-0.00022,-0.000274,-0.000149,0,-0.000531,-0.000415,-0.000265,-0.000347,-0.000549,0.000151,0.000643,0.001401,-0.000867,-0.000419,0.000123,0.000886,-0.000358,0.000665,-0.00033,0.000268,0.000474,-8.8e-05,-0.000205,-0.000344,-0.000808,-0.000418,-0.000181,-1.8e-05,-0.000143,0.000144,-0.000104,0.000325,0.000148,-0.000165,-0.000508,0.000175,5e-05,0.000157,-9.3e-05,-0.00046,-8.2e-05,-5.4e-05,-0.000332,-0.000241,0.000335,0.000666,-0.000109,2e-04,0.000421,0.000349,0.000453,-0.000363,0.000323,-0.000111,-0.000449,-0.000197,-0.000265,-0.000153,-0.00013,0.000288,-0.000112,-0.000272
-2.7e-05,-0.000106,-4.2e-05,0.000588,0.000375,0.000102,-0.000818,-3.1e-05,7.1e-05,0.000481,0.000569,-0.000265,0.000404,0.000758,-0.000398,0.000441,0.000756,0.000949,0.000779,-2e-06,0.000489,4.2e-05,0.000327,-0.000932,-0.001209,-0.000571,-0.000208,0.000439,-0.000287,0.00065,0.000357,-0.000327,-0.000422,0.000671,0.000792,0.00017,0.000316,0.000265,0.000113,0.001082,0.000427,-9.3e-05,0.000124,0.000307,0.000171,9.2e-05,0.000657,-0.000436,0.000553,0.000222,-0.000306,0.000269,-0.000731,-0.000445,8.5e-05,0.000455,9.3e-05,0.000411,0.000391,-0.000412,0.000443,0.00064,3.4e-05,-0.000597,0.000422,-0.000254,-0.000409,-0.000201,-0.000362,-0.000378,6.5e-05,-0.000138,0.000514,0.000107,-0.000185,-0.000103,-0.000338,7.1e-05,-0.000113,0.000375,-0.000134,-6.9e-05,0.000248,0.000345,0.000579,-1.6e-05,-0.000197,0.000336,0.000368,4.9e-05,5.1e-05,-0.000204,0.000214,0.000514,0.000189,-0.000194,-7.1e-05,-4.9e-05,0.000191,-0.000109,0.000237,1.9e-05,5.4e-05,8.1e-05,-0.000149,-0.000271,-0.000149,-0.000433,-0.000553,0.000642,0.000253,-0.000277,0.000383,0.000303,0.000163,0.000283,2e-04,2.1e-05,-0.00018,7.2e-05,0.000612
1.6e-05,8.6e-05,-0.00046,-9.1e-05,-0.000371,0.000237,0.000477,-8.9e-05,-0.000365,-0.000396,-0.000696,-1.7e-05,-0.000133,-0.000346,-0.000158,-0.000363,-8.4e-05,-0.001018,-0.000373,-0.000253,0.000326,-0.00041,-0.000195,0.000213,-6.6e-05,0.000456,0.00011,0.000279,0.00048,-0.000168,-0.00073,0.000385,6.5e-05,3e-05,0.000271,-0.00049,0.000166,-0.001492,-0.000251,-0.000996,-0.000394,-0.000481,-0.000468,-0.000362,-0.00027,-0.001109,-0.000552,-0.000475,-4e-04,-0.000119,0.000176,-0.000849,-0.000187,0.000272,-0.000228,-0.000328,0.000177,-0.000172,-9.6e-05,0.000425,-0.000494,-0.000662,-0.000356,0.000523,-0.000306,-0.000263,3.5e-05,0.000636,0.000327,-1.3e-05,-0.000667,1.8e-05,-0.000504,-0.000887,-0.000443,0.00033,-8.8e-05,5.3e-05,3.9e-05,-0.000193,0.000172,0.000195,-0.000555,-0.000384,-0.000155,0.000189,0.000111,-0.000237,-0.000547,8.4e-05,-9e-06,9.8e-05,-9.7e-05,2e-04,-1.3e-05,-0.00033,-0.000208,-0.00055,1e-06,-0.000183,-0.000151,-6.1e-05,7.1e-05,7e-06,-0.000136,9.6e-05,-0.000209,-0.000139,5e-05,-0.000157,-0.00017,-0.000165,-0.000238,-0.000399,-0.000232,7.2e-05,-0.000238,5.2e-05,-0.000161,-3.3e-05,-0.000731
0.000119,-0.000226,0.000549,-0.000479,0.000202,8.3e-05,9e-06,0.000468,0.000226,-0.000383,-0.000536,-0.000122,-9.4e-05,-0.000641,-0.000197,0.000291,9.1e-05,0.000386,-0.000307,-0.000128,-0.000537,0.000763,0.000319,0.00044,0.000811,0.00055,-2.8e-05,-0.000659,-9.9e-05,0.000729,0.000217,-0.000528,-0.000326,-0.000326,-0.000647,-0.000932,0.000371,0.000276,-0.000124,0.000614,0.000322,0.00024,0.000864,0.000378,3.6e-05,0.000565,0.000646,0.000625,0.000639,0.000141,5.5e-05,0.000244,0.000121,0.000282,0.00028,-0.000448,-0.00053,0.000103,0.000102,0.000301,1e-04,-0.00023,0.000175,-0.000177,0.00021,2e-04,0.000473,-0.000404,-0.000586,0.000141,-3.1e-05,-4e-04,0.000629,0.000623,0.000116,1.7e-05,6.2e-05,-0.00042,8e-06,5.1e-05,-0.000194,-0.000228,0.000213,0.000505,-7.6e-05,-0.000264,-0.000223,4.2e-05,0.000235,0.000178,0.00015,5.2e-05,0.000249,3.9e-05,8.6e-05,0.000109,0.000384,0.000266,0.000239,7.8e-05,-9.2e-05,0.000542,8.3e-05,-0.000363,1e-06,0.000454,0.000127,0.000133,0.000377,-8e-06,-9.8e-05,0.000418,3e-06,0.000488,0.000218,-0.000183,0.000189,-0.000192,-3.8e-05,-0.000154,1e-05
-8.7e-05,7.1e-05,-0.000334,0.000143,-0.000365,-0.00014,-0.000201,0.00011,0.000242,0.000325,-3.4e-05,0.000141,0.00014,0.000113,0.000195,-0.000686,-5.9e-05,-0.000202,-0.000156,0.000203,0.000192,7.9e-05,-0.000462,-0.000681,-0.000572,-6.5e-05,0.000225,0.000114,-0.00018,-0.000332,9e-05,0.000511,0.000254,-0.000325,-0.000352,0.00057,-0.000398,0.000404,0.000779,-8.6e-05,-8.9e-05,-0.000367,-0.000418,-0.000293,7.9e-05,-2.2e-05,0.000132,0.000213,-0.00022,-0.000359,8.5e-05,3.7e-05,0.000305,-5.1e-05,-5.2e-05,0.000316,0.000467,0.000578,4.1e-05,-0.000396,-2e-05,0.00033,0.000247,0.000204,0.000364,1.7e-05,-0.000455,2.8e-05,0.000239,-4.9e-05,-4.9e-05,0.000417,-0.000111,2.4e-05,0.000117,0.000262,0.000164,0.000145,3.1e-05,9.7e-05,0.000377,1.6e-05,0.000202,-0.000286,-0.000158,6.3e-05,-1.9e-05,-3.9e-05,6e-05,-0.000179,-0.000239,2.4e-05,1.6e-05,-0.000292,-0.00019,0.00025,-4.9e-05,0.00014,-0.000258,-9.4e-05,0.000243,-0.000134,-0.000176,0.000197,-8.9e-05,-0.000413,6.9e-05,5.1e-05,-0.000252,2.5e-05,0.000221,-0.000499,0.000106,0.000115,-0.00014,0.000107,0.000142,1.4e-05,0.000105,0.000295,2.8e-05
-0.000309,-0.000337,6.5e-05,0.00072,0.000308,-1e-04,-0.000152,-0.000104,-0.000548,1e-06,0.000153,0.000156,-2e-04,7.7e-05,-6.5e-05,3.7e-05,-0.000269,-0.000133,0.000344,3e-05,9.4e-05,-5.2e-05,0.000164,0.00033,0.000601,-0.000503,-0.000431,0.000283,-0.000237,-0.000312,-8.3e-05,-0.00011,-0.000154,-9.5e-05,0.000387,0.000477,0.000297,-0.000182,-0.00048,-0.000311,4.6e-05,3.8e-05,-1.4e-05,9.5e-05,-1.6e-05,8.3e-05,-0.00021,-0.000316,0.000185,0.000302,-1.6e-05,-8.7e-05,-0.000562,-0.000413,-0.000195,0.000137,-0.00014,-0.00047,-0.000167,0.00035,-0.000163,-6.5e-05,7.4e-05,-0.000136,-0.00049,7.6e-05,1.3e-05,0.000286,4e-04,2e-04,0.00036,-0.000332,-0.00029,-5.2e-05,3e-05,-0.000476,-0.000317,0.000161,-0.000232,-0.000206,-0.000116,-7.8e-05,6.2e-05,-0.000144,0.000223,0.00011,0.000233,0.000164,-0.000133,-8.8e-05,-5.5e-05,-0.000138,-0.000188,0.00014,-0.000102,-0.000102,-0.00016,-0.000257,-0.000171,-4.6e-05,6.5e-05,7.3e-05,-9.1e-05,-0.000116,7.6e-05,0.000113,-0.00017,1.3e-05,-0.000166,3.7e-05,-0.000153,-0.000282,-0.00018,0,-1.1e-05,-0.00018,-7.4e-05,5.3e-05,-2e-05,-5.2e-05,6.2e-05
0.00042,9.6e-05,2.5e-05,-0.000459,7e-05,4.7e-05,0.000341,6.5e-05,0.000427,-5.7e-05,9e-06,-0.000355,0.000176,-5.2e-05,0.000201,0.000373,4e-06,0.000238,-0.000127,0.00016,0.000287,0.000109,0.000286,2.5e-05,-0.000379,-6.9e-05,0.000133,0.000128,9.5e-05,1.3e-05,1e-04,-0.000255,-4.1e-05,0.000376,-0.000124,-0.000196,-0.000687,-0.000192,-0.000138,-0.000282,-0.000307,4.2e-05,-6.4e-05,5.9e-05,-0.000104,8e-05,-0.000165,-0.000218,-0.000135,-0.000481,-0.000117,0.000158,0.000128,-3.5e-05,0.00012,-0.000275,0.000132,-9.5e-05,0.000121,-0.000292,-1.9e-05,-1.1e-05,-6.8e-05,2.6e-05,-1e-04,-0.000223,-7.5e-05,-9.8e-05,-5.5e-05,-0.000122,-0.000349,-0.000208,2.5e-05,-9.6e-05,-0.000136,-0.000164,0.000124,-1.5e-05,0.000105,0.00014,-0.000343,3.7e-05,-0.000261,0.000207,-0.00015,-0.000116,-6.9e-05,0.000133,-0.000112,-5.4e-05,-8.1e-05,-0.000103,8.8e-05,-0.000125,0.000142,8e-05,-0.000125,0.000163,0.000156,7.8e-05,1.2e-05,-0.000224,2e-05,-5.8e-05,-4.4e-05,-0.000232,-4.5e-05,-7.6e-05,-0.000155,-1.5e-05,-0.000231,0.000329,0.000102,-0.000451,-6.8e-05,0.000187,2e-06,-0.000192,-5.8e-05,2.3e-05,0.000123
-4.5e-05,-0.000133,-9.7e-05,-0.000279,-0.000325,9.4e-05,4.4e-05,-4.3e-05,0.000188,-6.1e-05,6.3e-05,1e-05,-0.000164,-3.2e-05,-4.4e-05,-5.9e-05,0.000128,-4.1e-05,0.000168,-0.000191,-0.000314,-0.000346,-1.2e-05,-5e-05,8.3e-05,0.000378,6e-06,-0.000394,6.5e-05,0.000112,-2.4e-05,-0.000134,6.3e-05,-3.5e-05,0.000197,-0.000171,0.000134,0.000338,0.000305,0.000299,0.000176,0.000111,0.000129,2e-05,0.000138,-0.000438,-9.5e-05,-0.000143,-0.000446,0.000125,3.2e-05,-0.000114,-0.000229,0.000235,7.3e-05,0.000162,-0.000375,-0.000123,9.7e-05,1.3e-05,0.00014,3.3e-05,-0.000256,-0.00014,7.3e-05,2.6e-05,0.000196,-7e-06,-0.000171,-4.5e-05,-2.3e-05,0.000181,-8.3e-05,2.4e-05,1.5e-05,0.000313,1e-04,-0.000136,-0.000195,-0.000104,6.3e-05,-1.6e-05,0.000114,3e-06,2.1e-05,6.5e-05,-4.8e-05,-0.000124,7.5e-05,0.000124,4e-05,-1.2e-05,-2e-06,0.000137,0.000144,-0.00024,2e-06,-1.1e-05,0.000121,6e-05,-2e-05,-6.9e-05,0.000141,4.8e-05,-0.000127,0.000135,0.000227,5e-05,5.9e-05,-0.000252,-7.5e-05,-2.7e-05,0.000115,0.00013,1e-04,-4.8e-05,-4.9e-05,0.000186,2.9e-05,-5.9e-05,-1.2e-05
-0.00016,0.000115,8.6e-05,-8e-05,4.4e-05,1e-06,-0.000105,0.000127,-0.000119,-3.5e-05,2.3e-05,0.000359,0.000147,9.2e-05,-0.000117,3.8e-05,-1.7e-05,0.000135,-5.1e-05,2.3e-05,3.5e-05,-4.4e-05,-0.000124,-4.5e-05,-4e-05,-0.000114,9.5e-05,6.5e-05,-2e-05,-0.000102,-0.000145,5.4e-05,-0.00015,1.8e-05,-0.000196,-0.000127,-2.3e-05,-5.2e-05,-0.000114,0.000102,-0.000114,8e-06,-5.7e-05,6.7e-05,-6.5e-05,0.000169,-1.4e-05,3.8e-05,8.9e-05,3.9e-05,-0.000123,1.3e-05,0.000144,8.7e-05,-5.7e-05,0.000103,0.000168,0.000291,2e-05,7.7e-05,-2.3e-05,-3.9e-05,0.000243,0.000159,3.7e-05,2.1e-05,-6.9e-05,1e-05,0.000111,2.9e-05,0.000111,4.5e-05,-1.3e-05,-1e-05,-5.6e-05,-8.7e-05,-0.000101,-0.000118,-0.000127,0,8.8e-05,0.000144,-0.000119,-5.4e-05,-2.4e-05,-4e-05,-1.6e-05,8.4e-05,-1.8e-05,-5.3e-05,-4.4e-05,3.8e-05,8.3e-05,-0.000134,-6.6e-05,6.4e-05,0.000124,-8.9e-05,6.8e-05,-9.9e-05,0.000139,0.000101,4.7e-05,0.000104,-6e-06,7e-05,-6.5e-05,1e-05,9.7e-05,0.000134,5.1e-05,-4e-06,-9.8e-05,9.3e-05,3.4e-05,-3.2e-05,-3.8e-05,-6.3e-05,-1.9e-05,7.3e-05,-3.3e-05
-5.4e-05,-0.000197,-5e-05,0.000283,0.000178,-3e-06,5e-06,-3.1e-05,-0.000219,8.7e-05,-1.6e-05,5.9e-05,2.8e-05,3.8e-05,0.000105,-6.8e-05,-5.9e-05,-4.8e-05,-4.2e-05,2.4e-05,-1.1e-05,0.000148,-5.4e-05,0.000106,-0.000131,0.00015,7.5e-05,6.9e-05,-1.3e-05,-1.8e-05,-4.5e-05,4.6e-05,0.000196,-5.8e-05,-7.2e-05,0.000177,9.7e-05,-0.000361,7.2e-05,-0.000198,8.9e-05,2.4e-05,0.000111,-5.3e-05,4e-05,1.4e-05,-4e-05,-2.9e-05,5.6e-05,-0.000148,5.2e-05,-3.6e-05,-2.4e-05,-6e-05,-1.7e-05,-4.5e-05,-8.2e-05,-0.000148,-9.1e-05,-7.5e-05,-7.8e-05,5e-05,4.2e-05,-0.000146,-1.3e-05,-9.7e-05,8.1e-05,3.5e-05,-3e-06,-1.5e-05,9.5e-05,9.1e-05,4e-06,-0.00012,7.7e-05,3.1e-05,7.2e-05,0.000153,2.6e-05,3.2e-05,-1.2e-05,-3.9e-05,-9e-06,-8.6e-05,9.4e-05,5e-05,5.2e-05,1e-06,3e-06,-7.7e-05,1.2e-05,1.7e-05,-4.8e-05,-5.4e-05,-6e-06,-6e-06,1.8e-05,3.8e-05,-5.7e-05,3.4e-05,-7.2e-05,-8.6e-05,2.7e-05,-6.1e-05,9e-06,-3.9e-05,-8.5e-05,-4.9e-05,-3.7e-05,-1.3e-05,9.4e-05,4e-05,4.6e-05,-6.8e-05,6.8e-05,1e-05,9e-06,4.8e-05,4e-06,-3e-05,2e-05
-1.8e-05,0.000119,2.8e-05,-8.9e-05,-7.8e-05,-2.9e-05,0,4.5e-05,-6.3e-05,-7.9e-05,-3.5e-05,3.2e-05,-9.5e-05,-0.000102,-3.4e-05,8.6e-05,-0.00015,7.1e-05,3e-06,8e-06,0.000126,0.00012,-7.1e-05,-3e-06,0.000138,-0.000132,-0.000148,2e-06,-6e-06,-9.9e-05,-0.000118,5.1e-05,-6.6e-05,7.9e-05,4.2e-05,-5e-06,-7.1e-05,0.000144,-5e-06,0.000195,-2.8e-05,-9.2e-05,-4.2e-05,-8e-05,-3.6e-05,-4.2e-05,2.2e-05,2.7e-05,0.000172,-2.3e-05,-0.000101,-4.4e-05,0.000148,-2.6e-05,-9e-05,-0.000149,2e-06,0.000146,-2.3e-05,-5e-06,-2.8e-05,-9.3e-05,-5e-05,7.3e-05,-3.7e-05,-6.9e-05,-7.1e-05,-9e-06,-0.000111,0.000122,-0.000212,-0.000186,-9.1e-05,-2.3e-05,-6.7e-05,-0.000106,-1.1e-05,3.4e-05,0.000176,-8.2e-05,4.2e-05,-7.3e-05,4.5e-05,8.2e-05,-1.7e-05,-2.8e-05,-7.9e-05,-2.1e-05,2.7e-05,6.2e-05,-4.3e-05,2.5e-05,-2.3e-05,0.000103,3e-06,4.8e-05,-4e-05,-2.6e-05,-3.1e-05,-1.9e-05,5.1e-05,-4.2e-05,-6.7e-05,-1.1e-05,3.9e-05,-2.6e-05,2.2e-05,2.6e-05,-1.8e-05,-7e-05,-4e-05,-0.00012,-4.4e-05,0.000129,-2.2e-05,2.9e-05,9.5e-05,-1.6e-05,3.3e-05,-2.4e-05,-2.9e-05
2e-05,4.9e-05,-2e-06,-8.3e-05,1.8e-05,-3.7e-05,3.5e-05,-3.7e-05,1.1e-05,-5.8e-05,-4.3e-05,-7e-05,2.4e-05,-1.2e-05,-6.4e-05,-2e-06,9e-05,-0.000108,-7e-05,1.7e-05,-5.2e-05,-0.000121,7.1e-05,1.7e-05,-5e-05,-0.000111,3.1e-05,-0.000159,-1.5e-05,-5.5e-05,0.00016,5.6e-05,1.2e-05,4.5e-05,-4.6e-05,3.7e-05,4.8e-05,-1e-05,-5.9e-05,-0.000108,7.5e-05,5e-06,-6e-05,9.4e-05,2.6e-05,7.8e-05,-2.5e-05,8.3e-05,-0.000102,5.5e-05,8.2e-05,-6e-06,-8.7e-05,2.5e-05,4.9e-05,7.4e-05,3.3e-05,-0.000107,-1.5e-05,1.9e-05,3.2e-05,6.6e-05,7.4e-05,-3.3e-05,5.8e-05,0.000151,2e-06,-5.1e-05,4e-06,-2.6e-05,4.8e-05,2.2e-05,-4e-05,-1e-06,4.3e-05,-3e-05,-7.2e-05,-4e-05,-8e-05,3.9e-05,-0.00014,6.1e-05,5e-05,5e-05,-6.4e-05,2.6e-05,7e-05,-1.1e-05,-1.3e-05,-9e-06,2.6e-05,-2e-06,3.3e-05,-3.2e-05,-4.6e-05,4.5e-05,-2.1e-05,4.1e-05,2.6e-05,5.6e-05,-4e-05,-3.4e-05,1e-05,1.6e-05,2e-06,-1e-06,-2.6e-05,7e-06,-2e-05,-6e-05,-3.2e-05,-3e-05,-4.1e-05,-0.000161,-3.3e-05,-1.2e-05,-4.6e-05,2e-06,9e-06,-1.4e-05,-4e-06
7.5e-05,-8.3e-05,-3e-06,9.4e-05,-2.5e-05,3.2e-05,-1.5e-05,-4.9e-05,-6e-06,0.000113,5e-06,-6.3e-05,-3e-05,7e-06,7.4e-05,-4e-06,-5e-06,-3.6e-05,5.5e-05,2.6e-05,5e-06,-8.5e-05,-6e-06,-3.1e-05,1.3e-05,0.000131,-2.7e-05,7.2e-05,2.8e-05,0.000122,1.9e-05,-0.000109,1e-06,-7.2e-05,6e-05,9e-05,-5.9e-05,-4.3e-05,8e-05,1.5e-05,2e-06,-7e-06,4e-05,-2.3e-05,-1.4e-05,-4.7e-05,-1.5e-05,-6.7e-05,-3.5e-05,0.000116,-3.1e-05,-3.7e-05,3.3e-05,6.2e-05,2e-05,6.9e-05,3.5e-05,-4.5e-05,4.7e-05,-5e-06,-1.7e-05,-3e-05,-9.3e-05,1e-06,-1.9e-05,-6.1e-05,2.2e-05,6e-06,1.2e-05,6e-06,5.3e-05,-6e-06,7.2e-05,-1.7e-05,-5.7e-05,8e-05,7.1e-05,-3.9e-05,2.4e-05,-5.5e-05,7.7e-05,-3.4e-05,-3e-06,-2.9e-05,5e-05,-4e-05,-1.4e-05,-3.8e-05,-4.3e-05,3e-05,1.7e-05,3e-06,-2.1e-05,-2e-05,-7e-06,-2.3e-05,1.1e-05,-1e-05,-4e-06,-4.9e-05,3.4e-05,-2.2e-05,-6e-06,3.7e-05,2.8e-05,2.7e-05,3e-05,-9e-06,9e-06,6e-05,1.8e-05,7.3e-05,2.9e-05,3.2e-05,-1.7e-05,-1e-06,-3e-05,-2.2e-05,1e-06,1.4e-05,3e-06
1e-05,2e-05,-8e-06,1e-06,-4.2e-05,1.3e-05,3.7e-05,-6e-06,6e-06,2e-06,3.2e-05,4.6e-05,2.8e-05,3e-06,-4.6e-05,1e-06,2.7e-05,5.1e-05,5.8e-05,-4e-06,8e-06,3.7e-05,1.9e-05,-2.1e-05,2.2e-05,1e-06,2.1e-05,1e-05,3.8e-05,-3.3e-05,-4.4e-05,8.4e-05,2.7e-05,4.7e-05,-3e-06,-7.1e-05,8.1e-05,3e-05,-3.9e-05,5.1e-05,-2.6e-05,-1.8e-05,-3e-05,5.1e-05,6e-06,-1e-06,4.9e-05,2.6e-05,-1.2e-05,-4.9e-05,6e-06,6.7e-05,-2e-06,1.8e-05,-9e-06,-1e-04,-4.3e-05,8.1e-05,4e-06,-4e-06,-2.3e-05,-2.3e-05,6e-06,4e-06,1.1e-05,4.1e-05,-4e-06,2.2e-05,8e-06,-5e-06,-2.1e-05,-6e-06,-1.9e-05,1.9e-05,1.1e-05,1.8e-05,-1.4e-05,4.4e-05,-2.6e-05,1.1e-05,-1.8e-05,2.3e-05,-4.5e-05,-2e-06,8e-06,4.2e-05,-3e-06,1.8e-05,-1.9e-05,-1.3e-05,-2e-06,-1e-06,3.2e-05,-1.3e-05,1e-05,-7.1e-05,-2.9e-05,6e-06,2e-06,1e-05,-3.1e-05,2.5e-05,1e-05,-6.8e-05,0,3.8e-05,1.5e-05,6e-06,2.6e-05,1.7e-05,-1.8e-05,1.3e-05,-2.5e-05,2.1e-05,1e-05,-3.5e-05,-1e-06,-7e-06,-3e-06,-1.2e-05,-1.4e-05
-8e-05,0,7e-06,-5.1e-05,2.7e-05,-1.1e-05,-3e-05,-2e-05,4e-05,-3.5e-05,4.4e-05,-2e-06,0,-4e-05,3e-06,-2.6e-05,-6e-06,-6e-05,-3.4e-05,-2.3e-05,2.3e-05,-3.7e-05,-2.6e-05,-3e-06,-1.8e-05,4e-06,-1.7e-05,1e-05,-1.3e-05,-7e-06,2.5e-05,-9.4e-05,-5.9e-05,-1.8e-05,2.2e-05,-1.7e-05,-7e-06,0.000148,3.5e-05,1.7e-05,3.4e-05,8e-06,3e-06,-3.2e-05,-4e-06,-8.2e-05,-1e-05,1.5e-05,1e-06,-1e-05,3.7e-05,-3e-06,-1.9e-05,-2.8e-05,3e-06,2.1e-05,6.6e-05,4e-06,-1.8e-05,1.6e-05,1e-05,4.4e-05,1.6e-05,1e-05,4.1e-05,-3e-06,1.9e-05,1e-05,2e-06,-3.1e-05,-5.9e-05,7.6e-05,2.8e-05,2.9e-05,-2e-05,-1.9e-05,1.5e-05,-1.3e-05,1.1e-05,-8e-06,9e-06,1.3e-05,2.7e-05,-6.8e-05,-2e-06,-3.7e-05,2e-06,-2.7e-05,2.4e-05,-2.2e-05,-5e-06,7e-06,-2.4e-05,2.2e-05,-3.3e-05,-1.5e-05,2.3e-05,2.1e-05,-3.5e-05,-5.3e-05,-1.1e-05,2.8e-05,-1.3e-05,3.1e-05,-2e-06,1.7e-05,-1e-05,-7e-06,-1.6e-05,-3e-05,1.8e-05,-3.9e-05,1e-05,5.6e-05,-1.5e-05,2.8e-05,1.3e-05,4e-06,-3e-06,-2.4e-05,2e-05
7e-05,-3.5e-05,-1.2e-05,-4.2e-05,-7e-06,-1.7e-05,8e-06,1.4e-05,-1.9e-05,6e-06,2.2e-05,3.2e-05,-1.6e-05,2.2e-05,8e-06,6.6e-05,1.5e-05,2e-05,1.2e-05,-2e-06,-2e-05,6.9e-05,4.2e-05,0,-4.2e-05,-2.7e-05,1.5e-05,-6.7e-05,-2.5e-05,2.6e-05,-4.2e-05,6.1e-05,4.4e-05,4.5e-05,9e-06,-5.1e-05,-1e-06,-7.1e-05,2.5e-05,-6.6e-05,-5.8e-05,1.7e-05,-1.1e-05,-2e-06,2e-06,4.9e-05,3.7e-05,-2e-06,3.7e-05,2.2e-05,-3.3e-05,7e-06,-5.7e-05,-2.6e-05,1e-06,6.1e-05,-5.5e-05,4e-05,8e-06,8e-06,8e-06,-2.2e-05,-2.4e-05,-2.8e-05,-1.8e-05,-4e-05,-3e-05,-1.5e-05,-3.7e-05,1.8e-05,6.8e-05,-5.7e-05,2.4e-05,1e-05,1.2e-05,9e-06,1.1e-05,-1.3e-05,-1.9e-05,7e-06,4.9e-05,-1.5e-05,-1.1e-05,2.4e-05,-1.2e-05,2e-05,-5e-06,5e-06,-1.6e-05,9e-06,1.6e-05,1e-06,-7e-06,3e-06,1.6e-05,4e-06,4e-06,-3.8e-05,4e-06,2.9e-05,1e-06,7e-06,-8e-06,7e-06,-7e-06,-5.3e-05,6e-06,-2e-06,-1e-05,3.2e-05,-5e-06,1.8e-05,-3e-06,3.7e-05,1e-06,-1e-06,0,-1.1e-05,-3e-06,2.6e-05,-1.6e-05
-3.3e-05,3.4e-05,1.3e-05,6.8e-05,-1.1e-05,-9e-06,2e-06,-2.4e-05,5.2e-05,1.3e-05,1e-06,2.4e-05,0,1.3e-05,-1.6e-05,-3.1e-05,-1.4e-05,0,2.4e-05,-2.6e-05,-8e-06,6.3e-05,-2.9e-05,8e-06,4.1e-05,-4e-05,-2.2e-05,4.9e-05,7e-06,-5e-06,-2.1e-05,-3.7e-05,-1.9e-05,-5e-06,-2.5e-05,3.8e-05,8e-06,-3e-05,-5.4e-05,-4e-05,3.6e-05,2e-05,1.3e-05,9e-06,-9e-06,2e-05,0,-1.8e-05,5e-06,-4.3e-05,3.5e-05,-2e-05,4.7e-05,-8e-06,-5e-06,-2.9e-05,3.3e-05,-2.6e-05,-6e-06,-2.5e-05,-2.7e-05,1e-06,5.3e-05,1.8e-05,-2.3e-05,2.7e-05,2.9e-05,-1.9e-05,2.5e-05,8e-06,4.7e-05,-3e-06,-2.6e-05,-1.9e-05,2e-06,-5.3e-05,-3e-06,-9e-06,2.9e-05,1e-05,-5.1e-05,2.6e-05,8e-06,1.4e-05,4e-06,1e-06,-1.1e-05,-5e-06,1e-05,1.4e-05,-2.1e-05,-1e-05,1.2e-05,-4e-06,1.7e-05,3.7e-05,-8e-06,2.2e-05,3.8e-05,-2e-05,-8e-06,1.4e-05,4e-06,0,-9e-06,1e-06,-3e-06,-3e-06,-2e-05,2.7e-05,-5e-06,2e-05,-5e-06,-5.7e-05,7e-06,-1.1e-05,4e-06,2.3e-05,5e-06,-7e-06,6e-06
-1.9e-05,-2.2e-05,-1.6e-05,6.5e-05,3.2e-05,1.1e-05,1e-05,-7e-06,-1e-06,-4e-06,-1.8e-05,-6.1e-05,2e-06,-2e-06,3e-06,-2.3e-05,2.5e-05,4.5e-05,-3.7e-05,9e-06,8e-06,-7.9e-05,-2.4e-05,-1e-05,-1.7e-05,1.9e-05,3.8e-05,3e-06,2.5e-05,2e-06,1.3e-05,-3e-06,1.1e-05,-2.5e-05,-1.5e-05,7.2e-05,-4.3e-05,5e-05,3.9e-05,5.5e-05,-4e-06,-7e-06,-3.5e-05,-6e-06,8e-06,-2.1e-05,-7e-06,8e-06,6e-06,-1.8e-05,-1.1e-05,-1.4e-05,-2.2e-05,2.2e-05,1.7e-05,-3.1e-05,-6e-06,-4e-05,1.8e-05,3.8e-05,2.2e-05,-1.2e-05,-3.6e-05,-1.5e-05,-1e-05,-2.1e-05,-1.2e-05,2.8e-05,1e-06,3e-06,-5.9e-05,-1.8e-05,9e-06,3.6e-05,5e-06,5e-05,-1e-06,1.9e-05,-3.5e-05,5e-06,-2.3e-05,-7e-06,-7e-06,2.2e-05,8e-06,-1.4e-05,1.7e-05,-7e-06,1.6e-05,6e-06,-2e-06,0,-1e-05,-1.1e-05,-8e-06,8e-06,-1.8e-05,-1e-06,9e-06,3.6e-05,-2e-05,-1.3e-05,1.1e-05,-2.1e-05,0,4e-06,-3e-06,3e-06,3e-06,0,-1e-05,-1.5e-05,5e-06,4e-06,-1e-06,0,5e-06,-1.2e-05,3e-06,-7e-06,-1e-06
1.1e-05,8e-06,1.2e-05,-8.5e-05,-5e-06,1e-05,-1.7e-05,-1.6e-05,-4.1e-05,-2.8e-05,-1.7e-05,-1e-05,5e-06,-1.2e-05,5e-06,1.9e-05,-7e-06,-3.9e-05,1e-05,-1.2e-05,1.3e-05,-1.7e-05,-1.3e-05,2e-06,7e-06,3e-05,-1.4e-05,5e-06,-1e-05,1.6e-05,3.4e-05,-2.7e-05,-1.8e-05,2.9e-05,1.6e-05,-3.7e-05,2.4e-05,-1.2e-05,-1e-06,9e-06,-6e-06,1e-06,3.2e-05,1.2e-05,-4e-06,4e-05,8e-06,-3.1e-05,-4.8e-05,8e-06,-2e-06,7e-06,-1e-06,1.4e-05,-2.6e-05,1.3e-05,-7e-06,1.2e-05,-1.3e-05,-4.5e-05,-1.6e-05,9e-06,-1.3e-05,6e-06,2.4e-05,5e-06,1.5e-05,-7e-06,-2.3e-05,-1.1e-05,-4e-06,-1.4e-05,-8e-06,-2.5e-05,8e-06,-1e-06,-1.7e-05,0,-1.1e-05,7e-06,1.7e-05,5e-06,2.3e-05,-1.3e-05,-7e-06,1.4e-05,-8e-06,6e-06,-2e-06,-2e-05,-3e-06,1e-06,1.5e-05,1.3e-05,-5e-06,-6e-06,1.6e-05,-1.6e-05,-8e-06,-1.6e-05,0,1.8e-05,3e-06,2.9e-05,-9e-06,2.8e-05,-1e-06,0,1.2e-05,-1.8e-05,-1.2e-05,2e-06,-7e-06,-1.4e-05,7e-06,-5e-06,-1.3e-05,1.3e-05,0,7e-06,-9e-06
1.7e-05,4e-06,-7e-06,-2.2e-05,-1.8e-05,-1e-06,5e-06,0,2e-05,1e-05,-1.4e-05,3.5e-05,4e-06,6e-06,-4e-06,2e-06,-4e-06,3e-06,0,2.2e-05,-1.6e-05,1.2e-05,2e-05,9e-06,2.9e-05,1.2e-05,0,-3.4e-05,-1.6e-05,-2.8e-05,-2.1e-05,3.9e-05,3.2e-05,-2e-05,1e-06,2.1e-05,-2.2e-05,-4.9e-05,-1.4e-05,-7e-06,5e-06,-1.7e-05,-1e-06,-2.9e-05,1e-06,-5.4e-05,-1.9e-05,1.3e-05,-2.2e-05,8e-06,2e-06,-3e-06,1.4e-05,-7e-06,1.9e-05,2.5e-05,-1.1e-05,1.8e-05,-8e-06,3.9e-05,-1e-05,2e-06,2.7e-05,0,-2.2e-05,1.9e-05,-1.5e-05,-1.3e-05,2.2e-05,6e-06,1.3e-05,5e-05,1e-06,4e-06,-1.5e-05,-1.5e-05,-4e-06,-1e-05,6e-06,1.3e-05,6e-06,2e-06,-2.6e-05,-1.2e-05,-5e-06,-1.2e-05,2e-06,-1.4e-05,-9e-06,-9e-06,-7e-06,2e-06,-1.1e-05,4e-06,1.3e-05,-1.5e-05,9e-06,2.8e-05,-2.7e-05,2e-05,-3e-06,4e-06,-1.1e-05,-5e-06,3e-06,-3e-06,-6e-06,2e-06,-5e-06,6e-06,1.4e-05,-1.2e-05,3e-06,3.2e-05,5e-06,1e-05,0,-9e-06,-1e-06,-3e-06,7e-06
-1.6e-05,-1e-05,-1e-06,3.4e-05,1.2e-05,-1.1e-05,9e-06,1.2e-05,7e-06,1.3e-05,1e-06,1.8e-05,-6e-06,5e-06,-6e-06,7e-06,-1.9e-05,2.6e-05,-3e-06,-1.8e-05,-3e-06,1.4e-05,2.5e-05,-2e-06,-3.2e-05,-3e-05,-2e-06,2.6e-05,1.3e-05,-9e-06,-1.7e-05,-3.7e-05,-2.3e-05,1.9e-05,-3e-06,-3e-05,2.4e-05,2.9e-05,2.4e-05,-1e-06,-1e-05,-6e-06,-1.2e-05,1.5e-05,-1e-06,-3e-06,3e-06,-1.4e-05,1.2e-05,-1.7e-05,-6e-06,1.1e-05,2.8e-05,-8e-06,-1.2e-05,-2.3e-05,1.1e-05,1.2e-05,2e-06,-3.5e-05,3e-06,-1.6e-05,-2.1e-05,1e-06,-6e-06,-1.8e-05,5e-06,1.4e-05,2e-06,-7e-06,1.4e-05,-2.7e-05,-9e-06,1.2e-05,1.3e-05,-1e-06,3e-06,-1e-05,-1.4e-05,-1.2e-05,2.8e-05,-5e-06,1e-06,5e-06,9e-06,6e-06,3e-06,1.5e-05,1e-06,1.4e-05,-2e-06,3e-06,4e-06,-6e-06,-9e-06,-1.8e-05,-1.1e-05,-1.7e-05,-6e-06,-2.4e-05,-8e-06,5e-06,-5e-06,-8e-06,2e-06,-1.1e-05,5e-06,-1e-06,0,8e-06,2e-06,-1.3e-05,-1e-06,0,-2e-06,0,4e-06,2e-06,0,-2e-06,-7e-06
3.4e-05,1e-05,9e-06,6e-06,-2e-06,-2e-06,-9e-06,-1e-06,6e-06,-2.6e-05,8e-06,-1.2e-05,-4e-06,-1.1e-05,1.5e-05,-1.4e-05,1.8e-05,-3.7e-05,1e-05,1.7e-05,-3e-06,1.2e-05,7e-06,0,7e-06,-1.4e-05,-7e-06,1.3e-05,5e-06,2.2e-05,2.1e-05,3.9e-05,1.1e-05,-1.8e-05,-1e-06,-2.2e-05,-2.2e-05,4e-05,-1.6e-05,1.1e-05,1.6e-05,1e-06,8e-06,-3e-06,2e-06,1e-05,-7e-06,8e-06,3.8e-05,1e-05,-6e-06,-7e-06,-2.2e-05,-2e-06,3e-06,-1.4e-05,-2.2e-05,-8e-06,5e-06,2.7e-05,-7e-06,1.7e-05,1.1e-05,-9e-06,1.6e-05,-3e-06,-5e-06,-3e-06,-4e-06,3e-06,-4.7e-05,-5e-06,-5e-06,-1.9e-05,-1.6e-05,-8e-06,-1.5e-05,5e-06,2e-06,6e-06,-2.6e-05,4e-06,5e-06,-1e-06,-1e-06,2e-06,-3e-06,0,0,8e-06,1e-06,1e-06,-1e-06,-6e-06,-5e-06,6e-06,2e-06,5e-06,1.2e-05,4e-06,-1e-06,-1.3e-05,-2e-06,-5e-06,4e-06,-2e-05,1e-06,0,-5e-06,-2.6e-05,2e-06,9e-06,1e-06,3e-06,-1.1e-05,-1.3e-05,1e-06,-8e-06,0,2e-06,1e-06
-3.6e-05,-2e-06,-1.4e-05,-1.8e-05,-7e-06,9e-06,-2e-06,6e-06,1e-05,1.2e-05,1.4e-05,-3e-05,9e-06,2e-06,0,8e-06,-6e-06,9e-06,-1e-05,-2.2e-05,9e-06,1.8e-05,-1.2e-05,7e-06,-3e-06,1.3e-05,-1e-06,-1.9e-05,-8e-06,-9e-06,-2.2e-05,-6e-06,-5e-06,2e-06,1e-06,2.1e-05,1.9e-05,-4.8e-05,0,-2.8e-05,-9e-06,0,4e-06,3e-06,0,3e-06,-4e-06,7e-06,1.5e-05,1.1e-05,2e-06,1.4e-05,1.5e-05,8e-06,7e-06,3.3e-05,1.6e-05,-7e-06,7e-06,-1.7e-05,4e-06,-1e-05,4e-06,7e-06,-5e-06,1.2e-05,0,-2e-06,9e-06,6e-06,1.5e-05,-3e-06,9e-06,7e-06,1e-05,2e-06,2e-05,7e-06,9e-06,-5e-06,-1.6e-05,0,1e-06,8e-06,-2e-06,-2e-06,-3e-06,5e-06,-1.2e-05,-1.3e-05,4e-06,-2e-06,-5e-06,0,1.1e-05,1.6e-05,-3e-06,4e-06,1e-06,-1.7e-05,2e-06,-1.5e-05,8e-06,1.9e-05,3e-06,1.8e-05,-4e-06,-2e-06,1e-06,-8e-06,-5e-06,6e-06,0,-3.4e-05,0,7e-06,0,1e-06,0,-4e-06,2e-06
1e-06,-5e-06,1.5e-05,-1.4e-05,7e-06,5e-06,5e-06,-4e-06,-8e-06,-8e-06,1e-05,-3e-06,-3e-06,3e-06,-1e-05,3e-06,-4e-06,0,6e-06,1.6e-05,-8e-06,-2.5e-05,-1.5e-05,-2e-06,-1.1e-05,6e-06,2e-06,-7e-06,3e-06,-8e-06,-1.1e-05,-1.1e-05,1.3e-05,1.2e-05,6e-06,-1.4e-05,-2.1e-05,1.7e-05,1e-05,3.3e-05,7e-06,8e-06,-1.1e-05,3e-06,-2e-06,1.7e-05,1e-06,2e-06,-1.3e-05,-3e-06,-3e-06,-5e-06,-4e-06,2e-06,-1e-05,-2e-06,-6e-06,-2.7e-05,-8e-06,5e-06,-7e-06,1e-06,-1e-05,-4e-06,0,-1.7e-05,8e-06,5e-06,-1.2e-05,-8e-06,2.4e-05,-1e-05,-1.4e-05,-2e-05,-1e-05,1.8e-05,5e-06,-7e-06,1.2e-05,-1e-05,9e-06,5e-06,1e-06,-1.2e-05,-1e-06,-2e-06,3e-06,8e-06,2e-06,-1e-06,-1e-06,0,1e-05,3e-06,-2e-06,1.1e-05,5e-06,-1.3e-05,-3e-06,1.2e-05,-1e-06,-2e-06,-2e-06,-1.8e-05,1e-06,1.3e-05,7e-06,1e-06,2e-06,2e-06,-6e-06,2e-06,1e-06,-7e-06,-1e-06,1e-06,1e-06,0,2e-06,3e-06,-5e-06
-4e-06,6e-06,-1.4e-05,3.8e-05,-3e-06,-1e-06,-2e-06,7e-06,-5e-06,9e-06,2e-06,1.4e-05,0,4e-06,1.4e-05,-3e-06,-7e-06,1.7e-05,1.1e-05,-1.5e-05,-1e-06,-3.8e-05,-1e-06,-4e-06,1.2e-05,1.9e-05,1e-06,3e-06,4e-06,6e-06,1.7e-05,1.7e-05,-2.4e-05,-1.5e-05,-7e-06,4.3e-05,2.7e-05,1.5e-05,-1.1e-05,5e-06,-4e-06,4e-06,7e-06,-1.9e-05,1e-06,-1.5e-05,-1e-06,-8e-06,-1.4e-05,0,0,-9e-06,-1.6e-05,-4e-06,9e-06,-2.2e-05,3e-06,3.3e-05,-1e-06,2e-06,0,5e-06,5e-06,2e-06,5e-06,1.4e-05,-7e-06,-8e-06,4e-06,7e-06,-1e-06,2.3e-05,9e-06,5e-06,8e-06,-1.4e-05,-3e-06,1e-06,-1.9e-05,0,-1e-06,-1e-06,0,8e-06,3e-06,9e-06,0,-2e-06,4e-06,0,5e-06,0,-7e-06,-4e-06,-3e-06,-6e-06,-5e-06,1.4e-05,-7e-06,1e-06,4e-06,-8e-06,-1e-06,3e-06,2e-06,4e-06,-5e-06,0,1e-06,6e-06,4e-06,-4e-06,0,2e-05,0,-1e-06,-2e-06,-1e-06,0,2e-06,2e-06
2.2e-05,-5e-06,7e-06,-6e-06,-3e-06,-5e-06,-5e-06,6e-06,-2.4e-05,-1.2e-05,-6e-06,3e-06,-3e-06,-6e-06,-2e-06,5e-06,1.2e-05,-2.2e-05,-1.8e-05,2e-05,-1e-06,3.2e-05,-4e-06,3e-06,4e-06,-1.7e-05,4e-06,1e-05,-4e-06,-1e-06,2e-06,-1.7e-05,2.3e-05,1.6e-05,-2e-06,-1.2e-05,-1.9e-05,-7e-06,6e-06,-3.1e-05,-7e-06,1e-06,1e-05,1.2e-05,-1e-06,7e-06,5e-06,7e-06,-6e-06,-6e-06,2e-06,-2e-06,-1.2e-05,-4e-06,-9e-06,6e-06,4e-06,3e-06,-1e-06,-2e-06,1e-06,-6e-06,-5e-06,1e-06,1.1e-05,0,5e-06,6e-06,3e-06,-8e-06,-2.7e-05,-9e-06,9e-06,-1.1e-05,-5e-06,2e-06,1e-05,-4e-06,1.3e-05,-9e-06,1.6e-05,2e-06,2e-06,1e-06,2e-06,-1.3e-05,1e-06,8e-06,2e-06,4e-06,-1e-06,1e-06,4e-06,-3e-06,8e-06,-1.2e-05,3e-06,-9e-06,8e-06,1.2e-05,1e-06,7e-06,-3e-06,0,-3e-06,-1.3e-05,-2e-06,2e-06,-3e-06,-1e-05,0,-2e-06,-2e-06,1e-05,3e-06,1e-06,-3e-06,7e-06,-1e-06,-4e-06,-1e-06
-1.7e-05,0,-1e-06,-3.2e-05,8e-06,-3e-06,5e-06,6e-06,0,3e-06,-1e-05,6e-06,0,2e-06,-8e-06,-1.4e-05,2e-06,1.8e-05,1e-06,-1.4e-05,2e-06,7e-06,5e-06,-3e-06,-7e-06,-1.9e-05,1e-06,-1.5e-05,-4e-06,-7e-06,-1.1e-05,1e-06,-1.3e-05,-1.6e-05,4e-06,-2.1e-05,1.8e-05,-2.9e-05,-1e-06,-6e-06,1.3e-05,-4e-06,-1.7e-05,-6e-06,1e-06,-2.2e-05,0,-3e-06,1.1e-05,1.1e-05,-1e-06,-3e-06,1e-05,-2e-06,5e-06,1.4e-05,1e-06,-3e-06,5e-06,-1e-06,-8e-06,4e-06,3e-06,-2e-06,-1.2e-05,-6e-06,-7e-06,1e-06,-1.1e-05,3e-06,1.2e-05,-1e-06,-1.5e-05,6e-06,4e-06,-2e-06,-9e-06,1e-06,-1.1e-05,2e-06,3e-06,0,-6e-06,0,-4e-06,1.1e-05,-1e-06,-6e-06,1e-06,4e-06,0,-1e-06,-1e-06,-4e-06,0,-6e-06,-1e-06,3e-06,1.2e-05,-3e-06,5e-06,-8e-06,4e-06,1e-05,0,-1.4e-05,3e-06,-1e-06,-5e-06,4e-06,2e-06,2e-06,2e-06,1.3e-05,3e-06,-7e-06,4e-06,-5e-06,0,3e-06,-3e-06
1.8e-05,4e-06,-4e-06,5e-06,-3e-06,5e-06,0,4e-06,3e-06,4e-06,-6e-06,-2e-06,5e-06,1e-06,8e-06,1e-05,-4e-06,1e-05,1.1e-05,1.9e-05,-3e-06,-4e-06,3e-06,-4e-06,6e-06,1.4e-05,0,-1.3e-05,6e-06,1e-05,-1e-06,4e-06,5e-06,1.2e-05,1e-06,1.2e-05,-1.5e-05,3.1e-05,-8e-06,1.6e-05,-1.3e-05,-3e-06,1.3e-05,4e-06,0,2e-06,6e-06,3e-06,8e-06,-1e-05,2e-06,1.3e-05,-8e-06,3e-06,-3e-06,-8e-06,-5e-06,1e-06,-2e-06,6e-06,0,-6e-06,2e-06,-2e-06,-6e-06,8e-06,8e-06,-5e-06,9e-06,2e-06,1.5e-05,-6e-06,1.3e-05,3e-06,0,1e-06,-4e-06,-4e-06,4e-06,-3e-06,-2.1e-05,-2e-06,3e-06,-5e-06,1e-06,-9e-06,0,2e-06,6e-06,-8e-06,-1e-06,0,-2e-06,5e-06,-8e-06,0,2e-06,5e-06,-3e-06,-3e-06,3e-06,2e-06,2e-06,-1.3e-05,-3e-06,8e-06,-1e-06,1e-06,3e-06,1.4e-05,-3e-06,-2e-06,-3e-06,-2.7e-05,-1e-06,7e-06,2e-06,6e-06,0,2e-06,2e-06
-1.8e-05,-6e-06,6e-06,2e-05,-2e-06,4e-06,-3e-06,-1e-06,-1.4e-05,-5e-06,0,-1.7e-05,-5e-06,-1e-06,-2e-06,2e-06,-6e-06,-2.5e-05,-9e-06,-1.5e-05,-2e-06,1.7e-05,1.2e-05,2e-06,-7e-06,4e-06,3e-06,1.4e-05,1e-06,0,1e-05,-5e-06,-7e-06,-3e-06,-1e-06,-2.2e-05,7e-06,-6e-06,7e-06,8e-06,9e-06,-4e-06,1e-06,-3e-06,1e-06,1.5e-05,-1e-06,-4e-06,1e-06,-6e-06,0,-3e-06,9e-06,2e-06,2e-06,-1.5e-05,8e-06,-2.3e-05,-3e-06,-6e-06,-2e-06,6e-06,-3e-06,4e-06,1.4e-05,-5e-06,-7e-06,1e-06,0,-3e-06,-1.6e-05,-8e-06,2e-06,-2e-06,-2e-06,5e-06,-1e-06,5e-06,-8e-06,-1e-06,-1e-06,3e-06,-1e-06,-2e-06,1e-06,2e-06,1e-06,-1e-06,-3e-06,-1e-06,-1e-06,0,3e-06,1e-06,5e-06,8e-06,-3e-06,-1.1e-05,-8e-06,-6e-06,2e-06,0,-1e-06,7e-06,-1e-06,1.1e-05,-1e-06,-1e-06,0,0,-4e-06,-3e-06,0,-1e-06,0,1e-06,-1e-06,-5e-06,0,-4e-06,-2e-06
1.3e-05,3e-06,-7e-06,8e-06,6e-06,-2e-06,1e-06,2e-06,1.6e-05,0,8e-06,-3e-06,1e-06,-3e-06,-5e-06,-7e-06,6e-06,1.5e-05,3e-06,1.6e-05,2e-06,-2.1e-05,-1e-06,0,-4e-06,9e-06,-7e-06,-8e-06,-7e-06,-8e-06,-1.4e-05,-7e-06,1.5e-05,-5e-06,-1e-06,2.7e-05,-5e-06,-1e-05,-2e-06,-1.2e-05,-4e-06,-1e-06,-6e-06,-5e-06,0,-4e-06,1e-06,3e-06,-1.5e-05,8e-06,2e-06,2e-06,1.1e-05,-2e-06,-2e-06,1.6e-05,-5e-06,1.2e-05,2e-06,2e-06,-3e-06,-1e-06,1e-06,-3e-06,-9e-06,-6e-06,5e-06,2e-06,-6e-06,4e-06,-9e-06,1.4e-05,-1.3e-05,1e-05,2e-06,0,-6e-06,-4e-06,9e-06,8e-06,2e-06,-2e-06,5e-06,9e-06,0,4e-06,-2e-06,-2e-06,-5e-06,2e-06,-4e-06,0,-4e-06,-4e-06,0,1e-05,0,1.1e-05,-8e-06,-5e-06,3e-06,5e-06,-3e-06,0,0,4e-06,2e-06,0,-1e-06,-3e-06,1e-06,-3e-06,1e-06,-1e-06,2e-06,-5e-06,-1e-06,2e-06,0,1e-06,0
-1.3e-05,1e-06,5e-06,-2.1e-05,-4e-06,-4e-06,3e-06,0,1e-05,4e-06,9e-06,1.5e-05,-1e-06,2e-06,2e-06,4e-06,5e-06,-5e-06,3e-06,-1.5e-05,1e-06,-1.6e-05,-5e-06,-2e-06,8e-06,-8e-06,8e-06,4e-06,1e-06,9e-06,-8e-06,1.8e-05,-1.8e-05,9e-06,1e-06,-2e-06,1e-06,7e-06,-4e-06,1.4e-05,0,2e-06,2e-06,7e-06,1e-06,9e-06,1e-06,-5e-06,-1.4e-05,-5e-06,-2e-06,-3e-06,1e-06,-2e-06,3e-06,8e-06,0,1e-05,0,2e-06,0,-4e-06,-1e-06,1e-06,-6e-06,1.2e-05,-3e-06,-1e-06,6e-06,-3e-06,1.5e-05,-3e-06,1.4e-05,-9e-06,-3e-06,-8e-06,5e-06,1e-06,-1.7e-05,1e-06,1.3e-05,1e-06,-5e-06,-2e-06,0,-6e-06,1e-06,2e-06,-1e-06,5e-06,2e-06,1e-06,3e-06,-1e-06,-6e-06,-1e-06,4e-06,-7e-06,5e-06,4e-06,4e-06,8e-06,-1e-06,3e-06,-1e-06,-1.4e-05,-2e-06,0,2e-06,2e-06,1e-06,2e-06,-3e-06,2e-05,-2e-06,2e-06,1e-06,-3e-06,0,0,1e-06
1.4e-05,-4e-06,-2e-06,-5e-06,-2e-06,-1e-06,-3e-06,2e-06,4e-06,-4e-06,6e-06,8e-06,1e-06,2e-06,0,-4e-06,-2e-06,1e-06,-3e-06,1.7e-05,0,1.2e-05,-1.6e-05,2e-06,-3e-06,-1.5e-05,-1e-05,-1.6e-05,5e-06,2e-06,1.4e-05,-2.1e-05,1.3e-05,-1.2e-05,1e-06,-6e-06,2e-06,1.1e-05,5e-06,-1.4e-05,5e-06,2e-06,5e-06,-6e-06,0,-1.1e-05,-4e-06,0,2e-06,0,2e-06,-2e-06,-5e-06,0,-3e-06,-2e-05,2e-06,0,3e-06,-2e-06,-1e-06,5e-06,0,0,8e-06,-9e-06,1e-06,-2e-06,-5e-06,2e-06,1.2e-05,2e-06,-6e-06,1.2e-05,2e-06,4e-06,0,-4e-06,1e-05,3e-06,7e-06,1e-06,2e-06,4e-06,0,4e-06,1e-06,-6e-06,-2e-06,-2e-06,-2e-06,0,-1e-06,3e-06,2e-06,-7e-06,-2e-06,0,9e-06,0,-1e-06,4e-06,3e-06,-1e-05,2e-06,-7e-06,2e-06,0,-3e-06,6e-06,2e-06,1e-06,2e-06,6e-06,-2e-06,0,-1e-06,1e-06,0,-2e-06,-2e-06
-1.8e-05,4e-06,-1e-06,1.9e-05,4e-06,2e-06,-1e-06,-1e-06,4e-06,5e-06,-2e-06,-9e-06,2e-06,-1e-06,-2e-06,8e-06,-7e-06,-1.5e-05,2e-06,-1.4e-05,-2e-06,1.2e-05,-2e-06,2e-06,5e-06,8e-06,5e-06,1.5e-05,-3e-06,-9e-06,-1e-06,1.8e-05,-6e-06,1.4e-05,-1e-06,1.4e-05,-6e-06,-9e-06,-4e-06,2e-06,-7e-06,1e-06,-1e-05,9e-06,0,-4e-06,2e-06,1e-06,1.5e-05,1e-06,-2e-06,3e-06,5e-06,1e-06,2e-06,3e-06,-3e-06,-4e-06,-3e-06,-2e-06,-4e-06,-4e-06,0,-1e-06,1e-06,3e-06,0,2e-06,0,-2e-06,-1.6e-05,-4e-06,-7e-06,-8e-06,-3e-06,0,2e-06,4e-06,-6e-06,6e-06,-1.6e-05,-1e-06,-1e-06,-8e-06,1e-06,-1e-06,-2e-06,2e-06,0,-5e-06,0,0,0,1e-06,4e-06,-7e-06,-1e-06,8e-06,-1e-06,8e-06,2e-06,1e-06,1e-06,9e-06,1e-06,3e-06,-1e-06,0,1e-06,-7e-06,-1e-06,-2e-06,-1e-06,-1.5e-05,0,1e-06,0,0,0,1e-06,1e-06
1.9e-05,-1e-06,2e-06,-7e-06,-2e-06,2e-06,3e-06,-2e-06,-7e-06,-7e-06,-7e-06,-1.1e-05,-3e-06,-1e-06,0,-5e-06,1e-06,2.2e-05,-3e-06,1.5e-05,1e-06,3e-06,3e-06,-1e-06,2e-06,8e-06,4e-06,-3e-06,-3e-06,5e-06,-8e-06,-3e-06,4e-06,-1e-05,-1e-06,-2.7e-05,7e-06,-6e-06,-2e-06,8e-06,7e-06,-1e-06,5e-06,-8e-06,0,-3e-06,-4e-06,3e-06,1.4e-05,6e-06,0,-5e-06,-9e-06,0,-1e-06,1.5e-05,-1e-06,-5e-06,1e-06,6e-06,0,3e-06,2e-06,0,-7e-06,6e-06,0,1e-06,4e-06,1e-06,-3e-06,-8e-06,1.1e-05,7e-06,3e-06,-1e-06,5e-06,-3e-06,6e-06,0,-5e-06,1e-06,-1e-06,-1e-06,0,-2e-06,1e-06,-3e-06,2e-06,3e-06,1e-06,0,2e-06,-2e-06,-5e-06,0,0,-1e-05,-4e-06,-5e-06,1e-06,-1e-06,-1e-06,-4e-06,1e-06,1.4e-05,-1e-06,0,1e-06,-6e-06,-2e-06,1e-06,-1e-06,-1.3e-05,0,2e-06,2e-06,1e-06,0,0,-1e-06
-9e-06,-2e-06,-2e-06,-1.1e-05,-1e-06,-1e-06,-1e-06,-2e-06,6e-06,7e-06,-8e-06,3e-06,1e-06,1e-06,2e-06,1e-06,5e-06,-4e-06,0,-1.5e-05,2e-06,-3e-06,1.2e-05,1e-06,-6e-06,6e-06,-6e-06,-6e-06,2e-06,1e-06,1e-06,-5e-06,-1e-05,4e-06,1e-06,1.7e-05,-9e-06,1e-05,5e-06,-1e-06,-5e-06,-2e-06,5e-06,2e-06,0,4e-06,0,0,-1e-06,-2e-06,1e-06,3e-06,-6e-06,0,-1e-06,-1e-05,2e-06,-6e-06,1e-06,-7e-06,-3e-06,-2e-06,-1e-06,1e-06,3e-06,-1.1e-05,2e-06,-4e-06,-5e-06,-1e-06,1e-05,8e-06,-8e-06,-2e-06,-2e-06,5e-06,-4e-06,0,-9e-06,2e-06,-1e-06,-2e-06,2e-06,2e-06,-1e-06,4e-06,1e-06,0,4e-06,3e-06,0,0,-2e-06,-3e-06,1e-06,4e-06,2e-06,9e-06,-3e-06,4e-06,-2e-06,1e-06,-2e-06,3e-06,0,2e-06,1e-06,0,1e-06,4e-06,1e-06,-3e-06,2e-06,-3e-06,1e-06,-7e-06,-1e-06,2e-06,0,0,-1e-06
7e-06,3e-06,1e-06,3e-06,3e-06,-2e-06,-2e-06,-2e-06,-5e-06,-3e-06,-4e-06,1e-05,0,1e-06,-2e-06,0,0,-1.5e-05,6e-06,1.3e-05,0,-7e-06,3e-06,1e-06,1e-06,-9e-06,6e-06,3e-06,2e-06,-9e-06,3e-06,5e-06,1.5e-05,1e-06,0,-3e-06,1.1e-05,-7e-06,-4e-06,-9e-06,2e-06,-2e-06,-1.1e-05,4e-06,0,7e-06,0,-2e-06,-1.1e-05,-3e-06,-2e-06,2e-06,-1e-06,0,2e-06,-1.1e-05,-3e-06,1.2e-05,0,5e-06,-2e-06,1e-06,-1e-06,-2e-06,8e-06,8e-06,-4e-06,4e-06,4e-06,0,3e-06,-1e-06,1e-06,-5e-06,1e-06,-6e-06,3e-06,-2e-06,1.3e-05,-3e-06,9e-06,-1e-06,0,3e-06,0,-1e-06,-3e-06,0,1e-06,-2e-06,0,0,1e-06,0,4e-06,6e-06,-2e-06,-4e-06,5e-06,-1e-05,-1e-06,0,1e-06,-7e-06,0,-1e-05,-1e-06,0,-2e-06,1e-06,0,-2e-06,-2e-06,1.7e-05,2e-06,4e-06,-1e-06,-2e-06,0,1e-06,0
-1.4e-05,-1e-06,0,1.4e-05,-2e-06,-1e-06,2e-06,-1e-06,-5e-06,0,1e-06,2e-06,0,-2e-06,0,-1e-06,-5e-06,2e-05,-5e-06,-1.6e-05,0,-1.2e-05,1e-06,-2e-06,-2e-06,-1.1e-05,-1e-06,-3e-06,-3e-06,6e-06,-1.1e-05,1e-06,-1.3e-05,-7e-06,0,-3e-06,-1.1e-05,1e-06,1e-06,-5e-06,1e-06,0,6e-06,-3e-06,0,-1e-06,-1e-06,0,-9e-06,5e-06,1e-06,2e-06,1e-06,0,-4e-06,1.4e-05,1e-06,7e-06,0,0,-1e-06,1e-06,1e-06,1e-06,-8e-06,-2e-06,4e-06,-1e-06,0,1e-06,-1.5e-05,2e-06,3e-06,5e-06,-1e-06,-1e-06,-1e-06,4e-06,-1.3e-05,-1e-06,9e-06,0,1e-06,4e-06,1e-06,-3e-06,1e-06,-1e-06,0,-2e-06,0,0,0,2e-06,-3e-06,3e-06,0,-3e-06,5e-06,6e-06,-2e-06,0,1e-06,9e-06,0,-1e-05,0,0,0,-4e-06,0,2e-06,0,7e-06,0,1e-06,0,3e-06,0,-1e-06,-1e-06
1.7e-05,0,-2e-06,2e-06,-1e-06,1e-06,1e-06,-3e-06,4e-06,2e-06,5e-06,-4e-06,1e-06,1e-06,2e-06,6e-06,0,-9e-06,-3e-06,1.3e-05,0,3e-06,-7e-06,-1e-06,-2e-06,6e-06,-7e-06,1e-05,-1e-06,4e-06,-3e-06,-1.2e-05,7e-06,1.1e-05,0,1.6e-05,1.2e-05,-4e-06,3e-06,1.2e-05,-4e-06,1e-06,2e-06,7e-06,0,0,3e-06,3e-06,3e-06,-2e-06,0,0,1e-06,1e-06,4e-06,5e-06,3e-06,-1.1e-05,-1e-06,-5e-06,-3e-06,-4e-06,0,0,-4e-06,-5e-06,-4e-06,-3e-06,-4e-06,-3e-06,1e-06,2e-06,-4e-06,-1.1e-05,0,5e-06,-4e-06,-3e-06,7e-06,-1e-06,-7e-06,-1e-06,-2e-06,-6e-06,-1e-06,6e-06,1e-06,4e-06,-2e-06,1e-06,0,0,0,-2e-06,-2e-06,-3e-06,0,7e-06,-4e-06,-6e-06,-3e-06,-6e-06,0,-5e-06,-1e-06,4e-06,1e-06,0,1e-06,-1e-06,0,-1e-06,1e-06,-2e-06,-1e-06,-2e-06,1e-06,-4e-06,0,-1e-06,0
