-0.001699,-0.021435,-0.029417,-0.008255,-0.004376,-0.070298,-0.150093,-0.149992,-0.168965,-0.178443,-0.166364,-0.149023,-0.117107,-0.08838,-0.079507,-0.031057,-0.00635,-0.001914,-0.00185,-0.001079,-0.00086,-0.000831,-0.000984,-0.000685,-0.000408,-0.000379,-0.000319,-0.000205
0.000499,0.009465,0.015055,0.005871,0.004558,0.081384,0.184666,0.187863,0.186096,0.174792,0.181891,0.178065,0.146699,0.106856,0.101408,0.034946,0.006627,0.002119,0.002125,0.001284,0.001056,0.000842,0.000686,0.000741,0.000517,0.000401,0.000268,0.000142
0.000447,0.006161,0.007341,0.000307,-6.1e-05,0.002549,-0.008814,-0.026988,0.000456,0.009272,-0.001596,-0.012311,-0.015879,-0.01381,-0.012749,-0.000879,0.000195,3e-06,0.000124,-1.4e-05,-4.5e-05,3e-05,0.000104,3.9e-05,-4.5e-05,1.6e-05,0.000114,0.000105
-0.000152,-0.003191,-0.005905,-0.003123,-0.004265,-0.076193,-0.166384,-0.157061,-0.172946,-0.175016,-0.178048,-0.164365,-0.134019,-0.096041,-0.092159,-0.034659,-0.00696,-0.002265,-0.00219,-0.001281,-0.001021,-0.000817,-0.000661,-0.000767,-0.000475,-0.000421,-0.00031,-0.000177
0.000257,0.002709,0.005752,0.003585,0.003252,0.05573,0.137443,0.152877,0.131716,0.126337,0.142865,0.146989,0.125499,0.095653,0.088974,0.029261,0.005551,0.00166,0.001501,0.001024,0.000854,0.000773,0.000768,0.000556,0.000393,0.000274,7.4e-05,-2.5e-05
-0.000654,-0.008274,-0.010627,-0.003246,0.00103,0.029951,0.052143,0.024592,0.063465,0.08191,0.071267,0.051156,0.037129,0.022147,0.02319,0.014115,0.002993,0.000875,0.000964,0.000452,0.000302,0.000163,8.6e-05,0.000311,0.000127,2e-04,0.000221,0.000147
-0.000328,-0.002501,-0.004507,-0.002066,-0.003411,-0.070623,-0.159083,-0.1557,-0.161849,-0.169611,-0.186873,-0.1797,-0.14599,-0.107202,-0.101507,-0.037873,-0.007428,-0.002066,-0.001998,-0.001166,-0.000929,-0.000884,-0.000941,-0.000713,-0.000414,-0.000343,-0.000166,-2.4e-05
0.001223,0.015349,0.019677,0.006189,0.001265,0.021318,0.071061,0.10017,0.053786,0.031522,0.061768,0.080397,0.074329,0.057334,0.053909,0.011705,0.001625,0.000557,0.000469,0.00035,0.000359,0.000409,0.000418,0.000202,0.000207,9.7e-05,-7.3e-05,-0.000105
4.7e-05,-0.002235,-0.003815,-0.001841,0.001477,0.044103,0.086926,0.060248,0.095447,0.117916,0.123559,0.104183,0.075779,0.047386,0.047507,0.024269,0.005192,0.00134,0.001389,0.000698,0.000517,0.000515,0.000596,0.000494,0.00018,0.000203,0.000145,4.3e-05
-0.001084,-0.013572,-0.016731,-0.004323,-0.002393,-0.047191,-0.122867,-0.131875,-0.109388,-0.107236,-0.140855,-0.14726,-0.125777,-0.089739,-0.088615,-0.027148,-0.00457,-0.00136,-0.001366,-0.000795,-0.000692,-0.000683,-0.000631,-0.000495,-0.00029,-0.00023,-2.8e-05,8e-05
0.000188,0.004763,0.007532,0.003424,0.000147,-0.003903,0.012609,0.048465,0.000828,-0.029148,-0.003611,0.020881,0.030783,0.033233,0.02959,0.000196,-0.000565,-3.6e-05,-0.000276,-4.3e-05,6.2e-05,7.5e-05,-5e-06,-9.6e-05,6.2e-05,-1.3e-05,-6.7e-05,-4.8e-05
0.000608,0.007517,0.009791,0.00156,0.001905,0.040686,0.09226,0.069407,0.083641,0.108964,0.125552,0.114724,0.094067,0.059279,0.062824,0.026535,0.00487,0.001289,0.001358,0.000714,0.000547,0.00048,0.000415,0.000468,0.000176,0.000165,4.2e-05,-7.2e-05
-0.00023,-0.003736,-0.005785,-0.002295,-0.001138,-0.024098,-0.072806,-0.096469,-0.065942,-0.047124,-0.098949,-0.116883,-0.10378,-0.080113,-0.078501,-0.020797,-0.003366,-0.000872,-0.000691,-0.00043,-0.000442,-0.000459,-0.000423,-0.000256,-0.000189,-0.000138,-1.6e-05,5.2e-05
-0.000195,-0.003051,-0.005186,-0.000163,-0.000715,-0.018222,-0.02605,0.020437,-0.015855,-0.058448,-0.045654,-0.022766,-0.010496,0.006025,-0.000184,-0.011946,-0.002839,-0.000621,-0.000728,-0.000369,-0.000185,-8e-05,-1.5e-05,-0.00022,4e-06,-1.8e-05,6e-06,7.2e-05
-0.000107,-0.000936,0.000639,0.000367,0.001503,0.031452,0.074818,0.068206,0.071713,0.078331,0.126448,0.128094,0.103852,0.069464,0.072376,0.027877,0.004991,0.001129,0.001109,0.000612,0.000523,0.000481,0.000482,0.000427,0.000174,0.000174,4.7e-05,-6.2e-05
0.000141,0.003097,0.00575,0.000945,-8.6e-05,-0.003766,-0.027577,-0.069111,-0.03855,0.00211,-0.040554,-0.064571,-0.065429,-0.057556,-0.055902,-0.007448,-0.000474,-0.000358,-0.000143,-6e-05,-0.000169,-0.000236,-0.000256,-6.3e-05,-0.00011,-9.8e-05,-7e-05,-5.5e-05
0.000349,0.00294,0.00063,-6.2e-05,-0.001662,-0.025599,-0.045263,-0.006223,-0.032673,-0.063717,-0.079572,-0.062648,-0.039563,-0.013703,-0.02013,-0.018545,-0.003643,-0.000662,-0.00086,-0.000502,-0.000345,-0.000269,-0.000271,-0.000363,-6.6e-05,-6.5e-05,4e-06,8.8e-05
-0.000122,-0.002626,-0.004284,-0.001179,0.000552,0.016191,0.047246,0.059619,0.052029,0.031693,0.088071,0.103152,0.091071,0.065704,0.070388,0.020075,0.00293,0.00086,0.00076,0.000437,0.00039,0.000388,0.000361,0.00028,0.000127,0.000125,9.3e-05,1.8e-05
-0.000295,-0.001517,0.000513,0.000484,0.001073,0.013193,0.011828,-0.037465,-0.013892,0.024441,0.000692,-0.024932,-0.037096,-0.042362,-0.038307,0.00064,0.000672,-9.4e-05,0.000238,0.000149,4e-06,-8.4e-05,-9.2e-05,9.9e-05,-6.6e-05,-7.7e-05,-9e-05,-0.000107
