0.333509,0.376899,0.130977,0.069751,0.148711,0.252088,0.321034,0.284024,0.285422,0.430634,0.53036,0.515167,0.535805,0.612429,0.724622,0.718349,0.629203,0.59143,0.491086,0.370091,0.28423,0.20752,0.1356,0.101462,0.081765,0.068786,0.056869,0.04561
0.360535,0.406188,0.143426,0.079077,0.168883,0.301496,0.396771,0.344995,0.340095,0.497185,0.610044,0.605116,0.619636,0.69839,0.829062,0.810718,0.682775,0.632359,0.531795,0.406863,0.314831,0.23294,0.155,0.116086,0.093006,0.078444,0.066415,0.055203
0.390938,0.437241,0.158346,0.090883,0.194316,0.381707,0.532612,0.45423,0.444021,0.624816,0.752194,0.773566,0.780663,0.837675,0.968646,0.932428,0.752697,0.669144,0.562637,0.442239,0.344087,0.259501,0.181827,0.137243,0.107794,0.090681,0.079826,0.070955
0.405433,0.443334,0.161178,0.090909,0.192474,0.435902,0.665522,0.566309,0.554091,0.769051,0.908373,0.973143,0.980151,0.983113,1.064803,1.024181,0.837679,0.686269,0.542192,0.42957,0.322835,0.252281,0.196598,0.149567,0.112984,0.095302,0.088574,0.084485
0.431275,0.449706,0.158856,0.082805,0.172572,0.490045,0.840017,0.710582,0.670845,0.954462,1.117696,1.224315,1.260185,1.207328,1.225957,1.185999,0.996607,0.74801,0.529007,0.407232,0.285916,0.233158,0.207048,0.161136,0.120522,0.104093,0.100168,0.097841
0.484942,0.492828,0.171813,0.08228,0.166782,0.592833,1.105315,0.917724,0.805635,1.209961,1.432294,1.612258,1.786048,1.708637,1.633316,1.552773,1.278414,0.894079,0.573851,0.410369,0.279936,0.230048,0.210593,0.168634,0.134901,0.122384,0.118562,0.118621
0.609628,0.634698,0.216542,0.100102,0.20513,0.774931,1.484655,1.209246,1.075931,1.845426,2.284775,2.548483,2.891912,2.825036,2.62888,2.383132,1.902674,1.346653,0.844331,0.525254,0.343138,0.274396,0.235407,0.193995,0.168636,0.153378,0.149373,0.155666
0.780381,0.848046,0.28226,0.126826,0.276597,1.038888,2.020446,1.648448,1.654156,3.262052,4.216864,4.573688,5.009301,4.924514,4.61196,4.093322,3.296599,2.434756,1.533592,0.883367,0.562432,0.443589,0.352999,0.294766,0.257177,0.209846,0.194883,0.205059
0.977518,1.089201,0.354415,0.158917,0.365186,1.350567,2.675508,2.235042,2.672776,5.745519,7.491524,7.906257,8.379875,8.207394,7.763885,7.034089,5.896378,4.407816,2.725909,1.50855,0.956606,0.77839,0.602148,0.497584,0.423325,0.309663,0.265979,0.26846
1.155784,1.284252,0.409345,0.187919,0.449557,1.67793,3.381376,2.900913,4.054709,9.130443,11.870383,12.209427,12.546756,12.20418,11.706639,11.132993,9.752127,7.143402,4.286976,2.340666,1.504634,1.249772,0.946948,0.771591,0.651878,0.461202,0.381854,0.352317
1.298447,1.41873,0.445861,0.203264,0.495179,2.029243,4.198164,3.650731,5.378957,12.338294,16.127295,16.208668,16.007394,15.467968,15.102387,15.235763,13.8834,9.778842,5.657701,3.135234,2.074285,1.713134,1.275746,1.038972,0.888228,0.632006,0.524316,0.452756
1.362492,1.448639,0.453177,0.201818,0.468493,2.207842,4.789407,4.224573,5.872752,13.510087,17.991758,17.742555,16.835525,16.268989,16.13637,17.144848,16.043676,10.741465,5.942359,3.413103,2.366288,1.907144,1.405434,1.161771,1.00209,0.72929,0.627662,0.52388
1.28552,1.31368,0.420089,0.203133,0.405107,2.078413,4.61263,4.043376,4.963577,11.450106,15.694323,15.265249,14.208901,14.06697,14.041178,15.169829,14.241202,9.067167,4.785191,2.872001,2.129854,1.652125,1.204965,1.019557,0.872601,0.657182,0.599044,0.49605
1.280094,1.275029,0.408844,0.208022,0.363418,1.711823,3.637503,3.065934,3.202917,7.340578,10.375087,10.226939,9.948051,10.192361,9.635395,9.916017,9.164841,5.707996,3.001707,1.867911,1.474149,1.081527,0.768401,0.667471,0.557659,0.442532,0.428651,0.36262
1.580378,1.598161,0.495836,0.202086,0.353711,1.364266,2.563801,1.995038,1.709028,3.62045,5.338438,5.549591,5.789125,6.000676,5.115943,4.694334,4.153093,2.652489,1.503894,0.969832,0.784065,0.545617,0.388551,0.339285,0.270655,0.233779,0.226912,0.197951
2.189659,2.22639,0.653867,0.189046,0.377149,1.253394,2.044285,1.475425,1.054285,1.879368,2.869588,2.998759,3.119879,3.268643,2.73659,2.183837,1.717211,1.193073,0.712909,0.46831,0.376944,0.256274,0.183867,0.157133,0.131124,0.125563,0.114742,0.10785
2.953389,2.956666,0.839109,0.184754,0.412994,1.129794,1.691341,1.350736,1.122829,1.705625,2.453765,2.490876,2.443533,2.343257,1.93761,1.702415,1.450845,0.986087,0.509064,0.317329,0.232145,0.162313,0.115325,0.100237,0.097383,0.095953,0.099094,0.106646
3.805857,3.64335,0.980151,0.199676,0.450069,1.014833,1.471215,1.408461,1.408406,1.97699,2.539561,2.523366,2.432052,2.092063,1.737134,1.957867,2.040374,1.338891,0.54862,0.313501,0.2351,0.166324,0.105356,0.094963,0.101733,0.097982,0.107592,0.120112
4.542231,4.061734,0.982141,0.199431,0.433005,1.040568,1.617618,1.608484,1.649369,2.276557,2.732794,2.819536,2.840228,2.376368,2.11334,2.684564,2.971179,1.911485,0.718502,0.410306,0.315206,0.215692,0.12773,0.114201,0.117987,0.102108,0.107191,0.118298
5.229562,4.485128,0.959433,0.1759,0.345859,1.025367,1.760109,1.688895,1.730974,2.44475,2.934459,3.272214,3.365002,2.774403,2.65796,3.488452,3.797917,2.390142,0.906998,0.552464,0.423461,0.27837,0.161374,0.13815,0.132261,0.101531,0.099617,0.103785
5.545713,4.736202,0.942709,0.148897,0.269307,0.936015,1.667882,1.517735,1.628746,2.49829,3.10132,3.594318,3.559346,2.872827,3.044082,4.011853,4.089779,2.48792,1.020042,0.666191,0.493255,0.309966,0.185635,0.150428,0.130139,0.093371,0.089405,0.089736
4.960409,4.273373,0.853373,0.132587,0.247593,0.784894,1.331806,1.237282,1.440348,2.308604,3.024442,3.484968,3.210522,2.712732,3.245918,4.013059,3.655834,2.149832,1.009843,0.710087,0.493536,0.294446,0.19037,0.140064,0.111577,0.084535,0.083484,0.08558
3.584042,3.110555,0.661893,0.129726,0.233045,0.550944,0.861768,0.888162,1.10889,1.859227,2.789409,3.153916,2.624948,2.497957,3.257667,3.484775,2.705414,1.587378,0.917361,0.691015,0.432369,0.260412,0.194376,0.131088,0.107962,0.096839,0.089504,0.084964
2.417867,2.123449,0.475489,0.130228,0.208452,0.448276,0.697968,0.681792,0.85799,1.589757,2.565957,2.816143,2.327574,2.409702,3.102794,2.835235,1.726393,1.00393,0.732311,0.602886,0.37419,0.254117,0.212683,0.14083,0.12882,0.137801,0.119165,0.096794
1.770903,1.670019,0.418192,0.124412,0.178578,0.488104,0.794293,0.676284,0.886314,1.712243,2.451981,2.605932,2.451848,2.40473,2.790636,2.445365,1.310578,0.746183,0.548168,0.471642,0.327769,0.247037,0.221727,0.15835,0.164636,0.194525,0.162895,0.119224
1.370037,1.404987,0.396974,0.107994,0.139068,0.523223,0.897358,0.721642,0.95612,1.733738,2.194826,2.372681,2.504888,2.28207,2.333284,2.092828,1.170811,0.642032,0.412625,0.365474,0.286434,0.21264,0.206442,0.168421,0.19417,0.237746,0.193523,0.133032
1.069436,1.153718,0.34072,0.091335,0.118409,0.513024,0.881855,0.674006,0.883065,1.457522,1.826861,2.076588,2.165043,1.87447,1.701932,1.503492,0.985973,0.616167,0.357754,0.310693,0.250663,0.191459,0.197108,0.171505,0.195681,0.237423,0.192569,0.134435
0.731787,0.820545,0.253411,0.076654,0.111199,0.453253,0.753018,0.585774,0.817557,1.214066,1.558438,1.731782,1.61008,1.396699,1.277499,1.140636,0.879749,0.630161,0.337349,0.278684,0.232206,0.188257,0.197867,0.170233,0.163581,0.198414,0.170669,0.125503
0.521453,0.599225,0.20437,0.069451,0.10753,0.395603,0.658474,0.569951,0.945303,1.33338,1.470045,1.317776,1.091802,1.11443,1.255939,1.287667,0.995414,0.657673,0.323297,0.253832,0.219766,0.175729,0.175074,0.146597,0.116192,0.143962,0.135082,0.104767
0.42571,0.494751,0.192768,0.065606,0.100936,0.353222,0.620252,0.608826,1.113323,1.570366,1.454973,0.965602,0.712593,0.936627,1.205641,1.34144,1.059189,0.638622,0.312108,0.248253,0.208698,0.150682,0.133208,0.107945,0.071905,0.086631,0.086222,0.074877
0.410416,0.519416,0.232802,0.064922,0.087514,0.282011,0.524605,0.592605,1.168584,1.63961,1.398378,0.828483,0.580895,0.835236,1.03267,1.180302,1.106367,0.685061,0.300823,0.235898,0.20278,0.151714,0.113099,0.07869,0.050126,0.05384,0.05183,0.057679
0.441917,0.592484,0.275328,0.068693,0.087438,0.210552,0.403341,0.544051,1.116164,1.455892,1.209347,0.802755,0.690309,0.898788,0.901819,0.956154,1.124438,0.789373,0.282472,0.200668,0.190955,0.163874,0.120421,0.073896,0.040498,0.042254,0.045666,0.059063
0.522758,0.667298,0.282676,0.066462,0.085284,0.172941,0.342136,0.518688,1.07469,1.289808,1.030671,0.848036,0.835623,0.889999,0.803117,0.915834,1.238042,0.897384,0.255059,0.156482,0.161724,0.151151,0.116729,0.072842,0.037471,0.036346,0.041102,0.055156
0.548391,0.656755,0.251521,0.063091,0.079056,0.185747,0.320571,0.465401,1.080452,1.324858,0.937279,0.868813,0.914466,0.769357,0.716171,0.978821,1.318884,0.888029,0.209874,0.136942,0.141406,0.116146,0.093993,0.065792,0.03715,0.033574,0.034938,0.042526
0.49263,0.574178,0.211433,0.068287,0.077014,0.215554,0.336078,0.39761,1.002773,1.245585,0.777544,0.831526,0.92263,0.751025,0.877621,1.085623,1.204694,0.765338,0.185875,0.125846,0.116913,0.087151,0.081878,0.064761,0.039342,0.030514,0.030059,0.032704
0.441487,0.513663,0.189262,0.081434,0.080314,0.229767,0.339389,0.346995,0.919195,1.11642,0.758141,0.84384,0.936366,0.868157,1.11772,1.150831,0.929775,0.584571,0.197964,0.129433,0.093659,0.080272,0.090005,0.070328,0.041733,0.027543,0.025271,0.031246
0.503036,0.560558,0.191495,0.083817,0.072601,0.207191,0.332007,0.335823,0.930526,1.210107,0.876917,0.798284,0.882323,0.944149,1.243015,1.200624,0.735724,0.415622,0.205527,0.146409,0.095602,0.077999,0.090357,0.066582,0.038372,0.02473,0.023266,0.032634
0.579154,0.616918,0.183652,0.068743,0.054034,0.157868,0.298604,0.327162,0.97776,1.353318,0.919406,0.728098,0.796883,0.867481,1.174974,1.158402,0.629101,0.34432,0.209188,0.156416,0.117849,0.082108,0.082155,0.053131,0.030655,0.024007,0.024941,0.033459
0.614716,0.636161,0.158379,0.045842,0.040864,0.113264,0.241466,0.304466,0.988678,1.333006,0.783398,0.683057,0.83739,0.863197,1.094981,0.96925,0.47505,0.292044,0.187459,0.143176,0.130337,0.094374,0.087332,0.043626,0.025771,0.028597,0.032447,0.039681
0.597848,0.637748,0.151853,0.028776,0.03606,0.091288,0.190648,0.250661,0.914843,1.133355,0.532414,0.573797,0.928673,1.041001,1.126795,0.740477,0.364113,0.286642,0.149582,0.124265,0.125958,0.101177,0.1013,0.049137,0.028993,0.037356,0.042113,0.047264
