1.6e-05,5e-06,5e-06,1e-06,1.6e-05,7e-06,6e-06,1.4e-05,1.1e-05,9e-06,2e-06,2e-06,2.2e-05,1.2e-05,5e-06,7e-06,1e-05,1.5e-05,8e-06,2e-06,4e-06,1.4e-05,1.9e-05,1.1e-05,2e-06,2e-06,6e-06,1.5e-05,2.3e-05,4e-06,1.4e-05,2.3e-05,1e-06,1.7e-05,3e-06,2e-06,5e-06,3e-06,7e-06,3e-06,3e-06,1.9e-05,1e-06,1.9e-05,2e-06,7e-06,0,2e-06,1.6e-05,1.1e-05,4e-06,9e-06,1.2e-05,7e-06,2.2e-05,1.6e-05,1.2e-05,1.1e-05,1.6e-05,2e-06,7e-06,1e-05,7e-06,1.1e-05,7e-06,2.6e-05,7e-06,1e-05,2e-06,5e-06,1.1e-05,1.5e-05,1.7e-05,2.3e-05,1.2e-05,2e-06,3e-06,2.5e-05,1.1e-05,1e-06,4e-06,9e-06,2.5e-05,1e-05,5e-06,2.7e-05,2.1e-05,4e-06,7e-06,1.1e-05,3.8e-05,9e-06,6e-06,2e-06,2.4e-05,9e-06,3.3e-05,5e-06,5e-06,3e-06,3.5e-05,1e-06,2e-05,3e-06,2.6e-05,4e-05,2.1e-05,2.8e-05,7e-06,2.1e-05,3.5e-05,1.2e-05,1.2e-05,2e-05,1.9e-05,1.2e-05,1e-06,1.9e-05,2.1e-05,1.3e-05,2.3e-05
4.4e-05,2.1e-05,3.4e-05,1.8e-05,2.3e-05,1.6e-05,1.6e-05,3.9e-05,5e-06,2.9e-05,2e-05,8e-06,3.6e-05,2.5e-05,2.6e-05,2.6e-05,1.5e-05,3.2e-05,2.9e-05,4.8e-05,3.7e-05,4.8e-05,4.2e-05,2.3e-05,3.2e-05,1e-05,1.6e-05,4.3e-05,2.2e-05,1.5e-05,1.6e-05,7.1e-05,9e-06,5.2e-05,3e-05,2.5e-05,3.2e-05,2.1e-05,2.7e-05,8e-06,6.5e-05,4.9e-05,3.6e-05,5.2e-05,2.6e-05,5.9e-05,8e-06,3.8e-05,5.1e-05,1.2e-05,2.7e-05,6e-05,4.3e-05,3.9e-05,5.6e-05,3.6e-05,5e-05,4e-05,3.1e-05,1e-05,4e-06,2.9e-05,9e-06,4.9e-05,2.5e-05,3.9e-05,3.6e-05,4.4e-05,3e-05,1.9e-05,2.4e-05,2.3e-05,3.4e-05,4.5e-05,4.9e-05,2.7e-05,4e-06,4e-05,2e-05,3.4e-05,4.8e-05,4.1e-05,7.3e-05,2.1e-05,3.6e-05,2.2e-05,3.5e-05,2.2e-05,2.8e-05,3.2e-05,8.3e-05,5e-05,1.2e-05,2.1e-05,6e-05,4e-06,5.3e-05,1.5e-05,2e-05,1e-05,0.00012,2.2e-05,2.8e-05,3.8e-05,2e-05,9.9e-05,5.2e-05,8.6e-05,1.5e-05,9.2e-05,5.2e-05,5.2e-05,2.8e-05,2.5e-05,6.5e-05,3.1e-05,1.9e-05,4.2e-05,7.5e-05,1.5e-05,5.8e-05
1.7e-05,1.4e-05,1.5e-05,2.5e-05,3.6e-05,1e-05,1.9e-05,2.2e-05,4.3e-05,3.3e-05,3e-05,2.1e-05,4.6e-05,2.1e-05,3.4e-05,2.6e-05,1.2e-05,4e-06,2.7e-05,6e-05,2.6e-05,4.7e-05,4.4e-05,3.5e-05,6.6e-05,3.6e-05,4.7e-05,1.3e-05,3.4e-05,2.9e-05,1.9e-05,7.6e-05,8.1e-05,8.2e-05,7.8e-05,3.3e-05,3e-05,3.5e-05,5.6e-05,6.9e-05,4.2e-05,5.7e-05,6.6e-05,8.4e-05,6.8e-05,0.000115,8.3e-05,8.5e-05,2.7e-05,1.6e-05,2e-05,5.1e-05,2e-06,6.8e-05,0.000116,3.5e-05,2.5e-05,3.9e-05,4.3e-05,2.2e-05,1.7e-05,3.6e-05,4.9e-05,9.5e-05,3.7e-05,6.5e-05,8e-05,1.9e-05,2e-05,2.1e-05,1.9e-05,4.1e-05,5e-05,5.4e-05,5.3e-05,6.8e-05,7.6e-05,8.1e-05,4.2e-05,0.000103,6.1e-05,5.6e-05,3.9e-05,5.5e-05,5.3e-05,8.2e-05,3.3e-05,6.3e-05,1.5e-05,8e-05,0.000139,3.2e-05,1.2e-05,7.8e-05,4.4e-05,6.4e-05,3.7e-05,1.9e-05,5.2e-05,4.9e-05,0.000115,4.6e-05,7e-06,5.3e-05,6.3e-05,0.000114,8e-05,9.5e-05,7.4e-05,0.000107,8e-05,5e-05,2.4e-05,3.6e-05,5.9e-05,2.7e-05,4.8e-05,7.4e-05,7e-05,3.7e-05,8e-05
6e-06,1.3e-05,2.2e-05,1.9e-05,8.2e-05,8.5e-05,4.3e-05,4.1e-05,4.5e-05,2.5e-05,2.8e-05,4.1e-05,5.5e-05,9.4e-05,5.2e-05,4.3e-05,1.9e-05,3.1e-05,2.9e-05,7.6e-05,1.3e-05,6.2e-05,7.2e-05,8.7e-05,0.000118,0.00012,7e-05,7.3e-05,3.6e-05,1.7e-05,1.9e-05,5.8e-05,7.3e-05,9e-05,5.3e-05,9.4e-05,1e-04,7.6e-05,2.9e-05,8.9e-05,7.9e-05,0.000104,5.9e-05,9.5e-05,5.1e-05,7.4e-05,2e-05,6.7e-05,5e-05,3.9e-05,4.6e-05,4.2e-05,5.5e-05,8.6e-05,3e-05,6.4e-05,1.9e-05,6.8e-05,4.1e-05,3.2e-05,4e-05,4.5e-05,2.6e-05,0.000117,0.000113,0.000105,0.000175,0.000186,0.00012,9.5e-05,2.7e-05,2.5e-05,4.8e-05,0.000112,0.00013,6.9e-05,4.3e-05,7.7e-05,0.000142,7.3e-05,3.9e-05,8e-05,2.7e-05,8.9e-05,3e-05,0.000134,0.00015,7.3e-05,7.3e-05,0.000133,7e-05,0.000153,0.00012,0.000178,0.000175,0.00011,0.000152,7.3e-05,8e-05,1.1e-05,0.000135,0.000103,5.5e-05,0.000119,0.000173,0.00013,3.9e-05,0.000158,0.000128,0.00017,0.000164,0.000148,5.1e-05,0.000136,6.3e-05,3.2e-05,2.5e-05,6.9e-05,0.000163,9.6e-05,0.000133
5.6e-05,3e-06,6e-05,4.1e-05,6.2e-05,2e-05,3.2e-05,2e-05,2.4e-05,4e-06,4.1e-05,6.7e-05,5.2e-05,9e-05,3.9e-05,4.2e-05,2.9e-05,4.8e-05,4.5e-05,8e-06,5.7e-05,6.3e-05,2.2e-05,5.6e-05,4.4e-05,4.6e-05,5.2e-05,8.1e-05,8e-05,3.4e-05,6e-06,2.6e-05,5e-06,9e-06,6.5e-05,6e-05,5.4e-05,5.7e-05,7.2e-05,9.8e-05,5.2e-05,6.8e-05,0.000175,0.000119,0.00011,4.7e-05,5.2e-05,7e-05,9.9e-05,5.3e-05,5.9e-05,3.7e-05,4.1e-05,0.000101,9.8e-05,5.5e-05,2.9e-05,6.5e-05,3.9e-05,1.1e-05,4.2e-05,6.9e-05,8.7e-05,2.8e-05,4.6e-05,0.000141,8.9e-05,0.000124,3.2e-05,5e-05,5.2e-05,8e-05,3.7e-05,0.000122,6e-06,5.9e-05,7.6e-05,0.000121,0.000185,9.4e-05,4.5e-05,6.3e-05,9e-05,0.000141,0.000158,0.000222,9.2e-05,0.000113,9.4e-05,0.00013,0.000139,0.000171,9e-06,0.000158,0.000106,6.3e-05,0.000174,0.00015,0.000133,0.000119,0.00016,5.5e-05,3.2e-05,0.000147,6.8e-05,0.00017,9.6e-05,8.4e-05,1.9e-05,0.00011,6.4e-05,7.8e-05,3.3e-05,0.000137,8.5e-05,7.4e-05,3.9e-05,2.4e-05,0.000142,5.3e-05,2.9e-05
5.1e-05,6.8e-05,9.6e-05,6.1e-05,1.4e-05,6.4e-05,2.6e-05,5.1e-05,4.6e-05,3.8e-05,2.9e-05,4.7e-05,5.5e-05,5.5e-05,6.8e-05,4.4e-05,8.5e-05,5.7e-05,2.2e-05,1.1e-05,4.5e-05,8.3e-05,0.000109,3.3e-05,1.5e-05,4.2e-05,7.3e-05,4.3e-05,5.1e-05,9.3e-05,9.4e-05,3.5e-05,6.9e-05,9.9e-05,2.2e-05,7.3e-05,0.000128,2e-05,4.5e-05,8.3e-05,0.000158,9.5e-05,0.000198,0.000182,4.4e-05,2.9e-05,0.00012,0.000105,1.1e-05,9.3e-05,9.9e-05,7e-06,3.3e-05,4e-05,8.8e-05,9.8e-05,0.000101,9e-05,7.5e-05,7e-05,7.9e-05,7.1e-05,2.1e-05,7.3e-05,3.8e-05,0.000123,0.000173,0.000107,0.000123,8.4e-05,0.000136,9.4e-05,6.3e-05,7.2e-05,8.8e-05,5.7e-05,0.00014,3.3e-05,0.000126,0.000116,0.000145,8.7e-05,0.000141,0.000108,7.8e-05,0.000142,0.000103,0.000159,8.7e-05,8e-05,9.6e-05,0.000142,1e-04,0.00018,0.000129,2.8e-05,0.000106,9.2e-05,3.1e-05,0.000137,0.000286,0.000193,9e-05,0.000111,0.000135,0.000125,0.000192,0.00014,0.000189,7e-05,5.4e-05,0.000163,4.7e-05,0.00013,0.000114,7.8e-05,8.9e-05,8.5e-05,0.000144,0.000242,0.000126
2.3e-05,8e-05,6.2e-05,3.4e-05,3.7e-05,4.7e-05,7.4e-05,6.3e-05,0.000101,7.5e-05,2.6e-05,2.2e-05,0.000138,0.000118,7.4e-05,7.1e-05,5.2e-05,4.4e-05,7.6e-05,7.9e-05,4.7e-05,7.5e-05,5.4e-05,6.5e-05,4.9e-05,8.3e-05,6.5e-05,0.000102,8.9e-05,0.000126,0.000128,0.000135,0.000111,2.4e-05,6.3e-05,8.6e-05,8.8e-05,0.000106,3.2e-05,0.000147,0.000187,0.000123,0.000172,0.000106,8.8e-05,4.8e-05,0.000112,0.00017,6.9e-05,3.1e-05,0.000138,0.000141,4e-05,2.7e-05,6.4e-05,0.000106,0.000194,8.4e-05,7.9e-05,2.1e-05,6.9e-05,0.000159,0.000145,0.000139,0.000104,0.000147,1e-04,0.000181,0.000213,0.000161,6e-05,0.000174,0.000245,0.000251,6.4e-05,9.6e-05,8.3e-05,0.000114,0.000107,0.000193,0.000128,0.000135,0.000104,0.000194,8.2e-05,0.000163,0.000165,2.4e-05,4.2e-05,0.000105,0.000165,0.000211,0.000182,0.000131,0.000197,0.000183,0.000167,8.7e-05,0.00012,9e-05,0.000235,0.000387,0.000205,7.7e-05,0.000205,0.000236,0.000148,0.000157,0.000216,0.000199,0.000155,0.000185,0.000137,0.000141,0.000134,1e-05,5.3e-05,9.2e-05,0.000196,0.000301,0.000175
6e-05,7.8e-05,0.000122,0.000118,1e-04,5.4e-05,8.9e-05,3.3e-05,8.4e-05,3e-05,7.7e-05,9.2e-05,0.000157,0.000173,0.000193,0.000104,7.2e-05,5.9e-05,7.5e-05,7.4e-05,3.2e-05,4.5e-05,7.9e-05,0.000168,5.4e-05,9.2e-05,8.3e-05,8.3e-05,5.9e-05,5.9e-05,2.5e-05,4.7e-05,4e-05,6e-06,5.6e-05,7.9e-05,8.7e-05,0.000114,4.7e-05,0.00016,0.000119,0.000117,8.2e-05,3.3e-05,0.000138,6.5e-05,0.000189,0.000168,0.000138,0.000104,0.000107,9.5e-05,5.7e-05,9.8e-05,6.4e-05,8.4e-05,0.000199,0.000136,0.000146,4.7e-05,7.8e-05,0.000127,5.2e-05,7.9e-05,5.4e-05,6.6e-05,7.4e-05,0.000102,7e-05,5.3e-05,0.000172,9.1e-05,0.000211,9.6e-05,0.000129,9e-05,0.000101,9e-05,0.000118,8.8e-05,0.000108,0.000126,9.8e-05,0.000126,7.4e-05,0.000136,3.4e-05,5.7e-05,0.000148,0.000214,0.000149,0.000151,2e-05,6.8e-05,0.000186,2.9e-05,0.00015,3.6e-05,8e-05,0.00013,7.5e-05,0.000231,0.000139,0.000128,0.000154,2.7e-05,0.00016,0.000185,8.6e-05,0.000147,5.9e-05,0.000107,6.8e-05,5.7e-05,6.6e-05,0.000148,0.000115,5.5e-05,0.000117,7.9e-05,4.1e-05
0.00011,1.5e-05,0.000114,0.000207,9e-05,4e-06,6.3e-05,3.8e-05,8.2e-05,4.1e-05,7.8e-05,6.5e-05,0.000119,4.6e-05,8.2e-05,5.5e-05,9.7e-05,0.000106,4e-05,0.00011,0.000124,7.2e-05,7.1e-05,8.7e-05,8.6e-05,7.2e-05,0.000148,7.3e-05,8.1e-05,3.2e-05,6.8e-05,0.00014,8.6e-05,0.000132,9.8e-05,0.000107,0.00011,3.1e-05,2.7e-05,0.000126,5.6e-05,3.3e-05,8.3e-05,6.8e-05,0.000155,0.000136,0.00012,8.9e-05,0.00012,0.000116,0.000122,6.7e-05,3.9e-05,7.1e-05,3.2e-05,4e-05,0.000139,6.6e-05,9.6e-05,3.9e-05,9.7e-05,0.000141,0.000144,6.8e-05,0.000112,9.7e-05,7.3e-05,9.7e-05,0.00013,0.000114,0.000158,0.00029,4.8e-05,0.000186,0.000273,0.000171,0.000181,0.000112,0.000157,8.6e-05,0.000106,0.000106,0.000119,3.8e-05,0.000127,0.00015,5.8e-05,5.8e-05,0.000227,0.000356,0.00011,0.000116,0.000114,2.2e-05,0.000153,0.000108,0.000235,0.000231,0.000125,0.000171,3.4e-05,9.8e-05,6.9e-05,0.000239,3.7e-05,9.4e-05,0.00032,0.000149,4.5e-05,0.00015,7.7e-05,5.9e-05,7.2e-05,0.000119,0.000172,9.7e-05,6.3e-05,9.9e-05,0.000122,1e-04,9.2e-05
7.3e-05,8.5e-05,2.7e-05,0.000113,9.8e-05,7.9e-05,1e-04,7e-05,0.000136,0.000103,5.7e-05,0.000117,0.000151,7.6e-05,6.4e-05,6.4e-05,9.4e-05,3.9e-05,3e-06,0.000119,0.000101,4.5e-05,8e-05,7.6e-05,6.8e-05,8.7e-05,5.9e-05,4.8e-05,7e-05,5.9e-05,5.9e-05,0.000125,0.000134,0.000157,0.000132,7.9e-05,1.9e-05,9.5e-05,6.2e-05,3.9e-05,0.000145,0.000178,0.000108,0.000174,0.000159,0.000161,0.000186,3.4e-05,2.3e-05,4.5e-05,8.4e-05,8.2e-05,2.1e-05,2.9e-05,8.9e-05,9.2e-05,3.8e-05,4.9e-05,0.000132,0.000114,9.7e-05,0.000176,0.000172,0.000163,8.6e-05,2.9e-05,9.3e-05,6.3e-05,8.3e-05,8.3e-05,0.00014,0.000226,0.000222,0.000199,0.000175,0.000109,0.000186,0.000245,8.7e-05,8.2e-05,4.6e-05,3.6e-05,2.2e-05,0.00015,0.000225,2e-04,8.7e-05,0.00019,0.000193,5.8e-05,7.7e-05,0.000217,0.000246,0.000203,5.9e-05,5.8e-05,0.00015,0.000257,0.000117,5.1e-05,0.000188,0.00021,8.9e-05,0.000114,0.000108,0.000172,0.00036,0.000288,0.000113,4.4e-05,7.4e-05,0.000109,0.000144,9.2e-05,0.000138,0.000212,0.000188,0.00021,9.5e-05,0.000127,0.000204
4.3e-05,8.3e-05,5.9e-05,9.5e-05,2e-05,3.2e-05,8.6e-05,2.6e-05,9.2e-05,5.7e-05,3.5e-05,6.7e-05,1e-04,0.000107,0.000111,3.1e-05,4.7e-05,2.5e-05,1.1e-05,5.3e-05,3e-05,3.9e-05,4.9e-05,3.7e-05,2.7e-05,3.2e-05,5.7e-05,5.7e-05,7.3e-05,5.8e-05,3.3e-05,0.000133,1.1e-05,0.000195,8.7e-05,3.9e-05,5.3e-05,9.1e-05,8.8e-05,1.1e-05,9.2e-05,5.5e-05,1.8e-05,8.3e-05,0.00013,5.3e-05,6.7e-05,7.5e-05,8.3e-05,0.000109,0.000125,6e-06,5.5e-05,8.5e-05,0.000117,6.7e-05,4.7e-05,6.8e-05,0.000173,0.000161,0.000213,4e-05,9.2e-05,0.000126,0.000161,0.000196,0.000185,0.000155,0.000156,7.9e-05,7e-06,0.000115,8.2e-05,9.4e-05,0.000125,0.000121,7.6e-05,0.000127,0.000123,9.3e-05,0.000125,8.7e-05,0.00011,0.000228,0.000242,0.000201,0.000186,0.000102,0.000109,4.9e-05,2.7e-05,0.000202,9.3e-05,6.3e-05,7.1e-05,1e-05,0.000106,6.9e-05,9.4e-05,1.4e-05,0.000122,0.000155,0.000139,0.00013,0.00017,0.00028,1e-04,0.000114,0.000139,6.1e-05,6.7e-05,0.000104,0.000176,0.000109,0.000137,0.00013,9.4e-05,0.000141,0.000139,0.000189,0.000226
2.8e-05,7.6e-05,0.000109,0.000106,6e-05,2.9e-05,7.2e-05,6.8e-05,0.000102,6.8e-05,1.9e-05,6.4e-05,0.000118,9.5e-05,0.000138,0.000114,6.2e-05,7.7e-05,4.6e-05,0.000103,3.4e-05,5.8e-05,1.4e-05,4.3e-05,5.5e-05,5.9e-05,2.3e-05,5.3e-05,5.4e-05,8.6e-05,9.9e-05,9.3e-05,6.8e-05,0.000136,0.000108,0.000109,6e-05,8.7e-05,0.000137,9.3e-05,5.7e-05,0.000107,3.5e-05,4.6e-05,6.1e-05,1.9e-05,8e-05,4.1e-05,3.8e-05,0.00011,0.00014,9.7e-05,9e-06,5e-05,0.000107,7e-05,9.9e-05,5.7e-05,0.000167,0.000108,7.6e-05,7.2e-05,0.000162,0.000145,1.1e-05,0.000161,4.2e-05,0.000136,0.000107,0.000135,0.00018,0.000127,5.1e-05,0.000128,9.1e-05,2.3e-05,0.000106,3.6e-05,0.000127,4.2e-05,0.000134,0.000111,6.2e-05,0.000165,6e-05,0.000108,9.3e-05,0.000197,6e-05,7.8e-05,4.9e-05,0.00015,0.000135,8.7e-05,7e-06,1e-05,5.8e-05,6.7e-05,6.4e-05,2.6e-05,4.1e-05,0.000155,0.000214,3.3e-05,9.1e-05,0.000197,0.000117,0.00014,4.6e-05,5.3e-05,0.000108,3.6e-05,0.000164,6.7e-05,0.000167,0.000145,0.000109,0.000125,0.000133,0.000234,8.1e-05
9.9e-05,5e-05,1.6e-05,8.4e-05,3.7e-05,5.2e-05,4e-05,8.3e-05,5.8e-05,4.7e-05,3.4e-05,6.3e-05,6.7e-05,0.00013,8.2e-05,6.2e-05,2.6e-05,2e-05,3.6e-05,0.000165,0.000108,9.8e-05,5e-05,1.4e-05,5.3e-05,8.5e-05,6.7e-05,0.000107,1e-04,7e-06,6.1e-05,7.9e-05,4.2e-05,6.9e-05,4.3e-05,8.7e-05,4.7e-05,9.4e-05,5.6e-05,0.000103,2.5e-05,0.000102,8.1e-05,5.9e-05,3.3e-05,5.3e-05,9.6e-05,1.3e-05,4e-06,0.000119,9.1e-05,7.6e-05,1.7e-05,4.1e-05,7.8e-05,4.2e-05,6.1e-05,4.7e-05,7.5e-05,3.5e-05,4.8e-05,9e-06,0.000126,7.2e-05,4.3e-05,9.5e-05,0.000103,4.3e-05,9e-05,6.1e-05,0.000101,8e-05,7.7e-05,4.8e-05,7.6e-05,8.7e-05,0.000103,6.3e-05,0.000151,0.00013,7.9e-05,3.9e-05,0.000109,4.9e-05,5.4e-05,0.00014,5.4e-05,0.000107,0.000207,8.3e-05,7.3e-05,0.000127,0.00013,4.6e-05,5.8e-05,8.5e-05,0.000122,0.000134,9e-05,8e-05,0.000121,0.000108,6.4e-05,0.000108,6.5e-05,0.000161,5.6e-05,8.3e-05,5.1e-05,4.1e-05,8.3e-05,0.000127,0.000127,0.000118,0.00013,6.4e-05,0.000109,2.8e-05,0.000151,0.00011,9.5e-05
8e-05,8.4e-05,0.000114,0.00015,8.8e-05,8.6e-05,8e-05,9.5e-05,2.3e-05,3e-06,1.2e-05,3.7e-05,6.6e-05,2.1e-05,8.9e-05,9.3e-05,2e-05,4.7e-05,3e-05,0.000131,3.1e-05,8.1e-05,6e-05,5.2e-05,3e-05,6.8e-05,0.000107,6.2e-05,3.4e-05,3.2e-05,4.1e-05,1.7e-05,7.4e-05,3.4e-05,2.5e-05,7e-05,9.5e-05,0.000121,0.000105,8.3e-05,8.6e-05,8.5e-05,0.00017,5e-05,4.3e-05,2.8e-05,5.1e-05,7.3e-05,4.7e-05,0.00014,2.8e-05,8.4e-05,7.3e-05,7.5e-05,0.000108,6.7e-05,5.2e-05,0.000117,0.000102,3.5e-05,5e-05,3.2e-05,5.6e-05,1.9e-05,2.8e-05,1.6e-05,4.9e-05,1.7e-05,4.9e-05,3.5e-05,5.9e-05,5.6e-05,6.2e-05,3.1e-05,2.2e-05,2.5e-05,7.3e-05,3.6e-05,4.4e-05,4e-05,0.000144,7.7e-05,4e-05,5.1e-05,0.000134,6.5e-05,0.000113,7.4e-05,0.000135,8.5e-05,0.000126,5.5e-05,8e-06,6.4e-05,4.8e-05,0.000111,6.7e-05,4.9e-05,0.000159,9.7e-05,0.000155,7.2e-05,6.3e-05,8.6e-05,7.3e-05,6e-05,0.000139,7.7e-05,0.000113,1.4e-05,0.000101,6e-05,8.2e-05,2e-04,0.000124,0.000142,8.1e-05,3.9e-05,2e-05,8.1e-05,0.000166
0.000147,7.8e-05,9.2e-05,0.000152,0.000122,0.000132,0.000109,4.6e-05,0.000125,1e-04,2.9e-05,4.2e-05,5.4e-05,7.2e-05,7.4e-05,3.2e-05,0.000113,0.000166,0.000114,9.4e-05,8.9e-05,4.7e-05,1.2e-05,3.9e-05,5.5e-05,0.000141,0.000115,0.000125,9.4e-05,0.000139,8.8e-05,9.2e-05,3.7e-05,5.2e-05,0.000103,2e-06,6.8e-05,2.5e-05,7e-05,8.2e-05,6e-05,7.3e-05,0.000154,0.000167,0.00011,6.7e-05,4e-05,4.8e-05,4.7e-05,0.000238,0.000182,2.9e-05,4.7e-05,5.5e-05,9.5e-05,9.3e-05,0.000121,4.5e-05,5.5e-05,4.9e-05,8.3e-05,8.8e-05,3.3e-05,8e-05,5.1e-05,3.9e-05,0.000117,8.1e-05,7.9e-05,6.2e-05,5.6e-05,8e-05,6.8e-05,7.7e-05,1.2e-05,0.000103,2.8e-05,4.9e-05,6.1e-05,7.2e-05,0.000187,0.000228,0.000118,3.5e-05,8.7e-05,0.000187,0.000122,6.9e-05,7.2e-05,8.1e-05,0.000148,0.000181,9.9e-05,5.1e-05,0.000108,3.8e-05,6.1e-05,9.5e-05,0.000221,0.00023,7.4e-05,2.8e-05,8.6e-05,9.5e-05,9.4e-05,0.000106,5.2e-05,4.2e-05,4.7e-05,0.000109,0.000182,0.000149,6.5e-05,0.000151,4.8e-05,4.1e-05,6.6e-05,1e-04,7.3e-05,3.8e-05,0.000187
3.2e-05,5.7e-05,6.9e-05,3.7e-05,4.8e-05,7e-05,1.3e-05,7.3e-05,9.8e-05,7.2e-05,6.4e-05,1.5e-05,3.6e-05,8.8e-05,5.6e-05,8.6e-05,0.000125,0.000106,8.2e-05,6.1e-05,4.4e-05,9.6e-05,6.3e-05,4.8e-05,4e-05,9.5e-05,2.5e-05,7.8e-05,2.1e-05,0.000128,1.3e-05,8.3e-05,6.9e-05,1.3e-05,7.5e-05,8.8e-05,3.4e-05,3.3e-05,0.000117,0.000154,4.9e-05,8.6e-05,5.4e-05,6.4e-05,5.8e-05,4.5e-05,1.8e-05,0.000112,0.000152,0.000167,6.7e-05,9.6e-05,4.5e-05,7.1e-05,4.6e-05,5.8e-05,1.2e-05,1.5e-05,0.000124,5.1e-05,0.000103,2.9e-05,6.9e-05,7.6e-05,4.9e-05,5.3e-05,0.000129,5.2e-05,4.3e-05,4.1e-05,0.000148,7.8e-05,3.2e-05,5.6e-05,9.7e-05,0.000149,8.1e-05,9.5e-05,6.4e-05,0.000132,5.4e-05,0.000144,0.000109,5.9e-05,6.7e-05,6.9e-05,1.5e-05,5.9e-05,7.7e-05,0.000143,0.00012,9.1e-05,5.7e-05,2.3e-05,9.6e-05,0.000103,6.7e-05,8.9e-05,0.000124,1e-04,5.3e-05,6.2e-05,5.6e-05,4.3e-05,2.3e-05,5.2e-05,0.00011,2.7e-05,2.5e-05,7.6e-05,6.2e-05,9.3e-05,0.000293,0.000101,3.1e-05,5.6e-05,5.9e-05,0.000129,0.000118,3.8e-05,0.00019
4.5e-05,4.7e-05,8.4e-05,0.000123,3.4e-05,7.7e-05,6.5e-05,7.5e-05,0.000146,6.1e-05,5.9e-05,4.9e-05,7.1e-05,9.9e-05,7.2e-05,0.000127,7.8e-05,9.9e-05,1.4e-05,2.3e-05,2e-06,7.3e-05,8.4e-05,9.4e-05,3.9e-05,0.000102,6.7e-05,4.8e-05,6e-05,0.000118,7.4e-05,8.2e-05,0.000151,5e-05,2.2e-05,6.1e-05,3.6e-05,4.1e-05,5.4e-05,0.000114,9e-05,0.000104,7.6e-05,2.4e-05,4.4e-05,8e-06,7.9e-05,0.000167,0.000116,0.000171,8.7e-05,7.8e-05,1e-05,8.5e-05,0.000113,8.8e-05,3.8e-05,2.1e-05,0.000174,0.00023,7.2e-05,4.7e-05,7.8e-05,0.000109,8e-05,3.1e-05,5e-05,4.8e-05,9.4e-05,2.6e-05,0.000191,0.000221,0.000211,0.000147,0.000101,0.000164,8.6e-05,5.4e-05,0.000131,1.4e-05,7.5e-05,7.6e-05,3.6e-05,4.2e-05,2.4e-05,3e-05,7.5e-05,7.2e-05,0.000207,0.000151,9.6e-05,9.6e-05,9.1e-05,3.2e-05,8.9e-05,2.5e-05,7.4e-05,6.9e-05,0.000151,0.000193,7.6e-05,4.4e-05,0.00011,5.4e-05,5.5e-05,7.1e-05,3.3e-05,2.4e-05,0.000107,0.000136,9.4e-05,6e-05,0.000307,0.00014,6e-05,0.000117,9.7e-05,9.8e-05,0.000105,0.000103,7.5e-05
7.4e-05,2.9e-05,7.2e-05,7.2e-05,5.6e-05,9e-05,5.4e-05,3e-05,4.2e-05,3.3e-05,3.4e-05,2.3e-05,4.6e-05,8.8e-05,8.9e-05,0.000137,3.7e-05,2e-05,2e-05,3e-05,2.4e-05,6.7e-05,3.1e-05,0.00012,1e-04,0.000106,2.1e-05,8e-06,3.1e-05,7.8e-05,0.000116,1.2e-05,0.000101,0.000124,8.3e-05,9.1e-05,8.5e-05,7.7e-05,4.3e-05,3.7e-05,1.6e-05,1.9e-05,2.3e-05,2.4e-05,7.5e-05,4.6e-05,0.000105,0.00017,8.2e-05,7.1e-05,9.5e-05,1.1e-05,5.7e-05,0.000114,0.00011,5.8e-05,1e-05,1.4e-05,0.000178,0.000188,0.000163,0.000146,6.9e-05,6.1e-05,6.2e-05,1.7e-05,7.9e-05,4.7e-05,0.000126,0.000119,0.000186,0.000166,0.000171,3.9e-05,0.00016,5.1e-05,4.7e-05,7.6e-05,4.8e-05,9.7e-05,0.000105,4.4e-05,6.2e-05,3.4e-05,4.5e-05,4.5e-05,5.6e-05,0.00011,0.000139,8.6e-05,5.9e-05,0.000123,6.2e-05,0.000155,0.000173,0.000156,0.000194,0.000161,0.000214,0.000197,0.000116,5.1e-05,9e-05,0.000101,0.000103,3.3e-05,5.9e-05,6.1e-05,0.000134,0.000173,0.000151,0.000178,0.000299,0.000219,8e-05,0.000188,0.000133,0.000147,6.2e-05,9.1e-05,0.000117
2.5e-05,4.7e-05,5e-06,6.6e-05,2.2e-05,4.6e-05,2.8e-05,3.2e-05,2.2e-05,2.1e-05,2.6e-05,6e-06,4.3e-05,3e-06,4.5e-05,6.4e-05,7.3e-05,5e-05,4e-05,6.3e-05,2.8e-05,1.4e-05,6.5e-05,3.9e-05,4.3e-05,2e-05,3.9e-05,2.3e-05,4.2e-05,2e-05,9.2e-05,9.6e-05,3.2e-05,8.7e-05,3.8e-05,2.5e-05,4.3e-05,5.1e-05,7.7e-05,4.1e-05,3.8e-05,3.9e-05,4.5e-05,3e-05,9.5e-05,4.5e-05,7e-05,2e-05,3.5e-05,1.7e-05,1.8e-05,5.4e-05,4.4e-05,4.8e-05,4.3e-05,1.9e-05,4.4e-05,3.3e-05,9.4e-05,6.7e-05,7.5e-05,3.5e-05,2.2e-05,8.4e-05,4.8e-05,1.1e-05,8e-05,0.000118,9.2e-05,1.3e-05,5.3e-05,6.8e-05,6.1e-05,7.2e-05,0.000127,6e-05,7.3e-05,5.3e-05,2e-05,5.9e-05,2.1e-05,9.1e-05,4.9e-05,0.000103,5e-05,7.1e-05,9.9e-05,6.4e-05,0.000104,1e-04,1.2e-05,6.7e-05,3.4e-05,0.000152,0.000101,2e-05,0.000106,0.00015,0.000117,1.9e-05,1.2e-05,5.2e-05,4.9e-05,6.4e-05,7.5e-05,5.2e-05,2.9e-05,4.5e-05,5.6e-05,0.000131,9e-05,0.000107,8.5e-05,5.1e-05,0.000148,5.7e-05,6.5e-05,9.5e-05,2.4e-05,0.000103,0.00015
3.5e-05,4.7e-05,2.1e-05,2.6e-05,1.7e-05,2.3e-05,4.9e-05,2.1e-05,1.5e-05,8e-06,7e-06,2e-06,4.2e-05,2.9e-05,3.6e-05,6.2e-05,7.2e-05,3.2e-05,4.1e-05,2.8e-05,2.5e-05,1e-05,3.8e-05,4.3e-05,4.7e-05,3.7e-05,3.3e-05,6e-06,2.5e-05,1.9e-05,8.8e-05,1.3e-05,2.2e-05,3.8e-05,3.5e-05,1.6e-05,2.3e-05,2.7e-05,3.5e-05,4.3e-05,6e-05,4e-05,3.1e-05,4.4e-05,3.8e-05,5.6e-05,3.2e-05,1.5e-05,6.7e-05,5.1e-05,1.9e-05,3.1e-05,4e-05,2.1e-05,2.5e-05,1.3e-05,5.5e-05,1e-05,3.4e-05,5.5e-05,4e-06,1.7e-05,5e-06,6.3e-05,5.9e-05,6e-05,1.4e-05,5.6e-05,8e-06,2e-05,5.1e-05,5.8e-05,4.2e-05,5.4e-05,7.2e-05,1.5e-05,8.4e-05,3.4e-05,4.4e-05,3.5e-05,1.1e-05,7e-05,0.000114,8.3e-05,4.2e-05,2.9e-05,4.6e-05,1.7e-05,4.4e-05,5.1e-05,7.8e-05,8.4e-05,6.5e-05,6.7e-05,7.7e-05,5.5e-05,0.000109,6.1e-05,5.9e-05,4.4e-05,3.8e-05,5.5e-05,0.000118,6.4e-05,2.5e-05,2.8e-05,5.3e-05,4.8e-05,5.1e-05,6.2e-05,9.2e-05,4.7e-05,4.6e-05,7.8e-05,8.1e-05,7.9e-05,3.1e-05,5.5e-05,4.8e-05,7.4e-05,2.7e-05
1.2e-05,1.5e-05,3.6e-05,2.7e-05,2.8e-05,2.1e-05,1.4e-05,1.7e-05,1.5e-05,2.5e-05,4.4e-05,2.2e-05,2.1e-05,2.6e-05,1e-05,3.1e-05,1.7e-05,1.5e-05,2.7e-05,5e-06,9e-06,1.2e-05,1.6e-05,4.6e-05,1.8e-05,9e-06,1.9e-05,2.3e-05,1.9e-05,1.3e-05,4e-05,3.6e-05,2e-06,2.7e-05,3.6e-05,2.5e-05,3.5e-05,9e-06,2.1e-05,1.4e-05,2.2e-05,2.5e-05,3e-06,2.1e-05,3e-05,1.6e-05,4.1e-05,3.4e-05,2.9e-05,3.9e-05,2.6e-05,5e-06,1.3e-05,1.8e-05,1e-06,5e-06,3.9e-05,2.2e-05,1.2e-05,6.9e-05,2.2e-05,3.5e-05,2.5e-05,3.7e-05,3.4e-05,1.8e-05,2.1e-05,4.2e-05,1.2e-05,1.7e-05,5.4e-05,2.6e-05,2.2e-05,2.8e-05,6.2e-05,2.7e-05,6.4e-05,1.1e-05,2.9e-05,3.2e-05,3.9e-05,2e-06,7.9e-05,5.5e-05,2.7e-05,1.7e-05,8e-06,5.5e-05,5.2e-05,2e-05,4.4e-05,3.8e-05,1.5e-05,7.9e-05,4.6e-05,3.5e-05,6.2e-05,4.4e-05,2.8e-05,2.5e-05,4e-05,4.7e-05,5.7e-05,2.9e-05,5.2e-05,1.3e-05,4e-05,3.7e-05,3.8e-05,3.2e-05,7.6e-05,6.5e-05,4.2e-05,1.4e-05,5.2e-05,3.2e-05,2.3e-05,2.2e-05,6e-06,2e-05,2.1e-05
1.3e-05,2.3e-05,2.4e-05,1.7e-05,2e-05,1.9e-05,1.4e-05,1.8e-05,9e-06,2.8e-05,2e-05,2.1e-05,1e-06,1.8e-05,3e-06,1.7e-05,2.4e-05,1.1e-05,2.2e-05,1.5e-05,1.9e-05,2.8e-05,1.8e-05,4.2e-05,1.4e-05,1e-05,1.5e-05,2.9e-05,1e-05,8e-06,2.5e-05,1.4e-05,7e-06,6e-06,1.7e-05,1.7e-05,1.3e-05,4.1e-05,2.3e-05,1.1e-05,2.2e-05,2.1e-05,2.4e-05,1.8e-05,1.9e-05,1.6e-05,3.9e-05,3.3e-05,3.4e-05,3.1e-05,2.6e-05,4e-06,6e-06,4.5e-05,9e-06,8e-06,9e-06,1.3e-05,1.4e-05,3e-05,1.6e-05,3.7e-05,7e-06,5.1e-05,2.6e-05,5e-06,1.1e-05,4.1e-05,2.6e-05,1.4e-05,3.1e-05,5.2e-05,2.5e-05,2.7e-05,3.3e-05,8e-06,2.8e-05,2.3e-05,2.4e-05,2.5e-05,4e-05,2.5e-05,3.6e-05,3.7e-05,3.6e-05,8e-06,2.6e-05,2.7e-05,3.2e-05,2.9e-05,5.1e-05,6.5e-05,2.3e-05,6.6e-05,3.1e-05,1.1e-05,5.1e-05,2.2e-05,4e-05,9e-06,5.6e-05,1.3e-05,4e-05,1.3e-05,4e-05,2.8e-05,1.2e-05,7e-06,3.1e-05,6.1e-05,7.8e-05,3.4e-05,3.4e-05,5.5e-05,4.2e-05,3.4e-05,6.9e-05,3.6e-05,2e-05,3.6e-05,3.3e-05
6e-06,1.1e-05,1.4e-05,9e-06,1e-05,4e-06,7e-06,9e-06,9e-06,9e-06,9e-06,1.4e-05,8e-06,1e-05,5e-06,5e-06,9e-06,6e-06,6e-06,3e-06,7e-06,1.5e-05,6e-06,6e-06,1.6e-05,5e-06,9e-06,9e-06,9e-06,4e-06,2e-05,6e-06,4e-06,4e-06,1.4e-05,1.2e-05,1e-05,2.2e-05,1.1e-05,1e-05,1.1e-05,5e-06,1.6e-05,1.2e-05,1e-06,1e-05,4e-06,1.2e-05,1.7e-05,2.2e-05,1.4e-05,9e-06,1.1e-05,1.2e-05,8e-06,1.2e-05,2.1e-05,2.3e-05,2.2e-05,2.2e-05,9e-06,8e-06,2e-05,1.1e-05,7e-06,1.1e-05,9e-06,1.7e-05,1.2e-05,1.1e-05,6e-06,7e-06,6e-06,1e-05,1.3e-05,4e-06,1.5e-05,1.1e-05,2e-05,2.6e-05,1.7e-05,2.9e-05,1.6e-05,2.3e-05,8e-06,2e-05,2.1e-05,2.1e-05,2.4e-05,1.5e-05,1.9e-05,2.6e-05,1.6e-05,2.1e-05,1.7e-05,1.2e-05,1.5e-05,2.9e-05,1.9e-05,1e-05,1.6e-05,6e-06,2.3e-05,1.1e-05,1.2e-05,9e-06,6e-06,1e-05,1.1e-05,2.8e-05,2.7e-05,2.5e-05,3e-06,1.7e-05,9e-06,2.2e-05,2.4e-05,2.2e-05,2e-06,2e-05,1.7e-05
7e-06,1.6e-05,1.3e-05,2e-05,1.5e-05,1e-05,1e-06,3e-06,1e-05,8e-06,1.4e-05,1.2e-05,3e-06,1.1e-05,8e-06,1.3e-05,2e-06,9e-06,1.7e-05,9e-06,1e-05,7e-06,6e-06,7e-06,1.4e-05,6e-06,1.2e-05,1e-05,6e-06,1.3e-05,1e-05,1.5e-05,1.1e-05,2e-05,5e-06,1.4e-05,2.1e-05,7e-06,1.4e-05,1.4e-05,7e-06,1.4e-05,2.3e-05,1.4e-05,3e-06,8e-06,2.4e-05,1e-05,1.8e-05,2.7e-05,1.5e-05,7e-06,2.1e-05,2.1e-05,1.8e-05,3.2e-05,1.6e-05,2.7e-05,1.7e-05,2.1e-05,9e-06,1.1e-05,1.1e-05,9e-06,2.1e-05,1.8e-05,1.9e-05,1.1e-05,6e-06,1e-05,1.4e-05,2.9e-05,9e-06,5e-06,1.4e-05,1.6e-05,7e-06,3e-05,1.8e-05,1.7e-05,1.3e-05,1.3e-05,1.2e-05,9e-06,2.8e-05,1.7e-05,6e-06,1.7e-05,1.4e-05,8e-06,2.2e-05,2.6e-05,1.8e-05,3.5e-05,3.4e-05,2.2e-05,1.7e-05,8e-06,1.8e-05,1.9e-05,5e-06,1.8e-05,1.6e-05,6e-06,1e-05,3.4e-05,2.2e-05,1.1e-05,2e-05,3.2e-05,2.8e-05,2.9e-05,2.6e-05,2.5e-05,1.1e-05,2.4e-05,3.2e-05,3.1e-05,2.6e-05,7e-06,1.5e-05
4e-06,2.2e-05,2e-05,2.4e-05,0,6e-06,5e-06,1.3e-05,2.1e-05,1.1e-05,2e-05,2.5e-05,1.4e-05,3e-05,4e-05,2.7e-05,9e-06,1.8e-05,1.5e-05,2.3e-05,7e-06,6e-06,7e-06,4e-06,1.1e-05,1e-05,2.2e-05,2.5e-05,1.8e-05,2.7e-05,8e-06,1.4e-05,2.5e-05,3e-05,1.2e-05,1.2e-05,2.8e-05,1.1e-05,1.1e-05,2.8e-05,2.2e-05,2.2e-05,7e-06,7e-06,1.5e-05,1.2e-05,2.5e-05,1.9e-05,1.9e-05,1.3e-05,1.1e-05,2e-05,3.7e-05,3.4e-05,3.8e-05,2.1e-05,1.4e-05,1.8e-05,1.4e-05,3.4e-05,6e-06,1.4e-05,1.8e-05,3e-05,1.6e-05,1.8e-05,1.6e-05,2.1e-05,1.8e-05,1.5e-05,2e-05,3.1e-05,5.4e-05,2e-05,2.2e-05,1.6e-05,1.6e-05,4.1e-05,2.1e-05,1.6e-05,3e-06,1.5e-05,8e-06,1.4e-05,3.7e-05,2.8e-05,2.7e-05,1.4e-05,2.5e-05,9e-06,6e-06,7e-06,4e-05,1e-05,3.3e-05,8e-06,2.5e-05,8e-06,2e-05,1.5e-05,1.7e-05,3.2e-05,1.2e-05,3.4e-05,1.8e-05,3.6e-05,3.8e-05,3e-05,3.6e-05,8e-06,3.1e-05,2.1e-05,4.4e-05,1.2e-05,6e-06,1.2e-05,1.4e-05,3.4e-05,3e-05,3.9e-05,1.2e-05
2.3e-05,3.1e-05,4.4e-05,1.4e-05,2.1e-05,3e-05,2.4e-05,1.1e-05,1e-05,1.3e-05,5e-06,2.3e-05,4.3e-05,1.8e-05,4.5e-05,3.4e-05,1.6e-05,2.6e-05,4e-05,3.2e-05,2.4e-05,1.7e-05,1.5e-05,1.2e-05,8e-06,2.6e-05,2.9e-05,1.4e-05,3.5e-05,1.6e-05,3e-05,2.6e-05,3e-05,5.4e-05,5e-05,1.9e-05,5.5e-05,4.1e-05,2e-05,3.6e-05,5.1e-05,5.1e-05,3.2e-05,2e-05,2.9e-05,3.5e-05,5.4e-05,6.1e-05,8e-06,2.1e-05,8e-06,1.5e-05,6.1e-05,8.7e-05,8.2e-05,3e-05,2.3e-05,5e-05,4.6e-05,1.6e-05,4e-05,1e-06,6e-06,1.9e-05,3.2e-05,5.2e-05,2.9e-05,1.8e-05,3e-06,2.9e-05,6e-06,4.2e-05,5.8e-05,4.8e-05,4.1e-05,3.9e-05,2.5e-05,5.7e-05,1.5e-05,2.4e-05,2.9e-05,2.6e-05,3.7e-05,1.7e-05,4.6e-05,4.7e-05,3.2e-05,3.2e-05,2.9e-05,2.4e-05,4e-06,2.9e-05,3.6e-05,4.1e-05,2.4e-05,4e-05,4.1e-05,3.2e-05,3.9e-05,3.4e-05,3.7e-05,5.3e-05,5.1e-05,4.4e-05,3.7e-05,6.2e-05,3.1e-05,2.8e-05,3.2e-05,2.7e-05,6.3e-05,5.3e-05,7e-05,3.7e-05,5e-06,3.8e-05,1.2e-05,3.8e-05,2.6e-05,2.8e-05,5.4e-05
1.7e-05,1.5e-05,3.3e-05,3.9e-05,3.8e-05,2.8e-05,1.5e-05,3.4e-05,1.9e-05,8e-06,3.1e-05,3.6e-05,1.2e-05,2.4e-05,2.9e-05,2.7e-05,1.5e-05,2e-05,2.4e-05,1.6e-05,1.4e-05,9e-06,3.3e-05,2.6e-05,1.5e-05,2.4e-05,2.1e-05,3.3e-05,4.2e-05,5.7e-05,5.4e-05,4.5e-05,6.3e-05,7.6e-05,7.7e-05,7.9e-05,8.6e-05,5.4e-05,3.2e-05,3.5e-05,3.3e-05,1.5e-05,1e-05,1e-05,3.8e-05,1.3e-05,3.6e-05,5e-05,5.7e-05,1.9e-05,9e-06,1.4e-05,4.2e-05,5.3e-05,4e-06,3.1e-05,9e-06,3.5e-05,3.6e-05,3.6e-05,5.7e-05,5.4e-05,3.7e-05,2.3e-05,1.9e-05,3.4e-05,3.3e-05,3.4e-05,1.7e-05,4.4e-05,2.9e-05,3e-05,2.2e-05,4.4e-05,4.8e-05,3.4e-05,3.7e-05,2.3e-05,3e-05,1e-05,2.2e-05,2e-06,4.3e-05,4.5e-05,4.2e-05,4e-05,2.4e-05,2.7e-05,3.9e-05,6.3e-05,6e-05,7.7e-05,4.9e-05,5.8e-05,4.8e-05,5e-05,5.6e-05,6e-05,2.2e-05,1.5e-05,1.5e-05,5.3e-05,3e-05,5.3e-05,4.2e-05,4.9e-05,2.5e-05,4.9e-05,6.8e-05,5.3e-05,6.2e-05,5.7e-05,5.9e-05,7.2e-05,5.7e-05,3e-05,4.1e-05,5.5e-05,2.7e-05,3e-05,3.1e-05
1.3e-05,1.8e-05,2.3e-05,1.8e-05,1.7e-05,4e-06,6e-06,1.9e-05,7e-06,5e-06,2.3e-05,1.3e-05,2.4e-05,2.4e-05,3.7e-05,6e-06,9e-06,1.3e-05,1.3e-05,2.1e-05,1.4e-05,1e-05,3.4e-05,1.4e-05,1.5e-05,2e-06,1.8e-05,3.2e-05,6e-06,3.6e-05,1.6e-05,2.5e-05,2.6e-05,1.8e-05,3.3e-05,3.5e-05,1.3e-05,9e-06,5e-06,3.5e-05,1.7e-05,1e-05,1.2e-05,2.2e-05,2.6e-05,1.6e-05,1.8e-05,1.6e-05,1.9e-05,2.3e-05,6e-06,1.1e-05,3.5e-05,2.3e-05,1.3e-05,2.7e-05,3.1e-05,1.9e-05,5e-06,1.3e-05,2.4e-05,1.3e-05,1e-05,9e-06,1.7e-05,6e-06,1.9e-05,1.6e-05,2.2e-05,2.6e-05,2.4e-05,1.2e-05,1.4e-05,2.2e-05,3.6e-05,1.8e-05,2.3e-05,3.3e-05,4.8e-05,3.8e-05,4.7e-05,3.4e-05,2.6e-05,2.7e-05,3.4e-05,6.9e-05,4.8e-05,6e-06,2.1e-05,4.9e-05,2.7e-05,3.2e-05,4.3e-05,2.9e-05,6.1e-05,4.1e-05,4.6e-05,2.9e-05,2.7e-05,2e-06,1.9e-05,2.4e-05,3.2e-05,1e-05,2.9e-05,1.4e-05,1.7e-05,3.3e-05,6.9e-05,2.1e-05,3.9e-05,2.6e-05,4.4e-05,2.5e-05,2e-05,1.2e-05,2.5e-05,4e-05,1.9e-05,1.4e-05,3e-05
1.1e-05,1.1e-05,1.3e-05,7e-06,1.5e-05,1e-05,1e-06,9e-06,5e-06,8e-06,3e-06,9e-06,6e-06,7e-06,8e-06,1.1e-05,1.9e-05,1.2e-05,1.5e-05,1.6e-05,5e-06,1.8e-05,8e-06,9e-06,1e-05,1.9e-05,1.6e-05,1.6e-05,1e-05,1.8e-05,1.4e-05,9e-06,1.6e-05,2.4e-05,2e-06,1.7e-05,1.2e-05,2e-06,7e-06,1.6e-05,2.3e-05,1.8e-05,1.3e-05,1.7e-05,5e-06,1.4e-05,6e-06,7e-06,3e-06,2.5e-05,1.5e-05,9e-06,2.5e-05,9e-06,2.1e-05,1e-05,8e-06,1.5e-05,2e-05,1.6e-05,1.7e-05,1.9e-05,9e-06,6e-06,3e-06,8e-06,1.9e-05,1.4e-05,6e-06,9e-06,1.4e-05,2.1e-05,1.7e-05,1.4e-05,2.4e-05,8e-06,4e-06,6e-06,3e-05,1.9e-05,1.8e-05,2.2e-05,2.9e-05,1.6e-05,3e-05,1.7e-05,0,1.2e-05,2.7e-05,2e-05,1.5e-05,2.2e-05,2.5e-05,4.7e-05,1.2e-05,2e-05,9e-06,8e-06,1.2e-05,1.3e-05,8e-06,2e-05,3.2e-05,4.2e-05,2.9e-05,2.9e-05,2.4e-05,4.4e-05,1.8e-05,1.7e-05,1.5e-05,4e-06,1.4e-05,1e-05,2.9e-05,2.5e-05,9e-06,7e-06,1.3e-05,2.7e-05,1.8e-05
9e-06,1.1e-05,2.1e-05,1e-05,1e-05,5e-06,5e-06,6e-06,7e-06,1.2e-05,1e-05,5e-06,1.3e-05,5e-06,9e-06,1.5e-05,1e-05,7e-06,1.3e-05,1.3e-05,1.6e-05,1.2e-05,8e-06,8e-06,9e-06,1.9e-05,1.3e-05,7e-06,1.6e-05,2.3e-05,8e-06,8e-06,8e-06,1.9e-05,1.2e-05,1.4e-05,8e-06,8e-06,1e-05,1e-05,5e-06,5e-06,1.4e-05,3e-06,6e-06,1.3e-05,6e-06,9e-06,1.4e-05,1e-05,9e-06,1.3e-05,1.4e-05,1e-05,1.6e-05,1.5e-05,9e-06,9e-06,1.4e-05,1e-05,1.1e-05,1.8e-05,9e-06,1.1e-05,1.3e-05,1.5e-05,4e-06,1.2e-05,1.5e-05,1.7e-05,4e-06,1.9e-05,8e-06,5e-06,1.3e-05,1.7e-05,9e-06,1.2e-05,1.3e-05,1e-06,9e-06,1.5e-05,1.3e-05,7e-06,1.7e-05,2.2e-05,1.3e-05,9e-06,1.9e-05,9e-06,7e-06,1.2e-05,1e-05,1e-05,1.4e-05,1.7e-05,4e-06,1e-06,1.1e-05,2e-06,1.8e-05,1.7e-05,1.7e-05,1.9e-05,2e-06,8e-06,1.9e-05,1.5e-05,8e-06,1.2e-05,8e-06,1.2e-05,1.2e-05,1.6e-05,1.6e-05,9e-06,1.8e-05,1.2e-05,2e-05,1.2e-05,1.4e-05
7e-06,1.5e-05,2.1e-05,8e-06,5e-06,6e-06,0,1.1e-05,2e-06,1.1e-05,6e-06,6e-06,6e-06,1e-06,7e-06,1e-05,7e-06,5e-06,1e-05,1.7e-05,1.2e-05,4e-06,1e-06,4e-06,9e-06,1.9e-05,1.7e-05,2e-06,1.4e-05,1.6e-05,7e-06,4e-06,7e-06,1.4e-05,9e-06,9e-06,1.7e-05,2e-06,4e-06,3e-06,1.2e-05,4e-06,6e-06,5e-06,4e-06,1.2e-05,7e-06,1.8e-05,3e-06,7e-06,7e-06,5e-06,6e-06,1.1e-05,1.1e-05,3e-06,1.1e-05,7e-06,9e-06,2e-06,5e-06,9e-06,1e-05,4e-06,1.6e-05,9e-06,9e-06,4e-06,1e-05,1.1e-05,9e-06,1.2e-05,8e-06,1.2e-05,6e-06,7e-06,5e-06,9e-06,1.2e-05,3e-06,8e-06,1e-05,1.1e-05,2e-06,7e-06,1.3e-05,9e-06,0,3.1e-05,1.4e-05,1e-05,1.2e-05,7e-06,1.6e-05,9e-06,6e-06,4e-06,7e-06,1e-06,6e-06,1.8e-05,3e-06,1e-05,2.7e-05,1e-05,1.1e-05,1e-05,1.3e-05,1.3e-05,1.2e-05,9e-06,7e-06,1.7e-05,1.1e-05,1.7e-05,1e-05,2.4e-05,2e-06,8e-06,6e-06,2.4e-05
1e-05,6e-06,2e-05,9e-06,4e-06,7e-06,3e-06,9e-06,7e-06,9e-06,5e-06,2e-06,1e-05,3e-06,3e-06,7e-06,6e-06,9e-06,1.3e-05,9e-06,9e-06,1.2e-05,9e-06,1.1e-05,2e-06,1.3e-05,1e-06,1e-05,6e-06,2.8e-05,4e-06,3e-06,1e-06,8e-06,4e-06,2e-06,5e-06,1e-05,7e-06,7e-06,1.4e-05,3e-06,3e-06,3e-06,5e-06,1.2e-05,1.1e-05,7e-06,5e-06,5e-06,4e-06,3e-06,5e-06,6e-06,6e-06,9e-06,7e-06,9e-06,7e-06,6e-06,1e-06,1e-06,1.3e-05,1.8e-05,9e-06,5e-06,8e-06,1.3e-05,4e-06,1.3e-05,6e-06,1.5e-05,4e-06,4e-06,2e-06,8e-06,1e-05,6e-06,9e-06,5e-06,1.4e-05,7e-06,1.2e-05,1.1e-05,3e-06,1e-05,1.2e-05,7e-06,2.2e-05,1e-06,2e-06,1.2e-05,5e-06,2.1e-05,6e-06,1.4e-05,4e-06,7e-06,1e-06,9e-06,2e-06,6e-06,3e-06,2.5e-05,9e-06,1e-05,1.9e-05,1.4e-05,1.4e-05,1.3e-05,8e-06,1.4e-05,2e-06,1.7e-05,1.5e-05,1.3e-05,2.1e-05,1.6e-05,1.6e-05,6e-06,9e-06
9e-06,1.1e-05,1.6e-05,1.1e-05,5e-06,5e-06,7e-06,8e-06,2e-06,4e-06,1e-05,9e-06,5e-06,3e-06,1.3e-05,8e-06,4e-06,5e-06,3e-06,6e-06,9e-06,1.1e-05,8e-06,4e-06,7e-06,4e-06,6e-06,3e-06,8e-06,2e-05,1.4e-05,6e-06,4e-06,1.2e-05,9e-06,9e-06,3e-06,1e-05,1.3e-05,2e-06,3e-06,1.4e-05,6e-06,4e-06,8e-06,1.1e-05,4e-06,8e-06,8e-06,1.2e-05,7e-06,5e-06,6e-06,1e-05,5e-06,1.3e-05,2e-06,1.2e-05,1.3e-05,9e-06,7e-06,8e-06,1e-05,1.3e-05,6e-06,1e-05,5e-06,2.6e-05,1.7e-05,1.1e-05,2e-05,1.6e-05,2.3e-05,1.4e-05,3e-06,1.9e-05,1.2e-05,8e-06,1.2e-05,2e-06,1.2e-05,2e-06,1.3e-05,8e-06,7e-06,3e-06,9e-06,1e-05,9e-06,1.4e-05,1.5e-05,2e-05,1.5e-05,1.7e-05,8e-06,1e-05,9e-06,9e-06,8e-06,8e-06,6e-06,7e-06,1.2e-05,1.5e-05,1.2e-05,5e-06,1.5e-05,1e-05,2e-06,9e-06,1.2e-05,1.3e-05,9e-06,1.4e-05,2.4e-05,1.6e-05,2.9e-05,1.2e-05,1.2e-05,1.1e-05,1e-05
5e-06,6e-06,1.3e-05,4e-06,5e-06,5e-06,3e-06,4e-06,3e-06,3e-06,6e-06,8e-06,1.1e-05,7e-06,1e-05,9e-06,5e-06,9e-06,9e-06,1.3e-05,6e-06,9e-06,7e-06,2e-06,6e-06,8e-06,3e-06,0,3e-06,8e-06,7e-06,6e-06,1.1e-05,1.4e-05,1e-05,2e-06,3e-06,1e-05,1.7e-05,1.4e-05,1.3e-05,1.1e-05,8e-06,7e-06,5e-06,1.7e-05,1.2e-05,8e-06,8e-06,5e-06,6e-06,3e-06,7e-06,8e-06,2e-06,1.5e-05,7e-06,5e-06,9e-06,1e-05,5e-06,6e-06,7e-06,3e-06,1.1e-05,1.7e-05,6e-06,1.9e-05,1.3e-05,6e-06,1.7e-05,8e-06,1.4e-05,5e-06,9e-06,1.4e-05,6e-06,9e-06,7e-06,4e-06,1e-05,8e-06,7e-06,3e-06,9e-06,8e-06,9e-06,7e-06,1.3e-05,1.6e-05,1.4e-05,1.5e-05,2.1e-05,3.3e-05,5e-06,4e-06,1.2e-05,4e-06,1.2e-05,8e-06,1e-05,6e-06,1.7e-05,2.7e-05,5e-06,1.6e-05,5e-06,7e-06,1.2e-05,3e-06,1e-05,1.6e-05,1.9e-05,7e-06,8e-06,1.3e-05,1e-05,8e-06,1.6e-05,1.4e-05,2.7e-05
8e-06,1.2e-05,5e-06,1.2e-05,6e-06,6e-06,1e-06,9e-06,4e-06,6e-06,8e-06,1e-05,6e-06,5e-06,6e-06,7e-06,7e-06,7e-06,7e-06,7e-06,1.3e-05,1.1e-05,1e-05,7e-06,1e-05,5e-06,5e-06,5e-06,1e-05,5e-06,7e-06,6e-06,1.6e-05,1.4e-05,5e-06,1e-06,6e-06,3e-06,1.3e-05,5e-06,1e-05,1.3e-05,0,2e-06,3e-06,1.5e-05,3e-06,6e-06,4e-06,8e-06,3e-06,3e-06,5e-06,1e-05,7e-06,7e-06,1.4e-05,4e-06,1e-05,4e-06,6e-06,7e-06,7e-06,9e-06,4e-06,1.3e-05,1.9e-05,1.5e-05,1.5e-05,7e-06,9e-06,5e-06,6e-06,6e-06,1.5e-05,1.7e-05,1.1e-05,6e-06,1.9e-05,1.3e-05,3e-06,3e-06,4e-06,3e-06,1.1e-05,1e-05,4e-06,5e-06,1e-05,1.8e-05,7e-06,1.2e-05,9e-06,2e-05,1.9e-05,5e-06,7e-06,5e-06,1.4e-05,6e-06,1.3e-05,5e-06,9e-06,1.5e-05,1.5e-05,2e-05,9e-06,6e-06,1.2e-05,1.2e-05,8e-06,1e-05,1.3e-05,1.9e-05,4e-06,5e-06,8e-06,4e-06,1.8e-05,1.6e-05,2.4e-05
1.4e-05,2e-05,1.2e-05,8e-06,1.1e-05,6e-06,5e-06,1.4e-05,1e-05,5e-06,9e-06,1e-05,1.4e-05,1.2e-05,1.2e-05,1.8e-05,8e-06,6e-06,2e-06,6e-06,9e-06,4e-06,3e-06,3e-06,2e-06,7e-06,9e-06,9e-06,8e-06,1e-05,8e-06,8e-06,1.2e-05,2e-05,3e-06,4e-06,7e-06,1.1e-05,1.3e-05,1.1e-05,1.2e-05,5e-06,7e-06,5e-06,7e-06,1.3e-05,1.9e-05,1.1e-05,1.7e-05,2.5e-05,9e-06,5e-06,8e-06,7e-06,5e-06,3e-06,2e-06,1.4e-05,3e-06,3e-06,6e-06,3e-06,9e-06,9e-06,9e-06,1.6e-05,8e-06,9e-06,1.4e-05,5e-06,2e-06,1.3e-05,1e-05,1.3e-05,9e-06,9e-06,1e-06,9e-06,1.9e-05,1e-05,1.4e-05,9e-06,9e-06,1e-05,1.8e-05,2e-05,2.5e-05,3e-06,2.6e-05,1.7e-05,1.7e-05,1.5e-05,8e-06,5e-06,2e-06,9e-06,1.7e-05,3e-06,1.2e-05,1.5e-05,2.4e-05,7e-06,1.9e-05,1.7e-05,9e-06,2.2e-05,3e-06,2.3e-05,1.8e-05,2e-06,1.4e-05,2.2e-05,6e-06,1e-05,1.1e-05,1.4e-05,5e-06,2e-06,7e-06,3e-05,7e-06
1.1e-05,5e-06,5e-06,5e-06,7e-06,1.3e-05,7e-06,1.1e-05,1.6e-05,2.1e-05,4e-06,8e-06,1.8e-05,8e-06,9e-06,2.9e-05,1.8e-05,7e-06,6e-06,7e-06,1.5e-05,1.4e-05,1.4e-05,6e-06,6e-06,7e-06,1.3e-05,2.3e-05,2.2e-05,7e-06,9e-06,4e-06,1.5e-05,1e-05,1.5e-05,7e-06,3e-06,1.7e-05,1.5e-05,1.5e-05,1.9e-05,2e-05,1.3e-05,1.2e-05,1.6e-05,3.1e-05,1.5e-05,5e-06,1.2e-05,1.4e-05,5e-06,5e-06,1.3e-05,1.8e-05,1.4e-05,5e-06,1e-05,1.8e-05,1.6e-05,1.4e-05,6e-06,6e-06,1e-05,9e-06,2.1e-05,1e-06,9e-06,1.1e-05,1.5e-05,1.1e-05,1.2e-05,2.6e-05,1e-05,1.5e-05,1.8e-05,1.3e-05,1.4e-05,2e-05,3e-06,1.9e-05,2.8e-05,1.2e-05,4e-06,1.1e-05,1.7e-05,1.7e-05,2.3e-05,2.5e-05,4.6e-05,2.9e-05,2.3e-05,9e-06,3.3e-05,1.3e-05,1.6e-05,1.5e-05,3.5e-05,3e-05,3e-06,1.1e-05,3e-05,3.8e-05,7e-06,7e-06,1e-05,1.4e-05,1.8e-05,3.8e-05,5.2e-05,3.7e-05,1e-05,8e-06,1e-05,1.2e-05,1e-06,2.3e-05,8e-06,3e-06,1.3e-05,4.4e-05,3.8e-05
2e-06,5e-06,9e-06,4e-06,4e-06,2.2e-05,1.3e-05,1.6e-05,4e-06,1.4e-05,8e-06,1.2e-05,1.2e-05,1.1e-05,5e-06,1.9e-05,1.1e-05,8e-06,8e-06,1.5e-05,2.1e-05,2e-05,5e-06,6e-06,2e-06,4e-06,1.4e-05,2.7e-05,2.7e-05,2.4e-05,1.7e-05,1.2e-05,1.8e-05,1.9e-05,1.3e-05,9e-06,6e-06,2.3e-05,1.7e-05,1.3e-05,1.4e-05,1.2e-05,6e-06,1.8e-05,2e-06,2.3e-05,3e-05,2.6e-05,1.3e-05,2.3e-05,1.7e-05,1.9e-05,1.9e-05,7e-06,1.4e-05,1.6e-05,2.2e-05,1.3e-05,7e-06,1.3e-05,1.4e-05,1.1e-05,3e-06,7e-06,1.2e-05,1.2e-05,1.2e-05,1e-05,1.9e-05,1.4e-05,5e-06,2.3e-05,2.2e-05,6e-06,1.4e-05,2.2e-05,2.6e-05,1.9e-05,2.2e-05,1.5e-05,9e-06,1.1e-05,9e-06,1.6e-05,3.2e-05,3.9e-05,5.1e-05,5.2e-05,2.5e-05,1.6e-05,1.9e-05,2.9e-05,3.3e-05,3.2e-05,4e-06,2e-05,3.5e-05,3.3e-05,3.7e-05,3e-05,4.1e-05,5.2e-05,5.4e-05,5.2e-05,3.5e-05,2.4e-05,9e-06,3.1e-05,2.8e-05,4e-06,9e-06,1.2e-05,1.6e-05,1.8e-05,2.8e-05,2.6e-05,3.1e-05,2.8e-05,3.8e-05,2e-05,1.7e-05
1e-06,1e-05,1e-05,6e-06,5e-06,1.1e-05,4e-06,9e-06,9e-06,4e-06,3e-06,3e-06,8e-06,3e-06,6e-06,1.1e-05,7e-06,2e-06,9e-06,6e-06,4e-06,6e-06,5e-06,3e-06,3e-06,4e-06,7e-06,1.3e-05,8e-06,7e-06,7e-06,4e-06,7e-06,7e-06,3e-06,3e-06,9e-06,1e-05,9e-06,6e-06,7e-06,1e-06,9e-06,7e-06,9e-06,1.6e-05,1.4e-05,2e-06,8e-06,1.1e-05,9e-06,5e-06,6e-06,6e-06,5e-06,3e-06,9e-06,1.1e-05,6e-06,4e-06,6e-06,1e-06,6e-06,6e-06,3e-06,5e-06,5e-06,1.2e-05,9e-06,3e-06,8e-06,1.2e-05,9e-06,1.3e-05,8e-06,7e-06,7e-06,1.2e-05,1.1e-05,1.1e-05,1e-05,3e-06,9e-06,1.7e-05,1.4e-05,1e-05,2.1e-05,1.5e-05,7e-06,1.4e-05,7e-06,1.5e-05,1.1e-05,9e-06,8e-06,2.5e-05,2e-06,1.4e-05,1.2e-05,6e-06,1.6e-05,1.3e-05,1.5e-05,1.4e-05,9e-06,4e-06,9e-06,1.7e-05,8e-06,4e-06,5e-06,1.4e-05,8e-06,5e-06,2.1e-05,9e-06,1.9e-05,9e-06,1.6e-05,1.1e-05,9e-06
1e-06,9e-06,4e-06,4e-06,3e-06,5e-06,1e-06,5e-06,7e-06,5e-06,2e-06,1e-06,5e-06,0,2e-06,9e-06,1e-06,1e-06,6e-06,3e-06,2e-06,3e-06,0,3e-06,1e-06,0,0,1.1e-05,3e-06,8e-06,1e-06,3e-06,5e-06,5e-06,5e-06,1e-06,7e-06,5e-06,1e-06,4e-06,7e-06,3e-06,2e-06,6e-06,6e-06,1.5e-05,4e-06,4e-06,5e-06,8e-06,4e-06,7e-06,3e-06,2e-06,2e-06,4e-06,2e-06,7e-06,3e-06,1e-06,7e-06,4e-06,3e-06,3e-06,5e-06,5e-06,4e-06,7e-06,5e-06,4e-06,5e-06,8e-06,1e-06,5e-06,4e-06,4e-06,6e-06,4e-06,5e-06,8e-06,5e-06,2e-06,7e-06,8e-06,3e-06,4e-06,1.4e-05,1e-05,5e-06,1e-05,2e-06,1.3e-05,4e-06,6e-06,1e-06,1.3e-05,7e-06,8e-06,4e-06,3e-06,5e-06,6e-06,6e-06,4e-06,4e-06,3e-06,4e-06,1e-05,7e-06,4e-06,9e-06,5e-06,5e-06,6e-06,1.5e-05,9e-06,8e-06,4e-06,1.3e-05,4e-06,1e-05
0,7e-06,4e-06,4e-06,3e-06,5e-06,1e-06,5e-06,6e-06,4e-06,2e-06,0,4e-06,1e-06,2e-06,7e-06,3e-06,1e-06,5e-06,2e-06,1e-06,2e-06,2e-06,2e-06,1e-06,2e-06,1e-06,1e-05,2e-06,7e-06,2e-06,1e-06,3e-06,7e-06,5e-06,1e-06,7e-06,3e-06,3e-06,1e-06,6e-06,4e-06,2e-06,6e-06,5e-06,1.1e-05,2e-06,6e-06,4e-06,8e-06,1e-06,3e-06,1e-06,3e-06,2e-06,3e-06,3e-06,6e-06,3e-06,1e-06,5e-06,3e-06,4e-06,3e-06,5e-06,3e-06,5e-06,4e-06,1e-06,2e-06,2e-06,5e-06,2e-06,1e-06,3e-06,3e-06,8e-06,3e-06,2e-06,6e-06,3e-06,1e-06,3e-06,8e-06,1e-06,1e-06,9e-06,9e-06,6e-06,9e-06,2e-06,9e-06,2e-06,7e-06,1e-06,9e-06,4e-06,5e-06,5e-06,2e-06,4e-06,5e-06,6e-06,7e-06,5e-06,4e-06,2e-06,9e-06,6e-06,5e-06,7e-06,6e-06,4e-06,2e-06,1.2e-05,5e-06,1.6e-05,7e-06,1.4e-05,2e-06,8e-06
2e-06,8e-06,5e-06,4e-06,3e-06,5e-06,1e-06,4e-06,6e-06,4e-06,2e-06,0,5e-06,1e-06,2e-06,5e-06,3e-06,2e-06,5e-06,0,0,1e-06,1e-06,3e-06,1e-06,2e-06,1e-06,9e-06,1e-06,7e-06,2e-06,0,3e-06,6e-06,4e-06,1e-06,6e-06,2e-06,2e-06,1e-06,5e-06,4e-06,1e-06,6e-06,4e-06,1e-05,2e-06,5e-06,3e-06,7e-06,1e-06,4e-06,1e-06,2e-06,0,2e-06,1e-06,6e-06,2e-06,0,4e-06,3e-06,4e-06,4e-06,4e-06,3e-06,4e-06,3e-06,1e-06,2e-06,3e-06,4e-06,1e-06,1e-06,3e-06,2e-06,7e-06,3e-06,1e-06,5e-06,3e-06,1e-06,3e-06,7e-06,1e-06,0,7e-06,7e-06,5e-06,7e-06,2e-06,9e-06,1e-06,7e-06,1e-06,8e-06,2e-06,5e-06,3e-06,1e-06,2e-06,4e-06,4e-06,6e-06,3e-06,4e-06,1e-06,8e-06,6e-06,4e-06,5e-06,6e-06,2e-06,2e-06,1.2e-05,5e-06,1.8e-05,1e-06,1.3e-05,2e-06,8e-06
