4.2e-05,5.5e-05,8.6e-05,0.000244,5e-06,6.9e-05,3.2e-05,1.5e-05,2.6e-05,9.6e-05,8.2e-05,0.000272,5.4e-05,1e-05,2.4e-05,0.000146,4.7e-05,6.7e-05,6.1e-05,1.3e-05,8.1e-05,4.6e-05,7.2e-05,5.1e-05,4.2e-05,5.1e-05,8.1e-05,7.8e-05,0.00014,1.2e-05,9.7e-05,6e-06,5.1e-05,3.6e-05,2.3e-05,1e-05,2.9e-05,1.7e-05,7e-06,0.00017,8.4e-05,1.9e-05,1.2e-05,2.6e-05,0,4.8e-05,9.1e-05,6e-06,0.000114,2.8e-05,7.7e-05,0.000146,1e-05,2.1e-05,4.3e-05,2.1e-05,1.7e-05,2.2e-05,6.9e-05,6.8e-05,8.5e-05,1e-04,3.9e-05,4e-06,0.000109,3.5e-05,0.000106,7.1e-05,3.9e-05,5e-06,3e-06,1.3e-05,1.2e-05,1.7e-05,5.1e-05,1.6e-05,4e-05,0.000105,4.6e-05,1.8e-05,7.6e-05,4.7e-05,5e-05,2.1e-05,1.3e-05,5.1e-05,1e-05,1.1e-05,1.2e-05,5.4e-05,3.5e-05,4.9e-05,6.9e-05,5.8e-05,4e-05,1.5e-05,3e-06,4.7e-05,8.4e-05,9e-06,2.3e-05,7.9e-05,1.7e-05,0.000145,4e-06,1.9e-05,0.000101,1.5e-05,1e-06,2.6e-05,1.1e-05,5e-05,0.000105,0.000113,0.000113,4.6e-05,8e-06,3.5e-05,2.6e-05,3.5e-05,3e-05
0.000114,0.000264,0.00017,0.000471,7.7e-05,0.000176,0.000136,4e-05,0.000153,0.000251,0.000137,0.000504,3.9e-05,9.4e-05,0.000118,0.000252,0.000145,9.5e-05,0.000174,0.000121,0.000206,0.000165,0.000258,0.000192,0.00035,0.000116,0.000207,0.000294,0.000369,6.9e-05,0.000106,9.6e-05,0.000296,0.000112,0.000113,8e-05,8.6e-05,0.000162,0.000151,0.000185,0.000249,9.6e-05,7e-05,0.000126,0.000141,0.000103,0.000234,0.000133,0.000246,5.2e-05,0.000174,0.000335,0.000111,7.9e-05,8.2e-05,6.3e-05,5.7e-05,6.6e-05,0.000235,0.000119,0.000141,0.000125,0.000145,0.000126,0.000266,9.8e-05,0.000102,0.000174,0.000191,6.7e-05,9.6e-05,5e-05,4.9e-05,4.7e-05,0.000108,4.7e-05,0.000112,0.000275,9.9e-05,3.9e-05,0.000101,0.000185,0.000224,0.000108,4.5e-05,3.3e-05,3.8e-05,9.1e-05,7.4e-05,0.000202,9e-05,0.000135,0.000196,3.8e-05,5.9e-05,8.9e-05,9e-05,0.000148,0.000208,0.000221,0.000236,0.000302,5.2e-05,0.000157,0.000183,0.000182,0.000113,2.9e-05,5.2e-05,6.1e-05,3.3e-05,0.000178,0.000225,0.000289,0.000307,0.000167,4.3e-05,2.2e-05,7.1e-05,2.1e-05,0.000128
0.000165,0.000753,0.00043,0.000475,0.000192,0.000307,0.000265,0.000353,9.3e-05,0.000295,0.00013,0.000975,0.000101,0.000526,0.000392,0.000614,0.000275,0.000114,0.000205,0.000372,0.000371,0.000132,0.000217,8.1e-05,0.000625,0.000388,0.00023,0.000349,0.000503,0.000308,0.000182,0.000147,0.000136,0.000357,0.000213,9.9e-05,8.1e-05,0.000116,0.000118,0.00019,0.000155,0.000403,8.6e-05,0.000128,0.000158,8.9e-05,0.000432,0.000371,0.000273,0.000284,0.000285,0.000205,0.000131,0.00019,0.00016,0.000216,0.000123,3.6e-05,0.000379,0.000248,0.00023,0.000233,0.000153,0.000227,0.000399,0.000176,0.000315,0.000217,3.7e-05,9e-05,0.000255,0.000129,0.000238,0.000123,0.000246,0.000179,0.000191,3e-04,7.7e-05,2.6e-05,6.3e-05,0.000219,0.000104,8.9e-05,0.000101,0.000136,0.000163,0.000233,5.6e-05,0.000321,0.000108,0.000186,0.000123,1e-05,0.000134,7.8e-05,0.000101,0.000112,0.000117,0.000198,0.000132,0.000339,0.000219,0.000255,0.000208,0.000126,0.000293,5.1e-05,8.6e-05,0.00023,0.000134,0.000236,0.000164,0.000276,0.000229,0.000138,0.000106,1.8e-05,0.000199,3.6e-05,0.000169
0.000633,0.000728,0.000608,0.000297,0.000822,0.000161,0.000249,0.000392,0.000444,0.000335,0.000277,0.001187,0.001295,0.000186,0.000627,0.000891,0.00044,0.000537,0.000295,0.001002,0.000274,0.000572,0.000518,0.000581,0.000845,0.000766,0.000288,0.000804,7.7e-05,0.000285,0.000233,0.000154,0.000576,0.000729,0.000487,0.000427,0.000553,0.000312,0.000388,0.000331,8.7e-05,0.00044,0.000539,0.000376,0.000375,0.000378,0.000651,0.000238,0.000595,0.000706,0.000272,0.000659,0.000192,0.000622,0.00064,0.000215,0.000367,0.000138,0.00056,0.000543,0.000191,0.000141,0.000346,0.000154,0.000757,0.000129,0.000618,7.6e-05,0.000365,0.000328,0.000209,0.000538,8.1e-05,2e-04,0.000276,0.000183,0.000196,0.000632,0.000277,0.000292,4.9e-05,0.00032,0.000476,0.000197,0.000247,0.000257,0.000357,0.000291,0.000604,0.000584,8.3e-05,0.000163,0.000272,0.00019,0.000155,0.00026,9.9e-05,0.000381,0.00033,1e-04,0.000416,0.000391,2e-04,0.000429,0.000358,0.000371,0.000405,0.000255,5.9e-05,0.000419,0.000189,0.000509,0.000471,0.000286,0.00047,0.000607,0.000186,0.000134,0.000275,0.000432,0.000143
0.00077,0.000803,0.001298,0.001295,0.001819,0.001278,0.00121,0.000644,0.000489,0.001149,0.000878,0.001461,0.002084,0.001894,0.002059,0.002083,0.001235,0.000555,0.000734,0.001591,0.002124,0.001906,0.000879,0.000318,0.001381,0.001819,0.001286,0.001292,0.001023,0.00082,0.000865,0.000489,0.000973,0.0015,0.001339,0.001092,0.000231,0.000624,0.000563,0.000792,0.000697,0.000412,0.000246,0.000212,0.000246,0.00071,0.000734,0.00106,0.00097,0.000936,0.000983,0.001687,0.001477,0.001142,0.000825,0.001235,0.001185,0.000826,0.00084,0.001123,0.000625,0.000114,0.000832,0.000845,0.000956,0.000995,0.000724,0.000812,0.000627,0.000343,0.000485,0.000678,0.000743,0.000544,0.000351,0.000462,0.000295,0.000449,0.000534,0.000622,0.000497,0.000169,0.000453,4e-04,0.000648,0.00065,0.000681,0.00041,0.000868,0.00083,0.000862,0.000353,0.000387,0.000773,0.000625,0.000634,0.000453,0.000679,0.000536,0.000537,0.000485,0.000371,2.8e-05,0.000545,0.00059,0.000277,0.000468,0.000593,0.000422,0.000707,0.000477,9e-04,0.000302,0.000317,0.001017,0.001299,0.000954,0.000426,0.000575,0.000916,0.000708
0.000195,0.000678,0.000268,0.000274,0.001063,0.000694,0.000488,0.000242,0.000599,0.000468,0.000642,0.000543,0.000888,0.000407,0.00118,0.000622,0.000103,9.1e-05,0.000421,0.000882,0.001285,0.000574,0.000447,0.000509,0.001383,0.000725,8.6e-05,0.000638,0.000666,0.00075,0.000144,0.000179,0.000378,0.000799,0.000239,0.000835,0.00046,0.000834,0.000867,0.000825,0.000638,0.000434,0.000108,0.000154,0.000386,0.000557,0.001178,0.000944,0.000338,0.000704,0.000482,0.000871,0.000884,0.000423,0.000393,0.000851,0.000626,0.000323,0.00067,0.000712,0.000354,0.000459,0.001,0.000538,0.000328,0.000378,0.000513,0.000676,0.000459,0.000364,8.1e-05,0.000347,0.000339,0.000162,0.000381,0.000781,0.000518,5.5e-05,0.000266,0.000274,9.7e-05,0.000286,0.000192,7.1e-05,0.000454,0.000451,0.000166,3.9e-05,0.00053,3.9e-05,0.000434,8.8e-05,0.00039,0.000637,0.000549,0.00025,0.000384,0.000256,0.000188,0.000394,0.000319,0.000533,0.000412,0.000131,0.000222,8.4e-05,0.000544,0.000265,0.000184,0.000388,0.000217,0.000364,0.000209,0.000129,0.000722,0.000415,0.000297,0.000358,0.000451,0.000435,0.000239
0.000642,0.001103,0.000386,0.000221,0.000892,0.00026,0.000642,0.000144,0.000613,0.00044,0.000476,0.000683,0.000459,0.000459,0.000799,8.5e-05,0.000189,0.000176,0.000438,9.8e-05,0.000968,0.000466,0.000222,0.000395,0.000902,0.000327,0.000309,0.000452,0.000649,0.000602,0.000722,0.000131,0.000402,0.000133,0.000468,0.000986,0.000459,0.000671,0.000111,0.000702,0.00039,0.000176,0.000238,0.000117,0.00032,0.000866,0.000506,0.00038,0.000597,0.000332,0.000426,0.000757,0.000247,0.000318,0.000339,0.000761,0.000413,0.000422,0.000334,0.000437,0.00036,0.000353,0.00062,0.000648,3.7e-05,0.000172,0.000311,0.000427,0.000305,0.000341,0.000139,0.000297,0.000102,0.000322,0.000564,0.000202,0.000293,0.00035,8.6e-05,6.3e-05,0.000296,0.000329,7.2e-05,0.00014,0.000201,0.00024,0.000263,0.000196,0.000185,4e-05,0.000119,0.000209,0.000436,0.000619,4.1e-05,0.000358,0.000265,0.000375,0.000447,0.000398,0.000349,0.000402,0.000134,4.6e-05,0.000105,0.000327,0.000243,0.000263,0.000173,0.000415,0.000533,0.000475,9.8e-05,0.000553,6.1e-05,0.000463,0.000161,0.000242,0.000545,0.00047,0.000298
0.001311,0.000601,0.000874,0.00063,0.001528,0.001213,0.001125,0.001164,0.000354,0.000224,0.000421,0.000259,0.000708,0.000739,0.000699,0.000656,0.000695,0.000657,0.000653,0.000145,0.000421,0.000497,0.000556,0.000307,0.000727,0.000244,0.000101,0.000706,0.001005,0.000802,0.000885,0.00091,0.000615,0.000875,0.000992,0.000527,0.000553,0.000451,0.000475,0.000757,0.00078,0.000898,0.000823,0.000494,0.000533,0.000766,0.001085,0.000703,0.001053,0.001334,0.00089,0.00022,0.000427,0.000793,0.000931,0.001501,0.000358,0.000811,0.001005,0.0012,0.000537,0.000442,0.000585,0.001346,0.000785,0.000594,0.000621,0.00044,0.000175,0.000587,0.00062,0.000295,0.000506,0.000653,2.7e-05,0.000116,0.000392,0.000902,8e-04,3e-04,0.000429,0.000883,0.000557,0.000231,0.00032,0.000455,0.000227,0.00042,0.000938,0.000237,0.000558,0.000458,0.000516,0.000296,0.000487,0.000519,0.000365,0.000109,0.000257,0.000706,0.00033,0.00081,0.000687,0.000403,0.000481,0.000763,0.000326,0.000514,0.00047,0.00013,0.000799,0.000294,0.000574,0.000811,0.001173,0.000748,0.000504,0.00024,0.000338,0.000432,0.000274
0.001203,0.002128,0.001677,0.000903,0.001493,0.001108,0.001456,0.001465,0.001458,0.001302,0.000523,0.000253,0.000394,0.000159,0.000262,0.00038,0.000471,0.00055,0.000306,0.000607,0.000549,0.000998,0.000785,0.000357,0.000323,0.000585,0.000281,0.000611,0.000574,0.001248,0.000734,0.000812,0.001055,0.000892,0.000295,0.000234,0.000482,0.000429,0.000842,0.001364,0.000544,0.000733,0.00074,0.000341,0.000377,0.000176,0.00094,0.000454,0.000378,0.000938,0.000917,0.000688,0.000469,0.001085,0.000577,0.00065,0.000912,0.001047,0.000218,0.000633,0.00064,0.000887,0.001296,0.001845,0.001178,0.00048,0.000928,0.000501,0.000662,0.000702,0.001142,0.000837,0.000882,0.000341,0.000108,0.000145,0.000458,0.001369,0.001543,0.001099,0.000728,0.000885,0.000546,0.00014,0.000511,0.000201,0.000151,0.000534,0.000938,0.00081,0.001126,0.000702,0.000348,0.000416,0.000538,0.000694,0.000629,0.00071,3e-04,0.000691,0.001136,0.001372,0.000844,0.000341,0.000555,0.000862,0.000831,0.000712,0.00048,0.000604,0.000855,0.001351,0.001061,0.000451,0.000792,6e-04,0.000328,0.00015,0.000374,0.000592,0.000147
0.000761,0.000842,0.000661,0.000106,0.00039,0.00047,0.000655,0.000491,0.000401,0.000427,0.000563,0.000754,0.000482,0.000214,0.000402,0.000406,0.000456,0.000297,7.4e-05,0.000797,0.000761,0.000197,0.000194,0.000318,0.000242,0.000651,0.000498,0.000387,0.00073,0.000387,0.000693,0.000279,0.000545,0.000743,0.000688,0.000353,0.000495,0.000801,0.000608,0.000457,0.000394,0.000415,0.000309,0.000165,0.00021,0.000276,0.000642,0.000312,0.00011,0.000611,7.5e-05,0.000301,8.4e-05,0.000443,0.000257,0.000547,0.000217,8.5e-05,0.000189,0.000433,0.000505,0.000588,0.000461,0.000793,0.000363,0.000276,0.00026,0.00035,0.000499,0.000341,0.000566,0.000937,0.000183,0.000399,0.000361,0.000276,0.00049,0.000724,0.000571,0.00033,0.000265,0.000298,0.000122,0.000401,0.000284,8.9e-05,0.000248,0.000415,0.000322,0.000533,0.000633,0.00044,0.000211,0.000289,0.000337,0.000541,0.000325,0.000301,0.000419,0.000561,0.000585,0.00059,0.000189,0.000266,0.00043,0.000346,0.000473,0.000291,0.000433,0.000337,0.000207,0.000657,0.000158,0.000164,0.000684,0.00057,9.7e-05,0.000168,0.000287,0.000359,0.000401
0.000513,0.000553,0.000285,0.000451,0.00084,0.000677,0.000783,0.000267,0.000231,0.000706,0.000378,0.000611,0.000711,0.000608,0.000331,0.000281,0.000237,9.7e-05,0.000265,0.00082,0.000456,0.000222,0.000271,0.000345,0.000536,0.000442,0.000552,0.00064,0.000458,0.000383,0.000223,0.000425,0.000225,0.000397,0.000556,0.000583,0.000128,0.000472,0.000107,0.000494,0.000478,9.3e-05,0.000123,3.1e-05,0.000114,0.000164,0.000632,0.000722,0.000307,0.000334,0.000522,6e-04,0.000502,0.000282,7.2e-05,0.000379,0.000823,0.000667,0.00031,0.000303,0.000437,0.000534,0.00063,9.7e-05,0.000364,0.000403,0.00018,0.000377,0.000252,0.000507,0.000459,0.000613,0.000503,0.000327,0.000493,0.000421,0.000248,0.000247,0.000503,0.000806,0.000581,0.000453,0.000378,0.00017,0.000435,0.000207,0.000333,0.000251,0.00017,0.000319,0.000601,0.000236,0.000185,0.00029,7.2e-05,0.00046,0.000355,0.000146,0.000311,0.000337,0.000282,6e-04,0.00062,0.00078,0.000633,0.000657,0.000468,0.000272,0.000309,0.000294,0.000146,0.000205,0.000222,0.000337,0.00065,0.000164,0.000213,0.00037,0.000271,0.000378,0.000247
0.000302,0.000161,0.000234,0.000122,0.000759,0.00035,0.000258,0.000353,0.000417,0.000662,0.000284,0.000649,0.000183,0.000152,0.00024,0.000329,0.000365,0.000117,0.00022,0.000428,0.000156,9.8e-05,7e-05,0.000337,9.6e-05,0.000291,0.000235,0.000256,6.3e-05,0.000162,0.00022,0.00017,6.8e-05,7.1e-05,0.000175,0.000288,0.000115,0.000301,9.2e-05,0.000422,0.000259,0.000344,0.000262,0.000246,0.000239,0.000114,0.000235,0.00035,0.000478,0.000688,0.000613,0.000225,0.000129,0.000149,0.000112,0.000243,0.000398,0.000279,0.000274,0.000197,8.6e-05,0.000338,0.000403,0.000187,0.000282,0.000488,0.000381,0.000273,0.000302,0.000228,0.000298,0.000187,0.000242,4.6e-05,0.000233,7.3e-05,0.000343,0.000399,0.000297,0.00045,0.000123,0.00023,0.000151,0.000131,0.000281,6.9e-05,0.00016,0.000341,0.000382,0.000146,0.000277,0.000106,0.000265,6.9e-05,0.000116,0.000159,7.3e-05,0.00014,0.000211,0.000212,0.000132,8.5e-05,0.000371,0.000476,0.000166,0.000251,0.000379,0.000309,0.000472,0.000358,0.000407,0.000353,0.000266,0.000316,0.000453,0.000277,0.00025,0.000251,8.9e-05,0.00011,4.5e-05
0.000454,0.000371,0.000254,0.000359,0.000332,0.000174,4.2e-05,0.000297,7.5e-05,0.000136,0.000175,0.000269,0.000142,0.000308,0.000159,0.000215,8e-05,0.000131,0.000149,0.000268,4.9e-05,0.000104,2.9e-05,7.3e-05,0.000172,0.000109,0.00016,0.000135,8.8e-05,0.000172,0.000168,0.000193,0.000234,0.000284,7.9e-05,0.000328,0.000206,0.000278,3.5e-05,9.2e-05,0.000163,0.000255,0.000231,4e-05,0.000114,0.000113,0.000106,0.000126,0.000181,0.000193,0.000137,0.00015,6.5e-05,0.000204,3.3e-05,0.000211,0.000299,0.000135,0.000102,0.000141,0.000162,7.6e-05,0.000223,0.000146,0.000141,0.000242,0.000233,5.5e-05,8.3e-05,0.000241,0.000211,0.000252,0.000146,6.8e-05,4.9e-05,0.000109,0.000169,0.00019,9.8e-05,0.000244,0.000186,0.000128,0.000152,1.6e-05,0.000263,7.4e-05,0.000126,0.000355,0.000123,0.000111,6.9e-05,8.3e-05,0.000172,0.000161,0.000141,0.000162,3.4e-05,0.000166,0.000175,0.000287,1.6e-05,9e-05,0.000315,5.7e-05,0.000175,8.2e-05,0.00035,0.000157,0.000189,0.000244,0.000372,0.000154,0.000183,0.000295,0.000202,8.6e-05,0.000121,0.000125,0.000151,0.00011,1.3e-05
0.000438,0.000517,3.9e-05,0.000302,0.000576,7.6e-05,0.000249,4.2e-05,0.00024,6.9e-05,0.000148,0.000234,0.000259,0.000255,0.000151,0.000219,0.000163,0.000301,0.000377,0.000401,0.000289,0.000182,0.000234,0.000137,0.000192,0.000201,0.000151,0.000238,0.000155,0.000413,0.000385,0.000479,0.000207,0.000318,0.000217,0.000222,0.00021,0.000221,4.9e-05,0.00018,0.000126,0.000267,6.9e-05,0.000106,0.00018,0.000128,3.7e-05,8.7e-05,0.000132,0.000137,8.1e-05,0.000117,6.7e-05,0.000138,0.000191,0.00023,9.5e-05,0.000106,6.9e-05,0.000164,0.000155,0.000231,4e-05,6.5e-05,0.000115,0.000332,0.000321,0.000139,0.000122,0.000196,9.1e-05,2e-04,8.2e-05,8.1e-05,6.8e-05,8.2e-05,0.000125,0.000327,0.000213,0.000227,0.000299,0.000215,0.000186,0.000178,0.000253,6.8e-05,3.8e-05,0.000216,0.000194,0.000187,4.3e-05,0.000121,0.000118,7.9e-05,0.000162,0.000141,0.000134,0.000202,0.000103,0.000259,6.7e-05,0.000216,0.000306,9.4e-05,7.9e-05,7.4e-05,0.000359,0.00027,0.000185,0.000268,0.000258,0.000284,0.000141,0.000302,8.1e-05,0.000255,0.000232,0.000168,0.000209,0.000214,0.000156
0.000535,0.000271,0.000252,0.000437,0.000485,0.000342,0.000262,0.000214,0.000446,0.000211,0.000136,0.000455,0.000252,0.000674,0.000229,0.000446,0.000328,0.000495,0.000388,3e-04,0.000584,0.000323,0.000371,0.000137,0.000317,0.000407,0.000362,0.00052,0.000335,0.000398,0.000521,0.000668,0.000457,0.000183,8.8e-05,0.000245,0.000451,0.000302,0.00012,0.000239,0.000269,0.000552,0.000257,0.000171,0.000303,0.000279,0.000121,0.000162,0.000181,0.000226,0.000106,0.000125,7.8e-05,0.000179,0.000301,0.000123,0.00023,5.6e-05,1e-04,0.000202,2.1e-05,0.000411,0.00011,0.000199,0.000362,0.000495,0.00027,3.2e-05,0.000137,0.00037,9.4e-05,0.000147,0.000296,0.000165,0.000126,0.000139,0.000163,0.000595,0.000291,8.2e-05,0.000242,0.000169,0.000238,0.00014,0.000453,0.000198,0.000133,0.000111,0.000266,0.000447,0.000409,0.000224,0.000133,0.000288,0.000204,9.4e-05,0.000286,9e-05,0.000161,0.000543,6.7e-05,0.00042,0.00019,0.000462,0.000116,0.000164,0.000352,0.000343,0.000507,0.000461,0.000169,0.000504,6.2e-05,0.000225,0.00043,0.000503,0.000343,0.000287,0.000313,0.000308,0.000211
0.000223,0.000222,0.000667,0.001246,0.000962,0.000514,0.000714,0.000134,0.000272,0.00075,0.000392,0.000378,0.000504,0.001015,0.001011,0.000647,0.000225,0.00051,0.000446,0.00061,0.000655,0.000477,0.000447,0.000303,0.000547,0.000445,0.00036,0.001123,0.000319,0.00072,0.000395,0.00063,0.000403,0.00065,0.000617,0.000765,0.001181,0.000761,8.1e-05,0.000111,0.000231,0.000792,0.000929,0.000391,5.1e-05,0.000374,0.000417,0.000267,0.000327,0.000469,0.000431,0.000224,0.000312,0.000502,0.000288,0.000569,0.000187,7.9e-05,8.5e-05,0.000315,0.000428,0.000418,0.000368,0.000267,0.000264,0.00036,0.000665,0.000278,0.000264,0.000744,0.000508,0.000537,0.000584,0.000564,0.000287,0.000233,0.000289,0.000534,0.000961,0.000627,0.000482,0.000359,0.000484,0.000714,0.00066,0.000427,0.000449,0.000411,0.000497,0.000126,0.00046,0.00045,0.000356,0.000396,0.000521,0.000428,0.000596,0.000259,0.000221,0.000987,0.000772,0.000264,0.000261,0.000811,0.000685,0.000193,0.000314,0.000605,0.000326,0.000687,0.000474,0.000849,0.000431,0.000754,0.00064,0.000341,0.000362,0.000563,0.000409,0.000726,0.00039
0.000574,0.000163,0.001039,0.000769,0.001464,0.000999,0.000355,0.000471,0.000665,0.00088,0.000671,0.000615,0.000739,0.001388,0.001005,0.000554,0.000296,0.000129,0.000576,0.000871,0.000235,0.000265,0.000412,0.000649,0.000164,0.000538,7.5e-05,0.001106,0.001293,0.001728,0.001148,0.001312,0.001266,0.001512,0.002044,0.001844,0.002321,0.002127,0.00137,0.000432,0.000545,0.000739,0.001366,0.000741,0.000304,0.000478,0.000372,0.000293,0.000439,0.00056,0.000213,6.4e-05,0.000301,0.000915,0.000879,0.001214,0.000822,0.000348,0.000354,0.000703,0.000881,0.000992,0.000713,0.000521,0.000776,6e-04,0.000472,0.000784,0.000267,0.000724,0.000764,0.000697,0.000678,0.000735,0.000564,0.000481,0.000742,0.000807,0.001553,0.001756,0.001016,0.000495,0.000154,0.000679,0.001075,0.000635,0.000298,0.000382,0.000405,0.000503,0.000447,0.000295,0.000353,0.000795,0.001039,0.001536,0.001541,0.000876,0.000621,0.001104,0.00113,0.000878,0.000189,0.000803,0.000886,0.00093,0.000276,0.000603,0.000709,0.001038,0.001363,0.001846,0.001577,0.001416,0.001373,0.001077,0.000869,0.000925,0.000817,0.00055,0.000959
0.001046,0.001217,0.000955,0.001401,0.000538,9.2e-05,0.00027,0.00035,0.00082,0.000469,0.000302,0.000964,0.000514,0.001009,0.000843,0.000208,5.3e-05,0.000278,0.000708,0.000445,0.00041,0.000212,0.000405,0.000269,0.00033,0.000684,0.00069,0.000781,0.000902,0.00092,0.001313,0.000785,0.000295,0.000597,0.001309,0.001564,0.00045,0.000414,0.000368,0.000622,0.000563,0.00057,0.000389,0.000491,0.000288,0.000393,0.000166,0.000256,0.000257,0.000262,0.000357,0.000267,0.000237,0.000438,0.000684,0.000582,0.000609,0.000519,0.000451,0.000293,0.00029,0.000229,5.7e-05,0.000479,0.000616,0.000378,0.000749,0.000346,0.00036,0.000452,0.000541,0.000378,8.7e-05,0.00045,0.000318,0.000206,0.000606,0.000441,0.000611,0.000599,0.000496,0.000361,0.000154,0.000379,0.000317,0.000263,0.000159,0.000218,0.000209,0.00023,0.000148,8.9e-05,0.000291,0.000432,0.000364,0.00081,0.00053,0.000135,0.000358,0.000326,0.000344,0.000257,0.000324,0.000463,6.7e-05,0.000477,3e-04,0.000397,0.000216,0.000343,0.000529,0.000613,0.000635,0.000728,0.00048,0.000241,0.00014,0.00025,0.000126,0.000234,0.000662
0.000312,0.00054,0.000123,0.000445,5.1e-05,0.000324,0.000315,0.000142,0.000651,0.000525,0.000333,0.000406,8.4e-05,0.000704,0.000254,0.000326,0.000347,0.000353,0.000483,0.000236,0.000362,0.000166,0.00013,0.00022,0.000148,0.000357,0.00018,9.7e-05,0.000512,0.000843,0.000419,0.00057,0.000251,0.000337,0.000661,0.000229,3e-04,0.000109,0.00027,0.000316,0.000197,8.8e-05,0.000242,0.000141,0.000286,0.000305,0.000216,0.000113,0.000289,0.000122,0.000239,0.000252,0.000273,0.000233,0.000299,0.000197,0.000158,0.000306,0.000273,0.000279,4.5e-05,0.000118,0.000163,0.000405,0.000142,0.000228,0.000223,0.000247,0.000257,0.000352,0.000218,0.000196,7.2e-05,0.000185,7.1e-05,0.000126,0.000168,0.000291,0.000322,0.000113,9.6e-05,0.000206,0.000118,0.000104,0.000164,0.000226,0.000341,3e-04,0.000222,0.00036,8.7e-05,0.000137,0.000169,0.000467,0.000226,0.000417,0.000198,0.000262,0.000317,0.000384,2.7e-05,9e-05,0.000258,0.000277,0.000238,0.00016,0.00016,0.000239,0.000274,0.000148,0.000385,0.000321,0.000257,0.000359,0.000169,0.000143,8e-05,0.000109,0.000108,8.7e-05,0.000379
0.000258,9.3e-05,0.000261,0.00014,0.000334,6.3e-05,0.000162,0.000459,7.2e-05,0.00028,0.000149,2e-04,0.000147,0.000331,0.000184,0.000201,0.00019,3.7e-05,0.000349,0.000498,0.000214,0.000367,0.000251,6.2e-05,0.000278,0.000135,0.000235,0.000374,0.000227,0.000434,0.000158,0.000213,0.000267,0.000366,0.000356,0.000264,0.000456,0.000189,0.000116,7.8e-05,0.000139,0.000132,0.000156,8.9e-05,7.8e-05,0.000223,0.000152,0.000185,0.000296,0.000148,0.000176,0.000135,0.000144,0.000246,0.00026,5.5e-05,4.5e-05,0.00011,0.000107,0.000163,5.4e-05,6.4e-05,5.8e-05,9.7e-05,8.8e-05,0.00012,0.000174,0.000195,4.1e-05,6.2e-05,0.000208,6.9e-05,3.7e-05,0.000209,9.8e-05,0.000127,9.9e-05,0.000174,0.000389,0.000144,7.4e-05,0.000192,0.000191,0.000291,0.000252,0.000101,9.9e-05,7.2e-05,7.1e-05,0.000218,6.6e-05,0.000106,0.000109,0.000115,0.000119,0.000288,0.000158,0.000155,0.000164,0.000285,0.00013,8.4e-05,8.5e-05,0.000118,0.000143,0.000249,0.000315,0.000142,0.000273,0.000139,0.000168,0.000226,0.000131,0.000195,0.000166,0.000136,0.00013,0.000148,5.9e-05,0.000189,0.000101
0.000252,0.000417,0.000159,0.000238,0.000196,0.000173,0.00019,0.000394,0.00032,0.000163,0.000219,0.000198,0.000128,8.7e-05,9.1e-05,3e-05,0.000176,0.000195,0.000136,0.000198,8.9e-05,0.000124,7.4e-05,0.000116,0.000313,0.00038,0.000345,0.000204,0.000167,0.000374,0.000101,0.00025,0.000233,0.00027,0.000274,0.000262,0.000304,4.4e-05,7.9e-05,0.000145,5.3e-05,0.00021,3.1e-05,4.6e-05,4.7e-05,0.000169,0.000169,8.5e-05,0.000138,5.3e-05,5.8e-05,0.000132,0.000145,0.00019,0.000189,0.000133,0.00018,0.000117,0.00011,0.000114,0.000137,4.7e-05,4.5e-05,0.000169,3.7e-05,0.000101,0.000158,4.3e-05,8.6e-05,0.000145,0.000146,7.4e-05,1.4e-05,0.000174,9.7e-05,0.000203,0.000111,4e-06,0.000345,7.4e-05,0.000113,7.9e-05,0.000146,0.000185,2.5e-05,7.8e-05,0.000116,0.000141,7e-06,0.000104,0.000102,8.4e-05,9.1e-05,0.000183,7.2e-05,0.000183,9.1e-05,6.1e-05,0.000204,9.1e-05,5e-05,0.000149,0.000152,9.9e-05,0.000133,0.000168,9.8e-05,0.000124,0.000152,8.6e-05,0.000196,0.000111,0.000152,7.9e-05,5.8e-05,0.000103,7.8e-05,6.7e-05,3.7e-05,0.000143,3.3e-05
0.00027,0.000294,3.5e-05,8.4e-05,0.000117,0.000241,5.6e-05,0.000321,0.000176,0.00028,7.8e-05,6.5e-05,0.00016,0.000222,5.7e-05,9.8e-05,0.000157,0.000222,9.3e-05,0.000205,8e-05,0.000127,7.7e-05,6.4e-05,0.000192,0.000202,0.000183,0.000135,0.00024,0.000298,8e-05,0.000199,0.000176,0.000249,0.000323,0.000232,0.000182,1.1e-05,9.1e-05,7.6e-05,0.000112,4e-05,9.2e-05,6.4e-05,0.000108,7.2e-05,5.8e-05,6.5e-05,8.8e-05,2.8e-05,4.9e-05,0.000161,0.000103,0.000124,0.000146,9.8e-05,4.3e-05,2.3e-05,0.000154,1e-04,5.6e-05,0.000102,7.4e-05,7.7e-05,0.000111,7.9e-05,2.7e-05,8.7e-05,5e-05,9.2e-05,3.5e-05,2.4e-05,2.4e-05,3.9e-05,6.7e-05,9.7e-05,4.5e-05,7.7e-05,0.000166,4.1e-05,9.6e-05,9.2e-05,0.000128,5.7e-05,3e-05,3.8e-05,6.8e-05,8.3e-05,2.5e-05,8.7e-05,8.1e-05,9.3e-05,7.5e-05,5.1e-05,2.5e-05,0.000139,7e-05,9.1e-05,9.8e-05,2.2e-05,3.2e-05,5e-05,7.1e-05,9.4e-05,0.000137,8.7e-05,4.4e-05,8e-05,8.6e-05,9.3e-05,0.000109,0.000139,9.5e-05,9.4e-05,8e-05,2.1e-05,5.8e-05,3.8e-05,3.5e-05,0.00012,8.9e-05
0.000136,0.000194,2.5e-05,6e-05,6.1e-05,0.000142,9e-05,9.1e-05,9.3e-05,9.3e-05,4.9e-05,4.3e-05,2.2e-05,9.2e-05,3.6e-05,5.9e-05,3.6e-05,7.7e-05,9.8e-05,4.6e-05,4.8e-05,5.9e-05,1.9e-05,2.9e-05,7.9e-05,3.5e-05,6.2e-05,2.3e-05,7.2e-05,8.9e-05,4.5e-05,3.6e-05,8.9e-05,5.6e-05,3.5e-05,3.9e-05,9.5e-05,4.6e-05,2.1e-05,1.2e-05,4e-05,2.7e-05,2.5e-05,2.8e-05,2.2e-05,1.6e-05,3.4e-05,4.6e-05,4.1e-05,3.3e-05,4.8e-05,4.1e-05,6e-06,1.7e-05,5.6e-05,3.3e-05,5e-06,7e-06,6.4e-05,4.9e-05,9e-06,3.5e-05,3.5e-05,4.1e-05,1e-05,1.9e-05,6e-06,1.1e-05,8e-06,2.9e-05,4.4e-05,5e-06,9e-06,4.6e-05,3.5e-05,4.3e-05,2.9e-05,2.2e-05,7.7e-05,3.8e-05,1.2e-05,4.1e-05,5.1e-05,4.8e-05,4e-06,4.5e-05,7e-06,5.2e-05,2.4e-05,2.7e-05,1.4e-05,2.6e-05,2.4e-05,5.3e-05,3.5e-05,8.6e-05,2.5e-05,2.5e-05,3.9e-05,3.5e-05,3e-05,2e-05,3.6e-05,9e-06,1.8e-05,3.4e-05,2.7e-05,3.8e-05,5.3e-05,3.1e-05,2.8e-05,3.6e-05,4.1e-05,3.2e-05,3.1e-05,1.2e-05,3.6e-05,3.3e-05,3.5e-05,4.9e-05,3.6e-05
6e-06,7.1e-05,5.3e-05,7.1e-05,2.8e-05,5.9e-05,1.3e-05,4.4e-05,3.4e-05,6.1e-05,4.8e-05,2.7e-05,1.6e-05,7.6e-05,1.3e-05,2.5e-05,4.4e-05,4.2e-05,6.1e-05,8.1e-05,1.2e-05,1.3e-05,1.9e-05,2.1e-05,5.1e-05,2.3e-05,3.5e-05,4e-05,6e-05,2e-05,5.7e-05,7.5e-05,5.9e-05,6.3e-05,5.8e-05,7.1e-05,6.9e-05,4.3e-05,3.4e-05,7e-06,3.2e-05,4e-06,1.5e-05,2.1e-05,4.6e-05,3e-05,2.4e-05,3.7e-05,2.9e-05,3.8e-05,2.1e-05,1e-05,2.6e-05,2.2e-05,7.4e-05,3e-05,2.2e-05,5e-06,6.5e-05,2.1e-05,1.2e-05,6e-06,2.7e-05,3.1e-05,4.8e-05,2.3e-05,1e-05,1.4e-05,1e-05,2e-05,2.3e-05,1.4e-05,1.9e-05,2.6e-05,1.8e-05,3e-06,3.5e-05,5.2e-05,6.5e-05,1.4e-05,1.1e-05,2.9e-05,2.2e-05,4.8e-05,3.8e-05,2e-06,2.3e-05,2.7e-05,3.3e-05,2.4e-05,2.1e-05,1.5e-05,1.8e-05,4.7e-05,3.4e-05,7.7e-05,2.4e-05,3.1e-05,5.7e-05,5.6e-05,1.7e-05,1.6e-05,3.2e-05,3.9e-05,7e-06,9e-06,5.2e-05,1.6e-05,2.9e-05,2e-05,4.3e-05,4.2e-05,5.8e-05,2.4e-05,2.4e-05,2.7e-05,3e-05,1.9e-05,3.1e-05,5.3e-05,4.8e-05
3.5e-05,6.1e-05,5.4e-05,0.000106,3.2e-05,4.2e-05,4.2e-05,7.9e-05,3.1e-05,6.3e-05,3.7e-05,1.3e-05,1.4e-05,2.8e-05,4e-06,2e-06,6.8e-05,2.9e-05,4.9e-05,4.2e-05,4.1e-05,5e-06,1.7e-05,1.3e-05,3.6e-05,3e-05,1.2e-05,1.3e-05,4.6e-05,1.9e-05,4e-06,5.5e-05,3.1e-05,4.4e-05,6.6e-05,8.2e-05,4.5e-05,3.5e-05,2.5e-05,3.1e-05,9e-06,1.3e-05,1.3e-05,4e-05,4.6e-05,1.3e-05,1.9e-05,2.1e-05,2.2e-05,3e-06,2.6e-05,2.7e-05,4.8e-05,4.2e-05,4.3e-05,3.1e-05,2.7e-05,1.9e-05,7.1e-05,5.2e-05,1.8e-05,2.6e-05,3.9e-05,6e-06,2.4e-05,3.5e-05,1.8e-05,1.1e-05,3e-05,2.9e-05,8e-06,2.3e-05,2.4e-05,3.1e-05,2.5e-05,3.3e-05,5.8e-05,1e-05,5e-05,3.7e-05,3.3e-05,3e-05,3.1e-05,2.8e-05,3.8e-05,1.1e-05,2.2e-05,4.3e-05,2e-05,1.3e-05,1.7e-05,6e-06,9e-06,4.7e-05,5.4e-05,9.2e-05,2.9e-05,5.9e-05,4.7e-05,2.8e-05,9e-06,1.6e-05,4.9e-05,2.7e-05,1.9e-05,3e-06,2.8e-05,4.5e-05,2.9e-05,1e-05,4.1e-05,5.1e-05,1.5e-05,8e-06,1.2e-05,1.8e-05,3.9e-05,1.5e-05,1.5e-05,1e-05,2.3e-05
2.2e-05,8.3e-05,1.9e-05,8.9e-05,7.4e-05,3.2e-05,7e-06,7.1e-05,2.3e-05,7.6e-05,4e-05,1.9e-05,2.4e-05,3.9e-05,1.8e-05,3e-05,5.8e-05,4.7e-05,3.7e-05,5.9e-05,1.8e-05,1e-05,2.4e-05,2e-06,2.5e-05,1.1e-05,2.6e-05,2.8e-05,8.3e-05,3.5e-05,3.7e-05,6.7e-05,4.2e-05,4.8e-05,7.1e-05,5.2e-05,4.6e-05,3e-05,1.7e-05,3e-05,2.1e-05,1.9e-05,1.2e-05,2.8e-05,2.2e-05,1.2e-05,1.2e-05,2.2e-05,1.7e-05,3.7e-05,4.9e-05,1.8e-05,5.7e-05,1.5e-05,5.3e-05,1.8e-05,3.4e-05,3.3e-05,1.4e-05,4.1e-05,3.3e-05,1.8e-05,2e-05,1.4e-05,3.3e-05,7e-06,1.1e-05,9e-06,3.1e-05,2.9e-05,3.2e-05,4.1e-05,1e-05,3.9e-05,2.3e-05,1.7e-05,4e-05,3e-05,1.8e-05,5e-05,1.2e-05,3.4e-05,1.8e-05,1e-05,2e-06,1.9e-05,1.4e-05,3.7e-05,1.7e-05,3.4e-05,8e-06,1.5e-05,1.7e-05,3.6e-05,3.9e-05,2.7e-05,3.2e-05,3.4e-05,1.3e-05,2.3e-05,2.4e-05,1.9e-05,1.9e-05,3.5e-05,1.1e-05,8e-06,1.8e-05,2.7e-05,1.1e-05,2.2e-05,2.5e-05,3.4e-05,1.4e-05,4.2e-05,4.2e-05,3e-05,3.1e-05,1.3e-05,1.9e-05,1.8e-05,4.4e-05
3.5e-05,0.00011,4.9e-05,4.8e-05,5.5e-05,1e-05,2.6e-05,5.4e-05,1.7e-05,5.6e-05,4.3e-05,2e-06,4.5e-05,3e-05,2.5e-05,1.9e-05,5e-05,2.9e-05,2e-05,7.6e-05,8e-06,3.4e-05,1.4e-05,1e-05,1.6e-05,1.1e-05,1.8e-05,2.1e-05,6.1e-05,6.3e-05,6e-06,5.9e-05,4.4e-05,3.1e-05,6.4e-05,5.3e-05,3.8e-05,3.3e-05,1.9e-05,4.1e-05,1.7e-05,2.3e-05,2.9e-05,2.4e-05,1.5e-05,1.2e-05,7e-06,3.4e-05,2.4e-05,2.1e-05,3.1e-05,1.9e-05,3.6e-05,3.9e-05,6.9e-05,2.8e-05,1.6e-05,2e-05,3.4e-05,2.3e-05,1.3e-05,4.6e-05,3e-05,8e-06,4.7e-05,1.5e-05,1.6e-05,5e-06,3.2e-05,8e-06,3.8e-05,2.2e-05,1.9e-05,1.4e-05,7e-06,2.4e-05,3.8e-05,2e-05,5.1e-05,1.1e-05,1.6e-05,9e-06,2.9e-05,7e-06,6e-06,6e-06,2.1e-05,5.1e-05,1.1e-05,1.5e-05,3e-06,5e-06,1.7e-05,3.7e-05,2e-05,6.5e-05,2.3e-05,2.9e-05,4.2e-05,1.6e-05,2.3e-05,2.1e-05,1.5e-05,2.5e-05,2e-05,1.5e-05,2.3e-05,2.7e-05,1.5e-05,3.4e-05,2.1e-05,2.1e-05,2.6e-05,2.6e-05,3e-05,3.4e-05,3e-05,1.5e-05,2.4e-05,1.3e-05,5.2e-05
4.2e-05,6.4e-05,7.2e-05,6.5e-05,4.2e-05,3.4e-05,4.3e-05,6.9e-05,6e-06,5.2e-05,5.6e-05,1.8e-05,4.2e-05,4.5e-05,1.4e-05,1.8e-05,1.7e-05,4.5e-05,3.2e-05,7.1e-05,2.8e-05,2.1e-05,4.2e-05,1.5e-05,1.9e-05,1.5e-05,3.9e-05,3e-05,5.4e-05,3.8e-05,1.7e-05,2.7e-05,4.2e-05,4.9e-05,3.1e-05,7e-05,5.9e-05,2e-05,2.9e-05,1.6e-05,2.5e-05,3.5e-05,1.5e-05,2.8e-05,8e-06,1.9e-05,3.3e-05,2.7e-05,3.3e-05,4.7e-05,3e-05,2.1e-05,3.5e-05,2.2e-05,5.3e-05,2e-06,1.8e-05,2.1e-05,3.5e-05,5e-06,1.3e-05,2.3e-05,2.9e-05,2.7e-05,4.1e-05,8e-06,2.3e-05,1.5e-05,3.4e-05,4.3e-05,1.5e-05,4e-05,1e-05,2.8e-05,2.2e-05,2.8e-05,3.6e-05,2e-05,5.5e-05,2.8e-05,6e-06,2.8e-05,1.5e-05,5e-06,1.3e-05,3e-05,3.2e-05,3.1e-05,1.8e-05,5e-06,1.8e-05,1.3e-05,9e-06,3.6e-05,1.2e-05,6.9e-05,2.2e-05,2.5e-05,3e-05,1.1e-05,2.3e-05,1.8e-05,1.9e-05,3.5e-05,2.7e-05,3.1e-05,9e-06,1e-05,1.9e-05,7e-06,2.2e-05,4.1e-05,7e-06,2.4e-05,1.7e-05,3.6e-05,1.5e-05,1.3e-05,2.6e-05,7e-06,1.9e-05
1.9e-05,4.1e-05,1.7e-05,4.1e-05,1.8e-05,2.9e-05,3.3e-05,7.1e-05,1.2e-05,1.9e-05,2.1e-05,2.2e-05,3.3e-05,2.6e-05,2.2e-05,2.4e-05,5.9e-05,6.9e-05,6.1e-05,8.5e-05,4.8e-05,2.8e-05,4.1e-05,2.4e-05,1.8e-05,3.3e-05,4.6e-05,4e-05,7e-05,4.9e-05,2.9e-05,4.6e-05,4e-05,7.6e-05,1.5e-05,8.6e-05,6.4e-05,3.2e-05,1.5e-05,1.2e-05,3e-06,2.2e-05,3e-06,4.4e-05,3.5e-05,1.8e-05,4.8e-05,4.1e-05,3.4e-05,5e-05,1.3e-05,3.3e-05,2.4e-05,2.8e-05,5.1e-05,2.7e-05,2.8e-05,5e-05,3.8e-05,2e-05,1e-05,3.5e-05,3.5e-05,5.9e-05,4.1e-05,3.4e-05,2.7e-05,1.5e-05,1.2e-05,3.5e-05,2.9e-05,1.9e-05,2.9e-05,2e-05,2.4e-05,2.8e-05,1.5e-05,2.8e-05,3.7e-05,5.2e-05,1.3e-05,5e-05,1.4e-05,1e-05,3.2e-05,2.9e-05,1.8e-05,2.3e-05,1.3e-05,1.7e-05,3.6e-05,1.8e-05,1.6e-05,2.6e-05,2.9e-05,7.7e-05,2.5e-05,2e-05,2.9e-05,1.1e-05,3.1e-05,1e-05,4.1e-05,2e-05,1.7e-05,2.1e-05,6e-06,2.2e-05,2e-05,7e-06,2.9e-05,4.4e-05,2.2e-05,3.3e-05,1.7e-05,3.5e-05,3.4e-05,7e-06,7e-06,1.2e-05,2.5e-05
6e-05,5.4e-05,5.9e-05,6.6e-05,6e-05,2.9e-05,9e-06,6.2e-05,3.8e-05,7.1e-05,7e-05,3.3e-05,2.9e-05,5e-05,2.1e-05,1.6e-05,7e-05,6.1e-05,2.4e-05,9.2e-05,4e-05,6.7e-05,1.4e-05,2.1e-05,4.4e-05,4e-05,4.9e-05,8.2e-05,2.8e-05,3.4e-05,1.8e-05,8.6e-05,4e-05,4.9e-05,6.7e-05,9e-06,5.8e-05,2.2e-05,2.5e-05,3e-05,9e-06,1.5e-05,3.3e-05,5e-05,6.1e-05,2.8e-05,3e-05,7.9e-05,8.1e-05,9.4e-05,8.4e-05,5.5e-05,7.4e-05,3.7e-05,9.6e-05,6.1e-05,5.4e-05,7.2e-05,6.6e-05,9.2e-05,8.1e-05,5.6e-05,4.5e-05,1e-04,7.5e-05,4.5e-05,3.6e-05,4.1e-05,4.5e-05,4.6e-05,5.3e-05,5.5e-05,4.8e-05,3.8e-05,3.9e-05,6.9e-05,4.1e-05,5.1e-05,6.7e-05,5e-05,6.9e-05,2.6e-05,6.4e-05,6e-05,1.8e-05,3.1e-05,6e-05,3.1e-05,2.5e-05,6.9e-05,0.000129,8.8e-05,7.3e-05,3.7e-05,1.8e-05,9.8e-05,4.7e-05,1e-05,2e-05,3.6e-05,2.4e-05,2.6e-05,7.3e-05,6.4e-05,4.8e-05,3.8e-05,2.4e-05,2.9e-05,3.9e-05,3.1e-05,1.7e-05,2.9e-05,4e-06,3.3e-05,8.5e-05,5.7e-05,7.1e-05,5.1e-05,4.1e-05,9e-06,1.7e-05
1.5e-05,9e-05,3.6e-05,1.4e-05,8.7e-05,1.4e-05,2e-05,7.6e-05,5.5e-05,7.1e-05,3.6e-05,8e-06,4.7e-05,3.8e-05,4e-05,4.2e-05,5e-05,2.9e-05,4.3e-05,4.5e-05,3.1e-05,1.7e-05,1.4e-05,6e-06,2.5e-05,1.5e-05,1.9e-05,4.3e-05,3e-05,1.8e-05,5.8e-05,3e-06,4.2e-05,4.6e-05,4e-05,2.5e-05,1.7e-05,2.1e-05,3.6e-05,3.2e-05,2.5e-05,1.3e-05,2.6e-05,2.1e-05,3.8e-05,2e-05,2.1e-05,3.7e-05,7e-06,4.5e-05,6.4e-05,5.9e-05,3e-06,4.7e-05,4.1e-05,1.5e-05,4.4e-05,2.8e-05,7e-05,4.5e-05,7.3e-05,0.000109,8.2e-05,3.9e-05,4.5e-05,3.2e-05,2.6e-05,1.2e-05,2e-05,8.7e-05,0.000155,0.000125,8.2e-05,5.3e-05,9e-06,4.4e-05,5e-05,5.7e-05,1e-05,1.6e-05,5.7e-05,6.2e-05,8e-05,4.9e-05,5.1e-05,2.7e-05,6.1e-05,6.5e-05,5.3e-05,8.3e-05,0.000105,0.000102,6.2e-05,5.5e-05,4.7e-05,7.2e-05,1e-04,9.7e-05,6.5e-05,5.8e-05,2.4e-05,2.9e-05,5.4e-05,4.3e-05,2.7e-05,6e-06,7e-06,3.1e-05,2.8e-05,3e-06,1.8e-05,3.9e-05,1.9e-05,4.2e-05,9.4e-05,5.2e-05,4e-05,3.4e-05,5e-06,1.7e-05,4.2e-05
2.7e-05,8.8e-05,7e-06,2.8e-05,4.8e-05,2.7e-05,2.2e-05,7e-05,3.2e-05,5.2e-05,2.9e-05,7e-06,2.9e-05,2.7e-05,1.6e-05,1e-05,4.1e-05,2.8e-05,3.1e-05,4.9e-05,3e-05,4.5e-05,1.1e-05,1.2e-05,1.2e-05,1.6e-05,9e-06,3.7e-05,3.1e-05,3.4e-05,4e-05,3.6e-05,2.1e-05,2.1e-05,5.1e-05,3.1e-05,4e-05,2.3e-05,1.5e-05,7e-06,2e-05,2e-06,2.9e-05,4e-06,2.5e-05,1.5e-05,1.8e-05,1.2e-05,1.3e-05,3.5e-05,7e-06,2.4e-05,1.8e-05,4.7e-05,2.6e-05,2e-05,3.3e-05,2.3e-05,4.6e-05,4.7e-05,2.2e-05,4.8e-05,1.8e-05,3.3e-05,1.3e-05,1.4e-05,8e-06,9e-06,1.2e-05,5.5e-05,6.5e-05,2.8e-05,1e-05,2.4e-05,1.7e-05,2.7e-05,1.7e-05,1.6e-05,3.6e-05,9e-06,2.1e-05,8e-06,1.5e-05,1.5e-05,1.9e-05,2.2e-05,3e-05,3.4e-05,1.9e-05,6.8e-05,3e-05,3e-05,3.6e-05,5e-05,2.7e-05,1.7e-05,2.5e-05,3.6e-05,1.7e-05,2.7e-05,1.4e-05,3.7e-05,1.1e-05,1.6e-05,1.8e-05,1e-05,1.6e-05,1.9e-05,1.7e-05,1.9e-05,2.6e-05,2.6e-05,2.1e-05,2.8e-05,3.9e-05,1.3e-05,2.8e-05,9e-06,1.9e-05,6e-06,4.1e-05
1e-05,8.9e-05,1.6e-05,4.2e-05,3.9e-05,1.8e-05,1.1e-05,5.4e-05,1.4e-05,5e-05,2.7e-05,1e-05,1.8e-05,2.3e-05,2e-06,1.7e-05,2.5e-05,2.7e-05,3.1e-05,4.1e-05,3e-05,4e-05,2.1e-05,4e-06,3e-06,3e-06,1e-05,2.6e-05,3.7e-05,4e-05,2.2e-05,2.9e-05,2.8e-05,1.9e-05,3.3e-05,3e-05,4.5e-05,5e-06,1e-05,4e-06,1.4e-05,1.2e-05,2.3e-05,8e-06,9e-06,1.3e-05,9e-06,1.2e-05,2.9e-05,2.1e-05,1.1e-05,1.2e-05,8e-06,2.7e-05,2.4e-05,1.7e-05,3e-05,8e-06,3.3e-05,3.7e-05,2.6e-05,2.6e-05,2.3e-05,2.2e-05,8e-06,5e-06,8e-06,8e-06,1e-05,1.8e-05,5.2e-05,1.5e-05,1.2e-05,1.6e-05,3e-06,9e-06,2.2e-05,3e-06,3.9e-05,8e-06,1.2e-05,7e-06,1.6e-05,3e-06,1.3e-05,1.4e-05,1.1e-05,3.2e-05,1.1e-05,5.4e-05,3.8e-05,3.5e-05,1.3e-05,4.2e-05,1.2e-05,3.2e-05,1.6e-05,3.4e-05,5e-06,9e-06,9e-06,1.8e-05,1.2e-05,1.8e-05,8e-06,7e-06,1.1e-05,5e-06,8e-06,9e-06,1.4e-05,3.4e-05,6e-06,2.3e-05,3.8e-05,1.6e-05,1.7e-05,1.2e-05,2.1e-05,1.7e-05,3.1e-05
8e-06,7.6e-05,2e-05,3.7e-05,4.1e-05,1.7e-05,1.2e-05,6.2e-05,2.6e-05,4.9e-05,2.5e-05,1.5e-05,2.3e-05,2.7e-05,6e-06,9e-06,3.1e-05,1.3e-05,3.3e-05,4.4e-05,2e-05,2.6e-05,1e-05,5e-06,6e-06,1.1e-05,1e-05,2.4e-05,4.8e-05,4.7e-05,1.7e-05,3e-05,2.6e-05,2.9e-05,3.8e-05,3.3e-05,3.7e-05,1.6e-05,9e-06,8e-06,3e-06,4e-06,1.9e-05,6e-06,1.6e-05,2e-05,8e-06,1.7e-05,2.2e-05,1.2e-05,7e-06,3e-06,5e-06,2.2e-05,3e-05,1e-05,2.8e-05,4e-06,3.2e-05,3.3e-05,8e-06,1.6e-05,5e-06,1.9e-05,4e-06,4e-06,1.1e-05,7e-06,9e-06,1.5e-05,4.5e-05,8e-06,9e-06,1.2e-05,5e-06,3e-06,2.1e-05,4e-06,3.4e-05,1.4e-05,8e-06,8e-06,1.2e-05,1e-06,8e-06,3e-06,7e-06,2.9e-05,1e-05,3.9e-05,2.3e-05,2.4e-05,1.1e-05,2.8e-05,2e-06,3e-05,1.7e-05,3e-05,1.2e-05,8e-06,9e-06,1.6e-05,4e-06,2e-05,5e-06,2e-06,2e-06,8e-06,5e-06,8e-06,1.3e-05,3.1e-05,1.2e-05,1.7e-05,2.9e-05,4e-06,2.3e-05,1.3e-05,3e-06,1.3e-05,2.8e-05
2.1e-05,8.7e-05,9e-06,4.3e-05,4.1e-05,9e-06,3e-05,6.2e-05,2.3e-05,5.1e-05,1.5e-05,8e-06,2.1e-05,2.2e-05,1e-05,1.1e-05,3.7e-05,1.7e-05,2.9e-05,4.5e-05,3.1e-05,2.1e-05,1.2e-05,1e-06,1e-06,7e-06,1.1e-05,2.1e-05,4.8e-05,5.1e-05,3.4e-05,3.9e-05,2.5e-05,2e-05,3.4e-05,2.9e-05,4.4e-05,1.5e-05,1e-05,1.5e-05,6e-06,6e-06,2.8e-05,1.2e-05,1.5e-05,1.3e-05,4e-06,2.1e-05,2.4e-05,7e-06,8e-06,1.4e-05,8e-06,2.6e-05,2.6e-05,8e-06,2.2e-05,5e-06,3.4e-05,2.4e-05,1.5e-05,1e-05,9e-06,1.3e-05,3e-06,7e-06,7e-06,1.2e-05,3e-06,1.4e-05,4e-05,1.6e-05,4e-06,1.3e-05,7e-06,6e-06,1.8e-05,4e-06,3.4e-05,9e-06,1e-05,1e-05,9e-06,1.2e-05,1.3e-05,7e-06,9e-06,3.4e-05,7e-06,3.8e-05,2.4e-05,2.3e-05,9e-06,2.8e-05,5e-06,3.3e-05,7e-06,2.9e-05,9e-06,9e-06,8e-06,1.6e-05,8e-06,1.2e-05,3e-06,7e-06,4e-06,3e-06,6e-06,3e-06,1.2e-05,3.7e-05,6e-06,1.4e-05,2e-05,7e-06,2.2e-05,1.7e-05,6e-06,1.3e-05,2.4e-05
2.4e-05,7.4e-05,2e-05,3.3e-05,5.2e-05,1.3e-05,1.5e-05,5.1e-05,1.7e-05,3.1e-05,3.6e-05,1.1e-05,2.1e-05,2.5e-05,1.7e-05,7e-06,3.8e-05,1.4e-05,2.4e-05,5.8e-05,1.8e-05,2.7e-05,9e-06,7e-06,3e-06,4e-06,5e-06,2e-05,3.9e-05,4.1e-05,3.2e-05,2.1e-05,3.7e-05,2.9e-05,4.1e-05,2.6e-05,2.4e-05,2.4e-05,4e-06,5e-06,7e-06,8e-06,2.2e-05,2e-06,7e-06,1e-05,9e-06,1.3e-05,1.9e-05,1.6e-05,1.7e-05,5e-06,9e-06,2.6e-05,2.2e-05,1.4e-05,3e-05,7e-06,2.6e-05,1.6e-05,4e-06,1.5e-05,1.3e-05,1.5e-05,8e-06,5e-06,4e-06,1.1e-05,9e-06,7e-06,3.4e-05,1e-05,1.2e-05,2e-05,8e-06,6e-06,6e-06,5e-06,3e-05,7e-06,1e-06,6e-06,8e-06,2e-06,5e-06,5e-06,4e-06,2.7e-05,9e-06,2.5e-05,1.5e-05,2.7e-05,8e-06,2.5e-05,3e-06,4.1e-05,1e-05,3e-05,6e-06,1.1e-05,1e-05,8e-06,1e-05,1.6e-05,9e-06,1.2e-05,9e-06,8e-06,4e-06,7e-06,7e-06,1.9e-05,1.2e-05,1.5e-05,2e-05,7e-06,1.5e-05,1.1e-05,0,1.3e-05,3e-05
1.4e-05,6.5e-05,2e-05,4e-05,5.1e-05,2.8e-05,2.2e-05,5.5e-05,8e-06,3.9e-05,2.3e-05,2.3e-05,2.8e-05,2e-05,6e-06,5e-06,3.3e-05,1.8e-05,2.5e-05,4.9e-05,2.4e-05,3.1e-05,6e-06,6e-06,8e-06,1.1e-05,1.4e-05,2.9e-05,3.4e-05,2.8e-05,2.8e-05,3.5e-05,1.7e-05,2.4e-05,4.6e-05,1.5e-05,3.8e-05,1.3e-05,1.1e-05,1.7e-05,6e-06,4e-06,1.1e-05,8e-06,1.1e-05,1.1e-05,1e-05,1.5e-05,2.3e-05,9e-06,1.9e-05,1.2e-05,8e-06,1.8e-05,2.5e-05,1.1e-05,2.2e-05,9e-06,3.4e-05,9e-06,1e-05,1e-05,5e-06,2.1e-05,9e-06,6e-06,5e-06,8e-06,3e-06,5e-06,4.4e-05,5e-06,2e-06,1.3e-05,5e-06,2e-06,1.2e-05,3e-06,2.7e-05,9e-06,5e-06,6e-06,1.8e-05,1.2e-05,1.1e-05,6e-06,1.3e-05,3.5e-05,1.1e-05,4.1e-05,9e-06,2.5e-05,6e-06,3.2e-05,3e-06,3.3e-05,5e-06,2.5e-05,1.8e-05,1.4e-05,5e-06,1.1e-05,9e-06,9e-06,1.5e-05,1.4e-05,1.6e-05,3e-06,6e-06,1.2e-05,4e-06,2.5e-05,4e-06,2.2e-05,2.5e-05,4e-06,2.1e-05,4e-06,6e-06,1.5e-05,2.5e-05
1.8e-05,7.2e-05,9e-06,3.1e-05,3.7e-05,2.4e-05,1.7e-05,4.5e-05,5e-06,3.2e-05,2.4e-05,1.6e-05,1.4e-05,2e-05,8e-06,1.1e-05,2.8e-05,1.8e-05,1.4e-05,5.4e-05,1.7e-05,2.5e-05,9e-06,1e-05,1.3e-05,7e-06,7e-06,3.3e-05,4.4e-05,3e-05,1.5e-05,3.3e-05,1.3e-05,4e-05,3.9e-05,2e-05,3.1e-05,6e-06,5e-06,1e-05,1.1e-05,5e-06,1.4e-05,4e-06,8e-06,1.1e-05,4e-06,1.6e-05,2.4e-05,1.2e-05,1e-05,4e-06,3e-06,2.6e-05,3.4e-05,1.1e-05,1.4e-05,8e-06,3e-05,1.9e-05,5e-06,1.2e-05,1.2e-05,8e-06,5e-06,4e-06,4e-06,3e-06,3e-06,1.1e-05,2.9e-05,1e-05,1e-05,1e-05,1e-05,6e-06,1.5e-05,4e-06,2.7e-05,6e-06,8e-06,6e-06,2.3e-05,4e-06,8e-06,6e-06,8e-06,3.3e-05,8e-06,2.8e-05,1.3e-05,1.6e-05,6e-06,2.7e-05,5e-06,3.6e-05,7e-06,1.7e-05,1.2e-05,9e-06,4e-06,1.2e-05,1.2e-05,1.7e-05,7e-06,1.4e-05,2e-06,1e-05,1.1e-05,2e-06,7e-06,3.5e-05,5e-06,1.7e-05,3.7e-05,1.8e-05,1.3e-05,8e-06,9e-06,1.3e-05,2.8e-05
1.4e-05,7.9e-05,1.2e-05,4.1e-05,3.3e-05,5e-06,1.5e-05,5.8e-05,1e-05,3.3e-05,2.2e-05,8e-06,2.2e-05,2.4e-05,1.4e-05,9e-06,3.1e-05,1.2e-05,2.3e-05,4.6e-05,2.7e-05,1.6e-05,8e-06,8e-06,4e-06,7e-06,3e-06,1.9e-05,3.8e-05,2.8e-05,1.5e-05,2.1e-05,3e-05,3.6e-05,4.3e-05,2.3e-05,2.3e-05,1e-06,8e-06,2e-06,6e-06,8e-06,1.3e-05,5e-06,9e-06,7e-06,6e-06,1.2e-05,1.7e-05,9e-06,7e-06,6e-06,8e-06,2.8e-05,3e-05,1.5e-05,3.1e-05,1e-06,2.8e-05,2e-05,6e-06,1.6e-05,1.3e-05,2.1e-05,7e-06,5e-06,3e-06,3e-06,4e-06,1.4e-05,3.9e-05,6e-06,1.1e-05,1.3e-05,7e-06,5e-06,1e-05,4e-06,3.1e-05,7e-06,1.2e-05,5e-06,1.3e-05,1.2e-05,7e-06,4e-06,7e-06,3.2e-05,5e-06,2.8e-05,1.3e-05,1.5e-05,1.1e-05,3.3e-05,8e-06,3.5e-05,8e-06,2.5e-05,1.6e-05,7e-06,7e-06,7e-06,4e-06,1.5e-05,2e-06,7e-06,7e-06,1.1e-05,2e-06,4e-06,4e-06,2.6e-05,3e-06,3e-06,2.5e-05,9e-06,1.2e-05,1e-05,5e-06,1.1e-05,2.3e-05
7e-06,7.2e-05,1e-05,3e-05,3.3e-05,7e-06,1.6e-05,5.6e-05,1.1e-05,4.2e-05,2.4e-05,9e-06,2.3e-05,2.1e-05,6e-06,3e-06,3.2e-05,1.1e-05,2.3e-05,4.2e-05,2.2e-05,2e-05,1.3e-05,1e-05,2e-06,8e-06,1e-05,2e-05,4e-05,2.5e-05,2.4e-05,2.8e-05,2.4e-05,3.2e-05,3.7e-05,2.2e-05,2.4e-05,1.1e-05,5e-06,6e-06,5e-06,7e-06,1.1e-05,3e-06,8e-06,7e-06,3e-06,9e-06,1.6e-05,1.1e-05,1.3e-05,5e-06,4e-06,2.5e-05,3.2e-05,1.2e-05,2.5e-05,5e-06,3e-05,1.6e-05,5e-06,1.2e-05,9e-06,1.7e-05,9e-06,3e-06,2e-06,0,6e-06,1.2e-05,2.9e-05,2e-06,4e-06,1.2e-05,7e-06,8e-06,1.6e-05,4e-06,2.7e-05,4e-06,3e-06,1.1e-05,6e-06,3e-06,6e-06,1e-06,6e-06,3.1e-05,4e-06,2.9e-05,1.2e-05,1.7e-05,1.4e-05,2.5e-05,7e-06,3.7e-05,7e-06,2.4e-05,1.6e-05,1e-05,6e-06,1.1e-05,2e-06,1.9e-05,4e-06,6e-06,7e-06,8e-06,9e-06,3e-06,0,2.2e-05,2e-06,1.1e-05,2.3e-05,6e-06,1.4e-05,1e-05,7e-06,8e-06,1.8e-05
1.9e-05,6.8e-05,1.4e-05,3.2e-05,3.4e-05,8e-06,1.4e-05,5.3e-05,3e-06,3.9e-05,2.4e-05,1.1e-05,1.8e-05,1.8e-05,3e-06,7e-06,3.3e-05,1.2e-05,2.4e-05,4.4e-05,2.1e-05,2.3e-05,1.5e-05,5e-06,1e-06,2e-06,6e-06,2.3e-05,3.9e-05,3.2e-05,2.3e-05,2.3e-05,1.8e-05,3.3e-05,3.8e-05,2.8e-05,3.4e-05,7e-06,1e-05,2e-06,4e-06,5e-06,1.5e-05,4e-06,9e-06,6e-06,2e-06,1.4e-05,2e-05,1e-05,1.1e-05,3e-06,7e-06,2.4e-05,3e-05,1.3e-05,2.8e-05,5e-06,2.8e-05,1.5e-05,2e-06,1.5e-05,1e-05,1.6e-05,4e-06,3e-06,3e-06,0,3e-06,6e-06,3.4e-05,3e-06,4e-06,1.3e-05,8e-06,1e-06,1.6e-05,5e-06,2.8e-05,8e-06,4e-06,8e-06,9e-06,2e-06,1e-05,4e-06,6e-06,2.4e-05,3e-06,2.8e-05,1.1e-05,1.8e-05,1.4e-05,3.1e-05,4e-06,3.5e-05,8e-06,2.6e-05,9e-06,1e-05,6e-06,8e-06,4e-06,1.6e-05,1e-06,2e-06,9e-06,1e-06,4e-06,4e-06,2e-06,2.3e-05,1e-06,6e-06,2.3e-05,6e-06,1.1e-05,8e-06,7e-06,1.2e-05,2.3e-05
1.6e-05,6.8e-05,1.1e-05,2.6e-05,3.4e-05,6e-06,1.5e-05,5e-05,5e-06,3.8e-05,2.5e-05,1.2e-05,2e-05,2e-05,8e-06,7e-06,2.9e-05,1.4e-05,2.6e-05,4.4e-05,2.2e-05,2.3e-05,1e-05,7e-06,1e-06,2e-06,7e-06,2e-05,3.5e-05,3e-05,1.9e-05,2.4e-05,1.8e-05,2.9e-05,3.6e-05,2.6e-05,3.3e-05,9e-06,7e-06,4e-06,2e-06,7e-06,1.4e-05,5e-06,9e-06,7e-06,3e-06,1.2e-05,2e-05,9e-06,1.1e-05,2e-06,6e-06,2.6e-05,3.1e-05,9e-06,2.8e-05,2e-06,2.8e-05,1.8e-05,2e-06,1.3e-05,7e-06,1.8e-05,7e-06,3e-06,2e-06,3e-06,4e-06,8e-06,3.5e-05,1e-06,5e-06,1.1e-05,4e-06,4e-06,1.6e-05,4e-06,2.4e-05,5e-06,2e-06,7e-06,7e-06,2e-06,5e-06,1e-06,2e-06,3e-05,4e-06,2.6e-05,1e-05,1.9e-05,1.2e-05,2.6e-05,1e-06,3.4e-05,7e-06,2.4e-05,8e-06,7e-06,1e-06,8e-06,3e-06,1.5e-05,1e-06,5e-06,2e-06,3e-06,3e-06,0,6e-06,2.5e-05,3e-06,9e-06,2.1e-05,4e-06,1.2e-05,9e-06,5e-06,1e-05,2.3e-05
