2.2e-05,1.2e-05,2.9e-05,1e-05,2e-06,1.8e-05,2.1e-05,3e-05,2e-06,1.5e-05,1.6e-05,1.5e-05,4.4e-05,4.3e-05,1.4e-05,3.2e-05,5e-06,3.3e-05,1.7e-05,3.5e-05,1.8e-05,1.2e-05,8e-06,1.5e-05,2.4e-05,2.3e-05,8.8e-05,5.5e-05,8e-06,2e-06,1e-06,6e-06,2.3e-05,3e-06,1.1e-05,0.000163,0.000495,0.000614,0.000259,0.000624,2e-04,0.000829,0.000105,9e-05,0.000881,0.000162,0.000297,0.00134,0.000435,0.000186,0.000265,0.000321,0.000273,0.000376,9e-06,0.000217,5.4e-05,4.8e-05,2.6e-05,2e-05,0.000525,0.000169,0.000142,0.000145,7.5e-05,8.4e-05,0.000166,0.000416,0.000105,0.000261,4.4e-05,0.000184,1e-05,8e-06,0.000114,2.8e-05,3.1e-05,4.4e-05,0.000123,6e-05,2.9e-05,2.4e-05,3.1e-05,9e-05,3.1e-05,4.8e-05,2.2e-05,7e-06,4e-06,6e-06,3.5e-05,0.000163,0.000228,7.7e-05,0.000118,2.4e-05,4.9e-05,5.5e-05,0.000179,5.5e-05,0.000114,5.1e-05,5e-05,5e-06,4.5e-05,5e-06,2.2e-05,2e-06,3e-06,9e-06,1e-05,2.8e-05,2.2e-05,6.5e-05,7e-06,7.5e-05,3e-06,1.3e-05,1e-05,5e-06,1.8e-05
8.1e-05,8.4e-05,5.2e-05,6e-05,5.4e-05,6.4e-05,3.2e-05,7.1e-05,9.8e-05,0.000103,8.4e-05,7.2e-05,5.2e-05,6.3e-05,6.9e-05,8.2e-05,0.000103,8.4e-05,4.9e-05,7.6e-05,5.8e-05,7e-05,6.8e-05,5.4e-05,4.2e-05,5.4e-05,0.00016,4.7e-05,5.5e-05,5.3e-05,3.7e-05,1.4e-05,4.2e-05,2.3e-05,1.7e-05,0.000425,0.00151,0.002168,0.002141,0.003633,0.001763,0.001468,0.000599,0.00047,0.001885,0.001369,0.00201,0.003493,0.001461,0.001731,0.002264,0.001191,0.001239,0.000558,0.000663,0.000494,0.000342,0.000518,0.000388,0.000839,0.001354,0.001374,0.000386,0.000301,0.000605,0.000302,0.000437,0.001041,0.000296,0.000567,0.000471,0.000723,0.000317,0.000223,5.3e-05,0.000247,9.7e-05,0.000132,0.000331,0.000261,0.000176,0.000133,0.000169,0.000294,0.000214,0.000202,8.4e-05,0.000232,0.000195,8.3e-05,0.000153,0.000385,0.000831,0.000865,0.000612,0.000482,0.000183,8e-05,0.000396,0.000463,0.000252,0.000268,0.000152,0.000156,4.6e-05,4.8e-05,2.2e-05,3.4e-05,4e-05,4.7e-05,5.2e-05,2.9e-05,8.2e-05,6e-05,7.1e-05,7.3e-05,7.6e-05,6e-05,5.8e-05,4.7e-05,6.6e-05
2.9e-05,4.2e-05,4.1e-05,1.7e-05,1.6e-05,5.3e-05,4.7e-05,2.7e-05,6e-05,4.6e-05,1.8e-05,5.1e-05,0.000116,7.5e-05,6.6e-05,2.9e-05,8.8e-05,2e-05,3.6e-05,2.6e-05,1.2e-05,5.3e-05,4.7e-05,5.1e-05,0.000112,4.3e-05,0.000152,7.6e-05,6.9e-05,5.8e-05,1.6e-05,2.9e-05,4.3e-05,2.3e-05,2.1e-05,0.000559,0.001882,0.001028,0.000408,0.003392,0.00189,0.002289,0.001175,0.000792,0.002521,0.002999,0.001076,0.002078,0.000273,0.001059,0.001043,0.000233,0.000758,0.000344,0.000415,0.001588,0.001164,0.000761,0.000163,0.00074,0.000681,0.001306,0.001139,0.000816,0.000486,0.000311,0.00042,0.00106,0.001027,0.000893,0.000177,0.000864,0.000255,0.000114,0.000274,0.000285,0.000253,7.3e-05,0.000315,0.000262,0.000233,0.000232,0.000164,0.000203,0.000109,1e-04,0.000178,0.000169,0.000139,0.00017,0.000149,0.000195,6e-04,0.000456,9.3e-05,0.000159,4.5e-05,9.2e-05,0.000353,0.000132,6.4e-05,7.8e-05,0.000106,0.000141,4.7e-05,5.8e-05,1.8e-05,2.4e-05,6e-05,5.3e-05,2.3e-05,1e-05,6e-05,6.5e-05,7e-06,7.4e-05,4.2e-05,1.8e-05,6.9e-05,2.4e-05,4.1e-05
8.4e-05,3.4e-05,4.5e-05,5.5e-05,4e-05,7.2e-05,7.2e-05,7.3e-05,3.4e-05,7e-05,5.6e-05,8.1e-05,7.2e-05,0.000218,0.000105,7.5e-05,9.5e-05,8.9e-05,8.7e-05,4.2e-05,2e-05,5.8e-05,7.6e-05,3.3e-05,0.000168,3.2e-05,0.000154,6e-05,7.6e-05,7.7e-05,7e-05,7.8e-05,6.8e-05,2.4e-05,5.1e-05,0.000712,0.001224,0.000807,0.000263,0.003428,0.001523,0.002641,0.001876,0.000161,0.002169,0.000741,0.000928,0.003478,0.002209,0.000702,0.001492,0.00065,0.001301,0.001193,0.00049,0.002235,0.001235,0.001146,0.001194,0.00088,0.000431,0.000664,9.3e-05,0.000474,0.000367,0.000164,0.000558,0.000705,0.001141,9.7e-05,0.000262,0.000737,0.000766,0.000191,0.000573,0.000184,0.000162,0.000374,0.000211,8.5e-05,0.000291,0.000161,0.000381,0.000257,8.5e-05,0.000104,5.8e-05,0.000161,6.8e-05,0.000139,7.5e-05,0.000196,0.000169,0.000156,5.3e-05,0.000155,5.4e-05,0.000193,0.000113,0.000137,3.8e-05,4.2e-05,0.000102,2.8e-05,6.8e-05,5.2e-05,6.8e-05,3.9e-05,6.3e-05,3.1e-05,2e-05,2.9e-05,2.9e-05,2.1e-05,6.9e-05,0.00012,1.7e-05,4e-06,5.9e-05,6.3e-05,7e-06
1.5e-05,2.4e-05,1.5e-05,3.4e-05,3e-05,3e-05,2.9e-05,3.7e-05,4.1e-05,6.9e-05,2.2e-05,2.9e-05,0.000169,8.3e-05,8.8e-05,2e-05,3.7e-05,8e-06,1.2e-05,1.2e-05,1.5e-05,1.2e-05,1.8e-05,2.2e-05,0.000136,9.3e-05,0.000236,3.5e-05,3.2e-05,3.8e-05,1.9e-05,3.3e-05,3.3e-05,3.8e-05,5.7e-05,0.000695,0.001046,0.000586,0.000438,0.002465,0.00263,0.001969,0.000911,0.001672,0.000805,0.001935,0.000859,0.003358,0.004414,0.003202,0.002425,0.000544,0.001771,0.00061,0.00179,0.001547,0.001268,0.000594,0.000831,0.000303,0.000558,0.000452,0.00034,0.000358,0.00093,0.000663,9e-04,0.001121,0.000662,0.000615,0.000432,0.000248,0.000698,0.000931,0.000579,0.000409,0.000343,0.000597,0.000459,0.000331,0.000429,0.000214,0.000733,0.000322,0.000179,0.000113,3.7e-05,0.000171,0.000146,0.000166,5.7e-05,0.000163,0.000124,4.2e-05,5.8e-05,0.000245,0.000105,0.000206,0.000175,5.5e-05,4.8e-05,6.8e-05,6.5e-05,8e-05,4e-05,4.2e-05,4e-05,6e-06,1.5e-05,3.3e-05,1.6e-05,3e-05,5.1e-05,5.7e-05,5e-05,9.6e-05,2.1e-05,1.9e-05,4.1e-05,1.4e-05,6.5e-05
5.1e-05,3.6e-05,1.4e-05,3.2e-05,1.6e-05,4.1e-05,3.2e-05,3.1e-05,4.3e-05,2.2e-05,3.4e-05,3.6e-05,0.000291,0.000205,8.4e-05,2.9e-05,1.9e-05,2e-05,3.2e-05,1.3e-05,3.1e-05,3.4e-05,2.6e-05,4.3e-05,0.000111,0.000103,0.000195,6.2e-05,7e-05,5.1e-05,7.5e-05,5.8e-05,6e-05,2.7e-05,4.7e-05,0.000745,0.001252,0.000548,0.000688,0.001391,0.000485,0.000818,0.003328,0.003388,0.002758,0.00116,0.00081,0.002781,0.003213,0.001368,0.003033,0.001732,0.001947,0.000599,0.002379,0.002044,0.002063,0.002666,0.001364,0.000823,0.000891,0.001346,0.001433,0.000154,0.000655,0.000914,0.000844,0.000744,0.001135,0.000172,0.000935,0.000373,0.000579,0.000519,0.000617,0.000138,0.000183,0.000542,0.00022,0.000289,7.3e-05,0.000162,0.000872,0.000464,0.00041,0.000198,5.6e-05,0.00022,4e-05,9.7e-05,0.000102,6.3e-05,0.000102,0.000126,5e-05,0.000197,0.000278,0.000224,0.000107,8e-05,2.1e-05,8e-05,2.4e-05,0.000131,6.5e-05,1.5e-05,2.7e-05,5.9e-05,3e-05,3.4e-05,2.1e-05,1.8e-05,3.6e-05,5.4e-05,4.1e-05,4.8e-05,1.9e-05,1.5e-05,6e-06,2e-05,6.9e-05
4.4e-05,1.8e-05,1.6e-05,6e-06,8e-06,4.9e-05,1.8e-05,3.7e-05,1.3e-05,4.3e-05,5.7e-05,4.1e-05,0.000369,0.000344,0.000151,8.3e-05,1.7e-05,2.1e-05,4.1e-05,1.6e-05,2.2e-05,3.9e-05,5.1e-05,2.3e-05,9.3e-05,5e-05,0.000227,0.000254,0.000181,0.000128,0.000218,0.000202,5e-06,2.8e-05,5.5e-05,0.000747,0.000475,0.000417,0.000857,0.000249,0.000832,0.000822,0.003606,0.001502,0.001287,0.003001,0.002179,0.002889,0.002164,0.000935,0.004166,0.00248,0.002609,0.000723,0.001927,0.002498,0.000986,0.003078,0.004171,0.003423,0.001814,0.000408,0.001744,0.002041,0.002376,0.000134,0.001897,0.001762,0.000127,0.001302,0.001207,0.001498,0.000881,0.000589,0.000785,0.000524,0.000195,0.000488,0.000228,6.7e-05,2e-04,0.000175,0.000937,0.000417,0.000416,0.000174,0.000146,0.000209,0.000157,6.2e-05,4.2e-05,0.000203,0.000151,7.5e-05,6.7e-05,0.000171,0.000196,0.000236,0.00021,9.5e-05,9.4e-05,0.000124,0.000136,0.000116,0.000124,0.000127,9.8e-05,6e-05,5e-06,1.5e-05,2.4e-05,4.8e-05,2.1e-05,5.7e-05,2.7e-05,0.000115,2.5e-05,2e-05,3.4e-05,3.6e-05,9.3e-05
1.7e-05,3.2e-05,3.1e-05,3e-05,6.2e-05,1.8e-05,5.5e-05,3.5e-05,2.4e-05,2.7e-05,3.6e-05,1.8e-05,0.000396,8.5e-05,5.5e-05,6.6e-05,1.6e-05,4.3e-05,2.7e-05,2.8e-05,1.8e-05,3.1e-05,4.3e-05,7e-05,0.000128,0.000159,0.000171,0.000512,0.000128,8e-05,0.000219,0.000248,0.000262,6.1e-05,0.000106,0.000758,0.001966,0.001092,0.001261,0.000735,0.001348,0.001332,0.003355,0.005589,0.004033,0.005089,0.000618,0.002863,0.001683,0.003349,0.002495,0.001197,0.003038,0.001895,0.00317,0.002248,0.00095,0.001952,0.002981,0.000868,0.000987,0.000983,0.002429,0.003045,0.000726,0.001512,0.001802,0.000743,0.000487,0.001614,0.002257,0.001646,0.000841,0.000436,0.00093,0.00033,0.000474,0.000452,0.000436,0.000137,0.000358,0.000366,0.000787,0.000905,0.000258,0.000209,0.000124,1.7e-05,1.5e-05,8.8e-05,0.00019,0.000434,0.000122,4.9e-05,7.6e-05,0.000366,0.000433,0.000328,7e-05,7.5e-05,6.2e-05,0.000167,0.000307,0.000346,0.000178,4.4e-05,2.9e-05,3.1e-05,2.2e-05,8e-06,1.3e-05,9e-05,7.3e-05,0.000115,2.4e-05,0.000127,0.000131,6.3e-05,6.1e-05,2.1e-05,0.000158
6.2e-05,1.2e-05,1.6e-05,4.2e-05,4.7e-05,4.4e-05,8.7e-05,4.7e-05,1.3e-05,4e-05,4.5e-05,6.7e-05,0.000415,0.00032,0.000159,4.9e-05,5.1e-05,5.2e-05,8.4e-05,6.8e-05,3.8e-05,2.2e-05,6.9e-05,1.2e-05,0.000149,0.000294,0.000245,0.000581,0.000434,0.000233,8.6e-05,0.000221,0.000109,0.000236,0.000252,0.000998,0.004884,0.001914,0.001347,0.001266,0.000669,0.00073,0.005141,0.005761,0.004165,0.002536,0.005196,0.000885,0.001507,0.003319,0.005771,0.004349,0.001978,0.001486,0.002313,0.003104,0.003203,0.001244,0.002034,0.0032,0.001377,0.00104,0.002733,0.001,0.001776,0.001142,0.000545,0.00163,0.000833,0.00104,0.001013,0.000586,0.00033,0.000552,8.4e-05,0.000385,0.000575,0.000581,0.000687,0.000626,0.000541,0.000363,0.001004,0.000721,0.000247,0.000268,0.000279,0.000147,0.000117,9.2e-05,0.000127,0.000482,0.00054,0.000292,0.000222,0.000791,0.001205,0.000712,0.000296,2.8e-05,8.7e-05,0.000113,0.000208,0.000595,0.000226,6.4e-05,1.9e-05,4.6e-05,8e-06,4.9e-05,2.6e-05,8.5e-05,1.3e-05,9.5e-05,0.000227,0.000202,0.000267,0.000102,7.7e-05,4.8e-05,0.000195
3e-06,1.5e-05,3.6e-05,8.6e-05,0.000101,4.1e-05,3.4e-05,1.5e-05,3e-05,3.3e-05,6.5e-05,0.000106,0.000331,0.000177,7.7e-05,0.000102,0.000126,0.000103,6.8e-05,4.9e-05,4.6e-05,5.9e-05,4.4e-05,9.4e-05,0.000112,0.000391,0.000476,0.000506,0.000476,0.00019,0.000118,0.000219,0.000276,0.000318,0.000239,0.000962,0.006758,0.005413,0.00218,0.00153,0.000916,0.001377,0.004198,0.001867,0.004918,0.005817,0.00755,0.006577,0.005139,0.001324,0.004301,0.003234,0.00318,0.002713,0.000895,0.006252,0.004464,0.001095,0.001685,0.001982,0.000916,0.000591,0.003096,0.002968,0.00231,0.001959,0.001451,0.001557,0.001405,0.000717,0.001419,0.001169,0.000538,0.000671,0.001251,0.000906,0.000262,0.000688,0.001106,0.000524,0.000384,0.000105,0.000895,0.000438,0.000188,0.000363,7.3e-05,8.7e-05,0.000188,0.000235,0.00026,0.000711,0.000887,0.000414,0.000233,0.00093,0.001599,0.000742,0.000237,0.00013,8.3e-05,0.000245,1.8e-05,0.000803,0.000722,0.000333,9.4e-05,1e-04,0.000108,0.000114,8.8e-05,4.7e-05,8.9e-05,1.9e-05,0.000233,6.1e-05,0.000268,0.000239,0.000114,4e-05,0.000222
3.1e-05,4.2e-05,1.8e-05,0.000107,6.7e-05,5.4e-05,2.1e-05,2.1e-05,3.4e-05,4.7e-05,6.8e-05,4.5e-05,8.5e-05,7e-05,2.1e-05,4.3e-05,7.7e-05,4.1e-05,4.3e-05,1.7e-05,3.8e-05,5.4e-05,9.1e-05,8.9e-05,0.000236,0.000217,0.000165,1.6e-05,0.000179,0.000115,0.000141,0.000187,0.000233,4.9e-05,0.000161,0.001345,0.006069,0.002861,0.000897,0.000676,0.001266,0.001776,0.001863,0.003154,0.002168,0.001476,0.002707,0.001386,0.002609,0.002237,0.001935,0.000951,0.001915,0.00237,0.002545,0.005478,0.002006,0.001004,0.001062,0.002973,0.004033,0.00304,0.001132,0.001156,0.00071,0.001563,0.001037,0.00086,0.000403,0.000196,0.001317,0.00062,0.000285,0.000393,0.000797,0.000323,0.000607,0.000468,0.00044,0.000239,0.000245,0.000234,0.000638,0.000348,0.000493,0.000265,0.000227,0.000219,0.000272,9.8e-05,8.7e-05,0.000651,0.000357,0.000246,0.000163,0.00097,0.000966,0.000678,0.000242,0.000151,4.8e-05,0.000214,0.000148,0.000666,0.000369,0.000179,4.1e-05,5.9e-05,7.8e-05,0.000102,5.8e-05,2.9e-05,7.6e-05,3.7e-05,0.000187,0.000256,0.000302,0.00011,4.4e-05,0.000101,0.000193
1.8e-05,3.6e-05,2.8e-05,5.2e-05,6.8e-05,5.2e-05,1.1e-05,2.3e-05,3.9e-05,6.7e-05,4e-05,8.8e-05,1e-04,5.7e-05,7.5e-05,4.1e-05,0.000112,6.6e-05,4.6e-05,3.5e-05,7.9e-05,3.1e-05,5.8e-05,0.000115,0.000473,0.000304,0.000374,4e-04,0.000173,3.5e-05,9.2e-05,7.4e-05,8.3e-05,3.2e-05,9.3e-05,0.001372,0.002519,0.001218,0.00055,0.000903,0.000839,0.000586,0.002956,0.001308,0.002067,0.00264,0.001255,0.00234,0.001828,0.001755,0.002609,0.001392,0.00104,0.001154,0.001657,0.001216,0.001123,0.000522,0.000988,0.001331,0.002368,0.000635,0.001,0.00029,0.00076,0.001306,0.00033,0.001178,0.000549,0.000291,0.00049,0.000881,0.00087,0.000799,0.000588,0.000237,0.000326,0.000304,0.000196,9.4e-05,6.7e-05,0.00018,0.000405,0.00038,0.000359,3.2e-05,8.2e-05,0.000139,0.000198,0.000127,5.4e-05,0.000535,0.000135,9.5e-05,3.1e-05,0.000834,7e-05,0.000126,0.000125,0.00012,7e-05,0.000129,0.000104,0.000483,0.000176,9.5e-05,5.7e-05,1.6e-05,5.4e-05,2.1e-05,5e-05,0.000101,9.7e-05,4.3e-05,0.000106,0.000132,0.000119,0.000102,3.5e-05,6.5e-05,3.7e-05
5e-05,3.7e-05,2.2e-05,1.8e-05,3e-05,5.6e-05,6.1e-05,3.9e-05,4.6e-05,8.8e-05,8.5e-05,2.6e-05,0.000104,8.1e-05,7.3e-05,4.8e-05,8e-05,4e-05,3e-05,4.7e-05,5.3e-05,3.8e-05,2.2e-05,0.000133,0.000549,0.000264,0.000409,0.000387,0.000156,4.3e-05,4.5e-05,2.7e-05,2.3e-05,3.4e-05,8.1e-05,0.00142,0.000869,0.000744,0.000264,0.000323,0.001279,0.001774,0.001501,0.002424,0.001794,0.001417,0.000278,0.00178,0.001924,0.001704,0.002056,0.000714,0.000826,0.002695,0.001015,0.001079,0.000553,0.001084,0.001478,0.000369,0.001617,0.001662,0.001568,0.000436,0.001421,0.001475,0.000559,0.001202,0.000368,0.000557,0.000787,0.000884,0.000906,0.00065,0.000775,0.000252,0.000216,3.2e-05,0.000122,6.5e-05,9.4e-05,0.000113,0.00026,2.4e-05,0.000253,6.4e-05,0.000143,0.000171,5.6e-05,0.000141,0.00014,0.00031,0.000224,0.00013,1.6e-05,0.000447,0.000174,0.000103,3.4e-05,7.1e-05,3.6e-05,9.7e-05,4.7e-05,0.000204,0.000137,8.5e-05,7.1e-05,3.7e-05,3.5e-05,1.4e-05,4.9e-05,4.6e-05,4.7e-05,5.9e-05,3.8e-05,0.000149,0.000114,5.5e-05,1.2e-05,3.3e-05,7.2e-05
7.3e-05,4.8e-05,6.1e-05,4.8e-05,3e-05,3.4e-05,1.3e-05,4.1e-05,6.2e-05,4e-05,2.1e-05,3.6e-05,0.000215,0.000139,8.5e-05,2.3e-05,5.6e-05,6.4e-05,4e-05,5.5e-05,3.9e-05,8e-06,1.4e-05,0.000139,0.000598,0.000375,0.000138,7.2e-05,4.3e-05,9e-06,3e-06,6.4e-05,5.3e-05,4.1e-05,9.9e-05,0.001235,0.00094,0.000325,0.000396,0.00064,0.00107,0.001785,2e-04,0.002483,0.0018,0.000879,0.0016,0.001583,0.001104,0.001299,0.00239,0.003145,0.000617,0.00277,0.001592,0.00293,0.002461,0.003093,0.000628,0.00118,0.002291,0.002145,0.000314,0.001544,0.002385,0.000407,0.000353,0.001153,1e-04,0.000232,0.001407,0.001059,0.000675,0.00043,0.001026,0.000542,9.3e-05,0.000406,0.00011,0.000191,0.000167,0.000161,5.8e-05,0.000164,0.000239,7.2e-05,0.000143,0.000159,0.00011,9.8e-05,0.000264,0.000331,0.000163,8.2e-05,9.5e-05,0.000105,0.000205,6.1e-05,7.4e-05,7.3e-05,5.6e-05,3.2e-05,3.4e-05,9.3e-05,6e-05,3.7e-05,2e-05,2.8e-05,1.5e-05,5.4e-05,2.1e-05,5.4e-05,6.4e-05,5.5e-05,5e-05,0.000185,4.3e-05,3.2e-05,2.4e-05,4.8e-05,6.4e-05
5.4e-05,3.5e-05,5.2e-05,3.7e-05,4.9e-05,5.1e-05,4.8e-05,8.1e-05,5.7e-05,5.4e-05,7.1e-05,8.2e-05,0.000262,5.4e-05,3e-05,1.9e-05,4.5e-05,4.3e-05,3.7e-05,4.5e-05,6.3e-05,3.9e-05,3.8e-05,0.000163,0.00077,0.00027,0.000194,0.000182,0.00011,7.1e-05,5.7e-05,6.6e-05,1.6e-05,4.3e-05,0.000134,0.001101,0.001206,0.000506,0.000337,0.000614,0.00307,0.002741,0.001825,0.001436,0.001845,0.001516,0.003584,0.001345,0.003899,0.002511,0.00076,0.001928,0.002865,0.001356,0.000916,0.003682,0.001327,0.001533,0.000261,0.001418,0.003778,0.001244,0.002845,0.000359,0.002691,0.002342,0.001834,0.00136,0.001395,0.001235,0.002035,0.001622,0.000927,0.000363,0.000867,0.000438,0.000323,0.000956,0.000276,0.000161,0.000151,0.000115,0.000378,0.000681,0.000427,0.000308,0.000326,0.000333,0.00025,0.000156,3.8e-05,0.000229,0.000211,0.000289,0.000219,0.000606,6.3e-05,7e-05,3.4e-05,8.6e-05,3.5e-05,4.7e-05,7.2e-05,1.6e-05,8.8e-05,4.7e-05,1.6e-05,4.6e-05,2e-06,5.7e-05,3.3e-05,8.4e-05,2.7e-05,4.6e-05,1.8e-05,0.000178,0.000113,5.1e-05,5.1e-05,5.5e-05,5.1e-05
4.4e-05,2.3e-05,3.9e-05,4.1e-05,3.2e-05,6.1e-05,4.1e-05,3.7e-05,6.8e-05,3.1e-05,6.8e-05,3.8e-05,0.000176,0.000185,6.5e-05,4.9e-05,6e-05,5.4e-05,2.5e-05,6.7e-05,2.1e-05,3.2e-05,5.1e-05,0.000164,0.000744,0.000271,0.000215,0.00017,6e-05,6.2e-05,5.9e-05,4.2e-05,4.8e-05,4.4e-05,0.000107,0.000771,0.001888,0.000463,0.000454,0.000724,0.006047,0.000318,0.002188,0.005047,0.003578,0.000473,0.003986,0.002176,0.006079,0.003915,0.004568,0.000315,0.001631,0.005813,0.002353,0.001389,0.003773,0.003932,0.004818,0.003482,0.002775,0.0022,0.004815,0.003912,0.003972,0.003186,0.003422,0.002914,0.005271,0.003763,0.00137,0.000842,0.000965,0.001228,0.001806,0.001675,0.000652,0.001485,0.000712,0.000361,2.4e-05,0.000131,0.000779,0.000408,0.000422,0.000207,4e-04,0.000373,0.000359,0.000132,0.000202,0.000229,0.000229,0.000142,1.2e-05,0.000964,0.000555,0.000126,7.2e-05,0.000204,0.000126,1.7e-05,4.3e-05,0.000171,0.000119,0.000138,8.7e-05,4.2e-05,4e-05,3.9e-05,0.00012,0.000127,9.3e-05,5.9e-05,5.8e-05,0.000165,0.00016,0.000102,3.1e-05,3.4e-05,6e-06
8.6e-05,6.8e-05,7.4e-05,3.9e-05,5.4e-05,6.5e-05,6.4e-05,3.6e-05,3.4e-05,4.4e-05,2.4e-05,8.9e-05,0.00014,4e-05,6.5e-05,9.7e-05,3.5e-05,5e-05,6e-05,8.1e-05,4.3e-05,1.9e-05,0.00011,0.000166,0.000901,0.000501,0.000489,0.000117,3.8e-05,6.6e-05,0.000109,0.000141,0.000124,0.000107,5.1e-05,0.000619,0.001659,0.00146,0.001033,0.001363,0.007404,0.010015,0.004746,0.006602,0.010742,0.009971,0.002475,0.005053,0.00933,0.010218,0.006239,0.009508,0.009696,0.011278,0.00947,0.005406,0.002006,0.004737,0.007001,0.002965,0.006612,0.008843,0.005049,0.003819,0.004266,0.003836,0.003225,0.003053,0.005164,0.005108,0.005395,0.003962,0.003486,0.001113,0.002682,0.004877,0.003181,0.001972,0.002713,0.001658,0.000449,0.000224,0.000778,0.00125,0.00151,0.000926,0.000744,0.000373,0.000397,0.000283,0.000484,0.000403,0.000229,0.00025,0.000232,0.001078,0.000626,0.000463,0.000235,0.000202,0.000206,0.000112,9.9e-05,0.000308,8.5e-05,0.000179,7.9e-05,0.000114,9.1e-05,0.000104,7.7e-05,5.6e-05,1.7e-05,6.7e-05,5.8e-05,8.4e-05,5.8e-05,7e-05,7.9e-05,4.5e-05,8.1e-05
8.3e-05,0.000115,1e-05,1.4e-05,8.1e-05,0.000105,7.1e-05,7.6e-05,2.4e-05,3e-05,1.8e-05,6.8e-05,0.000171,0.000125,6.4e-05,6.2e-05,0.000128,8.5e-05,4.6e-05,4e-05,4.7e-05,2.7e-05,0.000108,0.000255,0.000664,0.000677,0.000515,0.000315,9.9e-05,7.3e-05,1.3e-05,5.2e-05,2.9e-05,7e-05,9.8e-05,0.000502,0.001322,0.001722,0.000373,0.001233,0.007242,0.009038,0.009767,0.008334,0.006236,0.006707,0.009803,0.007932,0.004554,0.00721,0.008498,0.009223,0.008093,0.006262,0.003598,0.00278,0.001815,0.007642,0.011079,0.012035,0.01003,0.00663,0.005,0.006401,0.004318,0.002534,0.003371,0.001986,0.007232,0.002252,0.003794,0.001756,0.001044,0.002032,0.001876,0.003078,0.002253,0.001723,0.002082,0.001532,0.001156,0.000498,0.000425,0.000731,0.00051,0.000416,0.001001,0.000774,0.000525,0.000365,0.000534,0.000537,0.000154,0.000102,0.000185,0.00065,0.000384,0.000353,0.000147,0.000321,0.000135,5e-05,9.5e-05,0.00035,0.000308,6e-05,8.8e-05,0.000146,7.7e-05,9.2e-05,0.000135,0.000135,1e-04,6.7e-05,1.8e-05,0.000103,3.6e-05,7.1e-05,0.000121,5.9e-05,0.00016
0.000102,6e-05,0.000108,0.000105,6.1e-05,5.5e-05,2.5e-05,8.2e-05,0.000103,5.6e-05,6.5e-05,4.5e-05,0.000113,0.000203,9.5e-05,6.3e-05,7e-05,8.2e-05,7.6e-05,3.7e-05,8.5e-05,7.7e-05,5.7e-05,0.000146,0.000908,0.00116,0.000344,0.000269,0.000224,0.000117,0.000107,8.2e-05,7.5e-05,7e-05,6.9e-05,0.000503,0.001274,0.00073,0.000909,0.001026,0.002641,0.004042,0.004731,0.003365,0.000859,0.004937,0.002084,0.003994,0.003511,0.002539,0.005658,0.005188,0.003298,0.001347,0.003419,0.004209,0.00413,0.005146,0.001489,0.004292,0.001573,0.004865,0.00287,0.003203,0.002825,0.001261,0.002024,0.005759,0.003623,0.003499,0.000789,0.000364,0.001225,0.000809,0.000804,0.001601,0.000654,0.001344,0.000186,0.00044,0.000442,0.000219,5.1e-05,0.000119,0.000458,0.000408,0.000787,0.000192,0.000323,0.000401,0.000172,0.000791,0.000512,0.000123,0.00014,0.00056,0.00028,3.1e-05,6.1e-05,0.000207,7.8e-05,3.8e-05,8.7e-05,0.000162,0.000129,9.7e-05,9.6e-05,1.6e-05,4.4e-05,6.1e-05,3.1e-05,0.000112,5.5e-05,4e-05,5.3e-05,0.000151,0.000114,4.4e-05,2.4e-05,5.7e-05,0.000156
4.6e-05,4.6e-05,0.000105,3e-05,0.000129,8.4e-05,8e-05,9.2e-05,9.1e-05,6.1e-05,6.4e-05,9.5e-05,2.6e-05,0.00015,0.000106,6.9e-05,5.6e-05,8.3e-05,0.000132,9.2e-05,8.7e-05,4.6e-05,8.8e-05,0.000162,0.000769,0.001015,0.000587,0.000312,0.000292,1e-04,0.000101,5e-05,7.4e-05,3e-05,7e-05,0.000455,0.001334,0.000558,0.00099,0.00098,0.001555,0.000538,0.004665,0.003465,0.002013,0.002476,0.001656,0.003206,0.003488,0.001964,0.001616,0.002523,0.003836,0.001858,0.00427,0.001631,0.005248,0.005618,0.003987,0.00091,0.00142,0.002638,0.002114,0.002894,0.001734,0.002117,0.002498,0.002772,0.002945,0.002372,0.00189,0.000665,0.000946,0.001572,0.000678,0.000659,0.000662,0.000834,0.001328,0.000689,0.000237,0.000365,0.000339,0.000478,0.000483,0.000696,0.000205,0.000216,0.000195,0.000251,0.000379,0.000887,0.000385,0.000221,8.8e-05,0.000302,0.000195,0.000105,4.9e-05,8.9e-05,0.000107,5.5e-05,1e-05,0.000215,0.000105,6.6e-05,0.000165,0.000101,5.1e-05,0.000116,7.5e-05,0.000104,5.2e-05,5.7e-05,7.2e-05,0.000156,0.000218,0.000174,0.000104,0.000108,0.000118
7.7e-05,8.2e-05,7.1e-05,0.000102,0.000103,2.9e-05,8.2e-05,3.9e-05,7e-05,7.9e-05,2.6e-05,7.7e-05,0.000198,0.000136,6.3e-05,5.2e-05,7.8e-05,6.6e-05,0.000127,5.8e-05,5.3e-05,8e-06,5.6e-05,0.000141,0.000735,0.000654,0.000476,0.00024,0.000106,4.8e-05,8.1e-05,7.6e-05,5.5e-05,5.9e-05,0.000147,0.000436,0.001069,0.000547,0.00057,0.000898,0.002384,0.000594,0.002493,0.000925,0.001388,0.000384,0.002662,0.001642,0.001886,0.000765,0.000742,0.000482,0.002212,0.000988,0.003878,0.004127,0.004303,0.000613,0.001881,0.00049,0.00124,0.002031,0.001916,0.002104,0.002122,0.001809,0.001686,0.001301,0.002616,0.001542,0.000242,0.000549,0.000573,0.001045,0.001079,0.00042,0.000503,0.000755,0.000852,0.000533,0.000561,0.000191,0.000665,0.000277,0.000355,0.000406,0.000227,0.000337,0.000298,0.000252,0.000146,0.00093,0.000771,0.000456,0.000212,0.000306,0.000508,0.000191,6.6e-05,0.000101,0.000135,0.000143,1.3e-05,0.000345,0.000399,0.000279,6.4e-05,4.2e-05,4.1e-05,8.5e-05,2.5e-05,0.00011,4.7e-05,1.2e-05,5.9e-05,0.000194,0.000242,8e-05,6e-05,5.5e-05,9.1e-05
0.000102,1.2e-05,2e-05,4.6e-05,3.5e-05,2.5e-05,7.5e-05,0.000108,0.000111,1.4e-05,8e-06,4.7e-05,0.00026,6.7e-05,1.8e-05,1.6e-05,0.000146,6.6e-05,7.9e-05,5e-05,4.9e-05,4.4e-05,1.3e-05,1e-04,0.000629,0.00047,0.000205,0.00015,8.9e-05,3.4e-05,4.5e-05,0.000107,0.000168,4.2e-05,0.000127,0.000608,0.000268,0.000218,6e-04,0.00073,0.00122,0.001015,0.001184,0.001514,0.001089,0.00109,0.001771,0.001749,0.001831,0.001825,0.00131,0.002019,0.001011,0.000792,0.001701,0.002971,0.001683,0.002157,0.000814,0.001077,0.001115,0.002321,0.00211,0.000789,0.000989,0.002444,0.001984,0.000936,0.001286,0.000761,0.001531,0.000821,0.000739,0.000268,0.000303,0.000705,0.00013,0.000767,0.000128,0.000317,0.000229,0.000164,0.000472,0.000326,0.000214,0.000206,4.5e-05,0.00029,0.000196,0.000142,0.000122,0.000813,0.000553,0.00021,4.7e-05,0.000399,0.000639,0.000438,0.000176,0.000114,8.9e-05,0.000125,0.000159,0.000459,0.000279,8e-05,4.7e-05,3.5e-05,4.7e-05,8.8e-05,6.6e-05,0.000116,9.4e-05,0.000102,7e-05,0.000197,0.00016,7.3e-05,5.9e-05,4e-05,0.000104
2.8e-05,3.8e-05,2e-05,4e-06,3.2e-05,1.6e-05,4.8e-05,2.2e-05,1.4e-05,4.1e-05,3.7e-05,1.7e-05,8.2e-05,7.3e-05,3.1e-05,1.5e-05,5.9e-05,5.9e-05,5e-06,6e-06,3.1e-05,2.6e-05,2.6e-05,5.4e-05,0.000245,0.000193,3.7e-05,8.3e-05,6e-05,2.2e-05,3.3e-05,5.3e-05,5.9e-05,6e-05,4.7e-05,0.000218,0.000221,1.5e-05,0.000187,0.000272,0.000474,0.000523,0.000373,0.000162,0.000246,0.000254,0.000607,0.000569,0.00112,0.000921,0.000569,0.000398,0.000226,0.000491,0.000466,0.000588,0.000632,0.000428,0.000197,0.000414,0.000669,0.000769,0.001073,0.000624,0.00065,6.7e-05,0.000308,0.000608,0.000393,0.000206,0.000539,0.000204,0.000231,0.000106,9.1e-05,0.00021,0.000106,0.000348,0.000271,7.3e-05,4.7e-05,6.6e-05,0.000147,4.4e-05,5.1e-05,5.8e-05,6.7e-05,0.000117,0.000133,6.4e-05,2.6e-05,0.000188,9.5e-05,1.8e-05,2.7e-05,0.000227,0.00016,4.8e-05,3.2e-05,2.7e-05,2.8e-05,1.2e-05,3.5e-05,0.000126,3.3e-05,7e-06,2.6e-05,3.7e-05,2.5e-05,1.2e-05,7e-06,3e-05,2.6e-05,2.1e-05,2.7e-05,0.000101,7.2e-05,3.7e-05,3.1e-05,1.7e-05,4.7e-05
9e-06,5e-06,1.8e-05,1.9e-05,2.5e-05,2.1e-05,4e-05,2.1e-05,7e-06,2.1e-05,2.4e-05,3e-06,4.1e-05,1.5e-05,6e-06,5e-06,4.3e-05,3.5e-05,5.1e-05,3e-05,3.4e-05,4.1e-05,6e-06,5e-05,0.000263,0.000157,0.000118,9.8e-05,5.3e-05,2.5e-05,2.8e-05,2.1e-05,2.6e-05,2.5e-05,2.5e-05,0.000183,0.000195,0.00018,0.000261,0.000489,0.00042,0.00059,0.000861,0.000637,0.000224,0.000313,0.000347,0.000753,0.000218,0.000183,0.000138,0.00062,0.000125,0.000658,0.000923,0.000867,0.000961,0.000608,0.000197,0.000178,0.000791,0.000946,0.000639,0.000255,0.000493,0.000322,0.000182,0.000509,0.000187,0.000196,0.00014,6.8e-05,4.7e-05,2.7e-05,5.6e-05,0.000253,4.2e-05,0.000245,0.000121,6.9e-05,7e-05,3.1e-05,2.9e-05,7.7e-05,3.3e-05,3.5e-05,4.7e-05,4.2e-05,6.1e-05,6.1e-05,3.5e-05,7.2e-05,6.9e-05,4.2e-05,2.6e-05,0.000142,5.4e-05,3.1e-05,1.9e-05,5e-06,2.5e-05,1.2e-05,1e-05,7e-05,5.6e-05,3.1e-05,1.3e-05,1.1e-05,1.8e-05,8e-06,6e-06,1.6e-05,2e-05,2.8e-05,3.8e-05,6.4e-05,4.9e-05,2.6e-05,2.7e-05,1.5e-05,6e-06
7e-06,4e-06,7e-06,9e-06,1.3e-05,1.5e-05,1.1e-05,6e-06,7e-06,1.2e-05,6e-06,1.9e-05,9e-06,2e-05,9e-06,1.5e-05,4.5e-05,5e-06,1.9e-05,4e-06,2.2e-05,4e-06,1.1e-05,3.3e-05,0.000168,8.6e-05,0.000101,7.3e-05,1.3e-05,4e-06,1.4e-05,1.7e-05,1.9e-05,1.5e-05,2.8e-05,0.000167,0.000292,0.000223,0.000179,0.000353,0.000375,0.000632,0.000262,0.000225,0.000718,0.000355,0.000293,0.00025,0.000289,0.000494,0.000461,0.000665,0.000605,0.000466,0.000802,0.000701,0.000198,0.000173,0.000604,0.000299,0.000114,0.000785,0.000364,8.8e-05,0.000595,3.8e-05,5.2e-05,0.000261,0.000271,0.000147,8.9e-05,5.4e-05,4e-05,2.3e-05,8.1e-05,0.000121,3.6e-05,0.000211,0.000101,2.8e-05,3.5e-05,3.4e-05,2.6e-05,6.3e-05,2.8e-05,2.7e-05,8.8e-05,3.4e-05,4.9e-05,5.4e-05,5.6e-05,0.000121,7.8e-05,3.6e-05,4.5e-05,9.4e-05,4.7e-05,1.5e-05,2.5e-05,2.7e-05,1.6e-05,4e-06,1.9e-05,1e-05,2.9e-05,1.5e-05,1.1e-05,1.9e-05,1.7e-05,1.7e-05,1.2e-05,7e-06,7e-06,2.8e-05,1.8e-05,4.4e-05,1.3e-05,1.2e-05,9e-06,1.6e-05,1.5e-05
1.7e-05,1.1e-05,1.1e-05,1.4e-05,1.3e-05,2.2e-05,2e-05,5e-06,1.3e-05,4e-06,1.3e-05,1.6e-05,3e-06,1.6e-05,8e-06,9e-06,3.6e-05,1.8e-05,1e-05,2e-06,5e-06,7e-06,1.1e-05,3.2e-05,0.000158,3e-05,4.1e-05,2.3e-05,2.4e-05,1.5e-05,2.3e-05,1.2e-05,7e-06,2.6e-05,7e-06,0.000136,0.000355,0.000152,8.6e-05,0.000414,0.000449,0.000409,0.000477,0.000262,0.000874,0.000117,0.000618,6e-04,0.000681,0.000603,0.000724,0.000159,0.000142,0.000324,0.000364,0.000489,0.000438,0.000259,0.000689,0.000568,0.000431,0.000435,0.000278,0.000338,0.00034,0.000184,5e-06,0.00032,0.000158,0.000126,0.000114,2.7e-05,2.6e-05,2.1e-05,0.000109,0.00014,2.4e-05,0.000209,9.3e-05,6e-06,1.9e-05,3.1e-05,7.1e-05,3.5e-05,1.4e-05,2.2e-05,4.3e-05,2e-05,2.1e-05,3.3e-05,4e-06,9.2e-05,1.8e-05,3e-06,1.6e-05,3.9e-05,2.5e-05,1.2e-05,1.5e-05,3e-05,1.2e-05,5e-06,2.4e-05,1e-05,7e-06,1.8e-05,4e-06,6e-06,3e-06,1.5e-05,1e-05,1.7e-05,1.2e-05,2.6e-05,1.3e-05,3.9e-05,1.9e-05,1e-06,4e-06,8e-06,1e-05
5e-06,2e-06,1e-05,1.5e-05,4e-06,1.4e-05,7e-06,3e-06,2.2e-05,2e-05,1.6e-05,2.8e-05,1e-05,5e-06,7e-06,4e-06,4.3e-05,1.2e-05,7e-06,8e-06,1e-06,6e-06,9e-06,1.5e-05,0.000106,3.2e-05,3.7e-05,4.3e-05,1.4e-05,4e-06,7e-06,1.2e-05,2.1e-05,2.3e-05,1.1e-05,8.2e-05,0.000307,7.5e-05,6.8e-05,0.000401,2.2e-05,0.000469,0.000316,0.000311,0.000203,0.000492,0.000618,0.00033,0.000767,0.000432,0.000386,0.000195,0.000188,0.000405,0.000521,0.000604,0.000608,5.2e-05,0.000309,0.000563,0.000187,0.000307,0.000196,0.000195,0.000227,0.000159,4.5e-05,0.000162,0.000141,2.8e-05,0.000148,7.8e-05,7e-06,3e-06,6.4e-05,0.000118,4.2e-05,0.000171,7.9e-05,1e-05,3.4e-05,3.2e-05,4.1e-05,5.4e-05,1.4e-05,2.1e-05,3.4e-05,2e-05,1.3e-05,2.7e-05,2.5e-05,1.1e-05,1.8e-05,2.3e-05,1e-05,2.7e-05,2.9e-05,1e-05,9e-06,1.1e-05,1.3e-05,4e-06,1.7e-05,3.4e-05,2.3e-05,8e-06,5e-06,1e-05,5e-06,1.3e-05,6e-06,1.2e-05,2e-06,1.5e-05,1e-05,3.3e-05,0,3e-06,7e-06,5e-06,1.2e-05
1.3e-05,1e-05,4e-06,1.1e-05,1.2e-05,1.5e-05,1.2e-05,8e-06,2.2e-05,7e-06,1.3e-05,5e-06,4e-06,9e-06,8e-06,5e-06,3.9e-05,2.6e-05,1.4e-05,8e-06,3e-06,8e-06,9e-06,1.3e-05,0.000103,1.9e-05,3.5e-05,3e-05,2.4e-05,1.4e-05,4e-06,9e-06,1.7e-05,1.1e-05,2.2e-05,5.7e-05,0.000266,0.000115,5.9e-05,0.000431,0.000396,0.000316,8.9e-05,0.000571,0.000621,0.000536,0.000374,0.000386,0.000113,0.000675,0.000581,0.000488,0.000293,0.000282,0.000587,0.000538,0.000272,0.000242,0.000162,0.000378,0.000306,0.000377,0.000343,9e-05,0.000286,0.000123,0.000167,0.00027,0.000231,1.6e-05,3.6e-05,0.000101,7e-06,2.8e-05,2e-05,3.2e-05,1.6e-05,0.000185,0.000119,2.7e-05,3.1e-05,3e-06,0.000112,7.5e-05,2.1e-05,3.6e-05,6.3e-05,6e-05,2.3e-05,2.2e-05,2.8e-05,6.3e-05,3.2e-05,1.3e-05,2.6e-05,2.1e-05,1.3e-05,3e-05,1.3e-05,1.6e-05,1.2e-05,8e-06,1.5e-05,2.9e-05,1.2e-05,1e-05,1.2e-05,1.5e-05,9e-06,1e-05,1.2e-05,9e-06,4e-06,1.3e-05,1.6e-05,2.9e-05,1.3e-05,5e-06,8e-06,5e-06,1.8e-05
9e-06,8e-06,3e-06,7e-06,6e-06,1e-05,8e-06,1.5e-05,2e-06,7e-06,1.2e-05,1.8e-05,1.7e-05,1.7e-05,6e-06,1e-06,4e-05,3.1e-05,1e-05,7e-06,7e-06,6e-06,1e-06,1.1e-05,9.5e-05,2.3e-05,3.9e-05,2e-05,6e-06,5e-06,9e-06,4e-06,2.1e-05,1.6e-05,1.5e-05,5.3e-05,0.000213,4.5e-05,4.9e-05,0.000378,0.000153,0.000237,0.000147,0.000684,0.000243,0.000209,0.000629,0.000382,0.000288,0.000307,0.000384,0.000327,0.000225,0.000244,0.000337,0.000296,0.000221,0.000212,0.000435,0.00043,0.000248,0.000271,0.000271,0.000295,0.000462,0.000272,0.000244,0.000112,0.000149,5.3e-05,1.9e-05,0.000166,0.00015,8.3e-05,4.2e-05,0.00012,4.6e-05,0.000178,1e-05,4.6e-05,9e-06,2.6e-05,0.000172,8.8e-05,3.7e-05,1.7e-05,7e-05,4.5e-05,3.2e-05,3e-05,2e-05,6.9e-05,5.2e-05,1.8e-05,1.8e-05,1.3e-05,1e-05,2.4e-05,3.3e-05,2.6e-05,2.4e-05,1.5e-05,1.7e-05,2.4e-05,5e-06,2e-06,1.2e-05,1e-05,1.3e-05,8e-06,8e-06,8e-06,1.6e-05,1.5e-05,1.5e-05,6e-06,4e-06,1.4e-05,8e-06,1.6e-05,1.8e-05
8e-06,1.5e-05,4e-06,7e-06,3e-06,1.2e-05,5e-06,1e-05,1e-05,5e-06,1.9e-05,1.1e-05,1.9e-05,1.2e-05,5e-06,3e-06,3.6e-05,1e-05,1.3e-05,1e-05,1e-05,1.5e-05,1e-05,2e-05,9e-05,3.7e-05,1.1e-05,1.8e-05,1.1e-05,8e-06,4e-06,7e-06,8e-06,6e-06,5e-06,6.4e-05,8.5e-05,0.00015,7.2e-05,0.000354,0.000286,0.000196,0.000438,0.000151,8.1e-05,0.000378,0.000497,0.000201,0.000586,0.000485,0.000292,0.000254,0.000247,0.000162,0.000105,0.000358,0.000394,0.000313,0.000169,0.000416,0.000449,0.000223,0.000251,9.1e-05,0.000148,0.000181,3.2e-05,2.1e-05,0.000147,6.3e-05,2.9e-05,0.000221,0.000172,0.000115,8e-06,0.000105,5.3e-05,0.000144,0.000117,2.1e-05,1e-05,3.1e-05,0.000172,0.000129,5.4e-05,3.7e-05,3.1e-05,9.2e-05,5.6e-05,1.1e-05,3.6e-05,3.6e-05,4.8e-05,1.8e-05,2.9e-05,3.3e-05,9e-06,1e-05,2e-05,5.9e-05,2.8e-05,1.1e-05,2.2e-05,3e-05,1.7e-05,3e-06,8e-06,8e-06,1.4e-05,5e-06,2e-06,1e-06,2.8e-05,1.9e-05,2.7e-05,1.4e-05,5e-06,1.1e-05,1.7e-05,8e-06,8e-06
1e-05,1.4e-05,1e-05,4e-06,3e-06,6e-06,6e-06,1.2e-05,1e-06,4e-06,6e-06,8e-06,1.1e-05,1.4e-05,1.4e-05,1e-05,3.2e-05,2e-05,2e-05,1.4e-05,9e-06,1.5e-05,9e-06,1.5e-05,0.000101,2.1e-05,1e-05,1.8e-05,1.6e-05,1.2e-05,5e-06,1e-05,2e-06,5e-06,1.3e-05,7e-05,0.000115,4.9e-05,3.8e-05,0.000348,0.000283,0.000241,0.000497,0.000512,0.00011,0.000168,0.000343,0.000261,0.000603,0.000324,0.000106,0.000238,0.000292,0.000287,0.000188,0.000265,0.000243,4e-04,0.000262,0.000236,0.000256,0.00011,0.000146,0.000233,0.000214,0.000273,0.000295,2.5e-05,9.3e-05,0.000173,0.000152,0.000223,0.000104,1e-04,0.000104,9.9e-05,8.1e-05,0.000164,0.000111,7e-05,7.4e-05,5.6e-05,9.7e-05,0.000153,6.8e-05,3.6e-05,3.5e-05,8.6e-05,3.2e-05,2.6e-05,1.7e-05,1.2e-05,6e-06,1.1e-05,1.9e-05,3.7e-05,9e-06,1.8e-05,9e-06,5e-05,3.2e-05,1.8e-05,1.6e-05,1e-05,1.5e-05,1.4e-05,5e-06,6e-06,9e-06,6e-06,6e-06,9e-06,2.9e-05,1.8e-05,3e-06,1.3e-05,1.6e-05,5e-06,8e-06,1.3e-05,1.4e-05
1e-06,8e-06,4e-06,4e-06,5e-06,3e-06,7e-06,6e-06,7e-06,1e-06,7e-06,7e-06,1.9e-05,4e-06,2e-06,6e-06,4e-05,2.6e-05,8e-06,9e-06,5e-06,1.7e-05,5e-06,2e-05,0.000111,5.2e-05,2.7e-05,3.6e-05,1.4e-05,1e-05,1.4e-05,1.4e-05,1.2e-05,1e-05,1.3e-05,8e-05,0.000179,1.4e-05,3.2e-05,0.00031,0.000118,0.000163,0.00034,0.000219,0.00034,0.000278,7.6e-05,0.000226,0.000116,0.00011,0.000375,0.000195,0.000346,8.4e-05,0.000216,0.000102,0.000193,0.000178,0.000291,0.000305,0.000333,0.000183,3.8e-05,0.000147,0.000271,3e-05,0.000138,0.000204,0.000169,4.7e-05,0.000146,0.000139,5.7e-05,0.000128,8.8e-05,0.000134,2e-05,0.000182,0.000101,2.1e-05,5.7e-05,2.1e-05,6.9e-05,6.5e-05,5.5e-05,3.5e-05,2.5e-05,8.1e-05,7.2e-05,2.2e-05,2.4e-05,3.4e-05,1.5e-05,2.5e-05,2.2e-05,5e-05,2.8e-05,1.7e-05,2.1e-05,3.2e-05,1.9e-05,2.5e-05,1.1e-05,2.8e-05,1.6e-05,1.6e-05,1e-05,7e-06,7e-06,6e-06,6e-06,1.1e-05,2.2e-05,6e-06,1.5e-05,1.7e-05,2.2e-05,1.1e-05,1e-06,5e-06,1.1e-05
5e-06,3e-06,9e-06,3e-06,3e-06,4e-06,3e-06,5e-06,2e-06,8e-06,8e-06,1.3e-05,6e-06,1e-05,5e-06,1.1e-05,3.6e-05,2.8e-05,1.7e-05,1.1e-05,1.4e-05,1.1e-05,6e-06,2.4e-05,0.000103,5.9e-05,5e-05,4.9e-05,1.7e-05,8e-06,8e-06,6e-06,1.2e-05,6e-06,1.9e-05,6.3e-05,0.00019,0.000142,7.7e-05,0.000277,0.000283,5.9e-05,0.000318,0.000119,0.000376,6.4e-05,0.000195,6.3e-05,0.000306,0.000258,0.000142,0.000339,0.000317,0.000284,0.000297,0.000341,0.000271,0.000425,0.000284,0.000184,0.00044,6.4e-05,8.1e-05,7.6e-05,0.000121,0.000119,2.3e-05,2.4e-05,0.000217,0.000103,0.000166,0.000134,0.000134,4.6e-05,4.7e-05,0.000122,6.4e-05,6.7e-05,0.000103,7.3e-05,8.2e-05,5.1e-05,3.1e-05,1.8e-05,3.2e-05,2.5e-05,2.4e-05,0.000103,2.2e-05,1e-06,1.8e-05,5.9e-05,4.9e-05,5.2e-05,2.3e-05,2.8e-05,1.8e-05,4e-06,1.5e-05,1.6e-05,1.7e-05,1.2e-05,4e-06,3.3e-05,1.8e-05,2.2e-05,1.8e-05,4e-06,1e-05,1.3e-05,5e-06,7e-06,1.1e-05,4e-06,1.7e-05,2e-06,1.1e-05,5e-06,6e-06,1e-05,4e-06
9e-06,6e-06,7e-06,1e-05,4e-06,9e-06,1.1e-05,4e-06,3e-06,8e-06,1.1e-05,4e-06,2.3e-05,1.4e-05,7e-06,1.6e-05,3.7e-05,3e-05,1e-05,2.2e-05,1.4e-05,1.2e-05,7e-06,2.3e-05,0.000107,2.6e-05,1.2e-05,1.8e-05,1.8e-05,8e-06,1.9e-05,2.3e-05,1e-05,2.2e-05,2.5e-05,4.6e-05,0.000243,0.00017,0.000129,0.000273,0.000151,4.7e-05,0.000149,0.000329,0.000308,0.00023,0.000122,0.000151,0.000384,0.000135,0.000266,0.000293,0.000261,0.000132,0.000387,0.000116,0.00016,0.000244,0.000131,0.000234,0.000244,0.000196,0.000158,0.000134,0.00031,8e-05,0.000129,0.000139,0.000333,0.000172,6.8e-05,0.000204,0.000112,1.2e-05,4.8e-05,6.9e-05,4.2e-05,2.5e-05,4.8e-05,1.2e-05,6.5e-05,3e-05,5e-05,5.4e-05,3.2e-05,6e-06,1.4e-05,0.000114,8.4e-05,3e-05,1.9e-05,0.000106,5.3e-05,3.4e-05,2.5e-05,3.3e-05,3.3e-05,1.4e-05,2e-05,2.5e-05,4e-06,1.8e-05,1.1e-05,3.2e-05,7e-06,1.2e-05,7e-06,1.2e-05,7e-06,6e-06,9e-06,8e-06,6e-06,1.2e-05,5e-06,1.3e-05,2.9e-05,1.9e-05,1.3e-05,5e-06,1.7e-05
4e-06,9e-06,7e-06,1e-05,8e-06,6e-06,8e-06,7e-06,1.3e-05,1.8e-05,6e-06,1.5e-05,2e-05,1.5e-05,7e-06,2.4e-05,3.8e-05,2.6e-05,1.4e-05,1.2e-05,3.2e-05,1.5e-05,3e-06,2e-05,9.3e-05,2.1e-05,3e-05,3.5e-05,1.5e-05,1.8e-05,2.8e-05,2.6e-05,4.2e-05,3.9e-05,5.8e-05,7.6e-05,0.000266,0.000152,0.000119,0.000136,0.000221,1.8e-05,0.000316,0.000154,0.000268,0.000154,0.000299,0.000119,0.000411,0.000168,0.000393,0.000111,0.000337,0.000248,0.000238,0.000131,0.000147,0.000209,0.00011,0.000215,0.000112,0.000119,0.000254,0.000151,0.000368,0.000281,0.000285,0.000304,5.1e-05,6.7e-05,5.6e-05,0.000149,6.8e-05,4.9e-05,3.1e-05,7.8e-05,4.9e-05,8.1e-05,3.4e-05,4.4e-05,2.8e-05,6.7e-05,4.5e-05,4.7e-05,2.6e-05,3.3e-05,2e-05,1e-04,4.9e-05,4.6e-05,2.3e-05,0.00011,6.7e-05,2.7e-05,1.8e-05,5.5e-05,5.6e-05,4.4e-05,2.5e-05,3.1e-05,2e-05,2.2e-05,1.6e-05,9e-06,2.3e-05,7e-06,8e-06,1e-05,6e-06,9e-06,9e-06,2e-06,5e-06,5e-06,6e-06,2.1e-05,4.8e-05,2.3e-05,1.6e-05,9e-06,1.8e-05
6e-06,4e-06,1.2e-05,7e-06,1e-06,1.1e-05,8e-06,0,1e-05,9e-06,1.4e-05,1.9e-05,2.8e-05,2.3e-05,2.2e-05,2.1e-05,2.2e-05,4.8e-05,3.4e-05,1.5e-05,1.7e-05,2.1e-05,1.5e-05,2e-05,0.000103,8.4e-05,2.2e-05,1.8e-05,3.1e-05,1.1e-05,2.1e-05,1.2e-05,2.6e-05,2.1e-05,4.1e-05,2.3e-05,0.000269,2e-04,6.9e-05,0.000216,0.000149,6.1e-05,0.000344,0.000207,0.000352,4.2e-05,0.00022,7.7e-05,7.5e-05,0.00013,5e-05,0.000198,0.000241,0.000182,0.000103,0.000329,0.000237,0.000285,0.000227,0.000128,0.000113,0.000176,0.000176,0.000111,0.000333,0.000153,8.1e-05,0.000158,0.000141,6.7e-05,9.8e-05,4.8e-05,5.9e-05,1.9e-05,6.6e-05,5e-05,1.4e-05,0.000107,5e-05,2.3e-05,2.1e-05,5e-05,0.000135,7e-05,3.3e-05,1.7e-05,4.7e-05,3.8e-05,4.5e-05,4.1e-05,2.6e-05,9.6e-05,2.6e-05,8e-06,4.8e-05,5.1e-05,3.6e-05,2.6e-05,1.1e-05,1.2e-05,6e-06,1.2e-05,6e-06,1e-05,1.8e-05,1.1e-05,5e-06,9e-06,3e-06,1.6e-05,7e-06,2e-06,8e-06,1e-05,3e-06,2.4e-05,4e-05,1.9e-05,6e-06,6e-06,1.6e-05
4e-06,7e-06,9e-06,1e-05,5e-06,1.2e-05,1.8e-05,1e-05,5e-06,1.4e-05,1.6e-05,1.6e-05,1.3e-05,6e-06,1.5e-05,1.3e-05,2e-05,6.2e-05,3.1e-05,1.2e-05,6e-06,1.2e-05,5e-06,2.3e-05,6.5e-05,0.000104,7.4e-05,3.4e-05,2.9e-05,1.2e-05,6e-06,9e-06,1.1e-05,3.3e-05,1.4e-05,2.4e-05,0.000323,0.00027,0.00012,0.000165,0.000157,0.000107,0.000377,0.000154,0.00025,6.7e-05,0.000231,7e-06,0.000172,8.7e-05,0.000383,0.000354,0.000132,0.000199,0.000223,0.00027,5.6e-05,0.000105,0.000167,0.000121,0.000283,0.000183,0.000174,0.000127,0.000402,0.000133,0.000121,0.000124,0.000113,0.000106,0.000128,0.00012,4.2e-05,3e-05,7e-05,1.1e-05,5e-05,8.8e-05,9.1e-05,4.1e-05,3.8e-05,2.9e-05,0.000129,5e-05,1.6e-05,5e-06,4e-05,2.4e-05,1.6e-05,2.4e-05,3e-05,7.1e-05,7.6e-05,2.1e-05,1.9e-05,2e-05,7.1e-05,3.3e-05,9e-06,1.9e-05,1.2e-05,6e-06,2e-06,2.6e-05,3.1e-05,2.6e-05,1.3e-05,1.5e-05,1.5e-05,1.7e-05,8e-06,3e-06,2e-06,1.2e-05,7e-06,2.3e-05,2.6e-05,2.1e-05,7e-06,5e-06,1.1e-05
3e-06,1.1e-05,1.4e-05,9e-06,6e-06,8e-06,1e-05,9e-06,7e-06,1.1e-05,7e-06,8e-06,5e-06,4e-06,5e-06,6e-06,8e-06,5e-05,2.8e-05,1.3e-05,9e-06,3e-06,1e-06,2.3e-05,0.000107,0.000118,5.1e-05,2.3e-05,2.2e-05,1.3e-05,1.3e-05,8e-06,5e-06,1.8e-05,1e-05,3.9e-05,0.00033,0.000237,0.000148,0.000155,0.000231,0.000148,0.00033,0.000176,8.7e-05,0.000109,0.000205,8e-06,0.000281,1.6e-05,0.00032,0.000176,4.1e-05,0.000213,0.000135,0.000134,0.000178,0.000282,0.000207,8.2e-05,0.000187,0.000126,0.000152,0.000258,0.000315,4e-04,0.000403,0.000327,0.000178,0.000197,6.9e-05,4.4e-05,4.1e-05,4.1e-05,4.9e-05,0.000132,8.6e-05,5.3e-05,0.000113,6.6e-05,7.9e-05,7.9e-05,0.000127,8.5e-05,3.1e-05,3.2e-05,1.4e-05,2.4e-05,3.4e-05,2.9e-05,1.9e-05,2.8e-05,2.5e-05,2.4e-05,1.5e-05,3.4e-05,8.3e-05,5.8e-05,2.7e-05,2.7e-05,2.1e-05,1.4e-05,7e-06,4e-05,4.5e-05,1.2e-05,1.1e-05,6e-06,6e-06,1.2e-05,1.4e-05,5e-06,6e-06,5e-06,8e-06,1.6e-05,2.2e-05,1e-05,8e-06,5e-06,3e-06
4e-06,3e-06,4e-06,4e-06,7e-06,3e-06,9e-06,3e-06,4e-06,3e-06,7e-06,9e-06,9e-06,5e-06,3e-06,3e-06,1e-05,2.6e-05,1.4e-05,5e-06,1e-05,1.1e-05,3e-06,1.5e-05,0.000102,4.7e-05,3e-05,1.5e-05,8e-06,9e-06,1.8e-05,6e-06,5e-06,8e-06,8e-06,3.8e-05,3e-04,0.000134,0.000113,0.000143,0.000136,0.000103,0.000269,0.000209,0.000176,1.1e-05,0.000111,0.000105,0.000259,0.00014,0.000122,0.000308,0.000134,9.2e-05,0.000212,6.3e-05,0.000118,2e-04,0.000149,0.000171,0.000159,0.000108,0.000131,0.000159,0.000428,0.000407,0.000213,0.000222,0.00023,8.8e-05,6.5e-05,1.3e-05,4.5e-05,1.9e-05,3.5e-05,0.000108,0.000111,0.000112,0.000135,4.6e-05,2.4e-05,3.8e-05,0.000105,6.7e-05,3.8e-05,5.1e-05,5.1e-05,3.3e-05,5.9e-05,4.1e-05,4.1e-05,3.1e-05,3.4e-05,2.6e-05,1e-05,3.4e-05,2.7e-05,1.1e-05,2.5e-05,6e-06,1.2e-05,7e-06,1e-06,3.3e-05,1.6e-05,1.1e-05,1e-06,7e-06,2e-06,5e-06,1.1e-05,8e-06,1e-05,5e-06,6e-06,2.5e-05,7e-06,6e-06,3e-06,3e-06,6e-06
2e-06,3e-06,1e-06,2e-06,4e-06,4e-06,1e-06,4e-06,1e-06,2e-06,2e-06,1.2e-05,5e-06,1e-06,2e-06,5e-06,1.2e-05,2e-06,6e-06,7e-06,4e-06,4e-06,3e-06,1.1e-05,9.4e-05,1.8e-05,2.1e-05,1.1e-05,8e-06,4e-06,8e-06,7e-06,3e-06,5e-06,6e-06,3.2e-05,0.000168,0.000117,1.5e-05,0.000124,0.000198,8e-05,0.000192,0.000303,0.00028,7.4e-05,0.000136,0.00013,0.000116,0.000171,0.00021,0.000128,0.00017,9.9e-05,0.000223,7.4e-05,0.000165,0.000139,4.5e-05,0.000136,0.000196,0.00018,0.000119,2.9e-05,0.000192,0.000132,5.2e-05,0.000169,0.000108,5.1e-05,1.2e-05,7.5e-05,5.9e-05,3.8e-05,4e-06,8.9e-05,3e-05,4.7e-05,7.4e-05,2.1e-05,1.7e-05,6e-06,4.5e-05,2.5e-05,2.2e-05,2.5e-05,1e-06,1.5e-05,2.8e-05,1.1e-05,8e-06,3e-05,4e-06,6e-06,1.7e-05,1.2e-05,2.9e-05,1.9e-05,2e-06,6e-06,6e-06,3e-06,4e-06,2.7e-05,1.3e-05,5e-06,4e-06,4e-06,1e-06,2e-06,5e-06,2e-06,7e-06,5e-06,0,2.5e-05,3e-06,3e-06,2e-06,1e-06,3e-06
3e-06,4e-06,3e-06,3e-06,2e-06,2e-06,3e-06,3e-06,1e-06,1e-06,3e-06,1e-05,7e-06,3e-06,1e-06,2e-06,7e-06,4e-06,6e-06,3e-06,4e-06,4e-06,2e-06,7e-06,9.3e-05,1.4e-05,7e-06,8e-06,3e-06,2e-06,1.1e-05,6e-06,0,4e-06,4e-06,2.2e-05,9.6e-05,6.8e-05,2e-06,9.4e-05,0.000152,8.9e-05,0.000236,7.9e-05,9.4e-05,0.000168,0.000295,3.1e-05,0.000171,0.000238,1.7e-05,0.000215,0.000103,0.000142,0.00019,0.000124,5.5e-05,0.000193,0.000215,0.000168,0.000226,0.000147,3.6e-05,1.1e-05,0.000124,0.000123,2.7e-05,0.000109,0.000143,6.3e-05,2.4e-05,3.5e-05,1.5e-05,1.9e-05,1.2e-05,6.1e-05,8e-06,6.5e-05,4.4e-05,5e-06,5e-06,5e-06,2e-05,1.1e-05,7e-06,1.7e-05,1.9e-05,7e-06,1.9e-05,5e-06,1e-05,1.3e-05,1e-05,6e-06,8e-06,1.3e-05,2.1e-05,5e-06,1e-06,7e-06,4e-06,0,2e-06,2.4e-05,7e-06,2e-06,1e-06,0,3e-06,4e-06,1e-06,0,7e-06,7e-06,2e-06,2.2e-05,4e-06,2e-06,0,3e-06,4e-06
3e-06,2e-06,2e-06,2e-06,3e-06,1e-06,3e-06,3e-06,2e-06,1e-06,2e-06,9e-06,6e-06,1e-06,2e-06,2e-06,4e-06,3e-06,3e-06,2e-06,2e-06,4e-06,2e-06,4e-06,8.5e-05,4e-06,3e-06,1e-05,1e-06,2e-06,1e-05,5e-06,1e-06,3e-06,4e-06,1.3e-05,9.8e-05,6e-05,3e-06,9.4e-05,0.000149,5.6e-05,0.00029,5.9e-05,0.000185,3.7e-05,0.000281,7.1e-05,8.7e-05,0.000214,6.7e-05,0.000183,9.7e-05,0.000108,0.000148,9.7e-05,5.5e-05,0.000151,0.00019,0.000144,0.000201,0.000101,2.1e-05,6e-06,0.000156,7.7e-05,4e-05,8.8e-05,0.000103,4.9e-05,2.5e-05,3e-05,1.7e-05,1.5e-05,9e-06,6.8e-05,5e-06,5.8e-05,5.2e-05,1.2e-05,1e-05,5e-06,3e-06,7e-06,8e-06,7e-06,1.6e-05,9e-06,1.8e-05,2e-06,9e-06,9e-06,7e-06,5e-06,5e-06,1.1e-05,1.1e-05,7e-06,5e-06,4e-06,3e-06,1e-06,1e-06,2.3e-05,6e-06,3e-06,1e-06,2e-06,1e-06,2e-06,1e-06,1e-06,6e-06,6e-06,2e-06,2.2e-05,4e-06,2e-06,2e-06,2e-06,3e-06
