0.000198,0.000302,0.000229,0.000248,0.000239,0.000231,0.000291,0.000194,0.000218,0.000101,0.000132,0.000225,0.000311,0.000167,0.000216,0.000163,0.000105,0.000262,7.5e-05,0.00018,0.000203,0.000245,0.000197,0.000121,6.9e-05,7.6e-05,0.000306,0.000263,0.000218,0.000182,0.000175,0.000256,0.00015,4.6e-05,0.000125,0.00021,0.000257,0.000163,0.000123,2.9e-05,-0.000437,-2e-06,7.8e-05,8.4e-05,7e-05,1.9e-05,1.8e-05,-1.7e-05,-2.2e-05,1.4e-05,0.000219,0.000215,0.000147,0.00016,1.6e-05,0.000224,0.000171,7e-06,2.9e-05,0.000129,0.000175,0.000175,0.000114,5.8e-05,0.000157,0.000289,0.000264,0.000143,0.000137,-0.000126,0.000167,0.000153,0.000118,3e-05,6.5e-05,0.000271,0.000193,6.9e-05,-0.000164,4.4e-05,0.000245,0.000159,0.000165,0.000113,2.5e-05,4.1e-05,9.6e-05,7.1e-05,9.6e-05,0.000316,0.000327,0.000115,-3e-05,6.2e-05,0.00021,0.000325,0.000223,0.000163,9.2e-05,0.000106,0.000202,0.000358,0.000178,-9e-06,2e-04,0.000235,9.3e-05,-8.7e-05,-0.000193,4e-06,0.000131,0.00016,-8.3e-05,-4.8e-05,-4.7e-05,0.000125,-0.00019,-9.1e-05,-2.3e-05,3.5e-05,0.000208
-8e-06,0.000135,0.000236,-7.7e-05,-4.7e-05,2e-06,7.2e-05,-3.1e-05,6.6e-05,2.1e-05,7.7e-05,1e-04,-0.000112,-4.1e-05,-0.000135,2.2e-05,0.000174,0.000148,-1.5e-05,-2.5e-05,2.9e-05,0.00017,-7e-06,2.8e-05,6.7e-05,0.00015,0.00019,-4e-05,9.4e-05,8.2e-05,0.00019,4.9e-05,8.7e-05,-1.5e-05,-0.000118,1.7e-05,0.000204,4.4e-05,0.000119,8e-06,0.000443,0.000326,3.2e-05,3.9e-05,5.5e-05,7.1e-05,0.000189,0.000103,5.1e-05,4.4e-05,7e-06,9.8e-05,-9.8e-05,6.4e-05,0.000189,0.000144,0.000133,-2.8e-05,-1.1e-05,-5.9e-05,7.5e-05,3.5e-05,8.5e-05,-9.6e-05,-1.8e-05,0.00012,3.5e-05,-0.000119,-2.3e-05,9.6e-05,0.000174,5.6e-05,-0.000174,-5.6e-05,3.5e-05,2.6e-05,-2.4e-05,0.000105,0.000118,-1e-06,0.000113,0.000246,9e-05,6.7e-05,0,0.000114,0.000104,-5.8e-05,6.5e-05,9.3e-05,-4.4e-05,4e-06,-6.4e-05,-8.7e-05,-4.8e-05,-6e-06,-0.000142,-0.000205,-3.2e-05,5.9e-05,0.000174,9.6e-05,4.5e-05,-6.1e-05,-1.3e-05,0.000243,0.000118,0.000136,6.7e-05,2.6e-05,2.8e-05,6.5e-05,1.7e-05,8.4e-05,0.000114,0.000193,0.000197,-3.5e-05,0.000119,7e-05,-4e-05
-0.000117,-8.8e-05,4.2e-05,2.4e-05,-0.000142,-0.000137,-8e-06,-8e-06,-9.1e-05,-3.7e-05,-0.000184,2.8e-05,8.2e-05,-0.000184,-0.000117,4.3e-05,0.000114,5.6e-05,-9.8e-05,-0.000256,-0.000147,-3e-05,-0.000135,-7.7e-05,-1.1e-05,2e-06,-5e-05,5.3e-05,-0.000225,-0.000168,1.7e-05,0.000125,7.1e-05,-0.00011,-0.000112,-0.000208,-0.000122,-2.9e-05,-0.000139,-0.000102,-0.000224,-0.000188,-0.000126,-0.000134,-8.8e-05,6.1e-05,1.5e-05,3.7e-05,2.4e-05,-1.2e-05,-9.8e-05,5.4e-05,-0.000137,-0.000184,-8.1e-05,-7.6e-05,-8.1e-05,1.7e-05,-9.4e-05,-0.000142,5.9e-05,-8.5e-05,-3.2e-05,-0.000135,-0.000159,-0.000156,-1.5e-05,-9.6e-05,-0.000153,6e-05,-2.4e-05,-4.1e-05,-2.3e-05,-0.000209,-0.000212,2.1e-05,-0.000111,7e-06,-2.1e-05,-2.4e-05,-7.4e-05,-2.5e-05,-0.000161,-5.5e-05,0.00014,7e-06,-6.1e-05,3.6e-05,-6.6e-05,-0.000168,7e-05,-0.000138,2.9e-05,5.4e-05,-0.000154,-0.000184,-0.00018,-0.000152,0,2.8e-05,5.2e-05,-9e-06,9e-06,-1.1e-05,-8.1e-05,8.8e-05,-8.9e-05,-6e-06,-2.9e-05,-8e-06,4.8e-05,-0.000129,-0.000114,-2.3e-05,1.4e-05,2.6e-05,3.6e-05,0.000137,-1.4e-05,-6.7e-05,7.7e-05
0.000104,-1.1e-05,-2.2e-05,9.5e-05,-6.5e-05,-9.3e-05,9e-05,6.5e-05,-4.9e-05,-7.9e-05,9e-06,3.6e-05,-3.5e-05,2.4e-05,-7.4e-05,7e-06,3.8e-05,-9.8e-05,4.6e-05,-3e-05,3e-06,0.000112,9e-06,-5.9e-05,-6.9e-05,1.9e-05,3e-06,6.2e-05,-9e-06,-4.2e-05,7.2e-05,0.000115,7e-06,3.7e-05,-1.2e-05,0,0.000129,0.000107,-4.3e-05,-3.9e-05,0.000153,5.3e-05,0.000118,-4.5e-05,-8.1e-05,2.2e-05,1.8e-05,6.1e-05,3.8e-05,-1.3e-05,-0.000166,-1.8e-05,-8e-05,-5.7e-05,3.2e-05,-1.1e-05,-5e-06,2e-06,-6.2e-05,2e-06,3.8e-05,2.9e-05,-5.1e-05,7.4e-05,4.8e-05,-4.6e-05,-2e-06,8e-06,-1.4e-05,1e-06,-7.7e-05,6e-06,-4.4e-05,-5.2e-05,-6.5e-05,0.000119,-0.000162,-6.7e-05,-0.000133,-1.1e-05,0,1.5e-05,-7.6e-05,-2e-06,-7e-05,1.3e-05,-6.2e-05,-3.4e-05,-0.000107,-8.9e-05,8.4e-05,1.6e-05,-2.2e-05,-5.4e-05,-6.7e-05,-7.5e-05,5.8e-05,-6e-06,-3.8e-05,-0.000146,7.1e-05,-0.000109,-0.000156,-2.1e-05,-0.000178,-8e-06,2.7e-05,4.8e-05,-0.000139,-9.1e-05,-7.5e-05,-8e-06,-0.000105,-4.9e-05,-5.1e-05,-0.000104,1.2e-05,-3.5e-05,-0.000208,2.9e-05,5e-06
0.000104,-2.8e-05,4e-06,-3.2e-05,-9e-06,1.6e-05,9.9e-05,-3.5e-05,-6.4e-05,-7.8e-05,-1e-06,1.1e-05,4.2e-05,2.8e-05,-2.3e-05,2.5e-05,-1.5e-05,-9.8e-05,4.3e-05,5.4e-05,9e-05,6.9e-05,-2.3e-05,4.3e-05,-7e-06,1.3e-05,-8e-06,-3e-06,-6.9e-05,1.4e-05,3.5e-05,-3.5e-05,-0.000119,-1.1e-05,3.2e-05,7.3e-05,8e-05,-4.2e-05,-9.4e-05,-1.4e-05,-2.9e-05,-6.3e-05,-8.7e-05,-1.4e-05,1.7e-05,7.2e-05,-6e-06,-4.1e-05,-5.9e-05,5.6e-05,5.2e-05,8.2e-05,4.1e-05,-2e-05,-2.1e-05,-3.1e-05,2.8e-05,-1.7e-05,1.4e-05,7.1e-05,9.9e-05,1.8e-05,-1.3e-05,2e-05,5.4e-05,4.3e-05,7.7e-05,3.6e-05,3.5e-05,-8e-06,-0.000121,-4.5e-05,9.2e-05,0.000115,5.6e-05,5.2e-05,2.6e-05,3e-06,0.000108,5.3e-05,7.2e-05,5e-06,-2.3e-05,-1.2e-05,-3e-06,4.8e-05,4.5e-05,4.4e-05,4.2e-05,-2e-05,-8.8e-05,-5.4e-05,4.7e-05,3e-06,8.6e-05,2.5e-05,8.1e-05,8.7e-05,0.000151,-7e-06,8.5e-05,-8.4e-05,-4.2e-05,3.1e-05,1.5e-05,8.1e-05,-4.6e-05,-6e-05,-6e-06,2.3e-05,7e-06,0.000162,0.000167,1.8e-05,-7.8e-05,-0.000121,-0.00014,8e-06,-2.5e-05,-4.1e-05,9.1e-05
7.7e-05,1.9e-05,-0.000126,-0.000178,-9.4e-05,-3.8e-05,2.8e-05,-3.3e-05,-4.4e-05,-3.5e-05,-3.3e-05,-4.7e-05,-3.4e-05,-5e-05,2.5e-05,-0.000108,-1.9e-05,-6.4e-05,-7.5e-05,-1.5e-05,-3.9e-05,-5.3e-05,-7.6e-05,-3.2e-05,-8.9e-05,-2.3e-05,-5.4e-05,-0.000102,-6.9e-05,-3.4e-05,-2.4e-05,-9.7e-05,-0.000142,-0.000115,-3.7e-05,-4.7e-05,2.7e-05,-0.000112,-3.8e-05,-0.000122,-1.6e-05,5.1e-05,1.8e-05,-2.5e-05,-8.1e-05,-7.4e-05,-2.2e-05,-0.000117,-9.8e-05,-4.1e-05,-3.1e-05,1.6e-05,1e-05,4.6e-05,-3.9e-05,-3.8e-05,-6.7e-05,-1.5e-05,3.2e-05,-7e-05,-7e-06,-7.8e-05,-3.9e-05,3e-06,4.9e-05,-2.7e-05,1.1e-05,-5.2e-05,1.8e-05,2.6e-05,4.5e-05,-9.1e-05,-2.2e-05,7e-06,0.000102,2.5e-05,-6e-05,-2e-06,-7.8e-05,-2.1e-05,-4.7e-05,-6.4e-05,-1e-04,1.2e-05,-5.2e-05,-4.6e-05,-5.1e-05,-5.1e-05,-2.2e-05,-5e-06,-0.000101,-2.1e-05,-7.1e-05,-4.9e-05,1e-05,-9.4e-05,1.8e-05,-5.8e-05,1.9e-05,-3.7e-05,-2.3e-05,4e-06,-5.7e-05,-0.000163,9.5e-05,-9.2e-05,-9.5e-05,-3.9e-05,-2.9e-05,-4.9e-05,-3e-06,1.6e-05,2.4e-05,8e-06,-9.6e-05,-0.000114,-0.000115,-1.7e-05,3.5e-05,-8.7e-05,3e-06
-2.6e-05,-6.6e-05,-0.000103,-9e-05,-9.3e-05,-8.8e-05,-0.000109,-0.00011,-0.000105,-1.5e-05,-3.1e-05,-0.000166,-0.000153,-0.000104,-9e-05,-3.4e-05,-0.000134,-1.4e-05,-1.2e-05,-0.000105,-0.000128,-0.000126,-8.7e-05,-0.000115,-2.9e-05,-8.3e-05,-0.000107,-0.000138,-0.000101,-0.000126,-7.2e-05,-0.000119,-2.6e-05,7e-06,-7.1e-05,-7.2e-05,-0.000134,-0.000108,-6.8e-05,-8.7e-05,-1.7e-05,-0.000156,-0.000114,-0.000131,-0.000119,-7.1e-05,-9.4e-05,-3.3e-05,-1.5e-05,-2.1e-05,-6.5e-05,-0.000155,-8.4e-05,-5.8e-05,-6.4e-05,-4.1e-05,-0.000107,-0.000127,-0.000126,-4.3e-05,-0.00013,-0.000114,-6.7e-05,1.4e-05,-6.1e-05,-0.000172,-0.000117,-6e-05,-7.3e-05,-3.4e-05,-3.5e-05,-0.000122,-0.000138,-0.000134,-7e-05,-9.1e-05,-6.1e-05,-8.4e-05,-5.3e-05,-6.3e-05,-0.000108,-0.000142,-5e-06,-9.2e-05,-4.2e-05,-7.4e-05,-7.2e-05,-6.9e-05,-9e-05,-0.000129,-0.000156,-9.8e-05,-5.8e-05,8.1e-05,-6.8e-05,-0.000173,-5.1e-05,-6.3e-05,-5.5e-05,-2e-05,-6.4e-05,-7.7e-05,-9.1e-05,-7.2e-05,-0.000104,-0.000156,-0.000164,-0.000113,-8.4e-05,-0.000115,-5.8e-05,-0.000221,-7.7e-05,-8.5e-05,-8e-06,-1e-06,0,-8.3e-05,-6.9e-05,-8.3e-05,-4.2e-05
-9.6e-05,-3.3e-05,-8.3e-05,-9.8e-05,-1.1e-05,-0.000126,-0.000101,-0.000105,-8.4e-05,2.6e-05,-5.5e-05,-1.3e-05,-9.7e-05,7e-06,-0.000125,-2.6e-05,-7e-05,-0.000118,-4.9e-05,-2.9e-05,-5.3e-05,-9.8e-05,-6e-05,-6e-05,-9e-06,1.1e-05,-5e-05,-0.000122,-1.5e-05,-0.000125,-6.8e-05,-5.3e-05,-5.1e-05,-2.5e-05,-1.8e-05,-8.8e-05,-0.000132,-0.00012,-8.3e-05,-7.7e-05,-9.5e-05,-3.1e-05,-0.000106,-1e-06,-6.4e-05,-3.8e-05,-3.6e-05,-5.2e-05,-2.8e-05,3e-06,-4.6e-05,-9.1e-05,-5.2e-05,-4.8e-05,-2.1e-05,-4e-05,-9.2e-05,-4.5e-05,1e-06,-7.9e-05,-4.2e-05,-2.7e-05,-6.7e-05,-5.1e-05,-2.5e-05,-4.2e-05,-0.000123,-4e-05,-5.7e-05,-2.6e-05,-4.2e-05,-9.2e-05,-3.6e-05,3.1e-05,-6.4e-05,-4.8e-05,-3.2e-05,-7.1e-05,-1.2e-05,-3.6e-05,-2.4e-05,-9.1e-05,-6.6e-05,-9.7e-05,-4.8e-05,1e-05,-6.3e-05,-3.7e-05,-9e-06,-7.8e-05,-6.5e-05,-9.1e-05,-0.000104,-3.2e-05,-2.2e-05,-2.7e-05,-0.000102,-7e-06,3e-06,-5.7e-05,-1.2e-05,-9.5e-05,-1.7e-05,-2.4e-05,-7.4e-05,-7.4e-05,-5.6e-05,5e-06,4.3e-05,5.1e-05,-8.7e-05,-3.5e-05,-3.4e-05,-1.8e-05,-4.2e-05,-2.2e-05,-4.1e-05,-4.2e-05,-4.1e-05,-5.3e-05,-0.000102
-5.3e-05,-9e-05,-4.6e-05,-6e-06,-2.1e-05,-2e-05,-6e-05,-1.8e-05,-1.3e-05,1.6e-05,-2.6e-05,1e-05,-1.5e-05,-4.5e-05,-6.5e-05,-1.5e-05,-1e-06,-2.4e-05,-4.4e-05,-2.6e-05,0,-3.1e-05,2e-05,-4.3e-05,1.5e-05,-4.3e-05,0,-7e-06,-3.6e-05,-5.6e-05,-4.2e-05,-1.8e-05,-5.5e-05,-5.1e-05,-2e-06,2.6e-05,-3.8e-05,3.9e-05,-5.4e-05,-3e-06,-9e-06,-6.3e-05,-5.8e-05,-9.7e-05,2.8e-05,-1.9e-05,-8e-06,-5e-06,-2.9e-05,-1.5e-05,-1.1e-05,-5.3e-05,1.5e-05,-6.9e-05,-1e-06,-2.6e-05,-2.6e-05,-4.3e-05,-3.1e-05,-2.3e-05,-1.4e-05,-3.1e-05,-5.6e-05,-3.5e-05,-1.1e-05,9e-06,-0.000109,0,4e-06,-3e-05,-2.1e-05,1.4e-05,-1.4e-05,3.4e-05,-3.9e-05,-4.3e-05,0,-9.6e-05,-5.5e-05,8e-06,-1.2e-05,-5.1e-05,2e-06,-1.5e-05,-1.1e-05,-5.8e-05,-5.2e-05,-4.6e-05,-3.4e-05,1.8e-05,2.4e-05,1.7e-05,4.8e-05,-2e-05,-4.2e-05,1.9e-05,-1.3e-05,2.6e-05,-3.8e-05,1.2e-05,-7.2e-05,-9.4e-05,-1.8e-05,1.9e-05,-1.2e-05,-3.6e-05,-1.6e-05,-4e-05,-4.5e-05,2e-05,-9.9e-05,-7.6e-05,2.5e-05,3.1e-05,-2.5e-05,-4.7e-05,-5.4e-05,-2.4e-05,2.3e-05,0,-1.6e-05
2e-06,1.5e-05,9e-06,-2.9e-05,-1e-06,3.7e-05,2e-06,2.5e-05,3e-05,-5e-05,-2.4e-05,1.3e-05,-4.3e-05,1.5e-05,6.2e-05,2.3e-05,1.4e-05,-4.7e-05,-2e-05,2e-05,5.2e-05,5.6e-05,8e-06,2.3e-05,-2.5e-05,-1.3e-05,-1.5e-05,2e-06,2.8e-05,5.7e-05,3e-06,-3.1e-05,-1.6e-05,3e-06,1e-05,4.5e-05,1.1e-05,-4.2e-05,2.2e-05,3e-06,-9e-06,-3e-06,9e-06,2e-06,2.6e-05,2.8e-05,5e-06,1e-06,-3.4e-05,-1.3e-05,2.4e-05,1.9e-05,1.6e-05,-1.5e-05,4.4e-05,1.2e-05,3e-06,2.7e-05,4.1e-05,5e-05,3.1e-05,9e-06,1.4e-05,-1.9e-05,-7e-06,5.7e-05,1.6e-05,3.5e-05,2e-05,1.6e-05,5e-06,2.2e-05,-9e-06,3.2e-05,4e-06,5.6e-05,-1.7e-05,1.4e-05,4.8e-05,-1e-05,-2e-06,5.4e-05,2e-05,3.7e-05,-7e-06,1.8e-05,2.1e-05,3.6e-05,1.6e-05,2e-06,3.9e-05,-6e-06,9.4e-05,-9e-06,-4.3e-05,3.2e-05,-8e-06,6.2e-05,-1.9e-05,2.2e-05,-1.3e-05,9e-06,-2.8e-05,3e-05,1.3e-05,5.2e-05,2e-05,-0.000111,1.3e-05,-4e-05,4.4e-05,-4.9e-05,-1.9e-05,-4e-06,4.8e-05,2.7e-05,3.2e-05,-1.9e-05,-2.1e-05,5.6e-05,-1.7e-05
7e-06,1.9e-05,7.1e-05,1.3e-05,1.4e-05,3.8e-05,4e-06,-2.7e-05,1.4e-05,2e-06,2.4e-05,-1.7e-05,-1.6e-05,3e-06,4.7e-05,3e-06,4e-06,2e-06,2e-05,9e-06,1.2e-05,9e-06,9e-06,2.4e-05,-1.6e-05,9e-06,-1.7e-05,4.8e-05,3e-05,2.9e-05,2.5e-05,-1e-05,2.6e-05,2.7e-05,1e-06,-2.8e-05,1.2e-05,1e-05,2.8e-05,4.9e-05,1.2e-05,3.1e-05,5.4e-05,6.1e-05,2.9e-05,-9e-06,-1.9e-05,-1e-05,2.2e-05,-2e-06,-7e-06,1.2e-05,2.3e-05,4.6e-05,-1.7e-05,1.5e-05,1.8e-05,1.7e-05,1.5e-05,-1.4e-05,-3.4e-05,5e-06,3.3e-05,-3e-06,-1.5e-05,-7e-06,3.6e-05,2.9e-05,1.6e-05,7e-06,0,2.8e-05,-6e-06,4.3e-05,8e-06,1.7e-05,3e-05,3.5e-05,3.8e-05,3.7e-05,-9e-06,5e-06,3.8e-05,5.3e-05,1.8e-05,-1e-06,1.1e-05,3.7e-05,1.7e-05,-4e-06,-1.4e-05,-1.4e-05,-2.5e-05,1.4e-05,-2.6e-05,-1.2e-05,-3.3e-05,2.5e-05,-6e-06,-4.1e-05,9e-06,8e-06,4.6e-05,1.7e-05,-2.3e-05,3.2e-05,-1.5e-05,-1e-06,-2.3e-05,2.3e-05,2.3e-05,-6e-06,2.8e-05,6e-05,-1.4e-05,3e-06,-2.3e-05,-4.7e-05,3.5e-05,-1e-05,-4.1e-05
-3e-05,2e-06,1e-06,2.7e-05,5e-06,-2e-06,-2e-06,7e-06,9e-06,4.3e-05,1.8e-05,-1e-06,-2.2e-05,-1.4e-05,-2.2e-05,-2.1e-05,-2.5e-05,1.9e-05,2e-06,2.3e-05,-1.6e-05,-1.3e-05,-1.7e-05,3e-06,6e-06,1.1e-05,7e-06,-1.9e-05,1.1e-05,9e-06,-2.3e-05,-1.8e-05,7e-06,5e-06,2.8e-05,3e-06,0,-2.8e-05,-6e-06,-1.2e-05,4e-06,1.6e-05,-2.8e-05,-4e-06,-5.2e-05,2e-06,6e-06,1.4e-05,3e-05,1.8e-05,-3e-06,1e-05,-2.3e-05,-1e-06,-2.4e-05,1.3e-05,1.8e-05,-5e-06,2.1e-05,3e-06,-1e-05,-1.8e-05,2.8e-05,1.8e-05,2.4e-05,-1.1e-05,3e-06,-7e-06,-4e-06,7e-06,2.3e-05,-3e-05,3e-06,-5e-06,-1.5e-05,-2.2e-05,-1.1e-05,4.1e-05,1e-05,6e-06,-1.3e-05,-3e-05,0,1.3e-05,-1.9e-05,-1e-05,-3.1e-05,-1.2e-05,1.8e-05,4e-06,-3.6e-05,-1.6e-05,2e-05,2.1e-05,4.5e-05,-3.7e-05,-2e-05,-6e-06,2.2e-05,-2.1e-05,-4e-06,8e-06,8e-06,-1.5e-05,-3.2e-05,-5e-05,0,3.4e-05,2.4e-05,1.2e-05,-2.6e-05,-2e-06,-6e-06,1.7e-05,-1.6e-05,0,-1.5e-05,3e-05,-1.2e-05,5e-06,-3.4e-05
-6e-06,1.3e-05,-2.2e-05,1e-05,6e-06,-8e-06,7e-06,-3e-06,2e-06,-3e-06,2.8e-05,-9e-06,3.1e-05,8e-06,1.6e-05,1e-05,3.1e-05,1.8e-05,-3e-06,5e-06,6e-06,5e-06,-1e-06,2.5e-05,1.9e-05,7e-06,3e-06,1.9e-05,1e-05,-1e-05,2e-06,1.6e-05,2.4e-05,1e-06,4e-06,6e-06,3e-06,7e-06,-1.7e-05,-8e-06,-1e-06,6e-06,5e-06,7e-06,2.1e-05,0,8e-06,2.3e-05,3e-06,-1.8e-05,8e-06,9e-06,3e-06,2.4e-05,-1e-05,-1.1e-05,-2e-06,8e-06,-1e-06,1e-05,1.2e-05,-2e-06,1.1e-05,-2.2e-05,-6e-06,-1e-05,-2e-06,-1.5e-05,2.8e-05,-8e-06,-8e-06,1.3e-05,8e-06,1e-06,-2.4e-05,-2.9e-05,-1.2e-05,3e-05,-3e-06,-8e-06,3e-06,0,5e-06,2.1e-05,7e-06,-1.2e-05,1.5e-05,1.9e-05,8e-06,-1.2e-05,1.3e-05,-7e-06,1.7e-05,9e-06,-6e-06,-5e-06,-7e-06,-9e-06,-1e-06,-2.9e-05,-4e-06,-2e-06,1.6e-05,5e-06,2e-05,-7e-06,-7e-06,8.4e-05,3e-05,-5e-06,1.6e-05,-8e-06,-1e-05,-1e-06,-9e-06,9e-06,6e-06,3.6e-05,1.9e-05,-1.5e-05,2.8e-05
1.4e-05,-5e-06,-3.1e-05,3.4e-05,3e-06,2e-05,7e-06,5e-06,5e-06,-1.4e-05,-3e-06,-2e-06,2.2e-05,6e-06,5e-06,1.4e-05,1.3e-05,-9e-06,7e-06,-9e-06,4e-06,-3e-06,0,3e-06,8e-06,-5e-06,4e-06,1e-06,7e-06,1.8e-05,0,1.1e-05,-2.1e-05,6e-06,-9e-06,-2e-06,4e-06,2.2e-05,3e-06,8e-06,7e-06,2e-06,2.1e-05,1.5e-05,1e-05,1.2e-05,5e-06,-1.5e-05,1.4e-05,1.1e-05,8e-06,-9e-06,-8e-06,1.3e-05,1.7e-05,-1.1e-05,0,0,1e-05,-5e-06,-1.1e-05,1.1e-05,-4e-06,0,1e-06,-3e-06,2e-05,-1e-05,9e-06,-9e-06,3e-06,-1.6e-05,2e-06,-1.1e-05,2.1e-05,-1e-05,-1.2e-05,-1.4e-05,8e-06,-2e-06,2e-06,4e-06,1e-06,-3e-06,9e-06,8e-06,1e-05,-6e-06,-3e-06,8e-06,-5e-06,-1e-06,2e-06,-2e-05,-1e-06,0,1.6e-05,-1.7e-05,4e-06,7e-06,-1e-06,1.4e-05,-1.1e-05,-1.5e-05,2.4e-05,-1.5e-05,-1.2e-05,2e-05,3e-06,6e-06,1.4e-05,-2.1e-05,-1.7e-05,-8e-06,2.3e-05,-2e-06,-6e-06,1.3e-05,9e-06,3e-06,2e-06
8e-06,6e-06,2.5e-05,-4e-06,0,3e-06,1.5e-05,6e-06,5e-06,-1.4e-05,-5e-06,8e-06,8e-06,-6e-06,0,7e-06,-1.3e-05,1.3e-05,-5e-06,1e-06,1e-06,1e-06,4e-06,0,1e-06,1e-06,0,-6e-06,2e-06,-1.4e-05,1.2e-05,8e-06,1e-05,4e-06,0,1.2e-05,2e-06,3e-06,9e-06,1.9e-05,-3e-06,-2e-06,-1.1e-05,-7e-06,-1e-06,-7e-06,1e-06,5e-06,-9e-06,-3e-06,-4e-06,0,2e-06,7e-06,1.1e-05,2e-06,-6e-06,7e-06,0,2e-06,1.1e-05,-7e-06,8e-06,1.2e-05,2e-06,1e-06,1.3e-05,-2e-06,3e-06,1.3e-05,-8e-06,-7e-06,2e-05,0,1.2e-05,6e-06,8e-06,7e-06,1e-05,1e-06,1e-06,7e-06,1.4e-05,-8e-06,1.4e-05,-5e-06,-9e-06,1.6e-05,1e-06,0,1e-05,2e-06,-2e-06,2e-06,9e-06,1e-05,6e-06,-1.4e-05,1.6e-05,2.8e-05,-2e-06,-7e-06,2.5e-05,9e-06,-1e-06,1e-06,6e-06,-3e-06,5e-06,-1e-05,5e-06,4.3e-05,0,7e-06,2.7e-05,-1.2e-05,7e-06,2.6e-05,6e-06,0,1.7e-05
0,-3e-06,9e-06,-8e-06,-5e-06,-2.3e-05,-4e-06,-4e-06,6e-06,3e-06,-3e-06,1.1e-05,-1.2e-05,1e-06,-1e-05,1e-06,0,0,0,-7e-06,1e-06,3e-06,-4e-06,0,-1.3e-05,-5e-06,4e-06,-1e-06,1e-06,-1.7e-05,-3e-06,-4e-06,1.4e-05,5e-06,-2e-06,-9e-06,-1.5e-05,-6e-06,-1e-06,-1.2e-05,7e-06,6e-06,8e-06,-1e-05,6e-06,1e-06,2e-06,-4e-06,1e-06,-2e-06,1e-06,-8e-06,1e-06,5e-06,-3e-06,3e-06,-2e-06,0,4e-06,7e-06,3e-06,-3e-06,-2e-06,7e-06,-2e-06,5e-06,-1.2e-05,3e-06,6e-06,0,1e-06,7e-06,3e-06,-8e-06,-1.5e-05,2e-06,-1.2e-05,5e-06,5e-06,-5e-06,7e-06,-1e-05,-5e-06,-1.1e-05,1e-06,1e-06,-7e-06,1e-06,1e-06,3e-06,3e-06,1e-06,1.2e-05,1.5e-05,-5e-06,4e-06,-4e-06,-5e-06,6e-06,-3e-06,-4e-06,-8e-06,3e-06,2e-05,3e-06,6e-06,-3e-06,-3e-06,-5e-06,1.1e-05,-1.6e-05,2e-06,-1.2e-05,4e-06,-3.2e-05,1e-06,-5e-06,1.1e-05,2e-06,-3e-06,4e-06
2e-06,1e-06,1e-05,-1.4e-05,1e-06,6e-06,-4e-06,1e-06,5e-06,6e-06,-4e-06,2e-06,-2e-06,1e-06,-3e-06,-1e-06,-4e-06,7e-06,0,0,8e-06,2e-06,5e-06,-3e-06,-4e-06,0,-1e-06,7e-06,1e-05,6e-06,-2e-06,-1.2e-05,2e-06,3e-06,-2e-06,6e-06,-3e-06,-1e-06,-5e-06,5e-06,2e-06,0,-7e-06,7e-06,1e-05,0,-1e-06,5e-06,1e-06,-2e-06,-2e-06,1e-06,0,-1e-06,2e-06,-2e-06,-2e-06,2e-06,-1e-06,-8e-06,3e-06,4e-06,0,5e-06,0,5e-06,-1.9e-05,3e-06,4e-06,-5e-06,2e-06,9e-06,-6e-06,2e-06,5e-06,7e-06,2e-06,-3e-06,-2e-06,2e-06,-2e-06,5e-06,1.1e-05,5e-06,-1.4e-05,1e-06,5e-06,2e-06,-5e-06,-2e-06,-4e-06,-3e-06,1.4e-05,2e-06,-1.3e-05,1.2e-05,0,-4e-06,-6e-06,-1.7e-05,-2e-06,-5e-06,3e-06,1e-06,0,1.5e-05,-1e-06,4e-06,0,-9e-06,-1.3e-05,-1.2e-05,1e-06,3e-06,-9e-06,5e-06,-5e-06,-6e-06,-1e-06,1.3e-05,-3e-06
1e-06,0,2e-06,2e-06,1e-06,8e-06,-1e-06,-1e-06,4e-06,3e-06,0,-5e-06,-6e-06,-4e-06,8e-06,-4e-06,2e-06,-6e-06,-2e-06,0,0,5e-06,0,6e-06,4e-06,1e-06,-4e-06,7e-06,0,6e-06,3e-06,-1e-06,3e-06,1e-06,2e-06,2e-06,5e-06,-9e-06,-1e-06,-3e-06,0,-6e-06,3e-06,5e-06,-1.1e-05,0,-1e-06,9e-06,2e-06,3e-06,3e-06,3e-06,2e-06,-2e-06,-1e-06,0,5e-06,7e-06,1e-05,3e-06,-3e-06,-1e-06,5e-06,-5e-06,-2e-06,-1e-06,5e-06,2e-06,-1e-06,1e-06,-1e-06,-2e-06,4e-06,0,1e-06,5e-06,0,-2e-06,0,2e-06,-6e-06,1e-05,3e-06,9e-06,-4e-06,-2e-06,-1e-06,7e-06,4e-06,-4e-06,-4e-06,-1e-06,9e-06,-3e-06,5e-06,-7e-06,-6e-06,-5e-06,-2e-06,1e-06,-6e-06,0,3e-06,1e-06,1e-06,1e-06,3e-06,6e-06,0,1e-06,1.1e-05,4e-06,-1e-06,-3e-06,2e-06,3e-06,-3e-06,-1e-05,4e-06,-4e-06,-6e-06
-3e-06,3e-06,1e-06,9e-06,-1e-06,-2e-06,-4e-06,1e-06,3e-06,-2e-06,2e-06,-2e-06,-2e-06,4e-06,5e-06,3e-06,-2e-06,-9e-06,0,5e-06,-5e-06,3e-06,-1e-06,4e-06,5e-06,3e-06,4e-06,6e-06,6e-06,-1e-06,-1e-06,2e-06,-3e-06,1e-06,3e-06,-8e-06,0,1e-06,7e-06,3e-06,2e-06,1.1e-05,1e-06,-2e-06,-3e-06,0,1e-06,0,1e-06,-1e-06,-2e-06,6e-06,0,1e-06,-8e-06,3e-06,2e-06,0,2e-06,0,-4e-06,-4e-06,6e-06,-3e-06,3e-06,-3e-06,4e-06,1e-06,-3e-06,5e-06,0,-1e-06,-4e-06,-3e-06,-7e-06,1e-06,-4e-06,9e-06,4e-06,2e-06,5e-06,-3e-06,3e-06,8e-06,2e-06,0,-4e-06,3e-06,5e-06,0,-5e-06,-3e-06,-5e-06,-7e-06,-5e-06,-1e-05,-6e-06,-5e-06,-4e-06,3e-06,1e-06,3e-06,5e-06,0,-1.6e-05,-4e-06,-4e-06,4e-06,9e-06,4e-06,2e-06,2e-06,-1e-06,-1e-06,0,-4e-06,1e-06,0,2e-06,-2e-06,-7e-06
-5e-06,0,-7e-06,1e-05,3e-06,-3e-06,0,1e-06,1e-06,-7e-06,2e-06,-5e-06,3e-06,-2e-06,-2e-06,0,1e-05,1.1e-05,-1e-06,-2e-06,2e-06,-8e-06,-1e-06,6e-06,0,-1e-06,-1e-06,-1e-06,1e-06,0,-3e-06,8e-06,-1e-06,6e-06,-1e-06,4e-06,5e-06,5e-06,-4e-06,0,0,-6e-06,6e-06,1.2e-05,-2e-06,3e-06,2e-06,0,6e-06,0,-1e-06,2e-06,-3e-06,6e-06,-2e-06,-1e-06,3e-06,2e-06,2e-06,-3e-06,0,3e-06,7e-06,0,-1e-06,-1e-06,3e-06,-4e-06,6e-06,0,0,-5e-06,5e-06,-4e-06,-9e-06,-8e-06,-4e-06,9e-06,4e-06,-1e-06,-3e-06,-1e-05,2e-06,2e-06,3e-06,0,0,2e-06,-1e-06,0,1e-06,-2e-06,1e-06,4e-06,-1e-06,4e-06,-4e-06,-7e-06,-5e-06,-4e-06,3e-06,-1e-06,2e-06,-5e-06,7e-06,-1.2e-05,-2e-06,-3e-06,0,0,-5e-06,-1.3e-05,0,3e-06,4e-06,0,0,3e-06,0,-3e-06,0
-3e-06,1e-06,-5e-06,5e-06,0,2e-06,2e-06,2e-06,2e-06,0,2e-06,4e-06,4e-06,0,-1e-06,2e-06,7e-06,1e-06,0,1e-06,-1e-06,0,0,2e-06,-3e-06,1e-06,-1e-06,0,2e-06,-1e-06,2e-06,3e-06,1.1e-05,2e-06,2e-06,1e-06,2e-06,1e-06,-3e-06,3e-06,1e-06,3e-06,-2e-06,1e-06,9e-06,2e-06,2e-06,-2e-06,1e-06,1e-06,3e-06,1e-06,2e-06,0,8e-06,0,-2e-06,2e-06,2e-06,2e-06,-1e-06,-1e-06,1e-06,-5e-06,0,0,2e-06,-1e-06,2e-06,-4e-06,1e-06,-2e-06,0,-3e-06,-3e-06,-1e-06,1e-06,4e-06,-5e-06,0,0,2e-06,2e-06,0,0,-1e-06,3e-06,1e-06,1e-06,-2e-06,2e-06,-1e-06,1e-06,4e-06,1e-06,1e-06,-2e-06,-5e-06,0,-3e-06,0,0,1e-06,2e-06,1e-06,-5e-06,3e-06,4e-06,3e-06,-3e-06,4e-06,0,-2e-06,-6e-06,-3e-06,-1e-06,-1e-06,7e-06,3e-06,-2e-06,-1e-06
2e-06,0,-4e-06,1e-06,-1e-06,2e-06,5e-06,0,2e-06,8e-06,0,4e-06,1e-06,2e-06,5e-06,2e-06,-7e-06,1e-06,1e-06,0,0,1e-06,0,1e-06,-3e-06,0,2e-06,-4e-06,0,0,0,-1e-06,-2e-06,2e-06,-1e-06,-2e-06,1e-06,4e-06,-1e-06,-1e-06,0,0,3e-06,-3e-06,0,-3e-06,-2e-06,-1e-06,5e-06,0,0,-3e-06,-1e-06,2e-06,3e-06,-1e-06,0,2e-06,0,1e-06,2e-06,-2e-06,0,0,1e-06,0,8e-06,-1e-06,0,-1e-06,-1e-06,0,5e-06,-1e-06,8e-06,-2e-06,-4e-06,-1e-06,2e-06,-1e-06,2e-06,5e-06,-1e-06,-3e-06,2e-06,-1e-06,0,0,0,2e-06,2e-06,-1e-06,-4e-06,-2e-06,1e-06,-2e-06,0,-2e-06,5e-06,3e-06,-1e-06,-1e-06,3e-06,5e-06,1e-06,5e-06,-4e-06,1.2e-05,2e-06,0,5e-06,7e-06,1e-06,-1e-06,0,4e-06,0,5e-06,0,2e-06,2e-06
1e-06,0,8e-06,-6e-06,1e-06,-2e-06,1e-06,0,2e-06,-2e-06,0,2e-06,0,-1e-06,-2e-06,-2e-06,-7e-06,-2e-06,-1e-06,-3e-06,0,-2e-06,1e-06,0,2e-06,-1e-06,1e-06,0,3e-06,-4e-06,3e-06,-5e-06,0,3e-06,-1e-06,2e-06,-3e-06,-4e-06,4e-06,4e-06,-1e-06,0,-2e-06,2e-06,1e-06,0,1e-06,2e-06,-3e-06,-1e-06,-1e-06,-3e-06,-1e-06,5e-06,-2e-06,0,-2e-06,1e-06,1e-06,-2e-06,1e-06,2e-06,-2e-06,1e-06,0,2e-06,0,1e-06,1e-06,2e-06,-1e-06,1e-06,3e-06,-3e-06,-5e-06,4e-06,-2e-06,-2e-06,0,-1e-06,-1e-06,-2e-06,4e-06,-6e-06,1e-06,1e-06,-3e-06,2e-06,0,1e-06,-1e-06,-1e-06,3e-06,-1e-06,0,4e-06,-1e-06,-1e-06,0,2e-06,1e-06,2e-06,1e-06,4e-06,-5e-06,6e-06,2e-06,1e-05,-2e-06,2e-06,-3e-06,-3e-06,-2e-06,0,0,-3e-06,-3e-06,4e-06,-1e-06,3e-06,0
1e-06,0,1e-05,-1e-06,0,-2e-06,0,0,2e-06,-4e-06,-1e-06,-2e-06,0,-1e-06,-2e-06,-2e-06,-1e-06,1e-06,0,0,2e-06,3e-06,0,-2e-06,3e-06,0,-1e-06,1e-06,0,-5e-06,-1e-06,-3e-06,1e-06,1e-06,0,-1e-06,-4e-06,-1e-06,0,-3e-06,1e-06,1e-06,2e-06,0,0,-1e-06,0,3e-06,-1e-06,1e-06,2e-06,0,1e-06,-2e-06,-3e-06,0,0,0,-1e-06,3e-06,1e-06,0,1e-06,1e-06,-1e-06,1e-06,-4e-06,1e-06,1e-06,1e-06,0,1e-06,0,2e-06,-4e-06,1e-06,0,0,1e-06,1e-06,0,0,-1e-06,-1e-06,-2e-06,-1e-06,0,0,-2e-06,-2e-06,-2e-06,-1e-06,3e-06,-2e-06,-3e-06,1e-06,1e-06,0,3e-06,-6e-06,-2e-06,-4e-06,0,2e-06,4e-06,4e-06,-2e-06,6e-06,5e-06,1e-06,-2e-06,1e-06,0,1e-06,-3e-06,1e-06,-1e-06,4e-06,0,1e-06,3e-06
2e-06,0,0,-1e-06,0,1e-06,-1e-06,0,1e-06,-2e-06,-1e-06,-2e-06,0,1e-06,1e-06,1e-06,5e-06,1e-06,0,-1e-06,-1e-06,3e-06,0,2e-06,1e-06,0,-1e-06,3e-06,0,3e-06,0,2e-06,0,2e-06,0,0,1e-06,-1e-06,-3e-06,2e-06,0,-2e-06,-3e-06,-2e-06,1e-06,0,-1e-06,-1e-06,0,1e-06,0,0,-1e-06,0,0,1e-06,1e-06,2e-06,2e-06,-1e-06,-1e-06,-1e-06,1e-06,2e-06,1e-06,-1e-06,-6e-06,0,-1e-06,-1e-06,1e-06,3e-06,2e-06,-1e-06,4e-06,1e-06,-2e-06,0,-3e-06,0,0,2e-06,1e-06,1e-06,-3e-06,0,2e-06,2e-06,2e-06,0,-1e-06,-1e-06,2e-06,2e-06,3e-06,-4e-06,0,2e-06,2e-06,-3e-06,0,1e-06,2e-06,-1e-06,3e-06,0,1e-06,-1e-05,0,-3e-06,-2e-06,5e-06,-1e-06,-1e-06,-1e-06,-1e-06,0,-1e-06,1e-06,-1e-06,0
2e-06,0,-8e-06,3e-06,0,2e-06,-2e-06,0,1e-06,3e-06,0,-1e-06,-1e-06,-1e-06,3e-06,0,0,2e-06,0,1e-06,0,-2e-06,0,1e-06,-2e-06,1e-06,2e-06,3e-06,2e-06,3e-06,-1e-06,3e-06,4e-06,2e-06,0,1e-06,0,2e-06,0,-1e-06,0,2e-06,3e-06,3e-06,-3e-06,0,0,2e-06,2e-06,-1e-06,-1e-06,3e-06,1e-06,0,1e-06,0,1e-06,0,-1e-06,-1e-06,-1e-06,1e-06,1e-06,-1e-06,-1e-06,-1e-06,1e-06,0,-2e-06,0,-1e-06,-4e-06,-1e-06,1e-06,-1e-06,-1e-06,-2e-06,0,1e-06,0,0,1e-06,1e-06,5e-06,2e-06,0,-1e-06,-1e-06,0,0,0,-1e-06,-3e-06,0,-1e-06,0,-1e-06,1e-06,-1e-06,4e-06,0,-1e-06,0,-3e-06,-3e-06,-5e-06,0,-5e-06,1e-06,1e-06,3e-06,-1e-06,1e-06,0,3e-06,1e-06,0,-1e-06,0,0,-1e-06
-1e-06,-1e-06,-3e-06,3e-06,1e-06,0,0,0,0,2e-06,0,0,0,-1e-06,1e-06,1e-06,2e-06,-4e-06,0,-1e-06,0,0,0,1e-06,-2e-06,0,0,0,-1e-06,-2e-06,0,3e-06,0,0,0,-2e-06,2e-06,0,1e-06,3e-06,0,0,1e-06,3e-06,1e-06,2e-06,1e-06,-2e-06,1e-06,0,0,0,-1e-06,0,0,0,1e-06,1e-06,2e-06,1e-06,1e-06,0,1e-06,0,0,0,1e-06,-1e-06,0,1e-06,0,0,1e-06,0,-1e-06,-2e-06,-1e-06,1e-06,-1e-06,0,1e-06,-3e-06,0,1e-06,0,0,-2e-06,1e-06,0,0,1e-06,-1e-06,-3e-06,0,-4e-06,1e-06,-1e-06,0,-3e-06,2e-06,-1e-06,1e-06,0,0,-2e-06,-5e-06,-1e-06,-1e-06,1e-06,2e-06,1e-06,-6e-06,-1e-06,-1e-06,1e-06,1e-06,0,-3e-06,-1e-06,-2e-06,-1e-06
-2e-06,1e-06,0,1e-06,-1e-06,-2e-06,-1e-06,1e-06,0,-1e-06,0,1e-06,0,2e-06,-1e-06,0,3e-06,2e-06,0,1e-06,-1e-06,-1e-06,0,2e-06,0,1e-06,-1e-06,-1e-06,1e-06,-2e-06,0,-1e-06,-2e-06,2e-06,0,2e-06,2e-06,2e-06,0,-1e-06,0,0,2e-06,-1e-06,3e-06,0,0,0,2e-06,1e-06,0,1e-06,0,0,1e-06,1e-06,0,0,-2e-06,-1e-06,0,-1e-06,1e-06,0,1e-06,0,2e-06,-1e-06,0,0,0,-1e-06,1e-06,1e-06,-3e-06,-1e-06,-1e-06,1e-06,1e-06,0,0,-2e-06,1e-06,-1e-06,2e-06,0,2e-06,0,0,0,1e-06,-1e-06,-2e-06,-1e-06,2e-06,0,-1e-06,0,0,-3e-06,1e-06,0,0,2e-06,4e-06,0,0,5e-06,1e-06,-2e-06,-2e-06,4e-06,1e-06,0,-2e-06,-1e-06,-1e-06,0,0,1e-06,0
-1e-06,-1e-06,1e-06,2e-06,1e-06,1e-06,1e-06,0,0,-2e-06,1e-06,2e-06,0,-1e-06,1e-06,-1e-06,-3e-06,-1e-06,0,-1e-06,1e-06,-1e-06,0,0,2e-06,0,1e-06,-1e-06,0,2e-06,0,-2e-06,1e-06,1e-06,0,0,0,-2e-06,-3e-06,2e-06,0,0,-1e-06,1e-06,2e-06,-1e-06,-1e-06,0,-1e-06,0,0,-1e-06,0,0,2e-06,0,-1e-06,0,1e-06,0,1e-06,1e-06,-1e-06,-1e-06,0,0,1e-06,0,-1e-06,-1e-06,0,0,0,0,0,-1e-06,-2e-06,1e-06,-1e-06,0,0,3e-06,0,-1e-06,-1e-06,0,1e-06,-1e-06,1e-06,0,0,-1e-06,0,0,-1e-06,0,-1e-06,0,-1e-06,-2e-06,1e-06,-1e-06,1e-06,2e-06,-1e-06,3e-06,-1e-06,4e-06,-1e-06,0,1e-06,0,-2e-06,0,-3e-06,0,-1e-06,0,1e-06,0,-1e-06
0,0,3e-06,-2e-06,0,1e-06,2e-06,0,0,-1e-06,0,-1e-06,1e-06,0,1e-06,0,-5e-06,1e-06,0,-1e-06,0,2e-06,0,0,1e-06,0,0,-1e-06,0,0,1e-06,-1e-06,1e-06,1e-06,0,-1e-06,0,1e-06,0,0,0,1e-06,0,1e-06,-2e-06,0,0,0,0,0,0,-1e-06,0,1e-06,-1e-06,0,-1e-06,1e-06,-2e-06,1e-06,0,0,0,0,0,0,2e-06,0,-1e-06,0,0,0,2e-06,0,3e-06,2e-06,-1e-06,0,-1e-06,0,1e-06,3e-06,0,-3e-06,-1e-06,0,-2e-06,1e-06,-1e-06,1e-06,-1e-06,0,-1e-06,0,-2e-06,1e-06,-1e-06,0,-1e-06,0,-1e-06,1e-06,0,2e-06,-2e-06,4e-06,1e-06,-2e-06,1e-06,0,2e-06,-5e-06,1e-06,-1e-06,1e-06,0,-1e-06,1e-06,-1e-06,2e-06,-1e-06
0,0,3e-06,0,-1e-06,-1e-06,1e-06,0,0,2e-06,0,-1e-06,0,0,0,0,-1e-06,1e-06,0,0,-1e-06,0,0,-1e-06,0,0,-1e-06,1e-06,-1e-06,-3e-06,1e-06,1e-06,1e-06,1e-06,-1e-06,2e-06,-2e-06,-1e-06,1e-06,2e-06,0,-1e-06,-1e-06,-1e-06,1e-06,-1e-06,1e-06,1e-06,0,0,0,-1e-06,0,0,-2e-06,0,0,0,1e-06,-1e-06,0,-1e-06,-1e-06,-1e-06,0,0,0,0,1e-06,1e-06,0,1e-06,-1e-06,2e-06,-4e-06,0,-1e-06,-1e-06,1e-06,0,0,-2e-06,0,-1e-06,0,0,0,-1e-06,0,-1e-06,0,-1e-06,1e-06,0,2e-06,-1e-06,-1e-06,0,1e-06,1e-06,0,-1e-06,0,0,-2e-06,2e-06,-1e-06,0,1e-06,1e-06,-2e-06,3e-06,-1e-06,1e-06,3e-06,0,0,2e-06,0,0,1e-06
0,0,-1e-06,-2e-06,1e-06,-1e-06,0,0,0,2e-06,0,-1e-06,0,0,0,0,5e-06,-1e-06,0,0,1e-06,0,0,0,-2e-06,0,0,1e-06,1e-06,0,-1e-06,2e-06,0,0,0,-1e-06,-1e-06,1e-06,0,-1e-06,0,1e-06,1e-06,1e-06,1e-06,0,0,0,0,0,0,0,0,0,0,0,0,1e-06,-1e-06,0,0,1e-06,0,0,0,0,-1e-06,0,-1e-06,1e-06,0,0,2e-06,0,-1e-06,1e-06,-2e-06,-1e-06,-1e-06,0,-1e-06,-1e-06,0,0,1e-06,0,1e-06,0,0,0,0,-1e-06,0,-1e-06,-1e-06,-1e-06,0,0,2e-06,-1e-06,0,1e-06,0,-2e-06,5e-06,-2e-06,0,1e-06,-1e-06,0,-1e-06,3e-06,0,0,-1e-06,0,0,1e-06,0,-1e-06,0
1e-06,0,-2e-06,0,0,1e-06,0,0,0,-2e-06,0,0,0,0,1e-06,0,1e-06,0,0,0,0,1e-06,0,0,-1e-06,0,1e-06,1e-06,-1e-06,2e-06,0,0,-1e-06,1e-06,0,0,0,0,-2e-06,2e-06,0,-1e-06,-1e-06,1e-06,0,1e-06,0,0,0,0,0,0,0,0,2e-06,0,1e-06,0,0,0,-1e-06,0,1e-06,1e-06,0,0,-2e-06,-1e-06,-1e-06,0,0,0,-1e-06,1e-06,1e-06,-2e-06,-1e-06,0,0,0,0,2e-06,0,2e-06,-1e-06,0,-1e-06,0,0,1e-06,0,0,-2e-06,1e-06,-1e-06,1e-06,0,0,0,-1e-06,-1e-06,-1e-06,0,0,-2e-06,-4e-06,0,3e-06,2e-06,-1e-06,0,-3e-06,-1e-06,0,-1e-06,-1e-06,0,0,0,0,0
1e-06,0,-3e-06,0,0,1e-06,-1e-06,0,0,-2e-06,0,1e-06,0,1e-06,1e-06,0,-2e-06,1e-06,0,0,-1e-06,-1e-06,0,0,1e-06,0,-1e-06,0,0,0,0,-1e-06,0,1e-06,0,1e-06,1e-06,0,0,-1e-06,0,1e-06,1e-06,0,0,1e-06,1e-06,0,0,0,0,1e-06,0,0,1e-06,0,0,0,-1e-06,0,0,-1e-06,0,0,0,0,0,0,0,-1e-06,0,-1e-06,0,0,0,0,0,1e-06,-1e-06,0,1e-06,0,1e-06,1e-06,0,0,-1e-06,0,0,-1e-06,0,0,-1e-06,0,0,0,0,-1e-06,1e-06,0,0,1e-06,0,0,-2e-06,-2e-06,0,-1e-06,-2e-06,2e-06,0,-1e-06,1e-06,0,0,0,-1e-06,-2e-06,0,-1e-06,1e-06
0,0,-1e-06,1e-06,-1e-06,-1e-06,-1e-06,0,0,1e-06,0,0,0,0,0,0,1e-06,-1e-06,0,1e-06,0,-1e-06,0,0,1e-06,0,-1e-06,-1e-06,0,-1e-06,0,-2e-06,1e-06,-1e-06,0,-1e-06,1e-06,-1e-06,1e-06,2e-06,0,-1e-06,0,1e-06,1e-06,0,0,-1e-06,1e-06,0,0,1e-06,0,0,-1e-06,0,0,0,0,0,0,0,0,0,0,0,1e-06,-1e-06,0,0,0,0,1e-06,0,-1e-06,-1e-06,-2e-06,0,1e-06,0,0,-2e-06,-1e-06,0,0,0,0,0,0,0,0,0,-1e-06,1e-06,1e-06,0,0,-1e-06,1e-06,1e-06,0,-1e-06,0,1e-06,1e-06,1e-06,0,-4e-06,0,-1e-06,0,4e-06,-1e-06,0,0,0,-1e-06,-1e-06,0,1e-06,0
0,0,3e-06,1e-06,1e-06,0,0,0,0,2e-06,0,0,0,0,0,0,0,0,0,-1e-06,1e-06,1e-06,0,0,0,0,1e-06,-1e-06,-1e-06,-1e-06,0,0,0,0,0,1e-06,1e-06,0,0,0,0,0,0,1e-06,1e-06,0,0,0,1e-06,0,0,0,0,-1e-06,-1e-06,0,0,0,0,0,0,0,0,0,0,0,1e-06,0,0,0,0,1e-06,-1e-06,0,-3e-06,1e-06,-1e-06,0,-1e-06,0,0,0,1e-06,-1e-06,0,0,0,-1e-06,0,1e-06,0,0,1e-06,-1e-06,-1e-06,0,0,-1e-06,-1e-06,-1e-06,0,1e-06,0,1e-06,1e-06,3e-06,0,-4e-06,0,-1e-06,-1e-06,-3e-06,1e-06,0,0,0,0,-1e-06,0,0,0
0,0,4e-06,0,-1e-06,1e-06,0,0,0,0,0,-1e-06,0,0,1e-06,0,-1e-06,0,0,0,-1e-06,-1e-06,0,0,-1e-06,0,0,-1e-06,0,0,0,1e-06,0,0,0,0,0,0,-1e-06,1e-06,0,1e-06,0,0,-1e-06,0,0,0,0,0,0,0,0,0,0,0,0,0,0,-1e-06,0,-1e-06,0,0,0,0,0,0,0,0,0,0,2e-06,0,2e-06,0,0,0,1e-06,0,0,2e-06,-1e-06,-1e-06,0,0,-1e-06,0,0,0,0,0,0,0,-1e-06,0,0,0,-1e-06,-1e-06,0,-1e-06,0,0,-1e-06,3e-06,0,1e-06,-1e-06,1e-06,0,-2e-06,-1e-06,0,-1e-06,0,0,0,0,0,0
0,0,0,-1e-06,0,0,1e-06,0,0,-2e-06,0,0,0,0,1e-06,0,-1e-06,-1e-06,0,0,0,0,0,0,-1e-06,0,-1e-06,0,0,0,0,1e-06,0,-1e-06,0,-1e-06,0,0,0,-1e-06,0,-1e-06,-1e-06,0,0,0,0,0,-1e-06,0,0,-1e-06,0,0,0,0,0,0,0,0,0,0,0,0,0,0,1e-06,0,0,0,0,0,-1e-06,0,0,0,-1e-06,0,0,0,0,1e-06,0,0,0,0,0,0,0,0,0,0,0,0,1e-06,0,-1e-06,0,0,0,0,0,0,0,-2e-06,0,0,3e-06,0,0,0,4e-06,1e-06,0,0,0,0,0,0,0,0
0,0,-3e-06,-1e-06,0,-1e-06,1e-06,0,0,-1e-06,0,0,0,0,0,0,3e-06,2e-06,0,0,0,1e-06,0,0,0,0,1e-06,1e-06,0,-2e-06,0,0,-1e-06,0,0,1e-06,-1e-06,0,1e-06,2e-06,0,0,1e-06,0,1e-06,0,0,0,-1e-06,0,0,0,0,0,0,0,0,0,-1e-06,0,0,0,-1e-06,0,0,0,0,0,0,0,0,0,1e-06,0,-3e-06,0,-1e-06,0,0,0,0,-2e-06,0,0,0,0,0,0,0,0,0,0,0,0,0,0,0,0,-1e-06,1e-06,0,0,0,-1e-06,2e-06,-3e-06,0,3e-06,0,0,0,-1e-06,-1e-06,0,1e-06,0,0,1e-06,0,-1e-06,0
0,0,-2e-06,-1e-06,-1e-06,0,0,0,0,1e-06,0,1e-06,0,0,1e-06,0,1e-06,-1e-06,0,0,-1e-06,-1e-06,0,0,1e-06,0,1e-06,1e-06,-1e-06,0,0,-1e-06,1e-06,0,0,-1e-06,-1e-06,0,0,-1e-06,0,0,0,-1e-06,1e-06,1e-06,0,0,0,0,0,0,0,0,1e-06,0,0,0,1e-06,0,0,-1e-06,0,0,0,0,-1e-06,0,0,0,0,0,0,0,0,-1e-06,0,-1e-06,0,0,0,-1e-06,0,1e-06,0,0,0,0,0,1e-06,0,0,0,0,-1e-06,0,0,0,-1e-06,0,0,-1e-06,0,-1e-06,1e-06,-3e-06,0,-1e-06,-1e-06,-1e-06,-1e-06,-3e-06,1e-06,0,-1e-06,0,-1e-06,1e-06,0,0,0
0,0,-1e-06,0,1e-06,1e-06,0,0,0,2e-06,0,0,0,0,1e-06,0,-3e-06,0,0,0,0,0,0,0,1e-06,0,-1e-06,0,0,1e-06,0,-1e-06,0,0,0,0,0,0,-1e-06,1e-06,0,0,0,1e-06,-1e-06,0,0,0,1e-06,0,0,0,0,0,1e-06,0,0,0,-1e-06,0,0,0,0,0,0,0,-1e-06,0,0,0,0,0,0,-1e-06,2e-06,1e-06,-1e-06,0,0,0,0,2e-06,-1e-06,0,0,0,-1e-06,0,-1e-06,0,0,0,-1e-06,0,1e-06,0,0,0,1e-06,-2e-06,0,1e-06,0,0,-3e-06,-1e-06,0,-3e-06,-1e-06,1e-06,0,3e-06,-1e-06,0,-1e-06,0,0,-1e-06,0,0,0
0,0,1e-06,1e-06,-1e-06,0,0,0,0,0,0,0,0,0,1e-06,0,0,0,0,0,0,0,0,0,0,0,0,0,0,0,0,1e-06,-1e-06,0,0,1e-06,0,0,0,0,0,0,0,0,0,0,0,0,0,0,0,0,0,0,-1e-06,0,0,0,1e-06,0,0,0,0,0,0,0,0,0,0,0,0,0,1e-06,0,0,-1e-06,-1e-06,0,0,0,0,1e-06,1e-06,0,0,0,0,0,0,-1e-06,0,0,1e-06,0,0,0,0,0,1e-06,0,0,-1e-06,0,0,1e-06,2e-06,0,0,1e-06,0,0,2e-06,1e-06,0,0,0,0,0,0,0,0
