-0.005585,-0.003505,-0.001835,-0.006064,-0.004087,-0.003026,-0.001443,-0.003797,-0.003673,-0.0018,-0.002217,-0.003198,-0.001931,-0.002128,-0.002838,0.000518,-0.003937,-0.001852,-0.007017,-0.006975,-0.005534,-0.002436,-0.002396,-0.00176,-0.000514,-0.002037,-0.002084,-0.002367,-0.003481,-0.004533,-0.001923,-0.004998,-0.006343,-0.003524,-0.005327,-0.004929,-0.005543,-0.005938,-0.006638,-0.005763,-0.008631,-0.005925,-0.00532,-0.002017,-0.001026,-0.003904,-0.004912,-0.006441,-0.004966,-0.0072,-0.003836,-0.00254,-0.000142,-0.000269,-0.003421,-0.005429,-0.003885,-0.004327,-0.001886,-0.002189,-0.002253,-0.000557,-0.003724,-0.002692,-0.002565,-0.004529,-0.003624,-0.002841,-0.004775,-0.001699,-0.002502,-0.003103,-0.002089,-0.003023,-0.003322,-0.003324,-0.001879,-0.001762,-0.002461,-0.007037,-0.005232,-0.005097,-0.002854,-0.001718,-0.003451,-0.001102,-0.001849,-0.00332,-0.001499,-0.00239,-0.002297,-0.003527,-0.004397,-0.006359,-0.004927,-0.005202,-0.002686,-0.003243,-0.006728,-0.003519,-0.003661,-0.004994,-0.001501,-0.006633,-0.003776,-0.003903,-0.00294,-0.005207,-0.002845,-0.003915,-0.000633,-0.00375,-0.00323,-0.003702,-0.004582,-0.004338,-0.005924,-0.003988,-0.003282,-0.003233,-0.003647
-0.003406,-0.000255,-0.002401,-2.7e-05,-0.001032,-0.000384,-0.002842,-0.001568,-0.001232,-0.003772,-0.00088,-0.000849,0.00184,-0.001985,-0.001191,-0.001813,-0.003441,-0.003647,-0.001608,-0.002757,-0.004024,-0.003916,-0.005463,-0.000761,-0.00238,-0.001383,-0.001273,-0.003823,-0.005141,-0.002404,-0.004349,-0.00318,-0.000657,0.000464,-0.00031,0.001648,0.000463,-0.000995,-0.002125,-0.000592,0.002348,-0.000273,-0.002685,-0.002864,-0.005424,-0.003265,-0.00195,0.000859,-0.001053,0.000971,-0.00304,-0.003497,-0.006216,-0.008085,-0.004266,-7e-04,-0.000825,-0.001815,-0.004733,-0.004032,-0.002179,-0.004058,-0.00148,-0.00109,-0.002278,-0.001623,-0.001058,-0.003868,-0.002108,-0.002493,-0.001026,-0.004488,-0.001902,-0.002839,-0.001504,-0.004528,-0.004361,-0.003466,-0.001339,-0.000469,-0.000722,-0.000484,-0.000786,-0.004332,-0.002015,-0.001118,-0.005153,-0.001524,8e-05,0.000168,-0.001605,-9e-06,-0.000562,-0.000697,-0.003691,0.000746,0.000117,-0.001744,-0.001336,0.001685,-0.00043,-0.000795,-0.000388,0.001898,0.001947,-0.000783,0.000461,0.000444,-0.003338,-0.001015,-0.004396,0.001831,-0.003442,-0.000686,-0.003289,-0.002435,0.000752,-0.000101,-0.002561,-0.003188,-0.00045
0.000361,-0.001519,-0.001941,-0.001952,-0.000939,-0.000601,-0.001839,-0.002063,0.000176,-0.000785,-0.002627,-0.000368,-0.001463,-0.001613,-0.001462,-0.002409,-0.00127,-0.001731,-0.003665,-0.004481,-0.002184,-0.000893,-1e-05,-0.001346,-0.000774,-0.001211,-0.001038,-0.001639,-7.7e-05,-0.000222,0.000168,-0.001507,-0.002011,-0.001287,-0.002846,-0.001648,-0.000179,-0.001042,-0.001664,-0.003697,-0.004757,-0.000597,0.000588,-0.003082,-0.003043,-0.002439,-0.000885,-0.00275,0.000611,0.000532,0.001565,0.000926,0.000445,0.000392,-0.002058,-0.002215,-0.001482,-0.002918,-0.002599,-0.002671,-0.000417,-0.002204,-0.004775,-0.002184,0.000373,-0.002076,-0.002761,-0.004725,-0.000481,-0.000844,-0.000738,0.002523,-0.002799,-0.002367,-0.00436,0.000318,0.001785,-0.002288,-0.001237,0.000416,-0.001129,-0.000607,-0.002111,-0.000994,-0.000247,-0.001816,0.000119,-0.001157,-0.001111,-0.000961,-0.00129,-0.000937,0.00025,-0.001806,0.003099,-0.000436,-0.002658,-0.002534,-0.001243,-0.002876,-0.000914,-9e-05,-0.002428,-0.003003,-0.00196,-0.001203,-0.001705,0.000984,-0.001783,-0.001647,-0.001592,-0.003228,-0.001428,-0.001921,0.002588,0.00089,0.00024,-0.002452,-0.00108,0.000504,0.000787
0.002539,0.002469,0.004072,0.004772,0.002372,0.001926,0.003699,0.004238,-0.00172,0.001996,0.001012,-0.001446,-0.000624,0.002743,0.003324,0.002653,0.003326,0.005173,0.004519,0.002532,0.004225,0.000239,0.001597,0.000859,0.001169,0.000394,0.001689,0.004021,0.001565,0.000434,0.001514,0.002732,0.002178,0.000385,0.003998,-0.000472,-0.000353,0.001758,0.002399,0.002696,0.003208,0.002177,0.002617,0.005498,0.002671,0.003003,0.003649,0.002106,-0.000287,0.000617,-0.00038,0.003547,0.001006,0.003227,0.005737,0.002352,0.001262,0.001742,0.000914,0.002567,0.001749,0.001569,0.003245,0.001491,0.001195,0.002746,0.001061,0.00284,0.00177,4.6e-05,-0.000545,-0.00066,0.003733,0.002741,0.002982,0.003106,0.000655,0.002328,0.003835,9.8e-05,0.001836,-0.000386,0.002023,0.003079,0.00135,0.000189,0.002723,0.002863,0.000591,0.000404,0.001865,0.000746,-0.002039,-0.000972,-0.002698,0.00073,0.003017,0.002444,0.002156,0.002895,0.000264,0.000481,0.003725,0.001814,0.002369,0.000931,0.001952,-0.002019,0.002382,0.003201,0.001919,0.002593,0.000788,0.00053,-0.000593,-0.000722,0.00072,0.000485,3.4e-05,-0.000566,-0.001272
-0.002073,-0.001837,-0.002882,-0.003124,-0.001523,-0.001793,-0.000559,-0.002229,0.000995,-0.001042,-0.000502,0.000995,-0.000834,8.9e-05,-0.001286,-0.000564,-3.2e-05,-0.001354,-0.00152,0.000943,-0.00103,0.001993,0.000632,-0.000399,-0.000563,-0.002339,-0.001202,-0.001508,-0.001142,0.000366,0.000188,-0.000869,-0.000606,-0.000196,-0.001571,0.00016,0.000242,-0.000671,-0.00145,-0.001048,0.000129,-0.000783,-0.001157,-0.001661,0.002094,-0.000726,-0.002537,-0.000173,0.000133,-0.00022,0.000497,-0.001531,-0.001217,0.001071,-0.000474,0.000708,-0.00123,-0.00083,0.002357,0.000125,-0.001357,0.002197,0.001923,-0.002239,-0.000469,-0.0011,-1.8e-05,0.000893,-0.000904,0.000793,0.000674,-0.000534,-0.001626,1e-06,0.000816,-0.00106,-0.003157,0.000568,-0.000747,-0.000728,-0.0013,0.001979,0.000218,-0.001224,-0.001062,0.000628,-0.000783,-0.000582,5.4e-05,0.000967,-0.000967,0.001759,0.001632,0.000839,0.001226,-6e-05,-0.001528,0.000625,0.000554,-0.001237,-0.000436,-0.000623,-0.00162,-0.000901,-0.001466,0.000108,-0.000466,0.000717,-0.000679,-0.001912,0.000127,-0.000453,0.002257,-0.000423,-0.00207,0.000137,-0.001215,0.001046,0.001046,0.000132,0.001702
7.4e-05,0.002262,0.001889,-0.000171,5e-06,-0.00026,-0.001323,-0.000334,-0.000753,0.000909,0.001267,0.001422,0.001974,0.000127,-0.001494,-0.000275,-0.000536,-0.000961,-0.000906,-0.000783,-0.000752,-0.000767,0.000119,0.000299,-0.000545,0.001497,0.000826,0.001837,0.000158,-0.000156,0.001412,6e-06,0.00077,0.001228,0.000723,-0.000948,0.000143,-0.000111,0.001427,0.00184,6.9e-05,-0.001253,-0.000184,-0.000544,-0.000262,-0.000943,-0.000198,-0.00142,0.000934,0.000813,-0.000349,-0.000346,0.000637,-0.002482,-0.002966,-0.000552,0.000854,0.000301,-0.000117,-0.001682,0.000112,-0.001725,-0.000672,0.001578,-0.00033,-0.000537,-0.001023,-0.000229,0.000804,-0.000265,0.000276,-9.3e-05,-0.001316,-0.000533,-0.001146,0.000305,0.00162,-0.00071,-0.000713,0.000309,0.000854,0.000832,-0.000688,-0.000469,-0.000871,0.000218,-0.001049,-0.000876,-0.001101,-0.000148,-0.000688,-0.002417,0.000883,0.000499,-0.000669,0.000819,0.001528,-0.000951,0.000286,0.000296,0.001935,-0.000402,0.000192,0.000881,0.002286,0.00092,0.0014,-0.000279,0.000806,0.000809,0.001459,-0.00012,-0.000417,-9.3e-05,0.001606,0.000586,0.000871,-0.000645,-9.6e-05,0.002792,-0.000453
0.001104,-0.001365,-0.000994,0.00066,0.001048,0.0014,-6.5e-05,0.000429,-5.9e-05,0.00056,-0.000262,-0.000263,-0.00012,-0.000546,0.001417,0.000837,-0.001011,-0.000171,0.002408,-0.000568,0.000133,-0.002336,-0.000526,-0.000451,0.001052,0.00086,0.000292,-0.001715,9.1e-05,0.001469,-0.001121,0.000576,-0.000964,-0.00174,-2e-04,0.00083,0.00111,-0.000467,-0.000804,-0.001363,0.000166,0.001059,0.001255,0.000679,-0.001698,-0.00039,-0.000152,0.00114,-0.000856,-8.7e-05,-0.001151,0.000313,0.001411,-0.000681,0.000157,-0.001387,-0.000509,9.5e-05,-0.001303,-0.000174,0.000128,0.000448,-0.001733,-0.000434,-0.000758,0.000275,0.000469,-0.001718,-0.001027,0.001232,0.000474,0.000792,0.00167,-0.000351,-0.000437,-0.000836,0.001594,0.001076,-0.000497,-0.000726,-9e-06,-0.000239,9.5e-05,-0.000764,0.000994,-0.001084,0.000631,0.00051,0.000649,0.000291,0.000185,-0.000347,-7.5e-05,0.000441,0.001008,-0.000353,0.000331,0.000607,-0.002123,-0.002249,-0.001145,0.000719,-0.000601,-0.000729,-0.00261,-0.001533,-0.001861,-6.7e-05,-0.000745,0.000454,-0.000275,-0.001902,-0.001214,0.000576,0.000192,-0.000103,0.000809,0.000719,-0.000976,-0.001566,-0.000756
0.000171,0.000182,0.000102,0.000701,-0.00054,-0.0013,0.000311,0.000776,2.6e-05,-0.001136,-0.000321,0.00087,-0.000545,-0.000921,-0.00057,-0.000339,0.000835,0.001431,-0.000317,0.000564,0.001347,0.002253,-0.000239,-0.001065,-0.00125,-0.001221,-0.000615,5.5e-05,-0.000428,-0.000496,5.6e-05,0,0.001045,0.000286,0.000256,0.000314,-0.000247,0.000654,0.001298,-0.000122,-0.000402,-0.000272,-0.001586,0.000945,0.001362,0.001902,0.001991,0.000912,0.000129,-0.000653,-3.1e-05,-0.000539,-0.000694,0.001803,0.001889,0.000275,0.000712,0.000931,0.000979,0.000967,0.001938,0.000515,0.001372,0.001369,0.001131,0.000195,0.000553,0.0012,0.000641,0.000197,7.3e-05,-2.7e-05,0.000241,0.000889,0.000704,0.001689,-0.00102,-0.001064,0.001904,0.001374,0.000515,-0.000683,0.000295,0.001214,0.000239,0.000973,0.000224,0.000151,-3.9e-05,-0.000582,-0.000736,0.000157,-0.000397,-0.000727,-0.000333,-0.001335,-0.001455,-0.000924,-0.000112,0.00131,0.000407,-0.000399,0.00074,0.001129,0.001271,0.001601,0.000154,-0.000692,0.000199,-3.5e-05,0.000677,0.001552,0.000132,0.000263,0.000924,-0.000265,-0.001079,0.000402,0.001059,-0.000302,0.000381
-0.000464,0.000593,-0.00065,-0.001115,-0.000891,0.000696,-0.000917,-0.000551,0.001111,0.000805,5.2e-05,-0.001384,-2e-05,-8e-05,0.000117,-0.000646,-0.000474,-0.000447,-0.000713,0.001751,0.000692,0.000209,0.001304,0.001889,0.000227,0.000616,0.000157,0.000511,0.000839,-0.001003,-0.000322,-0.000247,-0.001295,-0.001083,-0.000732,-0.000658,-0.001343,-0.000354,-0.001039,-0.000254,0.000158,0.000175,0.000449,-0.001169,-0.000357,-9.5e-05,-0.000511,-0.000873,0.000407,9.8e-05,0.000817,0.001231,-8.2e-05,-0.000857,-0.000988,0.000855,-0.000272,-5e-04,-0.000232,0.000305,-0.000723,-0.000838,8.8e-05,-0.000743,-0.000723,0.000185,0.000279,-0.000263,-0.001055,-0.000896,-0.000482,0.000557,-0.00046,-0.000279,0.000656,0.00016,-0.000756,-0.000741,-0.000532,-0.001094,-0.001674,0.000985,-0.000411,-0.000475,0.000414,0.000113,0.000405,8.8e-05,-0.000307,-0.000394,0.000708,0.000371,-0.000453,0.000112,0.000418,0.000725,-1e-04,0.000694,0.001342,0.000151,-0.000458,0.000631,-0.000631,-0.000665,0.000579,-0.001443,0.000416,0.000848,-0.000725,-0.000531,-0.0022,-0.000768,0.000646,-0.001587,-0.000447,-0.000123,-0.000783,-0.000185,-0.000333,0.000555,0.000189
0.000148,-0.000273,0.000377,0.001089,0.000569,-0.000316,0.000189,-0.00042,-0.001122,-0.001378,0.000256,-0.000101,-0.000172,0.000907,-0.000345,0.000441,2.9e-05,-0.000965,-0.000362,-0.001765,-0.000869,-0.001069,-0.001188,-0.000741,-0.000137,1.3e-05,0.000429,4.5e-05,-3.7e-05,0.001377,-0.000159,0.000371,0.000547,0.000608,0.000239,-0.000108,0.000513,-0.000115,-2.1e-05,0.001386,0.000186,-0.000763,-0.000913,-0.000543,-0.000358,-0.001066,-0.001084,-0.000435,0.000184,0.000717,0.000146,-0.000555,-0.000251,0.000477,-2.9e-05,-0.000172,-0.000495,0.000506,-0.000717,0.000278,-7e-04,-0.000128,-0.000365,-0.00068,0.001254,9.9e-05,-0.000257,-6.9e-05,0.000278,-0.000396,-0.000325,-0.000626,0.000193,-0.000263,-0.000302,-0.00063,7.8e-05,0.000245,-0.000206,-0.000351,0.000263,-0.001155,0.000422,0.000302,-0.000716,-0.001001,-0.000631,-0.000187,0.000148,0.000371,-0.000141,-0.000979,0.000851,-0.000791,-0.000437,0.001507,0.000133,-0.000886,-0.000611,8.9e-05,0.00097,-0.000984,-0.000374,0.000402,-0.000404,1e-04,-6.2e-05,-0.000385,0.000212,0.000176,0.000819,0.000912,-0.000923,-8.5e-05,-0.000265,0.000667,0.00086,0.000251,-0.00022,0.000338,-0.000526
-0.000311,-0.001031,-0.000206,-0.000583,0.000268,0.000231,0.000527,-5.3e-05,0.000171,0.000811,-0.000152,0.000124,0.000236,-0.00047,2.8e-05,0.000678,0.000377,-0.000241,0.000595,0.000634,0.000317,-0.000211,7e-05,-0.000498,-0.000149,3.8e-05,-0.000553,-0.000148,-0.000142,-0.000838,0.000165,-0.000449,-0.000324,0.000908,0.000363,0.000141,-0.000153,0.000228,0.000287,-0.00128,0.000292,0.000358,0.001168,3e-04,-0.000164,-0.000364,0.001084,0.000448,-0.000243,-0.000735,-0.000115,-0.000265,0.000299,0.000734,-0.000225,-0.000957,8.1e-05,-2e-05,0.000491,-0.001028,0.000502,0.000941,0.000376,0.000658,-0.00035,-0.000436,-7e-06,-0.000353,-0.000344,0.001136,0.000156,-0.000346,-1.7e-05,7.1e-05,0.000127,-4.3e-05,0.000339,0.00063,-0.000231,0.000642,-0.000413,9e-06,-0.000832,-0.000407,0.000398,0.000415,0.000416,3.1e-05,0.000263,-0.000151,2.2e-05,0.000594,0.000477,0.000502,0.000123,-0.001768,-0.000304,0.000879,-4.4e-05,-0.000845,-0.001208,1.2e-05,0.000642,-7.8e-05,-0.000543,-0.000355,-3.2e-05,-0.000381,3.4e-05,-3.2e-05,0.000729,0.000105,-4.5e-05,0.000993,0.000259,0.00032,-0.00017,-1.7e-05,0.000569,-0.000275,0.001001
0.000212,0.000382,5e-04,-2e-05,-0.00015,-0.000311,-0.000235,0.000122,0.000292,0.000212,7.3e-05,0.000651,0.000262,1.7e-05,-1e-05,-0.000413,-7.7e-05,0.000608,6.2e-05,0.000603,-0.000196,0.001051,0.000497,-0.000215,0.000755,3.2e-05,-0.000305,-0.000317,5.9e-05,0.000126,-0.000182,0.000268,0.000178,-0.000306,-0.000774,-7e-05,9.7e-05,-0.000516,2.7e-05,0.000467,-0.000753,0.000388,-0.000153,-0.000141,0.000202,0.000282,2.5e-05,0.000178,3.6e-05,0.000271,0.000146,0.000832,-0.000382,-6e-04,-0.000232,0.000402,0.000794,-0.000311,0.00019,0.000466,0.000104,-0.000515,-0.000241,0.000544,-6e-06,0.000501,0.000219,0.001021,0.000392,-0.000532,-0.000203,5.2e-05,-2.7e-05,0.000551,-0.000371,-0.000317,-0.000136,-0.00036,5e-06,0.000125,0.000129,2.1e-05,-0.000366,0.000259,-9.2e-05,0.000649,-0.000608,2e-06,-0.000527,-0.000166,-0.000242,0.000111,-0.001077,0.000451,-1.1e-05,0.000742,0.000312,-0.001297,0.000243,-6.3e-05,2.8e-05,0.000249,-0.000406,-1.1e-05,-0.000263,0.000423,0.000391,0.000132,0.000135,0.000303,-0.000654,-0.000163,9.6e-05,0.000385,-0.000586,-0.000389,-0.000175,-0.000236,-0.000318,-0.000231,-0.000416
6.4e-05,0.00068,-0.000173,-8.1e-05,-1e-06,0.000289,0.000127,-0.00014,-2e-06,-0.000158,-5e-06,-0.001004,-0.000285,0.000203,0.000749,-0.000253,-0.000345,6.5e-05,-0.000399,-0.000701,0.000276,-6.5e-05,-0.00038,0.000559,0.000225,2.2e-05,0.000175,0.000222,6e-05,-0.000289,0.000719,0.000118,-1.5e-05,-0.000407,0.000955,1e-06,-0.000433,0.000496,-6.9e-05,0.000174,0.000278,-7.5e-05,5.7e-05,0.000206,-0.000444,0.000393,-0.000646,1e-04,0.00011,-0.00024,0.000139,-0.000547,-0.000123,-0.000455,0.000779,0.000188,-5.8e-05,0.000342,-3.3e-05,-0.000375,-9.7e-05,-3.8e-05,-1.6e-05,-0.00031,-0.000771,-0.000276,-0.000337,-0.000492,6e-06,-0.000314,0.000162,0.000168,-9.7e-05,-0.000663,0.000582,0.000221,-0.000496,0.000258,0.000201,-0.000342,7.4e-05,0.000213,0.000325,-0.000128,0.000387,-0.000401,0.00041,0.000193,0.000235,-7.3e-05,-0.000115,-0.000232,1.6e-05,-0.000178,3.9e-05,-0.000286,-0.000193,0.000378,0.000119,0.000664,0.000278,0.000119,6.4e-05,-8.5e-05,0.000194,-0.00042,-0.000484,0.000314,0.000493,-0.000252,-0.000178,-0.000427,0.000264,-0.000529,0.000137,-0.000265,0.000522,-7.1e-05,0.00017,0.000171,-0.000434
-9.9e-05,-0.000592,-2.6e-05,-3.3e-05,-3.6e-05,-1.9e-05,9.3e-05,0.000221,-0.000428,4.8e-05,-0.000296,0.00012,0.000211,-0.000281,-0.000211,0.000177,0.000236,1.2e-05,-0.000144,0.000223,-0.000318,-0.000607,0.000239,1e-06,-0.000681,-2.8e-05,1.8e-05,-0.000111,5.4e-05,0.000223,-0.000577,-0.000162,4.8e-05,0.000166,-0.000827,-3e-06,0.000384,0.000506,-0.000225,-4.3e-05,6e-05,-9.5e-05,-9.3e-05,-0.000219,3.2e-05,-0.000175,9e-06,-0.000113,-9.5e-05,0.000202,-4.6e-05,-0.000117,-0.000103,0.000213,-0.000449,-0.000401,-0.000592,-0.000109,-8.5e-05,0.000308,-0.000331,-0.000352,-0.000508,-0.000306,0.000238,0.000124,0.000105,9.3e-05,-0.000221,-0.000357,2.4e-05,0.000165,-0.00016,0.000591,-0.000351,-0.000177,-4.3e-05,6.5e-05,0.000339,-6.3e-05,-0.00012,-0.000432,-0.000192,-7.6e-05,-0.000258,-0.000228,-0.000352,-0.000131,0.000272,0.000237,0.000233,0.000153,0.000103,7.6e-05,3.7e-05,0.000181,-1.3e-05,3e-06,-0.000571,-0.000122,-1.2e-05,0.00017,5.9e-05,2.6e-05,8.6e-05,0.000368,0.000234,-0.000121,-0.000353,0.000203,0.000234,3.7e-05,3.5e-05,-0.00012,0.000194,-0.000193,-0.000515,-4.3e-05,-3.2e-05,7.9e-05,0.000161
-8.8e-05,-3e-06,-0.000118,-3e-05,0.000112,-5e-06,-0.000121,5e-05,0.000196,-3.8e-05,9.7e-05,0.000344,-0.000263,0.000147,-0.000163,0.000209,4.8e-05,-7.6e-05,0.000256,0.000118,0.000274,0.000263,-0.000226,-0.000198,1.7e-05,1.9e-05,-2.6e-05,0.000242,4.6e-05,-0.000328,-0.000556,0.000243,-0.000116,7.7e-05,-0.000252,-6.9e-05,-0.000163,-0.000403,8.8e-05,-0.000339,-0.000297,-0.000186,-3.4e-05,3e-04,0.000389,-7.8e-05,0.000156,-0.000121,-0.000427,4.3e-05,0.000341,-9.8e-05,0.000176,-7e-05,0.00023,0.000221,0.000283,0.000162,0.000145,0.00014,-0.00015,-3.1e-05,0.000397,0.000102,0.000217,-3.7e-05,-0.000182,-0.000199,6.4e-05,0.000174,-6.7e-05,-7.4e-05,9.3e-05,-0.000217,0.000193,-9.3e-05,0.000349,8e-06,-5.5e-05,0.000135,0.000152,0.000101,0.000107,0.000121,2.9e-05,0.000314,0.000256,-5.2e-05,-0.00032,0.000213,4.8e-05,3e-05,8.7e-05,-1.8e-05,0.00013,8.6e-05,0.000263,0.000127,0.000314,-7.2e-05,-0.000159,-0.000285,-0.000165,-0.000125,-0.000131,-0.000379,-0.00042,-0.000101,0.000102,7e-05,3.8e-05,0.000164,0.000184,0.000152,-0.000325,-2.8e-05,-1e-05,-2.1e-05,0.000319,-0.000167,0.000217
0.000133,0.00026,0.000126,5.4e-05,4.1e-05,-0.000189,-0.000122,-0.000104,0.000217,7.5e-05,-0.000123,5e-06,5.6e-05,-2.8e-05,-0.000243,-4.5e-05,-0.000166,-0.000104,0.000107,-0.000182,-0.00039,-0.000126,0.000109,0.000101,0.000131,-0.000172,5e-06,6.2e-05,3.7e-05,0.000286,0.000576,-0.000139,0.000102,-0.000118,0.000373,-4.2e-05,0.000248,0.000106,-2e-06,2.4e-05,0.00035,6.7e-05,4.3e-05,2e-05,-0.000203,-0.000147,0.000172,1.1e-05,2e-04,-0.000168,-0.00014,-0.000155,-2.2e-05,-3.3e-05,-0.000166,0.000185,0.000259,3.7e-05,-0.000114,0.000104,0.000213,0.000114,-6.2e-05,0.000234,5.7e-05,-0.000168,0.000102,1e-04,-9.3e-05,-0.000138,6.2e-05,-7e-06,2.4e-05,-3e-06,0.000122,-5.6e-05,0.000133,5.2e-05,-0.000124,-8.3e-05,0.000109,-2.6e-05,-1.2e-05,-5.5e-05,-0.000115,-0.000173,2.2e-05,-1.7e-05,0.000138,-0.000305,-5.6e-05,-0.000189,-0.000381,0.000332,-6.8e-05,-0.000103,-2.9e-05,5.3e-05,-7e-06,-5.5e-05,-0.000109,0.00019,0.000195,5.2e-05,0.000257,-5.6e-05,8.2e-05,-8.6e-05,-9e-05,-0.000295,-0.000108,0.000112,-0.000118,0.00049,-0.000181,1e-04,0.000243,-1.8e-05,-0.000243,-0.000193,-0.00031
-0.000198,-0.000133,0.00016,-7.6e-05,-0.000145,6.9e-05,0.000129,9.7e-05,-0.000184,-4e-05,0.000164,-0.000187,0.00013,-4.9e-05,0.000137,-9.5e-05,1.8e-05,4.9e-05,0.000122,8.1e-05,3.8e-05,-0.000196,-3.7e-05,9.5e-05,0.00013,5.6e-05,5e-05,-0.000145,-1e-05,-0.000196,-0.000143,-2.3e-05,2.1e-05,-0.000133,-0.00013,7.9e-05,-0.000131,-0.000259,6.6e-05,7.2e-05,-2.5e-05,0.000121,-2.6e-05,-0.000152,0.000159,3.5e-05,0.000207,-7.1e-05,3e-04,0.000227,-3.7e-05,0.000224,-0.000145,0.000195,-0.000332,-0.000175,-1e-05,-0.000262,-0.000219,-8.1e-05,0.000134,-2.8e-05,-0.000118,5.4e-05,-4.1e-05,8.4e-05,-1e-06,-1.1e-05,4.3e-05,0.000168,7.6e-05,-8e-05,5.7e-05,9.3e-05,-8.8e-05,-5e-05,-0.000181,-0.000243,-0.000135,6.3e-05,-8.6e-05,1.6e-05,0.00016,0.000187,0.000207,4.8e-05,-5e-05,3.1e-05,-7e-06,-3e-05,4.1e-05,7.2e-05,-1.8e-05,-9.2e-05,-5.3e-05,5.1e-05,-5e-06,0.000251,-0.000165,-7e-06,0.000148,-0.000119,-5e-06,-4e-06,-9.4e-05,0.000355,8.6e-05,7.9e-05,0.000127,0.000158,0.000108,-8e-06,-0.000148,-0.000381,-0.000113,6e-06,-0.000191,-7e-05,2.2e-05,0.000289,0.000124
0.000156,-5.6e-05,-0.000239,0.000134,-5.1e-05,4.2e-05,-6e-05,-9.4e-05,-2.3e-05,-0.000125,-1.9e-05,-3e-05,-9.9e-05,7.8e-05,8.9e-05,-5.8e-05,-4.5e-05,2.5e-05,-8.9e-05,2.4e-05,-5.4e-05,0.000142,-6.3e-05,-0.00019,6.9e-05,-1.6e-05,0.000106,-1.6e-05,-5.1e-05,0.000145,0.000158,3e-05,-7e-05,0.000214,0.000129,-5.6e-05,8e-06,-3.2e-05,-1.4e-05,4.1e-05,-0.000124,3.6e-05,-7e-05,0.000115,0.000129,0.000186,-0.000276,-4.3e-05,-0.000149,-0.00016,-5.2e-05,-0.000104,-1.7e-05,-0.000113,0.000191,-2.6e-05,1.4e-05,5.9e-05,0.000184,-2.3e-05,-4.8e-05,-0.000109,0.000202,-0.000111,-0.000186,-3.7e-05,-1e-06,1e-06,9.8e-05,-2e-04,1.7e-05,1.7e-05,9e-05,-4.1e-05,-7.1e-05,0.000135,-7.9e-05,0,-9.5e-05,1.6e-05,-0.000108,1.7e-05,-0.000196,-3.1e-05,-6.2e-05,9.8e-05,1.3e-05,5.1e-05,2.5e-05,0.000182,-8.5e-05,9.3e-05,0.00014,-2.8e-05,-1.2e-05,7e-06,-9.1e-05,-0.000292,5.2e-05,-5e-06,7.6e-05,7.7e-05,-2.8e-05,1.4e-05,-0.000155,-0.000207,-0.000135,-4.5e-05,-2.1e-05,-9e-06,-0.000143,-3.6e-05,-3.2e-05,-0.000277,0.000373,0.000121,0.000137,5.4e-05,0.000105,-0.000138,0.000131
-9.4e-05,4.3e-05,4.2e-05,-3e-06,8.9e-05,2.9e-05,-3.2e-05,3.2e-05,0.000113,0.000107,-8e-06,0.000158,-7e-06,-5e-06,9.3e-05,5.5e-05,-3.4e-05,3.6e-05,-5.4e-05,-7.5e-05,6.7e-05,0.00015,0.000152,-5e-06,-0.000133,-8e-06,-5.5e-05,-0.000159,5e-06,1.5e-05,-9.5e-05,-0.000118,3e-05,2.8e-05,-3.8e-05,1.2e-05,-3.4e-05,0.000149,6e-06,-0.00029,7.7e-05,-8.5e-05,3.1e-05,-7.6e-05,4e-06,0,-0.000143,2e-06,9.5e-05,1.1e-05,2.6e-05,7.8e-05,4.1e-05,-1e-04,-2.1e-05,5.1e-05,-0.000258,-3.6e-05,-0.000133,-2.2e-05,-0.000156,0.000133,-7.7e-05,-6e-06,4.1e-05,-4.9e-05,3.6e-05,7.4e-05,-2.7e-05,8.6e-05,2e-06,1.1e-05,-0.00014,-9.8e-05,5.7e-05,4e-06,3.1e-05,0.000176,0.000185,-0.000205,7.8e-05,0.000118,0.000115,0.000101,1.7e-05,-1e-05,-0.000106,4e-06,-6.5e-05,-5.7e-05,2.7e-05,0,5.5e-05,2.4e-05,9e-06,-0.000106,-0.000111,0.000182,0.000108,0.000107,-0.000124,-2.2e-05,6.9e-05,0,0.00012,0.000153,0.000154,1.8e-05,2.3e-05,-4.5e-05,6.1e-05,-8.2e-05,-7e-06,0.000269,3.5e-05,-5.6e-05,-0.00012,7e-06,-0.000115,-0.000103,-2.6e-05
-1.4e-05,0.000129,-2.7e-05,-7.8e-05,2.6e-05,-3.1e-05,7.7e-05,-8e-06,-2e-05,-3.3e-05,4.6e-05,-3.5e-05,1.4e-05,-1.1e-05,-8.7e-05,1e-06,8.9e-05,-4.9e-05,0.000122,-5.5e-05,-1.3e-05,-0.000254,-7.6e-05,8.7e-05,4e-05,4e-05,5e-06,6.2e-05,-8e-06,-8e-06,4.2e-05,7.2e-05,-6.1e-05,6.3e-05,5.3e-05,5.1e-05,-3.5e-05,-0.000158,3.3e-05,0.000214,-1.6e-05,-1.2e-05,6.8e-05,-4.9e-05,-0.00018,1.6e-05,0.000138,3.3e-05,-9.7e-05,3e-05,1.4e-05,9.3e-05,-2e-05,6e-05,7.8e-05,4e-06,0.000182,-4.5e-05,8e-06,6.5e-05,2.3e-05,-5.6e-05,-9.6e-05,2e-06,-9.8e-05,0.000115,-4.8e-05,-7.2e-05,-3.9e-05,0.000128,-4.7e-05,6e-06,1e-06,0.000138,-9.7e-05,4.5e-05,0.000157,-1.3e-05,-2.2e-05,0.000168,-7.9e-05,-0.000149,-2e-05,-0.000107,-0.00012,-0.000107,0.000135,-2.3e-05,0.000149,-7.4e-05,6.2e-05,-4e-06,-4.6e-05,-2.8e-05,-6e-06,2.2e-05,0.000179,-0.000155,-4.5e-05,2.4e-05,3e-05,-3.1e-05,-5e-05,-1.6e-05,6.2e-05,-7e-05,-7.8e-05,1.6e-05,-4e-06,8.9e-05,1.3e-05,-2.1e-05,-4.1e-05,-2.9e-05,-2.2e-05,-5.1e-05,-0.000116,4.4e-05,8e-05,7e-05,-0.000129
7.6e-05,-0.000144,6e-05,7.7e-05,-5.4e-05,-3.4e-05,-6.7e-05,-4.9e-05,-0.000121,3.1e-05,-4.6e-05,3.2e-05,6.3e-05,7e-06,-1e-04,-3.6e-05,1.7e-05,-6.7e-05,-3.6e-05,4.6e-05,-4.5e-05,-5e-05,-5e-06,5.9e-05,1.4e-05,-4.8e-05,5.5e-05,-1.9e-05,5e-06,1.8e-05,9.4e-05,0,5.9e-05,-0.000115,-4.3e-05,1.5e-05,2.1e-05,6.1e-05,-8e-06,5.4e-05,-8.5e-05,1.4e-05,-5.8e-05,2.7e-05,7.4e-05,-0.000147,2.6e-05,9.5e-05,7.7e-05,-6e-06,-3.6e-05,-0.000147,7.4e-05,-4.4e-05,3.5e-05,-0.000102,-6.4e-05,2.5e-05,7.9e-05,6.4e-05,5.6e-05,-5e-06,7.9e-05,7.2e-05,0.000106,-1.9e-05,5.3e-05,6.9e-05,-4.5e-05,3.5e-05,1.8e-05,-3e-05,5.2e-05,-8.3e-05,-1.9e-05,-4.7e-05,-5.7e-05,7e-06,-1.7e-05,3.1e-05,7.1e-05,5.8e-05,-4.7e-05,2.6e-05,5.9e-05,6.4e-05,-3.3e-05,-2e-05,-0.00019,4.4e-05,-4.7e-05,8.4e-05,-3.4e-05,-6e-06,-1.2e-05,0.000121,-0.000135,6.8e-05,-6e-05,-5.1e-05,0.000162,-6e-05,1.1e-05,2.5e-05,6e-06,5e-06,4.9e-05,-3.2e-05,6e-05,-5.5e-05,-9.3e-05,2.7e-05,1.8e-05,5.7e-05,-0.00011,5e-06,9.2e-05,-3e-06,-3.8e-05,8.7e-05,6.3e-05
-8.5e-05,-4.8e-05,-4e-06,-8.3e-05,-4e-05,1.7e-05,3.3e-05,4.2e-05,0.000124,5.2e-05,2.8e-05,-0.000105,1e-05,-6.4e-05,9.3e-05,1.4e-05,1.2e-05,8.4e-05,-2.7e-05,2.5e-05,4.1e-05,0.000207,3.9e-05,-0.000131,-2.2e-05,4e-06,-4.5e-05,4.1e-05,-5e-06,1.8e-05,-9.3e-05,-3.5e-05,-1.6e-05,8e-06,9e-06,-2.5e-05,-8e-05,-3.1e-05,1.3e-05,-0.000151,6e-05,2.1e-05,8.7e-05,1.8e-05,7e-06,3.1e-05,7.8e-05,4e-06,-4.4e-05,4.2e-05,9.1e-05,4.8e-05,-2.6e-05,2e-06,4.9e-05,3.6e-05,9.2e-05,-4e-05,-3.2e-05,1.1e-05,7.7e-05,3.1e-05,2.6e-05,8e-06,3.1e-05,-8e-06,-3.9e-05,-4.4e-05,1.2e-05,-0.000132,-2.8e-05,-3.7e-05,-3.6e-05,-4e-06,-2.6e-05,-3e-05,-8.1e-05,8e-05,-9e-05,-4.1e-05,-2.2e-05,-1e-06,0.000134,1.8e-05,-1e-05,8e-05,1.3e-05,3e-06,0.000106,2.3e-05,4e-05,-6.5e-05,0.000133,3e-05,2e-06,-0.000126,2.3e-05,-2.8e-05,5.5e-05,-4.7e-05,-0.000158,8.5e-05,1.8e-05,-1.1e-05,-7.1e-05,-1.9e-05,-1.4e-05,-4.5e-05,-5.4e-05,-1.5e-05,4e-05,5.3e-05,4.4e-05,-0.000101,6.3e-05,2.6e-05,4.7e-05,3.7e-05,4.3e-05,-3.3e-05,-1.4e-05
5.1e-05,0.00015,-1.2e-05,-7e-06,4.6e-05,-7e-06,-4e-06,-1.8e-05,-9e-06,-6.8e-05,-2.9e-05,1.1e-05,-8.7e-05,2.9e-05,7.4e-05,1e-06,-1.7e-05,2.9e-05,-2e-05,-0.00011,-3.6e-05,-0.000112,-7.6e-05,4.3e-05,4e-06,1.1e-05,-6e-06,6.3e-05,-1.6e-05,-3.5e-05,5.1e-05,6.1e-05,-3e-06,9e-06,1.8e-05,2e-05,1e-04,-4.3e-05,-4e-06,3.8e-05,-2.6e-05,-2e-06,-0.000108,3.4e-05,-3.1e-05,4.9e-05,-2.7e-05,-7.1e-05,-4.8e-05,-6.1e-05,-9.7e-05,3e-06,2.5e-05,6.9e-05,-0.000161,6.1e-05,-4.4e-05,-3e-05,-9e-06,-1.7e-05,-1.9e-05,-2.9e-05,-6.4e-05,-8.4e-05,3.9e-05,5.2e-05,3.8e-05,2.1e-05,-1.2e-05,0.000126,-3.6e-05,3e-06,2.3e-05,7.1e-05,-2e-06,5.9e-05,1e-06,-6.6e-05,3.9e-05,-3.9e-05,-1.2e-05,2.1e-05,-0.00015,-1.4e-05,4.2e-05,-0.00018,2.8e-05,9e-06,6e-06,-7e-06,-5e-05,-2.8e-05,3.5e-05,-1.4e-05,-2.5e-05,1e-04,0.000109,4.4e-05,2.6e-05,-1.6e-05,-1.1e-05,-1.2e-05,-3.3e-05,1.5e-05,-5.2e-05,7e-06,-5.6e-05,3.9e-05,2.3e-05,1.8e-05,1.2e-05,7e-06,1.9e-05,-8.6e-05,0.000114,6.7e-05,-6.1e-05,-1e-05,-3.4e-05,-0.000104,-3e-06
-9e-06,-2.7e-05,2e-05,7.1e-05,4.2e-05,2.3e-05,-1e-05,6e-06,-4.8e-05,5.3e-05,3.8e-05,0.000103,3.2e-05,-6e-06,-1.5e-05,1.7e-05,-3.2e-05,1.2e-05,-5.1e-05,9.1e-05,6.5e-05,-4.3e-05,2.6e-05,5.2e-05,-1.1e-05,-4.3e-05,-2.2e-05,-5.7e-05,-2e-06,1e-05,-6.5e-05,-4.4e-05,-2.8e-05,3.5e-05,-7.4e-05,-1.1e-05,-3.7e-05,0.000103,-3e-06,-1e-05,-4.3e-05,-6e-06,5.2e-05,-1.4e-05,9e-06,8.5e-05,-9.2e-05,-2.2e-05,5.1e-05,1.9e-05,7.6e-05,-1.5e-05,-2e-05,-3e-06,7.5e-05,-2.2e-05,-0.000122,1.7e-05,3e-06,-2.3e-05,-8e-05,-1.1e-05,5.9e-05,1.3e-05,-2.7e-05,-7.3e-05,-2.5e-05,-2.2e-05,3.9e-05,2e-06,2.9e-05,1e-05,0,-6.8e-05,3e-06,-1.7e-05,6.1e-05,4.5e-05,5.8e-05,2e-06,9e-06,-0.000122,5.7e-05,5.4e-05,-5.4e-05,8.5e-05,-5.7e-05,7e-06,-6.4e-05,-5e-06,1e-06,5.9e-05,-6.4e-05,-1.1e-05,3e-06,-4.2e-05,-5.6e-05,-8.4e-05,-9.3e-05,5.4e-05,6e-06,3.6e-05,2.2e-05,-8e-06,4.8e-05,3e-06,7.7e-05,1.8e-05,-1.1e-05,-2.6e-05,-2e-06,-3.7e-05,1e-05,0.000152,-3.2e-05,6e-06,5.4e-05,1.8e-05,2e-06,0.000102,3.3e-05
-2.9e-05,-5.7e-05,-1.2e-05,-2.7e-05,-2.2e-05,-8e-06,3.2e-05,2.5e-05,-1e-05,-2.2e-05,-2.7e-05,0,3e-05,-2e-06,-7.9e-05,-1.4e-05,-3.7e-05,-2.6e-05,4.5e-05,-2e-06,2e-06,0.000108,-2.2e-05,-7e-05,-8e-06,3.4e-05,-5e-06,2.3e-05,-1.1e-05,-5.1e-05,2.4e-05,1.3e-05,3.7e-05,-5.7e-05,4.5e-05,5e-06,5.1e-05,-4.7e-05,-4e-06,5.2e-05,7e-05,-2.2e-05,-2.9e-05,1.9e-05,-2e-05,-4e-05,2.8e-05,-5e-06,3.5e-05,1.8e-05,-8.5e-05,3.9e-05,-8e-06,-3.4e-05,-4.8e-05,-4.7e-05,0.000155,-1.1e-05,-1e-05,-4e-06,-6e-06,7e-05,2.2e-05,3.7e-05,-6.1e-05,7e-06,-2e-06,4.9e-05,-3e-05,1e-06,1.9e-05,1.2e-05,-1.7e-05,4.5e-05,-3.3e-05,1.5e-05,1.4e-05,-2.1e-05,4.2e-05,1.5e-05,4.4e-05,6.6e-05,-4.6e-05,-1e-05,2e-05,2.6e-05,3.5e-05,-2e-06,6.3e-05,-3.4e-05,4.8e-05,-8e-06,2.6e-05,2e-06,-8e-06,2e-06,2.8e-05,8.3e-05,4.6e-05,3.5e-05,8.8e-05,-4.7e-05,-1.9e-05,9e-06,-5.3e-05,-6.4e-05,-4.5e-05,-1.5e-05,-3e-06,2.2e-05,-1.6e-05,-6e-06,1.4e-05,5.2e-05,-4.2e-05,-7e-06,-1.8e-05,-2e-06,2.8e-05,4.8e-05,9e-06
3.6e-05,1.1e-05,1.8e-05,8e-06,-3.5e-05,8e-06,-3.8e-05,-4e-06,8.7e-05,3e-06,2.3e-05,-8.2e-05,-3.8e-05,3.9e-05,-5.4e-05,-2.8e-05,3e-06,-5e-05,-1.7e-05,-5.7e-05,2.6e-05,-1e-05,-5e-06,-1.7e-05,5.6e-05,1.3e-05,2e-06,-2.2e-05,-2e-06,1.8e-05,-1e-06,4.9e-05,-5e-06,1.2e-05,-3.6e-05,1.3e-05,-4.3e-05,2.4e-05,-9e-06,-9.1e-05,5e-06,7e-06,-1.6e-05,1.7e-05,2.5e-05,-5.5e-05,7e-06,1.5e-05,-7.7e-05,-9e-06,8e-05,-4e-05,2e-06,4e-06,-2.7e-05,4.3e-05,-5e-05,7e-06,4e-06,4.3e-05,4.9e-05,-5.5e-05,-5.7e-05,4e-06,0,-1.5e-05,8e-06,-4.6e-05,-2e-06,-2.2e-05,-2.1e-05,-4e-06,6e-06,-3.6e-05,0,-4.7e-05,-6.2e-05,-6.8e-05,-2.1e-05,2.7e-05,-3.5e-05,2e-06,-1.2e-05,-4e-06,-4.1e-05,-4.9e-05,-2e-06,-7e-06,-2.2e-05,3.6e-05,-2.9e-05,-2.1e-05,6e-06,2.8e-05,1.5e-05,-3.3e-05,-1.6e-05,-5.6e-05,3.9e-05,-1.7e-05,-7.6e-05,7e-06,-2e-06,0,6.3e-05,8.3e-05,-8e-06,-2.2e-05,2.1e-05,-2.3e-05,2e-05,-3.1e-05,-2.1e-05,-0.000119,-6.6e-05,-1.9e-05,-2.7e-05,-1e-06,-7.9e-05,-8.6e-05,-2.6e-05
-1.7e-05,4e-05,-1.9e-05,1e-06,9e-06,-2.6e-05,3.1e-05,4e-06,-7.2e-05,-2e-06,-2e-05,-2.6e-05,1.7e-05,-2.9e-05,2.6e-05,2.3e-05,3e-05,4.6e-05,-3.1e-05,4.2e-05,-6e-06,-9.6e-05,3.4e-05,6.6e-05,-1.8e-05,-3.1e-05,-1.9e-05,7e-06,3e-06,-2.9e-05,-4.4e-05,-3.8e-05,-4e-06,4.8e-05,2.7e-05,-6e-06,2.7e-05,-3.5e-05,-7e-06,2.5e-05,-6.5e-05,2.9e-05,1.7e-05,-3e-05,7e-06,-2.1e-05,1.3e-05,3.1e-05,4.4e-05,-1e-06,-8.4e-05,3.7e-05,-1.4e-05,-9e-06,0.00012,-4e-06,-1.1e-05,2.2e-05,-4.1e-05,7e-06,4.2e-05,6e-06,2.3e-05,-1.9e-05,9e-06,-3.5e-05,-6e-06,4e-05,1.5e-05,-2.1e-05,9e-06,-1e-05,-9e-06,4.1e-05,3e-05,-1.8e-05,-9e-06,4.9e-05,-7.5e-05,1.1e-05,4e-06,-2e-06,5.5e-05,-1.4e-05,3.8e-05,4e-05,5e-06,-1e-06,-9e-06,2.3e-05,1.9e-05,5e-05,7e-06,-3.7e-05,-1.5e-05,2.7e-05,-2.3e-05,5.7e-05,-6.1e-05,-4.3e-05,-5.2e-05,-7e-06,8e-06,1e-06,6.1e-05,-6.2e-05,3.3e-05,5e-06,-3.1e-05,-7e-06,-8e-06,3.6e-05,-2.8e-05,0,9e-06,-4e-05,4.6e-05,-7e-06,5.2e-05,-1.1e-05,2.3e-05
-1.3e-05,-3e-05,-2.5e-05,-4.4e-05,3.2e-05,2e-06,-3e-05,0,-9e-06,-7e-06,1.4e-05,0.000108,-1e-06,-1e-06,9.9e-05,1.2e-05,9e-06,4e-06,3.3e-05,2.1e-05,-1.9e-05,7.1e-05,-3.9e-05,2.7e-05,-1.4e-05,2.2e-05,1e-05,-3e-06,-1e-06,1.2e-05,4.9e-05,1.9e-05,-8e-06,0,-1.1e-05,-5e-06,-1.4e-05,-5.4e-05,-5e-06,4.8e-05,7.3e-05,-1e-06,1.3e-05,-1.6e-05,2.7e-05,6.1e-05,1.6e-05,0,1.7e-05,-3e-06,5.3e-05,-2e-06,-1.3e-05,-2e-06,-9.3e-05,-4e-05,-8e-06,-1.1e-05,6e-05,5e-06,-4.2e-05,2.7e-05,-2e-06,-2.6e-05,5.5e-05,5.1e-05,3e-06,-7e-06,-1.1e-05,-7.5e-05,2.7e-05,-7e-06,1.6e-05,-5e-05,-2e-05,2.1e-05,4.4e-05,9e-06,-3e-05,-5.8e-05,1e-05,-2.9e-05,-3.2e-05,1.6e-05,-1.8e-05,1.2e-05,-8e-06,0,-1.1e-05,-4.3e-05,-1e-05,-2e-05,-8e-05,-2.5e-05,9e-06,1.1e-05,8e-06,-1.8e-05,-5e-06,2e-06,8.8e-05,1e-06,2e-06,-2e-06,-7.7e-05,4.5e-05,-3.5e-05,1e-06,3e-05,5.1e-05,8e-06,-2e-06,-1e-05,2.3e-05,4.4e-05,-1.2e-05,-3.7e-05,-3e-06,-5e-06,6.9e-05,-3.2e-05
3.2e-05,-1.5e-05,3.4e-05,1.2e-05,3e-06,8e-06,1.2e-05,-2.1e-05,4.1e-05,1.3e-05,-4e-06,-1.4e-05,7e-06,-7e-06,5e-06,-1.5e-05,2.2e-05,-2e-06,-6e-06,-3.7e-05,2.4e-05,4.6e-05,4.4e-05,-6.9e-05,-1.5e-05,-2.2e-05,3e-05,-5e-06,1e-06,-9e-06,-4.8e-05,-1e-05,5e-06,-2.5e-05,-1.6e-05,6e-06,-1e-05,6.7e-05,-2e-06,-2.3e-05,-2.1e-05,-2.3e-05,-1.6e-05,1.9e-05,-5.6e-05,3e-05,-2.1e-05,6e-06,-2.9e-05,-1e-06,-5.9e-05,-5.2e-05,1.4e-05,2.4e-05,8e-05,1e-05,-4.7e-05,1.6e-05,-4.1e-05,-1e-05,-5.2e-05,-2.5e-05,-5e-06,1.7e-05,-7e-06,-4e-06,1e-06,-1e-06,1.5e-05,7.3e-05,0,5e-06,-2e-06,4e-05,3.4e-05,-3e-06,1.9e-05,-3e-05,1.9e-05,3e-06,-3.5e-05,6e-05,3.1e-05,-2.8e-05,2.9e-05,2e-06,-1.4e-05,0,5.8e-05,-6e-06,-2.7e-05,-2.7e-05,8e-06,3.3e-05,-1e-05,7e-06,-2.2e-05,2.1e-05,3.2e-05,1.5e-05,-1e-06,1.9e-05,1.4e-05,-3e-06,-8e-06,-1.3e-05,3.2e-05,-7e-06,-2.2e-05,-3.4e-05,-4e-06,2.2e-05,-5e-06,3.5e-05,-3e-06,3e-06,1e-05,-2.2e-05,-3e-06,7e-06,-1.9e-05
-3.4e-05,4.1e-05,0,-2e-06,-3.3e-05,2e-05,-1.2e-05,-4e-06,-1e-06,3e-06,-9e-06,-5.8e-05,-5e-06,-2.1e-05,-6.4e-05,1e-06,-1.2e-05,2.5e-05,2.8e-05,3.7e-05,-2.5e-05,-0.00011,-1.5e-05,-2.3e-05,1.1e-05,-7e-06,-9e-06,1.2e-05,-5e-06,2.2e-05,2.5e-05,-2.5e-05,8e-06,-1.4e-05,2e-05,3e-06,1e-06,-2.4e-05,1e-06,-7.3e-05,-3.2e-05,-1.1e-05,4.3e-05,5e-06,3.2e-05,-8e-06,1e-05,1.7e-05,2.2e-05,8e-06,2.2e-05,3.2e-05,-1.7e-05,2e-06,-3.9e-05,1e-05,0.000113,1.5e-05,2.9e-05,-2e-05,1.6e-05,-2e-06,-3e-06,2.2e-05,-3e-06,0,-2e-06,2e-06,-2.8e-05,-4.6e-05,-1e-05,2e-06,-1.2e-05,-2.5e-05,3.2e-05,2e-05,-3.6e-05,5.3e-05,6.8e-05,4e-05,3.2e-05,-2.1e-05,-3.5e-05,2.7e-05,-3.6e-05,-6.8e-05,1.6e-05,1e-06,-7.9e-05,3.7e-05,4e-05,1.8e-05,9e-06,-1e-05,1.1e-05,-2.3e-05,2e-05,-3.6e-05,-2e-05,2.1e-05,-4.7e-05,-2.5e-05,-2.6e-05,-3e-06,-1.2e-05,-1.2e-05,-2.2e-05,4e-06,1.5e-05,2e-06,-1.1e-05,-1.1e-05,0,1.7e-05,-1.7e-05,2e-05,2.6e-05,3e-06,-3e-06,-6.9e-05,3.9e-05
1.9e-05,-1.8e-05,-2.9e-05,1e-06,-1.4e-05,-1.5e-05,7e-06,-8e-06,-5.6e-05,-6e-06,2.1e-05,-1.2e-05,-2.1e-05,1.9e-05,-3e-05,4e-06,-1.5e-05,-4.2e-05,9e-06,-4e-06,2e-05,3.4e-05,-1e-06,6.2e-05,6e-06,3.4e-05,1.4e-05,-2e-05,0,-4e-06,1.5e-05,3.5e-05,-1e-05,2.2e-05,-2.9e-05,-4e-06,-2e-05,2.8e-05,0,7.4e-05,4.7e-05,1.5e-05,-4.6e-05,-2.6e-05,1.8e-05,-3.9e-05,-1.1e-05,-1.1e-05,-4.2e-05,-1e-05,-1.4e-05,-2e-06,8e-06,-6e-06,-2.2e-05,-1.3e-05,-7.5e-05,-8e-06,5e-06,1.1e-05,4.8e-05,2.1e-05,1.5e-05,-1.7e-05,-2.6e-05,3.6e-05,-4e-06,3e-06,5e-06,-3.8e-05,3e-06,1e-06,1.9e-05,2.1e-05,-7e-06,-1.9e-05,-2.4e-05,-1e-05,8e-06,-1.2e-05,-1.5e-05,4e-06,2.5e-05,0,1e-05,6.2e-05,-3.8e-05,-1e-06,5.7e-05,-5e-06,-2.8e-05,5e-06,-2.1e-05,-3e-05,-7e-06,2e-06,-4e-06,3.1e-05,-1.5e-05,-1e-06,-2e-06,-4e-06,5e-06,-2e-06,4.2e-05,1.5e-05,-1e-06,3e-06,-6e-06,3.6e-05,1.6e-05,-1.1e-05,1.2e-05,-0.000105,-3.8e-05,9e-06,-2.4e-05,-5e-06,-4e-06,6e-06,1e-05
4e-06,-2.7e-05,2.8e-05,3.2e-05,3e-05,-3e-06,1.4e-05,5e-06,3.6e-05,7e-06,-2.3e-05,3.6e-05,3e-05,7e-06,2.1e-05,2e-06,-1.2e-05,1.4e-05,-1.9e-05,-2e-06,-3.5e-05,5.6e-05,1.6e-05,-2.4e-05,7e-06,-2.2e-05,3e-06,2.2e-05,1e-06,2e-05,-2.5e-05,-2.1e-05,3e-06,2e-06,4.1e-05,4e-06,2.6e-05,4e-06,2e-06,-2.6e-05,-2e-05,1.7e-05,1.9e-05,2e-05,-2.1e-05,2e-06,-1.4e-05,-1.9e-05,5.9e-05,7e-06,9e-06,-2e-06,-9e-06,3e-06,1.7e-05,-3e-06,1e-05,1.9e-05,-1.7e-05,2e-06,1.1e-05,-2.7e-05,-3e-06,-1.3e-05,-1.5e-05,-2.4e-05,9e-06,6e-06,-5e-06,2.4e-05,-1e-05,-5e-06,-1.5e-05,-2.6e-05,2e-06,3e-06,2.9e-05,-1.4e-05,-1.9e-05,-4e-06,9e-06,-1.6e-05,-3e-05,-2e-06,-1.2e-05,-1.7e-05,3.9e-05,0,-1.5e-05,-2.6e-05,1.4e-05,-2.9e-05,-2.1e-05,9e-06,1.3e-05,2.2e-05,-3e-06,-3e-05,2.3e-05,-1.9e-05,6.1e-05,2e-06,6e-06,2e-06,1.4e-05,-2e-05,3.1e-05,-8e-06,-7e-06,-3.5e-05,-6e-06,-1e-06,1.6e-05,3.4e-05,1.1e-05,-1.3e-05,4e-06,1e-06,3.1e-05,6.4e-05,-2.7e-05
-1.9e-05,1.6e-05,-1.2e-05,-1.3e-05,1.3e-05,-1.4e-05,-1.7e-05,1.4e-05,2.2e-05,-5e-06,2.6e-05,2.3e-05,-5e-06,0,3.6e-05,-1e-06,1e-06,2.1e-05,1.7e-05,-2e-06,1.2e-05,-6.1e-05,-2.3e-05,-5e-06,-1.8e-05,7e-06,-3e-06,-5e-06,1e-06,4e-06,3.7e-05,-6e-06,-3e-06,-8e-06,-1.7e-05,-4e-06,-1.4e-05,-3.8e-05,3e-06,-3e-06,-3.4e-05,-9e-06,-3e-06,1.7e-05,-2.1e-05,1.4e-05,2.1e-05,-1.3e-05,-3.9e-05,0,1.2e-05,1.2e-05,1.2e-05,-5e-06,-2.8e-05,9e-06,1e-06,5e-06,1.1e-05,6e-06,-4.1e-05,1.2e-05,-1.5e-05,1e-06,1.7e-05,-2e-06,-9e-06,-6e-06,1.6e-05,3.2e-05,-1.6e-05,-2e-06,-4e-06,3.6e-05,2.1e-05,9e-06,2.7e-05,2.3e-05,-4.8e-05,-6e-06,-9e-06,2.3e-05,2.6e-05,7e-06,3.5e-05,-3.8e-05,-2.8e-05,2e-06,-1.8e-05,1.2e-05,9e-06,1.8e-05,6e-06,1.4e-05,-5e-06,-2.3e-05,3e-05,1.5e-05,1e-05,-3e-06,-2.2e-05,2.2e-05,-8e-06,2e-06,-3.6e-05,2.6e-05,-3.7e-05,-7e-06,5e-06,1.8e-05,0,-1.2e-05,4e-06,4.8e-05,3.9e-05,-1.1e-05,1e-05,4e-06,-3.7e-05,-2.8e-05,1.4e-05
2.2e-05,2.2e-05,1.3e-05,-7e-06,-2.3e-05,1.6e-05,3.1e-05,-6e-06,-4.1e-05,-5e-06,-2.1e-05,-4.5e-05,-2.1e-05,1.4e-05,2.2e-05,-7e-06,7e-06,-2.3e-05,-6e-06,2.1e-05,-2.3e-05,-1.4e-05,9e-06,2.6e-05,1.6e-05,7e-06,7e-06,1e-06,3e-06,-1.1e-05,-2.9e-05,1.5e-05,8e-06,-9e-06,-5e-06,-2e-06,1.8e-05,4.3e-05,3e-06,-7e-06,4.4e-05,-1.3e-05,-2.3e-05,-2.5e-05,1.4e-05,2.5e-05,4e-06,-3e-06,-8e-06,-6e-06,-1.7e-05,-1e-05,6e-06,-4e-06,2.1e-05,-4e-06,-2.4e-05,-2e-06,-5e-06,-6e-06,-2.2e-05,-1e-06,1.2e-05,1.3e-05,9e-06,-6e-06,8e-06,1e-05,2e-06,-3.7e-05,1e-06,3e-06,1.7e-05,-3.1e-05,-1.2e-05,0,-2.2e-05,-3.8e-05,1.9e-05,0,1.9e-05,-3.4e-05,1e-05,-1.5e-05,-1.8e-05,5.1e-05,1.7e-05,1e-06,2.3e-05,1e-05,-2.1e-05,1e-05,4.3e-05,-1.4e-05,7e-06,3e-06,-2.6e-05,-5e-06,-2.1e-05,0,-4.7e-05,-9e-06,1.7e-05,2e-06,3e-05,-3.6e-05,1.9e-05,1.3e-05,-7e-06,1e-05,-1e-06,2.4e-05,0,-1.2e-05,1.7e-05,-7e-06,-2.1e-05,1e-06,1.2e-05,-5.4e-05,4e-06
-1.4e-05,-1.9e-05,-9e-06,1.5e-05,-1.5e-05,2e-06,-2.4e-05,1e-06,-6e-06,4e-06,1.6e-05,-1.5e-05,1.9e-05,-1.4e-05,-4.8e-05,2e-06,8e-06,1.9e-05,-7e-06,-1.5e-05,6e-06,6.3e-05,-1e-05,-4e-06,-1.5e-05,-2.7e-05,-1.5e-05,5e-06,0,1.9e-05,1.2e-05,-2.1e-05,-9e-06,1.9e-05,1.6e-05,1e-06,-1.4e-05,-3.1e-05,4e-06,6e-06,-2.1e-05,4e-06,2.8e-05,-1e-06,1.6e-05,-3e-06,4e-06,2e-05,1.3e-05,8e-06,2.4e-05,6e-06,-1e-06,5e-06,-9e-06,-9e-06,5.9e-05,6e-06,-7e-06,-5e-06,2.2e-05,-1.4e-05,-4e-06,7e-06,2.3e-05,-3.5e-05,-6e-06,-2e-06,-1.3e-05,4.1e-05,6e-06,3e-06,-1.3e-05,1.7e-05,-1e-06,9e-06,-2.8e-05,-9e-06,2e-05,5e-06,-1.9e-05,1.9e-05,-3.1e-05,-3e-06,3e-06,-1.4e-05,-1.2e-05,-2e-06,-3e-06,-5e-06,2.1e-05,-2.2e-05,-5e-06,-8e-06,-5e-06,4e-06,5e-06,3e-06,-2e-06,1e-05,2.7e-05,-6e-06,-1.4e-05,-1e-06,-4.6e-05,3.5e-05,-6e-06,3e-06,9e-06,-3.4e-05,4e-06,-1.1e-05,-3e-06,-3.8e-05,-1e-05,1.1e-05,3e-06,-2e-06,-5e-06,3.8e-05,-2.9e-05
3e-06,-1.5e-05,-5e-06,-2.4e-05,1.9e-05,5e-06,1.5e-05,-1e-06,3.7e-05,-4e-06,-1e-05,9e-06,3e-06,-4e-06,-3.5e-05,2e-06,6e-06,-2.9e-05,-1e-06,2e-06,-3e-06,-2.8e-05,-3e-06,-3.7e-05,1.4e-05,2e-05,-2e-06,-1e-05,1e-06,-3.1e-05,1e-05,2.2e-05,2e-06,3e-06,-1.3e-05,2e-06,1.6e-05,1e-05,0,1.4e-05,-1.7e-05,1e-05,-1.4e-05,1.4e-05,-1.6e-05,-1.4e-05,-1e-06,1.8e-05,4e-06,-4e-06,-2.8e-05,-1.2e-05,-1e-06,5e-06,2.5e-05,1e-06,-4.7e-05,-6e-06,1.1e-05,-9e-06,3e-05,1.1e-05,-7e-06,-2.1e-05,-1.7e-05,1.8e-05,4e-06,4e-06,-2e-06,8e-06,2e-06,1e-06,4e-06,6e-06,1.6e-05,-1.2e-05,1.5e-05,3.1e-05,1.3e-05,3e-06,1.4e-05,-1.4e-05,4.2e-05,-1e-06,-2.1e-05,1.2e-05,1e-05,-3e-06,-1.9e-05,-7e-06,-1.3e-05,5e-06,-7e-06,1.4e-05,7e-06,9e-06,8e-06,-6e-06,1.2e-05,8e-06,4.4e-05,-7e-06,2e-06,0,-1.3e-05,-2.4e-05,-4e-06,-5e-06,-5e-06,2.4e-05,-2e-06,1.5e-05,-7e-06,1.5e-05,-3.3e-05,1.7e-05,8e-06,1.2e-05,-6e-06,3.9e-05,1.3e-05
8e-06,1.9e-05,1.6e-05,-1e-06,2e-05,-8e-06,-1.4e-05,1e-06,-1.1e-05,-5e-06,3e-06,4.7e-05,-6e-06,3e-06,2.9e-05,-1e-06,-8e-06,-1e-06,-1.7e-05,6e-06,-3e-06,-4.4e-05,1.3e-05,-1e-06,-1.2e-05,2e-06,-5e-06,5e-06,1e-06,1.7e-05,-2e-05,1e-06,2e-06,-1.2e-05,2e-06,-2e-06,-8e-06,1.9e-05,1e-06,-3e-05,3.9e-05,-1e-06,2e-06,-1e-06,-2e-06,-1.1e-05,-1.7e-05,-4e-06,-1.6e-05,0,2.6e-05,-6e-06,4e-06,2e-06,-3.1e-05,5e-06,1.1e-05,3e-06,-1.5e-05,2e-06,-2e-06,-1e-06,7e-06,-4e-06,-1.3e-05,3e-06,-2e-06,-5e-06,-1.3e-05,-9e-06,0,-3e-06,4e-06,-2.3e-05,1e-06,3e-06,2.8e-05,-1.9e-05,-1.6e-05,-7e-06,-5e-06,1.2e-05,-5.2e-05,6e-06,2.5e-05,-1.7e-05,-8e-06,-2e-06,1.8e-05,0,-7e-06,1.8e-05,2.9e-05,-1e-06,-3e-06,-1.3e-05,-2.1e-05,1.5e-05,-1.2e-05,-5e-06,-4.4e-05,6e-06,8e-06,-1e-06,5.3e-05,1.4e-05,1.4e-05,-7e-06,0,-4e-06,3e-06,-1.6e-05,-6e-06,1.9e-05,1.1e-05,1.2e-05,-4e-06,1e-06,1.4e-05,-4.2e-05,2e-05
-1.1e-05,2e-06,-1.9e-05,1.7e-05,-1.2e-05,-6e-06,3e-06,3e-06,-3.7e-05,1.1e-05,2e-06,-1.9e-05,-3e-06,-5e-06,4.3e-05,0,-2e-06,3.4e-05,4e-06,-5e-06,1e-06,6.4e-05,-8e-06,5.6e-05,7e-06,-9e-06,-1.4e-05,-8e-06,1e-06,-2.8e-05,3.1e-05,-1.8e-05,1e-06,-7e-06,-5e-06,2e-06,-1e-06,-4.4e-05,0,2e-06,-1e-05,-7e-06,1.6e-05,-1.8e-05,-1e-06,1.2e-05,2e-06,-1e-05,8e-06,0,-2.6e-05,1.7e-05,-8e-06,-1e-06,3.3e-05,-1e-05,7e-06,2e-06,2.2e-05,-4e-06,-2.9e-05,-1.2e-05,6e-06,1.2e-05,-1.2e-05,2e-06,0,1e-05,1.4e-05,2.2e-05,7e-06,-3e-06,-9e-06,2.2e-05,-1e-05,-1e-06,-9e-06,5e-06,-3.1e-05,-2e-06,-6e-06,-1.5e-05,2.4e-05,-3e-06,-6e-06,1.8e-05,7e-06,1e-06,4e-06,6e-06,2.1e-05,-2.2e-05,1.2e-05,-1.5e-05,4e-06,3e-06,1.5e-05,-1.3e-05,-9e-06,-1.4e-05,-2.4e-05,-2e-06,-1.5e-05,0,2e-06,0,-2.3e-05,6e-06,0,-1.8e-05,-2e-06,1e-06,-1e-06,9e-06,2.5e-05,5e-06,1.1e-05,3e-06,-5e-06,-2.8e-05,-1.9e-05
9e-06,-9e-06,1.3e-05,-9e-06,-2.2e-05,-2e-06,-3e-06,-4e-06,3.1e-05,-9e-06,-6e-06,-4.1e-05,-2e-06,1.1e-05,-1e-06,1e-06,-2e-06,-2.9e-05,0,-1.2e-05,-4e-06,-7e-06,1.1e-05,-2.2e-05,-8e-06,1.7e-05,4e-06,6e-06,2e-06,1.5e-05,-2e-05,2.1e-05,-6e-06,1.6e-05,4e-06,1e-06,-3e-06,3.2e-05,-1e-06,1.4e-05,-1.9e-05,1e-06,-2.1e-05,5e-06,1.9e-05,1.2e-05,7e-06,-1e-05,2e-06,-3e-06,2.4e-05,-4e-06,4e-06,-5e-06,-3.3e-05,-6e-06,-6e-06,-9e-06,-1.7e-05,0,-1.5e-05,1.4e-05,-1.2e-05,8e-06,1e-05,3.5e-05,1e-06,-4e-06,-1e-06,1.7e-05,6e-06,-1e-06,8e-06,-1e-05,-5e-06,1e-06,-2.9e-05,2.2e-05,6e-06,1.1e-05,9e-06,2.4e-05,3e-06,5e-06,1.1e-05,-2e-05,-1e-06,2e-06,-2.7e-05,1e-06,-2.1e-05,2e-06,-1e-06,1.1e-05,-4e-06,-2e-06,-7e-06,9e-06,1.4e-05,-1e-06,3.7e-05,7e-06,1e-05,0,4e-06,-8e-06,2.4e-05,-4e-06,-1e-06,1.9e-05,-4e-06,0,-1e-06,-1.4e-05,1.2e-05,-1e-05,-2e-06,3e-06,7e-06,4.6e-05,-1e-06
-3e-06,-2e-06,-1.1e-05,1e-05,6e-06,1e-05,-6e-06,-7e-06,1.4e-05,5e-06,9e-06,1.4e-05,1.3e-05,1e-06,-2.4e-05,0,1e-06,1.4e-05,-3e-06,1.9e-05,1.2e-05,-5.3e-05,-2e-06,-3.2e-05,1.2e-05,-2e-05,0,-2e-06,0,-2.2e-05,9e-06,-1.4e-05,0,0,-9e-06,-2e-06,-1e-05,-1.1e-05,0,-3e-06,3.7e-05,3e-06,1e-05,2e-05,-1e-06,-4e-06,3e-06,-6e-06,6e-06,6e-06,-2.2e-05,1e-06,-6e-06,-2e-06,1e-06,6e-06,1.2e-05,-1e-06,1.4e-05,-4e-06,2e-05,-2e-06,7e-06,-6e-06,1.7e-05,-1.3e-05,-3e-06,4e-06,-1e-06,-4.6e-05,-1e-06,1e-06,-5e-06,2e-06,-3e-06,1e-06,7e-06,-2.3e-05,2.5e-05,-6e-06,-1.1e-05,-1.4e-05,-1.1e-05,-5e-06,-2.1e-05,-1.4e-05,2e-06,0,3.2e-05,-5e-06,1.5e-05,1.8e-05,-1.6e-05,1.3e-05,1e-06,8e-06,-1e-06,-3e-06,3e-06,1.3e-05,1.9e-05,-4e-06,-2e-06,1e-06,-4.3e-05,1.4e-05,-5e-06,2e-06,0,-1.7e-05,6e-06,-1e-06,1e-06,-1.6e-05,-2.4e-05,-1.2e-05,-1.2e-05,-6e-06,-4e-06,2e-05,2.1e-05
-3e-06,6e-06,3e-06,4e-06,2.3e-05,5e-06,1.4e-05,-5e-06,-2.7e-05,2e-06,-1.2e-05,3.7e-05,-8e-06,-1e-06,-3.8e-05,2e-06,3e-06,-3e-06,4e-06,-1.5e-05,-3e-06,4.3e-05,-6e-06,2.2e-05,-1e-05,-3e-06,2e-06,-3e-06,0,2.8e-05,7e-06,1e-06,7e-06,-1e-05,4e-06,1e-06,1.1e-05,3e-06,-2e-06,-2e-05,-2e-05,0,4e-06,-2e-05,-1.7e-05,-9e-06,4e-06,4e-06,1e-06,-1e-06,2.1e-05,6e-06,5e-06,1e-06,2.3e-05,-5e-06,-2.1e-05,-2e-06,-3e-06,-5e-06,2.7e-05,-3e-06,1e-06,-1.5e-05,-1e-06,-4e-06,5e-06,0,-1e-06,2.4e-05,1e-06,0,0,-1e-05,-1.1e-05,-5e-06,2.6e-05,1e-05,2.9e-05,-5e-06,1.1e-05,1e-05,2.5e-05,-2e-06,1.3e-05,2.6e-05,-5e-06,-1e-06,-1.6e-05,1e-06,-2e-06,-1.1e-05,5e-06,-1.6e-05,-5e-06,-5e-06,8e-06,1e-06,-9e-06,8e-06,-4.1e-05,-1e-05,2e-06,0,-2e-06,-1.9e-05,-1.1e-05,0,0,6e-06,-4e-06,1.4e-05,3e-06,2.8e-05,-2.7e-05,-7e-06,3e-06,-1e-06,7e-06,-5.1e-05,-2.4e-05
7e-06,3e-06,1.4e-05,-1e-05,-3e-06,-1e-06,-1.7e-05,4e-06,-1.3e-05,-1.1e-05,1.3e-05,9e-06,-8e-06,0,1e-05,-1e-06,0,-1.9e-05,3e-06,-3e-06,1e-05,1.7e-05,1e-05,2e-06,1.2e-05,1.6e-05,1e-05,7e-06,0,-2.2e-05,-2.6e-05,1.4e-05,-2e-06,-3e-06,1e-05,0,-7e-06,2.3e-05,-1e-06,2.4e-05,-2e-05,-1e-06,-2.1e-05,-9e-06,-3e-06,1e-06,-3e-06,6e-06,-2.4e-05,-2e-06,-1.5e-05,-6e-06,-2e-06,0,-4.4e-05,-5e-06,5e-06,-6e-06,-1.2e-05,-2e-06,-8e-06,4e-06,-1e-05,3e-06,0,6e-06,-6e-06,3e-06,-8e-06,-1e-06,-4e-06,-3e-06,6e-06,3.1e-05,-6e-06,4e-06,-1e-06,1e-05,-1.9e-05,5e-06,-1.1e-05,-1.5e-05,-2.3e-05,3e-06,-1.1e-05,-1.5e-05,1.1e-05,-1e-06,-5e-06,3e-06,-1.3e-05,-8e-06,-6e-06,-3e-06,1e-06,-2e-06,-7e-06,-2e-06,-2e-06,-4e-06,-1.2e-05,1e-06,7e-06,-1e-06,3.4e-05,2.1e-05,1.4e-05,4e-06,-1e-06,1.7e-05,-1e-06,-1.5e-05,2e-06,-7e-06,9e-06,2e-06,3e-06,1e-06,6e-06,-7e-06,-7e-06
