1.1e-05,2e-05,3.7e-05,6e-06,5.2e-05,3.4e-05,1.9e-05,4.7e-05,1.4e-05,1.8e-05,4e-05,2e-06,0.000262,5.2e-05,0.000116,0.00048,3.6e-05,7.3e-05,4.3e-05,2.8e-05,6.8e-05,3e-05,0.000115,0.000124,0.000259,0.000521,0.000728,0.00017,3.3e-05,0.000252,0.000214,0.000311,0.000475,3e-04,0.000165,8e-06,0.000598,2.2e-05,7.8e-05,0.000121,0.000186,0.000192,0.000368,0.000247,0.00011,4.3e-05,0.000117,0.000218,0.000385,0.000175,0.000445,1.2e-05,0.000155,3.5e-05,0.000168,0.000131,0.00036,3.6e-05,0.000114,0.000223,0.000137,1e-06,7.1e-05,0.000158,0,6.6e-05,2.3e-05,4.1e-05,2e-05,1.7e-05,1.7e-05,3.9e-05,5.3e-05,5.2e-05,3e-06,0.000121,2.9e-05,2e-06,9.6e-05,9e-06,0.000243,0.000132,1.7e-05,6.8e-05,3.1e-05,4.4e-05,4.1e-05,2e-06,2.7e-05,1.9e-05,3.3e-05,5.4e-05,2.6e-05,1.9e-05,1.7e-05,4.7e-05,2.4e-05,5.4e-05,1.5e-05,1.1e-05,1.2e-05,8e-06,5e-06,2e-06,2.9e-05,1e-06,3.4e-05,1.9e-05,2.7e-05,3.7e-05,2.3e-05,3.3e-05,3e-06,5e-06,1.4e-05,1.1e-05,2e-06,1.9e-05,2.4e-05,1.8e-05,3.4e-05
1.7e-05,4e-05,3.5e-05,6.8e-05,8.1e-05,3.4e-05,4.3e-05,7.2e-05,5.1e-05,1.8e-05,4.1e-05,7e-05,0.00054,0.00024,8.5e-05,0.000915,0.000361,5.7e-05,0.000251,0.000309,0.000131,6.1e-05,0.000246,0.000275,0.000334,0.001683,0.002483,0.001278,0.001383,0.000507,0.000792,0.001784,0.001385,0.002023,0.000834,0.002052,0.001793,0.001394,0.000466,0.000683,0.000877,0.000694,0.000237,0.000787,0.000672,0.000333,5e-04,0.000486,0.001064,0.000593,0.000922,0.000427,0.000286,0.000573,0.000612,0.000238,0.000757,0.000427,0.000142,0.00035,0.000219,0.000295,0.000174,0.000459,0.00011,0.000233,1.2e-05,3.2e-05,0.000241,0.000138,0.000106,5.2e-05,0.000179,0.000201,0.000204,0.000492,0.000448,0.000224,0.000233,0.000179,0.00053,0.000578,0.000519,0.000428,0.00028,9.9e-05,0.000136,9.8e-05,2.4e-05,6.8e-05,0.000102,4.8e-05,0.00014,0.000146,9e-05,0.000108,0.000132,6.5e-05,0.000114,9.7e-05,6.6e-05,3.6e-05,2.2e-05,2.4e-05,6.2e-05,6e-05,5.8e-05,9.7e-05,4.9e-05,8.6e-05,5.6e-05,8.9e-05,8.2e-05,1.7e-05,2.4e-05,6e-06,1.5e-05,2.4e-05,7.4e-05,9.9e-05,7.1e-05
3.8e-05,4.7e-05,3.7e-05,2.8e-05,3.8e-05,4.1e-05,4.3e-05,2.7e-05,3.1e-05,1.6e-05,1.5e-05,6.8e-05,0.000611,0.00098,0.000677,0.00123,0.000814,4e-04,0.000268,0.000545,0.000629,0.000288,0.00032,0.000227,0.000619,0.003238,0.000921,0.001313,0.000516,0.001029,0.001515,0.001408,0.001924,0.002528,0.002285,0.001508,0.001695,0.000662,0.001183,0.001591,0.000602,0.000894,0.001135,0.000772,0.000321,0.000856,0.000899,0.000806,0.001388,0.000677,0.001281,0.000259,0.001067,0.000419,0.000223,0.000474,0.000706,0.001028,0.00065,0.000489,0.000595,0.000199,0.00039,0.000624,0.000349,7.7e-05,0.000205,0.000111,0.000432,0.000137,0.000118,0.000172,8.2e-05,7e-05,0.000391,0.000486,0.000214,0.000144,0.000122,0.000517,0.000828,0.000889,0.000357,6.7e-05,4.4e-05,2e-05,9.2e-05,7.4e-05,8.2e-05,7.4e-05,2.6e-05,6e-05,8.8e-05,3.5e-05,8.5e-05,5.7e-05,7.1e-05,4.7e-05,8.9e-05,1.6e-05,3.6e-05,9e-06,1.5e-05,2.1e-05,4.2e-05,4.6e-05,1.6e-05,6.5e-05,2.6e-05,9e-06,3.3e-05,3.9e-05,3e-06,5.4e-05,2e-05,1e-05,2.7e-05,2.7e-05,4.7e-05,2.9e-05,4e-06
5.6e-05,6.1e-05,2.8e-05,2.9e-05,3.7e-05,7e-06,4.2e-05,1.5e-05,2.3e-05,4.8e-05,5.2e-05,5.3e-05,0.00049,0.001041,0.000423,0.001411,0.000358,0.000413,0.000183,0.000945,0.000192,6.2e-05,0.00036,0.000237,0.000536,0.004634,0.003954,0.002604,0.002582,0.002284,0.002938,0.001725,0.002126,0.000749,0.001331,0.001467,0.001565,0.000705,0.000921,0.001537,0.001017,0.001317,0.000268,0.001413,0.000634,0.001283,0.000535,0.001573,0.000783,0.001308,0.001167,0.001513,0.00038,0.000383,0.000365,0.001178,0.000598,0.000942,0.000845,0.001124,0.000467,0.000198,0.000603,0.000805,0.000373,0.000285,0.000209,0.000223,0.000487,0.000354,7.8e-05,0.00013,0.000221,0.000199,0.000492,0.00088,0.000609,0.000261,0.000327,0.000483,0.000766,0.000607,0.00047,0.000116,0.000111,0.000115,7e-05,7.1e-05,0.000113,3.9e-05,1.9e-05,0.000124,7.5e-05,4.2e-05,7.4e-05,4.4e-05,4.5e-05,5.3e-05,5.9e-05,6.1e-05,7.2e-05,5.2e-05,3.4e-05,4.2e-05,6.6e-05,2e-05,4.5e-05,6.8e-05,5.6e-05,6.2e-05,5e-05,5.1e-05,4.4e-05,6.2e-05,4.7e-05,3.9e-05,6.5e-05,6.2e-05,4.1e-05,5.4e-05,3e-05
1.4e-05,3.3e-05,2.3e-05,6e-06,9e-06,6e-06,2.4e-05,8e-06,1.7e-05,4.3e-05,2.7e-05,2.5e-05,0.000276,0.000557,0.000321,0.001467,0.000983,0.001025,0.000407,0.001172,0.001146,0.000463,0.000294,0.000165,0.000506,0.005564,0.002385,0.000795,0.002638,0.002098,0.002371,0.000327,0.001816,0.0036,0.002018,0.001746,0.001799,0.000901,0.00044,0.001057,0.001249,0.000609,0.000692,0.001688,0.001162,0.00131,0.000641,0.000962,0.001878,0.002369,0.000281,0.002109,0.00126,0.001388,0.001493,0.001504,0.000997,0.000345,0.000883,0.001606,0.00114,0.000231,0.000426,0.000173,0.000289,0.000125,0.000275,0.000233,0.000245,0.000177,0.00012,7.5e-05,7.9e-05,9.2e-05,0.000281,0.000614,0.000123,3.6e-05,0.00038,0.000248,0.001103,0.000574,0.000119,0.000108,6.8e-05,8.3e-05,6.6e-05,4.1e-05,0.000102,7.4e-05,3.9e-05,0.000128,4.6e-05,3e-05,1.4e-05,0.000119,7.9e-05,1.6e-05,1.6e-05,2e-05,2.9e-05,1.1e-05,1.4e-05,9e-06,4.2e-05,2.3e-05,4.1e-05,1.6e-05,1.2e-05,2.3e-05,5e-06,2e-05,1.4e-05,2.3e-05,9e-06,2.2e-05,4.5e-05,9e-06,2e-05,3.4e-05,2.2e-05
3.4e-05,1.5e-05,1.5e-05,2.5e-05,1.8e-05,3.7e-05,3e-06,1.4e-05,1.9e-05,3.5e-05,5.6e-05,8.2e-05,0.000579,0.000764,0.00034,0.00171,0.00056,0.000755,0.000228,0.001191,0.000679,0.000439,0.000141,0.000201,0.000495,0.006057,0.004063,0.003464,0.004285,0.004646,0.004678,0.003552,0.00181,0.003763,0.001728,0.001818,0.001611,0.000798,0.001636,0.00272,0.001585,0.002323,0.00051,0.0026,0.004014,0.002173,0.000447,0.00144,0.00065,0.00096,0.002868,0.002756,0.001982,0.001505,0.001785,0.001486,0.002707,0.001181,0.001147,0.001954,0.001083,0.001189,0.000144,0.000914,0.000255,0.000285,0.000344,0.000346,0.000247,0.000246,0.00013,8.6e-05,8.3e-05,4.7e-05,0.000301,0.000485,0.000337,6.5e-05,0.000383,0.00035,0.000854,0.000491,0.000195,6.2e-05,0.000246,0.000124,5.1e-05,7.3e-05,8.3e-05,0.000143,7.3e-05,0.000139,1e-04,5e-05,9.7e-05,6.5e-05,1.3e-05,2.1e-05,1.7e-05,2.3e-05,1.7e-05,1.7e-05,2.4e-05,2.1e-05,2.9e-05,1.1e-05,2.7e-05,8e-06,6e-06,1.4e-05,2.5e-05,3.6e-05,1.1e-05,2e-05,9e-06,2.3e-05,1.2e-05,7e-06,2.4e-05,3.9e-05,6e-06
7e-06,2.2e-05,2.3e-05,2.7e-05,2.9e-05,2.2e-05,6.3e-05,2.9e-05,3.3e-05,7.3e-05,6.8e-05,4.6e-05,0.001039,0.000277,0.000786,0.001721,0.002263,0.000477,0.000184,0.001202,0.000366,0.000299,0.000171,0.000229,0.000501,0.005754,0.003533,0.003252,0.006108,0.007304,0.005414,0.003353,0.004038,0.00479,0.001717,0.004294,0.003808,0.001433,0.002748,0.006073,0.003441,0.002743,0.002462,0.002379,0.004378,0.001627,0.001901,0.001336,0.000593,0.001457,0.003997,0.001823,0.001454,0.001255,0.002285,0.002614,0.004924,0.003459,0.001451,0.001525,0.001824,0.001022,0.000376,0.001268,0.000679,0.000309,0.000527,0.000577,0.000525,9.4e-05,0.00021,0.000227,0.000216,4.3e-05,0.000258,0.000474,0.000216,1.9e-05,0.000422,0.000221,0.000948,0.000873,0.000407,0.000153,0.000307,0.000166,8.1e-05,8.3e-05,4e-05,7.6e-05,6.6e-05,0.000164,6.9e-05,2.1e-05,0.000157,0.000114,1.6e-05,5.1e-05,1.9e-05,3.9e-05,2.7e-05,3e-05,4.5e-05,1.3e-05,1.4e-05,2.8e-05,1.1e-05,2e-05,2e-05,3.8e-05,3.1e-05,1.4e-05,2.6e-05,5.1e-05,3.8e-05,1.4e-05,1.6e-05,1.9e-05,2.7e-05,1.4e-05,2.3e-05
2.4e-05,2.7e-05,1.7e-05,8e-06,1.6e-05,3.7e-05,3.5e-05,1.1e-05,2e-05,5.6e-05,2.8e-05,6e-05,0.001326,0.003571,0.001507,0.001827,0.00415,0.004006,0.001836,0.001636,0.000915,0.000216,0.000423,0.000346,0.000947,0.00453,0.001795,0.000519,0.007065,0.002568,0.004818,0.002423,0.005062,0.00844,0.00494,0.009004,0.005229,0.003091,0.002202,0.002203,0.004075,0.001809,0.001298,0.002839,0.000733,0.001998,0.002074,0.00316,0.003189,0.003103,0.003467,0.002769,0.001895,0.003273,0.004123,0.004457,0.003645,0.001706,0.000979,0.001727,0.001076,0.001644,0.001458,0.001582,0.001201,0.000588,0.000523,0.000233,0.000347,0.00039,7.9e-05,0.000161,9.2e-05,0.000172,0.000231,0.000553,0.000279,5.2e-05,0.00046,0.000217,0.001097,0.001095,0.000646,0.00024,0.00035,0.000234,0.000136,0.000153,0.000152,0.000277,8.7e-05,0.000113,0.000369,0.00012,0.000212,0.000534,0.000271,0.000111,2.2e-05,4.7e-05,5.4e-05,1.7e-05,2.7e-05,1.3e-05,8e-06,1.5e-05,4.2e-05,4.4e-05,1.4e-05,3.3e-05,1.3e-05,1e-05,1.2e-05,4.2e-05,1.7e-05,3.1e-05,1e-05,9e-06,1.4e-05,2.1e-05,2.2e-05
2.3e-05,2.8e-05,2.5e-05,2.4e-05,8e-06,1.8e-05,4.2e-05,2e-05,2e-05,4.6e-05,8.1e-05,8.1e-05,0.001237,0.007743,0.004208,0.000931,0.002394,0.000333,0.001411,0.001515,0.00151,0.001145,0.000609,0.000545,0.000886,0.002286,0.003831,0.00214,0.005552,0.005373,0.002443,0.001377,0.004615,0.00576,0.003277,0.00717,0.002053,0.001514,0.001565,0.003489,0.002099,0.000953,0.000983,0.001293,0.000651,0.001898,0.001009,0.001641,0.001988,0.002055,0.00082,0.000453,0.00077,0.002232,0.001472,0.001553,0.002726,0.003302,0.001489,0.00119,0.000621,0.001144,0.000714,0.000713,0.000276,0.000177,0.000146,0.000124,0.00043,0.000457,0.000314,8.9e-05,0.000154,0.000154,0.000225,0.000495,0.000344,0.000192,0.000308,0.000553,0.000934,0.000756,0.000182,0.000271,0.000187,0.000269,9.4e-05,9.7e-05,0.000128,0.000421,0.000318,4.2e-05,0.000927,0.000478,0.000471,0.000597,0.000459,0.000183,1.8e-05,2.8e-05,2.7e-05,1.3e-05,1.5e-05,2.3e-05,1.2e-05,2.4e-05,3.5e-05,4.5e-05,4.8e-05,5.7e-05,5.3e-05,2.4e-05,3.5e-05,4.1e-05,3e-05,2.7e-05,3e-05,1.7e-05,1.7e-05,8e-06,5e-06
2.1e-05,2e-05,2.7e-05,1.9e-05,1.9e-05,4e-06,2.6e-05,2.8e-05,1e-05,4.9e-05,5.8e-05,8.2e-05,0.001198,0.008315,0.005375,0.00142,0.002331,0.001661,0.000712,0.000785,0.000655,0.000381,9e-05,0.000669,0.001128,0.000243,0.002108,0.00293,0.000712,0.003543,0.003629,0.000904,0.00292,0.003077,0.001395,0.001524,0.001559,0.000641,0.001157,0.001507,0.001354,0.001221,0.000935,0.000595,0.000526,0.001013,0.000726,0.000368,0.00193,0.001001,0.000698,0.000534,0.000356,0.001231,0.000772,0.000682,0.002238,0.00103,0.000584,0.000235,0.000431,0.000338,0.000162,0.000578,0.000379,0.000355,7.1e-05,0.000123,0.000209,0.000324,0.000314,0.000255,0.00022,8.4e-05,0.000162,0.000276,6.3e-05,0.000106,0.000271,0.000872,0.001255,0.000963,0.000594,0.000365,0.00014,0.000251,0.000187,0.000143,2.4e-05,0.000473,0.000206,0.000372,0.001371,0.000825,0.000617,0.000418,0.000442,0.000181,2.9e-05,3.5e-05,4.2e-05,7e-06,2.2e-05,3.6e-05,1.1e-05,1.1e-05,1.3e-05,3e-05,3.5e-05,1.6e-05,5.4e-05,4.5e-05,4.7e-05,2.7e-05,2.1e-05,1.5e-05,1.5e-05,1.7e-05,2e-06,8e-06,3e-06
1.5e-05,1.2e-05,9e-06,1e-06,7e-06,2e-06,2.3e-05,2.5e-05,2.6e-05,4.2e-05,3e-05,0.000135,0.001512,0.004987,0.002164,0.002097,0.00334,0.002605,0.001313,0.000682,0.000563,0.000233,0.000153,6e-04,0.000455,0.000384,0.001486,0.002011,8e-05,0.001979,0.000285,0.000715,0.001423,0.002164,0.000952,0.002011,0.001013,0.000888,0.000738,0.001652,0.001771,0.002644,0.000532,0.000203,0.00035,0.000426,0.000695,0.000298,0.001898,0.002054,0.001263,0.000187,0.00069,0.001029,0.001153,0.001134,0.000679,0.000739,0.000458,6.3e-05,0.000472,0.000505,0.00029,0.00046,0.000213,0.000107,0.00016,8.3e-05,0.000304,0.000181,0.000129,5.8e-05,0.000126,0.000118,0.000139,0.000115,8.9e-05,5.9e-05,0.000382,0.000637,0.001065,0.000338,9.3e-05,0.000167,0.000134,0.000187,8.9e-05,4.6e-05,0.000196,0.000471,0.000257,0.00062,0.001514,0.000796,0.000233,0.000484,0.000263,0.000151,4e-05,2.1e-05,1.4e-05,4.1e-05,2.8e-05,1.1e-05,2.4e-05,3.4e-05,2.1e-05,3.2e-05,3.3e-05,2e-05,5.6e-05,3e-05,9e-06,1.6e-05,1.4e-05,2e-05,8e-06,2.3e-05,2e-05,2e-05,3.3e-05
1.3e-05,1.2e-05,9e-06,4e-06,4e-06,1e-05,1.4e-05,8e-06,6e-06,5.3e-05,6.6e-05,0.000103,0.00177,0.000633,0.000966,0.001136,0.002078,0.001448,0.000554,0.000228,0.000357,0.000329,0.000373,0.000115,0.000554,0.000635,0.001426,0.001341,0.001156,0.00095,0.002913,0.002048,0.002026,0.002067,0.001142,0.0017,0.001326,0.001046,0.001767,0.001627,0.001264,0.002366,0.001653,0.000722,0.000784,0.001026,0.000985,0.000672,0.001411,0.000748,0.000831,0.000554,0.000789,0.00052,0.001716,0.000628,0.000278,0.000518,0.000662,0.000464,0.000225,0.000471,0.000157,0.000405,0.000252,0.00016,5.5e-05,3.8e-05,0.000192,9.3e-05,5.3e-05,7e-05,8e-06,4.2e-05,6.4e-05,5.6e-05,2.6e-05,4.6e-05,0.000458,0.00051,0.000369,9.4e-05,1.9e-05,0.000146,0.000273,0.00013,5.8e-05,5.2e-05,0.000218,0.000334,0.000177,0.000587,0.000714,0.000328,4.6e-05,2e-04,4e-05,2.4e-05,1.7e-05,2.6e-05,3.6e-05,2.2e-05,7e-06,6e-06,1.6e-05,4.6e-05,4.4e-05,3.8e-05,4.3e-05,2.8e-05,2.7e-05,1.7e-05,2.1e-05,1.8e-05,1e-05,1.7e-05,1.7e-05,1.2e-05,1.3e-05,2.8e-05,1.5e-05
1.4e-05,5e-06,8e-06,6e-06,9e-06,5e-06,2e-06,8e-06,1e-05,5.4e-05,4.5e-05,0.000105,0.002189,0.001098,0.000692,0.001125,0.001052,0.000514,0.000199,0.00029,0.000347,0.00013,0.000141,7.2e-05,0.00053,0.000278,0.001708,0.000745,0.002376,0.001892,0.003648,0.004253,0.001016,0.003662,0.000922,0.000907,0.001855,0.000704,0.002862,0.00129,0.001263,0.002325,0.001291,0.000837,0.001144,0.000321,0.001427,0.000959,0.001007,0.000551,0.000532,0.002169,0.000884,0.001699,0.001152,0.000296,0.000615,0.000271,0.000447,0.000335,0.000347,0.000415,0.000231,0.000671,5.9e-05,0.000222,0.000124,0.000114,6.3e-05,7.2e-05,8.8e-05,2.4e-05,6.4e-05,6.2e-05,8.4e-05,4.7e-05,3.7e-05,5e-05,0.000487,0.000581,0.000637,0.000147,3.8e-05,0.000285,7.4e-05,0.000128,8.5e-05,2.7e-05,0.000216,0.000154,3.6e-05,0.000391,0.00021,0.000114,3.6e-05,0.000203,6.1e-05,2.1e-05,3.5e-05,4.2e-05,1.4e-05,8e-06,1.5e-05,1.3e-05,2.8e-05,4.4e-05,2.7e-05,1.2e-05,6.4e-05,2.7e-05,1.5e-05,9e-06,1.4e-05,8e-06,1.4e-05,1.8e-05,9e-06,1e-05,7e-06,1.1e-05,1.7e-05
2e-06,1.2e-05,6e-06,7e-06,1.2e-05,1e-05,1e-05,4e-06,1.1e-05,3.2e-05,3.2e-05,6.2e-05,0.002219,0.00013,0.000166,0.000884,0.00042,0.000251,8.8e-05,0.000153,0.000181,0.000118,0.000222,0.000125,0.000482,0.001689,0.002189,0.000719,0.004169,0.0045,0.00287,0.002767,0.003324,0.005554,0.00228,0.001864,0.0015,0.000728,0.002117,0.00156,0.002043,0.00138,0.001799,0.00091,0.000623,0.002703,0.000553,0.001331,0.001199,0.000233,0.0015,0.000831,0.001874,0.001975,0.001327,0.000293,0.000398,0.000676,0.000654,0.000606,0.000792,0.000352,0.000298,0.000465,0.000172,0.000298,0.000272,8.4e-05,0.000121,0.000198,7e-06,0.00016,0.000133,2.5e-05,8.6e-05,0.000129,5.2e-05,1.8e-05,0.000616,0.000214,0.000411,5.4e-05,4.7e-05,0.000385,0.000257,9e-05,1.6e-05,4.4e-05,0.000146,2.7e-05,5.7e-05,0.000388,6.1e-05,0.000104,8.1e-05,0.000143,2.8e-05,8e-06,3e-05,5.3e-05,6.5e-05,1.6e-05,4.2e-05,2.6e-05,2.8e-05,3.4e-05,2.2e-05,5e-06,6.4e-05,3.3e-05,2.9e-05,6e-06,1.4e-05,8e-06,1.3e-05,3e-06,1e-05,1.6e-05,1.4e-05,7e-06,7e-06
6e-06,1e-05,1.2e-05,9e-06,1.9e-05,2.4e-05,8e-06,7e-06,9e-06,4.3e-05,2.5e-05,8.1e-05,0.00212,0.000754,0.000471,0.000477,0.000756,0.000288,0.00044,0.00029,0.000373,0.000275,0.00028,0.000105,0.00047,0.00355,0.002445,0.000892,0.003909,0.001615,0.00551,0.005956,0.002341,0.006543,0.004118,0.004755,0.002611,0.002111,0.003008,0.003069,0.002897,0.005925,0.00473,0.002328,0.002446,0.005361,0.001787,0.003481,0.001136,0.001336,0.002258,0.000909,0.001955,0.00221,0.001302,0.001565,0.001452,0.002585,0.002695,0.001172,0.00109,0.000602,0.000778,0.00073,0.00049,0.000257,5.1e-05,0.00012,0.00017,0.000132,8.7e-05,0.000237,0.00021,0.000144,3.1e-05,0.000121,8.6e-05,6.5e-05,0.00077,0.000976,0.00088,0.000313,8.2e-05,0.000396,0.000205,9.3e-05,7.9e-05,7.5e-05,0.000138,0.000128,5.3e-05,0.000374,0.000114,9.6e-05,6.8e-05,3.4e-05,4e-06,7e-06,2.9e-05,6.9e-05,4.3e-05,1.2e-05,5.5e-05,2.6e-05,2.6e-05,1.5e-05,5.9e-05,1.4e-05,5.2e-05,5.5e-05,6.4e-05,4.8e-05,2e-05,1.4e-05,1.4e-05,3e-05,3.4e-05,2.2e-05,2.3e-05,2e-05,4.1e-05
1.3e-05,1e-05,1e-05,1.7e-05,1e-05,1.7e-05,1.3e-05,4e-06,1e-06,3.8e-05,1.5e-05,8.5e-05,0.001745,0.001172,0.000633,0.000244,0.000436,0.000457,4e-05,0.000147,0.000448,0.000492,0.000199,3.7e-05,0.000471,0.004046,0.005079,0.005821,0.004133,0.006064,0.009145,0.007626,0.008423,0.004901,0.004905,0.006244,0.005321,0.002349,0.005643,0.004489,0.00393,0.004804,0.00292,0.007018,0.003943,0.006055,0.004766,0.006096,0.006057,0.002211,0.004693,0.006641,0.002931,0.002874,0.006728,0.00546,0.004102,0.00202,0.004037,0.003774,0.001969,0.001167,0.001022,0.002744,0.001176,0.000219,0.000275,0.000225,0.000217,0.000228,8.6e-05,0.000273,0.000127,0.00017,0.000143,6.6e-05,1.2e-05,1.7e-05,0.000807,0.000818,0.000275,0.000236,0.000197,0.000214,0.000399,0.000171,8.1e-05,0.00013,5.4e-05,0.000115,0.000132,0.000309,0.000189,0.000173,0.00013,0.000197,1e-04,7.4e-05,8.6e-05,6.5e-05,0.000117,9.1e-05,2e-06,6.6e-05,3.2e-05,1.7e-05,4.2e-05,5e-05,4.1e-05,6.3e-05,6.3e-05,5.6e-05,6.4e-05,3.2e-05,2.7e-05,4.8e-05,3.2e-05,1.1e-05,5e-05,5.1e-05,4.2e-05
1.4e-05,7e-06,1.4e-05,1.8e-05,1e-05,1.5e-05,4e-06,3e-06,6e-06,3.6e-05,2.8e-05,8.3e-05,0.001495,0.001115,0.000472,0.000439,0.001015,0.000795,0.000299,5.2e-05,0.00081,0.000564,0.000427,0.000131,0.000351,0.003691,0.009663,0.011956,0.002827,0.006312,0.001464,0.009304,0.01012,0.007113,0.008312,0.001199,0.008835,0.012912,0.012894,0.009767,0.010089,0.010532,0.010028,0.011341,0.003835,0.005655,0.01019,0.003565,0.005788,0.005901,0.003851,0.011218,0.013802,0.00544,0.00701,0.008898,0.00327,0.003245,0.008918,0.009424,0.006323,0.003035,0.002101,0.002049,0.003419,0.002621,0.001213,0.000881,0.000268,0.000257,0.000383,6e-05,5.4e-05,0.000226,0.000164,6.1e-05,3.7e-05,5.2e-05,0.000761,0.000641,0.000277,0.000319,0.000129,0.000342,0.000219,0.000179,2.6e-05,0.000111,0.000147,1.9e-05,0.000165,0.000272,0.000422,0.000391,0.000212,0.000232,1.8e-05,5.5e-05,0.000124,0.000151,8.8e-05,9.7e-05,7.3e-05,6.8e-05,0.000131,5.1e-05,2.7e-05,2e-05,5e-05,0.000115,0.000133,6.2e-05,2e-05,1.8e-05,5.9e-05,1.7e-05,4.5e-05,6.6e-05,9.4e-05,3.7e-05,4.3e-05
1.3e-05,2.2e-05,1.2e-05,1.5e-05,8e-06,2.7e-05,2.3e-05,1.3e-05,1.1e-05,2.8e-05,4.7e-05,0.000123,0.001181,0.001935,0.000913,0.000158,0.00126,0.000164,5.5e-05,8.4e-05,0.000701,6.4e-05,0.000258,0.000154,0.000378,0.003956,0.007276,0.003012,0.00733,0.00605,0.006172,0.004941,0.00182,0.002135,0.006096,0.006173,0.007411,0.005747,0.001462,0.005362,0.002905,0.003574,0.008009,0.003636,0.005986,0.001027,0.006113,0.006207,0.005178,0.008059,0.010239,0.003713,0.005151,0.007307,0.005942,0.001492,0.001069,0.003012,0.004589,0.001607,0.003391,0.003395,0.001622,0.002376,0.002437,0.000392,0.000413,0.000501,0.000278,0.000265,0.000435,0.000455,0.000282,1e-04,0.00015,0.00016,0.000139,1.7e-05,0.000637,0.000619,0.000364,0.000318,0.000197,0.00045,0.000366,0.000265,0.000134,0.000106,5.6e-05,6.1e-05,0.000141,0.000293,0.000461,0.000127,0.000105,6.4e-05,0.000108,6.1e-05,8e-05,9.1e-05,8e-05,3.9e-05,4.5e-05,9.8e-05,5.8e-05,0.000105,4.8e-05,1e-05,7.6e-05,9.7e-05,0.000153,9.4e-05,6.9e-05,4.5e-05,3.4e-05,4.2e-05,5e-05,2.7e-05,3.2e-05,3.2e-05,2.2e-05
2e-05,8e-06,3e-06,1.9e-05,1.4e-05,3e-05,2.4e-05,6e-06,1.6e-05,3.4e-05,7.6e-05,0.000161,0.00082,0.002212,0.001279,0.000557,0.000554,0.000842,0.000364,0.000261,0.000415,0.000491,0.000217,6.3e-05,0.000496,0.003845,0.000255,0.003586,0.004717,0.001887,0.004111,0.001002,0.001249,0.001027,0.004779,0.000838,0.001522,0.003458,0.001332,0.004965,0.006776,0.004569,0.00514,0.003057,0.005448,0.005058,0.001572,0.003683,0.001759,0.005971,0.00079,0.003483,0.002535,0.003452,0.003882,0.002149,0.00238,0.002432,0.003727,0.002457,0.001839,0.00037,0.000374,0.002084,0.000343,0.000526,0.000724,0.000579,0.000475,0.000244,0.000268,0.000121,0.000113,0.000145,0.000152,0.000142,4.9e-05,2.8e-05,0.000462,0.00048,0.000295,8.2e-05,7.9e-05,0.000677,0.000826,0.000346,6.5e-05,3.5e-05,8e-06,3e-05,9.5e-05,0.000257,0.000338,0.000197,0.000155,8.2e-05,8.5e-05,8e-06,4.2e-05,3.6e-05,1.2e-05,3.6e-05,5.3e-05,4.7e-05,0.000104,0.000123,1e-04,8.9e-05,6.8e-05,2.4e-05,8.1e-05,4e-06,5.1e-05,2.3e-05,2.2e-05,3.6e-05,1.8e-05,2.2e-05,1.7e-05,2.3e-05,1e-05
1e-05,1.6e-05,1.2e-05,1.8e-05,1.8e-05,1.6e-05,9e-06,1.4e-05,1.1e-05,7e-06,7.2e-05,0.000187,0.000629,0.000994,0.000458,0.000629,0.000424,0.000595,0.000445,0.000364,0.000643,0.000619,0.000136,9.8e-05,0.000321,0.002735,0.001903,0.002196,0.000552,0.000827,0.002293,0.000863,0.001551,0.00269,0.001823,0.004868,0.003351,0.002204,0.001532,0.002745,0.003566,0.00414,0.00198,0.001712,0.003523,0.00095,0.000676,0.002671,0.002161,0.001908,0.002431,0.00254,0.001258,0.001793,0.001629,0.002792,0.003742,0.002847,0.002309,0.001864,0.001603,0.001015,0.000261,0.000712,0.000565,0.000297,0.000279,0.00013,0.000275,0.000211,0.000114,4.6e-05,0.00011,0.000109,8.7e-05,6.6e-05,1.9e-05,3.9e-05,0.000329,0.000622,0.000355,0.000177,3e-05,0.000968,0.000812,0.000423,0.000101,8.1e-05,9.1e-05,6.6e-05,3e-05,0.000104,0.000201,0.000211,0.000151,8.3e-05,5.5e-05,2.8e-05,3.1e-05,6.7e-05,3.1e-05,7.8e-05,2.7e-05,7.6e-05,0.00023,7.4e-05,6.3e-05,0.000175,0.000188,0.000212,0.000204,0.000147,6e-05,4.9e-05,1.4e-05,3.2e-05,1.1e-05,1.6e-05,2.9e-05,5.5e-05,5e-05
1.3e-05,0,1.2e-05,2.4e-05,8e-06,9e-06,9e-06,7e-06,1.6e-05,1.8e-05,4.8e-05,0.000161,0.000129,0.000497,0.000124,0.000271,0.000167,0.000437,0.000652,0.000219,0.000737,0.000624,0.00061,0.00014,0.000314,0.001989,0.001446,0.001165,0.001009,0.00052,0.001269,0.002023,0.000931,0.00301,0.003302,0.004178,0.001726,0.002374,0.002164,0.003232,0.001281,0.002647,0.000645,0.001284,0.002896,0.003672,0.001622,0.001619,0.002501,0.0025,0.001263,0.001238,0.001522,0.00169,0.001122,0.002898,0.00104,0.001832,0.001727,8.6e-05,0.000442,0.000349,0.000373,0.000532,0.000218,0.000533,0.000212,0.000108,0.000141,0.000235,0.000105,6e-05,6.5e-05,7.2e-05,0.000122,0.000111,3.9e-05,6.8e-05,0.000343,0.000262,0.000272,0.000157,0.000108,0.001054,0.000657,0.000301,6.5e-05,5.9e-05,4.1e-05,7.9e-05,5.1e-05,0.00015,0.00012,4.2e-05,6.4e-05,6.9e-05,3.1e-05,7e-05,7.6e-05,6e-06,5.2e-05,9.2e-05,7.5e-05,7.1e-05,0.000152,0.000172,7.5e-05,0.000117,0.000122,0.000163,0.000243,8e-05,9e-06,2.6e-05,3e-05,2.1e-05,4e-06,2.1e-05,1.1e-05,4.2e-05,4.4e-05
8e-06,6e-06,7e-06,8e-06,2e-06,1.2e-05,6e-06,1e-06,3e-06,1.2e-05,2.5e-05,0.000173,0.000167,0.000339,0.00019,7.1e-05,0.000232,0.000728,0.000501,0.000179,0.000733,0.000504,0.000138,0.000169,0.000168,0.001407,0.0019,0.002069,0.000429,0.00051,0.000368,0.000749,0.000758,0.001416,0.001358,0.001823,0.000739,0.001219,0.001942,0.000438,0.001106,0.000512,0.001304,0.000489,0.000921,0.001875,0.000942,0.001449,0.002143,0.000467,0.000826,0.001065,0.001148,0.001241,0.001481,0.00122,0.000747,0.000572,0.00115,0.000571,0.000279,0.000222,0.00015,0.000614,0.000331,0.000192,7.9e-05,3.5e-05,9.3e-05,8.1e-05,7.4e-05,5.4e-05,1.1e-05,4.9e-05,6.6e-05,0.000108,5.2e-05,3.3e-05,0.00032,0.00035,0.000315,0.00012,7.5e-05,0.001007,0.000413,0.000117,4e-05,5.5e-05,4e-05,6.7e-05,3.1e-05,0.000162,6.6e-05,1.9e-05,0.00011,3.5e-05,1.1e-05,4.9e-05,3.6e-05,4.7e-05,5.4e-05,6.9e-05,4.9e-05,8.3e-05,7.3e-05,6e-05,8e-05,1.4e-05,4.2e-05,0.000217,0.000139,8e-05,4e-05,2.4e-05,2.8e-05,6e-06,8e-06,1.8e-05,6e-06,3.2e-05,1.8e-05
5e-06,3e-06,1e-06,5e-06,3e-06,4e-06,6e-06,3e-06,4e-06,5e-06,1.3e-05,8.3e-05,6.1e-05,8.3e-05,0.000152,0.000249,0.000168,0.000235,0.000176,7.9e-05,0.000296,0.000159,7.2e-05,2.5e-05,0.000151,0.000311,0.000683,0.000905,0.000851,0.000225,0.000257,0.00025,0.000279,0.000394,0.000882,0.000627,0.000787,0.000523,0.000494,0.000219,0.000603,0.000511,0.000371,0.000263,0.000867,0.000201,0.000578,0.000251,0.000385,0.000596,0.00071,0.000559,0.000235,0.000227,0.00058,0.00028,0.000348,0.00023,0.000404,0.000191,2e-05,1e-05,6.7e-05,0.000118,3.3e-05,6e-05,2.8e-05,5.1e-05,9.3e-05,6.9e-05,3.6e-05,3.2e-05,1.1e-05,1.3e-05,1.6e-05,4.7e-05,4.2e-05,3.7e-05,0.000138,0.000178,6.1e-05,5e-05,4.1e-05,0.000432,0.000164,4.9e-05,1.2e-05,1.7e-05,3.8e-05,2.2e-05,9e-06,5.2e-05,3.6e-05,2.3e-05,5.5e-05,5.2e-05,1.9e-05,1.7e-05,1.7e-05,1.9e-05,7e-06,1.8e-05,6e-06,1.3e-05,2.7e-05,3.2e-05,2.1e-05,2.5e-05,1.8e-05,0.000107,5.9e-05,2.8e-05,1.7e-05,2e-05,1e-05,7e-06,8e-06,3e-06,6e-06,1.4e-05,2e-05
4e-06,3e-06,4e-06,1e-06,1e-06,2e-06,3e-06,1e-06,4e-06,1e-06,1.2e-05,6e-05,0.000137,0.000277,9.5e-05,0.000102,0.000147,0.000296,0.000125,7.9e-05,0.000193,0.000101,5.7e-05,3.5e-05,0.000204,0.000406,0.000849,0.000163,0.000449,0.000363,0.000334,0.00012,0.000243,0.000395,0.000467,0.000154,0.000339,0.000471,0.000339,0.00047,0.000346,0.000408,0.000311,0.000331,0.000859,0.000399,0.000247,0.000276,0.000241,0.000404,0.000521,5e-04,0.000422,0.00015,0.000659,0.00047,0.000121,0.000237,0.000472,0.000142,0.000182,7.2e-05,6.8e-05,7.6e-05,4e-05,5.3e-05,1.8e-05,6.2e-05,4.4e-05,3.2e-05,7e-06,1.7e-05,1.6e-05,2e-05,5.9e-05,3.5e-05,9e-06,1.5e-05,0.000109,4e-06,8.4e-05,2.5e-05,1.9e-05,0.000257,0.000133,5.5e-05,2.3e-05,1.3e-05,7e-05,3.9e-05,8e-06,4.7e-05,3.5e-05,1.2e-05,3.3e-05,2.3e-05,1.8e-05,4e-06,5e-06,2.6e-05,1.7e-05,1e-05,6e-06,1.8e-05,2.6e-05,5e-05,3.4e-05,3e-05,7e-06,7.1e-05,2.3e-05,1.1e-05,4e-06,6e-06,5e-06,7e-06,6e-06,4e-06,6e-06,1.3e-05,8e-06
3e-06,3e-06,4e-06,2e-06,1e-06,1e-06,3e-06,2e-06,3e-06,2e-06,4e-06,5e-05,8e-05,0.000106,0.000196,0.000191,0.000157,0.000207,9.3e-05,6.6e-05,0.000129,4.9e-05,3.9e-05,2.5e-05,0.000144,0.000398,0.000813,0.000458,0.000124,0.000223,0.000307,0.000233,0.000651,0.000332,0.000589,0.000231,0.000469,0.000348,0.000359,0.00063,0.000679,0.000508,0.000313,0.000435,1e-04,0.00059,0.000291,0.000377,6.5e-05,0.000594,0.000413,0.00049,0.000371,2.6e-05,0.000492,0.00037,0.00019,0.00016,0.000424,0.000191,0.000119,1.6e-05,1.1e-05,9.1e-05,4.7e-05,5.9e-05,2.7e-05,1.9e-05,2.3e-05,4.1e-05,2.2e-05,1.6e-05,4e-06,4e-06,5.2e-05,3e-06,1.8e-05,1.7e-05,6.9e-05,7.1e-05,5.4e-05,2.1e-05,1.5e-05,0.000114,0.000126,4.5e-05,1.9e-05,2.2e-05,7.9e-05,3.1e-05,2.7e-05,5.1e-05,5.7e-05,2.2e-05,2.4e-05,1.7e-05,3e-06,1.1e-05,6e-06,1.8e-05,1.2e-05,1.2e-05,1e-05,2.3e-05,1.7e-05,3.2e-05,7e-06,3e-06,2e-06,3.9e-05,6e-06,7e-06,8e-06,2e-06,2e-06,1e-06,2e-06,6e-06,3e-06,1.2e-05,7e-06
5e-06,2e-06,2e-06,4e-06,2e-06,2e-06,3e-06,5e-06,6e-06,3e-06,6e-06,3.7e-05,5.1e-05,9.6e-05,0.00012,0.000121,0.00012,0.00016,3e-05,2.3e-05,7.6e-05,9.3e-05,3.3e-05,1.9e-05,8.8e-05,0.000332,0.000492,0.000162,0.000228,0.000145,0.000252,0.000121,0.000617,0.00029,0.000495,0.000247,0.000423,0.00013,0.000139,0.000253,0.000364,0.000255,0.000192,0.000478,0.000325,0.000483,0.000192,0.000163,0.000379,0.000511,0.000349,0.000294,0.000244,5.9e-05,0.000567,0.000465,7.4e-05,0.000166,0.000304,0.000127,0.000111,1.4e-05,1.7e-05,3.2e-05,8.3e-05,4.9e-05,1.4e-05,9e-06,2.7e-05,3.1e-05,2.1e-05,4.2e-05,3.5e-05,2.5e-05,2.5e-05,2.8e-05,1.3e-05,1.1e-05,3.5e-05,5.6e-05,6.8e-05,2.2e-05,1.7e-05,9.3e-05,6.8e-05,4e-05,1.7e-05,8e-06,6.8e-05,3.5e-05,2e-05,6.8e-05,4.2e-05,2.4e-05,8e-06,2.7e-05,6e-06,1.5e-05,1.7e-05,1.3e-05,1.5e-05,4e-06,4e-06,9e-06,5e-06,1.7e-05,2e-05,1.6e-05,1.3e-05,5.2e-05,1e-05,5e-06,3e-06,8e-06,5e-06,3e-06,5e-06,2e-06,6e-06,7e-06,8e-06
4e-06,3e-06,1e-06,3e-06,2e-06,2e-06,3e-06,4e-06,1e-06,5e-06,5e-06,2.8e-05,0.00011,0.00017,0.000143,0.000134,2.4e-05,0.000102,8.8e-05,3.7e-05,1.3e-05,8.6e-05,9.9e-05,7.1e-05,0.000147,0.000185,0.000497,0.000458,0.000199,0.000306,0.00066,0.000397,0.000105,0.000368,0.000357,0.000355,0.000538,0.000586,0.000386,0.000402,0.000108,0.000286,0.000115,0.000311,0.000213,0.000539,0.000218,4e-04,0.000218,0.000434,0.000316,0.000307,0.000511,0.000247,0.000664,0.000164,0.000143,0.000113,0.000223,0.000143,7.4e-05,3.4e-05,4.9e-05,8e-05,6e-05,5.8e-05,3.8e-05,3.4e-05,5.4e-05,7e-06,4.1e-05,3.3e-05,7e-06,1.9e-05,3.3e-05,3e-05,2.7e-05,1.3e-05,1.1e-05,4e-05,4.3e-05,2.4e-05,2.7e-05,0.000195,0.000106,5.3e-05,1.3e-05,1.6e-05,6.8e-05,2.3e-05,7e-06,5.5e-05,5.2e-05,2.2e-05,4e-06,1.3e-05,5e-06,1.1e-05,3e-06,5e-06,2e-06,8e-06,6e-06,8e-06,1.2e-05,7e-06,6e-06,7e-06,1.4e-05,3.8e-05,8e-06,1e-06,3e-06,7e-06,2e-06,1e-06,5e-06,4e-06,3e-06,5e-06,7e-06
3e-06,1e-06,1e-06,1e-06,1e-06,1e-06,4e-06,2e-06,3e-06,7e-06,4e-06,3e-05,0.000114,0.000187,0.000136,0.000136,0.000123,7.2e-05,2.9e-05,3.1e-05,7.7e-05,1e-04,0.000113,2e-05,0.000126,0.000263,0.000486,0.000433,0.000495,0.000437,0.000358,7.6e-05,0.000215,0.000362,0.000565,0.000305,0.000219,0.000337,0.000433,0.000342,0.000223,0.000417,0.000178,0.000328,0.000315,0.000404,0.000309,0.000366,0.00018,0.000258,0.00022,7.2e-05,0.000114,0.000165,0.000297,0.000494,7.9e-05,9.2e-05,0.000176,9.6e-05,6.7e-05,2.9e-05,2.2e-05,5.9e-05,9.1e-05,9.9e-05,2.8e-05,2.2e-05,4.7e-05,3.6e-05,3.8e-05,3.3e-05,6e-06,1.3e-05,3.6e-05,4e-06,1.2e-05,1.2e-05,3.9e-05,1e-04,1.3e-05,3e-05,1.3e-05,0.000251,7.3e-05,4.7e-05,1e-05,1.1e-05,5.6e-05,2.6e-05,6e-06,2.8e-05,2.7e-05,1.3e-05,9e-06,1.1e-05,7e-06,7e-06,1e-05,5e-06,6e-06,6e-06,4e-06,9e-06,1.4e-05,1.5e-05,1.3e-05,7e-06,1.5e-05,3.5e-05,6e-06,8e-06,1e-05,2e-06,1e-06,2e-06,5e-06,4e-06,3e-06,5e-06,5e-06
2e-06,3e-06,3e-06,2e-06,2e-06,3e-06,4e-06,3e-06,4e-06,7e-06,1e-06,3.6e-05,8e-05,6.7e-05,5.6e-05,9.4e-05,0.000105,3.1e-05,5.2e-05,3.2e-05,4.4e-05,0.00011,1.6e-05,3.8e-05,0.000135,0.000433,0.000398,0.000345,0.000655,0.000209,0.000284,0.000176,0.000288,0.000307,0.000324,0.000229,0.000408,0.000152,0.000396,0.000244,0.000543,0.000199,0.000128,0.000211,8.9e-05,0.000187,0.000318,0.000336,0.000113,0.00019,4.9e-05,0.000286,0.000245,0.000175,0.000221,1.9e-05,0.00014,4.7e-05,0.000195,8.5e-05,0.000107,2.5e-05,5.7e-05,0.000136,0.000113,1.3e-05,1.4e-05,2.6e-05,6e-06,3.8e-05,2.2e-05,3.5e-05,1.8e-05,8e-06,1.1e-05,2.6e-05,1.6e-05,1.7e-05,6.6e-05,9.5e-05,0.000106,3.9e-05,2.2e-05,0.000283,0.000114,3.3e-05,2.9e-05,1.9e-05,4.6e-05,3.3e-05,3.6e-05,2.9e-05,3.2e-05,1.7e-05,5e-06,2.2e-05,1.1e-05,7e-06,1.4e-05,7e-06,8e-06,7e-06,7e-06,6e-06,1.4e-05,1.3e-05,6e-06,8e-06,1.5e-05,3.1e-05,7e-06,9e-06,9e-06,6e-06,2e-06,3e-06,4e-06,3e-06,3e-06,5e-06,1e-06
2e-06,5e-06,1e-06,0,3e-06,3e-06,4e-06,3e-06,3e-06,3e-06,3e-06,4e-05,9.2e-05,0.000114,7.1e-05,0.000122,6.2e-05,2.8e-05,8e-06,1.4e-05,6.1e-05,9.8e-05,9.1e-05,4.5e-05,9.9e-05,0.000271,0.000352,0.000417,0.000287,0.000146,0.000137,0.000131,0.000389,0.000113,0.00049,0.000412,1.1e-05,0.000243,0.00029,0.000255,0.000132,4e-05,0.000182,0.000175,0.000166,0.000403,0.000314,0.00011,6.2e-05,0.000231,0.000145,0.000319,0.000163,0.000161,0.000315,9.3e-05,0.000195,0.000135,0.000116,8.8e-05,0.000166,0.000169,0.000124,0.000144,0.000144,7.2e-05,2e-05,1.3e-05,3.5e-05,5.3e-05,6.7e-05,8e-06,1.6e-05,1.3e-05,4.1e-05,4.1e-05,1.2e-05,1.2e-05,8.4e-05,1.9e-05,0.000103,1.7e-05,9e-06,0.000243,0.000186,9.6e-05,1.4e-05,1e-06,2e-05,2.9e-05,3.8e-05,3e-05,3.8e-05,5e-06,6e-06,1.4e-05,1.4e-05,6e-06,1.4e-05,1e-06,4e-06,6e-06,7e-06,1.3e-05,9e-06,9e-06,1.7e-05,1.2e-05,6e-06,4.2e-05,3.1e-05,1.2e-05,1e-06,2e-06,4e-06,4e-06,6e-06,4e-06,6e-06,4e-06,7e-06
1e-06,2e-06,2e-06,3e-06,2e-06,1e-06,4e-06,2e-06,3e-06,2e-06,2e-06,4.4e-05,0.000107,0.000116,6.9e-05,7e-05,6.5e-05,6.3e-05,4.5e-05,1.7e-05,0.000101,5.3e-05,2.7e-05,3e-05,8.4e-05,0.000198,0.000274,0.000248,0.000278,0.000125,0.000125,0.00016,0.000386,0.000393,0.000229,0.000264,0.000295,0.00028,0.000149,0.000176,0.000493,0.000377,0.000104,0.000103,3.8e-05,0.000318,0.000138,0.000163,0.000338,8.8e-05,0.000231,0.000279,0.000104,0.00014,0.000304,2e-04,0.000302,0.000164,0.000387,6.6e-05,0.000142,0.000138,4.1e-05,0.000182,9.7e-05,1.4e-05,2.1e-05,1.1e-05,6.3e-05,9.3e-05,6.8e-05,5.8e-05,5.5e-05,3.5e-05,3.3e-05,2.6e-05,2e-05,3e-06,8.7e-05,7.2e-05,9.1e-05,1.2e-05,1.3e-05,0.000189,0.00015,6.4e-05,1.6e-05,5e-06,1.5e-05,2.3e-05,1.3e-05,2.2e-05,1.4e-05,2e-05,5e-06,1.5e-05,1.4e-05,1.4e-05,1e-06,8e-06,1e-05,1.1e-05,1.1e-05,8e-06,3e-06,7e-06,1.4e-05,4e-06,6e-06,1.6e-05,2.2e-05,1.4e-05,3e-06,4e-06,4e-06,1e-05,8e-06,4e-06,5e-06,4e-06,8e-06
1e-06,0,1e-06,3e-06,3e-06,2e-06,3e-06,2e-06,1e-06,2e-06,2e-06,5e-05,8.5e-05,5.1e-05,0.000104,0.000109,6.1e-05,0.000102,2.1e-05,1.4e-05,0.000129,0.000113,5.9e-05,4.6e-05,0.000101,0.000396,0.00012,0.000394,0.000173,0.000131,0.000237,0.000132,0.000336,0.000154,0.000367,0.00039,0.000159,0.000324,3.3e-05,0.000389,0.000329,0.000264,0.000106,0.000123,0.000227,0.00027,0.000235,0.000119,0.000374,0.000445,0.000145,0.000377,9.1e-05,0.000127,0.000216,1.9e-05,0.000345,0.000306,0.000261,0.000243,0.000168,5.2e-05,4.1e-05,0.00015,5.8e-05,4.9e-05,0.000107,6.3e-05,3.8e-05,4.9e-05,2.7e-05,1.8e-05,2.4e-05,1.5e-05,2.9e-05,1.1e-05,6e-06,1.5e-05,6.1e-05,2.6e-05,3.9e-05,1.4e-05,1e-05,0.000133,2.4e-05,2.6e-05,7e-06,9e-06,2.8e-05,3.4e-05,2.8e-05,3.7e-05,1.5e-05,1.3e-05,1.6e-05,2.3e-05,1.4e-05,6e-06,6e-06,8e-06,8e-06,6e-06,7e-06,2.1e-05,1.3e-05,1e-05,3e-06,4e-06,2e-06,1.5e-05,1e-06,1e-06,2e-06,6e-06,8e-06,2e-06,2e-06,1e-06,6e-06,5e-06,1e-06
2e-06,1e-06,0,0,1e-06,0,3e-06,1e-06,2e-06,3e-06,1e-06,5.1e-05,0.000108,0.000189,7.6e-05,5.4e-05,3.3e-05,5.4e-05,2.7e-05,9e-06,0.00011,7.3e-05,5.8e-05,7.5e-05,7.9e-05,0.000368,0.000301,0.000252,0.000286,0.000313,0.000522,0.000123,0.000353,0.000242,0.000415,0.000332,0.000305,0.000274,8.4e-05,0.000331,0.000224,0.00028,9.9e-05,0.000121,0.000214,0.000482,0.000431,0.000274,0.00039,0.000185,9e-06,0.000269,0.000128,0.000132,0.000312,0.000265,1.7e-05,0.000192,0.000162,0.000187,0.000183,0.000144,0.000115,0.000146,4.5e-05,6.7e-05,0.000111,6.9e-05,1.7e-05,1.9e-05,3.1e-05,2.2e-05,1.7e-05,2.1e-05,7e-06,1.4e-05,5e-06,8e-06,3.6e-05,1.6e-05,9.2e-05,3e-05,2.9e-05,0.000101,4.3e-05,2.8e-05,1.4e-05,1.5e-05,2.5e-05,2.5e-05,1.6e-05,3.1e-05,3.4e-05,6e-06,1.5e-05,1e-05,7e-06,6e-06,4e-06,5e-06,1.2e-05,1.5e-05,5e-06,1.9e-05,5e-06,8e-06,2e-06,4e-06,6e-06,2.2e-05,1.5e-05,5e-06,2e-06,7e-06,2e-06,2e-06,2e-06,1e-06,3e-06,2e-06,1e-06
0,2e-06,1e-06,3e-06,1e-06,1e-06,3e-06,1e-06,5e-06,4e-06,3e-06,4.8e-05,0.000129,0.000112,2.5e-05,0.000112,9.2e-05,7e-05,2.2e-05,5.1e-05,9.6e-05,5e-05,5.1e-05,1.2e-05,0.000106,0.000259,0.000169,0.000176,0.000363,0.000131,0.000257,0.000216,0.000424,0.00036,0.000376,0.000215,0.00018,0.000222,6.8e-05,0.000199,0.000282,0.000343,4e-06,8.1e-05,0.000352,0.000377,0.000237,0.000352,0.000253,0.000334,0.000126,0.000226,4e-05,0.000118,0.000163,0.000328,7.7e-05,0.000186,0.000214,0.000127,8.1e-05,3.2e-05,8.5e-05,4.2e-05,8.7e-05,5.5e-05,4.5e-05,4e-05,8e-06,1.9e-05,3.2e-05,7e-06,1.1e-05,1.9e-05,1.4e-05,1.9e-05,4e-06,9e-06,1.7e-05,4.4e-05,8.3e-05,5.5e-05,1.9e-05,9.5e-05,7e-05,3.1e-05,1.2e-05,9e-06,5.4e-05,3.9e-05,1e-05,1.6e-05,3.1e-05,1.8e-05,1.8e-05,1.7e-05,4e-06,3e-06,3e-06,9e-06,3e-06,1.6e-05,1.4e-05,1.4e-05,6e-06,7e-06,4e-06,4e-06,8e-06,2.1e-05,2.2e-05,1.7e-05,4e-06,5e-06,6e-06,4e-06,4e-06,5e-06,4e-06,3e-06,3e-06
4e-06,4e-06,0,3e-06,3e-06,3e-06,6e-06,4e-06,9e-06,7e-06,9e-06,3.8e-05,9.6e-05,0.000156,9.4e-05,6.1e-05,3.6e-05,4.7e-05,1.5e-05,3.2e-05,7.3e-05,0.000146,5.2e-05,3e-05,8.7e-05,0.00018,0.000278,0.000192,0.000205,0.000101,0.000205,0.000199,0.000375,0.000166,0.000343,0.000169,0.000132,0.000244,0.000246,5.5e-05,0.000461,0.000183,0.000119,2.8e-05,0.000315,0.000284,0.000321,0.000248,6.1e-05,0.000251,0.000151,0.000215,9.6e-05,6e-05,0.000198,0.000136,0.00028,0.000159,0.000227,9.4e-05,9.4e-05,2.2e-05,3.5e-05,7.7e-05,6e-05,0.000101,2.7e-05,4.3e-05,5.7e-05,2.4e-05,7e-06,9e-06,2.5e-05,3.2e-05,3.3e-05,4.8e-05,3.5e-05,1e-05,4e-06,2.2e-05,4.6e-05,2.8e-05,1.6e-05,0.000135,0.000111,6.6e-05,1.7e-05,1.1e-05,4.4e-05,3.4e-05,3.2e-05,1.6e-05,6.7e-05,4.4e-05,1.8e-05,9e-06,5e-06,3e-06,3e-06,1.3e-05,8e-06,1.1e-05,1.6e-05,2.1e-05,1.1e-05,1e-05,1e-05,4e-06,8e-06,1.5e-05,1.1e-05,5e-06,5e-06,2e-06,3e-06,8e-06,5e-06,1e-06,3e-06,5e-06,4e-06
1e-06,2e-06,3e-06,0,2e-06,2e-06,3e-06,2e-06,7e-06,2e-06,6e-06,3.2e-05,8.5e-05,6.4e-05,1.8e-05,1e-04,1.4e-05,4.5e-05,2.8e-05,4.9e-05,0.000147,0.000201,0.00014,2.6e-05,0.000117,2.8e-05,0.000133,1.6e-05,0.000158,0.000511,4e-04,8.9e-05,0.000319,0.000352,0.000397,0.000136,0.000108,0.000216,0.000285,0.000294,3e-04,6.3e-05,1.1e-05,5.7e-05,0.000415,0.00035,0.000117,0.000474,0.000177,0.000143,6.1e-05,0.000277,5e-05,0.000166,0.000122,0.000142,0.000288,0.000323,0.000223,0.000212,0.000109,1e-04,7.9e-05,0.000114,0.000133,4.7e-05,3.1e-05,3e-05,3.3e-05,3e-05,1.2e-05,2.5e-05,2.8e-05,2.5e-05,4.6e-05,6.3e-05,1.4e-05,1.4e-05,2e-05,6.2e-05,5.7e-05,7e-06,1.3e-05,0.000148,0.000132,5.9e-05,1.3e-05,1.3e-05,3.1e-05,2.2e-05,1.9e-05,3e-05,7.4e-05,1.9e-05,2.6e-05,1.6e-05,1.6e-05,8e-06,6e-06,2.4e-05,1e-05,2e-06,1e-06,6e-06,2e-06,3e-06,5e-06,8e-06,1.2e-05,2e-05,4e-06,1e-05,6e-06,3e-06,1e-06,4e-06,3e-06,2e-06,4e-06,3e-06,1e-06
1e-06,1e-06,2e-06,2e-06,3e-06,2e-06,4e-06,2e-06,4e-06,3e-06,1e-06,2.8e-05,8.5e-05,9e-05,4e-05,9.9e-05,3.7e-05,4.8e-05,5.5e-05,4.4e-05,0.000132,8.4e-05,2.7e-05,4.4e-05,9.1e-05,0.00024,0.000269,0.000175,0.00026,0.000392,0.000222,7.5e-05,0.000177,0.000354,3e-04,0.00042,0.000399,0.000106,0.000279,8.4e-05,0.00011,0.000322,4.4e-05,0.000143,0.000445,0.000761,0.000418,0.000257,0.000605,0.000437,3.9e-05,0.000189,0.000136,0.000217,0.000373,0.000426,0.00035,0.000253,0.000372,0.000515,0.00042,0.000228,7e-05,0.000181,0.000205,6.5e-05,5.5e-05,3.8e-05,8e-05,7.3e-05,4.7e-05,4.8e-05,6.3e-05,4.7e-05,3.3e-05,0.000101,7.5e-05,1.9e-05,5.9e-05,0.000119,0.00014,7.7e-05,3.2e-05,0.000154,0.000248,0.000114,2.4e-05,8e-06,2.3e-05,2.1e-05,6e-06,3.6e-05,2.1e-05,1.4e-05,3.4e-05,7e-06,2.1e-05,1.7e-05,2e-06,2.5e-05,2.6e-05,2.4e-05,1.2e-05,4e-06,1e-05,6e-06,3e-06,1.4e-05,4e-06,1.9e-05,1.3e-05,1e-05,5e-06,7e-06,4e-06,2e-06,5e-06,4e-06,6e-06,4e-06,1e-06
1e-06,2e-06,2e-06,2e-06,1e-06,2e-06,2e-06,2e-06,3e-06,2e-06,3e-06,2.3e-05,0.000113,0.000103,0.000158,9.2e-05,9e-05,4.6e-05,4.3e-05,3.6e-05,8.4e-05,0.000111,5.6e-05,2.5e-05,0.000113,0.000305,0.000187,0.00024,0.000675,0.000867,0.000598,0.000175,0.000218,0.000169,0.000245,0.000306,8.3e-05,0.000159,0.000327,0.000492,0.000445,0.000279,6e-05,0.000183,0.000516,0.000481,0.000132,0.000233,0.000361,7.1e-05,8e-05,9.3e-05,0.000102,0.000297,4.5e-05,0.000421,4.6e-05,0.000137,9.7e-05,0.000367,0.000301,0.00017,7.3e-05,0.000206,5.5e-05,0.000101,6e-05,2.6e-05,7e-05,3.9e-05,1.5e-05,3.8e-05,6.8e-05,4.6e-05,2.3e-05,5.5e-05,2.1e-05,6e-06,8.1e-05,7.5e-05,4.7e-05,4.6e-05,3.3e-05,0.000153,0.000343,0.000188,6.4e-05,6e-06,2.2e-05,1.5e-05,2.5e-05,1.7e-05,4.6e-05,3.5e-05,1.4e-05,2.8e-05,1.5e-05,1.6e-05,1.9e-05,2e-05,1.9e-05,1.2e-05,1.9e-05,1.9e-05,1.8e-05,1e-05,4e-06,1.9e-05,2e-05,7e-06,1.3e-05,1.5e-05,7e-06,9e-06,6e-06,6e-06,2e-06,2e-06,7e-06,2e-06,2e-06
1e-06,2e-06,1e-06,1e-06,0,0,3e-06,1e-06,2e-06,2e-06,1e-06,1.4e-05,0.000111,0.00014,3e-05,6.4e-05,7.8e-05,5.3e-05,4.5e-05,3.1e-05,8.2e-05,0.000101,7.9e-05,4.2e-05,8.2e-05,0.000288,0.000184,9.5e-05,0.000522,0.00041,0.000259,0.000188,0.000208,0.000311,0.000316,6.7e-05,0.000252,0.000151,0.000303,0.000318,0.000236,0.000108,8e-06,0.000197,0.000191,6.8e-05,0.000311,0.000132,0.000142,0.000197,0.00021,0.000246,9.6e-05,0.00018,0.000156,0.000166,0.000146,0.000158,0.000222,0.000332,9.9e-05,5e-05,3.7e-05,6.7e-05,4.4e-05,0.000124,4e-05,1.6e-05,2.9e-05,1.7e-05,1.9e-05,1.4e-05,3e-05,2.4e-05,2.9e-05,1.4e-05,9e-06,2e-06,8.6e-05,3.4e-05,1.5e-05,2.2e-05,1.2e-05,0.000136,0.000211,1e-04,3.9e-05,1e-05,2.9e-05,9e-06,2.3e-05,3.3e-05,2.5e-05,2e-05,1.4e-05,1.9e-05,5e-06,8e-06,1.1e-05,2.4e-05,1.1e-05,1.4e-05,5e-06,3e-06,7e-06,4e-06,1.1e-05,1.4e-05,6e-06,8e-06,1.3e-05,6e-06,2e-06,6e-06,3e-06,1e-06,2e-06,1e-06,2e-06,2e-06,3e-06
1e-06,1e-06,1e-06,1e-06,0,1e-06,2e-06,1e-06,2e-06,0,3e-06,1.1e-05,9.3e-05,0.000142,3.9e-05,7.4e-05,7.5e-05,3.6e-05,1.2e-05,1.1e-05,5.2e-05,4.8e-05,1.3e-05,1.2e-05,7.9e-05,0.000247,0.000156,0.000119,0.000283,0.000102,0.000174,9.9e-05,0.000184,0.00025,0.000197,9.8e-05,0.00015,0.000327,0.00013,0.000328,0.000178,0.000142,0.000104,0.000157,0.00025,0.000211,0.000107,0.000138,0.000121,0.000145,0.000246,0.00025,0.000124,8.7e-05,0.000229,0.000241,0.000207,0.000268,8.8e-05,0.000151,3.9e-05,7e-06,1.2e-05,1.9e-05,4.2e-05,3.9e-05,2.5e-05,7e-06,9e-06,1e-05,1e-05,1.6e-05,7e-06,1.7e-05,2.4e-05,1.1e-05,3e-06,8e-06,7.8e-05,1.3e-05,3.7e-05,1.4e-05,1e-05,0.000101,2.8e-05,7e-06,5e-06,8e-06,1.7e-05,7e-06,9e-06,2e-05,1e-06,5e-06,3e-06,1.1e-05,8e-06,2e-06,1e-05,9e-06,5e-06,2e-06,6e-06,6e-06,3e-06,1e-06,5e-06,3e-06,3e-06,1.5e-05,4e-06,2e-06,3e-06,3e-06,3e-06,1e-06,2e-06,1e-06,1e-06,1e-06,1e-06
0,0,0,0,0,0,3e-06,0,1e-06,1e-06,2e-06,1e-05,6.5e-05,0.000102,3.3e-05,7.8e-05,5.4e-05,3.4e-05,1.2e-05,6e-06,4.6e-05,2.6e-05,0,8e-06,7.5e-05,0.000227,0.000228,0.000106,0.000228,5.9e-05,0.000148,9.8e-05,0.000278,0.000128,0.000181,1e-04,0.000109,0.000189,3.5e-05,0.000141,0.000287,0.000244,7.1e-05,2.9e-05,0.000246,0.000142,6.4e-05,0.000173,7.7e-05,0.000229,0.000129,0.000246,3.5e-05,1.2e-05,0.000237,0.000229,5.6e-05,0.000159,0.000142,0.000135,2.6e-05,8e-06,2.8e-05,1.9e-05,3.5e-05,4.3e-05,5e-06,3e-06,9e-06,3e-06,7e-06,8e-06,3e-06,1.5e-05,1.6e-05,3e-06,1e-06,6e-06,7.2e-05,4e-06,3.8e-05,6e-06,1.1e-05,5.9e-05,3.2e-05,3e-06,2e-06,6e-06,1.5e-05,3e-06,4e-06,2.4e-05,1.1e-05,5e-06,6e-06,1.4e-05,6e-06,2e-06,4e-06,7e-06,4e-06,2e-06,4e-06,4e-06,1e-06,2e-06,3e-06,1e-06,1e-06,1.6e-05,3e-06,2e-06,1e-06,1e-06,1e-06,1e-06,2e-06,1e-06,1e-06,2e-06,1e-06
1e-06,0,0,1e-06,0,0,2e-06,0,1e-06,1e-06,2e-06,1.1e-05,5e-05,6.6e-05,1.4e-05,6.8e-05,5.1e-05,3.7e-05,1.7e-05,1e-05,4.2e-05,1.6e-05,3e-06,6e-06,7.5e-05,0.000193,0.000281,7.4e-05,0.00024,5.6e-05,0.00017,5.4e-05,0.000154,1.2e-05,0.000148,0.000112,0.00016,0.000171,0.000104,0.000204,0.00021,0.000154,4.3e-05,3.9e-05,0.000227,0.000208,0.000121,0.000165,0.000127,0.000181,0.000101,0.000246,4.7e-05,1.8e-05,0.000232,0.000204,5e-05,0.000124,0.000136,0.000121,2.4e-05,1.5e-05,7e-06,1.5e-05,2.4e-05,4.1e-05,2e-06,2e-06,3e-06,6e-06,7e-06,6e-06,2e-06,1.6e-05,1.3e-05,6e-06,5e-06,6e-06,6.6e-05,4e-06,2.8e-05,7e-06,7e-06,3e-05,2.5e-05,1e-06,1e-06,7e-06,1.4e-05,3e-06,4e-06,2e-05,1.2e-05,1e-06,2e-06,1.4e-05,4e-06,2e-06,5e-06,6e-06,4e-06,1e-06,3e-06,4e-06,1e-06,1e-06,2e-06,1e-06,1e-06,1.5e-05,2e-06,1e-06,0,1e-06,1e-06,1e-06,1e-06,0,2e-06,1e-06,1e-06
