-0.000985,-0.002558,-0.003461,-0.00824,-0.008569,-0.004741,-0.006577,-0.003805,-0.001609,-0.004388,-0.007757,-0.00709,-0.003865,-0.001535,-0.001585,-0.000377,0.00014,0.000143,9.7e-05,0.000203,0.000314,-7.1e-05,-0.001353,-0.000679,-0.000864,-0.00113,-0.00055,1.4e-05,-0.000401,-0.000303,-0.00034,-2.5e-05,0.002149,0.00155,-0.009983,-0.007283,-0.012626,-0.009564,-0.00598,-0.008603,-0.015926,-0.012399,-0.009025,-0.0203,-0.0138,-0.009592,-0.007869,-0.020644,-0.01623,-0.012875,-0.01277,-0.008019,-0.010615,-0.011571,-0.006947,-0.012132,-0.014752,-0.013445,-0.015898,-0.011845,-0.013444,-0.010902,-0.011874,-0.007881,-0.005688,-0.007626,-0.010661,-0.003741,-0.006469,-0.006811,-0.00127,-0.007568,-0.007113,-0.004868,-0.010576,-0.009157,-0.006794,-0.003058,-0.001683,-0.001059,-0.001385,-0.00208,-0.001026,-0.000457,-0.000902,-0.001358,-0.004609,-0.002532,-0.001173,-0.001204,-0.001513,-0.000815,-0.001387,-0.003181,-0.001585,-0.001386,-0.000742,-0.000325,-0.000582,-4.2e-05,-0.001121,-0.001138,-0.001117,-0.001108,-6.1e-05,-0.000688,-0.000733,-0.000552,-0.000578,-0.000395,0.000203,-0.000301,-0.000449,-0.003165,-0.003067,-0.00151,-0.001092,-0.000893,-0.000188,-0.000566,-0.000429
-3.3e-05,0.000478,0.00045,0.001011,0.003667,0.002034,0.003798,0.003161,0.001545,0.000667,0.002042,0.005359,0.002916,0.001099,-0.000433,5e-05,0.000214,0.00017,0.000115,4.9e-05,0.000171,2.3e-05,0.000215,0.000332,-0.000578,0.000462,0.000335,1e-05,-0.00011,3.8e-05,6.1e-05,-9.5e-05,0.001993,0.000571,-0.001733,-0.004651,-0.005613,-0.004344,-0.004167,0.004322,-0.002849,-0.001873,-0.002123,0.002367,0.003385,-0.000848,-0.005582,3.2e-05,-5e-04,-0.003374,-0.005425,-0.005636,-0.005037,-0.008598,-0.008752,0.000583,-0.0018,-0.001433,0.009558,0.004194,-0.000837,-0.003172,-0.0039,-0.005574,-0.002405,0.000647,-0.002664,-0.00593,0.00064,-9e-06,-0.001037,-0.001677,0.000144,-0.001391,-0.000201,-0.00185,-0.000501,-0.000787,-8e-04,-0.001354,-0.000978,-0.000274,-0.001496,-0.001345,-0.000887,-0.000543,0.000493,0.001473,0.000653,-9e-06,-0.000496,-0.000277,-0.000481,-0.001207,-0.001312,-0.000842,-0.000312,0.000111,-0.000605,-0.000314,0.000349,3e-06,-0.000818,-0.001035,-0.000709,-0.001112,-0.000253,-0.000191,-0.000348,-0.000154,0.000456,-5.5e-05,-0.000133,-1.5e-05,0.000131,-0.000113,-0.000394,-0.000146,-0.000366,4.8e-05,0.000114
-0.000558,-0.000371,-3e-06,0.001599,-0.001368,-0.001012,-0.001719,-0.002029,-0.000802,-0.000687,-0.000978,-0.003171,-0.001536,-0.000333,-0.000479,-0.000179,0.000165,4e-06,8e-05,0.000154,3e-06,0.00027,0.000522,0.000268,0.000444,-0.000404,-0.000173,-0.000254,0.000411,0.000407,5.2e-05,2.3e-05,0.000249,-0.00413,-0.00741,-0.002138,0.002019,-0.002701,-9.7e-05,-0.001721,-0.000681,-0.002214,-0.002919,-0.006003,-0.010206,-0.003163,-0.000241,-0.000588,0.000674,-0.005146,-0.000105,-0.000234,0.001728,0.005136,-0.003952,-0.003024,-0.001288,-0.002973,-0.009565,-0.010501,-0.007033,-0.001552,-0.005341,-0.000303,-0.002507,0.002939,0.000647,0.003842,-0.000555,-0.001415,-0.000615,-0.000156,0.001694,0.001019,0.000538,-0.003081,-0.001898,0.000228,-0.001181,-0.00058,-8.4e-05,-0.000134,-0.000585,-0.000853,0.000186,-0.001122,-0.000209,-0.001372,-0.001712,-0.000235,-9.1e-05,-0.000228,-0.000255,0.001163,-0.00096,-0.00025,-0.000182,-2e-04,0.000505,-8e-05,-0.000796,-0.000127,0.000111,-0.000222,-0.000561,-0.000119,-0.000236,-0.000293,-0.000283,-0.000307,-0.00028,-0.00065,-0.000223,0.000338,0.000202,0.000129,-3.7e-05,-0.000186,-0.000139,-0.000102,-0.000122
-0.000241,4.8e-05,-0.000391,-0.001805,-0.000343,-0.000368,-0.000979,-0.000943,-0.000552,0.000151,-0.001874,-0.000119,0.000102,0.00017,-0.00023,-0.000287,-3.6e-05,0.000116,-4.5e-05,-2.2e-05,-8.1e-05,-0.000158,-0.000438,-0.000594,-0.000225,-0.00025,0.000155,-0.000177,-0.000434,-0.000225,-7e-05,-2e-04,-0.000555,-0.002796,0.002469,0.002285,-0.000388,-0.000417,0.001263,-0.001977,-0.00183,0.000977,-0.001045,0.002254,0.004872,0.002775,0.005181,0.003305,0.001389,0.003741,0.000743,-0.001453,0.000957,0.002717,0.000271,0.002215,-0.000664,0.001644,0.003376,0.006266,0.004162,-7.6e-05,0.002946,0.002343,0.003133,-0.001017,-0.003727,-0.00579,-0.000709,-0.00197,-2.9e-05,-0.002574,-0.001678,-0.001413,-0.000999,0.004237,0.003286,-0.000102,-0.001312,-0.000109,-7.1e-05,7.7e-05,0.000138,0.000398,0.000457,0.000477,0.000402,0.001348,0.000861,-0.000268,0.000323,-5e-05,-0.000372,-0.000408,-5.4e-05,-8.7e-05,-0.000115,-0.00045,-0.000268,-0.000344,7.7e-05,0.000308,-0.000306,6.4e-05,-0.000251,0.000131,0.000201,0.000164,0.000112,0.000104,-0.000186,-0.000345,-0.000314,-0.00038,0.000181,-0.00041,0.000142,0.000117,0.000113,-4.6e-05,-4.8e-05
0.000263,5.3e-05,0.000561,8.8e-05,0.00072,0.000179,-3.5e-05,-0.000227,-0.00026,-5.5e-05,0.001057,-0.00057,-0.000359,0.00021,0.000685,3e-06,-0.000298,-0.00015,0.000141,5.6e-05,-7.8e-05,0.000198,0.000153,0.000161,7e-05,-0.000161,-9e-06,-0.000118,8e-06,5.8e-05,7e-06,0.000116,0.000333,0.00103,-0.000494,-0.00086,0.001458,0.001922,0.00151,0.00205,-0.000694,0.000748,0.000607,0.002237,-0.002027,-0.006715,-0.001367,-0.001967,-0.000684,0.002952,-0.000542,0.003984,0.00339,0.000478,0.00423,0.002449,-0.000282,0.001182,-0.00402,-0.003125,-0.002091,0.000897,0.001588,-0.001623,0.001289,0.001007,0.006201,0.003981,-0.000595,-0.002592,-0.000919,0.002013,0.001498,0.001179,0.000596,-0.001133,-0.000586,-0.000243,-0.000684,-0.000754,0.000519,0.000134,0.001009,-0.000383,-0.000677,-0.000235,-0.000613,-0.001238,-0.000877,-0.000303,-0.000724,-0.000353,0.000271,0.000399,0.000441,4.3e-05,0.000686,0.000354,-7.2e-05,-0.000224,-0.000223,-3.1e-05,0.000552,2.7e-05,8.2e-05,-0.000206,-0.000257,-0.000118,0.000329,0.000138,0.000111,-0.000676,0.000167,-0.000216,-0.000353,2e-05,0.000114,0.000187,2.8e-05,-7.7e-05,2.7e-05
0.000146,0.000192,-0.000596,-7.8e-05,-0.000525,-0.001049,-5.1e-05,-0.000525,-0.000539,-0.000225,-0.000155,-0.000692,-0.000486,-0.000166,-5.9e-05,0.000284,-7.5e-05,-0.000229,-1.5e-05,-4.3e-05,-3.6e-05,9.9e-05,-0.000104,-7.1e-05,-0.000155,0.000205,9.9e-05,-8e-06,-2.7e-05,0.000264,1.5e-05,-0.000179,7e-05,-0.000817,-0.003801,-0.00125,-0.000662,0.002006,-0.002153,0.001176,-0.003347,-0.003127,0.001856,-0.001751,-0.002956,0.00046,-0.00122,-0.001494,-0.00142,-6.8e-05,0.0029,-0.001759,-0.000872,-0.001928,-0.005393,0.000153,-0.000307,-0.000984,0.003874,0.00096,0.003757,0.000792,0.001034,-0.000111,-0.001545,-0.003802,-0.002141,-0.000106,-0.000621,0.002109,-0.000374,-0.000315,-0.000989,-0.001033,0.001467,0.000991,-0.000322,-0.000289,-0.001074,-0.001265,7.8e-05,-0.000232,-6.3e-05,-0.000546,-4.7e-05,9e-05,-0.000448,0.000738,0.000401,0.000699,0.000219,3.2e-05,-0.000203,-3.6e-05,0.000177,5.5e-05,-0.000341,-0.000235,-0.000262,-0.000216,-3.3e-05,-0.000251,-0.000333,0.000228,0.000461,-9.6e-05,-0.000125,-4.8e-05,-0.000125,-0.000152,-0.000263,9.7e-05,0.000208,0.000433,-0.000118,7.4e-05,0.000158,0.000156,1.9e-05,-0.000115,5.8e-05
-4.3e-05,-4.1e-05,2e-06,-0.000236,0.00054,0.000521,1.9e-05,0.00046,0.000437,0.000323,-5.8e-05,-5.5e-05,0.000755,0.000266,-0.000173,-0.000224,-0.00022,-0.00019,-4.1e-05,-7.1e-05,-9.9e-05,2e-06,-3.6e-05,-0.00012,0.000184,9.8e-05,-0.000168,-0.000122,-8.5e-05,-0.000152,-9.8e-05,-9e-05,2e-05,0.000295,-0.001908,0.000756,-0.001081,-0.006234,-0.00319,0.000648,0.001671,0.00052,0.000746,-0.000593,-0.000202,-0.003373,0.000886,8.8e-05,-0.000965,-8.4e-05,-0.000264,0.000552,-4.4e-05,-0.001051,-0.000557,-0.001001,0.00206,0.001101,9.8e-05,-0.000275,-0.000654,0.001302,-0.000552,0.003282,-0.000782,0.001221,0.000679,0.00055,0.002011,0.001369,0.000652,0.000138,0.001298,0.000608,0.000547,-1e-04,-0.000192,0.000742,0.00055,-0.000535,-0.000454,-0.000244,0.000105,0.00024,0.000241,-0.000206,-0.000548,-0.000704,-0.000642,-0.000226,-7.9e-05,0.000281,0.000226,0.000539,-0.000219,0.000265,-6.6e-05,-2.5e-05,0.000145,8.5e-05,9.7e-05,-0.000283,-6.1e-05,1.9e-05,5.8e-05,7.2e-05,0.000104,-0.000126,4.2e-05,-9.1e-05,-0.000141,0.000377,0.000121,-0.000229,0.000163,9.3e-05,-0.000132,7e-06,7.6e-05,-3e-05,9.3e-05
-4.9e-05,-0.000148,2.1e-05,0.001127,0.000481,6.4e-05,0.000352,0.000483,-8.4e-05,-0.000314,-0.000392,0.00066,-9.9e-05,0.00015,0.000329,0.000194,-0.000151,-0.000141,-4.5e-05,-3.8e-05,-8.1e-05,-0.000107,4e-06,-3.6e-05,6e-05,7e-06,8.9e-05,-2e-06,-0.000271,7.6e-05,-5.2e-05,-1.9e-05,4.5e-05,0.000108,0.001054,0.001691,0.00016,0.002019,0.001186,-0.000262,0.000588,0.003384,0.001135,0.00101,-0.002117,-0.001445,-0.000439,-0.000354,0.002491,-0.001399,-0.000915,0.001752,-0.000502,0.000176,0.001381,-0.001775,-0.000749,0.000477,-0.000585,0.001355,0.00135,-0.000769,-0.000795,-0.00187,0.000888,0.001001,0.001015,-0.000794,-0.000231,-0.000735,0.000374,0.000163,-0.001314,-0.000657,1e-05,0.000131,0.000746,-0.000414,6e-04,0.000471,-0.000365,-0.000187,-0.000196,4.8e-05,0.00026,-7.3e-05,0.000552,0.000196,0.000831,0.000209,-0.000115,3.3e-05,-9.8e-05,-0.000319,0.000174,0.000277,4.3e-05,-4.3e-05,-5.9e-05,0.000463,0.000152,5.8e-05,-0.000113,9.5e-05,3.6e-05,0.000367,-5.3e-05,-7.4e-05,-0.000133,0.00011,-5.1e-05,0.000247,-0.000324,7.1e-05,2.1e-05,0.000113,-4e-06,-0.000233,-7.5e-05,9.1e-05,9.6e-05
6e-06,0.000165,0.000326,-0.000773,-0.000325,-0.000158,-0.000353,-0.000573,0.000118,7.6e-05,0.00027,-0.000447,1.5e-05,-0.000362,-0.00019,-5.5e-05,-0.000121,-0.00018,-2.1e-05,-6.3e-05,-0.000144,-4.4e-05,-0.000101,-0.000155,-1.8e-05,-3.3e-05,-0.000127,-0.000125,-0.000111,-0.000102,3.6e-05,-2.2e-05,4.6e-05,-0.000514,0.001568,-0.00046,0.001595,0.000969,-0.000763,-0.001992,-0.001496,-0.002115,-0.001649,-0.000439,0.001096,0.002546,0.000646,0.000266,-0.000454,0.001259,-0.000288,-0.000579,0.000865,0.0018,0.00094,-0.000846,0.00112,0.001913,-0.000779,0.000836,-0.000769,0.001463,-0.000437,-0.000932,0.001138,0.000497,-0.003131,-0.001407,-0.000115,0.000411,0.000959,0.000128,0.000344,-0.000576,-0.001381,-0.000302,-0.000657,9.5e-05,0.000172,0.000875,0.000486,0.000127,-0.000349,-6.5e-05,1.7e-05,0.000726,0.000122,0.000122,-0.000384,-0.000577,0.00011,7.5e-05,0.000143,3.6e-05,-0.000298,-2.6e-05,0.000138,8.8e-05,9.6e-05,-0.000211,6.1e-05,2e-06,0.00026,-0.000352,-9.9e-05,-6.6e-05,2.3e-05,-5.5e-05,-0.000118,-1.5e-05,-2e-06,-4.8e-05,1.3e-05,-2.8e-05,8e-06,-0.000105,-0.000195,1.3e-05,-8.1e-05,-5e-06,5.8e-05
6.8e-05,-6.6e-05,-5e-05,-9.7e-05,-0.000245,0.000283,0.000528,0.000357,-5.1e-05,0.000486,8.9e-05,0.000397,0.000209,0.000168,3.4e-05,-5.9e-05,9.4e-05,6.1e-05,-2e-05,-1e-05,1.8e-05,-5.3e-05,-5.3e-05,-1.3e-05,-5.1e-05,-6e-05,3.1e-05,-3.4e-05,3.4e-05,-0.000106,-0.000214,-3e-06,-0.000237,9.3e-05,0.000952,0.000269,-0.000304,0.000419,0.001115,-5.1e-05,-2.6e-05,0.00049,0.001744,0.000174,0.000251,0.002609,-0.00067,0.000544,-0.00154,0.000903,8.2e-05,-0.000129,-0.002069,-0.000926,-0.000538,0.000405,-0.000682,-0.001439,-0.000215,0.000161,-0.000274,-0.000519,0.00014,-0.000852,-0.000271,-0.000655,-0.000576,0.00224,0.000351,1.5e-05,0.00053,4.2e-05,0.00063,-6.1e-05,-4.7e-05,0.000181,0.000376,-0.000366,5.4e-05,-0.000193,-8.9e-05,-0.000315,0.00012,-0.000299,0.000159,-0.000551,0.000228,3.4e-05,0.000352,0.000317,-3.3e-05,0.000159,0.000139,8.2e-05,3.9e-05,-0.000261,-4.7e-05,-0.000276,-4.1e-05,0.000101,0.000115,0.000162,-1e-05,0.000117,0.000164,5.2e-05,1e-06,-5.4e-05,3.5e-05,-5.2e-05,0.000125,0.000101,-0.000139,9.8e-05,0.00013,9.3e-05,5.9e-05,3.3e-05,-3.6e-05,-0.000107,4.1e-05
-1e-06,6.8e-05,-0.000161,0.00043,0.000149,0.000163,-9.2e-05,-1.5e-05,-0.000134,-3.8e-05,-9.4e-05,-0.000298,-0.000241,-0.000139,-3.1e-05,4e-05,0.000117,-3e-06,-8e-06,-5.1e-05,3.6e-05,-2.5e-05,-2.1e-05,-9e-06,6.8e-05,-3e-05,0.000104,4e-05,-1e-06,-4.6e-05,0.000129,-2e-06,4e-06,0.000106,-0.000604,0.001686,-0.000175,0.000382,0.000523,-0.000578,-0.001209,0.000765,-0.001388,-0.000381,-0.000119,-0.000606,0.001079,2.8e-05,-0.001356,-0.000163,0.000859,0.000849,0.001248,-1.2e-05,0.000561,-7.7e-05,-0.000261,-0.001557,-0.000903,-0.000376,2.5e-05,-0.000863,0.000233,0.000615,0.001701,-0.000749,0.001209,7e-06,-0.000895,-0.000752,-0.001105,-0.000757,-0.001021,-0.000169,0.001717,0.000338,-0.00036,-0.000555,-0.000205,0.000391,-0.000162,0.000407,0.000217,8.7e-05,5.7e-05,-0.000206,-0.000124,0.000119,-0.000416,-0.000441,-0.000191,-4.3e-05,-0.000141,-8.4e-05,6.3e-05,0.000218,9e-06,0.000119,1.9e-05,6.1e-05,-0.000125,4.9e-05,7.5e-05,7.2e-05,-0.000112,-0.000251,3.4e-05,-8e-05,-5.6e-05,1.9e-05,5.8e-05,2.6e-05,5e-05,5.2e-05,-0.000118,-7.4e-05,-4.2e-05,2.7e-05,4.4e-05,6.4e-05,-5.8e-05
-9e-06,-1.2e-05,2e-06,-1.2e-05,-0.00026,-0.000237,-0.000202,-4.3e-05,1.7e-05,0.000242,2.2e-05,6.8e-05,-0.000174,0.000278,-0.000152,-7e-05,-5e-06,1.8e-05,-2.3e-05,-1.6e-05,-3.8e-05,-1.6e-05,1.9e-05,2.1e-05,-6e-06,-0.000128,-5.2e-05,5.7e-05,3.3e-05,1.6e-05,-5.9e-05,-1.2e-05,2.7e-05,-0.000148,-0.000277,0.000279,0.00041,-0.000422,-0.001343,-0.000231,0.000205,-1.2e-05,0.000378,-0.000784,-0.000747,-0.000883,-0.000384,-0.001157,0.000252,-0.000109,0.000407,-0.000853,0.000641,-0.000991,-0.000241,0.000254,-0.000754,0.001695,0.001377,-0.000507,-0.000178,-0.000884,-2.3e-05,0.000235,-4e-04,0.000319,0.000483,-0.000381,0.000545,0.00025,-0.000111,0.000386,-0.00037,1.8e-05,-0.001281,0.000537,0.000215,0.00051,8.3e-05,0.000121,-0.000223,0.000143,-0.000104,0.000278,-4.2e-05,0.000104,-0.00021,-8.4e-05,0.000269,5e-05,3.1e-05,0,1.2e-05,-0.000143,-1e-05,-0.000222,3e-05,0.000124,1.2e-05,1.7e-05,-9.7e-05,-6.7e-05,-7.8e-05,1.3e-05,8.5e-05,-7.7e-05,5.7e-05,0.000157,-4e-06,-2.2e-05,-5.2e-05,9.9e-05,-2e-06,-1.1e-05,-8e-06,9.6e-05,4.6e-05,-5.7e-05,4.4e-05,-6e-06,-0.000107
-1.1e-05,-1e-05,1.5e-05,-0.000129,0.00024,7.5e-05,0.000372,-6.5e-05,0.000112,-0.000185,-1.4e-05,5.6e-05,6.9e-05,-8.8e-05,8.9e-05,2.5e-05,-0.000129,2e-06,-4e-05,-1.9e-05,1e-06,-1e-06,-2.1e-05,1.2e-05,-8.9e-05,2.6e-05,-4.6e-05,-6e-06,-1.7e-05,-1.7e-05,1.7e-05,-2.7e-05,-2.4e-05,8.6e-05,-0.000588,-9.1e-05,5.5e-05,-0.000482,0.000592,0.000668,4e-05,-0.001366,-0.002215,-5.4e-05,0.000643,-0.000138,0.00129,0.000634,-0.000254,0.000724,-0.000737,-0.000177,-0.000168,-0.000163,-1.1e-05,0.000701,8.6e-05,3.2e-05,-0.000988,-0.000275,0.00025,0.001405,0.000669,-0.000205,-0.000738,4.3e-05,-1.5e-05,-9.2e-05,0.000149,-0.000481,-0.000187,-0.000245,0.000388,0.000184,6.8e-05,-3e-06,-2.9e-05,0.000147,0.00015,-0.000345,0.00018,-9.7e-05,-4.1e-05,-3.2e-05,3.1e-05,7.7e-05,8.5e-05,8.1e-05,-5.1e-05,-4.7e-05,-8.6e-05,-8e-05,-9.2e-05,5e-06,4.3e-05,-5.5e-05,-5.4e-05,-5.7e-05,-4.9e-05,-3.5e-05,-1.7e-05,-4e-06,7.5e-05,0.000156,-3.2e-05,9.8e-05,-9.3e-05,0.000101,8.9e-05,3.1e-05,-3.5e-05,5.9e-05,0.000176,-4.2e-05,1.6e-05,-0.000246,5.4e-05,-8e-06,-4e-06,-8e-06,-4.3e-05
2.5e-05,0,3.5e-05,-0.000132,-6.9e-05,0.000135,-0.000338,4e-05,-4.7e-05,8.2e-05,-0.000108,4e-06,-5.9e-05,-4.7e-05,-0.00017,-4.1e-05,-2.1e-05,5.4e-05,-9e-06,2.9e-05,-1.1e-05,-8e-06,4e-06,-7e-06,-1.2e-05,-1e-06,9e-06,1.2e-05,1e-05,-6.6e-05,-9e-06,3.2e-05,-2.6e-05,5e-06,1.2e-05,-0.001089,-0.00042,-8.6e-05,0.000122,-0.000339,0.000211,0.000398,2.8e-05,0.000308,-2.3e-05,0.000898,6.1e-05,-0.000369,0.000393,-0.000456,0.00023,0.000304,-0.000751,-0.000338,0.000712,-0.000535,-0.000238,-0.000138,0.001082,0.000187,-0.000172,-0.001052,-0.00065,-0.000683,-0.000492,-0.000139,-0.000241,-0.000374,0.000376,0.000328,0.000251,0.000411,-9.6e-05,0.000109,-1e-05,-0.000494,0.000183,0.000248,-0.000339,0.000135,0.000219,-2e-06,-3.6e-05,0.000138,-0.000104,-0.000105,-7.7e-05,1.4e-05,-6.2e-05,0.000156,0.000122,-1.5e-05,-5.9e-05,-9e-06,-5.2e-05,6.1e-05,-6.4e-05,2.7e-05,5.8e-05,-1.2e-05,0.000106,2e-06,-4.3e-05,-0.000115,-2.8e-05,5.8e-05,-8.1e-05,-4.7e-05,1.3e-05,3e-05,3.9e-05,-0.000125,3.8e-05,-0.000134,-4.1e-05,0.00018,-1e-05,-3.4e-05,-3.1e-05,4e-06,-2e-05
-1.3e-05,-2.4e-05,1.3e-05,0.000137,-6.1e-05,-0.000175,9.3e-05,-6.2e-05,-2.1e-05,-0.000202,-4.7e-05,4.9e-05,2e-06,0.000109,-4e-06,2.4e-05,2e-06,-2.7e-05,-1.7e-05,-8e-06,1.6e-05,2.2e-05,-5e-06,-1e-06,8e-06,-3.2e-05,-6e-06,-3.5e-05,2e-06,3e-05,9e-06,-2.9e-05,-3.2e-05,-8.3e-05,0.000516,-0.001002,-0.000611,0.000176,-0.000362,9.8e-05,0.00025,-9.7e-05,0.000128,0.000446,-0.000484,9e-06,-0.000529,-0.000411,0.000574,-0.000958,0.000359,-0.000176,0.000491,0.000237,-0.000242,0.000237,0.000273,0.000339,-6.5e-05,0.000248,0.000131,0.000351,0.000275,0.000347,-0.000139,0.000124,0.000256,-4.8e-05,-0.000773,5.6e-05,-0.000156,-0.000279,0.000301,-4e-04,-3.7e-05,0.000307,-6.7e-05,-0.000384,0.000112,-9e-05,6.7e-05,0.000136,1.2e-05,-6.9e-05,-2e-06,1e-06,3.6e-05,-3.1e-05,0.000132,2.9e-05,-5.1e-05,-1.1e-05,1.5e-05,9e-06,0.000153,-6.2e-05,-4.8e-05,-2.8e-05,-1e-06,-4.1e-05,-8.1e-05,-2.8e-05,1.5e-05,-4e-06,-3.6e-05,-0.000123,-1.6e-05,7e-06,-1.5e-05,1.3e-05,-1.9e-05,-8e-06,-1e-06,1.6e-05,4.2e-05,1.2e-05,9e-05,3.7e-05,1e-06,1e-06,1.4e-05
5e-06,1.9e-05,-4.5e-05,-5.1e-05,5.5e-05,4e-05,-7.6e-05,4.2e-05,-5.1e-05,-0.000216,-4e-05,-7.7e-05,-4e-06,-3.5e-05,2.8e-05,-2e-06,3.6e-05,-2e-05,-1.2e-05,1.3e-05,-3e-06,2e-05,5e-06,4e-06,-4.8e-05,3e-06,-2.7e-05,-1.3e-05,3e-06,3.1e-05,3e-06,1.4e-05,1.2e-05,8.3e-05,0.00023,0.000199,-1.6e-05,-0.000298,0.000456,3.2e-05,-0.000352,0.000238,-0.000613,-0.000162,-2.4e-05,3.2e-05,-0.000537,5.4e-05,-0.000386,0.000142,6e-06,0.000217,-0.000581,0.000532,-0.000483,-9.2e-05,-0.000135,-6e-06,-0.000605,0.000256,0.000309,-9.8e-05,-0.000147,0.000247,-0.000147,-0.00021,5.4e-05,-3.8e-05,-0.000118,-0.000291,0.000233,0.000228,8.5e-05,9e-06,0.000134,-5e-06,-8.4e-05,1.7e-05,0.000119,9e-06,0.000126,3.4e-05,5.2e-05,-6e-06,-3.5e-05,9.7e-05,0.000103,8e-06,-0.000133,-2.4e-05,3.7e-05,2.4e-05,-3e-06,4e-06,-0.00011,-2.6e-05,1.7e-05,4.5e-05,-2.9e-05,-2.1e-05,-1.1e-05,-1.5e-05,-3e-06,-5.6e-05,-3.6e-05,3.9e-05,3e-05,1.7e-05,2.7e-05,-2.1e-05,1.6e-05,3.6e-05,-8e-06,-1.5e-05,-8e-06,-1.5e-05,-9.8e-05,1.4e-05,2e-06,0,2.2e-05
4e-06,-3e-06,9e-06,-6e-06,-7e-06,7.2e-05,-2.7e-05,1.7e-05,2.6e-05,0.00012,4.1e-05,8e-06,1e-05,-0.000145,-7e-06,-9e-06,2e-06,-3.8e-05,5e-06,-5e-06,2e-06,-5e-06,-5e-06,1e-05,2.4e-05,1e-06,1.8e-05,1.2e-05,-2.8e-05,-2e-06,-2e-05,-2e-06,1.6e-05,-3e-06,-0.000128,0.000306,-0.000215,-4.5e-05,-0.000297,0.000319,-0.000168,0.000161,0.00045,6.1e-05,0.000256,0.000283,0.000121,0.000207,-0.000172,-0.000327,0.000141,0.000128,0.000198,6e-05,0.000545,0.000141,-0.000144,0.000167,0.000778,-0.000435,0.000234,0.000302,3.3e-05,-2.7e-05,0.000206,-0.000178,-0.000127,0.000219,0.000207,0.000262,-9.8e-05,-0.000118,-0.000161,-5.7e-05,-0.00028,-0.000164,-0.000183,-9.2e-05,0.000132,8.7e-05,-4.7e-05,-0.000137,-4.3e-05,3e-05,-3.5e-05,-1.1e-05,1.4e-05,0,4.4e-05,-3.1e-05,-3e-05,-2e-05,-1e-06,2.6e-05,4.1e-05,3e-05,-1e-06,0,-3e-06,7.4e-05,2.4e-05,4e-05,6e-06,2.2e-05,2.8e-05,1.5e-05,4.1e-05,-3e-06,-2e-05,2e-06,-4e-06,-2.7e-05,-1.2e-05,1.9e-05,-1.1e-05,-3.7e-05,4.2e-05,-1.7e-05,2e-06,2e-06,1e-06
-2e-06,-9e-06,-3e-06,1.1e-05,5.5e-05,2.8e-05,2.2e-05,-5.2e-05,7e-06,-7.3e-05,-4.3e-05,-3.8e-05,-3.1e-05,2.8e-05,1.1e-05,1.7e-05,-3.3e-05,0,1.5e-05,3e-06,-5e-06,-8e-06,-4e-06,0,1.1e-05,2.3e-05,1.9e-05,1.9e-05,1.1e-05,-1e-06,3e-06,1e-06,3e-06,-5.5e-05,-0.000292,-0.000114,-0.000269,0.000288,-0.000119,-0.000199,0.000186,2.1e-05,0.000476,-1e-05,-6.7e-05,9.7e-05,0.000568,-0.00013,-0.000166,-0.000459,-0.000516,-0.000117,0.000197,9.5e-05,9.4e-05,-0.000356,-8e-05,-7.9e-05,-5.9e-05,0.000209,-9.6e-05,-0.000213,4.8e-05,-0.000204,6e-06,0.000114,-3.3e-05,2.8e-05,0.000198,-0.000115,-1e-05,1e-04,0.000121,8.2e-05,5.3e-05,-3.1e-05,-1e-05,0.000192,-6.1e-05,-2.6e-05,-7.9e-05,5e-06,-6e-06,-1e-06,1.9e-05,-5.7e-05,-6.4e-05,5.5e-05,-6e-06,6.9e-05,8e-06,-2.9e-05,-4.1e-05,1.8e-05,3e-06,3.1e-05,-1.9e-05,-4.6e-05,-1e-05,-4.1e-05,-8e-06,-1.3e-05,-9e-06,7e-06,-2.8e-05,2.5e-05,2e-06,-3.2e-05,-7e-06,0,3.2e-05,-2.8e-05,-2.7e-05,8e-06,2.3e-05,5.9e-05,-3.1e-05,4e-05,7e-06,1.5e-05,4e-06
1e-06,1.3e-05,-8e-06,-2.6e-05,8e-06,-5.7e-05,-2.7e-05,2.2e-05,1.4e-05,3.6e-05,1.1e-05,6e-05,4e-05,2.7e-05,-9e-06,-1.3e-05,2.2e-05,1.5e-05,-2e-06,-6e-06,9e-06,-4e-06,-7e-06,0,-2.1e-05,3e-06,-1.4e-05,-2.6e-05,-7e-06,4e-06,8e-06,-9e-06,4e-06,4e-05,-0.000199,-0.000488,-6e-05,6.9e-05,0.000113,3.5e-05,0.000202,-0.000524,0.000266,7.7e-05,-6.9e-05,-0.00033,-4.5e-05,-4.5e-05,0.000134,-1.9e-05,0.000314,-0.000208,3.8e-05,-0.000185,-0.000404,-5e-06,0.000241,0.000183,0.000117,-0.00023,7e-06,5e-05,4.4e-05,-0.000108,-7e-05,2e-06,-0.000234,-3.2e-05,-5.6e-05,-8.7e-05,-0.000104,-1e-06,-5.1e-05,1.2e-05,-2e-06,6.4e-05,3e-05,-4.1e-05,-3e-06,2.4e-05,-6.1e-05,5.6e-05,3.5e-05,1.9e-05,-2.8e-05,7.6e-05,-3.9e-05,-6.7e-05,9e-06,-6e-05,-1.3e-05,5e-06,1.2e-05,0,1.9e-05,3.8e-05,2.6e-05,2.6e-05,2.4e-05,-8e-06,-4e-06,-1.1e-05,-1e-06,9e-06,0,9e-06,-2.4e-05,1.8e-05,-9e-06,-7e-06,-1.1e-05,-2.3e-05,-2e-05,1.2e-05,-2e-05,-3.8e-05,-7e-06,-4e-06,-2e-06,-1.1e-05,8e-06
5e-06,-1.1e-05,-8e-06,1.3e-05,-5.7e-05,-1e-06,4e-05,6e-06,-3.4e-05,-2.6e-05,-2e-06,-4.4e-05,1.1e-05,-4.3e-05,2.8e-05,7e-06,-2e-05,1.4e-05,-1e-06,2e-06,1e-06,-8e-06,-1e-06,5e-06,1.8e-05,-2.1e-05,-9e-06,1.8e-05,1e-06,0,-2.5e-05,3e-06,-2e-06,1e-06,2.6e-05,3.1e-05,0.000135,-0.000208,0.000175,-0.00014,-2.1e-05,-0.000109,6.8e-05,-2.4e-05,-0.000153,-8.4e-05,-4.8e-05,6.1e-05,5.5e-05,9.1e-05,6.6e-05,0.000268,-0.000136,-0.000244,0.000149,0.000183,6.8e-05,-0.000405,-0.000162,7.3e-05,6.8e-05,0.000114,-2e-06,0.000152,-6e-05,3.7e-05,0.000183,-1.4e-05,-3.2e-05,0.000117,0.00021,-5.9e-05,-8e-05,8.7e-05,0.000161,-3e-06,-6e-06,4e-06,-8.1e-05,-2e-05,3.6e-05,-2.2e-05,-6e-06,-1.3e-05,2.1e-05,4e-06,-9e-06,2.5e-05,-1.6e-05,-1.1e-05,1.5e-05,-7e-06,-1.1e-05,-3e-06,-2.1e-05,-3e-05,-1.4e-05,-2.1e-05,2.1e-05,-1.2e-05,3e-06,-1.7e-05,8e-06,-1.9e-05,2e-06,-2.8e-05,-3e-06,-2.3e-05,1e-06,1.7e-05,-1.4e-05,4e-06,-7e-06,1e-05,5e-06,2e-06,2.8e-05,-2e-06,-6e-06,-6e-06,0
-3e-06,-2e-06,2e-05,1.8e-05,1.3e-05,2e-06,-3.4e-05,-5e-06,-1.4e-05,-4e-06,1.8e-05,8e-06,-4.6e-05,3.2e-05,-2.1e-05,-3e-06,-1.3e-05,9e-06,-1e-06,-4e-06,-1e-05,-1.1e-05,2e-06,3e-06,-9e-06,-1e-06,1e-05,-1.6e-05,1e-06,-1.6e-05,2.2e-05,0,-1e-06,-2.6e-05,0.000174,-1.9e-05,-0.000181,1.3e-05,-7e-05,9.4e-05,-0.000178,0.000516,0.000179,-2.7e-05,-2.5e-05,0.000303,1e-05,6.8e-05,3.3e-05,0.000115,-1.7e-05,-2.2e-05,0.00013,6.9e-05,0.000242,0.00021,3.6e-05,0.000215,-5e-06,3.8e-05,3.2e-05,0.000155,-7.3e-05,0.000163,6.7e-05,2e-06,-4.4e-05,-4.8e-05,-0.000176,-3.8e-05,-1.8e-05,6.2e-05,6.5e-05,-6.8e-05,-9.3e-05,-5.5e-05,5.4e-05,-0.000102,-2e-05,1e-05,-3.3e-05,4.6e-05,-3.7e-05,-3e-06,-1.3e-05,-6.2e-05,2.1e-05,2.2e-05,-5e-06,-4e-05,-5e-06,1.4e-05,-1.3e-05,-1e-06,2.2e-05,-6e-06,0,0,-1.4e-05,1.3e-05,1.3e-05,-2e-06,-5e-06,-1.7e-05,1.2e-05,-1.1e-05,-1.1e-05,2e-06,3e-06,-4e-06,-2e-06,-6e-06,4.3e-05,-1e-06,1.2e-05,-8e-06,-1.2e-05,-1.8e-05,-4e-06,8e-06,2e-06
0,6e-06,-2e-06,-1e-05,3.3e-05,1.6e-05,4.8e-05,3e-06,1.7e-05,-2.2e-05,-1.5e-05,-4e-06,1.3e-05,5.5e-05,9e-06,2e-06,2e-06,-7e-06,-5e-06,3e-06,6e-06,1e-06,0,0,0,5e-06,-2e-06,8e-06,-8e-06,-3e-06,-1.8e-05,-3e-06,-2e-06,3e-05,0.000123,0.000223,0.000183,0.000145,7.2e-05,-1e-05,-0.00014,-8.3e-05,-0.000236,-8.7e-05,0.000116,0.000199,-0.000233,2.6e-05,1e-05,-0.000112,-8.2e-05,-1e-05,-4.3e-05,-7.1e-05,-0.000305,-1.1e-05,-5.9e-05,-2.5e-05,0.000194,-5e-06,1.5e-05,-0.000316,-4.7e-05,-0.000156,-0.000179,6.9e-05,0.000114,-6.5e-05,0.000114,8.1e-05,-2.5e-05,-7.1e-05,-6.4e-05,-5.5e-05,-6.1e-05,-1.3e-05,-3.1e-05,-1.3e-05,5e-05,2.1e-05,1.9e-05,-1.9e-05,3e-06,2e-05,2e-06,1e-05,3.5e-05,-4.6e-05,1.8e-05,3.9e-05,-2e-06,9e-06,-7e-06,6e-06,3e-06,-1e-06,7e-06,2e-05,-1.4e-05,-2e-06,3e-06,5e-06,0,2.8e-05,-5e-06,9e-06,4e-06,1.4e-05,1e-05,4e-06,1.2e-05,-2.8e-05,1.6e-05,-1e-06,-1.4e-05,3.6e-05,3e-06,0,1e-05,1e-06,2e-06
4e-06,-3e-06,1e-06,-1.8e-05,-4.4e-05,4.7e-05,-2.3e-05,1.1e-05,1.7e-05,1.5e-05,-1.3e-05,-2.3e-05,-1e-05,-6.7e-05,-9e-06,-1e-06,9e-06,-1e-05,-4e-06,-3e-06,0,6e-06,-4e-06,-1e-06,8e-06,-1.3e-05,-1.3e-05,-1.9e-05,3e-06,-1.3e-05,1.6e-05,3e-06,-1e-06,-1.1e-05,-2.6e-05,-1.8e-05,6.2e-05,1.6e-05,-0.000185,-1.1e-05,0,4.8e-05,0.000124,3.1e-05,-6.9e-05,-0.000127,7.1e-05,-5.9e-05,-0.000184,-9e-05,-2.8e-05,7e-05,-4.3e-05,0.000222,2.2e-05,-0.000114,-4.9e-05,-0.000108,-0.000144,2.2e-05,-0.000103,0.000259,5.5e-05,-0.000104,5.6e-05,-1.3e-05,-5e-06,-3.9e-05,8.1e-05,-1.9e-05,-3.3e-05,7.2e-05,-4.2e-05,-7.3e-05,0.000109,-7.8e-05,2.2e-05,4.1e-05,2.4e-05,-5e-05,2.1e-05,4e-06,7e-06,9e-06,3e-06,2.5e-05,1.4e-05,3.2e-05,3e-06,-8e-06,-1.1e-05,3e-06,1.2e-05,-4e-06,2e-06,-5e-06,2e-06,-1.2e-05,3e-06,2.2e-05,-1.4e-05,1.4e-05,-5e-06,-1.9e-05,8e-06,1.9e-05,6e-06,-6e-06,0,-4e-06,-5e-06,-3e-05,4e-06,0,1e-05,-2.8e-05,4e-06,0,0,-2e-06,-1e-06
0,5e-06,-9e-06,1.4e-05,1e-05,-5.9e-05,-9e-06,-3.7e-05,-1.9e-05,1e-06,1e-06,2.7e-05,8e-06,2.3e-05,-1.2e-05,-1e-06,1.2e-05,-1.7e-05,2e-06,3e-06,3e-06,8e-06,-1e-06,-1e-06,-1.1e-05,0,7e-06,1e-05,0,-5e-06,-1.5e-05,-4e-06,1e-06,-1.7e-05,-0.000162,-0.00014,3e-05,-4.7e-05,2.9e-05,-2.5e-05,0.000166,-0.000113,-0.000407,1.3e-05,-0.000107,-6.5e-05,8e-06,4.3e-05,-8.6e-05,0.000195,2.9e-05,-7e-05,-7e-05,3.9e-05,0.000156,1.2e-05,3.4e-05,0.000158,-0.000163,1.8e-05,3e-06,-1.8e-05,-4.2e-05,3.9e-05,0.000136,-5.2e-05,1.8e-05,0.000131,-2.9e-05,-8.8e-05,3.9e-05,-9e-05,6.5e-05,2.4e-05,-3.3e-05,-1e-05,1e-05,7.9e-05,1.9e-05,3.2e-05,3.2e-05,4e-06,1e-05,1.3e-05,2e-06,-5e-06,-1.3e-05,-7e-06,-2.7e-05,5e-06,8e-06,2e-06,-2e-06,-8e-06,1.5e-05,3e-05,-4e-06,-4e-06,9e-06,-1.5e-05,1e-06,8e-06,3e-06,1.3e-05,5e-06,-6e-06,4e-06,1e-06,1.1e-05,-4e-06,-7e-06,1e-06,-1e-06,3e-06,-1e-06,2e-06,8e-06,9e-06,-6e-06,0,-4e-06
-1e-06,-4e-06,3e-06,1.3e-05,6e-06,-1.3e-05,1e-05,3.5e-05,-5e-06,1.8e-05,-5e-06,-1.8e-05,6e-06,-1e-05,-8e-06,1e-06,-2e-06,-1e-06,0,-3e-06,-3e-06,1e-06,1e-06,3e-06,9e-06,2e-06,1.2e-05,-9e-06,-4e-06,1.2e-05,9e-06,2e-06,0,2.4e-05,-0.00011,0.000156,2.2e-05,-8e-06,8.7e-05,1.7e-05,5.8e-05,6.3e-05,-2.9e-05,3.3e-05,7.6e-05,3e-06,-0.000258,6.4e-05,7.8e-05,2e-05,0.00011,-6.9e-05,0.000137,4e-05,-0.000139,-7.2e-05,3.2e-05,-0.000147,0.000187,-7.6e-05,4.9e-05,1.7e-05,2.4e-05,9e-05,5.3e-05,-1e-05,3e-05,1.8e-05,-4.6e-05,5.1e-05,-4.2e-05,6.2e-05,2.9e-05,-4.1e-05,-1.2e-05,4.1e-05,-5e-06,6e-06,-1.6e-05,-2.3e-05,-1.4e-05,-1e-06,1e-06,-8e-06,7e-06,-2.9e-05,-2.3e-05,-2e-06,8e-06,1e-05,-7e-06,9e-06,-1.3e-05,4e-06,-7e-06,-4.7e-05,-4e-06,4e-06,4e-06,-1.7e-05,1.5e-05,-9e-06,-6e-06,-1.6e-05,1e-05,6e-06,6e-06,9e-06,-6e-06,4e-06,9e-06,1.8e-05,0,2e-06,-8e-06,-7e-06,-9e-06,-3e-06,2e-06,-2e-06,-4e-06
1e-06,1e-06,7e-06,-1.9e-05,-2.3e-05,4.5e-05,-8e-06,-1e-05,-1e-06,3e-05,-5e-06,8e-06,-2e-06,-1e-06,-9e-06,-1e-06,-2e-05,0,-1e-06,2e-06,1e-06,2e-06,1e-06,-1e-06,-3e-06,-6e-06,-1e-05,2e-06,2e-06,1e-05,-4e-06,-2e-06,2e-06,-7e-06,1.8e-05,7.6e-05,-9e-06,1.5e-05,9e-06,2.6e-05,-0.000106,-0.000123,-0.000116,7.4e-05,6.1e-05,-2.4e-05,0.000103,-5.6e-05,9e-05,0.000102,-0.000152,0.000112,-4.8e-05,-9e-05,-3.3e-05,4e-05,-1e-06,4.3e-05,-4.3e-05,3e-05,-4.3e-05,-0.000146,-6e-06,-2e-06,1.7e-05,4e-06,-0.000101,-1.4e-05,-3.4e-05,-1.5e-05,3.4e-05,-3.4e-05,-1.3e-05,2.2e-05,-3.9e-05,-2e-05,1e-05,-4.9e-05,-8e-06,-9e-06,1.7e-05,-2e-05,-2.1e-05,-8e-06,0,1.9e-05,-1.5e-05,3e-06,-2e-06,9e-06,1.3e-05,-3e-06,6e-06,3e-06,5e-06,-1.2e-05,-7e-06,1.7e-05,0,2.3e-05,-5e-06,1e-06,5e-06,-9e-06,-3e-06,-2.5e-05,-6e-06,5e-06,-4e-06,-3e-06,3e-06,-3e-06,-1.3e-05,0,8e-06,2e-06,-7e-06,-3e-06,2e-06,1e-06,-5e-06
0,0,-3e-06,3e-06,1.9e-05,1e-06,1.3e-05,-7e-06,7e-06,-5e-06,-6e-06,-1e-05,-2.4e-05,-1.4e-05,-1e-05,1e-06,1e-06,1.5e-05,0,-2e-06,0,1e-06,-2e-06,2e-06,-3e-06,-1e-06,-4e-06,-3e-06,3e-06,-2e-06,-4e-06,0,1e-06,-1e-05,9.8e-05,0.00015,1.2e-05,1.2e-05,-0.000123,-1.2e-05,-0.000122,0,-5.7e-05,4.3e-05,-0.000145,1e-06,4.2e-05,-6.6e-05,-2.2e-05,-8e-06,5.4e-05,-1.8e-05,-2.4e-05,-8.1e-05,0.000103,2e-06,-3.7e-05,0,-1.7e-05,-4.2e-05,-6.3e-05,0.000132,1.9e-05,-9.4e-05,5.5e-05,1.5e-05,2.2e-05,-4.9e-05,4.1e-05,1.2e-05,-1.5e-05,2.7e-05,3.6e-05,-2.4e-05,1.6e-05,1e-05,-2e-06,-2.3e-05,-1.1e-05,3.9e-05,6e-06,-3.1e-05,1.1e-05,9e-06,1.2e-05,1.4e-05,5e-06,-5e-06,-2e-06,1.1e-05,-1.2e-05,0,1e-06,-3e-06,-1e-06,1.4e-05,2e-06,-4e-06,-8e-06,-3e-06,-8e-06,-9e-06,-4e-06,1.2e-05,0,-1e-06,-1.2e-05,-9e-06,-3e-06,3e-06,-4e-06,-1e-05,-1.7e-05,-3e-06,-5e-06,6e-06,-4e-06,1e-06,0,2e-06,-1e-06
-1e-06,-2e-06,-1e-06,7e-06,8e-06,-1.9e-05,-1.2e-05,5e-06,5e-06,1.4e-05,1e-05,-3e-06,-8e-06,2e-05,2e-06,-1e-06,5e-06,-2e-06,0,1e-06,1e-06,-5e-06,-2e-06,0,4e-06,-4e-06,6e-06,-3e-06,-6e-06,-7e-06,0,-2e-06,0,1.4e-05,8.2e-05,-0.000157,6e-06,7e-06,0.000133,2.1e-05,2.2e-05,0.000109,3.6e-05,2.6e-05,-6e-06,5e-05,3.4e-05,4.6e-05,1.7e-05,0.000196,-5.3e-05,-3.5e-05,0.000115,-3.8e-05,-1e-04,2.2e-05,-2.4e-05,5.7e-05,-3e-05,6.8e-05,5e-05,-0.000116,2e-06,-4.8e-05,-4.8e-05,3.6e-05,-2e-05,-1.2e-05,3.5e-05,6e-06,4e-05,-1.3e-05,-5.9e-05,-1.4e-05,3e-05,8e-06,-3.2e-05,-1.7e-05,-2.5e-05,-9e-06,0,3.2e-05,1.6e-05,-4e-06,0,-2.2e-05,1.8e-05,4e-06,1.3e-05,-3.3e-05,3e-06,3e-06,-2e-06,2e-06,1.2e-05,8e-06,2e-06,-1.7e-05,-6e-06,2e-06,4e-06,0,6e-06,0,7e-06,1.1e-05,-4e-06,1e-05,-1e-06,1e-06,-7e-06,-3e-06,-5e-06,-3e-06,-1e-06,5e-06,7e-06,0,-3e-06,1e-06,2e-06
1e-06,4e-06,-1e-06,-4e-06,-1.4e-05,-3e-06,5e-06,5e-06,-5e-06,-1.3e-05,-2e-06,-1e-05,1.7e-05,-3e-06,-7e-06,1e-06,-3e-06,0,-1e-06,-1e-06,-2e-06,-6e-06,0,0,-8e-06,4e-06,-3e-06,0,-1e-06,1e-05,2e-06,2e-06,0,-7e-06,-7e-06,6e-06,-3e-05,-4.9e-05,-8.9e-05,-3.1e-05,1e-04,-7.6e-05,5e-06,-1e-05,3.6e-05,0.000105,-2e-05,8e-06,-8.7e-05,3e-06,8.4e-05,5.3e-05,-8.1e-05,-2.8e-05,-4e-06,1.5e-05,-1.5e-05,-6.5e-05,-2.9e-05,-2e-05,-6.5e-05,6.8e-05,-3e-05,9.5e-05,-1e-05,-5e-06,9e-06,1.8e-05,-1.7e-05,-4.4e-05,-8.6e-05,-1.2e-05,1.5e-05,-2e-05,-3.3e-05,1.2e-05,1.4e-05,5.4e-05,2.6e-05,1.3e-05,-3.9e-05,1.5e-05,-6e-06,7e-06,4e-06,3e-06,1e-05,-5e-06,-1.4e-05,1.5e-05,-2e-06,-6e-06,-1.1e-05,-1e-06,-9e-06,1.6e-05,5e-06,1.4e-05,5e-06,-5e-06,3e-06,8e-06,-6e-06,5e-06,-5e-06,8e-06,1e-06,-3e-06,-2e-06,-3e-06,6e-06,1.2e-05,1e-05,-2e-06,6e-06,-1.4e-05,-3e-06,0,3e-06,-4e-06,1e-06
-1e-06,-3e-06,5e-06,2e-06,1e-05,2e-05,2e-06,-1.6e-05,-1.1e-05,2e-06,0,7e-06,3e-06,1.1e-05,7e-06,-2e-06,5e-06,-1e-05,0,1e-06,-2e-06,-3e-06,1e-06,0,4e-06,4e-06,-4e-06,1e-06,0,3e-06,-5e-06,-2e-06,0,-4e-06,-8.2e-05,3e-06,1.5e-05,-1e-06,-3.6e-05,1.4e-05,5.3e-05,6.4e-05,0.000101,-3.8e-05,1.9e-05,-6.9e-05,-1.8e-05,-3.6e-05,-2.2e-05,-9.6e-05,-2e-06,-3.5e-05,-1.2e-05,8.1e-05,6.7e-05,7e-06,1.7e-05,8e-06,0.000138,1.8e-05,3.3e-05,-5.7e-05,4.7e-05,2.5e-05,3e-06,-5e-05,2.6e-05,-4e-06,-2.3e-05,2.7e-05,4.7e-05,3.8e-05,1e-06,1.8e-05,-8e-06,1.2e-05,-1e-06,9e-06,9e-06,-1.7e-05,-1.4e-05,-1.6e-05,-1.7e-05,-6e-06,-3e-06,1.7e-05,-2e-06,7e-06,6e-06,-1.5e-05,-3e-06,1e-06,8e-06,2e-06,5e-06,-1.4e-05,1e-06,-4e-06,9e-06,1e-06,-5e-06,0,5e-06,-4e-06,-1e-06,-1.2e-05,9e-06,-5e-06,5e-06,2e-06,1e-06,1.9e-05,1e-05,0,-5e-06,-2e-06,-3e-06,5e-06,-2e-06,1e-06,2e-06
0,1e-06,0,-2e-06,-1e-06,-1.3e-05,0,1.7e-05,9e-06,-4e-06,-5e-06,-4e-06,9e-06,1e-06,-5e-06,3e-06,-7e-06,-1e-06,1e-06,-1e-06,4e-06,0,0,0,-3e-06,-8e-06,6e-06,-2e-06,-2e-06,-7e-06,5e-06,-1e-06,-1e-06,1.1e-05,-7.2e-05,0.000108,1.8e-05,5.4e-05,8.5e-05,-1.1e-05,-4.4e-05,-2.2e-05,0.000138,-4.9e-05,-3e-05,-9.8e-05,-6.5e-05,-3.1e-05,4e-06,6.7e-05,-5.6e-05,-2.6e-05,1.7e-05,4.7e-05,-4e-05,2.8e-05,1.6e-05,-1.1e-05,-9.5e-05,-2.7e-05,-4.3e-05,9e-05,-4.1e-05,-4.4e-05,-5.3e-05,-3.2e-05,-4e-06,8e-06,-8e-06,-9e-06,0,-3.9e-05,-4e-06,-1.3e-05,5e-06,-1.3e-05,4e-06,3e-06,8e-06,-1.7e-05,1.7e-05,0,1e-06,-3e-06,-2e-06,-9e-06,-1e-05,-6e-06,-8e-06,1e-05,6e-06,-5e-06,0,1e-06,8e-06,-6e-06,-2e-06,-3e-06,-2e-06,-6e-06,-2e-06,2e-06,-3e-06,-3e-06,-4e-06,1e-06,2e-06,-3e-06,2e-06,-2e-06,-3e-06,3e-06,2e-06,1e-06,2e-06,9e-06,1.4e-05,-2e-06,-2e-06,2e-06,2e-06
0,1e-06,-3e-06,0,-4e-06,4e-06,0,-3e-06,3e-06,-2e-06,3e-06,-8e-06,-1.7e-05,-5e-06,1e-05,-2e-06,7e-06,-3e-06,-1e-06,1e-06,-2e-06,1e-06,-1e-06,1e-06,0,-4e-06,2e-06,-1e-06,0,-5e-06,-7e-06,2e-06,-1e-06,-6e-06,0,1.7e-05,-4.4e-05,-9e-06,3e-06,1.5e-05,-7.7e-05,1.6e-05,6.3e-05,-3.8e-05,7e-06,3e-06,4.4e-05,2.3e-05,2.7e-05,-1.7e-05,0,4.4e-05,1.8e-05,2.6e-05,-6.3e-05,-2.4e-05,-5e-06,-2e-06,6e-06,3e-06,-1.3e-05,-6.7e-05,1.9e-05,-5.4e-05,-2.2e-05,2.1e-05,1.8e-05,-1e-06,1.4e-05,-1.9e-05,-3e-06,3.8e-05,-7e-06,-1.2e-05,2.3e-05,9e-06,5e-06,-4.7e-05,-3e-06,7e-06,1e-06,8e-06,1e-05,4e-06,-2e-06,-9e-06,-1e-05,4e-06,7e-06,-1.6e-05,-5e-06,-4e-06,-4e-06,-3e-06,-6e-06,1.4e-05,-4e-06,3e-06,-4e-06,1.3e-05,5e-06,-5e-06,3e-06,-2e-06,3e-06,-5e-06,-4e-06,1e-06,2e-06,1e-06,-4e-06,0,3e-06,1e-06,1e-06,0,-6e-06,6e-06,2e-06,-1e-06,1e-06
0,-3e-06,-2e-06,-3e-06,1.1e-05,-5e-06,-9e-06,-1.4e-05,0,1e-06,-6e-06,6e-06,-2e-06,2e-06,-5e-06,1e-06,-2e-06,3e-06,0,0,0,2e-06,-1e-06,0,3e-06,3e-06,-7e-06,-3e-06,-4e-06,0,8e-06,-1e-06,0,-3e-06,6.1e-05,-0.000161,2.7e-05,-6e-05,-7.2e-05,-1e-05,-2.2e-05,-0.000122,2.2e-05,-3.3e-05,-1.2e-05,5.7e-05,5.5e-05,2.2e-05,5.2e-05,-0.000151,4.6e-05,1e-05,-5.7e-05,-1.1e-05,8.2e-05,-3.3e-05,8e-06,5.8e-05,4.6e-05,2e-06,1.7e-05,-1.4e-05,1e-06,1.2e-05,1e-06,3e-05,-1.9e-05,1.2e-05,1.3e-05,1.7e-05,-1.6e-05,-4.6e-05,2.1e-05,-2.7e-05,-5e-06,2.9e-05,-1.7e-05,-1.1e-05,-2e-06,-1.8e-05,2e-06,6e-06,4e-06,1e-06,-5e-06,8e-06,0,-1e-06,-7e-06,7e-06,2e-06,-1e-06,-4e-06,1e-06,1.3e-05,5e-06,-5e-06,-7e-06,-5e-06,-3e-06,0,0,-3e-06,6e-06,-6e-06,8e-06,-5e-06,-3e-06,1e-06,1e-06,6e-06,9e-06,1e-06,1e-06,-4e-06,-3e-06,-1e-06,-6e-06,2e-06,1e-06,0
-1e-06,3e-06,4e-06,8e-06,-1.2e-05,-2e-06,1e-05,1.6e-05,-3e-06,-6e-06,-4e-06,-1.4e-05,-5e-06,-1.4e-05,4e-06,1e-06,-6e-06,-1e-06,1e-06,0,-1e-06,4e-06,1e-06,1e-06,-3e-06,0,2e-06,1e-06,-1e-06,-1e-06,-9e-06,-1e-06,1e-06,8e-06,6e-05,-1.1e-05,-2.8e-05,1.3e-05,7.7e-05,0,6e-05,0.000117,8.8e-05,-1.2e-05,2.6e-05,1.7e-05,4.6e-05,-9e-06,-4.7e-05,2.1e-05,-3.3e-05,-4.4e-05,4.6e-05,-4.1e-05,-1.3e-05,-4.2e-05,-1e-05,-5.9e-05,-1.9e-05,-7e-06,-9e-06,-1.3e-05,-7e-06,7.4e-05,-2.5e-05,2.8e-05,2.1e-05,-1.1e-05,-1e-05,-1.2e-05,1.5e-05,5.1e-05,-2.6e-05,-8e-06,-2.1e-05,7e-06,-7e-06,1.3e-05,-1.4e-05,2.6e-05,1.3e-05,-2e-05,-6e-06,3e-06,-1e-06,5e-06,7e-06,-1e-06,4e-06,5e-06,-2e-06,1e-06,5e-06,2e-06,-1.3e-05,1.2e-05,0,4e-06,-1e-06,-8e-06,-3e-06,-4e-06,2e-06,0,-1e-06,5e-06,-4e-06,2e-06,-2e-06,-2e-06,1e-06,1.2e-05,-6e-06,0,3e-06,2e-06,1e-06,1e-06,-3e-06,-1e-06,-1e-06
0,-1e-06,-3e-06,-7e-06,0,1.9e-05,-4e-06,-5e-06,-4e-06,-3e-06,-1e-06,8e-06,1.5e-05,0,-4e-06,-2e-06,2e-06,0,-1e-06,0,2e-06,3e-06,0,0,1e-06,-2e-06,4e-06,-2e-06,2e-06,-2e-06,6e-06,0,1e-06,-4e-06,4e-06,-3.9e-05,-1.9e-05,5.3e-05,-3.4e-05,-7e-06,5.4e-05,1.1e-05,-0.000121,2.1e-05,-3.5e-05,-5e-06,-4e-06,1e-06,-4e-06,-5.5e-05,3.7e-05,4e-05,-1.5e-05,-1.9e-05,-6.6e-05,5.1e-05,-4e-06,3.8e-05,2e-06,7e-06,-1e-05,1e-04,2.1e-05,-1e-06,4e-06,3e-06,-3.8e-05,-1.4e-05,-3e-06,8e-06,-9e-06,-4.2e-05,1.5e-05,-2.3e-05,1.3e-05,-6e-06,6e-06,4.4e-05,-1e-05,7e-06,1.1e-05,-9e-06,-9e-06,-3e-06,-3e-06,-8e-06,6e-06,4e-06,3e-06,0,-1e-06,-1e-06,-2e-06,-3e-06,1.8e-05,-2e-05,4e-06,0,9e-06,5e-06,1e-06,4e-06,-1e-06,-2e-06,-2e-06,-7e-06,1e-06,-1e-06,-2e-06,1e-06,-5e-06,4e-06,-1.1e-05,0,-1e-06,1.3e-05,-1e-05,-6e-06,0,-1e-06,-1e-06
0,0,0,0,9e-06,-1.4e-05,-1e-06,-5e-06,0,-8e-06,2e-06,-6e-06,2e-06,9e-06,-3e-06,3e-06,2e-06,3e-06,0,-1e-06,-1e-06,-1e-06,-1e-06,0,1e-06,0,-5e-06,-1e-06,-1e-06,3e-06,-4e-06,1e-06,0,-2e-06,-4.9e-05,7.9e-05,-2.1e-05,-1.7e-05,-1.7e-05,1.2e-05,-2.3e-05,-7e-06,-1.9e-05,3.6e-05,-2.5e-05,-5e-06,-4e-06,1.9e-05,-1.8e-05,4.9e-05,-5e-05,-5e-06,1.1e-05,-3.3e-05,2.6e-05,9e-06,4e-06,-2.1e-05,-1.8e-05,1e-05,1.5e-05,-0.000111,-4.1e-05,-6.4e-05,3.7e-05,-3e-05,-1.2e-05,1e-06,1e-06,0,-9e-06,2.2e-05,8e-06,1.1e-05,6e-06,9e-06,-4e-06,-3e-06,1.9e-05,-8e-06,-1.5e-05,7e-06,9e-06,-4e-06,0,-1e-06,1e-06,-8e-06,-5e-06,-2e-06,2e-06,0,-5e-06,1e-06,-1.4e-05,-1.2e-05,4e-06,2e-06,2e-06,1e-06,3e-06,3e-06,0,2e-06,3e-06,-5e-06,2e-06,2e-06,-2e-06,-1e-06,-2e-06,-4e-06,-4e-06,0,-1e-06,-1.1e-05,5e-06,6e-06,2e-06,1e-06,0
0,2e-06,0,3e-06,-1.1e-05,-9e-06,-1e-06,8e-06,5e-06,0,-1e-06,-1e-06,-6e-06,1e-06,-3e-06,-3e-06,3e-06,0,0,1e-06,0,-2e-06,-1e-06,0,-3e-06,0,0,-2e-06,-1e-06,1e-06,2e-06,-2e-06,0,5e-06,-5.8e-05,-4.7e-05,-1.6e-05,-3.6e-05,2.7e-05,0,-5.2e-05,-6.5e-05,-0.000132,5.4e-05,2.2e-05,-1.5e-05,3e-06,9e-06,-2e-06,-0.000104,1.4e-05,-3e-05,-4.3e-05,3e-05,5.4e-05,5e-06,8e-06,4e-06,2.2e-05,-1.5e-05,1e-06,8.9e-05,3.7e-05,-1.6e-05,-1.1e-05,-2.9e-05,2.4e-05,1e-06,-1e-06,-1.6e-05,0,-1.2e-05,-4e-06,1e-06,-2e-06,4e-06,9e-06,-2.9e-05,7e-06,5e-06,-1e-06,1e-06,8e-06,3e-06,0,6e-06,-4e-06,9e-06,3e-06,0,-2e-06,1e-06,1e-06,0,1.2e-05,9e-06,3e-06,1e-06,-5e-06,0,0,0,0,-3e-06,-4e-06,3e-06,3e-06,6e-06,0,-1e-06,4e-06,0,4e-06,0,2e-06,2e-06,0,-3e-06,0,1e-06,-1e-06
0,-2e-06,0,-1e-06,4e-06,6e-06,0,-1e-06,1e-06,-3e-06,-2e-06,-3e-06,-5e-06,-9e-06,-5e-06,2e-06,-1e-06,1e-06,-1e-06,-1e-06,0,-3e-06,0,0,2e-06,0,6e-06,-3e-06,0,2e-06,-3e-06,1e-06,-1e-06,-4e-06,-1.7e-05,-3.9e-05,-1e-05,2e-05,2e-05,-6e-06,-1.8e-05,4.7e-05,-9.3e-05,4.3e-05,2.5e-05,-3.6e-05,2.7e-05,-1.6e-05,2e-05,1e-06,2.6e-05,2.7e-05,6.2e-05,1e-05,-6.9e-05,-1e-05,2e-06,9e-06,2.9e-05,1.3e-05,-4e-06,-2.5e-05,-2.1e-05,3.8e-05,0,1e-06,-8e-06,1e-05,6e-06,4e-06,1.6e-05,3e-06,1e-06,-1.1e-05,-8e-06,-1.1e-05,3e-06,-2e-05,-8e-06,-1.8e-05,1e-06,8e-06,-6e-06,-2e-06,-1e-06,0,-4e-06,-5e-06,-4e-06,2e-06,1e-06,0,3e-06,-1e-06,-6e-06,-2e-06,-1e-06,-6e-06,-4e-06,-1e-06,-2e-06,1e-06,0,4e-06,0,5e-06,2e-06,-4e-06,1e-06,1e-06,1e-06,4e-06,6e-06,0,-2e-06,3e-06,-1e-06,5e-06,-2e-06,-1e-06,-1e-06
0,1e-06,1e-06,-1e-06,8e-06,1.4e-05,3e-06,-1.2e-05,-1e-06,4e-06,3e-06,-3e-06,-6e-06,9e-06,-1e-06,-2e-06,-7e-06,-6e-06,0,1e-06,0,-3e-06,1e-06,0,-1e-06,-2e-06,-3e-06,1e-06,-1e-06,5e-06,2e-06,0,0,-1e-06,3.4e-05,-2.5e-05,-1.1e-05,3e-05,-3.8e-05,0,2e-05,-2.7e-05,-1.8e-05,2.6e-05,-3.7e-05,6e-06,-3.1e-05,-8e-06,-5e-06,3e-06,-2.2e-05,8e-06,-4.5e-05,2.4e-05,3e-06,-4e-06,-3e-06,1.1e-05,-7e-05,-1.7e-05,1.3e-05,8e-06,7e-06,4.5e-05,-6e-06,1.9e-05,1.4e-05,2e-06,4e-06,-5e-06,-1.3e-05,1e-05,-3e-06,-1.7e-05,0,3e-06,-9e-06,4e-06,2e-06,5e-06,-6e-06,-6e-06,-8e-06,1e-06,0,-5e-06,-1e-06,-5e-06,6e-06,-5e-06,-1e-06,2e-06,-5e-06,1e-06,2e-06,8e-06,-4e-06,8e-06,-1e-06,2e-06,1e-06,-3e-06,0,1e-06,3e-06,-4e-06,-4e-06,1e-06,3e-06,0,-5e-06,2e-06,3e-06,0,0,6e-06,5e-06,-5e-06,1e-06,-1e-06,-1e-06
0,0,-1e-06,0,-1.3e-05,-1e-05,-1e-06,1.7e-05,-3e-06,2e-06,-1e-06,-1e-06,1.2e-05,1e-06,-4e-06,0,1e-06,-3e-06,1e-06,-1e-06,1e-06,-1e-06,0,0,0,-1e-06,-3e-06,-3e-06,0,-1e-06,-3e-06,-1e-06,0,4e-06,4.8e-05,3.6e-05,-3e-06,-1.5e-05,2.4e-05,-2e-06,2.7e-05,-2.1e-05,-3.4e-05,5e-06,1e-06,4e-05,2e-05,2e-06,8e-06,5.8e-05,1.1e-05,-2.8e-05,2.1e-05,1.1e-05,5.3e-05,1.2e-05,-7e-06,-2.2e-05,1.6e-05,9e-06,-1.5e-05,-4.5e-05,-1e-06,-3.3e-05,-1.5e-05,1.9e-05,1.5e-05,3e-06,-7e-06,5e-06,-1.7e-05,-2.4e-05,-5e-06,-9e-06,-1e-06,-2e-06,1.1e-05,3.2e-05,-2e-06,-5e-06,-9e-06,3e-06,2e-06,-3e-06,1e-06,2e-06,2e-06,1e-05,-3e-06,-2e-06,-2e-06,0,-3e-06,-2e-06,3e-06,-1.1e-05,-5e-06,0,5e-06,-6e-06,1e-06,-2e-06,-1e-06,-3e-06,0,3e-06,-5e-06,3e-06,-1e-06,0,2e-06,-9e-06,4e-06,0,1e-06,-1.1e-05,-3e-06,3e-06,1e-06,2e-06,0
0,-1e-06,-1e-06,1e-06,6e-06,-1.1e-05,-1e-06,-8e-06,-3e-06,2e-06,-1e-06,-5e-06,1e-06,-2e-06,3e-06,2e-06,2e-06,-5e-06,0,1e-06,-2e-06,1e-06,-1e-06,0,0,3e-06,4e-06,3e-06,-1e-06,-6e-06,3e-06,1e-06,0,-2e-06,1.6e-05,8.7e-05,4e-06,-2.4e-05,-2e-05,8e-06,1.6e-05,6.3e-05,4.8e-05,-2.3e-05,1.7e-05,1.9e-05,-5.6e-05,7e-06,-1.6e-05,-3.2e-05,-1.2e-05,1.8e-05,-2e-05,-1.2e-05,-2.9e-05,-1.1e-05,-7e-06,-8e-06,5.3e-05,1e-06,-3e-06,6.4e-05,-1e-05,-5.5e-05,-2e-06,8e-06,-1e-05,-1e-05,1e-06,4e-06,1.9e-05,3.4e-05,1e-06,-2.1e-05,6e-06,-1.1e-05,-2e-06,7e-06,-8e-06,0,1e-05,1e-05,8e-06,-2e-06,1e-06,2e-06,2e-06,-6e-06,1e-06,1e-06,2e-06,0,3e-06,1e-06,-4e-06,-8e-06,-1e-06,-6e-06,4e-06,7e-06,-2e-06,0,1e-06,0,1e-06,-9e-06,-3e-06,-3e-06,2e-06,0,2e-06,-1.3e-05,2e-06,0,-1e-06,6e-06,2e-06,-4e-06,-1e-06,0,0
0,1e-06,1e-06,-3e-06,8e-06,8e-06,0,-3e-06,1e-06,3e-06,-3e-06,4e-06,1e-06,-1e-06,-3e-06,-3e-06,-1e-06,6e-06,0,-1e-06,1e-06,2e-06,0,0,1e-06,-1e-06,1e-06,-5e-06,-2e-06,-2e-06,-5e-06,0,0,-2e-06,-3.3e-05,-4.1e-05,5e-06,5e-06,-1e-06,-5e-06,-1.3e-05,-1.7e-05,1e-04,-4e-05,2e-06,-1.6e-05,-3.2e-05,-8e-06,-4e-06,-9e-06,-9e-06,1.4e-05,5.3e-05,-1e-06,-3.5e-05,5e-06,8e-06,3.9e-05,-3.4e-05,-1e-05,7e-06,-5e-05,3.1e-05,1.3e-05,2e-05,-1.1e-05,-1.2e-05,-2e-06,0,-1e-05,-1.2e-05,-3.9e-05,1e-05,-2e-06,4e-06,-5e-06,-4e-06,-6e-06,0,1.1e-05,2e-06,-6e-06,-1e-06,2e-06,2e-06,-2e-06,-1e-06,-2e-06,3e-06,2e-06,-3e-06,0,0,1e-06,8e-06,1.2e-05,3e-06,2e-06,-2e-06,-1e-06,-1e-06,1e-06,-1e-06,1e-06,-3e-06,3e-06,1e-06,-4e-06,-2e-06,-1e-06,1e-06,-4e-06,-3e-06,0,0,-7e-06,1e-06,4e-06,0,-1e-06,1e-06
