3.8e-05,-0.000311,-0.000304,-0.000217,-0.000156,-0.000161,-0.00035,-0.000375,-0.000143,-0.000235,-0.000301,-0.000188,-0.00023,-0.00053,-0.000153,-0.000152,-0.000285,-0.000166,-0.000173,-0.00013,-0.000328,-0.000425,-0.000218,-0.000153,-0.00017,-0.000249,-8.1e-05,-9.2e-05,-0.000226,-0.00017,-0.000236,-0.000114,-4.4e-05,-1e-04,3.6e-05,-0.000146,-0.000122,-0.000188,-0.000193,-0.000154,9.5e-05,-0.000239,-0.000324,-0.000178,-0.000195,-0.000348,-0.000177,-0.000112,-0.000309,-0.000185,-9e-05,-0.000155,0.000116,9.3e-05,-1.5e-05,-4e-06,-1.9e-05,-0.000184,-0.000221,-0.000149,0.000122,-0.000138,-7.4e-05,4e-06,-5.8e-05,0.000286,8.5e-05,-0.000235,0.000117,0.000129,2.9e-05,3e-06,3.1e-05,-7.6e-05,-0.000161,-2.1e-05,-0.000309,-0.000246,-0.000168,-0.000156,3.4e-05,-6.4e-05,-0.00012,-0.000107,-0.000416,-0.00023,-0.000167,-0.000384,8e-05,-6.4e-05,-0.000125,-0.000112,-0.00029,1.9e-05,-5.9e-05,-2.5e-05,-5.4e-05,-6.4e-05,-6e-06,0.000345,9.5e-05,-9.8e-05,-2.4e-05,7.4e-05,0.000146,0.00037,0.000314,0.000604,0.000484,0.000683,0.000723,0.000799,0.001256,0.001302,0.001534,0.002183,0.001942,0.002466,0.002488,0.002265,0.003001
-1.8e-05,0.00012,0.000182,-7.6e-05,-3e-05,-0.00011,7.1e-05,8e-05,3.3e-05,2.2e-05,8.1e-05,-0.000104,-4.8e-05,0.000204,0.000266,-0.000109,0.000146,6.6e-05,6.1e-05,-3.6e-05,0.000146,4.1e-05,-1.3e-05,-0.000199,-0.000141,5.1e-05,-0.000251,-7.8e-05,-9.7e-05,4.9e-05,0.000221,0.000154,-8.5e-05,-0.000279,-0.000189,-9.4e-05,1.6e-05,-2e-05,-3.3e-05,-7.2e-05,-9e-06,3.3e-05,0.000123,6.4e-05,-2.6e-05,0.000217,5.7e-05,2.1e-05,1e-05,6.6e-05,5.8e-05,-2e-05,-0.000162,-4.8e-05,-9.1e-05,-0.000108,-5.2e-05,0.00024,0.000173,-0.000104,2.1e-05,-1.5e-05,-5e-05,-0.000106,0.000139,2e-06,-4.2e-05,5e-06,-5.5e-05,2.3e-05,2.6e-05,-5.1e-05,-0.000235,-4.5e-05,3.4e-05,-0.000193,5.3e-05,6.8e-05,8.4e-05,-8.3e-05,3.4e-05,-3e-06,7.3e-05,-1.6e-05,0.000253,4.5e-05,-0.00015,9e-06,-0.000194,-0.000126,8.1e-05,0.000134,1e-06,-0.000199,-0.00017,2.7e-05,5.2e-05,0.000117,7.3e-05,-0.000154,-0.000181,1e-06,0.000292,8e-05,6.4e-05,0.000104,-2e-06,0.000208,1e-05,-0.00037,0.000189,-0.000353,0.000318,0.000324,-0.000194,0.000687,-0.00014,0.000281,0.000102,-0.000355,0.000294
-0.000193,-0.000171,-2.2e-05,0.000104,6e-05,1.6e-05,-0.000177,-0.000215,-8e-06,-8.7e-05,-0.000132,-6.6e-05,1.7e-05,-0.000128,-0.000159,-0.000119,-0.000124,-0.000104,-9.3e-05,-0.000103,-0.000248,6e-05,0.000112,-3.3e-05,-9e-06,-5.6e-05,-3e-06,-0.000184,-5.5e-05,-1e-04,-0.000286,-0.00034,-9.4e-05,-0.000114,-0.000159,-0.000273,-0.000116,-8.1e-05,6e-05,-0.000112,-7e-05,-0.000137,-7.1e-05,2.5e-05,-0.000144,-0.000238,-0.000168,-0.000137,-0.000161,-0.000232,-0.000171,-9.8e-05,-0.000189,-0.000252,-9.6e-05,-0.000119,9.9e-05,-0.000313,-0.000129,0.00012,-5.5e-05,-0.000118,-0.000118,-8.2e-05,-8.8e-05,-0.000157,-0.000323,-7.6e-05,-9.1e-05,-0.000177,-0.000123,-0.000221,-0.000112,-3.1e-05,-0.000111,-0.000134,-3.8e-05,-1.9e-05,-4.2e-05,8.5e-05,-2.4e-05,-4.3e-05,0.000135,-3.2e-05,-0.000341,-0.000231,-0.000208,7.8e-05,-0.000185,-0.000365,-0.000242,-0.000249,0.00016,-0.000187,-0.000327,-7.9e-05,-0.000189,-0.000164,-3.6e-05,-0.000368,-0.000177,-6.8e-05,-0.000248,-0.00022,-0.000473,-0.000228,-0.000379,-0.000313,-7.9e-05,-0.000414,-0.000227,-0.000752,-0.000561,-0.00044,-0.000863,-0.000943,-0.00109,-0.001075,-0.00066,-0.001322,-0.000708
-1e-06,-7e-05,-0.000138,-0.000229,-0.000141,-3.5e-05,7.2e-05,-5e-06,-0.000141,-1e-04,0.000145,-0.00015,-0.000135,2.9e-05,-0.000249,-0.000214,-0.00012,-0.000122,-0.000193,3.2e-05,-4e-06,-0.000164,-0.000179,1.1e-05,2.5e-05,-0.000114,7.4e-05,-0.000121,-2.4e-05,-0.000142,9e-06,-0.000113,8.2e-05,-1.3e-05,6e-05,-1.1e-05,-2.9e-05,-0.000158,-2.5e-05,4.5e-05,-0.000103,-1e-06,-0.000163,-8e-05,1.4e-05,9.4e-05,-7e-06,-4.9e-05,-4.5e-05,-8.3e-05,-0.000179,-0.000123,-0.000104,-0.000215,-2.2e-05,-5.9e-05,-0.000145,-9.4e-05,-7.3e-05,-0.000197,-0.000234,-0.000228,-1.8e-05,-0.000139,-5.5e-05,-0.000225,-0.000275,-0.000127,-0.000153,-0.000157,5e-05,-0.000106,-4.7e-05,7e-06,-3.6e-05,6.5e-05,-6.6e-05,0.000132,-0.000273,-0.000144,-0.000148,-0.000106,-0.000208,-0.000244,-8.3e-05,0.000108,1e-05,-0.000103,-3.2e-05,5.8e-05,1.4e-05,-9.9e-05,-0.000164,-7.9e-05,-0.000247,-7.3e-05,-0.000254,-0.000208,-0.000141,-0.000125,-0.000201,-0.000203,-0.000474,-0.000209,-0.000244,-0.000453,-0.000477,-0.000371,-0.000323,-0.000501,-0.000627,-0.00039,-0.000739,-0.00065,-0.001178,-0.001066,-0.00116,-0.00129,-0.001715,-0.001557,-0.001808
2.1e-05,2.2e-05,4.8e-05,-2.7e-05,9e-05,-9.2e-05,9e-06,0.000151,0.000206,8.8e-05,-5.9e-05,6.1e-05,3.2e-05,-8.2e-05,0.000213,0.000108,5.9e-05,4.2e-05,1e-06,1.7e-05,-3.4e-05,0.00018,0.000151,0.000109,0.000178,0.000147,3.7e-05,9.5e-05,3e-05,5.1e-05,1.8e-05,0.000104,1.5e-05,9.1e-05,-0.000192,0.000111,8.4e-05,0.000126,0.000147,-4.3e-05,4e-05,6.1e-05,8.9e-05,5.6e-05,9.1e-05,-3.5e-05,0.000121,0.000123,0.000125,-2.6e-05,-3.9e-05,2.7e-05,-7e-06,-2.4e-05,-4.2e-05,2.1e-05,3.1e-05,-4.1e-05,3.2e-05,2.9e-05,2.6e-05,0.000106,-6.9e-05,-2.9e-05,-9.8e-05,-8.5e-05,-3.4e-05,2.5e-05,0.000102,-0.000105,-0.000162,-4.5e-05,-1.5e-05,-3.4e-05,3.2e-05,7.7e-05,3.9e-05,-0.000105,-6e-06,1.7e-05,2.5e-05,-0.000176,5.2e-05,2.3e-05,8.6e-05,-3.9e-05,-1e-05,-4.6e-05,-3.9e-05,0.000114,8.4e-05,-9.6e-05,-8.1e-05,4.9e-05,0.000156,4.2e-05,0.000113,-5.8e-05,-9e-06,-4.6e-05,-0.000119,-2.5e-05,2e-05,-1e-04,-0.000122,-0.000103,-0.000115,-0.000281,-0.000338,-0.00019,-0.000244,-0.000151,-0.000327,-0.000422,-0.000465,-0.000622,-0.000645,-0.000999,-0.000609,-0.00061,-0.000895
-1.3e-05,-7.8e-05,1.1e-05,7e-05,9.9e-05,5.4e-05,6e-06,-1e-05,-0.000121,-7.7e-05,4.9e-05,-5.4e-05,-8e-06,4e-06,-0.000113,3.8e-05,-9.6e-05,-7.9e-05,-4.6e-05,-5.8e-05,1e-05,-0.00011,-9e-05,-1.2e-05,-0.000129,-6.9e-05,4.1e-05,-1.1e-05,-3.3e-05,6.6e-05,0.000156,9.9e-05,-0.000118,5.8e-05,7.1e-05,-5e-06,3.5e-05,-7.2e-05,-0.000116,-4.8e-05,-3.9e-05,5e-06,-2.2e-05,-2.4e-05,-2.7e-05,6.3e-05,-0.000102,5.5e-05,-2.2e-05,0.000164,5e-05,2.6e-05,-2.5e-05,8e-05,-0.000126,3.2e-05,-3.1e-05,-5.6e-05,-0.000167,1.8e-05,-4.5e-05,3e-06,-5e-06,-4e-05,-3.4e-05,3.2e-05,9.3e-05,-5.6e-05,-1e-04,1e-04,1.9e-05,-1.3e-05,6.3e-05,-6.6e-05,-1.1e-05,-9e-06,4.3e-05,8.2e-05,-2.9e-05,4.9e-05,-2e-05,3.8e-05,-6.8e-05,0.000107,5e-05,-7e-05,6.3e-05,4.4e-05,8.9e-05,1.7e-05,-1.9e-05,6.7e-05,-4e-05,-5.8e-05,0.000192,7.7e-05,0.000105,8.2e-05,-8.7e-05,8.3e-05,0.000109,-0.000232,-0.00022,-0.000126,4.3e-05,-0.000153,-8.4e-05,-2.9e-05,3e-06,9.5e-05,6.5e-05,-0.000167,-6.8e-05,-6.4e-05,-5e-06,-7e-06,-0.000105,-0.000154,0.000134,-0.000311,-0.000342
-3e-06,6.9e-05,-0.000191,-2.9e-05,-7.2e-05,2.9e-05,-1e-06,-1e-06,-3.7e-05,6e-06,-1.2e-05,5e-05,3e-06,-7e-05,1.5e-05,-7.1e-05,-8.8e-05,0.000105,0.000105,4.7e-05,1.7e-05,-4.1e-05,9.6e-05,-5e-05,-3e-05,3.5e-05,-3.5e-05,-4.3e-05,-3.7e-05,-0.00011,-7.3e-05,-2.9e-05,-7.6e-05,-6.4e-05,0.000148,6.3e-05,7e-06,-8e-06,-7e-06,0.000106,-1.7e-05,1e-05,2.9e-05,7e-06,6.7e-05,4.9e-05,6.2e-05,-0.000115,8e-06,-4.3e-05,2e-05,3.1e-05,-3.6e-05,-1e-06,-8e-06,0,-6.3e-05,0.000123,8.6e-05,6.4e-05,5.5e-05,4.9e-05,-0.000106,0.000154,7.1e-05,9e-06,0.000123,0.00012,2.2e-05,0.000118,3e-05,2.5e-05,8.1e-05,-2.6e-05,2.1e-05,5.1e-05,-3.3e-05,-0.000151,7.2e-05,-3.4e-05,5e-06,-8e-06,-0.000108,-6.1e-05,5.9e-05,-2.3e-05,1.6e-05,-0.000111,-5.1e-05,-1.8e-05,-0.000155,-5.2e-05,1.3e-05,0.000148,-0.000102,-0.000214,-8.6e-05,9e-06,-3.5e-05,5.1e-05,0.000183,4.7e-05,0.000209,6.6e-05,7.4e-05,0.000248,2e-04,9.2e-05,0.000147,0.000107,0.000106,0.000171,0.00037,0.000117,0.000318,0.000385,0.000351,0.00058,0.000359,0.000485,0.00032
-1.3e-05,-4.4e-05,5.4e-05,0.000108,4e-05,6e-06,4.2e-05,-6.9e-05,-3.7e-05,-1.2e-05,-4.7e-05,-6.4e-05,3.3e-05,0.000144,-1.1e-05,6.3e-05,5.1e-05,-2.7e-05,4.3e-05,-6.1e-05,-5.6e-05,-9e-06,-5.4e-05,2.7e-05,2.8e-05,-0.000108,-2.2e-05,-1.2e-05,-7.1e-05,4.9e-05,8e-06,-5.6e-05,-2e-05,4.2e-05,-4.9e-05,-8e-06,1.5e-05,-2.1e-05,-1.8e-05,-9.2e-05,0,-3.6e-05,-6.4e-05,-8.8e-05,-7.2e-05,-3.6e-05,-3.7e-05,7e-06,-3.4e-05,-2e-05,7.3e-05,2.4e-05,-1.3e-05,7e-06,5.1e-05,-2e-06,6e-05,-4.1e-05,-1.7e-05,-3.7e-05,-5e-06,-3.6e-05,6.8e-05,-2.7e-05,4.7e-05,2.8e-05,-5e-06,-4e-06,4.1e-05,3.2e-05,4.5e-05,4.6e-05,3.3e-05,5.5e-05,-2e-06,-6.8e-05,-1.3e-05,3.8e-05,-1.9e-05,-1.4e-05,-3.7e-05,5.2e-05,1.1e-05,6e-05,-1.8e-05,3.9e-05,8e-06,0.000109,0.000117,-1e-06,-5.3e-05,-2.6e-05,-6.5e-05,-5e-05,2.8e-05,-6e-05,2.9e-05,2.8e-05,2.8e-05,3.2e-05,1.7e-05,0.000121,-0.000106,0.000139,0.000106,0.000134,8.1e-05,0.000231,0.000152,9.3e-05,0.000153,0.000284,0.000228,0.00032,0.000305,0.000292,0.000505,0.000522,0.000398,0.000524,0.00083
-3.9e-05,2.9e-05,-7e-06,-4.5e-05,-1.3e-05,-2.7e-05,1.4e-05,2.8e-05,3.6e-05,2e-05,4.5e-05,4.8e-05,3e-05,-3.8e-05,4e-05,-2.1e-05,0.000105,3.3e-05,-1.5e-05,6.1e-05,2.7e-05,-5e-06,5e-06,-8.9e-05,-1.5e-05,5.1e-05,-3.5e-05,-2e-05,8.9e-05,5.3e-05,-7.3e-05,2e-06,5.8e-05,6.1e-05,-5.4e-05,-3e-06,-5.4e-05,2.1e-05,-4.4e-05,0,7.8e-05,7e-06,-2.6e-05,1.5e-05,3.4e-05,-2.7e-05,1.6e-05,-9.1e-05,-1.3e-05,-2.2e-05,-8.6e-05,-3.8e-05,0.000103,3.1e-05,6e-05,2e-05,2.4e-05,5.1e-05,0.00014,-3e-06,-2.1e-05,6e-05,2.1e-05,-1.3e-05,-5e-06,9e-05,1.6e-05,6.5e-05,9e-06,5.9e-05,4.4e-05,6.9e-05,-6.2e-05,2.9e-05,2.8e-05,-1.6e-05,-3e-06,1.1e-05,8e-06,-3.2e-05,-4e-06,-2e-05,2e-06,2.8e-05,4e-06,0.000122,1.4e-05,-3.7e-05,-7.1e-05,-9e-05,7.6e-05,2.4e-05,0.000116,2e-06,-1.6e-05,4.4e-05,2.9e-05,1.1e-05,9.5e-05,4e-06,-7e-05,4.7e-05,9.5e-05,0.000125,2.7e-05,0,9.3e-05,9.3e-05,2.8e-05,0.000153,5e-05,3.1e-05,5.9e-05,0.000135,0.000172,0.000231,8.9e-05,0.000333,0.000211,0.000269,0.000466
5.7e-05,-1.2e-05,7.9e-05,1.1e-05,-9.3e-05,-1.6e-05,-4.7e-05,-6e-06,2.7e-05,1.9e-05,-6e-06,-2.4e-05,-4e-06,-1.4e-05,1.7e-05,4.4e-05,-6e-06,6.7e-05,-5.1e-05,3e-06,3.6e-05,2e-05,6.9e-05,5.4e-05,-1.9e-05,2e-05,-1.2e-05,4.5e-05,1.2e-05,2e-05,4.1e-05,4.7e-05,8.6e-05,-2e-05,-4e-05,-7.8e-05,1.2e-05,1.4e-05,2e-06,4.2e-05,2e-05,1.5e-05,-3.3e-05,1.4e-05,2.2e-05,-3.9e-05,4.4e-05,9e-05,6.2e-05,-1.1e-05,1.6e-05,3.4e-05,-6.1e-05,3e-06,4e-05,1.9e-05,2.6e-05,4.2e-05,-2.4e-05,4.3e-05,2.7e-05,-2.7e-05,6.6e-05,5.5e-05,7e-06,5.6e-05,-3e-06,1.6e-05,2.6e-05,-8.7e-05,-2.8e-05,-3.1e-05,-4e-05,7e-06,2.8e-05,2e-05,1e-05,-1.4e-05,-2e-06,3e-05,5e-05,-6e-06,6e-06,2.9e-05,-3.9e-05,5e-06,6.1e-05,5.7e-05,0.000104,4.1e-05,8.6e-05,4e-06,2e-06,3.3e-05,3.9e-05,4.8e-05,-8e-06,-4.2e-05,2.2e-05,4.6e-05,5e-06,-1.8e-05,7.4e-05,-1.7e-05,1.4e-05,7e-06,-1e-05,-5.3e-05,3e-06,-4.5e-05,-3e-06,4.7e-05,-8.2e-05,-4.6e-05,0,-4e-05,1.1e-05,7e-06,9.6e-05,-7.3e-05,-0.000164
4.9e-05,1.6e-05,4e-05,3.1e-05,9e-06,4.9e-05,-1.4e-05,1.3e-05,3e-06,-3.4e-05,4.1e-05,4.4e-05,-4e-05,2e-05,-1e-05,-5.2e-05,-2.1e-05,-3.7e-05,-1.5e-05,7e-06,1.3e-05,3e-06,-2.4e-05,-1.7e-05,2.2e-05,-4.9e-05,4.5e-05,1e-05,1.9e-05,4e-05,-1.6e-05,-1.3e-05,-2.7e-05,-2.7e-05,2.5e-05,1.4e-05,0,3e-05,0,-1.2e-05,-3.1e-05,-2.8e-05,1.3e-05,-4e-06,-2.1e-05,2.7e-05,-7e-06,-6.2e-05,-5e-05,2.6e-05,1.3e-05,-4e-06,-1e-05,2e-06,7e-06,-2.5e-05,-6.9e-05,-1.7e-05,7e-06,-6.3e-05,-4.9e-05,-1.6e-05,-6e-05,-7e-06,-2.5e-05,-4.5e-05,-1.7e-05,-1e-05,-1.6e-05,3.4e-05,-1.3e-05,-1.9e-05,1.9e-05,-1.8e-05,-7e-06,1.4e-05,1.5e-05,4.1e-05,2.1e-05,-3.5e-05,-8.5e-05,-2e-06,7.6e-05,-1.1e-05,-1.1e-05,-6.9e-05,-5e-05,-6e-06,-4.8e-05,-3e-05,-3.2e-05,4.1e-05,5.9e-05,-3.3e-05,-3.9e-05,5.8e-05,3.1e-05,1e-06,-5e-06,-1.9e-05,2e-06,0,-1.7e-05,-4.5e-05,-3.8e-05,-5.8e-05,-7.3e-05,-1e-06,-1.4e-05,-6.8e-05,-2.1e-05,-0.00013,1e-05,-4.3e-05,-7.8e-05,-8.7e-05,-0.000154,-0.000137,-0.000206,-0.000218,4.5e-05
-2.4e-05,0,-4.3e-05,-4.1e-05,3.8e-05,1.8e-05,3.3e-05,-7e-06,-1.7e-05,2.2e-05,2e-06,-5.7e-05,5.4e-05,-4.2e-05,-1e-06,3.5e-05,-1.5e-05,-3.9e-05,4.3e-05,2.9e-05,-4e-05,-8e-06,-3.6e-05,0,-2e-05,3.2e-05,0,2e-06,-5.6e-05,-5e-05,-3e-06,2.9e-05,-3.1e-05,-1.3e-05,3.7e-05,2.4e-05,9e-06,-1.9e-05,1.7e-05,1.5e-05,1e-06,1.6e-05,5.5e-05,2.9e-05,4e-06,-1.1e-05,1.7e-05,4.5e-05,3.1e-05,-2.8e-05,3e-06,-5e-06,-3.9e-05,-7e-06,-6e-05,-3.3e-05,-2.6e-05,1.4e-05,-2.2e-05,-4e-06,2.1e-05,1e-05,-4.4e-05,-1e-05,1.5e-05,-2.9e-05,-3.4e-05,-7.4e-05,-2.5e-05,-1.4e-05,-3.9e-05,-4e-06,-2.6e-05,-3.6e-05,-1.3e-05,2e-05,-1e-05,-2.2e-05,-1e-05,3.9e-05,1.9e-05,2e-06,1.2e-05,-2e-05,4.4e-05,-5.1e-05,2e-06,-1.3e-05,-6.1e-05,1.3e-05,-5.9e-05,1.2e-05,-4.3e-05,-3.9e-05,-1e-06,-1e-06,-2.8e-05,6e-06,-5.2e-05,-3.3e-05,-2.5e-05,-7.8e-05,8e-06,-1.9e-05,-6.2e-05,-2.9e-05,5e-06,-8.2e-05,-4.2e-05,-6.6e-05,-2.7e-05,-0.000101,-2.6e-05,-0.00014,-8e-05,-6.3e-05,-9.2e-05,-0.000121,-0.000105,-4.9e-05,-0.000253
-2.4e-05,1e-06,9e-06,-1.1e-05,2.3e-05,-1.7e-05,-3.9e-05,1.1e-05,-2.4e-05,-2.5e-05,-1e-05,1.9e-05,-1.1e-05,3.4e-05,-2.1e-05,-4.4e-05,-9e-06,1e-06,-6e-06,-1.6e-05,-3.6e-05,-2.2e-05,-3e-06,1e-05,-5e-06,-1.3e-05,1.4e-05,0,2.5e-05,5e-06,2.1e-05,-1.4e-05,-3.6e-05,-4.6e-05,2e-06,-1.8e-05,-1.3e-05,-1.5e-05,-5e-06,-2.7e-05,-2.7e-05,-3e-06,-4e-06,-1.7e-05,-1e-05,3e-06,-4.5e-05,-1.8e-05,-2.3e-05,6e-06,2e-06,1e-06,-2e-05,8e-06,1e-05,8e-06,1.1e-05,-1e-05,-3.7e-05,-4.5e-05,-1.4e-05,-3e-06,-9e-06,2e-06,-4e-05,1.1e-05,4e-06,-1.1e-05,-4.6e-05,-4.5e-05,-1.1e-05,-1.1e-05,-8e-06,-3e-06,-1.2e-05,-1.3e-05,8e-06,-1e-05,1.6e-05,-2.7e-05,-2.2e-05,2.5e-05,-9e-06,-4.3e-05,-4.6e-05,2.3e-05,-3e-05,3e-06,6e-06,-1.5e-05,-6e-06,-1.2e-05,1.6e-05,8e-06,4.3e-05,-4e-05,-7e-05,-1.4e-05,2.1e-05,-6e-06,-1.6e-05,-2.9e-05,-3.5e-05,4.1e-05,-1.8e-05,3.7e-05,-4.4e-05,-1e-06,-2.4e-05,5e-06,-2.7e-05,5.9e-05,-9.5e-05,5.3e-05,-6.6e-05,-3.5e-05,1.9e-05,-0.000125,-4e-05,-3.5e-05,-7.5e-05
-4.1e-05,-1.4e-05,-2e-05,-1.6e-05,-1.2e-05,1.1e-05,2.1e-05,1.3e-05,7e-06,6e-06,1.5e-05,-1.1e-05,-3e-06,-4.1e-05,4e-06,3.1e-05,1.2e-05,2e-06,-1.6e-05,-2.3e-05,7e-06,1.7e-05,-1.9e-05,-6e-06,-1e-06,-8e-06,-2.3e-05,-7e-06,-4e-06,-3e-05,-1.8e-05,-1e-05,2.9e-05,3.5e-05,-1.6e-05,-1.2e-05,-4e-06,-7e-06,1e-05,-5e-06,-1.7e-05,1e-06,-6e-06,-1.1e-05,1.5e-05,2e-06,0,1.6e-05,7e-06,-5e-06,-3e-06,6e-06,2.9e-05,7e-06,1.1e-05,5e-06,1.3e-05,-1.6e-05,3.3e-05,6.3e-05,4e-06,-6e-06,4e-06,-2.2e-05,3.6e-05,5e-06,-1.6e-05,2.2e-05,1.6e-05,9e-06,1e-05,1.7e-05,-8e-06,1.1e-05,5e-06,-1.7e-05,-1.3e-05,6e-06,-8e-06,2.9e-05,1.9e-05,-2.5e-05,-2e-05,1.8e-05,2.8e-05,1e-06,2.5e-05,2e-06,1e-05,2.4e-05,5e-06,-3e-06,-2.6e-05,-1.8e-05,-3.3e-05,-1.8e-05,-1.3e-05,-2e-06,-5e-06,-2e-05,-9e-06,4.5e-05,-9e-06,-2.7e-05,5e-06,-2.7e-05,4.2e-05,1e-06,1e-05,-9e-06,6e-06,-3e-06,-1.6e-05,1.8e-05,2.2e-05,-1.5e-05,-5e-06,4.3e-05,3e-05,5e-06,-3.2e-05
1e-05,1.2e-05,1.6e-05,-1.7e-05,1e-05,2e-06,-2.3e-05,4e-06,-1e-06,7e-06,-2.3e-05,7e-06,-9e-06,6e-06,-1.1e-05,-2.3e-05,2.2e-05,-1.1e-05,8e-06,1.2e-05,4e-06,-1e-06,1e-05,1.8e-05,8e-06,1e-05,2.4e-05,-7e-06,2e-06,5e-06,1.3e-05,-7e-06,0,-1.7e-05,1.1e-05,5e-06,-1e-06,1.7e-05,0,1.8e-05,2.1e-05,-4e-06,2e-06,4e-06,-2e-06,1e-06,-2e-06,-1.3e-05,0,7e-06,4e-06,-9e-06,-6e-06,-3e-06,1.4e-05,4e-06,4e-06,2.6e-05,-1.3e-05,-1.2e-05,5e-06,3e-06,1.9e-05,2.8e-05,-2e-05,0,7e-06,2e-06,9e-06,-5e-06,1.3e-05,1.3e-05,2.9e-05,1e-05,-3e-06,4e-06,1e-06,-1e-06,-9e-06,-1.7e-05,3.7e-05,5e-06,-1e-06,-2.9e-05,1.2e-05,2e-05,-4e-06,0,-5e-06,7e-06,-1.2e-05,-7e-06,2.2e-05,1.6e-05,1.4e-05,-5e-06,1.9e-05,1e-06,1.4e-05,1.8e-05,1.6e-05,3e-05,2.9e-05,-5e-06,1.9e-05,-2e-06,-2.1e-05,3e-06,-4e-06,1.1e-05,2e-06,-1.5e-05,4.1e-05,-3e-06,1.4e-05,-7e-06,-3e-06,4e-06,-4.1e-05,-1e-05,2.7e-05
1.9e-05,-1.2e-05,-1.5e-05,1.1e-05,-4e-06,-1.3e-05,7e-06,-2.1e-05,1.4e-05,-4e-06,-2e-06,1e-06,1.1e-05,2.7e-05,2.4e-05,1.5e-05,-1.7e-05,-2e-06,5e-06,3e-06,1.1e-05,-8e-06,3e-06,-1.8e-05,-1.6e-05,-4e-06,1e-06,-1e-06,-5e-06,0,2e-06,6e-06,2.7e-05,9e-06,2.5e-05,0,7e-06,1.5e-05,5e-06,-5e-06,1e-06,1.2e-05,2e-06,3e-06,2e-06,1.5e-05,1.1e-05,2e-06,-8e-06,4e-06,-1.3e-05,2e-06,1.1e-05,3e-06,3e-06,2e-06,-1e-05,8e-06,1e-06,1.4e-05,4e-06,-2e-06,-5e-06,2e-06,-3e-06,-1e-06,-6e-06,-2e-06,1e-06,2.2e-05,-1.6e-05,-3e-06,-1.1e-05,-4e-06,6e-06,-1.3e-05,7e-06,-8e-06,1.2e-05,1e-05,-1.8e-05,9e-06,7e-06,3e-06,0,2.4e-05,-1e-06,3e-06,1.2e-05,-8e-06,3.6e-05,1.5e-05,-5e-06,1.2e-05,2e-06,2e-05,4e-06,4e-06,1.1e-05,-2e-06,7e-06,-1.7e-05,-3e-06,-1.5e-05,-2e-06,1.1e-05,6e-06,-8e-06,3e-06,3e-06,5e-06,1.1e-05,-5e-06,-3.5e-05,3e-06,-4e-06,-7e-06,5e-06,-6e-06,-2e-06,-6e-06
6e-06,6e-06,2.4e-05,5e-06,2e-06,4e-06,-3e-06,1.3e-05,-5e-06,-2e-06,6e-06,9e-06,-8e-06,-9e-06,-1.1e-05,-6e-06,1.3e-05,5e-06,9e-06,6e-06,-9e-06,-1e-06,-2e-06,2e-06,1.2e-05,1e-06,-1.1e-05,5e-06,1.4e-05,3e-06,3e-06,-1e-06,-7e-06,-2e-06,2e-06,-1e-06,-2.1e-05,-5e-06,-9e-06,-5e-06,-1.1e-05,-5e-06,3e-06,1e-06,4e-06,2e-06,-4e-06,0,0,-1.6e-05,-1e-06,-4e-06,-7e-06,4e-06,-1.5e-05,3e-06,1e-06,-1.3e-05,-8e-06,-1.1e-05,2e-06,-2e-06,-3e-06,-1.3e-05,3e-06,9e-06,2e-06,-6e-06,-1e-06,-3e-06,-1e-06,-2e-06,1.2e-05,-1e-05,-1.2e-05,-1.3e-05,-1e-06,4e-06,-7e-06,-9e-06,7e-06,7e-06,4e-06,1.4e-05,2e-06,-2.5e-05,-7e-06,-9e-06,2e-06,4e-06,1.3e-05,8e-06,2e-06,1e-06,5e-06,1.6e-05,-6e-06,6e-06,-1.8e-05,-6e-06,-6e-06,-1.6e-05,-1.2e-05,-1.3e-05,-3e-06,-6e-06,-6e-06,0,-5e-06,3e-06,-5e-06,-2e-05,2e-05,2e-06,-3e-06,1e-06,-2.2e-05,-8e-06,-1.7e-05,-2.4e-05,-1.6e-05
-2e-06,0,2e-06,0,-9e-06,-5e-06,4e-06,-8e-06,0,4e-06,-3e-06,-1.1e-05,5e-06,-4e-06,1.6e-05,0,-2e-05,1e-06,9e-06,2e-06,1.2e-05,5e-06,-3e-06,-1.4e-05,-2e-06,5e-06,0,-2e-06,-1e-05,2e-06,-4e-06,4e-06,-8e-06,0,-2.3e-05,7e-06,1e-05,3e-06,1e-06,2e-06,-4e-06,-1e-06,-6e-06,1.3e-05,-3e-06,-9e-06,-1e-06,-1.1e-05,2e-06,1.4e-05,0,0,-2e-06,4e-06,-1e-05,4e-06,2e-06,3e-06,-1.4e-05,1.3e-05,2e-06,0,-1.5e-05,6e-06,-4e-06,-6e-06,-3e-06,7e-06,1e-06,-1e-05,5e-06,2e-06,-1e-06,-3e-06,0,1e-06,0,4e-06,7e-06,6e-06,0,2e-06,1e-05,-2e-06,-3e-06,-6e-06,5e-06,4e-06,-8e-06,-7e-06,-1.1e-05,-5e-06,-1.4e-05,1e-06,-8e-06,7e-06,1e-05,-4e-06,-4e-06,7e-06,-2e-06,-8e-06,1.1e-05,1.1e-05,7e-06,6e-06,1e-06,1.2e-05,-4e-06,-1e-06,8e-06,-6e-06,-1.4e-05,1.9e-05,-4e-06,1e-06,2e-05,-1.7e-05,2.4e-05,9e-06,-1.5e-05
-2e-06,2e-06,-1.5e-05,-7e-06,-9e-06,-3e-06,-4e-06,-4e-06,-9e-06,-6e-06,9e-06,8e-06,-5e-06,-1e-06,-1.2e-05,1e-06,4e-06,-3e-06,-1.1e-05,-4e-06,-1e-05,1e-06,7e-06,9e-06,1e-06,-6e-06,0,2e-06,-2e-06,-6e-06,-3e-06,-3e-06,-1.5e-05,3e-06,1e-06,-2e-06,4e-06,-2e-06,-2e-06,-3e-06,4e-06,1e-06,-2e-06,-5e-06,-4e-06,-3e-06,0,7e-06,-2e-06,-7e-06,-5e-06,-3e-06,0,-1e-06,-7e-06,-5e-06,3e-06,-3e-06,0,2e-06,-4e-06,-2e-06,8e-06,-2e-06,3e-06,-4e-06,7e-06,1e-06,0,7e-06,2e-06,4e-06,6e-06,4e-06,2e-06,2e-06,-2e-06,-5e-06,-6e-06,-4e-06,-6e-06,-1.2e-05,-5e-06,-1e-06,3e-06,-1e-06,2e-06,-3e-06,1.2e-05,-5e-06,-1.5e-05,4e-06,-3e-06,7e-06,6e-06,2e-06,1e-05,0,0,-1e-06,4e-06,5e-06,-2e-06,5e-06,8e-06,5e-06,2e-06,-7e-06,9e-06,6e-06,4e-06,2.5e-05,-1e-06,-3e-06,9e-06,9e-06,7e-06,3e-05,-8e-06,1.1e-05,1.5e-05
5e-06,0,2e-06,9e-06,1e-06,5e-06,2e-06,0,3e-06,2e-06,-3e-06,-7e-06,1e-06,7e-06,7e-06,-2e-06,8e-06,6e-06,-4e-06,-1e-06,0,-9e-06,-9e-06,-7e-06,2e-06,4e-06,5e-06,-4e-06,-4e-06,-4e-06,-1e-06,5e-06,1e-06,8e-06,4e-06,-2e-06,-6e-06,-1e-06,3e-06,6e-06,1e-06,2e-06,4e-06,4e-06,7e-06,0,-3e-06,-6e-06,-1e-06,4e-06,3e-06,2e-06,0,3e-06,7e-06,6e-06,4e-06,-3e-06,8e-06,1e-06,4e-06,0,-3e-06,4e-06,6e-06,5e-06,2e-06,5e-06,1e-06,-3e-06,3e-06,1e-06,0,7e-06,1e-06,4e-06,3e-06,3e-06,6e-06,4e-06,4e-06,8e-06,-5e-06,8e-06,-5e-06,5e-06,-1e-05,3e-06,-8e-06,3e-06,-2e-06,6e-06,-7e-06,-3e-06,1e-06,-1.3e-05,-5e-06,1e-06,9e-06,2e-06,4e-06,1.5e-05,-2e-06,-6e-06,5e-06,-7e-06,5e-06,1.3e-05,2e-06,7e-06,1e-06,-7e-06,2.4e-05,9e-06,1.1e-05,8e-06,6e-06,2.1e-05,2.1e-05,1.1e-05,3.7e-05
-8e-06,0,-5e-06,1e-06,-1e-06,0,2e-06,0,0,2e-06,-4e-06,7e-06,-6e-06,1e-06,-5e-06,5e-06,3e-06,1e-06,9e-06,-2e-06,3e-06,7e-06,7e-06,5e-06,0,-2e-06,-5e-06,0,8e-06,4e-06,1e-06,-1e-06,1e-05,-1e-06,4e-06,5e-06,5e-06,-2e-06,-2e-06,-4e-06,-2e-06,-1e-06,8e-06,-1e-06,-4e-06,-2e-06,5e-06,8e-06,3e-06,-1e-06,-3e-06,-4e-06,1e-06,1e-06,1e-05,3e-06,2e-06,3e-06,1e-06,-8e-06,-3e-06,-1e-06,8e-06,-1e-06,-9e-06,5e-06,-3e-06,5e-06,5e-06,6e-06,1e-06,1e-06,-2e-06,3e-06,1e-06,2e-06,-3e-06,-3e-06,-4e-06,-2e-06,-4e-06,1e-06,-3e-06,4e-06,-5e-06,1.1e-05,9e-06,1e-06,2e-06,-5e-06,9e-06,-1e-06,8e-06,4e-06,-6e-06,-8e-06,-1e-06,4e-06,0,2e-06,0,5e-06,1e-06,-7e-06,0,8e-06,-6e-06,1e-06,0,1e-06,1e-06,-3e-06,6e-06,-5e-06,3e-06,2e-06,-4e-06,1e-06,-4e-06,-9e-06,8e-06
2e-06,-1e-06,9e-06,4e-06,8e-06,-5e-06,2e-06,-1e-06,3e-06,-2e-06,-2e-06,-3e-06,4e-06,7e-06,5e-06,-5e-06,-3e-06,0,1e-06,1e-06,-1e-06,-6e-06,3e-06,1e-06,-4e-06,-4e-06,4e-06,2e-06,-2e-06,-3e-06,2e-06,-3e-06,1e-06,4e-06,-1e-06,0,4e-06,3e-06,3e-06,-3e-06,3e-06,0,4e-06,-4e-06,0,-3e-06,-7e-06,-7e-06,-4e-06,-3e-06,3e-06,2e-06,0,-1e-06,1e-06,-2e-06,-1e-06,-7e-06,2e-06,3e-06,2e-06,0,-2e-06,-5e-06,2e-06,-5e-06,4e-06,2e-06,-2e-06,-4e-06,-1e-06,2e-06,-3e-06,-3e-06,0,2e-06,-3e-06,2e-06,2e-06,-1e-06,4e-06,5e-06,0,-1e-06,4e-06,-3e-06,-3e-06,-3e-06,4e-06,-3e-06,-1e-06,1e-06,-4e-06,0,5e-06,0,5e-06,0,1e-06,1e-06,-2e-06,-9e-06,1e-06,0,3e-06,3e-06,5e-06,-3e-06,-3e-06,1e-06,2e-06,6e-06,-1.7e-05,-3e-06,0,3e-06,-4e-06,1e-06,9e-06,3e-06,-4e-06
2e-06,2e-06,-6e-06,1e-06,0,1e-06,-5e-06,2e-06,0,3e-06,-5e-06,5e-06,2e-06,-3e-06,-2e-06,7e-06,0,2e-06,-5e-06,2e-06,1e-06,3e-06,-1e-06,2e-06,1e-06,7e-06,0,-1e-06,3e-06,2e-06,-2e-06,1e-06,8e-06,-5e-06,-1.1e-05,-4e-06,-5e-06,-1e-06,0,5e-06,1e-06,1e-06,-4e-06,-1e-06,3e-06,-1e-06,8e-06,7e-06,2e-06,6e-06,-6e-06,1e-06,-3e-06,1e-06,-6e-06,-2e-06,-8e-06,1e-06,-6e-06,-3e-06,-2e-06,0,-3e-06,3e-06,4e-06,-1e-06,3e-06,-5e-06,1e-06,-4e-06,-1e-06,-4e-06,-3e-06,-6e-06,0,3e-06,3e-06,1e-06,-4e-06,4e-06,-4e-06,-4e-06,2e-06,3e-06,-5e-06,-6e-06,1e-06,4e-06,-2e-06,4e-06,5e-06,2e-06,1e-06,-5e-06,-3e-06,2e-06,0,-4e-06,-7e-06,-2e-06,1e-06,-7e-06,1e-06,5e-06,1e-06,-6e-06,-1e-06,4e-06,3e-06,-1e-06,0,-1.1e-05,2e-06,3e-06,1e-06,1e-06,7e-06,-1e-06,-8e-06,1e-06,1e-06
2e-06,0,5e-06,-3e-06,-1e-06,1e-06,5e-06,1e-06,0,-1e-06,4e-06,-4e-06,-6e-06,-6e-06,-3e-06,-7e-06,-4e-06,0,0,-3e-06,-3e-06,-3e-06,-1e-06,2e-06,-1e-06,-4e-06,0,2e-06,-5e-06,1e-06,2e-06,1e-06,-1.3e-05,0,4e-06,0,0,2e-06,0,0,-2e-06,-1e-06,-2e-06,4e-06,-4e-06,2e-06,-2e-06,-6e-06,0,-7e-06,4e-06,1e-06,1e-06,1e-06,-3e-06,0,3e-06,2e-06,-1e-06,-3e-06,1e-06,-1e-06,-4e-06,4e-06,-5e-06,3e-06,-2e-06,-1e-06,-1e-06,8e-06,0,0,0,-1e-06,2e-06,-1e-06,0,-2e-06,3e-06,-5e-06,-1e-06,-2e-06,2e-06,-2e-06,-1e-06,-5e-06,-2e-06,-4e-06,-4e-06,-1e-06,4e-06,0,-5e-06,1e-06,1e-06,9e-06,-5e-06,4e-06,2e-06,2e-06,2e-06,0,1e-06,3e-06,-2e-06,3e-06,-2e-06,1e-06,2e-06,1e-06,0,6e-06,1e-05,3e-06,0,2e-06,-4e-06,3e-06,1.2e-05,3e-06,2e-06
1e-06,1e-06,1e-06,3e-06,2e-06,-4e-06,-2e-06,-1e-06,-1e-06,-3e-06,2e-06,4e-06,1e-06,0,1e-06,7e-06,1e-06,-2e-06,-1e-06,3e-06,1e-06,2e-06,1e-06,-3e-06,1e-06,0,-1e-06,-2e-06,4e-06,0,0,1e-06,-2e-06,0,9e-06,0,3e-06,-4e-06,-2e-06,0,-1e-06,0,5e-06,-2e-06,0,6e-06,1e-06,3e-06,0,5e-06,-1e-06,-1e-06,0,0,-1e-06,1e-06,4e-06,-6e-06,2e-06,-3e-06,0,0,-2e-06,-5e-06,4e-06,0,1e-06,3e-06,0,-2e-06,2e-06,2e-06,-1e-06,3e-06,3e-06,-1e-06,-1e-06,2e-06,1e-06,5e-06,3e-06,3e-06,4e-06,2e-06,3e-06,3e-06,3e-06,3e-06,5e-06,1e-06,-7e-06,3e-06,-2e-06,-1e-06,-4e-06,3e-06,0,0,-3e-06,-1e-06,-2e-06,3e-06,-2e-06,0,0,-1e-06,4e-06,-1e-06,0,-1e-06,0,6e-06,0,0,1e-06,0,3e-06,4e-06,-4e-06,0,7e-06
-3e-06,-1e-06,-4e-06,-1e-06,0,1e-06,-2e-06,0,-1e-06,3e-06,2e-06,-3e-06,2e-06,1e-06,-2e-06,-7e-06,4e-06,1e-06,1e-06,1e-06,-1e-06,-3e-06,-3e-06,0,1e-06,3e-06,-1e-06,0,-5e-06,1e-06,1e-06,-1e-06,-2e-06,-2e-06,-1e-06,-2e-06,-4e-06,2e-06,1e-06,0,4e-06,1e-06,1e-06,5e-06,2e-06,1e-06,-2e-06,-3e-06,1e-06,-2e-06,-1e-06,1e-06,2e-06,-1e-06,4e-06,-1e-06,0,3e-06,4e-06,6e-06,1e-06,0,2e-06,3e-06,-3e-06,-2e-06,-3e-06,1e-06,-1e-06,-2e-06,-2e-06,-1e-06,-2e-06,3e-06,-2e-06,1e-06,0,-2e-06,-2e-06,-4e-06,2e-06,0,-4e-06,-4e-06,-2e-06,1e-06,-1e-06,-1e-06,-4e-06,0,-6e-06,-1e-06,0,-3e-06,4e-06,-3e-06,0,0,5e-06,0,-3e-06,6e-06,1e-06,-2e-06,0,-2e-06,-4e-06,-2e-06,0,0,0,-8e-06,-6e-06,0,-2e-06,-1e-06,-2e-06,-3e-06,4e-06,-1e-06,0
0,-1e-06,0,-1e-06,-4e-06,0,2e-06,1e-06,1e-06,-1e-06,1e-06,3e-06,0,3e-06,5e-06,6e-06,0,-1e-06,3e-06,-3e-06,0,1e-06,3e-06,-3e-06,0,-3e-06,1e-06,0,2e-06,-4e-06,0,1e-06,7e-06,0,-8e-06,-1e-06,2e-06,-2e-06,-1e-06,-2e-06,-3e-06,0,-3e-06,-1e-06,-3e-06,-3e-06,1e-06,2e-06,0,2e-06,2e-06,1e-06,-1e-06,-1e-06,4e-06,0,-1e-06,1e-06,4e-06,-1e-06,0,-1e-06,-1e-06,-1e-06,0,0,1e-06,-3e-06,2e-06,-3e-06,0,0,2e-06,0,-1e-06,0,1e-06,1e-06,0,3e-06,-3e-06,3e-06,-3e-06,1e-06,1e-06,1e-06,1e-06,0,0,-2e-06,2e-06,0,4e-06,3e-06,0,-5e-06,-1e-06,-1e-06,1e-06,1e-06,0,1e-06,0,0,0,4e-06,4e-06,2e-06,-4e-06,-1e-06,0,3e-06,0,-3e-06,2e-06,0,-1e-06,-2e-06,-6e-06,-2e-06,-3e-06
-2e-06,0,-2e-06,-2e-06,0,0,-1e-06,0,0,0,-4e-06,-2e-06,-2e-06,-1e-06,-5e-06,-5e-06,0,-1e-06,-2e-06,2e-06,0,0,-1e-06,2e-06,-1e-06,1e-06,-2e-06,0,0,2e-06,-1e-06,0,4e-06,-1e-06,-1e-06,1e-06,1e-06,3e-06,-1e-06,3e-06,1e-06,-1e-06,0,-1e-06,2e-06,0,-1e-06,0,0,2e-06,0,0,0,1e-06,0,1e-06,-2e-06,-3e-06,-5e-06,3e-06,-1e-06,0,1e-06,0,0,2e-06,-1e-06,-1e-06,0,1e-06,0,0,1e-06,-3e-06,0,0,-1e-06,-1e-06,1e-06,-3e-06,-2e-06,-4e-06,-2e-06,-2e-06,0,3e-06,0,1e-06,2e-06,0,4e-06,2e-06,2e-06,0,-3e-06,-4e-06,1e-06,1e-06,-2e-06,-2e-06,2e-06,-6e-06,0,1e-06,-2e-06,-3e-06,-3e-06,-3e-06,3e-06,0,-1e-06,1e-06,0,1e-06,-2e-06,0,1e-06,-1e-06,5e-06,1e-06,-3e-06
3e-06,0,5e-06,-1e-06,-1e-06,2e-06,0,-1e-06,1e-06,2e-06,-1e-06,2e-06,3e-06,-3e-06,5e-06,4e-06,-2e-06,1e-06,-3e-06,0,1e-06,-3e-06,-1e-06,-2e-06,0,1e-06,2e-06,-1e-06,3e-06,1e-06,0,0,1e-06,0,3e-06,-1e-06,0,-2e-06,1e-06,-1e-06,0,1e-06,2e-06,1e-06,0,0,0,0,0,-4e-06,1e-06,-1e-06,0,0,-5e-06,0,1e-06,4e-06,-1e-06,-3e-06,2e-06,0,-5e-06,2e-06,1e-06,-1e-06,-1e-06,-1e-06,-1e-06,5e-06,-1e-06,-1e-06,2e-06,-2e-06,0,0,-1e-06,0,1e-06,3e-06,4e-06,1e-06,1e-06,2e-06,0,-5e-06,-1e-06,-2e-06,-3e-06,0,1e-06,-1e-06,2e-06,0,1e-06,3e-06,0,2e-06,-3e-06,0,1e-06,-3e-06,0,3e-06,1e-06,-2e-06,-1e-06,0,0,-1e-06,0,-6e-06,1e-06,2e-06,1e-06,-1e-06,-1e-06,-1e-06,-4e-06,0,-2e-06
-1e-06,0,-2e-06,1e-06,0,0,-1e-06,0,0,-1e-06,-1e-06,-3e-06,-1e-06,0,-5e-06,-3e-06,-1e-06,0,2e-06,-1e-06,1e-06,2e-06,1e-06,2e-06,-1e-06,-2e-06,0,0,-2e-06,-1e-06,0,-2e-06,-3e-06,2e-06,1e-06,1e-06,-2e-06,1e-06,1e-06,-1e-06,0,0,2e-06,-1e-06,-1e-06,-1e-06,2e-06,1e-06,0,4e-06,-2e-06,1e-06,0,0,-1e-06,-1e-06,0,-2e-06,-2e-06,5e-06,-1e-06,0,0,-3e-06,-2e-06,-1e-06,0,0,1e-06,-3e-06,1e-06,0,0,1e-06,-1e-06,-1e-06,2e-06,2e-06,-2e-06,-3e-06,-3e-06,1e-06,1e-06,-2e-06,0,-2e-06,1e-06,2e-06,3e-06,-1e-06,0,1e-06,-2e-06,2e-06,0,4e-06,-1e-06,-2e-06,0,1e-06,-1e-06,1e-06,-1e-06,1e-06,0,3e-06,2e-06,2e-06,-1e-06,1e-06,1e-06,6e-06,2e-06,0,-1e-06,0,1e-06,1e-06,2e-06,0,3e-06
0,0,0,-1e-06,1e-06,1e-06,2e-06,0,1e-06,-1e-06,1e-06,2e-06,0,2e-06,5e-06,3e-06,0,-1e-06,2e-06,2e-06,-1e-06,-2e-06,0,-1e-06,0,2e-06,1e-06,0,1e-06,1e-06,0,1e-06,-8e-06,0,0,1e-06,2e-06,-1e-06,-1e-06,2e-06,-2e-06,0,1e-06,-1e-06,1e-06,-2e-06,-2e-06,-1e-06,0,-4e-06,2e-06,0,0,0,0,0,1e-06,-1e-06,1e-06,-2e-06,1e-06,0,-1e-06,0,0,1e-06,0,-1e-06,-1e-06,-1e-06,1e-06,0,2e-06,2e-06,0,-1e-06,1e-06,-1e-06,2e-06,3e-06,1e-06,1e-06,2e-06,1e-06,-1e-06,2e-06,-1e-06,-1e-06,-1e-06,0,0,0,-1e-06,0,1e-06,2e-06,1e-06,1e-06,1e-06,-1e-06,0,3e-06,0,-3e-06,0,-2e-06,-2e-06,-2e-06,0,0,0,0,-5e-06,-1e-06,1e-06,0,-2e-06,-1e-06,-3e-06,0,-2e-06
0,-1e-06,0,1e-06,1e-06,0,-2e-06,0,-2e-06,1e-06,3e-06,-2e-06,0,1e-06,-4e-06,-2e-06,2e-06,0,-1e-06,-1e-06,0,2e-06,-2e-06,2e-06,0,-2e-06,-1e-06,0,-1e-06,-2e-06,0,0,1e-06,1e-06,-3e-06,0,0,0,0,-2e-06,1e-06,0,-1e-06,2e-06,-1e-06,-1e-06,2e-06,2e-06,0,3e-06,-1e-06,0,0,0,3e-06,1e-06,0,3e-06,3e-06,0,-1e-06,0,2e-06,2e-06,0,1e-06,-1e-06,0,0,1e-06,0,0,-1e-06,2e-06,-1e-06,-1e-06,-1e-06,0,-1e-06,-3e-06,-1e-06,0,1e-06,0,1e-06,2e-06,1e-06,1e-06,0,0,-2e-06,-1e-06,0,0,-3e-06,0,1e-06,0,1e-06,0,1e-06,3e-06,0,0,0,2e-06,1e-06,0,0,0,0,-4e-06,0,-1e-06,0,0,0,0,2e-06,-1e-06,1e-06
-1e-06,0,-1e-06,-1e-06,1e-06,1e-06,1e-06,0,1e-06,-1e-06,0,2e-06,2e-06,1e-06,4e-06,1e-06,1e-06,1e-06,-1e-06,0,0,-3e-06,2e-06,0,1e-06,0,0,1e-06,1e-06,1e-06,0,0,1e-06,1e-06,0,0,0,-1e-06,1e-06,1e-06,1e-06,1e-06,-2e-06,-1e-06,0,2e-06,-2e-06,-2e-06,0,-1e-06,-1e-06,-1e-06,1e-06,0,3e-06,0,0,-2e-06,0,-4e-06,0,0,-1e-06,-2e-06,0,-1e-06,-1e-06,1e-06,0,1e-06,-1e-06,-1e-06,0,-1e-06,0,0,0,0,1e-06,2e-06,1e-06,-2e-06,-2e-06,1e-06,0,1e-06,-1e-06,0,-1e-06,1e-06,-2e-06,0,2e-06,0,2e-06,-3e-06,-2e-06,0,0,0,0,-1e-06,0,1e-06,0,0,1e-06,0,1e-06,0,0,5e-06,5e-06,1e-06,0,0,1e-06,0,-1e-06,0,-2e-06
0,0,0,1e-06,-1e-06,1e-06,1e-06,-1e-06,0,1e-06,1e-06,-2e-06,-2e-06,0,-3e-06,0,-2e-06,-1e-06,0,1e-06,1e-06,2e-06,0,-1e-06,0,2e-06,1e-06,0,-2e-06,-1e-06,-1e-06,0,6e-06,-1e-06,4e-06,0,-1e-06,1e-06,-1e-06,1e-06,-1e-06,0,2e-06,1e-06,1e-06,2e-06,1e-06,2e-06,0,-1e-06,1e-06,0,-1e-06,0,-2e-06,-1e-06,0,0,-2e-06,1e-06,1e-06,0,0,0,0,-1e-06,1e-06,0,1e-06,0,0,0,-1e-06,-2e-06,1e-06,0,1e-06,0,-2e-06,-1e-06,0,1e-06,-1e-06,-1e-06,-1e-06,-1e-06,0,0,1e-06,0,2e-06,0,2e-06,-1e-06,0,-2e-06,1e-06,0,-1e-06,0,-1e-06,-3e-06,0,1e-06,0,-1e-06,-2e-06,0,-1e-06,0,0,-2e-06,-1e-06,0,0,0,-1e-06,0,0,1e-06,1e-06
-1e-06,0,-1e-06,1e-06,0,-1e-06,-1e-06,1e-06,1e-06,0,-1e-06,2e-06,0,-2e-06,1e-06,0,0,1e-06,0,-1e-06,0,-2e-06,0,0,0,-3e-06,-1e-06,0,2e-06,-1e-06,0,1e-06,0,1e-06,-1e-06,0,1e-06,0,0,-2e-06,-1e-06,0,2e-06,1e-06,-1e-06,0,-1e-06,-2e-06,0,2e-06,-1e-06,0,0,0,-2e-06,1e-06,-1e-06,2e-06,-2e-06,0,-1e-06,0,-2e-06,1e-06,1e-06,1e-06,1e-06,-1e-06,-1e-06,-3e-06,0,0,0,-1e-06,0,0,0,0,1e-06,-1e-06,-3e-06,0,0,1e-06,1e-06,-1e-06,0,1e-06,-2e-06,0,3e-06,0,0,0,0,-1e-06,2e-06,-1e-06,0,1e-06,0,-2e-06,0,0,0,-1e-06,2e-06,0,1e-06,0,0,-2e-06,-3e-06,0,0,1e-06,2e-06,0,0,0,-1e-06
1e-06,0,3e-06,-1e-06,0,0,-1e-06,0,0,-1e-06,-2e-06,-1e-06,1e-06,0,-1e-06,1e-06,0,1e-06,1e-06,1e-06,-1e-06,1e-06,0,-1e-06,0,2e-06,1e-06,0,-1e-06,1e-06,0,0,-2e-06,-1e-06,-4e-06,0,-1e-06,0,0,2e-06,1e-06,0,-2e-06,-2e-06,1e-06,-1e-06,1e-06,1e-06,0,-3e-06,1e-06,0,-1e-06,0,-1e-06,0,1e-06,-3e-06,0,-1e-06,1e-06,0,-1e-06,-1e-06,-1e-06,0,0,0,0,2e-06,0,-1e-06,-1e-06,1e-06,-1e-06,1e-06,-1e-06,0,0,1e-06,4e-06,1e-06,0,1e-06,0,0,1e-06,-1e-06,2e-06,0,-1e-06,-1e-06,-1e-06,0,0,1e-06,-1e-06,1e-06,-1e-06,0,1e-06,1e-06,0,-1e-06,0,2e-06,-1e-06,1e-06,-1e-06,0,0,5e-06,1e-06,1e-06,0,0,0,0,0,0,2e-06
0,0,-1e-06,1e-06,-1e-06,1e-06,2e-06,-1e-06,0,1e-06,0,1e-06,0,1e-06,0,-2e-06,0,0,0,0,0,0,0,0,-1e-06,0,0,0,1e-06,-1e-06,0,0,-5e-06,-1e-06,1e-06,0,-1e-06,0,0,0,0,0,-1e-06,1e-06,0,0,-1e-06,-1e-06,0,3e-06,-1e-06,0,0,0,1e-06,-1e-06,0,2e-06,2e-06,1e-06,-1e-06,0,1e-06,1e-06,0,-1e-06,1e-06,1e-06,0,2e-06,0,0,0,2e-06,0,1e-06,0,0,0,-1e-06,-2e-06,-1e-06,1e-06,-1e-06,0,1e-06,-1e-06,1e-06,-1e-06,0,-1e-06,0,-2e-06,-1e-06,0,3e-06,-1e-06,-1e-06,2e-06,-1e-06,1e-06,2e-06,0,0,0,-2e-06,-1e-06,0,1e-06,0,0,-3e-06,1e-06,-1e-06,0,0,-1e-06,0,1e-06,0,-1e-06
1e-06,0,0,-1e-06,-1e-06,0,-2e-06,0,0,0,0,-1e-06,-2e-06,1e-06,1e-06,2e-06,1e-06,0,-1e-06,-1e-06,0,0,-1e-06,0,0,-2e-06,1e-06,0,-1e-06,1e-06,0,0,-1e-06,0,1e-06,0,1e-06,0,0,-1e-06,-1e-06,0,2e-06,0,-1e-06,0,1e-06,1e-06,0,-2e-06,1e-06,0,0,0,2e-06,0,0,1e-06,1e-06,0,1e-06,0,-1e-06,0,1e-06,0,0,0,0,-1e-06,0,0,0,1e-06,1e-06,0,1e-06,-1e-06,-1e-06,1e-06,0,0,1e-06,1e-06,1e-06,1e-06,0,0,-1e-06,0,0,0,0,1e-06,0,1e-06,1e-06,0,1e-06,0,0,1e-06,0,0,0,2e-06,2e-06,0,0,0,0,0,0,1e-06,1e-06,0,1e-06,0,-1e-06,0,1e-06
0,0,-1e-06,0,0,-1e-06,0,0,0,-1e-06,2e-06,1e-06,1e-06,0,-2e-06,-2e-06,0,0,0,1e-06,0,1e-06,1e-06,0,1e-06,2e-06,0,0,1e-06,-1e-06,0,0,3e-06,-1e-06,2e-06,0,0,0,0,2e-06,1e-06,0,1e-06,-1e-06,1e-06,-1e-06,1e-06,0,0,1e-06,-1e-06,0,-1e-06,0,0,0,-1e-06,-2e-06,0,3e-06,0,0,0,-1e-06,-2e-06,1e-06,0,-1e-06,0,-1e-06,0,0,0,-1e-06,0,0,0,0,0,-1e-06,0,0,-1e-06,-1e-06,0,0,1e-06,0,1e-06,0,0,-1e-06,0,1e-06,0,-1e-06,-1e-06,1e-06,0,1e-06,-1e-06,-1e-06,0,0,0,-1e-06,-3e-06,0,-1e-06,0,0,3e-06,-1e-06,0,-1e-06,0,-2e-06,0,2e-06,0,-1e-06
-1e-06,0,0,0,0,1e-06,0,0,1e-06,1e-06,1e-06,-1e-06,1e-06,-1e-06,3e-06,3e-06,-2e-06,0,1e-06,-1e-06,0,-1e-06,-1e-06,0,-1e-06,-1e-06,0,-1e-06,0,0,0,0,3e-06,0,0,0,-1e-06,-1e-06,0,-1e-06,0,0,-1e-06,1e-06,-1e-06,-1e-06,-2e-06,0,0,0,-1e-06,0,0,0,-2e-06,0,0,2e-06,-2e-06,-2e-06,0,0,-1e-06,1e-06,1e-06,0,0,0,0,-1e-06,0,0,0,-2e-06,0,0,0,0,1e-06,1e-06,0,0,-1e-06,1e-06,0,0,-1e-06,0,-2e-06,-1e-06,0,0,1e-06,0,1e-06,-2e-06,-2e-06,0,-2e-06,-1e-06,0,-2e-06,0,0,0,0,2e-06,0,1e-06,0,0,-4e-06,0,0,1e-06,0,0,0,-1e-06,0,1e-06
1e-06,0,0,0,0,0,0,0,0,0,0,1e-06,-1e-06,0,-3e-06,-3e-06,0,0,0,0,0,1e-06,1e-06,1e-06,0,0,1e-06,0,1e-06,1e-06,0,0,3e-06,1e-06,-3e-06,0,1e-06,1e-06,0,0,0,0,-1e-06,0,0,0,1e-06,0,0,-2e-06,1e-06,0,0,0,-1e-06,-1e-06,1e-06,-1e-06,-1e-06,1e-06,1e-06,0,0,0,-1e-06,-1e-06,0,1e-06,0,1e-06,0,0,1e-06,-1e-06,-1e-06,0,1e-06,0,-1e-06,-2e-06,0,1e-06,0,-1e-06,0,-1e-06,1e-06,0,1e-06,0,1e-06,-1e-06,0,0,-1e-06,-1e-06,1e-06,0,1e-06,0,1e-06,-1e-06,0,-1e-06,0,-1e-06,0,0,-1e-06,0,0,1e-06,0,0,-1e-06,0,0,0,1e-06,0,-1e-06
0,0,-1e-06,0,0,-1e-06,-1e-06,0,0,0,0,-1e-06,0,0,4e-06,3e-06,1e-06,0,0,1e-06,0,-2e-06,0,-1e-06,0,1e-06,-1e-06,0,-1e-06,-1e-06,0,0,-3e-06,0,0,0,1e-06,-1e-06,0,1e-06,0,0,0,-1e-06,1e-06,0,-1e-06,-1e-06,0,3e-06,-1e-06,0,0,0,0,0,0,-2e-06,2e-06,-2e-06,-1e-06,0,-1e-06,-1e-06,0,0,0,0,-1e-06,0,0,0,0,1e-06,0,0,0,0,1e-06,3e-06,-2e-06,-1e-06,1e-06,1e-06,0,0,0,0,-1e-06,0,0,-1e-06,0,0,0,1e-06,1e-06,0,0,0,0,1e-06,0,0,0,2e-06,-1e-06,0,1e-06,0,0,2e-06,0,-1e-06,1e-06,0,0,0,-2e-06,0,1e-06
