7e-06,2.4e-05,1.7e-05,9e-06,1.6e-05,7e-06,1.9e-05,1.4e-05,2e-06,9e-06,1.3e-05,5e-06,1.9e-05,7e-06,1.4e-05,1e-06,1e-05,1.3e-05,2.5e-05,4.1e-05,3e-06,1.2e-05,0,2.1e-05,2.2e-05,9e-06,6e-06,2.3e-05,2.3e-05,1e-06,1.1e-05,5e-06,4e-06,1.5e-05,1.2e-05,4e-06,1.6e-05,3e-06,2.7e-05,1.1e-05,3.5e-05,2.9e-05,1.9e-05,7e-06,1.6e-05,1.8e-05,1.6e-05,6e-06,2.2e-05,1.1e-05,5e-06,1.5e-05,2e-06,8e-06,4e-06,2e-05,2.2e-05,1.1e-05,6e-06,3e-06,1.6e-05,7e-06,3e-06,1.1e-05,1.9e-05,3e-06,1.5e-05,2.5e-05,1.5e-05,1.5e-05,1.4e-05,1.2e-05,4e-06,2.3e-05,2.6e-05,3.1e-05,3.6e-05,1.4e-05,2.8e-05,5e-06,4.1e-05,1.5e-05,2.8e-05,2.7e-05,2e-06,2e-05,2.6e-05,1.9e-05,2.6e-05,4e-06,4.1e-05,5e-06,1.2e-05,1.1e-05,2e-06,4.2e-05,3e-06,1e-05,5e-06,1e-06,5.6e-05,3e-06,2.2e-05,4e-06,1.5e-05,1.7e-05,1.3e-05,2e-06,1.1e-05,8e-06,8e-06,5e-06,1.1e-05,1.2e-05,9e-06,4e-06,9e-06,9e-06,6e-06,0,3e-06
3.9e-05,4.4e-05,9.1e-05,5.9e-05,8.1e-05,4e-05,3.8e-05,6e-05,2.5e-05,2.8e-05,5.4e-05,2.1e-05,0.000102,5.1e-05,1.4e-05,3.5e-05,5.4e-05,7.9e-05,8.6e-05,9.6e-05,8.5e-05,3.8e-05,4.5e-05,6.2e-05,0.000108,9e-06,7.3e-05,8.3e-05,8.9e-05,3.9e-05,4.3e-05,4e-05,2.7e-05,1.3e-05,2.6e-05,2.8e-05,7e-06,1.8e-05,4.9e-05,2.9e-05,6.6e-05,3.7e-05,7e-05,1e-05,1.4e-05,4.9e-05,3e-05,4.2e-05,3.4e-05,4.1e-05,4.2e-05,2.2e-05,1.8e-05,3.8e-05,2e-05,3.5e-05,3.9e-05,7e-06,9e-06,6e-06,2.5e-05,3.9e-05,5.1e-05,2.3e-05,2.9e-05,4.2e-05,9.4e-05,2.7e-05,5.1e-05,2.6e-05,3.3e-05,8e-06,3e-05,5.4e-05,1.3e-05,5.9e-05,4e-05,7.2e-05,1.7e-05,4.8e-05,6.5e-05,3.4e-05,5.8e-05,3.5e-05,3.3e-05,4.5e-05,1.6e-05,4.8e-05,5e-05,4.7e-05,7e-05,7.2e-05,1.6e-05,1e-04,3.4e-05,6.4e-05,7e-05,1.2e-05,9e-05,4e-05,0.000108,5.9e-05,4e-05,2e-05,3.3e-05,3.4e-05,2.6e-05,3.4e-05,2.6e-05,3.8e-05,2.7e-05,1.5e-05,2.4e-05,2.6e-05,2.2e-05,5e-06,2.9e-05,1.7e-05,3.4e-05,2.7e-05,8e-06
4.4e-05,6.3e-05,2.4e-05,5.3e-05,4e-05,5e-05,1.2e-05,3.1e-05,4e-05,6e-05,2.8e-05,8.8e-05,8e-05,6.5e-05,5.7e-05,6e-05,7.9e-05,8.3e-05,5.7e-05,8.2e-05,2.3e-05,2.9e-05,4.1e-05,1.9e-05,7.5e-05,1.4e-05,8.8e-05,7.4e-05,0.000151,4.3e-05,5.2e-05,3.3e-05,5.9e-05,7.2e-05,3.9e-05,1.4e-05,9e-06,2.2e-05,1.3e-05,2e-05,0.000102,1.9e-05,3.6e-05,1.3e-05,1.9e-05,3.9e-05,5e-05,1.7e-05,4.6e-05,1.8e-05,6.7e-05,1.7e-05,2e-05,3.1e-05,2.5e-05,3e-05,9.4e-05,4.3e-05,3.5e-05,8e-06,2.1e-05,1.2e-05,2.3e-05,3.6e-05,4.2e-05,4.1e-05,7.2e-05,4.4e-05,2.5e-05,2.5e-05,2.8e-05,3.8e-05,1.4e-05,4e-05,2.1e-05,5.1e-05,6e-06,2.6e-05,3.7e-05,5.2e-05,2.7e-05,3.6e-05,4.6e-05,1.6e-05,4.3e-05,2.4e-05,1.8e-05,3.8e-05,6.8e-05,2.6e-05,6.4e-05,2.8e-05,6.9e-05,0.000161,0.000128,1.1e-05,2.1e-05,7.7e-05,0.000104,0.000105,4.9e-05,7.6e-05,0.000108,7.4e-05,4.5e-05,4.4e-05,4.6e-05,3.3e-05,6.6e-05,2.1e-05,5.6e-05,2.6e-05,8e-06,2.1e-05,3.6e-05,6e-06,1.4e-05,3.1e-05,1e-05,2e-05,4.5e-05
0.000116,8.8e-05,8.7e-05,4.4e-05,3.5e-05,0.000107,4.2e-05,4.6e-05,2.9e-05,1.3e-05,4.4e-05,5.2e-05,0.000119,4.4e-05,4.4e-05,0.000111,0.000137,0.000132,0.000148,8.9e-05,0.00013,0.000104,0.000168,0.00016,5.4e-05,0.000142,0.000116,4.5e-05,0.000226,0.000176,0.00015,0.000126,0.000144,7.9e-05,6.8e-05,6.6e-05,4e-05,2e-05,3.3e-05,5.3e-05,5.8e-05,1e-05,8e-05,1.6e-05,2.8e-05,9e-06,8e-06,7e-06,2.1e-05,3.6e-05,7.3e-05,7.2e-05,5.4e-05,6.6e-05,4.1e-05,4.6e-05,3.7e-05,1.6e-05,2.4e-05,2.4e-05,1.4e-05,1.4e-05,4e-06,1.2e-05,2.4e-05,5.3e-05,8.3e-05,9e-05,0.000109,7.1e-05,6.5e-05,1e-05,3.4e-05,4.8e-05,4.5e-05,7.3e-05,6e-05,2.2e-05,2.7e-05,1.4e-05,2.2e-05,6.1e-05,8.7e-05,2.9e-05,3.8e-05,2.3e-05,4.7e-05,2.1e-05,9.6e-05,0.000114,4.7e-05,5e-05,0.000103,7.7e-05,6.3e-05,8.5e-05,7.6e-05,0.000107,9.6e-05,0.00021,0.00012,0.000134,0.000127,8.9e-05,8.7e-05,8.2e-05,9.4e-05,5.4e-05,8.9e-05,1e-04,4.8e-05,4.2e-05,3.6e-05,6.1e-05,4.5e-05,4.1e-05,4.9e-05,3.5e-05,3.3e-05,2.7e-05,3.3e-05
9.9e-05,4.4e-05,0.000114,5.7e-05,4.9e-05,0.000126,0.000103,6.7e-05,1.7e-05,4.7e-05,5.1e-05,9.1e-05,0.000129,5.3e-05,1.4e-05,9.2e-05,9.6e-05,1.4e-05,0.000173,7e-05,3.7e-05,1.4e-05,0.000148,0.000114,0.00018,0.000173,5.2e-05,0.000112,0.000232,0.000124,0.000122,0.000126,7e-05,8.8e-05,5.3e-05,1.5e-05,7e-05,0.000107,3.5e-05,4.8e-05,8.2e-05,5.6e-05,0.000124,5e-05,3.8e-05,6.8e-05,8e-06,1.1e-05,6.4e-05,4.9e-05,1.6e-05,2.7e-05,2.6e-05,2.4e-05,2.5e-05,4.2e-05,6.4e-05,1.6e-05,2.4e-05,1.9e-05,2.7e-05,9e-06,2.6e-05,3.1e-05,3.5e-05,5.6e-05,1.6e-05,4.5e-05,7.9e-05,2.5e-05,7.8e-05,3.4e-05,7.2e-05,1.1e-05,4.1e-05,4.5e-05,3e-05,2.5e-05,3.6e-05,8e-06,6.4e-05,3e-05,1.1e-05,1.3e-05,2.5e-05,3.7e-05,3.2e-05,1.3e-05,6.3e-05,5.7e-05,0.000144,9.3e-05,0.000188,0.000151,8.6e-05,4.6e-05,0.000104,1.2e-05,3.1e-05,0.000224,0.000171,0.000153,3.7e-05,7.6e-05,6.7e-05,2.1e-05,3e-05,2.4e-05,4.4e-05,2.7e-05,4.3e-05,5.1e-05,4.9e-05,9.4e-05,4.1e-05,4.6e-05,5.3e-05,5.7e-05,4.3e-05,3.1e-05,7e-06
0.000133,9.2e-05,0.000123,7.8e-05,8.2e-05,4.8e-05,6.8e-05,6.3e-05,2.5e-05,8.9e-05,7.2e-05,0.00012,0.000234,7.7e-05,5.9e-05,7.5e-05,0.000168,0.000108,0.000204,3.4e-05,0.00011,0.000101,0.000161,0.000106,0.000168,0.000201,5.8e-05,0.00019,0.000261,0.000238,0.00013,9.7e-05,0.000106,5e-05,0.000115,6.6e-05,0.000119,4.2e-05,5.5e-05,5.1e-05,0.000118,8.5e-05,9.8e-05,7.8e-05,3e-05,5.8e-05,4.8e-05,4.4e-05,4e-06,6.1e-05,7.9e-05,4.5e-05,3.8e-05,3.6e-05,1.5e-05,1.2e-05,9.1e-05,3.8e-05,5.1e-05,1.6e-05,2.2e-05,4.2e-05,3e-05,4.4e-05,6.6e-05,1.7e-05,5.7e-05,5.9e-05,3.7e-05,3.4e-05,6e-05,3.2e-05,7.9e-05,7.3e-05,6.4e-05,4.2e-05,8e-06,3.2e-05,3.9e-05,4e-05,7.1e-05,4.9e-05,2.6e-05,4e-06,4e-05,3.5e-05,5.9e-05,4.2e-05,3.1e-05,9e-06,0.000164,0.000119,0.000112,0.000121,7e-05,3.7e-05,0.000106,9.2e-05,9.7e-05,0.000214,0.000106,0.000152,0.000117,0.000145,9.1e-05,0.000124,5.6e-05,5.8e-05,6e-05,4.9e-05,4.7e-05,3e-05,8.8e-05,4.3e-05,4.6e-05,3.6e-05,2.7e-05,4.4e-05,4.6e-05,0.000127,4.2e-05
0.000269,0.00011,0.000277,0.000288,0.000213,0.000126,1.9e-05,0.000118,7.9e-05,0.000175,8.9e-05,9.2e-05,0.000263,0.000252,0.000126,0.000206,0.000199,0.000161,0.000237,0.000192,0.000285,0.000212,0.000443,0.000244,0.000618,0.000163,0.00034,0.000194,0.000501,0.000424,0.000466,0.000402,0.000274,0.00025,0.000303,0.000244,0.000258,0.000253,0.000135,3e-05,0.000243,0.000143,0.000114,0.000131,0.000138,0.000108,4.6e-05,4.9e-05,4.9e-05,0.000109,0.000203,0.000119,3e-05,2.9e-05,4e-05,6e-05,9.1e-05,0.000103,5.4e-05,9e-05,4.7e-05,5.7e-05,6.8e-05,4.7e-05,8.9e-05,8.1e-05,5.5e-05,9.7e-05,2e-05,5.9e-05,4.8e-05,2.6e-05,0.000104,7.5e-05,2.4e-05,9.2e-05,5e-05,6.1e-05,6.7e-05,5.8e-05,0.000102,9.8e-05,0.000101,2.7e-05,7.6e-05,9.4e-05,7.8e-05,3.6e-05,1.2e-05,3.9e-05,0.000142,8.8e-05,0.00014,4e-05,4.7e-05,9.2e-05,0.000192,6.7e-05,8.7e-05,0.000159,0.000124,0.000182,9.7e-05,0.000119,7.6e-05,0.000136,8.8e-05,0.000144,1.9e-05,1.8e-05,8.2e-05,8.1e-05,7.9e-05,0.000114,0.000104,6.4e-05,4.2e-05,3.7e-05,5.4e-05,0.000172,0.000122
9.9e-05,0.000239,0.000303,9.6e-05,3.2e-05,6.2e-05,1.3e-05,0.000174,0.000122,0.00012,0.000173,0.000124,0.000138,0.00028,0.000171,0.000378,0.000172,0.00036,0.000272,0.000286,0.000364,0.000376,0.00048,0.000327,0.000779,0.000708,0.000584,0.00041,0.000401,0.000113,0.000318,6.5e-05,0.000115,0.000249,0.000318,0.000182,0.000157,0.000138,0.000115,8.2e-05,0.000321,0.000232,0.000139,0.000195,0.000181,9e-05,6.2e-05,8.6e-05,0.000161,0.000228,0.000108,3.8e-05,4e-05,7.4e-05,6.9e-05,0.000159,7.9e-05,0.000177,0.000141,5.3e-05,4.8e-05,7.6e-05,0.000121,0.000129,6.3e-05,7.3e-05,3.3e-05,6.6e-05,0.000135,3.9e-05,6.5e-05,5.6e-05,0.000123,5.8e-05,5.9e-05,7.1e-05,6.1e-05,5.9e-05,8.9e-05,2.6e-05,7e-05,2.4e-05,5.3e-05,3.6e-05,0.000109,5.4e-05,9e-05,7.9e-05,3.9e-05,2e-05,2e-05,2.5e-05,1.4e-05,6.7e-05,0.000135,2.4e-05,0.000113,0.000111,6.6e-05,0.000116,0.000149,3.6e-05,9.4e-05,6.1e-05,3.3e-05,5.5e-05,1.8e-05,9.6e-05,9.5e-05,5.5e-05,0.000158,0.000173,1e-04,6.4e-05,4e-05,7.7e-05,8e-05,5.5e-05,5.9e-05,0.000153,0.000108
0.000203,0.000423,0.000185,0.000154,9.1e-05,0.000157,9.9e-05,0.000188,0.000108,0.000228,0.000117,0.000109,0.000254,0.000192,0.000297,0.000242,0.000407,0.000326,4.2e-05,0.000366,0.00027,0.000321,0.000562,0.000523,0.000649,0.000426,0.000728,0.000229,0.000238,0.000413,0.000146,0.000178,0.000158,0.000293,3.6e-05,0.000184,0.00014,0.000189,0.000201,0.000246,0.00016,0.000214,6.7e-05,6.7e-05,0.000144,5.9e-05,0.000139,5e-05,7e-05,8.2e-05,0.000225,0.000172,0.00012,3.8e-05,0.000139,0.00014,0.000146,0.000104,5.6e-05,9.1e-05,8.3e-05,5.2e-05,9e-05,0.000107,0.00022,0.000107,3.4e-05,0.000157,0.000251,0.000221,0.000189,6.5e-05,0.000104,0.000108,0.000126,8e-05,0.000182,0.000151,5.8e-05,6.9e-05,6.6e-05,2.4e-05,7.9e-05,8.2e-05,0.000107,0.000118,5.2e-05,2.3e-05,5e-05,2e-05,7.8e-05,8.3e-05,7.5e-05,4e-05,0.000105,0.000116,3.3e-05,0.000112,0.000113,0.000138,3.5e-05,8.1e-05,1e-05,2e-06,5.4e-05,3.7e-05,5.1e-05,1.4e-05,4.8e-05,9.3e-05,0.000147,8.9e-05,1.4e-05,8.4e-05,4.8e-05,7.3e-05,6.6e-05,9.2e-05,4.9e-05,0.00011,4.1e-05
0.000165,0.000263,0.000276,0.000376,0.000289,0.000133,7.5e-05,0.000156,0.000105,0.000228,0.000309,0.000368,0.000392,0.000281,0.000283,0.000389,0.000299,0.000502,0.000482,0.00055,0.000596,0.000469,0.000491,0.000141,0.000635,0.000389,0.000722,0.000557,0.00038,0.000389,0.000152,7e-05,0.00016,0.000443,0.000335,0.000176,8.7e-05,0.000278,0.000115,0.00012,0.000191,0.00013,7.2e-05,6.8e-05,0.000177,0.000133,0.000138,0.000203,9.7e-05,5.4e-05,0.000121,0.000116,0.000149,0.000168,2e-04,0.000132,0.000193,0.000225,0.00013,0.000114,6.8e-05,2e-05,5.5e-05,1.9e-05,0.000144,0.000225,0.000193,0.000229,0.000227,7.9e-05,3.6e-05,9e-05,0.000105,4.1e-05,0.000169,0.000147,0.000203,0.00024,0.000189,0.000122,0.000154,0.000157,0.000191,0.000189,0.000147,0.000177,0.000204,0.000146,7.7e-05,6.4e-05,7e-05,7.6e-05,0.000119,9.4e-05,9.4e-05,8.3e-05,5.9e-05,9.8e-05,0.000102,0.000109,9.7e-05,9.3e-05,5.1e-05,5.4e-05,9.5e-05,4.8e-05,6.5e-05,8.2e-05,4.1e-05,0.000117,0.00013,0.000108,6.2e-05,5.6e-05,0.000133,3.4e-05,4e-05,9.3e-05,0.000147,0.000149,0.000153
0.000115,7.6e-05,1.9e-05,0.000202,0.000122,0.000108,6.8e-05,0.000137,0.000138,7.1e-05,0.000112,0.000115,0.000142,0.000215,3.4e-05,0.000219,7.6e-05,0.000344,0.000353,4.1e-05,0.000254,0.000162,5.4e-05,5e-05,0.000348,0.000312,3e-04,9.4e-05,0.000166,0.000157,0.000149,0.00018,0.000168,0.000128,5.1e-05,8.1e-05,9.5e-05,9.8e-05,4.4e-05,0.000105,5.2e-05,3.7e-05,9.3e-05,0.00014,0.000166,0.000128,8e-05,0.000122,0.000143,0.000116,3.6e-05,0.000124,2.4e-05,0.000102,6.9e-05,2.5e-05,0.000142,7.4e-05,7e-06,4.1e-05,4.8e-05,4.9e-05,6.7e-05,8e-05,6.3e-05,0.000148,8.1e-05,0.000248,0.000131,4.1e-05,1.8e-05,7.1e-05,4.5e-05,8.9e-05,0.000125,0.000108,6.6e-05,8.4e-05,6.6e-05,4.6e-05,5.4e-05,7.4e-05,8.5e-05,0.000127,0.000126,5.5e-05,9.7e-05,8.6e-05,9.7e-05,3.3e-05,6.1e-05,0.00015,8.6e-05,3.4e-05,8.3e-05,3.6e-05,7.2e-05,1.9e-05,5e-05,8.1e-05,6.5e-05,7.6e-05,7.8e-05,5e-05,2.6e-05,1.8e-05,6.1e-05,1.8e-05,8.8e-05,0.000147,0.000107,5.4e-05,2.8e-05,3.5e-05,8.5e-05,6.7e-05,6.6e-05,4.3e-05,6.1e-05,4.9e-05,9.5e-05
3e-06,3.4e-05,3.8e-05,6.1e-05,5.3e-05,9e-05,7.9e-05,5.1e-05,4.9e-05,8.9e-05,8.4e-05,2.4e-05,3.5e-05,7e-05,1.7e-05,0.000137,0.000166,9e-05,0.00014,8.4e-05,9.6e-05,0.00012,0.000172,8.6e-05,0.000201,0.000186,0.00016,0.000158,9e-05,0.000111,8.8e-05,3.8e-05,3.5e-05,2.1e-05,6.9e-05,6e-05,3.9e-05,4.8e-05,3.9e-05,6.9e-05,6.8e-05,9e-05,5.6e-05,6.9e-05,5.7e-05,2.6e-05,4.6e-05,0.000146,8.5e-05,4.5e-05,9.8e-05,9.2e-05,8.6e-05,2.2e-05,4.8e-05,3.2e-05,0.000134,9.3e-05,1.1e-05,2.8e-05,3.4e-05,1.2e-05,6.1e-05,5e-05,9.9e-05,4e-05,7.6e-05,1e-04,4.1e-05,7.7e-05,4.1e-05,3.7e-05,1.6e-05,5.6e-05,7.9e-05,1.1e-05,4.6e-05,4.6e-05,3.4e-05,3.3e-05,5.2e-05,3.1e-05,7.5e-05,6.1e-05,3.7e-05,7.8e-05,7.4e-05,1.5e-05,2.3e-05,2.1e-05,3e-05,9.3e-05,7.7e-05,1.3e-05,2.7e-05,2.8e-05,6.8e-05,5.6e-05,4.7e-05,2.8e-05,9.1e-05,9e-06,4.4e-05,1.7e-05,4.1e-05,4.1e-05,3.6e-05,4.3e-05,7.2e-05,4.7e-05,4.5e-05,6e-05,4.6e-05,8e-06,7.5e-05,2.9e-05,5.1e-05,3e-05,3.4e-05,8.3e-05,4e-06
2e-05,8.9e-05,0.000108,0.000117,7.4e-05,9.6e-05,0.000105,8.3e-05,9.3e-05,7.5e-05,6.1e-05,2.4e-05,3.9e-05,4e-05,5.8e-05,2.2e-05,7.9e-05,0.000123,0.000113,5e-05,0.000147,7.5e-05,0.00012,0.000117,4.4e-05,0.000122,5.8e-05,6.3e-05,0.000114,9.7e-05,6.9e-05,4.5e-05,7.8e-05,0.000122,2.8e-05,4.5e-05,3.9e-05,6.4e-05,7.5e-05,3.5e-05,4.7e-05,3.5e-05,8.9e-05,3.7e-05,4.9e-05,3.8e-05,5.7e-05,2.7e-05,7.6e-05,2e-06,2.1e-05,7e-05,3.2e-05,4.4e-05,6.7e-05,3.5e-05,5.2e-05,5e-05,4.8e-05,4e-05,5.2e-05,2.6e-05,4.4e-05,3e-05,0.000114,8.3e-05,9.3e-05,4.2e-05,3.4e-05,6.8e-05,4.3e-05,1.2e-05,2.3e-05,4.3e-05,6.7e-05,6.6e-05,6.5e-05,3.2e-05,1.7e-05,2.6e-05,5.3e-05,4.8e-05,3.7e-05,3e-05,2.1e-05,2.1e-05,3.2e-05,4e-05,5.3e-05,2.6e-05,4.5e-05,8.8e-05,4e-05,7.6e-05,5.2e-05,5.1e-05,9e-06,2.2e-05,3e-05,3.8e-05,5.4e-05,4.6e-05,2.4e-05,2.4e-05,5.7e-05,4.3e-05,5.9e-05,1.5e-05,5.7e-05,2.4e-05,5.8e-05,5.6e-05,2.3e-05,5.5e-05,9e-06,2.1e-05,3.3e-05,1.3e-05,1.8e-05,2.4e-05,9e-06
4.5e-05,4.8e-05,4.6e-05,8.5e-05,1.1e-05,6e-05,4.5e-05,1.9e-05,3.5e-05,2.4e-05,3.2e-05,4.6e-05,9e-06,6.9e-05,3.7e-05,5e-05,5.5e-05,2.4e-05,1e-05,3.7e-05,0.000162,5.9e-05,2.4e-05,5.7e-05,2.8e-05,0.000128,2.2e-05,3.3e-05,5.8e-05,4.8e-05,8.5e-05,4.6e-05,0.000104,7.1e-05,2e-05,4.5e-05,1.6e-05,2.3e-05,3.9e-05,2.9e-05,4.5e-05,1.4e-05,3.1e-05,1.7e-05,3.7e-05,3.1e-05,2.5e-05,3.6e-05,9e-05,4.3e-05,4.6e-05,1.7e-05,7.5e-05,4.3e-05,2.9e-05,2e-05,4e-05,2e-05,1.4e-05,2.9e-05,1.1e-05,9e-06,7e-06,1.2e-05,7.8e-05,2.8e-05,5.5e-05,3.6e-05,4.9e-05,1.2e-05,2.5e-05,3.4e-05,1.6e-05,8e-06,2.1e-05,2.6e-05,4.7e-05,5e-06,1.6e-05,1.5e-05,4.2e-05,1.8e-05,3.6e-05,1.2e-05,2e-06,9e-06,3.7e-05,4.2e-05,4e-05,2.8e-05,1.7e-05,5.7e-05,1.4e-05,3.3e-05,1.8e-05,1.3e-05,1.1e-05,3.4e-05,2e-06,8e-06,5.1e-05,3.1e-05,2.5e-05,3.6e-05,1.2e-05,5.6e-05,1.2e-05,3.7e-05,6e-05,3.1e-05,1.7e-05,3e-05,1.8e-05,3.6e-05,3.8e-05,2.2e-05,2.1e-05,1.4e-05,1.9e-05,2e-05,1.8e-05
3.6e-05,5.6e-05,5.6e-05,5.9e-05,1.7e-05,1.2e-05,5.5e-05,1.9e-05,3.5e-05,1.7e-05,2.7e-05,3.1e-05,1.3e-05,4.5e-05,9e-06,6.2e-05,4.6e-05,8.4e-05,7.4e-05,8.1e-05,8.8e-05,7e-05,4.9e-05,8.2e-05,3.7e-05,0.000162,4.3e-05,6.8e-05,1.5e-05,4.7e-05,8.5e-05,9.1e-05,3.6e-05,4e-05,3e-05,6.5e-05,3.7e-05,4.1e-05,5.6e-05,1.8e-05,1.7e-05,4e-05,1.7e-05,3e-05,4.6e-05,2e-05,2.3e-05,3e-05,4.5e-05,2.8e-05,5.7e-05,5e-05,1.8e-05,5.9e-05,1.7e-05,8e-06,5.1e-05,2.7e-05,2.3e-05,3.9e-05,2.1e-05,1.2e-05,1.3e-05,5e-06,1.6e-05,2.1e-05,5.2e-05,3.7e-05,5.3e-05,2.5e-05,1.2e-05,1.9e-05,1.5e-05,2e-05,2.3e-05,2.5e-05,2.3e-05,3.4e-05,2.8e-05,8e-06,1.1e-05,2.2e-05,4e-05,3.5e-05,2.2e-05,1.8e-05,4.1e-05,3.7e-05,6e-06,2.8e-05,1.8e-05,3.6e-05,3.2e-05,3.7e-05,1.3e-05,2.1e-05,2.8e-05,4.7e-05,1.6e-05,8e-06,4.6e-05,7e-06,5.2e-05,2.3e-05,1e-06,1.3e-05,2e-05,2.7e-05,2.6e-05,2.6e-05,3.6e-05,2.5e-05,3.3e-05,2.4e-05,2.9e-05,1.7e-05,1.3e-05,2.3e-05,2.1e-05,3.7e-05,3.3e-05
5.8e-05,2e-05,2e-05,1.2e-05,1.5e-05,2.6e-05,1.8e-05,2.3e-05,3.3e-05,2e-05,2.3e-05,1.7e-05,3.8e-05,6.1e-05,1.6e-05,9e-06,3.4e-05,6.3e-05,2.7e-05,2.4e-05,8.7e-05,7.3e-05,7.3e-05,6.2e-05,5.8e-05,0.000129,3.7e-05,8.7e-05,9.3e-05,3.6e-05,7.4e-05,7e-05,2.5e-05,0.000115,5.2e-05,5.6e-05,3.3e-05,2.4e-05,1.5e-05,3.6e-05,2.9e-05,3.4e-05,3.3e-05,2.1e-05,3e-05,1.5e-05,2.3e-05,4.6e-05,2.1e-05,1.9e-05,1.5e-05,3.3e-05,5.1e-05,5.9e-05,4.2e-05,3.8e-05,3.5e-05,1.6e-05,1.1e-05,2.9e-05,2.8e-05,3.9e-05,4.6e-05,1.6e-05,3e-05,2e-06,9e-06,3e-05,1.7e-05,2.3e-05,1.5e-05,2e-06,1.1e-05,9e-06,2e-05,3.2e-05,2.4e-05,2.3e-05,9e-06,2.2e-05,2.1e-05,2.7e-05,3.6e-05,2.5e-05,2e-06,2e-06,4.8e-05,4.1e-05,1.4e-05,2.5e-05,2.1e-05,2.5e-05,1.7e-05,1.9e-05,9e-06,4.3e-05,4.3e-05,4.7e-05,3.6e-05,3.1e-05,4.7e-05,4.2e-05,4.5e-05,4.1e-05,3.9e-05,2e-05,4e-06,2.5e-05,1.1e-05,2e-05,1e-05,2.4e-05,1.7e-05,2.4e-05,1.8e-05,1.5e-05,1.9e-05,1.2e-05,1.1e-05,2.1e-05,3.4e-05
2e-05,2.3e-05,1.9e-05,2.3e-05,2.2e-05,4.2e-05,2.1e-05,9e-06,1.4e-05,2.5e-05,2e-05,1.4e-05,2.6e-05,9.3e-05,5.9e-05,2.4e-05,2.6e-05,1.4e-05,7.8e-05,7.7e-05,6.7e-05,3.6e-05,6.9e-05,2.9e-05,3.2e-05,2.4e-05,6.1e-05,3e-05,6.5e-05,1e-04,7.8e-05,2.2e-05,3.6e-05,9.4e-05,4.6e-05,5.6e-05,1.3e-05,1.1e-05,1.1e-05,2e-05,1.2e-05,2e-05,2.4e-05,4.4e-05,4.4e-05,1.3e-05,3.7e-05,5e-06,1.2e-05,1e-05,1.8e-05,3e-05,4.1e-05,3.2e-05,2.4e-05,2.8e-05,2.8e-05,2.1e-05,8e-06,3.8e-05,2.2e-05,1.8e-05,5.2e-05,3.5e-05,3.1e-05,2.2e-05,4e-05,2e-05,2e-05,2.9e-05,2.7e-05,9e-06,2.1e-05,1.2e-05,2.3e-05,2e-05,2.5e-05,1.2e-05,2.7e-05,1.9e-05,5e-06,2.5e-05,1.6e-05,2e-05,3.1e-05,1.8e-05,4.7e-05,3.1e-05,9e-06,1.1e-05,1.5e-05,6.5e-05,4e-05,9e-06,1.5e-05,3.1e-05,4.1e-05,9e-06,1.7e-05,1.9e-05,2.8e-05,3.6e-05,1.9e-05,2.3e-05,3.1e-05,1e-05,1e-05,3.2e-05,1.9e-05,1.9e-05,8e-06,1.4e-05,2e-05,1.6e-05,8e-06,2.5e-05,1.2e-05,9e-06,2.4e-05,1.2e-05,3.9e-05
2.7e-05,5.1e-05,4.3e-05,6e-05,4.8e-05,2.7e-05,1.7e-05,1.2e-05,3.3e-05,9e-06,1.4e-05,1.8e-05,3.6e-05,3.6e-05,3.6e-05,2.1e-05,1.5e-05,3.1e-05,3.7e-05,7.5e-05,0.000113,6e-06,1.9e-05,7.4e-05,5.4e-05,8.7e-05,2.8e-05,4.9e-05,2.8e-05,5.9e-05,2.4e-05,3.3e-05,2.2e-05,6e-06,2.4e-05,3.4e-05,1.1e-05,1e-05,1e-05,1.6e-05,1.5e-05,1.5e-05,1.6e-05,2.4e-05,3.2e-05,4.6e-05,5.6e-05,5.6e-05,2.4e-05,2.5e-05,2e-05,1.1e-05,3.8e-05,1.5e-05,5e-05,2.5e-05,2.4e-05,1.7e-05,2.4e-05,4e-05,1.8e-05,9e-06,6.2e-05,4.1e-05,3.5e-05,4.6e-05,6e-06,1e-05,2.1e-05,1.4e-05,1.5e-05,2.2e-05,8e-06,7e-06,2.7e-05,7e-06,2.6e-05,6e-06,3e-05,3.5e-05,2.2e-05,3.5e-05,3.5e-05,1e-05,2.7e-05,2.8e-05,2.6e-05,2.7e-05,2.5e-05,1.7e-05,9e-06,3.2e-05,4e-05,1.7e-05,1.1e-05,1.4e-05,2.4e-05,7e-06,2.4e-05,2.6e-05,3.4e-05,3.2e-05,2.5e-05,3e-06,5e-06,1.8e-05,6e-06,1.7e-05,3.1e-05,2.1e-05,3.3e-05,1.3e-05,2.8e-05,2.1e-05,3.4e-05,1.5e-05,1.7e-05,8e-06,1.8e-05,3.2e-05,1.6e-05
6e-05,4.6e-05,2.6e-05,8.4e-05,2.2e-05,5.9e-05,5.6e-05,2.3e-05,5.4e-05,5.3e-05,5.7e-05,1.6e-05,4.3e-05,5.9e-05,5e-05,4.4e-05,1.7e-05,4.9e-05,4.9e-05,7.6e-05,8.4e-05,4.8e-05,3.6e-05,4.8e-05,1.3e-05,5e-05,1.8e-05,8.3e-05,2.9e-05,6.1e-05,5.6e-05,4.3e-05,2.2e-05,6.6e-05,3e-05,2.2e-05,3.8e-05,2.8e-05,1.3e-05,3.5e-05,3.2e-05,2e-05,2.2e-05,4e-05,5e-06,4.1e-05,2.5e-05,7e-06,2.7e-05,1.9e-05,3.2e-05,1.1e-05,1.5e-05,3.7e-05,5.7e-05,1.7e-05,1.6e-05,4e-06,2.3e-05,1e-05,2.2e-05,1.9e-05,3.7e-05,6e-06,2.7e-05,5.1e-05,3.9e-05,2.9e-05,5e-06,1.5e-05,1.1e-05,1.4e-05,2.5e-05,1.2e-05,2.1e-05,9e-06,1.8e-05,2.7e-05,1.9e-05,5e-06,2.7e-05,2.3e-05,7e-06,9e-06,1.7e-05,3.1e-05,8e-06,2e-05,8e-06,1.1e-05,2e-05,2.8e-05,7.6e-05,3.8e-05,1.3e-05,5e-05,3.3e-05,4e-05,4.3e-05,1.4e-05,1e-05,2.9e-05,1.6e-05,8e-06,2.2e-05,2.4e-05,2.5e-05,2.1e-05,1.7e-05,1e-06,2.7e-05,1.7e-05,1.2e-05,3.4e-05,3.8e-05,3.9e-05,1.3e-05,2.2e-05,2.5e-05,8e-06,1.9e-05
3.7e-05,7e-05,7.1e-05,3.8e-05,3.6e-05,4.5e-05,1.6e-05,1.7e-05,5.4e-05,7.1e-05,4e-06,1.5e-05,2.2e-05,5.3e-05,1.8e-05,1.4e-05,4.8e-05,6e-05,3.5e-05,6e-05,6.1e-05,1.1e-05,5.5e-05,2.8e-05,4.9e-05,5.9e-05,1.1e-05,4.9e-05,2.9e-05,3.5e-05,2.7e-05,3.6e-05,2.6e-05,3.9e-05,6.4e-05,4.7e-05,4.2e-05,2.2e-05,2.6e-05,5.6e-05,4e-05,3.8e-05,2.3e-05,1.8e-05,2.4e-05,3.6e-05,4.3e-05,3.1e-05,2.4e-05,1.6e-05,3.3e-05,1.9e-05,2.4e-05,4.4e-05,2.2e-05,1.2e-05,2.8e-05,2.1e-05,7e-06,2.3e-05,3.1e-05,1.9e-05,2.4e-05,2.9e-05,5.4e-05,7e-06,9e-06,2.1e-05,4e-06,7e-06,9e-06,2e-05,1.8e-05,1.4e-05,2e-06,1.1e-05,1e-05,2.3e-05,2.6e-05,2.4e-05,3.4e-05,2.1e-05,2e-05,1e-05,7e-06,1.1e-05,2.4e-05,7e-06,9e-06,1e-05,2.3e-05,8.9e-05,0.000129,0.000142,9.8e-05,4.2e-05,3.3e-05,4.4e-05,2.9e-05,1.2e-05,2.3e-05,4.8e-05,5.8e-05,5.9e-05,3.6e-05,7e-06,1.8e-05,2.1e-05,1.3e-05,2.4e-05,8e-06,1.2e-05,5e-06,2.3e-05,1.5e-05,1.6e-05,1.7e-05,2e-06,5e-06,4e-06,3.1e-05
2.2e-05,3.7e-05,4.5e-05,1.7e-05,3.7e-05,2e-05,2.2e-05,5e-06,3.8e-05,6e-06,1.8e-05,7e-06,2e-05,1.1e-05,5.4e-05,2.7e-05,2.1e-05,6e-06,4.3e-05,3.8e-05,6.3e-05,3.1e-05,4.9e-05,4.7e-05,1.9e-05,7.7e-05,4.8e-05,3.9e-05,2.6e-05,3e-06,4.4e-05,2.6e-05,2.3e-05,3.2e-05,2.1e-05,2.3e-05,3.7e-05,1.7e-05,2.5e-05,3.3e-05,4.4e-05,2.6e-05,1.8e-05,7e-06,2.3e-05,3.7e-05,3.2e-05,1.2e-05,4.3e-05,2.5e-05,2.3e-05,2.4e-05,2.6e-05,2.1e-05,2.3e-05,3.3e-05,2e-05,1.9e-05,8e-06,2.2e-05,2.2e-05,2.2e-05,2.3e-05,3.1e-05,3e-05,3e-06,1.2e-05,1.1e-05,2.3e-05,9e-06,1.3e-05,2.5e-05,1.1e-05,3e-06,2e-05,3.1e-05,1.8e-05,1.1e-05,1.5e-05,7e-06,1.7e-05,2e-05,3e-05,1.1e-05,1.5e-05,1.6e-05,1.5e-05,1.7e-05,2.2e-05,1.2e-05,1.8e-05,8.5e-05,3.1e-05,6.4e-05,2.7e-05,4e-05,2.9e-05,2.2e-05,2.9e-05,7e-06,2.6e-05,3.2e-05,3.6e-05,1.6e-05,1e-05,1e-05,2.1e-05,7e-06,1.2e-05,1.8e-05,3e-05,2.7e-05,2e-05,1.7e-05,3.5e-05,2.9e-05,3.6e-05,8e-06,3e-06,1.7e-05,2.2e-05
1.9e-05,5.6e-05,5.2e-05,3.8e-05,5.8e-05,3.6e-05,1.2e-05,3.2e-05,1.7e-05,6e-05,3.2e-05,1.6e-05,1.6e-05,3.2e-05,6.4e-05,3.5e-05,2.9e-05,2.7e-05,3.3e-05,2.9e-05,5e-05,6e-06,3.3e-05,9e-06,3.9e-05,9.4e-05,2.9e-05,5.1e-05,1.7e-05,5.7e-05,5.7e-05,4.8e-05,3.2e-05,7.4e-05,7.3e-05,4.5e-05,3.3e-05,5.1e-05,3.2e-05,2.9e-05,3e-05,1.1e-05,5e-06,2e-05,2.9e-05,3e-06,4.2e-05,2.7e-05,5.9e-05,2.3e-05,1.4e-05,1.7e-05,1.7e-05,5.5e-05,1.4e-05,3.7e-05,2.5e-05,6e-06,4.7e-05,3.1e-05,1e-05,8e-06,3.1e-05,2e-06,6e-06,2.4e-05,4e-05,2.6e-05,1.5e-05,5.1e-05,2.3e-05,2.3e-05,3.7e-05,3.3e-05,1.8e-05,5e-05,3.9e-05,2.6e-05,3.1e-05,2.4e-05,1.2e-05,2.3e-05,7e-06,3.4e-05,3.5e-05,1.7e-05,2.3e-05,1.5e-05,3.9e-05,5e-06,2e-05,4.9e-05,3.6e-05,3.9e-05,4.3e-05,9e-06,1.2e-05,5e-06,3.1e-05,1.9e-05,4e-05,3.5e-05,2.2e-05,2.8e-05,3.2e-05,1.8e-05,2.9e-05,3e-05,1e-05,2.4e-05,2.5e-05,2e-05,1.4e-05,3e-05,2.9e-05,2.4e-05,4.8e-05,3.2e-05,9e-06,2.6e-05,4e-05
2.6e-05,3.3e-05,5.3e-05,6.4e-05,3e-05,2.2e-05,2.1e-05,2.3e-05,2.2e-05,3.3e-05,3.2e-05,1.9e-05,1.7e-05,2.9e-05,1.8e-05,1.4e-05,2.3e-05,3.8e-05,2.7e-05,1e-05,1.2e-05,1.8e-05,1.2e-05,2.5e-05,3e-05,6.5e-05,4.4e-05,5e-05,2.4e-05,3.9e-05,5.3e-05,7.9e-05,4.4e-05,4.6e-05,8.6e-05,6.7e-05,5.6e-05,3.6e-05,1.9e-05,1.1e-05,1.9e-05,2e-05,1.7e-05,6e-06,1.8e-05,2.4e-05,2.7e-05,1.6e-05,4.2e-05,4e-05,3.1e-05,2.3e-05,3e-05,5.2e-05,3.7e-05,9e-06,1.3e-05,1.6e-05,2.6e-05,3.1e-05,3.2e-05,1.9e-05,2.3e-05,2.1e-05,3e-05,2.4e-05,1e-05,1.2e-05,1.8e-05,3.4e-05,2e-05,5e-06,2e-05,9e-06,6e-06,2.7e-05,2.3e-05,4e-06,1.4e-05,2.9e-05,2.9e-05,2.7e-05,2.2e-05,2e-05,8e-06,1e-05,1.7e-05,1.2e-05,2.1e-05,1.5e-05,1.4e-05,8e-06,1.2e-05,2.1e-05,2.2e-05,2.4e-05,1.4e-05,1e-05,1.5e-05,1.9e-05,2.2e-05,1.6e-05,2.6e-05,7e-06,1.1e-05,7e-06,1.5e-05,1.8e-05,2.3e-05,1.9e-05,2.4e-05,1.8e-05,8e-06,2.2e-05,3.1e-05,2.4e-05,3.7e-05,4.6e-05,4.2e-05,3.4e-05,3.1e-05
3.4e-05,3.1e-05,2.2e-05,2.7e-05,1.9e-05,1.9e-05,5e-06,1.2e-05,4e-06,2.3e-05,9e-06,1.2e-05,2.2e-05,7e-06,9e-06,1.9e-05,8e-06,1.5e-05,1.6e-05,4e-06,1.1e-05,8e-06,1.6e-05,1.6e-05,2e-05,3.1e-05,3.1e-05,1.8e-05,1.5e-05,2.1e-05,2.5e-05,3.5e-05,3.7e-05,4.8e-05,2.2e-05,7e-06,1.4e-05,8e-06,5e-06,5e-06,1.1e-05,1.9e-05,2e-06,9e-06,1e-05,8e-06,1.5e-05,8e-06,2.3e-05,1.3e-05,1.3e-05,6e-06,1.7e-05,2.4e-05,1.8e-05,1.8e-05,4e-06,7e-06,2e-05,7e-06,1.2e-05,6e-06,7e-06,1.3e-05,1.9e-05,2e-05,1.8e-05,1.9e-05,8e-06,1.5e-05,8e-06,7e-06,1.1e-05,1.8e-05,1.3e-05,1.6e-05,1e-05,1e-05,1.5e-05,1.6e-05,1e-05,1e-05,1.1e-05,5e-06,3e-06,8e-06,5e-06,6e-06,8e-06,9e-06,1e-06,9e-06,1.4e-05,1e-05,2e-06,1.3e-05,1e-05,1e-06,1.8e-05,1.3e-05,6e-06,1.2e-05,1.7e-05,1.2e-05,1.3e-05,3e-06,8e-06,5e-06,1.4e-05,7e-06,1.2e-05,1.6e-05,1.2e-05,1.5e-05,1.6e-05,1.6e-05,1.3e-05,1.7e-05,1.7e-05,1e-05,1e-05
1.1e-05,1.1e-05,7e-06,1.1e-05,6e-06,1e-05,8e-06,2e-06,7e-06,4e-06,1.2e-05,1.7e-05,9e-06,9e-06,1.2e-05,1.1e-05,8e-06,8e-06,1.1e-05,6e-06,1.5e-05,4e-06,1.3e-05,1.9e-05,5e-06,1.2e-05,7e-06,2e-06,9e-06,8e-06,1.3e-05,1.5e-05,1.3e-05,1.2e-05,1.4e-05,1e-06,5e-06,4e-06,8e-06,5e-06,7e-06,9e-06,9e-06,4e-06,6e-06,2e-06,1e-05,4e-06,4e-06,7e-06,6e-06,3e-06,4e-06,9e-06,7e-06,4e-06,1e-05,8e-06,4e-06,6e-06,3e-06,8e-06,6e-06,1e-05,1.5e-05,1e-05,1e-05,4e-06,6e-06,8e-06,4e-06,3e-06,6e-06,4e-06,4e-06,8e-06,3e-06,3e-06,7e-06,9e-06,4e-06,9e-06,3e-06,3e-06,6e-06,5e-06,3e-06,1e-06,1e-06,2e-06,4e-06,7e-06,5e-06,8e-06,3e-06,6e-06,8e-06,4e-06,1.1e-05,6e-06,4e-06,1.2e-05,6e-06,5e-06,8e-06,6e-06,4e-06,5e-06,8e-06,2e-06,6e-06,8e-06,3e-06,5e-06,5e-06,6e-06,8e-06,1e-05,8e-06,6e-06,7e-06
1.3e-05,4e-06,4e-06,8e-06,7e-06,1e-05,3e-06,2e-06,7e-06,4e-06,7e-06,1e-05,8e-06,1e-06,8e-06,1e-05,2e-06,6e-06,7e-06,6e-06,1.7e-05,5e-06,8e-06,1.1e-05,4e-06,1.7e-05,2e-06,4e-06,1e-06,1.5e-05,5e-06,9e-06,9e-06,1.1e-05,7e-06,5e-06,4e-06,2e-06,6e-06,2e-06,4e-06,2e-06,2e-06,9e-06,7e-06,6e-06,6e-06,5e-06,9e-06,6e-06,5e-06,3e-06,5e-06,6e-06,9e-06,6e-06,5e-06,5e-06,5e-06,3e-06,2e-06,7e-06,4e-06,1.3e-05,1.3e-05,1.1e-05,6e-06,6e-06,3e-06,9e-06,1e-06,3e-06,5e-06,8e-06,5e-06,9e-06,3e-06,1e-06,4e-06,5e-06,3e-06,5e-06,4e-06,3e-06,1e-06,3e-06,4e-06,1e-06,3e-06,1e-06,4e-06,1.3e-05,9e-06,6e-06,6e-06,4e-06,7e-06,8e-06,1e-05,7e-06,5e-06,1.2e-05,7e-06,4e-06,2e-06,5e-06,1e-06,2e-06,4e-06,3e-06,9e-06,2e-06,3e-06,5e-06,4e-06,1e-06,5e-06,7e-06,5e-06,6e-06,3e-06
8e-06,4e-06,2e-06,9e-06,6e-06,3e-06,4e-06,2e-06,4e-06,4e-06,7e-06,1.1e-05,5e-06,5e-06,4e-06,8e-06,4e-06,6e-06,5e-06,6e-06,2e-05,2e-06,6e-06,1.3e-05,2e-06,1.7e-05,5e-06,5e-06,8e-06,1.8e-05,4e-06,1.4e-05,7e-06,7e-06,4e-06,5e-06,3e-06,4e-06,4e-06,8e-06,4e-06,3e-06,4e-06,6e-06,7e-06,5e-06,7e-06,2e-06,3e-06,4e-06,5e-06,1e-06,4e-06,5e-06,4e-06,4e-06,3e-06,4e-06,5e-06,1e-06,3e-06,5e-06,1e-06,8e-06,1e-05,8e-06,3e-06,6e-06,2e-06,7e-06,2e-06,4e-06,4e-06,2e-06,2e-06,4e-06,2e-06,0,2e-06,4e-06,1e-06,4e-06,4e-06,4e-06,3e-06,4e-06,5e-06,2e-06,3e-06,2e-06,3e-06,1.6e-05,3e-06,1e-05,5e-06,5e-06,5e-06,3e-06,4e-06,4e-06,4e-06,8e-06,5e-06,3e-06,7e-06,6e-06,2e-06,4e-06,2e-06,2e-06,6e-06,2e-06,1e-06,3e-06,5e-06,2e-06,3e-06,8e-06,3e-06,6e-06,5e-06
1.1e-05,1e-06,4e-06,7e-06,4e-06,4e-06,4e-06,1e-06,5e-06,5e-06,7e-06,1.1e-05,6e-06,6e-06,6e-06,8e-06,4e-06,3e-06,9e-06,5e-06,1.9e-05,1e-06,5e-06,9e-06,5e-06,2.3e-05,3e-06,8e-06,5e-06,1e-05,3e-06,9e-06,3e-06,6e-06,4e-06,4e-06,2e-06,6e-06,1e-06,1.1e-05,2e-06,4e-06,4e-06,5e-06,1.1e-05,4e-06,8e-06,8e-06,3e-06,6e-06,9e-06,4e-06,6e-06,7e-06,6e-06,7e-06,6e-06,2e-06,2e-06,2e-06,4e-06,2e-06,2e-06,5e-06,7e-06,8e-06,5e-06,4e-06,4e-06,5e-06,1e-06,3e-06,4e-06,5e-06,1e-06,1e-06,1e-06,0,1e-06,4e-06,2e-06,3e-06,5e-06,2e-06,0,3e-06,2e-06,1e-06,2e-06,1e-06,4e-06,1.3e-05,8e-06,4e-06,6e-06,1e-06,0,2e-06,6e-06,6e-06,3e-06,9e-06,7e-06,6e-06,3e-06,5e-06,3e-06,2e-06,2e-06,4e-06,7e-06,3e-06,2e-06,2e-06,3e-06,1e-06,3e-06,6e-06,6e-06,9e-06,3e-06
9e-06,1e-06,5e-06,6e-06,5e-06,4e-06,1e-06,1e-06,5e-06,3e-06,5e-06,9e-06,4e-06,6e-06,7e-06,9e-06,2e-06,4e-06,7e-06,7e-06,1.7e-05,3e-06,4e-06,1e-05,5e-06,2.1e-05,5e-06,3e-06,7e-06,1.3e-05,3e-06,5e-06,4e-06,7e-06,1e-06,4e-06,2e-06,8e-06,7e-06,1.2e-05,1.6e-05,9e-06,8e-06,6e-06,5e-06,2e-06,6e-06,8e-06,8e-06,5e-06,5e-06,3e-06,3e-06,5e-06,5e-06,9e-06,3e-06,4e-06,3e-06,1e-06,4e-06,5e-06,2e-06,5e-06,1e-05,6e-06,4e-06,4e-06,2e-06,5e-06,2e-06,2e-06,1e-06,2e-06,1e-06,2e-06,1e-06,1e-06,1e-06,2e-06,3e-06,4e-06,5e-06,4e-06,3e-06,4e-06,3e-06,2e-06,2e-06,2e-06,3e-06,1.4e-05,5e-06,6e-06,3e-06,4e-06,3e-06,2e-06,5e-06,7e-06,4e-06,4e-06,8e-06,4e-06,6e-06,4e-06,0,1e-06,4e-06,1e-06,6e-06,4e-06,1e-06,4e-06,3e-06,1e-06,4e-06,3e-06,2e-06,6e-06,3e-06
7e-06,3e-06,2e-06,8e-06,4e-06,4e-06,1e-06,1e-06,3e-06,3e-06,4e-06,7e-06,5e-06,5e-06,8e-06,3e-06,3e-06,7e-06,7e-06,4e-06,1.8e-05,4e-06,6e-06,8e-06,6e-06,2e-05,1e-06,2e-06,6e-06,1.1e-05,2e-06,6e-06,3e-06,5e-06,3e-06,5e-06,2e-06,6e-06,4e-06,3e-06,9e-06,5e-06,1e-06,2e-06,5e-06,8e-06,4e-06,1e-06,8e-06,1e-06,6e-06,2e-06,3e-06,8e-06,3e-06,5e-06,2e-06,2e-06,3e-06,1e-06,2e-06,4e-06,3e-06,4e-06,1e-05,4e-06,4e-06,3e-06,1e-06,5e-06,1e-06,2e-06,3e-06,4e-06,1e-06,2e-06,3e-06,1e-06,0,2e-06,3e-06,4e-06,2e-06,2e-06,2e-06,5e-06,4e-06,1e-06,2e-06,2e-06,4e-06,1.1e-05,7e-06,2e-06,2e-06,0,1e-06,2e-06,5e-06,6e-06,4e-06,3e-06,6e-06,4e-06,3e-06,5e-06,2e-06,2e-06,3e-06,1e-06,5e-06,2e-06,4e-06,3e-06,3e-06,2e-06,4e-06,2e-06,3e-06,6e-06,4e-06
7e-06,1e-06,3e-06,6e-06,3e-06,3e-06,2e-06,1e-06,4e-06,4e-06,3e-06,5e-06,3e-06,1e-06,7e-06,5e-06,2e-06,5e-06,1.2e-05,7e-06,1.7e-05,4e-06,6e-06,1e-05,7e-06,1.4e-05,4e-06,4e-06,5e-06,1.4e-05,4e-06,8e-06,2e-06,4e-06,6e-06,2e-06,1e-06,4e-06,1.3e-05,7e-06,3e-06,6e-06,3e-06,3e-06,5e-06,7e-06,3e-06,6e-06,5e-06,6e-06,4e-06,4e-06,4e-06,5e-06,4e-06,1e-06,4e-06,3e-06,2e-06,2e-06,4e-06,2e-06,2e-06,7e-06,7e-06,7e-06,7e-06,4e-06,4e-06,6e-06,1e-06,2e-06,1e-06,5e-06,1e-06,1e-06,3e-06,1e-06,0,2e-06,2e-06,1e-06,2e-06,2e-06,3e-06,6e-06,2e-06,2e-06,3e-06,1e-06,4e-06,9e-06,5e-06,5e-06,4e-06,2e-06,1e-06,3e-06,2e-06,5e-06,3e-06,5e-06,7e-06,2e-06,2e-06,4e-06,1e-06,3e-06,2e-06,2e-06,4e-06,1e-06,2e-06,4e-06,2e-06,2e-06,5e-06,5e-06,1e-06,4e-06,4e-06
1e-05,1e-06,6e-06,6e-06,3e-06,4e-06,2e-06,2e-06,1e-06,6e-06,3e-06,6e-06,3e-06,6e-06,4e-06,7e-06,2e-06,3e-06,8e-06,4e-06,1.5e-05,5e-06,7e-06,9e-06,7e-06,2.2e-05,9e-06,3e-06,4e-06,6e-06,3e-06,6e-06,2e-06,5e-06,3e-06,4e-06,3e-06,4e-06,8e-06,4e-06,6e-06,7e-06,4e-06,1e-06,2e-06,3e-06,4e-06,5e-06,3e-06,1e-06,6e-06,1e-06,4e-06,3e-06,5e-06,1e-06,3e-06,2e-06,3e-06,1e-06,3e-06,4e-06,1e-06,6e-06,7e-06,5e-06,6e-06,5e-06,2e-06,5e-06,2e-06,3e-06,4e-06,3e-06,3e-06,3e-06,3e-06,1e-06,3e-06,3e-06,1e-06,5e-06,3e-06,3e-06,0,5e-06,2e-06,1e-06,1e-06,1e-06,5e-06,1.1e-05,3e-06,3e-06,3e-06,2e-06,2e-06,2e-06,6e-06,6e-06,2e-06,5e-06,4e-06,3e-06,3e-06,5e-06,1e-06,1e-06,5e-06,2e-06,3e-06,2e-06,1e-06,3e-06,3e-06,3e-06,6e-06,4e-06,1e-06,5e-06,4e-06
7e-06,1e-06,5e-06,3e-06,2e-06,4e-06,2e-06,0,3e-06,4e-06,3e-06,4e-06,2e-06,6e-06,6e-06,6e-06,5e-06,5e-06,7e-06,4e-06,1.5e-05,4e-06,7e-06,1e-05,6e-06,1.9e-05,5e-06,5e-06,3e-06,1.1e-05,2e-06,7e-06,2e-06,6e-06,1e-06,5e-06,4e-06,5e-06,6e-06,8e-06,3e-06,7e-06,3e-06,6e-06,6e-06,3e-06,4e-06,3e-06,3e-06,3e-06,4e-06,1e-06,2e-06,4e-06,1e-06,3e-06,4e-06,1e-06,1e-06,3e-06,3e-06,3e-06,2e-06,5e-06,8e-06,4e-06,4e-06,3e-06,1e-06,6e-06,2e-06,3e-06,3e-06,2e-06,2e-06,1e-06,3e-06,2e-06,2e-06,2e-06,2e-06,0,2e-06,1e-06,2e-06,4e-06,3e-06,2e-06,2e-06,0,3e-06,9e-06,4e-06,4e-06,4e-06,0,3e-06,1e-06,3e-06,5e-06,2e-06,5e-06,7e-06,3e-06,4e-06,3e-06,4e-06,3e-06,5e-06,2e-06,5e-06,2e-06,3e-06,2e-06,2e-06,2e-06,3e-06,3e-06,2e-06,5e-06,6e-06
8e-06,2e-06,4e-06,3e-06,8e-06,6e-06,3e-06,4e-06,4e-06,4e-06,5e-06,7e-06,7e-06,3e-06,7e-06,6e-06,6e-06,3e-06,1e-05,5e-06,1.4e-05,2e-06,7e-06,1e-05,2e-06,2.2e-05,8e-06,5e-06,4e-06,7e-06,2e-06,7e-06,0,1e-05,2e-06,6e-06,2e-06,3e-06,7e-06,7e-06,5e-06,2e-06,5e-06,1e-05,4e-06,5e-06,3e-06,2e-06,4e-06,4e-06,5e-06,1e-06,3e-06,6e-06,3e-06,4e-06,3e-06,1e-06,4e-06,2e-06,2e-06,2e-06,3e-06,5e-06,5e-06,4e-06,4e-06,6e-06,3e-06,4e-06,3e-06,2e-06,1e-06,4e-06,2e-06,2e-06,6e-06,2e-06,2e-06,3e-06,3e-06,3e-06,1e-06,2e-06,2e-06,3e-06,4e-06,2e-06,3e-06,1e-06,0,6e-06,2e-06,1e-06,4e-06,3e-06,2e-06,2e-06,4e-06,2e-06,3e-06,5e-06,6e-06,1e-06,2e-06,2e-06,3e-06,2e-06,3e-06,1e-06,6e-06,2e-06,4e-06,2e-06,2e-06,1e-06,4e-06,4e-06,2e-06,2e-06,4e-06
8e-06,2e-06,4e-06,8e-06,2e-06,3e-06,2e-06,3e-06,4e-06,1e-06,4e-06,9e-06,6e-06,6e-06,8e-06,7e-06,5e-06,4e-06,1.1e-05,6e-06,1.4e-05,1e-06,4e-06,1.3e-05,7e-06,2.4e-05,5e-06,6e-06,3e-06,1.3e-05,5e-06,9e-06,2e-06,9e-06,2e-06,4e-06,0,2e-06,7e-06,3e-06,4e-06,2e-06,5e-06,5e-06,5e-06,3e-06,2e-06,3e-06,2e-06,2e-06,3e-06,2e-06,1e-06,6e-06,1e-06,4e-06,2e-06,3e-06,2e-06,2e-06,5e-06,5e-06,3e-06,3e-06,6e-06,7e-06,5e-06,3e-06,2e-06,2e-06,2e-06,5e-06,4e-06,1e-06,2e-06,3e-06,5e-06,2e-06,2e-06,4e-06,3e-06,3e-06,2e-06,3e-06,3e-06,1e-06,4e-06,2e-06,4e-06,1e-06,1e-06,7e-06,3e-06,1e-06,3e-06,3e-06,3e-06,3e-06,7e-06,3e-06,2e-06,6e-06,7e-06,2e-06,4e-06,2e-06,2e-06,2e-06,3e-06,2e-06,5e-06,2e-06,2e-06,5e-06,1e-06,1e-06,3e-06,4e-06,2e-06,5e-06,4e-06
8e-06,2e-06,6e-06,8e-06,4e-06,4e-06,2e-06,2e-06,4e-06,2e-06,4e-06,1e-05,3e-06,5e-06,8e-06,4e-06,2e-06,4e-06,9e-06,7e-06,1.4e-05,1e-06,4e-06,9e-06,1e-06,1.5e-05,9e-06,6e-06,8e-06,1e-05,4e-06,5e-06,1e-06,7e-06,3e-06,8e-06,3e-06,2e-06,3e-06,1e-06,3e-06,1e-06,2e-06,7e-06,7e-06,6e-06,2e-06,2e-06,3e-06,3e-06,5e-06,2e-06,1e-06,8e-06,3e-06,4e-06,1e-06,1e-06,1e-06,2e-06,2e-06,6e-06,2e-06,4e-06,6e-06,5e-06,2e-06,2e-06,4e-06,0,3e-06,3e-06,2e-06,2e-06,1e-06,3e-06,4e-06,2e-06,1e-06,4e-06,3e-06,4e-06,2e-06,3e-06,2e-06,4e-06,2e-06,4e-06,1e-06,1e-06,3e-06,5e-06,1e-06,2e-06,2e-06,2e-06,2e-06,1e-06,4e-06,5e-06,1e-06,5e-06,7e-06,3e-06,5e-06,3e-06,1e-06,2e-06,4e-06,2e-06,5e-06,1e-06,2e-06,2e-06,2e-06,0,3e-06,3e-06,2e-06,4e-06,5e-06
8e-06,1e-06,2e-06,5e-06,5e-06,3e-06,0,1e-06,3e-06,4e-06,4e-06,9e-06,3e-06,4e-06,6e-06,6e-06,2e-06,2e-06,7e-06,3e-06,1.2e-05,1e-06,5e-06,7e-06,4e-06,1.7e-05,8e-06,4e-06,7e-06,1.3e-05,2e-06,7e-06,5e-06,6e-06,5e-06,4e-06,1e-06,2e-06,1e-06,2e-06,2e-06,3e-06,2e-06,2e-06,6e-06,2e-06,4e-06,7e-06,6e-06,1e-06,2e-06,2e-06,1e-06,7e-06,2e-06,2e-06,3e-06,2e-06,4e-06,1e-06,2e-06,3e-06,2e-06,5e-06,7e-06,3e-06,2e-06,4e-06,2e-06,4e-06,1e-06,4e-06,4e-06,1e-06,1e-06,1e-06,3e-06,1e-06,0,2e-06,1e-06,2e-06,1e-06,2e-06,1e-06,3e-06,2e-06,1e-06,2e-06,1e-06,3e-06,8e-06,2e-06,2e-06,2e-06,0,1e-06,1e-06,2e-06,4e-06,3e-06,4e-06,4e-06,1e-06,3e-06,2e-06,2e-06,2e-06,3e-06,2e-06,5e-06,2e-06,1e-06,2e-06,1e-06,1e-06,2e-06,1e-06,1e-06,2e-06,4e-06
7e-06,1e-06,4e-06,6e-06,3e-06,4e-06,1e-06,1e-06,2e-06,4e-06,3e-06,7e-06,2e-06,3e-06,5e-06,6e-06,1e-06,2e-06,7e-06,3e-06,1.6e-05,2e-06,6e-06,7e-06,4e-06,1.8e-05,7e-06,8e-06,3e-06,8e-06,5e-06,7e-06,4e-06,9e-06,4e-06,8e-06,0,2e-06,1e-06,1e-06,4e-06,4e-06,2e-06,4e-06,3e-06,3e-06,4e-06,2e-06,2e-06,2e-06,2e-06,3e-06,4e-06,2e-06,3e-06,1e-06,3e-06,2e-06,3e-06,1e-06,1e-06,3e-06,2e-06,2e-06,8e-06,3e-06,3e-06,4e-06,1e-06,2e-06,1e-06,2e-06,3e-06,3e-06,1e-06,2e-06,2e-06,1e-06,0,0,3e-06,5e-06,2e-06,3e-06,2e-06,3e-06,4e-06,1e-06,1e-06,1e-06,2e-06,8e-06,1e-06,2e-06,2e-06,1e-06,0,1e-06,4e-06,3e-06,4e-06,2e-06,5e-06,1e-06,3e-06,1e-06,1e-06,2e-06,2e-06,2e-06,5e-06,1e-06,1e-06,2e-06,1e-06,1e-06,2e-06,3e-06,2e-06,5e-06,4e-06
8e-06,1e-06,5e-06,5e-06,3e-06,3e-06,0,2e-06,5e-06,5e-06,4e-06,8e-06,2e-06,4e-06,4e-06,7e-06,2e-06,3e-06,5e-06,3e-06,1.5e-05,2e-06,7e-06,8e-06,3e-06,1.6e-05,4e-06,1e-06,6e-06,7e-06,5e-06,8e-06,1e-06,7e-06,3e-06,6e-06,3e-06,3e-06,1e-06,1e-06,1e-06,1e-06,1e-06,2e-06,3e-06,2e-06,1e-06,1e-06,2e-06,1e-06,3e-06,1e-06,2e-06,4e-06,2e-06,3e-06,5e-06,1e-06,1e-06,1e-06,2e-06,2e-06,1e-06,4e-06,8e-06,3e-06,3e-06,3e-06,2e-06,2e-06,1e-06,2e-06,1e-06,2e-06,1e-06,2e-06,3e-06,1e-06,1e-06,1e-06,2e-06,3e-06,2e-06,1e-06,1e-06,2e-06,3e-06,2e-06,2e-06,2e-06,4e-06,7e-06,2e-06,2e-06,2e-06,1e-06,1e-06,0,4e-06,4e-06,2e-06,3e-06,5e-06,2e-06,3e-06,2e-06,1e-06,1e-06,1e-06,3e-06,5e-06,2e-06,1e-06,2e-06,2e-06,1e-06,3e-06,3e-06,0,4e-06,2e-06
6e-06,2e-06,5e-06,5e-06,3e-06,2e-06,1e-06,1e-06,3e-06,3e-06,3e-06,8e-06,2e-06,2e-06,5e-06,7e-06,1e-06,4e-06,7e-06,3e-06,1.5e-05,2e-06,4e-06,7e-06,2e-06,1.5e-05,2e-06,2e-06,5e-06,1e-05,3e-06,7e-06,0,7e-06,3e-06,5e-06,1e-06,1e-06,2e-06,0,1e-06,1e-06,2e-06,2e-06,3e-06,1e-06,1e-06,2e-06,3e-06,1e-06,4e-06,1e-06,1e-06,4e-06,3e-06,4e-06,2e-06,1e-06,1e-06,0,3e-06,3e-06,1e-06,4e-06,7e-06,5e-06,3e-06,3e-06,2e-06,4e-06,0,2e-06,2e-06,2e-06,0,1e-06,2e-06,1e-06,0,2e-06,0,3e-06,2e-06,1e-06,1e-06,3e-06,2e-06,1e-06,2e-06,1e-06,3e-06,7e-06,2e-06,2e-06,2e-06,1e-06,1e-06,0,4e-06,4e-06,3e-06,4e-06,4e-06,2e-06,3e-06,2e-06,1e-06,1e-06,3e-06,2e-06,4e-06,2e-06,1e-06,1e-06,1e-06,1e-06,2e-06,3e-06,1e-06,4e-06,2e-06
7e-06,1e-06,4e-06,7e-06,4e-06,4e-06,1e-06,1e-06,3e-06,3e-06,3e-06,6e-06,2e-06,3e-06,5e-06,7e-06,3e-06,4e-06,7e-06,4e-06,1.5e-05,1e-06,5e-06,7e-06,1e-06,1.5e-05,2e-06,2e-06,5e-06,7e-06,2e-06,7e-06,2e-06,5e-06,1e-06,4e-06,1e-06,1e-06,1e-06,1e-06,2e-06,2e-06,1e-06,2e-06,3e-06,1e-06,1e-06,2e-06,4e-06,1e-06,3e-06,1e-06,1e-06,4e-06,2e-06,3e-06,2e-06,1e-06,1e-06,0,3e-06,3e-06,0,2e-06,7e-06,4e-06,2e-06,4e-06,1e-06,3e-06,0,2e-06,2e-06,3e-06,1e-06,0,2e-06,1e-06,0,2e-06,1e-06,2e-06,3e-06,0,1e-06,3e-06,2e-06,1e-06,2e-06,1e-06,2e-06,7e-06,1e-06,2e-06,3e-06,1e-06,1e-06,0,4e-06,4e-06,3e-06,3e-06,5e-06,1e-06,3e-06,2e-06,1e-06,1e-06,2e-06,2e-06,4e-06,1e-06,1e-06,1e-06,1e-06,1e-06,3e-06,3e-06,0,3e-06,3e-06
6e-06,1e-06,5e-06,5e-06,3e-06,3e-06,0,1e-06,3e-06,3e-06,4e-06,7e-06,1e-06,4e-06,5e-06,7e-06,2e-06,2e-06,8e-06,5e-06,1.5e-05,1e-06,5e-06,8e-06,1e-06,1.6e-05,1e-06,3e-06,5e-06,8e-06,2e-06,7e-06,1e-06,5e-06,1e-06,5e-06,1e-06,1e-06,2e-06,1e-06,1e-06,2e-06,1e-06,2e-06,3e-06,1e-06,0,2e-06,3e-06,1e-06,3e-06,1e-06,1e-06,4e-06,2e-06,3e-06,2e-06,1e-06,1e-06,1e-06,2e-06,3e-06,1e-06,3e-06,8e-06,4e-06,3e-06,3e-06,1e-06,3e-06,0,2e-06,2e-06,2e-06,0,0,2e-06,0,0,1e-06,1e-06,3e-06,2e-06,1e-06,1e-06,3e-06,2e-06,1e-06,3e-06,1e-06,2e-06,7e-06,2e-06,1e-06,2e-06,1e-06,1e-06,1e-06,3e-06,4e-06,3e-06,3e-06,5e-06,1e-06,3e-06,2e-06,1e-06,1e-06,2e-06,1e-06,4e-06,1e-06,1e-06,1e-06,1e-06,1e-06,2e-06,2e-06,0,4e-06,3e-06
