-0.000191,-0.000235,-0.000214,-0.000184,-0.00023,-0.000245,-0.000182,-0.000101,-0.000107,-0.000137,-0.000197,-0.000158,-9.9e-05,-4.8e-05,-5.8e-05,-0.000109,-6.6e-05,-1.6e-05,-3.6e-05,-0.000116,-0.000171,-0.000148,-0.000124,-0.000121,-0.000118,-0.000136,-0.000239,-0.000131
-0.000411,-0.000293,-0.000321,-0.000218,-0.000166,-0.000347,-0.000347,-0.00027,-0.000216,-0.000156,-0.000101,-5.4e-05,-1.4e-05,-4.2e-05,-0.000119,-0.000191,-0.000166,-9.8e-05,-9.7e-05,-7.1e-05,-0.000113,-0.000149,-5.7e-05,-0.00012,-0.000215,-0.000405,-0.000661,-0.000353
-0.00036,-0.000235,-0.000237,-0.000106,-3.1e-05,-0.000141,-0.000179,-0.000231,-0.000251,-0.000304,-0.000233,-0.000195,-0.000191,-0.000161,-0.000186,-0.000256,-0.000254,-0.000246,-0.000183,-0.000116,-0.000132,-0.000164,-0.000127,-0.000168,-0.000248,-0.00042,-0.000635,-0.000425
-0.000396,-0.000341,-0.000229,-0.000103,-0.000118,1e-05,2.8e-05,-0.000106,-0.000165,-0.00026,-6e-05,-5.5e-05,-0.000102,-0.000107,-8.9e-05,-4.2e-05,-9.1e-05,-0.000184,-0.000125,-5.2e-05,-3e-05,-3e-05,-7.9e-05,-8.3e-05,-6.2e-05,-0.000134,-0.000166,-0.000179
-0.000282,-0.000175,-8.3e-05,-5.8e-05,-8e-05,5.5e-05,7.4e-05,-1.6e-05,-3.1e-05,-4e-06,0.000208,0.000163,6.7e-05,-1e-06,-7e-06,6.3e-05,-1.9e-05,-9.7e-05,-9.7e-05,1.8e-05,7.9e-05,0.000106,0.000115,0.000111,0.000134,0.000161,0.000306,0.000143
-0.000115,3.5e-05,7e-05,-4e-06,1.2e-05,-2.9e-05,-4.5e-05,-3.8e-05,-1.2e-05,6.2e-05,-1.5e-05,-8e-06,-4.6e-05,-2.4e-05,0,1.9e-05,-5.3e-05,-7.1e-05,-0.000145,-5.4e-05,-4.4e-05,-2e-05,6.3e-05,7.9e-05,0.000115,0.000243,0.000409,0.000232
-0.00012,-0.000106,-4e-06,-5.9e-05,-0.000113,-0.000183,-0.000159,-7.7e-05,1.2e-05,9.7e-05,-8.7e-05,-1.2e-05,1e-06,3.5e-05,3.8e-05,6e-06,-2.5e-05,-5e-06,-9.4e-05,-4e-05,-7.3e-05,-9.6e-05,-7.1e-05,-3.7e-05,2.8e-05,0.000179,0.000261,0.000194
3.6e-05,-7.8e-05,4.3e-05,1.1e-05,-7.3e-05,-4.8e-05,-1.8e-05,3.4e-05,9.8e-05,0.000132,3e-06,7.2e-05,7.1e-05,8.6e-05,7.1e-05,-7e-06,3.3e-05,8.9e-05,4.7e-05,5.6e-05,5.5e-05,1.6e-05,-1.9e-05,-5e-06,-2.7e-05,2.5e-05,1.8e-05,5.2e-05
0.000365,0.000265,0.000246,0.00016,0.000198,0.000283,0.000248,0.000203,0.000157,8.4e-05,-9.4e-05,-6.3e-05,-1.1e-05,4.4e-05,0.000103,8.2e-05,0.000162,0.000183,0.000163,9.5e-05,0.000108,8.1e-05,2e-05,1.2e-05,-4e-05,-0.000111,-0.000222,-0.000147
0.000407,3e-04,0.000184,0.000104,0.000173,0.00029,0.000281,0.000224,0.000112,4.5e-05,1.4e-05,-2.1e-05,6.1e-05,4.5e-05,9e-05,0.000119,0.000181,0.000148,0.000164,5.6e-05,6.5e-05,6.7e-05,-1.2e-05,-1.9e-05,-2.2e-05,-0.000158,-0.00031,-0.000183
0.000187,3.5e-05,-9.1e-05,-4.9e-05,-0.000115,-5.6e-05,2.4e-05,7e-05,-5.3e-05,-0.000115,7.8e-05,2.3e-05,6.9e-05,1.1e-05,-5e-06,3e-05,6.9e-05,3.2e-05,8.1e-05,-1.8e-05,-3.1e-05,4.4e-05,3e-05,2.4e-05,1.5e-05,-0.000131,-0.000235,-9.4e-05
9.5e-05,4.6e-05,-0.000108,7e-06,-8.4e-05,-0.000238,-0.000214,-7.6e-05,-0.000139,-0.000193,-7.2e-05,-0.000103,-5.2e-05,-5.8e-05,-9.4e-05,-5.6e-05,-4.5e-05,-5.4e-05,-8e-06,-6.5e-05,-0.000106,-6e-06,5.4e-05,4.1e-05,4.3e-05,5e-06,-1.2e-05,3.6e-05
1e-06,0.000119,-4e-06,8.6e-05,0.000133,-0.000115,-0.000216,-0.000108,-3.9e-05,-2e-06,5.1e-05,2.1e-05,-1.3e-05,-4.1e-05,-0.000122,-0.000122,-0.000133,-0.000125,-6.6e-05,-7.7e-05,-8.5e-05,-4.5e-05,-1.7e-05,-1.6e-05,3e-05,0.000176,0.000306,0.000172
-0.000229,-9.6e-05,-0.000106,-3.5e-05,5.4e-05,1.5e-05,-5.5e-05,-7.4e-05,4.9e-05,4.6e-05,9e-05,0.000111,-2e-06,-1.1e-05,-4.8e-05,-5.6e-05,-9.7e-05,-8.3e-05,-4e-05,-1.1e-05,2.6e-05,-1.4e-05,-2.4e-05,-1e-06,2.8e-05,0.000223,0.000472,0.000191
-0.000236,-0.000154,-0.000125,-8.8e-05,-6.2e-05,6.7e-05,0.000103,-2.5e-05,5.8e-05,1.9e-05,-7.2e-05,-3.6e-05,-0.000105,-4.7e-05,1.6e-05,1.8e-05,-3.9e-05,-1.7e-05,-3e-06,4.5e-05,8.1e-05,-6e-06,9e-06,2.1e-05,3e-06,0.000109,0.000282,7e-05
-2.9e-05,6.9e-05,8.8e-05,8e-06,2.9e-05,6.2e-05,9e-05,-2.8e-05,4e-05,0.000176,7.7e-05,3.9e-05,1e-05,1e-05,5.4e-05,6.4e-05,-4e-06,1e-06,1e-06,3e-05,1.3e-05,-5.7e-05,-3e-05,-4.3e-05,-8e-05,-1e-04,-0.000124,-8.8e-05
-2.7e-05,3.9e-05,0.00017,2e-06,1e-06,-4.3e-05,-6e-05,-7.9e-05,-3.6e-05,0.000135,0.000105,4.7e-05,4.5e-05,3.3e-05,5.5e-05,7.1e-05,9e-06,2.5e-05,-2e-05,2e-06,-1.2e-05,-3.6e-05,-2.5e-05,-6.4e-05,-0.000104,-0.000261,-0.000447,-0.000176
-0.000166,-0.000239,7e-06,-0.000101,-0.000183,-0.000113,-0.000121,-6.9e-05,-0.000108,-9.5e-05,-0.00011,-0.000121,-7.1e-05,-2.6e-05,-2.6e-05,-4.9e-05,-1.2e-05,2.4e-05,-4.8e-05,-1.8e-05,-4e-06,1.5e-05,1.6e-05,-3.4e-05,-5.1e-05,-0.000233,-0.00049,-0.000184
-5.7e-05,-0.000214,-4.7e-05,-4.9e-05,-8.9e-05,4.5e-05,3.5e-05,3.9e-05,-7.6e-05,-0.000109,-2.1e-05,-1.9e-05,1.8e-05,2.3e-05,-4e-05,-9.3e-05,-1e-06,9e-06,-4.5e-05,-2.8e-05,-2.3e-05,2.4e-05,-1.3e-05,-7e-06,2.3e-05,-4.5e-05,-0.000184,-8.7e-05
