0.005061,0.00471,0.005169,0.005656,0.005863,0.005463,0.004944,0.005633,0.005428,0.004356,0.004752,0.005159,0.005177,0.005255,0.004892,0.004699,0.004994,0.004871,0.004617,0.004868,0.005406,0.005678,0.005534,0.005171,0.005009,0.005274,0.005409,0.005666
0.006212,0.005797,0.006303,0.006805,0.00701,0.006604,0.006013,0.006863,0.006707,0.005624,0.005988,0.006205,0.006241,0.006502,0.00612,0.005821,0.006149,0.005958,0.005573,0.0058,0.006423,0.006822,0.006746,0.006371,0.006218,0.006417,0.006502,0.006835
0.008153,0.007612,0.008144,0.008689,0.008989,0.008616,0.00783,0.008781,0.008762,0.00792,0.008259,0.008029,0.008036,0.008609,0.008234,0.007788,0.008192,0.007871,0.007149,0.007276,0.008054,0.00865,0.008691,0.008423,0.008368,0.008321,0.008203,0.008652
0.009819,0.009095,0.009472,0.01009,0.010718,0.010566,0.009454,0.009881,0.009949,0.009798,0.010306,0.009668,0.00951,0.010308,0.010069,0.009514,0.009934,0.009666,0.008636,0.008468,0.009328,0.010087,0.010182,0.010128,0.010224,0.009827,0.009394,0.00986
0.011176,0.010367,0.010411,0.011038,0.012161,0.012452,0.011098,0.010567,0.010479,0.010898,0.011688,0.011105,0.010779,0.011495,0.011391,0.010636,0.010856,0.01121,0.010383,0.009615,0.010266,0.011051,0.011012,0.011043,0.011191,0.01077,0.010303,0.010702
0.012518,0.011668,0.011544,0.012414,0.01385,0.014622,0.013619,0.012208,0.011263,0.011489,0.012589,0.012719,0.01225,0.012248,0.012284,0.011535,0.011196,0.012291,0.012243,0.010804,0.010928,0.011577,0.011413,0.011556,0.011678,0.011527,0.011438,0.011737
0.013601,0.01325,0.013639,0.015035,0.016373,0.017459,0.017608,0.016065,0.013668,0.012644,0.013547,0.0145,0.013861,0.012976,0.013493,0.013292,0.012467,0.01348,0.013745,0.011902,0.011453,0.012015,0.011807,0.011876,0.012538,0.012833,0.012974,0.013347
0.014529,0.015414,0.016501,0.018214,0.019233,0.020391,0.021595,0.020452,0.017076,0.014714,0.015069,0.016577,0.015778,0.014618,0.015938,0.016062,0.015087,0.015324,0.014808,0.012952,0.012291,0.012868,0.01268,0.0123,0.013508,0.014523,0.014699,0.014737
0.016077,0.017813,0.019101,0.020625,0.021247,0.02251,0.024085,0.023586,0.020542,0.01797,0.018021,0.019027,0.01792,0.017179,0.018955,0.018769,0.01853,0.018557,0.015887,0.01368,0.013545,0.014035,0.013966,0.013422,0.014719,0.016088,0.016239,0.016118
0.017477,0.019361,0.021175,0.022649,0.023029,0.024879,0.025988,0.025539,0.023413,0.020977,0.021341,0.022001,0.020362,0.019825,0.021387,0.020509,0.021181,0.021953,0.017324,0.014481,0.015429,0.015767,0.015746,0.015526,0.016984,0.018252,0.01797,0.018501
0.017932,0.018657,0.022241,0.026203,0.026882,0.028434,0.027863,0.025831,0.024459,0.022596,0.023257,0.023768,0.021777,0.021316,0.022152,0.020527,0.021776,0.023812,0.018996,0.015852,0.017461,0.017615,0.017614,0.017425,0.019163,0.020934,0.020377,0.021981
0.01888,0.017507,0.022282,0.028686,0.029052,0.029526,0.02753,0.024213,0.024207,0.023353,0.023996,0.024155,0.021684,0.021242,0.021788,0.019816,0.020644,0.023242,0.01954,0.016895,0.018868,0.019071,0.018842,0.018463,0.020439,0.022496,0.022495,0.026094
0.019476,0.016964,0.02137,0.027337,0.027008,0.028428,0.027547,0.023721,0.02346,0.0225,0.023307,0.023991,0.021263,0.019718,0.019862,0.018418,0.01861,0.02064,0.01866,0.017923,0.019915,0.019908,0.019135,0.018739,0.021126,0.022458,0.022776,0.028191
0.018325,0.016087,0.01917,0.022826,0.022461,0.027286,0.028426,0.023703,0.021689,0.019675,0.020248,0.021745,0.02021,0.018092,0.017836,0.01787,0.018058,0.018353,0.01745,0.018307,0.019289,0.019202,0.018581,0.017883,0.019941,0.020292,0.020646,0.026647
0.017527,0.016005,0.017297,0.018754,0.019479,0.026125,0.02759,0.022743,0.019812,0.017728,0.018216,0.019557,0.019943,0.018966,0.017635,0.017538,0.0178,0.016997,0.016213,0.016785,0.016215,0.016247,0.016925,0.016674,0.017745,0.017512,0.017325,0.021181
0.020267,0.019192,0.019972,0.020362,0.020978,0.025653,0.025785,0.021639,0.020053,0.019958,0.019605,0.020091,0.023115,0.024212,0.021242,0.019007,0.018524,0.017259,0.015724,0.015267,0.014601,0.0154,0.017315,0.017194,0.016709,0.016748,0.016248,0.016845
0.027109,0.025102,0.026218,0.026375,0.026109,0.029694,0.029195,0.024107,0.023612,0.027142,0.025345,0.024054,0.03034,0.034219,0.02961,0.024331,0.02286,0.020918,0.017575,0.01657,0.017069,0.018932,0.020527,0.01954,0.019957,0.021839,0.019683,0.01747
0.034546,0.031115,0.032648,0.032363,0.031534,0.03652,0.036351,0.029563,0.029561,0.035861,0.033233,0.030801,0.039733,0.045896,0.039805,0.032866,0.030908,0.027441,0.02186,0.020458,0.022274,0.024829,0.024609,0.022223,0.025497,0.029841,0.024977,0.020939
0.037241,0.033786,0.035877,0.034859,0.03392,0.040099,0.04088,0.034921,0.03503,0.040847,0.038792,0.037648,0.04694,0.052588,0.045381,0.038765,0.037539,0.033033,0.025653,0.023414,0.026274,0.029054,0.0269,0.02442,0.030087,0.035187,0.028271,0.023819
0.033459,0.032819,0.035646,0.033122,0.032714,0.039322,0.04143,0.038673,0.03798,0.039878,0.039423,0.041132,0.047652,0.049757,0.042091,0.03688,0.037715,0.034516,0.026876,0.023825,0.027595,0.030518,0.027627,0.026271,0.031742,0.03456,0.02821,0.026357
0.028365,0.029856,0.034292,0.031352,0.031854,0.037864,0.040595,0.040587,0.038741,0.036454,0.037004,0.040332,0.042566,0.041363,0.034333,0.029788,0.032142,0.032973,0.02747,0.02319,0.027024,0.031493,0.030529,0.030028,0.032255,0.030299,0.026504,0.029695
0.027095,0.030217,0.037197,0.035505,0.036631,0.041245,0.042258,0.040767,0.037429,0.034083,0.03557,0.039127,0.038343,0.034541,0.028587,0.02561,0.027504,0.032505,0.03203,0.025364,0.025268,0.031015,0.033168,0.033766,0.032376,0.024724,0.022893,0.030537
0.030631,0.033141,0.039932,0.040987,0.044549,0.046463,0.044515,0.041768,0.035585,0.031437,0.033617,0.036304,0.034047,0.031797,0.02898,0.027377,0.026943,0.03564,0.041622,0.030023,0.024274,0.031837,0.03599,0.03706,0.03454,0.023568,0.020292,0.027917
0.03573,0.034601,0.038486,0.042273,0.049298,0.051206,0.047766,0.044311,0.035453,0.031189,0.035041,0.035599,0.030314,0.029182,0.03018,0.030398,0.027488,0.03793,0.048716,0.035389,0.026957,0.033938,0.038337,0.040571,0.038354,0.026514,0.021062,0.026494
0.038247,0.033862,0.035171,0.038552,0.04544,0.048881,0.046192,0.045995,0.038208,0.033085,0.038105,0.036962,0.028416,0.026051,0.029993,0.030981,0.026725,0.036578,0.046934,0.036984,0.030953,0.033942,0.036483,0.041605,0.038958,0.026306,0.023409,0.029468
0.036019,0.031636,0.032617,0.031796,0.036223,0.041876,0.039898,0.042951,0.037181,0.03137,0.03706,0.037303,0.027945,0.022546,0.026567,0.028744,0.026655,0.032357,0.036747,0.034182,0.033355,0.02983,0.031802,0.041305,0.0369,0.022723,0.023387,0.030243
0.033259,0.031749,0.032693,0.026938,0.028576,0.03798,0.037698,0.037452,0.032448,0.028379,0.033535,0.035313,0.027836,0.020916,0.022378,0.027328,0.02924,0.027658,0.026492,0.031465,0.033521,0.025373,0.02677,0.036291,0.032781,0.020777,0.021463,0.026383
0.030498,0.031392,0.031122,0.024654,0.02587,0.038069,0.039857,0.034675,0.030417,0.029069,0.030289,0.029953,0.026249,0.021734,0.020987,0.026101,0.029644,0.025506,0.025793,0.032493,0.031646,0.021529,0.021379,0.027241,0.026014,0.020375,0.019344,0.022564
0.031478,0.033254,0.032499,0.029625,0.030613,0.040994,0.042082,0.036165,0.033132,0.032161,0.03103,0.028447,0.026687,0.026189,0.024419,0.024699,0.02802,0.028806,0.031592,0.033499,0.029038,0.019779,0.018934,0.024388,0.025478,0.023541,0.020929,0.026235
0.041137,0.041049,0.042286,0.043041,0.043708,0.048786,0.044695,0.040946,0.040812,0.04142,0.041718,0.036017,0.032244,0.03581,0.033279,0.026972,0.030532,0.037847,0.040844,0.035464,0.025757,0.019076,0.021261,0.029965,0.033675,0.03257,0.030794,0.040857
0.056572,0.055746,0.056656,0.059293,0.0616,0.063871,0.054208,0.050216,0.05331,0.056059,0.057884,0.047033,0.039413,0.047542,0.045175,0.035209,0.040117,0.051412,0.053709,0.04204,0.024851,0.018674,0.024718,0.037795,0.04612,0.044875,0.043847,0.05916
0.0674,0.067627,0.064932,0.069137,0.074563,0.074891,0.062011,0.056253,0.062389,0.068046,0.069613,0.055357,0.044625,0.054956,0.052677,0.0408,0.047681,0.061767,0.062005,0.049212,0.028811,0.020189,0.027037,0.04369,0.054702,0.051487,0.052147,0.071502
0.064619,0.066718,0.05913,0.064171,0.072031,0.069906,0.056985,0.050759,0.058974,0.066838,0.066987,0.056662,0.048933,0.054704,0.049146,0.037471,0.045592,0.059821,0.056807,0.047979,0.030739,0.020534,0.027082,0.043472,0.052231,0.046023,0.048803,0.068255
0.048689,0.051338,0.042214,0.046655,0.053528,0.049615,0.039833,0.036159,0.043827,0.050262,0.049543,0.048166,0.04784,0.045,0.035208,0.027094,0.034811,0.044402,0.038973,0.037249,0.029134,0.019805,0.026669,0.037823,0.039966,0.031713,0.034469,0.049286
0.034354,0.033273,0.028228,0.033099,0.03705,0.031178,0.023924,0.0256,0.029925,0.031173,0.033399,0.036156,0.038345,0.030081,0.020661,0.019261,0.024494,0.0258,0.021351,0.024611,0.024002,0.018549,0.026393,0.032668,0.030446,0.021196,0.019476,0.028459
0.031308,0.027379,0.02154,0.027609,0.036884,0.030382,0.017948,0.018633,0.021782,0.026095,0.031504,0.030337,0.027338,0.019387,0.014359,0.017888,0.019179,0.017722,0.017573,0.019076,0.018036,0.01707,0.025492,0.029937,0.02435,0.016814,0.012936,0.018643
0.031234,0.026189,0.020043,0.029204,0.039866,0.030021,0.013427,0.012176,0.016991,0.027141,0.031847,0.023867,0.02106,0.016647,0.012503,0.017013,0.016856,0.016367,0.017395,0.015401,0.015037,0.014581,0.020591,0.028303,0.023138,0.014996,0.012281,0.014902
0.025815,0.022813,0.019749,0.027999,0.03698,0.026314,0.013619,0.01246,0.013868,0.024704,0.027564,0.018178,0.017356,0.015944,0.01515,0.017767,0.013488,0.013202,0.015594,0.013692,0.014548,0.011592,0.014053,0.02458,0.020747,0.013609,0.014183,0.016162
0.016796,0.01763,0.017541,0.021718,0.028186,0.021119,0.015771,0.015282,0.013835,0.020988,0.021645,0.014703,0.016133,0.017832,0.020844,0.021304,0.012403,0.009534,0.01303,0.012458,0.014292,0.01034,0.010499,0.019014,0.015706,0.012347,0.017022,0.018248
0.010237,0.014184,0.013656,0.014318,0.018728,0.019486,0.019291,0.016499,0.012948,0.017136,0.019971,0.013676,0.017116,0.022859,0.026367,0.023747,0.011928,0.008316,0.011598,0.011086,0.013465,0.011255,0.010241,0.013963,0.01091,0.012205,0.020313,0.021455
