-0.001257,0.001153,-0.001913,-0.000381,-0.002931,0.000367,-0.001767,-0.003227,-3.6e-05,-0.002742,-0.003311,-0.004598,-0.005713,-0.003167,-0.00625,-0.001984,-0.003428,-0.000477,-0.004685,-0.001623,-0.003653,-0.003301,-0.003332,-0.002102,-0.00306,-0.000283,-0.00318,-0.004404,-0.00244,-0.002924,-0.001364,-0.003019,-0.002112,-0.002653,-0.00124,-0.000593,-0.001622,-0.001595,-0.002079,-0.004251,-0.002941,-0.001976,-0.001273,0.001161,-0.000789,-0.002186,-0.00527,-0.003451,-0.001966,-0.001043,-0.002982,-0.00213,-0.001612,-0.000343,-0.000459,-0.001506,-0.001569,-0.0017,-0.001752,-0.002547,-0.004282,-0.003884,-0.004073,-0.003064,-0.000819,-0.000365,-0.002525,-0.004704,-0.003612,-0.001391,-0.00161,-0.005342,-0.002108,-0.001805,-0.003494,-0.002129,-0.003471,-0.001002,-0.004924,-0.002102,-0.002418,0.001073,-0.00072,-0.001082,0.000162,-0.000845,-0.001868,-0.001108,-0.000618,-0.002678,-0.002675,-0.002569,-0.002136,-0.004141,-0.002612,-0.001901,-0.002443,-0.000729,-0.001247,-0.001422,-0.003762,-0.004069,-0.002452,-0.000932,-0.001674,-0.001574,-0.001003,-0.00142,-0.002189,-0.001558,-0.002034,-0.003782,-0.002517,-0.002443,-0.000936,-0.001713,-0.001306,-0.001743,-0.002948,-0.002783,-0.001019
-0.000946,-0.004113,0.002251,-0.000101,0.000392,-0.001838,-0.002661,0.000203,0.001371,0.002411,0.001501,0.000373,0.003106,-0.001513,0.001911,-9.5e-05,0.000287,-0.00092,-0.001898,-0.00126,0.00197,0.003259,0.001109,-0.000689,0.00092,-0.000619,0.000593,0.000714,-0.000182,0.000378,-0.001063,-0.000523,-0.000452,0.000513,-0.001976,-0.000929,0.002295,-0.000484,0.000785,-0.000117,-0.002072,-0.001319,0.000268,-0.002296,-0.001914,0.000723,0.001917,0.001567,0.002615,0.001931,0.003046,0.001423,0.00062,0.000681,-0.003125,1e-05,-0.000365,-0.000287,0.001146,-0.000207,0.001154,0.002009,0.002759,0.001765,-0.000662,-0.000613,0.000814,0.002016,0.000362,-0.000292,-0.002836,0.002611,-0.001133,-0.001812,-0.001648,4.1e-05,0.000405,0.000435,0.002005,-0.000685,-0.000466,-0.000207,-0.004162,-0.002308,-0.000409,-0.001272,0.000749,0.001292,-0.003571,-0.000798,0.000409,0.000167,0.000204,0.000512,0.001148,-0.001176,-0.00135,-0.001849,-0.000526,-0.000437,0.002046,0.002239,0.000484,-0.001655,-0.001623,-0.000264,-0.000449,-0.000743,0.000948,-0.000719,0.000196,0.001498,0.001497,0.000242,0.000218,0.000577,0.00098,6.9e-05,0.001142,-0.000198,-0.000873
-0.000734,-0.002695,-0.005119,-0.002857,-0.000557,-7e-06,-0.003132,-0.001661,0.00013,-0.002958,-0.001225,0.00099,-0.001849,-0.002299,-0.001595,-0.001468,-0.000484,-0.003011,-0.004569,-0.002904,-0.001384,-0.003234,-0.001926,-0.00016,0.000121,-0.001528,-0.002693,-0.001311,-0.00074,0.000773,0.000607,-0.001202,-0.000708,-0.000882,0.000102,0.000233,-0.001581,-0.00256,-0.000747,-0.003072,-0.001967,-0.001528,-0.000606,-0.002182,-0.002493,-0.001014,-0.00354,-0.001232,-0.001368,0.000102,-0.000143,-0.0021,-0.000673,-0.001341,-0.001825,-0.001161,-0.002437,-0.002849,0.000165,-0.000436,-0.001986,-0.002323,-0.000469,-0.000483,0.001091,0.00027,-0.000626,-0.001591,-0.000129,0.000114,-0.000251,-0.003092,-0.001777,0.001284,-0.001728,-0.002891,-0.002718,-0.000656,-0.001453,-0.00166,-0.002056,-0.003113,-0.002047,-0.001345,-0.000222,0.000202,-0.001418,-0.001559,0.000329,-0.000966,-0.000208,-0.001371,-0.000673,-0.000937,-0.00077,0.000219,-0.000494,-0.000871,-0.000155,-0.000321,-0.00371,-0.002513,-0.000962,0.000172,0.000599,-0.001354,-0.001491,-0.001656,-0.00303,-0.000954,-0.001214,-0.002184,-0.001425,0.000295,-0.000801,6.1e-05,-7e-04,-0.0019,-0.002021,-0.001499,-0.000739
0.002244,0.002713,0.00337,0.002726,-0.001642,0.000341,0.003535,-7.5e-05,-0.000392,-0.000794,0.002385,-0.000422,0.002259,0.00253,0.002526,0.001465,-0.00131,0.003237,0.005679,0.002937,0.001772,0.003257,0.00129,0.000415,7.4e-05,-0.000347,7e-05,0.001442,0.000724,0.000367,-1.6e-05,0.000789,0.000332,0.000267,0.000443,-0.000959,0.000904,0.002848,0.001305,0.003903,0.003596,0.002184,-6.2e-05,0.000346,0.003748,0.001142,0.002588,0.002322,0.001141,-9.5e-05,-0.001022,0.001994,0.00057,-0.000921,0.000711,0.002469,0.002106,0.001784,-0.000594,-0.001121,0.002274,0.003857,0.000989,0.000121,-0.000618,-0.001747,-0.000541,0.000914,0.000296,0.000672,0.000417,0.002291,0.001731,0.001181,0.000756,0.003813,0.003951,0.000831,0.000843,-0.000278,0.002546,0.002835,0.00421,0.001912,0.000229,0.000743,0.000729,0.000982,0.001596,0.001795,0.000664,0.001155,8.2e-05,-1e-05,-0.00116,-0.001018,0.001072,0.001313,0.001482,0.000598,0.001408,0.002018,0.001629,0.001545,0.000157,0.000496,0.001397,0.001449,0.002476,0.001827,0.000526,0.00177,-2.5e-05,-0.000403,0.0017,-0.000222,0.001252,0.001396,0.001664,0.00065,0.001199
0.001555,0.001784,0.002053,0.000108,0.000203,-0.000398,4.6e-05,-0.000945,-0.001151,-0.001134,-0.003687,-0.001353,-0.001835,-0.001136,-0.002377,-0.000873,0.000642,-0.0014,-0.00221,-0.000698,-3.2e-05,-0.002047,-9e-04,-0.001187,0.000731,0.002446,-0.000245,-0.001309,-0.001002,-0.000556,0.000308,-0.002109,-0.00085,-0.001003,0.000242,-0.000535,-0.000236,-0.001139,-0.000931,-0.002088,-0.002879,-0.000179,0.001395,-0.001624,-0.000743,-0.001959,-0.000328,-0.001245,-0.001269,0.00018,0.000526,-0.000841,0.000693,-8e-05,0.000703,-0.001016,-0.000265,0.001208,0.000319,0.001275,0.000519,-0.002987,-0.000371,0.000384,-0.000932,9.4e-05,-2.2e-05,-0.000625,-0.001466,-0.000981,0.000695,-0.001413,-0.000353,-0.001646,0.001011,-0.000873,-0.001717,-0.001167,-0.000338,9.3e-05,-0.001252,-0.000817,-0.000316,5e-06,0.001504,-0.000743,9.4e-05,-0.001106,-0.000287,-0.000698,-0.001061,-0.000774,0.000101,-0.000308,0.001063,0.000702,-0.000456,-0.000652,-0.001963,0.000341,-0.00066,-0.000919,-0.000121,0.000216,0.001116,0.000199,-0.001345,-0.00022,-0.000635,-0.000674,1e-05,-0.001943,-0.000705,0.000784,-0.000222,-6.1e-05,-0.001042,4.2e-05,-0.000813,-0.000265,-0.000317
-0.001664,-0.001332,-0.000249,-0.000398,-0.000806,-0.000936,-0.000633,0.001425,0.000103,-0.000207,-0.000386,-0.000335,0.000726,0.002213,-2e-06,0.00082,0.000131,0.00056,0.000382,-0.001014,-0.000561,0.000319,0.000339,0.000132,0.000233,-0.000451,0.000857,0.001289,0.000717,0.000257,-0.001527,0.001384,0.0017,0.000651,-4.6e-05,0.000116,0.000651,0.000393,0.000488,0.001147,0.000725,0.002013,-0.000757,0.000533,0.000467,-0.00044,0.000654,0.000743,0.000436,-0.001096,-0.001284,-0.000976,-1e-04,-0.000253,0.00066,9.1e-05,0.000263,-0.000483,-0.000189,-0.000387,3.8e-05,0.000853,-0.001191,-0.000469,0.000508,0.000365,-0.000127,0.000862,0.002014,0.000848,-0.000591,4e-05,0.000142,0.000558,-0.000164,0.000229,-0.000144,1.2e-05,-7.7e-05,0.000848,0.001576,3.3e-05,-0.000333,-0.001269,-0.001559,0.000126,0.000635,0.000876,7.8e-05,-0.001127,-0.000251,-0.000138,0.000595,0.000872,0.000504,0.000692,3.8e-05,-0.000855,0.000196,-0.000746,-0.000391,-0.00016,-0.000589,0.000636,-0.001009,9.7e-05,-0.000128,-0.000247,-1.2e-05,0.000141,0.000104,0.000805,0.000511,-0.000443,0.000195,-0.000521,0.000837,0.001041,0.000391,0.001166,0.000292
0.000227,1.2e-05,-0.001564,-0.001718,3.2e-05,-8e-06,-0.000954,-0.000527,-0.000278,0.000699,-0.000531,0.000663,0.000131,-0.001146,-0.000204,-0.001692,0.000492,5.1e-05,-0.000244,0.001184,0.000209,-0.001209,-1e-04,0.000371,-0.000795,-0.000525,-0.001099,-0.000728,-8.8e-05,-0.000296,0.001407,0.000509,-0.001934,9.5e-05,0.000325,-9.9e-05,-0.000269,-0.000222,-0.000124,-3.1e-05,-0.000461,-0.002259,-0.000544,0.000852,-0.000271,0.001062,-0.000303,-0.001028,-0.001393,-0.000832,-0.000721,-0.000939,-0.000321,0.000171,-0.000136,0.000873,6.2e-05,0.000274,-0.000294,0.000357,-0.000565,-0.000888,0.000323,0.000336,-0.000411,-0.000327,0.001313,-0.000227,-0.001013,0.000407,0.000851,5.8e-05,-0.000131,0.001093,-0.000593,-0.001547,-0.000205,-9.9e-05,0.000519,-0.000417,-0.001086,-0.001408,-0.000352,-0.001309,4e-05,0.000221,-0.000831,-0.000191,-0.000433,0.000373,0.000457,0.00013,-0.000444,-0.000572,-0.000897,0.000174,0.000349,0.000456,0.000478,0.000349,-9e-05,-0.000992,0.000635,0.00016,-0.000166,-0.000467,-0.000258,-0.00118,-0.001415,-0.000357,-0.000655,0.000275,0.000213,0.000289,-0.000981,-3.9e-05,0.000226,-0.000534,-0.00044,-0.000879,-0.000423
-0.00089,0.000289,0.000127,-0.000221,-0.001123,-0.001395,0.000283,0.000155,-0.000924,0.000166,-0.000327,-0.001272,-0.00096,0.00137,6.2e-05,0.000795,-0.000617,-6.4e-05,0.000677,0.000713,-0.000171,7e-05,0.000225,-0.001188,0.000404,0.001002,-0.00061,0.000226,-4.1e-05,-0.000337,-0.001107,-0.000359,0.000554,0.000326,-0.000155,0.000364,-0.00027,0.000578,-0.000219,-0.000374,0.000982,0.000638,-0.000281,-1.2e-05,0.000558,-3.2e-05,-0.000464,0.000894,0.000762,-0.000281,0.000252,-0.000271,-0.000883,-0.000363,-0.000839,-0.000154,-7.2e-05,-0.000328,0.000584,-0.000196,0.000401,0.000231,-7.2e-05,0.000445,0.00059,3e-06,-0.000713,-0.000255,0.000236,0.00023,-0.000221,0.000452,0.000753,2e-06,0.001291,0.000609,0.000959,-0.000339,-0.000776,0.000609,-0.000243,0.001497,0.000416,0.002028,0.000162,-0.001665,0.000123,0.000277,0.00022,0.000396,-0.000375,-0.00063,-0.00046,-0.000176,0.000137,-0.000159,-0.000785,3.7e-05,-0.000319,0.000581,-0.000336,0.000146,-7.3e-05,-6.1e-05,1e-04,-0.000664,0.000271,0.000318,-0.000103,0.000275,-0.000428,-0.000277,0.000258,3e-05,0.000769,-3e-05,-0.000343,-0.000536,0.00038,0.00031,-0.000251
0.001039,-0.000721,0.000859,0.000702,0.000688,0.001062,-0.00024,-0.000608,0.001288,0.000149,6.6e-05,0.001027,0.000879,-0.000875,-0.000805,-0.000438,-0.000164,-0.000597,-0.000686,-0.000785,-2.1e-05,0.000623,-0.000404,0.000841,-0.000315,-0.001385,-0.001013,-0.000166,-0.001086,-0.000278,0.000188,-0.000201,9.1e-05,-8.6e-05,-0.00037,0.000398,-1.6e-05,-0.000218,-0.001003,3.6e-05,-0.000433,0.000417,0.000105,0.001008,-9e-06,-0.000144,0.000649,-0.001338,-0.000239,-0.00021,-7e-04,0.000315,0.00085,0.000243,8.6e-05,-0.000313,-0.000842,0.00044,0.000337,-0.000148,0.000868,0.000317,8.4e-05,-0.000168,-0.000749,0,0.000146,-5.9e-05,-0.000263,-0.000565,0.000147,-0.000214,-0.000714,-0.000689,-0.000708,0.000877,-0.000376,0.000836,0.000225,-0.000768,-0.000107,-0.000101,-0.000247,-0.000421,0.000229,-0.000114,-0.000282,-0.000302,-0.000315,-0.000158,-1.6e-05,0.00059,0.000258,-9.6e-05,-0.000532,-0.000343,0.000708,-0.000232,-0.000359,0.000103,0.000544,0.000251,0.000642,-0.000598,-6.5e-05,0.000846,5.9e-05,-0.000132,0.000231,-7e-06,0.000488,0.000244,-0.000512,0.000409,-0.000279,-0.00025,-0.000232,-0.00039,0.000129,-0.000414,8.9e-05
-0.000694,-0.000293,-0.000334,7.5e-05,0.00065,2.4e-05,-0.000441,0.000493,0.000309,-0.000247,0.00019,-0.000814,-0.000335,-2.8e-05,0.000949,-0.000123,0.000157,0.000531,0.000353,-0.001754,-0.000505,-0.000509,-0.000464,-0.000783,-0.000393,0.000461,0.001055,-0.000162,0.000842,0.000142,2e-04,-0.00039,0.000309,-0.000155,5.9e-05,-0.001002,-0.000432,0.000275,0.001368,0.000156,0.000386,-0.000228,0.00047,-0.00093,0.000136,0.000641,-0.000644,0.000633,-0.000146,0.000116,0.000455,-0.000111,-0.001167,8.8e-05,-0.00028,-0.000413,0.000207,-0.000432,-0.000739,-0.000467,-0.001521,-0.000616,-0.001498,-0.000624,0.000715,-0.000426,-0.000119,-0.000345,4.3e-05,0.000467,-0.000407,-0.000907,0.000375,8.2e-05,-0.000231,-0.000475,8.6e-05,-0.000977,-0.000226,0.00082,8.7e-05,-0.000333,-3.1e-05,-6.7e-05,-0.000783,2.2e-05,0.000257,-0.000678,0.000286,0.000122,0.000161,-0.000118,-0.000221,0.000418,0.000558,9.6e-05,2.7e-05,-0.000174,-0.00026,-0.000559,-4e-04,-0.00015,-0.000918,-0.000392,-0.000327,-0.000887,-0.000105,5.4e-05,0.000307,-0.00019,0.000181,-0.000171,0.000413,-0.000116,-0.000382,-4.4e-05,0.000385,0.00029,0.00055,0.000495,0.000418
-7.9e-05,-0.000735,-8.5e-05,-0.000396,0.000154,0.000299,0.000152,0.000494,-0.000124,0.000929,5.6e-05,0.000668,0.000342,-0.000101,-0.000459,-0.000256,-0.000593,0.000434,-4.1e-05,0.000952,0.000493,0.00018,0.000308,0.000375,0.000122,-0.000316,0.000182,7.8e-05,-0.000159,0.000814,0.000171,0.000885,0.000146,-0.000268,-2.5e-05,0.000237,-0.00014,0.000116,-0.000282,-0.000401,-0.000174,-0.000224,-0.000104,0.000852,-6e-05,0.000168,-0.000156,-0.000385,-0.000537,0.000251,-3.7e-05,0.00011,0.000321,0.000346,0.000609,7.1e-05,0.00062,0.000501,-0.000429,0.000295,0.000107,0.000349,0.001063,0.000256,-7.8e-05,0.000109,-0.000473,0.000148,-0.000142,-0.000593,0.00032,0.000333,0.000569,-0.000381,0.000535,-1.6e-05,-0.000132,3e-05,0.000242,-0.000438,7.2e-05,-0.00024,-0.000486,-0.000104,-3.7e-05,0.000745,-0.000137,-3e-06,-7.8e-05,-0.00027,9.2e-05,0.000188,-4e-05,-0.000557,0.000221,-8.1e-05,-1.2e-05,0.000304,0.000526,0.000586,7.2e-05,0.00015,0.00068,0.000511,8.5e-05,7.6e-05,-0.000116,-3.2e-05,-0.000179,-0.000326,-0.000637,0.000113,-0.000252,3.9e-05,0.000367,2.2e-05,-0.000459,-0.000196,-0.00015,-0.000516,-7.7e-05
0.000775,0.000557,0.000428,-0.000131,-0.000639,-0.000171,0.000198,-0.000118,-5.9e-05,-0.000457,1.5e-05,-0.000181,0.000142,-0.000229,0.000478,0.000692,0.000324,0.000424,0.000117,0.00032,0.000217,0.00019,-9.7e-05,-0.00037,-5.9e-05,0.000536,-0.000108,6.2e-05,0.000446,-0.000439,-0.000129,-0.000613,0.000483,0.000838,0.000144,8.3e-05,0.000319,-0.000174,-3.9e-05,0.000428,9.7e-05,5e-04,-0.000638,-4.4e-05,-4.8e-05,-8e-04,4e-04,0.000289,0.000326,-0.00012,1e-05,0.000386,-0.00015,-4.7e-05,-0.000183,0.000149,-0.000697,-0.000224,0.000146,0.000153,0.000278,0.000117,-0.000576,-2e-05,0.000145,-0.000112,0.000445,-0.000277,0.000175,0.000202,-6.6e-05,-6.9e-05,-0.000144,0.000253,0.000232,0.000267,3.5e-05,0.000301,-7.8e-05,-7.7e-05,0.000257,0.000121,0.000664,-0.000156,7.6e-05,-0.000348,0.000325,0.000379,0.000118,2e-04,6.8e-05,0.000198,-6.6e-05,0.000255,-8.4e-05,0.000324,-6.5e-05,-6.9e-05,-0.000178,-0.000194,-0.000317,-0.000159,-0.000321,-0.000421,-0.00033,0.000256,1.8e-05,0.000439,0.000229,8.7e-05,0.000295,0.000268,-7.6e-05,-0.000578,-0.000375,7.9e-05,0.000125,-6.2e-05,-0.000233,8.3e-05,-4.4e-05
-3.5e-05,-0.000126,-0.000305,6.1e-05,-0.000144,0.000207,-6.2e-05,-9.9e-05,-0.000508,3.3e-05,-3.5e-05,-8.3e-05,8.4e-05,6.3e-05,-0.000406,-0.000232,-0.000226,-0.000211,-0.000401,-9.8e-05,-0.000439,-8.1e-05,6.5e-05,0.000583,0.000144,-0.000467,0.000418,7e-06,-7.6e-05,0.000199,0.000112,0.000228,-0.000425,-0.000359,-3e-06,0.000261,0.00012,-6.2e-05,-0.000444,0.000138,7.5e-05,1.9e-05,0.000488,0.000174,-0.000143,-4.6e-05,2e-04,5.9e-05,0.000188,0.000144,0.000486,-3e-05,0.000258,0.000455,0.000274,0.000175,-0.000191,-4.4e-05,0.00048,1.4e-05,-0.00024,-4.9e-05,0.00031,-1e-05,0.000319,0.000145,-0.000307,0.000219,-8.9e-05,0.000153,6.2e-05,9.9e-05,-0.000186,1.4e-05,-0.000434,-5e-04,0.000139,0.000501,0.000201,0.000114,-3e-04,-3.5e-05,-8.2e-05,-4.4e-05,0.000184,-0.000231,-0.000299,-0.000434,-0.000352,8.1e-05,-2.5e-05,-6e-05,-2.6e-05,5e-06,-9.3e-05,-0.000291,-0.000307,-6.2e-05,9.5e-05,-0.000215,0.000393,6.6e-05,0.000273,-0.000131,0.000124,-7e-06,0.000291,-0.00013,-9.5e-05,0.000169,9.1e-05,-2e-05,2.5e-05,0.000353,-3.8e-05,-2e-04,-0.00021,0.000211,-7.5e-05,0.000148,-0.000108
-0.000272,0.000535,-0.000267,-0.000131,0.000448,0.000354,0.00045,4.4e-05,1.2e-05,-0.000128,-3.3e-05,8.2e-05,0.000126,-7.1e-05,2.4e-05,0.000224,0.000115,-0.000386,0.000149,-2e-05,-4e-05,-2e-06,1.2e-05,-0.000126,-7.4e-05,-0.000111,3.8e-05,6.6e-05,-0.000107,-0.000221,-0.000149,-8.5e-05,-0.000312,-0.000101,-4e-05,-0.000383,-5.6e-05,-1.8e-05,9.5e-05,-0.000155,0.000145,-0.000368,-3e-05,-5.1e-05,-0.000354,0.00064,-0.000307,-0.000122,-0.000339,-6.9e-05,-0.00019,3.7e-05,9.1e-05,-0.000229,4.4e-05,-0.000263,-1.9e-05,-0.000281,-0.000262,-0.00014,0.000449,-9.5e-05,-2.9e-05,-0.000216,1e-06,-0.000337,-8.2e-05,-0.000101,1.3e-05,-0.000119,3e-05,6e-05,1.1e-05,-0.00021,0.000164,3.7e-05,-8.5e-05,-0.000366,-0.000364,-0.000153,0.000218,0.000366,5e-05,0.000217,-0.000294,3.3e-05,-0.000251,-6e-05,3.3e-05,0.000136,-8e-05,-0.000354,7.5e-05,4.8e-05,0.000208,-0.000197,0.000138,2e-04,-9.6e-05,0,0.000102,-8e-05,-0.000482,-3.2e-05,0.000129,-8.8e-05,-0.000137,-7.2e-05,0.000101,0.000144,-8.7e-05,-0.000287,-5.4e-05,-0.000223,-0.000115,0.000122,-9e-06,-2.9e-05,3.6e-05,0.00018,7e-05
0.000327,-0.000624,-1.6e-05,-3.5e-05,-1.6e-05,-7.3e-05,-0.000181,0.000156,0.000522,0.000228,0.000103,-6.6e-05,0.000208,0.000327,-4e-05,-0.000263,-0.000185,-0.000233,-6.5e-05,-6.7e-05,-7.5e-05,-0.000107,-9.6e-05,0.000155,0.000118,1.9e-05,4.6e-05,-0.000225,1e-04,0.000145,9.8e-05,-6.5e-05,5.5e-05,-0.000134,7.8e-05,8.1e-05,-1.6e-05,-8.1e-05,0.00011,-0.000129,-2.4e-05,-1.2e-05,-0.000385,-0.000323,-8e-06,0.000274,2.5e-05,-0.000238,0.000292,-5.9e-05,0.000225,-3.8e-05,5.6e-05,0.000241,-5.6e-05,-2.1e-05,5.8e-05,0.000171,-0.000166,3.8e-05,4.7e-05,6.9e-05,0.000121,9.1e-05,5e-06,0.000148,0.000178,-2.6e-05,-8.8e-05,1e-06,-1e-06,-3.9e-05,0.000141,3.6e-05,-1.1e-05,0.000119,1.3e-05,-7.3e-05,0.000157,4.5e-05,-0.000132,-2.9e-05,2.8e-05,-1.4e-05,0.000415,0.000109,0.000195,8e-05,-7.2e-05,4e-05,2e-05,0.00021,2.4e-05,-3.8e-05,-0.000168,9.4e-05,2.2e-05,-0.000345,4.1e-05,2.2e-05,-8.1e-05,8e-06,4e-05,0.000145,-5.9e-05,0.000124,1.7e-05,-1.3e-05,-9.6e-05,-1.6e-05,-6.9e-05,0.000157,3.3e-05,0.00023,0.000155,-4.3e-05,0.000119,-0.000111,1.3e-05,-9.7e-05,-4.8e-05
-6e-06,0.000424,-2.4e-05,0.000128,-1.6e-05,-0.000101,5.2e-05,-5.2e-05,-0.000163,-0.00017,-3.3e-05,3.4e-05,-0.000375,-0.000277,-4e-06,0.00011,0.000245,5.8e-05,3e-06,-0.000106,6e-06,2.1e-05,3.9e-05,-0.000102,-9.2e-05,0.000177,-0.000104,5.8e-05,9.6e-05,-6e-06,5e-06,0.000223,-3e-06,-1e-05,-2e-06,5.3e-05,-9.1e-05,-3.2e-05,-0.000207,5.5e-05,7.4e-05,0.000138,0.000261,9.3e-05,-7.8e-05,-3.1e-05,5.5e-05,0.000278,-2e-05,2.4e-05,-0.000169,5e-06,9.5e-05,-6.1e-05,9e-05,-0.000108,0.000167,-0.000142,0.000107,3.9e-05,0.000121,-4.8e-05,-0.000173,-3e-06,4.1e-05,8e-06,-0.000119,0.000217,-1e-05,-1.8e-05,-6.7e-05,-1.7e-05,9.4e-05,1.6e-05,-0.000162,6e-05,5.2e-05,0.000188,1.9e-05,-0.000107,-5.7e-05,-0.000187,-6.1e-05,-0.000145,-0.000151,-3.6e-05,-8.8e-05,5.2e-05,0.000101,-3.9e-05,5.4e-05,-2.8e-05,5.9e-05,-4.1e-05,-2.5e-05,0.000146,7.1e-05,9.6e-05,2.8e-05,-0.000124,0.000135,-1e-05,-0.000112,-0.00014,7.7e-05,-1.1e-05,-6e-06,-7.7e-05,1e-04,-7.8e-05,6.4e-05,7.6e-05,-3e-05,-0.000175,-0.000212,4.4e-05,-0.000119,0.000154,2.2e-05,-2.3e-05,2.8e-05
-0.00021,-5e-06,-0.000105,-0.000122,-0.000143,6.7e-05,-0.000114,-0.000106,-0.000127,0.000121,1.3e-05,-1.8e-05,-0.000166,0.00022,8.4e-05,-9.5e-05,-7.4e-05,-7e-06,4e-06,0.000373,0.000179,4.9e-05,7.6e-05,0.00013,-2e-06,-0.000136,-6.8e-05,8e-05,-9.6e-05,-5.6e-05,-0.000125,-0.00018,1.6e-05,9.4e-05,-3.3e-05,-7.4e-05,7.6e-05,3.2e-05,2.2e-05,-1.1e-05,-2.9e-05,-0.000259,8e-05,1.1e-05,6.1e-05,-0.000237,-6.8e-05,-0.000247,-0.000179,0.000115,6.9e-05,9.8e-05,-0.000126,5.1e-05,-0.000172,4.1e-05,-3.4e-05,1.7e-05,-0.000138,3.3e-05,-8.2e-05,-4.6e-05,0.000166,2e-06,-9.1e-05,7e-06,5.6e-05,-0.000122,4.4e-05,-3.5e-05,5.7e-05,-3.3e-05,-6.4e-05,6.8e-05,4e-05,-1.2e-05,-0.000107,5.6e-05,-5.6e-05,0.000257,5.6e-05,1.9e-05,-1.7e-05,6.1e-05,-7.7e-05,-0.000199,7.1e-05,0.000101,2.1e-05,-3.4e-05,-3.1e-05,1.9e-05,-4e-06,4.8e-05,8.8e-05,-2.3e-05,6e-06,4.5e-05,8e-06,5.3e-05,5.8e-05,3.3e-05,0.000139,0.00013,-9.8e-05,-9.5e-05,-6e-06,1.4e-05,6.3e-05,-2.7e-05,8.2e-05,-3.6e-05,-5.1e-05,0.000101,0.000258,-3.1e-05,4.9e-05,-0.000102,-5.2e-05,9.9e-05,6.4e-05
-4e-06,-0.000154,0.000136,4e-06,0.000191,-4.8e-05,-0.000178,2.9e-05,-4.7e-05,5.6e-05,3.3e-05,4.7e-05,4.4e-05,-2.6e-05,-3e-06,-1.3e-05,8e-05,7e-06,-1.6e-05,-6.3e-05,4.4e-05,-5.3e-05,-1.1e-05,-0.000103,3.5e-05,0.000141,0.000256,-0.000118,8.6e-05,9.5e-05,0.000103,9.2e-05,-3.9e-05,6e-06,1e-06,1.8e-05,-4.4e-05,-6.8e-05,9.2e-05,1.3e-05,-8e-06,7.3e-05,-0.000142,-2.7e-05,3.9e-05,2.3e-05,-4e-05,0.000113,0.000135,5e-06,-1.5e-05,-1.4e-05,-7.6e-05,-1.8e-05,5.6e-05,6e-05,0,3.9e-05,0.000139,-2.7e-05,-0.000151,7.2e-05,-0.000136,4.1e-05,8.5e-05,-4.7e-05,1.2e-05,4.5e-05,-8.9e-05,7.3e-05,-2.7e-05,4e-05,-7.7e-05,3.8e-05,2.9e-05,-7.8e-05,2.5e-05,-8.8e-05,4e-06,-0.000157,-5e-05,1.3e-05,-2e-06,-6.4e-05,3.4e-05,0.000134,-4.7e-05,-2.2e-05,2e-05,6.1e-05,1.4e-05,-9.4e-05,-3.3e-05,-1e-06,-3.5e-05,-7.8e-05,-0.000123,-2e-05,-2.8e-05,4e-06,-0.000105,2.7e-05,-7.7e-05,-4.8e-05,7.1e-05,3.6e-05,5.6e-05,2.2e-05,-6.8e-05,7e-06,-6e-06,-2e-06,9e-06,-4.7e-05,-1e-05,2.4e-05,3.6e-05,3.8e-05,-8.6e-05,-8.3e-05,1e-06
5e-06,5.4e-05,9.8e-05,3e-06,-0.000113,0.000112,0.000154,2e-05,-1e-05,-0.000155,-5.9e-05,-6.4e-05,-1e-05,-8.5e-05,-4e-05,5.3e-05,-3.7e-05,6e-06,2.9e-05,-0.000193,-9.4e-05,2.6e-05,-4.6e-05,5.8e-05,-5.7e-05,5.2e-05,-7e-06,6.9e-05,1.5e-05,-5e-06,-2.4e-05,-5e-05,0.000146,-4.2e-05,-1.7e-05,-1.9e-05,-1.1e-05,1.8e-05,6.8e-05,-1.3e-05,3.1e-05,6.9e-05,4.8e-05,-2.9e-05,2.9e-05,2.2e-05,4.1e-05,8e-05,-4.9e-05,1e-05,6.9e-05,2.3e-05,-2.4e-05,-1.9e-05,-9e-05,-5.4e-05,6.4e-05,1e-06,6.7e-05,0,6.5e-05,-2.2e-05,5.5e-05,-4.1e-05,-1.3e-05,0.000101,-6.9e-05,-4.1e-05,5.5e-05,-2.7e-05,-1.5e-05,-7e-06,1.7e-05,1e-06,-0.000127,-4.7e-05,4.2e-05,6.8e-05,-1.8e-05,9.8e-05,3.1e-05,4e-06,7e-06,-5e-06,2.3e-05,0.00013,8.7e-05,-2.1e-05,-3e-06,5.5e-05,-1.6e-05,4.1e-05,2e-06,-2.7e-05,2.7e-05,6.5e-05,2.3e-05,1.9e-05,-3.9e-05,-4.1e-05,4.7e-05,-5.6e-05,0.000124,5.6e-05,-7.5e-05,4.3e-05,6e-06,5.7e-05,5.7e-05,2.3e-05,-4.6e-05,-4.7e-05,6.8e-05,6e-05,-9e-05,-2.7e-05,-7e-06,-1.4e-05,-2.1e-05,-4.6e-05,-1.8e-05
-6.9e-05,-8.2e-05,-8.5e-05,-1.5e-05,-6.1e-05,-3.6e-05,-5.6e-05,1e-06,3e-05,8.5e-05,7e-06,3e-05,9.1e-05,3.4e-05,-9e-06,4.1e-05,1.7e-05,1.2e-05,-6.9e-05,-4.4e-05,2e-06,1.8e-05,-3.6e-05,-3.3e-05,4.1e-05,-0.000121,-2.5e-05,0,8e-06,-0.000101,-1.3e-05,2.9e-05,-0.000172,-5.4e-05,5e-06,-7.4e-05,2.1e-05,1e-05,-0.000101,1e-06,-3.7e-05,7.1e-05,-9e-06,-8.7e-05,3.1e-05,9.4e-05,2e-06,-0.000146,1.1e-05,1.1e-05,3.7e-05,1.9e-05,3.3e-05,2e-05,2.3e-05,2.4e-05,-1.5e-05,-2.4e-05,-4.5e-05,-1.2e-05,-6.3e-05,1.7e-05,-7e-05,-3.7e-05,-2.4e-05,-1.5e-05,9.3e-05,-5.1e-05,-5.1e-05,-3.2e-05,1.3e-05,-4.1e-05,-2.2e-05,-9.3e-05,2e-05,2.9e-05,-3.2e-05,-5.8e-05,8e-06,1e-05,2e-06,2.4e-05,-5.6e-05,5.9e-05,-8e-05,-9e-05,-4.9e-05,-2.1e-05,-2.9e-05,3.9e-05,1.6e-05,-3e-06,-1.5e-05,4.5e-05,-2e-05,0.000102,-1.9e-05,3.5e-05,1.4e-05,2.5e-05,4.1e-05,2.8e-05,-0.000156,-6e-06,3.4e-05,-7.9e-05,1.7e-05,-3.3e-05,-2e-05,-1.5e-05,0.000133,4.6e-05,-4.8e-05,-4e-06,8.3e-05,1.5e-05,-6e-06,-2.8e-05,-1.3e-05,-9e-06,-4.7e-05
1.9e-05,-8e-05,-1.5e-05,-1e-05,3.6e-05,4.9e-05,7e-05,-5.5e-05,-4.8e-05,0,3.3e-05,-4.5e-05,-1.9e-05,-8.5e-05,-4.7e-05,-7.6e-05,1e-06,5e-06,6e-05,9.8e-05,-2.6e-05,3e-06,3.5e-05,5.6e-05,-2.1e-05,0.000104,5.6e-05,-3.3e-05,8.8e-05,-4.9e-05,-3e-06,2.3e-05,-1.3e-05,6.2e-05,1.1e-05,2.1e-05,-1.6e-05,-5e-06,-8.9e-05,4e-06,2.4e-05,-0.000117,-4.7e-05,3.4e-05,2.7e-05,-3.6e-05,-1.3e-05,0.000176,-2.6e-05,-1e-05,-1.1e-05,-3.7e-05,-3.4e-05,1.2e-05,1.3e-05,1.9e-05,-0.000115,9.6e-05,-0.000119,2.7e-05,-6.5e-05,-3.6e-05,0.000107,7.6e-05,5e-06,-3.8e-05,-5.8e-05,4.8e-05,3.7e-05,3.5e-05,-3.4e-05,1.2e-05,-7.6e-05,7.1e-05,6.3e-05,-2.8e-05,2e-05,-2.1e-05,3.2e-05,-1.5e-05,1.8e-05,1.4e-05,7.6e-05,8e-06,7.7e-05,-2.7e-05,-4.7e-05,2e-05,2e-06,-2e-06,1.4e-05,-2.6e-05,-3.4e-05,-4.6e-05,-2.2e-05,-4.7e-05,1.9e-05,-7.8e-05,3e-05,6.3e-05,-2.3e-05,-4.3e-05,0.000115,-4.1e-05,1.4e-05,5.8e-05,-2.7e-05,1.1e-05,-8e-06,-3.7e-05,-6.9e-05,-3e-06,-7e-06,5e-05,-0.000106,3e-06,1.6e-05,5.2e-05,3.7e-05,7.2e-05,9e-06
9.4e-05,9.9e-05,5.9e-05,-3.1e-05,0.000125,6e-06,1.2e-05,-1.6e-05,9.6e-05,-2.9e-05,-1e-05,6.5e-05,-4.4e-05,6e-06,2.9e-05,6.8e-05,8e-06,-5e-05,-3.9e-05,5.3e-05,2.3e-05,-1e-06,3.9e-05,-3.1e-05,0,-1.8e-05,0.000129,4.3e-05,-8.2e-05,3.3e-05,1.6e-05,-6.8e-05,1e-06,3e-05,1e-06,4.5e-05,2.2e-05,3e-05,8.4e-05,2e-06,-3e-05,6.5e-05,6.6e-05,-2.1e-05,-6e-06,3.1e-05,3e-05,-0.000152,4.7e-05,-2.1e-05,2.8e-05,7e-06,7.7e-05,-5.5e-05,-2e-06,8e-06,2e-05,-5.4e-05,2.9e-05,-4e-06,3.5e-05,-2.4e-05,-9.2e-05,0,-2.9e-05,1.9e-05,-8e-06,-6.5e-05,-2e-05,-2e-05,8e-06,6e-06,-1.6e-05,-1.5e-05,-7.9e-05,2.1e-05,-1.7e-05,3e-05,-3.7e-05,3e-06,-1e-05,-6.5e-05,-4.1e-05,-6.2e-05,-2e-05,-6.3e-05,3.7e-05,1.9e-05,-2.9e-05,-2.7e-05,6e-06,9e-06,7e-06,2.8e-05,1.7e-05,-5.4e-05,8.9e-05,4.9e-05,-1.3e-05,-3.1e-05,1.7e-05,1.6e-05,-3.1e-05,9e-06,-4e-06,1e-05,2.2e-05,-2e-06,1.5e-05,-5e-06,4e-06,-3.5e-05,1.8e-05,-7.3e-05,4.1e-05,-1.9e-05,-4.9e-05,-1.5e-05,3.8e-05,-6.9e-05,6e-06
-3.2e-05,-5e-06,-6.5e-05,3.7e-05,-6e-05,-6.1e-05,4.4e-05,2e-05,1e-05,-5e-06,1.3e-05,-6.9e-05,-5.9e-05,-6.3e-05,1.1e-05,1.7e-05,-2.2e-05,1e-05,1.4e-05,3e-05,-2.5e-05,-2.1e-05,-3.2e-05,2.5e-05,1.1e-05,-5e-05,-8.4e-05,-3.3e-05,2.2e-05,4.3e-05,-2.8e-05,7.2e-05,5e-05,2e-06,1.1e-05,2.4e-05,9e-06,9e-06,3.3e-05,-1e-06,-1.1e-05,3.2e-05,-2.6e-05,4e-06,1.5e-05,-0.000102,2.7e-05,4.6e-05,-4.5e-05,9e-06,-3.8e-05,6e-06,8e-06,-6e-06,2.5e-05,1.8e-05,3e-06,3.2e-05,1e-04,-1e-06,2e-05,5.1e-05,9.6e-05,-5.6e-05,2.7e-05,2.3e-05,3.7e-05,2.2e-05,-1e-06,1.5e-05,-8e-06,1.7e-05,2.1e-05,-2.8e-05,2.3e-05,7.6e-05,-1.3e-05,0.000103,-4e-06,-1.5e-05,5e-06,3.4e-05,3.8e-05,3.7e-05,-1.6e-05,6.2e-05,-1.6e-05,-7.7e-05,3e-05,2e-06,-1.1e-05,6e-06,2e-06,-1.4e-05,6e-06,1.9e-05,-5.4e-05,-2.5e-05,-4e-06,3.7e-05,2.2e-05,1.5e-05,7.8e-05,-2.2e-05,-4e-06,-2.3e-05,1e-05,-2.8e-05,1e-05,2.5e-05,-6e-06,-4e-06,-5e-06,2.3e-05,-1.6e-05,2.6e-05,4.4e-05,-4e-06,-1e-06,-5e-06,1.2e-05
-5.5e-05,-4.8e-05,-2.5e-05,-1.6e-05,-6.8e-05,1.9e-05,-3e-06,-1.5e-05,-0.000102,3e-05,6e-06,4.5e-05,-8e-06,5.7e-05,8e-06,-6.4e-05,-7e-06,-3e-06,0,-9.4e-05,2.2e-05,0,-2e-05,-1.2e-05,-2e-06,-1.5e-05,-4.1e-05,8e-06,1.4e-05,-2.6e-05,4.5e-05,-5.6e-05,-1.7e-05,-5.6e-05,2e-06,-0.000104,-1e-06,2.2e-05,-1e-05,-5e-06,-4e-06,-7.5e-05,-7e-06,-3e-06,3e-06,-1.1e-05,-3e-05,-3.2e-05,1.7e-05,4.2e-05,1.3e-05,1.4e-05,2.5e-05,-1e-06,-3.6e-05,-3.2e-05,-1.1e-05,1.8e-05,-1.3e-05,-8e-06,5.9e-05,-2.4e-05,-7e-05,5e-06,-6.3e-05,-2.4e-05,-6.9e-05,8e-06,7e-06,3e-06,2.4e-05,-9e-06,-5e-06,8e-06,5.4e-05,-6.3e-05,1.5e-05,-5.9e-05,1.2e-05,5.3e-05,-1.7e-05,1.3e-05,-1.2e-05,-2.4e-05,1.4e-05,1e-05,-2e-06,-9e-06,-8e-06,2.6e-05,6e-06,-2.3e-05,8e-06,2e-06,-2.8e-05,2.9e-05,7e-06,1.9e-05,-1.1e-05,8e-06,4e-06,-4e-06,-3.9e-05,-3e-06,-2e-05,1.1e-05,1.1e-05,1e-06,2.3e-05,3e-05,6.5e-05,-5e-06,1.8e-05,-5.5e-05,2.1e-05,-2.3e-05,-2.9e-05,1.8e-05,-1.3e-05,3e-05,1.5e-05
4.5e-05,9.2e-05,7.5e-05,3e-06,2.3e-05,-8e-06,-6.1e-05,-1e-05,9e-06,-2.3e-05,-2.4e-05,-3.8e-05,-1.6e-05,-4.2e-05,8e-06,2.6e-05,-2e-06,3.8e-05,-1e-05,-7.5e-05,7e-06,6e-06,1e-05,1.6e-05,1.7e-05,6.1e-05,6.9e-05,9e-06,-1.4e-05,2.2e-05,-4.3e-05,3.8e-05,6.6e-05,2.4e-05,-3e-06,1.2e-05,-7e-06,-5e-06,-5.1e-05,-2e-06,-1.3e-05,-6e-06,3.4e-05,-2.2e-05,-1.7e-05,-2.8e-05,-1.8e-05,2.2e-05,6e-06,-1.1e-05,1e-05,1.1e-05,-2.5e-05,-2.9e-05,1.5e-05,-2.4e-05,3.9e-05,-1.3e-05,-5.4e-05,1.1e-05,1.5e-05,8e-06,3e-05,1.2e-05,5.6e-05,-1e-06,3.9e-05,5e-06,-1e-05,-8e-06,-1.6e-05,-1.4e-05,-2e-05,-3.8e-05,-2.5e-05,-1.3e-05,4e-06,-7.4e-05,-1.7e-05,-7.8e-05,9e-06,-2.3e-05,-1.7e-05,-3.1e-05,1.2e-05,-5.6e-05,9e-06,5.9e-05,2.8e-05,7e-06,-1.1e-05,1.1e-05,7e-06,1.5e-05,1e-06,-1.7e-05,-3.2e-05,-1.6e-05,1.4e-05,-2e-05,1.2e-05,1.4e-05,9e-06,6e-06,8e-06,-1.3e-05,7e-06,6e-06,-1.3e-05,1.3e-05,-4.1e-05,1.9e-05,-2.3e-05,4.5e-05,-1.1e-05,2.4e-05,-2e-05,-9e-06,-2e-05,1.5e-05,-1.1e-05
-1.8e-05,-6.3e-05,-1.4e-05,-1e-05,3.9e-05,2e-06,0,-1e-05,9e-06,-1.1e-05,1.2e-05,3.1e-05,2.5e-05,5.4e-05,-2.3e-05,-2.6e-05,2.1e-05,3e-06,7e-06,0.000127,1.9e-05,-3e-06,1.2e-05,-1.6e-05,-2.2e-05,-6.4e-05,2e-05,-2.8e-05,-2e-06,-5e-06,2.5e-05,-2.3e-05,2e-05,2.5e-05,0,3.1e-05,-1.5e-05,1.4e-05,4.1e-05,-1e-06,-9e-06,7.9e-05,-4.2e-05,5e-05,3e-06,9.1e-05,1.5e-05,-2.5e-05,6e-06,1.1e-05,-3e-06,-1.4e-05,1e-05,-2.4e-05,-3e-05,1.5e-05,-3.7e-05,-2.5e-05,6e-06,3e-06,1.5e-05,6e-06,-3e-05,-8e-06,-8.2e-05,2.8e-05,-4e-06,2.7e-05,3e-06,-1.1e-05,1.2e-05,2e-06,-5e-06,2.7e-05,8e-06,7e-06,5e-06,4.5e-05,2.1e-05,6.2e-05,1e-06,1.9e-05,1e-05,5.9e-05,-1.3e-05,3.3e-05,1.9e-05,-7e-06,-3.4e-05,2e-06,1e-06,9e-06,0,-2.2e-05,5.1e-05,-2.4e-05,-2.2e-05,2.2e-05,8e-06,5e-06,3e-06,-2.6e-05,-6.2e-05,-1.1e-05,2.4e-05,3e-05,-7e-06,2e-06,-2e-06,-1.2e-05,1.3e-05,-2e-06,-8e-06,-3.5e-05,3e-06,-2.4e-05,4.1e-05,-5e-06,1e-05,-4e-05,-4e-06
-3.6e-05,4e-05,-4.4e-05,-8e-06,-6e-06,1.7e-05,-3.8e-05,7e-06,3.5e-05,2.4e-05,8e-06,-3.7e-05,1.4e-05,1.3e-05,-8e-06,3.7e-05,-3e-06,-7e-06,-1.5e-05,5e-05,-1.8e-05,3e-06,7e-06,7e-06,1.1e-05,3.4e-05,-4e-06,2.8e-05,1.9e-05,-9e-06,-6e-06,-3e-06,-6.4e-05,6e-06,-7e-06,-2e-06,2e-06,-7e-06,3e-05,9e-06,-2e-06,-2.6e-05,-1.4e-05,-2.3e-05,-3.3e-05,1.6e-05,-3e-06,7.5e-05,-2.8e-05,-3e-06,1.5e-05,5e-06,-5e-05,1.1e-05,-1e-05,2e-06,2.3e-05,2.4e-05,-1.8e-05,0,1.6e-05,-1.6e-05,5.2e-05,1.9e-05,4.4e-05,-1.5e-05,-3.5e-05,-1.7e-05,-6e-06,2.2e-05,-1.4e-05,-5e-06,1.1e-05,2.2e-05,4.9e-05,-1.5e-05,-6e-06,3.6e-05,-1.4e-05,-3.7e-05,-8e-06,-7e-06,-2.7e-05,-2.4e-05,-7e-06,2.5e-05,-2.3e-05,-8e-06,2.5e-05,-2e-05,-3e-06,-1.6e-05,1e-06,1.7e-05,-4.2e-05,-1.3e-05,5.1e-05,-2.5e-05,-2e-06,7e-06,-7e-06,1e-05,8.4e-05,2e-05,-1.8e-05,-3.5e-05,7e-06,-2e-06,6e-06,-1.9e-05,1e-05,-1.7e-05,2.1e-05,4.5e-05,3e-06,2.2e-05,-3.7e-05,0,2.8e-05,-4e-06,-1.2e-05
2.9e-05,-2.8e-05,4e-05,1.1e-05,-4.2e-05,-3.3e-05,2.5e-05,3e-06,1.9e-05,-1.3e-05,-1e-06,2.6e-05,1.3e-05,6e-06,-9e-06,-6.2e-05,-1.3e-05,6e-06,4e-06,-0.000106,-1.9e-05,1.1e-05,-1.1e-05,-8e-06,-5e-06,-9e-06,-2.2e-05,-1.2e-05,-4.1e-05,-1.6e-05,-1e-06,2.7e-05,8e-06,-6e-06,-4e-06,-1.7e-05,2e-06,-8e-06,-5.6e-05,3e-06,-1.4e-05,-3.9e-05,5.7e-05,2.4e-05,-6e-06,-2.1e-05,-1.1e-05,-6.5e-05,1.9e-05,-5e-06,-2.1e-05,-2e-06,0,-2.7e-05,1e-06,2e-06,1.6e-05,-3.9e-05,3.2e-05,-2e-06,-5.6e-05,1.1e-05,-5.3e-05,-5e-06,-1.2e-05,-1.2e-05,4.1e-05,5e-06,4e-06,-1.7e-05,9e-06,9e-06,7e-06,-2e-06,-1.5e-05,4.3e-05,-6e-06,-2.6e-05,-1.4e-05,6e-06,1.5e-05,-1.2e-05,1.8e-05,-2.4e-05,1e-05,6e-06,-7e-06,2e-06,-3.2e-05,-1.3e-05,2e-06,5e-06,-2e-06,-1.1e-05,-9e-06,2.9e-05,1e-06,1.4e-05,-1.1e-05,-3.6e-05,7e-06,-1.1e-05,-7.4e-05,2e-06,5e-06,8e-06,-1e-06,9e-06,-1.6e-05,-8e-06,2.1e-05,-4e-06,-5e-06,-4e-05,-1.6e-05,-1.4e-05,3e-05,-2e-06,2.2e-05,2.9e-05,-6e-06
1.6e-05,-2e-06,3e-06,-1.2e-05,3.7e-05,2.2e-05,1e-06,-9e-06,-3.7e-05,-1e-05,1.1e-05,-2.2e-05,2.1e-05,1.7e-05,8e-06,6.9e-05,1.1e-05,-1.9e-05,4e-06,0,-9e-06,-4e-06,-1.2e-05,5e-06,-3e-06,1.4e-05,4e-05,-8e-06,3.7e-05,-1e-06,-7e-06,-3.9e-05,-1.3e-05,-3.1e-05,-1e-06,-1.6e-05,2e-06,-1e-06,-1.8e-05,-9e-06,0,4e-05,-3.7e-05,-1.3e-05,-6e-06,-9.8e-05,1.2e-05,4.9e-05,7e-06,-1.9e-05,6e-06,-8e-06,-1.5e-05,3e-06,-1.1e-05,2e-06,-2e-05,-3e-06,2.1e-05,-2e-06,-3.8e-05,-6e-06,3.9e-05,-2.9e-05,-6e-06,1.7e-05,-1.9e-05,-1.6e-05,-5e-06,1.1e-05,-6e-06,-5e-06,6e-06,-2.7e-05,-5e-06,-1.8e-05,1e-06,-9e-06,1.8e-05,5e-06,-1.3e-05,9e-06,-1.5e-05,2e-06,-6e-06,-5.2e-05,1.1e-05,-7e-06,2.1e-05,5e-06,3e-06,3e-06,-3e-06,3e-06,3.1e-05,4e-06,1.1e-05,-3e-06,-1e-06,1.1e-05,-8e-06,7e-06,3.7e-05,7e-06,-2e-06,3.2e-05,1.4e-05,-5e-06,1.9e-05,1e-06,-3.2e-05,6e-06,-1.8e-05,1.9e-05,3.1e-05,1.2e-05,-9e-06,-1e-06,-4e-06,-2e-05,1.8e-05
-1.1e-05,0,-4.8e-05,1.1e-05,1.4e-05,-1.7e-05,1.9e-05,3e-06,-1e-06,1.5e-05,-6e-06,1.1e-05,-5e-06,-1.6e-05,7e-06,-2e-05,8e-06,1e-05,-1.1e-05,0,2.1e-05,-5e-06,3e-06,-3e-06,1e-05,-7e-06,2.4e-05,2.2e-05,-2e-05,1.4e-05,1.5e-05,4e-05,3.6e-05,1.1e-05,0,0,8e-06,-1.4e-05,1.9e-05,6e-06,-3e-06,1e-05,-9e-06,9e-06,-5e-06,1.8e-05,9e-06,-4.4e-05,-1.7e-05,2.4e-05,-2e-06,5e-06,4.7e-05,-1.6e-05,2.6e-05,-9e-06,0,1e-06,-5e-06,3e-06,3e-06,6e-06,-3.3e-05,1.8e-05,-6e-06,6e-06,1e-06,-5e-06,5e-06,-4e-06,1.4e-05,-8e-06,1.5e-05,2.9e-05,2.9e-05,-4e-06,4e-06,5e-06,-6e-06,-2e-06,2e-06,5e-06,1.9e-05,5e-06,-4e-06,-7e-06,-2e-06,1.4e-05,-9e-06,2e-06,6e-06,2e-06,-3e-06,1e-06,-8e-06,-1e-05,-8e-06,0,5e-06,-2e-06,-7e-06,4e-06,-4.5e-05,-4e-06,-6e-06,-3.8e-05,-6e-06,-6e-06,-1e-06,6e-06,1.9e-05,8e-06,6e-06,-1.1e-05,-2.9e-05,-7e-06,-2e-06,5e-06,-2.2e-05,-1.8e-05,-2e-06
0,-7e-06,2.2e-05,-8e-06,-2.2e-05,-6e-06,2.9e-05,3e-06,-1e-05,-2e-06,-8e-06,-1.2e-05,-1.4e-05,5e-06,7e-06,-8e-06,-1e-06,-1.1e-05,5e-06,1e-05,7e-06,2e-06,1.5e-05,2e-06,-1e-05,1.1e-05,-3.7e-05,-2.1e-05,-2.2e-05,1.2e-05,-1.5e-05,-3.5e-05,-3.7e-05,1.6e-05,4e-06,-1e-06,-1e-06,-2e-06,5e-05,0,-4e-06,-4.5e-05,3.6e-05,1.4e-05,1.3e-05,3.8e-05,-6e-06,7e-06,4e-06,1e-06,7e-06,1e-06,-1.4e-05,-2e-06,-1.3e-05,7e-06,1e-06,-5e-06,-5.2e-05,-1e-06,-3e-06,2e-06,2.9e-05,2e-05,1.1e-05,-2.1e-05,1.4e-05,-2e-06,-9e-06,-8e-06,-5e-06,-1e-06,1e-05,-6e-06,-1.5e-05,2e-05,5e-06,-6e-06,-7e-06,8e-06,2e-06,-5e-06,-3e-06,-9e-06,5e-06,2.8e-05,-1.2e-05,5e-06,1.4e-05,-2e-06,-3e-06,-2e-06,-6e-06,1e-06,-9e-06,-3e-06,-4.1e-05,-4e-06,1e-06,-2e-05,1.2e-05,-7e-06,1.4e-05,-2e-06,1.4e-05,1.5e-05,3e-06,1e-06,1e-06,1e-06,1e-05,-6e-06,3e-06,3.1e-05,2.6e-05,0,1e-05,2e-06,-1.5e-05,4e-06,7e-06
1e-05,1e-06,3.2e-05,1e-06,-3e-05,1.5e-05,-1.1e-05,5e-06,1.3e-05,-1e-05,6e-06,5e-06,-3e-06,-3.7e-05,-7e-06,2e-06,-8e-06,7e-06,3e-06,6.7e-05,-4e-06,-3e-06,3e-06,0,7e-06,-7e-06,-2.7e-05,1.1e-05,2e-05,3e-06,1.2e-05,2.7e-05,5.9e-05,3e-06,2e-06,1.5e-05,-4e-06,-8e-06,-3.4e-05,-5e-06,4e-06,-2e-06,-2.1e-05,-1.1e-05,0,4.2e-05,1e-06,-3e-06,1.2e-05,-2e-06,-5e-06,3e-06,1.8e-05,8e-06,1.5e-05,4e-06,-3e-06,-7e-06,6e-06,3e-06,-1e-06,-1.1e-05,-1.9e-05,-1.6e-05,-7e-06,6e-06,-2.6e-05,-9e-06,8e-06,1.2e-05,4e-06,1e-06,2e-06,2e-06,-1.7e-05,-4.1e-05,-3e-06,-2e-06,7e-06,-1.8e-05,-8e-06,1e-06,8e-06,1.6e-05,1.2e-05,-7e-06,1.2e-05,-1.7e-05,-8e-06,-1e-05,0,0,0,-2e-06,1e-06,4e-06,1.3e-05,6e-06,-1e-06,8e-06,-1e-06,6e-06,0,-2e-06,-2.1e-05,1.7e-05,1e-06,0,7e-06,-4e-06,-1e-06,-3e-06,-2e-06,-1.5e-05,-1.9e-05,5e-06,-4e-06,-2e-06,-4e-06,2.3e-05,-3e-06
-1.2e-05,8e-06,-3.4e-05,6e-06,3.7e-05,-2.1e-05,0,0,9e-06,4e-06,-4e-06,-3e-06,-1.4e-05,1.5e-05,-6e-06,2.5e-05,-2e-06,2e-06,-1.2e-05,-3.7e-05,-1e-06,1e-06,-1.6e-05,-1e-06,-5e-06,7e-06,2.6e-05,3e-06,-2e-05,-1.8e-05,-3e-06,-6e-06,-3.4e-05,-1.8e-05,0,-1.2e-05,-1e-06,2e-06,-2.6e-05,4e-06,-5e-06,4.1e-05,-1.3e-05,8e-06,7e-06,-2.7e-05,4e-06,-1e-06,-8e-06,4e-06,-8e-06,-2e-06,6e-06,-1.9e-05,-3e-06,-6e-06,-9e-06,1.9e-05,4.7e-05,-4e-06,2e-05,6e-06,2.9e-05,-5e-06,8e-06,1.3e-05,1.9e-05,6e-06,-9e-06,-6e-06,-3e-06,6e-06,8e-06,6e-06,1e-05,1.3e-05,-3e-06,2.6e-05,-1e-05,3e-05,4e-06,3e-06,1e-06,-1e-06,-2e-05,3e-06,1.1e-05,-9e-06,3e-06,-1.3e-05,-3e-06,4e-06,3e-06,4e-06,1e-05,1.8e-05,4e-06,-6e-06,-4e-06,1.3e-05,-5e-06,-9e-06,2.8e-05,-2e-06,2.5e-05,-2.3e-05,-3e-06,-2e-06,-1.7e-05,2e-06,-1.3e-05,5e-06,1e-06,1.3e-05,6e-06,-6e-06,-9e-06,5e-06,1.1e-05,-1.8e-05,-1.5e-05
-1e-05,-7e-06,0,-9e-06,1.2e-05,1.8e-05,-1.8e-05,1e-06,-1.3e-05,1.2e-05,3e-06,-4e-06,7e-06,-3.2e-05,-7e-06,-4.8e-05,7e-06,-3e-06,1.1e-05,-7.7e-05,-4e-06,-1e-06,-3e-06,0,2e-06,-1.2e-05,1.7e-05,-1.7e-05,1e-06,-1.5e-05,-5e-06,-1.3e-05,-8e-06,-1.1e-05,0,-3.3e-05,0,-3e-06,1.6e-05,-1e-06,4e-06,-2.4e-05,2.5e-05,-6e-06,6e-06,-1.7e-05,-7e-06,1.2e-05,-1e-05,3e-06,0,-6e-06,-1.1e-05,1.1e-05,-6e-06,1e-06,1e-06,-2e-06,-3e-06,5e-06,3.5e-05,4e-06,-3.8e-05,7e-06,-7e-06,-8e-06,-1e-06,-8e-06,5e-06,-1e-06,4e-06,-4e-06,1.1e-05,-3.2e-05,-1e-05,2.4e-05,0,-1.2e-05,5e-06,-3.2e-05,-2e-06,-5e-06,-1e-05,-2.6e-05,1.5e-05,-1.2e-05,-1.5e-05,1.1e-05,-5e-06,-2e-06,-2e-06,-2e-06,1e-06,-6e-06,-2e-06,-2e-06,2.4e-05,4e-06,0,-1.7e-05,1.2e-05,6e-06,-3.4e-05,-2e-06,-1.3e-05,5e-06,1e-05,1e-06,1.1e-05,8e-06,1.6e-05,6e-06,-8e-06,-2.2e-05,-3e-06,7e-06,1e-05,-6e-06,8e-06,-6e-06,8e-06
1.4e-05,1.3e-05,3.5e-05,2e-06,-1.8e-05,-1.1e-05,-2.6e-05,5e-06,2.4e-05,-1.8e-05,5e-06,0,1.9e-05,1.9e-05,1e-06,2.5e-05,3e-06,4e-06,-8e-06,5e-05,1e-06,-1e-06,1e-05,-1e-06,2e-06,1e-06,-4.4e-05,1.9e-05,1.2e-05,1.1e-05,5e-06,2.3e-05,-1.1e-05,1e-05,-1e-06,5e-06,2e-06,4e-06,1.7e-05,-1e-06,0,-1.6e-05,-1.3e-05,0,0,-2.5e-05,-5e-06,-5e-06,1.8e-05,-1.5e-05,0,3e-06,-1.1e-05,5e-06,9e-06,-2e-06,-1.2e-05,8e-06,-2.7e-05,-5e-06,1.1e-05,-6e-06,2.8e-05,-8e-06,3e-06,-1.1e-05,-1.6e-05,8e-06,-3e-06,3e-06,-1e-06,-4e-06,0,1.6e-05,-2.1e-05,-1.9e-05,-1e-06,-2.4e-05,2e-06,2.4e-05,0,1e-06,4e-06,1.6e-05,-4e-06,1.6e-05,-2e-06,9e-06,-3e-06,3e-06,-1e-06,0,1e-06,6e-06,-1e-06,-2.2e-05,9e-06,0,5e-06,1.5e-05,-1e-06,-3e-06,3.8e-05,1e-06,2e-06,1e-05,-6e-06,2e-06,-7e-06,8e-06,1e-06,1e-06,6e-06,1.2e-05,-1.4e-05,-9e-06,-9e-06,1e-06,-3e-06,1e-05,-6e-06
-2e-06,-7e-06,-2.5e-05,-2e-06,-1.7e-05,-1e-06,7e-06,0,-1.7e-05,1e-05,-8e-06,-7e-06,4e-06,-4e-06,5e-06,0,-6e-06,-9e-06,1e-06,5.7e-05,-3e-06,6e-06,2e-06,1e-06,-4e-06,7e-06,-8e-06,-1.2e-05,-2.1e-05,1.2e-05,-1e-06,-3e-05,3e-06,1.4e-05,-1e-06,2.5e-05,-1e-06,5e-06,-6e-06,3e-06,1e-06,3.7e-05,-4e-06,5e-06,4e-06,1e-05,3e-06,1.8e-05,-7e-06,3e-06,1e-05,-2e-06,-1.1e-05,-7e-06,-1.8e-05,1e-06,6e-06,6e-06,-1e-06,5e-06,-1.5e-05,-1e-06,-1.9e-05,4e-06,7e-06,1.8e-05,1.5e-05,3e-06,-1e-06,-3e-06,0,-1e-06,-2e-06,7e-06,4e-06,1e-05,2e-06,1.2e-05,-8e-06,-1.1e-05,3e-06,7e-06,-1.2e-05,-2e-06,0,6e-06,8e-06,-1.1e-05,4e-06,0,-1e-06,3e-06,0,-3e-06,-9e-06,1e-06,-1.9e-05,-4e-06,0,1.1e-05,-8e-06,2e-06,-3.9e-05,0,0,-7e-06,3e-06,-3e-06,0,0,-7e-06,-5e-06,5e-06,-1.9e-05,2.6e-05,8e-06,1e-06,0,-1e-05,9e-06,7e-06
-1e-05,-5e-06,-2e-05,4e-06,2.2e-05,1.2e-05,-3e-06,0,-1.9e-05,4e-06,0,6e-06,1.3e-05,1.4e-05,3e-06,-1.4e-05,0,5e-06,2e-06,-3.8e-05,1e-06,-2e-06,-4e-06,-2e-06,5e-06,-1.3e-05,2.2e-05,-3e-06,6e-06,-5e-06,0,3.2e-05,6e-06,-3e-06,-1e-06,-5e-06,-2e-06,2e-06,-2.7e-05,-1e-06,3e-06,3e-06,1.4e-05,-1.3e-05,0,1.8e-05,2e-06,-2.4e-05,-6e-06,8e-06,-6e-06,-2e-06,1e-06,6e-06,1.8e-05,4e-06,5e-06,8e-06,2e-06,-6e-06,-3e-06,3e-06,2e-05,9e-06,-2e-06,-3e-06,-1e-05,-7e-06,3e-06,0,-2e-06,-2e-06,5e-06,-1e-06,-2e-06,-5e-06,2e-06,1.4e-05,3e-06,1e-06,-1e-06,-7e-06,7e-06,-1.4e-05,-7e-06,-3.4e-05,-2e-06,-8e-06,-4e-06,-3e-06,0,-2e-06,0,-1e-06,8e-06,1.7e-05,-1.2e-05,3e-06,-1e-06,-1e-05,3e-06,1e-06,3.9e-05,1e-06,-6e-06,-6e-06,-2e-06,0,1.1e-05,-9e-06,-2e-06,-1e-06,-1e-05,2e-05,-2.5e-05,-5e-06,8e-06,-4e-06,-1.3e-05,-1.5e-05,9e-06
1e-05,1.4e-05,3.4e-05,-3e-06,8e-06,-1.5e-05,2.4e-05,0,2e-05,-9e-06,2e-06,-1e-05,-2e-06,1.2e-05,1e-06,1.9e-05,2e-06,-4e-06,-7e-06,-2.2e-05,2e-06,-2e-06,-3e-06,2e-06,-6e-06,9e-06,-5e-06,1.5e-05,1.2e-05,-2e-06,-1e-06,-2.6e-05,-1.1e-05,-1.3e-05,0,-2.7e-05,0,5e-06,1.9e-05,-1e-06,1e-06,-3.9e-05,-1e-05,9e-06,-2e-06,3e-05,-2e-06,1.9e-05,7e-06,-6e-06,-6e-06,3e-06,3e-06,7e-06,-1e-05,-4e-06,-6e-06,-4e-06,9e-06,6e-06,-9e-06,-1e-06,-2.2e-05,-1.2e-05,3e-06,-1.1e-05,-2e-06,0,-4e-06,3e-06,-2e-06,3e-06,1e-06,-8e-06,-1.2e-05,-8e-06,-2e-06,-8e-06,1e-06,1e-06,0,1e-06,-2e-06,1.2e-05,1.4e-05,1.1e-05,-9e-06,1.1e-05,9e-06,-6e-06,2e-06,-1e-06,-1e-06,3e-06,9e-06,-4e-06,-1.2e-05,-3e-06,-3e-06,7e-06,-3e-06,-3e-06,-9e-06,3e-06,1.4e-05,1.3e-05,0,1e-06,-1.3e-05,-1e-05,1.1e-05,4e-06,1e-06,-1.7e-05,1.5e-05,4e-06,-1.2e-05,5e-06,-4e-06,-6e-06,-1e-05
4e-06,-1.9e-05,-5e-06,-1e-06,-2.3e-05,1.1e-05,2e-06,2e-06,-5e-06,2e-06,-3e-06,7e-06,-2.5e-05,2e-06,-6e-06,-9e-06,3e-06,4e-06,6e-06,2e-06,4e-06,2e-06,-3e-06,-2e-06,3e-06,-2e-06,-3.7e-05,-1.7e-05,-2.3e-05,1.2e-05,1e-06,1e-05,2.3e-05,-5e-06,1e-06,-1e-05,0,1e-06,1.7e-05,1e-06,2e-06,1.7e-05,-2e-06,-7e-06,1e-06,-6e-06,3e-06,-2.4e-05,3e-06,1e-06,-2e-06,-1e-06,1.3e-05,-4e-06,9e-06,-2e-06,1e-05,5e-06,1.1e-05,-6e-06,-3.1e-05,0,2.1e-05,-5e-06,-7e-06,3e-06,1e-05,-1.1e-05,4e-06,-4e-06,2e-06,-2e-06,-9e-06,5e-06,4e-06,1.3e-05,0,-7e-06,-5e-06,-2e-06,1e-06,3e-06,4e-06,2e-06,-1.4e-05,9e-06,7e-06,6e-06,-1.1e-05,-2e-06,2e-06,1e-06,-2e-06,-4e-06,-1.5e-05,-1.9e-05,1.4e-05,5e-06,0,1e-05,-7e-06,1e-06,6e-06,0,-1.2e-05,-5e-06,1e-06,-1e-06,7e-06,-2e-06,-6e-06,3e-06,6e-06,1.4e-05,6e-06,-3e-06,1.5e-05,0,7e-06,1.3e-05,7e-06
-9e-06,1.1e-05,-2.8e-05,0,0,-3e-06,7e-06,0,1.2e-05,6e-06,6e-06,-1.2e-05,-1.1e-05,1.2e-05,-5e-06,1.6e-05,-3e-06,2e-06,-6e-06,-1.2e-05,-3e-06,-3e-06,2e-06,2e-06,1e-06,5e-06,-1.4e-05,1.1e-05,2e-05,-4e-06,-5e-06,4e-06,-1.8e-05,9e-06,1e-06,1.5e-05,3e-06,0,-8e-06,-1e-06,2e-06,2.3e-05,9e-06,3e-06,-3e-06,-2.8e-05,4e-06,2e-05,-1e-05,6e-06,3e-06,1e-06,5e-06,7e-06,3e-06,1e-06,0,-2e-06,-2e-06,7e-06,-1.3e-05,-3e-06,-2.4e-05,1.3e-05,2e-05,1.5e-05,-1e-05,3e-06,-4e-06,3e-06,1e-06,-2e-06,-6e-06,-1e-06,9e-06,-1.3e-05,1e-06,7e-06,5e-06,4e-06,-2e-06,-5e-06,4e-06,-1.7e-05,9e-06,4e-06,7e-06,-6e-06,1.2e-05,4e-06,1e-06,0,0,3e-06,-3e-06,-2e-06,1.8e-05,-5e-06,2e-06,-1.6e-05,2e-06,-4e-06,-1.7e-05,1e-06,4e-06,-5e-06,-1e-06,-1e-06,-7e-06,4e-06,-5e-06,-2e-06,-4e-06,-1.7e-05,-1.9e-05,1e-06,-8e-06,0,1.3e-05,0,-1e-05
5e-06,-2e-06,2.6e-05,-2e-06,2e-05,-6e-06,1.5e-05,-3e-06,-4e-06,-5e-06,1e-06,1e-05,-6e-06,-1.8e-05,-2e-06,-1.7e-05,-2e-06,-3e-06,0,4.9e-05,-2e-06,0,7e-06,-2e-06,-2e-06,-8e-06,1.9e-05,1e-06,-7e-06,-2e-05,6e-06,-1.5e-05,1e-05,1.3e-05,0,3e-06,2e-06,-2e-06,-1.9e-05,0,1e-06,-2.7e-05,-8e-06,3e-06,-2e-06,-2.7e-05,-3e-06,-2e-05,7e-06,-6e-06,7e-06,-2e-06,0,4e-06,-7e-06,0,-1e-06,-3e-06,-2.7e-05,-7e-06,1.7e-05,2e-06,2.5e-05,-3e-06,-2.5e-05,-1.5e-05,3e-06,4e-06,2e-06,-2e-06,2e-06,-1e-06,1e-06,5e-06,-1e-06,1.2e-05,0,-2e-06,-3e-06,-1.1e-05,1e-06,3e-06,-3e-06,2e-06,-7e-06,-5e-06,-9e-06,-4e-06,-1.4e-05,3e-06,0,-1e-06,-1e-06,0,1.2e-05,2.2e-05,4e-06,5e-06,1e-06,5e-06,-1e-06,1e-06,1.6e-05,1e-06,2e-06,8e-06,1e-06,0,-4e-06,5e-06,7e-06,-4e-06,-2e-06,1.1e-05,1.2e-05,2e-06,0,1e-06,8e-06,-9e-06,-3e-06
4e-06,-5e-06,1e-05,2e-06,4e-06,1.5e-05,-2.6e-05,0,-1.5e-05,-4e-06,-3e-06,-1.3e-05,6e-06,9e-06,2e-06,1.2e-05,0,4e-06,3e-06,1.2e-05,-1e-06,2e-06,-1e-06,2e-06,3e-06,1.1e-05,-1e-05,-1.2e-05,-8e-06,2e-06,-5e-06,2.7e-05,-1.1e-05,-4e-06,0,-6e-06,-2e-06,-1e-06,-1e-06,1e-06,2e-06,-1e-05,-4e-06,-8e-06,1e-06,1.7e-05,-2e-06,2.4e-05,1e-06,-4e-06,-4e-06,-2e-06,-1.5e-05,1e-06,1.1e-05,0,0,-9e-06,0,6e-06,1.6e-05,3e-06,-1.9e-05,-5e-06,2.4e-05,1e-06,5e-06,-3e-06,-2e-06,-1e-06,-4e-06,-2e-06,-4e-06,1e-05,5e-06,1.1e-05,0,-4e-06,-3e-06,1.8e-05,1e-06,2e-06,2e-06,6e-06,9e-06,-1.1e-05,-3e-06,1e-06,1.3e-05,-1e-06,-2e-06,0,0,-2e-06,2e-06,3e-06,-3e-06,-5e-06,-1e-06,2e-06,-1e-06,0,-3.1e-05,-2e-06,-5e-06,-1e-06,-3e-06,0,9e-06,1e-06,0,0,2e-06,-9e-06,3e-06,-2e-06,4e-06,-2e-06,-5e-06,-4e-06,1e-05
