7e-06,2.5e-05,3.1e-05,1.6e-05,2.1e-05,1.4e-05,6e-06,1.1e-05,3.7e-05,2.2e-05,1.2e-05,2.4e-05,1.1e-05,2.3e-05,6e-06,4.3e-05,3e-06,3.2e-05,3.5e-05,1.3e-05,7.1e-05,5.3e-05,8e-06,6.3e-05,1.8e-05,3.7e-05,2.5e-05,5.5e-05,3.6e-05,4e-06,2.5e-05,1.6e-05,0.000104,4.3e-05,2.9e-05,1e-05,5.1e-05,5.4e-05,4.6e-05,4.9e-05,4e-06,3.5e-05,1.8e-05,7.5e-05,4e-06,4.5e-05,4.4e-05,5.9e-05,2e-06,0.000174,6.8e-05,0.000108,2.5e-05,5.2e-05,6.1e-05,9e-05,8.3e-05,2.2e-05,3.4e-05,3.1e-05,2.6e-05,2.9e-05,1.2e-05,8.8e-05,9.8e-05,4.8e-05,0.000158,1e-06,3.6e-05,0.000127,0.000138,4.1e-05,3.4e-05,8.4e-05,0.000142,0.000185,0.000139,0.000116,5.9e-05,7e-06,2.6e-05,2.3e-05,0.000106,8.2e-05,4.9e-05,0.000159,6.3e-05,3.2e-05,2.8e-05,2.8e-05,0.000116,1.2e-05,2e-05,2e-05,4.4e-05,3.5e-05,0.000116,6.8e-05,0.000255,0.000116,4e-06,5e-06,1.2e-05,1.3e-05,1.7e-05,2.1e-05,0.000211,0.000137,5.4e-05,8.4e-05,0.000227,8.2e-05,0.00013,0.00015,5.5e-05,0.000196,0.000229,1e-06,7.6e-05,7.1e-05,2e-05
7.1e-05,3.6e-05,9.1e-05,4.7e-05,6e-05,5.8e-05,6.8e-05,6.2e-05,0.000111,0.000136,8.5e-05,7.3e-05,7.7e-05,6.2e-05,3.8e-05,3e-05,0.000108,3.8e-05,5.4e-05,0.000185,0.000211,7.9e-05,0.00011,6.8e-05,0.00014,0.000164,5e-05,0.000144,0.000101,0.000135,2.5e-05,5.3e-05,0.000215,0.000232,0.000214,1.7e-05,0.000104,0.00016,6.4e-05,0.000107,0.000119,9e-05,0.000148,0.000231,0.000152,9.2e-05,0.000166,4.8e-05,4.7e-05,0.000287,6.6e-05,0.000223,0.000185,0.000248,0.000187,0.000203,0.000211,0.000268,0.000109,7.6e-05,0.00013,0.000192,9.8e-05,0.000173,0.000288,0.000102,0.000379,0.000384,9.7e-05,0.000255,0.000471,0.000349,0.000175,0.000131,0.000171,0.000522,0.00013,0.00033,0.000451,0.000243,2.9e-05,7.3e-05,0.000279,0.000384,0.000161,0.000467,0.000487,0.000275,0.000219,8.3e-05,0.000182,0.000322,0.000182,4.8e-05,7.4e-05,9.2e-05,0.000254,8.1e-05,0.000504,0.000703,0.000591,0.000149,5.8e-05,0.000179,0.000256,0.000339,0.000441,0.00047,0.000183,0.000168,0.000511,0.000294,0.000249,0.000297,0.000332,0.000174,0.000665,0.000376,0.000286,0.000269,0.000213
3.6e-05,4.5e-05,3.1e-05,8.9e-05,0.000123,4.5e-05,5.5e-05,3.8e-05,6.4e-05,0.000121,0.000138,5.2e-05,6.5e-05,5.2e-05,3.9e-05,4e-05,0.000134,0.000154,0.000129,0.000279,4.4e-05,4.6e-05,0.000149,0.000162,5.1e-05,0.000149,0.000188,0.000115,0.000135,0.00019,0.000176,4.4e-05,0.000185,0.000125,0.000119,0.000181,0.000123,6.3e-05,8.7e-05,9e-06,8.7e-05,5.2e-05,0.000166,5.4e-05,0.000214,0.000214,0.000213,8e-05,0.000107,0.000258,0.000189,0.000132,0.000143,0.000135,0.000103,0.000226,0.000141,0.000116,0.000128,0.000179,0.000117,0.000241,0.00033,0.000361,0.000373,0.000404,0.000528,0.00033,0.000352,0.000228,8.1e-05,0.000136,0.000156,0.000397,0.000261,0.000362,0.000369,0.000317,0.000114,0.000439,0.000404,0.000288,0.000124,0.000142,0.000137,0.000545,0.000321,0.000198,0.000278,0.000251,8.2e-05,0.000512,0.000199,0.000103,6.7e-05,0.000199,0.000212,0.000412,0.000247,0.000217,0.000168,0.000257,0.000227,0.000275,0.00023,0.000317,0.000127,0.000272,0.000257,8.5e-05,0.000275,0.00076,0.000739,0.000186,0.000437,0.000188,0.000417,0.000576,0.000195,9.1e-05,3.5e-05
2e-05,3.6e-05,2.9e-05,3.8e-05,3.6e-05,3.5e-05,7.8e-05,2.6e-05,5.7e-05,3.5e-05,4.2e-05,2.9e-05,4.3e-05,0.000117,5.4e-05,0.000124,0.000143,2.2e-05,6.5e-05,0.000147,0.000149,0.000147,0.000121,3.9e-05,7.7e-05,0.000118,0.000164,0.000114,0.000186,0.000151,0.000112,5.8e-05,0.000176,0.000182,0.000236,0.000136,8.7e-05,0.000109,0.00016,0.000199,0.000158,0.000133,9.6e-05,0.000134,0.000135,0.000112,8.6e-05,1e-04,0.000155,0.000239,0.000106,0.00018,0.000239,0.000205,0.000148,0.000447,0.000221,0.000201,0.000113,0.000108,7.4e-05,0.000318,0.000206,0.000254,0.000102,0.000129,0.000266,0.00034,0.000382,0.000191,8e-05,0.000208,0.00031,0.000627,0.000386,0.000138,0.000279,0.000157,7.4e-05,0.000387,0.000138,2.7e-05,0.00018,0.00042,0.000232,0.000273,0.000226,0.000169,0.00028,0.000164,0.00018,0.000237,0.000327,0.000353,0.000137,0.00019,0.000169,0.000302,0.000307,0.000174,0.000384,0.000282,5.9e-05,0.000297,0.000439,0.00042,0.000231,0.000681,0.000401,0.000243,0.000217,0.000763,0.00053,0.000294,0.000565,0.000499,0.000358,0.000123,0.000131,9.6e-05,0.000178
3.2e-05,2e-06,4.6e-05,3.2e-05,1e-05,4.6e-05,3.9e-05,3.4e-05,4.3e-05,3.9e-05,5.3e-05,1.2e-05,5.3e-05,1e-04,3.5e-05,0.00013,9.6e-05,8.3e-05,6.5e-05,7.5e-05,4.7e-05,9.4e-05,6.3e-05,0.000115,6.5e-05,0.000182,0.000116,0.000115,6.3e-05,6e-05,0.000192,0.000112,0.000108,0.000107,0.000106,4.9e-05,7.6e-05,0.000141,7.8e-05,5.7e-05,3.2e-05,6.3e-05,9.4e-05,0.000143,1e-04,9e-05,0.000127,0.000109,0.000103,0.000231,0.000332,0.000128,0.000146,9.6e-05,0.000112,0.000591,0.000445,0.000321,9.2e-05,0.000188,4.3e-05,0.00017,0.000105,0.000169,7.7e-05,8.5e-05,0.000149,0.000651,0.000302,0.000226,0.000227,0.000357,0.000484,0.000301,0.000179,0.000111,0.000238,0.000274,0.000148,0.000289,0.000138,4e-05,3.8e-05,0.000461,0.000216,9.5e-05,0.000144,0.000202,0.000173,0.000402,0.000359,0.000218,7.9e-05,8.4e-05,4.5e-05,9.9e-05,0.000237,0.000386,0.000189,0.000139,0.000252,0.000142,5.7e-05,0.000363,0.000145,0.000492,0.000298,0.000631,0.000504,0.000245,0.000257,0.000394,0.000219,0.000164,0.000456,8.3e-05,0.000301,0.000228,0.000259,0.000123,0.000221
1.9e-05,1e-05,5.9e-05,6.6e-05,3.2e-05,5.6e-05,6.5e-05,7.7e-05,8.8e-05,6e-05,7.3e-05,5e-05,6.5e-05,0.000115,0.000112,0.000148,9.5e-05,0.00013,9.1e-05,2e-05,5.9e-05,0.00012,0.000114,7.4e-05,8.4e-05,0.000154,0.000187,5e-05,5.8e-05,0.000104,0.000119,0.000117,6.3e-05,8.8e-05,0.000134,2.1e-05,5.8e-05,0.000113,0.00015,0.000105,0.000121,4.7e-05,0.000199,7.9e-05,7e-05,0.000159,0.000161,6.6e-05,0.000183,0.000287,0.000465,0.000381,0.000351,0.000245,0.00025,0.000238,0.000347,0.000125,0.000217,0.000177,0.000191,0.000226,0.000236,6.7e-05,0.000154,0.00014,0.00018,0.000594,0.00029,0.00031,9.2e-05,0.000312,0.000191,0.000359,0.000264,0.000123,0.000192,9.1e-05,0.000126,0.000107,0.000149,8.9e-05,8e-05,0.00041,0.000325,0.000488,0.000224,0.000293,0.000201,0.000323,0.000318,0.000245,3.6e-05,0.000171,8.1e-05,0.000227,0.000282,4.5e-05,0.000197,0.000217,0.000162,0.000231,0.000125,0.000265,0.000226,0.000321,0.00021,0.000267,0.000234,0.000163,4.1e-05,0.000232,0.000519,0.000344,0.000408,0.000447,0.000102,0.000186,0.000259,0.000197,3.1e-05
3e-05,2.8e-05,5.6e-05,1.7e-05,6.8e-05,9.1e-05,6.1e-05,1.8e-05,4.5e-05,5.9e-05,3.6e-05,5e-05,2.1e-05,0.000124,0.000161,6.5e-05,9.9e-05,7.3e-05,0.000115,3.1e-05,4.3e-05,4.1e-05,2.7e-05,0.000109,0.000175,0.000133,1.5e-05,7.9e-05,3.8e-05,9.4e-05,0.000121,3.7e-05,2.1e-05,3.3e-05,0.000143,7.3e-05,6.5e-05,9.6e-05,4.4e-05,5.7e-05,0.00016,8.7e-05,0.000299,0.000161,0.000149,0.000224,9.6e-05,0.000107,0.000197,0.00017,0.000168,0.00017,1e-05,0.000102,0.000229,0.000314,0.000385,0.000208,0.000175,0.000163,0.000214,0.000329,0.000169,0.00025,0.000183,0.000136,0.000167,0.000434,0.000206,0.000154,0.000108,0.00011,8.9e-05,5.6e-05,0.000174,0.000125,0.000145,6e-05,0.000133,9.4e-05,0.00019,9.3e-05,0.000125,0.000257,0.000218,0.000484,0.000307,0.000323,7.2e-05,0.000442,0.000251,0.000152,0.000228,0.000274,0.000254,0.000238,0.000197,0.000266,0.000407,0.000333,0.000146,8.9e-05,7.5e-05,0.00016,0.000101,0.000214,0.000182,0.000115,0.000214,0.000299,0.000156,0.000223,6.9e-05,0.000115,0.000107,5.6e-05,0.000212,0.000324,0.000194,3.1e-05,9.3e-05
2.4e-05,2.1e-05,6.1e-05,2.5e-05,7.6e-05,5.7e-05,3e-05,2.7e-05,1e-05,7.8e-05,9.1e-05,8.1e-05,7.7e-05,6.6e-05,0.000109,7.4e-05,0.000109,6.6e-05,0.00013,0.000122,7.6e-05,6.8e-05,1.7e-05,0.000105,0.000114,1.8e-05,5.8e-05,5.7e-05,7.6e-05,0.00015,0.000148,0.000111,4.4e-05,3e-05,0.000132,0.00011,6.2e-05,8.6e-05,9.7e-05,9.5e-05,0.000134,0.00011,0.000254,0.000138,0.00018,1.7e-05,0.000124,8.3e-05,0.000185,0.000208,4.7e-05,7.8e-05,0.00012,0.00011,0.000367,0.000205,0.000275,0.000181,0.000222,0.000284,0.00017,0.000197,0.000186,0.000231,0.000154,0.00022,8.7e-05,0.000293,0.000262,0.000132,0.000107,5.7e-05,5.6e-05,8.3e-05,0.000149,0.000139,6.9e-05,0.000202,0.000146,5.5e-05,0.000275,0.00019,0.00011,0.000234,0.000221,0.000271,0.000242,0.000226,0.000253,0.000273,0.000194,9.6e-05,0.000141,0.000141,0.000189,0.000354,0.000143,0.000282,0.000267,9.1e-05,7.4e-05,0.000212,0.000142,7.3e-05,0.000282,0.000267,0.000284,0.000466,0.000165,0.000147,0.000133,0.000188,9e-06,0.000137,0.000152,0.000157,5.3e-05,0.000192,0.000284,0.000308,0.000301
8e-06,1.2e-05,4.1e-05,3.5e-05,5.8e-05,3.9e-05,2.3e-05,4.2e-05,1.3e-05,7e-05,2.5e-05,2.1e-05,1.9e-05,1.6e-05,1e-04,0.000106,6.4e-05,4.2e-05,9.2e-05,0.000102,8.1e-05,6.9e-05,5.6e-05,0.000142,8.2e-05,8.6e-05,1e-04,8.8e-05,3.9e-05,0.000146,6.8e-05,0.000127,5.2e-05,2.1e-05,8.4e-05,0.00011,2.2e-05,2e-06,5.3e-05,2.4e-05,0.000109,7e-05,0.000179,0.000104,0.000264,0.000238,0.000216,0.000116,0.000174,0.000119,0.000194,5.8e-05,0.000166,0.000117,0.000353,0.000146,7.2e-05,1.6e-05,0.000259,7.7e-05,0.000185,0.000213,8.4e-05,0.000194,0.000117,0.000165,2e-04,5.9e-05,0.00021,0.000251,0.000308,0.000203,9.6e-05,3.6e-05,7.9e-05,5e-05,0.00015,0.000328,0.000353,0.000197,0.000307,0.000225,0.000141,0.000164,2.1e-05,0.000174,0.000346,0.000206,0.000174,0.000303,7.3e-05,0.000142,0.000145,6.8e-05,0.000159,8.8e-05,6.9e-05,0.000146,0.000167,0.000249,0.000167,0.000131,1.6e-05,0.000153,0.000255,0.000148,0.000288,0.000254,0.000191,0.000225,0.000145,0.000102,0.000257,0.000156,0.000193,0.000389,0.000229,0.000211,6e-05,0.000173,9.9e-05
1.8e-05,8e-06,2.9e-05,3.2e-05,8e-06,8e-06,1.1e-05,3.2e-05,1.8e-05,4.1e-05,3.8e-05,1.6e-05,1.2e-05,3.6e-05,6e-05,4.6e-05,2.1e-05,1.5e-05,2e-05,7.3e-05,6.3e-05,9.8e-05,7.1e-05,5.9e-05,1.2e-05,4.2e-05,7e-05,4.1e-05,3.5e-05,6.9e-05,3.3e-05,9.6e-05,4.5e-05,5.5e-05,5.1e-05,9.2e-05,5.8e-05,4.8e-05,8.7e-05,8.2e-05,9.5e-05,7.1e-05,7.3e-05,2.3e-05,0.000212,4.8e-05,9.2e-05,6.6e-05,0.000103,5.4e-05,8.6e-05,6.5e-05,0.000166,8.9e-05,0.000171,0.000117,0.000158,6.6e-05,0.000188,0.000149,0.000304,0.000286,0.000104,0.000184,0.000131,9.8e-05,3.5e-05,9.2e-05,0.00018,5.4e-05,0.000145,0.000101,0.000128,0.000166,8.3e-05,0.000106,2.1e-05,0.000177,0.000101,4.5e-05,0.000216,4.7e-05,9.7e-05,5.7e-05,6.4e-05,0.00017,0.000155,0.000267,0.000119,0.000175,0.000289,0.00012,0.000142,0.000188,0.000163,0.000168,0.000192,0.00021,0.000184,0.000198,5.3e-05,0.000141,0.00013,0.000207,0.00012,4.3e-05,0.000209,6.8e-05,9.9e-05,0.000141,0.000147,0.000111,9.9e-05,7.5e-05,0.000129,0.000239,0.000191,0.00014,0.000105,9.4e-05,8.2e-05
2e-06,1.1e-05,1.3e-05,2.2e-05,1.2e-05,7e-06,1.2e-05,1.6e-05,2.9e-05,1.4e-05,3.9e-05,2.4e-05,1.8e-05,2.6e-05,2.1e-05,4.4e-05,2.9e-05,4e-05,3.5e-05,7.8e-05,9.6e-05,6e-05,1.4e-05,6.7e-05,5.1e-05,7.8e-05,2.8e-05,2.1e-05,6.3e-05,8.2e-05,4e-05,6.6e-05,5.8e-05,7e-05,4.4e-05,5.2e-05,3.6e-05,5.2e-05,4.6e-05,3.3e-05,4.4e-05,9.6e-05,4.2e-05,6.6e-05,0.000129,9.6e-05,9e-06,9.3e-05,0.000124,2.5e-05,6e-06,6.6e-05,4.8e-05,4.8e-05,9.7e-05,0.00016,0.000121,8.9e-05,0.000122,0.000152,0.000256,4.8e-05,0.000151,5.3e-05,9.3e-05,8.9e-05,0.000128,0.000125,8.6e-05,7.6e-05,7.8e-05,0.000128,9.2e-05,0.00021,0.000225,0.00013,7e-05,4.1e-05,0.000164,0.000143,9.1e-05,9.2e-05,0.000138,4.7e-05,0.000109,0.000156,0.000102,0.000117,5.7e-05,0.000141,0.000116,0.000207,0.000259,9.4e-05,8.7e-05,0.000105,2.9e-05,7.4e-05,0.000134,5e-05,4.5e-05,7.8e-05,0.000139,0.00013,0.00022,0.000157,0.000137,7.3e-05,0.000102,0.000199,8.5e-05,4.7e-05,0.000174,0.000182,0.00012,0.000271,0.000168,8.6e-05,8.8e-05,0.000109,2.4e-05
1.1e-05,2e-06,3e-06,2.3e-05,1.1e-05,1.2e-05,1e-05,7e-06,1.6e-05,1.1e-05,3.1e-05,8e-06,7e-06,8e-06,2.9e-05,3.5e-05,1.1e-05,3e-05,2.4e-05,7.5e-05,4.6e-05,2.8e-05,1e-05,6.8e-05,6.3e-05,2.5e-05,1.6e-05,1.1e-05,3.2e-05,4.3e-05,2.3e-05,2.9e-05,4e-05,3.8e-05,1.1e-05,5.1e-05,4.7e-05,4e-05,4.3e-05,4.9e-05,1.8e-05,3e-05,9.8e-05,1e-04,5.1e-05,5.3e-05,5.4e-05,6.9e-05,1.7e-05,8.2e-05,7.5e-05,4.5e-05,3e-06,2.7e-05,5.3e-05,3.2e-05,0.000129,0.000127,0.000173,0.000112,0.000133,0.000101,0.000139,0.000106,1.2e-05,1.4e-05,0.000103,4e-06,6e-05,6.6e-05,1e-05,5.7e-05,4.7e-05,8e-05,2.7e-05,2.4e-05,1.8e-05,8e-06,0.000143,9.3e-05,0.000117,5.3e-05,0.000101,7.2e-05,0.000129,6.8e-05,2.2e-05,8e-05,5.2e-05,5.4e-05,0.000135,0.000187,4.7e-05,7.5e-05,2.4e-05,0.000107,2.9e-05,0.000137,5.5e-05,8.2e-05,3.9e-05,6.4e-05,7.6e-05,9.5e-05,8.8e-05,7.9e-05,6.9e-05,1.7e-05,7.2e-05,0.00014,7.2e-05,5.1e-05,0.000154,8.3e-05,8.2e-05,0.000151,0.000157,0.000108,0.000143,5.7e-05,4.6e-05
1e-05,2e-06,4e-06,1.1e-05,1.8e-05,2e-05,1e-05,5e-06,8e-06,1.6e-05,8e-06,2.1e-05,1.5e-05,5e-06,1.9e-05,3.6e-05,2e-06,2.2e-05,3.9e-05,1.4e-05,2.3e-05,4e-06,2.1e-05,4.8e-05,4.5e-05,2.7e-05,1.5e-05,1.2e-05,4.8e-05,8e-06,1.4e-05,1.5e-05,2.3e-05,1.5e-05,3.2e-05,3.9e-05,3.3e-05,2.5e-05,2.6e-05,2.5e-05,2.2e-05,1.6e-05,5.9e-05,6.4e-05,9e-06,5.3e-05,9.6e-05,4.4e-05,5.8e-05,5.6e-05,1.3e-05,2e-05,3.2e-05,3.6e-05,6.2e-05,0.000108,5.7e-05,9.1e-05,1.7e-05,7e-06,5.2e-05,6.5e-05,1.8e-05,6.6e-05,4e-06,5.4e-05,8.2e-05,4.6e-05,4e-05,0.000115,1.4e-05,3.7e-05,8e-05,4.7e-05,6e-05,3.5e-05,7.6e-05,1.4e-05,0.00013,6.2e-05,1.1e-05,5.2e-05,1.7e-05,3.2e-05,4.6e-05,6.5e-05,5.7e-05,0.000129,3.1e-05,6.5e-05,6.6e-05,7.9e-05,5.8e-05,5e-05,4.1e-05,0.000138,3.5e-05,0.000138,2.7e-05,8.8e-05,6.3e-05,2.8e-05,2.4e-05,6.8e-05,4.4e-05,5.9e-05,9.6e-05,2.4e-05,3.8e-05,9.3e-05,2.5e-05,8.2e-05,0.00014,2.1e-05,3.7e-05,0.000127,0.000119,5.2e-05,7.1e-05,8.6e-05,7e-05
1.2e-05,6e-06,1.2e-05,1.6e-05,2.2e-05,8e-06,2e-06,9e-06,9e-06,1.9e-05,1.1e-05,1.1e-05,4e-06,1.4e-05,2e-05,2e-05,3e-05,2.2e-05,8e-05,2.2e-05,1.3e-05,3.6e-05,2.3e-05,4.1e-05,4e-05,3.6e-05,4.8e-05,2.6e-05,2.5e-05,5.4e-05,2.1e-05,2.9e-05,3.3e-05,5.9e-05,6.4e-05,1.6e-05,6.9e-05,7.3e-05,3.2e-05,6.7e-05,3.4e-05,3.8e-05,8.5e-05,4.2e-05,4.3e-05,2e-05,6e-05,3.1e-05,3.1e-05,3.4e-05,2.3e-05,1.5e-05,2.1e-05,3.5e-05,8.4e-05,0.000157,4.2e-05,0.000142,4e-05,3.1e-05,3.8e-05,9.4e-05,2.6e-05,0.000108,7e-06,3.9e-05,0.000141,0.000118,6.7e-05,0.00023,0.000152,0.000122,4.5e-05,7.4e-05,0.000167,9.7e-05,5.7e-05,5.4e-05,9.3e-05,5.3e-05,6.7e-05,6.6e-05,9.6e-05,2.5e-05,0.000108,9.7e-05,0.000135,0.000224,0.000125,0.000171,6.4e-05,7.8e-05,5.1e-05,0.000121,9.6e-05,0.000185,1.6e-05,0.000141,5.8e-05,0.000101,6.1e-05,2.3e-05,3e-05,6.8e-05,8e-05,5.4e-05,9e-06,7.5e-05,5.3e-05,0.000143,0.000112,0.00013,0.000121,5e-05,7.1e-05,6.5e-05,9.4e-05,7.8e-05,5.8e-05,2.8e-05,5.3e-05
7e-06,1e-05,1.5e-05,2e-05,4.7e-05,3.4e-05,6e-06,1.8e-05,9e-06,1.5e-05,3.6e-05,9e-06,6e-06,4.8e-05,6.7e-05,5e-06,2.4e-05,7e-06,7e-05,8.5e-05,4.7e-05,4.6e-05,2.8e-05,6e-05,6.2e-05,2.9e-05,2.3e-05,3.6e-05,4.5e-05,9e-05,4.6e-05,4.5e-05,5e-05,5.6e-05,7.5e-05,1.5e-05,7.1e-05,2.5e-05,7.1e-05,6.1e-05,4.1e-05,4.3e-05,0.000159,2.7e-05,6e-05,5e-06,2.3e-05,0.000117,7.7e-05,7.6e-05,5.9e-05,5.1e-05,3.2e-05,6.9e-05,0.000194,0.000222,0.000222,1e-04,0.000254,7.8e-05,0.000146,0.000249,2.7e-05,0.000132,9.3e-05,1.1e-05,8.2e-05,7.5e-05,0.000257,0.000184,0.000131,0.000214,0.000207,7.6e-05,0.000277,8.6e-05,3.6e-05,3.3e-05,0.000131,3.5e-05,6.5e-05,4.4e-05,8.3e-05,6.2e-05,0.000123,4.2e-05,0.000157,0.000103,6.6e-05,0.000247,0.000311,0.000212,0.000115,9.7e-05,6.8e-05,0.000243,0.00017,0.00019,0.000106,0.000225,4.7e-05,8.5e-05,9.1e-05,8e-05,0.000227,0.00019,0.000104,5.6e-05,3e-06,0.000195,3.3e-05,0.000117,0.000232,8.5e-05,0.000126,0.000125,0.000239,6e-05,0.000101,0.000157,0.000128
6e-06,1.1e-05,2.7e-05,2.5e-05,5.2e-05,2.9e-05,4.9e-05,4.4e-05,3.5e-05,3.3e-05,1.3e-05,3.1e-05,2.1e-05,7e-05,2.6e-05,9.2e-05,4.5e-05,5.1e-05,4.8e-05,0.000136,7.2e-05,5.5e-05,2.3e-05,4e-05,0.000121,9.3e-05,0.000129,7.8e-05,9.8e-05,0.000125,5.5e-05,8.1e-05,0.000103,4e-05,0.000165,0.000104,5.2e-05,7e-05,0.000129,0.000137,6.6e-05,6.7e-05,0.000172,0.000214,4.3e-05,9.3e-05,8.7e-05,0.000146,1.2e-05,0.000135,0.000181,0.000192,0.000106,5.8e-05,0.00034,0.000443,0.000171,0.000163,0.000443,0.000365,0.00016,0.000378,0.000204,0.00019,0.000238,0.000177,0.000172,0.000118,0.000252,0.000361,0.000322,0.00024,7.8e-05,0.000226,0.000201,0.000307,6.4e-05,9e-05,0.000133,0.000131,9.5e-05,0.000114,0.00018,0.000209,0.000173,0.000178,0.000296,0.00027,0.000296,0.000347,0.000403,0.000292,0.00017,0.000127,0.000184,0.000473,0.000383,0.000477,0.000503,0.000491,0.000472,9.8e-05,4e-05,0.000212,0.000385,0.00013,0.000301,0.000264,0.000109,0.00027,0.000316,0.000232,0.000204,0.000104,0.000165,0.000228,0.000753,0.000513,0.00015,0.000273,0.000279
2.5e-05,1.4e-05,1.6e-05,1.5e-05,5.5e-05,3.8e-05,6.5e-05,6.1e-05,2.2e-05,2.4e-05,3.1e-05,5.1e-05,2.3e-05,6.5e-05,0.000116,0.000163,9e-05,2.6e-05,9.3e-05,0.000128,5.4e-05,6.8e-05,8.9e-05,5.4e-05,0.000126,8.6e-05,0.000109,9.2e-05,0.000132,0.000137,9.1e-05,7.6e-05,9.2e-05,0.000116,0.000311,0.00029,0.000205,4e-05,0.000101,2.4e-05,5e-05,0.000106,5.6e-05,0.000268,0.000167,0.000126,9.6e-05,0.000184,0.000203,0.000288,0.000451,0.000178,7e-06,6.3e-05,0.00046,0.000794,0.000527,0.000375,0.000468,0.000529,0.000551,0.00068,0.000696,0.000331,0.000205,4.4e-05,0.000255,0.000351,0.000146,0.000186,0.000258,0.000538,0.000467,0.000488,0.00028,0.000297,0.000342,0.000262,0.000194,0.000155,0.000111,8.4e-05,0.00013,0.000142,0.000398,0.000177,0.000279,0.000291,0.000286,0.000235,0.000195,0.000351,0.000143,0.000151,0.000154,0.000651,0.000425,7.9e-05,0.000693,0.00042,0.000336,0.000513,0.000318,0.000171,0.000149,0.000285,0.00032,0.000288,0.000297,0.000301,0.000205,7.3e-05,0.000358,0.000344,0.000489,0.000559,0.000737,0.000636,0.000493,0.000395,0.000511
1.6e-05,7e-06,1.2e-05,1.5e-05,5e-05,4.1e-05,2.5e-05,2.2e-05,5e-06,2.4e-05,2.8e-05,3.4e-05,5e-05,5e-05,7.5e-05,4.6e-05,3.8e-05,6.2e-05,9.3e-05,2.8e-05,2.7e-05,7.6e-05,8.8e-05,0.000103,0.000138,9.2e-05,0.000146,6.9e-05,9.5e-05,3e-05,2.3e-05,1.9e-05,0.00015,6.4e-05,0.000309,0.000218,7.2e-05,5.3e-05,0.000111,0.000183,0.000149,0.000101,0.000131,0.00018,0.000154,0.000155,4.1e-05,9.7e-05,0.000109,0.000212,0.000427,0.000236,6e-05,6.9e-05,0.000495,0.000376,0.000116,0.000438,0.000367,0.000117,0.00011,0.000281,0.000356,0.000177,0.000187,0.000142,0.000254,0.000326,0.00017,5.8e-05,0.000359,0.000339,0.000165,0.000143,0.000197,0.000368,0.00016,9.6e-05,0.000209,0.000283,0.000311,0.000283,0.000209,1.9e-05,0.000344,0.000162,0.000124,6.6e-05,0.000243,0.000246,0.000238,0.000207,0.000231,8.1e-05,0.000239,0.000625,0.000391,0.00023,0.000428,0.000323,0.00061,0.000269,0.000106,0.000182,0.000273,0.000372,0.000242,0.000425,0.000536,0.000281,3.9e-05,0.000201,0.000237,0.000152,0.000344,0.000542,0.000848,0.00037,8e-05,0.00029,0.00026
1.3e-05,4e-06,7e-06,5e-06,4.7e-05,2.2e-05,2.8e-05,1.3e-05,3e-05,3.5e-05,3.1e-05,6e-06,3.6e-05,3.1e-05,5.6e-05,8.8e-05,2.2e-05,3.6e-05,1.3e-05,3.6e-05,7.1e-05,6.6e-05,3.4e-05,4.9e-05,1.5e-05,2.1e-05,5.5e-05,3.6e-05,0.000127,0.000125,6.2e-05,5e-05,0.00014,8.3e-05,0.000237,1e-04,5.8e-05,6.8e-05,4.3e-05,0.000129,1e-04,0.000123,6.6e-05,1.8e-05,6.4e-05,2.5e-05,6e-05,5.1e-05,2e-05,0.000145,0.000182,0.00012,6.6e-05,8.5e-05,0.000278,0.00011,0.000268,0.000404,0.000311,9.2e-05,0.000137,0.000129,0.000115,0.000217,5.2e-05,3.6e-05,0.00024,4.9e-05,0.000108,9e-05,0.000199,0.000121,0.000201,5.9e-05,0.000205,0.000186,0.00016,0.000142,0.000275,0.000199,0.000138,8.6e-05,9.7e-05,0.000199,0.000153,0.000106,2.1e-05,2.7e-05,0.000157,0.000189,0.000231,0.000257,0.000213,0.000141,0.000198,0.000593,0.000344,6.7e-05,0.000191,0.000114,0.000232,0.00023,8.1e-05,6.9e-05,0.000109,0.000128,8.9e-05,0.000155,0.000326,0.000254,0.000124,0.000168,4e-05,0.000117,0.000408,0.000199,0.000332,0.000173,8.1e-05,0.000259,0.000123
6e-06,5e-06,2e-06,2e-06,2.7e-05,1e-05,1.1e-05,2e-05,1e-05,9e-06,1.5e-05,1.2e-05,2.4e-05,3.5e-05,2.8e-05,3.3e-05,2.8e-05,2.6e-05,1.9e-05,3.1e-05,4.4e-05,2.6e-05,2.4e-05,3e-05,3.3e-05,3.1e-05,7e-06,2e-05,9.3e-05,6.8e-05,3.7e-05,4.6e-05,6.3e-05,5.6e-05,0.000175,6.8e-05,4.7e-05,7e-06,6.5e-05,4.9e-05,5.2e-05,0.000112,1e-04,5.7e-05,9.5e-05,6.7e-05,3.4e-05,3.8e-05,7.1e-05,0.000212,5.3e-05,7.4e-05,3.1e-05,4.8e-05,0.000192,0.000124,0.000202,6.3e-05,0.000239,0.000176,0.000147,0.000125,5.7e-05,0.000118,6.3e-05,7.6e-05,0.000185,0.000162,0.000156,0.000188,8.4e-05,3.7e-05,0.000152,5.6e-05,0.000131,0.000171,0.000135,9.7e-05,0.000111,2.4e-05,5.6e-05,8.5e-05,7.3e-05,0.000127,2.7e-05,0.000104,0.000182,0.000108,0.000127,0.000158,0.000147,3.4e-05,0.000108,7.5e-05,0.000176,0.000153,5.5e-05,0.000127,0.000283,0.000113,5e-06,8.3e-05,9.9e-05,4.5e-05,0.000114,0.000133,3.4e-05,0.000136,0.000157,2.5e-05,2.5e-05,9.6e-05,4.1e-05,5.8e-05,0.000164,0.000112,0.000132,4.9e-05,7.9e-05,4.9e-05,5.7e-05
6e-06,2e-06,4e-06,2e-06,8e-06,9e-06,3e-06,1.4e-05,8e-06,1.3e-05,2e-05,1e-06,2.2e-05,8e-06,8e-06,1.1e-05,8e-06,7e-06,3.9e-05,9e-06,3.1e-05,3.3e-05,9e-06,1.4e-05,1e-05,3.3e-05,8e-06,2.1e-05,6.2e-05,1.1e-05,1.1e-05,1.8e-05,4.9e-05,1.4e-05,4e-05,2.8e-05,5.2e-05,5.3e-05,4.7e-05,4.3e-05,5.5e-05,4.2e-05,4.3e-05,8.7e-05,4.7e-05,4.3e-05,6.5e-05,9.8e-05,7e-05,0.000184,0.000152,8.4e-05,3.7e-05,5e-05,0.000138,2.9e-05,0.000117,9.9e-05,0.00017,9.3e-05,0.000162,0.000159,7e-05,0.000131,7e-05,3.2e-05,8.6e-05,0.000128,9e-05,0.00013,9.8e-05,6.2e-05,0.000108,0.000119,6.7e-05,4.4e-05,6.4e-05,5.1e-05,0.000113,2.8e-05,6.3e-05,9e-06,5.4e-05,8.4e-05,3.1e-05,0.000126,0.000147,9.8e-05,1.7e-05,7.4e-05,6e-05,0.000125,0.000158,0.000101,4.6e-05,3.2e-05,6e-05,3.4e-05,0.000246,0.000211,4.4e-05,5.5e-05,0.000118,0.000159,4.3e-05,4.2e-05,0.000117,0.000197,3.7e-05,0.000102,6.1e-05,8.1e-05,3.4e-05,7.8e-05,0.000119,0.000134,2.9e-05,0.000153,0.000192,3.9e-05,7.8e-05
5e-06,2e-06,1e-06,2e-06,6e-06,4e-06,7e-06,9e-06,7e-06,2e-05,9e-06,1e-05,1.2e-05,1.3e-05,7e-06,2e-05,7e-06,1e-05,3.6e-05,4.8e-05,4.9e-05,1.9e-05,1.2e-05,1e-05,2.6e-05,2e-06,1e-05,1e-05,4.7e-05,1.9e-05,3e-06,1.3e-05,1.4e-05,2.3e-05,2.7e-05,3.3e-05,4.4e-05,5.3e-05,4.5e-05,1.6e-05,1.8e-05,4.7e-05,2.3e-05,3.1e-05,5.6e-05,2.6e-05,3.4e-05,2.5e-05,1.9e-05,0.000168,7.7e-05,3.2e-05,3.4e-05,3.1e-05,5.6e-05,4.8e-05,9.2e-05,0.000161,8.2e-05,0.000104,1.2e-05,7.8e-05,4e-05,6.2e-05,3.6e-05,1.9e-05,3.6e-05,3.9e-05,0.000107,0.000111,5.7e-05,4.2e-05,0.000106,0.00017,7.5e-05,5.2e-05,1.2e-05,1.8e-05,3.5e-05,4.1e-05,4.2e-05,3.5e-05,5.3e-05,9.8e-05,6.8e-05,3.8e-05,2.4e-05,5.3e-05,2.7e-05,5.8e-05,1.2e-05,9.3e-05,0.000115,8e-05,3.8e-05,8.8e-05,5.2e-05,7.2e-05,0.000168,3.9e-05,6.6e-05,4.8e-05,7.4e-05,9.1e-05,0.000117,0.000151,0.000111,5.6e-05,3.5e-05,8.2e-05,5.4e-05,3.5e-05,7.5e-05,2.1e-05,4e-05,7.1e-05,5.2e-05,0.000107,9.9e-05,0.000186,9.4e-05
3e-06,1e-06,2e-06,2e-06,3e-06,2e-06,3e-06,3e-06,4e-06,9e-06,3e-06,2e-06,4e-06,3e-06,3e-06,1e-05,1e-06,2e-06,1.1e-05,1.8e-05,9e-06,4e-06,3e-06,8e-06,4e-06,4e-06,5e-06,3e-06,1.6e-05,7e-06,8e-06,1e-06,1e-06,8e-06,1.2e-05,1.1e-05,6e-06,1.4e-05,1.4e-05,7e-06,9e-06,7e-06,1.3e-05,8e-06,8e-06,3e-06,9e-06,4e-06,1.1e-05,4e-05,7e-06,5e-06,1.1e-05,1.6e-05,2.5e-05,2.3e-05,2.2e-05,6.3e-05,3.5e-05,1.4e-05,1.4e-05,2.6e-05,3.1e-05,2.8e-05,2.1e-05,1.3e-05,9e-06,1.3e-05,1.7e-05,2.4e-05,2.1e-05,3e-06,3.2e-05,4.2e-05,2.3e-05,2.5e-05,2e-05,2.3e-05,2e-05,2.8e-05,2.1e-05,2.4e-05,3e-06,3.3e-05,3.9e-05,4.8e-05,4.6e-05,1.8e-05,1.1e-05,2.9e-05,1.9e-05,9e-06,1.3e-05,1.7e-05,1.2e-05,1.5e-05,2.4e-05,4e-06,3.6e-05,1.8e-05,3e-06,1e-05,2e-05,2.6e-05,2.3e-05,3.7e-05,8e-06,1.3e-05,3.9e-05,3.9e-05,2.4e-05,2.3e-05,3.2e-05,2.6e-05,2.1e-05,9e-06,4.1e-05,4.1e-05,3.6e-05,7.3e-05,2.5e-05
1e-06,3e-06,4e-06,1e-06,2e-06,2e-06,1e-06,4e-06,4e-06,7e-06,1e-06,4e-06,5e-06,2e-06,4e-06,5e-06,3e-06,3e-06,6e-06,9e-06,1e-05,2e-06,6e-06,2e-06,3e-06,7e-06,5e-06,6e-06,1.1e-05,6e-06,8e-06,6e-06,4e-06,1e-06,1.3e-05,5e-06,7e-06,1e-06,1.4e-05,5e-06,8e-06,8e-06,9e-06,9e-06,8e-06,3e-06,5e-06,1.6e-05,7e-06,2.7e-05,7e-06,3e-06,2e-06,1.4e-05,2.6e-05,1.5e-05,3.5e-05,3.6e-05,1.6e-05,2.1e-05,1.4e-05,3.5e-05,2.4e-05,1.5e-05,6e-06,6e-06,2e-06,1.3e-05,1e-06,1.1e-05,1.6e-05,6e-06,1e-05,3.4e-05,2.1e-05,1.3e-05,2.8e-05,1.1e-05,1e-05,2.1e-05,4e-06,1.2e-05,1.5e-05,3.3e-05,2.5e-05,1.7e-05,2.1e-05,1.1e-05,7e-06,2e-05,1.6e-05,2.6e-05,1.6e-05,1.5e-05,1.2e-05,1.8e-05,1e-05,9e-06,4.2e-05,1.7e-05,1.3e-05,6e-06,1e-06,6e-06,1.7e-05,3.2e-05,2.9e-05,1.5e-05,3.1e-05,1.8e-05,1.5e-05,2.1e-05,1.4e-05,6e-06,2.4e-05,1.1e-05,3e-05,2.3e-05,3.6e-05,1e-06,2.2e-05
2e-06,1e-06,1e-06,1e-06,2e-06,2e-06,2e-06,3e-06,3e-06,5e-06,2e-06,2e-06,3e-06,3e-06,3e-06,6e-06,2e-06,3e-06,4e-06,4e-06,5e-06,5e-06,1e-06,3e-06,2e-06,1e-05,6e-06,3e-06,1.2e-05,1e-06,4e-06,5e-06,7e-06,3e-06,1.3e-05,4e-06,8e-06,6e-06,8e-06,7e-06,2e-06,2e-06,9e-06,5e-06,4e-06,8e-06,5e-06,1.5e-05,8e-06,2.5e-05,3e-06,8e-06,1e-05,8e-06,2.6e-05,9e-06,2.9e-05,2.9e-05,1.6e-05,3.1e-05,1.2e-05,2.3e-05,5e-06,1.3e-05,6e-06,9e-06,4e-06,1.2e-05,2.4e-05,1.1e-05,1.5e-05,7e-06,1.6e-05,1.7e-05,1.5e-05,9e-06,2.1e-05,5e-06,1e-05,1.7e-05,9e-06,7e-06,7e-06,2.8e-05,2.2e-05,1.3e-05,8e-06,1.7e-05,1e-06,1.5e-05,1.4e-05,2.4e-05,5e-06,1.8e-05,1.8e-05,1.1e-05,1.9e-05,7e-06,4.3e-05,1.1e-05,1.1e-05,1.1e-05,5e-06,1.1e-05,1e-05,3.4e-05,1.8e-05,2.1e-05,1.3e-05,1.1e-05,1.4e-05,1.8e-05,8e-06,5e-06,1.5e-05,1e-05,2.6e-05,4e-06,2.2e-05,2.2e-05,4e-06
2e-06,2e-06,3e-06,1e-06,3e-06,1e-06,3e-06,1e-06,3e-06,5e-06,3e-06,0,2e-06,3e-06,3e-06,4e-06,1e-06,3e-06,2e-06,3e-06,2e-06,3e-06,2e-06,7e-06,1e-06,8e-06,3e-06,3e-06,1.1e-05,1e-06,1e-06,5e-06,7e-06,2e-06,1e-05,5e-06,5e-06,2e-06,1e-05,8e-06,2e-06,2e-06,8e-06,2e-06,4e-06,7e-06,4e-06,5e-06,1e-06,2.1e-05,9e-06,2e-06,1e-05,1e-05,1.6e-05,9e-06,2.5e-05,2.3e-05,1.5e-05,2.7e-05,6e-06,2.9e-05,1.3e-05,9e-06,7e-06,7e-06,2e-06,6e-06,7e-06,1.2e-05,1e-05,9e-06,2e-05,1.2e-05,1.7e-05,5e-06,9e-06,6e-06,3e-06,7e-06,2e-06,3e-06,8e-06,2e-05,2.1e-05,1.3e-05,1.2e-05,1.1e-05,1e-05,1.7e-05,1.4e-05,1.3e-05,4e-06,1.8e-05,6e-06,1.1e-05,1e-05,6e-06,3.5e-05,1e-05,1.4e-05,1.2e-05,8e-06,7e-06,7e-06,3.2e-05,1.7e-05,2.3e-05,7e-06,3e-06,1.7e-05,2.3e-05,5e-06,3e-06,9e-06,1.5e-05,2.7e-05,1.3e-05,1.4e-05,2.1e-05,1e-06
2e-06,1e-06,2e-06,1e-06,2e-06,1e-06,2e-06,4e-06,4e-06,4e-06,2e-06,0,2e-06,1e-06,4e-06,6e-06,3e-06,2e-06,5e-06,3e-06,3e-06,3e-06,3e-06,4e-06,3e-06,5e-06,5e-06,4e-06,1e-05,0,1e-06,4e-06,2e-06,3e-06,7e-06,3e-06,5e-06,5e-06,7e-06,4e-06,2e-06,1e-06,5e-06,1e-06,3e-06,4e-06,4e-06,1.2e-05,4e-06,2.2e-05,1.2e-05,8e-06,3e-06,9e-06,1.1e-05,8e-06,2.4e-05,2.3e-05,1e-05,1.7e-05,8e-06,2.4e-05,7e-06,1.2e-05,3e-06,6e-06,4e-06,5e-06,9e-06,7e-06,7e-06,2e-06,8e-06,1.8e-05,7e-06,8e-06,2e-06,7e-06,5e-06,9e-06,4e-06,4e-06,1e-05,2.8e-05,1.4e-05,1.1e-05,7e-06,5e-06,6e-06,1.1e-05,1.3e-05,1e-05,2e-06,1.2e-05,5e-06,1.6e-05,4e-06,4e-06,3.5e-05,1.1e-05,2e-05,2e-06,7e-06,2e-06,4e-06,2.9e-05,1.8e-05,1.5e-05,9e-06,3e-06,1.9e-05,2.1e-05,6e-06,5e-06,1.1e-05,7e-06,2.3e-05,1.7e-05,1.8e-05,1.5e-05,5e-06
1e-06,2e-06,1e-06,0,2e-06,3e-06,2e-06,3e-06,1e-06,6e-06,2e-06,1e-06,3e-06,1e-06,2e-06,4e-06,4e-06,3e-06,5e-06,2e-06,4e-06,1e-06,1e-06,4e-06,4e-06,5e-06,3e-06,3e-06,1e-05,2e-06,1e-06,1e-06,3e-06,1e-06,5e-06,7e-06,4e-06,6e-06,1e-05,8e-06,2e-06,5e-06,8e-06,6e-06,1e-06,5e-06,7e-06,8e-06,5e-06,2.2e-05,1e-05,7e-06,7e-06,8e-06,1.4e-05,1e-06,2.3e-05,2.8e-05,1.6e-05,9e-06,1e-05,2.3e-05,9e-06,1.2e-05,2e-06,8e-06,2e-06,5e-06,5e-06,1e-05,1e-05,3e-06,9e-06,5e-06,2e-05,1e-05,1.1e-05,7e-06,6e-06,1.3e-05,4e-06,5e-06,6e-06,2.3e-05,2.2e-05,1.1e-05,9e-06,5e-06,5e-06,1e-05,1.3e-05,1.2e-05,3e-06,8e-06,7e-06,1.3e-05,2e-06,7e-06,3.2e-05,1.5e-05,1.7e-05,9e-06,2e-06,9e-06,1.1e-05,3e-05,1.1e-05,2.5e-05,8e-06,6e-06,1.8e-05,1.6e-05,3e-06,6e-06,1.2e-05,1.9e-05,1.4e-05,1.1e-05,1.4e-05,9e-06,6e-06
2e-06,1e-06,1e-06,0,2e-06,4e-06,1e-06,3e-06,3e-06,5e-06,1e-06,1e-06,3e-06,2e-06,1e-06,7e-06,1e-06,3e-06,2e-06,2e-06,3e-06,1e-06,3e-06,6e-06,3e-06,8e-06,2e-06,3e-06,1e-05,1e-06,2e-06,2e-06,2e-06,2e-06,8e-06,1e-06,4e-06,3e-06,1.1e-05,4e-06,1e-06,5e-06,1e-05,6e-06,5e-06,2e-06,5e-06,6e-06,1e-06,1.9e-05,7e-06,5e-06,3e-06,8e-06,1.7e-05,8e-06,2.1e-05,2.3e-05,5e-06,2.5e-05,5e-06,1.1e-05,5e-06,1.6e-05,4e-06,1e-06,5e-06,1.3e-05,9e-06,8e-06,1.3e-05,1.3e-05,9e-06,9e-06,1.6e-05,4e-06,1.2e-05,3e-06,6e-06,1.5e-05,3e-06,2e-06,5e-06,2e-05,2e-05,2e-06,9e-06,7e-06,6e-06,1e-05,1.1e-05,1.1e-05,7e-06,8e-06,8e-06,9e-06,6e-06,1e-06,2.7e-05,3e-06,1.2e-05,6e-06,7e-06,4e-06,7e-06,2.6e-05,1.4e-05,1.9e-05,9e-06,5e-06,1.2e-05,1.7e-05,3e-06,3e-06,1.5e-05,2.2e-05,1.2e-05,1.2e-05,1.5e-05,9e-06,9e-06
1e-06,0,1e-06,1e-06,3e-06,1e-06,1e-06,3e-06,3e-06,3e-06,2e-06,1e-06,2e-06,2e-06,4e-06,7e-06,2e-06,2e-06,3e-06,3e-06,4e-06,4e-06,1e-06,5e-06,0,5e-06,6e-06,1e-06,9e-06,1e-06,2e-06,4e-06,0,2e-06,1.1e-05,3e-06,2e-06,2e-06,9e-06,8e-06,2e-06,2e-06,8e-06,1e-05,1e-06,4e-06,4e-06,9e-06,3e-06,1.6e-05,7e-06,1e-06,4e-06,9e-06,2.3e-05,4e-06,2.9e-05,1.3e-05,6e-06,1.6e-05,9e-06,1.5e-05,5e-06,1.6e-05,4e-06,6e-06,4e-06,1e-05,9e-06,1e-05,6e-06,5e-06,7e-06,7e-06,1.1e-05,5e-06,7e-06,6e-06,2e-06,1.5e-05,1.2e-05,3e-06,4e-06,1.8e-05,1.1e-05,6e-06,1e-06,3e-06,4e-06,1.5e-05,5e-06,1e-05,4e-06,8e-06,4e-06,1.8e-05,1.1e-05,2e-06,2.7e-05,1.2e-05,1.6e-05,5e-06,9e-06,1.1e-05,8e-06,2.6e-05,1.2e-05,2e-05,7e-06,3e-06,1.8e-05,2e-05,5e-06,6e-06,1.1e-05,2e-05,2.1e-05,6e-06,7e-06,1e-05,8e-06
2e-06,0,1e-06,1e-06,4e-06,2e-06,1e-06,4e-06,2e-06,3e-06,2e-06,2e-06,3e-06,0,2e-06,6e-06,2e-06,1e-06,2e-06,4e-06,2e-06,4e-06,1e-06,4e-06,1e-06,3e-06,4e-06,4e-06,8e-06,2e-06,1e-06,4e-06,4e-06,3e-06,8e-06,5e-06,3e-06,1e-06,4e-06,7e-06,2e-06,1e-06,7e-06,8e-06,8e-06,6e-06,9e-06,7e-06,2e-06,1.8e-05,6e-06,7e-06,8e-06,6e-06,1.6e-05,1.7e-05,1.4e-05,1.7e-05,4e-06,2.2e-05,7e-06,1.3e-05,3e-06,5e-06,1.2e-05,3e-06,7e-06,1.1e-05,1.5e-05,7e-06,6e-06,3e-06,1e-05,5e-06,1.6e-05,6e-06,1.3e-05,1.2e-05,1.6e-05,8e-06,5e-06,6e-06,3e-06,1.9e-05,1.6e-05,6e-06,1.2e-05,1.2e-05,1.2e-05,1.3e-05,9e-06,1.1e-05,6e-06,7e-06,0,8e-06,1e-06,5e-06,1.7e-05,1.4e-05,1.4e-05,1.3e-05,9e-06,1.5e-05,2.2e-05,2.3e-05,7e-06,4e-06,6e-06,5e-06,1e-05,9e-06,6e-06,8e-06,1.4e-05,5e-06,9e-06,1.5e-05,1.2e-05,5e-06,9e-06
1e-06,2e-06,2e-06,1e-06,3e-06,1e-06,3e-06,4e-06,4e-06,3e-06,2e-06,3e-06,0,1e-06,1e-06,6e-06,3e-06,3e-06,2e-06,2e-06,2e-06,2e-06,2e-06,4e-06,3e-06,4e-06,1e-06,2e-06,9e-06,1e-06,3e-06,2e-06,3e-06,3e-06,2e-06,4e-06,2e-06,1e-06,6e-06,8e-06,4e-06,1e-06,5e-06,3e-06,1e-06,2e-06,3e-06,4e-06,6e-06,1.7e-05,8e-06,7e-06,7e-06,7e-06,8e-06,1.4e-05,1.9e-05,1.5e-05,5e-06,1.7e-05,7e-06,1.4e-05,4e-06,1.3e-05,3e-06,4e-06,8e-06,7e-06,7e-06,6e-06,1.2e-05,8e-06,8e-06,6e-06,1.4e-05,1.1e-05,1.3e-05,4e-06,1.1e-05,1e-06,3e-06,3e-06,3e-06,1.8e-05,8e-06,1.5e-05,1e-05,7e-06,2e-06,1.4e-05,8e-06,1.3e-05,6e-06,1.5e-05,1e-05,1.3e-05,1.1e-05,7e-06,1.6e-05,1e-05,1.5e-05,8e-06,8e-06,1.7e-05,4e-06,1.5e-05,8e-06,1.9e-05,6e-06,6e-06,1e-05,1.6e-05,8e-06,1.6e-05,5e-06,1.4e-05,1.7e-05,1e-05,4e-06,1.1e-05,6e-06
2e-06,3e-06,0,1e-06,2e-06,2e-06,1e-06,2e-06,2e-06,5e-06,2e-06,1e-06,3e-06,2e-06,2e-06,6e-06,1e-06,2e-06,2e-06,3e-06,1e-06,4e-06,3e-06,3e-06,2e-06,5e-06,4e-06,3e-06,1e-05,2e-06,5e-06,4e-06,3e-06,1e-06,6e-06,3e-06,6e-06,2e-06,7e-06,6e-06,2e-06,1e-06,1e-06,4e-06,2e-06,3e-06,4e-06,3e-06,3e-06,1.4e-05,9e-06,3e-06,4e-06,8e-06,1.3e-05,1.3e-05,1.1e-05,2.3e-05,1e-05,4e-06,4e-06,1.2e-05,7e-06,5e-06,3e-06,3e-06,4e-06,2e-06,9e-06,7e-06,1e-05,2e-06,1e-05,7e-06,9e-06,1e-05,1.1e-05,6e-06,1.1e-05,1e-05,5e-06,2e-06,3e-06,2e-05,1e-05,6e-06,1e-06,7e-06,5e-06,1.1e-05,8e-06,1e-05,4e-06,6e-06,7e-06,1.8e-05,1.5e-05,5e-06,2.5e-05,1e-05,1.4e-05,5e-06,1.1e-05,6e-06,6e-06,1.5e-05,5e-06,1.3e-05,8e-06,4e-06,7e-06,1.4e-05,1.1e-05,8e-06,1.1e-05,1.6e-05,1.9e-05,9e-06,9e-06,1.3e-05,1.2e-05
3e-06,1e-06,1e-06,1e-06,2e-06,2e-06,1e-06,3e-06,2e-06,5e-06,2e-06,1e-06,2e-06,3e-06,1e-06,6e-06,1e-06,3e-06,2e-06,2e-06,4e-06,4e-06,1e-06,4e-06,2e-06,4e-06,5e-06,2e-06,8e-06,2e-06,3e-06,2e-06,2e-06,1e-06,8e-06,6e-06,2e-06,4e-06,8e-06,5e-06,1e-06,1e-06,3e-06,4e-06,3e-06,3e-06,7e-06,7e-06,3e-06,1.3e-05,8e-06,4e-06,5e-06,9e-06,9e-06,1.3e-05,1.9e-05,1.5e-05,7e-06,1.2e-05,6e-06,1e-05,1e-05,1.6e-05,6e-06,6e-06,2e-06,3e-06,5e-06,1e-05,1.4e-05,7e-06,5e-06,8e-06,7e-06,3e-06,9e-06,9e-06,4e-06,3e-06,8e-06,5e-06,1e-06,2.2e-05,1.2e-05,1.2e-05,5e-06,6e-06,6e-06,5e-06,8e-06,6e-06,5e-06,3e-06,1.1e-05,1.3e-05,1.2e-05,5e-06,2.1e-05,4e-06,1e-05,0,7e-06,6e-06,3e-06,2.4e-05,8e-06,1.5e-05,3e-06,5e-06,1.1e-05,1.7e-05,6e-06,1e-05,1e-05,9e-06,8e-06,9e-06,1.1e-05,1.7e-05,1.1e-05
2e-06,1e-06,2e-06,1e-06,2e-06,3e-06,1e-06,2e-06,1e-06,5e-06,2e-06,1e-06,1e-06,2e-06,3e-06,7e-06,2e-06,4e-06,4e-06,2e-06,3e-06,2e-06,2e-06,4e-06,1e-06,5e-06,2e-06,1e-06,9e-06,2e-06,1e-06,1e-06,0,2e-06,5e-06,5e-06,4e-06,5e-06,5e-06,4e-06,2e-06,2e-06,2e-06,1e-06,6e-06,3e-06,5e-06,3e-06,1e-06,1.3e-05,8e-06,3e-06,5e-06,3e-06,7e-06,5e-06,1e-05,1.8e-05,7e-06,1e-05,6e-06,2e-06,1.3e-05,6e-06,4e-06,4e-06,3e-06,0,5e-06,9e-06,9e-06,3e-06,4e-06,6e-06,7e-06,2e-06,2e-06,2e-06,7e-06,9e-06,2e-06,3e-06,3e-06,2.1e-05,1.6e-05,4e-06,7e-06,8e-06,1e-06,7e-06,1.1e-05,7e-06,4e-06,1.1e-05,2e-06,9e-06,8e-06,6e-06,3.1e-05,7e-06,7e-06,2e-06,4e-06,6e-06,5e-06,1.9e-05,6e-06,1.5e-05,3e-06,2e-06,9e-06,1.7e-05,6e-06,2e-06,7e-06,6e-06,1e-05,7e-06,6e-06,2.1e-05,1.1e-05
1e-06,1e-06,1e-06,1e-06,2e-06,2e-06,2e-06,1e-06,3e-06,3e-06,1e-06,1e-06,2e-06,2e-06,1e-06,6e-06,2e-06,2e-06,1e-06,1e-06,1e-06,2e-06,2e-06,3e-06,1e-06,6e-06,3e-06,2e-06,9e-06,3e-06,1e-06,0,1e-06,2e-06,6e-06,1e-06,1e-06,3e-06,7e-06,6e-06,2e-06,2e-06,3e-06,3e-06,4e-06,3e-06,4e-06,4e-06,1e-06,1.4e-05,4e-06,3e-06,2e-06,5e-06,1.1e-05,5e-06,1.7e-05,1.4e-05,8e-06,1.3e-05,1e-06,9e-06,4e-06,1e-05,4e-06,3e-06,5e-06,2e-06,5e-06,7e-06,4e-06,3e-06,7e-06,5e-06,1.2e-05,4e-06,6e-06,2e-06,7e-06,6e-06,2e-06,4e-06,1e-06,2e-05,1.7e-05,6e-06,5e-06,1e-05,3e-06,8e-06,7e-06,4e-06,5e-06,4e-06,2e-06,1e-05,3e-06,2e-06,2.9e-05,1.3e-05,1.3e-05,6e-06,7e-06,5e-06,9e-06,2.3e-05,1e-05,1.7e-05,6e-06,4e-06,1.1e-05,1.8e-05,4e-06,9e-06,9e-06,7e-06,1.4e-05,1.2e-05,4e-06,7e-06,6e-06
1e-06,1e-06,1e-06,1e-06,2e-06,2e-06,1e-06,2e-06,3e-06,4e-06,1e-06,1e-06,1e-06,1e-06,2e-06,7e-06,2e-06,1e-06,2e-06,1e-06,2e-06,2e-06,2e-06,4e-06,3e-06,5e-06,1e-06,1e-06,7e-06,3e-06,3e-06,3e-06,2e-06,2e-06,7e-06,5e-06,3e-06,2e-06,9e-06,4e-06,1e-06,2e-06,1e-06,5e-06,6e-06,1e-06,5e-06,2e-06,6e-06,1.4e-05,9e-06,3e-06,7e-06,1e-05,9e-06,1.2e-05,1.7e-05,1.2e-05,6e-06,1.8e-05,6e-06,9e-06,3e-06,8e-06,1e-06,2e-06,5e-06,6e-06,9e-06,4e-06,4e-06,4e-06,2e-06,7e-06,9e-06,7e-06,1.2e-05,8e-06,6e-06,1.1e-05,4e-06,3e-06,3e-06,1.9e-05,1.5e-05,4e-06,6e-06,8e-06,7e-06,5e-06,7e-06,3e-06,2e-06,9e-06,4e-06,1e-05,6e-06,2e-06,2e-05,9e-06,9e-06,5e-06,3e-06,5e-06,8e-06,1.8e-05,1.1e-05,9e-06,4e-06,3e-06,9e-06,2e-05,3e-06,7e-06,1e-05,3e-06,1.9e-05,6e-06,5e-06,5e-06,1.4e-05
1e-06,1e-06,1e-06,0,1e-06,2e-06,0,1e-06,3e-06,3e-06,2e-06,2e-06,1e-06,2e-06,1e-06,5e-06,1e-06,1e-06,2e-06,3e-06,0,0,2e-06,5e-06,4e-06,5e-06,1e-06,3e-06,7e-06,3e-06,1e-06,3e-06,2e-06,2e-06,8e-06,5e-06,3e-06,2e-06,8e-06,8e-06,4e-06,1e-06,2e-06,2e-06,3e-06,1e-06,5e-06,0,3e-06,9e-06,8e-06,2e-06,7e-06,2e-06,1.4e-05,1.1e-05,9e-06,2.8e-05,1.4e-05,1.3e-05,4e-06,9e-06,3e-06,8e-06,4e-06,5e-06,4e-06,4e-06,1e-05,3e-06,9e-06,4e-06,6e-06,1e-06,1e-05,7e-06,8e-06,2e-06,7e-06,9e-06,2e-06,2e-06,3e-06,1.9e-05,1.8e-05,9e-06,3e-06,3e-06,5e-06,6e-06,7e-06,7e-06,4e-06,1.2e-05,6e-06,1e-05,8e-06,1e-05,2.5e-05,2e-06,9e-06,7e-06,6e-06,9e-06,5e-06,1.8e-05,1.1e-05,1.7e-05,2e-06,6e-06,1e-05,2e-05,4e-06,9e-06,9e-06,4e-06,8e-06,1.2e-05,4e-06,2e-06,8e-06
2e-06,0,1e-06,1e-06,2e-06,1e-06,1e-06,2e-06,2e-06,3e-06,1e-06,0,1e-06,1e-06,1e-06,5e-06,1e-06,2e-06,1e-06,2e-06,3e-06,2e-06,1e-06,3e-06,2e-06,4e-06,1e-06,2e-06,1e-05,1e-06,1e-06,3e-06,0,2e-06,6e-06,4e-06,1e-06,2e-06,6e-06,6e-06,2e-06,2e-06,2e-06,1e-06,2e-06,1e-06,4e-06,3e-06,3e-06,8e-06,3e-06,2e-06,5e-06,9e-06,1.5e-05,5e-06,1.9e-05,1.5e-05,1.1e-05,1.1e-05,4e-06,6e-06,5e-06,1.1e-05,4e-06,6e-06,2e-06,5e-06,6e-06,6e-06,6e-06,6e-06,5e-06,6e-06,9e-06,7e-06,3e-06,5e-06,3e-06,7e-06,3e-06,1e-06,5e-06,1.5e-05,1.3e-05,4e-06,3e-06,6e-06,1e-06,4e-06,7e-06,7e-06,5e-06,1e-05,5e-06,9e-06,3e-06,8e-06,2.1e-05,6e-06,6e-06,1e-06,4e-06,1e-05,8e-06,1.9e-05,3e-06,1.1e-05,7e-06,6e-06,9e-06,1.7e-05,9e-06,2e-06,8e-06,1.1e-05,8e-06,8e-06,1e-06,2e-06,4e-06
1e-06,0,0,0,1e-06,2e-06,0,2e-06,2e-06,4e-06,0,1e-06,2e-06,1e-06,1e-06,5e-06,0,1e-06,1e-06,3e-06,1e-06,1e-06,1e-06,3e-06,1e-06,3e-06,2e-06,1e-06,8e-06,1e-06,1e-06,2e-06,2e-06,1e-06,6e-06,6e-06,2e-06,1e-06,6e-06,5e-06,2e-06,1e-06,2e-06,3e-06,3e-06,1e-06,3e-06,3e-06,2e-06,1e-05,5e-06,2e-06,1e-06,5e-06,1.1e-05,6e-06,1.6e-05,1.6e-05,6e-06,1.4e-05,0,9e-06,4e-06,9e-06,4e-06,3e-06,1e-06,6e-06,9e-06,6e-06,5e-06,7e-06,9e-06,4e-06,1.1e-05,3e-06,3e-06,2e-06,3e-06,7e-06,3e-06,1e-06,2e-06,1.8e-05,1.1e-05,5e-06,2e-06,6e-06,1e-06,6e-06,5e-06,5e-06,4e-06,7e-06,2e-06,5e-06,7e-06,3e-06,2.3e-05,9e-06,7e-06,2e-06,4e-06,8e-06,1e-06,2.3e-05,9e-06,3e-06,2e-06,2e-06,1.2e-05,1.2e-05,4e-06,4e-06,1e-05,1e-05,5e-06,1.1e-05,2e-06,5e-06,4e-06
2e-06,0,0,1e-06,1e-06,1e-06,0,2e-06,2e-06,3e-06,1e-06,0,1e-06,1e-06,1e-06,5e-06,1e-06,1e-06,1e-06,2e-06,2e-06,1e-06,0,4e-06,2e-06,4e-06,2e-06,1e-06,8e-06,1e-06,1e-06,1e-06,2e-06,1e-06,6e-06,4e-06,1e-06,1e-06,6e-06,5e-06,2e-06,0,2e-06,3e-06,3e-06,1e-06,3e-06,4e-06,2e-06,9e-06,4e-06,1e-06,2e-06,4e-06,9e-06,3e-06,1.6e-05,1.6e-05,6e-06,1.2e-05,1e-06,8e-06,2e-06,7e-06,3e-06,2e-06,1e-06,3e-06,4e-06,4e-06,5e-06,4e-06,7e-06,3e-06,1e-05,4e-06,1e-06,2e-06,5e-06,1e-05,4e-06,2e-06,2e-06,1.6e-05,1.4e-05,7e-06,1e-06,3e-06,1e-06,6e-06,4e-06,7e-06,2e-06,7e-06,1e-06,2e-06,4e-06,6e-06,2e-05,5e-06,8e-06,1e-06,4e-06,7e-06,3e-06,2.1e-05,5e-06,1e-05,5e-06,2e-06,1.1e-05,1.4e-05,3e-06,5e-06,8e-06,1e-05,9e-06,7e-06,3e-06,4e-06,3e-06
2e-06,1e-06,0,1e-06,1e-06,1e-06,0,2e-06,2e-06,3e-06,1e-06,0,1e-06,1e-06,1e-06,5e-06,1e-06,1e-06,2e-06,1e-06,1e-06,1e-06,1e-06,3e-06,2e-06,4e-06,2e-06,2e-06,8e-06,1e-06,0,1e-06,2e-06,1e-06,6e-06,3e-06,1e-06,1e-06,6e-06,5e-06,2e-06,1e-06,2e-06,3e-06,3e-06,1e-06,4e-06,2e-06,2e-06,1e-05,5e-06,2e-06,3e-06,5e-06,8e-06,2e-06,1.7e-05,1.5e-05,7e-06,1.3e-05,1e-06,9e-06,2e-06,7e-06,2e-06,2e-06,1e-06,1e-06,5e-06,4e-06,5e-06,5e-06,6e-06,4e-06,7e-06,3e-06,2e-06,2e-06,3e-06,1e-05,4e-06,2e-06,1e-06,1.7e-05,1.2e-05,3e-06,0,5e-06,1e-06,6e-06,6e-06,5e-06,3e-06,7e-06,2e-06,4e-06,3e-06,4e-06,2.2e-05,4e-06,9e-06,2e-06,4e-06,5e-06,3e-06,1.9e-05,3e-06,1.1e-05,3e-06,3e-06,9e-06,1.4e-05,3e-06,4e-06,8e-06,8e-06,7e-06,7e-06,1e-06,4e-06,2e-06
