-0.001266,-0.005051,-0.006302,-0.004021,-0.007462,-0.006425,-0.004776,-0.004091,-0.009099,-0.005948,-0.008636,-0.005296,-0.008375,-0.007602,-0.005025,-0.003177,-0.00951,-0.009635,-0.009593,-0.006536,-0.006598,-0.009569,-0.011699,-0.008338,-0.007322,-0.006286,-0.00355,-0.003787,-0.003721,-0.009751,-0.007256,-0.006382,-0.00497,-0.006275,-0.005026,-0.004775,-0.005084,-0.005375,-0.004362,-0.004771,-0.001781,-0.002863,-0.001926,-0.004995,-0.007266,-0.002792,-0.003824,-0.004007,-0.008526,-0.007076,-0.004926,-0.005132,-0.002931,-0.001789,-0.006051,-0.007906,-0.008357,-0.007251,-0.00718,-0.007852,-0.007057,-0.004369,-0.006814,-0.011809,-0.009154,-0.011628,-0.009995,-0.00923,-0.005977,-0.003408,-0.007733,-0.00529,-0.009913,-0.005765,-0.008735,-0.008208,-0.005998,-0.003707,-0.00368,-0.005881,-0.007315,-0.005284,-0.007783,-0.005941,-0.00236,-0.00569,-0.005223,-0.002657,-0.004271,-0.007252,-0.007851,-0.004183,-0.010447,-0.008248,-0.007161,-0.006041,-0.008122,-0.008413,-0.006876,-0.005801,-0.005913,-0.006975,-0.007835,-0.008771,-0.006343,-0.006105,-0.004312,-0.004838,-0.007744,-0.008475,-0.00561,-0.003003,-0.009027,-0.006137,-0.003475,-0.002261,-0.001164,-0.003821,-0.005507,-0.006268,-0.01067
-0.004921,-0.00226,-0.002426,-0.004656,-0.004245,-0.002234,-0.000961,7.2e-05,0.003225,0.000886,0.002234,0.002421,-0.000211,1.1e-05,-0.001871,-0.003621,-0.00354,-0.000124,-0.001026,-0.000824,0.002104,0.002331,0.006135,0.001862,0.001878,0.00243,-0.000329,-0.004807,-0.002243,-0.001973,0.003765,-0.000642,-0.002284,-3.1e-05,0.001343,0.000758,0.002509,-0.00142,-0.000131,-0.00095,-0.004184,-0.000651,-0.001637,-0.002956,0.001442,0.000241,-0.003826,-0.005644,-0.00056,-0.00064,-0.001723,-0.002196,-0.002566,-0.004733,-0.000932,0.00384,0.001748,0.000634,0.002407,0.001995,0.002128,1.8e-05,0.002023,0.004674,0.004627,0.002752,0.0014,-0.004386,-0.004881,-0.001587,0.003298,-0.000525,0.004357,0.003614,0.001558,0.001519,0.001424,-0.002359,-0.000931,0.000215,-8e-06,-0.002748,-0.001739,-0.00133,-0.001311,0.000526,-0.001501,-0.001035,0.002261,-6.9e-05,0.001747,0.002317,0.000711,0.001148,0.002504,0.000498,-0.000633,0.003219,0.00254,0.000777,-0.00027,0.002298,-0.001678,0.000896,-0.000412,-0.004061,-0.002642,-0.000535,-0.000101,0.00204,0.000805,-0.001812,0.001067,0.000868,9.1e-05,0.000528,-0.002266,0.001207,0.001282,-9.4e-05,0.003813
6.5e-05,-0.000387,0.002228,-0.00106,0.002695,-0.000467,0.000551,0.000285,-0.000768,-0.002297,-0.002041,-0.003157,0.002056,-0.000875,0.000427,0.001916,-0.001748,-0.002704,0.000285,-0.003484,-0.001165,-0.002813,-0.005339,-0.001896,-0.001852,3.4e-05,0.001479,0.000635,0.000193,0.001452,-0.003048,-0.003607,0.001173,-0.001955,-0.002783,-0.001984,-0.001931,0.00034,0.001051,8.7e-05,-0.00111,-0.001319,0.000712,0.00173,-0.001516,-0.002262,0.001858,0.000989,0.00076,-0.00078,0.000334,0.002108,0.001192,-0.000223,-0.002065,-0.005697,-0.005386,-0.000434,-0.001544,-0.003628,-0.002376,-0.000967,-0.001844,-0.005753,-0.004478,-0.001784,0.000182,0.002672,-0.000778,-0.001411,-0.001009,-0.00147,-0.00238,-0.002414,-0.002999,-0.000872,-0.002062,-0.00066,-0.000562,-0.001197,0.002121,0.002367,-0.000134,-0.000755,0.000384,-5.4e-05,-0.001093,0.001501,-0.004312,-0.002478,-0.002138,-0.002437,0.000138,-0.002665,-0.002447,-0.00178,0.000723,-0.002337,-0.002274,-0.002028,0.000475,-0.001207,-0.000515,0.000836,0.000724,0.003426,0.000608,-0.00028,-0.003842,-0.00343,-0.001001,-0.002417,-0.002286,-0.002001,-0.000977,-0.000438,-0.001088,-0.000589,-0.003314,-0.000973,-0.002151
0.004459,0.003897,0.001861,0.002523,0.001848,0.002917,0.001707,0.000172,-0.000383,0.001026,0.000907,0.001538,-0.001772,0.001911,0.001843,0.002595,0.003484,0.00629,0.001508,0.004228,0.001863,0.003336,0.003096,0.00149,0.000641,8.4e-05,0.00142,0.002187,0.002097,0.002426,0.001633,0.00414,0.002692,0.00334,0.003269,0.000389,0.001505,-0.000607,-0.000438,0.00105,0.004334,0.00369,0.001456,0.001617,0.004634,0.00262,0.001118,0.004732,0.003716,0.001157,0.001811,0.000101,0.00027,0.004959,0.005706,0.005223,0.007485,0.00022,0.000593,0.00287,0.003139,0.002512,0.001601,0.003858,0.003667,0.001819,0.000134,0.001714,0.004338,0.004095,0.000259,0.002563,0.001017,0.001573,0.003888,0.00363,0.001772,0.001034,0.000704,0.001325,-0.002064,0.000674,0.003155,0.002849,-0.000116,0.001363,0.003135,-7e-05,0.002819,0.004105,0.00273,0.001904,0.000826,0.0047,0.000384,0.002606,0.002206,0.003917,0.003044,0.000706,0.002187,0.001864,0.000371,-0.00118,-0.000397,0.000543,0.001332,0.002109,0.004312,0.003644,0.002635,0.001903,0.002554,0.003215,0.001779,0.000463,0.002901,0.000691,0.002932,0.001143,0.003201
-0.003359,-0.003813,-0.002773,-0.001062,-0.000891,-0.002377,-0.001701,-5.7e-05,-0.001382,0.000778,0.000888,-0.001,0.000359,-0.000945,-0.000236,-0.001125,-0.001037,-0.00364,0.00012,-8.8e-05,-0.000488,-0.000284,0.000804,-0.000861,-0.000345,-0.001482,-0.003013,-0.001151,-0.001849,-0.002671,0.001324,-0.000983,-0.001529,-0.002309,-0.002508,-0.000292,-0.001278,2.9e-05,-0.001782,-0.001254,-0.001856,-0.003132,-0.001021,-0.002915,-0.002165,-0.00098,-0.003274,-0.00376,-0.005035,-0.002174,-0.001665,-0.000859,-0.001845,-0.002751,-0.002803,-0.001328,-0.003204,-0.000711,-0.00059,-0.002172,-0.002604,-0.002318,0.001409,-0.000526,-0.002656,-0.002136,0.000515,0.000206,-0.001923,-0.002486,-0.000649,-0.001323,-0.000394,-0.001655,-0.001878,-0.002227,-0.000892,-0.000266,-0.002216,-0.000142,0.001079,-0.002339,-0.001866,-0.001291,0.000774,-0.001026,-0.002002,-0.001055,-0.00202,-0.001539,-0.001574,-0.002113,-0.000976,-0.002635,-0.000539,-0.002132,-0.001748,-0.002972,-0.003128,-0.000566,-0.001868,-0.003201,0.000362,0.001052,-0.000219,-0.000779,-8e-04,-0.001112,-0.000134,-0.000895,-0.003604,-3.6e-05,3.2e-05,-0.001027,-0.000722,-0.000871,-0.000875,-0.001078,-0.000781,-0.000389,-0.002532
-0.000601,0.000666,0.001742,-0.000555,-0.000874,-0.000849,0.000853,-0.00108,0.001264,-0.000949,-0.001298,0.001588,0.000118,0.00083,0.000654,-0.001027,-0.000291,0.000399,0.000796,-0.001995,0.000567,-0.002191,-0.002141,0.000388,0.000994,0.001906,0.001297,0.000585,-0.001135,0.000129,-0.001316,0.00074,-0.001122,0.000633,0.000262,0.000373,0.001698,-2.2e-05,-0.00188,-0.000606,-1.9e-05,0.000394,7.8e-05,0.000778,-0.000856,-0.001115,0.001116,0.000758,0.002088,0.004128,0.000133,0.000863,0.001677,-0.000513,-0.001436,0.00073,0.00093,8e-06,0.001872,0.002592,0.00215,0.00081,-0.000742,-0.000359,0.002163,0.002278,0.00117,-0.001344,-0.001382,-0.000204,-0.00026,0.001533,0.001021,0.001989,1.7e-05,0.00044,-0.000311,-0.000263,0.000353,-0.000118,0.000127,0.000372,3.7e-05,0.001926,-0.000437,-0.000505,0.00119,0.00022,0.000421,0.000141,-0.000296,0.001174,0.000129,0.000925,0.000529,-6.3e-05,-0.001041,0.000564,0.001449,0.000292,0.000526,0.002511,0.000936,0.000833,0.00016,-0.000336,0.000683,-0.000309,-0.001742,0.000159,0.002346,-0.000648,-0.00042,-3.5e-05,0.00019,0.000814,-0.000647,-0.000931,0.000184,0.001692,-0.000269
0.002526,0.001264,-0.001193,0.001331,0.002497,0.001996,-0.000994,0.00061,0.000414,-0.000171,0.000389,-0.001567,0.000716,-0.000125,-0.002308,0.000511,0.002457,-0.000221,-0.003509,0.001417,-0.002346,0.000278,0.000967,-0.000697,-0.000367,-0.000954,-0.000347,0.000517,0.0011,0.001948,-0.000359,-0.001062,0.00071,0.001146,0.000459,0.000238,-0.000729,-0.000568,0.002498,0.00081,-0.000247,0.0019,-0.000229,0.000741,0.000201,0.001916,0.001438,0.001023,0.000294,-0.002423,0.000664,-0.000466,-0.000844,0.000148,0.000896,-0.000872,-0.001477,0.001221,-0.001458,-0.001565,-0.001389,-0.000551,-0.001014,0.001558,-0.000991,-0.000646,-0.002534,-0.001002,0.002158,0.000272,0.000939,-0.000433,-0.001285,-0.002279,-0.000911,-0.001116,0.000124,0.000244,0.001122,-0.001027,-0.001871,-0.000185,0.000647,-0.002216,-0.001501,-0.000954,-0.000144,-0.00016,0.000622,-0.000408,0.001409,-0.000144,0.001562,0.000374,0.001244,0.001253,0.001707,0.000349,6.2e-05,0.00086,0.000819,-0.000778,-0.000606,8.2e-05,-0.000312,0.000965,0.000145,0.00049,0.000175,-0.000681,-0.00138,0.001183,-0.000676,-0.000504,-0.000494,-0.000247,-0.00053,0.001315,-0.000415,-0.001307,-9.1e-05
0.000115,5e-05,-0.000615,-5.5e-05,-0.000351,-0.000608,0.000207,-0.000442,-0.000323,0.000499,0.000547,0.000541,-0.001364,-0.001106,0.001478,-0.000481,-0.001333,0.000392,0.001766,-0.000882,0.001741,0.000638,-0.000275,0.000758,0.000234,0.000365,0.000237,-0.000594,0.000735,-0.00102,0.000416,0.001247,0.000476,-0.000928,-9.5e-05,-0.000326,0.000575,0.00022,-0.000802,-0.000983,0.000834,2e-06,0.000516,-0.000597,0.001063,-0.000205,-0.000249,-0.000806,-0.000807,7.7e-05,0.000653,0.000233,-0.000139,0.000195,0.000719,0.00072,0.001317,-0.000677,0.000975,0.001207,0.000164,0.000122,4e-05,-0.00235,0.000243,0.000225,0.00136,0.000628,-0.001135,0.0015,-0.000335,-0.001001,0.000579,0.001423,0.001021,0.001416,0.000418,0.000261,0.000434,0.000353,0.001287,0.000473,-0.000219,0.000119,0.000414,0.000761,0.000298,0.000483,0.000321,0.000232,-0.001471,-0.000686,-0.001375,-0.000557,-0.001856,-0.000714,-0.000377,-0.000483,0.000682,-0.000807,2e-05,-0.000632,0.000439,-0.001547,8.5e-05,-0.000575,-0.000817,-0.000848,0.000517,-0.000102,-7.5e-05,-5.6e-05,0.000849,5e-06,0.000792,0.000539,0.000434,0.000157,0.000304,-0.000123,0.001588
-0.001971,-0.001211,0.000363,9.3e-05,-0.001071,-0.000135,0.000336,-0.000233,-5.4e-05,-0.000869,0.000155,-0.00011,0.001004,8e-04,-0.000588,-0.00041,-0.000511,-0.000363,0.00122,0.001354,-0.000857,0.000791,0.000689,0.00021,-0.000459,0.000629,0.000148,-0.000521,-0.00049,0.000496,-0.000269,0.000412,-0.001519,-0.000472,-0.000481,0.001255,-0.001031,-0.000447,0.000177,-0.000353,-0.000767,-0.000887,-0.001477,-0.000105,-0.001513,-0.001463,-0.001059,-0.000142,0.000149,0.000329,-0.000951,-0.000688,0.000725,-0.000323,-0.001342,-0.000357,-0.000838,-0.000217,-0.000714,-0.000745,-0.000482,0.000828,0.000972,0.001034,-0.000175,-0.001339,-0.00075,0.001006,-0.000439,-0.001232,0.000781,0.000653,-4.1e-05,-0.000587,-0.000653,-0.00142,4.2e-05,0.000424,-0.000985,0.000219,0.000379,0.000625,-0.000607,0.000335,-2e-05,-0.000277,-0.001146,-0.001209,-0.000374,-0.000411,0.000574,0.000536,0.001568,-6.1e-05,0.000456,0.00084,-0.001154,0.000362,-0.00102,0.00081,-0.000154,-7.6e-05,-0.001289,0.001216,-0.000492,0.000639,-2e-05,0.000348,-0.000136,0.000573,0.00034,-0.000417,0.000323,-6.9e-05,-0.000381,-0.000752,-0.000245,-0.000328,9.8e-05,0.000326,-0.00149
0.000503,0.000324,0.001863,0.00044,-0.001314,0.000465,-9.6e-05,0.000599,0.000326,-0.000161,-0.000488,0.000121,-0.00057,9.8e-05,0.000432,0.000812,-0.000266,0.000348,-0.001337,-0.000272,0.000197,-0.000103,-0.00023,-0.000447,0.000286,-0.000687,9.6e-05,0.000203,-0.000811,-0.00055,-0.000263,-0.001619,0.000578,0.000879,0.00031,-0.000907,2.4e-05,0.000656,0.000869,0.000371,3.6e-05,-3.3e-05,0.000983,0.000132,0.001234,0.000743,0.001057,0.001023,0.000691,0.000986,-0.000109,0.000802,-0.00055,0.00061,0.000693,0.000153,0.000306,-0.000224,-0.00034,-0.00084,0.000465,-0.000876,-0.000766,0.00045,-0.000344,0.000696,0.000253,-0.000959,0.000389,-0.000103,-0.000741,-8.6e-05,0.000363,-0.000349,0.000368,0.000987,0.00047,-0.000346,0.000308,-8.8e-05,-0.000322,-0.000248,0.000729,0.000894,0.000706,0.000626,8.1e-05,0.001299,-0.000501,0.000231,-0.000788,-0.000391,-0.001119,9e-06,-9e-06,4.2e-05,0.001225,0.000308,5e-06,-0.001588,-0.000505,0.000932,0.000904,-0.000395,0.001165,-0.000308,0.000739,0.000629,-0.000369,-0.000563,0.000515,2.6e-05,-0.001232,-0.000224,-6.1e-05,0.000306,0.000224,-0.000412,-0.000219,-7.5e-05,-9.5e-05
-3.1e-05,0.000329,-0.001572,-0.000752,0.001528,0.000402,-0.000199,0.000317,0.000176,0.000994,0.000194,-0.000289,5.4e-05,-2e-04,-0.000819,-0.000621,0.000483,0.000511,0.000227,-6.4e-05,0.000308,-0.000502,-0.000232,-0.000395,3.7e-05,-9.7e-05,-0.000525,-0.000281,0.000187,0.000619,0.000586,0.000614,0.000272,-0.000121,9.5e-05,8e-05,0.000514,-0.000346,-0.000956,0.000547,9.5e-05,0.000147,0.000179,0.000582,-4e-05,0.000129,-0.000795,-0.000381,-0.000453,-0.001461,-0.000103,-0.000659,-0.000414,-0.00013,0.000347,-4e-04,7.2e-05,0.000899,0.000596,0.001033,-0.000115,-7.1e-05,0.000608,-0.000305,0.000905,0.000703,0.000423,0.000345,-0.000466,0.001069,-0.00035,5.2e-05,-0.000964,0.000608,8.9e-05,-0.000458,-0.000791,-0.000223,6.8e-05,0.000776,-0.001313,-7.6e-05,-0.000758,-0.001338,-8.5e-05,-0.000265,0.000537,-1.5e-05,0.000335,-3.6e-05,0.000599,-1.5e-05,0.000254,0.000282,0.001047,0.00035,-0.001034,-0.000235,0.000516,0.001309,-0.000169,0.000185,-0.000508,0.000483,-0.000941,-0.00019,-0.000365,-0.000705,0.000818,0.00029,1.8e-05,-0.000166,0.00101,0.000672,-0.000229,-0.000254,0.000132,0.000481,0.000772,-0.000147,-2.4e-05
-3.9e-05,-0.00052,-0.000343,-0.000159,-0.00077,-0.000689,0.000523,-0.000573,-0.000469,0.000132,0.000121,-0.00013,0.000213,0.000323,0.000505,0.000795,-0.000448,-0.000704,0.000183,-0.000732,-0.000138,-0.000284,-0.000268,0.000276,-0.000546,-0.000357,-1e-05,0.000181,0.000526,-0.001144,0.000347,3.9e-05,0.000504,-0.000418,-0.000193,-0.000119,-5.9e-05,0.000236,0.000135,-0.000467,-0.000128,0.000103,-0.000507,-0.000259,-0.000707,-9e-05,0.000772,-0.000327,-0.000142,5.2e-05,-0.000148,0.000244,0.000589,-0.000159,-0.000468,8.2e-05,-0.00019,-0.000541,-0.000352,0.000141,0.000113,0.000385,-0.000281,6.5e-05,-0.000407,-0.000374,-0.000314,-8e-06,0.000792,-0.000687,-0.000232,0.000127,0.001031,-3.2e-05,-5.6e-05,5e-05,-0.000108,-0.000345,-6.8e-05,0.000251,0.000851,0.000392,-0.000121,0.000232,-0.000602,0.000211,1.1e-05,-0.000114,0.000444,0.00033,-0.000147,-0.000111,-0.000334,-0.00017,-0.001041,-0.000985,0.000654,0.00024,-0.000535,-0.000478,-1.6e-05,-0.000757,5.9e-05,-0.000503,0.000246,3e-06,5.5e-05,9.5e-05,5.8e-05,-7e-06,-0.000582,-0.000112,-0.000152,-8.5e-05,0.001,2e-05,-0.00027,0.000209,-0.000406,0.000256,0.001049
-0.000111,0.000408,0.000388,0.00016,0.000573,-2.2e-05,0.000115,0.000146,-9e-05,-0.000455,0.000204,0.00027,-0.000491,-6.2e-05,0.000139,-0.000192,0.000206,0.000402,4.1e-05,0.000963,0.000609,0.000381,0.000368,0.000512,0.000462,0.001033,5.3e-05,0.000158,7e-05,0.000208,-0.000552,-0.000229,-0.000475,-0.000499,-0.000141,2.7e-05,0.000363,-0.000176,0.000324,0.000486,0.00042,-5.4e-05,-0.000121,4.5e-05,0.000245,-0.000126,-0.000614,-0.000143,0.000226,0.000789,0.000855,-0.000115,-7e-05,0.000402,0.000336,0.00022,0.000157,4.9e-05,0.000447,-0.000703,6e-05,0.000143,0.000164,0.000214,4e-06,-9.8e-05,0.000124,-2e-06,-0.000304,-7.9e-05,0.000928,-7.1e-05,-0.00063,-0.000431,0.000207,4.1e-05,0.000403,0.000448,0.000226,-0.000591,0.000411,-0.000421,0.000544,0.000595,0.000153,-0.000199,0.000381,-0.000804,-0.000945,-0.000591,0.000554,0.000421,0.000385,0.000425,0.000271,0.000587,-0.000174,-0.000342,0.000352,0.000272,0.000194,0.00028,0.000168,0.000104,-7e-06,-9.6e-05,-0.000422,0.000222,-0.000313,-0.000297,6.5e-05,-0.000386,-0.000304,-0.000382,-0.000445,-0.00031,-0.000212,4.7e-05,-8.6e-05,-3.5e-05,-0.000428
-0.000313,-4.1e-05,-6.3e-05,0.000163,-0.000396,-0.000177,-0.000205,0.000105,0.00022,0.000237,-7.1e-05,0.000306,0.000588,0.000177,-0.000231,-0.000311,-2.7e-05,-0.000238,-0.000388,-0.000759,-0.000756,-0.000217,-0.000178,-0.000369,-8.2e-05,-0.000388,-0.000128,-0.000148,-8.7e-05,0.000301,0.000196,0.000409,0.000135,0.000667,0.000141,-0.000132,-0.000315,-4.5e-05,-0.000202,0.000167,0.000496,-9.7e-05,-0.000123,-0.000132,-0.000213,0.000202,0.000401,0.000351,-3.9e-05,-0.000296,-0.00024,0.000308,0.000118,-0.000206,0.00013,-0.000248,-0.000209,-8.8e-05,-0.000469,0.000663,-0.000149,6.5e-05,5.3e-05,1e-06,0.000137,-4.6e-05,-8.7e-05,-0.000176,-1.6e-05,0.000657,-0.000143,-0.000255,9.3e-05,0.000135,0.000125,1.6e-05,-0.000142,-0.000178,-0.000403,-5.5e-05,0.000158,-3.4e-05,-0.000225,-0.000451,0.000296,0.000116,-7.6e-05,0.000619,0.000252,0.000257,-0.000476,-0.000104,-0.000436,-0.00029,-4e-06,0.000201,8.1e-05,0.000299,0.000184,-0.000381,-9.4e-05,8.1e-05,0.000112,0.000384,0.000213,8.6e-05,0.000339,-0.000383,3.6e-05,0.000163,0.000411,0.000685,0.000184,-6.7e-05,-0.00052,0.00026,0.000185,-0.000239,0.000214,-0.000147,-0.000108
0.000326,2.5e-05,-3.7e-05,-4.4e-05,0.000442,0.000469,-0.000281,-0.000215,-0.000219,-0.000162,-0.000121,-0.000248,-0.000192,-0.000204,0.000253,0.000242,5.7e-05,3.6e-05,7.8e-05,0.000238,0.000582,0.000147,0.000206,-4.2e-05,-0.000135,-0.000138,0.000344,0.000105,-0.000157,0.000213,-8.6e-05,-0.000181,-0.000312,-0.000219,2e-05,0.000177,0.000269,1.9e-05,0.000105,-0.000112,-0.000306,-1.7e-05,0.000342,5e-06,4.9e-05,-8.8e-05,-0.000406,-0.000325,7.3e-05,-0.000158,-0.000368,-0.000252,-0.00026,-6.2e-05,-0.000421,-8.3e-05,-1.1e-05,0.000155,0.000388,-0.000179,5.9e-05,-0.000285,-0.000221,-0.000257,-0.000327,-8.4e-05,0.000173,8.7e-05,-0.000112,-0.000624,-0.000491,0.000164,0.000131,0.00025,-0.00017,-2.1e-05,0.000145,-7.4e-05,0.000173,1.8e-05,-0.000325,2.5e-05,0.000281,0.000178,-8.6e-05,-5.4e-05,-9.4e-05,-0.000362,0.000186,-0.000117,0.000243,-0.000259,5.4e-05,3.3e-05,0.00021,-0.000132,0.000156,-4.8e-05,-0.000266,0.000427,0.000143,-5.4e-05,-4.7e-05,-0.000194,-0.000189,-3e-06,-0.000151,0.000373,0.000105,2e-05,2.4e-05,-0.000192,0.000116,2.5e-05,0.000192,-0.000126,-0.00014,-5e-05,-0.00011,7.8e-05,-0.00024
5.7e-05,0.000234,-5.9e-05,-9.5e-05,0.000172,-0.000162,0.00011,5.1e-05,8.1e-05,-0.00019,6e-06,2.3e-05,4.9e-05,1.5e-05,-0.000196,-0.000183,0.000245,0.000128,0.000236,1.8e-05,-0.000312,-0.000115,-0.000153,1.6e-05,0.000256,-8e-06,-5.2e-05,-3.6e-05,0.000104,-0.000267,-6.3e-05,-5.7e-05,0.00017,8.5e-05,4.7e-05,-0.000143,-0.000126,-5.9e-05,-9.2e-05,-0.000142,0.000102,0.000199,4.3e-05,0.000123,0.000112,-3.3e-05,1.7e-05,0.000328,-4.8e-05,-5e-05,0.000154,-5.1e-05,0.000245,0.000253,7.7e-05,0.000267,9.7e-05,6.9e-05,-3.7e-05,-0.000213,-0.000105,0.000233,0.000112,-3.5e-05,-2.4e-05,0.000112,-8e-05,4.5e-05,0.000312,0.000124,0.000176,7.8e-05,-5.3e-05,6.3e-05,-4.4e-05,2.4e-05,1.2e-05,6.1e-05,6e-05,-2.4e-05,6.4e-05,0.000178,-1.9e-05,2.8e-05,-0.000293,-3.4e-05,0.000173,7.8e-05,-7.3e-05,6.2e-05,-0.000179,0.000101,-2.8e-05,-0.000128,-0.000222,-0.000143,-4.5e-05,-2.2e-05,-1.2e-05,-0.000237,-0.000119,-3.1e-05,-1e-06,0.000179,1.5e-05,-0.00014,-1.9e-05,-0.000109,-0.000149,-6.2e-05,4.5e-05,0.000123,-0.000272,8.8e-05,4.9e-05,0.00026,0.000202,0.000202,-1.7e-05,0.000136,0.000157
-0.000112,-0.000258,0.000323,-0.000125,-4.1e-05,-8.5e-05,2.6e-05,2.3e-05,-7.3e-05,1e-04,-8.9e-05,4.2e-05,-0.000131,-6.6e-05,7.9e-05,1e-06,-4e-05,-0.000173,-0.00036,-7.7e-05,-6.3e-05,-3.8e-05,0.000107,-1.1e-05,-0.00021,0.000103,-0.00017,-9.3e-05,2.8e-05,-9.1e-05,-5.3e-05,0.000145,9.6e-05,-0.00016,-1.2e-05,-7.2e-05,-8.1e-05,6.4e-05,-2.8e-05,-0.000133,-0.000227,-5.4e-05,-0.000166,-1e-06,-0.00022,-2.8e-05,0.000144,-0.000166,-5e-05,0.000342,4.5e-05,7e-06,-8e-05,-0.000215,9.2e-05,-3e-05,-3.7e-05,-0.000168,-9.2e-05,2e-04,-1.4e-05,-0.000169,5.1e-05,0.000145,0.000185,-0.000199,3e-06,-0.000137,-0.000355,0.00021,0.000382,-3e-05,4.2e-05,-0.000252,6.6e-05,-0.000124,-0.000123,-1e-06,3.9e-05,4.9e-05,-3.8e-05,-0.000158,-0.000173,0.000245,0.000139,6.5e-05,-0.000206,0.00031,6.1e-05,3.2e-05,1.8e-05,0.000235,0.000126,1.5e-05,6.1e-05,7e-05,-1.7e-05,8.8e-05,2.4e-05,0.000115,5.6e-05,-0.000177,0.000111,-0.000239,-9.2e-05,0.000208,-3.2e-05,-0.000139,0.000158,0.000113,-0.000239,-0.00019,2.8e-05,4.3e-05,-0.000102,-0.000191,7.1e-05,1.6e-05,2.6e-05,-1.7e-05,4.7e-05
0.000244,9.3e-05,-0.000121,0.000154,-0.000268,1.5e-05,-0.000121,4.7e-05,1.8e-05,8.2e-05,6.1e-05,-6e-06,0.000191,6.3e-05,-0.000115,0.000178,-6.7e-05,9.4e-05,0.000157,-6.5e-05,0.000257,8.3e-05,-0.000121,1.5e-05,0.00013,-4.3e-05,9e-06,8.7e-05,6.1e-05,1.4e-05,5.1e-05,-4e-05,-0.000108,0.000124,-8e-05,1e-05,-9.2e-05,-3.3e-05,0.000133,7.6e-05,-1.5e-05,-0.000218,0.00013,1.4e-05,0.000133,0,2.3e-05,4.9e-05,6.4e-05,-8.2e-05,1.8e-05,-4.8e-05,-3.8e-05,0.000103,-9.4e-05,-0.000153,9.3e-05,-5.2e-05,6.4e-05,-0.00014,0.000118,6.1e-05,-0.000121,-2e-06,-0.000141,0.000225,0.000154,2.4e-05,0.000203,-0.00039,-0.000166,7.9e-05,-0.000143,0.000143,-1.9e-05,0.000249,-6.3e-05,1.9e-05,-1.4e-05,0.000195,-0.000147,-6.8e-05,0.000115,-0.00022,4.1e-05,4.6e-05,-5.5e-05,-0.000241,-3e-05,-1.9e-05,1.8e-05,-4e-05,-2.6e-05,-1.1e-05,-1.5e-05,-0.000151,-3.6e-05,-0.000108,2.2e-05,-0.000199,3e-06,0.000199,-0.000211,0.000111,2.7e-05,-6.9e-05,6.8e-05,0.000158,-4e-06,-7.9e-05,8.3e-05,0.000128,0.000118,-8e-06,0.000113,5.9e-05,-1e-04,-5.9e-05,0,-8.8e-05,0.000131
-0.000194,0,-0.000257,-9e-06,1.2e-05,-3.1e-05,0.000154,-2.1e-05,4.2e-05,-5.3e-05,-9.9e-05,2.2e-05,-0.000114,-2.8e-05,0.000156,-8.6e-05,7.2e-05,-0.000108,8.4e-05,0.000214,-0.000169,-6.8e-05,1.9e-05,2.2e-05,-0.000131,0.00012,-6.8e-05,-0.000105,1.7e-05,0.000157,9e-06,-6.4e-05,3.6e-05,9.8e-05,2.4e-05,0.000151,5.2e-05,5.9e-05,3.9e-05,7.6e-05,-4.8e-05,-4e-06,-0.00016,-4.3e-05,7.8e-05,0.000145,-4.9e-05,-3e-06,-9.1e-05,-0.00027,6.8e-05,0.000113,6e-06,-3.2e-05,0.000185,0.000214,-6.2e-05,9.6e-05,-0.000129,7e-05,-8e-05,-2e-05,9.3e-05,5.1e-05,9.2e-05,-6.9e-05,-0.000194,4.8e-05,-7.6e-05,0.000271,-0.000148,-5e-05,8.9e-05,-1.7e-05,-2.2e-05,-0.000233,9.1e-05,1.5e-05,-3.2e-05,-7.4e-05,0.000167,-7e-06,-0.000161,1.1e-05,-3.4e-05,6e-06,5e-06,0.000163,-7.6e-05,4.3e-05,4.7e-05,-9e-05,1e-05,2.6e-05,0.000206,5.2e-05,0.000141,-5.4e-05,4.3e-05,0.000179,6e-05,2.5e-05,8.4e-05,-0.000101,0.000121,6e-05,-7e-06,-0.000105,-1.2e-05,1.7e-05,4.1e-05,-8.9e-05,-0.000151,1.8e-05,4.4e-05,5.2e-05,7.5e-05,-5.4e-05,-6.6e-05,0.000148,-5.2e-05
0.00013,-2.6e-05,1.3e-05,-4.2e-05,-7.9e-05,4.2e-05,-2.2e-05,2.6e-05,1.2e-05,6.8e-05,0.00012,-2.3e-05,0.000177,-1.8e-05,-6e-06,1.5e-05,-0.000115,5.7e-05,-5.9e-05,-0.000211,9.2e-05,7.3e-05,3.4e-05,3e-06,0.000142,-0.00013,0.000135,2.8e-05,-0.000115,-3.9e-05,1.3e-05,2e-05,9.6e-05,-0.000131,5.2e-05,-8.2e-05,1.3e-05,-6.4e-05,-0.000135,8e-06,-4.9e-05,8.3e-05,7.8e-05,-4.3e-05,-0.000114,-4.7e-05,-0.000146,-3.7e-05,4.6e-05,0.000221,-0.000254,-6.2e-05,2e-05,-9.3e-05,-8.8e-05,-3.9e-05,-2.8e-05,0.000114,0.000118,-2.8e-05,2.7e-05,5.2e-05,-6.4e-05,-2e-06,7e-05,-1.8e-05,0.000111,3e-06,-5e-06,-6.6e-05,-8e-06,1.7e-05,3.7e-05,-6.3e-05,9.5e-05,0.000105,1.9e-05,1.9e-05,3.2e-05,-8.2e-05,7.4e-05,1e-06,8.4e-05,1.1e-05,9e-06,-3.4e-05,-2.9e-05,-0.000102,8.9e-05,-3.1e-05,-6.7e-05,5.4e-05,-4.9e-05,5e-05,-0.000117,6e-06,-0.000174,8.1e-05,-6.6e-05,-0.000168,-8.5e-05,-0.000118,-8e-05,3.5e-05,-3.7e-05,-3.4e-05,3e-06,1.9e-05,4.7e-05,3e-05,-6.6e-05,5.8e-05,8e-06,-2.6e-05,-0.000125,-9.7e-05,-6.9e-05,5.9e-05,2.1e-05,-5.4e-05,-0.000218
-4.8e-05,5.9e-05,0.000122,4.9e-05,7.2e-05,-1.3e-05,-4.8e-05,-0.000145,-3.9e-05,6e-06,-0.000125,3.9e-05,-0.000163,-1.7e-05,-9.8e-05,1e-06,-1.4e-05,-4e-05,-2.1e-05,0.000128,-4.8e-05,1.9e-05,2e-05,-4.3e-05,-8.6e-05,-5.4e-05,4.1e-05,-2e-06,-3.1e-05,-1.8e-05,5.4e-05,-1e-06,-3.7e-05,1.6e-05,2.8e-05,8e-06,-6e-06,4e-05,-2.4e-05,1.2e-05,0.000137,2.7e-05,-5.1e-05,1e-05,8.9e-05,-4.7e-05,0.000169,2.4e-05,3.5e-05,4.1e-05,5e-05,4.3e-05,1e-06,0.000119,-0.000175,-0.000144,5e-06,-0.000148,-7.5e-05,8e-05,2.8e-05,-0.000108,7.4e-05,-7.1e-05,-9.8e-05,-1.7e-05,-9.9e-05,-2e-05,6.7e-05,-5.6e-05,6.8e-05,-1.8e-05,-0.000102,8.8e-05,-2.1e-05,5e-05,-4.9e-05,3e-06,-1.7e-05,-1.3e-05,-2.1e-05,7.1e-05,-2e-05,-3.1e-05,4.7e-05,-3e-06,9.2e-05,4.6e-05,2.8e-05,-1.5e-05,0.000118,2.3e-05,0.000105,-3.7e-05,-5.5e-05,-8e-06,0.000149,-1.8e-05,-9.2e-05,0.000147,-2e-05,0,1.1e-05,-7.4e-05,6.9e-05,-6.7e-05,-4.1e-05,0.000121,-3.4e-05,-2.8e-05,9.2e-05,3e-06,9.9e-05,-4.7e-05,0.000132,9.9e-05,3e-06,1.7e-05,1e-05,-8.7e-05,0.000166
-2.5e-05,-3.5e-05,8.8e-05,-3e-05,-7.2e-05,-2.3e-05,-2.2e-05,0.000159,5.8e-05,-7.8e-05,5e-05,-2.9e-05,0.00017,-1.9e-05,9.5e-05,-5e-06,-1.7e-05,1.6e-05,5.1e-05,-3.3e-05,3.4e-05,2e-06,-1.4e-05,-1.9e-05,5.2e-05,1.9e-05,-0.000102,-7e-06,0.000112,-4.3e-05,-6.3e-05,-5.1e-05,-8.5e-05,2.5e-05,-8e-06,2.8e-05,-1e-06,-1.6e-05,2.7e-05,-1e-05,-8.9e-05,-1.7e-05,0.000105,-1.2e-05,-2.2e-05,3.9e-05,-7.5e-05,1.3e-05,1.1e-05,-0.000103,0.000119,-8.2e-05,-2.8e-05,-7.7e-05,0.000132,0.000121,-4.6e-05,-1.7e-05,2.3e-05,-7.7e-05,-4.9e-05,0.000178,-0.000142,5.3e-05,7.2e-05,-8e-06,8.7e-05,7e-06,-5.2e-05,2.9e-05,9e-06,-9.2e-05,8e-05,-7.1e-05,-4.6e-05,-0.000136,7.1e-05,-7e-06,4.5e-05,-2.5e-05,-0.000207,-4e-05,-1.5e-05,-2.7e-05,-3e-06,-7e-06,7.6e-05,-5.8e-05,-7.5e-05,2.7e-05,-8.2e-05,-3e-05,-4.3e-05,4.7e-05,2.3e-05,-4.5e-05,-5.1e-05,5e-06,7.6e-05,-7.3e-05,-7e-06,3.7e-05,5.9e-05,0.000125,-6.4e-05,9.8e-05,5e-05,-0.000118,-2.1e-05,9e-06,-3.3e-05,-1e-05,-7e-05,-5.3e-05,1.2e-05,-4.7e-05,3.8e-05,4e-06,-4.3e-05,7.1e-05,4.1e-05
-3.1e-05,0,-9.7e-05,2.2e-05,6.7e-05,3.1e-05,3e-05,-6.4e-05,-5e-06,1.8e-05,-2.8e-05,-2e-06,-0.000113,-4e-06,-3e-06,8e-06,-4.2e-05,3.1e-05,-4.4e-05,-6e-06,-1.7e-05,-4.2e-05,-2.5e-05,5.6e-05,-3.8e-05,7.1e-05,3.7e-05,1.6e-05,2.3e-05,5.9e-05,2e-06,4e-06,-2e-06,3.8e-05,-3.8e-05,-5e-06,-1.5e-05,8e-06,2.1e-05,0,2.3e-05,-9.6e-05,-2.8e-05,8e-06,-4.8e-05,-4.7e-05,0.000112,1.1e-05,-1.4e-05,-6.9e-05,-6.7e-05,6.3e-05,2.5e-05,1.6e-05,1.2e-05,1e-05,5.4e-05,-8e-06,3.6e-05,-1e-06,1.5e-05,-0.000149,0.000106,-6e-05,-3.3e-05,5.7e-05,-4.3e-05,1.7e-05,-1.5e-05,4.9e-05,5.4e-05,7.3e-05,-1.7e-05,2e-06,3.5e-05,0.000142,3e-06,8e-06,-3.2e-05,-4.5e-05,0.000119,-2.3e-05,0.000127,1.1e-05,-4.1e-05,1.6e-05,-8.3e-05,4.9e-05,6e-06,-3e-06,2.3e-05,-2.1e-05,-9e-06,-4.8e-05,8.7e-05,4e-05,1.5e-05,2.9e-05,6e-05,2.3e-05,1.9e-05,5.7e-05,-3.5e-05,-0.000131,1.8e-05,-2.6e-05,-2.1e-05,1.2e-05,-1.9e-05,-2e-06,4.6e-05,-1.1e-05,-1.6e-05,3.8e-05,-6.3e-05,1.9e-05,0,-2.6e-05,4.3e-05,-3e-06,-9e-06
3.2e-05,1.2e-05,4.4e-05,-1.2e-05,-3.1e-05,1e-06,4.9e-05,-2e-06,-1.5e-05,1.2e-05,5.7e-05,2.8e-05,5.2e-05,-2e-05,-8.3e-05,-5.2e-05,4.6e-05,-4.4e-05,-2.2e-05,-3e-06,-6.6e-05,4e-06,-1e-05,-1.2e-05,2.9e-05,8.9e-05,-6.7e-05,1.2e-05,-5.4e-05,-2.8e-05,0,4.6e-05,1.9e-05,-3.9e-05,-2.4e-05,-2e-06,4.9e-05,-3e-06,4e-05,-5.7e-05,4e-05,2.1e-05,-5.4e-05,-1.2e-05,6.9e-05,2.6e-05,-0.000135,-1.6e-05,-3.4e-05,8.6e-05,8.6e-05,-2.6e-05,-9e-06,5.9e-05,-1.5e-05,-6.9e-05,1.4e-05,0.00014,-4e-05,7.7e-05,7e-06,0.000109,-5e-06,6e-06,-2.1e-05,-6.4e-05,2e-05,-2e-05,1.7e-05,-2e-05,-2e-06,2e-06,1.4e-05,4.8e-05,-6e-06,-7.3e-05,-7.4e-05,-9e-06,-9e-06,0.000115,6.7e-05,1e-05,-8.9e-05,0.000111,-2.6e-05,-2e-06,4.4e-05,1.4e-05,1.3e-05,-1.8e-05,-3.6e-05,5e-05,-1.9e-05,-1.5e-05,-6.6e-05,-6.4e-05,-1.3e-05,-7e-05,-3.1e-05,-3.7e-05,3.1e-05,-6.5e-05,6e-05,0.000106,-7e-05,-2.9e-05,4e-06,3.8e-05,1e-06,-3e-06,-7.3e-05,1.3e-05,7.6e-05,7.2e-05,-4e-05,-1.6e-05,6e-06,-1.6e-05,-1.5e-05,-2.9e-05,-0.000113
-3.2e-05,1.2e-05,-2.8e-05,3.7e-05,0.000136,-2.9e-05,-2.2e-05,-2.3e-05,3e-06,-2.4e-05,-2.9e-05,1.7e-05,-3e-05,-1e-06,8.9e-05,1.7e-05,1e-05,7.1e-05,3.5e-05,6.8e-05,0.000105,6e-06,5e-06,-2.8e-05,-3.3e-05,-0.000194,3.3e-05,-7e-06,-4.2e-05,9e-06,1.4e-05,-6e-06,3.4e-05,-3.7e-05,3e-05,4.8e-05,-2e-05,-1.3e-05,-3e-05,6e-06,-3.8e-05,8.3e-05,2.5e-05,-2e-06,-6.4e-05,2.7e-05,6.8e-05,-3e-06,3.3e-05,7.2e-05,-5e-05,3.6e-05,3e-06,-9e-05,1.5e-05,3e-05,-2.6e-05,-0.000101,7.3e-05,-0.000104,-3e-05,-0.000112,-1.2e-05,6.3e-05,1.9e-05,5e-06,2.4e-05,-1.2e-05,3e-05,-9.8e-05,-7.2e-05,-2.2e-05,-1.3e-05,-4.4e-05,-1.6e-05,8e-06,1e-06,-1.2e-05,2.1e-05,3.4e-05,-1.1e-05,8e-06,2.7e-05,-0.000122,9e-06,6e-06,-4.7e-05,-4.2e-05,2.1e-05,3.8e-05,1.4e-05,-2e-06,1.1e-05,4e-06,1.1e-05,1.6e-05,1.5e-05,2e-05,-2.1e-05,4.9e-05,-1.1e-05,-2.4e-05,-2.6e-05,-7.8e-05,8.3e-05,3.2e-05,-1.9e-05,-4.7e-05,0,1.7e-05,-3.8e-05,1.2e-05,-5.3e-05,-1.7e-05,5e-05,-4e-06,-7e-06,1.5e-05,-1.2e-05,-2.5e-05,3.8e-05
5.7e-05,-1.3e-05,-4.8e-05,-3.6e-05,-2.1e-05,1.8e-05,-4.4e-05,8.7e-05,2.3e-05,1.7e-05,-5e-06,-4e-05,2e-05,2.1e-05,-1.3e-05,9e-06,2.3e-05,-6e-05,4.7e-05,-7.5e-05,-8.1e-05,3e-05,1.8e-05,2.6e-05,5.4e-05,3.2e-05,6.7e-05,-1e-06,2.8e-05,-4e-06,-1.4e-05,-1.6e-05,1.5e-05,3.5e-05,3.5e-05,-4.3e-05,-1e-06,1.6e-05,-2.5e-05,1.1e-05,-4e-06,9e-06,-1.5e-05,-6e-06,-1.2e-05,-4.2e-05,-2.3e-05,1.4e-05,1.6e-05,-0.000141,-9.7e-05,-5.1e-05,-4e-06,6.3e-05,-2.5e-05,1.7e-05,9e-06,1.5e-05,-8.6e-05,5.2e-05,2.2e-05,6.9e-05,-5e-06,-4.1e-05,-3.6e-05,1.2e-05,-3.5e-05,2.1e-05,-6.7e-05,0.000163,-4.9e-05,3.6e-05,-3.6e-05,3.4e-05,7e-06,2.4e-05,3.3e-05,6e-06,-1.7e-05,-4.4e-05,-1.9e-05,5e-06,2.1e-05,5.9e-05,3.8e-05,-6e-06,-7.5e-05,6.1e-05,-1.4e-05,-3.9e-05,-2.2e-05,-4.4e-05,-1e-06,0,-4.4e-05,6.6e-05,-4e-06,1e-05,-5e-06,-2e-05,-3e-06,4.1e-05,2.9e-05,6e-05,-4.1e-05,-6.5e-05,2.9e-05,5.6e-05,1.9e-05,-1.7e-05,5e-05,-4.5e-05,-1.6e-05,-1.3e-05,1.2e-05,1.6e-05,0,1.5e-05,3.4e-05,6.6e-05,6.1e-05
-5.1e-05,4e-06,-5e-06,-1e-06,-5.5e-05,7e-06,4.7e-05,-9.5e-05,-2.6e-05,1.9e-05,2.5e-05,1e-05,1.8e-05,1.5e-05,-2.2e-05,3.5e-05,3.8e-05,4.3e-05,-7e-05,4.4e-05,3.7e-05,-2.6e-05,4e-06,5e-06,-6.8e-05,7.8e-05,-4.5e-05,-2e-06,3.6e-05,1.3e-05,1.9e-05,2.8e-05,2.8e-05,2.6e-05,-6e-06,-2.6e-05,-3.1e-05,-2.2e-05,-1.6e-05,1.1e-05,-3.3e-05,-5.5e-05,2.2e-05,-1e-05,6.1e-05,4e-05,2.7e-05,-1.7e-05,-3e-06,2.3e-05,0.000123,0,1e-06,-8e-06,-5e-06,-2.3e-05,-8e-06,-6.7e-05,3.4e-05,0,9e-06,-3.8e-05,0,-3e-06,3.4e-05,2.2e-05,2.8e-05,0,7.4e-05,-0.000116,8.3e-05,-9e-06,6e-05,-2.6e-05,8e-06,-2.2e-05,-6e-06,-1.3e-05,1e-05,-1.4e-05,-5.9e-05,-2e-06,-5.4e-05,-2e-05,-1.5e-05,0,6.1e-05,-5.6e-05,-1.6e-05,1.5e-05,5.7e-05,3e-05,-6e-06,2e-05,7.3e-05,-1.2e-05,-2.3e-05,-1.2e-05,-1.1e-05,7e-06,-8e-06,1.2e-05,-4.5e-05,-3.1e-05,3.3e-05,1.9e-05,-2e-05,-2.3e-05,-1e-06,-7e-06,4.1e-05,4.9e-05,3.7e-05,-5e-06,-4.6e-05,-3e-06,-2.3e-05,-1.5e-05,-1.1e-05,-1e-05,2e-06
2.5e-05,4e-06,4.5e-05,6e-06,-5e-06,3e-06,-2.6e-05,4.5e-05,-7e-06,-1e-05,2e-06,2e-05,-1.4e-05,-5e-06,-9e-06,-8e-06,-6e-06,-1e-05,1.5e-05,-1.3e-05,1.9e-05,1.9e-05,5e-06,-8e-06,5.3e-05,-2.4e-05,1.7e-05,-1.6e-05,-1.2e-05,-1.7e-05,-1e-05,1e-06,-9.3e-05,-2.8e-05,-2.2e-05,5e-06,2.3e-05,4e-06,4.3e-05,2.4e-05,8e-06,-4.6e-05,1e-06,0,-4.7e-05,-1.7e-05,-1e-06,0,-1.6e-05,7.9e-05,-7e-06,3.1e-05,0,-4.5e-05,1.6e-05,2e-06,-3.1e-05,0.000131,-1.1e-05,-2e-05,-3.1e-05,4.3e-05,2.3e-05,1.6e-05,-1.4e-05,-5e-06,-1.1e-05,-9e-06,-7e-05,1.1e-05,5.1e-05,-2.2e-05,-5.5e-05,1.8e-05,-1.1e-05,9e-06,3.8e-05,8e-06,-8e-06,-1e-05,4e-06,3e-06,2.9e-05,2.8e-05,-2.2e-05,-4e-06,-7.1e-05,3.3e-05,8e-06,-1.8e-05,-2.4e-05,2.2e-05,-1.1e-05,-1e-06,-2.1e-05,-2e-05,3.8e-05,3.4e-05,-1e-06,-1.6e-05,2.4e-05,-1e-05,1e-06,-1.6e-05,-9e-06,2.9e-05,-7e-06,-3.9e-05,-1e-06,7e-06,-9e-06,-2.2e-05,-2e-06,-1.9e-05,-1.4e-05,-9e-06,2.2e-05,-1.1e-05,-1.4e-05,-6.4e-05,-1.3e-05
1.9e-05,-2e-05,6.3e-05,1e-06,-4.1e-05,9e-06,-1.4e-05,-8e-06,7e-06,1e-05,1.2e-05,-1.8e-05,2e-05,0,4e-05,-3e-05,-5e-06,-1.3e-05,2.9e-05,-8e-06,-5.2e-05,-2.2e-05,-1.9e-05,7e-06,-3e-05,1.8e-05,-3.2e-05,2e-06,-4e-06,-1e-06,1e-06,-7e-06,3.6e-05,-1.5e-05,-1.5e-05,1.4e-05,5e-06,-8e-06,-1.5e-05,-1.4e-05,2.4e-05,5.4e-05,-1.9e-05,-1e-06,9e-06,-2.4e-05,-2.5e-05,2.1e-05,-2e-06,-1.3e-05,-4.9e-05,-2.9e-05,-2e-06,6.5e-05,-4e-06,1.4e-05,2.2e-05,-8.6e-05,-4e-06,2.1e-05,2.9e-05,-3.5e-05,-2.2e-05,-2.1e-05,8e-06,-3e-05,-1.8e-05,-3e-06,4.1e-05,8.1e-05,-5.6e-05,2e-05,1.9e-05,6e-06,5e-06,6e-06,-2.5e-05,-1.1e-05,4e-06,-4e-05,1.2e-05,-1e-06,-3.7e-05,-4.3e-05,2.8e-05,6e-06,4.7e-05,-3.2e-05,0,8e-06,2.7e-05,-2.6e-05,1.2e-05,1.5e-05,-1.5e-05,3.1e-05,-4e-05,-1.9e-05,1.4e-05,9e-06,-6e-06,-3.4e-05,-5e-06,5.8e-05,1.6e-05,-2.4e-05,1.6e-05,5.9e-05,-8e-06,5e-06,-4.1e-05,2.3e-05,-2.8e-05,-4e-06,4e-05,4e-06,6e-06,6e-06,1e-05,6.4e-05,-4.3e-05
-7e-06,2.4e-05,-5.5e-05,-5e-06,3.5e-05,-2.2e-05,5e-05,-6e-06,8e-06,-9e-06,-1.8e-05,-2e-06,-3e-05,-1e-06,-1.2e-05,1.1e-05,-6e-06,3.3e-05,-3.3e-05,-4e-06,5.1e-05,-6e-06,-4e-06,-1e-06,2.4e-05,-3.8e-05,-1.6e-05,5e-06,-1.2e-05,3e-06,0,3e-06,8e-06,1.1e-05,1.3e-05,-2.7e-05,-4e-06,6e-06,5e-06,8e-06,-3e-05,3.4e-05,1.6e-05,6e-06,2.6e-05,2.5e-05,1.6e-05,-2.2e-05,3e-06,-5.4e-05,3.8e-05,1.9e-05,1e-06,-3.7e-05,-1.1e-05,5e-06,1.8e-05,4.4e-05,1.9e-05,-8e-06,-1.1e-05,3.9e-05,-1.6e-05,1.2e-05,3.2e-05,-6e-06,3e-05,7e-06,-6e-06,-0.000113,-4.4e-05,-2.3e-05,1e-05,-3.3e-05,5e-06,-1.7e-05,-1.9e-05,9e-06,0,2.6e-05,7.2e-05,3e-06,-7e-06,2.2e-05,1.3e-05,1e-06,5.3e-05,3.8e-05,9e-06,-1e-06,-1.1e-05,-1.3e-05,-2e-06,-1.9e-05,-1.9e-05,-5e-06,3.4e-05,-1.2e-05,-1.5e-05,-6e-06,-4e-06,2.4e-05,-2.4e-05,-5.4e-05,-1.9e-05,1.8e-05,-9e-06,-2.6e-05,-1.1e-05,9e-06,-9e-06,-3e-05,2.8e-05,4e-06,3e-06,-2e-06,-1.2e-05,1.1e-05,1e-05,2e-06,-8e-06
-1.7e-05,-2.2e-05,-3.3e-05,-5e-06,-4.8e-05,6e-06,-2.2e-05,1.1e-05,-1.4e-05,-2.4e-05,2e-05,5e-06,3.4e-05,1.8e-05,-2.9e-05,7e-06,-2.4e-05,-3.8e-05,-1.1e-05,2.1e-05,-5.3e-05,0,8e-06,-8e-06,-2.5e-05,8e-06,4.3e-05,-1.4e-05,-1.7e-05,1e-05,-1e-06,-1e-05,-2.5e-05,2.6e-05,2.3e-05,-3e-06,4e-06,-3e-06,-7e-06,-1.8e-05,3.3e-05,-3.1e-05,-2.7e-05,1e-06,-3e-05,-9e-06,-1.7e-05,1.3e-05,-5e-06,6e-06,-5.4e-05,-1.2e-05,3e-06,-8e-06,1.6e-05,-2.4e-05,-1.7e-05,-8.8e-05,-2.9e-05,5e-06,-1.6e-05,-5.4e-05,2.1e-05,-8e-06,-4.2e-05,1.6e-05,-3.1e-05,-3e-06,9e-06,5e-05,4.5e-05,-6e-06,-4e-06,3.6e-05,-6e-06,2.5e-05,1e-06,-6e-06,0,4.1e-05,-3e-05,-6e-06,3.4e-05,2.9e-05,-2.9e-05,-1e-06,-2.2e-05,-2.1e-05,1e-06,2e-06,-1.2e-05,2.3e-05,1e-06,3e-06,3.9e-05,-1.5e-05,-2.6e-05,1.1e-05,-3e-06,5e-06,-1.7e-05,2.5e-05,3e-05,3.1e-05,1.6e-05,-1.7e-05,6e-06,-2e-05,-1e-05,-7e-06,2.3e-05,2.5e-05,8e-06,2.2e-05,-1.9e-05,1.7e-05,2.6e-05,8e-06,-1e-05,-5.1e-05,3.5e-05
1.7e-05,6e-06,4e-06,1.4e-05,3.1e-05,7e-06,-2e-06,-2e-06,-5e-06,1.5e-05,-1.4e-05,8e-06,-3.8e-05,-2e-06,6.5e-05,-1.4e-05,-1e-05,3e-05,3e-05,-3.3e-05,4.5e-05,2.8e-05,-1e-06,3e-06,1.6e-05,-1e-05,-1.1e-05,1.9e-05,1.9e-05,-6e-06,-5e-06,3e-06,1.5e-05,-1.9e-05,1e-06,1.1e-05,-1.6e-05,-5e-06,-1.5e-05,-8e-06,1e-06,-2.5e-05,3.6e-05,-2e-06,1.8e-05,1.5e-05,3.4e-05,-1e-06,-2e-06,7.7e-05,1.3e-05,1.3e-05,-2e-06,3.4e-05,-4e-06,7e-06,1.9e-05,0.000122,3.6e-05,-2.1e-05,2.2e-05,5.1e-05,1.5e-05,-3e-06,2.2e-05,-1e-05,2.4e-05,-5e-06,-2.7e-05,4.6e-05,2e-05,3.9e-05,-2e-06,-1.9e-05,-1e-06,-2.5e-05,-1e-06,8e-06,0,-4e-06,-1.9e-05,-2e-06,-1.1e-05,-5.3e-05,-1e-06,-3e-06,4.2e-05,-6e-06,-1.7e-05,1e-06,-2.6e-05,7e-06,8e-06,-8e-06,-1.1e-05,3.3e-05,1.6e-05,-1.5e-05,8e-06,1.1e-05,0,-2.4e-05,-1.5e-05,-2e-05,-1.6e-05,1.2e-05,-1.3e-05,3.6e-05,-1e-06,-1e-05,2e-06,-2.9e-05,-2.9e-05,1e-05,4.8e-05,-9e-06,-2.5e-05,-1.4e-05,3e-06,2.3e-05,4.6e-05
-2e-05,1e-05,1e-05,-2e-05,2e-06,-1.2e-05,-1.3e-05,-1.5e-05,6e-06,3e-06,4e-06,-1.7e-05,4.4e-05,0,-6.3e-05,9e-06,-9e-06,-2.4e-05,-3e-06,1.5e-05,-2e-05,-1e-05,1.2e-05,-1e-06,-6e-06,1.2e-05,1.3e-05,-6e-06,2.1e-05,-1e-06,1e-06,-1e-05,3e-05,-1.3e-05,-1.3e-05,-1e-05,1.8e-05,5e-06,2.4e-05,-1e-06,-3e-06,-5e-06,-1.4e-05,0,-8e-06,-5e-06,-3.6e-05,-6e-06,5e-06,-4.6e-05,6.4e-05,-2.9e-05,1e-06,-3.3e-05,-4e-06,2.4e-05,-8e-06,-8e-05,-3.1e-05,2.6e-05,-1.4e-05,-4.6e-05,-1.2e-05,9e-06,0,7e-06,-2.1e-05,3e-06,2.7e-05,-8.2e-05,-3e-05,-2.3e-05,-1.1e-05,2e-06,6e-06,9e-06,1.3e-05,-4e-06,-5e-06,-7e-06,-4.3e-05,6e-06,1e-05,2.7e-05,1.5e-05,0,-3.3e-05,3.5e-05,9e-06,-3e-06,1.4e-05,-1.9e-05,-2e-06,-8e-06,-1e-06,2e-06,-7e-06,1.7e-05,-2e-06,-2.6e-05,5e-06,-1e-05,2.9e-05,2.9e-05,-1.3e-05,2.1e-05,1.6e-05,-2.3e-05,5e-06,4e-06,-6e-06,1.9e-05,1.7e-05,-1.4e-05,-4.2e-05,-1e-05,1e-06,-1.3e-05,6e-06,2.3e-05,-3.9e-05
1.9e-05,-1.3e-05,2e-05,1.1e-05,5e-05,5e-06,9e-06,1.8e-05,9e-06,-5e-06,-7e-06,6e-06,-3.4e-05,1.1e-05,2.5e-05,-2e-06,-4e-06,5e-06,-2e-05,3e-06,-4e-06,-1e-06,-6e-06,5e-06,-2e-06,4.5e-05,-6e-06,-2e-06,-1.6e-05,-7e-06,6e-06,-1.4e-05,-2.1e-05,1.2e-05,-1.1e-05,-3e-06,-1.5e-05,-4e-06,1.5e-05,4e-06,5e-06,4.6e-05,-9e-06,0,-1e-05,-1.9e-05,2.9e-05,3e-06,0,-3.8e-05,-4.4e-05,6e-06,-3e-06,9e-06,0,-2.8e-05,-2.2e-05,5.8e-05,2.1e-05,-1.3e-05,0,3.9e-05,-1.2e-05,-2e-06,-3.4e-05,-4e-06,1.5e-05,4e-06,-1.8e-05,3.8e-05,-1.2e-05,6e-06,8e-06,1.2e-05,-6e-06,1.1e-05,6e-06,8e-06,8e-06,1e-06,2.8e-05,0,1e-05,-2.8e-05,-1.2e-05,2e-06,-3.2e-05,-4.5e-05,1e-05,3e-06,-1.1e-05,-4e-06,1e-06,1.2e-05,-1.9e-05,-3.2e-05,0,9e-06,2.2e-05,2.2e-05,9e-06,7e-06,-3e-06,-1.6e-05,2.1e-05,-1.7e-05,-7e-06,5e-06,4e-06,2e-06,9e-06,0,6e-06,-7e-06,-1e-05,4e-06,6e-06,1.1e-05,-9e-06,-2.1e-05,-4.2e-05
-1.1e-05,1.2e-05,2e-06,3e-06,0,-7e-06,2.3e-05,9e-06,-2e-06,1.6e-05,7e-06,8e-06,3.3e-05,8e-06,-4e-06,0,9e-06,7e-06,5e-06,-6e-06,3.2e-05,-1.6e-05,-1e-05,-4e-06,8e-06,-4.2e-05,-3.5e-05,1.2e-05,-1.7e-05,8e-06,-4e-06,1.6e-05,1.3e-05,8e-06,5e-06,2.8e-05,1.1e-05,4e-06,-3.2e-05,1.1e-05,-1.7e-05,9e-06,1.5e-05,3e-06,2.3e-05,1.6e-05,-3.1e-05,2e-06,-1.1e-05,3.8e-05,-9e-06,3e-06,1e-06,1.5e-05,0,-1e-06,1.3e-05,-0.000104,0,-1.2e-05,1.3e-05,-2.5e-05,7e-06,3e-06,3.3e-05,7e-06,0,-5e-06,2e-06,1.6e-05,1.7e-05,7e-06,3e-06,-2.1e-05,-1e-06,-2.1e-05,6e-06,-5e-06,-5e-06,-2.2e-05,3.7e-05,-1e-06,-9e-06,4.8e-05,-3e-06,-1e-06,3e-06,4.4e-05,-1.5e-05,0,3e-05,1.6e-05,-7e-06,-1e-06,1.7e-05,1.9e-05,0,-1.7e-05,4e-06,-2.1e-05,-3e-06,1.6e-05,5e-06,-3e-06,-1.3e-05,1.2e-05,3e-06,1.1e-05,9e-06,1e-06,-2e-06,3e-06,-2.2e-05,-7e-06,1.3e-05,-1e-06,-1.1e-05,9e-06,6e-06,-2.2e-05,1.9e-05
-7e-06,-1e-05,9e-06,0,-8e-06,-3e-06,-2.7e-05,-4.1e-05,-1.2e-05,0,-7e-06,-5e-06,-3e-05,1e-06,1.2e-05,1.6e-05,1e-05,-1.6e-05,2.1e-05,-3e-06,-5.1e-05,9e-06,0,-4e-06,-8e-06,-4.1e-05,2.4e-05,-1.5e-05,7e-06,0,4e-06,6e-06,-1.7e-05,-3e-06,1.2e-05,0,-6e-06,-6e-06,3e-06,-1e-06,1.8e-05,-4.7e-05,-1.2e-05,1e-06,-2.4e-05,-6e-06,2.5e-05,-4e-06,-4e-06,2.3e-05,1.4e-05,1.9e-05,5e-06,-1.9e-05,8e-06,2.6e-05,2e-06,0.000117,-1.2e-05,2.6e-05,-1.5e-05,1.3e-05,1.7e-05,-2e-06,-1.2e-05,-7e-06,-1.2e-05,-2e-06,1.8e-05,-4.2e-05,8e-06,-2.3e-05,-1.4e-05,1.3e-05,5e-06,1e-05,-1.3e-05,6e-06,-1e-06,-1e-05,-3e-06,-3e-06,6e-06,-4.6e-05,6e-06,0,-2e-05,-3.9e-05,7e-06,0,5e-06,-4e-06,6e-06,1.1e-05,3e-06,-4e-06,0,1.1e-05,-1.9e-05,3.1e-05,-4e-06,-6e-06,-4e-06,-8e-06,1.2e-05,-1.8e-05,-1e-05,-2.9e-05,2e-06,-1e-06,-5e-06,-7e-06,1.2e-05,1e-06,0,1.2e-05,1.6e-05,-6e-06,-1e-06,3.4e-05,4.3e-05
1.5e-05,2e-06,-2.5e-05,-7e-06,-2.9e-05,3e-06,-4e-06,4.6e-05,1.3e-05,-1.9e-05,-5e-06,-5e-06,1.5e-05,-1e-05,-2.1e-05,-2.6e-05,1e-05,2.3e-05,-1.6e-05,1.6e-05,5.5e-05,0,7e-06,5e-06,9e-06,3.8e-05,5e-06,5e-06,1.4e-05,-2e-06,-3e-06,-1.3e-05,-2.2e-05,-1.5e-05,0,-4e-06,3e-06,5e-06,-4e-06,4e-06,-8e-06,-1e-05,1.8e-05,1e-06,5e-06,1e-06,-8e-06,2e-06,7e-06,-3e-05,-2.2e-05,-2.5e-05,-4e-06,1e-05,-1.6e-05,-2.2e-05,2e-06,-7e-05,7e-06,-2.2e-05,6e-06,-3e-06,-3e-05,-3e-06,-1e-05,-1e-05,1.9e-05,3e-06,-2.4e-05,4.5e-05,-2e-06,1.8e-05,1.1e-05,-1e-06,-2e-06,6e-06,-1e-05,-7e-06,-1e-06,2e-05,-8e-06,0,-1.1e-05,3e-05,2e-06,-1e-06,9e-06,2.9e-05,1e-06,4e-06,3e-06,-8e-06,-1e-06,-4e-06,-3e-06,-2.2e-05,4e-06,-1.1e-05,-1.2e-05,-3.3e-05,3e-06,-1.7e-05,-1e-05,2.7e-05,1e-06,-1.4e-05,1.4e-05,2.7e-05,-4e-06,-2e-06,-1.6e-05,-2e-06,8e-06,6e-06,-1.9e-05,-5e-06,-5e-06,-3e-06,-7e-06,9e-06,-7e-06
-7e-06,2e-06,-1.7e-05,8e-06,6e-06,-5e-06,1.8e-05,-2.2e-05,2e-06,9e-06,1e-06,5e-06,-1.2e-05,-1e-06,1e-05,4e-06,1e-05,-2.1e-05,-9e-06,-1.2e-05,-4.6e-05,1.3e-05,2e-06,1e-06,-1.2e-05,2.6e-05,2e-06,-1e-06,-5e-06,-2e-06,1e-06,-1e-06,2.3e-05,6e-06,-9e-06,7e-06,-3e-06,-3e-06,1.1e-05,-4e-06,-6e-06,2.9e-05,-2.5e-05,1e-06,2.1e-05,1.3e-05,-1e-06,1e-06,5e-06,-3.3e-05,2.7e-05,-1.3e-05,0,2e-06,6e-06,-2e-06,8e-06,7e-05,-1e-05,1e-05,5e-06,-2e-06,1e-05,0,2.8e-05,8e-06,-1.6e-05,2e-06,1.2e-05,-3.2e-05,-2e-06,1e-06,4e-06,-2e-06,-3e-06,-1.7e-05,-5e-06,7e-06,-1e-06,4e-06,-3.9e-05,1e-06,-1.4e-05,3e-06,6e-06,1e-06,2.9e-05,-1.9e-05,-6e-06,1e-06,-1.5e-05,4e-06,-1e-06,1e-06,-1.1e-05,2e-05,-9e-06,-6e-06,1e-06,3e-05,3e-06,8e-06,-2e-06,-2.9e-05,5e-06,2.9e-05,-7e-06,5e-06,-3e-06,5e-06,1.5e-05,6e-06,-1.3e-05,0,1.9e-05,-6e-06,4e-06,3e-06,8e-06,-4.5e-05,-3.3e-05
3e-06,-2e-06,9e-06,-1e-06,-3.5e-05,1e-06,-2.2e-05,1e-06,-1e-06,5e-06,2e-06,2e-06,6e-06,5e-06,1.6e-05,1.8e-05,4e-06,1.2e-05,1.3e-05,2e-06,2.2e-05,-5e-06,-2e-06,-6e-06,1.5e-05,-4e-06,1.3e-05,-9e-06,-5e-06,3e-06,-2e-06,1.3e-05,0,1.1e-05,-4e-06,-3e-06,-5e-06,-1e-06,1.3e-05,-4e-06,1.3e-05,3.2e-05,1.3e-05,-1e-06,-2.3e-05,-1.3e-05,4e-06,-2e-06,-4e-06,4.8e-05,1.2e-05,1.9e-05,1e-06,-9e-06,1.7e-05,2e-05,-3e-06,-0.000117,1.1e-05,2e-06,-1.5e-05,0,7e-06,-5e-06,-1.7e-05,1e-06,9e-06,-3e-06,-3e-06,1.6e-05,-7e-06,-2.1e-05,-1e-05,4e-06,3e-06,1.2e-05,1e-05,-8e-06,2e-06,-1e-06,-1e-06,1e-06,1.6e-05,-1.5e-05,-3e-06,-1e-06,3e-06,2e-06,9e-06,-5e-06,0,5e-06,-9e-06,-8e-06,1.1e-05,5e-06,1.2e-05,1.8e-05,1e-06,-3.4e-05,2e-06,1.1e-05,-1.4e-05,1.4e-05,-2.2e-05,-1.8e-05,2e-06,-3.1e-05,-4e-06,2e-06,1.1e-05,-1e-05,2e-06,7e-06,1.4e-05,0,-7e-06,3e-06,1e-06,2.5e-05,-1.3e-05
0,1e-06,2e-05,-8e-06,2.3e-05,3e-06,1.3e-05,-3e-06,-1e-05,-2e-05,-1e-06,-6e-06,-1e-06,-4e-06,-3.6e-05,-1.2e-05,0,-5e-06,1e-06,9e-06,1e-05,-5e-06,0,8e-06,-1.7e-05,-3.1e-05,-2.7e-05,7e-06,2e-06,-1e-06,3e-06,4e-06,1.7e-05,-3e-06,3e-06,-2e-06,8e-06,-1e-06,-1.2e-05,-2e-06,0,-2.4e-05,2e-06,0,7e-06,1e-06,-1.2e-05,0,-4e-06,1.1e-05,-3.5e-05,-4e-06,1e-06,7e-06,-1.9e-05,-1.7e-05,-1e-05,0.000105,-8e-06,-8e-06,1.1e-05,5e-06,8e-06,1.1e-05,7e-06,2e-06,-1e-06,0,5e-06,-4e-06,-3e-06,2.4e-05,0,-5e-06,1e-06,1e-06,1.2e-05,6e-06,-1e-06,4e-06,3.3e-05,0,-1e-05,3e-06,-1.1e-05,0,2.4e-05,1.7e-05,-4e-06,5e-06,-2.1e-05,-5e-06,8e-06,-4e-06,-4e-06,-2.7e-05,-9e-06,-9e-06,-7e-06,3.5e-05,-3e-06,-2e-06,5e-06,-1e-05,1.9e-05,-2e-06,-1e-05,2.3e-05,-3e-06,-7e-06,-6e-06,1.4e-05,1.3e-05,-5e-06,-9e-06,1e-06,-2e-06,-1e-06,-6e-06,2.5e-05,2.4e-05
-2e-06,-3e-06,1.6e-05,1e-05,-4.5e-05,0,1.9e-05,1.9e-05,1.2e-05,1.5e-05,-2e-06,3e-06,-5e-06,-1e-05,3.3e-05,1e-06,-4e-06,-8e-06,-9e-06,-5e-06,-3.1e-05,-1.1e-05,-7e-06,-5e-06,1.8e-05,-3e-06,-5e-06,-5e-06,-4e-06,0,-3e-06,-1.2e-05,-1.3e-05,-1e-05,6e-06,1e-05,-3e-06,-3e-06,-1.5e-05,-5e-06,-6e-06,-3.9e-05,-7e-06,-1e-06,9e-06,0,1.8e-05,0,3e-06,-4.6e-05,2e-06,0,-1e-06,-1e-06,1e-06,2e-06,0,-6.3e-05,7e-06,7e-06,0,-9e-06,-1.2e-05,0,6e-06,-9e-06,-9e-06,3e-06,-1.1e-05,-8e-06,7e-06,0,1e-06,2e-06,-3e-06,-1.1e-05,1e-06,-7e-06,-1e-06,-5e-06,3e-05,-2e-06,-1e-06,-1.5e-05,1e-05,0,1e-06,-2.8e-05,-3e-06,-6e-06,1e-05,0,0,3e-06,4e-06,1.2e-05,5e-06,4e-06,-4e-06,-3.1e-05,-5e-06,-1.2e-05,-1e-06,1e-05,-1.8e-05,2e-06,1.5e-05,1e-06,2e-06,-4e-06,-1e-05,-1.2e-05,-1e-05,-5e-06,1e-05,4e-06,2e-06,-4e-06,3e-06,-3.5e-05,2.8e-05
2e-06,4e-06,-2.1e-05,-5e-06,6.1e-05,1e-06,-1.6e-05,-3.4e-05,-7e-06,5e-06,2e-06,-1e-06,0,-3e-06,-1.2e-05,4e-06,-8e-06,1.8e-05,0,-7e-06,4e-05,1e-05,2e-06,-2e-06,-1.8e-05,2.3e-05,1.5e-05,1e-06,0,-1e-06,1e-06,-3e-06,2e-06,0,0,-7e-06,6e-06,2e-06,1.6e-05,8e-06,1e-06,1.3e-05,1.2e-05,0,-1e-05,-4e-06,-1.7e-05,0,5e-06,4e-06,1.4e-05,-1.3e-05,-2e-06,-4e-06,1e-05,1.1e-05,6e-06,8.8e-05,6e-06,-5e-06,-8e-06,1.3e-05,-6e-06,-6e-06,-1.6e-05,0,1.3e-05,1e-06,2.4e-05,3.1e-05,3e-06,-1.8e-05,5e-06,1e-06,1e-06,1.5e-05,0,6e-06,-2e-06,-7e-06,-2.4e-05,0,1.5e-05,4e-05,5e-06,1e-06,-3.2e-05,3.4e-05,3e-06,2e-06,3e-06,-1e-06,4e-06,-3e-06,-9e-06,1.3e-05,-2e-06,6e-06,5e-06,3.4e-05,0,-1e-06,7e-06,2e-06,1e-05,-5e-06,-6e-06,-1.5e-05,5e-06,2e-06,-2e-06,1.2e-05,-8e-06,4e-06,-2e-05,0,-7e-06,0,3e-06,-3e-06,-1.4e-05
