-2.4e-05,-0.000491,-0.007794,-0.00573,-0.000101,-3e-06,-0.000766,-0.011469,-0.008239,-0.000162,-2e-06,-3.4e-05,-0.000241,-0.025326,-0.055681,-0.009823,-4.9e-05,0,-7e-06,-0.002542,-0.112569,-0.217086,-0.045379,-0.000519,-0.035669,-0.127447,-0.164093,-0.169992
-2.4e-05,-0.000376,-0.005949,-0.004325,-6.9e-05,-3e-06,0.000207,0.002587,0.001518,-2.6e-05,-2.2e-05,-2.7e-05,-0.000194,-0.028449,-0.062534,-0.011469,-7.7e-05,0,0,-0.000261,-0.079091,-0.180096,-0.0384,9.8e-05,-0.006568,-0.020756,0.111745,0.120981
1e-06,0.000215,0.003514,0.002607,3.9e-05,-1.4e-05,-5.9e-05,0.000647,0.001077,4.4e-05,-2.1e-05,-3.3e-05,2.5e-05,-0.003973,-0.007782,-0.001362,-1.6e-05,-1e-06,0,-0.000348,0.019572,0.068689,0.020543,0.000245,0.011795,0.022068,0.015119,0.00029
2e-05,0.000462,0.007505,0.005508,7.8e-05,-1.9e-05,0.00035,0.00538,0.003728,6.6e-05,-8e-06,3.5e-05,0.000169,0.025467,0.057873,0.010531,5.8e-05,1e-06,2e-06,0.000741,0.092952,0.210342,0.04675,-3.1e-05,0.006743,0.01002,-0.125066,-0.120362
1.1e-05,4.4e-05,0.000778,0.000579,4e-06,-1.1e-05,6.9e-05,0.001151,0.000824,5e-06,-2.6e-05,1.4e-05,6.8e-05,0.020785,0.047597,0.009329,6e-05,2e-06,6e-06,0.001562,0.043367,0.054718,0.005397,0.000151,0.008664,0.051076,0.103163,0.128716
-1.4e-05,-0.000392,-0.006497,-0.004843,-8.8e-05,-1.5e-05,-0.000641,-0.00982,-0.00704,-0.000156,-5.8e-05,-8.2e-05,-0.000127,-0.007841,-0.020297,-0.003484,-1.2e-05,-1e-06,-4e-06,-0.001513,-0.083607,-0.167092,-0.03691,5e-05,-0.006159,-0.018404,0.054171,0.062527
-1.6e-05,-0.000208,-0.003577,-0.002694,-4.9e-05,-1.4e-05,0.000223,0.001611,0.000207,-9.5e-05,-5.5e-05,-8.1e-05,-0.000124,-0.018334,-0.045641,-0.009629,-6.5e-05,0,-6e-06,-0.001996,-0.083743,-0.136914,-0.022988,-0.000319,-0.019788,-0.087705,-0.160612,-0.156672
1e-06,0.000209,0.003667,0.002807,5.6e-05,1e-06,0.000288,0.00635,0.005266,0.000107,-1.6e-05,-6.6e-05,-5e-05,-0.009718,-0.02028,-0.004439,-4e-05,1e-06,4e-06,0.00091,0.033244,0.071081,0.019828,-6.5e-05,0.00189,0.018802,0.028997,0.009802
1.6e-05,0.000254,0.004539,0.003433,5.8e-05,1.4e-05,-7.8e-05,0.000344,0.001085,0.000107,3.8e-05,7e-06,3.1e-05,0.007134,0.019692,0.003995,2.9e-05,2e-06,4e-06,0.001132,0.071278,0.136983,0.028221,0.000319,0.024059,0.08335,0.125718,0.102646
1.5e-05,-2.4e-05,-0.000595,-0.00053,-1.3e-05,1.6e-05,-9e-06,-0.002891,-0.00302,-3.1e-05,5.4e-05,7e-05,4.7e-05,0.014178,0.034685,0.007581,5.8e-05,1e-06,0,0.000262,0.019066,0.018003,-0.002911,-4.1e-05,-0.00164,-0.022475,-0.094662,-0.066389
-5e-06,-0.000217,-0.00404,-0.003074,-3.9e-05,1.4e-05,-0.000246,-0.004036,-0.003018,-5.4e-05,2.6e-05,2.5e-05,-8e-06,0.002374,0.006464,0.002503,1.5e-05,0,-1e-06,0.000553,-0.018856,-0.06679,-0.020412,-0.000316,-0.021754,-0.054827,-0.041975,-0.0316
-1.8e-05,-7.7e-05,-0.00136,-0.000959,6e-06,1.4e-05,0.00019,0.00374,0.002995,3.9e-05,1.1e-05,7e-06,3.3e-05,-0.007035,-0.020839,-0.00468,-4e-05,2e-06,-2e-06,-0.000648,-0.039099,-0.056396,-0.006467,5.3e-05,-0.000165,0.00931,0.097604,0.081599
-1.1e-05,0.000129,0.002509,0.00196,3.8e-05,8e-06,0.000154,0.002296,0.001798,5.6e-05,1.8e-05,2e-06,4e-05,-0.006899,-0.019967,-0.005648,-4.1e-05,3e-06,0,-0.001094,-0.015751,0.00791,0.010885,0.000181,0.011167,0.002199,-0.056346,-0.03568
6e-06,0.000104,0.001956,0.001423,8e-06,-2e-06,-0.000217,-0.002477,-0.001326,3.4e-05,2.4e-05,-9e-06,-1.5e-05,-0.001385,-0.001477,-0.00076,1e-05,2e-06,4e-06,0.000378,0.030706,0.051311,0.008871,-5.3e-05,0.001759,0.003214,-0.058651,-0.064225
1.4e-05,-3.8e-05,-0.000907,-0.000803,-3.1e-05,-1.2e-05,9.9e-05,0.000603,-1e-04,-1.9e-05,9e-06,9e-06,-2.6e-05,0.00468,0.014276,0.00389,5.1e-05,-1e-06,-1e-06,0.000399,0.01818,0.015941,-0.003289,1.5e-05,-0.000214,0.033138,0.10788,0.067668
8e-06,-7.9e-05,-0.001648,-0.001218,-1.4e-05,-1.3e-05,-1.1e-05,-0.001714,-0.001987,-8.9e-05,-2.9e-05,0,1e-05,0.006144,0.017221,0.004846,3.5e-05,-3e-06,-5e-06,-0.00024,-0.008315,-0.010936,-0.003746,7.5e-05,-0.005562,-0.017563,-0.005102,0.01882
-8e-06,-1.5e-05,-0.000124,5e-05,1.3e-05,-1.1e-05,-0.000117,-0.000171,0.000476,-2.2e-05,-5.5e-05,-1.3e-05,1e-06,0.001054,0.003179,0.000883,-2.1e-05,-4e-06,-2e-06,-0.000186,-0.014933,-0.016123,0.001369,-3.4e-05,-0.006612,-0.036526,-0.097132,-0.079924
-1.2e-05,4.7e-05,0.001099,0.000843,5e-06,-9e-06,0.00016,0.004101,0.003566,4.5e-05,-4.3e-05,-3.4e-05,-2e-05,-0.005447,-0.016326,-0.004459,-4.7e-05,-3e-06,-2e-06,-0.000541,-0.02683,-0.038151,-0.001377,3.1e-05,0.005834,0.02354,0.06374,0.020562
-1e-06,2.1e-05,0.00035,0.000103,-2.3e-05,-8e-06,-8.7e-05,-0.002441,-0.002191,-3.2e-05,-1.1e-05,-4.9e-05,-2.7e-05,-0.005802,-0.017101,-0.004558,-1.8e-05,-1e-06,-4e-06,-0.000419,-0.011512,-0.022893,-0.005392,4.4e-05,0.009598,0.02405,0.045746,0.060336
