0.000282,4.8e-05,2.4e-05,2e-06,1.7e-05,6e-05,3.5e-05,1.4e-05,5e-06,4e-05,1.2e-05,2.3e-05,6e-06,2.4e-05,5e-06,8.6e-05,0.000171,0.000123,5.1e-05,9.2e-05,4.8e-05,0.000153,0.000847,0.000251,0.000372,0.000334,0.000342,0.000161,0.00058,0.000244,4e-05,0.000289,0.000559,0.000199,4.2e-05,0.000121,0.000229,0.000347,0.000103,0.000318,0.000511,0.000111,7.6e-05,4.5e-05,0.000185,0.000246,1.7e-05,0.000242,0.00034,0.00026,4.1e-05,0.000308,7.3e-05,0.000172,1.2e-05,0.000149,3e-06,5.8e-05,2.3e-05,3.9e-05,1.7e-05,5.4e-05,4e-05,5e-05,0.000102,8.3e-05,3.6e-05,2.9e-05,1.2e-05,3.6e-05,2.1e-05,4.5e-05,6e-06,1.7e-05,3.4e-05,0.000134,5.2e-05,1.4e-05,2.1e-05,4.5e-05,1.9e-05,3e-05,7e-06,1e-06,1.9e-05,8e-06,1e-05,2.1e-05,1.3e-05,2.3e-05,1.8e-05,1.5e-05,1.3e-05,1.9e-05,3e-06,1.2e-05,5e-06,3e-06,2.7e-05,1.2e-05,8.4e-05,1.1e-05,8e-06,3.7e-05,7e-06,1.3e-05,3e-06,4.2e-05,8e-06,4.5e-05,3.3e-05,1.1e-05,1e-05,3e-06,1.3e-05,6.2e-05,0.000276,9.1e-05,4e-06,0.000165,1.5e-05
0.000556,0.000215,0.00011,0.000129,1.7e-05,0.000138,3.7e-05,7e-06,1.2e-05,4.8e-05,7e-05,1.5e-05,3e-05,3.7e-05,1.7e-05,0.000202,0.000244,0.000618,0.000281,4e-04,0.000297,0.000489,0.001644,0.00251,0.001277,0.000804,0.001563,0.001041,0.000987,0.001208,0.000957,0.001142,0.000521,0.000126,0.000806,0.000578,0.000724,0.000453,0.000828,0.001587,0.00091,0.000807,0.000399,0.000559,0.000729,0.000281,0.000346,0.000411,0.000647,0.001234,0.000899,9.7e-05,0.000361,0.000133,5.8e-05,0.000289,0.000154,0.000119,9e-05,6.7e-05,6.4e-05,0.000102,2.1e-05,0.000224,0.000211,0.000268,0.000292,0.000131,8.5e-05,0.000103,5.6e-05,7.9e-05,5.8e-05,0.000125,2.8e-05,0.000284,0.00021,5.1e-05,2e-05,0.000145,6.7e-05,5.3e-05,5.7e-05,4.1e-05,5.9e-05,7e-05,3e-05,7.8e-05,1.4e-05,6e-05,4e-05,5.8e-05,1.7e-05,5.5e-05,5e-05,2.9e-05,9.8e-05,9.5e-05,4.9e-05,4.8e-05,0.000191,0.00014,0.00011,8.1e-05,3.8e-05,2.6e-05,4.7e-05,0.00014,7.5e-05,0.000101,0.000145,7.8e-05,5.2e-05,5.8e-05,9.3e-05,0.000142,0.000469,2e-04,0.000365,0.000265,7.3e-05
0.000815,0.000271,0.000136,0.000109,0.000149,8.3e-05,5.6e-05,5e-05,2e-05,3.2e-05,3.8e-05,4.5e-05,2.5e-05,5.8e-05,3.8e-05,0.000191,0.000119,0.000985,0.000427,0.000576,0.00064,5.4e-05,0.002625,0.004995,0.003414,0.001179,0.000142,0.000538,0.00148,0.001807,0.002371,0.001874,0.001255,0.001324,0.000362,0.000412,0.001107,0.000963,0.001488,0.002499,0.001286,0.000682,0.000584,0.000647,0.000778,0.000574,0.000303,0.000734,0.000357,0.001853,0.000692,0.000712,0.000158,0.000303,0.000544,0.000304,0.000134,0.00036,4.1e-05,6.6e-05,0.000133,0.000266,0.000244,0.000336,0.000666,0.000361,0.000254,0.000112,0.000175,4e-05,3.7e-05,8.6e-05,0.000129,8.1e-05,0.000131,0.000305,0.000434,0.000263,0.000104,8e-05,3.4e-05,9.3e-05,5.6e-05,3.3e-05,8.3e-05,5e-05,5.1e-05,0.000117,6.5e-05,9e-05,3.8e-05,3.7e-05,3.8e-05,3.9e-05,4.1e-05,5.4e-05,0.000136,0.000104,9.2e-05,4.6e-05,0.000206,0.000254,0.000137,0.000125,5.9e-05,3.2e-05,9.4e-05,0.000251,0.000314,0.000131,9.9e-05,0.000108,3.2e-05,6.3e-05,1e-04,0.000228,0.000545,0.00012,0.000616,0.000524,0.000256
0.00139,0.000416,0.000226,0.000147,8.6e-05,0.000189,6.9e-05,4.1e-05,4.5e-05,6.2e-05,2.2e-05,7e-06,4.9e-05,6.8e-05,3.9e-05,0.000186,0.00022,0.000892,0.00075,0.000964,0.00066,0.000498,0.003232,0.003741,0.000952,0.002218,0.001016,0.000409,0.001934,0.002994,0.001553,0.000444,0.001345,0.002065,0.001822,0.000432,0.000541,0.000573,0.001477,0.001814,0.000458,0.00067,0.000245,0.000818,0.001402,0.000775,0.000363,0.001195,0.00089,0.00173,0.000802,0.001067,0.000969,0.00093,0.000232,0.00057,0.000488,0.000582,0.00031,0.000158,7.8e-05,0.000187,9.4e-05,0.000566,0.001174,0.000372,0.000104,7.1e-05,1.8e-05,0.000108,0.000102,8e-05,0.000122,0.000136,0.000122,0.000357,0.000383,0.000197,0.000216,0.000119,0.000145,6.5e-05,2.8e-05,6.1e-05,5.4e-05,6.5e-05,7.9e-05,4.1e-05,4.3e-05,8.9e-05,5.2e-05,8.6e-05,2.4e-05,1.2e-05,6.1e-05,8.3e-05,4.2e-05,1.6e-05,7e-06,0.000118,0.00018,0.000112,0.000345,0.000327,0.000173,3.3e-05,0.000131,0.000215,0.000158,6.7e-05,3.3e-05,4.4e-05,8.2e-05,0.000109,2.8e-05,0.000237,0.000278,0.00036,0.000817,0.000459,0.000267
0.001813,0.000727,0.000301,9.3e-05,0.000113,6.5e-05,0.000105,4.8e-05,3.5e-05,2.8e-05,2.3e-05,1.9e-05,4.5e-05,2.6e-05,1.3e-05,0.000187,0.000582,0.000438,0.000174,0.000801,0.000486,0.000443,0.003274,0.003542,0.002409,0.001096,0.001015,0.000911,0.001359,0.001625,0.000441,0.000892,0.001234,0.002041,0.000782,0.001768,0.001117,0.000225,0.000821,0.002176,0.001131,0.000469,0.000302,0.000597,0.001281,0.000749,0.000405,0.000615,0.001892,0.002444,0.001494,0.00061,0.001038,0.000699,0.000213,0.000285,0.000396,0.000146,0.000269,0.000237,2.7e-05,0.000211,0.000371,0.000727,0.000476,0.000532,0.000361,0.000158,5.7e-05,8.1e-05,0.00016,0.000201,0.000135,0.000157,0.000148,0.000391,0.000219,0.000208,0.000267,0.000156,2e-04,0.000156,8.7e-05,5.6e-05,4.6e-05,7.1e-05,6.5e-05,1.8e-05,9.3e-05,3.4e-05,6.7e-05,5e-05,4.7e-05,1.3e-05,1.8e-05,3e-05,3.5e-05,2.9e-05,7.7e-05,0.000144,0.00029,2e-04,0.000474,7.9e-05,0.000207,0.000131,0.000157,0.000183,6.8e-05,0.000115,8.9e-05,1e-04,1e-04,0.000175,0.000137,0.000134,0.000491,0.000223,0.00049,0.000101,0.000463
0.002287,0.000226,8.5e-05,6.9e-05,0.000121,0.000185,0.000138,8.8e-05,4e-05,0.000119,7.1e-05,7.1e-05,4.7e-05,6.1e-05,8.2e-05,0.000214,0.000465,0.000223,0.000244,0.000723,0.000754,0.000251,0.00333,0.002705,0.001119,0.000883,0.000862,0.002151,0.002615,0.00237,0.001356,0.000488,0.000226,0.001978,0.001137,0.002019,0.001303,0.000653,0.00087,0.001725,0.001482,0.00055,0.000811,6.7e-05,0.001252,0.001468,0.001647,0.000775,0.000475,0.000964,0.000833,0.000571,0.000427,0.000615,0.000403,0.000549,0.00029,0.000415,3e-06,0.000109,4.1e-05,0.000162,0.000518,0.001074,0.000696,0.000398,0.000303,0.000242,0.000206,9.8e-05,5.9e-05,0.000134,4.7e-05,0.000165,0.000194,0.00134,0.000363,0.000221,0.000201,0.000253,8.8e-05,5e-06,0.000144,0.00024,0.000167,7.4e-05,8.7e-05,4.3e-05,7.1e-05,6.1e-05,6e-05,6.5e-05,3.4e-05,8.3e-05,0.000114,5.6e-05,8.2e-05,5.3e-05,0.000194,0.000292,0.000117,0.000226,5.5e-05,0.000255,0.000232,0.000286,0.000231,0.000269,0.00013,0.000114,0.000103,7.6e-05,0.000119,6e-05,5.3e-05,0.000233,0.000401,2.6e-05,0.000595,0.000501,0.000468
0.00252,0.001752,0.000901,0.000255,7.4e-05,0.000109,0.000177,9.7e-05,6.6e-05,0.000152,6.1e-05,6e-05,5.5e-05,5e-05,6.1e-05,9.9e-05,0.000773,0.00023,0.000163,0.000908,0.000483,0.000259,0.002822,0.002116,0.002234,0.002136,0.000974,0.003045,0.000229,0.003568,0.004641,0.002005,0.001995,0.001787,0.000606,0.002624,0.001336,0.001103,0.001562,0.002329,0.001482,0.000776,0.001135,0.000918,0.001482,0.000983,0.000956,0.001909,0.000428,0.003918,0.001456,0.000862,0.000523,0.001257,0.001131,0.000724,0.000112,0.000218,0.000329,0.000356,0.000255,0.000343,0.000274,0.000491,0.000355,0.000412,0.000144,0.000238,0.000151,0.000265,0.000269,0.000151,0.000134,0.000202,0.000201,0.002104,0.001504,0.000432,0.000152,0.000158,0.000103,6.9e-05,0.000157,0.000189,0.000112,0.000214,0.000142,0.000146,0.000134,4.1e-05,7.2e-05,3.4e-05,3.1e-05,6.4e-05,0.000153,6.8e-05,9.9e-05,3.2e-05,0.000201,0.000246,0.000427,0.000593,0.000243,3.9e-05,7.7e-05,0.000341,0.000241,0.000426,0.000358,0.000297,8.1e-05,9e-05,6.9e-05,9.2e-05,0.000172,0.000308,0.000437,0.000258,0.000795,0.001109,0.000567
0.002103,0.003458,0.001671,0.000496,7.2e-05,0.000128,0.000398,0.000185,5.7e-05,5.9e-05,6.6e-05,2.5e-05,4.2e-05,1.1e-05,6.8e-05,6.7e-05,0.001086,0.00074,0.000492,0.001562,0.001129,0.000383,0.002195,0.004109,0.001645,0.001826,0.002023,0.001597,0.003758,0.004284,0.002135,0.001998,0.002068,0.002499,0.000931,0.003051,0.001864,0.000241,0.003309,0.000819,0.000404,0.001133,0.001123,0.001053,0.001168,0.002131,0.001168,0.00211,0.003468,0.007053,0.00594,0.003806,0.001322,0.001629,0.000949,0.000436,0.000695,0.000108,0.000171,0.000287,0.000499,6e-05,0.00032,0.000493,0.000364,0.000534,0.000376,4.7e-05,7.8e-05,0.000225,3e-04,0.000172,0.000111,0.000205,0.000248,0.002612,0.002832,0.001604,0.000571,0.000211,8.6e-05,9.4e-05,8.8e-05,0.000282,0.000231,0.000219,0.000104,0.00011,7.8e-05,0.000111,4.7e-05,9e-05,7.6e-05,5e-05,9.8e-05,8e-05,7.5e-05,6.2e-05,0.000178,5.5e-05,0.00043,0.000839,0.000813,0.000416,0.000206,0.00029,0.000383,0.000563,0.000295,0.000201,0.000125,0.000107,5.1e-05,0.000188,0.000189,0.000283,0.00027,0.000126,0.000717,0.000962,0.001448
0.002021,0.004111,0.002038,0.000713,6.7e-05,0.000121,0.000452,0.000285,5.6e-05,1.8e-05,8.5e-05,7.4e-05,5.5e-05,4.2e-05,9.1e-05,4.8e-05,0.000785,0.000651,0.00084,0.001624,0.001184,0.000681,0.001878,0.003835,0.005553,0.004087,0.0032,0.002034,0.002752,0.000746,0.001358,0.000498,0.002634,0.000513,0.000554,0.002406,0.000986,0.000805,0.003381,0.003369,0.002137,0.001292,0.000632,0.000425,0.001181,0.002357,0.001415,0.001064,0.003045,0.0033,0.000928,0.001428,0.000876,0.000468,0.000266,0.000257,0.000225,0.00061,0.000249,0.000257,0.000164,0.000279,0.000153,0.000514,0.000556,0.000279,0.00023,3.1e-05,8.6e-05,0.000261,5.7e-05,4.8e-05,4.9e-05,5.1e-05,0.00019,0.002692,0.002128,0.000811,0.000261,0.000169,8.5e-05,2.5e-05,4.5e-05,0.000132,6.6e-05,0.000116,0.00011,1.3e-05,5.1e-05,8.5e-05,6.5e-05,8.5e-05,9.2e-05,7.4e-05,3.6e-05,8.7e-05,0.000112,4.6e-05,0.000105,2.9e-05,0.000383,0.000518,0.000366,0.000146,5.3e-05,0.00014,0.000158,0.000158,7.6e-05,5.8e-05,6.5e-05,3.6e-05,2.9e-05,0.000278,0.000341,0.000503,0.001136,0.000189,0.000369,0.001124,0.001481
0.001337,0.003083,0.001666,0.000562,2.9e-05,0.000199,0.000295,0.000108,3.3e-05,2.5e-05,8.2e-05,7.9e-05,5.5e-05,2.8e-05,5.7e-05,6.6e-05,0.000364,0.001189,0.000307,0.001422,0.000288,0.000421,0.001506,0.002365,0.003623,0.001082,0.000367,0.002016,0.001294,0.002091,0.001198,0.001562,0.002233,0.002334,0.000655,0.002188,0.001533,0.001292,0.002353,0.002914,0.001323,0.002361,0.001894,0.001055,0.000985,0.00133,0.000935,0.001359,0.000924,0.000765,0.001387,0.000341,0.000548,0.000306,0.000412,0.000188,7.2e-05,0.000395,0.000159,0.00021,4.8e-05,5.6e-05,0.000112,0.000341,0.000294,0.00019,0.000183,3.5e-05,8.3e-05,9.1e-05,6.4e-05,1.8e-05,5e-06,3.6e-05,9.5e-05,0.002423,0.001101,0.000463,2e-05,6e-05,2.8e-05,3.8e-05,3.4e-05,3.6e-05,2.9e-05,2.1e-05,6.1e-05,3.5e-05,5.6e-05,2.4e-05,1e-05,3.7e-05,5.6e-05,4.6e-05,3.9e-05,9.8e-05,7e-05,5.7e-05,4.1e-05,1.8e-05,0.000416,0.000144,0.000452,0.000378,0.00023,2.6e-05,0.00011,0.000166,6e-05,4.7e-05,9.9e-05,2.1e-05,7.4e-05,0.00025,8.6e-05,0.000282,0.001216,0.000716,7.8e-05,0.000797,0.000504
0.001034,0.001646,0.00093,0.000336,4e-05,0.000188,9.7e-05,5.2e-05,2e-05,1.8e-05,5.1e-05,1.5e-05,4.5e-05,4.1e-05,5.1e-05,1.7e-05,0.000475,0.000777,0.000485,0.000937,0.000482,0.000459,0.001477,0.001293,0.001768,0.002227,0.002011,0.001897,0.001719,0.002234,0.0026,0.001612,0.002561,0.001463,0.001979,0.00139,0.000197,0.001303,0.00204,0.002847,0.001312,0.001915,0.000562,0.000712,0.000478,0.000568,0.000276,0.001514,0.002031,0.001165,0.001267,0.000623,0.000498,0.000227,0.00039,0.000191,0.000314,0.000267,8e-05,0.000131,0.000111,0.000137,6.8e-05,0.000301,6e-05,8.3e-05,0.000144,1.2e-05,7.7e-05,0.000137,1e-05,4.2e-05,3.6e-05,6.3e-05,6.6e-05,0.00164,0.000698,0.000237,6.8e-05,2.7e-05,1.7e-05,5.7e-05,1.6e-05,6.5e-05,1.2e-05,2.6e-05,4e-05,5.6e-05,5e-05,4.1e-05,2.1e-05,4e-05,5.2e-05,4.8e-05,2.6e-05,7.1e-05,4.8e-05,2.4e-05,3.9e-05,7e-06,0.000473,0.000538,0.000534,0.000368,0.00018,0.000116,5.3e-05,0.000415,0.000477,0.000208,0.000129,0.000111,0.00013,0.00023,5.7e-05,0.000216,0.001746,0.001339,0.000834,0.000734,8.9e-05
0.000814,0.000503,0.000198,9.1e-05,2.5e-05,0.000165,7.2e-05,3e-05,1.5e-05,4.7e-05,3.3e-05,2.4e-05,3.3e-05,2.7e-05,1.8e-05,3.7e-05,0.001318,0.000944,0.000515,0.000683,0.000688,0.000629,0.00132,0.00174,0.00313,0.000509,0.001276,0.001838,9.9e-05,0.002242,0.000617,0.001574,0.002643,0.002764,0.001853,0.002001,0.001429,0.00067,0.001584,0.004091,0.001404,0.001717,0.001461,0.000484,0.000375,0.000291,0.000477,0.001287,0.000436,0.001263,0.00083,0.000643,0.000791,0.000257,0.000602,0.000303,2e-04,0.000384,6.6e-05,0.000174,0.000188,0.000202,2e-05,0.000265,0.000128,0.000105,0.00018,2.1e-05,6.4e-05,9.8e-05,2.7e-05,1.7e-05,3.2e-05,7.2e-05,4e-05,0.000831,0.00013,0.000158,9.6e-05,3e-05,4.4e-05,2.5e-05,1.6e-05,3.7e-05,4.7e-05,1.5e-05,6e-05,5.4e-05,5.9e-05,4.7e-05,1.8e-05,9e-06,2.4e-05,3.2e-05,3.6e-05,7.9e-05,4.6e-05,4.3e-05,2.4e-05,3.3e-05,0.000447,0.000339,0.000486,0.000299,8.4e-05,6.8e-05,7.2e-05,0.000598,0.000754,0.00043,0.000136,9.7e-05,1.9e-05,9.1e-05,0.000165,0.000146,0.0017,0.000579,0.000266,0.000341,0.00045
0.000824,1.5e-05,4.1e-05,3.3e-05,1.2e-05,0.000117,6.6e-05,2.6e-05,2.5e-05,4.2e-05,4.1e-05,4e-05,4.3e-05,3.1e-05,1.9e-05,1.5e-05,0.002916,0.001622,0.000553,0.001204,0.000367,0.000326,0.000708,0.001992,0.001014,0.000912,0.001928,0.000905,0.001553,0.002687,0.003182,0.001214,0.002461,0.004056,0.001588,0.002321,0.001322,0.001092,0.001611,0.002,0.002228,0.001714,0.001671,0.000343,0.000442,0.001545,0.001257,0.000848,0.000228,0.00021,0.000686,0.000632,0.00085,0.000296,0.000754,0.000207,0.000235,0.000254,0.000149,2.4e-05,0.000185,0.000248,0.000115,0.000336,0.000163,6.9e-05,0.000227,3.9e-05,7.2e-05,0.000147,5.5e-05,1.9e-05,5.4e-05,6.6e-05,3.1e-05,0.000153,0.00027,0.00011,6.8e-05,9.4e-05,6.5e-05,4.3e-05,6e-05,3.5e-05,1.8e-05,4e-05,4.3e-05,7.7e-05,4.6e-05,3.4e-05,4e-05,2.2e-05,3.4e-05,3.5e-05,4e-05,9.4e-05,3.7e-05,1.8e-05,3e-05,1.9e-05,0.000477,0.000324,0.00062,0.000363,0.000159,7.4e-05,0.000149,0.000846,0.00073,0.000264,3.4e-05,0.000112,8.3e-05,0.000108,5.4e-05,0.000151,0.00171,0.001815,0.000761,0.000391,0.000384
0.000927,0.000406,0.000224,0.000105,3.4e-05,8.8e-05,7.7e-05,2.5e-05,4.6e-05,2.9e-05,4e-05,3.8e-05,3.3e-05,3e-05,3.7e-05,6.3e-05,0.004201,0.001196,0.000399,0.001636,0.000763,0.000552,0.00044,0.001753,0.003531,0.002317,0.000548,0.000662,0.001305,0.005177,0.001225,0.00092,0.004011,0.00214,0.000295,0.002027,0.001039,0.000769,0.001907,0.004281,0.003672,0.001404,0.001147,0.001184,0.000532,0.001014,0.000796,0.001583,0.000482,0.001423,0.00153,0.00041,0.000627,0.000109,0.000957,0.00074,9.1e-05,0.000476,0.000164,3.1e-05,0.000228,0.000227,8.7e-05,0.000441,0.000237,8.4e-05,0.000183,0.000109,0.000157,0.000118,0.000183,8.8e-05,4.4e-05,0.000103,8e-05,0.000507,0.000339,0.000159,0.000111,4e-05,4.3e-05,0.000165,5.7e-05,8.4e-05,8.9e-05,9.2e-05,8.3e-05,8e-05,0.000116,6.1e-05,4.1e-05,5.1e-05,4.6e-05,3.8e-05,6.1e-05,0.000122,1e-04,2.1e-05,0.000103,4.6e-05,0.000473,0.000414,0.000692,0.000306,0.000123,7.9e-05,6.2e-05,0.001096,0.000823,0.000444,0.000118,0.000103,4.5e-05,7.1e-05,9.6e-05,0.000178,0.001243,0.000765,0.000363,0.000256,1e-04
0.00099,0.000931,0.000447,0.000121,1.3e-05,6.4e-05,0.000109,2.9e-05,5.4e-05,9.1e-05,4.7e-05,6.1e-05,6.4e-05,6e-05,2.8e-05,5.5e-05,0.004321,0.003532,0.002171,0.002434,0.001924,0.000599,0.00037,0.003039,0.004904,0.001329,0.002118,0.001832,0.001953,0.008045,0.006357,0.001576,0.00534,0.008386,0.003556,0.002091,0.001662,0.001794,0.00294,0.007029,0.001156,0.002233,0.002076,0.002216,0.00247,0.001365,0.002161,0.006033,0.002821,0.000771,0.001924,0.000987,0.002316,0.00126,0.000708,0.000451,0.000413,0.000354,0.00066,0.000304,0.00018,0.000583,0.000102,0.000405,0.001032,0.000744,0.000505,0.000116,0.000176,0.00023,0.000133,4.9e-05,0.000233,0.000174,2.6e-05,0.000814,0.000493,0.000203,6.9e-05,0.000161,7.2e-05,0.000174,8.5e-05,0.000133,6.7e-05,1.7e-05,0.000155,5.9e-05,0.000138,8.9e-05,6.3e-05,2.5e-05,6.2e-05,7.1e-05,5.6e-05,0.000189,9.7e-05,0.000105,0.000149,2.4e-05,0.000438,0.000227,0.000698,0.000431,0.000295,0.000129,9.5e-05,0.001527,0.000167,0.000213,0.000174,0.000187,0.000143,5.1e-05,6.8e-05,0.00022,0.000774,0.001515,0.000611,9.2e-05,0.000192
0.000903,0.000646,0.000344,9.2e-05,2.3e-05,6.1e-05,1e-04,0.000101,5.6e-05,3.1e-05,0.000107,5.8e-05,8.5e-05,4.4e-05,5.3e-05,0.000103,0.003671,0.004732,0.001399,0.00286,0.001508,0.000638,0.00047,0.006318,0.001053,0.004198,0.003315,0.006606,0.002047,0.006419,0.001113,0.00858,0.002855,0.010494,0.013732,0.002436,0.00189,0.003908,0.001614,0.004041,0.009585,0.006002,0.00267,0.0031,0.003543,0.006728,0.002994,0.00778,0.004598,0.00237,0.005237,0.002022,0.004451,0.001545,0.000599,0.00068,0.000829,0.000867,0.000303,0.000194,0.000414,0.000906,0.000632,0.001005,0.001936,0.000957,0.0011,0.00038,0.000208,0.000429,0.000361,0.000137,0.000325,0.000196,6.3e-05,0.000923,0.000442,0.000371,0.000177,0.000166,6.5e-05,0.000162,7.8e-05,0.000213,9.7e-05,5.9e-05,0.000356,0.00017,0.000155,6.7e-05,0.000193,0.000157,5.9e-05,0.000113,0.000203,0.000201,0.000227,9.1e-05,5.7e-05,0.000124,0.000598,0.000346,0.000244,0.000129,0.000221,9.6e-05,0.000121,0.001974,0.001663,0.000577,0.000259,0.000162,0.000132,0.000182,7.4e-05,0.000138,0.00036,0.002094,0.001069,0.000637,0.00018
0.000775,0.00024,0.00011,2.9e-05,3.1e-05,7e-05,5.8e-05,6.5e-05,3.7e-05,4.4e-05,6.8e-05,0.000126,1.2e-05,1.2e-05,5.3e-05,8.4e-05,0.003332,0.005917,0.004042,0.003091,0.00194,0.001299,0.000994,0.00776,0.008873,0.012021,0.012141,0.013956,0.011902,0.006957,0.007341,0.011674,0.013013,0.004543,0.005479,0.010199,0.005899,0.00465,0.003484,0.004346,0.010324,0.007834,0.00257,0.0041,0.001334,0.007064,0.002258,0.006708,0.009561,0.004114,0.006689,0.00573,0.007557,0.006292,0.002014,0.00155,0.002563,0.002467,0.001067,0.000525,0.000892,0.000751,0.001376,0.000604,0.001607,0.001058,0.001222,0.001183,0.001016,0.000225,0.000593,0.000634,0.000611,0.000522,0.000373,0.000682,0.000183,0.000442,0.000217,0.000225,0.000229,0.000255,0.000189,9e-05,3.2e-05,0.000119,0.00036,0.000743,0.000639,0.000479,0.000356,0.000401,0.000332,0.000298,0.000131,0.000435,0.000677,0.000478,4.7e-05,0.000127,0.000512,0.00038,0.000521,0.000205,0.000267,0.000305,0.00028,0.002466,0.002316,0.001455,0.000609,3.3e-05,0.000171,0.000328,0.000327,0.000155,0.001052,0.001984,0.001133,0.000786,0.000462
0.000543,0.000178,9.1e-05,9e-05,3e-05,9.3e-05,6.4e-05,1.5e-05,4e-06,4e-05,3.1e-05,6.2e-05,7.6e-05,4.5e-05,2.6e-05,0.00011,0.002838,0.004182,0.002261,0.002643,0.001026,0.000318,0.000575,0.005766,0.002408,0.006637,0.007635,0.002139,0.005721,0.004672,0.006373,0.003778,0.003978,0.003533,0.004116,0.008537,0.011532,0.013209,0.007945,0.001976,0.004154,0.006723,0.010761,0.012053,0.010567,0.003316,0.008073,0.000838,0.006382,0.005929,0.006063,0.003716,0.002257,0.003649,0.003638,0.002613,0.000752,0.002867,0.002317,0.000905,0.000832,0.001786,0.001736,0.001643,0.000833,0.000686,0.000664,0.000721,2e-05,0.000468,0.000604,0.000199,0.000482,0.000151,0.000127,0.000703,0.000469,0.000638,0.000377,0.000396,0.00033,0.000425,0.000371,0.000317,0.000196,0.000218,0.000459,0.000792,0.000275,0.000346,0.000234,0.000153,4.3e-05,0.000372,0.000511,0.000482,0.00033,0.00029,0.000393,0.000238,0.000522,0.000271,0.000182,0.000247,0.000163,0.000103,1.9e-05,0.002351,0.000956,0.00029,0.000203,0.000205,0.000278,0.000195,0.000103,0.000158,0.001168,0.000913,0.000263,0.000617,0.000508
0.000364,0.000291,0.000127,3.5e-05,3.6e-05,8e-05,6.4e-05,6.7e-05,7e-06,2.7e-05,5e-05,4.7e-05,5.4e-05,1.3e-05,2.9e-05,0.000135,0.002026,0.001172,0.000442,0.001567,0.000787,0.000219,0.000865,0.001347,0.004119,0.001912,0.002495,0.002835,0.003388,0.005751,0.007382,0.004474,0.001421,0.002154,0.001421,0.004002,0.004132,0.002644,0.004878,0.005012,0.003621,0.0051,0.007187,0.005593,0.00624,0.007473,0.00968,0.006221,0.003012,0.001797,0.00345,0.003201,0.003115,0.000823,0.001342,0.000352,0.001145,0.000962,0.001161,0.000813,0.000662,0.000983,0.000268,0.000409,0.000914,0.000178,0.000352,0.000202,0.000299,0.000238,0.000246,0.000186,3e-04,0.000157,0.000269,0.000712,0.00023,0.000238,0.00014,0.000237,0.000125,0.000274,0.000302,0.000238,0.000186,3.8e-05,0.00022,0.000337,0.000352,0.000259,0.000104,6.6e-05,0.000147,0.000297,0.000188,0.000237,0.000116,0.00013,0.000151,7.2e-05,0.000382,9.4e-05,5.4e-05,0.000152,0.000235,0.000178,0.000145,0.001918,0.001318,0.000407,7e-05,7.7e-05,6.7e-05,8.6e-05,0.000172,3.1e-05,0.000899,0.002068,0.001723,0.000543,0.000146
0.00018,0.00051,0.000242,8.3e-05,3.7e-05,8.4e-05,6.4e-05,1.9e-05,4.6e-05,2.7e-05,4.2e-05,6.6e-05,3.2e-05,1.5e-05,7e-06,0.000103,0.001329,0.00058,0.000162,0.001026,0.00063,0.000342,0.001234,0.001642,0.002614,0.00159,0.000976,0.001821,0.002458,0.002753,0.001052,0.000979,0.00132,0.001329,0.002157,0.001307,0.002406,0.002482,0.005278,0.005133,0.003494,0.003156,0.00271,0.001201,0.003248,0.002316,0.003201,0.001279,0.0015,0.003272,0.001768,0.000739,0.00103,0.000856,0.001282,0.000859,0.000797,0.000631,0.000651,0.000195,0.000526,0.000172,0.000305,0.000454,0.000472,0.000351,0.000155,3.2e-05,8e-05,0.000207,0.000213,8.9e-05,0.000215,0.000231,0.000335,0.000291,9.3e-05,8.2e-05,3.8e-05,0.000106,0.000102,9e-05,0.000206,0.000206,9.1e-05,1.8e-05,9.4e-05,0.000182,0.00023,9.8e-05,0.000109,9.5e-05,0.000127,8.4e-05,3.3e-05,0.000122,0.000134,9.6e-05,8.5e-05,5.4e-05,0.000322,0.000151,0.000299,4.8e-05,0.000115,0.000108,0.000194,0.001342,0.000939,0.000417,0.000124,0.000114,5.6e-05,5.3e-05,0.000185,0.000157,0.000578,0.001642,0.00156,0.001494,0.000656
0.00011,0.000313,0.000194,7.2e-05,1e-05,8.9e-05,9.3e-05,7.3e-05,4.6e-05,3.7e-05,1.1e-05,5.6e-05,5.5e-05,4.1e-05,4e-05,6.5e-05,0.001403,0.000739,0.000329,0.000989,0.000848,0.000175,0.001086,0.001712,0.000714,0.002533,0.001424,0.00121,0.001924,0.001208,0.00067,0.001196,0.00069,0.000663,0.002044,0.00109,0.000719,0.002376,0.002128,0.002788,0.000403,0.001902,0.002607,0.001623,0.000415,0.002041,0.002271,0.001916,0.000667,0.001692,0.000728,0.000728,0.000782,5.3e-05,0.000377,0.000222,0.000505,0.000729,9e-05,0.000282,0.00032,0.000261,0.000243,0.000208,5.7e-05,0.000117,0.000302,0.000134,0.000169,6.9e-05,7.8e-05,0.000111,0.000173,7.4e-05,8.6e-05,0.000455,0.000259,0.000143,3.5e-05,0.000124,7.3e-05,0.000153,3.7e-05,5.8e-05,6.7e-05,5.1e-05,0.000105,7.8e-05,8.3e-05,5.1e-05,6.9e-05,5.4e-05,2.2e-05,3.7e-05,3.4e-05,5.4e-05,0.000103,4.6e-05,3.6e-05,4e-06,0.000267,0.000171,0.000141,0.000158,3.1e-05,0.00013,6.8e-05,0.000738,0.000262,0.000215,0.000112,4.3e-05,4.1e-05,7.2e-05,0.000123,8.1e-05,0.000452,0.000554,0.000641,0.000466,0.00026
0.000152,6.8e-05,9.4e-05,6.2e-05,2.9e-05,7.6e-05,8.6e-05,7.5e-05,4.9e-05,5e-06,6e-06,2.1e-05,2.2e-05,1.3e-05,3.1e-05,6.4e-05,0.001095,0.000141,0.000184,0.000957,0.000565,0.000278,0.000921,0.001301,0.001347,0.001393,0.000549,0.000455,0.002548,0.00182,0.000857,0.000584,0.000387,0.000681,0.000843,0.000421,0.001366,0.001111,0.001866,0.001,0.001171,0.00118,0.001084,0.001076,0.001287,0.001018,0.001827,0.000613,0.000142,0.000402,0.000387,1e-04,0.000532,8e-05,0.000448,0.000157,0.000357,0.000381,3e-05,0.000146,0.000164,0.000195,0.000196,0.000221,0.000198,6.1e-05,0.000234,0.000113,7.3e-05,6.7e-05,7.6e-05,0.000127,7.7e-05,6.4e-05,6.5e-05,0.000471,0.000106,6.8e-05,6.1e-05,5.9e-05,4.4e-05,8e-05,4.3e-05,1.7e-05,4.5e-05,2.4e-05,5.3e-05,8e-05,3.4e-05,7.3e-05,6.2e-05,2.4e-05,2.4e-05,6.8e-05,1.6e-05,4.1e-05,4e-05,4.9e-05,3e-05,1.8e-05,0.000247,6.1e-05,8.8e-05,3.4e-05,2.5e-05,4.2e-05,0.000105,8e-05,0.000103,4.6e-05,7.1e-05,5.1e-05,6.8e-05,3.1e-05,0.000116,3.5e-05,0.000478,0.000523,0.000478,0.000717,0.000441
9.3e-05,5.7e-05,2.1e-05,7e-06,1.1e-05,3.7e-05,1.4e-05,1.8e-05,7e-06,4e-06,9e-06,6e-06,6e-06,2e-06,1.9e-05,4.2e-05,0.000245,2.3e-05,2.5e-05,0.000448,0.000323,0.000162,0.000379,0.000654,0.000482,0.00066,0.000351,0.000148,0.000811,7.4e-05,0.000238,0.000393,0.000407,7.6e-05,0.000402,0.00017,0.000356,0.00048,0.000703,0.000178,0.000369,0.000281,0.000631,0.000742,7e-04,0.000577,0.000307,0.000511,0.000151,0.00025,0.000335,0.000185,0.000239,0.000136,0.000124,9e-06,0.000168,0.00011,4.8e-05,3.1e-05,3.6e-05,7.3e-05,3.5e-05,8.2e-05,6e-05,4e-05,9.3e-05,2.8e-05,1.7e-05,5e-05,2e-05,2.3e-05,1.8e-05,2.8e-05,3.5e-05,0.000188,6.8e-05,3.2e-05,9e-06,3.2e-05,2e-05,1.4e-05,2e-05,4e-06,1.6e-05,2.3e-05,3.1e-05,2.3e-05,1.4e-05,2e-05,2.7e-05,7e-06,1.6e-05,2.4e-05,1.3e-05,3.7e-05,2.7e-05,1.5e-05,9e-06,6e-06,0.000115,4.6e-05,3.3e-05,7e-06,1.5e-05,4.2e-05,4.2e-05,0.000154,9.6e-05,5.7e-05,5.1e-05,2.5e-05,8e-06,2.2e-05,2.1e-05,9e-06,2e-04,0.000315,0.000105,0.000308,0.00014
0.000103,6.7e-05,2.9e-05,1.8e-05,1.5e-05,1.1e-05,1.4e-05,1.9e-05,1e-05,1.2e-05,1.1e-05,1.7e-05,1.8e-05,9e-06,1.7e-05,2.3e-05,0.000259,6.2e-05,5e-05,0.00037,9.8e-05,6.7e-05,0.000429,0.000438,0.00054,0.000731,0.00024,0.000242,0.000715,0.000302,0.000543,9.6e-05,0.000389,0.000191,0.000422,4.9e-05,0.000288,0.000505,0.000544,0.000368,0.000149,0.000119,0.000187,0.000397,0.000331,0.000513,0.000312,0.000412,0.000247,0.000289,0.000344,0.000117,0.000309,3.7e-05,8.2e-05,4.2e-05,0.000142,9e-05,3.4e-05,3.4e-05,5e-05,0.000107,5.9e-05,4.6e-05,5.6e-05,1.6e-05,8.7e-05,1e-05,1.6e-05,3.9e-05,1.8e-05,2.5e-05,2.3e-05,1.9e-05,2.2e-05,0.000128,3.3e-05,1.4e-05,1e-05,2.8e-05,7e-06,2.4e-05,8e-06,9e-06,1e-05,1.9e-05,1.4e-05,6e-06,2.2e-05,2.1e-05,1.5e-05,1.1e-05,9e-06,2.5e-05,1.1e-05,2.4e-05,2.2e-05,1.5e-05,7e-06,3e-06,9.9e-05,3.6e-05,6e-05,4.5e-05,1.8e-05,2.3e-05,3e-05,0.000235,0.000102,7e-05,7e-06,2.5e-05,2.6e-05,1.7e-05,1.2e-05,2.4e-05,0.000128,0.000269,6.5e-05,0.000247,0.000126
9.6e-05,1.2e-05,3.7e-05,1.5e-05,1.7e-05,1.6e-05,1e-05,1.5e-05,1e-06,9e-06,1.1e-05,2e-06,1.4e-05,4e-06,2e-06,2.5e-05,0.000269,0.000162,4.6e-05,0.000317,0.000128,5.7e-05,0.000436,0.000207,1.6e-05,0.000552,0.000443,0.000222,0.000573,0.000206,0.000503,0.000232,0.000259,0.000143,0.000317,0.00012,0.000385,0.000273,0.000316,0.000408,0.000226,0.000313,0.000304,0.000365,0.000283,0.000289,0.000422,0.000198,0.000153,7.8e-05,0.000382,0.000181,0.000291,8.9e-05,0.000128,7.5e-05,0.000153,6.3e-05,2.9e-05,1e-05,5.3e-05,9.2e-05,4.1e-05,6.5e-05,4.3e-05,3e-05,4.3e-05,4e-06,2.6e-05,3e-05,4e-06,2.9e-05,7e-06,7e-06,1.2e-05,0.000114,3.8e-05,2.6e-05,7e-06,2.4e-05,2.2e-05,2.3e-05,1e-05,1.4e-05,1.6e-05,6e-06,1.9e-05,1.4e-05,2.1e-05,1.5e-05,8e-06,4e-06,9e-06,2.5e-05,8e-06,2.2e-05,2.6e-05,1.7e-05,1.2e-05,6e-06,8.2e-05,2.2e-05,2.7e-05,4e-06,1.4e-05,1.8e-05,3.6e-05,0.000233,0.000159,9.5e-05,2.9e-05,2.8e-05,1.3e-05,7e-06,8e-06,1.2e-05,9e-05,0.00013,5.2e-05,0.000219,0.000111
8.2e-05,2.7e-05,1.6e-05,6e-06,1.3e-05,1.9e-05,7e-06,8e-06,7e-06,2e-06,3e-06,7e-06,5e-06,1e-06,1.3e-05,3.1e-05,0.000245,0.000193,6.5e-05,0.000197,3.5e-05,3.4e-05,0.000403,0.000436,0.000507,0.000387,0.000175,0.000215,0.000346,0.000209,0.000334,0.000314,0.000128,0.000231,0.000158,8.2e-05,8.9e-05,0.000209,0.000402,7.9e-05,0.000425,0.000413,0.000192,0.000274,0.000413,0.000442,0.00036,0.00035,0.00012,0.000118,0.000128,0.000115,0.000309,6.2e-05,9.5e-05,7e-06,0.000134,5e-05,5e-05,3.2e-05,4.3e-05,8.8e-05,3.6e-05,4.3e-05,3.6e-05,1.9e-05,2.5e-05,3.1e-05,3.8e-05,3.3e-05,5e-06,2.9e-05,9e-06,2.1e-05,1.7e-05,0.000113,2.6e-05,3.4e-05,2.5e-05,1e-05,4e-06,8e-06,1.4e-05,1e-05,5e-06,2e-06,1.8e-05,1.1e-05,2e-05,1.5e-05,1.6e-05,3e-06,8e-06,2.4e-05,1.3e-05,2.6e-05,2e-05,2.1e-05,2e-05,1.2e-05,7.8e-05,2.8e-05,1.1e-05,9e-06,1.2e-05,2.3e-05,1.1e-05,0.000148,9.8e-05,5.7e-05,2.7e-05,1e-05,2.4e-05,6e-06,1.1e-05,8e-06,7.8e-05,0.000121,9.4e-05,0.000169,0.000109
6.1e-05,3.2e-05,2.6e-05,1.5e-05,2e-06,2.4e-05,9e-06,6e-06,1.1e-05,1.1e-05,2e-06,1.2e-05,6e-06,3e-06,1.2e-05,1.7e-05,0.000192,9.5e-05,7.8e-05,9.5e-05,7.7e-05,3.5e-05,0.000333,0.000448,0.000426,0.000292,0.000397,0.000541,0.000874,0.000419,8.8e-05,0.000269,0.000112,1e-05,0.000179,0.000224,0.000364,0.000104,0.00038,0.000334,0.000123,0.000323,0.000268,0.000358,0.000362,0.000592,0.000366,0.00038,0.000341,0.000322,0.000173,0.000115,0.00017,9.2e-05,6.7e-05,6e-05,9.5e-05,4e-05,5.7e-05,1.6e-05,4.3e-05,4.3e-05,4.4e-05,4.4e-05,1.6e-05,2.7e-05,2.1e-05,2.4e-05,2.3e-05,1.1e-05,1e-05,1.8e-05,8e-06,2.6e-05,2.5e-05,9.8e-05,1.8e-05,2e-05,4e-06,1.9e-05,1.3e-05,1e-05,1e-06,8e-06,5e-06,1.1e-05,1.9e-05,1.1e-05,9e-06,2.2e-05,1.4e-05,1.4e-05,8e-06,2.4e-05,2e-06,2.1e-05,2e-05,1.7e-05,3e-06,8e-06,8.1e-05,1.3e-05,2.8e-05,2.5e-05,2.5e-05,1.3e-05,1.3e-05,0.000118,9.7e-05,1.8e-05,1.6e-05,6e-06,1.3e-05,1.3e-05,8e-06,1.2e-05,6.9e-05,7.3e-05,7.9e-05,6.5e-05,4.1e-05
3.9e-05,6e-05,1.9e-05,1.5e-05,1.5e-05,2.4e-05,4e-06,9e-06,1.3e-05,1.6e-05,1.5e-05,1.7e-05,4e-06,9e-06,8e-06,2e-05,0.000198,2.5e-05,2.9e-05,8.9e-05,6e-06,7.3e-05,0.000258,0.00012,0.000345,0.000182,0.000158,0.000408,0.000491,0.000148,3.6e-05,0.000214,0.000108,6e-05,0.000228,4e-04,4.2e-05,0.000218,0.000583,0.000539,0.000212,0.00042,0.000206,0.000227,0.000128,0.000193,0.000446,0.00036,0.000418,1.3e-05,0.000192,0.000175,0.000228,5.5e-05,4.1e-05,4.8e-05,9.1e-05,6.7e-05,4.3e-05,6e-05,1.9e-05,4.2e-05,5.2e-05,7.2e-05,3.6e-05,2.2e-05,4.1e-05,2.5e-05,8e-06,1.9e-05,5e-06,3.1e-05,1.1e-05,8e-06,1.9e-05,9.8e-05,2.9e-05,5e-06,2e-05,2.4e-05,2.1e-05,2.1e-05,1.2e-05,1.4e-05,9e-06,1.9e-05,1.4e-05,1.6e-05,1.3e-05,1.7e-05,1e-06,1.1e-05,9e-06,1.6e-05,1e-05,1.7e-05,3e-05,1.3e-05,5e-06,1.5e-05,6.6e-05,3.5e-05,3.6e-05,3.7e-05,8e-06,8e-06,1e-05,0.000143,0.000133,7.2e-05,1.9e-05,2e-05,1.8e-05,1.4e-05,1.4e-05,1.1e-05,2.8e-05,0.000229,0.000143,0.000137,7.7e-05
1.8e-05,9e-06,1.9e-05,1.3e-05,5e-06,3.3e-05,2.3e-05,2e-05,1.9e-05,1.1e-05,1e-05,9e-06,3e-06,1.3e-05,1e-05,2.6e-05,0.000186,0.000111,7.4e-05,0.00016,2.5e-05,7.5e-05,0.000396,0.000167,0.000334,0.000466,6.5e-05,0.000386,0.000507,0.000311,0.000531,0.000133,0.000239,0.000107,0.000178,0.000282,0.000241,0.000299,0.000469,0.000146,3e-04,0.000518,0.000548,5e-04,0.000337,0.000105,0.00031,0.000407,7.3e-05,0.000305,0.000156,0.000182,0.000148,0.00015,6.7e-05,4.4e-05,0.000109,4e-05,6.2e-05,5.7e-05,7.8e-05,9.6e-05,6.6e-05,3.6e-05,4.4e-05,5e-05,5.3e-05,2.1e-05,5.5e-05,2.8e-05,1.7e-05,3.2e-05,1e-05,2.5e-05,9e-06,0.000119,6e-06,3.2e-05,1e-05,6e-06,1.4e-05,1e-05,1.4e-05,1.1e-05,1e-05,1.7e-05,2.8e-05,1e-05,2.7e-05,2.2e-05,2.7e-05,2.3e-05,1.6e-05,2e-06,2.1e-05,1.9e-05,2.5e-05,1.7e-05,2e-05,6e-06,6.6e-05,1.7e-05,5.1e-05,3.8e-05,1.1e-05,9e-06,1.3e-05,0.00017,0.000146,8.9e-05,2.2e-05,1.2e-05,3e-06,1.4e-05,3e-05,8e-06,6.7e-05,0.000155,0.000139,0.000131,5.7e-05
9e-06,5.5e-05,3.7e-05,1.5e-05,1.2e-05,3e-05,2.4e-05,6e-06,6e-06,1.2e-05,1e-05,4e-06,1.1e-05,1.5e-05,1.6e-05,1.6e-05,6.2e-05,0.000183,9.1e-05,0.000241,9.7e-05,0.000109,0.000309,0.00024,0.000708,0.000179,0.000148,0.000366,0.000411,9.5e-05,0.000575,0.000291,0.000178,0.00012,0.00012,0.000239,8.4e-05,0.000249,0.000195,0.000234,0.000218,0.000515,0.000209,0.000244,0.000376,0.000251,0.000374,0.000245,0.000112,0.000233,0.00027,0.000186,0.000294,0.000238,2.4e-05,3.6e-05,7.7e-05,5.8e-05,6.3e-05,3.8e-05,2.4e-05,9e-05,4.9e-05,6.2e-05,1.2e-05,3.1e-05,5.2e-05,2e-05,5.5e-05,4.4e-05,5.8e-05,5.6e-05,3.8e-05,4.5e-05,2.5e-05,9.6e-05,4.2e-05,3.9e-05,1.8e-05,1.5e-05,2e-05,2.2e-05,2e-05,2e-05,1.7e-05,3.1e-05,1.2e-05,5e-06,2.1e-05,2.1e-05,2.8e-05,2.3e-05,1.5e-05,4e-06,3.3e-05,2.6e-05,1.1e-05,1.3e-05,1.6e-05,2.1e-05,6.9e-05,2.9e-05,1.8e-05,1.8e-05,7e-06,2.2e-05,2.4e-05,0.00016,8.2e-05,2.7e-05,1.2e-05,9e-06,6e-06,2.5e-05,1.5e-05,9e-06,0.000118,0.000138,0.000172,0.000216,0.000101
2.9e-05,3.3e-05,5e-06,1e-05,1.3e-05,3e-05,1.7e-05,1.9e-05,7e-06,1.6e-05,1.4e-05,7e-06,1.3e-05,3e-06,3e-06,2.3e-05,0.000111,0.000102,3.3e-05,0.00019,5.1e-05,6.6e-05,0.000305,0.000364,0.000732,0.000184,6.8e-05,0.000314,0.000505,0.000369,0.000177,0.000123,6.4e-05,0.000203,0.000228,0.000215,0.000196,0.000263,0.000149,0.000162,0.000266,0.000472,0.00037,0.000272,0.000377,0.000259,0.000182,0.000501,0.000183,0.000102,0.000217,0.000371,0.000155,0.000109,0.000186,0.000118,9.2e-05,5.5e-05,8.1e-05,4.3e-05,3.9e-05,8.9e-05,1.8e-05,3.1e-05,3.8e-05,3e-05,3.3e-05,1.8e-05,4.7e-05,4.2e-05,2.5e-05,1.1e-05,4.2e-05,2.2e-05,2.9e-05,7.4e-05,3.9e-05,2e-05,1.5e-05,2.7e-05,5e-06,9e-06,7e-06,2.1e-05,5e-06,1.5e-05,1.9e-05,7e-06,1e-06,1.3e-05,3e-06,1.6e-05,2.3e-05,1.4e-05,1.4e-05,3e-06,1.8e-05,1.2e-05,1.1e-05,9e-06,5.6e-05,3.3e-05,3.8e-05,3.5e-05,1.1e-05,2.6e-05,9e-06,0.000133,4.3e-05,3.9e-05,5e-06,1.9e-05,9e-06,2.9e-05,1.9e-05,1.3e-05,0.000133,0.000107,9.3e-05,0.000151,4.9e-05
4.8e-05,3.8e-05,8e-06,1.5e-05,5e-06,1.4e-05,8e-06,1.5e-05,8e-06,6e-06,6e-06,1.6e-05,1.4e-05,6e-06,6e-06,2.4e-05,0.000197,9.4e-05,0.000107,0.000162,8.6e-05,5.6e-05,0.000265,0.000528,0.000193,0.000345,9.7e-05,0.000246,0.000302,0.000218,7.4e-05,0.000198,0.000127,0.000173,4.8e-05,8.4e-05,7.4e-05,0.000231,0.000181,0.000109,0.000107,0.000387,0.000193,0.000158,0.000396,0.000129,6.7e-05,0.000236,0.000175,0.000141,0.000106,0.000228,6.8e-05,6.9e-05,0.00011,3.4e-05,0.000117,2.9e-05,9.2e-05,6e-05,6.6e-05,4.6e-05,4.7e-05,3e-05,3.2e-05,4.5e-05,5.1e-05,5.8e-05,1.2e-05,4e-06,2.5e-05,1.6e-05,3.3e-05,2.4e-05,3.9e-05,0.000115,2.8e-05,1.8e-05,2.7e-05,1.1e-05,8e-06,1e-06,8e-06,1.9e-05,3e-05,1.3e-05,1.3e-05,1.8e-05,2e-06,1.7e-05,6e-06,7e-06,2.1e-05,9e-06,4e-06,1.7e-05,1.8e-05,2.2e-05,9e-06,5e-06,4.2e-05,1.8e-05,5e-05,3.6e-05,1e-06,3e-05,2.5e-05,7.7e-05,7.7e-05,3.7e-05,3.7e-05,8e-06,1.5e-05,1e-05,2e-06,1.1e-05,9.6e-05,9.6e-05,1e-04,0.000191,0.000105
5.5e-05,5.1e-05,3.7e-05,2.1e-05,1.1e-05,1.4e-05,1.6e-05,1.7e-05,1.5e-05,1.2e-05,6e-06,1.5e-05,1.2e-05,6e-06,9e-06,1.7e-05,0.000172,7.9e-05,7.4e-05,0.000114,0.00014,0.000133,0.000181,0.000217,0.000378,0.00033,0.000146,0.000149,0.00027,0.000182,0.000253,0.000141,0.000128,8.4e-05,0.000135,1.6e-05,0.000157,0.000176,0.00014,0.000146,0.000209,0.000311,0.000276,0.000154,0.000407,0.000255,8.8e-05,0.00029,0.000196,0.000385,0.000267,0.00018,0.000174,7.2e-05,3.4e-05,2.4e-05,0.00017,0.000102,1.1e-05,1.1e-05,5.4e-05,7.8e-05,3.8e-05,6e-06,5.9e-05,4.9e-05,3.9e-05,4.2e-05,3.5e-05,3.2e-05,1.8e-05,1.8e-05,2.1e-05,4e-06,1.9e-05,1e-04,1.7e-05,3.3e-05,2.4e-05,6e-06,1.2e-05,1.3e-05,9e-06,1.1e-05,3.3e-05,1.4e-05,2.6e-05,1e-05,5e-06,1.1e-05,5e-06,1.8e-05,4e-06,1e-05,9e-06,2.7e-05,2.5e-05,1.7e-05,1.8e-05,6e-06,4.9e-05,5.1e-05,6.5e-05,3.5e-05,2.9e-05,4.1e-05,4.5e-05,3.6e-05,1e-04,3.9e-05,3.8e-05,3.8e-05,2.2e-05,1.2e-05,1.2e-05,2.1e-05,3e-05,0.000157,7.8e-05,0.00011,0.000125
5.8e-05,9e-06,1.1e-05,1.4e-05,1e-06,7e-06,1.6e-05,8e-06,7e-06,1.4e-05,4e-06,1.1e-05,1.4e-05,1e-05,8e-06,1.2e-05,5.3e-05,7.6e-05,0.000104,1.2e-05,0.000143,0.000107,0.000157,0.00025,0.000348,0.000298,0.000227,0.000119,0.000195,0.000214,0.00032,8e-05,8.7e-05,0.000236,8.1e-05,2.4e-05,6.9e-05,0.000162,0.000363,0.000387,8e-06,0.000217,0.000189,0.000224,0.000303,0.000167,0.00014,0.000298,2.8e-05,0.000342,0.000177,0.000199,0.000111,7.9e-05,2.3e-05,5.5e-05,0.000104,5e-06,6e-06,3.4e-05,3.8e-05,1.9e-05,2.6e-05,1.8e-05,3.5e-05,3.4e-05,4.7e-05,2.6e-05,1.1e-05,3.5e-05,1.2e-05,2e-06,2.3e-05,1e-06,2.4e-05,9e-05,3.1e-05,3.1e-05,1.4e-05,2e-05,1e-05,2.1e-05,3e-06,6e-06,2.7e-05,1.7e-05,3e-05,8e-06,1e-05,7e-06,1.1e-05,1.4e-05,1.5e-05,1.5e-05,5e-06,1.6e-05,9e-06,1.2e-05,1.6e-05,1.6e-05,3.5e-05,5.2e-05,4.1e-05,4.1e-05,7e-06,2.1e-05,4.8e-05,5.4e-05,0.000122,6.1e-05,4.8e-05,2.1e-05,1.6e-05,1.1e-05,2.5e-05,3.1e-05,6e-06,0.000292,0.000207,0.000195,0.000192
4.9e-05,2e-05,3.1e-05,1.5e-05,9e-06,7e-06,1.1e-05,7e-06,1.2e-05,1e-05,6e-06,3e-06,1.4e-05,4e-06,4e-06,2.7e-05,5.2e-05,0.00013,4.9e-05,0.000107,9.8e-05,6.8e-05,0.000261,0.000219,0.000441,0.000236,0.000111,0.000149,0.000205,9.6e-05,0.000261,0.000128,0.000143,0.000281,0.000197,1.4e-05,0.000115,0.000122,0.000424,0.000115,0.000212,0.000132,0.000219,0.000277,0.000222,0.00013,0.000173,0.000266,0.000158,0.000127,0.000127,8.5e-05,0.000126,4.9e-05,6.7e-05,1.4e-05,3.1e-05,6e-05,1.4e-05,3.9e-05,5e-05,6.4e-05,4.9e-05,3.2e-05,1e-05,4.7e-05,2.4e-05,1.2e-05,1.1e-05,2.8e-05,1.1e-05,2.2e-05,2.5e-05,8e-06,1.4e-05,8.3e-05,2.4e-05,1.5e-05,1.8e-05,6e-06,1.7e-05,1.1e-05,1.4e-05,1.4e-05,7e-06,1.1e-05,7e-06,1.3e-05,2e-06,2e-05,2e-05,1.6e-05,9e-06,8e-06,5e-06,1.2e-05,8e-06,9e-06,7e-06,5e-06,3.5e-05,1.9e-05,3.9e-05,6e-06,2.8e-05,2.1e-05,4.7e-05,7e-06,9.6e-05,7.3e-05,5.1e-05,1.4e-05,1.4e-05,6e-06,1.8e-05,1e-05,1.9e-05,0.000208,0.000143,9.7e-05,0.00013
3.9e-05,1.5e-05,3.4e-05,1.5e-05,5e-06,3e-06,1e-05,4e-06,1.7e-05,3e-06,2e-06,5e-06,1e-05,1e-05,6e-06,2.3e-05,0.000101,0.000186,0.000106,0.000114,0.000112,5.9e-05,0.000233,0.000309,0.000901,0.000616,0.000222,0.000191,0.000202,3.4e-05,0.000325,0.000118,0.000126,0.000107,5.1e-05,4.5e-05,9.6e-05,0.000138,0.000402,0.000155,3.8e-05,7e-05,0.000219,0.000243,0.000225,0.00014,0.000216,4.5e-05,0.000142,0.000112,0.000214,0.000203,0.00012,4e-05,0.000101,9.2e-05,0.000105,8.2e-05,4.9e-05,1.6e-05,2.5e-05,7.5e-05,4.2e-05,1.9e-05,4.3e-05,4.6e-05,3e-05,7e-06,4e-06,3.1e-05,4.2e-05,1.1e-05,2e-05,2.5e-05,1.2e-05,9.7e-05,7e-06,6e-06,1.6e-05,2.4e-05,2e-05,9e-06,1.5e-05,1.8e-05,2.8e-05,9e-06,8e-06,1.1e-05,1.1e-05,1.2e-05,3e-06,9e-06,5e-06,6e-06,9e-06,1.9e-05,1e-05,1.5e-05,1.6e-05,1.1e-05,2.2e-05,1.9e-05,5.1e-05,3e-05,2.8e-05,2.5e-05,5.5e-05,5.4e-05,8.1e-05,5e-05,8e-06,1.1e-05,7e-06,1.3e-05,1.6e-05,1.3e-05,3.7e-05,9.9e-05,1.2e-05,8.4e-05,5.7e-05
2.6e-05,2e-05,4e-06,5e-06,5e-06,6e-06,6e-06,8e-06,2e-05,1.1e-05,7e-06,3e-06,6e-06,7e-06,7e-06,2.4e-05,5.2e-05,0.000126,4.6e-05,6.5e-05,8.2e-05,8.6e-05,0.000191,0.000364,0.000769,0.000322,0.000195,0.000205,0.000203,0.000107,0.000139,0.000173,0.000131,0.000147,7.8e-05,9.9e-05,8e-05,0.000194,0.000338,0.000301,0.000283,0.000151,0.000135,0.000171,0.000234,0.000321,0.000257,0.000187,0.000202,0.000222,0.00024,0.000188,0.000241,7.9e-05,0.000106,8e-05,0.00012,7.8e-05,5.8e-05,4.9e-05,4.4e-05,3.8e-05,2.3e-05,2.4e-05,2.7e-05,9.9e-05,7e-05,2.8e-05,1.8e-05,2.1e-05,4.4e-05,4.6e-05,2.1e-05,2.9e-05,2.7e-05,8.7e-05,2.5e-05,2.4e-05,9e-06,2.4e-05,3.6e-05,2.5e-05,2e-05,1.7e-05,1.2e-05,1.7e-05,3e-06,1.1e-05,2.4e-05,1.4e-05,1e-05,1.3e-05,1.1e-05,1.6e-05,1.6e-05,2.3e-05,1.7e-05,1.2e-05,1.3e-05,1.6e-05,2.8e-05,1.7e-05,6.8e-05,4.2e-05,2.9e-05,7e-06,2.6e-05,2.7e-05,1.6e-05,1.7e-05,6e-06,1.2e-05,1.2e-05,3e-06,2.1e-05,1e-05,4e-05,0.000111,6.4e-05,4.5e-05,4e-05
3.8e-05,1.7e-05,2e-06,4e-06,3e-06,4e-06,1.1e-05,1e-06,9e-06,1.1e-05,5e-06,7e-06,8e-06,3e-06,4e-06,2e-05,3.5e-05,0.00014,7.6e-05,7.1e-05,6e-05,4.4e-05,0.00026,0.000299,0.00042,0.000462,0.000214,7e-05,0.00025,0.000203,0.000167,0.000122,0.000115,0.000176,5.4e-05,0.000136,0.000124,0.000225,0.000212,0.000266,0.000176,0.000178,0.000201,0.00012,0.000181,0.000208,0.000142,0.000145,0.000109,0.000158,0.000186,8.6e-05,0.000213,4.2e-05,3.4e-05,7.6e-05,5.6e-05,6.7e-05,3e-05,8e-06,4e-05,2e-05,5e-05,3.3e-05,4.8e-05,0.00011,4.4e-05,5.2e-05,5.7e-05,1.5e-05,1.3e-05,1.9e-05,3.3e-05,1.4e-05,3e-06,9.9e-05,3.4e-05,1.6e-05,1e-05,2.8e-05,2e-05,5e-06,1.1e-05,1.1e-05,1e-06,1.1e-05,1.7e-05,7e-06,2.4e-05,2.4e-05,1.1e-05,1.2e-05,2e-05,1.9e-05,7e-06,1e-05,2.3e-05,2.1e-05,1.2e-05,9e-06,2.3e-05,4.2e-05,3e-05,1.7e-05,1.1e-05,2e-06,3.1e-05,1.3e-05,2e-05,1.3e-05,2e-06,7e-06,2e-06,8e-06,8e-06,5e-06,3.9e-05,0.000119,0.000102,6.7e-05,2.4e-05
5e-05,1e-05,1.3e-05,4e-06,1e-06,2e-06,1e-05,1e-05,5e-06,3e-06,2e-06,8e-06,2e-06,3e-06,2e-06,1.8e-05,7.9e-05,0.000119,5.5e-05,0.000115,5.6e-05,3.3e-05,0.000242,0.000199,0.000222,0.00027,0.000139,0.000119,0.000137,0.000215,0.00019,9.6e-05,0.000214,0.000123,0.000144,0.000156,1.5e-05,0.000224,0.000198,0.000163,0.000174,0.000191,0.000114,0.000229,5.6e-05,0.000233,8.1e-05,0.000128,0.000316,0.000131,0.000122,9.7e-05,7.4e-05,7.5e-05,0.000136,1e-04,6.9e-05,4.4e-05,2.5e-05,1.4e-05,2.1e-05,2.5e-05,1.7e-05,2.4e-05,3.8e-05,4.2e-05,2e-05,3.4e-05,4e-06,1.2e-05,3e-06,1.3e-05,6e-06,1.3e-05,2e-06,9.7e-05,1.9e-05,8e-06,1.5e-05,2e-05,1.2e-05,1.2e-05,6e-06,1.4e-05,7e-06,5e-06,9e-06,1e-05,1.2e-05,8e-06,1.4e-05,1.5e-05,1.3e-05,1.1e-05,7e-06,1.2e-05,4e-06,1.4e-05,5e-06,1e-06,3.1e-05,2.5e-05,1.6e-05,8e-06,1.3e-05,7e-06,2.4e-05,2.2e-05,3.7e-05,3.4e-05,1.8e-05,1.9e-05,1.6e-05,1.8e-05,2.2e-05,1.1e-05,2.8e-05,2.6e-05,2.5e-05,3.3e-05,3.4e-05
5.4e-05,2.3e-05,1.5e-05,6e-06,1e-06,3e-06,3e-06,3e-06,7e-06,2e-06,2e-06,6e-06,2e-06,1e-06,3e-06,2e-05,6.5e-05,3.4e-05,2.5e-05,8.9e-05,9e-06,1.7e-05,0.000185,0.000271,0.000284,0.000107,8.2e-05,0.000236,0.000294,0.000248,0.000264,0.000123,0.000156,0.000111,0.000121,0.000146,0.000136,0.000173,9.4e-05,0.000233,0.000124,0.000165,0.000119,0.00018,6.3e-05,0.000322,0.000284,0.000247,9.1e-05,7.7e-05,5.4e-05,6.3e-05,6.9e-05,6.3e-05,7.6e-05,1.7e-05,4.9e-05,5e-06,1.5e-05,7e-06,1.7e-05,2.5e-05,6e-06,1.2e-05,4.9e-05,1.7e-05,1.1e-05,1e-05,9e-06,1.7e-05,9e-06,8e-06,9e-06,6e-06,1.5e-05,9.8e-05,2.5e-05,8e-06,7e-06,1.3e-05,7e-06,6e-06,2e-06,7e-06,1e-05,4e-06,1e-05,1.1e-05,5e-06,2e-06,1.2e-05,3e-06,1.1e-05,1.4e-05,1e-05,7e-06,8e-06,1.1e-05,3e-06,3e-06,3.6e-05,3.3e-05,1.5e-05,4e-06,6e-06,3e-06,1.9e-05,3.6e-05,2.8e-05,2.3e-05,4e-06,1.2e-05,3e-06,1.1e-05,1.2e-05,7e-06,1.5e-05,5.9e-05,3.6e-05,4.3e-05,1.3e-05
5.5e-05,1.3e-05,6e-06,2e-06,1e-06,3e-06,2e-06,1e-06,6e-06,4e-06,0,5e-06,1e-06,2e-06,3e-06,1.9e-05,2.7e-05,7.3e-05,2.5e-05,6.8e-05,2e-05,9e-06,0.000188,0.000152,0.000193,0.000248,0.000103,0.00021,0.000256,0.000141,0.000162,9.2e-05,0.000113,3.6e-05,4.2e-05,0.000199,3e-05,0.000158,0.000136,0.000135,0.000174,0.000132,1e-04,0.000196,1e-04,0.000171,0.000171,2e-04,0.000205,4.1e-05,9.4e-05,1.1e-05,9.5e-05,3.9e-05,7.9e-05,2.2e-05,4.7e-05,4e-06,6e-06,3e-06,1e-05,3.6e-05,8e-06,7e-06,4.2e-05,1e-05,5e-06,1.1e-05,8e-06,1e-05,6e-06,8e-06,1.3e-05,2e-06,1.2e-05,9.5e-05,1.5e-05,1.2e-05,7e-06,7e-06,5e-06,7e-06,4e-06,7e-06,7e-06,4e-06,1.2e-05,1.1e-05,7e-06,3e-06,5e-06,3e-06,8e-06,1.1e-05,7e-06,1e-05,8e-06,1e-05,2e-06,4e-06,4.1e-05,2.9e-05,4e-06,3e-06,9e-06,1e-06,1.7e-05,3.2e-05,1e-05,8e-06,1.1e-05,4e-06,7e-06,7e-06,1.3e-05,4e-06,1.2e-05,4.2e-05,2.6e-05,2.8e-05,1.1e-05
5.1e-05,5e-06,3e-06,4e-06,3e-06,2e-06,2e-06,2e-06,3e-06,5e-06,1e-06,5e-06,2e-06,1e-06,4e-06,1.9e-05,8e-06,2.5e-05,2e-05,4.5e-05,2.1e-05,7e-06,0.000192,0.000127,0.000194,0.000221,0.000118,0.000164,0.000179,0.000107,0.00015,0.000113,6.5e-05,5.9e-05,4.2e-05,0.000124,9.7e-05,0.000186,0.000172,8.2e-05,0.000109,0.000133,0.000122,0.000213,0.000136,0.00017,0.000195,0.000145,0.000233,4.7e-05,4.4e-05,2.9e-05,0.000105,2.6e-05,5.7e-05,1.1e-05,4.9e-05,3e-06,3e-06,4e-06,1.8e-05,3.6e-05,6e-06,7e-06,4.5e-05,1.4e-05,8e-06,8e-06,1e-05,1.1e-05,2e-06,5e-06,9e-06,0,1e-05,9.3e-05,1.6e-05,8e-06,1.3e-05,8e-06,5e-06,7e-06,4e-06,8e-06,8e-06,2e-06,1e-05,1e-05,5e-06,5e-06,9e-06,5e-06,8e-06,1.1e-05,6e-06,1e-05,9e-06,9e-06,2e-06,4e-06,4.3e-05,1.9e-05,5e-06,2e-06,8e-06,1e-06,1.6e-05,2.4e-05,1.1e-05,1.9e-05,9e-06,3e-06,4e-06,6e-06,1.4e-05,4e-06,5e-06,2e-05,9e-06,2.8e-05,8e-06
