-0.000176,0.000103,-0.000361,-0.000379,0.000607,1.8e-05,-0.000301,-0.000398,-0.000325,-0.000684,-0.000347,-0.000833,-0.000252,-0.000214,0.000137,0.000469,4.1e-05,-0.000884,-0.000397,-0.000343,-0.000474,8.7e-05,-0.001529,-0.002366,-0.00099,-0.000525,-0.000271,-0.003468,-0.003139,-0.004574,-0.005218,-0.005187,-0.007089,-0.004987,-0.002641,-0.015672,-0.007808,-0.000835,0.001615,0.007759,0.00122,-0.025451,-0.016289,-0.018387,-0.020602,-0.009766,-0.020219,-0.014266,-0.020396,-0.015146,-0.016169,-0.01609,-0.010724,-0.011095,-0.01188,-0.012445,-0.011866,-0.014117,-0.011481,-0.014376,-0.014562,-0.012398,-0.008566,-0.008052,-0.003749,-0.009891,-0.011447,-0.012512,-0.006754,-0.010703,-0.010002,-0.00222,-0.007198,-0.00339,-0.00502,-0.003066,0.000194,-0.006621,-0.004781,-0.002331,-0.001866,-0.003989,-0.005346,-0.0031,-0.004152,-0.003296,-0.00159,-0.001302,0.000123,0.000353,-0.001112,-0.00213,-0.004137,-0.003921,-0.002468,-0.001844,-0.003279,-0.001006,-0.00045,-0.00042,0.00015,-2.2e-05,0.000153,0.000239,3.2e-05,0.000343,0.000155,0.000211,9.2e-05,0.000393,-2.2e-05,-0.000187,0.000786,8.9e-05,-0.000923,-0.003285,-0.002,-0.000636,-0.00027,-0.00062,-0.000534
-0.000269,0.00019,0.000257,0.000374,0.000634,0.000492,0.000259,0.00031,0.00034,0.000297,0.000859,0.00093,-0.000137,-6.2e-05,-0.000254,-0.000217,-0.000482,0.000362,-7.4e-05,-0.000558,-0.000127,-0.000111,-0.000308,0.001284,0.000551,0.000196,0.000389,0.002002,0.002783,0.000398,0.000478,0.001725,0.003399,0.00253,0.001568,0.008516,0.008346,0.003731,0.001846,0.001069,0.001377,0.004976,0.002592,0.002186,0.000257,0.002616,0.007367,0.007313,0.002922,0.00533,0.001592,0.00448,7e-06,0.006305,-0.000882,0.000851,-0.003629,-0.002083,-0.002031,-0.000986,0.000133,0.0024,-0.001952,-6.7e-05,-0.001965,-0.001542,-0.005128,0.000427,-0.00269,-0.004666,-0.00438,-0.003128,0.000403,-0.001217,0.001846,0.002185,0.002245,-0.000212,0.000151,-0.001965,-0.000565,0.001666,0.000335,0.000166,0.000355,0.001658,0.001651,0.000298,0.000386,-0.001514,0.004685,0.003584,0.003142,0.002858,0.001202,0.001034,-0.001644,0.000596,0.000977,0.000705,0.000184,-8e-05,0.00027,0.000504,0.000474,0.000924,0.000202,0.000283,0.000171,0.000134,0.000556,0.000173,0.000776,0.000497,0.000946,0.001889,0.001207,0.000351,-9e-05,-8.3e-05,5.8e-05
-0.000305,-0.000458,-7.2e-05,-0.000141,3.1e-05,1.4e-05,-0.000409,-0.000242,6e-06,0.000154,-8e-06,-0.000548,-0.00024,1.5e-05,-0.000265,-0.000534,0.000198,-0.00016,-0.000212,0.000213,-1.4e-05,-2.4e-05,5e-05,-0.000712,-0.000174,8.9e-05,-0.000403,-0.002996,-0.00264,-0.000896,0.000916,0.000596,-0.001755,-0.002022,-0.001776,-0.00353,-0.003756,-0.002694,3.8e-05,-0.006343,-0.004424,-0.006661,-0.004757,0.003759,-0.005353,-0.014817,-0.016605,-0.007009,-0.005288,-0.013148,-0.00146,-0.005079,-0.005702,-0.010012,-0.008039,-0.007866,0.00012,-0.002361,-0.000889,-0.000184,-0.004381,-0.003506,-0.002852,-0.002631,-0.003565,0.003028,0.000555,-0.000149,-0.000226,0.003678,0.001823,-0.00115,-0.002004,-0.002245,-0.00486,-0.005194,-0.003445,-4.7e-05,-0.001101,0.000113,-0.001147,-0.001493,-0.000313,-0.000775,-0.000305,-0.001709,-0.000597,-0.000888,-0.000992,0.000537,-0.001509,-0.002845,-0.000519,-0.00146,-0.00092,-0.001318,-0.001538,-0.002511,-0.001245,-0.000584,-0.000428,-0.000294,-0.000539,-0.000149,-7e-06,-0.000407,3.7e-05,0.000307,0.000286,0.000122,7.5e-05,0.000361,0.000153,-0.000119,-0.000278,-0.000693,-0.000263,-0.00042,1.7e-05,-0.000118,-0.000224
8e-05,0.000111,5.1e-05,0.000627,0.000364,-5.6e-05,9e-05,-5e-06,-0.00056,3.1e-05,0.000226,3e-04,-6.6e-05,6e-05,-0.000473,0,0.00011,3.9e-05,0.000485,0.000358,0.000463,-0.000178,-0.000284,-0.000176,-0.00039,-0.000273,0.000176,-4.6e-05,0.001266,-0.000284,0.00027,-1.6e-05,0.002339,0.001005,0.000876,-0.002291,0.002807,0.00026,-0.000255,7e-04,0.002785,0.001854,-0.002826,-0.004082,0.000225,0.003731,0.006656,0.007669,0.004424,0.002075,-0.002805,-0.00133,0.000155,0.003106,0.003599,0.003019,0.004394,0.002426,0.003009,0.001424,0.003313,-0.001503,-0.00318,0.001882,-0.000813,-0.002547,0.002849,0.005071,-0.00034,-0.001204,0.002533,0.000913,0.000712,8e-06,0.001678,-0.000223,-0.002099,-0.001575,0.000473,-4.6e-05,0.000517,0.000364,5.2e-05,0.000359,0.000561,0.000732,0.001404,-9.2e-05,-0.000476,-0.000868,-0.001227,-0.000289,-0.000501,0.000353,0.000102,-0.000204,0.001614,0.001387,0.000806,0.000774,-0.000179,4.8e-05,0.000335,-0.000275,3.7e-05,9.9e-05,-2.9e-05,0.000159,-0.00022,0.000104,0.000159,4.2e-05,-2.8e-05,-1.6e-05,0.000314,0.000294,0.000164,-0.000146,-0.00022,-3.4e-05,0.000368
-0.000103,0.00021,8.4e-05,-0.000133,-0.000277,-0.000237,0.000124,-6e-06,0.000126,-0.000148,-0.000234,8.7e-05,0.000185,3e-06,4.1e-05,0.000388,2.1e-05,-1.3e-05,-0.000489,-0.000289,0.000193,-0.000175,5.8e-05,0.00033,0.00015,0.000343,3.5e-05,0.00015,-0.00132,-0.000787,-0.000941,-1.9e-05,-0.001589,-0.001322,0.000353,0.000474,-0.002033,-0.002377,-0.001427,0.000123,-0.00057,-0.013989,-0.005185,0.002109,-0.001004,-0.006394,-0.006793,-0.006002,0.003702,-0.001964,-0.003209,0.001252,-0.000853,-0.001188,-0.002145,-0.001853,-0.000548,-0.001586,-0.001234,-0.002205,-0.002406,-0.002769,0.00434,0.000586,0.000335,-0.00057,-0.000903,-0.001662,-3e-05,0.000678,0.000376,-0.001333,0.001986,0.001807,-0.000525,0.000197,-0.002503,-0.00086,-0.000363,-0.000192,-0.000527,-0.000732,-0.000321,-8.1e-05,-0.000239,-0.00107,-0.000748,-6.7e-05,-2e-06,-0.00059,-0.000631,-0.002402,-0.001302,-1e-05,0.000357,0.000471,0.00031,5e-04,-0.000252,-0.000918,-0.000353,8.5e-05,-0.000224,-0.00068,-0.000379,-0.000108,-0.000134,0.000324,-0.000142,0.000358,-0.000115,5.2e-05,-0.000278,-0.000487,-0.000104,-0.000498,-0.000412,7.3e-05,0.000168,-0.000249,-0.000478
0.000181,-0.000237,2.5e-05,0.000182,-7e-05,-0.000133,-0.000107,0.000293,-0.000248,0.000195,-2.3e-05,-0.000361,6.7e-05,0.000265,7.1e-05,5.9e-05,0.000375,-0.000226,-0.000384,0.000316,-0.000399,3.6e-05,-0.00021,-0.000151,-0.000285,-0.000208,7.8e-05,-0.00052,0.000543,0.000183,-8.6e-05,-0.000343,1e-06,0.000923,-0.000554,6.1e-05,-0.000888,-0.000249,-0.001345,-0.000292,-0.005452,0.001891,0.006831,-0.000286,0.002358,0.006962,0.006738,0.005254,-0.001946,0.005189,-0.002066,-0.004656,0.007233,0.000633,0.000735,-0.001176,-0.000476,0.003933,0.003541,0.001706,0.004411,0.00478,-0.001691,-0.000409,0.005072,0.004064,3.1e-05,-0.000903,-0.00169,-0.000611,-0.005472,-0.00088,-0.001281,0.000521,0.001095,0.00101,-0.001083,-4.8e-05,0.000865,-0.000233,0.000465,0.000222,0.000109,0.000991,-0.00039,0.000909,0.000789,0.000272,0.000774,0.001237,-0.000182,-6e-06,0.000244,-0.000428,-0.000298,0.000112,0.00131,0.000398,0.000399,0.00015,-5.9e-05,0.00024,-6.4e-05,-0.00016,-0.000119,0.000194,-0.000105,-0.00021,-0.000305,-0.000265,-0.000236,0.000336,2.4e-05,-0.000254,0.000124,0.000387,3.1e-05,-8.3e-05,-0.000262,0.000284,0.000127
-0.000153,-8.4e-05,-0.000313,-0.000244,-0.00011,7.1e-05,-0.000208,3e-05,-0.000214,-6.8e-05,-3.9e-05,-0.000222,-6.8e-05,-0.000147,-0.00016,1e-06,0.000116,0.000361,0.000117,8.7e-05,-6.9e-05,7e-06,-0.000541,-0.00018,2.3e-05,-1e-06,-2.3e-05,0.000111,-7.9e-05,0.000636,-0.000138,0.000746,0.000289,-6.4e-05,0.000357,-3e-06,-0.001305,-0.000922,-0.000755,0.000284,-0.005372,0.000283,-0.003932,-0.001742,-0.001275,-0.000334,-0.000969,-0.006383,0.003314,0.000853,0.00087,0.001972,-0.000726,-0.00173,0.000521,0.000548,0.000125,-0.000261,-0.003763,-0.002442,-0.000571,-0.00218,-0.000919,-0.000953,-0.002746,-0.001799,-0.001033,0.000385,0.000298,0.000151,0.003134,0.001577,0.000258,0.000344,0.001142,-0.002291,0.001405,0.000147,-0.000476,-0.000347,0.000358,-0.000627,6.6e-05,-0.000179,-0.000291,-0.000858,-0.000874,-0.000249,-0.000823,0.000246,0.000271,-3.5e-05,-0.000873,0.000256,0.000489,3.9e-05,-0.001684,-0.000994,-0.000784,-0.000383,-0.000384,-9e-06,-0.000311,-9.4e-05,-0.000366,-0.000188,-0.000317,-9.5e-05,-1.8e-05,0.000169,-0.00031,1.6e-05,-0.000282,-0.000339,-4.1e-05,-0.000293,-0.000205,-0.000258,-0.000164,-0.000227,-0.000164
3e-06,-7.2e-05,-0.00013,-3.7e-05,1.5e-05,-1.3e-05,-9.2e-05,5.6e-05,0.000114,-4.7e-05,0.000142,-0.000161,5e-06,-0.000107,-0.000106,-0.000339,-5.8e-05,-0.000205,-0.000187,-0.000174,0.000187,-0.000218,4.4e-05,9.4e-05,5.2e-05,1e-06,-3.5e-05,0.000207,0.000964,3.1e-05,-0.000283,0.000443,0.000181,0.000235,-0.000547,-0.000184,0.000589,-0.000529,-4.1e-05,-0.000283,0.004437,0.001972,0.002879,0.003469,-0.00131,0.000856,-0.002271,0.001697,-0.004282,-0.000811,-0.000394,-0.001285,0.000747,0.001577,0.002456,0.001241,-0.000539,-0.001573,0.000205,0.000527,0.000269,0.000415,0.002467,0.002457,0.001247,-0.000568,0.000138,0.000915,0.000237,0.000878,-0.000535,-0.001123,-7.6e-05,-0.000592,-0.001763,-0.000319,-0.000972,-0.000665,-0.000102,-0.000913,-0.000186,0.000753,4.1e-05,-0.000274,-0.000279,-0.000354,-0.00017,-0.00032,-0.000345,0.000391,0.00033,0.000699,-0.001297,-0.000316,-0.000543,9.3e-05,-6e-05,-0.000306,0.000177,0.000151,0.000103,-6.9e-05,0.000157,-0.000197,-5.7e-05,-0.000102,-5.8e-05,-8.1e-05,-0.000117,-0.000203,-7.5e-05,0.000141,5.3e-05,6.9e-05,-9.6e-05,6.1e-05,-1e-04,3.7e-05,0.000247,4.7e-05,-6e-05
-0.000113,0.000107,9.5e-05,-3.3e-05,-0.000259,-1.8e-05,-0.000101,-6.2e-05,2.3e-05,-0.000103,-0.000343,-0.000168,-4.2e-05,-1.6e-05,0.000143,-0.000104,-0.000142,-0.000106,4.7e-05,0.000103,-0.000149,-0.000232,5.7e-05,-0.000121,-0.00045,-0.000189,0.000139,0.000272,-0.000193,0.000518,0.000122,-0.000186,6.9e-05,0.000796,0.000615,0.000749,-0.000754,-0.000662,-0.000238,-0.000513,8e-04,0.001341,0.002222,0.001227,0.001134,-3e-06,-0.001413,-0.000278,0.003298,0.001246,0.003045,-0.001117,-5.4e-05,0.000328,-0.001159,-0.001976,-0.000626,-0.000136,6.2e-05,-0.001634,0.000142,0.000616,-0.000849,0.000419,-0.001445,-0.001944,-0.001979,-0.000989,-0.000121,-0.002134,-0.000874,-0.001783,-0.000713,0.000337,0.000536,4.4e-05,0.000624,-0.000799,-0.000251,0.001727,0.00016,-0.000133,-0.000218,0.00012,-0.000178,0.000251,-0.000572,0.000179,-0.000165,-0.000562,-0.000288,-0.000605,0.000376,-0.000113,0.000104,-0.000281,0.000155,-0.000102,-0.00125,-0.000372,0.000127,-0.000171,2.8e-05,4.9e-05,6.7e-05,-0.000281,-0.000147,-0.00022,-0.00021,-0.000182,-5e-05,-2.9e-05,-0.000159,-2.9e-05,-7.6e-05,-0.000178,-6.8e-05,2.4e-05,8.4e-05,-1.7e-05,4.6e-05
8e-06,2.8e-05,6.9e-05,4e-05,-0.000165,-0.000123,-6.4e-05,0.000198,3e-05,-0.000107,0.000185,-6.4e-05,0.00011,0.000106,-9.1e-05,9e-06,-0.000105,-1.3e-05,-7.6e-05,3.8e-05,-5e-05,7.4e-05,-9.4e-05,-9.9e-05,0.000405,2.2e-05,-2.5e-05,4.6e-05,-0.000171,-0.00014,-2.5e-05,-0.000833,-8.5e-05,-0.00095,-0.000481,-0.000344,0.00069,0.000219,5e-06,-0.000696,-0.000113,0.001636,0.000913,-0.000843,-0.001924,0.000904,0.000851,-0.000336,-0.002092,-0.002543,0.000915,-0.000993,-0.00066,-0.00198,8.7e-05,-0.001079,-0.001062,0.000883,0.000407,0.001357,-0.000328,-0.00098,0.000995,-0.001626,0.001418,-4.2e-05,0.001324,0.000752,0.000527,-0.00069,0.000282,-0.000383,-0.000875,4e-06,0.000298,-0.000281,-0.00021,0.000393,0.000385,-0.000644,0.000137,0.000428,0.00031,-0.00041,-0.000479,-7e-05,-8.4e-05,-0.000111,-0.000308,-0.000226,0.000181,0.000348,-0.00073,-0.000153,-8.7e-05,0.000241,-0.000109,0.000166,-0.000379,-0.000197,5.3e-05,-2.2e-05,2e-05,-0.00015,-4.9e-05,-0.000125,2.3e-05,-8e-06,-0.000146,-2.7e-05,-0.000127,-6e-05,7.5e-05,-3.7e-05,0.000109,-2e-05,9.7e-05,-4.8e-05,0.000161,8.9e-05,9e-05
0.000123,0.000136,6.7e-05,-3.7e-05,-1.2e-05,8e-05,0.000125,-4.2e-05,-1.2e-05,5e-05,-0.000178,-1e-06,1.3e-05,0.000143,0.000116,-4e-05,6.8e-05,-2.3e-05,5.5e-05,5.7e-05,0.000168,0.000101,0.000269,5e-06,-0.000391,-0.000164,4.6e-05,2.8e-05,0.000217,-0.000404,0.000257,0.000482,-0.000172,3e-05,0.000559,-0.000123,0.000385,-7e-05,0.000235,-0.000653,0.000105,0.000762,-0.002203,-0.001992,0.003077,-0.000194,-0.002119,0.001222,0.002638,0.000697,-0.001956,-9e-05,-0.000312,-0.001982,-0.000535,-0.002234,-0.000926,-0.000188,-0.00065,5.2e-05,-0.000233,-0.001335,0.001111,0.000967,-0.000429,0.001016,-4.6e-05,-0.000224,-0.000308,0.000431,-0.000116,0.00218,0.000948,-0.000711,-0.000102,0.000706,-0.000206,0.000864,0.000185,0.000392,-0.000152,-0.000148,-3.9e-05,1e-04,0.000882,7e-05,-7.1e-05,0.000289,0.000454,-1.8e-05,-0.000439,-0.000542,0.000853,0.000252,0.000404,-6.7e-05,-4.1e-05,-0.000105,0.000275,3.8e-05,0.000207,-0.000106,-0.00012,3.4e-05,0.000124,-0.000102,1e-05,-0.00013,-2.3e-05,-1.9e-05,2.4e-05,-1e-04,-0.000176,2e-05,-0.000108,-8.1e-05,-1.4e-05,7.4e-05,-0.000131,7.1e-05,-3e-05
-0.000196,-5.5e-05,-7.2e-05,2.1e-05,6.4e-05,-6e-06,-6e-05,-2.7e-05,-0.000101,-3.6e-05,-0.000113,3.3e-05,-5.2e-05,1.2e-05,-5.1e-05,-4.8e-05,-1.9e-05,-4.9e-05,-3.5e-05,-6e-06,-0.000138,-0.000144,-0.000147,-1.4e-05,0.000189,0.000103,-8.1e-05,0.000102,-0.000121,0.000372,-0.000173,-0.000328,0.000366,0.000516,-0.000169,0.000293,-0.000511,0.000294,-0.000371,-0.000265,-0.00062,-0.002756,0.002087,-0.000361,-7e-06,-0.001123,0.001655,-0.002158,-0.000412,-0.001849,-0.000852,0.000382,-0.001584,0.000299,0.000115,0.002602,0.001001,-0.000921,0.001397,0.000271,0.000924,0.000436,0.000715,-0.000368,-0.000406,0.001286,-5.8e-05,-0.001413,-0.000511,-0.000392,-7e-05,-0.001241,-0.000162,-0.001656,0.000672,-0.000449,0.000227,0.000146,9e-05,-0.00047,-6.9e-05,-0.000323,-8.3e-05,-9.4e-05,-0.000351,3.3e-05,0.000479,2.4e-05,-1.1e-05,-2.9e-05,-0.000159,0.000186,-1e-04,-0.000373,-0.00014,6.1e-05,0.000134,5.8e-05,0.000195,-1.5e-05,4.9e-05,-7.8e-05,-7.9e-05,1.7e-05,-5.4e-05,-0.00011,-3.3e-05,-7.5e-05,1e-06,-5.1e-05,-0.000126,-0.000146,-8.3e-05,-8.6e-05,-0.000128,-1.5e-05,-0.000108,-9e-06,5.5e-05,-0.000121,8e-05
3.4e-05,2e-05,3e-05,-1e-06,-5e-05,-2.1e-05,0,0,-3.9e-05,-2.9e-05,4.6e-05,2.6e-05,-2.8e-05,7.7e-05,-8.1e-05,1e-04,-3e-06,4e-05,-7.6e-05,-2.2e-05,-6e-05,-4.8e-05,-5.9e-05,3.7e-05,-8.5e-05,-0.000115,-5.1e-05,5.3e-05,3.4e-05,-0.00077,-4.3e-05,-5e-05,-2e-06,-0.000209,5.2e-05,-8e-06,3.5e-05,-0.000145,0.000149,-0.000155,-0.00089,-0.000379,-0.001728,-0.000454,-0.001714,0.001701,-0.000774,-0.001333,0.000406,0.000594,-0.000482,0.001033,0.000405,-0.000643,0.000187,0.000194,-0.001158,1e-05,-0.001183,0.000194,-0.001141,0.000307,-0.001171,-0.000587,0.000256,-0.000103,-0.000353,0.000441,0.000221,-0.000505,-0.000438,-0.00045,-0.000206,0.000476,0.000106,-0.00013,0.000367,0.000541,-0.000127,0.000253,-3.2e-05,-0.000703,-0.000107,4.2e-05,-0.000152,8.1e-05,-0.000118,-1.2e-05,0.000225,-0.000101,0.000213,0.000147,0.001002,-5.9e-05,0.000203,2.2e-05,5.3e-05,5e-05,0.000112,-9e-06,6.2e-05,1.2e-05,-3.3e-05,3e-06,-1.1e-05,3e-05,-3.6e-05,7.1e-05,-9.1e-05,1.4e-05,-1.9e-05,-7.5e-05,-4.5e-05,-6e-06,-9.6e-05,-5.9e-05,1.3e-05,-1.4e-05,1.7e-05,1.1e-05,-6.9e-05
7.1e-05,-4.6e-05,1.2e-05,8e-06,-2.4e-05,2.1e-05,2e-06,-5.9e-05,-2.5e-05,3.5e-05,-4.9e-05,-9.2e-05,-2.7e-05,1e-06,2e-05,-2.1e-05,-6.1e-05,-4.1e-05,7.9e-05,3.1e-05,7.6e-05,7.7e-05,4.9e-05,3.1e-05,9e-05,3.9e-05,3.5e-05,3.5e-05,-0.00018,0.000755,7.1e-05,-4.2e-05,-2.6e-05,9.1e-05,-0.000375,-4.7e-05,-0.000108,-3.1e-05,-5.5e-05,2e-05,0.000593,0.002179,-0.000319,0.000768,1.5e-05,-0.001213,-0.000203,0.000583,-0.001609,-0.000676,0.000497,-0.001005,-0.001309,0.001115,-0.00043,0.000295,0.000625,0.000346,-0.000165,-0.000116,-6.9e-05,-0.000195,0.000259,0.000185,0.001081,-0.000772,6.3e-05,7.1e-05,0.000526,0.000734,-6.8e-05,0.000572,-0.000303,-0.00038,0.000195,-1e-04,-0.000279,-0.000338,-0.000259,-0.000211,-0.000159,0.000288,1.2e-05,2.6e-05,0.000166,-0.000149,-0.000115,-0.000124,-4.4e-05,-0.000119,0.000132,-0.000147,-0.000469,-1.1e-05,-7.5e-05,-0.000122,0.000135,-0.000105,-0.000243,3.5e-05,1e-05,0.00012,4.8e-05,-6.5e-05,-2.7e-05,8e-05,3e-06,-7e-06,-3e-06,-1.7e-05,-2.4e-05,-1e-05,-1.7e-05,4.6e-05,-1.6e-05,-3.7e-05,-1.1e-05,-4.1e-05,3e-06,6e-06,3.5e-05
-4e-05,4e-05,-4e-05,1.1e-05,-4.3e-05,3.3e-05,-4.8e-05,0,5.9e-05,3.6e-05,2.7e-05,3.3e-05,-5e-05,-1e-05,-2e-06,1.8e-05,-1.3e-05,3.3e-05,-8.6e-05,-2.7e-05,-5.6e-05,1.7e-05,5.4e-05,-2.8e-05,-6e-05,5.3e-05,-5.6e-05,4.7e-05,6e-06,6.1e-05,-0.000196,-8.8e-05,-4e-06,-0.000236,0.000155,-0.000112,-4.4e-05,-0.000166,0.00037,0.000167,0.00098,0.000512,-0.000407,-0.002001,-0.00017,7.4e-05,0.000605,0.000493,0.000346,-0.001504,-0.000169,-0.000513,0.00016,-0.000343,0.000515,-0.000321,-0.000775,-0.000416,0.000157,0.000144,0.000243,0.000241,-0.000193,-0.001015,-0.000692,3.1e-05,4e-06,-0.000377,1.7e-05,-0.000516,0.000152,-0.000382,7.4e-05,6.5e-05,-0.000215,-0.000135,0.000152,3.7e-05,-0.00012,-4.8e-05,9.8e-05,3e-04,-4.5e-05,1e-06,-0.000126,1.8e-05,0.000219,4.2e-05,0.000169,-3.3e-05,-9.1e-05,-1.3e-05,-0.000223,-4e-05,2.5e-05,0.000159,-0.000203,6.8e-05,7.7e-05,0.000112,8.9e-05,6.5e-05,8.4e-05,-2.4e-05,1e-06,2.6e-05,5e-06,4.9e-05,-3e-06,3e-06,5e-06,2.2e-05,-3.5e-05,-6.5e-05,6.1e-05,1.7e-05,2.2e-05,8e-06,-5.4e-05,3e-06,-1.5e-05
-4e-06,2e-06,-6e-06,-1.7e-05,4.1e-05,-4.8e-05,-2.2e-05,-4e-05,-2e-05,2.7e-05,1.9e-05,-6.2e-05,-4.1e-05,-2.3e-05,-1.3e-05,2e-05,2.2e-05,-1.2e-05,5.1e-05,-3.9e-05,-1.6e-05,-4.7e-05,1e-05,-2.8e-05,2.1e-05,-4.9e-05,1.2e-05,-5e-06,-0.000105,-0.000129,0.00014,2.4e-05,-6.4e-05,1.7e-05,-3.1e-05,0.000143,0.000123,-2.9e-05,-0.000384,9.5e-05,2.1e-05,-0.000277,0.00051,0.001388,0.000195,-0.000106,-0.000282,-5e-05,-0.000712,-9.4e-05,0.00075,0.000134,-0.000438,0.000219,-0.000306,-4.5e-05,0.000554,0.000476,-7.1e-05,-0.000483,-0.000286,-4.3e-05,-0.000167,0.000195,-0.000175,0.00033,-7.3e-05,0.000563,-0.000417,0.000448,5.9e-05,0.00031,0.000188,0.000254,-0.000285,8.4e-05,-0.000117,-1.1e-05,-1.8e-05,-9.6e-05,-7.7e-05,-0.000224,1.7e-05,3.8e-05,-8e-06,-1.2e-05,-8e-05,-5.3e-05,-6.6e-05,5.5e-05,1.5e-05,-1e-05,-0.000106,2.9e-05,-9.4e-05,-7.3e-05,0.000103,-3.4e-05,7.6e-05,-1e-06,5.6e-05,-2e-06,1e-05,4e-06,3.8e-05,9e-06,4e-06,-2e-05,-2e-06,1.6e-05,3e-05,-1.2e-05,5e-06,3.8e-05,-3e-06,3.1e-05,3e-06,1e-06,9e-06,1.1e-05,1e-06
-1.4e-05,1.8e-05,2.2e-05,8e-06,1.2e-05,1e-05,1e-06,-6e-06,-2.2e-05,-2.1e-05,-3.3e-05,-2.5e-05,-4e-06,-3.4e-05,1.5e-05,-2.3e-05,1e-05,-3.6e-05,-3e-06,3e-06,1.2e-05,-2.4e-05,-1.5e-05,-1e-05,1.8e-05,1.6e-05,-6e-06,2.1e-05,2.9e-05,3.6e-05,-7.5e-05,8.6e-05,1.1e-05,0.000155,8.5e-05,-3.9e-05,0.000107,-7.2e-05,0.00017,9.5e-05,-6.6e-05,-0.001292,-1e-06,-9.2e-05,0.000721,-0.000303,0.000498,0.000209,0.000434,-0.000595,-0.000258,-0.000721,0.000159,-4.8e-05,7.9e-05,-8e-05,-0.000232,-0.000232,-8.9e-05,5.1e-05,-1.5e-05,0.000232,-0.000138,7.1e-05,8.8e-05,-0.000368,7.6e-05,-0.000169,-2.1e-05,-0.000107,5.7e-05,-0.000273,-0.000109,0.000455,2e-05,-7.3e-05,5.9e-05,0.000201,8.5e-05,2.7e-05,8e-05,3e-06,-1.6e-05,-3.6e-05,7.2e-05,7.5e-05,-7.4e-05,4.6e-05,9.3e-05,-5e-06,1.1e-05,4.2e-05,0.000136,4.1e-05,2e-06,6.6e-05,-7.7e-05,-2.2e-05,-0.000118,-8.5e-05,1.3e-05,7.1e-05,0,8e-06,-1.1e-05,1.6e-05,-5e-06,-3.6e-05,2.8e-05,-5e-06,-2.6e-05,2.7e-05,1.5e-05,-2.4e-05,1.9e-05,8e-06,-8e-06,-2.3e-05,-2e-06,-4.3e-05,2.8e-05
1.5e-05,-1.2e-05,4e-06,-3e-06,-2e-05,-9e-06,-1e-05,4e-06,1.3e-05,-2.6e-05,-2e-06,2.9e-05,1.6e-05,1e-06,5e-06,-1.5e-05,0,2.4e-05,1.4e-05,-2.3e-05,-1.3e-05,1.4e-05,3.5e-05,7e-06,-2.8e-05,-1.4e-05,0,2e-05,9e-06,4.7e-05,7.1e-05,2e-05,-3.6e-05,-8e-05,-2e-05,-9.9e-05,-0.000147,1.3e-05,-0.000162,1.4e-05,-0.000168,-0.00012,-0.000955,-0.000568,-4.4e-05,0.000455,-0.000628,0.000211,0.00044,0.000463,0.000191,0.000287,0.000488,-6.8e-05,-6.3e-05,-0.000343,0.000428,0.000103,-1.1e-05,-2.7e-05,-4.9e-05,-0.000127,-7.1e-05,5.4e-05,-2e-06,-0.00017,-9.1e-05,-0.000171,0.000294,6.6e-05,6.7e-05,-0.000129,-7e-06,-6.7e-05,-0.000261,6.7e-05,4.4e-05,4.4e-05,3.6e-05,-0.000117,-8.1e-05,-4.3e-05,2.8e-05,-7e-06,-2.4e-05,-4.9e-05,-8.8e-05,-2.5e-05,-6.4e-05,6.2e-05,1.4e-05,-2e-06,4.2e-05,-1e-06,-0.000116,-1.3e-05,-5.6e-05,3.2e-05,1.3e-05,-5e-06,3.7e-05,-1e-05,-2.5e-05,-1.1e-05,-8e-06,-2e-06,2e-06,-2.9e-05,-4.1e-05,-2.1e-05,-2e-05,2.6e-05,-6e-06,1.4e-05,6e-06,-1.9e-05,-4e-06,1.5e-05,-4.6e-05,2e-05,-1.7e-05
-3e-06,8e-06,-1.9e-05,-2e-06,-1.7e-05,2.5e-05,3e-06,0,-2.3e-05,-1e-06,2.8e-05,1e-06,-1.1e-05,0,1e-06,0,-4e-06,-7e-06,0,1.4e-05,-1.2e-05,1.6e-05,-1.3e-05,-4e-06,5e-06,-3e-05,5e-06,2e-06,-6.8e-05,-1.8e-05,-4.6e-05,2e-05,1.6e-05,-3.6e-05,6.1e-05,2.3e-05,3.1e-05,3e-06,4.2e-05,2e-05,-0.000178,0.00059,0.000609,0.00058,-6e-06,-0.000206,-9e-06,-0.000217,-0.000339,5.9e-05,-0.000197,-6.8e-05,-0.000118,0.00046,0.000119,8.7e-05,-0.000251,-0.000167,0.000271,0.00018,0.000186,0.000251,-0.000322,-1.8e-05,1.5e-05,0.000234,3.7e-05,7.8e-05,-0.000105,6.2e-05,-4.3e-05,0.000168,1.7e-05,-4.9e-05,-4.3e-05,-1.4e-05,4e-06,9e-06,3.1e-05,0.000173,4.8e-05,5.5e-05,-8.1e-05,-4.1e-05,-2.3e-05,2e-05,8.6e-05,1.5e-05,6.4e-05,-5.5e-05,3e-05,4.1e-05,0.000141,0,1.1e-05,1.9e-05,1.9e-05,-3.9e-05,-0.000168,-4.4e-05,2e-05,-2.5e-05,-1e-06,-2e-05,-3e-06,-3.3e-05,-3e-06,-1e-06,-1.9e-05,2e-06,-1.4e-05,2.2e-05,-8e-06,-2.4e-05,-1.7e-05,-9e-06,8e-06,0,1.5e-05,-9e-06,2.1e-05
-5e-06,-1.2e-05,7e-06,5e-06,-1e-06,-1.4e-05,-2e-06,-4e-06,1.4e-05,7e-06,-1.9e-05,-5e-06,1e-06,9e-06,-6e-06,-1.3e-05,2.2e-05,-1.2e-05,-1.6e-05,-3e-06,3.5e-05,-1.9e-05,-6e-06,-4e-06,-2.1e-05,-1.7e-05,-3e-06,3e-06,6.1e-05,9.8e-05,-1.6e-05,-1.6e-05,1.2e-05,5.1e-05,-8.2e-05,5.9e-05,-4.5e-05,-1.2e-05,6e-05,-6e-06,7e-05,-0.000187,-0.000237,0.000466,0.000179,8.7e-05,0.000153,-0.00016,1.9e-05,7.3e-05,-2e-06,-0.000167,0.000433,-0.000268,-0.00021,-0.000329,0.000308,1.1e-05,-0.00015,0.000135,-0.000132,-6e-05,-0.000114,-4e-05,-0.000401,0.00022,-7.5e-05,-3.1e-05,-8.4e-05,-0.000113,2.2e-05,4.3e-05,2e-06,0.000113,5.4e-05,-8.8e-05,1.5e-05,0.000109,1e-05,-0.000196,-3e-06,-8e-06,7.1e-05,4e-06,-3e-05,5.3e-05,5.9e-05,-2e-06,-4e-06,0.000113,-3.4e-05,-9.9e-05,-4e-06,-4.3e-05,6e-06,-7e-06,-3e-06,1.9e-05,5.4e-05,3.8e-05,-4e-06,-4e-06,4e-06,-1.3e-05,-1.6e-05,-1e-05,1e-06,-4e-06,-2e-06,-6e-06,-1.1e-05,1.1e-05,-1.2e-05,1.3e-05,-1e-05,-1.5e-05,6e-06,-2.3e-05,-2e-06,2e-06,-1.8e-05
-1e-06,-2e-06,4e-06,-2e-06,1.1e-05,3e-06,-7e-06,3e-06,-1.1e-05,-1.2e-05,-2e-06,2e-06,1.2e-05,-8e-06,8e-06,8e-06,3e-06,6e-06,-4e-06,-5e-06,-2.2e-05,-2.3e-05,2.9e-05,-5e-06,2.3e-05,2.5e-05,4e-06,2e-06,-1.3e-05,-8.8e-05,-2e-05,1e-05,-4.5e-05,-6.2e-05,4.2e-05,-4.5e-05,-8.5e-05,-5.2e-05,6e-06,-6e-06,0.000332,9.8e-05,0.000113,-0.000199,-0.000291,-7.7e-05,-0.000452,0.000197,-0.000225,7.8e-05,0.000287,-6e-06,-0.000139,7.4e-05,1e-06,0.000285,-0.00038,0.000276,5.9e-05,-0.00035,-8.9e-05,-6.2e-05,3.8e-05,0.000246,0.00031,5.8e-05,6.3e-05,-9.3e-05,9e-06,6.3e-05,5.9e-05,5.4e-05,-1.2e-05,-3.9e-05,-0.000128,3.5e-05,-2e-06,4e-06,-4.7e-05,0.000124,-4e-06,3.8e-05,-3.7e-05,-1.6e-05,6e-05,-1.4e-05,-1.2e-05,1e-05,2.7e-05,-8e-06,-6e-06,3.9e-05,8.6e-05,-2.2e-05,3e-05,-1e-06,7.4e-05,2e-06,0.000133,8e-06,1e-05,-2.7e-05,1.7e-05,1.7e-05,1.4e-05,7e-06,-5e-06,4e-06,6e-06,-2e-06,9e-06,-1e-05,9e-06,-1.2e-05,1e-06,-6e-06,-1e-05,1e-05,-2e-06,-1.3e-05,1e-06
3e-06,-2e-06,-1.3e-05,0,-1e-06,-1.4e-05,-8e-06,1.3e-05,2.1e-05,-3e-06,0,-1.5e-05,2e-06,0,3e-06,1e-06,-9e-06,-1.8e-05,9e-06,1.3e-05,1e-06,1.2e-05,-4e-06,-1e-06,-2.5e-05,-2.5e-05,1e-06,-7e-06,4.8e-05,-1.4e-05,1.4e-05,3e-06,9e-06,5e-05,-5.9e-05,-2.2e-05,0.000115,-3.7e-05,-5.4e-05,-1.1e-05,6.4e-05,-0.000402,0.000142,-6.9e-05,0.000188,0.000141,5.5e-05,6.5e-05,0.000137,-0.000165,-1e-05,-9.8e-05,0.000216,-8.6e-05,-1.9e-05,0.00013,0.000266,-0.000128,5.8e-05,0.000247,0.000132,-5.5e-05,0.000127,-0.000202,-5.7e-05,-0.000173,-0.000135,0.000202,0.000174,-0.000173,-0.000149,-0.000282,0,-4.6e-05,4.6e-05,-5.2e-05,6e-06,2.4e-05,-3.7e-05,-0.00014,1.5e-05,-5.5e-05,1.7e-05,9e-06,-3.8e-05,-2.8e-05,4.7e-05,-1.8e-05,1.4e-05,-4e-06,3.6e-05,2.2e-05,-7.8e-05,1.2e-05,-5.2e-05,1.4e-05,-1.8e-05,-1.6e-05,-6.5e-05,-1.9e-05,4e-06,8e-06,3e-06,-1.4e-05,4e-06,0,2e-06,1.4e-05,-1.6e-05,3e-06,-2e-06,-1.1e-05,-1e-06,-7e-06,1e-05,-1.1e-05,6e-06,4e-06,-2.1e-05,1e-05,3e-06
1e-06,9e-06,1e-06,-2e-06,-5e-06,1.4e-05,-3e-06,1e-06,-2.1e-05,7e-06,-9e-06,-1.9e-05,-6e-06,-1.3e-05,-4e-06,2e-06,-1.2e-05,4e-06,-3e-06,-1e-06,3e-06,1.6e-05,4e-06,4e-06,4.1e-05,9e-06,-4e-06,-5e-06,-1.4e-05,4e-05,-8e-06,-1.1e-05,4e-06,2e-06,2.6e-05,4.6e-05,1.9e-05,4e-05,1.9e-05,-1e-06,-0.000109,-6.6e-05,0.000358,0.00013,-9.2e-05,-8.8e-05,1e-06,-3.5e-05,-0.000115,0.000152,0.000153,-0.000187,-0.000196,-0.000191,-8e-05,0.000192,-0.000281,-0.000163,4.6e-05,0.000137,-2.3e-05,4.2e-05,-9.1e-05,0.000219,9.1e-05,-1.4e-05,0.00013,-0.000145,-0.000124,-1.7e-05,3.1e-05,0.000136,4.2e-05,-0.000141,2e-06,1e-05,6.8e-05,-7.3e-05,-1e-06,8.5e-05,-1.9e-05,-7e-06,-3.1e-05,1e-06,3e-06,5e-06,-4.7e-05,-1.2e-05,-1.8e-05,-2.7e-05,-1.7e-05,7e-06,-5.6e-05,5e-06,4.1e-05,-9e-06,4e-06,1.6e-05,-5e-06,8e-06,-7e-06,5e-06,-6e-06,-1.2e-05,-1e-06,-1e-06,0,-6e-06,-1.2e-05,2e-06,-3e-06,-1.5e-05,-1e-05,8e-06,3e-06,-3e-06,-8e-06,-1e-05,1.5e-05,-2e-06,-3e-06
-1.2e-05,-5e-06,4e-06,1e-06,-1.3e-05,3e-06,-5e-06,3e-06,9e-06,1.3e-05,1e-06,-2e-06,4e-06,-1.1e-05,3e-06,9e-06,-7e-06,1.3e-05,1.7e-05,2e-06,-1e-05,-1.3e-05,1.2e-05,-2e-06,-3.3e-05,8e-06,4e-06,-4e-06,1.3e-05,-8.4e-05,1.4e-05,-5e-06,-5e-06,-1e-06,7e-06,8e-06,-2.8e-05,-5.9e-05,-2e-05,-4e-06,-0.000131,-0.000178,-0.000367,-0.000133,5.7e-05,3e-05,-9.9e-05,4e-06,0.000175,0.000128,1.4e-05,-4.7e-05,-0.000114,0.000119,5.2e-05,-8.6e-05,0.000189,6.3e-05,-0.00013,1e-05,-3.1e-05,-4.6e-05,0.000101,1e-06,-0.000166,-1.3e-05,-3.2e-05,-6.6e-05,-0.000104,0.000166,-3.5e-05,1e-04,-4.6e-05,-2.4e-05,-3e-06,1e-06,-9.3e-05,-3.8e-05,3e-05,-7.4e-05,1.1e-05,7e-06,3.5e-05,2.1e-05,3.1e-05,2e-06,8e-06,1.7e-05,2.8e-05,-2.8e-05,-1.1e-05,-5e-06,-4.1e-05,-1.5e-05,-2.8e-05,7e-06,1e-05,-4e-06,-2e-06,1e-05,-9e-06,1.2e-05,-6e-06,-1.4e-05,3e-06,8e-06,-2e-06,5e-06,-1e-06,-1e-06,-7e-06,-1.6e-05,-4e-06,-9e-06,-1.7e-05,-6e-06,9e-06,-1e-06,-8e-06,-3e-06,1e-05
5e-06,0,6e-06,-1e-06,1e-05,-2e-06,-6e-06,1e-06,-1.2e-05,2e-06,9e-06,0,3e-06,-9e-06,1e-06,-5e-06,3e-06,-1.9e-05,-2.2e-05,5e-06,0,-1.7e-05,-5e-06,-7e-06,1.1e-05,-9e-06,-5e-06,-6e-06,-4e-06,6.8e-05,-1.8e-05,-1.6e-05,0,8e-06,3.2e-05,-4.9e-05,1.4e-05,-1.8e-05,3e-06,7e-06,-3.2e-05,-0.000152,0.000167,-8e-06,0.000207,8.5e-05,0.000208,-0.000203,-6.8e-05,-0.000143,3.6e-05,-0.000102,-9.3e-05,-2.9e-05,4.3e-05,-8.2e-05,-6.2e-05,4.8e-05,2e-06,-0.000112,-7.5e-05,-0.000134,-3.1e-05,-0.000182,5.9e-05,-9.9e-05,9e-06,0.00011,0.00011,-1.8e-05,-8.4e-05,-0.000125,-7e-06,-2.6e-05,2.3e-05,-2.6e-05,4.9e-05,3.2e-05,3.4e-05,7.2e-05,2e-06,-2.9e-05,-3.8e-05,2e-06,-1.5e-05,-2.4e-05,3e-06,1e-05,-1.7e-05,3.4e-05,2.8e-05,-2.9e-05,4.1e-05,-1.2e-05,-1.4e-05,-8e-06,-3.1e-05,-6e-06,-8e-06,1.3e-05,-4e-06,1e-05,-2e-06,5e-06,-1e-05,7e-06,-4e-06,0,2e-06,3e-06,-9e-06,-6e-06,5e-06,4e-06,-1.3e-05,0,-8e-06,-1e-06,4e-06,-2e-06,0
4e-06,0,-5e-06,-1e-06,6e-06,-1e-05,6e-06,3e-06,5e-06,-8e-06,-1e-05,0,-5e-06,3e-06,-1e-06,-1e-06,-4e-06,4e-06,1.6e-05,-3e-06,1e-05,8e-06,1e-06,-6e-06,6e-06,-5e-06,0,-4e-06,-3e-06,-3.9e-05,1e-06,5e-06,-6e-06,-4e-05,-3.4e-05,1.2e-05,-3.4e-05,9e-06,1.2e-05,3e-06,7.1e-05,0.000435,6.8e-05,-0.000121,-6.4e-05,-9e-05,-0.000178,-9.1e-05,0.000211,-0.000165,-9.7e-05,-5.8e-05,-0.000175,0.000157,-1.9e-05,-3.2e-05,0.000115,8.3e-05,8e-06,-0.000101,4e-05,3e-05,7e-05,0.000163,-1.3e-05,-1.7e-05,1.7e-05,-5.8e-05,5.2e-05,-7.8e-05,0.000125,7.4e-05,2.7e-05,-3.7e-05,-4.5e-05,1.7e-05,4e-05,-8e-06,1.8e-05,-3.6e-05,-8e-06,4e-06,2.6e-05,1.1e-05,-1.4e-05,-1e-06,-4e-05,-2.3e-05,-2e-06,-1.3e-05,-1.5e-05,7e-06,0,-5e-06,-1.4e-05,-3e-06,-1.1e-05,1.2e-05,-2e-06,-1.3e-05,-1.3e-05,1.7e-05,8e-06,1e-06,1e-06,1e-06,1e-06,-1e-05,-2e-06,-3e-06,0,-1e-06,-5e-06,2e-06,3e-06,0,5e-06,-1e-06,1.2e-05,-3e-06,-5e-06
-6e-06,-2e-06,-5e-06,1e-06,-4e-06,8e-06,-4e-06,0,-1e-06,-1e-06,4e-06,1e-06,-3e-06,1e-05,1e-06,1e-06,0,3e-06,-1.4e-05,7e-06,-6e-06,1.2e-05,6e-06,-1e-06,-2e-06,-4e-06,-1e-06,-3e-06,2.1e-05,2.1e-05,-9e-06,-4e-06,6e-06,3.9e-05,2.5e-05,3.8e-05,-3.9e-05,-3e-06,4.5e-05,7e-06,8.3e-05,-0.000102,0.000125,3.5e-05,4.7e-05,8.7e-05,1.6e-05,8.4e-05,-0.000222,-0.000218,4.3e-05,2.6e-05,3e-05,-0.000126,-5.6e-05,-4.1e-05,-6e-06,-0.000259,2.3e-05,6.7e-05,-1.7e-05,4.7e-05,-3.6e-05,-0.000121,-2e-05,0.000107,-6.5e-05,4.4e-05,-4.9e-05,-0.000113,8e-06,-9.9e-05,-6e-06,2.3e-05,-8e-06,-1.9e-05,-4e-05,-5e-06,-6e-06,4.6e-05,7e-06,5.9e-05,-1.1e-05,-1.2e-05,-4e-06,1.2e-05,7e-06,1.2e-05,8e-06,4e-06,-1.6e-05,2.4e-05,9.9e-05,-2e-06,2e-05,2e-06,-1.2e-05,-1e-05,-4.5e-05,-1e-05,-2.2e-05,0,4e-06,-7e-06,0,-3e-06,0,3e-06,-8e-06,-3e-06,3e-06,2e-06,-2e-06,-9e-06,5e-06,-2e-06,-7e-06,-4e-06,-1e-05,8e-06,5e-06
1e-06,-3e-06,6e-06,1e-06,-1e-05,0,-6e-06,-6e-06,0,4e-06,2e-06,-1e-06,2e-06,8e-06,2e-06,-5e-06,4e-06,-8e-06,9e-06,2e-06,-3e-06,-8e-06,5e-06,1e-06,-9e-06,0,-1e-06,-3e-06,-3e-05,-1.3e-05,-1.6e-05,2e-06,1e-06,3.1e-05,-2.4e-05,-2.3e-05,5.3e-05,-2.8e-05,-7.8e-05,2e-06,2.3e-05,-0.000104,-0.000219,-6.8e-05,-0.000103,-4.8e-05,7.1e-05,3.1e-05,8.6e-05,-5.4e-05,-8e-05,-7.3e-05,-0.000195,-8.9e-05,3.8e-05,5.4e-05,-1.4e-05,9.6e-05,8e-06,3e-06,-3.4e-05,4.1e-05,0.000187,4.2e-05,3e-06,0.000154,5.1e-05,8.8e-05,-5.8e-05,5.4e-05,-2e-05,9.2e-05,-2.3e-05,6.5e-05,6e-05,-2e-06,1.3e-05,-3.1e-05,-3.2e-05,-6.1e-05,-9e-06,-3e-05,6e-06,6e-06,-8e-06,9e-06,2.3e-05,-3e-06,-1.4e-05,-1.5e-05,2.6e-05,1.1e-05,-1.4e-05,-4e-06,-1.7e-05,-3e-06,1e-05,2e-06,1.9e-05,-2e-06,-6e-06,-9e-06,2e-06,-1.1e-05,2e-06,-4e-06,-1e-06,-1e-05,-9e-06,0,0,5e-06,3e-06,2e-06,8e-06,-2e-06,9e-06,3e-06,9e-06,-7e-06,-9e-06
-1e-06,2e-06,-2e-06,0,4e-06,1e-06,4e-06,0,0,-2e-06,-9e-06,-5e-06,-4e-06,3e-06,-1e-06,1e-06,5e-06,8e-06,0,-5e-06,7e-06,-1.3e-05,-3e-06,1e-06,6e-06,-9e-06,1e-06,-2e-06,1.4e-05,-6e-06,1.7e-05,5e-06,-2e-06,-4.5e-05,1.8e-05,-1.9e-05,6e-06,-7e-06,5.3e-05,2e-06,-4.7e-05,-0.000267,1.2e-05,-4.8e-05,-0.000109,-3e-05,-0.000253,-1.9e-05,-2e-04,-9.5e-05,0.000107,-5.3e-05,0.000211,0.000153,2.5e-05,-7.7e-05,-8.2e-05,3.4e-05,6e-06,7.3e-05,3.9e-05,-4.1e-05,-3.2e-05,-4.4e-05,-6.5e-05,-4.3e-05,-4e-05,6e-06,4.3e-05,0.000117,5e-05,-6e-06,-1e-06,5.9e-05,3e-06,-8e-06,-1e-06,-2.3e-05,-2.4e-05,5.8e-05,1.2e-05,-8.8e-05,-1.2e-05,-1.3e-05,-2e-06,-9e-06,3.2e-05,2e-06,1.5e-05,1e-06,-4e-06,-2.8e-05,7e-06,-3e-06,2.8e-05,6e-06,1.6e-05,3e-06,-1e-05,-2e-06,-1.2e-05,-6e-06,-4e-06,-4e-06,6e-06,-1e-06,1e-06,2e-06,-1e-06,2e-06,-1e-06,5e-06,-1e-06,-6e-06,4e-06,-4e-06,-5e-06,-2e-06,-3e-06,2e-06,6e-06
-3e-06,1e-06,-4e-06,-2e-06,2e-06,-2e-06,-8e-06,-1e-06,-6e-06,-7e-06,7e-06,-6e-06,-3e-06,1e-06,3e-06,1e-06,4e-06,-7e-06,-2e-06,4e-06,-7e-06,5e-06,3e-06,-2e-06,-3e-06,5e-06,0,-1e-06,-1.5e-05,-1.4e-05,-2e-05,0,7e-06,-8e-06,-3.7e-05,2.6e-05,-1.7e-05,0,-5.3e-05,0,-4.6e-05,-5e-06,0.000166,-8.3e-05,0.000138,3.7e-05,7.3e-05,1e-06,8.6e-05,-8.3e-05,5.7e-05,-1.3e-05,-9e-06,-1.6e-05,-3.8e-05,6.7e-05,2.9e-05,-1.8e-05,1.3e-05,-0.00011,-4.7e-05,2.5e-05,2.9e-05,-6e-06,8.5e-05,-9e-05,2.4e-05,-5.1e-05,6e-05,-8.1e-05,-2.2e-05,-4.8e-05,5e-06,-1.3e-05,4.7e-05,-1.5e-05,-7e-06,-1.4e-05,-9e-06,-7.4e-05,-1e-05,2.3e-05,1.3e-05,6e-06,5e-06,8e-06,-1.7e-05,-1e-06,-1.5e-05,1.2e-05,-1.4e-05,1e-06,-6.4e-05,3e-06,1.2e-05,-2e-06,-5e-06,-9e-06,3.8e-05,8e-06,-1.7e-05,-8e-06,-3e-06,2e-06,-7e-06,-1e-06,0,3e-06,5e-06,-1e-06,-4e-06,8e-06,-4e-06,5e-06,-3e-06,-2e-06,3e-06,-6e-06,4e-06,-3e-06,1e-06
3e-06,0,2e-06,1e-06,3e-06,-2e-06,-2e-06,-2e-06,5e-06,-2e-06,-1e-06,-5e-06,1e-06,-5e-06,1e-06,-2e-06,0,-6e-06,2e-06,-4e-06,-1e-06,1e-05,3e-06,-2e-06,-8e-06,-2e-06,0,-1e-06,7e-06,4.6e-05,1.6e-05,1e-06,-2e-06,2.2e-05,1.9e-05,8e-06,2.8e-05,2e-06,4.5e-05,0,-4.2e-05,0.000341,-0.000246,0.000213,5.1e-05,1.5e-05,-7.3e-05,3.5e-05,-2.6e-05,-1.1e-05,1.5e-05,-9.9e-05,0.000104,-1.4e-05,1.2e-05,2.3e-05,-4.9e-05,1.6e-05,-1.3e-05,-1.3e-05,-5e-06,2e-05,2.2e-05,5e-06,-3e-06,-2.7e-05,-2.5e-05,2.6e-05,-6.6e-05,-0.000108,-4e-05,5e-05,-1.1e-05,1.7e-05,1.2e-05,7e-06,4e-05,-3.2e-05,9e-06,6.3e-05,0,2.7e-05,-1e-05,-4e-06,1.1e-05,1.5e-05,-2.1e-05,-3e-06,1.1e-05,-3e-06,1.4e-05,3e-06,-9e-06,2e-06,1.1e-05,2e-06,1.5e-05,9e-06,2e-05,-3e-06,-7e-06,-6e-06,0,-3e-06,0,-2e-06,0,6e-06,-6e-06,1e-06,-5e-06,6e-06,1e-06,-5e-06,-8e-06,-5e-06,-4e-06,6e-06,-1e-06,3e-06,-2e-06
-2e-06,1e-06,3e-06,0,-4e-06,4e-06,1e-06,-2e-06,-6e-06,7e-06,-1e-06,-1e-06,0,-1e-06,0,4e-06,-2e-06,1.1e-05,-2e-06,0,5e-06,-5e-06,-4e-06,0,8e-06,-5e-06,1e-06,-1e-06,-3e-06,-4e-05,-1.8e-05,6e-06,-2e-06,6e-06,1.5e-05,-2.4e-05,-2.6e-05,-2.1e-05,-9e-06,0,5.5e-05,-9.1e-05,8.1e-05,1.9e-05,-2.5e-05,-1.6e-05,-5.1e-05,-6.5e-05,0.000114,-8.5e-05,1.5e-05,-5.4e-05,0.000105,1.7e-05,3e-06,7.9e-05,1.2e-05,-5.9e-05,1.7e-05,0.00014,8e-06,2e-05,2.6e-05,-3.7e-05,4.8e-05,1e-05,2.6e-05,-5.6e-05,-7e-06,-3.9e-05,3.4e-05,-9.3e-05,1e-05,1.7e-05,-8e-06,-1.7e-05,-4.2e-05,-6e-06,2.1e-05,-7e-05,5e-06,2.1e-05,2e-06,7e-06,-5e-06,-1.5e-05,9e-06,1e-06,-5e-06,6e-06,-6e-06,1.6e-05,6e-06,-9e-06,-1e-05,-3e-06,-1e-06,-4e-06,-5.1e-05,-2e-06,-9e-06,0,3e-06,-6e-06,-1e-06,1e-06,-2e-06,1e-06,-8e-06,0,-1e-06,0,2e-06,3e-06,-6e-06,-3e-06,4e-06,-4e-06,4e-06,-1e-06,6e-06
-1e-06,-1e-06,0,-1e-06,-4e-06,1e-06,-4e-06,0,5e-06,5e-06,0,-1e-06,-2e-06,-7e-06,0,1e-06,-1e-06,-7e-06,-1e-06,-1e-06,-2e-06,-1.1e-05,3e-06,0,-1e-06,0,0,0,-7e-06,1.3e-05,1e-06,-6e-06,2e-06,-3e-06,8e-06,-1e-06,-2.2e-05,-1.7e-05,1.8e-05,-1e-06,4.3e-05,1.8e-05,-5.9e-05,-0.000107,-9e-06,-2.6e-05,9e-05,2.3e-05,-5.1e-05,-1e-05,-9.1e-05,-4e-06,-1.6e-05,-3e-05,-2e-06,-1.6e-05,4.4e-05,0.000101,-2.6e-05,-5e-05,1.5e-05,2e-05,-0.000102,9.4e-05,-8.8e-05,1.8e-05,-3e-05,-9e-06,2.6e-05,8.6e-05,-4.1e-05,0.000112,7e-06,-3.6e-05,-1.1e-05,-6e-06,1.5e-05,-2.3e-05,1.7e-05,6.2e-05,-5e-06,7e-06,4e-06,1e-06,-1e-06,-2e-06,-4e-06,1e-06,-4e-06,3e-06,-8e-06,0,1.9e-05,-1e-05,1.1e-05,-2e-06,-7e-06,0,1.8e-05,5e-06,-1e-05,4e-06,2e-06,-5e-06,-2e-06,4e-06,0,0,-1e-06,0,1e-06,-2e-06,-2e-06,-1e-06,4e-06,-3e-06,-1e-06,-2e-06,-4e-06,-2e-06,-8e-06
2e-06,-1e-06,-3e-06,0,3e-06,-2e-06,0,2e-06,-4e-06,-3e-06,-1e-06,0,2e-06,7e-06,2e-06,-3e-06,-1e-06,-2e-06,4e-06,-3e-06,-1e-06,3e-06,3e-06,-2e-06,-1e-06,3e-06,0,0,5e-06,5e-06,-7e-06,4e-06,1e-06,-2.8e-05,-1.8e-05,2.3e-05,2.7e-05,1.4e-05,-3e-05,0,-8e-06,-0.00014,5.9e-05,0.000107,-9.6e-05,2.7e-05,-0.000112,9.9e-05,4.4e-05,2.9e-05,-7e-06,-6.6e-05,9e-05,1.2e-05,-2.3e-05,-4e-05,-6.6e-05,-3.8e-05,6e-06,-3.7e-05,-8e-06,4e-06,-3.2e-05,-9.6e-05,7.4e-05,-5e-05,2e-05,3.8e-05,2.5e-05,0.000135,0,-4.6e-05,-1.9e-05,-1.7e-05,-2.4e-05,-2e-06,2.6e-05,5e-06,-2e-06,-5.3e-05,9e-06,-2.6e-05,-3e-06,1e-05,8e-06,7e-06,-7e-06,1e-06,4e-06,-5e-06,1.4e-05,-1.6e-05,3e-06,0,-1.1e-05,0,-8e-06,4e-06,-2e-05,0,-4e-06,8e-06,0,-3e-06,6e-06,0,0,-2e-06,2e-06,0,2e-06,-3e-06,-2e-06,-5e-06,8e-06,-1e-06,1e-06,-3e-06,-2e-06,2e-06,4e-06
-3e-06,0,1e-06,1e-06,2e-06,-1e-06,0,0,4e-06,-3e-06,-1e-06,0,2e-06,4e-06,0,3e-06,-3e-06,6e-06,-5e-06,2e-06,4e-06,9e-06,-2e-06,-2e-06,3e-06,-5e-06,0,0,-1e-05,-2.3e-05,-1e-06,-4e-06,1e-06,1.5e-05,1.1e-05,-5e-06,-1e-06,-5e-06,4e-06,0,-3.5e-05,7e-06,-0.00011,3e-06,5.7e-05,-1e-05,6.1e-05,-3.4e-05,-7.3e-05,6.5e-05,-9e-06,-1.1e-05,-0.000101,-3.1e-05,1.5e-05,-3.6e-05,8.3e-05,-2e-06,-1e-05,-3.8e-05,-2.7e-05,-2.6e-05,1.2e-05,4.1e-05,-5e-06,-1.1e-05,-1.6e-05,-3.8e-05,-4.2e-05,-6.2e-05,1.7e-05,-4.5e-05,-6e-06,-1.8e-05,2e-06,-1.2e-05,-3.4e-05,-8e-06,-1.5e-05,4.7e-05,-1e-05,-4e-05,-1e-06,0,-5e-06,-4e-06,-4e-06,-2e-06,-2e-06,9e-06,-7e-06,-1e-06,2.3e-05,3e-06,-4e-06,0,-8e-06,-3e-06,-4e-06,2e-06,0,2e-06,-1e-06,-1e-06,-2e-06,0,0,-6e-06,-2e-06,0,-1e-06,-4e-06,0,4e-06,1e-06,-2e-06,-2e-06,2e-06,0,-3e-06,-3e-06
0,2e-06,2e-06,1e-06,0,2e-06,-2e-06,0,-4e-06,3e-06,2e-06,-3e-06,-1e-06,4e-06,1e-06,-1e-06,-1e-06,-8e-06,5e-06,0,-3e-06,-3e-06,1e-06,-1e-06,1e-06,-2e-06,0,0,1.6e-05,2.8e-05,-3e-06,2e-06,-1e-06,1.6e-05,-2.2e-05,-2e-05,-8e-06,-2.4e-05,3e-06,0,3e-06,0.00011,8.8e-05,-8e-05,2.6e-05,2.2e-05,-3.5e-05,7e-06,1.8e-05,2.5e-05,5e-05,0,-1.7e-05,4.2e-05,-2e-06,-2.4e-05,-7.6e-05,3.7e-05,1.2e-05,6.6e-05,5e-05,-4.1e-05,-6.9e-05,4.1e-05,-1.2e-05,9.4e-05,-1.9e-05,1.5e-05,-2.8e-05,-0.000104,-1.6e-05,6.9e-05,2e-05,1e-06,-1.4e-05,-3e-06,8e-06,-2e-06,-1.8e-05,-4.9e-05,6e-06,8e-06,0,0,-5e-06,-5e-06,1e-05,-1e-06,-3e-06,-2e-05,-6e-06,1e-05,-4e-06,-3e-06,-4e-06,4e-06,4e-06,1e-06,4e-06,-4e-06,-3e-06,5e-06,-1e-06,-5e-06,0,2e-06,0,2e-06,-6e-06,-1e-06,-3e-06,-2e-06,2e-06,-7e-06,-5e-06,-2e-06,0,-1e-06,0,3e-06,-1e-06
0,0,-3e-06,-1e-06,-3e-06,1e-06,0,1e-06,2e-06,3e-06,0,-2e-06,0,1e-06,1e-06,-1e-06,0,4e-06,-4e-06,-2e-06,-2e-06,-1e-05,1e-06,0,-7e-06,6e-06,0,1e-06,-9e-06,-1.3e-05,0,-4e-06,0,-1.6e-05,1.3e-05,1.2e-05,2e-05,5e-06,6e-06,0,-6e-06,-8.9e-05,-3.3e-05,8e-05,-2.7e-05,-2.3e-05,-8.7e-05,3e-06,-3.2e-05,-1.8e-05,4.8e-05,-5.9e-05,-9.8e-05,2.3e-05,-1.5e-05,2.8e-05,5.1e-05,-7e-05,-1e-06,-2e-05,-1.6e-05,-4e-06,-2.2e-05,-7e-05,-5e-05,5.1e-05,2.3e-05,1.1e-05,5.7e-05,4e-06,2.4e-05,-4.8e-05,-1e-06,-1.3e-05,-7e-06,-7e-06,1.8e-05,-3e-06,-9e-06,3.8e-05,-2e-06,2.6e-05,5e-06,-6e-06,-1e-06,1e-06,1.3e-05,3e-06,2e-06,1.7e-05,1.3e-05,6e-06,-7e-06,-5e-06,1.1e-05,0,-2e-06,2e-06,-1.5e-05,1e-06,0,-3e-06,1e-06,-4e-06,0,0,0,-2e-06,-3e-06,1e-06,-2e-06,-3e-06,-1e-06,4e-06,-5e-06,-2e-06,1e-06,0,1e-06,-4e-06,4e-06
0,1e-06,0,0,1e-06,-2e-06,-2e-06,1e-06,-1e-06,-3e-06,-2e-06,-2e-06,2e-06,-5e-06,1e-06,1e-06,1e-06,2e-06,3e-06,3e-06,2e-06,1e-06,-1e-06,0,3e-06,-8e-06,0,1e-06,7e-06,-3e-06,-3e-06,2e-06,2e-06,-5e-06,-1e-06,1.4e-05,-1.4e-05,2e-06,1e-06,0,-7e-06,0.000167,-3.5e-05,1.4e-05,1e-06,-1e-06,5.7e-05,-5.7e-05,3.5e-05,-3.1e-05,7e-06,-3.1e-05,-2.1e-05,-8.6e-05,1e-05,8e-06,-1.4e-05,4.3e-05,9e-06,5e-06,6e-06,-7e-06,4.8e-05,6.4e-05,2.9e-05,-4e-05,-2e-05,-5e-06,-3e-06,9.2e-05,9e-06,5e-05,-1.1e-05,-4e-06,2e-06,-4e-06,-1.2e-05,-6e-06,7e-06,-4.4e-05,0,-2e-06,-1e-05,0,-1e-06,4e-06,-4e-06,-3e-06,-2e-06,-1.2e-05,-7e-06,-8e-06,-1.9e-05,-1e-06,-6e-06,0,5e-06,-4e-06,2.8e-05,-3e-06,7e-06,-3e-06,1e-06,-2e-06,-4e-06,-2e-06,0,3e-06,-1e-06,0,-2e-06,-2e-06,-2e-06,-4e-06,-2e-06,-2e-06,0,-2e-06,-2e-06,2e-06,-4e-06
-1e-06,-1e-06,3e-06,1e-06,1e-06,-1e-06,0,0,0,-5e-06,2e-06,-3e-06,-1e-06,-3e-06,0,0,2e-06,-9e-06,-2e-06,-3e-06,0,9e-06,0,-1e-06,1e-06,-3e-06,0,1e-06,-1e-06,1.3e-05,-4e-06,-2e-06,-2e-06,5e-06,3e-06,-1.7e-05,-1.4e-05,-1.8e-05,1e-05,0,2.7e-05,-6.3e-05,4.9e-05,-7.1e-05,-6.8e-05,2.4e-05,-1e-04,1.7e-05,1.8e-05,-2.9e-05,-4.3e-05,-3.5e-05,-7.2e-05,4.7e-05,-9e-06,3e-05,2.9e-05,-3.3e-05,3e-06,-3.5e-05,1e-05,-1.4e-05,3e-06,-3.1e-05,4.5e-05,-0.000104,1.4e-05,7e-06,-3.7e-05,7.2e-05,-1.3e-05,-5.7e-05,5e-06,1e-05,-1e-06,-8e-06,5e-06,1.1e-05,1.7e-05,4.3e-05,-1e-06,0,8e-06,-6e-06,-3e-06,-1e-06,-9e-06,2e-06,1e-06,1.1e-05,-7e-06,-5e-06,3e-06,1e-06,1e-05,-1e-06,9e-06,3e-06,-1e-06,-1e-06,5e-06,-3e-06,0,-1e-06,4e-06,0,0,2e-06,1e-06,0,1e-06,1e-06,1e-06,2e-06,3e-06,-2e-06,0,-3e-06,2e-06,0,3e-06
-1e-06,0,1e-06,0,1e-06,0,-3e-06,0,1e-06,1e-06,-1e-06,-1e-06,-2e-06,-3e-06,1e-06,-1e-06,0,7e-06,0,2e-06,-1e-06,-1e-06,2e-06,-1e-06,-2e-06,4e-06,0,1e-06,-1e-06,-7e-06,-3e-06,2e-06,0,6e-06,1e-06,-7e-06,1.9e-05,0,-3.2e-05,0,6e-06,-6.2e-05,3.2e-05,3.3e-05,4.2e-05,-8e-06,1.9e-05,3.2e-05,1.6e-05,-2.2e-05,-5e-05,-5.4e-05,-6e-06,2e-06,5e-06,3e-06,-2.5e-05,1.2e-05,-2e-06,-7e-06,1.5e-05,0,-3.2e-05,-1.2e-05,-4.4e-05,-3e-06,-1e-05,2.5e-05,-1.3e-05,-0.000106,-2e-06,2.8e-05,8e-06,1.6e-05,1.6e-05,-6e-06,-1.2e-05,1e-06,1.5e-05,-4.6e-05,-2e-06,-6e-06,-5e-06,-1e-06,-2e-06,-6e-06,-4e-06,-2e-06,-1e-06,-8e-06,1.4e-05,1e-06,-4e-06,-3e-06,-1e-06,-2e-06,4e-06,-2e-06,1.3e-05,3e-06,3e-06,-4e-06,-1e-06,-4e-06,0,0,0,-1e-06,-3e-06,0,2e-06,1e-06,2e-06,0,5e-06,-3e-06,0,1e-06,-3e-06,-1e-06,-2e-06
0,-1e-06,-2e-06,-1e-06,-3e-06,2e-06,-1e-06,0,-1e-06,5e-06,1e-06,-1e-06,1e-06,-4e-06,0,1e-06,0,-1e-06,2e-06,0,1e-06,-9e-06,-1e-06,0,-1e-06,-4e-06,0,0,7e-06,-1.1e-05,-7e-06,-2e-06,0,-4e-06,9e-06,1.7e-05,-9e-06,1e-06,2.1e-05,0,-1.7e-05,-5.1e-05,-1.3e-05,-4.5e-05,2.3e-05,-1.1e-05,-2e-06,-1.1e-05,5e-06,-1.9e-05,-1.3e-05,-2.5e-05,7.4e-05,-2e-06,-8e-06,1.1e-05,5.7e-05,1.3e-05,2e-06,7.7e-05,4e-06,2.8e-05,5.6e-05,2.9e-05,1.1e-05,7.4e-05,2e-06,-5e-06,4.2e-05,-0.000114,2e-06,2.6e-05,-1.1e-05,-9e-06,0,-1e-06,1e-05,1.2e-05,2e-06,4.9e-05,5e-06,-2.4e-05,4e-06,-1e-06,0,6e-06,8e-06,2e-06,-2e-06,-5e-06,-7e-06,8e-06,2e-06,-6e-06,-1e-06,0,-2e-06,-1e-06,-8e-06,0,1e-05,1e-06,-1e-06,-4e-06,0,0,0,1e-06,-6e-06,1e-06,0,2e-06,-2e-06,-2e-06,3e-06,-2e-06,1e-06,0,1e-06,1e-06,-1e-06
-1e-06,1e-06,-1e-06,0,1e-06,-1e-06,1e-06,-1e-06,1e-06,0,1e-06,-1e-06,0,5e-06,1e-06,0,0,-5e-06,-3e-06,-1e-06,1e-06,0,-1e-06,-1e-06,6e-06,-2e-06,0,1e-06,-1.1e-05,2.7e-05,5e-06,4e-06,-1e-06,-3e-06,-1.4e-05,2e-06,-8e-06,-4e-06,-1.9e-05,0,-1.3e-05,-6.7e-05,-6.9e-05,-7e-06,-3.6e-05,1e-06,-7.9e-05,-1.5e-05,-1.1e-05,-7.5e-05,2.6e-05,-1.5e-05,-1.8e-05,8e-06,1.8e-05,-1.1e-05,-9.4e-05,-5.5e-05,-6e-06,-5e-06,-1e-05,1.1e-05,2.2e-05,-2.2e-05,-2.9e-05,3e-06,-6e-06,-2.8e-05,9e-06,3.8e-05,-9e-06,-6.7e-05,1e-06,3e-06,-1.8e-05,-5e-06,1e-05,5e-06,-1.1e-05,-5e-05,-5e-06,-4e-06,-9e-06,4e-06,2e-06,4e-06,4e-06,2e-06,5e-06,8e-06,-7e-06,0,1e-06,-1e-06,-1e-05,1e-06,-6e-06,3e-06,-2.9e-05,2e-06,8e-06,2e-06,0,-2e-06,2e-06,0,0,-2e-06,-2e-06,0,-1e-06,2e-06,-1e-06,2e-06,-2e-06,-3e-06,-1e-06,-1e-06,1e-06,-2e-06,3e-06
