-9.4e-05,-0.009421,-0.05108,-0.026068,-0.008004,-0.074064,-0.176191,-0.196294,-0.203613,-0.155032,-0.147844,-0.124249,-0.08565,-0.058619,-0.037543,-0.010882,-0.005161,-0.00106,-0.001347,-0.00141,-0.000416,-0.00031,-0.000271,-0.000205,-4.7e-05,0,0,2e-06
-6.2e-05,-0.007926,-0.042868,-0.021113,-0.000672,0.015706,0.002826,0.031818,0.008189,0.079928,0.105283,0.115069,0.088011,0.055263,0.037461,0.011487,0.00612,0.001009,0.000603,0.001119,0.000541,-0.00019,-0.000293,-0.000232,-5.3e-05,-2e-06,-2e-06,3e-06
-1.1e-05,0.003139,0.019738,0.009007,-0.000963,-0.018507,-0.060782,-0.046616,-0.027024,-0.009971,-0.003587,0.00139,-0.003953,-0.001062,0.002966,0.001435,0.000268,-0.000396,-0.000236,-0.000646,-0.000451,0.000123,1.9e-05,1.7e-05,1.4e-05,-2e-06,-5e-06,0
5.4e-05,0.009225,0.051743,0.024995,-0.003546,-0.068648,-0.103046,-0.111076,-0.065627,-0.109673,-0.130443,-0.124651,-0.092769,-0.065949,-0.043305,-0.013201,-0.006382,-0.001352,-0.001126,-0.00108,-8.8e-05,0.000227,0.00029,0.000242,7e-05,2e-06,0,3e-06
8.3e-05,0.003033,0.012763,0.006906,0.003943,0.048739,0.174799,0.198793,0.188939,0.118728,0.106747,0.100532,0.070288,0.047435,0.030297,0.008348,0.004511,0.000954,0.000324,0.000956,0.000854,4.2e-05,0.000224,0.000186,4.9e-05,5e-06,4e-06,2e-06
-2e-05,-0.007414,-0.043746,-0.020691,0.00179,0.055003,0.13832,0.142613,0.117398,0.09169,0.085505,0.065253,0.040137,0.036302,0.024754,0.007369,0.002935,0.000567,4e-04,-0.000669,-0.00084,-0.000175,-0.000103,-8.6e-05,-2.4e-05,5e-06,4e-06,-1e-06
-9e-05,-0.00651,-0.033743,-0.016521,-0.006162,-0.065488,-0.146646,-0.182689,-0.198179,-0.125904,-0.117792,-0.123947,-0.075743,-0.053394,-0.042916,-0.012502,-0.006333,-0.001164,-0.000621,-0.000613,-4.4e-05,-7.2e-05,-0.000263,-0.000219,-5.4e-05,2e-06,1e-06,0
-1.5e-05,0.003219,0.021803,0.010074,0.000382,-0.014763,-0.057983,-0.06528,-0.109875,-0.036202,-0.004876,0.015736,0.022074,0.006624,0.003875,0.001146,0.001545,0.000289,-0.000373,0.000207,0.000476,8.7e-05,-7.1e-05,-5.6e-05,-6e-06,0,-1e-06,5e-06
5.3e-05,0.006911,0.038939,0.018363,0.005891,0.062611,0.055176,0.064127,0.072349,0.054435,0.066577,0.07986,0.041216,0.035986,0.033959,0.010799,0.00486,0.000969,0.000469,-0.000218,-0.000382,4.9e-05,0.000169,0.000149,4.6e-05,-1e-06,-1e-06,5e-06
3.8e-05,0.001312,0.003501,0.001749,-0.000832,-0.025101,-0.08733,-0.085525,0.01577,-0.031531,-0.059041,-0.069374,-0.051266,-0.036235,-0.027789,-0.008131,-0.004718,-0.000806,1.8e-05,-0.000427,-0.000105,-4.1e-05,0.000167,0.000149,3.8e-05,-1e-06,-3e-06,-1e-06
0,-0.005128,-0.031623,-0.014669,-0.003711,-0.032925,-0.007257,0.025387,0.05534,0.017213,-0.004269,-0.010581,0.002575,-0.009693,-0.011617,-0.004347,-0.001105,-0.000176,-0.000672,-0.000451,0.000347,3e-06,4e-06,-1e-06,-4e-06,3e-06,3e-06,2e-06
-3e-05,-0.004205,-0.021466,-0.009622,0.000896,0.047392,0.14546,0.163655,0.089812,0.065565,0.076357,0.075752,0.037517,0.036324,0.034574,0.010244,0.005139,0.000871,-6.7e-05,-0.000416,-0.000424,5.7e-05,-0.000119,-0.000116,-3.1e-05,6e-06,7e-06,6e-06
-3.3e-05,0.002214,0.016386,0.007004,-0.000585,-0.014465,-0.01631,-0.052811,-0.083971,-0.040731,-0.030378,-0.040149,-0.027423,-0.012799,-0.012124,-0.003198,-0.002716,-0.000623,0.000428,0.000793,0.000183,-2.1e-05,-0.000111,-9.2e-05,-1.9e-05,4e-06,3e-06,6e-06
1.8e-05,0.004836,0.027352,0.011925,-0.001997,-0.057613,-0.099369,-0.121576,-0.135996,-0.058257,-0.046219,-0.04373,-0.005551,-0.019487,-0.024083,-0.00755,-0.003102,-0.000654,-0.000352,6e-06,0.000195,-4.6e-05,2.4e-05,3.6e-05,1.5e-05,2e-06,1e-06,3e-06
5.1e-05,0.00038,-0.00086,7e-04,0.002768,0.043626,0.051512,0.057219,0.031314,0.017835,0.029881,0.052558,0.024417,0.023089,0.026568,0.008253,0.004755,0.000792,-0.000371,-0.000696,-0.000336,0,0.00012,0.000113,2.9e-05,-2e-06,-5e-06,-5e-06
-2e-06,-0.00329,-0.020918,-0.009083,0.002376,0.041489,0.001937,0.009822,0.093717,0.014278,-0.007828,0.000356,-0.016828,0.000302,0.005325,0.002338,-0.000356,-0.000147,0.000254,0.000415,0.000194,5.5e-05,3.5e-05,2.9e-05,4e-06,-3e-06,-7e-06,-7e-06
-4.9e-05,-0.002051,-0.010117,-0.00589,-0.002677,-0.042549,-0.09083,-0.064615,0.027304,0.011493,-0.018439,-0.039669,-0.004171,-0.018083,-0.027753,-0.008988,-0.004046,-0.000848,-0.000141,0.000284,0.000112,1.5e-05,-8.5e-05,-7.6e-05,-2.1e-05,-1e-06,-5e-06,-7e-06
-1.9e-05,0.001365,0.010935,0.004133,-0.001412,0.003794,0.066705,0.083822,0.013337,0.036546,0.048253,0.030082,0.019475,0.014271,0.013127,0.003504,0.003188,0.000601,-5.8e-05,0.000208,-7e-05,-3.4e-05,-7.6e-05,-6.5e-05,-1.6e-05,0,-3e-06,-6e-06
9e-06,0.002358,0.014191,0.007484,0.001971,0.03459,0.095416,0.055787,-0.035668,-0.019668,0.006082,0.014267,-0.017722,0.003022,0.016458,0.005218,0.001321,2e-04,0.000303,0.000345,-5.4e-05,-7.3e-05,-1.6e-05,-3e-06,3e-06,3e-06,0,-4e-06
