0.006882,0.006824,0.006183,0.005651,0.00521,0.00525,0.005322,0.00565,0.006168,0.005374,0.004805,0.004714,0.004152,0.004059,0.005289,0.007763,0.01074,0.011734,0.009875,0.008722,0.009142,0.008947,0.008269,0.008137,0.007773,0.007542,0.007747,0.007632
0.008755,0.00858,0.007643,0.006888,0.006279,0.006328,0.006492,0.006863,0.007371,0.006442,0.005796,0.005769,0.005124,0.004874,0.006361,0.009361,0.012632,0.013553,0.011532,0.010386,0.010932,0.010794,0.010053,0.009905,0.009481,0.009191,0.009269,0.008922
0.012092,0.011722,0.010398,0.009134,0.008058,0.008147,0.008468,0.00872,0.009079,0.008052,0.007341,0.007486,0.006874,0.006347,0.008127,0.011943,0.015479,0.016088,0.014044,0.013119,0.01377,0.013605,0.012754,0.012621,0.012318,0.012224,0.012099,0.011189
0.015163,0.014428,0.013025,0.011345,0.009621,0.009664,0.010009,0.009794,0.009842,0.008856,0.008146,0.008662,0.008518,0.007717,0.00936,0.0136,0.017094,0.017309,0.015733,0.015465,0.015852,0.015255,0.014323,0.01405,0.014341,0.015672,0.015526,0.013531
0.017401,0.015819,0.014839,0.013386,0.011049,0.010958,0.011333,0.010596,0.010347,0.009331,0.008455,0.009336,0.009818,0.008858,0.010191,0.014969,0.019076,0.018763,0.01728,0.01756,0.017348,0.016572,0.015975,0.015128,0.016103,0.019824,0.01966,0.016108
0.019177,0.016532,0.016115,0.015096,0.012433,0.012491,0.013096,0.012007,0.011653,0.010637,0.009134,0.009844,0.010744,0.009961,0.011565,0.017824,0.02337,0.022318,0.020131,0.02014,0.019357,0.019013,0.019009,0.017291,0.018338,0.024184,0.023733,0.018464
0.020893,0.01809,0.017487,0.015992,0.013233,0.013581,0.014407,0.013441,0.013412,0.012429,0.010177,0.010401,0.011479,0.011138,0.013338,0.021415,0.028529,0.027182,0.024454,0.023778,0.022755,0.023,0.022919,0.019698,0.019854,0.026729,0.026489,0.02052
0.023081,0.020616,0.018923,0.016161,0.013699,0.014337,0.015121,0.014641,0.01483,0.014023,0.011542,0.011264,0.012348,0.012233,0.014675,0.023978,0.032757,0.031852,0.029237,0.028111,0.026936,0.027543,0.026428,0.021558,0.020489,0.027177,0.028037,0.02293
0.026636,0.024507,0.021379,0.017279,0.014697,0.014908,0.015436,0.015974,0.01659,0.016054,0.013474,0.012398,0.01331,0.013288,0.015653,0.025457,0.035264,0.034949,0.033268,0.031937,0.030353,0.030976,0.028455,0.023122,0.022529,0.028804,0.030022,0.026263
0.031367,0.029065,0.024012,0.01913,0.016617,0.016249,0.016523,0.017633,0.018345,0.017846,0.015448,0.013972,0.014477,0.014269,0.016647,0.026519,0.035945,0.035178,0.03395,0.032811,0.031456,0.031958,0.028924,0.024689,0.025819,0.033526,0.034787,0.030475
0.035674,0.031628,0.024663,0.019854,0.018138,0.018403,0.018361,0.018604,0.018776,0.018027,0.016467,0.015428,0.015325,0.014932,0.017146,0.025352,0.032214,0.030885,0.030602,0.030202,0.029235,0.028955,0.026348,0.024317,0.027059,0.036761,0.038641,0.032928
0.036821,0.030208,0.023836,0.019995,0.018175,0.019058,0.019029,0.017933,0.017508,0.017055,0.016868,0.016386,0.015588,0.015267,0.016636,0.021792,0.025617,0.024543,0.025111,0.025264,0.024938,0.024408,0.022542,0.022087,0.02556,0.036494,0.039002,0.031232
0.035788,0.027364,0.021674,0.018986,0.017012,0.017699,0.018452,0.017219,0.015649,0.015792,0.017389,0.016829,0.015064,0.014649,0.014611,0.017044,0.018483,0.017341,0.018571,0.019784,0.021329,0.021824,0.01968,0.019573,0.023261,0.033054,0.035046,0.02579
0.033197,0.025152,0.019008,0.016735,0.015549,0.015889,0.016869,0.016225,0.014203,0.014531,0.016646,0.016206,0.014612,0.014214,0.0132,0.013773,0.01355,0.012338,0.014806,0.016303,0.017302,0.018291,0.016527,0.016706,0.020004,0.026696,0.027696,0.01957
0.034285,0.026261,0.019801,0.016619,0.01502,0.014232,0.014291,0.013554,0.0127,0.013235,0.013993,0.014511,0.014291,0.014352,0.013744,0.013567,0.013388,0.012703,0.014598,0.014417,0.013475,0.014516,0.014456,0.014989,0.016527,0.019389,0.020037,0.016386
0.046642,0.036488,0.026972,0.020133,0.015665,0.013311,0.013242,0.012537,0.012038,0.012732,0.01288,0.01396,0.014501,0.015475,0.015991,0.015593,0.015474,0.015174,0.016451,0.015307,0.013672,0.01443,0.015404,0.015795,0.015593,0.015551,0.015961,0.016839
0.064638,0.050762,0.03626,0.02648,0.019666,0.015738,0.015388,0.014797,0.013538,0.013592,0.014838,0.016207,0.016305,0.018584,0.020254,0.019016,0.018309,0.019209,0.020771,0.018915,0.016983,0.017266,0.018394,0.018451,0.018124,0.017533,0.018068,0.021206
0.079205,0.063445,0.045123,0.034767,0.026656,0.020977,0.019595,0.01829,0.016808,0.016538,0.018933,0.020438,0.019978,0.023325,0.025189,0.02361,0.022915,0.024616,0.027199,0.025167,0.023329,0.023387,0.023194,0.0221,0.02213,0.022087,0.023743,0.027127
0.0848,0.071704,0.054174,0.043397,0.034403,0.02845,0.026516,0.023549,0.022667,0.022083,0.023602,0.02442,0.023725,0.027351,0.028805,0.029641,0.030771,0.030869,0.033987,0.033613,0.0334,0.033723,0.030138,0.026727,0.026582,0.026606,0.030201,0.03372
0.084136,0.075345,0.06025,0.048367,0.04026,0.036694,0.036333,0.032181,0.030682,0.028582,0.027923,0.027,0.025357,0.027963,0.029983,0.036347,0.040174,0.037018,0.039685,0.041722,0.045196,0.046964,0.038423,0.031894,0.031342,0.031752,0.037873,0.042768
0.08924,0.082232,0.062534,0.046371,0.040479,0.040947,0.043524,0.040365,0.037835,0.033136,0.030877,0.028841,0.024961,0.025453,0.029792,0.041243,0.046132,0.040389,0.043018,0.046795,0.052808,0.056702,0.046056,0.03729,0.034741,0.035744,0.044325,0.050394
0.094882,0.084366,0.057222,0.037733,0.035067,0.038168,0.042428,0.042662,0.039184,0.033315,0.032774,0.029661,0.024231,0.02585,0.032172,0.042002,0.043175,0.037914,0.042697,0.04583,0.050336,0.056381,0.04882,0.040175,0.035905,0.037089,0.044754,0.050344
0.086837,0.071046,0.04797,0.033601,0.031351,0.032022,0.034723,0.037703,0.033217,0.029442,0.034123,0.029969,0.025572,0.030984,0.035814,0.038705,0.03413,0.031441,0.038021,0.03829,0.039328,0.046212,0.046292,0.041004,0.0343,0.034537,0.039784,0.044041
0.065768,0.050682,0.03951,0.033206,0.03153,0.030956,0.029162,0.030149,0.027074,0.026493,0.034074,0.029017,0.026249,0.034501,0.035619,0.032614,0.027157,0.02648,0.031594,0.030397,0.030865,0.036722,0.042431,0.041465,0.031316,0.029251,0.033216,0.035825
0.047492,0.039866,0.035095,0.033742,0.034276,0.031494,0.025698,0.024537,0.025166,0.026909,0.031928,0.026787,0.024839,0.032256,0.030566,0.024345,0.021553,0.023728,0.026956,0.026615,0.029668,0.033222,0.038073,0.040367,0.029977,0.025376,0.027277,0.026804
0.042075,0.036955,0.033706,0.034172,0.036174,0.030157,0.021355,0.020506,0.02581,0.027119,0.027257,0.022806,0.020161,0.024116,0.024642,0.021385,0.019936,0.023025,0.024138,0.022494,0.026238,0.028852,0.031119,0.033888,0.026088,0.021252,0.021634,0.02009
0.042413,0.03418,0.03252,0.033885,0.035365,0.029146,0.020941,0.020392,0.025868,0.024673,0.022825,0.020071,0.016284,0.017364,0.021335,0.023089,0.022033,0.02257,0.022278,0.022163,0.023806,0.023552,0.024794,0.026886,0.021795,0.018079,0.018769,0.017527
0.044708,0.032675,0.03253,0.03217,0.030777,0.027789,0.023841,0.022716,0.023503,0.020892,0.019892,0.019216,0.017184,0.018286,0.023151,0.025889,0.024584,0.022929,0.024344,0.028126,0.026614,0.021363,0.021691,0.023529,0.020139,0.017446,0.018058,0.017834
0.044,0.033844,0.035076,0.031446,0.029992,0.031387,0.030434,0.028511,0.023118,0.020139,0.020831,0.02377,0.024062,0.024146,0.030223,0.034395,0.032992,0.028428,0.030186,0.037849,0.035828,0.027965,0.024689,0.02548,0.024749,0.023601,0.023341,0.022523
0.046009,0.038786,0.039256,0.03755,0.038381,0.04313,0.045294,0.043093,0.033247,0.027666,0.029673,0.036141,0.034793,0.032282,0.043323,0.052498,0.050886,0.041897,0.04076,0.049719,0.049743,0.042818,0.036049,0.037208,0.038496,0.034326,0.030557,0.03057
0.059404,0.051057,0.046627,0.046994,0.050409,0.059264,0.064747,0.060665,0.04692,0.039704,0.042394,0.049698,0.046394,0.041559,0.057748,0.074127,0.075258,0.060411,0.051998,0.05903,0.063186,0.060812,0.052015,0.053414,0.055304,0.046856,0.038704,0.03998
0.074896,0.061298,0.050918,0.053824,0.060002,0.071418,0.078437,0.071216,0.055022,0.0485,0.051554,0.056843,0.053312,0.048392,0.065536,0.088276,0.09754,0.077412,0.060134,0.06528,0.07068,0.072352,0.063505,0.06496,0.066615,0.056238,0.046497,0.046695
0.078813,0.062894,0.047403,0.052687,0.060283,0.07016,0.075804,0.066095,0.05102,0.047728,0.050418,0.051663,0.049175,0.045465,0.058536,0.083751,0.106799,0.090067,0.064099,0.063929,0.065784,0.06884,0.062229,0.063872,0.064474,0.055471,0.049675,0.046709
0.067556,0.059571,0.042854,0.048718,0.055686,0.056785,0.055809,0.047702,0.039825,0.0394,0.039607,0.038091,0.035678,0.032154,0.039015,0.060784,0.09514,0.092423,0.068056,0.060533,0.0522,0.052392,0.049431,0.052332,0.05066,0.045191,0.04777,0.041445
0.047425,0.0492,0.037121,0.042211,0.047801,0.039856,0.033148,0.030433,0.034279,0.035911,0.032018,0.032184,0.025678,0.01871,0.020867,0.037379,0.07138,0.087608,0.078792,0.065697,0.048607,0.039397,0.035676,0.039443,0.036829,0.033849,0.039471,0.034835
0.036005,0.039002,0.033221,0.032141,0.036318,0.031369,0.028708,0.029191,0.037315,0.038348,0.029667,0.030034,0.025766,0.018704,0.017246,0.034172,0.057877,0.081631,0.089709,0.074896,0.054841,0.036285,0.02827,0.02842,0.029723,0.02475,0.028832,0.033958
0.038256,0.035719,0.030023,0.025525,0.028345,0.027828,0.02999,0.032292,0.03935,0.039276,0.028241,0.024867,0.026108,0.021703,0.017047,0.034213,0.054683,0.080299,0.090062,0.075199,0.060137,0.041018,0.027147,0.02323,0.027332,0.021758,0.025745,0.035226
0.042849,0.037436,0.029117,0.026091,0.027309,0.024891,0.028439,0.030558,0.03404,0.033663,0.023983,0.017154,0.023127,0.021591,0.016021,0.03248,0.049526,0.074797,0.086358,0.069881,0.059923,0.051464,0.031583,0.023479,0.02817,0.024695,0.030788,0.036357
0.047339,0.042999,0.032338,0.033992,0.02926,0.019993,0.025992,0.027011,0.02469,0.025756,0.021386,0.01327,0.018892,0.019063,0.014719,0.029311,0.03904,0.061123,0.086814,0.070106,0.059196,0.061085,0.037592,0.026972,0.033483,0.028253,0.035974,0.039842
0.051955,0.044325,0.033216,0.040905,0.029617,0.017777,0.027454,0.026505,0.017753,0.024053,0.023103,0.013537,0.016054,0.018775,0.015077,0.026065,0.034302,0.046778,0.079495,0.069294,0.058889,0.06401,0.038831,0.027946,0.037068,0.02785,0.036678,0.04404
