0.00033,0.000122,5.1e-05,0.000187,0.000386,0.000361,0.000222,3.6e-05,0.000132,0.000212,9.7e-05,4e-05,0.000249,5.7e-05,0.000185,8.4e-05,0.000166,0.000433,0.000405,0.000364,0.000154,0.000338,0.000192,0.000568,0.000137,5.1e-05,0.000312,0.000371,2.1e-05,0.000192,0.000605,0.000427,4.4e-05,0.000125,9.8e-05,6e-05,7.5e-05,9.8e-05,4.2e-05,1.7e-05,6.2e-05,2e-06,3e-06,0.000273,0.000133,0.000109,6.1e-05,0.000103,0.000169,0.000113,0.000278,5.3e-05,2.3e-05,3e-05,8.7e-05,0.000153,7.4e-05,8.7e-05,0.000222,0.000175,1.1e-05,6.2e-05,8.2e-05,0.000139,0.000183,6.5e-05,0.000164,1.9e-05,6.8e-05,0.00019,0.000296,1.7e-05,4.4e-05,0.000207,4.9e-05,0.000261,9.1e-05,0.000169,0.000255,1.5e-05,0.000329,6.5e-05,0.000186,0.000136,0.000177,9.8e-05,0.000203,0.000264,0.000167,0.000134,0.000405,3e-05,5e-06,5.7e-05,0.00021,0.00022,0.000102,0.000109,0.000474,0.000349,8.8e-05,0.000231,7.4e-05,0.00039,0.000233,0.000156,0.000311,1.3e-05,0.000466,0.000213,0.000261,4e-06,0.00015,2e-04,7.2e-05,2.1e-05,0.000172,0.000372,0.000254,0.000204,0.000295
0.000869,0.00061,0.000277,0.00037,0.001068,0.001617,0.001112,0.000433,0.000682,0.000233,0.000661,0.000732,0.000734,0.000497,0.001479,0.00109,0.000796,0.001492,0.000578,0.00068,0.000865,0.000284,0.000767,0.000804,0.000441,0.000473,0.000771,0.000785,0.000639,0.000548,0.000289,0.001003,0.00088,0.000284,0.000573,6.1e-05,0.000276,0.000141,0.000195,0.000299,0.000201,0.000288,0.000348,0.00103,0.000256,0.000551,0.000415,0.000503,0.000208,0.00052,0.000555,0.000418,0.000441,0.000247,0.00049,0.000629,0.000555,0.000813,0.001041,0.000832,0.000846,0.001192,0.000974,0.000861,0.000469,0.000452,0.000658,0.000688,0.000786,0.000583,0.00118,0.000796,0.000842,0.000788,0.000265,0.000378,0.000593,0.000377,0.000296,0.000161,0.000834,0.000183,0.000547,0.000406,0.000368,0.000483,0.000264,0.000545,0.000179,0.000152,0.000736,0.000488,0.000458,7.9e-05,0.000159,0.000511,0.000436,0.000472,0.000608,0.000593,0.00025,0.000531,0.000142,0.000621,0.000571,0.000152,0.000435,3.9e-05,0.00101,0.000665,0.00079,9.4e-05,0.000176,0.00053,0.000539,0.000428,0.000896,0.00093,0.000623,0.000838,0.000513
0.001079,0.001163,0.000631,0.000116,0.000985,0.000892,0.00093,0.001045,0.000531,3.3e-05,0.000795,0.00061,0.000674,0.000399,0.001121,0.000453,0.000574,0.001226,0.001067,0.000541,0.001702,0.000825,0.000492,0.001391,0.000284,0.000266,0.000898,0.001297,0.000883,0.000667,0.000836,0.000155,0.000413,0.000396,0.000865,0.000483,0.000427,0.000653,0.000468,0.000199,0.000279,0.000579,0.000503,0.000917,0.000222,0.000692,0.000428,2.1e-05,0.000689,0.000216,0.00058,0.000424,0.000179,0.000356,0.000321,0.00013,0.000365,0.000922,0.001091,0.001401,0.000327,0.000607,0.000423,0.000631,0.000563,0.000458,0.000477,0.001041,0.000145,0.000797,0.000957,0.000426,0.000783,0.00146,0.000839,0.000526,0.000853,0.000624,0.000703,0.000175,0.000941,0.000242,0.000758,0.000375,0.00107,0.000226,0.000703,0.000605,0.000245,0.000483,0.000204,0.000358,0.000169,0.000352,0.000268,0.000387,0.000169,0.000277,0.000774,0.000944,6.9e-05,0.000877,7.8e-05,0.000755,0.000606,0.000494,0.000515,0.000548,0.000774,0.000582,0.000458,0.000624,0.000625,0.00045,0.000345,0.000607,0.001828,0.000582,0.001491,0.001538,0.001353
0.001193,0.001628,0.000327,0.000665,0.000649,0.001083,0.000895,0.000876,0.000942,0.000377,0.000729,0.001618,0.00112,0.000646,0.00097,0.000811,0.001292,0.001131,0.001416,0.001578,0.002026,0.002623,0.001805,0.003361,0.001451,0.001109,0.000846,0.001481,0.000686,0.001121,0.001066,0.000789,0.000677,0.000941,0.001502,0.000651,0.000703,0.001565,0.001912,0.000936,0.000376,0.00127,0.000807,0.000742,0.000232,0.001326,0.001222,0.00101,0.001057,0.000624,0.00123,0.000874,0.000114,0.000335,0.000192,0.000755,0.000858,0.000303,0.001045,0.000753,0.001762,0.001024,0.000419,0.00068,0.000798,0.000552,0.001065,0.000739,0.000211,0.000785,0.000509,0.000199,0.001089,0.000991,0.001247,0.000246,0.000583,0.001167,0.000776,0.00027,0.000491,0.000814,0.001361,0.000959,0.001383,0.000534,0.00029,0.000656,0.001035,0.000914,0.00052,0.000126,0.000416,0.000736,0.000983,0.000886,0.000311,0.000685,0.001094,0.001309,0.000469,0.001232,0.000779,0.001026,0.001413,0.00069,0.000565,0.000826,0.001472,0.001046,0.001452,0.001648,0.000744,0.000971,0.001228,0.000577,0.001581,0.001709,0.001511,0.001163,0.001597
0.000465,0.001751,0.001795,0.001842,0.001511,0.001458,0.002111,0.001556,0.000415,0.000187,0.000566,0.001896,0.002636,0.003393,0.002286,0.00196,0.000982,0.00238,0.001024,0.002283,0.001873,0.003167,0.000581,0.003769,0.00356,0.00221,0.000898,0.002328,0.002624,0.00122,0.003102,0.003322,0.003076,0.002725,0.003093,0.003318,0.002886,0.000607,0.002038,0.002471,0.002209,0.000589,0.001104,0.00074,0.001312,0.002241,0.002945,0.001234,0.00187,0.000815,0.001754,0.000726,0.000887,0.000943,0.000636,0.001361,0.002069,0.001142,0.001062,0.001689,0.002019,0.000628,0.000596,0.000968,0.001587,0.001813,0.00071,0.001095,0.001196,0.000204,0.000932,0.000599,0.001635,0.001182,0.001302,0.001732,0.00112,0.000951,0.001533,0.001157,0.000817,0.000712,0.00164,0.002186,0.000716,0.001375,0.001327,0.000942,0.001957,0.003135,0.001883,0.000801,0.0011,0.001138,0.001354,0.000906,0.001412,0.001019,0.001349,0.002089,0.00136,0.002161,0.00151,0.002255,0.000679,0.001929,0.001483,0.001207,0.000202,0.001908,0.003113,0.003306,0.002418,0.001997,0.001628,0.002012,0.001523,0.001594,0.000887,0.000583,0.002089
0.000713,0.002233,0.002412,0.000808,0.000326,0.00249,0.000267,0.000519,0.00055,0.000408,0.000237,0.001173,0.001225,0.002065,0.000965,0.001463,0.001998,0.000838,0.000421,0.000689,0.000724,0.001033,0.001819,0.001711,0.002465,0.003076,0.00187,0.001355,0.001158,0.002317,0.002722,0.001216,0.001994,0.000935,0.00097,0.001345,0.000669,0.001311,0.001666,0.00088,0.00058,0.000606,0.000958,0.00171,0.000129,0.001642,0.001436,0.000993,0.001462,0.002148,0.001026,0.001215,0.001199,0.000472,0.000676,0.002696,0.001612,0.000936,0.000479,0.000847,0.001649,0.000731,0.000585,0.000813,0.001455,0.001722,0.000376,0.000854,0.001248,0.000804,0.000631,0.00046,0.001426,0.000328,0.000759,0.001588,0.001006,0.00085,0.001484,0.001606,0.000353,0.000659,0.001171,0.001396,0.001173,0.002143,0.001359,0.001128,0.001677,0.002212,0.000726,0.00052,0.000916,0.000503,0.000876,0.000307,0.001265,0.001297,0.000651,0.002121,0.001577,0.000799,0.001018,0.00143,0.000246,0.000831,0.000491,0.000204,0.000357,0.00096,0.001562,0.000836,0.000449,0.001643,0.00048,0.000569,0.001202,0.000437,0.000185,0.000658,0.001011
0.000709,0.002581,0.001013,0.000564,0.000515,0.00048,0.001887,0.000952,0.00076,0.000638,0.000839,0.001351,0.00053,0.002326,0.000911,0.000172,0.001098,0.001581,0.001242,0.000556,0.000573,0.00122,0.00114,0.002956,0.001861,0.001222,0.000812,0.001036,0.000549,0.001274,0.001941,0.001869,0.000482,0.001196,0.000473,0.000813,0.001232,0.000989,0.000235,0.001204,0.000273,0.000895,0.000876,0.001767,9.4e-05,0.000954,0.000785,4.6e-05,0.000944,0.002115,0.000944,0.00066,0.000539,0.000353,0.001494,0.00219,0.000781,0.000605,0.000689,0.00037,0.001272,0.00099,0.001068,0.001312,0.000925,0.000746,0.000907,0.000428,0.000681,0.001259,0.000862,0.000597,0.001549,0.000734,0.000757,0.000289,0.001167,0.000778,0.000623,0.001026,0.001114,0.00024,0.001641,0.000103,0.001791,0.001892,0.000806,0.000163,0.000619,0.000625,0.000314,0.000843,0.00085,0.001093,0.001723,0.00104,0.000839,0.001747,0.001201,0.001486,0.000253,0.00072,0.001507,0.002145,0.001019,0.000324,0.000307,0.000312,0.001583,0.000757,0.000783,0.000767,0.000844,0.00188,0.001202,0.00143,0.00048,0.000342,0.000819,0.000866,0.001185
0.001416,0.00342,0.003911,0.001413,0.000716,0.001877,0.002872,0.001386,0.000704,0.000546,0.001818,0.003476,0.001811,0.001658,0.003158,0.001651,0.000854,0.001128,0.004212,0.002881,0.002986,0.003153,0.001349,0.00415,0.003116,0.001367,0.001976,0.002173,0.001395,0.00113,0.003295,0.003804,0.002759,0.001942,0.001642,0.001745,0.000834,0.002061,0.000395,0.000854,0.001237,0.001143,0.001918,0.002966,0.002483,0.002214,0.001525,0.001836,0.001476,0.002275,0.003652,0.002693,0.000939,0.000851,0.001771,0.00308,0.000904,0.000264,0.000395,0.001273,0.001426,0.001571,0.001674,0.001027,0.001067,0.002226,0.002646,0.001855,0.002004,0.002057,0.00119,0.001395,0.002132,0.001162,0.000622,0.002053,0.001487,0.00192,0.001328,0.002102,0.000391,0.000996,0.003756,0.003048,0.00324,0.003139,0.002485,0.002322,0.000927,0.00205,0.001277,0.001507,0.000668,0.00012,0.0011,0.001208,0.001438,0.002009,0.001923,0.001363,0.000496,0.001518,0.002311,0.004362,0.003549,0.003333,0.001189,0.000733,0.001811,0.002928,0.001498,0.001095,0.001968,0.002382,0.002837,0.00217,0.00095,0.001171,0.001778,0.001705,0.001677
0.005098,0.003219,0.003465,0.002817,0.001847,0.003194,0.001841,0.001237,0.001664,0.001587,0.002932,0.002744,0.002188,0.002462,0.004934,0.002212,0.001934,0.002243,0.006477,0.00342,0.001682,0.000483,0.000756,0.003806,0.005666,0.004004,0.002078,0.001277,0.001327,0.000962,0.002829,0.002408,0.00091,0.00017,0.002359,0.000985,0.002543,0.001497,0.001269,0.001734,0.003562,0.00305,0.001267,0.002888,0.005801,0.001334,0.001569,0.003377,0.001163,0.003083,0.005656,0.003048,0.001883,0.001101,0.002787,0.003705,0.002897,0.000943,0.000561,0.002415,0.001657,0.001678,0.001326,0.003573,0.002276,0.003683,0.001783,0.000391,0.001494,0.001255,0.000866,0.00278,0.002241,0.003209,0.002272,0.002755,0.003177,0.002853,0.00211,0.001359,0.00313,0.003114,0.003162,0.003876,0.000251,0.00424,0.005997,0.002885,0.001475,0.003207,0.000846,0.001569,0.000637,0.000658,0.001037,0.002005,0.001322,0.003075,0.00232,0.003433,0.001758,0.003828,0.004463,0.005822,0.008663,0.004466,0.004755,0.000902,0.002491,0.003824,0.002752,0.000595,0.001581,0.000934,0.002339,0.003514,0.002838,0.000325,0.002631,0.001652,0.000998
0.004623,0.003946,0.003387,0.001946,0.00158,0.004178,0.003255,0.001706,0.001222,0.001368,0.00208,0.000415,0.001444,0.003728,0.002449,0.00267,0.004218,0.004724,0.004894,0.004682,0.001634,0.002966,0.001795,0.003666,0.003779,0.003067,0.004668,0.003158,0.001375,0.001805,0.000801,0.001504,0.001028,0.000628,0.003394,0.003609,0.001813,0.001125,0.001462,0.002179,0.003472,0.001138,0.001585,0.001308,0.003439,0.003783,0.003242,0.003513,0.0037,0.002809,0.002354,0.002073,0.002901,0.001061,0.002237,0.001509,0.001743,0.002632,0.002181,0.001669,0.001941,0.000733,0.001449,0.00413,0.004904,0.003676,0.002997,0.000494,0.001756,0.00332,0.002057,0.002682,0.00189,0.004548,0.002925,0.002583,0.003061,0.002893,0.001887,0.002402,0.002623,0.002022,0.004555,0.002519,0.002175,0.002086,0.001452,0.005536,0.002921,0.004385,0.00435,0.00297,0.002629,0.001357,0.000142,0.001853,0.002777,0.000966,0.002436,0.004054,0.004193,0.004598,0.004398,0.005488,0.005519,0.003534,0.005244,0.00486,0.004248,0.001945,0.001003,0.002589,0.003516,0.003308,0.001463,0.003164,0.000967,0.00253,0.004173,0.003199,0.002584
0.002584,0.00301,0.001568,0.001778,0.001729,0.00216,0.002066,0.002392,0.001485,0.000158,0.00087,0.000615,0.001034,0.003152,0.002651,0.002731,0.001238,0.001927,0.002931,0.002508,0.002286,0.002688,0.002325,0.004783,0.002186,0.00315,0.003015,0.00118,0.000609,0.00164,0.001574,0.000813,0.001301,0.002144,0.003854,0.00209,0.002359,0.001029,0.001717,0.00133,0.001985,0.001726,0.001691,0.000989,0.001825,0.000493,0.001641,0.001712,0.00253,0.001661,0.001921,0.001674,0.00274,0.002988,0.000938,0.001229,0.00075,0.002291,0.000683,0.000723,0.001462,0.00136,0.00084,0.002522,0.001975,0.002709,0.001765,0.001854,0.002059,0.002558,0.003864,0.003043,0.001784,0.004359,0.004182,0.004944,0.001988,0.002456,0.002336,0.000966,0.001954,0.000111,0.001403,0.000858,0.001473,0.00071,0.000361,0.004091,0.003329,0.004094,0.003318,0.00168,0.00298,0.002737,0.001556,0.001997,0.000948,0.000858,0.001415,0.000914,0.002031,0.003637,0.001331,0.002276,0.000721,0.001661,0.002592,0.001365,0.001451,0.001717,0.002253,0.000934,0.001235,0.001636,0.001425,0.002899,0.00206,0.003078,0.001742,0.001465,0.001322
0.001697,0.001839,0.000906,0.000523,0.00018,0.001178,0.00105,0.000892,0.00059,0.000371,0.000381,0.000275,0.000659,0.001017,0.001385,0.000828,0.002226,0.000771,0.000382,0.001582,0.000739,0.001209,0.000732,0.002274,0.001564,0.00073,0.000785,0.000453,0.000711,0.000382,0.000873,6.7e-05,0.000894,0.00105,0.001151,0.000388,0.00022,0.000355,0.001348,0.000774,0.000792,0.001082,0.000239,0.000605,0.000302,0.000861,0.00044,0.000921,0.000709,0.001181,0.000504,0.000992,0.000722,0.000892,0.000387,0.000348,0.000867,0.000656,0.000821,0.000121,0.000865,0.000349,0.000305,0.001139,0.000435,0.00089,0.000883,0.001225,0.000318,0.001772,0.001511,7.2e-05,0.000906,0.001734,0.000796,0.001062,0.001266,0.000365,0.000338,0.000215,0.00077,0.001003,0.001202,0.000922,0.001149,0.000696,0.000955,0.001478,0.000706,0.000979,0.000709,0.000836,0.002286,0.001096,0.00043,0.000674,0.000537,0.000248,0.000587,0.000754,0.000894,0.001237,9.7e-05,0.001395,0.000803,0.001013,0.000718,0.000448,0.000808,0.001221,0.000159,0.000745,0.000895,0.000623,0.000596,0.000834,0.00084,0.000873,0.000723,0.001156,0.000692
0.00113,0.000982,0.000304,0.000615,0.000151,0.001137,0.000571,0.000553,0.000397,0.000116,0.000513,8.2e-05,0.000492,0.000788,0.000854,0.000369,0.001128,0.000262,0.00088,0.000425,0.000445,0.000453,0.000468,0.001013,0.00078,0.000927,0.000388,0.00031,0.00025,0.000383,0.000609,0.000203,0.000575,0.000619,0.000656,0.000485,0.000474,0.000278,0.000686,0.000496,0.000547,5.6e-05,0.000326,0.000441,0.000226,0.000661,0.000474,0.000475,0.000587,0.00071,0.000535,0.000439,0.000474,0.000494,0.000254,0.000399,0.000814,0.000359,0.000469,0.000426,0.000529,0.000381,0.000554,0.00058,0.00016,0.000406,0.000368,0.000414,0.00026,0.000712,0.000874,0.000277,0.000523,0.000615,0.000371,0.000431,0.000482,0.000213,0.000334,0.000199,0.000361,0.00073,0.001024,0.000405,4.9e-05,0.000434,0.000685,0.000738,0.000232,0.000756,0.000436,0.000669,0.001075,0.000128,0.000204,0.000301,0.000308,0.000391,0.000466,3e-04,0.000547,0.000985,0.000104,0.000775,0.000279,0.00085,0.000651,0.000106,0.000824,4e-04,0.000283,0.000375,0.000486,0.000228,0.000389,0.000382,0.000459,0.000511,0.000663,0.000556,0.000274
0.00055,0.000487,0.000276,0.000449,8.7e-05,0.00084,0.000366,0.000341,0.000275,0.000227,0.000498,0.000103,0.000443,0.00054,0.000758,9.5e-05,0.000566,0.000197,0.000435,0.000402,0.000448,0.000235,0.000411,0.000647,0.000639,0.000647,0.000476,2.9e-05,0.000393,0.000344,0.000233,0.000371,0.000681,0.000714,0.000579,0.000402,0.000476,9.9e-05,0.000519,0.000525,0.000179,0.000293,0.000479,0.000269,6.8e-05,0.000421,0.000391,0.000365,0.000392,0.000625,0.000685,0.000224,0.000555,0.000484,0.00013,0.000566,0.000871,0.000307,0.000536,0.000598,0.000279,0.000401,0.000415,0.000267,0.00019,0.000502,0.000135,0.000489,0.000296,0.000688,0.000654,0.000276,0.000211,0.000546,0.000419,0.000481,0.000303,0.00025,0.000332,0.000153,0.000277,0.000556,0.001054,0.000438,0.000308,0.000259,0.000286,0.000638,0.000275,0.00071,0.000559,0.000784,0.000848,0.000421,0.000533,0.000164,0.000183,0.000152,0.000326,0.000189,0.000241,0.000792,0.00011,6e-04,0.000189,0.000636,0.000358,0.000225,0.00075,0.00067,8.1e-05,0.000126,0.000332,9.5e-05,0.000473,0.000153,0.000172,0.000431,0.000391,0.000348,0.000329
0.000316,0.000547,0.000231,0.000646,0.000838,0.000682,0.000748,0.000542,0.000587,9.7e-05,0.000788,0.000483,0.000264,0.000458,0.000799,0.000483,0.000853,0.000692,0.00084,0.000558,0.000405,0.000273,0.000383,0.00089,0.000656,0.00117,0.000634,0.00051,0.000568,0.000217,0.000336,0.000524,0.000671,0.001009,0.000907,0.000284,0.000931,0.000531,0.000483,0.000424,0.000569,0.000936,0.000186,0.000219,0.000404,0.000285,0.000283,0.00081,0.000663,0.000503,0.000844,0.00067,0.000452,0.000432,3.3e-05,0.00059,0.000647,0.000644,0.000766,0.000414,0.000556,0.000759,0.000342,0.000145,0.000438,0.000421,0.000223,0.00055,0.000468,0.000625,0.000497,0.000138,0.00037,0.000376,0.000656,0.000272,0.000231,2.7e-05,0.000544,0.000189,0.000504,0.000702,0.000634,0.000228,0.000674,0.000536,0.000532,0.000962,0.000359,0.000548,0.000618,0.000826,0.001007,0.000709,0.000646,0.000666,0.000316,0.000626,0.000804,0.000191,0.000773,0.000405,0.000443,0.000614,0.000312,0.000578,0.000538,0.000157,0.000568,0.000468,0.000369,0.000137,0.000512,0.000626,0.00045,0.000588,0.000434,0.00066,0.00039,0.000142,0.000302
0.00028,0.000157,0.000559,0.001464,0.002092,0.001921,0.001555,0.001624,0.000134,0.00027,0.000715,0.000789,0.000729,0.00016,0.001354,0.000762,0.001486,0.001754,0.002018,0.000383,0.000871,0.00198,0.000916,0.000766,0.00062,9e-04,0.000992,0.00105,0.000491,0.00092,0.000492,0.00027,0.000288,0.001778,0.000614,0.001021,0.001596,0.001929,0.000511,0.000378,0.001609,0.000807,0.001125,0.001078,0.000895,0.000576,0.000363,0.001322,0.002232,0.000582,0.001227,0.00087,0.000525,0.00095,0.000562,0.00085,0.001751,0.000556,0.001134,0.000816,0.000518,0.001368,0.00156,0.000897,0.001373,0.000797,0.000699,0.000702,0.000956,0.000678,0.000854,0.000513,0.000963,0.001429,0.001674,0.00088,0.000318,0.000323,0.001221,0.00105,0.00049,0.00085,0.001461,0.000982,0.001199,0.001765,0.000937,0.001057,0.00124,0.000828,0.001036,0.001683,0.002239,0.000848,0.00117,0.000477,0.000547,0.000515,0.001808,0.001469,0.001459,0.001541,0.00123,0.000641,0.000653,0.000621,0.000332,0.000101,0.000596,0.000394,0.000419,0.000512,0.000869,0.000896,0.001235,0.001092,0.001656,0.001049,0.00109,0.000339,0.000618
0.001903,0.001025,0.000508,0.001448,0.003682,0.00213,0.000992,0.000184,0.001471,0.001285,0.001173,0.000735,0.00079,0.00096,0.001795,0.002654,0.002262,0.002974,0.002023,0.002606,0.001339,0.001881,0.002191,0.000427,0.000681,0.000876,0.002185,0.002474,0.00272,0.002192,0.001529,0.000658,0.000459,0.001556,0.003441,0.003521,0.002835,0.003603,0.002535,0.001661,0.001902,0.002417,0.002252,0.000666,0.000671,0.0011,0.000917,0.001599,0.003068,0.003052,0.000681,0.000739,0.00078,0.001696,0.001595,0.001306,0.002197,0.001979,0.001594,0.001884,0.001744,0.002637,0.002526,0.000938,0.000928,0.000462,0.000654,0.000343,0.001077,0.00184,0.000966,0.000437,0.000613,0.000643,0.00197,0.002073,0.001395,0.001193,0.000847,0.000993,0.001058,0.001199,0.001875,0.002169,0.00334,0.003198,0.002514,0.002538,0.001984,0.001362,0.000577,0.00139,0.002025,0.0024,0.002447,0.001468,0.001073,0.000496,0.002203,0.002914,0.003002,0.001515,0.00046,0.000532,0.000477,0.000973,0.000987,0.000575,0.000149,0.000666,0.00061,0.000791,0.000208,0.00056,0.00053,0.00048,0.001014,0.001718,0.002763,0.002665,0.000897
0.00101,0.000908,0.00104,0.001656,0.001537,0.001075,0.001148,0.001052,0.002053,0.002022,0.001014,0.000874,0.000818,0.000847,0.000419,0.001797,0.000833,0.001753,0.000318,0.000868,0.000272,0.001478,0.001279,0.00133,0.001029,0.001614,0.002031,0.000355,0.001357,0.000251,0.000538,0.000331,0.000275,0.00098,0.002267,0.001199,0.002292,0.002046,0.00047,0.000465,0.001101,0.000884,0.000365,0.000572,0.00066,0.000556,0.000552,0.000449,0.001219,0.000735,0.001245,0.000726,0.001268,0.000735,0.000391,0.001201,0.000565,0.000764,0.001672,0.000841,0.000467,0.001262,0.000754,0.001183,0.000151,0.000282,0.000327,0.000209,0.000944,0.001008,0.00137,0.000762,0.000384,0.000521,0.001292,0.00087,0.000327,0.000257,0.00058,0.000317,0.000398,0.000979,0.000934,0.000205,0.0019,0.000657,0.001044,0.000461,0.000361,0.000447,0.000987,0.000465,0.001139,0.000264,0.000725,0.000496,0.001036,0.001239,0.001671,0.00068,0.000554,0.000591,0.000891,0.000843,0.00063,0.000944,0.000625,0.000245,0.00017,0.000457,0.000214,0.000616,0.000773,0.000338,0.000544,0.000411,0.000649,0.000561,0.001481,0.001218,0.000587
0.000667,0.000521,0.000465,0.00058,0.000652,0.00037,9.1e-05,0.000536,0.001008,6.3e-05,0.000504,0.000414,0.000517,0.000308,0.000371,0.000751,0.000846,0.000793,0.000486,0.000222,0.000322,0.000674,0.000562,0.000325,0.00059,0.000573,0.000233,0.000751,0.000229,0.000571,9e-05,0.000445,0.000468,0.000386,0.001017,0.000655,0.000995,0.000485,0.000638,0.000151,0.000717,0.000552,0.000103,0.000171,0.000663,0.000153,0.000231,0.000534,0.000276,0.000265,0.000414,3.2e-05,0.000427,0.000371,0.00038,0.000592,0.000442,0.000244,0.00069,0.000445,0.000209,0.000776,1.8e-05,0.000713,0.000286,0.000452,0.000485,0.000246,0.000154,0.000631,0.000398,0.000269,0.000232,0.000571,0.000499,0.000155,0.000437,0.000258,0.000344,0.00022,0.000195,0.000433,0.00025,0.000501,0.000872,0.001093,9.7e-05,0.00031,0.000427,0.000196,0.000606,0.000569,0.000286,0.000626,0.000233,0.000309,0.000973,0.000801,0.000637,0.000617,0.000514,0.000687,0.000141,0.000461,0.000302,0.000879,3e-04,0.000263,0.000361,0.000129,0.000176,0.000355,0.000209,0.000234,0.000115,0.000326,0.000501,0.000537,0.00081,0.000335,0.000671
0.000661,0.000234,0.000341,0.000694,0.000874,0.000426,0.000175,0.000126,0.000541,0.000546,5.8e-05,7.8e-05,0.000235,0.000233,0.000127,0.000344,0.000305,0.00043,0.000299,0.000401,0.000156,0.000514,0.000403,0.000101,0.000137,0.000338,0.000206,0.000648,0.00031,0.000393,0.000227,0.000221,0.000306,0.000566,0.000588,0.000329,0.000561,0.000329,0.000388,8.2e-05,0.000568,0.000629,0.000177,0.000275,0.000239,0.000111,0.000351,0.000762,0.000455,0.000434,0.000354,0.000293,0.000319,2e-04,0.000295,0.000295,0.000258,0.00034,0.000331,0.000203,0.000193,0.000411,0.000106,0.000233,0.000245,0.000415,0.000299,0.000122,0.000272,0.000209,0.000422,0.000216,0.000311,0.000432,0.000412,0.000133,0.000153,0.000179,0.000467,0.000261,0.000258,0.000465,0.000429,0.000471,0.000673,0.000532,0.000301,0.000214,0.000172,0.000129,0.000418,0.000298,0.000276,0.000434,0.000432,0.000242,0.000619,0.000271,0.000311,0.000412,0.000352,0.000429,0.000278,0.00043,0.000102,0.000473,0.00013,0.000237,0.000279,0.000205,0.000111,0.000158,0.000405,0.000165,0.000302,0.000282,0.000221,0.000308,0.000395,0.000179,0.000501
0.00068,0.000474,0.000358,0.000284,0.000628,0.00028,0.000183,0.000226,0.000415,0.000301,0.000141,0.000131,0.000119,0.000176,3.3e-05,0.000211,0.000142,0.000424,0.000244,0.000222,0.00023,0.000406,0.000166,0.000384,0.000118,0.000114,0.000517,0.000424,0.000386,0.000332,0.000276,2.9e-05,0.000255,0.000252,0.000333,0.000181,0.000255,8.5e-05,0.000207,0.000143,0.000476,0.000232,0.000258,0.000393,0.000144,0.000138,0.000573,0.000214,0.000504,0.000165,0.000137,0.000172,0.000139,1e-05,0.000243,0.000155,0.000301,1e-04,0.000102,0.000132,0.000239,0.000314,0.000114,0.00019,8.2e-05,0.000373,2e-04,0.000106,0.000267,7.3e-05,0.000323,0.000212,0.000267,0.000166,0.000314,0.000211,2.6e-05,0.000197,0.000142,0.000291,0.000169,0.000303,0.000241,0.000155,0.000311,0.000542,0.000328,6e-05,6.4e-05,0.000186,0.000266,0.000168,6.4e-05,0.000288,0.000189,0.000111,0.000476,0.00026,0.000354,0.000191,0.000396,0.000294,7.5e-05,0.000294,0.000126,0.000506,0.000144,0.000113,0.000189,0.000112,0.000157,0.000199,0.000245,0.000136,0.000219,0.000145,3e-05,0.000231,0.000175,0.000214,0.000178
0.00041,0.000327,0.000173,0.000299,0.000433,0.00015,0.000246,0.00015,0.000226,0.000331,0.000157,0.000102,0.000269,0.000232,0.000112,0.000139,1e-04,0.000354,0.000445,0.000258,0.000123,0.000329,8.3e-05,0.000102,6.7e-05,0.000103,0.000329,0.000148,0.000273,0.000345,0.000198,0.000162,0.000116,0.000238,0.000442,0.000104,0.000273,6.1e-05,0.000228,0.000128,0.00038,0.000169,0.000112,0.000159,0.000166,0.000173,0.000256,0.000336,0.000346,0.000178,0.000118,0.000195,0.000143,7.6e-05,0.000208,0.000106,0.000129,0.000112,8.6e-05,8.7e-05,0.000227,0.000249,9.7e-05,0.000239,0.000147,0.000296,0.000147,4.7e-05,0.000186,8.3e-05,0.000265,0.000159,2e-04,0.000113,0.000283,3.2e-05,0.000104,0.000226,0.000237,0.000219,0.000148,0.000182,0.000235,2e-04,0.000311,0.000357,0.000215,4.7e-05,3.1e-05,0.000167,0.000225,9.6e-05,0.000232,0.000162,0.000137,0.000103,0.000374,7.3e-05,0.000229,0.000206,0.000293,0.000295,4.7e-05,0.000273,4.2e-05,0.000358,6.2e-05,8.2e-05,0.000267,3.1e-05,0.000102,9.6e-05,0.00026,6.8e-05,0.000114,9.7e-05,0.000137,0.000153,0.000262,0.000225,0.000304
0.000281,0.000137,7.8e-05,0.000139,0.00013,7.4e-05,8.1e-05,3.8e-05,6.9e-05,8.8e-05,2.8e-05,0.000104,2e-05,6e-05,3.7e-05,6.5e-05,3.3e-05,0.000138,0.000164,9.5e-05,4.1e-05,0.000191,3.3e-05,8.9e-05,5.4e-05,3.3e-05,0.00015,7.8e-05,9.3e-05,0.000123,5.6e-05,9.2e-05,4.8e-05,4.5e-05,0.000181,4.6e-05,9.6e-05,2.9e-05,9.2e-05,2.6e-05,0.00017,5.9e-05,4.2e-05,0.000103,8.3e-05,4.9e-05,0.000138,0.000143,0.000123,5.5e-05,5.8e-05,6.1e-05,5.6e-05,3.4e-05,9.3e-05,8.2e-05,5.5e-05,1.3e-05,1.2e-05,2.8e-05,6.4e-05,0.000113,4.1e-05,0.000115,4.7e-05,0.000123,6e-05,1.7e-05,8.1e-05,4.8e-05,0.000136,6e-05,4.6e-05,8.4e-05,0.000165,6.8e-05,2.1e-05,9.7e-05,8.2e-05,8.4e-05,6.3e-05,9.8e-05,0.000166,5.1e-05,0.000123,0.000225,8.6e-05,7.5e-05,7.6e-05,4.3e-05,0.000104,2.7e-05,8.4e-05,6.3e-05,6.9e-05,5.4e-05,0.000188,8.4e-05,0.000101,5.8e-05,0.000144,0.000148,2.1e-05,0.000113,5.7e-05,0.000191,7.3e-05,4e-05,0.000107,4.4e-05,2e-05,3.8e-05,0.000152,2.8e-05,4.9e-05,4.9e-05,5.8e-05,6e-06,6.2e-05,0.000134,0.000125
0.000226,0.000132,6.8e-05,8.7e-05,0.000112,7.2e-05,5.7e-05,5.1e-05,6.3e-05,7.4e-05,4e-05,8.6e-05,7.6e-05,7.6e-05,4.1e-05,0.000107,7.6e-05,1e-04,0.00012,4e-05,6.6e-05,0.000156,3.4e-05,7.4e-05,4.6e-05,4e-05,0.000124,0.000115,4.8e-05,0.000132,9.1e-05,6.4e-05,4.7e-05,0.000106,0.00017,1.7e-05,9.2e-05,7e-06,6.5e-05,7.7e-05,0.000113,7.1e-05,5.8e-05,5.5e-05,7.3e-05,5e-06,0.000107,0.000142,9.3e-05,6.3e-05,4.7e-05,4.3e-05,3.8e-05,2e-05,7.7e-05,8.4e-05,3.5e-05,5.2e-05,2.6e-05,1.6e-05,6.5e-05,8.8e-05,3.2e-05,7.9e-05,7.9e-05,8.3e-05,5.2e-05,1.9e-05,8.3e-05,4.8e-05,0.000147,8.2e-05,8.4e-05,8.3e-05,0.000136,4.6e-05,3e-05,4.8e-05,7.9e-05,9.8e-05,7e-06,8.4e-05,0.000129,5.3e-05,9.2e-05,0.000196,4e-05,3e-05,6e-05,1.8e-05,9.5e-05,2.6e-05,1.8e-05,2.4e-05,8.5e-05,1.5e-05,0.000202,0.00012,0.000104,2.9e-05,9.5e-05,0.000142,4.4e-05,0.000176,6.8e-05,0.000125,6.8e-05,1e-05,0.000114,6.8e-05,4.9e-05,2.2e-05,0.000103,7.3e-05,8.4e-05,8e-05,5.1e-05,8.1e-05,0.000114,0.000116,6.5e-05
0.00019,0.000133,3.3e-05,6.8e-05,7.1e-05,4.2e-05,8.7e-05,7.2e-05,1.2e-05,4.4e-05,1.2e-05,3.6e-05,1.5e-05,7.9e-05,7.1e-05,7.2e-05,6e-05,0.00012,0.000157,8.6e-05,5.5e-05,0.000128,2.7e-05,6.1e-05,4.2e-05,4.2e-05,0.000112,7.9e-05,7.1e-05,0.000118,7.7e-05,9e-05,4.9e-05,2.2e-05,0.000157,6.8e-05,7.1e-05,4.1e-05,0.000161,1.6e-05,0.000118,8.1e-05,1.7e-05,7.9e-05,6.6e-05,4.4e-05,4.5e-05,0.000103,0.000139,8.2e-05,3.1e-05,0.000103,9.6e-05,5.2e-05,1e-04,4.4e-05,5.2e-05,7.5e-05,5.1e-05,3.9e-05,5e-05,6.9e-05,3.3e-05,7.7e-05,9.1e-05,0.00012,7e-06,1.6e-05,9.2e-05,5.2e-05,0.000103,6.5e-05,2.4e-05,0.000112,0.000111,5.2e-05,6.2e-05,0.00011,7.8e-05,0.000113,0.000107,7.6e-05,0.00014,0.000105,0.000167,0.000204,3.5e-05,0.000113,1.6e-05,6.5e-05,9.3e-05,4.9e-05,7.7e-05,3e-05,3.4e-05,6.9e-05,0.000126,3.1e-05,9e-06,5.1e-05,0.000206,8.3e-05,0.000107,0.000173,9.2e-05,0.00015,6.9e-05,8.5e-05,6.2e-05,8.3e-05,4e-05,3.5e-05,0.000102,9e-05,2.2e-05,7e-05,3e-05,6.2e-05,0.000107,3.3e-05,0.000143
0.00023,0.00014,7e-05,1.5e-05,0.000146,5.7e-05,3.1e-05,3.9e-05,5.6e-05,9.9e-05,3.6e-05,1.7e-05,4.9e-05,0.000104,9.8e-05,5.8e-05,8.5e-05,0.000124,0.000132,9.5e-05,4.2e-05,0.000134,3.1e-05,0.000108,5.5e-05,8.2e-05,7.2e-05,0.000138,8.7e-05,0.000114,2.3e-05,1e-04,8.1e-05,0.000105,0.000121,3.5e-05,7.4e-05,2.5e-05,0.000135,5.2e-05,0.000123,6.1e-05,1.3e-05,9.7e-05,7.3e-05,8.7e-05,0.000127,9.4e-05,0.000149,4.8e-05,4.8e-05,4.6e-05,5.1e-05,1.9e-05,4.8e-05,2.1e-05,3.6e-05,5.1e-05,3.8e-05,2.1e-05,6.7e-05,0.000134,7.5e-05,7.9e-05,3.2e-05,8.8e-05,5.6e-05,6.3e-05,0.000116,3.7e-05,0.000123,1.2e-05,6.5e-05,2.2e-05,8.3e-05,0.000134,0.000131,3.9e-05,9.2e-05,4.8e-05,6.2e-05,5.2e-05,0.000187,6.6e-05,0.000118,0.00021,7.1e-05,8.7e-05,7.9e-05,6.8e-05,0.000124,6e-05,6.2e-05,5.1e-05,3.6e-05,5.7e-05,9e-05,3.7e-05,7.5e-05,8.1e-05,8.9e-05,6.8e-05,6.5e-05,0.000107,7.3e-05,0.000161,6.2e-05,7.6e-05,0.000103,7.7e-05,7.1e-05,6.6e-05,5.6e-05,8.3e-05,5e-05,0.000119,6.3e-05,2.2e-05,4.4e-05,0.00013,5.8e-05
0.000241,0.000114,5.1e-05,8.3e-05,7.5e-05,0.000102,4.1e-05,4.5e-05,6.6e-05,8e-05,2e-05,5e-05,8.8e-05,3.5e-05,4.7e-05,3.8e-05,1.9e-05,8.5e-05,0.000152,0.000112,6.8e-05,5.4e-05,7.8e-05,6.3e-05,5.1e-05,4.7e-05,0.000115,0.000136,9.4e-05,0.000106,6.9e-05,5.6e-05,9.1e-05,5.4e-05,0.000162,3e-05,5.9e-05,1.6e-05,7e-05,1.3e-05,0.000111,8.4e-05,5e-05,0.000115,5e-05,2.5e-05,0.000111,1e-04,1e-04,0.000119,8.7e-05,9e-05,3.8e-05,4.4e-05,5.3e-05,1.3e-05,5.9e-05,6.4e-05,3.7e-05,4.2e-05,6.6e-05,0.000129,1.8e-05,8.9e-05,8.9e-05,7e-05,8.9e-05,4.5e-05,2.4e-05,4.5e-05,0.00011,5.5e-05,5.7e-05,8.7e-05,7.8e-05,8.2e-05,6.1e-05,6.3e-05,9.1e-05,8.6e-05,3.1e-05,9.3e-05,0.000118,4.6e-05,0.000169,1e-04,0.000128,2.2e-05,3.4e-05,5.6e-05,8.3e-05,3.7e-05,6.8e-05,6.9e-05,5.9e-05,3.1e-05,1e-04,1.5e-05,7.2e-05,0.000127,0.000104,9.1e-05,6.4e-05,5.5e-05,3.7e-05,0.000142,6.8e-05,5e-05,1e-04,7.8e-05,3.7e-05,5.8e-05,7e-05,7.4e-05,5.5e-05,3.7e-05,2.5e-05,6.1e-05,8.7e-05,0.000143,5e-05
0.000187,0.000121,6.5e-05,3.7e-05,7.7e-05,7.3e-05,4.9e-05,5e-05,5.7e-05,9e-05,3.6e-05,8.5e-05,7.5e-05,4.8e-05,4.5e-05,4.5e-05,3.7e-05,3e-05,0.000113,7.4e-05,6.7e-05,7.4e-05,5.4e-05,3e-05,3.1e-05,1.5e-05,8.8e-05,0.000128,6.3e-05,7.4e-05,1.2e-05,3.6e-05,5.6e-05,5.4e-05,0.000128,3.2e-05,6.2e-05,6.4e-05,0.000126,6.4e-05,6e-05,5.2e-05,2.7e-05,9.1e-05,6.8e-05,3.7e-05,9e-05,7.4e-05,7.7e-05,5.5e-05,0.000101,6.1e-05,7.7e-05,6.5e-05,9.7e-05,5.3e-05,1e-05,3.4e-05,7.2e-05,1e-05,5.3e-05,6.2e-05,7.5e-05,0.000112,2.7e-05,7.4e-05,9e-05,1.9e-05,9.4e-05,5e-06,0.000113,7.5e-05,4.7e-05,7.4e-05,0.000112,6e-05,5.8e-05,4.3e-05,4.8e-05,5.4e-05,2.7e-05,7.6e-05,0.000115,4.7e-05,0.000135,0.000133,8e-05,3.1e-05,3.1e-05,2.4e-05,0.000112,4.5e-05,3.8e-05,4.5e-05,5.3e-05,6.7e-05,6.1e-05,2.6e-05,3.7e-05,6.6e-05,7.8e-05,0.000118,4.8e-05,6.7e-05,6.9e-05,0.000157,4.9e-05,6.4e-05,0.000121,1.1e-05,5.7e-05,7e-06,9.3e-05,4.8e-05,7e-05,2.1e-05,6.9e-05,4.5e-05,6.9e-05,8.4e-05,0.000128
0.000149,8.9e-05,6.1e-05,0.000102,6.6e-05,7.3e-05,3.9e-05,3.5e-05,7.6e-05,7.7e-05,7.9e-05,6.7e-05,0.000107,9.9e-05,2.8e-05,4.6e-05,4.9e-05,0.000136,0.000167,0.000119,9.9e-05,6.9e-05,1e-05,1.4e-05,9e-05,6.7e-05,3.2e-05,0.000107,4.3e-05,9.7e-05,4.7e-05,4.1e-05,4.2e-05,4.6e-05,9.8e-05,5.9e-05,4.6e-05,0.000126,8.1e-05,4.4e-05,8.5e-05,6.7e-05,7.1e-05,0.000108,4.6e-05,3.7e-05,4.3e-05,0.00016,6.3e-05,9e-05,9.5e-05,7e-05,4e-05,6.5e-05,6.1e-05,5.5e-05,4.3e-05,1.6e-05,6.9e-05,5.6e-05,4.3e-05,1.5e-05,2.5e-05,7.8e-05,5.6e-05,9.9e-05,7.1e-05,4.9e-05,0.000118,4.4e-05,9.5e-05,7.4e-05,0.000124,9.9e-05,9.1e-05,7.7e-05,1e-04,6.9e-05,8.5e-05,7e-05,3.4e-05,8.2e-05,0.00016,4.9e-05,0.000118,0.000121,5e-05,2.1e-05,5.2e-05,7.5e-05,0.000108,7e-05,1.7e-05,4.8e-05,4.7e-05,5.9e-05,0.000114,6.2e-05,3.6e-05,3.7e-05,9e-05,0.000101,6.7e-05,0.000108,7.6e-05,0.000161,5.3e-05,3.2e-05,7.2e-05,2.7e-05,3.2e-05,1.9e-05,9.3e-05,5.9e-05,2.6e-05,4.7e-05,7.2e-05,5.4e-05,8.2e-05,8.3e-05,9.5e-05
0.000263,5.1e-05,5.1e-05,3.2e-05,4e-06,3.6e-05,7.8e-05,7.5e-05,0.000154,0.000107,0.000122,0.000108,6.8e-05,3e-05,0.000118,8.8e-05,4.5e-05,0.000165,0.000147,0.000155,8.6e-05,8.1e-05,9.8e-05,7.9e-05,7.7e-05,2.9e-05,0.000167,3.9e-05,1.6e-05,0.000107,8.8e-05,3.5e-05,7.6e-05,7.5e-05,0.000138,6.7e-05,5.1e-05,6.3e-05,0.000224,9.3e-05,9.6e-05,8.5e-05,0.000139,8.9e-05,6.6e-05,2.7e-05,3.3e-05,3.5e-05,9.3e-05,0.000123,0.000119,7.6e-05,3.2e-05,8.3e-05,6.9e-05,1.6e-05,2.6e-05,5.7e-05,0.000101,6.8e-05,8.7e-05,3.4e-05,4.4e-05,9.7e-05,9.5e-05,7.2e-05,5.2e-05,8.9e-05,0.000102,9.9e-05,0.00014,2.8e-05,5.3e-05,0.000152,0.000161,7.2e-05,9.9e-05,7.8e-05,0.000101,8.7e-05,8.1e-05,2.4e-05,0.000174,6.7e-05,0.000155,0.000121,1.9e-05,6.5e-05,8.2e-05,0.000131,4.3e-05,4.1e-05,8.9e-05,6.3e-05,0.000104,8.7e-05,7.5e-05,7.8e-05,5.7e-05,3.8e-05,0.000157,0.000125,8.1e-05,7.8e-05,4.2e-05,7.5e-05,8.7e-05,3.2e-05,0.000171,7.4e-05,9.8e-05,4.9e-05,6.2e-05,6.1e-05,8.4e-05,0.000103,6.5e-05,4.8e-05,6.4e-05,7.8e-05,0.000123
0.000159,0.000147,6.7e-05,8.5e-05,7.9e-05,9.7e-05,5.4e-05,0.000108,8.6e-05,5.1e-05,5.4e-05,4.7e-05,2.3e-05,6.4e-05,0.000167,6.3e-05,4.6e-05,0.00016,0.000129,9.8e-05,4.2e-05,9.5e-05,9.2e-05,9.9e-05,9.6e-05,7.3e-05,0.000203,0.000163,5.1e-05,6.6e-05,1.6e-05,5.6e-05,0.000131,0.000147,6.5e-05,4.4e-05,6.8e-05,5.2e-05,0.000183,0.000115,0.000123,0.000103,9.7e-05,4.6e-05,7e-05,7.8e-05,0.000104,0.000142,9.4e-05,3.6e-05,1.7e-05,0.000102,0.000102,7.3e-05,0.000127,7.5e-05,7.1e-05,7.3e-05,2.3e-05,2.8e-05,6.1e-05,5e-05,5.6e-05,1e-05,0.000103,1.4e-05,0.000106,0.000134,5.8e-05,6.8e-05,0.000129,5e-05,0.000117,0.000164,0.000133,1e-04,0.000147,0.000127,0.000151,0.000104,3.8e-05,3.6e-05,0.000104,6.8e-05,8.7e-05,0.000125,8.4e-05,6.5e-05,5.2e-05,9.1e-05,8.5e-05,7e-05,3.6e-05,2.1e-05,6.7e-05,5.4e-05,8.1e-05,9.5e-05,9.6e-05,0.000206,0.000112,0.000127,9.3e-05,9.2e-05,5.8e-05,8.1e-05,4.9e-05,6e-06,0.000134,8.5e-05,6.6e-05,6.1e-05,1.4e-05,0.000114,3.6e-05,9.8e-05,3.9e-05,4.8e-05,4.6e-05,0.000105,0.000138
0.000121,7.6e-05,3.2e-05,4.3e-05,0.000102,0.000134,8.9e-05,7.3e-05,6.4e-05,6.8e-05,4.7e-05,0.000105,7.5e-05,1.1e-05,0.000186,0.000174,5e-05,0.000101,0.000163,4.2e-05,5.9e-05,0.000109,6.5e-05,7.2e-05,3.2e-05,6.6e-05,0.000153,5e-05,6.2e-05,7.5e-05,6.6e-05,8.9e-05,3.1e-05,1.4e-05,0.000125,3.4e-05,2.3e-05,5.7e-05,0.000133,4e-05,7.3e-05,9e-05,6.3e-05,4.1e-05,9.4e-05,0.000127,3.5e-05,9e-05,4.7e-05,4.1e-05,9.8e-05,0.000108,5.6e-05,0.000193,7.1e-05,0.000128,0.000102,9.7e-05,9.1e-05,3.2e-05,4.5e-05,5.4e-05,2.9e-05,3.5e-05,3.3e-05,7.5e-05,7.9e-05,5e-05,9.2e-05,5.1e-05,0.000122,3.5e-05,4e-05,9.8e-05,0.000162,6.7e-05,6.1e-05,0.000155,0.000109,2e-05,3.5e-05,7.2e-05,8.3e-05,9.6e-05,0.000159,0.000116,0.000144,0.000109,2.3e-05,3.1e-05,2.7e-05,4.5e-05,4.6e-05,8.8e-05,1.6e-05,7.9e-05,0.000133,2.4e-05,3.2e-05,0.000158,0.000149,4.2e-05,5.4e-05,0.000123,8.8e-05,9e-05,5.9e-05,9e-06,7.9e-05,1e-04,0.000131,1e-04,5.6e-05,0.00012,0.000109,3.2e-05,2.9e-05,5.2e-05,7.5e-05,0.000112,0.000112
0.000151,3.1e-05,6.5e-05,0.000115,6.6e-05,0.000118,7.5e-05,0.000124,5e-05,0.000131,0.000104,7.1e-05,0.000114,7.6e-05,0.000164,1.4e-05,7.7e-05,9e-05,0.000195,5.5e-05,4.1e-05,9.9e-05,0.000114,0.000105,0.000119,7.9e-05,0.00012,4e-05,0.000105,0.000166,0.000123,3.8e-05,1.3e-05,8.7e-05,0.000119,6.5e-05,9.2e-05,4.8e-05,0.000196,0.000104,8.8e-05,9.5e-05,4.3e-05,4.6e-05,6.9e-05,7.5e-05,0.000179,0.000119,7.2e-05,7.2e-05,8.4e-05,9.8e-05,9.6e-05,0.000138,5.8e-05,9.3e-05,7.1e-05,0.000137,3.3e-05,4e-05,6.7e-05,0.000112,5.5e-05,9.7e-05,6.9e-05,5.2e-05,2.4e-05,2.9e-05,9.9e-05,4.2e-05,8.1e-05,2.6e-05,9.7e-05,4.5e-05,0.000129,7.9e-05,4.1e-05,0.000208,7.1e-05,6.1e-05,0.00011,7.3e-05,8.9e-05,8.5e-05,0.000213,0.000205,0.00021,3.2e-05,3.9e-05,3.5e-05,8.3e-05,4.6e-05,0.000102,9.4e-05,0.000158,0.000104,7.7e-05,4.7e-05,3.4e-05,0.000114,0.000139,6.6e-05,6.2e-05,0.000151,0.000207,0.000258,2.7e-05,4.1e-05,0.000125,8.1e-05,0.00011,6e-05,0.000114,6.8e-05,2.2e-05,4e-05,4.4e-05,9.4e-05,9.4e-05,8.1e-05,2.9e-05
2e-04,0.000143,1.6e-05,0.000134,5.9e-05,0.000114,0.000123,7.9e-05,9.8e-05,5.1e-05,8.4e-05,7.8e-05,4.5e-05,0.000119,0.000188,0.000173,0.000196,0.000139,0.000135,9.5e-05,9.8e-05,0.000105,0.000105,1.4e-05,8.1e-05,4.8e-05,8.2e-05,0.000131,0.000188,0.000139,0.000163,0.000124,7.1e-05,0.000118,7.6e-05,9.9e-05,0.000142,5.5e-05,0.00011,8e-05,8.6e-05,9.9e-05,3e-05,5.8e-05,5.1e-05,4e-05,0.000147,0.000155,7e-05,0.00013,9.1e-05,7.8e-05,7.3e-05,0.000163,0.00017,0.000115,0.000135,7.7e-05,8.1e-05,9.8e-05,0.000101,9.5e-05,9e-05,0.000135,9.1e-05,3.7e-05,5.3e-05,4.2e-05,6e-05,7.2e-05,7.3e-05,4.6e-05,0.000177,0.00012,9.3e-05,6.7e-05,3.4e-05,0.000191,9.7e-05,1.7e-05,0.000146,0.000229,8.3e-05,2e-05,0.000251,1.8e-05,8.6e-05,0.000122,3.7e-05,6.2e-05,4.7e-05,9.1e-05,0.000175,0.00011,0.000202,0.00019,0.00022,0.000105,9.8e-05,0.000226,6.1e-05,3.3e-05,0.000107,9.2e-05,0.000182,7e-05,0.000138,4.6e-05,0.000137,7.4e-05,7.7e-05,4.9e-05,9.3e-05,2.6e-05,8.3e-05,8.2e-05,5.5e-05,0.000148,8.2e-05,3.1e-05,2.7e-05
0.000137,0.000111,1.3e-05,0.000116,1e-04,6.4e-05,0.000117,9.2e-05,0.000122,0.000136,5.6e-05,2e-05,3.6e-05,0.000153,0.000196,7.3e-05,7.8e-05,9.9e-05,0.00011,6.8e-05,0.000109,3.3e-05,0.000108,0.000158,4.2e-05,3.5e-05,4e-05,0.000131,4.6e-05,0.000111,9e-05,0.000106,6e-05,5.3e-05,0.000132,6.1e-05,7.5e-05,8.2e-05,1.3e-05,1.9e-05,2.8e-05,4.3e-05,5e-05,0.000116,5.8e-05,3.4e-05,4.8e-05,0.000226,0.00011,9.3e-05,9.1e-05,0.000132,2.3e-05,6e-05,0.000124,9e-06,0.000112,9e-05,0.000114,0.000143,6.5e-05,8.5e-05,6e-05,1.8e-05,2.2e-05,9e-05,1.8e-05,8e-06,4.3e-05,7.8e-05,9.4e-05,4.8e-05,0.000101,5.5e-05,0.000102,4.8e-05,2.7e-05,7.4e-05,5e-05,3.5e-05,0.00012,8e-05,0.000147,0.000128,4.7e-05,0.000151,4e-05,4e-05,9.2e-05,5.7e-05,4.8e-05,5.6e-05,5.3e-05,6.5e-05,9.6e-05,2.9e-05,9.4e-05,3.7e-05,4e-05,0.000132,7.3e-05,6.6e-05,4.6e-05,6.6e-05,0.000102,0.000129,7.1e-05,7.8e-05,0.000122,4.7e-05,7.2e-05,3.2e-05,6.6e-05,6.1e-05,0.000124,4.6e-05,7.6e-05,4.1e-05,5.9e-05,6.5e-05,9.4e-05
0.000151,8.5e-05,3.3e-05,3.3e-05,2.3e-05,7.3e-05,6.1e-05,6e-05,3.7e-05,7.8e-05,1.7e-05,2.1e-05,2.9e-05,5.1e-05,4e-06,6.6e-05,5.7e-05,4.3e-05,0.000103,9.4e-05,3.6e-05,5.6e-05,3.6e-05,9.2e-05,3e-05,3e-05,3.6e-05,8.4e-05,4.6e-05,5.4e-05,5.4e-05,3.6e-05,1.4e-05,5.1e-05,8.9e-05,8e-05,1.7e-05,1.8e-05,4.8e-05,3.4e-05,5.3e-05,3.1e-05,3e-05,6.8e-05,5.2e-05,6.5e-05,5.3e-05,0.000139,4.1e-05,7.6e-05,6.2e-05,7.9e-05,4e-06,3.6e-05,9.6e-05,4.1e-05,8.5e-05,5.1e-05,2.8e-05,5e-05,6.5e-05,5.6e-05,6e-05,7.1e-05,1.5e-05,5.2e-05,6e-06,3.2e-05,6.4e-05,4e-05,8.5e-05,6e-05,4.8e-05,4.6e-05,9.9e-05,6.5e-05,9e-06,4.4e-05,3.3e-05,3.6e-05,4.5e-05,6.6e-05,0.000117,6.3e-05,8.2e-05,0.000119,8.4e-05,3.8e-05,3.8e-05,4e-05,1.9e-05,1.2e-05,5.4e-05,3e-05,6.5e-05,4.8e-05,4.2e-05,1.9e-05,2.6e-05,6.6e-05,4.4e-05,6.5e-05,3.4e-05,7.3e-05,2.8e-05,8.6e-05,7e-06,3.2e-05,9.3e-05,7e-06,1.6e-05,3e-06,4.9e-05,7.1e-05,2.5e-05,3.2e-05,5.7e-05,4.4e-05,7.4e-05,4.7e-05,8.4e-05
0.000156,8.5e-05,1.8e-05,2.9e-05,3.1e-05,0.000102,7.2e-05,7.5e-05,4e-05,7e-05,8e-06,9e-06,2.8e-05,3e-05,4.9e-05,1.9e-05,1.4e-05,1.2e-05,0.000154,0.000116,9.7e-05,8.7e-05,6e-05,7.7e-05,1.2e-05,2.6e-05,7.4e-05,4.8e-05,5.1e-05,2.1e-05,4.6e-05,5e-05,2e-05,7.1e-05,0.000118,5.2e-05,1.1e-05,2.5e-05,6.1e-05,3.2e-05,6.4e-05,2.3e-05,2.3e-05,6.2e-05,1.3e-05,4.5e-05,4.9e-05,0.00012,1.8e-05,3.2e-05,6.2e-05,0.000111,1.6e-05,1.1e-05,6.6e-05,1.8e-05,3.1e-05,2.7e-05,2.4e-05,6.8e-05,2.4e-05,7.4e-05,1.7e-05,8.7e-05,3.9e-05,3.9e-05,2.1e-05,3.5e-05,5e-05,2.3e-05,7.6e-05,6.2e-05,4.1e-05,6.5e-05,2.6e-05,2.3e-05,3.5e-05,6e-05,4.6e-05,3.3e-05,6e-05,6.3e-05,0.000113,2.9e-05,0.000105,9e-05,9.5e-05,2.4e-05,1.6e-05,4.3e-05,3.3e-05,2.9e-05,4.5e-05,2.5e-05,4.4e-05,2.3e-05,8.6e-05,5e-05,3.5e-05,7.2e-05,4.7e-05,5.1e-05,5.4e-05,0.000109,5.3e-05,1e-04,2.6e-05,1.9e-05,9.3e-05,2.6e-05,3.2e-05,3.9e-05,5e-05,1.6e-05,3.2e-05,1.5e-05,1e-05,5.1e-05,5.4e-05,7e-05,7.7e-05
0.000119,7.1e-05,1.7e-05,3.1e-05,2.8e-05,8.7e-05,6.4e-05,3.7e-05,9e-06,6.1e-05,2.8e-05,1.7e-05,2.1e-05,2.2e-05,5.6e-05,2.1e-05,1.5e-05,7.7e-05,7.2e-05,6.6e-05,8e-05,0.000146,3.8e-05,3.8e-05,2.8e-05,3.1e-05,5.2e-05,3.4e-05,1e-05,4.1e-05,3.2e-05,4.1e-05,2.1e-05,4.9e-05,6.1e-05,4.5e-05,3e-05,3.4e-05,6.7e-05,2.6e-05,6.1e-05,3.3e-05,8e-06,2.7e-05,1.4e-05,3.8e-05,6.1e-05,0.000149,1.9e-05,2.4e-05,1.4e-05,9.6e-05,3.2e-05,1.9e-05,8.8e-05,1.6e-05,4.7e-05,2.6e-05,5e-06,7e-05,9.5e-05,3.4e-05,4e-05,2.7e-05,5.8e-05,5.3e-05,1.8e-05,2.7e-05,3.3e-05,2.2e-05,0.000112,3.3e-05,3.5e-05,6e-05,8.5e-05,3.4e-05,5.1e-05,6.8e-05,2.4e-05,5.6e-05,5.1e-05,1.1e-05,7.8e-05,4.1e-05,0.000121,0.000102,4.2e-05,1.3e-05,2.7e-05,1.3e-05,4e-06,6e-06,5.1e-05,3.7e-05,2.4e-05,4.2e-05,7.1e-05,3.2e-05,3.7e-05,6e-05,6.5e-05,0.000105,3.1e-05,8.7e-05,2.8e-05,0.000125,2.7e-05,3.2e-05,6.3e-05,4.7e-05,5.5e-05,2e-06,5.2e-05,9e-06,3.6e-05,4.7e-05,2.8e-05,6.4e-05,2e-05,6.4e-05,0.000121
0.000127,9.3e-05,4.6e-05,6.4e-05,4.3e-05,9.6e-05,2.1e-05,3.4e-05,3.2e-05,6.8e-05,2.4e-05,9e-06,1.9e-05,2.7e-05,4.9e-05,2.7e-05,1.2e-05,8e-05,8.3e-05,1e-04,4.6e-05,9e-05,5e-05,3.9e-05,1.8e-05,1.9e-05,7.1e-05,9.7e-05,6.6e-05,8.6e-05,3.9e-05,3e-05,9e-06,3.5e-05,8.2e-05,4e-06,1.8e-05,3.3e-05,2.9e-05,1.2e-05,6.8e-05,2.8e-05,1.3e-05,6.3e-05,4e-05,2e-06,2e-05,0.000117,4.9e-05,0.000103,6e-05,6.1e-05,6e-06,2.6e-05,5.9e-05,1.7e-05,5.4e-05,1.1e-05,2e-05,3.8e-05,5.1e-05,3.9e-05,4.8e-05,6.7e-05,4.7e-05,5.6e-05,9e-06,1.3e-05,4.2e-05,3.3e-05,8.4e-05,3.8e-05,5.8e-05,1.8e-05,6.5e-05,4.2e-05,1.1e-05,3.6e-05,4.4e-05,7.6e-05,2.9e-05,2e-05,8.4e-05,3.2e-05,9.2e-05,7.5e-05,4.4e-05,1.5e-05,3e-05,1.9e-05,1e-05,1.9e-05,7.9e-05,1e-05,1.4e-05,2.3e-05,7e-05,1.8e-05,1.7e-05,7.3e-05,4.8e-05,0.000108,5.3e-05,0.000107,4.4e-05,0.000123,3.6e-05,3.2e-05,6.1e-05,5.3e-05,1.4e-05,3e-05,7.3e-05,1.5e-05,2.7e-05,4.5e-05,2e-05,3.5e-05,5.5e-05,4.7e-05,0.000104
0.000124,7.5e-05,2.8e-05,3.8e-05,3.5e-05,9.5e-05,4e-05,1.1e-05,1.3e-05,6.3e-05,2.6e-05,5e-06,6e-06,1.4e-05,4.1e-05,3.2e-05,2.2e-05,6.6e-05,7.3e-05,6.2e-05,3.2e-05,8e-05,2.6e-05,4e-05,1e-05,1.2e-05,7.2e-05,7.5e-05,4.3e-05,6.3e-05,2.5e-05,1.5e-05,1.5e-05,2.1e-05,8.8e-05,1.2e-05,4e-06,1.2e-05,5.7e-05,8e-06,4.3e-05,4.4e-05,1e-05,5.1e-05,2.2e-05,9e-06,4e-05,0.000112,5.6e-05,5.7e-05,4.6e-05,7.3e-05,5e-06,1.3e-05,5.3e-05,5e-06,2.9e-05,1.7e-05,3.1e-05,2.7e-05,4.9e-05,4.2e-05,4.4e-05,5.3e-05,3.5e-05,7.3e-05,1.7e-05,7e-06,4.5e-05,1.6e-05,8.6e-05,3.5e-05,5e-05,3.3e-05,6.5e-05,3.5e-05,2e-06,3.4e-05,3.9e-05,5e-05,2.3e-05,1.7e-05,0.000105,2.8e-05,7.7e-05,0.000106,5e-05,1.4e-05,4e-06,3.5e-05,3e-05,9e-06,5.7e-05,1.9e-05,1.7e-05,2.3e-05,8.2e-05,2.4e-05,1.1e-05,6.9e-05,5.8e-05,8.3e-05,3e-06,9.2e-05,3.5e-05,9.3e-05,2.3e-05,1.1e-05,5.8e-05,4.2e-05,9e-06,1.6e-05,6e-05,1e-05,3.3e-05,3e-05,9e-06,3.3e-05,5.3e-05,7.9e-05,9.3e-05
0.000123,7.6e-05,1.7e-05,4.9e-05,4.5e-05,9.4e-05,3.9e-05,1.9e-05,1.5e-05,5.9e-05,2.4e-05,7e-06,1.6e-05,1.4e-05,4.7e-05,1.4e-05,2.9e-05,4.3e-05,8.3e-05,6e-05,3.9e-05,7.8e-05,1.4e-05,5.4e-05,8e-06,1.2e-05,7.9e-05,7.2e-05,3.6e-05,4.7e-05,1.4e-05,1.6e-05,8e-06,5e-06,9.5e-05,1e-05,7e-06,5e-06,5.4e-05,1.3e-05,5e-05,2.6e-05,4e-06,4.1e-05,2.3e-05,6e-06,4.4e-05,0.000115,3.9e-05,5.5e-05,4.9e-05,5.8e-05,4e-06,1.6e-05,5.9e-05,6e-06,2.6e-05,5e-06,9e-06,2.3e-05,5.4e-05,4e-05,4.1e-05,6.8e-05,3e-05,6.4e-05,1.3e-05,2e-06,3.8e-05,7e-06,8.2e-05,3.6e-05,4.3e-05,2.8e-05,6.9e-05,3e-05,2e-06,4.2e-05,3.8e-05,5.6e-05,1.2e-05,2.2e-05,0.00011,2.7e-05,9.3e-05,0.000109,5.2e-05,4e-06,1.3e-05,2.7e-05,2.2e-05,1.5e-05,4.4e-05,1.3e-05,9e-06,2.5e-05,7.6e-05,2.1e-05,9e-06,5e-05,6.7e-05,6.8e-05,1.6e-05,9.9e-05,4.1e-05,9.1e-05,1.7e-05,1.1e-05,7.1e-05,3.6e-05,7e-06,5e-06,6.1e-05,6e-06,2.9e-05,3.3e-05,1e-05,3.7e-05,4.6e-05,7.9e-05,8.1e-05
0.000124,7.5e-05,2.1e-05,4.2e-05,3.3e-05,8.4e-05,4.4e-05,2.1e-05,1.1e-05,5.4e-05,2.4e-05,1e-06,1.3e-05,1.8e-05,4.3e-05,2.3e-05,2.3e-05,5.1e-05,9.1e-05,5.3e-05,3.8e-05,6.8e-05,1.7e-05,5e-05,5e-06,1.2e-05,6.2e-05,7e-05,4.1e-05,5.4e-05,2.4e-05,2.1e-05,6e-06,6e-06,8e-05,1.2e-05,6e-06,3e-06,5.8e-05,1.4e-05,5.7e-05,2.9e-05,3e-06,4.5e-05,2.3e-05,1e-06,3.6e-05,0.000105,4.4e-05,5e-05,4e-05,6.6e-05,6e-06,1.7e-05,5.7e-05,4e-06,3.1e-05,1e-06,1.3e-05,1.7e-05,5.5e-05,4.6e-05,3.3e-05,5.5e-05,3.3e-05,6.1e-05,6e-06,2e-06,3.6e-05,7e-06,8.2e-05,3.6e-05,4.5e-05,2.5e-05,6.8e-05,3.4e-05,8e-06,4.1e-05,3.3e-05,5.4e-05,1.8e-05,2.2e-05,0.000106,2.4e-05,7.8e-05,0.000101,5.1e-05,3e-06,1e-05,2.5e-05,2.6e-05,1.2e-05,3.9e-05,1.6e-05,3e-06,2.8e-05,8.2e-05,1.7e-05,7e-06,5.5e-05,6e-05,6.3e-05,1e-05,9.4e-05,3.9e-05,8.5e-05,1.5e-05,1.9e-05,6.4e-05,3.9e-05,4e-06,1e-05,6.2e-05,6e-06,2.5e-05,3.3e-05,1.5e-05,3e-05,5.6e-05,7.3e-05,8.4e-05
