0.004916,0.005181,0.005056,0.005052,0.006131,0.006153,0.005053,0.004964,0.00503,0.004789,0.004791,0.004959,0.004848,0.004395,0.004112,0.003902,0.003907,0.004309,0.004685,0.005074,0.005146,0.005201,0.005434,0.005392,0.005318,0.004833,0.004476,0.005201
0.005867,0.006129,0.006005,0.005959,0.006993,0.007087,0.006117,0.006009,0.006104,0.005898,0.005895,0.005997,0.005808,0.005303,0.004951,0.004728,0.004787,0.005352,0.005879,0.006235,0.006173,0.006186,0.006485,0.006456,0.006367,0.005857,0.005554,0.006399
0.007352,0.00755,0.00743,0.007402,0.008403,0.00865,0.007878,0.007698,0.007875,0.007776,0.007827,0.00781,0.007374,0.006729,0.006282,0.006048,0.006176,0.007074,0.007865,0.008012,0.007662,0.007644,0.008076,0.00804,0.007913,0.007489,0.007342,0.008272
0.008297,0.008322,0.008158,0.008319,0.009373,0.009701,0.008987,0.008695,0.008875,0.009006,0.009354,0.009232,0.00841,0.007563,0.007063,0.006863,0.007014,0.008227,0.009171,0.008865,0.008227,0.008246,0.008845,0.008687,0.008432,0.008462,0.008598,0.009223
0.008697,0.008372,0.008146,0.008605,0.009659,0.009945,0.009127,0.008663,0.008845,0.009194,0.009721,0.009674,0.008782,0.00786,0.007379,0.007259,0.007368,0.00866,0.009541,0.008763,0.007999,0.008073,0.008793,0.008551,0.008153,0.008861,0.009224,0.009194
0.009016,0.008265,0.007955,0.00887,0.010248,0.010286,0.008975,0.008197,0.00847,0.009041,0.00938,0.009434,0.009088,0.008631,0.008219,0.008074,0.008152,0.009071,0.00943,0.008472,0.007873,0.008015,0.008698,0.008673,0.008467,0.009343,0.00949,0.009088
0.009796,0.00873,0.008316,0.009654,0.011478,0.01108,0.009241,0.008507,0.008935,0.009325,0.009135,0.009157,0.009691,0.010204,0.009861,0.009417,0.009794,0.010535,0.010181,0.009313,0.008915,0.008995,0.00933,0.009416,0.009495,0.009997,0.010353,0.010419
0.011571,0.010162,0.009553,0.010971,0.013113,0.012518,0.010024,0.009735,0.010903,0.010938,0.009887,0.009686,0.011128,0.012476,0.012209,0.011574,0.012553,0.013719,0.013056,0.012032,0.011224,0.010846,0.010648,0.010565,0.010642,0.010899,0.012064,0.012774
0.013993,0.011756,0.011126,0.012854,0.015341,0.014835,0.011873,0.012345,0.014308,0.013858,0.011886,0.011015,0.012781,0.014556,0.014759,0.014335,0.015625,0.01762,0.017316,0.015944,0.014786,0.014099,0.013041,0.012221,0.012144,0.01235,0.01405,0.014929
0.016342,0.013324,0.01285,0.014777,0.017863,0.018065,0.0148,0.015537,0.017889,0.017015,0.014242,0.012332,0.013814,0.015816,0.016548,0.016435,0.017835,0.02072,0.021093,0.019208,0.018057,0.017768,0.015668,0.013576,0.013931,0.014436,0.015555,0.016094
0.017432,0.014087,0.013913,0.015852,0.018803,0.019624,0.017134,0.017816,0.020014,0.019292,0.016232,0.013268,0.014728,0.017007,0.017358,0.017084,0.018381,0.021608,0.022299,0.020168,0.01959,0.020324,0.017735,0.014623,0.015628,0.016309,0.016097,0.016521
0.016634,0.013907,0.014598,0.016678,0.018152,0.018755,0.017928,0.018405,0.019823,0.019528,0.017361,0.014589,0.015975,0.017738,0.017173,0.016768,0.017858,0.020476,0.020699,0.019175,0.019612,0.020456,0.017825,0.014978,0.016313,0.016789,0.015857,0.016298
0.015616,0.013812,0.01528,0.017552,0.017228,0.016961,0.017502,0.017841,0.018053,0.017971,0.017165,0.015316,0.016521,0.017678,0.016515,0.01635,0.017185,0.018174,0.017603,0.017363,0.018606,0.018158,0.015593,0.014072,0.015434,0.015685,0.014887,0.015223
0.014672,0.013813,0.015599,0.017826,0.017817,0.016665,0.016126,0.016709,0.016814,0.017204,0.01642,0.014481,0.015554,0.016339,0.01508,0.0153,0.0159,0.015742,0.015229,0.015553,0.016245,0.015048,0.01407,0.013642,0.013711,0.013842,0.013555,0.013857
0.014073,0.01353,0.015364,0.017359,0.018836,0.017287,0.014132,0.014382,0.01589,0.01672,0.015148,0.013385,0.014301,0.015074,0.014339,0.014,0.013756,0.014107,0.014768,0.014617,0.014156,0.013513,0.014491,0.014211,0.012427,0.012709,0.013677,0.014116
0.015101,0.01362,0.015197,0.017228,0.020314,0.019038,0.013895,0.013138,0.015966,0.016897,0.014477,0.013843,0.015376,0.01694,0.016606,0.01442,0.013024,0.015131,0.016865,0.016096,0.015564,0.015686,0.017036,0.016245,0.013634,0.013645,0.015247,0.015845
0.017047,0.014538,0.016966,0.020373,0.023504,0.021968,0.017272,0.016085,0.019596,0.02035,0.016237,0.016398,0.019988,0.022557,0.021279,0.017741,0.016485,0.01982,0.021133,0.018901,0.018231,0.019546,0.021095,0.020266,0.017696,0.016355,0.017535,0.018321
0.019261,0.016519,0.020345,0.025758,0.027303,0.024979,0.022666,0.022021,0.026743,0.027136,0.020263,0.021086,0.02628,0.028159,0.026475,0.023489,0.022991,0.026575,0.027396,0.023728,0.021796,0.02453,0.026517,0.025446,0.022937,0.020882,0.022387,0.022834
0.020822,0.019162,0.024544,0.030728,0.03076,0.028378,0.028444,0.028616,0.033947,0.033601,0.025523,0.027409,0.032353,0.031556,0.029489,0.028551,0.029795,0.033361,0.034895,0.03153,0.027406,0.029894,0.031729,0.030747,0.028716,0.02664,0.028288,0.027103
0.024071,0.023881,0.02937,0.032387,0.031854,0.031832,0.03265,0.032191,0.036899,0.03596,0.030265,0.03348,0.036546,0.033879,0.030514,0.030719,0.034587,0.038976,0.041935,0.039605,0.032521,0.032869,0.034579,0.03425,0.033562,0.032329,0.032885,0.02899
0.028322,0.02996,0.033687,0.031354,0.030677,0.033569,0.033842,0.031855,0.035741,0.035758,0.034419,0.037724,0.037693,0.035792,0.032956,0.032451,0.036524,0.041715,0.046283,0.04553,0.036334,0.033572,0.035644,0.035373,0.034949,0.036168,0.035752,0.027938
0.031139,0.035414,0.036528,0.031473,0.030837,0.032335,0.031787,0.029841,0.033052,0.036058,0.039017,0.040848,0.037243,0.035147,0.034565,0.033786,0.034261,0.039579,0.046308,0.045691,0.037438,0.034044,0.034905,0.0334,0.033289,0.037236,0.035949,0.025376
0.031784,0.039363,0.039329,0.033526,0.032704,0.029146,0.028317,0.031392,0.036878,0.042516,0.045835,0.043792,0.035824,0.031232,0.032858,0.034123,0.029926,0.03329,0.041795,0.040434,0.036439,0.034772,0.032925,0.031564,0.033202,0.036577,0.033015,0.023634
0.032736,0.041001,0.04122,0.035559,0.034693,0.028395,0.02697,0.033549,0.041341,0.047472,0.051374,0.049207,0.036831,0.028466,0.031344,0.034841,0.029422,0.028145,0.0355,0.03665,0.036705,0.034668,0.030074,0.031048,0.035044,0.037027,0.033168,0.025193
0.034505,0.038031,0.040234,0.034937,0.032632,0.030125,0.03059,0.03522,0.041189,0.045072,0.048327,0.04867,0.036936,0.027352,0.031792,0.035981,0.028041,0.022454,0.029209,0.034898,0.037481,0.035148,0.029896,0.030873,0.035054,0.036315,0.033415,0.025007
0.035621,0.033442,0.036769,0.032316,0.027602,0.03063,0.03562,0.035354,0.035336,0.036654,0.037546,0.039793,0.036684,0.029147,0.031405,0.033994,0.023927,0.018874,0.026435,0.033033,0.034579,0.032076,0.030366,0.030832,0.034529,0.035859,0.031947,0.023223
0.036145,0.033119,0.035009,0.03196,0.026114,0.030448,0.038723,0.035902,0.029957,0.029428,0.0294,0.031744,0.037877,0.033273,0.031102,0.032432,0.022756,0.019911,0.028298,0.033066,0.030497,0.028148,0.031704,0.033516,0.037005,0.038163,0.032954,0.024638
0.032463,0.035978,0.035832,0.031657,0.028613,0.032911,0.04022,0.039441,0.032644,0.030774,0.031089,0.034322,0.046367,0.040021,0.032081,0.0348,0.027625,0.027173,0.035942,0.035261,0.027624,0.026101,0.03419,0.038569,0.040248,0.039725,0.03608,0.031076
0.025804,0.038055,0.040033,0.032606,0.031689,0.036114,0.039965,0.04334,0.038195,0.036525,0.03773,0.041281,0.056258,0.047991,0.03588,0.037766,0.032687,0.03759,0.049566,0.04368,0.028993,0.025206,0.035423,0.042833,0.043095,0.039262,0.040717,0.042707
0.025339,0.040836,0.043644,0.033871,0.036513,0.042684,0.043376,0.049666,0.044685,0.045118,0.047212,0.047074,0.059213,0.053175,0.044945,0.044247,0.037721,0.048568,0.064023,0.057915,0.037091,0.025397,0.035835,0.048695,0.048725,0.041239,0.048796,0.057142
0.03139,0.0482,0.049301,0.036077,0.042672,0.053431,0.050954,0.056891,0.052242,0.055577,0.061494,0.051898,0.053564,0.057145,0.058726,0.053978,0.044259,0.056336,0.070002,0.067069,0.046341,0.026843,0.036887,0.057407,0.060945,0.048551,0.055342,0.066867
0.041836,0.05826,0.052726,0.033813,0.043003,0.059748,0.056557,0.058487,0.055969,0.062623,0.072582,0.053223,0.045372,0.061505,0.068787,0.058916,0.049677,0.058318,0.063827,0.064309,0.048535,0.026183,0.037812,0.063888,0.069884,0.052053,0.053,0.064029
0.048413,0.060721,0.049064,0.026347,0.03391,0.054915,0.054653,0.051299,0.050702,0.058854,0.071398,0.048901,0.039355,0.062428,0.066791,0.052394,0.04647,0.052401,0.052675,0.052724,0.040511,0.021507,0.03313,0.058756,0.065507,0.047012,0.042881,0.049321
0.044865,0.050676,0.041745,0.020961,0.020692,0.040181,0.044262,0.041769,0.040245,0.044644,0.056489,0.037818,0.030486,0.051469,0.052582,0.038161,0.033736,0.037816,0.038328,0.038778,0.028091,0.016824,0.02665,0.043187,0.046958,0.033169,0.027733,0.031398
0.031861,0.033541,0.032207,0.018793,0.013811,0.026678,0.03041,0.031753,0.032124,0.032397,0.038978,0.027914,0.022797,0.034598,0.035882,0.026205,0.019376,0.022236,0.026547,0.028963,0.01972,0.014937,0.024783,0.029171,0.025929,0.018467,0.015179,0.019843
0.017599,0.020617,0.023515,0.016184,0.013005,0.019843,0.021751,0.022011,0.023442,0.025005,0.026796,0.020237,0.017487,0.024451,0.022611,0.015448,0.011315,0.015455,0.01923,0.018956,0.012399,0.013612,0.022651,0.020857,0.016799,0.013051,0.012695,0.019545
0.01056,0.012186,0.015627,0.012168,0.013825,0.018071,0.018069,0.016869,0.015616,0.0165,0.016071,0.014192,0.015988,0.019143,0.014583,0.010348,0.008607,0.012364,0.014993,0.011965,0.007177,0.012364,0.019324,0.015508,0.013924,0.012675,0.012447,0.01874
0.008298,0.007419,0.009578,0.008153,0.015016,0.018809,0.014813,0.012389,0.01208,0.011813,0.01007,0.012939,0.016507,0.016033,0.013273,0.011013,0.007918,0.011726,0.016131,0.012584,0.006824,0.011579,0.016094,0.012406,0.011494,0.012868,0.012939,0.016203
0.0074,0.00703,0.01053,0.008255,0.015988,0.018558,0.010662,0.008684,0.012901,0.011835,0.009696,0.014715,0.01691,0.01317,0.012222,0.011919,0.007837,0.011959,0.017379,0.0148,0.009552,0.011514,0.012237,0.011844,0.013195,0.015789,0.017712,0.015583
0.006914,0.008954,0.014809,0.01105,0.017606,0.020087,0.009445,0.006828,0.01487,0.014717,0.010891,0.01524,0.015431,0.012022,0.011538,0.011915,0.010003,0.014396,0.017498,0.015947,0.01295,0.011532,0.008257,0.01196,0.018443,0.021674,0.02342,0.017209
