1.9e-05,1e-06,1.1e-05,7e-06,1.2e-05,3e-06,1.4e-05,1.5e-05,1.6e-05,1e-05,1.4e-05,2.9e-05,7.7e-05,0.00044,9e-06,9.9e-05,1e-06,0.000257,1.7e-05,0.000309,0.00074,0.000472,0.000185,0.000657,0.000212,0.000208,0.000781,1e-06,0.000596,0.000225,0.000541,0.000445,0.00039,4.3e-05,0.000592,0.000751,0.001,0.000227,0.00055,0.000139,0.000117,0.000105,7.5e-05,0.000276,0.000453,0.000283,0.000436,0.00027,0.000357,3e-05,7.1e-05,0.000263,8.8e-05,0.000146,4.4e-05,2.1e-05,0.000159,0.000159,7.5e-05,6.2e-05,2.4e-05,4.2e-05,1.2e-05,2.3e-05,1.5e-05,1.3e-05,1.6e-05,1.7e-05,1.3e-05,5e-05,6.4e-05,0.000121,8e-06,2.8e-05,2.4e-05,4.4e-05,5.3e-05,3.1e-05,1e-05,2.7e-05,2e-05,2.7e-05,0.000216,7e-06,9.9e-05,4.2e-05,5e-05,0.000122,0.000146,4.3e-05,7.4e-05,3.2e-05,2.6e-05,0.000219,7.6e-05,2.7e-05,2.7e-05,1.3e-05,0,4.8e-05,8.6e-05,7.1e-05,3.6e-05,3.6e-05,6e-06,0.000112,8.2e-05,1.3e-05,5.2e-05,4.4e-05,2.9e-05,1.8e-05,1e-06,1.4e-05,1.7e-05,2e-05,3e-06,1.4e-05,1e-06,3e-06,1e-06
2.8e-05,3.8e-05,5.3e-05,3.9e-05,2.3e-05,1.2e-05,1.9e-05,1e-05,4.1e-05,3.2e-05,4.1e-05,3.1e-05,0.00017,0.000951,0.000111,0.000432,0.000177,0.000321,0.000562,0.000342,0.001578,0.001532,0.001477,0.00358,0.002736,0.000532,0.001564,0.001537,0.002626,0.00106,0.000422,0.000568,0.002315,0.000549,0.000881,0.00111,0.00324,0.001926,0.001479,0.000921,0.001415,0.00132,0.001069,0.00037,0.000419,0.000964,0.000765,0.000297,0.000835,0.000734,0.000324,0.00073,0.000203,0.000267,0.000271,0.000303,0.000207,0.000169,0.000174,0.000327,0.000111,5.8e-05,8.1e-05,4.9e-05,4e-05,7.6e-05,0.000123,7.8e-05,9.5e-05,0.000125,0.000137,0.000273,0.000198,0.000148,0.000137,0.000202,0.000248,0.000124,4.5e-05,5.9e-05,8.4e-05,0.000353,0.000696,0.000597,0.000438,0.000271,0.000272,0.000314,0.000522,0.000332,0.000195,0.00016,9e-05,0.000497,0.000326,0.000314,0.000174,9e-05,5.9e-05,0.000105,0.000291,0.00035,0.000181,8.4e-05,7.2e-05,0.000183,0.000348,0.000338,0.000153,6.2e-05,9.3e-05,6.3e-05,2.5e-05,4.2e-05,2.9e-05,5.3e-05,4.9e-05,2.6e-05,2.7e-05,5e-05,5.7e-05
3.6e-05,1.9e-05,6.5e-05,3.2e-05,4.3e-05,3e-05,3e-05,1.7e-05,4.3e-05,1.7e-05,4.9e-05,4.5e-05,7.3e-05,0.001064,0.000485,0.000111,0.000423,0.000696,0.000587,0.000412,0.000655,0.002006,0.003415,0.005675,0.002772,0.00274,0.000914,0.001079,0.002309,0.001161,0.00134,0.000526,0.00271,0.002926,0.002262,0.0015,0.001407,0.002116,0.001282,0.001361,0.00167,0.001755,0.000508,0.000487,0.000573,0.001069,0.000848,0.001093,0.000831,0.00039,0.000548,0.00084,0.00026,0.000249,0.000721,0.000542,0.000586,0.000619,0.000299,0.000149,0.00024,0.000329,0.000243,0.000209,0.000233,0.000243,0.000252,0.000235,0.000108,6.8e-05,0.000241,0.000217,0.000527,0.000339,0.000266,0.000145,8.1e-05,0.000324,0.000222,0.000216,0.000235,0.000826,0.000254,0.000268,7e-06,0.000138,0.000235,0.000475,0.000337,0.000248,0.000121,5.4e-05,6e-06,0.000777,0.000698,0.000238,3.8e-05,3.2e-05,3.6e-05,2e-04,0.000399,6.6e-05,6e-06,2.4e-05,3.1e-05,0.000235,0.000684,0.000151,0.000109,8.1e-05,5.2e-05,5.9e-05,3.9e-05,3.6e-05,1.1e-05,1.8e-05,2e-05,3.5e-05,1.9e-05,3.5e-05,6.6e-05
4.6e-05,5.5e-05,7.3e-05,4e-05,4.4e-05,3.6e-05,3.7e-05,4.7e-05,4e-05,2.7e-05,3.5e-05,5.8e-05,9e-06,0.001575,0.001089,0.000527,0.000538,0.000777,0.000292,0.000403,0.000427,0.004872,0.000987,0.003566,0.001021,0.001306,0.001989,0.001414,0.003634,0.001977,0.00337,0.003044,0.001163,0.001997,0.001675,0.001083,0.001059,0.000481,0.001756,0.001953,0.000435,0.001543,0.000923,0.000587,0.000843,0.000964,0.000974,0.000553,0.000825,0.00062,0.000588,0.000449,0.000733,0.00082,0.001126,0.000269,0.000475,0.000642,0.000314,0.000149,0.000229,0.000333,7e-05,7.7e-05,0.000229,6.4e-05,0.00013,9e-06,0.000102,3.4e-05,0.000125,0.000283,0.000462,0.000277,2.1e-05,7.7e-05,0.000152,0.000265,0.000107,0.000151,7.4e-05,0.000908,0.000685,0.000573,0.000289,0.000168,0.000197,0.00043,0.000183,0.000172,4.3e-05,7.4e-05,4.7e-05,0.000998,0.000541,0.000328,5.9e-05,5.4e-05,3.8e-05,0.00021,0.000198,0.000139,7.3e-05,8.3e-05,3.8e-05,0.000257,0.000935,0.000805,0.000413,9.1e-05,8.4e-05,5e-05,2.1e-05,6.2e-05,5.8e-05,6.1e-05,5.5e-05,3e-05,4e-05,4.9e-05,6e-05
4e-06,3.8e-05,3e-06,1e-05,3.3e-05,1.7e-05,2.5e-05,8e-06,1e-05,2.7e-05,1.1e-05,4.2e-05,0.000143,0.001538,0.00187,0.00136,0.000402,0.000916,0.001549,0.001459,0.000921,0.005909,0.004729,0.007447,0.003304,0.001683,0.001801,0.002185,0.005393,0.003294,0.004886,0.002149,0.002704,0.001893,0.003909,0.00114,0.002774,0.001323,0.00209,0.002866,0.001791,0.000748,0.001072,0.00057,0.001627,0.002029,0.00097,0.001296,0.001586,0.000952,0.000288,0.000451,0.001065,0.000393,0.000833,0.000813,0.000923,0.000332,0.000303,6.5e-05,0.000275,0.00037,0.000321,0.000217,0.000256,0.000173,0.000179,0.000152,0.000229,0.000155,0.000257,0.00011,0.000304,9.6e-05,0.000126,6.1e-05,0.00012,2.7e-05,2.9e-05,0.000134,0.000121,0.000896,0.002187,0.000921,0.000436,6.8e-05,0.000112,8.1e-05,0.000108,0.000109,2.7e-05,4.9e-05,7.4e-05,0.001043,0.000547,0.000221,0.000141,9.3e-05,2.1e-05,0.000178,6.4e-05,5.5e-05,7e-06,4.7e-05,3.2e-05,0.000271,0.000882,0.000425,0.000194,2.6e-05,1e-05,4.4e-05,3.5e-05,5.5e-05,4.5e-05,1.7e-05,2.3e-05,3.2e-05,5.1e-05,3.8e-05,7.5e-05
2.1e-05,3e-05,2.2e-05,1e-06,1.9e-05,8e-06,2.2e-05,4.1e-05,4.4e-05,3.7e-05,1.1e-05,2e-05,0.000224,0.00161,0.002729,0.001151,0.000832,0.001054,0.001417,0.000363,0.001037,0.004063,0.004146,0.00322,0.002769,0.002503,0.001514,0.002503,0.003344,0.001346,0.003289,0.005392,0.004851,0.002013,0.002906,0.002597,0.003237,0.001849,0.002809,0.001684,0.001854,0.001642,0.001466,2.8e-05,0.002453,0.001943,0.001361,0.002187,0.001905,0.000354,0.00069,0.001194,0.001512,0.001472,0.000825,0.00068,7.3e-05,0.000178,0.000239,0.000223,0.000411,0.000329,0.000117,0.000191,0.000275,0.00021,0.000143,8.7e-05,0.000222,0.000133,0.000352,0.000334,0.000379,0.000233,8.2e-05,6.6e-05,0.000171,0.000109,6.1e-05,0.000213,4.1e-05,0.000599,0.003433,0.001878,0.00061,6.5e-05,9.3e-05,4.6e-05,0.000153,9.7e-05,3.5e-05,3.7e-05,7.5e-05,0.000884,0.000605,0.00024,6.1e-05,1.4e-05,3.8e-05,0.000122,4.9e-05,1.8e-05,4.1e-05,3.8e-05,2.7e-05,0.000289,0.000478,0.00023,0.000141,8e-05,3.7e-05,4.6e-05,3.1e-05,2.4e-05,8e-06,5e-06,3.7e-05,3.9e-05,3e-05,6.8e-05,5.1e-05
1.9e-05,2e-05,8e-06,8e-06,2.2e-05,1.5e-05,2.8e-05,3.8e-05,2.7e-05,1.9e-05,2.1e-05,2.7e-05,0.000277,0.001654,0.002359,0.001043,0.001662,0.001143,0.001334,0.001355,0.000401,0.003113,0.0022,0.000947,0.00451,0.002923,0.002985,0.000753,0.003836,0.003703,0.004959,0.005029,0.007501,0.004023,0.005026,0.005157,0.00809,0.0053,0.002722,0.002923,0.001089,0.002232,0.001832,0.00114,0.002439,0.002628,0.000235,0.001217,0.000879,0.001586,0.001692,0.001129,0.001198,0.000953,0.00093,0.000713,0.000553,0.000157,0.000202,0.00021,0.000753,0.00043,0.000308,0.000345,0.000107,8.8e-05,0.000368,0.00012,0.000177,0.000123,0.000262,0.000455,0.000679,0.000454,0.000311,0.000123,0.000136,1.5e-05,0.000122,0.000378,0.000363,0.00036,0.003123,0.001646,0.000467,0.000238,0.000169,0.000227,0.000203,0.000157,4.2e-05,5.3e-05,6.7e-05,0.000719,0.000925,0.000542,0.000217,7.2e-05,5.3e-05,7.1e-05,0.000122,1e-04,9.2e-05,8.2e-05,7.7e-05,0.000331,0.000586,0.000411,0.000244,6e-05,3.7e-05,3e-05,5e-06,2.1e-05,3.2e-05,1.5e-05,2.7e-05,1.5e-05,2.3e-05,4.7e-05,7.1e-05
9e-06,2e-05,2.2e-05,1.1e-05,2.1e-05,2.2e-05,1.4e-05,4.9e-05,3.2e-05,1.4e-05,3e-05,1.8e-05,0.000349,0.001776,0.000801,0.00069,0.00216,0.001318,0.002768,0.001651,0.000316,0.002352,0.002956,0.00526,0.005254,0.009966,0.004149,0.003485,0.001036,0.00339,0.004006,0.003851,0.005105,0.004129,0.003277,0.008927,0.001079,0.001575,0.003537,0.001902,0.001524,0.001867,0.001196,0.002799,0.003721,0.003039,0.004323,0.002319,0.002286,0.000752,0.000551,0.000158,0.00191,0.001105,0.000788,0.000937,0.000443,0.000388,0.000436,0.000373,0.001463,0.000924,0.000454,7.1e-05,0.000253,0.000141,0.000443,0.000389,0.00025,0.000257,0.000221,0.000247,0.000627,0.000499,9.6e-05,7.2e-05,0.000141,0.000132,6.1e-05,0.000299,4.3e-05,0.000613,0.001471,0.001647,0.000774,0.000809,0.000348,0.000286,0.000298,0.000105,0.000164,0.000115,5.5e-05,0.001132,0.001378,0.000546,0.000146,3.9e-05,2.6e-05,5.4e-05,2.7e-05,1.8e-05,3.1e-05,2.8e-05,4.5e-05,0.000366,0.00098,0.000302,0.000158,0.000101,5.9e-05,1.8e-05,1.7e-05,2.7e-05,4.9e-05,1.8e-05,2.3e-05,2.9e-05,2e-05,4.5e-05,9.5e-05
8e-06,1.7e-05,4.2e-05,3e-05,2.9e-05,1.9e-05,2.4e-05,7.8e-05,8.4e-05,9e-05,9.7e-05,5e-05,0.000374,0.001298,0.004724,0.00282,0.000627,0.001243,0.003472,0.001985,0.001378,0.002745,0.003292,0.00804,0.007101,0.007497,0.00742,0.005995,0.005155,0.007564,0.006603,0.007438,0.00184,0.000902,0.004614,0.008472,0.008138,0.005376,0.003447,0.000991,0.001922,0.002173,0.00406,0.003821,0.003763,0.002067,0.004838,0.004414,0.001881,0.000599,0.001413,0.000742,0.001525,0.001362,0.000746,0.000884,0.001331,0.000804,0.000904,0.001053,0.002124,0.000748,0.000308,0.000379,0.000369,0.000226,0.000506,0.000247,0.000133,9.5e-05,9.8e-05,0.000352,0.000253,0.000339,0.000209,1e-04,0.00023,0.000273,0.000154,0.000225,0.000344,0.000437,0.001793,0.001388,0.000896,0.000913,0.000697,0.000283,0.000173,0.000224,0.000167,0.000112,3e-05,0.001436,0.001393,0.000791,0.000252,6.5e-05,5.5e-05,6.7e-05,0.000102,4.7e-05,8e-06,2.5e-05,3.7e-05,0.000341,0.000888,0.000684,0.000253,9.1e-05,4.9e-05,2.9e-05,2.8e-05,2.3e-05,4.2e-05,4.6e-05,3e-05,4.7e-05,8e-06,4.4e-05,6e-05
9e-06,1.5e-05,2.2e-05,5e-06,2e-05,3.1e-05,2.7e-05,5.8e-05,9e-06,4.2e-05,8.4e-05,5.8e-05,0.000392,0.001063,0.006509,0.002933,0.000253,0.001345,0.002949,0.001588,0.000713,0.003919,0.008981,0.004609,0.002897,0.003535,0.002418,0.004119,0.00122,0.007276,0.004157,0.005281,0.005607,0.003732,0.004087,0.002548,0.001857,0.002055,0.001498,0.000677,0.000989,0.001167,0.002774,0.003253,0.001722,0.00098,0.003296,0.001405,0.001379,0.001206,0.00085,0.00185,0.001949,0.000259,0.001145,0.000394,0.000849,0.000397,0.000892,0.000941,0.00115,0.000884,5.7e-05,0.000145,0.00012,0.000283,0.000175,0.000142,0.000195,0.000273,0.000301,0.000393,0.000543,0.000792,0.00042,8.2e-05,0.000151,0.000106,6.9e-05,0.000121,0.000137,0.000361,0.002241,0.001112,0.000382,0.000472,0.000401,0.000135,9.4e-05,0.000168,6.5e-05,0.000121,6.4e-05,0.001323,0.001353,0.000541,0.000124,7.2e-05,4.8e-05,4.2e-05,9.8e-05,8.3e-05,4.7e-05,4.2e-05,3.2e-05,0.000377,0.00054,0.000217,9.3e-05,4.7e-05,3.6e-05,1.6e-05,5e-06,2.6e-05,1.9e-05,4.1e-05,1.9e-05,2.9e-05,5e-05,3.4e-05,4.1e-05
2.4e-05,2.5e-05,2.4e-05,7e-06,1.6e-05,3.9e-05,1.9e-05,4.3e-05,2.4e-05,2.3e-05,4.7e-05,3.2e-05,0.000395,0.002478,0.005951,0.004606,0.002228,0.000898,0.002404,0.002064,0.001184,0.003429,0.007386,0.008477,0.006674,0.003107,0.002899,0.001908,0.000764,0.003608,0.001665,0.003256,0.004874,0.00151,0.003613,0.001525,0.002,0.002702,0.002912,0.001831,0.001938,0.001809,0.003139,0.001497,0.002437,0.002396,0.000525,0.002092,0.001455,0.000403,0.000405,0.000826,0.00071,0.000705,0.000591,0.00053,0.000464,0.000236,0.00055,7e-05,0.0012,0.000648,0.000266,0.000205,0.000201,2.4e-05,0.000148,9.9e-05,0.000115,0.000217,0.000428,0.000183,0.000508,0.000635,0.000336,0.000132,0.000113,4.3e-05,3.2e-05,6.3e-05,0.000248,0.000552,0.001354,4e-04,5.6e-05,0.000491,0.000288,0.000231,5e-05,0.000109,0.000139,2.6e-05,4.2e-05,0.000721,0.000854,0.000652,0.000321,7.2e-05,3.6e-05,5.5e-05,0.000121,6e-05,6.3e-05,1.9e-05,1.1e-05,0.000417,0.000331,0.000278,0.00015,2.6e-05,9e-06,1.2e-05,2e-06,2.7e-05,8e-06,4.8e-05,3.2e-05,2.5e-05,2.3e-05,4.7e-05,2.2e-05
1.7e-05,8e-06,6e-06,1.3e-05,1.4e-05,2.3e-05,1.1e-05,1.3e-05,2.9e-05,1.1e-05,3.4e-05,2.3e-05,0.000326,0.002503,0.00208,0.00022,0.000681,0.001027,0.001065,0.000445,0.000269,0.002933,0.006105,0.007624,0.002612,0.001437,0.001979,0.001147,0.003647,0.001499,0.001484,0.001888,0.001688,0.001126,0.003052,0.000855,0.001915,0.002143,0.000754,0.001166,0.001076,0.001447,0.000113,0.001523,0.002364,0.001411,0.001869,0.000268,0.001302,0.000293,0.000156,0.000332,0.000933,0.001155,0.000479,4.6e-05,6.6e-05,0.000277,0.000239,0.000233,0.000762,0.000474,0.000285,0.000146,8e-05,8.2e-05,5.1e-05,0.000128,3.4e-05,0.000144,0.000207,2.8e-05,0.00045,0.00017,7.9e-05,5.3e-05,8.7e-05,4.9e-05,7.5e-05,5e-05,0.00017,0.000505,0.00039,0.000498,0.000221,0.000318,0.00019,6.9e-05,0.000132,8.1e-05,0.000126,7.6e-05,1.9e-05,0.000264,0.000661,0.000204,8.7e-05,4.1e-05,7.1e-05,8.2e-05,8.7e-05,6.6e-05,4.8e-05,2.1e-05,1.1e-05,0.000451,0.000356,0.000197,8.3e-05,1.6e-05,4.4e-05,1.7e-05,9e-06,1.8e-05,1.9e-05,4.8e-05,2.8e-05,1.5e-05,1.4e-05,5e-05,2.7e-05
5e-06,5e-06,9e-06,1e-05,1e-05,1.9e-05,1.7e-05,1.5e-05,1.5e-05,1.5e-05,2e-05,2.3e-05,3e-04,0.001803,0.001301,0.000484,0.000238,0.001132,0.001192,0.000646,0.000541,0.003303,0.008127,0.002291,0.00077,0.001278,0.001058,0.002043,0.003559,0.001746,0.002809,0.000406,0.00256,0.001521,0.002897,0.002733,0.000965,0.002089,0.000492,0.001656,0.00147,0.001687,0.000548,0.0018,0.003331,0.001972,0.001128,0.000864,0.001869,0.000974,0.000276,0.000154,0.000624,0.000757,0.000361,0.000377,7.2e-05,0.000342,0.000332,7.2e-05,0.000388,0.000172,0.00031,0.000167,0.000138,0.000112,6.3e-05,0.00018,5.5e-05,7.6e-05,0.000172,5.3e-05,0.000454,0.000155,7.8e-05,1.3e-05,2.1e-05,2.4e-05,9.8e-05,6e-05,5.6e-05,0.000493,0.00049,0.000205,8.8e-05,0.000271,0.000218,0.000147,0.000125,1.1e-05,6.5e-05,3.4e-05,5.9e-05,0.000699,0.000409,0.000193,6.7e-05,3e-05,1.9e-05,0.000168,8.5e-05,3.6e-05,3e-05,6e-06,1.6e-05,0.000439,0.000237,1.8e-05,2.8e-05,4.4e-05,7e-06,5e-06,5e-06,1.2e-05,7e-06,1.4e-05,7e-06,1.1e-05,6e-06,3.4e-05,1.1e-05
7e-06,6e-06,7e-06,1.3e-05,6e-06,5e-06,4e-06,1.1e-05,1.7e-05,1.6e-05,2e-06,1e-06,0.000248,0.001072,0.001523,0.001069,0.00011,0.001152,0.001846,0.000998,0.000592,0.00282,0.004891,0.003486,0.001741,0.003069,0.000758,0.003348,0.001791,0.000438,0.002353,0.002333,0.004529,0.004698,8.6e-05,0.003551,0.001666,0.000947,0.001841,0.000875,0.000785,0.001798,0.001271,0.002946,0.002747,0.002353,0.002501,0.002245,0.002623,0.00054,0.000295,0.000307,0.000814,0.000883,0.000279,0.000194,8.2e-05,0.000389,0.000111,0.000107,0.000194,0.000227,0.000276,0.000169,0.000153,0.000124,4.1e-05,0.000176,0.00011,0.000118,0.000143,7e-05,0.00052,9.5e-05,7.7e-05,5.5e-05,2.3e-05,6.1e-05,5.9e-05,0.00012,0.000222,0.000567,0.000447,0.000126,2.3e-05,0.000329,0.00017,7.4e-05,3.2e-05,8.4e-05,9.7e-05,3.4e-05,6.1e-05,0.001134,0.000351,0.000161,2.2e-05,3.4e-05,7e-06,0.000135,8e-06,2.5e-05,1.9e-05,1.6e-05,3.6e-05,0.000471,0.000266,7.5e-05,2.1e-05,2.7e-05,8e-06,3.2e-05,7e-06,6e-06,1e-05,1.6e-05,7e-06,1.3e-05,1.5e-05,3.7e-05,3.1e-05
7e-06,1.4e-05,7e-06,4e-06,9e-06,2e-05,5e-06,1.2e-05,1.9e-05,8e-06,1.2e-05,6e-06,0.000206,0.002166,0.002037,0.000907,0.000609,0.001304,0.000687,0.000525,0.000292,0.002659,0.003587,0.005228,0.003034,0.002509,0.004439,0.006223,0.000949,0.000621,0.001576,0.000957,0.00292,0.002219,0.000971,0.004836,0.000252,0.002906,0.003503,0.00172,0.001137,0.003184,0.001421,0.004908,0.004527,0.003386,0.001233,0.001457,0.001761,0.001293,0.000898,0.000971,0.001327,0.001241,0.00169,0.001224,0.000311,0.000857,0.000597,0.000777,0.000128,0.000497,0.000205,0.000263,0.000266,3.5e-05,0.000151,0.000211,0.000244,4.6e-05,0.000237,0.000243,0.000432,6.5e-05,0.000124,4.6e-05,6.5e-05,0.000109,0.000178,9.5e-05,0.000374,0.000298,0.000318,0.000258,0.000326,0.000465,0.00028,0.000196,0.000158,1.4e-05,0.00011,8.4e-05,3.5e-05,0.001312,0.000675,0.000323,0.000139,1.5e-05,3e-05,8e-05,4.1e-05,3.1e-05,1.8e-05,2.4e-05,2.9e-05,0.000458,0.000676,0.000377,0.000152,2.3e-05,2e-05,3.7e-05,5.2e-05,3.8e-05,1.8e-05,2.5e-05,1.6e-05,2e-06,1.6e-05,4.9e-05,4.5e-05
1.3e-05,1.5e-05,1.2e-05,8e-06,7e-06,1.9e-05,2.6e-05,7e-06,2.7e-05,2e-05,1.8e-05,2e-05,0.000192,0.002841,0.000722,0.000888,0.000205,0.001025,0.002052,0.001088,0.000694,0.002961,0.005164,0.002016,0.002375,0.006486,0.009392,0.004412,0.005512,0.004353,0.002605,0.000353,0.002441,0.006947,0.002308,0.004524,0.006106,0.001814,0.005294,0.006131,0.007024,0.003844,0.001635,0.005566,0.003694,0.007134,0.004114,0.001712,0.004902,0.003578,0.002119,0.001573,0.002288,0.001285,0.003796,0.001562,0.00081,0.00179,0.001135,0.001506,0.001124,0.001321,0.001545,0.00082,0.000673,0.000451,0.000166,0.000422,0.000298,0.00043,0.000341,0.00037,0.000526,0.000274,0.000196,6.4e-05,0.000109,0.000289,0.000107,0.000319,0.00055,0.000705,0.00096,0.000491,0.000452,0.000202,0.000116,0.000138,5.5e-05,0.000116,0.000159,9.5e-05,5.2e-05,0.001412,0.000988,0.000502,0.000109,2.9e-05,4.7e-05,0.000104,2.9e-05,2.4e-05,2.4e-05,1.3e-05,1.9e-05,0.000444,0.000943,0.000742,0.000297,5.6e-05,5.2e-05,5.2e-05,1.9e-05,2.9e-05,8e-06,1.3e-05,3.1e-05,1.9e-05,2.8e-05,2.9e-05,1.9e-05
1.3e-05,2.8e-05,1.3e-05,5e-06,1e-05,1.7e-05,6e-06,9e-06,1.7e-05,1.5e-05,1.3e-05,4e-06,0.000191,0.003023,0.001629,0.001432,0.000438,0.001242,0.002391,0.001354,0.000581,0.003539,0.002081,0.004251,0.007528,0.002931,0.005555,0.008579,0.008089,0.001984,0.005415,0.004704,0.00444,0.009633,0.012099,0.010777,0.010419,0.007029,0.009374,0.008147,0.005265,0.007584,0.005124,0.006083,0.006671,0.008655,0.005829,0.003313,0.007717,0.00408,0.000892,0.003777,0.000436,0.003789,0.007017,0.006365,0.002508,0.00099,0.000785,0.001008,0.001102,0.00034,0.001065,0.001398,0.000366,0.000316,0.000404,0.000529,0.000139,0.000207,0.001104,0.000497,0.000399,0.00074,0.000497,0.000273,4.1e-05,0.000334,0.000112,0.000369,3e-04,0.000479,0.001417,0.001231,0.000507,0.000217,0.000276,6.4e-05,0.000141,0.000134,0.00011,7.4e-05,0.000131,0.00145,0.000509,0.000175,3.7e-05,3e-05,2.8e-05,0.000114,5.6e-05,3e-05,2.1e-05,3.2e-05,6.6e-05,0.000384,0.001254,0.000319,0.000139,0.00011,3.6e-05,2.1e-05,4e-05,4.2e-05,2.8e-05,1.9e-05,3.2e-05,1.3e-05,3.6e-05,4.7e-05,5.1e-05
1.6e-05,6e-06,5e-06,9e-06,1.5e-05,1e-05,2.2e-05,9e-06,2.1e-05,1.4e-05,1.5e-05,5e-06,0.000209,0.003748,0.002829,0.00107,0.000349,0.001493,0.000746,0.001461,0.001258,0.002908,0.000774,0.0031,0.005593,0.008215,0.001733,0.003121,0.002983,0.006058,0.003837,0.005486,0.003466,0.00573,0.005545,0.000588,0.004126,0.002081,0.004627,0.003533,0.008836,0.005054,0.001758,0.003958,0.007288,0.000423,0.003487,0.002365,0.004387,0.005267,0.002536,0.004398,0.005492,0.006175,0.006792,0.00207,0.001761,0.000861,0.000129,0.000647,0.000171,0.00086,0.000906,0.000653,0.001173,0.000641,0.000308,0.000169,0.000208,0.000281,0.001056,0.001302,0.000245,0.000993,0.000481,0.000239,0.000221,0.000467,0.000328,0.000389,0.000694,0.000452,0.000947,0.000355,0.000236,0.000329,0.000102,0.000159,0.000211,7.9e-05,1.5e-05,5.6e-05,9.8e-05,0.001262,0.000673,0.000249,3.4e-05,2.7e-05,3.9e-05,7.2e-05,9.6e-05,4.3e-05,1.6e-05,3.3e-05,8e-05,0.000461,0.001398,0.001036,0.000377,6.9e-05,4.3e-05,4.9e-05,6.1e-05,8e-06,1.1e-05,6e-06,2.4e-05,2.4e-05,3.4e-05,2e-06,3.9e-05
1e-05,1.6e-05,3e-06,1.2e-05,2.1e-05,2.1e-05,1.1e-05,2.4e-05,2.6e-05,1.7e-05,3e-05,3.5e-05,0.00024,0.0042,0.002742,0.001016,0.000416,0.001085,0.001104,0.000832,0.000607,0.002792,0.001157,0.002741,0.004379,0.00304,0.001438,0.00172,0.002774,0.002608,0.007076,0.006456,0.002719,0.002383,0.003277,0.003301,0.000879,0.003369,0.002341,0.004466,0.005492,0.005684,0.003055,0.002363,0.003336,0.003796,0.000915,0.002417,0.001748,0.00309,0.003331,0.00296,0.002336,0.001205,0.002336,0.001577,0.001857,0.001466,0.000967,0.000781,0.000669,0.00123,0.001653,0.000898,0.001333,0.00075,0.000987,0.00079,0.000627,0.000311,0.000929,0.000462,0.000757,0.001242,0.000589,0.000163,0.000165,0.000305,0.000383,0.000113,0.000312,0.000124,0.000794,0.000674,0.00042,0.000136,0.00015,0.000142,5e-05,3.3e-05,7.7e-05,2.6e-05,3.5e-05,0.00092,0.00067,0.000329,8.4e-05,1.6e-05,1.8e-05,2.8e-05,8.8e-05,5.6e-05,4.1e-05,5.4e-05,3.2e-05,0.000371,9e-04,0.000457,0.000174,5.6e-05,5e-05,1.6e-05,9e-06,2.4e-05,2.6e-05,3.4e-05,2.2e-05,1.9e-05,2.7e-05,2e-05,1.6e-05
1e-05,2.7e-05,2.3e-05,2.6e-05,1.4e-05,1.1e-05,2.1e-05,3.2e-05,6e-06,1.6e-05,1.9e-05,2.4e-05,0.000254,0.003896,0.002204,0.001064,0.00023,0.001183,0.002048,0.001441,0.001207,0.001134,0.002353,0.002914,0.003584,0.003708,0.001168,0.00423,0.002689,0.003246,0.004751,0.004294,0.003092,0.002487,0.000785,0.00208,0.002399,0.003123,0.003315,0.004296,0.002225,0.004647,0.002374,0.004479,0.002799,0.003762,0.002188,0.004687,0.001873,0.002713,0.00382,0.004837,0.00375,0.001403,0.000682,0.000486,0.000921,0.001885,0.001956,0.000385,0.000906,0.000279,0.000602,0.000607,0.000918,0.000286,0.000703,0.000186,0.000439,0.000651,0.000213,0.000586,0.000435,4e-04,0.000335,0.00013,0.000168,0.000173,0.00014,0.000171,0.000172,0.000283,0.000536,0.000478,0.000283,6.9e-05,2.8e-05,0.000109,0.000135,0.000103,0.000149,0.000121,6.6e-05,0.000523,0.000385,0.000198,8.2e-05,3.4e-05,3.5e-05,8.2e-05,8.7e-05,5.6e-05,1.5e-05,4.1e-05,3.6e-05,0.000376,0.00063,0.000457,0.00021,9.1e-05,3.3e-05,3.1e-05,2.8e-05,3.8e-05,2.3e-05,3.1e-05,3.8e-05,2.1e-05,2.1e-05,3.1e-05,4.1e-05
1.5e-05,1.4e-05,4e-06,1.4e-05,1.2e-05,1.6e-05,4e-06,2.3e-05,2.1e-05,3.3e-05,2.2e-05,3.8e-05,0.000291,0.002445,0.001458,0.000736,0.000193,0.000994,0.003,0.001622,0.000966,0.000425,0.000607,0.001587,0.001982,0.003115,0.001793,0.003783,0.003234,0.002386,0.001744,0.003362,0.001764,0.002926,0.00113,0.002326,0.000997,0.001402,0.002818,0.001239,0.003205,0.003988,0.007081,0.001932,0.002507,0.002108,0.001118,0.004046,0.002626,0.002728,0.001617,0.000423,0.002039,0.00079,0.000575,0.000246,0.000601,0.001342,0.000868,0.001569,0.001155,0.000613,0.000422,0.000325,0.000713,0.000546,0.00025,0.000604,8.4e-05,0.00019,0.000681,0.000724,0.000368,0.000244,6.7e-05,6.5e-05,0.000121,5.5e-05,0.000104,8.3e-05,5e-05,0.000142,0.000435,9e-05,0.00017,0.000192,0.000124,8.5e-05,5.2e-05,3e-05,6e-05,4.5e-05,3.9e-05,0.000259,6.4e-05,8.3e-05,3.6e-05,2.6e-05,1.3e-05,7.3e-05,8.6e-05,1.9e-05,2.5e-05,2.2e-05,2.1e-05,0.00034,0.00086,0.000511,0.000158,2.8e-05,2e-05,1e-05,2.4e-05,3e-05,1.8e-05,2.9e-05,2e-06,1.4e-05,7e-06,1.4e-05,4.4e-05
4e-06,7e-06,7e-06,5e-06,1e-05,1.6e-05,1.5e-05,1.9e-05,7e-06,1.7e-05,1.4e-05,2.2e-05,0.000269,0.000685,0.002114,0.001334,0.000647,0.000797,0.003181,0.001397,0.000481,0.000226,0.002331,0.000856,0.002001,0.000471,0.001653,0.000629,0.000966,0.002997,0.002042,0.001823,0.002397,0.000764,0.000483,0.000862,0.001941,0.004158,0.001222,0.00155,0.001395,0.000469,0.004071,0.002349,0.001131,0.001162,0.002708,0.000988,0.001598,0.000224,0.00124,0.000914,0.001038,0.001293,0.000558,0.000566,0.000531,0.000569,0.000851,0.000586,0.000185,0.000255,0.000286,0.000111,0.000213,0.000137,0.000306,0.000263,0.000322,0.00037,0.000803,0.000164,0.000196,0.000186,0.000111,2.3e-05,4.6e-05,0.000123,8.9e-05,4.1e-05,6.7e-05,0.000172,0.000405,0.000294,0.000233,0.000441,0.000232,8e-05,4.9e-05,5e-05,4.1e-05,6e-05,5.5e-05,0.000236,0.000278,5.5e-05,2.4e-05,6e-06,2.1e-05,1.9e-05,1.1e-05,3.1e-05,1e-05,1.2e-05,1.8e-05,0.000305,0.000606,0.000239,7.1e-05,1.8e-05,2.4e-05,1.7e-05,1.5e-05,4.3e-05,3.3e-05,3.4e-05,2.9e-05,1.9e-05,1.3e-05,7e-06,4e-05
3e-06,5e-06,2e-06,4e-06,3e-06,3e-06,2e-06,5e-06,2e-06,3e-06,7e-06,9e-06,0.000155,0.00064,0.001027,0.000381,0.000249,0.00047,0.001057,0.000645,0.000291,0.000301,0.00074,0.000454,0.00111,0.000806,0.001351,0.000951,0.000384,4e-04,0.000482,8e-04,0.000917,0.000374,0.000394,4e-04,0.001075,0.001781,0.000837,0.000604,0.000694,0.000778,0.000857,0.000837,0.000763,0.000602,0.001015,0.000651,0.000268,0.00026,0.000124,0.000386,4.6e-05,0.000236,0.000131,0.000179,0.000286,0.000125,8.8e-05,0.000131,0.000211,0.000156,9.2e-05,2.1e-05,0.00011,6.9e-05,0.000105,4.8e-05,9.2e-05,0.000122,0.000157,0.000183,1.5e-05,7.3e-05,9e-06,3.9e-05,2.9e-05,7.3e-05,1.7e-05,1.5e-05,2.9e-05,4.8e-05,0.000213,0.000132,4.2e-05,0.000202,8.9e-05,4.4e-05,1.6e-05,2.8e-05,3.2e-05,3.1e-05,1e-05,0.000176,9.9e-05,4.7e-05,9e-06,5e-06,4e-06,7e-06,1.2e-05,1.3e-05,4e-06,4e-06,3e-06,0.000136,9.7e-05,7.2e-05,1.5e-05,6e-06,1.3e-05,5e-06,4e-06,1.4e-05,4e-06,5e-06,9e-06,2e-06,3e-06,5e-06,3e-06
3e-06,3e-06,4e-06,5e-06,3e-06,2e-06,2e-06,2e-06,1e-06,2e-06,2e-06,4e-06,0.000153,0.000549,7e-05,3.3e-05,0.000125,0.000253,0.000566,0.000238,0.000192,0.000342,0.000442,0.000705,8.4e-05,0.000341,0.001181,0.00059,0.000356,0.000635,0.000509,0.000271,0.000442,0.000142,0.000188,0.000174,0.000984,0.000903,0.000386,0.000265,0.000393,0.000934,0.000716,0.000466,0.000607,6e-05,0.00014,0.000315,0.000348,0.000156,9.4e-05,0.00025,1e-04,0.000223,0.000124,0.000175,9.3e-05,0.000123,7.2e-05,6e-05,8.2e-05,2.8e-05,3.2e-05,2.8e-05,4.6e-05,5.6e-05,4e-05,1.5e-05,5.6e-05,0.000154,5.7e-05,7.6e-05,0.000109,2.4e-05,2.2e-05,2.2e-05,1.4e-05,3.5e-05,2.1e-05,9e-06,4e-05,7.9e-05,0.000178,9.9e-05,3.4e-05,7.7e-05,4.7e-05,3.1e-05,3.1e-05,2.3e-05,2.6e-05,2.3e-05,1.4e-05,0.000192,0.000114,6.3e-05,2.1e-05,9e-06,6e-06,8e-06,8e-06,1e-06,8e-06,4e-06,2e-06,0.000128,0.000178,8.8e-05,4e-05,1.7e-05,9e-06,6e-06,3e-06,4e-06,1e-06,8e-06,2e-06,4e-06,4e-06,7e-06,6e-06
2e-06,1e-06,1e-06,3e-06,3e-06,2e-06,2e-06,2e-06,3e-06,6e-06,4e-06,2e-06,0.000151,0.000154,0.000186,7e-05,0.000153,0.000244,0.000461,0.00028,0.00015,0.000329,0.000398,0.00031,0.00048,0.000396,0.000386,0.000482,0.000392,0.000325,9.9e-05,0.000303,0.000493,0.000287,0.000387,0.000496,0.000485,0.000842,0.000674,0.000208,0.000297,0.000776,0.00025,0.000264,0.000434,0.000404,0.000403,0.000126,0.000219,0.000163,0.000146,0.000157,6.5e-05,0.000172,0.000129,7.4e-05,7.9e-05,4.3e-05,7.2e-05,8.3e-05,9.2e-05,4.7e-05,4.9e-05,4.3e-05,3.3e-05,5.8e-05,3.7e-05,1.7e-05,2.9e-05,0.00012,5.9e-05,1.9e-05,5.4e-05,4e-05,1.5e-05,9e-06,1.6e-05,3.2e-05,1.3e-05,2.6e-05,1.2e-05,9.1e-05,8.8e-05,5.5e-05,3.4e-05,8e-06,1.1e-05,2.2e-05,1.5e-05,1.2e-05,1.4e-05,1.1e-05,1.7e-05,0.000187,3.5e-05,3.2e-05,9e-06,4e-06,3e-06,2e-06,1e-05,5e-06,9e-06,1.1e-05,6e-06,0.000105,0.000137,3.6e-05,1.7e-05,1.3e-05,1.8e-05,8e-06,2e-06,6e-06,1e-06,5e-06,5e-06,3e-06,4e-06,4e-06,6e-06
2e-06,3e-06,2e-06,3e-06,2e-06,2e-06,3e-06,3e-06,3e-06,5e-06,2e-06,5e-06,0.000148,0.000133,3.4e-05,8.6e-05,9.8e-05,0.000153,0.000337,0.000275,0.000148,0.000415,0.000728,0.000149,0.000588,0.000357,0.000636,0.000314,0.000545,0.00063,0.000398,0.000446,0.000154,0.000232,0.000551,0.000549,0.000499,0.000477,0.000363,0.000503,0.000265,0.000225,0.000277,0.000559,7.2e-05,0.000144,7.6e-05,3.4e-05,0.000276,0.000127,0.000112,0.000125,7.3e-05,0.000143,0.000149,0.000141,4.5e-05,6.2e-05,2.9e-05,5e-05,6e-05,1.8e-05,7.2e-05,3.2e-05,3.8e-05,3.3e-05,2.6e-05,6e-06,2.8e-05,1e-04,2.3e-05,1.5e-05,4.7e-05,4.4e-05,1.7e-05,1.4e-05,7e-06,2.3e-05,9e-06,2.2e-05,1e-05,7.7e-05,7.7e-05,2.7e-05,8e-06,4.2e-05,3e-06,1.1e-05,1.6e-05,9e-06,1.1e-05,1.8e-05,1.3e-05,0.000158,5e-05,2e-05,2.8e-05,1.2e-05,5e-06,5e-06,9e-06,5e-06,6e-06,5e-06,5e-06,9e-05,1.2e-05,5.6e-05,2.2e-05,7e-06,9e-06,4e-06,4e-06,1.1e-05,4e-06,2e-06,4e-06,3e-06,3e-06,4e-06,2e-06
1e-06,3e-06,4e-06,3e-06,1e-06,1e-06,3e-06,1e-06,4e-06,1.1e-05,4e-06,3e-06,0.000133,9.1e-05,9.6e-05,9.4e-05,6.1e-05,0.000225,8.7e-05,9.3e-05,0.000156,0.000221,0.000476,0.000439,0.000523,0.000555,0.00042,0.000585,0.000444,0.000421,0.000257,0.000221,0.000214,0.000387,0.000605,0.000147,0.00023,0.000288,0.000296,0.000168,0.000141,0.000479,0.000688,0.000233,0.00041,0.000306,0.000341,2.4e-05,0.000216,7.9e-05,8e-06,0.000143,2.5e-05,0.000141,0.000217,5.4e-05,5.5e-05,3.6e-05,3.4e-05,6.5e-05,1.8e-05,2.2e-05,5.6e-05,4.1e-05,4.5e-05,6.3e-05,3.7e-05,3.5e-05,1.7e-05,9.5e-05,2.5e-05,2.4e-05,2.3e-05,1.1e-05,7e-06,8e-06,2.9e-05,1.7e-05,5e-06,1.6e-05,1.7e-05,5.6e-05,7.9e-05,7.3e-05,3.5e-05,2.3e-05,1.9e-05,1.8e-05,2.4e-05,1.4e-05,1.1e-05,1.6e-05,1.1e-05,0.000135,1e-06,2.3e-05,1e-05,6e-06,4e-06,1e-05,8e-06,2e-06,1e-06,6e-06,9e-06,7.5e-05,8.7e-05,4e-06,6e-06,8e-06,1.1e-05,8e-06,4e-06,5e-06,4e-06,3e-06,2e-06,3e-06,3e-06,4e-06,3e-06
3e-06,2e-06,3e-06,2e-06,1e-06,2e-06,2e-06,4e-06,3e-06,1.1e-05,5e-06,7e-06,0.00012,5.9e-05,0.00022,2.9e-05,7.4e-05,0.000186,0.000169,0.00014,0.000155,0.000302,0.000226,0.000134,0.000219,0.000168,0.000163,0.000589,0.000738,0.00025,0.00044,0.000501,0.000479,0.000357,0.000405,0.000331,0.000275,0.000276,0.000278,0.000342,0.000303,0.00048,0.000207,0.000132,0.000227,0.000199,0.00021,0.000177,0.000238,7.1e-05,7.8e-05,0.000124,7.1e-05,0.000126,0.000204,9.8e-05,5.1e-05,3.8e-05,3.3e-05,4.2e-05,3.9e-05,2.1e-05,5.8e-05,1.3e-05,3.1e-05,6.7e-05,3.4e-05,3.9e-05,1.8e-05,8.6e-05,1.5e-05,2.7e-05,3.8e-05,4.6e-05,1e-05,1e-05,1.9e-05,2e-05,6e-06,1.7e-05,1.2e-05,3.7e-05,8.9e-05,3.7e-05,6.2e-05,3.4e-05,4e-05,2e-05,2.3e-05,7e-06,1.3e-05,1e-05,1.5e-05,0.000111,5.8e-05,1.7e-05,8e-06,4e-06,2e-06,1.3e-05,9e-06,1e-05,1e-05,3e-06,9e-06,7e-05,7.3e-05,3.8e-05,2.2e-05,5e-06,7e-06,5e-06,1.1e-05,5e-06,4e-06,7e-06,4e-06,6e-06,1e-06,3e-06,3e-06
4e-06,2e-06,2e-06,1e-06,3e-06,3e-06,3e-06,3e-06,4e-06,4e-06,1e-05,1.1e-05,0.000111,5.9e-05,0.000115,7.1e-05,7.5e-05,0.00024,0.000202,0.000252,0.000178,0.000443,0.000336,0.000437,0.000297,0.000223,0.000325,0.000358,0.00041,5e-04,0.000253,0.000251,0.000187,0.00017,0.00036,0.000453,0.000346,0.000364,0.000507,6.7e-05,0.000189,0.000393,0.000505,0.000105,0.000219,0.000101,0.000186,9e-05,0.000261,0.000174,0.000272,0.000219,2.2e-05,0.000139,8.5e-05,9e-05,3.5e-05,9.3e-05,1.3e-05,4e-05,5.8e-05,2.1e-05,5.9e-05,4.8e-05,3.7e-05,5.1e-05,6.1e-05,3.8e-05,2.2e-05,9.9e-05,7.2e-05,6.3e-05,6.5e-05,9e-06,2.8e-05,1.8e-05,1.2e-05,3.3e-05,1.4e-05,4.6e-05,4.4e-05,5.7e-05,0.000132,9.3e-05,6.2e-05,7.6e-05,2.1e-05,3.1e-05,1e-05,7e-06,1.8e-05,9e-06,9e-06,7.6e-05,5.8e-05,4e-05,1.5e-05,2e-06,4e-06,1.6e-05,1.3e-05,1.2e-05,2e-06,1e-05,1.5e-05,5.2e-05,3.9e-05,6e-06,7e-06,8e-06,1.6e-05,5e-06,1e-05,6e-06,3e-06,3e-06,5e-06,6e-06,6e-06,1e-06,5e-06
3e-06,3e-06,5e-06,2e-06,2e-06,2e-06,5e-06,6e-06,0,3e-06,8e-06,9e-06,0.000102,0.000145,0.000135,0.000147,0.000101,0.00031,0.00011,0.000137,0.000187,0.000298,0.000211,0.000403,0.000736,0.000798,0.000487,0.000168,0.000655,0.000587,0.000737,0.000139,0.000267,0.000136,0.000284,0.000495,0.000394,0.000605,8.8e-05,0.000385,0.000193,0.000463,0.000452,0.000457,0.000521,0.000347,0.000205,0.000112,0.000141,0.000193,0.000189,0.000138,0.00025,0.000232,0.000107,0.000157,0.000262,3.6e-05,1.3e-05,1e-04,1.3e-05,7.2e-05,0.000144,8.9e-05,9.3e-05,4.1e-05,7.2e-05,5.7e-05,6.1e-05,0.000109,0.000111,0.000182,0.000232,0.000143,9.5e-05,4.4e-05,5.2e-05,2.4e-05,2.6e-05,7.4e-05,9.7e-05,1.9e-05,6.1e-05,5.3e-05,9.8e-05,4.1e-05,4.9e-05,2.7e-05,1.4e-05,1.5e-05,2.1e-05,1.7e-05,1e-05,5.5e-05,0.000117,4.5e-05,2.2e-05,5e-06,3e-06,2.3e-05,1.1e-05,8e-06,5e-06,1.3e-05,8e-06,4.9e-05,0.00011,5.2e-05,3.1e-05,9e-06,1.6e-05,1.1e-05,1.4e-05,7e-06,7e-06,6e-06,1e-05,9e-06,5e-06,7e-06,2e-06
2e-06,2e-06,2e-06,1e-06,1e-06,1e-06,4e-06,6e-06,5e-06,5e-06,2e-06,2e-06,9.2e-05,0.000128,0.000306,9e-05,5.1e-05,0.000179,0.000125,5.4e-05,0.000231,0.000592,0.000366,4.5e-05,0.000242,0.000423,0.000373,0.000487,0.000564,0.000387,0.000281,0.000381,0.000601,0.00047,0.000304,0.000257,0.000257,0.000285,0.000375,0.000505,0.000214,0.000401,0.000285,0.00018,0.000197,0.000176,0.00028,0.000405,0.000307,0.000119,0.000137,0.00019,0.000301,0.000107,0.000105,0.000165,0.000279,0.000237,5.8e-05,8.7e-05,5.4e-05,9.4e-05,0.000126,8.3e-05,0.000108,4.7e-05,0.000117,5.7e-05,3.7e-05,4.8e-05,7.3e-05,6.4e-05,9.7e-05,5.5e-05,6e-06,7e-06,5.1e-05,6.7e-05,2.6e-05,6.8e-05,3e-06,8.3e-05,6.4e-05,7.1e-05,4.4e-05,5.4e-05,3.3e-05,1.6e-05,1.9e-05,1.3e-05,1.5e-05,1.5e-05,1e-06,3.6e-05,9.2e-05,4.6e-05,2.1e-05,9e-06,8e-06,1.8e-05,1.8e-05,8e-06,5e-06,6e-06,1.3e-05,4.9e-05,9.2e-05,4.9e-05,1.9e-05,9e-06,1e-05,7e-06,6e-06,1e-06,4e-06,7e-06,5e-06,5e-06,2e-06,6e-06,5e-06
2e-06,2e-06,2e-06,1e-06,2e-06,2e-06,4e-06,6e-06,2e-06,8e-06,7e-06,5e-06,8.4e-05,0.000124,0.000125,4e-06,8e-05,0.000289,6.5e-05,0.000117,0.00018,0.000456,0.000414,0.000338,0.000171,0.000545,0.000557,0.000328,0.000451,0.000626,0.000322,0.000415,0.000231,0.000107,0.00025,0.000191,0.000503,0.000359,0.000243,2.8e-05,0.000257,0.000492,0.000306,0.000168,0.000251,0.000264,0.000357,0.00014,0.000171,0.000147,0.000125,0.000207,2.6e-05,4.4e-05,0.00011,4.9e-05,0.000167,0.000112,7.8e-05,7.1e-05,8.3e-05,0.000134,0.000101,7.9e-05,1.3e-05,2e-05,0.000109,8.6e-05,2.6e-05,6e-05,4.5e-05,0.00013,9.9e-05,7.3e-05,5.9e-05,2.4e-05,3.3e-05,5.6e-05,4.3e-05,5e-05,4.7e-05,0.000115,6.2e-05,2.3e-05,4.4e-05,2.1e-05,4e-06,1.7e-05,1.9e-05,6e-06,8e-06,1.2e-05,6e-06,3.9e-05,5e-05,2.6e-05,1e-05,0,2e-06,1e-05,9e-06,3e-06,8e-06,1e-05,7e-06,5.5e-05,2.7e-05,3.3e-05,1.4e-05,3e-06,1.1e-05,1.5e-05,8e-06,3e-06,2e-06,5e-06,1e-06,3e-06,4e-06,1e-06,1e-06
2e-06,1e-06,2e-06,1e-06,2e-06,4e-06,4e-06,2e-06,2e-06,8e-06,1.2e-05,6e-06,7.3e-05,0.00013,0.000187,4.4e-05,5e-05,0.000238,0.000221,0.000155,0.00011,0.000303,0.000178,0.00027,0.000522,0.000727,0.000831,0.00049,0.000241,0.000668,0.000282,0.000462,0.000516,0.000257,0.00018,0.000137,0.000272,0.000286,0.000412,0.000259,0.000224,0.000277,0.000271,0.000384,0.000166,0.000179,0.000124,0.000262,0.00017,0.000191,7.5e-05,2e-04,8.8e-05,7.5e-05,6.2e-05,7.6e-05,5.5e-05,0.000117,0.000139,7.1e-05,4.7e-05,7.3e-05,9.2e-05,8.5e-05,4.2e-05,2e-05,9.7e-05,4.5e-05,1.7e-05,6.4e-05,1.7e-05,0.000165,0.000197,4.1e-05,3.2e-05,1.1e-05,8e-06,3.1e-05,2.5e-05,8e-06,5e-06,0.000106,0.000115,5.8e-05,6e-05,1.8e-05,5.3e-05,8e-06,2.6e-05,2.3e-05,7e-06,8e-06,1e-05,6.8e-05,7.4e-05,2.8e-05,6e-06,4e-06,8e-06,1.2e-05,5e-06,5e-06,4e-06,7e-06,6e-06,5.7e-05,1.7e-05,4e-06,5e-06,8e-06,2e-06,9e-06,7e-06,5e-06,2e-06,1e-06,3e-06,3e-06,4e-06,3e-06,4e-06
2e-06,1e-06,1e-06,1e-06,1e-06,4e-06,4e-06,3e-06,3e-06,3e-06,1.2e-05,8e-06,6.8e-05,7.7e-05,0.00032,0.000175,0.00016,0.000166,0.000336,0.000253,0.000299,0.00035,0.000295,0.000368,0.000439,3.6e-05,0.000834,0.000367,0.000248,0.000345,0.000125,0.000572,0.000658,0.000179,0.000202,9.6e-05,0.00038,0.000165,0.000185,3.5e-05,0.000239,0.000195,0.000454,0.000318,0.000262,0.000308,0.000348,0.000394,0.000326,0.000315,0.000289,0.000234,0.000161,0.000145,0.000149,0.000159,0.000125,0.000118,0.000138,6e-05,8.6e-05,9.2e-05,6.3e-05,4.6e-05,5.1e-05,4.1e-05,8.7e-05,5.5e-05,3.4e-05,5.4e-05,5.9e-05,0.000123,0.000116,0.000101,8.3e-05,5.2e-05,4.3e-05,3.6e-05,1.8e-05,3e-05,2.1e-05,5.5e-05,6e-05,5.3e-05,8.4e-05,0.000108,4.1e-05,6.2e-05,4.7e-05,4.3e-05,2.4e-05,9e-06,1.3e-05,9.6e-05,6.5e-05,2.8e-05,2e-06,5e-06,1.3e-05,3.2e-05,1.7e-05,1.1e-05,1e-05,3e-06,6e-06,5.6e-05,6.2e-05,6.3e-05,3e-05,1.1e-05,5e-06,3e-06,4e-06,6e-06,2e-06,5e-06,3e-06,4e-06,6e-06,4e-06,5e-06
5e-06,2e-06,2e-06,2e-06,4e-06,3e-06,3e-06,5e-06,3e-06,2e-06,1e-05,6e-06,6.2e-05,0.000101,0.000444,0.00024,0.000146,0.000267,0.000461,0.000273,0.000252,0.000241,0.000293,0.000239,0.00018,0.000238,0.000645,0.000361,0.00032,0.000621,0.000567,0.000577,9.2e-05,0.000237,0.000166,0.000183,0.00035,0.000284,0.000283,0.000255,5.3e-05,0.000332,0.000461,0.000122,0.000189,9.2e-05,0.000364,0.000245,0.000213,0.000113,0.000136,0.000197,0.000278,0.000208,7.1e-05,0.000108,0.000123,0.000257,0.000315,0.000129,1e-04,8e-05,7.7e-05,4.7e-05,2.8e-05,8.5e-05,0.00012,5.4e-05,3.1e-05,6.8e-05,3.8e-05,7.9e-05,0.000148,0.000134,4.2e-05,1.8e-05,8e-06,1.7e-05,1.5e-05,2.4e-05,3.2e-05,7.6e-05,2.8e-05,6e-06,8e-05,5.4e-05,9.1e-05,4e-05,2.3e-05,2e-06,1.8e-05,1.7e-05,2.1e-05,9.3e-05,0.000113,5e-05,1.3e-05,6e-06,2e-05,4e-05,3.9e-05,3.6e-05,1.5e-05,5e-06,6e-06,4.7e-05,0.000132,5.4e-05,1.8e-05,3e-06,5e-06,2e-06,4e-06,5e-06,4e-06,5e-06,5e-06,2e-06,4e-06,3e-06,2e-06
4e-06,1e-06,3e-06,1e-06,2e-06,4e-06,5e-06,4e-06,1e-06,5e-06,4e-06,9e-06,4.6e-05,0.000121,0.000435,0.000266,6.1e-05,9.7e-05,0.000372,0.000243,7.3e-05,0.000347,0.000155,0.000167,0.000289,0.000367,0.000553,0.000189,0.000282,0.000667,0.000301,0.000309,0.000351,0.000273,9.8e-05,0.000189,0.000388,0.000284,0.000205,8.5e-05,1e-04,0.000338,0.000144,0.000194,0.000336,0.000228,0.000322,3e-05,0.000185,0.000104,8.1e-05,0.000101,6.1e-05,0.000123,0.000157,0.00026,0.000147,0.00012,7.9e-05,0.000132,8.5e-05,5.9e-05,7.5e-05,7.9e-05,3.4e-05,4.8e-05,1.3e-05,1.6e-05,1.7e-05,6.9e-05,1.8e-05,1.9e-05,6.1e-05,6.1e-05,4.9e-05,6e-06,1.2e-05,2.1e-05,1.5e-05,7e-06,5e-05,4.7e-05,3e-05,3.7e-05,8e-05,1.4e-05,3.8e-05,3e-05,1.4e-05,1.5e-05,1.2e-05,5e-06,1.2e-05,0.000121,6.9e-05,4e-05,6e-06,6e-06,1.4e-05,1e-05,2e-05,1.5e-05,7e-06,8e-06,6e-06,5.7e-05,0.000157,9.4e-05,2.9e-05,8e-06,6e-06,7e-06,7e-06,6e-06,3e-06,3e-06,3e-06,1e-06,1e-06,3e-06,3e-06
1e-06,2e-06,1e-06,2e-06,1e-06,2e-06,3e-06,4e-06,1e-06,6e-06,6e-06,5e-06,3.2e-05,8.8e-05,0.000402,2e-04,1e-04,0.000188,0.00039,0.00043,0.000186,0.000438,0.000545,0.000194,0.000224,0.000189,0.000241,0.000368,2e-04,0.000429,0.000251,0.000287,7.1e-05,7.4e-05,0.000227,0.000135,0.000291,0.000188,0.000192,0.000231,0.000138,0.00019,0.000272,0.000239,0.000219,0.000226,0.000195,0.000178,0.000233,9.6e-05,2.4e-05,3.6e-05,0.000103,0.000148,8.7e-05,0.000195,4.8e-05,3.5e-05,2.1e-05,9.6e-05,1.4e-05,6.5e-05,0.000104,5.2e-05,7.2e-05,3.3e-05,3.7e-05,2.5e-05,2.7e-05,9.1e-05,7.1e-05,2.7e-05,0.000109,6.3e-05,2.7e-05,8e-06,9e-06,2.7e-05,5e-06,4e-06,5.6e-05,7.7e-05,7.4e-05,7e-06,3.3e-05,4.7e-05,3.9e-05,2.4e-05,9e-06,5e-06,1.1e-05,5e-06,4e-06,0.000146,9e-05,3.4e-05,1.6e-05,3e-06,1.1e-05,1.1e-05,1.8e-05,1.1e-05,9e-06,2e-06,2e-06,5.5e-05,0.000143,4.6e-05,1.7e-05,5e-06,0,4e-06,1.2e-05,6e-06,2e-06,1e-06,1e-06,4e-06,1e-06,3e-06,3e-06
0,1e-06,2e-06,1e-06,0,2e-06,1e-06,5e-06,3e-06,2e-06,3e-06,2e-06,2.1e-05,0.000143,0.000493,0.000173,0.000121,0.000257,0.000136,0.000251,0.000219,0.000364,0.000233,0.000288,0.000264,0.000276,0.000198,0.000173,0.000223,0.000267,0.000247,0.000255,9.7e-05,4.6e-05,0.000126,7.3e-05,0.000495,0.000129,0.000111,4.7e-05,0.000138,0.000103,0.000218,0.000189,0.000278,0.000295,0.000286,0.000259,0.000274,0.00021,0.000227,8.1e-05,0.000201,6.1e-05,7.1e-05,8.5e-05,0.000109,4.8e-05,1.2e-05,5.5e-05,2.2e-05,5.1e-05,0.000161,0.000162,0.000122,7.2e-05,6.7e-05,7.4e-05,4e-05,4.5e-05,0.000164,0.000148,0.000165,2.5e-05,1.8e-05,8e-06,1.1e-05,3.1e-05,4.7e-05,2.5e-05,5.2e-05,1.4e-05,9.7e-05,8.6e-05,4.2e-05,5.1e-05,5.9e-05,3e-05,2.4e-05,1.4e-05,1.3e-05,7e-06,3e-06,0.000169,0.000142,7.1e-05,1.5e-05,6e-06,1e-06,1.8e-05,2.4e-05,1.1e-05,1.1e-05,1.3e-05,7e-06,5.4e-05,9.9e-05,8.7e-05,4.1e-05,1.2e-05,3e-06,1e-06,9e-06,1.1e-05,8e-06,2e-06,2e-06,4e-06,3e-06,3e-06,4e-06
1e-06,1e-06,2e-06,1e-06,1e-06,3e-06,2e-06,3e-06,1e-06,3e-06,1e-06,2e-06,1.4e-05,0.000157,0.000295,0.000255,0.000108,0.000131,7.5e-05,0.00021,9.5e-05,0.000299,0.000213,0.000124,0.000129,0.000532,0.000514,0.000225,0.000399,0.000106,0.000229,2e-05,0.000101,0.000139,0.000218,7.2e-05,0.000328,0.000237,0.000118,0.00015,0.000167,0.000184,0.000143,0.000132,0.000267,8.7e-05,0.000111,0.000187,0.000129,6.1e-05,9.2e-05,7.7e-05,0.000135,9.7e-05,9.8e-05,2.5e-05,8.5e-05,0.000138,0.000128,5.2e-05,6.4e-05,2.1e-05,9.3e-05,4.2e-05,3.9e-05,6.1e-05,7.3e-05,7.8e-05,4.9e-05,3.2e-05,0.000125,3.2e-05,3.2e-05,5.9e-05,4.8e-05,3.1e-05,2.2e-05,3.5e-05,4.9e-05,3.2e-05,2.8e-05,5.5e-05,3.3e-05,5.8e-05,2.2e-05,3.4e-05,2.9e-05,1.9e-05,1.4e-05,9e-06,4e-06,7e-06,7e-06,0.000168,7.7e-05,4.3e-05,1.2e-05,3e-06,4e-06,2e-05,1.5e-05,1.3e-05,8e-06,5e-06,4e-06,5.4e-05,7e-05,4.3e-05,1.8e-05,8e-06,1e-06,2e-06,5e-06,4e-06,0,2e-06,2e-06,3e-06,4e-06,3e-06,2e-06
2e-06,0,0,0,1e-06,3e-06,1e-06,2e-06,1e-06,2e-06,1e-06,0,6e-06,0.000145,8.3e-05,2.3e-05,3e-05,0.000119,0.000146,8.4e-05,3.3e-05,0.000277,0.000282,8.1e-05,0.00015,0.000552,7.8e-05,0.000128,6.9e-05,0.000316,0.000106,0.000188,4.6e-05,0.000146,0.000109,0.000201,0.000286,0.000109,7e-06,8.1e-05,0.000152,0.00018,0.000196,0.00018,0.000143,0.000204,0.000162,8.5e-05,0.000113,6.8e-05,3.6e-05,3.9e-05,8.8e-05,4.6e-05,5.8e-05,6.3e-05,8.1e-05,5.5e-05,5.5e-05,3e-05,3.7e-05,3.9e-05,2e-05,8e-06,4e-06,4.3e-05,2.4e-05,1.9e-05,1.4e-05,2.1e-05,4.8e-05,3.4e-05,3.3e-05,2.6e-05,1.9e-05,9e-06,4e-06,1.5e-05,1.1e-05,8e-06,1.3e-05,6e-05,1.8e-05,1.1e-05,1.6e-05,1.5e-05,2e-06,1.2e-05,5e-06,2e-06,3e-06,4e-06,3e-06,0.000153,1.9e-05,7e-06,3e-06,3e-06,2e-06,1.2e-05,3e-06,2e-06,2e-06,5e-06,3e-06,5.3e-05,4.9e-05,8e-06,5e-06,2e-06,2e-06,2e-06,2e-06,2e-06,1e-06,1e-06,2e-06,1e-06,2e-06,1e-06,1e-06
2e-06,1e-06,1e-06,0,1e-06,2e-06,2e-06,3e-06,0,2e-06,0,0,3e-06,0.000139,2.1e-05,7.2e-05,3.1e-05,0.000143,0.000172,8.3e-05,4.3e-05,0.000178,0.000396,0.000171,5.3e-05,0.000352,0.000213,0.00016,6.6e-05,0.000274,0.000137,0.000151,9.7e-05,9.9e-05,0.000119,0.000109,1e-04,9.9e-05,6.3e-05,0.000102,8.1e-05,0.00019,0.000115,0.000104,2.6e-05,9.3e-05,7e-05,7.8e-05,0.000112,6.5e-05,4.4e-05,2.1e-05,6.4e-05,3.2e-05,6.2e-05,4.5e-05,5.3e-05,6.8e-05,2.9e-05,3.8e-05,2.1e-05,2.4e-05,2.1e-05,1.2e-05,6e-06,3.1e-05,1.7e-05,4e-06,8e-06,3e-05,2.8e-05,1e-05,2.3e-05,6e-06,9e-06,5e-06,6e-06,6e-06,1.2e-05,4e-06,1.8e-05,5.8e-05,9e-06,1.4e-05,4e-06,8e-06,4e-06,1.3e-05,4e-06,1e-06,0,5e-06,3e-06,0.000128,9e-06,1e-06,4e-06,1e-06,0,6e-06,3e-06,2e-06,2e-06,5e-06,2e-06,5.2e-05,1.2e-05,7e-06,4e-06,2e-06,1e-06,1e-06,2e-06,1e-06,3e-06,3e-06,1e-06,1e-06,1e-06,2e-06,0
1e-06,0,1e-06,0,1e-06,2e-06,2e-06,3e-06,0,2e-06,1e-06,1e-06,6e-06,0.000109,3.2e-05,4.3e-05,4.1e-05,0.000141,0.000109,4.1e-05,4.9e-05,0.000165,0.000351,0.000108,0.000113,0.000287,0.000217,0.000141,0.000103,0.000238,6.2e-05,0.000138,5.5e-05,4.6e-05,4.2e-05,0.000125,0.000158,2.5e-05,8e-05,0.000126,0.000115,0.000157,0.000207,0.000178,4.4e-05,0.000142,5.5e-05,1e-04,0.000113,7.1e-05,3.2e-05,1.8e-05,6.4e-05,4e-05,7.9e-05,6e-05,5.5e-05,5.1e-05,1.8e-05,4e-05,1.9e-05,1.4e-05,1e-05,8e-06,5e-06,2.9e-05,1.8e-05,3e-06,8e-06,3.1e-05,2.9e-05,5e-06,2.7e-05,9e-06,8e-06,3e-06,1e-06,7e-06,1.3e-05,5e-06,1.8e-05,6.1e-05,1.1e-05,1.3e-05,1e-05,1.1e-05,3e-06,1.2e-05,1e-06,2e-06,1e-06,4e-06,2e-06,0.000112,1.2e-05,2e-06,4e-06,3e-06,2e-06,8e-06,2e-06,1e-06,2e-06,4e-06,2e-06,5e-05,2.2e-05,8e-06,1e-06,1e-06,1e-06,1e-06,2e-06,1e-06,1e-06,2e-06,0,1e-06,1e-06,1e-06,0
