0.080861,0.087572,0.082746,0.104104,0.127664,0.140606,0.132208,0.117915,0.129117,0.148685,0.171666,0.188611,0.182935,0.17053,0.174601,0.192582,0.218492,0.236275,0.217841,0.176095,0.156962,0.161099,0.17069,0.202659,0.229606,0.232396,0.24857,0.247096
0.096764,0.105896,0.104613,0.13603,0.168829,0.184791,0.170254,0.146667,0.158331,0.182991,0.209958,0.230781,0.22765,0.212401,0.214305,0.236505,0.268423,0.289198,0.269089,0.218397,0.192721,0.195551,0.208264,0.249467,0.282908,0.291947,0.318669,0.315831
0.121259,0.134653,0.143086,0.192862,0.239878,0.259274,0.234978,0.196642,0.206039,0.236982,0.270927,0.296788,0.297835,0.27869,0.275299,0.305327,0.346434,0.370579,0.349427,0.28648,0.251324,0.251535,0.270711,0.328013,0.370457,0.387281,0.431446,0.42774
0.132919,0.150033,0.169419,0.231748,0.285257,0.305649,0.281306,0.238687,0.23857,0.267169,0.304258,0.329553,0.334957,0.314987,0.303229,0.334808,0.377324,0.40141,0.389687,0.331176,0.291091,0.287175,0.312109,0.375581,0.414729,0.431206,0.486883,0.487668
0.130832,0.151391,0.176469,0.235082,0.282474,0.310576,0.305332,0.269675,0.256599,0.281749,0.319163,0.339827,0.353431,0.334868,0.30629,0.323979,0.357988,0.382651,0.393375,0.360852,0.322885,0.311789,0.337442,0.394607,0.416064,0.417214,0.466603,0.475503
0.129052,0.164604,0.19912,0.2417,0.278955,0.337866,0.372995,0.347177,0.329142,0.371154,0.429885,0.446052,0.460174,0.434724,0.379437,0.375209,0.398474,0.433635,0.474576,0.46596,0.434528,0.423848,0.446597,0.473748,0.451154,0.4299,0.480473,0.516218
0.163256,0.240717,0.307258,0.3596,0.398641,0.49982,0.583766,0.555102,0.540106,0.627128,0.752599,0.769362,0.730516,0.668936,0.61244,0.621171,0.643034,0.679495,0.763926,0.781592,0.736907,0.734523,0.764034,0.714054,0.599422,0.568594,0.673356,0.781118
0.259202,0.412912,0.532221,0.619456,0.666374,0.815272,0.972725,0.933305,0.915628,1.090072,1.366297,1.372506,1.159155,1.015691,1.021424,1.096906,1.124028,1.165308,1.34654,1.412028,1.304114,1.302758,1.36185,1.1816,0.915229,0.881943,1.101896,1.3447
0.421995,0.681017,0.858729,0.999226,1.060173,1.255099,1.518978,1.470095,1.432187,1.726801,2.259594,2.245163,1.711686,1.445676,1.584838,1.77722,1.83049,1.905341,2.255472,2.407264,2.172351,2.148832,2.292549,1.953507,1.447777,1.402997,1.822541,2.27307
0.61788,0.993917,1.207556,1.405027,1.49162,1.71808,2.103533,2.059018,1.989313,2.394344,3.23409,3.215027,2.300804,1.886168,2.172213,2.495135,2.615833,2.798815,3.377133,3.630628,3.196862,3.108138,3.409856,2.936489,2.142306,2.064257,2.733354,3.437184
0.760038,1.216482,1.414304,1.632385,1.751745,1.990337,2.466416,2.461258,2.376219,2.781251,3.80861,3.8498,2.678104,2.121765,2.494937,2.904522,3.131435,3.48358,4.24265,4.57482,3.923129,3.69845,4.177357,3.687099,2.705283,2.597123,3.461269,4.3497
0.752052,1.185871,1.315719,1.490364,1.620074,1.853862,2.34008,2.376486,2.293407,2.577155,3.53784,3.701,2.561554,1.93044,2.272781,2.675294,2.99478,3.460241,4.204641,4.54437,3.81098,3.434272,3.967161,3.634489,2.762338,2.670531,3.506251,4.337536
0.591801,0.885532,0.942575,1.047458,1.15953,1.366935,1.723482,1.754312,1.712409,1.863367,2.528349,2.756205,1.953234,1.406211,1.608181,1.919176,2.227143,2.609897,3.110358,3.349022,2.800051,2.4174,2.785285,2.693299,2.220465,2.195081,2.727632,3.233516
0.402713,0.545139,0.595552,0.680737,0.765332,0.888718,1.014832,1.025745,1.104972,1.212742,1.47363,1.632378,1.348981,1.068496,1.13891,1.428212,1.653547,1.713087,1.819403,1.916521,1.667429,1.410869,1.571247,1.651885,1.543238,1.527646,1.693599,1.853658
0.323894,0.445902,0.570276,0.693348,0.815688,0.902598,0.898474,0.914033,1.112854,1.32175,1.289718,1.299681,1.441177,1.377339,1.386837,1.785864,2.064072,1.869909,1.545191,1.543806,1.54607,1.377993,1.472445,1.574118,1.57282,1.420758,1.312453,1.372545
0.386829,0.553541,0.791212,1.003788,1.197655,1.373667,1.391011,1.41047,1.698079,1.964527,1.765368,1.703625,2.060445,2.117517,2.140844,2.702416,3.110921,2.795072,2.228083,2.231064,2.306172,2.021326,2.14902,2.343813,2.350167,2.003064,1.67217,1.811533
0.550038,0.765433,1.088496,1.371975,1.669216,1.982348,2.06935,2.128169,2.483324,2.681071,2.285519,2.216912,2.735668,2.949985,3.024084,3.62556,4.102364,3.76445,3.085332,3.04289,3.097562,2.728509,3.016642,3.389784,3.318071,2.718268,2.186798,2.440376
0.808539,1.042873,1.354259,1.724561,2.142065,2.48901,2.692225,2.916809,3.19629,3.081227,2.516956,2.524341,3.106055,3.524989,3.70641,4.113598,4.577445,4.457341,3.754014,3.44413,3.443661,3.193788,3.723127,4.262914,4.011405,3.260897,2.722899,2.975073
1.115299,1.302739,1.548439,2.082377,2.549937,2.688095,3.032784,3.608389,3.625144,3.043475,2.54676,2.63314,3.079344,3.741999,4.110444,4.054167,4.369345,4.82799,4.131189,3.224812,3.154439,3.199576,3.958187,4.657891,4.332402,3.670085,3.23798,3.237216
1.356937,1.518093,1.843723,2.557499,2.880992,2.669505,3.095484,3.962236,3.642556,2.835549,2.687865,2.670948,2.678876,3.45898,4.13366,3.755476,3.889106,4.955114,4.265442,2.797036,2.688279,3.056184,3.982632,4.77843,4.612728,4.059644,3.592951,3.414924
1.357826,1.585121,2.075581,2.788258,2.941236,2.512849,2.781819,3.580956,3.13189,2.471276,2.602022,2.478666,2.283907,3.049892,3.652873,3.301903,3.631683,4.832252,4.065079,2.474211,2.397924,3.007444,4.063395,4.756149,4.600101,4.050061,3.577263,3.462824
1.067326,1.366061,1.919288,2.423678,2.455467,2.071189,2.150215,2.591081,2.208736,1.8678,2.033051,1.947883,1.968179,2.569349,2.657256,2.365542,2.92196,3.913532,3.285872,2.027866,1.970965,2.604447,3.531225,3.915148,3.73547,3.415638,3.128783,2.989686
0.723523,1.024925,1.437941,1.709773,1.707083,1.443761,1.471519,1.584211,1.354168,1.233771,1.245493,1.277631,1.561132,1.957274,1.709605,1.395336,1.880006,2.521418,2.197918,1.522654,1.416494,1.858036,2.52521,2.589305,2.295067,2.295182,2.309647,2.042252
0.491401,0.792816,1.000059,1.096021,1.200084,1.053476,1.007574,1.11063,1.088818,0.92935,0.840918,0.924605,1.128216,1.306638,1.191349,0.98642,1.236367,1.616131,1.405611,1.113585,1.089521,1.254857,1.565242,1.497479,1.221228,1.365206,1.496528,1.285382
0.377418,0.651865,0.797641,0.948882,1.110437,0.953733,0.859141,1.115719,1.327711,1.131775,0.933983,0.969452,1.017118,0.97764,1.010861,1.030587,1.223112,1.487516,1.253643,1.006606,1.103764,1.148482,1.154791,1.030347,0.839174,1.015715,1.15346,1.104454
0.357627,0.585898,0.753626,1.05866,1.187369,0.991478,0.954291,1.321664,1.763589,1.567927,1.213324,1.137594,1.176041,1.161633,1.10482,1.090977,1.246671,1.543308,1.461588,1.151095,1.200092,1.300532,1.236243,1.054228,0.804461,1.055644,1.347257,1.364582
0.359223,0.536724,0.762522,1.154617,1.199473,1.016017,1.076906,1.524071,2.162484,1.941892,1.41345,1.228275,1.290372,1.354671,1.095318,1.001172,1.222592,1.523616,1.615291,1.374444,1.310884,1.391346,1.372408,1.202578,0.946572,1.328811,1.771009,1.713298
0.324865,0.449974,0.7263,1.107645,1.087831,0.989507,1.184567,1.610268,2.223669,1.986905,1.367458,1.170987,1.288198,1.364574,0.948789,0.849819,1.119573,1.285081,1.496892,1.536671,1.412369,1.330877,1.364362,1.319881,1.175119,1.586548,2.0276,1.842743
0.268654,0.350396,0.593693,0.8352,0.78765,0.841786,1.172451,1.451261,1.826593,1.700151,1.136321,0.983473,1.188811,1.218237,0.815429,0.757564,0.951047,0.909007,1.115218,1.452539,1.350192,1.172196,1.330612,1.420075,1.352663,1.57471,1.882949,1.691447
0.194642,0.254541,0.403641,0.490076,0.477986,0.655513,0.98056,1.079924,1.173979,1.166957,0.842239,0.795803,0.977422,0.950496,0.697633,0.617581,0.721176,0.634061,0.778382,1.186718,1.051053,0.880659,1.159045,1.403168,1.415402,1.28745,1.407101,1.366336
0.14174,0.166817,0.246509,0.341571,0.352869,0.455628,0.695533,0.728428,0.665279,0.663062,0.562172,0.631869,0.776016,0.688083,0.525348,0.431055,0.467211,0.455906,0.611953,0.872005,0.67764,0.56558,0.794916,1.112046,1.242016,0.966632,0.995793,1.031212
0.142516,0.13471,0.179263,0.324438,0.353734,0.324769,0.476262,0.473387,0.415426,0.420718,0.372331,0.51412,0.637199,0.537574,0.415229,0.338223,0.330917,0.326354,0.449849,0.557607,0.413341,0.338275,0.419562,0.677612,0.867356,0.744815,0.806189,0.844326
0.152442,0.135869,0.200436,0.367013,0.35456,0.243187,0.322135,0.312434,0.275392,0.342191,0.337465,0.438443,0.479334,0.40278,0.35726,0.284686,0.261279,0.286585,0.368676,0.398642,0.297152,0.229256,0.223483,0.368345,0.486166,0.504439,0.572374,0.637582
0.145759,0.140951,0.23604,0.401186,0.336946,0.191836,0.251957,0.24811,0.201292,0.295516,0.320331,0.34178,0.386323,0.354295,0.293787,0.235973,0.239415,0.277022,0.305654,0.31204,0.262285,0.205854,0.176326,0.237956,0.296413,0.326738,0.347642,0.41078
0.123631,0.136628,0.239999,0.387079,0.335539,0.189399,0.19889,0.184216,0.175186,0.273372,0.277804,0.232758,0.308841,0.319212,0.251237,0.231415,0.244322,0.239497,0.225269,0.261172,0.249248,0.184424,0.153169,0.177642,0.231486,0.249137,0.273322,0.280421
0.111183,0.120517,0.191532,0.301153,0.305958,0.208036,0.168707,0.143,0.158074,0.220979,0.206257,0.161455,0.23855,0.247298,0.205056,0.214809,0.238439,0.208139,0.176353,0.225359,0.207971,0.155621,0.140732,0.182374,0.214404,0.192985,0.235907,0.226749
0.099275,0.096713,0.117637,0.180655,0.22958,0.211024,0.169243,0.143144,0.144121,0.152977,0.136409,0.136929,0.182678,0.176708,0.159016,0.168373,0.218303,0.197686,0.136058,0.168615,0.161762,0.13838,0.136392,0.189211,0.193659,0.179086,0.221134,0.181876
0.077847,0.079014,0.073741,0.089575,0.13695,0.17633,0.152797,0.135006,0.13294,0.123407,0.10899,0.127352,0.148791,0.152139,0.146815,0.150643,0.220213,0.201163,0.109741,0.120377,0.131609,0.114444,0.119513,0.165654,0.172531,0.185107,0.191399,0.126304
0.056887,0.07419,0.071238,0.059988,0.070512,0.120018,0.117769,0.107999,0.106509,0.108001,0.13047,0.150173,0.154454,0.158856,0.134212,0.142124,0.219612,0.190827,0.083818,0.100497,0.124757,0.105625,0.114153,0.131923,0.133764,0.171801,0.153147,0.094494
0.04412,0.062227,0.067543,0.059575,0.049939,0.076124,0.097111,0.086271,0.071862,0.082167,0.150227,0.195785,0.194979,0.163187,0.102866,0.111795,0.186641,0.167015,0.074077,0.092106,0.109911,0.099922,0.119591,0.109724,0.088929,0.139226,0.134558,0.090327
