-0.000811,-0.000501,-0.000711,-0.000702,-0.00048,-0.000278,-0.000371,-0.00044,-0.000613,-0.000517,-0.000205,-0.00015,-0.000322,-0.000571,-0.000309,-0.000426,-0.000588,-0.000606,-0.000239,-0.000394,-0.000567,-0.000597,-0.000576,-0.000626,-0.000335,-9.6e-05,-0.000514,-0.000354,-0.000822,-0.000385,-0.000522,-0.000178,-0.000456,-0.00053,-6.4e-05,-0.000359,-2.2e-05,-0.000419,-0.000362,-0.000569,-0.000413,-0.000302,-0.000201,-0.000222,-0.00019,-0.000495,-0.000102,-0.000219,-0.000212,-0.000103,-0.000134,-0.00021,-0.000193,-0.000331,-0.000239,-0.000406,-0.000395,-0.000267,-0.000303,-0.000352,-0.000221,-3.4e-05,-0.000179,-0.000145,-0.00035,-0.000281,-0.000322,-0.000376,-0.000255,-0.000306,-0.000321,-0.000275,-0.000263,-0.000214,-0.000273,-0.000311,-0.000105,-0.000217,-0.000158,-0.000151,-0.000169,-9.7e-05,-0.000275,-0.000161,-0.000242,-2.8e-05,-1.6e-05,-8.9e-05,-0.000148,-0.000281,-0.000164,-0.000208,-4.7e-05,-7e-06,-0.000125,0.000109,-0.000198,-0.000186,2.9e-05,-3e-05,-5.1e-05,-8e-06,-0.000169,-0.000186,-0.000113,-0.000156,-0.00013,-5.5e-05,-0.000133,-8.7e-05,5e-06,-0.000143,-0.000138,-3.9e-05,-9.5e-05,-0.000136,-0.000201,-4.3e-05,-9.8e-05,-4.4e-05,-2.8e-05
-4.3e-05,-0.000357,-0.000163,-5.8e-05,-9.4e-05,-0.000302,-0.000402,-6.2e-05,-9.3e-05,-0.000418,-0.00028,-0.000103,-0.000176,-0.000376,-0.00047,-0.000204,0.00013,-2.8e-05,-0.000181,-4.3e-05,-3.2e-05,0.000121,-4e-06,-0.000521,-0.000408,-0.000844,-0.000428,-0.000438,4e-06,-9e-06,6.3e-05,-0.00025,-0.000426,-0.000459,-0.000304,-0.000136,-0.000229,-0.00019,-0.000365,-0.000185,-0.000286,-0.000419,-0.000545,-0.000321,-0.000204,-0.000129,0.000285,-9e-05,-0.000215,-7.9e-05,-8.3e-05,-0.000244,-0.000262,-0.000491,-0.000239,-0.000131,4.4e-05,-0.000209,-0.000126,-4.7e-05,-0.000412,-0.000197,-0.000117,-0.000126,-0.000229,4.2e-05,-0.000153,-0.00013,-3.4e-05,-5.8e-05,-0.000105,-0.000209,-0.000151,-2.4e-05,4.4e-05,-2.3e-05,-9.8e-05,-7.4e-05,2.1e-05,-4.8e-05,-8.5e-05,-0.000206,-0.000276,-0.000259,-9.9e-05,-0.000302,-0.00025,-0.000119,-0.000147,-4.7e-05,-0.000234,-0.000127,-5.6e-05,-0.000332,-0.000412,-0.000281,-0.000165,-0.000151,-0.000221,-0.000249,-0.000145,-0.000188,-0.000162,-0.00018,-8.9e-05,-0.000239,-1e-04,-7.3e-05,-0.000158,-0.000168,-8.7e-05,-7.5e-05,-3.8e-05,-4e-05,-0.000272,-0.00017,-0.000233,-0.000176,-0.000144,-0.000205,-0.000203
0.000188,8.2e-05,-3.2e-05,0.000105,8.8e-05,9.8e-05,2e-05,-7.2e-05,-0.000106,0.000185,0.00012,0.000177,-0.000115,0.000121,0.00024,0.000159,-2.6e-05,0.000164,4.9e-05,7.9e-05,0.000138,2.5e-05,5e-05,9.3e-05,5.8e-05,0.000276,0.000166,7e-06,-6.4e-05,-0.000156,4e-06,5.7e-05,9.1e-05,0.000261,0.000148,0.000114,-0.000103,4.5e-05,0.000103,0.000229,0.000196,0.000239,8.3e-05,0.000368,-8.4e-05,8.2e-05,4.4e-05,-7.2e-05,6.6e-05,0.00015,-0.000171,0.000162,0.000132,-1.7e-05,-5.2e-05,5.4e-05,-8.4e-05,-1.1e-05,-2.2e-05,2e-06,3.2e-05,-2.8e-05,-0.000132,-2.4e-05,1.1e-05,-1e-05,2e-06,-3.6e-05,2.6e-05,-2.4e-05,0.000117,7e-06,0.00019,5.3e-05,9.1e-05,8.6e-05,-0.000174,3.6e-05,0.000104,7.2e-05,0.000168,0.000225,0.000205,4.1e-05,-8.5e-05,-6e-05,-0.000157,-7e-05,-1.2e-05,1e-04,0.000187,7.2e-05,-2.7e-05,7.8e-05,0.000188,-0.00016,2.8e-05,0.000109,-7.2e-05,-2.7e-05,-5.6e-05,-4.3e-05,-2e-05,1.4e-05,-1.4e-05,-6.6e-05,1.1e-05,-7.5e-05,-3.7e-05,7.7e-05,1.9e-05,-0.000106,-8.2e-05,-0.000107,-3.2e-05,0.000185,5e-05,-2e-06,-7.6e-05,5e-05,8.9e-05
-0.000143,4.8e-05,0.000291,6.4e-05,-1e-06,8.5e-05,0.000158,0.000208,-7.1e-05,3.6e-05,0.000143,-0.00024,8.8e-05,0.000284,0.000349,0.000231,0.000109,-6.4e-05,5.2e-05,3e-06,-2.6e-05,-0.000131,-0.000104,0.000224,0.000245,0.000314,0.000276,0.000182,5.4e-05,-8.8e-05,4e-05,-2.9e-05,0.000364,0.000219,0.000195,9.6e-05,0.000121,-4.3e-05,3.1e-05,0.000181,0.000229,0.00022,0.000232,5.2e-05,0.000178,0.000142,-8e-05,0.000153,6e-05,1.7e-05,-0.000133,0.000151,0.000117,0.000303,4.8e-05,-0.000121,-2e-05,-0.000157,0.000199,9.1e-05,4.2e-05,9.4e-05,-0.000131,-7.5e-05,3e-05,-7e-05,3.9e-05,8.7e-05,-0.000181,3.5e-05,-5.5e-05,1e-04,-7e-05,-2.9e-05,-0.000106,-2.8e-05,2.2e-05,-0.000108,-3e-05,-5.5e-05,-3.9e-05,9.4e-05,7.4e-05,1.4e-05,0.000155,0.000103,0.000154,-6.5e-05,9e-06,-6.4e-05,-3.2e-05,0.000111,8.8e-05,3.7e-05,0.000191,0.000141,2.5e-05,-5.1e-05,-5.9e-05,0.000243,4.1e-05,1.2e-05,1.4e-05,7.5e-05,-3.8e-05,0.00012,-4.2e-05,-0.000121,9.7e-05,7e-06,6.4e-05,7.2e-05,-3e-06,4.7e-05,0.000136,0.000119,0.000127,8.4e-05,4e-05,9.8e-05,0.000153
4.5e-05,2.7e-05,-8e-06,-8.7e-05,-3.8e-05,6.9e-05,-0.000199,-3.8e-05,9e-06,-0.000157,-0.000171,-2.4e-05,-2.9e-05,-7.9e-05,-0.000239,-0.000231,-0.000376,-0.000148,-0.000225,-0.000174,3.4e-05,4.7e-05,-2.9e-05,2.7e-05,-0.000237,-0.000201,-0.000327,-0.00017,-7.8e-05,3.9e-05,-9.8e-05,-1.2e-05,-0.000144,-0.000259,-0.000327,-0.000298,-0.000111,9.6e-05,5.9e-05,-0.00014,-4.8e-05,-0.000143,-3.6e-05,-0.000173,-1.9e-05,-1e-06,9.5e-05,2.7e-05,-0.000196,-3.3e-05,-0.000122,-0.000125,4.8e-05,1.7e-05,-8.6e-05,7.2e-05,8.2e-05,3.5e-05,-4.1e-05,-0.000121,-7.6e-05,7.3e-05,0.000103,7.3e-05,6e-06,1.8e-05,-9e-06,-4e-06,-4e-05,2.2e-05,-6.6e-05,-1.5e-05,4.1e-05,-4e-06,-7.1e-05,-7.3e-05,2.6e-05,-7.2e-05,-3e-05,-2.6e-05,-9.7e-05,-0.000227,-0.00019,-9.6e-05,-5.5e-05,-4.4e-05,3.2e-05,3e-06,0.000131,0.000157,-0.000174,-7.7e-05,-6.6e-05,-0.000153,-0.000225,-5e-05,6.7e-05,-9.5e-05,-4e-05,-1.4e-05,-2.4e-05,-3.7e-05,-0.000121,-4e-06,2.6e-05,8e-05,1.1e-05,5.3e-05,1.3e-05,-1.6e-05,-8.5e-05,-2.5e-05,5.5e-05,-5.8e-05,2.1e-05,-0.000112,-8e-06,7e-06,1.5e-05,-5e-05,-7.2e-05
-0.000101,-0.000143,-0.000172,-0.000173,-6.2e-05,-0.000113,-6.4e-05,-0.000228,0.00011,2e-05,-2e-06,-8.2e-05,4.8e-05,-0.000218,-3.4e-05,-7.1e-05,0.000121,0.000102,3.4e-05,-0.00011,-1e-04,-1.2e-05,1e-06,-0.000189,-0.000145,-0.000163,-0.000165,-0.000105,-0.000164,-0.000269,5e-05,-3.7e-05,-0.000188,-0.000156,-6.3e-05,-6.6e-05,-0.000126,-0.000162,-5.3e-05,-4.4e-05,-9.5e-05,-1e-04,5.2e-05,0.000102,-9.8e-05,-0.000236,-0.000119,-0.000147,-9.3e-05,4.1e-05,0.000115,-7.1e-05,-5.7e-05,-0.000273,5.4e-05,3.6e-05,-1.9e-05,-2.9e-05,-0.000192,-0.000117,-4.6e-05,-7.6e-05,2.4e-05,2.3e-05,3.1e-05,-8.8e-05,-0.00015,-3.2e-05,2.1e-05,5e-06,-2.4e-05,-1e-04,1e-06,-5.4e-05,-3.9e-05,-1.7e-05,-6e-06,-2.6e-05,-1e-06,-3.5e-05,0.000122,9.6e-05,-7.6e-05,6.4e-05,-1.2e-05,-2.8e-05,-0.00013,2.8e-05,-4.1e-05,-3e-05,4e-06,2.1e-05,-2e-05,-4.3e-05,-9.6e-05,-0.000146,-4.9e-05,-3.6e-05,1.2e-05,-9.4e-05,-0.000102,-7.8e-05,-2.6e-05,-9.6e-05,-9e-06,-2.1e-05,0.000107,4.2e-05,-2.2e-05,-7.1e-05,1e-06,0,-3.3e-05,7.5e-05,-4.1e-05,-2.1e-05,-8.9e-05,-3.9e-05,-1.7e-05,-7.2e-05,-4.7e-05
-0.000136,6.2e-05,0.000105,2.3e-05,5.2e-05,-0.00015,2.6e-05,2.5e-05,7.7e-05,3.7e-05,9.8e-05,7e-06,-3.5e-05,0.000177,0.000208,0.000197,9e-05,6.6e-05,-4.8e-05,0.000123,4.7e-05,-3.9e-05,-7.1e-05,-8.6e-05,0.000293,0.000101,0.000173,0.000209,0.000122,0.000157,0.000107,4.8e-05,-4.6e-05,0.000223,0.000137,0.000225,-1.8e-05,-5.9e-05,0.000143,8.8e-05,0.000106,9.6e-05,0.000168,0.000136,-7.7e-05,-5e-06,9e-06,-3.2e-05,7e-06,4.4e-05,-3.3e-05,6.4e-05,-4e-06,9.9e-05,0.000113,-2.3e-05,-1.5e-05,2.5e-05,-1.1e-05,5.4e-05,2.2e-05,-0.000125,6.5e-05,3.7e-05,-4.9e-05,-2.8e-05,4.1e-05,-3.7e-05,0,2.4e-05,-8.9e-05,-2.8e-05,3e-06,5.3e-05,3.2e-05,1.9e-05,-2.9e-05,-4.7e-05,2.5e-05,-5e-06,2.5e-05,-9e-05,0.000193,4.7e-05,-4e-06,6.1e-05,-2.8e-05,9.3e-05,-3.3e-05,-1.7e-05,-1.1e-05,4.7e-05,0.000107,-5e-06,6.8e-05,8.6e-05,-8.3e-05,-1.1e-05,1.1e-05,-3.8e-05,7.8e-05,3.7e-05,0.000118,-4.8e-05,-1.3e-05,-2.7e-05,2.1e-05,3.3e-05,-1.1e-05,-5.1e-05,-2.2e-05,-6.7e-05,-4e-05,1.7e-05,-3.5e-05,5.5e-05,1.9e-05,-4.6e-05,1.1e-05,6.6e-05,4.7e-05
0.000132,-2e-05,8.6e-05,0.000115,4.2e-05,4.2e-05,4.9e-05,-3.3e-05,-2.9e-05,2.4e-05,-8.9e-05,-1.1e-05,-0.000153,3.2e-05,-9.5e-05,-9.2e-05,-0.000184,-5.6e-05,2.9e-05,-3e-06,-5.4e-05,-3.1e-05,-7.8e-05,-8.6e-05,7.8e-05,0.000183,3e-05,-0.000141,4.7e-05,-7.1e-05,-9.8e-05,-2.8e-05,-3e-05,-0.00011,3.4e-05,-0.000119,-3.4e-05,3.1e-05,-7.2e-05,-2.8e-05,-3e-06,-8.7e-05,-9.4e-05,-0.000193,6.5e-05,3.7e-05,2.6e-05,-0.000178,-3.8e-05,-0.000119,-7.9e-05,-4.6e-05,-6.5e-05,8e-05,-1.7e-05,-5.1e-05,-1.7e-05,2e-06,3.7e-05,5.8e-05,6.7e-05,1e-05,-6.8e-05,-9.5e-05,-4.1e-05,3.8e-05,-9e-05,3e-06,-1.3e-05,-8.4e-05,-1.7e-05,6e-06,-4.8e-05,-3.6e-05,-2.2e-05,-1e-05,2e-06,8.2e-05,1.3e-05,1e-06,1.6e-05,-3.5e-05,1e-05,8e-06,6.5e-05,-3.2e-05,4.8e-05,-1.8e-05,-4.7e-05,-5.6e-05,-5e-05,-0.000121,-2.4e-05,1.4e-05,5e-06,-2e-06,2.4e-05,1.5e-05,-0.000101,-3.3e-05,7.9e-05,5.8e-05,2e-06,3.3e-05,-3.4e-05,-1.2e-05,-8.8e-05,-4.5e-05,2e-05,8.8e-05,3.1e-05,6.3e-05,2.8e-05,-7.4e-05,-1e-06,1.4e-05,3.7e-05,5.3e-05,-9.3e-05,3.8e-05,-1.6e-05
-3e-05,-4.5e-05,-0.000105,-9.3e-05,-7e-06,8.8e-05,-8.1e-05,-6e-06,-1.7e-05,3.5e-05,-2.6e-05,4e-05,0.000117,-1.6e-05,-4.7e-05,-6.4e-05,5.4e-05,-5.3e-05,-5.9e-05,-4e-06,-4.8e-05,3.4e-05,0.000138,0.000123,-1e-04,-0.000123,-8.6e-05,-0.000137,-0.00013,-3.8e-05,-0.000125,-1.2e-05,0.000133,-4.5e-05,-0.000133,0,-8.6e-05,-7e-06,-3.5e-05,7e-06,-0.000184,-6.4e-05,-8e-06,-6.2e-05,-0.000135,3.1e-05,4e-05,-1e-05,-3.2e-05,-7.2e-05,4.1e-05,-9e-06,-8.5e-05,-7.7e-05,-7e-05,-4.5e-05,1e-06,-5.2e-05,1.4e-05,-1.3e-05,-5.3e-05,5e-05,5.9e-05,-4.9e-05,-3e-05,-1.3e-05,1e-06,-3.5e-05,-0.000104,-7e-06,-3.6e-05,-5.7e-05,-1.3e-05,-6.6e-05,-2.7e-05,4.5e-05,2.4e-05,-8e-06,-2.4e-05,-3.8e-05,2.7e-05,3.5e-05,-3.1e-05,-7.3e-05,-5.1e-05,1.2e-05,5e-06,-2.4e-05,-9e-06,-1.1e-05,-4.8e-05,-2.4e-05,-2.6e-05,-3.2e-05,1e-06,-2.2e-05,7.2e-05,1.3e-05,-3.1e-05,-9e-06,-8.2e-05,-9e-06,-6.2e-05,-1.1e-05,-1.2e-05,-2.7e-05,1.1e-05,1.4e-05,-2.2e-05,-2.3e-05,-2.9e-05,8e-06,4.3e-05,-1.3e-05,-3.4e-05,-6e-05,-0.000131,-4e-05,-1.2e-05,1.2e-05,-2.4e-05
-5.5e-05,3.7e-05,8.4e-05,7e-06,8.6e-05,1.3e-05,4.2e-05,9e-06,0.000118,-5.1e-05,-4.8e-05,-9e-06,-7.3e-05,-2.2e-05,-4.1e-05,2.5e-05,-1.9e-05,2.8e-05,7.5e-05,-4.1e-05,-5.6e-05,-4.5e-05,-1.5e-05,-3.6e-05,9.7e-05,6e-05,3.5e-05,0.000101,6.3e-05,1e-06,4e-05,4.8e-05,4.5e-05,1.2e-05,2e-06,1.7e-05,7.8e-05,-5.2e-05,8e-06,2e-06,1.1e-05,2.4e-05,-1e-06,1.7e-05,6.4e-05,1.6e-05,3e-06,-1e-06,-4.3e-05,-6.4e-05,-2.4e-05,-4e-06,5.3e-05,5e-05,4.1e-05,1.5e-05,-1e-05,1.3e-05,1.4e-05,-7e-06,-1.8e-05,2e-06,6.2e-05,2.1e-05,4.8e-05,-6e-05,2.2e-05,4.1e-05,8.3e-05,-6e-06,2.6e-05,3.6e-05,1e-05,-2.2e-05,-7e-06,-1.6e-05,-3.3e-05,-5e-06,-9e-06,-2.8e-05,-3e-05,1.4e-05,5e-05,2.2e-05,-4.4e-05,-5.6e-05,-3e-05,1.1e-05,2.2e-05,5.9e-05,3.2e-05,8.8e-05,-3.2e-05,7e-06,5e-05,-3.5e-05,1.3e-05,4.1e-05,-3e-06,1.7e-05,-4.3e-05,3.4e-05,5.5e-05,2.3e-05,3.3e-05,7e-06,2.4e-05,-5e-06,1.6e-05,-4.7e-05,-2.3e-05,-2.7e-05,4e-06,-2.6e-05,1e-06,-2e-06,3.2e-05,1e-05,5.8e-05,1.9e-05,1.2e-05
-1.2e-05,-5.2e-05,-6e-05,-3.5e-05,-4e-06,-1e-06,3.4e-05,5e-05,-2.3e-05,-7.2e-05,6.3e-05,-2.2e-05,1e-05,2.5e-05,4.2e-05,2.7e-05,-4.9e-05,2.3e-05,-2.7e-05,3.3e-05,6.8e-05,3.8e-05,4.2e-05,3.4e-05,-1e-05,4.2e-05,-7e-06,0.000102,1.5e-05,9e-05,1.4e-05,6.8e-05,-4.2e-05,5.8e-05,0.000118,3.5e-05,5.5e-05,4.5e-05,4.9e-05,5.6e-05,6.5e-05,8e-06,5e-05,1.4e-05,1e-06,-2.4e-05,3.4e-05,5.1e-05,2.8e-05,2.8e-05,2.6e-05,-1.1e-05,-4.8e-05,-1.1e-05,6.3e-05,3.8e-05,5e-06,6.2e-05,-3e-05,-1.7e-05,7.8e-05,1.2e-05,-2.5e-05,4.2e-05,1.5e-05,1.9e-05,2.1e-05,-2.3e-05,2.7e-05,-1.6e-05,4.4e-05,6.7e-05,1.2e-05,2.8e-05,9e-06,-5e-06,2.1e-05,-2.5e-05,-3.7e-05,-2.2e-05,-3.9e-05,-1.7e-05,-4e-06,1.5e-05,4e-05,3.3e-05,3.4e-05,2.7e-05,6.5e-05,-3.5e-05,-5e-06,-3.3e-05,3.6e-05,5e-06,3e-05,-2e-06,-6e-06,-1e-05,1e-06,7e-06,4.7e-05,1.8e-05,1.1e-05,3.2e-05,-3.2e-05,2e-06,4.5e-05,3.1e-05,2.1e-05,9e-06,8e-06,1.7e-05,4e-06,3.5e-05,4.5e-05,1.9e-05,2.4e-05,-1.6e-05,-1e-06,-3.8e-05,1.9e-05
7e-05,4.3e-05,5.7e-05,5e-05,-7.5e-05,3e-06,2.2e-05,-1.6e-05,-5.3e-05,-5e-06,0,-1.7e-05,5e-05,-2.7e-05,-2.6e-05,0,1.7e-05,-6.4e-05,0,-2e-05,3e-05,0,-1.8e-05,-8e-06,3.3e-05,-7.8e-05,-3e-06,-7e-06,-8e-06,1.3e-05,-8e-06,-1e-05,-2e-06,3e-05,-7.1e-05,-4.1e-05,-5.6e-05,-5.1e-05,1.5e-05,-4.5e-05,-5.5e-05,-6.9e-05,-5.7e-05,-5e-06,-2.4e-05,3.3e-05,-2.4e-05,-2.1e-05,1.5e-05,-1.4e-05,5.1e-05,2.4e-05,-1.2e-05,-5e-05,-3.2e-05,-1.1e-05,-1.8e-05,-8e-06,-1e-06,3.9e-05,-2e-05,8e-06,-5.4e-05,2.3e-05,-3e-06,-1.1e-05,5e-05,2e-05,-4.4e-05,5.6e-05,1.1e-05,-7.7e-05,0,1.9e-05,-1e-06,-2.4e-05,1.5e-05,2.3e-05,-3.3e-05,4.3e-05,1e-05,-2.1e-05,-1.7e-05,-2e-06,-1.1e-05,2e-05,-1.9e-05,-2.3e-05,-8e-06,2.4e-05,9e-06,-2e-06,-4.8e-05,-5e-05,-1e-05,-2e-05,-1e-06,-3e-05,0,-2.3e-05,3.7e-05,-2.3e-05,-2.1e-05,1.1e-05,-4.3e-05,-1.9e-05,-2e-05,1.6e-05,-2.8e-05,1.2e-05,5e-06,2.5e-05,-1.6e-05,-1e-05,-2.6e-05,4.2e-05,-1.6e-05,6e-06,-6e-06,-1.2e-05,-2.2e-05
-1.7e-05,5e-06,-2.2e-05,-8e-06,2e-05,-3.9e-05,-6.7e-05,-1e-06,-5.1e-05,3.4e-05,1.9e-05,2.1e-05,3.6e-05,6.2e-05,-5e-06,-2.1e-05,2.8e-05,2.3e-05,-2e-05,1.9e-05,-2.7e-05,-7e-06,-4e-06,-1.2e-05,-2e-06,-3.5e-05,-1.7e-05,-3.1e-05,1.2e-05,-3.2e-05,-4e-05,-4.3e-05,-3.3e-05,8e-06,3e-05,-2e-06,3e-05,0,-4.3e-05,1.2e-05,-3.1e-05,6e-06,2e-06,4e-06,-6.2e-05,1.2e-05,-1.6e-05,-1.1e-05,9e-06,-1.6e-05,2e-06,2.6e-05,1e-06,-3.4e-05,-2e-06,-2e-06,-4e-06,6e-06,-2.4e-05,2.4e-05,-1e-06,-4e-06,3e-05,-8e-06,3e-06,5.2e-05,-5.9e-05,-6e-06,8e-06,-4e-06,-2.7e-05,5e-05,-5e-06,-1.4e-05,-2.4e-05,-1e-06,0,1.9e-05,2.6e-05,-1.9e-05,-1.1e-05,-2e-05,1.8e-05,1.6e-05,-3e-05,-2.4e-05,-2e-05,-2.8e-05,-5.3e-05,-3e-06,1e-06,9e-06,1e-06,1.1e-05,8e-06,4e-06,8e-06,3e-06,-1.1e-05,-3e-06,-1.1e-05,-3.1e-05,-7e-06,-8e-06,1.6e-05,-4e-06,-3.2e-05,-2.2e-05,1e-06,1.6e-05,-8e-06,-3.5e-05,4e-06,-1.8e-05,1e-06,-5e-06,-1.2e-05,-2e-06,0,2.9e-05,-2.3e-05
-3.1e-05,-3.1e-05,-1.6e-05,-3e-06,2.1e-05,-3e-06,-1.9e-05,-1.2e-05,1.7e-05,1e-05,-2.6e-05,1e-06,1.5e-05,5e-06,-7e-06,2.6e-05,4e-06,1e-06,3e-06,-1e-05,5e-06,6e-06,4e-06,2.2e-05,-3.9e-05,-8e-06,-7e-06,-9e-06,1e-05,-1.9e-05,4.4e-05,1e-06,9e-06,-4.5e-05,4e-06,1.6e-05,-2.8e-05,1.8e-05,-2.9e-05,1.3e-05,5.6e-05,6.6e-05,1.5e-05,7e-06,3.1e-05,8e-06,-1.6e-05,5e-06,-1.3e-05,2e-05,-2.4e-05,3e-06,2.1e-05,2.3e-05,1.9e-05,-1.2e-05,1e-05,0,1.1e-05,-2e-05,-1.3e-05,1e-05,-7e-06,1.5e-05,2e-06,-8e-06,-1.9e-05,-4e-06,1.1e-05,-2.7e-05,-4e-06,-1.3e-05,1.1e-05,1e-05,2.3e-05,-9e-06,4e-06,-1.5e-05,3.2e-05,7e-06,-5e-06,-4e-06,-2e-05,7e-06,2.3e-05,-3.2e-05,1.7e-05,3.1e-05,-1.3e-05,-1.4e-05,-2.6e-05,1e-06,-1.9e-05,1e-06,7e-06,3e-06,1.1e-05,-9e-06,1e-05,-1.3e-05,6e-06,3e-06,-4e-06,-1.5e-05,-3e-06,1.9e-05,1.5e-05,-5e-06,-1e-05,-1.6e-05,-3e-06,1.8e-05,0,1.2e-05,1e-06,-1.8e-05,6e-06,1e-06,5e-06,4e-06,-6e-06
6.8e-05,9e-06,3e-06,-7e-06,-3e-06,-1.3e-05,3.1e-05,6e-06,-7e-06,-2e-05,1.6e-05,-2e-06,-2.2e-05,-4.1e-05,1.5e-05,-4e-06,-2.2e-05,-2.5e-05,1.6e-05,-5e-06,4e-06,5e-06,-1.1e-05,-1.2e-05,2e-06,-5e-06,-1.9e-05,3.2e-05,-9e-06,1.6e-05,4e-06,-1.1e-05,-6e-06,-1.3e-05,1e-06,8e-06,1.6e-05,1e-06,-1.2e-05,-5e-06,-3e-06,-7e-06,1.6e-05,6e-06,5e-06,4.6e-05,2.3e-05,-1.5e-05,1.9e-05,0,-4e-06,-6e-06,2.4e-05,-7e-06,2e-05,7e-06,1e-05,-2e-05,2.7e-05,-6e-06,2.2e-05,-1.3e-05,-2.5e-05,-1e-05,2e-06,-1.1e-05,2.3e-05,2.1e-05,1.6e-05,1.3e-05,7e-06,4e-06,-9e-06,2e-06,-6e-06,3e-06,1.1e-05,-9e-06,-9e-06,1e-05,-8e-06,1.3e-05,-1e-05,1.2e-05,0,2e-05,-9e-06,-1e-05,9e-06,8e-06,1.2e-05,1e-05,-1.3e-05,1e-06,1.1e-05,1.1e-05,-4e-06,-1.4e-05,2e-06,-3e-06,-2.3e-05,6e-06,4e-06,3e-06,5e-06,1e-06,4e-06,2.2e-05,-6e-06,-1.5e-05,-4e-06,7e-06,-2e-06,1.5e-05,1e-06,-6e-06,2e-06,4e-06,2.3e-05,-2.5e-05,7e-06
-2.8e-05,-1.6e-05,-1.2e-05,-6e-06,-1.4e-05,1.2e-05,-5e-06,-1e-06,-2.2e-05,-4e-06,-3e-06,7e-06,-7e-06,5e-06,6e-06,-1.2e-05,1.4e-05,1.8e-05,-1.1e-05,-8e-06,-1.2e-05,-3e-06,2e-06,1e-05,-3e-06,-1e-05,1e-06,2e-06,-2e-06,8e-06,-7e-06,-3e-06,1.1e-05,2.3e-05,1e-06,-1.4e-05,-7e-06,-2.6e-05,-3e-06,-4e-06,1e-05,-3e-06,1.2e-05,-2e-06,1.4e-05,-2.2e-05,-1.4e-05,-2.4e-05,-2.4e-05,2.2e-05,3e-06,-6e-06,2e-06,0,-1e-06,4e-06,-1.4e-05,5e-06,-4e-06,-1.1e-05,-1.3e-05,9e-06,-5e-06,0,-5e-06,-1.3e-05,7e-06,-1e-05,-1.3e-05,1.1e-05,-3e-06,2e-06,1.9e-05,3e-06,-2e-06,1.4e-05,-5e-06,4e-06,-9e-06,-3e-06,-9e-06,8e-06,3e-06,8e-06,-9e-06,-1.1e-05,5e-06,-8e-06,-1.5e-05,1.2e-05,1.1e-05,-1.7e-05,-3e-06,-1.3e-05,1.1e-05,0,-5e-06,1.3e-05,0,1e-06,1e-06,-1.1e-05,0,9e-06,-3e-06,-1.1e-05,-1.5e-05,2e-06,2e-06,-1.4e-05,6e-06,-1e-05,8e-06,-4e-06,2e-06,-6e-06,6e-06,-9e-06,-2.7e-05,-2e-05,1.1e-05
-3.1e-05,-6e-06,1.7e-05,2e-06,1e-05,1.5e-05,1.1e-05,6e-06,-6e-06,2e-06,-1e-05,-2e-06,-4e-06,-1.5e-05,-1.9e-05,2e-06,1.7e-05,1.7e-05,7e-06,1.3e-05,1e-06,1.4e-05,2e-06,-1.4e-05,-6e-06,-6e-06,1.3e-05,-1.9e-05,-9e-06,-1.2e-05,-5e-06,-1.3e-05,-2e-06,0,-1.3e-05,9e-06,-1.2e-05,5e-06,-1.4e-05,-1.2e-05,-1.1e-05,-2e-06,3e-06,-1.5e-05,-2e-06,3e-06,4e-06,-1.4e-05,6e-06,-1.9e-05,3e-06,3e-06,0,1.8e-05,-4e-06,-1.1e-05,8e-06,3e-06,3e-06,5e-06,1e-06,-1e-06,1e-05,7e-06,1e-06,1.6e-05,1.2e-05,6e-06,-2.3e-05,-1.2e-05,-2e-06,-7e-06,-2e-06,-5e-06,4e-06,-1.2e-05,-2e-06,-1e-06,2e-06,-7e-06,1e-06,-1e-06,-1.3e-05,-5e-06,-1e-06,1e-05,4e-06,-7e-06,1e-06,-5e-06,6e-06,-8e-06,-8e-06,-1e-06,6e-06,9e-06,1.5e-05,7e-06,-6e-06,5e-06,2e-05,-1.3e-05,-8e-06,-4e-06,8e-06,0,-1e-06,-5e-06,-1e-06,0,1e-06,-4e-06,-3e-06,-7e-06,3e-06,1.8e-05,-1e-05,5e-06,0,-9e-06,4e-06
1.5e-05,2.2e-05,-5e-06,9e-06,-7e-06,-6e-06,-6e-06,-1.2e-05,7e-06,1.6e-05,6e-06,-8e-06,-9e-06,-1e-06,-4e-06,-1e-06,5e-06,-1e-05,1e-06,-1.1e-05,5e-06,1e-06,-1e-06,3e-06,-1.9e-05,1e-06,-3e-06,1.2e-05,6e-06,6e-06,8e-06,3e-06,-8e-06,1e-06,-1.1e-05,-1.3e-05,1.2e-05,1.2e-05,-5e-06,1.8e-05,-1.9e-05,-8e-06,-2e-06,-4e-06,-1.6e-05,1.3e-05,-2e-06,2e-06,1e-06,-1e-05,2e-06,1.2e-05,-1.5e-05,4e-06,-3e-06,-5e-06,-1e-06,-7e-06,-5e-06,1.1e-05,-3e-06,1e-06,0,-4e-06,-1e-06,6e-06,-2e-06,-4e-06,4e-06,0,8e-06,5e-06,-5e-06,-3e-06,-4e-06,-1e-06,-6e-06,6e-06,5e-06,-8e-06,3e-06,-9e-06,-1e-06,-2e-06,3e-06,-7e-06,-3e-06,6e-06,1.7e-05,0,-6e-06,1e-05,3e-06,-1e-06,-1e-06,-4e-06,-1e-06,-1.4e-05,-5e-06,2e-06,-6e-06,-1e-05,0,7e-06,6e-06,-6e-06,3e-06,6e-06,4e-06,1.4e-05,0,3e-06,-6e-06,-7e-06,2e-06,-1e-06,-8e-06,1e-06,1.5e-05,8e-06,-4e-06
1.3e-05,-7e-06,-8e-06,1e-06,-4e-06,-3e-06,-2e-06,7e-06,9e-06,1e-05,-1.2e-05,-3e-06,1.4e-05,1.2e-05,-9e-06,3e-06,-1.5e-05,5e-06,2e-06,3e-06,-1.3e-05,-1e-06,-1e-06,-5e-06,-9e-06,1e-06,-3e-06,1.6e-05,3e-06,-2e-06,-8e-06,-5e-06,-6e-06,-2e-06,4e-06,1.3e-05,-5e-06,-1.4e-05,6e-06,1e-06,-3e-06,1.4e-05,5e-06,2e-06,1.6e-05,-6e-06,-5e-06,8e-06,-6e-06,0,0,0,-1.2e-05,-2e-06,3e-06,6e-06,-4e-06,5e-06,-9e-06,0,0,-4e-06,-9e-06,-3e-06,-3e-06,-8e-06,-7e-06,4e-06,8e-06,1e-06,-3e-06,6e-06,-1e-06,2e-06,-3e-06,-5e-06,-3e-06,-7e-06,-6e-06,3e-06,-1e-06,-3e-06,-7e-06,-4e-06,-5e-06,2e-06,-8e-06,2e-06,5e-06,-4e-06,-4e-06,0,5e-06,4e-06,2e-06,2e-06,-8e-06,0,-3e-06,-1e-06,-1e-05,-3e-06,6e-06,6e-06,-8e-06,1e-06,2e-06,2e-06,-5e-06,1e-06,-3e-06,4e-06,1e-06,3e-06,3e-06,-5e-06,1e-06,-6e-06,-4e-06,6e-06,0
-1.6e-05,2e-06,8e-06,-8e-06,2e-06,-2e-06,2e-06,-4e-06,-3e-06,-1e-05,6e-06,7e-06,4e-06,-4e-06,7e-06,6e-06,1e-06,-1.4e-05,5e-06,3e-06,1.4e-05,-1e-06,-3e-06,8e-06,0,1e-06,-2e-06,-2e-06,1e-06,9e-06,0,1e-06,-1e-06,4e-06,5e-06,-3e-06,4e-06,-1e-06,5e-06,-3e-06,-2e-06,-7e-06,-1e-05,3e-06,-1e-05,1.3e-05,2e-06,1e-06,9e-06,3e-06,4e-06,-2e-06,-3e-06,1.2e-05,-1e-06,2e-06,1e-06,-3e-06,1e-06,-3e-06,0,0,-3e-06,0,2e-06,-4e-06,2e-06,-3e-06,0,2e-06,-3e-06,-2e-06,0,2e-06,8e-06,4e-06,0,1e-06,-4e-06,0,3e-06,1e-06,-4e-06,-1e-06,3e-06,1e-06,1e-05,-3e-06,-7e-06,0,2e-06,2e-06,-6e-06,-8e-06,-2e-06,-2e-06,2e-06,-2e-06,-2e-06,-1e-06,8e-06,1e-06,-2e-06,-2e-06,-8e-06,-2e-06,-2e-06,-4e-06,2e-06,-4e-06,-1e-06,-6e-06,1e-06,-2e-06,0,-3e-06,-2e-06,2e-06,1e-06,-2e-06,-2e-06
6e-06,-1e-06,-4e-06,1e-06,-1e-06,-5e-06,2e-06,1e-06,5e-06,-1.1e-05,-2e-06,0,1e-05,-1e-06,1e-06,-5e-06,8e-06,-1e-06,-1e-06,-5e-06,1e-05,4e-06,1e-06,-6e-06,9e-06,2e-06,0,-1e-05,-8e-06,-1.1e-05,-5e-06,-1e-06,4e-06,1.3e-05,-3e-06,-5e-06,-3e-06,6e-06,4e-06,-7e-06,0,-5e-06,-4e-06,0,-1.2e-05,1.2e-05,-1e-06,2e-06,-5e-06,-8e-06,-3e-06,-4e-06,3e-06,-8e-06,-6e-06,0,2e-06,2e-06,0,-1e-05,-2e-06,1e-06,9e-06,1e-06,1e-06,1e-06,-1e-06,3e-06,-1.6e-05,-1e-06,-1e-06,1e-06,-1e-06,1e-06,-5e-06,-3e-06,-2e-06,-1e-06,1e-06,-1e-06,-1e-06,6e-06,2e-06,-1e-06,6e-06,3e-06,-6e-06,-3e-06,-3e-06,0,0,1e-06,7e-06,4e-06,-1e-06,1e-06,0,0,-4e-06,-6e-06,-1e-06,-3e-06,-1e-06,-2e-06,7e-06,1e-06,-4e-06,-3e-06,2e-06,-7e-06,0,3e-06,0,-3e-06,-1e-06,1e-06,-1e-06,3e-06,-2e-06,-1e-06,0
9e-06,2e-06,5e-06,2e-06,-2e-06,0,-5e-06,4e-06,1.1e-05,-3e-06,-1e-06,-8e-06,-2e-06,5e-06,6e-06,2e-06,-2e-06,2e-06,2e-06,0,-1.3e-05,-2e-06,-2e-06,0,-3e-06,3e-06,2e-06,4e-06,3e-06,2e-06,-1e-06,-2e-06,6e-06,-8e-06,0,1e-06,-1e-06,-8e-06,-2e-06,-3e-06,3e-06,6e-06,-7e-06,-2e-06,4e-06,-1.1e-05,-2e-06,-9e-06,5e-06,2e-06,1e-06,2e-06,9e-06,-3e-06,0,-3e-06,1e-06,-3e-06,7e-06,2e-06,-3e-06,-1e-06,4e-06,4e-06,0,4e-06,-3e-06,-1e-06,1.1e-05,0,0,1e-06,2e-06,-3e-06,0,1e-06,1e-06,1e-06,0,1e-06,1e-06,2e-06,6e-06,-1e-06,-5e-06,-5e-06,2e-06,5e-06,-7e-06,1e-06,3e-06,-2e-06,-3e-06,-6e-06,1e-06,-2e-06,-3e-06,3e-06,1e-06,-5e-06,-1e-06,-3e-06,0,-2e-06,-3e-06,0,6e-06,2e-06,0,-2e-06,0,0,0,-1e-06,0,4e-06,1e-06,-1e-06,2e-06,0,0
-1.1e-05,1e-06,2e-06,2e-06,-1e-06,5e-06,0,-5e-06,6e-06,2e-06,1e-06,3e-06,-3e-06,-2e-06,-4e-06,-2e-06,5e-06,-5e-06,-1e-06,7e-06,-2e-06,-2e-06,2e-06,-1e-06,0,2e-06,-4e-06,2e-06,-3e-06,-6e-06,9e-06,2e-06,-3e-06,-9e-06,-2e-06,1e-06,-3e-06,-1e-06,2e-06,3e-06,2e-06,5e-06,-1e-06,2e-06,1.1e-05,0,1e-06,-5e-06,-5e-06,0,0,5e-06,2e-06,2e-06,1e-06,2e-06,-3e-06,-1e-06,3e-06,4e-06,-2e-06,0,-4e-06,1e-06,0,4e-06,6e-06,1e-06,0,1e-06,-1e-06,1e-06,-2e-06,-1e-06,-1e-06,1e-06,-1e-06,2e-06,-1e-06,0,1e-06,-1e-06,-3e-06,0,5e-06,2e-06,3e-06,2e-06,-3e-06,0,-6e-06,4e-06,2e-06,1e-06,-3e-06,2e-06,1e-06,1e-06,-1e-06,3e-06,2e-06,2e-06,0,2e-06,-4e-06,3e-06,-1e-06,-1e-06,2e-06,4e-06,0,-5e-06,0,3e-06,0,-3e-06,-2e-06,-1e-06,4e-06,3e-06,0
1e-06,-1e-06,0,1e-06,4e-06,7e-06,5e-06,1e-06,-2e-06,6e-06,-4e-06,4e-06,-3e-06,0,7e-06,1e-06,-1e-06,0,0,-5e-06,6e-06,4e-06,0,5e-06,5e-06,0,-2e-06,-1e-06,2e-06,9e-06,-3e-06,1e-06,-3e-06,3e-06,0,0,5e-06,3e-06,5e-06,1e-06,4e-06,0,1e-06,2e-06,-1.2e-05,1e-06,2e-06,-4e-06,3e-06,1e-05,-4e-06,0,3e-06,-7e-06,1e-06,0,-2e-06,1e-06,-6e-06,0,0,0,4e-06,-3e-06,0,-2e-06,0,2e-06,-3e-06,0,3e-06,0,0,2e-06,1e-06,-1e-06,-2e-06,-4e-06,1e-06,-1e-06,-2e-06,-2e-06,4e-06,0,1e-06,-1e-06,-2e-06,-1e-06,7e-06,2e-06,1e-06,-7e-06,-3e-06,-3e-06,-2e-06,0,1e-06,-1e-06,-1e-06,2e-06,-7e-06,3e-06,3e-06,0,1e-06,-1e-06,-3e-06,0,0,1e-06,-1e-06,5e-06,-1e-06,1e-06,1e-06,-3e-06,0,1e-06,-6e-06,6e-06,2e-06
9e-06,-3e-06,-1e-06,-3e-06,0,-1e-06,-1e-06,-1e-06,-1e-06,-6e-06,3e-06,-4e-06,-7e-06,0,0,-3e-06,0,3e-06,-1e-06,-1e-06,-6e-06,0,0,-4e-06,-2e-06,0,0,-1e-06,0,-6e-06,4e-06,-1e-06,-1e-06,2e-06,3e-06,0,-2e-06,-5e-06,3e-06,0,1e-06,-3e-06,1e-06,-1e-06,6e-06,-1e-06,3e-06,-5e-06,-3e-06,-2e-06,0,-3e-06,2e-06,-2e-06,-2e-06,0,3e-06,-2e-06,0,-1e-06,-1e-06,1e-06,5e-06,-2e-06,0,-3e-06,4e-06,-1e-06,-7e-06,-1e-06,1e-06,-2e-06,2e-06,1e-06,-2e-06,-4e-06,0,3e-06,3e-06,1e-06,0,-4e-06,-1e-06,0,-4e-06,2e-06,-1e-06,-1e-06,3e-06,0,1e-06,-2e-06,1e-06,-2e-06,-2e-06,2e-06,-2e-06,-1e-06,-2e-06,0,0,2e-06,-1e-06,1e-06,2e-06,-1e-06,2e-06,2e-06,-1e-06,-3e-06,0,-1e-06,0,-2e-06,1e-06,0,1e-06,-2e-06,-1e-06,2e-06,-2e-06
-6e-06,9e-06,-1e-06,-2e-06,-1e-06,-5e-06,0,-1e-06,0,0,2e-06,-3e-06,0,-4e-06,-2e-06,-2e-06,1e-06,1e-06,-1e-06,1e-06,2e-06,1e-06,1e-06,1e-06,6e-06,-2e-06,-2e-06,-1e-06,-4e-06,3e-06,-4e-06,0,-4e-06,1e-05,0,-3e-06,-2e-06,-2e-06,-1e-06,-2e-06,-1e-06,1e-06,3e-06,-4e-06,-3e-06,3e-06,-2e-06,4e-06,2e-06,-2e-06,2e-06,-3e-06,-2e-06,-1e-06,-1e-06,-2e-06,1e-06,1e-06,0,-2e-06,0,-1e-06,-2e-06,0,0,-1e-06,-1e-06,2e-06,1e-06,1e-06,-2e-06,3e-06,-3e-06,-2e-06,2e-06,-2e-06,0,-4e-06,-1e-06,0,-1e-06,2e-06,6e-06,-1e-06,1e-06,-1e-06,2e-06,3e-06,0,1e-06,1e-06,4e-06,0,1e-06,-4e-06,-1e-06,0,-2e-06,-1e-06,1e-06,6e-06,2e-06,-1e-06,2e-06,0,-1e-06,2e-06,-3e-06,0,-3e-06,0,-3e-06,1e-06,-1e-06,1e-06,3e-06,-4e-06,2e-06,5e-06,-3e-06,0
-7e-06,-2e-06,2e-06,1e-06,-2e-06,-3e-06,-3e-06,0,-2e-06,0,-2e-06,2e-06,2e-06,1e-06,-3e-06,7e-06,0,0,0,0,4e-06,1e-06,-2e-06,0,2e-06,0,0,1e-06,2e-06,-3e-06,5e-06,-1e-06,5e-06,-3e-06,0,5e-06,4e-06,4e-06,0,-3e-06,-3e-06,3e-06,3e-06,-1e-06,-1e-06,-1e-06,2e-06,3e-06,-1e-06,-5e-06,-1e-06,0,-3e-06,-1e-06,2e-06,-1e-06,-3e-06,0,-2e-06,-3e-06,-2e-06,0,-3e-06,2e-06,0,3e-06,-4e-06,-1e-06,6e-06,0,-2e-06,1e-06,2e-06,0,-1e-06,1e-06,-1e-06,4e-06,-2e-06,-3e-06,0,0,-1e-06,-1e-06,-2e-06,0,0,1e-06,4e-06,0,-3e-06,-2e-06,-1e-06,-4e-06,-1e-06,2e-06,0,1e-06,-1e-06,0,-1e-06,3e-06,1e-06,-1e-06,-2e-06,-1e-06,-1e-06,-3e-06,0,0,1e-06,2e-06,0,0,0,2e-06,0,1e-06,-2e-06,-2e-06,0
8e-06,-1e-06,-1e-06,2e-06,2e-06,0,2e-06,0,-4e-06,-1e-06,2e-06,0,2e-06,3e-06,-1e-06,-1e-06,5e-06,-2e-06,0,-1e-06,-2e-06,-1e-06,1e-06,2e-06,1e-06,1e-06,0,3e-06,0,3e-06,1e-06,1e-06,3e-06,-3e-06,-1e-06,-3e-06,-4e-06,-3e-06,-1e-06,4e-06,-1e-06,-4e-06,1e-06,2e-06,0,-4e-06,-3e-06,0,0,3e-06,1e-06,4e-06,-5e-06,0,0,3e-06,1e-06,-1e-06,4e-06,5e-06,-1e-06,0,4e-06,1e-06,-1e-06,0,0,2e-06,0,-1e-06,1e-06,0,-1e-06,0,-2e-06,1e-06,0,-1e-06,-1e-06,1e-06,1e-06,3e-06,4e-06,-1e-06,0,-1e-06,-1e-06,-3e-06,-4e-06,-2e-06,0,4e-06,1e-06,1e-06,-2e-06,-1e-06,-1e-06,2e-06,-1e-06,-3e-06,-4e-06,1e-06,1e-06,-1e-06,-1e-06,-1e-06,-1e-06,3e-06,-1e-06,2e-06,-1e-06,0,0,1e-06,0,-2e-06,0,-4e-06,0,-1e-06,0
1e-06,-4e-06,1e-06,1e-06,2e-06,1e-06,-1e-06,1e-06,-4e-06,6e-06,-1e-06,-2e-06,4e-06,1e-06,1e-06,1e-06,-2e-06,0,2e-06,4e-06,1e-06,0,0,-3e-06,2e-06,-1e-06,-1e-06,-2e-06,-1e-06,-3e-06,-5e-06,0,-1e-06,0,-2e-06,2e-06,1e-06,-5e-06,-1e-06,0,-2e-06,1e-06,1e-06,2e-06,0,-6e-06,0,0,1e-06,-1e-06,-1e-06,1e-06,2e-06,3e-06,0,-1e-06,2e-06,1e-06,1e-06,0,-1e-06,0,0,-1e-06,0,0,0,-1e-06,-7e-06,1e-06,-1e-06,-1e-06,-1e-06,0,1e-06,-2e-06,-1e-06,0,2e-06,1e-06,-1e-06,0,-2e-06,-1e-06,0,1e-06,2e-06,0,-8e-06,0,2e-06,0,-1e-06,-2e-06,-1e-06,1e-06,0,0,-1e-06,-2e-06,2e-06,0,-1e-06,-1e-06,4e-06,0,-1e-06,0,0,0,0,1e-06,0,-1e-06,-1e-06,-2e-06,-2e-06,4e-06,-1e-06,2e-06,2e-06
-6e-06,1e-06,-3e-06,-3e-06,-3e-06,3e-06,0,-1e-06,-1e-06,-3e-06,1e-06,1e-06,-1e-06,1e-06,3e-06,-3e-06,-3e-06,-2e-06,0,-2e-06,3e-06,0,-1e-06,0,1e-06,0,0,-3e-06,0,2e-06,1e-06,0,0,0,1e-06,-1e-06,1e-06,4e-06,-3e-06,0,-1e-06,-2e-06,-2e-06,-1e-06,-1e-06,-1e-06,1e-06,-4e-06,-2e-06,-2e-06,-2e-06,-2e-06,-1e-06,2e-06,-1e-06,1e-06,-3e-06,0,-1e-06,-1e-06,-1e-06,0,-4e-06,-1e-06,0,-1e-06,3e-06,0,0,1e-06,0,1e-06,1e-06,0,1e-06,1e-06,0,0,0,-1e-06,-1e-06,-2e-06,-1e-06,0,0,-1e-06,-1e-06,0,1e-06,1e-06,0,-3e-06,1e-06,0,-1e-06,-1e-06,1e-06,-2e-06,-1e-06,1e-06,0,-1e-06,0,0,-2e-06,1e-06,2e-06,-2e-06,-1e-06,-2e-06,0,-2e-06,0,-2e-06,0,0,0,-1e-06,0,1e-06,0
3e-06,1e-06,0,0,-2e-06,2e-06,1e-06,0,-1e-06,2e-06,-1e-06,0,0,-1e-06,1e-06,-1e-06,4e-06,1e-06,1e-06,-3e-06,-4e-06,1e-06,1e-06,0,-2e-06,-1e-06,-2e-06,1e-06,-1e-06,-2e-06,1e-06,1e-06,-4e-06,0,2e-06,0,-3e-06,0,-3e-06,-2e-06,2e-06,1e-06,-2e-06,-1e-06,2e-06,2e-06,-2e-06,-3e-06,1e-06,0,0,-1e-06,2e-06,1e-06,1e-06,-1e-06,-1e-06,0,0,-1e-06,1e-06,-1e-06,-2e-06,-1e-06,0,0,1e-06,-1e-06,5e-06,-1e-06,1e-06,1e-06,-1e-06,1e-06,-2e-06,-1e-06,1e-06,-1e-06,-2e-06,-1e-06,0,-1e-06,0,0,0,0,-2e-06,1e-06,3e-06,1e-06,1e-06,3e-06,-1e-06,-1e-06,-1e-06,0,0,0,-1e-06,1e-06,1e-06,-1e-06,0,0,-3e-06,0,-1e-06,1e-06,0,-3e-06,0,1e-06,0,2e-06,0,2e-06,0,-2e-06,2e-06,-3e-06,0
3e-06,1e-06,0,0,3e-06,-1e-06,-1e-06,1e-06,-1e-06,-6e-06,0,-2e-06,-3e-06,-2e-06,0,3e-06,1e-06,0,-1e-06,2e-06,-2e-06,0,0,0,-3e-06,0,0,1e-06,-1e-06,1e-06,0,-1e-06,-1e-06,0,0,2e-06,3e-06,-5e-06,-1e-06,1e-06,0,4e-06,-2e-06,1e-06,-2e-06,-3e-06,2e-06,-2e-06,-1e-06,2e-06,-2e-06,0,1e-06,2e-06,0,2e-06,3e-06,0,-2e-06,-1e-06,-1e-06,0,3e-06,1e-06,0,1e-06,-1e-06,0,-1e-06,0,1e-06,-3e-06,0,0,1e-06,0,-1e-06,1e-06,-1e-06,0,0,-1e-06,0,0,0,0,2e-06,-1e-06,1e-06,0,-3e-06,-5e-06,0,-2e-06,0,0,-1e-06,-1e-06,0,1e-06,2e-06,0,0,0,1e-06,1e-06,-3e-06,1e-06,1e-06,0,0,0,0,0,0,1e-06,-1e-06,0,-3e-06,-3e-06,-1e-06
-5e-06,-4e-06,1e-06,1e-06,1e-06,-4e-06,1e-06,-1e-06,1e-06,1e-06,-1e-06,0,-1e-06,0,0,-1e-06,0,-2e-06,0,1e-06,2e-06,1e-06,0,-1e-06,1e-06,0,0,0,1e-06,1e-06,0,1e-06,3e-06,-2e-06,-1e-06,-2e-06,-2e-06,2e-06,0,0,2e-06,-4e-06,-2e-06,0,-2e-06,0,1e-06,0,0,2e-06,1e-06,2e-06,2e-06,0,0,-1e-06,0,-1e-06,1e-06,2e-06,0,0,-1e-06,1e-06,0,1e-06,-1e-06,0,-6e-06,0,-1e-06,3e-06,0,0,0,-1e-06,0,0,1e-06,1e-06,0,1e-06,-4e-06,0,1e-06,0,-1e-06,0,4e-06,0,1e-06,-1e-06,2e-06,0,-1e-06,1e-06,1e-06,-1e-06,-1e-06,1e-06,-2e-06,-1e-06,0,1e-06,0,-1e-06,1e-06,-2e-06,0,2e-06,0,-1e-06,0,0,1e-06,-1e-06,0,1e-06,0,0,0
1e-06,3e-06,0,1e-06,-3e-06,-2e-06,0,1e-06,2e-06,2e-06,1e-06,0,0,0,-1e-06,0,-1e-06,-1e-06,0,-3e-06,0,0,0,1e-06,-2e-06,1e-06,0,-2e-06,-1e-06,-1e-06,-1e-06,-2e-06,1e-06,5e-06,-1e-06,0,1e-06,1e-06,1e-06,1e-06,0,3e-06,0,-1e-06,3e-06,-1e-06,0,1e-06,1e-06,0,1e-06,1e-06,1e-06,-1e-06,0,0,-2e-06,1e-06,0,1e-06,0,0,-2e-06,-1e-06,0,-1e-06,0,-1e-06,3e-06,0,0,-1e-06,-1e-06,0,-1e-06,1e-06,0,-1e-06,0,-1e-06,0,1e-06,0,0,-2e-06,0,-1e-06,1e-06,1e-06,-1e-06,1e-06,4e-06,-1e-06,-1e-06,0,-1e-06,0,1e-06,-1e-06,0,-2e-06,-3e-06,0,-1e-06,-2e-06,0,1e-06,0,0,1e-06,0,1e-06,0,0,0,-1e-06,0,0,2e-06,1e-06,0
5e-06,-2e-06,-1e-06,-1e-06,-1e-06,1e-06,-1e-06,-1e-06,2e-06,-3e-06,-1e-06,-1e-06,1e-06,0,-2e-06,-1e-06,0,-2e-06,-1e-06,3e-06,-1e-06,-1e-06,0,0,0,1e-06,-1e-06,0,-1e-06,0,2e-06,0,1e-06,-2e-06,0,1e-06,0,-4e-06,1e-06,0,0,0,0,-1e-06,-3e-06,-6e-06,-1e-06,2e-06,-1e-06,-1e-06,-1e-06,-2e-06,-2e-06,-1e-06,0,-1e-06,1e-06,-1e-06,0,-1e-06,-1e-06,0,-1e-06,-1e-06,0,-1e-06,-1e-06,0,2e-06,0,0,-1e-06,1e-06,0,1e-06,1e-06,0,1e-06,0,0,0,0,-2e-06,1e-06,0,0,1e-06,1e-06,-4e-06,0,0,-3e-06,0,-1e-06,0,1e-06,0,0,-1e-06,-2e-06,2e-06,-2e-06,0,-1e-06,0,-1e-06,-1e-06,2e-06,1e-06,-1e-06,0,-2e-06,0,-1e-06,0,0,-1e-06,0,-2e-06,2e-06,0
-4e-06,2e-06,1e-06,-1e-06,2e-06,2e-06,0,0,2e-06,1e-06,1e-06,1e-06,2e-06,1e-06,-2e-06,3e-06,3e-06,-1e-06,1e-06,-1e-06,1e-06,0,0,0,-1e-06,0,-1e-06,1e-06,1e-06,-1e-06,-1e-06,0,0,0,1e-06,-1e-06,-1e-06,1e-06,1e-06,-1e-06,-1e-06,0,1e-06,0,0,2e-06,-1e-06,1e-06,1e-06,-1e-06,1e-06,-1e-06,-1e-06,-2e-06,1e-06,1e-06,1e-06,0,2e-06,-1e-06,0,0,2e-06,0,0,0,1e-06,0,-1e-06,0,0,2e-06,0,0,0,-2e-06,1e-06,-1e-06,0,1e-06,0,-1e-06,-2e-06,0,0,0,-1e-06,-1e-06,-3e-06,0,-1e-06,4e-06,0,0,0,-1e-06,1e-06,-1e-06,-1e-06,-1e-06,1e-06,-1e-06,0,-1e-06,-1e-06,0,0,-1e-06,0,-2e-06,0,0,0,1e-06,-1e-06,1e-06,0,1e-06,1e-06,1e-06,0
-2e-06,-3e-06,-1e-06,0,0,2e-06,1e-06,1e-06,1e-06,-3e-06,0,1e-06,1e-06,0,0,2e-06,-1e-06,1e-06,0,-2e-06,0,0,0,-1e-06,-2e-06,0,0,0,-1e-06,1e-06,-1e-06,0,-3e-06,-3e-06,1e-06,1e-06,1e-06,1e-06,1e-06,-1e-06,-1e-06,0,2e-06,1e-06,1e-06,3e-06,1e-06,-2e-06,0,2e-06,0,0,0,-2e-06,0,0,-1e-06,0,-1e-06,1e-06,0,0,-1e-06,1e-06,0,1e-06,0,1e-06,-4e-06,0,0,-3e-06,0,0,-1e-06,0,0,1e-06,0,0,0,-1e-06,2e-06,0,-1e-06,0,-1e-06,0,-1e-06,0,0,0,0,-2e-06,1e-06,1e-06,0,0,-1e-06,0,-1e-06,-1e-06,0,-1e-06,1e-06,0,0,0,-1e-06,0,0,2e-06,0,-1e-06,0,0,0,-1e-06,0,-1e-06,0
5e-06,1e-06,2e-06,2e-06,-1e-06,0,-1e-06,-1e-06,1e-06,4e-06,-1e-06,-1e-06,0,0,1e-06,-3e-06,-1e-06,-1e-06,1e-06,2e-06,-1e-06,0,0,1e-06,0,0,0,-2e-06,0,-2e-06,0,1e-06,0,0,0,-2e-06,0,-3e-06,1e-06,0,-1e-06,-2e-06,2e-06,0,0,-1e-06,0,-1e-06,0,-2e-06,-1e-06,1e-06,0,-1e-06,0,0,0,-1e-06,-1e-06,1e-06,1e-06,0,-1e-06,1e-06,0,0,0,0,0,0,1e-06,2e-06,1e-06,0,1e-06,-1e-06,0,-1e-06,-1e-06,-1e-06,0,-1e-06,-2e-06,0,1e-06,0,1e-06,0,-1e-06,0,1e-06,-4e-06,0,1e-06,0,0,0,0,-1e-06,0,0,-1e-06,0,1e-06,-1e-06,0,1e-06,2e-06,2e-06,1e-06,0,-2e-06,0,0,0,-1e-06,0,1e-06,-1e-06,0,0
-1e-06,0,0,0,-1e-06,-1e-06,0,0,0,-2e-06,2e-06,-1e-06,-1e-06,0,2e-06,-2e-06,1e-06,1e-06,1e-06,1e-06,0,0,0,0,1e-06,0,-1e-06,1e-06,1e-06,2e-06,0,0,1e-06,1e-06,-1e-06,1e-06,-1e-06,0,0,0,-1e-06,2e-06,1e-06,0,-2e-06,2e-06,1e-06,-3e-06,0,-1e-06,0,1e-06,0,0,0,0,1e-06,1e-06,1e-06,1e-06,-1e-06,0,2e-06,0,0,0,0,0,4e-06,0,0,-1e-06,-1e-06,0,0,0,0,0,-1e-06,0,0,1e-06,0,0,0,0,0,0,3e-06,0,0,3e-06,0,-2e-06,1e-06,1e-06,0,0,-1e-06,1e-06,-1e-06,0,0,1e-06,-1e-06,0,0,0,0,0,0,0,0,0,0,-1e-06,0,-1e-06,2e-06,1e-06,0
-4e-06,1e-06,-1e-06,-1e-06,1e-06,-3e-06,0,0,-1e-06,0,-1e-06,1e-06,-1e-06,0,0,0,0,1e-06,0,-2e-06,0,1e-06,0,0,1e-06,0,0,1e-06,-1e-06,-3e-06,0,0,1e-06,1e-06,1e-06,-1e-06,1e-06,2e-06,0,0,0,-1e-06,0,0,3e-06,-2e-06,0,-2e-06,0,0,-1e-06,-2e-06,0,0,0,1e-06,0,0,-1e-06,-2e-06,1e-06,0,1e-06,-1e-06,0,-1e-06,-1e-06,0,1e-06,0,-1e-06,0,1e-06,0,-1e-06,-1e-06,0,1e-06,1e-06,0,0,1e-06,1e-06,0,0,0,-1e-06,0,4e-06,1e-06,0,-4e-06,1e-06,0,1e-06,0,0,1e-06,-1e-06,1e-06,0,1e-06,0,1e-06,1e-06,0,-1e-06,-2e-06,-1e-06,-1e-06,0,1e-06,0,0,0,1e-06,-1e-06,-1e-06,-2e-06,1e-06,0
3e-06,-2e-06,0,-1e-06,1e-06,-1e-06,0,0,-1e-06,1e-06,-1e-06,0,0,0,0,2e-06,0,0,0,2e-06,-1e-06,0,0,0,0,0,0,0,0,3e-06,-1e-06,0,1e-06,-3e-06,0,0,0,-3e-06,0,-1e-06,0,0,-1e-06,1e-06,-2e-06,-1e-06,0,0,0,2e-06,0,-1e-06,1e-06,1e-06,0,0,-1e-06,0,0,-1e-06,-1e-06,0,-2e-06,-1e-06,0,0,0,0,-4e-06,0,0,0,0,0,1e-06,0,0,-1e-06,1e-06,-1e-06,0,0,1e-06,0,1e-06,0,1e-06,0,-1e-06,0,-1e-06,0,-1e-06,-1e-06,1e-06,1e-06,0,0,-1e-06,0,1e-06,1e-06,0,0,0,0,0,1e-06,1e-06,-1e-06,0,-1e-06,0,0,0,1e-06,0,1e-06,0,1e-06,0
1e-06,2e-06,-1e-06,1e-06,0,1e-06,0,1e-06,-1e-06,-2e-06,1e-06,0,0,0,-1e-06,0,0,-1e-06,-1e-06,0,0,0,0,0,1e-06,0,0,-1e-06,0,-3e-06,0,0,-1e-06,2e-06,-1e-06,1e-06,-1e-06,-2e-06,-1e-06,0,1e-06,1e-06,-1e-06,0,0,2e-06,0,0,0,-1e-06,1e-06,1e-06,-1e-06,2e-06,0,0,0,1e-06,1e-06,0,1e-06,0,0,0,0,0,0,0,-1e-06,0,0,-1e-06,-1e-06,0,0,0,0,2e-06,0,0,0,0,-1e-06,0,-1e-06,0,1e-06,0,-3e-06,0,0,4e-06,0,-1e-06,1e-06,-1e-06,0,0,-1e-06,-1e-06,1e-06,1e-06,0,-1e-06,-1e-06,-1e-06,0,1e-06,0,0,0,0,0,0,0,0,0,0,1e-06,0,0
