0.000173,0.000102,-1.1e-05,0.000362,0.000125,0.000388,8e-05,0.001626,-6.1e-05,-1.6e-05,0.000356,0.001796,0.002157,0.000935,0.003448,0.010099,0.006987,0.002325,0.002253,0.001309,0.00079,0.007769,0.004495,0.005047,0.002707,0.006396,0.002892,0.004155,0.011837,0.003487,0.005055,0.007791,0.007714,0.006251,0.005206,0.001849,0.000974,0.002951,0.002548,0.00041,0.003958,0.002316,-0.00302,-0.001976,-0.000167,-0.002296,-0.002809,-0.001499,-0.00174,-0.000642,0.002263,0.006142,0.003549,0.002854,0.001208,0.003334,0.004879,0.003529,0.0031,0.00274,0.001356,-0.002055,-0.001438,0.000992,-0.000631,-0.001749,-0.000929,-0.000797,0.00149,0.00211,0.001818,0.002081,0.005207,0.00074,0.001789,0.008264,0.005649,0.00337,0.000111,0.003506,0.001911,0.004457,0.003789,0.004129,0.002681,0.004407,0.003261,0.002835,0.005568,0.009063,0.005299,0.002098,0.002001,0.000616,0.002115,0.001305,0.000852,0.000609,0.001225,0.005764,0.0054,0.002714,0.004137,0.002916,0.002343,0.001516,0.00024,0.001094,0.003376,0.002237,0.004982,0.003571,0.002071,0.001226,0.001198,0.000777,-0.000564,0.001122,0.001188,0.000848,0.000647
-0.000151,2.7e-05,-3.4e-05,8.2e-05,0.000158,3.1e-05,-0.000214,0.000502,0.001005,0.000831,0.000499,0.001006,0.000124,-9e-06,0.000488,0.003902,0.001518,0.00093,0.002146,0.00288,-0.002393,0.000887,-0.001982,-0.002085,-0.000528,-0.00168,-0.006793,-0.004042,0.003343,0.002387,-0.006829,-0.007624,0.004679,0.003224,-0.000336,-0.001002,-0.002262,0.001412,0.001463,0.000149,0.000921,0.000493,-0.000611,0.0019,-0.001078,-0.001114,-0.002349,-0.000538,-0.001386,0.001161,-0.000162,0.001741,0.002693,0.004512,0.000291,0.000622,-0.001988,6.1e-05,0.002171,0.002255,-0.00022,0.000452,-0.000241,-0.000967,0.000596,-0.000552,0.000583,0.000205,0.000295,0.001104,-0.000413,-0.003072,-0.000194,-0.000352,0.001449,0.000976,0.001468,0.000499,-0.001073,-0.003228,-0.001414,-0.000741,-0.003669,-7.1e-05,0.002186,0.003898,0.000957,0.000733,0.000402,0.001821,0.001988,-0.000609,-2e-04,0.001157,0.00105,0.001381,-0.000893,0.000138,-0.000824,0.001107,0.001912,0.001453,0.001912,0.001387,-0.001336,-0.000976,0.000812,0.000914,-0.001347,0.000215,0.00085,0.001322,0.001069,0.000353,0.000679,-0.000781,0.000469,-0.00146,-0.000921,-0.001124,0.000125
-0.000201,-8.3e-05,-7.7e-05,-0.000174,0.000225,-0.000368,-5.4e-05,0.000313,0.000143,0.000329,-0.000834,-0.000408,-0.001404,-0.001049,-0.000789,-0.001428,-0.001752,-0.000691,-0.00189,-0.003033,-0.002507,-0.005407,-0.001877,0.000226,-0.000757,0.000231,0.001674,0.004645,0.001795,0.002643,0.001268,0.00119,0.002506,-0.002684,-0.002332,-0.000827,-0.004123,-0.002359,0.003327,0.000384,-0.00492,-0.004738,-0.002272,-0.002121,-0.001414,-0.001654,-0.002174,-0.001919,-6.9e-05,-0.00017,-0.001933,-0.001544,-0.005515,-0.001296,-0.00065,-0.002689,-0.003625,-0.003879,-0.004294,-0.000275,0.000705,-0.000795,-0.000438,-0.002455,-0.002637,0.001437,0.002626,-0.000276,-0.000519,-0.001477,-0.001942,-0.00537,-0.002471,0.00095,-0.000142,-0.000779,-0.003535,-0.002502,-0.001417,-0.004818,-0.002992,-0.000871,0.000144,-0.000518,0.000693,-0.003715,-0.00179,-0.002829,-0.000417,-0.00116,-0.00121,-1.8e-05,0.00064,-0.001722,-0.001598,-0.00012,0.001954,0.000845,0.000378,-0.001501,0.000695,-5.5e-05,-0.00176,-0.000413,-0.000807,0.000139,-0.000227,-0.000385,-0.002199,-0.000469,0.000355,-3.6e-05,-0.000507,-9.1e-05,-0.001081,-0.000419,-3e-04,0.000426,-0.000586,-0.000724,-0.000527
-4.8e-05,-3.3e-05,0.000152,-0.000222,0.000109,-0.000361,2.3e-05,-0.000353,-0.000648,-0.000159,-0.001052,-0.000805,-0.000738,-0.000387,-1.6e-05,-0.002244,-0.002554,0.000873,0.00026,0.000565,0.00183,-0.003628,-0.000301,-0.004561,-0.000198,-0.000101,0.001714,0.002886,-0.003793,-0.005152,-0.000254,-0.000714,-0.001125,-0.002303,0.000132,-0.003248,-0.002545,-0.002917,0.000206,-0.001417,-0.000214,-0.002615,0.001805,0.001549,0.001465,0.001222,0.001329,-2.7e-05,-0.000201,0.001354,-0.000848,0.000423,-0.002927,-0.00271,-0.000678,-0.00078,-0.00382,-0.003104,0.000727,0.001869,-0.002245,0.000302,-0.000782,-0.000704,0.00142,-0.000215,-0.000635,-0.000719,-0.001386,-0.002253,-5e-04,-0.003447,-0.004504,-0.000636,-0.000986,0.000242,-0.001382,0.001574,-0.000831,-0.000446,-0.001293,0.001193,-0.000188,0.001661,0.001632,-0.00043,0.000675,-0.002575,0.000159,-0.004169,-0.005346,-0.001375,0.000472,-0.000392,-0.000839,-0.001835,-0.00021,0.000401,-0.000242,-0.002376,-0.002376,-0.001273,-0.002361,-0.002502,0.000781,0.000494,0.000136,0.001637,9.8e-05,-0.000958,-0.001785,-0.001885,-0.001464,-0.000366,-0.000455,-0.000504,-0.000588,0.000374,-0.000736,4.8e-05,9e-05
0.000127,0.000101,-4.4e-05,4e-06,-2.3e-05,1e-05,3.2e-05,-0.000341,-0.00065,0.00027,-2.7e-05,-0.000227,-0.000341,0.000597,-0.000847,-0.001778,-0.00292,2.9e-05,0.00036,-0.001341,-0.003274,-0.002963,0.000368,-0.001503,0.001286,-0.002288,-0.004664,-0.003509,-0.004798,-0.000592,0.002588,0.000846,-0.001175,-0.002465,-0.000188,0.001825,0.003025,0.00039,0.001629,0.001486,0.001868,-0.000662,-0.002569,-0.002117,0.000117,0.002096,0.001593,-0.000283,-0.000246,-0.001205,-0.000136,0.002236,-0.003243,-0.001085,-0.000453,-0.000915,-0.002904,-0.003712,-0.00431,-0.000578,-0.00105,-0.001417,0.000292,0.001359,-0.001871,-0.002389,7.1e-05,0.002341,0.002253,-0.00013,0.000913,0.001429,-0.002757,-0.001126,-0.001135,0.001591,-0.001465,-0.000529,4.4e-05,0.000818,0.00088,0.000774,-0.001184,-0.001362,-0.000739,-0.001358,-0.002452,-0.000534,0.001417,-0.000369,-0.001987,-0.000814,0.00049,-0.001639,-0.001594,-0.00131,-0.001577,-0.000578,0.000103,-0.002084,-0.001892,-0.002834,-0.001479,-0.001916,-0.001864,-0.000673,-0.000861,-8.5e-05,-0.000355,0.000154,-0.001681,-0.002195,-0.001929,-0.000742,-0.000371,-0.000529,-0.000303,-0.000643,-0.000634,0.000446,0.000271
5.1e-05,0.000123,1e-06,-6.8e-05,-8e-06,-8.2e-05,-0.00027,-7.8e-05,-0.00024,-0.000231,-5.8e-05,0.000103,-0.000154,0.000346,-0.000685,0.000889,-0.000995,4.9e-05,-0.000755,-0.001688,0.000634,0.001271,0.002275,0.001595,0.001411,-0.002298,-0.002005,0.000845,-0.001603,-0.004733,-0.00071,0.001207,0.001125,-0.002253,-0.001156,0.002355,-0.000254,-0.002353,-0.001311,-0.001159,0.003653,0.001267,-0.00272,-0.000886,0.000984,0.000626,-0.000372,-0.000887,-0.000123,-0.00031,-0.001993,-0.000985,-0.001361,-1.5e-05,-0.002556,-0.002036,0.00165,0.000668,-0.003392,-0.001059,-0.00054,-0.001,0.000509,-0.000479,-0.002279,0.000299,0.001247,-0.00068,-0.000428,0.001082,0.001365,0.000297,0.001205,0.001013,0.000475,0.000611,-0.001379,-8.8e-05,0.001452,-0.000332,0.001226,-0.000279,-0.001702,-0.001011,-0.001265,6e-05,-0.00215,2.4e-05,-0.001152,-0.000182,-0.000997,-0.001404,-0.000241,-0.000359,0.001101,-0.000262,-0.000623,-0.000675,-0.000696,0.000328,-0.003316,-0.002946,-0.00089,-0.002111,-0.001852,-0.001362,-0.000935,0.001106,0.000417,0.001649,1.2e-05,-0.001636,-0.000988,-0.000584,-0.000227,0.00027,-0.000535,0.00011,0.000666,-7.2e-05,0.000428
2.4e-05,0,2.1e-05,3.4e-05,-1.1e-05,-0.00011,6.1e-05,0.000117,-9.6e-05,0.000353,-0.000272,0.000309,0.000199,0.000738,0.000512,8e-05,-0.000596,0.000801,-0.000466,-0.002099,0.000224,0.000285,0.000815,6.9e-05,-0.000893,-0.001263,-0.001024,0.002433,0.001855,-0.003264,-0.000724,-0.005532,-0.006036,-0.005287,-0.003493,0.002129,0.000617,0.003041,-0.002272,-0.003964,-0.000961,0.001033,-0.000466,0.000215,-0.000557,-4.5e-05,0.000704,0.000559,1.3e-05,0.000987,-0.000816,-0.001251,0.001926,0.003168,-0.000512,0.000439,0.00101,0.002271,-0.000591,-0.000559,-0.00116,0.000919,-0.001078,-0.001636,-0.000262,-0.001796,-0.000867,0.000674,-0.000102,-0.000223,0.001102,0.000696,0.001572,0.001149,0.000478,-0.000323,-0.001776,-0.000316,0.000689,0.000205,0.000865,-0.000305,-0.001637,-0.001717,-0.001589,-0.000719,-0.002178,-0.000912,-0.000975,-0.000277,9e-05,-0.000425,-6.7e-05,-0.000658,0.000837,-0.000106,-0.000531,-0.000376,0.000153,-0.000222,-0.001004,-0.000412,-0.001954,-0.001653,-0.001829,5.3e-05,-0.000266,-0.000109,-0.00101,0.000136,-0.00084,-0.001172,-0.000902,5.5e-05,-0.000597,0.000239,0.000248,-0.000389,-7e-05,-0.00056,-0.000111
-2.9e-05,-5.2e-05,-1.5e-05,-8.1e-05,-0.000108,-3.8e-05,0.00015,0.000129,-0.000109,7e-06,-8.2e-05,0.000665,0.000242,-0.00109,0.000499,-0.000164,-0.000349,-0.001564,-0.000242,0.000457,0.001782,-0.000954,-0.001005,-0.002759,-0.001804,0.000498,0.000689,-0.001441,-0.002629,-0.002895,-0.000129,0.001149,-0.000414,-0.001272,-0.003103,-0.000241,-0.000922,0.00064,-0.001038,-0.001618,0.000271,-0.000478,0.000722,0.001406,-0.000183,-0.000514,-0.002342,-0.000528,7.1e-05,-0.000692,0.000303,-0.000967,0.000114,0.001307,-3.7e-05,-0.000541,0.00046,0.001582,0.00096,0.00015,-0.001088,-0.000355,0.000319,2.7e-05,0.000334,-0.000276,-0.000202,-0.001424,-0.000566,-0.000943,0.000584,-0.001483,0.000478,-0.001944,-0.001234,-0.001339,-0.000491,0.001837,-0.000607,-0.000988,-7.8e-05,-0.001069,-0.000201,-0.001158,-0.000952,-0.001468,-5.6e-05,0.000195,-0.001898,-0.001261,0.000567,0.000922,0.000455,-0.000281,0.000848,0.00021,-0.000506,-0.000525,-0.000284,-0.000349,0.000922,0.00017,-0.000236,-0.000456,-0.000686,0.001316,-0.000213,-0.000369,-9.9e-05,0.000409,-0.000544,-0.000278,6.1e-05,1.8e-05,-0.000172,0.000812,0.000659,0.000227,-0.000514,-0.000377,-0.000392
-2.4e-05,-3.4e-05,4.8e-05,-5e-06,-4.9e-05,3e-05,0.000208,-0.00011,3.3e-05,-1e-05,-0.000247,0.000387,-0.000108,-0.000739,0.000216,0.000379,-0.000389,-0.001,-0.000837,0.000585,0.000442,0.000247,-0.001011,-0.001276,-0.002454,0.000785,-0.000738,-0.001442,-0.000779,0.000908,-0.001221,0.001836,0.000254,-0.00076,-0.001311,-0.001719,-0.001462,-0.000884,-0.000566,3.2e-05,0.000828,-0.001574,0.000269,0.001146,-0.001222,0.000424,0.002032,-7.4e-05,0.000232,-0.000267,0.000453,-0.000403,-0.001,0.000947,-7.8e-05,-0.001365,-0.000837,0.000868,0.001073,-0.000146,-0.000407,-9.4e-05,0.000264,-0.000732,0.000133,-0.001136,0.000273,0.000791,-0.000435,-0.001701,-0.000695,-0.000379,-0.000684,-0.001605,0.000363,-0.00083,-0.001292,0.001004,0.000314,-0.001074,0.000412,-3.4e-05,-6.4e-05,-0.000344,0.000321,-0.00102,-0.000108,0.000928,0.000748,-0.000147,-0.000316,0.00048,-0.00015,0.000575,0.000474,0.000358,-0.00052,-4.3e-05,-1.5e-05,-0.000186,0.000728,0.000538,-0.000124,0.000628,0.000202,0.000168,-0.000526,-5e-06,-0.000596,0.000208,0.000276,5.3e-05,0.000427,0.000361,-6.5e-05,1.6e-05,-0.000121,0,0.000364,-0.000302,-0.000234
3.3e-05,8e-06,-3.9e-05,2.7e-05,-0.000121,-6.2e-05,7.8e-05,2.2e-05,-4.8e-05,1e-05,0.000124,-0.000178,3.3e-05,-0.000195,-0.000185,0.000214,0.000189,0.000125,-0.000332,-0.000513,-0.000289,0.000444,-0.001474,0.000383,-0.00173,-0.001509,0.000572,-0.000226,0.000573,0.001601,-0.001645,-8e-06,-0.000486,0.000631,-0.001252,-0.000677,-8e-05,-0.000652,-0.000963,-0.000922,-0.001313,-0.000197,0.001105,-0.000229,-0.000199,0.000224,0.000629,-7e-05,0.000519,0.000238,-0.000702,-0.000343,9.3e-05,-0.000211,0.000178,0.000551,0.001158,-0.00029,0.001009,-0.000492,-0.00071,0.000229,0.001074,0.000413,-0.000163,0.001052,-0.001001,-0.00031,6.8e-05,0.000161,-0.001348,-7.8e-05,-0.000458,-0.000921,0.00012,-0.001653,-0.000357,-0.000888,-0.000535,0.000399,0.000187,0.000267,-0.000207,0.00073,-0.000869,-0.000775,0.000366,0.001191,0.00131,0.00055,-5.1e-05,0.000895,-0.000464,0.000123,0.000143,-3e-04,-4.2e-05,-0.000495,-0.000896,0.000251,0.000535,0.000621,0.000876,0.000622,0.000407,0.000431,0.000333,-0.000236,-0.000158,-0.000454,0.000309,3.6e-05,0.000148,0.00055,0.000207,-7.7e-05,-3.3e-05,0.000186,0.000129,-5.2e-05,2.9e-05
-8e-06,1.8e-05,-5.4e-05,-2.8e-05,-1.1e-05,1.8e-05,-7.6e-05,3.7e-05,7.1e-05,-0.000213,-0.000387,-4.5e-05,-0.000314,-9.1e-05,6e-05,-5.4e-05,-0.000193,0.000224,-0.000132,-0.000552,4e-06,-0.000923,0.000307,0.000737,0.00088,-0.001225,0.000399,-0.00087,-0.000405,-0.000466,-0.001553,-0.000758,4.1e-05,0.001767,-0.000358,0.000672,0.000544,0.000402,0.001187,-0.000474,-3.3e-05,0.000477,-0.001295,-0.000326,-0.000694,-0.000368,-0.000316,0.000462,0.000651,-0.000366,-0.000159,-0.000276,0.000711,-0.001043,6.3e-05,0.000561,0.000463,-0.000691,-0.000351,-0.000159,0.000195,0.000128,-0.000424,-0.000125,-0.000709,-0.000457,-3.3e-05,-0.000565,-0.000457,-0.000441,-0.000349,-0.00021,0.000227,-0.000517,-0.001403,7.7e-05,-0.000537,-0.001787,0.000251,-3e-06,8.2e-05,0.001066,0.000158,0.000476,-0.000454,-0.000527,-0.000364,0.000204,0.000833,0.000459,6.2e-05,3.2e-05,-0.000654,-0.000293,-1.5e-05,-6.9e-05,0.000391,-5.3e-05,-0.000587,-0.000221,0.000261,9e-05,0.000777,-0.000433,0.000425,0.000858,0.000665,-0.000443,-0.000266,-0.000478,-0.000296,-0.000221,0.000452,0.000461,0.000176,-0.000184,-0.00013,0.000398,-6e-06,0.000478,0.000118
-3e-05,-3.5e-05,-3.4e-05,-3.1e-05,5e-05,8e-05,1.5e-05,-1e-04,-0.000111,-0.000192,0.000194,0.00012,-7.5e-05,0.000103,3e-05,-0.000414,-0.000249,0.000106,-0.000655,-9.8e-05,4e-06,-0.00061,0.000119,0.000753,0.000477,0.000323,0.000188,-6.6e-05,-0.001227,-0.00043,-0.001513,-0.001075,-0.000622,-0.000777,0.00051,-0.000822,0.000622,0.000376,0.000274,-0.000327,-0.001155,-0.000581,0.000159,0.000538,-0.000708,0.00031,-4.2e-05,-0.000429,-0.000677,0.00035,0.000169,-8.5e-05,0.000866,-0.000493,-0.000383,0.000772,-0.000315,-0.000186,-0.000927,-0.000306,0.000219,0.000146,0.000502,2.8e-05,0.000378,0.00025,-0.000937,9.7e-05,0.000374,-1.6e-05,-0.000143,0.000461,0.000543,0.000519,-0.000646,-0.000145,-0.000115,-0.000818,-0.000374,3e-05,0.000378,0.000194,-0.000291,5.5e-05,-0.000203,-0.000428,-0.000718,0.000409,0.000316,0.000143,0.000307,-0.000635,-0.000386,-0.000391,0.000104,-0.000281,0.000517,0.000134,-0.000197,-2.3e-05,-0.000814,0.000379,5e-06,0.000324,0.000452,-0.000173,-1.7e-05,-8.1e-05,-3.5e-05,-0.000108,-0.000347,-0.000124,0.000139,0.00019,0.000154,-3.2e-05,-0.000192,-8.6e-05,-0.00017,3.6e-05,-5.8e-05
-1.5e-05,9e-06,1.4e-05,8e-06,4.6e-05,1e-05,-1.3e-05,-8.2e-05,-1e-05,4.8e-05,3.4e-05,-3.6e-05,1.6e-05,0.000207,0.000382,5.3e-05,-0.000113,9e-06,-0.000825,-0.000214,-0.000513,-6.1e-05,7.7e-05,-9.6e-05,0.000113,0.000311,-0.000215,-0.000223,0.000411,-0.000654,-0.000412,0.000187,-0.00011,-0.00117,0.000545,-0.001998,0.000231,0.000291,0.000392,1.3e-05,-0.000802,-0.000404,-0.000747,-0.000232,0.000565,-0.000472,0.000282,0.000139,-0.00015,0.000245,-0.000387,0.000551,0.000154,-0.000436,-0.000968,0.000312,0.000278,-1.4e-05,-0.000574,0.000288,0.000566,-5e-06,-1.7e-05,-0.000105,4.3e-05,-0.000115,0.00052,0.000153,-0.000589,-0.000179,-0.000346,0.000354,2.8e-05,0.000237,9.6e-05,-0.000501,3.3e-05,-4.9e-05,0.000651,-0.000114,-0.000151,-0.001016,-0.000103,-0.000381,0.000856,2e-06,-2.5e-05,-4.5e-05,-2e-04,-0.000173,4.3e-05,-0.000325,-0.00012,8e-06,-0.000448,-6e-05,1.2e-05,-3.1e-05,0.000222,6.9e-05,8.1e-05,-0.000277,0.000246,-4.7e-05,9.5e-05,0.000277,-0.000381,-6e-05,-0.000176,-0.00015,-0.000724,9.2e-05,3.8e-05,-1.9e-05,3.1e-05,-5.5e-05,-6.9e-05,-0.000143,8.7e-05,-0.00011,-3e-05
-2.3e-05,-8e-06,3.2e-05,5e-06,1.9e-05,-3e-06,-6e-06,-3.9e-05,5e-06,0,5.9e-05,-1.1e-05,-5.4e-05,0.000125,0.000501,0.000167,-0.000163,-0.000148,-0.000293,0.000307,-0.000683,0.000409,-0.000342,0.000281,0.000202,0.000719,-7.7e-05,0.000257,0.000494,0,0.000767,-0.001062,5.6e-05,2.6e-05,0.000663,-0.000704,9.3e-05,-0.000207,-0.000508,0.000389,-0.000341,0.000357,0.000694,-0.000413,0.000572,-7.4e-05,-0.000345,-0.000277,7.7e-05,-2.9e-05,3e-05,-0.000112,-0.000219,-0.000315,-0.00029,-0.000128,4.3e-05,0.000267,-8.8e-05,0.00045,-0.000467,-0.000344,-0.000396,0.000239,0.000145,0.000155,-0.000141,-0.000449,0.000164,-5.8e-05,-0.000331,0.000178,-4e-04,0.000341,0.000513,8.1e-05,-8.3e-05,0.000116,0.000546,-0.000122,-0.000128,-0.000782,-0.000198,-0.000159,-0.00036,0.000182,0.000129,0.00028,-0.000557,-0.000216,-5.8e-05,-6.7e-05,-0.000135,0.000347,-0.000323,-0.000238,-0.000344,-2.2e-05,-0.000302,0.000106,0.000453,6.2e-05,0.000129,3e-04,-0.000127,-0.000186,-0.000341,-0.000101,-2.3e-05,-0.000204,-1.1e-05,-2e-06,0.000133,-9.7e-05,-0.000171,-0.000186,-3.1e-05,-9.6e-05,-3.9e-05,0.000136,7.6e-05
-8e-06,-6e-06,1.7e-05,1e-06,-4.2e-05,-5e-06,2e-06,1.6e-05,5e-06,2.2e-05,2.5e-05,-0.000128,-4.4e-05,0.000193,-8.5e-05,-8.5e-05,-6e-06,5.1e-05,-0.000163,-1.8e-05,-0.000214,-0.000346,0.000746,-0.000136,0.000382,0.000753,0.000327,0.000482,-0.000177,-0.000404,0.000418,2.1e-05,-0.000177,0.000133,0.000201,-0.000134,0.000251,-3e-06,-0.000361,-0.000116,-0.000242,-0.000145,1e-04,-4e-04,-9e-05,-0.000329,-0.000168,-0.00023,0.000217,0.000222,0.00024,-5.2e-05,7.1e-05,-0.000428,-0.000206,2.7e-05,-9e-06,-0.000446,0.000268,-9e-05,-8.7e-05,5e-05,6.2e-05,-8.7e-05,0.00013,3.4e-05,0.000299,0.000135,3.8e-05,0.000103,-0.000192,5.9e-05,0.000133,-3e-05,0.000181,0.000331,-3e-05,-4e-05,0.000453,-4.8e-05,-8.4e-05,0.000128,-6.9e-05,-2.9e-05,-5.6e-05,0.000417,0.000329,2.1e-05,-0.000178,1.6e-05,-4.6e-05,0.00015,0.000264,-0.000148,-4.3e-05,-9e-06,-0.000229,-0.000145,0.000239,0.000233,0.000241,1e-05,-0.000193,-6.6e-05,-0.00017,-0.000221,-6.2e-05,-2e-06,5.3e-05,-0.000221,0.000265,-0.000187,0.00015,8e-06,-0.000163,-0.000234,-5.9e-05,1.9e-05,-6.2e-05,-0.000131,-3.5e-05
2e-06,-6e-06,-1.2e-05,7e-06,7e-06,-3e-06,-1.8e-05,2.5e-05,6e-06,4e-05,5e-06,-1.6e-05,-7e-06,-9.7e-05,-3.4e-05,-9.8e-05,-6e-05,-0.000121,0,-5.7e-05,-0.000151,3.9e-05,-0.000199,-0.000214,2.8e-05,-0.000297,0.000389,0.000249,-0.000197,0.000451,0.000263,0.000405,-4.8e-05,-0.000188,-0.000184,5.3e-05,0.000171,-2.3e-05,-0.000142,5.7e-05,-0.000103,-2.4e-05,2e-04,0,-8.6e-05,-0.000212,-5.1e-05,0.000246,1.9e-05,-0.000124,-0.000185,-6e-06,0.00047,-0.000545,9e-05,-8.1e-05,-0.000197,-0.000228,0.000169,1.1e-05,0.000103,-2e-05,4.2e-05,-0.000103,-0.000334,-0.000271,1e-06,0.000177,-0.000253,-0.000121,-9e-05,-5.8e-05,0.000159,-3e-05,-2.5e-05,-0.000179,-0.000106,-0.000203,-0.000165,-2.9e-05,-0.000166,0.000132,-1.8e-05,2.5e-05,-0.000123,-0.000107,0.000116,0.00015,-0.000302,-6.2e-05,0.000108,0.000176,1e-06,1.1e-05,-1e-06,-0.000122,-0.000127,3.7e-05,0.000229,3.4e-05,-2e-05,0.00011,-0.000159,-0.000216,5.3e-05,-1e-04,4.3e-05,0.000225,-0.000155,7.7e-05,9.9e-05,-1.8e-05,0.00012,-4e-05,-4.6e-05,-3.3e-05,7e-06,1e-05,-5.8e-05,-0.000154,-4e-05
-5e-06,-4e-06,-9e-06,-5e-06,-1.2e-05,-5e-06,-5.2e-05,-1.8e-05,-3.9e-05,-2.8e-05,-2.7e-05,-8e-05,-1e-05,-0.000104,-0.000104,1.4e-05,-7.3e-05,-7.2e-05,0.000144,-1.2e-05,-0.000112,0.000128,-3e-05,-0.000196,-0.00038,-0.00032,0.000252,-4e-06,4.6e-05,0.000375,0.000195,3.9e-05,-0.00013,0.000207,-0.000367,-3e-05,-0.000177,0.00026,-8.7e-05,-0.000208,-4.8e-05,2.4e-05,-0.000155,-3e-06,-0.000167,-5e-06,0.000263,-1e-05,-0.000211,-4e-06,-3.3e-05,-0.000113,0.000114,-0.000113,2e-05,0.000145,-4.4e-05,0.000123,-7.5e-05,-8.8e-05,-2e-04,-3e-06,9.1e-05,-9e-06,2.3e-05,-4.4e-05,0.000177,-0.000128,1.4e-05,-8.4e-05,0.000242,5.7e-05,6.8e-05,-0.000186,2e-04,-0.000226,3.4e-05,-0.000282,-9.3e-05,-8.2e-05,-8.9e-05,-1.2e-05,-9.6e-05,0.000106,-1.9e-05,-0.000117,-0.000144,3.1e-05,7.5e-05,-1.4e-05,4.3e-05,-0.000151,0.000141,0.000111,-0.000135,-2.3e-05,0.000151,2e-06,-1e-05,1e-06,-8e-05,0.000117,0.000244,0.000105,0.000118,-0.000107,-7.8e-05,0.000228,2.1e-05,-9e-06,-0.000141,-1.9e-05,7.8e-05,-0.000125,-1.6e-05,-1.7e-05,-2e-05,8.3e-05,7.5e-05,1.8e-05,2.6e-05
5e-06,4e-06,-2e-06,4e-06,0,5e-06,-3.1e-05,-9e-06,1.9e-05,1.2e-05,-5e-06,2.6e-05,-1.1e-05,-7e-05,7.2e-05,2.9e-05,3e-06,3e-06,4.9e-05,-0.000147,-5.3e-05,0.000189,-0.00015,0.000122,-0.000129,9.8e-05,-0.000107,-2.1e-05,0.000294,7.8e-05,-0.000133,9e-06,0.00015,0.00019,-0.000203,0.000152,-5.3e-05,1e-06,0.000196,-0.000278,4e-04,-3.4e-05,-0.000188,2e-04,-0.000132,3.4e-05,-0.000288,-1.9e-05,-2.4e-05,5e-05,4.9e-05,-4.7e-05,-0.000217,0.000241,-2.7e-05,4.1e-05,3.3e-05,0.000116,-0.000331,-0.000222,-0.000164,-1.3e-05,-0.000137,2.4e-05,0.000154,0.000106,-5.4e-05,8.9e-05,0.000105,-7.4e-05,4.8e-05,2.9e-05,-0.000211,-0.000131,-0.000172,0,-0.000234,0.000166,-0.000153,6.7e-05,-9.2e-05,0.000158,-1.2e-05,0.000109,-6.1e-05,1.7e-05,-0.000162,-3.2e-05,0.000169,-2e-06,-3.3e-05,-0.000194,0.00013,-0.000109,-0.000114,1.1e-05,0.000134,-2.6e-05,4.8e-05,3.7e-05,-0.000216,2.3e-05,3.3e-05,-5.6e-05,0.000179,-0.000134,-0.000102,-4.9e-05,-7.4e-05,2.9e-05,-8.6e-05,4.5e-05,0.000112,-2.1e-05,-4.1e-05,4.8e-05,-1.9e-05,-2e-06,-1.3e-05,3.2e-05,8e-06
7e-06,-4e-06,3e-06,-3e-06,-9e-06,8e-06,0,1.2e-05,2e-06,2.5e-05,9e-06,8e-06,1.5e-05,-6.3e-05,1.5e-05,-2e-05,-4.7e-05,3e-05,-4e-05,0.000113,-0.000173,-5.3e-05,-2.8e-05,9.1e-05,-0.000205,0.000177,-1e-05,-0.000115,-0.000101,-0.000579,-0.000322,-2.6e-05,-0.000294,-0.00031,-7.8e-05,0.000466,-5e-06,-0.000135,0.000137,-0.000189,-0.000101,6.7e-05,2.1e-05,-0.000181,-0.000275,0.000133,-4.1e-05,0.000112,-2.6e-05,-2.4e-05,-0.000143,2.2e-05,2.7e-05,0.000132,-0.000249,0.000153,4.2e-05,4.6e-05,-0.000164,9.9e-05,9e-05,-0.000136,0.000108,-4.5e-05,-4.5e-05,0.00012,-3.2e-05,-2.4e-05,-8.3e-05,6.3e-05,6.7e-05,-5.5e-05,-6.5e-05,-0.000141,-3.8e-05,-7.7e-05,4.4e-05,0.00033,-5.1e-05,5.1e-05,-6.9e-05,3.2e-05,-2.1e-05,-7e-06,0.00012,2e-06,-8.8e-05,-4.4e-05,1.9e-05,3.8e-05,-2.7e-05,-4.6e-05,2.7e-05,-2.7e-05,1.9e-05,-6.2e-05,7.4e-05,4.1e-05,-2.7e-05,6.5e-05,5.8e-05,-0.000132,-7.4e-05,4.2e-05,0.00011,-6.7e-05,-1.7e-05,-6.3e-05,-3.6e-05,2.9e-05,3.4e-05,-2.7e-05,9e-06,-8.3e-05,7e-06,1e-06,4.5e-05,1.8e-05,-2.6e-05,1.8e-05,7e-06
0,1e-06,4e-06,-2e-06,1e-06,-5e-06,3e-06,8e-06,4e-06,-3e-06,-2.5e-05,-5.4e-05,-1.2e-05,-3e-05,-1.6e-05,-5.2e-05,-4.2e-05,5e-05,-4.7e-05,3.2e-05,4.3e-05,-0.000104,-3e-06,8.1e-05,0.000103,0.000146,-3e-06,-5.3e-05,-0.000251,-0.000138,-0.000236,0.000119,5.4e-05,-0.000127,0.000272,0.00052,-1.8e-05,-7.9e-05,0.000116,7e-05,4.8e-05,-7e-06,7.4e-05,-0.00015,-0.000119,9.1e-05,-1e-05,-0.000117,-7.1e-05,1.3e-05,5e-06,-6e-06,0.000105,4.7e-05,-8.5e-05,-3e-06,-0.000151,-1.6e-05,6e-05,5.8e-05,6.3e-05,3.4e-05,-9.2e-05,3.3e-05,0.000127,-6.5e-05,-9.5e-05,0.000115,-4e-05,-0.000142,1.5e-05,6.6e-05,0.000109,-4.9e-05,-2.1e-05,-5e-05,-8.5e-05,0.000137,-0.00026,-2.3e-05,-1.6e-05,-7.2e-05,-9e-06,-5.9e-05,4.6e-05,-8.1e-05,0.000109,-9.2e-05,-7.6e-05,-2.7e-05,2.6e-05,3.3e-05,-3.7e-05,1.9e-05,6.1e-05,1.3e-05,-7.7e-05,-6.2e-05,-3.8e-05,6e-06,0.000204,-2.9e-05,5.2e-05,-1.7e-05,-2.5e-05,-0.000107,-2e-06,-1.2e-05,-4.8e-05,0.000107,-1.3e-05,-5.4e-05,5.4e-05,-7.4e-05,-2.1e-05,2e-05,2.6e-05,-2e-05,-3.3e-05,5e-05,-3e-06
4e-06,1e-06,-2e-06,2e-06,9e-06,0,6e-06,-1e-06,-1.4e-05,3e-06,2.1e-05,1.8e-05,-2e-06,3.3e-05,-3.4e-05,5.8e-05,-3.8e-05,-5e-06,-6.9e-05,-3.2e-05,0.000113,0.000251,-9.5e-05,-4.8e-05,0.000174,-8.6e-05,0.000181,-0.000101,0.000145,4.5e-05,-0.00028,-0.000109,-7e-06,-7.4e-05,0.000122,-6.4e-05,3.7e-05,0.000119,7e-06,1.4e-05,0.000183,-0.00014,0.000157,8.9e-05,-5.1e-05,9.8e-05,1e-06,3e-05,1.6e-05,2e-05,9.1e-05,2.1e-05,0.000104,-5e-06,-7.3e-05,4.5e-05,-4.3e-05,2.1e-05,0.000158,-4.1e-05,-9.5e-05,3.8e-05,-3e-05,6e-06,-0.000117,-2.8e-05,9e-06,-0.000136,4.4e-05,-2e-05,4.6e-05,3.3e-05,7.4e-05,6.1e-05,7.2e-05,-3.9e-05,-3.8e-05,-9.3e-05,2e-06,3.7e-05,-3e-06,-0.000103,-3.3e-05,-7.8e-05,-0.000103,-3.9e-05,9.9e-05,-3.4e-05,-0.000154,-3.8e-05,3.3e-05,0.000123,-2.9e-05,8.7e-05,2.8e-05,-2.3e-05,-3.6e-05,6e-06,-6.6e-05,8e-06,6.3e-05,5.8e-05,-3.6e-05,1.2e-05,-4.3e-05,-8.8e-05,-0.00011,-9e-05,-3.6e-05,-4.6e-05,-5e-05,-3e-05,7.8e-05,-6.9e-05,-5.2e-05,4.2e-05,-1.3e-05,-2.6e-05,5e-05,2.6e-05,0
2e-06,2e-06,-7e-06,3e-06,1e-05,6e-06,-5e-06,-7e-06,-2e-06,-2.2e-05,-1.1e-05,5e-06,-4e-06,4e-05,-4.2e-05,2e-06,-2.1e-05,-2.1e-05,-8e-05,3e-05,9.2e-05,-5.9e-05,7.5e-05,6.4e-05,0.000103,-1.3e-05,1.9e-05,-3.7e-05,0.000139,0.000117,-0.000191,2.8e-05,-2.8e-05,-6.4e-05,0.00027,-0.000205,3.4e-05,-7e-06,-0.000165,-1.3e-05,-4.1e-05,3.6e-05,-3.2e-05,9.9e-05,8.9e-05,3.3e-05,-2.2e-05,1.5e-05,2.5e-05,-3.4e-05,-6.3e-05,1e-05,1.6e-05,0.000138,3e-05,1.5e-05,5.2e-05,6.6e-05,9.4e-05,7.4e-05,4.4e-05,-6.7e-05,-2.7e-05,-1.6e-05,-7.5e-05,-5.9e-05,-6.5e-05,-1.5e-05,-4.8e-05,-1.1e-05,-3.2e-05,3e-05,-3.6e-05,7.1e-05,-3e-05,7e-05,-4.6e-05,-0.000188,-3.4e-05,-1.8e-05,2.9e-05,-7e-05,-2e-05,-3.5e-05,-0.000131,4.4e-05,5.5e-05,-9e-05,-9.3e-05,-8e-06,6e-06,6.1e-05,-7.8e-05,-4.5e-05,6e-06,2.3e-05,-5e-05,1e-06,-3.1e-05,2.4e-05,-7.1e-05,4.5e-05,-5.5e-05,-5.9e-05,-3.7e-05,1e-05,-1e-04,-4.8e-05,-2.4e-05,2.5e-05,5.7e-05,-3.3e-05,2.6e-05,-7e-05,-2.2e-05,6.1e-05,5e-06,3e-05,-9e-06,-6.8e-05,1e-05
-2e-06,-1e-06,-4e-06,-6e-06,4e-06,-1e-06,-6e-06,-1e-06,1.1e-05,-2.8e-05,1e-05,2.3e-05,-2e-06,7.9e-05,2e-05,-2.6e-05,-2.1e-05,9e-06,-2.7e-05,-7.9e-05,6.8e-05,-3.4e-05,-3e-05,-1.8e-05,0.000138,1e-06,9.8e-05,-4e-06,-8.1e-05,9.7e-05,-5e-05,6.9e-05,-5.7e-05,8.7e-05,9e-06,-6.9e-05,-3e-05,3e-06,-0.000118,-6.4e-05,-8.1e-05,4.1e-05,4.6e-05,0.000126,8.6e-05,1.9e-05,0.000109,-7.2e-05,1.7e-05,2.6e-05,-4.7e-05,1.2e-05,-0.000162,0.000135,4e-06,-4.1e-05,-2e-05,2e-05,-9.1e-05,-4.7e-05,-9.1e-05,-5e-06,5.6e-05,-2.4e-05,9.2e-05,4.2e-05,7e-06,6.7e-05,-1.6e-05,2e-05,-9.4e-05,2.9e-05,-0.000137,3.3e-05,-0.000138,-7.2e-05,-2.4e-05,-0.000107,8.6e-05,-4.8e-05,4.1e-05,4.8e-05,-1.8e-05,4.3e-05,0.000129,1.4e-05,-7.5e-05,-2.3e-05,-1e-05,1.3e-05,-3.7e-05,-4.4e-05,-5.1e-05,-8.1e-05,4e-05,-5e-05,-4.6e-05,-2.3e-05,2.1e-05,1.2e-05,-7.8e-05,2.6e-05,-1.5e-05,-4.6e-05,2.7e-05,6e-06,6e-06,-1.6e-05,-4.6e-05,-1.7e-05,8e-06,3e-06,3.9e-05,0,-2.3e-05,5.4e-05,-4e-06,0,-3.3e-05,-1.1e-05,-7e-06
0,-2e-06,3e-06,3e-06,-6e-06,-4e-06,1e-06,5e-06,-3e-06,1.6e-05,-7e-06,1e-06,1e-06,1.1e-05,1e-05,7e-06,-9e-06,-1.9e-05,-3.6e-05,-2e-06,-9e-06,-2.3e-05,7.8e-05,-4.8e-05,2.2e-05,5.3e-05,-1.6e-05,0.000103,-6.1e-05,6.9e-05,3.7e-05,-5.2e-05,6e-06,9.1e-05,0,-4.4e-05,2.2e-05,-7.2e-05,-4.5e-05,-3e-06,-4.2e-05,-2.9e-05,-0.000112,-4.7e-05,4.8e-05,-3e-05,-2.8e-05,9e-06,-5.6e-05,-1.6e-05,6.6e-05,-7e-06,4e-06,5.1e-05,-3.1e-05,1.3e-05,-8e-06,5.2e-05,-0.000115,-2.8e-05,2e-06,-3e-05,1.3e-05,3e-06,-3e-05,-5.9e-05,2e-05,-5.3e-05,9e-06,-5.8e-05,-1e-04,1.2e-05,6e-05,1.4e-05,4.8e-05,5.6e-05,-4.1e-05,3.9e-05,-2e-05,5e-05,4e-05,9.4e-05,-1.7e-05,5.7e-05,1.7e-05,-2e-06,-8.8e-05,-7.8e-05,6.7e-05,-4e-06,-4e-06,-7.8e-05,4e-06,7.4e-05,3.4e-05,2.2e-05,1.6e-05,1.9e-05,-7e-06,4e-06,-8.5e-05,-4.4e-05,1.2e-05,1.7e-05,6.5e-05,-3e-06,6.3e-05,2e-05,-1e-06,4e-06,-2.1e-05,-8e-06,1.9e-05,-1.3e-05,-1e-05,0,-6e-06,2.3e-05,1.4e-05,-2.5e-05,-6e-06
-3e-06,3e-06,7e-06,-1e-06,-1e-05,2e-06,1.6e-05,0,-3e-06,1.1e-05,8e-06,-9e-06,-3e-06,-1.4e-05,-1e-06,-3e-06,-6e-06,-1.9e-05,-4.2e-05,5.5e-05,5.6e-05,0.000114,6e-06,-5.2e-05,-1.2e-05,0.000172,1e-05,4.3e-05,2.7e-05,-4e-05,9.2e-05,-3.5e-05,0.000114,-0.000128,-5.1e-05,-0.000255,1e-06,1.4e-05,8.1e-05,-9.4e-05,-3e-05,-4.5e-05,4.8e-05,-3.2e-05,8.3e-05,-2.7e-05,0.000114,4.4e-05,-3.6e-05,-1e-05,-4.7e-05,-1e-05,0.000131,-9.5e-05,-8.7e-05,3e-06,-5.2e-05,-7e-06,-5.7e-05,4.7e-05,-0.000104,3e-06,-5.8e-05,-2.1e-05,6.2e-05,3.2e-05,6.3e-05,-5.4e-05,1e-06,-1.6e-05,-6.7e-05,2e-05,5e-05,-4.8e-05,5.5e-05,-3.9e-05,-3.8e-05,5.2e-05,7.1e-05,-4.8e-05,5.1e-05,3.8e-05,-5e-06,2.2e-05,-1.5e-05,8e-06,3e-06,-3.4e-05,7.3e-05,-3e-06,2.7e-05,-2.9e-05,-2e-05,-6e-06,1.2e-05,-2.8e-05,5e-05,-2.6e-05,1e-06,-4e-06,6e-05,-4.6e-05,-6e-06,5e-06,7.5e-05,6.1e-05,1e-05,3.1e-05,-4.9e-05,-6.8e-05,-8e-05,-1.7e-05,1.8e-05,1e-06,-1e-05,0,1.6e-05,-2e-06,1.4e-05,-4.2e-05,2e-06
-3e-06,-1e-06,3e-06,0,-1e-06,2e-06,1.4e-05,-5e-06,-4e-06,-6e-06,-6e-06,1.6e-05,-3e-06,-1.9e-05,-1.3e-05,2.5e-05,-1.4e-05,8e-06,-2.5e-05,-3.6e-05,2.3e-05,-2.1e-05,-1.6e-05,3.2e-05,-0.000185,-3.7e-05,2.1e-05,2.9e-05,8.6e-05,-0.000241,0.000132,-2.7e-05,-0.000135,-8.1e-05,-6.8e-05,-0.000279,-6.9e-05,3.6e-05,6.3e-05,-4.6e-05,-9.4e-05,6e-06,-1.8e-05,-1.4e-05,-3.5e-05,-2.3e-05,-8e-05,-3.6e-05,3.5e-05,1.2e-05,-6.4e-05,-3e-06,-3.3e-05,-6e-05,-7.8e-05,-3e-06,7.3e-05,-1.7e-05,4.3e-05,-2.5e-05,5.6e-05,4.6e-05,5.9e-05,1.3e-05,-1.2e-05,1.5e-05,-9e-06,9.5e-05,-1.1e-05,-6e-06,-4.7e-05,5e-06,4.9e-05,-3.8e-05,2.9e-05,-6e-06,0,-4.4e-05,-1.5e-05,2.3e-05,3.8e-05,-3.4e-05,-2.1e-05,-2.4e-05,-4.2e-05,2.2e-05,3.7e-05,-5.6e-05,6.4e-05,4e-06,1.6e-05,2.1e-05,2.5e-05,-2.1e-05,5e-06,5e-06,5.2e-05,1.3e-05,4.8e-05,1e-05,0.000118,2e-06,1.6e-05,-4e-06,4.2e-05,1e-05,-5.3e-05,1.2e-05,-9e-06,1e-06,2.2e-05,-2.9e-05,7e-06,-7e-06,7e-06,-1.8e-05,-1e-05,-1e-05,-4e-06,4.2e-05,8e-06
-1e-06,-1e-06,-2e-06,0,0,-3e-06,8e-06,-1e-06,5e-06,5e-06,2e-06,-1e-05,-3e-06,-3.5e-05,-3.2e-05,-2.1e-05,-1e-05,-4e-06,-2.1e-05,2.8e-05,-4.1e-05,-6.3e-05,-1e-06,3.6e-05,-9.2e-05,-6.4e-05,4e-06,2.4e-05,-4.7e-05,-2.6e-05,7e-05,1.9e-05,7.3e-05,4.3e-05,-1.4e-05,-0.00011,0,3.6e-05,5.2e-05,-1.4e-05,-7e-06,2.5e-05,0.00011,6.6e-05,-8.6e-05,-4.9e-05,3.9e-05,2.1e-05,2.7e-05,-2.3e-05,6.6e-05,3e-06,-6.8e-05,-2.8e-05,-4.6e-05,1.7e-05,-2.4e-05,-2e-06,7.5e-05,-4e-06,-6.4e-05,-3.5e-05,-2.3e-05,-6e-06,-6.9e-05,1.1e-05,3.1e-05,-4.3e-05,-4e-06,-2e-06,2e-06,-3e-06,-0.000106,-4e-05,-2.9e-05,-2.1e-05,-7.4e-05,-9.6e-05,-1e-05,1.2e-05,3.7e-05,-4.5e-05,-7e-06,-2.4e-05,2.4e-05,-4e-06,7.2e-05,-9e-06,-3.1e-05,4e-06,-2.8e-05,6.2e-05,2.8e-05,1.2e-05,-1e-05,-1.7e-05,1.8e-05,2e-06,1.3e-05,5e-06,1.1e-05,3.6e-05,-3.1e-05,-3.6e-05,-1.5e-05,2.9e-05,-6.2e-05,4.6e-05,-2.8e-05,-1.1e-05,2.5e-05,-2.3e-05,1.3e-05,1.2e-05,-1e-05,-1e-05,-2.5e-05,-1.2e-05,-2.1e-05,2.5e-05,-4e-06
-2e-06,-1e-06,-4e-06,0,5e-06,1e-06,0,3e-06,1e-06,-5e-06,-4e-06,1.6e-05,1e-06,-2.8e-05,1.2e-05,-1.2e-05,-1.1e-05,2e-05,-1.7e-05,-2.1e-05,-2.9e-05,5.8e-05,-1.8e-05,2e-06,0,-3.1e-05,4.3e-05,-2.4e-05,-6.8e-05,5.2e-05,-1.4e-05,-5e-06,-2.1e-05,-8.4e-05,6.2e-05,8.3e-05,-3.8e-05,-5.4e-05,2.6e-05,-5e-06,1.7e-05,-1.2e-05,-3e-05,1.7e-05,-6.6e-05,-2e-05,4.5e-05,3e-06,2.8e-05,2.1e-05,9e-06,-1.1e-05,-3.5e-05,-2e-05,-2.5e-05,8e-06,1.8e-05,7e-06,2.6e-05,2.5e-05,2.1e-05,-1.8e-05,5e-06,4e-06,4.6e-05,-4.9e-05,-1.8e-05,5e-06,2.8e-05,-2e-05,6e-06,2e-05,-2.1e-05,-3e-05,2.7e-05,1.4e-05,8e-06,-6e-05,-8.3e-05,-2.3e-05,2.4e-05,-2.2e-05,-1.5e-05,-1.4e-05,-6.7e-05,-1.6e-05,6e-06,-2.1e-05,-4.1e-05,-6e-06,-1e-05,3.1e-05,2.4e-05,7e-06,-1.2e-05,-1e-06,-3.2e-05,-1.2e-05,-5e-06,1e-06,-7.4e-05,8e-06,-1.5e-05,1.3e-05,-2.6e-05,3.9e-05,-7e-06,1.5e-05,-2.4e-05,-3e-06,1.2e-05,-1e-06,6e-06,1.6e-05,-1.4e-05,-2.4e-05,0,-1e-06,1.2e-05,2e-06,-3e-06
-1e-06,1e-06,-1e-06,-1e-06,-1e-06,2e-06,-5e-06,1e-06,-4e-06,-1e-06,2e-06,-5e-06,-2e-06,-4e-06,4e-06,2.8e-05,-1.4e-05,-3e-06,-1e-06,-3.6e-05,-5.7e-05,2.2e-05,6e-06,-1.6e-05,1.6e-05,8e-06,-9e-06,-2.3e-05,4.1e-05,0.000162,-5.6e-05,-5e-06,1.3e-05,-3e-05,4e-05,7.9e-05,-8e-06,-1.8e-05,-5.5e-05,-4.7e-05,-5.2e-05,-2.1e-05,6e-06,-4.5e-05,-6.2e-05,-3e-05,-1.5e-05,-3.6e-05,3e-06,0,-6.8e-05,-1e-06,5e-06,-4.5e-05,6e-06,-2.2e-05,-2.6e-05,1e-05,-4.7e-05,-2.3e-05,-3.9e-05,1e-05,-1.8e-05,0,-1.3e-05,-1.6e-05,1.4e-05,1.4e-05,-4.7e-05,-4.3e-05,2.1e-05,0,5.1e-05,5e-06,-3e-06,-3.4e-05,-3.6e-05,5.7e-05,-9e-06,2.2e-05,5e-06,-7e-06,-1e-05,-6e-06,5.2e-05,-7e-06,-4.1e-05,-6e-06,-4.9e-05,-4e-06,1.2e-05,-2.8e-05,2.8e-05,3e-06,4e-06,-1.2e-05,-6.5e-05,1e-05,4e-06,-4e-06,-5.5e-05,-2e-06,2.1e-05,-2.1e-05,-1.1e-05,2.1e-05,8e-06,-2e-05,-1.9e-05,-1.9e-05,-2.5e-05,-1.1e-05,-1.2e-05,1.9e-05,-8e-06,-3.5e-05,-2e-06,0,8e-06,6e-06,8e-06
1e-06,0,1e-06,1e-06,3e-06,-2e-06,0,-2e-06,-1e-06,1.2e-05,0,-1.2e-05,0,6e-06,8e-06,-1.3e-05,-3e-06,-6e-06,0,3.6e-05,-4.2e-05,-6e-06,-2.4e-05,1e-05,0.000113,5.8e-05,4.2e-05,-1.7e-05,5.5e-05,-5.1e-05,-9.4e-05,3.7e-05,-5.1e-05,7.7e-05,0.000132,3.2e-05,-7e-06,7e-06,-5.7e-05,-1.8e-05,5.3e-05,1e-05,-1.6e-05,-1.6e-05,-2.6e-05,-6e-06,-4.6e-05,1.5e-05,-5e-06,2e-06,3.6e-05,1.2e-05,6.5e-05,-5.5e-05,-2.5e-05,1e-05,2.4e-05,-2.8e-05,-5.8e-05,1e-06,1.8e-05,-5e-06,3.3e-05,5e-06,1.5e-05,9e-06,-4e-05,7e-06,2.8e-05,8e-06,4.8e-05,4e-06,4.9e-05,2.4e-05,-3.5e-05,1.5e-05,-2.4e-05,9.9e-05,-2.3e-05,-5e-06,-5e-06,1.4e-05,-7e-06,7e-06,3.2e-05,-2e-06,-3.7e-05,7e-06,-6e-06,1e-06,1.2e-05,-3.7e-05,3e-06,-3.2e-05,-1.2e-05,3e-06,-2.8e-05,-1.9e-05,2e-06,0,-2e-05,-1.7e-05,-1.5e-05,4e-06,1.4e-05,9e-06,-6e-06,-2e-06,-2.5e-05,2.9e-05,-1.1e-05,-1.8e-05,1e-06,1.9e-05,-6e-06,-2.5e-05,-1e-06,1.1e-05,-8e-06,-8e-06,-1e-06
0,-1e-06,2e-06,-1e-06,2e-06,-1e-06,4e-06,-1e-06,1e-06,-1e-06,-2e-06,1e-05,0,3.2e-05,-5e-06,-3e-06,-4e-06,2e-06,-9e-06,-2e-05,-3.3e-05,-3.2e-05,-5e-06,1.1e-05,5.8e-05,1.8e-05,-4.7e-05,-3.5e-05,-4.7e-05,5e-06,-9.6e-05,-1.3e-05,0,-1.3e-05,3.4e-05,8.8e-05,1e-06,4e-05,-4.1e-05,-1.8e-05,1.4e-05,1e-05,2.1e-05,-4e-05,1.2e-05,3e-06,7.4e-05,-1e-06,-3e-06,1.1e-05,1.4e-05,-4e-06,-3.5e-05,-2.4e-05,-3.2e-05,-1.8e-05,2.4e-05,-5e-06,-2.1e-05,1.2e-05,-5.1e-05,1.3e-05,-4e-06,-1.2e-05,2.2e-05,3e-06,-2e-06,-8e-06,-3e-06,-2e-06,4.1e-05,1e-05,-2.7e-05,1.9e-05,-1e-05,-1e-06,-2.5e-05,2.9e-05,3e-05,-2.1e-05,-1.7e-05,1.5e-05,-1e-05,2.1e-05,-9e-06,7e-06,-6e-06,1e-06,3.1e-05,4e-06,-3e-06,-1.7e-05,-9e-06,1.6e-05,-2.2e-05,-1.1e-05,2.8e-05,9e-06,-2e-05,1e-06,5.5e-05,-1.9e-05,-2.5e-05,-4e-06,3e-05,1.8e-05,-1.5e-05,-1.8e-05,-1.5e-05,6e-06,8e-06,-1.7e-05,-1.1e-05,1.5e-05,-6e-06,-1.7e-05,7e-06,-1e-06,-1e-05,-4e-05,-5e-06
1e-06,1e-06,0,0,1e-06,2e-06,2e-06,1e-06,2e-06,-5e-06,2e-06,-8e-06,-1e-06,1.4e-05,-9e-06,-1e-06,-1e-06,-4e-06,-8e-06,1.2e-05,-3.8e-05,3.9e-05,2.4e-05,-1.9e-05,6.4e-05,-2e-05,2e-05,1e-06,-1.9e-05,-8.1e-05,-6.9e-05,-1.3e-05,3.4e-05,-7.2e-05,4.5e-05,0.000181,-6e-06,-4e-06,2.7e-05,-1.8e-05,-2e-06,-1.9e-05,1e-05,5.1e-05,3.5e-05,1.3e-05,-6.9e-05,-3e-05,-1e-06,-6e-06,-6e-05,0,-7.4e-05,3e-06,-5.3e-05,-1.3e-05,-3.4e-05,-5e-06,2.3e-05,-4e-06,-9e-06,-1.5e-05,-1e-05,8e-06,-4.8e-05,-6e-06,-7e-06,-1.8e-05,-1.8e-05,-1e-05,2.3e-05,0,-7.5e-05,2.6e-05,2.9e-05,3e-06,-1.5e-05,-3.6e-05,0,1.8e-05,-2e-05,1.9e-05,-4e-06,1.1e-05,-5.1e-05,2e-06,3.6e-05,2.3e-05,3.7e-05,-3e-06,-1.5e-05,1.1e-05,-1.8e-05,2e-05,-3e-06,2e-06,4.1e-05,-3e-06,-3e-06,-2e-06,7e-05,1e-05,3.2e-05,-5e-06,2.9e-05,-5e-06,0,-2.4e-05,-2.7e-05,3e-06,-4e-06,-1.8e-05,-6e-06,2.3e-05,-8e-06,2e-06,-1e-05,-1e-06,1.1e-05,-1.1e-05,0
1e-06,0,-2e-06,1e-06,-2e-06,0,-5e-06,1e-06,-2e-06,-2e-06,-1e-06,8e-06,-1e-06,6e-06,6e-06,0,-3e-06,-3e-06,-1.3e-05,8e-06,-1e-05,1.6e-05,-1.5e-05,-1.6e-05,-2.8e-05,-2.1e-05,-3.1e-05,2e-05,2.8e-05,-2.2e-05,-2.4e-05,1.1e-05,-6.5e-05,-9e-06,-1.6e-05,0.000114,2e-06,-2.2e-05,3e-05,-2.8e-05,2.1e-05,-3e-06,1.7e-05,-6e-06,5.3e-05,2.2e-05,-3e-06,3.5e-05,1.5e-05,2e-06,2.2e-05,4e-06,2.1e-05,3e-05,-2.4e-05,1.9e-05,2.3e-05,-4e-06,3.5e-05,-2e-06,-2.5e-05,-1.5e-05,1.3e-05,-4e-06,1.4e-05,-1.5e-05,7e-06,5e-06,6e-06,-3.6e-05,1e-06,1e-06,3.4e-05,-2e-06,1.8e-05,-1.4e-05,-3.1e-05,-5.3e-05,5.4e-05,-6e-06,-2.6e-05,-3e-06,-1e-05,-6e-06,-6e-06,-7e-06,2.7e-05,2e-06,2.3e-05,1e-06,0,3e-05,-1.7e-05,-1.8e-05,4e-06,-7e-06,3.1e-05,-2e-06,0,0,-8e-06,9e-06,8e-06,0,1.2e-05,-7e-06,-2e-06,-1.3e-05,-1.1e-05,3e-06,-3e-06,-8e-06,-1.1e-05,4e-06,4e-06,7e-06,-9e-06,3e-06,2e-06,9e-06,3e-06
0,0,-1e-06,-1e-06,-4e-06,-1e-06,-8e-06,-1e-06,-1e-06,-6e-06,0,-8e-06,0,0,1e-06,1.2e-05,-6e-06,2e-06,-1.5e-05,-3.1e-05,-6e-06,-1.4e-05,3e-05,7e-06,-6.6e-05,-1.3e-05,2.6e-05,1.1e-05,3.2e-05,-3.9e-05,5e-06,-3e-06,4.5e-05,-1.1e-05,-4e-05,-5.6e-05,-6e-06,-1.4e-05,3.1e-05,-1.1e-05,7e-06,7e-06,1e-05,-1.8e-05,3.4e-05,2.5e-05,-2.1e-05,-7e-06,1.1e-05,6e-06,3.4e-05,-3e-06,3.3e-05,2.9e-05,-2.8e-05,-9e-06,-1.5e-05,7e-06,6e-06,9e-06,-1e-06,1.9e-05,-1.2e-05,-3e-06,9e-06,1.4e-05,-1e-06,7e-06,1.2e-05,1e-05,-1.3e-05,0,3.9e-05,-1.2e-05,-4.7e-05,6e-06,-1.4e-05,-4e-06,1.9e-05,-7e-06,-3e-05,-1.7e-05,-4e-06,-1.5e-05,2.9e-05,9e-06,2e-06,2.7e-05,-9e-06,-2e-06,1.6e-05,1e-05,-1.4e-05,-3e-06,-2e-06,0,-3e-06,8e-06,-1e-06,0,-6.4e-05,3e-06,-4.2e-05,-1.9e-05,-8e-06,-6e-06,-2.8e-05,-7e-06,-2.4e-05,1.3e-05,-3e-06,-1.4e-05,-1.2e-05,9e-06,-9e-06,1.1e-05,9e-06,-1.4e-05,-8e-06,-6e-06,1e-06
0,-1e-06,1e-06,0,-2e-06,1e-06,-8e-06,-1e-06,2e-06,4e-06,-2e-06,-1e-06,0,-1.1e-05,6e-06,-1.6e-05,-8e-06,-2e-06,-1e-05,2e-05,9e-06,-2.8e-05,-2.7e-05,1.9e-05,-6e-05,3.4e-05,-1.5e-05,1.6e-05,-3.5e-05,7e-05,3.4e-05,2e-06,-2.4e-05,-4.5e-05,-3e-06,-9.3e-05,-7e-06,2.3e-05,9e-06,-2.4e-05,-1.4e-05,-5e-06,-1.8e-05,-1.8e-05,6e-06,1.6e-05,1e-06,-1.4e-05,6e-06,-1.2e-05,-4.5e-05,-1e-06,3e-06,2e-06,-4e-06,-2e-06,2.6e-05,-1.5e-05,-2.2e-05,-3e-06,-2.3e-05,-4e-06,7e-06,2e-06,-6e-06,-1.4e-05,7e-06,-2.2e-05,-1e-05,-3e-06,-2.4e-05,-4e-06,2.7e-05,-1.7e-05,1.4e-05,3e-06,-1.6e-05,4.8e-05,3.1e-05,2e-05,-2.6e-05,-1.4e-05,-5e-06,-1e-05,1.9e-05,3e-06,-2.5e-05,6e-06,-2.9e-05,3e-06,5e-06,-1.4e-05,3e-06,-3e-06,-2e-06,-3e-06,-2.1e-05,-1e-05,-1e-06,1e-06,-3.7e-05,0,2.3e-05,1.1e-05,-1.3e-05,-1.7e-05,-3e-05,1.6e-05,-1.2e-05,-5e-06,1.4e-05,-1.3e-05,-1e-05,2e-06,-8e-06,1.9e-05,4e-06,1e-05,-4e-06,2.5e-05,-4e-06
0,0,1e-06,0,1e-06,1e-06,-2e-06,0,0,7e-06,2e-06,5e-06,-1e-06,-1.2e-05,-3e-06,2e-06,-7e-06,6e-06,-8e-06,-7e-06,2.1e-05,5.2e-05,3e-05,-2e-06,-6.6e-05,1.7e-05,6e-06,1.1e-05,-1.9e-05,5.1e-05,3.2e-05,-4e-06,3.4e-05,3.4e-05,-3e-06,-5.9e-05,1e-06,0,-1e-05,-2.6e-05,-2.2e-05,-1e-06,1.5e-05,1e-05,-1.9e-05,1e-05,-3.6e-05,2.3e-05,-7e-06,7e-06,6e-06,1e-06,-3.4e-05,6e-06,-1.9e-05,4e-06,-2e-05,3e-06,-2.7e-05,-1.1e-05,-1.5e-05,-3e-06,-1.1e-05,0,2.4e-05,-4e-06,1.3e-05,1.4e-05,-4e-06,-1.1e-05,-3.1e-05,-1e-06,-7e-05,-1.9e-05,5e-06,-1.2e-05,-3.3e-05,1e-05,-2e-05,-1.8e-05,-2e-05,-2e-06,-6e-06,4e-06,-1.2e-05,-3e-06,-1.4e-05,1.9e-05,-2.7e-05,-3e-06,-1.3e-05,-1.5e-05,-4e-06,1.3e-05,3e-06,-2e-06,-3.1e-05,2e-06,8e-06,-2e-06,9e-06,-1.1e-05,1.2e-05,-1e-05,-7e-06,-1.2e-05,-1e-06,8e-06,-2.3e-05,-1.3e-05,-8e-06,-1.3e-05,-1.9e-05,4e-06,-5e-06,1.7e-05,-1e-06,-3e-06,9e-06,1.6e-05,0
-1e-06,1e-06,1e-06,0,1e-06,-1e-06,3e-06,1e-06,-1e-06,-5e-06,-2e-06,-9e-06,0,-7e-06,-2e-06,1e-05,-5e-06,0,-8e-06,-2e-06,1.2e-05,-2.3e-05,-2.7e-05,-1e-05,4e-05,-2.6e-05,-1.5e-05,-1.1e-05,2.6e-05,-2.6e-05,2.3e-05,5e-06,-2.8e-05,1.3e-05,4.6e-05,-5.9e-05,-3e-06,1e-05,-2.7e-05,-1.2e-05,1.5e-05,5e-06,7e-06,1.5e-05,-3.5e-05,2e-06,3.2e-05,-1.9e-05,-2.3e-05,-3e-06,3e-05,-3e-06,-3.2e-05,1.3e-05,-1.8e-05,-1.3e-05,3e-06,-1e-06,-9e-06,8e-06,6e-06,-3e-06,1.6e-05,-3e-06,-2.1e-05,-1.9e-05,0,1.5e-05,1.5e-05,-1.9e-05,-3.3e-05,-4e-06,-1e-05,-3e-06,1.3e-05,1.2e-05,-2e-06,-3.5e-05,2e-06,8e-06,-1.1e-05,1.3e-05,-3e-06,1e-05,-1e-06,-3e-06,6e-06,5e-06,-1.2e-05,1e-06,-5e-06,-1.1e-05,1.2e-05,-2e-06,8e-06,-2e-06,-1.8e-05,-3e-06,6e-06,-2e-06,4.9e-05,-3e-06,-2.6e-05,4e-06,-4e-06,-6e-06,1.5e-05,1.2e-05,-1.6e-05,2e-06,-1e-05,-1.5e-05,-8e-06,1e-06,-3e-06,2.3e-05,1e-06,2e-06,-3e-06,-1.4e-05,4e-06
0,0,0,-1e-06,2e-06,0,2e-06,0,-1e-06,-2e-06,1e-06,1.1e-05,0,-4e-06,1e-06,-9e-06,-3e-06,-4e-06,-5e-06,2.1e-05,1.3e-05,-2e-06,1.5e-05,1e-06,3.6e-05,-7e-06,-1.5e-05,-2e-06,1.6e-05,-2.6e-05,8e-06,-3e-06,1.9e-05,-4.1e-05,4.8e-05,-0.000122,1e-06,-2.2e-05,-1.4e-05,-9e-06,-2.7e-05,-1.7e-05,2.9e-05,5e-06,-4.4e-05,-8e-06,-2.7e-05,-7e-06,-5e-06,-7e-06,-4.1e-05,2e-06,3e-05,3.1e-05,-3.3e-05,4e-06,2e-06,1e-06,1.3e-05,-2e-06,-3.3e-05,-9e-06,-1e-05,0,-1.3e-05,3e-06,-8e-06,-2.3e-05,-1.6e-05,-6e-06,-2.2e-05,-5e-06,3.5e-05,-3e-06,-1.2e-05,-1.3e-05,-2.5e-05,-5e-05,-3.3e-05,7e-06,-3e-06,7e-06,-6e-06,5e-06,-2.8e-05,2e-06,1.5e-05,8e-06,1.1e-05,0,7e-06,7e-06,1.1e-05,-2.1e-05,3e-06,-4e-06,7e-06,-2e-06,0,-1e-06,4.3e-05,4e-06,7e-06,-9e-06,5e-06,-1.2e-05,-2e-06,2.3e-05,-1.7e-05,-4e-06,-5e-06,-9e-06,-1.7e-05,-5e-06,-7e-06,1.1e-05,-9e-06,4e-06,-4e-06,-7e-06,0
0,0,-1e-06,1e-06,0,0,-1e-06,-1e-06,1e-06,2e-06,0,-6e-06,0,1e-05,-1e-06,2e-06,1e-06,2e-06,-6e-06,-2.5e-05,5e-06,6e-06,-1.5e-05,1e-05,7.2e-05,-1.7e-05,8e-06,-7e-06,-3.4e-05,-3e-05,-3e-06,-5e-06,9e-06,-1.5e-05,4e-05,-0.000103,4e-06,-8e-06,0,-1.8e-05,-6e-06,7e-06,-1.7e-05,2e-06,-3.5e-05,-6e-06,1.8e-05,1.4e-05,1.2e-05,1e-05,-4e-06,-1e-06,4.1e-05,1.2e-05,-2.1e-05,8e-06,0,6e-06,8e-06,-8e-06,-5e-06,1.2e-05,0,1e-06,1.6e-05,0,2e-06,1.7e-05,-1e-06,5e-06,-1.7e-05,-4e-06,3.7e-05,8e-06,7e-06,8e-06,-2e-05,-1.5e-05,-5e-06,-2.1e-05,4e-06,-1e-06,-3e-06,-5e-06,2e-06,1e-06,1.3e-05,4e-06,2.9e-05,1e-06,8e-06,1.4e-05,6e-06,2.1e-05,-1e-06,3e-06,2.6e-05,4e-06,1e-06,1e-06,-1.8e-05,-1e-06,1.7e-05,-2e-06,1.1e-05,-2e-06,-2.3e-05,-2e-06,-1.8e-05,-5e-06,1.4e-05,-1.3e-05,-1.4e-05,-7e-06,-3e-06,5e-06,-4e-06,-7e-06,1e-06,-1.2e-05,-4e-06
-1e-06,0,0,-1e-06,1e-06,0,-3e-06,0,0,0,1e-06,0,0,2e-06,3e-06,-3e-06,-1e-06,-3e-06,-7e-06,9e-06,-1e-06,0,1e-06,-4e-06,4.3e-05,2.2e-05,-2.2e-05,-1.3e-05,-6e-06,2.7e-05,-1.7e-05,4e-06,-2.3e-05,1e-06,2.5e-05,6e-06,6e-06,1.6e-05,1.8e-05,-1.6e-05,4e-06,1.6e-05,9e-06,-1.8e-05,-1e-05,-1e-05,-7e-06,-2.3e-05,9e-06,-7e-06,4.1e-05,1e-06,-2.8e-05,-2e-05,-2.1e-05,-1.1e-05,5e-06,-3e-06,2e-06,1.8e-05,-2.4e-05,-5e-06,5e-06,-3e-06,-3e-06,-2e-06,1e-06,-9e-06,8e-06,-1e-05,7e-06,-5e-06,-2e-05,4e-06,8e-06,-1.4e-05,-1e-05,4.3e-05,-2.6e-05,1.3e-05,1.1e-05,-3e-06,-4e-06,-2e-06,1.5e-05,-4e-06,-7e-06,-3e-06,1.6e-05,0,-4e-06,7e-06,1e-05,5e-06,3e-06,-9e-06,2.7e-05,-2e-06,2e-06,1e-06,-5.7e-05,7e-06,-1.5e-05,3e-06,9e-06,2e-06,-1.9e-05,1e-06,-1.4e-05,-8e-06,1e-06,-1.2e-05,-1.2e-05,-8e-06,0,-6e-06,9e-06,3e-06,4e-06,-2.3e-05,-1e-06
0,0,0,1e-06,0,0,0,1e-06,-1e-06,3e-06,-1e-06,4e-06,0,2e-06,2e-06,4e-06,-1e-06,0,-5e-06,0,-5e-06,1.4e-05,7e-06,-1e-05,-1.1e-05,1.7e-05,1.7e-05,3e-06,2.8e-05,-5e-05,-2.2e-05,-1e-06,2.2e-05,-3.8e-05,1.4e-05,0.000103,1e-06,1e-05,0,-1e-05,2e-06,-2e-05,-1.8e-05,1e-05,1e-05,-5e-06,2.1e-05,8e-06,-6e-06,3e-06,-2.9e-05,-1e-06,-2.8e-05,-3.2e-05,-1.8e-05,0,-1.7e-05,3e-06,-5e-06,-5e-06,2e-06,-7e-06,-8e-06,2e-06,1e-05,-5e-06,-8e-06,1e-06,-6e-06,-1.2e-05,1.3e-05,-6e-06,-5.8e-05,7e-06,-2.8e-05,1.5e-05,-1.9e-05,3.6e-05,2e-05,0,1.7e-05,0,-4e-06,1e-06,2.6e-05,0,-7e-06,4e-06,3e-06,-1e-06,-1.2e-05,0,-4e-06,-2.2e-05,-1e-06,5e-06,1.2e-05,0,-3e-06,-1e-06,-2.6e-05,1e-06,1e-06,-1e-05,-2e-06,2e-06,-1e-06,-3e-06,-2.1e-05,1.3e-05,-7e-06,-1.3e-05,-1.6e-05,-6e-06,-7e-06,-1.4e-05,0,-4e-06,-6e-06,3e-06,4e-06
0,0,0,0,-1e-06,0,4e-06,0,0,0,1e-06,-7e-06,0,0,-2e-06,5e-06,-5e-06,3e-06,-4e-06,-1.6e-05,-1.5e-05,-3.5e-05,-7e-06,1e-06,-2.7e-05,-1.7e-05,-3.5e-05,6e-06,7e-06,4.3e-05,-2.2e-05,2e-06,-3.2e-05,-1.4e-05,-1.2e-05,7.6e-05,1.3e-05,-1.4e-05,4e-06,-1.8e-05,5e-06,-8e-06,2.6e-05,-2e-06,2.8e-05,-1e-06,-1.6e-05,1.3e-05,-9e-06,7e-06,-1.9e-05,1e-06,8e-06,-9e-06,-1.9e-05,6e-06,1.4e-05,2e-06,-7e-06,-1.1e-05,-3.2e-05,5e-06,8e-06,-1e-06,4e-06,-1e-05,2e-06,-3e-06,-2e-06,-1.3e-05,2.4e-05,-6e-06,2.5e-05,-4e-06,1.3e-05,-1.2e-05,-2.2e-05,-1.1e-05,-4e-06,-1.1e-05,2.2e-05,2e-06,-3e-06,1e-06,-1.5e-05,3e-06,3e-06,-1.1e-05,-1.5e-05,1e-06,1e-06,-6e-06,-1e-05,4e-06,-3e-06,-1e-05,-1.8e-05,1e-06,-3e-06,0,2.6e-05,-6e-06,1.2e-05,6e-06,-1.1e-05,5e-06,-2e-06,-1.6e-05,-1.1e-05,-1e-06,-3e-06,-1.4e-05,-1.2e-05,-1e-05,-4e-06,-1.4e-05,-6e-06,1e-06,1e-06,1.6e-05,0
