-0.009759,-0.013793,-0.00844,-0.010293,-0.01212,-0.011134,-0.010963,-0.009814,-0.014479,-0.025834,-0.016742,-0.010722,-0.010234,-0.011446,-0.015546,-0.013258,-0.014686,-0.012376,-0.005722,-0.004308,-0.004917,-0.002961,-0.002464,-0.003586,-0.004187,-0.004439,-0.005112,-0.003788
-0.010608,-0.015878,-0.011347,-0.014085,-0.013738,-0.012261,-0.012242,-0.012762,-0.019222,-0.034659,-0.023748,-0.016016,-0.014412,-0.015859,-0.019477,-0.01811,-0.021246,-0.016727,-0.007889,-0.005422,-0.005992,-0.003675,-0.003672,-0.005081,-0.004764,-0.006119,-0.006618,-0.004251
0.000182,0.001565,-0.000738,-0.000797,0.001065,0.002219,0.001697,-0.000193,0.000151,-0.000405,-0.002494,-0.002929,-0.000871,-2.4e-05,0.001554,-0.001963,-0.003794,-0.001793,-0.000354,0.000682,0.000917,0.000397,-0.00055,-0.000741,0.00021,-0.000876,-0.000712,8.1e-05
0.008806,0.013562,0.007401,0.009882,0.011317,0.011193,0.010834,0.009481,0.015446,0.029361,0.01786,0.010214,0.010608,0.012796,0.017584,0.014379,0.014385,0.011412,0.005147,0.003752,0.004772,0.002621,0.002112,0.003488,0.003816,0.004082,0.00484,0.00328
0.00726,0.009315,0.006937,0.008207,0.007548,0.006341,0.007137,0.008782,0.012507,0.024322,0.017282,0.01221,0.009849,0.009808,0.011573,0.013972,0.015816,0.010365,0.004056,0.001793,0.002446,0.00169,0.002207,0.003561,0.002498,0.004368,0.004914,0.002535
-0.003585,-0.00628,-0.001907,-0.002445,-0.005037,-0.00649,-0.005748,-0.002447,-0.004584,-0.010917,-0.004323,-0.000331,-0.002574,-0.003574,-0.007844,-0.003051,0.000773,-0.00077,-0.001077,-0.001357,-0.002043,-0.00134,-0.000105,-0.000471,-0.001809,-0.000357,-0.000995,-0.001452
-0.007583,-0.011279,-0.006232,-0.008545,-0.009084,-0.00925,-0.009515,-0.008898,-0.014027,-0.028202,-0.01749,-0.010982,-0.010809,-0.011716,-0.01589,-0.014765,-0.012372,-0.008366,-0.003851,-0.002605,-0.003866,-0.002154,-0.001742,-0.003042,-0.002794,-0.004019,-0.004746,-0.0023
-0.000115,-1e-04,-0.000719,-0.001219,0.00031,0.001826,0.001156,-0.002469,-0.005006,-0.009716,-0.005936,-0.004655,-0.00323,-0.003723,-0.002381,-0.006241,-0.008866,-0.004093,-0.000308,0.001416,0.001171,0.00121,-0.000202,-0.001431,0.000483,-0.001681,-0.001784,-3.1e-05
0.001953,0.005505,0.002413,0.003436,0.004124,0.00588,0.005181,0.002062,0.00515,0.015452,0.006256,0.001764,0.00414,0.004731,0.009804,0.005205,-0.001606,-0.000575,0.000837,0.000942,0.00176,0.000793,-0.000321,0.000524,0.001603,0.000981,0.001821,0.000923
0.002442,0.004122,0.002095,0.004504,0.004652,0.003739,0.003577,0.004915,0.009392,0.021348,0.012691,0.007942,0.007684,0.007958,0.009734,0.010683,0.007175,0.002812,0.000972,-7.7e-05,0.001117,0.000144,0.000496,0.001704,0.00062,0.002572,0.002802,0.000692
0.001231,-0.000419,-0.000462,-0.001085,-0.001373,-0.003553,-0.002332,0.001537,0.003159,0.001678,0.001037,0.002247,0.001014,0.001945,-0.001507,0.003212,0.008419,0.00409,-2e-06,-0.001136,-0.001167,-0.000841,0.000699,0.001037,-0.00092,0.000777,0.000527,-0.000172
-0.000611,-0.002514,-0.001625,-0.003473,-0.003959,-0.004363,-0.003355,-0.001452,-0.004136,-0.017341,-0.008943,-0.004034,-0.005329,-0.004826,-0.008965,-0.006771,0.002593,0.00353,0.000317,0.000116,-0.000934,-0.000257,0.000343,-0.00053,-0.000815,-0.001127,-0.001845,-0.000526
-0.001261,-0.00158,-0.000788,-0.001891,-0.001503,0.00042,-6.8e-05,-0.002708,-0.007512,-0.015181,-0.00779,-0.005142,-0.004794,-0.005609,-0.005711,-0.007774,-0.005014,-0.000636,0.000312,0.000718,-0.000196,0.000137,-0.00038,-0.000955,0.00036,-0.001974,-0.001812,9.2e-05
-0.001895,-0.001616,0.000734,0.002,0.001606,0.00329,0.001731,-0.001667,-0.002937,0.005016,0.003664,-0.000465,-0.000469,-0.001743,0.003525,0.000317,-0.00857,-0.006265,-0.000883,-0.000662,-0.000496,0.000234,-0.000935,-0.000549,0.000737,-0.00031,0.000381,0.000123
-0.000752,0.000246,0.001173,0.003607,0.002463,0.00118,0.000838,0.000552,0.00411,0.016497,0.008732,0.004492,0.004996,0.004901,0.008147,0.006904,-0.00311,-0.005129,-0.001109,-0.000146,0.001002,0.000218,-0.000201,0.000304,-0.00011,0.001446,0.001789,-6.1e-05
0.001648,0.002711,0.000366,0.000782,0.001438,-0.001103,-0.000608,0.002762,0.007031,0.008802,0.003841,0.00386,0.004297,0.00559,0.002747,0.004332,0.004767,0.001379,-0.000239,0.000432,0.001233,-2.4e-05,0.000493,0.000421,-6e-04,0.001345,0.000661,0.000105
0.003185,0.004225,-0.000231,-0.00374,-0.002283,-0.002104,-2.9e-05,0.00203,0.002469,-0.008604,-0.006296,-0.001088,-0.00022,0.000456,-0.00505,-0.00214,0.008517,0.007593,0.001896,0.001697,0.001609,0.00082,0.001114,0.000125,1.5e-05,-0.000104,-0.000934,4.1e-05
-0.000289,-0.001685,-0.002097,-0.004614,-0.004338,-0.000881,-0.000768,-0.00204,-0.005477,-0.015835,-0.009685,-0.005401,-0.00537,-0.006,-0.007101,-0.006635,0.001356,0.003839,0.000752,-0.000925,-0.002291,-0.000769,-0.000376,-0.000371,0.000406,-0.001241,-0.001112,-0.00053
-0.003065,-0.005571,-0.001109,0.00111,0.001253,0.00233,2e-04,-0.002318,-0.006402,-0.002635,0.001168,-0.00097,-0.003016,-0.005107,-0.001031,-0.001861,-0.004702,-0.002625,-0.000691,-0.00186,-0.002711,-0.000968,-0.000697,0.00023,0.000303,-0.000666,0.000272,-9.2e-05
