-0.001841,-0.001517,-0.002637,-0.001872,-0.001534,-0.00114,-0.00083,-0.001552,-0.000527,-0.001297,-0.002656,-0.002165,-0.002455,-0.002205,-0.002288,-0.001389,-0.002265,-0.002402,-0.002079,-0.001125,-0.001991,-0.001979,-0.003062,-0.001061,-0.001777,-0.001778,-0.002483,-0.002263,-0.001953,-0.00132,-0.003124,-0.002188,-0.001797,-0.00171,-0.001497,-0.001928,-0.001537,-0.001334,-0.002325,-0.002522,-0.001997,-0.001252,-0.00099,-0.001736,-0.001322,-0.002565,-0.001696,-0.001689,-0.001253,-0.001884,-0.002167,-0.002726,-0.003561,-0.002024,-0.00315,-0.004381,-0.002846,-0.002078,-0.002728,-0.001935,-0.001615,-0.00146,-0.001585,-0.001302,-0.000886,-0.00176,-0.001743,-0.001849,-0.002522,-0.001951,-0.001751,-0.002189,-0.001402,-0.001053,-0.001086,-0.001612,-0.001676,-0.0015,-0.001234,-0.000866,-0.00279,-0.0027,-0.001621,-0.0016,-0.002244,-0.002211,-0.001288,-0.001081,-0.00112,-0.002112,-0.001627,-0.001131,-0.001301,-0.001518,-0.002442,-0.002555,-0.001539,-0.000864,-0.001847,-0.002723,-0.002407,-0.001961,-0.002329,-0.002087,-0.001385,-0.001784,-0.002392,-0.001354,-0.001124,-0.001738,-0.001888,-0.001054,-0.002423,-0.00165,-0.001597,-0.001102,-0.002927,-0.002366,-0.002556,-0.001879,-0.002329
0.000819,0.000503,0.001274,0.000547,0.000225,0.000285,-8e-05,0.000309,0.000221,-0.000378,0.001335,0.001373,0.000893,0.001256,0.001079,0.001477,0.001565,0.00153,0.001466,0.000676,0.001021,0.000819,0.001859,0.000968,0.000114,0.000625,0.000962,0.000613,-0.000198,9.1e-05,0.001991,0.000467,0.000528,0.000657,0.000437,0.001129,0.000859,0.000842,0.001046,0.001043,0.000611,-0.000118,3.5e-05,0.000441,-3.3e-05,0.001477,0.001018,0.000581,0.00069,0.00043,0.001711,0.002356,0.002211,0.001318,0.001217,0.003661,0.00155,0.000973,0.001674,0.000761,0.000958,0.000438,0.000568,0.000243,0.000358,0.000924,0.001082,0.001187,0.001737,0.001007,0.000777,0.000953,0.000379,0.000575,5.4e-05,8.3e-05,0.000776,0.000327,0.00028,2e-06,0.001781,0.001789,0.00104,0.000955,0.001206,0.001148,0.00035,0.000274,-0.000173,0.000902,0.000707,0.000143,0.000303,0.000103,0.001333,0.000908,0.000605,9.6e-05,0.000942,0.00175,0.000821,0.000974,0.000921,0.000797,0.000388,0.000789,0.001199,0.000354,0.000543,0.000242,0.000866,-3.8e-05,0.000443,-5.7e-05,0.000406,0.000369,0.000907,0.000899,0.000438,0.000307,0.000983
-0.000948,-0.000615,5.5e-05,-0.000285,-4.9e-05,9e-05,-0.000512,-5.7e-05,-0.000461,4e-04,-0.000945,-0.001328,-0.000117,-0.001027,-0.000618,-0.001188,-0.001544,-0.000951,-0.000932,-0.000373,-0.000443,-0.00027,-0.000397,-0.000274,0.000146,-0.000108,-0.00038,0.000403,0.001014,0.000469,-9e-04,-2.2e-05,-0.000231,0.000477,4.1e-05,-0.00066,-0.000273,-0.000821,-0.000162,-0.000166,-0.00032,-0.000214,0.000482,0.000115,-0.000285,-0.001366,-0.000974,-0.000171,-0.000546,-0.000175,-0.000798,-0.002301,-0.001292,-0.000382,-0.000814,-0.002393,-0.001263,-0.000115,-0.00056,-0.001497,-0.001224,-0.000404,-0.000162,-9.3e-05,-5.6e-05,-0.000718,-0.000979,-0.00071,-0.001413,-0.000453,-0.000446,-0.000357,-0.000452,-0.000348,-5.3e-05,0.00043,-0.000575,0.000362,0.000189,0.000425,-0.000805,-0.001467,-0.000744,-0.000947,-0.001155,-0.000927,-6.4e-05,0.000421,6.8e-05,-0.000185,0.000333,0.000219,-5.1e-05,-0.00021,-0.000892,-0.000455,-0.000189,-8.5e-05,-0.000555,-0.000828,-0.000256,-0.00064,-0.000621,-0.000381,-7e-05,-0.000807,-0.000467,-0.000415,-2.5e-05,0.000594,-8.4e-05,0.000519,0.000323,9e-04,-0.000342,0.000109,0.000457,-0.000393,4.6e-05,0.00075,-0.000383
0.000456,0.000334,-0.000599,0.000351,-0.000203,-0.000404,0.000267,-0.000348,5e-06,-0.000182,8.7e-05,0.000526,-0.000421,0.000356,3.9e-05,0.00041,0.001002,0.000797,0.000475,0.000125,-8.7e-05,0.000138,-3e-04,-0.000149,-0.000917,-0.000441,0.000288,-0.000376,-0.000637,-0.000871,0.00039,0.000149,-4.5e-05,-0.000624,-7.7e-05,-3.2e-05,0.000348,0.000346,-0.000368,0.000679,0.000393,5e-05,-0.000293,-0.000587,0.000413,0.000476,0.000484,-0.000486,7.9e-05,-0.000304,0.00016,0.001015,0.000625,-0.000362,0.000927,0.001257,0.000152,-0.000892,-5.6e-05,0.001086,0.000465,0.000197,-0.000318,0.000162,-0.00028,0.000366,0.000314,-0.000119,0.001208,0.00033,0.00018,-8.5e-05,0.000133,-0.000141,0.000175,-0.000552,3.5e-05,-0.000503,-0.000466,-0.000421,0.000397,0.000435,0.000141,0.000482,0.000963,0.000427,-0.000343,-0.000295,-0.000413,-7.9e-05,-0.000338,-0.000386,-0.000322,0.000112,0.00031,-0.000414,-0.000366,-0.000131,-0.000128,-0.000332,3.2e-05,0.000668,0.000185,0.000268,0.000209,0.000487,1.7e-05,0.000146,-0.000214,-0.000664,-0.000166,-0.000703,-0.000859,-0.001095,-1e-06,-0.000284,-0.000759,4.7e-05,7e-05,-0.000805,0.000459
6.4e-05,-0.00034,0.000243,-0.000418,-0.00036,0.000276,8.6e-05,9.3e-05,0.000263,0.000349,-0.000103,-0.000128,0.000287,0.000189,0.000225,-7e-05,-0.000894,-0.000301,-0.000368,-0.00046,0.000119,0.000151,0.000492,0.000512,0.000834,0.00067,-0.000383,-0.000555,0.000388,0.000915,-0.00018,-0.000158,9.7e-05,-1.3e-05,-5.5e-05,0.000212,-0.000404,-0.000272,0.000109,-0.000797,-0.000786,-0.000432,9e-05,3.7e-05,0.000244,-0.000252,-0.000404,0.000504,-0.000114,0.000117,-0.000143,-0.00034,-0.000389,0.000357,-0.000553,-0.000313,0.00026,0.000761,0.000228,-4e-05,3.4e-05,-0.000393,0.000196,-0.000352,-3.8e-05,-0.000237,-0.000172,0.000621,-0.000781,-0.000275,-0.000384,-0.000152,-0.000343,6.8e-05,1.8e-05,0.000641,0.000358,-2.4e-05,0.000731,-6.7e-05,6.7e-05,-0.000261,8.9e-05,-0.000235,-0.000866,-0.000633,-6.3e-05,-0.000265,9.7e-05,-0.000128,0.000124,0.000221,4e-04,-0.000438,-0.000234,0.000706,0.000453,0.000179,1.9e-05,0.000339,-4e-06,-0.000699,-0.000307,-0.000458,-9.2e-05,-0.000339,-0.000229,-0.000167,0.000168,0.000284,-3.6e-05,0.000326,0.000667,0.000855,-1.6e-05,-2.6e-05,0.000566,0.000141,8.4e-05,0.000172,-0.000305
0.000309,4e-06,-0.000333,0.000639,0.00071,-6.7e-05,0.000157,-0.00011,-5e-05,6.7e-05,1.2e-05,-0.000302,-0.000369,-0.000166,-0.000208,0.000347,7.5e-05,-7.5e-05,0.000318,0.000505,-7e-06,0.00022,-0.000609,-0.000607,-0.000388,-0.000581,0.000273,0.000615,-0.000408,-0.000515,0.000132,0.000299,0.000164,7.2e-05,0.000177,-1.6e-05,0.000413,5.1e-05,-0.000307,0.000389,0.00072,0.000454,9e-06,0.000187,-0.000621,0.000317,0.000627,0.000116,6.7e-05,0.000474,0.00018,4.8e-05,0.000349,-0.00017,-0.000108,-0.000301,-0.000813,-0.000582,-0.000287,-0.000392,0.000235,0.000525,-0.000111,0.000463,4e-06,-1.3e-05,0.000315,-0.000345,0.000328,0.00029,-7.5e-05,0.000455,0.000742,-4.2e-05,-2.2e-05,-0.000549,-0.000314,4.2e-05,-0.000269,-0.000148,-0.00011,0.000253,-0.000137,9.6e-05,0.000247,0.000449,0.000361,0.000475,4.6e-05,-0.000229,0.000124,1.8e-05,-0.000189,0.000474,8.7e-05,-0.000691,-0.00061,-0.000192,0.00013,3.7e-05,-0.000422,0.000252,0.000361,0.000313,-0.000126,0.000188,0.000603,0.000112,-0.000227,-0.000299,4.6e-05,-0.000179,-0.000309,-0.000481,0.000173,-8.6e-05,-0.000277,-0.000269,-0.000507,0.000576,0.00043
-0.000208,-0.000146,0.000103,-0.000478,-0.000282,-0.000126,-9.5e-05,-0.00015,-0.000439,-0.000106,0.000225,0.000194,-3.9e-05,0.000121,0.000473,-0.000381,0.000414,0.000138,3e-05,0.00016,0.000168,-0.000157,0.000564,0.000574,9.5e-05,0.000328,5.6e-05,-0.000389,0.000109,-1.8e-05,6e-05,-0.000463,-1.8e-05,0.000101,-0.000135,-0.000349,-0.000104,7.9e-05,-0.00019,-0.000294,-0.000568,-0.000337,0.00015,3e-05,0.000276,0.000123,-0.000526,1e-04,0.000157,-0.000483,-0.000875,7.6e-05,-0.000305,0.000165,3e-04,0.000295,0.00153,0.00074,0.000206,0.000255,0.000317,-0.000374,-0.000182,-0.000322,0.000195,0.000233,-0.00038,0.000371,-0.000215,1.2e-05,0.000248,-0.000293,-0.000418,0.000158,0.000161,0.000161,0.000217,-0.000177,-5.4e-05,0.000102,6e-06,-7.6e-05,0.000372,-4.6e-05,0.000134,-0.000371,-0.000111,-0.000136,-0.000132,-0.000106,-0.000148,3e-05,-0.00013,-0.000133,0.000149,0.000582,0.000457,0.000219,-0.000126,-7.1e-05,0.000456,0.000135,-0.000211,0.000116,0.000138,-3.2e-05,-0.000512,9e-06,0.000245,0.000384,0.000143,0.000485,4.4e-05,-9e-05,-0.000164,-0.000121,-0.00011,0.000347,0.000303,-0.000881,-0.000441
-0.000388,0.000151,-1e-06,9.3e-05,-8.7e-05,-0.00017,-3.8e-05,0.000213,0.000299,-0.000182,-0.000238,-0.000375,0.000192,9.8e-05,-0.000448,7.3e-05,-0.000372,-0.000232,-0.000241,-0.000439,-0.000228,4.2e-05,-0.000246,-0.000195,-0.000114,-0.00023,-0.000274,0.000196,6.2e-05,0.000378,-0.000301,0.000653,0.000108,-0.000223,0.000131,0.000354,-0.000173,-9.6e-05,0.000304,0.000714,0.000266,0.000268,0.000237,2.7e-05,-0.000267,-0.000532,0.000282,-0.000185,-0.000278,0.000204,0.000734,-9.6e-05,-6e-05,-0.000244,-0.000394,2.9e-05,-0.001066,-0.00058,0.000155,-0.00013,-0.000391,9e-05,0.000337,0.000102,-7.5e-05,-1.9e-05,0.000178,-0.000382,-6.8e-05,-0.000232,-0.000332,0.000169,8e-05,-0.000133,-9.7e-05,0.00019,-4.9e-05,0.000178,0.000226,5.5e-05,3e-06,-3.6e-05,-0.000311,-0.000241,6.3e-05,0.000166,0.000221,-0.000101,0.000404,0.000652,3.4e-05,-0.000136,4.8e-05,-4e-05,2.1e-05,-0.000372,1.7e-05,-7.4e-05,0.000369,5.4e-05,-0.000406,-0.000128,0.000129,-0.000234,-0.000108,-5.7e-05,0.000201,-9.9e-05,0.000142,-2e-04,-6.7e-05,-0.000382,-7e-06,0.000118,0.000163,-2.8e-05,5.3e-05,-0.000141,-0.000236,0.000648,0.000334
0.00031,9.9e-05,0.000178,6.1e-05,0.000112,0.000207,0.000154,0.00024,-0.00023,1.2e-05,7e-06,9.7e-05,-0.000168,-0.000437,4.3e-05,0.000106,0.000195,0.000152,0.000396,0.000259,0.000143,-8.2e-05,-3e-06,0.000118,-6.6e-05,-0.000162,0.000116,-0.000161,-0.000192,-0.000216,0.000272,-0.000243,-0.000225,0.000324,0.000245,-0.000279,7e-05,0.000158,-2.9e-05,-0.000897,8.9e-05,-0.000229,-0.000535,-1.8e-05,0.000146,0.000253,-0.000447,0.000107,-8.2e-05,5.6e-05,-0.000484,5.5e-05,0.000314,0.000211,0.000491,0,0.000499,0.000475,-0.00052,4.5e-05,-0.000163,-0.000237,-0.000203,-0.000122,8e-05,8.3e-05,-7.1e-05,0.000158,0.000324,8e-05,0.000324,0.000153,-3.2e-05,0.000107,0.000204,-2.4e-05,2.9e-05,-1.8e-05,-0.000159,-5e-06,-0.000316,-5.4e-05,8e-05,0.000278,-0.00013,5.5e-05,-0.000459,-0.000196,-0.000325,-0.000484,-3.2e-05,9e-06,6.9e-05,0.00011,-9.1e-05,0.000344,-4.7e-05,-8.6e-05,-0.000222,-6.7e-05,0.000361,0.000226,-3.6e-05,0.000178,4.4e-05,-1e-04,-8e-05,0.000162,5e-06,1e-06,-0.000106,4.2e-05,-0.000104,-0.000114,-0.000161,0.000399,-0.000194,-8.9e-05,5.5e-05,-0.000276,-3.6e-05
-6e-06,-0.000211,0.000234,9e-06,0.000106,-3e-05,-0.00013,-0.000136,0.000101,0.000181,-0.000164,0.000204,0.000256,0.000454,0.000117,-9.6e-05,-0.000255,-0.000318,-0.00025,-5.9e-05,-0.00014,0.000127,-7.2e-05,-8.4e-05,0.000241,9.8e-05,-5.3e-05,0.000233,-0.000152,3.6e-05,-0.000168,7.2e-05,0.000184,-0.000202,-0.000177,5.3e-05,-0.000342,-5.5e-05,0.000105,0.000523,-0.000114,0.000171,0.00026,-5.7e-05,-8e-06,0.000177,0.000178,1.2e-05,1.8e-05,-3e-06,0.000362,0.000151,-0.000173,-0.000204,-0.000331,-7.6e-05,-0.000187,-0.000131,0.00041,9.3e-05,1.6e-05,0.000241,0.000113,1.8e-05,-0.000162,-0.00018,-9.4e-05,-0.000151,-0.000387,-0.000122,-0.000286,-7e-06,-1.4e-05,-0.000259,-9.6e-05,-4.7e-05,-2.1e-05,2e-04,1e-06,1.2e-05,0.000411,0.000341,0.000248,-3.8e-05,8.6e-05,2.8e-05,0.000121,0.000207,0.000107,0.000342,6.7e-05,4e-05,4.7e-05,-0.000113,-2.1e-05,-0.00017,5.3e-05,1e-04,-0.000112,8.5e-05,-6.1e-05,-0.00012,-1.8e-05,-8.3e-05,-1.8e-05,0.000216,7e-06,-0.000112,-0.00023,-2e-06,0.000319,0.000189,6.8e-05,0.000257,-1.2e-05,-0.000398,0.000292,6e-05,-5.5e-05,0.000171,-0.000197
-5.3e-05,-4.6e-05,-0.000428,6.6e-05,-0.000133,2.5e-05,0.00011,-5.4e-05,-5.7e-05,-0.000191,0.000225,3.7e-05,-0.000333,-0.000398,4.2e-05,0.000126,0.000254,3e-05,0.000217,8.8e-05,0.000154,-4e-06,6.4e-05,7.7e-05,-0.000368,-7.5e-05,0.000135,-0.00019,0.000254,-3.2e-05,0.000158,-0.000107,-0.000124,6.5e-05,3.5e-05,-1.4e-05,0.000209,0.000109,-2.4e-05,-0.000287,3.4e-05,0.000136,-0.000327,5.1e-05,9.2e-05,-5e-06,4e-05,7.8e-05,0.000353,-6.7e-05,-8.3e-05,-0.000128,0.000195,0.000241,-9.1e-05,-8.1e-05,0.000258,-0.000181,-0.000211,-0.000116,0.000163,-8.3e-05,-2.5e-05,-5e-06,0.000153,6.5e-05,0.000105,0.000173,0.000238,0.000164,0.000218,-0.000123,-3.7e-05,0.000168,-0.000131,-8.8e-05,-9.3e-05,-0.000267,5.9e-05,4.8e-05,-6.7e-05,-0.00013,-0.000283,3.1e-05,-4.4e-05,-3.2e-05,1.4e-05,-1.6e-05,0.00011,-0.000317,-0.000274,-0.000211,-0.000154,0.000145,1e-05,0,-0.000167,-0.000116,0.000147,-7.3e-05,-0.000151,0.000107,5.8e-05,2.8e-05,2.5e-05,-0.000211,3.8e-05,-1.2e-05,0.000183,-3.3e-05,-0.000185,-0.000195,5e-05,-3.7e-05,0.000206,0.000257,-0.000219,-0.00015,5.3e-05,-0.000366,0.000317
8.5e-05,6e-06,0.000414,3.4e-05,0.000196,-2.8e-05,-0.000115,4.2e-05,0.000118,1.2e-05,-3.8e-05,-1.9e-05,0.000274,0.000148,-0.000117,-6e-06,-7.3e-05,0.000211,-9.2e-05,-7.8e-05,-0.000108,-9e-05,-0.000177,3.8e-05,0.000171,-3e-06,-6.7e-05,8.3e-05,-0.000142,5.8e-05,3.7e-05,7.3e-05,5.1e-05,8.4e-05,7.2e-05,-2.7e-05,8.8e-05,-5e-05,-4.4e-05,-6e-05,5.4e-05,-0.000246,0.000181,0.000193,1e-06,-0.00017,6.7e-05,-0.000182,-0.000161,5.9e-05,-8e-06,-7.6e-05,-0.000111,-0.000183,0.000295,7.1e-05,-0.000211,0.000203,0.000161,3.6e-05,-0.000144,0.000118,-2e-05,2e-05,-0.000115,-2.1e-05,-5e-06,-0.000172,-5e-05,-0.000164,-0.000138,-2e-06,5.8e-05,-0.000156,2.1e-05,6.2e-05,6.2e-05,2.5e-05,3.8e-05,-3.5e-05,-3.1e-05,-2e-05,0.000103,-1.9e-05,-1e-05,-3.2e-05,-5.4e-05,-3.1e-05,-7e-05,0.000134,0.000131,0.000182,0.000114,2.1e-05,5.6e-05,-3e-06,0.000162,3.7e-05,-0.000198,-3.2e-05,6.8e-05,1.8e-05,1.6e-05,-7.5e-05,0.000255,0.000182,-8.8e-05,1e-06,2.5e-05,-4.4e-05,4.3e-05,0.000139,-4.2e-05,-1.4e-05,-0.00012,-0.000128,0.000138,3.4e-05,-1.5e-05,0.000112,-0.000261
5e-05,3.4e-05,-0.000191,-9.7e-05,-0.000141,3e-05,4.9e-05,-6.8e-05,6.6e-05,7.6e-05,-0.000116,-4.4e-05,-1e-06,5.4e-05,0.000149,-0.000107,1.7e-05,-7.5e-05,2.1e-05,3.3e-05,0,-8e-06,0.000231,-5.7e-05,-1.5e-05,0.000178,-2.4e-05,-0.000168,4.8e-05,-0.000145,-0.000223,-2.5e-05,-0.000134,-0.000142,-0.000179,1.2e-05,-0.000145,5.3e-05,6e-06,0.000101,-1e-05,0.000121,-5e-05,-0.000173,-8.9e-05,0.00017,7.9e-05,0.000142,2e-05,-5.7e-05,-6e-06,2e-05,-2.4e-05,5e-06,-0.000241,-3.9e-05,8.5e-05,-8.6e-05,-2.7e-05,2.6e-05,-4.7e-05,8.5e-05,5.4e-05,4.6e-05,0.000202,2.1e-05,-1.1e-05,6.8e-05,1.3e-05,8.5e-05,0.000163,1e-04,-7.1e-05,1e-04,1.4e-05,-0.000102,-6e-05,0.00011,5.9e-05,6e-06,4.8e-05,5.4e-05,-2.9e-05,-0.000122,5.3e-05,-3.7e-05,2.6e-05,0.000102,5.6e-05,-7.4e-05,7.3e-05,-0.000158,-4.9e-05,-4.6e-05,-3.9e-05,2.7e-05,-0.000117,-7.8e-05,0.000114,8.5e-05,-2.1e-05,-2.5e-05,-9.3e-05,0.00011,-0.000291,-0.000151,-2e-06,9e-06,-0.000264,2.7e-05,-5.3e-05,-4e-05,-3.4e-05,-1.1e-05,4.8e-05,1.2e-05,-5.3e-05,-4e-05,-0.000135,7.5e-05,0.00017
-6.5e-05,0.00013,5.6e-05,-4.4e-05,7.5e-05,8e-06,-1.6e-05,6.5e-05,-5.7e-05,-2.7e-05,7e-05,4.9e-05,3.1e-05,5.7e-05,-0.000157,8.8e-05,-4.5e-05,2.8e-05,-0.000115,5.4e-05,-9e-06,2.5e-05,-0.000242,-1.2e-05,-3.8e-05,-0.000109,3.6e-05,8.9e-05,-2.1e-05,6.1e-05,0.000239,-4.3e-05,7.6e-05,3.8e-05,3.2e-05,3.3e-05,3.3e-05,-0.000112,-3.6e-05,-1.9e-05,0.000118,-8e-06,6.3e-05,8.2e-05,-4e-06,-0.00013,-0.000159,-0.000172,1.2e-05,-9e-06,4e-05,-4e-06,3.9e-05,5.4e-05,0.000132,2.9e-05,-9.3e-05,-3.9e-05,0.000106,-0.000114,0.000114,-0.000166,3.1e-05,-1.5e-05,-0.000124,-3.2e-05,6.2e-05,-4.8e-05,2e-05,-5e-06,-9.7e-05,-0.000138,5.9e-05,-6.3e-05,-7e-06,5.5e-05,1.1e-05,-5.4e-05,-9.8e-05,2e-06,-6e-05,-3.2e-05,-7.1e-05,7.4e-05,-8.8e-05,2.7e-05,-2.7e-05,-0.000184,-1.2e-05,2.6e-05,2e-06,0.000109,-6.8e-05,-5e-06,1.3e-05,-1.1e-05,0.000111,6.7e-05,-5.3e-05,7e-06,-5.7e-05,-3.3e-05,6.8e-05,-0.000121,7.6e-05,4.1e-05,5.4e-05,1.1e-05,0.000299,1.8e-05,1.5e-05,-5e-06,1.3e-05,3.8e-05,-1.3e-05,9e-06,0.000138,-2e-05,5.8e-05,-9.2e-05,-7.3e-05
-3.9e-05,-0.000159,-4e-06,2e-05,-6.1e-05,-1.4e-05,3.6e-05,5e-06,-1.4e-05,9e-06,1.8e-05,-0.000141,-5.4e-05,-1.6e-05,9.1e-05,-4.8e-05,-3.6e-05,-3e-05,0,2.2e-05,3.3e-05,-4.9e-05,8.1e-05,-3.3e-05,-3.7e-05,1.3e-05,-1.1e-05,-6.8e-05,5.2e-05,-5.2e-05,-6.6e-05,9.9e-05,-4.7e-05,6.9e-05,2.2e-05,2.4e-05,3.3e-05,-3.4e-05,2.8e-05,0.00011,-0.000187,-2.1e-05,-7.2e-05,-9.8e-05,4.8e-05,8.9e-05,0.000138,6.3e-05,2.2e-05,8.1e-05,2.5e-05,-2e-06,-5.3e-05,7.4e-05,-6.9e-05,-4.2e-05,0.000165,-2.4e-05,-5.7e-05,0.000135,1.8e-05,4.9e-05,-9.2e-05,-1e-06,1.1e-05,3.5e-05,-6.4e-05,6.5e-05,-5.4e-05,6e-06,3.6e-05,7.1e-05,-3.6e-05,5.9e-05,1.1e-05,-5.4e-05,6e-06,5.6e-05,4.3e-05,2.8e-05,2.7e-05,1.4e-05,3.5e-05,-8.4e-05,3e-06,3.6e-05,3.9e-05,7.5e-05,-4.5e-05,-6e-06,1.2e-05,-4.7e-05,7.3e-05,4.4e-05,1.5e-05,8e-06,-0.000115,4e-06,5.5e-05,-5.4e-05,0.000129,1e-06,-5.4e-05,6.8e-05,-4.8e-05,2e-06,-2.5e-05,-3e-06,-0.000217,-2e-06,1.7e-05,5.1e-05,2.8e-05,-3.6e-05,-4.4e-05,5.8e-05,-0.000167,3e-05,4e-06,6.9e-05,3.9e-05
1.6e-05,2.6e-05,2.3e-05,-3.8e-05,4.3e-05,3e-05,2.6e-05,-3.8e-05,-3.6e-05,-1e-06,-2.6e-05,0.000186,-3.6e-05,2e-05,-6.7e-05,7e-06,9.9e-05,-2.7e-05,-1.6e-05,-3.6e-05,-2.2e-05,6.3e-05,0,7e-06,2.3e-05,6.2e-05,1.8e-05,0.000104,-8.6e-05,5e-06,-6.7e-05,-0.000128,3.3e-05,-7.6e-05,-8e-06,-2.7e-05,-3.4e-05,4.1e-05,-2e-05,-0.000123,0.000164,3e-05,6.9e-05,2.3e-05,-6.3e-05,-8.3e-05,-4.7e-05,-2.4e-05,-1.3e-05,-1.7e-05,-2.3e-05,3.2e-05,1.6e-05,-6e-05,-2e-05,-3e-06,-0.000179,3.5e-05,-4.2e-05,-4.1e-05,-1.8e-05,-7.7e-05,1.4e-05,-2.4e-05,-5e-05,-9e-06,1.7e-05,-4.6e-05,3.5e-05,3.2e-05,-4.3e-05,-6.8e-05,-3.1e-05,-5.1e-05,-2.2e-05,3.1e-05,1.5e-05,-5.6e-05,-7.9e-05,2.4e-05,-3.1e-05,2.3e-05,-2e-05,7.4e-05,3.6e-05,9e-06,6.4e-05,-3.9e-05,4.6e-05,-1.8e-05,-1.2e-05,5.2e-05,-3.5e-05,3e-06,-9e-06,1e-05,6.5e-05,-2.5e-05,3.5e-05,3.1e-05,-3.8e-05,3.4e-05,2.6e-05,-2.1e-05,4.5e-05,-2.3e-05,1.5e-05,-1.5e-05,6.3e-05,-2e-05,-5e-06,0,-5.4e-05,3.9e-05,1.5e-05,-4.4e-05,5.5e-05,2.4e-05,1.9e-05,-4.8e-05,-3.5e-05
-3.7e-05,-1.2e-05,6e-06,6e-06,-2.9e-05,1.5e-05,-3.7e-05,9e-06,1.9e-05,-5e-06,6e-06,-4.3e-05,5.1e-05,-3e-06,5e-06,5.9e-05,-3.1e-05,1.8e-05,2.5e-05,-2.5e-05,1e-06,3.7e-05,2.5e-05,-9e-06,2.5e-05,-0.000108,-4.1e-05,-6.5e-05,2.8e-05,4e-06,6.4e-05,6.8e-05,-4.4e-05,3.6e-05,3.1e-05,2.2e-05,5.9e-05,-5e-06,-1.8e-05,0.000126,-0.000144,-3.3e-05,1e-06,1e-05,3.8e-05,1.2e-05,-1.5e-05,5.8e-05,1.3e-05,-2.6e-05,3.7e-05,-2.4e-05,2.6e-05,-1e-05,2.6e-05,0,9.3e-05,-4.5e-05,5.6e-05,-2.6e-05,-2.1e-05,7.3e-05,-1.6e-05,-7e-06,6.6e-05,-2e-05,-2.6e-05,2.7e-05,-9e-06,-2.9e-05,4.8e-05,3e-05,5.6e-05,4.7e-05,-2.6e-05,-6e-06,-1.2e-05,4.1e-05,4.4e-05,-1.3e-05,4e-06,7e-06,-2.2e-05,-4e-06,-2.7e-05,-2.2e-05,-5.3e-05,4e-06,3e-06,-1.2e-05,-2.4e-05,-1.9e-05,2.8e-05,-2.8e-05,5e-06,-4.5e-05,-3.7e-05,2e-06,-1.8e-05,-2.9e-05,-3.2e-05,-1e-06,-5.3e-05,-7e-06,1.8e-05,2.9e-05,-1.1e-05,1.6e-05,1.8e-05,1.3e-05,-1.5e-05,-3.1e-05,3.9e-05,-2.9e-05,-2.5e-05,-4.2e-05,-3.6e-05,-1.1e-05,2e-06,3.4e-05,-5.9e-05
-1.6e-05,-1.6e-05,-3.7e-05,2e-05,5.3e-05,0,2.7e-05,-2e-06,-2e-05,2.1e-05,-1.6e-05,1.3e-05,-3.8e-05,2e-05,-8e-06,-5e-05,-4e-05,2e-06,-2.7e-05,3.1e-05,-8e-06,-4e-05,6e-06,2.5e-05,-5.3e-05,5.2e-05,1.7e-05,-1.1e-05,-6e-06,3.2e-05,-4.6e-05,-2.4e-05,7e-05,-4.5e-05,-2.3e-05,-1.5e-05,-9.9e-05,-2.8e-05,1e-05,-0.000114,4.5e-05,1.3e-05,7e-06,-2.6e-05,1.6e-05,4.9e-05,-5e-06,-2.6e-05,-2.8e-05,-7e-06,-4.4e-05,2e-05,1.7e-05,1.3e-05,3e-06,3e-05,-9.9e-05,2.9e-05,-8e-05,4.4e-05,-7e-06,-8e-06,2e-05,3e-06,-3.2e-05,2.2e-05,-2e-06,8e-06,3e-06,-3e-06,-2.6e-05,-1.1e-05,-3.9e-05,-3.9e-05,2.6e-05,3.8e-05,1.5e-05,-2.4e-05,-2.2e-05,2e-06,4e-06,-7e-06,3.5e-05,3e-06,9e-06,-4e-06,8e-06,7e-06,-1.8e-05,-1.8e-05,-2e-06,3.4e-05,-1e-05,6e-06,1e-06,4.7e-05,4.1e-05,1.7e-05,3.5e-05,4.5e-05,6.6e-05,-1.7e-05,4e-05,0,-2e-06,0,2e-06,-6e-06,-7e-06,-1.1e-05,5e-06,1.6e-05,4e-06,1.2e-05,2.5e-05,3.6e-05,3.4e-05,2e-05,9e-06,-4.7e-05,5.1e-05
3.7e-05,1.6e-05,3e-05,1.1e-05,-6e-05,-1.5e-05,-3.2e-05,3e-05,2.3e-05,-1.5e-05,6e-06,-2.9e-05,5.8e-05,-3.4e-05,3.6e-05,1.7e-05,4.3e-05,-1.9e-05,3.3e-05,1.1e-05,1.3e-05,1.2e-05,0,-2.9e-05,5.8e-05,-2.4e-05,8e-06,3.5e-05,-2.2e-05,-4.8e-05,1.9e-05,2e-05,-5.1e-05,1.9e-05,4.4e-05,-3e-06,4.8e-05,2.8e-05,3e-06,5.6e-05,-1.1e-05,-4e-06,-5e-06,1.8e-05,-4.5e-05,-6.4e-05,-9e-06,2.8e-05,2e-05,2.7e-05,2.6e-05,7e-06,-1.2e-05,2.2e-05,-2e-05,-1.8e-05,8.5e-05,-2.7e-05,4.8e-05,-3.4e-05,2.1e-05,-2.3e-05,-1.1e-05,-1.2e-05,7e-06,1.4e-05,3.5e-05,1.7e-05,3.1e-05,-2e-06,2.7e-05,0,5e-06,3.3e-05,8e-06,-2.5e-05,-4e-06,2.8e-05,3e-05,1e-05,8e-06,4e-06,-8e-06,-3e-06,1e-06,1.9e-05,-3.8e-05,1.8e-05,-1.1e-05,4.8e-05,-1.6e-05,-6.1e-05,-3e-06,-3e-06,-7e-06,-3e-05,-2.9e-05,-1.6e-05,-3.1e-05,-3.2e-05,-7.3e-05,-1.1e-05,-1.1e-05,1.4e-05,1.3e-05,3e-06,-6e-06,4e-06,-3e-05,1.5e-05,-4e-06,-1.4e-05,-1.2e-05,-2.5e-05,-2.4e-05,-1.1e-05,-1e-06,7e-06,-3.4e-05,3e-05,-4e-05
-3e-06,1.1e-05,-5e-06,-3e-06,2.6e-05,8e-06,1.3e-05,-2e-05,3e-06,-1e-05,1.6e-05,3.4e-05,-5.1e-05,-5e-06,-1.5e-05,-8e-06,-1.7e-05,-4e-06,-1e-05,-2.2e-05,-6e-06,-2.8e-05,-5.2e-05,1.2e-05,-6.2e-05,1e-06,-2.3e-05,-1.7e-05,9e-06,2.5e-05,1.5e-05,1.3e-05,5.4e-05,2.5e-05,-4e-05,-8e-06,2.9e-05,-2.4e-05,8e-06,-6e-06,1.8e-05,8e-06,-4.5e-05,-5e-06,8e-06,9e-06,4.7e-05,-1e-06,3.4e-05,-3.9e-05,-1e-05,1.5e-05,5e-06,-2.3e-05,2.9e-05,-4e-06,-5.6e-05,2.8e-05,-3.5e-05,1.7e-05,-2.5e-05,4e-05,7e-06,1.8e-05,-2.9e-05,-1.3e-05,-2.6e-05,-3.2e-05,-3.7e-05,-8e-06,-3.5e-05,2.2e-05,3e-06,-3.3e-05,1.8e-05,2e-05,-1e-06,-3e-06,-1.1e-05,-1e-05,-9e-06,-1.1e-05,-2.2e-05,-2e-06,-2.1e-05,-1.1e-05,5.2e-05,-9e-06,5e-06,-2.9e-05,1.3e-05,4.1e-05,7e-06,1.3e-05,6e-06,2.5e-05,2.5e-05,0,1.1e-05,0,2.5e-05,-7e-06,-1e-05,-1.3e-05,-4.4e-05,-8e-06,-5e-06,-3e-06,3.5e-05,-9e-06,-1.5e-05,8e-06,3e-06,2.1e-05,1e-05,-5e-06,3e-06,-1e-05,1e-05,-2.8e-05,5.2e-05
-1e-06,-4.3e-05,-1e-06,-2.1e-05,-8e-06,4e-06,-2.5e-05,5e-06,-1.1e-05,5e-06,-1.2e-05,-4.6e-05,1.1e-05,1.1e-05,7e-06,1e-05,1e-05,1.1e-05,8e-06,-1.1e-05,-4e-06,1.4e-05,4.5e-05,-4e-06,3.7e-05,1.4e-05,2.4e-05,2.3e-05,8e-06,1.3e-05,-4.6e-05,-3.8e-05,-3.8e-05,-2.9e-05,1.8e-05,1.5e-05,-4.2e-05,5e-06,-9e-06,-3.2e-05,-4.6e-05,-4e-06,2.3e-05,-6e-06,6e-06,7e-06,-4.4e-05,0,-5.9e-05,2e-06,2e-06,-1.4e-05,-9e-06,-1.8e-05,-2.1e-05,1.9e-05,3e-05,-7e-06,3e-05,-1.4e-05,-2.1e-05,-1.9e-05,-1.1e-05,-4e-06,4.4e-05,-3e-06,1.4e-05,1.5e-05,1.8e-05,5e-06,2.7e-05,-2.6e-05,-1e-05,2.5e-05,-5e-06,-1.1e-05,4e-06,1.4e-05,4e-06,1.3e-05,-2e-06,7e-06,4.7e-05,-1.3e-05,2.2e-05,6e-06,-4.9e-05,3e-06,5e-06,1.6e-05,6e-06,-2.7e-05,-1e-06,-2.5e-05,3e-06,-3.2e-05,-3.9e-05,8e-06,-1e-05,4e-06,2.7e-05,8e-06,-5e-06,1e-05,3.1e-05,-6e-06,6e-06,-4e-06,-1.5e-05,-1e-06,2.5e-05,2e-06,0,-2.3e-05,-2e-06,3.4e-05,-6e-06,-1.1e-05,-4e-06,4.8e-05,-4.2e-05
2e-06,2.1e-05,-2.8e-05,1.8e-05,1e-06,0,1.5e-05,-1e-05,1.2e-05,4e-06,-7e-06,2.8e-05,-1.6e-05,-1.3e-05,1e-06,-6e-06,-3e-06,2.1e-05,6e-06,1.3e-05,4e-06,-3.4e-05,-2e-05,7e-06,-1.9e-05,-1e-06,-3.1e-05,-3.3e-05,1.2e-05,-1.4e-05,3.1e-05,4.6e-05,1.7e-05,8e-06,5e-06,-9e-06,3.1e-05,8e-06,7e-06,1.7e-05,1.2e-05,-9e-06,-8e-06,1.2e-05,-1.3e-05,4e-06,2.3e-05,-9e-06,1.8e-05,2.4e-05,6e-06,1e-06,7e-06,2.8e-05,-2e-06,-2.1e-05,-2.8e-05,5e-06,-1.4e-05,1.6e-05,1.9e-05,1.1e-05,-1e-06,1.2e-05,-3.6e-05,5e-06,5e-06,-6e-06,-1.4e-05,-1e-06,-8e-06,3.3e-05,1.3e-05,-1.6e-05,-9e-06,8e-06,-5e-06,-1e-05,-1e-06,-3e-06,2e-06,-6e-06,-1.2e-05,2.3e-05,-3e-06,1e-06,2.2e-05,8e-06,-1.6e-05,-2.3e-05,-1.8e-05,-8e-06,-7e-06,5e-06,-6e-06,4.1e-05,3e-05,-1e-05,-2e-06,1.2e-05,-2.6e-05,7e-06,1.2e-05,1e-06,-1.6e-05,-1e-06,-3e-06,4e-06,4e-06,0,-8e-06,-9e-06,0,2.3e-05,1e-06,-3.5e-05,7e-06,-1.1e-05,1.4e-05,-6.7e-05,3.4e-05
-7e-06,-1.2e-05,3.5e-05,-1.3e-05,3e-06,0,-4e-06,-3e-06,-1.4e-05,-7e-06,4e-06,-6e-06,-2e-06,2e-06,2e-06,-4e-06,-7e-06,0,-5e-06,3e-06,0,4e-05,9e-06,-6e-06,-1e-05,3e-06,3e-05,3.5e-05,-3e-05,-7e-06,0,-2.6e-05,-9e-06,-4e-06,-4e-06,2e-06,-2.7e-05,-5e-06,-1e-05,-1.5e-05,2.7e-05,1.6e-05,1.3e-05,-2.5e-05,1.3e-05,-2e-06,-1.1e-05,9e-06,1.2e-05,-1.6e-05,9e-06,8e-06,-1e-06,-2e-06,1.9e-05,3e-06,5.2e-05,-1e-06,1.8e-05,-1.3e-05,1.1e-05,-4.3e-05,1.3e-05,-4e-06,2.5e-05,1e-06,-1.4e-05,-1e-06,2e-06,9e-06,5e-06,-1.1e-05,-6e-06,1.5e-05,-1e-06,-3e-06,-5e-06,-2.2e-05,-1e-06,1e-06,-2e-06,-5e-06,-1e-05,-1.6e-05,-1e-05,3e-06,-1.9e-05,-2.3e-05,8e-06,8e-06,2e-05,2.5e-05,8e-06,4e-06,0,-4.3e-05,-7e-06,2e-06,1e-05,-1.2e-05,-8e-06,-1.7e-05,-4e-06,-4e-06,8e-06,6e-06,3e-06,-5e-06,-7e-06,-3e-06,-1e-05,7e-06,-4e-06,-1.6e-05,-3e-06,1.2e-05,-1.5e-05,0,-8e-06,5.6e-05,-1.5e-05
-1e-06,9e-06,-2.9e-05,1e-05,-1e-05,7e-06,-4e-06,4e-06,1.3e-05,5e-06,9e-06,3.1e-05,2.3e-05,1.3e-05,-5e-06,-1e-06,8e-06,-1.4e-05,-1e-06,-7e-06,-2e-06,-1e-05,-7e-06,6e-06,4e-06,1e-06,-1.2e-05,-2.6e-05,2.2e-05,2.2e-05,-4e-06,1.8e-05,-3e-06,-2e-06,-1e-06,8e-06,1.7e-05,-5e-06,6e-06,3.9e-05,-3.8e-05,-1.2e-05,-6e-06,1.7e-05,4e-06,-1.7e-05,-7e-06,-1.3e-05,-9e-06,-3e-06,-1.8e-05,-5e-06,1.5e-05,-1e-05,-9e-06,1.2e-05,-5.1e-05,1.4e-05,-1.4e-05,8e-06,-2e-06,2.3e-05,-1.2e-05,3e-06,-1.1e-05,-4e-06,1e-05,-3e-06,6e-06,0,-1e-05,-6e-06,3e-06,-1.7e-05,-3e-06,-3e-06,1e-06,3.5e-05,-2e-06,-2e-06,-3e-06,6e-06,2.6e-05,6e-06,7e-06,-2e-06,1.7e-05,1.5e-05,-1.3e-05,0,7e-06,-1.5e-05,-4e-06,-1e-05,0,3.6e-05,7e-06,2e-06,-8e-06,1e-06,3.1e-05,5e-06,-7e-06,3e-06,2e-06,-1e-05,-1e-06,2e-06,1.2e-05,0,1.3e-05,-2e-06,4e-06,1.1e-05,1e-06,-5e-06,-4e-06,1e-06,4e-06,-3.5e-05,0
-5e-06,-1e-06,-2e-06,1e-05,1e-06,-4e-06,1.3e-05,1.2e-05,-1e-05,2e-06,-8e-06,-4e-05,-3e-05,3e-06,-3e-06,1e-05,-1e-06,1e-06,7e-06,-1.1e-05,0,-7e-06,-3e-06,-6e-06,-8e-06,-3e-06,-1.3e-05,1e-05,-1.7e-05,-1.5e-05,-6e-06,-9e-06,-8e-06,1.7e-05,-1.2e-05,-1.2e-05,1.3e-05,1.1e-05,0,-4.4e-05,9e-06,6e-06,-8e-06,1.2e-05,0,2.1e-05,2.2e-05,7e-06,1e-06,6e-06,1e-05,-1e-05,-4e-06,-1e-05,-1.2e-05,-1.4e-05,3.8e-05,-1.4e-05,3e-06,-6e-06,-2e-06,-1e-05,6e-06,-5e-06,4e-06,0,-1.1e-05,3e-06,-1.1e-05,2e-06,7e-06,5e-06,-1e-06,1.7e-05,-3e-06,-3e-06,2e-06,-1.4e-05,-8e-06,-3e-06,4e-06,-6e-06,-2.1e-05,6e-06,-4e-06,-2e-06,4e-06,0,2e-06,1.7e-05,-8e-06,0,-2e-06,8e-06,4e-06,-2.7e-05,-1.2e-05,0,7e-06,8e-06,-4.2e-05,2e-06,8e-06,2e-06,1.2e-05,9e-06,-1e-06,2e-06,-1.1e-05,4e-06,-7e-06,1e-06,1e-06,-1.7e-05,4e-06,8e-06,5e-06,-8e-06,-1.6e-05,2.7e-05,1.2e-05
0,-1.6e-05,1.8e-05,-4e-06,8e-06,-5e-06,-1e-05,-4e-06,5e-06,-3e-06,-3e-06,2.7e-05,2.1e-05,-1.5e-05,4e-06,-1.2e-05,0,-1.2e-05,-4e-06,7e-06,0,1.6e-05,0,8e-06,1e-05,-1.3e-05,2.4e-05,-1.4e-05,1e-05,-4e-06,-1e-05,-3e-06,5e-06,-2e-06,1.5e-05,4e-06,-3.9e-05,-3e-06,0,4.5e-05,8e-06,2e-06,1.5e-05,-1.6e-05,-3e-06,2e-06,-2.7e-05,-8e-06,-2e-06,4e-06,2e-06,1.3e-05,-7e-06,1.9e-05,1.3e-05,6e-06,-2.7e-05,9e-06,-1e-06,3e-06,4e-06,5e-06,-1e-06,-5e-06,-1.6e-05,4e-06,-4e-06,4e-06,1.7e-05,-1e-06,-4e-06,-3e-06,-3e-06,-1.5e-05,-3e-06,-4e-06,-2e-06,1.5e-05,1.4e-05,0,0,-4e-06,1.1e-05,-9e-06,2e-06,1e-06,-4e-06,-1e-05,9e-06,-1.6e-05,-2e-06,1.8e-05,-4e-06,-1.3e-05,-2e-06,2.5e-05,5e-06,-2e-06,-4e-06,-5e-06,3.3e-05,2e-06,0,-5e-06,-1.5e-05,-6e-06,2e-06,-3e-06,-3e-06,0,-6e-06,-1e-06,-3e-06,1.2e-05,-5e-06,-4e-06,3e-06,4e-06,6e-06,-2.9e-05,-1.5e-05
1.2e-05,2e-06,-7e-06,5e-06,-1.2e-05,-1e-06,7e-06,-6e-06,-1e-06,3e-06,4e-06,-1.5e-05,-3.5e-05,2e-05,5e-06,2e-06,-7e-06,1e-05,6e-06,1.1e-05,-2e-06,-2.1e-05,2.2e-05,-6e-06,-1.9e-05,7e-06,-2.4e-05,1.8e-05,-1.8e-05,3e-06,2.9e-05,7e-06,-8e-06,-1.5e-05,-9e-06,-2e-06,2.6e-05,-2e-06,-1e-06,-3.3e-05,0,-1e-05,-2e-06,1e-05,-1e-05,-9e-06,1.7e-05,7e-06,-6e-06,-4e-06,-7e-06,-7e-06,2e-06,0,-5e-06,6e-06,2.4e-05,-1e-06,-1.3e-05,0,4e-06,1.5e-05,-2e-06,4e-06,2.5e-05,-6e-06,1.3e-05,-3e-06,-1.2e-05,-4e-06,4e-06,4e-06,3e-06,1.3e-05,-4e-06,2e-06,1e-06,-1.7e-05,-5e-06,2e-06,-2e-06,0,-5e-06,3e-06,4e-06,0,-5e-06,8e-06,-1.3e-05,-4e-06,-7e-06,-1.2e-05,2e-06,6e-06,-5e-06,-2.6e-05,-7e-06,4e-06,2e-06,3e-06,-2e-06,6e-06,4e-06,5e-06,6e-06,-3e-06,1e-06,1e-06,2.5e-05,0,1.6e-05,3e-06,4e-06,-1e-05,1e-06,-2e-06,-2e-06,1.1e-05,-2e-06,2e-05,1.2e-05
2e-06,-2e-06,-2e-06,-1.2e-05,5e-06,5e-06,-3e-06,2e-06,-1e-06,-6e-06,1e-06,6e-06,3e-05,-2.3e-05,-4e-06,5e-06,2e-06,2e-06,-7e-06,-7e-06,2e-06,2e-05,-2.4e-05,5e-06,1.9e-05,-5e-06,2.1e-05,-9e-06,2.5e-05,9e-06,-1.7e-05,-2e-05,8e-06,1.3e-05,2e-06,2e-06,-1e-06,5e-06,2e-06,1.2e-05,-1e-05,7e-06,5e-06,-6e-06,1.2e-05,-5e-06,-1.1e-05,-8e-06,1.5e-05,0,6e-06,0,-7e-06,-5e-06,-4e-06,-1e-05,-1.3e-05,-1e-05,1.7e-05,-5e-06,-4e-06,-2e-05,-4e-06,-6e-06,-1.8e-05,-2e-06,-8e-06,1e-06,5e-06,1e-06,-3e-06,-1.8e-05,0,-1.2e-05,-1e-06,-3e-06,2e-06,1e-05,0,0,0,1e-06,-1e-05,-2e-06,-5e-06,-1e-06,7e-06,-2e-06,6e-06,2e-06,-1e-06,1e-06,1e-06,2e-06,5e-06,2.3e-05,1e-05,-1e-06,-2e-06,-8e-06,-1.4e-05,-8e-06,-9e-06,-2e-06,-1.2e-05,4e-06,-2e-06,-1e-06,-3e-05,0,-1.2e-05,-3e-06,-2e-06,1.3e-05,5e-06,5e-06,7e-06,1e-06,1.1e-05,-6e-06,-9e-06
-7e-06,-1e-06,-9e-06,-3e-06,1e-06,0,2e-06,-1e-06,5e-06,0,-1e-06,-6e-06,-1.7e-05,1.4e-05,1e-06,-4e-06,4e-06,-3e-06,-3e-06,-8e-06,-3e-06,-1.3e-05,5e-06,-5e-06,-2.2e-05,0,-1.1e-05,6e-06,-2e-05,-1.8e-05,-1.2e-05,2e-05,-1e-06,-1e-05,1e-06,-3e-06,-9e-06,-3e-06,-1e-06,1e-06,4e-06,-1e-06,-1.2e-05,1e-06,-1e-05,1.5e-05,7e-06,5e-06,-6e-06,1e-05,-2e-06,5e-06,0,-8e-06,1.1e-05,6e-06,9e-06,0,-1.2e-05,8e-06,-9e-06,1.7e-05,9e-06,8e-06,1.4e-05,7e-06,1e-05,1e-06,2e-06,-5e-06,4e-06,1.2e-05,-2e-06,1.1e-05,3e-06,6e-06,1e-06,-9e-06,3e-06,0,0,-4e-06,-1e-06,3e-06,1e-06,2e-06,-5e-06,-2e-06,2e-06,-2e-06,4e-06,7e-06,4e-06,-4e-06,0,-1.7e-05,-2e-06,-2e-06,2e-06,6e-06,1.1e-05,2e-06,1.1e-05,-3e-06,5e-06,-3e-06,-1e-06,0,1.7e-05,-3e-06,1e-06,3e-06,-1e-06,-9e-06,-2e-06,-7e-06,1e-06,0,-3e-06,-5e-06,9e-06
4e-06,6e-06,1.6e-05,-2e-06,-3e-06,-1e-06,0,0,-7e-06,1e-06,-3e-06,5e-06,6e-06,-1.2e-05,-1e-06,9e-06,-2e-06,-3e-06,0,7e-06,0,2e-05,-1e-06,3e-06,1.4e-05,1.1e-05,-4e-06,-7e-06,1.2e-05,1.2e-05,2e-05,-1.3e-05,-2e-06,7e-06,-1e-06,6e-06,1.7e-05,-3e-06,1e-06,-5e-06,2e-05,-1e-06,0,1e-05,3e-06,-2e-06,6e-06,-2e-06,-1.1e-05,-8e-06,0,-4e-06,1e-05,1e-05,-1e-05,0,-1.5e-05,4e-06,7e-06,-7e-06,2e-06,-2.2e-05,-6e-06,-2e-06,-1.8e-05,0,-7e-06,0,-1e-05,3e-06,-2e-06,-2e-06,4e-06,-9e-06,6e-06,-4e-06,0,3e-06,-1e-06,-2e-06,0,2e-06,1e-05,-2e-06,2e-06,1e-06,3e-06,6e-06,-2e-06,1.1e-05,-1e-06,-1.1e-05,-7e-06,6e-06,-3e-06,1.2e-05,-2e-06,0,4e-06,-1e-06,0,5e-06,-6e-06,2e-06,8e-06,3e-06,3e-06,2e-06,2e-06,2e-06,1.2e-05,-2e-06,3e-06,7e-06,-3e-06,2e-06,-3e-06,3e-06,3e-06,7e-06,-6e-06
0,-9e-06,-9e-06,2e-06,6e-06,2e-06,-1e-06,2e-06,4e-06,0,0,1e-06,-4e-06,5e-06,0,-1.2e-05,3e-06,8e-06,-1e-06,2e-06,3e-06,-1.2e-05,4e-06,0,-7e-06,-1e-05,1.6e-05,3e-06,-7e-06,-1e-06,-1.2e-05,9e-06,1.2e-05,3e-06,1e-06,-3e-06,-2.1e-05,5e-06,-1e-06,5e-06,-2.1e-05,4e-06,0,-1.1e-05,1e-05,-7e-06,-1.8e-05,5e-06,1e-05,-1e-06,-3e-06,2e-06,-4e-06,-3e-06,4e-06,-5e-06,1.9e-05,-5e-06,0,5e-06,5e-06,1.3e-05,0,5e-06,1.8e-05,-4e-06,-2e-06,-1e-06,9e-06,-1e-06,-2e-06,-8e-06,-4e-06,6e-06,3e-06,5e-06,1e-06,5e-06,-7e-06,0,0,0,-1.6e-05,0,0,-4e-06,-8e-06,-6e-06,2e-06,-2e-06,6e-06,-1e-06,6e-06,-4e-06,2e-06,-8e-06,-5e-06,2e-06,-2e-06,-2e-06,-1.3e-05,-3e-06,3e-06,1e-06,-5e-06,-1e-06,-1e-06,-2e-06,-1.1e-05,-1e-06,-1.3e-05,1e-06,-2e-06,-7e-06,2e-06,5e-06,-7e-06,-2e-06,-8e-06,-8e-06,-2e-06
-9e-06,-1e-06,1e-06,5e-06,-6e-06,0,3e-06,3e-06,-5e-06,-1e-06,2e-06,0,-1.2e-05,-3e-06,-2e-06,8e-06,-4e-06,0,-3e-06,0,-1e-06,-2e-06,8e-06,0,-4e-06,6e-06,-1.6e-05,-1e-06,9e-06,-3e-06,7e-06,-8e-06,-1e-05,-7e-06,-4e-06,0,1e-05,-2e-06,1e-06,-1.3e-05,4e-06,-5e-06,2e-06,4e-06,-7e-06,1e-06,1.9e-05,-1e-06,4e-06,7e-06,5e-06,4e-06,2e-06,2e-06,2e-06,7e-06,-1.2e-05,-3e-06,4e-06,-4e-06,-2e-06,-1e-06,1e-06,-1e-06,-1.4e-05,2e-06,6e-06,1e-06,-6e-06,3e-06,3e-06,5e-06,0,-6e-06,1e-06,-3e-06,-1e-06,-4e-06,2e-06,-2e-06,1e-06,1e-06,5e-06,2e-06,2e-06,3e-06,6e-06,-1e-06,-1e-06,-6e-06,-2e-06,5e-06,-2e-06,4e-06,-2e-06,6e-06,5e-06,-2e-06,0,-3e-06,1.9e-05,1e-06,-5e-06,-4e-06,1.2e-05,1e-06,-1e-06,1e-06,7e-06,1e-06,1e-06,-1e-06,0,6e-06,1e-06,-4e-06,-1e-06,-5e-06,1e-06,1.1e-05,8e-06
1e-06,1e-06,5e-06,0,7e-06,-3e-06,-7e-06,-5e-06,4e-06,2e-06,1e-06,1e-06,1.8e-05,6e-06,-1e-06,-3e-06,1e-06,-1e-06,0,-6e-06,-2e-06,0,-7e-06,0,6e-06,0,1.1e-05,0,-1.3e-05,-1e-06,-2e-06,-1e-06,8e-06,1e-06,6e-06,0,8e-06,-3e-06,-2e-06,2.2e-05,1.8e-05,4e-06,4e-06,1e-06,-5e-06,1e-06,-1.4e-05,1e-06,-1e-05,-5e-06,-6e-06,-2e-06,-3e-06,-9e-06,-3e-06,-3e-06,4e-06,2e-06,-7e-06,2e-06,-2e-06,-3e-06,0,-3e-06,1.1e-05,1e-06,-6e-06,-2e-06,7e-06,0,0,2e-06,5e-06,7e-06,0,5e-06,-2e-06,5e-06,4e-06,1e-06,-1e-06,-1e-06,5e-06,-1e-06,-2e-06,1e-06,0,1e-05,5e-06,-5e-06,-4e-06,-5e-06,-1e-06,0,0,-3e-06,0,-1e-06,-2e-06,7e-06,-1e-05,-2e-06,6e-06,4e-06,-2e-05,0,2e-06,0,5e-06,-1e-06,1e-05,0,1e-06,-5e-06,-4e-06,-1e-06,4e-06,-4e-06,-2e-06,-1.2e-05,-1.2e-05
5e-06,-5e-06,0,0,-2e-06,-1e-06,5e-06,2e-06,1e-06,1e-06,-2e-06,-6e-06,-1.7e-05,-5e-06,1e-06,-1e-06,3e-06,-4e-06,1e-06,2e-06,3e-06,-1.5e-05,-1.2e-05,1e-06,-8e-06,-7e-06,-6e-06,2e-06,8e-06,9e-06,-1.4e-05,1.1e-05,-6e-06,1e-06,-3e-06,-1e-06,-1.8e-05,3e-06,2e-06,-2.5e-05,-2e-05,-3e-06,-1e-05,-4e-06,8e-06,8e-06,5e-06,-1e-06,7e-06,-1e-06,6e-06,0,-3e-06,9e-06,4e-06,-2e-06,-7e-06,1e-06,7e-06,1e-06,4e-06,9e-06,1e-06,0,-1.1e-05,-3e-06,5e-06,3e-06,-2e-06,1e-06,0,2e-06,-6e-06,-6e-06,-1e-06,-3e-06,0,-1.4e-05,-5e-06,-1e-06,0,1e-06,-5e-06,-1e-06,-1e-06,-2e-06,0,-8e-06,-1e-06,8e-06,5e-06,2e-06,0,1e-06,2e-06,0,4e-06,3e-06,1e-06,-3e-06,-2e-06,-1e-06,-5e-06,-1e-06,1.4e-05,-3e-06,-1e-06,0,-1.4e-05,0,-1e-05,1e-06,-1e-06,5e-06,2e-06,1e-06,2e-06,-1e-06,5e-06,1e-05,9e-06
-1e-06,5e-06,-7e-06,0,0,2e-06,-3e-06,2e-06,-1e-06,-1e-06,-2e-06,4e-06,1.8e-05,6e-06,1e-06,-2e-06,-3e-06,0,4e-06,7e-06,0,1.6e-05,1.2e-05,-2e-06,6e-06,6e-06,2e-06,-4e-06,-1e-06,-1.2e-05,2e-05,-1.2e-05,3e-06,-3e-06,1e-06,1e-06,1.3e-05,0,-1e-06,2.4e-05,1.2e-05,1e-06,1e-05,7e-06,-9e-06,-1.4e-05,2e-06,1e-06,-3e-06,3e-06,-3e-06,1e-06,1e-06,-2e-06,-3e-06,4e-06,7e-06,2e-06,-5e-06,-6e-06,4e-06,-7e-06,-1e-06,-6e-06,1.2e-05,0,-3e-06,-1e-06,-3e-06,-1e-06,-2e-06,-5e-06,4e-06,5e-06,0,2e-06,0,1.1e-05,3e-06,1e-06,0,2e-06,8e-06,2e-06,2e-06,-1e-06,1e-06,-4e-06,0,0,-1e-06,6e-06,-1e-06,2e-06,-2e-06,4e-06,-4e-06,-2e-06,1e-06,2e-06,1e-05,3e-06,2e-06,-1e-06,-1.2e-05,1e-06,0,0,1.1e-05,-2e-06,3e-06,0,0,-3e-06,0,1e-06,1e-06,0,0,-8e-06,-6e-06
0,-5e-06,5e-06,-4e-06,0,0,1e-06,-1e-06,1e-06,2e-06,2e-06,-4e-06,-1.8e-05,-3e-06,0,3e-06,0,0,1e-06,-2e-06,-1e-06,-8e-06,-1e-06,3e-06,-1e-05,-6e-06,5e-06,5e-06,-2e-06,7e-06,-5e-06,1.3e-05,-7e-06,9e-06,1e-06,-2e-06,-7e-06,-1e-06,1e-06,-1.6e-05,-8e-06,-1e-06,-6e-06,-7e-06,6e-06,3e-06,-8e-06,-2e-06,0,0,0,0,3e-06,6e-06,1e-06,-5e-06,-5e-06,-1e-06,-2e-06,9e-06,-2e-06,1.4e-05,-1e-06,3e-06,-1.3e-05,4e-06,0,1e-06,4e-06,0,2e-06,6e-06,-1e-06,-4e-06,-2e-06,-1e-06,-1e-06,-6e-06,3e-06,0,0,0,-3e-06,-1e-06,-1e-06,3e-06,-5e-06,9e-06,2e-06,6e-06,-2e-06,-8e-06,3e-06,-1e-06,0,-6e-06,-2e-06,-1e-06,0,-4e-06,-1.1e-05,-1e-06,-2e-06,2e-06,7e-06,0,0,-1e-06,-1e-06,1e-06,5e-06,0,-1e-06,3e-06,-2e-06,-4e-06,1e-06,0,0,9e-06,7e-06
2e-06,-3e-06,5e-06,-3e-06,2e-06,-1e-06,2e-06,-2e-06,-3e-06,-4e-06,0,6e-06,1e-05,-1e-06,-1e-06,0,0,3e-06,0,-5e-06,1e-06,1.4e-05,5e-06,-3e-06,7e-06,2e-06,-1e-05,-4e-06,-1e-06,4e-06,-1.2e-05,-1.2e-05,5e-06,-6e-06,-2e-06,3e-06,-1e-06,1e-06,0,7e-06,1.5e-05,-1e-06,9e-06,0,-1e-06,6e-06,1.4e-05,1e-06,3e-06,-4e-06,1e-06,-2e-06,1e-06,-1.2e-05,2e-06,2e-06,3e-06,3e-06,5e-06,-7e-06,-4e-06,-1.4e-05,-2e-06,-3e-06,1.3e-05,-1e-06,4e-06,-2e-06,-8e-06,-1e-06,0,1e-06,-3e-06,3e-06,-3e-06,-1e-06,0,3e-06,-3e-06,-1e-06,0,0,2e-06,0,1e-06,-1e-06,9e-06,-5e-06,-4e-06,-5e-06,-1e-06,9e-06,-3e-06,1e-06,0,8e-06,1e-06,2e-06,1e-06,4e-06,5e-06,-2e-06,1e-06,0,4e-06,-2e-06,0,0,-6e-06,0,-9e-06,-1e-06,1e-06,-3e-06,-1e-06,5e-06,2e-06,3e-06,-4e-06,-9e-06,-7e-06
-1e-06,2e-06,-7e-06,5e-06,0,-1e-06,-1e-06,1e-06,2e-06,2e-06,-1e-06,-5e-06,-5e-06,3e-06,1e-06,1e-06,1e-06,0,0,2e-06,-1e-06,-4e-06,-4e-06,3e-06,-8e-06,2e-06,1e-05,4e-06,3e-06,-8e-06,1e-05,8e-06,-1.2e-05,-3e-06,1e-06,-3e-06,1.5e-05,-1e-06,0,-2e-06,-2.1e-05,4e-06,-7e-06,5e-06,1e-06,-2e-06,-1.4e-05,-1e-06,-4e-06,3e-06,-1e-06,0,2e-06,7e-06,-3e-06,3e-06,-3e-06,1e-06,-4e-06,2e-06,0,7e-06,4e-06,4e-06,-1.2e-05,-5e-06,-4e-06,3e-06,8e-06,1e-06,2e-06,-4e-06,4e-06,-3e-06,-2e-06,2e-06,1e-06,-4e-06,0,1e-06,0,1e-06,3e-06,1e-06,0,-1e-06,-7e-06,-2e-06,5e-06,-5e-06,-1e-06,-9e-06,0,-1e-06,0,-1e-05,2e-06,0,1e-06,-2e-06,5e-06,1e-06,-1e-06,-1e-06,-5e-06,1e-06,1e-06,0,7e-06,1e-06,5e-06,1e-06,0,1e-06,3e-06,-2e-06,-3e-06,4e-06,-1e-06,7e-06,6e-06
-2e-06,-5e-06,3e-06,1e-06,-1e-06,0,1e-06,0,-2e-06,0,0,7e-06,1e-06,-8e-06,-1e-06,0,0,-3e-06,-2e-06,2e-06,0,0,-8e-06,-2e-06,2e-06,-1e-06,-7e-06,-5e-06,0,2e-06,-1e-06,-5e-06,1.3e-05,2e-06,-2e-06,-1e-06,-2.1e-05,0,0,-1e-06,9e-06,-3e-06,-1e-06,-7e-06,-1e-06,-3e-06,9e-06,1e-06,-2e-06,0,0,2e-06,-3e-06,-1e-06,4e-06,-5e-06,1e-06,-1e-06,1e-06,2e-06,2e-06,-4e-06,-1e-06,1e-06,1.1e-05,2e-06,2e-06,-2e-06,-4e-06,-2e-06,-4e-06,2e-06,-3e-06,3e-06,-2e-06,-3e-06,0,1e-06,0,0,0,1e-06,1e-06,-1e-06,-2e-06,1e-06,5e-06,5e-06,-4e-06,2e-06,2e-06,6e-06,1e-06,0,1e-06,1.2e-05,1e-06,-1e-06,0,-1e-06,-8e-06,-1e-06,0,2e-06,5e-06,-1e-06,-1e-06,-1e-06,-2e-06,-1e-06,4e-06,0,-1e-06,-2e-06,-1e-06,-2e-06,-1e-06,1e-06,0,-5e-06,-2e-06
-1e-06,2e-06,1e-06,4e-06,-1e-06,-1e-06,-1e-06,-1e-06,0,-1e-06,0,-1.4e-05,6e-06,8e-06,0,-1e-06,-1e-06,3e-06,-1e-06,1e-06,1e-06,-2e-06,8e-06,1e-06,0,3e-06,3e-06,5e-06,-5e-06,7e-06,2e-06,-2e-06,-1.2e-05,-1e-06,2e-06,2e-06,1.1e-05,2e-06,0,6e-06,9e-06,1e-06,1e-06,4e-06,-2e-06,-3e-06,-2e-06,-2e-06,6e-06,-2e-06,1e-06,-3e-06,-1e-06,6e-06,-2e-06,3e-06,1e-06,-1e-06,1e-06,-3e-06,-1e-06,0,0,0,-1.1e-05,3e-06,-1e-06,0,2e-06,2e-06,2e-06,2e-06,1e-06,-2e-06,1e-06,3e-06,0,3e-06,0,1e-06,0,-1e-06,-4e-06,-1e-06,1e-06,0,-5e-06,-4e-06,0,3e-06,2e-06,-6e-06,0,0,-2e-06,-1.4e-05,-3e-06,1e-06,-2e-06,-1e-06,5e-06,0,2e-06,-2e-06,-8e-06,-1e-06,1e-06,0,-2e-06,-1e-06,-8e-06,0,1e-06,2e-06,-2e-06,3e-06,-2e-06,-1e-06,4e-06,3e-06,-3e-06
1e-06,-1e-06,-2e-06,0,2e-06,0,1e-06,3e-06,1e-06,2e-06,1e-06,1.4e-05,-1.2e-05,-8e-06,-1e-06,4e-06,0,0,2e-06,-5e-06,-2e-06,-7e-06,6e-06,0,-6e-06,-1e-06,2e-06,-4e-06,6e-06,-6e-06,-4e-06,9e-06,1e-05,3e-06,0,-1e-06,5e-06,-2e-06,0,-1.2e-05,-1.7e-05,1e-06,-1e-06,0,-2e-06,7e-06,-5e-06,2e-06,-2e-06,2e-06,1e-06,2e-06,0,-1.2e-05,-1e-06,-1e-06,0,1e-06,1e-06,2e-06,-3e-06,8e-06,1e-06,2e-06,1.1e-05,-3e-06,-1e-06,1e-06,3e-06,-1e-06,-1e-06,-3e-06,0,2e-06,2e-06,-4e-06,0,-6e-06,-2e-06,1e-06,0,0,1e-06,1e-06,0,0,5e-06,2e-06,2e-06,4e-06,1e-06,7e-06,-1e-06,-1e-06,1e-06,1.5e-05,-2e-06,0,0,1e-06,0,0,-2e-06,0,3e-06,1e-06,-1e-06,0,1e-06,-1e-06,3e-06,-1e-06,0,-1e-06,3e-06,-2e-06,2e-06,1e-06,0,-2e-06,6e-06
1e-06,-4e-06,-2e-06,-4e-06,-3e-06,0,-2e-06,-1e-06,-1e-06,-2e-06,0,-1e-05,1.5e-05,6e-06,1e-06,-5e-06,0,0,0,-1e-06,-1e-06,1e-05,-7e-06,-1e-06,6e-06,0,-9e-06,4e-06,-3e-06,-4e-06,-4e-06,-1.2e-05,-5e-06,2e-06,-2e-06,-1e-06,-1.3e-05,-1e-06,0,1.8e-05,6e-06,-3e-06,4e-06,-5e-06,6e-06,-1e-06,1.1e-05,0,-3e-06,0,-3e-06,2e-06,-1e-06,6e-06,2e-06,-3e-06,-2e-06,-2e-06,-5e-06,-1e-06,1e-06,-1.2e-05,0,-4e-06,-1.1e-05,-1e-06,2e-06,2e-06,-7e-06,2e-06,2e-06,-2e-06,-2e-06,-2e-06,1e-06,5e-06,0,6e-06,3e-06,-1e-06,0,0,-1e-06,0,-1e-06,0,-2e-06,3e-06,-4e-06,-3e-06,0,-1e-05,1e-06,0,1e-06,-1.5e-05,0,0,1e-06,2e-06,-8e-06,-1e-06,1e-06,2e-06,-3e-06,0,-1e-06,0,3e-06,1e-06,4e-06,1e-06,-1e-06,1e-06,0,0,0,-2e-06,0,1e-06,-6e-06
