2.9e-05,5e-06,1.9e-05,1.7e-05,1.2e-05,1e-05,2.4e-05,2.9e-05,1.2e-05,1.1e-05,3.9e-05,7e-06,3.1e-05,1.3e-05,1.2e-05,1.4e-05,3e-06,1e-06,1.1e-05,1.5e-05,2.8e-05,5e-06,3e-06,1e-06,1.2e-05,2.1e-05,7e-06,1.1e-05,1.1e-05,1.2e-05,1.1e-05,2.2e-05,1.4e-05,1.3e-05,2.1e-05,7e-06,6e-06,3e-06,1.4e-05,8e-06,2e-06,0,5e-06,1.8e-05,8e-06,5e-06,1.1e-05,1.2e-05,1.6e-05,8e-06,1.5e-05,1.1e-05,3e-06,2e-06,5e-06,1.9e-05,2e-06,1.6e-05,3e-06,4e-06,1.8e-05,4e-06,1.3e-05,3e-06,1.1e-05,1.7e-05,4e-06,1.3e-05,1.4e-05,1.5e-05,1.1e-05,1.2e-05,6e-06,1.4e-05,2.4e-05,5e-06,9e-06,2.7e-05,2.8e-05,1.5e-05,1.5e-05,4e-06,3.9e-05,0,2.8e-05,4.5e-05,4e-06,1.6e-05,1.8e-05,7e-06,1.3e-05,2.3e-05,4e-06,1e-06,1e-05,6e-06,8e-06,1.7e-05,7e-06,1.6e-05,1e-05,1.5e-05,1.2e-05,1.7e-05,5e-06,3e-06,2.8e-05,2e-06,8e-06,3e-06,6e-06,6e-06,4e-06,1.8e-05,3e-06,5e-06,4e-06,4e-06,6e-06,7e-06,4e-06
4.2e-05,1.1e-05,4.3e-05,4.4e-05,5e-06,4.1e-05,6.5e-05,6.3e-05,2.3e-05,3.5e-05,4.6e-05,5e-05,2.2e-05,2.3e-05,6e-06,5.9e-05,2.3e-05,2.7e-05,4.1e-05,5.9e-05,5.8e-05,2.1e-05,1e-05,2.2e-05,3.1e-05,4.9e-05,1e-05,3.2e-05,6e-05,2e-05,8e-06,6.5e-05,2.3e-05,2.9e-05,5e-05,2.9e-05,1.8e-05,1.4e-05,3.7e-05,4.4e-05,1.7e-05,2.2e-05,2.7e-05,2.2e-05,2.9e-05,2.9e-05,2e-05,2e-05,4.9e-05,1.6e-05,2.5e-05,3e-05,2.3e-05,2e-05,3e-06,4.1e-05,5e-06,3.8e-05,3e-06,3e-06,3e-05,4e-06,4e-05,3.3e-05,1.3e-05,5.8e-05,1.1e-05,2.8e-05,3.8e-05,4.1e-05,3.1e-05,4.1e-05,1.8e-05,3.6e-05,4.2e-05,3.1e-05,3.1e-05,7e-05,5e-05,4.8e-05,5.9e-05,3.5e-05,0.000115,1.7e-05,6.9e-05,0.000122,3.3e-05,4.1e-05,4.4e-05,3.6e-05,3.1e-05,3.6e-05,1.1e-05,1e-05,3.6e-05,1.5e-05,4.5e-05,2.9e-05,1.9e-05,1.4e-05,3.5e-05,2.5e-05,4.8e-05,4e-05,2.4e-05,3.3e-05,4.6e-05,3e-05,2.6e-05,2e-05,9e-06,2.5e-05,1.3e-05,6.1e-05,3.1e-05,3.9e-05,1.3e-05,1.6e-05,3.4e-05,2.7e-05,1.5e-05
3.8e-05,4e-06,4e-05,9e-05,6.7e-05,2.9e-05,8.8e-05,8.6e-05,5.1e-05,2.5e-05,6.5e-05,6.5e-05,7.5e-05,6.3e-05,2e-05,9.7e-05,3.6e-05,8e-06,4.6e-05,1.3e-05,2.7e-05,3.9e-05,2.3e-05,5.2e-05,4.3e-05,5.6e-05,2e-06,1.5e-05,9e-06,2.9e-05,2e-05,5.5e-05,7.8e-05,2.1e-05,8.1e-05,5.1e-05,2.4e-05,4.2e-05,3.3e-05,4.4e-05,2.8e-05,6.4e-05,1.5e-05,3.4e-05,2.4e-05,1.9e-05,2.9e-05,5.5e-05,5e-05,4.8e-05,1.2e-05,1.1e-05,2.2e-05,2.7e-05,2.2e-05,5e-05,1.1e-05,3.7e-05,9e-06,2.3e-05,2.1e-05,5e-06,7.6e-05,1.4e-05,2.2e-05,4.3e-05,2.7e-05,6e-06,4e-05,4.3e-05,2.4e-05,2.3e-05,4.4e-05,6.6e-05,3.8e-05,3.4e-05,3.8e-05,5.3e-05,3.5e-05,5.8e-05,7.1e-05,4.8e-05,0.000125,7.5e-05,4.1e-05,5.5e-05,6e-05,9.2e-05,2.8e-05,6e-06,2.8e-05,5.4e-05,2.8e-05,4.1e-05,4.3e-05,2.7e-05,3.3e-05,6.1e-05,3.9e-05,4.4e-05,9e-06,1.5e-05,1.3e-05,5e-05,1.1e-05,5.7e-05,9.5e-05,2e-05,2.2e-05,1.9e-05,3.5e-05,5.5e-05,6.4e-05,4.2e-05,1.9e-05,2.8e-05,3.8e-05,6e-05,4.8e-05,4.4e-05,8e-06
8.4e-05,2.3e-05,4e-05,0.00015,2.2e-05,2.3e-05,9.6e-05,1.9e-05,8e-05,3.3e-05,0.000149,6.3e-05,2.9e-05,5.3e-05,8.6e-05,8.5e-05,0.000107,0.00011,8.7e-05,5.3e-05,0.000106,1.2e-05,3.7e-05,1.6e-05,4.8e-05,8e-05,2.7e-05,3.1e-05,5.4e-05,2.9e-05,1.4e-05,2.1e-05,4.2e-05,8.5e-05,1.5e-05,1.7e-05,2.9e-05,7.3e-05,0.000129,4.7e-05,7e-05,6.8e-05,4.6e-05,7e-06,4.9e-05,3.8e-05,2.2e-05,0.000111,6.8e-05,6.1e-05,7.1e-05,4.8e-05,3.2e-05,1.1e-05,2.6e-05,6.8e-05,6.2e-05,7.3e-05,4e-05,1.7e-05,6.5e-05,2.9e-05,9.6e-05,9.6e-05,2.5e-05,2.1e-05,5.4e-05,5.9e-05,6.5e-05,1.1e-05,4.7e-05,6.5e-05,6.4e-05,4e-05,0.00014,6.4e-05,7.5e-05,6.5e-05,6.4e-05,3.4e-05,0.000142,0.000101,0.00016,9.5e-05,9.6e-05,0.000173,7.4e-05,0.000123,5.3e-05,6.1e-05,3.1e-05,9e-05,6.2e-05,6.1e-05,3.9e-05,5.6e-05,9.5e-05,3.6e-05,5.6e-05,6.5e-05,2.5e-05,4.6e-05,8e-06,9.6e-05,4.6e-05,7.1e-05,5e-05,8.6e-05,6e-05,2.7e-05,2.4e-05,0.00011,6.4e-05,4.5e-05,6.5e-05,7e-06,5.6e-05,6e-05,6.1e-05,1.1e-05,2.3e-05
4.2e-05,4.2e-05,3e-05,0.000151,4.8e-05,4.8e-05,7e-05,7.1e-05,8.5e-05,0.000164,0.000205,0.000114,5.6e-05,2e-05,4.4e-05,2.7e-05,5.9e-05,8.3e-05,7.4e-05,7.1e-05,0.000183,1e-04,5.2e-05,8.9e-05,9.3e-05,0.000115,5e-05,4.7e-05,0.000128,3.7e-05,3e-05,2.4e-05,5.7e-05,0.00011,1e-05,5.6e-05,3.9e-05,8.6e-05,8.8e-05,5.6e-05,9.3e-05,2.3e-05,2.1e-05,6.7e-05,4.9e-05,2.4e-05,2.5e-05,0.000113,4.9e-05,9e-05,0.000135,0.000113,4.4e-05,3e-05,4.4e-05,2.1e-05,6e-05,1.9e-05,3e-05,6e-06,8e-05,7.6e-05,4e-06,4.1e-05,3e-05,4.4e-05,4.3e-05,3.9e-05,4.3e-05,3.4e-05,6.2e-05,0.000102,8e-05,1.9e-05,6.3e-05,9.7e-05,7.7e-05,2.4e-05,4.7e-05,1.9e-05,9.1e-05,3.2e-05,2.2e-05,2.8e-05,3.5e-05,0.00012,0.000121,0.000149,3.4e-05,8.6e-05,9.8e-05,0.00013,5.2e-05,9.3e-05,6.3e-05,5.7e-05,7.6e-05,5.1e-05,0.000104,0.000107,0.000103,0.000122,9e-05,0.000117,6.5e-05,9.3e-05,6.1e-05,9.7e-05,2.6e-05,4.5e-05,1.4e-05,7.5e-05,3.2e-05,6.6e-05,5.5e-05,5.7e-05,2.2e-05,5.5e-05,5.4e-05,4.7e-05,3.9e-05
0.000168,3.1e-05,1.5e-05,0.00025,9.5e-05,4.3e-05,0.000138,7.6e-05,5.8e-05,0.000168,5.8e-05,0.000122,0.000122,4.8e-05,0.00011,4.8e-05,0.000114,8.2e-05,7.2e-05,6.2e-05,0.000156,8.6e-05,0.000107,9.3e-05,0.000122,9.2e-05,4.3e-05,8.7e-05,6.3e-05,6e-05,8e-05,0.000107,5.8e-05,5.4e-05,0.000161,8.3e-05,3.6e-05,0.000116,7.6e-05,7.9e-05,1.9e-05,8e-06,8.3e-05,9.7e-05,5.8e-05,9e-05,5.8e-05,7.2e-05,7.3e-05,7.9e-05,0.000164,0.000116,9e-05,4.1e-05,7.6e-05,2.9e-05,9.8e-05,8.7e-05,3.7e-05,8.4e-05,6.1e-05,0.000158,7.2e-05,0.000111,2.3e-05,6e-05,3.3e-05,7.6e-05,6.8e-05,4.2e-05,0.000101,3.7e-05,2.2e-05,6.4e-05,7e-05,8e-05,2.4e-05,7.6e-05,0.00012,4.8e-05,7.2e-05,0.000117,3.3e-05,3.9e-05,8.1e-05,7.3e-05,0.000124,4.1e-05,8.5e-05,4.3e-05,7.6e-05,3.7e-05,0.000147,9.4e-05,3.4e-05,2.3e-05,9.5e-05,8.4e-05,0.000102,0.000132,3e-05,8.2e-05,0.000117,1e-05,9e-05,6.3e-05,5.2e-05,2.8e-05,9.1e-05,7.6e-05,4.3e-05,9.3e-05,3.5e-05,5.2e-05,6.1e-05,6.5e-05,3.6e-05,6.7e-05,0.000141,2.4e-05,4.5e-05
8.9e-05,8.3e-05,2e-05,0.000312,0.00014,6e-05,0.000143,0.000142,0.000121,0.00021,0.00017,0.000166,0.000227,8.8e-05,0.000187,5.5e-05,0.000155,0.000172,0.000103,0.000153,0.00024,0.000122,0.000266,0.000197,0.000276,0.000372,0.000176,7.6e-05,0.000201,0.00014,8.9e-05,0.000121,0.000219,0.000174,0.000286,0.000185,0.000175,8e-06,9.6e-05,0.00014,1.5e-05,2.6e-05,0.000173,0.000227,0.000161,0.000168,0.000165,0.000106,4.7e-05,0.000107,2.8e-05,0.000145,3.4e-05,0.000107,3.3e-05,0.000126,8.6e-05,8.1e-05,1.8e-05,9.1e-05,0.000114,0.000192,0.000138,0.000213,0.000177,7.4e-05,2.8e-05,7.6e-05,4.9e-05,0.000104,0.000119,7.7e-05,0.000146,0.000108,0.000106,6.1e-05,5.5e-05,9.1e-05,0.000245,7.8e-05,0.000118,0.000211,0.000108,5.3e-05,0.000123,8.5e-05,0.000137,0.000243,0.000157,0.000151,3.6e-05,2.4e-05,0.000222,0.000248,0.000192,0.000169,4e-05,3.5e-05,4.1e-05,5.8e-05,0.000149,4.9e-05,2e-05,8e-05,3.8e-05,5.4e-05,6.9e-05,3.6e-05,0.000139,0.000106,0.000149,0.000169,3.8e-05,4.2e-05,8.7e-05,4.9e-05,0.00015,0.000139,9e-05,0.000159,0.000123
0.000438,0.000454,0.000289,0.000361,0.000421,0.000331,0.00021,0.000197,0.000191,0.000205,0.000108,8e-05,0.000223,0.00024,0.000436,0.000287,0.000217,0.000173,3.7e-05,8.6e-05,6.1e-05,7e-06,0.00028,0.000281,0.000243,0.000127,0.000321,0.00021,0.000172,1.3e-05,6.1e-05,0.000233,0.000111,0.000103,0.000255,0.000187,0.000205,0.000166,0.000178,5.9e-05,0.000172,9e-05,0.000149,0.000208,8.3e-05,0.000156,0.000127,0.000117,6.7e-05,0.000181,0.000154,7.4e-05,0.000216,0.000183,9.3e-05,0.000212,0.000169,0.000214,0.000143,0.000113,0.000116,9.6e-05,0.000156,0.000129,0.000248,0.000266,0.000117,0.000151,0.000124,0.000198,3e-05,9.8e-05,0.000172,0.000221,0.000292,0.000241,0.000102,0.000169,0.000322,0.000379,0.000245,0.000289,0.000164,0.000192,0.00025,0.000135,0.000113,0.000173,0.000258,0.000119,7.4e-05,8.3e-05,0.000203,0.000185,2.9e-05,0.000184,0.00023,0.000128,1.8e-05,0.000116,7.4e-05,2.4e-05,9.6e-05,0.000108,0.000187,7.5e-05,0.000163,0.000159,0.000105,3.8e-05,0.000177,3.9e-05,0.000108,8.2e-05,9.2e-05,6.6e-05,0.000253,0.000179,0.000209,0.000189,5.2e-05
0.000291,0.000363,0.000122,0.000253,0.000435,0.000188,0.000105,0.000133,0.000334,0.000406,0.000385,0.000226,0.000275,0.000395,0.000303,0.000223,0.000262,0.000389,0.000343,0.000238,0.000151,0.00012,0.00022,0.000126,0.000242,0.000292,0.000315,0.00022,0.000301,0.00027,0.000153,8.1e-05,0.000188,0.000219,0.000198,0.000239,6.2e-05,7.2e-05,0.000215,0.000247,0.000254,0.000112,0.000139,8.9e-05,2.6e-05,0.000196,0.000109,0.000151,0.000129,0.000123,0.00011,0.000196,0.000356,0.000224,0.000156,0.000208,0.000205,4.9e-05,5.3e-05,0.000124,0.000189,0.000158,4.8e-05,0.000223,0.000146,0.000118,4.3e-05,0.000193,4.7e-05,8.3e-05,0.000238,0.000129,0.000264,7.4e-05,0.000123,0.000199,0.000138,0.000213,0.000179,0.000255,9e-05,0.000286,0.000122,9.9e-05,0.000238,2e-04,0.000104,0.000178,0.000187,0.000103,0.000221,0.000166,8.9e-05,9.1e-05,0.000115,0.000207,7.1e-05,0.00019,9.7e-05,0.000118,0.000137,0.00022,0.000235,0.000147,0.000186,0.000256,0.000264,9.6e-05,0.000224,0.000219,0.000131,0.000244,0.00021,0.000138,0.000131,7.6e-05,0.000245,8.1e-05,0.00014,8.9e-05,6.3e-05
0.000208,0.000164,0.000269,4e-04,0.000338,0.000294,0.000374,0.000135,0.000194,0.000399,0.000421,0.000379,7.4e-05,0.000208,0.000538,0.000458,0.000222,0.000448,0.000263,9.5e-05,0.000258,0.000313,0.000331,8e-05,0.000198,3.9e-05,0.000207,0.000192,0.000294,0.000305,0.00018,0.00011,0.000103,0.000353,0.000443,9.4e-05,0.000203,0.000176,0.000143,0.000154,4e-05,0.000183,0.000289,0.000194,0.000131,0.000157,0.000162,0.000121,5.4e-05,0.000111,1.9e-05,0.000208,0.000168,0.000112,7.8e-05,0.000235,0.000186,9.1e-05,0.000107,0.000167,0.000311,0.000257,0.000255,0.000328,0.00024,0.000108,2.9e-05,0.000197,0.000184,6.7e-05,0.000263,0.000298,0.00023,0.000159,1e-04,0.000222,0.000131,0.000195,0.000173,0.000151,0.000197,0.000317,0.000334,0.000176,0.000204,0.000116,0.000123,0.000161,0.000119,9.8e-05,0.000223,8e-05,9.6e-05,0.000146,0.000215,0.000265,0.000217,0.000349,0.00042,0.000369,0.000218,0.00017,0.000128,9e-06,0.000203,0.000354,8.4e-05,1.7e-05,0.00017,0.000134,0.000168,0.00021,0.000269,4.9e-05,0.000145,0.000138,0.000251,0.000315,0.000311,0.000272,0.000204
8.8e-05,0.000143,0.000214,0.000333,0.000133,0.000337,0.000313,0.000228,8.8e-05,0.000216,9.6e-05,0.000113,0.000137,6.6e-05,0.000277,0.000316,0.000209,0.000132,9.6e-05,0.000179,0.000109,0.000215,9.6e-05,0.000131,9.7e-05,0.000112,0.000175,6.9e-05,0.000196,7.8e-05,8e-05,0.000143,0.000155,0.000159,0.00013,0.000115,0.000182,0.000208,0.000127,0.000159,0.000198,0.000288,0.000191,0.000111,9.8e-05,0.000195,5.1e-05,0.000108,0.000104,2.2e-05,4.8e-05,0.000194,0.000169,8.8e-05,0.000147,0.000235,0.000169,0.000134,0.000117,0.000231,7.9e-05,4.8e-05,0.00015,0.00015,0.00015,0.000164,0.00018,0.000169,0.000117,4.9e-05,0.000206,0.000277,8.9e-05,7.9e-05,0.000218,0.000183,3.7e-05,0.000198,0.000196,0.000104,0.000241,0.000356,0.000125,0.000102,7.3e-05,0.000157,0.000164,0.00011,6e-05,6e-05,8.8e-05,9.1e-05,0.000179,0.000242,7.4e-05,0.000115,0.00017,0.000207,0.000252,0.000126,7.6e-05,0.000238,0.000148,2e-05,9.4e-05,0.000133,0.000117,2.5e-05,7.1e-05,2.7e-05,6.9e-05,0.000136,0.000162,0.000181,0.000114,9.9e-05,0.000223,0.000174,0.000156,0.00015,6.8e-05
6.2e-05,8.2e-05,9e-05,0.000144,7.6e-05,0.000162,5.6e-05,7.2e-05,4.9e-05,9e-06,7e-05,9.6e-05,4e-05,4.1e-05,0.000139,0.000108,7e-05,5.2e-05,7.2e-05,2.8e-05,7.1e-05,0.00012,2e-05,8.7e-05,2.2e-05,3.9e-05,4.1e-05,3.5e-05,7.9e-05,2.5e-05,4.5e-05,0.000103,2.2e-05,0.000109,3.1e-05,3.4e-05,0.000144,2.6e-05,2.6e-05,0.000158,8.6e-05,7.8e-05,3.6e-05,7.8e-05,3.5e-05,6.3e-05,3.2e-05,5e-05,1.8e-05,3.8e-05,6.2e-05,6.1e-05,3.1e-05,2.4e-05,9.1e-05,7.4e-05,3.1e-05,3.9e-05,8.5e-05,4.2e-05,8.5e-05,7.2e-05,5.1e-05,1.8e-05,0.000106,3.1e-05,5.2e-05,7.7e-05,4.5e-05,0.000112,3.9e-05,0.000105,6e-05,7.6e-05,9.4e-05,3e-05,7.5e-05,4.6e-05,1.4e-05,9.5e-05,0.000127,9.3e-05,3.9e-05,8.5e-05,7.1e-05,5.3e-05,3.9e-05,4.9e-05,5.5e-05,3.6e-05,4.9e-05,7.5e-05,0.000108,3.4e-05,2.2e-05,5.7e-05,8.4e-05,9.8e-05,8e-05,5e-05,6.7e-05,7.2e-05,5.4e-05,4.7e-05,5.6e-05,6.3e-05,2e-05,4.9e-05,5.7e-05,2.2e-05,1.6e-05,9.3e-05,3.4e-05,4.8e-05,1e-05,6.4e-05,8e-05,1.6e-05,0.000108,3.5e-05,3.6e-05
4.6e-05,6.5e-05,3.3e-05,6.4e-05,9.1e-05,8.8e-05,5.5e-05,6.1e-05,5.1e-05,8e-05,3.3e-05,5.8e-05,0.000114,1.1e-05,8.1e-05,3.5e-05,6.7e-05,4.3e-05,7e-05,4.3e-05,8.8e-05,2.8e-05,9.8e-05,0.000113,3.8e-05,2.5e-05,4e-05,5.8e-05,5.9e-05,4.4e-05,3.5e-05,7e-05,2.2e-05,4.2e-05,5e-06,4e-05,7.7e-05,1.8e-05,2.6e-05,9.3e-05,5.2e-05,2.5e-05,4.1e-05,4.3e-05,4.1e-05,3.6e-05,1.2e-05,3.5e-05,5.2e-05,2.8e-05,3.3e-05,4.2e-05,9.8e-05,9.8e-05,1.4e-05,5.1e-05,4.4e-05,6.5e-05,5e-05,5.8e-05,4.3e-05,1.1e-05,4.6e-05,3.8e-05,9.2e-05,3.3e-05,4.4e-05,4.5e-05,2.7e-05,9.2e-05,7.6e-05,8.3e-05,5.6e-05,3.9e-05,7.1e-05,2.2e-05,7.9e-05,4.6e-05,5e-05,7.1e-05,5.8e-05,7.9e-05,2.4e-05,2e-05,3.4e-05,5e-05,2.5e-05,3.4e-05,4.7e-05,2e-05,4.7e-05,5.3e-05,3.3e-05,6.6e-05,3e-06,6e-05,8.9e-05,7e-05,3.4e-05,4.4e-05,4.1e-05,6.4e-05,2.6e-05,1.6e-05,3.5e-05,4.1e-05,3.1e-05,1.4e-05,4.6e-05,7e-06,4.3e-05,5.3e-05,1.2e-05,1.1e-05,3e-06,1.1e-05,3.6e-05,5.2e-05,8.4e-05,3.8e-05,1.8e-05
6.8e-05,0.000101,5e-05,6.1e-05,8.2e-05,0.000102,0.000103,0.000106,8.1e-05,4.6e-05,2.8e-05,4.9e-05,4.6e-05,7.1e-05,6e-05,2.2e-05,0.000122,3.1e-05,7e-06,2.8e-05,0.000101,7.5e-05,0.000113,0.000112,3.1e-05,2e-05,5.4e-05,8e-05,4.7e-05,0.000105,5.6e-05,5.4e-05,3.1e-05,8.2e-05,1.8e-05,1.5e-05,7.1e-05,5.1e-05,5.6e-05,1e-05,5.7e-05,7.6e-05,3.5e-05,7.1e-05,5.2e-05,4.3e-05,2.8e-05,5.7e-05,8.8e-05,8.2e-05,8.1e-05,6.1e-05,0.000125,6.6e-05,6.8e-05,1.9e-05,8.7e-05,9e-05,0.000111,0.000102,4.9e-05,4.5e-05,6.4e-05,9.3e-05,5.7e-05,9.5e-05,0.000103,0.000115,9.6e-05,6.9e-05,2.8e-05,4.3e-05,9.9e-05,8.8e-05,4.1e-05,5.8e-05,5.7e-05,3.6e-05,4.9e-05,6.5e-05,2.3e-05,3.1e-05,2.8e-05,5.5e-05,0.000104,0.000111,9.4e-05,4.2e-05,6.7e-05,8.7e-05,4.8e-05,9.8e-05,2.3e-05,0.000133,8.2e-05,8.3e-05,5.6e-05,6.8e-05,5.8e-05,5.4e-05,7.9e-05,2e-05,3.2e-05,2e-06,7.3e-05,5.6e-05,4.2e-05,4.2e-05,2.3e-05,8e-06,3.3e-05,7e-06,7.5e-05,6.5e-05,3.8e-05,9e-06,4.2e-05,6.1e-05,5.5e-05,3.2e-05,1.3e-05
9.6e-05,0.000102,6.2e-05,5.6e-05,3.9e-05,0.000154,8.8e-05,8.2e-05,6.3e-05,2.2e-05,3.4e-05,1.7e-05,7.3e-05,0.000153,0.000142,7.4e-05,0.000105,0.000111,5.5e-05,6.7e-05,7.8e-05,3.8e-05,6.6e-05,0.000177,7.9e-05,3.7e-05,5e-05,7.4e-05,6.8e-05,6.3e-05,5.1e-05,1.9e-05,3.6e-05,6e-05,4e-05,7e-05,7.9e-05,0.000142,6.5e-05,7.3e-05,9e-05,5.8e-05,4.7e-05,0.000137,8.3e-05,2.7e-05,4.7e-05,5.5e-05,2e-05,5.7e-05,0.000101,1.5e-05,3.2e-05,3e-05,1.4e-05,1.5e-05,0.000125,4.3e-05,0.000103,6.7e-05,4.9e-05,6.4e-05,0.000123,7.8e-05,4.1e-05,7.7e-05,4.3e-05,6.6e-05,4e-05,2.5e-05,1.9e-05,1.7e-05,9.1e-05,6.2e-05,2.3e-05,4.8e-05,4.3e-05,5.2e-05,2e-05,5.6e-05,4.6e-05,1.7e-05,2.7e-05,2.1e-05,0.00012,4.7e-05,7.2e-05,6.2e-05,4.4e-05,0.000108,8.9e-05,9.6e-05,9.2e-05,0.000117,8.4e-05,4.1e-05,5.7e-05,0.000122,7.6e-05,7.7e-05,7.8e-05,8e-05,3.6e-05,4.8e-05,9.4e-05,6.1e-05,2.2e-05,5e-05,6.5e-05,1.2e-05,2.8e-05,6.1e-05,7e-05,3.7e-05,4.4e-05,5e-05,5e-05,1.9e-05,7.1e-05,5.8e-05,1.6e-05
7.7e-05,1.1e-05,4.7e-05,0.000147,7e-05,3.2e-05,4e-05,3e-05,4.5e-05,0.000127,0.000109,2.5e-05,0.000108,0.000122,4.7e-05,8.3e-05,0.00012,7.5e-05,0.000106,9.9e-05,0.000108,7.2e-05,6.8e-05,0.000151,0.000126,4.7e-05,1.9e-05,3.6e-05,1.4e-05,7.9e-05,6e-05,2.3e-05,4.7e-05,7.8e-05,0.000101,1e-05,5e-05,5.3e-05,2.2e-05,0.000104,0.000172,0.000105,8.6e-05,0.000129,7.6e-05,8.4e-05,6.1e-05,6.8e-05,0.000111,2.5e-05,0.000147,9.7e-05,0.000109,2.6e-05,1.9e-05,6.8e-05,7.8e-05,4.8e-05,9.1e-05,0.000106,5.6e-05,3.7e-05,9.4e-05,9.3e-05,6.7e-05,6.5e-05,2.1e-05,6.3e-05,3.7e-05,4.3e-05,8.2e-05,5.9e-05,3.8e-05,1.9e-05,8.8e-05,6.8e-05,8e-06,5.8e-05,9.5e-05,8.6e-05,6.7e-05,1.5e-05,6.5e-05,2.3e-05,0.00011,0.000143,3.5e-05,2.6e-05,5.9e-05,6.2e-05,6.7e-05,8e-06,2.9e-05,8e-06,3.1e-05,5.8e-05,5.2e-05,9.5e-05,7.4e-05,2.4e-05,8.2e-05,3.1e-05,3e-05,3.3e-05,0.000108,0.000108,8.5e-05,1.4e-05,4.6e-05,6.2e-05,6.6e-05,3e-05,5.7e-05,9.3e-05,4.7e-05,7.4e-05,6.3e-05,3.3e-05,2.7e-05,3.4e-05,6.1e-05
4.5e-05,4e-05,2.3e-05,0.000192,0.00013,1.8e-05,0.000113,1.8e-05,0.000103,0.000103,7.2e-05,0.000101,8.8e-05,0.00014,0.000175,0.000175,5.9e-05,8.5e-05,6.3e-05,8.3e-05,0.000109,2.7e-05,0.000118,0.000196,4.8e-05,3.4e-05,5.3e-05,1.2e-05,4.9e-05,3e-05,7.5e-05,1.8e-05,5.9e-05,6.5e-05,4.1e-05,4.3e-05,8.1e-05,5.3e-05,9.9e-05,0.000163,0.000101,6.8e-05,0.000185,5.2e-05,4.7e-05,6.7e-05,9.8e-05,8.5e-05,0.00013,0.000134,0.000146,0.000181,0.000137,3.3e-05,1.3e-05,0.000109,1e-04,6.3e-05,8.7e-05,7.9e-05,4e-05,7.3e-05,0.000149,0.000158,0.000134,3.7e-05,7.1e-05,8.6e-05,4.2e-05,8.1e-05,3.9e-05,1.9e-05,7e-06,3.2e-05,7.3e-05,0.000127,0.000129,0.000102,0.000111,4.3e-05,2.9e-05,5.7e-05,9.2e-05,0.000123,2.4e-05,6e-05,6e-05,7.3e-05,2.9e-05,5.5e-05,0.000135,0.000151,9e-05,5.8e-05,6e-05,9.4e-05,0.000103,5.5e-05,3.4e-05,6.3e-05,0.000102,7.6e-05,3.5e-05,3e-05,3.4e-05,3.9e-05,7.1e-05,6.3e-05,4.8e-05,8.2e-05,0.000161,0.000135,0.000105,4.5e-05,4e-05,8.1e-05,2.9e-05,4.4e-05,7.1e-05,4.8e-05,8.6e-05
0.000139,3.6e-05,3.3e-05,0.000104,7.9e-05,0.000107,0.000164,0.000104,0.000122,3.8e-05,7.1e-05,8.5e-05,0.000103,0.000101,0.000115,6.5e-05,9e-06,5.2e-05,7e-05,9.6e-05,7.8e-05,0.000116,0.00019,0.000157,0.000142,9.8e-05,1.9e-05,4.3e-05,4.9e-05,3.5e-05,5.6e-05,6.4e-05,7.6e-05,1.2e-05,5e-05,2.9e-05,0.000123,9.7e-05,7.7e-05,6.8e-05,4.5e-05,4.3e-05,8e-05,9.4e-05,0.000104,5.9e-05,1.4e-05,0.000119,7.4e-05,5.9e-05,4.3e-05,7.5e-05,1e-04,7.5e-05,1.2e-05,7.9e-05,0.00011,4.8e-05,3.4e-05,3.5e-05,3.7e-05,8.8e-05,4.5e-05,6.4e-05,5.8e-05,0.000105,5.3e-05,7.5e-05,4.8e-05,7e-05,6.6e-05,3.8e-05,2.5e-05,3.2e-05,4.6e-05,8.3e-05,4.3e-05,8e-05,2.8e-05,2.7e-05,2.3e-05,5.3e-05,0.000101,0.000102,1e-04,6e-05,7.1e-05,4.2e-05,2.1e-05,3.5e-05,6.7e-05,6.8e-05,0.000136,0.000127,8.3e-05,3.5e-05,4.5e-05,9e-06,1.8e-05,9.5e-05,2.7e-05,3.8e-05,8.4e-05,5.8e-05,1.8e-05,9.3e-05,6.1e-05,1.3e-05,5.2e-05,4.2e-05,0.000105,1.9e-05,6.1e-05,2.6e-05,9e-06,5.5e-05,8.5e-05,7.2e-05,1.6e-05,2.2e-05,2.3e-05
9.7e-05,0.00018,0.000158,0.000105,9.5e-05,5.5e-05,3.7e-05,2.9e-05,5.6e-05,8.4e-05,0.000106,2.5e-05,4.9e-05,3.8e-05,6.6e-05,4.5e-05,6.9e-05,5.1e-05,5.1e-05,5.8e-05,8.5e-05,0.000114,2.7e-05,7.5e-05,4e-05,4.3e-05,7.2e-05,4.3e-05,4.9e-05,1.7e-05,6.8e-05,1.3e-05,5.3e-05,4.2e-05,4.8e-05,3.3e-05,9.1e-05,7e-05,4.8e-05,8.4e-05,8e-06,1.8e-05,4.2e-05,4.8e-05,5.6e-05,8.7e-05,0.000103,0.000128,0.000109,4e-05,4.3e-05,5e-05,1.1e-05,1.2e-05,4.1e-05,5.2e-05,6.9e-05,3.4e-05,2.9e-05,3.3e-05,2.3e-05,5.7e-05,3.3e-05,6e-05,5e-05,4.6e-05,9e-06,4e-05,6.4e-05,4.2e-05,4.2e-05,5.3e-05,1.5e-05,2.4e-05,4.4e-05,9.2e-05,9.6e-05,0.000107,2.8e-05,1.5e-05,3.4e-05,3.9e-05,7e-05,2.3e-05,7e-05,3.6e-05,7e-05,9.2e-05,4.6e-05,1.6e-05,3.1e-05,6.9e-05,6.4e-05,3.6e-05,7.2e-05,6.6e-05,6.4e-05,4.3e-05,4.4e-05,6.5e-05,3.9e-05,5.1e-05,2.7e-05,1.5e-05,2.7e-05,0.000101,5.1e-05,3.7e-05,3.3e-05,7.4e-05,2.6e-05,4.4e-05,4.3e-05,3.7e-05,7e-05,2.3e-05,5.5e-05,3.5e-05,4.1e-05,2.1e-05,1.3e-05
3e-05,0.000122,8.7e-05,6.4e-05,2.9e-05,3e-05,6.1e-05,4.8e-05,5.8e-05,0.00012,5.2e-05,3.5e-05,4.2e-05,5.6e-05,0.000132,4.5e-05,6.5e-05,5e-05,6.3e-05,5.4e-05,3.7e-05,2.7e-05,4.7e-05,1.2e-05,2.4e-05,5.9e-05,1.1e-05,3.5e-05,3.6e-05,2.6e-05,5.2e-05,8.3e-05,4.2e-05,2.6e-05,6.9e-05,7e-05,7.3e-05,5.8e-05,7e-06,3.3e-05,5e-05,3.6e-05,7.7e-05,9e-06,3.1e-05,4.6e-05,2.2e-05,7.1e-05,5.2e-05,2.4e-05,3.3e-05,3.9e-05,4.1e-05,8e-06,3.7e-05,8.2e-05,2.4e-05,4.2e-05,5e-06,4.5e-05,5.7e-05,5.7e-05,7.8e-05,6.7e-05,4.2e-05,3.5e-05,1.1e-05,5.5e-05,2.7e-05,3e-06,4e-05,4.1e-05,4.4e-05,5.4e-05,7.6e-05,8.9e-05,3.1e-05,0.000107,7.8e-05,5.4e-05,1.9e-05,2.4e-05,8.1e-05,5.7e-05,6e-05,6.3e-05,2.5e-05,4e-05,8e-06,4e-05,8.5e-05,9.6e-05,7.4e-05,1.5e-05,4.6e-05,6.5e-05,6.9e-05,5.6e-05,1.2e-05,3e-05,4.1e-05,3.3e-05,5.3e-05,1.4e-05,1.3e-05,6.3e-05,3.1e-05,2e-05,2.9e-05,4.3e-05,1.9e-05,2e-05,2.7e-05,2.6e-05,7.2e-05,5.6e-05,4.2e-05,1.2e-05,3e-05,1.8e-05,5.2e-05
3.4e-05,9.7e-05,4.5e-05,3.1e-05,6.9e-05,2.4e-05,7.2e-05,7.4e-05,9e-06,8.8e-05,6.1e-05,2.3e-05,7e-06,4.2e-05,0.000128,6.1e-05,5.4e-05,4.6e-05,9.8e-05,3e-06,2.8e-05,1.8e-05,8.1e-05,4e-06,9e-06,4.2e-05,7e-05,3e-05,1e-05,2.3e-05,2.4e-05,5.8e-05,8.2e-05,7.5e-05,6.5e-05,5.5e-05,6.6e-05,2.1e-05,7.9e-05,3e-05,2e-06,3.3e-05,6.4e-05,2.3e-05,3.5e-05,6.4e-05,5.1e-05,1.1e-05,2.9e-05,2.9e-05,3.4e-05,7.2e-05,5.4e-05,5.4e-05,1.6e-05,4.9e-05,4e-05,4.8e-05,8.6e-05,4.8e-05,1.9e-05,4.9e-05,3.3e-05,7.2e-05,5.2e-05,2.8e-05,3.5e-05,4.9e-05,6.3e-05,6.4e-05,3.2e-05,4.5e-05,4.9e-05,8.1e-05,8.2e-05,4.3e-05,1.2e-05,5.5e-05,2.9e-05,2.4e-05,2.8e-05,4.1e-05,7.6e-05,2.4e-05,9e-05,5.2e-05,4.9e-05,3.4e-05,2.4e-05,6.2e-05,6.9e-05,7e-06,3.8e-05,5e-05,4.6e-05,5.6e-05,4.9e-05,3.3e-05,1e-05,3.4e-05,2.8e-05,1e-05,6.5e-05,4.2e-05,5.9e-05,1.7e-05,2.4e-05,4.1e-05,1.6e-05,3e-05,3.9e-05,2.3e-05,2.2e-05,2e-05,4.7e-05,3.2e-05,5.3e-05,2.1e-05,4.6e-05,1.5e-05,4.2e-05
9.8e-05,7.9e-05,4.6e-05,9e-06,5.9e-05,2.6e-05,2.6e-05,0,2.9e-05,2e-05,9.6e-05,4.1e-05,4.3e-05,4e-05,0.000117,9e-06,8.1e-05,0.000113,3.3e-05,9.2e-05,8.6e-05,9.2e-05,2.6e-05,3.4e-05,2.2e-05,2.6e-05,2.7e-05,3.6e-05,2.4e-05,2.1e-05,3.5e-05,4.1e-05,3.1e-05,2.2e-05,2.8e-05,2.6e-05,1.6e-05,6e-05,9e-05,8.7e-05,3.3e-05,5.1e-05,5.9e-05,6.7e-05,5.1e-05,5.7e-05,4.9e-05,1.5e-05,5.9e-05,1.8e-05,7.3e-05,9e-06,3.2e-05,7.3e-05,4e-05,3.8e-05,7.3e-05,7.3e-05,8e-05,2.6e-05,4.1e-05,1.1e-05,7.1e-05,9.8e-05,2.3e-05,4.3e-05,5e-05,3e-05,6.7e-05,3.1e-05,4.5e-05,6.8e-05,5e-05,9.8e-05,6.8e-05,1.8e-05,2.7e-05,2.9e-05,5.2e-05,4.7e-05,6.3e-05,3.7e-05,9.8e-05,7.2e-05,6.3e-05,1.7e-05,4.1e-05,7.8e-05,6e-05,5.1e-05,6e-06,1.1e-05,3.8e-05,6e-05,1.9e-05,8.4e-05,7.5e-05,6.7e-05,4.6e-05,9.1e-05,4.4e-05,4e-05,4.7e-05,4.2e-05,4.8e-05,6.2e-05,3.2e-05,2.1e-05,2.4e-05,4.2e-05,1.5e-05,1.7e-05,2.2e-05,1.2e-05,2.5e-05,2.4e-05,6.2e-05,5.8e-05,7.6e-05,6e-06,5e-06
3.4e-05,4e-05,4.2e-05,4.5e-05,3.5e-05,1.7e-05,1.9e-05,2.2e-05,4e-05,4.7e-05,8.8e-05,5.2e-05,3.3e-05,3.9e-05,6e-05,4.7e-05,4.3e-05,3.6e-05,2.3e-05,3.4e-05,2.4e-05,3e-05,3e-05,2.1e-05,2.7e-05,1.7e-05,8e-06,8e-06,1.9e-05,1.5e-05,1.4e-05,2.9e-05,2.4e-05,5e-06,2.1e-05,2.2e-05,1.7e-05,2.6e-05,7e-06,3e-05,2.6e-05,1.5e-05,1.2e-05,1.4e-05,6e-06,4e-06,3.3e-05,4.3e-05,5.2e-05,4.3e-05,3.7e-05,4e-05,4e-05,4.5e-05,3.1e-05,1.2e-05,2.4e-05,2.4e-05,3.3e-05,1e-05,2.3e-05,2.5e-05,2e-05,4.7e-05,4.9e-05,4.8e-05,1.4e-05,1.7e-05,2.3e-05,3.6e-05,1.5e-05,2.6e-05,2.8e-05,6e-05,3.6e-05,9e-06,1.2e-05,1.4e-05,7e-06,1.3e-05,2.2e-05,2.1e-05,3.5e-05,1.5e-05,4.6e-05,4.6e-05,1.3e-05,2.9e-05,3.6e-05,4.3e-05,2.6e-05,3.2e-05,2.1e-05,2.3e-05,2.4e-05,2.3e-05,4.6e-05,1.3e-05,1.5e-05,3.7e-05,2.6e-05,7e-06,8e-06,6e-06,1.3e-05,4e-06,2.3e-05,3.4e-05,3.1e-05,3e-05,2.1e-05,1.5e-05,7e-06,5e-06,1.3e-05,2.3e-05,1.3e-05,3.4e-05,2e-06,2.4e-05,2.2e-05
3.3e-05,1e-05,1.7e-05,2.9e-05,8e-06,9e-06,2.2e-05,1.6e-05,2.9e-05,4.3e-05,3.7e-05,1.3e-05,1.1e-05,1.2e-05,2e-05,2e-05,3e-06,1.2e-05,2.2e-05,3.7e-05,2.1e-05,5e-06,3e-06,1.6e-05,2e-05,1.5e-05,7e-06,1.6e-05,2.4e-05,3e-06,1.8e-05,2.8e-05,2.1e-05,2.5e-05,1.3e-05,1.9e-05,1.4e-05,1.5e-05,9e-06,1.5e-05,4e-06,9e-06,6e-06,6e-06,1e-05,1.2e-05,2.1e-05,2.7e-05,1.3e-05,1.3e-05,1.1e-05,2.4e-05,2.2e-05,8e-06,7e-06,1e-05,2e-05,9e-06,2.4e-05,2.1e-05,9e-06,1e-05,2e-06,2.1e-05,1.4e-05,1.8e-05,1.6e-05,1.4e-05,3e-06,5e-06,1.4e-05,1.6e-05,7e-06,2.4e-05,7e-06,1.3e-05,2e-06,6e-06,5e-06,9e-06,9e-06,1.5e-05,1.9e-05,7e-06,1.9e-05,9e-06,1.6e-05,3e-06,1.8e-05,1e-05,6e-06,2.7e-05,2.7e-05,1.7e-05,1.7e-05,1.6e-05,9e-06,3e-06,1.3e-05,1.4e-05,2.1e-05,3e-06,1e-05,1.6e-05,1.2e-05,2.2e-05,9e-06,2.8e-05,2e-06,1.8e-05,2e-06,1.4e-05,1.5e-05,1e-05,1.6e-05,4e-06,7e-06,1.6e-05,1.4e-05,2.5e-05,1.4e-05
1e-05,7e-06,1.1e-05,2.6e-05,7e-06,1e-05,1.1e-05,1.5e-05,2e-05,2.2e-05,2.2e-05,5e-06,8e-06,9e-06,2.2e-05,2.2e-05,1.4e-05,4e-06,3e-06,1.2e-05,2.1e-05,1e-05,1.5e-05,1.7e-05,6e-06,4e-06,4e-06,1.3e-05,3e-06,5e-06,1e-05,1.8e-05,4e-06,1.5e-05,5e-06,1.1e-05,7e-06,7e-06,2e-06,5e-06,4e-06,6e-06,9e-06,7e-06,6e-06,4e-06,8e-06,1.3e-05,3e-06,1.2e-05,7e-06,1.3e-05,1.2e-05,5e-06,6e-06,1.1e-05,1.3e-05,1.4e-05,1.4e-05,1.3e-05,7e-06,1.1e-05,5e-06,8e-06,1.7e-05,1.4e-05,4e-06,9e-06,3e-06,1.2e-05,2e-05,8e-06,1e-05,5e-06,2e-06,1.4e-05,6e-06,1e-05,9e-06,7e-06,8e-06,6e-06,1.6e-05,8e-06,6e-06,1.3e-05,3e-06,5e-06,1.4e-05,2e-06,6e-06,1.2e-05,6e-06,8e-06,7e-06,1e-05,1.8e-05,9e-06,6e-06,1e-05,1.2e-05,2.4e-05,9e-06,9e-06,1e-05,1.9e-05,6e-06,1.1e-05,1.7e-05,9e-06,1.5e-05,6e-06,1.2e-05,8e-06,1.1e-05,1.2e-05,7e-06,1.1e-05,4e-06,8e-06,4e-06
9e-06,2e-06,9e-06,1.2e-05,3e-06,7e-06,9e-06,9e-06,2e-05,5e-06,7e-06,4e-06,8e-06,7e-06,2.2e-05,2e-05,9e-06,1.2e-05,1.2e-05,1.8e-05,1.2e-05,1.3e-05,1.4e-05,4e-06,3e-06,7e-06,9e-06,1.4e-05,5e-06,3e-06,4e-06,1.6e-05,9e-06,9e-06,1e-05,1.7e-05,6e-06,3e-06,3e-06,1.4e-05,7e-06,6e-06,1.2e-05,3e-06,7e-06,7e-06,9e-06,1.4e-05,5e-06,1e-05,8e-06,2e-06,1.2e-05,7e-06,4e-06,1.2e-05,6e-06,5e-06,1.8e-05,8e-06,2e-06,6e-06,9e-06,6e-06,1e-05,4e-06,8e-06,1.1e-05,8e-06,8e-06,1.1e-05,9e-06,1.1e-05,1.7e-05,7e-06,9e-06,1.2e-05,1.5e-05,7e-06,8e-06,1.1e-05,3e-06,5e-06,5e-06,9e-06,1e-05,8e-06,7e-06,7e-06,4e-06,3e-06,9e-06,1.3e-05,3e-06,7e-06,4e-06,1.2e-05,1.8e-05,1e-05,8e-06,7e-06,1.5e-05,9e-06,5e-06,1e-05,1e-05,1e-05,1e-05,1.3e-05,3e-06,1.1e-05,1.3e-05,4e-06,6e-06,8e-06,2e-06,7e-06,6e-06,9e-06,3e-06,4e-06
9e-06,4e-06,5e-06,1.5e-05,5e-06,2e-06,1e-06,1.2e-05,2.9e-05,1.1e-05,1.5e-05,6e-06,1e-05,4e-06,1.9e-05,1.1e-05,9e-06,1.1e-05,9e-06,1.1e-05,9e-06,6e-06,1e-05,9e-06,6e-06,4e-06,9e-06,1e-06,1.1e-05,5e-06,3e-06,1.4e-05,7e-06,1e-05,2e-06,1.9e-05,5e-06,6e-06,7e-06,1.4e-05,4e-06,5e-06,1.4e-05,7e-06,9e-06,7e-06,1e-05,9e-06,4e-06,2e-06,7e-06,5e-06,7e-06,6e-06,2e-06,7e-06,6e-06,6e-06,1.7e-05,8e-06,4e-06,1.1e-05,1.2e-05,2e-06,8e-06,8e-06,1.1e-05,6e-06,6e-06,1e-05,6e-06,4e-06,1e-06,1.1e-05,2e-06,2e-06,9e-06,1e-06,5e-06,9e-06,9e-06,1.1e-05,1.3e-05,5e-06,2e-06,6e-06,1e-05,8e-06,8e-06,4e-06,3e-06,7e-06,1.5e-05,2e-06,6e-06,4e-06,1e-05,9e-06,1e-06,8e-06,3e-06,6e-06,4e-06,4e-06,8e-06,1.3e-05,6e-06,9e-06,1e-06,1e-05,4e-06,7e-06,6e-06,6e-06,2e-06,4e-06,5e-06,4e-06,9e-06,6e-06,1e-06
5e-06,7e-06,9e-06,1.1e-05,3e-06,9e-06,5e-06,3e-06,1.7e-05,3e-06,8e-06,4e-06,1.1e-05,6e-06,2e-05,3e-06,6e-06,7e-06,4e-06,1.1e-05,9e-06,2e-06,1e-05,1.2e-05,4e-06,4e-06,3e-06,4e-06,1e-05,7e-06,8e-06,7e-06,5e-06,1.2e-05,4e-06,1.2e-05,5e-06,3e-06,7e-06,1e-06,4e-06,4e-06,6e-06,2e-06,8e-06,6e-06,4e-06,9e-06,2e-06,2e-06,8e-06,6e-06,5e-06,1e-06,7e-06,9e-06,6e-06,6e-06,1.2e-05,2e-06,5e-06,7e-06,7e-06,4e-06,4e-06,2e-06,7e-06,5e-06,2e-06,1.2e-05,3e-06,7e-06,3e-06,1e-05,3e-06,4e-06,2e-06,2e-06,5e-06,1.1e-05,3e-06,7e-06,9e-06,8e-06,4e-06,1e-05,4e-06,1e-06,4e-06,3e-06,1e-06,7e-06,1.4e-05,4e-06,3e-06,2e-06,5e-06,7e-06,4e-06,2e-06,2e-06,7e-06,5e-06,1e-06,4e-06,9e-06,6e-06,6e-06,6e-06,4e-06,7e-06,3e-06,5e-06,8e-06,3e-06,3e-06,7e-06,6e-06,7e-06,7e-06,5e-06
8e-06,3e-06,3e-06,1.6e-05,8e-06,2e-06,6e-06,8e-06,1.7e-05,4e-06,1.8e-05,8e-06,1.2e-05,1e-05,1.7e-05,4e-06,2e-06,6e-06,4e-06,3e-06,6e-06,1.1e-05,1e-05,1.2e-05,5e-06,3e-06,6e-06,9e-06,7e-06,6e-06,5e-06,8e-06,1e-06,6e-06,5e-06,1.3e-05,8e-06,3e-06,4e-06,5e-06,3e-06,6e-06,7e-06,1e-06,7e-06,9e-06,5e-06,6e-06,2e-06,3e-06,6e-06,3e-06,2e-06,1e-06,8e-06,7e-06,4e-06,7e-06,1.1e-05,6e-06,6e-06,6e-06,8e-06,5e-06,4e-06,4e-06,6e-06,7e-06,1e-06,1e-05,9e-06,1.1e-05,4e-06,9e-06,7e-06,2e-06,2e-06,2e-06,1e-06,8e-06,3e-06,4e-06,1e-05,1e-05,5e-06,6e-06,4e-06,4e-06,5e-06,3e-06,2e-06,6e-06,1e-05,4e-06,5e-06,7e-06,6e-06,5e-06,4e-06,7e-06,4e-06,9e-06,3e-06,2e-06,6e-06,1.2e-05,3e-06,2e-06,8e-06,4e-06,9e-06,3e-06,4e-06,7e-06,7e-06,5e-06,4e-06,6e-06,9e-06,6e-06,5e-06
1e-05,6e-06,2e-06,1e-05,1.1e-05,3e-06,6e-06,5e-06,1.7e-05,3e-06,1.9e-05,3e-06,4e-06,6e-06,1.7e-05,5e-06,4e-06,1e-05,9e-06,4e-06,4e-06,1.1e-05,7e-06,9e-06,1e-06,4e-06,7e-06,5e-06,1.2e-05,4e-06,5e-06,1.1e-05,2e-06,9e-06,9e-06,4e-06,3e-06,4e-06,6e-06,2e-06,3e-06,9e-06,1e-05,3e-06,2e-06,4e-06,3e-06,8e-06,3e-06,1e-06,2e-06,2e-06,7e-06,4e-06,7e-06,8e-06,2e-06,1e-06,1.4e-05,1.1e-05,1e-05,4e-06,8e-06,4e-06,3e-06,2e-06,9e-06,7e-06,2e-06,7e-06,7e-06,9e-06,2e-06,8e-06,7e-06,6e-06,1e-06,5e-06,5e-06,2e-06,5e-06,7e-06,5e-06,6e-06,6e-06,6e-06,6e-06,6e-06,3e-06,6e-06,2e-06,2e-06,1.6e-05,3e-06,7e-06,7e-06,6e-06,6e-06,5e-06,8e-06,3e-06,9e-06,6e-06,3e-06,5e-06,1.1e-05,1e-06,6e-06,3e-06,6e-06,4e-06,5e-06,1e-06,2e-06,7e-06,2e-06,4e-06,8e-06,8e-06,3e-06,6e-06
6e-06,5e-06,4e-06,1.1e-05,1.3e-05,1.5e-05,6e-06,4e-06,2e-05,8e-06,7e-06,7e-06,1e-05,2e-06,1.4e-05,7e-06,1.1e-05,1e-06,4e-06,9e-06,8e-06,1e-05,4e-06,7e-06,4e-06,8e-06,1e-06,4e-06,5e-06,5e-06,6e-06,5e-06,5e-06,1e-05,7e-06,7e-06,3e-06,4e-06,7e-06,8e-06,3e-06,1e-05,6e-06,6e-06,4e-06,3e-06,5e-06,5e-06,2e-06,3e-06,3e-06,4e-06,8e-06,6e-06,5e-06,1.5e-05,1e-06,6e-06,1.4e-05,5e-06,4e-06,8e-06,4e-06,2e-06,5e-06,5e-06,9e-06,8e-06,6e-06,8e-06,2e-06,1e-05,1.2e-05,3e-06,1e-05,6e-06,7e-06,9e-06,8e-06,4e-06,5e-06,5e-06,5e-06,5e-06,5e-06,6e-06,7e-06,4e-06,9e-06,5e-06,4e-06,7e-06,1.3e-05,6e-06,2e-06,3e-06,7e-06,6e-06,3e-06,1e-05,3e-06,1e-05,8e-06,4e-06,5e-06,1e-05,1e-06,6e-06,2e-06,5e-06,6e-06,4e-06,7e-06,4e-06,4e-06,4e-06,4e-06,4e-06,7e-06,3e-06,2e-06
5e-06,3e-06,1e-06,1.6e-05,4e-06,6e-06,6e-06,3e-06,1.9e-05,3e-06,4e-06,4e-06,7e-06,6e-06,1.6e-05,7e-06,5e-06,1e-06,3e-06,4e-06,1.1e-05,5e-06,3e-06,1.1e-05,7e-06,5e-06,2e-06,7e-06,3e-06,3e-06,5e-06,5e-06,3e-06,1e-06,1.2e-05,3e-06,4e-06,4e-06,3e-06,6e-06,1e-06,6e-06,4e-06,1e-05,1.1e-05,1e-05,4e-06,4e-06,3e-06,5e-06,1e-06,4e-06,2e-06,6e-06,1e-06,1.1e-05,4e-06,6e-06,1.3e-05,9e-06,5e-06,5e-06,5e-06,4e-06,5e-06,4e-06,9e-06,6e-06,3e-06,9e-06,4e-06,2e-06,6e-06,5e-06,6e-06,4e-06,3e-06,2e-06,3e-06,3e-06,6e-06,1e-06,3e-06,8e-06,1e-06,3e-06,3e-06,2e-06,9e-06,5e-06,5e-06,4e-06,1.4e-05,7e-06,3e-06,3e-06,6e-06,6e-06,2e-06,2e-06,2e-06,1e-05,4e-06,2e-06,7e-06,3e-06,5e-06,3e-06,5e-06,4e-06,2e-06,1e-06,6e-06,1e-06,2e-06,2e-06,7e-06,7e-06,7e-06,2e-06,2e-06
6e-06,2e-06,2e-06,1.6e-05,4e-06,1e-05,7e-06,9e-06,1.4e-05,1e-06,6e-06,2e-06,8e-06,4e-06,1.4e-05,2e-06,5e-06,2e-06,3e-06,4e-06,5e-06,8e-06,6e-06,9e-06,5e-06,5e-06,2e-06,5e-06,5e-06,3e-06,4e-06,8e-06,4e-06,6e-06,7e-06,6e-06,2e-06,5e-06,6e-06,4e-06,1e-06,2e-06,8e-06,8e-06,3e-06,3e-06,1.2e-05,4e-06,2e-06,4e-06,5e-06,5e-06,3e-06,4e-06,2e-06,8e-06,3e-06,5e-06,1.2e-05,5e-06,4e-06,9e-06,3e-06,1e-06,6e-06,4e-06,4e-06,5e-06,2e-06,8e-06,3e-06,5e-06,6e-06,3e-06,1e-06,3e-06,3e-06,1e-06,4e-06,5e-06,4e-06,2e-06,3e-06,9e-06,5e-06,6e-06,6e-06,4e-06,3e-06,3e-06,2e-06,3e-06,1e-05,4e-06,3e-06,5e-06,3e-06,6e-06,2e-06,4e-06,3e-06,7e-06,0,0,6e-06,1.1e-05,1e-06,5e-06,4e-06,3e-06,3e-06,2e-06,5e-06,2e-06,1e-06,2e-06,7e-06,6e-06,5e-06,1e-06,1e-06
8e-06,4e-06,4e-06,7e-06,7e-06,7e-06,6e-06,2e-06,1.4e-05,3e-06,9e-06,1e-06,8e-06,5e-06,1.1e-05,5e-06,7e-06,3e-06,5e-06,5e-06,5e-06,8e-06,3e-06,9e-06,3e-06,2e-06,1e-06,3e-06,5e-06,3e-06,3e-06,3e-06,0,6e-06,8e-06,7e-06,2e-06,7e-06,3e-06,1e-06,3e-06,4e-06,7e-06,3e-06,5e-06,3e-06,6e-06,4e-06,2e-06,4e-06,7e-06,4e-06,1e-06,3e-06,1e-06,7e-06,2e-06,5e-06,8e-06,2e-06,3e-06,4e-06,7e-06,3e-06,7e-06,7e-06,1e-06,2e-06,2e-06,7e-06,2e-06,2e-06,5e-06,4e-06,3e-06,2e-06,4e-06,2e-06,6e-06,3e-06,1e-06,4e-06,2e-06,1.1e-05,3e-06,7e-06,3e-06,1e-06,7e-06,2e-06,2e-06,6e-06,8e-06,1e-06,3e-06,5e-06,5e-06,5e-06,2e-06,4e-06,3e-06,9e-06,4e-06,4e-06,3e-06,6e-06,2e-06,4e-06,5e-06,1e-06,3e-06,3e-06,3e-06,3e-06,1e-06,4e-06,4e-06,4e-06,6e-06,2e-06,3e-06
3e-06,4e-06,1e-06,8e-06,2e-06,6e-06,2e-06,6e-06,1.3e-05,1e-06,9e-06,1e-06,1.1e-05,8e-06,1.5e-05,5e-06,2e-06,6e-06,3e-06,6e-06,6e-06,3e-06,7e-06,5e-06,4e-06,1e-06,5e-06,2e-06,8e-06,4e-06,3e-06,6e-06,2e-06,6e-06,7e-06,1.1e-05,2e-06,6e-06,2e-06,3e-06,2e-06,5e-06,6e-06,6e-06,6e-06,1e-06,4e-06,4e-06,1e-06,5e-06,3e-06,3e-06,1e-06,3e-06,4e-06,8e-06,1e-06,4e-06,5e-06,4e-06,1e-06,6e-06,6e-06,7e-06,4e-06,3e-06,4e-06,3e-06,1e-06,5e-06,6e-06,4e-06,3e-06,7e-06,4e-06,2e-06,6e-06,4e-06,3e-06,4e-06,2e-06,2e-06,2e-06,5e-06,8e-06,3e-06,2e-06,3e-06,5e-06,4e-06,1e-06,5e-06,1.1e-05,5e-06,2e-06,7e-06,3e-06,4e-06,1e-06,4e-06,3e-06,6e-06,6e-06,3e-06,3e-06,6e-06,2e-06,2e-06,3e-06,2e-06,2e-06,4e-06,7e-06,3e-06,1e-06,3e-06,5e-06,4e-06,5e-06,2e-06,2e-06
2e-06,1e-06,1e-06,1e-05,1e-06,7e-06,2e-06,3e-06,1.1e-05,2e-06,7e-06,1e-06,1.1e-05,2e-06,1.6e-05,5e-06,7e-06,7e-06,7e-06,3e-06,5e-06,1e-06,5e-06,7e-06,2e-06,1e-06,5e-06,4e-06,1.1e-05,3e-06,4e-06,6e-06,2e-06,4e-06,5e-06,7e-06,2e-06,4e-06,1e-06,4e-06,2e-06,5e-06,5e-06,2e-06,2e-06,4e-06,4e-06,3e-06,2e-06,8e-06,4e-06,1e-06,3e-06,3e-06,2e-06,7e-06,3e-06,1e-06,4e-06,4e-06,4e-06,1e-06,6e-06,4e-06,6e-06,3e-06,3e-06,2e-06,2e-06,9e-06,4e-06,4e-06,3e-06,8e-06,7e-06,2e-06,1e-06,1e-06,3e-06,3e-06,3e-06,0,5e-06,8e-06,5e-06,6e-06,2e-06,2e-06,3e-06,4e-06,4e-06,3e-06,1.3e-05,3e-06,2e-06,3e-06,5e-06,3e-06,1e-06,6e-06,0,6e-06,1e-06,1e-06,5e-06,7e-06,1e-06,5e-06,4e-06,2e-06,2e-06,2e-06,3e-06,4e-06,2e-06,2e-06,6e-06,4e-06,8e-06,3e-06,3e-06
4e-06,5e-06,1e-06,8e-06,3e-06,6e-06,1e-06,5e-06,1.4e-05,1e-06,9e-06,2e-06,1e-05,3e-06,1.6e-05,2e-06,6e-06,8e-06,3e-06,4e-06,5e-06,1e-06,7e-06,6e-06,2e-06,3e-06,2e-06,5e-06,6e-06,2e-06,5e-06,5e-06,1e-06,7e-06,4e-06,6e-06,2e-06,5e-06,1e-06,4e-06,2e-06,3e-06,6e-06,1e-06,1e-06,2e-06,3e-06,0,2e-06,5e-06,3e-06,3e-06,3e-06,1e-06,2e-06,7e-06,2e-06,2e-06,6e-06,2e-06,5e-06,6e-06,5e-06,2e-06,5e-06,4e-06,3e-06,2e-06,3e-06,8e-06,5e-06,6e-06,5e-06,7e-06,4e-06,3e-06,3e-06,2e-06,4e-06,3e-06,1e-06,3e-06,6e-06,6e-06,8e-06,3e-06,3e-06,2e-06,2e-06,2e-06,1e-06,4e-06,9e-06,4e-06,3e-06,3e-06,5e-06,4e-06,1e-06,5e-06,2e-06,7e-06,1e-06,2e-06,4e-06,7e-06,3e-06,6e-06,1e-06,3e-06,3e-06,1e-06,4e-06,3e-06,2e-06,2e-06,6e-06,4e-06,6e-06,2e-06,5e-06
4e-06,4e-06,5e-06,1.2e-05,4e-06,6e-06,3e-06,7e-06,1.2e-05,1e-06,7e-06,2e-06,1e-05,3e-06,1.3e-05,4e-06,7e-06,3e-06,3e-06,2e-06,3e-06,3e-06,4e-06,6e-06,5e-06,3e-06,3e-06,3e-06,6e-06,2e-06,5e-06,5e-06,1e-06,9e-06,7e-06,6e-06,3e-06,2e-06,3e-06,6e-06,3e-06,5e-06,4e-06,5e-06,1e-06,2e-06,4e-06,5e-06,3e-06,3e-06,2e-06,4e-06,5e-06,4e-06,2e-06,4e-06,3e-06,3e-06,7e-06,3e-06,4e-06,3e-06,4e-06,4e-06,1e-06,3e-06,6e-06,2e-06,2e-06,8e-06,4e-06,6e-06,4e-06,5e-06,3e-06,2e-06,1e-06,3e-06,5e-06,1e-06,1e-06,2e-06,7e-06,4e-06,7e-06,6e-06,2e-06,2e-06,2e-06,1e-06,1e-06,5e-06,8e-06,5e-06,1e-06,4e-06,5e-06,3e-06,3e-06,4e-06,1e-06,8e-06,3e-06,0,2e-06,8e-06,2e-06,3e-06,2e-06,2e-06,2e-06,1e-06,3e-06,3e-06,1e-06,2e-06,5e-06,5e-06,4e-06,3e-06,4e-06
3e-06,3e-06,4e-06,1e-05,2e-06,8e-06,1e-06,5e-06,1.2e-05,2e-06,6e-06,2e-06,9e-06,3e-06,1.4e-05,3e-06,2e-06,3e-06,3e-06,5e-06,4e-06,3e-06,4e-06,8e-06,2e-06,2e-06,2e-06,2e-06,4e-06,2e-06,6e-06,4e-06,1e-06,6e-06,4e-06,3e-06,1e-06,3e-06,4e-06,4e-06,3e-06,3e-06,1e-06,1e-06,2e-06,3e-06,3e-06,5e-06,1e-06,3e-06,1e-06,3e-06,4e-06,4e-06,1e-06,3e-06,3e-06,1e-06,7e-06,3e-06,3e-06,4e-06,3e-06,2e-06,1e-06,4e-06,3e-06,2e-06,1e-06,7e-06,4e-06,6e-06,4e-06,6e-06,4e-06,2e-06,2e-06,1e-06,2e-06,4e-06,1e-06,1e-06,4e-06,1e-06,0,2e-06,1e-06,0,1e-06,1e-06,1e-06,5e-06,1.1e-05,1e-06,3e-06,3e-06,6e-06,5e-06,1e-06,3e-06,2e-06,7e-06,4e-06,1e-06,0,8e-06,2e-06,6e-06,3e-06,1e-06,3e-06,2e-06,5e-06,2e-06,0,2e-06,5e-06,3e-06,7e-06,1e-06,1e-06
4e-06,2e-06,4e-06,1e-05,2e-06,8e-06,2e-06,6e-06,1.2e-05,2e-06,8e-06,2e-06,8e-06,3e-06,1.4e-05,0,4e-06,7e-06,1e-06,3e-06,4e-06,2e-06,6e-06,8e-06,3e-06,4e-06,3e-06,2e-06,5e-06,0,5e-06,5e-06,1e-06,5e-06,3e-06,6e-06,1e-06,1e-06,2e-06,5e-06,1e-06,4e-06,4e-06,2e-06,0,3e-06,4e-06,4e-06,0,2e-06,2e-06,3e-06,4e-06,1e-06,2e-06,5e-06,1e-06,2e-06,7e-06,3e-06,2e-06,5e-06,5e-06,2e-06,1e-06,1e-06,3e-06,0,1e-06,6e-06,3e-06,4e-06,3e-06,5e-06,5e-06,1e-06,2e-06,2e-06,1e-06,3e-06,1e-06,1e-06,3e-06,3e-06,3e-06,3e-06,3e-06,1e-06,2e-06,0,1e-06,4e-06,1.1e-05,3e-06,1e-06,2e-06,3e-06,4e-06,2e-06,4e-06,2e-06,8e-06,3e-06,1e-06,2e-06,7e-06,1e-06,4e-06,4e-06,1e-06,3e-06,1e-06,5e-06,3e-06,1e-06,2e-06,5e-06,3e-06,6e-06,1e-06,1e-06
2e-06,2e-06,3e-06,8e-06,2e-06,7e-06,1e-06,6e-06,1.2e-05,2e-06,6e-06,0,9e-06,4e-06,1.5e-05,0,4e-06,6e-06,3e-06,3e-06,4e-06,2e-06,5e-06,8e-06,1e-06,2e-06,3e-06,3e-06,5e-06,2e-06,4e-06,5e-06,2e-06,5e-06,3e-06,4e-06,1e-06,2e-06,2e-06,4e-06,1e-06,5e-06,4e-06,0,2e-06,3e-06,4e-06,3e-06,0,2e-06,1e-06,2e-06,4e-06,1e-06,1e-06,6e-06,2e-06,2e-06,7e-06,2e-06,3e-06,4e-06,4e-06,3e-06,3e-06,2e-06,3e-06,0,1e-06,7e-06,4e-06,4e-06,3e-06,5e-06,4e-06,1e-06,2e-06,1e-06,1e-06,3e-06,1e-06,1e-06,3e-06,3e-06,3e-06,5e-06,2e-06,1e-06,2e-06,1e-06,1e-06,3e-06,1.1e-05,2e-06,1e-06,3e-06,3e-06,5e-06,2e-06,4e-06,3e-06,7e-06,2e-06,1e-06,2e-06,8e-06,0,3e-06,3e-06,0,3e-06,2e-06,4e-06,2e-06,1e-06,2e-06,5e-06,4e-06,6e-06,1e-06,1e-06
3e-06,2e-06,3e-06,9e-06,2e-06,7e-06,1e-06,5e-06,1e-05,1e-06,7e-06,1e-06,9e-06,3e-06,1.5e-05,2e-06,3e-06,4e-06,2e-06,4e-06,4e-06,2e-06,4e-06,8e-06,2e-06,3e-06,2e-06,2e-06,5e-06,1e-06,5e-06,4e-06,2e-06,4e-06,4e-06,4e-06,0,2e-06,2e-06,3e-06,1e-06,3e-06,4e-06,0,2e-06,4e-06,3e-06,3e-06,0,3e-06,2e-06,3e-06,4e-06,0,0,6e-06,2e-06,2e-06,8e-06,2e-06,3e-06,5e-06,4e-06,2e-06,3e-06,0,4e-06,1e-06,1e-06,7e-06,3e-06,4e-06,4e-06,5e-06,3e-06,2e-06,0,2e-06,0,2e-06,1e-06,1e-06,3e-06,4e-06,2e-06,4e-06,2e-06,0,2e-06,1e-06,0,4e-06,1e-05,3e-06,2e-06,3e-06,4e-06,5e-06,2e-06,5e-06,1e-06,7e-06,3e-06,1e-06,2e-06,7e-06,1e-06,3e-06,4e-06,1e-06,2e-06,1e-06,3e-06,3e-06,1e-06,1e-06,5e-06,4e-06,6e-06,1e-06,0
