-3e-04,-0.000185,-0.000145,-0.00045,-0.000302,-0.000321,-0.000762,-0.000372,-0.000325,-0.000608,-0.000483,-0.000284,-9.8e-05,-0.000306,-0.00036,-0.000334,-4e-04,-0.000443,-0.000217,-0.000139,-8.2e-05,-0.00038,-0.000296,-0.000747,-0.00044,-0.000362,-5e-05,-0.000188,-0.000304,-0.000326,-0.000297,-0.000415,-0.000211,-0.000157,-0.000124,-0.000175,-0.000384,-0.000314,-0.000208,-0.00026,-0.000385,-0.000313,-0.000445,-0.000417,-0.000253,-0.000309,-0.000482,-0.000318,-0.000488,-0.000374,-0.000181,0.000104,-0.000102,-0.000268,-0.000323,-0.000257,-0.000392,-0.00028,-0.000342,-0.000386,-7e-05,-0.000276,-0.000423,-0.000362,-0.000218,-0.000155,-0.000122,-0.000194,-3.7e-05,-0.000179,-3.5e-05,-0.000358,-0.00034,-0.000169,-5.3e-05,-0.000357,-0.000154,-9.1e-05,-0.000285,-0.00016,-0.000172,-0.000343,-0.00025,-1.3e-05,-0.000104,-0.000292,-0.000217,-0.000383,-0.000119,-0.000203,-7e-05,-0.000169,-0.000346,-0.000107,-0.000318,-0.000133,-0.000164,-0.000402,-0.000175,-4.8e-05,-0.000152,-0.000225,-0.000361,-0.000237,-6.5e-05,-0.000201,-7.8e-05,-0.000221,-0.000366,-0.000359,2.6e-05,-0.000138,-9e-05,-7e-05,-0.000147,-0.00012,-0.000122,1.7e-05,-3.3e-05,-0.000216,-0.000289
6.4e-05,-0.000436,-8.3e-05,-3.1e-05,-0.000108,-1.8e-05,0.000282,-0.000138,-0.00019,0.000368,5.3e-05,-0.000127,-9.8e-05,0.000156,-5.9e-05,-0.000323,1.5e-05,6.2e-05,-5.8e-05,-3e-06,-0.000183,5.6e-05,-0.000244,0.000262,-3e-06,-4.8e-05,0.000144,-5.4e-05,8.1e-05,-9.1e-05,-0.000108,4.1e-05,-0.000129,-0.000106,-0.000238,-8.7e-05,7.5e-05,-0.000379,-0.000465,-0.000168,-0.000318,-3.2e-05,0.000156,0.000133,-0.000123,-7.2e-05,0.00012,0.000215,3.1e-05,0.000187,-2.1e-05,-0.000263,-0.000165,0.000218,3.7e-05,-8.8e-05,1.6e-05,-0.000249,-9.2e-05,-0.000213,-7e-05,-6e-06,0.000171,0.000105,-8.9e-05,-7.7e-05,-0.000147,2.2e-05,-0.000191,-4e-05,-2e-06,4.4e-05,1e-06,-2.7e-05,-0.000249,8.2e-05,-0.000174,-0.000102,-0.000131,-0.000203,-0.00019,0.000108,6.4e-05,-7.5e-05,-6.3e-05,-0.000138,-3.3e-05,5e-05,2.8e-05,-0.000282,-0.000183,-0.000127,9.9e-05,-1e-06,7.7e-05,0.000114,-5.3e-05,-2e-06,-1.8e-05,-6e-05,1.1e-05,-9.1e-05,9.1e-05,-0.000289,-0.000263,-6.9e-05,-5.7e-05,2.3e-05,0.000255,1.4e-05,-4.1e-05,-7.8e-05,-0.000169,0.000181,-1.5e-05,2.6e-05,6e-06,-0.000366,-0.000271,-0.000154,-7e-05
0.000152,-9.2e-05,-0.000441,-0.000198,-0.000368,-0.000334,-0.000259,-0.000326,-4.8e-05,-0.000223,-0.000177,-0.000146,-2.8e-05,-0.000353,-7.1e-05,-1.3e-05,9.6e-05,-0.000156,-0.000405,-0.000167,-2.7e-05,-0.00022,0.000101,-0.00025,-9.9e-05,-0.000448,-0.000323,-0.000473,-0.000273,0,6e-05,-4.8e-05,-0.000149,4.2e-05,7.2e-05,0.000155,-0.000143,-0.000162,-0.000211,-6.1e-05,9.5e-05,-0.000289,-9.9e-05,-0.000314,-9.2e-05,7.7e-05,-6.7e-05,-0.000397,8.7e-05,-0.000168,-4.4e-05,-0.000197,-0.000105,-0.000253,-0.00024,-0.000248,-9.7e-05,0.000118,-0.000185,-0.000136,-0.000324,-5.1e-05,-0.000345,-0.000272,-0.000339,-0.000229,-0.000237,-9.6e-05,-4.7e-05,-8.3e-05,-6.7e-05,-0.000141,-5e-06,1e-06,-2e-05,-4.2e-05,3e-06,-3.1e-05,-0.000132,-0.000181,-0.000257,-0.000203,-0.000197,-0.000202,0,2.3e-05,-2.3e-05,-0.000324,-0.000278,-0.00018,-0.000114,-0.000195,-0.000203,-0.000155,-0.00032,3.7e-05,-0.000279,-5.2e-05,-0.000206,-0.000126,-0.000165,7.1e-05,-5e-05,6e-05,-4e-05,-6.7e-05,-8.7e-05,-7.4e-05,-0.000204,-0.000143,-8.5e-05,-0.000128,-7.4e-05,-3.9e-05,-0.000172,-0.000158,-0.000285,-0.000228,-0.000176,-0.000154,2.9e-05
-0.000404,5.4e-05,5e-06,-2e-06,0.00027,0.000288,7.6e-05,0.00021,-9.3e-05,1.2e-05,-0.000211,-6.8e-05,-8.7e-05,7.6e-05,-3.4e-05,0.000159,-0.000258,-0.000307,-3.2e-05,1.3e-05,7.5e-05,0.000288,-0.000183,-3.7e-05,-0.000242,0.000146,-8.8e-05,0.000156,0.00012,-0.000144,-9.8e-05,2.3e-05,3.7e-05,5.9e-05,-9.9e-05,-0.000359,-7.1e-05,0.000177,-5.8e-05,-0.000187,-8.1e-05,6.4e-05,-0.000123,0.000223,0.000128,-0.000136,5.2e-05,5.7e-05,-8.1e-05,5.5e-05,8.1e-05,-0.000157,-0.000181,-1.4e-05,3e-05,0.000141,2.4e-05,0.000113,0.000259,0.000133,4.5e-05,-9.2e-05,0.000137,0.000131,9.7e-05,6e-06,0.000215,0.000145,0.000104,0.000135,7e-05,-7.1e-05,-0.000116,-3.4e-05,-9.7e-05,-0.000215,5.9e-05,-1.9e-05,0.000134,0.000201,8.8e-05,0.000139,7.7e-05,-4.4e-05,-0.000171,8e-06,-0.000184,0.000289,-3.7e-05,-6.6e-05,-9.7e-05,4.6e-05,-0.000175,0.000178,9e-05,-9.7e-05,5e-06,-0.000186,-3.4e-05,1.3e-05,6.9e-05,-8.2e-05,-1.7e-05,1.7e-05,-0.000198,-8.9e-05,5e-05,-0.000168,7.2e-05,-7.1e-05,-0.00016,-3.5e-05,1.9e-05,7.3e-05,-2.3e-05,-0.000206,5.6e-05,-1.1e-05,1.4e-05,0.000127,-0.000145
0.000135,0.000164,0.000209,4.9e-05,-7.3e-05,-7.5e-05,8.3e-05,0.00023,0.000226,0.000129,0.000267,0.000209,7e-05,6e-05,0.000132,9.4e-05,0.000209,0.000322,0.000182,9.4e-05,1e-06,3.8e-05,1.4e-05,1e-05,0.000287,0.000126,0.000162,7.1e-05,0.000216,6.3e-05,0.000163,-8.3e-05,-1.1e-05,3.6e-05,3.9e-05,0.000136,-3.1e-05,8.8e-05,0.000368,0.000361,3e-05,-2.5e-05,3.4e-05,-6.9e-05,9e-06,0.000151,8.5e-05,0.000108,6.3e-05,-0.000154,-7.6e-05,0.000146,0.000112,0.000101,0.000309,-3.5e-05,9.1e-05,-6e-05,3.4e-05,-0.000188,1e-06,0.000135,-5.1e-05,-0.000105,2e-06,0.000146,1e-05,-1e-04,0.000101,-0.000151,-0.000126,5.4e-05,8.3e-05,-6.6e-05,-1e-06,6.8e-05,-0.000148,-0.000204,-8.4e-05,-2.2e-05,6.5e-05,-6.4e-05,-2e-06,6.3e-05,7.3e-05,4.2e-05,0.000182,-4.6e-05,3.3e-05,-2e-05,0.000279,0.000241,0.00022,-2.2e-05,-9e-05,5.3e-05,0.000106,0.000111,8.2e-05,0.000132,1.4e-05,1.9e-05,4.5e-05,0.000129,0.000172,8.9e-05,6.1e-05,7e-05,3.3e-05,9.4e-05,0.000149,0.000159,0.000111,-0.00018,-3.3e-05,7.2e-05,6.6e-05,0.000137,1e-06,2.5e-05,0.00014
0.000111,-6.4e-05,4.5e-05,0.000171,0.000132,-6.3e-05,-7e-05,-0.000177,-2.9e-05,-1e-04,-0.000143,7e-06,-2.4e-05,-9.9e-05,9.1e-05,-0.000151,-0.000164,-0.000102,7.1e-05,-3.9e-05,-2.2e-05,-4.2e-05,-5.8e-05,-4.2e-05,-0.000122,-6.7e-05,0.000128,-2e-05,-0.000205,1e-06,-0.000147,-3.7e-05,-6.8e-05,-0.000144,-5.5e-05,3e-06,-6e-05,-9.7e-05,-4.1e-05,-6.7e-05,1.9e-05,0.000117,-0.000104,-2.3e-05,-0.00012,-0.000151,-8.5e-05,-9.9e-05,-6.9e-05,0.000104,-0.000151,-0.000109,6.5e-05,-2.6e-05,-0.000141,2.8e-05,-1.7e-05,-9.9e-05,-0.000165,0.000208,0.000215,5.6e-05,3.5e-05,0.000192,6.9e-05,8.3e-05,1.3e-05,7.6e-05,-6.7e-05,-2.4e-05,-7.9e-05,-9.7e-05,-4e-05,-5.4e-05,-9e-06,-3e-06,0.000134,6.4e-05,0.000138,-7.4e-05,4.5e-05,-2.5e-05,-3.3e-05,-3e-05,-3.1e-05,-8e-06,-0.000138,1.2e-05,8.6e-05,0.000211,-2.8e-05,-8.1e-05,-0.000122,-5.9e-05,-2.3e-05,-0.000118,-2.9e-05,3.2e-05,5.1e-05,-7.6e-05,2.7e-05,2.7e-05,2e-05,-5.6e-05,1.2e-05,-0.000102,-5.1e-05,-6.5e-05,-1.5e-05,-7.6e-05,2.9e-05,8.5e-05,-4.2e-05,-3e-05,4.9e-05,6.5e-05,0.00012,0.000101,0.000234,-4.6e-05,-0.00013
-9e-05,3.2e-05,-4e-05,-0.000102,-0.000108,-9.5e-05,0.000161,7.6e-05,-3.5e-05,3.5e-05,8.7e-05,7.9e-05,8.9e-05,-4.4e-05,-9.3e-05,3e-05,6.8e-05,-3.6e-05,-8e-06,-2.3e-05,4e-06,-0.00011,7e-05,0.000193,0.000167,4.9e-05,6.3e-05,4e-06,5e-06,0,-5.3e-05,6.6e-05,0.000129,6.8e-05,-4.7e-05,8.3e-05,0.00013,0.000132,-0.000181,-0.000159,-5e-06,-0.000155,9.5e-05,-1.7e-05,-3.1e-05,-4e-06,-4.6e-05,3.8e-05,7.4e-05,-6.2e-05,7.6e-05,4.7e-05,-4.4e-05,-5.4e-05,0.000111,-0.00011,-3e-05,5.4e-05,0.000108,9.4e-05,-0.00012,-0.000138,9e-06,-5.2e-05,5.6e-05,-2.4e-05,-0.000104,-3.1e-05,3.2e-05,0.000117,3.1e-05,0.000129,8e-05,7.4e-05,-4e-06,-3.8e-05,-6e-05,0.000177,-4.3e-05,-3.2e-05,-6.9e-05,5.8e-05,1.5e-05,6e-06,4.3e-05,6e-06,-7.5e-05,-0.00019,-1.5e-05,6.5e-05,-0.000108,-7e-05,2.1e-05,6.3e-05,0.000126,4e-06,7.2e-05,0.000121,-0.000107,-0.000165,-2.6e-05,-4e-06,-2.5e-05,-4.5e-05,-0.000228,-0.000153,1.7e-05,0.000102,-5e-06,8.1e-05,-0.000117,-4.7e-05,-2.9e-05,2.6e-05,2.3e-05,1.2e-05,-4.6e-05,-0.000112,-6.7e-05,1.7e-05,-1.6e-05
-6.7e-05,-8.2e-05,-0.000164,-0.000104,3.8e-05,4.1e-05,-0.000127,-5.4e-05,-7.2e-05,-0.000135,-5.6e-05,-0.000199,-1.9e-05,0,-0.000124,-0.000106,-8.1e-05,6e-06,-3.9e-05,2.5e-05,-3e-05,2.2e-05,-7.7e-05,-0.000107,-0.000186,-6.8e-05,-0.000174,-0.000102,-0.000145,1.9e-05,5.5e-05,-5.4e-05,-6.5e-05,-1.2e-05,-2.8e-05,5.3e-05,-4.9e-05,-0.000131,1.6e-05,1.5e-05,1.3e-05,5e-06,-0.000112,4.4e-05,2.1e-05,3.2e-05,4.2e-05,-5.3e-05,-0.000171,-1.8e-05,-9e-06,1.1e-05,5.6e-05,-3.1e-05,-0.000193,-3.3e-05,-6.9e-05,3.9e-05,8.3e-05,-0.000205,-3.8e-05,-5.7e-05,-5.2e-05,-2.2e-05,-4.8e-05,-0.000138,-1.7e-05,7e-06,-3.4e-05,-3.4e-05,5.8e-05,-1.7e-05,7e-06,5.6e-05,6.3e-05,4e-05,-5e-05,-8.9e-05,-9.3e-05,5.4e-05,3.6e-05,-0.000106,7e-06,-8.6e-05,-5.4e-05,-4.6e-05,-2.9e-05,1.7e-05,-9.6e-05,-9.7e-05,-5.6e-05,-6.7e-05,-1.2e-05,-0.000162,-0.000169,-0.000132,-4.4e-05,-0.000111,-2.9e-05,-1.4e-05,1.1e-05,-5.2e-05,5e-06,1.3e-05,4.2e-05,0.000139,1.9e-05,-5.1e-05,-9.5e-05,-9e-05,-7e-06,-8.4e-05,-4.6e-05,5e-06,-2.3e-05,-7e-05,-3.1e-05,5.3e-05,-0.000169,-1.7e-05,9.3e-05
-8.4e-05,-2.9e-05,7.7e-05,6e-06,-0.000181,6.8e-05,-4e-06,-2.5e-05,6e-06,5.1e-05,4.5e-05,8.2e-05,8e-06,2.2e-05,3.1e-05,1e-05,6e-06,-5.3e-05,-6.2e-05,-3.9e-05,9.1e-05,-2e-06,-1.8e-05,-3.8e-05,7.7e-05,-7.3e-05,-0.000113,9e-06,0.000131,-2.4e-05,-5.1e-05,8e-06,1.9e-05,2.6e-05,-8e-06,-3.7e-05,-0.000158,-5e-05,4e-05,3e-06,-8.2e-05,2.6e-05,6.8e-05,1.1e-05,2.7e-05,-6.5e-05,-8.9e-05,5.4e-05,1e-04,-1.5e-05,5.5e-05,7.9e-05,-1e-05,-2.8e-05,4.6e-05,5.8e-05,6.5e-05,-7.8e-05,-5.5e-05,6.1e-05,6e-05,-1.5e-05,8e-06,-5.8e-05,3e-06,8e-06,-3e-05,-1.8e-05,-6e-05,-5.5e-05,-2.8e-05,2e-05,1e-05,1.2e-05,3e-06,5e-06,1.7e-05,2e-06,-1.6e-05,5.1e-05,4e-06,-1e-06,-3e-05,4.2e-05,-4e-06,-4.9e-05,4.3e-05,-4.7e-05,6.8e-05,3.9e-05,5.4e-05,4.7e-05,-1.4e-05,-2.3e-05,6.7e-05,0.000104,3e-05,-3.8e-05,-1.6e-05,1.9e-05,4.7e-05,2.9e-05,0,-4.2e-05,7.1e-05,4.8e-05,5.2e-05,-4e-06,1e-05,5e-05,-2.5e-05,-3.3e-05,-1e-05,2.3e-05,-6e-06,-3.1e-05,-6.5e-05,-3.8e-05,2.1e-05,5e-06,-6e-06
2.4e-05,5.2e-05,9.4e-05,5e-06,0.000126,-1e-05,2.1e-05,2e-06,8e-05,7.5e-05,2.4e-05,7e-06,-6.3e-05,-2e-06,2.3e-05,9.7e-05,-7e-06,4.2e-05,6e-05,7.1e-05,-2.6e-05,2.8e-05,3e-05,3.5e-05,-2.5e-05,0.000131,0.000116,8.4e-05,-3.9e-05,1e-05,2.3e-05,-1.3e-05,-6.8e-05,-2e-05,3.5e-05,6.3e-05,6.1e-05,-1.9e-05,1.9e-05,3e-05,4.7e-05,-4.5e-05,-2.1e-05,7.9e-05,2.5e-05,-9e-06,8.4e-05,-3.7e-05,-2.5e-05,-4.3e-05,1.8e-05,-3.2e-05,4.2e-05,8.6e-05,-3.7e-05,1.2e-05,8.7e-05,8e-06,-5.2e-05,3.4e-05,-0.000101,2e-05,7.4e-05,4.2e-05,-2.1e-05,3.1e-05,6.8e-05,3.3e-05,7e-06,-5.5e-05,-1.1e-05,-3.6e-05,-9e-05,-2.7e-05,8e-06,1.4e-05,-5e-05,-2.2e-05,1.6e-05,-5e-05,1e-06,4e-05,2e-05,-5e-06,1.7e-05,-1.7e-05,-2.3e-05,3.9e-05,4e-05,-6.8e-05,-4.8e-05,5.7e-05,7e-06,2.8e-05,3.7e-05,-3.2e-05,1.9e-05,2e-06,-2.3e-05,4.3e-05,1.5e-05,4.3e-05,-2e-06,4.6e-05,-2.4e-05,-1e-05,-1.9e-05,-4.4e-05,-2e-05,-2e-05,-2e-06,-2e-06,9e-06,5e-06,2e-05,-8.4e-05,-3.2e-05,2.5e-05,3.6e-05,1.2e-05,8e-06
6.7e-05,-3e-05,-6.8e-05,4.6e-05,1.2e-05,-5e-06,3.2e-05,4e-06,-0.000111,2.4e-05,-1.9e-05,-2.9e-05,-2.3e-05,2.2e-05,-4.6e-05,-8.3e-05,3.2e-05,-3.9e-05,-4.1e-05,-3.3e-05,-2.7e-05,-2.2e-05,7e-05,-6.6e-05,-1e-05,-0.000134,3e-05,-4e-06,2e-05,5.2e-05,8.1e-05,2e-05,5.5e-05,3e-06,-8.5e-05,2.7e-05,-6.5e-05,7.3e-05,-4.5e-05,-1.7e-05,8.8e-05,4.6e-05,9e-05,-3.6e-05,-6.6e-05,1.1e-05,-2e-05,2.4e-05,1.6e-05,8e-06,-5.3e-05,-9e-06,-7.8e-05,4.4e-05,1.8e-05,7.3e-05,-1.2e-05,-4.6e-05,-3.9e-05,7e-05,6.7e-05,3.1e-05,1.3e-05,-1.7e-05,5.5e-05,1.5e-05,3e-06,-1.2e-05,8e-06,-1.2e-05,5.5e-05,2.4e-05,1.3e-05,3e-06,-4.7e-05,-1.6e-05,7.6e-05,4.4e-05,7.9e-05,5e-06,-2.6e-05,9.2e-05,5.6e-05,-2.2e-05,1.6e-05,-2e-05,-1.3e-05,4e-05,3.1e-05,4.9e-05,0.000102,-5.9e-05,5e-06,5.5e-05,6.6e-05,3.8e-05,-2.3e-05,9e-06,5.8e-05,-1.2e-05,-5.5e-05,6e-06,1.3e-05,-3e-05,-1e-06,-1.8e-05,-6.3e-05,6.9e-05,5.7e-05,2.3e-05,5e-06,3.9e-05,2.8e-05,2.1e-05,9e-06,5.3e-05,-1e-06,5.6e-05,-1.4e-05,-5e-06,-3.1e-05
2.4e-05,-1e-05,5e-05,-2.2e-05,-1e-05,-2.9e-05,-9e-05,-1e-06,8.4e-05,-1.3e-05,4e-06,4.6e-05,8.4e-05,4.1e-05,1.9e-05,3.6e-05,1.8e-05,5.8e-05,3e-06,7e-06,-2.2e-05,-8e-06,7e-06,4e-06,-3e-06,0.000147,-1.5e-05,-1e-05,1e-06,-3e-05,-2.9e-05,4.9e-05,-3.3e-05,-2.3e-05,7.2e-05,4e-06,4.8e-05,3e-06,4.6e-05,0,-1.1e-05,-2.4e-05,-0.000127,-3.7e-05,5.7e-05,3.3e-05,5.3e-05,-2.9e-05,0,2e-05,2.6e-05,5e-06,1.1e-05,-2.7e-05,-1.7e-05,-7.1e-05,-3.9e-05,6e-05,-9e-06,-8.2e-05,2.5e-05,2.5e-05,-2.8e-05,-2e-06,0,-3.4e-05,-4e-05,-2.8e-05,-2.1e-05,4.4e-05,-4.7e-05,-1.6e-05,-3e-06,5e-06,-3e-06,-2e-05,2.2e-05,1e-05,-2.9e-05,-2.3e-05,1.4e-05,-5e-05,-3.7e-05,2.5e-05,-1.9e-05,5.7e-05,5e-06,-6.6e-05,-5.2e-05,-2e-06,-9e-06,1.1e-05,5e-06,7.9e-05,-3.7e-05,-2e-06,-5.5e-05,-8e-06,1.1e-05,8e-06,-2.8e-05,-1e-05,-9e-06,4e-06,4e-06,-1.6e-05,1.5e-05,-4.1e-05,1.2e-05,-4e-06,1e-05,-2.1e-05,-7e-06,-3.8e-05,-2.2e-05,-2.3e-05,6e-06,-1.1e-05,3.9e-05,-2.6e-05,-1.6e-05
-2e-06,-1.5e-05,-4e-05,-2.2e-05,1.1e-05,-1.6e-05,-3.3e-05,-4.1e-05,-2.4e-05,-1.6e-05,-3.9e-05,-2e-05,-2.9e-05,-2.6e-05,-2e-06,-5.4e-05,-1.8e-05,-4.2e-05,2e-06,-2.6e-05,-1e-06,-2e-05,-2.5e-05,-8e-06,3.7e-05,-7.9e-05,-1.4e-05,-2.1e-05,-5e-06,-1.3e-05,6e-06,-1.3e-05,1.5e-05,-9e-06,1.4e-05,-3e-05,2.2e-05,-7e-06,-3.5e-05,9e-06,-5.8e-05,-2.2e-05,6.9e-05,-2.6e-05,-4.1e-05,-8e-06,1.3e-05,0,-5.1e-05,2.6e-05,2.3e-05,-1.8e-05,-9e-06,-4.6e-05,-1e-06,3.2e-05,4.9e-05,-1.6e-05,-7e-06,2.3e-05,-4.7e-05,-2.6e-05,-8e-06,-1.2e-05,7e-06,4.1e-05,1e-05,-3e-05,-1.4e-05,-1.7e-05,-9e-06,1e-05,2e-05,5e-06,1.3e-05,1.3e-05,2e-06,-1.5e-05,-1.7e-05,-7e-06,6e-06,-5.6e-05,-2.5e-05,-6e-06,6e-06,-4.9e-05,-1.9e-05,5.6e-05,5.8e-05,-5e-06,-4e-06,-1e-05,-9e-06,-4.4e-05,3.8e-05,-2e-06,1.5e-05,-1.7e-05,-9e-06,-3.7e-05,-3.4e-05,-3.3e-05,-1.6e-05,5e-06,4e-06,1.3e-05,-4.1e-05,9e-06,0,-8e-06,2.6e-05,-6e-06,2e-06,-7e-06,-1.3e-05,3.7e-05,1.1e-05,-5e-06,-1.9e-05,2.7e-05,-6e-06
-2e-05,-2e-05,-2.8e-05,3.3e-05,-3e-05,2.3e-05,4.2e-05,7e-06,-5e-06,-3.7e-05,1.7e-05,1.2e-05,1.4e-05,-7e-06,3.9e-05,4.2e-05,1.8e-05,-1.1e-05,-1.2e-05,-2e-06,1.4e-05,2.2e-05,-1e-06,-2.2e-05,-4e-06,5e-06,3.9e-05,6e-06,-3.6e-05,-3e-05,-4.7e-05,-2e-06,1e-06,1.5e-05,7e-06,6e-06,-2.5e-05,8e-06,-4.1e-05,-1e-05,-8e-06,1.8e-05,3.3e-05,2.5e-05,4e-06,-1.5e-05,-3.7e-05,-3e-06,3.9e-05,-2e-05,-2.2e-05,1.3e-05,7e-06,-4e-06,2.3e-05,-2.4e-05,-2e-05,1.3e-05,-2e-05,5.6e-05,-3e-06,-4.3e-05,-1.6e-05,7e-06,-1.9e-05,-1.6e-05,-2.2e-05,1.8e-05,2e-05,6e-06,3.7e-05,-9e-06,-2.1e-05,1.2e-05,1.1e-05,-5e-06,4e-06,-1.2e-05,1.9e-05,2e-05,-4e-06,1.3e-05,3e-06,7e-06,-6e-06,2.1e-05,-2.4e-05,-1.9e-05,-4e-05,-3.2e-05,-8e-06,1.1e-05,1.3e-05,-3.2e-05,-3.4e-05,-9e-06,-3e-05,1.4e-05,-3e-05,2.4e-05,1e-05,-1e-06,7e-06,-2.3e-05,-3.2e-05,3.2e-05,2.3e-05,-7e-06,-1.6e-05,8e-06,-1.8e-05,-4e-06,9e-06,1.8e-05,2.2e-05,-4e-06,-8e-06,-9e-06,3.6e-05,1.2e-05,2.9e-05
1.4e-05,2.6e-05,-4e-06,4e-06,8e-06,1.1e-05,1.3e-05,4e-06,-1e-05,3e-05,6e-06,-1e-06,-2.6e-05,1.2e-05,-1.3e-05,0,-7e-06,1.2e-05,4e-06,1.5e-05,7e-06,-1.8e-05,2.9e-05,2e-05,2e-06,1.8e-05,-3.9e-05,-9e-06,3.2e-05,4e-05,1.1e-05,0,-9e-06,2e-06,-2.5e-05,0,1.3e-05,-1.5e-05,2.5e-05,-3e-06,7e-06,-1.2e-05,-3.4e-05,1.2e-05,5e-06,2e-06,1.2e-05,-1e-05,-1.2e-05,-2e-06,3.4e-05,-6e-06,-1.7e-05,-1.1e-05,2.9e-05,-1e-05,-1.4e-05,-3.1e-05,1.7e-05,-2e-06,1.5e-05,3.7e-05,7e-06,8e-06,1.5e-05,-4e-06,1.7e-05,1.3e-05,-8e-06,-6e-06,1e-05,-2e-06,1.1e-05,9e-06,-2e-05,1.3e-05,-1.5e-05,-1e-06,-7e-06,3.2e-05,4e-06,3.4e-05,7e-06,-4e-06,-5e-06,7e-06,1e-05,-3e-06,7e-06,3.4e-05,-1e-05,1.6e-05,-1e-05,1.7e-05,-1.8e-05,2.1e-05,1.7e-05,-6e-06,3e-06,-1.1e-05,-4e-06,5e-06,5e-06,9e-06,1.7e-05,-3.3e-05,1e-06,9e-06,1e-06,-9e-06,1.2e-05,2.9e-05,-1.2e-05,1.4e-05,3e-06,6e-06,3e-06,-9e-06,-1.7e-05,-1.1e-05,1e-05
-1.7e-05,3e-06,3.1e-05,-7e-06,8e-06,7e-06,1.2e-05,-7e-06,2.1e-05,1.7e-05,8e-06,-6e-06,1.1e-05,-5e-06,-8e-06,-1e-05,-9e-06,3.5e-05,-8e-06,-1.3e-05,-9e-06,-1e-06,1.7e-05,1e-06,-7e-06,-2e-06,2.4e-05,4e-06,-9e-06,-1e-05,-1e-06,-1.3e-05,5e-06,3e-06,4e-06,-3e-05,1.4e-05,3e-06,4e-06,3e-06,1e-05,1.8e-05,1.3e-05,2e-06,1e-06,0,1.8e-05,6e-06,-2e-06,1.3e-05,-1.1e-05,-2.1e-05,5e-06,9e-06,-7e-06,1.4e-05,6e-06,2.7e-05,4e-06,-2e-06,-8e-06,-4.7e-05,-6e-06,-6e-06,-3e-06,-1e-05,-2e-06,-5e-06,4e-06,2e-06,5e-06,4e-06,4e-06,-3e-06,5e-06,-1.4e-05,-1e-06,-1e-06,-9e-06,-5e-06,-1e-06,-3.3e-05,2e-06,3e-06,5e-06,-4e-06,1e-05,-5e-06,-6e-06,-3e-06,-1.1e-05,4e-06,2e-06,-7e-06,9e-06,2e-06,2e-06,6e-06,6e-06,2.4e-05,1.2e-05,-8e-06,2e-06,-7e-06,1.3e-05,6e-06,-1.6e-05,1.1e-05,-9e-06,1e-06,-1.2e-05,-1e-05,3e-06,-1.3e-05,-6e-06,0,0,-1e-05,-1e-05,1.8e-05,-1.5e-05
8e-06,7e-06,-1.2e-05,-7e-06,6e-06,-2.7e-05,-1.4e-05,-1e-05,-1.5e-05,-1.6e-05,-1e-06,8e-06,1e-06,5e-06,1.6e-05,1.1e-05,1.2e-05,-2.9e-05,6e-06,6e-06,5e-06,1e-05,-1.1e-05,1.6e-05,7e-06,-1.8e-05,-2.1e-05,-2e-06,1e-05,-7e-06,5e-06,1.2e-05,-1e-06,-7e-06,-3e-06,-7e-06,-1.2e-05,1.2e-05,1e-05,0,-1e-05,-3e-06,-4e-06,-1.2e-05,-2e-06,2e-06,1.1e-05,-1e-06,-1e-05,1e-06,-1.8e-05,1.7e-05,1.2e-05,8e-06,3e-06,-5e-06,-9e-06,-1.1e-05,6e-06,-3e-05,-7e-06,2.5e-05,-2e-06,1e-05,-3e-06,1.2e-05,8e-06,4e-06,-1.3e-05,1.3e-05,-2e-06,-2e-06,1.6e-05,-1e-05,4e-06,4e-06,-1e-06,1e-06,-4e-06,-1.8e-05,-3e-06,8e-06,1.1e-05,-4e-06,-2e-06,-7e-06,0,4e-06,1e-06,1e-05,5e-06,-3e-06,1.1e-05,-2e-06,-3e-06,-6e-06,-1.1e-05,-8e-06,-1.6e-05,-1e-06,3e-06,-1.3e-05,-3e-06,7e-06,-1.2e-05,7e-06,1.9e-05,-4e-06,2e-06,1e-06,1.2e-05,-4e-06,-3e-06,-1.3e-05,-1e-06,2e-06,-2e-06,-5e-06,1.1e-05,-2.2e-05,2e-06
-3e-06,1.1e-05,3e-06,1.4e-05,-1.2e-05,8e-06,1e-05,9e-06,0,1.5e-05,5e-06,-1.6e-05,8e-06,8e-06,-6e-06,2e-06,1e-06,1.1e-05,-4e-06,-5e-06,-8e-06,3e-06,-4e-06,2e-06,-3e-06,2.8e-05,9e-06,9e-06,-1e-06,2e-06,-4e-06,0,-4e-06,-1e-06,2e-06,-6e-06,1e-05,-9e-06,-9e-06,-6e-06,-3e-06,-7e-06,7e-06,-8e-06,0,-4e-06,-1.4e-05,2e-06,1.7e-05,-8e-06,1.7e-05,3e-06,-1.6e-05,5e-06,-1.7e-05,8e-06,1e-05,6e-06,-3e-06,1.4e-05,1e-06,1.1e-05,2e-06,2e-06,-8e-06,-3e-06,0,2e-06,-1e-06,-4e-06,-8e-06,2e-06,-3e-06,4e-06,-1.1e-05,0,1e-06,-3e-06,2e-06,7e-06,1e-06,1.4e-05,-1e-06,0,2e-06,-3e-06,-4e-06,-9e-06,-5e-06,-1e-05,5e-06,2e-06,-6e-06,8e-06,1.4e-05,-1e-06,2e-05,1.1e-05,1.5e-05,0,-2e-06,1.5e-05,6e-06,-1.2e-05,-6e-06,-2.1e-05,-5e-06,-1.3e-05,3e-06,4e-06,-9e-06,6e-06,0,-4e-06,-2e-06,-5e-06,-3e-06,4e-06,5e-06,1.1e-05,-4e-06
7e-06,-1.4e-05,3e-06,-4e-06,1.6e-05,-1e-05,6e-06,-4e-06,6e-06,-8e-06,-4e-06,1e-06,-1.8e-05,-9e-06,-2.1e-05,-5e-06,-3e-06,4e-06,1e-06,1e-06,-1e-06,2e-06,8e-06,-2e-06,-7e-06,-1.2e-05,2.1e-05,-1e-06,2e-06,2e-06,2e-06,-3e-06,8e-06,5e-06,2e-06,-2e-06,-4e-06,1.4e-05,2.3e-05,1e-06,3e-06,6e-06,-9e-06,4e-06,1e-06,-2e-06,7e-06,2e-06,-1.4e-05,-1e-06,-8e-06,-1e-06,1e-05,6e-06,-1e-05,-6e-06,-2.9e-05,-9e-06,1.3e-05,-7e-06,4e-06,-3e-06,-2e-06,0,6e-06,0,-6e-06,-6e-06,-2e-06,-1.2e-05,2e-06,-1e-06,-1.2e-05,-8e-06,2e-06,1e-06,-2e-06,-2e-06,1e-05,-9e-06,1e-06,0,-8e-06,-8e-06,1e-06,-4e-06,4e-06,6e-06,0,1.2e-05,5e-06,-1.4e-05,-4e-06,4e-06,-1.9e-05,0,-2e-06,-4e-06,-2e-06,-6e-06,4e-06,0,-2e-06,1.2e-05,1.2e-05,1.6e-05,5e-06,1.3e-05,6e-06,-3e-06,1e-06,-4e-06,2e-06,5e-06,4e-06,-6e-06,4e-06,-7e-06,-1e-05,-3e-06,2e-06
2e-06,3e-06,2e-06,-1.6e-05,-8e-06,7e-06,-7e-06,5e-06,-4e-06,-8e-06,0,1e-05,6e-06,4e-06,1.3e-05,-6e-06,6e-06,4e-06,4e-06,-6e-06,7e-06,-5e-06,1.2e-05,5e-06,-4e-06,2e-06,-2.6e-05,-4e-06,-8e-06,1e-06,-1e-06,3e-06,-5e-06,4e-06,0,-7e-06,-9e-06,0,-1.6e-05,-1e-06,0,-1.1e-05,9e-06,-7e-06,-2e-06,1e-06,-7e-06,-4e-06,9e-06,1.2e-05,6e-06,-1e-06,4e-06,-1.3e-05,-1e-06,-3e-06,1e-05,4e-06,-6e-06,-1.6e-05,-3e-06,3e-06,-4e-06,-5e-06,-1e-06,1e-06,-3e-06,-3e-06,5e-06,3e-06,5e-06,0,-2e-06,8e-06,7e-06,0,6e-06,3e-06,-1e-06,2e-06,-5e-06,-4e-06,2e-06,4e-06,0,0,-4e-06,1e-05,-4e-06,3e-06,-1e-06,-1e-06,6e-06,1.2e-05,3e-06,-6e-06,0,-1e-06,7e-06,-9e-06,1e-06,-2e-06,-4e-06,-5e-06,-5e-06,8e-06,7e-06,1e-06,4e-06,2e-06,6e-06,-6e-06,1e-06,6e-06,-1e-06,3e-06,2e-06,-1e-06,7e-06,-2e-06,1e-06
-5e-06,-4e-06,2e-06,4e-06,3e-06,6e-06,-1.3e-05,3e-06,2e-06,-3e-06,1e-06,-7e-06,-7e-06,-2e-06,-1e-06,4e-06,2e-06,-1.4e-05,0,8e-06,-3e-06,-2e-06,-1e-05,-1e-06,3e-06,1.2e-05,1.3e-05,1e-06,0,-8e-06,-8e-06,-3e-06,3e-06,-2e-06,0,0,1.2e-05,1e-06,9e-06,-3e-06,-6e-06,1e-06,-2e-06,1.4e-05,4e-06,-1e-06,5e-06,4e-06,-1.4e-05,-1e-05,3e-06,6e-06,5e-06,-7e-06,-3e-06,2e-06,3e-06,-5e-06,-2e-06,3e-06,-2e-06,-1e-05,-2e-06,-1e-06,1e-06,5e-06,-9e-06,4e-06,-4e-06,-1e-06,-1e-06,-3e-06,7e-06,-6e-06,-5e-06,-1e-06,0,1e-06,-1e-06,4e-06,5e-06,-1.7e-05,-2e-06,-2e-06,0,0,-8e-06,-1e-05,-2e-06,-2e-06,9e-06,0,-1e-06,-6e-06,3e-06,0,7e-06,-3e-06,-7e-06,7e-06,5e-06,-8e-06,0,2e-06,-8e-06,-1.6e-05,-3e-06,1e-06,-1e-06,-1e-06,-1e-06,1e-06,2e-06,-5e-06,-3e-06,-1e-06,0,0,-2e-06,2e-06,3e-06
6e-06,-7e-06,-5e-06,6e-06,2e-06,2e-06,6e-06,0,-2e-06,1e-06,-3e-06,6e-06,1.3e-05,-3e-06,3e-06,1e-06,-2e-06,1e-05,0,-3e-06,1e-06,-1e-06,-1e-06,-4e-06,2e-06,-1.4e-05,-3e-06,-2e-06,-5e-06,7e-06,-3e-06,-1e-06,-3e-06,0,-2e-06,3e-06,-4e-06,3e-06,-2e-06,1e-06,-8e-06,1e-06,5e-06,0,-6e-06,2e-06,-3e-06,-5e-06,8e-06,9e-06,-8e-06,-4e-06,-1e-05,4e-06,4e-06,-6e-06,-7e-06,5e-06,-4e-06,-3e-06,5e-06,6e-06,1e-06,1e-06,-3e-06,-3e-06,7e-06,1e-06,5e-06,5e-06,-4e-06,2e-06,0,-2e-06,-3e-06,0,-1e-06,2e-06,1e-06,-1e-06,-3e-06,1.2e-05,2e-06,0,0,4e-06,1e-06,1e-05,0,-3e-06,-1e-05,-1e-06,-3e-06,-1.4e-05,-1e-05,3e-06,-7e-06,3e-06,3e-06,-2e-06,-1e-06,7e-06,0,-2e-06,6e-06,4e-06,0,-8e-06,-3e-06,1e-06,3e-06,-5e-06,-1e-06,-1e-06,2e-06,2e-06,2e-06,-1e-06,7e-06,0,-4e-06
-3e-06,3e-06,3e-06,-1e-06,0,-4e-06,-1e-06,-1e-06,1e-06,1.2e-05,3e-06,0,-3e-06,5e-06,-1e-06,2e-06,-2e-06,0,2e-06,-2e-06,-8e-06,3e-06,1e-06,-4e-06,-6e-06,1.3e-05,1e-06,1e-06,7e-06,-1e-06,1e-06,2e-06,0,-3e-06,3e-06,1e-06,1e-06,-5e-06,5e-06,3e-06,4e-06,-3e-06,-8e-06,0,3e-06,-2e-06,0,3e-06,4e-06,-4e-06,0,0,1.2e-05,2e-06,7e-06,9e-06,1e-06,1e-06,-5e-06,7e-06,-2e-06,-1.1e-05,3e-06,-1e-06,1e-06,-2e-06,0,0,0,1e-06,2e-06,0,-3e-06,0,7e-06,2e-06,1e-06,-1e-06,-2e-06,-2e-06,2e-06,8e-06,4e-06,3e-06,0,1e-06,3e-06,-1.1e-05,-2e-06,1e-06,-3e-06,8e-06,1e-06,-1e-06,1e-06,0,3e-06,3e-06,-2e-06,8e-06,-4e-06,6e-06,-3e-06,2e-06,5e-06,-3e-06,-1e-06,2e-06,-4e-06,-2e-06,-6e-06,7e-06,-1e-06,-2e-06,0,0,-1e-06,0,-9e-06,-1e-06,1e-06
0,-4e-06,1e-06,-1e-06,-7e-06,-7e-06,-5e-06,1e-06,2e-06,-1e-06,-3e-06,-2e-06,-4e-06,-3e-06,4e-06,-2e-06,1e-06,-1e-06,-3e-06,3e-06,2e-06,0,8e-06,-2e-06,3e-06,-9e-06,-1e-06,0,1e-06,2e-06,2e-06,-3e-06,0,0,-2e-06,4e-06,6e-06,4e-06,-6e-06,-2e-06,6e-06,3e-06,2e-06,-4e-06,0,-1e-06,-2e-06,1e-06,-8e-06,0,2e-06,-2e-06,-4e-06,4e-06,2e-06,-6e-06,1e-06,-3e-06,-2e-06,-9e-06,-4e-06,0,-1e-06,-2e-06,-3e-06,0,2e-06,-2e-06,1e-06,-6e-06,-1e-06,1e-06,-1e-06,1e-06,-3e-06,0,-5e-06,1e-06,0,1e-06,-2e-06,-4e-06,2e-06,0,-1e-06,0,-3e-06,0,0,-1e-06,0,-1e-06,2e-06,0,1e-06,-2e-06,-2e-06,-3e-06,-2e-06,0,-4e-06,-4e-06,2e-06,0,-8e-06,-4e-06,-2e-06,2e-06,-2e-06,2e-06,6e-06,1e-06,-2e-06,0,-1e-06,2e-06,1e-06,1e-06,4e-06,-2e-06,0
-1e-06,2e-06,-1e-06,-1e-06,4e-06,1e-06,-3e-06,-4e-06,-5e-06,-6e-06,1e-06,4e-06,-3e-06,1e-06,3e-06,4e-06,0,-1e-06,0,-1e-06,2e-06,1e-06,-6e-06,0,0,4e-06,-4e-06,1e-06,-2e-06,-2e-06,5e-06,0,2e-06,3e-06,-1e-06,0,-4e-06,-4e-06,5e-06,-1e-06,1e-06,-3e-06,2e-06,-1e-06,1e-06,-1e-06,2e-06,-2e-06,2e-06,-1e-06,-5e-06,3e-06,-3e-06,2e-06,2e-06,1e-06,3e-06,-2e-06,2e-06,2e-06,7e-06,9e-06,1e-06,1e-06,0,2e-06,2e-06,-1e-06,-4e-06,4e-06,-1e-06,-1e-06,3e-06,1e-06,1e-06,-1e-06,3e-06,0,-2e-06,-2e-06,1e-06,-3e-06,-3e-06,-3e-06,1e-06,1e-06,-2e-06,1e-06,2e-06,0,-1e-06,-3e-06,-2e-06,4e-06,-2e-06,0,-4e-06,-3e-06,4e-06,-1e-06,-5e-06,0,1e-06,-3e-06,-1e-06,6e-06,1e-06,1e-06,2e-06,0,-4e-06,1e-06,1e-06,2e-06,1e-06,-3e-06,-1e-06,3e-06,2e-06,2e-06,0
0,5e-06,-1e-06,5e-06,0,6e-06,7e-06,0,2e-06,3e-06,-2e-06,-8e-06,7e-06,1e-06,-4e-06,-2e-06,1e-06,5e-06,2e-06,1e-06,3e-06,1e-06,-2e-06,1e-06,0,1e-06,5e-06,0,1e-06,-2e-06,-4e-06,2e-06,-1e-06,-1e-06,0,5e-06,2e-06,3e-06,1e-06,1e-06,-2e-06,0,2e-06,2e-06,-3e-06,2e-06,0,2e-06,3e-06,0,7e-06,0,-3e-06,-3e-06,-1e-06,4e-06,-4e-06,3e-06,1e-06,3e-06,-5e-06,-3e-06,1e-06,3e-06,1e-06,-3e-06,-5e-06,-1e-06,0,3e-06,2e-06,0,1e-06,1e-06,-2e-06,0,-1e-06,1e-06,0,2e-06,-1e-06,0,-2e-06,0,0,-3e-06,1e-06,-1e-06,-3e-06,-4e-06,1e-06,3e-06,0,4e-06,4e-06,0,1e-06,0,-2e-06,-6e-06,-2e-06,1e-06,-1e-06,3e-06,7e-06,2e-06,-2e-06,-2e-06,1e-06,0,0,4e-06,-1e-06,0,0,3e-06,1e-06,0,-2e-06,-2e-06,1e-06
5e-06,-1e-06,6e-06,0,-3e-06,1e-06,5e-06,-1e-06,3e-06,-3e-06,1e-06,4e-06,1e-06,-3e-06,-5e-06,-4e-06,0,-3e-06,-4e-06,-1e-06,1e-06,1e-06,-1e-06,-1e-06,-4e-06,-2e-06,-4e-06,0,-1e-06,3e-06,0,-1e-06,0,-1e-06,0,3e-06,3e-06,0,-3e-06,1e-06,0,1e-06,-9e-06,2e-06,3e-06,0,-3e-06,-2e-06,-4e-06,4e-06,-3e-06,0,3e-06,-2e-06,-4e-06,-7e-06,5e-06,-1e-06,1e-06,-4e-06,-1e-06,3e-06,-1e-06,-1e-06,0,1e-06,-2e-06,1e-06,0,-1e-06,0,-1e-06,1e-06,-3e-06,2e-06,1e-06,0,0,5e-06,0,1e-06,7e-06,1e-06,1e-06,0,-2e-06,-2e-06,4e-06,3e-06,2e-06,3e-06,-5e-06,1e-06,-1e-06,-2e-06,0,-1e-06,3e-06,2e-06,1e-06,1e-06,6e-06,1e-06,-2e-06,-4e-06,-3e-06,1e-06,-3e-06,2e-06,0,-1e-06,-3e-06,1e-06,2e-06,0,-4e-06,-1e-06,2e-06,-4e-06,1e-06,0
-3e-06,4e-06,-8e-06,-6e-06,4e-06,1e-06,-1e-06,0,-2e-06,-2e-06,0,0,-1e-06,2e-06,5e-06,3e-06,0,0,1e-06,3e-06,1e-06,-2e-06,4e-06,2e-06,3e-06,-1e-06,4e-06,-1e-06,-3e-06,-1e-06,-3e-06,1e-06,0,-1e-06,1e-06,2e-06,-4e-06,1e-06,4e-06,-2e-06,1e-06,-3e-06,6e-06,2e-06,-2e-06,-1e-06,1e-06,1e-06,-1e-06,-5e-06,-5e-06,0,-3e-06,-3e-06,-2e-06,3e-06,0,-1e-06,1e-06,2e-06,4e-06,-3e-06,0,0,0,0,-1e-06,1e-06,1e-06,0,-1e-06,1e-06,-1e-06,0,-3e-06,1e-06,2e-06,-1e-06,0,1e-06,0,-4e-06,-2e-06,-1e-06,0,-1e-06,-3e-06,0,0,-1e-06,1e-06,3e-06,-1e-06,1e-06,-3e-06,1e-06,-1e-06,-1e-06,-1e-06,1e-06,1e-06,-5e-06,2e-06,3e-06,-3e-06,-4e-06,1e-06,4e-06,2e-06,0,3e-06,0,0,-2e-06,0,2e-06,0,2e-06,3e-06,-1e-06,0
1e-06,-1e-06,3e-06,1e-06,-4e-06,-5e-06,-2e-06,0,-2e-06,3e-06,0,-4e-06,-3e-06,-1e-06,-3e-06,-2e-06,0,2e-06,2e-06,-2e-06,-4e-06,-1e-06,-3e-06,2e-06,0,6e-06,-5e-06,0,0,2e-06,2e-06,0,0,-1e-06,0,-1e-06,4e-06,0,-1e-06,0,1e-06,1e-06,-2e-06,-4e-06,0,0,-2e-06,0,2e-06,4e-06,6e-06,0,-3e-06,0,-3e-06,-1e-06,4e-06,2e-06,0,-2e-06,-4e-06,0,0,1e-06,0,1e-06,0,1e-06,-1e-06,-3e-06,1e-06,0,-2e-06,2e-06,0,-1e-06,-2e-06,0,-1e-06,-2e-06,0,-8e-06,2e-06,1e-06,0,0,1e-06,2e-06,1e-06,2e-06,0,0,0,-2e-06,5e-06,1e-06,2e-06,0,1e-06,0,2e-06,-1e-06,-1e-06,-5e-06,4e-06,0,-2e-06,1e-06,-1e-06,0,0,-1e-06,1e-06,-2e-06,-1e-06,-2e-06,0,0,2e-06,-2e-06,-1e-06
-2e-06,-3e-06,0,2e-06,1e-06,1e-06,2e-06,0,4e-06,2e-06,0,6e-06,0,-1e-06,-1e-06,2e-06,1e-06,0,-3e-06,1e-06,1e-06,0,-2e-06,0,1e-06,-7e-06,3e-06,1e-06,2e-06,-3e-06,-1e-06,-1e-06,0,1e-06,0,0,1e-06,-1e-06,3e-06,-1e-06,0,-1e-06,1e-06,1e-06,0,-1e-06,3e-06,0,-2e-06,-1e-06,-3e-06,1e-06,3e-06,3e-06,0,1e-06,-6e-06,-2e-06,2e-06,6e-06,1e-06,-4e-06,1e-06,1e-06,0,-2e-06,1e-06,0,1e-06,0,-1e-06,0,1e-06,-2e-06,2e-06,-1e-06,2e-06,-1e-06,1e-06,0,0,8e-06,1e-06,-2e-06,-1e-06,1e-06,1e-06,-4e-06,-1e-06,-1e-06,-2e-06,-2e-06,0,-5e-06,0,0,1e-06,-2e-06,-1e-06,4e-06,2e-06,-2e-06,0,5e-06,2e-06,3e-06,3e-06,0,-1e-06,0,-2e-06,-4e-06,0,1e-06,0,1e-06,0,1e-06,-2e-06,3e-06,1e-06
1e-06,0,2e-06,0,0,0,2e-06,0,-3e-06,1e-06,0,-2e-06,4e-06,2e-06,2e-06,0,-1e-06,-2e-06,2e-06,0,-1e-06,2e-06,-2e-06,0,-2e-06,5e-06,1e-06,0,0,2e-06,1e-06,0,1e-06,0,0,1e-06,-2e-06,-1e-06,-4e-06,0,0,0,-3e-06,-3e-06,-1e-06,1e-06,-1e-06,1e-06,5e-06,2e-06,0,-3e-06,-1e-06,2e-06,0,0,3e-06,0,0,-1e-06,1e-06,1e-06,0,-1e-06,1e-06,0,2e-06,-1e-06,1e-06,3e-06,0,-1e-06,-1e-06,2e-06,-1e-06,0,-1e-06,0,-2e-06,0,0,4e-06,0,1e-06,0,1e-06,-3e-06,1e-06,3e-06,0,-1e-06,2e-06,-1e-06,0,-3e-06,-1e-06,0,1e-06,-1e-06,0,2e-06,5e-06,1e-06,-3e-06,-5e-06,-2e-06,0,-2e-06,-1e-06,0,2e-06,2e-06,0,0,0,-1e-06,1e-06,0,0,-3e-06,0
0,-3e-06,-2e-06,-2e-06,2e-06,3e-06,-3e-06,0,-1e-06,-2e-06,0,0,-1e-06,-2e-06,1e-06,0,0,2e-06,2e-06,-1e-06,3e-06,0,2e-06,-1e-06,2e-06,-1e-06,-3e-06,0,0,0,1e-06,0,-1e-06,0,0,-3e-06,3e-06,0,5e-06,0,2e-06,0,2e-06,2e-06,0,-1e-06,1e-06,-1e-06,-6e-06,-2e-06,3e-06,0,0,0,3e-06,-1e-06,3e-06,1e-06,-1e-06,0,0,2e-06,0,-2e-06,0,0,-1e-06,-1e-06,-1e-06,-1e-06,1e-06,0,2e-06,0,0,0,-1e-06,0,0,0,0,-3e-06,-1e-06,0,0,1e-06,-1e-06,-3e-06,-1e-06,1e-06,-2e-06,-1e-06,0,2e-06,8e-06,1e-06,2e-06,0,1e-06,-2e-06,1e-06,-3e-06,-1e-06,2e-06,1e-06,1e-06,0,2e-06,-1e-06,0,0,-1e-06,0,1e-06,-1e-06,1e-06,0,0,1e-06,1e-06,1e-06
-2e-06,-2e-06,0,0,-4e-06,0,-3e-06,0,3e-06,-3e-06,-1e-06,2e-06,0,1e-06,2e-06,-1e-06,1e-06,1e-06,-3e-06,0,0,-1e-06,0,0,0,-2e-06,3e-06,0,-1e-06,-1e-06,0,0,0,1e-06,0,-2e-06,-1e-06,-2e-06,-3e-06,1e-06,1e-06,-2e-06,1e-06,-1e-06,0,0,-1e-06,1e-06,2e-06,0,-3e-06,0,-1e-06,-2e-06,2e-06,3e-06,-2e-06,0,-1e-06,3e-06,0,-1e-06,-1e-06,1e-06,0,0,-3e-06,0,0,0,0,0,-2e-06,-2e-06,0,0,0,0,0,0,0,-3e-06,-1e-06,0,0,0,0,1e-06,0,-1e-06,0,-1e-06,0,3e-06,-2e-06,-1e-06,0,1e-06,-1e-06,-2e-06,1e-06,-1e-06,-1e-06,-2e-06,4e-06,0,1e-06,0,1e-06,0,0,2e-06,0,-1e-06,0,-1e-06,0,-2e-06,0,1e-06,0
2e-06,1e-06,0,3e-06,3e-06,-2e-06,0,0,-2e-06,1e-06,1e-06,-4e-06,-3e-06,1e-06,-1e-06,1e-06,0,-2e-06,3e-06,0,-2e-06,0,-2e-06,0,0,2e-06,-1e-06,0,1e-06,0,-2e-06,0,0,0,0,-1e-06,0,1e-06,2e-06,-1e-06,-2e-06,1e-06,0,2e-06,0,-1e-06,1e-06,-1e-06,1e-06,2e-06,0,2e-06,4e-06,0,1e-06,-3e-06,-1e-06,-2e-06,-2e-06,1e-06,0,2e-06,0,1e-06,1e-06,-1e-06,0,1e-06,0,0,0,0,1e-06,2e-06,1e-06,0,0,0,0,0,1e-06,-1e-06,0,1e-06,0,-1e-06,-2e-06,2e-06,0,0,1e-06,2e-06,-1e-06,2e-06,-2e-06,0,0,0,1e-06,1e-06,0,0,0,2e-06,-4e-06,-2e-06,-2e-06,1e-06,1e-06,0,-3e-06,2e-06,0,-2e-06,0,1e-06,0,0,-1e-06,-1e-06,0
-2e-06,-1e-06,1e-06,-1e-06,-1e-06,0,2e-06,0,0,0,-1e-06,3e-06,2e-06,-2e-06,-1e-06,-1e-06,0,0,0,1e-06,1e-06,0,-1e-06,-1e-06,-1e-06,-2e-06,0,0,-1e-06,-1e-06,-1e-06,0,0,0,0,0,3e-06,-1e-06,-1e-06,0,-2e-06,-1e-06,-1e-06,-1e-06,0,1e-06,0,0,-1e-06,-3e-06,2e-06,-2e-06,-2e-06,0,0,2e-06,0,2e-06,-1e-06,2e-06,1e-06,-1e-06,0,-1e-06,0,1e-06,-1e-06,0,0,0,0,0,-1e-06,0,-1e-06,0,1e-06,0,2e-06,0,-1e-06,6e-06,-1e-06,0,0,0,-1e-06,-1e-06,0,0,0,-2e-06,0,-1e-06,4e-06,0,1e-06,0,-1e-06,0,-1e-06,2e-06,0,-1e-06,-1e-06,1e-06,1e-06,-3e-06,1e-06,0,2e-06,-1e-06,0,1e-06,0,0,0,0,0,1e-06,0
2e-06,3e-06,-1e-06,-1e-06,0,-2e-06,-1e-06,0,1e-06,0,1e-06,-2e-06,0,2e-06,3e-06,0,0,1e-06,-3e-06,-1e-06,-1e-06,0,0,0,2e-06,1e-06,1e-06,0,0,2e-06,0,0,0,0,0,-2e-06,-2e-06,1e-06,1e-06,1e-06,0,-1e-06,-1e-06,0,1e-06,0,0,1e-06,0,2e-06,-2e-06,1e-06,1e-06,0,-1e-06,0,0,-1e-06,1e-06,-3e-06,-1e-06,0,0,0,0,0,1e-06,0,-1e-06,2e-06,0,0,3e-06,-1e-06,1e-06,0,0,0,0,0,0,-1e-06,2e-06,-1e-06,0,-1e-06,1e-06,2e-06,0,-1e-06,2e-06,1e-06,1e-06,-2e-06,-3e-06,1e-06,-2e-06,-1e-06,1e-06,2e-06,-2e-06,-1e-06,0,0,3e-06,-1e-06,-1e-06,3e-06,0,0,0,1e-06,0,0,0,0,0,-2e-06,1e-06,-1e-06,0
-2e-06,1e-06,0,1e-06,2e-06,2e-06,-1e-06,0,0,2e-06,0,-1e-06,2e-06,0,-2e-06,0,0,0,3e-06,1e-06,1e-06,-1e-06,2e-06,0,0,0,-1e-06,0,0,-2e-06,1e-06,0,0,0,0,-1e-06,1e-06,0,0,0,0,0,3e-06,0,-1e-06,0,0,-1e-06,1e-06,-2e-06,2e-06,0,0,2e-06,-2e-06,-2e-06,-2e-06,0,1e-06,1e-06,-1e-06,-2e-06,0,1e-06,0,0,2e-06,0,1e-06,-1e-06,0,0,-1e-06,1e-06,0,0,0,0,0,0,0,-5e-06,0,1e-06,0,-1e-06,0,-2e-06,0,1e-06,0,0,0,-1e-06,1e-06,-1e-06,0,0,-1e-06,1e-06,-2e-06,-3e-06,1e-06,1e-06,1e-06,1e-06,0,-2e-06,0,0,-1e-06,-1e-06,0,0,0,0,0,0,0,1e-06,0
1e-06,-1e-06,1e-06,0,-2e-06,0,2e-06,0,0,0,0,4e-06,-4e-06,-1e-06,-2e-06,0,0,-1e-06,-1e-06,0,1e-06,1e-06,-2e-06,0,0,-1e-06,1e-06,0,2e-06,1e-06,-1e-06,0,0,1e-06,0,0,2e-06,0,-1e-06,-1e-06,0,-1e-06,-2e-06,0,1e-06,0,0,1e-06,-1e-06,1e-06,0,0,1e-06,0,-1e-06,3e-06,0,0,0,0,1e-06,2e-06,0,0,0,0,0,0,0,-2e-06,0,0,1e-06,0,0,0,0,0,0,0,0,3e-06,0,0,0,1e-06,-2e-06,0,-1e-06,-1e-06,-1e-06,-2e-06,-1e-06,0,0,0,0,1e-06,0,-1e-06,-2e-06,2e-06,0,0,-4e-06,1e-06,0,2e-06,0,0,0,-2e-06,0,1e-06,0,0,0,0,-3e-06,-1e-06,0
0,2e-06,-2e-06,-1e-06,0,1e-06,3e-06,0,1e-06,-2e-06,0,-3e-06,1e-06,2e-06,3e-06,0,0,1e-06,-3e-06,0,-1e-06,1e-06,0,0,0,0,-1e-06,0,-2e-06,0,1e-06,0,0,0,0,1e-06,-2e-06,0,2e-06,0,0,0,1e-06,2e-06,0,-1e-06,1e-06,0,1e-06,-1e-06,-2e-06,-2e-06,-1e-06,-1e-06,-1e-06,-2e-06,1e-06,1e-06,1e-06,-1e-06,0,0,0,-1e-06,0,0,-2e-06,0,1e-06,0,0,0,-2e-06,-1e-06,0,0,0,0,-2e-06,0,0,1e-06,-1e-06,-1e-06,0,1e-06,0,-1e-06,0,0,-2e-06,2e-06,1e-06,1e-06,-2e-06,0,-2e-06,0,0,-1e-06,0,1e-06,0,1e-06,2e-06,-4e-06,-1e-06,-4e-06,0,0,1e-06,0,0,-1e-06,0,0,0,0,4e-06,1e-06,0
-1e-06,-1e-06,2e-06,-1e-06,1e-06,-2e-06,0,0,-1e-06,-1e-06,0,2e-06,-1e-06,-1e-06,0,-1e-06,0,0,3e-06,0,-1e-06,0,-1e-06,0,0,0,-1e-06,0,1e-06,0,-1e-06,0,0,0,0,0,2e-06,0,-2e-06,0,0,-1e-06,0,-1e-06,0,0,-1e-06,0,-1e-06,0,3e-06,0,-1e-06,0,0,-1e-06,1e-06,-2e-06,0,-1e-06,-1e-06,0,0,0,0,0,-1e-06,0,-1e-06,0,0,0,2e-06,1e-06,0,0,0,0,0,0,0,0,0,0,0,0,1e-06,-1e-06,0,0,0,-1e-06,0,1e-06,1e-06,0,1e-06,-1e-06,0,-1e-06,0,1e-06,0,-2e-06,3e-06,2e-06,1e-06,3e-06,0,0,1e-06,-1e-06,0,0,0,0,0,0,-2e-06,0,0
1e-06,-1e-06,-1e-06,1e-06,1e-06,-1e-06,-2e-06,0,0,0,0,1e-06,4e-06,0,-1e-06,1e-06,0,0,-1e-06,0,0,-1e-06,3e-06,0,-1e-06,-2e-06,2e-06,0,0,0,0,0,0,0,0,0,0,0,3e-06,0,1e-06,-1e-06,1e-06,1e-06,0,0,1e-06,0,0,1e-06,-1e-06,1e-06,1e-06,-1e-06,0,1e-06,-2e-06,2e-06,0,-1e-06,1e-06,2e-06,0,1e-06,-1e-06,0,-1e-06,0,1e-06,1e-06,0,0,-1e-06,0,0,0,0,0,0,0,0,-4e-06,0,0,0,0,-2e-06,0,1e-06,0,-1e-06,0,-1e-06,1e-06,-1e-06,-1e-06,0,-1e-06,1e-06,0,1e-06,-4e-06,0,2e-06,-4e-06,1e-06,0,-2e-06,0,0,-2e-06,1e-06,0,0,0,0,0,1e-06,1e-06,0,0
-1e-06,1e-06,1e-06,1e-06,-2e-06,0,-1e-06,0,1e-06,1e-06,0,-3e-06,-2e-06,1e-06,0,0,0,0,-2e-06,0,-1e-06,0,-1e-06,0,0,2e-06,-1e-06,0,1e-06,-1e-06,-1e-06,0,0,0,0,2e-06,-1e-06,0,-3e-06,0,0,0,-1e-06,-2e-06,0,1e-06,-1e-06,-1e-06,2e-06,-2e-06,-1e-06,0,-1e-06,0,1e-06,-1e-06,1e-06,-1e-06,0,0,0,-1e-06,0,0,0,0,0,0,-1e-06,1e-06,0,0,1e-06,-1e-06,0,0,1e-06,0,0,0,0,-1e-06,-1e-06,0,0,-1e-06,-1e-06,0,0,1e-06,1e-06,2e-06,0,-1e-06,-2e-06,0,-1e-06,1e-06,-1e-06,0,1e-06,2e-06,0,-2e-06,0,-2e-06,0,2e-06,0,0,0,1e-06,0,-1e-06,0,-1e-06,0,1e-06,-1e-06,1e-06,0
