0.007581,0.009487,0.010743,0.01037,0.01243,0.015297,0.014914,0.014334,0.015805,0.015898,0.014216,0.013649,0.014197,0.013485,0.011809,0.011714,0.01201,0.011742,0.013079,0.015468,0.015258,0.014582,0.017629,0.01993,0.019417,0.019747,0.021379,0.021462
0.009275,0.011631,0.013105,0.012601,0.015732,0.020124,0.019348,0.018024,0.019919,0.020428,0.018729,0.017701,0.018098,0.017616,0.015385,0.015068,0.01558,0.01525,0.016978,0.020387,0.020569,0.019485,0.023509,0.026495,0.02548,0.026002,0.028333,0.028208
0.012364,0.015169,0.016927,0.01644,0.021623,0.028829,0.027389,0.024733,0.027392,0.028693,0.027145,0.025266,0.025103,0.025134,0.02212,0.021329,0.022228,0.022219,0.024699,0.02978,0.030755,0.029007,0.034925,0.0391,0.037447,0.038811,0.042184,0.041308
0.01579,0.018088,0.019471,0.019534,0.026625,0.03597,0.034269,0.030899,0.034207,0.036091,0.035227,0.033004,0.031867,0.032069,0.028811,0.027443,0.02868,0.030244,0.033461,0.039184,0.040997,0.039029,0.046541,0.052436,0.052221,0.055164,0.058724,0.056503
0.020254,0.021709,0.02205,0.022302,0.029537,0.03848,0.037932,0.03661,0.040765,0.04221,0.042036,0.040542,0.038024,0.038008,0.035566,0.0329,0.035427,0.040725,0.043571,0.047582,0.050225,0.048862,0.056577,0.067198,0.073988,0.079617,0.082789,0.07762
0.026487,0.028715,0.028945,0.028629,0.033232,0.038748,0.041117,0.046306,0.053209,0.053423,0.052811,0.051279,0.046643,0.047285,0.046199,0.041053,0.04746,0.057902,0.057857,0.058847,0.063059,0.062757,0.070159,0.089622,0.109938,0.120556,0.122746,0.111687
0.035542,0.040534,0.041143,0.04023,0.043618,0.047422,0.052543,0.063548,0.072891,0.071468,0.069463,0.065931,0.058502,0.060145,0.060257,0.053988,0.065113,0.078497,0.074742,0.075366,0.081828,0.081683,0.091315,0.121273,0.154096,0.168996,0.170378,0.153931
0.045644,0.054477,0.055693,0.054233,0.058134,0.061793,0.068399,0.08345,0.094414,0.090264,0.085689,0.078707,0.067935,0.070242,0.072635,0.068766,0.081988,0.092565,0.086651,0.090027,0.097776,0.097591,0.111939,0.149086,0.185199,0.200248,0.200467,0.183056
0.053233,0.0667,0.069763,0.068133,0.074822,0.07957,0.084155,0.098972,0.109316,0.102272,0.096887,0.087842,0.075135,0.077386,0.081329,0.081592,0.091699,0.094236,0.091506,0.100376,0.106961,0.1068,0.125123,0.162263,0.188379,0.196596,0.194833,0.185383
0.055823,0.0742,0.080663,0.078929,0.092441,0.100962,0.10194,0.112902,0.120059,0.113043,0.108968,0.100875,0.088486,0.08863,0.091179,0.093932,0.100802,0.096631,0.098423,0.111471,0.11676,0.118643,0.140852,0.175215,0.186038,0.182547,0.178475,0.180339
0.054273,0.076279,0.086502,0.086443,0.10778,0.119277,0.119086,0.130195,0.136094,0.134543,0.130119,0.120364,0.109249,0.10525,0.102674,0.107546,0.116492,0.107347,0.109533,0.124068,0.125939,0.13023,0.158432,0.199137,0.202805,0.183097,0.173488,0.187121
0.052038,0.073605,0.087543,0.092755,0.118553,0.131372,0.131591,0.141127,0.144835,0.154617,0.150883,0.133997,0.126576,0.121423,0.112478,0.121768,0.134129,0.119113,0.119104,0.132923,0.130666,0.139385,0.173721,0.220251,0.220443,0.188434,0.179157,0.205335
0.051062,0.070691,0.085577,0.094423,0.118932,0.131526,0.130913,0.136419,0.138222,0.15249,0.148739,0.126316,0.123496,0.124897,0.114639,0.126335,0.139951,0.12305,0.123691,0.132848,0.127469,0.140671,0.172703,0.215351,0.218868,0.186457,0.179389,0.213289
0.050198,0.068046,0.081451,0.090621,0.106429,0.11071,0.109526,0.114596,0.115771,0.124759,0.122273,0.10278,0.100176,0.111667,0.108273,0.115887,0.12751,0.119094,0.122747,0.126526,0.122477,0.132964,0.15206,0.178654,0.18996,0.176748,0.175596,0.20142
0.047093,0.064156,0.077769,0.085501,0.090871,0.089072,0.092673,0.103291,0.107481,0.105458,0.098242,0.088588,0.085907,0.094176,0.094971,0.099599,0.114145,0.119656,0.124466,0.135518,0.140612,0.137882,0.139418,0.148711,0.16257,0.170001,0.185472,0.207043
0.051051,0.069863,0.087171,0.096128,0.096593,0.097111,0.10055,0.115175,0.136459,0.131643,0.116914,0.115744,0.109585,0.098517,0.092845,0.098142,0.122017,0.139002,0.144971,0.178156,0.200195,0.180767,0.169716,0.179692,0.189916,0.187448,0.219957,0.26057
0.068018,0.08837,0.112563,0.125533,0.124746,0.127657,0.130698,0.15222,0.190912,0.189518,0.173943,0.174946,0.162931,0.136999,0.119483,0.128088,0.162793,0.180004,0.184605,0.242537,0.281867,0.258502,0.2436,0.248833,0.257547,0.242689,0.277691,0.33846
0.093193,0.111974,0.14454,0.164272,0.164721,0.167562,0.172572,0.1976,0.243708,0.250745,0.24206,0.242776,0.226923,0.190355,0.160024,0.175077,0.216808,0.229875,0.228995,0.298186,0.343604,0.330422,0.332742,0.329538,0.331091,0.322402,0.351387,0.408636
0.125572,0.14072,0.17707,0.2017,0.206472,0.214506,0.223902,0.238841,0.277893,0.30726,0.31375,0.305631,0.294377,0.254345,0.202566,0.224838,0.273894,0.284179,0.272991,0.328147,0.368372,0.379733,0.420692,0.409907,0.382377,0.38968,0.42235,0.457545
0.157759,0.169407,0.205696,0.235831,0.24551,0.2542,0.268449,0.274675,0.294894,0.346842,0.369587,0.343564,0.345858,0.315852,0.244075,0.270534,0.323842,0.333682,0.316727,0.351684,0.386125,0.424441,0.510509,0.49205,0.412335,0.428018,0.48266,0.496754
0.182011,0.198264,0.227608,0.255278,0.26697,0.264572,0.284931,0.298551,0.296876,0.347979,0.376781,0.338664,0.35143,0.33492,0.26345,0.285931,0.333119,0.347505,0.344564,0.369687,0.388274,0.446229,0.570664,0.539115,0.410576,0.426504,0.500107,0.500918
0.189853,0.211731,0.229713,0.259795,0.278723,0.252079,0.260311,0.285197,0.27005,0.307713,0.341313,0.31003,0.312201,0.296444,0.244222,0.252563,0.294077,0.317627,0.331572,0.345439,0.343092,0.421549,0.545277,0.494,0.379719,0.396788,0.453669,0.465792
0.18764,0.210864,0.223041,0.271273,0.308392,0.25384,0.222428,0.246403,0.234266,0.268255,0.29733,0.273087,0.255895,0.241204,0.213209,0.202473,0.250329,0.289433,0.295415,0.282827,0.278753,0.371897,0.444036,0.372284,0.335982,0.369339,0.376541,0.396851
0.159648,0.182561,0.212228,0.279624,0.315654,0.243329,0.188414,0.210217,0.205907,0.244245,0.268439,0.235608,0.202639,0.200091,0.189695,0.16517,0.219525,0.279108,0.267667,0.211787,0.212288,0.321056,0.355679,0.285555,0.291618,0.316439,0.29573,0.312423
0.122266,0.137991,0.172566,0.234647,0.257175,0.198188,0.149151,0.173983,0.185183,0.201593,0.211432,0.182236,0.1539,0.173712,0.18109,0.143693,0.17382,0.236056,0.219403,0.150661,0.152383,0.242854,0.27034,0.223913,0.230595,0.258028,0.23751,0.226415
0.123758,0.123343,0.136012,0.172352,0.178297,0.14403,0.110636,0.14062,0.174476,0.163193,0.149494,0.138183,0.130736,0.165263,0.189081,0.153199,0.145067,0.181465,0.182001,0.145567,0.135533,0.166222,0.189457,0.172415,0.180227,0.22315,0.215324,0.179466
0.143169,0.134261,0.13195,0.147035,0.147517,0.124097,0.096546,0.122158,0.160587,0.164535,0.152294,0.143341,0.147608,0.175124,0.203637,0.176702,0.150314,0.178635,0.198135,0.174116,0.141833,0.128218,0.141723,0.151765,0.156767,0.192849,0.211727,0.177819
0.149076,0.141658,0.138102,0.149189,0.153048,0.130863,0.108912,0.11614,0.140852,0.168832,0.169036,0.155859,0.154332,0.176277,0.208975,0.193346,0.165595,0.19261,0.216825,0.195661,0.153291,0.126227,0.13966,0.156639,0.144143,0.15796,0.201595,0.186984
0.125038,0.123504,0.131813,0.146582,0.151325,0.136405,0.123158,0.113897,0.132204,0.161819,0.157749,0.150478,0.13872,0.146356,0.177281,0.173948,0.153403,0.172033,0.191992,0.182158,0.145351,0.125116,0.153693,0.171503,0.15528,0.154297,0.178023,0.17279
0.084091,0.086094,0.106982,0.134254,0.139135,0.136402,0.130839,0.106936,0.119225,0.135514,0.125156,0.132984,0.11741,0.09809,0.114709,0.123867,0.12555,0.131181,0.132782,0.135792,0.116744,0.106794,0.142555,0.168983,0.169364,0.152276,0.134316,0.137342
0.066787,0.061227,0.085996,0.120069,0.124583,0.129577,0.122454,0.087613,0.095595,0.102599,0.090715,0.103835,0.100443,0.078823,0.07695,0.087319,0.104191,0.099027,0.085072,0.086995,0.079223,0.083206,0.120023,0.153871,0.163902,0.136971,0.098862,0.103549
0.064233,0.053005,0.077502,0.108745,0.108835,0.11512,0.10119,0.066464,0.089514,0.098739,0.076816,0.077974,0.079855,0.077997,0.078048,0.077063,0.084105,0.076058,0.057249,0.055485,0.050095,0.063249,0.110364,0.145176,0.142019,0.119228,0.091561,0.084921
0.062918,0.056997,0.079103,0.100641,0.096045,0.098858,0.084116,0.053259,0.084474,0.094909,0.067695,0.06502,0.063955,0.068154,0.069346,0.062566,0.067344,0.062649,0.045876,0.039355,0.037874,0.05544,0.098101,0.122911,0.114182,0.100883,0.080374,0.070267
0.060629,0.061156,0.077294,0.082553,0.07508,0.075364,0.071438,0.052226,0.07523,0.085301,0.056497,0.050893,0.049273,0.050357,0.048807,0.046316,0.053182,0.052404,0.042955,0.037929,0.041253,0.052189,0.070762,0.082847,0.080963,0.078546,0.066506,0.059666
0.071716,0.067117,0.075545,0.067677,0.05743,0.057047,0.061868,0.055001,0.066647,0.074974,0.049603,0.039414,0.041617,0.043903,0.039033,0.037414,0.042056,0.047295,0.044985,0.046807,0.054783,0.046078,0.040497,0.050909,0.062946,0.071296,0.065762,0.050445
0.085396,0.075346,0.068963,0.057108,0.050784,0.045802,0.0559,0.057015,0.055544,0.059002,0.042303,0.038745,0.051383,0.055758,0.046742,0.03713,0.037449,0.049642,0.050775,0.058012,0.066706,0.041005,0.03005,0.048903,0.067467,0.080109,0.070643,0.043744
0.087929,0.07611,0.059735,0.051745,0.052681,0.042488,0.045175,0.053126,0.049973,0.044513,0.035563,0.0445,0.06362,0.064502,0.051428,0.038855,0.036858,0.047922,0.051234,0.061846,0.073754,0.045974,0.031301,0.049426,0.067557,0.078821,0.066834,0.039832
0.073531,0.065402,0.061201,0.063739,0.056722,0.038162,0.032071,0.045003,0.057814,0.048099,0.031956,0.045523,0.066765,0.062606,0.04849,0.036829,0.03178,0.039702,0.045254,0.053713,0.070344,0.054899,0.035644,0.044251,0.056946,0.063432,0.053475,0.035482
0.048371,0.054334,0.073791,0.077793,0.054568,0.036782,0.033297,0.051127,0.07242,0.063962,0.041387,0.042481,0.057852,0.056474,0.050015,0.037313,0.023947,0.033313,0.043774,0.040084,0.057858,0.062345,0.044934,0.050759,0.050431,0.05048,0.04795,0.03491
0.025528,0.046187,0.090412,0.084568,0.045907,0.041166,0.050148,0.074345,0.085941,0.078752,0.063407,0.045551,0.044548,0.052419,0.062255,0.0455,0.023393,0.035415,0.043318,0.032786,0.047464,0.064356,0.063097,0.072858,0.056427,0.04744,0.048935,0.034045
