0.027135,0.028007,0.027343,0.027652,0.025202,0.025032,0.027005,0.024044,0.02423,0.028709,0.028764,0.025682,0.025253,0.024588,0.024183,0.028398,0.028396,0.024457,0.023832,0.022515,0.022211,0.024215,0.023244,0.02159,0.023516,0.024512,0.025392,0.02689
0.037132,0.037945,0.036444,0.037234,0.034431,0.034063,0.036921,0.03274,0.032202,0.038568,0.03946,0.03513,0.034404,0.033643,0.032928,0.038707,0.039003,0.033318,0.032139,0.030613,0.030563,0.033882,0.032259,0.029527,0.032717,0.034172,0.035333,0.037273
0.056069,0.056708,0.053244,0.055143,0.0521,0.05145,0.056363,0.050244,0.047675,0.056949,0.05978,0.05317,0.05193,0.051075,0.049318,0.057785,0.058798,0.049768,0.04766,0.046315,0.047076,0.053146,0.049892,0.044891,0.051064,0.053393,0.054744,0.057068
0.072694,0.073202,0.06766,0.070528,0.068182,0.067687,0.074985,0.067943,0.062159,0.072639,0.078074,0.069417,0.067851,0.067272,0.063895,0.074313,0.076386,0.064543,0.061626,0.061107,0.063064,0.072423,0.067263,0.059671,0.069322,0.072449,0.073218,0.074883
0.078618,0.078852,0.072356,0.075261,0.074429,0.074552,0.08275,0.076898,0.068527,0.076507,0.083638,0.074816,0.073325,0.073651,0.069558,0.079759,0.082149,0.069896,0.067262,0.068067,0.070493,0.081655,0.07644,0.067662,0.078034,0.080593,0.079952,0.08005
0.072605,0.072309,0.068466,0.070191,0.07001,0.069709,0.074526,0.072044,0.0644,0.06698,0.07411,0.068152,0.066066,0.066717,0.064284,0.071539,0.072957,0.063596,0.062014,0.064979,0.067332,0.076407,0.074388,0.066726,0.071835,0.071668,0.069535,0.068897
0.072048,0.070899,0.071481,0.071187,0.069911,0.069219,0.067145,0.067395,0.064904,0.06507,0.072609,0.068091,0.062065,0.062698,0.062807,0.063656,0.065037,0.063033,0.0619,0.067218,0.069197,0.072326,0.076348,0.070558,0.066037,0.062412,0.05845,0.05978
0.098881,0.09597,0.096728,0.092849,0.090355,0.091097,0.084282,0.084934,0.08572,0.086898,0.097349,0.091218,0.079341,0.081075,0.083292,0.078877,0.082716,0.087988,0.086814,0.093744,0.093887,0.091956,0.102091,0.094989,0.081982,0.077872,0.075256,0.078928
0.137476,0.132042,0.130604,0.12376,0.121158,0.121572,0.111035,0.112067,0.11577,0.11808,0.130904,0.126371,0.11282,0.115291,0.118687,0.11174,0.118489,0.128844,0.127455,0.135881,0.133629,0.128043,0.142606,0.134522,0.118133,0.114725,0.109927,0.111119
0.165217,0.158514,0.158498,0.153804,0.151662,0.14947,0.135517,0.133819,0.138789,0.141286,0.153344,0.156066,0.149123,0.151337,0.154818,0.14718,0.153318,0.165684,0.164225,0.172766,0.167592,0.159398,0.176767,0.170723,0.160146,0.161159,0.148204,0.142408
0.171983,0.166462,0.173714,0.183086,0.182463,0.171102,0.15548,0.147829,0.151906,0.155222,0.160517,0.172009,0.179701,0.183194,0.185848,0.175601,0.173405,0.183896,0.183635,0.1892,0.183132,0.17664,0.191585,0.19088,0.196592,0.203607,0.180317,0.166669
0.178845,0.176751,0.187408,0.218906,0.225854,0.198449,0.1798,0.16038,0.165659,0.180036,0.175747,0.187752,0.207785,0.223159,0.228453,0.201144,0.18082,0.183738,0.182109,0.184446,0.182537,0.182732,0.196454,0.211198,0.235013,0.240102,0.21101,0.192951
0.212146,0.208172,0.213816,0.266305,0.287904,0.24281,0.215993,0.190388,0.19814,0.224556,0.218907,0.219766,0.232989,0.267308,0.288338,0.242075,0.200698,0.186593,0.177682,0.183166,0.190594,0.201077,0.214992,0.242979,0.284309,0.287164,0.252702,0.227304
0.25052,0.237833,0.248806,0.316917,0.342524,0.286792,0.256449,0.231448,0.234941,0.267412,0.274137,0.254853,0.244076,0.295798,0.340305,0.287315,0.226869,0.204083,0.193219,0.199165,0.213724,0.237318,0.251576,0.269405,0.318959,0.32997,0.286502,0.248179
0.267172,0.239404,0.262615,0.327929,0.337824,0.283926,0.26612,0.258266,0.260935,0.284586,0.295511,0.26209,0.235625,0.287923,0.336174,0.295225,0.231904,0.209624,0.207948,0.211672,0.229695,0.263685,0.268634,0.258392,0.296651,0.316996,0.275993,0.227766
0.244444,0.215467,0.247427,0.289531,0.271637,0.231829,0.237331,0.254961,0.263112,0.265652,0.262508,0.231535,0.202849,0.235975,0.273478,0.25839,0.21425,0.19245,0.192339,0.189271,0.211867,0.260751,0.254299,0.214763,0.226883,0.24758,0.223296,0.176055
0.191674,0.17993,0.205311,0.224766,0.197385,0.176408,0.196292,0.221559,0.226778,0.214967,0.202573,0.179979,0.153839,0.167055,0.196799,0.203592,0.185166,0.166491,0.160327,0.153756,0.176654,0.227863,0.219551,0.175562,0.16656,0.177914,0.17023,0.137051
0.141852,0.142727,0.155333,0.183059,0.179612,0.157552,0.164277,0.189057,0.195723,0.176337,0.161261,0.153071,0.141117,0.138529,0.141216,0.152805,0.160202,0.153808,0.16217,0.156021,0.145782,0.172109,0.172543,0.154442,0.157954,0.160543,0.148844,0.136761
0.153434,0.139294,0.137472,0.197397,0.221724,0.181588,0.17669,0.212965,0.22718,0.204999,0.183953,0.16749,0.156186,0.153569,0.13775,0.144764,0.177147,0.189914,0.219591,0.21033,0.155417,0.1525,0.151076,0.146605,0.174562,0.182492,0.171642,0.176512
0.201056,0.167108,0.158842,0.227649,0.254929,0.206209,0.216862,0.277097,0.303633,0.282592,0.246192,0.204605,0.172851,0.172267,0.161468,0.17545,0.229542,0.248221,0.288653,0.287089,0.208693,0.182956,0.161997,0.152722,0.200953,0.215649,0.210276,0.223541
0.263495,0.212142,0.198241,0.249047,0.256257,0.2101,0.243176,0.324941,0.364471,0.342591,0.286897,0.237915,0.196215,0.185424,0.178599,0.19359,0.26275,0.291102,0.327513,0.33446,0.248292,0.205332,0.178682,0.168661,0.21884,0.232501,0.228816,0.23766
0.321065,0.253871,0.239778,0.278639,0.260712,0.216943,0.26503,0.343771,0.37452,0.345415,0.283478,0.255946,0.222962,0.199158,0.190327,0.190973,0.258825,0.299944,0.314848,0.318619,0.249361,0.212489,0.194709,0.18586,0.220431,0.228318,0.219524,0.214717
0.3522,0.27816,0.26728,0.317139,0.287832,0.243306,0.30062,0.341573,0.330926,0.297278,0.256089,0.25778,0.234437,0.199836,0.184536,0.17918,0.234408,0.285773,0.286083,0.260844,0.208211,0.198815,0.197028,0.192573,0.228633,0.237371,0.209265,0.202311
0.326245,0.276426,0.276708,0.324002,0.288811,0.262413,0.317907,0.3038,0.257939,0.242578,0.235212,0.249776,0.230601,0.18805,0.161608,0.16215,0.204354,0.248646,0.2429,0.198414,0.169983,0.19398,0.197304,0.189428,0.229437,0.243549,0.20638,0.199838
0.247429,0.225679,0.237847,0.270598,0.241239,0.237868,0.279639,0.238491,0.191136,0.191554,0.195675,0.206156,0.199315,0.160745,0.126687,0.135294,0.163567,0.19364,0.204255,0.165239,0.150409,0.186661,0.191088,0.182186,0.207978,0.220684,0.189884,0.175644
0.157891,0.142497,0.156407,0.188753,0.186568,0.183409,0.199222,0.16937,0.144009,0.149435,0.149303,0.149603,0.146965,0.129482,0.110836,0.114423,0.127522,0.144192,0.168877,0.154264,0.141901,0.163191,0.162857,0.15486,0.164947,0.171757,0.153062,0.130663
0.1019,0.090445,0.108616,0.144407,0.145159,0.129491,0.134086,0.128687,0.128153,0.136603,0.138117,0.138485,0.1224,0.107441,0.099966,0.09829,0.108521,0.11935,0.135139,0.143028,0.133183,0.123044,0.118867,0.118987,0.120428,0.120298,0.119576,0.103426
0.095492,0.083381,0.114134,0.142748,0.121055,0.095523,0.100824,0.112144,0.116428,0.124252,0.129867,0.130912,0.11965,0.106082,0.09315,0.08749,0.108262,0.11852,0.104972,0.11853,0.1203,0.096792,0.103798,0.10975,0.09751,0.095103,0.09972,0.095047
0.106356,0.094127,0.129542,0.151747,0.116513,0.080053,0.080536,0.105872,0.10919,0.112926,0.116014,0.112386,0.119708,0.118337,0.097584,0.081762,0.102317,0.111403,0.078707,0.095588,0.120476,0.097476,0.107274,0.121201,0.100968,0.090291,0.091214,0.092916
0.10934,0.106033,0.138766,0.159188,0.131815,0.077565,0.066649,0.107412,0.115373,0.114013,0.117292,0.106451,0.112694,0.128749,0.117288,0.087726,0.089096,0.102973,0.079852,0.094819,0.129861,0.109666,0.114096,0.134605,0.110052,0.08027,0.074791,0.091456
0.104269,0.106965,0.144225,0.173517,0.153896,0.082651,0.070503,0.130279,0.137245,0.123024,0.123194,0.105937,0.093771,0.120113,0.13209,0.099534,0.089505,0.111544,0.093883,0.096558,0.131095,0.119992,0.117262,0.139171,0.112722,0.066519,0.059852,0.091191
0.097371,0.097583,0.14287,0.189372,0.164983,0.08501,0.080503,0.14627,0.145181,0.116464,0.111942,0.094202,0.073419,0.110807,0.13876,0.103067,0.098574,0.1282,0.103553,0.08756,0.11355,0.117624,0.120037,0.135283,0.105815,0.06493,0.062795,0.097005
0.086509,0.087466,0.135049,0.178691,0.146065,0.077819,0.083473,0.136401,0.124522,0.093282,0.085728,0.074116,0.065801,0.117509,0.136554,0.090439,0.098297,0.128752,0.10269,0.080761,0.095998,0.10438,0.108581,0.115783,0.092646,0.065049,0.063112,0.091761
0.072439,0.068195,0.109654,0.13562,0.105855,0.068135,0.081911,0.105662,0.084681,0.072665,0.072123,0.060628,0.058372,0.116063,0.122563,0.076792,0.10136,0.115399,0.091557,0.080184,0.078342,0.085168,0.088422,0.095307,0.093745,0.069431,0.058273,0.075236
0.057897,0.047974,0.075967,0.086706,0.081456,0.069176,0.073617,0.074774,0.057342,0.059781,0.064519,0.0495,0.047393,0.10169,0.108281,0.07842,0.108089,0.097293,0.071694,0.071296,0.062615,0.069807,0.070598,0.075132,0.091186,0.070883,0.050723,0.0578
0.050981,0.050284,0.060448,0.061069,0.077949,0.075337,0.062671,0.058376,0.04838,0.048565,0.049576,0.034585,0.038628,0.079921,0.084513,0.080317,0.114674,0.090611,0.057108,0.054858,0.048249,0.054843,0.057753,0.062286,0.079111,0.065581,0.042671,0.047566
0.043711,0.05383,0.058624,0.058607,0.08555,0.084755,0.058606,0.058824,0.049729,0.045947,0.03944,0.026796,0.035562,0.05693,0.060366,0.083724,0.118582,0.088897,0.05683,0.047745,0.041903,0.048039,0.047706,0.056556,0.068588,0.062918,0.041643,0.039846
0.043128,0.048925,0.052732,0.063447,0.097119,0.090029,0.06416,0.075615,0.059597,0.050704,0.044863,0.030742,0.035286,0.040072,0.048057,0.086157,0.110198,0.079594,0.059463,0.045748,0.037989,0.040747,0.035806,0.062752,0.080364,0.0696,0.045918,0.031277
0.04275,0.036699,0.044326,0.063164,0.09827,0.094223,0.073485,0.091512,0.0697,0.054461,0.052807,0.035425,0.032871,0.029639,0.038614,0.07514,0.091757,0.064112,0.054347,0.044395,0.035921,0.030551,0.026034,0.077544,0.112014,0.087533,0.055241,0.026924
0.037785,0.023579,0.041941,0.058643,0.088416,0.104771,0.085528,0.100818,0.069679,0.049718,0.057349,0.037938,0.032486,0.034727,0.037189,0.054084,0.076533,0.057855,0.04129,0.038386,0.036288,0.027294,0.028119,0.1073,0.1649,0.120943,0.063246,0.025957
