-0.000384,-0.000892,-0.000735,-2.9e-05,-0.000365,-0.000747,-0.000694,-0.000508,-1.2e-05,-3.9e-05,0.00031,0.000294,-0.000262,-0.00062,-0.000734,-4e-04,-0.00017,-0.000315,-0.000466,-0.001008,-0.000597,-0.000627,-0.000301,-0.000261,2.8e-05,-0.000132,-0.000343,-0.000349,0.000403,0.000242,2.4e-05,-9e-05,0.000717,0.00071,-3e-06,0.000985,0.000238,-0.000228,0.000172,0.000731,-0.000329,-0.000548,0.003536,0.001252,0.001594,0.006305,-0.011032,-0.016893,-0.012102,-0.006657,-0.005941,-0.014746,-0.002471,0.000162,-0.015123,-0.018393,-0.009071,0.003627,-0.023558,-0.011783,-0.002031,-0.008194,-0.020793,-0.02714,-0.01888,-0.02656,-0.025303,-0.024092,-0.026561,0.000687,-0.006805,-0.013438,-0.026978,-0.024714,-0.029017,-0.022448,-0.023521,-0.03019,-0.027548,-0.02739,-0.014305,-0.024206,-0.025073,-0.025026,-0.026231,-0.020156,-0.027955,-0.032532,-0.02709,-0.008609,-0.019129,-0.015169,-0.025762,-0.022076,-0.007168,-0.015919,-0.028892,-0.020189,-0.029404,-0.019813,-0.013878,-0.020837,-0.026565,-0.027665,-0.017118,-0.016289,-0.011425,-0.020423,-0.000939,-0.028503,-0.015983,-0.00775,-0.025877,-0.026137,-0.031584,-0.013686,-0.014982,-0.016107,-0.015981,-0.016698,-0.02364
-0.000205,0.000376,0.000404,-0.000261,-0.001094,-0.000181,0.000345,0.000119,-0.00024,-0.000374,-0.000265,-0.000357,-0.000211,-0.000385,0.000185,-0.000317,-0.000395,-0.000509,-5.9e-05,0.000688,0.000195,0.000473,0.000311,3.6e-05,-0.000293,0.000126,-0.000293,-0.000548,-0.001294,-0.000453,-9.3e-05,-0.000192,-0.000641,-0.000539,-0.001175,-0.001315,-0.000344,0.000254,-0.001228,-0.001282,5e-06,-0.001145,-0.002107,-0.004064,-0.006322,-0.019098,-0.011975,-0.001966,-0.010421,-0.012653,-0.020185,-0.012281,-0.023143,-0.008556,0.002144,-0.015279,-0.013091,-0.037801,-0.005821,-0.02497,-0.029824,-0.027986,-0.017025,0.004025,0.007358,-0.015367,0.00756,0.018824,0.024235,0.00156,-0.017828,-0.010089,0.012684,-0.00114,0.016275,0.017645,0.020123,0.007465,0.020276,0.025093,0.006939,-0.017942,-0.007751,0.006889,0.018425,-0.01255,0.008163,0.018258,0.000258,-0.014998,-0.014473,-0.003734,0.01229,-0.002384,-0.015812,-0.010454,-0.00803,0.00454,0.010287,0.001298,-0.009445,-0.005908,-0.004514,0.003719,-0.022534,-0.007491,-0.015569,0.001081,-0.006432,-0.014461,-0.009665,-0.003159,-0.000652,0.016589,0.003902,-0.008166,-0.020373,0.001993,0.017026,0.023024,0.002592
5e-05,-0.000495,-0.000615,-0.000364,0.000384,7.6e-05,-0.000595,0.000108,-0.00072,-0.000127,-0.000371,0.000109,0.000193,0.000302,-0.000129,-0.000141,-0.000325,6.8e-05,1.5e-05,-0.000463,-0.000261,3e-06,-0.000513,-0.00024,0.000238,0.000101,-9.8e-05,-0.000125,-0.000409,-0.000326,-0.000168,-0.000758,-0.000532,-0.000639,-0.00047,-0.001293,-0.001065,-0.00083,-0.000518,-0.001652,-0.000776,-0.00076,-0.002985,-0.000788,-0.003369,0.006497,0.004071,-0.006687,0.012596,0.012637,0.008281,-0.001488,0.018959,0.001229,-0.005657,0.012552,0.011454,0.002409,-0.000338,0.007507,0.018016,0.021733,0.009592,0.002307,-0.006401,0.021925,-0.006258,-0.018746,-0.019422,-0.012104,0.013521,0.013707,-0.003665,-0.007351,-0.013998,-0.015317,-0.012184,-0.005559,-0.008878,-0.015038,-0.016247,0.006979,0.022488,0.002374,-0.011579,-0.001857,-0.007789,-0.014975,-0.014982,-0.009515,-0.004432,-0.010467,-0.018999,-0.008322,-0.021044,0.001502,-0.003384,-0.014411,-0.010741,0.002352,-0.00091,-0.003763,-0.004777,-0.003328,-0.006411,-0.011808,0.002665,-0.007034,0.0069,-0.005246,0.003494,0.002643,-0.002464,-0.011147,-0.000516,-0.000969,0.007033,0.00241,-0.005056,-0.001773,-0.001069
-0.000156,2e-06,0.000345,-0.000246,0.000291,0.000624,0.000341,5.7e-05,0.000224,-0.000204,0.000642,0.000658,0.000292,-8.7e-05,0.000371,7e-05,-0.000197,-0.000169,-0.000179,0.000353,0.000487,3e-06,-4.5e-05,-0.000163,5.9e-05,0.000193,0.000141,0.000259,0.000269,0.000185,-9.1e-05,-9.9e-05,5e-05,-0.000397,0.000364,0.000201,0.000195,0.000553,0.000997,0.000706,0.000167,-5.7e-05,0.001293,0.002227,0.003946,0.00307,0.00014,-0.001638,-0.001251,-0.00915,-0.021324,-0.00052,-0.012023,-0.00186,-0.003681,-0.012699,-0.001956,0.00931,0.013486,0.000327,7.6e-05,-0.005916,0.000666,-0.010411,0.005593,0.003161,0.000743,0.003723,0.007003,0.009969,0.001356,-0.002181,0.002969,-0.000467,0.007335,-0.007578,0.012662,-0.005753,0.011013,0.005646,0.014924,0.001416,-0.004709,0.004612,0.010269,-0.000622,0.008132,0.01392,0.004634,0.007246,0.018378,0.016294,0.01404,0.016746,0.022105,-0.00204,0.014072,0.016626,0.015386,0.004078,0.015096,0.009861,0.011827,0.010058,0.009971,0.018761,0.006464,0.009363,-0.007424,0.016217,-0.007133,-0.013633,-0.001663,0.005591,-0.005417,0.01641,0.005967,0.009341,0.008457,-0.009697,0.000293
0.000223,-7.7e-05,-0.00021,-9.9e-05,-0.000535,-0.000389,-5.1e-05,3e-06,1.3e-05,0.000274,0.000231,2e-04,-0.000297,8.4e-05,-3e-04,-9e-06,-0.000229,-0.000247,0.000333,-0.000221,-8e-06,-0.000109,-1e-06,0.000103,0.000282,-0.000174,6.6e-05,0.000177,0.000154,0.000621,9.7e-05,0.000315,0.000254,0.000648,0.00034,0.000277,0.000757,-1.2e-05,-0.000115,0.000521,0.000761,0.000652,0.000611,-0.001646,-0.001014,-0.000943,-0.004134,0.004032,-0.002697,0.01114,0.007558,-0.014546,-0.006468,-0.00562,-0.003584,0.00844,-0.013951,-0.012349,-0.020575,0.004392,-0.008812,-0.007833,-0.015028,-0.002163,-0.000567,-0.00385,-0.009851,-0.003089,-0.013892,-0.0139,-0.002459,-0.011671,-0.008956,-0.000891,-0.002024,0.003718,-0.007337,0.007066,-0.010628,0.000427,-0.016277,-0.004556,-0.00685,-0.007587,-0.006367,-0.002136,-0.006193,-0.010882,0.003359,-0.003189,-0.016184,-0.003306,-0.014235,0.0035,-0.006624,0.004922,-0.00178,-0.00969,-0.011529,-0.003588,-0.014592,0.008599,-0.005091,-0.014088,0.003174,-0.010319,-0.00059,-0.011945,0.007075,-0.001518,0.006654,0.00693,0.003609,0.006676,0.006151,-0.00542,-0.016424,-0.012413,-0.002589,0.004528,-0.003432
-0.000198,0.000113,0.000192,0.00025,6.2e-05,-0.000443,-0.000109,-9.2e-05,0.000275,0.000497,0.000183,-0.000452,-0.000198,1.7e-05,-0.000284,-0.000109,-5.9e-05,-0.000215,-0.000235,0.000134,-0.000251,-7.3e-05,0.000296,-0.000118,-0.000146,-0.000106,-0.000277,-0.000298,-0.000135,-0.000444,-0.000328,0.000139,-6e-06,0.00047,-1.2e-05,-0.000267,0.000121,0.00012,-8.3e-05,-0.000262,-0.000392,-0.000282,5.2e-05,0.00129,0.001512,-0.00286,0.007902,0.002276,-0.006522,-0.002166,-0.001418,-0.000401,0.005371,0.003596,-0.004142,-0.000793,-0.00646,0.011242,0.007938,0.005548,-0.006769,0.010095,0.011231,0.010268,0.002065,0.003906,-0.008092,-0.006209,-0.001486,0.007567,0.016825,0.013078,0.014362,0.000647,0.005113,-0.00476,0.007999,0.003309,0.004976,6e-04,0.006233,-0.002094,0.002507,0.000228,0.007265,-0.001088,0.006172,0.007031,-0.004826,-0.00317,-0.003904,-0.011966,-0.002475,-0.003606,-0.002612,0.008248,-0.00337,0.007208,0.012815,0.003434,0.011761,-0.012478,-0.01245,0.006528,-0.002566,-0.002538,-0.006388,-0.004158,-0.000673,-0.006524,-0.006968,-0.005213,-0.007063,-0.011856,0.001821,0.002788,0.007088,0.005354,-0.007235,-0.00315,0.003151
-0.000231,-5.9e-05,-0.000357,4.3e-05,0.000148,0.00047,0.000131,-0.000187,-0.000467,-0.000256,0.000173,5.2e-05,0.000215,0.000185,0.000172,-8.8e-05,0.000509,0.00033,2.2e-05,-0.000203,0.000136,0.000117,-3e-06,2.4e-05,-1.2e-05,6e-06,1e-04,0.000174,-0.000101,4.8e-05,-0.000161,-0.000138,-0.000346,-0.000207,-3.3e-05,-0.000459,-0.000738,-0.00061,-0.000428,-0.000355,-0.000595,-0.000146,-0.000243,-0.000796,-0.000297,0.000827,-0.00129,-0.004681,0.006685,0.000455,0.004495,0.007875,0.004757,0.00495,0.004782,0.003942,0.001662,-0.004416,0.005026,0.006098,0.002792,-0.004872,0.004004,7e-06,-0.00598,-0.004798,0.003728,0.011027,-0.004317,-0.003043,-0.001092,-0.005463,0.007597,-6.4e-05,0.006551,0.000997,0.000666,-0.004859,-0.004343,0.001313,0.001376,0.009788,0.000962,-0.004256,0.006753,0.000678,0.006736,-0.005299,0.001897,-0.000772,0.001835,0.009662,-0.000328,0.004544,0.008429,-0.004687,0.004114,-0.004959,-0.009166,-0.013723,-0.004513,0.002582,0.006858,0.002005,0.001456,-0.003485,-0.000406,0.009723,-0.002624,0.005929,0.006006,0.004261,-0.001578,0.002043,-0.000312,-0.005502,-0.001531,-0.001157,0.003909,-0.002786,0.006606
0.000222,0.000257,3.1e-05,2.2e-05,-6.1e-05,-0.000137,-0.000317,0.000129,0.000236,-9.6e-05,-0.000216,-9.1e-05,-0.000216,-0.000221,6.1e-05,0.000311,-6.6e-05,0.00015,6.7e-05,-0.000161,-0.000226,-6.7e-05,6.1e-05,0.000116,7.8e-05,-0.000117,-0.000166,7e-06,0.000409,7e-05,4.6e-05,0.000198,-0.000103,-0.000245,-0.000376,0.000131,0.000107,0.000149,-0.00024,0.000372,-7.7e-05,0.000168,-0.000586,0.00026,-0.001924,0.001412,-0.003629,0.000922,0.000223,-0.00557,-0.00532,-0.000306,-0.002719,-0.012033,-0.017263,-0.004828,-0.002217,0.000851,-0.012278,-0.002895,-0.011996,-0.007878,-0.011154,0.002103,0.001446,0.008388,0.004635,-0.005062,0.001243,0.001903,-0.000433,-0.001975,-0.004053,-0.003856,-0.015294,-0.004751,-0.002036,0.004712,0.003462,0.001809,-0.00442,-0.004724,-0.005725,-0.005013,-0.005458,-0.003522,-0.01505,0.003675,-0.000171,0.000376,0.004168,-0.005273,0.001221,-0.00378,-0.001054,-0.007278,-0.009293,-0.00589,0.003843,0.009391,-0.000859,0.004224,-0.000511,-0.002798,0.003847,-0.000357,0.008282,-0.001774,-0.001955,-0.009638,0.003413,0.005112,-0.006889,0.001129,0.00111,-4e-05,0.005563,-0.009492,-0.00612,-0.002679,-0.000464
-4.1e-05,-2.5e-05,3e-05,-0.000134,0.000227,-0.000247,-4.4e-05,-0.00019,-9.7e-05,-5e-05,-0.000238,-6e-05,-0.000164,5.2e-05,-0.000187,-6.8e-05,-4.6e-05,6.5e-05,1.2e-05,5e-05,5.5e-05,-0.000154,2.2e-05,-0.000115,-3.7e-05,1.6e-05,-0.000163,-1e-04,-4e-05,-0.000142,0.000223,-5.2e-05,4.1e-05,0.000178,0.000135,0.000389,-0.000324,0.000232,0.000106,3.9e-05,2.4e-05,0.000165,0.000564,-0.000238,0.00064,-0.000263,0.001046,0.000814,-0.000682,-0.001495,-0.002377,0.006476,0.000126,0.004896,0.003461,0.00072,-0.001037,-0.002151,-0.00509,0.00467,-0.000157,-0.000502,0.000277,-6.6e-05,0.005648,-0.006122,-0.006861,-0.00459,0.004087,-0.003156,-0.002542,-0.005606,0.001443,0.001117,0.002543,0.004435,0.000947,-0.003793,-0.00849,0.000749,0.004788,0.004366,-0.001088,-0.002548,0.004403,0.002523,0.003212,-0.001521,0.00024,-0.000416,0.001134,-0.000755,0.008441,0.003593,0.001378,0.00458,0.011755,0.003521,0.000123,-0.000906,0.000744,-0.003262,0.002499,-0.001962,-0.002005,0.007587,-0.00303,-0.005306,0.003431,0.004847,0.004425,-0.004234,0.005984,0.003584,0.002423,0.001805,-0.00178,0.002805,0.001125,0.001734,0.002961
-1.8e-05,1.8e-05,-5.8e-05,5.8e-05,-0.000198,7e-05,7e-05,0.000214,-0.000133,-7.1e-05,0.000138,-0.00019,-6.7e-05,-2.4e-05,3.5e-05,5.2e-05,-7.9e-05,-0.000142,-0.000214,-7.1e-05,1.2e-05,8.9e-05,1e-05,-7e-06,5e-05,-0.000145,3e-06,3.2e-05,-2.5e-05,-0.00012,2.6e-05,7e-05,0.000253,2.5e-05,0.000103,-9.3e-05,8.9e-05,6.8e-05,-4e-06,-0.000123,0.000206,-1.4e-05,2.7e-05,5.3e-05,0.001593,0.000245,0.001797,-0.002445,-0.000478,0.002309,0.007631,-0.003432,-0.003233,-0.001157,0.005278,0.001922,-0.001731,0.004242,-0.00058,0.000382,-0.00077,-0.001947,-0.00363,0.003233,-0.005895,0.004255,0.000799,-0.003497,-0.003772,-0.00044,-0.001933,-0.001294,3.1e-05,-0.008119,-0.001755,-0.001986,-0.010188,0.00123,0.007355,-0.000395,-0.004217,-0.005131,0.004698,0.006662,0.000583,-0.0036,-0.00485,-0.001439,0.000273,0.000772,-0.004261,-0.001831,-0.003922,-0.00711,-0.003505,0.003698,-0.001505,0.002189,0.001728,-0.001667,0.00163,-4e-06,-0.003561,-0.001028,0.000218,-0.005919,-0.00174,0.002975,-0.004179,-0.003384,-0.009979,0.000662,0.001812,-0.003419,-0.003468,-0.006569,0.001465,0.008508,0.005544,-0.001633,-0.002348
0.000138,3.9e-05,2.9e-05,8e-06,-2.1e-05,2.9e-05,-1e-05,-9.3e-05,-7.4e-05,2.2e-05,5.4e-05,-0.000121,4.5e-05,0.000132,6e-05,-2.1e-05,1.9e-05,0.000114,4.5e-05,0.000159,4.7e-05,-0.000225,-6.6e-05,3e-06,-0.000167,-2.2e-05,0.000117,-5.7e-05,-0.000187,-9.7e-05,-0.000356,-9.8e-05,2.2e-05,-0.000119,-7.7e-05,-7.9e-05,-0.000138,-0.000237,-0.000137,-3.2e-05,-2.4e-05,-0.000301,-3.6e-05,0.000138,-0.000769,-0.001029,-0.000664,0.001514,-0.002553,0.001871,-0.002197,0.000384,-0.003063,-0.00173,-0.001612,0.002496,-0.000487,0.004763,0.001892,-0.004825,0.004483,-0.001767,-0.002512,-0.002194,0.004364,-0.004972,0.000426,0.000549,-0.00088,-0.003409,-0.002354,-0.003019,-0.00375,0.004096,-0.000609,0.00344,0.003747,-0.003942,0.000156,-0.000561,0.002465,0.003051,-0.002771,-0.004105,0.000716,0.004012,0.003425,0.002662,-0.001527,0.001728,0.001094,0.002758,0.000355,0.002204,-0.001322,-0.002271,-0.006913,0.000177,-0.003094,-0.001294,4.4e-05,0.004322,0.001798,0.002116,0.002411,0.005432,0.003538,-0.002927,-0.003032,-0.000696,0.004802,0.003443,-0.000103,0.001156,-2.4e-05,0.002914,-0.002139,-0.003191,-0.005268,0.002296,0.001028
-5.3e-05,8.2e-05,9.6e-05,3.3e-05,5e-06,-9.6e-05,-3.9e-05,-8.6e-05,-1.8e-05,-8.8e-05,-4.3e-05,-9.1e-05,1.9e-05,-0.000144,-2.8e-05,0.000142,0.000117,-0.000198,9.3e-05,-0.000162,-0.00011,0.000113,3.4e-05,-5.9e-05,-3.9e-05,2.4e-05,-8.3e-05,-3.6e-05,0.000232,-1e-06,1.4e-05,-0.000116,-7.7e-05,-1.2e-05,3.4e-05,-5.2e-05,6.1e-05,-0.000226,7e-06,-0.000155,-4.4e-05,-0.000202,-1.5e-05,-0.000159,-0.000174,0.000174,-0.001404,0.0013,0.003535,-0.001396,0.001123,0.000357,-0.000277,0.003904,-0.002781,0.005505,0.001041,-0.001722,0.003257,0.000304,0.000359,0.00092,0.002961,0.001494,-0.000205,0.003274,0.002537,-0.001179,-0.002649,-0.001133,-0.002336,0.000884,-0.000407,0.001412,0.001358,0.001114,-0.000654,0.000309,1.5e-05,-0.000643,0.000444,-0.003016,0.003825,0.002432,-0.001769,0.000712,-0.001756,0.002267,0.001905,-0.002941,0.000102,-0.000236,0.002038,-0.001656,-0.001493,0.002258,-4e-05,-0.002509,-0.000675,0.000323,-0.000539,-0.004849,0.00109,-0.003617,-0.00327,-0.002198,0.000488,0.004319,0.006652,0.002537,0.000798,-0.004362,0.001475,0.005555,-0.000175,-0.001152,0.004218,0.000796,0.000788,0.000482,-0.001182
-3.3e-05,9e-06,-3e-06,-0.000141,-2.5e-05,0.00016,2.1e-05,-2.2e-05,-6.7e-05,-2.6e-05,5e-06,1e-04,-1.3e-05,4.6e-05,6e-06,-5.8e-05,-0.000147,8e-05,1.7e-05,-3.3e-05,2.5e-05,-8.4e-05,-3.4e-05,-1.1e-05,5.1e-05,-1.7e-05,-3.4e-05,-4.9e-05,-0.000126,1.1e-05,0.00014,1.2e-05,-4.3e-05,-6.4e-05,1.7e-05,-1.2e-05,3.4e-05,3.9e-05,0.000103,-9e-06,-5.5e-05,0.000159,-1.1e-05,8.6e-05,-0.000183,0.00036,0.000352,-0.001494,-0.000529,0.000125,-0.000878,-1.9e-05,-0.000771,-0.004194,-4.3e-05,0.002563,-0.001432,0.003697,-0.003853,0.001268,0.000311,0.000121,-0.001742,-0.001105,-0.006297,-0.00127,0.000598,-0.002456,0.002614,-0.001364,0.000458,0.001922,0.001357,-0.00239,0.000145,-0.005399,-0.000196,-0.002376,-0.000506,0.00056,-7e-05,0.001447,-0.002372,-0.001078,-0.001364,0.000441,-0.000319,-0.00368,-0.001733,0.001861,0.000155,0.00071,0.000468,0.001335,-0.000519,0.002402,0.001087,0.003496,-0.000115,-0.000165,-0.002816,0.001747,-0.001819,0.000176,-0.001764,0.000375,-0.000887,-0.005672,-0.002656,-0.000606,-0.000772,-0.000902,-0.00484,0.000172,0.000505,0.001002,-0.004061,-0.002253,0.005682,-0.000831,-0.001346
-6.5e-05,-9.1e-05,-9e-06,1.8e-05,8.4e-05,-8.5e-05,1e-05,8.1e-05,4.9e-05,4.4e-05,-3.5e-05,8.7e-05,-6e-06,1.6e-05,-2.7e-05,-1.4e-05,5.9e-05,4.7e-05,3.1e-05,5.7e-05,2.5e-05,6.4e-05,1.3e-05,1.8e-05,1.8e-05,4.8e-05,5.2e-05,-3.9e-05,4.9e-05,2.1e-05,2.2e-05,3.2e-05,-5.1e-05,0,3e-06,6.9e-05,5.8e-05,0.000147,-8e-06,2.2e-05,4.5e-05,6.7e-05,7.4e-05,-9e-05,0.000311,0.000334,0.00099,-0.000201,0.000153,-0.000231,-0.000566,0.002207,0.003266,0.002938,0.000281,-0.002505,-0.001472,-0.000215,0.00029,0.000268,-0.004151,0.000569,0.000865,0.004,0.002159,-0.00011,0.000175,0.001323,-0.00057,0.00135,0.00081,-0.000127,-0.002732,0.001538,0.000737,0.001186,0.001161,0.001173,-0.002431,-0.002572,0.000683,-0.001151,0.001223,0.000328,-0.000697,0.001228,0.001641,-0.002139,0.001243,-0.00092,0.001226,-0.001786,0.000995,-0.002363,-0.00267,-0.000348,0.000496,-0.002633,-0.000404,-0.000375,0.001521,0.000847,0.00268,0.001386,0.001041,0.000732,-4e-05,0.002055,-0.001684,-0.000742,0.001989,0.000498,7e-04,-0.002249,-0.000948,5e-06,0.00257,0.000252,-0.001138,0.000623,-0.001581
4.1e-05,1.7e-05,5e-06,7e-06,-4.9e-05,2.4e-05,-2e-05,1.7e-05,1.6e-05,-4.1e-05,5.4e-05,1.5e-05,4.4e-05,3.5e-05,-4.4e-05,3.5e-05,2e-06,-2e-05,2e-06,-5.7e-05,-1.3e-05,-7.1e-05,-4.9e-05,-2.9e-05,2.5e-05,-3.2e-05,-2.4e-05,6e-06,-1.8e-05,8e-06,4e-06,-2.6e-05,-3e-05,2.1e-05,-1.3e-05,4.4e-05,6e-05,-4.6e-05,-3.2e-05,-1.3e-05,-0.000162,-3e-06,-9.6e-05,5.4e-05,2.3e-05,-0.000401,-0.000173,0.001262,-0.001324,0.00057,0.000646,-0.003322,-0.000619,-0.002083,-2.1e-05,-0.001603,-0.001471,0.000739,0.001266,-0.000936,5.5e-05,-0.000862,0.000305,-0.001555,0.001019,0.001201,-0.001499,-0.000537,0.000833,-7.1e-05,0.000698,-0.000814,-0.000851,0.000258,0.002838,0.000865,-0.00038,0.001689,0.001538,0.000102,0.000702,0.000902,-0.001201,-0.00082,-0.003688,0.000968,0.000266,0.001791,-0.001671,0.000415,-0.000895,0.000569,0.000703,0.001247,0.000331,-0.003679,0.001616,0.001513,0.000687,0.001326,-0.000857,-0.001782,-0.001532,5.8e-05,-0.000485,-0.000116,-0.000801,0.002052,0.001207,0.001233,-0.001209,0.002247,-0.00018,-0.000469,-0.001465,0.000726,-0.002902,-0.000306,-0.004651,-0.000271,-0.00135
-3e-05,-3.2e-05,1e-05,2e-06,-4e-06,6e-05,-1.8e-05,-3.8e-05,-1e-05,-7e-06,-2.4e-05,-4.2e-05,2.3e-05,1e-05,2.4e-05,-1e-05,4e-05,-1.5e-05,-3.2e-05,-8e-06,-1.1e-05,3e-05,-2.6e-05,-5e-06,9e-06,1.8e-05,9e-06,-2.3e-05,-8e-06,2.3e-05,2.3e-05,-2.8e-05,1.5e-05,3e-05,-4e-06,-1.7e-05,-8.3e-05,7.6e-05,-5.8e-05,-9e-06,6.8e-05,-2.7e-05,1.9e-05,-3.5e-05,-0.00016,-1.3e-05,-0.000598,-0.000314,3.9e-05,-0.000612,-0.000269,0.000443,0.001308,-0.00083,-0.001665,-0.000239,0.000646,-0.000858,-0.000838,-0.000181,-0.001227,-0.002052,-1e-06,0.000496,-0.001656,-0.001321,0.001797,-0.000297,0.000604,0.001119,0.000379,0.000337,-0.001394,-0.001373,-0.003009,-0.000674,0.001864,-0.000557,-0.001212,0.002792,-0.000768,-0.001328,0.001037,-9.4e-05,0.001582,0.000895,-0.00039,-0.001777,0.002817,0.000825,-0.000517,0.000495,-3.3e-05,-0.000181,-0.000752,-0.000638,-0.001513,-0.000488,4.8e-05,-0.000856,0.001265,0.000876,0.001197,0.000232,9e-05,0.000639,-0.000807,-0.000329,0.001292,-0.000774,-0.000798,-0.001764,-0.000112,-0.001041,0.001867,0.000226,0.00144,-0.001832,0.001817,-0.000175,0.000806
2.5e-05,-3e-06,-1.5e-05,-3.9e-05,-1.6e-05,-5.6e-05,1e-05,2e-05,-1.4e-05,-2.4e-05,-2.6e-05,-7.8e-05,-2.7e-05,1.4e-05,3.3e-05,-1.5e-05,3e-06,-3.6e-05,-2.9e-05,3.1e-05,-3e-06,-1.4e-05,4e-06,1.3e-05,-1.5e-05,-6e-06,5e-06,2.4e-05,-2.2e-05,-6e-06,-4.7e-05,0,8e-06,6e-06,3e-06,-2e-05,0,-2.5e-05,-2e-05,2.2e-05,1.8e-05,2.5e-05,0,6.5e-05,0.000161,-0.000205,0.000223,-0.00083,0.000576,0.000299,-0.000474,0.00038,-0.000795,0.00102,8e-05,0.000205,0.000963,0.00033,0.000245,0.000903,0.002098,0.001668,0.001849,-0.000862,0.000292,0.001084,0.000974,0.001869,-0.001305,-0.001214,0.000391,-0.000405,0.001086,0.000521,0.000673,-0.000704,0.000231,0.002107,0.000789,-0.002036,0.00064,0.001296,-0.001164,0.000657,-0.000296,0.000307,9e-05,0.001933,-0.002128,-0.000812,-0.00019,0.000309,-0.000548,0.000877,0.000307,0.001042,0.000208,-0.001604,0.001096,-0.000352,-0.001541,0.000147,-6.1e-05,-0.000648,-0.000847,-0.001012,0.001051,-0.001111,-0.001945,0.000753,0.001669,-0.000624,0.001042,-0.000506,7.9e-05,-0.001556,-0.000932,0.002162,-0.00014,0.000251,-0.000339
6e-06,-3e-06,1.8e-05,3.2e-05,0,-4e-06,1.5e-05,-3.5e-05,2e-06,3.3e-05,1e-05,-1.3e-05,-2.9e-05,-5e-06,-1.1e-05,9e-06,-5e-06,1.2e-05,1.2e-05,3.4e-05,1.1e-05,3e-05,-5e-06,-1.6e-05,-2.3e-05,-1.4e-05,-1.3e-05,-1e-05,2.8e-05,-2.4e-05,-2.1e-05,1.4e-05,2e-05,1.3e-05,-4e-06,-1.1e-05,-6.6e-05,-5.9e-05,1.4e-05,-8e-06,1.4e-05,-1.6e-05,-1.4e-05,-6.7e-05,-1.3e-05,0.00024,0.000302,0.000614,-9e-06,1.2e-05,0.00039,1.7e-05,0.000537,-0.001139,0.001824,-0.000752,0.000566,0.000265,-0.001639,-0.000202,-0.001105,-0.00157,-0.00107,0.001112,0.000968,-0.000869,7.7e-05,-0.001724,7.8e-05,0.000677,-0.000165,-0.000133,0.000236,-0.000198,0.000487,0.000725,-0.000453,-0.001055,-0.001509,0.000813,-0.000222,-0.000863,0.000883,0.000335,-0.000714,8.3e-05,-0.000417,-0.001443,0.000722,0.000248,0.001279,-0.000763,-0.00061,-0.000115,0.000782,-0.001033,-0.000849,0.002026,-0.001442,0.000613,0.000537,-0.001505,-0.000247,0.000371,0.000551,0.000415,-0.00012,0.000553,5.2e-05,-9e-04,0.000304,0.000448,-0.000148,0.001592,-0.000697,0.000899,9.3e-05,0.001214,0.000468,0.000126,0.000408
-1.9e-05,-1.1e-05,1.6e-05,-5e-06,2.5e-05,9e-06,-3e-06,2e-05,1e-06,-2.9e-05,1.1e-05,-1.2e-05,-1.6e-05,2e-05,1e-06,-1.7e-05,6e-06,2.7e-05,-1.2e-05,-1.3e-05,-1.9e-05,-7e-06,-1.1e-05,-1e-06,1.1e-05,6e-06,1e-06,0,-2.1e-05,3e-06,2.9e-05,-7e-06,-4e-06,-1.2e-05,0,-8e-06,0,-1.2e-05,9e-06,1.4e-05,1e-06,1.1e-05,5.5e-05,6.2e-05,-6.3e-05,-1e-06,-0.00021,0.000197,0.000183,0.000274,-0.000147,0.000742,-0.000288,0.000814,-0.001622,0.000123,-0.000398,-0.001076,0.000363,-0.000661,0.002021,0.000351,-0.000482,-0.00113,-0.00059,0.000408,-0.00055,-0.000338,0.000645,-0.000143,-0.000326,-0.001145,-0.000202,5e-05,-0.000727,-0.000467,-0.000421,0.001258,0.001632,-0.000183,-5.7e-05,0.000979,-5.5e-05,-0.000669,0.001143,0.000492,0.001169,0.00064,-2.8e-05,-0.000219,-0.00022,0.000655,0.000509,0.000612,0.000368,-0.000509,-0.001341,-0.001772,0.000889,-0.000196,5.1e-05,0.001177,0.000678,0.00049,-0.000958,0.000128,-0.000674,-0.000521,0.000917,-0.000128,-0.00118,-2.8e-05,-0.000285,0.000712,-7.4e-05,-0.00115,0.000161,-0.00135,0.000614,-0.001025,0.000196
-4e-06,-1.2e-05,-1.4e-05,1.8e-05,-2e-06,-2.2e-05,-8e-06,-1.3e-05,-1.8e-05,6e-06,-1.2e-05,2.6e-05,1.6e-05,-2.7e-05,-1.3e-05,-1e-06,2.6e-05,6e-06,0,-3.7e-05,2.2e-05,-2.2e-05,1e-05,4e-06,-6e-06,-1.2e-05,4e-06,3e-06,2e-06,-1.7e-05,4.8e-05,1.5e-05,-4e-06,1e-06,4e-06,4e-06,-1.9e-05,4.3e-05,1.2e-05,-1e-06,8e-06,1.3e-05,-1.6e-05,-4e-05,-2e-05,7.3e-05,-0.000215,-0.000578,-0.00056,-0.000363,5.1e-05,-0.001691,0.000172,-8.8e-05,-0.001146,0.000562,-0.000521,0.000744,0.00139,0.000504,-0.001121,-0.000659,0.000632,-0.000145,-0.0013,-0.000308,0.00034,0.000509,0.000648,-5.5e-05,-0.000767,0.000615,0.000812,-0.000741,0.000382,4.7e-05,-0.001099,-0.00104,-0.000482,0.000642,6.9e-05,-0.000518,-0.000165,-0.000332,0.000119,4e-06,-0.001056,-0.000322,-0.000245,0.000291,-0.000676,-0.000372,-0.000171,-0.000712,0.000124,0.001215,0.002033,0.000828,-0.00038,0.000243,-0.000299,0.000332,-4.5e-05,-0.00077,0.000985,-0.000552,0.000138,0.00234,-0.000475,0.000587,-0.000181,0.000479,-0.00047,-0.001468,0.000189,0.000722,-0.000574,-0.000305,-0.001316,0.000752,0.000477
-8e-06,7e-06,1.1e-05,-1.3e-05,-2e-05,2.8e-05,3e-06,2e-05,0,1e-06,1.9e-05,-1e-06,1e-05,1e-06,0,4e-06,2e-06,-2.6e-05,1.1e-05,6e-06,-3e-06,5e-06,-1e-06,-1e-05,0,1e-06,-6e-06,-7e-06,2e-06,-1.1e-05,-1.4e-05,1.4e-05,-1e-06,-1.2e-05,2e-06,8e-06,3.4e-05,1.4e-05,4e-06,8e-06,-3.3e-05,-4e-06,1.2e-05,1.1e-05,2.9e-05,-0.000126,0.000143,0.000163,7.7e-05,3.4e-05,6.7e-05,0.000536,-0.000772,-0.000527,0.001224,-0.000402,7e-06,-0.001,-0.000382,-0.000103,0.000598,0.000482,-0.000453,-0.000433,0.001068,-0.000123,0.00045,-0.000869,3.9e-05,-9e-05,-0.000174,-0.000412,0.000529,0.000521,-9.3e-05,-0.000885,0.000266,0.000147,-0.00027,-0.000909,-0.000162,0.000567,0.000322,0.000617,0.000784,0.000136,0.000261,0.000359,0.000117,-0.000159,0.00029,0.000351,-0.00017,0.000246,0.000583,0.000405,-0.000196,0.000195,0.000589,-0.000119,0.000484,-0.001161,-5.6e-05,9.4e-05,-0.000319,0.000728,-1.6e-05,-0.001979,-0.000497,-0.000925,0.00045,-0.000895,-0.000975,0.000342,-1.7e-05,-0.000144,0.000574,-0.000213,0.00106,0.000377,0.000676
3e-06,2e-06,7e-06,6e-06,5e-06,2e-06,3e-06,-2e-06,-3e-06,7e-06,-2.2e-05,1.4e-05,-1e-06,-9e-06,1.3e-05,-8e-06,-1.2e-05,-3e-06,1.2e-05,-7e-06,-7e-06,-5e-06,3e-06,-2e-06,-5e-06,7e-06,-2e-06,-3e-06,-5e-06,1.2e-05,-4e-05,-7e-06,-2e-06,-1e-06,2e-06,-2e-06,1.1e-05,-1.2e-05,-8e-06,-1.3e-05,-1.6e-05,-2.3e-05,-2e-06,1.9e-05,2.9e-05,3.3e-05,0.000199,0.000377,0.000105,-0.000109,-0.000247,-0.000142,0.000458,0.00079,-0.000429,-0.001022,0.000485,-0.000115,-0.000203,-0.000391,-0.001692,8.9e-05,0.000452,0.000332,0.000508,0.00037,0.000712,0.000181,-0.000491,-0.000259,-0.000264,0.000638,9.7e-05,-0.000103,0.000348,0.000835,-6.4e-05,-0.000369,-0.00012,0.000921,8.6e-05,-0.000438,-0.000335,-0.000473,0.000733,0.000104,0.000328,2e-05,-1.2e-05,-6.9e-05,-0.000439,-0.000202,-0.000186,-0.000833,-0.000462,-0.000882,-0.000342,0.000158,-0.000523,-0.000104,-0.000447,0.001081,0.00027,8.2e-05,0.00055,-0.00053,-5e-06,0.000267,0.000806,0.00069,-0.000262,0.000503,0.000661,0.000137,-0.000244,0.000193,-0.000461,1.5e-05,-0.000363,-0.00068,0.000154
7e-06,-3e-06,-9e-06,0,-5e-06,-1.8e-05,-4e-06,-4e-06,-1.1e-05,-1.4e-05,1.9e-05,-1.2e-05,1e-06,7e-06,-3e-06,0,5e-06,0,-4e-06,1.3e-05,1.2e-05,1e-05,3e-06,3e-06,-2e-06,-5e-06,3e-06,-1.1e-05,8e-06,-3e-06,1e-05,1e-05,3e-06,-2e-06,-1e-06,-1e-05,1.3e-05,-1.1e-05,-1.1e-05,5e-06,1.8e-05,-1.2e-05,-4e-06,-5.8e-05,-1.6e-05,-5.2e-05,-0.000144,-0.000359,0.000334,0.000208,0.000201,2.2e-05,-0.000527,-0.000683,-5.1e-05,-0.000631,-1.2e-05,-2e-04,-0.000439,8.1e-05,0.000605,-0.000474,-0.000217,-0.000532,-0.001097,-0.000325,-0.000178,-0.000333,-2.5e-05,5.9e-05,4.8e-05,-0.000423,0.00017,-0.000201,0.000871,-0.000644,2.5e-05,-0.000562,-0.000368,-0.00072,4.5e-05,0.000308,0.000241,0.000312,-0.000527,-9.4e-05,-2e-04,-0.001017,3.7e-05,3.7e-05,0.000478,3.3e-05,-0.000497,0.000394,2.3e-05,-0.000276,3e-05,-0.000135,-1.3e-05,-3e-05,0.000374,5.1e-05,-7.4e-05,-6.3e-05,-0.000289,0.000333,0.00012,-4.6e-05,-5e-06,0.000243,0.000133,7.9e-05,0.000553,-0.000567,0.000261,0.000313,0.000495,0.000363,-0.001002,-3.6e-05,-0.000148
9e-06,8e-06,-4e-06,3e-06,8e-06,1.4e-05,-3e-06,-1.2e-05,1e-06,3e-06,-3e-06,1.5e-05,6e-06,-4e-06,-8e-06,-1e-06,-9e-06,1.6e-05,1e-05,-9e-06,-1.4e-05,-8e-06,3e-06,-7e-06,4e-06,7e-06,0,-5e-06,-6e-06,4e-06,1.8e-05,-7e-06,6e-06,-6e-06,-1e-06,-2e-06,6e-06,-1.7e-05,-2e-06,-9e-06,-1e-05,4e-06,6e-06,7.5e-05,-2e-05,8.4e-05,-0.000117,-6.5e-05,-0.000356,-0.000202,2.3e-05,0.000918,0.000818,0.00019,-0.000591,-0.000288,-4e-05,-0.000213,0.000287,0.000254,-0.000529,-0.000211,0.000203,-0.000186,0.000749,0.000399,-0.000291,-0.000394,0.000425,-0.000191,0.000156,0.000305,5.4e-05,0.00024,-0.000811,0.000585,0.000241,0.00046,0.000916,0.000466,-0.000199,-0.000182,-0.000214,-0.000277,0.000379,8.8e-05,0.000353,0.000992,-0.000225,-8.1e-05,-0.000111,-6.4e-05,-0.000104,-0.000586,-0.000354,0.000444,-0.000618,-0.000575,0.000284,-0.000138,-9e-06,-0.001018,0.00025,0.000328,0.000624,-0.000415,5.8e-05,0.000361,-0.000709,-0.000569,0.00024,-0.000177,0.000177,5e-04,3.2e-05,-0.000551,-0.000424,-4.5e-05,0.001187,0.000534,0.000124
-3e-06,3e-06,9e-06,-4e-06,3e-06,-1e-06,2e-06,-1e-06,3e-06,-7e-06,-1e-05,-1e-05,1e-06,1e-06,2e-06,1e-06,2.1e-05,2e-06,-1.3e-05,0,-2e-06,4e-06,1e-06,-2e-06,4e-06,-6e-06,-2e-06,-1.1e-05,8e-06,1e-05,-5e-06,4e-06,3e-06,0,2e-06,1e-06,-2.1e-05,8e-06,-5e-06,0,2.4e-05,2e-06,-1e-05,-7.5e-05,2.3e-05,-3.8e-05,0.000129,0.000339,3.6e-05,0.000131,-0.000134,-0.000879,-0.000435,0.000166,-7.9e-05,7.5e-05,-0.000216,-0.000292,0.000412,9.4e-05,0.001123,2.8e-05,0.000802,0.000264,3.5e-05,-9e-05,9.8e-05,0.000433,0.00019,0.000251,0.000341,-0.000223,-0.000193,-0.00014,0.000232,-0.000357,0.000214,-0.00059,-0.000582,-0.000561,0.000167,0.000181,0.000221,0.000463,0.000242,-0.000153,-0.000346,-5.2e-05,0.000386,0.000144,-3.9e-05,0.000152,0.000114,0.000413,-0.000382,-6e-06,0.00058,0.000568,-0.000431,0.000426,-0.000334,0.000873,-0.000209,-0.000521,-0.000637,0.000156,-0.000121,0.000207,0.000401,0.000683,-0.000726,0.000141,0.000136,-7.6e-05,-0.000308,0.000501,0.000478,0.000511,0.000153,-0.00025,-8.8e-05
-8e-06,5e-06,-1e-06,-1e-06,-6e-06,-9e-06,3e-06,1.5e-05,-1e-05,7e-06,6e-06,2e-06,-5e-06,1e-06,4e-06,-3e-06,-1.6e-05,-5e-06,-4e-06,1.7e-05,9e-06,-1e-05,-2e-06,1e-06,6e-06,-1e-06,-2e-06,-3e-06,-9e-06,-3e-06,9e-06,-8e-06,-2e-06,4e-06,-3e-06,1e-06,-9e-06,8e-06,0,-1e-06,0,0,1.3e-05,6e-05,-5e-06,2.7e-05,6.2e-05,-0.000151,-3.9e-05,-8.7e-05,7.4e-05,0.000388,0.000439,-0.000421,0.001012,0.000232,0.000216,-7.9e-05,-0.000705,-0.00016,-0.000257,-0.000256,-0.000236,7.3e-05,-0.00072,-0.00014,0.000472,-0.000212,0.000183,-0.000157,0.000286,4.3e-05,-0.000472,-0.000227,0.000155,3e-05,0.000309,0.00096,0.000417,0.000426,-9.4e-05,-0.000254,-0.000345,-0.000216,-0.000683,-7.5e-05,0.000176,0.000231,-0.000486,8.5e-05,-0.000136,-9.2e-05,7e-05,-9e-05,-0.000116,-0.00044,0.000588,-0.000247,0.000265,-0.000318,0.000348,4.6e-05,0.00015,0.00036,0.000486,0.000193,0.000126,-4e-04,0.000332,-0.000443,0.000303,-0.000346,-0.000682,-0.000268,0.000153,-0.000413,-0.000474,-6.1e-05,-0.001145,-0.000326,-0.000165
3e-06,9e-06,-7e-06,1e-06,0,9e-06,-1e-06,-4e-06,3e-06,-1.3e-05,-2e-06,-1.8e-05,-1e-05,5e-06,1e-06,3e-06,0,-1.2e-05,-8e-06,-2.3e-05,-4e-06,8e-06,0,-5e-06,-3e-06,3e-06,3e-06,-6e-06,1e-05,-3e-06,7e-06,-2e-06,-3e-06,1e-06,0,-2e-06,-2e-05,9e-06,4e-06,-3e-06,-7e-06,1e-06,-9e-06,-2.9e-05,-9e-06,-5.4e-05,-8e-05,-0.000207,4.6e-05,0.000135,-6.6e-05,-0.00023,-0.000291,0.000513,-0.001268,0.000259,9.6e-05,6.2e-05,-8e-05,0.000114,0.000525,-0.000287,0.000242,1.5e-05,0.000267,0.000249,0.000118,-0.000223,0.000217,0.000188,2.6e-05,-0.000193,-0.00024,0.000157,-0.000471,-0.00023,7.9e-05,-0.000413,-0.000534,-0.000273,-3.6e-05,0.000115,0.000376,-5.7e-05,-0.000244,-0.000108,9e-05,-0.000614,0.000539,-0.000218,-0.000166,7.3e-05,-6.2e-05,0.000431,-0.000165,0.000374,-0.000546,0.000178,-0.00025,0.000103,-0.000276,-0.000803,0.000117,0.000146,-0.000474,-0.000376,5.9e-05,-0.000367,-0.000368,-0.000139,0.000324,0.000382,-0.00017,0.00033,0.000154,8.2e-05,0.000571,-0.000833,0.000708,0.000425,-0.000325
-6e-06,0,9e-06,0,-2e-06,-7e-06,-3e-06,3e-06,0,7e-06,-1e-06,-5e-06,-2e-06,-2e-06,-1e-06,2e-06,4e-06,5e-06,9e-06,-2e-06,6e-06,0,0,-1e-06,-1e-06,-5e-06,-3e-06,-3e-06,-1e-05,3e-06,-2e-05,-8e-06,-2e-06,-1e-06,1e-06,0,3e-06,4e-06,2e-06,2e-06,-8e-06,-1e-06,-1e-06,0,5e-06,3.8e-05,-5.5e-05,0.000261,0.000193,-0.00013,3.8e-05,0.000137,0.000233,-0.000379,-0.000156,0.000221,-1.9e-05,-0.000218,0.000292,0.00014,-0.000821,0.000173,3.3e-05,-0.000252,0.000297,-0.000455,-0.000186,7.6e-05,-0.000503,-0.000171,-5.9e-05,4.7e-05,-3.3e-05,-0.000137,0.000158,0.000469,-0.000327,0.000751,0.000534,0.000201,5.8e-05,-8.4e-05,-0.000223,-0.000102,3.4e-05,-0.000147,-0.000202,0.000282,-0.000528,0.000175,0.000455,-0.000129,-2e-04,-0.000111,-0.000132,0.000529,0.000293,-0.000165,0.000516,3.9e-05,0.000175,0.000783,-0.000258,-0.000343,0.000284,0.000325,-9.5e-05,0.000805,-0.000173,0.000318,-0.000253,-4.5e-05,-3.2e-05,0.000148,-0.00012,-2.6e-05,-0.000607,8e-05,0.000382,-6.7e-05,-0.000246
4e-06,1e-06,-1e-06,-1e-06,-2e-06,-3e-06,0,-8e-06,-7e-06,-3e-06,3e-06,-2e-06,5e-06,-2e-06,-6e-06,0,-3e-06,4e-06,-6e-06,3e-06,-1e-06,2e-06,-2e-06,0,-6e-06,4e-06,-1e-06,1e-06,1.2e-05,-9e-06,-8e-06,-1e-06,0,4e-06,0,-1e-06,-4e-06,-1.5e-05,0,-1e-06,-2e-06,-1e-06,9e-06,2.2e-05,1e-06,-2.4e-05,6.6e-05,1.8e-05,-0.000168,9.5e-05,4.8e-05,0.000289,-0.000241,9.7e-05,0.000669,0.000174,-9.9e-05,0.000315,0.000273,-9.3e-05,0.000326,-0.000252,-0.000163,0.000396,-0.000263,0.00041,-0.000177,-0.00019,0.000228,0.000164,-0.000113,-0.00011,-5.7e-05,-6.1e-05,-7e-05,-0.000536,-0.000181,-0.000191,-0.000274,-0.00039,-4.9e-05,3.8e-05,7.4e-05,0.000166,-0.00062,-8e-05,0.00014,-0.000295,0.000468,-3.9e-05,-0.000201,9.7e-05,2.6e-05,0.000276,0.000152,-0.000251,-0.000741,0.000248,-0.000364,-0.000204,-5.2e-05,-8.7e-05,0.00025,0.000274,-0.000504,-0.000133,4.9e-05,-0.000288,0.000441,-0.000464,-4.6e-05,-0.000217,4.6e-05,-4.7e-05,-0.000174,-6.4e-05,0.000595,0.000218,-0.000488,-0.000254,2.2e-05
4e-06,2e-06,-7e-06,-2e-06,9e-06,9e-06,1e-06,2e-06,1e-06,4e-06,-3e-06,1.2e-05,3e-06,-3e-06,0,1e-06,5e-06,4e-06,1.1e-05,7e-06,-2e-06,-6e-06,-2e-06,-3e-06,1e-06,-1e-06,2e-06,-4e-06,-1.2e-05,0,1.8e-05,-2e-06,1e-06,-1e-06,1e-06,-2e-06,1.6e-05,-6e-06,-1e-06,2e-06,-7e-06,0,-9e-06,-3.4e-05,5e-06,3.8e-05,4.5e-05,-0.000238,-1e-05,-8e-05,-1.2e-05,-0.000533,0.000213,0.000156,-0.000392,9.6e-05,-4.3e-05,-5.1e-05,5.1e-05,-8.2e-05,-0.000807,0.000111,0.000299,-8e-06,-7.3e-05,-0.00038,5.1e-05,-4.6e-05,0.00032,-0.000158,-0.000134,8.6e-05,-0.000211,-6.1e-05,5.4e-05,0.000354,-1.2e-05,2.3e-05,-9.7e-05,0.00074,8e-06,3.1e-05,-2e-06,-0.00016,5.2e-05,-0.000109,-4e-05,0.000284,-0.00036,-8e-06,4e-05,-4.9e-05,1.9e-05,-0.00027,4.9e-05,-0.000272,-0.000154,-0.000137,0.000123,0.000217,-0.000135,-0.000574,-0.000162,-0.000256,0.000303,-9e-06,-5e-06,7e-06,-0.000114,0.000363,0.000127,0.000168,0.00039,-0.000303,0.000161,0.000224,-0.000528,8.5e-05,1.1e-05,0.000162,-9.3e-05
0,-3e-06,4e-06,3e-06,-5e-06,-4e-06,-2e-06,-1e-06,-3e-06,-5e-06,0,8e-06,2e-06,0,6e-06,2e-06,-7e-06,-2e-06,-2e-06,2e-06,-2e-06,-2e-06,0,-1e-06,0,-1e-06,0,3e-06,1e-05,0,1.1e-05,-2e-06,0,0,1e-06,-2e-06,6e-06,6e-06,-4e-06,-3e-06,8e-06,1e-06,4e-06,3.1e-05,-7e-06,-3.3e-05,-6.5e-05,0.000127,-3.3e-05,0.000101,2.6e-05,0.000334,-0.000327,-0.000305,-2.9e-05,1e-05,0.00016,0.000207,-0.000431,1.6e-05,0.000677,-0.000327,-0.000146,4.3e-05,0.000257,0.00033,0.000248,-7.7e-05,3.9e-05,0.000139,-0.000171,0,8.9e-05,7e-05,0.000347,-0.000223,-0.000126,5.1e-05,7.5e-05,-0.000659,2.2e-05,-2.9e-05,-6e-06,5.2e-05,0.000112,-0.000118,9.2e-05,3.3e-05,0.00026,2.5e-05,-3.2e-05,4.7e-05,0.000107,8e-05,0.000116,0.000156,0.000562,-0.000239,-7.6e-05,-0.00012,0.000237,0.000597,5.8e-05,0.000171,-0.000433,3.7e-05,-1.9e-05,-0.000148,-0.000274,-9.8e-05,-9.4e-05,-0.000183,6e-05,-3.7e-05,0.000112,-0.000225,0.000398,0.000281,-0.000167,0.000129,6e-06
-2e-06,-1e-06,1e-06,-2e-06,-3e-06,-1e-06,-1e-06,3e-06,-2e-06,3e-06,6e-06,4e-06,1e-06,-3e-06,1e-06,0,0,-7e-06,5e-06,-1e-05,-3e-06,2e-06,-2e-06,0,1e-06,2e-06,-2e-06,-4e-06,-7e-06,0,-1.1e-05,4e-06,1e-06,-1e-06,-1e-06,1e-06,5e-06,5e-06,-2e-06,5e-06,7e-06,-2e-06,0,-2.5e-05,0,2e-05,-2.4e-05,0.000132,0.000127,-9.3e-05,-7e-06,-0.000144,0.000284,0.000313,-0.000404,-7.2e-05,9.2e-05,-9.5e-05,9e-06,-1.1e-05,-0.000348,0.000102,0.000141,-0.000161,-0.000118,-0.000138,1.1e-05,-0.000108,0.000155,-0.000139,-8e-05,3.8e-05,0.000123,-8.1e-05,-0.000272,0.000235,1.1e-05,-0.000519,-7e-05,0.000275,-4.9e-05,4.8e-05,2.3e-05,7.8e-05,-0.000305,-4.2e-05,2.2e-05,-0.000383,-0.000224,-9.6e-05,-2.5e-05,-3.2e-05,0.000114,-0.000276,0.000227,2.3e-05,-6.7e-05,0.000314,0.000142,0.000152,-0.000279,-8.8e-05,-2.9e-05,5.8e-05,0.000295,-7.2e-05,-3e-06,1e-06,0.000216,-5.8e-05,6e-05,0.000352,-9.1e-05,0.000264,-0.000198,0.000253,-0.000272,-0.00024,0.000194,-0.000216,4.1e-05
-3e-06,-2e-06,-3e-06,2e-06,1e-06,5e-06,1e-06,3e-06,-2e-06,-1e-06,-7e-06,-4e-06,1e-06,-1e-06,-4e-06,-1e-06,1e-06,0,-8e-06,7e-06,4e-06,3e-06,0,-3e-06,1e-06,-3e-06,2e-06,0,4e-06,1e-06,-9e-06,0,0,1e-06,0,0,-4e-06,2e-06,0,-4e-06,-4e-06,-3e-06,-1e-06,1.6e-05,5e-06,-2.6e-05,5.5e-05,-0.000197,-5.5e-05,7.4e-05,-1.8e-05,0.000167,-0.000309,-0.000223,0.000181,9.9e-05,-4.3e-05,0.000252,0.000179,-4.9e-05,0.000849,-0.000129,0.000197,0.000291,-0.000241,1.2e-05,-0.000215,-0.000188,-0.000222,7.3e-05,5e-05,-1.6e-05,0.000118,1.4e-05,0.000132,-3e-04,7.8e-05,0.000294,4e-04,-1.8e-05,4.8e-05,-6.2e-05,-2e-05,-3.5e-05,0.000524,-8.6e-05,-0.000142,0.000372,0.000186,2.6e-05,6.5e-05,7e-06,-5.8e-05,9.6e-05,4.5e-05,-0.000245,0.00026,-8.3e-05,-0.000104,-0.000149,0.000264,-0.000496,-6.7e-05,-3e-04,-0.000247,0.000184,1.2e-05,0.000437,0.000106,0.000258,8.8e-05,-0.000352,-0.000227,-8.8e-05,3e-06,-0.000122,0.000112,4e-06,0.000278,7.2e-05,0.000128
0,-4e-06,-1e-06,-3e-06,-3e-06,-4e-06,0,-2e-06,-2e-06,1e-06,4e-06,-8e-06,0,0,-2e-06,0,0,2e-06,6e-06,-6e-06,1e-06,0,0,-1e-06,0,2e-06,0,-3e-06,-3e-06,5e-06,6e-06,3e-06,0,-1e-06,0,-1e-06,-8e-06,-2e-06,0,3e-06,4e-06,-3e-06,1e-06,-1e-05,-2e-06,2.4e-05,1.1e-05,7e-06,4.5e-05,-7.8e-05,1.1e-05,0.000102,0.00029,7.3e-05,0.000374,0.000343,-6.1e-05,7.7e-05,-7e-05,-3.4e-05,-0.000546,-0.000166,-2.6e-05,-6.6e-05,0.000314,0.000142,-0.000184,7e-05,9.6e-05,-4.8e-05,8.2e-05,-3.7e-05,5.6e-05,2.8e-05,9.3e-05,0.000186,0.000109,-0.000605,-0.000462,0.000136,-6e-06,0.000107,5e-06,1.1e-05,-1.2e-05,-5e-05,0.000179,-0.000176,-0.000109,2e-06,-4e-05,3e-06,9e-06,-0.000255,7.1e-05,-2.9e-05,-6.6e-05,-1e-06,-8.9e-05,-3e-06,-0.00019,0.000623,8.4e-05,0.000308,0.000311,-0.000201,-2.8e-05,-0.000424,-0.000227,-0.000307,-0.000108,0.000102,-0.00031,7.9e-05,0.000123,-2.5e-05,-1.7e-05,-4.3e-05,-0.000385,0.000117,0.000152
-2e-06,-1e-06,5e-06,3e-06,6e-06,1e-06,0,-1e-06,0,-3e-06,-2e-06,-3e-06,-3e-06,2e-06,0,0,-2e-06,5e-06,-1.1e-05,-4e-06,0,-3e-06,0,-1e-06,0,-1e-06,-2e-06,-4e-06,3e-06,-3e-06,2e-06,2e-06,0,0,0,-2e-06,-9e-06,-4e-06,1e-06,-2e-06,-5e-06,-1e-06,-1e-06,1e-05,0,-1.5e-05,-3.8e-05,0.000173,-7.4e-05,8.1e-05,-1.7e-05,-0.000302,-0.000184,6.1e-05,-0.000782,0.000259,-1.1e-05,-5e-05,-4.8e-05,4.1e-05,0.000388,-3.9e-05,0.000277,4.7e-05,-3.4e-05,-0.000275,0.000107,-1e-05,0.000159,1.9e-05,5.9e-05,1.3e-05,0.000143,-9.2e-05,-0.000311,-0.000152,0.000156,0.000455,0.000242,-0.000378,-3.4e-05,-8.7e-05,-5.9e-05,-7.3e-05,-3.6e-05,-3e-05,-0.000105,0.000297,3e-06,3.1e-05,9.8e-05,9e-06,-3e-06,0.000163,6e-06,0.000231,-0.000572,-0.000104,0.000137,9.7e-05,7.7e-05,-0.000204,-9e-05,-0.00014,-0.000196,0.000113,2e-06,2.5e-05,1.9e-05,0.000163,-5.1e-05,8.8e-05,0.000126,0.000122,-3.4e-05,3.1e-05,-5.7e-05,-0.000326,6.2e-05,-0.000139,5.7e-05
3e-06,-2e-06,-2e-06,-2e-06,-2e-06,2e-06,-1e-06,-4e-06,-3e-06,2e-06,0,-4e-06,-4e-06,2e-06,3e-06,-1e-06,1e-06,0,5e-06,1e-06,1e-06,-1e-06,0,-2e-06,0,-1e-06,1e-06,-2e-06,-3e-06,2e-06,-4e-06,3e-06,0,0,0,0,-7e-06,-4e-06,1e-06,0,-6e-06,-1e-06,2e-06,-1.2e-05,1e-06,1.6e-05,-1.1e-05,-0.000116,-5e-06,-8.1e-05,-3.3e-05,8.4e-05,0.00018,-0.000149,7.8e-05,9.3e-05,9.7e-05,0.000325,-5.9e-05,3.6e-05,-0.000777,-5.2e-05,-2.7e-05,-0.000145,-0.000154,0.000287,0.000132,-0.000254,-1e-06,1e-06,4.3e-05,-5.1e-05,7.4e-05,-4.9e-05,9e-05,0.00015,-2.8e-05,-0.000306,-0.000234,0.000425,3.9e-05,9.3e-05,9.7e-05,0.000103,0.000564,-2.9e-05,6e-06,-0.000484,9.4e-05,-3e-05,-0.000173,-3.8e-05,8.7e-05,-8.8e-05,-0.000185,5.1e-05,3e-04,0.000145,-7.3e-05,-0.000135,8.4e-05,-0.000349,-1.8e-05,1.5e-05,0.000332,4e-06,1e-05,5.2e-05,0.000181,-3.6e-05,0.000115,-9.8e-05,0.000264,-0.000329,-8.5e-05,-0.000103,9.3e-05,0.000317,0.000367,-1.2e-05,4.7e-05
2e-06,-3e-06,-4e-06,2e-06,-2e-06,-4e-06,0,4e-06,0,-2e-06,2e-06,5e-06,0,0,2e-06,0,-5e-06,-2e-06,-5e-06,2e-06,-3e-06,0,0,-1e-06,1e-06,1e-06,0,-6e-06,1e-06,-2e-06,6e-06,0,0,1e-06,0,0,3e-06,4e-06,-1e-06,-1e-06,2e-06,0,-2e-06,1.5e-05,0,-1.7e-05,3.3e-05,-8.4e-05,6e-05,6.5e-05,2.7e-05,-0.00013,-0.000116,0.00014,0.00032,-0.000104,3e-05,-0.000267,0.000129,-1.6e-05,0.00038,-7.9e-05,-9e-06,2e-04,0.000111,-0.000302,-3.5e-05,6.3e-05,0.000139,-2e-05,6.4e-05,2.9e-05,-2.9e-05,3.2e-05,-1.6e-05,-0.000177,-7e-06,0.000391,0.000266,-0.000274,-1.2e-05,-0.000131,-8.7e-05,-5.8e-05,-0.000213,9e-06,-2.3e-05,0.000214,-0.000148,-6e-06,2.1e-05,2.4e-05,8.8e-05,0.000238,-0.000124,-0.000157,0.000172,2e-06,2.1e-05,0.000152,-0.000192,0.000546,2.8e-05,1e-04,-0.000182,-6.1e-05,-3.2e-05,0.000118,-8.7e-05,-0.000174,-1.2e-05,8.9e-05,0.000177,7e-06,5.5e-05,0.000139,-0.000117,0.000198,-0.000455,0.000104,7e-05
0,0,6e-06,-2e-06,3e-06,1e-06,0,1e-06,0,1e-06,-2e-06,0,3e-06,1e-06,-4e-06,0,6e-06,-3e-06,8e-06,8e-06,-1e-06,3e-06,0,-1e-06,0,-2e-06,-1e-06,-2e-06,2e-06,-1e-06,4e-06,1e-06,0,0,0,-1e-06,3e-06,4e-06,0,0,2e-06,0,1e-06,-1.4e-05,1e-06,1e-05,1.1e-05,0.000164,-8e-06,-6.4e-05,3e-06,0.000171,8.3e-05,-0.000102,-0.000243,-0.000113,-2.9e-05,0.000202,9.7e-05,1.1e-05,-0.000407,-2.5e-05,0.000134,-8.2e-05,1.1e-05,0.000233,-0.000209,1e-06,-4.5e-05,4.5e-05,3e-06,-5.3e-05,-3.8e-05,-7.6e-05,-2.3e-05,0.000189,-9.3e-05,4.4e-05,-0.000127,7.6e-05,-1.1e-05,0.000134,5e-05,2.6e-05,8e-06,-2e-06,-6.2e-05,2e-05,0.000165,6.8e-05,6.4e-05,-5e-06,-2.3e-05,-5.7e-05,-0.000139,-1.1e-05,3.1e-05,-0.00017,-0.000108,-0.000104,2e-04,-0.000207,-5.2e-05,-0.000229,0.000261,3.7e-05,2.2e-05,-8.8e-05,-1e-04,0.000274,-5e-05,-0.000134,2.4e-05,0.000247,7.1e-05,-0.000143,0.000136,-6.9e-05,-1.4e-05,-7.9e-05,1.3e-05
-1e-06,0,-2e-06,2e-06,-5e-06,2e-06,-1e-06,0,-4e-06,-2e-06,1e-06,7e-06,3e-06,0,-2e-06,0,-3e-06,1e-06,-4e-06,-9e-06,2e-06,0,0,-2e-06,-2e-06,2e-06,-1e-06,-4e-06,-4e-06,-1e-06,-9e-06,0,0,0,0,0,8e-06,0,-1e-06,1e-06,0,-1e-06,0,6e-06,-2e-06,-9e-06,-3.6e-05,-3e-05,-1.6e-05,7.3e-05,1.5e-05,6.1e-05,-9.2e-05,4.1e-05,-8.9e-05,-0.000181,-3.8e-05,-0.000128,-0.000166,3.4e-05,0.000678,-9e-05,-8.2e-05,-3.7e-05,-8.4e-05,-9.8e-05,-0.00011,-0.000236,-7.8e-05,-4.9e-05,-4.2e-05,6.6e-05,4.2e-05,6e-06,0.000152,-0.000214,-0.000128,5.3e-05,-8e-05,-4.7e-05,2.5e-05,-0.000138,0,-5.3e-05,0.000289,3.3e-05,9.6e-05,3.4e-05,-0.000172,-3e-05,-1.1e-05,-4e-06,3e-05,0.000195,-0.000152,8.4e-05,0.000102,0.000159,0.000161,4.7e-05,-0.00014,-0.000344,1e-05,0.000262,-0.000186,-2.4e-05,1.1e-05,-6.5e-05,0.000114,-0.00025,2.1e-05,0.000118,-0.000297,-1e-04,-8.8e-05,0.000123,-0.000171,-1e-05,0.000424,-1e-05,-2.9e-05
-2e-06,1e-06,-3e-06,-2e-06,4e-06,-2e-06,0,-2e-06,1e-06,1e-06,0,-2e-06,1e-06,1e-06,3e-06,0,-1e-06,3e-06,9e-06,-2e-06,-1e-06,-2e-06,0,-1e-06,0,0,2e-06,-2e-06,5e-06,1e-06,-3e-06,-1e-06,0,1e-06,0,-1e-06,3e-06,-3e-06,-2e-06,-2e-06,6e-06,-1e-06,-1e-06,5e-06,1e-06,1.1e-05,-2e-06,-0.000137,-1.2e-05,-7.4e-05,-3e-06,-8.9e-05,9.9e-05,1.6e-05,-0.000263,-0.000108,3.4e-05,-2.5e-05,-3.9e-05,7e-06,-0.00034,-7.1e-05,0.000114,-9.5e-05,3.8e-05,1.5e-05,8.6e-05,0.000133,0.000139,6.1e-05,-2.9e-05,-6.3e-05,-3.3e-05,-7e-06,-1e-04,0.000171,3e-06,0.000231,0.00015,0.000138,-2.5e-05,0.000144,-1e-05,5.5e-05,-0.00033,2.9e-05,-3.4e-05,0.000134,0.000187,2.6e-05,-1.2e-05,1.1e-05,-6.9e-05,-0.00012,1.6e-05,-4.7e-05,-0.000507,-2.7e-05,-3.6e-05,-3e-06,3.9e-05,0.000589,-4.5e-05,-0.000116,0.000181,2.2e-05,-1.7e-05,-9e-05,6.3e-05,0.000139,-1.1e-05,1.3e-05,-0.000188,-5.4e-05,-2.8e-05,9e-06,0.000226,-0.000253,-0.00024,0.000103,-4.7e-05
-1e-06,2e-06,4e-06,2e-06,2e-06,1e-06,0,-2e-06,-1e-06,0,1e-06,4e-06,-1e-06,-2e-06,2e-06,0,3e-06,3e-06,-8e-06,4e-06,1e-06,-2e-06,0,-1e-06,-1e-06,0,-2e-06,-1e-06,-5e-06,-1e-06,9e-06,-2e-06,0,0,0,0,0,-2e-06,0,2e-06,-1e-06,-1e-06,1e-06,-1.9e-05,1e-06,-7e-06,3e-05,0.00012,2e-05,7.2e-05,-8e-06,3.9e-05,-0.000122,-4.9e-05,0.000252,-8.8e-05,5.8e-05,6.8e-05,1.9e-05,-2.8e-05,0.00052,-3.4e-05,4.7e-05,0.000135,1.7e-05,0.000109,0.000135,-0.000142,7.7e-05,-8e-05,-1e-06,7.9e-05,-8e-05,-3.3e-05,6.8e-05,-0.000143,8e-06,-0.000367,-0.000105,-0.000202,1.3e-05,-0.000155,1.2e-05,-6.1e-05,-3.1e-05,4e-05,-4e-05,-0.000334,-0.000203,-1.4e-05,-2.5e-05,-3e-06,-3.3e-05,9.9e-05,3.6e-05,-7.9e-05,-3.5e-05,-7.5e-05,-3.1e-05,-6.4e-05,6.6e-05,-0.000287,-9e-06,-8.5e-05,-0.000236,3e-06,2e-06,0.000334,-0.000126,5.7e-05,1e-05,-0.00015,-3.8e-05,5.1e-05,8.5e-05,-7.9e-05,-0.000273,1.3e-05,-0.000121,-6.4e-05,-3.4e-05
1e-06,2e-06,0,-2e-06,-4e-06,1e-06,0,2e-06,-3e-06,0,-2e-06,-7e-06,-1e-06,0,-1e-06,0,-5e-06,-2e-06,5e-06,-1e-06,1e-06,1e-06,0,-1e-06,2e-06,1e-06,0,-3e-06,4e-06,2e-06,1e-06,-1e-06,0,0,0,-1e-06,-7e-06,1e-06,1e-06,-3e-06,-4e-06,-1e-06,-1e-06,3.1e-05,-1e-06,6e-06,-2e-06,5.3e-05,-5.8e-05,-7e-05,2e-06,-1e-04,0.00013,6.5e-05,0.000136,-2.2e-05,-6e-06,-0.000291,1e-06,-1.4e-05,-0.000602,-0.000142,-6e-06,-9.3e-05,1e-05,-0.000194,-8.1e-05,-0.000185,-8e-06,7.5e-05,-1e-06,-9.7e-05,-5.8e-05,-3.4e-05,6.6e-05,0.000106,4.3e-05,0.000276,0.000243,0.000186,1.2e-05,0.000148,2e-06,6.2e-05,6.7e-05,5.3e-05,8.6e-05,0.000224,0.000213,-5.7e-05,5.9e-05,-1.3e-05,2.8e-05,-0.000197,1e-04,4.1e-05,0.000292,3.9e-05,-2.8e-05,0.000111,-0.000136,-0.000269,3.7e-05,0.000182,0.000134,-6.1e-05,8e-06,-0.00026,-2.3e-05,-0.00022,1e-06,0.000198,9e-05,-1.1e-05,1e-06,8.5e-05,0.000318,0.000175,0.000125,-4.4e-05,-3.9e-05
