0.005901,0.006398,0.006199,0.006142,0.122456,0.446223,0.452033,0.297984,0.446208,0.799303,1.198371,1.429137,1.223123,0.840568,0.751195,0.879792,1.030999,1.014148,0.835119,0.615928,0.414113,0.235094,0.194747,0.274309,0.26239,0.10958,0.026321,0.03057
0.007225,0.007785,0.007608,0.007595,0.148403,0.529128,0.532046,0.355365,0.522235,0.895167,1.310436,1.558787,1.342673,0.934866,0.865233,1.006853,1.168073,1.163433,0.960602,0.707339,0.474086,0.27021,0.224225,0.313161,0.299822,0.126492,0.031259,0.037095
0.009464,0.010102,0.010069,0.01015,0.181603,0.63005,0.633605,0.440995,0.632579,1.017857,1.430849,1.680844,1.475039,1.072356,1.041327,1.170374,1.31323,1.329751,1.09671,0.802706,0.537125,0.30916,0.257063,0.353237,0.339788,0.147501,0.038631,0.047627
0.011189,0.011834,0.012058,0.012264,0.181703,0.611677,0.625112,0.468142,0.666414,1.045609,1.44781,1.682373,1.521484,1.171844,1.157509,1.217416,1.257002,1.253368,1.020365,0.734694,0.494408,0.293139,0.243981,0.333532,0.327201,0.148808,0.042212,0.054111
0.012624,0.012957,0.013327,0.013717,0.155864,0.51086,0.53768,0.432966,0.631632,1.035962,1.486306,1.738593,1.62037,1.328549,1.267562,1.207002,1.110114,1.033079,0.802357,0.557224,0.390698,0.249975,0.209089,0.287817,0.29296,0.14097,0.043121,0.054051
0.014704,0.014601,0.0147,0.015466,0.130231,0.418031,0.455138,0.380202,0.615776,1.121839,1.667346,1.991878,1.945939,1.719654,1.577448,1.368776,1.156212,0.962349,0.676969,0.462625,0.354414,0.252436,0.224375,0.283869,0.273753,0.134161,0.042552,0.049263
0.017655,0.017008,0.016748,0.017952,0.127697,0.41199,0.467042,0.38193,0.767673,1.58457,2.225497,2.510688,2.523944,2.480285,2.44929,2.101364,1.682449,1.317915,0.888812,0.632745,0.502156,0.341673,0.301416,0.349542,0.296823,0.137394,0.043339,0.049195
0.0219,0.020453,0.019912,0.02187,0.141016,0.460095,0.551129,0.470478,1.148301,2.588207,3.509267,3.584839,3.573798,3.924612,4.20446,3.725791,3.007387,2.327471,1.524826,1.095981,0.873582,0.534081,0.421904,0.481654,0.38347,0.162692,0.048694,0.065342
0.027239,0.02519,0.02498,0.027857,0.150053,0.490765,0.632179,0.617917,1.757273,4.188056,5.781605,5.817651,5.850969,6.656474,7.134802,6.347309,5.221804,4.011601,2.5819,1.868332,1.460941,0.808638,0.546867,0.62476,0.495873,0.204058,0.061134,0.092763
0.033246,0.029799,0.030367,0.034315,0.156364,0.512335,0.693751,0.754672,2.444561,6.126594,8.820483,9.347075,9.663344,10.636706,10.856297,9.57475,8.110045,6.219338,3.943118,2.878966,2.190484,1.109165,0.627844,0.718792,0.586536,0.244179,0.076448,0.121621
0.038602,0.033794,0.034219,0.037829,0.149469,0.489829,0.699365,0.858036,2.978644,7.708291,11.646933,13.286764,14.198656,14.819623,14.16925,12.365988,10.879387,8.391035,5.237544,3.881573,2.880937,1.343284,0.649171,0.728318,0.607666,0.264839,0.087722,0.136068
0.039536,0.034339,0.033765,0.035649,0.135435,0.451081,0.683709,0.945952,3.187358,8.293897,13.068069,16.013758,17.632213,17.375599,15.591281,13.502241,12.214427,9.481274,5.858395,4.408346,3.210939,1.419591,0.661238,0.688405,0.545709,0.256937,0.091557,0.126305
0.035955,0.031694,0.030418,0.03036,0.131363,0.482655,0.735634,1.003834,3.238425,8.273075,12.761856,15.89014,17.646412,16.297995,13.801108,12.022975,11.117549,8.749747,5.395062,4.000135,2.872255,1.27781,0.66442,0.62376,0.43105,0.220314,0.087403,0.105465
0.030877,0.028031,0.027285,0.026483,0.136478,0.563314,0.81539,0.955399,2.98057,7.424111,10.578249,12.417718,13.409828,11.400094,9.198768,8.30948,7.782573,6.244453,3.893016,2.748798,1.954335,0.94094,0.603026,0.530637,0.325827,0.180077,0.077395,0.09356
0.024645,0.023309,0.023269,0.022844,0.160236,0.753661,1.0115,0.858146,2.432289,5.868709,7.422544,7.387068,7.344437,5.871236,4.734682,4.50041,4.048535,3.179678,2.044412,1.400369,0.981788,0.55825,0.495822,0.450763,0.294978,0.172516,0.073731,0.107209
0.021997,0.022301,0.021412,0.02076,0.201732,1.063289,1.395829,0.860435,1.762656,4.084417,4.629055,3.611011,3.290384,3.027923,2.670422,2.357121,1.813916,1.249104,0.86571,0.616997,0.403468,0.327602,0.427385,0.408807,0.299741,0.187231,0.083521,0.135667
0.024518,0.026039,0.024633,0.021898,0.248886,1.450391,1.932882,1.026612,1.433963,3.212593,3.585189,2.605823,2.270544,2.09766,1.665724,1.396472,1.141511,0.816382,0.630375,0.455538,0.277262,0.281201,0.415538,0.417641,0.333244,0.218702,0.098493,0.163785
0.028931,0.029705,0.029401,0.025025,0.311199,1.903216,2.544016,1.278968,1.321389,2.997151,3.795897,3.202313,2.780104,2.191347,1.42525,1.270298,1.278899,1.037793,0.783114,0.558045,0.367247,0.335913,0.440415,0.448475,0.370169,0.247123,0.112636,0.187111
0.03496,0.032851,0.033898,0.028341,0.355288,2.211383,2.978236,1.495973,1.361021,3.263501,4.80546,4.668336,3.943207,2.914166,1.959973,1.782432,1.798176,1.443566,1.064793,0.781857,0.52203,0.413773,0.464348,0.472171,0.400886,0.261616,0.122099,0.194085
0.040138,0.035099,0.036599,0.031296,0.341962,2.161803,3.008308,1.608277,1.495788,3.756915,6.074717,6.453274,5.366267,3.918106,2.923905,2.578989,2.404282,1.949838,1.517316,1.107495,0.677137,0.485934,0.475159,0.464567,0.39342,0.244556,0.121329,0.177983
0.039868,0.034697,0.037409,0.03374,0.295733,1.818728,2.658036,1.578676,1.687993,4.224604,6.973415,7.858621,6.548022,4.787685,3.93684,3.303836,2.748594,2.35965,2.005161,1.381573,0.747296,0.523142,0.507951,0.475342,0.365373,0.210224,0.105773,0.145443
0.038904,0.036969,0.039996,0.036136,0.252721,1.397306,2.112968,1.40164,1.772868,4.259085,6.909602,8.069591,6.71457,4.996057,4.567277,3.609032,2.62529,2.475652,2.259753,1.434251,0.692817,0.490226,0.505785,0.476178,0.34527,0.187497,0.08366,0.112087
0.040562,0.042275,0.044325,0.038941,0.189683,0.909477,1.450714,1.108559,1.688199,3.852816,5.882516,6.800188,5.618922,4.390654,4.438848,3.363682,2.289063,2.335501,2.097582,1.239415,0.582242,0.425072,0.468488,0.451893,0.318243,0.165944,0.067304,0.082223
0.043893,0.047944,0.048708,0.039608,0.119281,0.485958,0.867498,0.823293,1.521416,3.432291,4.946151,5.230504,4.19129,3.628164,3.842856,2.929762,2.127324,2.044527,1.617987,0.945834,0.510973,0.382011,0.423757,0.40709,0.277068,0.140025,0.061209,0.062762
0.045372,0.048304,0.046447,0.036665,0.088712,0.344473,0.632478,0.679289,1.481035,3.363301,4.670932,4.279325,3.248639,3.091828,3.117632,2.581836,2.07153,1.668234,1.087394,0.655401,0.452456,0.362786,0.387559,0.344734,0.233237,0.121919,0.056111,0.049973
0.040397,0.040123,0.037444,0.035441,0.098169,0.350539,0.561035,0.593471,1.551153,3.362381,4.390691,3.815975,2.863876,2.631637,2.354112,2.042113,1.742445,1.287497,0.832047,0.532394,0.387959,0.347839,0.360669,0.299098,0.210966,0.115391,0.049375,0.043273
0.031105,0.028947,0.0293,0.036747,0.102327,0.321535,0.483686,0.519501,1.485924,3.049561,3.716176,3.282259,2.577477,2.274482,1.943991,1.51554,1.255435,1.081802,0.822865,0.520713,0.341789,0.324882,0.336683,0.262372,0.178473,0.104385,0.048284,0.042543
0.026985,0.025609,0.025805,0.03472,0.08981,0.265081,0.436868,0.509629,1.292026,2.632084,3.112927,2.708501,2.098187,1.735216,1.530255,1.068815,0.890558,1.008837,0.858024,0.509223,0.300429,0.305719,0.320974,0.253713,0.15793,0.087919,0.048426,0.045105
0.032771,0.031187,0.03048,0.033158,0.07179,0.212052,0.395581,0.495011,1.119318,2.442271,3.055188,2.523254,1.736557,1.362943,1.276697,0.888326,0.77087,1.006642,0.929651,0.534854,0.305906,0.34825,0.374787,0.302847,0.169635,0.077569,0.050204,0.051566
0.049329,0.048125,0.046149,0.039067,0.07527,0.208639,0.359117,0.435063,1.165534,2.530953,2.977242,2.353736,1.626775,1.303049,1.299519,0.994857,0.785334,1.005576,0.966183,0.552807,0.352379,0.415674,0.467659,0.383727,0.192826,0.079138,0.059671,0.067887
0.070753,0.069794,0.065977,0.051733,0.096359,0.253539,0.381511,0.422694,1.334172,2.717983,2.772121,2.131827,1.603595,1.363579,1.461446,1.097841,0.73019,0.927589,0.943811,0.593058,0.399101,0.43117,0.534723,0.457399,0.209838,0.085056,0.072452,0.090612
0.085159,0.084568,0.078603,0.060008,0.111887,0.291394,0.434959,0.506647,1.52389,2.866499,2.717638,2.066024,1.566157,1.345741,1.433099,1.043593,0.638692,0.744713,0.799711,0.628433,0.426852,0.370429,0.515203,0.471099,0.205038,0.088745,0.083727,0.106896
0.080604,0.080632,0.073767,0.054965,0.105489,0.294144,0.463704,0.574895,1.585943,2.969696,2.973755,2.194294,1.480392,1.200343,1.178089,0.921989,0.617139,0.547299,0.588138,0.584614,0.411789,0.283846,0.405717,0.406378,0.181593,0.083322,0.081233,0.101612
0.057033,0.057773,0.052509,0.038046,0.077554,0.264204,0.456718,0.571701,1.528535,3.059215,3.507514,2.716723,1.627705,1.119838,1.057967,0.948189,0.65007,0.447126,0.452258,0.461892,0.33391,0.217211,0.289854,0.304133,0.148696,0.067796,0.063452,0.07462
0.029939,0.031495,0.031334,0.024171,0.048228,0.21212,0.377672,0.479707,1.547234,3.535258,4.136955,3.003728,1.690339,1.132038,1.200346,1.07039,0.646896,0.399952,0.361689,0.300428,0.218655,0.175392,0.242366,0.254142,0.139527,0.060434,0.046566,0.049839
0.017453,0.019094,0.024578,0.023492,0.040105,0.171799,0.272792,0.33703,1.471473,3.742521,4.292746,2.799963,1.501577,1.105868,1.235121,1.040028,0.57048,0.341624,0.301701,0.205188,0.137561,0.129751,0.253495,0.305993,0.16502,0.061301,0.038029,0.0416
0.018706,0.018807,0.024167,0.027171,0.045237,0.148185,0.220549,0.257471,1.257085,3.321213,3.976299,2.532619,1.178575,0.974931,1.056751,0.859693,0.559547,0.376255,0.30448,0.172781,0.119825,0.128165,0.29848,0.379027,0.18949,0.053813,0.031841,0.038947
0.020403,0.022057,0.02758,0.033259,0.051773,0.130136,0.185422,0.217574,1.058471,2.671492,3.439162,2.264715,0.993356,0.816852,0.800973,0.636451,0.532274,0.428451,0.297091,0.168431,0.132464,0.168534,0.368493,0.421109,0.189381,0.039721,0.0223,0.030881
0.024117,0.026922,0.034733,0.046095,0.056287,0.120453,0.176511,0.190518,1.03436,2.672953,3.098582,1.774501,0.81104,0.644615,0.660728,0.497587,0.437333,0.4479,0.284578,0.162423,0.161546,0.223585,0.406036,0.40029,0.164434,0.032248,0.017917,0.024572
0.029195,0.032227,0.040223,0.060207,0.059937,0.114674,0.174131,0.156065,1.001262,2.632293,2.645928,1.34903,0.632633,0.540666,0.562048,0.364221,0.32343,0.444355,0.290035,0.148185,0.183425,0.261559,0.381214,0.325777,0.126399,0.027127,0.018678,0.026348
