3e-06,1.6e-05,6e-06,2.7e-05,4.3e-05,5e-05,2.6e-05,0,6e-06,4.9e-05,2e-05,1.5e-05,2.8e-05,2e-06,1.4e-05,1.5e-05,9e-06,3.3e-05,1.3e-05,2e-06,2.1e-05,1.4e-05,1.9e-05,6e-06,7.9e-05,2.9e-05,2e-06,3.7e-05,3.9e-05,1.8e-05,2.1e-05,5.5e-05,1e-05,3.1e-05,5.6e-05,2e-05,1e-06,4.4e-05,4e-05,3.6e-05,1.9e-05,1.6e-05,4.8e-05,2.2e-05,1.7e-05,5e-06,5.6e-05,1.9e-05,5e-06,4e-06,2.9e-05,2.3e-05,1.8e-05,2e-06,1.2e-05,7e-06,2e-06,2.9e-05,1.8e-05,5e-06,3.4e-05,3.5e-05,2.9e-05,1.6e-05,5.6e-05,3.7e-05,2e-05,3.8e-05,2e-06,3.1e-05,3.3e-05,0,6.4e-05,8e-06,1.9e-05,2e-06,4.3e-05,5e-05,2e-06,1.1e-05,1.6e-05,2e-05,3.5e-05,1.6e-05,9e-06,1.9e-05,2.6e-05,3e-05,2e-05,2.4e-05,1e-05,2.5e-05,1.1e-05,2.4e-05,1.2e-05,1.8e-05,1.1e-05,2.2e-05,1.8e-05,1.1e-05,2.2e-05,4.1e-05,2.1e-05,1.1e-05,1e-05,7e-06,9e-06,1e-06,3.3e-05,1.4e-05,2e-06,1e-05,8e-06,1.3e-05,1.6e-05,4.4e-05,2.7e-05,2.5e-05,1.4e-05,1e-05,0
1e-05,4.4e-05,2.2e-05,7.7e-05,9.5e-05,0.000113,3.5e-05,2.2e-05,5e-06,0.000109,3.6e-05,5.1e-05,4.7e-05,1.3e-05,5.5e-05,1.8e-05,1.9e-05,6.5e-05,3.9e-05,3e-06,4.7e-05,2.6e-05,2.2e-05,3.3e-05,0.000147,6.9e-05,3.5e-05,9.3e-05,0.000106,8.2e-05,2.3e-05,8.8e-05,3.9e-05,0.00012,0.000107,2.9e-05,2e-05,0.000108,9.5e-05,6.3e-05,4.1e-05,4.5e-05,0.000102,5.6e-05,5e-05,5e-06,8.7e-05,3.4e-05,4.1e-05,2.1e-05,7e-05,7.8e-05,3.4e-05,2.7e-05,6e-06,3.1e-05,2.8e-05,6.4e-05,5.3e-05,1.9e-05,7.5e-05,5.7e-05,8e-05,3.7e-05,0.000132,7.6e-05,1.6e-05,7.7e-05,4.4e-05,5.1e-05,2.8e-05,3.2e-05,9.6e-05,4.8e-05,2.6e-05,2.6e-05,6.3e-05,9.3e-05,3.9e-05,1.9e-05,5.2e-05,1.8e-05,2.9e-05,1.9e-05,4.9e-05,4.5e-05,9.3e-05,5.3e-05,6.4e-05,5.1e-05,2.6e-05,6.1e-05,1.9e-05,4.5e-05,1.3e-05,1.7e-05,1e-05,3.9e-05,7e-05,2.1e-05,8e-06,8.4e-05,4.9e-05,5.9e-05,2.8e-05,4.7e-05,5.8e-05,4.4e-05,6.4e-05,2.1e-05,3.2e-05,3.1e-05,1.6e-05,4.4e-05,4.8e-05,9.3e-05,5.6e-05,3.7e-05,2.8e-05,2.5e-05,1.3e-05
3.3e-05,9.5e-05,5.7e-05,5.2e-05,8.6e-05,0.000127,1e-04,2.6e-05,3.5e-05,0.000154,3.4e-05,9e-05,0.00011,1.9e-05,5.3e-05,7.1e-05,2.6e-05,7e-05,5.8e-05,2.7e-05,5.8e-05,6.4e-05,5e-06,2e-05,0.000152,0.000112,2.9e-05,6e-05,9e-05,1.9e-05,8e-05,0.000111,2.5e-05,0.000115,0.000156,5.2e-05,3.9e-05,0.000146,7.8e-05,0.000124,7.6e-05,5.1e-05,6.5e-05,4.3e-05,3.2e-05,3.2e-05,0.00013,2.7e-05,7.4e-05,5.8e-05,7.7e-05,5e-05,4.4e-05,8.4e-05,4.7e-05,8.7e-05,1.3e-05,4.8e-05,4.3e-05,3.1e-05,4.3e-05,8.4e-05,6.2e-05,6.7e-05,0.000131,0.000102,4.7e-05,0.000107,2.2e-05,6.6e-05,3.6e-05,3.5e-05,6.4e-05,8.9e-05,7.9e-05,6.3e-05,3e-05,0.00014,0.000142,7.4e-05,0.000105,8.9e-05,0.000145,5.3e-05,7.3e-05,4.9e-05,0.00015,4.1e-05,6.7e-05,2.6e-05,4.1e-05,4.3e-05,4.9e-05,3.6e-05,3.5e-05,4.1e-05,2.7e-05,4.5e-05,1e-04,2.7e-05,4.2e-05,0.000102,2.5e-05,2.8e-05,7.9e-05,5.4e-05,7.8e-05,6.4e-05,5.4e-05,7.1e-05,2.6e-05,2.9e-05,2.6e-05,5.8e-05,3e-05,4.3e-05,0.000135,5.8e-05,4.8e-05,4.8e-05,5.1e-05
4.5e-05,0.000124,4.2e-05,4.8e-05,0.000144,0.000131,0.000113,6e-05,3.5e-05,0.000188,5.9e-05,4.9e-05,7.8e-05,3.5e-05,5.3e-05,4.2e-05,3.7e-05,0.00011,9.8e-05,4.1e-05,7.9e-05,2.5e-05,8e-05,6.9e-05,0.00022,0.000129,0.000112,0.000108,0.000119,0.000103,0.000109,0.000156,7e-05,6.7e-05,9.6e-05,8.7e-05,0.000146,5.3e-05,2.6e-05,9.6e-05,9.9e-05,7.3e-05,0.000162,4.4e-05,9.5e-05,6.1e-05,0.00016,6.2e-05,7.2e-05,7.2e-05,7.1e-05,0.000204,0.000134,3.9e-05,1.2e-05,7.4e-05,8.5e-05,1.6e-05,0.000153,6e-05,8.2e-05,0.000124,0.000101,9.7e-05,0.000176,0.000133,0.000105,5.4e-05,9.8e-05,0.000146,8.4e-05,5.1e-05,0.00011,5.9e-05,9e-06,6.5e-05,5.7e-05,0.000101,9.3e-05,1.7e-05,7e-05,4.9e-05,0.000132,4.8e-05,3.7e-05,7.4e-05,7.7e-05,0.000113,5.4e-05,2.9e-05,7.8e-05,0.000107,6.2e-05,5.1e-05,8.7e-05,0.000105,6.3e-05,3.3e-05,0.000135,0.000106,3.9e-05,0.000137,8.1e-05,4.4e-05,3.2e-05,0.000121,0.000137,6e-05,0.000115,1.8e-05,6.6e-05,5.6e-05,1.7e-05,5.4e-05,0.00011,0.000127,9.8e-05,7.8e-05,5.4e-05,2.3e-05,1.6e-05
0.000147,8.6e-05,2.3e-05,0.000203,0.00023,0.000181,0.000179,0.000105,0.000109,0.000205,2.9e-05,9.8e-05,0.000139,4.2e-05,3.7e-05,6.7e-05,3.8e-05,0.000163,0.000135,1.4e-05,6.6e-05,9.6e-05,7e-05,2.6e-05,0.000188,0.000161,0.000118,8.2e-05,0.000147,0.00013,0.000212,8.2e-05,0.000135,0.000174,8.3e-05,8e-05,9.3e-05,0.000175,0.000167,8.4e-05,2.4e-05,4.1e-05,0.000182,7.2e-05,9e-05,2.5e-05,0.000159,7.8e-05,4.3e-05,9.5e-05,9.7e-05,0.000204,0.000102,0.000106,5.1e-05,5e-05,9e-06,8.5e-05,0.000213,5e-05,0.000101,0.000147,7.4e-05,1.3e-05,0.000122,0.000218,5.5e-05,0.000101,0.000117,4.6e-05,5.4e-05,4e-05,0.000143,6.2e-05,5.6e-05,5.8e-05,7.5e-05,6.4e-05,0.000145,8.2e-05,1.6e-05,3.6e-05,6.5e-05,4.8e-05,5e-05,5.4e-05,8.4e-05,6.5e-05,0.000106,9.5e-05,9.8e-05,9e-05,6.5e-05,5.6e-05,7e-05,7.2e-05,3.8e-05,6.7e-05,0.000173,2e-04,6.6e-05,0.000137,0.000101,3.9e-05,6.2e-05,0.000106,3.3e-05,5.6e-05,3.1e-05,0.00014,0.000118,5e-05,8.2e-05,5.1e-05,5.8e-05,0.000129,5.6e-05,7.4e-05,3.9e-05,0.000112,1e-04
0.000134,9.3e-05,8.5e-05,0.000269,0.000206,0.000102,0.000262,1.7e-05,0.000195,0.000163,0.000287,7.6e-05,0.000223,8.5e-05,6.2e-05,5.5e-05,6.3e-05,0.000294,0.000155,8.7e-05,0.000222,8.8e-05,0.000207,0.000178,0.000187,0.000205,0.000124,4.4e-05,3.2e-05,0.000137,0.000232,0.000228,0.000126,7.8e-05,0.000219,6.8e-05,6.8e-05,0.000181,3e-04,0.000241,0.000162,1.3e-05,0.000204,7e-05,5.3e-05,7.3e-05,0.000201,8.7e-05,7.9e-05,6.6e-05,7e-05,0.000181,9e-05,3.5e-05,0.000124,4.5e-05,0.000178,0.00017,0.000188,7e-05,7.2e-05,0.000104,0.000101,0.000114,0.000213,0.00028,0.000176,0.000116,0.000143,0.000122,0.000123,5.5e-05,0.000229,5.6e-05,6.4e-05,0.000161,0.000139,5e-05,9.3e-05,7.2e-05,2.5e-05,1.4e-05,8.7e-05,0.000113,7.2e-05,6.8e-05,2.8e-05,0.000175,0.000106,2.3e-05,6.8e-05,8.7e-05,6.6e-05,0.000147,0.000125,6.7e-05,0.000111,6.1e-05,0.000142,8.8e-05,0.000223,0.000141,0.000103,5.8e-05,7.3e-05,4.3e-05,9.9e-05,0.000134,2.7e-05,0.000121,0.000147,0.000149,9e-05,2.8e-05,8.8e-05,0.000184,0.000127,5.4e-05,2.8e-05,0.000196,0.000125
0.000361,0.000137,0.000189,0.000437,0.000579,0.000742,0.000659,0.000262,0.000411,0.000537,0.000652,0.000435,0.000354,0.000102,7.9e-05,6.2e-05,9e-06,0.000378,0.000563,0.000456,0.000389,0.00017,0.000398,7.5e-05,0.000395,0.000216,0.000395,0.00029,0.000228,0.000264,0.000418,0.000308,9.3e-05,0.000148,0.000268,0.000267,0.000162,0.000304,0.000211,5e-05,0.000402,0.000361,0.000492,0.000329,0.000325,0.00028,0.000158,6e-05,0.000119,0.000138,6.9e-05,0.000277,0.000306,0.000156,0.000273,0.000355,4e-04,7e-05,0.000391,0.000227,0.000167,0.000317,9e-05,0.000215,0.000548,0.000386,0.000302,0.000466,0.000456,0.000294,0.000141,0.000121,0.000407,0.000353,0.000133,0.000283,0.000295,0.000231,0.000148,2e-05,1e-05,9.9e-05,0.000245,0.000118,3.9e-05,3.9e-05,0.000198,0.000274,0.000218,0.000185,0.000197,8.7e-05,6.2e-05,0.000103,9.8e-05,0.000199,7.7e-05,0.000134,0.000227,0.000274,0.000466,0.000544,0.000531,0.000363,0.000216,0.000233,0.000193,0.000333,0.000265,0.000162,0.000267,0.000372,0.000383,0.000257,0.000308,0.000337,0.000221,0.00028,0.000104,0.000233,0.000233
0.000643,0.00044,0.000547,7.8e-05,0.000247,0.000559,4.6e-05,0.000437,0.000108,0.000648,0.000902,0.000545,0.00068,0.000667,0.000354,0.000226,0.000113,0.000424,0.000441,0.000452,0.000518,0.000502,0.000638,0.000538,0.000347,0.000378,0.000514,0.000187,0.000227,0.000198,0.000292,0.00055,0.00062,0.000261,0.000581,0.000479,0.00031,0.000517,0.000436,8.4e-05,0.000486,0.000526,0.000776,0.000796,0.000487,9.8e-05,0.000456,0.000382,0.000149,0.000376,0.000123,0.000327,0.000758,0.000397,0.000436,9.7e-05,0.000352,0.000306,0.000712,0.000585,0.000472,0.000466,0.000559,0.000359,0.000323,0.000296,0.000176,0.000277,0.000307,9e-05,0.000233,0.000261,0.000283,0.000487,0.000264,0.000445,0.00035,0.00047,0.000293,0.000126,0.000107,0.000203,0.000523,0.000452,0.000199,0.000191,0.000452,0.000633,0.000284,0.00019,0.000441,0.000407,0.000355,0.000169,0.000151,0.000179,0.000329,0.000422,0.000462,0.000546,0.000208,0.000188,0.000326,0.00013,9.4e-05,0.000178,7.1e-05,0.000248,0.000222,0.000204,0.000302,0.000138,0.000135,9.3e-05,0.00017,0.00015,0.000177,0.000137,0.000236,3e-04,0.000463
0.000254,0.000228,0.000466,0.000482,0.000288,0.00029,0.000471,0.000646,0.000535,0.000378,0.000283,0.000331,0.00047,0.000972,0.000477,0.000175,0.000324,0.000624,0.000329,0.000261,0.00026,0.000485,0.000137,0.000407,0.000784,0.00104,0.000269,8.5e-05,0.000218,0.000198,0.000228,0.000465,0.000451,0.000368,0.000646,0.000314,9.1e-05,0.000512,0.00075,0.000751,0.000637,0.000468,0.000706,0.000386,0.000495,0.000327,0.000477,0.000536,0.000478,0.000193,0.00029,0.000368,0.000693,0.000505,0.000638,0.000355,0.000545,0.000524,0.000335,0.000353,0.000104,4.8e-05,0.000467,0.000266,0.000291,0.000687,0.000446,0.000374,0.000124,0.000178,3e-04,8.5e-05,0.000241,0.000336,0.000171,0.000427,0.000323,0.00062,0.000681,0.000432,0.000272,0.000288,0.000467,0.000515,0.00034,0.000332,0.000241,0.000372,0.000429,0.00031,0.00052,0.000556,0.00014,0.000236,0.000408,0.00019,0.000357,0.000247,0.000189,0.000223,0.000294,0.000171,0.000123,0.000267,0.000156,0.000193,0.000208,0.000229,0.000114,0.000153,0.000329,0.000275,9.8e-05,8.8e-05,0.000186,0.000311,0.000326,0.000286,0.000215,0.00044,0.00037
7.3e-05,0.000488,0.000429,0.000137,0.000221,0.000104,0.000248,0.000296,8.2e-05,0.000221,0.000252,0.000341,0.000525,0.000443,0.000659,0.000376,0.000198,0.000243,0.000446,0.000287,0.000127,0.000475,0.000413,4.7e-05,0.000329,0.000576,0.000444,0.000133,8.7e-05,0.000199,0.000211,0.000344,0.000236,0.000225,0.000291,0.000323,0.00011,0.000254,0.000366,0.000299,0.000279,0.000506,0.000256,0.000121,0.000398,0.000491,0.000327,0.000353,0.000206,0.000279,0.000422,0.000226,0.000369,6.2e-05,0.000383,0.000376,0.000166,0.00032,0.000537,0.000126,0.000188,0.000299,0.000297,9.1e-05,0.000298,0.000438,0.000249,0.000127,0.000136,0.000126,0.000255,0.000271,1e-04,7.2e-05,1.2e-05,0.000272,9.7e-05,0.000284,0.000197,4.6e-05,0.000214,0.000276,0.000382,0.000346,0.000186,0.000287,0.00038,0.000102,0.000307,0.000438,0.000207,0.000234,0.000238,0.000234,0.000108,0.000285,0.000429,0.000298,9e-05,0.000144,1e-04,4.2e-05,4.2e-05,0.000186,0.000148,0.000209,0.00012,5.9e-05,5.8e-05,0.000149,0.000154,0.000115,3.4e-05,4.1e-05,7.3e-05,0.000188,0.000126,0.000204,0.00036,0.000368,9.8e-05
0.000231,0.000412,8.6e-05,9.8e-05,0.000285,0.00024,7.7e-05,0.000106,0.000143,0.000221,0.000177,0.000273,0.000152,0.000434,0.000224,7.1e-05,0.000188,0.000342,1e-04,9.3e-05,0.000139,0.000263,0.000156,9.5e-05,0.00018,0.000263,0.000151,0.000112,0.000196,0.000292,0.000354,0.000192,9.5e-05,5.2e-05,0.000126,0.000217,0.000209,0.000208,0.00025,9.3e-05,0.000251,8.5e-05,7.3e-05,0.000179,0.000128,0.000165,0.000297,7.9e-05,0.000129,0.00023,0.000172,0.000247,6e-05,0.000113,0.000284,0.000236,0.000172,0.000139,6.3e-05,9.2e-05,0.000103,0.000209,8.1e-05,0.000122,9.2e-05,0.00016,5.1e-05,0.000123,0.000164,0.00019,1e-05,0.000158,0.000242,0.000168,0.000119,0.000179,3.7e-05,8.1e-05,2e-05,7.9e-05,0.000295,0.000138,0.000154,0.000128,0.000149,9.6e-05,0.000107,0.000103,0.000154,0.000142,0.000272,8.2e-05,9.2e-05,0.000152,0.000213,0.000297,8.1e-05,0.000199,0.000263,4.4e-05,5.6e-05,0.00011,9.8e-05,3.3e-05,5.1e-05,0.000118,9.1e-05,0.000109,9.7e-05,0.000205,9.9e-05,0.000138,9.7e-05,6.9e-05,2.9e-05,0.000129,0.000109,0.000171,7.8e-05,5.6e-05,0.000105
6e-05,0.000262,0.00013,4.1e-05,0.000177,3.5e-05,9.9e-05,7.6e-05,0.000111,8.8e-05,3.9e-05,0.00016,9.2e-05,9.9e-05,0.000121,0.000116,0.000132,6.6e-05,8.7e-05,8.7e-05,0.00026,7.7e-05,8.5e-05,6.7e-05,0.000129,0.000102,9.9e-05,8.4e-05,0.000167,0.000161,7.8e-05,0.000149,0.000117,0.000126,0.000158,8e-05,0.00011,8.9e-05,0.000188,0.000119,0.000202,8.2e-05,0.000138,0.000133,0.000111,9.7e-05,9.6e-05,9e-06,3.9e-05,0.000136,3.7e-05,0.000124,2.7e-05,6.9e-05,0.000151,7.6e-05,0.000142,6.3e-05,5.7e-05,6.2e-05,2.7e-05,0.00016,2.5e-05,6.2e-05,9.6e-05,6.8e-05,4.4e-05,0.000112,6.8e-05,0.000103,8.5e-05,6.9e-05,0.000109,7.7e-05,5.2e-05,3.9e-05,6.7e-05,0.000112,0.000162,0.000135,0.000123,7.2e-05,0.000102,3.2e-05,7.2e-05,6.9e-05,0.000145,5.6e-05,8.2e-05,9.7e-05,0.000106,4e-05,8.9e-05,5.5e-05,6.6e-05,0.000146,0.000136,0.000145,5.2e-05,5.9e-05,3.6e-05,4.1e-05,7.3e-05,0.000101,6.8e-05,4.5e-05,7.5e-05,3.1e-05,1.7e-05,8.5e-05,7.3e-05,6.7e-05,3.4e-05,1e-06,3e-05,6.8e-05,9.2e-05,3e-05,4.6e-05,5.7e-05,8e-05
9.5e-05,0.00014,6.3e-05,6.4e-05,6.4e-05,0.000123,7.3e-05,0.000102,3.9e-05,0.00012,7.9e-05,3.8e-05,8e-05,0.000104,3.7e-05,7.3e-05,5.1e-05,5.1e-05,7.5e-05,0.000106,0.000128,3.5e-05,6.8e-05,3.8e-05,4.7e-05,7.6e-05,6.8e-05,1.8e-05,0.000102,0.000127,0.000171,0.000112,1.3e-05,7.6e-05,6e-05,0.000142,3.6e-05,0.000141,0.000197,3.5e-05,0.000155,5.4e-05,8.2e-05,2.2e-05,5.6e-05,3.9e-05,9.5e-05,1.6e-05,1e-04,0.00011,2.1e-05,4.8e-05,7.9e-05,2.1e-05,0.000129,2.9e-05,9.5e-05,6.4e-05,4.3e-05,9.8e-05,6.8e-05,0.000131,0.000109,6.2e-05,0.000117,5.9e-05,3.7e-05,5.9e-05,5.6e-05,2.2e-05,1.7e-05,4.6e-05,0.000111,9.7e-05,6.2e-05,4.1e-05,1.3e-05,1e-04,9e-05,9.9e-05,8.4e-05,8.1e-05,0.000124,1.7e-05,6.5e-05,5.5e-05,0.000141,2.3e-05,5.3e-05,2.6e-05,7.4e-05,6.7e-05,0.000161,4.7e-05,7e-05,8e-05,1e-04,9.5e-05,7.9e-05,6.6e-05,3.1e-05,2.3e-05,1.3e-05,0.000103,3.8e-05,7.1e-05,6e-06,5.3e-05,7.6e-05,6.4e-05,8.2e-05,5.8e-05,2.1e-05,2e-05,4.3e-05,8.1e-05,5.4e-05,3.5e-05,8.2e-05,5.7e-05,5.7e-05
0.00017,3.8e-05,0.000148,0.000121,0.000106,0.000232,0.000276,0.000281,0.000168,3.6e-05,2.4e-05,0.000104,0.000173,0.00012,6.7e-05,3.6e-05,7.8e-05,8.6e-05,0.000142,9.1e-05,0.000197,0.000207,0.000115,0.000126,9.5e-05,0.00014,8.6e-05,2e-05,1.3e-05,9.7e-05,0.000117,0.000146,9.4e-05,1.1e-05,7.2e-05,0.000133,9.6e-05,0.000163,0.000301,0.000187,0.000143,0.000131,5.4e-05,5.1e-05,6.5e-05,6.8e-05,5.6e-05,3.1e-05,0.000154,8.9e-05,0.000137,9.4e-05,0.00017,9.6e-05,9.3e-05,4.2e-05,9.6e-05,0.000104,0.000106,0.000132,0.000164,5.3e-05,0.000111,9.7e-05,0.000112,2.7e-05,0.000109,0.000163,7.4e-05,7.4e-05,6.9e-05,6.9e-05,4.5e-05,4.7e-05,9.1e-05,0.000144,0.000147,4e-05,9.9e-05,0.000147,9.2e-05,7.4e-05,0.00012,8.1e-05,6.3e-05,4.1e-05,8.2e-05,3.3e-05,8.8e-05,2.6e-05,7.2e-05,5e-05,0.000141,0.000102,5.9e-05,0.000113,8.5e-05,5.7e-05,4.1e-05,5.2e-05,8.2e-05,5.5e-05,4.3e-05,4.8e-05,6.6e-05,5.3e-05,2e-05,8.4e-05,3.4e-05,0.000114,7.1e-05,7.8e-05,5.2e-05,5e-06,7.7e-05,4.4e-05,3.4e-05,9.2e-05,1.5e-05,8.7e-05,9.3e-05
0.000172,0.000191,0.000239,0.000243,0.000128,0.000168,0.000321,0.000225,0.000135,0.000111,7.7e-05,1.9e-05,0.000154,0.000153,0.000141,8.7e-05,6.9e-05,0.000107,5e-05,8.8e-05,7.4e-05,0.000151,2.3e-05,7.7e-05,1e-04,0.000119,6.3e-05,9.4e-05,0.00014,0.000117,0.000165,5.2e-05,3.9e-05,4.9e-05,7.7e-05,0.000208,0.000167,0.000214,0.000194,0.000125,0.000164,0.000139,0.000122,9.4e-05,0.000117,4.8e-05,6.8e-05,5.9e-05,0.000181,0.000141,0.000103,0.000144,0.000208,0.000199,0.000122,0.000159,0.000121,9.5e-05,4.1e-05,1e-04,0.000117,0.000126,0.000158,9.3e-05,7.1e-05,5.2e-05,0.000152,0.000174,0.000102,0.000134,3.8e-05,7.1e-05,7.5e-05,5.8e-05,5.4e-05,1e-04,0.000128,1e-04,9e-05,6.8e-05,0.000187,0.000187,0.000164,0.000146,3.1e-05,6e-05,0.00012,5.6e-05,8.7e-05,1.3e-05,0.000144,0.000121,0.000123,8.7e-05,7.8e-05,9.9e-05,6.5e-05,0.00011,7.1e-05,5.2e-05,8.4e-05,4.7e-05,6.8e-05,3.4e-05,7.4e-05,8.3e-05,1e-04,8e-06,2.6e-05,0.000102,0.000108,2.3e-05,4.3e-05,4.6e-05,8.3e-05,0.00011,4.3e-05,3.7e-05,3.6e-05,0.000158,8.5e-05
0.000115,0.000133,6e-05,0.000112,0.000131,0.000258,0.000134,0.000228,7.4e-05,0.000283,0.000194,8.6e-05,9.8e-05,4.9e-05,2.1e-05,9e-05,5.3e-05,0.000106,4.2e-05,0.000147,0.00013,6.1e-05,0.000143,0.000121,4.1e-05,9.3e-05,9.4e-05,0.000123,0.000187,6e-05,6.9e-05,8e-05,0.000127,0.000235,5.2e-05,0.000123,5e-05,0.000191,0.000127,7.2e-05,9.8e-05,1.3e-05,4.9e-05,8.7e-05,8e-06,7.1e-05,0.000105,0.000106,0.000124,5.6e-05,0.000172,9.4e-05,0.00016,2.8e-05,9.2e-05,0.000152,6e-05,6e-05,8.8e-05,7.6e-05,2.3e-05,3.2e-05,0.000156,3.5e-05,5.2e-05,7.8e-05,7.8e-05,7.5e-05,0.000128,0.000142,0.000115,0.000127,5.6e-05,8.6e-05,0.000134,6.5e-05,2.6e-05,5.2e-05,4.7e-05,5.9e-05,0.000137,1.2e-05,0.000149,0.00011,0.000102,8.5e-05,0.000154,5.7e-05,0.000181,0.000148,0.000145,6.7e-05,5e-05,6e-05,8.5e-05,8.5e-05,3e-05,7.8e-05,7.1e-05,0.000108,3.2e-05,9.7e-05,4e-05,8.2e-05,4.8e-05,5.9e-05,3.9e-05,4.2e-05,2.8e-05,2.2e-05,4.6e-05,2.8e-05,1.8e-05,4.3e-05,0.000102,2.6e-05,4.9e-05,6.1e-05,0.000134,6.2e-05,5.2e-05
0.000247,2.9e-05,9.6e-05,3.5e-05,0.000236,0.000214,0.000276,0.00034,0.000212,0.000325,0.000152,0.000136,0.00014,0.000183,0.000129,9.3e-05,9.9e-05,9.7e-05,2.2e-05,0.000167,0.000128,0.000187,0.000223,0.000158,0.000192,0.000174,0.000107,0.000151,0.000285,0.000188,0.000206,0.000105,0.000134,0.000284,0.000268,0.00026,0.000148,0.000116,7.2e-05,2.5e-05,0.000148,9e-05,6.5e-05,0.00012,0.00011,9.3e-05,2.6e-05,9e-05,0.000161,9.4e-05,0.000231,0.00033,0.000139,3.8e-05,0.000105,0.000117,0.000159,9.3e-05,0.00011,9.4e-05,0.000121,7.4e-05,0.000173,8.1e-05,9.1e-05,3.7e-05,5.8e-05,0.000105,0.000242,0.000158,8.5e-05,8.1e-05,2.9e-05,9.7e-05,0.000147,0.000138,0.000122,0.000194,0.000206,0.000204,6.9e-05,4e-05,7.4e-05,0.000101,7e-05,7.2e-05,0.000193,1e-04,0.000226,0.000211,8.8e-05,8.1e-05,5.8e-05,9.1e-05,0.000149,0.000121,7.6e-05,4e-06,5.2e-05,8.2e-05,6.7e-05,0.000115,7.3e-05,0.00011,4.9e-05,3.3e-05,8.5e-05,6.4e-05,0.000102,8e-05,8.8e-05,3.3e-05,7.5e-05,8.7e-05,1.3e-05,6e-05,9.7e-05,9.7e-05,0.000119,7.9e-05,0.000119
0.000203,0.000205,7.8e-05,0.000116,0.000172,8.5e-05,0.000276,0.000121,9.1e-05,0.000118,6.3e-05,2e-05,0.000188,0.00017,0.000189,0.000224,0.000143,0.000152,0.000157,3e-05,0.000111,0.000213,4.3e-05,0.00013,0.000101,3.8e-05,8.6e-05,9.9e-05,0.000171,5.5e-05,0.000203,0.000101,7.2e-05,0.000317,0.000227,4e-05,8.3e-05,0.000117,0.000149,0.000126,5.5e-05,5.7e-05,6.9e-05,0.000196,6.2e-05,1.5e-05,3.9e-05,0.000123,7.3e-05,0.00015,0.000243,2.5e-05,0.00014,0.000121,0.00019,0.000129,6.6e-05,0.000142,0.000205,5.3e-05,0.00013,4.7e-05,0.000107,0.000123,7.4e-05,0.000141,7.1e-05,3.5e-05,0.000157,0.000299,0.000175,2.6e-05,0.000109,0.000175,5.1e-05,0.000152,0.000109,0.000147,0.000131,0.000101,0.000131,6e-05,7.9e-05,5.9e-05,0.000116,3.2e-05,7.3e-05,5.3e-05,0.000136,7.4e-05,7.6e-05,5.6e-05,3.6e-05,6.4e-05,4.7e-05,5.1e-05,7.4e-05,4.9e-05,6e-05,7.1e-05,5.4e-05,0.000114,3.5e-05,6.6e-05,5.1e-05,1.1e-05,5.5e-05,6.1e-05,4e-05,1.8e-05,7.9e-05,9.1e-05,6.1e-05,7.5e-05,4.8e-05,5.7e-05,7.5e-05,1.1e-05,7.7e-05,5.2e-05,6.2e-05
5.8e-05,0.000131,0.000203,0.000297,0.000254,3.2e-05,0.000173,0.000294,0.000255,0.000136,0.000127,0.000127,7.7e-05,0.000102,0.000187,8.7e-05,0.000168,4.9e-05,0.000159,0.000208,0.000131,9.6e-05,0.000121,0.000117,0.000107,1.9e-05,0.000103,4.5e-05,0.000214,0.000183,9.9e-05,0.000147,0.000113,0.000176,0.00011,0.000119,3.9e-05,0.000172,0.000227,1.3e-05,4.6e-05,6.4e-05,1.3e-05,0.000202,0.000252,0.000133,8.4e-05,3.6e-05,0.000123,0.000256,0.000156,9.9e-05,0.000212,0.000231,9.5e-05,0.000176,0.000166,0.000219,3.1e-05,4.6e-05,0.00015,9.1e-05,6.3e-05,0.000122,0.000118,8.2e-05,0.000113,8e-05,0.000164,0.000182,0.000161,0.000155,7.5e-05,0.000177,0.000162,0.000201,0.000196,7.6e-05,0.00012,9e-05,3.7e-05,1.9e-05,0.000107,7e-05,8.4e-05,9.3e-05,2.1e-05,4.5e-05,4.4e-05,8.3e-05,0.000119,6.2e-05,9.3e-05,4.7e-05,2.2e-05,4e-05,8.8e-05,2.7e-05,6.5e-05,0.000113,4.9e-05,4.7e-05,3.6e-05,3.4e-05,2.8e-05,6.8e-05,4.5e-05,8.2e-05,8.7e-05,7.1e-05,3.5e-05,3.3e-05,3.8e-05,9.2e-05,5.9e-05,6.6e-05,1e-04,4.9e-05,2.5e-05,7.3e-05,5.2e-05
0.000115,8.1e-05,6.8e-05,0.000251,0.000138,0.000149,0.000106,0.000186,7.9e-05,6.5e-05,0.000181,0.000189,3.8e-05,5.7e-05,6.9e-05,0.000182,0.000107,0.000131,3e-05,0.000206,0.00014,0.000168,7.5e-05,3.3e-05,3.4e-05,7.5e-05,0.000117,0.000124,0.000104,2.3e-05,0.000111,3.3e-05,7.3e-05,9.5e-05,3.1e-05,0.000117,0.000143,0.000262,3.7e-05,0.000123,0.000145,5.6e-05,2.7e-05,0.000112,8.5e-05,6e-05,7.1e-05,1.5e-05,0.000129,7.9e-05,4.3e-05,9.3e-05,0.000192,0.000104,0.000112,5.3e-05,7e-05,0.000109,3.5e-05,6.8e-05,6.6e-05,2e-05,7.2e-05,7.4e-05,4.8e-05,6.2e-05,0.000118,5.5e-05,0.000161,9.3e-05,0.00014,9.7e-05,7.8e-05,0.000102,7.8e-05,0.000107,6.6e-05,4.6e-05,0.000102,0.000122,5.1e-05,5.7e-05,9.4e-05,4.7e-05,3.3e-05,7.7e-05,7.1e-05,5.7e-05,7.1e-05,8.9e-05,9.7e-05,7.7e-05,0.000116,0.000106,6.1e-05,5.9e-05,0.000165,0.00012,0.000152,0.000101,4.8e-05,4e-05,9.6e-05,5.4e-05,8.7e-05,4e-06,6.2e-05,5.1e-05,2.9e-05,9e-06,4.2e-05,5.6e-05,3e-05,4.6e-05,8e-05,5.6e-05,4.6e-05,2.7e-05,1.7e-05,3.8e-05,4.4e-05
0.000128,0.000117,9.1e-05,4e-05,3.9e-05,7.4e-05,0.000153,0.000177,0.000196,0.000199,0.000143,3.8e-05,9e-05,3.8e-05,3.3e-05,4.7e-05,6.8e-05,1.3e-05,7.3e-05,9.8e-05,6.1e-05,0.00011,9.4e-05,2e-05,3.6e-05,7.8e-05,0.000113,7.7e-05,0.000113,6e-05,5e-05,3.9e-05,6.6e-05,6e-05,3.4e-05,0.000114,0.000137,5.9e-05,3.9e-05,0.000132,0.000128,0.000104,5.7e-05,2.2e-05,8.5e-05,9.9e-05,9.4e-05,3.8e-05,0.000117,0.000103,8.9e-05,0.000127,5.7e-05,5.5e-05,1.9e-05,2.6e-05,0.000113,0.000105,3.1e-05,3.5e-05,6.4e-05,9e-05,4.4e-05,4.3e-05,8.9e-05,4.8e-05,5.6e-05,6.9e-05,0.000132,8e-05,8e-05,3.9e-05,3.4e-05,7.1e-05,7.4e-05,7.6e-05,9e-05,3.5e-05,1.7e-05,1.9e-05,5.7e-05,2.6e-05,5.5e-05,6.5e-05,7.5e-05,8.3e-05,4.1e-05,6.7e-05,2.3e-05,6.1e-05,3.2e-05,4.8e-05,7.6e-05,4.1e-05,6.3e-05,4.1e-05,0.000124,4.9e-05,6.4e-05,6.2e-05,3.7e-05,9.7e-05,2.3e-05,3.2e-05,6.9e-05,8.7e-05,1.6e-05,3.4e-05,2.6e-05,2.7e-05,3e-05,6.1e-05,3.1e-05,3.6e-05,4.8e-05,7.7e-05,9.7e-05,7.5e-05,4.4e-05,1.9e-05,3.1e-05
0.000119,6.1e-05,2.2e-05,6.9e-05,5.4e-05,5.8e-05,0.00018,1.4e-05,3.7e-05,6.5e-05,8.9e-05,0.000113,7.2e-05,6e-05,7.9e-05,3e-06,3.5e-05,4e-05,6.8e-05,0.000103,0.00012,2.9e-05,9e-05,0.000109,3e-05,3.2e-05,2.6e-05,6.5e-05,0.000131,2.2e-05,0.000116,5.9e-05,3.4e-05,6.1e-05,5.2e-05,7.2e-05,0.000147,0.000125,3.6e-05,6e-05,0.000122,0.000107,8.7e-05,3.5e-05,6.3e-05,5.4e-05,5.8e-05,1.1e-05,5.9e-05,5.3e-05,1e-04,0.000109,3.5e-05,5.7e-05,1.3e-05,4.5e-05,0.000137,7.9e-05,8.3e-05,5.7e-05,8.9e-05,0.000116,8.7e-05,8.3e-05,8.8e-05,7.1e-05,6.4e-05,3.7e-05,4.7e-05,7.5e-05,0.000104,4.8e-05,4.1e-05,6.3e-05,4.9e-05,0.00011,5.9e-05,5.6e-05,7.8e-05,4.4e-05,4.2e-05,6.3e-05,6.3e-05,9.6e-05,4.6e-05,4.5e-05,4.1e-05,9.7e-05,3.8e-05,8.3e-05,6.5e-05,4e-05,7e-06,2.6e-05,2.4e-05,2.9e-05,7.9e-05,2.2e-05,0.000116,5e-05,2.9e-05,1e-04,5e-05,5.3e-05,7.6e-05,5.4e-05,6.2e-05,3.8e-05,5e-05,8.9e-05,5.9e-05,5.2e-05,3.7e-05,1.8e-05,4.1e-05,5.9e-05,7.7e-05,2.6e-05,1.8e-05,2.3e-05,3.7e-05
6.3e-05,3.5e-05,1.6e-05,6.7e-05,9.9e-05,4e-05,6.6e-05,5.2e-05,6e-06,2.2e-05,2.8e-05,8.9e-05,0.00016,0.000116,3.2e-05,2.4e-05,4.7e-05,1.1e-05,3.3e-05,6.9e-05,5.2e-05,5.4e-05,3.2e-05,8.3e-05,7.4e-05,4e-05,9e-06,6.1e-05,8e-06,3.7e-05,6.7e-05,5.3e-05,5.8e-05,4.5e-05,5.9e-05,2.8e-05,7.1e-05,5.6e-05,4.5e-05,3e-06,5.5e-05,3.3e-05,3.6e-05,6.2e-05,2.7e-05,4.6e-05,3.6e-05,2.8e-05,3.7e-05,5.2e-05,8.4e-05,0.000107,5.7e-05,2.4e-05,2.5e-05,1.9e-05,2.2e-05,6.8e-05,2.5e-05,4.9e-05,9.8e-05,5e-05,3.8e-05,5.3e-05,3.5e-05,3.1e-05,1.1e-05,1.7e-05,4.4e-05,3.9e-05,7.9e-05,0.000115,7.6e-05,5.7e-05,1.4e-05,6.1e-05,5.6e-05,3.8e-05,1.3e-05,3.9e-05,3.8e-05,7.9e-05,2.2e-05,3.9e-05,5e-05,2.5e-05,2.5e-05,3e-05,5.3e-05,1.8e-05,3.2e-05,1.3e-05,3.6e-05,2.7e-05,2.7e-05,3.4e-05,3.4e-05,2.4e-05,8.6e-05,8.6e-05,3.7e-05,1e-05,2e-05,1.9e-05,4.5e-05,6.1e-05,1.8e-05,2.2e-05,4.8e-05,5.5e-05,3.9e-05,1.6e-05,4.2e-05,3.8e-05,3e-05,5.3e-05,6.7e-05,4.9e-05,3e-05,3.7e-05,5.3e-05
2.1e-05,7e-06,5.2e-05,3.2e-05,5.3e-05,4.8e-05,7.9e-05,7.2e-05,7.3e-05,6.6e-05,8.6e-05,7.9e-05,6.5e-05,1.8e-05,3.3e-05,3.8e-05,7.6e-05,9.4e-05,0.000112,4.6e-05,1.2e-05,2.3e-05,4.3e-05,4.8e-05,4e-05,1.2e-05,2.9e-05,4.1e-05,7e-05,8.1e-05,6.6e-05,9e-06,5.5e-05,3.9e-05,2.7e-05,3.6e-05,7.7e-05,1e-05,1.3e-05,3.2e-05,3.8e-05,2.8e-05,3.6e-05,7e-05,6.6e-05,7.5e-05,6.3e-05,3.8e-05,4.3e-05,5.6e-05,7.3e-05,9.3e-05,5.6e-05,5.9e-05,5e-05,2.3e-05,1.9e-05,1.8e-05,2.9e-05,5e-05,0.000103,7e-05,2.7e-05,2.8e-05,1.9e-05,1.2e-05,2.2e-05,3.9e-05,5.1e-05,2.8e-05,3.9e-05,7.7e-05,3.6e-05,3.3e-05,3.2e-05,5.3e-05,3.1e-05,2.3e-05,1.7e-05,2.6e-05,3.2e-05,5.3e-05,6.9e-05,6e-05,1.8e-05,1.6e-05,2.3e-05,5.8e-05,8.6e-05,7.8e-05,6.7e-05,5.4e-05,3.9e-05,1.5e-05,2.8e-05,3.5e-05,3.5e-05,6.4e-05,0.000121,9.8e-05,6.3e-05,6.2e-05,4.2e-05,1.2e-05,4.1e-05,5.3e-05,4.2e-05,1.9e-05,3.8e-05,1e-05,2.7e-05,3.8e-05,6.9e-05,4e-05,1e-05,2.6e-05,5.7e-05,6.2e-05,4.7e-05,5.9e-05,4e-05
1.9e-05,2.8e-05,4.8e-05,1.8e-05,3.5e-05,1.9e-05,2e-05,1.4e-05,3.6e-05,2.9e-05,4e-05,2.7e-05,9e-06,1.1e-05,1.8e-05,2.9e-05,1.8e-05,5.7e-05,3.8e-05,5e-06,1.4e-05,1.4e-05,2.2e-05,3.5e-05,2.6e-05,2.6e-05,1.6e-05,4.3e-05,5.8e-05,2.4e-05,1.6e-05,2.3e-05,3.8e-05,2e-05,1.5e-05,2e-05,2.9e-05,1.8e-05,1.2e-05,1.2e-05,1.3e-05,1.8e-05,2.4e-05,2.6e-05,2.3e-05,2.7e-05,1.7e-05,1.8e-05,1e-05,1.1e-05,4e-05,1.6e-05,2.9e-05,3e-05,2e-06,2.9e-05,2.6e-05,1e-05,9e-06,4.2e-05,1.9e-05,1.1e-05,6e-06,1.6e-05,1.9e-05,2.2e-05,1.8e-05,2.6e-05,1e-05,2.7e-05,3.2e-05,3.3e-05,2e-05,1.6e-05,1.8e-05,1.2e-05,1.1e-05,1.2e-05,1.2e-05,1.2e-05,2.2e-05,2.3e-05,2.7e-05,1.2e-05,7e-06,1.4e-05,1.7e-05,3.5e-05,2.8e-05,2.1e-05,2.5e-05,2.9e-05,1.7e-05,1.4e-05,2e-05,3.3e-05,8e-06,3.3e-05,3.4e-05,2.5e-05,2.1e-05,3.5e-05,1e-06,8e-06,2.3e-05,2.3e-05,1.7e-05,1.6e-05,1.8e-05,1.3e-05,1.3e-05,1.1e-05,2e-05,8e-06,9e-06,9e-06,2.5e-05,1e-05,9e-06,2.5e-05,1.6e-05
2e-05,1.4e-05,4.5e-05,2.2e-05,1.2e-05,2e-05,9e-06,1.1e-05,3.4e-05,1.8e-05,1.5e-05,2.7e-05,5.4e-05,2.5e-05,1e-05,2.9e-05,8e-06,4.8e-05,4.4e-05,3e-06,1.2e-05,1e-05,1.8e-05,3.8e-05,1.5e-05,2e-05,3.3e-05,4.9e-05,1.5e-05,3.9e-05,1.2e-05,2.4e-05,4.5e-05,2.5e-05,4e-06,1.6e-05,2.7e-05,9e-06,1e-05,1.2e-05,1.9e-05,2e-06,1.6e-05,1.6e-05,2.8e-05,2.5e-05,1.8e-05,9e-06,1.4e-05,2.6e-05,1.3e-05,2.7e-05,2.1e-05,1.1e-05,1.9e-05,2.1e-05,2.8e-05,9e-06,2.4e-05,2.7e-05,2.1e-05,9e-06,1.6e-05,1.8e-05,1.7e-05,2.2e-05,9e-06,1e-05,1e-05,2.6e-05,2.5e-05,2.2e-05,8e-06,1.4e-05,1.4e-05,1.8e-05,1.2e-05,1.3e-05,8e-06,1e-05,3e-05,2.5e-05,7e-06,5e-06,1.1e-05,2e-05,1e-05,2e-05,2.8e-05,1.5e-05,2.4e-05,1.6e-05,1.4e-05,6e-06,3e-06,1.6e-05,7e-06,1.2e-05,2.8e-05,3.4e-05,1.3e-05,1.6e-05,4e-06,5e-06,7e-06,6e-06,1.7e-05,1.7e-05,1.2e-05,1e-05,9e-06,4e-06,6e-06,1.2e-05,7e-06,2.2e-05,1.1e-05,1.2e-05,6e-06,7e-06,5e-06
1.2e-05,2.2e-05,2.6e-05,1.9e-05,1.6e-05,7e-06,2e-05,9e-06,2.2e-05,3.1e-05,3.3e-05,3.2e-05,2.6e-05,1.2e-05,1.1e-05,3.1e-05,8e-06,1.7e-05,2.3e-05,7e-06,1.2e-05,1.5e-05,2.6e-05,8e-06,1.3e-05,6e-06,2.3e-05,4e-06,5e-06,1.6e-05,8e-06,1.6e-05,2.9e-05,6e-06,1e-05,5e-06,2.7e-05,4e-06,1.1e-05,1.1e-05,8e-06,1.6e-05,1.6e-05,1e-05,5e-06,1.3e-05,1.5e-05,3e-06,2.3e-05,2.3e-05,1.8e-05,2.8e-05,1.8e-05,7e-06,8e-06,5e-06,2.8e-05,8e-06,2.8e-05,2e-05,2.3e-05,1.8e-05,7e-06,5e-06,1.1e-05,1.6e-05,2.2e-05,2.4e-05,1.3e-05,6e-06,8e-06,5e-06,1.8e-05,9e-06,0,1e-05,1.1e-05,8e-06,9e-06,1.4e-05,2.1e-05,1.3e-05,9e-06,3e-06,1.4e-05,2.4e-05,6e-06,1.3e-05,1.4e-05,1.1e-05,1.5e-05,1e-05,8e-06,4e-06,1.4e-05,1.5e-05,6e-06,1.4e-05,1.6e-05,2e-05,2.6e-05,1.7e-05,6e-06,3e-06,1.8e-05,2.1e-05,6e-06,8e-06,1.4e-05,2e-06,4e-06,9e-06,1.1e-05,1e-05,4e-06,1.7e-05,9e-06,1.6e-05,1.4e-05,8e-06,8e-06
1.7e-05,6e-06,1.4e-05,9e-06,2.6e-05,7e-06,1.5e-05,8e-06,1.3e-05,3.4e-05,1.8e-05,3.4e-05,2.1e-05,1.1e-05,7e-06,1.3e-05,4e-06,1.8e-05,2.9e-05,1e-06,1.4e-05,8e-06,9e-06,1.8e-05,8e-06,3e-06,1.2e-05,9e-06,1.1e-05,8e-06,3e-06,1.2e-05,1.6e-05,6e-06,6e-06,1e-06,2.3e-05,4e-06,8e-06,4e-06,1.2e-05,1.5e-05,4e-06,6e-06,9e-06,9e-06,2e-05,8e-06,1.3e-05,6e-06,7e-06,1.8e-05,1.2e-05,8e-06,5e-06,1.1e-05,2e-05,1e-05,1.9e-05,1.7e-05,1.1e-05,1.8e-05,1.2e-05,8e-06,1.1e-05,8e-06,1.2e-05,1.6e-05,8e-06,4e-06,7e-06,6e-06,3e-06,7e-06,5e-06,1.2e-05,4e-06,1.1e-05,7e-06,6e-06,1.3e-05,6e-06,1e-06,1.1e-05,6e-06,9e-06,8e-06,6e-06,1.1e-05,3e-06,1.8e-05,5e-06,1e-06,4e-06,8e-06,1.7e-05,3e-06,8e-06,2e-05,1.1e-05,6e-06,1.7e-05,4e-06,4e-06,2.1e-05,7e-06,4e-06,1e-05,1.4e-05,1e-06,1e-05,7e-06,9e-06,3e-06,1e-05,1.2e-05,6e-06,1.1e-05,4e-06,1.4e-05,5e-06
1.3e-05,1.9e-05,1.6e-05,9e-06,2.3e-05,1.8e-05,1.8e-05,1e-05,1.8e-05,1.6e-05,1.7e-05,2.9e-05,1.6e-05,1.8e-05,1.3e-05,1.7e-05,4e-06,2.5e-05,3.8e-05,1e-05,1e-05,2e-06,7e-06,1.3e-05,1e-05,9e-06,4e-06,1.3e-05,9e-06,1e-05,7e-06,1.2e-05,1.5e-05,6e-06,6e-06,3e-06,2e-05,8e-06,6e-06,6e-06,6e-06,1.9e-05,7e-06,4e-06,5e-06,3e-06,1.1e-05,7e-06,1e-05,6e-06,5e-06,2.2e-05,7e-06,9e-06,2e-06,1.2e-05,3e-05,6e-06,1.4e-05,9e-06,1e-05,7e-06,6e-06,1.1e-05,1.5e-05,1.1e-05,7e-06,1.3e-05,4e-06,3e-06,5e-06,9e-06,9e-06,5e-06,6e-06,1.2e-05,3e-06,1.3e-05,5e-06,8e-06,2e-05,1.1e-05,1.1e-05,3e-06,1e-06,6e-06,9e-06,6e-06,7e-06,7e-06,2e-05,4e-06,8e-06,2e-06,8e-06,1.3e-05,5e-06,6e-06,1.5e-05,5e-06,1e-05,1.3e-05,2e-06,1e-06,1.6e-05,1.2e-05,6e-06,7e-06,1.3e-05,5e-06,7e-06,6e-06,7e-06,2e-06,6e-06,1.1e-05,1.1e-05,6e-06,3e-06,1.2e-05,4e-06
1.2e-05,1.1e-05,5e-06,2e-06,1.7e-05,1e-05,1.3e-05,1e-05,1.7e-05,2.4e-05,1.6e-05,2.1e-05,2.2e-05,1.3e-05,9e-06,1.3e-05,5e-06,2.3e-05,2.9e-05,5e-06,1.1e-05,7e-06,7e-06,6e-06,2e-06,1.3e-05,8e-06,1.4e-05,1e-05,8e-06,9e-06,1.3e-05,1.3e-05,9e-06,8e-06,5e-06,2.3e-05,1e-05,1.5e-05,5e-06,6e-06,1.4e-05,5e-06,6e-06,5e-06,1.1e-05,1.6e-05,1.2e-05,7e-06,8e-06,1e-05,2.3e-05,9e-06,9e-06,7e-06,7e-06,2.1e-05,2e-06,1e-05,1.2e-05,1e-05,1e-05,7e-06,1.2e-05,1.1e-05,6e-06,5e-06,1.2e-05,3e-06,5e-06,1e-06,9e-06,3e-06,4e-06,2e-06,1e-05,5e-06,1.3e-05,5e-06,1.1e-05,1.6e-05,7e-06,1.1e-05,2e-06,4e-06,3e-06,4e-06,1.1e-05,7e-06,6e-06,1.7e-05,6e-06,5e-06,2e-06,9e-06,1.4e-05,6e-06,1e-06,1.5e-05,2e-06,1e-05,1.3e-05,4e-06,1e-06,1.6e-05,1.2e-05,1e-05,8e-06,1.2e-05,5e-06,6e-06,4e-06,5e-06,2e-06,8e-06,1e-05,1.2e-05,7e-06,5e-06,1.3e-05,5e-06
9e-06,9e-06,7e-06,1.2e-05,2e-05,4e-06,1.4e-05,1.1e-05,1e-05,2.7e-05,1.8e-05,1.8e-05,2.3e-05,1.1e-05,1.4e-05,2e-05,8e-06,2.4e-05,2.7e-05,4e-06,7e-06,5e-06,3e-06,9e-06,3e-06,1.1e-05,4e-06,1.1e-05,1.4e-05,1e-05,1.1e-05,7e-06,9e-06,7e-06,7e-06,8e-06,2e-05,7e-06,1e-05,8e-06,3e-06,1.6e-05,4e-06,9e-06,1.3e-05,1.1e-05,1.1e-05,1.1e-05,1.5e-05,1.3e-05,7e-06,1.6e-05,8e-06,8e-06,4e-06,3e-06,1.7e-05,4e-06,9e-06,1.2e-05,1.1e-05,1.4e-05,8e-06,5e-06,9e-06,6e-06,5e-06,1.3e-05,3e-06,9e-06,1e-06,3e-06,5e-06,3e-06,4e-06,1.2e-05,1e-05,1.3e-05,7e-06,3e-06,1.3e-05,5e-06,9e-06,2e-06,3e-06,9e-06,6e-06,7e-06,8e-06,7e-06,1.5e-05,5e-06,4e-06,3e-06,7e-06,1.3e-05,7e-06,1e-06,1.1e-05,2e-06,1.2e-05,1.4e-05,6e-06,2e-06,1.5e-05,1.1e-05,8e-06,9e-06,1.1e-05,2e-06,6e-06,6e-06,6e-06,5e-06,6e-06,9e-06,1e-05,1.1e-05,2e-06,1.4e-05,7e-06
3e-06,1.2e-05,1e-05,1.4e-05,9e-06,2e-06,1.4e-05,1.8e-05,1.5e-05,1.6e-05,2.5e-05,3e-05,2.1e-05,2e-06,1e-06,1.4e-05,1e-05,1.8e-05,2.6e-05,8e-06,6e-06,4e-06,2e-06,1.2e-05,5e-06,7e-06,7e-06,1.3e-05,2e-05,3e-06,3e-06,1e-05,9e-06,8e-06,1.3e-05,5e-06,1.6e-05,8e-06,1e-05,5e-06,4e-06,2.7e-05,1.3e-05,2e-06,8e-06,1.6e-05,1e-05,1.1e-05,1.6e-05,1.2e-05,1.1e-05,2.9e-05,2e-06,9e-06,2.1e-05,8e-06,2.8e-05,9e-06,2e-06,1.3e-05,5e-06,1.6e-05,6e-06,9e-06,6e-06,8e-06,1e-05,2.1e-05,7e-06,1.3e-05,7e-06,4e-06,9e-06,3e-06,9e-06,1.4e-05,4e-06,8e-06,2e-06,9e-06,1.5e-05,1.1e-05,1.5e-05,5e-06,3e-06,1.5e-05,1.6e-05,8e-06,1e-06,9e-06,1.7e-05,4e-06,3e-06,3e-06,1.2e-05,1.3e-05,7e-06,4e-06,1.6e-05,6e-06,9e-06,1e-05,8e-06,1e-05,1.6e-05,1.2e-05,9e-06,6e-06,8e-06,5e-06,6e-06,7e-06,2e-06,4e-06,1.3e-05,9e-06,6e-06,6e-06,5e-06,1.6e-05,7e-06
2e-06,1.7e-05,7e-06,1.3e-05,1.7e-05,1.8e-05,8e-06,1.3e-05,1.7e-05,4.9e-05,2.4e-05,6e-06,2.6e-05,2.1e-05,1e-05,2.5e-05,2.2e-05,3.2e-05,2.4e-05,5e-06,2.1e-05,1.3e-05,1.4e-05,8e-06,1.2e-05,1e-05,5e-06,1e-05,1.4e-05,1e-05,1.6e-05,1.8e-05,2.1e-05,1.6e-05,1.6e-05,3e-06,2.4e-05,4e-06,1e-05,7e-06,8e-06,3.2e-05,1.6e-05,1.6e-05,1.2e-05,1.3e-05,2.2e-05,5e-06,3.2e-05,1.4e-05,9e-06,3.2e-05,1.7e-05,1.3e-05,1.3e-05,1.1e-05,3.2e-05,6e-06,4e-06,3e-06,1.1e-05,1.6e-05,1.5e-05,6e-06,1.7e-05,1.1e-05,9e-06,1e-05,3e-06,1e-05,9e-06,6e-06,1.2e-05,1.4e-05,2e-06,1.6e-05,9e-06,1.2e-05,4e-06,6e-06,3.3e-05,1.6e-05,1.3e-05,1.1e-05,8e-06,1.3e-05,1.7e-05,1.5e-05,6e-06,1.5e-05,1.4e-05,1e-05,7e-06,5e-06,5e-06,1.7e-05,1.5e-05,1.4e-05,2.1e-05,4e-06,1.3e-05,1.7e-05,7e-06,1.2e-05,6e-06,4e-06,3e-06,1e-05,7e-06,6e-06,1.3e-05,6e-06,5e-06,3e-06,1.1e-05,1.4e-05,1.3e-05,3e-06,9e-06,1.3e-05,1.4e-05
1.5e-05,9e-06,1.5e-05,1.5e-05,1.6e-05,8e-06,9e-06,9e-06,2.6e-05,1e-05,2.6e-05,3.2e-05,4.5e-05,3e-06,3e-06,1.8e-05,1.5e-05,7e-06,2.9e-05,8e-06,2.2e-05,1.8e-05,8e-06,1e-06,8e-06,6e-06,1.4e-05,2.3e-05,1.6e-05,1.5e-05,1.2e-05,1.3e-05,3.7e-05,6e-06,1.8e-05,1.2e-05,1.3e-05,1.5e-05,1.6e-05,1.5e-05,2e-05,2.2e-05,1.1e-05,1.4e-05,4e-06,1e-05,1.8e-05,9e-06,2.8e-05,2.4e-05,2.7e-05,3.4e-05,2.6e-05,1.8e-05,1.5e-05,1.6e-05,1.5e-05,1e-05,5e-06,1.2e-05,1.1e-05,1.6e-05,2.5e-05,1.9e-05,1.5e-05,1.1e-05,7e-06,3e-06,1.3e-05,3e-06,8e-06,8e-06,1e-05,7e-06,9e-06,2.2e-05,9e-06,6e-06,4e-06,1e-06,2.4e-05,1.2e-05,1.8e-05,2.2e-05,1.1e-05,1.1e-05,1.2e-05,1e-05,6e-06,8e-06,2.2e-05,1e-05,3e-06,2e-06,3e-06,1e-05,9e-06,1e-05,1.7e-05,1.2e-05,1.7e-05,2.2e-05,1.1e-05,1.3e-05,2.1e-05,1.2e-05,2e-05,1.6e-05,9e-06,8e-06,1.2e-05,1.4e-05,9e-06,1e-05,3e-06,6e-06,1.2e-05,1.6e-05,7e-06,9e-06,1.7e-05
1.6e-05,2.6e-05,1.9e-05,5e-06,2.4e-05,4e-06,9e-06,1.5e-05,2.1e-05,1.5e-05,2.3e-05,3.3e-05,1.1e-05,1.6e-05,2e-06,2.3e-05,5e-06,1.4e-05,2.5e-05,3e-06,1.7e-05,9e-06,1.1e-05,5e-06,2e-06,8e-06,8e-06,1.6e-05,1.1e-05,2e-06,7e-06,3e-06,1.4e-05,1.5e-05,7e-06,9e-06,1e-05,1.1e-05,8e-06,1.5e-05,2e-06,5e-06,5e-06,8e-06,9e-06,4e-06,9e-06,1e-06,1.5e-05,1.3e-05,7e-06,2.9e-05,1.5e-05,5e-06,5e-06,7e-06,2.3e-05,6e-06,8e-06,9e-06,5e-06,1.3e-05,4e-06,6e-06,8e-06,2e-06,4e-06,1.5e-05,4e-06,8e-06,7e-06,2e-06,2e-06,7e-06,6e-06,1.4e-05,1e-06,1e-05,5e-06,5e-06,1.4e-05,4e-06,2e-06,1e-05,5e-06,9e-06,1e-05,4e-06,1e-05,7e-06,1.3e-05,3e-06,7e-06,4e-06,5e-06,9e-06,6e-06,2e-06,2e-05,1.2e-05,5e-06,2.1e-05,1.3e-05,3e-06,1.3e-05,8e-06,1e-05,7e-06,5e-06,7e-06,2e-06,9e-06,3e-06,1e-05,7e-06,7e-06,8e-06,8e-06,8e-06,5e-06,5e-06
8e-06,1.4e-05,1.6e-05,4e-06,2e-05,4e-06,8e-06,1.2e-05,2.4e-05,1.8e-05,2.1e-05,2.6e-05,2.3e-05,1.4e-05,8e-06,1.7e-05,1e-05,1.5e-05,2.2e-05,5e-06,1.4e-05,1e-06,4e-06,5e-06,2e-06,6e-06,4e-06,1.1e-05,1.1e-05,2e-06,9e-06,4e-06,5e-06,3e-06,2e-06,1e-06,1.4e-05,1e-06,7e-06,1.1e-05,6e-06,8e-06,5e-06,3e-06,9e-06,0,9e-06,2e-06,9e-06,4e-06,4e-06,2.5e-05,3e-06,2e-06,3e-06,1e-06,2.1e-05,5e-06,9e-06,6e-06,6e-06,5e-06,9e-06,1e-05,4e-06,5e-06,1e-05,1.2e-05,8e-06,6e-06,4e-06,3e-06,5e-06,5e-06,3e-06,1.1e-05,4e-06,1.4e-05,9e-06,2e-06,1.3e-05,3e-06,8e-06,5e-06,2e-06,1.1e-05,5e-06,7e-06,2e-06,2e-06,1.5e-05,3e-06,7e-06,6e-06,8e-06,1.3e-05,3e-06,2e-06,1.8e-05,6e-06,4e-06,1.6e-05,6e-06,5e-06,1.1e-05,7e-06,5e-06,1e-05,4e-06,3e-06,4e-06,8e-06,4e-06,6e-06,2e-06,4e-06,4e-06,5e-06,3e-06,8e-06,5e-06
1e-05,1e-05,9e-06,3e-06,1.9e-05,8e-06,1.1e-05,1e-05,2e-05,2.1e-05,2.4e-05,2.7e-05,1.3e-05,7e-06,0,1.1e-05,3e-06,1.3e-05,1.9e-05,3e-06,1.1e-05,8e-06,1e-05,2e-06,3e-06,9e-06,6e-06,9e-06,7e-06,6e-06,9e-06,2e-06,1.2e-05,4e-06,3e-06,3e-06,8e-06,1e-05,5e-06,3e-06,1e-05,5e-06,5e-06,7e-06,7e-06,3e-06,1e-05,0,3e-06,6e-06,4e-06,2.2e-05,8e-06,5e-06,2e-06,2e-06,1.7e-05,6e-06,5e-06,1e-05,6e-06,3e-06,1e-06,6e-06,7e-06,6e-06,7e-06,1.2e-05,4e-06,3e-06,2e-06,2e-06,3e-06,1e-06,2e-06,1e-05,1e-05,8e-06,4e-06,3e-06,1.2e-05,4e-06,7e-06,4e-06,4e-06,8e-06,9e-06,7e-06,8e-06,2e-06,1.5e-05,5e-06,6e-06,2e-06,3e-06,1e-05,3e-06,3e-06,1.4e-05,4e-06,6e-06,1.3e-05,1e-06,2e-06,1.1e-05,8e-06,5e-06,6e-06,7e-06,3e-06,5e-06,8e-06,5e-06,4e-06,2e-06,6e-06,4e-06,4e-06,5e-06,7e-06,6e-06
7e-06,1e-05,1.1e-05,6e-06,1.5e-05,7e-06,8e-06,6e-06,1.4e-05,1.2e-05,1.5e-05,2e-05,1.3e-05,6e-06,6e-06,1.5e-05,6e-06,1.5e-05,1.9e-05,3e-06,2e-06,5e-06,3e-06,4e-06,5e-06,6e-06,3e-06,1e-05,8e-06,2e-06,6e-06,1e-06,1.1e-05,7e-06,2e-06,3e-06,1.1e-05,4e-06,4e-06,3e-06,1e-05,1.1e-05,5e-06,5e-06,8e-06,0,1.4e-05,6e-06,6e-06,7e-06,4e-06,1.6e-05,1e-05,5e-06,5e-06,2e-06,1.7e-05,6e-06,5e-06,5e-06,6e-06,4e-06,6e-06,7e-06,3e-06,5e-06,6e-06,1.4e-05,8e-06,3e-06,4e-06,2e-06,1e-06,4e-06,3e-06,1.4e-05,7e-06,1.1e-05,4e-06,2e-06,1.3e-05,5e-06,2e-06,2e-06,3e-06,9e-06,8e-06,1e-06,8e-06,2e-06,1.6e-05,1e-06,3e-06,1e-06,6e-06,1.3e-05,3e-06,2e-06,1.4e-05,1e-06,5e-06,1.6e-05,2e-06,2e-06,9e-06,8e-06,4e-06,8e-06,7e-06,2e-06,4e-06,2e-06,4e-06,5e-06,3e-06,5e-06,6e-06,4e-06,5e-06,9e-06,6e-06
9e-06,8e-06,1.2e-05,3e-06,1.7e-05,2e-06,9e-06,3e-06,1.8e-05,1.4e-05,1.4e-05,1.8e-05,1.4e-05,9e-06,4e-06,1.1e-05,4e-06,1.2e-05,2e-05,3e-06,7e-06,3e-06,3e-06,6e-06,5e-06,4e-06,3e-06,9e-06,8e-06,3e-06,4e-06,2e-06,8e-06,7e-06,3e-06,4e-06,1.3e-05,4e-06,8e-06,1e-06,1e-06,7e-06,4e-06,1e-06,8e-06,3e-06,1.2e-05,4e-06,2e-06,8e-06,7e-06,1.8e-05,6e-06,2e-06,3e-06,1e-06,1.8e-05,8e-06,1.1e-05,5e-06,4e-06,6e-06,2e-06,7e-06,4e-06,7e-06,5e-06,1.3e-05,5e-06,3e-06,2e-06,3e-06,3e-06,5e-06,2e-06,1e-05,2e-06,9e-06,3e-06,1e-06,1.2e-05,1e-06,4e-06,3e-06,1e-06,7e-06,5e-06,5e-06,5e-06,6e-06,1e-05,5e-06,6e-06,3e-06,9e-06,1.2e-05,2e-06,2e-06,1.3e-05,3e-06,5e-06,1.6e-05,5e-06,5e-06,1.1e-05,6e-06,7e-06,5e-06,8e-06,3e-06,2e-06,7e-06,5e-06,4e-06,4e-06,6e-06,4e-06,4e-06,5e-06,9e-06,5e-06
6e-06,8e-06,8e-06,3e-06,1.6e-05,3e-06,9e-06,2e-06,1.5e-05,1.5e-05,1.7e-05,1.9e-05,1.6e-05,9e-06,6e-06,1.1e-05,3e-06,1.5e-05,1.8e-05,1e-06,5e-06,1e-06,5e-06,4e-06,4e-06,2e-06,2e-06,8e-06,9e-06,4e-06,7e-06,1e-06,1e-05,5e-06,4e-06,2e-06,1.2e-05,6e-06,7e-06,2e-06,4e-06,8e-06,3e-06,1e-06,7e-06,2e-06,8e-06,4e-06,2e-06,7e-06,2e-06,2.4e-05,7e-06,2e-06,2e-06,1e-06,1.6e-05,5e-06,1.1e-05,5e-06,4e-06,7e-06,6e-06,7e-06,5e-06,7e-06,7e-06,1.1e-05,5e-06,3e-06,3e-06,1e-06,1e-06,4e-06,2e-06,1.2e-05,2e-06,8e-06,5e-06,1e-06,1e-05,3e-06,3e-06,2e-06,1e-06,8e-06,6e-06,4e-06,3e-06,3e-06,1.2e-05,3e-06,6e-06,3e-06,5e-06,1.1e-05,2e-06,3e-06,1.1e-05,0,5e-06,1.2e-05,3e-06,1e-06,1.1e-05,7e-06,8e-06,6e-06,7e-06,2e-06,1e-06,8e-06,3e-06,3e-06,4e-06,6e-06,3e-06,2e-06,5e-06,8e-06,4e-06
8e-06,1e-05,8e-06,2e-06,1.7e-05,4e-06,1e-05,5e-06,1.3e-05,1.4e-05,1.6e-05,1.8e-05,1.6e-05,1e-05,5e-06,1e-05,2e-06,1.1e-05,1.9e-05,3e-06,5e-06,1e-06,5e-06,4e-06,3e-06,4e-06,1e-06,8e-06,9e-06,3e-06,6e-06,1e-06,1e-05,4e-06,3e-06,2e-06,1.3e-05,5e-06,7e-06,2e-06,4e-06,1e-05,0,3e-06,3e-06,3e-06,1.1e-05,3e-06,3e-06,5e-06,2e-06,2e-05,3e-06,2e-06,1e-06,1e-06,1.6e-05,6e-06,7e-06,5e-06,4e-06,7e-06,3e-06,5e-06,6e-06,3e-06,5e-06,1e-05,5e-06,2e-06,0,2e-06,2e-06,2e-06,2e-06,1.2e-05,4e-06,8e-06,4e-06,1e-06,1.1e-05,1e-06,4e-06,2e-06,1e-06,7e-06,6e-06,2e-06,6e-06,3e-06,1.2e-05,3e-06,5e-06,2e-06,7e-06,1.1e-05,4e-06,1e-06,1.3e-05,3e-06,4e-06,1.4e-05,2e-06,2e-06,9e-06,6e-06,6e-06,6e-06,7e-06,1e-06,2e-06,6e-06,3e-06,4e-06,3e-06,5e-06,3e-06,5e-06,4e-06,8e-06,5e-06
7e-06,1e-05,8e-06,2e-06,1.6e-05,3e-06,1.2e-05,4e-06,1.7e-05,1.3e-05,1.4e-05,1.9e-05,1.5e-05,9e-06,6e-06,1e-05,1e-06,1.3e-05,2.1e-05,2e-06,6e-06,0,5e-06,3e-06,3e-06,4e-06,2e-06,1e-05,8e-06,4e-06,5e-06,0,9e-06,4e-06,5e-06,3e-06,1.3e-05,4e-06,6e-06,1e-06,3e-06,8e-06,2e-06,3e-06,5e-06,3e-06,1e-05,4e-06,2e-06,5e-06,2e-06,1.9e-05,3e-06,2e-06,2e-06,1e-06,1.6e-05,7e-06,8e-06,4e-06,4e-06,6e-06,4e-06,6e-06,5e-06,4e-06,6e-06,8e-06,3e-06,1e-06,1e-06,1e-06,1e-06,2e-06,1e-06,1.2e-05,4e-06,8e-06,4e-06,1e-06,1.2e-05,3e-06,4e-06,2e-06,1e-06,7e-06,6e-06,2e-06,5e-06,3e-06,1.3e-05,4e-06,6e-06,2e-06,7e-06,1e-05,3e-06,0,1.2e-05,3e-06,5e-06,1.3e-05,3e-06,1e-06,9e-06,8e-06,7e-06,6e-06,7e-06,1e-06,1e-06,7e-06,3e-06,3e-06,4e-06,6e-06,3e-06,4e-06,4e-06,7e-06,5e-06
