9e-06,5e-06,2e-06,6e-06,6e-06,3e-06,1.1e-05,1e-06,1e-06,2.1e-05,1.3e-05,2.8e-05,4e-06,2.2e-05,5e-06,6e-06,1.6e-05,5e-06,2.7e-05,1.2e-05,4.2e-05,4.1e-05,6.1e-05,4.2e-05,0.000159,2.6e-05,2.8e-05,0.000273,0.000175,0.000674,0.000392,6.3e-05,0.000183,4e-05,2.3e-05,0.000738,0.00015,0.000287,0.000245,0.000129,0.000375,4.2e-05,0.000898,3.9e-05,0.000469,4.4e-05,0.000632,0.000451,0.000355,9.5e-05,0.00041,8.1e-05,8.6e-05,0.000249,0.000548,0.000368,0.000647,0.000493,0.000552,0.000123,0.000446,0.00018,3.9e-05,0.000534,0.000174,0.000136,2e-06,0.000126,1e-06,0.000117,9e-05,0.000152,0.000105,4e-06,1.5e-05,1.7e-05,6.9e-05,4.5e-05,0.000132,8.4e-05,6.1e-05,4.8e-05,3e-05,8.1e-05,3.3e-05,1e-06,2.7e-05,3.5e-05,6.8e-05,4.2e-05,0.00032,0.000117,6.8e-05,4.7e-05,0.000456,0.000294,6.8e-05,3.1e-05,1e-04,1.2e-05,5.6e-05,2.9e-05,2.1e-05,4e-05,9e-06,6.5e-05,1.4e-05,2.1e-05,2.4e-05,5e-06,2.7e-05,9e-06,7e-06,1.2e-05,1e-05,2.9e-05,7e-06,1.3e-05,2.4e-05,2.8e-05,2.4e-05
2.2e-05,1.6e-05,4.1e-05,3.2e-05,6e-06,1e-05,2.6e-05,2e-05,1.6e-05,3.7e-05,6.7e-05,3.1e-05,4.7e-05,7.2e-05,6.8e-05,2.9e-05,6.2e-05,4.1e-05,7.2e-05,0.000109,7e-05,9.7e-05,8.6e-05,0.000161,0.000488,0.000274,0.000126,0.000517,0.000844,0.00234,0.001388,0.00159,0.001291,0.001044,0.000749,0.002207,0.000556,0.000936,6.8e-05,0.000396,0.002057,0.001594,0.002226,0.001104,0.000993,0.000547,0.000935,0.000401,0.000601,0.00107,0.001103,0.000386,0.000635,0.00052,0.001195,0.001209,0.001202,0.001068,0.000882,0.000113,0.001634,0.000691,0.000274,0.000777,0.000228,0.000515,0.000329,0.000187,0.000172,0.000392,0.000375,0.000113,0.000235,0.000221,8.8e-05,4.6e-05,0.000155,4.3e-05,0.000218,0.00032,0.000402,0.000306,0.000196,4.1e-05,0.000158,0.000257,0.000231,0.000136,0.000123,3.3e-05,0.000595,6e-04,0.000184,0.000339,0.001026,0.001198,0.000681,0.000292,3.2e-05,0.000131,0.000127,0.000153,0.000122,0.00011,0.000127,8e-05,0.000117,9.7e-05,9.2e-05,8.6e-05,6.8e-05,8e-05,7.6e-05,6.9e-05,8.4e-05,0.000125,5.3e-05,3.8e-05,1.3e-05,0.000115,7.7e-05
3.4e-05,3.3e-05,2.6e-05,2.2e-05,4.6e-05,1.9e-05,1.1e-05,1.5e-05,3.6e-05,1.3e-05,5e-05,6e-05,6e-06,6.4e-05,3e-06,8e-06,8.3e-05,5.1e-05,0.000134,0.000228,0.000173,0.000247,3.1e-05,2e-04,0.000748,0.000318,0.000193,0.000461,0.000362,0.003297,0.002257,0.001519,0.000793,0.000202,0.001174,0.002772,0.00079,0.000894,0.001308,0.00031,0.002025,0.000896,0.003048,0.001999,0.000961,0.000234,0.00037,0.001553,0.001393,9.1e-05,0.001102,0.000983,0.000753,0.000722,0.00235,0.000512,0.002185,0.000652,0.001678,0.001018,0.000922,0.000794,0.001085,0.001304,0.000794,1.7e-05,0.000605,0.00072,0.000468,0.000313,0.000457,0.000108,9e-05,0.000278,0.000233,0.000157,0.000156,8.6e-05,0.000198,0.000375,0.000291,2.5e-05,0.000115,0.000139,0.000139,0.000321,0.000262,8.2e-05,8.1e-05,0.000103,0.000568,0.001592,0.000716,0.000535,0.001034,0.000269,0.000178,0.000186,5.1e-05,6.7e-05,2.4e-05,5e-05,5.8e-05,1.5e-05,7.2e-05,8.2e-05,8.3e-05,2e-05,2e-05,2.9e-05,3.4e-05,3.1e-05,6.3e-05,3.2e-05,5.7e-05,6.7e-05,4.4e-05,2.2e-05,3.2e-05,0.000125,4.3e-05
4.3e-05,9e-06,3.1e-05,5.1e-05,7.8e-05,8.6e-05,6.7e-05,3.4e-05,9e-06,1.9e-05,4.1e-05,6.4e-05,9e-05,5e-05,4.1e-05,3.4e-05,7.3e-05,5.1e-05,7.2e-05,0.000113,6.3e-05,0.000231,0.000567,0.000305,0.000492,0.001195,0.000984,0.000604,0.000332,0.003802,0.003564,0.001049,0.002176,0.001164,0.002587,0.002554,0.001385,0.000477,0.001229,0.002327,0.001379,0.002298,0.000922,0.001359,0.000138,0.000978,0.001584,0.002044,0.000345,0.001822,0.000433,0.000883,0.000358,0.000892,0.001896,0.001079,0.000952,0.001468,0.00262,0.001586,0.000647,0.000521,0.000726,0.000537,0.000947,0.000552,0.000696,0.000186,0.000553,0.000804,0.000829,0.000742,0.000321,0.000145,2.8e-05,0.00016,0.000181,0.000171,0.00032,0.000399,0.000207,0.000223,0.000147,0.000166,0.000107,0.000669,0.000251,0.000121,9.9e-05,0.000308,0.000832,0.001767,0.001623,0.001193,0.001233,0.00137,0.000785,3e-04,0.000103,8.3e-05,8e-05,5e-05,4.1e-05,1.4e-05,3.8e-05,5.2e-05,3.6e-05,5.3e-05,4.3e-05,5.5e-05,4.2e-05,5.8e-05,6.2e-05,6.4e-05,2.6e-05,6.2e-05,9.3e-05,4.7e-05,6.9e-05,9.5e-05,4.2e-05
2.3e-05,2.3e-05,1.1e-05,4.6e-05,2.7e-05,3.9e-05,1.4e-05,2e-05,3.3e-05,3.5e-05,1.5e-05,2.6e-05,4.7e-05,2.9e-05,2.9e-05,2.3e-05,6e-06,3.3e-05,0.000168,9.4e-05,3.4e-05,0.000151,0.000576,0.000287,0.00052,0.000892,0.000375,0.000351,0.000259,0.003912,0.006009,0.004175,0.003314,0.003372,0.004828,0.006416,0.00258,0.000942,0.000566,0.002763,0.004296,0.00536,0.004556,0.000484,0.000881,0.001833,0.00162,0.00062,0.000625,0.002501,0.001269,0.001075,0.001578,0.000726,0.001444,0.000367,0.001234,0.000577,0.001705,0.000951,0.001679,0.001044,0.000857,0.001525,0.001141,0.001229,0.000462,0.000608,0.000695,0.000613,0.000122,0.000541,0.000198,0.000232,8.9e-05,0.000108,0.000311,8.6e-05,0.00028,0.000371,0.000215,0.000123,8.8e-05,0.000202,0.000305,0.001089,0.000439,0.000193,0.000182,0.000385,0.000553,0.000995,0.001637,0.000643,0.000861,0.000795,0.000328,9.7e-05,6.6e-05,0.000147,4.8e-05,4.8e-05,3.1e-05,5.9e-05,2.2e-05,3e-05,5e-05,2.8e-05,1.6e-05,4.3e-05,2e-05,1.9e-05,3.8e-05,8.8e-05,3.4e-05,2.8e-05,2.3e-05,2.1e-05,4.1e-05,9.7e-05,2.6e-05
1.8e-05,3.1e-05,3.6e-05,2.6e-05,1.9e-05,2.2e-05,2.5e-05,1e-06,3.5e-05,1.4e-05,2e-05,6e-06,3.5e-05,3.3e-05,2.4e-05,1.3e-05,3.7e-05,2.2e-05,0.000456,0.000261,6.9e-05,1e-04,0.00056,0.000582,0.000351,0.000973,0.000435,0.000733,0.000243,0.003425,0.007219,0.003453,0.001945,0.002411,0.003469,0.004328,0.001451,0.001384,0.001439,0.004324,0.006207,0.003152,0.001448,0.002705,0.000702,0.00263,0.001258,0.002473,0.001141,0.001052,0.001987,0.002103,0.002257,0.00244,0.002621,0.001109,0.00085,0.002571,0.001728,0.00229,0.001686,0.000358,0.000975,0.002049,0.001382,0.001966,0.000991,0.000365,0.00103,0.000882,0.00015,0.000362,0.000166,6.4e-05,0.000135,3.2e-05,2e-04,0.00018,0.000157,0.000444,0.000249,0.000268,0.00016,9.4e-05,0.000258,0.000778,0.000252,0.000109,0.000123,0.000237,0.00037,0.000767,0.000789,0.000383,0.000471,0.000343,0.000111,0.000106,0.000106,0.000151,0.000214,0.000102,4.7e-05,8.5e-05,6.3e-05,1.9e-05,5e-05,2.9e-05,4.1e-05,7.4e-05,2.5e-05,1.7e-05,4.2e-05,5.1e-05,7.3e-05,6e-05,1.9e-05,1.4e-05,9.4e-05,0.00021,1e-04
3.8e-05,5.1e-05,3.8e-05,2.5e-05,2e-05,3.2e-05,2.4e-05,3.2e-05,1.9e-05,2e-05,1.2e-05,4e-06,8e-06,5e-05,2.2e-05,2.3e-05,3.5e-05,4.4e-05,0.000567,0.000313,0.000297,0.000153,0.000339,0.000719,0.000811,0.000395,0.000474,0.000553,0.001073,0.001344,0.00947,0.003948,0.006026,0.000604,0.003947,0.00453,0.005277,0.005168,0.003358,0.004186,0.009705,0.009048,0.003232,0.001696,0.001546,0.003882,0.002763,0.003718,0.003074,0.003014,0.001656,0.002844,0.001328,0.00367,0.00633,0.002965,0.00102,0.004701,0.008136,0.003799,0.003202,0.002267,0.003051,0.000737,0.002371,0.001302,0.000677,0.000866,0.000569,0.000399,0.000686,0.000694,0.000267,3.8e-05,0.000196,2e-04,0.000148,0.000108,0.000219,0.000344,0.000433,0.000152,0.000147,0.00012,0.000485,0.000524,0.000787,0.000334,0.000187,0.00022,0.001018,0.001227,0.000702,0.000622,0.001925,0.000993,0.000501,0.000288,7.5e-05,4.5e-05,9.8e-05,0.000123,6.6e-05,6.9e-05,6e-05,5.2e-05,5.4e-05,3.5e-05,3.2e-05,4.7e-05,2.8e-05,3.7e-05,3.5e-05,6.6e-05,9.9e-05,8.2e-05,0.000143,6.9e-05,0.000179,0.000241,0.000104
3.1e-05,1.2e-05,4e-05,4.4e-05,5.6e-05,4.1e-05,2.5e-05,5.1e-05,4.2e-05,2.8e-05,3.3e-05,2.4e-05,1.8e-05,5.3e-05,5.2e-05,5e-05,4.5e-05,3.1e-05,0.000433,0.000213,0.000296,0.000144,0.000317,0.000528,0.000578,0.000492,0.000515,0.000866,0.000237,0.000471,0.007136,0.005597,0.008982,0.007842,0.008215,0.00911,0.006575,0.002277,0.001571,0.003452,0.005205,0.008831,0.006129,0.003309,0.001758,0.004193,0.002306,0.00286,0.002932,0.002291,0.003559,0.007058,0.006599,0.004438,0.003039,0.005063,0.003098,0.005817,0.011898,0.012244,0.006377,0.001999,0.003113,0.00295,0.004,0.003205,0.002771,0.002607,0.001268,0.000692,0.000721,0.000414,0.000289,0.000397,0.000205,0.000343,0.000289,9.9e-05,2e-05,0.000209,0.000422,0.000371,9.8e-05,0.000272,0.000499,0.000437,0.000953,0.00055,1.5e-05,0.000215,0.001593,0.000575,0.000912,0.000433,0.002935,0.002719,0.001112,0.000103,0.000227,0.000151,5e-05,5.4e-05,2.6e-05,6.5e-05,6.8e-05,8e-06,3.5e-05,4.9e-05,3.7e-05,2.8e-05,7e-06,1.9e-05,1.8e-05,9.1e-05,9.5e-05,8.4e-05,0.00013,0.000152,0.000303,0.000569,0.000379
1.4e-05,6e-06,5.4e-05,5.8e-05,1e-05,1.4e-05,1.1e-05,4.3e-05,4.8e-05,2.2e-05,3.2e-05,3e-05,2.6e-05,3e-05,1.4e-05,2.2e-05,2.1e-05,1.3e-05,0.000194,0.000111,0.000246,0.000211,0.000322,0.00012,0.000973,0.000268,0.000309,0.000285,0.000457,0.00069,0.005727,0.00194,0.005237,0.006567,0.006169,0.001816,0.001278,0.000289,0.000526,0.001834,0.006129,0.001039,0.002723,0.001734,0.000573,0.002849,0.004855,0.002467,0.00136,0.003457,0.003894,0.002029,0.00319,0.001954,0.004768,0.004195,0.00301,0.003379,0.008695,0.006779,0.003004,0.001342,0.001394,0.000347,0.002008,0.001295,0.001273,0.001401,0.000544,0.000503,0.000178,0.000476,0.000313,9.1e-05,0.000185,0.000351,0.000185,0.000166,0.000185,0.000281,0.00033,8.8e-05,9.9e-05,0.000257,0.000447,7.1e-05,0.000681,0.000388,0.000236,0.000187,0.001682,0.001315,0.000253,0.000233,0.003045,0.002303,0.00109,0.000234,0.000111,8.9e-05,7.2e-05,7.7e-05,4.2e-05,5.6e-05,2.5e-05,1.7e-05,2.8e-05,3.3e-05,2.2e-05,9e-06,1.2e-05,1.2e-05,4.8e-05,7.4e-05,0.00016,0.00016,0.000156,5.5e-05,0.000136,0.000395,0.000356
1.9e-05,3.3e-05,1.6e-05,1.4e-05,2.2e-05,1.3e-05,2e-06,3.5e-05,4e-06,1e-05,2.9e-05,5e-06,2.8e-05,9e-06,2.5e-05,8e-06,2.1e-05,2.1e-05,9.4e-05,4.9e-05,0.00013,4.2e-05,0.00011,0.000329,0.000698,0.001164,0.000446,0.000357,0.000369,0.000825,0.004463,0.003102,0.00157,0.003798,0.001318,0.00283,0.003796,0.001632,0.000424,0.000827,0.002596,0.002474,0.001402,0.000148,0.000415,0.000936,0.003307,0.000561,0.000859,0.000643,0.001586,0.002593,0.000957,0.001317,0.002206,0.000908,0.001068,0.000954,0.00748,0.001585,0.000861,0.000494,0.000427,0.000824,0.000841,0.000724,0.000689,0.000348,0.000261,0.000187,0.000181,0.000219,7.1e-05,0.000103,0.000119,4e-05,7.7e-05,5.6e-05,0.000111,0.000365,0.000104,8.1e-05,0.000102,0.000214,0.000293,0.000601,0.00051,0.000245,9.7e-05,0.000104,0.001189,7e-04,0.000452,0.000115,0.00299,0.0013,0.000679,0.000227,5.4e-05,7e-05,4.9e-05,3e-05,2.5e-05,2.7e-05,2.3e-05,1e-05,3e-05,1.3e-05,2.5e-05,3.3e-05,1.7e-05,2.3e-05,4e-05,8.1e-05,0.00015,0.000186,0.000135,0.000137,0.000172,4.8e-05,1e-04
1e-05,1.4e-05,1.1e-05,1.1e-05,1.4e-05,6e-06,4e-06,1e-05,5e-06,5e-06,1.3e-05,1.1e-05,2.5e-05,4e-06,1.7e-05,2.3e-05,1.2e-05,1.8e-05,0.000142,6.9e-05,7.5e-05,9.4e-05,0.000353,0.000532,0.000297,0.000888,0.000524,0.000398,0.000361,0.000865,0.002275,0.001203,0.000737,0.003131,0.000664,0.001832,0.001936,0.000896,0.000746,0.001671,0.00213,0.002037,0.001578,0.001652,0.000468,0.000699,0.002478,0.001114,0.00122,0.000792,0.000905,0.001315,0.001219,0.000574,0.000985,0.000455,0.000786,0.001044,0.002996,0.002303,0.001135,9.8e-05,0.000763,0.000486,0.000807,0.000605,0.000423,0.000327,8.5e-05,0.000217,0.000154,0.000223,0.000135,5.7e-05,5.4e-05,8.3e-05,0.000134,0.000103,0.000177,0.000404,5.3e-05,3.3e-05,5.5e-05,0.000253,0.000128,0.000567,0.000693,0.000261,8.2e-05,4e-05,0.000653,0.00073,0.000879,0.000404,0.002704,0.001844,0.000801,0.000405,0.000152,1e-04,7.3e-05,1e-05,1.5e-05,1e-05,4e-06,8e-06,1.8e-05,1.1e-05,1.3e-05,1.1e-05,1.3e-05,1.9e-05,3e-05,6.9e-05,5.3e-05,4.6e-05,7.1e-05,3.5e-05,9.7e-05,0.000155,5.7e-05
1.1e-05,9e-06,1.8e-05,1.1e-05,1.5e-05,5e-06,7e-06,1.9e-05,2e-06,1.2e-05,8e-06,3e-06,2.7e-05,1.9e-05,1.6e-05,2.2e-05,3.8e-05,2.2e-05,0.000112,9e-05,3.5e-05,0.000111,0.00022,0.000393,0.000519,0.00068,0.000412,0.000275,0.000365,0.000685,0.001095,0.000887,0.00149,0.000241,0.00203,0.001004,0.001175,0.000568,0.001825,0.001266,0.000874,0.002327,0.000911,0.000815,0.00117,0.001533,0.002103,0.000727,0.002628,0.000561,0.00046,0.000492,0.001719,0.001296,0.001439,0.001173,0.001051,0.000995,0.000873,0.001978,0.00146,0.000811,0.000378,0.00024,0.000325,0.000321,0.000289,0.000369,8e-05,0.000315,0.000144,0.000192,6e-05,6.1e-05,5.8e-05,4.1e-05,0.000197,0.000107,0.000169,0.000433,7.7e-05,4.6e-05,7.5e-05,0.000239,0.00024,2e-04,0.000386,0.000272,9.4e-05,5.5e-05,0.000461,0.00078,0.001059,0.000497,0.00242,0.002233,0.001192,0.000606,0.00022,5.9e-05,2.7e-05,1.9e-05,2.4e-05,2.3e-05,2.8e-05,1e-05,1.3e-05,2.2e-05,1.9e-05,1.9e-05,1.5e-05,2.4e-05,3.5e-05,9e-06,8e-06,4.5e-05,5.1e-05,1.3e-05,7.3e-05,0.000171,0.000155
1.2e-05,1.6e-05,6e-06,6e-06,4e-06,9e-06,6e-06,1.7e-05,1.4e-05,9e-06,6e-06,7e-06,1.6e-05,1.5e-05,1.3e-05,2e-05,3.1e-05,3.2e-05,0.000111,6.1e-05,7.9e-05,0.000125,0.00038,7.6e-05,0.000374,0.000354,0.000221,0.000247,0.000479,0.002074,0.001273,0.003201,0.00418,0.001909,0.002342,0.001044,0.002213,0.000229,0.002332,0.002705,0.001515,0.00146,5.1e-05,0.001112,0.000474,0.001861,0.002248,0.003413,0.002361,0.000287,0.00051,0.002181,0.002412,0.002255,0.000878,0.001972,0.001312,0.001645,0.002392,0.001896,0.000678,0.001708,0.000628,0.001277,0.000513,0.000684,0.000423,0.000468,0.000139,0.000384,6.4e-05,0.000359,3.3e-05,5.7e-05,0.000101,8.4e-05,0.000235,0.000154,0.000156,0.000553,0.000103,6.3e-05,0.000134,0.000122,0.000114,0.00023,0.000262,0.000106,2.3e-05,3.4e-05,0.000347,0.000951,0.000601,0.000346,0.002113,0.001096,0.000465,0.000153,5.1e-05,3.6e-05,3.9e-05,4.2e-05,2.7e-05,2.6e-05,5e-06,8e-06,1.1e-05,3.1e-05,1.1e-05,1.6e-05,1.2e-05,1.2e-05,4e-06,1.1e-05,6e-05,0.000104,2.4e-05,6.9e-05,0.000112,9.7e-05,4.8e-05
3e-06,1.8e-05,1.1e-05,7e-06,8e-06,8e-06,1.7e-05,1.4e-05,7e-06,1.1e-05,1.3e-05,1.3e-05,1.6e-05,1e-05,1.5e-05,2.3e-05,2.6e-05,1.2e-05,0.00012,0.000103,4.8e-05,0.000175,0.00052,0.000107,0.000375,0.000368,0.000278,0.000289,0.000339,0.003218,0.003398,0.001572,0.002568,0.000543,0.001837,0.002259,0.001377,0.001408,0.000203,0.002247,0.002428,0.003028,0.003584,0.000866,0.000565,0.002649,0.000325,0.001815,0.001275,0.002048,0.001627,0.001722,0.003929,0.003669,0.002754,0.002085,0.002036,0.0024,0.004011,0.002519,0.000533,0.001575,0.001525,0.001003,0.000618,0.000536,0.000668,0.000258,0.000573,0.000601,0.00021,0.000419,0.00013,7.5e-05,5.4e-05,0.000163,0.000232,0.000435,0.000165,0.000581,0.00018,3.7e-05,0.00012,0.000147,0.000327,0.000667,0.000353,7.7e-05,8.5e-05,1.5e-05,0.000212,0.000826,0.000454,0.000226,0.001783,0.000466,0.000344,0.000324,0.000177,4.9e-05,2.1e-05,2.5e-05,3.8e-05,2e-05,2.5e-05,1.8e-05,1.4e-05,2.5e-05,1.2e-05,1.8e-05,1.7e-05,7e-06,1.4e-05,2.4e-05,0.000112,6.5e-05,0.000102,2.3e-05,0.000105,0.000103,5.4e-05
1.1e-05,1.8e-05,1.4e-05,9e-06,1.6e-05,1.7e-05,2.1e-05,1.1e-05,1.7e-05,5e-06,1e-05,1e-05,3.8e-05,3.2e-05,2.6e-05,1.3e-05,3.1e-05,3.4e-05,4.5e-05,0.000152,0.000208,0.000256,0.000562,0.000304,0.000409,0.000309,0.000222,0.000321,0.000165,0.003777,0.003947,0.00145,0.005852,0.002076,0.005024,0.005913,0.005613,0.004128,0.002697,0.003825,0.00195,0.002706,0.008453,0.003308,0.000165,0.003778,0.001223,0.002037,0.004373,0.002997,0.006143,0.004028,0.003759,0.002454,0.000339,0.002596,0.002145,0.001487,0.001708,0.000843,0.004125,0.001937,0.001891,0.000899,0.001664,0.001417,0.000809,0.001824,7.1e-05,0.000555,0.000381,0.000885,0.000419,0.000372,0.000227,0.000433,2.6e-05,0.000417,0.00061,0.001458,0.00021,0.000208,0.000314,0.000153,0.000235,0.000882,0.000408,0.000193,8.1e-05,0.00015,0.00019,0.000766,0.000299,0.000309,0.001542,0.000925,0.000524,0.000272,6.3e-05,4.2e-05,9e-05,8e-06,3.5e-05,4e-05,1.5e-05,8e-06,1.4e-05,1.6e-05,7e-06,1.7e-05,2.1e-05,2.5e-05,1.1e-05,3.2e-05,0.000165,7.2e-05,6.1e-05,3.1e-05,0.000111,8e-06,2.4e-05
3e-06,1.2e-05,1.5e-05,1.2e-05,7e-06,7e-06,6e-06,3e-06,1.1e-05,1.2e-05,1.1e-05,2e-05,1.8e-05,2.7e-05,4.2e-05,3.5e-05,2.8e-05,7e-06,7.8e-05,0.000101,7.6e-05,0.000113,0.000297,0.000283,0.000242,0.00017,0.000329,0.000245,0.000487,0.003856,0.002267,0.004435,0.008424,0.009791,0.011124,0.00298,0.008232,0.002901,0.007142,0.004036,0.000247,0.00471,0.009384,0.009564,0.003967,0.005032,0.003209,0.005166,0.0031,0.00231,0.006665,0.004895,0.004977,0.007155,0.003954,0.007414,0.005414,0.003558,0.003551,0.001998,0.007752,0.003523,0.004935,0.004212,0.003378,0.001345,0.002605,0.003323,0.001779,0.001634,0.001488,0.000768,0.000807,0.000365,0.000231,0.000333,0.000499,0.000114,0.000549,0.002982,0.001753,0.00103,6.7e-05,0.000301,0.000148,0.001261,0.000895,0.000423,0.000171,0.000183,0.000121,0.000333,0.000682,6.1e-05,0.00176,0.001432,0.000689,0.000365,0.000161,7.3e-05,4.1e-05,4.5e-05,6e-06,2.1e-05,5.3e-05,4.7e-05,2.7e-05,2.8e-05,4.5e-05,2e-06,1.6e-05,2.2e-05,4e-06,3.6e-05,0.000137,9.3e-05,8.6e-05,5.1e-05,0.000113,0.000139,0.000114
1.7e-05,7e-06,5e-06,1.2e-05,9e-06,4e-06,5e-06,1e-05,3e-06,1e-05,1.2e-05,4e-06,1.6e-05,3e-06,1.4e-05,1.8e-05,6e-06,1e-05,0.000156,0.000103,6.2e-05,9.6e-05,0.000216,0.000131,0.000337,0.00022,0.000142,0.000308,0.000399,0.003968,0.006395,0.010448,0.007963,0.005383,0.004299,0.005627,0.005223,0.010326,0.012125,0.008321,0.000649,0.004151,0.002336,0.007582,0.010251,0.006478,0.007893,0.008942,0.009336,0.00708,0.003675,0.010373,0.011391,0.007343,0.00551,0.008972,0.011074,0.007626,0.000811,0.004027,0.008071,0.004826,0.008033,0.003597,0.005362,0.004236,0.003655,0.00559,0.005082,0.002733,0.00201,0.002362,0.001541,0.000812,0.000566,0.000641,0.000396,0.000641,0.000297,0.00266,0.003152,0.001459,0.000169,0.000544,0.000445,0.00117,0.000822,0.000342,0.00012,6.2e-05,0.000105,0.00065,0.000997,0.000769,0.002188,0.001417,0.000433,0.000341,0.000135,0.000117,8e-05,5.3e-05,9e-06,3.7e-05,5.6e-05,5.4e-05,3.6e-05,5.7e-05,2.1e-05,4.5e-05,2.3e-05,1.3e-05,2.4e-05,6e-05,9.3e-05,4.2e-05,6.2e-05,4e-05,5.1e-05,0.000105,5.9e-05
2.1e-05,9e-06,6e-06,1.3e-05,1.1e-05,1e-05,3e-06,1.1e-05,9e-06,6e-06,1e-05,1.1e-05,3e-06,8e-06,1.2e-05,4.3e-05,8e-06,1.3e-05,0.000189,0.000196,0.000271,0.000283,0.000221,0.000401,0.000506,0.000306,0.000277,0.000287,0.000124,0.003709,0.003696,0.005162,0.002553,0.003515,0.005386,0.005349,0.005322,0.006145,0.002503,0.006124,0.00596,0.003158,0.002168,0.006565,0.010291,0.008519,0.009062,0.002694,0.004607,0.004999,0.004649,0.007063,0.001756,0.004559,0.004012,0.005688,0.00381,0.001004,0.001268,0.004418,0.002765,0.002634,0.004907,0.008881,0.001793,0.00191,0.000878,0.004391,0.002103,0.000498,0.000317,0.00057,5e-04,0.000206,0.000764,0.000456,0.000129,0.000562,0.00033,0.001666,0.002098,0.001009,0.000606,0.000249,0.000302,0.001229,0.000846,0.000385,0.000212,0.000285,0.000142,0.00057,0.000549,0.000314,0.002639,0.001027,0.000337,0.00037,0.000161,0.000148,5.6e-05,6.8e-05,7.1e-05,8.9e-05,3.1e-05,4.2e-05,2.5e-05,4.2e-05,3.4e-05,3.1e-05,2.2e-05,1.6e-05,1.2e-05,4.4e-05,5.6e-05,5.1e-05,2.5e-05,1.8e-05,2e-05,9.4e-05,8.9e-05
8e-06,1.8e-05,1.5e-05,1e-05,1.2e-05,1.4e-05,1.1e-05,1.3e-05,8e-06,1.2e-05,1.2e-05,1e-05,1.4e-05,1.4e-05,1.3e-05,4.2e-05,3.5e-05,2.2e-05,0.000204,4.7e-05,0.000206,0.000168,0.000199,0.000494,0.000178,0.000189,0.000368,5e-04,0.000579,0.002494,0.00374,0.000795,0.002243,0.002591,0.001914,0.003574,0.002708,0.004374,0.004211,0.001776,0.003538,0.005242,0.002805,0.003683,0.001897,0.004751,0.004849,0.00631,0.002874,0.002541,0.003119,0.001886,0.00189,0.004619,0.00179,0.003026,0.001647,0.003464,0.003186,0.003787,0.003129,0.002696,0.002749,0.003274,0.005861,0.003953,0.000852,0.002408,0.001487,0.001002,0.000953,0.000466,0.00067,0.000531,0.00043,0.000276,0.000333,0.000632,0.000312,0.000933,0.000826,0.000732,0.000571,0.000517,0.000185,0.000701,0.000194,0.000137,0.00037,0.000448,0.000575,0.000218,0.00066,0.00016,0.002286,0.001007,0.00067,0.000642,0.000337,0.000141,0.000119,0.000132,4.8e-05,5.5e-05,3.7e-05,2.7e-05,4e-06,2.5e-05,3.8e-05,4.3e-05,2.9e-05,9e-06,1.1e-05,2.3e-05,4.6e-05,5.3e-05,2.8e-05,2.2e-05,8.9e-05,0.00018,0.000114
1.4e-05,6e-06,7e-06,5e-06,1e-05,1e-05,7e-06,3e-06,1e-06,8e-06,1e-05,5e-06,2e-06,2.3e-05,4e-06,3.1e-05,2.6e-05,3.1e-05,0.000201,0.000212,0.000124,0.000325,0.000346,0.00073,0.000457,0.000221,0.000228,0.000236,0.000504,0.001679,0.004127,0.003212,0.003071,0.003026,0.002242,0.004848,0.001233,0.00088,0.001485,0.00263,0.005676,0.004569,0.002285,0.000453,0.001441,0.003773,0.001135,0.002342,0.001291,0.000573,0.00191,0.000713,0.00295,0.004367,0.002652,0.001933,0.000571,0.002831,0.004308,0.002253,0.003638,0.003464,0.002851,0.001331,0.004508,0.003068,0.002092,0.001469,0.001216,0.001653,0.001381,0.000846,0.000253,0.000219,0.000505,0.000272,0.000268,0.000254,0.000184,0.000805,0.000408,0.000653,0.000177,0.000122,0.000259,0.000543,0.000533,0.00018,0.000216,0.000121,0.000328,0.000468,0.000582,0.00052,0.00155,0.001169,0.000869,0.000538,0.000275,0.000128,6.5e-05,5.2e-05,3.3e-05,9e-06,1.5e-05,2.3e-05,1.4e-05,9e-06,1.4e-05,2e-05,3.4e-05,2.2e-05,1.2e-05,1.4e-05,3.1e-05,1.5e-05,2.4e-05,2.8e-05,7.6e-05,1e-04,1e-04
1.5e-05,1.3e-05,9e-06,3e-06,1.1e-05,1.5e-05,5e-06,2e-06,4e-06,8e-06,4e-06,6e-06,8e-06,1.8e-05,1.5e-05,1.1e-05,3e-06,3.6e-05,0.000108,7.2e-05,5.7e-05,0.000226,0.000177,0.000548,0.000442,0.000302,0.00036,0.000456,0.00018,0.001436,0.002071,0.00063,0.001964,0.002156,0.002089,0.001478,0.002037,0.002126,0.001545,0.003731,0.003317,0.002414,0.001033,0.002166,0.001653,0.003114,0.001984,0.002065,0.001141,0.001112,0.00014,0.001556,0.00211,0.000971,0.002519,0.000314,0.001024,0.001869,0.000885,0.000738,0.001457,0.001092,0.000572,0.001581,0.001961,0.000104,0.00067,0.000726,0.000548,0.000505,0.000199,0.000411,0.000238,0.000191,0.000218,0.000138,0.000227,0.000148,9.2e-05,0.000624,0.000368,0.000123,0.000144,0.000229,0.000183,0.000474,0.000562,0.000274,8.2e-05,3e-05,0.000216,0.000352,0.000587,0.000314,0.000983,0.00089,0.000369,0.000262,4.4e-05,2.3e-05,4.9e-05,5.3e-05,2.5e-05,1.3e-05,1.9e-05,1.2e-05,1.4e-05,7e-06,8e-06,2.2e-05,1.4e-05,6e-06,9e-06,1.6e-05,1.6e-05,3.4e-05,4.9e-05,1.2e-05,5e-05,4.6e-05,3e-05
5e-06,2e-06,2e-06,5e-06,5e-06,8e-06,7e-06,3e-06,4e-06,2e-06,3e-06,7e-06,4e-06,2e-06,1.1e-05,1.4e-05,6e-06,3e-05,4e-05,4.8e-05,6.5e-05,0.000184,0.000303,0.000456,0.000125,3.9e-05,0.00013,0.000373,0.000283,0.000985,0.001332,0.000747,0.000856,0.001576,0.000577,0.000661,0.001425,0.000615,0.000948,0.002799,0.002553,0.002271,0.001136,0.001656,0.001693,0.001949,0.000387,0.001005,0.000766,0.00174,0.001502,0.001715,0.001625,0.002202,0.000345,0.000751,0.000915,0.001576,0.001578,0.000184,0.000594,3.2e-05,0.000528,0.001108,0.001027,0.000528,0.000503,0.000213,0.000288,0.000281,9.2e-05,7.8e-05,0.000198,8e-05,0.000176,0.000136,0.00014,0.000146,7.3e-05,0.000279,4.2e-05,9.4e-05,5.7e-05,0.000173,0.000191,0.000595,0.000401,0.000201,0.000157,9.8e-05,0.000175,0.000146,0.000608,0.000275,0.000625,0.000157,4e-05,8.2e-05,9.9e-05,6.2e-05,2.8e-05,2.5e-05,1e-05,1.6e-05,1e-05,7e-06,1e-05,1.4e-05,2e-06,1.1e-05,8e-06,3e-06,6e-06,1e-05,1.2e-05,1.4e-05,3e-05,1.3e-05,3.9e-05,2.8e-05,2.7e-05
2e-06,3e-06,0,1e-06,2e-06,2e-06,2e-06,1e-06,2e-06,3e-06,1e-06,4e-06,3e-06,3e-06,6e-06,1e-06,3e-06,9e-06,3.3e-05,1.4e-05,3.2e-05,6.2e-05,0.000121,0.000163,0.000154,6.5e-05,2.5e-05,0.000126,4.9e-05,0.000231,0.000343,0.000993,0.000557,0.001269,0.001018,0.000888,0.000474,0.000472,0.000414,0.000433,0.000434,0.000637,0.000358,0.000427,0.000477,0.000385,0.000565,0.000529,0.000272,0.000191,0.000309,0.000448,0.000312,0.00069,0.000366,0.000393,0.000283,0.000549,0.000683,0.000427,0.00045,0.000411,0.000323,0.000214,0.000333,0.000226,0.000155,0.000109,4.2e-05,0.000151,9e-05,5.6e-05,1.7e-05,3.3e-05,2.1e-05,4.6e-05,3e-05,3.5e-05,5.7e-05,0.000116,5.2e-05,3.5e-05,1.3e-05,6.5e-05,5.1e-05,0.00022,4.4e-05,2.2e-05,6e-05,1.8e-05,7.9e-05,7.9e-05,0.000129,7.5e-05,0.000191,6.7e-05,4.2e-05,4.7e-05,3.3e-05,1.7e-05,7e-06,1.7e-05,5e-06,4e-06,0,6e-06,7e-06,1e-06,2e-06,6e-06,7e-06,6e-06,4e-06,3e-06,8e-06,7e-06,1.2e-05,5e-06,2.4e-05,8e-06,1.1e-05
4e-06,2e-06,1e-06,2e-06,2e-06,3e-06,1e-06,2e-06,2e-06,3e-06,2e-06,2e-06,1e-06,5e-06,2e-06,3e-06,4e-06,8e-06,2.8e-05,2.7e-05,1.7e-05,2.8e-05,0.000117,0.000112,8.6e-05,5.3e-05,4.9e-05,9.8e-05,0.000129,0.000145,0.000276,0.000716,0.000102,0.001224,0.000391,0.000258,0.000419,0.000183,0.000604,0.000302,0.000678,0.00052,0.000738,0.000814,0.000251,9.8e-05,0.000119,0.000561,0.000123,0.000348,0.000453,0.000203,0.000313,0.000388,0.000184,0.000447,0.000448,0.000623,0.000206,0.000262,0.000252,0.000248,0.000355,0.000373,0.000327,2.1e-05,4.5e-05,0.000146,8.8e-05,8e-05,0.000101,5.8e-05,4e-05,4e-05,1.4e-05,3.3e-05,3.8e-05,2.4e-05,3.3e-05,0.000104,2.6e-05,1.2e-05,1.5e-05,1e-05,1.7e-05,0.000158,3.9e-05,1.7e-05,3e-06,1.2e-05,5.9e-05,0.000141,1.5e-05,1.3e-05,0.000149,5e-05,5.7e-05,4.2e-05,2e-05,2e-06,5e-06,7e-06,4e-06,7e-06,8e-06,4e-06,2e-06,5e-06,1e-06,8e-06,3e-06,3e-06,4e-06,5e-06,8e-06,3e-06,6e-06,5e-06,2.5e-05,1.4e-05,5e-06
2e-06,3e-06,2e-06,2e-06,1e-06,1e-06,2e-06,2e-06,1e-06,4e-06,1e-06,3e-06,3e-06,2e-06,4e-06,7e-06,6e-06,8e-06,8e-06,2.2e-05,1.7e-05,7.1e-05,0.000163,4.2e-05,7.6e-05,0.000145,6e-06,5.1e-05,0.000105,0.000325,0.000738,0.001006,7.5e-05,0.000427,0.00102,0.000173,0.000232,0.000284,0.00023,0.000876,0.000702,0.000354,0.000797,0.00021,0.000212,0.000143,0.000421,8.9e-05,0.000289,0.000354,0.00044,0.000176,3.6e-05,0.00081,0.000467,0.000109,6.4e-05,0.000472,0.00026,0.00027,0.000239,0.000145,0.000334,0.00014,0.000233,0.000162,0.000106,0.000113,7.4e-05,8.9e-05,5.5e-05,2.4e-05,2.1e-05,4.7e-05,3e-05,2.6e-05,3.8e-05,1.2e-05,3.4e-05,7.6e-05,3.5e-05,3.3e-05,3.4e-05,2.7e-05,3.3e-05,9.6e-05,4e-05,2.7e-05,1.5e-05,2.5e-05,5.2e-05,0.00013,4.5e-05,3.1e-05,0.000157,4.6e-05,7.6e-05,3.9e-05,1.8e-05,1.6e-05,5e-06,5e-06,2e-06,6e-06,8e-06,7e-06,2e-06,3e-06,3e-06,8e-06,8e-06,5e-06,3e-06,1e-06,8e-06,6e-06,7e-06,4e-06,2.2e-05,8e-06,1e-05
2e-06,1e-06,2e-06,1e-06,1e-06,1e-06,1e-06,1e-06,2e-06,1e-06,3e-06,3e-06,2e-06,2e-06,4e-06,4e-06,4e-06,1.1e-05,1.6e-05,1.1e-05,1.7e-05,7e-05,6.6e-05,4.4e-05,5.8e-05,0.000175,6e-05,4.4e-05,9.5e-05,0.000416,0.000792,0.000316,0.000361,9.1e-05,0.000341,0.000282,0.000342,0.000371,0.000309,0.000505,0.000322,8.1e-05,0.000422,0.000347,0.000363,0.00018,0.000556,0.000373,0.000243,0.000297,0.00048,0.000492,0.000701,0.000458,0.000257,0.000324,0.000209,0.000541,0.000331,0.000426,0.000125,0.000232,0.000229,0.000271,0.000128,0.000102,5.1e-05,0.000136,5.7e-05,5.6e-05,2.8e-05,5.5e-05,3e-05,4.5e-05,2.4e-05,3e-05,2.9e-05,1.1e-05,1.4e-05,7.2e-05,1.4e-05,1.5e-05,3.2e-05,7e-06,3.6e-05,7.5e-05,4.3e-05,1.4e-05,1.8e-05,1e-06,4e-05,0.000162,5.3e-05,6.2e-05,0.000198,7.5e-05,6.8e-05,2.5e-05,2.7e-05,8e-06,7e-06,1.5e-05,8e-06,8e-06,8e-06,3e-06,2e-06,1e-06,2e-06,9e-06,5e-06,2e-06,3e-06,2e-06,6e-06,0,4e-06,9e-06,2.4e-05,8e-06,7e-06
3e-06,1e-06,1e-06,1e-06,2e-06,2e-06,0,0,2e-06,2e-06,2e-06,2e-06,3e-06,2e-06,3e-06,4e-06,5e-06,8e-06,1.4e-05,1.2e-05,2.5e-05,3e-05,5.9e-05,6e-05,5.6e-05,0.000249,0.000111,0.000125,4.9e-05,0.000391,0.000183,0.000659,0.000319,0.00048,0.000216,0.000281,0.000233,2.4e-05,0.000253,0.00048,0.000153,0.000628,0.000847,5.5e-05,0.000321,0.00036,0.000313,0.000568,0.000237,0.000128,0.000313,0.000581,3e-04,0.00046,0.000341,0.000412,0.000366,0.000452,0.000632,0.000151,0.000199,0.000173,0.000186,0.000191,0.000308,0.000104,1e-04,0.000143,7e-06,9e-05,3.1e-05,5.2e-05,3.2e-05,3.3e-05,2.3e-05,3.4e-05,3e-05,2.9e-05,1.7e-05,0.000103,2.4e-05,1.9e-05,1.7e-05,3e-06,2.3e-05,7e-05,1.3e-05,1e-05,4e-05,2.2e-05,4.8e-05,0.000163,8.2e-05,2.4e-05,0.000255,7.9e-05,4.6e-05,1.8e-05,1.4e-05,4e-06,7e-06,1.6e-05,3e-06,5e-06,5e-06,3e-06,1e-06,3e-06,2e-06,4e-06,7e-06,4e-06,4e-06,3e-06,6e-06,5e-06,7e-06,7e-06,2.6e-05,1.3e-05,1.5e-05
2e-06,3e-06,2e-06,3e-06,2e-06,1e-06,1e-06,2e-06,1e-06,1e-06,3e-06,3e-06,2e-06,1e-06,3e-06,4e-06,6e-06,1.4e-05,4e-06,1.1e-05,1.9e-05,2.1e-05,2.2e-05,0.000105,0.00011,0.000448,0.000572,0.000262,0.000148,0.000249,0.000169,0.000529,0.000525,0.00039,0.000647,0.000213,0.000233,0.000199,0.000355,0.000691,0.000542,0.000742,0.000368,0.000413,0.000261,0.000478,7.3e-05,0.000267,0.000344,0.000121,0.000332,0.000247,6e-05,0.000269,0.00034,0.00037,0.000321,0.000123,0.000325,0.000333,0.000192,2e-04,5.1e-05,0.000189,0.00013,0.000222,0.000171,0.000158,7.4e-05,7.8e-05,4e-06,6.1e-05,3.7e-05,3.6e-05,4.4e-05,4.3e-05,4e-05,3.5e-05,7e-06,0.000141,4.4e-05,3.6e-05,1.7e-05,2e-06,4.3e-05,7.1e-05,2.9e-05,2.6e-05,3.5e-05,8e-06,5.8e-05,0.00015,0.000157,7.6e-05,0.000322,0.000143,7.4e-05,4.6e-05,2.2e-05,9e-06,1.2e-05,1.6e-05,6e-06,4e-06,9e-06,6e-06,2e-06,2e-06,1e-06,3e-06,1e-06,5e-06,3e-06,6e-06,7e-06,9e-06,6e-06,9e-06,1e-05,7e-06,2.2e-05
1e-06,2e-06,3e-06,1e-06,1e-06,1e-06,1e-06,2e-06,1e-06,1e-06,4e-06,0,3e-06,1e-06,2e-06,4e-06,2e-06,1.1e-05,5e-06,1.3e-05,6e-06,1.6e-05,3.8e-05,8.8e-05,9.4e-05,0.000566,0.000684,0.000436,3.8e-05,0.000206,0.000311,0.00034,0.000374,1.5e-05,0.000336,0.00059,0.000503,0.000472,0.000373,0.000504,0.000498,0.000804,0.00078,0.000333,0.000298,0.000293,0.00013,0.000222,0.000484,0.000247,0.000222,0.00025,0.000268,0.000297,0.00063,0.000181,0.000396,0.000502,6.5e-05,0.000344,0.000204,0.00023,0.000237,8e-05,0.000319,0.000315,0.000155,5.8e-05,0.000115,7.4e-05,6.8e-05,0.000102,9.4e-05,3.8e-05,3.2e-05,3.3e-05,8.1e-05,5.1e-05,1.7e-05,0.000123,8e-05,2.8e-05,2.2e-05,2.6e-05,4e-05,7.6e-05,5e-05,1.8e-05,2.5e-05,2.5e-05,4.1e-05,0.000111,0.000104,6.9e-05,0.000259,3.2e-05,3.3e-05,3.1e-05,1.8e-05,5e-06,1.1e-05,1.4e-05,5e-06,7e-06,7e-06,1.4e-05,1.7e-05,1.2e-05,6e-06,3e-06,1e-05,1.2e-05,2e-06,7e-06,1e-06,1.6e-05,9e-06,1e-05,1.5e-05,7e-06,2e-05
3e-06,3e-06,2e-06,2e-06,2e-06,1e-06,1e-06,1e-06,1e-06,1e-06,1e-06,1e-06,3e-06,1e-06,1e-06,4e-06,4e-06,1.1e-05,5e-06,1.2e-05,1.4e-05,1.9e-05,5.8e-05,6.4e-05,8.7e-05,0.000469,0.000126,5.1e-05,0.000156,0.000399,0.000178,0.000237,0.00026,4.3e-05,0.000226,0.000314,0.000425,0.000244,0.000308,0.000198,0.000532,0.000388,0.000454,0.000465,9.9e-05,9.1e-05,0.000111,0.000225,0.00039,0.000663,0.000571,0.000305,0.000261,0.00057,0.000492,0.000499,0.000453,0.000386,0.000192,0.000503,0.000384,0.000454,0.00047,0.000308,0.000343,0.00015,0.000263,0.000229,0.000114,9e-05,5.9e-05,4.2e-05,5.4e-05,8.8e-05,6.8e-05,4.2e-05,3.3e-05,4.4e-05,1.8e-05,9.1e-05,8.2e-05,5.2e-05,5.3e-05,2.3e-05,3e-05,0.00011,4.8e-05,2.6e-05,1.7e-05,4e-06,2.3e-05,8.9e-05,5e-06,5.1e-05,0.000175,9e-05,6.1e-05,3e-05,1.4e-05,1e-05,8e-06,1.5e-05,4e-06,8e-06,9e-06,1.5e-05,1e-05,0,4e-06,4e-06,1.1e-05,6e-06,1.3e-05,6e-06,2e-06,1e-05,7e-06,3e-06,1.6e-05,1.4e-05,8e-06
2e-06,2e-06,3e-06,1e-06,4e-06,2e-06,2e-06,1e-06,2e-06,1e-06,2e-06,2e-06,3e-06,2e-06,3e-06,3e-06,2e-06,1.2e-05,5e-06,2e-05,2.4e-05,3.8e-05,8.8e-05,7.7e-05,8.3e-05,0.000411,0.000192,4e-05,5.3e-05,0.000387,0.000336,0.000206,0.000369,0.000103,0.000207,0.000207,0.000393,0.000141,0.000229,0.000285,0.000305,0.000381,9.6e-05,0.000266,0.00022,6.7e-05,0.000199,9.5e-05,0.000519,0.000218,0.000326,0.000401,0.000411,0.000186,0.00051,0.000247,0.00022,0.000176,0.000275,0.000144,0.000108,0.000372,0.000125,0.000107,0.000349,0.000304,0.000128,0.000129,6.5e-05,9.4e-05,8e-05,9.5e-05,3.6e-05,9.4e-05,0.000104,6.5e-05,3.3e-05,4.6e-05,4.3e-05,0.000109,9.2e-05,3.3e-05,4e-05,5.6e-05,3.6e-05,0.000125,4.8e-05,4.5e-05,2.9e-05,9e-06,3.2e-05,7.2e-05,3e-05,6.1e-05,0.000146,4.6e-05,3.7e-05,3e-06,1.4e-05,7e-06,9e-06,1.4e-05,8e-06,9e-06,4e-06,1.2e-05,6e-06,7e-06,3e-06,3e-06,6e-06,6e-06,1e-05,2e-06,2e-06,3e-06,8e-06,4e-06,1.7e-05,7e-06,3e-06
3e-06,1e-06,3e-06,2e-06,4e-06,2e-06,2e-06,3e-06,3e-06,3e-06,2e-06,1e-06,3e-06,2e-06,2e-06,3e-06,5e-06,1.2e-05,1.1e-05,2.8e-05,1.2e-05,2.8e-05,4.6e-05,5.4e-05,3.2e-05,0.000237,8.3e-05,5.6e-05,2.4e-05,0.000397,6.5e-05,2.8e-05,0.00013,0.000331,0.000496,0.000166,0.000377,0.000132,0.000156,0.000313,0.000283,0.000323,0.00035,7.3e-05,0.000254,0.000222,0.000184,0.000164,0.000229,0.000668,0.000296,0.000206,0.000259,0.000314,0.000175,0.000123,0.000146,0.000491,0.000608,0.000215,0.000165,0.000399,0.000403,3.5e-05,0.000314,7.3e-05,0.000141,0.000169,7.1e-05,4.5e-05,2.5e-05,2.3e-05,2.1e-05,7.3e-05,2.6e-05,2.9e-05,9e-06,2.9e-05,5.4e-05,0.000109,5.9e-05,4.8e-05,5.6e-05,2.5e-05,2.2e-05,0.000107,6e-05,2.8e-05,2.6e-05,2.5e-05,2.1e-05,6.6e-05,4.5e-05,2.2e-05,0.000188,9.9e-05,6.7e-05,3.9e-05,3.7e-05,2.7e-05,1.4e-05,1.3e-05,9e-06,8e-06,6e-06,6e-06,4e-06,1.1e-05,1.1e-05,6e-06,2e-06,7e-06,4e-06,5e-06,8e-06,1e-06,1e-06,8e-06,1.5e-05,3e-06,3e-06
3e-06,2e-06,2e-06,2e-06,2e-06,1e-06,1e-06,2e-06,0,2e-06,2e-06,1e-06,3e-06,2e-06,2e-06,6e-06,2e-06,8e-06,1.1e-05,3.2e-05,3.1e-05,1.9e-05,7e-05,7.9e-05,8.7e-05,0.000165,0.000166,0.000106,1e-05,0.000218,9e-05,0.000202,0.000357,0.000367,0.000201,4.5e-05,0.000152,8e-05,0.00033,0.000131,0.00016,0.000217,0.00013,0.000269,0.000238,0.000319,0.000159,0.000157,0.000256,0.000638,6.7e-05,0.000241,0.000225,0.000402,0.000198,0.000174,6e-05,0.000385,0.000252,0.000559,0.000322,0.000124,0.000219,0.000292,2.7e-05,0.00013,0.000126,9.2e-05,1.9e-05,4.9e-05,0.00011,7.5e-05,3.4e-05,4.1e-05,2.6e-05,1.6e-05,4.5e-05,2.4e-05,3.8e-05,0.000123,7.2e-05,5e-05,5.4e-05,5.7e-05,5.5e-05,7.7e-05,2.2e-05,3.1e-05,5.8e-05,2e-05,1e-05,2.8e-05,7.3e-05,6.5e-05,0.000183,0.000229,0.000104,3.3e-05,2.1e-05,1.2e-05,1.4e-05,2.1e-05,4e-06,1.4e-05,9e-06,7e-06,5e-06,1e-05,3e-06,2e-06,2e-06,6e-06,9e-06,8e-06,1.1e-05,9e-06,4e-06,5e-06,1e-05,7e-06,7e-06
2e-06,2e-06,1e-06,1e-06,3e-06,1e-06,1e-06,1e-06,1e-06,1e-06,2e-06,1e-06,3e-06,3e-06,2e-06,6e-06,9e-06,1.4e-05,5e-06,1.4e-05,1.4e-05,1.9e-05,5.8e-05,4.6e-05,5.3e-05,0.000153,0.00019,6e-05,8.7e-05,0.00014,0.000291,0.00014,0.000121,0.000235,0.000101,0.000181,9.2e-05,2.9e-05,0.000219,0.000172,0.000288,0.00023,0.000222,0.000163,0.00018,0.000298,0.000205,0.000147,0.000173,3e-04,0.000264,3.6e-05,7.6e-05,0.000393,0.00019,0.000217,7.5e-05,0.000254,0.000291,0.000336,0.000117,0.000134,0.00013,0.000199,8.9e-05,0.000201,0.000159,4.1e-05,3e-05,2.1e-05,0.000112,5.5e-05,4.1e-05,4.1e-05,3.1e-05,2.3e-05,2.9e-05,1.4e-05,5e-06,0.000103,5.1e-05,2.8e-05,6.1e-05,4.8e-05,1.6e-05,3.7e-05,2.5e-05,4e-05,5.5e-05,3.8e-05,1.8e-05,9.1e-05,7.3e-05,5.7e-05,0.00031,0.000242,4.1e-05,7.7e-05,4.4e-05,4e-06,2.9e-05,3e-05,6e-06,1.5e-05,1.6e-05,1.4e-05,8e-06,4e-06,5e-06,4e-06,5e-06,1e-06,4e-06,3e-06,6e-06,4e-06,6e-06,2e-06,1.3e-05,7e-06,6e-06
1e-06,1e-06,2e-06,2e-06,3e-06,2e-06,1e-06,1e-06,1e-06,2e-06,2e-06,2e-06,4e-06,3e-06,1e-06,3e-06,5e-06,8e-06,8e-06,7e-06,5e-06,1.8e-05,2.3e-05,2.6e-05,7.5e-05,0.000142,0.00012,0.000154,3.8e-05,0.000298,0.000167,0.000233,4.9e-05,0.000299,0.000417,0.000245,0.000173,2.2e-05,0.000235,0.00033,0.000146,0.000149,0.000124,0.000275,0.000166,0.000256,0.000172,2e-04,0.000134,0.000313,0.000315,0.000186,0.000141,6.3e-05,8.1e-05,0.000105,0.000146,0.000121,0.000202,0.000145,9.2e-05,0.000211,0.000233,0.000109,8.7e-05,8.4e-05,0.000123,0.00017,9.5e-05,7.9e-05,7.3e-05,5.3e-05,8.1e-05,8.9e-05,5.8e-05,6.6e-05,5.9e-05,1.8e-05,1.3e-05,7e-05,3.8e-05,1.2e-05,4.6e-05,6e-06,1.6e-05,1.1e-05,3e-05,4.7e-05,1.4e-05,1.6e-05,5.6e-05,7e-05,7.2e-05,1.4e-05,0.00036,0.000256,0.000135,4.5e-05,4.2e-05,8e-06,4.7e-05,2.5e-05,1.7e-05,2.3e-05,3.6e-05,4.1e-05,1.9e-05,9e-06,4e-06,4e-06,6e-06,1.2e-05,7e-06,2e-06,5e-06,8e-06,5e-06,2e-06,1.4e-05,7e-06,4e-06
2e-06,2e-06,1e-06,2e-06,1e-06,1e-06,0,2e-06,1e-06,2e-06,1e-06,1e-06,3e-06,1e-06,2e-06,4e-06,0,9e-06,1.4e-05,1e-05,8e-06,1.8e-05,2.7e-05,2.7e-05,6.4e-05,0.000248,9.1e-05,9.5e-05,0.000101,0.000381,4.5e-05,0.00027,0.000113,0.000363,0.000254,7.4e-05,8.1e-05,6.6e-05,0.000295,0.000232,8e-05,0.000145,0.000122,0.000225,0.00021,0.000147,0.000224,0.000324,0.000221,0.000275,0.000286,0.000195,0.000103,0.000315,0.000422,0.000322,0.000219,0.000339,0.00032,9.5e-05,6e-05,0.000169,9.1e-05,0.00013,0.000293,0.000121,6.3e-05,0.000126,4e-06,4.5e-05,7.6e-05,8.6e-05,0.000126,1.9e-05,1.6e-05,4.6e-05,2.5e-05,7.7e-05,2e-05,4.7e-05,0.000114,6.5e-05,6.9e-05,2.2e-05,2e-06,5.6e-05,4.1e-05,3.4e-05,2.2e-05,2e-05,4.6e-05,2.4e-05,8.4e-05,6.1e-05,0.000402,0.000242,0.000192,3.7e-05,2.2e-05,3.5e-05,2.5e-05,4.5e-05,3.3e-05,4.2e-05,2.1e-05,5e-06,1.7e-05,9e-06,1.3e-05,8e-06,8e-06,1.1e-05,7e-06,5e-06,2e-06,6e-06,5e-06,3e-06,1.3e-05,3e-06,2e-06
1e-06,3e-06,2e-06,2e-06,3e-06,1e-06,1e-06,2e-06,2e-06,1e-06,3e-06,1e-06,0,2e-06,2e-06,3e-06,1e-06,8e-06,8e-06,1.1e-05,1.1e-05,1e-05,1.4e-05,2e-05,5.2e-05,0.000334,0.000164,2.8e-05,3.5e-05,0.000326,0.000242,0.00025,0.00051,0.000342,0.000211,0.000186,0.000332,0.000124,0.000128,4.5e-05,0.000274,0.000288,0.000193,4.3e-05,0.000286,8e-05,7.4e-05,0.000129,2.6e-05,0.000193,0.000219,0.000276,0.000354,0.000361,0.000307,4.1e-05,0.000259,0.000163,0.00028,0.000334,0.000141,0.000141,0.000296,0.000306,0.000212,0.000208,2.3e-05,0.000223,0.000142,8.4e-05,7e-05,1e-04,5.8e-05,7.7e-05,7.1e-05,4.4e-05,3.6e-05,6.6e-05,7.7e-05,5.3e-05,0.00018,0.000104,4.6e-05,1.4e-05,2.5e-05,8.5e-05,2.3e-05,1e-05,2.4e-05,1e-05,4.5e-05,8.7e-05,0.000117,7e-05,0.000496,0.000315,0.000182,5.5e-05,2.7e-05,6e-06,3.7e-05,5.4e-05,7.6e-05,2.6e-05,3.4e-05,2.1e-05,2.1e-05,1.4e-05,1e-05,8e-06,1e-05,2e-06,4e-06,1e-06,5e-06,1e-06,4e-06,6e-06,1.4e-05,6e-06,1e-06
3e-06,1e-06,1e-06,1e-06,1e-06,1e-06,2e-06,2e-06,1e-06,2e-06,2e-06,1e-06,2e-06,0,2e-06,4e-06,2e-06,5e-06,4e-06,5e-06,5e-06,4e-06,2e-06,2.2e-05,4.6e-05,0.000234,0.000168,0.000137,0.000182,0.000214,0.000274,0.000476,0.000567,0.000722,0.000159,0.00014,0.000267,0.000125,0.000251,0.00019,0.000477,0.000328,0.000316,0.000326,0.000162,9.7e-05,0.000199,0.000134,0.000153,3e-04,0.00016,0.000232,0.000277,0.000289,0.000328,0.000209,0.000234,0.000138,0.00033,0.000143,0.000176,0.000149,0.000194,7.9e-05,0.000296,0.000369,0.000276,7.4e-05,7e-05,5e-06,9.5e-05,5e-05,4.5e-05,1.9e-05,4.6e-05,3.9e-05,2.6e-05,1.2e-05,5.9e-05,5.1e-05,0.000153,9.7e-05,5.8e-05,4.9e-05,4.6e-05,7.1e-05,4.9e-05,3.9e-05,4.8e-05,9e-06,3.4e-05,0.000126,5.7e-05,4.8e-05,0.000477,0.000212,4.3e-05,3.3e-05,2.3e-05,2e-05,3.5e-05,9.5e-05,0.000107,8.5e-05,5.8e-05,4.5e-05,2.6e-05,1.2e-05,8e-06,3e-06,9e-06,9e-06,9e-06,5e-06,6e-06,6e-06,3e-06,5e-06,1.3e-05,5e-06,4e-06
1e-06,2e-06,1e-06,0,2e-06,1e-06,0,1e-06,1e-06,2e-06,1e-06,1e-06,2e-06,1e-06,1e-06,1e-06,2e-06,7e-06,6e-06,1.6e-05,8e-06,4e-06,1.5e-05,1.8e-05,1.5e-05,0.000132,6.8e-05,6e-05,7.6e-05,0.000141,7.9e-05,0.000351,0.000295,0.000285,0.000313,1.7e-05,0.000116,0.000148,0.000239,0.00029,0.000575,9.9e-05,0.000114,0.000144,0.000176,0.000187,0.000134,0.000101,0.00016,0.000275,0.000132,0.000188,0.000214,0.000107,0.000112,0.000105,0.000256,0.000158,0.000168,0.000204,8.4e-05,7e-05,7e-05,5e-05,9e-05,0.000124,5.3e-05,0.000131,5e-05,2.1e-05,5e-05,8.5e-05,3e-05,1.4e-05,9e-06,1.5e-05,1.5e-05,2.2e-05,3e-05,1.6e-05,1e-04,5e-05,2.1e-05,3e-06,2.4e-05,1.7e-05,6.2e-05,2.2e-05,2.1e-05,1.4e-05,2.7e-05,8.5e-05,8.4e-05,4.2e-05,0.000369,0.000117,4.4e-05,1e-05,1.2e-05,2e-05,9e-06,5.2e-05,3.1e-05,1.4e-05,1.8e-05,2e-05,6e-06,3e-06,3e-06,3e-06,7e-06,7e-06,1e-06,0,3e-06,5e-06,3e-06,2e-06,1.3e-05,2e-06,6e-06
1e-06,2e-06,1e-06,0,2e-06,0,0,1e-06,1e-06,1e-06,1e-06,0,2e-06,0,1e-06,1e-06,1e-06,6e-06,6e-06,1e-05,6e-06,7e-06,1.6e-05,5e-06,2.9e-05,9e-05,2.1e-05,2.7e-05,5.7e-05,0.000163,0.000145,0.000232,2.8e-05,4.9e-05,0.000195,0.000166,2e-05,0.000131,0.000196,0.000271,0.000457,0.000169,4e-05,0.000174,0.000175,0.000291,7.4e-05,0.000159,0.000219,7.7e-05,0.000165,0.000398,0.000293,0.000164,0.000175,0.000123,0.000185,4.1e-05,0.000176,0.000191,3.8e-05,4.5e-05,0.000105,1e-04,5.2e-05,2.8e-05,8.7e-05,8.1e-05,2.5e-05,2.9e-05,2e-05,5.4e-05,2.4e-05,1.8e-05,8e-06,1.7e-05,1.1e-05,7e-06,1.3e-05,3.5e-05,3e-06,2.2e-05,1.3e-05,2.2e-05,1.4e-05,3.2e-05,2.6e-05,1.6e-05,1.2e-05,4e-06,2.2e-05,6.8e-05,4.1e-05,3.4e-05,0.000247,5.9e-05,3.9e-05,2.4e-05,1.3e-05,4e-06,1.2e-05,3e-05,1.1e-05,4e-06,1.2e-05,4e-06,4e-06,1e-06,1e-06,2e-06,5e-06,3e-06,1e-06,0,4e-06,4e-06,3e-06,3e-06,1.3e-05,5e-06,2e-06
1e-06,2e-06,1e-06,0,2e-06,0,1e-06,1e-06,1e-06,1e-06,1e-06,1e-06,2e-06,1e-06,2e-06,1e-06,1e-06,6e-06,5e-06,1e-05,1e-06,4e-06,1.4e-05,7e-06,1.9e-05,6.6e-05,2.4e-05,2.3e-05,6.2e-05,0.000176,0.00018,0.000346,0.000138,0.000285,0.000241,0.000109,3.9e-05,0.000114,0.000257,0.000156,0.000379,0.000121,0.000111,0.000147,0.000199,0.000255,0.000104,9.7e-05,0.000123,9.4e-05,0.000105,0.000202,7.7e-05,0.000186,7.6e-05,0.000164,0.000162,7e-05,0.000154,0.000131,1.6e-05,3.5e-05,0.000112,7.5e-05,0.000104,5.9e-05,1e-04,4.4e-05,1.4e-05,2e-05,2.6e-05,3.2e-05,1.8e-05,3e-06,9e-06,1.8e-05,6e-06,7e-06,1.2e-05,4.2e-05,1.7e-05,1.5e-05,1.1e-05,1.6e-05,1.4e-05,2.7e-05,1.9e-05,1e-05,7e-06,7e-06,1.9e-05,6.6e-05,3.2e-05,3e-05,0.000172,4e-06,3.8e-05,3e-06,9e-06,3e-06,5e-06,2e-05,9e-06,3e-06,9e-06,3e-06,2e-06,0,1e-06,2e-06,5e-06,2e-06,2e-06,1e-06,4e-06,4e-06,3e-06,2e-06,1.3e-05,5e-06,4e-06
1e-06,2e-06,1e-06,0,2e-06,0,1e-06,1e-06,0,1e-06,1e-06,1e-06,2e-06,1e-06,1e-06,1e-06,0,6e-06,5e-06,1.1e-05,3e-06,4e-06,1.1e-05,3e-06,1.5e-05,5.1e-05,4e-06,2.2e-05,6.2e-05,0.000174,9.8e-05,0.000331,9.9e-05,0.000245,0.000177,6.4e-05,0.000102,0.000107,0.000214,0.00016,0.000409,7.5e-05,7.3e-05,0.000163,0.000208,0.000169,4.4e-05,5.6e-05,2.7e-05,0.000136,4.5e-05,0.000117,0.000126,0.000204,8.1e-05,9.9e-05,6.5e-05,0.000102,0.000138,7.8e-05,3e-05,1.3e-05,0.000126,5.7e-05,8e-05,8e-06,9.9e-05,4.6e-05,1e-06,1.9e-05,1.7e-05,2.4e-05,1.2e-05,5e-06,6e-06,1.2e-05,5e-06,7e-06,8e-06,3.9e-05,9e-06,7e-06,1e-05,1.4e-05,1.8e-05,2.4e-05,1.8e-05,6e-06,8e-06,5e-06,1.9e-05,6.9e-05,3e-05,2.5e-05,0.000183,1.5e-05,1.8e-05,5e-06,4e-06,3e-06,4e-06,1.6e-05,9e-06,1e-06,8e-06,2e-06,2e-06,0,1e-06,2e-06,5e-06,2e-06,2e-06,0,3e-06,4e-06,3e-06,3e-06,1.2e-05,5e-06,4e-06
