1.1e-05,1.8e-05,4.5e-05,5.4e-05,2.3e-05,2.9e-05,4e-06,3e-06,5.4e-05,2.4e-05,4e-06,1.6e-05,3e-05,7e-06,5.6e-05,9.1e-05,5.9e-05,1.7e-05,4.4e-05,8e-06,6.6e-05,2.4e-05,2.3e-05,4.1e-05,1.9e-05,1e-05,8.4e-05,2.3e-05,2.6e-05,4e-05,3.6e-05,1e-05,7e-06,4.4e-05,1.1e-05,2.9e-05,1.8e-05,7e-06,1.8e-05,0,2.3e-05,7e-06,1.8e-05,2.8e-05,2.9e-05,2.1e-05,2.9e-05,2e-05,2e-05,5.8e-05,7e-06,2.4e-05,7e-06,2.4e-05,4.1e-05,1.6e-05,1.7e-05,3.4e-05,1e-06,2.7e-05,2e-06,0.000105,2.3e-05,2.4e-05,4.8e-05,1e-05,8e-06,1e-06,7e-06,4.4e-05,4.6e-05,4.1e-05,1.6e-05,4.5e-05,2.9e-05,2.3e-05,8e-06,3e-06,4.5e-05,2.2e-05,2e-06,9e-06,4e-06,2.5e-05,1.4e-05,1.7e-05,2.2e-05,0,9e-06,0,8e-06,1.5e-05,4.9e-05,2.3e-05,4e-06,2.2e-05,2e-05,2.8e-05,5e-06,3.1e-05,2.4e-05,6.8e-05,3.2e-05,2e-05,3.9e-05,4.8e-05,1.3e-05,4e-05,3e-05,2e-06,3e-06,5e-06,3e-06,7e-06,1.1e-05,1.1e-05,1.1e-05,3.4e-05,1.3e-05,4.1e-05,1.6e-05
2e-05,2.7e-05,7.8e-05,8.9e-05,4.4e-05,4.6e-05,9e-06,1e-05,0.00011,6.5e-05,1.4e-05,3.9e-05,6.4e-05,1.9e-05,0.000125,0.000203,0.000104,3.2e-05,5.3e-05,1.1e-05,0.000119,5.9e-05,6.7e-05,8.7e-05,7.8e-05,4.3e-05,0.000166,4.4e-05,6.3e-05,9.7e-05,7.2e-05,2e-05,2.7e-05,7.7e-05,2.7e-05,7.6e-05,4e-05,4.4e-05,1.6e-05,1.1e-05,2.9e-05,9e-06,3.9e-05,7e-05,6.3e-05,4.3e-05,6.4e-05,5.1e-05,2.6e-05,0.000131,5.1e-05,6.7e-05,5.4e-05,7.1e-05,5.5e-05,4e-05,2.8e-05,5.6e-05,9e-06,5.7e-05,1.9e-05,0.000229,6.3e-05,4.4e-05,7.7e-05,3.1e-05,4.5e-05,1.6e-05,1.7e-05,8.9e-05,0.000101,9.6e-05,4e-05,9.5e-05,3.8e-05,3e-05,2.6e-05,3.3e-05,4.6e-05,5.3e-05,4.8e-05,2.9e-05,2.6e-05,9e-05,5.2e-05,2e-05,5.4e-05,3.3e-05,4.3e-05,3.7e-05,3e-05,4.3e-05,9e-05,6e-05,2.7e-05,4.5e-05,2.9e-05,5.1e-05,3.2e-05,6.6e-05,2e-05,0.000116,9.1e-05,6.8e-05,5.2e-05,8.4e-05,3.4e-05,0.000106,2.8e-05,3.9e-05,1.1e-05,3.5e-05,1.8e-05,3.4e-05,3.3e-05,2.5e-05,2.6e-05,8.9e-05,3.5e-05,8.3e-05,1.6e-05
6.5e-05,0.000107,7.6e-05,7.8e-05,7.5e-05,5.7e-05,6e-06,3.3e-05,0.000145,0.000135,9.4e-05,3.3e-05,4.2e-05,9.2e-05,6.9e-05,0.000297,0.00011,5.1e-05,0.00015,8.3e-05,0.000143,3.7e-05,0.00011,7.2e-05,0.000116,2.7e-05,0.000174,3.1e-05,0.000108,0.000164,7.6e-05,9.9e-05,6.7e-05,8.6e-05,7e-06,5.3e-05,9.7e-05,9e-05,0.000116,4.5e-05,2.2e-05,0.000111,7.2e-05,8.6e-05,6e-05,7e-05,0.000125,4.9e-05,4.7e-05,0.000196,9.5e-05,3.8e-05,6.2e-05,8e-05,0.00014,5.1e-05,4.1e-05,0.000102,5.2e-05,4.8e-05,2.3e-05,0.00022,0.000136,3.5e-05,0.000103,2.4e-05,2.6e-05,9.7e-05,7.3e-05,8.7e-05,0.000129,0.000132,5.3e-05,0.000168,8.9e-05,4.5e-05,6.8e-05,3e-05,8.1e-05,6.5e-05,6.9e-05,7.8e-05,1.5e-05,6.7e-05,6.8e-05,7.4e-05,8.3e-05,1.6e-05,3e-05,1e-05,3.8e-05,5.9e-05,0.000144,0.000111,5.8e-05,7.7e-05,8.2e-05,1e-04,6.4e-05,5.1e-05,2.1e-05,0.000114,9e-05,6.1e-05,5.9e-05,9.5e-05,7.3e-05,0.000107,8e-05,3.8e-05,5e-05,4.3e-05,3.8e-05,5.1e-05,3.8e-05,1.5e-05,1e-05,9.1e-05,2.7e-05,0.000129,4.6e-05
0.000186,5.9e-05,0.000111,6.6e-05,0.000123,3.7e-05,4.9e-05,8e-05,7e-05,9.3e-05,7.7e-05,8.3e-05,0.000152,0.000121,8.4e-05,0.00028,0.000199,7.4e-05,0.000201,4.3e-05,4.5e-05,7.6e-05,4.9e-05,8.2e-05,4.7e-05,9.3e-05,0.000162,0.000155,0.000107,7.2e-05,0.000184,5.9e-05,8.4e-05,8.8e-05,1.2e-05,2.6e-05,5e-05,0.000105,0.000136,7.4e-05,0.000102,0.000103,5.1e-05,0.000156,2.8e-05,9.7e-05,2.7e-05,4.5e-05,4.4e-05,0.000126,0.000129,0.000117,3.8e-05,0.000192,7e-05,3.9e-05,7.5e-05,0.000116,2e-06,4.1e-05,0.000151,0.000222,8.3e-05,0.000125,9.5e-05,5.3e-05,4.6e-05,0.000123,4.7e-05,0.000154,9.2e-05,0.000127,9.1e-05,0.00025,2.4e-05,0.00013,3.5e-05,5.6e-05,0.000113,4.2e-05,6.2e-05,4.9e-05,9e-05,0.000132,9.1e-05,0.000133,5.6e-05,4.7e-05,5.4e-05,5.4e-05,0.000157,6.8e-05,0.000127,4.5e-05,0.000107,3.2e-05,6.7e-05,0.000105,6.3e-05,2.9e-05,2e-05,0.000176,7.9e-05,8.9e-05,0.000137,6.1e-05,5.5e-05,9.2e-05,2.3e-05,1.6e-05,4.2e-05,3e-05,5.6e-05,5.8e-05,2.8e-05,1.7e-05,4.4e-05,6.9e-05,5.3e-05,5.3e-05,6.1e-05
0.000191,0.000234,6e-05,0.000218,3.3e-05,0.000217,0.000184,5.9e-05,4e-06,0.000196,8.6e-05,6e-06,0.000173,0.000123,0.000251,0.00015,9.2e-05,0.000157,0.000191,0.000124,0.000259,0.000127,0.00011,0.000162,2.6e-05,7e-05,0.000194,0.000205,4.2e-05,9e-05,0.000256,6e-05,5e-05,0.000258,7.6e-05,0.000125,0.000107,9.2e-05,3e-05,7.4e-05,9.9e-05,4.6e-05,6.4e-05,0.00023,0.000148,8.1e-05,0.000155,0.000104,8.5e-05,0.000234,3.9e-05,4e-05,0.000111,0.000258,0.000177,0.000101,0.000154,0.000156,2.3e-05,7.5e-05,0.000125,0.000224,9.2e-05,2.8e-05,0.000116,6.4e-05,2.1e-05,4.6e-05,4.2e-05,0.000167,0.000117,0.000158,0.000203,0.000195,0.000137,0.000143,7.6e-05,9.5e-05,5.3e-05,3.8e-05,9.2e-05,7.1e-05,0.000126,8.8e-05,9.3e-05,0.000145,3.8e-05,4e-05,7.3e-05,8.8e-05,0.000152,4.6e-05,8.8e-05,0.000169,0.00013,0.000153,0.000221,4.4e-05,4.9e-05,2.1e-05,9.3e-05,0.000271,0.000206,0.00019,0.000271,0.000141,6.3e-05,0.000101,4.7e-05,5.6e-05,5.8e-05,2.2e-05,0.000105,6.4e-05,7.7e-05,2.7e-05,0.000127,0.000148,4.6e-05,5.3e-05,1e-04
0.00012,0.000162,0.000269,0.000259,5.1e-05,0.000321,0.000357,9.3e-05,0.000119,0.000122,8.8e-05,7.2e-05,0.000227,7.7e-05,0.000214,0.000322,0.000137,2.6e-05,0.000257,0.000204,0.00027,8.1e-05,0.000168,0.000183,0.000121,9.1e-05,0.000308,9.6e-05,0.000251,4.3e-05,0.000277,0.000186,0.000139,0.000259,0.000182,0.000133,7.5e-05,0.00027,0.000194,0.00016,0.00031,0.000208,0.00012,0.000286,0.000174,9.2e-05,0.000172,5.3e-05,0.00017,0.000446,0.000119,1e-04,0.000119,0.000138,9.4e-05,4.6e-05,6e-05,0.000225,8.2e-05,4e-05,0.000147,0.000386,0.000212,0.000166,0.000184,8.7e-05,6.2e-05,0.000185,7.4e-05,0.000221,5.7e-05,0.000199,0.000166,0.000274,0.000128,0.000148,4.4e-05,0.000153,9.7e-05,0.000115,3.1e-05,5.9e-05,0.000225,0.000113,3.9e-05,0.000147,0.000132,7e-05,7.4e-05,1.8e-05,0.000102,0.000237,0.000189,0.000131,0.000114,7e-05,0.000259,0.000166,0.000187,6.1e-05,0.000132,0.00025,5.5e-05,3.4e-05,0.000156,0.000191,0.000119,0.000203,0.000105,1.8e-05,0.000191,9.5e-05,8.9e-05,0.00018,7.5e-05,0.000113,0.000156,0.000115,9.3e-05,0.000119,7.9e-05
0.000353,0.000405,0.000323,0.000449,0.000437,0.000597,0.000704,0.000498,0.000242,0.000156,2.6e-05,0.000118,0.000242,0.000457,5.9e-05,0.000474,0.000632,7.4e-05,0.000485,0.000488,0.000665,0.000466,0.000341,0.000134,4.5e-05,0.00013,0.000471,0.00075,0.000741,0.000634,0.000369,0.000193,0.000392,0.000265,0.000495,0.000335,0.000249,0.00042,0.00018,0.000187,0.000281,1.6e-05,0.000363,0.000472,0.000117,0.000256,0.000443,0.000167,0.00031,0.000438,0.000502,0.000551,0.000333,0.000428,0.000291,0.000176,0.000184,0.00041,0.00014,0.00021,0.00034,0.000678,0.000388,0.000286,0.000484,0.000295,0.000181,0.000275,0.00029,3e-05,0.000143,0.000251,0.000175,0.00024,0.000107,0.000222,1e-04,0.000274,0.000239,0.000184,0.000349,0.000102,0.00042,7.2e-05,0.000221,0.000163,9.2e-05,9.3e-05,0.000174,8.9e-05,9.1e-05,0.000345,0.000352,0.000163,0.000138,4.7e-05,0.00017,0.000356,0.000243,0.000209,0.000331,0.000368,0.000219,0.00022,4e-05,0.000484,0.000332,0.000491,0.000299,0.00018,0.000287,0.00026,9.7e-05,0.000115,0.000378,0.000342,0.000413,0.000256,3.1e-05,0.000184,0.000169
0.000729,0.000173,0.000576,0.000245,0.00032,0.000128,0.00034,0.000591,0.000845,0.000319,3.8e-05,0.000201,3.6e-05,0.000787,0.001018,0.00061,0.000927,0.000982,0.000965,0.000722,0.000158,0.000766,0.000157,0.000116,0.000288,0.000108,0.000443,0.000818,0.000107,0.000726,0.00049,0.000387,0.000362,0.000514,0.000539,0.000359,7.6e-05,0.000224,0.000451,0.000331,0.000707,0.000383,0.000899,0.00085,0.000803,0.00072,0.00057,0.000402,0.000452,0.00059,0.000368,0.000325,0.000574,0.000622,0.000555,0.000659,0.000428,0.000344,0.000313,0.000284,0.000278,0.000412,0.001138,0.000583,0.000282,0.000324,0.000265,0.000493,0.000379,0.000262,0.000223,0.000421,0.000605,0.000568,0.000163,0.000141,0.000221,0.000322,0.000297,0.000278,0.000657,0.00032,0.000622,0.000565,0.000602,0.00057,0.000396,0.000433,1.9e-05,0.000324,0.000175,0.000247,0.000508,0.000422,0.000129,0.000113,0.000231,0.000308,0.000546,0.000133,0.000481,0.000367,0.000385,0.000499,0.000331,0.00064,0.00063,0.000705,0.000686,0.000131,0.000408,0.000351,0.000301,5e-05,0.000365,0.00018,0.000157,3.6e-05,0.000287,9e-05,0.000351
0.000717,0.000331,0.001113,0.000992,0.000437,0.000207,0.000493,0.000382,0.000682,0.000906,0.000508,0.000156,0.000271,0.000769,0.000375,0.000666,0.000776,0.000709,0.000107,0.000272,0.000228,0.000763,0.000912,0.000291,0.000281,0.000372,0.000219,0.00068,0.000601,0.000836,0.000468,0.000163,0.000265,0.000392,0.000846,0.00037,0.000363,0.000128,0.000301,0.000109,0.000652,0.000353,0.000915,0.000423,0.000551,0.000499,0.000537,0.000541,0.000963,0.00054,0.000635,0.000376,0.000545,0.00048,0.00055,0.000613,0.000524,0.000484,0.000498,0.000592,0.00044,0.000894,0.001484,0.000688,7.2e-05,4e-04,0.000149,0.000452,0.000283,0.000178,0.000787,0.000745,0.00058,0.000551,0.000798,0.000497,0.000165,0.000464,0.000367,0.000368,0.000583,0.000631,0.000222,0.00042,0.000263,8.3e-05,0.000524,0.000225,0.00025,0.000576,0.000343,0.000373,0.000958,0.001066,0.000582,8.4e-05,0.000362,0.000471,0.000164,0.000313,0.000607,0.000535,0.000384,0.000476,0.000216,0.000372,0.000478,0.000383,7.3e-05,0.000457,0.000404,0.000273,0.000299,9.7e-05,0.000317,0.000162,9.5e-05,0.000338,0.000543,0.000529,0.000482
0.000912,0.000842,0.001239,0.000981,0.000617,0.000346,0.000354,0.000244,0.000759,0.000732,0.000454,0.000247,0.000301,0.000289,0.000592,0.001216,0.000775,0.000745,0.000535,0.000131,0.00013,0.000486,0.000323,0.000594,0.000576,0.000104,0.00047,0.000347,0.000293,0.000653,0.000413,0.000355,0.000369,0.000252,0.000454,0.000483,0.000584,0.000415,0.000462,0.000426,0.000273,0.000442,0.000727,0.001135,0.00086,0.000775,0.000606,0.000226,0.000527,0.000584,0.001053,0.001181,0.000227,0.000315,0.000305,0.000686,0.001086,0.000723,0.000462,0.000289,0.000363,0.001029,0.000696,0.000557,0.000685,0.00083,0.000436,0.000574,0.000286,7.9e-05,0.000964,0.001395,0.000799,0.00023,0.000643,0.000462,8e-05,0.000435,0.000655,0.000658,0.000542,0.000547,0.000512,9.3e-05,0.000365,0.000559,0.000532,0.00071,0.000731,0.000657,0.000564,0.000501,0.000946,0.000946,0.000648,0.000419,0.000566,0.000137,0.000388,0.000292,0.000678,0.000779,0.000717,8.5e-05,0.000594,0.000404,0.000647,0.000588,0.000386,0.000619,0.000629,0.000701,0.00052,0.000239,0.000247,0.000382,0.000225,0.000314,0.000489,3.1e-05,0.000225
0.000825,0.000894,0.000202,0.00041,3.4e-05,0.000112,0.000283,0.000435,0.000714,0.000235,0.000289,2.1e-05,0.000223,0.000317,0.000567,0.000655,0.000148,5.8e-05,0.000216,0.000151,0.000234,0.000193,0.000543,0.000453,0.000115,0.000104,0.000455,0.000469,0.000306,0.000368,0.000155,8.8e-05,0.000328,0.000312,0.000417,3.7e-05,0.000346,0.000105,0.000431,0.000498,0.000476,0.000283,0.000607,0.000386,0.000314,0.000195,0.000225,2.6e-05,0.000403,0.000346,0.000701,0.000645,0.000623,0.00051,0.000205,0.000422,0.000279,0.00029,0.000314,0.000451,0.000611,0.000471,0.000317,0.000229,0.000332,0.000395,0.000254,0.000475,0.000553,0.000494,0.000763,0.000398,0.000254,0.000392,0.000415,0.000299,0.000318,0.000203,0.000168,0.000334,0.000313,0.000372,2e-04,0.000208,9.6e-05,0.000383,0.000204,0.000328,0.000314,0.000452,0.000425,0.000238,0.000406,0.000172,0.000163,0.000121,0.000203,0.000252,0.000528,0.000302,0.000575,0.000218,0.000342,0.000448,0.000591,0.000361,0.000201,0.000293,2.2e-05,0.00036,0.000445,0.000497,0.000641,0.000613,0.000581,0.000362,0.000191,0.000271,8.5e-05,0.000176,0.000396
0.00023,0.000296,0.000203,0.000114,0.000102,0.000117,0.000258,0.000235,8.5e-05,7.1e-05,9.9e-05,0.000139,1.2e-05,0.000134,0.000351,0.00017,0.000122,0.00018,0.000129,2.4e-05,6.6e-05,0.000165,0.000145,0.000108,1e-05,7e-05,0.000209,0.000142,0.000152,5.9e-05,0.00016,0.000144,0.000236,0.000265,1e-04,0.000243,0.000119,0.000131,0.000295,0.000178,9.5e-05,0.000128,0.000159,0.000235,0.000183,9.4e-05,0.000205,0.000115,0.000129,0.000189,0.000418,0.000125,0.000152,6e-05,6.1e-05,0.000249,0.000295,9.5e-05,1e-04,8.3e-05,0.000305,0.00022,0.000199,8.7e-05,0.00023,0.000124,0.000168,0.000157,0.000132,0.000152,0.000248,3.9e-05,0.000123,0.000166,0.000106,0.000142,0.000119,0.000106,9.2e-05,0.000243,0.000169,6.4e-05,0.000133,8.8e-05,0.000137,0.000117,0.000166,0.000108,0.00017,0.000304,0.000137,0.000193,0.000219,0.000117,8.3e-05,0.000156,0.000133,0.000133,0.000195,7.1e-05,0.000168,0.000257,9.1e-05,0.000287,0.000131,1e-04,0.000126,7.9e-05,0.000135,0.000105,0.00022,0.000136,0.000235,0.000173,6.3e-05,0.000125,1.9e-05,0.000168,0.000199,0.000211,0.000153
0.000161,0.000209,0.000112,4.6e-05,4.3e-05,3.7e-05,0.000158,0.000157,8.3e-05,6.2e-05,7.8e-05,0.000114,3.1e-05,0.000174,0.000245,0.000133,9.8e-05,0.000119,0.00013,9.9e-05,5.2e-05,0.000121,0.000173,7.4e-05,4.2e-05,6.7e-05,2.4e-05,0.00014,0.000188,4.1e-05,9.8e-05,0.000123,0.000204,0.000157,0.000132,0.000154,0.000101,9.8e-05,0.000191,4.1e-05,6.5e-05,0.000109,0.000238,0.00017,9.5e-05,5.4e-05,0.000172,0.000104,0.000113,0.000261,0.000196,0.000133,7.5e-05,0.000138,6.4e-05,0.000103,9.7e-05,7.6e-05,7.8e-05,5e-05,0.00014,0.000215,8.7e-05,5.7e-05,0.000162,0.000145,4.4e-05,4e-05,8e-05,0.000106,0.000218,9.3e-05,0.000151,1.1e-05,8.4e-05,0.000103,0.000124,0.00013,0.000116,0.000171,0.000241,0.000123,2.4e-05,8e-05,9.4e-05,5.8e-05,0.000104,0.000102,6.2e-05,0.000277,0.000142,0.000155,0.000163,8.1e-05,3.1e-05,9.9e-05,7.2e-05,6.4e-05,3.9e-05,0.00013,0.000185,9.5e-05,5.5e-05,0.000221,0.000156,8.4e-05,3.4e-05,2.3e-05,4.5e-05,9.7e-05,0.000113,7.3e-05,0.000161,5.9e-05,5e-05,4.1e-05,4.7e-05,0.000116,0.000106,2.8e-05,0.000102
5.4e-05,0.000222,0.000233,0.000143,4.1e-05,7.1e-05,0.000111,0.000178,9.3e-05,5e-05,7.7e-05,8.2e-05,0.000112,0.000188,9.8e-05,8.1e-05,0.000108,3.3e-05,3.4e-05,4.7e-05,4.6e-05,0.000164,7e-05,2.4e-05,0.000105,8.3e-05,3e-05,0.000238,0.00021,0.000169,0.000104,5.9e-05,0.000131,0.000195,0.000168,0.000172,0.000126,0.000197,0.000167,0.000125,0.000135,0.000169,0.00028,0.000227,0.000193,4.9e-05,0.000165,0.000149,0.000126,0.00039,0.000241,0.000188,0.000177,0.00011,0.000184,1e-04,0.000141,8.2e-05,0.000123,2.8e-05,0.000203,0.000134,4.8e-05,6.9e-05,8.5e-05,0.000105,0.000269,9e-05,6.1e-05,9.2e-05,0.000246,4.1e-05,0.000187,0.000109,0.000126,0.000236,8.1e-05,0.000198,0.00016,0.00018,0.000198,0.000226,0.00017,0.000125,0.000107,9.5e-05,5.4e-05,0.000101,8.8e-05,0.000174,5.9e-05,0.000178,3.7e-05,6.3e-05,4.9e-05,9.6e-05,3.5e-05,3e-05,0.00015,0.000136,0.000131,0.000195,2.4e-05,0.000215,9.1e-05,0.000195,2.9e-05,4.1e-05,6.6e-05,0.000126,7.1e-05,8.6e-05,0.000156,0.000106,0.000173,8.5e-05,3.7e-05,0.000133,0.000193,0.000177,0.000196
0.000173,0.000148,0.000238,0.000112,0.000131,0.000122,5.5e-05,0.000191,0.000155,6.3e-05,0.000128,4.7e-05,1.2e-05,7.5e-05,0.000213,0.000265,0.000104,0.000144,0.000141,3.1e-05,0.000151,0.000191,0.000202,7.9e-05,9.9e-05,8.6e-05,6.7e-05,0.000231,0.000169,6.7e-05,0.000133,1.8e-05,0.000145,0.000248,0.00013,6.2e-05,8.2e-05,9.3e-05,9.7e-05,4.9e-05,0.000129,0.00011,9.9e-05,0.000152,4e-05,6.4e-05,0.000154,0.000162,9.7e-05,0.000357,0.000292,0.000125,1.9e-05,3.5e-05,0.000132,0.000114,6.6e-05,0.000171,8.9e-05,0.000153,0.000181,4.2e-05,4.3e-05,4e-05,0.000167,0.000157,0.00035,0.000301,0.000146,0.000157,9.8e-05,4.3e-05,0.000188,0.000117,0.000175,0.000132,0.00015,0.00012,0.000189,2.9e-05,7.1e-05,0.000164,0.000148,9.4e-05,7.6e-05,0.000184,4.4e-05,2.4e-05,5.1e-05,0.000172,0.000137,0.000216,0.000137,0.000129,2.4e-05,8.8e-05,5.1e-05,6.1e-05,0.00017,0.000117,0.000187,7.2e-05,0.000129,0.000144,0.000237,6.1e-05,0.000149,0.000162,4.3e-05,0.000123,0.000123,4.6e-05,0.000101,0.000178,6.9e-05,4.1e-05,4.1e-05,0.000119,0.000181,0.000135,7.4e-05
8.8e-05,4.3e-05,0.000304,0.000121,0.000128,0.000238,0.000233,0.000184,0.000178,0.00012,8.7e-05,6.1e-05,8e-05,5.4e-05,1e-04,0.000204,8.5e-05,0.000188,8.7e-05,6.4e-05,0.000211,0.000139,0.00012,7.9e-05,5e-05,0.000168,0.000171,0.000104,0.000139,0.000151,0.000126,0.000218,0.000286,0.000159,0.000137,5.2e-05,4.5e-05,0.000104,0.000187,0.000196,4.9e-05,8.5e-05,6.9e-05,0.000171,0.000104,3.2e-05,9.9e-05,9e-05,0.000114,0.000191,0.000166,0.000159,9.9e-05,8.9e-05,6.9e-05,9.4e-05,0.000142,0.00013,9.6e-05,0.000186,6.6e-05,9.1e-05,0.000127,4.8e-05,0.000282,0.000131,0.000212,0.000245,0.00024,0.000173,0.000278,0.00021,0.000258,0.000113,0.000144,0.000176,5e-05,1.1e-05,0.000119,0.000107,0.000101,4.6e-05,1e-04,0.000202,0.000103,0.000163,6.6e-05,5.7e-05,0.000118,0.00018,0.000154,7.9e-05,0.00011,0.000178,6.2e-05,8.5e-05,0.000105,0.000121,9.2e-05,3.3e-05,0.000102,0.000163,8.8e-05,0.000125,0.000152,0.000153,0.000253,0.000124,9.3e-05,9.6e-05,9e-05,0.000103,0.000135,8.3e-05,2.6e-05,1.5e-05,4.4e-05,2.7e-05,0.00016,9.9e-05,0.000107
0.000167,0.000111,0.000224,0.000249,0.000138,0.000153,6.2e-05,0.000215,0.000143,0.00027,0.000313,0.000219,6.2e-05,9.6e-05,0.000226,0.000183,8.1e-05,0.000188,0.000296,0.000195,0.000236,0.000194,0.000179,8.6e-05,7.9e-05,0.000161,2.6e-05,0.000211,0.000308,8.6e-05,0.000146,0.000174,0.000201,0.000275,0.000309,0.000271,0.000153,0.000132,0.000264,0.000202,9.2e-05,3e-05,4.7e-05,0.000246,4.7e-05,4.3e-05,0.000159,0.000279,9.2e-05,0.000102,5.3e-05,0.000113,0.000148,0.000236,0.00017,0.000167,8.8e-05,4.2e-05,3.2e-05,0.000141,0.000386,0.000323,0.000191,0.000145,0.000137,0.000175,0.000256,6.5e-05,9.7e-05,0.000234,0.00031,0.000219,0.000283,0.000246,0.000228,0.000177,0.000241,0.000111,7.8e-05,7e-05,8.4e-05,0.000184,7.1e-05,9.5e-05,7.3e-05,6.2e-05,6.8e-05,8.2e-05,0.000215,8.3e-05,0.000167,0.000157,0.000103,0.000153,0.000163,4.4e-05,9e-06,7.3e-05,0.000143,0.000128,0.000119,0.000118,0.000273,0.000161,0.000266,0.000148,8.5e-05,0.000252,0.000287,0.000151,0.00035,0.000133,3.7e-05,0.000162,0.000131,4.9e-05,6.6e-05,6.9e-05,6.1e-05,4.9e-05,6e-05
0.000137,8.4e-05,5.1e-05,6e-05,9.4e-05,0.000119,0.000147,6.3e-05,7.5e-05,0.000186,0.000113,2.6e-05,7e-05,0.000211,0.000297,0.000216,0.000154,3.5e-05,0.000213,9e-05,0.000119,0.000127,0.000112,2.1e-05,0.000139,7.6e-05,0.000106,0.000302,0.000202,0.000127,0.000217,0.000202,0.000186,7.3e-05,5.1e-05,0.000196,0.00016,5.9e-05,0.000319,0.000166,7.7e-05,1.2e-05,0.000155,0.000236,0.000152,5.3e-05,0.00016,0.000313,0.000174,9.9e-05,0.000157,0.000206,5.1e-05,0.000187,3.4e-05,7.7e-05,3.4e-05,1.4e-05,6.1e-05,0.000154,0.000276,0.000252,6.9e-05,6e-05,1.6e-05,0.000115,0.000201,0.000195,0.000153,6.4e-05,6.9e-05,0.000211,0.000138,4.2e-05,0.000207,8e-05,0.000233,0.00022,0.000174,0.000199,0.000215,0.000148,0.000106,5.4e-05,1.7e-05,5.2e-05,5e-05,0.000127,0.000119,0.00027,0.000123,0.000174,0.000117,0.000123,0.000319,0.000219,8.6e-05,4e-05,0.000166,0.00013,8.5e-05,7.7e-05,0.00033,0.000171,0.000183,0.000102,9e-05,0.000179,4.7e-05,0.000119,0.000353,0.000367,0.000294,0.000198,9.3e-05,4.8e-05,8.1e-05,6.2e-05,0.000119,1.2e-05,9e-06
0.000155,0.000166,8.6e-05,8e-05,0.000128,7.1e-05,0.000137,0.000111,7.6e-05,9.2e-05,5.7e-05,5.2e-05,1e-04,0.000255,8.7e-05,0.000102,7.9e-05,5.9e-05,0.000172,0.000169,5.5e-05,4.3e-05,0.000106,5.8e-05,0.000158,0.000211,9.4e-05,0.000166,0.000125,0.000159,0.000226,5.9e-05,0.000131,0.00019,0.000146,0.000194,4.9e-05,8.3e-05,0.000268,4.4e-05,0.000141,4.4e-05,0.000184,1e-04,6.3e-05,0.000155,9.1e-05,0.000132,8.3e-05,6.7e-05,0.000225,0.000108,0.000151,0.000143,0.000181,2.7e-05,5.4e-05,3.1e-05,3e-05,0.000157,0.000139,0.000135,2.9e-05,4.9e-05,0.000197,0.000121,0.000139,0.000172,0.000195,0.000108,1.2e-05,6.4e-05,0.000157,0.00014,0.000131,0.000103,0.000216,0.000118,3.6e-05,0.000164,5.5e-05,0.000153,0.000208,0.000181,0.00014,0.000209,0.000129,0.000183,5.6e-05,0.000187,0.000235,0.000214,1e-04,0.000118,0.000286,0.000237,8.4e-05,6.5e-05,0.000212,6.6e-05,8.1e-05,0.000113,0.000314,0.000181,1e-04,5.9e-05,0.00019,0.000177,0.00017,0.000227,0.000182,8.2e-05,0.000164,0.000154,0.000109,0.000104,0.000183,0.00016,0.000143,0.000103,0.000101
0.00014,0.000137,0.000139,0.000108,4e-05,6.1e-05,6.4e-05,0.000148,9e-05,8.6e-05,0.000136,0.000126,0.000176,7.3e-05,6.1e-05,6.9e-05,4.1e-05,6.6e-05,6.3e-05,9.5e-05,8.7e-05,0.000118,4.3e-05,5.9e-05,4.3e-05,0.000262,0.000211,0.000202,0.000135,7.5e-05,0.000117,4.4e-05,9.8e-05,0.000117,0.000103,1e-05,7.5e-05,0.000129,9e-05,9.7e-05,0.000238,0.000251,0.000195,0.00017,0.000111,0.000105,0.00029,0.000193,6e-06,0.000133,0.000154,0.000249,0.000213,0.000292,0.000147,7.4e-05,7.2e-05,5.9e-05,5.4e-05,8.1e-05,8.3e-05,0.00016,0.000117,0.000103,0.000175,0.00011,0.000188,9.2e-05,0.000103,8.4e-05,6.4e-05,3.5e-05,0.00011,1.5e-05,7.2e-05,7.3e-05,0.000128,4.2e-05,2.9e-05,8.3e-05,0.00015,0.000274,0.000159,0.000197,7.4e-05,0.000212,8e-06,4e-05,2.1e-05,9.1e-05,0.000196,0.000109,0.00017,0.000182,9.5e-05,0.000126,0.000128,0.000184,7.1e-05,6.7e-05,8.9e-05,0.000204,8.8e-05,2.9e-05,0.000178,0.000174,8.1e-05,0.000185,8.3e-05,0.000137,9.9e-05,6.3e-05,8.8e-05,3.6e-05,7.5e-05,1.3e-05,0.000156,0.000143,0.000118,8e-05,1.4e-05
0.000163,0.000148,9.8e-05,7.5e-05,9e-05,9.6e-05,0.000133,0.000127,0.000183,8.5e-05,0.000116,4.7e-05,6.4e-05,0.000128,5.3e-05,8.4e-05,2.3e-05,3.2e-05,5.8e-05,0.000107,2e-04,3.9e-05,3.1e-05,5.1e-05,3.6e-05,2e-04,9.9e-05,0.00021,0.000161,0.000103,0.000166,0.000144,8e-05,0.000118,0.000139,0.000146,4.8e-05,7.4e-05,0.000158,0.000108,0.000165,0.00014,8.2e-05,0.000137,4.6e-05,4.8e-05,0.000167,6.7e-05,0.00014,0.000111,8.2e-05,0.000122,3.6e-05,0.000159,4.7e-05,6.2e-05,0.000153,0.000113,7.8e-05,4.5e-05,6.8e-05,2.6e-05,2.4e-05,1.1e-05,9.8e-05,3.6e-05,0.000238,9.6e-05,0.000105,8.7e-05,3.3e-05,0.000109,0.000105,9.1e-05,0.000135,6.4e-05,5.3e-05,2.5e-05,7.4e-05,7.9e-05,0.000213,0.000114,9.9e-05,6.2e-05,5.5e-05,9e-05,0.000158,0.000166,6.7e-05,4.1e-05,0.000185,8.8e-05,0.000119,0.000109,0.000129,1.2e-05,0.000133,7.2e-05,3.8e-05,9.4e-05,5.4e-05,0.000127,0.00014,7.8e-05,9.5e-05,5.6e-05,0.000117,5.4e-05,5e-05,0.000146,1.8e-05,8.5e-05,8.3e-05,9.7e-05,6.4e-05,7.3e-05,7.4e-05,4.7e-05,3.1e-05,0.000116,0.000118
0.000254,0.000138,0.00016,8.5e-05,2.3e-05,0.000166,4e-05,8e-05,0.000122,7.7e-05,0.000112,0.000102,3.1e-05,0.000101,2.4e-05,9.9e-05,4.5e-05,9.8e-05,4.4e-05,3.4e-05,0.000102,1.3e-05,0.000101,8.3e-05,9.7e-05,0.000252,0.000162,0.000121,0.000148,4.8e-05,0.000147,6.4e-05,0.000155,8.4e-05,9e-06,0.000205,0.00019,3.2e-05,4.6e-05,4.5e-05,0.000201,0.000171,0.000133,8.7e-05,0.000116,2.9e-05,9.9e-05,5.7e-05,9.6e-05,0.000112,8.5e-05,9.5e-05,5.5e-05,6.8e-05,0.000137,9.2e-05,0.000182,7.9e-05,8.8e-05,3e-05,9.9e-05,0.000117,6.6e-05,9.6e-05,4.9e-05,6.9e-05,0.000211,0.000175,0.000132,3.1e-05,7.8e-05,5.4e-05,2.6e-05,1.5e-05,0.000103,0.000204,0.000109,0.000102,0.000102,3.1e-05,0.000174,0.000207,0.000148,0.00016,0.000102,7.2e-05,0.000121,8.8e-05,8.1e-05,2.3e-05,0.000102,4.3e-05,0.000135,0.000139,9.5e-05,8.2e-05,0.000148,0.00016,0.000115,0.000133,0.000119,0.000186,2.6e-05,9.1e-05,3.7e-05,8.5e-05,0.000116,8.4e-05,0.000138,3e-05,8.8e-05,7.1e-05,1.8e-05,4e-05,7.5e-05,5.6e-05,3.7e-05,9.9e-05,6.4e-05,5.6e-05,9e-05
0.000149,0.000124,6.9e-05,4.4e-05,3.8e-05,8.4e-05,7.9e-05,1.6e-05,0.000105,8.5e-05,7.6e-05,1e-05,4.6e-05,9.1e-05,0.000106,7e-05,2.1e-05,5e-05,4.8e-05,5.3e-05,3.4e-05,6.4e-05,9.3e-05,2.5e-05,4.9e-05,8.9e-05,7.4e-05,0.000112,4.5e-05,4.5e-05,3e-05,2.7e-05,0.00011,0.000101,6.1e-05,0.000129,7e-05,9.7e-05,9.3e-05,2.8e-05,6.4e-05,6.1e-05,3.9e-05,5.5e-05,3.3e-05,4.2e-05,7.7e-05,7.2e-05,5.5e-05,6.2e-05,3.9e-05,4.4e-05,2.5e-05,1.3e-05,3.6e-05,3.2e-05,6.3e-05,3.7e-05,9.3e-05,6.8e-05,4e-06,7.6e-05,5.5e-05,6.4e-05,2.3e-05,4.9e-05,6.5e-05,8.5e-05,0.000109,0.000107,6.8e-05,2.6e-05,1.4e-05,0,4e-05,3.5e-05,7e-05,2.1e-05,6.5e-05,9.5e-05,5.6e-05,2.3e-05,6.9e-05,1.8e-05,2e-05,2.3e-05,4.6e-05,4.1e-05,6.3e-05,4.9e-05,0.000102,6.7e-05,9.3e-05,4.9e-05,5e-06,1.7e-05,4.3e-05,6e-06,0.000113,5.8e-05,1.2e-05,5.8e-05,9e-05,7.7e-05,4.8e-05,1.2e-05,3.5e-05,4.5e-05,2.8e-05,1.4e-05,4.4e-05,3e-05,3.3e-05,3.3e-05,2.1e-05,3.4e-05,1e-05,8.8e-05,9.6e-05,5.4e-05,4.9e-05
3.7e-05,7.7e-05,1.8e-05,2.4e-05,1.3e-05,4.1e-05,7e-06,4.5e-05,9.5e-05,8.7e-05,8.2e-05,9.2e-05,0.000105,0.000105,7e-05,2.3e-05,4e-06,3.1e-05,3e-05,4.1e-05,7e-05,7.6e-05,0.000119,0.000143,0.00015,0.00016,8.1e-05,7.7e-05,5e-05,7e-05,6.7e-05,3.8e-05,7.6e-05,9.2e-05,4.3e-05,0.000136,5.4e-05,1e-04,8.7e-05,6.9e-05,2.8e-05,7.5e-05,4.3e-05,7.9e-05,4.3e-05,7.7e-05,0.000134,1.9e-05,0.00011,0.000211,0.000163,8.4e-05,2.3e-05,3.8e-05,3.5e-05,6.8e-05,7e-05,2.9e-05,0.000104,4.6e-05,4.1e-05,7.4e-05,7.7e-05,4.2e-05,4.4e-05,2.2e-05,5.9e-05,0.000115,2.1e-05,3.4e-05,7e-06,1.7e-05,2e-05,3.2e-05,4.1e-05,3.4e-05,1.8e-05,7e-05,4.2e-05,4.9e-05,8.1e-05,0.000111,7.5e-05,6.7e-05,5.1e-05,3.5e-05,1.5e-05,3.6e-05,8.2e-05,4.4e-05,8.7e-05,3.7e-05,0.000104,9.3e-05,7e-05,8e-06,1e-05,2.7e-05,9.5e-05,9e-05,3.6e-05,6.1e-05,1.8e-05,9.9e-05,7.3e-05,2.5e-05,2.9e-05,1.6e-05,3.8e-05,3.5e-05,3.3e-05,6.3e-05,6.6e-05,4e-05,3e-05,3e-05,4.4e-05,0.000101,7.4e-05,7.3e-05,9.2e-05
3.4e-05,2.3e-05,3.1e-05,2e-05,4.4e-05,3.2e-05,2e-05,3.4e-05,1.4e-05,5.3e-05,5e-05,1.9e-05,4.1e-05,4.3e-05,1.2e-05,2.6e-05,1.2e-05,1.3e-05,1.9e-05,7.1e-05,9.3e-05,9.5e-05,5.4e-05,0.000108,5.7e-05,4.9e-05,5.8e-05,4.5e-05,3.8e-05,8.2e-05,4.9e-05,4.5e-05,6.2e-05,3.2e-05,7e-05,4.7e-05,3.5e-05,5.9e-05,3.8e-05,9e-06,3e-05,3.7e-05,3.9e-05,7.1e-05,2.6e-05,6.7e-05,2.4e-05,5e-05,0.000107,8.2e-05,5.4e-05,4.7e-05,7e-06,4.4e-05,3.1e-05,7.8e-05,4.8e-05,4.2e-05,5.5e-05,6.5e-05,6.4e-05,7e-05,3.2e-05,1.4e-05,2.2e-05,5.3e-05,8.2e-05,2.8e-05,5.7e-05,4.4e-05,7e-06,3e-05,3.8e-05,6.9e-05,4e-05,4.8e-05,2.3e-05,5e-05,4.2e-05,3.8e-05,3.4e-05,7.1e-05,6e-05,2.5e-05,1.3e-05,2.6e-05,3.4e-05,2e-05,7.8e-05,4.6e-05,6e-05,6.9e-05,1.7e-05,9e-06,4.5e-05,5.2e-05,4.3e-05,2.1e-05,4.4e-05,7.6e-05,5.3e-05,4.9e-05,4.4e-05,4.8e-05,2.7e-05,1.2e-05,2.1e-05,5.3e-05,4.9e-05,6.8e-05,7.6e-05,1.2e-05,2.1e-05,2.1e-05,9e-06,2e-05,4.6e-05,0.000101,6.1e-05,6.7e-05,3.1e-05
5.5e-05,5.5e-05,5.7e-05,1.3e-05,2.9e-05,4e-06,2.3e-05,1.5e-05,5.7e-05,4.6e-05,2.8e-05,3.3e-05,1.9e-05,1.6e-05,3e-05,2.1e-05,1.1e-05,1.4e-05,1.4e-05,5.2e-05,1.9e-05,1.6e-05,3.6e-05,3.4e-05,2.4e-05,4e-06,4.7e-05,1.8e-05,3.8e-05,5.2e-05,3.9e-05,4.2e-05,2.4e-05,3.5e-05,4.8e-05,8e-06,1.4e-05,3e-06,3e-05,3.9e-05,5.6e-05,4.1e-05,1.9e-05,2.6e-05,1.8e-05,4.8e-05,4.5e-05,1.7e-05,5.3e-05,8.2e-05,2.5e-05,9e-06,4.3e-05,6.2e-05,2.2e-05,6.8e-05,4.3e-05,2.4e-05,3.9e-05,1.2e-05,3.3e-05,2.8e-05,3.5e-05,5.2e-05,4.5e-05,1.2e-05,6.6e-05,6.6e-05,4.6e-05,1.1e-05,3.3e-05,2.8e-05,2.7e-05,3.9e-05,1.7e-05,6.9e-05,5.6e-05,3.2e-05,4e-06,8e-06,5.4e-05,2.8e-05,3.4e-05,4.7e-05,3.6e-05,9e-06,4.4e-05,4.4e-05,5e-05,2.4e-05,3.2e-05,2e-05,1.2e-05,3.4e-05,2.6e-05,6e-06,3.5e-05,3.9e-05,8.2e-05,2.5e-05,1.5e-05,4.6e-05,2.5e-05,1.5e-05,2.3e-05,1.9e-05,1e-05,5.7e-05,3.2e-05,5.2e-05,3.1e-05,4.9e-05,1e-05,2.3e-05,1.4e-05,1.4e-05,4e-05,1.5e-05,1.6e-05,1.4e-05,3.3e-05
4.8e-05,4.3e-05,1e-05,2.8e-05,2.5e-05,2e-05,4.4e-05,1.9e-05,6.9e-05,1.7e-05,1.5e-05,3.5e-05,1.4e-05,2.2e-05,2.2e-05,1.1e-05,2e-05,1.8e-05,2.9e-05,1.3e-05,1.6e-05,3e-05,6e-05,4.9e-05,1e-05,1.6e-05,3.7e-05,3.3e-05,6e-06,5.7e-05,5.6e-05,1.9e-05,2.1e-05,3e-06,3.5e-05,7e-06,3.5e-05,3.3e-05,4.6e-05,4.8e-05,2.6e-05,2.2e-05,4e-05,8.4e-05,3e-05,2.4e-05,5.1e-05,7.7e-05,5.5e-05,4.7e-05,4e-06,1e-05,5.2e-05,3.4e-05,3.1e-05,4e-05,6.5e-05,5e-05,3.5e-05,3.1e-05,3.2e-05,5.2e-05,5.9e-05,2.7e-05,1.6e-05,1.7e-05,3.1e-05,2.9e-05,2.4e-05,5.1e-05,2.8e-05,3.4e-05,4.8e-05,2.2e-05,7e-06,5.1e-05,2.4e-05,4.9e-05,3.4e-05,9e-06,3.2e-05,1.9e-05,2.1e-05,1.8e-05,3e-05,3.7e-05,2e-05,2.7e-05,2.5e-05,1.2e-05,2.8e-05,4.4e-05,2.8e-05,3.5e-05,2.1e-05,2.3e-05,2.4e-05,5.1e-05,2.7e-05,1.5e-05,1.1e-05,1.9e-05,1.5e-05,1.1e-05,1.2e-05,2.5e-05,1.1e-05,4.5e-05,4.7e-05,1.9e-05,1.3e-05,1.8e-05,1.5e-05,3.3e-05,1.3e-05,1e-05,3.2e-05,3.5e-05,6e-06,3.4e-05,3e-05
2.9e-05,3.7e-05,1.1e-05,1.3e-05,1e-05,3e-06,1.8e-05,2.1e-05,3.1e-05,2.9e-05,1.7e-05,1e-05,1e-05,3.2e-05,2.4e-05,1.7e-05,1.5e-05,9e-06,2.7e-05,1.1e-05,6e-06,3.6e-05,1.6e-05,1.6e-05,2.4e-05,1.5e-05,3.1e-05,1.4e-05,2.1e-05,4.4e-05,4e-06,5e-06,1.9e-05,1.6e-05,4.1e-05,3e-05,1.9e-05,2.6e-05,3e-06,4e-06,5e-06,1.8e-05,3.2e-05,3.4e-05,1.1e-05,2.7e-05,2.4e-05,3.7e-05,1.5e-05,4.2e-05,1.1e-05,3.1e-05,3.5e-05,2.1e-05,9e-06,2.2e-05,3.5e-05,1.8e-05,1.2e-05,4.3e-05,1.7e-05,4.4e-05,3.2e-05,1.2e-05,1.7e-05,2.1e-05,3.2e-05,1.6e-05,1.9e-05,3.4e-05,2.8e-05,9e-06,2.2e-05,1.7e-05,8e-06,2.4e-05,1.5e-05,2.8e-05,2.1e-05,2.1e-05,2.2e-05,6e-06,2.9e-05,2.5e-05,3.3e-05,2.5e-05,1.1e-05,3.1e-05,1.6e-05,1.7e-05,8e-06,4.4e-05,2e-05,9e-06,1.5e-05,3.1e-05,3.5e-05,2e-05,1.4e-05,4e-06,8e-06,9e-06,1.1e-05,1e-05,2.6e-05,1.9e-05,1.1e-05,2.8e-05,1.5e-05,1.5e-05,1.3e-05,2.5e-05,2.6e-05,1.3e-05,5e-06,3e-06,2.4e-05,1.1e-05,1.7e-05,2.4e-05,1.7e-05
2.4e-05,2.2e-05,4e-06,1.4e-05,6e-06,3e-06,1.5e-05,3e-06,1.7e-05,1.4e-05,6e-06,8e-06,2.3e-05,1.7e-05,2.2e-05,6e-06,1.7e-05,7e-06,9e-06,1.4e-05,1e-06,1.9e-05,3.2e-05,1.6e-05,5e-06,7e-06,2.5e-05,2.8e-05,1e-05,3e-05,2.7e-05,9e-06,1e-05,6e-06,3.1e-05,1.5e-05,1.2e-05,8e-06,9e-06,9e-06,1.5e-05,1.2e-05,2.3e-05,5.7e-05,1.7e-05,7e-06,3.4e-05,7e-06,1.7e-05,3.3e-05,1.5e-05,2.1e-05,2.3e-05,1.7e-05,1.2e-05,1.3e-05,2.3e-05,4e-06,8e-06,3.5e-05,2.7e-05,3.6e-05,2.2e-05,1.7e-05,1.7e-05,1.6e-05,3.7e-05,4.1e-05,9e-06,1.6e-05,1.3e-05,1.9e-05,1.5e-05,2e-05,1.9e-05,1.3e-05,9e-06,1.7e-05,7e-06,1.6e-05,2.5e-05,1.4e-05,1.4e-05,4e-06,2.6e-05,1.8e-05,1.3e-05,2.3e-05,2e-05,8e-06,5e-06,3.9e-05,1.9e-05,6e-06,1.7e-05,1.1e-05,1.8e-05,1.6e-05,1e-05,6e-06,9e-06,6e-06,3e-06,1.4e-05,2.7e-05,2.8e-05,1.9e-05,2.9e-05,1.3e-05,2.1e-05,1e-06,1.7e-05,2.2e-05,6e-06,6e-06,3e-06,8e-06,1.7e-05,1.2e-05,2.6e-05,2.1e-05
2.3e-05,2.2e-05,6e-06,1.7e-05,1.3e-05,6e-06,2e-05,1.5e-05,1.3e-05,1.3e-05,9e-06,1.9e-05,2.4e-05,2.8e-05,3.1e-05,2.1e-05,2.6e-05,1e-05,2e-05,1.2e-05,9e-06,5e-06,2.1e-05,5e-06,5e-06,8e-06,2.6e-05,3.5e-05,2.8e-05,2.5e-05,1.5e-05,1.3e-05,1.5e-05,1.3e-05,2.4e-05,1.8e-05,1.6e-05,1.4e-05,1.9e-05,4e-06,1.2e-05,2e-05,1.1e-05,5.6e-05,7e-06,9e-06,2.4e-05,5e-06,3e-06,3.7e-05,1.1e-05,8e-06,1.6e-05,1.4e-05,1e-05,1.2e-05,1.7e-05,5e-06,1.4e-05,2.2e-05,1.7e-05,2.7e-05,9e-06,8e-06,2.3e-05,2.3e-05,1.8e-05,3.3e-05,6e-06,6e-06,2.7e-05,1.3e-05,2.9e-05,1.4e-05,1.4e-05,9e-06,5e-06,8e-06,1e-06,1.7e-05,1.7e-05,6e-06,1.3e-05,9e-06,2.4e-05,9e-06,1.3e-05,2.2e-05,1.6e-05,1.9e-05,7e-06,3.3e-05,1.9e-05,1.5e-05,3e-06,1e-05,2.3e-05,2e-05,8e-06,1.2e-05,6e-06,6e-06,1.2e-05,1.9e-05,1.6e-05,1.7e-05,1.1e-05,2.9e-05,1.3e-05,2e-06,8e-06,1.6e-05,1.9e-05,2.5e-05,1.3e-05,4e-06,5e-06,1.4e-05,4e-06,1.7e-05,1.4e-05
4.7e-05,9e-06,2.6e-05,1.2e-05,2e-05,6e-06,4e-06,9e-06,1.4e-05,2.5e-05,2.6e-05,1e-05,3.7e-05,1.4e-05,2.5e-05,1.1e-05,2.2e-05,1.5e-05,1.3e-05,1.8e-05,6e-06,1.2e-05,1.9e-05,3.1e-05,1.2e-05,1.5e-05,1.7e-05,8e-06,2e-05,2.1e-05,1e-05,4e-06,1.1e-05,2.2e-05,3.4e-05,1.7e-05,1.8e-05,1.2e-05,1.1e-05,1.7e-05,3.3e-05,2.7e-05,2.9e-05,2.2e-05,1.4e-05,2.2e-05,1.9e-05,6e-06,2.5e-05,6e-06,1.3e-05,2.2e-05,3e-05,2e-05,2.1e-05,9e-06,1.2e-05,2.2e-05,1.5e-05,6e-06,2.5e-05,3.2e-05,6e-06,1.8e-05,1.3e-05,1.9e-05,3.6e-05,5e-06,2.1e-05,1.5e-05,3.1e-05,8e-06,4e-06,2.1e-05,2.3e-05,1.1e-05,1.6e-05,6e-06,1.2e-05,2.2e-05,1.2e-05,1.5e-05,6e-06,7e-06,2.7e-05,1.5e-05,3.3e-05,2.4e-05,2.3e-05,1.2e-05,7e-06,2.8e-05,1.8e-05,2e-05,3e-06,1.5e-05,2.2e-05,3.1e-05,6e-06,2.1e-05,1.3e-05,2e-05,4e-06,1.6e-05,2.5e-05,1.8e-05,7e-06,2.8e-05,2.9e-05,2.4e-05,1.9e-05,1.9e-05,2.4e-05,1e-05,1.3e-05,1.7e-05,4e-06,1.1e-05,1e-05,2.1e-05,4e-06
8e-05,3.9e-05,3.1e-05,2.1e-05,3.5e-05,2.9e-05,1.3e-05,2.3e-05,1.2e-05,2.5e-05,4.7e-05,3.9e-05,3.2e-05,3.4e-05,1.8e-05,1.9e-05,1.2e-05,6e-06,2.6e-05,2.3e-05,2.7e-05,4.5e-05,2.6e-05,1.6e-05,4e-06,4.1e-05,1.5e-05,1.2e-05,2.8e-05,1.6e-05,2.1e-05,1.9e-05,3.9e-05,4.3e-05,2.4e-05,2.7e-05,3e-05,3.6e-05,3.2e-05,3.4e-05,2.4e-05,3.2e-05,2e-05,2.6e-05,1.2e-05,2.7e-05,4.7e-05,2.4e-05,3.6e-05,3.8e-05,6e-06,1.7e-05,4.9e-05,2.3e-05,1e-05,3.1e-05,8e-06,1.8e-05,2.5e-05,1.2e-05,1.5e-05,3.6e-05,2.3e-05,5e-06,1.1e-05,3.4e-05,3.5e-05,7e-06,2.5e-05,2.6e-05,3.6e-05,1.1e-05,2.4e-05,2.2e-05,9e-06,1.6e-05,2.3e-05,1.7e-05,1.1e-05,3.7e-05,3.6e-05,4.6e-05,3e-05,9e-06,1.6e-05,2e-05,3.2e-05,2.4e-05,2.1e-05,2.1e-05,1.9e-05,3e-05,2.8e-05,2e-05,2.4e-05,1e-05,1.8e-05,1.5e-05,2.3e-05,3.2e-05,2.8e-05,2e-05,1.3e-05,2.8e-05,2.1e-05,2.9e-05,1.2e-05,2.3e-05,1.2e-05,1.2e-05,7e-06,8e-06,1.2e-05,3.7e-05,1.5e-05,2.3e-05,2.1e-05,1.8e-05,2e-05,2.2e-05,2.2e-05
3.3e-05,3.9e-05,4.6e-05,4.2e-05,3.5e-05,2.9e-05,3.6e-05,1.3e-05,2.9e-05,3.7e-05,2e-05,1.3e-05,3.3e-05,1.2e-05,1.9e-05,1.2e-05,3e-06,4e-06,4e-05,5.3e-05,3e-05,2.9e-05,2.9e-05,1.7e-05,1.9e-05,5.4e-05,7.4e-05,3.8e-05,2.5e-05,1.9e-05,1.3e-05,2.7e-05,3.2e-05,1.9e-05,5.4e-05,7.9e-05,2.2e-05,4e-05,5.2e-05,2.6e-05,1.4e-05,2.6e-05,2.1e-05,3.3e-05,2.5e-05,4.6e-05,1.6e-05,1.4e-05,2.2e-05,4e-05,2.2e-05,3.5e-05,6.9e-05,5.8e-05,3.9e-05,3.9e-05,4.3e-05,3.4e-05,2.2e-05,4.2e-05,4e-05,4.6e-05,1.9e-05,1.7e-05,1e-05,3.2e-05,3.8e-05,6e-06,2e-06,2.2e-05,2.9e-05,4.5e-05,3.8e-05,3.3e-05,1.6e-05,3.1e-05,3.4e-05,9e-06,1.3e-05,4.9e-05,5.9e-05,1e-05,4e-05,3.9e-05,8e-06,4e-06,1.2e-05,2.7e-05,1.5e-05,9e-06,3.5e-05,6e-05,4.8e-05,4.6e-05,2.3e-05,2.9e-05,3.7e-05,3.5e-05,3e-05,4.9e-05,1.8e-05,2.4e-05,3.7e-05,8e-06,8e-06,5e-05,3.2e-05,1.3e-05,3.9e-05,1.8e-05,2.6e-05,1.7e-05,3e-06,2.4e-05,3.6e-05,2.7e-05,1.4e-05,2e-06,9e-06,3.1e-05,1.4e-05
8e-06,3.2e-05,5.1e-05,2.5e-05,3.3e-05,1.6e-05,1.7e-05,2.3e-05,9e-06,2.7e-05,6e-06,9e-06,5e-06,5e-06,1e-05,1.9e-05,1.5e-05,1e-05,4.4e-05,2.9e-05,1.9e-05,2.7e-05,1.3e-05,1.3e-05,1.8e-05,2.2e-05,4.7e-05,3.6e-05,3.7e-05,8e-06,1.7e-05,2.2e-05,6e-06,1.4e-05,1.7e-05,5.5e-05,3.5e-05,3e-05,1.4e-05,4e-06,2.3e-05,1.3e-05,1.1e-05,7e-06,3.6e-05,3e-06,3.9e-05,1.7e-05,2e-05,3.8e-05,2.5e-05,1.5e-05,2.9e-05,3e-06,9e-06,3.2e-05,1.2e-05,4e-06,1.9e-05,3.7e-05,1.6e-05,8e-06,2e-06,2e-05,8e-06,1.2e-05,2.7e-05,3.2e-05,2.5e-05,9e-06,1.4e-05,2.4e-05,2.7e-05,5e-06,2e-05,2.4e-05,1.2e-05,1.5e-05,2.8e-05,7e-06,1.9e-05,1.9e-05,3.3e-05,3e-05,3.9e-05,2.3e-05,2.4e-05,2.8e-05,1.1e-05,1.4e-05,2.8e-05,6e-06,5e-06,1.3e-05,2.3e-05,3.6e-05,1.1e-05,8e-06,7e-06,3e-05,1.8e-05,2.9e-05,9e-06,1.4e-05,2.1e-05,2.1e-05,9e-06,1.2e-05,4e-05,4e-06,2.6e-05,1.1e-05,1.2e-05,4e-06,2.4e-05,1.2e-05,9e-06,5e-06,6e-06,3.3e-05,3.6e-05
1.5e-05,3.8e-05,3.3e-05,7e-06,9e-06,6e-06,9e-06,1.1e-05,1.2e-05,2.8e-05,1.5e-05,7e-06,2.6e-05,2.5e-05,4e-06,2.8e-05,1.2e-05,1.4e-05,1.9e-05,6e-06,1e-06,1e-05,6e-06,1e-05,1.5e-05,1.8e-05,1.3e-05,1.5e-05,8e-06,1.5e-05,1.5e-05,2.8e-05,1.7e-05,9e-06,1.3e-05,3.6e-05,4e-06,2.2e-05,1.5e-05,1e-06,1.4e-05,1e-05,2e-05,3.8e-05,9e-06,9e-06,2.7e-05,6e-06,1e-05,1.2e-05,2.2e-05,1e-06,1.6e-05,2.3e-05,1.8e-05,2e-05,9e-06,3e-06,2e-05,1e-05,2.4e-05,3e-05,1.2e-05,9e-06,5e-06,7e-06,3.7e-05,2.1e-05,1.1e-05,1e-05,8e-06,1e-05,1.6e-05,2.6e-05,6e-06,3e-06,1.2e-05,1.9e-05,3e-06,5e-06,1.2e-05,7e-06,2.5e-05,8e-06,1.8e-05,1e-05,2e-05,1.5e-05,1.2e-05,7e-06,1.3e-05,1.5e-05,1e-05,3e-06,1.8e-05,1.3e-05,2.2e-05,1.7e-05,8e-06,1.4e-05,1.1e-05,1.9e-05,5e-06,1.2e-05,1.4e-05,6e-06,1e-05,2e-06,1.6e-05,1.2e-05,2e-05,9e-06,4e-06,1e-06,1.2e-05,1.1e-05,8e-06,8e-06,1e-05,2e-05,8e-06
2.3e-05,1.9e-05,1.6e-05,1.1e-05,6e-06,3e-06,1.6e-05,8e-06,6e-06,2.2e-05,3e-06,1.2e-05,1.9e-05,1.8e-05,4e-06,2e-05,2e-06,7e-06,9e-06,1e-05,7e-06,1.2e-05,5e-06,1.2e-05,4e-06,1.4e-05,3e-06,2.1e-05,1.7e-05,1.7e-05,6e-06,1.4e-05,1.2e-05,3e-06,2.2e-05,2.1e-05,1e-05,1.9e-05,1.8e-05,5e-06,3e-06,6e-06,1.6e-05,3.1e-05,4e-06,5e-06,1.3e-05,1e-05,4e-06,2.4e-05,2e-05,1.2e-05,9e-06,1.7e-05,4e-06,7e-06,1.2e-05,3e-06,1.6e-05,1.2e-05,2e-05,2.9e-05,8e-06,8e-06,6e-06,7e-06,2.7e-05,2.7e-05,5e-06,9e-06,1.7e-05,4e-06,7e-06,1.7e-05,1.3e-05,3e-06,5e-06,1.4e-05,1.6e-05,4e-06,2e-05,6e-06,1.6e-05,6e-06,1.9e-05,1.6e-05,1.2e-05,1.7e-05,6e-06,9e-06,8e-06,2.2e-05,1.2e-05,7e-06,1.7e-05,6e-06,6e-06,3e-06,7e-06,3e-06,2e-06,1e-05,1.2e-05,7e-06,1.5e-05,1.1e-05,2e-06,6e-06,1.3e-05,6e-06,1.4e-05,9e-06,4e-06,3e-06,4e-06,4e-06,2e-06,4e-06,6e-06,3e-06,1.1e-05
2e-05,2.1e-05,1.9e-05,2e-06,5e-06,5e-06,1.3e-05,3e-06,1e-06,1.8e-05,7e-06,1.2e-05,1.4e-05,1.1e-05,1e-05,1.8e-05,9e-06,5e-06,1.2e-05,1.3e-05,5e-06,1.6e-05,3e-06,1e-05,7e-06,7e-06,7e-06,1.5e-05,1.1e-05,1.7e-05,9e-06,1.8e-05,1.4e-05,1e-06,1.8e-05,2.1e-05,6e-06,1.8e-05,8e-06,9e-06,9e-06,6e-06,1.4e-05,2.9e-05,6e-06,8e-06,1.9e-05,4e-06,6e-06,1.9e-05,1.7e-05,5e-06,2e-06,1.4e-05,5e-06,1e-06,9e-06,4e-06,3e-06,2.2e-05,1.6e-05,2.5e-05,1.5e-05,6e-06,5e-06,2e-06,1.8e-05,2.4e-05,8e-06,9e-06,1.8e-05,8e-06,1e-05,1.1e-05,8e-06,6e-06,5e-06,1.3e-05,1e-05,1.2e-05,1.7e-05,6e-06,1.3e-05,4e-06,1.2e-05,1.5e-05,1e-05,2.1e-05,3e-06,8e-06,9e-06,2.6e-05,7e-06,5e-06,2.1e-05,0,3e-06,8e-06,1.1e-05,6e-06,2e-06,6e-06,1.3e-05,4e-06,1.5e-05,1.4e-05,6e-06,8e-06,1.2e-05,8e-06,1.4e-05,1.1e-05,2e-06,1e-05,4e-06,1e-06,4e-06,3e-06,3e-06,1.2e-05,1.9e-05
1.9e-05,2.3e-05,1.8e-05,3e-06,1e-06,3e-06,1.4e-05,1e-06,1e-06,2.2e-05,6e-06,1.1e-05,9e-06,1.4e-05,8e-06,1.2e-05,7e-06,7e-06,6e-06,1e-05,3e-06,1.4e-05,3e-06,8e-06,9e-06,3e-06,3e-06,1.6e-05,1.4e-05,1.4e-05,5e-06,1.1e-05,1.1e-05,2e-06,2.3e-05,1.4e-05,9e-06,9e-06,1.1e-05,5e-06,1.2e-05,1e-06,1.5e-05,3e-05,6e-06,6e-06,1.8e-05,4e-06,6e-06,1.6e-05,1e-05,5e-06,6e-06,1.3e-05,5e-06,5e-06,5e-06,8e-06,1e-05,9e-06,1.7e-05,1.9e-05,9e-06,1.1e-05,3e-06,6e-06,1.7e-05,2.2e-05,3e-06,6e-06,1.4e-05,6e-06,7e-06,7e-06,9e-06,4e-06,7e-06,9e-06,1.2e-05,1.2e-05,1.7e-05,1.1e-05,1e-05,4e-06,1.2e-05,1.5e-05,9e-06,1.9e-05,2e-06,7e-06,6e-06,2.3e-05,8e-06,6e-06,7e-06,6e-06,6e-06,4e-06,1e-05,3e-06,3e-06,9e-06,8e-06,8e-06,1.4e-05,1e-05,4e-06,1.1e-05,1.2e-05,1e-06,1.2e-05,5e-06,4e-06,7e-06,1e-06,4e-06,3e-06,1e-06,2e-06,1.1e-05,1.7e-05
1.2e-05,2.4e-05,1.5e-05,2e-06,4e-06,4e-06,1.4e-05,5e-06,3e-06,2.3e-05,8e-06,8e-06,1.5e-05,1.1e-05,1.2e-05,1.8e-05,6e-06,4e-06,1e-05,9e-06,1e-06,9e-06,3e-06,6e-06,9e-06,4e-06,8e-06,9e-06,9e-06,1.5e-05,9e-06,1.9e-05,8e-06,8e-06,1.7e-05,1.3e-05,1e-05,1.6e-05,1.1e-05,1e-06,8e-06,1e-06,1.4e-05,2.7e-05,3e-06,3e-06,2e-05,3e-06,9e-06,1.9e-05,1.6e-05,2e-06,2e-06,1.1e-05,5e-06,7e-06,1e-05,4e-06,1.8e-05,1.4e-05,1.6e-05,1.4e-05,1.1e-05,6e-06,7e-06,2e-06,2e-05,2e-05,0,9e-06,1.1e-05,5e-06,1e-05,1.6e-05,6e-06,1e-06,5e-06,8e-06,1e-05,1.1e-05,1.5e-05,1e-05,1.7e-05,4e-06,1.6e-05,1.1e-05,5e-06,1.8e-05,2e-06,9e-06,6e-06,2.2e-05,1e-05,5e-06,5e-06,6e-06,6e-06,1.1e-05,1.1e-05,3e-06,2e-06,1e-05,5e-06,4e-06,1.4e-05,1e-05,2e-06,6e-06,2.1e-05,5e-06,1.3e-05,8e-06,2e-06,1e-05,4e-06,7e-06,3e-06,1e-06,1e-06,1.4e-05,1.2e-05
1.6e-05,2.3e-05,1.7e-05,1e-06,5e-06,2e-06,1.6e-05,2e-06,3e-06,1.4e-05,3e-06,4e-06,1.2e-05,1.2e-05,1.2e-05,1.6e-05,2e-06,1e-06,1e-05,8e-06,1e-06,7e-06,2e-06,7e-06,8e-06,5e-06,4e-06,1e-05,1.3e-05,1.4e-05,1.1e-05,1.5e-05,1.1e-05,8e-06,2.2e-05,1.6e-05,1.2e-05,8e-06,9e-06,5e-06,1e-05,3e-06,1e-05,2.4e-05,4e-06,6e-06,2.1e-05,2e-06,4e-06,1.6e-05,1.3e-05,2e-06,1e-06,9e-06,6e-06,3e-06,7e-06,2e-06,1.1e-05,1.3e-05,1.6e-05,1.6e-05,8e-06,4e-06,5e-06,1e-06,2.2e-05,2.2e-05,1e-06,6e-06,1e-05,2e-06,1.3e-05,9e-06,4e-06,2e-06,4e-06,7e-06,1e-05,9e-06,1.9e-05,1.1e-05,1.4e-05,2e-06,1.5e-05,1.3e-05,8e-06,2.1e-05,1e-06,8e-06,6e-06,2.3e-05,1.2e-05,1e-06,6e-06,7e-06,3e-06,9e-06,7e-06,3e-06,1e-06,6e-06,7e-06,4e-06,1.3e-05,1e-05,2e-06,6e-06,1.6e-05,3e-06,1.2e-05,1e-05,5e-06,8e-06,4e-06,2e-06,1e-06,1e-06,3e-06,1.6e-05,1.6e-05
1.3e-05,2.4e-05,1.9e-05,2e-06,2e-06,1e-06,1.5e-05,3e-06,2e-06,1.2e-05,5e-06,6e-06,1.2e-05,1.4e-05,1e-05,1.7e-05,6e-06,3e-06,1.1e-05,6e-06,1e-06,9e-06,0,1.1e-05,7e-06,4e-06,2e-06,1.1e-05,1.2e-05,1e-05,9e-06,1.3e-05,1.2e-05,6e-06,1.7e-05,1.9e-05,8e-06,9e-06,1.1e-05,3e-06,9e-06,0,1.1e-05,2.6e-05,3e-06,3e-06,1.9e-05,1e-06,7e-06,1.5e-05,1e-05,3e-06,4e-06,6e-06,2e-06,3e-06,6e-06,3e-06,1e-05,1.4e-05,1.5e-05,1.8e-05,7e-06,6e-06,3e-06,1e-06,2.1e-05,1.7e-05,4e-06,5e-06,1.3e-05,1e-06,9e-06,9e-06,4e-06,1e-06,3e-06,5e-06,8e-06,9e-06,1.9e-05,9e-06,1.2e-05,2e-06,1.3e-05,1.2e-05,7e-06,2e-05,2e-06,8e-06,4e-06,2.3e-05,1.2e-05,4e-06,6e-06,5e-06,4e-06,9e-06,9e-06,1e-06,1e-06,5e-06,9e-06,5e-06,1.4e-05,9e-06,1e-06,7e-06,1.6e-05,6e-06,1.1e-05,8e-06,5e-06,9e-06,3e-06,2e-06,2e-06,2e-06,2e-06,1.2e-05,1e-05
1.7e-05,2.2e-05,1.7e-05,3e-06,4e-06,1e-06,1.5e-05,2e-06,1e-06,1.3e-05,5e-06,6e-06,1.2e-05,1.3e-05,1.1e-05,1.6e-05,2e-06,2e-06,1.2e-05,6e-06,1e-06,8e-06,1e-06,7e-06,5e-06,4e-06,2e-06,9e-06,1.2e-05,1e-05,8e-06,1.3e-05,1.2e-05,4e-06,1.4e-05,1.7e-05,9e-06,9e-06,1.2e-05,6e-06,9e-06,1e-06,1.2e-05,2.5e-05,1e-06,2e-06,2e-05,1e-06,6e-06,1.5e-05,1.2e-05,3e-06,1e-06,6e-06,1e-06,1e-06,8e-06,2e-06,9e-06,1.3e-05,1.5e-05,1.7e-05,6e-06,5e-06,4e-06,2e-06,2e-05,1.7e-05,1e-06,7e-06,1.2e-05,2e-06,9e-06,1e-05,3e-06,1e-06,0,5e-06,9e-06,8e-06,1.8e-05,7e-06,1.2e-05,2e-06,1.3e-05,1.3e-05,8e-06,1.8e-05,1e-06,6e-06,5e-06,2.3e-05,9e-06,3e-06,5e-06,5e-06,4e-06,8e-06,7e-06,3e-06,3e-06,6e-06,9e-06,4e-06,1.6e-05,9e-06,0,8e-06,1.4e-05,6e-06,1.2e-05,9e-06,2e-06,7e-06,2e-06,1e-06,1e-06,1e-06,2e-06,1.1e-05,1e-05
