4e-06,-3e-06,-0.005456,-0.031815,-0.013285,-0.001674,-0.002715,-0.067867,-0.201842,-0.211227,-0.184661,-0.151004,-0.154183,-0.146015,-0.097319,-0.052613,-0.019587,-0.004348,-0.001542,-0.000314,-0.000579,5.2e-05,-0.000731,-0.001139,-0.000136,6e-06,6.6e-05,7.3e-05
3.9e-05,2.5e-05,-0.0044,-0.026639,-0.0111,-0.000541,-0.000417,-0.016813,-0.054507,-0.066008,0.014715,0.108956,0.142852,0.114365,0.071293,0.056553,0.023489,0.004564,0.001536,0.000114,-0.000206,-0.000144,-0.000525,-0.000876,-9.1e-05,5.1e-05,7.5e-05,8.5e-05
2e-05,1.4e-05,0.002455,0.014694,0.005707,0.000233,-0.000979,-0.018045,-0.033274,-0.048542,-0.03838,-0.008458,0.004907,0.002144,0.0016,-0.002325,-0.003574,-0.000487,0.000209,0.000187,3e-06,5.8e-05,0.000529,0.00057,0.000203,0.000121,7.9e-05,7e-05
-6e-06,0,0.00476,0.030569,0.012971,0.000639,-0.001174,-0.01897,-0.021787,0.008799,-0.047115,-0.116544,-0.145044,-0.117678,-0.078944,-0.057417,-0.02335,-0.004834,-0.001424,2.7e-05,0.000412,-1e-05,0.000831,0.001211,0.000355,0.000129,5.6e-05,5.5e-05
3.9e-05,3.3e-05,0.000819,0.0045,0.002254,0.000813,0.001678,0.047883,0.171197,0.226726,0.204112,0.131427,0.111066,0.106211,0.075823,0.048208,0.021022,0.004193,0.001579,0.000479,0.001376,0.001151,0.000237,0.00042,0.000193,8.8e-05,7.2e-05,7.6e-05
4.6e-05,2.7e-05,-0.004255,-0.026842,-0.011182,-0.000711,-6e-04,0.014056,0.079567,0.080182,0.06881,0.054553,0.0684,0.061432,0.045388,0.023584,0.00638,0.0016,0.000985,-2e-06,-0.001138,-0.000964,-0.000529,-0.00072,-8.9e-05,-1e-06,2.9e-05,5.1e-05
-2e-06,-1e-06,-0.002943,-0.018062,-0.007691,-0.00044,-0.001672,-0.061501,-0.182906,-0.220806,-0.204917,-0.154294,-0.139612,-0.12941,-0.097387,-0.060297,-0.023722,-0.004783,-0.001815,-0.000367,-0.000421,-0.000147,-0.000321,-0.000708,-1e-04,2.5e-05,3.9e-05,4.3e-05
6e-06,1.9e-05,0.002588,0.015802,0.00657,0.000407,0.000167,-0.014298,-0.089395,-0.094776,-0.043376,0.021478,0.018874,0.006699,0.001487,0.016949,0.012012,0.001844,0.000224,0.000292,0.000192,0.000153,0.000456,0.000411,0.000152,0.000105,5.4e-05,4.9e-05
2.3e-05,2.7e-05,0.003962,0.024094,0.010123,0.000558,0.001357,0.042526,0.089399,0.076092,0.075742,0.082861,0.088593,0.077606,0.062633,0.035267,0.010867,0.002789,0.001374,0.000749,0.00108,0.000678,0.000598,0.000879,0.000266,9.4e-05,4.1e-05,4.4e-05
-1e-05,-9e-06,-0.00026,-0.001795,-7e-04,7.9e-05,0.00092,0.013272,0.047713,0.040863,-0.013931,-0.063774,-0.067267,-0.044807,-0.034833,-0.040656,-0.019503,-0.003083,-0.000794,0.00031,0.000692,0.000202,-6.4e-05,0.000135,0.000116,2.9e-05,2.3e-05,3e-05
-6e-06,-7e-06,-0.003831,-0.022411,-0.009113,-0.000567,-2.6e-05,0.001101,0.038043,0.088878,0.074218,0.024882,-0.009211,-0.00692,-0.007858,0.002817,0.006266,0.00028,-0.000119,1.1e-05,0.000195,0.000417,-0.000326,-0.000492,-6.5e-05,-3e-06,2.7e-05,3.3e-05
3.3e-05,2.6e-05,-0.001072,-0.008136,-0.003652,-0.000199,-0.000707,0.013688,0.040379,0.049376,0.06132,0.064167,0.06624,0.043859,0.044521,0.038573,0.014818,0.002843,0.001188,-3.4e-05,-0.001464,-0.001045,5.8e-05,-0.000185,-5.3e-05,2.3e-05,2.5e-05,3.2e-05
1.5e-05,1.3e-05,0.002089,0.013211,0.005592,0.000632,-0.000188,-0.020794,-0.095035,-0.157675,-0.142037,-0.085429,-0.044575,-0.038683,-0.034422,-0.03024,-0.015232,-0.001851,-0.000582,6.7e-05,0.000536,0.00026,0.000239,0.000223,8.4e-05,6.3e-05,2.5e-05,2e-05
-1.3e-05,-4e-06,0.002264,0.014522,0.006104,5.3e-05,-0.000504,-0.035879,-0.105761,-0.110243,-0.072733,-0.031821,-0.038657,-0.028976,-0.033999,-0.015562,-0.000836,-0.001017,-0.000841,0.000227,0.000868,0.000505,3.4e-05,0.000242,0.00014,5.6e-05,2.2e-05,1.5e-05
2e-06,5e-06,-0.000683,-0.004319,-0.001878,-0.000487,-0.000386,0.012905,0.06242,0.09211,0.095009,0.074582,0.055266,0.045058,0.044134,0.03554,0.014691,0.002575,0.001109,0.000185,-7.9e-05,-6.7e-05,-0.000151,2.1e-05,4.1e-05,-1e-05,0,1.1e-05
-3e-06,-7e-06,-0.001913,-0.013274,-0.00597,-1.4e-05,0.000831,0.026239,0.09885,0.086113,0.034153,-0.011897,0.011039,0.020822,0.013802,-0.012226,-0.011694,-0.000421,0.000328,1.2e-05,0.000158,4.3e-05,-2.6e-05,-8.8e-05,-5.3e-05,-2.3e-05,7e-06,6e-06
-2.5e-05,-2.1e-05,-0.00094,-0.004365,-0.001612,-0.000208,-0.000299,-0.006341,0.003478,0.019842,0.00556,-0.028801,-0.040282,-0.024535,-0.029041,-0.020829,-0.005496,-0.00205,-0.000925,-0.000295,-0.000723,-0.000409,0.000126,-1.2e-05,-4.6e-05,4e-06,2e-06,-6e-06
-3e-06,1e-06,0.001664,0.010298,0.004561,0.000428,0.000226,0.004253,-0.009231,0.006617,0.030031,0.039641,0.009932,-0.013479,0.006992,0.027589,0.014043,0.001235,0.000426,3e-05,-0.000261,-0.000165,0.000109,8.7e-05,1.8e-05,2.2e-05,3e-06,1e-06
1.7e-05,7e-06,0.001191,0.007502,0.003449,0.000372,0.000236,0.006115,-0.035705,-0.08609,-0.07548,-0.017628,0.017123,0.002761,0.008557,-0.001306,-0.007009,0.00037,0.000426,0.000126,0.000272,0,-0.000157,-4.9e-05,2.8e-05,1e-06,-7e-06,-5e-06
