-0.000102,-0.000255,-0.000177,-0.000449,-0.000281,-0.000346,-0.000138,-9.2e-05,-0.000173,6.4e-05,-9.6e-05,-0.000449,-4e-04,-0.000318,-0.000467,-0.000288,-0.000257,-0.000204,-0.000406,-0.000248,-9.7e-05,-0.00048,-0.000342,-0.000309,-0.00011,-0.000459,-0.000241,-0.00036,-0.000237,-0.000295,-1.8e-05,-0.000241,-0.000394,-0.000222,-0.000268,-0.000114,-7e-05,3.3e-05,-5.1e-05,-0.000279,-0.000407,-0.000509,-0.00043,-0.000364,-0.000316,-0.000194,-0.000169,0.000123,-0.000206,-0.00031,-0.000265,-0.000264,-0.000258,-0.00013,-9.8e-05,-1e-05,-8.3e-05,-0.000265,-0.000291,-0.000298,-0.000174,-0.00021,-0.000318,-0.000295,-0.000136,-7.7e-05,-0.000106,-1.6e-05,0.000132,1e-05,-0.000192,-0.000164,-4.4e-05,-8e-05,-9.6e-05,0.000144,-5.4e-05,-0.000231,-0.000234,-0.00012,-8.6e-05,1.3e-05,-2.7e-05,-0.000192,-0.000183,-0.000208,-0.000115,-0.000178,-0.000253,-0.000195,-0.000176,-0.000294,-9.6e-05,4e-05,-0.000293,-0.000116,-1.5e-05,0.000111,-0.000227,-0.000154,-0.000166,-0.000255,2e-05,-3.7e-05,3.5e-05,0,3.2e-05,-0.000174,-3.6e-05,-0.000234,-0.000189,-0.000279,-9.9e-05,-9.4e-05,-0.000188,4.6e-05,-0.000129,-6.6e-05,0.000222,2.3e-05,-9.4e-05
9.9e-05,-5.6e-05,-0.000273,8.3e-05,-8.4e-05,7.5e-05,-0.000126,-9.3e-05,-0.000113,-0.000167,-0.000202,0.000113,2.7e-05,8.3e-05,0.000207,7.4e-05,-4.7e-05,-9.1e-05,0.000186,-3.9e-05,-6.8e-05,6.2e-05,-6.3e-05,1.2e-05,-7.5e-05,0.000118,-9e-06,-3.3e-05,4e-05,6.9e-05,-0.000174,4.7e-05,-0.000132,4.3e-05,0.000204,-0.000139,-0.00019,-0.000123,-0.000207,0.000107,4.2e-05,0.00026,0.000103,0.000105,0.000221,6.1e-05,3.1e-05,-5e-05,-0.000135,-8.1e-05,-1e-04,0.000184,0.000267,1.5e-05,-0.00015,-0.000228,-0.000141,-1.4e-05,-3.6e-05,3.8e-05,-2.1e-05,5.4e-05,-9.8e-05,-9.2e-05,-9.6e-05,0,-8.9e-05,-0.00019,-1e-04,-4.5e-05,0.000185,-0.000122,-0.000105,-9.1e-05,-0.000106,-0.000122,-0.000129,-0.000154,-5.4e-05,-3.9e-05,5.7e-05,-4.8e-05,-3e-06,-0.000138,0.000171,0.000259,4.7e-05,-3.4e-05,0.000129,1.8e-05,4.6e-05,9.3e-05,0.000155,-0.000154,-0.000121,-3e-05,-0.000111,-6.3e-05,0.000106,0,1.1e-05,-1.6e-05,-9e-05,-0.000132,-6.7e-05,-8.6e-05,-2.1e-05,-7.4e-05,-0.000113,2.7e-05,-2.7e-05,4.6e-05,-7e-05,0.000125,0.000124,-0.000147,-0.00011,-0.000201,-0.000212,-0.000184,-6e-06
-0.00024,-0.000105,4e-06,-0.00031,-7e-05,-0.00016,-0.000123,-0.000184,-6.5e-05,-0.00024,-1.6e-05,5.8e-05,2.3e-05,-0.000228,-0.000179,0.000107,-0.00012,-8.2e-05,-0.000252,-0.000152,-9.7e-05,0,-0.000143,-2.7e-05,-7.9e-05,-6.9e-05,-1.4e-05,-0.000152,-6.5e-05,-4.3e-05,-0.000143,-0.000269,-3e-05,-0.00019,-9.6e-05,-0.000194,-0.000325,-0.000158,-0.000104,-0.00018,-5e-06,-0.000183,6.4e-05,-0.00017,-0.000364,-0.000122,-0.000266,-0.000174,-0.000302,-4.1e-05,-2.8e-05,-0.000217,-0.000272,-0.000133,5.9e-05,-8.2e-05,-0.000177,-0.000111,-0.000188,-0.000149,-0.000264,-0.000179,2.6e-05,-5.4e-05,-0.000146,-0.000198,1e-06,-4.6e-05,-0.000214,-9.7e-05,-0.000102,-0.000114,-4e-05,-0.000133,-2.5e-05,-0.000146,-8.2e-05,5.7e-05,5.6e-05,1.3e-05,-6.1e-05,-0.000121,-1.8e-05,-0.00012,-0.000209,-0.000103,-0.000169,-0.000216,-0.000315,-0.000106,-2.1e-05,-0.00023,-0.000148,-0.000235,5.1e-05,-0.000167,-0.000225,-0.00018,-0.000224,-0.000128,-5e-06,-0.00011,-0.000177,-0.000142,-0.000258,-0.000252,-6.6e-05,-0.000189,-0.000214,-0.000149,-0.000111,-0.000226,-0.000118,-0.000145,-0.000164,-0.000214,-0.000142,-0.000134,-0.000274,-0.000214,-0.000125
-1.2e-05,-0.000163,7.9e-05,0.00014,6.4e-05,-5.3e-05,-0.000194,-9.7e-05,5.9e-05,8e-05,-1.9e-05,-0.000205,-6e-05,-0.000158,2.8e-05,-0.00017,0.000102,-0.000146,-6.4e-05,-2.2e-05,-8.5e-05,-0.00018,3.7e-05,-0.000117,-3.9e-05,7.6e-05,-0.000154,0.000104,-1.2e-05,-3.2e-05,-4.8e-05,3.6e-05,6.9e-05,-1.4e-05,-0.000144,0.000189,1.9e-05,-5.7e-05,-5.1e-05,4.6e-05,-9.9e-05,8.7e-05,7e-06,0.00013,4.8e-05,-1e-06,1.1e-05,-7.3e-05,0.000172,-0.000134,7.7e-05,-3.2e-05,-0.000156,-8.2e-05,3.1e-05,-4.1e-05,2.7e-05,-4.5e-05,9e-05,-3.2e-05,-0.000124,-6.8e-05,-3.9e-05,2e-05,-5.9e-05,-6e-05,-8.7e-05,-3.5e-05,-0.00017,-9e-05,-0.000106,1.5e-05,9.5e-05,2.3e-05,-1.6e-05,-0.000103,-8.1e-05,3e-06,5.7e-05,-1.2e-05,5e-05,-0.000153,-0.000103,-5.4e-05,-3e-05,-3e-05,-3.2e-05,0.000101,-4.5e-05,-2e-06,-0.000173,4.4e-05,-1.8e-05,2.1e-05,-0.000117,0.00013,3.3e-05,4.4e-05,-2.6e-05,7.3e-05,-0.000115,3.5e-05,2.4e-05,2.4e-05,9.6e-05,-2.1e-05,-7.3e-05,6.9e-05,3.3e-05,-4e-06,4e-06,-1.2e-05,1.2e-05,-9.4e-05,-2.2e-05,6.2e-05,1.6e-05,-0.000139,6.8e-05,2e-06,3e-05
2.8e-05,0.000147,-9.6e-05,8.4e-05,-2.2e-05,8.7e-05,0.000207,0.000182,5.6e-05,-3.2e-05,3e-06,1.9e-05,0.000107,0.000223,1.6e-05,1.4e-05,-1.2e-05,2.6e-05,9.6e-05,0.000118,6.8e-05,1.2e-05,6.4e-05,9.8e-05,0.000101,-8.3e-05,0.000149,5.5e-05,0.000154,0.000119,-3e-06,0.000159,6.6e-05,3.7e-05,0.000123,4.4e-05,0.000132,0.00019,0.000141,2.5e-05,4.3e-05,-8e-06,-6e-06,2.7e-05,-2e-05,0.000147,6.9e-05,7.6e-05,3.9e-05,0.000168,-4e-06,7.9e-05,8.7e-05,-3.2e-05,-0.00011,1.3e-05,-8.4e-05,-3.7e-05,2.5e-05,6.3e-05,0.00016,0.00016,-9e-06,9e-05,3.5e-05,-7.4e-05,8.6e-05,0.000117,7.1e-05,-0.000107,1e-06,3.4e-05,-1.1e-05,4.9e-05,-4.8e-05,6.4e-05,7.3e-05,-3.6e-05,-5.9e-05,6.2e-05,-2e-06,3.4e-05,-2.1e-05,8.9e-05,-7.1e-05,0.000158,8.6e-05,5.8e-05,0.000243,3.1e-05,0.000125,0.000116,-6.3e-05,6.1e-05,2e-04,0.00011,0.000119,3.5e-05,2.6e-05,5.7e-05,9.3e-05,2.6e-05,8e-06,0.000115,9.7e-05,6.5e-05,6.5e-05,8.1e-05,0.000146,9.8e-05,3.4e-05,0.000101,1e-04,-6e-06,-7.3e-05,-2.1e-05,6.5e-05,0.00016,0.000156,0.000204,5.7e-05
-6.6e-05,-6e-06,-0.000124,-2.5e-05,8e-06,0.000113,-1.3e-05,7.6e-05,5.7e-05,0,-1.9e-05,3e-05,-1.8e-05,-9.4e-05,-5.4e-05,4.9e-05,1.7e-05,0.000132,5.9e-05,7.9e-05,2.2e-05,1.2e-05,-0.000121,8.4e-05,-5.5e-05,7.2e-05,6e-06,0,-8.1e-05,-6.9e-05,-0.000137,-9e-06,-6e-06,-7.7e-05,-0.000112,6.6e-05,1e-04,7.3e-05,1.5e-05,-1.1e-05,-4.5e-05,-0.000138,-0.000127,-1.1e-05,6.6e-05,0,6.4e-05,4.2e-05,5.7e-05,3.8e-05,2.2e-05,-4.2e-05,-2.5e-05,-7.3e-05,-8.7e-05,2.3e-05,2.9e-05,-3.8e-05,-4.6e-05,1.1e-05,-2.8e-05,-1.2e-05,6e-05,-0.000123,2.7e-05,1.9e-05,-2e-05,-6.3e-05,-1.6e-05,1.1e-05,-0.000137,1.9e-05,-1.8e-05,8e-06,9.7e-05,-4e-06,-2.4e-05,4.2e-05,-5.3e-05,-4.4e-05,-4e-06,1.4e-05,-7e-06,-4.4e-05,-3.6e-05,-9.4e-05,-0.000158,-3.9e-05,-1.6e-05,7.6e-05,3.2e-05,-6.3e-05,4.5e-05,5.1e-05,-6.1e-05,-6.5e-05,6.2e-05,4.8e-05,6.6e-05,-5.4e-05,-5.8e-05,-3.6e-05,5e-05,6.3e-05,0.000109,0.000116,5.6e-05,2.5e-05,-8.8e-05,5.9e-05,1.5e-05,-1.2e-05,-0.000104,-7.3e-05,-3e-06,-2.6e-05,9.3e-05,-1.1e-05,1.9e-05,-2.9e-05,-5.3e-05
1.2e-05,-8e-06,0.000144,-7e-06,-8e-06,-6.9e-05,-5.7e-05,-7.6e-05,-2.9e-05,-5.9e-05,3.5e-05,0,-0.000187,-3.2e-05,-1.6e-05,-3.7e-05,-3.6e-05,-3.2e-05,-0.00014,-0.000101,2.9e-05,5e-05,0.000117,-7.7e-05,5.1e-05,-1.5e-05,3.5e-05,-6.1e-05,-3.4e-05,8.2e-05,0.000147,-6.4e-05,-0.00012,-1.1e-05,9.4e-05,-0.000103,-3.2e-05,-0.000167,-5.6e-05,3.1e-05,0.000125,0.000151,0.000163,8e-05,-0.000137,-3.8e-05,-6.7e-05,5.5e-05,-6.5e-05,2e-06,-7.1e-05,-2.9e-05,0.000109,0.000155,0.000161,-2.1e-05,4e-05,-3.8e-05,-2e-06,6.6e-05,7.8e-05,1.5e-05,-5.9e-05,-1.6e-05,6.8e-05,6.3e-05,-1.2e-05,-8e-05,9e-06,7.6e-05,-3e-06,5.6e-05,-3e-05,-1e-06,5.1e-05,-2.7e-05,-4.2e-05,2.7e-05,6e-05,-1e-06,-5.2e-05,-8e-06,1e-05,-6e-06,-2e-05,1e-05,2e-05,-7.5e-05,-1e-05,-4.9e-05,-4.6e-05,-4.9e-05,6.6e-05,5.9e-05,-6.3e-05,3.7e-05,-5e-05,-7.9e-05,6.5e-05,0.000104,1.6e-05,-4e-06,-5.1e-05,-0.000101,-8e-05,-8e-05,-9.4e-05,-8e-05,-6e-05,-4.3e-05,0.000101,1e-06,-6.5e-05,2.3e-05,5.4e-05,5.9e-05,-4.9e-05,-5.3e-05,-8.6e-05,-0.000103,-5.8e-05
-7e-05,-1.3e-05,7e-06,5.3e-05,0.000106,-2.2e-05,7e-06,3.5e-05,-0.000111,-3.1e-05,7.1e-05,-3.4e-05,0.000125,5.9e-05,-8.2e-05,4.5e-05,-6.2e-05,-4.7e-05,2e-05,-6.4e-05,-8.9e-05,-5e-05,-7.3e-05,3.5e-05,3.6e-05,-3.5e-05,-7.7e-05,-1.5e-05,-3.1e-05,-2.3e-05,1.5e-05,-3.4e-05,-3.9e-05,4.9e-05,-4e-06,3.7e-05,-5e-05,-8.2e-05,-8.6e-05,-0.000108,-6.7e-05,-5.9e-05,-0.000109,-0.000103,3.7e-05,-2.3e-05,-1.7e-05,-0.000136,-6.7e-05,-0.000148,-3.6e-05,-6e-06,-2.5e-05,2e-06,1.5e-05,8.3e-05,6.2e-05,5.3e-05,3.7e-05,-4.9e-05,-5.7e-05,-4.7e-05,-3.9e-05,3.4e-05,-3.7e-05,-1.5e-05,-0.000109,6.1e-05,-7e-05,4.9e-05,5.2e-05,-4e-05,-4.6e-05,6e-06,2.8e-05,-6e-06,5e-06,-4.3e-05,-4.5e-05,-2.4e-05,1.6e-05,6e-06,-4.9e-05,3.5e-05,0.000162,1.4e-05,-3.3e-05,-4.8e-05,-4.3e-05,-5.3e-05,-2.3e-05,3.9e-05,-4.3e-05,-5.1e-05,-7.8e-05,-8.3e-05,-1.7e-05,-3.2e-05,-2e-05,-7.5e-05,4.2e-05,2e-05,-2.7e-05,-3.2e-05,1e-06,-1.4e-05,-5.7e-05,2.3e-05,9e-06,-7.6e-05,-0.000122,-3.6e-05,-2.5e-05,-3.7e-05,3e-05,-1.7e-05,-0.000122,-5e-05,-2.2e-05,-9e-06,-4e-05
4e-06,-1e-05,4.5e-05,-9e-06,-0.00011,6.1e-05,-5.5e-05,-7.1e-05,4.8e-05,4.4e-05,-1.2e-05,-4.1e-05,-0.00014,-1.1e-05,7.2e-05,4e-06,4.6e-05,-4.1e-05,-8.8e-05,6e-06,8e-06,1.3e-05,3.2e-05,-4.2e-05,-8e-05,-2e-06,3.1e-05,3e-05,3.2e-05,1.6e-05,-3.7e-05,1e-05,7.9e-05,-8.3e-05,-2.6e-05,4.6e-05,4.9e-05,3.8e-05,4.5e-05,-1.4e-05,-9e-06,-3.3e-05,7e-05,3e-05,-1.2e-05,-8.8e-05,4.1e-05,7e-06,-2.8e-05,4.9e-05,8.7e-05,7.7e-05,-3e-05,4.4e-05,-3e-06,1.5e-05,-3.4e-05,2.9e-05,2e-05,-0.000108,-5.4e-05,-2.2e-05,-4e-06,2.6e-05,-2.8e-05,-1.1e-05,4e-05,-1.7e-05,-7.4e-05,-2.2e-05,5e-06,2.7e-05,4.2e-05,-1.1e-05,-6e-05,-2.2e-05,-1e-06,-3.3e-05,6.1e-05,-1.9e-05,7e-06,2.3e-05,1.7e-05,4.6e-05,-0.000114,9e-06,2.5e-05,6.7e-05,3e-06,-3e-05,1e-06,-6e-05,-5.2e-05,-5e-05,3.7e-05,-3.4e-05,5e-05,1.4e-05,-2e-05,-5.2e-05,-5.4e-05,-1e-06,1.3e-05,-3.8e-05,-2.8e-05,-9e-06,-2.9e-05,-9.7e-05,-9e-06,2.7e-05,3.1e-05,1.3e-05,2.7e-05,3.2e-05,2.9e-05,4.4e-05,2.2e-05,4.9e-05,-9.6e-05,-1e-06,7.7e-05
2.1e-05,4.6e-05,-3.1e-05,9e-06,-9e-06,-1.8e-05,-1e-06,2e-06,9e-06,4.3e-05,-2.5e-05,1e-05,0.00011,4.3e-05,9e-05,3.9e-05,2.3e-05,0.000106,3.3e-05,-1.6e-05,2.2e-05,3.2e-05,3e-05,-1.5e-05,-3e-06,-2.2e-05,-4e-06,-7.3e-05,-3.9e-05,5.4e-05,-1.1e-05,-8.8e-05,-2e-06,5.1e-05,1e-06,-4.2e-05,-1.4e-05,8e-06,4.4e-05,5e-06,2.6e-05,6.3e-05,-2.7e-05,-1.6e-05,5.1e-05,4.3e-05,4.6e-05,2.3e-05,1.8e-05,3.1e-05,-2e-06,-3.5e-05,-6e-06,-2.1e-05,1e-06,-4.4e-05,-7.9e-05,-2.7e-05,3.9e-05,5.3e-05,4.8e-05,-2e-06,1.8e-05,-3.5e-05,-2e-05,6e-06,6.9e-05,2.1e-05,3.5e-05,1e-05,0.000105,-1.9e-05,1.4e-05,2.6e-05,1.6e-05,-3.2e-05,7e-06,5.2e-05,-4.5e-05,-1e-06,-2.7e-05,-1.3e-05,4.1e-05,2e-06,-1.8e-05,-7.5e-05,4.6e-05,-1.5e-05,1.6e-05,4e-05,1.2e-05,5.6e-05,3.4e-05,1.5e-05,2.4e-05,4.4e-05,3.1e-05,2.5e-05,-7e-06,1.4e-05,-1.9e-05,-1.2e-05,8e-06,1.9e-05,4.8e-05,4.6e-05,7.2e-05,6.2e-05,3.8e-05,-1.8e-05,-2.3e-05,-4e-06,1.7e-05,3.3e-05,3e-06,-2.8e-05,2.4e-05,2.1e-05,9.7e-05,3.7e-05,4.6e-05
3.6e-05,-1e-05,-6.9e-05,-2.4e-05,2e-06,-1.1e-05,3.5e-05,-4e-06,1.5e-05,1e-05,-7.3e-05,4.4e-05,-3.3e-05,1.5e-05,-9.1e-05,-9e-06,-3.1e-05,-5.8e-05,1.8e-05,3.6e-05,1e-06,-2.6e-05,5e-06,-2.5e-05,2.1e-05,6.3e-05,1.6e-05,0.000108,4e-05,-4.9e-05,6e-06,7e-06,2e-05,5.2e-05,5e-06,4e-05,5.1e-05,6.4e-05,1.9e-05,4.2e-05,-2e-06,-2.4e-05,2.1e-05,2.1e-05,-4.7e-05,-1.7e-05,-1.5e-05,1.7e-05,2.6e-05,4e-05,7e-06,1.2e-05,3.2e-05,-1.6e-05,-5.1e-05,-5e-06,2.8e-05,1e-05,-7.1e-05,4.4e-05,-1e-05,4.8e-05,6.7e-05,4e-05,4.5e-05,3.7e-05,1e-05,3.4e-05,1e-05,0,0,6e-06,1.5e-05,-2.1e-05,1.4e-05,5.3e-05,7e-06,4e-05,3e-05,-3.7e-05,1.5e-05,-1.7e-05,-1.6e-05,-2.1e-05,-2.5e-05,2.8e-05,1.5e-05,4.3e-05,2.7e-05,2.5e-05,1.8e-05,-2e-05,0,0,3.2e-05,-1.2e-05,-2.7e-05,1.8e-05,4.4e-05,4.2e-05,-2.3e-05,3.5e-05,-1.9e-05,-4e-05,1.6e-05,1.3e-05,1.9e-05,9e-06,1.6e-05,7e-06,3.1e-05,-2e-06,-9e-06,-4.1e-05,-2.1e-05,0,-1.2e-05,3.1e-05,2e-05,-1.2e-05,-1.7e-05
3.2e-05,2e-05,1.5e-05,-1e-06,1.6e-05,4e-05,-2.6e-05,-1e-05,-2.6e-05,-5e-06,4.2e-05,2.2e-05,3.2e-05,-7.2e-05,3e-05,1e-05,4.9e-05,1.8e-05,4.2e-05,-1.5e-05,2e-06,1.3e-05,-3.9e-05,1e-05,1.4e-05,-2.6e-05,-1.9e-05,-3.9e-05,-2.6e-05,-1.2e-05,4.1e-05,4.5e-05,-2.9e-05,-1.7e-05,3e-06,-7.2e-05,1e-06,-1.3e-05,-1.7e-05,1.4e-05,0,7e-06,3.4e-05,-2.7e-05,3.9e-05,1e-06,3.3e-05,-3.2e-05,1.2e-05,-3.2e-05,-2.6e-05,-1.8e-05,-1.3e-05,-9e-06,-7e-06,1.1e-05,2.5e-05,1.9e-05,4.4e-05,-1.9e-05,4e-05,-3.5e-05,-2.5e-05,-2.3e-05,-4.1e-05,-3.2e-05,-1e-06,-2.5e-05,1e-06,7e-06,-9.1e-05,-3.4e-05,-5.4e-05,-3.1e-05,1e-06,3e-05,1.2e-05,8e-06,-7e-06,5.2e-05,9e-06,-1e-06,-2e-05,-8e-06,-6e-06,-2.7e-05,1.5e-05,-2.6e-05,-4e-05,2.4e-05,4e-06,-6e-06,0,-1e-06,-2.5e-05,-5.5e-05,4.7e-05,-1.6e-05,-1.6e-05,-3e-06,3.4e-05,-1.2e-05,3.3e-05,2.2e-05,-1.9e-05,0,-4e-06,-2.3e-05,-1.1e-05,-2.3e-05,1e-06,4.7e-05,-7e-06,4e-05,3.4e-05,-2.1e-05,9e-06,-8e-06,-2e-05,1.2e-05,-2.8e-05
-4.4e-05,-2.1e-05,7e-06,1e-05,-6e-06,-2e-06,-4e-06,-1.8e-05,2e-06,-1.9e-05,-1.9e-05,-2.6e-05,-1e-05,2.6e-05,-8e-06,3e-06,-1.4e-05,-6e-06,-1.7e-05,5e-06,3.8e-05,-1.4e-05,-3e-06,4.1e-05,2.4e-05,1.8e-05,-5e-06,-1.4e-05,9e-06,3e-06,1.3e-05,-2e-06,1.2e-05,-4.8e-05,-2e-06,-5.7e-05,1.8e-05,4e-06,-8e-06,-1.6e-05,6e-06,-1e-05,-4.2e-05,1.8e-05,-1.8e-05,-2e-06,-4.9e-05,1.1e-05,-2.6e-05,1.1e-05,1.5e-05,-1.5e-05,-1.4e-05,2.7e-05,8e-06,-1e-06,-4e-05,-2.3e-05,-1.8e-05,-1.3e-05,-4e-05,1.7e-05,-1.2e-05,-1e-06,6e-06,1.3e-05,-2.6e-05,-1.3e-05,0,4.1e-05,-8e-06,-1.7e-05,1e-06,6e-06,-1.1e-05,-1.7e-05,5e-06,-1.6e-05,-1e-05,-6e-06,9e-06,5e-06,9e-06,-2.6e-05,1.3e-05,3.3e-05,6e-06,3.2e-05,-7e-06,-2.3e-05,-4e-05,-3e-06,-6e-06,-1.2e-05,5e-06,-2e-06,-2.6e-05,1.6e-05,-2e-05,-2.8e-05,4e-06,-3e-05,-1e-06,-5e-06,-2.6e-05,-2e-06,-1.1e-05,0,2e-06,1.8e-05,-9e-06,-3.1e-05,-8e-06,4e-06,-3.4e-05,-7e-06,2.8e-05,-2.6e-05,3e-05,7e-06,0
-2.5e-05,-1e-05,6e-06,-6e-06,-9e-06,7e-06,1.3e-05,6e-06,5e-06,6e-06,2e-06,-1.5e-05,-1.1e-05,-4.4e-05,-6e-06,-3.9e-05,6e-06,1.1e-05,-1e-05,4e-06,-2.9e-05,1e-05,7e-06,-4.2e-05,-5.9e-05,-2.1e-05,1.2e-05,1.7e-05,2e-06,1e-06,-1.4e-05,-5e-06,-2.1e-05,3.2e-05,-5e-06,5e-06,5e-06,1.2e-05,6e-06,-3e-06,-2.3e-05,-6e-06,3.6e-05,2e-06,5e-06,2.3e-05,2e-05,1.8e-05,1.1e-05,-6e-06,1.1e-05,2.6e-05,-1e-06,7e-06,-9e-06,8e-06,4e-06,-4e-06,2e-06,2.4e-05,-1.2e-05,-1e-06,-1.1e-05,1.4e-05,5e-06,-6e-06,6e-06,-8e-06,4e-06,-1.4e-05,1e-05,1.7e-05,-4.1e-05,9e-06,-7e-06,0,-1.6e-05,-2.2e-05,-5e-06,-4e-06,0,-1e-06,8e-06,2e-06,-1.8e-05,-1.3e-05,-2e-06,0,2.6e-05,8e-06,2e-06,1.2e-05,-1.3e-05,1.7e-05,-2e-05,1.4e-05,-3e-05,3e-06,-9e-06,2e-06,-1.3e-05,8e-06,-8e-06,1.4e-05,-2e-06,6e-06,1e-06,7e-06,-1.3e-05,5e-06,-2.3e-05,3e-06,-6e-06,-6e-06,3e-05,4e-06,1e-06,-3e-06,-1.5e-05,-1.6e-05,6e-06
1e-05,2.1e-05,7e-06,4e-06,-2e-06,-4.2e-05,5e-06,2e-06,-7e-06,1.5e-05,-3e-05,-8e-06,1.4e-05,1.8e-05,2e-06,-1.5e-05,1.2e-05,-1e-05,1.5e-05,2.2e-05,2e-05,5e-06,6e-06,3.5e-05,2.1e-05,8e-06,-7e-06,-1e-05,-9e-06,-1.7e-05,-5e-06,2e-06,1.8e-05,4e-06,-2e-06,-3.5e-05,1.2e-05,-1.3e-05,1e-06,-6e-06,-9e-06,-2e-06,-2.4e-05,-1e-05,-2e-05,5e-06,-1e-05,5e-06,1.3e-05,-7e-06,-7e-06,-3e-06,1e-06,-1.8e-05,1.5e-05,9e-06,7e-06,1.2e-05,-5e-06,-4e-06,7e-06,-4e-06,6e-06,1.2e-05,7e-06,5e-06,-1.8e-05,1.9e-05,2.4e-05,-1.4e-05,1.6e-05,5e-06,2.2e-05,1.2e-05,5e-06,2e-06,1.6e-05,4e-06,2e-06,-3e-06,9e-06,-4e-06,2e-06,1.7e-05,2e-06,1e-06,-2e-06,-1.7e-05,-4e-06,-1.2e-05,1.3e-05,-6e-06,3e-06,-1e-05,-1.6e-05,1.2e-05,6e-06,-6e-06,3e-06,1.3e-05,-4e-06,1e-05,1.1e-05,-6e-06,-6e-06,1e-05,-5e-06,9e-06,1e-05,-3e-06,4e-06,4e-06,2e-06,-4e-06,-1e-06,1.4e-05,-1.4e-05,6e-06,4e-06,1.3e-05,0
-1.4e-05,-1.1e-05,-2.3e-05,-1.4e-05,-2e-06,5e-06,-2e-06,0,-1e-05,4e-06,6e-06,-1e-06,-1.4e-05,-8e-06,-2e-06,1.9e-05,-1.2e-05,-6e-06,-9e-06,-8e-06,-1.3e-05,-4e-06,5e-06,0,-1e-06,0,3e-06,1e-06,1.8e-05,1.8e-05,1.7e-05,1e-06,7e-06,8e-06,4e-06,4.6e-05,9e-06,0,-1e-06,-4e-06,-1.2e-05,1.3e-05,2e-06,7e-06,2.1e-05,-4e-06,-7e-06,-6e-06,-1.8e-05,-1.6e-05,4e-06,9e-06,4e-06,4e-06,-8e-06,1e-06,1e-05,2e-05,-1.5e-05,-1.8e-05,8e-06,0,-2e-06,-4e-06,-1e-06,1.8e-05,1.4e-05,-9e-06,-1.6e-05,5e-06,-1e-06,3e-06,-3e-06,-1.6e-05,9e-06,-3e-06,2e-06,-3e-06,-1e-06,-6e-06,1.1e-05,-2e-06,-1.2e-05,-5e-06,-1e-06,-1.1e-05,3e-06,7e-06,9e-06,-1e-06,0,6e-06,1e-05,8e-06,1.6e-05,0,3e-06,9e-06,0,2e-06,1e-06,8e-06,-1.1e-05,-2e-06,-8e-06,1e-05,1e-06,0,-5e-06,3e-06,6e-06,-1e-06,4e-06,1e-05,-1.9e-05,-4e-06,-8e-06,-4e-06,2e-06,-4e-06,1.1e-05
1.6e-05,0,1.1e-05,7e-06,5e-06,8e-06,5e-06,3e-06,1.2e-05,5e-06,1.5e-05,2e-06,2.1e-05,-6e-06,-4e-06,2e-06,7e-06,-7e-06,-1.3e-05,9e-06,-1e-06,-3e-06,-4e-06,-1e-06,-2e-06,-2e-06,-3e-06,2e-06,-1.5e-05,-1.3e-05,1.3e-05,-5e-06,1.6e-05,-1.4e-05,-2e-06,-5e-06,-1.4e-05,1.1e-05,-2e-06,1e-06,2e-06,-9e-06,0,-1.3e-05,-8e-06,-1e-06,2e-06,9e-06,1e-06,1.4e-05,-4e-06,-2e-06,-1e-06,-6e-06,-4e-06,-8e-06,-6e-06,-3e-06,4e-06,-2.4e-05,-1.4e-05,5e-06,-5e-06,-4e-06,-9e-06,-1.4e-05,4e-06,6e-06,-1e-06,0,-8e-06,1e-06,1.7e-05,1e-05,-1e-06,2e-06,-1e-06,-4e-06,-5e-06,5e-06,-1.7e-05,-3e-06,5e-06,-5e-06,1.8e-05,5e-06,6e-06,-5e-06,7e-06,-3e-06,1e-06,0,-9e-06,-8e-06,9e-06,-3e-06,-1.7e-05,-2e-06,0,-4e-06,4e-06,-5e-06,1e-06,-1e-06,0,-1e-06,1.3e-05,4e-06,2e-06,7e-06,-2e-06,-1e-06,2e-06,-5e-06,-3e-06,1.2e-05,0,-2e-06,-7e-06,-7e-06,9e-06
3e-06,1e-06,0,2e-06,2e-06,2e-06,6e-06,2e-06,-4e-06,3e-06,1.4e-05,0,-2.1e-05,6e-06,1.3e-05,-5e-06,-5e-06,1.5e-05,8e-06,6e-06,5e-06,2e-06,-5e-06,-5e-06,2e-06,5e-06,9e-06,0,7e-06,1e-05,-2e-06,0,3e-06,-1e-06,0,7e-06,-2.1e-05,1.3e-05,6e-06,0,1e-06,1e-06,4e-06,5e-06,-3e-06,-4e-06,-6e-06,-7e-06,7e-06,3e-06,-4e-06,-1e-06,-7e-06,6e-06,5e-06,5e-06,-5e-06,4e-06,-4e-06,1.3e-05,5e-06,2e-06,1.2e-05,-2e-06,1.4e-05,1e-06,1e-05,0,4e-06,-2e-06,-1.3e-05,2e-06,2e-06,-8e-06,-1e-05,-2e-06,-2e-06,3e-06,1e-06,0,0,-1e-06,4e-06,1e-06,0,4e-06,-1e-06,-6e-06,6e-06,4e-06,3e-06,-3e-06,0,6e-06,2e-06,4e-06,1e-06,3e-06,2e-06,-4e-06,-1e-06,4e-06,0,-1e-05,5e-06,3e-06,6e-06,-7e-06,1e-06,-8e-06,-1.4e-05,3e-06,-2e-06,1e-06,1.1e-05,-8e-06,-2e-06,9e-06,-3e-06,1e-05,-7e-06
2e-06,-2e-06,4e-06,-1e-06,-6e-06,-4e-06,-3e-06,1e-06,5e-06,-2e-06,3e-06,1e-06,1.9e-05,-1e-06,-1.7e-05,-1.2e-05,-3e-06,-5e-06,1.3e-05,-1.4e-05,-2e-06,0,2e-06,-2e-06,-1e-06,-4e-06,-6e-06,0,-6e-06,-5e-06,-4e-06,4e-06,-4e-06,-1e-06,2e-06,1.2e-05,1e-06,-5e-06,1e-06,3e-06,0,2e-06,-4e-06,-3e-06,6e-06,-1e-06,-1e-06,5e-06,-3e-06,-2e-06,-3e-06,-3e-06,5e-06,4e-06,7e-06,4e-06,6e-06,-5e-06,2e-06,8e-06,4e-06,-6e-06,2e-06,0,-2e-06,8e-06,-6e-06,-2e-06,-3e-06,-5e-06,-1e-06,2e-06,-4e-06,2e-06,4e-06,-1e-06,8e-06,5e-06,6e-06,-3e-06,2e-06,0,-4e-06,2e-06,-1e-06,-3e-06,0,2e-06,-3e-06,9e-06,7e-06,2e-06,6e-06,-2e-06,1e-06,-5e-06,4e-06,-1e-06,3e-06,-1e-06,0,-3e-06,-4e-06,-2e-06,0,-1e-06,-1e-06,6e-06,2e-06,-4e-06,1.6e-05,1e-06,-4e-06,4e-06,-6e-06,9e-06,-3e-06,-1e-06,1.2e-05,0,-1.2e-05
0,0,5e-06,2e-06,-2e-06,6e-06,5e-06,-5e-06,0,0,-6e-06,3e-06,-1.3e-05,-6e-06,5e-06,9e-06,4e-06,-7e-06,-5e-06,8e-06,-3e-06,-2e-06,0,-3e-06,-1e-06,2e-06,2e-06,-4e-06,1e-06,6e-06,-1e-06,-3e-06,-2e-06,3e-06,-1e-06,-1e-05,-1.2e-05,2e-06,-6e-06,0,-4e-06,-4e-06,4e-06,-1e-06,-5e-06,-4e-06,1e-06,1e-06,2e-06,-5e-06,-5e-06,1e-06,5e-06,-6e-06,0,-7e-06,-2e-06,2e-06,2e-06,-1e-05,-5e-06,-2e-06,-6e-06,-5e-06,-5e-06,-8e-06,-4e-06,0,1e-06,0,3e-06,0,-6e-06,-4e-06,1e-06,1.1e-05,-2e-06,-1e-06,-7e-06,3e-06,0,2e-06,-2e-06,2e-06,-6e-06,-5e-06,3e-06,-3e-06,-2e-06,-1e-06,-5e-06,-2e-06,-3e-06,1e-06,-1e-06,-5e-06,-4e-06,-1e-06,5e-06,6e-06,-5e-06,2e-06,6e-06,0,0,-4e-06,-6e-06,-5e-06,-2e-06,-2e-06,1e-06,-1e-06,-1e-06,-1e-06,-5e-06,-3e-06,7e-06,-6e-06,-1.1e-05,-6e-06,0
-4e-06,-3e-06,-1.1e-05,1e-06,3e-06,-7e-06,-5e-06,0,-3e-06,1e-06,8e-06,-2e-06,4e-06,1e-06,4e-06,-1e-06,-2e-06,6e-06,-6e-06,-2e-06,4e-06,0,0,-6e-06,5e-06,-3e-06,-3e-06,5e-06,-4e-06,-6e-06,2e-06,1e-06,-4e-06,-4e-06,1e-06,8e-06,-3e-06,8e-06,-1e-06,-3e-06,3e-06,4e-06,-3e-06,3e-06,6e-06,4e-06,-4e-06,-4e-06,1e-06,6e-06,9e-06,1e-06,-6e-06,-4e-06,2e-06,3e-06,1e-06,4e-06,4e-06,-3e-06,4e-06,5e-06,-2e-06,4e-06,-3e-06,4e-06,-4e-06,-4e-06,-1e-06,-3e-06,-1e-06,0,3e-06,-1e-06,0,-4e-06,0,-4e-06,2e-06,3e-06,1e-06,-2e-06,2e-06,1e-06,0,1e-06,-5e-06,3e-06,-2e-06,-4e-06,-6e-06,-1e-06,-2e-06,-4e-06,-6e-06,1e-06,-2e-06,2e-06,-2e-06,1e-06,4e-06,7e-06,-3e-06,5e-06,2e-06,-3e-06,2e-06,-2e-06,-1e-06,3e-06,1e-06,-2e-06,-1e-06,0,-2e-06,3e-06,6e-06,0,0,3e-06,3e-06
-2e-06,4e-06,5e-06,-1e-06,0,-2e-06,5e-06,-3e-06,5e-06,1e-06,-2e-06,-6e-06,-3e-06,8e-06,-3e-06,6e-06,0,0,5e-06,-2e-06,-3e-06,2e-06,4e-06,6e-06,1e-06,1e-06,3e-06,-4e-06,4e-06,6e-06,4e-06,7e-06,5e-06,1e-06,1e-06,-2e-06,-7e-06,-6e-06,2e-06,0,2e-06,0,1e-06,2e-06,-1e-05,0,-1e-06,3e-06,-1e-06,-4e-06,-2e-06,-1e-06,-2e-06,1e-06,-6e-06,-1e-06,-2e-06,5e-06,1e-06,1.1e-05,-3e-06,-4e-06,-2e-06,-1e-06,6e-06,0,-2e-06,5e-06,-1e-06,4e-06,8e-06,-3e-06,-3e-06,5e-06,-4e-06,-2e-06,4e-06,-3e-06,0,0,-1e-06,0,1e-06,1e-06,8e-06,1e-06,-2e-06,-5e-06,-1e-06,0,5e-06,1e-06,0,1e-06,-6e-06,0,1e-06,-2e-06,1e-06,-4e-06,0,-2e-06,1e-06,-2e-06,2e-06,0,1e-06,3e-06,2e-06,0,-1e-06,1e-06,0,-1e-06,0,-2e-06,-1e-06,3e-06,6e-06,2e-06,3e-06
3e-06,-5e-06,0,2e-06,2e-06,5e-06,-2e-06,1e-06,-4e-06,2e-06,4e-06,-3e-06,1e-06,-7e-06,1e-06,-9e-06,2e-06,1e-06,-1e-06,8e-06,1e-06,1e-06,-2e-06,-3e-06,-5e-06,3e-06,-3e-06,2e-06,1e-06,-5e-06,-1e-06,-3e-06,0,3e-06,-1e-06,0,1e-06,-4e-06,-1e-06,-3e-06,0,-4e-06,-1e-06,-3e-06,1e-05,3e-06,2e-06,0,-1e-06,-3e-06,-2e-06,-1e-06,4e-06,2e-06,-2e-06,-3e-06,-2e-06,-2e-06,1e-06,2e-06,1e-06,3e-06,2e-06,-3e-06,2e-06,-5e-06,2e-06,-2e-06,5e-06,-2e-06,-1e-06,-2e-06,9e-06,-3e-06,0,1e-06,-1e-06,0,1e-06,0,1e-06,-2e-06,1e-06,0,-4e-06,1e-06,4e-06,-2e-06,-1e-06,-1e-06,1e-06,-1e-06,1e-06,2e-06,3e-06,0,7e-06,0,1e-06,-1e-06,2e-06,1e-06,0,3e-06,0,0,-1e-06,0,-2e-06,1e-06,-1e-06,-2e-06,0,1e-06,1e-06,-1e-06,-2e-06,-3e-06,-6e-06,-4e-06,3e-06
0,7e-06,-2e-06,0,0,0,0,0,-2e-06,0,-8e-06,5e-06,3e-06,3e-06,1e-06,9e-06,-3e-06,-7e-06,-4e-06,1e-06,0,-2e-06,-2e-06,2e-06,1e-06,-5e-06,0,3e-06,-2e-06,5e-06,-4e-06,-2e-06,7e-06,2e-06,1e-06,-5e-06,-5e-06,4e-06,1e-06,-1e-06,-2e-06,3e-06,0,3e-06,-4e-06,2e-06,-2e-06,-2e-06,1e-06,0,2e-06,2e-06,2e-06,0,4e-06,-2e-06,1e-06,2e-06,-3e-06,-6e-06,-1e-06,-3e-06,3e-06,-2e-06,-5e-06,5e-06,1e-06,2e-06,-3e-06,-4e-06,-8e-06,1e-06,0,-1e-06,2e-06,4e-06,-2e-06,3e-06,-2e-06,-7e-06,-1e-06,0,-5e-06,-1e-06,-1e-06,0,-4e-06,0,-4e-06,-3e-06,0,0,1e-06,-4e-06,5e-06,1e-06,-3e-06,1e-06,1e-06,2e-06,-2e-06,1e-06,-1e-06,1e-06,1e-06,-3e-06,1e-06,2e-06,2e-06,5e-06,2e-06,-3e-06,0,0,-3e-06,0,0,0,1e-06,0,1e-06
1e-06,-5e-06,6e-06,-2e-06,-4e-06,-3e-06,0,1e-06,5e-06,-1e-06,-2e-06,4e-06,-5e-06,2e-06,-3e-06,-2e-06,0,4e-06,1e-06,-1e-06,-2e-06,0,1e-06,1e-06,2e-06,4e-06,0,-5e-06,1e-06,-4e-06,0,3e-06,1e-06,1e-06,1e-06,-7e-06,0,-1e-06,-1e-06,0,2e-06,0,0,-2e-06,3e-06,0,6e-06,1e-06,-1e-06,7e-06,-4e-06,-1e-06,-3e-06,-1e-06,1e-06,2e-06,-1e-06,-2e-06,3e-06,-4e-06,2e-06,4e-06,-1e-06,1e-06,2e-06,-1e-06,4e-06,-3e-06,-2e-06,1e-06,1e-06,-1e-06,-2e-06,2e-06,1e-06,-4e-06,4e-06,1e-06,0,4e-06,0,-1e-06,3e-06,0,-3e-06,0,0,-3e-06,2e-06,1e-06,-3e-06,1e-06,-2e-06,4e-06,1e-06,0,1e-06,-1e-06,-2e-06,1e-06,0,-3e-06,1e-06,-1e-06,1e-06,0,2e-06,-2e-06,-1e-06,0,4e-06,1e-06,-1e-06,0,5e-06,0,-2e-06,2e-06,4e-06,4e-06,-4e-06
0,3e-06,-7e-06,2e-06,0,0,2e-06,0,-5e-06,0,-4e-06,-2e-06,8e-06,-4e-06,1e-06,6e-06,1e-06,-1e-06,3e-06,3e-06,1e-06,0,-1e-06,2e-06,-1e-06,-3e-06,1e-06,3e-06,-2e-06,4e-06,1e-06,-1e-06,0,-4e-06,0,-3e-06,1e-06,-1e-06,1e-06,0,0,-3e-06,1e-06,-1e-06,-4e-06,-1e-06,-2e-06,2e-06,0,0,3e-06,0,0,-1e-06,-3e-06,-1e-06,2e-06,0,0,3e-06,-2e-06,1e-06,2e-06,0,0,-1e-06,-4e-06,2e-06,3e-06,2e-06,4e-06,1e-06,-2e-06,1e-06,-1e-06,1e-06,0,1e-06,3e-06,-1e-06,1e-06,1e-06,3e-06,1e-06,2e-06,-1e-06,1e-06,0,2e-06,1e-06,1e-06,-1e-06,-2e-06,-4e-06,0,2e-06,5e-06,1e-06,-1e-06,-1e-06,-2e-06,1e-06,-1e-06,-3e-06,-1e-06,-2e-06,1e-06,3e-06,0,-2e-06,-7e-06,-1e-06,-1e-06,-1e-06,-3e-06,0,-3e-06,-1e-06,-5e-06,-1e-06,-4e-06
-1e-06,-1e-06,2e-06,-1e-06,4e-06,6e-06,0,0,2e-06,-1e-06,1e-06,-3e-06,-6e-06,0,-1e-06,-7e-06,-2e-06,2e-06,-1e-06,-2e-06,1e-06,0,0,-1e-06,2e-06,2e-06,0,-1e-06,0,-4e-06,0,-2e-06,-1e-06,-1e-06,0,1e-06,0,1e-06,0,3e-06,-1e-06,3e-06,1e-06,1e-06,5e-06,-1e-06,1e-06,-4e-06,0,-1e-06,0,2e-06,1e-06,-2e-06,-1e-06,-2e-06,-2e-06,1e-06,-2e-06,4e-06,2e-06,-6e-06,-2e-06,-1e-06,2e-06,1e-06,0,-2e-06,-1e-06,0,1e-06,0,-4e-06,-1e-06,-2e-06,2e-06,-1e-06,1e-06,-2e-06,0,-2e-06,-1e-06,-3e-06,0,2e-06,0,-3e-06,0,-1e-06,3e-06,-1e-06,0,2e-06,3e-06,0,0,0,-1e-06,0,-1e-06,2e-06,0,2e-06,-1e-06,-1e-06,-2e-06,-3e-06,-2e-06,0,0,2e-06,-1e-06,-1e-06,2e-06,2e-06,0,1e-06,-2e-06,2e-06,-3e-06,0
-1e-06,1e-06,2e-06,-2e-06,-1e-06,-1e-06,-2e-06,1e-06,1e-06,0,1e-06,1e-06,4e-06,3e-06,1e-06,0,2e-06,-5e-06,0,-4e-06,-1e-06,0,1e-06,-2e-06,-3e-06,-1e-06,-1e-06,-2e-06,-1e-06,3e-06,-1e-06,2e-06,-1e-06,2e-06,0,-4e-06,-1e-06,1e-06,-2e-06,-1e-06,-1e-06,-1e-06,-3e-06,-1e-06,-4e-06,-1e-06,2e-06,1e-06,1e-06,1e-06,0,0,1e-06,4e-06,-1e-06,2e-06,0,3e-06,1e-06,-2e-06,-1e-06,4e-06,-2e-06,1e-06,-2e-06,-2e-06,-3e-06,0,1e-06,0,0,0,-1e-06,0,2e-06,-1e-06,2e-06,0,0,1e-06,0,0,-2e-06,-1e-06,1e-06,1e-06,-1e-06,1e-06,0,-1e-06,2e-06,1e-06,1e-06,-1e-06,-3e-06,-2e-06,-4e-06,0,0,0,1e-06,1e-06,-2e-06,-1e-06,-1e-06,-1e-06,0,2e-06,0,-1e-06,-1e-06,0,0,-1e-06,-1e-06,0,3e-06,2e-06,2e-06,3e-06,4e-06
0,-1e-06,-2e-06,1e-06,-3e-06,-3e-06,4e-06,0,-3e-06,0,1e-06,2e-06,-4e-06,-4e-06,1e-06,0,-1e-06,5e-06,1e-06,1e-06,1e-06,0,-1e-06,2e-06,3e-06,-2e-06,1e-06,2e-06,1e-06,-3e-06,-1e-06,1e-06,1e-06,0,0,7e-06,4e-06,-2e-06,0,-2e-06,-1e-06,-1e-06,3e-06,0,2e-06,0,-2e-06,0,0,1e-06,3e-06,-1e-06,-1e-06,-1e-06,1e-06,0,2e-06,-1e-06,-2e-06,-4e-06,-1e-06,-2e-06,0,0,-1e-06,1e-06,2e-06,1e-06,-2e-06,0,-2e-06,1e-06,6e-06,1e-06,0,-2e-06,0,-1e-06,1e-06,0,0,-1e-06,5e-06,0,-3e-06,-1e-06,1e-06,1e-06,1e-06,-1e-06,-3e-06,-1e-06,-2e-06,0,-3e-06,0,4e-06,0,0,0,-2e-06,1e-06,1e-06,-1e-06,-1e-06,0,0,-1e-06,0,-2e-06,1e-06,0,0,-1e-06,3e-06,0,1e-06,0,-5e-06,1e-06,2e-06
1e-06,1e-06,4e-06,0,1e-06,1e-06,-2e-06,1e-06,3e-06,0,2e-06,-1e-06,3e-06,2e-06,-1e-06,3e-06,0,-1e-06,-1e-06,-1e-06,0,0,-1e-06,-3e-06,0,2e-06,0,-1e-06,0,3e-06,-1e-06,-1e-06,0,-3e-06,0,0,3e-06,1e-06,0,-1e-06,-1e-06,2e-06,-3e-06,1e-06,-1e-06,1e-06,2e-06,0,0,-3e-06,-3e-06,-1e-06,0,-1e-06,3e-06,-2e-06,0,0,2e-06,3e-06,1e-06,0,-1e-06,-1e-06,3e-06,0,-1e-06,0,-1e-06,-1e-06,-2e-06,0,-1e-06,0,0,2e-06,-2e-06,-1e-06,0,1e-06,0,0,-2e-06,0,0,0,-2e-06,-1e-06,0,0,1e-06,0,0,-1e-06,1e-06,0,0,0,0,1e-06,-1e-06,-1e-06,1e-06,2e-06,-1e-06,0,0,0,0,-2e-06,-3e-06,-1e-06,0,1e-06,-1e-06,0,0,-1e-06,5e-06,-4e-06,-1e-06
0,-1e-06,-2e-06,-1e-06,0,3e-06,1e-06,-1e-06,-2e-06,0,-1e-06,-2e-06,-2e-06,0,1e-06,-1e-06,1e-06,1e-06,-1e-06,0,-1e-06,0,1e-06,-1e-06,-1e-06,-1e-06,0,0,0,-2e-06,1e-06,1e-06,1e-06,2e-06,0,4e-06,2e-06,0,0,-1e-06,-1e-06,-1e-06,2e-06,-1e-06,0,0,0,-2e-06,0,-1e-06,1e-06,1e-06,0,0,-1e-06,2e-06,0,-1e-06,-2e-06,4e-06,0,-1e-06,3e-06,0,-1e-06,0,3e-06,0,2e-06,1e-06,2e-06,0,4e-06,0,-1e-06,0,1e-06,0,-1e-06,-1e-06,0,0,0,0,2e-06,0,0,1e-06,0,0,0,0,0,1e-06,3e-06,-1e-06,-4e-06,1e-06,0,0,1e-06,1e-06,-3e-06,1e-06,0,0,0,1e-06,1e-06,1e-06,-1e-06,-1e-06,0,0,2e-06,0,1e-06,1e-06,-2e-06,2e-06,-2e-06
0,1e-06,-1e-06,1e-06,0,-2e-06,-1e-06,0,-1e-06,-1e-06,5e-06,1e-06,0,-2e-06,-1e-06,-2e-06,-1e-06,-2e-06,1e-06,2e-06,1e-06,0,0,1e-06,1e-06,1e-06,-1e-06,0,-1e-06,2e-06,0,1e-06,-2e-06,2e-06,0,1e-06,2e-06,-1e-06,1e-06,0,0,-1e-06,0,0,1e-06,1e-06,-1e-06,2e-06,0,2e-06,0,-1e-06,1e-06,0,-2e-06,0,-1e-06,0,0,-2e-06,0,3e-06,0,1e-06,-1e-06,1e-06,0,-1e-06,-1e-06,1e-06,2e-06,0,-3e-06,-1e-06,1e-06,-1e-06,0,1e-06,0,-1e-06,0,0,0,0,0,0,0,0,0,0,1e-06,-1e-06,1e-06,-1e-06,1e-06,1e-06,1e-06,0,1e-06,-1e-06,2e-06,-1e-06,2e-06,1e-06,0,1e-06,1e-06,-1e-06,0,2e-06,0,0,0,-1e-06,-2e-06,1e-06,0,1e-06,-2e-06,2e-06,-2e-06
1e-06,-1e-06,2e-06,0,1e-06,-1e-06,2e-06,-1e-06,2e-06,0,0,1e-06,2e-06,0,0,-1e-06,0,2e-06,0,-1e-06,-1e-06,0,0,2e-06,-1e-06,-1e-06,1e-06,0,1e-06,-2e-06,-1e-06,-1e-06,0,-1e-06,0,0,5e-06,1e-06,0,-1e-06,0,2e-06,0,0,-1e-06,0,1e-06,-1e-06,0,1e-06,-1e-06,-1e-06,-1e-06,0,0,-1e-06,1e-06,0,1e-06,-4e-06,0,0,0,-1e-06,0,0,0,1e-06,-1e-06,-1e-06,0,0,-3e-06,1e-06,0,2e-06,-1e-06,0,1e-06,0,0,0,0,0,1e-06,0,0,0,-1e-06,0,-2e-06,0,0,0,0,0,1e-06,0,0,1e-06,-2e-06,0,-1e-06,-1e-06,0,0,1e-06,1e-06,0,0,2e-06,0,0,1e-06,1e-06,-1e-06,-2e-06,-2e-06,3e-06,-3e-06,0
0,1e-06,-2e-06,0,-1e-06,2e-06,-1e-06,0,-2e-06,0,2e-06,0,-2e-06,0,1e-06,4e-06,0,0,-1e-06,1e-06,0,0,1e-06,-1e-06,0,0,-1e-06,0,-1e-06,1e-06,-1e-06,-1e-06,-1e-06,0,0,1e-06,1e-06,0,0,0,-1e-06,-1e-06,0,-1e-06,1e-06,0,-1e-06,0,0,-1e-06,3e-06,1e-06,0,1e-06,0,1e-06,0,1e-06,-1e-06,1e-06,0,-2e-06,0,0,1e-06,0,-1e-06,-1e-06,1e-06,0,0,0,0,0,0,-1e-06,1e-06,0,-1e-06,0,0,-1e-06,2e-06,0,-2e-06,1e-06,0,0,0,1e-06,0,0,-1e-06,0,0,0,-2e-06,0,0,1e-06,0,1e-06,-1e-06,-1e-06,1e-06,0,-1e-06,-1e-06,0,1e-06,-1e-06,0,0,0,1e-06,1e-06,-1e-06,0,-2e-06,0,2e-06
0,-2e-06,2e-06,1e-06,-2e-06,0,0,0,1e-06,0,-3e-06,-1e-06,0,-1e-06,0,0,-1e-06,-1e-06,1e-06,0,0,1e-06,-1e-06,0,1e-06,1e-06,0,-1e-06,1e-06,-1e-06,1e-06,1e-06,0,1e-06,0,-2e-06,0,-1e-06,0,0,0,0,0,1e-06,-1e-06,0,-2e-06,0,0,0,-2e-06,0,0,-1e-06,1e-06,1e-06,-1e-06,0,1e-06,3e-06,0,3e-06,-2e-06,0,0,0,0,1e-06,-1e-06,1e-06,-2e-06,-1e-06,-1e-06,-1e-06,-1e-06,0,0,0,-1e-06,0,0,0,-1e-06,0,0,-1e-06,0,0,1e-06,1e-06,1e-06,-1e-06,0,-1e-06,-1e-06,0,-1e-06,0,0,0,0,-1e-06,2e-06,-1e-06,0,0,-1e-06,1e-06,0,1e-06,1e-06,0,0,-1e-06,0,-1e-06,0,1e-06,-1e-06,3e-06,2e-06
0,2e-06,-1e-06,0,2e-06,-2e-06,0,0,0,0,-1e-06,-1e-06,-1e-06,1e-06,0,-1e-06,1e-06,0,1e-06,-1e-06,0,0,0,2e-06,0,-1e-06,-1e-06,1e-06,0,1e-06,0,-1e-06,1e-06,0,0,-1e-06,1e-06,1e-06,0,-1e-06,0,1e-06,-1e-06,0,1e-06,-1e-06,1e-06,1e-06,0,1e-06,0,-1e-06,0,-1e-06,1e-06,0,0,-1e-06,0,-1e-06,1e-06,-2e-06,0,0,0,0,1e-06,0,0,0,-2e-06,0,3e-06,0,0,0,-1e-06,0,1e-06,1e-06,0,0,-2e-06,0,1e-06,0,1e-06,1e-06,-1e-06,0,0,0,1e-06,1e-06,-2e-06,0,1e-06,0,0,0,1e-06,0,-2e-06,-1e-06,0,1e-06,0,-1e-06,0,0,0,0,0,0,-1e-06,0,1e-06,-1e-06,3e-06,-2e-06,0
0,-2e-06,-1e-06,-1e-06,2e-06,0,0,0,-1e-06,0,-1e-06,0,1e-06,0,0,-4e-06,0,0,-1e-06,0,0,0,1e-06,-1e-06,-1e-06,1e-06,0,-1e-06,1e-06,-1e-06,0,-1e-06,0,0,0,-1e-06,1e-06,1e-06,0,-1e-06,0,-1e-06,0,0,-2e-06,0,-1e-06,-1e-06,0,-1e-06,1e-06,0,-1e-06,0,-2e-06,-1e-06,0,-1e-06,1e-06,-3e-06,-1e-06,0,-1e-06,-1e-06,0,0,0,0,0,0,2e-06,0,2e-06,0,1e-06,0,0,0,-1e-06,0,0,0,3e-06,0,0,1e-06,-1e-06,0,-1e-06,-1e-06,-1e-06,0,0,-1e-06,0,1e-06,0,0,0,0,-1e-06,0,1e-06,0,0,0,0,1e-06,0,-1e-06,3e-06,0,0,0,0,0,0,-1e-06,-2e-06,-1e-06,-2e-06
0,2e-06,2e-06,0,-2e-06,1e-06,0,0,1e-06,0,-1e-06,0,-2e-06,0,-1e-06,3e-06,0,1e-06,0,0,0,0,-1e-06,-1e-06,1e-06,-1e-06,0,0,0,1e-06,-1e-06,1e-06,0,0,0,-3e-06,-2e-06,-2e-06,0,-1e-06,0,0,0,0,1e-06,0,0,1e-06,0,-1e-06,-2e-06,1e-06,0,1e-06,-1e-06,1e-06,0,-1e-06,1e-06,1e-06,0,-1e-06,1e-06,1e-06,0,0,1e-06,0,-1e-06,0,1e-06,0,-1e-06,0,0,0,0,0,0,0,0,0,0,0,-1e-06,0,0,0,1e-06,0,0,0,0,0,1e-06,0,-1e-06,0,0,0,0,-1e-06,0,1e-06,0,0,0,0,0,-1e-06,-1e-06,0,0,0,1e-06,0,0,1e-06,-1e-06,3e-06,-1e-06
0,-1e-06,-2e-06,0,-1e-06,-1e-06,-1e-06,0,-1e-06,0,-1e-06,0,2e-06,0,1e-06,1e-06,1e-06,-2e-06,1e-06,0,-1e-06,0,0,0,0,1e-06,0,1e-06,0,-1e-06,0,0,-2e-06,-1e-06,0,-1e-06,0,0,0,-1e-06,0,1e-06,0,0,-1e-06,0,1e-06,0,0,1e-06,2e-06,0,0,0,1e-06,0,0,0,-1e-06,3e-06,0,1e-06,1e-06,0,1e-06,1e-06,-1e-06,0,1e-06,0,0,0,0,0,0,0,-1e-06,0,0,-1e-06,0,0,-3e-06,0,0,-1e-06,1e-06,0,1e-06,0,2e-06,0,0,0,1e-06,-1e-06,0,0,0,0,0,1e-06,-1e-06,1e-06,0,0,0,0,0,0,0,0,0,0,-2e-06,0,1e-06,0,3e-06,-1e-06,0
0,1e-06,1e-06,-1e-06,2e-06,-1e-06,1e-06,0,0,0,-1e-06,0,1e-06,-1e-06,-1e-06,0,-1e-06,1e-06,0,1e-06,1e-06,0,1e-06,0,0,0,0,-1e-06,0,0,0,-1e-06,-1e-06,0,0,1e-06,-1e-06,1e-06,0,0,0,-1e-06,1e-06,0,1e-06,0,-1e-06,0,0,1e-06,-1e-06,0,0,0,0,-1e-06,0,0,0,-1e-06,0,1e-06,0,0,-1e-06,0,1e-06,0,-1e-06,0,0,0,-3e-06,0,0,-1e-06,0,0,1e-06,0,0,-1e-06,2e-06,0,0,1e-06,-1e-06,0,0,0,-1e-06,0,0,0,0,0,2e-06,0,0,0,0,0,1e-06,0,0,0,0,1e-06,0,0,0,0,0,0,1e-06,0,0,-1e-06,-3e-06,-2e-06,1e-06
0,-1e-06,0,0,0,1e-06,-1e-06,0,0,0,2e-06,0,-1e-06,0,0,-3e-06,0,-1e-06,-1e-06,0,0,0,0,-1e-06,0,-1e-06,0,0,-1e-06,0,1e-06,1e-06,-1e-06,1e-06,0,-1e-06,-2e-06,-1e-06,0,0,0,0,-1e-06,0,-1e-06,0,0,0,0,-1e-06,0,1e-06,0,-1e-06,1e-06,1e-06,0,0,1e-06,-2e-06,0,-1e-06,0,0,0,0,-1e-06,0,0,0,-1e-06,0,0,0,1e-06,1e-06,0,0,-1e-06,1e-06,0,0,0,0,0,-1e-06,1e-06,0,-1e-06,0,0,0,0,0,1e-06,0,-2e-06,0,0,-1e-06,0,0,0,0,0,0,0,-1e-06,0,0,1e-06,0,0,0,-1e-06,-1e-06,-1e-06,1e-06,1e-06,2e-06,1e-06
0,1e-06,-2e-06,0,-1e-06,0,1e-06,0,-1e-06,0,0,0,-1e-06,0,0,0,0,2e-06,0,0,0,0,0,0,0,1e-06,0,0,1e-06,0,0,0,1e-06,0,0,4e-06,-3e-06,0,0,0,-1e-06,1e-06,1e-06,0,1e-06,0,1e-06,0,0,0,1e-06,0,0,0,0,0,0,-1e-06,-1e-06,0,0,1e-06,0,1e-06,0,1e-06,1e-06,0,1e-06,0,0,0,2e-06,0,0,0,0,0,0,0,0,0,-1e-06,0,1e-06,0,1e-06,0,0,0,-1e-06,0,0,1e-06,-1e-06,0,0,0,0,0,-1e-06,0,-1e-06,-1e-06,0,0,0,1e-06,0,1e-06,-1e-06,0,0,0,1e-06,1e-06,0,0,2e-06,1e-06,0
