8.3e-05,1.3e-05,0.000121,6.1e-05,0.000115,1.2e-05,3.4e-05,4.9e-05,6.9e-05,3.4e-05,0.000243,3.9e-05,4.2e-05,9.4e-05,0.000162,0.000199,0.000136,1.1e-05,4.9e-05,3.1e-05,3.3e-05,6.2e-05,0.000104,4.6e-05,8.3e-05,2.3e-05,2e-06,1.9e-05,3.5e-05,8e-06,4.6e-05,1.7e-05,3.8e-05,2.3e-05,5.2e-05,9.1e-05,0.000142,9.9e-05,4e-06,3.6e-05,4.3e-05,8e-06,4e-06,1.5e-05,9.2e-05,0.000153,2.6e-05,0.000108,5e-05,9.2e-05,3.3e-05,3.6e-05,6e-06,0.00012,9.1e-05,0.000142,2.6e-05,1.9e-05,9.5e-05,7e-06,9e-05,6e-05,6.8e-05,8.8e-05,0.000117,1.6e-05,8.4e-05,8e-06,1.3e-05,3.6e-05,9.8e-05,0.000114,6e-05,6.5e-05,7.7e-05,3.8e-05,6.5e-05,1.1e-05,7.9e-05,0.000187,0.000107,2e-05,2.7e-05,1.5e-05,1.4e-05,0.000116,5.5e-05,4.8e-05,0.000243,1.8e-05,1.3e-05,3e-06,0.000112,0.000139,5e-05,0.000123,3.4e-05,3.6e-05,4e-06,6.8e-05,0.000135,0.000102,8e-06,5e-06,1.6e-05,1.7e-05,2e-06,5.5e-05,5.3e-05,7e-05,1.4e-05,5.9e-05,2.1e-05,2.8e-05,4.8e-05,8.3e-05,9e-06,2.5e-05,1.1e-05,5.3e-05,3.9e-05
2e-04,0.000115,0.000336,0.000149,0.000306,0.000148,0.000144,0.000216,7.6e-05,9.2e-05,0.000492,0.000101,4.2e-05,0.000211,0.000326,0.000314,0.000194,3e-05,0.000144,7.2e-05,6.9e-05,0.000119,0.000161,3.6e-05,0.000156,7.2e-05,0.000126,0.000162,5.2e-05,0.000127,8e-05,6.7e-05,0.000193,5.7e-05,9e-05,2e-04,0.000284,0.000266,2.1e-05,5.8e-05,5.9e-05,0.00018,6.9e-05,6.7e-05,0.000156,0.000309,5.4e-05,0.000232,9.5e-05,0.000113,7.9e-05,4.9e-05,7.3e-05,0.000284,0.00026,0.000403,8.2e-05,8.7e-05,0.000232,2.8e-05,0.000153,0.000162,0.000186,0.000161,0.000241,8e-05,0.000252,0.000109,0.000143,0.000139,0.00026,0.00031,0.00014,0.000147,0.00016,5.9e-05,0.000181,3.8e-05,0.000169,0.00036,0.000256,0.000122,6.7e-05,4.8e-05,8.4e-05,0.000297,0.000147,0.000108,0.000558,4.1e-05,5.5e-05,8.2e-05,0.000192,0.000284,0.000183,0.00036,0.000115,0.000135,2.3e-05,0.000154,0.000304,0.000226,4.5e-05,1.9e-05,6.9e-05,4.3e-05,1.9e-05,6.8e-05,6.2e-05,0.000248,5.4e-05,0.000181,9.8e-05,0.000177,0.000148,0.000187,6.2e-05,8e-05,3.4e-05,6e-05,8.3e-05
0.000309,8.2e-05,0.000415,0.000208,0.000487,0.000317,7.8e-05,0.000302,0.000143,0.000247,0.000618,0.000268,7.4e-05,0.000316,0.000396,0.000482,0.000431,0.00012,0.000169,0.000205,1.9e-05,0.000252,0.000235,0.000215,0.000102,0.000301,0.000358,0.000206,0.000156,0.00017,0.000294,0.000174,0.000245,0.000257,0.000243,0.00031,0.000203,0.000394,6.5e-05,0.000319,0.000295,0.000486,0.000221,0.000161,0.000185,0.000567,0.000255,0.000291,0.000214,0.000105,0.000279,0.000217,3.8e-05,0.000485,0.000201,0.000474,9.8e-05,6.5e-05,0.000441,0.000203,0.00019,7.8e-05,5.9e-05,0.000485,0.000355,0.000321,8.2e-05,0.000172,0.00011,0.000336,0.000378,0.000417,0.000289,0.00013,0.000246,9e-05,0.000218,0.000203,0.000348,0.000253,0.000187,1.6e-05,0.000188,0.000178,0.00026,0.000255,0.000113,0.000124,0.000864,0.000193,0.000193,0.000196,0.000259,0.000309,0.000271,0.000324,4.7e-05,0.000335,0.000254,2e-05,0.000413,0.000197,0.000131,0.000238,9.8e-05,2e-04,0.000146,0.000236,0.000316,0.000315,0.000249,0.000394,0.000135,5.9e-05,0.000122,0.000294,8.6e-05,0.000225,0.000326,0.000364,9.4e-05
0.000387,0.000393,0.000274,0.000411,3.8e-05,0.000767,0.000969,0.00066,0.000367,0.000365,0.000907,0.000923,0.000612,0.000562,0.000835,0.000738,0.001068,0.000642,0.000539,0.000719,0.000385,0.000426,0.000669,0.000746,0.000568,0.000645,0.000226,0.000219,0.000283,0.000435,0.000433,0.000256,0.000329,0.000545,0.000418,0.000424,0.000503,0.000632,0.00033,0.000459,0.000771,0.000238,0.000754,0.000426,0.000227,0.001094,0.000615,0.000699,0.000667,0.000642,0.000525,0.000246,4.7e-05,0.000673,0.000496,0.000998,0.000672,0.000421,0.000482,0.000645,0.000224,0.000355,0.000262,0.00077,0.000323,0.000594,0.000662,0.000272,0.000443,0.000245,0.000579,0.000447,0.000861,0.000726,0.000404,0.000494,0.000237,0.000345,0.000245,0.000899,0.000486,0.000137,0.000168,0.000441,0.00062,0.000825,0.000386,9.1e-05,0.001133,0.001108,0.000604,0.000371,0.000434,0.000533,0.000473,0.000887,0.000609,0.000593,0.000414,0.000269,0.00041,0.000762,0.000585,0.000239,0.000294,0.000285,0.000606,0.000801,0.000294,0.000576,0.000214,0.000638,0.000635,0.000134,0.000112,0.000329,0.000327,0.000608,9.2e-05,0.000196,0.000485
0.000455,0.000394,0.000353,0.000548,0.000524,0.001133,0.001129,0.000506,0.000944,0.001028,0.000263,0.000902,0.000454,0.000801,0.001385,0.001574,0.001824,0.000709,0.000466,0.000786,0.000443,0.000184,0.000615,0.000979,0.000221,0.000432,0.000391,0.000545,0.000666,0.000147,0.00037,0.00029,0.000468,0.000319,0.000613,0.000516,0.000146,9e-04,0.000828,0.00093,0.00029,0.000853,0.000977,0.000592,0.000243,0.000912,0.000519,0.000613,0.000284,0.000242,0.000565,0.000569,0.000358,0.00041,0.000609,0.000344,0.000728,0.000286,0.000474,0.000236,0.000185,0.000422,0.000261,0.000994,0.001119,0.0011,0.000453,0.000966,0.00051,0.000709,0.000424,0.000522,0.000651,0.000337,0.000371,0.000276,0.000386,0.000518,0.000684,0.000812,0.001211,0.000776,0.000381,0.000155,0.000724,0.000639,0.000317,0.000153,0.000726,0.000948,0.000123,6.1e-05,0.000497,0.001088,0.000621,0.000294,0.000876,0.000864,0.00071,0.000659,0.000375,0.000572,4.5e-05,0.000309,0.000328,8.9e-05,0.00075,0.000726,0.000556,0.000382,0.000582,0.000841,0.000952,0.001048,0.000859,0.000825,0.000491,0.000718,0.000713,0.000594,0.000739
0.000274,0.000278,0.000579,0.000426,0.000908,0.001079,0.000365,0.000518,0.000596,0.000441,0.000583,0.000521,0.000356,0.000688,0.000392,0.000566,0.000785,0.000458,0.000322,0.000409,0.000343,0.000151,0.000514,0.000474,0.000518,0.000176,0.000379,0.000296,0.000381,0.000341,0.000264,0.000229,0.000327,0.000322,0.000323,0.000382,0.000486,0.00054,0.000793,0.000237,0.000227,5e-04,0.000269,0.000216,0.000292,0.00044,0.000319,0.000135,3.5e-05,0.000294,9.4e-05,0.000486,0.000256,0.000471,0.00048,0.000341,0.000458,0.000456,0.00033,0.000134,0.00013,0.000503,0.000442,0.000575,0.000544,0.000532,0.000402,0.000674,0.000272,0.000455,0.000389,0.000182,0.000114,0.000239,0.000285,0.000187,0.000212,0.00054,0.000111,0.000295,0.000458,0.000353,0.000679,0.000515,0.000422,0.000111,0.000266,0.000322,0.000364,0.000325,0.000638,0.000253,0.00045,0.000549,5e-05,0.000198,0.000432,0.000249,0.000725,0.000429,0.000364,0.000409,0.000444,5e-04,0.000294,0.000123,0.000907,0.000342,0.000375,0.000301,0.000541,7.6e-05,0.000853,0.000472,0.000453,0.000522,0.000499,0.000129,0.000303,0.000404,0.000679
0.000184,0.000229,0.000268,3.6e-05,0.001041,0.000874,0.000557,0.000324,0.000648,0.000588,0.00074,0.000515,0.000347,0.000437,0.000345,5e-04,0.000206,0.00033,0.00021,0.000295,0.000194,0.000479,0.00052,0.000363,0.000304,0.000567,0.000333,0.000186,0.000509,0.000216,0.000502,0.000196,0.000119,0.000173,0.000189,0.000715,0.00078,0.000391,0.000387,5.1e-05,0.000702,0.000404,0.000587,0.000197,0.00026,0.000348,0.000197,0.000342,0.000219,0.000485,0.000659,0.000373,0.00016,0.000496,0.000476,0.000468,0.000703,0.000793,0.00061,0.000297,7.2e-05,0.00048,0.000417,0.000636,0.000472,0.000184,0.000499,0.000674,0.000634,0.000289,0.000965,0.000225,0.000404,0.000254,0.000133,0.00051,0.000282,0.000357,0.000314,0.000513,0.000488,0.000153,0.000742,0.000351,0.000766,0.000155,0.000597,0.000577,0.000902,0.000353,0.000376,0.000418,0.000192,0.000696,0.00023,0.000264,0.000363,5e-04,0.001001,0.001064,0.000152,0.000395,0.000449,0.000272,0.000258,0.000317,0.000828,0.000666,0.000205,0.00027,0.000674,0.000547,0.000542,0.000956,0.000549,0.000422,0.000408,0.000291,0.00017,0.000598,0.000254
0.000394,0.000454,0.000342,0.000428,0.001121,0.00209,0.001477,0.001774,0.001941,0.001023,0.000891,0.001341,0.001129,0.000683,0.000371,0.000118,0.000188,0.00029,0.000588,0.000576,0.000488,0.00035,0.000453,0.000611,0.000461,0.000482,0.000302,0.000647,0.000745,0.000845,0.00095,0.000842,0.00015,0.000675,0.000329,0.000483,0.0013,0.001048,0.000505,0.000793,0.000761,0.001108,0.000732,0.000603,6.9e-05,0.000315,0.000194,0.00069,0.000603,0.000807,0.000507,0.000757,0.000692,0.000538,0.001284,0.001346,0.000517,0.000994,0.000963,0.000476,8.4e-05,0.000308,0.000344,0.000196,0.000641,0.000397,0.000908,0.000439,0.000922,0.000357,0.001179,0.000932,0.00066,0.00028,0.000156,0.001115,0.001164,0.001028,0.000431,0.001022,0.000553,0.000527,0.000848,0.000758,0.000878,0.00117,0.000791,0.000356,0.00093,0.000729,0.000358,0.000719,0.000501,0.001077,0.000558,0.00074,0.001042,0.000592,0.001255,0.000318,0.000547,0.000538,0.000343,5e-04,0.001012,0.000834,0.00054,0.000895,0.000588,0.000359,0.000735,0.000268,0.000601,7.7e-05,0.000488,0.00063,0.000694,0.000397,0.000261,0.000327,0.000846
0.000491,0.000844,0.000995,0.00073,0.001342,0.001353,0.001223,0.001634,0.001532,0.000601,0.000309,0.000872,0.00154,0.001164,0.000815,0.000935,0.000518,0.000647,0.000198,0.000462,0.000372,0.000496,0.000591,0.000573,0.000681,0.000857,0.000511,0.001369,0.001548,0.000761,0.00034,0.00035,0.000761,0.000753,0.000523,0.000238,0.000626,0.000909,0.000168,0.00085,0.001286,0.00106,0.000556,0.000648,0.000592,9e-04,0.000685,0.000699,0.00016,0.000114,0.000977,0.000608,7.7e-05,0.000147,0.001127,0.000106,0.000356,0.000896,0.000632,8.9e-05,0.000462,0.000538,0.000276,0.00016,0.000588,0.000517,0.000843,0.000871,0.001072,0.000933,0.001269,0.000971,0.000771,0.000591,0.000222,0.000944,0.000957,0.00062,0.000862,0.001124,0.000432,0.000515,0.000236,0.000656,0.00016,0.001293,0.001432,0.000994,0.000634,0.000619,0.00088,0.000879,0.00113,0.000965,0.00115,0.000583,0.00084,0.000454,0.00088,0.001119,0.00106,0.000722,0.000531,0.00026,0.001112,0.000815,2.5e-05,0.000841,0.000716,0.000683,0.000317,0.000765,0.001004,0.000375,0.000435,0.000451,0.000386,0.000174,0.000312,0.000786,0.001063
0.000797,0.000986,0.00084,0.000384,0.000769,0.000393,0.000672,0.001008,0.000374,0.000307,0.000172,0.000486,0.001382,0.001392,0.000885,0.000199,0.000759,0.000623,0.000684,6.3e-05,0.000178,0.000653,0.000846,0.001495,0.000979,0.000894,0.000756,0.000982,0.00074,0.000717,0.000803,0.000689,0.000367,0.001196,0.000912,0.000924,0.000675,0.000864,0.000786,0.00093,9.9e-05,0.00026,0.00013,0.000466,9.6e-05,0.000824,0.000848,0.001017,0.000789,0.000824,0.001237,0.000677,0.000338,0.000216,0.000605,0.00086,0.001015,0.000835,0.000498,0.000517,0.000449,0.000162,0.000466,0.000862,0.000573,0.000228,0.000625,0.000193,0.000496,0.000248,0.000741,0.000671,0.000334,0.000319,0.000456,0.000525,4.2e-05,0.000695,0.000946,0.000453,0.000428,0.000272,0.000248,0.000254,0.000208,0.001165,0.000298,0.000234,0.00045,0.000409,0.000518,0.000375,0.000477,0.000941,0.000985,0.000616,0.000469,0.000619,0.001015,0.000711,0.000502,0.000622,0.000783,0.000687,0.000619,0.000311,0.000549,0.000306,0.000645,0.000425,6e-04,0.000806,0.000407,0.000664,0.000639,0.000557,0.000542,0.000322,0.000386,0.000955,0.000476
0.001801,0.001195,0.000915,0.000616,0.000609,0.000856,0.000771,0.000665,0.000296,0.000287,7e-04,0.00086,0.000615,0.000362,0.000278,0.000251,0.000959,0.000541,0.000388,0.000563,0.000222,0.000622,0.000863,0.001473,0.000793,0.00073,0.000433,0.000912,0.000554,0.000706,0.000547,0.00029,1e-04,0.000874,0.000615,0.000833,0.000856,0.00048,0.000504,0.000243,0.00026,0.00019,0.000361,0.000321,0.000224,0.000694,0.000568,0.000298,0.000242,0.000655,0.001122,0.000422,0.000183,0.000127,0.000104,0.000458,0.00046,0.00045,0.000171,0.000297,0.000591,0.000697,0.000655,0.000493,0.000261,0.000237,0.000259,0.000423,0.000168,0.000343,0.000778,0.000643,0.000829,0.000813,0.000569,0.000544,0.000439,0.000324,0.000187,0.000364,0.000562,0.000598,0.000498,0.000237,0.000318,0.000525,0.000475,0.000277,0.000359,0.000168,0.000235,0.000451,0.000445,0.00092,0.000346,0.000123,0.000436,0.000289,0.00038,0.000377,0.000118,0.000415,0.000486,0.000207,0.000414,0.000519,0.000178,0.000408,0.000105,0.000342,0.000135,0.000182,0.000341,0.000679,0.000164,0.000565,0.000518,0.000527,0.000133,0.000502,0.000516
0.000972,0.00073,0.000271,0.00012,0.000377,0.000604,0.000335,0.000501,0.000361,0.000261,0.000626,0.000414,0.000361,0.000329,0.000488,0.000253,0.000731,0.000544,0.000588,0.000375,0.000429,0.000414,0.000592,0.000412,0.000255,0.000334,0.000518,5.5e-05,0.000267,0.000227,0.000678,0.000541,0.000233,0.000453,0.000223,0.000284,0.000345,0.000256,0.000324,0.000168,0.000626,0.000149,0.000298,0.00016,0.000205,0.000342,0.000218,0.000232,0.000154,0.000472,0.000162,0.000284,0.000161,0.000236,0.000325,0.000314,0.000357,7.1e-05,8.2e-05,0.000331,0.000661,0.000152,0.000219,0.000138,0.000196,0.000134,0.000241,0.000392,0.00023,7.2e-05,0.00067,0.000234,5e-04,0.000319,0.000525,0.000447,9.9e-05,0.000368,0.000456,0.000538,0.000196,9.6e-05,0.000604,0.000199,0.000415,8.6e-05,0.000171,0.000214,0.000161,6.2e-05,0.000465,0.000102,0.000136,0.000363,7.4e-05,2e-04,0.00028,0.000416,0.000544,0.000348,0.000283,0.00018,0.000133,0.000287,0.000371,0.00024,0.000279,0.000354,0.000248,0.000235,0.000103,0.000271,0.000216,0.000447,0.000461,0.00055,0.000637,0.000229,9.5e-05,0.000338,0.000559
0.000468,0.000441,0.000169,9.1e-05,0.00031,0.000355,5.6e-05,0.00048,0.000131,0.000159,0.000186,0.000252,0.000108,0.000178,0.000446,0.000249,0.000476,0.000164,0.000361,0.000283,0.000282,0.000119,0.000514,0.000145,0.000227,0.000275,0.000195,0.000247,0.00027,0.000163,0.000346,0.000128,0.000112,0.000212,0.000219,0.000278,0.000198,0.000362,0.000108,0.000225,0.000394,0.000114,0.000125,0.000142,0.000148,0.000128,0.00024,0.000302,0.00016,0.000339,0.000136,0.000227,0.000129,8.4e-05,0.000257,2.6e-05,0.00018,0.000217,0.000359,0.000263,0.000393,0.000362,0.000356,0.000168,0.000159,0.000149,0.000204,0.000237,0.000432,0.000186,0.000436,0.000152,0.000407,0.000143,0.000194,0.000308,0.000291,0.000243,0.000238,3.8e-05,0.000176,0.000106,0.000269,0.000374,0.000285,0.000321,0.000143,0.000233,2e-04,0.000142,0.000293,0.00024,0.000307,0.000283,0.000284,0.000176,0.000101,0.000138,0.000291,3.9e-05,8.7e-05,0.000146,9.6e-05,7.5e-05,0.00028,0.000106,0.000393,0.000168,0.000235,0.000186,0.000167,0.000309,0.000513,0.000147,0.000257,0.000195,0.000424,0.000101,0.000125,0.000295,0.000563
0.000506,0.000481,0.000146,0.000293,0.000134,0.000531,0.000516,0.000485,0.000345,0.00033,0.000283,0.000415,0.000187,0.00021,0.000766,0.000388,0.00057,0.000335,0.000159,0.00018,0.000525,0.000195,0.000637,5.1e-05,0.000261,0.000342,0.000579,0.000133,0.000686,0.000378,0.000533,0.000318,0.000206,0.000453,0.000233,0.00013,0.000149,0.000232,0.000245,0.000228,0.000163,0.000456,0.000277,0.000184,7e-05,0.000348,0.000363,0.000546,0.000332,0.000197,6.4e-05,0.000148,0.000566,0.000288,0.000793,0.00022,1e-04,0.000893,0.000549,0.00018,0.000847,0.000391,5e-04,0.000221,0.00041,0.000409,0.000312,0.00051,0.000559,0.000686,0.00049,0.000206,0.000494,0.00011,0.000197,0.000254,0.000451,0.000286,0.000208,0.000359,0.000125,0.000228,0.000174,0.000292,0.000747,0.000204,0.000446,0.00013,0.000451,0.000393,0.000226,0.000188,0.000776,0.000153,0.00029,0.000451,0.000124,0.000115,0.000363,0.000103,0.000246,0.000156,0.00032,0.000282,0.000136,0.000492,0.00032,0.000329,0.000205,0.000416,0.000477,0.000268,0.000439,0.000792,0.000332,0.000467,4e-04,0.000636,0.000301,0.00018,0.00053
0.000531,0.001119,0.000829,0.00061,0.000136,0.000848,0.000857,0.000588,0.000429,0.000801,0.000329,0.000493,0.000873,0.000722,0.001148,0.000985,0.000987,0.001306,0.001059,0.000421,0.001027,0.001188,0.001068,0.00085,0.000541,0.001086,0.001496,0.001666,0.000928,0.001238,0.001142,0.000882,0.00069,0.000494,0.000309,0.00029,0.000431,0.000231,0.00028,0.000248,0.000328,0.00063,0.000745,0.000379,0.000227,0.00069,0.000665,0.001131,0.001306,0.001032,0.000412,0.000226,0.000798,0.000567,0.001414,0.001078,0.000736,0.000895,0.001876,0.001482,0.001243,0.001684,0.001745,0.001071,0.000455,0.000289,0.000968,0.00121,0.001523,0.001709,0.000862,0.000404,0.000731,0.000612,0.000118,0.000141,0.000441,5e-04,0.000469,0.000461,0.000632,0.000817,0.000907,0.000316,0.00103,0.000947,0.000519,0.000723,0.000533,0.001226,0.001392,0.000899,0.00064,0.001499,0.000778,0.000849,0.001021,0.00065,0.00058,0.000648,0.000587,0.000554,0.00074,0.001236,0.000859,0.000244,0.00075,0.000324,0.000244,0.000302,0.00042,0.000885,0.001133,0.001844,0.001187,0.000669,6.6e-05,0.000896,0.001053,0.000418,0.000877
0.000498,0.001162,0.001339,0.000722,0.000526,0.000662,0.001501,0.001666,0.001696,0.000984,0.000609,0.000626,0.000826,0.000815,0.001564,0.002233,0.002149,0.001545,0.000814,0.001396,0.001055,0.000703,0.000983,0.000462,0.000513,0.00118,0.00035,0.001316,0.001691,0.001302,0.000921,0.000705,0.000371,0.000539,0.000202,0.000294,0.00065,0.000595,0.000535,0.000539,0.000351,0.00022,0.000285,0.000195,8.1e-05,0.000517,0.001073,0.0014,0.000972,0.000742,0.000803,4e-04,0.000594,0.000362,0.000965,0.00071,0.000225,0.001304,0.001541,0.001384,0.000472,0.001374,0.001426,0.001291,0.00141,0.00125,0.00102,0.000626,0.00063,0.000752,0.001004,0.000841,0.000444,0.000605,0.000708,0.00056,0.000222,0.000292,0.00041,0.00031,0.000633,0.000239,0.000438,0.000496,0.001186,0.000645,0.00075,0.001165,0.0014,0.001354,0.000863,0.000674,0.001279,0.001678,0.001904,0.000901,0.000418,0.000501,0.000122,0.000294,3e-05,0.000298,0.000449,0.001057,0.001396,0.001334,0.000853,0.000721,0.000624,0.000817,0.000283,0.000822,0.001002,0.001007,0.000703,0.000378,0.000766,0.000855,0.000225,0.000275,0.001012
0.000198,0.001165,0.00033,0.00023,0.000214,0.000495,0.000446,0.00082,0.000723,0.000457,0.000566,0.000319,0.000157,0.000647,0.000512,0.000853,0.000362,0.000496,0.000288,0.000636,0.000197,0.000441,0.000512,0.000147,0.000347,0.000635,0.000625,0.000652,0.000455,0.000478,0.000366,0.000179,0.000342,0.000505,0.000458,0.000346,0.000519,0.000136,0.000341,0.000146,0.000137,0.000174,0.000237,8.5e-05,2.3e-05,0.000295,0.000535,0.000538,5.6e-05,0.000501,0.000161,0.000233,0.000102,0.000118,0.000536,0.000259,0.000426,0.000627,0.000533,0.000548,0.000572,0.000911,0.000431,0.000559,0.000465,9.7e-05,0.000463,0.000125,0.000303,0.00021,0.000429,0.000166,0.000147,0.000533,3e-04,0.000291,6.4e-05,0.000269,8.9e-05,0.00021,0.000411,0.000686,0.00027,0.000352,0.000475,0.000183,0.000475,0.000541,0.00022,0.000562,0.000322,0.000361,0.000408,0.000738,0.000623,0.000381,0.000171,8.4e-05,0.000194,0.000136,5.4e-05,0.000213,0.000108,0.000748,0.000303,0.000241,0.000201,0.000307,0.000218,0.000378,0.000453,0.000299,0.000292,0.000317,0.000266,7e-05,0.000553,0.000264,1.8e-05,0.000112,0.000602
0.000268,0.000525,0.000324,0.000222,0.000231,0.000242,0.000502,0.000367,0.000336,0.000246,0.000147,0.000229,0.000173,0.000385,0.000309,0.000508,0.000171,0.000193,0.00024,0.000193,0.000116,0.000321,0.000146,0.000176,0.000335,0.000151,0.000229,0.000309,0.000109,0.000141,0.000231,0.000131,0.000194,0.000188,0.000206,0.000362,0.000167,0.000169,0.000129,0.000175,9.6e-05,0.000224,0.000317,0.000171,0.000118,0.000291,0.000103,0.000207,0.000266,0.000136,4.6e-05,0.00024,0.000298,0.000171,2.1e-05,6.4e-05,0.000294,0.000374,0.000169,3e-04,0.000354,0.000335,0.000334,0.000229,0.000215,0.000275,0.000296,7.7e-05,0.000194,0.000165,0.000114,0.000257,0.000277,0.000161,6.5e-05,0.000267,0.00011,0.00022,0.000127,0.000118,0.000335,0.000303,0.000166,0.000226,0.000131,7.3e-05,0.000238,0.000212,0.000121,0.000179,0.000304,3.1e-05,0.000283,0.000496,0.000129,0.000125,0.000212,6.8e-05,0.000129,7.2e-05,3.6e-05,0.00011,9.8e-05,0.000309,0.000262,5.2e-05,6.9e-05,9.2e-05,0.000185,0.000125,0.000153,0.000245,0.000263,0.000166,0.000177,0.000169,0.00024,0.000303,7.2e-05,0.000246,0.000278
6.6e-05,0.000375,0.000176,2.9e-05,0.000228,0.000215,0.000304,0.000206,0.000205,6.5e-05,3e-06,0.00016,3e-05,0.00012,0.000196,0.000392,0.000158,0.000222,0.000113,0.000185,0.000148,0.000159,0.000109,8e-05,0.000111,0.000149,0.000168,0.000333,0.000164,5.3e-05,0.000199,7.7e-05,0.000134,0.000147,8.3e-05,8.6e-05,0.000118,0.000171,0.000104,0.000158,3e-05,0.000106,0.000191,6.9e-05,8e-05,0.000262,0.000161,0.000169,0.000279,0.000161,0.000111,0.000132,0.000109,0.000127,0.000136,0.000133,0.000231,0.000231,0.000225,0.000268,9.3e-05,0.000119,0.000226,0.000307,0.000251,0.000162,0.000223,7.4e-05,0.000242,0.000204,0.00013,0.000208,8.5e-05,0.000125,9.8e-05,0.000147,7.2e-05,0.000123,0.000143,3.3e-05,3.5e-05,6.2e-05,0.00015,0.000215,0.000105,4.3e-05,0.000133,0.000182,0.000107,0.000253,0.000189,2.6e-05,0.000297,0.000285,9.7e-05,5.7e-05,0.000153,4.5e-05,5.9e-05,0.000119,7.2e-05,0.000173,9e-05,0.000249,0.000227,3e-05,3e-05,8e-05,0.000147,6.4e-05,7.6e-05,0.000112,0.000243,0.000162,0.000104,3.5e-05,2.6e-05,0.000168,0.000134,0.000209,0.000172
0.000116,0.000324,5.2e-05,2e-05,0.000161,6.6e-05,0.00027,0.000115,0.000166,9.9e-05,0.000129,8.1e-05,0.000125,0.000104,0.000205,0.000203,0.00021,6.5e-05,5.9e-05,0.000229,9.4e-05,0.000225,6.9e-05,9.6e-05,0.000181,6.6e-05,0.000228,0.000128,0.000113,2.9e-05,0.000118,8.5e-05,6.2e-05,1.3e-05,6.2e-05,0.000182,0.000108,9.5e-05,0.000134,8e-05,7.3e-05,8.2e-05,9e-05,1.6e-05,5.4e-05,0.000273,9.2e-05,0.000246,0.000161,0.000113,9.3e-05,8.5e-05,0.000104,0.000144,0.000121,0.000174,0.000117,0.000261,0.000247,0.000167,0.000182,0.000162,0.000161,0.00021,0.000157,0.000106,0.000153,9e-05,0.000132,1e-04,0.000147,0.000149,0.000152,0.000114,9.1e-05,0.000142,3.8e-05,9.8e-05,0.000178,9.2e-05,6.2e-05,0.000146,4.1e-05,0.000101,0.000101,8.1e-05,0.000152,0.000124,0.000149,0.000213,0.00018,8.1e-05,0.000196,0.000128,0.000172,9.6e-05,7.8e-05,2e-05,2.7e-05,6.2e-05,9.6e-05,0.000101,0.000134,0.000212,9e-06,0.000134,5.1e-05,0.000106,0.000148,4e-05,5.1e-05,0.00017,0.000132,0.000164,2.9e-05,7.1e-05,0.000153,8.5e-05,7.4e-05,0.00019,0.000224
0.000153,0.000165,7.8e-05,4.5e-05,8.9e-05,3.2e-05,7e-05,0.000283,0.000175,5.7e-05,0.000194,0.000169,0.000101,0.000122,0.00011,0.00013,8.7e-05,0.000128,1e-04,9.4e-05,2e-05,0.000186,0.000109,3.1e-05,0.000204,6.9e-05,0.000241,0.000228,6.9e-05,3.8e-05,9e-05,4.4e-05,3.1e-05,5.3e-05,4.9e-05,0.000138,5.1e-05,8.6e-05,0.000112,0.000107,8.9e-05,0.000127,6e-05,8.1e-05,2.3e-05,0.00022,8.5e-05,0.000198,0.000203,0.000166,6.6e-05,8.3e-05,0.000114,9.7e-05,4.5e-05,5e-05,6.9e-05,0.000181,0.000235,0.000203,0.00013,0.000232,0.000279,0.000236,6.2e-05,0.000101,0.000129,5.6e-05,0.000179,6.5e-05,9.4e-05,5.8e-05,8.6e-05,1.2e-05,3e-05,0.000167,4.7e-05,5.9e-05,8.2e-05,3.5e-05,7e-05,0.000126,6.9e-05,0.000145,3.4e-05,4.3e-05,8e-05,8.8e-05,0.000102,0.000148,9.1e-05,5.2e-05,0.000171,0.000217,3.4e-05,4.4e-05,9e-05,9e-06,4.1e-05,0.000102,4.7e-05,5.1e-05,7.1e-05,0.000148,9.8e-05,7e-05,5.1e-05,6.8e-05,0.000188,7.3e-05,5.5e-05,0.000162,0.000136,5.9e-05,5.6e-05,8.5e-05,3e-05,9.9e-05,2.3e-05,0.000146,0.000137
2.5e-05,0.000178,7.7e-05,1e-05,0.000166,4.9e-05,0.000145,0.000175,9.8e-05,5.1e-05,0.000125,7.6e-05,9.4e-05,0.000171,0.000127,0.00015,0.000104,0.000145,7.7e-05,0.000155,7e-06,0.000129,4.6e-05,2.7e-05,0.000137,4.6e-05,0.000139,0.000132,6.4e-05,3.6e-05,8.5e-05,3e-05,5.5e-05,6.9e-05,2.9e-05,0.000122,8.6e-05,0.000112,0.000116,4.4e-05,5e-05,5.8e-05,6.6e-05,2e-05,3.2e-05,0.000149,4.3e-05,0.000137,0.000167,0.000121,6e-05,7.1e-05,5e-05,2.7e-05,3.8e-05,0.000108,6.3e-05,0.000217,0.000202,6.1e-05,0.000172,9.1e-05,0.000173,0.000167,6.6e-05,9.1e-05,0.000119,7.1e-05,0.000148,5.5e-05,0.000124,0.00012,9e-05,5.3e-05,4.5e-05,9.7e-05,3.2e-05,4.3e-05,0.000127,5e-05,6.6e-05,8.2e-05,2e-05,0.000115,6e-05,3.4e-05,3.5e-05,7.6e-05,9.3e-05,8.7e-05,0.000149,6e-05,8.6e-05,0.000113,3e-05,7.8e-05,3.4e-05,2.7e-05,4e-05,8.8e-05,5e-05,7.9e-05,5.4e-05,0.000133,9.2e-05,4.7e-05,2.2e-05,1.5e-05,0.000128,2.7e-05,4.4e-05,0.00012,4.9e-05,0.00011,1.8e-05,6.9e-05,6.6e-05,9.4e-05,8.9e-05,0.000116,0.000148
2.8e-05,8.2e-05,4.7e-05,3e-05,5.9e-05,2e-05,5.4e-05,8.4e-05,2.9e-05,2e-05,5.3e-05,2.7e-05,4.6e-05,7.9e-05,2.8e-05,7.7e-05,3.9e-05,4.6e-05,4.7e-05,5.6e-05,1.6e-05,3.2e-05,3e-05,2.5e-05,6e-05,8e-06,5.4e-05,6.8e-05,1.5e-05,1.4e-05,3.2e-05,2.8e-05,1.8e-05,1.9e-05,1.1e-05,5.9e-05,3.4e-05,3.3e-05,3.9e-05,7e-06,4e-05,1.1e-05,3e-05,8e-06,1.6e-05,4.3e-05,9e-06,4.5e-05,6.5e-05,6.9e-05,2.6e-05,2.2e-05,3e-05,3.3e-05,2.7e-05,5.7e-05,2.2e-05,0.000102,6.9e-05,3.8e-05,3.7e-05,7e-05,7.1e-05,8.2e-05,1.7e-05,3.6e-05,6.7e-05,4e-05,7e-05,2.3e-05,5.4e-05,3.5e-05,3.1e-05,2.2e-05,7e-06,5.5e-05,1.6e-05,6e-06,3.5e-05,2.9e-05,1.2e-05,1.1e-05,7e-06,4.3e-05,1.6e-05,1.2e-05,2.2e-05,2.9e-05,5.1e-05,4.4e-05,6.5e-05,1.7e-05,3.8e-05,5.5e-05,2.8e-05,1.8e-05,2.2e-05,7e-06,9e-06,2.7e-05,1.4e-05,2.8e-05,3.5e-05,5.6e-05,3.8e-05,2.7e-05,1.6e-05,5e-06,3.9e-05,2.1e-05,2.5e-05,4.6e-05,3.7e-05,3.9e-05,1.1e-05,1e-05,3.9e-05,1.8e-05,1.6e-05,4.9e-05,7.6e-05
2.2e-05,6.7e-05,2.5e-05,9e-06,4.7e-05,1.2e-05,5.5e-05,7.8e-05,3.6e-05,1.7e-05,5.9e-05,3.6e-05,2.7e-05,5.6e-05,2e-05,5.8e-05,4.1e-05,6.1e-05,4.7e-05,5.8e-05,2.2e-05,3.2e-05,2.9e-05,1.5e-05,5.1e-05,7e-06,5.3e-05,7.2e-05,3.4e-05,1.6e-05,1.6e-05,1.7e-05,1.1e-05,1.4e-05,1.1e-05,5.5e-05,2e-05,2.8e-05,2.7e-05,8e-06,4.1e-05,1.3e-05,4e-05,1.7e-05,1.4e-05,5.1e-05,2.3e-05,5.4e-05,6.5e-05,5.5e-05,2.7e-05,8e-06,3e-05,3.3e-05,2.2e-05,4.8e-05,1e-05,8.6e-05,8.1e-05,6.8e-05,2.4e-05,4.4e-05,5.1e-05,7e-05,2.2e-05,2.5e-05,4.5e-05,3.1e-05,5.7e-05,1.6e-05,4.5e-05,3.7e-05,9e-06,1.3e-05,1.9e-05,4.7e-05,1.5e-05,9e-06,4.8e-05,2.4e-05,9e-06,2e-05,8e-06,3.4e-05,1.4e-05,1.7e-05,1.3e-05,2.3e-05,3.6e-05,4.1e-05,5.4e-05,1.5e-05,2.3e-05,4.5e-05,3.1e-05,2.3e-05,1.3e-05,2e-05,1.3e-05,2.4e-05,3.5e-05,2.7e-05,3.8e-05,5.1e-05,3.4e-05,1.4e-05,1.8e-05,1.3e-05,4.3e-05,2.3e-05,1.4e-05,3.2e-05,1.7e-05,5.8e-05,1.8e-05,6e-06,4.1e-05,1.9e-05,2.1e-05,5.7e-05,5.3e-05
2e-05,7e-05,2e-05,8e-06,5.2e-05,1.7e-05,5.6e-05,7.9e-05,3.4e-05,2.3e-05,5.6e-05,1.9e-05,3.5e-05,5.8e-05,2.8e-05,6.9e-05,2.6e-05,5.2e-05,1.6e-05,6.4e-05,1.4e-05,2.9e-05,5.1e-05,3.3e-05,5.9e-05,1.3e-05,4.5e-05,4.8e-05,3e-05,8e-06,9e-06,3.5e-05,1.5e-05,6e-06,2.5e-05,6e-05,2.8e-05,2.4e-05,1.1e-05,9e-06,3.9e-05,3.4e-05,1.2e-05,3e-06,1.6e-05,5.5e-05,9e-06,4.1e-05,7.6e-05,5.6e-05,3e-05,1.2e-05,1.3e-05,1.9e-05,3e-05,5.1e-05,3e-05,9.9e-05,6.8e-05,3.8e-05,3.9e-05,5.6e-05,4.2e-05,7e-05,2.2e-05,2.2e-05,4.9e-05,3e-05,4.8e-05,1.5e-05,4.6e-05,2.9e-05,5e-06,5e-06,1e-05,3.2e-05,1.8e-05,2.7e-05,5.6e-05,2.9e-05,1.6e-05,1.8e-05,1e-06,5e-05,4.1e-05,4e-05,1.1e-05,3.1e-05,2.8e-05,5.3e-05,7e-05,2.2e-05,2e-05,5.4e-05,8e-06,8e-06,2.4e-05,2.4e-05,1.3e-05,9e-06,1.7e-05,2e-05,3.1e-05,4e-05,2e-06,2.8e-05,2.5e-05,2.3e-05,4.8e-05,2.3e-05,3e-05,4e-05,2.5e-05,3.4e-05,1.6e-05,1.2e-05,4e-05,3.3e-05,1e-05,2.9e-05,7.8e-05
4.5e-05,8e-05,3e-05,1.2e-05,5.3e-05,1e-06,5e-05,6.7e-05,1.9e-05,2.1e-05,3.5e-05,3e-05,4.2e-05,6.5e-05,4.9e-05,6.3e-05,4.3e-05,4.5e-05,2.8e-05,4e-05,1.1e-05,4.7e-05,4.9e-05,1.7e-05,3.8e-05,4e-05,1e-04,6.6e-05,1.2e-05,2.3e-05,2.1e-05,1.9e-05,4.4e-05,4.4e-05,2.1e-05,3.3e-05,4.6e-05,3.1e-05,4e-05,2.1e-05,7e-06,2.1e-05,3.3e-05,5e-05,6e-06,5.1e-05,9e-06,6.1e-05,6.7e-05,9.7e-05,6.1e-05,1.2e-05,5.1e-05,3.8e-05,2.4e-05,6.6e-05,7.7e-05,0.000124,0.000113,4.9e-05,2.7e-05,2.1e-05,1.5e-05,2.2e-05,3.8e-05,7e-06,1.4e-05,1.4e-05,5e-05,2.8e-05,6e-05,1.5e-05,4.2e-05,4.2e-05,1.5e-05,2.8e-05,2.6e-05,2.8e-05,2.5e-05,3.2e-05,3e-05,3.4e-05,2e-05,2.7e-05,1.7e-05,1.7e-05,2.5e-05,1.3e-05,3.4e-05,5.3e-05,5.6e-05,1.8e-05,2.5e-05,2.6e-05,3e-05,2.2e-05,3.6e-05,4.7e-05,8e-06,3.8e-05,2e-06,1.7e-05,1.8e-05,4.2e-05,4.2e-05,2.1e-05,1.9e-05,5.7e-05,3.2e-05,2.6e-05,1.9e-05,3.8e-05,5.4e-05,5.2e-05,2.9e-05,1e-05,3.1e-05,2.6e-05,2e-06,4.8e-05,8.4e-05
2.2e-05,4.3e-05,1.3e-05,1.7e-05,7.4e-05,3.1e-05,2e-05,4.8e-05,3.1e-05,1.2e-05,3e-05,1e-05,3.4e-05,5e-05,3.8e-05,8.5e-05,6.5e-05,3.5e-05,2.9e-05,3.6e-05,1.9e-05,5.1e-05,3.9e-05,1.3e-05,6.6e-05,4.3e-05,3.9e-05,1.9e-05,2.1e-05,3.5e-05,1.8e-05,2.7e-05,2.7e-05,1.2e-05,3e-06,3e-05,1.9e-05,1.9e-05,3.2e-05,3e-06,2.6e-05,3.4e-05,4.6e-05,3.2e-05,2.9e-05,4.6e-05,7e-06,7.3e-05,5.2e-05,2.7e-05,4e-06,5.1e-05,5.4e-05,4.2e-05,1.7e-05,3.1e-05,4.7e-05,8.8e-05,8.2e-05,3.9e-05,4.7e-05,6.2e-05,5.3e-05,5.9e-05,3.1e-05,5.9e-05,5e-05,4.3e-05,4.1e-05,3.7e-05,5.2e-05,2.1e-05,3.6e-05,3.5e-05,2.5e-05,5.2e-05,2.9e-05,2.4e-05,5.6e-05,5.1e-05,3.4e-05,2e-05,1.9e-05,2.6e-05,2.4e-05,3.5e-05,4.1e-05,4.2e-05,3.3e-05,1.7e-05,4.5e-05,1e-05,2.9e-05,6.8e-05,5.2e-05,2.1e-05,2.5e-05,4.1e-05,4.7e-05,5e-05,3.5e-05,1.3e-05,2.7e-05,4.2e-05,3.9e-05,3.2e-05,2.7e-05,4.2e-05,9.1e-05,4.4e-05,2.2e-05,5.1e-05,3.7e-05,2e-05,3.2e-05,5.8e-05,5e-05,1.2e-05,1e-05,3.4e-05,7.7e-05
3.8e-05,6.2e-05,1.1e-05,1.4e-05,5.9e-05,9e-06,4.2e-05,6.3e-05,3e-05,2.6e-05,3.4e-05,2.3e-05,3.3e-05,3.5e-05,4.4e-05,6.7e-05,3.3e-05,4.8e-05,1.1e-05,4e-05,2.3e-05,1.9e-05,2.2e-05,2.2e-05,3.9e-05,2.5e-05,2.7e-05,3e-05,5.1e-05,5e-06,2.5e-05,1.8e-05,2.4e-05,6e-06,1.4e-05,3.8e-05,5e-06,2.7e-05,1.7e-05,1.3e-05,3.6e-05,1.1e-05,3.2e-05,2e-05,3.1e-05,4.3e-05,1.8e-05,3.5e-05,1.5e-05,4.1e-05,3.2e-05,4.5e-05,1.7e-05,4e-05,2.5e-05,3.7e-05,3.5e-05,7.1e-05,5.2e-05,3.1e-05,3e-05,3.9e-05,4.6e-05,6.1e-05,2.1e-05,2.8e-05,4.5e-05,3.6e-05,4.9e-05,6e-06,3.3e-05,1.8e-05,1.6e-05,1.2e-05,7e-06,5.8e-05,2e-06,1.3e-05,1.2e-05,1.7e-05,3.7e-05,2.8e-05,5e-06,6e-06,1.9e-05,1.8e-05,2.6e-05,2e-05,1.1e-05,4.9e-05,4.7e-05,2.9e-05,1.6e-05,6.3e-05,1.2e-05,1.9e-05,2.3e-05,1.6e-05,2.2e-05,1e-05,1.4e-05,1.4e-05,2.3e-05,4.7e-05,1.6e-05,4.9e-05,2.3e-05,1.6e-05,3.8e-05,2.5e-05,3.4e-05,2.5e-05,4.3e-05,4e-05,1.8e-05,3.1e-05,1.6e-05,3.6e-05,3.8e-05,6.5e-05,3.9e-05
2.9e-05,5.6e-05,2.2e-05,1.1e-05,4.4e-05,5e-06,3.9e-05,5.8e-05,2.8e-05,2.1e-05,4.2e-05,3.9e-05,3.3e-05,3.4e-05,2.8e-05,5.1e-05,2.8e-05,5.8e-05,3.7e-05,3.2e-05,1.3e-05,1e-05,2e-05,1.6e-05,4.3e-05,2.5e-05,4.2e-05,4.9e-05,2.6e-05,1.3e-05,3.7e-05,2.5e-05,2.3e-05,1.8e-05,2.1e-05,3.3e-05,5e-06,2e-05,2.7e-05,3.1e-05,2.7e-05,9e-06,4.4e-05,2e-06,2.9e-05,2.9e-05,1.6e-05,3e-05,4.1e-05,4.1e-05,4.5e-05,1.6e-05,2.4e-05,3.7e-05,4e-06,5.6e-05,4.5e-05,6.1e-05,3.4e-05,3.7e-05,9e-06,2.9e-05,3.6e-05,4.8e-05,3.1e-05,5.2e-05,6e-05,1.6e-05,6.6e-05,2.4e-05,5.3e-05,1.3e-05,2.7e-05,1.6e-05,1.3e-05,4.7e-05,6e-06,6e-06,3e-05,8e-06,4e-05,1.8e-05,1.6e-05,2.1e-05,3.4e-05,3e-05,2.4e-05,1.4e-05,1.8e-05,3.7e-05,4.8e-05,1.6e-05,1.5e-05,2.5e-05,4.5e-05,1.8e-05,1.8e-05,1.4e-05,2e-06,2.2e-05,3e-06,2.5e-05,2.6e-05,4.6e-05,3.1e-05,3.3e-05,7e-06,1e-05,1.8e-05,1.8e-05,1.9e-05,2.4e-05,4.1e-05,2.2e-05,5e-06,2.1e-05,1.8e-05,3.7e-05,3.2e-05,5.5e-05,4.6e-05
2.5e-05,4.7e-05,2.5e-05,1.3e-05,4.8e-05,1.6e-05,3.7e-05,6e-05,4.6e-05,1.9e-05,2.4e-05,2.2e-05,2.5e-05,4.9e-05,3.9e-05,3.9e-05,2.2e-05,6e-05,2.4e-05,2.1e-05,1.3e-05,2.2e-05,2.3e-05,9e-06,4.6e-05,3.2e-05,2.5e-05,5.8e-05,3.8e-05,1.1e-05,4.2e-05,1.6e-05,2.4e-05,4.1e-05,1.8e-05,5.3e-05,2.4e-05,1.1e-05,3.1e-05,2.9e-05,3.6e-05,2.2e-05,2.8e-05,1.3e-05,2e-05,5.2e-05,2.2e-05,5e-05,5.1e-05,4.5e-05,3.6e-05,5.8e-05,4e-06,2.7e-05,2.4e-05,3.7e-05,1.8e-05,9.4e-05,4.6e-05,4e-05,1.5e-05,2.5e-05,4.2e-05,7.3e-05,4.5e-05,1e-05,8.8e-05,1.7e-05,4e-05,5e-06,4.7e-05,3e-06,7e-06,3.1e-05,5e-06,5.2e-05,1.6e-05,1.3e-05,4.2e-05,4.7e-05,5.5e-05,5.5e-05,1.6e-05,2.1e-05,3.8e-05,2.2e-05,3.3e-05,7e-06,1.1e-05,5e-05,3.9e-05,8e-06,3.5e-05,3.5e-05,4.4e-05,1.3e-05,2.9e-05,1.6e-05,1.4e-05,1.5e-05,2e-05,2.9e-05,9e-06,3.5e-05,2.8e-05,1.8e-05,1.7e-05,1.9e-05,3.5e-05,2.7e-05,2.1e-05,2.6e-05,3.1e-05,5.2e-05,1.3e-05,2.7e-05,3.1e-05,1.9e-05,3e-05,5.7e-05,1.5e-05
2.8e-05,7.9e-05,1.5e-05,5e-06,5.4e-05,2.6e-05,6.1e-05,6.7e-05,5.7e-05,3.1e-05,8e-06,1e-05,4.3e-05,2.1e-05,2.5e-05,4.5e-05,3.2e-05,3.9e-05,4.5e-05,5.2e-05,2.4e-05,3e-06,2.4e-05,1e-05,4.1e-05,2.9e-05,2.5e-05,5.9e-05,2.4e-05,2.9e-05,3.7e-05,3.4e-05,2.9e-05,3e-05,7.2e-05,9e-06,2.1e-05,3.6e-05,4e-05,5.2e-05,3.3e-05,4.1e-05,3.3e-05,2e-05,2.3e-05,2.9e-05,2.4e-05,2.5e-05,6.3e-05,2.8e-05,5.3e-05,7.1e-05,7e-05,4.7e-05,3.8e-05,4.9e-05,3.7e-05,9.7e-05,2.8e-05,7.1e-05,5.8e-05,5.7e-05,5.7e-05,7.1e-05,1.2e-05,4e-05,9.2e-05,3.9e-05,5.8e-05,2.5e-05,1.6e-05,2.1e-05,1.8e-05,3.5e-05,3.4e-05,5.4e-05,5.4e-05,3.8e-05,1.8e-05,3.4e-05,2.4e-05,2.6e-05,3.5e-05,3.7e-05,4.6e-05,8.3e-05,1e-05,1.4e-05,1.1e-05,6.9e-05,6e-05,1.4e-05,2.3e-05,2e-05,2.5e-05,4.2e-05,2.8e-05,4.6e-05,3e-05,3.1e-05,5.8e-05,4.8e-05,3e-05,1.5e-05,3.1e-05,3.1e-05,2.8e-05,1.7e-05,3e-05,2.7e-05,3.1e-05,1.2e-05,1.9e-05,6.1e-05,2.5e-05,3.6e-05,2.5e-05,3e-05,3.5e-05,5.3e-05,2.8e-05
3.5e-05,4.6e-05,1.4e-05,5e-06,4.8e-05,3.1e-05,1.3e-05,5.6e-05,4.3e-05,2.2e-05,1.7e-05,3.4e-05,6.9e-05,5.2e-05,2.1e-05,6.3e-05,6.3e-05,5.8e-05,1.8e-05,3.2e-05,2.1e-05,3.8e-05,3.4e-05,3.2e-05,4.8e-05,4.8e-05,1.9e-05,4.7e-05,3.9e-05,1.8e-05,3.1e-05,3.1e-05,1.1e-05,5e-06,5.5e-05,6.4e-05,2.3e-05,3e-05,2.6e-05,4.2e-05,6.7e-05,6e-05,2.2e-05,3.1e-05,2.9e-05,4.9e-05,4.3e-05,1.7e-05,6.1e-05,5.2e-05,6.7e-05,2.2e-05,5.2e-05,4e-05,2e-05,6.4e-05,5.5e-05,1.4e-05,3.4e-05,4.1e-05,5.5e-05,8.8e-05,7e-05,6e-05,2.3e-05,5.9e-05,5.7e-05,5.3e-05,9.5e-05,1.1e-05,6e-05,3.8e-05,1.5e-05,1.4e-05,4.5e-05,6.3e-05,5e-05,4.4e-05,5.1e-05,4.9e-05,5.6e-05,1e-05,2.1e-05,3.8e-05,3.3e-05,7.7e-05,8.1e-05,3.4e-05,2.2e-05,6e-05,2.6e-05,2.9e-05,6.3e-05,6.8e-05,4.9e-05,1.8e-05,2e-05,6.3e-05,1.7e-05,3.1e-05,6.6e-05,2.5e-05,2.3e-05,1.4e-05,5.1e-05,5.2e-05,8e-06,3.2e-05,5.5e-05,2e-05,2.5e-05,2.1e-05,6.8e-05,4.7e-05,5.3e-05,3.9e-05,3.9e-05,1.3e-05,3.2e-05,1e-04,5.4e-05
6e-06,1.5e-05,7.6e-05,5.5e-05,5.2e-05,4.2e-05,6.1e-05,0.000106,3.3e-05,2.4e-05,6.5e-05,2.6e-05,7.2e-05,3.3e-05,4.4e-05,7.4e-05,2.5e-05,8e-06,5.1e-05,3.2e-05,1.4e-05,2.8e-05,4.1e-05,4.7e-05,7e-05,4.9e-05,3e-05,3.9e-05,4.2e-05,5.7e-05,8.7e-05,6e-05,3.8e-05,3e-05,5e-05,1.1e-05,6.4e-05,8.9e-05,8.2e-05,2.3e-05,6.8e-05,6.8e-05,0.000111,5.2e-05,1.2e-05,3.5e-05,2e-05,3.9e-05,7.5e-05,4.3e-05,4.7e-05,5.7e-05,9.4e-05,9.3e-05,3.6e-05,5.7e-05,5.4e-05,0.000119,4.4e-05,4.3e-05,2.6e-05,0.000109,4.3e-05,0.000127,5.4e-05,2.5e-05,4.3e-05,4.3e-05,2.5e-05,4.7e-05,5.3e-05,9e-06,5e-06,1e-05,4.8e-05,3.9e-05,7e-05,5.2e-05,4.9e-05,2.2e-05,3.3e-05,5.3e-05,1.9e-05,5.9e-05,3.9e-05,5.9e-05,2.7e-05,4.9e-05,2.2e-05,1.9e-05,1.9e-05,3.6e-05,5.9e-05,7.4e-05,3.4e-05,3.7e-05,2e-05,8.1e-05,7e-05,3.4e-05,7.4e-05,7.3e-05,6.4e-05,4e-05,5.5e-05,2.8e-05,5.5e-05,6.2e-05,1.3e-05,3.6e-05,2.2e-05,5.6e-05,7.1e-05,5.9e-05,4.5e-05,2.2e-05,1e-05,4.6e-05,5.4e-05,4.1e-05,2.9e-05
3.3e-05,8.2e-05,1.5e-05,2.4e-05,2.5e-05,7.2e-05,0.000101,8.5e-05,7.4e-05,7.2e-05,2.7e-05,6.2e-05,4.2e-05,6.2e-05,4.7e-05,8.6e-05,5.6e-05,4.1e-05,1.2e-05,5.1e-05,3.5e-05,1.8e-05,2e-05,2.7e-05,3.5e-05,1.8e-05,3.4e-05,2e-06,4e-06,3.3e-05,6.6e-05,2.4e-05,2.2e-05,2.5e-05,4.2e-05,5.8e-05,4.8e-05,4.2e-05,1.6e-05,6e-06,4.4e-05,1e-05,5.5e-05,5e-06,2e-06,7e-06,3e-06,4.8e-05,1.2e-05,4.4e-05,3e-06,2.3e-05,4.5e-05,8e-06,3.4e-05,5.7e-05,3.9e-05,7.7e-05,1e-05,6e-06,5.2e-05,4e-05,3.5e-05,6.6e-05,6e-06,2.4e-05,3.5e-05,6.6e-05,4.3e-05,5e-05,3.7e-05,1.4e-05,2.7e-05,2.4e-05,1.9e-05,3.4e-05,4.5e-05,9e-06,3.5e-05,1.3e-05,2.6e-05,2.6e-05,4e-06,4.6e-05,1.5e-05,1.8e-05,1.8e-05,2.6e-05,1.5e-05,2.1e-05,2.2e-05,1.2e-05,4.7e-05,1.2e-05,9e-06,1e-06,2.2e-05,3.2e-05,1.2e-05,1.2e-05,3.4e-05,3.2e-05,1.3e-05,3.3e-05,3e-05,1.7e-05,2.2e-05,1.9e-05,3.3e-05,1.1e-05,1.3e-05,5.1e-05,3.9e-05,2.6e-05,1.6e-05,8e-06,1.3e-05,4e-05,2.5e-05,4.9e-05,5.5e-05
3.9e-05,4.7e-05,1.2e-05,2.8e-05,3.3e-05,4.7e-05,4.9e-05,8e-05,5.1e-05,1.3e-05,2.2e-05,2e-05,2.9e-05,2.6e-05,1.3e-05,4.6e-05,3.2e-05,3e-05,1.2e-05,2.6e-05,1.8e-05,2e-05,4.5e-05,1e-05,4.4e-05,4e-06,3.3e-05,2.8e-05,3e-06,2.2e-05,2.9e-05,1.6e-05,2e-05,1.3e-05,2.3e-05,2.8e-05,4e-05,2.7e-05,9e-06,1e-05,1.8e-05,1.1e-05,2.9e-05,1.5e-05,6e-06,1.4e-05,6e-06,4.2e-05,2.1e-05,2.9e-05,1.1e-05,2.2e-05,1.2e-05,2.6e-05,1.6e-05,4.6e-05,2.2e-05,5.4e-05,2.9e-05,2.5e-05,4e-05,3.6e-05,3.2e-05,6.1e-05,2e-06,1.2e-05,3.8e-05,2.6e-05,4.2e-05,2.4e-05,3.1e-05,2.3e-05,2.6e-05,8e-06,9e-06,3.4e-05,3.1e-05,1.2e-05,4.2e-05,1.1e-05,1.4e-05,2.5e-05,6e-06,1.9e-05,2.1e-05,1.1e-05,1.5e-05,2.1e-05,6e-06,2.4e-05,3.2e-05,1.3e-05,4.2e-05,3.4e-05,1e-05,1e-06,2.3e-05,1.3e-05,9e-06,3e-06,2.1e-05,7e-06,1.7e-05,3.2e-05,2.1e-05,5e-06,9e-06,4e-06,3.9e-05,1.7e-05,4e-06,3.1e-05,3.5e-05,2.1e-05,1.5e-05,2.2e-05,1.5e-05,2.4e-05,1.7e-05,3.8e-05,3.9e-05
3.6e-05,4.2e-05,2.6e-05,2.7e-05,2e-05,2.3e-05,4.8e-05,6.5e-05,3.1e-05,1e-05,1.9e-05,1e-05,2.2e-05,2.9e-05,2.5e-05,4.8e-05,2.6e-05,4.1e-05,9e-06,2.9e-05,9e-06,1.9e-05,4.4e-05,1.6e-05,5.2e-05,1.1e-05,2.3e-05,2.4e-05,0,1.3e-05,2.4e-05,1.9e-05,1.1e-05,4e-06,1.3e-05,2.5e-05,2.6e-05,8e-06,9e-06,8e-06,2.2e-05,1.2e-05,3.5e-05,8e-06,6e-06,4e-06,1.6e-05,4.2e-05,2.9e-05,2.6e-05,1.4e-05,2e-05,1.4e-05,2e-05,7e-06,3.5e-05,4e-06,8.2e-05,3.2e-05,8e-06,2.6e-05,3.2e-05,3.5e-05,3.6e-05,1.6e-05,1e-05,2.9e-05,2.8e-05,3.2e-05,1.6e-05,3.5e-05,2e-05,2.7e-05,1.9e-05,5e-06,3.1e-05,2.8e-05,9e-06,3.5e-05,1.1e-05,1.9e-05,2e-05,4e-06,1.6e-05,9e-06,1.5e-05,2.1e-05,1.4e-05,1e-05,1.4e-05,1.9e-05,1.8e-05,2.5e-05,1.9e-05,1.4e-05,8e-06,1.1e-05,1.7e-05,3e-06,5e-06,5e-06,8e-06,2.1e-05,3.2e-05,1.4e-05,4e-06,6e-06,9e-06,3e-05,1.3e-05,5e-06,3.6e-05,2.4e-05,1.8e-05,1.3e-05,1.6e-05,6e-06,2.7e-05,2.2e-05,3.6e-05,3.5e-05
3.2e-05,4.8e-05,8e-06,1.9e-05,3.9e-05,1.7e-05,4.5e-05,6.1e-05,3.5e-05,1.3e-05,2.8e-05,2.5e-05,1.6e-05,3.6e-05,1.1e-05,4.4e-05,2.4e-05,2.2e-05,2.1e-05,4.8e-05,2.2e-05,1.7e-05,4e-05,5e-06,3e-05,2e-06,1.9e-05,1.3e-05,2.2e-05,2e-05,3.1e-05,2e-05,1.3e-05,9e-06,2.3e-05,4.4e-05,4e-06,1.3e-05,2.2e-05,1.7e-05,2.2e-05,2e-06,3e-05,5e-06,9e-06,2e-05,1.5e-05,3e-05,2.7e-05,2.8e-05,7e-06,6e-06,1.2e-05,2.7e-05,1.6e-05,4.3e-05,1.5e-05,7.4e-05,4.2e-05,1.6e-05,2.2e-05,2.9e-05,4.3e-05,5.7e-05,9e-06,5e-06,1.5e-05,2.4e-05,3.2e-05,9e-06,2e-05,7e-06,2.9e-05,1.8e-05,2e-05,3e-05,1.8e-05,1.3e-05,3e-05,1.8e-05,1.7e-05,2.9e-05,1.2e-05,1.8e-05,3e-06,1.5e-05,7e-06,1.7e-05,1.1e-05,3.3e-05,1.9e-05,6e-06,2.8e-05,1.6e-05,1.6e-05,6e-06,1.8e-05,9e-06,1.1e-05,7e-06,1.3e-05,8e-06,1.5e-05,2.8e-05,2.6e-05,2e-05,7e-06,1.4e-05,2.1e-05,6e-06,1.4e-05,3.8e-05,1.7e-05,8e-06,1.5e-05,9e-06,6e-06,2.4e-05,2.5e-05,2.3e-05,2.3e-05
3.1e-05,3.8e-05,1.5e-05,2.1e-05,3.1e-05,2.3e-05,3.8e-05,5.6e-05,3.7e-05,1.3e-05,2e-05,9e-06,3.6e-05,3.6e-05,5e-06,4.1e-05,3e-06,4.9e-05,2.3e-05,3.4e-05,1.3e-05,1.6e-05,3.4e-05,1.6e-05,5.1e-05,4e-06,1.6e-05,3.8e-05,1.6e-05,1.1e-05,1.3e-05,9e-06,9e-06,1.3e-05,1.3e-05,2.8e-05,9e-06,1.9e-05,1.2e-05,1.2e-05,1.1e-05,7e-06,2.5e-05,1e-05,1.1e-05,3.3e-05,5e-06,3.3e-05,3.1e-05,2.8e-05,7e-06,4e-06,6e-06,2.8e-05,1.2e-05,3.8e-05,9e-06,6.3e-05,3.6e-05,1.5e-05,2.9e-05,2.9e-05,4.1e-05,6.2e-05,9e-06,1.6e-05,2.1e-05,2.5e-05,2.6e-05,2.2e-05,3.5e-05,1.1e-05,1.9e-05,9e-06,7e-06,3.8e-05,2.1e-05,1.3e-05,2.6e-05,2.2e-05,1.1e-05,3.3e-05,1.3e-05,1.7e-05,1.7e-05,1.7e-05,7e-06,1.4e-05,4e-06,2.5e-05,3.4e-05,1.1e-05,1.9e-05,2e-05,1.1e-05,9e-06,1.9e-05,8e-06,1.1e-05,3e-06,1e-05,0,5e-06,2e-05,2.6e-05,1.2e-05,3e-06,7e-06,2.5e-05,1.3e-05,1.3e-05,3.1e-05,1.5e-05,1.9e-05,6e-06,6e-06,2e-06,3e-05,1.7e-05,3.6e-05,3.4e-05
2.8e-05,4.6e-05,1.2e-05,1.3e-05,2.8e-05,1.2e-05,3.9e-05,6.3e-05,2.7e-05,1.6e-05,1.8e-05,1.1e-05,2.9e-05,3.5e-05,1.8e-05,2.7e-05,1.8e-05,3.8e-05,1.7e-05,3.8e-05,1.7e-05,5e-06,4.2e-05,1.9e-05,3.4e-05,1.4e-05,3.2e-05,2.8e-05,6e-06,9e-06,2.1e-05,6e-06,8e-06,9e-06,6e-06,3.7e-05,5e-06,2.4e-05,1.6e-05,7e-06,1.2e-05,4e-06,2.7e-05,7e-06,9e-06,1.9e-05,5e-06,3.6e-05,2.9e-05,2.3e-05,8e-06,1e-05,6e-06,2.5e-05,1e-05,2.9e-05,7e-06,6.8e-05,4.6e-05,1.5e-05,2.5e-05,4e-05,3.6e-05,5.5e-05,7e-06,9e-06,2.5e-05,2.4e-05,2.6e-05,2.4e-05,2.5e-05,7e-06,1.6e-05,6e-06,1.1e-05,3.9e-05,1.7e-05,1.1e-05,1.7e-05,1.5e-05,7e-06,2.3e-05,4e-06,2.6e-05,2.3e-05,2e-06,1.3e-05,1.1e-05,5e-06,1.5e-05,2.6e-05,8e-06,2e-05,1.5e-05,2.2e-05,1.6e-05,2.6e-05,5e-06,1.1e-05,1e-05,6e-06,5e-06,1.1e-05,2.1e-05,1.5e-05,1.1e-05,6e-06,5e-06,2.5e-05,8e-06,5e-06,2.6e-05,2.3e-05,2.6e-05,6e-06,1.3e-05,1e-05,2.4e-05,1.4e-05,3.6e-05,3e-05
3e-05,4.9e-05,8e-06,9e-06,2.6e-05,2e-05,3.8e-05,6.5e-05,3.3e-05,1.5e-05,1.7e-05,1.4e-05,2.1e-05,3.1e-05,2e-05,3.3e-05,1.1e-05,2.7e-05,1.3e-05,3e-05,1.6e-05,7e-06,2.8e-05,6e-06,3.5e-05,1.2e-05,2.4e-05,3.4e-05,4e-06,1.2e-05,2e-05,9e-06,7e-06,9e-06,4e-06,3.4e-05,1e-06,2e-05,1.4e-05,6e-06,1.4e-05,4e-06,2.8e-05,6e-06,3e-06,1.2e-05,4e-06,3.8e-05,3.3e-05,2.9e-05,1e-05,1.1e-05,7e-06,1.9e-05,1.5e-05,3.7e-05,9e-06,5.8e-05,3.3e-05,1.1e-05,2e-05,3e-05,3.5e-05,4.6e-05,2e-06,1e-05,2.4e-05,2.7e-05,2.7e-05,2.2e-05,3.1e-05,1.7e-05,1.4e-05,3e-06,9e-06,3.6e-05,1.9e-05,1.3e-05,2.9e-05,9e-06,5e-06,1.7e-05,8e-06,1.9e-05,1.5e-05,3e-06,1.4e-05,9e-06,4e-06,1.8e-05,3.1e-05,5e-06,2e-05,4e-06,1e-05,4e-06,1.7e-05,4e-06,9e-06,9e-06,5e-06,2e-06,1e-05,2.3e-05,2.3e-05,1.6e-05,4e-06,3e-06,3.4e-05,7e-06,9e-06,3e-05,2.4e-05,2.1e-05,8e-06,5e-06,6e-06,2.1e-05,1.8e-05,3.6e-05,3.2e-05
3e-05,4.7e-05,6e-06,1.1e-05,3.1e-05,2e-05,3.8e-05,5.5e-05,3e-05,1.4e-05,2.1e-05,1e-05,2.7e-05,3.2e-05,2e-05,3.3e-05,1.5e-05,3.3e-05,7e-06,3.3e-05,1.8e-05,8e-06,3.4e-05,2e-06,3.5e-05,1.2e-05,2.9e-05,3e-05,3e-06,1.1e-05,2.5e-05,6e-06,1.1e-05,8e-06,3e-06,3.5e-05,2e-06,1.6e-05,1.4e-05,6e-06,1.4e-05,2e-06,2.5e-05,3e-06,5e-06,1.6e-05,4e-06,3e-05,3.2e-05,2.8e-05,1e-05,1.1e-05,7e-06,2.2e-05,1e-05,3.3e-05,1e-05,5.5e-05,3.1e-05,1e-05,1.8e-05,2.9e-05,3.1e-05,4.8e-05,2e-06,9e-06,2.7e-05,2.5e-05,2.7e-05,1.9e-05,3.2e-05,1.7e-05,1.6e-05,1e-06,7e-06,3.8e-05,1.8e-05,1.5e-05,2.2e-05,9e-06,7e-06,1.4e-05,1e-06,1.6e-05,1.4e-05,5e-06,7e-06,1.5e-05,3e-06,2.1e-05,3.1e-05,4e-06,1.9e-05,8e-06,4e-06,3e-06,1.3e-05,9e-06,1e-05,7e-06,6e-06,3e-06,1.1e-05,2.4e-05,2.3e-05,7e-06,3e-06,4e-06,3e-05,6e-06,1e-05,2.8e-05,1.9e-05,2e-05,7e-06,7e-06,4e-06,2.4e-05,1.4e-05,3.5e-05,3e-05
3e-05,4.9e-05,7e-06,1.1e-05,3e-05,1.7e-05,3.8e-05,5.7e-05,2.8e-05,1.3e-05,1.9e-05,1.2e-05,2.5e-05,3.5e-05,1.8e-05,3.5e-05,1.6e-05,2.5e-05,1.1e-05,3.5e-05,1e-05,1.2e-05,2.8e-05,3e-06,3.3e-05,9e-06,2.6e-05,3e-05,2e-06,1.1e-05,2.5e-05,9e-06,6e-06,1e-05,2e-06,3.4e-05,2e-06,1.6e-05,1.3e-05,4e-06,1.4e-05,0,2.9e-05,4e-06,6e-06,1.6e-05,3e-06,3.2e-05,3.2e-05,3e-05,8e-06,1e-05,9e-06,2.3e-05,9e-06,2.9e-05,1.1e-05,5.8e-05,3.4e-05,1.1e-05,1.8e-05,2.9e-05,3.5e-05,4.6e-05,1e-06,7e-06,2.5e-05,2.8e-05,2.9e-05,1.7e-05,3.1e-05,1.7e-05,1.8e-05,3e-06,5e-06,3.7e-05,1.7e-05,1.1e-05,2.2e-05,1e-05,8e-06,1.6e-05,4e-06,1.7e-05,1.6e-05,4e-06,1.3e-05,1.6e-05,5e-06,1.8e-05,3e-05,5e-06,1.3e-05,8e-06,1e-06,2e-06,1.5e-05,6e-06,1.1e-05,7e-06,5e-06,1e-06,1e-05,2.2e-05,2.1e-05,1.2e-05,2e-06,2e-06,3.1e-05,6e-06,9e-06,2.8e-05,1.6e-05,2.2e-05,3e-06,4e-06,4e-06,2.2e-05,1.3e-05,3.4e-05,3.1e-05
