-0.000132,-0.00042,-0.000391,-0.000335,-0.000318,-0.000497,-0.00015,-0.000383,-0.000434,-0.00069,-0.000869,-0.001194,-0.000639,-0.001059,-0.000699,-0.000567,-0.000956,-0.000394,-0.000446,-0.000928,-0.00088,-0.000792,-0.000799,-0.001116,-0.001484,-0.001031,-0.000626,-0.001577,-0.000943,-0.001013,-0.000559,-0.00058,-0.000891,-0.001507,-0.001848,-0.001415,-0.000799,-0.001348,-0.000577,-0.001408,-0.001316,-0.001136,-0.000961,-0.001233,-0.000746,-0.001323,-0.001236,-0.001283,-0.002365,-0.001684,-0.001263,-0.001538,-0.001809,-0.001173,-0.001383,-0.000876,-0.000954,-0.001543,-0.000944,-0.000547,-0.000521,-0.001622,-0.001694,-0.001498,-0.001018,-0.001177,-0.000447,-0.002634,-0.001533,-0.000965,-0.001397,-0.001783,-0.00087,-0.002423,-0.001821,-0.001586,-0.000575,-0.000659,-0.000617,-0.001472,-0.00124,-0.002352,-0.001305,-0.001204,-0.001003,-0.000829,-0.00159,-0.001238,-0.00069,-0.001255,-0.000825,-0.000493,-0.000689,-0.001308,-0.001255,-0.001015,-0.000846,-0.001088,-0.001051,-0.001608,-0.001173,-0.001742,-0.000993,-0.001072,-0.0012,-0.001019,-0.000892,-0.000959,-0.000946,-0.000916,-0.001017,-0.000751,-0.001478,-0.001395,-0.001111,-0.001456,-0.001242,-0.001449,-0.001163,-0.000977,-0.001387
-0.000225,-0.000547,-0.000378,-4e-05,3.2e-05,-0.000175,-0.000279,-0.000566,-0.000212,-0.000178,-0.000615,-9.3e-05,-0.000158,0.000401,0.000133,-0.000609,0.000259,0.000207,0.000163,0.000171,0.000551,-6e-06,-0.000397,0.000472,-0.00035,-0.000137,-0.000423,0.000642,-0.000182,-0.000183,-0.000173,-0.000489,-0.000566,0.000521,0.000264,0.000241,6.2e-05,-0.000409,-0.000446,-0.000108,0.000725,0.000428,0.000278,-0.000117,-0.001135,-0.000329,0.000367,0.000201,0.000732,0.000377,-0.000459,-5e-05,0.000497,4.9e-05,9.3e-05,-0.000131,-4.5e-05,-0.00032,-0.000268,-9.1e-05,-0.000235,-6e-05,0.000397,0.000561,0.000384,0.000216,-0.000208,0.000265,-0.00011,-9.2e-05,9.5e-05,-6.5e-05,-0.000253,0.000631,0.000757,0.000458,-0.000182,-0.000339,-0.000338,0.000215,8.9e-05,0.000887,0.000663,0.000401,-3.2e-05,0.000396,0.000481,0.000237,-0.000321,0.000157,-0.000149,-0.000399,0.000201,0.000131,7e-05,0.000216,-0.000106,6.5e-05,0.000376,0.000579,-0.000175,0.000269,-2e-06,-0.000294,0.000585,0.000487,0.000265,0.000183,1.1e-05,-0.000233,0.000206,0.000172,-0.000253,-0.000397,0.000448,-2.6e-05,0.000299,0.000905,-0.000111,-0.000203,0.000289
0.000193,0.000274,0.000402,9.7e-05,-0.000175,0.000189,0.00032,0.000575,0.000359,0.000163,0.000496,0.000515,0.00037,-0.000167,-0.000148,0.000261,-0.000268,-2.5e-05,0,-0.000155,-0.000357,-5.2e-05,0.000223,-0.000274,0.000853,0.000409,0.000659,4.5e-05,1.6e-05,0.000293,6.9e-05,0.00062,0.000447,0.00013,0.000247,0.000226,0.000277,0.000442,0.000564,0.000399,-0.000291,-8.7e-05,-0.000303,0.000614,0.001372,0.000673,5.4e-05,-0.000352,-0.000244,0.000632,0.000703,0.000491,0.000491,0.000229,0.000421,0.000376,0.000524,0.000824,0.000552,4e-05,0.00012,0.000563,0.000126,6.7e-05,-0.00036,3e-06,0.000427,0.000864,0.000346,0.000496,-9.2e-05,0.00087,0.000388,0.000292,-0.000282,-0.000252,0.000369,0.000207,0.000753,0.000549,0.000882,-0.000323,-0.000443,-0.000258,9.4e-05,-0.000174,-0.000222,-0.000125,0.000257,1.5e-05,-1.9e-05,0.000196,6e-06,8e-06,0.00017,9.4e-05,8.6e-05,0.000217,-0.000339,0.000262,0.000577,-1.9e-05,2.2e-05,0.000413,-0.000683,-0.000419,-0.00021,-1e-05,-0.000343,0.000157,0.000227,-0.000333,0.000837,0.001063,0.000458,0.000328,-5e-05,-0.000751,0.000325,0.000468,0.000266
5.6e-05,-0.000101,-0.000332,-0.000204,0.000244,-0.000301,-0.000321,-0.000574,-0.000211,-0.000137,0.000297,-0.000366,-0.00038,-8.4e-05,-0.000179,-4e-06,8.1e-05,-0.000232,0.000173,8.8e-05,0.000255,-0.000451,-0.00011,0.000132,-0.000469,-0.000821,-0.000918,-0.000813,4.5e-05,-0.000277,-0.000114,-0.000327,9.3e-05,-0.000485,-0.000652,-0.000635,-0.000132,-0.000716,-0.000987,-0.000287,-0.000151,-0.000245,-1e-04,-0.00072,-0.001188,-0.000859,-4.4e-05,0.000367,-0.000175,-0.001094,-0.000548,-0.000841,-0.000741,-0.000502,-0.000412,-0.000471,-0.000199,-0.001145,-0.000557,-0.000311,-8.5e-05,-0.000311,-0.000404,-0.000446,0.000537,0.000141,-0.000403,-0.001207,-0.000726,-0.000543,-0.000107,-0.00094,-0.000654,-0.000508,-0.000571,0.000337,-0.000377,-0.00031,-0.000866,-0.000761,-0.000916,0.000213,-0.000111,-8.4e-05,-0.000277,0.000239,0.000179,-0.000296,5.1e-05,1e-06,3.3e-05,0.000481,-3.9e-05,0.000295,-0.000176,-0.000355,-0.000161,-0.000235,-0.000252,-0.000581,-0.000661,-0.000166,-0.000242,-7e-05,-3.6e-05,-7e-06,-0.00025,-0.000114,-0.000104,-1.5e-05,-0.000368,0.000459,-0.000677,-0.000912,-0.000875,-0.000515,-2.5e-05,0.000116,0.000102,-0.000492,-0.000556
-0.000265,7.3e-05,0.000131,0.000137,-0.000129,0.000165,-0.000136,-7e-05,-0.00035,0.000174,-0.000545,-0.000211,-3.5e-05,-3.3e-05,0.000212,2.1e-05,3.8e-05,3.6e-05,-7.8e-05,-0.000196,-0.000283,0.000227,-7.2e-05,-0.000137,-9.4e-05,0.000738,0.000677,0.000491,-8.3e-05,-1.3e-05,6e-05,0.000173,-0.000498,0.000149,0.000392,0.000432,9.3e-05,0.000368,0.000631,0.00029,0.00035,0.000497,0.000253,0.000365,0.000446,0.000664,-7.6e-05,-0.000794,0.000504,0.001107,0.000474,0.000162,0.000676,0.000498,-5.9e-05,0.000328,-0.000111,0.00072,0.000104,1e-04,-5.3e-05,-6.6e-05,0.000808,0.000771,-0.00021,-0.000184,0.000495,0.000753,0.000719,0.000205,0.000183,0.000661,0.000408,0.000232,0.000928,-0.000339,0.000375,0.000587,0.000705,0.000572,0.000678,-0.000321,0.000147,0.000303,0.000254,-0.000142,-0.00037,0.000483,1.6e-05,-0.000208,-1.5e-05,-0.000314,0.000129,-0.000275,-2e-06,0.000279,0.00018,0.000233,0.000353,0.000254,0.000452,0.00047,0.000351,-6.3e-05,-0.000129,2.1e-05,0.000131,0,0.000267,-4.7e-05,0.000376,-0.000249,2.9e-05,0.000376,0.000414,0.000218,-0.000196,0.000376,-0.000434,0.000227,0.000292
7.5e-05,-0.000207,-7.2e-05,-0.000171,8.2e-05,0.000166,0.000425,0.000238,0.000439,-0.000304,0.000368,0.000566,0.000307,-8.6e-05,-0.00016,-0.000124,-0.000261,-0.000253,-0.000112,0.000179,0.000106,8.7e-05,9.5e-05,-5.5e-05,0.000202,-0.000626,-4e-06,-0.000273,0.000161,2e-05,-5.3e-05,-0.000103,0.000167,1.5e-05,-0.000393,-0.000222,-0.000112,-0.000257,0.000241,-0.000135,-0.000393,-0.000595,-2e-05,-0.000152,-8.7e-05,-0.000231,-6.7e-05,0.00061,-0.000254,-8e-04,-0.000356,0.000127,-0.000497,0.000149,5.4e-05,-0.000153,-0.000219,-0.00029,4e-06,0.000101,-5.8e-05,0.000133,-0.000789,-0.000815,-0.000324,-4.6e-05,-0.00024,-9.3e-05,-0.000483,0.000169,0.000137,-0.000269,-0.000142,-3.1e-05,-0.000595,9.5e-05,-0.000159,-0.000582,-0.00049,-0.000426,-0.000542,0.000225,-0.000111,-0.000271,0.000206,6.6e-05,0.000209,-0.000461,2.5e-05,0.000419,-0.000181,-0.00021,-0.000432,-0.000151,-2.8e-05,-4.7e-05,-0.00011,-0.000332,-0.000214,0,-5e-06,-0.000477,-1e-06,0.000207,0.000256,1.4e-05,-0.000114,0.000281,1.8e-05,8.2e-05,2.6e-05,0.000225,0.00012,-0.000283,-0.000146,0.000272,0.000206,-0.000305,-0.000114,-9.4e-05,-0.000151
6.1e-05,7.5e-05,0.000107,1.4e-05,5.9e-05,-0.00019,-0.000162,-6e-05,-0.000258,4.9e-05,-0.000203,-0.000495,-0.000448,0.000279,0.00026,6.1e-05,0.000233,0.000251,-1.5e-05,-0.000123,0.000178,2.3e-05,0.000109,6e-05,-0.000165,0.000107,-0.000147,0.000101,-0.000335,4.8e-05,0.000203,2.8e-05,7.8e-05,0.000146,0.000518,0.000103,0.000176,0.000226,-0.00075,-0.000148,0.000376,0.000497,2.4e-05,0.000106,8.7e-05,-8.8e-05,-7e-05,-0.00029,-7.5e-05,0.000749,9e-05,-0.000411,0.000215,-3.6e-05,-0.000104,4.9e-05,0.00027,0.000208,0.000133,0.000103,0.000203,-0.000237,0.00065,0.000795,0.000441,-0.000115,0.000159,-6.2e-05,0.000346,-0.000196,-0.000479,0.000108,-0.00022,-0.00013,0.000482,-0.000112,-0.000113,0.00038,0.000183,0.00019,0.000509,-0.000131,0.000112,-3e-05,-0.000259,-8.3e-05,-4.1e-05,0.000315,-5.5e-05,-0.000384,0.000249,0.000282,0.000393,0.000351,9.3e-05,-7.1e-05,0.000139,0.000215,0.000167,-4.5e-05,-0.000303,0.00023,-0.000278,-0.000239,-8.2e-05,-0.00012,0.000225,-0.00026,-0.000189,-9.9e-05,-4.3e-05,-0.000401,-1.3e-05,0.000226,9.4e-05,-0.000362,-3.9e-05,7e-05,0.000101,-0.000171,0.000123
-3.6e-05,9.2e-05,1.4e-05,1.7e-05,-5.2e-05,6.5e-05,-8e-06,-1.6e-05,0.000115,0.000116,5.1e-05,0.000305,0.000277,-0.000213,-0.000204,-4.6e-05,1.5e-05,-0.000275,-6.5e-05,0.000105,-0.000155,-0.000201,0.000111,3.8e-05,0.000264,0.000206,5.8e-05,0.000229,0.000293,-3e-06,-0.000215,-4e-06,-0.000113,-0.000184,-0.000512,-2.4e-05,-0.000358,3e-06,0.000544,0.000335,-0.000302,-0.000259,-9.4e-05,-0.000194,0.000133,0.000137,0.000166,0.000103,3.2e-05,-0.000572,6e-06,0.000688,-0.000155,-0.000143,1e-06,-0.000133,-7.6e-05,-9.2e-05,-0.000127,-0.000211,0.000151,0.000172,-0.000302,-0.000438,-0.000356,0.000353,-0.000231,-0.000161,4.1e-05,0.000225,0.00026,-0.000155,0.000359,0.000322,-0.000397,0.000297,7.8e-05,-0.000129,-0.000222,2e-06,-0.000309,-0.000339,-6.2e-05,0.000221,0.000145,0.000255,3.2e-05,-7e-06,0.000125,0.000232,0.000168,-0.000219,-9.9e-05,-0.000199,0.000181,0.000152,-0.000116,-3.6e-05,6e-06,-4.6e-05,0.000424,-8.9e-05,0.000102,0.00015,-0.000186,3.6e-05,-0.000203,0.000352,4.2e-05,0.000403,6.2e-05,0.000284,-4.1e-05,0.000108,-0.000112,0.000416,-7.6e-05,-1e-06,-1.3e-05,0.000247,-0.000138
1.9e-05,-0.000104,-2.6e-05,1.2e-05,7.3e-05,-3.6e-05,-9e-06,4.8e-05,-8e-06,-7.3e-05,-1.1e-05,7.4e-05,-8.6e-05,0.000158,0.000162,-2.2e-05,-5e-05,0.000215,-0.000169,-5.3e-05,9.4e-05,0.000295,-0.000306,-5.7e-05,-0.000336,-0.000185,-8.5e-05,-0.000325,-3.8e-05,4e-05,0.000195,0.000115,0.000182,0.000119,1.8e-05,1e-06,0.000514,3.9e-05,-0.000277,-0.000182,0.000371,0.000114,-2.3e-05,0.000261,-0.000333,3e-05,0.000257,-3.2e-05,-0.000147,0.000441,5e-06,-0.000471,-6e-06,5.2e-05,7.3e-05,4.7e-05,-0.000178,8.5e-05,0.000162,0.000339,-0.000168,-3e-05,6.9e-05,0.000176,0.00015,-0.000339,-4e-06,0.000155,-0.000273,-0.000484,-0.000117,1.4e-05,-3.9e-05,-0.00042,0.000341,-0.000147,-1.2e-05,2e-05,0.000194,-2.1e-05,0.000101,0.000467,0.000111,-0.000194,-1.8e-05,-0.00026,3e-05,3.3e-05,-0.000233,-9.2e-05,-0.000464,0.000166,-7.1e-05,4.9e-05,-0.000356,-8.6e-05,4.5e-05,-1.6e-05,-0.000151,-0.000134,-0.000397,-3.3e-05,3e-05,-0.000214,0.000183,0.000264,0.000193,-0.000202,6.2e-05,-0.000139,-2.6e-05,-5.8e-05,2.7e-05,-0.000229,6e-06,-0.000492,2.2e-05,-1.1e-05,-1.5e-05,-0.000384,-5.6e-05
0,6.7e-05,5.1e-05,3e-05,-4e-05,8.2e-05,-3.4e-05,-0.000109,-6.4e-05,1.1e-05,-0.00012,3e-06,-3.8e-05,-9.5e-05,-5.4e-05,3e-05,-5.4e-05,-3.2e-05,0.000151,0.000139,1.9e-05,-0.000202,8.9e-05,6.5e-05,0.000309,-2.7e-05,-2e-06,0.000162,4.3e-05,-4.4e-05,-0.000193,-3.7e-05,-0.000139,-0.000236,0.000244,1e-04,-0.000477,-0.000161,0.000252,5.7e-05,-0.000336,-0.000108,2.2e-05,-5.5e-05,0.000195,9.6e-05,-0.000471,3.6e-05,0.000139,-0.000202,1e-05,0.000139,9.7e-05,0.000161,7.1e-05,-3.3e-05,0.000208,-0.000166,-0.000131,-0.000223,-5e-06,1.6e-05,4e-06,-0.000254,-0.000115,0.000128,-0.00014,-9.6e-05,9.8e-05,0.000317,-3.7e-05,-1e-06,-5.2e-05,0.000258,-0.000181,-0.000164,-0.000179,-3.2e-05,1.4e-05,6.8e-05,-8.6e-05,-0.000282,-0.000276,-7.6e-05,4.6e-05,6.6e-05,-5.1e-05,-0.000187,0.000134,7e-05,0.000296,-7.9e-05,-0.000147,9.6e-05,0.000245,-4.3e-05,8.3e-05,1.3e-05,8.6e-05,9.6e-05,0.000162,0.000103,0.000106,0.000188,8.6e-05,-0.000187,-4.7e-05,5.5e-05,7e-06,-7.1e-05,-5.1e-05,-0.000137,-3.9e-05,2.3e-05,1.9e-05,0.000244,7.6e-05,-4.4e-05,-1e-05,5.9e-05,7.2e-05
-2.3e-05,5.8e-05,1.8e-05,-6e-05,-1.6e-05,-8e-05,5.6e-05,3.8e-05,4.1e-05,0.000183,0.000167,-0.000205,0.000101,3.3e-05,-1e-06,3.6e-05,-4.4e-05,-2.6e-05,2.2e-05,-4.9e-05,-2.7e-05,0.000185,5.7e-05,4.6e-05,-0.000184,0.000233,-7.4e-05,-7.7e-05,9.3e-05,3.6e-05,-8.8e-05,6e-06,4.1e-05,0.000129,-0.000146,-9.5e-05,0.000177,0.000163,-8.7e-05,-0.000131,4.1e-05,0.000107,3.3e-05,-7.2e-05,1.2e-05,-7e-05,0.000282,3.1e-05,1.5e-05,-8e-06,6.9e-05,-0.000165,3e-05,-0.000365,-6.5e-05,7e-05,-0.000232,2.7e-05,8e-06,5.6e-05,2.3e-05,0,-2.8e-05,4.6e-05,4.8e-05,6.1e-05,0.00023,-4.3e-05,5.1e-05,-8.2e-05,0.00019,9.1e-05,0.000145,-3.7e-05,1.6e-05,0.000107,0.000154,1.7e-05,-0.000145,-4e-05,6e-05,9.5e-05,0.000141,0.000186,5.3e-05,-2e-06,7.8e-05,9.1e-05,2.8e-05,1.9e-05,-0.000182,0.000114,0.000275,-2e-06,-8e-06,7.5e-05,-0.000161,5e-05,-2.6e-05,3.8e-05,-5.2e-05,-0.00019,-0.000128,6.1e-05,-1.5e-05,0.000131,8.5e-05,-0.000121,-4.6e-05,-4.9e-05,4.3e-05,7.3e-05,5.6e-05,-2.3e-05,1.8e-05,-4.1e-05,-0.000134,3.1e-05,2.6e-05,5.5e-05,-5.6e-05
-3.3e-05,-0.000124,1.2e-05,2.7e-05,-4.4e-05,9.1e-05,5e-06,6e-05,-3.2e-05,-0.000183,-0.000149,0.000195,2.5e-05,6.8e-05,-3.8e-05,6.2e-05,1.7e-05,1e-06,6.4e-05,2.8e-05,2.4e-05,-7.2e-05,-1.6e-05,-2.4e-05,-5.3e-05,-0.000144,-7.1e-05,5e-06,-0.000178,-8.1e-05,0.000166,1.1e-05,-2.1e-05,-3e-06,1e-05,7.2e-05,-3.1e-05,-4.7e-05,0.000213,0.000102,8.6e-05,-5.3e-05,-8e-05,-4.8e-05,-0.000103,-3.5e-05,-0.000188,-3.4e-05,7.9e-05,-6.4e-05,-9.2e-05,0.000158,4.3e-05,0.00021,9.5e-05,-3.3e-05,0.000219,8.7e-05,3.3e-05,-6.8e-05,-1.5e-05,0.000166,-2.5e-05,6e-05,-7.7e-05,-0.000134,-7.1e-05,3.4e-05,-8.9e-05,-4.8e-05,-0.000215,-0.000145,-0.000115,-0.000108,6.9e-05,-9.8e-05,-4.9e-05,-8.7e-05,7e-05,4.7e-05,4.8e-05,-3.9e-05,-0.000118,-0.00016,-0.000124,2e-05,-2.5e-05,-6.9e-05,-0.00013,-7.4e-05,4.4e-05,-0.000126,-0.000167,-0.000102,-5.9e-05,-3.4e-05,0.000114,-9.2e-05,4.2e-05,-2.2e-05,2.8e-05,0.000176,4.8e-05,-7.5e-05,3.1e-05,-5.2e-05,-0.000147,-1e-06,0.000107,-2e-06,-0.000121,-0.00013,-0.000151,-1.2e-05,4.1e-05,-6.7e-05,8.4e-05,1.8e-05,0,0.000162,-3.6e-05
-5e-06,8.4e-05,-1.2e-05,-1e-05,-3.9e-05,-2.4e-05,-4.6e-05,-3e-06,5e-05,6.2e-05,6.2e-05,-6.5e-05,-6.8e-05,-6.8e-05,1.4e-05,1e-06,3.5e-05,-3.1e-05,-1.1e-05,-5.5e-05,-3.3e-05,4e-05,1.5e-05,-5e-05,0.000104,7.1e-05,9.2e-05,-1.7e-05,7.1e-05,3e-05,-3e-05,-7.2e-05,2.1e-05,-2.6e-05,7.9e-05,3.4e-05,-1.8e-05,5.3e-05,-0.000134,-5.9e-05,-0.000106,-2.6e-05,6.6e-05,3.5e-05,-1.3e-05,9e-06,6.1e-05,-0.000131,-1.9e-05,0.000173,0.000135,-1.9e-05,-2.3e-05,-0.000119,-0.000128,5.4e-05,-0.000116,-8.8e-05,-4.7e-05,-1.7e-05,4.2e-05,-8.8e-05,9.3e-05,-0.000177,-6e-06,0.000131,6.9e-05,-0.000132,2.8e-05,3.1e-05,6e-06,9.3e-05,-4.6e-05,0.000137,-6.8e-05,0.000241,1.6e-05,0.000128,1e-05,-1.2e-05,-1.1e-05,4.5e-05,0.000121,8.4e-05,3.3e-05,9e-05,-5e-05,6e-06,0.000109,7.9e-05,0.000107,-2.6e-05,6.6e-05,8.5e-05,3e-06,5.7e-05,-4.7e-05,6.2e-05,-5.9e-05,-4e-05,-0.000122,-0.000116,3.2e-05,5e-05,-1.6e-05,-1.8e-05,7.9e-05,4.2e-05,-8.4e-05,0.000119,-2.6e-05,4.3e-05,0.000125,1.2e-05,-8.5e-05,8.3e-05,-0.000131,-5.6e-05,-3.1e-05,-0.000213,2.5e-05
-2e-06,-3.3e-05,-1.2e-05,-1.3e-05,5.6e-05,1.6e-05,3.6e-05,-4.1e-05,-4.3e-05,-1.9e-05,1.3e-05,6e-06,4e-05,-2e-05,4.2e-05,1.6e-05,-3e-06,1.6e-05,3.1e-05,-6.8e-05,-2e-05,-2.1e-05,-1.4e-05,1.9e-05,-4.8e-05,-2.8e-05,-3.1e-05,4.7e-05,-2.6e-05,-3.6e-05,-5.6e-05,4.4e-05,1.8e-05,9e-06,-0.000107,-5.8e-05,0.00013,-6e-06,-6e-06,8.4e-05,9e-06,4.5e-05,-2.4e-05,1.8e-05,0.00016,-2.1e-05,7e-06,0.000124,2.4e-05,-0.000141,-9e-05,-4.3e-05,-2.5e-05,7.7e-05,0.000102,-1.3e-05,1e-05,-2e-06,2.1e-05,2.8e-05,-3.6e-05,-3.6e-05,-7.1e-05,0.000141,-1e-06,-6.1e-05,-6.1e-05,0.000105,3.4e-05,5.8e-05,0.000113,-3.4e-05,3.6e-05,-8.3e-05,-1.4e-05,-0.000237,-5.4e-05,-9.1e-05,-3.4e-05,4.2e-05,-1.3e-05,-2.3e-05,-3.7e-05,-6.2e-05,-2.8e-05,-6e-05,9.2e-05,2.4e-05,1.3e-05,-7.4e-05,-6.7e-05,0.000131,-1.2e-05,-2.4e-05,-1e-06,-7.2e-05,1.6e-05,-3.7e-05,1.9e-05,1e-06,0.000122,1.8e-05,-8.3e-05,-6.8e-05,-7e-06,1e-04,-1.7e-05,-4.3e-05,3.8e-05,-0.000102,6.9e-05,-3e-06,-5.3e-05,2.9e-05,-6e-06,-0.000122,0.000119,6.7e-05,1.5e-05,0.000168,-0.000103
4.2e-05,-2e-06,-8e-06,-1.8e-05,7e-06,3e-06,0,-4e-06,3.2e-05,-4.7e-05,-1.6e-05,-4.1e-05,1.8e-05,6.6e-05,-2.8e-05,-4.5e-05,-2e-05,2.2e-05,-8.8e-05,1.3e-05,-1.3e-05,-1.2e-05,1.5e-05,-1.6e-05,7.6e-05,3.4e-05,-1e-05,-2.3e-05,-2.7e-05,2.8e-05,5.4e-05,-6.9e-05,-3.4e-05,1e-05,-2.8e-05,2.5e-05,-0.00011,-6e-05,-2.2e-05,-5.4e-05,5e-06,-5.5e-05,-6e-06,4e-06,-9.1e-05,-2.7e-05,-8e-05,1.5e-05,-3.1e-05,0.000148,6.1e-05,3.4e-05,-2.6e-05,-4.5e-05,-2.7e-05,-2.8e-05,-1.9e-05,8.3e-05,2.7e-05,-2.4e-05,-6e-06,6e-06,5e-06,5e-06,2.1e-05,4.7e-05,9e-05,4e-06,-4.8e-05,-3.4e-05,-7.3e-05,-3e-06,5.9e-05,9e-05,2.4e-05,0.000132,1.3e-05,5.8e-05,-1.2e-05,-5.2e-05,3.2e-05,-1.1e-05,-6.3e-05,7.9e-05,-3.5e-05,-1.4e-05,-4.7e-05,0,-2.7e-05,2e-06,-1.2e-05,-9.4e-05,-3.3e-05,-1.7e-05,-4.3e-05,2.7e-05,7e-06,9e-06,-5e-06,1.9e-05,-5.8e-05,1.8e-05,-6e-06,4.5e-05,1.5e-05,-9.6e-05,1e-06,1.8e-05,-7.2e-05,2e-05,2.4e-05,4.1e-05,0,-4.6e-05,2.8e-05,0.000141,6e-06,2e-06,-8e-06,-4.4e-05,8.5e-05
-2.1e-05,-3e-06,-1.1e-05,2.2e-05,-3.5e-05,-1.3e-05,1.9e-05,1.5e-05,-2.7e-05,2.3e-05,3.4e-05,5.3e-05,-2.9e-05,-7.2e-05,-2.1e-05,0,7e-06,-1.5e-05,5.7e-05,8e-06,1.5e-05,3e-06,2.7e-05,1.2e-05,-5.8e-05,-3.2e-05,4.7e-05,1.6e-05,0.000101,5e-06,-2.4e-05,1e-05,5.6e-05,1.6e-05,9.8e-05,-8e-06,6.3e-05,1.8e-05,4e-05,-1.3e-05,-4.3e-05,1.5e-05,-1.2e-05,6e-06,1.8e-05,2.3e-05,6e-05,-5.8e-05,6e-06,-0.000123,-1.9e-05,-3.6e-05,3.4e-05,0.000137,-1.5e-05,-8e-06,4.1e-05,-5.1e-05,-2.4e-05,6e-06,8e-06,-5e-06,4.7e-05,-6.3e-05,3e-05,-3.3e-05,-7.7e-05,2.3e-05,2.4e-05,7e-06,9e-05,-2e-06,-8.9e-05,-6.9e-05,-1.7e-05,-3.4e-05,2.6e-05,7e-06,8e-06,1.2e-05,-3.1e-05,2.7e-05,7e-05,-7.6e-05,-8e-06,2.2e-05,5e-06,-1.4e-05,-5.4e-05,2.2e-05,1.8e-05,6.3e-05,4.8e-05,1.1e-05,4.1e-05,2.3e-05,-2.3e-05,-1e-05,2.7e-05,-1.5e-05,5e-05,6e-06,2.3e-05,-1.3e-05,-7e-06,4.2e-05,1.1e-05,5e-06,1.4e-05,-7e-06,-1e-06,-2.8e-05,-1.5e-05,6e-06,-1.6e-05,-7.3e-05,-5.6e-05,-1.9e-05,1e-06,8e-06,1.7e-05
-3e-06,1.6e-05,-1.7e-05,-2.3e-05,3.5e-05,5e-06,-3.7e-05,-3e-06,1.4e-05,3.2e-05,-2.9e-05,-6.4e-05,3e-06,4.4e-05,2.2e-05,-1.5e-05,1e-06,1.7e-05,-1.7e-05,7e-06,3e-06,-3e-06,4e-06,9e-06,2.2e-05,3.3e-05,-3e-06,5e-06,-7.7e-05,-9e-06,2e-05,2.5e-05,-3.7e-05,-2e-06,-4.3e-05,6e-06,-2.4e-05,2.5e-05,-5.4e-05,2.3e-05,8.7e-05,2.7e-05,1e-05,-1.7e-05,-2.7e-05,1e-06,-7.7e-05,5e-05,-1e-05,5.7e-05,-1.6e-05,5.2e-05,-2.3e-05,-0.000106,1.5e-05,1.4e-05,-5e-06,2.5e-05,9e-06,2.3e-05,6e-06,3.1e-05,-5.2e-05,7.4e-05,-2.5e-05,2.5e-05,2.4e-05,-1.8e-05,4e-06,-7e-06,-3.7e-05,1.3e-05,7.1e-05,2.4e-05,-2.7e-05,-4.3e-05,-2.1e-05,-4e-06,1.7e-05,1.4e-05,-4e-06,-1.9e-05,-3.2e-05,3.4e-05,6e-06,8e-06,1e-06,1.2e-05,3.6e-05,-1e-05,-1.6e-05,-2.6e-05,-6e-06,-1.3e-05,-2.6e-05,-1.6e-05,3e-05,3.9e-05,-2.1e-05,-6e-06,-3.9e-05,-3.2e-05,-1.8e-05,-2.1e-05,4.1e-05,-3.3e-05,-9e-06,2.7e-05,-6e-06,0,0,1e-06,2.1e-05,-4e-06,-1.5e-05,2.8e-05,3.3e-05,6e-06,5e-06,-1.4e-05,-1.9e-05
2e-06,-1.1e-05,1e-06,5e-06,-1.8e-05,-2.5e-05,1.6e-05,5e-06,6e-06,-2.9e-05,2.1e-05,-7e-06,2.1e-05,-2.7e-05,-3e-06,2e-06,5e-06,3e-06,-4e-06,-1.2e-05,-8e-06,-2.3e-05,-1.6e-05,1e-06,-1.3e-05,-5e-06,-8e-06,2e-05,3e-05,6e-06,-1.4e-05,9e-06,1.8e-05,-2e-05,8e-06,0,-2.7e-05,-2.8e-05,2.7e-05,-1.6e-05,-6.6e-05,-3.3e-05,7e-06,1.1e-05,1.2e-05,-1e-05,0.000106,-4.8e-05,-9e-06,-5.7e-05,2.2e-05,-2.2e-05,3.1e-05,6.4e-05,-5e-06,-9e-06,1.7e-05,1.8e-05,-9e-06,-3.4e-05,-4e-06,0,1e-06,-4.8e-05,-1e-06,-4e-06,-3.7e-05,-1.3e-05,-2.1e-05,1e-06,2.2e-05,-1.1e-05,-4.9e-05,-1.3e-05,2e-05,8.7e-05,4e-05,-1.5e-05,-1.3e-05,1.5e-05,-9e-06,-1.8e-05,3.1e-05,1.8e-05,4e-06,3e-06,-5e-06,8e-06,-2.9e-05,6e-06,8e-06,-3.3e-05,-3.6e-05,-6e-06,-1.3e-05,-1.5e-05,-1.8e-05,-3.6e-05,1.7e-05,1.8e-05,2.8e-05,2.7e-05,-1.1e-05,2.8e-05,-2.2e-05,-2e-06,-2e-06,-9e-06,1e-06,5.5e-05,1e-05,4.4e-05,7e-06,1.8e-05,5e-06,-2.6e-05,-2.8e-05,8e-06,-4e-06,-1.1e-05,-1.3e-05
3e-06,-1e-06,-4e-06,-1e-05,6e-06,1.6e-05,1.4e-05,-9e-06,-8e-06,0,-1.5e-05,2.1e-05,-6e-06,-3e-06,-4e-06,2.4e-05,2e-06,-1.4e-05,2.4e-05,1.4e-05,5e-06,2.8e-05,-6e-06,-1.2e-05,1e-06,-4e-06,4e-06,-1.2e-05,-3.2e-05,-5e-06,1e-06,-4e-06,-3e-06,1.6e-05,-2e-06,-3e-06,5.8e-05,7e-06,1.5e-05,1.4e-05,2.1e-05,1.1e-05,-1.9e-05,-8e-06,0,-4e-06,-5.9e-05,3.8e-05,2.1e-05,5.1e-05,-7e-06,1.4e-05,-1.5e-05,-6.6e-05,-5e-06,1.1e-05,-2.4e-05,-2.1e-05,1.6e-05,3.7e-05,5e-06,5e-06,8e-06,1.1e-05,2.3e-05,-1e-05,3.5e-05,1.8e-05,1.5e-05,-2e-05,-2.3e-05,5e-06,-4e-06,2e-06,-1.5e-05,-7e-05,-2.6e-05,2.7e-05,-4e-06,-2e-05,-7e-06,7e-06,-1.2e-05,-3.9e-05,-4e-06,-1.2e-05,2e-05,-1e-06,2.3e-05,-9e-06,5e-06,2.5e-05,4.3e-05,2.4e-05,7e-06,1.1e-05,-5e-06,1.1e-05,-1e-05,2e-06,-2.8e-05,-1.8e-05,2e-05,-2.3e-05,-8e-06,-7e-06,1e-06,1.4e-05,1.6e-05,0,2e-06,-5.2e-05,-1.2e-05,-7e-06,8e-06,3.4e-05,1.2e-05,-8e-06,5e-06,6e-06,2.3e-05
6e-06,2e-06,1e-06,6e-06,-1e-06,-9e-06,-7e-06,-3e-06,6e-06,9e-06,-3e-06,1.5e-05,-1.3e-05,2.1e-05,1e-06,2e-06,-7e-06,1.2e-05,-4e-06,-1.1e-05,9e-06,-3.9e-05,-7e-06,8e-06,1.2e-05,1e-05,0,-1e-06,1.5e-05,3e-06,3e-06,0,-7e-06,-9e-06,-7e-06,2e-06,-3.7e-05,2e-06,-1.7e-05,3e-06,-1e-06,1e-05,1.8e-05,2e-05,2e-06,9e-06,-6e-06,-1.9e-05,6e-06,-4.7e-05,-9e-06,-3.5e-05,1.9e-05,3e-05,8e-06,5e-06,6e-06,1e-06,-6e-06,-2.9e-05,-2e-05,-7e-06,-9e-06,3e-06,-2.1e-05,3e-05,-1.6e-05,-7e-06,4e-06,4e-06,3e-06,-8e-06,1.4e-05,-2e-06,4e-05,3.3e-05,-2e-06,-2.3e-05,1.1e-05,5e-06,1.6e-05,-3e-06,-9e-06,2.3e-05,4e-06,-1.9e-05,-2e-06,8e-06,-9e-06,1.2e-05,-2.7e-05,-5e-06,-2.2e-05,-1.8e-05,1e-05,-9e-06,1.2e-05,3e-06,0,-7e-06,1.8e-05,3e-06,4e-06,2.5e-05,2.7e-05,-1e-06,2e-06,-2.1e-05,-9e-06,-1e-05,-2.4e-05,4.1e-05,-7e-06,-5e-06,1.3e-05,-3.1e-05,5e-06,9e-06,-9e-06,1.6e-05,3e-06
-1e-05,-6e-06,-1e-06,-5e-06,-5e-06,6e-06,1e-06,1.3e-05,-1.2e-05,-1.6e-05,8e-06,-2.7e-05,1.7e-05,-2.1e-05,4e-06,7e-06,-7e-06,-8e-06,2e-06,1.5e-05,1e-06,2.2e-05,7e-06,-1e-06,-1.9e-05,-1e-06,0,7e-06,7e-06,1e-06,-2.3e-05,-9e-06,1.5e-05,1e-05,1.5e-05,-5e-06,1e-06,0,-1e-05,-6e-06,-1.6e-05,-1.2e-05,-1.3e-05,-1e-06,-3e-06,3e-06,4.8e-05,1.1e-05,-6e-06,4.1e-05,2.3e-05,3.2e-05,-2.3e-05,-1.9e-05,-9e-06,1.1e-05,1e-05,4e-06,0,2e-05,1.4e-05,-1.3e-05,1.2e-05,-1.5e-05,1.6e-05,-3.2e-05,1.6e-05,-1.3e-05,-1.8e-05,7e-06,7e-06,2e-06,6e-06,1e-06,-4.2e-05,-3.4e-05,1e-05,1.2e-05,-4e-06,-2e-06,4e-06,8e-06,9e-06,-6e-06,8e-06,1.1e-05,-1.6e-05,-1.3e-05,1.5e-05,-1e-05,2.4e-05,1e-06,6e-06,-4e-06,-9e-06,1.1e-05,-6e-06,-1e-05,4e-06,-1.1e-05,-1.2e-05,1.3e-05,-1.1e-05,-3.7e-05,-2e-05,2.3e-05,-2e-06,1.3e-05,7e-06,-1.7e-05,1e-06,-1.6e-05,8e-06,-1e-05,-1.4e-05,-8e-06,-1.6e-05,-1e-05,0,2.7e-05,-7e-06
5e-06,6e-06,-2e-06,7e-06,1e-05,-4e-06,-1e-05,-5e-06,1.5e-05,8e-06,-1.6e-05,-1e-06,-4e-06,9e-06,-3e-06,-1.5e-05,3e-06,1.6e-05,-1.4e-05,-4e-06,7e-06,-1.4e-05,-1.1e-05,1e-06,1.7e-05,-1.1e-05,-1.1e-05,4e-06,-2.1e-05,2e-06,1.9e-05,2e-06,-1.6e-05,-1.5e-05,-9e-06,-2e-06,1.9e-05,1e-06,1e-06,-1e-05,3.3e-05,3e-06,6e-06,-2e-06,-6e-06,-3e-06,-5.6e-05,-3e-06,-6e-06,-4.4e-05,-2.7e-05,-5e-06,2e-06,-1.6e-05,8e-06,-1.5e-05,-9e-06,0,-2e-06,-5e-06,1.3e-05,7e-06,1.2e-05,1e-06,-9e-06,2.1e-05,-2.6e-05,6e-06,9e-06,8e-06,-5e-06,-2e-06,-1.1e-05,1.4e-05,4.4e-05,3.3e-05,-8e-06,-4e-06,-7e-06,1e-06,-1e-05,-2e-05,-1.2e-05,-5e-06,3e-06,1.9e-05,1e-05,0,3e-06,4e-06,-4e-06,2.2e-05,-4e-06,1.5e-05,2e-06,-1.2e-05,-3e-06,4e-06,-3e-06,9e-06,0,-1.4e-05,-4e-06,3.3e-05,-6e-06,-4.2e-05,8e-06,-2.4e-05,-9e-06,8e-06,4e-06,-1.5e-05,5e-06,9e-06,-7e-06,1.4e-05,1.3e-05,1.1e-05,5e-06,-3.8e-05,-5e-06
-5e-06,0,2e-06,-1e-05,-1.3e-05,3e-06,1.5e-05,-6e-06,-8e-06,1.1e-05,1.6e-05,2.7e-05,-1.1e-05,5e-06,-1e-06,-3e-06,7e-06,-6e-06,-2e-06,1.2e-05,-5e-06,-2e-06,6e-06,3e-06,-1.9e-05,9e-06,4e-06,-4e-06,4e-05,-1e-06,1.6e-05,7e-06,1.2e-05,1e-06,-1.8e-05,0,-3.7e-05,3e-06,1.7e-05,1e-05,-2e-05,2e-06,0,-1.2e-05,1.3e-05,4e-06,3.6e-05,-6e-06,1e-06,4.2e-05,2e-05,2e-06,-9e-06,2e-06,-2e-06,1e-06,8e-06,-2e-06,-3e-06,-6e-06,-1.8e-05,0,-2.8e-05,4e-06,0,-9e-06,2.1e-05,-2e-06,7e-06,8e-06,1e-05,1e-06,1.1e-05,-1.2e-05,-1.6e-05,-1e-05,1e-06,6e-06,7e-06,1e-06,4e-06,1.3e-05,1.8e-05,6e-06,8e-06,-1.2e-05,-3e-06,-5e-06,-1.4e-05,-2e-06,-5e-06,-3.4e-05,4e-06,-4e-06,6e-06,7e-06,5e-06,1.1e-05,-2e-06,7e-06,4e-06,9e-06,1.3e-05,-2.2e-05,1.4e-05,1.6e-05,-1.1e-05,1.1e-05,5e-06,7e-06,-5e-06,1.2e-05,-6e-06,2e-06,5e-06,-5e-06,-6e-06,3e-06,-6e-06,2.1e-05,7e-06
3e-06,-3e-06,3e-06,7e-06,3e-06,0,-7e-06,1e-06,4e-06,-8e-06,-8e-06,-1e-05,1e-05,-1.6e-05,-2e-06,-6e-06,2e-06,-2e-06,-4e-06,-5e-06,1e-06,7e-06,-2e-06,2e-06,1.1e-05,-1e-06,3e-06,-4e-06,-4.6e-05,-2e-06,-2.9e-05,3e-06,-1.1e-05,8e-06,2.3e-05,3e-06,5e-05,-4e-06,-3.6e-05,-1e-06,-8e-06,1e-06,-6e-06,8e-06,0,5e-06,-6e-06,1.3e-05,-4e-06,-2.2e-05,-1.4e-05,-9e-06,1.2e-05,3.1e-05,3e-06,1e-06,-1e-05,1e-06,7e-06,7e-06,2e-06,-6e-06,3e-05,-6e-06,7e-06,0,-3e-06,-2e-06,-9e-06,-1.5e-05,-9e-06,-4e-06,-1e-06,4e-06,-2e-06,7e-06,3e-06,-8e-06,0,1e-06,0,0,-1.9e-05,-8e-06,3e-06,-2e-06,3e-06,7e-06,1e-05,2e-06,1.6e-05,2.5e-05,-1.2e-05,-6e-06,-2e-06,-3e-06,-4e-06,-1.3e-05,3e-06,-1e-05,2e-06,-4e-06,-3e-06,1.9e-05,-4e-06,0,5e-06,-1.4e-05,-4e-06,1e-06,-1e-06,-8e-06,-9e-06,-1e-06,6e-06,0,-7e-06,-3e-06,2e-06,3e-06,0
0,5e-06,1e-06,-6e-06,2e-06,-4e-06,-2e-06,1e-06,-6e-06,3e-06,0,1e-06,1e-06,2.5e-05,3e-06,4e-06,-6e-06,1e-06,7e-06,3e-06,5e-06,-8e-06,1.3e-05,-3e-06,0,-3e-06,0,5e-06,3.1e-05,0,1.3e-05,-3e-06,5e-06,3e-06,-3e-06,-5e-06,-3.7e-05,1e-06,4.2e-05,7e-06,1.8e-05,-6e-06,1e-05,0,-1.1e-05,-1e-06,3e-06,-1.7e-05,2e-06,1.2e-05,5e-06,0,0,-3e-05,-3e-06,-9e-06,6e-06,6e-06,-4e-06,-6e-06,6e-06,1.1e-05,-8e-06,1.4e-05,-7e-06,6e-06,-5e-06,-1e-06,6e-06,1.1e-05,8e-06,3e-06,-1.6e-05,2e-06,-4e-06,-5e-06,-4e-06,9e-06,-1e-06,-4e-06,0,-9e-06,1.1e-05,1.2e-05,-1e-06,-7e-06,-2e-06,-1e-05,-1.8e-05,1e-06,-1.6e-05,-2.1e-05,1.9e-05,9e-06,1.5e-05,2e-06,3e-06,6e-06,-3e-06,-6e-06,-2e-06,-3e-06,-9e-06,-1e-05,1e-06,-1.3e-05,1e-06,6e-06,5e-06,-1.8e-05,-1e-06,4e-06,1.2e-05,-7e-06,-2e-06,5e-06,1.4e-05,-4e-06,2e-06,4e-06,-2e-06
0,-6e-06,2e-06,5e-06,-3e-06,4e-06,2e-06,3e-06,2e-06,1e-06,5e-06,2e-06,-6e-06,-1.7e-05,0,2e-06,-2e-06,3e-06,0,-1e-06,-4e-06,8e-06,-6e-06,0,-4e-06,6e-06,0,3e-06,-1.7e-05,-1e-06,3e-06,-1e-06,0,-2e-06,-8e-06,-3e-06,1.8e-05,2e-06,-2.9e-05,-5e-06,-1.6e-05,8e-06,-1e-05,3e-06,1.1e-05,-4e-06,-1.8e-05,1.5e-05,0,-1.4e-05,1e-06,2e-06,3e-06,3.4e-05,-2e-06,4e-06,0,3e-06,2e-06,-3e-06,-3e-06,-1e-06,-1.5e-05,-1.8e-05,7e-06,-7e-06,-7e-06,3e-06,0,-1.2e-05,-4e-06,-2e-06,1.8e-05,-7e-06,7e-06,-1.5e-05,5e-06,-4e-06,-2e-06,1e-06,-2e-06,6e-06,-2e-06,-1.5e-05,-2e-06,2e-06,-3e-06,6e-06,1.2e-05,-2e-06,1e-06,1e-05,-1.1e-05,-4e-06,-9e-06,-1e-06,0,-1e-06,1e-06,9e-06,0,2e-06,4e-06,-1e-06,-6e-06,2.1e-05,1e-06,2e-06,-1e-06,-5e-06,1.1e-05,-6e-06,-4e-06,1e-06,-6e-06,4e-06,-6e-06,4e-06,-1e-06,-2e-05,-1e-06
2e-06,3e-06,1e-06,-5e-06,7e-06,-3e-06,1e-06,-1e-06,3e-06,-7e-06,-8e-06,1.1e-05,3e-06,3e-06,-4e-06,8e-06,4e-06,-8e-06,7e-06,-4e-06,-4e-06,0,1e-06,0,8e-06,-6e-06,1e-06,-1e-06,0,0,-3e-06,-1e-06,-3e-06,-3e-06,5e-06,3e-06,-6e-06,0,2.1e-05,-5e-06,1.3e-05,-3e-06,5e-06,-2e-06,-4e-06,0,1.4e-05,-5e-06,3e-06,1.2e-05,-6e-06,7e-06,-1e-06,-8e-06,4e-06,9e-06,2e-06,-6e-06,-3e-06,7e-06,5e-06,-1e-06,1.4e-05,1.6e-05,-1e-06,7e-06,1.1e-05,5e-06,-7e-06,5e-06,-3e-06,0,-1.1e-05,0,-1.4e-05,3.1e-05,-4e-06,1e-06,3e-06,-3e-06,-5e-06,-3e-06,-5e-06,1.1e-05,-3e-06,1.3e-05,3e-06,-6e-06,-1.1e-05,2e-06,9e-06,1.1e-05,-1e-06,-4e-06,-5e-06,1e-06,-4e-06,-3e-06,4e-06,7e-06,3e-06,1e-06,3e-06,6e-06,-3e-06,-1e-05,-6e-06,0,3e-06,4e-06,1e-06,1.4e-05,-3e-06,2e-06,0,-4e-06,1e-06,-7e-06,2e-06,2e-05,-1e-06
-4e-06,0,1e-06,3e-06,-6e-06,3e-06,4e-06,-4e-06,-3e-06,2e-06,8e-06,-1.9e-05,1e-06,8e-06,1e-06,-5e-06,3e-06,5e-06,-5e-06,0,0,-4e-06,-4e-06,-1e-06,-1.3e-05,0,3e-06,-4e-06,1.7e-05,1e-06,-4e-06,-3e-06,5e-06,3e-06,-2e-06,-1e-06,-1.1e-05,-1e-06,-2.4e-05,1e-06,-7e-06,-5e-06,0,1e-06,-1e-06,2e-06,1.4e-05,1e-06,1e-06,-9e-06,7e-06,-2e-06,-5e-06,-7e-06,-1e-06,-1e-06,-4e-06,1e-05,2e-06,-1.2e-05,-5e-06,-3e-06,0,-5e-06,-1e-06,-8e-06,-3e-06,-4e-06,6e-06,-1.1e-05,1e-06,0,1.4e-05,2e-06,9e-06,-3.1e-05,3e-06,0,-1e-06,5e-06,7e-06,2e-06,1.3e-05,-6e-06,-4e-06,-7e-06,0,7e-06,1.4e-05,-3e-06,-9e-06,-1.8e-05,6e-06,7e-06,5e-06,1e-06,6e-06,0,-2e-06,-7e-06,-3e-06,-1e-06,-7e-06,-7e-06,1.1e-05,4e-06,8e-06,1.1e-05,-3e-06,1e-05,-5e-06,-1.5e-05,0,3e-06,8e-06,4e-06,-3e-06,3e-06,-1e-06,-9e-06,3e-06
2e-06,0,1e-06,-3e-06,2e-06,-2e-06,-8e-06,1e-06,3e-06,4e-06,-6e-06,1.1e-05,-2e-06,-1.1e-05,4e-06,4e-06,-1e-06,-2e-06,2e-06,-4e-06,-2e-06,1.2e-05,1e-06,0,1e-05,1e-06,-3e-06,2e-06,-2.4e-05,-1e-06,4e-06,1e-06,-7e-06,4e-06,-3e-06,0,1.9e-05,0,2.7e-05,2e-06,-5e-06,6e-06,-3e-06,-4e-06,1e-06,-2e-06,-3.5e-05,-3e-06,-3e-06,9e-06,-5e-06,-9e-06,1e-06,1.5e-05,0,1e-06,3e-06,-4e-06,1e-06,1.3e-05,-2e-06,-5e-06,-1.4e-05,0,3e-06,7e-06,1e-06,-2e-06,2e-06,8e-06,1e-06,1e-06,-1.5e-05,0,-3e-06,2.9e-05,0,1e-06,-1e-06,-1e-06,0,-4e-06,-1.6e-05,3e-06,-4e-06,-7e-06,-2e-06,-2e-06,-9e-06,2e-06,2e-06,1.7e-05,-4e-06,-4e-06,0,-1e-06,-5e-06,6e-06,1e-06,-6e-06,5e-06,3e-06,-4e-06,5e-06,-1e-05,-5e-06,-5e-06,-9e-06,0,5e-06,5e-06,7e-06,3e-06,-4e-06,-2e-06,-8e-06,-5e-06,4e-06,-1e-06,1e-05,0
-2e-06,0,-1e-06,3e-06,2e-06,3e-06,2e-06,3e-06,-5e-06,-3e-06,2e-06,0,0,1.1e-05,-3e-06,-6e-06,-3e-06,6e-06,-6e-06,5e-06,1e-06,-8e-06,-1e-06,2e-06,-6e-06,4e-06,0,3e-06,2.7e-05,1e-06,1e-06,4e-06,5e-06,-5e-06,5e-06,0,-1.2e-05,-1e-06,-2.3e-05,3e-06,1.3e-05,-2e-06,6e-06,1e-06,-2e-06,-3e-06,3.4e-05,5e-06,-1e-06,-7e-06,1e-06,4e-06,-2e-06,-2.2e-05,-1e-06,-3e-06,-2e-06,-3e-06,-1e-06,-9e-06,2e-06,3e-06,1.4e-05,1e-06,-5e-06,-4e-06,-6e-06,2e-06,-4e-06,5e-06,2e-06,-1e-06,1.2e-05,0,4e-06,-2.2e-05,-5e-06,-5e-06,1e-06,-2e-06,0,-1e-06,1e-05,0,-3e-06,3e-06,3e-06,5e-06,1e-05,-2e-06,6e-06,-1.5e-05,-2e-06,-3e-06,-4e-06,-1e-06,2e-06,-6e-06,-1e-06,5e-06,-8e-06,-3e-06,8e-06,-5e-06,-2e-06,4e-06,2e-06,1e-05,0,-5e-06,0,4e-06,1e-06,-2e-06,-7e-06,6e-06,6e-06,1e-06,0,2e-06,0
3e-06,0,-1e-06,-4e-06,-4e-06,0,2e-06,-1e-06,5e-06,1e-06,2e-06,-2e-06,2e-06,-6e-06,-1e-06,-1e-06,-2e-06,-5e-06,1e-06,-5e-06,0,5e-06,0,0,4e-06,-6e-06,1e-06,0,-2.8e-05,-1e-06,-6e-06,1e-06,-3e-06,-2e-06,-4e-06,1e-06,4e-06,1e-06,1e-05,-1e-06,-1.4e-05,-5e-06,-6e-06,2e-06,4e-06,1e-06,-1.5e-05,-2e-06,-2e-06,3e-06,4e-06,2e-06,3e-06,1.1e-05,0,0,3e-06,5e-06,1e-06,5e-06,2e-06,1e-06,-7e-06,-4e-06,2e-06,0,6e-06,-2e-06,2e-06,-1e-06,-3e-06,0,-1.2e-05,5e-06,-2e-06,3e-06,8e-06,4e-06,1e-06,-1e-06,1e-06,4e-06,-5e-06,-6e-06,-1e-06,3e-06,-1e-06,-6e-06,-6e-06,2e-06,-6e-06,3e-06,7e-06,7e-06,-1e-06,2e-06,2e-06,2e-06,0,6e-06,6e-06,-1e-06,-1e-06,5e-06,1e-05,8e-06,-2e-06,-1.1e-05,-1e-06,-3e-06,-3e-06,-8e-06,-5e-06,-1e-06,1e-06,-1e-05,-5e-06,-4e-06,-1e-06,-8e-06,-2e-06
0,0,0,3e-06,4e-06,-1e-06,1e-06,-1e-06,-2e-06,1e-06,-4e-06,-1e-05,-2e-06,-4e-06,1e-06,0,1e-06,-1e-06,1e-06,4e-06,-2e-06,3e-06,-1e-06,-1e-06,0,2e-06,-2e-06,-3e-06,1.9e-05,0,2e-06,-3e-06,0,0,1e-06,-1e-06,5e-06,0,-1e-06,-2e-06,6e-06,7e-06,4e-06,3e-06,-3e-06,1e-06,-8e-06,-1e-06,0,3e-06,-8e-06,5e-06,1e-06,-1.2e-05,1e-06,-4e-06,-2e-06,-2e-06,-1e-06,0,1e-06,2e-06,1e-06,-1e-06,-1e-06,3e-06,-1e-06,-1e-06,0,-2e-06,1e-06,-1e-06,8e-06,0,0,1.1e-05,-6e-06,-2e-06,-1e-06,2e-06,1e-06,-7e-06,1e-06,9e-06,-1e-06,2e-06,1e-06,3e-06,-4e-06,-1e-06,4e-06,9e-06,-8e-06,-4e-06,-3e-06,-2e-06,-3e-06,1e-06,1e-06,-2e-06,-5e-06,1e-06,-4e-06,-1e-06,-9e-06,-1e-05,2e-06,7e-06,1e-06,2e-06,-4e-06,9e-06,0,4e-06,5e-06,7e-06,-1e-06,2e-06,0,2e-06,1e-06
-1e-06,-1e-06,-1e-06,-2e-06,-2e-06,1e-06,-2e-06,0,1e-06,-4e-06,5e-06,8e-06,0,1e-05,1e-06,1e-06,2e-06,2e-06,1e-06,-5e-06,0,-6e-06,3e-06,0,-4e-06,-1e-06,1e-06,0,-8e-06,0,9e-06,-1e-06,2e-06,3e-06,2e-06,0,-1.4e-05,-1e-06,4e-06,-1e-06,2e-06,-2e-06,-2e-06,-2e-06,2e-06,-1e-06,1.7e-05,3e-06,0,-5e-06,9e-06,-6e-06,4e-06,1e-06,-2e-06,-2e-06,-1e-06,-3e-06,1e-06,-3e-06,-2e-06,2e-06,9e-06,5e-06,0,-5e-06,-3e-06,0,-3e-06,2e-06,2e-06,0,-3e-06,-4e-06,4e-06,-1.4e-05,5e-06,-1e-06,-1e-06,1e-06,-1e-06,1e-06,3e-06,-8e-06,1e-06,-1e-06,0,-3e-06,2e-06,1e-06,2e-06,-1.1e-05,5e-06,-4e-06,1e-06,1e-06,4e-06,-3e-06,0,-5e-06,6e-06,0,1e-06,-2e-06,1e-06,1.2e-05,-1e-06,-9e-06,-1e-06,9e-06,-1e-06,-8e-06,4e-06,0,2e-06,-3e-06,4e-06,0,0,5e-06,2e-06
0,1e-06,0,1e-06,0,-2e-06,-2e-06,0,-2e-06,1e-06,-4e-06,-3e-06,3e-06,-1.1e-05,-2e-06,1e-06,1e-06,-1e-06,3e-06,4e-06,4e-06,9e-06,1e-06,0,6e-06,1e-06,-1e-06,2e-06,-4e-06,0,-1.1e-05,2e-06,-3e-06,-1e-06,-3e-06,1e-06,1.5e-05,0,-8e-06,0,-8e-06,-2e-06,-1e-06,-3e-06,0,-1e-06,-7e-06,-3e-06,1e-06,4e-06,-7e-06,-2e-06,-3e-06,4e-06,0,5e-06,1e-06,4e-06,-1e-06,3e-06,-3e-06,-4e-06,-1e-05,-7e-06,2e-06,4e-06,0,1e-06,3e-06,1e-06,-1e-06,0,4e-06,2e-06,-8e-06,1.7e-05,-3e-06,1e-06,1e-06,0,0,2e-06,-5e-06,3e-06,2e-06,-7e-06,-1e-06,1e-06,-2e-06,0,-5e-06,1.1e-05,1e-06,6e-06,1e-06,0,-3e-06,0,0,1e-06,-6e-06,1e-06,4e-06,3e-06,4e-06,-9e-06,2e-06,4e-06,2e-06,-1e-06,2e-06,3e-06,-1e-06,-1e-06,-4e-06,1e-06,-2e-06,-3e-06,0,-2e-06,-1e-06
-1e-06,0,0,-2e-06,1e-06,2e-06,2e-06,1e-06,0,1e-06,1e-06,-4e-06,-3e-06,7e-06,1e-06,0,-3e-06,-1e-06,-2e-06,-2e-06,0,-7e-06,0,-1e-06,-6e-06,0,1e-06,1e-06,1.6e-05,0,3e-06,0,2e-06,-2e-06,1e-06,1e-06,-7e-06,1e-06,4e-06,4e-06,8e-06,3e-06,2e-06,0,-1e-06,2e-06,-1e-06,3e-06,1e-06,-5e-06,3e-06,1e-06,0,5e-06,1e-06,0,0,-2e-06,1e-06,-1e-06,2e-06,0,2e-06,5e-06,-2e-06,-2e-06,2e-06,0,0,-5e-06,0,0,-6e-06,-1e-06,3e-06,-1.9e-05,-1e-06,0,-1e-06,-1e-06,-3e-06,-2e-06,5e-06,3e-06,3e-06,2e-06,2e-06,-2e-06,2e-06,-1e-06,3e-06,-6e-06,-3e-06,-3e-06,-2e-06,0,2e-06,3e-06,0,4e-06,5e-06,1e-06,-3e-06,-6e-06,-6e-06,-1e-06,-2e-06,-3e-06,-2e-06,-5e-06,-2e-06,-1e-06,-2e-06,-3e-06,-3e-06,1e-06,1e-06,0,1e-06,-6e-06,-2e-06
2e-06,0,-1e-06,1e-06,-2e-06,-2e-06,1e-06,0,2e-06,-1e-06,1e-06,2e-06,-1e-06,-2e-06,1e-06,1e-06,-2e-06,1e-06,0,3e-06,-2e-06,3e-06,0,0,7e-06,0,0,-2e-06,-2.2e-05,0,3e-06,-1e-06,-2e-06,1e-06,1e-06,-1e-06,0,0,2e-06,1e-06,-4e-06,-1e-06,-3e-06,1e-06,2e-06,1e-06,-6e-06,-2e-06,0,6e-06,1e-06,4e-06,-3e-06,-1.2e-05,0,2e-06,0,1e-06,-1e-06,-2e-06,3e-06,1e-06,1e-05,-4e-06,1e-06,1e-06,1e-06,-1e-06,-2e-06,-2e-06,-2e-06,-1e-06,5e-06,-3e-06,-1e-06,1.5e-05,3e-06,-2e-06,0,0,1e-06,0,-5e-06,-5e-06,3e-06,6e-06,-1e-06,1e-06,-2e-06,1e-06,-1e-06,-3e-06,1e-06,-3e-06,-1e-06,0,0,-3e-06,0,-1e-06,-3e-06,-1e-06,-1e-06,7e-06,5e-06,7e-06,1e-06,3e-06,2e-06,-8e-06,1e-06,0,-1e-06,1e-06,4e-06,1e-06,-2e-06,5e-06,0,6e-06,2e-06
-2e-06,1e-06,0,-1e-06,3e-06,2e-06,-2e-06,-2e-06,-1e-06,1e-06,-4e-06,2e-06,3e-06,-5e-06,0,-1e-06,1e-06,2e-06,-3e-06,0,1e-06,2e-06,-2e-06,1e-06,-5e-06,-3e-06,-1e-06,-1e-06,2.1e-05,0,0,1e-06,2e-06,3e-06,-3e-06,0,7e-06,0,-6e-06,-3e-06,-1e-06,-2e-06,3e-06,1e-06,-3e-06,-1e-06,1.5e-05,0,0,-6e-06,-4e-06,0,1e-06,1.9e-05,0,1e-06,0,1e-06,1e-06,5e-06,-3e-06,-1e-06,-1.2e-05,3e-06,0,0,-2e-06,1e-06,1e-06,4e-06,3e-06,1e-06,-2e-06,1e-06,1e-06,-1.2e-05,-3e-06,2e-06,0,0,0,-1e-06,4e-06,3e-06,2e-06,-2e-06,-1e-06,-1e-06,6e-06,-1e-06,-1e-06,1e-05,1e-06,6e-06,3e-06,-1e-06,0,2e-06,0,-4e-06,2e-06,-1e-06,3e-06,-6e-06,-1e-06,-8e-06,0,2e-06,-1e-06,1e-06,3e-06,0,3e-06,1e-06,4e-06,2e-06,-1e-06,0,0,0,0
1e-06,-1e-06,0,1e-06,-2e-06,-1e-06,1e-06,1e-06,1e-06,0,4e-06,-2e-06,-1e-06,9e-06,0,0,3e-06,0,0,0,1e-06,-5e-06,1e-06,-1e-06,3e-06,3e-06,2e-06,1e-06,-1.8e-05,0,-3e-06,1e-06,0,0,1e-06,1e-06,-1.4e-05,0,7e-06,-2e-06,6e-06,2e-06,-2e-06,0,1e-06,0,-1.5e-05,0,0,7e-06,5e-06,-3e-06,1e-06,-1.6e-05,-2e-06,-4e-06,0,-1e-06,0,-7e-06,-1e-06,1e-06,0,0,0,-1e-06,0,1e-06,-1e-06,1e-06,-2e-06,0,-2e-06,3e-06,-2e-06,1.1e-05,3e-06,-1e-06,1e-06,1e-06,2e-06,2e-06,-3e-06,-2e-06,2e-06,-2e-06,1e-06,1e-06,-5e-06,1e-06,2e-06,-1.2e-05,-2e-06,-3e-06,0,1e-06,0,-1e-06,0,0,-2e-06,0,1e-06,4e-06,-2e-06,9e-06,-1e-06,0,0,6e-06,0,-1e-06,1e-06,1e-06,-3e-06,-6e-06,3e-06,-2e-06,0,1e-06,0
0,1e-06,0,-1e-06,1e-06,0,1e-06,0,-2e-06,-1e-06,-3e-06,-2e-06,-1e-06,-8e-06,0,-2e-06,0,-2e-06,1e-06,1e-06,0,4e-06,-1e-06,0,-1e-06,0,-1e-06,0,1e-05,0,0,-2e-06,0,-2e-06,1e-06,0,1.3e-05,0,-9e-06,1e-06,-9e-06,1e-06,1e-06,0,0,1e-06,4e-06,2e-06,-1e-06,-1.1e-05,-4e-06,-2e-06,2e-06,1.6e-05,2e-06,-1e-06,0,1e-06,0,6e-06,0,0,1e-05,-1e-06,0,1e-06,1e-06,-1e-06,-1e-06,-1e-06,-1e-06,0,5e-06,1e-06,5e-06,-5e-06,-3e-06,0,0,0,0,-2e-06,0,3e-06,0,-2e-06,-1e-06,0,1e-06,-1e-06,-1e-06,1.1e-05,1e-06,-3e-06,-1e-06,0,0,-1e-06,0,4e-06,2e-06,0,-2e-06,-1e-06,5e-06,-7e-06,0,4e-06,0,0,0,1e-06,-4e-06,-1e-06,-4e-06,5e-06,-4e-06,0,0,-4e-06,-1e-06
0,0,0,1e-06,0,0,0,-1e-06,1e-06,1e-06,1e-06,6e-06,1e-06,4e-06,1e-06,1e-06,-2e-06,-2e-06,1e-06,-2e-06,1e-06,-2e-06,0,1e-06,-2e-06,0,0,-1e-06,1e-06,0,4e-06,-1e-06,1e-06,0,-2e-06,0,-7e-06,0,1.1e-05,2e-06,6e-06,-4e-06,1e-06,-2e-06,0,0,9e-06,-1e-06,0,1.1e-05,1e-06,2e-06,1e-06,-1.5e-05,0,-2e-06,0,-1e-06,0,-4e-06,0,1e-06,-8e-06,0,0,-1e-06,1e-06,0,2e-06,2e-06,-1e-06,0,-5e-06,-1e-06,-2e-06,-5e-06,2e-06,1e-06,-1e-06,0,1e-06,-2e-06,1e-06,-3e-06,-1e-06,1e-06,1e-06,0,-1e-06,0,1e-06,-5e-06,0,5e-06,1e-06,0,0,0,-1e-06,0,-2e-06,1e-06,0,-1e-06,-6e-06,1e-06,1e-06,-4e-06,-1e-06,-3e-06,-1e-06,-2e-06,0,-1e-06,1e-06,-2e-06,0,0,0,2e-06,1e-06
1e-06,0,0,-1e-06,-1e-06,-1e-06,-1e-06,0,0,0,1e-06,-3e-06,1e-06,2e-06,0,-2e-06,-2e-06,3e-06,0,3e-06,-2e-06,-3e-06,-1e-06,-1e-06,4e-06,-1e-06,0,-1e-06,-1e-05,0,-2e-06,2e-06,-1e-06,2e-06,0,0,2e-06,0,-1.4e-05,1e-06,1e-06,2e-06,-1e-06,0,1e-06,-1e-06,-1.3e-05,-1e-06,0,-1e-05,2e-06,3e-06,0,1e-05,-1e-06,-1e-06,0,0,-1e-06,1e-06,2e-06,0,2e-06,2e-06,0,1e-06,-3e-06,0,-1e-06,-1e-06,2e-06,1e-06,3e-06,1e-06,2e-06,1.1e-05,1e-06,0,1e-06,-1e-06,0,1e-06,-3e-06,0,-1e-06,4e-06,0,0,-1e-06,0,0,-3e-06,-1e-06,-3e-06,0,0,0,0,0,-3e-06,2e-06,0,2e-06,2e-06,3e-06,3e-06,-1e-06,5e-06,0,-5e-06,0,2e-06,3e-06,0,4e-06,-1e-06,1e-06,-2e-06,0,-1e-06,0
-1e-06,0,0,0,1e-06,1e-06,-1e-06,0,0,0,-3e-06,2e-06,0,-6e-06,-1e-06,3e-06,1e-06,-2e-06,1e-06,-4e-06,-1e-06,6e-06,2e-06,-1e-06,-5e-06,1e-06,-1e-06,0,1.7e-05,0,-5e-06,0,1e-06,-1e-06,1e-06,0,3e-06,0,1.7e-05,0,-4e-06,1e-06,1e-06,0,-1e-06,0,7e-06,2e-06,0,1e-05,-5e-06,-2e-06,-1e-06,-7e-06,1e-06,3e-06,1e-06,1e-06,1e-06,2e-06,0,-1e-06,3e-06,-4e-06,-1e-06,0,2e-06,0,-1e-06,2e-06,0,0,-2e-06,-1e-06,-5e-06,-1.8e-05,-2e-06,-1e-06,-1e-06,0,0,0,4e-06,5e-06,-3e-06,0,-1e-06,0,1e-06,0,-1e-06,9e-06,0,-3e-06,0,0,0,-1e-06,0,0,-2e-06,-1e-06,-1e-06,-3e-06,5e-06,-7e-06,-1e-06,-7e-06,0,4e-06,0,-1e-06,0,1e-06,0,0,-1e-06,0,0,1e-06,0
