-0.002438,-0.001584,-0.000891,-0.001643,-0.001491,-0.001261,-0.001696,-0.001948,-0.001078,-0.000704,-0.001386,-0.001099,-0.001122,-0.000711,-0.001636,-0.001772,-0.001861,-0.001672,-0.001704,-0.001492,-0.002253,-0.001166,-0.001188,-0.001053,-0.002241,-0.002186,-0.001453,-0.001565,-0.002191,-0.00232,-0.002403,-0.002106,-0.001428,-0.001434,-0.001497,-0.0013,-0.001111,-0.000674,-0.00114,-0.002382,-0.001251,-0.002355,-0.001173,-0.001259,-0.000859,-0.001232,-0.00086,-0.000911,-0.000729,-0.000262,-0.00103,-0.001426,-0.001144,-0.000487,-0.001253,-0.001788,-0.001137,-0.000532,-0.000854,-0.001089,-0.000802,-0.001795,-0.00175,-0.002961,-0.001647,-0.001288,-0.000806,-0.00153,-0.001281,-0.000742,-0.001153,-0.000323,-0.001636,-0.00127,-0.001207,-0.00114,-0.000935,-0.001834,-0.00152,-0.000944,-0.001106,-0.000941,-0.000866,-0.000456,-0.001955,-0.00128,-0.001485,-0.003181,-0.001562,-0.001126,-0.000805,-0.001105,-0.001304,-0.000577,-0.00066,-0.001532,-0.001223,-0.001357,-0.001791,-0.00209,-0.001661,-0.001009,-0.000919,-0.001044,-0.000729,-0.001236,-0.000651,-0.000795,-0.001288,-0.001397,-0.000714,-0.001616,-0.000548,-0.000947,-0.001007,-0.000242,-0.001305,-0.000879,-0.001227,-0.001337,-0.000925
0.001533,0.000253,0.000174,0.001116,0.000713,0.000504,0.001199,0.001104,9.8e-05,0.00039,0.000875,0.000652,0.000285,0.00022,-1e-06,0.000812,0.001492,0.00049,0.00072,0.000451,0.000668,-0.000547,0.000207,-0.000474,0.001184,0.001152,0.000721,0.000191,0.000509,0.000813,0.00089,0.000588,0.00051,0.000199,0.000579,0.000673,0.000246,3.3e-05,0.000341,0.000687,0.000362,0.000822,0.000676,0.000406,-0.000479,0.000442,-4e-05,-0.000349,7.4e-05,-0.000586,0.000116,7.7e-05,0.000165,0.000143,0.000176,-3.8e-05,2.4e-05,-0.000396,0.000214,0.000468,4.7e-05,0.000502,0.000493,0.001153,0.000576,0.00019,0.000147,0.000159,-0.000485,-0.000463,9.8e-05,-0.000197,0.000541,0.000716,0.000367,0.000453,0.000333,0.00056,0.000227,2.6e-05,1.4e-05,-4.5e-05,0.000336,9e-06,0.000163,0.000801,-0.000222,0.002314,0.00043,0.000251,-7.7e-05,0.000256,0.000276,0.000196,0.000433,0.001037,0.000686,0.000693,2.6e-05,0.000736,0.000515,0.000169,4.7e-05,-3.1e-05,0.000176,0.000635,0.000434,0.000318,0.00029,0.000425,0.000113,0.000845,0.00032,0.000313,0.000459,-0.000132,0.000372,-0.000145,0.000296,0.000324,-2e-06
-0.001169,-0.000134,-8.3e-05,-0.000276,-0.000894,-0.000355,-0.00119,-0.00093,-0.000568,-0.000183,-0.000402,-0.000379,-6.6e-05,-5.4e-05,0.000503,-0.000688,-0.001074,-0.000568,0.000144,-0.000367,-0.000433,0.000565,0.000515,0.001092,-0.000273,-0.001063,-0.000877,4.9e-05,0.000462,0.000299,-0.000184,0.000236,-0.000377,0.000168,-0.000291,-8.6e-05,-0.000202,-0.000387,-6.6e-05,-0.00022,0.000295,-0.000212,-0.000291,5e-06,0.000786,-0.00027,1e-06,0.000404,0.000319,0.000172,0.000665,-8.5e-05,0.000134,0.000315,0.000197,0.000379,0.000361,0.000479,-0.000103,-0.000477,-6.3e-05,3.2e-05,-0.000291,-3.5e-05,-0.000268,-0.000283,-0.000308,0.000129,0.000925,0.000843,0.000375,0.000351,-0.000522,6.2e-05,-0.000333,-0.000248,-4.4e-05,-9.9e-05,6.1e-05,0.000282,0.000483,0.000295,3.2e-05,-0.000145,0.00086,-0.000433,0.000595,-0.001295,-0.000766,-0.00032,0.000388,2.6e-05,0.000116,-0.000113,-0.00011,-0.000562,4e-06,-0.000593,0.000266,-0.000923,-0.000127,0.00014,6.4e-05,0.000495,-7.8e-05,-0.000316,-0.00038,-0.000258,-8e-05,-8.7e-05,0.000283,-0.000252,-0.000272,-0.000284,-0.000385,-0.000634,-1.7e-05,0.000104,0.00057,-3.2e-05,2.8e-05
0.000612,0.000139,3.1e-05,-4.5e-05,0.000731,0.000251,0.000573,9.4e-05,0.000627,2.5e-05,-0.00016,-8.1e-05,-8.2e-05,-0.000104,-0.000155,0.000355,0.000177,0.000438,-0.000348,-0.000213,0.000217,-0.000415,-0.000863,-0.000929,-0.000466,0.000953,0.000467,-0.000483,-0.000546,-0.001222,-0.000552,-0.000842,0.000345,0.000227,-5.2e-05,-0.000695,-0.000335,0.000109,-0.000532,9.4e-05,-0.000208,-6.8e-05,0.000138,-0.000647,-0.001283,-0.000523,0.000152,-1.2e-05,-0.000227,-0.000128,-0.000735,0.000203,-0.000143,-0.000599,-0.00024,-0.000463,-0.000675,-0.000452,-0.000111,0.000418,-0.000208,-0.000138,-0.000218,-0.000603,0.000479,0.000586,0.000501,-0.000367,-0.000961,-0.00066,-0.00074,-0.000536,0.000174,-0.000477,-0.000138,-1.1e-05,-8.7e-05,-0.000243,-0.000265,-0.000604,-0.00058,-0.000422,-0.000446,-0.000354,-0.001043,-0.000311,-0.000553,0.000465,0.00071,0.000354,-0.000293,-0.000277,-0.000209,-0.000234,-3.2e-05,3.2e-05,-0.000188,0.000374,-7.5e-05,0.000901,4.4e-05,-0.000386,-1.4e-05,-0.000196,-0.000273,-2.8e-05,8.3e-05,0.000106,-0.000113,-7.8e-05,-0.000472,-0.000317,6.3e-05,-0.000171,0.000258,0.000282,-0.000538,-0.000361,-0.001042,-0.000133,-0.000119
-0.000649,-2.3e-05,-5.5e-05,-0.000151,-0.000488,-0.000513,-0.00022,0.00027,-0.000147,1.1e-05,5.6e-05,-4.3e-05,0.00023,8.4e-05,0.000255,-0.000176,-0.000187,-8.2e-05,0.000574,0.000499,-0.000285,0.000416,0.000854,0.000529,0.000729,-0.000581,-0.000402,0.000561,0.000551,0.001343,0.000895,0.00087,-0.000169,-0.000423,4.8e-05,0.000589,0.000306,0.000244,0.000315,-0.000141,-0.000238,0.000174,-0.000198,0.00045,0.000927,0.000543,0.00015,-0.000103,0.000178,0.00071,0.000386,-0.000167,0.000117,0.000337,0.000138,0.000333,0.000866,0.000413,-0.000164,-0.000267,0.000132,-0.000152,0.000575,0.000546,-0.000453,-0.000683,-0.000483,0.000395,0.000637,0.000329,0.000703,0.000561,0.000123,-8.4e-05,0.000451,-0.000173,9.6e-05,0.00019,0.000435,0.000594,0.00061,0.00028,0.000351,9.1e-05,0.000632,0.000276,0.000451,0.000143,-0.000558,-0.000234,0.000208,0.000176,-3.1e-05,0.000199,6.6e-05,0.000116,3.6e-05,-0.000409,-0.000209,-0.000558,-2.5e-05,0.00014,8.1e-05,-0.000195,6.9e-05,0.000291,-0.000289,-7.3e-05,0.000249,-1.3e-05,3.6e-05,0.000114,-1.8e-05,0.000131,-0.000166,-0.000194,0.000518,0.000685,0.000776,0.000274,1.1e-05
0.000274,-0.00033,9.4e-05,0.000508,0.000423,0.000404,5.4e-05,-6.9e-05,-0.000304,-0.000402,4e-06,0.000155,-0.000283,-7e-06,-0.000228,0.00012,0.000515,0.000335,-0.000804,-0.000252,0.000141,-0.000231,-0.000326,-0.000307,-0.000449,0.000298,0.000526,-0.000291,-0.000792,-0.000687,-0.000613,-0.000568,-6e-06,0.000154,1.4e-05,-0.000264,-0.000177,-0.00013,-0.000318,7.3e-05,0.000216,4.6e-05,5.9e-05,-2e-06,2.6e-05,-0.000252,-0.000174,-0.000373,-0.000318,-0.000425,-0.000533,-0.000325,-0.000417,-0.000101,-9e-05,-1.4e-05,-0.000516,-8.7e-05,0.000282,9.8e-05,0.000116,9.7e-05,-0.000352,-0.000428,0.000636,0.000429,4.7e-05,-0.000186,-0.000273,-0.000264,-0.000295,-0.000359,-0.000319,0.000125,-0.000316,0.000313,-0.000156,0.000112,-0.000289,-0.000237,-0.000357,2e-06,4e-06,9.3e-05,-0.000212,-7.7e-05,0.000225,-7.2e-05,0.000586,-0.000102,-0.000115,0.000119,-1e-06,0.000189,-0.000384,2.9e-05,0.000276,0.000164,0.000461,0.000162,9e-06,0.00022,-0.000363,0.000214,0.000227,-0.000346,0.000236,-3.3e-05,-0.000266,0.000164,0.000265,6.3e-05,0.00031,-8e-06,0.000269,0.000242,-0.00028,-0.000275,-0.000417,-0.000497,-3e-05
-0.000142,0.000706,4.5e-05,-0.00035,-0.000377,-0.00023,2.4e-05,-0.000105,0.000336,0.000586,0.000207,-0.000154,0.00017,-0.000333,9.1e-05,4e-05,-0.000547,-0.000592,0.00052,0.000186,8e-06,1e-04,-0.000208,0.000155,0.000329,-0.000135,-0.000348,2e-05,0.000422,0.000194,0.000139,6.1e-05,0.000103,-0.000241,-0.000247,-0.000189,0.000237,0.000338,0.000575,9e-06,-9.2e-05,-3.7e-05,-0.000429,-0.000122,-6.3e-05,9.9e-05,0.000122,0.000534,0.000142,-0.000183,0.00041,0.000701,0.000325,-6.6e-05,0.000124,-0.000446,9.3e-05,-0.000131,-0.000129,-0.000126,-7.6e-05,0.000204,-2e-04,0.000319,-0.000571,-0.000286,-0.000154,2e-06,0.000239,-0.000256,-4e-06,1e-04,0.000117,-0.000201,8.1e-05,-0.000395,2.4e-05,-0.00042,0.000156,-0.000101,0.000109,-0.000194,1.5e-05,-1.5e-05,0.000102,3.9e-05,-0.000603,-8e-05,-0.00035,5e-06,2.8e-05,-0.000259,5.8e-05,-0.000385,4e-05,6.7e-05,-0.000694,-3.9e-05,-0.000427,4e-05,-7.5e-05,-0.000244,0.000355,7.1e-05,-0.000227,1e-04,-0.000233,-0.000132,0.000254,-8.7e-05,-0.000194,0.000109,-0.000175,0.000178,-0.000435,-0.000162,-0.000184,0.000228,0.000263,0.000538,0.000229
0.000243,-0.000529,-0.000155,0.000128,4.4e-05,0.000212,-0.000104,-0.000235,-0.00041,-0.000291,-7.2e-05,6.9e-05,-0.000133,0.000293,1e-05,-0.000346,0.000513,0.000151,-0.000287,-0.000269,0.000506,-0.000221,0.000305,-0.000106,-0.000268,8.5e-05,7.7e-05,-9.6e-05,-0.000271,3.4e-05,0.00023,-1.1e-05,-0.000145,0.000201,0.000343,0.000528,-7.8e-05,-0.000431,-0.000539,-4.1e-05,-4.9e-05,0.000258,0.00043,0.000169,-0.000197,0,-0.000187,-0.000415,2.9e-05,0.000269,-1.9e-05,-0.000378,-4.5e-05,6.2e-05,9.8e-05,0.000591,6.3e-05,6.9e-05,-8.1e-05,0.000123,-1.1e-05,-0.000278,7.3e-05,0.000107,0.000319,0.000256,0.000165,-9.5e-05,-0.000168,0.000625,0.000253,-8.9e-05,1e-06,0.000229,-9.3e-05,0.000293,-0.00013,0.00035,4.1e-05,-8.1e-05,-3.7e-05,6.8e-05,-0.000136,5.7e-05,-0.000245,-9.7e-05,0.000323,-1.4e-05,0.000176,0.000187,-0.000226,0.000283,0.000105,0.000362,0.000216,5e-06,0.00053,1.6e-05,0.000228,-0.000116,-5.1e-05,0.000157,-0.000112,-1.1e-05,0.000174,4.9e-05,5.6e-05,0.000143,-0.00018,5.2e-05,0.000385,-7.1e-05,-3.9e-05,-0.000184,0.000337,0.000196,-7.4e-05,-0.000151,4.3e-05,-0.000235,-0.000389
-0.000218,2.9e-05,0.000144,4.8e-05,0.000144,-0.000222,8.2e-05,0.000277,0.000455,0.000121,-9e-06,-0.000163,-0.000125,-0.000158,0.000114,0.000185,-0.000492,-7.2e-05,0.000306,0.000136,-0.000747,5.5e-05,-0.000262,-0.000254,-0.000245,-3.2e-05,5.9e-05,9.5e-05,0.000169,-6e-05,-0.000424,-0.000105,0.000169,-0.000115,-6.9e-05,-0.000424,-0.000162,0.000286,0.000104,0.000111,8e-06,-0.000451,-0.00015,-0.000179,4.4e-05,-0.000253,-0.000128,0.000177,3e-05,-0.000338,-0.000301,0.000186,-7.5e-05,-9.8e-05,-0.000128,-0.000462,-0.000112,-0.000128,4e-06,-2.6e-05,0.000116,0.000197,-7.6e-05,-0.000328,-6.4e-05,-0.000324,-0.000103,0.000135,5.1e-05,-0.000538,-0.000218,2.6e-05,-8.8e-05,8.1e-05,5.6e-05,-0.000151,0.000154,2.1e-05,-5.8e-05,0.000383,-0.000137,4.6e-05,-1.9e-05,-0.00013,5.8e-05,0.000182,1.2e-05,4.4e-05,-0.000158,-5.4e-05,5.1e-05,-0.000141,-0.000219,-0.000306,-4.2e-05,1e-04,-0.000133,1.1e-05,-9.6e-05,-4e-06,3.5e-05,6.2e-05,0,-0.000118,-9e-06,-5.4e-05,-3.8e-05,-0.000157,0.000127,-3e-05,-0.00044,-4.2e-05,2.8e-05,8.2e-05,-0.000111,-0.000189,0.000431,-5e-05,2.1e-05,-4.1e-05,0.000413
1.3e-05,-9.4e-05,-5.4e-05,-0.000185,-9.1e-05,0.000174,-5.6e-05,-5.3e-05,-8.6e-05,-0.000212,4.5e-05,0.000138,0.000296,9.8e-05,-9.5e-05,-2.2e-05,0.000472,0.000156,-0.000331,-8e-06,0.000514,-8e-06,0.000297,0.000346,0.000298,-6.2e-05,-7.5e-05,5.4e-05,0.00016,-0.000126,0.000579,0.000301,-8.1e-05,0.000309,-6.9e-05,0.000318,0.000184,-0.000274,3e-06,2.4e-05,0.000128,0.000242,5.9e-05,0.000111,5.1e-05,8.9e-05,0.000131,-1.3e-05,-0.000215,0.000102,7e-05,1.3e-05,0.000185,0.000127,4.1e-05,0.000212,7.9e-05,0.000245,0.000123,0.000117,1e-05,-0.000357,-0.000146,0.000444,-2.6e-05,0.000287,9.1e-05,3e-05,1.7e-05,0.000342,-2.4e-05,0.00011,8.9e-05,-0.000198,-0.000144,-4e-05,-0.000158,-0.000238,-0.000118,-0.000307,0.000122,2.1e-05,8.7e-05,8.5e-05,0.000153,-9.1e-05,3e-05,-9e-05,4.9e-05,-0.000106,0.000119,-2.8e-05,0.000132,0.000187,-7.4e-05,-5e-05,1.9e-05,0.000119,0.000159,0.000168,0.000164,-0.000231,5.5e-05,5.6e-05,-2.6e-05,0.000201,7.8e-05,0.000269,-0.000102,-5.8e-05,0.000299,-8e-06,-0.000135,-6.4e-05,6.1e-05,9e-05,-0.000206,0.000132,-2e-05,9.4e-05,-0.000238
2.1e-05,8.9e-05,1.3e-05,0.000193,2.8e-05,-0.000214,-3.9e-05,5e-06,-0.00014,0.00029,-9.5e-05,-9.7e-05,-0.000212,-2.2e-05,-6e-05,-2.4e-05,-0.000273,-8e-05,0.000245,6.6e-05,-0.000336,-3e-05,-0.000296,-0.000119,-0.000356,3.3e-05,5.3e-05,-9.4e-05,-0.000291,-3.3e-05,-0.00042,-0.000351,2.6e-05,-0.000307,-2e-06,-0.000294,-0.00018,0.000238,0.000261,6e-06,-9e-05,-0.000112,4.6e-05,-0.000181,5e-06,0.000167,-0.000134,-6e-06,0.000234,2e-06,-4.7e-05,-0.000129,-8.5e-05,-0.000157,-1.5e-05,-4e-06,-1.4e-05,2.3e-05,-8.2e-05,-0.000111,-8.9e-05,0.000191,0.000109,-0.000375,7e-06,-0.000428,-7.1e-05,-0.000353,5e-06,-0.000174,-2.2e-05,-0.000149,-0.000141,7.5e-05,0.000323,0.000156,0.000237,0.000229,0.000125,0.000127,8.4e-05,-5.4e-05,-0.000109,-3e-06,-4.9e-05,0.00012,1.2e-05,-1.5e-05,-1.8e-05,0.000145,-0.000156,-7.7e-05,-2.3e-05,7e-06,5.5e-05,-0.00013,-1e-05,-0.000285,-9.1e-05,-0.000184,-0.000148,0.000283,-5.9e-05,7.2e-05,-2e-06,-0.000151,2.2e-05,-0.000201,5.1e-05,9.7e-05,-0.000245,-4.2e-05,0.000155,0.000146,2.9e-05,2.2e-05,0.000103,-7.4e-05,-0.000261,-0.000105,0.000152
0.000129,-0.000155,4.2e-05,-5.7e-05,3.8e-05,4.2e-05,7.4e-05,1.8e-05,0.000127,-1e-04,4.2e-05,0.000164,0.000173,6e-05,-5e-05,2.1e-05,9.9e-05,0.000106,-0.000265,-9.5e-05,0.000251,5.9e-05,0.000136,-0.000112,0.00022,-0.000108,-4.2e-05,0.000126,0.000106,0.000224,0.000163,0.000332,-1.7e-05,8.5e-05,-4e-05,0.000326,3.8e-05,-7.9e-05,-0.000112,-8.6e-05,-1.2e-05,0.000126,-2.4e-05,4.9e-05,-3.1e-05,-8.9e-05,0.000198,0.000144,-5.9e-05,0.000107,0.00011,-3.3e-05,-2.9e-05,-8e-06,-6e-06,-4.8e-05,-6.7e-05,-0.000142,5.2e-05,-8.8e-05,-1e-06,-9.4e-05,0.000133,0.000146,-1.7e-05,0.000355,0.00011,0.000319,-1.5e-05,2e-06,-1.6e-05,2.1e-05,0.00016,0.000106,-0.000118,-6.5e-05,-0.000152,-0.000101,-6.3e-05,-5.4e-05,-0.000169,4.2e-05,0.000125,2.3e-05,-1.5e-05,2.4e-05,-4.1e-05,8.6e-05,-1.8e-05,-0.000305,4e-06,6.3e-05,-2.3e-05,-2e-05,-0.000143,-5.2e-05,-9.3e-05,0.000242,4.3e-05,8.7e-05,3.3e-05,-0.000158,-6.2e-05,-0.000189,8.8e-05,-4.8e-05,-5.3e-05,9.2e-05,6e-06,-7.6e-05,9.6e-05,1e-04,-6.1e-05,-7.4e-05,-6.6e-05,1.4e-05,-0.000114,-0.000153,0.000141,6.9e-05,-0.000159
-0.000121,0.000115,4e-06,-8.8e-05,-6.8e-05,3.8e-05,-7e-06,-2e-05,-4.1e-05,1.2e-05,6.3e-05,-8e-05,-7.8e-05,-5.8e-05,3.1e-05,-3e-06,7.8e-05,-7.4e-05,0.000338,5.8e-05,-2.8e-05,0.000142,-7e-05,9.1e-05,4.3e-05,0.000178,-3.8e-05,-0.000113,3.7e-05,-1e-04,-1.2e-05,-0.000256,-3.9e-05,5.6e-05,-5.3e-05,-0.000222,-3e-06,-2.9e-05,-6.9e-05,5.8e-05,-3.7e-05,-6.7e-05,-4.1e-05,3.8e-05,5.4e-05,-3.5e-05,-6.2e-05,-8.4e-05,-6.7e-05,-4.5e-05,2.9e-05,4.4e-05,-3.1e-05,0.000194,-1.1e-05,8e-06,7.2e-05,8.3e-05,-8.8e-05,0.000136,2.5e-05,7.7e-05,-0.000181,0.000157,0,-0.000197,-9.9e-05,-0.000129,-5.1e-05,-4.4e-05,9.1e-05,3.1e-05,-4.4e-05,-6.1e-05,2e-05,4.4e-05,1.6e-05,6.6e-05,-6e-06,4.4e-05,5e-06,-1.4e-05,-7e-05,-4e-05,-3e-06,-7.1e-05,6.5e-05,-4.5e-05,-3e-05,0.000288,9.2e-05,-8.4e-05,7.5e-05,0,0.000109,7.4e-05,1e-05,-8.8e-05,-0.000101,-3e-05,5.6e-05,0.000156,8.5e-05,0.000112,-1.6e-05,9.7e-05,-2.5e-05,-2.2e-05,7.7e-05,1.2e-05,-2e-05,-3.3e-05,5.4e-05,2.4e-05,-2.3e-05,-6.4e-05,8.4e-05,2e-05,-4.3e-05,1.1e-05,8.9e-05
3.6e-05,-3.1e-05,-8.1e-05,0.000114,6.5e-05,3.2e-05,-5.5e-05,-2.8e-05,8.1e-05,-6.9e-05,-6.7e-05,2.2e-05,-8e-06,1.4e-05,1.5e-05,1.8e-05,-0.000194,4.2e-05,-0.000137,3e-06,-0.00012,-0.000212,2.4e-05,-3e-06,2.3e-05,-4.3e-05,0.000121,0.000118,-7.3e-05,2.4e-05,-5.8e-05,0.000179,6.2e-05,-2.5e-05,0.000146,4.4e-05,1e-05,5.8e-05,5.8e-05,2e-06,4e-05,9.9e-05,2.7e-05,2.5e-05,0,2.7e-05,-6.9e-05,1e-05,8.3e-05,-1.1e-05,-4.6e-05,4.9e-05,1.7e-05,-0.000194,-2.8e-05,-8.6e-05,-1.9e-05,-5.7e-05,4.9e-05,-4.5e-05,-7e-06,-7.6e-05,6.6e-05,-7.7e-05,-8e-05,2.1e-05,5.4e-05,5e-05,3.3e-05,0.000104,-6.6e-05,-8e-05,-2e-06,2.1e-05,2.3e-05,-0.000105,-4.2e-05,-2.6e-05,3e-05,-9.2e-05,0.000121,-2.2e-05,2.6e-05,-1e-05,1e-05,-1.2e-05,-0.000145,6e-06,-6.8e-05,-0.000143,9e-06,8.6e-05,-2.2e-05,-2.2e-05,6e-06,-1.9e-05,-5.9e-05,-2.4e-05,4.9e-05,5e-06,-6e-05,-0.000219,-3.4e-05,-2.3e-05,-3.5e-05,-5.5e-05,1e-05,-2.7e-05,-5.2e-05,4.4e-05,1e-06,1.8e-05,-3.3e-05,-2.2e-05,2.6e-05,2.8e-05,-0.000116,9.6e-05,3e-05,-1.2e-05,6.4e-05
1e-06,6e-05,1.4e-05,-4.6e-05,-1e-05,-5.8e-05,4.2e-05,3.7e-05,-1.1e-05,-1.1e-05,-2e-06,8e-06,1.6e-05,-3e-06,-1e-05,8e-06,0.000132,-6.3e-05,4.3e-05,1.8e-05,4.5e-05,9.3e-05,1.6e-05,4e-06,-4.8e-05,1.1e-05,-0.000157,-0.000119,8e-05,5.7e-05,-2.6e-05,-7.8e-05,-8e-05,7.8e-05,-4.3e-05,-2.1e-05,2e-06,-4.2e-05,-2.3e-05,-5e-06,5.5e-05,-5.6e-05,-2.7e-05,-6.6e-05,-4e-05,9e-06,2.9e-05,-4.1e-05,-3.6e-05,3e-05,-8e-06,-5.7e-05,-3.2e-05,0.000122,2.3e-05,6.1e-05,-4.4e-05,6e-06,-7e-06,-3.2e-05,4e-06,4.4e-05,-3.1e-05,-1.4e-05,8.1e-05,6.9e-05,0,-7.9e-05,1.6e-05,-4.8e-05,5.2e-05,2.2e-05,-8e-06,-2.6e-05,-6.7e-05,7.5e-05,7.9e-05,3.9e-05,-1.8e-05,4.1e-05,-9.9e-05,2.4e-05,4.7e-05,2.6e-05,-5.2e-05,-1.4e-05,5.3e-05,-3e-06,7.8e-05,3.8e-05,-8.4e-05,-1.5e-05,3e-06,4e-05,5e-06,-4e-06,9.5e-05,5.2e-05,-8.6e-05,4.5e-05,2.6e-05,0.000147,-1e-06,3.4e-05,1.4e-05,-4.9e-05,1.2e-05,4.1e-05,2.1e-05,-2.6e-05,1.4e-05,-2.3e-05,-1.4e-05,1.8e-05,2.9e-05,-3.6e-05,8.5e-05,-2.7e-05,-4.1e-05,4.1e-05,-9.1e-05
-4e-06,-2.4e-05,-1.7e-05,5.5e-05,-3.1e-05,2.7e-05,-2e-05,-6e-06,-4.3e-05,6.4e-05,1.2e-05,-1.2e-05,2.6e-05,-3e-06,-4e-06,-4.5e-05,-3.7e-05,1.5e-05,-0.000149,-2.1e-05,-5.1e-05,-4.9e-05,-4e-06,-3.5e-05,5e-05,6.7e-05,0.000139,0.000126,-3.7e-05,-4.1e-05,0.000106,1.7e-05,6.9e-05,-7.8e-05,-5.9e-05,6.6e-05,-4e-06,-4e-05,3e-05,-3.5e-05,-2.5e-05,-4e-06,5.4e-05,8.7e-05,-1e-05,-6e-06,2.7e-05,-2.3e-05,3.4e-05,-1.4e-05,3.1e-05,-8.7e-05,2.8e-05,-7.1e-05,-8e-06,-5.2e-05,7e-05,5e-06,-2.4e-05,4.6e-05,4e-06,3e-06,2.8e-05,2e-05,-1.3e-05,-0.000107,2.7e-05,0.000104,-3.6e-05,5e-06,-1.8e-05,5e-05,1.1e-05,2.6e-05,3.9e-05,-5.7e-05,-4.4e-05,-2.6e-05,2e-06,-1.5e-05,5.6e-05,0,-1.9e-05,-4.1e-05,4e-05,5e-06,2.4e-05,0,-2.9e-05,4e-06,2.6e-05,-2.9e-05,2.6e-05,-6.8e-05,-6.5e-05,3e-06,-1.4e-05,-5.1e-05,4.1e-05,-3.4e-05,1.2e-05,-3.8e-05,2e-05,-2e-06,3.2e-05,8.4e-05,-1.5e-05,-4.2e-05,-4.4e-05,0,-2.6e-05,3.5e-05,1.3e-05,-1.5e-05,-3.9e-05,-5e-06,3.8e-05,3.7e-05,4.8e-05,-1.7e-05,3.2e-05
2.2e-05,-7e-06,1e-06,-9.1e-05,5e-05,-1.5e-05,-7e-06,2.2e-05,1.9e-05,0,5.5e-05,-1.7e-05,-3.3e-05,-3e-06,1.2e-05,1.7e-05,2e-05,1.2e-05,0.000121,9e-06,0.000104,5.2e-05,-3e-06,7e-06,-1.6e-05,-8.3e-05,-0.000115,-0.000115,1.3e-05,-2.3e-05,-9.3e-05,-9e-06,-2.5e-05,4.7e-05,5.8e-05,-4.4e-05,1.4e-05,6.7e-05,-2.9e-05,4e-06,3e-06,5e-06,1.3e-05,-2.7e-05,6.5e-05,-2.4e-05,-5.6e-05,3.7e-05,2e-05,-3.4e-05,4e-06,4.5e-05,1.7e-05,6.8e-05,-1e-05,5.2e-05,-5.2e-05,-4e-06,3.9e-05,-5.8e-05,-2e-06,1.5e-05,-2.7e-05,1.8e-05,-2.2e-05,9.8e-05,-6e-06,-5.1e-05,-1.3e-05,-6e-06,1.4e-05,-2e-05,-1e-06,7e-06,-3.8e-05,2.4e-05,2.4e-05,-2.6e-05,-3e-06,5.5e-05,-3.5e-05,-1e-06,-1.5e-05,3.7e-05,-2.1e-05,-2e-06,-4.7e-05,6e-06,3.7e-05,-4.7e-05,-9e-06,5.3e-05,-2.1e-05,4.9e-05,1.6e-05,1.3e-05,3e-06,3.5e-05,-1.5e-05,9e-06,-1e-06,-1.9e-05,-5e-05,-2.7e-05,-3.7e-05,-2.5e-05,1e-05,2.5e-05,1.7e-05,1e-05,4.1e-05,-2.8e-05,-2.6e-05,-6e-06,1.3e-05,3.1e-05,-2.2e-05,-7e-06,-1.9e-05,-3.5e-05,2.5e-05
-1.9e-05,-5e-06,1e-06,7.5e-05,-2.4e-05,3.2e-05,1.1e-05,-3e-06,-2.4e-05,-6.2e-05,-3.2e-05,9e-06,2.4e-05,1.7e-05,6e-06,1.3e-05,-6.4e-05,-1.7e-05,-5.1e-05,-1.1e-05,-8.5e-05,-3.4e-05,2e-06,2e-06,-4e-06,2.8e-05,6.9e-05,7.8e-05,-8e-06,3e-05,6.3e-05,1.8e-05,-3e-06,-3.8e-05,-8e-06,6e-06,1.3e-05,-6.6e-05,5e-06,8e-06,-2.9e-05,-1.4e-05,-4e-05,-9e-06,-3.3e-05,0,4.5e-05,1.2e-05,-3.7e-05,2.5e-05,-1.1e-05,1.4e-05,-1e-05,-7.9e-05,3e-06,-3.1e-05,9e-06,7e-06,-2.5e-05,2.4e-05,-4e-06,-2.4e-05,6.7e-05,-3.7e-05,4e-06,-6.4e-05,2.5e-05,-2e-06,1.7e-05,-2e-05,-2.2e-05,1.5e-05,7e-06,-2.2e-05,2.8e-05,7e-06,-2.2e-05,3e-05,8e-06,-9.6e-05,2e-05,-1.8e-05,1.7e-05,-1.2e-05,3.6e-05,-8e-06,-3e-06,0,-2.5e-05,3.4e-05,1.2e-05,-6e-06,4e-06,-3.2e-05,-4e-06,-1e-06,8e-06,-2.6e-05,3.1e-05,8e-06,1.1e-05,8e-06,2.7e-05,1.2e-05,-7e-06,-4.7e-05,-7e-06,-1.8e-05,-2e-05,-2e-06,-3.6e-05,-2e-06,4.3e-05,1.6e-05,-2.2e-05,-3.4e-05,-5.5e-05,2e-05,5.5e-05,2.9e-05,-5.1e-05
0,1.8e-05,-8e-06,-1.1e-05,7e-06,-1.5e-05,-1.4e-05,-1e-06,1.1e-05,1.5e-05,-1.4e-05,2.4e-05,6e-06,-5e-06,5e-06,-2.2e-05,6.6e-05,1.9e-05,8.1e-05,4e-06,4.6e-05,3.8e-05,4e-06,3.2e-05,-2.5e-05,-8e-06,-3.2e-05,-3.3e-05,1.2e-05,-6e-06,-5e-05,-2.7e-05,2.8e-05,1.9e-05,-1.5e-05,5e-05,-8e-06,3.9e-05,3.1e-05,-5e-06,1.3e-05,2e-06,1.6e-05,-5e-06,1.8e-05,3.2e-05,-1.5e-05,-2.3e-05,-3e-06,-2.1e-05,-1.4e-05,-4e-06,1e-06,4.4e-05,1.3e-05,-1e-06,-3e-06,-3e-06,1.5e-05,1.8e-05,-1e-06,0,-4.9e-05,1.8e-05,-1.6e-05,1.9e-05,-5e-05,9e-06,9e-06,1.7e-05,7e-06,-2e-06,-3e-06,2.5e-05,-7e-06,-1.4e-05,7e-06,-8e-06,-8e-06,8.7e-05,-2.1e-05,2e-05,-1.1e-05,-1.2e-05,-2.5e-05,1e-06,2.4e-05,-1.2e-05,1.2e-05,1.7e-05,-1.7e-05,-1.6e-05,6e-06,1.4e-05,1.2e-05,3e-06,-1.9e-05,3.1e-05,-4e-06,-1.5e-05,-2.3e-05,-7e-06,1e-06,-2e-06,1.3e-05,2.9e-05,3e-06,1.3e-05,1.1e-05,5e-06,3.2e-05,-5e-06,-3.1e-05,-3e-06,1.2e-05,2.4e-05,3.6e-05,-2.6e-05,-2.3e-05,-2.1e-05,4.8e-05
-2e-06,-3e-05,2.8e-05,-2.9e-05,8e-06,1e-05,1.1e-05,-6e-06,2.6e-05,1.2e-05,2e-06,-2.3e-05,-3.5e-05,-1.9e-05,1e-06,6e-06,-3.1e-05,-4e-06,-7.6e-05,-4e-06,-5.3e-05,-3e-05,-1.5e-05,-4.1e-05,0,-5e-06,2.6e-05,1.9e-05,-1.1e-05,-2.6e-05,3.5e-05,2.3e-05,-3.1e-05,1.1e-05,2.7e-05,-6.9e-05,-9e-06,-6e-06,-1.3e-05,4e-06,1e-05,5e-06,-1.1e-05,1.6e-05,-2.1e-05,-1e-05,8e-06,3e-05,1.5e-05,2.5e-05,2e-06,1.7e-05,-8e-06,-1.9e-05,0,8e-06,1.2e-05,-1e-06,-1e-05,-2.1e-05,5e-06,-1e-05,3e-06,-5e-06,2.2e-05,4e-06,5.9e-05,6e-06,-1.1e-05,1.8e-05,-2.3e-05,-2.3e-05,5e-06,-3.7e-05,1.3e-05,1.8e-05,-3e-06,-2e-06,4e-06,-4.9e-05,2.5e-05,-1e-06,4e-06,1.6e-05,1e-05,1e-06,-1.7e-05,2e-05,1e-05,-7e-06,1.6e-05,-3e-06,-8e-06,-5e-06,2e-05,4e-06,2e-06,-1.3e-05,-6e-06,1.3e-05,4e-06,-1e-06,3e-06,1e-05,1e-06,5e-06,2e-06,-1.5e-05,-5e-06,-9e-06,-2.8e-05,3e-06,1.9e-05,-3e-06,-2e-05,-7e-06,2e-06,-1e-06,1e-05,-6e-06,-4.8e-05
1e-05,-2e-06,-2.5e-05,1.9e-05,-9e-06,-2.1e-05,-6e-06,1e-06,-3.4e-05,3e-06,2e-05,1.7e-05,3.9e-05,3.1e-05,-6e-06,3e-06,-5e-06,5e-06,2.9e-05,4e-06,5e-05,1.8e-05,-2e-06,5e-06,3.1e-05,-3e-06,-1.8e-05,-1.6e-05,1.7e-05,2.1e-05,-4.1e-05,4e-06,2.9e-05,0,-8e-06,4.7e-05,6e-06,-4e-06,-2e-05,-5e-06,-3e-06,2e-06,1e-06,-1.5e-05,2.9e-05,-2.4e-05,6e-06,-4.6e-05,2e-06,-1.5e-05,9e-06,-1.7e-05,6e-06,1.9e-05,-4e-06,-1.8e-05,-2.3e-05,-1.5e-05,-2e-06,1.4e-05,0,1.3e-05,8e-06,-2.5e-05,-1.9e-05,-1.2e-05,-3.6e-05,-8e-06,-3e-06,-5e-06,7e-06,2.7e-05,-4e-06,1.8e-05,-1.6e-05,-2.9e-05,-2e-06,1.4e-05,5e-06,1.6e-05,-2.7e-05,-1.3e-05,0,-1e-06,-1.4e-05,5e-06,8e-06,-8e-06,-2.1e-05,-7e-06,1.6e-05,2e-06,1e-06,-3e-06,-1.9e-05,-2e-06,-2e-06,-1.9e-05,3e-06,-7e-06,6e-06,8e-06,-2e-06,-2.2e-05,-8e-06,-1.5e-05,-1.4e-05,1.6e-05,-4e-06,6e-06,1.6e-05,0,1e-06,-8e-06,2.3e-05,-7e-06,-1e-05,-1.6e-05,-3.2e-05,7e-06,4.2e-05
0,1e-06,1.8e-05,-9e-06,1.6e-05,1.2e-05,5e-06,-1e-06,1.7e-05,7e-06,-9e-06,-1.1e-05,-4e-05,-3.4e-05,-2e-06,4e-06,1.4e-05,-1.6e-05,-4.4e-05,-5e-06,-8e-06,-2.1e-05,2.3e-05,2e-05,-1.1e-05,1.2e-05,1.7e-05,2.9e-05,-1.6e-05,2e-05,5.1e-05,-1.3e-05,-1.8e-05,-2e-06,-2e-05,-2.3e-05,-8e-06,1.7e-05,8e-06,4e-06,8e-06,-1e-06,1.6e-05,-4e-06,-1.4e-05,1.1e-05,-1.1e-05,3e-05,-5e-06,1.3e-05,1.1e-05,3e-06,1e-05,-2.4e-05,0,1.7e-05,1.8e-05,1.5e-05,4e-06,-1e-06,-5e-06,-7e-06,4e-06,2e-06,1.3e-05,-5e-06,2.9e-05,-1.7e-05,9e-06,-1.8e-05,4e-06,-1.6e-05,2e-06,1.5e-05,-4e-06,2.8e-05,6e-06,-1e-05,-7e-06,-8e-06,2e-05,9e-06,-1e-06,-4e-06,1e-05,-1e-06,-2e-06,0,1.4e-05,-1.1e-05,-1.4e-05,-1.3e-05,1e-06,4e-06,-1.7e-05,-5e-06,2.3e-05,2.8e-05,3e-06,0,-6e-06,-1.3e-05,-1e-05,9e-06,0,1.6e-05,1.1e-05,-9e-06,8e-06,-1e-06,-5e-06,1e-06,-1.2e-05,1.4e-05,-2e-06,1.4e-05,8e-06,1e-05,1.7e-05,-1e-05,-1.5e-05
-9e-06,6e-06,-1.7e-05,7e-06,-1.2e-05,8e-06,3e-06,4e-06,-1.1e-05,-3.1e-05,-1.2e-05,1e-05,2.7e-05,1.8e-05,-3e-06,1e-06,-1.2e-05,7e-06,6.7e-05,4e-06,-1e-05,1.6e-05,-2.7e-05,-7e-06,-6e-06,-9e-06,-1.8e-05,-1.3e-05,8e-06,-2.2e-05,-4.2e-05,2.6e-05,1e-06,-1.5e-05,1.7e-05,2.6e-05,-1e-06,-1.5e-05,1.1e-05,-4e-06,-8e-06,1.6e-05,-8e-06,8e-06,-8e-06,1.1e-05,-8e-06,-2.4e-05,1e-06,-1.2e-05,-1.4e-05,1.3e-05,1e-06,1.3e-05,-1e-06,-1.6e-05,2e-06,-8e-06,4e-06,-1.5e-05,3e-06,2e-06,-2.8e-05,-2e-06,3e-06,2.1e-05,-1.5e-05,3.2e-05,1e-06,1.6e-05,-2e-06,-3e-06,3e-06,-1.9e-05,-4e-06,-2.8e-05,-1e-06,2e-06,5e-06,1.1e-05,-1.2e-05,1e-05,3e-06,5e-06,-1.3e-05,-3e-06,6e-06,3e-06,-1.7e-05,1e-05,-2.2e-05,4e-06,-4e-06,-1.1e-05,5e-06,-4e-06,-1.5e-05,-1.7e-05,-1e-06,5e-06,1e-06,1.7e-05,4e-06,8e-06,8e-06,-7e-06,3e-06,-4e-06,-3e-06,-6e-06,0,-3e-06,1.4e-05,-1.2e-05,-1e-06,-1.4e-05,1.6e-05,-1.9e-05,-2e-06,6e-06,-1.2e-05
0,7e-06,1.8e-05,2e-06,8e-06,-1.9e-05,-6e-06,2e-06,-4e-06,1.2e-05,6e-06,-1.3e-05,-7e-06,-3e-06,5e-06,-9e-06,1.9e-05,0,-3.7e-05,-1e-06,-3e-06,-1.4e-05,2.4e-05,-1.1e-05,1.7e-05,-1e-06,1.8e-05,-1e-05,2e-06,-5e-06,4.2e-05,-3.2e-05,9e-06,9e-06,3e-06,-3.5e-05,-1e-06,4e-06,1e-06,-1e-06,-3e-06,-4e-06,2e-06,2e-06,2e-06,-1.2e-05,9e-06,3e-06,2e-06,2e-06,-5e-06,3e-06,-6e-06,2e-06,-1e-06,1.3e-05,-1.4e-05,9e-06,-9e-06,1.2e-05,2e-06,-5e-06,3.4e-05,1.2e-05,-1.1e-05,-3.5e-05,7e-06,-2e-05,-4e-06,-1.9e-05,4e-06,2e-05,-2e-06,7e-06,-3e-06,2e-05,4e-06,-3e-06,-1e-06,-1e-06,8e-06,-1.5e-05,-1e-06,-5e-06,8e-06,7e-06,3e-06,-1e-05,1.2e-05,-1e-06,1.3e-05,6e-06,0,2e-05,1.3e-05,4e-06,-5e-06,4e-06,4e-06,-4e-06,6e-06,-2.9e-05,8e-06,-7e-06,-8e-06,-7e-06,-8e-06,1.1e-05,-4e-06,5e-06,2e-06,0,-1.5e-05,1e-06,4e-06,1e-05,-2.4e-05,1.3e-05,5e-06,8e-06,1.7e-05
8e-06,0,-1.6e-05,-9e-06,2e-06,2.6e-05,-3e-06,-1e-06,1.6e-05,1.4e-05,4e-06,9e-06,0,3e-06,-1e-06,2e-06,-2.3e-05,-1e-06,2.1e-05,0,-6e-06,8e-06,-1.5e-05,7e-06,-6e-06,1.9e-05,-1.7e-05,2.5e-05,-3e-06,1.5e-05,-3.5e-05,3e-05,-1.8e-05,-1e-06,-1.3e-05,3.1e-05,1e-06,6e-06,-1.3e-05,6e-06,-1e-06,-1e-05,-4e-06,0,2.1e-05,-5e-06,-9e-06,6e-06,-5e-06,4e-06,7e-06,0,-4e-06,-4e-06,2e-06,-9e-06,1.3e-05,-2e-06,5e-06,6e-06,-3e-06,4e-06,-2e-06,-1.8e-05,6e-06,3.5e-05,-1.2e-05,5e-06,-2e-06,2.3e-05,7e-06,-2.3e-05,2e-06,-1.6e-05,-3e-06,-4e-06,-5e-06,3e-06,0,-9e-06,-1e-05,1e-06,-1e-06,4e-06,5e-06,-2e-06,-1.3e-05,6e-06,-1.1e-05,1.4e-05,6e-06,0,2e-06,-2.3e-05,3e-06,0,4e-06,1e-05,-2e-06,1e-06,-6e-06,3.7e-05,-6e-06,5e-06,2e-06,8e-06,1e-06,-1.4e-05,6e-06,-4e-06,-2e-06,4e-06,1.3e-05,2e-06,-1.3e-05,-6e-06,-6e-06,-1e-06,-1.6e-05,-1e-05,-4e-06
-2e-06,-3e-06,1.8e-05,5e-06,-8e-06,-2.5e-05,6e-06,-2e-06,-1.4e-05,2e-06,-1e-06,-6e-06,-2e-06,-7e-06,0,5e-06,2e-05,7e-06,-4.1e-05,-1e-06,2.1e-05,-5e-06,3e-06,1e-06,-1.1e-05,-2.2e-05,1.4e-05,-2.7e-05,1e-06,-9e-06,1.2e-05,-2e-05,1.7e-05,1e-05,1.1e-05,-1.3e-05,2e-06,-2e-05,1e-06,-2e-06,3e-06,-1e-06,-3e-06,-1.3e-05,-2.7e-05,5e-06,8e-06,5e-06,5e-06,-9e-06,5e-06,-7e-06,-2e-06,-5e-06,-1e-06,0,-8e-06,2e-06,-2e-06,-1.3e-05,1e-06,2e-06,-1.2e-05,-7e-06,-1e-06,-2.5e-05,1.6e-05,-3e-06,0,-1e-05,-1e-06,9e-06,-1e-06,2.2e-05,1.6e-05,-3e-06,0,0,-1e-06,7e-06,9e-06,9e-06,3e-06,-5e-06,0,-2e-06,1.6e-05,-2e-06,4e-06,-8e-06,-7e-06,-6e-06,-4e-06,1.8e-05,0,-3e-06,-6e-06,-1.7e-05,0,0,0,-2.4e-05,9e-06,-9e-06,0,-6e-06,2e-06,1.2e-05,-3e-06,1e-06,1e-06,-1e-06,-1.1e-05,2e-06,9e-06,6e-06,1.8e-05,1.3e-05,3e-06,5e-06,-5e-06
-3e-06,3e-06,-1.4e-05,3e-06,9e-06,1.4e-05,-6e-06,0,8e-06,-2.2e-05,-3e-06,5e-06,3e-06,4e-06,-2e-06,-1.1e-05,-9e-06,-4e-06,3e-05,1e-06,-1.1e-05,1e-05,-1e-06,7e-06,1.1e-05,8e-06,-1e-05,2.1e-05,-1e-06,-9e-06,0,1e-05,-1.1e-05,-6e-06,1e-06,-1e-06,-1e-06,2.1e-05,1.1e-05,3e-06,6e-06,3e-06,7e-06,2.3e-05,1.4e-05,2e-06,5e-06,2e-06,-2e-06,1e-05,-2e-06,-4e-06,5e-06,1.2e-05,-2e-06,2e-06,4e-06,-4e-06,0,9e-06,1e-06,-1e-06,8e-06,3e-06,-3e-06,7e-06,-1.3e-05,1e-05,1e-06,1e-05,-3e-06,7e-06,1e-06,-8e-06,-2e-06,9e-06,-2e-06,-3e-06,1e-06,9e-06,-9e-06,-5e-06,-5e-06,3e-06,-1e-06,-1e-06,-1.3e-05,-3e-06,-2e-06,-1.6e-05,0,1.1e-05,-1e-06,-1e-05,-1.1e-05,1e-06,4e-06,1.2e-05,-4e-06,-2e-06,-3e-06,1.1e-05,-1e-05,1.1e-05,2e-06,2e-06,-3e-06,-6e-06,-3e-06,2e-06,0,-2e-06,7e-06,-4e-06,-2e-06,-1e-06,-1e-06,-3e-06,4e-06,-4e-06,8e-06
0,1e-06,7e-06,4e-06,-7e-06,-4e-06,4e-06,1e-06,-2e-06,1e-05,2e-06,-1e-06,-7e-06,4e-06,2e-06,2e-06,2e-06,3e-06,-1.2e-05,-2e-06,6e-06,-1e-05,8e-06,-1e-05,-4e-06,-1e-06,6e-06,-1.9e-05,-1e-06,1.3e-05,-5e-06,2e-06,5e-06,-2e-06,-1.4e-05,1e-06,1e-06,-1.1e-05,-2e-06,-2e-06,0,-6e-06,-4e-06,-1.7e-05,1e-06,1e-06,-5e-06,5e-06,-4e-06,-5e-06,-5e-06,-2e-06,1e-06,-1e-05,1e-06,-9e-06,-5e-06,-1e-06,1e-06,-3e-06,-1e-06,-3e-06,6e-06,6e-06,0,1.1e-05,1e-05,-1e-05,-2e-06,-2e-05,3e-06,-1.4e-05,-1e-06,-3e-06,-3e-06,-1.1e-05,6e-06,6e-06,-1e-06,-2.3e-05,8e-06,-4e-06,1e-06,0,-5e-06,0,6e-06,8e-06,3e-06,1.6e-05,7e-06,-1e-06,1e-06,5e-06,-5e-06,3e-06,6e-06,-1e-06,-1e-06,2e-06,0,-6e-06,-4e-06,-4e-06,-3e-06,9e-06,2e-06,1e-06,6e-06,-3e-06,-1e-06,-2e-06,2e-06,2e-06,6e-06,-5e-06,-1.2e-05,4e-06,7e-06,-5e-06,-1.2e-05
2e-06,-7e-06,-5e-06,-1.1e-05,2e-06,8e-06,0,-1e-06,-1e-05,-2e-06,0,-2e-06,2e-06,-1e-05,1e-06,7e-06,-4e-06,-6e-06,2.5e-05,0,-1.6e-05,8e-06,-6e-06,-1e-06,-3e-06,-1.3e-05,-2e-06,2.6e-05,2e-06,-1e-06,1e-06,-5e-06,3e-06,-4e-06,1.1e-05,1e-06,3e-06,-4e-06,-7e-06,0,-7e-06,1e-06,5e-06,7e-06,-1e-06,-6e-06,3e-06,-1.9e-05,4e-06,2e-06,-1e-06,1e-06,-1e-06,6e-06,1e-06,8e-06,7e-06,0,-5e-06,-8e-06,-1e-06,0,-1.8e-05,4e-06,5e-06,-2.3e-05,-4e-06,1e-06,-4e-06,1.4e-05,-6e-06,1.2e-05,0,3e-06,3e-06,9e-06,-5e-06,-5e-06,1e-06,2.6e-05,-4e-06,7e-06,2e-06,0,3e-06,2e-06,-2e-06,-2e-06,3e-06,-1e-05,1e-06,-7e-06,-2e-06,-2e-06,6e-06,-1e-06,3e-06,-1e-05,2e-06,-1e-06,5e-06,5e-06,9e-06,-2e-06,2e-06,-9e-06,-3e-06,1e-06,-1e-06,4e-06,0,3e-06,-9e-06,-1e-06,-4e-06,9e-06,8e-06,-6e-06,1e-06,5e-06,1.8e-05
1e-06,-1e-06,0,0,2e-06,-1e-05,0,0,1.4e-05,1.3e-05,-2e-06,1e-06,6e-06,1e-05,1e-06,-1e-06,1e-05,-1e-06,-2.6e-05,0,1.6e-05,-6e-06,-4e-06,7e-06,5e-06,1.4e-05,-2e-06,-2.8e-05,0,-1.1e-05,9e-06,7e-06,-7e-06,0,7e-06,4e-06,0,1.3e-05,-1e-06,1e-06,0,3e-06,1e-06,-1e-05,-4e-06,-5e-06,-1e-06,8e-06,-1e-06,2e-06,3e-06,5e-06,-1e-06,-9e-06,-1e-06,-8e-06,-7e-06,1e-06,5e-06,1.3e-05,1e-06,2e-06,6e-06,-1e-05,-5e-06,2.2e-05,-2e-06,5e-06,1e-06,-8e-06,-3e-06,-4e-06,0,-1e-05,-1.1e-05,-1e-05,4e-06,1e-06,-1e-06,-1.9e-05,3e-06,2e-06,-2e-06,1e-06,-3e-06,1e-06,-1e-06,-1e-06,-3e-06,1.2e-05,-9e-06,7e-06,0,-1e-06,1.3e-05,0,-1e-05,1.6e-05,-3e-06,-1e-06,-2e-06,-2e-06,-2e-06,1e-06,1e-06,-3e-06,2e-06,-3e-06,-2e-06,0,-1e-06,0,1.2e-05,1e-06,-1e-06,-1e-05,6e-06,5e-06,-4e-06,-3e-06,-1.6e-05
-1e-06,-1e-06,1e-06,1.3e-05,-5e-06,4e-06,-1e-06,1e-06,-9e-06,-7e-06,2e-06,-2e-06,-1.3e-05,-4e-06,0,-3e-06,-7e-06,4e-06,8e-06,1e-06,-2e-06,5e-06,9e-06,0,-3e-06,-5e-06,5e-06,2.7e-05,0,8e-06,-9e-06,-5e-06,1e-05,6e-06,-1.2e-05,-1.2e-05,-2e-06,-1.1e-05,8e-06,-2e-06,2e-06,2e-06,-9e-06,1.9e-05,-3e-06,8e-06,-5e-06,-5e-06,-3e-06,-5e-06,4e-06,-8e-06,0,1.3e-05,0,4e-06,6e-06,2e-06,-2e-06,-6e-06,0,1e-06,9e-06,6e-06,3e-06,-1.7e-05,5e-06,-3e-06,3e-06,8e-06,1e-06,-3e-06,-1e-06,1.5e-05,5e-06,8e-06,-6e-06,2e-06,1e-06,1.3e-05,-4e-06,-7e-06,1e-06,-2e-06,3e-06,0,4e-06,1e-06,6e-06,-3e-06,0,-5e-06,0,4e-06,-6e-06,1e-06,0,-1.2e-05,3e-06,2e-06,1e-06,-1e-06,-1e-06,-1e-06,-2e-06,8e-06,3e-06,1e-06,2e-06,0,1e-06,0,-1e-05,-2e-06,-4e-06,9e-06,-1.4e-05,-1e-05,-1e-06,0,7e-06
0,2e-06,-2e-06,-1e-05,5e-06,-2e-06,-1e-06,0,3e-06,-9e-06,1e-06,4e-06,1.9e-05,1e-06,-2e-06,-2e-06,-5e-06,-3e-06,-1.4e-05,0,1e-06,-5e-06,-7e-06,-6e-06,1e-06,0,-8e-06,-2e-05,-1e-06,6e-06,1e-06,6e-06,-8e-06,1e-06,5e-06,1.5e-05,0,4e-06,0,1e-06,2e-06,1e-06,5e-06,-1.9e-05,7e-06,1e-06,1e-06,5e-06,2e-06,5e-06,-3e-06,-3e-06,-2e-06,-1.1e-05,0,-3e-06,-5e-06,-3e-06,0,-4e-06,-1e-06,-1e-06,-9e-06,4e-06,0,7e-06,-7e-06,0,-1e-06,-1e-06,3e-06,8e-06,1e-06,-7e-06,1e-06,-6e-06,7e-06,-3e-06,-1e-06,-1.1e-05,4e-06,1e-06,0,1e-06,-3e-06,0,-9e-06,-3e-06,-6e-06,-6e-06,6e-06,-4e-06,-1e-06,-8e-06,-3e-06,-1e-06,3e-06,0,-1e-06,-2e-06,0,1e-06,2e-06,5e-06,1e-06,-3e-06,-5e-06,0,0,1e-06,0,-2e-06,6e-06,1e-06,1e-06,-5e-06,0,3e-06,-1e-06,6e-06,3e-06
-1e-06,2e-06,3e-06,-2e-06,-3e-06,2e-06,1e-06,0,5e-06,1e-06,-2e-06,-5e-06,-1.6e-05,-2e-06,0,1e-06,1.3e-05,6e-06,2.2e-05,0,-5e-06,5e-06,4e-06,2e-06,2e-06,5e-06,9e-06,1.3e-05,-1e-06,-1e-05,5e-06,-5e-06,4e-06,0,3e-06,-1.2e-05,-1e-06,4e-06,-5e-06,-1e-06,2e-06,0,0,8e-06,1e-06,-9e-06,2e-06,8e-06,0,-4e-06,-3e-06,5e-06,1e-06,7e-06,0,-2e-06,3e-06,2e-06,-1e-06,8e-06,0,-1e-06,2e-06,2e-06,-2e-06,-1e-06,5e-06,-1e-06,-1e-06,-2e-06,0,-9e-06,0,2e-06,4e-06,2e-06,-9e-06,2e-06,2e-06,1e-05,-4e-06,5e-06,-1e-06,0,7e-06,-1e-06,1e-05,2e-06,5e-06,-4e-06,-2e-06,4e-06,0,1e-05,-9e-06,-1e-06,-3e-06,1.2e-05,0,1e-06,-3e-06,0,-7e-06,-6e-06,1e-06,-2e-06,1e-06,1e-06,-3e-06,-1e-06,-2e-06,1e-06,-3e-06,0,1e-06,0,1.1e-05,-1e-06,6e-06,-1e-06,-4e-06
1e-06,1e-06,-2e-06,2e-06,0,-1e-06,1e-06,0,-1e-05,1.4e-05,-2e-06,3e-06,9e-06,6e-06,1e-06,2e-06,-1e-05,-2e-06,-8e-06,-1e-06,-1e-06,-4e-06,-1e-06,2e-06,-7e-06,-2e-06,-9e-06,-1.1e-05,-1e-06,1e-06,-7e-06,6e-06,1e-06,-5e-06,-1e-05,6e-06,0,-8e-06,-2e-06,0,-4e-06,-3e-06,-2e-06,0,-1.3e-05,1e-06,-1e-06,-9e-06,-1e-06,3e-06,1e-06,0,2e-06,-5e-06,1e-06,2e-06,-2e-06,-3e-06,1e-06,-6e-06,1e-06,0,9e-06,5e-06,3e-06,-3e-06,-5e-06,5e-06,2e-06,-2e-06,3e-06,5e-06,0,-5e-06,1e-06,3e-06,8e-06,-1e-06,-1e-06,-4e-06,4e-06,-4e-06,1e-06,0,-4e-06,0,-7e-06,-1e-06,-5e-06,9e-06,-6e-06,0,0,-1.1e-05,6e-06,1e-06,3e-06,-1.3e-05,1e-06,1e-06,0,-4e-06,2e-06,2e-06,-1e-06,6e-06,2e-06,-2e-06,3e-06,1e-06,3e-06,1e-06,0,-1e-06,1e-06,4e-06,-3e-06,1e-06,-2e-06,2e-06,2e-06
1e-06,-1e-06,3e-06,4e-06,1e-06,2e-06,-2e-06,0,1e-05,-6e-06,4e-06,-1e-06,-4e-06,-8e-06,1e-06,-4e-06,3e-06,-1e-06,6e-06,0,4e-06,4e-06,-1e-06,1e-06,3e-06,-2e-06,9e-06,7e-06,1e-06,8e-06,7e-06,-6e-06,-5e-06,0,8e-06,-3e-06,0,8e-06,5e-06,1e-06,1e-06,0,5e-06,4e-06,1.2e-05,5e-06,4e-06,6e-06,2e-06,0,2e-06,2e-06,0,8e-06,1e-06,-5e-06,1e-06,2e-06,0,0,-1e-06,1e-06,-7e-06,2e-06,-4e-06,1e-06,6e-06,-5e-06,1e-06,0,1e-06,1e-06,0,1e-06,1e-06,-6e-06,-6e-06,0,1e-06,-6e-06,-4e-06,-4e-06,0,0,-1e-06,-1e-06,3e-06,0,2e-06,-4e-06,5e-06,-3e-06,0,1e-05,3e-06,0,4e-06,7e-06,0,-1e-06,1e-06,6e-06,6e-06,1e-06,0,-2e-06,-1e-06,3e-06,-1e-06,-1e-06,-4e-06,0,4e-06,0,1e-06,-7e-06,-7e-06,-2e-06,-1e-06,2e-06,-1e-06
-1e-06,3e-06,-4e-06,-1e-06,-3e-06,-4e-06,2e-06,0,-3e-06,-3e-06,1e-06,2e-06,-1e-06,4e-06,0,-1e-06,-1e-06,0,-1.7e-05,1e-06,0,-4e-06,1e-06,-2e-06,2e-06,3e-06,-9e-06,-4e-06,0,-7e-06,-5e-06,5e-06,7e-06,1e-06,4e-06,5e-06,0,-4e-06,1e-06,-1e-06,-1e-06,-1e-06,-3e-06,-8e-06,-2e-06,-2e-06,-1e-06,-6e-06,0,-2e-06,0,1e-06,0,-1e-05,-1e-06,5e-06,0,-1e-06,0,7e-06,0,0,-3e-06,-5e-06,2e-06,3e-06,-6e-06,2e-06,-1e-06,4e-06,0,-5e-06,-1e-06,8e-06,-4e-06,5e-06,6e-06,0,0,9e-06,2e-06,6e-06,-1e-06,0,-2e-06,0,2e-06,4e-06,-1e-06,9e-06,5e-06,3e-06,0,-6e-06,8e-06,0,-4e-06,0,0,1e-06,1e-06,-7e-06,-2e-06,0,1e-06,-3e-06,1e-06,-4e-06,-2e-06,-1e-06,4e-06,-1e-06,-7e-06,0,-2e-06,7e-06,7e-06,6e-06,-5e-06,-3e-06,0
-1e-06,-1e-06,4e-06,-4e-06,2e-06,2e-06,0,0,-3e-06,-5e-06,-3e-06,-3e-06,1e-06,1e-06,0,4e-06,4e-06,-5e-06,1e-05,1e-06,0,3e-06,0,-1e-06,-4e-06,-2e-06,9e-06,-3e-06,1e-06,-4e-06,4e-06,-4e-06,-8e-06,2e-06,-1.1e-05,-6e-06,1e-06,0,-4e-06,1e-06,0,-2e-06,-2e-06,1e-06,-2e-06,-4e-06,0,0,-2e-06,3e-06,-1e-06,-2e-06,-1e-06,7e-06,0,-5e-06,0,2e-06,-1e-06,-7e-06,0,-1e-06,9e-06,-2e-06,0,-7e-06,8e-06,0,-1e-06,-3e-06,-1e-06,4e-06,1e-06,-6e-06,-1e-06,-5e-06,-6e-06,-1e-06,0,-5e-06,0,1e-06,0,0,2e-06,1e-06,-4e-06,-2e-06,-1e-06,-1.2e-05,-4e-06,1e-06,0,3e-06,-1e-05,0,-4e-06,-5e-06,1e-06,-1e-06,1e-06,3e-06,0,1e-06,0,3e-06,-1e-06,1e-06,2e-06,1e-06,-4e-06,-1e-06,9e-06,-1e-06,0,-6e-06,0,-4e-06,5e-06,1e-06,4e-06
1e-06,-2e-06,-3e-06,2e-06,-2e-06,3e-06,-2e-06,0,7e-06,6e-06,-1e-06,1e-06,1e-06,-3e-06,0,-1e-06,-6e-06,4e-06,-2e-06,0,-4e-06,-3e-06,0,2e-06,3e-06,-3e-06,-9e-06,9e-06,0,9e-06,-6e-06,1e-06,5e-06,2e-06,4e-06,3e-06,0,6e-06,-1e-06,0,3e-06,2e-06,1e-06,1e-05,-1e-06,-1e-06,-1e-06,0,1e-06,-4e-06,-1e-06,0,-2e-06,-4e-06,0,2e-06,1e-06,-1e-06,1e-06,1e-06,0,0,-7e-06,9e-06,-1e-06,8e-06,-1.1e-05,0,0,4e-06,-1e-06,-2e-06,-1e-06,1e-06,0,4e-06,6e-06,2e-06,0,-2e-06,1e-06,-6e-06,1e-06,-1e-06,-1e-06,0,4e-06,-1e-06,1e-06,5e-06,-4e-06,-2e-06,0,-1e-06,-2e-06,0,3e-06,7e-06,0,0,0,-2e-06,-1e-06,-3e-06,-1e-06,-1e-06,-1e-06,1e-06,0,-1e-06,3e-06,1e-06,-8e-06,0,-3e-06,5e-06,-7e-06,4e-06,1e-06,-1e-06,-9e-06
0,-3e-06,3e-06,2e-06,1e-06,-4e-06,2e-06,0,-8e-06,6e-06,3e-06,1e-06,-1e-06,1e-06,0,-2e-06,2e-06,-2e-06,1.2e-05,0,3e-06,3e-06,-1e-06,0,3e-06,6e-06,9e-06,-1.1e-05,-1e-06,-1e-06,8e-06,2e-06,-4e-06,-1e-06,4e-06,2e-06,0,-1e-05,4e-06,0,-1e-06,2e-06,-1e-06,-1.1e-05,2e-06,3e-06,0,0,1e-06,3e-06,1e-06,1e-06,1e-06,4e-06,0,-2e-06,-3e-06,0,0,5e-06,0,0,-1e-06,-1e-06,2e-06,-6e-06,1.1e-05,-1e-06,1e-06,-5e-06,-2e-06,0,0,-4e-06,0,-2e-06,-6e-06,-2e-06,0,3e-06,-2e-06,3e-06,0,0,0,1e-06,-4e-06,1e-06,-1e-06,-9e-06,3e-06,1e-06,0,-1e-06,-4e-06,0,1e-06,-5e-06,0,1e-06,-1e-06,3e-06,-2e-06,2e-06,1e-06,-1e-06,2e-06,-2e-06,-2e-06,1e-06,-1e-06,1e-06,3e-06,1e-06,3e-06,-3e-06,3e-06,-1e-06,3e-06,-2e-06,8e-06
-1e-06,0,-2e-06,1e-06,0,6e-06,0,0,5e-06,-5e-06,1e-06,-1e-06,-1e-06,1e-06,0,0,3e-06,2e-06,-1.4e-05,0,-1e-06,-2e-06,1e-06,-1e-06,-3e-06,-5e-06,-1e-05,1.3e-05,-1e-06,-6e-06,-1e-05,-4e-06,0,-2e-06,-8e-06,-6e-06,0,8e-06,0,0,0,-1e-06,2e-06,5e-06,2e-06,2e-06,-2e-06,1e-06,-1e-06,-1e-06,1e-06,1e-06,2e-06,-7e-06,0,-2e-06,5e-06,-1e-06,-1e-06,-6e-06,0,0,6e-06,-7e-06,-1e-06,0,-1.1e-05,0,0,4e-06,-1e-06,2e-06,0,3e-06,2e-06,1e-06,6e-06,1e-06,0,2e-06,2e-06,4e-06,0,0,2e-06,1e-06,2e-06,-1e-06,2e-06,1.3e-05,1e-06,2e-06,0,3e-06,1e-05,0,-1e-06,2e-06,0,-1e-06,0,-3e-06,4e-06,-1e-06,1e-06,2e-06,-2e-06,2e-06,2e-06,0,-1e-06,0,1e-06,-1e-06,1e-06,-1e-06,7e-06,-1e-06,-5e-06,1e-06,-3e-06
0,0,1e-06,-3e-06,-1e-06,-8e-06,-1e-06,0,1e-06,-7e-06,-3e-06,1e-06,6e-06,1e-06,1e-06,3e-06,-5e-06,2e-06,2e-06,0,2e-06,3e-06,1e-06,0,1e-06,1e-06,1.1e-05,-1.6e-05,0,7e-06,1.1e-05,6e-06,3e-06,-1e-06,5e-06,6e-06,0,-1e-06,-3e-06,0,-2e-06,1e-06,1e-06,-5e-06,-2e-06,-6e-06,2e-06,7e-06,0,-1e-06,0,-1e-06,0,8e-06,0,2e-06,-4e-06,0,0,2e-06,0,0,-2e-06,-2e-06,0,6e-06,1.2e-05,1e-06,-1e-06,-4e-06,1e-06,-2e-06,0,4e-06,0,1e-06,-5e-06,0,0,-1e-06,-1e-06,-5e-06,0,0,0,0,0,0,-2e-06,-5e-06,-4e-06,-2e-06,0,-6e-06,1e-06,0,3e-06,1e-06,0,0,-1e-06,1e-06,2e-06,-1e-06,-2e-06,-1e-06,0,-1e-06,-1e-06,0,3e-06,-1e-06,-5e-06,0,0,4e-06,-8e-06,-1e-06,1e-06,-1e-06,-1e-06
0,2e-06,-2e-06,-1e-06,1e-06,7e-06,1e-06,0,-6e-06,2e-06,0,-1e-06,-1.1e-05,-6e-06,-1e-06,-1e-06,3e-06,-4e-06,-6e-06,0,-2e-06,-3e-06,-1e-06,0,1e-06,5e-06,-1.1e-05,1.7e-05,0,2e-06,-1e-05,-7e-06,-4e-06,2e-06,4e-06,-3e-06,0,-7e-06,0,0,0,0,-1e-06,1.2e-05,-8e-06,-1e-06,-1e-06,-1e-05,0,2e-06,-1e-06,-1e-06,-1e-06,-5e-06,0,-4e-06,3e-06,1e-06,-1e-06,4e-06,0,0,-4e-06,0,0,-1.2e-05,-1.1e-05,-2e-06,0,5e-06,2e-06,2e-06,0,-3e-06,0,-4e-06,5e-06,-1e-06,-1e-06,-7e-06,1e-06,-2e-06,0,0,0,0,-2e-06,1e-06,3e-06,4e-06,0,-2e-06,0,8e-06,2e-06,0,0,-4e-06,0,0,1e-06,1e-06,-3e-06,1e-06,1e-06,-1e-06,2e-06,0,-1e-06,1e-06,-4e-06,1e-06,6e-06,0,0,-6e-06,-2e-06,3e-06,-1e-06,-1e-06,2e-06
