0.561893,0.429266,0.365797,0.383176,0.372752,0.385847,0.347819,0.234524,0.15036,0.118538,0.127131,0.50071,0.882377,0.606549,0.460681,0.587974,0.541644,0.632877,0.629425,0.459287,0.347304,0.449257,0.742807,0.59968,0.259861,0.267421,0.459689,0.543404
0.666895,0.535265,0.459356,0.470226,0.453585,0.475113,0.427995,0.284842,0.181735,0.143128,0.150547,0.563269,0.98147,0.679414,0.532534,0.680532,0.62497,0.71729,0.707305,0.528191,0.411809,0.540314,0.891854,0.712346,0.304147,0.3214,0.554513,0.649771
0.845007,0.734457,0.63097,0.617656,0.58211,0.614316,0.554893,0.362401,0.228846,0.178155,0.185237,0.641962,1.09206,0.76627,0.633635,0.808484,0.744945,0.834414,0.810964,0.629712,0.511708,0.68166,1.126131,0.886861,0.366846,0.402648,0.700399,0.808757
0.965298,0.922414,0.798623,0.734429,0.652852,0.683085,0.62463,0.397369,0.244758,0.186688,0.198836,0.651067,1.077519,0.777833,0.688634,0.865956,0.805428,0.902853,0.87468,0.702936,0.582713,0.76032,1.254885,0.978861,0.39108,0.446617,0.784292,0.898071
1.0236,1.062458,0.962326,0.857268,0.691964,0.710587,0.661917,0.387505,0.222233,0.172824,0.208485,0.690929,1.115781,0.82564,0.747682,0.90253,0.835421,0.961682,0.96249,0.814401,0.666961,0.781725,1.282849,1.008257,0.410248,0.490175,0.84289,0.95593
1.186562,1.273321,1.200231,1.06278,0.795111,0.801444,0.737121,0.380268,0.203598,0.177798,0.263574,0.92971,1.509045,1.113784,0.918888,1.069711,0.980352,1.131184,1.186321,1.065634,0.838048,0.853549,1.416379,1.165337,0.542321,0.637722,1.024272,1.156443
1.644296,1.765074,1.638257,1.423989,1.051005,1.041406,0.929193,0.447703,0.239811,0.233311,0.379302,1.356653,2.240231,1.653603,1.278113,1.469866,1.312745,1.480311,1.614634,1.506698,1.154385,1.089438,1.821905,1.564674,0.817498,0.940438,1.467604,1.631563
2.302863,2.499263,2.220869,1.87087,1.426198,1.429808,1.281153,0.616147,0.325949,0.321884,0.513777,1.806463,3.020934,2.250281,1.767254,2.063835,1.815595,2.003997,2.152666,2.033737,1.598628,1.500118,2.518533,2.209344,1.208382,1.378741,2.161805,2.337982
2.854505,3.171226,2.701896,2.202478,1.770363,1.853881,1.704618,0.837886,0.430973,0.41197,0.623951,2.109168,3.511322,2.633844,2.221877,2.654861,2.304438,2.497204,2.577779,2.459084,2.030811,1.919044,3.21128,2.864244,1.613807,1.800081,2.822874,3.006326
2.982294,3.474278,2.915596,2.346619,1.961346,2.098059,1.989201,1.032212,0.511789,0.460415,0.679839,2.19267,3.53092,2.647424,2.491803,3.01677,2.522956,2.630911,2.650744,2.581063,2.220015,2.079464,3.42684,3.121973,1.828592,1.98048,3.082193,3.305177
2.640811,3.135516,2.872041,2.523545,2.049839,2.036269,1.975522,1.118765,0.526635,0.433343,0.672743,2.093472,3.185404,2.369704,2.42106,2.932478,2.346588,2.321686,2.327644,2.335259,2.100186,1.941677,3.14973,2.913437,1.716942,1.77866,2.720649,3.014893
2.210918,2.396536,2.544826,2.599286,2.023474,1.716334,1.701777,1.076857,0.46863,0.355863,0.621835,1.870507,2.662274,1.905682,2.035502,2.540772,1.950925,1.809046,1.853552,1.932498,1.808132,1.747312,2.943307,2.634013,1.358194,1.312253,1.964038,2.312261
2.003578,1.967106,2.077324,2.280131,1.870436,1.486451,1.486005,1.005728,0.40267,0.304023,0.572395,1.72162,2.350076,1.545951,1.678784,2.303908,1.747973,1.488369,1.589306,1.661436,1.517806,1.711767,3.098422,2.572456,1.069875,0.923912,1.332383,1.701161
2.033801,1.993961,1.710524,1.779823,1.685389,1.445543,1.450776,0.96608,0.367849,0.287458,0.51806,1.677644,2.319465,1.404637,1.501756,2.210487,1.667656,1.369954,1.64681,1.842865,1.587012,1.73526,3.033084,2.421886,0.934325,0.760518,1.067726,1.439999
2.413568,2.231319,1.644586,1.592924,1.545354,1.360379,1.434629,0.975309,0.391257,0.327809,0.536942,1.730688,2.410009,1.390971,1.505226,2.259622,1.709684,1.44235,1.908464,2.269449,1.926329,1.745994,2.668387,2.152203,0.830167,0.700565,1.128904,1.525917
3.469407,3.010544,2.135924,1.871726,1.566695,1.32836,1.464377,1.063107,0.528369,0.479582,0.722975,2.081391,2.852396,1.644512,1.78667,2.709833,2.1463,1.877828,2.591682,3.156419,2.697776,2.120919,3.019238,2.61855,1.010464,0.897313,1.640794,2.108248
5.224632,4.546774,3.248811,2.76223,2.151069,1.653835,1.666876,1.265857,0.784633,0.725063,1.094221,3.033991,4.052555,2.289848,2.453321,3.779034,2.982702,2.496701,3.732225,4.664111,3.898635,3.071855,4.630534,4.15876,1.558652,1.345778,2.566145,3.259163
6.899105,6.113306,4.659257,4.166055,3.160381,2.239528,2.117527,1.640325,1.114838,1.021067,1.552785,4.253855,5.645376,3.160736,3.316647,5.079953,3.807096,3.050224,5.131655,6.339129,4.953366,4.204116,6.826097,6.111975,2.229945,1.881981,3.767022,4.872894
7.492935,6.806143,5.834663,5.63408,4.078452,2.700699,2.505451,1.951415,1.367207,1.260482,1.966677,5.263928,7.021313,3.998457,3.969554,5.963101,4.279008,3.343638,6.218047,7.304189,5.127611,4.921423,8.602095,7.561025,2.744259,2.439162,5.033771,6.438741
6.616293,6.160449,6.177402,6.500673,4.478784,2.831595,2.597475,1.997869,1.417026,1.33811,2.114946,5.669747,7.881851,4.726308,4.322008,6.399795,4.431495,3.225751,6.398284,6.982941,4.243297,4.82771,8.893296,7.584692,2.862408,2.906292,6.013185,7.229024
4.919927,4.560383,5.369759,6.129153,4.118096,2.620071,2.386801,1.795052,1.275471,1.197431,1.862273,5.073218,7.516342,4.902479,4.507855,6.564102,4.246934,2.725276,5.679597,5.832813,3.13184,4.083574,7.483911,6.193111,2.584218,3.021809,6.025631,6.563149
3.306399,3.072015,3.913711,4.643155,3.151617,2.070708,1.881556,1.453805,1.054887,0.920178,1.360407,3.769244,5.86069,4.14681,4.216027,6.05568,3.644558,2.08817,4.615292,4.757152,2.510915,3.175119,5.609237,4.607661,2.102014,2.606478,4.893693,4.884137
2.208019,2.063632,2.59966,3.099954,2.079316,1.320687,1.308072,1.135695,0.840069,0.701582,0.951198,2.514431,3.825382,2.745776,3.15824,4.520889,2.613141,1.479278,3.402894,3.646649,2.101337,2.312381,3.892074,3.368701,1.57347,1.758664,3.348917,3.675716
1.530268,1.345936,1.588745,1.964249,1.260974,0.707163,0.961061,0.968127,0.658924,0.578862,0.852986,1.788943,2.220698,1.386277,1.886992,2.857375,1.705358,1.060535,2.288534,2.624087,1.834955,1.891772,2.729636,2.255688,0.992441,0.96459,2.087063,3.012477
1.068822,0.864304,1.021527,1.378392,0.853491,0.440148,0.825348,0.882086,0.560804,0.517255,0.835835,1.577895,1.613262,0.746978,1.196817,2.045716,1.285796,0.876078,1.870236,2.183389,1.588977,1.668165,2.079958,1.473277,0.650196,0.543321,1.218391,2.344023
0.83485,0.602959,0.743675,1.048831,0.640225,0.336372,0.67604,0.719615,0.448085,0.412608,0.721488,1.488085,1.496624,0.612016,0.774905,1.337675,0.883809,0.730707,1.609011,1.884386,1.290175,1.411745,1.775508,1.147544,0.504936,0.461786,1.022078,1.892134
0.799014,0.635851,0.563345,0.674185,0.451249,0.278983,0.491253,0.483694,0.293322,0.291182,0.538462,1.339879,1.490036,0.622609,0.464586,0.736128,0.520394,0.629389,1.367619,1.597367,1.081506,1.257234,1.770989,1.12625,0.401996,0.46171,1.090289,1.601689
0.852611,0.774437,0.452733,0.360289,0.294395,0.22495,0.350306,0.324231,0.206554,0.249225,0.417538,1.202083,1.549324,0.735388,0.368505,0.50403,0.36314,0.523981,1.068356,1.308697,1.007841,1.163361,1.725963,1.118869,0.350498,0.475633,1.129464,1.431973
0.948417,0.862603,0.425178,0.240965,0.211076,0.201573,0.345523,0.31881,0.191435,0.223692,0.34246,1.062825,1.581671,0.889175,0.379452,0.443775,0.33119,0.416525,0.786289,1.059365,0.92263,1.035651,1.538957,1.0601,0.418657,0.516513,1.03527,1.243722
0.996402,0.819707,0.419469,0.258105,0.198124,0.189799,0.385484,0.350238,0.173547,0.179911,0.281424,0.945448,1.543062,0.98061,0.417558,0.426839,0.315019,0.318659,0.590026,0.89045,0.80267,0.848127,1.205992,0.90058,0.527543,0.555784,0.801467,0.9066
0.919871,0.669742,0.402781,0.355866,0.255356,0.187207,0.38252,0.355832,0.152402,0.129779,0.225717,0.769078,1.310523,0.915067,0.40899,0.381573,0.274711,0.279317,0.632969,0.916643,0.700414,0.636035,0.825274,0.705223,0.613484,0.559387,0.566597,0.623722
0.781956,0.519645,0.400371,0.484825,0.329632,0.184479,0.326831,0.306655,0.129287,0.090714,0.187941,0.562582,0.940547,0.711002,0.347783,0.322404,0.228867,0.267382,0.728693,0.942651,0.577867,0.470155,0.63904,0.63663,0.62844,0.506501,0.383943,0.459785
0.581207,0.370361,0.415568,0.578037,0.363654,0.165941,0.242245,0.216559,0.104641,0.077172,0.168586,0.413456,0.688462,0.539774,0.296852,0.302611,0.206081,0.272964,0.798342,0.94988,0.482484,0.450134,0.698265,0.642943,0.560125,0.42844,0.300384,0.359611
0.427483,0.286728,0.40893,0.578663,0.336351,0.135185,0.169594,0.132544,0.074602,0.075788,0.172759,0.338419,0.532213,0.440551,0.268426,0.270372,0.172234,0.26382,0.80863,0.952559,0.475673,0.545039,0.834381,0.643397,0.445539,0.338431,0.297613,0.308778
0.424341,0.298697,0.382173,0.487896,0.275259,0.123507,0.1532,0.098549,0.053833,0.070813,0.173713,0.332522,0.434812,0.348567,0.23501,0.223791,0.154022,0.275385,0.800687,0.905116,0.489078,0.662718,0.982949,0.656689,0.341444,0.288995,0.301345,0.250521
0.438521,0.306754,0.344377,0.364587,0.20967,0.12846,0.15564,0.089772,0.051287,0.065723,0.160839,0.353266,0.447191,0.298074,0.172503,0.160751,0.133659,0.271385,0.777039,0.890898,0.513609,0.741194,1.060431,0.663562,0.273331,0.271709,0.303086,0.201809
0.447678,0.319987,0.351007,0.321872,0.165423,0.11856,0.153975,0.092688,0.050012,0.06692,0.164526,0.415605,0.557333,0.30353,0.110277,0.10134,0.106032,0.250363,0.715939,0.82983,0.492104,0.725021,0.988661,0.625709,0.2571,0.247097,0.299931,0.208878
0.469953,0.379488,0.434024,0.385375,0.159002,0.09116,0.142689,0.10449,0.054131,0.077033,0.174765,0.501349,0.704384,0.353821,0.094158,0.084774,0.084946,0.216311,0.626318,0.726069,0.413487,0.609163,0.790306,0.504464,0.264253,0.229037,0.264996,0.217641
0.508807,0.469557,0.549387,0.451719,0.158893,0.069695,0.122367,0.116298,0.063306,0.087115,0.182139,0.552311,0.788904,0.391436,0.110105,0.089898,0.072164,0.199097,0.598793,0.730051,0.373393,0.520106,0.652361,0.426771,0.265746,0.198483,0.202018,0.19703
0.579362,0.560485,0.647159,0.484712,0.160514,0.058867,0.095695,0.116617,0.06549,0.088603,0.21761,0.59255,0.768974,0.385519,0.125139,0.096484,0.061005,0.212057,0.615865,0.715485,0.398906,0.602743,0.823043,0.536382,0.24837,0.178048,0.166469,0.172388
