3e-06,1e-06,5e-06,6e-06,2e-06,5e-06,9e-06,6e-06,3e-06,9e-06,5e-06,5e-06,4e-06,1.5e-05,2e-06,3e-06,5e-06,1.8e-05,1e-05,6e-06,5.3e-05,0.000446,6.6e-05,7.6e-05,4e-05,9.6e-05,3.3e-05,9e-06,4.2e-05,3.8e-05,0.000107,3.6e-05,7e-05,0.000142,0.001268,0.001278,0.000364,0.000241,0.000867,0.000669,7.3e-05,0.000244,0.000171,0.00052,0.000433,6.1e-05,0.000398,5e-05,7e-05,0.000268,9.8e-05,0.000298,0.00016,2.8e-05,0.000136,6.6e-05,6.2e-05,0.000174,4.5e-05,8.7e-05,3.8e-05,6e-06,0.000119,8.3e-05,1.3e-05,4.9e-05,6.2e-05,2.5e-05,6.1e-05,6.1e-05,6.3e-05,6.8e-05,1.6e-05,0.000106,6.2e-05,3.9e-05,8.1e-05,8e-06,5e-05,8.5e-05,2.3e-05,2.2e-05,5.2e-05,0.000163,4.7e-05,3.3e-05,0.000358,0.000665,9.7e-05,2.4e-05,1.2e-05,0.000126,0.000133,0.000236,0.000878,0.000184,7.1e-05,8e-05,0.000108,0.00017,0.000112,7.8e-05,4e-06,8e-06,5.8e-05,1e-05,3.9e-05,3e-05,7e-06,6.8e-05,2.6e-05,3.9e-05,4e-05,5.4e-05,1e-04,3e-06,1.8e-05,2.1e-05,6.1e-05,1.4e-05,5.5e-05
8e-06,7e-06,1.4e-05,3e-06,2.4e-05,2.4e-05,9e-06,2.5e-05,1.9e-05,2.8e-05,4e-06,1.8e-05,5e-06,3.2e-05,2e-05,2.4e-05,2e-05,2.8e-05,4.1e-05,2.8e-05,0.000109,0.000925,0.000297,0.000321,0.000139,0.000157,9.5e-05,1e-05,0.00012,4.6e-05,0.00045,0.000908,0.001541,0.001226,0.003622,0.004978,0.000634,0.00017,0.002246,0.001467,0.001023,7e-04,0.000408,0.001481,0.000849,0.000587,0.000929,0.000249,0.000467,0.000547,0.000403,0.000296,0.000567,0.000285,0.000241,0.000392,0.00036,0.000326,0.000343,0.000265,0.000428,0.000356,0.000285,0.000364,0.00032,0.000246,0.000232,0.000231,0.000277,3e-04,9.8e-05,0.000203,0.000227,0.000132,0.000273,0.000287,9.1e-05,0.000127,0.000243,0.000294,0.000278,0.000233,0.000188,0.000484,0.000145,0.000191,0.001054,0.00184,0.000301,0.000407,0.00018,0.000225,0.000576,0.000843,0.001922,0.001089,0.001008,0.000489,0.000195,0.000445,0.000628,0.000371,0.00035,0.000122,0.000112,0.000144,0.000135,0.000154,0.000154,0.000144,0.000197,0.000119,0.000147,0.000205,0.000144,0.000106,0.000193,0.000118,0.000137,9.8e-05,0.000121
1.4e-05,2.6e-05,2.6e-05,2.4e-05,2.7e-05,6e-06,1.8e-05,7e-06,1.9e-05,1.7e-05,2.6e-05,2.1e-05,1.1e-05,2.1e-05,1.1e-05,2.2e-05,7e-06,9.6e-05,0.000185,4.4e-05,8.7e-05,0.000924,0.000219,0.000394,0.000279,0.000237,0.000191,0.000126,7.1e-05,9.3e-05,0.000733,0.001489,0.001791,0.001244,0.004072,0.004003,0.004152,0.002213,0.001991,0.001189,0.000543,0.000168,0.000174,0.000935,0.001309,0.000865,0.001416,0.001479,0.000234,0.000413,0.000555,5.3e-05,0.000301,0.000268,0.000144,9.3e-05,0.000358,0.000261,0.000168,7.9e-05,0.000309,0.000202,0.000127,0.000121,0.000152,0.000125,0.000107,0.000197,8.2e-05,6.3e-05,5e-05,0.000147,5.8e-05,0.000103,0.000226,1.8e-05,0.000196,0.00014,0.000187,8.1e-05,7.5e-05,0.000123,2.3e-05,0.000392,0.000609,0.00034,0.00191,0.002086,0.001655,0.00065,0.000442,0.000655,0.001146,0.000982,0.003497,0.003398,0.001287,0.000261,0.000202,0.000313,0.000511,0.000855,0.000241,0.000177,3.8e-05,6.4e-05,0.000125,0.000105,8.1e-05,9.3e-05,0.000142,2.7e-05,6.1e-05,0.000156,0.000272,0.000254,6.3e-05,4.5e-05,0.000108,0.000102,5.1e-05
5.8e-05,5.1e-05,4.6e-05,4.5e-05,4e-05,4.2e-05,4.1e-05,3.9e-05,2.1e-05,3.7e-05,3.7e-05,3.3e-05,2.9e-05,2.7e-05,2.7e-05,2.1e-05,2.5e-05,0.000257,0.000227,0.000192,0.000155,0.001136,0.000359,0.000258,0.000148,0.000176,0.000263,0.000102,5.9e-05,4.7e-05,0.000868,0.001017,0.001741,0.000159,0.003566,0.00219,0.002261,0.000443,0.002796,0.001189,0.000577,0.000985,0.000656,0.000998,0.000586,0.000606,0.000947,0.000672,0.000666,0.000293,0.000217,0.000667,0.000273,0.000121,0.00025,0.000167,0.000447,8.1e-05,2.5e-05,6.7e-05,0.000277,0.000143,0.000154,0.000116,0.000154,6.9e-05,0.000164,6.7e-05,4.6e-05,2.4e-05,1.4e-05,7.4e-05,0.000128,0.000146,0.000142,9.3e-05,0.000301,0.000185,0.000159,0.000106,1.9e-05,0.000147,9e-05,0.000293,0.000666,0.00038,0.002326,0.003863,0.001879,0.000513,0.000246,0.000428,0.000847,0.000413,0.003029,0.002313,0.001291,0.000875,0.000919,0.000182,0.000993,0.001337,0.000845,0.00043,0.000224,0.000185,0.000103,0.000102,1e-04,0.000107,2.2e-05,5.2e-05,2.7e-05,0.000216,0.000414,0.000366,0.000319,0.000163,0.000192,8.8e-05,6.5e-05
4.5e-05,3e-06,2.2e-05,8e-06,1.7e-05,2.4e-05,1e-06,1.9e-05,1e-05,2.7e-05,1.1e-05,1.6e-05,1.4e-05,1.5e-05,5e-06,8e-06,1.6e-05,0.000443,5.1e-05,8.3e-05,3.9e-05,0.001066,0.000923,0.000498,0.000192,0.000211,0.000359,0.000206,0.000148,0.000138,0.000918,0.001062,0.001123,0.001184,0.002349,0.00171,0.002174,0.00147,0.002314,0.000684,0.000516,0.001801,0.002124,0.003843,0.00069,0.002178,0.001357,0.000769,0.000832,0.000688,0.000553,0.000232,0.000385,9.4e-05,0.000494,0.000317,0.000187,0.000285,0.000186,0.000252,0.000418,0.000136,1.4e-05,0.000106,0.00013,0.00012,0.000114,5.9e-05,0.000105,6.4e-05,1.9e-05,8e-05,1e-04,4e-05,5e-05,5.2e-05,0.000228,5.3e-05,4.8e-05,5.1e-05,0.000161,0.00021,2.6e-05,0.000261,0.000374,0.000175,0.002336,0.006084,0.001823,0.001013,0.000407,0.000147,0.000663,0.00048,0.001438,0.001047,8.1e-05,0.001559,0.000883,0.000513,0.000888,0.000378,0.000239,9.6e-05,0.000112,2e-05,7.5e-05,4.1e-05,2.3e-05,3.8e-05,1.4e-05,1.9e-05,3e-06,0.000168,0.000256,0.000134,4.9e-05,3.4e-05,0.000167,3.6e-05,4.8e-05
2.3e-05,1.1e-05,7e-06,1.5e-05,2e-06,7e-06,1e-05,2.1e-05,2.4e-05,8e-06,2.5e-05,3e-06,2.1e-05,1e-05,8e-06,1.5e-05,1.2e-05,0.000578,3e-04,1e-04,8.7e-05,0.000766,0.000356,0.000731,0.000194,0.000333,0.000219,0.00016,0.000314,0.000138,0.000786,0.002117,0.000984,0.00095,0.002192,0.002733,0.002537,0.001204,0.002643,0.003563,0.002413,0.000693,0.001786,0.003523,0.002832,0.002734,0.001575,0.001952,0.00095,0.000649,0.000304,0.000791,0.000213,0.000788,0.000473,0.000262,0.000331,0.000206,3.7e-05,0.000254,0.000386,7.5e-05,0.00014,7.2e-05,0.000121,0.000112,0.000195,6.9e-05,9.7e-05,5.5e-05,3e-05,9.9e-05,4.3e-05,4.9e-05,0.000144,0.000106,0.000339,0.000245,4.5e-05,3.1e-05,0.000173,7.3e-05,0.000104,0.000214,0.000253,0.00013,0.002242,0.004783,0.004217,0.001347,0.000906,0.000198,0.000439,0.000346,0.000136,0.000184,0.000491,0.00153,0.00051,0.000316,0.001088,0.000342,5.4e-05,9e-06,8.8e-05,0.000164,3.8e-05,5e-05,5.9e-05,1.8e-05,6e-06,3.9e-05,2.5e-05,0.000185,0.000104,5e-06,2.6e-05,2.7e-05,0.000148,6e-05,2.6e-05
1.3e-05,7e-06,2.5e-05,2.9e-05,8e-06,7e-06,2.3e-05,2.9e-05,1.2e-05,1.7e-05,1.9e-05,2.9e-05,1.3e-05,2.7e-05,2.1e-05,1e-05,2.1e-05,0.000575,0.000433,0.00021,0.00013,0.000681,0.001832,0.000786,0.000632,0.000717,0.000335,0.000121,3e-04,1.9e-05,0.000483,0.00175,0.00065,0.000407,0.00169,0.003133,0.002822,0.0018,0.002494,0.007509,0.00514,0.001986,0.002824,0.000294,0.000662,0.000526,0.002358,0.002153,0.002385,0.001211,0.000916,0.001775,0.001354,0.000418,0.000275,0.000219,0.000359,0.000347,0.000157,0.000208,0.000733,0.00022,9.5e-05,0.000134,0.000115,0.000198,0.000182,0.000131,0.000156,5.1e-05,6.7e-05,0.000161,2e-04,1.5e-05,0.000112,4e-05,0.000654,0.000249,2e-06,2.6e-05,0.000157,0.000261,0.000122,7e-05,0.000293,0.000321,0.001589,0.004613,0.004744,0.003351,0.00196,0.000253,0.000384,0.000652,0.000544,0.001476,0.000356,0.001767,0.000776,0.000536,0.001146,0.000508,0.000261,5.1e-05,5.4e-05,0.00017,0.000105,3.6e-05,6e-05,6.4e-05,1.8e-05,7.6e-05,1.2e-05,0.000195,7.9e-05,5e-05,5.6e-05,1.2e-05,2.8e-05,7.4e-05,4.2e-05
3.1e-05,5e-06,1.7e-05,2e-05,1.1e-05,1.4e-05,1.6e-05,2.1e-05,2.5e-05,1.3e-05,1.2e-05,2.5e-05,2.8e-05,2.3e-05,1.4e-05,2.5e-05,4.8e-05,0.000468,0.000662,0.00031,0.000187,0.000287,0.002981,0.000996,0.000709,0.000433,0.00176,0.001074,0.000473,0.000272,0.000322,0.002511,0.001876,0.001246,0.001414,0.002989,0.003665,5e-04,0.002485,0.007444,0.007935,0.005479,0.002682,0.00142,0.002317,0.002557,0.000912,0.000618,0.001995,0.002327,0.000769,0.002096,0.003418,0.002025,0.000716,0.000369,0.000388,0.000286,0.000277,0.000253,0.001104,0.000846,6e-04,0.000242,3.1e-05,0.000126,9e-05,7.2e-05,0.000216,9.3e-05,0.00015,5.5e-05,0.000199,0.000235,0.00012,0.000152,0.000862,0.000629,0.000335,0.000139,0.000125,0.000316,0.000247,3.7e-05,0.000391,0.000136,0.00088,0.002415,0.000941,0.000881,0.001624,0.001339,0.001805,0.001238,0.001413,0.003827,0.002155,0.002542,0.00136,0.000933,0.001102,0.001654,8e-04,0.000271,7.3e-05,0.000115,3.1e-05,2e-05,8.9e-05,4e-05,4e-05,8.1e-05,0.000105,0.000187,0.00045,0.000262,0.000123,5.6e-05,0.000124,4.6e-05,3.9e-05
4.7e-05,2.9e-05,1.6e-05,6.6e-05,4.9e-05,2.2e-05,1.2e-05,2.8e-05,2.8e-05,3.7e-05,1.3e-05,1.2e-05,3.5e-05,3e-05,4.2e-05,5.9e-05,2e-06,0.000279,0.000496,0.000286,0.000182,0.00048,0.003662,0.003545,0.002092,0.001299,0.002279,0.001966,0.000667,0.000565,0.000207,0.004586,0.003614,0.001782,0.001113,0.002753,0.005815,0.004929,0.00498,0.001211,0.001483,0.000426,0.001494,0.000197,0.002554,0.004187,0.003432,0.001129,0.001653,0.002041,0.002284,0.001646,0.002134,0.001337,0.000949,0.000423,0.000332,0.00019,0.000211,0.000114,0.001522,0.001091,0.000409,1.4e-05,8.7e-05,3.4e-05,8.8e-05,2.8e-05,0.000181,0.000113,2.8e-05,0.000128,0.000171,4.1e-05,6.9e-05,0.000198,0.000824,0.000499,0.000169,0.000117,0.000133,0.000244,0.000267,0.000265,0.000356,0.000193,0.000649,0.000605,0.000238,0.000553,0.00093,0.000677,0.002664,0.002125,0.000973,0.004073,0.002552,0.001205,0.001891,0.000475,0.000498,0.001107,0.000912,0.000471,7e-05,5.4e-05,7.5e-05,4.5e-05,0.000119,8e-05,6.8e-05,9.7e-05,7.7e-05,0.000201,0.000587,0.000345,0.000105,2.9e-05,0.000203,0.000137,9.3e-05
7.5e-05,5.8e-05,1.7e-05,7.3e-05,5.3e-05,1.6e-05,7e-06,1e-06,2.8e-05,3.2e-05,4.4e-05,3.8e-05,2.8e-05,3.4e-05,8.1e-05,2.1e-05,4.1e-05,0.000245,0.000752,0.000411,0.000185,0.00075,0.003438,0.003044,0.001577,0.001198,0.001241,0.000258,0.000526,0.000572,0.000896,0.00503,0.002711,0.000369,0.000611,0.002582,0.004605,0.002437,0.00264,0.002825,0.001392,0.001428,0.001929,0.000981,0.001484,0.001848,0.001292,0.000648,0.000924,0.000733,0.000999,0.000758,0.002282,0.001041,0.000825,0.000347,0.000266,0.000333,7.4e-05,0.000101,0.001449,0.000857,0.000437,0.000161,4.2e-05,5.6e-05,6.7e-05,0.000136,0.000193,4.2e-05,5.7e-05,0.000108,0.000125,0.000106,5.5e-05,4.7e-05,0.000607,0.000309,0.00012,0.00013,0.000129,0.000252,1e-05,0.000158,0.000443,0.00028,0.000741,0.000386,0.000637,0.000462,0.000619,0.000316,0.002676,0.001691,0.000873,0.002395,0.000991,0.001382,0.001438,0.000975,0.000206,0.001359,0.000505,4.3e-05,0.000155,0.000185,0.000181,0.00017,0.000208,0.000174,0.000122,5.6e-05,4.1e-05,0.000264,0.000504,0.000238,3.9e-05,3.8e-05,0.000135,0.000115,2e-05
2.1e-05,2e-05,2e-05,6e-05,4.1e-05,3.4e-05,1.4e-05,1.1e-05,1.4e-05,1.8e-05,2.1e-05,8e-06,6e-06,2.7e-05,4.7e-05,3.8e-05,5.9e-05,0.000257,0.00039,0.000185,5.2e-05,0.001034,0.002567,0.001055,0.000154,0.000266,0.000153,0.00048,0.000125,7.6e-05,0.001052,0.004558,0.002688,0.001336,6.8e-05,0.002664,0.000985,0.001296,0.00126,0.002551,0.001989,0.000554,0.000974,0.000247,0.000592,0.001479,0.001121,0.000786,0.000301,0.000174,0.000693,0.000575,0.001561,0.00096,0.000281,0.000283,3.8e-05,8.8e-05,7.2e-05,0.00016,0.001199,0.001228,0.000561,0.000171,2e-05,3.5e-05,6.1e-05,5.1e-05,0.000134,0.00012,1.9e-05,9.4e-05,9.2e-05,1.5e-05,6.3e-05,0.000109,0.000379,0.00015,5.9e-05,8e-05,5.6e-05,0.000124,0.000113,0.000211,0.000455,0.000239,0.000709,0.00112,0.000854,0.000121,0.000235,0.000391,0.002467,0.001235,0.002345,0.000695,0.000383,0.001049,0.000511,0.00023,0.000244,0.000716,0.000455,0.000115,3.5e-05,0.000282,0.000131,2.7e-05,8.6e-05,2.1e-05,2.1e-05,3.4e-05,2.8e-05,0.000207,8.2e-05,6.3e-05,8.6e-05,5.4e-05,0.000193,9.7e-05,4.2e-05
1.7e-05,8e-06,7e-06,2.8e-05,6e-06,1.9e-05,8e-06,1.3e-05,1.8e-05,2.3e-05,1.5e-05,2.2e-05,8e-06,7e-06,4.1e-05,8e-06,3.9e-05,0.000295,0.000176,0.000109,6.3e-05,0.001274,0.001879,0.000154,0.00047,0.000625,0.000559,7.8e-05,0.000219,9.1e-05,0.001426,0.002334,0.000795,0.000476,0.001095,0.001684,0.001838,0.000753,0.000909,0.001625,0.000668,0.001508,0.001011,0.000366,0.001082,0.000415,0.000571,0.000373,0.000265,7.6e-05,0.000215,0.000728,0.000744,0.000553,0.000297,0.000156,0.000142,0.000197,8e-05,0.000126,0.000838,0.000594,0.000252,8.4e-05,1e-05,3.2e-05,5.2e-05,4e-05,0.00012,8.4e-05,3.5e-05,0.000152,9e-05,8.1e-05,5e-05,0.000103,0.00011,8.6e-05,7.5e-05,6.3e-05,8.2e-05,7.9e-05,4.2e-05,0.000177,0.000259,0.000153,0.000899,0.000824,0.000361,0.000582,0.000651,0.000247,0.001254,0.000391,0.002797,0.001495,0.000595,0.000569,0.000227,0.000353,0.000458,0.000622,0.000306,1e-04,5.4e-05,0.000229,0.00014,7.1e-05,5.8e-05,5.7e-05,2.7e-05,2.7e-05,2.5e-05,0.000125,0.000164,8.9e-05,2.8e-05,1.2e-05,3e-04,0.000143,5e-05
1.5e-05,5e-06,1.3e-05,1.8e-05,1.7e-05,1.6e-05,9e-06,7e-06,3e-06,4e-06,1.1e-05,1.2e-05,8e-06,9e-06,1.6e-05,2.4e-05,2.7e-05,0.000345,0.000273,8.1e-05,3.5e-05,0.001506,0.000584,0.001221,0.00037,0.000697,0.000238,0.000114,5.4e-05,3.2e-05,0.00173,0.000842,0.000232,0.000245,0.001746,0.001458,0.001926,0.000522,0.002,0.001403,0.000545,0.001977,0.000822,0.000768,0.002118,0.000332,0.00035,0.000327,0.000208,0.000308,0.000158,0.000605,0.000297,0.000196,0.000188,0.000117,5.3e-05,0.000146,6.7e-05,8.4e-05,0.000513,7.9e-05,0.000106,0.000113,6.7e-05,6e-06,3.3e-05,4.2e-05,9.6e-05,7.5e-05,3.5e-05,0.000213,4.5e-05,4.6e-05,4e-05,6.2e-05,8.4e-05,4.1e-05,5.9e-05,1.6e-05,5.3e-05,2.2e-05,9e-06,0.00018,2.8e-05,4.1e-05,0.000916,0.000438,0.000518,0.000467,0.000294,2.1e-05,0.000396,0.000137,0.00233,0.00092,0.000363,0.000535,9.1e-05,0.000379,0.000374,0.000322,7.4e-05,1.1e-05,3.8e-05,0.00018,0.000102,7.3e-05,8e-06,1.4e-05,5e-05,2.8e-05,2e-05,9.6e-05,0.000132,6.9e-05,4.3e-05,3.2e-05,0.000267,7.6e-05,3.2e-05
1.1e-05,8e-06,1.4e-05,1.8e-05,1.6e-05,0,1e-06,9e-06,5e-06,1e-06,8e-06,7e-06,5e-06,1.1e-05,2e-06,5e-06,1.4e-05,0.000457,0.000268,0.000172,8.1e-05,0.001719,0.002251,0.000453,0.000255,0.000772,0.00042,0.00012,7.9e-05,5.8e-05,0.0018,0.001662,0.000564,0.000415,0.00188,0.001668,0.000661,0.001934,0.003104,0.000701,0.000815,0.001828,0.002765,0.00263,0.00057,0.002348,0.001504,0.000688,0.000731,0.000159,0.000799,0.000839,0.000264,0.000327,0.000248,0.000153,0.000107,0.000247,5.9e-05,5.6e-05,0.000431,0.000281,0.000104,0.000101,3.9e-05,2e-05,4.8e-05,6.1e-05,0.000123,0.000132,1.4e-05,0.000227,0.00017,2.6e-05,5e-06,6.8e-05,8.3e-05,0.000102,3e-05,1.6e-05,5.2e-05,4.9e-05,8e-06,0.000187,0.000192,6.9e-05,0.000554,0.000342,0.000119,0.000329,0.000208,0.000122,0.000716,0.000315,0.001618,0.001062,0.000402,0.000272,7.3e-05,0.00031,0.000333,0.000166,7.3e-05,9e-06,4.2e-05,0.000132,7.6e-05,1.1e-05,2.2e-05,4.4e-05,3.9e-05,1.4e-05,2.1e-05,0.000105,7.5e-05,3.9e-05,4.1e-05,6.3e-05,0.000113,0.000109,4.8e-05
1.5e-05,4e-06,1.1e-05,2.2e-05,1.1e-05,3e-06,3e-06,1.2e-05,4e-06,2e-06,6e-06,8e-06,6e-06,1e-05,1.4e-05,8e-06,7e-06,0.000564,0.000274,0.00013,8.6e-05,0.001921,0.002615,0.001886,0.000482,0.000639,0.000172,0.000203,5.1e-05,0.000107,0.00171,0.002229,0.001703,0.001007,0.002738,0.003389,0.002164,0.000424,0.005295,0.002947,0.001652,0.002544,0.001958,0.003028,0.00117,0.003423,0.001606,0.001735,0.001146,0.001654,0.001391,0.001983,0.000521,0.001102,0.000197,0.00013,0.000225,0.000211,0.000144,8.2e-05,0.000224,0.000382,9.6e-05,0.000117,0.000182,3e-05,5.6e-05,0.000161,0.000259,0.000198,4e-05,0.000144,0.000148,6.6e-05,7.1e-05,0.000146,4.5e-05,4.2e-05,5.8e-05,0.000128,5.9e-05,8.2e-05,7.2e-05,0.00013,0.000198,0.000108,0.00036,0.000563,0.000415,0.000231,6.8e-05,5.5e-05,0.000626,0.000402,0.001583,0.0024,0.001226,0.000531,0.000131,0.000223,7.2e-05,0.000198,0.000182,5e-05,4.3e-05,5.9e-05,9.8e-05,4.9e-05,4.9e-05,2.2e-05,2.3e-05,3e-05,3.8e-05,6.5e-05,0.000175,8.6e-05,2.4e-05,4.8e-05,0.000198,0.000111,5.7e-05
8e-06,8e-06,1.8e-05,2.1e-05,1.6e-05,4e-06,6e-06,7e-06,8e-06,4e-06,6e-06,1.2e-05,5e-06,1.1e-05,1.3e-05,2e-05,1.9e-05,0.000609,0.000308,7.6e-05,2.5e-05,0.001897,0.00207,0.00025,0.00044,0.000607,0.000182,6.4e-05,0.000118,8.5e-05,0.001645,0.002152,0.000432,0.000352,0.003334,0.000878,0.007096,0.004739,0.008078,0.007172,0.002722,0.006364,0.00125,0.005662,0.003812,0.00491,0.001766,0.0041,0.004381,0.000508,0.000589,0.002512,0.002376,0.001488,0.00037,0.00052,0.000202,0.000397,0.000553,0.000167,0.00024,0.000352,0.00035,9.7e-05,0.000166,7.7e-05,0.000123,0.000292,0.000303,0.000279,0.000179,0.000308,4.6e-05,0.000249,0.000162,0.000165,9.8e-05,0.000224,9.4e-05,0.000227,7.6e-05,0.000114,0.000137,0.000203,0.000139,9.4e-05,0.00079,0.000553,0.000767,0.000259,0.000133,7.4e-05,0.001344,0.000766,0.000992,0.002348,0.00153,0.000855,0.000408,0.000253,0.000436,0.000357,5.1e-05,1.1e-05,2.4e-05,0.000124,5.7e-05,3.1e-05,5.4e-05,3.3e-05,3.3e-05,8e-06,2.3e-05,0.000122,0.000263,0.000148,8.6e-05,5.5e-05,0.000461,0.000192,6.7e-05
5e-06,8e-06,1.3e-05,9e-06,1.4e-05,3e-06,1e-05,7e-06,1.2e-05,7e-06,4e-06,7e-06,1.1e-05,2e-06,9e-06,2e-06,2e-05,0.000609,0.000438,0.00027,8.9e-05,0.001719,0.001929,0.001752,0.001032,0.000364,0.000522,0.00023,0.000149,0.00011,0.001507,0.000378,0.000889,0.000752,0.002166,0.004301,0.0092,0.004127,0.007326,0.002458,0.004002,0.009408,0.010984,0.010813,0.012646,0.005292,0.004103,0.00517,0.004458,0.003612,0.002122,0.001499,0.003393,0.001967,0.001964,0.001102,0.000211,0.000293,0.000727,0.000524,0.000265,0.000671,0.000766,0.000797,0.00052,0.000311,0.000393,0.000501,0.000808,0.000869,0.000789,0.000644,0.000506,0.000562,0.000212,0.000201,0.000338,0.000154,0.000164,0.000349,0.000352,9.5e-05,0.000129,8.3e-05,0.000148,0.000194,0.001199,0.001366,0.00041,0.000341,0.000296,0.000315,0.001543,0.000681,0.000968,0.001179,0.000561,0.000803,0.000289,0.00033,0.000612,0.000135,2.9e-05,7.8e-05,1.8e-05,0.000257,0.000144,6.9e-05,3.4e-05,3e-05,9.1e-05,9.3e-05,6.5e-05,0.000121,0.000235,0.000111,0.000113,4.2e-05,0.000723,0.00033,0.000137
2.1e-05,2e-05,2.9e-05,1.7e-05,1.4e-05,1.5e-05,1.6e-05,1e-05,1.3e-05,8e-06,1.3e-05,1.5e-05,7e-06,1.2e-05,1.6e-05,2.4e-05,5.2e-05,0.000535,0.000182,8.5e-05,0.000129,0.001515,0.000882,0.001975,0.000968,0.000695,0.001002,0.000498,0.000192,8.1e-05,0.001173,0.001595,0.000536,0.000307,0.00141,0.005938,0.004266,0.009727,0.003488,0.004644,0.005954,0.003637,0.007488,0.007662,0.003732,0.00656,0.006174,0.006582,0.003015,0.001441,0.001197,0.002221,0.003279,0.003301,0.002314,0.001326,0.000849,0.000744,0.000665,0.000445,0.00047,0.000483,0.000294,0.000311,0.00024,0.000302,0.000322,0.000322,0.000599,0.000543,0.000343,0.000491,0.000698,0.000591,0.000524,0.000274,0.000452,0.000289,0.000247,0.000203,0.000275,0.000395,0.000406,0.000283,0.000173,0.00012,0.001106,0.001187,0.001043,0.000438,0.000248,4.2e-05,0.000779,0.000399,0.001663,0.000952,0.000554,0.001155,0.000753,0.000281,0.000214,0.000149,0.000126,5.5e-05,6.9e-05,0.000351,0.00021,7.5e-05,3.8e-05,5.1e-05,5.3e-05,4.7e-05,2.7e-05,0.000174,0.000139,1e-04,5e-05,3.7e-05,0.001074,0.000517,0.00027
1.2e-05,1.5e-05,6e-06,7e-06,5e-06,1e-05,3e-06,1e-05,6e-06,6e-06,7e-06,6e-06,5e-06,8e-06,1e-05,2e-05,4.8e-05,0.00043,0.000271,0.000167,2.9e-05,0.001144,0.000723,0.002253,0.001437,0.000938,0.000898,3e-04,0.00014,0.00014,0.00101,0.001421,0.001015,0.000627,0.001591,0.005585,0.004657,0.00706,0.005038,0.00526,0.003628,0.005164,0.002145,0.000622,0.003206,0.006135,0.006119,0.00258,0.000993,0.000233,0.001435,0.002745,0.002472,0.00091,0.000424,0.000906,0.000655,0.000868,0.000341,0.000326,0.000153,0.000392,0.000294,0.000179,0.00032,0.00023,0.000552,0.000331,0.000482,0.000173,0.000146,0.000283,0.000274,0.000318,0.000281,0.000411,0.000355,0.000198,0.000311,0.000321,0.000374,0.000377,0.000193,7e-06,0.000132,5e-05,0.000955,0.000771,0.000923,0.000409,0.00023,0.00021,0.000681,0.000341,0.001669,0.002355,0.001188,0.001874,0.001449,0.000828,0.000229,0.000269,6e-05,7e-05,2.8e-05,0.000298,0.000205,9.8e-05,2.2e-05,4.3e-05,4.6e-05,2.9e-05,4.5e-05,0.000165,6.1e-05,2.6e-05,9.3e-05,3.6e-05,0.001448,0.000951,0.000329
9e-06,1.1e-05,3e-06,8e-06,1.4e-05,1.4e-05,1.1e-05,9e-06,1.5e-05,4e-06,4e-06,9e-06,7e-06,4e-06,5e-06,2.3e-05,5.1e-05,0.000349,0.000191,0.000174,9.4e-05,0.000782,0.001365,0.001253,0.00064,0.000275,0.000265,0.000329,0.000113,0.000114,0.000691,0.00071,0.000503,0.00012,0.002051,0.003211,0.000424,0.002599,0.001323,0.001528,0.005794,0.003789,0.003282,0.00134,0.002843,0.002585,0.001922,0.001702,0.000456,0.000457,0.000445,0.00191,0.001305,0.001753,0.001016,0.000594,0.000304,0.000323,0.000318,7.1e-05,0.000116,0.00026,0.000256,0.000124,0.000303,0.000168,0.000288,0.000121,0.000198,0.000138,0.000112,0.000161,4.7e-05,0.000185,0.000191,0.000309,1.8e-05,0.00018,0.000288,0.000106,1e-04,7.1e-05,0.000162,0.000161,9.7e-05,0.000116,0.000721,0.000991,0.000366,0.000127,0.000149,6e-05,0.001241,0.000667,0.000691,0.001638,0.000985,0.00202,0.001386,0.000458,0.000188,9.5e-05,0.000122,4.7e-05,7.3e-05,0.000162,5.9e-05,6.8e-05,4.1e-05,3e-05,3e-06,5.4e-05,5.6e-05,0.000173,7.1e-05,4.7e-05,4.9e-05,4.8e-05,0.001568,0.001237,0.000638
6e-06,1e-05,1.7e-05,1e-05,2e-05,6e-06,4e-06,1.6e-05,6e-06,7e-06,5e-06,1.4e-05,8e-06,3e-06,1e-05,3e-06,3.4e-05,0.000184,0.000185,1.8e-05,5.4e-05,0.000525,0.001262,0.001132,0.000582,0.000186,0.00024,8.4e-05,0.00018,0.000121,0.000586,0.000365,0.000159,0.00042,0.001079,0.001505,0.002248,0.001657,0.000628,0.001683,0.002753,0.002308,0.001628,0.001775,0.001908,0.000514,0.001463,0.000129,0.000449,0.000545,6.4e-05,0.001253,0.000217,0.00068,0.00035,9.6e-05,0.000208,0.000153,0.000201,0.000119,3.7e-05,7.6e-05,0.000152,9.8e-05,0.000131,1e-04,0.000148,8.4e-05,9.2e-05,9.5e-05,0.00012,0.000154,8e-05,9.1e-05,0.000149,6.9e-05,5.9e-05,7.4e-05,8.7e-05,0.000138,0.000162,1e-04,4.2e-05,3.9e-05,8.7e-05,0.000125,0.000389,0.000834,0.000336,2e-04,0.000191,1e-04,0.001122,0.000494,0.00083,0.001974,0.001109,0.00209,0.000839,0.000123,0.000206,0.000194,9.3e-05,7e-05,0.000126,0.000164,0.000104,8e-05,6.2e-05,7e-05,6.9e-05,6e-05,3.4e-05,0.000153,9.5e-05,3.4e-05,1.3e-05,3e-05,0.001271,0.000631,0.000173
9e-06,1.2e-05,3.1e-05,1.6e-05,1.7e-05,1.2e-05,4e-06,1.2e-05,8e-06,4e-06,1.3e-05,1.2e-05,1.1e-05,8e-06,9e-06,1.1e-05,2.1e-05,2.5e-05,7.7e-05,9.7e-05,6.2e-05,0.000304,0.000345,0.000298,4.6e-05,0.000451,0.00041,0.000305,0.000216,0.000188,0.000256,0.000566,0.000259,0.000385,0.001348,0.000666,0.000683,0.001059,0.000624,0.000493,0.0019,0.001853,0.00111,0.00099,0.000559,0.001692,0.000852,0.000972,0.000684,0.000365,0.000224,0.000693,1.6e-05,0.000195,0.000107,0.000159,3.6e-05,0.000165,3.7e-05,3.9e-05,0.000101,0.000116,0.00012,0.000129,6.7e-05,5.4e-05,7.7e-05,5.6e-05,8.5e-05,7.8e-05,4.7e-05,0.000132,5.6e-05,3e-05,8e-05,0.00011,7.3e-05,7.6e-05,2.2e-05,5e-05,7.7e-05,8.5e-05,5.5e-05,4.8e-05,0.000105,5.5e-05,0.000193,0.000281,0.000207,0.000166,0.000102,9.8e-05,0.000559,0.000319,0.001275,0.002022,0.000902,0.001444,0.000566,0.00033,9e-05,5e-05,1.9e-05,8.1e-05,4.5e-05,3.3e-05,7e-06,4.3e-05,1.4e-05,3.8e-05,1.8e-05,7e-06,2.9e-05,0.000116,6e-05,4.8e-05,6e-05,4.2e-05,0.00075,0.000308,0.000143
4e-06,6e-06,5e-06,2e-06,3e-06,0,2e-06,3e-06,2e-06,3e-06,6e-06,7e-06,2e-06,4e-06,7e-06,6e-06,1.4e-05,4.3e-05,5.4e-05,1.8e-05,3e-06,9.4e-05,6.9e-05,0.000119,0.000114,0.000245,0.000301,0.000109,3.8e-05,4.2e-05,0.000155,0.000205,0.000107,0.000176,0.000437,0.00029,0.000353,0.000737,0.000154,0.000216,0.000566,0.000137,0.000239,0.000515,0.00039,0.000828,0.000217,0.000365,0.000146,0.000118,5.4e-05,0.000296,7.7e-05,3.4e-05,2.5e-05,6.9e-05,2.4e-05,8.8e-05,4e-05,7e-06,9.1e-05,5.3e-05,5.1e-05,4e-05,1.8e-05,2.2e-05,1.6e-05,1.9e-05,4.1e-05,4e-05,2.3e-05,5.2e-05,2.6e-05,2.1e-05,1.9e-05,2.4e-05,1.8e-05,3.6e-05,1.5e-05,6e-06,4.5e-05,1.2e-05,1e-05,1.3e-05,1.9e-05,1.4e-05,9.5e-05,7.5e-05,5.6e-05,4e-05,2.4e-05,9e-06,0.000148,0.00011,0.00072,0.000389,0.000206,0.00023,0.000206,0.000151,7.4e-05,1.8e-05,1.5e-05,3.2e-05,2.4e-05,3e-05,1.6e-05,1.4e-05,6e-06,7e-06,2.3e-05,2e-05,4e-06,4.2e-05,1.6e-05,1.6e-05,3.3e-05,1.2e-05,0.000114,8.2e-05,3.8e-05
3e-06,2e-06,1e-06,4e-06,3e-06,1e-06,2e-06,3e-06,2e-06,3e-06,2e-06,4e-06,1e-06,3e-06,7e-06,6e-06,1.4e-05,6.1e-05,4.7e-05,2.6e-05,1.6e-05,8.6e-05,8.2e-05,0.000178,6.1e-05,0.000264,0.000188,0.000124,2.3e-05,2.2e-05,0.000154,6e-06,6.8e-05,8.9e-05,0.000275,8.2e-05,0.00046,0.00055,7.1e-05,0.000124,0.000418,0.000628,0.000604,0.000436,0.000523,0.000619,0.000264,0.000265,5.4e-05,6.1e-05,0.000153,0.000266,4.8e-05,7.4e-05,3.8e-05,3.3e-05,1e-05,3.9e-05,3.2e-05,1e-05,5.6e-05,7e-06,4.6e-05,3e-05,1.2e-05,7e-06,2.6e-05,2e-05,2.9e-05,2.5e-05,1.3e-05,4e-05,5e-06,3.1e-05,1.8e-05,1.3e-05,2.8e-05,1.8e-05,1.9e-05,2e-05,4e-05,1.4e-05,7e-06,7e-06,2.4e-05,1.6e-05,2e-04,0.000155,0.000104,5.2e-05,7.7e-05,3.6e-05,0.000199,8.2e-05,0.000572,0.000562,0.000199,0.000283,8.3e-05,3.5e-05,4.1e-05,2.1e-05,5e-06,3.2e-05,3.1e-05,1.6e-05,2e-06,3e-06,2.1e-05,1.1e-05,1.8e-05,8e-06,1.4e-05,5.2e-05,2.7e-05,6e-06,1.7e-05,1e-05,2e-04,0.000124,5.3e-05
3e-06,2e-06,4e-06,0,3e-06,1e-06,2e-06,3e-06,2e-06,3e-06,3e-06,4e-06,2e-06,3e-06,3e-06,5e-06,5e-06,7e-05,3e-05,4.6e-05,2e-05,0.00015,0.000101,0.000124,4.2e-05,0.00022,0.000161,7.2e-05,4.2e-05,2.1e-05,0.000165,0.000196,9.5e-05,0.00012,0.000166,0.000387,0.000871,0.000374,0.000233,4.3e-05,0.000661,0.000459,0.000247,0.000368,0.000468,0.000156,2e-05,0.000248,0.000156,9.4e-05,0.000136,0.000228,0.000104,0.000104,1.6e-05,3.1e-05,1.3e-05,2.2e-05,2.5e-05,1e-05,9e-06,4.4e-05,3.6e-05,3.2e-05,1.6e-05,2e-05,3.1e-05,2.4e-05,2.3e-05,2.7e-05,2.3e-05,2.4e-05,2.6e-05,3e-05,9e-06,1.4e-05,2.5e-05,1.2e-05,7e-06,9e-06,1.9e-05,1.3e-05,1e-06,4e-06,6e-06,1e-05,0.000265,0.000173,8e-05,6.1e-05,1.6e-05,2e-05,0.000183,7.4e-05,0.000382,0.000369,0.000198,0.000278,0.000122,2.8e-05,3.2e-05,1.6e-05,2.5e-05,2.4e-05,2.4e-05,2.8e-05,1.9e-05,9e-06,1.6e-05,5e-06,9e-06,1e-05,1.2e-05,4.4e-05,1e-05,1.4e-05,1.8e-05,9e-06,0.000233,9.6e-05,3.8e-05
3e-06,2e-06,3e-06,2e-06,1e-06,2e-06,0,2e-06,1e-06,2e-06,1e-06,2e-06,2e-06,0,3e-06,4e-06,5e-06,5.9e-05,1.3e-05,1.1e-05,7e-06,0.000207,0.000166,0.000125,8.9e-05,0.000214,0.000112,5.8e-05,3e-05,2e-06,0.000135,0.000198,0.000102,0.000122,5.9e-05,0.000358,0.000282,0.000451,0.000205,0.000111,0.000456,0.000177,0.000237,0.000516,0.000125,0.000288,0.000148,0.000477,8.3e-05,4.2e-05,0.000113,0.000184,0.000147,6.8e-05,2.1e-05,2.5e-05,1.7e-05,1.9e-05,2.1e-05,1.4e-05,5.3e-05,4.2e-05,1.9e-05,2.7e-05,1.8e-05,1.2e-05,2.5e-05,1.7e-05,1.6e-05,1.2e-05,2.2e-05,2.6e-05,2e-05,2.7e-05,1.4e-05,1.2e-05,1e-05,1.6e-05,1e-05,9e-06,2.2e-05,7e-06,1.9e-05,7e-06,1.5e-05,8e-06,0.000221,4.1e-05,3.7e-05,4.2e-05,2.1e-05,1.2e-05,8.5e-05,1.5e-05,0.000489,0.000244,0.000129,0.000206,6.2e-05,3e-06,5.5e-05,2.3e-05,2.4e-05,1e-05,1.4e-05,1e-05,1e-05,7e-06,6e-06,1e-05,1.3e-05,7e-06,5e-06,4e-05,1.6e-05,1.6e-05,6e-06,1.2e-05,0.000144,5.3e-05,1.5e-05
3e-06,1e-06,3e-06,1e-06,3e-06,2e-06,2e-06,1e-06,2e-06,1e-06,0,1e-06,1e-06,1e-06,2e-06,1e-06,3e-06,4.7e-05,2.8e-05,2.9e-05,1.3e-05,0.000253,0.000134,5.5e-05,2.6e-05,0.000222,7.7e-05,1.9e-05,2.2e-05,3.1e-05,7.6e-05,5.9e-05,5.4e-05,0.000123,8.2e-05,0.000444,0.000594,0.000622,0.000245,0.00012,0.000333,0.00046,0.000381,0.000313,0.000284,0.000285,0.000118,0.000403,0.00019,0.000132,0.000112,0.000153,0.000137,8.6e-05,3.3e-05,8e-06,2e-05,2.2e-05,1.7e-05,1.3e-05,3e-05,1e-05,2.2e-05,4.1e-05,2e-05,2e-05,1.8e-05,1e-05,3.5e-05,2.3e-05,2.3e-05,3.8e-05,1.6e-05,2.5e-05,5e-06,1.6e-05,1.6e-05,1e-05,2.3e-05,8e-06,3.1e-05,1.5e-05,2.1e-05,1e-05,2.1e-05,1.3e-05,0.00015,2.5e-05,5.9e-05,3.8e-05,2.8e-05,1.6e-05,4.5e-05,4.7e-05,0.000533,0.000503,0.000206,0.000101,2e-05,5.6e-05,1.6e-05,1.6e-05,1.9e-05,2e-05,1e-05,9e-06,1.7e-05,5e-06,4e-06,9e-06,9e-06,8e-06,5e-06,3e-05,1.4e-05,1e-05,8e-06,7e-06,5.1e-05,7e-05,2.9e-05
2e-06,3e-06,1e-06,0,3e-06,2e-06,1e-06,1e-06,0,1e-06,2e-06,3e-06,1e-06,1e-06,2e-06,2e-06,5e-06,3.5e-05,2.2e-05,2.5e-05,1e-05,0.000253,0.000272,0.000228,6.8e-05,0.000199,9.7e-05,7.8e-05,5.3e-05,4.6e-05,8.6e-05,3.9e-05,8e-05,0.000135,0.000178,0.000435,0.000395,0.000138,0.00026,5.4e-05,0.000696,0.000268,0.000313,0.000311,0.000122,0.000415,0.000123,0.000163,9.8e-05,9.3e-05,9.6e-05,0.000106,0.00015,0.000111,3.6e-05,2.9e-05,1.4e-05,2.2e-05,3e-05,1.8e-05,1.8e-05,2.4e-05,1.5e-05,2.3e-05,6e-06,9e-06,4.4e-05,1.8e-05,1.6e-05,3.7e-05,9e-06,1.8e-05,1.9e-05,1.5e-05,1.8e-05,2e-05,3.4e-05,2.6e-05,1.7e-05,2.1e-05,3.3e-05,1.2e-05,2.1e-05,1.5e-05,1.4e-05,8e-06,0.000149,5e-05,6.3e-05,3.7e-05,3.1e-05,3.6e-05,0.000108,5.3e-05,0.000424,0.000312,0.000187,0.000139,6.1e-05,2e-05,2.6e-05,1.1e-05,2.9e-05,1.7e-05,1.1e-05,1.1e-05,1e-05,1e-05,4e-06,1.2e-05,1.1e-05,6e-06,5e-06,2.1e-05,4e-06,9e-06,2e-06,5e-06,0.000167,5.5e-05,2.9e-05
2e-06,2e-06,3e-06,2e-06,3e-06,2e-06,0,1e-06,2e-06,1e-06,1e-06,3e-06,1e-06,1e-06,1e-06,4e-06,7e-06,2.8e-05,2.8e-05,2.6e-05,2.6e-05,0.000232,0.000199,7.2e-05,7e-05,0.000182,0.000119,2.4e-05,3.1e-05,2e-05,4.2e-05,0.000241,9.1e-05,8.6e-05,0.000226,0.00038,0.00022,0.000406,0.000345,0.000336,0.000678,0.000604,0.000402,0.000103,0.000378,5.6e-05,9.6e-05,0.000182,0.000106,9.7e-05,0.000119,0.000148,0.00012,3.9e-05,3.2e-05,5.4e-05,2.2e-05,3e-05,3.2e-05,1.1e-05,2.1e-05,9e-06,4.5e-05,4.1e-05,3.8e-05,2e-05,3e-05,3e-06,2.3e-05,3e-05,1.6e-05,3.4e-05,1.6e-05,8e-06,2.4e-05,1.7e-05,2.5e-05,4e-06,1.8e-05,8e-06,2.8e-05,3.4e-05,9e-06,1.3e-05,1.5e-05,8e-06,0.000162,6.6e-05,9.6e-05,4.1e-05,5.3e-05,2.9e-05,9.5e-05,8.4e-05,0.000383,0.000251,0.000114,0.00014,1.4e-05,3.2e-05,2.5e-05,1.9e-05,1.5e-05,1.5e-05,3e-06,7e-06,1.3e-05,7e-06,7e-06,1.5e-05,1.2e-05,6e-06,1.1e-05,3.1e-05,1.4e-05,3e-06,6e-06,3e-06,0.000214,0.000107,3.5e-05
3e-06,2e-06,4e-06,1e-06,1e-06,1e-06,1e-06,2e-06,1e-06,3e-06,2e-06,3e-06,3e-06,3e-06,1e-06,4e-06,4e-06,2.4e-05,1.6e-05,2.5e-05,8e-06,0.000186,0.000228,0.000196,4.4e-05,0.000134,6.6e-05,6.1e-05,1.8e-05,1.2e-05,1.3e-05,0.000375,0.000237,0.000112,0.000209,0.000575,0.000575,0.000109,0.000357,0.000873,0.000703,0.000378,0.000509,0.000322,0.000266,0.000103,0.000268,0.000272,7e-05,0.000142,0.000233,7.1e-05,9.4e-05,0.000109,7e-06,5.8e-05,7.2e-05,4.9e-05,3.5e-05,1.6e-05,8e-06,2.7e-05,2.5e-05,2.1e-05,1.9e-05,9e-06,1.2e-05,2.1e-05,3.4e-05,1.1e-05,1.4e-05,2.3e-05,2e-06,2e-06,3.8e-05,4.3e-05,3.7e-05,1e-05,1.6e-05,1.8e-05,3.4e-05,4e-05,1.7e-05,2e-06,1.9e-05,2.3e-05,9.2e-05,6.3e-05,0.000104,4.8e-05,6.1e-05,5.7e-05,7e-05,7.2e-05,0.000517,0.000363,0.000199,8.2e-05,6.5e-05,7.7e-05,6.7e-05,3.7e-05,1.6e-05,2.5e-05,1.3e-05,1.3e-05,9e-06,2e-06,4e-06,8e-06,4e-06,6e-06,5e-06,2.5e-05,1.4e-05,1.4e-05,9e-06,1.1e-05,0.000178,9.3e-05,4.3e-05
1e-06,2e-06,3e-06,1e-06,1e-06,2e-06,1e-06,1e-06,1e-06,2e-06,1e-06,2e-06,2e-06,1e-06,4e-06,6e-06,2e-06,1.3e-05,1.2e-05,2.6e-05,2.5e-05,0.00018,0.000192,4.6e-05,6e-05,0.000137,0.000133,3.2e-05,1.5e-05,2.2e-05,1.9e-05,0.000298,0.000148,0.000116,0.000214,0.000397,0.000141,0.000224,0.000311,0.000861,0.000603,0.000266,0.000231,0.000189,6.4e-05,0.000224,0.000272,0.000371,0.000179,7.1e-05,7.8e-05,0.000231,9.7e-05,0.000115,0.000109,0.000131,9.3e-05,5.3e-05,2.9e-05,1.5e-05,1.5e-05,2.8e-05,1.9e-05,6e-06,1.4e-05,1.8e-05,2.6e-05,9e-06,8e-06,1.2e-05,4e-06,1.1e-05,5e-06,2.7e-05,2.4e-05,2.9e-05,1.3e-05,6e-06,2.7e-05,4.7e-05,4.6e-05,4.5e-05,2.6e-05,2e-06,1.9e-05,2.3e-05,0.00016,0.000275,7.4e-05,0.000108,5e-05,1.8e-05,0.000104,3.9e-05,0.000385,0.000416,0.000306,0.00022,8e-05,2.3e-05,6e-06,1.2e-05,1.4e-05,1.4e-05,1.2e-05,1.3e-05,9e-06,9e-06,3e-06,6e-06,6e-06,8e-06,1.5e-05,1.8e-05,1.2e-05,4e-06,1.3e-05,9e-06,9e-05,8.9e-05,2.6e-05
3e-06,1e-06,4e-06,2e-06,3e-06,2e-06,2e-06,3e-06,2e-06,3e-06,2e-06,3e-06,0,1e-06,6e-06,2e-06,3e-06,1e-05,1.8e-05,9e-06,1.3e-05,0.000192,6.9e-05,9.3e-05,6.1e-05,0.000111,9.4e-05,7.2e-05,3.3e-05,1.4e-05,3.2e-05,0.000247,0.00011,0.000126,0.000303,0.000577,0.000438,0.000451,0.000143,0.000471,0.000203,0.00011,0.000155,5.8e-05,0.000224,8.2e-05,0.000187,9.4e-05,5.5e-05,6.9e-05,0.000149,8.9e-05,1e-04,0.000117,0.000103,7.9e-05,2.8e-05,3.6e-05,3.9e-05,2e-06,2.9e-05,4e-06,3.8e-05,1.4e-05,2.5e-05,2.9e-05,1.9e-05,2.1e-05,1.4e-05,1.6e-05,2e-05,9e-06,7e-06,3.9e-05,3.6e-05,2.4e-05,1.6e-05,9e-06,1.1e-05,4.7e-05,4.3e-05,1.9e-05,1.5e-05,3.1e-05,3.3e-05,4e-06,0.000388,0.000153,8.6e-05,9.3e-05,8.3e-05,5.7e-05,0.000104,2.1e-05,0.000245,0.000502,0.00023,0.00022,5.5e-05,2.9e-05,5.6e-05,3.6e-05,1.8e-05,1.7e-05,2e-05,1.5e-05,1.1e-05,1e-06,2e-06,1e-05,5e-06,1e-05,5e-06,1.6e-05,7e-06,7e-06,7e-06,6e-06,7.4e-05,3e-05,1.3e-05
1e-06,2e-06,4e-06,0,3e-06,2e-06,3e-06,2e-06,2e-06,1e-06,1e-06,5e-06,3e-06,0,1e-05,1.3e-05,7e-06,3.1e-05,2.5e-05,1.4e-05,1.4e-05,0.000214,0.000221,0.000185,6.1e-05,0.000135,0.000105,5.7e-05,1.8e-05,1e-05,8.8e-05,0.000206,6.7e-05,0.000122,0.000235,0.000644,0.000273,0.000325,0.000174,4.7e-05,0.000192,0.000217,0.000214,0.000124,0.000238,0.000144,8.6e-05,0.000194,0.000155,0.000118,0.000212,0.000114,0.00011,0.000179,3.3e-05,2.6e-05,1.6e-05,2.9e-05,2.1e-05,2.1e-05,3.8e-05,1.4e-05,2.4e-05,1e-05,1.3e-05,5e-06,2.9e-05,2.8e-05,2.8e-05,1.7e-05,1e-06,9e-06,1.1e-05,3.2e-05,2e-05,9e-06,1.2e-05,2.7e-05,1.6e-05,5.6e-05,2e-05,3.2e-05,1e-05,3.6e-05,1.8e-05,9e-06,0.000555,0.000304,0.000132,8.5e-05,4.9e-05,3.6e-05,3.6e-05,4.8e-05,0.000283,0.00048,0.000271,0.000162,3.6e-05,3e-05,4.9e-05,2.8e-05,2.7e-05,2.1e-05,1.5e-05,8e-06,7e-06,8e-06,4e-06,1.2e-05,6e-06,4e-06,4e-06,2e-05,1.1e-05,1.8e-05,9e-06,3e-06,0.000119,5.7e-05,3.6e-05
2e-06,0,3e-06,2e-06,5e-06,2e-06,1e-06,3e-06,1e-06,2e-06,3e-06,3e-06,2e-06,1e-06,1.2e-05,1.5e-05,1.2e-05,4.7e-05,5e-05,1.7e-05,1.3e-05,0.000194,0.000174,0.000119,0.000111,0.000111,0.000167,6.2e-05,2.1e-05,2e-05,9.4e-05,0.000145,0.000154,0.000151,0.000148,0.000521,0.000351,0.000166,0.000257,4e-04,0.000438,0.000392,0.00021,0.00011,0.00025,0.000201,0.000151,0.000217,9.7e-05,5.5e-05,7.6e-05,0.000145,1.7e-05,0.000104,9.8e-05,5e-05,4e-05,2e-05,2.2e-05,2.2e-05,4e-05,2e-05,4.1e-05,1.8e-05,2e-05,5e-06,2.5e-05,1.8e-05,5e-06,1e-05,1.1e-05,2.4e-05,4e-06,3e-06,2e-06,1.8e-05,3.3e-05,2.7e-05,1.7e-05,4.7e-05,4.9e-05,4.3e-05,2e-05,3.4e-05,5.3e-05,3e-05,0.000618,0.000309,0.00017,9.7e-05,7.9e-05,4.5e-05,6.1e-05,2.7e-05,0.000306,0.000535,0.00028,0.000168,5.1e-05,3.1e-05,5.1e-05,5.5e-05,2.3e-05,1.7e-05,8e-06,1.9e-05,2e-05,3e-06,2e-06,1e-05,7e-06,1.1e-05,6e-06,7e-06,1.5e-05,1.3e-05,1.4e-05,9e-06,0.000147,4.9e-05,1.3e-05
0,1e-06,1e-06,2e-06,4e-06,3e-06,3e-06,0,2e-06,3e-06,2e-06,2e-06,3e-06,3e-06,1.1e-05,2e-06,8e-06,4.2e-05,2e-05,3e-05,1.8e-05,0.000157,0.000145,0.000226,0.000136,0.000133,5.8e-05,4.1e-05,1.1e-05,1.1e-05,6.3e-05,0.000382,0.000142,6.7e-05,2.3e-05,0.000258,0.000198,0.000218,0.000272,0.000268,0.000198,0.000239,0.000163,9e-05,0.000195,0.000231,0.000178,0.000271,0.000159,8.9e-05,5.3e-05,0.000123,6.3e-05,2.5e-05,7e-06,2.7e-05,3.9e-05,5e-06,4.2e-05,8e-06,4.5e-05,1.6e-05,2.5e-05,4e-06,6e-06,1.2e-05,1.7e-05,9e-06,1.4e-05,9e-06,3.1e-05,2.5e-05,6e-06,1.7e-05,6e-06,1.5e-05,2.1e-05,2.3e-05,2.4e-05,1.5e-05,1.4e-05,7e-06,1e-06,2e-05,3.1e-05,2.4e-05,0.000543,0.000391,0.000103,4.1e-05,6.4e-05,4.8e-05,9.3e-05,6.6e-05,0.000125,0.000258,0.000147,5.8e-05,4e-05,2.1e-05,2.7e-05,4.7e-05,1.7e-05,1.6e-05,1e-06,1.7e-05,3e-06,1e-05,2e-06,1e-05,1e-05,6e-06,1.6e-05,2.5e-05,7e-06,1.7e-05,2e-05,5e-06,0.000156,7.9e-05,3.6e-05
1e-06,2e-06,4e-06,3e-06,4e-06,2e-06,2e-06,1e-06,1e-06,1e-06,1e-06,2e-06,2e-06,2e-06,6e-06,6e-06,3e-06,2.9e-05,8e-06,3.3e-05,1.7e-05,0.000131,0.000116,0.000195,0.000121,0.00015,0.000109,7e-05,6.5e-05,4.9e-05,8.8e-05,0.000557,0.000327,0.00019,0.000162,0.000363,6.3e-05,0.000123,0.000311,0.000484,0.000265,0.000158,0.000223,0.000148,0.00028,0.000225,8.7e-05,0.000271,0.000135,9.3e-05,5.5e-05,0.000117,0.000104,0.000112,3.2e-05,1.5e-05,4.6e-05,3.8e-05,5.1e-05,3.9e-05,2.2e-05,5e-06,9e-06,3e-05,1.9e-05,2.3e-05,2.7e-05,9e-06,1e-05,1.5e-05,1.4e-05,1e-05,2.3e-05,2.5e-05,1e-05,2.2e-05,3.5e-05,2.6e-05,7e-06,1.5e-05,1.8e-05,7e-06,6e-06,2e-05,1.1e-05,1.2e-05,0.000461,0.000203,0.000157,2.1e-05,6.2e-05,1.7e-05,0.000118,2.8e-05,0.000113,0.000107,4.5e-05,0.000106,9.6e-05,3.3e-05,2.1e-05,4e-05,4.5e-05,1.4e-05,1e-06,1.7e-05,1.5e-05,6e-06,8e-06,8e-06,1e-06,7e-06,7e-06,1.8e-05,2e-06,1.2e-05,8e-06,1.8e-05,0.000166,9.1e-05,4.6e-05
1e-06,1e-06,2e-06,1e-06,1e-06,1e-06,1e-06,2e-06,2e-06,2e-06,1e-06,2e-06,1e-06,2e-06,6e-06,2e-06,4e-06,9e-06,5e-06,3.4e-05,2.4e-05,9.6e-05,4e-06,0.000244,0.000135,0.000165,0.00015,7.4e-05,7.9e-05,3e-05,6.5e-05,0.000602,0.000229,0.000132,0.00031,0.000162,0.000275,0.000321,0.000277,0.000593,0.000428,0.000291,0.000256,0.000193,0.000245,0.000254,0.000293,0.000269,0.000121,0.000106,9.6e-05,0.000254,0.00013,0.000109,0.00018,0.000119,7.4e-05,4.2e-05,8.6e-05,3e-05,4.2e-05,1.9e-05,1.8e-05,4.2e-05,1.7e-05,3e-05,2.6e-05,2.6e-05,1.1e-05,2e-05,1.4e-05,3.1e-05,1.8e-05,2.5e-05,1.9e-05,1.9e-05,9e-06,8e-06,1.4e-05,2.4e-05,1.6e-05,9e-06,1.8e-05,1.9e-05,2.1e-05,2.4e-05,0.000394,0.000136,4.8e-05,6.7e-05,4.2e-05,1.9e-05,0.000159,0.000101,0.000307,0.000306,0.00011,0.000168,8.3e-05,4.3e-05,5.2e-05,0.000101,3e-05,2.6e-05,2e-05,1.2e-05,6e-06,4e-06,7e-06,1.1e-05,1.2e-05,5e-06,8e-06,1e-05,9e-06,4e-06,1.1e-05,7e-06,0.000176,0.000175,7.6e-05
1e-06,1e-06,1e-06,2e-06,2e-06,2e-06,2e-06,2e-06,2e-06,2e-06,2e-06,0,2e-06,3e-06,2e-06,3e-06,4e-06,9e-06,1e-05,2.6e-05,1.9e-05,7e-05,8.1e-05,0.000155,0.000148,0.000125,0.000135,8.4e-05,7.1e-05,3.7e-05,4e-05,0.000588,0.000435,0.000203,0.000275,0.000347,0.000294,0.000161,0.000349,0.000318,0.000341,0.000208,0.000236,0.000336,0.000265,0.000129,0.000315,0.00044,0.000248,0.000114,0.000148,0.000121,0.000111,0.000167,0.000171,5e-05,3.3e-05,5.3e-05,0.000109,0.000113,8e-05,2.5e-05,1.7e-05,5.1e-05,4.3e-05,3e-05,2.4e-05,2.6e-05,3.2e-05,7e-06,1.1e-05,3.4e-05,1.1e-05,9e-06,1.2e-05,1.4e-05,1.4e-05,2.1e-05,1e-05,2.5e-05,3.6e-05,3.2e-05,8e-06,9e-06,2.1e-05,1.5e-05,0.000406,0.000376,0.000244,0.000108,4.6e-05,3.7e-05,0.000165,0.00013,0.000382,0.000469,3e-04,9.6e-05,9.2e-05,1.4e-05,9.3e-05,0.000127,7.6e-05,3.9e-05,1.9e-05,8e-06,6e-06,8e-06,5e-06,3e-06,3e-06,6e-06,1.1e-05,9e-06,1.4e-05,8e-06,1.1e-05,1e-05,0.000169,0.000207,0.000118
1e-06,2e-06,2e-06,1e-06,0,1e-06,1e-06,1e-06,0,1e-06,1e-06,1e-06,1e-06,0,3e-06,2e-06,3e-06,1.6e-05,1.3e-05,2.5e-05,1.4e-05,7.7e-05,0.000101,0.000143,8.1e-05,6.7e-05,7.2e-05,4.3e-05,3.3e-05,2.7e-05,5.5e-05,0.000553,0.000309,0.000134,0.000173,0.00026,6.7e-05,0.000186,0.000378,0.000216,8e-05,0.000212,0.000321,0.000136,4.8e-05,0.000111,8e-05,0.000201,0.000113,0.000173,0.00015,0.000101,5.9e-05,0.000121,4.4e-05,6.3e-05,1.7e-05,5.1e-05,5.5e-05,5.7e-05,4.2e-05,2.1e-05,2e-05,3.6e-05,2.2e-05,2e-05,1.3e-05,1.2e-05,8e-06,1.2e-05,1.2e-05,2.4e-05,1.7e-05,1.2e-05,2e-06,1.6e-05,1.8e-05,1.5e-05,8e-06,1.9e-05,2.4e-05,2.5e-05,2.1e-05,1.6e-05,9e-06,1e-05,0.000347,0.000294,0.000159,7.7e-05,6.7e-05,2e-05,0.000129,4e-05,0.000292,0.000336,0.000204,0.000169,8.1e-05,7.5e-05,7.1e-05,2.4e-05,5e-06,1.2e-05,1e-06,1e-05,1e-06,6e-06,3e-06,1e-06,1e-06,4e-06,4e-06,1.6e-05,1.2e-05,5e-06,6e-06,4e-06,0.000131,0.000115,3.8e-05
1e-06,1e-06,3e-06,1e-06,1e-06,0,0,1e-06,1e-06,0,1e-06,2e-06,0,0,2e-06,2e-06,2e-06,1e-05,1.2e-05,7e-06,8e-06,8.5e-05,7.4e-05,6.8e-05,1.9e-05,8.5e-05,3.8e-05,1e-05,1.8e-05,1.5e-05,3.7e-05,0.000352,0.000114,4.5e-05,0.000113,0.000342,0.000253,0.000241,0.000244,0.000272,0.00031,0.000193,0.000118,0.000175,0.000154,5.8e-05,2.8e-05,0.00023,8e-06,1e-04,1.3e-05,0.000105,1.3e-05,8.6e-05,3.3e-05,1.7e-05,1e-06,2.2e-05,2.7e-05,2.2e-05,4e-05,6e-06,2.4e-05,1.1e-05,1.5e-05,6e-06,1.1e-05,4e-06,6e-06,8e-06,6e-06,1.6e-05,9e-06,6e-06,5e-06,1e-05,1.4e-05,8e-06,2e-06,1.1e-05,8e-06,1.1e-05,7e-06,5e-06,7e-06,6e-06,0.000249,6.6e-05,2.3e-05,3.8e-05,2e-05,1.2e-05,7.7e-05,1e-05,0.000206,0.000215,9.6e-05,0.000139,2.8e-05,4.5e-05,2.5e-05,2.7e-05,2.3e-05,2e-06,3e-06,8e-06,6e-06,4e-06,3e-06,2e-06,3e-06,3e-06,6e-06,1.6e-05,9e-06,6e-06,5e-06,2e-06,8.1e-05,2.5e-05,2.7e-05
1e-06,1e-06,2e-06,1e-06,0,0,0,1e-06,0,0,0,1e-06,0,0,2e-06,2e-06,3e-06,7e-06,7e-06,2e-06,7e-06,7.3e-05,7.2e-05,6.8e-05,1.7e-05,7.2e-05,2.4e-05,6e-06,2.5e-05,1e-05,4.2e-05,0.000133,1.2e-05,4.2e-05,9.6e-05,0.000241,0.000211,0.000129,7.6e-05,0.000113,0.000179,0.000173,0.000125,0.000171,0.000257,0.000103,6.9e-05,0.00015,2.5e-05,5.9e-05,1.9e-05,0.00011,1.3e-05,7.4e-05,2.1e-05,1e-05,9e-06,1.2e-05,1.6e-05,1.7e-05,2.4e-05,8e-06,1.4e-05,1.6e-05,3e-06,5e-06,1.4e-05,3e-06,4e-06,2e-06,4e-06,1.2e-05,9e-06,4e-06,6e-06,8e-06,1.5e-05,8e-06,2e-06,6e-06,5e-06,2e-06,2e-06,2e-06,9e-06,1e-06,0.00017,3.5e-05,2.1e-05,3.9e-05,2.8e-05,1.4e-05,7.2e-05,5e-06,0.000199,4.4e-05,2.3e-05,8.3e-05,2.1e-05,2.3e-05,1.7e-05,5e-06,8e-06,7e-06,8e-06,1e-06,2e-06,2e-06,1e-06,1e-06,3e-06,0,6e-06,1.4e-05,2e-06,1e-06,5e-06,2e-06,4.7e-05,8e-06,9e-06
1e-06,0,2e-06,0,1e-06,0,0,1e-06,0,0,0,2e-06,1e-06,0,2e-06,2e-06,3e-06,1.1e-05,9e-06,2e-06,8e-06,5.7e-05,6.2e-05,6.2e-05,9e-06,7.2e-05,2.9e-05,5e-06,1.7e-05,4e-06,3.7e-05,0.000159,2.9e-05,5.4e-05,9.5e-05,0.000247,0.000153,0.000205,8.4e-05,3.6e-05,0.000185,0.000188,7e-05,0.000125,0.000112,0.000133,2.2e-05,0.000167,1.1e-05,4.5e-05,2.8e-05,0.000107,6e-06,6.6e-05,2e-05,1.1e-05,2e-06,1.1e-05,8e-06,1e-05,2.3e-05,7e-06,1.4e-05,1.7e-05,5e-06,3e-06,1.6e-05,1e-06,3e-06,1e-06,5e-06,1.4e-05,6e-06,6e-06,3e-06,7e-06,1.3e-05,6e-06,0,7e-06,5e-06,4e-06,0,2e-06,6e-06,0,0.000166,2.3e-05,2.3e-05,3.6e-05,2.2e-05,1.4e-05,7.7e-05,8e-06,0.000209,7.3e-05,3.1e-05,6.6e-05,2.5e-05,2.9e-05,2.1e-05,7e-06,4e-06,0,8e-06,3e-06,3e-06,2e-06,1e-06,1e-06,2e-06,0,6e-06,1.3e-05,4e-06,1e-06,4e-06,1e-06,2.2e-05,2e-06,5e-06
