-0.000446,-0.000546,-0.000948,-0.001237,-0.005831,-0.004093,-0.00196,-0.008482,-0.017071,-0.008487,-0.003597,-0.002715,-0.003736,-0.00921,-0.009459,-0.005104,-0.002287,-0.001609,-0.001568,-0.000716,0.005209,0.004072,-0.006578,-0.010531,-0.006191,-0.009368,-0.00907,-0.01255,-0.010821,-0.01045,-0.019305,-0.010323,-0.017291,0.000686,-0.009482,-0.011431,-0.013315,-0.010836,-0.016574,-0.023366,-0.015577,-0.009408,-0.006897,-0.010262,-0.014482,-0.012014,-0.008648,-0.005308,-0.013495,-0.007929,-0.006367,-0.006568,-0.001197,-0.001818,-0.002508,-0.003946,-0.007288,-0.007724,-0.01065,-0.004075,-0.001934,-0.002069,-0.001434,0.000194,-0.000335,-0.001609,-0.002613,-0.00185,-0.001055,0.000861,-8.9e-05,-0.000464,-0.012764,-0.007899,-0.003333,-2.9e-05,0.001351,-0.005034,-0.001895,-0.001496,-0.000558,-0.000676,0.000716,-0.001121,-0.000581,-0.000392,0.000138,-0.000378,-0.004399,-0.005175,-0.002484,-0.000432,7.1e-05,-0.003065,-0.001676,-0.00071,0.000124,0.000343,0.000255,0.000106,0.000161,0.000161,0.000153,-0.00405,-0.002105,-0.001613,-0.000877,-0.00037,-9.2e-05,-1e-04,-2.3e-05,0.000206,-1.4e-05,7.3e-05,0.000103,-5.8e-05,7.9e-05,6e-06,-7.4e-05,-0.000229,-0.000144
2.9e-05,0.000266,0.000181,0.000607,0.002936,0.002679,0.001358,0.003917,0.010759,0.007304,0.002521,0.001576,-0.000571,0.000814,0.004826,0.002836,0.001609,-0.002502,-8.9e-05,0.003655,0.001072,-0.007544,-0.004405,-0.007326,-0.001261,-0.001354,-0.000268,0.00453,0.006213,0.010035,-0.013123,-0.001838,-0.00032,-0.001924,-0.000804,-0.004616,-0.005583,0.004652,0.003062,-0.000233,-0.003415,-0.002871,-0.003361,-0.002538,0.001874,-0.002496,-0.007481,-0.002716,-0.002641,-0.00226,-0.006168,-0.00684,-0.003584,-0.003262,-0.001332,-0.000494,-0.00366,-0.00232,-0.000267,0.000164,-0.000535,-0.000716,4e-05,-0.000423,-0.000582,-0.000403,-0.000411,0.000396,4.8e-05,-0.000372,0.000317,-0.002529,0.005258,0.003954,0.001951,0.001573,-0.00054,0.003703,0.002822,0.001472,-0.000615,-0.000256,-0.002481,0.001912,0.001319,0.000377,0.000375,0.000464,0.002076,0.003712,0.001905,0.000577,7.3e-05,0.00042,0.000384,0.000113,2.2e-05,0.000194,0.000142,0.000255,0.000369,8.6e-05,0.000138,0.002113,0.001737,0.000627,-0.000465,-0.000322,-0.000226,-0.00018,-1.8e-05,0.000112,3.6e-05,1.2e-05,5.5e-05,-2.9e-05,-0.000127,-0.000192,-3.3e-05,-0.000187,-0.000227
-8.9e-05,-0.000173,-0.00014,-0.000394,-0.000768,-0.000546,-0.000269,-0.00423,-0.006894,-0.005103,-0.001665,-0.000967,-0.000578,0.00104,-0.001878,-0.001018,-0.000667,0.000661,0.000874,-0.00011,0.001833,-0.005859,-0.010897,-0.007501,-0.007724,0.003218,-0.008447,-0.008418,-0.0096,-0.01152,-0.002632,-0.005315,-0.002276,-0.004058,-0.00166,-0.003634,0.004915,-0.010334,-0.003298,0.002829,0.004094,-0.00035,-0.002186,-0.001608,-0.000352,0.003157,0.00063,-0.001634,0.000157,-0.000166,-0.000484,0.001297,-0.000133,0.000161,-0.001594,-0.003807,-0.001774,-0.002199,-0.003028,-0.004537,-0.000943,0.001121,0.000732,2.3e-05,-0.001047,-0.000959,-0.000249,-0.000339,4.3e-05,-0.001064,-0.000633,0.000134,-0.003201,-0.003618,-0.000462,3.8e-05,-0.000718,-0.00229,-0.001241,-0.000548,-3.3e-05,-0.000163,0.000191,-0.001163,-0.000648,7.2e-05,-0.000282,0.000118,0.000799,-0.001805,-0.001002,-0.000349,-0.000148,0.000351,0.000263,2.6e-05,2.4e-05,8e-06,-9.7e-05,4.9e-05,-7.1e-05,-3.4e-05,1.9e-05,-0.001867,-0.001392,-0.00056,-0.000352,-0.000193,-0.000176,-0.000184,-5.5e-05,-0.000135,-5e-06,-8.7e-05,-0.000168,6.1e-05,-0.000104,-0.000227,-0.000165,-0.000106,-0.000174
5.5e-05,-3.7e-05,-0.000179,-0.000335,9.4e-05,-0.000929,-0.000667,0.00062,0.00148,0.001604,0.000595,0.000279,0.000344,-0.000773,-0.001152,-0.000436,0.000446,0.000154,-0.000565,-0.000673,3.8e-05,-0.003477,-0.001405,0.002152,-0.007631,-0.002419,-0.004484,-0.000989,0.003225,-0.001859,0.011206,0.002175,0.006411,0.005239,-0.000537,-0.006077,-0.001367,-0.002091,-0.002794,-0.00429,-0.002398,-5.9e-05,0.003856,0.003806,-0.00205,-0.003284,-8.8e-05,0.001063,-0.001412,0.001547,-0.000588,0.0017,3.6e-05,-0.000444,-0.000988,0.001913,0.002107,0.002628,0.003858,0.002022,0.000775,-0.000797,-0.000304,0.000259,-0.00151,-0.00018,0.00034,0.00041,-0.000327,-0.000706,-3e-06,0.000264,0.000465,0.002257,0.001588,-0.000141,0.000854,-0.000787,0.000961,0.000129,9.7e-05,-0.00025,0.000252,-0.000937,-0.000401,0.001047,5.5e-05,-0.000148,0.000165,6e-04,0.000476,0.00018,3.2e-05,-0.000388,-8e-05,6.9e-05,0.00024,-0.000126,-9.9e-05,7.2e-05,4.3e-05,-5.7e-05,0.000166,0.000175,-0.000125,0.000264,0.000219,0.000103,0.000129,-3.2e-05,-5.4e-05,-6.9e-05,-1.5e-05,-2.6e-05,4.5e-05,-0.000144,-7.7e-05,-1.9e-05,-3e-05,-9.3e-05,0.000132
7e-06,-4.9e-05,4e-06,0.000234,9.4e-05,0.000879,0.000683,0.000412,-0.001265,-0.000667,-0.000398,7.6e-05,-0.000745,-8.4e-05,0.000623,0.000165,-0.000237,-0.00055,-0.002084,-0.001964,0.002918,0.000244,-0.003136,0.000159,0.003854,-0.000534,0.003192,-0.001099,-0.005905,-0.001453,-0.00317,-0.006279,-0.003527,-0.008858,-0.004523,0.005604,0.000743,0.000664,0.002057,0.004041,0.00104,0.001442,-0.003841,-0.001414,0.001926,0.000961,0.002226,-0.002762,0.005854,-0.001059,0.000966,-0.001571,0.000919,-0.000735,0.000733,-5e-05,-0.0026,-0.000202,-0.003653,-0.00084,-0.001735,0.000305,0.000377,0.000265,0.000283,0.000234,0.000816,0.000509,0.000221,-7.2e-05,-0.000594,-2e-06,-0.00165,-0.003694,-0.001194,-0.000497,-0.000252,-1.6e-05,-0.001671,-0.000811,0.000225,6.9e-05,0.000117,-0.001399,-0.001144,-0.000624,-0.000214,8.3e-05,-0.000218,-0.001285,-0.000724,-4e-04,6.8e-05,-9.2e-05,-0.000226,-7.3e-05,0.000203,-0.000144,-0.000219,0.000128,-0.000122,-0.000144,0.000103,0.00035,-0.000191,-0.000445,1e-06,-3.5e-05,5.4e-05,4.6e-05,9.4e-05,-9.4e-05,3.7e-05,-4.5e-05,7.5e-05,-3e-05,8.4e-05,0.000121,8.7e-05,0.000147,1.8e-05
5.8e-05,5.4e-05,2.8e-05,-0.000341,-0.000296,-0.000431,-0.000148,-0.000145,0.001537,0.000251,9.8e-05,-1.4e-05,0.000739,-0.000382,-0.000113,0.000417,-0.000106,0.000361,1.6e-05,0.000315,0.000165,-0.000856,0.003917,0.001093,-0.001854,0.007912,-0.000236,0.003681,0.002777,-0.000719,-0.001884,-0.000753,0.001547,0.000364,-0.001454,-0.001738,-0.000417,0.001443,-0.000505,-0.000513,-0.003754,-0.000706,0.001934,0.001497,-0.005854,7.9e-05,-0.000155,0.002381,0.000388,0.003557,0.001362,0.000481,-0.001466,0.000605,-0.000166,-0.001676,0.000406,0.003949,0.001755,0.001409,0.000842,-0.000138,-0.000144,0.00072,0.000268,0.000617,2.2e-05,9e-06,5.1e-05,0.000425,-0.000188,-0.00026,-0.000672,0.001137,0.001273,-0.000334,-0.000366,5e-06,-7.4e-05,-0.000554,-0.000313,0.000229,-5.2e-05,-8.9e-05,5.9e-05,0.000369,0.00013,-6e-06,-0.000163,8.9e-05,0.000335,0.000106,7e-06,-4.8e-05,-0.000145,3.2e-05,-9.9e-05,-1e-05,-0.000174,0.000156,-0.000157,-0.000137,-4.5e-05,4.2e-05,0.000332,-4.1e-05,-1.7e-05,0.000193,-2e-06,0.000111,2.7e-05,-1.4e-05,-2.7e-05,3.6e-05,-2.8e-05,-5.3e-05,-5.8e-05,0.00011,-5.1e-05,-2.8e-05,3e-06
-0.000172,-6.9e-05,-0.000146,-5.8e-05,-4.3e-05,-0.000255,-0.000457,9.5e-05,8e-05,6e-06,0.000102,2.2e-05,-0.000199,0.000364,-9.9e-05,-0.000358,-0.00011,-0.000728,-0.001561,-0.000712,0.000116,-0.001663,9.7e-05,-0.003239,0.004145,-0.002749,-0.004753,0.00093,-0.003181,-0.003792,-0.002051,0.003221,-0.001008,0.001538,-0.001165,-0.001102,0.001997,-0.001894,-0.002288,0.001277,0.001122,0.000289,0.001429,-0.00477,-0.000223,0.001271,-0.001101,0.00099,0.001014,-0.000519,-4.5e-05,0.002282,-0.000905,0.000295,-3.4e-05,-0.000331,0.000775,-0.003229,0.00034,-0.001438,-0.001447,-0.001069,-0.00107,-6.9e-05,0.000391,-0.000324,-0.000134,-0.000225,-0.000131,-2.4e-05,1.8e-05,-0.000105,0.000425,-0.001869,-0.000966,-0.000281,-0.000302,-0.000399,-0.000563,-0.000717,-0.000437,-0.000101,0.00028,0.000734,-0.000564,-0.000365,-0.000316,-8.9e-05,0.000116,-0.000249,-0.000322,-5e-05,1.9e-05,-5e-05,9.3e-05,9.8e-05,1.5e-05,-5.5e-05,-0.000174,-5.9e-05,-4.8e-05,-9.8e-05,-0.000114,-4e-05,0.000104,7e-06,2e-05,-5.7e-05,-9.7e-05,1.2e-05,3e-06,-7e-05,3e-06,-4e-05,-0.00014,-9.1e-05,-7.5e-05,-8.6e-05,-7.4e-05,-6.1e-05,2.7e-05
-5e-05,1.6e-05,-0.000141,-0.000143,9e-06,0.000254,0.000235,-0.000123,0.000133,0.000204,0.000135,-6.8e-05,-7.9e-05,-0.000332,-0.000397,8e-06,1.8e-05,4.7e-05,0.000979,-0.001493,-0.001231,-0.000757,-0.001853,0.002854,-0.000403,5.5e-05,0.001128,0.006473,0.00301,0.001707,0.001644,0.001025,0.004516,0.000816,0.001109,0.002101,-0.000547,0.00207,-0.002234,0.000413,0.000285,-0.002284,0.000142,-0.000675,0.000746,-0.000979,0.00142,-0.000387,4e-06,-0.003277,0.001891,-0.002674,0.000923,0.000101,-0.001053,-0.000108,0.001279,3e-04,0.000137,0.000936,9.7e-05,0.000559,0.000112,-0.00014,0.000311,-0.000342,-0.000619,-0.000672,-0.000544,-3.7e-05,9.2e-05,-0.000261,-0.000559,1.2e-05,0.000317,-0.000299,-0.000802,0.000141,0.000344,-7e-05,-0.000373,-0.000198,5.4e-05,-0.000221,0.000702,7e-06,-0.000454,-0.000259,-0.000139,0.000109,-0.000144,-3.4e-05,-0.000137,0.000153,2.9e-05,-4e-05,-0.000105,-5.8e-05,-7.7e-05,-6.6e-05,-7.3e-05,-0.000109,-0.000156,0.000114,0.000176,0.000155,0.000117,-7.4e-05,-2.4e-05,-2.1e-05,-7.2e-05,-8.4e-05,-4.7e-05,-0.000116,-0.000102,-5.3e-05,6.6e-05,-4.4e-05,-5.2e-05,-2.5e-05,1.1e-05
1e-05,-6.8e-05,-9.5e-05,0.000161,-0.000116,-7.2e-05,-0.000166,5.5e-05,-0.000662,-2e-04,7e-06,-0.000179,0.000214,0.000436,0.000795,-0.000456,-2.4e-05,-0.000451,-0.000212,0.000729,-0.000762,-0.000282,-0.000969,0.000827,-0.000871,-0.003888,-0.003375,-0.002616,0.000246,-0.001303,-0.000319,-0.003551,-0.002608,-0.003031,-0.004858,0.004731,-0.001414,-0.00188,0.000295,-0.004806,-0.000796,0.001894,-0.000179,0.00241,0.001141,-0.002763,0.003954,-0.001238,-0.001275,-0.000142,0.000577,0.00093,-0.000332,-0.000268,-0.000806,0.000962,-0.00099,-0.000372,-0.000592,-0.000161,-0.00046,-0.000672,-0.000553,3.5e-05,-0.000297,-0.000683,-6e-06,5.1e-05,-1.5e-05,0.00016,0.000168,-0.000179,-0.000215,8.2e-05,0.000183,0.000101,-0.000229,-0.00012,0.000394,-8.2e-05,-0.000213,-1.6e-05,6e-05,-0.000239,-0.000304,-0.000337,-0.000116,-0.00012,-7.4e-05,0.000245,1.9e-05,-5.6e-05,-1.2e-05,-1.5e-05,-0.000148,-0.000171,-6.2e-05,-0.000175,-5.2e-05,-0.000121,-7.1e-05,-8.1e-05,-8e-05,1.6e-05,-0.000244,0.000191,-0.000112,-4.6e-05,3.8e-05,-4.7e-05,-3.7e-05,-2e-05,-1.9e-05,-2.2e-05,-2.1e-05,-8.9e-05,-4.2e-05,-8.2e-05,3.5e-05,6.2e-05,-2.4e-05
1.5e-05,1.2e-05,5.6e-05,-6e-06,1.8e-05,-1.7e-05,2.5e-05,0.00014,0.000431,4.2e-05,-0.000192,7.9e-05,-0.000214,-0.000319,2e-05,2.7e-05,5e-05,0.000274,-6.3e-05,-0.000104,-0.001678,-0.000243,0.001447,0.000352,0.000203,0.001773,0.001082,0.000435,0.000233,0.000224,0.001576,-0.001419,-0.00055,-0.002279,0.001273,-0.000744,-0.000191,0.003716,0.001218,0.001916,-0.000431,7e-05,-0.000207,0.000671,-0.000624,0.001326,-0.00212,-0.000283,-0.000507,-0.000503,-0.001455,-0.000847,-0.001145,-9.5e-05,0.000158,-0.000874,0.000549,-0.000334,0.000211,-0.000458,-0.000172,5e-05,-4.6e-05,-0.000198,-0.000339,-3.6e-05,-0.000166,0.000103,7.3e-05,4e-06,5.6e-05,-0.000446,-5.2e-05,-0.000251,-0.000732,-0.000553,-0.000483,-2.5e-05,0.000174,0.000474,6.5e-05,0.000112,-0.000222,-2e-05,0.000765,-0.000226,-0.000121,-2.9e-05,-6.9e-05,-0.000244,-0.000194,-0.000218,-0.000106,-4.6e-05,8e-06,7.1e-05,-5.2e-05,-0.000125,2.8e-05,-2.9e-05,-7e-06,-2.5e-05,-3e-06,1.6e-05,2e-06,0.000329,4e-06,8.1e-05,2.6e-05,4.5e-05,-1e-05,-3.6e-05,-6e-06,-4.5e-05,-1.2e-05,3.2e-05,6e-06,-1.1e-05,2e-05,2.9e-05,2.1e-05
-8e-06,2.8e-05,4.8e-05,-5.1e-05,0.000121,-2.4e-05,6.2e-05,-0.000293,4.6e-05,4.3e-05,9.2e-05,-0.000197,-0.000116,0.000233,-0.000235,0.000235,-2e-04,-0.000243,-0.000379,-0.00047,-0.000638,0.000423,0.000478,0.000126,0.000635,-0.001999,-7.1e-05,-0.002825,-0.001503,0.001149,0.001627,0.002672,6e-04,-0.000573,0.003193,0.000479,0.000449,-0.000491,0.000985,-0.00019,0.000407,-0.001696,-0.000106,-0.00127,0.000429,-0.000886,0.000416,-5.1e-05,0.000701,0.000825,0.000982,0.000965,0.000823,0.000669,0.000418,-0.00056,-0.000468,-0.000562,-0.00185,-0.000347,0.000663,-5.8e-05,1.5e-05,4.6e-05,0.000612,0.000225,0.000184,0.000105,-1.2e-05,-2.7e-05,-0.00014,5.1e-05,-0.000237,0.00014,-6.9e-05,6.7e-05,0.000173,0.00027,-0.000181,-0.000378,-0.000155,0.000147,-0.000241,-5e-06,-0.000191,-0.000439,-0.000104,-9e-05,-0.000193,-1e-06,0.000138,1.7e-05,-9.2e-05,-9.5e-05,1e-06,-9e-05,4.2e-05,6.1e-05,2e-06,-0.000119,-9.5e-05,1.7e-05,-8e-05,5.3e-05,1.3e-05,-0.000152,-0.000145,-6.9e-05,4.5e-05,1.4e-05,1.1e-05,-4.9e-05,-2.2e-05,-1.5e-05,0,-3.4e-05,1.6e-05,-1.7e-05,-1.2e-05,1.6e-05,2e-06
5e-06,9e-06,3e-05,-9e-06,-0.000121,-5e-06,-3.7e-05,0.000199,-2.6e-05,2.1e-05,0.000277,0.000151,-0.000119,-0.000181,0.000107,0.000182,0.000124,0.00019,-4.3e-05,0.000924,0.000437,4.9e-05,-0.00096,-0.001333,-0.001248,0.001974,0.000704,0.00151,-0.002449,-9.5e-05,0.000345,0.000764,-0.000399,0.001298,-0.00201,-0.001588,0.00082,-0.001262,0.000488,0.000322,-0.001448,0.000581,0.001013,0.000102,-0.001549,-0.000834,-0.000576,0.000259,-0.000765,-0.000943,-0.000811,4.1e-05,0.000186,-0.000275,0.000201,0.000303,0.000633,3e-05,0.001664,0.000512,5e-04,0.000549,5.9e-05,-0.000254,0.000227,-9.8e-05,-0.00018,-2.7e-05,0.000265,0.000154,1.8e-05,0.000174,7.1e-05,0.000108,-0.000444,-0.000356,6e-06,0.000136,6.2e-05,0.000514,0.000195,-2e-05,0.000128,-2.9e-05,-0.000721,0.000143,-0.000152,0.000236,-0.00012,3.1e-05,-8.8e-05,-5.6e-05,5.2e-05,-5.8e-05,-3.7e-05,-2.3e-05,-3.4e-05,2.2e-05,-4.1e-05,-6.8e-05,-2.2e-05,2.5e-05,2.3e-05,-5e-06,-5.1e-05,-0.000138,-2.8e-05,-3.6e-05,-8.2e-05,-2.5e-05,5e-06,-3.6e-05,-5e-05,-2e-06,9e-06,-1.7e-05,-1.9e-05,-9e-06,-2.7e-05,-1e-05,-1.2e-05
3.7e-05,-4e-06,-2.4e-05,2.5e-05,-6.3e-05,5.3e-05,6e-06,9.2e-05,-3.2e-05,-0.000249,-0.000159,2.6e-05,-1.2e-05,0.000173,-0.000133,-3.4e-05,-0.000169,-3.4e-05,0.00022,-0.000389,-0.000269,0.000301,-0.000192,-0.001727,-0.00039,-0.000356,-2.1e-05,-0.00043,-0.001867,7e-06,-0.000465,-0.001592,-0.003636,-0.001537,-0.00089,-0.000845,-0.000695,-0.000616,5e-06,-0.001214,-2.4e-05,0.000589,-0.00065,-0.000448,0.001541,0.000319,9.8e-05,-0.001214,-0.000461,-0.000361,-8.1e-05,-0.00044,-0.000175,0.000301,0.000479,0.000279,-0.000582,0.001147,-0.000157,-8e-05,-0.000388,-0.000357,-2.3e-05,-0.000225,-7.5e-05,0.000285,0.000141,4e-06,-0.000158,-4.5e-05,3.7e-05,0.000222,-2.2e-05,-6.3e-05,5.7e-05,7.8e-05,0.000192,0.000158,-3.6e-05,-3e-04,5.4e-05,0.000118,6.4e-05,-5.5e-05,0.000373,-0.000289,-8e-05,-0.000309,-0.000108,0,0.000136,0.00015,-3e-05,-2e-06,-1.8e-05,-3.7e-05,-1e-06,8e-06,-2.6e-05,2.6e-05,1e-05,-3.9e-05,1.1e-05,-4.4e-05,-5.6e-05,0.000122,1.4e-05,4.2e-05,-3.1e-05,-1.9e-05,-2.1e-05,2e-06,1e-05,7e-06,-3e-06,2.7e-05,-1.2e-05,2.1e-05,-1e-05,1e-05,-2.1e-05
9e-06,1e-05,1.4e-05,2.4e-05,7.4e-05,7e-06,-2.3e-05,-0.000103,-0.000111,3.6e-05,-0.000213,-5e-05,8.4e-05,-9e-05,8.6e-05,-4.3e-05,0.000275,-4.1e-05,-2.9e-05,-0.000118,0.000554,-2.7e-05,0.000301,0.000544,-0.000264,0.00155,-7.1e-05,-0.000674,-0.000297,0.000191,-0.000481,5.3e-05,0.004383,0.000348,0.000462,-0.003528,0.000814,-0.00016,-0.00114,-0.000689,0.001229,-0.001031,-0.000636,-0.000273,0.000237,-0.000146,-0.000528,-0.000144,0.000442,0.000673,-0.000689,0.000155,0.000464,-0.000289,-0.00068,8.7e-05,-0.000192,-0.000334,-0.000377,-0.00012,-0.000279,0.000448,2.9e-05,2.4e-05,0.000225,-4.3e-05,-5.4e-05,5.3e-05,-8.7e-05,-2.5e-05,-4e-05,5.4e-05,4.4e-05,-8.3e-05,-8.4e-05,-0.000123,3.6e-05,-2.5e-05,5.4e-05,3.8e-05,0.000158,5e-06,4.6e-05,-1e-06,0.000161,0.000442,-5.9e-05,0.000129,1.1e-05,8.6e-05,3.3e-05,-1.1e-05,3.9e-05,-9e-06,8e-06,6e-05,-6.1e-05,-4.3e-05,-1e-06,3.4e-05,2.2e-05,-4e-06,4e-06,-2.1e-05,-2.1e-05,-0.000159,1.2e-05,-1.6e-05,2.3e-05,3e-06,-1.1e-05,1.9e-05,8e-06,1.1e-05,8e-06,2.3e-05,2e-06,2.5e-05,-2.5e-05,-1.2e-05,-2.2e-05
-8e-06,-6e-06,-3.2e-05,1.8e-05,-1.3e-05,8e-06,2.7e-05,0.000178,0.000196,-6.7e-05,0.000201,8e-05,-5.1e-05,0.000122,-2.1e-05,4e-06,-5.9e-05,-2.2e-05,5e-06,-1.7e-05,9.7e-05,0.000121,0.000658,0.001184,0.000968,-0.000864,-0.000474,-0.001573,0.000495,-0.000419,-0.000361,-0.002004,-0.001064,0.000242,-6.7e-05,0.000172,6e-05,0.000689,0.000237,0.001325,-0.00099,0.000423,-0.000103,-0.000189,-0.000166,0.000489,-0.000505,0.000593,9.8e-05,-0.000445,0.000184,-8.1e-05,-6.8e-05,0.000225,-0.000394,-0.000199,-0.000177,9.7e-05,0.000448,5.7e-05,0.000187,-0.000238,2.8e-05,-5e-05,2.7e-05,-4.7e-05,3.2e-05,-1e-06,5.7e-05,-0.000114,4.5e-05,-3.5e-05,0.000126,6.8e-05,0.000319,0.000199,2.1e-05,0.000135,9.4e-05,-0.000103,-6.5e-05,-1.6e-05,4e-06,4.9e-05,-8e-06,-0.000196,3e-06,-6e-06,0.000117,2.9e-05,-0.000122,-2.2e-05,-4.2e-05,2.7e-05,-3e-06,-1.3e-05,-5e-06,9e-06,3.4e-05,2.5e-05,1e-05,-1.6e-05,1.5e-05,-2e-05,2e-06,0.000182,8.4e-05,-3.7e-05,3.6e-05,8e-06,6e-06,-8e-06,-1.2e-05,-1.2e-05,1.2e-05,1.6e-05,1.4e-05,4e-06,1.8e-05,1.3e-05,8e-06
1.4e-05,1.5e-05,-9e-06,9e-06,-2.5e-05,-4e-05,-1e-06,-5.2e-05,-0.000176,5e-05,-0.000175,-0.00028,-2.3e-05,-4.9e-05,5e-06,4e-06,4.1e-05,6.9e-05,-0.000159,0.000111,0.000256,-9e-06,-0.000535,-0.000759,0.000681,8.8e-05,-0.000344,-3e-05,0.000415,9.4e-05,-0.000454,0.001373,-0.000755,-0.000316,0.001043,0.000617,0.000232,-0.000354,2.6e-05,-0.000226,0.000513,-0.000243,0.000357,0.000487,-0.000377,-0.000144,0.000868,-0.000256,-0.000288,5.6e-05,0.000199,-0.000213,8.6e-05,-9.6e-05,5.6e-05,0.000102,0.000126,-4.4e-05,-0.000373,-7.9e-05,-5e-06,0.00012,1.8e-05,3.3e-05,-1.2e-05,9e-06,-1.3e-05,3e-06,3.6e-05,2e-05,-2e-05,-0.000102,4e-06,-1.8e-05,0.000174,1.2e-05,-4e-06,1.2e-05,-4.6e-05,-3.5e-05,-7.9e-05,-2.8e-05,-3.6e-05,1.3e-05,-0.000154,-1.4e-05,1.2e-05,-1e-06,-1e-06,-2.1e-05,4.3e-05,4.5e-05,2.2e-05,-4e-06,-1.1e-05,1.1e-05,-2.2e-05,0,6e-06,2.3e-05,5e-06,1.5e-05,-1.2e-05,-2e-05,8e-06,7.9e-05,-4.9e-05,-1.3e-05,4e-05,-2.2e-05,-5e-06,0,-2e-06,-5e-06,1e-06,-8e-06,-1.2e-05,6e-06,6e-06,-3e-06,8e-06
4e-06,-7e-06,6e-06,6e-06,1.8e-05,4.9e-05,-1.8e-05,-2.5e-05,3.5e-05,-3.8e-05,0.000139,0.00023,8.1e-05,6.3e-05,2.6e-05,-1.4e-05,-0.00014,-0.000101,-8e-06,0.000105,-0.000274,-3.5e-05,-0.000255,-6.7e-05,-0.000497,-0.000112,9.6e-05,0.000159,-0.000671,0.000217,0.000264,-0.00036,0.000465,0.000491,-0.000217,-0.000321,-0.000496,0.000445,8.7e-05,0.000223,-0.000233,-0.000242,8e-06,0.000208,0.000458,-2.8e-05,-0.001277,0.000237,0.000369,-0.000231,-0.000233,-9.7e-05,-3e-06,-5.4e-05,7.4e-05,-0.000116,-5.1e-05,-0.000154,0.000372,6e-05,3.6e-05,-0.000303,7e-06,-2.9e-05,4.3e-05,-1.5e-05,4.5e-05,-2.9e-05,-3.3e-05,-5e-06,-2.3e-05,-2.5e-05,1.5e-05,4.8e-05,-0.000262,1.5e-05,-6.9e-05,-1.3e-05,-4.3e-05,6.2e-05,-2.6e-05,4.3e-05,5.4e-05,-2.3e-05,2.4e-05,0.000197,4.4e-05,-5.6e-05,3.4e-05,-2.9e-05,-3e-06,-1.2e-05,-2.4e-05,7e-06,0,1.7e-05,1.9e-05,1e-06,-1.3e-05,6e-06,-4e-06,-6e-06,-1e-05,-3e-06,1e-06,-0.000161,6.1e-05,3e-06,8e-06,2e-05,4e-06,-5e-06,9e-06,0,0,-1e-06,0,7e-06,9e-06,4e-06,-1e-06
-4e-06,5e-06,-6e-06,2e-06,-3e-06,-1.6e-05,1e-06,1.5e-05,-6.9e-05,-1e-06,-7.1e-05,-7.5e-05,-2.9e-05,-7.7e-05,-3.2e-05,-3.6e-05,4.3e-05,0.000131,3.9e-05,-0.000182,0.000255,4.8e-05,0.000436,-0.00017,0.00012,-0.000532,-3.5e-05,-9.9e-05,-0.000445,0.000517,0.000191,-0.000337,-0.000573,-0.000241,-0.000515,-0.000683,-0.00078,-0.000527,0.000131,-0.00042,0.000592,0.000404,-0.000277,-0.000292,-0.000393,0.000137,0.000452,-0.000507,8.8e-05,0.000223,0.000118,-0.000239,0.000159,4.8e-05,1.9e-05,-4.3e-05,-0.000154,-0.000182,0.000102,3e-05,0.000158,9e-05,-3.5e-05,6.8e-05,4.3e-05,-1.3e-05,-3.6e-05,1e-06,-5e-06,-2.2e-05,2e-05,-1.8e-05,-1e-06,6e-06,0.000211,-5.3e-05,0.000115,4.3e-05,-2.7e-05,-6e-06,-8e-06,-2.6e-05,3.1e-05,-1.4e-05,-1.1e-05,-0.000166,1.1e-05,1.9e-05,-4.9e-05,2.6e-05,-9e-06,4e-06,8e-06,7e-06,-5e-06,-3e-06,-1e-05,-8e-06,-1.2e-05,-1.6e-05,4e-06,4e-06,-9e-06,-1e-06,-1.4e-05,5e-05,-4e-06,1.6e-05,-2.7e-05,-3e-06,1e-06,-1.7e-05,-3e-06,-8e-06,6e-06,7e-06,6e-06,-1.4e-05,0,0,6e-06
0,-3e-06,7e-06,8e-06,-4e-06,-7e-06,-5e-06,0,5.6e-05,-9e-06,1.3e-05,-2.5e-05,2.5e-05,4.3e-05,-1.6e-05,-4.3e-05,-3.4e-05,-9e-05,4.8e-05,5e-06,-0.000204,-1.1e-05,0.000195,-4.9e-05,0.000176,0.000115,-0.000155,0.00028,0.000119,1.7e-05,7.2e-05,-0.000666,0.000752,-0.000149,0.000482,0.000791,0.000247,0.00022,-2.1e-05,0.000254,-6.5e-05,-0.000548,0.000125,-0.000161,0.000426,4.8e-05,8.4e-05,0.000335,-0.00016,3.2e-05,-0.000132,0.000279,-0.000166,-0.000118,1e-05,0.00019,-8e-06,-0.000199,-0.000403,-4.1e-05,-6.7e-05,4.3e-05,6e-06,2.9e-05,-2.6e-05,2e-05,1.8e-05,-8e-06,-1.6e-05,-1e-05,-1.4e-05,-3e-06,-1.2e-05,-9e-06,-6.9e-05,3e-05,-8.8e-05,4.6e-05,-1.6e-05,2e-06,-1.7e-05,7e-06,1.8e-05,3e-06,1.2e-05,4.1e-05,-2.7e-05,3e-05,8e-06,2.5e-05,2.4e-05,-2.8e-05,-1.3e-05,3e-06,-1e-06,-2e-06,2.3e-05,-1.6e-05,-8e-06,-1.9e-05,-1e-05,-3e-06,-6e-06,-4e-06,9e-06,-7.8e-05,-2.1e-05,-9e-06,-1.2e-05,-5e-06,6e-06,-2e-06,0,1e-06,-1e-06,-4e-06,-8e-06,-2e-06,-4e-06,1e-06,-3e-06
1.2e-05,5e-06,4e-06,1.1e-05,1e-06,9e-06,2.7e-05,-1.7e-05,-2.6e-05,-4e-06,3.2e-05,4.9e-05,1.7e-05,-2.7e-05,4.2e-05,6.4e-05,4e-05,5.8e-05,1.5e-05,0.000168,-8.1e-05,3.2e-05,-0.000232,4.1e-05,0.000108,-0.000293,6.2e-05,0.000147,0.000288,0.000131,5.1e-05,6.8e-05,3.2e-05,-0.000168,0.000692,-9.7e-05,1e-06,-2.4e-05,-0.000126,2.5e-05,2.9e-05,0.000428,-0.000172,7.3e-05,3e-05,-0.000113,0.000194,8.2e-05,8.8e-05,-0.000205,0.000127,9.6e-05,0.000126,0.00013,-0.000107,-2e-06,-2.5e-05,0.000112,9.5e-05,0,-3.9e-05,0.000109,4.8e-05,4e-06,-2.1e-05,5.7e-05,-3.9e-05,-1.8e-05,4.4e-05,-1e-06,1.7e-05,6e-06,1.1e-05,1.5e-05,-0.000116,-4.7e-05,7.6e-05,4e-06,3.7e-05,-6e-05,5e-05,6e-06,-1.9e-05,1.1e-05,3.4e-05,-9.1e-05,-3.2e-05,-2.1e-05,1.3e-05,-9e-06,-1e-06,-1.1e-05,6e-06,6e-06,3e-06,2e-06,6e-06,7e-06,3e-06,-1.3e-05,8e-06,-1e-06,-4e-06,0,1e-05,3.4e-05,1.9e-05,-5e-06,-1e-06,-4e-06,-3e-06,6e-06,0,4e-06,2e-06,7e-06,3e-06,4e-06,-5e-06,0,-4e-06
5e-06,-2e-06,3e-06,4e-06,-4e-06,1.6e-05,-2.3e-05,4e-06,-3.5e-05,3.7e-05,3.4e-05,2e-06,-2.7e-05,4e-05,-3.1e-05,5.3e-05,6.3e-05,-1.6e-05,-9.5e-05,-0.000119,-2.4e-05,3e-06,-0.000177,0.000257,-0.000105,0.000556,9.6e-05,0.000107,-8.3e-05,-4.7e-05,-0.000101,0.000852,-1.8e-05,-8.1e-05,-0.000674,2.6e-05,0.000297,0.000157,-2e-06,-0.000276,4.7e-05,-0.000175,9.1e-05,6.3e-05,-0.000155,-0.000138,-2.5e-05,-0.000154,-6e-05,0.000153,5.9e-05,-8.9e-05,8.4e-05,-5e-06,6e-06,-5.1e-05,0.000115,-3.6e-05,-3.4e-05,-2.3e-05,-6.8e-05,-4.7e-05,-1.7e-05,7e-06,-2.5e-05,1.1e-05,1.9e-05,6e-06,2.3e-05,-6e-06,1e-06,1.7e-05,-6e-06,-2.8e-05,6.8e-05,4.2e-05,2.7e-05,-1e-06,1e-05,6e-06,4.3e-05,-8e-06,-1e-05,-1e-06,-5.8e-05,0,-2.4e-05,-3.8e-05,1e-05,1e-06,1.8e-05,1.1e-05,-1.1e-05,-5e-06,-5e-06,-2e-05,-7e-06,7e-06,2e-06,-5e-06,1e-06,-1e-06,7e-06,6e-06,-4e-06,4e-06,-2.5e-05,3e-06,0,-2e-06,-2e-06,-3e-06,3e-06,1e-06,3e-06,0,1e-06,-2e-06,2e-06,1e-06,-4e-06
-2e-06,-1e-06,-9e-06,8e-06,1e-06,-2e-06,6e-06,2e-06,2.7e-05,-2.7e-05,-4.4e-05,-2e-05,3e-05,-1.7e-05,-2e-06,-3.4e-05,-6.6e-05,-3.2e-05,-1.1e-05,-1.5e-05,-8e-06,1.6e-05,0.000258,4.9e-05,-0.000111,-0.000251,-0.00016,-1e-04,-0.000137,0.000127,-0.000154,-0.000707,-0.000651,0.000226,-9.3e-05,0.000274,-0.000323,3e-06,6.9e-05,0.000192,-0.00038,-7.6e-05,0.000124,1.2e-05,3e-06,1e-04,-6.5e-05,8.3e-05,-3.8e-05,-0.000157,4.4e-05,0.00011,-0.000182,-4.4e-05,1.1e-05,-4.8e-05,-3e-06,0.000109,-4.7e-05,3.4e-05,-3.1e-05,3.5e-05,-1.4e-05,-1.1e-05,-2.3e-05,2.3e-05,-1.6e-05,2.7e-05,-3.3e-05,7e-06,-1.8e-05,2.2e-05,-1e-06,2.7e-05,-7.5e-05,-5.8e-05,7e-06,2.1e-05,-2.3e-05,-3.6e-05,-2.2e-05,-5e-06,2e-06,-6e-06,0.000106,2e-06,-1.1e-05,3.8e-05,-1e-05,-6e-06,4e-06,7e-06,8e-06,-2e-06,-5e-06,-1e-05,-4e-06,-4e-06,1e-06,2e-06,4e-06,-4e-06,-1e-06,0,-5e-06,4.3e-05,-1.4e-05,2e-06,-4e-06,8e-06,1e-06,-4e-06,-1e-06,-2e-06,0,6e-06,-2e-06,1e-06,1e-06,0,1e-06
4e-06,1e-06,1e-06,-4e-06,3e-06,-1.7e-05,0,-7e-06,-9e-06,2.2e-05,2e-06,-7e-06,-1.6e-05,2.2e-05,2e-05,-1.7e-05,8e-06,4.9e-05,-6e-06,2.7e-05,7.9e-05,1e-05,9.1e-05,-7.6e-05,-0.00011,0.000366,-8.5e-05,0.000197,-0.000308,-1.3e-05,-0.000159,0.000177,0.000421,-0.000132,0.000528,0.00064,4.1e-05,-0.000134,-4.5e-05,-0.00036,0.000188,0.000102,-9.4e-05,6.4e-05,0.000171,-2.2e-05,0.000223,-0.00022,-3.3e-05,5.7e-05,0.000106,-0.000143,9.3e-05,-6.5e-05,-3.5e-05,6e-06,2.8e-05,8.4e-05,0.000272,-1.9e-05,5.7e-05,-5.1e-05,2.1e-05,-1.8e-05,-7e-06,5e-06,1.2e-05,2.1e-05,5e-06,6e-06,1.6e-05,9e-06,4e-06,-5e-06,2e-06,3.5e-05,1.4e-05,2e-06,-5e-06,6e-05,1e-05,-1.3e-05,7e-06,1e-06,-8.7e-05,1e-05,-7e-06,-2.6e-05,-1.1e-05,-1e-06,-1.2e-05,8e-06,1e-06,-6e-06,4e-06,4e-06,-5e-06,-2e-06,-2e-06,5e-06,-5e-06,-1e-06,3e-06,3e-06,2e-06,-4.6e-05,0,-9e-06,1e-05,-5e-06,2e-06,-2e-06,0,-2e-06,0,-5e-06,0,6e-06,2e-06,0,2e-06
1e-06,0,-4e-06,2e-06,-3e-06,1.5e-05,-4e-06,7e-06,2.5e-05,-3e-05,3.6e-05,1.3e-05,-5e-06,-1.3e-05,-1e-05,6e-06,-1.9e-05,-4.1e-05,5.3e-05,1.3e-05,-3.6e-05,-3e-06,-0.000158,3.3e-05,9e-05,-0.000265,-4e-06,9.8e-05,-0.000186,8.3e-05,-9e-06,-0.000526,1.6e-05,-6.5e-05,-5.8e-05,-0.000156,-3e-06,7.9e-05,-2.2e-05,0.000383,-8.4e-05,7.2e-05,-5.9e-05,1.2e-05,-0.000108,-3.1e-05,-0.000136,0.00024,-5.5e-05,-2.9e-05,-4.2e-05,0.000111,5.2e-05,8.5e-05,-2.2e-05,3.5e-05,-3.6e-05,-4e-06,-0.000265,-2e-06,5e-06,4.3e-05,5e-06,-1.1e-05,-3e-06,-2e-05,-1.1e-05,-5e-06,1.2e-05,-1.5e-05,-7e-06,-3e-06,-4e-06,-3e-06,1.6e-05,-2.8e-05,-3e-06,-1.3e-05,-1e-05,-3.4e-05,-2.9e-05,-5e-06,0,0,-4.8e-05,1.1e-05,-8e-06,2.2e-05,-3e-06,1.5e-05,1.2e-05,5e-06,-3e-06,-1e-06,1e-06,0,-8e-06,-6e-06,-4e-06,9e-06,3e-06,2e-06,-1e-06,5e-06,3e-06,9e-06,4e-06,3e-06,1.2e-05,-1e-06,-1e-06,2e-06,-2e-06,0,1e-06,-2e-06,3e-06,0,2e-06,0,1e-06
-1e-06,1e-06,-3e-06,6e-06,2e-06,-2e-06,-4e-06,-1e-06,-2.7e-05,2.3e-05,-4e-05,-3.1e-05,2.1e-05,1.5e-05,1.3e-05,-2e-06,4.3e-05,2.1e-05,-5e-06,8e-06,0.000107,8e-06,-0.000133,-0.00026,-3.7e-05,0.00033,2.5e-05,0.000115,-0.000221,4.2e-05,0.000106,0.000528,-1e-04,-2.3e-05,0.000259,0.000144,-1.5e-05,7e-06,2.6e-05,-6.2e-05,0.000127,-0.000265,2e-06,-9.9e-05,0.000107,2.8e-05,0.000118,-7.8e-05,-0.000108,-6.5e-05,-6e-06,-0.00016,-0.000104,2.2e-05,-3.3e-05,-2.8e-05,4.4e-05,1.5e-05,5.1e-05,2.2e-05,3.9e-05,-2.3e-05,-1.5e-05,-4.2e-05,-5.3e-05,8e-06,2.3e-05,-2e-06,6e-06,1.5e-05,-4e-06,-1.2e-05,4e-06,1.3e-05,4.9e-05,2.5e-05,4e-06,-1e-06,3e-06,2e-05,-1.1e-05,-5e-06,2e-06,-2e-06,8.1e-05,2.1e-05,-2e-06,-2.3e-05,4e-06,9e-06,7e-06,-1.3e-05,1e-06,1e-06,-5e-06,1.4e-05,3e-06,6e-06,-6e-06,7e-06,-3e-06,0,-2e-06,3e-06,-1e-06,-2.7e-05,0,-2e-06,3e-06,0,1e-06,-3e-06,2e-06,-1e-06,2e-06,3e-06,-1e-06,0,-3e-06,1e-06,-1e-06
-1e-06,1e-06,-2e-06,2e-06,0,2e-06,1e-06,-4e-06,1.7e-05,-3e-06,1.2e-05,1.1e-05,-2.6e-05,-1.4e-05,-1e-05,-1.7e-05,-1.4e-05,0,-2.5e-05,-3.4e-05,-6e-05,-7e-06,0.000163,6.9e-05,-3.7e-05,-0.000375,-6.2e-05,-0.000307,-3.2e-05,4.2e-05,8.4e-05,-3.1e-05,9.3e-05,2.5e-05,-0.000248,-1.7e-05,-5.4e-05,0.000211,4e-05,-0.00013,2.6e-05,0.000247,7.9e-05,-9.3e-05,-4.1e-05,-8.5e-05,-6.6e-05,-6.1e-05,8.2e-05,0.000121,-7.2e-05,-2.1e-05,4e-06,-3.7e-05,-5e-06,-9e-06,0,-0.000106,8.6e-05,-4.2e-05,-2.5e-05,-1.1e-05,1.2e-05,1.9e-05,-1.8e-05,1e-06,-2.7e-05,3e-06,-4e-06,-2e-06,1.4e-05,-1.2e-05,1e-06,-7e-06,-2.8e-05,-4e-06,-1.5e-05,2e-06,2e-05,-2.6e-05,-1e-05,-9e-06,2e-06,-1e-06,2.3e-05,-1e-05,-7e-06,8e-06,5e-06,-8e-06,-1.5e-05,3e-06,-3e-06,1e-06,0,-6e-06,8e-06,0,-3e-06,1e-06,7e-06,0,-1e-06,0,-2e-06,2e-05,1e-05,3e-06,-3e-06,3e-06,0,0,1e-06,-1e-06,0,4e-06,-2e-06,-1e-06,-1e-06,-2e-06,-2e-06
2e-06,0,3e-06,-3e-06,-3e-06,1e-06,8e-06,4e-06,7e-06,1e-05,-1e-06,6e-06,1.6e-05,5e-06,-8e-06,2e-06,2.3e-05,-7e-06,-2.3e-05,3e-05,4.4e-05,5e-06,5.3e-05,0.000251,3.9e-05,0.00014,3e-06,-5.8e-05,3.8e-05,9e-06,0.000128,-8.4e-05,0.000141,5.8e-05,-0.000206,-0.000134,-0.000145,-0.000297,1.9e-05,-2.8e-05,6.6e-05,-9.7e-05,1.9e-05,9e-05,-0.00018,0.000104,-6.6e-05,2.1e-05,5.7e-05,-7e-05,-9e-06,3.7e-05,6e-05,-1.6e-05,3.1e-05,-2e-05,7e-06,1.2e-05,-0.000101,2.4e-05,-7e-06,-2e-05,5e-06,-6e-06,-8e-06,2e-06,1.3e-05,-9e-06,-1e-06,0,-1.3e-05,-4e-06,0,7e-06,5e-06,2e-06,1.3e-05,-1e-05,-4e-06,-7e-06,9e-06,0,2e-06,2e-06,-3.3e-05,5e-06,-9e-06,-7e-06,3e-06,-8e-06,8e-06,6e-06,1e-06,2e-06,1e-06,5e-06,-6e-06,-3e-06,4e-06,-1e-06,-1e-06,-2e-06,-3e-06,2e-06,-1e-06,9e-06,5e-06,-4e-06,-6e-06,-1e-06,0,1e-06,-2e-06,1e-06,0,0,3e-06,-4e-06,0,1e-06,1e-06
3e-06,-1e-06,0,-2e-06,5e-06,-1e-06,-6e-06,-1e-06,6e-06,-7e-06,0,1.5e-05,1e-06,-1.2e-05,1.8e-05,2.5e-05,-3e-05,1.1e-05,-4e-06,-7e-06,-5.6e-05,-4e-06,-9.5e-05,-0.000158,3.3e-05,-0.000241,6e-06,6.2e-05,-0.000172,5e-06,4e-06,-0.000205,-0.000427,-4.3e-05,0.000453,-0.000492,0.000177,1.8e-05,-3.2e-05,0.000108,-4.1e-05,-3.4e-05,-6.7e-05,4.7e-05,0.00011,2.5e-05,-3.5e-05,3.7e-05,-5.4e-05,-1e-06,-4.8e-05,-1e-06,-4.3e-05,1.5e-05,1.8e-05,-9e-06,-3.1e-05,-8.6e-05,0.000111,1.9e-05,4e-06,2.9e-05,-6e-06,1.8e-05,-1.5e-05,1.3e-05,-1.2e-05,-1.4e-05,-1.2e-05,0,5e-06,2e-06,4e-06,-2e-06,4.1e-05,-1.5e-05,9e-06,-1e-05,-7e-06,3e-06,1.3e-05,-3e-06,0,2e-06,-4.2e-05,-8e-06,-5e-06,1.6e-05,0,3e-06,1.1e-05,-6e-06,-4e-06,0,-1e-06,6e-06,5e-06,-3e-06,-1e-06,-4e-06,-1e-06,-1e-06,0,0,2e-06,1.6e-05,0,3e-06,-4e-06,-4e-06,0,-3e-06,-1e-06,-1e-06,1e-06,-2e-06,-2e-06,-1e-06,0,0,-1e-06
-2e-06,-1e-06,1e-06,1e-06,-1e-06,3e-06,-1e-06,-3e-06,1e-06,-4e-06,1.2e-05,-1.3e-05,-1.1e-05,2e-06,-4e-06,-2.3e-05,9e-06,-9e-06,3.1e-05,-3.2e-05,2.2e-05,2e-06,-9e-05,-5.2e-05,-2.9e-05,9.8e-05,3e-05,-3e-05,-2e-04,-1e-06,-7.1e-05,-6.8e-05,0.000187,-4e-06,0.000128,-4.3e-05,2.6e-05,0.000127,-3.4e-05,0.000157,6e-05,6.1e-05,-8e-06,-1.8e-05,0.000114,-7.5e-05,-9.1e-05,4e-06,3.1e-05,4e-05,-2.6e-05,7.2e-05,-1.5e-05,4e-05,-3.2e-05,1.3e-05,-1.6e-05,3.6e-05,-6.7e-05,-2e-05,-2.2e-05,8e-06,1.1e-05,-4e-06,-3e-06,5e-06,1.2e-05,-4e-06,2e-05,0,2e-06,5e-06,-2e-06,1e-06,-4.9e-05,8e-06,-5e-06,2e-06,-2e-06,-2e-06,1.2e-05,1e-06,0,0,4.3e-05,-1e-05,-4e-06,-1.6e-05,-2e-06,5e-06,-7e-06,2e-06,3e-06,0,0,-1e-06,-5e-06,1e-06,-2e-06,-7e-06,-2e-06,0,0,-2e-06,1e-06,-2e-05,2e-06,-1e-06,-2e-06,3e-06,0,-1e-06,1e-06,0,0,2e-06,-1e-06,-2e-06,1e-06,0,1e-06
0,0,0,1e-06,-5e-06,-4e-06,3e-06,2e-06,-7e-06,2e-06,-5e-06,-8e-06,1.7e-05,-6e-06,-1e-06,1.7e-05,-1.7e-05,1e-06,0,3.7e-05,-3.3e-05,1e-06,9.6e-05,-3.9e-05,-2.6e-05,1.8e-05,-2.1e-05,-0.000102,-7.7e-05,1.2e-05,-6.5e-05,0.00037,0.000114,-5.5e-05,-0.000382,-0.000167,2.7e-05,7.7e-05,4e-06,-0.000311,-2.4e-05,-7.7e-05,2.8e-05,-3e-05,-2.8e-05,-6e-06,-1.5e-05,1.8e-05,8.3e-05,-3.5e-05,3.2e-05,-3.2e-05,9.1e-05,-9e-06,-4.6e-05,-3e-06,-7e-06,1.7e-05,-7e-05,-3e-06,1.8e-05,-9e-06,4e-06,7e-06,-1.2e-05,0,-1.1e-05,8e-06,-7e-06,1e-06,-7e-06,4e-06,0,3e-06,1.1e-05,-1.5e-05,8e-06,-6e-06,-6e-06,1.2e-05,5e-06,-4e-06,4e-06,-2e-06,-9e-06,1e-06,-5e-06,2e-06,-1e-06,2e-06,1e-06,-8e-06,-4e-06,-1e-06,0,-4e-06,-2e-06,4e-06,-2e-06,-5e-06,1e-06,-2e-06,1e-06,-1e-06,-2e-06,1e-05,1e-06,0,0,2e-06,0,1e-06,0,0,0,3e-06,2e-06,0,1e-06,-1e-06,1e-06
2e-06,1e-06,-2e-06,1e-06,4e-06,-2e-06,-4e-06,1e-06,1.5e-05,4e-06,-9e-06,2e-05,-1.2e-05,3e-06,6e-06,1.1e-05,1.9e-05,4e-06,-6e-06,-3e-06,1.3e-05,-2e-06,4.7e-05,-3.9e-05,6e-06,7.9e-05,-3.4e-05,6.5e-05,3.8e-05,-4e-06,-4e-05,-0.000254,-0.000191,-2.3e-05,9.7e-05,-0.000138,-0.000113,-0.000143,1.4e-05,0.000124,-3e-06,9.3e-05,3e-06,-2.8e-05,9e-06,4.9e-05,5.3e-05,-8e-05,-1e-06,1e-06,-2.5e-05,-2.3e-05,-4.4e-05,-4.2e-05,-1.5e-05,1.8e-05,-6e-06,4.4e-05,0.00013,-7e-06,-1e-05,1.7e-05,-8e-06,8e-06,-1.5e-05,1e-06,9e-06,5e-06,-3e-06,0,8e-06,4e-06,2e-06,0,6e-06,1.3e-05,1e-06,-1e-05,8e-06,-8e-06,-1.2e-05,-1e-06,-2e-06,-2e-06,1.3e-05,-2.4e-05,-7e-06,-1e-06,0,1e-06,0,-2e-06,3e-06,0,-1e-06,-7e-06,1e-06,-4e-06,-3e-06,0,-1e-06,1e-06,0,-1e-06,-1e-06,-2.9e-05,-4e-06,-1e-06,1e-06,-1e-06,0,0,-1e-06,0,1e-06,-1e-06,0,1e-06,0,1e-06,0
-2e-06,-1e-06,-2e-06,-1e-06,1e-06,-2e-06,-1e-06,-2e-06,-1e-05,1e-06,1.1e-05,-2.4e-05,4e-06,1e-06,-9e-06,-2.1e-05,2e-05,-7e-06,-2.7e-05,-2.1e-05,3e-06,5e-06,-4.2e-05,-1.1e-05,3.4e-05,9.6e-05,1.1e-05,2e-06,-2e-06,2.3e-05,-5e-06,-9e-06,0.000211,6.7e-05,0.00022,-1.5e-05,7.8e-05,-5.1e-05,2.4e-05,-6e-06,-8.1e-05,-6.8e-05,2.1e-05,-4.9e-05,-4.8e-05,-3e-06,-7e-05,7.6e-05,-4.3e-05,-2.4e-05,1.1e-05,6.1e-05,-2e-06,1.3e-05,2e-06,-2e-06,-9e-06,1.7e-05,-8.7e-05,1.2e-05,3e-05,-2e-05,4e-06,-1e-06,9e-06,1e-06,-5e-06,0,3e-06,-1e-06,-4e-06,1e-06,0,2e-06,-1.7e-05,-4e-06,6e-06,-2e-06,4e-06,6e-06,0,2e-06,-4e-06,0,-1.8e-05,2e-05,-8e-06,1.2e-05,1e-06,-5e-06,-1e-06,1.3e-05,-3e-06,1e-06,0,-5e-06,-2e-06,-2e-06,-1e-06,3e-06,3e-06,-1e-06,0,-1e-06,1e-06,2.8e-05,-2e-06,1e-06,5e-06,-2e-06,0,0,1e-06,0,0,-1e-06,-1e-06,1e-06,0,0,0
-1e-06,0,0,1e-06,-5e-06,5e-06,0,2e-06,8e-06,-9e-06,-2e-06,4e-06,6e-06,5e-06,6e-06,-8e-06,-2.5e-05,6e-06,1e-06,1e-05,-2e-06,-4e-06,-7.9e-05,9.1e-05,1.4e-05,-5.2e-05,1.9e-05,-5.2e-05,-2.2e-05,6e-06,3.4e-05,-0.000211,-0.000137,5e-06,-9.8e-05,0.000263,6e-05,9.7e-05,0,3.3e-05,5e-05,-1.7e-05,-2.4e-05,-3e-06,-0.000129,-5.3e-05,3.7e-05,1e-06,-2.5e-05,7e-06,2e-06,-7.5e-05,4.6e-05,1.8e-05,2.3e-05,-1.4e-05,-1.4e-05,0,9e-06,-2e-06,-1.3e-05,-3e-06,7e-06,0,8e-06,-9e-06,8e-06,3e-06,-3e-06,0,-2e-06,-2e-06,1e-06,0,-2e-06,6e-06,-1.4e-05,-1e-06,-5e-06,-1.3e-05,-1.6e-05,2e-06,-4e-06,3e-06,0,-4e-06,-5e-06,-1.4e-05,0,-3e-06,1e-06,-7e-06,4e-06,0,0,3e-06,2e-06,0,0,3e-06,-2e-06,1e-06,0,-1e-06,0,-1e-05,-7e-06,1e-06,1e-06,3e-06,0,-2e-06,1e-06,0,0,1e-06,1e-06,1e-06,0,0,-1e-06
1e-06,0,-1e-06,0,3e-06,0,5e-06,0,-1.3e-05,-1e-06,-1.9e-05,9e-06,-1.1e-05,1e-06,2e-06,9e-06,6e-06,-4e-06,1e-05,1.1e-05,1.8e-05,5e-06,6.4e-05,-3.2e-05,-3.8e-05,-9e-06,-1.5e-05,3e-05,-0.000128,-7e-06,3.5e-05,0.000264,-5.5e-05,-5.4e-05,7.9e-05,-2.8e-05,-2.8e-05,1e-05,-2.2e-05,-2e-05,4.2e-05,6.2e-05,-1.6e-05,5.9e-05,0.000121,4.3e-05,-1.7e-05,-3.7e-05,-2.1e-05,1.5e-05,1.9e-05,1.3e-05,-4.6e-05,1.2e-05,0,1.1e-05,2e-06,-3e-06,4.8e-05,-1e-06,-8e-06,-1.3e-05,-7e-06,-2e-06,-8e-06,4e-06,-1.4e-05,6e-06,0,2e-06,6e-06,-3e-06,-1e-06,0,2e-06,-1e-05,1e-05,-5e-06,-1e-06,3e-06,6e-06,-4e-06,3e-06,1e-06,3.2e-05,1.3e-05,-5e-06,-4e-06,-1e-06,4e-06,-4e-06,5e-06,-3e-06,0,-1e-06,-2e-06,1e-06,3e-06,0,3e-06,-1e-06,-1e-06,0,0,-2e-06,1.5e-05,6e-06,-2e-06,2e-06,1e-06,0,0,0,0,0,1e-06,1e-06,1e-06,0,0,0
0,1e-06,-1e-06,0,2e-06,-6e-06,0,-1e-06,9e-06,0,1.9e-05,-4e-06,9e-06,0,-9e-06,1.1e-05,-1.6e-05,5e-06,1.3e-05,4e-06,-1.2e-05,-4e-06,4.7e-05,-5.1e-05,-2.3e-05,-0.000113,-8e-06,8.8e-05,-0.00013,2e-06,3.2e-05,-1e-04,0.000102,-2e-06,-0.000145,5.7e-05,-2.3e-05,3.8e-05,-6e-06,-0.000123,-4.1e-05,-2.3e-05,2e-06,2.5e-05,5.2e-05,-1.6e-05,8.8e-05,2.4e-05,5e-06,0,2e-05,-2.8e-05,-5e-06,-3.1e-05,-3.4e-05,1.2e-05,0,-3.5e-05,-0.000101,4e-06,-6e-06,1.9e-05,0,-5e-06,4e-06,-1e-06,1.2e-05,0,2e-06,-3e-06,-7e-06,-3e-06,-1e-06,0,1.2e-05,1e-05,-1e-06,-6e-06,-3e-06,-8e-06,-1e-06,4e-06,2e-06,0,-4.4e-05,-3e-06,-6e-06,1.7e-05,-1e-06,5e-06,2e-06,-3e-06,1e-06,-1e-06,0,2e-06,1e-06,0,-1e-06,3e-06,0,0,-1e-06,-1e-06,-1e-06,-1.1e-05,-7e-06,1e-06,-1e-06,-2e-06,0,0,0,-1e-06,0,-2e-06,-1e-06,0,0,0,0
0,0,1e-06,-1e-06,-3e-06,3e-06,-6e-06,2e-06,-7e-06,8e-06,2e-06,0,-3e-06,-2e-06,9e-06,-1.9e-05,5e-06,-5e-06,-1e-06,-2.2e-05,1.7e-05,4e-06,-1.9e-05,3.2e-05,9e-06,5.2e-05,2.6e-05,5.7e-05,-9.1e-05,-7e-06,-2e-06,3e-06,9.8e-05,4e-06,-2.8e-05,0.000133,-6.6e-05,-0.000116,8e-06,0.000119,1e-04,-6e-05,3.2e-05,-2.2e-05,-1.4e-05,2e-06,-1.7e-05,-4.5e-05,-9e-06,-9e-06,9e-06,-1e-06,1.8e-05,1e-05,-1.4e-05,2e-06,6e-06,-1.9e-05,9.2e-05,-1.2e-05,-1.9e-05,-1.6e-05,5e-06,3e-06,1.3e-05,4e-06,-9e-06,-4e-06,-4e-06,0,4e-06,-1e-06,2e-06,1e-06,-9e-06,-8e-06,-4e-06,5e-06,-2e-06,9e-06,9e-06,3e-06,1e-06,-1e-06,5e-06,-1e-06,-3e-06,-1.5e-05,0,-1e-06,5e-06,-5e-06,0,0,1e-06,1e-06,0,-4e-06,-2e-06,0,0,0,0,0,0,1e-06,7e-06,0,-4e-06,0,0,-1e-06,0,0,0,-1e-06,1e-06,0,0,0,0
0,0,1e-06,1e-06,2e-06,0,3e-06,-1e-06,0,-4e-06,-1.2e-05,2e-06,-5e-06,-2e-06,-3e-06,9e-06,8e-06,2e-06,-1.5e-05,6e-06,-2e-05,-3e-06,-7.8e-05,-3.7e-05,2.2e-05,-6.9e-05,3e-06,-5.5e-05,-5e-06,-5e-06,-1.2e-05,-0.000122,-0.000146,1.1e-05,0.000307,0.000139,6.4e-05,-1e-06,3e-06,-1.1e-05,-6.3e-05,8.3e-05,3e-06,-2e-05,-1.5e-05,2.3e-05,3e-05,8e-05,-2.3e-05,0,1.9e-05,6e-05,-2.8e-05,1.4e-05,1e-06,-1e-05,-2e-06,1e-06,-1e-06,0,3.5e-05,2.2e-05,-4e-06,-1.5e-05,0,2e-06,7e-06,-5e-06,1e-06,2e-06,0,1e-06,-1e-06,0,1.1e-05,7e-06,7e-06,-3e-06,5e-06,-1e-06,1e-06,-2e-06,-1e-06,-1e-06,2.4e-05,1e-06,-3e-06,7e-06,1e-06,-3e-06,-4e-06,6e-06,-1e-06,0,-1e-06,2e-06,0,-1e-06,-3e-06,-3e-06,0,0,0,0,1e-06,-8e-06,1e-06,0,-4e-06,2e-06,0,0,0,0,0,2e-06,1e-06,-1e-06,0,0,0
0,0,-1e-06,0,1e-06,0,0,-1e-06,-2e-06,-4e-06,2e-06,2e-06,1e-05,-4e-06,-2e-06,1.1e-05,9e-06,2e-06,-8e-06,2.2e-05,1.2e-05,2e-06,4.2e-05,-2e-06,2e-06,0.000103,-8e-06,-5.7e-05,1.8e-05,4e-06,-3e-05,2.2e-05,2.1e-05,1.1e-05,-0.000111,-6.1e-05,-1.3e-05,7.5e-05,5e-06,5.8e-05,2.2e-05,-3.5e-05,-3.1e-05,-8e-06,-2.5e-05,-3e-05,6.4e-05,-5.5e-05,3.1e-05,2.2e-05,-2e-06,-5.1e-05,-6e-06,1e-06,7e-06,-4e-06,2e-06,5e-06,-6.8e-05,1.2e-05,-8e-06,-1.7e-05,1e-06,7e-06,1e-06,2e-06,-7e-06,-2e-06,4e-06,-2e-06,-5e-06,3e-06,-1e-06,1e-06,7e-06,-6e-06,-2e-06,-2e-06,0,4e-06,0,2e-06,1e-06,0,9e-06,-9e-06,-4e-06,-1.2e-05,1e-06,-1e-06,-2e-06,-3e-06,0,0,-1e-06,5e-06,-1e-06,2e-06,-1e-06,-4e-06,1e-06,0,0,0,0,8e-06,1e-06,-1e-06,1e-06,1e-06,0,0,0,0,0,0,-1e-06,0,0,0,0
0,0,0,-1e-06,-2e-06,-1e-06,1e-06,1e-06,-1e-06,-4e-06,1.3e-05,-5e-06,-1e-05,-2e-06,4e-06,-9e-06,-8e-06,-4e-06,0,-2e-05,-1.6e-05,-1e-06,4.4e-05,3.2e-05,-9e-06,-4.8e-05,-8e-06,5.3e-05,-0.000101,1e-06,-2.7e-05,0.00013,4.5e-05,-2.1e-05,-0.000241,0.00016,0,3.5e-05,-8e-06,-0.000116,-4.7e-05,8e-06,-2e-06,-7e-06,-6.5e-05,1e-06,-4.9e-05,-2e-06,4.8e-05,-4e-05,-3e-06,4.9e-05,2.9e-05,-9e-06,2e-06,2e-06,-2e-06,2.4e-05,8.9e-05,-4e-06,7e-06,1.1e-05,2e-06,-1e-06,1.2e-05,-4e-06,8e-06,-3e-06,-6e-06,0,6e-06,2e-06,1e-06,0,-9e-06,6e-06,2e-06,1e-06,-2e-06,-4e-06,-2e-06,3e-06,2e-06,0,-3.3e-05,1e-06,-4e-06,1.6e-05,0,1e-06,6e-06,2e-06,0,0,0,-1e-06,1e-06,3e-06,0,-2e-06,-1e-06,0,0,0,-1e-06,-5e-06,1e-06,1e-06,4e-06,-3e-06,0,0,0,0,0,-1e-06,0,0,0,0,0
-1e-06,0,0,-1e-06,1e-06,2e-06,-3e-06,-1e-06,3e-06,4e-06,-1e-06,-3e-06,6e-06,-2e-06,-6e-06,-1e-05,-7e-06,3e-06,1.2e-05,-6e-06,1e-05,0,2e-06,-7e-06,-7e-06,8.9e-05,4e-06,5.9e-05,-0.000132,-2e-06,-9e-06,-0.000102,-8.9e-05,9e-06,0.000199,4.7e-05,8e-06,-6.7e-05,2e-06,1e-05,1.7e-05,-2.1e-05,1.4e-05,1.9e-05,0.000101,2e-05,1.5e-05,1.8e-05,-3e-06,1.5e-05,-1.1e-05,-2.2e-05,-3.1e-05,-1e-05,-2.3e-05,-2e-06,4e-06,-2e-06,-7.1e-05,-9e-06,-5e-06,-9e-06,-3e-06,5e-06,2e-06,2e-06,-5e-06,-2e-06,6e-06,1e-06,-4e-06,1e-06,-1e-06,0,-7e-06,-7e-06,0,4e-06,0,-7e-06,-7e-06,-2e-06,0,1e-06,3e-06,-7e-06,-5e-06,-1.2e-05,0,1e-06,-3e-06,-1e-06,0,0,0,0,-1e-06,-2e-06,-1e-06,-1e-06,0,0,0,1e-06,0,1.1e-05,4e-06,0,1e-06,0,0,-1e-06,0,0,0,-1e-06,1e-06,-1e-06,0,0,-1e-06
0,0,-1e-06,0,0,2e-06,2e-06,0,-3e-06,5e-06,-1.4e-05,0,1e-06,2e-06,-1e-06,1.1e-05,-2e-06,-1e-06,4e-06,1.4e-05,-8e-06,2e-06,-8e-05,-8e-06,6e-06,-6.3e-05,1e-06,-6.7e-05,-7.6e-05,2e-06,9e-06,1.5e-05,7.7e-05,-1.7e-05,8.3e-05,-0.000113,1.7e-05,-3e-05,2e-06,0.00012,2.4e-05,1.9e-05,8e-06,2e-05,-1.7e-05,-1e-05,-2.8e-05,-1.1e-05,-2.5e-05,1.1e-05,-8e-06,4e-06,1.2e-05,1.6e-05,-1.6e-05,0,-2e-06,2.1e-05,8e-06,0,-1.2e-05,1.9e-05,2e-06,2e-06,4e-06,-2e-06,5e-06,0,-2e-06,-1e-06,0,0,1e-06,1e-06,1e-06,5e-06,-1e-06,-2e-06,-1e-06,0,3e-06,1e-06,1e-06,1e-06,2.6e-05,5e-06,-4e-06,5e-06,0,2e-06,-2e-06,-3e-06,-2e-06,0,0,-2e-06,1e-06,-4e-06,0,0,0,0,0,0,1e-06,-9e-06,-4e-06,-2e-06,-3e-06,2e-06,0,0,1e-06,0,0,2e-06,-1e-06,0,0,0,0
0,0,0,-1e-06,-1e-06,-2e-06,0,1e-06,4e-06,0,5e-06,4e-06,-7e-06,1e-06,6e-06,5e-06,3e-06,0,-3e-06,-3e-06,1e-05,-1e-06,1.8e-05,-2.8e-05,2e-06,3.1e-05,6e-06,-3.7e-05,-1.2e-05,-4e-06,1.6e-05,-0.000135,3.5e-05,-1.9e-05,-0.00011,-0.000206,6e-06,4.9e-05,-1e-06,-8.2e-05,-4e-05,1.1e-05,-2e-06,-4e-06,-1.3e-05,-1.4e-05,2.2e-05,5.3e-05,-8e-06,-2.5e-05,-2e-06,1.1e-05,2.4e-05,-7e-06,4e-06,-3e-06,-3e-06,-2.7e-05,6.3e-05,1e-06,1.6e-05,-1.7e-05,1e-06,-4e-06,6e-06,-1e-06,-1e-05,4e-06,0,1e-06,4e-06,-1e-06,1e-06,0,8e-06,-5e-06,3e-06,1e-06,1e-06,-2e-06,-4e-06,0,-2e-06,-1e-06,-1.6e-05,3e-06,-4e-06,-3e-06,0,-1e-06,4e-06,3e-06,2e-06,0,0,-3e-06,-3e-06,1e-06,-1e-06,2e-06,0,-1e-06,0,0,0,5e-06,0,1e-06,1e-06,0,0,1e-06,0,0,0,0,0,0,0,0,0
