3.6e-05,8e-05,0.000117,6.3e-05,1.8e-05,9.9e-05,0.000104,4.9e-05,5.7e-05,9.3e-05,6.9e-05,1.8e-05,8.4e-05,8.3e-05,2.2e-05,2.9e-05,3.3e-05,3.4e-05,2.2e-05,1e-05,2.1e-05,2.5e-05,2.7e-05,1e-06,1.1e-05,1.9e-05,1e-06,6e-06,0,3e-06,5e-06,6e-06,7e-06,5e-06,4e-06,4e-06,1.2e-05,1.4e-05,1.2e-05,8e-06,1.3e-05,1.4e-05,1.4e-05,2.9e-05,0,5e-06,6e-06,5e-06,3e-06,1.2e-05,0,8e-06,1e-06,1.1e-05,9e-06,8e-06,1e-06,1.3e-05,3e-06,1e-05,1e-05,2.1e-05,1.7e-05,4e-06,4e-06,1.3e-05,5e-06,1.4e-05,1.1e-05,4e-06,2e-06,1e-05,1.2e-05,2e-06,1.3e-05,8e-06,4e-06,1e-06,1.3e-05,2e-06,1e-06,1e-06,6e-06,2e-05,3e-06,1e-06,1.2e-05,1e-06,0,3e-06,7e-06,1e-06,0,1e-06,1e-05,5e-06,5e-06,2e-06,1e-06,7e-06,2e-06,5e-06,6e-06,3e-06,2e-06,3e-06,1e-06,1.6e-05,7e-06,0,7e-06,4e-06,8e-06,1e-05,4e-06,7e-06,1e-06,1.1e-05,9e-06,5e-06,1e-06
0.000241,0.000313,0.000388,0.00027,0.000253,0.000334,0.000343,0.000264,0.000274,0.000321,0.000262,0.000172,0.000289,0.000284,0.000141,0.00013,0.000145,0.000156,0.000117,8.1e-05,8.8e-05,8e-05,9e-05,4.9e-05,3.3e-05,3.3e-05,3.1e-05,3.3e-05,1.1e-05,2.1e-05,2.7e-05,1.3e-05,2.6e-05,9e-06,9e-06,1.2e-05,3.8e-05,2.9e-05,2.5e-05,2.8e-05,4.4e-05,5.2e-05,5.1e-05,4.7e-05,2.5e-05,1.2e-05,1.7e-05,1.5e-05,3e-06,3.2e-05,6e-06,2.2e-05,1e-06,2.6e-05,2.4e-05,1.7e-05,1.4e-05,2.1e-05,9e-06,3.1e-05,3.2e-05,5.9e-05,1.8e-05,1.6e-05,2.7e-05,3.6e-05,1.3e-05,1.7e-05,2.9e-05,8e-06,3e-06,2.7e-05,2.2e-05,1e-05,2e-05,2.2e-05,2.3e-05,1.4e-05,1.7e-05,5e-06,1.2e-05,1.8e-05,1.3e-05,5.3e-05,1.2e-05,2e-05,8e-06,5e-06,1.2e-05,1.3e-05,2.2e-05,2.4e-05,2.1e-05,7e-06,3.5e-05,1.3e-05,6e-06,3e-06,1.1e-05,2.5e-05,1.3e-05,1.9e-05,8e-06,1.2e-05,1.6e-05,1.4e-05,5e-06,3.9e-05,0,1.8e-05,2e-05,1.7e-05,1.6e-05,3e-05,3.9e-05,1.3e-05,6e-06,2e-05,1.3e-05,1.3e-05,1e-05
0.000745,0.00074,0.00065,0.000624,0.000604,0.00064,0.000545,0.000549,0.000648,0.000598,0.000474,0.00054,0.000521,0.000343,0.000374,0.00033,0.000198,0.000207,0.000177,0.000153,0.000147,0.000135,7.8e-05,0.000125,9.7e-05,4.3e-05,7.4e-05,2.7e-05,3.6e-05,3.4e-05,1.9e-05,4.5e-05,8.4e-05,7e-05,6.2e-05,2.9e-05,3.1e-05,6.3e-05,2.8e-05,3.3e-05,1.3e-05,2.1e-05,1.9e-05,8.6e-05,5.5e-05,4.8e-05,4.7e-05,6e-06,5e-06,5.2e-05,4.4e-05,2.6e-05,2.3e-05,4e-05,3.8e-05,5.6e-05,4e-05,2.8e-05,2.8e-05,3.8e-05,8.3e-05,3.1e-05,7.1e-05,5.2e-05,4e-06,4.5e-05,1.9e-05,1.7e-05,1.2e-05,3.1e-05,1.6e-05,3.4e-05,2.7e-05,9e-06,6.9e-05,3.4e-05,9e-06,1.5e-05,2.1e-05,4.8e-05,5.5e-05,1.9e-05,3.8e-05,5.2e-05,4.6e-05,2.8e-05,7.5e-05,2.7e-05,2.6e-05,3.1e-05,4e-06,5.8e-05,1.6e-05,3e-05,2.9e-05,3.9e-05,2.9e-05,1e-05,2.8e-05,4.7e-05,2.3e-05,9e-06,1.5e-05,2.5e-05,5.6e-05,8e-06,2.6e-05,5.2e-05,3.9e-05,2.7e-05,3.4e-05,4.8e-05,4.1e-05,5e-06,1.4e-05,2.6e-05,2.3e-05,3.5e-05,1.8e-05,2e-05,2.4e-05
0.000365,0.000159,0.000176,0.000202,0.000215,0.000173,0.000133,0.000182,0.000164,0.000217,4.7e-05,0.000224,0.000157,5.4e-05,0.000193,5.9e-05,2.6e-05,0.000137,5.5e-05,5.5e-05,5.8e-05,5.2e-05,2.9e-05,7.6e-05,3.5e-05,3.1e-05,6.7e-05,4.1e-05,7.9e-05,6e-05,6.1e-05,3.3e-05,5.6e-05,6.2e-05,3.2e-05,4.9e-05,3.2e-05,3.6e-05,5.4e-05,4.5e-05,3.6e-05,2.6e-05,3.3e-05,7.9e-05,5.4e-05,9.2e-05,4.2e-05,3.4e-05,4.5e-05,9e-05,8.2e-05,7.3e-05,5.9e-05,2.5e-05,1.5e-05,7.1e-05,2.8e-05,1.8e-05,5.5e-05,4.5e-05,8.7e-05,4.2e-05,7.7e-05,3.7e-05,2.4e-05,3.2e-05,6.9e-05,8e-05,5.2e-05,7e-05,3.9e-05,5e-06,2.9e-05,5.6e-05,0.000136,7.3e-05,2.6e-05,5.1e-05,4.4e-05,8.2e-05,1.3e-05,3.5e-05,6.6e-05,8.6e-05,6.3e-05,8.9e-05,8.1e-05,7e-05,5.7e-05,6.8e-05,3e-05,7.3e-05,6.1e-05,4.6e-05,1.8e-05,6.3e-05,1.6e-05,1.4e-05,3.4e-05,1.6e-05,2.6e-05,1.6e-05,1e-05,4.2e-05,6.1e-05,7.4e-05,8.2e-05,7.2e-05,6.3e-05,5.9e-05,3.6e-05,4.7e-05,4.9e-05,5.5e-05,5.7e-05,6.7e-05,2.7e-05,2.6e-05,4.9e-05,4.1e-05,3.9e-05
0.000235,0.00021,0.000134,0.000102,0.000177,0.000128,6.9e-05,0.000187,7.2e-05,0.000124,0.000131,6.8e-05,9.7e-05,6e-05,5.7e-05,4.7e-05,9.7e-05,4.5e-05,6.3e-05,7.5e-05,6.9e-05,2.2e-05,1.3e-05,5.3e-05,3.2e-05,5.1e-05,1.9e-05,3.8e-05,4e-05,4.7e-05,4.9e-05,4.9e-05,2.5e-05,2.8e-05,4.5e-05,3.5e-05,4.1e-05,3e-06,5e-05,6.2e-05,4.5e-05,4.2e-05,3.6e-05,4.9e-05,3e-05,8.2e-05,2.1e-05,1.7e-05,4.1e-05,5.4e-05,1e-05,5.2e-05,4.6e-05,1.2e-05,2.3e-05,8.1e-05,5e-05,6.4e-05,5.6e-05,6.6e-05,4.1e-05,3.7e-05,4.8e-05,3e-05,3.7e-05,2.2e-05,3.7e-05,7.1e-05,2e-06,6.4e-05,4.5e-05,3.8e-05,2.8e-05,2.9e-05,8.4e-05,5.7e-05,3.1e-05,7.2e-05,4.7e-05,7.2e-05,4.6e-05,6.2e-05,1.1e-05,7e-06,3.2e-05,9e-05,2.3e-05,4.2e-05,3.7e-05,5e-05,2.2e-05,4.3e-05,5e-05,1.8e-05,5.3e-05,5.1e-05,4.6e-05,2e-05,3.5e-05,1.9e-05,2.2e-05,2e-06,1.6e-05,1.5e-05,2.4e-05,4e-05,5.6e-05,2.9e-05,1.8e-05,3.4e-05,4.3e-05,3e-05,2.9e-05,4.4e-05,5.6e-05,2.9e-05,1.7e-05,9e-06,2.3e-05,2.1e-05,5e-05
0.000117,0.000166,0.000186,0.000151,0.000144,0.000209,0.000117,5.9e-05,0.000185,0.000149,5e-05,6e-05,6e-05,2.5e-05,3.1e-05,0.000101,9.5e-05,4.5e-05,5e-06,2.1e-05,5.6e-05,3.3e-05,2.2e-05,3.5e-05,7.5e-05,8.6e-05,5e-05,4.3e-05,6e-05,3.7e-05,3.3e-05,5.8e-05,5.4e-05,5.2e-05,4.7e-05,8.2e-05,6.9e-05,5.2e-05,3.3e-05,3.1e-05,6.2e-05,8.4e-05,5.9e-05,6.3e-05,2.7e-05,2e-06,5.4e-05,4.8e-05,7.8e-05,4.5e-05,3.4e-05,5.2e-05,3.4e-05,4e-06,2.6e-05,4.8e-05,3.1e-05,8.9e-05,7.8e-05,8.9e-05,8.3e-05,5.2e-05,4.4e-05,2.4e-05,3.8e-05,1.1e-05,2.3e-05,5.9e-05,6.4e-05,6.4e-05,7.4e-05,2e-05,5.8e-05,5.6e-05,0.000103,0.000122,9.7e-05,2.5e-05,4.3e-05,7.6e-05,1.8e-05,9.7e-05,6.5e-05,7.9e-05,5e-05,6.6e-05,5e-05,3.5e-05,3.7e-05,7.3e-05,4.2e-05,4.7e-05,5.2e-05,5.8e-05,3.7e-05,1.5e-05,3.3e-05,2.8e-05,2.6e-05,2.4e-05,1.8e-05,3.8e-05,4.4e-05,2.8e-05,2.2e-05,5e-05,1.8e-05,2.4e-05,1e-06,3.6e-05,2.8e-05,2.6e-05,2.6e-05,1.2e-05,4.6e-05,5.6e-05,2.8e-05,1.6e-05,1.2e-05,2.9e-05,3.5e-05
0.000176,0.000192,5.6e-05,3.9e-05,0.000229,6.5e-05,3.7e-05,5.6e-05,0.000176,0.000166,0.000166,2.7e-05,4.6e-05,3.2e-05,6.2e-05,0.000136,6e-05,0.000101,8.7e-05,4e-05,5.3e-05,6.7e-05,0.000108,6.2e-05,7.2e-05,5.1e-05,1.4e-05,4.2e-05,0.000118,8.4e-05,2.1e-05,6.1e-05,5.2e-05,4.3e-05,1.3e-05,4.3e-05,0.000101,9.3e-05,9e-05,8.9e-05,6e-05,8.6e-05,0.000146,0.000102,9.6e-05,8.3e-05,6e-05,2.2e-05,6.5e-05,6.6e-05,2.2e-05,1.2e-05,5.1e-05,3.7e-05,4.6e-05,3.2e-05,4.1e-05,9.7e-05,0.00015,7.8e-05,3.1e-05,5.4e-05,4.9e-05,1.1e-05,3.2e-05,4.3e-05,4.3e-05,6e-05,0.000105,8.6e-05,2.8e-05,5.3e-05,5.4e-05,3.5e-05,0.000106,5.1e-05,4.6e-05,7.1e-05,0.000106,8e-05,2.6e-05,0.000123,6.8e-05,8.7e-05,9e-05,2.9e-05,8.4e-05,3.2e-05,7.3e-05,7.8e-05,8.9e-05,0.000114,0.000122,5.1e-05,5.5e-05,0.000105,1.5e-05,8e-05,9.3e-05,8.1e-05,5.6e-05,4e-05,3.3e-05,1.9e-05,2.6e-05,4.8e-05,1.4e-05,4.3e-05,4.7e-05,3e-05,1.7e-05,1e-05,4.7e-05,4.3e-05,1.5e-05,3e-05,3.6e-05,3.3e-05,1.1e-05,2.8e-05,3.7e-05
5.1e-05,6.5e-05,9.7e-05,0.000125,0.000302,0.000149,6.9e-05,6.2e-05,6.3e-05,0.000127,4.9e-05,5.2e-05,4.6e-05,3.9e-05,8.9e-05,8.1e-05,9.3e-05,7.8e-05,7.1e-05,0.000107,5.1e-05,3.4e-05,8.4e-05,5e-06,6.2e-05,2.9e-05,1.7e-05,3.8e-05,0.000123,0.000109,0.000118,7.5e-05,8.6e-05,3e-05,4.4e-05,6e-05,4.6e-05,6.3e-05,3.7e-05,3.1e-05,7.6e-05,5.6e-05,0.000104,5.6e-05,9.6e-05,2e-04,0.00018,0.000101,7.7e-05,4.3e-05,2.2e-05,3.7e-05,3.6e-05,2e-05,4.8e-05,6.1e-05,6.4e-05,0.000103,0.000108,9e-05,8.6e-05,6e-05,1.6e-05,3.9e-05,4e-06,4e-05,1e-04,7.2e-05,6.4e-05,1.3e-05,1e-05,5.1e-05,3.3e-05,2.7e-05,0.000101,0.00011,0.000113,7.2e-05,8.4e-05,0.000108,2.7e-05,0.000127,0.000141,5.9e-05,2.5e-05,9.3e-05,0.000124,8.5e-05,8.9e-05,6e-06,0.000108,4.9e-05,9.1e-05,4e-05,2.7e-05,0.000103,9.5e-05,0.000122,1.8e-05,4.2e-05,3.1e-05,6.1e-05,9.3e-05,2e-05,4.1e-05,7.8e-05,2.6e-05,5.8e-05,2.4e-05,7e-05,4.5e-05,3.4e-05,1.9e-05,1.1e-05,8.9e-05,3.7e-05,3.7e-05,4.4e-05,3.4e-05,3.2e-05,8e-06
6.1e-05,8.3e-05,5.7e-05,0.000108,0.000131,5.4e-05,4.1e-05,8e-05,7.7e-05,7.1e-05,5.4e-05,2.2e-05,5.8e-05,4.1e-05,8.5e-05,4.3e-05,6.5e-05,6.2e-05,1.5e-05,8.1e-05,9e-05,2.4e-05,8.9e-05,8.6e-05,5.2e-05,1.9e-05,2.7e-05,3.2e-05,9.7e-05,2.4e-05,8e-05,0.000161,6.8e-05,6.7e-05,4e-05,5.4e-05,9.7e-05,0.000102,8.5e-05,4.9e-05,9.4e-05,0.00013,0.000168,0.000156,0.000152,8.3e-05,5.7e-05,1.7e-05,8.4e-05,7e-05,1.4e-05,6.2e-05,5.1e-05,4.2e-05,3.5e-05,9e-05,7.3e-05,9.9e-05,4.3e-05,9e-05,2.2e-05,0.000113,8.6e-05,8.7e-05,3.7e-05,3e-05,0.000128,2.7e-05,5.8e-05,6.4e-05,4.9e-05,7.2e-05,7.3e-05,8.2e-05,0.000121,7e-05,0.000116,3.6e-05,4.2e-05,4e-05,9.8e-05,9.7e-05,4.5e-05,1.6e-05,8.3e-05,0.000173,5.7e-05,0.000113,0.000119,8.3e-05,7.9e-05,4.4e-05,1e-04,4.2e-05,8.3e-05,3e-05,4e-05,1.1e-05,1.3e-05,6.3e-05,6.2e-05,9e-06,6.2e-05,9.3e-05,9e-05,4.4e-05,9.4e-05,7.1e-05,7.5e-05,0.000127,9.5e-05,2.3e-05,1.1e-05,1.9e-05,0.00012,0.000109,8.2e-05,8e-05,6.1e-05,7.7e-05,1.6e-05
1.2e-05,7.7e-05,2.5e-05,8.3e-05,0.000136,0.000145,8.9e-05,4.8e-05,6.9e-05,4.4e-05,9e-06,3.5e-05,6.7e-05,2.9e-05,7.9e-05,7.6e-05,2.9e-05,5.3e-05,2.3e-05,3.9e-05,0.000105,8.1e-05,0.000119,9e-05,5.7e-05,1.2e-05,4.1e-05,4.2e-05,9.8e-05,7.4e-05,8.8e-05,9.8e-05,8.1e-05,3.7e-05,3.3e-05,5.2e-05,6.6e-05,0.000106,0.000104,5.5e-05,2.7e-05,5e-05,4.1e-05,5.6e-05,7.4e-05,6.9e-05,3.1e-05,3.7e-05,6.2e-05,0.000174,0.000137,0.000126,4.6e-05,8.6e-05,0.000108,2.4e-05,6.2e-05,0.000149,0.000116,6.6e-05,6.4e-05,0.000107,5.7e-05,6.2e-05,3.2e-05,1.3e-05,0.000127,0.000135,3.6e-05,3.9e-05,6e-05,0.000157,6.5e-05,2.9e-05,9.2e-05,0.000117,5e-05,8.3e-05,1e-04,0.000133,0.000182,0.000205,0.000136,1.1e-05,9.9e-05,0.000131,0.000234,0.000119,3.5e-05,6.9e-05,0.000115,5.7e-05,4.7e-05,7.4e-05,0.000105,8.3e-05,5.1e-05,1.5e-05,2.9e-05,7.9e-05,4.6e-05,4.2e-05,1.3e-05,6.4e-05,9.3e-05,8.5e-05,9.7e-05,2.4e-05,1.3e-05,9.8e-05,3.1e-05,2.7e-05,2.2e-05,1.1e-05,0.00011,7.6e-05,2e-05,8.6e-05,0.000126,8.1e-05,8.6e-05
3.9e-05,8.9e-05,6.3e-05,5e-05,4.5e-05,9e-05,3.5e-05,7.8e-05,3.2e-05,1.9e-05,3.9e-05,5.5e-05,4.4e-05,4.9e-05,5.3e-05,2.3e-05,6e-05,2.6e-05,4.1e-05,3.2e-05,8.1e-05,4.1e-05,6.3e-05,2.8e-05,2.4e-05,4.4e-05,5.1e-05,4.8e-05,6.6e-05,1.8e-05,9.3e-05,8.6e-05,9.7e-05,9.3e-05,7.1e-05,5e-05,8.5e-05,6.2e-05,3.9e-05,1e-05,2.3e-05,9.7e-05,9.6e-05,8e-06,0.000105,9e-05,3.5e-05,2.4e-05,7e-05,0.000164,6.8e-05,2.3e-05,7.8e-05,6.6e-05,2.5e-05,8.1e-05,1.6e-05,8.2e-05,0.000114,0.000106,6.1e-05,6.5e-05,4.3e-05,4.5e-05,5.3e-05,1.5e-05,1e-04,4.9e-05,9.3e-05,4.1e-05,5.6e-05,0.000105,0.000104,2.6e-05,5e-05,2e-05,8.2e-05,8e-05,3.4e-05,0.000113,9.6e-05,2e-05,1.6e-05,4.6e-05,3.4e-05,3.8e-05,0.000121,7.8e-05,9e-06,6.2e-05,7.3e-05,7.9e-05,7.3e-05,4.5e-05,3.1e-05,6.1e-05,3.1e-05,8.4e-05,7e-05,1.7e-05,6.7e-05,2.7e-05,6.2e-05,3.8e-05,3.3e-05,1.8e-05,3.6e-05,5.2e-05,2.7e-05,4.2e-05,4.6e-05,2.7e-05,4.9e-05,4.5e-05,4e-05,2.4e-05,1.9e-05,5.3e-05,3.2e-05,2.3e-05,3.6e-05
3.1e-05,1e-04,7.7e-05,7.7e-05,7.5e-05,4.4e-05,3.7e-05,8.6e-05,7.4e-05,5.3e-05,1.2e-05,6e-05,1.9e-05,5.8e-05,9.3e-05,7.8e-05,6.8e-05,5.9e-05,5.7e-05,4e-05,3.7e-05,2.1e-05,4.5e-05,4.6e-05,7.3e-05,2e-06,2.4e-05,4.3e-05,2.2e-05,5.7e-05,0.000104,7.9e-05,2e-06,7.2e-05,6.9e-05,5.6e-05,0.000108,8e-05,4.9e-05,1.4e-05,1.5e-05,0.000114,0.000131,6.3e-05,6.2e-05,2.3e-05,5e-05,5.6e-05,3.5e-05,0.000114,6e-05,2.5e-05,5.7e-05,5e-05,7.3e-05,8.4e-05,5.6e-05,4.4e-05,0.000107,7.3e-05,4.7e-05,4.5e-05,4.4e-05,4.3e-05,2.1e-05,6.8e-05,1.7e-05,7.7e-05,3e-05,4.4e-05,8.2e-05,2.1e-05,4.5e-05,4.7e-05,2.4e-05,1.6e-05,6.5e-05,1.6e-05,5.2e-05,1.5e-05,4.2e-05,1.7e-05,4e-05,2.7e-05,2.8e-05,4.5e-05,2.2e-05,8.1e-05,7.2e-05,7.5e-05,2.9e-05,3.4e-05,2.5e-05,2e-05,3.1e-05,6.9e-05,3.4e-05,8.3e-05,7.8e-05,6.6e-05,4e-05,5.6e-05,5e-05,4e-05,1.7e-05,4.6e-05,5.7e-05,2.5e-05,7.5e-05,4.8e-05,4.8e-05,2.5e-05,3.9e-05,3.8e-05,3.7e-05,4.7e-05,2.4e-05,1e-05,4.7e-05,3.8e-05,3.2e-05
4.5e-05,7.8e-05,4.5e-05,1.6e-05,3.3e-05,6.2e-05,1.8e-05,5e-06,3.9e-05,2.3e-05,3.9e-05,4.1e-05,3.5e-05,2.9e-05,4.8e-05,7.1e-05,2.4e-05,2.7e-05,3.6e-05,2e-05,4.7e-05,3.8e-05,9e-06,1.2e-05,5.2e-05,6.2e-05,4.7e-05,4.6e-05,6.8e-05,4.3e-05,1.1e-05,2e-05,8e-06,4.5e-05,1.7e-05,4e-05,0.000125,2.2e-05,2.7e-05,1.9e-05,3.4e-05,0.00013,1.2e-05,4e-05,1.5e-05,2.8e-05,3.1e-05,6.2e-05,2.8e-05,6.5e-05,4.7e-05,5.1e-05,9.4e-05,5.5e-05,6.5e-05,3.5e-05,5.2e-05,3.1e-05,6.8e-05,3e-05,6.2e-05,2.6e-05,5.6e-05,6e-05,6.4e-05,3.1e-05,5.1e-05,2.7e-05,4.2e-05,6.7e-05,9.1e-05,5.2e-05,1.8e-05,2.2e-05,2.9e-05,4.2e-05,4.4e-05,3e-05,6.5e-05,5e-05,5.8e-05,2.9e-05,5e-05,1.9e-05,3.2e-05,1.5e-05,0.000107,0.000135,5.3e-05,1.9e-05,2.1e-05,1e-05,4.1e-05,4.9e-05,5.8e-05,5.3e-05,8.6e-05,1.2e-05,1.3e-05,3.4e-05,1.5e-05,2.9e-05,6.6e-05,3.2e-05,4e-06,8.9e-05,9.5e-05,0.000101,4.5e-05,1.5e-05,1.8e-05,9e-06,1.6e-05,1.9e-05,4.8e-05,3.1e-05,3.6e-05,6e-06,2.9e-05,1.6e-05,4.4e-05
3.5e-05,3.2e-05,5.7e-05,6e-06,4.5e-05,4e-05,4e-05,6.8e-05,3.5e-05,4.8e-05,5.5e-05,5.6e-05,7.8e-05,3.6e-05,6.8e-05,1.5e-05,8e-06,1.5e-05,2.9e-05,4.8e-05,4.5e-05,3.3e-05,2.1e-05,2.4e-05,3.8e-05,2.4e-05,5.1e-05,1.6e-05,5.6e-05,7.9e-05,7.4e-05,7.4e-05,5.2e-05,3.7e-05,5e-05,6.7e-05,4e-05,5.4e-05,2.9e-05,2.7e-05,2.7e-05,5e-05,5e-05,7.9e-05,7.2e-05,3.4e-05,3.1e-05,0.000105,7.3e-05,3.1e-05,3.6e-05,3.9e-05,7.9e-05,0.000104,9e-05,0.00012,5.4e-05,7e-05,3.6e-05,5e-05,7.9e-05,3.9e-05,4.8e-05,2.7e-05,5e-05,4.7e-05,0.000109,7.1e-05,8e-05,3e-05,4.5e-05,9.1e-05,0.000134,7.5e-05,4.6e-05,6.3e-05,3.6e-05,3.1e-05,2.8e-05,5.4e-05,6e-05,8.2e-05,6.7e-05,8.4e-05,3.1e-05,3.3e-05,0.000127,3.4e-05,2.2e-05,2.2e-05,2e-05,4.5e-05,3.1e-05,4.4e-05,5.7e-05,5.8e-05,4.7e-05,4.9e-05,2.5e-05,3.5e-05,1.9e-05,1.4e-05,3.4e-05,4.4e-05,2.4e-05,9.1e-05,3.4e-05,4.2e-05,6.7e-05,5.3e-05,4.5e-05,2.1e-05,4e-05,2.1e-05,3.8e-05,4.9e-05,5e-05,3.8e-05,1.9e-05,3.2e-05,3.8e-05
4.1e-05,7.9e-05,4.9e-05,0.000104,8.8e-05,7.7e-05,8.8e-05,2.5e-05,2.8e-05,6.6e-05,8.1e-05,4.6e-05,2.7e-05,7.2e-05,8.2e-05,4.5e-05,1e-05,3e-05,5.2e-05,5.9e-05,9.1e-05,0.00011,6.6e-05,4.7e-05,1.2e-05,3.9e-05,4.4e-05,3.1e-05,3.6e-05,0.00014,7.4e-05,1.4e-05,1.8e-05,5.5e-05,8.1e-05,5.7e-05,4.1e-05,3.8e-05,3.2e-05,8.3e-05,5.4e-05,5.4e-05,2e-05,2.7e-05,6.9e-05,8.3e-05,4.8e-05,8.9e-05,5.4e-05,7.4e-05,0.000102,9e-06,3.1e-05,8.4e-05,6.9e-05,0.000107,6.8e-05,4.5e-05,3e-05,4.1e-05,0.000127,0.000104,7.9e-05,6.5e-05,2.6e-05,1.1e-05,0.000114,0.000125,2.1e-05,8e-05,6.2e-05,1.9e-05,0.000134,8.6e-05,3.5e-05,1.3e-05,6e-06,4.2e-05,1.8e-05,5e-05,1.8e-05,4.9e-05,4.5e-05,5.5e-05,8e-06,5.4e-05,4.5e-05,9.7e-05,5.6e-05,5.8e-05,6e-05,7.2e-05,8e-05,5.8e-05,9.6e-05,0.000124,6.3e-05,5e-06,2.6e-05,3.6e-05,5.3e-05,2.4e-05,1.4e-05,5.6e-05,6.2e-05,6.5e-05,2.9e-05,2.5e-05,6.5e-05,2.8e-05,6e-06,7e-06,6.4e-05,6.2e-05,6e-05,4e-05,1.6e-05,3.2e-05,5.1e-05,6.7e-05,9.1e-05
7.6e-05,4.3e-05,7.3e-05,9.9e-05,0.000111,3e-05,4.1e-05,6.4e-05,9e-06,3.2e-05,3.8e-05,4.1e-05,5.9e-05,8.2e-05,2.1e-05,2.5e-05,1.2e-05,5.8e-05,8.3e-05,3.7e-05,5.3e-05,3.7e-05,1.3e-05,2.5e-05,3.5e-05,3.9e-05,8.5e-05,9.6e-05,4.8e-05,0.000138,8.1e-05,2.7e-05,2.1e-05,4e-05,4.5e-05,9e-06,5e-05,2.4e-05,4.9e-05,6.9e-05,6.6e-05,4.4e-05,5.6e-05,2.6e-05,6.3e-05,9.5e-05,1.7e-05,3.8e-05,1.2e-05,5.7e-05,6.7e-05,8.9e-05,2.6e-05,5.1e-05,4.1e-05,4.3e-05,7.8e-05,3.6e-05,8.9e-05,1e-04,6.6e-05,3.6e-05,3.6e-05,5.9e-05,8.9e-05,7e-05,9.8e-05,3.1e-05,4.4e-05,6.3e-05,7.6e-05,5.6e-05,7.7e-05,5.7e-05,7.9e-05,3e-05,3.1e-05,4.4e-05,6.8e-05,2.4e-05,3.1e-05,1.2e-05,3.8e-05,2.9e-05,3.5e-05,3.1e-05,5e-05,8.5e-05,6.2e-05,3.6e-05,4.6e-05,5.1e-05,9.3e-05,1.9e-05,7.7e-05,5.2e-05,8e-05,2e-05,4.3e-05,1.7e-05,4.3e-05,3.3e-05,1.2e-05,3.4e-05,9e-06,2.9e-05,1.6e-05,6e-06,7.1e-05,9.3e-05,3.8e-05,2.6e-05,5.4e-05,4.2e-05,4.8e-05,2.4e-05,2.6e-05,2.7e-05,8.4e-05,6.4e-05,6.1e-05
2.6e-05,2.1e-05,1.7e-05,5e-05,2.2e-05,4.2e-05,1.5e-05,1.6e-05,6.4e-05,2.9e-05,3.6e-05,4.9e-05,8.4e-05,5.7e-05,7.6e-05,6e-05,2.5e-05,5.1e-05,8e-06,3e-06,1.5e-05,5e-05,6.8e-05,3.6e-05,3.4e-05,3.1e-05,6.4e-05,6.5e-05,7.4e-05,4e-05,2.5e-05,7.3e-05,2.2e-05,2.5e-05,6e-05,5e-05,5.2e-05,6.7e-05,5.6e-05,3.6e-05,3e-05,6e-05,1.4e-05,3.4e-05,4.1e-05,6.2e-05,6.7e-05,4.7e-05,2.2e-05,3.2e-05,7e-06,3.7e-05,4.9e-05,5.2e-05,7.4e-05,4.5e-05,0.000107,8.8e-05,5e-05,3.9e-05,9.2e-05,5.2e-05,6.8e-05,5.4e-05,9.2e-05,3.1e-05,2.4e-05,1.2e-05,4.6e-05,2e-05,4.7e-05,0.000104,2.7e-05,5e-05,3e-05,8.6e-05,7.7e-05,5.6e-05,0.00011,0.000109,0.000116,4.8e-05,3e-06,6.2e-05,2.9e-05,7.4e-05,5.5e-05,8.2e-05,9e-06,6.4e-05,2.5e-05,4.8e-05,5.8e-05,0.000104,6.2e-05,3.8e-05,6.4e-05,3.7e-05,3.7e-05,2.8e-05,2.8e-05,2.6e-05,4.4e-05,5.8e-05,4.6e-05,7e-05,4e-05,2.3e-05,3.9e-05,9.9e-05,7.9e-05,2.4e-05,1.2e-05,2.2e-05,6.9e-05,5.1e-05,6.1e-05,2.6e-05,7.3e-05,1.1e-05,9e-05
2.3e-05,4.3e-05,4.4e-05,3e-05,2e-05,1.6e-05,1.8e-05,7e-06,4.4e-05,2.1e-05,1.3e-05,5.4e-05,3.7e-05,5.8e-05,7.3e-05,6.7e-05,4.6e-05,1.7e-05,1.5e-05,2e-05,2.2e-05,1.2e-05,3.5e-05,4.3e-05,2.7e-05,2.5e-05,4e-05,0.000108,4.5e-05,3.3e-05,4e-05,6.2e-05,5.6e-05,3.2e-05,7.4e-05,5.8e-05,7.3e-05,7e-05,0.000105,5.2e-05,1.5e-05,5.2e-05,3.5e-05,3.9e-05,2.4e-05,9e-05,5.9e-05,4.3e-05,6.9e-05,3.1e-05,2.8e-05,9e-06,3.8e-05,8.9e-05,5.3e-05,5.7e-05,9.3e-05,3.6e-05,5e-05,9e-05,9.8e-05,3.9e-05,5.1e-05,5.6e-05,2.7e-05,4.1e-05,1.6e-05,3.3e-05,3.2e-05,5.3e-05,4.6e-05,5.6e-05,3.5e-05,4.7e-05,3.3e-05,8.5e-05,3.6e-05,2e-05,8.1e-05,8.4e-05,8.6e-05,8.5e-05,4.1e-05,8.4e-05,0.000116,0.000143,7e-05,8.4e-05,7.6e-05,7.5e-05,4.2e-05,2e-05,6.8e-05,5.2e-05,3.6e-05,6.7e-05,9.5e-05,6.7e-05,5.1e-05,2.8e-05,4.5e-05,4.5e-05,1.9e-05,6.6e-05,5.4e-05,7.9e-05,6.8e-05,1.6e-05,2.9e-05,6e-05,2.6e-05,3.9e-05,4.7e-05,4.4e-05,3.1e-05,2.7e-05,4.9e-05,3.6e-05,2.3e-05,3.1e-05,4.1e-05
3.3e-05,6.7e-05,1.6e-05,2.1e-05,2.8e-05,1.9e-05,2.5e-05,2.4e-05,3.3e-05,3e-05,1.7e-05,5e-05,3.1e-05,4.2e-05,1.8e-05,1.8e-05,3.3e-05,1.5e-05,2.1e-05,3.8e-05,1.3e-05,1.3e-05,5.2e-05,1.7e-05,1.4e-05,3.5e-05,1.9e-05,4.1e-05,1e-05,2e-05,2.5e-05,3.9e-05,7e-06,2.7e-05,5.6e-05,1.8e-05,4.8e-05,6.9e-05,3.6e-05,5.3e-05,2.8e-05,7.3e-05,4.9e-05,5.3e-05,4.4e-05,8e-05,3.6e-05,3.7e-05,5.4e-05,4.2e-05,6e-05,5.8e-05,2.9e-05,5.3e-05,3.8e-05,2.2e-05,3.3e-05,4.6e-05,4.3e-05,3.3e-05,1.4e-05,2.5e-05,1.4e-05,1.2e-05,2.8e-05,5.2e-05,5.2e-05,1.8e-05,2.9e-05,2.3e-05,1.3e-05,3.8e-05,2.3e-05,5.4e-05,3.4e-05,5.5e-05,2.1e-05,3.2e-05,3.2e-05,4.9e-05,3.8e-05,7e-05,3.8e-05,3.3e-05,5.3e-05,3.9e-05,1.7e-05,4e-05,5.4e-05,2.1e-05,3.8e-05,1.1e-05,3.7e-05,1.3e-05,5.5e-05,2.3e-05,2.1e-05,5e-06,1.2e-05,8e-06,2.8e-05,2.7e-05,4.2e-05,2.7e-05,1e-05,2.5e-05,2.6e-05,3.1e-05,4.3e-05,1.8e-05,5e-06,2.9e-05,1.5e-05,2.1e-05,2e-05,6e-06,4.2e-05,1.7e-05,1.8e-05,2e-05,1.4e-05
1.7e-05,4.6e-05,7e-06,1.2e-05,4.7e-05,1e-06,2.1e-05,2.1e-05,2e-05,1.5e-05,3.5e-05,2e-05,2.1e-05,4.9e-05,1.5e-05,2e-05,1.2e-05,1.4e-05,1.2e-05,1.8e-05,1.6e-05,1.6e-05,4.3e-05,2.8e-05,1.6e-05,1e-06,2.7e-05,2e-05,1.7e-05,3.3e-05,5.3e-05,3e-05,1.7e-05,3.1e-05,4.3e-05,4.6e-05,2.2e-05,2.7e-05,2.9e-05,4.6e-05,2.5e-05,2.9e-05,1.2e-05,1.7e-05,2.9e-05,1.6e-05,9e-06,3.8e-05,4.1e-05,9e-06,3.7e-05,1.5e-05,1.9e-05,2.9e-05,2.7e-05,3.4e-05,1.4e-05,3.9e-05,4e-06,1.9e-05,2.2e-05,1.8e-05,1.2e-05,1.4e-05,3.6e-05,2.6e-05,2.4e-05,3.6e-05,3.9e-05,1.3e-05,1.4e-05,3.1e-05,3.2e-05,1.6e-05,1.7e-05,1.8e-05,1e-05,2.6e-05,1e-05,2.8e-05,4.6e-05,3.5e-05,2.9e-05,6e-06,2.7e-05,2e-05,1.8e-05,1.8e-05,3.1e-05,9e-06,1.7e-05,1.3e-05,3.2e-05,1.1e-05,1.4e-05,2.5e-05,6e-06,3e-06,1e-06,2.1e-05,1.6e-05,1.3e-05,2.1e-05,2.5e-05,1.9e-05,2.6e-05,4e-06,1.6e-05,2e-06,9e-06,8e-06,1.4e-05,1.1e-05,1.4e-05,1.7e-05,1.3e-05,9e-06,1e-05,1.3e-05,1.3e-05,1.9e-05
9e-06,2.7e-05,3e-06,5e-06,3.3e-05,4e-06,1.1e-05,2.1e-05,3.3e-05,1.8e-05,1.5e-05,2.5e-05,1.2e-05,1.8e-05,3e-06,1e-05,1.2e-05,1.8e-05,1.2e-05,1.8e-05,1.8e-05,1.3e-05,3.6e-05,1.6e-05,1.6e-05,3e-06,6e-06,1.8e-05,8e-06,3.4e-05,2.9e-05,1.5e-05,2e-06,2.7e-05,4.4e-05,5e-06,6e-06,6e-06,2.9e-05,4e-06,1.7e-05,6e-06,2.1e-05,9e-06,3.1e-05,2.5e-05,1e-05,1.5e-05,2.5e-05,3.5e-05,1.4e-05,2.3e-05,1.5e-05,1.4e-05,1.1e-05,2.8e-05,1e-05,1.9e-05,1.1e-05,2.1e-05,1.9e-05,6e-06,1.9e-05,1.3e-05,2.9e-05,1e-05,1.5e-05,3.1e-05,1.5e-05,9e-06,1.4e-05,2.8e-05,1.5e-05,1.4e-05,1.1e-05,7e-06,1e-06,5e-06,1.5e-05,2.8e-05,2.7e-05,1.1e-05,9e-06,1.5e-05,2.4e-05,1.7e-05,1.9e-05,2e-06,2.5e-05,1.3e-05,1.6e-05,2.6e-05,9e-06,3.3e-05,2.4e-05,1.6e-05,7e-06,4e-06,5e-06,2.4e-05,3e-06,5e-06,1.7e-05,2.3e-05,1.6e-05,2.8e-05,1.6e-05,9e-06,1.3e-05,1.1e-05,7e-06,9e-06,1.2e-05,1e-05,8e-06,1.3e-05,1.8e-05,6e-06,1.7e-05,4e-06,1.6e-05
1.3e-05,2.8e-05,1.7e-05,8e-06,3.9e-05,6e-06,8e-06,2.7e-05,3e-05,9e-06,2.3e-05,2e-05,5e-06,3e-06,8e-06,1.8e-05,8e-06,3e-06,2e-06,1.8e-05,6e-06,9e-06,1.9e-05,1.4e-05,1.7e-05,4e-06,1.5e-05,2.3e-05,1.7e-05,1.4e-05,2.5e-05,1e-05,1.9e-05,2.6e-05,2.8e-05,3.7e-05,8e-06,8e-06,3e-05,1.7e-05,1e-05,2.1e-05,2.3e-05,5e-06,1.6e-05,5e-06,1.1e-05,1.2e-05,1e-05,3e-06,1.8e-05,1.2e-05,1.1e-05,1.1e-05,1.9e-05,1.6e-05,1.8e-05,2.1e-05,1.7e-05,1.5e-05,8e-06,1.1e-05,1.6e-05,4e-06,2.1e-05,9e-06,1e-05,1.3e-05,3e-06,1.5e-05,4e-06,1.3e-05,5e-06,8e-06,3e-06,7e-06,1.2e-05,2.1e-05,7e-06,1.6e-05,1.5e-05,1.5e-05,1.1e-05,8e-06,3.1e-05,2.1e-05,2.5e-05,1.3e-05,2.9e-05,6e-06,1.3e-05,1.1e-05,8e-06,2.2e-05,6e-06,2.5e-05,1.1e-05,6e-06,1.5e-05,1.8e-05,7e-06,2e-06,1.9e-05,2e-05,1.2e-05,1.5e-05,1e-05,4e-06,3e-06,3e-06,1e-05,3e-06,1.5e-05,1.8e-05,6e-06,5e-06,1.7e-05,1.2e-05,2.1e-05,1.9e-05,1.1e-05
8e-06,1.3e-05,6e-06,3e-06,2.3e-05,9e-06,6e-06,5e-06,1.8e-05,3e-06,1e-05,1.1e-05,2e-06,1e-05,2e-06,8e-06,9e-06,6e-06,4e-06,8e-06,2e-06,1e-05,1.5e-05,5e-06,7e-06,9e-06,1.1e-05,7e-06,1e-05,1.8e-05,7e-06,1e-05,7e-06,9e-06,4e-06,5e-06,5e-06,1.1e-05,4e-06,4e-06,5e-06,7e-06,6e-06,7e-06,7e-06,1.2e-05,2e-06,1.1e-05,6e-06,1.1e-05,9e-06,4e-06,1e-06,2e-06,9e-06,1e-05,1.1e-05,1.2e-05,5e-06,1e-05,3e-06,6e-06,1e-05,5e-06,1.1e-05,7e-06,8e-06,6e-06,5e-06,1.1e-05,6e-06,8e-06,8e-06,6e-06,4e-06,8e-06,6e-06,1.1e-05,6e-06,7e-06,2e-06,7e-06,2e-06,6e-06,9e-06,1.1e-05,7e-06,5e-06,1.2e-05,7e-06,2e-06,5e-06,2e-06,8e-06,1e-06,2e-06,4e-06,5e-06,6e-06,2e-06,7e-06,7e-06,7e-06,8e-06,1e-06,7e-06,7e-06,3e-06,9e-06,1.1e-05,2e-06,4e-06,3e-06,5e-06,2e-06,3e-06,5e-06,1e-06,7e-06,1e-06,4e-06
1.7e-05,3.5e-05,1.4e-05,4e-06,1.2e-05,3e-06,5e-06,7e-06,1.2e-05,3e-06,7e-06,1.8e-05,1.1e-05,5e-06,1.1e-05,7e-06,6e-06,8e-06,8e-06,1.3e-05,1.2e-05,1.2e-05,7e-06,5e-06,5e-06,1.2e-05,2e-06,1e-05,7e-06,1.4e-05,1.8e-05,9e-06,9e-06,1.7e-05,1.2e-05,5e-06,6e-06,1.2e-05,8e-06,9e-06,4e-06,1e-06,6e-06,1e-05,7e-06,1.2e-05,1.1e-05,1.5e-05,1.5e-05,9e-06,1.4e-05,1.6e-05,5e-06,9e-06,1e-05,1e-05,1.4e-05,6e-06,1.1e-05,5e-06,3e-06,3e-06,8e-06,4e-06,1.1e-05,2e-06,4e-06,1.1e-05,3e-06,8e-06,4e-06,8e-06,1.2e-05,1.1e-05,1e-05,1.1e-05,1.6e-05,1.2e-05,2e-06,2e-06,6e-06,3e-06,6e-06,1e-05,1.4e-05,1.3e-05,5e-06,1.5e-05,1e-05,6e-06,1.8e-05,6e-06,1e-06,5e-06,7e-06,7e-06,8e-06,6e-06,7e-06,1e-05,4e-06,3e-06,4e-06,7e-06,5e-06,0,5e-06,8e-06,1.5e-05,7e-06,4e-06,2e-06,3e-06,8e-06,3e-06,6e-06,8e-06,9e-06,3e-06,4e-06,5e-06
7e-06,4e-05,2.6e-05,2.2e-05,1.6e-05,1.4e-05,8e-06,1.7e-05,9e-06,1.1e-05,1e-05,1.1e-05,4e-06,9e-06,1.2e-05,4e-06,9e-06,1.4e-05,1.8e-05,1.5e-05,8e-06,1e-05,7e-06,5e-06,5e-06,1.2e-05,1.4e-05,1.5e-05,1.2e-05,2e-05,2e-05,2.2e-05,1.2e-05,8e-06,1.4e-05,1.1e-05,1.3e-05,7e-06,4e-06,5e-06,6e-06,1.1e-05,6e-06,1.2e-05,1.1e-05,4e-06,7e-06,8e-06,3e-06,8e-06,3e-06,1.2e-05,1.5e-05,6e-06,8e-06,8e-06,1.6e-05,1.5e-05,1.6e-05,5e-06,4e-06,6e-06,8e-06,1e-05,9e-06,1.1e-05,5e-06,6e-06,5e-06,4e-06,9e-06,3e-06,1.2e-05,8e-06,8e-06,1.4e-05,2.2e-05,1.9e-05,7e-06,1.2e-05,1.4e-05,1e-05,1.3e-05,7e-06,7e-06,1.2e-05,1.6e-05,3e-06,1.2e-05,1e-05,2.5e-05,2.7e-05,1.9e-05,7e-06,1e-05,1.8e-05,4e-06,2e-06,7e-06,8e-06,7e-06,1e-05,1e-05,1.2e-05,9e-06,1e-05,1.4e-05,1.5e-05,7e-06,9e-06,2e-06,3e-06,2e-06,1.1e-05,1.3e-05,1.5e-05,4e-06,7e-06,5e-06,3e-06,4e-06
9e-06,2.6e-05,6e-06,9e-06,1.9e-05,5e-06,3e-06,1.5e-05,2e-05,8e-06,1e-05,3e-06,3e-06,6e-06,1e-06,3e-06,1e-05,7e-06,1e-05,1.4e-05,1.1e-05,1.1e-05,9e-06,1e-06,1.1e-05,5e-06,4e-06,1e-05,1e-05,8e-06,5e-06,9e-06,1e-05,4e-06,1e-05,1.8e-05,6e-06,1.2e-05,1.2e-05,5e-06,2e-06,1.4e-05,4e-06,1e-05,2e-05,1.7e-05,4e-06,0,5e-06,6e-06,1e-05,8e-06,7e-06,8e-06,9e-06,1.1e-05,1.2e-05,9e-06,4e-06,9e-06,9e-06,4e-06,4e-06,1.4e-05,8e-06,6e-06,7e-06,1.3e-05,1.5e-05,1.5e-05,1.2e-05,2.1e-05,1.6e-05,5e-06,6e-06,1.4e-05,1.1e-05,8e-06,3e-06,1.3e-05,1.6e-05,8e-06,4e-06,7e-06,6e-06,3e-06,8e-06,1.4e-05,9e-06,1.5e-05,1.3e-05,5e-06,1.1e-05,6e-06,9e-06,4e-06,6e-06,7e-06,9e-06,5e-06,1e-06,7e-06,5e-06,3e-06,2e-06,1.7e-05,2e-06,3e-06,7e-06,5e-06,7e-06,5e-06,4e-06,4e-06,5e-06,5e-06,1e-05,2e-06,1e-05,9e-06,5e-06
6e-06,8e-06,2.3e-05,1e-05,2.6e-05,9e-06,4e-06,8e-06,1.8e-05,8e-06,1.4e-05,2e-06,2e-06,1e-06,3e-06,1e-05,9e-06,0,9e-06,1.1e-05,1.4e-05,4e-06,4e-06,5e-06,8e-06,1.5e-05,1.2e-05,5e-06,4e-06,1.3e-05,1.8e-05,1.2e-05,4e-06,6e-06,8e-06,5e-06,1.2e-05,8e-06,8e-06,1.1e-05,3e-06,5e-06,5e-06,8e-06,4e-06,1.5e-05,9e-06,6e-06,4e-06,5e-06,4e-06,4e-06,7e-06,4e-06,9e-06,9e-06,2e-06,4e-06,8e-06,9e-06,4e-06,7e-06,7e-06,1.1e-05,7e-06,1.1e-05,7e-06,1e-05,1e-05,6e-06,9e-06,1.2e-05,1e-05,4e-06,4e-06,1.4e-05,5e-06,1e-05,4e-06,9e-06,3e-06,6e-06,1.1e-05,9e-06,5e-06,3e-06,1.1e-05,1.7e-05,1.2e-05,1.5e-05,1e-06,4e-06,8e-06,6e-06,3e-06,3e-06,5e-06,6e-06,9e-06,2e-06,3e-06,3e-06,3e-06,5e-06,2e-06,1.3e-05,9e-06,8e-06,3e-06,3e-06,2e-06,0,5e-06,4e-06,4e-06,4e-06,1e-05,1.1e-05,1.2e-05,9e-06,1.1e-05
9e-06,5e-06,1.6e-05,1.3e-05,1.3e-05,1e-06,9e-06,1e-05,1.2e-05,7e-06,2e-06,8e-06,3e-06,3e-06,5e-06,5e-06,3e-06,4e-06,1.4e-05,1.2e-05,6e-06,6e-06,4e-06,3e-06,5e-06,9e-06,4e-06,2e-06,4e-06,6e-06,1.3e-05,6e-06,8e-06,2e-06,7e-06,4e-06,7e-06,4e-06,5e-06,8e-06,9e-06,9e-06,7e-06,3e-06,6e-06,1e-05,8e-06,1e-06,4e-06,7e-06,2e-06,2e-06,0,4e-06,6e-06,5e-06,3e-06,3e-06,7e-06,3e-06,6e-06,3e-06,6e-06,7e-06,1e-05,8e-06,4e-06,2e-06,9e-06,6e-06,6e-06,1.1e-05,7e-06,0,5e-06,8e-06,6e-06,1.2e-05,7e-06,7e-06,6e-06,3e-06,8e-06,1e-06,1e-05,8e-06,6e-06,1.3e-05,7e-06,3e-06,7e-06,5e-06,3e-06,5e-06,2e-06,4e-06,2e-06,7e-06,6e-06,3e-06,1e-06,3e-06,4e-06,8e-06,6e-06,3e-06,1e-06,2e-06,4e-06,5e-06,3e-06,1e-06,3e-06,1e-06,2e-06,4e-06,5e-06,2e-06,9e-06,6e-06,4e-06
7e-06,7e-06,4e-06,7e-06,1.9e-05,4e-06,7e-06,5e-06,1.2e-05,1e-06,2e-06,1e-06,2e-06,7e-06,6e-06,7e-06,2e-06,3e-06,7e-06,6e-06,6e-06,4e-06,3e-06,6e-06,3e-06,1.1e-05,5e-06,4e-06,3e-06,1e-06,1.5e-05,6e-06,3e-06,2e-06,2e-06,7e-06,4e-06,4e-06,2e-06,5e-06,5e-06,7e-06,4e-06,2e-06,5e-06,8e-06,2e-06,6e-06,5e-06,2e-06,1e-06,4e-06,3e-06,5e-06,6e-06,7e-06,5e-06,5e-06,4e-06,7e-06,5e-06,7e-06,3e-06,6e-06,7e-06,2e-06,4e-06,7e-06,6e-06,2e-06,3e-06,9e-06,1e-06,4e-06,4e-06,6e-06,1e-06,2e-06,5e-06,5e-06,7e-06,7e-06,5e-06,1e-06,5e-06,2e-06,5e-06,5e-06,2e-06,5e-06,4e-06,2e-06,4e-06,4e-06,4e-06,6e-06,2e-06,4e-06,1e-06,5e-06,4e-06,4e-06,4e-06,9e-06,1e-06,5e-06,4e-06,4e-06,5e-06,2e-06,1e-06,2e-06,3e-06,2e-06,0,5e-06,2e-06,5e-06,6e-06,6e-06,4e-06
5e-06,8e-06,4e-06,8e-06,1.3e-05,2e-06,2e-06,4e-06,1.2e-05,3e-06,4e-06,8e-06,4e-06,4e-06,1e-06,1e-05,3e-06,2e-06,2e-06,1e-06,1e-06,2e-06,2e-06,3e-06,5e-06,3e-06,2e-06,2e-06,2e-06,1e-06,8e-06,3e-06,5e-06,3e-06,6e-06,6e-06,7e-06,7e-06,5e-06,4e-06,2e-06,1.1e-05,6e-06,4e-06,4e-06,6e-06,1e-06,2e-06,4e-06,3e-06,2e-06,4e-06,2e-06,8e-06,8e-06,5e-06,4e-06,5e-06,3e-06,6e-06,8e-06,4e-06,4e-06,2e-06,1.1e-05,6e-06,3e-06,2e-06,4e-06,3e-06,5e-06,4e-06,3e-06,3e-06,2e-06,3e-06,2e-06,3e-06,4e-06,4e-06,6e-06,4e-06,3e-06,4e-06,4e-06,3e-06,9e-06,6e-06,2e-06,4e-06,3e-06,2e-06,2e-06,4e-06,5e-06,4e-06,1e-06,3e-06,2e-06,6e-06,1e-06,1e-06,2e-06,5e-06,3e-06,6e-06,2e-06,2e-06,2e-06,3e-06,1e-06,2e-06,4e-06,3e-06,1e-06,4e-06,2e-06,4e-06,2e-06,4e-06,1e-06
5e-06,1.4e-05,4e-06,5e-06,1.7e-05,4e-06,4e-06,6e-06,6e-06,2e-06,6e-06,4e-06,1e-06,3e-06,5e-06,5e-06,4e-06,3e-06,5e-06,4e-06,3e-06,2e-06,1e-06,4e-06,4e-06,3e-06,3e-06,5e-06,3e-06,4e-06,9e-06,4e-06,4e-06,1.1e-05,5e-06,6e-06,8e-06,8e-06,5e-06,2e-06,1e-06,6e-06,5e-06,9e-06,5e-06,4e-06,2e-06,3e-06,5e-06,1e-06,5e-06,3e-06,2e-06,8e-06,6e-06,1e-06,1e-06,6e-06,1e-06,7e-06,7e-06,6e-06,1e-06,2e-06,6e-06,3e-06,3e-06,3e-06,1e-06,4e-06,3e-06,4e-06,4e-06,4e-06,2e-06,6e-06,2e-06,3e-06,0,4e-06,6e-06,3e-06,3e-06,1e-06,5e-06,5e-06,8e-06,4e-06,3e-06,4e-06,3e-06,2e-06,3e-06,4e-06,3e-06,7e-06,2e-06,3e-06,2e-06,3e-06,3e-06,2e-06,4e-06,6e-06,3e-06,1e-06,2e-06,2e-06,2e-06,3e-06,1e-06,3e-06,2e-06,1e-06,3e-06,4e-06,2e-06,3e-06,4e-06,2e-06,3e-06
6e-06,1.4e-05,3e-06,1e-06,1.2e-05,2e-06,4e-06,9e-06,1.2e-05,5e-06,3e-06,5e-06,2e-06,3e-06,7e-06,5e-06,4e-06,1e-06,3e-06,2e-06,1e-06,4e-06,3e-06,3e-06,1e-06,3e-06,2e-06,7e-06,5e-06,6e-06,4e-06,2e-06,4e-06,7e-06,5e-06,6e-06,4e-06,4e-06,3e-06,4e-06,1e-06,2e-06,3e-06,2e-06,7e-06,4e-06,5e-06,2e-06,8e-06,8e-06,4e-06,3e-06,2e-06,8e-06,9e-06,3e-06,2e-06,3e-06,2e-06,6e-06,3e-06,1e-06,4e-06,3e-06,6e-06,6e-06,4e-06,4e-06,3e-06,3e-06,2e-06,7e-06,3e-06,3e-06,2e-06,5e-06,2e-06,2e-06,4e-06,3e-06,6e-06,3e-06,3e-06,0,5e-06,3e-06,4e-06,3e-06,4e-06,6e-06,5e-06,4e-06,5e-06,2e-06,2e-06,5e-06,3e-06,2e-06,1e-06,4e-06,4e-06,3e-06,3e-06,4e-06,5e-06,5e-06,1e-06,1e-06,4e-06,2e-06,1e-06,2e-06,4e-06,1e-06,3e-06,2e-06,4e-06,6e-06,4e-06,4e-06,3e-06
5e-06,9e-06,3e-06,2e-06,1.4e-05,1e-06,1e-06,1.1e-05,1e-05,2e-06,7e-06,5e-06,3e-06,6e-06,4e-06,7e-06,2e-06,0,4e-06,1e-06,1e-06,5e-06,3e-06,3e-06,3e-06,4e-06,1e-06,3e-06,2e-06,4e-06,4e-06,5e-06,3e-06,3e-06,3e-06,2e-06,4e-06,5e-06,1e-06,1e-06,1e-06,4e-06,1e-06,0,3e-06,4e-06,4e-06,5e-06,3e-06,1e-06,1e-06,3e-06,2e-06,7e-06,6e-06,2e-06,3e-06,5e-06,4e-06,8e-06,6e-06,4e-06,1e-06,1e-06,5e-06,4e-06,1e-06,3e-06,2e-06,2e-06,2e-06,6e-06,5e-06,0,2e-06,1e-06,2e-06,2e-06,4e-06,4e-06,6e-06,2e-06,3e-06,2e-06,5e-06,2e-06,5e-06,1e-06,2e-06,1e-06,4e-06,0,3e-06,1e-06,3e-06,4e-06,3e-06,1e-06,0,4e-06,3e-06,2e-06,4e-06,5e-06,3e-06,2e-06,3e-06,1e-06,2e-06,3e-06,1e-06,3e-06,2e-06,1e-06,3e-06,1e-06,2e-06,2e-06,2e-06,2e-06,2e-06
1e-06,7e-06,1e-06,2e-06,1.2e-05,1e-06,2e-06,8e-06,1.3e-05,2e-06,7e-06,4e-06,1e-06,4e-06,1e-06,4e-06,5e-06,1e-06,6e-06,3e-06,3e-06,3e-06,1e-06,2e-06,2e-06,4e-06,4e-06,5e-06,3e-06,3e-06,1e-06,3e-06,1e-06,2e-06,1e-06,5e-06,5e-06,2e-06,1e-06,1e-06,1e-06,4e-06,2e-06,1e-06,2e-06,2e-06,2e-06,3e-06,4e-06,5e-06,0,1e-06,1e-06,3e-06,6e-06,4e-06,3e-06,3e-06,4e-06,3e-06,3e-06,4e-06,1e-06,1e-06,4e-06,1e-06,4e-06,2e-06,1e-06,1e-06,2e-06,4e-06,4e-06,1e-06,3e-06,5e-06,3e-06,6e-06,2e-06,3e-06,3e-06,3e-06,3e-06,4e-06,5e-06,4e-06,3e-06,2e-06,3e-06,4e-06,1e-06,0,4e-06,3e-06,2e-06,5e-06,2e-06,2e-06,1e-06,5e-06,2e-06,3e-06,2e-06,4e-06,1e-06,3e-06,3e-06,2e-06,5e-06,2e-06,1e-06,2e-06,2e-06,1e-06,4e-06,2e-06,1e-06,3e-06,3e-06,3e-06,0
3e-06,5e-06,4e-06,2e-06,1.4e-05,2e-06,2e-06,6e-06,1.2e-05,0,8e-06,5e-06,2e-06,1e-06,3e-06,5e-06,3e-06,4e-06,6e-06,2e-06,2e-06,3e-06,1e-06,3e-06,2e-06,3e-06,2e-06,4e-06,1e-06,4e-06,4e-06,6e-06,3e-06,4e-06,0,6e-06,4e-06,5e-06,1e-06,1e-06,0,3e-06,4e-06,2e-06,2e-06,5e-06,3e-06,2e-06,7e-06,8e-06,7e-06,3e-06,4e-06,4e-06,3e-06,1e-06,2e-06,7e-06,0,2e-06,2e-06,5e-06,4e-06,2e-06,5e-06,3e-06,4e-06,5e-06,1e-06,2e-06,2e-06,6e-06,0,3e-06,3e-06,6e-06,5e-06,3e-06,3e-06,2e-06,2e-06,1e-06,2e-06,2e-06,1e-06,5e-06,4e-06,5e-06,2e-06,4e-06,3e-06,1e-06,4e-06,4e-06,1e-06,4e-06,0,0,0,5e-06,4e-06,4e-06,4e-06,3e-06,1e-06,4e-06,3e-06,3e-06,7e-06,4e-06,1e-06,2e-06,1e-06,4e-06,1e-06,3e-06,4e-06,2e-06,4e-06,1e-06,3e-06
4e-06,8e-06,2e-06,5e-06,1.1e-05,3e-06,2e-06,8e-06,1.2e-05,0,7e-06,5e-06,2e-06,5e-06,2e-06,4e-06,2e-06,2e-06,4e-06,2e-06,0,1e-06,2e-06,3e-06,5e-06,3e-06,2e-06,2e-06,5e-06,3e-06,6e-06,2e-06,2e-06,6e-06,5e-06,6e-06,3e-06,5e-06,3e-06,2e-06,2e-06,1e-06,1e-06,7e-06,7e-06,5e-06,5e-06,2e-06,7e-06,3e-06,3e-06,2e-06,3e-06,2e-06,5e-06,3e-06,0,7e-06,5e-06,6e-06,5e-06,1e-06,2e-06,0,3e-06,3e-06,2e-06,4e-06,4e-06,3e-06,2e-06,7e-06,5e-06,1e-06,2e-06,5e-06,1e-06,4e-06,2e-06,3e-06,3e-06,1e-06,4e-06,3e-06,4e-06,3e-06,5e-06,1e-06,2e-06,4e-06,1e-06,2e-06,1e-06,2e-06,2e-06,4e-06,2e-06,2e-06,1e-06,2e-06,1e-06,1e-06,1e-06,5e-06,1e-06,3e-06,2e-06,4e-06,1e-06,3e-06,2e-06,3e-06,1e-06,2e-06,3e-06,2e-06,3e-06,3e-06,4e-06,4e-06,2e-06
3e-06,1e-05,2e-06,3e-06,8e-06,1e-06,1e-06,7e-06,1.1e-05,3e-06,4e-06,4e-06,2e-06,4e-06,6e-06,4e-06,5e-06,3e-06,3e-06,1e-06,0,2e-06,1e-06,3e-06,4e-06,2e-06,2e-06,2e-06,3e-06,2e-06,5e-06,5e-06,1e-06,3e-06,2e-06,4e-06,3e-06,1e-06,0,2e-06,2e-06,1e-06,2e-06,6e-06,2e-06,4e-06,3e-06,1e-06,4e-06,4e-06,2e-06,3e-06,0,5e-06,4e-06,1e-06,3e-06,3e-06,2e-06,1.1e-05,1e-06,3e-06,3e-06,3e-06,2e-06,5e-06,7e-06,3e-06,4e-06,2e-06,1e-06,5e-06,6e-06,3e-06,3e-06,2e-06,4e-06,3e-06,1e-06,4e-06,3e-06,3e-06,2e-06,4e-06,7e-06,3e-06,5e-06,5e-06,3e-06,4e-06,3e-06,1e-06,2e-06,6e-06,2e-06,5e-06,3e-06,4e-06,4e-06,1e-06,3e-06,3e-06,2e-06,4e-06,4e-06,5e-06,1e-06,3e-06,1e-06,5e-06,1e-06,1e-06,2e-06,1e-06,3e-06,2e-06,0,2e-06,4e-06,2e-06,2e-06
6e-06,1.1e-05,2e-06,1e-06,1.1e-05,3e-06,3e-06,5e-06,8e-06,1e-06,6e-06,4e-06,3e-06,5e-06,2e-06,7e-06,6e-06,3e-06,2e-06,2e-06,1e-06,3e-06,4e-06,2e-06,3e-06,4e-06,1e-06,1e-06,1e-06,6e-06,6e-06,5e-06,4e-06,2e-06,3e-06,1e-06,4e-06,3e-06,1e-06,3e-06,1e-06,3e-06,3e-06,5e-06,4e-06,1e-06,4e-06,4e-06,1e-06,4e-06,4e-06,5e-06,6e-06,4e-06,3e-06,1e-06,1e-06,3e-06,4e-06,5e-06,4e-06,3e-06,4e-06,4e-06,2e-06,4e-06,1e-06,5e-06,1e-06,3e-06,3e-06,4e-06,3e-06,2e-06,2e-06,3e-06,2e-06,7e-06,2e-06,2e-06,5e-06,2e-06,2e-06,3e-06,1e-06,3e-06,8e-06,6e-06,1e-06,1e-06,0,2e-06,2e-06,4e-06,2e-06,6e-06,0,1e-06,2e-06,5e-06,1e-06,2e-06,2e-06,2e-06,4e-06,3e-06,1e-06,3e-06,5e-06,1e-06,2e-06,3e-06,3e-06,1e-06,4e-06,1e-06,1e-06,3e-06,3e-06,2e-06,2e-06
2e-06,8e-06,4e-06,3e-06,1.3e-05,1e-06,2e-06,4e-06,1e-05,0,6e-06,5e-06,2e-06,4e-06,4e-06,5e-06,1e-06,1e-06,5e-06,1e-06,0,2e-06,3e-06,3e-06,1e-06,0,2e-06,1e-06,2e-06,3e-06,5e-06,3e-06,3e-06,3e-06,4e-06,3e-06,3e-06,2e-06,2e-06,1e-06,1e-06,1e-06,1e-06,0,1e-06,1e-06,1e-06,1e-06,3e-06,3e-06,2e-06,2e-06,2e-06,4e-06,2e-06,1e-06,1e-06,2e-06,5e-06,6e-06,2e-06,1e-06,3e-06,1e-06,3e-06,3e-06,2e-06,3e-06,1e-06,1e-06,1e-06,4e-06,3e-06,1e-06,1e-06,2e-06,1e-06,5e-06,2e-06,1e-06,3e-06,2e-06,0,3e-06,4e-06,3e-06,6e-06,5e-06,1e-06,4e-06,1e-06,2e-06,2e-06,4e-06,1e-06,3e-06,2e-06,1e-06,1e-06,2e-06,1e-06,2e-06,0,3e-06,2e-06,2e-06,0,1e-06,3e-06,2e-06,0,2e-06,2e-06,0,3e-06,0,1e-06,3e-06,4e-06,4e-06,1e-06
4e-06,9e-06,2e-06,2e-06,1.1e-05,1e-06,1e-06,5e-06,1.1e-05,1e-06,5e-06,5e-06,3e-06,1e-06,4e-06,6e-06,2e-06,1e-06,4e-06,1e-06,1e-06,2e-06,2e-06,2e-06,1e-06,1e-06,2e-06,2e-06,2e-06,3e-06,4e-06,2e-06,1e-06,2e-06,3e-06,3e-06,1e-06,2e-06,1e-06,1e-06,1e-06,1e-06,1e-06,1e-06,2e-06,3e-06,1e-06,1e-06,0,1e-06,2e-06,1e-06,2e-06,5e-06,4e-06,2e-06,0,3e-06,2e-06,4e-06,3e-06,0,1e-06,0,3e-06,1e-06,1e-06,4e-06,2e-06,0,1e-06,6e-06,3e-06,1e-06,1e-06,2e-06,1e-06,4e-06,0,2e-06,2e-06,2e-06,1e-06,2e-06,3e-06,4e-06,6e-06,4e-06,1e-06,4e-06,2e-06,1e-06,1e-06,2e-06,2e-06,4e-06,2e-06,1e-06,0,2e-06,1e-06,2e-06,1e-06,3e-06,3e-06,3e-06,1e-06,1e-06,3e-06,2e-06,1e-06,1e-06,2e-06,1e-06,2e-06,0,0,3e-06,3e-06,3e-06,1e-06
3e-06,9e-06,1e-06,1e-06,1e-05,2e-06,1e-06,5e-06,1e-05,1e-06,5e-06,4e-06,2e-06,2e-06,3e-06,5e-06,1e-06,1e-06,4e-06,1e-06,0,1e-06,0,2e-06,2e-06,2e-06,3e-06,2e-06,2e-06,2e-06,3e-06,1e-06,1e-06,2e-06,2e-06,3e-06,2e-06,1e-06,1e-06,1e-06,0,2e-06,1e-06,1e-06,2e-06,2e-06,1e-06,1e-06,1e-06,2e-06,2e-06,1e-06,1e-06,5e-06,3e-06,2e-06,0,2e-06,2e-06,3e-06,3e-06,1e-06,1e-06,1e-06,3e-06,1e-06,1e-06,3e-06,1e-06,1e-06,1e-06,7e-06,3e-06,1e-06,1e-06,2e-06,1e-06,3e-06,2e-06,2e-06,3e-06,2e-06,1e-06,1e-06,4e-06,3e-06,5e-06,3e-06,1e-06,2e-06,1e-06,1e-06,2e-06,2e-06,0,4e-06,2e-06,1e-06,0,3e-06,1e-06,1e-06,0,3e-06,2e-06,3e-06,0,1e-06,3e-06,2e-06,0,2e-06,2e-06,0,2e-06,0,0,2e-06,4e-06,3e-06,1e-06
4e-06,9e-06,2e-06,2e-06,1.1e-05,2e-06,1e-06,5e-06,1e-05,1e-06,5e-06,5e-06,2e-06,2e-06,4e-06,4e-06,2e-06,0,4e-06,0,1e-06,2e-06,1e-06,2e-06,2e-06,2e-06,2e-06,2e-06,1e-06,3e-06,3e-06,1e-06,1e-06,2e-06,2e-06,2e-06,1e-06,1e-06,1e-06,1e-06,1e-06,1e-06,1e-06,0,3e-06,2e-06,1e-06,1e-06,1e-06,1e-06,1e-06,1e-06,1e-06,5e-06,4e-06,2e-06,0,2e-06,1e-06,4e-06,3e-06,1e-06,1e-06,0,3e-06,1e-06,0,3e-06,1e-06,0,1e-06,6e-06,3e-06,1e-06,0,2e-06,0,4e-06,2e-06,1e-06,4e-06,1e-06,1e-06,1e-06,4e-06,3e-06,5e-06,3e-06,1e-06,3e-06,1e-06,0,2e-06,3e-06,0,4e-06,1e-06,1e-06,0,3e-06,1e-06,1e-06,0,3e-06,2e-06,3e-06,1e-06,1e-06,3e-06,2e-06,0,1e-06,1e-06,1e-06,2e-06,0,1e-06,2e-06,4e-06,3e-06,1e-06
