-0.000399,-0.000399,-0.000226,-0.000151,-4.8e-05,-7.2e-05,0.000157,1.5e-05,-0.000127,2.1e-05,5.3e-05,0.000267,-0.000106,-3e-04,-0.000169,-0.000113,-0.000298,0.000368,-0.013457,-0.011605,-0.010443,-0.010075,-0.005312,-0.005673,-0.005251,-0.008429,-0.004325,0.007338,-0.004182,-0.018635,-0.01115,-0.00743,-0.016581,-0.017093,-0.015162,-0.013013,-0.01426,-0.013833,-0.013584,-0.014241,-0.012174,-0.011634,-0.016924,-0.011186,-0.014401,-0.008034,-0.011035,-0.004843,-0.003446,-0.006411,-0.003273,-0.00257,-0.002989,-0.003426,-0.005701,-0.004609,-0.000503,-0.002261,-0.011697,-0.007267,-0.002993,-0.00093,-0.00093,-0.000979,-0.000849,6e-05,-0.000125,-0.000833,-0.00079,-0.001345,-0.000882,-0.000918,-0.002691,-0.001933,-0.000191,-0.001331,-0.003501,-0.001915,-0.004057,-0.003413,-0.000789,0.000512,-0.00058,-0.002467,-0.004356,-0.002685,-0.001843,-0.001112,-0.000639,-0.001074,-0.000598,-0.00023,-0.003638,-0.001719,-0.002084,-0.002291,-0.001668,-0.002188,-0.001567,-0.000525,0.000103,-0.009514,-0.014991,-0.012011,-0.026004,-0.020877,-0.014349,-0.009779,-0.004309,-0.001436,-0.000507,-1.2e-05,0.000603,0.000767,0.000412,0.000166,-0.000105,-0.000376,3.7e-05,9.7e-05,0.000171
9.1e-05,-0.00012,-0.000251,-0.000165,-0.00012,-0.000181,-6.1e-05,-0.000422,-0.000143,-0.000229,-0.000302,-0.000418,0.000411,-2e-04,-0.000143,-0.000175,8.4e-05,-0.001947,0.005341,0.001895,0.001241,0.003758,0.00216,0.003115,0.01063,0.009986,0.004382,-0.005241,-0.005111,0.004897,0.009175,-0.002372,0.004409,-0.004088,0.002347,-0.005735,0.003474,0.000767,0.005052,0.010896,0.00113,0.000683,0.004638,0.001013,9.9e-05,-0.000773,-0.000442,-0.004232,-0.006523,-0.004415,-0.004179,-0.003212,-0.00032,-0.000518,-6e-04,0.001884,-0.002755,-0.001063,0.005124,0.002449,-0.000449,0.000282,0.000218,0.000183,-2.6e-05,0.000287,0.000469,-0.000173,0.000282,0.000409,1.5e-05,0.001091,-0.001684,-0.000919,0.000165,-0.000557,0.001474,0.001241,0.001268,0.002724,0.001274,0.001083,0.000443,0.001066,0.001666,0.002771,0.001372,0.000862,0.000269,0.000917,0.000641,0.000125,0.001123,0.001271,8e-06,3.7e-05,0.000963,0.000725,0.000324,-0.000145,9e-06,0.002538,0.010984,0.003774,0.014811,0.015628,0.006767,0.001597,0.001108,0.000838,0.000514,0.000388,0.000669,0.000246,7.6e-05,0.000301,2.2e-05,-0.000209,1.6e-05,-0.000364,-0.000133
-0.000441,7.3e-05,-2.8e-05,-6.9e-05,-9.1e-05,-0.000565,-0.000225,4.9e-05,-4e-06,-0.000174,-0.000123,0.000124,-0.000302,1.5e-05,-0.000139,0.000178,-0.000147,-0.001252,-0.001949,0.000553,0.002346,-0.001485,-0.000822,-0.001832,-0.007364,-0.007731,-0.004791,-0.006666,-0.004056,-0.005113,-0.010909,-0.004913,-0.006552,-0.000563,0.001002,-0.004809,-0.007512,-0.003395,-0.004912,-0.01123,-0.010304,-0.003245,-0.00248,1.5e-05,0.005211,-7.8e-05,-0.002623,-0.003603,0.002102,0.000617,-0.001276,-0.002662,-0.00182,-0.000585,0.000746,-0.001588,-0.001095,6.4e-05,-0.002959,-0.001985,-0.001151,-0.001184,-0.000404,-8.3e-05,-0.000394,-0.000215,0.000854,2.5e-05,-0.000448,-0.000773,-0.000423,-0.000447,-0.000291,-0.001722,-0.001015,-1.5e-05,8.7e-05,-0.000319,-5.5e-05,-0.0014,-0.001051,-0.000863,0.00083,-0.000582,-0.002257,-0.003765,-0.001398,-0.000509,-6.4e-05,-0.000741,-0.000149,0.000229,0.00024,-8e-06,-0.000113,0.000766,-0.000438,4.6e-05,5e-05,-0.000432,-4.6e-05,0.000332,-0.006698,-0.004585,-0.01125,-0.014585,-0.000121,0.001635,0.001069,0.000252,8.3e-05,1e-06,0.000517,0.000725,0.000462,0.000214,0.000335,-7.8e-05,-0.00014,0.000122,0.000157
0.000304,6.6e-05,-0.000584,-0.000107,-1.3e-05,0.000149,5.8e-05,-9.6e-05,0.000116,-5.6e-05,0.00017,-2.9e-05,3e-06,0.000646,0.000329,-2e-06,-0.000169,-0.000186,-0.002685,-0.004117,-0.001995,0.001355,0.000359,0.000779,-0.002184,0.004183,0.003966,0.001589,-0.002585,-0.002555,0.000481,-0.005545,-0.001212,-0.003128,-0.003091,0.002894,0.001778,-0.000254,0.000767,0.00257,0.007172,0.001333,0.00062,-0.000222,-0.001737,0.001058,0.002854,0.004091,0.004196,0.003673,-0.002741,0.000148,0.001777,0.000181,-0.000655,0.00083,0.001334,-0.001293,0.001748,0.000923,0.001363,0.000247,0.000681,0.000497,0.000476,0.000175,-0.000425,-0.000616,-0.000258,0.000593,-6e-06,0.000602,-0.000566,0.000678,0.000697,-5.1e-05,-0.000613,0.000303,-0.001003,-0.001308,0.001576,0.000785,0.000712,-0.001004,0.000548,0.001444,0.000469,7.6e-05,0.00025,0.000448,-9.6e-05,-7.5e-05,0.000311,-0.00064,0.000549,0.000534,0.001066,-0.000227,0.000144,0.000542,-0.000257,0.000576,0.003167,0.002199,0.010092,0.009881,0.003062,0.002194,0.000872,-0.000262,7e-05,-0.000144,0.000528,0.000121,0.000412,4.9e-05,-0.000319,0.000489,0.000121,0.000116,-8.6e-05
-0.000488,-0.000329,0.000316,-9.2e-05,-0.00036,-0.000108,3e-06,0.000161,-0.000147,9.4e-05,-4e-06,5.7e-05,8e-06,-0.000187,-0.000249,-0.000244,0.000158,-0.000994,0.001164,0.002054,-0.000875,-0.000463,-0.000695,0.000318,-0.000909,-0.005709,-0.003835,-0.003319,0.0019,-0.001519,-0.000289,-0.000651,-0.00411,0.000292,0.002935,-0.000943,-0.001069,-0.00213,-0.002883,-0.002555,-0.001195,0.000323,-0.003129,-0.002355,0.000317,-0.002294,0.000928,0.001104,-0.003197,-0.001856,0.002373,0.002439,0.001141,-0.00076,-0.0014,0.000362,0.000328,0.001018,-0.001157,-0.001393,4.3e-05,5.9e-05,-0.000402,-8.7e-05,-5.2e-05,-3.2e-05,-9.9e-05,6.9e-05,-0.000955,-0.000803,0.000153,-0.000262,0.000326,-0.000267,-0.000186,0.000447,0.000869,-0.000536,0.00021,-0.001837,-0.000813,-0.000407,0.000467,0.000379,-0.000179,-0.001009,-0.000833,2e-04,-1.9e-05,0.000183,-0.000236,-0.000157,4.2e-05,-9.5e-05,-0.000446,-0.001441,-0.000333,0.000373,-6.5e-05,-0.000366,-0.000121,-0.000395,-0.000981,-0.000185,0.002778,-0.004046,-0.000147,-0.002493,-0.001127,-1.5e-05,-3.4e-05,-8.9e-05,0.00024,-0.000538,-0.000254,-5.9e-05,0.000193,-0.000206,-0.000365,-0.000396,0.000272
-4.3e-05,0.000433,8.5e-05,-0.000177,-1.8e-05,-3e-05,3e-05,-4.6e-05,4.3e-05,9.9e-05,-0.000139,1.1e-05,-0.000114,0.000126,-0.000182,0.000155,-0.00031,0.000422,-0.002221,0.001899,0.000899,-0.000446,0.000403,0.000168,0.001697,-0.001124,0.000924,0.001129,-0.004215,-0.004284,-0.00321,0.00232,0.000222,-0.002606,-0.004549,-0.003723,0.001272,0.002055,-0.001342,-0.000125,0.00133,0.004841,0.001586,5e-05,0.000522,0.000675,0.000351,0.000878,-0.001187,0.000253,-0.00082,0.000961,-0.000702,-0.000169,0.000727,0.000349,-4.8e-05,-0.00185,0.000731,0.000811,0.00057,0.000452,0.000619,0.000335,-0.000237,8.4e-05,-0.000244,0.000525,0.000892,8.9e-05,0.000475,7.4e-05,-0.000301,0.000769,0.001123,-2.3e-05,-0.000541,-0.000186,-0.000829,-0.001559,0.000176,-0.000768,0.000489,-0.000371,-0.001075,0.000456,0.000352,2e-05,-0.000194,-0.000146,4.3e-05,-0.000149,-7.6e-05,-0.00046,0.000344,-0.000412,-0.000884,-0.000501,-0.000125,8.8e-05,-7.6e-05,0.000192,-0.000134,-0.000949,-0.005405,0.000352,-0.000707,0.002643,0.001717,0.000577,0.000118,2.2e-05,5.1e-05,-0.00029,0.000353,-4.9e-05,-8.9e-05,0.000135,4.8e-05,9.1e-05,2.5e-05
-5.9e-05,-0.000407,-0.000232,0.000104,-6.3e-05,-5.8e-05,-0.000287,-9.3e-05,0.000229,-0.00019,-0.00016,-9.9e-05,-3e-06,-0.000152,6.8e-05,3e-05,5.1e-05,0.000461,0.001195,-0.001697,-0.00023,-0.000899,-0.000149,0.000104,-0.001133,-0.002757,-0.004159,-0.001312,-0.001732,0.000333,0.002809,-0.000543,-0.000932,0.004355,0.0034,0.00229,-0.001624,-0.001964,-0.000813,-0.00304,-0.006214,-0.00292,0.001024,0.000154,-0.002697,-0.002024,-0.000711,-0.000884,0.000229,0.001029,0.000744,-0.001162,-0.000637,-0.000606,-0.000616,0.000342,-0.001042,0.000128,-0.001049,-0.000661,-0.000293,0.000158,-0.000117,-0.000471,-0.000309,3.5e-05,-0.000409,-0.000378,0.000116,-0.000355,-0.000194,-0.000121,0.000156,-0.000258,-0.000323,-0.000445,-0.000348,-0.001213,-0.000317,0.000107,-0.001121,-0.000631,-0.000391,-0.000605,-0.000275,-0.00105,-0.001118,0.000174,0.00019,-0.000333,-0.000228,-0.000345,0.000221,-0.00011,0.000264,0.000185,-0.000503,0.000185,9.2e-05,4e-06,-0.00028,0.000276,-0.000155,0.000809,-0.000893,-0.000788,0.002349,-0.002388,-0.00203,-0.000534,-6.5e-05,-0.000126,-0.000243,-0.00025,4e-06,-8.1e-05,3e-05,-0.000205,-7.5e-05,-0.000253,-0.000168
1e-04,9.9e-05,0.000162,4e-06,1.4e-05,0.000138,2.6e-05,-8.5e-05,-0.000164,-5.3e-05,6.6e-05,8.6e-05,-0.000279,7.2e-05,0.000119,6.4e-05,-5.7e-05,0.000113,0.00013,0.000362,-0.000417,0.000322,-0.00063,-0.000125,0.000345,-4.7e-05,0.001199,-0.000507,0.001589,-0.001482,0.000709,0.001539,-0.001758,-0.000665,-0.002486,-0.001824,-0.001727,0.002237,-0.000186,0.001829,0.000664,-0.002323,-0.002005,-0.000569,0.000839,0.001391,0.000284,0.001345,0.001151,-0.000457,-0.000488,4.3e-05,0.000439,0.000467,-0.000326,0.000172,0.000598,0.000773,0.00113,-0.000639,-5.3e-05,-0.00082,2.4e-05,-0.000208,0.000368,0.000123,-0.000184,2e-04,-0.000457,9.4e-05,0.000292,0.000114,0.000566,-0.000354,-0.000545,-0.000457,0.000457,0.00024,-0.000382,0.000491,0.000643,0.00023,-0.000496,-0.00018,-0.000955,-0.000109,3.1e-05,-0.000102,-0.000309,-0.000175,0.000206,0.000119,-9.7e-05,7e-06,-0.000182,0.000226,0.000428,-0.000495,-4.6e-05,0.000146,1.1e-05,1.9e-05,0.000554,-0.000143,-0.001984,-0.001086,-0.004125,-0.000745,0.000232,7.1e-05,7.7e-05,-0.000162,0.000209,-0.000206,-8e-05,-0.000264,-0.000195,-0.000146,-0.000125,-9e-06,1.2e-05
3.1e-05,0.000183,0.000175,0.000146,-0.000154,-5.1e-05,0.00019,1.5e-05,-2.9e-05,1.9e-05,-7e-06,0.000176,5.1e-05,-4.1e-05,-0.000242,-0.000251,-7.3e-05,8.2e-05,0.000306,-0.000778,-0.000405,0.000695,0.000859,0.000261,-0.000364,0.000809,-0.000609,-0.000945,0.000604,0.00337,-0.00016,0.000112,0.002,-0.001141,0.001102,0.002419,-0.00293,-0.000758,0.004271,0.000423,-0.001092,-0.000528,0.000298,0.000465,-0.002739,-0.003923,-0.001603,-0.00288,-0.001572,-0.000268,-0.000638,-0.001078,0.000443,-0.000496,-0.000331,-0.00104,-0.001553,-0.000359,-0.000926,0.001105,-0.00031,-0.000107,-0.000152,-0.000101,-0.000402,-0.000379,-0.000165,6.8e-05,3.6e-05,2.8e-05,-0.000255,-0.000235,-9.2e-05,-5.7e-05,-0.000325,-0.000141,-9.6e-05,0.000108,-0.000267,-0.000154,-0.001065,-0.000444,-0.00011,-0.000428,0.000173,0.000741,-0.000345,-0.000161,0.000219,0.00017,-0.000189,-0.000362,-5.7e-05,0.000217,0.00015,-0.000249,-0.000368,-0.000341,-0.000259,-4.7e-05,0.000246,3.7e-05,0.000274,-0.000101,0.00043,-0.002706,0.0018,0.000177,0.000298,0.000419,-8.5e-05,-0.000154,-0.000221,-0.000252,-0.000191,-4e-05,8.4e-05,2.5e-05,-8.4e-05,0.00029,3.7e-05
-9.2e-05,0.000139,-0.000153,-3.5e-05,0.000182,4.5e-05,6.5e-05,5.1e-05,-8.3e-05,-7.3e-05,7.1e-05,-2.2e-05,0.000159,1.6e-05,5e-06,-2.1e-05,-6.8e-05,-0.00012,-0.000349,-0.000949,0.001634,3e-05,-0.000596,-0.000494,-0.000613,0.00052,0.001022,0.001491,0.000233,0.000905,-0.001572,-0.001311,-0.00205,-0.000476,-0.000652,0.00078,0.003063,-0.00163,-6.3e-05,0.000684,0.000746,0.001097,-0.001295,-0.001047,0.000917,0.000125,0.000947,0.000594,-0.00016,0.000107,0.000224,-0.000357,8.3e-05,4.4e-05,3.1e-05,0.000153,0.000917,-0.000191,-0.000232,-0.000408,4.4e-05,0.000513,0.000193,5.8e-05,5.6e-05,-0.000134,-2.4e-05,0.000124,-0.000336,0.000189,0.000143,-2.5e-05,0.000189,-0.000105,-0.000198,-0.000171,-0.000165,-0.000185,-0.000415,-0.000486,-0.000256,-0.000987,-0.000148,-6.1e-05,0.000686,-0.000166,9.2e-05,-2e-05,-0.00023,-0.000111,0.000204,0.000273,-0.000114,-0.000352,-0.000235,-6.5e-05,-0.000218,9.4e-05,9.6e-05,-3.5e-05,-1.5e-05,-0.000243,-0.00039,2e-05,0.000479,0.001613,-0.003162,-0.001051,-0.00128,0.000198,0.000357,-7.5e-05,6.8e-05,-0.000196,-7.5e-05,-0.000153,5.8e-05,-0.000116,0.000148,-7.4e-05,-0.000209
6.2e-05,-4.7e-05,0.000116,-6.5e-05,1e-04,1.3e-05,6e-06,4e-05,-2.3e-05,-7.7e-05,-0.000119,-3.9e-05,-7e-06,-6.5e-05,-4.8e-05,8.3e-05,0.000145,0.000129,0.00023,0.001068,-0.000871,-0.000593,0.000537,-2e-06,0.000615,-0.000482,-0.00014,0.000316,0.00061,-0.002456,-0.001379,9e-05,0.001567,-0.00199,0.001618,0.00083,-0.003122,-0.001163,-0.000369,0.001355,0.001665,-0.000799,-2.3e-05,0.001668,-0.000907,0.001728,-0.001538,-3e-04,-0.000399,-0.000238,0.00152,0.000149,-0.00076,2e-06,-1e-05,0.000232,-0.000898,-0.000206,-0.000515,-0.000539,-0.000742,-0.000318,-0.000275,-0.00018,6e-06,-3e-06,-4.1e-05,-0.000227,-0.000102,-0.000234,-0.00038,-2.9e-05,-0.000256,-7.4e-05,0.000174,0.000316,-0.00014,0.000146,0.000269,-7.2e-05,0.000268,-0.000213,-0.000403,-2.2e-05,-0.000184,0.000277,0.00039,-2e-06,9e-06,7.3e-05,8.6e-05,-6.8e-05,3.3e-05,-6.3e-05,-0.000248,-0.000224,-6.5e-05,-4.7e-05,-7.4e-05,-9.9e-05,-0.000108,-4.3e-05,6.4e-05,0.000423,0.000438,0.000825,0.00165,0.00157,0.000198,-0.000202,-5.1e-05,-0.000128,-8.5e-05,-0.000108,-2.6e-05,-0.000115,-3.5e-05,1.8e-05,-0.000116,-0.000111,-1.4e-05
-8.7e-05,3.3e-05,-0.000162,2.1e-05,-8e-05,2.8e-05,-2.5e-05,-9.3e-05,7.3e-05,0.000118,1.9e-05,5.4e-05,-5.7e-05,-0.000107,-2.2e-05,-7.4e-05,-0.000174,-6.6e-05,-0.000272,0.00027,0.000522,0.000405,-0.00036,-3.7e-05,-0.000153,-0.000372,-0.000332,0.001612,-0.000144,0.001077,-0.000628,-0.000906,0.000679,0.000386,-0.001474,0.000327,0.001344,0.001597,0.000822,-0.000111,8.6e-05,-0.000119,0.001003,-0.000503,0.001488,-0.001098,0.001355,-0.000286,0.000241,-0.000258,-0.000269,-0.000257,-5.8e-05,5e-05,-0.000258,-0.00047,0.000389,0.000388,0.000123,0.000163,0.000818,8e-06,-0.00021,0.000112,-3.7e-05,-9.5e-05,1.3e-05,5.4e-05,0.000118,-0.000134,4.5e-05,-1.2e-05,-1.9e-05,6e-06,0.000103,-0.000109,-0.000119,-0.000221,-0.000394,0.000318,3.5e-05,-0.000366,-9e-06,-5.3e-05,0.000256,-9.9e-05,0.000515,8.3e-05,1e-06,-6e-06,-1e-05,5.1e-05,-0.000112,4.9e-05,-0.000239,-8e-06,0.000118,2.9e-05,2e-05,-4.3e-05,4.9e-05,2e-06,0.000166,-8e-04,-5.7e-05,-0.000791,-0.000596,-0.001863,-0.000462,0.000169,0.00038,5.9e-05,-4.8e-05,3.2e-05,-7e-05,-0.000216,2.3e-05,-5.3e-05,-4.3e-05,-2.8e-05,-8.4e-05
4.8e-05,2.7e-05,2.4e-05,-4e-06,2e-06,-2.5e-05,0,3.9e-05,-2.6e-05,-3.6e-05,-1.3e-05,-3.5e-05,-2.8e-05,0.000107,5.7e-05,-2.5e-05,-1e-06,-2e-05,7.1e-05,-9e-06,-0.000489,-0.000208,0.000152,4.7e-05,-0.000344,-0.000541,0.000519,1.6e-05,-0.000297,0.000614,0.000128,0.000268,-0.000359,0.001244,0.001095,-0.000393,-0.001046,-0.000369,-0.000883,-0.000557,6.9e-05,0.000837,-0.000129,-0.000974,-0.000723,-0.000112,4.8e-05,0.000205,-0.00022,7.4e-05,-0.000411,-2.7e-05,-0.000247,-0.000367,0.000185,-0.000215,2.4e-05,0.000246,0.000285,0.00011,-0.000424,-6.3e-05,0.000283,-0.00011,8.8e-05,3e-05,-1e-04,-8.4e-05,-0.000198,5.8e-05,-6.8e-05,-0.000122,-0.000142,-2.3e-05,-0.000195,-4e-06,-8.9e-05,-3.2e-05,0.000654,0.000181,0.000371,0.000379,1.1e-05,-3.8e-05,-0.000108,0.00024,-0.000248,-0.000211,-0.000241,9.1e-05,-5.2e-05,-2e-05,9e-06,3.2e-05,-1.9e-05,-5.2e-05,-7.7e-05,-3.1e-05,-6.7e-05,4.9e-05,2e-05,-5.4e-05,1.2e-05,0.000307,-0.000158,0.000991,0.000494,0.001604,0.000113,-2e-04,-0.000197,-2.3e-05,-3.8e-05,-0.000139,-4.2e-05,4.5e-05,-7.2e-05,7e-06,1.6e-05,0.000102,3.1e-05
-9.3e-05,-2.1e-05,1.9e-05,-1.6e-05,-0.00012,5e-06,-6.5e-05,1e-05,-1.4e-05,-3.4e-05,-3e-06,4e-06,-1.7e-05,-4.8e-05,-4.2e-05,4.6e-05,-1.3e-05,-2.3e-05,5e-06,-0.000209,-0.000346,-0.000133,1.2e-05,0.000305,0.000153,-9.5e-05,-0.000312,8.4e-05,0.000698,-0.000306,-0.000574,0.000242,0.000664,0.001467,-0.000591,-0.000322,0.001414,-0.000155,0.000741,-0.000804,0.000207,0.000174,-0.000333,0.000912,0.00041,8.9e-05,-0.00055,-0.000296,0.000453,0.000268,0.000367,0.000199,5.4e-05,4e-06,-1e-06,5e-05,-0.00049,-5e-06,-0.00024,0.000241,0.000162,0.000161,-0.000104,7e-05,-4.2e-05,-0.000149,-3e-05,1.9e-05,0.00013,-2.3e-05,-1.4e-05,6.5e-05,1.1e-05,7.7e-05,7.6e-05,-0.000215,0.000132,-7.5e-05,-0.00018,7e-06,-0.000175,3.7e-05,0.000308,-2.4e-05,2.3e-05,-0.000211,-0.000286,4.1e-05,-1e-06,-8.9e-05,-3.8e-05,7e-06,1.1e-05,-3.4e-05,-4.6e-05,0.000116,7.1e-05,9.3e-05,-2.4e-05,1.5e-05,-1.8e-05,-6.3e-05,2e-05,0.000202,-0.000358,-0.000268,-0.001288,-0.001405,-1.1e-05,0.000117,1.9e-05,3e-05,1.3e-05,-3.7e-05,-4.6e-05,-7.5e-05,-4e-05,1e-06,1e-06,-1.3e-05,2.4e-05
5.9e-05,-7.4e-05,8.5e-05,1.8e-05,6.6e-05,9e-06,-1.1e-05,1.5e-05,-4e-06,-1.2e-05,1.8e-05,-7e-06,2e-06,3.2e-05,-3.2e-05,1.8e-05,3.2e-05,-3.7e-05,5.4e-05,0.000238,-0.000255,0.000227,-6.7e-05,-0.000236,0.000225,0.000766,4.6e-05,0.000164,-9.5e-05,0.000369,-0.000417,0.000261,0.000163,-0.000638,0.00038,0.000518,-0.000468,-0.000165,-9.6e-05,0.000389,0.000204,-0.000218,-6.8e-05,-0.000239,0.000248,-0.000109,-0.000152,0.000286,-0.000223,-0.000135,0.000241,-3.1e-05,0.000156,-4.9e-05,-5e-05,-2.9e-05,0.000375,5.6e-05,0.000108,0.000151,-0.000175,-6.9e-05,8e-06,3e-06,-3.5e-05,0.000127,-6.8e-05,-5.7e-05,4e-06,0.000132,2e-05,-9e-06,1.9e-05,9.4e-05,-1.8e-05,0.000237,-7e-05,2.3e-05,-0.000143,-0.000136,-2.8e-05,0.000301,-0.000317,4.6e-05,9.9e-05,0.000127,-7e-06,-0.000149,-2e-06,5.5e-05,9.4e-05,1.5e-05,2.7e-05,3e-06,0.000228,-1.5e-05,-5.4e-05,0.000138,-5e-06,-6e-06,-1.5e-05,8.5e-05,-4e-06,-0.000227,-0.000257,-0.000518,0.000719,0.000939,9e-06,7.6e-05,0.000167,-3.9e-05,-1.3e-05,-2.9e-05,3.2e-05,7e-06,3.2e-05,-1.8e-05,4.6e-05,-3.6e-05,6.5e-05
1.5e-05,-6e-06,-5.7e-05,-2e-05,2.4e-05,7e-06,5e-05,-3.4e-05,1.2e-05,9e-06,1.3e-05,-1.5e-05,-2.7e-05,1e-05,1.1e-05,-5e-06,-2.9e-05,-1.9e-05,-7.6e-05,-0.000209,0.000235,-4.9e-05,3.1e-05,0.000281,-0.000164,-1e-06,5.3e-05,0.000153,-0.000259,0.000328,0.000362,6.3e-05,9e-06,0.000693,-4.4e-05,2.2e-05,0.000175,-0.000166,0.000141,-0.000191,-0.000632,-0.000274,0.000323,6.1e-05,-0.00047,0.000309,0.000494,-3.6e-05,0.000164,3.9e-05,-0.000288,7e-06,-1.5e-05,3.3e-05,4.9e-05,-2.3e-05,-6.7e-05,-0.00011,-5.3e-05,-0.00019,0.000153,3.8e-05,6.9e-05,2.2e-05,-3e-06,7.1e-05,6.7e-05,9e-06,5.7e-05,-5e-06,5.5e-05,6e-06,1.7e-05,-6e-06,-4e-05,-0.000153,8e-06,0.000112,-1.3e-05,-1e-06,6e-06,-0.000108,-4.6e-05,-7.1e-05,8.6e-05,6.5e-05,-4.5e-05,0.000153,1.1e-05,-3.3e-05,-1.9e-05,-4.4e-05,-2.2e-05,0,-7.1e-05,-8.2e-05,-6.9e-05,-8e-05,0,2e-05,6.5e-05,1.8e-05,-5.9e-05,5e-05,0.000133,4.1e-05,-0.000323,-0.000269,0.000112,-3e-05,-0.000216,-4.3e-05,-3.3e-05,-4e-06,1.3e-05,4e-06,2.3e-05,9e-06,-6e-06,2.6e-05,-1.9e-05
-1.7e-05,4.8e-05,5.4e-05,5e-06,-2.2e-05,3e-06,-1e-05,1.7e-05,2.4e-05,-1.1e-05,-8e-06,5e-06,0,-1.6e-05,-1e-06,-1.2e-05,1.5e-05,1.1e-05,3.2e-05,-0.000148,0.000294,-2.4e-05,0.000123,-0.000175,-5.5e-05,-0.000222,-8e-05,-0.00034,-0.000154,-0.000398,0.000711,-0.000556,-0.000215,-0.000673,0.000204,0.000429,-0.00063,1e-06,5e-05,0.000219,9e-06,0.000505,0.000126,0.00015,4.1e-05,0.000323,-0.000456,-0.000102,7.5e-05,-0.000124,1.3e-05,0.000179,1.6e-05,8.8e-05,5.8e-05,4.6e-05,0.000212,1e-04,2.2e-05,0.000166,0.000141,-2e-06,-7.7e-05,1.6e-05,5.2e-05,-6.2e-05,-2.4e-05,-2e-05,2.2e-05,-6e-05,6.3e-05,0,-5.4e-05,-3.6e-05,-1.9e-05,0.000121,-2.4e-05,-1.7e-05,-3.2e-05,9.6e-05,-5.2e-05,-0.00021,6e-06,-4.8e-05,-9e-05,-0.000177,8.7e-05,-4.3e-05,6e-05,-2e-06,1e-05,-4e-06,2.3e-05,-3.9e-05,8.5e-05,4.4e-05,-3.1e-05,-0.000106,-1e-06,-2e-06,4e-06,1.5e-05,-2.8e-05,4.2e-05,0.000109,9.1e-05,0.000551,-0.000188,-0.000313,-0.000178,0.000205,-2.5e-05,4.9e-05,-1e-06,-3e-06,2.2e-05,-4.5e-05,-4.5e-05,7e-06,-2.7e-05,-3e-06
2e-06,-5.2e-05,2.1e-05,6e-06,-1e-06,-4e-06,-1.1e-05,-1.1e-05,-2.1e-05,-4e-06,-9e-06,-1.9e-05,2.8e-05,2.5e-05,-9e-06,-1.3e-05,-5e-06,-7e-06,-5.7e-05,0.000157,3e-06,-5.7e-05,-4.7e-05,2.2e-05,9.2e-05,-0.000156,-8e-06,9.6e-05,6.6e-05,-0.00012,0.000109,0.000419,0.000194,-0.000316,-0.00016,-0.000131,0.000231,0.000163,-0.000365,-0.000186,-0.000165,0.000133,-0.000182,-0.000387,-6.4e-05,-0.000225,0.000137,3.5e-05,6.8e-05,8.6e-05,0.00012,-0.000154,-9.9e-05,-0.000106,7.6e-05,-9.1e-05,-0.000179,0.000212,-8.1e-05,-6.4e-05,-0.000168,0.000121,3.1e-05,-3.3e-05,-3.3e-05,3.5e-05,-1.6e-05,1.7e-05,-7.5e-05,-1.4e-05,-5.8e-05,7e-06,-2.8e-05,4e-06,1.5e-05,-5.6e-05,-9e-06,2e-06,-6e-06,1.1e-05,1.7e-05,9e-05,6.8e-05,2e-06,8e-05,0.000189,7e-06,1e-06,-3.8e-05,2.6e-05,-2.7e-05,-2.6e-05,0,1e-05,2.2e-05,-1.1e-05,4.2e-05,-5e-06,-2.4e-05,-3e-06,-2.1e-05,-7e-06,1.3e-05,-6.7e-05,0.000223,-0.000186,-0.000357,4e-04,0.000171,0.00011,-0.000134,-2.4e-05,-3.7e-05,-3.9e-05,-1.3e-05,-3.2e-05,6e-06,3e-06,9e-06,0,5e-06
-1.2e-05,-1.2e-05,-9e-06,-2e-06,-7e-06,1e-06,-1.1e-05,2e-06,-1.3e-05,1e-05,-7e-06,7e-06,-1.2e-05,-3.1e-05,7e-06,1.6e-05,5e-06,-7e-06,3.6e-05,-0.000104,-9e-06,-5.4e-05,-5.5e-05,7.4e-05,-2.5e-05,-0.000202,-0.000107,-0.000222,-0.000149,1e-06,-0.00039,-2.9e-05,0.000529,0.000344,0.000238,0.000132,-0.000144,1.6e-05,-3.7e-05,-0.000167,0.000184,-0.000353,-0.000285,-5e-06,-7.7e-05,-0.00019,3.3e-05,-6.6e-05,0.000239,-1.4e-05,-3e-05,-0.000124,-2.4e-05,3.4e-05,-0.000131,9e-06,0.000186,-0.000107,-1.6e-05,3.9e-05,-1.5e-05,-8.3e-05,-2.7e-05,2.5e-05,2.6e-05,-5.4e-05,5e-06,-1.3e-05,5.2e-05,-1.9e-05,5.6e-05,-4e-06,1.6e-05,-4.2e-05,1.5e-05,1.9e-05,-1.5e-05,-9.2e-05,-1e-06,-7e-06,2.2e-05,-0.00011,-9.1e-05,-1.8e-05,-4.3e-05,-6.8e-05,0.000132,2e-05,1e-06,2.5e-05,6e-06,4.6e-05,-1.2e-05,3e-05,2.5e-05,3.1e-05,2e-06,-2.8e-05,1.4e-05,6e-06,1.6e-05,3e-06,7e-06,5e-05,0.000108,0.000257,-0.000209,-0.000368,-8.9e-05,-7.8e-05,-1.2e-05,-1e-05,1.8e-05,-3.2e-05,-7e-06,-2.7e-05,6e-06,-1.1e-05,0,1e-06,-1.5e-05
6e-06,5e-06,-3e-06,2e-06,1.4e-05,4e-06,1e-06,-9e-06,9e-06,-1e-06,3e-06,-3e-06,-2.2e-05,1e-05,-3.1e-05,6e-06,-5e-06,-3e-06,-1e-06,0.000189,-0.000113,7.3e-05,2e-06,-0.000126,-7.1e-05,9.8e-05,8.4e-05,0.000298,5e-06,0.000362,1e-06,8.5e-05,0.000205,-0.00048,-8e-06,-0.000128,-0.000414,-6.6e-05,-6e-06,1.6e-05,0.000291,-0.000154,0.000246,0.00015,9.2e-05,5.5e-05,-1.4e-05,4.9e-05,-4.5e-05,0.000107,4e-05,7.3e-05,-1.2e-05,-3.9e-05,1.8e-05,9.4e-05,-0.000202,7.3e-05,1.5e-05,0.000103,-8.8e-05,-1.5e-05,2.9e-05,-4e-06,-1.5e-05,2e-05,-2.4e-05,-1e-05,-2.7e-05,2.7e-05,-5.7e-05,1.3e-05,2e-06,1e-05,3e-06,-9.1e-05,3e-05,-8e-06,1e-06,-4.6e-05,1.3e-05,0,3.1e-05,-2.8e-05,2.7e-05,-2.7e-05,-8.2e-05,3e-05,-2.1e-05,2e-06,1.4e-05,-2.1e-05,-6e-06,-1.8e-05,-3.2e-05,-2.8e-05,2e-06,3.6e-05,-2.9e-05,-9e-06,1.6e-05,-1e-06,-3.8e-05,-4e-06,-9.2e-05,0.000189,0.000278,0.000211,-8.2e-05,-1.5e-05,2.3e-05,-9e-06,0,-1.9e-05,6e-06,-2.5e-05,-7e-06,-8e-06,-1e-06,2.8e-05,-2.3e-05
-4e-06,-9e-06,2.5e-05,-4e-06,-2.6e-05,5e-06,-1.2e-05,1e-05,-3e-06,-1.2e-05,3e-06,-5e-06,4e-06,-1.6e-05,5e-06,-2e-05,-4e-06,1e-06,3.1e-05,8.3e-05,0.000127,1.2e-05,3e-06,9e-06,8.6e-05,0.000225,4.4e-05,-0.000336,-6e-05,-0.000126,0.000149,8.4e-05,-3.8e-05,0.000127,-1e-05,-9.5e-05,0.000203,-0.000259,-0.000118,-0.000166,-0.000285,5.7e-05,1e-06,0.00012,-8.1e-05,0.000147,5e-06,-5.1e-05,-2.3e-05,-0.000142,2.3e-05,-5e-05,2.8e-05,-5e-06,3.5e-05,-0.000103,7.2e-05,-6.3e-05,-1.3e-05,-7.4e-05,0.000115,1.8e-05,1.7e-05,0,-2.7e-05,3e-06,8e-06,2.9e-05,-3.1e-05,3e-06,1.8e-05,9e-06,2.8e-05,1.1e-05,1e-06,-1.1e-05,-1e-05,3.4e-05,-1.4e-05,-2.2e-05,-3e-06,-1.6e-05,2.3e-05,-6e-06,2.2e-05,4.1e-05,-7.2e-05,-3.7e-05,-2.1e-05,-1e-05,-2.2e-05,1.2e-05,3e-06,-2.7e-05,-3.1e-05,2e-06,1e-06,3e-06,1.6e-05,-5e-06,-1.8e-05,0,1.2e-05,-1.4e-05,-5.9e-05,-0.000231,-0.000226,-9.4e-05,1.7e-05,1e-06,-3.8e-05,-4e-06,-2e-06,3e-06,-1.2e-05,1e-06,-9e-06,8e-06,3e-06,-1.4e-05,5e-06
6e-06,-9e-06,-1.5e-05,2e-06,1e-05,-4e-06,3e-06,-4e-06,1.1e-05,4e-06,2e-06,6e-06,7e-06,5e-06,8e-06,-5e-06,1e-06,1e-06,-3e-05,-0.000111,-2.2e-05,-5.2e-05,1.8e-05,7.7e-05,-1.1e-05,4e-05,-2e-06,0.00015,-4.9e-05,-0.000105,-4.3e-05,-0.000226,0.000121,-1.7e-05,-6.3e-05,0.00012,-0.000156,0.000126,0.000158,1.2e-05,0.000104,6.3e-05,0.000113,-0.000108,0.00015,6.2e-05,-3.9e-05,5.7e-05,-9.5e-05,-6.3e-05,-5.6e-05,-5.3e-05,1.9e-05,-2.2e-05,-1.9e-05,-5.8e-05,-3e-06,3.8e-05,6.4e-05,5.6e-05,-9.9e-05,3.9e-05,-6e-06,-1e-05,3.8e-05,-9e-06,-2.3e-05,-8e-06,9e-06,7e-06,-3.5e-05,-3e-05,1.1e-05,-1.8e-05,-7e-06,-2.9e-05,-1.7e-05,3.3e-05,-8e-06,3.9e-05,2.1e-05,-3.1e-05,1.6e-05,-5e-06,1.3e-05,-1.5e-05,-2.1e-05,-2e-06,2.3e-05,8e-06,1.1e-05,-6e-06,-3e-06,9e-06,-3.6e-05,-2.4e-05,-3e-05,2e-06,-2.4e-05,2e-06,9e-06,-5e-06,1.4e-05,-3e-05,-5.5e-05,8.8e-05,8.5e-05,-4.1e-05,-6.2e-05,5.6e-05,1.8e-05,5e-06,-8e-06,-7e-06,-4e-06,-1.9e-05,4e-06,-6e-06,1e-06,-1.9e-05,-3e-06
-7e-06,-3e-06,-6e-06,2e-06,-7e-06,3e-06,2.3e-05,3e-06,-9e-06,0,0,-3e-06,-1e-06,3e-06,-1.5e-05,1.3e-05,2e-06,0,9e-06,-2.7e-05,-0.00014,3.5e-05,1.4e-05,-9.4e-05,-7.1e-05,-0.000139,4.7e-05,-0.000161,-1.4e-05,0.000211,2.3e-05,5.2e-05,-6.4e-05,0.000315,4.2e-05,-0.000125,0.000272,1.3e-05,-0.000203,2.7e-05,-2e-05,2.3e-05,-0.000221,7.4e-05,-0.000131,-1.7e-05,4.8e-05,-9.2e-05,-8e-06,6.5e-05,-4e-06,8.4e-05,8e-06,2.5e-05,-1.2e-05,3.4e-05,-7.5e-05,3.6e-05,-6.1e-05,1.4e-05,9.8e-05,-3.2e-05,-1.1e-05,8e-06,-2e-06,-2.7e-05,1.3e-05,-1e-06,-3.4e-05,-1.5e-05,1.2e-05,2.2e-05,-1e-06,2.3e-05,1e-05,7.7e-05,8e-06,2.9e-05,3.4e-05,2.9e-05,-1.4e-05,-3.6e-05,-3.7e-05,-1.4e-05,-9e-06,7e-06,-4.3e-05,1e-05,-1e-06,-5e-06,-6e-06,-4e-06,-5e-06,1.1e-05,-2.6e-05,2e-05,0,2.9e-05,4e-06,-7e-06,9e-06,-5e-06,-1.9e-05,5.5e-05,-3.6e-05,-5.7e-05,-2.1e-05,0.000143,7.2e-05,-4.2e-05,-3.1e-05,-1.2e-05,5e-06,-1.7e-05,-6e-06,-1.6e-05,8e-06,2e-06,4e-06,1e-05,-1e-06
-4e-06,2.5e-05,1e-06,-5e-06,1.8e-05,0,-7e-06,-7e-06,-8e-06,-8e-06,-3e-06,2e-06,-9e-06,-3e-06,2e-06,1e-05,-1e-06,0,-1.9e-05,4e-06,0.000149,1.9e-05,-3.4e-05,4.5e-05,6e-05,-9.8e-05,-4e-05,0.000104,-2.7e-05,-0.000126,-0.000217,-8e-05,0.000115,-5e-06,-3.1e-05,-6.6e-05,-0.000411,0.000106,-0.000154,0.000104,-1.4e-05,0.000122,8.2e-05,-7.8e-05,7.1e-05,-4.9e-05,-4.5e-05,8.3e-05,3.2e-05,-3.1e-05,1.8e-05,8e-06,-3.1e-05,-2.2e-05,3.2e-05,5e-06,8.9e-05,1.8e-05,-1.2e-05,7e-06,-2.9e-05,-4e-06,-3.2e-05,-9e-06,-7e-06,1e-05,-1e-05,-4e-06,3.9e-05,-2.5e-05,-1.8e-05,-1e-06,-1.1e-05,5e-06,-1.3e-05,-2.2e-05,-3e-06,-4.8e-05,-5.6e-05,-1.5e-05,-1.8e-05,8.1e-05,-5e-06,-1.1e-05,3.9e-05,-3.5e-05,2.6e-05,-2.1e-05,-1.1e-05,-1.4e-05,1.9e-05,-1e-06,6e-06,-8e-06,-1.2e-05,1.1e-05,1.3e-05,3e-05,-3e-06,4e-06,3e-06,-1e-06,6e-06,-2.3e-05,7.5e-05,-0.000143,1.1e-05,-0.000205,-7.3e-05,-2e-06,-2e-06,-9e-06,0,-1.5e-05,5e-06,-2e-06,-7e-06,-1.2e-05,-1e-06,2e-06,1e-05
4e-06,-3e-06,5e-06,4e-06,-2e-06,-2e-06,-5e-06,6e-06,1.4e-05,0,-1e-06,1e-06,5e-06,1.4e-05,-7e-06,-6e-06,-1e-06,0,9e-06,0.000109,3.5e-05,-5.4e-05,2.4e-05,3.6e-05,1.8e-05,-3.6e-05,-1.9e-05,-0.00018,-6.4e-05,-0.000119,1.6e-05,0.00013,0.000139,0.000253,-3.6e-05,-2.8e-05,0.000278,-2.3e-05,0.000146,-2.6e-05,1.5e-05,6.4e-05,2e-05,-9.6e-05,-6.1e-05,-6.4e-05,-6.1e-05,-3.5e-05,7e-06,2.5e-05,-4.6e-05,-2.9e-05,-1.3e-05,8e-06,2.8e-05,-2.2e-05,-0.000112,-1.9e-05,-1.4e-05,2e-05,3e-06,1.6e-05,3.5e-05,3e-06,2e-06,1.7e-05,4e-06,7e-06,-8e-06,2e-06,-1.6e-05,-8e-06,-2e-06,-9e-06,-1e-05,1.7e-05,-5e-06,-1.8e-05,-2.1e-05,-3.4e-05,0,2.4e-05,3.3e-05,-6e-06,-2.3e-05,5.7e-05,7.1e-05,2.2e-05,-2e-06,1.2e-05,-1.4e-05,-3e-06,2e-06,-1e-06,3e-06,-1.4e-05,-3e-06,-3.4e-05,-1e-05,-1e-06,-1.6e-05,1e-06,9e-06,-2.4e-05,3.9e-05,1.5e-05,1.4e-05,0.000213,3e-05,-4e-06,1.7e-05,-3e-06,-8e-06,-5e-06,3e-06,-1e-06,-3e-06,-4e-06,0,7e-06,1.3e-05
-1e-06,-7e-06,-1.4e-05,-1e-06,-1.9e-05,1e-06,-4e-06,-6e-06,-3e-06,1e-06,-2e-06,0,8e-06,-5e-06,-7e-06,-7e-06,1e-06,1e-06,4e-06,-0.000172,-5.2e-05,2e-05,-1.3e-05,-4.1e-05,-5.5e-05,4.7e-05,-5e-06,8.9e-05,3.3e-05,0.00016,0.00014,2.9e-05,0.000109,-0.000233,8.8e-05,-0.000158,-0.000274,-0.000105,-0.000101,-6.4e-05,-8.2e-05,-9.7e-05,9.4e-05,0.000154,8e-06,2e-04,1.4e-05,-3.3e-05,-5e-06,-4e-06,1.7e-05,5.2e-05,-8e-06,-4e-06,-2.4e-05,2.4e-05,9.8e-05,-3.4e-05,2.5e-05,-2.7e-05,-7e-06,3.2e-05,-1.2e-05,-1e-06,6e-06,-7e-06,-4e-06,-7e-06,-1.5e-05,1.4e-05,3.6e-05,4e-06,-1e-06,8e-06,1e-06,-4.2e-05,8e-06,-1.8e-05,3e-06,-1e-06,5e-06,-4.9e-05,-4.3e-05,-1e-05,5e-06,-4.9e-05,2.4e-05,-2e-05,-1.3e-05,1.4e-05,-1.4e-05,1e-06,-3e-06,2e-06,4.7e-05,0,-1.6e-05,-2.3e-05,1.2e-05,0,1e-05,3e-06,-9e-06,4.2e-05,-1e-05,6.6e-05,0.000166,-0.000179,2e-06,3.4e-05,-1.7e-05,-8e-06,1.5e-05,-3e-06,1e-06,-1.4e-05,1e-06,-7e-06,3e-06,-7e-06,-2e-06
2e-06,9e-06,1.1e-05,-2e-06,1.1e-05,-1e-06,2e-06,6e-06,0,-2e-06,5e-06,2e-06,-1.1e-05,7e-06,8e-06,1e-06,1e-06,0,1.1e-05,1.2e-05,-1.9e-05,3.6e-05,4e-06,8e-06,1.6e-05,0.000103,7e-06,-6.8e-05,2.1e-05,2.3e-05,-5e-06,-0.00011,7.4e-05,-0.000114,-7.4e-05,-4e-05,0.000306,-9e-06,0.000166,1.7e-05,0.000114,-8e-05,-0.000114,-4.7e-05,-2.2e-05,2.3e-05,9.6e-05,6e-06,-5e-06,-4.6e-05,3.3e-05,-1.5e-05,1.1e-05,-1.9e-05,-2.6e-05,-1.2e-05,-8.5e-05,3.9e-05,9e-06,5.7e-05,8e-06,-3.5e-05,-3e-06,-2e-06,-1e-05,5e-06,-3e-06,6e-06,2.3e-05,1.1e-05,-2e-06,-3e-06,6e-06,-4e-06,0,1.6e-05,-1e-06,2.4e-05,-1.7e-05,2.1e-05,1e-06,6e-06,-6e-06,-7e-06,3e-06,8e-06,-2.3e-05,1.3e-05,-3e-06,-3e-06,9e-06,-2e-06,1e-06,-1e-05,1.6e-05,-1e-05,7e-06,-9e-06,-2.4e-05,-1e-06,7e-06,-1e-06,-3e-06,-2.1e-05,-1.1e-05,1.3e-05,-0.000177,1e-04,-5.2e-05,-2e-05,1.1e-05,-4e-06,-1.2e-05,-4e-06,-1e-06,2e-06,1e-06,-9e-06,-1e-06,1e-06,-2e-06
-3e-06,7e-06,-3e-06,3e-06,-8e-06,1e-06,-2e-06,-7e-06,0,-4e-06,-2e-06,-1e-06,-7e-06,-7e-06,-6e-06,7e-06,-1e-06,0,-6e-06,8.8e-05,-1.7e-05,0,1.8e-05,4.6e-05,3.4e-05,1.2e-05,-1e-05,5.8e-05,-4.3e-05,-7.5e-05,6.5e-05,2.2e-05,-1.9e-05,2e-06,3.7e-05,-7.5e-05,-0.00045,-4.1e-05,-6.9e-05,-1e-06,-5.5e-05,4.4e-05,-7e-06,-2.1e-05,-1.4e-05,-0.000172,-9.8e-05,1e-06,3.9e-05,2.2e-05,-4.3e-05,-4.1e-05,2.1e-05,-2e-06,9e-06,1.8e-05,9.8e-05,-8e-06,-2.9e-05,1.3e-05,7e-06,-6e-06,2.4e-05,6e-06,1.3e-05,-8e-06,-3e-06,-7e-06,-1.3e-05,-1e-06,2.1e-05,0,6e-06,-9e-06,7e-06,-3.5e-05,-9e-06,3e-05,-5e-06,7e-06,5e-06,-7.8e-05,5e-06,-5e-06,-1.2e-05,2.3e-05,-2.9e-05,-1.9e-05,4e-06,-6e-06,3e-06,8e-06,3e-06,-1e-06,1.5e-05,1.1e-05,-6e-06,1.8e-05,1.1e-05,6e-06,-8e-06,1e-06,1e-05,-1.5e-05,-6.8e-05,0,8.9e-05,-2e-06,2.8e-05,5e-06,3e-06,-1e-06,5e-06,-1e-05,-2e-06,-3e-06,-2e-06,2e-06,1e-06,-4e-06,0
-2e-06,-4e-06,-2e-06,-1e-06,1.3e-05,0,1e-06,8e-06,-7e-06,3e-06,3e-06,0,8e-06,-2e-06,-7e-06,-1e-06,1e-06,0,-4e-06,3e-06,0,-1.3e-05,-1.1e-05,-3.5e-05,-3.2e-05,-6.3e-05,-3e-06,-4.7e-05,-1.5e-05,-3.7e-05,-3.5e-05,-4.6e-05,-8e-06,-0.000151,1e-05,-6.8e-05,0.000229,9.5e-05,-9.7e-05,-1.3e-05,2.6e-05,1.5e-05,-3.1e-05,3.1e-05,9e-05,7.7e-05,3.2e-05,3.4e-05,3.2e-05,4e-05,-1e-06,3.5e-05,6e-06,-4e-06,8e-06,2.6e-05,-5.5e-05,1.6e-05,0,-5.1e-05,-3.4e-05,1.6e-05,-2.6e-05,-5e-06,-4e-06,3e-06,-3e-06,6e-06,1.4e-05,-1.4e-05,-1.4e-05,3e-06,-4e-06,1.3e-05,0,6e-06,5e-06,-5e-06,1e-06,-5e-06,2e-06,2.6e-05,2.3e-05,-7e-06,1e-05,-3.1e-05,-3.6e-05,2.2e-05,4e-06,7e-06,1e-05,-7e-06,-3e-06,1e-05,9e-06,-2e-06,0,-7e-06,-1.6e-05,2e-06,-3e-06,1e-06,2e-06,2.8e-05,-3.2e-05,6.9e-05,-0.000138,-8.7e-05,-4.2e-05,1.1e-05,-1.2e-05,-4e-06,-1e-06,-7e-06,3e-06,-5e-06,2e-06,-4e-06,0,-5e-06,-7e-06
1e-06,0,1e-06,-1e-06,-1.1e-05,-2e-06,1.1e-05,-7e-06,1e-05,-1e-06,-3e-06,1e-06,3e-06,0,2e-06,-9e-06,0,0,-3e-06,-5e-06,1.6e-05,-1.3e-05,-1.3e-05,-3.5e-05,-8e-06,-5.9e-05,1.2e-05,3e-05,2.2e-05,2.2e-05,-2.4e-05,4.1e-05,7e-06,0.000105,9e-06,-2.4e-05,-0.000173,6.9e-05,3.8e-05,-1.2e-05,-9.3e-05,-8.5e-05,0.000124,-3.3e-05,-8.3e-05,-2.8e-05,1.5e-05,-2.8e-05,-3e-06,-2.4e-05,3.7e-05,-1.1e-05,-6e-06,0,-6e-06,-1.7e-05,2e-05,-1.7e-05,-1.8e-05,2.2e-05,1e-06,1.3e-05,7e-06,2e-06,-1.2e-05,1e-05,3e-06,-2e-06,-1.5e-05,-1.4e-05,1.4e-05,-1e-06,-6e-06,-1e-05,-5e-06,5e-06,0,-6e-06,-9e-06,-1e-05,-1e-06,-1.3e-05,-8e-06,-6e-06,2e-06,2.7e-05,-2.7e-05,-1.3e-05,5e-06,-4e-06,-1.5e-05,5e-06,-1e-06,0,-6e-06,6e-06,7e-06,5e-06,6e-06,0,7e-06,0,-9e-06,-1.7e-05,4e-06,-3.3e-05,0.000107,0.00013,1.5e-05,-1e-05,1.8e-05,-4e-06,-1e-06,-1e-06,-2e-06,-9e-06,0,2e-06,0,1.1e-05,-6e-06
-1e-06,8e-06,3e-06,1e-06,1e-06,0,-6e-06,5e-06,-3e-06,-3e-06,0,-2e-06,-4e-06,-6e-06,-4e-06,0,0,0,-3e-06,-7.2e-05,-3e-06,4e-06,-7e-06,3.2e-05,3.1e-05,-1.4e-05,3e-06,-1.1e-05,9e-06,3.9e-05,6.5e-05,7e-06,4.6e-05,-4.5e-05,-6.8e-05,-6.8e-05,0.000124,-7.7e-05,-6.1e-05,5.6e-05,-8.7e-05,-9e-06,-5.6e-05,0,4e-05,2.9e-05,-1.9e-05,4.2e-05,-2.8e-05,3e-06,-6e-06,-3.4e-05,-1e-05,-1.1e-05,0,-2.3e-05,1.7e-05,-1.7e-05,1.1e-05,1.9e-05,-2.3e-05,-2.1e-05,-1e-05,0,1e-05,-1.6e-05,-4e-06,-4e-06,-1.2e-05,1.1e-05,-9e-06,-3e-06,-7e-06,-4e-06,6e-06,1.3e-05,-4e-06,-3.1e-05,-4e-06,-7e-06,3e-06,1.9e-05,-2e-06,-3e-06,-1.1e-05,-3.3e-05,6e-06,1e-05,-9e-06,-7e-06,3e-06,-2e-06,2e-06,-1.1e-05,-8e-06,-8e-06,-3e-06,8e-06,-8e-06,-2e-06,2e-06,0,4e-06,-2e-06,1.7e-05,-4.2e-05,-3.1e-05,-0.000121,-9e-06,0,-1e-06,1e-06,0,-3e-06,-1e-06,-5e-06,-2e-06,-3e-06,1e-06,-1e-06,2e-06
2e-06,-3e-06,-5e-06,0,3e-06,-1e-06,-2e-06,-5e-06,-2e-06,-1e-06,0,0,-3e-06,6e-06,-1e-06,7e-06,1e-06,0,5e-06,4e-05,0,3e-06,1.6e-05,-6e-06,-1.5e-05,3.7e-05,-2e-06,1.6e-05,-9e-06,-6.9e-05,4e-06,1.7e-05,4.7e-05,0.000106,6e-05,-2.3e-05,-0.000183,-6.3e-05,0.000132,2e-06,0.000142,8.4e-05,-5e-06,4e-05,-4.1e-05,6.9e-05,-4.4e-05,8e-06,-2.5e-05,-1.5e-05,-1.9e-05,4e-05,-4e-06,9e-06,2.3e-05,4.1e-05,-3.1e-05,2e-06,-2e-06,8e-06,6.4e-05,-3e-06,7e-06,-1e-06,-3e-06,8e-06,4e-06,1e-06,1.6e-05,-1e-06,-1e-05,2e-06,-2e-06,1.1e-05,-3e-06,-2e-05,3e-06,2e-06,-3e-06,1e-05,-9e-06,-3e-06,1e-06,-5e-06,1.1e-05,3.3e-05,4.2e-05,-6e-06,0,4e-06,4e-06,1e-06,-1e-06,2e-06,-2.3e-05,-5e-06,-1.2e-05,1.1e-05,0,1e-06,-9e-06,-1e-06,5e-06,1e-05,3.7e-05,2.6e-05,3.2e-05,9.3e-05,-1e-06,6e-06,-4e-06,-4e-06,1e-06,-4e-06,-2e-06,-1e-06,0,-1e-06,0,-1e-06,1e-06
-1e-06,-5e-06,2e-06,0,-2e-06,0,-1e-06,5e-06,2e-06,1e-06,0,1e-06,3e-06,-2e-06,1e-06,2e-06,-1e-06,0,3e-06,-8e-06,3.8e-05,-7e-06,4e-06,-8e-06,-1.2e-05,4.5e-05,1.5e-05,-1.6e-05,-6e-06,3.9e-05,-5.2e-05,2.2e-05,-1.6e-05,-7.2e-05,-4e-05,-9e-06,5.7e-05,-4.5e-05,4.2e-05,-3.1e-05,-5.2e-05,4.3e-05,-6e-05,2e-06,8e-06,-7.6e-05,3.2e-05,6e-06,1e-05,-1.5e-05,1e-06,7e-06,0,-1e-05,0,1e-06,4.4e-05,1.4e-05,-5e-06,-1.1e-05,-5e-05,1.4e-05,7e-06,1e-06,-1e-06,-8e-06,-5e-06,3e-06,-1.3e-05,-1e-06,3e-06,4e-06,4e-06,-8e-06,0,6e-06,0,1e-05,-1.3e-05,1.1e-05,2e-06,-3.3e-05,9e-06,-5e-06,-4e-06,-2.2e-05,3.2e-05,4e-06,-3e-06,6e-06,2e-06,-1e-06,-2e-06,6e-06,-2.2e-05,7e-06,2e-06,5e-06,2e-06,-1e-06,5e-06,0,-7e-06,-2e-06,2.4e-05,3e-06,-6.2e-05,-4.6e-05,8e-06,-6e-06,1.3e-05,-4e-06,1e-06,-6e-06,1e-06,-4e-06,0,-4e-06,0,-6e-06,1e-06
1e-06,-2e-06,1e-06,1e-06,3e-06,0,0,-4e-06,-3e-06,-2e-06,2e-06,-2e-06,3e-06,5e-06,-5e-06,-5e-06,1e-06,0,1e-06,1.6e-05,-2.5e-05,8e-06,-1e-05,2.8e-05,2.1e-05,4e-06,1e-06,1.7e-05,0,4.9e-05,-8e-06,-6.5e-05,-5.4e-05,0.000162,8e-06,-2.3e-05,-3.8e-05,8.8e-05,-4.7e-05,-1e-05,4.6e-05,-2.6e-05,9.1e-05,-4.8e-05,8e-06,-6e-05,-6e-06,1.6e-05,2.2e-05,8e-06,7e-06,-2.9e-05,1e-05,-5e-06,-1.2e-05,-2.2e-05,-5.1e-05,-2e-06,-2e-06,-2.2e-05,3e-05,4e-06,-3e-06,0,2e-06,4e-06,3e-06,-1e-06,6e-06,3e-06,-1.5e-05,-4e-06,5e-06,4e-06,2e-06,-1.5e-05,-4e-06,1.6e-05,-1.4e-05,-8e-06,-1e-06,2.4e-05,-2.2e-05,-3e-06,-3e-06,-6e-06,-1.3e-05,1e-06,-1e-06,-2e-06,-1e-06,0,2e-06,-2e-06,-1e-06,-1e-06,3e-06,-1.1e-05,-1.4e-05,-1e-06,2e-06,0,0,-8e-06,-3e-06,-3.8e-05,9.6e-05,-5e-06,-2.3e-05,-1e-06,-1.2e-05,0,-4e-06,-3e-06,1e-06,-6e-06,-1e-06,-6e-06,1e-06,2e-06,4e-06
-1e-06,3e-06,-2e-06,-1e-06,-1e-05,-1e-06,1e-06,3e-06,5e-06,-1e-06,-1e-06,1e-06,-5e-06,1e-06,-3e-06,-3e-06,0,0,-3e-06,-2.7e-05,-1.8e-05,6e-06,0,-1.5e-05,-7e-06,-3.3e-05,-1.9e-05,0,1.6e-05,-8.3e-05,-2.4e-05,1.1e-05,-3.5e-05,-8.9e-05,3e-06,2.4e-05,-2e-05,5.1e-05,0,1.5e-05,1.6e-05,-1.8e-05,-9e-06,1.9e-05,-2.2e-05,6.6e-05,-5e-06,-3e-06,9e-06,7e-06,-1e-06,3e-05,4e-06,-1e-06,1e-06,7e-06,4.7e-05,-1e-05,-1e-05,4.5e-05,-1.2e-05,-1.8e-05,5e-06,-1e-06,-3e-06,5e-06,-4e-06,-1e-06,-7e-06,-1.1e-05,8e-06,0,1e-06,6e-06,-3e-06,7e-06,3e-06,1e-05,-1e-06,-8e-06,-2e-06,-5e-06,3e-06,-3e-06,8e-06,3.2e-05,-1.3e-05,-1e-06,-1e-06,-2e-06,-9e-06,-1e-06,1e-06,-2e-06,0,1e-06,-1e-06,-2.5e-05,8e-06,0,0,0,6e-06,7e-06,-8e-06,3.3e-05,-0.000101,4.3e-05,1.8e-05,1e-05,6e-06,-3e-06,5e-06,-1e-06,-1e-06,0,0,-1e-06,0,5e-06,3e-06
-2e-06,-3e-06,-1e-06,0,1.1e-05,0,-1e-06,-3e-06,-1e-06,1e-06,0,0,-2e-06,0,1e-06,4e-06,0,0,-1e-06,-2e-06,1.7e-05,-1.1e-05,-2e-06,-1.4e-05,-1.1e-05,-3e-05,1.5e-05,-6e-06,-1e-06,-3e-06,4.2e-05,1e-05,-1.7e-05,8e-06,3e-05,8e-06,-1.9e-05,-2.9e-05,-4.6e-05,-3e-06,-2.4e-05,1e-06,-1.3e-05,1.4e-05,3.5e-05,8.2e-05,4e-06,-8e-06,1e-06,0,3e-06,7e-06,-2e-06,-3e-06,3e-06,5e-06,-5.3e-05,-1e-05,1.3e-05,-5e-06,4e-06,-2e-06,-1.5e-05,0,-6e-06,-9e-06,1e-06,1e-06,0,-3e-06,-1.1e-05,3e-06,-2e-06,-1e-05,1e-06,-1.7e-05,1e-06,-1.8e-05,-1e-05,2e-06,5e-06,9e-06,5e-06,-4e-06,-1.1e-05,-4e-05,-4.2e-05,-3e-06,5e-06,2e-06,1e-05,0,-2e-06,3e-06,8e-06,-4e-06,2e-06,1.1e-05,-1.4e-05,0,-5e-06,0,-4e-06,5e-06,-1e-05,2.7e-05,9.5e-05,-6.3e-05,-1.5e-05,-1.7e-05,7e-06,-3e-06,-4e-06,-1e-06,1e-06,-2e-06,1e-06,-4e-06,0,-3e-06,-1e-06
1e-06,-3e-06,4e-06,0,-5e-06,-1e-06,5e-06,4e-06,-3e-06,-1e-06,-1e-06,-1e-06,6e-06,0,-4e-06,4e-06,0,0,-2e-06,7.5e-05,-1.9e-05,-8e-06,2e-06,2e-05,1.4e-05,-1e-06,-1.6e-05,1.1e-05,-1.6e-05,4.1e-05,2.7e-05,1.1e-05,-1.6e-05,-4.2e-05,-5.8e-05,1.2e-05,-0.000105,-3e-05,2.5e-05,-8e-06,5.1e-05,-2.2e-05,-5.7e-05,-3.6e-05,-3e-05,-7.9e-05,-1e-06,-2.1e-05,-1.1e-05,-6e-06,-6e-06,-3.3e-05,-5e-06,-4e-06,-3e-06,3e-06,3.5e-05,4e-06,-1.2e-05,-3.6e-05,1e-06,1.8e-05,1.4e-05,0,8e-06,3e-06,0,-1e-06,1.4e-05,5e-06,1.8e-05,-3e-06,-4e-06,5e-06,0,2e-05,-3e-06,-8e-06,-8e-06,3e-06,-2e-06,-2.3e-05,-2e-06,-4e-06,2e-06,2.7e-05,-2e-05,-4e-06,-2e-06,-2e-06,-2e-06,2e-06,0,-1e-06,1.3e-05,2e-06,-3e-06,8e-06,3e-06,1e-06,4e-06,0,-4e-06,-1.2e-05,-4e-06,-6.9e-05,-7.5e-05,6.2e-05,-2e-06,6e-06,-1.6e-05,1e-06,2e-06,-4e-06,-1e-06,-5e-06,-1e-06,-1e-06,0,2e-06,-3e-06
1e-06,2e-06,-4e-06,1e-06,3e-06,-1e-06,-4e-06,-4e-06,4e-06,-2e-06,0,1e-06,1e-06,-3e-06,-2e-06,-3e-06,0,0,1e-06,-3.9e-05,3e-06,0,3e-06,-5e-06,0,2.3e-05,4e-06,-8e-06,3e-06,-1.7e-05,-5.1e-05,3.2e-05,-7e-06,-7.2e-05,5.2e-05,3.6e-05,0.000114,-4.7e-05,4.4e-05,1e-05,-8.9e-05,-6e-06,5.1e-05,3.1e-05,1.5e-05,-1.9e-05,5e-06,1.6e-05,-4e-06,-4e-06,-2e-06,1.7e-05,-1e-06,2e-06,-3e-06,2e-06,-2e-05,5e-06,-1e-06,1.1e-05,-1.7e-05,0,-9e-06,-1e-06,-2e-06,1e-06,0,2e-06,-1.5e-05,3e-06,2e-06,3e-06,-1e-06,1e-06,0,-8e-06,2e-06,-1.3e-05,3e-06,4e-06,1e-06,-2e-06,3e-06,-3e-06,2e-06,-1.3e-05,1.3e-05,1e-05,-2e-06,-3e-06,0,-1e-06,1e-06,-2e-06,1.4e-05,-2e-06,-4e-06,-6e-06,-5e-06,-1e-06,1e-06,0,5e-06,8e-06,1.4e-05,3e-05,9e-06,-5.1e-05,-8e-06,2e-06,2e-05,-2e-06,0,-4e-06,1e-06,-2e-06,-1e-06,-1e-06,0,-4e-06,0
0,-1e-06,1e-06,0,-4e-06,0,-1e-06,4e-06,-4e-06,0,0,-1e-06,-6e-06,0,1e-06,-5e-06,0,0,3e-06,-2.9e-05,2.3e-05,5e-06,2e-06,-3e-06,-1e-05,1.4e-05,-3e-06,1.3e-05,1.6e-05,6e-06,3.3e-05,-2.2e-05,-5.9e-05,9e-06,-2e-05,1.5e-05,-0.000176,0,-5e-06,-1e-06,-1.5e-05,2.8e-05,1.3e-05,1.4e-05,-6e-06,3.4e-05,-2.5e-05,-1.6e-05,-7e-06,6e-06,1.5e-05,4e-06,-2e-06,-3e-06,1e-05,-7e-06,-5e-06,3e-06,-4e-06,5e-06,1.1e-05,-1.4e-05,1e-06,1e-06,-4e-06,3e-06,1e-06,-2e-06,5e-06,0,5e-06,-1e-06,3e-06,-8e-06,1e-06,-1e-06,1e-06,1.2e-05,-3e-06,1e-06,-3e-06,-2.5e-05,1e-06,-3e-06,-7e-06,6e-06,2.5e-05,-9e-06,-1e-06,3e-06,-6e-06,1e-06,-1e-06,3e-06,1.9e-05,2e-06,0,-1e-06,0,2e-06,-3e-06,0,0,4e-06,1.3e-05,1.9e-05,-8e-06,2.7e-05,-1e-06,2e-06,-2e-05,-2e-06,0,-3e-06,0,-2e-06,1e-06,-1e-06,0,0,-4e-06
0,-1e-06,2e-06,0,-2e-06,0,0,-4e-06,3e-06,1e-06,1e-06,1e-06,-1e-06,-2e-06,-5e-06,2e-06,0,0,0,-2e-06,-8e-06,7e-06,-3e-06,5e-06,5e-06,-7e-06,5e-06,-1.9e-05,-5e-06,-2e-05,-7e-06,-2.3e-05,-7e-05,-3.1e-05,-1e-05,4e-05,0.000131,5.3e-05,4e-06,-3e-06,-1.7e-05,-3e-06,7e-06,-4.3e-05,-1.2e-05,-6.8e-05,-2e-06,-1.1e-05,-5e-06,5e-06,0,-3.3e-05,3e-06,-6e-06,7e-06,-1.3e-05,2.6e-05,-4e-06,0,1.3e-05,-1.4e-05,-5e-06,9e-06,-1e-06,7e-06,-2e-06,-3e-06,0,-4e-06,-3e-06,2e-06,-1e-06,4e-06,8e-06,-1e-06,-1.6e-05,-3e-06,1.6e-05,-8e-06,-5e-06,0,1.2e-05,9e-06,-3e-06,3e-06,-2e-06,2e-05,7e-06,2e-06,3e-06,1e-06,0,-1e-06,2e-06,-1e-06,2e-06,3e-06,9e-06,-1e-06,-1e-06,0,0,-5e-06,-1.1e-05,8e-06,-6.6e-05,1.9e-05,7e-06,1e-06,-1.1e-05,9e-06,0,0,-1e-06,0,-1e-06,1e-06,-1e-06,0,1e-06,-1e-06
0,1e-06,-1e-06,-1e-06,8e-06,0,-2e-06,5e-06,0,-2e-06,0,0,5e-06,0,-1e-06,5e-06,0,0,1e-06,2.9e-05,1e-06,-3e-06,-7e-06,-1.2e-05,3e-06,-1.1e-05,8e-06,2.1e-05,-1.4e-05,9e-06,1e-05,-1.5e-05,-5.4e-05,6.9e-05,0,3.6e-05,-2e-04,5e-05,-2.9e-05,-8e-06,1.8e-05,-3.9e-05,-6e-05,2.7e-05,1.6e-05,8.9e-05,-5e-06,1.4e-05,1e-06,4e-06,-1.1e-05,1.6e-05,6e-06,1e-06,-9e-06,1.9e-05,-3.8e-05,-1.5e-05,6e-06,-1.9e-05,1.2e-05,1.6e-05,-7e-06,0,-5e-06,-3e-06,2e-06,1e-06,0,-6e-06,-7e-06,2e-06,2e-06,-1e-06,-1e-06,8e-06,1e-06,4e-06,-4e-06,-2e-06,1e-06,1.7e-05,-7e-06,-3e-06,0,-8e-06,4e-06,-7e-06,-4e-06,-2e-06,8e-06,1e-06,1e-06,-5e-06,-1.1e-05,-4e-06,0,6e-06,-6e-06,0,2e-06,0,4e-06,7e-06,-4e-06,4e-05,-2.6e-05,-3.8e-05,-8e-06,1.2e-05,6e-06,-3e-06,-1e-06,-2e-06,0,-5e-06,-2e-06,-3e-06,0,2e-06,1e-06
-1e-06,1e-06,-1e-06,0,-7e-06,0,3e-06,-5e-06,-3e-06,-1e-06,-1e-06,-1e-06,0,2e-06,0,-1e-06,0,0,-2e-06,1.4e-05,2e-06,-4e-06,1e-06,-1e-06,-3e-06,-2e-06,-1.6e-05,-2.2e-05,1e-06,1.5e-05,2.1e-05,5e-06,-4.3e-05,-7.9e-05,3.2e-05,3e-05,0.000154,-2.1e-05,-1.5e-05,2e-06,5.9e-05,7e-06,3.3e-05,1.6e-05,-2.7e-05,4e-05,2e-05,-1e-06,4e-06,2e-06,2e-06,1.5e-05,-5e-06,-3e-06,-3e-06,-1e-06,4.7e-05,1.2e-05,-1.2e-05,-1.7e-05,-1.7e-05,0,6e-06,1e-06,0,3e-06,-3e-06,1e-06,8e-06,-1e-06,5e-06,1e-06,-2e-06,-6e-06,1e-06,-5e-06,1e-06,-2e-06,-8e-06,2e-06,-1e-06,-2.9e-05,-3e-06,-3e-06,-5e-06,2.6e-05,-1.9e-05,8e-06,2e-06,-1e-06,-5e-06,-1e-06,0,0,-8e-06,2e-06,-1e-06,-2e-06,5e-06,0,1e-06,0,2e-06,3e-06,-1.6e-05,3.5e-05,5.4e-05,5.9e-05,5e-06,-6e-06,-1.9e-05,-3e-06,2e-06,-2e-06,-1e-06,-3e-06,0,-2e-06,0,2e-06,2e-06
