-0.000543,-0.000256,-0.000385,-0.000609,-0.000796,0.000139,-0.000207,-0.000479,-0.00046,-0.000352,0.000314,-0.000284,4.3e-05,-0.000878,-0.000463,-0.000469,-0.000542,-0.000129,-5.5e-05,-0.000271,-0.000217,-0.000844,-0.001166,-0.001367,-0.000977,-0.000609,-0.000117,-5.2e-05,-0.000633,-1.9e-05,-0.000513,-0.000822,-0.000956,-0.000882,-0.000474,-0.000421,-0.000201,-0.000385,-8.1e-05,-0.000775,-0.000709,-0.00089,-0.000721,-0.000339,-0.000376,-0.000485,-0.000301,-0.000292,-0.000502,-0.000161,-0.00077,-0.00045,-0.000471,-0.000816,-0.000435,-0.000117,-0.000411,-0.000821,-0.000272,-0.000522,-0.000533,-0.000153,-0.000101,-0.000182,-4.1e-05,-0.000243,-0.000789,-0.000974,-8.2e-05,-9.4e-05,-0.000441,-8.9e-05,-0.000566,-0.001004,-0.000651,-0.000379,-0.000414,-0.000896,-4e-04,-0.000487,-0.000619,-0.000284,-0.000421,-0.000834,-0.000899,-0.000625,-0.000403,-0.000352,-0.001143,-0.000675,-0.000571,2.6e-05,-0.000189,3.7e-05,-0.000131,-0.000408,-0.000463,-0.000764,-0.000456,-0.000153,-0.000734,-0.000503,-0.000591,-0.000606,-0.000452,-0.000223,-0.00019,-0.000354,-0.000449,-0.000355,-0.000131,-0.000297,-0.000404,-0.000347,-0.00032,-4.1e-05,-0.000314,-0.000106,-0.00046,-0.000326,-0.000325
-0.000832,-0.00037,-6e-06,-0.000419,0.000388,0.000269,-0.000253,-7.6e-05,-0.000494,-0.000201,-2.8e-05,-0.000222,0.000205,0.000354,0.000372,-4.5e-05,0.000212,0.000255,-0.000211,-0.000264,-0.000325,-0.000371,-0.000206,0.000224,0.000302,0.00014,-0.000149,-0.000448,0.000163,0.000135,3.7e-05,0.000293,0.000164,0.000113,-8.9e-05,-0.000432,-0.000162,3e-04,-0.000304,-1.8e-05,-0.000267,-0.000471,-2e-05,-0.000256,-4e-06,0.000165,-0.000305,4.4e-05,-7.8e-05,-0.000409,-6.5e-05,-0.000305,-0.000264,0.000109,-0.000327,-0.000372,-0.000244,-3e-06,-0.000156,-4.8e-05,-0.000249,-0.000166,2.9e-05,9.8e-05,-0.00046,-0.00015,0.000134,4.6e-05,-0.000391,-0.000245,-6.3e-05,-4.7e-05,-0.00018,8.2e-05,-0.000123,-0.000191,-9e-06,-0.000122,2.9e-05,5.6e-05,0.000301,-0.000227,-0.000185,-0.000117,4.5e-05,4e-06,4.6e-05,-0.000448,1.4e-05,-0.000108,1.9e-05,-0.000147,1.1e-05,-3.8e-05,-0.00019,-7.7e-05,-0.000106,6.1e-05,-6e-05,9.6e-05,0.000247,7.6e-05,-0.00011,0.000242,0.000243,0.000167,3.3e-05,-6.2e-05,-0.000112,-0.000139,0.000143,-1.7e-05,-0.000146,0.000255,-0.00014,-0.000103,1.9e-05,3.3e-05,0.000193,4.6e-05,1.4e-05
0.000713,0.00023,-0.000203,0.000472,3.7e-05,0.00024,0.000435,0.000237,-8.6e-05,-1.4e-05,-0.000238,0.000298,0.000338,-0.000206,0.000266,0.000227,-0.000207,-3.8e-05,0.000109,5e-04,0.000127,0.000175,0.000281,0.000305,0.000159,-6e-05,-0.000134,-6.1e-05,2.2e-05,-4e-05,-4.6e-05,3.2e-05,2.6e-05,0.000136,-1.4e-05,0.000251,6.5e-05,-0.000408,-5.1e-05,1.7e-05,0.000491,0.000403,0.000207,-8.9e-05,-0.000312,-0.000106,0.000225,-6.3e-05,9e-06,4.6e-05,0.000172,0.000181,0.000164,8.4e-05,0.000375,0.00028,3.5e-05,-4.2e-05,0.000233,0.000215,0.000108,-0.000137,-4.3e-05,0.000138,-0.000183,-0.000101,0.000378,0.000316,-0.000191,0.000131,0.000225,0.000248,0.000323,-2.9e-05,0.000111,-1.8e-05,0.000404,0.000435,0.000146,-2.6e-05,-0.00033,-0.00012,-0.000399,3.2e-05,-7.1e-05,2.4e-05,2.1e-05,0.000237,0.000123,0.000207,0.000284,-0.000167,-9e-05,9.7e-05,0.000329,-7.5e-05,-0.000206,-7.8e-05,-4.8e-05,-0.000241,0.000115,0.000176,0.000103,0.000232,-2.9e-05,-9.9e-05,-3.3e-05,-9.8e-05,-0.000127,-9.7e-05,-0.000268,-0.00019,4.5e-05,-7.9e-05,-9.4e-05,-8.1e-05,0.000119,0.000225,-0.000152,-0.000117,0.000189
-0.000333,-0.000306,-1.6e-05,-0.000293,-0.000664,-0.00012,-0.000337,-5e-06,-0.000259,-0.000271,9.3e-05,-0.000191,-0.000213,0.000397,0.000221,8e-06,-0.00055,-2e-06,-0.000144,-0.000268,3.2e-05,1e-04,-0.000937,-0.000485,-5.7e-05,-0.000186,-0.000347,-0.000478,-0.00025,-0.000454,-0.000503,-0.000407,-0.000136,-3.1e-05,-1e-05,-1.1e-05,-0.000206,8e-05,-0.000774,-0.000373,-0.000579,-0.000448,-8.6e-05,-1.5e-05,-2.6e-05,-0.00026,-0.000323,-0.000535,-0.00034,-0.000421,-0.00037,-0.000154,-0.000121,-0.000266,-0.000438,-0.000168,-0.000203,-0.000164,-2.9e-05,-1e-04,-8.5e-05,6.7e-05,7e-05,-0.000441,6e-06,6.3e-05,-0.000487,-0.000235,-8e-05,-0.00046,-0.000475,-0.000572,-0.000694,-0.000113,-0.000382,-0.000136,-0.000357,-8.4e-05,-3.4e-05,-0.000106,-5e-06,-0.000346,-0.000165,-0.000275,-8.2e-05,-0.000144,-2.7e-05,0.000176,-0.000147,-0.000471,-0.000207,-0.000279,-0.000136,-0.000249,-0.000371,-0.000208,0.000305,-0.000208,6.9e-05,-0.000154,-0.000309,-0.000195,-3.4e-05,-6.5e-05,2.6e-05,-9.4e-05,-6.2e-05,-0.00013,-0.000108,-1e-06,-0.000162,-5.4e-05,-3e-05,-8.5e-05,-1e-06,-0.000146,-0.00029,-0.000137,0.000178,0.000163,0.000151
0.00026,-0.00052,-2e-05,-4.1e-05,0.000256,0.000509,0.000299,0.000143,0.000207,0.000217,3e-05,-0.000167,8.5e-05,-0.000172,0.000355,-7e-05,0.00036,0.000535,-0.000317,-0.000211,9.9e-05,-0.000249,0.00056,0.000327,0.000318,0.00019,4e-06,-1e-05,0.000336,0.000299,-4.1e-05,-1.8e-05,-0.000163,-0.000246,0.000108,3.6e-05,0.000125,0.000132,0.000526,0.000118,0.000201,-0.000283,9.9e-05,-9.5e-05,-4e-05,0.000294,4e-06,-8e-06,0.000149,0.000257,0.000265,5.7e-05,-8.6e-05,7.5e-05,8.7e-05,0.000291,-0.000121,0.000223,-7.2e-05,8.1e-05,2.4e-05,-0.000195,-0.00012,1.9e-05,0.000114,4.6e-05,0.000141,0.000242,-0.000319,3.6e-05,0.000141,0.000121,0.000586,0.00016,0.000129,-4.2e-05,5.7e-05,-0.000164,0.000144,0.000321,-0.000131,0.000365,0.000335,0.000149,0.000349,0.000105,-0.000135,-7e-05,0.000159,8.9e-05,5.6e-05,-0.000156,0.000144,0.000118,0.000177,1e-04,-3.5e-05,5.1e-05,-1e-06,-0.000102,0.000108,0.000266,-7.2e-05,-4.3e-05,-0.000253,-2.8e-05,-0.000173,0.000111,0.000124,0.000189,-5.9e-05,0.000174,0.00011,0.000135,0.000171,0.000211,6e-05,0.000142,5.5e-05,-4.4e-05,5.1e-05
-0.000405,-4.6e-05,7.3e-05,9e-06,-0.000101,-0.000182,-0.000262,-0.000288,-0.000181,0.000194,-2.4e-05,-0.000312,-0.000381,6.4e-05,-0.000267,0.000201,0.000196,-0.000108,-0.000113,-9.5e-05,-9.7e-05,3.7e-05,-0.000279,-0.000474,-0.00028,-0.00021,-0.000244,0.000197,-3.2e-05,-0.000201,0.000334,-0.000205,0.000164,0.000198,0.000134,9.2e-05,3e-06,-0.000255,5e-05,0.000173,3.1e-05,0.000223,1.3e-05,-0.000104,9.5e-05,-0.000144,-9.6e-05,-9.2e-05,-0.000161,-0.000302,-0.000202,-7.5e-05,-7.8e-05,0.000141,5.5e-05,3.2e-05,0.000191,3.3e-05,-1.8e-05,-7.9e-05,-0.000146,-9.1e-05,-7e-05,-0.000185,-5.6e-05,-0.000155,-4.4e-05,4.9e-05,0.000338,1.8e-05,-3.6e-05,-0.000362,-0.000448,-9.5e-05,-0.000213,-9.2e-05,-4.5e-05,4.9e-05,-0.000169,-0.000274,5.6e-05,-0.000401,-6.6e-05,4.9e-05,-0.000267,-0.000117,1e-05,-8e-05,0.000124,0.000578,9e-05,-8.6e-05,3.5e-05,-0.000254,0.000152,-6.4e-05,0.000244,0.00019,0.00012,0.000176,0.000127,-0.00013,4.9e-05,0.000173,0.000161,-0.000125,4.8e-05,-5.6e-05,-3.3e-05,-0.000205,-6.4e-05,-7.8e-05,-1.3e-05,-0.000113,-0.000105,0,-2.2e-05,9e-05,-5e-06,3.8e-05,8e-05
0.000124,0.000302,-9.3e-05,-0.000171,1.1e-05,0.000217,-0.000244,0.000392,-2.6e-05,0.000108,-4.6e-05,-9.5e-05,0.000159,-1.7e-05,7.8e-05,-0.00022,0.000101,-0.000111,-0.000253,-0.000379,9.3e-05,-0.000204,-7.9e-05,-0.000108,0.000118,7.8e-05,1.8e-05,-4.4e-05,7.1e-05,2e-05,2.9e-05,0.000196,-0.000103,-0.000282,-7.8e-05,-6.7e-05,-0.000123,-2e-04,3e-05,-0.000212,-0.000228,-6.6e-05,-0.000139,8.7e-05,-0.000228,3.8e-05,0.000103,-4.5e-05,0.000203,-3.9e-05,-4.6e-05,-1e-05,7.6e-05,-0.000194,-0.000189,3e-05,-8e-06,6.6e-05,-0.000142,-0.000217,3.8e-05,3.1e-05,-0.000292,-9.8e-05,-8.1e-05,-3.8e-05,-0.00014,-4.4e-05,-0.000266,-0.000162,3.1e-05,-5.8e-05,-0.00013,5.7e-05,0.000107,-8.8e-05,-0.000155,-0.000206,-6.1e-05,-0.000103,-0.000237,-7.3e-05,0.000117,-1.2e-05,0.00014,-1.6e-05,1e-05,-6e-06,-0.000285,-0.000462,-0.000304,-0.000219,0.000108,-5.4e-05,-4e-05,-0.000166,-0.000154,-0.000189,-3.8e-05,-7.6e-05,-0.000248,-0.00012,1.7e-05,-0.000136,-0.000321,-5.4e-05,-9.3e-05,5.5e-05,-8.9e-05,2.2e-05,-6.7e-05,-9.4e-05,-0.000103,-9.8e-05,9.2e-05,3.2e-05,6.8e-05,-0.000141,-0.00014,-4.2e-05,-8e-05
0.000119,-0.000144,-0.000246,-0.000163,6.8e-05,-0.000283,-0.000199,0.000165,0.00013,-3e-06,-0.000197,-3e-05,-0.000337,-0.00011,-3.3e-05,-0.000222,-0.000122,1e-05,0.000149,-0.000163,-0.000202,7.8e-05,-6.5e-05,-0.000133,-5.7e-05,0.000112,-7.2e-05,1.6e-05,0.000239,-0.000146,-0.000152,-0.000164,-0.000145,1.5e-05,-5.5e-05,-5.8e-05,-1.2e-05,-0.000109,6.2e-05,0.000275,0.000171,0.000197,-8.9e-05,-4.3e-05,-0.000172,-0.000179,-5.7e-05,0.000109,0.000119,0.000121,-2.8e-05,4.1e-05,0.000151,0.00016,-2.2e-05,-2.9e-05,-0.000266,-1.8e-05,6e-05,4.7e-05,-4.6e-05,4e-06,0.000137,3.3e-05,1e-06,-3e-06,-0.000203,-0.000119,-6.2e-05,-1.6e-05,3.2e-05,8.8e-05,-8.9e-05,-7.3e-05,-0.000199,-0.000229,-0.000133,-1e-06,-1.1e-05,2e-05,-8.6e-05,-0.000108,-7.5e-05,-3.1e-05,-0.000159,1.1e-05,0.000154,2.7e-05,0.000158,8.7e-05,0.000236,0.000259,0.000168,9.1e-05,-8e-05,9.1e-05,2e-05,-4.3e-05,-0.000154,-9.8e-05,-0.000127,1.7e-05,-0.00027,-5.9e-05,3.8e-05,-0.000135,-1.6e-05,-6.6e-05,2.8e-05,-1.9e-05,-5.2e-05,-0.000156,-1.5e-05,0.000117,-2.7e-05,-8.8e-05,-3.2e-05,2.6e-05,5.9e-05,-3.9e-05,-1.8e-05
-0.000101,-7.1e-05,-0.000103,7.4e-05,-9.5e-05,-3.3e-05,-3.8e-05,0.000154,-0.000147,-5.2e-05,-4.1e-05,7.1e-05,-4.5e-05,-2e-06,-0.000145,1.2e-05,1e-05,-0.000164,-0.000131,-2e-05,-1.2e-05,5.1e-05,6.3e-05,5.8e-05,-0.000224,-0.000262,0.000109,-9e-06,-0.000132,1.6e-05,1e-05,0.000181,0.000153,-2e-06,6.6e-05,8.1e-05,-3.7e-05,2e-06,8.7e-05,-3.2e-05,-5.8e-05,1e-06,-0.000102,0.000183,0.000133,8e-05,0.000166,-5.3e-05,-2.1e-05,-2.2e-05,0.000106,-0.000229,3.8e-05,-0.000109,6.8e-05,3.8e-05,6.6e-05,-4.1e-05,-0.00012,-5.1e-05,0.000127,7.9e-05,-1.8e-05,-8.4e-05,-0.000128,9.8e-05,-2e-05,0.000146,5.4e-05,0.000101,-0.000204,-0.000266,-2.4e-05,0.000224,0.00025,9.5e-05,6.5e-05,-4.3e-05,7.3e-05,-1.5e-05,-5.9e-05,4.2e-05,-4e-06,-2.6e-05,8.6e-05,5e-06,-0.000168,1.1e-05,1.3e-05,-2.1e-05,7.9e-05,-0.000118,-5.2e-05,2.4e-05,3.3e-05,-0.000145,4.1e-05,6.1e-05,2.9e-05,-9.6e-05,-6.3e-05,3.8e-05,0.000154,8.5e-05,-2.9e-05,-1.8e-05,-1.3e-05,-4.6e-05,3e-06,-3.6e-05,-7e-06,-1.8e-05,-0.000209,-2.8e-05,1.5e-05,-2.9e-05,1.5e-05,-1.2e-05,-5.3e-05,-3.2e-05,0.000116
9.3e-05,-1.8e-05,-1e-06,9.4e-05,0.000132,-6.9e-05,-5e-06,7.9e-05,0.000155,-0.000143,4.4e-05,-0.000106,4.4e-05,1.1e-05,4.8e-05,0.000128,0.000156,0.000117,-0.00023,-0.000117,-5.4e-05,-0.00018,-0.00023,9.9e-05,-5e-05,0.000102,3.5e-05,5.4e-05,-6.5e-05,-1e-06,-0.00024,-0.000181,-5.5e-05,0.000171,5.3e-05,4.8e-05,-5.5e-05,4.8e-05,4.6e-05,-0.000125,4.5e-05,-9.9e-05,-5e-06,-0.000169,0.00014,-8.9e-05,-0.000113,5.8e-05,-1.3e-05,7.8e-05,-6e-06,0.000234,4.9e-05,5.5e-05,5e-06,-0.000149,-7.6e-05,1.2e-05,0.000158,-1e-06,-0.000155,-9.5e-05,0,1.3e-05,1.9e-05,-0.000112,-4e-06,-3.5e-05,-9.1e-05,3.5e-05,2.8e-05,0.000178,8.5e-05,1e-05,-0.000138,0.000116,4.5e-05,-0.000102,2e-06,0.000148,3e-06,3.9e-05,0.000135,-2e-06,-7.8e-05,-5.2e-05,-2.7e-05,-3.9e-05,6.5e-05,9.8e-05,-0.000136,-0.000128,7.3e-05,0,2.5e-05,6.8e-05,5.1e-05,1.3e-05,5.3e-05,0.000114,9.2e-05,-3.8e-05,-4.7e-05,1.6e-05,2.2e-05,-0.000101,-5.5e-05,4.3e-05,-4.4e-05,6.9e-05,4.8e-05,5e-05,8.6e-05,1.1e-05,2.1e-05,6.9e-05,-7.2e-05,-1.3e-05,-3.5e-05,1e-05,-7.4e-05
2.3e-05,4.8e-05,0.000102,-8e-06,4.9e-05,9.4e-05,-6.3e-05,-0.000194,-0.00022,-5.8e-05,6.3e-05,5.1e-05,-1e-06,7.8e-05,-4.1e-05,-1.6e-05,-0.00018,7.6e-05,2.2e-05,5e-05,-0.000151,6e-05,0.000224,3e-05,0.000114,-9.9e-05,-0.000135,-6.5e-05,-7.7e-05,-6.6e-05,5.5e-05,-5.8e-05,7.3e-05,-8e-05,-6.3e-05,-3e-06,9e-05,-2.7e-05,-3.4e-05,-6e-06,1.3e-05,0.000136,7.7e-05,0.000125,-2.1e-05,2.1e-05,-8.8e-05,-2.8e-05,-4e-06,-5e-06,-3e-05,-7e-06,-1.3e-05,-8.7e-05,2e-06,-7.7e-05,-0.000133,4.1e-05,1.8e-05,9.3e-05,-4.1e-05,5.8e-05,6.5e-05,1.5e-05,7.7e-05,1.2e-05,1.5e-05,-6e-06,8.6e-05,-2.4e-05,-4.5e-05,-7.9e-05,-3e-05,-2.2e-05,5.3e-05,1.5e-05,-0.000111,8.9e-05,4.7e-05,-0.000133,0.000173,9.5e-05,-0.000116,2.4e-05,-3.4e-05,8.1e-05,8.6e-05,-4.7e-05,-3.8e-05,3.9e-05,3.3e-05,0.000165,-1.1e-05,-6.6e-05,-6.2e-05,4.1e-05,9e-05,6.5e-05,1.5e-05,2.2e-05,-4e-05,-4.3e-05,-2.8e-05,-8.1e-05,-2.1e-05,5.5e-05,6.8e-05,5.2e-05,2.1e-05,-6.5e-05,-4e-06,3e-05,-4.1e-05,-4.8e-05,-8.1e-05,5.7e-05,3.6e-05,2.1e-05,2.5e-05,-3.7e-05,5.8e-05
-0.000138,-8e-06,-6.7e-05,-6.1e-05,5.8e-05,1.5e-05,8e-06,-0.000122,7.1e-05,4.2e-05,-5.1e-05,-8.6e-05,6.2e-05,-0.000103,-5.6e-05,-1e-06,5e-05,6.9e-05,3.8e-05,0.000104,-9.1e-05,-7e-06,-2.1e-05,3e-06,-7.3e-05,1e-06,3.2e-05,1.1e-05,-6.2e-05,7.3e-05,-8.5e-05,-0.00021,-3.5e-05,3.2e-05,2.4e-05,1.8e-05,-8e-06,-3.5e-05,-7.4e-05,-4.8e-05,-6.1e-05,-5.5e-05,2.8e-05,-7.2e-05,-8.1e-05,-2e-06,0,3.7e-05,1.5e-05,-1.9e-05,1.9e-05,5e-06,-4.5e-05,5e-05,-5.9e-05,2e-05,9.5e-05,-3e-05,-0.000141,-0.000117,-1.4e-05,-4.4e-05,-6.5e-05,1.7e-05,3e-05,-5.1e-05,-9e-06,1.8e-05,-4.9e-05,2.6e-05,-3.3e-05,-2.5e-05,0.000108,7.3e-05,-1.7e-05,1e-06,7.6e-05,-2.3e-05,3.5e-05,1.1e-05,-8.9e-05,-4e-05,-4.8e-05,4.2e-05,0.000107,-5e-06,1.6e-05,-8e-06,5.5e-05,-0.000101,-3.1e-05,-7.3e-05,-4.4e-05,-0.000102,-3.8e-05,8.2e-05,-3e-05,-1e-05,1.8e-05,-4e-06,2.5e-05,-6.5e-05,1.9e-05,-6e-06,-6.6e-05,-6.6e-05,-3.4e-05,9.8e-05,-2.7e-05,1.9e-05,-1.3e-05,1.6e-05,-9e-06,-2.3e-05,1.2e-05,-2.3e-05,-2.1e-05,-1e-06,-7.7e-05,4e-06,-2.9e-05
8.1e-05,-5.5e-05,1.4e-05,6.8e-05,5.1e-05,1e-05,-2e-06,-1e-05,-7.8e-05,-2.1e-05,-7.1e-05,6.3e-05,4e-06,6e-05,-1.9e-05,2.4e-05,-9.3e-05,-3e-05,7e-06,-2.8e-05,7.6e-05,1.2e-05,-7.1e-05,-5.8e-05,-0.000142,-4.7e-05,-2e-06,-4.4e-05,1.2e-05,3e-06,-7e-06,0.00011,5.5e-05,1.9e-05,-4.1e-05,-7e-06,-2.8e-05,4e-06,-0.000127,8e-06,-7.4e-05,3.8e-05,7e-05,2.1e-05,4.1e-05,-6.5e-05,-2e-05,-3.3e-05,-2e-06,-5.6e-05,-1e-06,3e-06,1.1e-05,-9e-06,4.6e-05,-2.8e-05,2e-05,-6.5e-05,-1.2e-05,7.9e-05,1.2e-05,-9e-06,-7e-06,-1e-06,-2.2e-05,-7e-06,4.7e-05,-2.6e-05,1.9e-05,1.9e-05,9.2e-05,-6e-06,5.3e-05,-7e-05,-3.5e-05,1.3e-05,-5.8e-05,1e-06,1.7e-05,3.5e-05,9e-06,4.5e-05,-2.2e-05,-5.1e-05,-3.2e-05,-3e-06,-3e-05,-8.5e-05,1e-06,5.7e-05,6.6e-05,3.3e-05,1.6e-05,-7.3e-05,3e-05,3.3e-05,-4.1e-05,-1.5e-05,-2.9e-05,-2e-05,1.4e-05,1e-05,-3.9e-05,-2.9e-05,6e-05,6e-05,1e-05,3.1e-05,-5.2e-05,-4e-06,-3e-05,-2.1e-05,-5.7e-05,-7.5e-05,3e-06,7.3e-05,4.2e-05,1.5e-05,4.6e-05,-2.6e-05,1.5e-05
-1.6e-05,2.8e-05,4.4e-05,2e-06,-3.9e-05,1.8e-05,-1.4e-05,-8.2e-05,1.4e-05,2e-06,-3.7e-05,-2.2e-05,-3.1e-05,-5.4e-05,-2.5e-05,3.3e-05,-6.3e-05,1.1e-05,7.1e-05,-6.9e-05,-3e-05,-2.1e-05,-2.8e-05,-3.2e-05,7.8e-05,1.7e-05,2.2e-05,-8e-06,4.4e-05,-1.3e-05,-2e-06,0,-9.2e-05,-5e-06,6.8e-05,-1.5e-05,-1e-06,6e-06,-5e-06,-2.7e-05,1.5e-05,-2e-05,4e-06,-6e-06,-4.6e-05,2.8e-05,5.5e-05,4.9e-05,-3.6e-05,-1.4e-05,-5e-06,-2e-06,4.2e-05,-3.6e-05,-2.2e-05,-5e-06,5.1e-05,2.6e-05,-2.9e-05,-5.4e-05,-2.3e-05,-4e-06,-2.6e-05,1e-06,-3.6e-05,4.1e-05,-1.5e-05,-2.3e-05,-1.8e-05,3e-06,4.9e-05,-2.5e-05,-6.5e-05,-3e-05,1.1e-05,-3.7e-05,3.3e-05,-7.2e-05,-1.3e-05,-3e-05,-9e-06,3.3e-05,-1.7e-05,3.4e-05,-1.4e-05,-7.4e-05,-1.4e-05,8e-06,-4.4e-05,1.2e-05,-2e-05,8e-06,-5.9e-05,2.3e-05,-9e-06,2.4e-05,-9e-06,0,2.8e-05,-2.2e-05,-1.9e-05,-2e-06,3.5e-05,1.4e-05,-4.6e-05,2.1e-05,-1.7e-05,-7e-06,1.5e-05,8e-06,-2e-05,2.8e-05,-5e-06,4e-06,8e-06,7e-06,-1.5e-05,-1.2e-05,3e-06,-1.1e-05,-1.8e-05
1.2e-05,9e-06,-3.9e-05,1e-06,-6.6e-05,-8e-06,-1.7e-05,-5.3e-05,4e-05,-1.6e-05,-2.8e-05,-2.1e-05,-2.7e-05,-1.3e-05,-6.9e-05,-7.1e-05,-9.1e-05,-9e-06,-0.000155,-3e-06,0.000101,-3.6e-05,7.4e-05,5.3e-05,-3.9e-05,1.5e-05,3.5e-05,2.3e-05,2.5e-05,1e-06,-6e-06,8.2e-05,1.3e-05,5.3e-05,9e-06,1e-05,-3e-05,-2.2e-05,-4e-05,2.1e-05,3.1e-05,-6e-06,-2.5e-05,-9e-06,2.4e-05,1.8e-05,-2.5e-05,-1e-06,-1.6e-05,5.6e-05,1.8e-05,0,-2.6e-05,2.6e-05,4e-06,1e-06,-3.4e-05,-2.5e-05,-3e-06,5e-05,-8e-06,-8e-06,1.8e-05,-2.5e-05,3e-06,-2e-06,-3.2e-05,-2.5e-05,1.1e-05,1.4e-05,-3.6e-05,4e-05,4.8e-05,-2.2e-05,7e-06,5e-06,2.6e-05,5.9e-05,2.4e-05,-1.2e-05,-3.2e-05,-6e-06,-2e-05,3e-06,3.1e-05,1.9e-05,-1e-06,5.2e-05,2.6e-05,3.7e-05,3.1e-05,-5.1e-05,-7e-06,1.9e-05,-1.3e-05,2.1e-05,-6e-05,7e-06,-1.1e-05,-8e-06,-2.1e-05,2.1e-05,-1e-05,-1.5e-05,-5e-06,-2.1e-05,-8e-06,-1.7e-05,1.3e-05,-3.4e-05,2.4e-05,-2.3e-05,3.9e-05,-4e-06,-1e-06,2.3e-05,-1.1e-05,-1e-06,-1.5e-05,1.6e-05,-2e-05
-1.5e-05,-1.5e-05,2e-06,3.5e-05,1.8e-05,3e-06,1e-05,-1.2e-05,-3.4e-05,3e-05,1.4e-05,-6e-06,2.4e-05,6.7e-05,2.4e-05,4e-06,3e-06,-7.3e-05,2.6e-05,7e-06,1e-06,3.5e-05,-1e-06,3.9e-05,5.6e-05,1.5e-05,-1e-05,-1.2e-05,3e-06,-1.5e-05,3.9e-05,-3.1e-05,8e-06,-3.8e-05,-1e-05,-1.1e-05,-1.3e-05,2.3e-05,4e-06,-1.4e-05,1.6e-05,-4.3e-05,-1.9e-05,-1.9e-05,-5e-06,5e-06,5e-06,-5e-06,-4e-06,1.6e-05,4e-06,-1.8e-05,-2.9e-05,-5e-06,-1e-05,-5e-06,-3.2e-05,-2e-05,2.3e-05,-4.3e-05,1.2e-05,2e-05,1e-05,8e-06,-8e-06,2.2e-05,1.4e-05,6e-06,1.8e-05,1e-05,-3.3e-05,1.1e-05,-1.2e-05,4e-06,-3.5e-05,-2e-05,-1.7e-05,-5e-05,-1.3e-05,7e-06,2e-05,8e-06,2.8e-05,1.2e-05,-1e-05,1.3e-05,2.3e-05,-1.1e-05,-1.4e-05,1.1e-05,-2.7e-05,1.5e-05,0,-1.2e-05,1.4e-05,0,1e-05,3.3e-05,6e-06,7e-06,-1.7e-05,0,-2.1e-05,-2e-06,1.5e-05,4e-06,1.2e-05,-2.2e-05,5e-06,4.3e-05,-2.7e-05,-2.6e-05,1.6e-05,3e-06,9e-06,-1.1e-05,-3e-06,-7e-06,5e-06,-8e-06,4.4e-05
6e-06,-8e-06,-1.9e-05,2.7e-05,-2.5e-05,1e-06,-4e-05,-5.1e-05,1.1e-05,1.7e-05,1.5e-05,-1.2e-05,-3e-05,-5.2e-05,-1.2e-05,1.1e-05,-2.9e-05,9e-06,-4e-05,5e-06,-4e-05,-2e-06,-4.6e-05,-3e-05,3.9e-05,-1.5e-05,1.6e-05,-1.8e-05,3.4e-05,-2e-06,-2.3e-05,-6e-06,1.5e-05,4e-05,4e-06,4e-06,2.2e-05,-2e-06,-2.3e-05,3.1e-05,-7e-06,5.3e-05,0,3e-06,1.3e-05,-2.2e-05,-2.3e-05,3.7e-05,5e-06,2.3e-05,-1.1e-05,2.1e-05,-2.2e-05,6e-06,2.6e-05,5e-05,2e-05,1.5e-05,2.1e-05,1.7e-05,-5e-06,-1.2e-05,1e-06,-2e-06,-1.1e-05,-9e-06,9e-06,-1e-06,-8e-06,-2e-05,4.1e-05,8e-06,-9e-06,-3e-06,4.6e-05,1.5e-05,5e-06,4.8e-05,-3e-06,-5e-06,-6e-06,-2e-06,2e-06,2e-06,9e-06,1e-05,-1.6e-05,0,-4e-05,1.4e-05,9e-06,2.5e-05,-1.5e-05,-1e-05,-5e-06,2e-06,-7e-06,3e-06,-1.3e-05,-1.1e-05,8e-06,7e-06,1.4e-05,9e-06,-1.9e-05,-1.6e-05,-4e-06,4e-06,1.1e-05,-2.7e-05,1.5e-05,5e-06,0,-1.7e-05,-1.5e-05,-1.7e-05,-4e-06,5e-06,7e-06,-4e-06,-2.5e-05
4e-06,-1.6e-05,1.7e-05,-1e-05,-2.8e-05,1.5e-05,2.3e-05,2e-06,-1.7e-05,-2e-06,1.8e-05,1.2e-05,3.9e-05,1.5e-05,1.5e-05,6e-06,2e-06,4e-06,5.1e-05,2.5e-05,-1e-06,5e-06,1e-05,3.1e-05,-1.6e-05,1.1e-05,1e-05,3e-06,1.5e-05,7e-06,9e-06,-1.6e-05,5e-06,-1.3e-05,-1.1e-05,-6e-06,8e-06,-4e-06,1.9e-05,9e-06,1.1e-05,3e-06,1e-06,-1e-05,0,1.4e-05,2.2e-05,-1.1e-05,-5e-06,-4e-06,3e-06,-2.5e-05,4e-06,-7e-06,-1.5e-05,-1.5e-05,-1.2e-05,3e-06,-2.1e-05,1.5e-05,1.6e-05,-1e-06,-2e-06,-1e-06,1.3e-05,-1.6e-05,-9e-06,-8e-06,2.7e-05,0,-1e-06,-1.7e-05,2.1e-05,-1.5e-05,-1.9e-05,2e-05,-1.8e-05,-2.4e-05,1.2e-05,-7e-06,5e-06,1.4e-05,1.6e-05,-8e-06,-1.4e-05,1.4e-05,5e-06,-1e-06,-1e-05,7e-06,-2e-06,-1e-06,-2e-06,-6e-06,9e-06,7e-06,-6e-06,0,1.7e-05,1.4e-05,-3e-06,-1.2e-05,9e-06,1e-05,1.3e-05,9e-06,-3e-06,0,3e-06,1.7e-05,-1.3e-05,4e-06,5e-06,0,9e-06,1.2e-05,-7e-06,-1.2e-05,-8e-06,3e-06,1.3e-05
6e-06,2.3e-05,4e-06,-1.7e-05,4e-06,-8e-06,-2.9e-05,4.2e-05,1.5e-05,6e-06,-2e-06,0,-1.4e-05,-2e-06,1e-06,1.8e-05,-1.4e-05,1.7e-05,-2.4e-05,-1e-06,-1.4e-05,1e-06,2e-05,-3.2e-05,1e-06,-4e-06,-1e-05,1.1e-05,6e-06,-5e-06,1.2e-05,5.5e-05,-1e-06,8e-06,-1.6e-05,6e-06,-5e-06,-8e-06,-7e-06,1.8e-05,-1e-06,-4e-05,5e-06,9e-06,-1.8e-05,-5e-06,3e-06,1.4e-05,-5e-06,-4e-06,1e-06,3.4e-05,2.5e-05,2.2e-05,-8e-06,-6e-06,-1.6e-05,-9e-06,4e-06,-8e-06,-2e-05,-1e-05,-1.2e-05,-7e-06,-7e-06,3e-06,-5e-06,1.8e-05,-1.4e-05,-5e-06,-1.5e-05,5e-06,3e-05,1e-06,2.3e-05,-5e-06,5e-06,-7e-06,-1.2e-05,-1e-06,-1e-06,4e-06,9e-06,1.3e-05,-2e-05,-1e-05,-1.2e-05,-1.6e-05,0,-1.4e-05,-2e-06,-1.9e-05,9e-06,-7e-06,-1.2e-05,7e-06,2e-06,1e-06,-1.3e-05,1.1e-05,5e-06,-5e-06,-2.1e-05,2e-06,-2.1e-05,-1.7e-05,-1e-06,-1.4e-05,-5e-06,-3e-06,-1e-06,6e-06,-1.6e-05,-2e-06,-1.3e-05,-1.9e-05,2e-06,9e-06,-4e-06,-2e-06,1e-06
-1.3e-05,5e-06,6e-06,0,-4e-06,-1.1e-05,1.3e-05,2.2e-05,-1.3e-05,-1.2e-05,-2e-05,7e-06,-8e-06,0,0,-7e-06,2.3e-05,1e-06,-2.1e-05,-9e-06,-3.3e-05,0,-1e-05,-1e-05,-3.7e-05,1e-06,2e-05,-1e-06,-1e-06,9e-06,-1.6e-05,-2.2e-05,-1e-05,1.5e-05,1e-06,-5e-06,-1.1e-05,-4e-06,2.1e-05,-4e-06,-3e-06,2.8e-05,5e-06,-7e-06,1.9e-05,-2e-06,1.6e-05,5e-06,3e-06,1.1e-05,-1e-06,-1.7e-05,2e-06,-2.9e-05,6e-06,-1e-05,7e-06,2.2e-05,-1.1e-05,7e-06,2.1e-05,6e-06,-6e-06,7e-06,7e-06,0,4e-06,0,1.4e-05,1.2e-05,-2e-05,-1e-06,7e-06,6e-06,-5e-06,-1.1e-05,-2e-06,1.2e-05,-1e-06,-3e-06,2e-06,1.3e-05,1.7e-05,-5e-06,2.2e-05,-1.1e-05,1.2e-05,7e-06,-2e-06,1e-06,1e-05,3e-06,6e-06,1.1e-05,2e-06,4e-06,-1.2e-05,-4e-06,1.5e-05,-1.3e-05,-3e-06,-2e-06,7e-06,-7e-06,-7e-06,1.5e-05,4e-06,-4e-06,-6e-06,1e-06,-9e-06,6e-06,1e-06,-3e-06,3e-06,7e-06,-5e-06,-2e-06,1e-06,-1e-06,-9e-06
7e-06,-4e-06,1e-06,1.8e-05,-9e-06,7e-06,-1.2e-05,2.2e-05,2.1e-05,-1.5e-05,-4e-06,-1.6e-05,1.2e-05,1.1e-05,-6e-06,-5e-06,1.1e-05,1.5e-05,-5e-06,-1.8e-05,1e-05,-3e-06,-1e-05,5e-06,1.6e-05,-1.1e-05,1.6e-05,-3e-06,-1.8e-05,-5e-06,-9e-06,1.5e-05,2e-06,-1.9e-05,0,3e-06,0,-4e-06,8e-06,0,-3e-06,-2.8e-05,1e-06,5e-06,-5e-06,-1.1e-05,-1.9e-05,2e-06,8e-06,9e-06,-5e-06,-1e-06,-1.3e-05,2.3e-05,-6e-06,5e-06,-3e-06,6e-06,-1.5e-05,-8e-06,-2.9e-05,3e-06,8e-06,-2e-06,-2e-06,9e-06,1.1e-05,1e-06,7e-06,-6e-06,1e-05,-2e-06,-8e-06,-4e-06,3e-06,7e-06,4e-06,-5e-06,3e-06,3e-06,-2e-06,-1e-05,-2e-06,-1.5e-05,-1e-06,-1e-06,2e-06,-8e-06,3e-06,8e-06,-5e-06,1.3e-05,5e-06,0,8e-06,1e-05,-2e-06,2e-06,-6e-06,5e-06,5e-06,2e-06,3e-06,-2e-06,5e-06,-1e-05,-7e-06,-5e-06,8e-06,-1.2e-05,6e-06,2e-06,-2.4e-05,6e-06,8e-06,-9e-06,1e-06,5e-06,-4e-06,-3e-06,3e-06
-1e-06,-6e-06,-6e-06,3e-06,-7e-06,-1e-06,0,1.1e-05,-2.1e-05,-5e-06,3e-06,0,-1.6e-05,-1.9e-05,-2e-06,3e-06,0,-3e-06,-2e-06,-6e-06,-1.9e-05,-1e-06,5e-06,-3e-06,-6e-06,3e-06,-2e-06,-2e-06,-1.6e-05,-4e-06,-1.4e-05,-4.2e-05,-1e-05,1.8e-05,8e-06,-2e-06,-3e-06,3e-06,1e-05,-2e-06,1.3e-05,1.4e-05,1e-06,-9e-06,-1.4e-05,6e-06,9e-06,1.1e-05,1e-05,1.1e-05,3e-06,-3e-06,-8e-06,-4e-06,4e-06,-6e-06,1.3e-05,-1.2e-05,1.6e-05,1.1e-05,1e-05,-3e-06,5e-06,1e-06,6e-06,2e-06,-9e-06,9e-06,-3e-06,-7e-06,9e-06,8e-06,1.1e-05,3e-06,0,-7e-06,6e-06,-1e-06,-7e-06,5e-06,-8e-06,1.1e-05,3e-06,3e-06,-7e-06,0,-5e-06,0,3e-06,-1.1e-05,-1e-06,-2.9e-05,1.3e-05,2e-06,-1.1e-05,-1e-06,-1e-06,-4e-06,-4e-06,2e-06,0,-2e-06,-5e-06,3e-06,-8e-06,2e-06,0,-6e-06,-1e-06,1e-05,-1.1e-05,-2e-06,2e-06,-5e-06,-1e-05,-5e-06,-4e-06,1e-06,-6e-06,-1e-06,-4e-06
-3e-06,-4e-06,-5e-06,4e-06,-2e-06,1e-06,-4e-06,-6e-06,5e-06,-9e-06,1e-05,2e-06,-2e-06,1.1e-05,-1e-06,-1.3e-05,6e-06,-2e-05,7e-06,4e-06,1.7e-05,-2e-06,-2e-06,9e-06,-2.3e-05,-2e-06,9e-06,6e-06,-1e-06,3e-06,-2e-06,1.3e-05,1.2e-05,-6e-06,-5e-06,1e-06,4e-06,-7e-06,1.5e-05,-1e-05,3e-06,1.2e-05,-9e-06,6e-06,1.3e-05,0,-1.6e-05,1e-06,3e-06,-1e-06,3e-06,7e-06,2e-06,3e-06,-4e-06,-6e-06,-1.1e-05,1e-06,-3e-06,-1.3e-05,2e-06,8e-06,1e-06,-6e-06,-6e-06,-7e-06,-8e-06,-1e-05,1.6e-05,9e-06,8e-06,-4e-06,-1e-05,8e-06,3e-06,1e-06,-2e-06,-4e-06,-2e-06,-1.5e-05,-4e-06,-3e-06,-9e-06,-2e-06,1.7e-05,6e-06,-5e-06,3e-06,-4e-06,0,-8e-06,2.2e-05,3e-06,-4e-06,1e-06,7e-06,7e-06,1e-05,9e-06,1e-06,-6e-06,0,4e-06,-6e-06,1e-06,-7e-06,-7e-06,-1e-05,-5e-06,-1e-05,5e-06,-9e-06,-6e-06,-2e-06,3e-06,1e-06,3e-06,-2e-06,4e-06,2e-06,7e-06
1e-06,1.6e-05,-5e-06,6e-06,5e-06,1.1e-05,7e-06,8e-06,1e-06,5e-06,2e-06,-1e-06,9e-06,-5e-06,-6e-06,3e-06,9e-06,0,-3e-06,-5e-06,4e-06,4e-06,1.4e-05,2e-05,3.2e-05,-6e-06,3e-06,0,-3e-06,-1e-06,-3e-06,-1.7e-05,2e-06,6e-06,9e-06,3e-06,6e-06,1e-06,2e-06,1e-06,-6e-06,-2e-05,-1.3e-05,0,4e-06,-5e-06,7e-06,8e-06,1e-06,1e-06,-4e-06,-8e-06,1.5e-05,-1e-05,8e-06,-4e-06,1e-06,1e-06,3e-06,3e-06,-2e-06,-1e-05,-3e-06,3e-06,-5e-06,3e-06,0,4e-06,-9e-06,-8e-06,-1e-06,4e-06,3e-06,3e-06,-4e-06,0,-4e-06,5e-06,2e-06,6e-06,3e-06,9e-06,0,4e-06,-9e-06,2e-06,4e-06,-1e-05,-1e-06,-1e-06,1.3e-05,-3e-06,5e-06,-3e-06,4e-06,-5e-06,1.3e-05,-5e-06,-7e-06,-4e-06,-4e-06,-1e-06,-6e-06,-2e-06,-4e-06,4e-06,1.1e-05,-9e-06,7e-06,5e-06,-6e-06,-4e-06,1.3e-05,-3e-06,4e-06,-8e-06,-1e-06,-1e-06,3e-06,-4e-06,0
7e-06,-1.3e-05,1e-06,0,2e-06,-1.1e-05,-1e-05,5e-06,-1.2e-05,-2e-06,-4e-06,3e-06,0,6e-06,5e-06,2e-06,-7e-06,-1e-05,-2.1e-05,1.1e-05,-4e-06,-2e-06,-7e-06,-2.6e-05,-4e-06,6e-06,2e-06,-5e-06,0,0,-6e-06,3.3e-05,3e-06,-4e-06,-6e-06,1e-06,-5e-06,1e-06,-7e-06,-8e-06,-9e-06,1e-06,-1e-06,-6e-06,-1e-06,1e-06,-1e-06,-3e-06,3e-06,-1e-06,-1e-06,0,7e-06,7e-06,-5e-06,7e-06,5e-06,-9e-06,-4e-06,-3e-06,-4e-06,3e-06,-2e-06,2e-06,0,-3e-06,3e-06,-1e-06,1.4e-05,-1e-06,-1e-06,-4e-06,4e-06,-4e-06,8e-06,4e-06,-2e-06,-6e-06,-3e-06,3e-06,-3e-06,-3e-06,-1.2e-05,-1e-06,0,-2e-06,4e-06,-1e-06,9e-06,6e-06,-3e-06,-3e-06,-2e-06,-8e-06,-2e-06,-3e-06,0,1e-06,-1e-06,0,-2e-06,-1e-06,0,1e-06,-1e-06,-7e-06,-5e-06,-4e-06,-5e-06,-4e-06,1e-06,2e-06,-1e-06,1e-06,-4e-06,-6e-06,3e-06,-3e-06,-1e-06,0,-5e-06
-9e-06,5e-06,7e-06,-8e-06,-3e-06,4e-06,6e-06,-9e-06,2e-06,2e-06,0,-7e-06,-1e-06,-2e-06,-2e-06,5e-06,-7e-06,9e-06,1e-06,6e-06,5e-06,3e-06,-6e-06,8e-06,-5e-06,-1e-06,1.1e-05,-3e-06,6e-06,3e-06,5e-06,-1.5e-05,-5e-06,1e-06,-2e-06,-1e-06,-4e-06,-5e-06,-3e-06,-2e-06,5e-06,2e-06,1.5e-05,7e-06,-7e-06,0,3e-06,6e-06,0,-1e-06,4e-06,8e-06,-3e-06,-5e-06,1e-06,4e-06,-6e-06,3e-06,-4e-06,-1e-06,0,1e-06,-1e-06,0,3e-06,3e-06,-3e-06,-6e-06,-4e-06,2e-06,-2e-06,5e-06,9e-06,3e-06,-1e-06,6e-06,4e-06,5e-06,-1e-06,-6e-06,2e-06,1e-06,-3e-06,1e-06,2e-06,-3e-06,-1e-06,7e-06,4e-06,-2e-06,-2e-06,2e-06,-3e-06,6e-06,1e-06,-3e-06,0,-2e-06,5e-06,2e-06,1e-06,0,6e-06,3e-06,0,6e-06,2e-06,-1e-06,-3e-06,1e-06,0,2e-06,4e-06,-1e-06,-1e-06,3e-06,-3e-06,1e-06,1e-06,1e-06,5e-06
6e-06,-2e-06,-5e-06,-2e-06,-2e-06,0,-8e-06,-1.3e-05,-6e-06,8e-06,-6e-06,2e-06,9e-06,-5e-06,1e-06,4e-06,-2e-06,3e-06,-4e-06,-1.3e-05,4e-06,-2e-06,2e-06,-5e-06,1.3e-05,5e-06,0,-1e-06,2e-06,-2e-06,1e-06,1.1e-05,-3e-06,0,0,1e-06,4e-06,-2e-06,-1.6e-05,-1e-06,3e-06,2e-06,8e-06,-3e-06,-1e-06,3e-06,-1e-06,2e-06,0,6e-06,-4e-06,-9e-06,-4e-06,-4e-06,-2e-06,-2e-06,-6e-06,1e-06,-3e-06,6e-06,-2e-06,0,-2e-06,-1e-06,3e-06,1e-06,4e-06,2e-06,2e-06,-4e-06,3e-06,-3e-06,1e-06,3e-06,4e-06,-7e-06,0,-4e-06,3e-06,2e-06,2e-06,-4e-06,-2e-06,2e-06,-9e-06,2e-06,-5e-06,-2e-06,3e-06,-7e-06,-2e-06,-1e-06,0,-2e-06,-3e-06,1e-06,-4e-06,-2e-06,-4e-06,0,2e-06,0,-6e-06,4e-06,-3e-06,-6e-06,-3e-06,3e-06,2e-06,-3e-06,-2e-06,6e-06,2e-06,1e-06,2e-06,-4e-06,0,-1e-06,-3e-06,-2e-06,0
-6e-06,0,3e-06,5e-06,7e-06,-6e-06,3e-06,-1.4e-05,8e-06,7e-06,0,-3e-06,-1.4e-05,7e-06,1e-06,-5e-06,-6e-06,1e-05,8e-06,-6e-06,-4e-06,1e-06,1e-05,-5e-06,-7e-06,-9e-06,2e-06,3e-06,2e-06,0,0,-1.8e-05,1e-06,2e-06,1e-06,-1e-06,1e-06,4e-06,2e-06,5e-06,0,3e-06,1e-06,-2e-06,8e-06,-6e-06,1e-06,-1e-06,-4e-06,0,-1e-06,7e-06,-3e-06,4e-06,4e-06,2e-06,-1e-06,-9e-06,-3e-06,-4e-06,6e-06,5e-06,4e-06,1e-06,3e-06,-2e-06,2e-06,-4e-06,5e-06,-2e-06,0,0,-4e-06,-5e-06,0,-2e-06,0,1e-06,-2e-06,1e-06,-3e-06,3e-06,2e-06,-1e-06,8e-06,-2e-06,1e-06,7e-06,3e-06,3e-06,1e-06,1e-06,-6e-06,0,5e-06,-4e-06,-7e-06,-4e-06,-5e-06,0,2e-06,1e-06,-1e-06,-3e-06,0,0,-2e-06,4e-06,0,3e-06,1e-06,2e-06,0,0,-5e-06,2e-06,0,2e-06,-1e-06,0,-6e-06
3e-06,1e-06,-1e-06,5e-06,-1e-06,8e-06,-4e-06,-7e-06,-7e-06,3e-06,2e-06,3e-06,9e-06,-8e-06,-2e-06,0,-8e-06,0,-3e-06,-2e-06,-3e-06,-1e-06,-8e-06,8e-06,-1e-06,1.2e-05,6e-06,-4e-06,7e-06,-2e-06,-3e-06,1.2e-05,-1e-06,-1e-06,-2e-06,0,-1e-06,-1e-06,-1.3e-05,4e-06,-4e-06,-3e-06,3e-06,-1e-06,-5e-06,2e-06,-4e-06,5e-06,-5e-06,2e-06,2e-06,-5e-06,5e-06,-4e-06,-4e-06,1e-06,2e-06,6e-06,7e-06,5e-06,-1e-06,-4e-06,2e-06,0,-2e-06,2e-06,-2e-06,1e-06,-7e-06,-2e-06,-5e-06,2e-06,6e-06,-1e-06,1e-06,3e-06,-1e-06,-2e-06,1e-06,-2e-06,0,0,-1e-06,-3e-06,0,2e-06,4e-06,0,4e-06,4e-06,4e-06,-5e-06,-5e-06,0,-2e-06,-2e-06,1e-06,0,1e-05,-4e-06,-2e-06,-1e-06,6e-06,0,0,-2e-06,3e-06,3e-06,1e-06,-3e-06,-1e-06,-2e-06,-4e-06,-1e-06,5e-06,0,2e-06,1e-06,-1e-06,1e-06,7e-06
0,-4e-06,3e-06,-1e-06,-2e-06,-5e-06,2e-06,0,4e-06,-2e-06,-1e-06,0,-4e-06,8e-06,0,-1e-06,-5e-06,-4e-06,-1.2e-05,-4e-06,-1.3e-05,-3e-06,-5e-06,6e-06,-2e-06,-6e-06,-3e-06,-1e-06,1e-06,0,-3e-06,-6e-06,3e-06,-6e-06,3e-06,-2e-06,1e-06,1e-06,1e-06,3e-06,2e-06,-6e-06,-4e-06,1e-06,-3e-06,1e-06,6e-06,-3e-06,-1e-06,-1e-06,0,1e-06,5e-06,3e-06,3e-06,2e-06,3e-06,6e-06,-2e-06,-3e-06,-4e-06,2e-06,-2e-06,1e-06,-2e-06,-4e-06,-5e-06,1e-06,1e-05,2e-06,-3e-06,-3e-06,-6e-06,-3e-06,2e-06,-1e-06,1e-06,-3e-06,-1e-06,1e-06,-2e-06,0,7e-06,-1e-06,-3e-06,1e-06,-1e-06,-6e-06,-1e-06,-3e-06,-3e-06,8e-06,-3e-06,-1e-06,-2e-06,0,-1e-06,0,-9e-06,0,-3e-06,1e-06,-4e-06,1e-06,0,2e-06,-4e-06,1e-06,1e-06,4e-06,-1e-06,-2e-06,-1e-06,-1e-06,-2e-06,6e-06,0,2e-06,2e-06,-1e-06,-4e-06
2e-06,-2e-06,-2e-06,0,4e-06,-2e-06,-3e-06,4e-06,0,-4e-06,2e-06,-2e-06,-3e-06,-3e-06,0,-5e-06,1e-06,-4e-06,0,5e-06,-5e-06,1e-06,3e-06,-1.1e-05,-1e-06,2e-06,2e-06,-3e-06,-8e-06,0,0,1.5e-05,1e-06,5e-06,0,2e-06,-2e-06,1e-06,-3e-06,3e-06,0,4e-06,-7e-06,-1e-06,6e-06,0,-5e-06,3e-06,-2e-06,1e-06,-2e-06,-1e-06,-2e-06,-1e-06,-2e-06,-5e-06,-5e-06,-5e-06,1e-06,3e-06,3e-06,-3e-06,-1e-06,-1e-06,-1e-06,0,3e-06,-1e-06,-5e-06,0,3e-06,3e-06,-3e-06,-2e-06,-1e-06,1e-06,-1e-06,3e-06,-1e-06,-1e-06,-3e-06,1e-06,3e-06,-5e-06,9e-06,-1e-06,0,1e-06,-3e-06,0,3e-06,-2e-06,-3e-06,-4e-06,3e-06,0,2e-06,-1e-06,2e-06,2e-06,0,-1e-06,0,-1e-06,-5e-06,-3e-06,2e-06,2e-06,2e-06,-3e-06,-1e-06,-3e-06,-5e-06,2e-06,-2e-06,1e-06,-1e-06,-3e-06,-1e-06,0,3e-06
-3e-06,9e-06,-4e-06,-2e-06,-2e-06,5e-06,1e-06,1e-06,1e-06,-4e-06,0,-1e-06,5e-06,-3e-06,1e-06,4e-06,-1e-06,-8e-06,-5e-06,3e-06,6e-06,0,4e-06,1.1e-05,4e-06,-5e-06,5e-06,4e-06,-2e-06,1e-06,-5e-06,-1.3e-05,-2e-06,-3e-06,-2e-06,-2e-06,-2e-06,-3e-06,0,0,-1e-06,2e-06,-9e-06,0,-1e-06,-3e-06,3e-06,-2e-06,-1e-06,0,1e-06,3e-06,-5e-06,9e-06,1e-06,-4e-06,1e-06,2e-06,-1e-06,-1e-06,-3e-06,1e-06,-1e-06,0,0,2e-06,3e-06,4e-06,6e-06,-4e-06,5e-06,-2e-06,2e-06,-3e-06,3e-06,0,1e-06,-3e-06,2e-06,-1e-06,0,-2e-06,4e-06,2e-06,-7e-06,1e-06,-3e-06,-3e-06,-2e-06,0,-5e-06,-8e-06,0,5e-06,-2e-06,-3e-06,1e-06,-1e-06,3e-06,-2e-06,-1e-06,0,0,-1e-06,0,1e-06,1e-06,5e-06,-2e-06,-1e-06,-1e-06,-1e-06,0,-1e-06,3e-06,0,-1e-06,0,0,0,-1e-06
2e-06,-5e-06,2e-06,-2e-06,-3e-06,-8e-06,-1e-06,-4e-06,-2e-06,-4e-06,-1e-06,-1e-06,-2e-06,6e-06,-1e-06,1e-06,-1e-06,5e-06,9e-06,-2e-06,3e-06,1e-06,-5e-06,-1.4e-05,-1.3e-05,6e-06,-3e-06,-2e-06,-2e-06,1e-06,-3e-06,5e-06,1e-06,3e-06,2e-06,1e-06,2e-06,1e-06,4e-06,2e-06,-2e-06,1e-06,-6e-06,0,-2e-06,1e-06,-4e-06,0,0,-2e-06,1e-06,-3e-06,-4e-06,-9e-06,-1e-06,4e-06,1e-06,3e-06,-1e-06,-1e-06,1e-06,1e-06,1e-06,-1e-06,0,0,-3e-06,0,0,3e-06,1e-06,2e-06,2e-06,-3e-06,-2e-06,2e-06,-1e-06,0,0,3e-06,-1e-06,0,2e-06,-1e-06,-2e-06,0,3e-06,2e-06,-3e-06,0,2e-06,7e-06,2e-06,-2e-06,1e-06,-2e-06,-4e-06,0,-5e-06,0,-1e-06,-1e-06,-1e-06,0,-1e-06,-1e-06,1e-06,5e-06,-1e-06,1e-06,-2e-06,1e-06,0,1e-06,-3e-06,6e-06,0,-1e-06,-1e-06,1e-06,-1e-06
-1e-06,-1e-06,1e-06,-3e-06,4e-06,9e-06,0,7e-06,-4e-06,-4e-06,0,1e-06,-1e-06,-4e-06,1e-06,0,2e-06,-3e-06,-7e-06,-3e-06,3e-06,0,-1e-06,7e-06,1.2e-05,-4e-06,1e-06,-1e-06,-4e-06,0,-3e-06,-1.3e-05,-2e-06,-3e-06,0,-1e-06,2e-06,-2e-06,3e-06,-1e-06,3e-06,0,6e-06,1e-06,1e-06,0,2e-06,-1e-06,1e-06,0,-1e-06,0,1e-06,4e-06,0,-1e-06,-2e-06,-3e-06,-1e-06,5e-06,2e-06,0,0,2e-06,0,1e-06,-4e-06,0,-1e-06,-2e-06,-2e-06,-1e-06,-1e-06,4e-06,4e-06,1e-06,2e-06,0,1e-06,-1e-06,2e-06,-2e-06,1e-06,0,3e-06,-1e-06,1e-06,4e-06,-1e-06,1e-06,-2e-06,-3e-06,2e-06,1e-06,-1e-06,1e-06,0,-1e-06,3e-06,2e-06,-1e-06,1e-06,3e-06,1e-06,-2e-06,-4e-06,0,3e-06,2e-06,-2e-06,1e-06,2e-06,0,0,0,-1e-06,0,-1e-06,0,0,2e-06
1e-06,-3e-06,1e-06,1e-06,-2e-06,-5e-06,2e-06,8e-06,1e-06,2e-06,1e-06,0,4e-06,4e-06,-1e-06,0,5e-06,9e-06,-2e-06,-4e-06,3e-06,0,0,-1e-06,-3e-06,0,1e-06,-2e-06,2e-06,-1e-06,-1e-06,1.4e-05,2e-06,-1e-06,-1e-06,1e-06,-3e-06,-1e-06,5e-06,-2e-06,2e-06,-5e-06,1.1e-05,-3e-06,0,-1e-06,-1e-06,-1e-06,3e-06,-1e-06,-1e-06,3e-06,4e-06,0,1e-06,-2e-06,-2e-06,2e-06,0,-7e-06,-5e-06,2e-06,2e-06,-1e-06,1e-06,-2e-06,2e-06,1e-06,5e-06,0,-2e-06,0,-2e-06,-2e-06,-2e-06,-4e-06,-1e-06,-2e-06,1e-06,-2e-06,-2e-06,2e-06,-3e-06,1e-06,-7e-06,0,0,-2e-06,-1e-06,-1e-06,3e-06,0,1e-06,-1e-06,1e-06,-1e-06,-2e-06,0,2e-06,-1e-06,1e-06,-1e-06,-4e-06,2e-06,1e-06,2e-06,-1e-06,2e-06,-1e-06,0,-2e-06,3e-06,1e-06,0,3e-06,3e-06,1e-06,2e-06,0,-1e-06,-3e-06
-1e-06,3e-06,-1e-06,2e-06,-1e-06,2e-06,-3e-06,3e-06,-2e-06,1e-06,-1e-06,-1e-06,-4e-06,-3e-06,-1e-06,-1e-06,0,1e-06,-5e-06,-1e-06,0,0,0,1e-06,-3e-06,1e-06,-4e-06,1e-06,3e-06,0,0,-8e-06,-1e-06,1e-06,-1e-06,-1e-06,0,2e-06,6e-06,-3e-06,-1e-06,4e-06,4e-06,4e-06,1e-06,0,3e-06,-1e-06,2e-06,0,1e-06,-3e-06,1e-06,-1e-06,-1e-06,0,-1e-06,1e-06,2e-06,5e-06,2e-06,-3e-06,0,-1e-06,2e-06,-1e-06,2e-06,-1e-06,-4e-06,1e-06,3e-06,1e-06,4e-06,1e-06,3e-06,-1e-06,0,-1e-06,0,3e-06,1e-06,-1e-06,-2e-06,1e-06,4e-06,0,-2e-06,1e-06,-2e-06,1e-06,1e-06,2e-06,4e-06,1e-06,2e-06,-2e-06,1e-06,-1e-06,-4e-06,1e-06,0,1e-06,0,0,-1e-06,-2e-06,-2e-06,1e-06,1e-06,-1e-06,1e-06,0,1e-06,-1e-06,-3e-06,1e-06,-1e-06,0,1e-06,1e-06,1e-06
1e-06,2e-06,-3e-06,0,1e-06,0,3e-06,7e-06,0,3e-06,1e-06,-1e-06,0,-1e-06,0,0,2e-06,3e-06,1e-06,-1e-06,-3e-06,0,1e-06,-1e-06,1e-05,0,2e-06,1e-06,0,0,-1e-06,1.1e-05,0,-1e-06,3e-06,1e-06,1e-06,-2e-06,3e-06,-2e-06,-3e-06,0,-2e-06,-3e-06,0,-1e-06,-3e-06,-4e-06,2e-06,-1e-06,0,1e-06,-3e-06,-2e-06,1e-06,5e-06,1e-06,-5e-06,-1e-06,-7e-06,-1e-06,1e-06,-2e-06,1e-06,0,3e-06,-2e-06,0,6e-06,0,0,-2e-06,-6e-06,3e-06,-3e-06,2e-06,-1e-06,0,-1e-06,-1e-06,1e-06,0,-4e-06,-1e-06,2e-06,0,-1e-06,-1e-06,-2e-06,-2e-06,-1e-06,-1e-06,2e-06,-3e-06,-3e-06,0,4e-06,1e-06,3e-06,1e-06,-1e-06,-1e-06,3e-06,-1e-06,-1e-06,1e-06,2e-06,1e-06,2e-06,0,0,0,2e-06,0,1e-06,0,0,1e-06,1e-06,0,2e-06
-1e-06,0,3e-06,-2e-06,-3e-06,-1e-06,-4e-06,-2e-06,-2e-06,4e-06,1e-06,-1e-06,4e-06,2e-06,0,-1e-06,2e-06,-5e-06,1e-06,-1e-06,-2e-06,0,-1e-06,6e-06,-7e-06,0,-1e-06,-2e-06,3e-06,0,0,-1.1e-05,2e-06,0,-4e-06,0,-1e-06,-2e-06,5e-06,-2e-06,1e-06,-1e-06,1e-06,3e-06,0,1e-06,3e-06,1e-06,1e-06,-1e-06,-2e-06,0,-4e-06,1e-06,-1e-06,-1e-06,0,1e-06,1e-06,4e-06,1e-06,-2e-06,-1e-06,1e-06,-1e-06,-2e-06,-2e-06,-1e-06,-4e-06,0,-2e-06,2e-06,-1e-06,-2e-06,4e-06,-1e-06,1e-06,-1e-06,1e-06,-1e-06,-2e-06,-3e-06,-2e-06,-1e-06,-4e-06,1e-06,1e-06,-3e-06,-1e-06,0,-2e-06,-1e-06,1e-06,2e-06,2e-06,2e-06,-1e-06,0,1e-06,0,-1e-06,1e-06,-1e-06,1e-06,0,-2e-06,-2e-06,0,-2e-06,-3e-06,0,-1e-06,-2e-06,0,2e-06,1e-06,-1e-06,0,-1e-06,-1e-06,-4e-06
2e-06,-3e-06,0,-1e-06,1e-06,1e-06,4e-06,-6e-06,2e-06,3e-06,-3e-06,1e-06,-5e-06,-1e-06,0,0,0,-5e-06,1e-06,2e-06,-8e-06,0,-1e-06,-1.3e-05,6e-06,0,-4e-06,1e-06,4e-06,1e-06,0,7e-06,-1e-06,-2e-06,1e-06,0,1e-06,3e-06,-3e-06,0,2e-06,3e-06,0,-1e-06,1e-06,-2e-06,-4e-06,-3e-06,0,-1e-06,1e-06,0,0,1e-06,2e-06,-1e-06,-2e-06,2e-06,-2e-06,-3e-06,1e-06,1e-06,0,0,-1e-06,1e-06,3e-06,0,3e-06,-1e-06,-2e-06,-1e-06,0,2e-06,-4e-06,0,0,-1e-06,0,1e-06,-1e-06,1e-06,-1e-06,-1e-06,9e-06,-1e-06,1e-06,4e-06,1e-06,2e-06,0,-2e-06,1e-06,-1e-06,-1e-06,-1e-06,2e-06,0,-4e-06,1e-06,0,-1e-06,-2e-06,-1e-06,-1e-06,2e-06,2e-06,-1e-06,0,3e-06,0,-2e-06,2e-06,0,-3e-06,-2e-06,0,-1e-06,0,0,3e-06
-3e-06,0,-1e-06,-2e-06,1e-06,2e-06,-4e-06,5e-06,1e-06,2e-06,1e-06,0,5e-06,0,0,1e-06,-1e-06,0,-6e-06,-1e-06,5e-06,0,0,1.2e-05,-4e-06,3e-06,1e-06,-3e-06,0,0,-1e-06,-6e-06,1e-06,1e-06,0,0,1e-06,-3e-06,-1e-06,1e-06,1e-06,-4e-06,-6e-06,1e-06,-2e-06,2e-06,2e-06,-1e-06,0,-1e-06,1e-06,0,5e-06,-5e-06,-3e-06,0,1e-06,-4e-06,1e-06,3e-06,-1e-06,1e-06,1e-06,-1e-06,0,-1e-06,1e-06,-1e-06,0,2e-06,2e-06,0,1e-06,-1e-06,5e-06,-1e-06,0,1e-06,0,-1e-06,-1e-06,0,-1e-06,2e-06,-5e-06,0,-1e-06,-1e-06,0,0,4e-06,5e-06,-1e-06,1e-06,0,0,-1e-06,1e-06,5e-06,0,-1e-06,1e-06,1e-06,0,0,-5e-06,0,-3e-06,0,-4e-06,-1e-06,0,-4e-06,0,3e-06,-1e-06,0,0,-1e-06,0,0
1e-06,1e-06,-1e-06,-1e-06,0,-4e-06,5e-06,-3e-06,-3e-06,-3e-06,-1e-06,0,-2e-06,-1e-06,0,1e-06,-1e-06,-5e-06,0,-2e-06,1e-06,-1e-06,2e-06,-7e-06,-1e-06,-4e-06,-2e-06,3e-06,-1e-06,0,-1e-06,1.1e-05,1e-06,1e-06,0,0,-2e-06,1e-06,-3e-06,0,-2e-06,1e-06,-4e-06,0,1e-06,-2e-06,-1e-06,-2e-06,-1e-06,0,-1e-06,0,4e-06,7e-06,3e-06,2e-06,1e-06,1e-06,0,-1e-06,-2e-06,-1e-06,0,1e-06,0,-1e-06,-1e-06,0,-3e-06,1e-06,1e-06,1e-06,0,0,-4e-06,1e-06,-1e-06,-2e-06,0,1e-06,0,1e-06,2e-06,-1e-06,-1e-06,-1e-06,-1e-06,1e-06,1e-06,-3e-06,-2e-06,-1e-06,-2e-06,-1e-06,0,2e-06,-1e-06,0,-2e-06,-1e-06,-1e-06,-1e-06,1e-06,-1e-06,0,2e-06,0,-3e-06,-1e-06,3e-06,0,0,3e-06,0,0,-1e-06,0,0,0,0,-2e-06
-1e-06,0,-1e-06,0,0,6e-06,-6e-06,-7e-06,1e-06,-3e-06,-1e-06,0,-2e-06,1e-06,-1e-06,-1e-06,-2e-06,6e-06,-5e-06,-1e-06,0,1e-06,-1e-06,1e-06,6e-06,2e-06,-3e-06,-4e-06,-2e-06,0,-2e-06,-1.1e-05,-1e-06,0,-1e-06,1e-06,-1e-06,1e-06,-4e-06,2e-06,0,2e-06,3e-06,0,1e-06,1e-06,1e-06,-2e-06,-2e-06,-2e-06,0,0,-1e-06,-4e-06,-3e-06,0,-1e-06,2e-06,-2e-06,0,3e-06,2e-06,0,0,0,2e-06,-1e-06,0,4e-06,-1e-06,1e-06,0,-3e-06,2e-06,5e-06,0,0,0,-1e-06,1e-06,1e-06,-1e-06,3e-06,0,4e-06,0,0,0,3e-06,2e-06,1e-06,-4e-06,-2e-06,2e-06,-1e-06,1e-06,2e-06,0,-2e-06,0,0,1e-06,-1e-06,0,-2e-06,-3e-06,1e-06,-2e-06,0,-2e-06,-1e-06,1e-06,-3e-06,-1e-06,-2e-06,-4e-06,0,0,0,0,4e-06
