-0.000125,-7.4e-05,-8.6e-05,-6.6e-05,-4.4e-05,-5.3e-05,-5e-05,-4.4e-05,-4e-05,-4.3e-05,-3e-05,-2.5e-05,-0.000126,-0.000553,-0.00086,-0.000219,-1.4e-05,-0.000893,-0.004911,-0.005236,-0.01064,-0.00807,-0.00389,-0.025735,-0.011219,-3e-05,-3.4e-05,-0.014316
0.000137,6.3e-05,8.1e-05,7.6e-05,5e-05,5.3e-05,5.6e-05,5.2e-05,4.7e-05,4.5e-05,1.9e-05,1.3e-05,8e-06,-0.000564,-0.000949,-0.000196,-7e-06,-0.000631,-0.00211,-0.001988,-0.008904,-0.007072,-0.000877,-0.008765,-0.005351,-3.3e-05,1.2e-05,0.005647
-1.1e-05,-1.5e-05,-5e-06,-2e-06,-8e-06,-5e-06,-7e-06,-1.1e-05,-1.1e-05,-5e-06,-7e-06,-1.3e-05,1.5e-05,-0.00014,2.2e-05,7e-05,-1.2e-05,7.7e-05,0.001354,0.001813,0.002581,0.001737,0.001402,0.008746,0.003527,2.9e-05,-1e-06,0.001062
-0.000142,-7.2e-05,-9.6e-05,-8.3e-05,-5.7e-05,-6.6e-05,-6.1e-05,-5.1e-05,-4.5e-05,-4.5e-05,-2.4e-05,-2.4e-05,-8e-06,0.000105,0.000524,0.000204,-6e-06,0.00049,0.001694,0.001614,0.005499,0.004794,0.000571,0.008354,0.006005,0.000102,-2.9e-05,-0.006596
0.000119,7.6e-05,7.6e-05,5.6e-05,4.3e-05,4.8e-05,4.7e-05,4.5e-05,4.3e-05,3.7e-05,2.7e-05,2.7e-05,1.2e-05,-0.000161,-1e-04,4.6e-05,0,0.000433,0.001299,0.001087,0.00158,0.002081,0.001053,0.010861,0.006935,0.000116,4e-06,0.003544
5.9e-05,3.7e-05,5.8e-05,4e-05,2.2e-05,3.6e-05,3e-05,1.5e-05,7e-06,1.3e-05,1.1e-05,1.4e-05,-3.6e-05,-0.000424,-0.000721,-0.000159,-1.5e-05,-0.00026,-0.001463,-0.001788,-0.006095,-0.004542,-0.000386,-0.00341,-0.001605,2.2e-05,7e-06,-0.000891
-0.000142,-7.5e-05,-9.8e-05,-7.7e-05,-5.2e-05,-5.7e-05,-5.1e-05,-4.4e-05,-4.6e-05,-4.5e-05,-2.6e-05,-2e-05,-1.7e-05,0.000102,-0.000139,-0.000127,-1.7e-05,-0.000669,-0.003688,-0.004283,-0.009032,-0.007248,-0.003385,-0.025092,-0.012106,-6e-05,-2.3e-05,-0.007077
4.8e-05,1.9e-05,1.4e-05,1.7e-05,1.6e-05,9e-06,1.5e-05,1.9e-05,2.2e-05,1.6e-05,4e-06,5e-06,7.2e-05,0.000646,0.000706,5.9e-05,-8e-06,-0.000167,-0.00046,-0.000549,-0.002891,-0.002671,-0.001092,-0.008653,-0.004581,-1.7e-05,3e-06,0.003952
7.8e-05,2.9e-05,6.3e-05,5.1e-05,2.7e-05,3.7e-05,2.8e-05,1.6e-05,1.6e-05,1.8e-05,3e-06,2e-06,1e-05,0.000285,0.000539,0.00013,3e-06,0.000469,0.003324,0.003878,0.006034,0.004082,0.003117,0.021324,0.009566,7.8e-05,2.8e-05,0.008954
-0.000108,-5.2e-05,-6.7e-05,-5.1e-05,-3.8e-05,-4.4e-05,-4e-05,-3e-05,-2.9e-05,-2.4e-05,-9e-06,-1.5e-05,-4.7e-05,-0.000286,-0.000237,2.3e-05,7e-06,0.000279,0.001019,0.001103,0.006723,0.005299,0.001089,0.009316,0.005608,9.5e-05,-6e-06,-0.001839
1.1e-05,1.2e-05,-1.1e-05,-7e-06,4e-06,-8e-06,-2e-06,8e-06,1.5e-05,1e-05,1.3e-05,7e-06,-9e-06,-0.000471,-0.00068,-9e-05,-6e-06,-0.000221,-0.002285,-0.002955,-0.001482,-0.000309,-0.002378,-0.015316,-0.005744,2.5e-05,-2.5e-05,-0.009998
9.5e-05,4.8e-05,7.9e-05,5.6e-05,3.7e-05,4.8e-05,3.4e-05,2e-05,1.7e-05,1.6e-05,7e-06,1.6e-05,2.5e-05,-0.000252,-0.000406,-6.7e-05,1e-06,-0.000199,-0.000603,-0.000932,-0.006847,-0.005344,-0.001182,-0.010625,-0.005943,-3.7e-05,1.1e-05,0.000466
-7.5e-05,-3e-05,-3.2e-05,-2.4e-05,-1.8e-05,-1.5e-05,-1.2e-05,-1e-05,-2e-05,-1.8e-05,-1e-05,-4e-06,-1.6e-05,-6e-06,5e-05,3e-06,1e-06,-2.6e-05,0.001156,0.001389,-0.002869,-0.003437,0.000451,-0.000235,-0.002095,-3.8e-05,1.7e-05,0.008204
-3.3e-05,-1.8e-05,-5e-05,-3.3e-05,-1.4e-05,-2.4e-05,-1.1e-05,-2e-06,5e-06,-2e-06,2e-06,1e-06,1e-06,3.8e-05,0.000126,3.8e-05,-4e-06,-3e-06,-1.8e-05,-5.4e-05,0.002754,0.001627,0.000247,0.00151,0.000502,2.7e-05,-1e-05,-0.003561
8.9e-05,3e-05,6e-05,4.1e-05,2.5e-05,3.3e-05,1.9e-05,5e-06,1.3e-05,1.5e-05,5e-06,7e-06,1.6e-05,-4e-06,2.2e-05,2.1e-05,-2e-06,8.4e-05,-2.2e-05,-0.000213,0.004226,0.004165,0.000966,0.009362,0.005693,9.5e-05,1e-06,-0.003799
-3.2e-05,-1.4e-05,0,-1e-06,-6e-06,-1e-06,-4e-06,-3e-06,-1.3e-05,-8e-06,-5e-06,-7e-06,-2.1e-05,4.7e-05,2.8e-05,-5e-06,1e-06,6e-06,0.000485,0.000716,0.002085,0.0025,0.000731,0.006547,0.003906,6.6e-05,1e-05,0.005436
-5e-05,-1.9e-05,-5.5e-05,-3.6e-05,-2.2e-05,-3.5e-05,-1.7e-05,-4e-06,-2e-06,-4e-06,3e-06,-7e-06,-4e-06,0.000147,5.8e-05,-2.1e-05,-8e-06,-0.000157,-0.000587,-0.000508,-0.002121,-0.001975,-0.001293,-0.011118,-0.005804,-2.8e-05,-1.1e-05,-0.002873
6.5e-05,2.5e-05,3.7e-05,2.2e-05,1.3e-05,1.6e-05,5e-06,-6e-06,3e-06,6e-06,0,-2e-06,2e-05,0.000165,9.4e-05,-1.6e-05,-4e-06,-4.3e-05,-0.000356,-0.000469,-0.003242,-0.003495,-0.00112,-0.010664,-0.00632,-5.5e-05,-2e-06,-0.002588
-8e-06,4e-06,2.6e-05,1.5e-05,9e-06,1.7e-05,8e-06,6e-06,-7e-06,-4e-06,-6e-06,-3e-06,5e-06,7.3e-05,8.8e-05,4e-06,3e-06,6.7e-05,0.000905,0.001292,-9e-06,-0.000451,0.001067,0.007487,0.002786,-6e-06,9e-06,0.007124
