-0.010346,-0.000773,-2.2e-05,-3e-06,-3e-06,-8e-06,-8e-06,-3e-06,-0.001774,-0.059189,-0.135643,-0.074093,-0.017077,-0.006022,-0.063939,-0.122811,-0.111824,-0.0785,-0.035083,-0.014676,-0.003043,-0.001767,-0.000964,-0.000994,-0.001784,-0.001505,-0.003461,-0.016681
-0.006472,-0.000518,-2.2e-05,-3e-06,0,-1e-06,-4e-06,-2e-06,-0.000733,-0.030288,-0.060015,-0.033455,-0.013775,0.00544,0.088973,0.156337,0.136327,0.072947,0.030046,0.010999,0.001588,0.001804,0.001156,0.001184,0.001201,0.000365,-0.003095,-0.018409
0.004704,0.000329,8e-06,2e-06,1e-06,1e-06,3e-06,2e-06,0.000384,0.019547,0.047338,0.029401,0.003391,-0.000927,-0.011547,-0.028025,-0.041051,-0.03023,-0.012046,-0.003637,-0.000551,-7.1e-05,4e-06,-2.7e-05,-7.7e-05,-0.000218,-0.002689,-0.015863
0.00943,0.000701,2.1e-05,3e-06,1e-06,6e-06,7e-06,3e-06,0.000903,0.031491,0.085926,0.052829,0.01206,-0.012139,-0.087713,-0.141116,-0.101445,-0.054928,-0.033058,-0.014483,-0.002167,-0.002024,-0.0011,-0.001086,-0.001049,-0.000296,0.001071,0.008277
0.00074,0.00011,9e-06,0,0,2e-06,1e-06,0,0.000515,0.01009,0.014458,0.00464,0.008992,0.008044,0.070271,0.14156,0.141228,0.093999,0.03776,0.014658,0.003217,0.0018,0.001049,0.001057,0.001664,0.001452,0.004505,0.025231
-0.00949,-0.000672,-1.9e-05,-6e-06,-7e-06,-1e-05,-1e-05,-5e-06,-0.000681,-0.021982,-0.08417,-0.056723,-0.008512,-0.00086,0.020833,0.029531,-0.004823,-0.003763,0.011509,0.007904,0.001036,0.00093,0.000526,0.00038,0.000137,-0.000125,0.000638,0.003692
-0.00426,-0.000391,-2.1e-05,-3e-06,-2e-06,-1e-06,-2e-06,-1e-06,-0.00068,-0.025397,-0.04264,-0.018725,-0.011407,-0.007657,-0.08703,-0.150311,-0.12167,-0.072445,-0.030861,-0.014166,-0.003246,-0.002142,-0.001245,-0.001322,-0.002082,-0.001525,-0.00228,-0.009566
0.006427,0.000443,6e-06,5e-06,4e-06,7e-06,7e-06,3e-06,4.6e-05,0.005495,0.047351,0.039684,0.000532,0.00245,0.045695,0.094034,0.093563,0.047261,0.015266,0.003212,0.000525,0.000559,0.000356,0.000472,0.000776,0.000456,-0.001501,-0.009587
0.006086,0.000494,1.4e-05,0,0,1e-06,3e-06,1e-06,0.000563,0.024367,0.046738,0.022035,0.007688,0.004787,0.044844,0.062469,0.020216,0.00069,0.008236,0.007618,0.001816,0.001478,0.000835,0.000839,0.001192,0.000613,-0.000866,-0.009245
-0.002074,-0.000128,6e-06,0,0,0,0,2e-06,0.000425,0.007847,-0.001573,-0.013947,0.002797,-0.0059,-0.079897,-0.141916,-0.098821,-0.041755,-0.02398,-0.010369,-0.001449,-0.001513,-0.000843,-0.000879,-0.001045,-0.000365,0.000863,0.005329
-0.006529,-0.000502,-1.3e-05,-4e-06,-2e-06,-5e-06,-6e-06,-1e-06,-0.000492,-0.018699,-0.049982,-0.024833,-0.000184,0.004847,0.019083,0.050339,0.071684,0.052481,0.009775,0.000256,0.000254,-5.6e-05,-7e-06,7.5e-05,0.000195,0.000322,0.001899,0.012714
-0.001414,-0.000141,-5e-06,4e-06,3e-06,1e-06,0,3e-06,-0.000244,-0.011375,-0.017276,-0.000853,-0.003262,0.002606,0.058882,0.088589,0.032449,0.003476,0.012331,0.010215,0.001476,0.001645,0.000913,0.000882,0.000788,8.5e-05,0.000196,0.00134
0.005202,0.00039,4e-06,2e-06,2e-06,6e-06,6e-06,2e-06,-8e-06,0.007763,0.038041,0.022734,-0.002512,-0.005665,-0.063745,-0.118271,-0.094781,-0.0483,-0.015346,-0.006005,-0.001503,-0.001011,-6e-04,-0.000721,-0.00112,-0.000674,-0.000855,-0.003685
0.003575,0.000312,1.3e-05,1e-06,0,2e-06,3e-06,1e-06,0.000262,0.006351,0.007471,0.003384,0.001282,0.00091,-0.005418,0.015641,0.041725,0.027973,0.003551,-0.004918,-0.000689,-0.00088,-0.000525,-0.000403,-3.4e-05,0.000288,-0.000565,-0.003528
-0.002982,-0.000226,-3e-06,-6e-06,-2e-06,-3e-06,-4e-06,-3e-06,0.000149,-0.000432,-0.017796,-0.014958,0.001661,0.001934,0.062156,0.101805,0.049132,0.006116,0.009771,0.008049,0.00169,0.001407,0.000812,0.00087,0.001254,0.00044,-0.000304,-0.004503
-0.004279,-0.000356,-6e-06,-2e-06,-1e-06,-3e-06,-4e-06,-2e-06,-0.000112,0.002312,0.006855,-0.00204,0.000852,-0.004981,-0.046416,-0.096401,-0.075864,-0.029577,-0.011244,-0.001839,-0.000365,-0.000384,-0.000171,-0.000285,-0.000587,-0.000435,0.000255,0.00066
0.000611,4.2e-05,-1e-06,1e-06,-1e-06,-1e-06,-1e-06,-1e-06,-0.000253,0.002195,0.005695,0.005332,-0.000365,-0.002687,-0.027166,-0.022557,0.018083,0.029891,-1.9e-05,-0.006423,-0.001363,-0.001178,-0.000674,-0.000701,-0.000782,-6.1e-05,0.00037,0.002261
0.004002,0.000341,7e-06,1e-06,0,4e-06,5e-06,1e-06,0.00026,-0.002075,0.000704,0.0059,-0.001191,0.003945,0.057635,0.102745,0.054724,0.006185,0.008579,0.006584,0.000804,0.0012,0.000571,0.000613,0.00078,0.000268,8.3e-05,5e-04
0.000887,0.00011,4e-06,-4e-06,-3e-06,-1e-06,1e-06,-2e-06,4e-05,-0.007577,-0.010257,-0.002217,-0.002061,-0.00284,-0.025462,-0.067549,-0.062211,-0.03327,-0.006935,0.001721,6e-05,0.000214,0.00013,5.4e-05,-2.4e-05,-0.000119,-1.4e-05,0.001993
