0.077656,0.091745,0.113188,0.111407,0.090556,0.079625,0.078848,0.078158,0.071589,0.063381,0.058954,0.055393,0.058849,0.059367,0.052247,0.052488,0.055323,0.057859,0.062096,0.058814,0.054147,0.057023,0.056797,0.051673,0.051011,0.055405,0.056856,0.055815
0.097638,0.116418,0.13965,0.135363,0.11229,0.101089,0.101028,0.098229,0.087631,0.076208,0.072398,0.070496,0.075046,0.073858,0.064368,0.065639,0.069435,0.071072,0.076798,0.074226,0.067211,0.069947,0.069849,0.064451,0.064485,0.069573,0.071314,0.069107
0.133621,0.160449,0.183631,0.171995,0.147212,0.138114,0.139563,0.132946,0.115595,0.098064,0.094867,0.096688,0.103188,0.098591,0.085498,0.088224,0.094033,0.094667,0.102742,0.101881,0.090801,0.093015,0.092911,0.086552,0.087627,0.094782,0.09738,0.091659
0.163391,0.196139,0.211914,0.187551,0.16701,0.164201,0.165824,0.157444,0.137557,0.116245,0.111377,0.115837,0.124563,0.116812,0.101854,0.105407,0.112771,0.114516,0.123593,0.123024,0.109742,0.111643,0.110612,0.102431,0.104564,0.114696,0.118399,0.108316
0.184288,0.221986,0.230821,0.19156,0.175805,0.177012,0.174171,0.167101,0.150694,0.131517,0.123086,0.124055,0.131243,0.121868,0.10964,0.113985,0.11938,0.123969,0.132075,0.13024,0.119903,0.121626,0.118351,0.107051,0.109413,0.122287,0.126606,0.114847
0.215443,0.267697,0.290072,0.237791,0.209553,0.213092,0.211992,0.202387,0.184182,0.166482,0.151413,0.139075,0.140038,0.134317,0.128149,0.130804,0.131129,0.140671,0.14444,0.137904,0.13369,0.134598,0.128118,0.115552,0.119785,0.134234,0.13926,0.132938
0.294817,0.366372,0.423042,0.368581,0.313202,0.322439,0.333734,0.312541,0.280503,0.252401,0.226337,0.203962,0.20588,0.205292,0.199296,0.197036,0.195436,0.216985,0.213109,0.189419,0.186304,0.193593,0.182359,0.163678,0.176999,0.196255,0.203906,0.214098
0.453381,0.526863,0.648968,0.622639,0.525835,0.543481,0.576575,0.530361,0.470756,0.414534,0.364106,0.340866,0.362638,0.368516,0.347908,0.336492,0.340646,0.392553,0.383537,0.320852,0.308232,0.326936,0.301785,0.266111,0.30848,0.34515,0.346842,0.383555
0.716711,0.774751,1.01539,1.042278,0.871781,0.912046,1.000523,0.91745,0.800263,0.683537,0.584906,0.568305,0.625253,0.635648,0.588349,0.560282,0.573835,0.687712,0.679045,0.545212,0.509241,0.542367,0.494171,0.429189,0.525236,0.597637,0.582677,0.660754
1.090395,1.133015,1.529217,1.603231,1.324907,1.417975,1.616878,1.482922,1.266108,1.05602,0.891618,0.884203,0.971369,0.975207,0.89587,0.844707,0.870277,1.090104,1.094717,0.852422,0.774181,0.820102,0.739577,0.634843,0.81427,0.950598,0.909882,1.029917
1.463166,1.480781,2.007139,2.111426,1.726572,1.883036,2.237814,2.061215,1.725547,1.429587,1.218849,1.208812,1.280374,1.265969,1.170319,1.090742,1.127234,1.479386,1.510509,1.150294,1.025324,1.073692,0.955394,0.817188,1.091194,1.310386,1.24475,1.378296
1.597699,1.571748,2.115081,2.235628,1.821387,2.007026,2.483989,2.308289,1.906689,1.591541,1.38959,1.364933,1.359604,1.316351,1.239018,1.146539,1.193221,1.63355,1.691591,1.280085,1.134638,1.159585,1.014215,0.878712,1.204975,1.485085,1.412466,1.498743
1.360436,1.309393,1.710406,1.808105,1.488442,1.63525,2.077376,1.971308,1.650213,1.401955,1.24904,1.210079,1.112392,1.041154,1.012562,0.955483,1.010547,1.405425,1.474315,1.14912,1.027859,0.999021,0.864962,0.796424,1.073402,1.317234,1.263638,1.26783
0.994809,1.007068,1.175256,1.189153,1.051151,1.117494,1.298059,1.260933,1.118573,0.963173,0.8832,0.873654,0.764804,0.681146,0.693675,0.693613,0.722563,0.937494,0.977907,0.822961,0.763988,0.707594,0.632364,0.629504,0.766134,0.901432,0.913868,0.887816
1.054684,1.194732,1.172834,1.080061,1.051794,1.031036,0.88263,0.855416,0.847955,0.693486,0.649428,0.731685,0.774546,0.710355,0.708759,0.71024,0.671229,0.688646,0.64773,0.635631,0.656949,0.600962,0.583326,0.60007,0.597489,0.644133,0.750367,0.775222
1.548122,1.835693,1.768183,1.563426,1.484991,1.437181,1.137721,1.120745,1.174779,0.900667,0.81614,0.948767,1.101314,1.080498,1.020717,0.979126,0.925428,0.872633,0.781741,0.813177,0.838595,0.733517,0.753906,0.814138,0.764936,0.788902,0.970947,1.044923
2.094444,2.496951,2.427383,2.184743,2.123546,2.043247,1.579168,1.576582,1.679705,1.246283,1.06548,1.189563,1.481645,1.583838,1.396496,1.290072,1.275602,1.200663,1.102468,1.121655,1.117474,0.984677,1.047988,1.160237,1.090364,1.077198,1.298468,1.402694
2.471198,2.849474,2.902324,2.880326,2.862011,2.687702,2.03983,1.939117,2.05568,1.510974,1.221878,1.281558,1.74085,2.058106,1.69961,1.529733,1.586252,1.484491,1.443145,1.494779,1.521328,1.343363,1.361667,1.505756,1.464712,1.393707,1.544801,1.63581
2.599616,2.809971,3.274689,3.791675,3.607417,3.18691,2.404292,2.026886,2.107279,1.632382,1.324439,1.303939,1.925272,2.502286,1.920638,1.672714,1.80473,1.69163,1.748404,1.870193,2.001025,1.760148,1.620174,1.73207,1.770408,1.652543,1.630025,1.69847
2.619039,2.764268,3.655962,4.646172,4.158867,3.5062,2.656625,1.844559,1.80821,1.584171,1.431869,1.476957,2.230552,2.913165,2.063372,1.691355,1.943962,1.92635,2.013923,2.095866,2.338385,2.103629,1.798669,1.868113,1.992023,1.820082,1.579827,1.653558
2.431061,2.647318,3.760909,4.747336,3.950337,3.311429,2.629158,1.635923,1.548953,1.516687,1.475068,1.561148,2.267417,2.871365,1.954626,1.49735,1.85441,2.033216,2.073727,1.984775,2.256447,2.151892,1.832019,1.901949,2.054475,1.808984,1.467168,1.602635
1.992686,2.157897,3.123747,3.697956,2.863766,2.512793,2.161226,1.435276,1.423006,1.439321,1.396644,1.386418,1.789621,2.170762,1.568812,1.240625,1.552039,1.793697,1.736096,1.489313,1.706376,1.77405,1.530256,1.597678,1.769836,1.502168,1.169231,1.393319
1.381286,1.483989,1.986317,2.111709,1.636187,1.618189,1.49215,1.170222,1.209361,1.230714,1.202727,1.0899,1.120503,1.238234,1.100011,1.043674,1.22767,1.339078,1.177251,0.939315,1.107265,1.241795,1.084498,1.091713,1.203848,1.064097,0.890771,1.06277
0.989727,1.069568,1.263907,1.265075,1.020348,1.072785,1.188718,1.128902,1.086411,1.100289,1.059865,0.927931,0.776838,0.71526,0.800729,0.933299,1.062425,1.069974,0.863755,0.715036,0.904498,0.984256,0.828187,0.774978,0.818902,0.908192,0.911488,0.838169
0.942943,0.949713,1.240762,1.319901,0.978891,0.879319,1.17944,1.272294,1.190627,1.161716,1.038661,0.913934,0.746086,0.654462,0.746914,0.99296,1.197437,1.131298,0.835578,0.654083,0.960933,1.178089,0.949109,0.787372,0.878727,1.151128,1.193934,0.905168
1.077339,0.916073,1.367195,1.584822,1.104084,0.850427,1.207056,1.379193,1.240016,1.098011,0.927702,0.832195,0.718395,0.720433,0.837227,1.2367,1.563865,1.299328,0.834923,0.660439,1.067852,1.45925,1.244426,1.013875,1.068173,1.411752,1.53655,1.10539
1.221573,1.002208,1.534142,1.739611,1.208484,0.966648,1.195143,1.27791,1.08443,0.857848,0.69821,0.656337,0.652998,0.803945,0.99803,1.543758,1.936033,1.440039,0.832486,0.69257,1.122979,1.623617,1.497744,1.252434,1.174215,1.485364,1.80853,1.346093
1.187995,1.092236,1.61866,1.658704,1.167031,1.022532,1.045285,1.007562,0.864276,0.647672,0.502022,0.488606,0.584869,0.816912,1.0479,1.613927,1.952668,1.325333,0.730975,0.700115,1.115329,1.55834,1.482734,1.287589,1.094602,1.285073,1.795543,1.419623
1.037269,1.188694,1.59513,1.401663,0.977857,0.9045,0.830004,0.706411,0.645086,0.535363,0.415831,0.398873,0.517169,0.727149,0.91777,1.31432,1.48534,0.9491,0.56957,0.679709,0.974693,1.195769,1.15392,1.050701,0.849259,0.907713,1.418364,1.192861
1.0103,1.349062,1.500727,1.098744,0.711891,0.638219,0.577423,0.450668,0.441921,0.452508,0.388198,0.330849,0.413051,0.57997,0.703286,0.832981,0.825209,0.541183,0.394772,0.574493,0.755341,0.793705,0.803662,0.761008,0.563097,0.548389,0.871442,0.782707
1.095089,1.473417,1.396805,0.876755,0.52018,0.426771,0.39124,0.335879,0.33511,0.360015,0.351446,0.298064,0.364401,0.48439,0.509287,0.473355,0.40812,0.355934,0.364656,0.507665,0.627683,0.570248,0.591911,0.615319,0.416511,0.379058,0.490891,0.429659
1.227283,1.451233,1.147759,0.664357,0.421105,0.328834,0.311146,0.297028,0.255156,0.273579,0.310955,0.314604,0.364004,0.425639,0.391188,0.341276,0.32746,0.328403,0.38106,0.455561,0.501907,0.458869,0.469667,0.515061,0.373671,0.311497,0.307082,0.267012
1.421603,1.601648,1.013036,0.531849,0.3889,0.299133,0.267353,0.268486,0.214139,0.235475,0.319001,0.380293,0.384102,0.367413,0.316715,0.279011,0.299857,0.293717,0.335334,0.343779,0.323479,0.341852,0.375927,0.394324,0.298743,0.267147,0.278452,0.24331
1.577672,1.912465,1.133305,0.503186,0.403483,0.301766,0.231179,0.241819,0.228255,0.24795,0.360198,0.434608,0.381574,0.309627,0.259274,0.247796,0.265633,0.238678,0.248574,0.24883,0.222028,0.265046,0.294577,0.29524,0.242543,0.267368,0.295394,0.223247
1.467408,2.065414,1.331823,0.506057,0.372549,0.277538,0.19766,0.196896,0.219751,0.23795,0.348805,0.407839,0.314015,0.222118,0.178398,0.179073,0.197431,0.175219,0.174413,0.214095,0.211766,0.205697,0.212947,0.22383,0.222966,0.300574,0.308525,0.187053
1.078802,1.894672,1.430415,0.472217,0.2775,0.205442,0.17598,0.170816,0.18709,0.223243,0.289381,0.301673,0.217473,0.15299,0.12226,0.106695,0.121602,0.138495,0.172331,0.254328,0.256149,0.175166,0.154294,0.175106,0.214264,0.318953,0.288266,0.183853
0.641701,1.479208,1.406668,0.474236,0.180791,0.131485,0.154633,0.173165,0.171161,0.211565,0.238539,0.191595,0.168981,0.158143,0.12709,0.074639,0.071156,0.121687,0.174247,0.289258,0.312381,0.191444,0.123926,0.133939,0.201567,0.303022,0.232001,0.172466
0.334641,1.021586,1.256933,0.540776,0.179626,0.124784,0.144535,0.182239,0.188559,0.214295,0.216232,0.129338,0.149467,0.179002,0.142381,0.068267,0.046285,0.10445,0.163758,0.281974,0.322357,0.195893,0.098242,0.117654,0.184966,0.271779,0.207229,0.15957
0.215756,0.666429,1.029154,0.614599,0.217185,0.134451,0.140232,0.190422,0.188159,0.189248,0.185359,0.1149,0.151658,0.187647,0.145655,0.069278,0.03668,0.091223,0.161022,0.236075,0.269708,0.180638,0.090509,0.102781,0.145343,0.234025,0.219105,0.161801
0.151387,0.398486,0.779238,0.626126,0.229515,0.123007,0.143925,0.201116,0.156408,0.136079,0.141732,0.106706,0.145873,0.164402,0.12548,0.067285,0.033345,0.07648,0.147283,0.178982,0.186751,0.14675,0.09871,0.086582,0.114496,0.200752,0.208292,0.14608
