0.066233,0.064272,0.065017,0.062074,0.060711,0.118576,0.308127,0.431845,0.383418,0.30211,0.221174,0.157615,0.115456,0.088496,0.076177,0.08215,0.081694,0.067838,0.066871,0.073976,0.076921,0.072519,0.068391,0.066338,0.062256,0.064298,0.064875,0.066185
0.082646,0.07954,0.078807,0.076117,0.076234,0.145078,0.373868,0.53683,0.489475,0.386336,0.278014,0.19257,0.14147,0.111039,0.099673,0.108818,0.105449,0.086694,0.083612,0.092683,0.09826,0.091665,0.084963,0.083018,0.078122,0.079042,0.079211,0.081801
0.11607,0.110966,0.107039,0.106281,0.10846,0.198436,0.50248,0.733414,0.68531,0.544153,0.385018,0.259737,0.192143,0.155509,0.149782,0.166021,0.155611,0.127431,0.118656,0.13169,0.143895,0.132108,0.119807,0.118479,0.110477,0.105953,0.105759,0.113217
0.160751,0.154117,0.146954,0.148658,0.149684,0.274788,0.675741,0.961762,0.902481,0.719775,0.501057,0.343142,0.25742,0.210349,0.214676,0.23824,0.222362,0.187112,0.167917,0.182875,0.203644,0.186368,0.166663,0.165902,0.150903,0.133952,0.134999,0.154874
0.222085,0.218313,0.208563,0.204909,0.198972,0.381686,0.90746,1.243621,1.167203,0.927861,0.634128,0.454395,0.350137,0.282617,0.287339,0.314082,0.307671,0.276322,0.240705,0.244034,0.267272,0.255962,0.231454,0.226712,0.20516,0.175124,0.177009,0.208997
0.316742,0.318575,0.307893,0.287414,0.266615,0.531317,1.238757,1.648016,1.508593,1.173396,0.795134,0.591319,0.471159,0.37433,0.358181,0.386213,0.419861,0.420056,0.373718,0.341209,0.339404,0.351191,0.329703,0.31551,0.300788,0.268435,0.274512,0.309531
0.481788,0.486832,0.48263,0.441995,0.392124,0.748829,1.692604,2.211674,1.92291,1.431597,0.99366,0.776016,0.644099,0.51316,0.460663,0.500809,0.60694,0.6548,0.60851,0.529255,0.472743,0.521843,0.520636,0.498042,0.503736,0.47384,0.490736,0.532326
0.748175,0.747877,0.762349,0.708482,0.613259,1.072162,2.272928,2.855521,2.298818,1.634961,1.225685,1.042481,0.912591,0.743906,0.639474,0.695604,0.896816,0.990467,0.951672,0.856485,0.748209,0.836906,0.862308,0.84203,0.869415,0.834582,0.865964,0.918295
1.112703,1.093993,1.140313,1.073089,0.912122,1.456211,2.826777,3.335268,2.486798,1.793187,1.536667,1.416414,1.295735,1.064921,0.890752,0.96514,1.292127,1.438978,1.423247,1.362471,1.179153,1.272167,1.338841,1.337126,1.370897,1.337573,1.394031,1.429824
1.549828,1.48472,1.562645,1.480025,1.223807,1.799945,3.22721,3.526559,2.462637,2.01566,2.030146,1.915425,1.786033,1.474929,1.190248,1.263834,1.772938,2.016785,2.044446,2.045701,1.709598,1.728767,1.865235,1.909129,1.911106,1.901849,1.991348,1.922707
1.931423,1.780984,1.892814,1.808839,1.422924,1.969635,3.485623,3.667061,2.430056,2.298071,2.543937,2.326696,2.231191,1.878974,1.45766,1.517925,2.216985,2.560212,2.633809,2.72138,2.211693,2.102182,2.311395,2.408422,2.329447,2.370231,2.502604,2.213906
2.014603,1.772338,1.893538,1.82606,1.363942,1.804766,3.277693,3.464974,2.257617,2.348571,2.669221,2.339845,2.330017,1.999028,1.506191,1.573128,2.331327,2.693375,2.816581,2.988009,2.428231,2.20352,2.419357,2.577021,2.401221,2.46418,2.659959,2.217675
1.651646,1.387937,1.473082,1.413483,1.040661,1.336903,2.436785,2.632325,1.785995,1.958958,2.187803,1.874071,1.919623,1.629921,1.200868,1.299796,1.907581,2.192717,2.348491,2.552695,2.129443,1.84307,1.980238,2.181236,1.998487,2.03572,2.22572,1.83208
1.008463,0.856185,0.897268,0.840433,0.674325,0.829391,1.388401,1.534881,1.155152,1.2721,1.3447,1.145868,1.173296,0.975631,0.73278,0.832473,1.152113,1.308528,1.438252,1.584117,1.3916,1.168969,1.219344,1.38297,1.272923,1.276705,1.402011,1.211333
0.626014,0.59278,0.58414,0.591608,0.596914,0.627214,0.822571,0.917327,0.791097,0.795574,0.795593,0.729623,0.688281,0.589771,0.530079,0.556169,0.625529,0.684888,0.740201,0.774644,0.745465,0.668345,0.652325,0.718374,0.767037,0.845926,0.928146,0.870098
0.824553,0.814851,0.809591,0.859267,0.881468,0.831724,0.838099,0.854488,0.857325,0.89762,0.929736,0.950667,0.853511,0.742499,0.751502,0.763703,0.771936,0.792375,0.8024,0.748182,0.713315,0.717792,0.692506,0.700528,0.887907,1.132567,1.239911,1.171266
1.203296,1.179613,1.240597,1.317817,1.32588,1.232978,1.108083,1.037142,1.107047,1.231307,1.335162,1.403719,1.251339,1.102842,1.145018,1.177969,1.204471,1.220873,1.210539,1.120807,1.044339,1.054368,1.039981,1.002176,1.26717,1.638044,1.739882,1.676996
1.621583,1.642871,1.817399,1.845793,1.799647,1.738203,1.541634,1.34298,1.375619,1.582122,1.808688,1.918431,1.732735,1.576176,1.620952,1.639141,1.684144,1.718435,1.692484,1.557552,1.429183,1.488705,1.534364,1.380085,1.633108,2.052313,2.084456,2.138391
2.098854,2.285367,2.509489,2.305623,2.184655,2.279792,2.053328,1.727515,1.675945,1.943554,2.348667,2.510093,2.319409,2.159716,2.157673,2.047583,2.015585,2.091061,2.073903,1.931693,1.814475,2.02738,2.208563,1.852527,1.941952,2.253428,2.133574,2.444812
2.601539,2.944061,3.016595,2.498269,2.363862,2.744554,2.61466,2.198557,2.070724,2.344089,2.853825,3.071809,2.900155,2.715348,2.721401,2.451396,2.129577,2.160841,2.255857,2.254518,2.280933,2.753105,3.04252,2.388963,2.153529,2.281706,2.08642,2.638843
2.848574,3.221779,2.984639,2.323093,2.327173,2.984094,3.007116,2.478611,2.218864,2.476683,3.065208,3.377977,3.227987,2.953347,3.085801,2.813127,2.111766,2.009313,2.246297,2.40507,2.654801,3.389232,3.672212,2.743406,2.133359,2.167814,2.171876,2.862477
2.523886,2.864999,2.456657,1.873291,2.073595,2.805983,2.90048,2.348396,1.924329,2.145235,2.719896,3.119474,3.075814,2.709077,2.982803,2.935132,2.210592,1.96963,2.015773,2.118162,2.539664,3.37533,3.58606,2.691376,1.872603,1.811736,2.107814,2.756234
1.792383,2.091473,1.818077,1.471072,1.717501,2.175314,2.188977,1.803856,1.416169,1.578725,2.006856,2.395579,2.434885,2.092205,2.406819,2.597177,2.126574,1.761394,1.543364,1.546487,1.907661,2.524729,2.69006,2.245012,1.573714,1.372145,1.81871,2.289369
1.291015,1.416664,1.368583,1.328803,1.572294,1.630808,1.423024,1.282271,1.095882,1.180759,1.46439,1.720778,1.682831,1.478709,1.748166,2.021862,1.798589,1.385851,1.191503,1.188619,1.22395,1.425701,1.603704,1.756581,1.449403,1.14575,1.569177,1.844009
1.279328,1.380148,1.276313,1.350972,1.84201,1.73956,1.246561,1.1998,1.170926,1.169783,1.454748,1.66972,1.481568,1.308036,1.474516,1.804235,1.713715,1.283023,1.242919,1.261787,0.982022,0.954723,1.174033,1.505685,1.416452,1.250077,1.60547,1.707291
1.608527,1.847524,1.619594,1.600458,2.260526,2.096775,1.510816,1.51806,1.446578,1.456183,1.844904,2.092647,1.817983,1.452866,1.459153,2.055633,2.18295,1.63737,1.544338,1.48815,1.065336,1.064723,1.394426,1.720114,1.663528,1.58722,1.894862,1.938169
1.85015,2.195753,1.874072,1.816347,2.445309,2.196115,1.739562,1.829072,1.65477,1.705558,2.137988,2.375325,2.121606,1.564095,1.492435,2.449777,2.770091,2.058304,1.764166,1.588355,1.176695,1.307215,1.798938,2.099398,2.004772,1.89945,2.173722,2.320337
1.764062,2.08613,1.747034,1.705843,2.121539,1.892685,1.734888,1.916388,1.714238,1.740972,2.029226,2.230732,2.101362,1.46815,1.36625,2.524275,2.974442,2.169016,1.698309,1.482244,1.227182,1.52798,2.087942,2.183058,2.02802,1.972417,2.125297,2.318105
1.364549,1.537741,1.353044,1.344648,1.469519,1.370077,1.432106,1.626599,1.555456,1.526084,1.533829,1.656756,1.696228,1.289359,1.232969,2.143904,2.492278,1.783614,1.365401,1.240646,1.166519,1.539806,2.005819,1.822046,1.604523,1.731467,1.752557,1.796727
0.811971,0.961494,1.050148,1.078922,0.983825,0.919722,0.98089,1.075035,1.184075,1.191996,1.031808,1.018606,1.086617,1.006171,1.084659,1.496333,1.550389,1.157754,1.02054,1.038106,1.0205,1.253403,1.59778,1.373529,1.068961,1.230828,1.266907,1.152225
0.485622,0.624583,0.740705,0.832888,0.718869,0.619958,0.62852,0.66173,0.831673,0.850623,0.730404,0.662526,0.670099,0.729312,0.823888,0.846877,0.736812,0.697535,0.794576,0.937828,0.892662,0.854661,1.179318,1.158301,0.784817,0.850487,0.947059,0.761308
0.403384,0.421807,0.444704,0.645867,0.627521,0.500973,0.501776,0.611807,0.742688,0.599142,0.513486,0.492204,0.437023,0.462539,0.5652,0.512746,0.408611,0.506497,0.63378,0.758213,0.699159,0.577912,0.866452,0.958261,0.682058,0.653768,0.647182,0.565136
0.337194,0.254458,0.251994,0.509065,0.580878,0.440637,0.393683,0.543783,0.647429,0.428265,0.336993,0.369994,0.329673,0.337773,0.467524,0.495785,0.449826,0.54418,0.537263,0.489504,0.436097,0.429027,0.714689,0.772499,0.582629,0.519808,0.449233,0.399769
0.278771,0.191783,0.159788,0.353256,0.446242,0.343374,0.289389,0.408918,0.523499,0.377422,0.240617,0.265037,0.283456,0.34914,0.492716,0.519024,0.518002,0.609897,0.454055,0.270413,0.257273,0.310593,0.548525,0.630435,0.495732,0.501096,0.460243,0.305773
0.236044,0.182801,0.129256,0.217883,0.283178,0.248307,0.241193,0.310973,0.390278,0.360582,0.243805,0.224572,0.241788,0.365701,0.495085,0.469181,0.497532,0.609334,0.404419,0.185642,0.189976,0.207431,0.34776,0.438735,0.355602,0.46704,0.526873,0.315241
0.20417,0.169227,0.124867,0.136659,0.196632,0.232048,0.236229,0.266505,0.337069,0.346572,0.262637,0.214742,0.213919,0.338957,0.401835,0.327777,0.375714,0.523758,0.388676,0.187913,0.162212,0.154895,0.234027,0.263234,0.206021,0.401764,0.545338,0.35026
0.153642,0.149789,0.141165,0.124876,0.175976,0.210204,0.199255,0.234322,0.300838,0.290234,0.23989,0.191137,0.166407,0.254942,0.252007,0.186429,0.261229,0.400125,0.335267,0.185677,0.149348,0.151216,0.194849,0.165118,0.121034,0.331167,0.495288,0.384116
0.116711,0.126158,0.160207,0.138295,0.160774,0.165108,0.140854,0.218588,0.273135,0.207665,0.178886,0.141003,0.10278,0.147898,0.130537,0.127304,0.248752,0.307908,0.24102,0.167464,0.137834,0.131688,0.152144,0.14246,0.11903,0.260119,0.382606,0.36646
0.103948,0.116356,0.157439,0.143828,0.149569,0.141695,0.112496,0.188178,0.24296,0.167956,0.129613,0.093817,0.062588,0.069673,0.082421,0.141971,0.244466,0.214432,0.143367,0.149593,0.138192,0.105677,0.128817,0.160729,0.154979,0.212637,0.247267,0.286895
0.086272,0.094674,0.130031,0.147142,0.156449,0.150724,0.1013,0.141107,0.223241,0.172101,0.114709,0.083969,0.051691,0.042868,0.07461,0.168439,0.214995,0.131362,0.088557,0.129271,0.123857,0.09306,0.126859,0.178284,0.189765,0.168818,0.137727,0.183314
