-0.001955,-0.00247,-0.004647,-0.003038,-0.001677,-0.001078,-0.000998,-0.001469,-0.001739,-0.00395,-0.003956,-0.003511,-0.002481,-0.003827,-0.005707,-0.004876,-0.002533,-0.001882,-0.00431,-0.007523,-0.006379,-0.005684,-0.004577,-0.00309,-0.006175,-0.006645,-0.006504,-0.00344,-0.003436,-0.002829,-0.004492,-0.006656,-0.005192,-0.005201,-0.004018,-0.004401,-0.003165,-0.007078,-0.006154,-0.003724,-0.00506,-0.006705,-0.004703,-0.004274,-0.005994,-0.002642,-0.002839,-0.001087,-0.008532,-0.007141,-0.004916,-0.004504,-0.00707,-0.005933,-0.007533,-0.007758,-0.005786,-0.004726,-0.010767,-0.009237,-0.005105,-0.005617,-0.004,-0.002982,-0.005732,-0.006055,-0.006163,-0.004678,-0.005139,-0.003851,-0.007065,-0.007809,-0.008738,-0.007144,-0.006913,-0.005785,-0.003265,-0.004088,-0.003769,-0.003071,-0.006964,-0.01031,-0.00541,-0.010159,-0.006083,-0.007616,-0.008027,-0.008341,-0.004461,-0.007826,-0.011331,-0.008412,-0.005982,-0.014865,-0.011032,-0.005967,-0.00648,-0.006363,-0.006711,-0.013045,-0.004126,-0.005441,-0.005365,-0.007302,-0.005258,-0.009641,-0.00445,-0.004291,-0.004196,-0.001865,-0.007747,-0.005355,-0.007479,-0.012051,-0.007046,-0.005408,-0.005969,-0.007324,-0.003515,-0.004277,-0.006699
0.000311,0.001468,0.003063,0.001514,0.000651,-0.000362,3.6e-05,-0.000226,0.000455,0.001338,0.002429,0.001465,0.001688,0.002465,0.002371,0.002834,0.001644,0.000359,0.00135,0.003958,0.004827,0.001012,0.002237,0.001864,0.003408,0.003337,0.001114,-8.5e-05,0.000948,0.001406,0.000326,0.005186,0.002921,-0.000663,-0.002572,0.001387,0.00104,0.002784,0.001046,-0.001284,0.000566,0.00428,0.000902,0.000646,0.000201,0.001838,-0.000546,-0.003192,0.005647,0.004782,0.000857,-0.000631,0.000797,0.0016,0.005143,0.002734,0.001261,0.000697,0.007716,0.000959,-0.000644,-0.00193,-0.00031,-0.000125,0.001756,0.000592,-0.000247,-0.001025,0.003989,0.001413,0.005102,0.006375,0.0038,0.003513,0.004292,0.003275,-0.003166,-0.002754,-0.001248,-0.002412,0.003856,0.002112,0.002109,0.003219,0.001983,0.001136,-0.000186,0.002992,0.001822,0.005486,-0.000147,-0.000488,-0.001509,0.007063,0.004832,0.000552,0.001531,0.002121,0.003062,0.004633,0.00207,0.002367,0.001344,0.001524,0.00244,0.00071,0.000596,-0.002519,-0.002234,-0.002176,0.00373,-0.002754,0.002531,0.006467,0.005215,0.002931,0.002464,-0.00277,-0.000769,-0.000857,-0.001443
-9e-05,-0.001055,-0.001858,-0.000538,-0.000177,0.000126,0.000274,0.000213,-0.000244,-0.000325,-0.001833,-0.000518,-0.000331,-0.001583,-0.002102,-0.002264,-0.001512,-0.000493,-0.001086,-0.002945,-0.002665,0.000206,-0.001101,-0.000592,-0.00157,1.8e-05,-0.000296,0.000356,5.4e-05,9.7e-05,-0.00025,-0.002299,-0.002425,0.001135,0.002392,-0.000103,-0.000374,-0.001214,-0.002163,0.000968,0.00116,-0.0028,-0.002746,-0.001321,0.000308,0.000266,0.00102,-0.001033,-0.004288,-0.004492,-0.003087,-0.001481,-0.001117,-0.001922,-0.002701,-0.005431,-0.001304,-0.001066,-0.005904,-0.000914,0.001188,0.002094,-0.00117,-0.001456,-0.00019,0.001615,0.001519,0.000876,-0.002938,-0.002712,-0.00417,-0.00465,-0.004846,-0.002705,-0.003173,-0.000253,-0.002732,-0.000491,-0.001551,-0.000118,-0.00405,-0.001616,-0.005246,-0.004204,-0.003305,-0.004512,0.001628,1.3e-05,-0.000474,-0.00424,-0.005721,-0.002357,-0.002695,-0.005672,-0.004623,-0.003752,-0.004153,-0.003555,-0.001866,-0.004555,-0.003512,-0.005603,-0.005768,-0.001019,-0.001188,0.000658,-0.000476,-0.000391,0.001086,0.000876,-0.002889,-0.001337,-0.002551,-0.006451,-0.001871,-0.006612,-0.004784,-0.000606,-0.002562,-0.007556,-0.003035
0.000315,0.000865,0.000827,0.00011,0.000248,-0.00033,-0.000768,-4.8e-05,-0.000302,-0.000437,0.000983,-0.000283,0.000235,0.001095,0.001022,0.001601,0.000316,-0.000121,-0.000191,0.001843,0.001486,-0.000117,0.000382,-0.00077,-0.00035,0.000274,0.000766,0.001124,0.000456,-0.000389,0.001383,0.000715,0.001389,0.000405,-7.3e-05,0.000144,0.001462,0.001622,0.003222,0.001271,-0.001972,0.002668,0.003211,-0.00012,-0.00026,-0.000415,-0.000718,0.000881,0.001392,-0.000435,0.000939,0.002812,0.001743,0.001985,0.001315,0.003342,0.001291,0.001049,0.003057,0.001183,-0.001258,4.6e-05,-0.001427,-0.001022,-0.001071,-0.000885,0,-0.001458,0.002498,0.001819,0.002651,0.003588,0.003872,0.00291,0.001132,0.00076,0.003521,0.00575,0.003782,0.000267,0.001966,0.004655,0.003459,0.002856,0.003134,0.003697,2.3e-05,-0.000894,0.000358,0.00109,0.005757,0.00314,0.002442,0.003096,0.005467,0.002069,0.006908,0.004986,0.000778,0.003398,0.000414,0.002747,0.004747,4e-06,-0.00186,0.000483,0.000701,0.002086,0.001019,-0.000206,0.003521,0.001027,0.001376,0.003037,-0.000485,-0.00201,0.003435,0.002722,0.004032,0.004775,0.003642
-0.000681,-0.000235,-0.000339,-0.000421,-0.000627,0.000252,0.000425,-0.000195,0.000359,-0.000156,-0.000539,0.00014,-0.000696,-0.001012,-0.001518,-0.002242,-0.000532,0.000583,0.000458,-0.00122,-0.001449,-0.001037,-0.001206,-0.000169,0.001039,-0.000818,0.000443,6e-04,-0.001035,-0.000188,-0.000655,-0.000477,-0.000852,-0.001918,-0.002012,0.000169,-0.001164,-0.001822,-0.003527,-0.002174,-0.001255,-0.00098,-0.002353,-0.001803,0.000362,0.001295,-0.000147,0.000992,0.000758,0.000681,-0.000935,-0.001192,-0.001981,-0.001534,-0.002342,-0.002106,-0.002762,0.000675,-0.000546,-0.002035,0.001484,0.000398,0.000961,0.001895,0.001243,0.000466,-0.001941,0.001581,0.000347,-0.004496,0.000325,-0.002749,-0.00058,-0.000611,-0.003109,-0.000704,-0.002989,-0.004504,-0.000913,-0.000451,-0.001732,-0.002293,-0.002486,0.000506,-0.002136,8.4e-05,-0.001387,-0.000179,-0.001907,-0.001052,-0.000907,-0.001471,-3.3e-05,-0.002319,-0.004815,-0.000999,-0.003984,-0.004602,-0.000681,-0.000185,0.000449,-0.004377,-0.002675,-0.001515,0.00124,-0.004206,-0.001066,-0.002697,-0.00237,-0.000602,-0.000825,-0.001183,-0.000428,-0.001277,-0.001163,0.001272,-0.002654,-0.003075,-0.001737,-0.000245,0.00096
0.000452,-1e-06,0.000178,0.000197,0.000376,-5.6e-05,5.1e-05,0.000143,0.000142,0.000555,8.9e-05,0.000343,0.000509,0.000386,0.00119,0.00176,0.000621,0.000445,0.000234,0.001342,0.00137,0.002222,0.001018,-0.000139,-0.001078,0.001208,-0.00074,-6e-04,0.000714,0.000231,0.000693,0.00029,0.000997,0.00134,0.000964,-0.00017,6.7e-05,0.001009,0.002759,0.002194,0.001326,-0.000589,0.001973,0.001026,-0.000236,-0.002428,-0.00068,-8.7e-05,-0.000226,-0.001331,0.001718,-0.00046,5.2e-05,0.001901,-0.000379,-0.000238,0.001508,0.000493,-0.000329,0.001531,-0.000482,-0.00067,-0.001549,-0.000537,-0.000103,0.000334,0.000949,-0.001252,-0.001852,0.001433,0.000717,-0.000887,-0.001647,-0.001266,0.002618,-0.001043,0.000808,0.000341,-0.000951,-0.002083,0.001878,0.001591,0.002313,0.000574,0.003616,-0.000121,0.002144,0.000792,0.002753,-0.001746,0.001331,0.000605,-0.000563,0.001115,0.001539,0.00124,-0.000182,0.001188,0.001258,-0.001519,-0.001583,0.001515,0.003938,-0.000228,0.00091,0.003788,-0.002605,0.003087,0.000582,0.001284,-0.000201,0.000425,0.001193,0.001496,0.001261,0.001027,0.002847,0.002764,-0.001335,0.001185,-0.003386
-0.000208,-1.8e-05,-0.000249,-0.000315,-0.000436,1.9e-05,0.000204,-0.000278,-6.2e-05,-0.000478,-0.000416,-0.000439,-0.000465,-0.000172,-5e-05,-0.000557,-0.000719,-0.000722,6.6e-05,-0.000173,-0.000762,-0.000873,-0.000837,0.000433,0.000212,-0.000406,0.001145,6.8e-05,-0.000708,0.000673,-0.000846,-0.001423,-5e-06,-0.000533,0.001151,-0.001086,-3.4e-05,-0.000648,-0.00096,-0.002168,-0.001057,0.000128,-0.000451,0.000585,-0.000886,-0.000447,0.001547,0.00036,-0.001432,0.001915,-0.000571,0.000817,0.001702,-0.000413,-0.000227,0.000569,-2.5e-05,-0.000832,-0.000296,0.000524,0.000525,0.000813,0.001167,9.9e-05,-0.000498,-0.000919,-0.001,-0.000485,0.000797,0.000598,0.000302,0.000963,0.001794,-0.000152,-0.001814,-0.000174,0.000993,0.000873,-0.000399,0.001738,-0.00037,-0.001362,-0.003904,-0.00187,-0.00075,0.00122,-0.001464,-0.001965,-0.001895,0.00149,-0.000522,-0.000815,0.001637,0.000668,-0.000149,0.001087,0.0021,0.00112,0.002691,-0.000348,0.000399,0.002373,-0.002227,0.002216,-7.7e-05,-0.001292,0.000451,-0.00038,1.1e-05,0.000905,-0.001062,-0.001375,-0.002433,-0.001547,-0.00125,-0.002029,-0.000474,-0.002376,0.001655,-0.001155,0.001147
8.1e-05,-0.000162,4e-05,0.000284,0.000259,5.8e-05,8e-06,7.5e-05,-0.00026,0.000291,0.000532,0.000839,0.000569,0.000578,1.2e-05,0.000347,-0.000149,1.3e-05,0.000136,-0.000123,0.000461,-0.000154,0.000622,-0.000434,9.4e-05,-0.000251,-0.001183,-4.8e-05,-0.000598,-0.001527,-0.000335,0.001376,9.8e-05,0.000487,-0.001372,0.001639,0.000567,-0.001598,0.000258,0.000802,0.000869,0.000118,-0.000265,-0.000411,0.000337,0.000455,-0.000115,-0.000146,-0.000101,-0.001503,0.00049,0.000793,0.000465,-0.000577,0.000755,0.000723,-0.000279,-0.000266,0.000519,-0.000757,-0.000238,9.2e-05,-0.000227,0.001361,0.000253,0.000848,0.001156,0.001572,0.00113,-0.001062,-0.001902,0.000443,-0.001034,2.6e-05,0.00138,-0.000605,-0.001751,0.000725,0.002335,-0.000339,0.000407,0.000794,0.001853,0.001148,-0.001102,-0.001567,-0.001561,0.001123,0.002378,0.002281,0.000499,0.000564,-0.001237,-0.000529,0.000587,-0.000278,-0.000661,-0.001299,-0.002469,0.000654,0.002406,-0.000932,0.00205,-0.000503,-0.000265,0.000768,0.000666,0.00043,0.001133,-0.001635,-0.000793,0.001062,0.001611,0.000406,0.002884,0.002451,0.000708,0.001487,0.000544,0.002274,0.000237
-1.6e-05,2.2e-05,-9.1e-05,-0.000125,-0.00045,-8.4e-05,-6.3e-05,-0.000132,7.4e-05,0.000136,-0.000134,-0.000747,-0.000452,-0.000438,0.000352,-3.4e-05,-5.8e-05,-0.000247,-0.000403,0.000266,-0.000643,0.000366,0.000367,0.000851,0.000235,0.000318,0.000643,-0.000517,0.000467,0.000606,0.000552,-0.00034,0.000147,-0.00034,0.000713,-0.001129,-0.001053,0.000931,0.000254,-0.000582,0.000741,0.000387,-0.000227,-0.000268,-0.000988,-5e-04,-7.3e-05,-0.001398,0.000748,0.000466,-0.000249,-0.001204,-0.002236,0.000393,-0.001202,-2.8e-05,0.000164,0.001744,-0.000138,0.000668,-0.000574,-0.00022,-0.000317,-0.001291,-0.000691,-0.000319,-0.001116,-0.000786,-0.000867,8.6e-05,0.001192,0.000204,0.002642,0.000292,-0.000398,8.6e-05,0.002478,3e-05,-0.002064,5.5e-05,-0.000903,-5.4e-05,0.000315,-0.001082,-6.2e-05,0.001624,1.9e-05,-0.00127,-0.003014,-0.000231,-0.001053,-0.000381,-7.4e-05,-0.000517,0.000454,0.001899,0.00093,-0.000319,0.000991,0.00092,-0.001298,0.000431,-6.7e-05,0.001107,-0.00107,-9.1e-05,-0.000664,0.000413,-0.001762,0.000728,0.001655,-0.000329,-0.001257,-0.000355,-0.001896,-0.001031,-0.000279,-0.001337,-0.00083,-0.001079,0.002247
-4.8e-05,0.000463,0.000352,-6.4e-05,0.000481,0.000183,2.7e-05,-4e-06,-5.6e-05,-0.000384,-2.2e-05,0.00043,0.000325,0.000202,-0.000418,1.3e-05,-1.7e-05,8.5e-05,1.5e-05,-0.000402,0.000543,-0.000357,-0.000183,-0.00067,0.000312,-0.000169,-0.000341,0.000173,2.3e-05,-7.9e-05,-0.000265,-0.00046,-0.000206,-0.000577,-0.000345,0.000191,0.000739,0.000145,-0.00017,0.00073,-0.000578,-0.001519,-0.000166,-0.000115,0.00071,0.000631,0.000131,0.001536,0.000272,0.000522,-0.000166,0.000728,0.001344,8.8e-05,0.001544,0.000888,0.000273,-0.00154,0.000494,-0.000324,0.000243,-0.000769,0.000333,0.000941,0.000845,-3e-05,0.000854,-0.000376,-0.000578,0.000338,-0.002374,0.000257,-0.001141,-0.000162,-0.00048,-0.00109,-0.00042,4.7e-05,0.000571,-0.000655,-0.001177,-0.000633,-0.00083,0.000855,0.000262,-0.000565,0.001078,0.001332,0.00172,-0.00169,-0.000599,0.000441,-0.000899,3.4e-05,-0.000263,-0.002017,-0.001296,0.000142,-0.000553,-0.00031,-0.000606,-0.001612,-0.002153,-0.001624,0.001071,-0.000276,-0.000819,-0.001964,-0.000482,-0.001169,-0.00051,0.000842,-0.00042,0.000769,9.6e-05,1.1e-05,-0.002018,0.002105,-0.000187,-0.000487,-0.001817
4.6e-05,-0.000427,-0.000347,4.8e-05,-0.000243,2.7e-05,-2.4e-05,0.000146,9.9e-05,0.000191,0.000121,-0.000402,-0.000292,-0.000142,0.000187,0.000155,1e-06,-1e-04,0.000427,3.1e-05,-0.000187,0.000171,-0.000288,0.000119,-6.6e-05,0.000181,5.6e-05,0.000121,-3e-05,-0.000204,0.000197,-0.000112,-0.000297,0.000226,-0.00014,3.9e-05,-0.00026,0.000363,0.000611,-0.000568,-0.000113,0.000661,0.000263,0.000107,-0.000408,-0.00026,-0.00059,-0.000535,-0.000482,6.8e-05,0.000217,-0.001237,9.1e-05,0.000888,-0.000697,-0.000815,8.1e-05,0.000879,-0.000517,0,0.000497,0.000287,0.000345,-0.000481,0.000367,4.7e-05,-0.000514,0.000865,0.000205,-0.000399,0.000694,0.000272,-0.00025,0.000484,0.000949,0.001355,0.000575,-0.000522,0.000362,0.000142,0.000487,5e-06,0.000177,-0.001272,0.00018,-0.000195,0.000364,-0.000344,-0.000161,0.000666,0.001538,-0.000406,0.00229,0.000928,-0.000396,0.000966,0.000112,0.000301,0.000148,-0.000409,0.000269,0.000647,-0.000348,0.001247,-0.000543,-0.000191,0.00232,0.001561,0.001527,0.001042,-0.000765,-0.000966,4e-04,2.7e-05,7.5e-05,-0.000181,0.000272,-0.000571,-0.000406,0.000777,-0.000399
-1e-04,0.000242,0.00033,-3.5e-05,0.00011,-0.000164,-2e-06,-7.6e-05,-0.000137,2.4e-05,-0.00024,0.000135,0.000105,-8.7e-05,-0.00015,-0.000262,0.000192,-6e-06,-0.000118,0.000144,0.000246,0.000161,0.000629,5.3e-05,0.000305,1.3e-05,0.000292,-8.3e-05,-1e-04,-9.1e-05,6.1e-05,0.000431,0.000218,0.000154,0.000548,0.00085,-0.000236,-0.000318,-3.8e-05,0.000624,-4.1e-05,-0.000174,0.000227,0.00026,0.00091,-0.000269,-1e-04,-0.000114,0.000239,-0.000289,-0.000247,0.00063,5.1e-05,-0.000888,0.000362,0.000303,-9.7e-05,-7.4e-05,0.000133,-0.000151,0.000412,0.000321,-0.000341,-0.000115,-0.000384,3.5e-05,0.000451,-0.00039,0.000108,0.000318,0.000118,-0.000411,0.00011,-5.1e-05,-0.000595,-0.000173,0.000237,-0.000186,6.3e-05,0.000858,0.000118,0.000393,0.000247,0.000503,-0.000454,-0.001178,-0.000164,0.000412,-0.001105,-5e-04,-5.5e-05,0.000404,-0.001171,-0.000677,-6.4e-05,-0.001146,-0.000194,-0.000288,-0.000964,0.000961,0.000232,0.000757,0.000792,-0.00082,-0.000393,0.000554,-0.001407,-0.001461,0.000118,-0.000341,5e-04,0.000526,0.000309,-0.000219,0.000488,0.000368,0.000625,9.3e-05,-5e-06,-0.000199,-0.000848
3.4e-05,-0.000116,-0.000322,-1.7e-05,7.6e-05,0.000155,-2e-05,0.000148,1.2e-05,3e-06,5.3e-05,-9e-05,-0.000199,0.000164,2.5e-05,0.000187,-5.3e-05,4.9e-05,-5.2e-05,-2e-05,-6.7e-05,-0.000341,-0.000256,-0.000206,-0.000344,-0.000303,-0.000197,-0.000223,-0.000369,0.000328,0.000258,-0.000115,2.7e-05,1.8e-05,-0.000505,-0.001079,0.000215,-0.000102,0.00032,0.000124,0.000209,0.000136,-0.00069,-0.00017,-0.000521,5e-05,0.000205,0.000458,-0.000358,2.2e-05,0.000316,0.000136,-0.000263,-0.000437,-0.000115,-0.000351,-2e-04,-0.000836,0.000127,-8.4e-05,-0.000913,-0.000292,1.2e-05,-0.000193,-0.000535,-0.000174,-0.000577,-2.6e-05,-9.4e-05,-0.000153,0.000131,-0.000136,-0.000206,0.000445,0.000274,0.000156,-0.000569,0.000274,6.8e-05,-0.000832,3.5e-05,-0.000611,0.000175,0.000283,-0.000159,0.000788,0.000201,-0.000262,0.000794,0.00114,9e-06,-0.000294,1.7e-05,0.000213,-0.000225,0.000768,-0.000515,-0.000204,0.000572,-0.000495,-0.000197,-0.001238,-1.8e-05,0.00015,0.001442,0.000194,0.000819,-2.4e-05,0.00036,-0.000398,0.000154,-0.000119,0.000108,-0.000658,-0.000164,0.000198,-0.000625,-0.000812,0.000319,9.8e-05,0.000853
2.4e-05,-3.6e-05,0.000104,0.000106,-0.000214,-0.000115,-5.1e-05,-8.2e-05,-2.1e-05,2.5e-05,8.8e-05,1.5e-05,0.000329,-0.000145,0.000175,-0.000107,7.8e-05,-0.000103,-0.00015,0.000145,1.4e-05,0.000267,0.000246,-0.000101,0.000213,-6.7e-05,-5.5e-05,6.7e-05,0.000404,-0.000209,-0.00021,0.000156,-0.000136,8.4e-05,0.000312,0.000548,0.000117,0.000125,-0.000661,-0.00014,-0.000383,0.000356,0.00035,0.000133,0.000119,0.000323,-0.000282,-5e-04,-0.000138,-0.00014,-0.000475,7.5e-05,0.00032,0.000721,0.000434,5.5e-05,0.00021,0.000272,0.000315,0.000137,0.000564,0.000158,3.3e-05,0.000143,-2e-04,-0.000164,0.000342,0.000352,0.000324,0.000278,5.1e-05,-7.1e-05,-0.000223,-0.000237,-0.000193,-0.000384,0.000732,-0.000452,3.8e-05,0.000278,-0.000154,0.000416,-0.000124,-0.000356,2.8e-05,-0.000493,-8.6e-05,0.000124,-0.000254,-0.00071,-0.000404,3.9e-05,-0.000255,-6.4e-05,-5.2e-05,-0.000581,0.00017,-0.000299,-0.000115,5.1e-05,7.2e-05,0.000669,0.000133,-0.00041,-0.000789,-0.000362,-0.000521,0.000121,-0.000114,0.000275,-0.000687,0.000284,0.000138,0.001007,-0.000273,-0.000315,0.000674,0.000216,-6.3e-05,-0.000173,-0.000336
-7.8e-05,9.4e-05,1.5e-05,-0.000116,0.000182,-2.2e-05,-8e-06,5.8e-05,3.7e-05,-3.4e-05,1.3e-05,6.9e-05,-0.000207,8.3e-05,-0.000153,1.8e-05,-9.3e-05,9.1e-05,2.3e-05,-7.2e-05,-0.000117,-0.000157,-0.000318,0.000238,-8e-05,-0.000104,0.000123,2.6e-05,-0.00021,0.000236,8.1e-05,-0.000149,-4.3e-05,-0.000149,-0.00016,-0.000192,-0.000146,-0.000271,-9.5e-05,0.000104,0.000383,-9.6e-05,-6.2e-05,-0.000138,-0.000244,-2.1e-05,-1.3e-05,0.000101,0.000282,0.000123,0.000457,0.000176,-0.000298,-0.000511,-0.000131,-0.000205,2.2e-05,-0.000354,-0.000344,4.7e-05,-0.000415,9e-05,-4.5e-05,-0.000184,0.000406,0.000192,-8e-06,-0.000341,-0.000103,6.7e-05,4e-04,-1.2e-05,0.000414,-1.5e-05,-9.9e-05,-0.000105,-0.000459,-3e-06,-0.000484,-2.1e-05,8.2e-05,1e-05,0.000189,0.000256,-0.000101,0.00048,-4.4e-05,-6e-06,-0.000146,0.000398,-0.000269,0.000274,0.000108,0.000394,0.000343,0.000459,0.000328,0.000249,-0.000178,1.6e-05,-0.000512,-4.1e-05,-8.8e-05,0.000461,0.000258,0.000102,0.000136,-0.000235,-0.000255,-0.000196,0.000653,-0.000181,9.3e-05,6.9e-05,7.6e-05,0.00011,-0.000256,0.000599,-0.000183,-6.6e-05,0.000682
9.6e-05,-6.4e-05,-2.8e-05,3.3e-05,-6.3e-05,1.6e-05,-1.6e-05,-2e-05,-2e-06,-1.4e-05,-1.9e-05,-9.8e-05,6.6e-05,2e-05,3.9e-05,4.3e-05,5.4e-05,3.7e-05,4.7e-05,-3.2e-05,9.3e-05,5.3e-05,0.000221,-8.5e-05,8.9e-05,-3e-05,-0.000158,4.6e-05,5e-06,0.000208,3.6e-05,2e-05,-4e-06,0.000108,-3.2e-05,-0.000126,0.000103,9.8e-05,8.8e-05,2.4e-05,-0.000342,-6.8e-05,-8.1e-05,0.000132,0.000158,0.000221,-2e-06,-0.000216,0.000106,8.6e-05,-0.000193,-0.000226,0.000388,0.000268,-0.000294,0.000135,2.1e-05,0.000361,0.000246,-0.000122,0.000149,1.1e-05,3.1e-05,1.9e-05,-0.000171,0.000231,-1.7e-05,0.000179,-2.9e-05,-0.000399,-5.6e-05,-7.7e-05,-0.000478,-0.000237,0.00019,1.1e-05,-0.000501,-0.000308,0.000115,5.4e-05,0.000163,-8.4e-05,-0.000167,2.6e-05,0.000191,-0.00023,-0.000304,-0.00027,0.000179,-0.000362,8.1e-05,-0.000195,5.6e-05,-0.000564,-4e-05,-0.000309,-0.000357,0.000186,0.000157,0.000124,0.000445,-0.000102,0.000266,-0.000344,-0.00052,-0.000188,-0.000252,0.000379,0.000139,0.000288,0.000236,1.2e-05,3.5e-05,-0.000413,-0.000121,0.000141,0.000229,-0.000678,0.000182,-0.000117,-0.000185
-6.2e-05,6.2e-05,3.2e-05,-3.3e-05,3.6e-05,-2.1e-05,4.1e-05,-2.4e-05,-4e-06,2.2e-05,-8e-06,0.000132,2.8e-05,-3.8e-05,2.1e-05,-9.7e-05,-8.1e-05,-7.3e-05,-6.8e-05,7.5e-05,-2e-05,-3.4e-05,-6.5e-05,-2.3e-05,-4.7e-05,0.000146,0.000107,-0.000176,7.4e-05,-0.000147,-0.000113,-8e-05,2e-06,7e-06,2.3e-05,0.000137,-1.2e-05,0.000208,-0.000154,3.3e-05,7.9e-05,5e-06,0.000266,-6.9e-05,-5.7e-05,-8.3e-05,-7.1e-05,0.000109,1e-05,-0.000138,0.000124,0.000106,-0.000344,-6.2e-05,0.000302,-0.000266,-0.000144,-0.000386,-0.000138,4.1e-05,-0.000128,-0.000362,-6.1e-05,4.8e-05,7.1e-05,-5.3e-05,0.000107,-8.8e-05,0.000118,-4e-05,-6.4e-05,8.4e-05,0.00032,0.000134,-8.8e-05,0.000235,0.000161,-2.4e-05,0.000239,-9.1e-05,3.2e-05,-0.000215,-2.9e-05,3e-06,-0.000313,9.3e-05,3.5e-05,0.00023,0.000105,-0.000115,-0.000243,0.000286,0.000152,0.000188,-8.5e-05,0.000314,0.000586,-0.00011,-0.000107,-0.000138,0.000235,0.000258,-0.000146,0.000246,0.00018,0.000284,0.000624,3.6e-05,8.7e-05,4.8e-05,-0.000197,-6.3e-05,-0.000282,0.000401,0.000267,-0.000179,0.000248,0.000579,6.9e-05,6.1e-05,-9.4e-05
2.4e-05,-4e-06,-1e-06,3.1e-05,3e-06,-1e-06,0,5.2e-05,1.4e-05,-1.2e-05,-1.5e-05,-0.000111,-7.5e-05,1.1e-05,-3.5e-05,9.4e-05,6.4e-05,7e-05,2e-05,-2.7e-05,-2e-06,1.2e-05,-5e-06,5.9e-05,4.6e-05,-9.8e-05,-3.7e-05,0.000182,-7.9e-05,-2.8e-05,3.9e-05,0.000143,4.1e-05,-5.8e-05,1.2e-05,5.2e-05,-6.4e-05,-5.6e-05,0.000157,-6.6e-05,-2.6e-05,-7.1e-05,-0.000231,3.8e-05,-2e-05,-0.000207,8.8e-05,0.000146,-5e-05,4.4e-05,-0.000118,-6.4e-05,-0.000176,-0.000105,-0.000113,7.1e-05,9.1e-05,0.00048,-0.000211,-4.1e-05,0.000152,0.000243,2.2e-05,-5e-06,0.000152,-0.000116,-0.000168,8.9e-05,2.2e-05,0.000287,-0.000281,-0.000162,-6.9e-05,-2.7e-05,-2.6e-05,-5.1e-05,-0.000321,0.000234,-0.000311,0.000183,-7.7e-05,6.7e-05,0.000145,-2.6e-05,0.000278,0.000128,0.000114,-3.7e-05,-2e-04,0.000269,8.8e-05,-0.000187,-0.00035,8.5e-05,0.000107,-0.000402,-0.000338,6.6e-05,0.000257,3e-06,-0.000135,-0.000309,1.8e-05,-0.000322,-6e-06,-0.00013,-0.000264,1.1e-05,-0.000261,2.1e-05,-0.000151,-3e-06,8.3e-05,-0.000168,-0.000111,0.000135,-0.000326,-0.000472,0.000175,-0.000227,-0.000215
-3e-06,-4.6e-05,-7e-06,-3e-06,-5e-06,0,8e-06,-4.6e-05,1.1e-05,4e-06,-1.4e-05,9.8e-05,0.000101,6e-06,6.8e-05,-5.9e-05,-2.3e-05,-8.4e-05,-3.5e-05,-2e-06,2.5e-05,-1e-06,6.6e-05,-2.4e-05,-8.9e-05,3.2e-05,-4.2e-05,-0.000135,4.1e-05,5.4e-05,5e-06,-2.7e-05,-2e-05,0,4e-06,-1e-04,7.5e-05,-1.4e-05,-0.000169,9.3e-05,0.000124,9e-06,0.00018,-8e-06,1e-04,-7e-06,6.9e-05,-3.9e-05,-3.5e-05,7.3e-05,9.9e-05,3e-05,0.000198,0.000162,6.6e-05,-0.000111,6e-05,-7.3e-05,0.000183,2e-06,-0.000128,-5.6e-05,2.1e-05,-3e-06,2e-06,-9.2e-05,0.000168,-0.00012,-5.7e-05,-1e-04,0.000187,2.3e-05,-3.1e-05,0.000109,2.2e-05,2.1e-05,0.000121,-5.8e-05,0.000163,-0.000182,-9.6e-05,-8e-05,-9e-06,-9.9e-05,0.000124,-3.1e-05,5.5e-05,-2.5e-05,0.00022,4.5e-05,0.000117,4.7e-05,0.000327,-0.000102,-7e-05,0.000205,-6e-06,-9e-05,-0.000253,2.1e-05,-0.000138,3e-05,0.000117,0.000174,-0.000225,-9.5e-05,-3.9e-05,0.000227,-5.8e-05,-1e-06,-5.4e-05,9.3e-05,-9e-05,-7.5e-05,-3.7e-05,-7.3e-05,9.7e-05,9.3e-05,-7.4e-05,0.000156,0.000261
1.2e-05,3.7e-05,1.5e-05,2e-06,1e-06,8e-06,-5e-06,5.1e-05,-5e-06,-6e-06,2.7e-05,-5.8e-05,-3.3e-05,-3e-06,-5.6e-05,-3e-06,4.3e-05,4.3e-05,6.4e-05,7e-06,-2.2e-05,8e-06,-0.00013,-3e-05,-1.5e-05,8.6e-05,5.9e-05,0.000104,-8.5e-05,1.4e-05,1.7e-05,-6.9e-05,4.4e-05,-4.8e-05,2.4e-05,-2e-06,-3.3e-05,-8.7e-05,8.1e-05,-3.6e-05,2.3e-05,-8.3e-05,-1e-04,2.7e-05,-6e-06,9.7e-05,-5.2e-05,3.1e-05,-4.7e-05,-8.8e-05,-5.1e-05,-5.2e-05,5.9e-05,-0.000132,2.8e-05,6.9e-05,-4.9e-05,-2.4e-05,-4.9e-05,4e-05,0.000284,2.1e-05,2.6e-05,0.000133,-1e-04,0,-0.000173,0.00014,-7e-05,-6e-05,-0.000223,2.1e-05,0.000125,-7.4e-05,-9.6e-05,-5.2e-05,-0.000126,0.000144,-3.6e-05,0.000173,2.4e-05,4.1e-05,4.3e-05,9.7e-05,-0.00019,2.4e-05,-5.8e-05,3e-06,-2.4e-05,-0.000204,-6e-06,3.2e-05,-0.000158,6.1e-05,-3.2e-05,2.7e-05,0.000174,0.000105,0.000189,-1e-06,8.5e-05,0.000258,-0.000396,-1.6e-05,0.000174,9.9e-05,6.9e-05,-0.000223,0.000102,7.6e-05,0.000109,-8.6e-05,4.8e-05,0.000124,-8.4e-05,0.000107,-0.000216,-0.000143,0,7e-06,-5e-06
-2.5e-05,-1.8e-05,-2.9e-05,-2.2e-05,-1.3e-05,-1.2e-05,1.6e-05,-1.4e-05,-5e-06,2e-06,1.4e-05,3.6e-05,-4.1e-05,-2e-05,-7e-06,3.3e-05,-3.4e-05,-1.8e-05,-1.8e-05,-8e-06,2.9e-05,-1.9e-05,8.7e-05,7.2e-05,-3e-06,-9.6e-05,-2.7e-05,-9.4e-05,-2.3e-05,-1.1e-05,1.7e-05,-4e-06,-1e-05,3.4e-05,-3.6e-05,0.000109,-2.6e-05,0,-5.2e-05,-7.2e-05,-9.7e-05,0.000113,-1e-06,-2e-06,1.7e-05,2.9e-05,4.8e-05,2.9e-05,0,-3.7e-05,-3.6e-05,-2.6e-05,-0.000143,6.7e-05,-1.7e-05,-1.5e-05,-5.5e-05,-1e-06,-1.6e-05,-3.1e-05,-0.000219,2e-06,-2.2e-05,-0.000144,-6e-05,5.4e-05,0.000155,-0.000146,6.3e-05,-2e-06,1.7e-05,-8e-06,-8e-06,-2.8e-05,1e-04,6e-05,-0.000123,-5.8e-05,-9e-06,-8.1e-05,1.4e-05,0.00012,-8e-06,-8.8e-05,0.000146,0.000143,-1.3e-05,7e-06,-0.000115,-8.6e-05,0.000246,-0.000109,0.000174,-0.000121,5.7e-05,-8.8e-05,-0.000189,1.9e-05,-0.000173,-3.8e-05,0.000133,-0.00025,0.000147,0.000106,9e-06,-0.000112,-2.1e-05,0.000234,9.1e-05,-0.000107,-3.8e-05,7.8e-05,0.000106,-0.000142,7.9e-05,-0.000175,-1.6e-05,2.9e-05,-9.5e-05,-9e-05,3.5e-05
2.2e-05,-8e-06,0,3e-06,4.5e-05,2e-05,7e-06,4e-06,-8e-06,-3e-06,-6e-06,-1.5e-05,4.2e-05,1.5e-05,2.6e-05,-4.3e-05,2.6e-05,-1.1e-05,-2e-06,8e-06,-2.5e-05,9e-06,-0.000109,-5.5e-05,9e-06,4.1e-05,6e-06,5.7e-05,6.7e-05,-1.8e-05,-1.7e-05,3e-05,2e-06,5.7e-05,5.2e-05,-0.000165,4.7e-05,3.6e-05,-2.9e-05,8.5e-05,4.8e-05,-0.000134,3.1e-05,-5e-06,-6.5e-05,6e-05,-2e-06,1e-06,7.1e-05,7.4e-05,8e-05,1e-06,1e-04,-1.3e-05,-7e-05,2.2e-05,4.8e-05,0.000126,1.9e-05,-1.4e-05,3e-06,-6.1e-05,1.4e-05,0.000156,3e-06,2.5e-05,-8.6e-05,3.2e-05,-1.8e-05,-1.6e-05,0.000174,1.9e-05,1.4e-05,9e-06,0,-0.000106,0.000117,2.9e-05,-1.5e-05,7.4e-05,2.9e-05,-2.8e-05,0.000104,2e-06,-0.000106,-0.000217,5.6e-05,-2e-05,0.000105,0.000102,-0.000145,0.00012,-0.000285,4.3e-05,-3.6e-05,2.9e-05,0.000104,-0.000118,0.000226,-7e-06,-0.000181,9.2e-05,-5.4e-05,-4.1e-05,9.4e-05,0.000147,-9e-05,-0.000208,3.7e-05,8.2e-05,6.1e-05,-9e-05,1.9e-05,4.7e-05,4.7e-05,0.000198,0.000142,0.000149,4.8e-05,0.000153,-6e-05
-1.5e-05,3e-05,3.7e-05,6e-06,-6e-05,-1.4e-05,0,1e-06,1.2e-05,-2e-06,-1.5e-05,-3.4e-05,-1.2e-05,-1.9e-05,-3.4e-05,3.3e-05,-1.4e-05,2.6e-05,-9e-06,-1.1e-05,1.5e-05,1.3e-05,0.000122,-1e-06,-7e-06,9e-06,2.9e-05,-4.3e-05,-3.3e-05,1e-05,1e-05,3.4e-05,2e-06,-4.4e-05,1.2e-05,8.7e-05,-6e-06,-1.9e-05,7e-05,-8.2e-05,1.1e-05,9.2e-05,-4.8e-05,1.2e-05,5.1e-05,-5e-06,-3.3e-05,-6.5e-05,1.4e-05,-5.6e-05,-0.000109,-3e-06,-0.000105,1.1e-05,7.7e-05,0,2.7e-05,-0.000158,-2.5e-05,2.8e-05,-2e-06,9.8e-05,8e-06,-8.4e-05,0.00012,-1e-06,5.8e-05,5e-05,-3e-05,0.00011,-3e-06,3.3e-05,0.000106,8e-06,-5.4e-05,-1e-05,-0.000119,5.9e-05,9.4e-05,-6.5e-05,-6.2e-05,-2e-05,-0.000102,3.7e-05,6e-05,0.000134,-7.9e-05,-1e-05,-2.1e-05,8.4e-05,-4.1e-05,-9.4e-05,0.00017,5.8e-05,-7e-06,3.5e-05,-4.6e-05,9e-05,-0.000331,3.4e-05,0.000164,-5.8e-05,7.3e-05,-2.1e-05,-0.000126,-5.5e-05,0.000162,-1.4e-05,-0.00014,-0.000122,0.000126,0.00012,5.8e-05,8.3e-05,-5.3e-05,-9.3e-05,-0.000175,-0.000158,-3.5e-05,-2.1e-05,-0.000143
6e-06,-2.4e-05,-5.3e-05,7e-06,5.3e-05,1.4e-05,-4e-06,-1e-05,-5e-06,7e-06,-3e-06,3.6e-05,-2.5e-05,2.1e-05,3.7e-05,-1.3e-05,3e-06,-2.8e-05,2.9e-05,-1e-06,-2e-05,-8e-06,-8.1e-05,2.6e-05,-1.1e-05,-4e-05,-3.9e-05,2.2e-05,6e-06,7.3e-05,-2.5e-05,-3e-05,-2e-06,4e-06,-1.5e-05,1.8e-05,-2e-05,5.3e-05,-5.5e-05,3.1e-05,4.4e-05,9.6e-05,8e-06,7e-06,-7.5e-05,-9.7e-05,3.9e-05,4.9e-05,-4.3e-05,2.4e-05,8.8e-05,5.5e-05,8.9e-05,1.2e-05,3e-06,4.3e-05,-3.4e-05,7.6e-05,-1.3e-05,-2.5e-05,1.7e-05,-4.5e-05,-1.9e-05,2.6e-05,1.8e-05,-1.7e-05,-5.8e-05,-5.3e-05,5.7e-05,-9.4e-05,1.1e-05,-3.1e-05,-0.000145,9e-06,6.1e-05,-6e-06,7e-05,-4.7e-05,-0.000147,4.8e-05,2.3e-05,1.4e-05,7.9e-05,2.7e-05,-4.5e-05,-0.000155,-7.3e-05,1.2e-05,-4.1e-05,-7.1e-05,1e-06,5e-05,-3.3e-05,-6.4e-05,4.4e-05,-0.000116,-6.4e-05,-4.4e-05,0.000278,-3e-05,-0.000142,5e-06,1.7e-05,5.8e-05,4.3e-05,-3.1e-05,-0.000116,1e-05,-0.00012,0.000119,-0.000147,-9.2e-05,-3.2e-05,-0.000128,-4e-06,5e-06,0.000149,0.000131,5.9e-05,5.3e-05,-9.7e-05
-7e-06,3e-06,6.2e-05,-8e-06,-1.4e-05,4e-06,-8e-06,6e-06,1e-06,-5e-06,5e-06,-4.9e-05,5.3e-05,-1.4e-05,-1.5e-05,-5e-06,-1.8e-05,3.1e-05,1e-06,5e-06,1.7e-05,5e-06,-7e-06,-2.9e-05,-4e-06,5.2e-05,2.2e-05,3.8e-05,1e-06,-5.1e-05,0,-1e-06,-1.4e-05,-1.2e-05,5e-06,-1.9e-05,2.4e-05,1.5e-05,0.000109,1.2e-05,-6.4e-05,-9.5e-05,1.8e-05,9e-06,5e-05,2e-06,-2.9e-05,-1.4e-05,-2.4e-05,-1.5e-05,-7.3e-05,-3.1e-05,8.4e-05,-6.6e-05,-5.8e-05,4.2e-05,-4e-05,2.1e-05,3.6e-05,1e-05,-2e-06,-2e-05,-1.6e-05,-2.2e-05,-6.8e-05,-2.3e-05,2.5e-05,0,-9e-06,-6e-05,8.1e-05,-7e-06,8.1e-05,-1.3e-05,-8.8e-05,9e-05,4.6e-05,3.6e-05,0.000101,1.1e-05,3.6e-05,-1.5e-05,2.6e-05,-7e-06,-0.000118,3.2e-05,5.1e-05,-1e-05,-1e-06,1.4e-05,-0.000127,-1.6e-05,3.9e-05,7e-06,-2.7e-05,0.000116,9.1e-05,4.1e-05,-0.000206,-2.5e-05,5e-05,9.7e-05,-2.2e-05,2.1e-05,3.4e-05,9e-06,6.8e-05,-0.000117,6.5e-05,-8.2e-05,-1e-04,6.1e-05,-1.1e-05,3.5e-05,-4.2e-05,2e-05,2e-05,-0.000183,-7.1e-05,-3.4e-05,0.000121
1.3e-05,1.7e-05,-5.4e-05,-3e-06,-2e-05,-5e-06,0,-1.3e-05,-1e-06,-6e-06,7e-06,5.1e-05,-4.2e-05,1.5e-05,-1.1e-05,1.7e-05,1.5e-05,-1.3e-05,-4e-06,-1e-06,-1.4e-05,-8e-06,1.6e-05,2.1e-05,-1.9e-05,-2.8e-05,-6e-06,-7.8e-05,-4.5e-05,-1.4e-05,0,-2.5e-05,-3e-06,1.9e-05,-1.9e-05,-4.7e-05,-5e-06,-3.7e-05,-6e-06,-3.7e-05,4e-05,1.4e-05,-4.5e-05,-1e-05,-7e-06,2e-05,-3.8e-05,-2.9e-05,-1.9e-05,-2.2e-05,5.8e-05,2.2e-05,-0.000158,0.000111,3.8e-05,-3e-06,4e-05,-6.9e-05,-1.9e-05,7e-06,3.6e-05,6.1e-05,1.3e-05,0,-2e-05,-2e-06,-1e-05,2e-05,-2.3e-05,0.000103,-5.7e-05,3.1e-05,-1.7e-05,-9e-06,7.8e-05,2.8e-05,-3.1e-05,-7.6e-05,-4e-06,-2.7e-05,5e-06,-2.1e-05,-2.6e-05,6e-06,9.3e-05,4.3e-05,6.5e-05,1.5e-05,7.7e-05,-5e-05,0.000136,-1e-05,7e-06,6e-06,-1.8e-05,-1.6e-05,-1e-04,7e-06,0.000148,1.4e-05,1e-05,-0.000108,0.000103,6e-06,-0.000109,-2e-06,-5.8e-05,7.5e-05,6.8e-05,7.2e-05,8.4e-05,-6.8e-05,-3.9e-05,6.8e-05,8.4e-05,1.8e-05,-1.3e-05,0.000102,2.9e-05,3.5e-05,0.000104
-1.4e-05,-3.1e-05,3.5e-05,-4e-06,3.5e-05,4e-06,-3e-06,1.8e-05,4e-06,6e-06,6e-06,-5.2e-05,1.7e-05,-1.3e-05,1.4e-05,-1.2e-05,3e-06,-3e-06,-5e-06,-1e-06,8e-06,-2e-06,-2.4e-05,-1.9e-05,8e-06,-1.4e-05,-1.2e-05,7.4e-05,2.5e-05,3.6e-05,-1e-06,1.7e-05,-2e-06,1.9e-05,2.4e-05,9.3e-05,-1.3e-05,-3.1e-05,1.5e-05,3.1e-05,-4e-06,-3e-05,6.3e-05,9e-06,2.7e-05,2.1e-05,2.8e-05,6.7e-05,-2e-06,1e-06,-5e-05,-1.5e-05,2.7e-05,-8.8e-05,-3e-06,4.3e-05,2.1e-05,-5e-05,1.6e-05,-2.1e-05,-1.6e-05,-8e-05,-1e-05,-1.2e-05,2.5e-05,1.2e-05,-1e-06,-2.5e-05,1.4e-05,-2.6e-05,-4.5e-05,-1.5e-05,-5.2e-05,7e-06,-1.8e-05,-2.1e-05,0.000153,-1e-06,-5e-05,4.8e-05,-1e-05,1.3e-05,1.8e-05,2.4e-05,-2.9e-05,-6.3e-05,-3e-06,5e-06,-0.000118,3.5e-05,-2.5e-05,2.4e-05,-4.8e-05,1.5e-05,9e-06,1.8e-05,9.2e-05,-7.4e-05,-0.000108,1.9e-05,-3e-06,2.5e-05,-8.3e-05,-4.6e-05,8.1e-05,4.3e-05,9.7e-05,-1.3e-05,-5.7e-05,-6.6e-05,4.2e-05,6.5e-05,-6.5e-05,-4.6e-05,-1.7e-05,-4e-05,0.000105,-6.5e-05,2e-06,-3.3e-05,-4e-05
7e-06,2.4e-05,-1.5e-05,5e-06,-3.6e-05,1e-06,-1e-06,-1.5e-05,1e-06,-1e-06,-5e-06,3.9e-05,2e-06,8e-06,-1.8e-05,4e-06,-2e-06,2e-06,-1e-06,0,0,9e-06,4.9e-05,1.1e-05,1.2e-05,2.4e-05,2e-05,-7e-05,-2.6e-05,-5e-06,8e-06,1.6e-05,2e-06,-3.4e-05,-8e-06,-6.7e-05,1.3e-05,-6e-06,2e-06,-2.9e-05,-2e-05,6e-06,-2.7e-05,-1e-06,-2.5e-05,2.8e-05,-1.3e-05,-6e-05,3e-05,3.4e-05,2.4e-05,-1e-06,8.1e-05,1e-05,-1.5e-05,-5e-06,-2.5e-05,1.3e-05,2e-06,7e-06,5e-06,4.8e-05,8e-06,-2.1e-05,-2.6e-05,1.7e-05,2.4e-05,-2.1e-05,1.7e-05,-5.4e-05,-5.9e-05,2e-06,1.9e-05,1.1e-05,-2.7e-05,-7e-05,-2.3e-05,-1.4e-05,8.4e-05,-5.2e-05,-2.8e-05,-1.6e-05,2.2e-05,-4.6e-05,2.8e-05,4.5e-05,-3.8e-05,-2.6e-05,0.000103,-4e-06,1.6e-05,-3.2e-05,-1.4e-05,2e-06,-1.5e-05,-7.6e-05,1.3e-05,6.3e-05,8.4e-05,-1.5e-05,2e-06,1.7e-05,6.8e-05,1e-06,-4.8e-05,-2.9e-05,-0.000144,-1e-05,-4.1e-05,6.3e-05,7e-06,-4.6e-05,4.9e-05,-4e-06,-6e-06,1e-06,-0.000112,6.6e-05,3.2e-05,1.3e-05,3e-05
1e-06,-4e-06,1e-06,4e-06,2.1e-05,-1e-06,-2e-06,1.1e-05,-1e-06,-1e-06,-7e-06,-1.6e-05,-1.9e-05,3e-06,1.9e-05,1e-06,-2e-06,-1.4e-05,5e-06,-2e-06,0,-9e-06,-4e-05,1e-06,1.4e-05,-2.9e-05,-1.4e-05,8.6e-05,3e-06,-3.7e-05,-3e-06,1e-05,-3e-06,-6e-06,-7e-06,-5e-06,-1.1e-05,3.1e-05,-2.4e-05,2.5e-05,-8e-06,-1.5e-05,-2e-05,1.1e-05,2.3e-05,2e-06,-1.4e-05,3.2e-05,2.1e-05,-5.5e-05,4e-06,9e-06,-4.7e-05,3.4e-05,-2e-06,2.2e-05,-1e-05,4e-05,-2.3e-05,-4e-06,6e-06,-1.6e-05,9e-06,3.3e-05,-2.4e-05,1.2e-05,-3.2e-05,4.8e-05,-2.1e-05,4.4e-05,4.2e-05,1.1e-05,-3.2e-05,-9e-06,3.2e-05,6e-06,4.3e-05,-1.8e-05,-5.3e-05,4.9e-05,1.6e-05,-3e-06,2.3e-05,-7e-06,-3.8e-05,3.4e-05,6e-06,1.4e-05,-4.4e-05,5.3e-05,8.1e-05,2.8e-05,9.9e-05,-1.2e-05,1.5e-05,7.1e-05,-0.000112,-8e-06,-7e-05,2e-06,-2.8e-05,-1e-05,-3.9e-05,-1.4e-05,7.6e-05,-1.4e-05,0.00012,9e-05,3e-05,-3.7e-05,1.3e-05,1.5e-05,-8e-06,-2e-06,-2.9e-05,3.2e-05,8e-06,1e-05,-1.9e-05,-1e-05,-5.6e-05
-2e-06,-1.4e-05,4e-06,-3e-06,-2e-06,-3e-06,-1e-06,-3e-06,0,-1e-06,-2e-06,1.1e-05,2.4e-05,-6e-06,1e-06,2e-06,1e-06,1.7e-05,-8e-06,3e-06,-3e-06,1e-06,2.9e-05,4e-06,-5e-06,1.4e-05,3e-06,-9.4e-05,2.3e-05,3.5e-05,3e-06,-2.9e-05,3e-06,7e-06,-3e-06,3.7e-05,0,1.2e-05,3.6e-05,-3.8e-05,3.2e-05,2e-05,5.1e-05,-6e-06,-1.4e-05,-5.5e-05,3.2e-05,0,-3e-06,2.3e-05,-2.1e-05,-1.6e-05,1.2e-05,-4.5e-05,2.9e-05,-2.6e-05,1.6e-05,-8.3e-05,1.7e-05,-9e-06,-4e-05,4e-06,5e-06,-5.1e-05,4.3e-05,-1.5e-05,2.9e-05,-2.9e-05,-1.8e-05,-1.1e-05,-4.2e-05,-1.2e-05,-2.3e-05,-2e-06,-4.5e-05,1e-06,1.1e-05,3.5e-05,-1.1e-05,-2.2e-05,3e-06,9e-06,-4.1e-05,-4e-06,4.4e-05,-5.8e-05,4e-06,-2e-06,-7e-06,-3.9e-05,-9.6e-05,-3.6e-05,-0.000139,-8e-06,1.9e-05,-4.2e-05,0.000154,0,8.5e-05,4e-06,4.3e-05,1.9e-05,-5.3e-05,3.5e-05,-4.7e-05,-1e-05,-7.1e-05,-4.1e-05,4.6e-05,2e-05,-1.2e-05,-1.2e-05,5.7e-05,-8e-06,1.6e-05,-3.1e-05,0,-2e-05,1.4e-05,-5.5e-05,-8e-06
0,2.3e-05,2e-06,-4e-06,3e-06,2e-06,1e-06,-6e-06,1e-06,1e-06,5e-06,8e-06,-6e-06,6e-06,-1.2e-05,-2e-06,1e-06,-1.4e-05,-5e-06,1e-06,1e-06,3e-06,-2.6e-05,-1.6e-05,6e-06,1.5e-05,8e-06,6.6e-05,-2.3e-05,-9e-06,-8e-06,3e-06,6e-06,1e-05,7e-06,-5e-06,9e-06,-3e-06,-4.6e-05,3.7e-05,-1e-06,1.9e-05,-5.5e-05,3e-06,-1.1e-05,2e-06,-1.4e-05,-2.7e-05,-1.3e-05,4e-06,3.4e-05,9e-06,-1e-05,5.2e-05,-2.6e-05,9e-06,1.6e-05,0.000113,6e-06,8e-06,1.2e-05,2.7e-05,-6e-06,5e-05,4.2e-05,-1.7e-05,-4e-05,7e-06,2.5e-05,3e-06,9e-06,-1.1e-05,3.1e-05,0,5.3e-05,1.9e-05,-2.8e-05,-3e-05,9e-06,3e-05,-3e-06,2e-05,5.3e-05,-3e-06,5.9e-05,9.5e-05,-2e-05,0,3.5e-05,-4.4e-05,1.9e-05,2.5e-05,0.000116,2.5e-05,-6e-06,3e-05,-0.000103,1.1e-05,-8.7e-05,3e-06,-5.6e-05,-1.1e-05,2.4e-05,-6.2e-05,-1.5e-05,4.1e-05,4.6e-05,4.7e-05,1.8e-05,-1.6e-05,-5.7e-05,1.6e-05,1.6e-05,-1.4e-05,2.5e-05,-8e-06,-5.4e-05,3e-05,-1.7e-05,3.8e-05,1.3e-05
2e-06,-2e-05,-1.1e-05,-1e-06,-9e-06,-3e-06,2e-06,7e-06,-1e-06,1e-06,5e-06,-2e-05,-9e-06,-6e-06,8e-06,1e-06,-8e-06,6e-06,-2e-06,0,2e-06,-4e-06,1.1e-05,3e-05,-1e-06,-2.5e-05,-1.2e-05,-3.8e-05,5e-06,-1.6e-05,-2e-06,5e-06,2e-06,1.2e-05,-8e-06,-2.8e-05,-5e-06,5e-06,2.9e-05,-2e-05,-2.3e-05,-5.4e-05,4.4e-05,-1e-06,3e-06,2e-06,-2e-06,2.8e-05,-3e-06,-8e-06,-4.7e-05,-1.3e-05,-3.4e-05,-5.9e-05,-8e-06,-2.7e-05,-1.1e-05,-2.2e-05,-1.1e-05,-5e-06,-4e-06,-5.9e-05,4e-06,-1.8e-05,-1.7e-05,-8e-06,3.9e-05,-5e-06,1e-06,8e-06,7.6e-05,1.3e-05,-4.1e-05,2e-06,-2e-05,1.1e-05,3.5e-05,2.5e-05,4.6e-05,-5.2e-05,-1.1e-05,2e-06,-1.5e-05,5e-06,-7.1e-05,-5.8e-05,-1.2e-05,0,-3.8e-05,2.5e-05,-5e-05,-2.2e-05,-9.6e-05,-1.5e-05,1e-06,4e-06,-4e-06,-3.3e-05,6.9e-05,-3e-06,7.6e-05,-2.9e-05,-2.5e-05,2.5e-05,4.8e-05,-9e-06,-3.3e-05,4e-06,-6e-05,1e-05,-3e-05,5e-06,-5e-06,7e-06,-8e-06,3.7e-05,4.9e-05,-7.8e-05,1.2e-05,-3.3e-05,7.5e-05
-3e-06,5e-06,1.7e-05,3e-06,7e-06,1e-06,5e-06,-1e-05,0,-1e-06,-1e-06,3.1e-05,7e-06,4e-06,-1.1e-05,2e-06,3e-06,3e-06,5e-06,0,-2e-06,6e-06,1.8e-05,-3.2e-05,3e-06,2e-05,8e-06,2.8e-05,-1.5e-05,1.1e-05,1e-06,1.3e-05,-2e-06,-1.7e-05,4e-06,2.5e-05,-2e-06,-1.3e-05,-1.8e-05,-8e-06,-1.6e-05,5.7e-05,-2.1e-05,5e-06,5e-06,2e-05,2.3e-05,-1.5e-05,0,-1.3e-05,5.9e-05,9e-06,8.7e-05,2.6e-05,2.4e-05,0,-1.3e-05,1e-05,8e-06,-2e-06,3.1e-05,5.8e-05,-5e-06,-4e-06,-4.5e-05,9e-06,-3.1e-05,5e-06,-1.7e-05,-4.2e-05,-1.5e-05,-3e-06,3.5e-05,5e-06,-1.1e-05,1.5e-05,-4.4e-05,-7e-06,-8.8e-05,5.9e-05,1e-06,1e-06,-1.4e-05,7e-06,5.6e-05,1.1e-05,2.6e-05,4e-06,3.7e-05,4.1e-05,-3.9e-05,1e-05,9e-05,-6e-06,-6e-06,-3.6e-05,8.8e-05,2.2e-05,-2.1e-05,-1e-06,-5.2e-05,2.8e-05,2.9e-05,-4.5e-05,-4.3e-05,-7e-06,3.6e-05,-4.3e-05,-3.8e-05,3e-06,5.9e-05,-1.6e-05,6e-06,1.5e-05,-3e-06,-2e-05,-3.1e-05,6.2e-05,-1.4e-05,5e-06,-7.7e-05
2e-06,1e-05,-1.8e-05,2e-06,3e-06,-2e-06,-1e-06,7e-06,-1e-06,0,-2e-06,-3.5e-05,-8e-06,-6e-06,8e-06,-3e-06,0,-4e-06,0,-1e-06,1e-06,-2e-06,-7e-06,2e-05,6e-06,-3e-06,-2e-06,-1.3e-05,-1.5e-05,9e-06,1e-06,-3e-06,0,-8e-06,4e-06,7e-06,1.1e-05,-1.6e-05,-1.3e-05,3.3e-05,4.4e-05,-4e-06,-1.4e-05,-2e-06,3e-06,2.1e-05,-1.5e-05,9e-06,5e-06,2e-05,-5.7e-05,1e-06,-4.2e-05,1.7e-05,-1.2e-05,-3.4e-05,6e-06,-3.5e-05,4e-06,4e-06,-1.7e-05,-2.9e-05,-7e-06,2.9e-05,-5e-06,1.8e-05,3e-05,-8e-06,1.5e-05,3.2e-05,1e-06,-7e-06,9e-06,-1e-06,3e-06,-1.2e-05,1e-06,9e-06,7.6e-05,-3.5e-05,1.5e-05,-9e-06,1.5e-05,2.3e-05,-4.5e-05,2.7e-05,3.1e-05,-2e-06,-4.4e-05,-1.5e-05,7.3e-05,8e-06,-5e-05,6e-06,-9e-06,1.9e-05,-0.000113,1.1e-05,-2.8e-05,1.2e-05,-6e-06,1e-05,-4e-06,7.3e-05,2.1e-05,-9e-06,-4.6e-05,3.5e-05,5.4e-05,-1.4e-05,4.6e-05,1.4e-05,-4.9e-05,-1.4e-05,-2.6e-05,-2e-06,1.7e-05,-2.3e-05,9e-06,7e-06,-7e-06
0,-1.8e-05,1.1e-05,-1e-06,-1.7e-05,0,0,-6e-06,0,1e-06,-5e-06,2.9e-05,1e-05,6e-06,5e-06,4e-06,5e-06,1e-05,-1e-06,1e-06,-3e-06,1e-06,-3e-06,-9e-06,8e-06,-1.1e-05,-5e-06,-6e-06,1.4e-05,-7e-06,6e-06,-1.2e-05,-1e-06,1e-05,-9e-06,-2.6e-05,-5e-06,-2e-06,3e-06,-4e-05,-1.9e-05,-2.4e-05,2.3e-05,0,-3e-06,-1e-06,-2e-06,-2e-06,1.1e-05,-2.3e-05,4.2e-05,1e-06,-4.8e-05,-1.9e-05,-6e-06,-6e-06,1e-05,5.9e-05,-1.9e-05,-3e-06,1.4e-05,-6e-06,-3e-06,-2e-05,2.6e-05,3e-06,-2.5e-05,2.3e-05,6e-06,1.3e-05,1.9e-05,1e-05,-7e-06,-1e-06,-7e-06,0,-1.8e-05,2e-05,-3.6e-05,2.3e-05,1e-06,-1.4e-05,2e-06,-2e-06,1.2e-05,-5.9e-05,-2.1e-05,-4e-06,5.3e-05,-2.7e-05,-1.5e-05,-1.8e-05,1.2e-05,-3e-06,7e-06,-2e-05,7.3e-05,-1.7e-05,4.6e-05,-1e-06,2.2e-05,-1.9e-05,7e-06,-5.1e-05,-2e-05,-9e-06,3.5e-05,-4e-05,3.4e-05,7e-06,-1.8e-05,-1.4e-05,-1e-06,1.5e-05,2.6e-05,1.1e-05,3.8e-05,4.3e-05,-9e-06,2e-06,-5.7e-05
-2e-06,1.4e-05,4e-06,-3e-06,2.8e-05,2e-06,-1e-06,5e-06,0,0,1e-06,-3e-05,-1e-06,-5e-06,-6e-06,-4e-06,-5e-06,-1.2e-05,1e-06,0,3e-06,1e-06,-1e-06,6e-06,-3e-06,1.2e-05,7e-06,1.6e-05,-6e-06,-1e-06,2e-06,-5e-06,-1e-06,6e-06,7e-06,1.7e-05,-4e-06,1.5e-05,-2.7e-05,3.3e-05,-1e-06,2e-05,-1.5e-05,-1e-06,1.1e-05,-3.2e-05,1.5e-05,2e-06,-3e-06,1.6e-05,-2.6e-05,3e-06,5.2e-05,1.9e-05,1.1e-05,-1.6e-05,-5e-06,-4.8e-05,1.6e-05,2e-06,-2e-05,2.7e-05,6e-06,1.2e-05,1.1e-05,-6e-06,1.6e-05,-1.1e-05,-1.7e-05,-4.8e-05,-2.8e-05,-3e-06,2.5e-05,-3e-06,2.1e-05,-2.2e-05,-3.8e-05,-2e-05,-4e-06,-1.5e-05,-6e-06,-5e-06,-6e-06,-3e-06,2.3e-05,2.7e-05,-2.1e-05,5e-06,-5.3e-05,9e-06,4.9e-05,2.6e-05,-1e-05,9e-06,4e-06,5.1e-05,-1.6e-05,4e-06,-5.6e-05,-1.3e-05,8e-06,3e-06,2.5e-05,4.9e-05,2.3e-05,3.4e-05,-2.2e-05,-1.6e-05,-2.7e-05,-1e-05,-1.4e-05,1.8e-05,-3.3e-05,-1e-06,0,3e-06,-2.2e-05,-2.7e-05,-1e-06,-7e-06,4.4e-05
2e-06,-2e-06,-1.6e-05,0,-2.7e-05,-1e-06,2e-06,-3e-06,0,-1e-06,3e-06,2e-05,-7e-06,3e-06,3e-06,0,5e-06,9e-06,3e-06,0,-1e-06,-3e-06,5e-06,-1.6e-05,-4e-06,-9e-06,-4e-06,-2.2e-05,2e-06,-8e-06,1e-06,3e-06,0,3e-06,5e-06,2e-06,6e-06,1.6e-05,1.7e-05,-1.8e-05,-1.2e-05,-2.5e-05,4e-06,2e-06,-1e-05,-4e-06,-2.1e-05,-3e-06,-1.6e-05,-8e-06,1.6e-05,-4e-06,-1e-06,-3.4e-05,0,-5e-06,-1.3e-05,-9e-06,-3e-06,2e-06,8e-06,-3.4e-05,-1e-06,-5e-06,-1e-05,-1.4e-05,-1.2e-05,0,0,2.6e-05,-1.4e-05,-9e-06,2e-06,-1e-06,1e-06,-1.4e-05,7e-06,1.7e-05,2.4e-05,2e-06,-7e-06,8e-06,-1.3e-05,-1e-06,-8.8e-05,5e-06,1.4e-05,-4e-06,3.8e-05,6e-06,1.5e-05,-2.8e-05,2e-06,-1.1e-05,3e-06,-5e-05,-3.7e-05,0,5.9e-05,8e-06,-1.6e-05,-3e-06,-3.3e-05,-5.9e-05,-1.2e-05,-1.6e-05,2.2e-05,3.3e-05,-1.9e-05,2.3e-05,-2.5e-05,-2.1e-05,1.8e-05,-2.2e-05,5e-06,-1.6e-05,1.9e-05,-9e-06,-1e-06,3.3e-05,2e-06
-2e-06,-1e-05,2.4e-05,2e-06,1.3e-05,0,1e-06,1e-06,0,0,4e-06,-1e-05,7e-06,0,-7e-06,3e-06,-4e-06,-5e-06,2e-06,0,1e-06,0,4e-06,2.6e-05,-1e-06,-1e-06,1e-06,3e-05,4e-06,1.2e-05,-3e-06,1.4e-05,1e-06,-1.4e-05,-3e-06,-5e-06,-4e-06,-2e-06,-2.5e-05,1e-05,3.5e-05,9e-06,1.2e-05,0,3e-06,-1e-06,3e-06,2e-06,-7e-06,-1e-06,-7e-06,1e-06,-1.8e-05,3.9e-05,-1.3e-05,-6e-06,0,3.1e-05,-7e-06,-2e-06,-1.8e-05,3.4e-05,3e-06,4e-06,0,-4e-06,2e-06,0,1.5e-05,1e-05,-1.2e-05,8e-06,1e-06,2e-06,-1.7e-05,9e-06,-3.9e-05,-1.8e-05,-2e-05,7e-06,6e-06,6e-06,2.1e-05,-1.4e-05,5.5e-05,-4.8e-05,2e-06,2e-06,-1.3e-05,-5e-06,-4.8e-05,2e-05,1.1e-05,0,3e-06,2.5e-05,7.6e-05,-6e-06,-5.9e-05,9e-06,-1e-05,0,2.9e-05,7.5e-05,-1e-05,-2e-06,-2.8e-05,-6.3e-05,1.2e-05,-2.6e-05,-2.7e-05,1.7e-05,2.3e-05,1.9e-05,-1.7e-05,6e-06,-1.6e-05,-4e-06,9e-06,-5e-06,8.4e-05
2e-06,1.5e-05,-2.6e-05,1e-06,6e-06,1e-06,-1e-06,0,0,1e-06,-2e-06,-4e-06,-9e-06,-1e-06,2e-06,-5e-06,1e-06,-1e-06,0,0,-1e-06,0,-2e-06,-3.1e-05,-1e-06,1.1e-05,3e-06,-3.4e-05,-1.9e-05,2e-06,-5e-06,1e-06,1e-06,-6e-06,5e-06,-7e-06,-3e-06,-1e-05,2e-05,-6e-06,-3.6e-05,-6e-06,-1.7e-05,-2e-06,-7e-06,8e-06,1.2e-05,-1e-06,3e-06,-7e-06,-5e-06,-4e-06,1.6e-05,-2.1e-05,9e-06,4e-06,1.3e-05,-2.7e-05,1.2e-05,2e-06,2.3e-05,-2.7e-05,4e-06,-8e-06,1.5e-05,7e-06,9e-06,-5e-06,-6e-06,-2.7e-05,1.2e-05,2e-06,1.6e-05,0,2e-06,2.6e-05,1.6e-05,1e-05,-3e-06,-5e-06,4e-06,4e-06,-1.8e-05,-1e-05,-1.3e-05,6.1e-05,-1.5e-05,0,-1.2e-05,1.7e-05,1.5e-05,-1.1e-05,-1e-06,1.1e-05,-6e-06,-2.1e-05,-8.7e-05,2.1e-05,6.4e-05,-9e-06,2.6e-05,2.3e-05,-2.2e-05,-4.9e-05,1.9e-05,-9e-06,3.6e-05,5.6e-05,2.5e-05,2.5e-05,2.4e-05,-1.8e-05,2e-05,-1e-06,-5e-06,7e-06,-1.7e-05,-9e-06,-2e-06,-1e-05,-4.7e-05
-1e-06,-1.2e-05,2e-05,-1e-06,-1.6e-05,0,-1e-06,-3e-06,0,1e-06,-3e-06,1.3e-05,8e-06,2e-06,5e-06,2e-06,-5e-06,2e-06,-1e-06,0,1e-06,-1e-06,-4e-06,2.6e-05,0,-1.2e-05,-3e-06,2.7e-05,-1e-06,-2e-05,-2e-06,-8e-06,0,1e-05,-3e-06,1.8e-05,3e-06,-1e-05,9e-06,4e-06,1.6e-05,1.8e-05,1.2e-05,1e-06,7e-06,2.1e-05,-1.8e-05,-2e-06,5e-06,1.5e-05,2.4e-05,1e-06,-3.4e-05,0,6e-06,1e-05,0,-1.3e-05,-1.2e-05,-2e-06,-1.6e-05,1.1e-05,4e-06,0,-1.3e-05,9e-06,-1.5e-05,1.1e-05,-1.3e-05,2.5e-05,-1.7e-05,-8e-06,-2e-05,1e-06,3e-06,4e-06,9e-06,1e-06,1.2e-05,1.6e-05,-4e-06,4e-06,-1e-05,-4e-06,-7e-06,-4.3e-05,6e-06,-1e-06,2.8e-05,-4e-06,-4.5e-05,-1e-06,-2.6e-05,-7e-06,-4e-06,1.3e-05,6.3e-05,-1.7e-05,-7.8e-05,-2e-06,-2e-05,-2.5e-05,-1e-05,5.4e-05,-3e-06,5e-06,-4.2e-05,-2.2e-05,-5e-06,-3.2e-05,4.1e-05,1.6e-05,2e-05,-1.7e-05,1.3e-05,-1.7e-05,1e-05,2.4e-05,0,2e-05,3e-06
1e-06,1e-06,-1.1e-05,-2e-06,1.3e-05,0,-1e-06,4e-06,0,-1e-06,-2e-06,-1.9e-05,0,-3e-06,0,0,5e-06,-2e-06,0,0,-1e-06,0,-2e-06,-1.9e-05,0,3e-06,1e-06,-2e-05,-5e-06,1.3e-05,-1e-06,-9e-06,0,8e-06,-2e-06,-1.5e-05,0,-5e-06,-1.2e-05,1e-05,-3e-06,-3e-06,7e-06,-1e-06,-9e-06,-1e-06,7e-06,5e-06,5e-06,-1.7e-05,-3.6e-05,-1e-06,3.4e-05,1.4e-05,-1.1e-05,6e-06,-1.3e-05,7e-06,1e-06,-2e-06,2.4e-05,1.4e-05,-5e-06,1.4e-05,-3.1e-05,5e-06,2.2e-05,-4e-06,1.4e-05,-1.1e-05,9e-06,6e-06,1e-06,-1e-06,3e-06,4e-06,5e-06,-1.1e-05,1.4e-05,-3.2e-05,-5e-06,-4e-06,9e-06,3e-06,1.5e-05,8e-06,1.7e-05,2e-06,-3.4e-05,-2.3e-05,-6e-06,1.3e-05,6e-05,-3e-06,-1e-06,9e-06,3e-06,-7e-06,9.7e-05,4e-06,1e-05,-3e-06,1.7e-05,-7.6e-05,2e-06,1.9e-05,4.2e-05,-9e-06,-3.5e-05,4.3e-05,1.2e-05,-1.2e-05,-1.5e-05,1.5e-05,1e-06,1.2e-05,-7e-06,-1.5e-05,-1e-06,-1.6e-05,-5.2e-05
-2e-06,1.1e-05,4e-06,0,-8e-06,0,1e-06,-5e-06,0,0,2e-06,2.9e-05,-6e-06,3e-06,1e-06,-2e-06,-2e-06,6e-06,-1e-06,0,0,1e-06,-8e-06,1.6e-05,-2e-06,6e-06,1e-06,2.6e-05,-7e-06,9e-06,4e-06,7e-06,0,-2e-06,3e-06,5e-06,-3e-06,7e-06,2.3e-05,-2.7e-05,2.2e-05,-2.4e-05,-2.3e-05,1e-06,9e-06,-1.2e-05,1.1e-05,-6e-06,0,6e-06,4e-05,0,2e-05,-3.1e-05,0,1.8e-05,0,3.4e-05,7e-06,0,-1.6e-05,-3.3e-05,-2e-06,-3.5e-05,8e-06,-6e-06,-2.7e-05,5e-06,5e-06,-1.8e-05,2.2e-05,3e-06,-3e-06,-1e-06,1e-05,-1e-05,3.2e-05,1.3e-05,-5.4e-05,2.7e-05,0,-4e-06,-8e-06,8e-06,-2.4e-05,3.7e-05,-3e-06,-1e-06,3.4e-05,-3e-06,4.2e-05,-1.9e-05,-8.1e-05,2e-06,1e-06,-5e-06,-7.4e-05,1.7e-05,-0.000115,-1e-06,-6e-06,2.2e-05,-2.1e-05,6.2e-05,-1.3e-05,-1.2e-05,-4.2e-05,5.3e-05,2e-06,-4.1e-05,-1.9e-05,1.4e-05,-7e-06,5e-06,6e-06,0,2e-06,1e-05,2e-06,3e-06,4.8e-05
