5.1e-05,0.000237,0.000193,3.3e-05,3.4e-05,0.000169,0.000184,5.5e-05,5e-05,0.000219,1e-04,9e-06,0.000349,0.000256,4.1e-05,0.000141,0.000198,0.000424,8.9e-05,3.7e-05,0.000179,0.000133,1.3e-05,0.000271,6.7e-05,0.00013,8.2e-05,4e-05,0.000125,6.5e-05,0.000183,0.000118,0.000183,0.000291,2.1e-05,3.6e-05,2.4e-05,7.6e-05,5e-05,2.1e-05,0.000124,0.000101,0.00026,3.8e-05,0.000162,0.000122,0.000131,4.4e-05,2.6e-05,8.3e-05,0.00013,1e-05,0.000129,0.000332,0.000155,0.000215,8.1e-05,0.000196,0.000194,0.000116,0.000186,4.5e-05,1.6e-05,0.000112,0.000395,0.000222,0.000173,8.6e-05,0.000189,5.1e-05,8.3e-05,0.000121,0.000113,3.8e-05,0.000129,0.000237,0.000255,0.000182,7.7e-05,0.000128,0.000102,8.7e-05,6.7e-05,6e-05,0.000298,1e-04,0.000165,0.000323,9e-06,3e-05,3.5e-05,0.000207,3e-05,4.4e-05,0.000377,8.3e-05,0.000263,0.000217,4.4e-05,8e-06,7.8e-05,0.000148,5.4e-05,6.8e-05,0.000296,2.9e-05,5.5e-05,0.000295,9.3e-05,8.1e-05,8.4e-05,9e-06,7.7e-05,6.3e-05,1.2e-05,0.000127,0.000146,3.1e-05,5e-06,1.1e-05,0.000149
0.000286,0.000351,0.000416,0.000209,0.000339,5.9e-05,0.000395,0.000452,0.000284,0.000647,0.00036,6.6e-05,0.000892,0.000696,0.000362,0.000396,0.000237,0.000728,0.000336,0.000122,0.000524,0.000176,0.000299,0.000369,0.000218,0.000242,3.7e-05,0.00012,7e-04,0.000366,0.000477,0.000191,0.000362,0.000691,0.000264,0.000108,0.000145,0.000295,0.000316,0.000332,0.000315,0.000467,0.000741,0.000262,0.000247,2e-04,0.000389,0.00012,0.000136,0.00026,0.000204,0.00022,0.000197,0.000635,0.000471,0.000308,0.000195,0.000285,0.000361,0.000353,0.000322,0.000109,0.000309,0.000366,0.000768,0.00036,0.000454,0.000134,0.000296,0.000308,0.000212,0.000318,0.000289,0.000345,0.000562,0.000854,0.000825,0.000286,0.000313,0.000374,0.000206,5.8e-05,0.000172,0.000305,0.000608,0.00016,0.000336,0.000503,7.8e-05,0.000174,0.000136,0.000184,0.000151,0.000114,0.000728,0.000221,0.000474,0.000437,0.000213,0.000168,0.000229,0.000366,0.000193,0.000191,0.000815,8.8e-05,0.000169,0.000603,9.6e-05,0.000166,9.7e-05,7e-05,0.000209,7.1e-05,0.000121,0.000322,0.000342,0.00011,0.00011,0.000286,0.00028
0.000408,0.00041,0.000216,0.000162,0.000446,0.000205,0.000199,0.000622,0.000193,0.000556,0.000334,0.000533,0.000857,0.000149,0.000465,0.000948,0.000625,0.000854,0.000517,0.00043,0.000541,0.000438,0.000579,0.000685,0.000603,0.000263,0.000114,0.000319,0.000482,0.000113,0.000377,9.6e-05,0.000464,0.000797,0.000402,0.000491,0.000415,0.000343,0.000755,0.000741,0.000557,0.000451,0.000575,0.000582,0.000827,0.000116,0.000105,0.000461,0.000275,0.000212,0.000447,0.000522,0.000562,0.000387,0.000211,0.000415,0.000323,0.000213,0.000555,0.00076,0.00093,0.000333,0.000657,0.000212,0.001043,0.000519,0.000572,0.000327,0.000465,0.000156,0.000207,7e-04,9.6e-05,0.000366,0.000556,0.000987,0.000587,0.000416,0.000304,0.000222,0.000533,2.5e-05,0.000113,0.000323,0.000546,0.000319,0.000343,0.001121,0.000334,0.000374,0.00013,0.000391,0.000302,0.000384,0.000861,0.000285,0.000462,0.000661,0.000265,0.000153,0.000138,0.000436,0.000306,0.000352,0.001017,0.000543,0.00039,0.000667,0.000213,0.000383,0.000335,0.000168,0.000156,0.000439,0.000289,0.000356,3.3e-05,0.000183,0.00039,0.000575,0.000637
0.000587,0.000701,0.000136,0.000372,0.00043,0.000327,0.00034,0.001095,0.000725,0.001173,0.000438,0.000196,4e-04,0.001041,0.001213,0.000606,0.001068,0.000436,0.000613,0.000342,0.000764,0.000633,0.000274,0.000846,0.001039,0.000519,0.000171,8.6e-05,0.00054,0.000536,0.000758,0.000195,0.000661,0.000859,0.000254,0.000655,0.000676,0.000103,0.001066,0.000316,0.000627,0.000394,0.000849,0.000873,0.000705,0.000897,0.000547,0.000666,0.000553,0.000358,0.000568,0.000778,0.000492,0.001022,0.000757,3e-04,0.000388,0.000937,0.000985,0.001528,0.000364,0.000583,0.000958,0.000684,0.00131,0.001276,0.000267,7.8e-05,0.000448,0.000476,0.000569,0.000735,0.000367,0.000322,0.000615,0.001234,0.001617,0.001047,0.000667,0.000631,0.000175,0.000536,0.000507,0.000526,0.001181,5e-04,0.000841,0.001396,0.000214,0.000336,0.000321,0.000681,0.000641,0.001282,0.000668,0.00078,0.000672,0.00016,0.000422,0.00036,0.000133,4e-04,0.000474,0.000243,0.001171,0.000392,0.000498,0.000735,0.000586,0.000908,0.000834,0.000331,0.000255,0.000842,0.000429,0.000661,0.000768,0.000663,0.000471,7e-04,0.000225
0.000642,0.000954,0.000426,0.000508,0.001495,0.001269,0.000239,0.001378,0.001576,0.00285,0.00202,0.001138,0.00102,0.001282,0.001978,0.001461,0.001845,0.001311,0.001616,0.000939,0.001233,0.000831,0.000953,0.001616,0.001901,0.001388,0.000607,0.000836,0.000808,0.001482,0.000609,0.000768,0.000559,3.5e-05,0.000574,0.000465,0.000779,0.001061,0.000933,0.001508,0.000551,9.1e-05,0.000917,0.002589,0.001295,0.001058,0.001373,0.000835,0.00013,0.000146,0.000605,0.001168,0.00117,0.001183,0.001748,0.001328,0.000232,0.001375,0.001799,0.001317,0.000949,0.000758,0.001397,0.001479,0.002349,0.001832,0.002099,0.000904,0.000729,0.00108,0.000462,0.001392,0.001506,0.000407,0.000187,0.001493,0.002889,0.001854,0.001016,6.9e-05,0.000687,0.001115,0.000341,0.00085,0.001213,0.001114,0.001983,0.002438,0.001942,0.000729,0.000454,0.000334,0.000794,0.001583,0.002722,0.002294,0.001338,0.001249,0.000281,0.000804,0.001317,0.001164,0.000969,0.001011,0.001314,0.001276,0.001279,0.001169,0.000838,0.001612,0.000724,0.000733,0.000891,0.001742,0.002152,0.00221,0.001365,0.001175,0.000765,0.000786,0.001215
0.000368,0.000683,0.000745,0.00081,0.002445,0.001124,0.000741,0.000747,0.001325,0.001246,0.001458,0.000659,0.001346,0.000999,0.001269,0.001478,0.001313,0.001325,0.000141,0.000802,0.000929,0.000746,0.00014,0.000679,0.000252,0.000625,0.000894,0.000523,0.000671,0.001541,0.001471,0.000367,0.000187,0.000352,0.000713,0.000639,0.000404,0.000455,0.001172,0.001179,0.00097,0.00073,0.000214,0.001554,0.001049,0.000787,0.001269,0.000937,0.00074,0.000753,0.000429,0.000366,0.001309,0.001244,0.00019,0.000239,0.001358,0.001256,0.001314,0.000671,0.000682,0.00043,0.000741,0.000956,0.000806,0.001174,0.000866,0.000889,0.00034,0.000978,0.001034,0.001246,0.001077,0.000903,0.000333,0.001024,0.001411,0.001872,0.0012,0.001411,0.000291,0.001061,0.000922,0.000951,0.00136,0.001535,0.00169,0.000591,0.000319,0.000528,0.000337,0.001363,0.001653,0.000865,0.000895,0.000894,0.001117,0.001179,0.000547,0.000876,0.001007,0.000327,0.000312,0.000802,0.00104,0.001366,0.000699,0.001343,0.000871,0.001615,0.001111,0.000354,0.001087,0.001534,0.001027,0.000897,0.000402,0.000743,0.001457,0.000419,0.00119
0.000732,0.001089,0.000742,0.001338,0.001435,0.001091,0.000673,0.000881,0.001377,0.000164,0.000654,0.000332,0.001033,0.000408,0.001228,0.001092,0.000957,0.001161,0.001557,0.000628,0.001191,0.000275,0.000324,0.000817,0.001067,0.001505,0.000907,0.000992,0.000287,0.001587,0.000225,0.001405,0.001521,0.001356,0.000732,0.00057,0.000544,0.001282,0.001083,0.000869,0.000949,0.000707,0.000844,0.001352,0.001101,0.00041,0.001464,0.000103,0.00077,0.001313,0.000909,0.00044,0.000712,0.000635,0.000668,0.000295,0.0021,0.000271,0.000388,0.000303,0.000534,9.4e-05,0.000935,0.001377,0.000962,0.001193,0.001218,0.00035,0.000893,0.001889,0.002012,0.001513,0.000521,0.000909,0.000254,0.001004,0.000619,0.000508,0.000973,0.00101,0.000995,0.000906,0.000204,0.000606,0.001146,0.001005,0.001604,0.000571,0.000997,0.000223,0.000431,0.001523,0.000908,0.00078,0.000637,0.002063,7.4e-05,0.000935,0.000127,0.001108,0.000636,0.000597,0.000414,0.000963,0.001054,0.00104,0.001592,0.000105,0.000514,0.00069,0.000104,0.000528,0.000603,0.00075,0.001797,0.000562,0.001024,0.000417,0.001739,0.001106,0.001903
0.000782,0.00065,0.000696,0.002673,0.001519,0.001344,0.000307,0.001383,0.003183,0.000544,0.000405,0.000746,0.001727,0.002504,0.000761,0.000839,0.00171,0.002077,0.003475,0.002903,0.000947,0.000449,0.000135,0.001588,0.001433,0.00178,0.001366,0.000656,0.001402,0.001549,0.0016,0.001718,0.000673,0.001566,0.000719,0.001053,0.000796,0.001867,0.002198,0.000981,0.000357,0.001381,0.001523,0.002865,0.002789,0.001389,0.00229,0.002412,0.002224,0.000622,0.000593,0.001052,0.000491,0.000662,0.00142,0.00161,0.002557,0.001938,0.000244,0.000722,0.001759,0.001229,0.000876,0.000734,0.001945,0.001836,0.003554,0.001759,0.001879,0.002157,0.000819,0.001109,0.001302,0.002821,0.001657,7e-04,0.00084,0.000658,0.001233,0.000756,0.000795,0.000886,0.001238,0.000698,0.000656,0.00149,0.002307,0.001689,0.000359,0.001395,0.000585,0.001736,0.002901,0.002005,0.001612,0.002235,0.002105,0.000779,0.001114,0.000784,0.000284,0.001542,0.000952,0.000231,0.000578,0.000654,0.000717,0.000689,0.000207,0.001187,0.000819,0.000766,0.001582,0.001711,0.001698,0.000569,0.000457,0.000843,0.001002,0.001849,0.003185
0.00134,0.001451,0.000569,0.004162,0.003631,0.001959,0.001763,0.000811,0.004413,0.004227,0.004437,0.001196,0.002641,0.001502,0.002778,0.001756,0.002265,0.000372,0.001325,0.001185,0.001337,0.000545,0.000609,0.0014,0.002945,0.003743,0.003118,0.004317,0.004702,0.003597,0.001076,0.00163,0.001839,0.00267,0.001836,0.001108,0.001601,0.000918,0.003672,0.003221,0.00098,0.000975,0.000651,0.002159,0.000391,0.000553,0.002426,0.002925,0.002829,0.00223,0.000983,0.000907,0.000288,0.00055,0.001179,0.000448,0.000992,0.001824,0.001384,0.001418,0.002544,0.001542,0.001311,0.001255,0.001833,0.003526,0.005148,0.003684,0.000368,0.002837,0.002726,0.001777,0.001826,0.002871,0.002338,0.00231,0.001988,0.00122,0.00214,0.001953,0.000972,0.000852,0.001409,0.002624,0.001794,0.000473,0.002923,0.003027,0.001846,0.001718,0.001758,0.002099,0.002881,0.002999,0.001499,0.000832,0.000266,0.001084,0.001094,0.001138,0.002083,0.001648,0.001688,0.001809,0.000351,0.001108,0.001117,0.000382,0.001715,0.002005,0.000349,0.001851,0.001762,0.001803,0.001471,0.002043,0.001382,0.001996,0.00109,0.004276,0.003773
0.002735,0.0013,0.001831,0.003328,0.005057,0.003708,0.002394,0.001296,0.004638,0.004039,0.002224,0.002895,0.001286,0.003408,0.000885,0.002953,0.001057,0.002312,0.00254,0.000871,0.001927,0.002979,0.001794,0.001799,0.002426,0.001518,0.00134,0.002898,0.001327,0.001285,0.001665,0.000218,0.001771,0.001642,0.002037,0.001357,0.000673,0.0017,0.002389,0.0026,0.001167,0.000558,0.00077,0.001275,0.001505,0.000993,0.001543,0.001366,0.002543,0.000286,0.000412,8e-04,0.000209,0.000344,0.001547,0.000427,0.000741,0.000967,0.000866,0.001357,0.001287,0.001276,0.000834,0.000413,0.000643,0.001441,0.002231,0.001294,0.001421,0.000681,0.001767,0.000817,0.001849,0.0018,0.000626,0.000991,0.001155,0.001612,0.002351,0.000941,0.000885,0.002481,0.000602,0.002348,0.000207,0.002255,0.002638,0.001648,0.001658,0.002115,0.002295,0.000568,0.000557,0.000971,0.000761,0.001162,0.000888,0.000245,0.0011,0.002236,0.003018,0.003812,0.001353,0.001534,0.002298,0.001232,0.002206,0.002133,0.003045,0.003035,0.002352,0.002826,0.00284,5e-04,0.002861,0.004703,0.003133,0.002847,0.001572,0.004049,0.002701
0.001955,0.002837,0.002371,0.004271,0.000862,0.001576,0.002509,0.003053,0.002353,0.001177,0.003157,0.002376,0.003495,0.003299,0.004255,0.005324,0.004292,0.002636,0.003316,0.003805,0.001468,0.00379,0.004749,0.004755,0.00433,0.004579,0.004272,0.0044,0.004626,0.004154,0.004009,0.003787,0.004114,0.002624,0.002215,0.003505,0.002822,0.00274,0.003183,0.001594,0.001136,0.001676,0.000849,0.002022,0.002253,0.000482,0.001891,0.000941,0.002716,0.003398,0.002386,0.001444,0.000875,0.000591,0.001855,0.002581,0.001346,0.001389,0.000993,0.001326,0.002219,0.001453,0.001684,0.000788,0.001689,0.000569,0.002651,0.001298,0.000524,0.001724,0.000317,0.001787,0.001528,0.002416,0.001158,0.000938,0.000983,0.002027,0.002344,0.003155,0.002581,0.004648,0.003965,0.00162,0.002923,0.004742,0.005777,0.003971,0.00282,0.000951,0.001945,0.001934,0.00221,0.002941,0.003122,0.003676,0.003647,0.003544,0.003355,0.004599,0.004342,0.003244,0.002108,0.002006,0.003831,0.004783,0.004919,0.004606,0.004691,0.004258,0.003026,0.003039,0.003004,0.003437,0.002221,0.002111,0.003196,0.00357,0.002298,0.0025,0.004195
0.000617,0.001225,0.000505,0.001466,0.000951,0.000556,0.001057,0.001159,0.001101,0.000781,0.001334,0.00028,0.001429,0.001001,0.002943,0.001364,0.000568,0.001905,0.001049,0.001905,0.00256,0.002013,0.001202,0.001569,0.001268,0.001373,0.001871,0.000674,0.001094,0.001024,0.000847,0.001921,0.003041,0.002609,0.002417,0.001622,0.001969,0.001707,9e-04,0.001555,0.002192,0.002333,0.002121,0.003385,0.003316,0.002757,0.002651,0.002076,0.00136,0.001451,0.001925,0.002062,0.002067,0.001679,0.002721,0.00256,0.001878,0.002005,0.001935,0.001919,0.002336,0.001269,0.002249,0.00198,0.003117,0.002943,0.003848,0.003078,0.00289,0.002936,0.002553,0.003049,0.002026,0.001796,0.001457,0.001505,0.002452,0.00333,0.003383,0.003167,0.003109,0.002525,0.002018,0.002934,0.003043,0.001618,0.001229,0.001588,0.001456,0.00216,0.00057,0.000474,0.001641,0.002247,0.001613,0.001761,0.001077,0.0016,0.002824,0.001314,0.001118,0.001071,0.000425,0.001135,0.002164,0.001648,0.000947,0.001571,0.001139,0.000706,0.000937,0.000789,0.000995,0.001255,0.000889,0.000734,0.001358,0.000609,0.000671,0.001043,0.001717
0.000598,0.000793,0.000474,0.000954,0.000644,0.000562,0.00047,0.000848,0.000523,0.000382,0.000719,0.000591,0.00054,0.001032,0.001256,0.000824,0.000482,0.000978,0.000903,0.000914,0.000641,0.000396,0.000977,0.000582,0.000573,0.001108,0.001013,0.000484,0.000243,0.000264,0.000573,0.000605,0.001246,0.000438,0.000935,0.000767,0.000669,0.000884,0.000271,0.000547,0.000892,0.000983,0.000563,0.001621,0.000572,0.000555,0.00046,0.000248,0.000476,0.000533,0.000621,0.00061,0.000516,0.000694,0.001055,0.000519,0.000614,0.000441,0.000317,0.000686,0.000767,0.000886,0.000966,0.000689,0.001008,0.001278,0.00117,0.000757,0.000922,0.000487,0.001138,0.000887,0.000914,0.000823,0.000508,0.000827,0.001081,0.000694,0.000921,0.000647,0.00125,0.001086,0.000475,0.000642,0.000852,0.000608,0.000799,0.000596,0.000411,0.000717,0.000528,0.000247,0.001278,0.00135,0.000456,0.000887,0.000838,0.000745,0.001029,0.000674,0.00078,0.000563,0.000257,0.001007,0.000735,0.000696,0.000752,0.000703,0.000878,0.000283,0.000595,0.000234,0.000353,0.000654,0.000322,0.000891,0.00114,0.000445,0.000525,0.000656,0.00067
0.000291,0.000556,0.000384,0.000654,0.000507,0.000345,0.000586,0.000442,0.001079,0.000264,0.000502,0.000472,0.000198,0.000525,0.000615,0.000452,9.6e-05,0.000547,0.000745,0.000549,0.000206,0.000606,0.000781,0.000584,0.000423,0.000967,0.000661,0.00052,0.000132,0.000287,0.000414,0.000538,0.000414,0.000127,0.000308,0.000449,0.000319,0.000802,0.000589,0.000474,0.000709,0.000449,0.000974,0.001214,0.000648,0.000412,0.000369,0.00021,0.000184,0.000349,0.000303,0.000372,0.000523,0.000232,0.000539,0.000145,0.000781,0.000416,0.000254,1.8e-05,0.000456,0.000307,0.000596,0.00043,0.000601,0.000781,0.000658,0.000731,0.000585,0.000238,0.000655,0.000307,0.000789,0.000563,0.000855,0.000825,0.000573,0.000207,0.000685,0.000239,0.000661,0.00079,0.000245,0.000238,0.000692,0.000915,0.000805,0.000256,0.000346,0.00067,0.00023,0.000228,0.000637,0.00102,0.000519,0.000458,0.000425,0.000398,0.000866,0.00037,0.000577,0.000663,0.000247,0.000735,0.000134,0.000525,0.000596,0.000401,0.000595,0.000421,0.000636,7.8e-05,0.000383,0.000491,0.000285,0.000729,0.000248,0.000569,0.000669,0.00055,0.000465
0.000707,2.8e-05,0.000785,0.000732,0.000349,0.000457,0.000665,0.000646,0.000569,0.000386,0.000844,0.000692,0.000531,0.000729,0.001164,0.000718,0.001097,0.000137,0.000628,0.000852,0.000156,0.000412,0.000504,0.001162,0.000411,0.001273,0.000509,0.000785,0.00018,0.000409,0.000406,0.000535,0.000462,0.000103,0.000323,0.001097,0.000485,0.000651,0.000521,0.000245,0.001018,0.000152,0.000773,0.000422,0.000645,0.000581,0.000115,0.00042,0.000387,0.000269,0.000349,0.000464,0.000624,0.000115,0.000848,0.000542,0.000152,0.000298,0.000402,0.000341,0.000714,0.000499,0.001017,0.000287,0.000745,0.001203,0.000241,0.000355,0.000629,0.000211,0.000852,0.000649,0.001351,0.000935,0.000364,0.001138,0.000671,0.000262,0.000661,7.8e-05,0.000903,0.001425,0.000748,0.000457,0.001195,0.001271,0.000656,0.00036,0.000718,0.000655,0.000138,0.000196,0.000736,0.001202,0.000607,0.000515,0.000228,0.000149,0.000575,0.001249,0.000362,0.000933,0.001071,0.000705,0.000889,0.000297,0.000207,0.000614,5.9e-05,0.000589,0.000322,0.000187,0.000419,0.000419,0.000506,0.000313,0.000439,0.000813,0.000202,0.000128,0.000412
0.000925,0.001105,0.001215,0.001124,0.001038,0.000953,0.000579,0.001265,0.000714,0.000677,0.001568,0.001111,0.000668,0.000907,0.001567,0.000566,0.001095,0.001405,0.001789,0.001508,0.001683,0.00119,0.000695,0.001462,0.001075,0.001071,0.001565,0.000641,0.000802,0.001188,0.001446,0.001695,0.000683,0.000936,0.000806,0.001313,0.001458,0.000986,0.001297,0.000788,0.002089,0.001651,0.000939,0.001253,0.000622,0.000334,0.000195,0.000384,0.000673,0.001335,0.000923,9.5e-05,0.00107,0.001123,0.001033,0.000367,0.000574,3e-04,0.000427,0.000721,0.001281,0.001039,0.002309,0.001736,0.001741,0.001124,0.001346,0.00043,0.001489,0.001728,0.002283,0.001491,0.001953,0.000941,0.001153,0.001192,0.002452,0.00193,0.000834,0.000345,0.001387,0.002599,0.001943,0.00099,0.00114,0.001999,0.00257,0.001583,0.001784,0.001762,0.000865,0.000231,0.000324,0.001959,0.002203,0.001164,5.2e-05,0.000233,0.000129,0.001254,0.000987,0.001545,0.001705,0.001056,0.000104,0.00067,0.000143,0.000118,0.000144,7.9e-05,0.000603,0.000743,0.000134,0.000722,0.000777,0.001373,0.001615,0.001996,0.001829,0.000661,0.000969
0.002207,0.00109,0.001084,0.003066,0.002931,0.002149,0.001691,0.001031,0.000474,0.000275,0.001809,0.002213,0.00165,0.001293,0.001746,0.002033,0.000791,0.001925,0.001849,0.002916,0.003037,0.002058,0.001226,0.00151,0.00195,0.000547,0.000752,0.001241,0.002201,0.003025,0.001555,0.000971,0.001284,0.002426,0.002551,0.002222,0.00241,0.001598,0.000287,0.001399,0.002184,0.001865,0.00102,0.000541,0.000754,0.000838,0.001367,0.000428,0.000545,0.001133,0.001247,0.000892,0.000581,0.001194,0.002255,0.001869,0.001828,0.001151,0.001306,0.001457,0.000795,0.000339,0.001536,0.001055,0.000699,0.00171,0.002014,0.001678,0.001649,0.001606,0.000476,0.001162,0.000791,0.000796,0.001389,0.000402,0.001485,0.001776,0.001,0.00064,0.001169,0.000938,0.000197,0.000436,0.000367,0.001596,0.001855,0.001083,0.000811,0.001457,0.001105,0.000325,0.000276,0.001497,0.00086,0.000843,0.000908,0.001014,0.00109,0.00145,0.000689,0.000913,0.000761,0.000554,0.000316,0.000647,0.000373,0.000822,0.000622,0.000373,0.000846,0.000411,0.000787,0.000208,0.001149,0.001185,0.001014,0.001432,0.001407,0.00181,0.00015
0.000247,0.000434,0.000398,0.001857,0.00075,0.000797,0.000432,0.000979,0.000901,0.000586,0.000959,0.000987,0.000761,0.001404,0.00073,0.00094,0.000527,0.001268,0.001204,0.001336,0.000804,0.000328,0.001356,0.000133,0.001265,0.001038,0.000885,0.001051,0.000984,0.001099,0.000692,0.000744,0.000675,0.001751,0.001186,0.00044,0.000556,0.000356,0.000772,0.00064,0.001086,0.000713,0.000314,0.000377,0.000786,0.000803,0.001249,0.001532,0.001033,0.000606,0.000545,0.000322,0.000272,0.000882,0.000733,0.000534,0.000334,0.000684,0.001012,0.000341,0.000279,0.000147,0.001005,0.000607,0.001055,0.000155,0.000554,0.000798,0.000702,0.00075,0.000545,0.000213,0.000376,0.000261,0.000749,0.000575,0.000432,0.000845,0.000305,0.000606,0.000433,0.000274,0.000139,0.000404,0.000661,0.000643,0.00032,0.000572,0.000851,0.000701,0.000378,0.000162,0.000315,0.000814,7e-04,0.000589,0.000193,0.001142,0.000695,0.000384,0.000544,0.000367,0.000375,0.000873,0.000318,0.000683,0.000633,0.000419,0.000289,4.1e-05,0.000522,0.000207,0.000666,0.000419,0.000596,0.000159,0.000916,0.000388,0.000586,0.000475,0.000751
0.000772,0.000736,0.000855,0.000685,7.1e-05,0.000197,5.5e-05,0.000424,0.000232,0.000256,0.000494,0.000159,0.000539,0.000581,0.001221,0.000271,0.000451,0.000404,0.00068,0.000779,0.001082,0.000468,0.000676,0.000572,0.000614,0.000325,0.000622,0.000592,0.000413,0.000831,0.000873,0.000422,0.000316,0.001163,0.00053,0.000354,0.000336,0.000219,0.00035,0.000204,0.000464,0.000174,8.7e-05,7.2e-05,0.000462,0.000909,0.000293,0.000682,0.000616,0.000656,0.000215,0.000352,0.000613,0.000184,0.000178,0.000634,0.000427,0.000582,0.000148,0.000539,0.000222,0.000179,0.000173,0.00016,0.00034,0.000202,0.000299,0.000184,0.000258,0.000249,0.000211,0.000279,0.000216,6e-05,0.000162,0.000233,0.000342,0.000391,0.000516,0.000497,0.000306,0.000181,0.000166,0.000118,0.00044,0.000848,0.000587,0.000425,0.000447,0.000521,0.000228,0.000244,0.000175,0.000399,0.000405,0.000117,0.000396,0.000438,0.000158,0.000388,0.000167,0.000382,0.000366,0.000289,4.7e-05,0.00024,0.000252,0.000227,0.000424,0.000126,0.000266,0.000149,0.000381,0.000325,0.000665,0.000517,0.000667,0.000647,0.000224,0.000157,0.000431
0.000148,0.000176,0.000636,0.001195,0.000482,0.000215,0.00018,0.000199,0.000293,0.000349,0.000704,0.000266,0.000443,0.000168,0.00046,0.000312,0.000186,0.000557,0.000312,0.00046,0.00058,0.000149,7.3e-05,0.000355,0.000351,0.000141,0.000483,0.000522,0.00067,0.000611,0.000382,0.000391,0.000594,0.000719,0.000418,0.000161,0.000308,0.000188,2.4e-05,0.000239,5e-04,0.00016,0.000137,0.000174,0.000149,0.000558,0.000393,5e-04,0.000134,0.000267,0.000215,0.000242,0.000197,0.000433,0.000409,0.00034,0.000183,0.000141,0.000113,0.000108,0.00012,0.000189,0.000286,0.000311,0.000385,8.6e-05,0.000318,0.000357,0.000373,0.00022,7.9e-05,0.000358,0.000179,0.000371,0.000308,0.000219,0.000503,8.4e-05,8.8e-05,0.000272,0.000233,0.000203,9.5e-05,0.000299,0.000342,0.000599,4.4e-05,0.000331,0.000112,0.000213,0.000195,0.000306,0.000131,9.6e-05,0.000448,7.4e-05,0.000215,0.000291,9.5e-05,0.000191,0.000187,0.000229,0.000205,0.000465,9.6e-05,0.000414,0.000357,0.000164,0.000522,0.000511,0.000381,0.00023,0.000251,0.000168,0.000466,0.000398,0.000333,0.000659,0.000223,0.000282,0.00043
0.00018,0.000118,0.000406,0.000472,0.000735,0.000231,0.000299,0.000116,0.000173,0.00034,0.000249,6.1e-05,0.000366,8.7e-05,0.000531,0.000161,0.00026,0.000593,0.000645,0.000254,0.000266,0.000212,0.00054,0.000157,0.00032,0.000163,0.000538,0.000269,0.000154,0.00028,0.000502,0.000244,0.000299,0.000535,3.6e-05,0.000289,0.00017,8.1e-05,6.6e-05,0.000312,0.000242,0.000186,0.000205,0.000175,0.000183,3e-04,0.000215,0.000299,0.000304,0.000181,0.000175,0.000189,0.000106,0.00037,0.000243,0.000252,0.000155,0.000233,0.000208,0.000461,9.4e-05,0.000102,0.000195,0.000356,0.000354,0.000111,0.000257,0.000166,4.8e-05,0.00026,0.00015,0.000292,0.000224,0.00013,0.000112,0.000143,0.000354,0.00015,0.000179,0.000192,9.2e-05,7.5e-05,9.6e-05,0.000238,0.000228,0.000463,0.000402,0.000313,0.000304,0.00029,0.000181,0.000158,0.000207,0.000355,0.00033,0.000138,0.000119,0.000181,9.6e-05,0.000171,0.000167,0.00026,1.7e-05,0.000418,0.000277,0.000321,0.00034,0.000369,0.000104,0.00029,0.00018,0.000103,0.000184,9.4e-05,0.000459,6.2e-05,0.000367,0.000249,9.5e-05,0.000326,9.6e-05
0.000181,0.000107,0.000263,0.000405,0.000505,0.000195,0.000168,0.000291,4e-06,0.000311,0.000325,0.000101,0.000182,0.000165,0.000442,7.3e-05,0.000117,0.000448,0.000433,0.000363,0.00059,0.000235,0.000338,0.000218,0.000153,0.000191,0.000303,0.000335,0.000237,0.000174,0.000391,0.000257,0.00034,0.000417,0.00019,0.000219,0.000243,7.7e-05,9.8e-05,0.000259,0.000105,0.000141,7.9e-05,0.000122,0.000173,0.000265,0.000163,0.00012,0.000281,0.000306,0.000149,9.1e-05,0.000184,0.000156,0.00027,0.000119,8e-05,0.000214,0.000122,0.000223,6.2e-05,0.00015,0.000156,0.000141,0.000343,8.3e-05,7.6e-05,5.8e-05,1.5e-05,0.000154,0.000198,0.000229,8.3e-05,2e-04,0.000105,3.6e-05,0.000183,5.8e-05,0.000278,0.00035,0.000242,0.000131,0.000149,5.2e-05,0.000184,0.000249,0.000369,0.000256,0.000458,0.000285,9.5e-05,5.3e-05,0.000146,0.000231,0.000316,0.00022,4.3e-05,0.000206,0.000168,8.6e-05,0.000119,0.000169,7.2e-05,0.000267,0.000175,9e-05,0.000168,0.000225,9.3e-05,0.000175,6.2e-05,9.4e-05,0.000176,0.000104,0.000429,5.1e-05,0.000327,0.00029,0.00011,0.000335,8e-05
4.1e-05,3.4e-05,0.000108,0.00017,0.000236,4.3e-05,4.1e-05,0.000135,3.9e-05,0.00014,0.000102,4.4e-05,7.4e-05,4.6e-05,0.000204,6.5e-05,5e-06,0.00019,0.000154,0.000162,0.000241,2.3e-05,8.2e-05,7.1e-05,5.5e-05,7.6e-05,0.00016,9.4e-05,6.1e-05,0.000109,0.000157,3.5e-05,0.000135,0.000153,5.6e-05,6.5e-05,9.7e-05,7.8e-05,2.4e-05,0.000153,9.9e-05,4.7e-05,3.5e-05,7.9e-05,3.7e-05,0.00013,8.9e-05,4.9e-05,1e-04,8.1e-05,4.9e-05,2.7e-05,9.3e-05,0.000105,7e-05,8.9e-05,3.7e-05,0.000109,6.6e-05,0.000156,3.3e-05,6.3e-05,5.8e-05,5.8e-05,8.8e-05,5.5e-05,7.6e-05,8.6e-05,5.7e-05,1e-04,6.8e-05,8.9e-05,6e-05,0.000107,4.9e-05,2.5e-05,8.3e-05,6.8e-05,7.2e-05,8.3e-05,0.000115,5.7e-05,3e-05,8.2e-05,8.9e-05,0.000109,0.000134,4.3e-05,0.000144,0.000152,6.8e-05,2.8e-05,1e-04,0.000109,7.6e-05,3.4e-05,5.3e-05,0.000119,9.1e-05,1.7e-05,4.1e-05,7.9e-05,3.6e-05,0.000103,6.8e-05,8.3e-05,6.7e-05,0.000138,3.2e-05,7.6e-05,8.2e-05,2.6e-05,5.4e-05,7.3e-05,0.000153,2.3e-05,0.00016,9.2e-05,4.6e-05,0.000154,3.7e-05
3.1e-05,2.6e-05,9e-05,0.000152,0.00023,9.7e-05,1.5e-05,0.000102,3.7e-05,0.000142,0.000124,3.8e-05,7.3e-05,6.6e-05,0.000155,7.3e-05,4.9e-05,0.000169,0.000177,8.5e-05,0.000205,5.1e-05,0.000114,5.8e-05,3.2e-05,8.8e-05,0.000153,5.5e-05,4.3e-05,0.000116,9.9e-05,3.5e-05,0.00016,0.000119,6.9e-05,5.7e-05,9.4e-05,6.6e-05,1.3e-05,0.000124,0.000134,1.9e-05,3.2e-05,0.000103,6.1e-05,0.000153,8.2e-05,8.3e-05,8.5e-05,3.1e-05,5.5e-05,1.8e-05,2.4e-05,8.1e-05,9.6e-05,2.3e-05,3.4e-05,0.000115,5.3e-05,0.000114,5e-05,6.3e-05,2.6e-05,8.6e-05,8e-05,5.1e-05,9.4e-05,1.7e-05,3.9e-05,7.1e-05,6.9e-05,9e-05,5.3e-05,7e-05,5.2e-05,2.6e-05,0.00014,3.1e-05,6e-05,0.00011,0.000111,1.3e-05,1.7e-05,8.4e-05,4e-05,8.4e-05,8.2e-05,4.1e-05,0.000147,8.1e-05,6.4e-05,4.6e-05,7e-05,0.000107,6.3e-05,1.8e-05,2.9e-05,9.4e-05,9.1e-05,1.5e-05,3.5e-05,6.9e-05,1.3e-05,0.000134,6.5e-05,7.2e-05,8.7e-05,7.6e-05,9e-06,6.7e-05,9.4e-05,2.4e-05,7.2e-05,1.8e-05,0.000187,3.3e-05,9.5e-05,9.8e-05,8e-05,0.000128,3e-05
3.7e-05,1.4e-05,7.4e-05,0.000187,0.000152,1.5e-05,6.3e-05,8.7e-05,3.4e-05,0.000132,8.8e-05,3.3e-05,8.8e-05,0.000109,0.000198,0.000111,4.5e-05,0.00017,0.000206,0.000152,0.000231,1e-05,9.9e-05,5.6e-05,6.1e-05,0.000128,0.000213,4.9e-05,4.3e-05,0.000103,0.000103,4.8e-05,0.000133,0.000133,7.3e-05,8.1e-05,0.000134,7.4e-05,5.3e-05,5.3e-05,0.000104,0.000103,3.9e-05,4.7e-05,1.2e-05,0.000122,0.000108,7.4e-05,4.8e-05,5e-05,2.5e-05,3.8e-05,3.5e-05,4.5e-05,8.5e-05,7.5e-05,8.9e-05,8.3e-05,2.2e-05,0.000104,3.1e-05,5.4e-05,4.8e-05,5.1e-05,9.9e-05,9.9e-05,2.2e-05,2.2e-05,1.2e-05,0.000104,5.3e-05,9.6e-05,2.6e-05,7.5e-05,1e-04,3.5e-05,0.000171,7e-06,5.3e-05,0.000107,3.1e-05,1.9e-05,5.3e-05,2.8e-05,3.3e-05,6.8e-05,6.1e-05,4.1e-05,0.00019,0.000109,1.8e-05,2.8e-05,3.3e-05,0.000103,0.000125,4.6e-05,7.4e-05,0.000117,0.000119,2.1e-05,2.3e-05,7.7e-05,4.1e-05,0.00014,6.2e-05,0.000106,0.000119,0.000161,4e-05,5.5e-05,8.4e-05,1.4e-05,8.3e-05,5.6e-05,0.000183,6e-05,8e-05,0.000102,8.2e-05,0.000169,6e-05
2.2e-05,1.5e-05,3.4e-05,0.000253,0.000141,6.1e-05,6.6e-05,8.7e-05,6.9e-05,0.000146,9.9e-05,3.5e-05,4.5e-05,7.9e-05,0.000184,2.7e-05,1e-04,0.000151,0.000182,0.000103,0.000156,8.4e-05,0.000126,4.1e-05,0.000101,6.4e-05,0.00016,6.5e-05,0.00011,0.000108,5.1e-05,5.9e-05,0.000138,0.000109,7.7e-05,6.8e-05,7.4e-05,7.4e-05,4.9e-05,6.5e-05,9.7e-05,4.2e-05,3.4e-05,7.8e-05,6.7e-05,0.00011,1.1e-05,3.1e-05,8.1e-05,4.9e-05,5.3e-05,3.4e-05,6.8e-05,5.5e-05,6.1e-05,8.6e-05,4e-05,8.4e-05,2.1e-05,0.00012,2.1e-05,5.3e-05,5.6e-05,5.7e-05,7.1e-05,0.000103,1e-04,8e-06,1.4e-05,0.000104,6.8e-05,7e-05,6.4e-05,5.3e-05,5e-06,3.3e-05,0.000122,7.5e-05,8.1e-05,1.1e-05,0.000121,6.4e-05,9.8e-05,6.6e-05,5.6e-05,7.9e-05,1.8e-05,6.9e-05,0.000104,7e-05,6.7e-05,2e-05,7.2e-05,0.000135,5.8e-05,6.2e-05,3.5e-05,8.7e-05,5.4e-05,7.5e-05,7.9e-05,0.000102,1.8e-05,9.6e-05,5e-05,0.000115,0.000193,7.4e-05,6.1e-05,5.3e-05,7.8e-05,3.2e-05,5.1e-05,9.4e-05,9.8e-05,5.3e-05,0.000128,0.000112,5.4e-05,8.1e-05,0.000161
1.7e-05,3.2e-05,5.1e-05,0.000216,0.000139,1e-05,5.1e-05,0.000137,1.5e-05,8.9e-05,4.7e-05,7.2e-05,1.2e-05,6.7e-05,0.000218,5.4e-05,4.7e-05,0.000135,0.000135,0.000104,0.000128,4.4e-05,0.000135,0.000106,5.5e-05,0.000115,8.3e-05,4.9e-05,7.4e-05,4e-06,4e-06,4e-05,0.000103,0.00011,5e-05,3.4e-05,9.9e-05,9.9e-05,4.7e-05,9.7e-05,4.3e-05,2e-05,1.7e-05,7.7e-05,6.4e-05,7.4e-05,2.7e-05,7.9e-05,0.000113,6e-05,1e-05,1.1e-05,2.3e-05,0.000105,0.000103,6.4e-05,4.1e-05,9.6e-05,7.6e-05,7.6e-05,4e-06,7.2e-05,5.2e-05,2.2e-05,4.8e-05,2.7e-05,2.6e-05,4.8e-05,4.1e-05,0.000103,9.3e-05,4.2e-05,6.2e-05,2.4e-05,2.7e-05,2.9e-05,0.000125,9.3e-05,2.1e-05,2.3e-05,0.000106,3.6e-05,4.9e-05,3.6e-05,4.9e-05,8e-05,7.2e-05,5.9e-05,8.9e-05,8.5e-05,3e-05,5.7e-05,6.9e-05,8.8e-05,1.9e-05,1.3e-05,4.1e-05,7.4e-05,6.1e-05,4.3e-05,4.8e-05,8.1e-05,2.3e-05,0.000102,2.9e-05,9.3e-05,7.5e-05,1e-04,4.8e-05,2.1e-05,4.2e-05,1.4e-05,6.1e-05,5.5e-05,0.000118,2e-05,0.000115,6.8e-05,4.3e-05,8.4e-05,9.9e-05
5.3e-05,1.7e-05,4.5e-05,0.000136,0.000114,2.5e-05,6.4e-05,8.5e-05,1.5e-05,7.2e-05,7.4e-05,5.5e-05,6.2e-05,1.4e-05,0.000189,4.8e-05,1.8e-05,0.000139,0.000135,0.000105,0.000126,1.9e-05,3.7e-05,5.1e-05,4.2e-05,9e-05,8.6e-05,3e-05,8.7e-05,7.3e-05,9.6e-05,6.4e-05,0.000109,0.000117,6.2e-05,2.4e-05,6.3e-05,4.5e-05,4.4e-05,8.2e-05,6.7e-05,5.6e-05,1.2e-05,6.8e-05,2.9e-05,8.4e-05,4.5e-05,8.6e-05,5.9e-05,1e-05,1.9e-05,3.2e-05,3e-05,5.8e-05,7.7e-05,3.8e-05,2.2e-05,3.6e-05,4.7e-05,8e-05,7e-06,8.7e-05,7.1e-05,5.2e-05,6.2e-05,3.2e-05,1.5e-05,2.8e-05,1.4e-05,9.6e-05,7.2e-05,4.7e-05,3.5e-05,1.8e-05,2.4e-05,4.4e-05,0.000125,1.3e-05,3.4e-05,4e-05,6.8e-05,2.2e-05,4.3e-05,3.8e-05,4.6e-05,8.8e-05,5e-05,4.5e-05,9e-05,0.000101,4.1e-05,3.3e-05,7.2e-05,9.8e-05,2.5e-05,1e-05,4.7e-05,6.4e-05,6.5e-05,2.8e-05,1.9e-05,6.5e-05,3.4e-05,0.000118,4.2e-05,5.6e-05,0.00011,9e-05,2.6e-05,4.2e-05,5.7e-05,2e-05,7.6e-05,7.1e-05,7.4e-05,5.6e-05,8.7e-05,5.2e-05,1e-05,8.8e-05,5.7e-05
3e-05,4.5e-05,2.4e-05,0.000144,0.000137,3.7e-05,4e-05,0.000113,2.8e-05,0.000123,6e-05,2.4e-05,3.6e-05,9.3e-05,0.000151,4.5e-05,3.4e-05,0.000146,0.000144,9.4e-05,0.000147,5.1e-05,8.6e-05,1.3e-05,6.1e-05,4.2e-05,0.000106,3e-06,8.1e-05,7.5e-05,7.4e-05,2.7e-05,0.000105,0.000116,5.9e-05,3.1e-05,4e-05,3e-05,1.1e-05,5.5e-05,8.4e-05,2.5e-05,1.8e-05,8.1e-05,3e-05,9.7e-05,2.5e-05,4.6e-05,5.9e-05,3e-05,3.9e-05,4e-06,2.9e-05,2.3e-05,7e-05,3.9e-05,3.8e-05,4.5e-05,4.1e-05,7.5e-05,5e-06,7.6e-05,4.2e-05,3.7e-05,6.6e-05,4.1e-05,3.3e-05,3.2e-05,2.3e-05,5.6e-05,2.9e-05,8.2e-05,4.3e-05,3.4e-05,4.3e-05,2.9e-05,8.3e-05,4.2e-05,2.1e-05,6.4e-05,6.6e-05,4.1e-05,4.1e-05,3.2e-05,6.4e-05,5.9e-05,3.4e-05,5e-05,8.7e-05,0.000113,3.2e-05,4.1e-05,8.8e-05,7.8e-05,1.5e-05,6e-06,2.6e-05,8.4e-05,3.7e-05,2.6e-05,3e-05,5e-05,4.1e-05,7.2e-05,4.9e-05,4.8e-05,8.9e-05,0.000108,3.9e-05,3.8e-05,6.9e-05,4.8e-05,6.4e-05,6.4e-05,8.1e-05,3.7e-05,0.000105,4.7e-05,2.8e-05,7.7e-05,5.7e-05
1.9e-05,3.7e-05,3.4e-05,0.000181,0.000115,2.4e-05,2.8e-05,0.000108,3.9e-05,7.4e-05,6.8e-05,1.1e-05,1e-05,8.7e-05,0.000156,1.5e-05,1.4e-05,0.000118,0.000142,2e-05,0.000112,2.2e-05,7.9e-05,1.6e-05,8e-05,4.5e-05,6.1e-05,2.5e-05,4.1e-05,7.8e-05,0.000106,3.8e-05,0.000105,9.5e-05,5.6e-05,1.6e-05,6.4e-05,9e-06,2.8e-05,6.7e-05,4.8e-05,3.7e-05,3.2e-05,8.8e-05,3.7e-05,7.8e-05,7e-06,5.8e-05,5.4e-05,5.2e-05,2.7e-05,2.9e-05,4e-05,3.8e-05,6.5e-05,5.5e-05,5.9e-05,6.7e-05,6.3e-05,7e-05,2.6e-05,6.5e-05,5.5e-05,3.7e-05,3.4e-05,2.4e-05,1.6e-05,2.9e-05,2.8e-05,7.7e-05,4.7e-05,7e-05,2.5e-05,1e-05,3.4e-05,3.7e-05,7.7e-05,4.2e-05,1.9e-05,1.7e-05,7.7e-05,2.5e-05,4.4e-05,2.5e-05,3.6e-05,7.2e-05,6e-05,3.4e-05,9.6e-05,8.6e-05,1.6e-05,5.2e-05,0.000103,0.00012,1.9e-05,3.9e-05,4.8e-05,9.1e-05,4.7e-05,4.4e-05,8e-05,6e-05,2.7e-05,8.3e-05,3.8e-05,3.8e-05,9.7e-05,9.7e-05,3.3e-05,3.1e-05,0.000103,2.1e-05,5.1e-05,5.2e-05,8.3e-05,7.4e-05,7.1e-05,5.5e-05,3.6e-05,0.000104,4.9e-05
3.5e-05,5.6e-05,6.4e-05,0.000205,0.000133,4.9e-05,2.4e-05,1e-04,4.8e-05,0.000101,7.2e-05,1e-05,3.1e-05,2.1e-05,0.00017,4.8e-05,6.8e-05,0.000114,0.000118,6.3e-05,0.000151,3e-05,1.4e-05,8.8e-05,4.6e-05,0.000137,0.000109,3.5e-05,8.8e-05,7.2e-05,9.1e-05,4.7e-05,0.000102,0.00012,8.8e-05,2.2e-05,5.2e-05,2.6e-05,1e-05,4e-05,2.3e-05,3.1e-05,3.9e-05,9.1e-05,2.2e-05,8.3e-05,4.1e-05,2e-05,5e-05,6.5e-05,3.4e-05,6e-06,7.3e-05,5e-06,8.3e-05,0.000101,4.6e-05,7.5e-05,8.9e-05,8.2e-05,2e-05,4.3e-05,4.7e-05,3.2e-05,6.8e-05,1.7e-05,3.2e-05,4.2e-05,2.3e-05,9.8e-05,4.1e-05,6.6e-05,2.8e-05,4.6e-05,1.5e-05,2.6e-05,0.000125,4.6e-05,2.5e-05,4.8e-05,0.000147,5.2e-05,4.3e-05,2.5e-05,8.6e-05,3.3e-05,5.6e-05,4.3e-05,9.5e-05,7.4e-05,2.8e-05,2.8e-05,6.8e-05,7.8e-05,4e-06,3e-05,2.6e-05,5.3e-05,4.8e-05,8.6e-05,6e-06,4.6e-05,4.3e-05,7.1e-05,8.7e-05,3.8e-05,9.8e-05,5.7e-05,1.5e-05,2.1e-05,8.8e-05,6e-05,2.8e-05,5.8e-05,0.000101,3.9e-05,7.4e-05,7.3e-05,8e-06,0.000133,4.6e-05
3e-05,6.4e-05,6.8e-05,0.000233,5.3e-05,2.3e-05,5.1e-05,0.000125,2e-05,5.7e-05,3.8e-05,2.6e-05,5.4e-05,9.8e-05,0.000155,7.5e-05,2e-06,0.000143,0.000123,0.000117,7.5e-05,1.9e-05,7.6e-05,2.9e-05,3.6e-05,9.6e-05,0.000126,3.9e-05,5.9e-05,8.8e-05,1.2e-05,1.3e-05,0.000109,0.000107,9.9e-05,4.2e-05,4.7e-05,4e-05,1.7e-05,3.8e-05,3e-05,5.8e-05,8e-06,6.2e-05,5.6e-05,5e-05,6.6e-05,4.3e-05,4.1e-05,5.9e-05,4.7e-05,4.8e-05,0.000103,2.4e-05,4.3e-05,5.6e-05,3.5e-05,7.3e-05,8.6e-05,7.1e-05,3.4e-05,7.1e-05,3.4e-05,1.5e-05,8.8e-05,5.6e-05,6.5e-05,6.9e-05,4e-05,6.6e-05,6.3e-05,5.8e-05,3.2e-05,1.3e-05,3.5e-05,7.2e-05,9.7e-05,0.000115,7.4e-05,4.5e-05,0.000178,8.2e-05,8.3e-05,3.5e-05,9.6e-05,6.8e-05,4.6e-05,6.4e-05,0.000123,7.1e-05,3e-05,4.3e-05,3.3e-05,9.8e-05,2.5e-05,7.5e-05,4.1e-05,9.3e-05,0.00012,3.6e-05,3e-05,2.1e-05,4.9e-05,6.5e-05,4.7e-05,6.9e-05,0.000106,9.3e-05,2.3e-05,2.3e-05,4.1e-05,2.2e-05,4.9e-05,4.8e-05,0.000108,5.3e-05,7.9e-05,6.5e-05,4e-05,0.00013,2.5e-05
5.6e-05,1.5e-05,1.7e-05,0.000188,0.000111,2.4e-05,4.2e-05,7.9e-05,1.4e-05,5.2e-05,9.4e-05,4.4e-05,3.6e-05,6.9e-05,0.000206,2.8e-05,3e-05,0.000105,0.000112,7.1e-05,0.000117,1.3e-05,6e-05,4.2e-05,1.4e-05,2.3e-05,9.9e-05,2.9e-05,7e-05,0.000119,5.7e-05,1.4e-05,0.000106,1e-04,8.5e-05,5.3e-05,8.5e-05,1.2e-05,3e-05,7.6e-05,4.1e-05,3e-06,1.4e-05,3.5e-05,3.2e-05,6.2e-05,6e-05,1.7e-05,7e-05,1.8e-05,2.2e-05,7e-05,5.2e-05,2.9e-05,3.9e-05,0.000101,1.6e-05,6.3e-05,6.1e-05,9.2e-05,4.5e-05,8.2e-05,5.5e-05,5.3e-05,0.000108,5.5e-05,4.8e-05,5.2e-05,1.4e-05,0.00012,5.2e-05,7.5e-05,4.5e-05,3.6e-05,1.6e-05,9.1e-05,0.000135,0.000101,2.1e-05,4.3e-05,0.000106,4.7e-05,3.7e-05,4.1e-05,1.3e-05,3.5e-05,1.5e-05,2.5e-05,8.8e-05,0.000104,3.4e-05,7.3e-05,5.4e-05,7.7e-05,5.3e-05,0.000108,8.3e-05,9.2e-05,3.2e-05,5.7e-05,5.2e-05,5.4e-05,3.9e-05,7.6e-05,4.6e-05,3e-05,8.4e-05,9.9e-05,7.8e-05,7.8e-05,4.4e-05,4.8e-05,2.9e-05,3.7e-05,9.1e-05,3.5e-05,3e-05,1.2e-05,5.9e-05,9.7e-05,2.9e-05
5.3e-05,4.4e-05,3.1e-05,0.000133,0.000113,4e-05,2.4e-05,4.6e-05,4.3e-05,7.9e-05,4.5e-05,2e-05,1.1e-05,5.9e-05,0.000166,1.1e-05,4.1e-05,0.000107,0.000134,3.7e-05,0.000102,3.1e-05,9.2e-05,2.8e-05,1.2e-05,6.2e-05,0.000152,4.9e-05,8.7e-05,8.6e-05,2.8e-05,1.5e-05,0.000106,0.000101,4.1e-05,2.5e-05,4.4e-05,9e-05,2.9e-05,4.9e-05,5.8e-05,3.2e-05,6.3e-05,3e-05,8.2e-05,6.5e-05,7.5e-05,7.7e-05,0.000117,6e-05,9e-05,6.2e-05,0.00011,4.6e-05,1.9e-05,6.5e-05,1.7e-05,3.9e-05,5e-05,5.9e-05,6.5e-05,8.8e-05,3.7e-05,3.3e-05,0.00011,0.000131,0.000101,7e-05,6.2e-05,0.000143,0.000107,2e-05,3.6e-05,8.1e-05,7.1e-05,0.000103,0.000142,7.6e-05,7e-05,6.7e-05,6.6e-05,4.1e-05,7.5e-05,5.4e-05,5.7e-05,1.7e-05,5e-05,7.4e-05,8.2e-05,0.000107,3.1e-05,5.8e-05,4.8e-05,0.000128,4.3e-05,7.1e-05,2.5e-05,3.3e-05,9.9e-05,6.8e-05,6.9e-05,0.000118,3.2e-05,9.2e-05,2.4e-05,7.3e-05,6.9e-05,5.2e-05,5.2e-05,7e-06,4.8e-05,6.1e-05,6.2e-05,7.1e-05,0.000112,2.7e-05,6e-05,6.2e-05,5.8e-05,9.9e-05,1.4e-05
4.7e-05,2.4e-05,5.1e-05,7.7e-05,0.000131,9e-05,4.5e-05,7.4e-05,3.1e-05,2.4e-05,0.000108,6.5e-05,5.4e-05,4.3e-05,0.000153,4.5e-05,6.3e-05,0.000102,0.000166,9.6e-05,4.4e-05,5.2e-05,9.2e-05,5.9e-05,4.8e-05,8.6e-05,8e-05,6.1e-05,1.3e-05,0.000103,0.000102,8.5e-05,9.8e-05,8.7e-05,7.8e-05,2.5e-05,3.5e-05,6.1e-05,4.4e-05,9.4e-05,1.6e-05,5.8e-05,1.5e-05,9.5e-05,2.8e-05,0.000103,2.5e-05,6e-05,0.000123,7.6e-05,5.2e-05,7.1e-05,8.7e-05,9.4e-05,1e-04,7.9e-05,6e-05,3.5e-05,7.7e-05,0.000103,2.6e-05,4.2e-05,0.000104,6.8e-05,9.5e-05,9.3e-05,9e-05,9.9e-05,2.4e-05,6.2e-05,3.2e-05,9.1e-05,7.1e-05,0.000126,7.7e-05,3.8e-05,6.4e-05,2.6e-05,5.6e-05,1e-05,9.9e-05,2.5e-05,4e-05,2.2e-05,7.2e-05,6.1e-05,3e-05,6.5e-05,8.2e-05,9.1e-05,3.6e-05,2e-05,6.2e-05,9.8e-05,5.4e-05,7.8e-05,2.5e-05,5.6e-05,6.4e-05,4.3e-05,8e-06,8.2e-05,4.1e-05,6.5e-05,1.3e-05,5.2e-05,8.8e-05,4e-05,3.5e-05,1.8e-05,2.9e-05,3.3e-05,5.1e-05,6.7e-05,8.8e-05,1.9e-05,7.6e-05,3.9e-05,4.1e-05,5.7e-05,2.5e-05
3.7e-05,2.5e-05,3.5e-05,9.8e-05,4.8e-05,2.1e-05,5.3e-05,4.7e-05,3.8e-05,7.4e-05,0.000123,4.3e-05,5.5e-05,5.5e-05,0.000123,6.5e-05,6.2e-05,0.000168,8.2e-05,7.4e-05,0.000111,4.5e-05,7.4e-05,5.4e-05,2.6e-05,9.9e-05,7.8e-05,3.2e-05,3e-05,5.2e-05,7.4e-05,4.1e-05,0.000116,8.8e-05,8.5e-05,1.7e-05,7.5e-05,5.1e-05,1.1e-05,5.6e-05,8e-06,3.1e-05,1.4e-05,8.1e-05,1.4e-05,5.4e-05,3.9e-05,6.6e-05,9.5e-05,3.2e-05,1.4e-05,3.7e-05,1.2e-05,3.4e-05,4.9e-05,3.4e-05,6.4e-05,4.2e-05,5.4e-05,8.4e-05,1.9e-05,3.3e-05,6e-05,5.6e-05,3.1e-05,1.3e-05,3.9e-05,2.9e-05,3.3e-05,6.3e-05,2.3e-05,7.4e-05,3.3e-05,6.7e-05,2.5e-05,3.9e-05,5.3e-05,1.4e-05,1.5e-05,3.1e-05,6.1e-05,1.8e-05,1.5e-05,3.2e-05,5.2e-05,4.2e-05,4.2e-05,3.1e-05,9.3e-05,9e-05,3.3e-05,2.1e-05,5.7e-05,8.9e-05,3.7e-05,3.7e-05,3e-06,3.7e-05,8.4e-05,3.6e-05,3.7e-05,6.7e-05,4.9e-05,1e-04,1.3e-05,4.3e-05,6.5e-05,5.1e-05,3.2e-05,1.6e-05,2.9e-05,4e-05,4.9e-05,5.1e-05,6.8e-05,3e-05,8.7e-05,5.4e-05,2.3e-05,9.5e-05,1.5e-05
5.5e-05,3.1e-05,3.6e-05,0.000126,6.3e-05,4.3e-05,5.1e-05,0.000103,5e-05,9e-05,7.9e-05,6.1e-05,1.1e-05,1.9e-05,0.000164,8e-06,7e-05,0.000181,0.000139,5.6e-05,9e-05,5e-05,7.6e-05,5.7e-05,3.4e-05,0.000106,4.5e-05,8.2e-05,3e-05,8.4e-05,6.1e-05,4e-05,6.5e-05,0.00011,5e-05,7e-05,5.8e-05,2.5e-05,9e-06,4e-05,4e-05,3.7e-05,2.2e-05,0.000101,2.7e-05,6.8e-05,5.8e-05,5.1e-05,8.3e-05,9e-06,3.6e-05,1.6e-05,5e-06,1.6e-05,4.4e-05,3.4e-05,1.1e-05,5.2e-05,1.7e-05,7.7e-05,1.3e-05,2.5e-05,7e-05,2.7e-05,4.9e-05,1.9e-05,2.6e-05,4.4e-05,2.9e-05,6.2e-05,1.2e-05,8e-05,1.5e-05,1.6e-05,8e-06,3.4e-05,5.6e-05,3.7e-05,2.1e-05,3.9e-05,6.2e-05,2.8e-05,2.5e-05,3.1e-05,5.1e-05,2.1e-05,1.5e-05,1.6e-05,6.4e-05,0.000101,1.3e-05,2.4e-05,6.9e-05,8.6e-05,1.1e-05,3.5e-05,7e-06,2e-05,7e-05,1.8e-05,3.7e-05,6.7e-05,1.7e-05,7.2e-05,1.9e-05,6.2e-05,6.1e-05,7.3e-05,4.9e-05,1.3e-05,3.4e-05,2.1e-05,5.3e-05,3.1e-05,5.9e-05,6e-06,5.6e-05,5.1e-05,1.4e-05,9.6e-05,2.5e-05
1.3e-05,3e-05,5e-05,0.000182,0.000148,6.3e-05,3.9e-05,0.000126,1.9e-05,6.4e-05,3.8e-05,2.4e-05,3.3e-05,4.8e-05,0.000136,4.6e-05,3.2e-05,7.6e-05,0.000117,7.4e-05,5.5e-05,2.6e-05,6e-05,2.6e-05,4.8e-05,9.5e-05,0.000103,3.9e-05,5.3e-05,5.5e-05,4.3e-05,2.6e-05,8.6e-05,9e-05,1.4e-05,3.9e-05,6e-05,5.4e-05,4.6e-05,8.2e-05,3.7e-05,3.8e-05,1e-05,8.7e-05,5.6e-05,7.8e-05,4.1e-05,4.7e-05,7.4e-05,1.8e-05,2.9e-05,1.9e-05,3.4e-05,2.2e-05,8.5e-05,5.8e-05,1.6e-05,1.4e-05,2.8e-05,7.8e-05,2e-05,2.9e-05,5.1e-05,6.9e-05,3.9e-05,1.4e-05,2.7e-05,3.5e-05,1.8e-05,6e-05,4.1e-05,3.6e-05,1.1e-05,2.9e-05,1.9e-05,1.5e-05,8.9e-05,2.1e-05,1.4e-05,3.7e-05,4.1e-05,2.9e-05,3.8e-05,2.4e-05,4.2e-05,1.6e-05,3e-05,1.1e-05,7.1e-05,6.2e-05,2.1e-05,2e-05,4.5e-05,9.5e-05,1.8e-05,3.3e-05,1.4e-05,3.3e-05,6e-05,8e-06,3.6e-05,5.3e-05,2.6e-05,7.6e-05,1.7e-05,4.3e-05,8.2e-05,5.5e-05,1.9e-05,6.9e-05,6.8e-05,3.6e-05,3.7e-05,3.3e-05,8.6e-05,2.6e-05,6.7e-05,4.5e-05,1.3e-05,9.2e-05,4.2e-05
6e-06,2.6e-05,3.6e-05,0.000151,0.000117,1.8e-05,4.7e-05,8.6e-05,1.4e-05,4.6e-05,6.7e-05,2.1e-05,1.1e-05,4.7e-05,0.000154,3.2e-05,3.2e-05,0.000105,0.000118,7.8e-05,8e-05,2.9e-05,8e-05,4e-05,3e-05,5.6e-05,8.9e-05,1.7e-05,3.5e-05,4.3e-05,5e-05,2.9e-05,8.6e-05,8e-05,1.9e-05,3.5e-05,3.9e-05,2.6e-05,2.5e-05,6.2e-05,2.1e-05,4.1e-05,1e-05,6.5e-05,2.1e-05,8.8e-05,5.5e-05,3e-05,7.5e-05,9e-06,6e-06,9e-06,1.7e-05,2.4e-05,6.6e-05,4.9e-05,2.4e-05,2.7e-05,3.4e-05,8e-05,1.6e-05,1.4e-05,2.8e-05,5e-05,2.3e-05,2e-06,1.7e-05,1.6e-05,8e-06,6e-05,4.4e-05,4.5e-05,2.5e-05,1.8e-05,5e-06,4e-06,6.7e-05,1.8e-05,1.6e-05,3.6e-05,2.9e-05,1.6e-05,1.9e-05,2.2e-05,4.3e-05,1.8e-05,4e-05,2.2e-05,8e-05,8.3e-05,8e-06,4.5e-05,6.3e-05,8.5e-05,1.4e-05,3.3e-05,1.3e-05,2e-05,6.8e-05,1.4e-05,2.2e-05,4.2e-05,1.1e-05,6.9e-05,1.4e-05,5.1e-05,6e-05,3.6e-05,2.8e-05,3.9e-05,4.9e-05,1.1e-05,4.5e-05,2.5e-05,9.2e-05,9e-06,6.6e-05,4e-05,1e-05,6.8e-05,3.2e-05
3e-06,2e-05,2.9e-05,0.000125,0.000121,8e-06,3.7e-05,9.5e-05,3e-06,7.2e-05,6e-05,4e-06,3e-06,5.4e-05,0.000139,1e-05,1e-05,0.000103,0.00012,6.9e-05,8.7e-05,2.8e-05,8.1e-05,2.3e-05,2.1e-05,6.6e-05,8.9e-05,6e-06,2.1e-05,5.3e-05,4.7e-05,1.7e-05,9.3e-05,7.2e-05,4e-05,2.3e-05,5.1e-05,1.7e-05,2e-05,5.4e-05,2.8e-05,3.4e-05,6e-06,4.9e-05,4.5e-05,7.8e-05,4.2e-05,3.4e-05,6.2e-05,1e-05,1.3e-05,9e-06,1.8e-05,1.7e-05,5.6e-05,4.3e-05,2e-05,3.1e-05,2.5e-05,8e-05,1.7e-05,3.5e-05,3e-05,4.2e-05,4e-05,2e-05,2.1e-05,1.9e-05,1.3e-05,5.5e-05,3.9e-05,4e-05,2.1e-05,2.9e-05,1.2e-05,8e-06,5.4e-05,8e-06,1.8e-05,1e-05,5.4e-05,8e-06,1.9e-05,3e-05,3.8e-05,2.5e-05,1.7e-05,4e-06,7.6e-05,8.2e-05,2.3e-05,3.3e-05,5.5e-05,7.7e-05,9e-06,3.7e-05,5e-06,2.6e-05,6.2e-05,2.1e-05,2.9e-05,4.4e-05,9e-06,7.9e-05,6e-06,6.1e-05,6.8e-05,3.4e-05,1.5e-05,3.3e-05,5.3e-05,2.2e-05,4.1e-05,4e-05,9.5e-05,2.3e-05,6.4e-05,4.3e-05,5e-06,8.6e-05,1.7e-05
3e-06,1.6e-05,1.6e-05,0.00012,0.000109,7e-06,3.3e-05,9.2e-05,1.4e-05,6.6e-05,5.4e-05,8e-06,8e-06,4.8e-05,0.000149,2.6e-05,8e-06,0.000103,0.000111,7.4e-05,8.2e-05,2.1e-05,7e-05,1e-05,1.5e-05,6.9e-05,9.5e-05,1.1e-05,3.9e-05,5.5e-05,4.5e-05,2.1e-05,8.4e-05,7.4e-05,3.7e-05,9e-06,4e-05,2.6e-05,1e-05,6e-05,3.6e-05,3.3e-05,8e-06,6.9e-05,3.4e-05,7.6e-05,3.7e-05,4e-05,5.5e-05,2e-06,1.2e-05,5e-06,2.2e-05,2e-05,5.6e-05,4.6e-05,2.5e-05,2.8e-05,2.5e-05,7.1e-05,7e-06,2.8e-05,2.6e-05,3.1e-05,4.6e-05,5e-06,2e-05,1.3e-05,8e-06,6e-05,4.2e-05,5.2e-05,2.3e-05,1.8e-05,1.5e-05,3e-06,6.4e-05,2e-06,4e-06,1.3e-05,5.5e-05,3e-06,7e-06,2.2e-05,4e-05,4e-05,2.1e-05,1.4e-05,7.4e-05,7.5e-05,2.4e-05,3.5e-05,5.5e-05,8.3e-05,4e-06,2.8e-05,6e-06,3.5e-05,7.1e-05,2e-05,2.2e-05,4.8e-05,1.3e-05,7.5e-05,8e-06,6e-05,5.9e-05,3e-05,1.9e-05,4.1e-05,4.7e-05,2.2e-05,4.5e-05,4.2e-05,8.5e-05,1.7e-05,6.6e-05,4.1e-05,2e-06,7.8e-05,1.6e-05
4e-06,1.5e-05,1.3e-05,0.000129,0.000103,9e-06,2.9e-05,8.4e-05,1.4e-05,6.5e-05,4.8e-05,6e-06,9e-06,4.4e-05,0.000148,2.7e-05,1.6e-05,0.000106,9.7e-05,6e-05,8e-05,2.5e-05,7.5e-05,6e-06,1.5e-05,6.6e-05,8.9e-05,6e-06,3.3e-05,5.3e-05,5.5e-05,1.4e-05,8.3e-05,8.2e-05,4e-05,1.7e-05,4.7e-05,2.3e-05,7e-06,5.1e-05,3.5e-05,4.2e-05,7e-06,6.6e-05,3.3e-05,7.8e-05,3.3e-05,3.8e-05,5.8e-05,1e-06,1.9e-05,3e-06,2.5e-05,1.9e-05,6.1e-05,4.1e-05,2e-05,2.5e-05,3e-05,7.6e-05,2e-06,3.1e-05,3.2e-05,3.3e-05,3.7e-05,8e-06,1.8e-05,1.7e-05,5e-06,6.1e-05,4.1e-05,5.1e-05,1.6e-05,2.1e-05,6e-06,2e-06,5.8e-05,1.3e-05,8e-06,2.1e-05,5.6e-05,2e-06,1.1e-05,3.2e-05,4e-05,4.1e-05,1.5e-05,1.1e-05,7.8e-05,8e-05,2.2e-05,3.1e-05,5.1e-05,8.2e-05,2e-06,3e-05,4e-06,2.9e-05,6.6e-05,1.2e-05,2.6e-05,4.3e-05,1.2e-05,7.8e-05,6e-06,5.4e-05,6.6e-05,4e-05,2.1e-05,3.4e-05,4.9e-05,1.8e-05,4e-05,3.6e-05,8.2e-05,2.1e-05,6.3e-05,4.6e-05,6e-06,8e-05,1.6e-05
