-0.008462,-0.004747,-0.005402,-0.003182,-0.001279,-0.000331,-0.000159,-0.003005,-0.00211,-0.001265,-0.005523,-0.006597,-0.008032,-0.010147,-0.008769,-0.020969,-0.012781,-0.012037,-0.010948,-0.009084,-0.012534,-0.011416,-0.013855,-0.012437,-0.014483,-0.02149,-0.016248,-0.017348,-0.012886,-0.013847,-0.008738,-0.007545,-0.00784,-0.007841,-0.014558,-0.01642,-0.012868,-0.010207,-0.010716,-0.011986,-0.01291,-0.009608,-0.007872,-0.006248,-0.002784,-0.002741,-0.005036,-0.002438,-0.004077,-0.002812,-0.003442,-0.00151,-0.001648,-0.001203,-0.001865,-0.001904,-0.002686,-0.001653,-0.001789,-0.002007,-0.001715,-0.001911,-0.001167,-0.001372,-0.000552,-0.001434,-0.001735,-0.001286,-0.001305,-0.000456,-0.001394,-0.001052,-0.001209,0.000417,-0.000938,-0.001649,-0.001545,-0.001226,-0.001034,-0.001331,-0.000866,-0.001002,-0.000224,-0.000612,-0.00099,-0.001012,-0.00107,-6e-04,-0.001165,-0.001535,-0.000615,-0.000619,-0.001096,-0.001369,-0.005276,-0.003482,-0.004874,-0.004615,-0.002196,-0.001314,-0.000804,-0.000485,-0.000486,-0.000678,-0.00202,0.000829,-0.005646,-0.00803,-0.003988,-0.008455,-0.004019,-0.001058,0.000292,-0.002348,-0.00395,-0.002129,0.000337,-0.001421,-0.006153,-0.004217,-0.002169
0.005832,0.003634,0.002587,0.001276,-3e-06,-4.6e-05,-0.001127,-9e-05,0.000233,0.000117,-0.000378,0.003374,0.000956,-0.00119,-0.000665,0.000189,0.003885,-0.004425,-0.0033,-0.00874,-0.002933,-0.008345,0.001889,0.000932,0.002317,0.003324,-0.0072,0.004085,0.00043,-0.006337,-0.004373,-0.00276,-0.002529,-0.003147,0.000666,0.006444,0.003365,-0.007547,-0.001597,1e-06,0.005448,0.002616,0.00382,0.001069,-0.001928,-0.000875,0.000282,-0.00142,-0.001524,-0.000879,-0.001069,-0.002071,-0.001896,-0.001237,-0.000454,0.000412,0.000736,6.4e-05,-0.001015,-8.8e-05,-0.000242,-0.000294,-0.000179,-0.000368,-0.00066,-7e-05,-0.000486,-0.000115,0.000279,-0.000578,-9.9e-05,-0.000314,0.000643,-0.000595,9.2e-05,0.000817,-0.000344,-0.000442,-0.000256,-4.7e-05,-0.000781,-0.00082,-0.000975,-0.000394,7.2e-05,-0.000181,-0.001235,-0.001119,0.000123,0.00073,0.000241,-0.000268,-0.001208,-0.001115,0.000293,0.000594,0.001102,-0.001077,-0.000345,-2e-04,-0.000181,-0.000293,-0.000653,-0.000939,0.000168,-0.001612,-0.002,0.005589,0.003269,-0.001855,-0.000323,-0.001314,-0.000933,-0.002581,-0.00049,-0.000484,0.000696,0.000673,-0.001031,-0.000124,2e-04
-0.005391,-0.00282,-0.001109,-0.000297,0.000452,0.001143,0.000894,0.000351,0.000143,0.000592,2.6e-05,-0.00404,0.001848,0.004625,-0.002435,0.003952,-0.000311,0.000662,-5.7e-05,0.00324,0.002426,-0.001076,-0.004557,-0.00903,-0.002176,-0.001083,-0.001117,-0.005462,-0.006483,0.000607,-0.000795,-0.004621,0.000166,-0.006196,-0.006212,-0.007577,-0.005614,0.003286,0.00157,4.4e-05,-0.004058,0.000649,-0.002345,-0.002,-0.00104,-0.000756,0.000364,-0.000844,0.000463,0.000266,0.001412,0.002051,0.001925,0.000342,-0.000475,-0.000323,5.7e-05,-1.7e-05,0.000775,0.000726,6.2e-05,0.001139,0.000597,-1.9e-05,0.000457,-0.000164,0.001191,0.000967,0.000128,0.000423,0.000809,0.000594,-0.000176,-0.000902,8e-06,0.000393,6e-04,0.000789,-4.1e-05,0.000675,0.000356,0.000471,0.000313,0.000172,0.000391,0.000234,0.000951,0.00072,0.000131,-0.000223,-0.000252,0.000228,0.000135,-0.000134,-0.000234,-0.000227,-0.000179,0.000852,0.000181,-0.00088,-0.001235,-0.000267,0.000101,0.000796,0.000697,-0.00152,-0.004657,-0.00338,-0.001679,-0.001196,0.001258,-0.001008,0.000146,-0.000233,5e-04,0.000157,0.001198,-0.001233,-6.2e-05,2.4e-05,0.000209
0.003095,0.002712,8.7e-05,-7.1e-05,-0.000533,-0.000699,-0.001154,-0.000291,0.000476,-8.5e-05,-0.002088,-0.002428,0.001183,-0.002681,-0.00225,-0.002022,-0.002454,-0.000687,0.002406,-0.000772,-0.004348,-0.004459,0.002466,-0.00243,-0.004386,-0.002032,0.003897,0.004669,0.000813,0.000599,-0.00528,-0.004434,0.000686,0.003544,-0.000522,0.00087,-0.002823,-0.002503,0.000318,0.002254,0.003776,-0.000139,0.001619,0.001209,0.001653,-0.000104,-0.001545,0.000673,0.000118,-0.000143,-7.3e-05,-0.002822,-0.00045,0.000133,3.9e-05,0.000544,0.000317,-0.000477,-0.000873,-0.001177,0.000329,-0.000696,-0.000505,0.000327,-0.000629,0.000145,-0.000348,-0.000942,-0.000188,-7.3e-05,-0.001022,-0.000372,-0.001368,-0.001035,-0.000932,-0.000137,0.000255,0.000111,0.000227,-0.000528,3.8e-05,-0.000429,-0.000201,-0.000167,-0.000484,-0.000325,0.000134,0.000237,0.000269,1e-04,0.000277,-2e-05,0.000478,-0.00025,0.00022,0.000917,0.000372,0.000747,0.000217,0.000738,0.000325,0.000384,0.000145,-0.000896,-0.001046,-0.001,0.000852,-0.004184,-0.001344,-0.000134,-0.000748,-0.001207,-0.000428,8.4e-05,-0.000651,-2e-04,-0.000383,-0.00117,-0.001321,-7e-05,9e-05
-0.002359,-0.001865,-0.000169,7.5e-05,-3.4e-05,2.4e-05,5.5e-05,0.000187,-0.000461,-0.000642,0.000754,-0.005267,-0.0033,0.000743,0.001378,0.002595,0.002495,-0.000227,0.000614,0.000133,0.004925,0.005992,0.004614,0.001014,0.002857,0.005489,0.00448,-0.003887,-0.000124,-0.000177,-0.002454,0.006246,0.001565,0.002262,0.003815,-0.003187,0.003193,-0.001008,0.001824,-0.00357,3.6e-05,-0.000944,-0.001534,-0.000878,-0.000362,-0.000505,0.000671,0.000634,2e-05,0.000186,-2.7e-05,0.001413,-0.000217,-0.000146,0.000102,-0.000334,-0.000624,6.4e-05,0.000242,0.00039,-0.000408,0.000263,0.000355,-0.000132,1.4e-05,-0.000265,-0.000209,0.000431,-8.3e-05,-0.000296,0.000322,0.000588,0.000657,-0.001218,-0.000442,4e-06,-0.000168,-0.00059,0.000281,0.00031,0.000136,0.000152,-0.000272,-0.000497,-9.7e-05,-7.7e-05,-0.000102,-0.000319,-0.000206,-0.000278,-0.000234,-0.00017,-0.000614,-0.000323,-0.000257,-0.001472,-0.000756,-0.00065,-0.001079,-0.000862,-0.000648,-2.5e-05,-0.000371,0.000475,-0.000323,-0.000993,-6.3e-05,-0.002812,-0.001053,0.000509,0.002849,0.00166,0.00128,5.9e-05,0.000744,-2.6e-05,5.7e-05,-0.000377,0.000937,-0.000587,-0.000565
0.001873,0.001511,3.9e-05,0.000237,0.000289,0.000146,-4e-06,0.000219,0.000256,0.000599,-0.000209,0.000567,-0.000468,-0.001937,0.000503,-0.000452,0.000935,0.002985,0.001975,0.001716,-0.001561,-0.002134,-0.004064,-0.003993,0.000245,-0.007029,-0.004124,-0.003894,0.000882,-0.002165,0.002372,-0.002575,-0.001932,-0.00096,0.001388,0.002063,-0.000411,0.001319,-0.000553,0.00218,0.000324,0.000561,0.00157,0.002643,0.000731,-0.000421,-1.6e-05,2.5e-05,0.001353,0.000275,-2.9e-05,-0.00016,-4e-04,-0.000152,0.000544,-0.000206,0.000527,0.000451,9e-05,0.000463,7.2e-05,-0.000106,-0.000544,-1.5e-05,6.3e-05,-0.000271,0.000318,0.00013,-7.7e-05,0.000224,-0.000255,-0.000343,-3.7e-05,5e-05,2e-04,-0.000302,0.00016,0.000393,-0.000102,-0.000145,-2.1e-05,0.000275,0.000592,0.000261,6.2e-05,-0.000188,9.1e-05,0.000441,0.000181,0.000125,0.000218,-3.3e-05,0.000237,0.000682,-5e-06,0.00075,0.000213,0.00056,0.00066,0.000179,0.000956,0.000142,0.000215,0.000272,0.000682,0.00022,0.00191,-0.001385,0.000317,-4.1e-05,0.000493,-0.000178,0.000192,-0.000171,0.001551,0.000861,0.000625,0.000562,0.001292,0.000708,0.000816
-0.001365,-0.001452,-0.000678,-0.000307,-0.000317,-0.000446,-4.6e-05,-0.000696,-0.000189,-0.000259,-0.000159,0.000762,-0.001357,-0.003192,0.000628,-0.002616,-0.0061,-0.000249,0.00038,0.001305,0.002011,0.00412,-0.001914,0.001127,0.000802,0.004795,0.002468,0.004259,0.002895,0.001678,-0.006618,-0.003585,-0.004703,-0.000728,-0.004445,-0.001825,-0.002986,-0.004327,0.000679,-0.001006,-0.002644,-0.000739,-0.000965,-0.002454,-0.001584,4e-06,-2.7e-05,-0.000619,-0.001568,0.000314,-0.000289,0.000116,0.000337,0.000403,0.000209,4e-04,-0.000336,-0.000224,9.3e-05,-0.000774,-6.5e-05,8.2e-05,4.3e-05,0.000261,-5.3e-05,0.000363,8.1e-05,-0.000293,-0.000169,-1.8e-05,-0.000393,-8.4e-05,-0.000134,0.000191,-0.00079,-0.000189,0.000103,-0.000578,0.000334,0.000209,0.000166,-0.000247,-0.000158,0.000258,0.000136,0.000214,-0.000494,-0.000184,-2.8e-05,-0.000197,-0.000308,-0.000197,-3.1e-05,-0.000201,-0.000171,0.000102,0.000218,-0.000428,-0.000525,-0.00032,-3.6e-05,1e-06,-0.00024,-0.000195,-0.000467,-0.00015,0.000865,0.001087,-0.001093,0.000864,-0.003154,-0.000953,7.1e-05,-0.000558,-0.000223,-0.000351,-0.000618,-4.7e-05,-0.000308,-0.000459,-0.000792
-0.00071,-0.000258,0.000166,3.3e-05,7.2e-05,4.3e-05,0.000517,0.000305,0.000249,0.000123,0.000298,-0.001194,3e-05,0.000509,0.003323,-4.7e-05,0.002923,0.002997,-0.002382,-0.001461,-0.001014,-0.000471,-0.000901,0.00086,-0.000729,-0.001155,-0.002126,-0.000181,-0.000763,0.001508,0.002828,0.000723,-0.000173,0.002966,-0.001247,-0.000614,-0.000711,0.001712,0.000482,0.003351,0.002431,4.8e-05,0.000856,0.000148,0.000594,0.001107,0.000201,8e-05,0.000411,-0.000801,0.000114,-8.2e-05,-4.8e-05,-4e-04,-0.000111,0.000106,0.000117,0.000326,-0.000472,0.000355,-0.00047,-0.00054,0.000154,-7.6e-05,-0.000211,-0.000163,-0.000261,0.000144,0.00011,0.000158,0.000495,0.000309,0.000246,0.000138,0.000358,0.000208,0.000392,0.000216,-7.4e-05,-0.000164,9.7e-05,0.000112,-0.000281,-0.000245,-0.00021,0.000182,0.000237,-0.000124,-0.000215,-6.1e-05,-5.2e-05,0.000134,-0.000196,-0.000278,-0.000814,-0.000113,-0.000204,0.000281,6.6e-05,0.000226,8.7e-05,-0.000154,-6.8e-05,-0.000134,9.6e-05,-0.000363,0.000338,0.001042,-0.001249,-7.7e-05,-0.001763,-0.001177,-0.001387,0.000396,-0.000109,-0.001232,-0.000183,0.000199,-0.000716,0.00024,0.000185
0.000904,0.000636,7.1e-05,-0.000124,0.000251,0.000234,-6e-05,-0.000374,-0.000473,0.000179,-0.000353,0.000292,-0.002126,-0.000864,-0.000465,0.000981,-0.000801,-0.00027,-0.000643,0.000358,-0.001154,0.000381,0.00127,-0.002595,-0.000991,-0.000455,9.7e-05,0.002,0.000525,-0.000234,0.000259,-0.001583,-0.001446,-0.001007,3e-05,0.000505,-0.001481,-0.001029,-0.00197,0,-0.000652,-0.000165,0.000175,-0.00065,-0.000172,0.000159,0.000184,0.000808,0.000398,0.000354,-3.8e-05,0.000213,0.000402,-0.000191,-0.000253,-8.6e-05,-1.5e-05,-0.000169,0.000293,-5.3e-05,0.000285,0.000483,9.6e-05,-0.00023,6.5e-05,-0.000124,2.7e-05,-0.000148,0.000215,-0.000101,-0.000208,-0.000239,-3.9e-05,7.1e-05,0.000148,-0.000289,-0.000314,-0.000242,-0.00015,3.6e-05,-0.00037,-0.000159,0.000207,0.000156,0.000167,-0.00014,-3.5e-05,3.9e-05,-7.5e-05,9.1e-05,-4.4e-05,-2.8e-05,0.000166,0.000267,0.000181,0.000255,-0.000614,-0.00013,-0.000236,7.3e-05,-0.000204,-4.3e-05,-1.8e-05,0.000188,0.00017,0.001182,9.1e-05,-9.1e-05,-0.001663,-0.000131,0.000719,0.000829,0.000302,-0.000657,-0.000317,0.001139,7e-04,0.000386,-3.1e-05,0.000252,-9.5e-05
-0.000207,-0.000209,0.000263,6.4e-05,-5.6e-05,-6.1e-05,6.2e-05,-7e-06,0.000168,-0.000101,0.000125,-0.000398,-0.000151,-0.001267,9.4e-05,-7.6e-05,-0.000487,0.000772,6e-05,0.001324,0.000184,0.000503,0.000604,2e-06,-0.000566,0.001591,-0.000472,6.2e-05,0.000624,0.001595,-0.000304,-4.8e-05,0.002253,-0.001479,0.001402,-0.000361,0.00021,-0.000296,0.000352,-0.000358,0.000396,-0.001404,-0.000773,0.000414,0.000301,-0.000287,-0.000429,-3.4e-05,-0.000356,-0.000664,-0.000445,-0.000148,-0.000278,-0.000339,0.000516,9.8e-05,0.00027,0.000154,0.000146,0.000215,-3.6e-05,-0.000305,-4.1e-05,0.000354,0.000262,0.000317,7.2e-05,-0.000193,-0.000368,8e-06,4.5e-05,9.3e-05,0.000106,-0.000121,-0.000264,-0.000103,0.000279,2.1e-05,0.000498,-7.4e-05,0.000528,0.000151,-0.000221,-0.000142,0.000103,4.1e-05,-6.1e-05,-9.3e-05,2.9e-05,-5e-05,2.3e-05,1.4e-05,1e-06,-4.7e-05,-4.8e-05,-0.000221,0.000766,0.000132,0.000263,0.000308,0.000348,0.000107,0.000334,-6.5e-05,-4.1e-05,-0.000585,7.8e-05,-0.000141,0.00199,0.000932,0.000715,0.001,-0.000138,-0.00046,-0.000238,-0.000242,-0.000458,-0.000121,-0.000197,-0.000322,1e-05
0.000142,2.9e-05,-0.000245,-0.000128,0.000163,2e-05,0.000236,2.5e-05,5.5e-05,0.000196,-2.3e-05,0.000178,0.000515,-0.000766,-0.000864,0.001317,0.000572,0.00126,0.000294,-0.000298,0.001046,-0.001429,0.000855,0.000864,-0.000324,-0.003562,-0.00109,-0.00224,-0.000738,-0.001882,-0.000803,-3e-04,-0.0017,-0.000751,-2.6e-05,-0.000837,0.000788,-0.000452,-0.000369,0.000904,-0.000285,0.000417,0.000683,2.6e-05,9.4e-05,-1.5e-05,-0.000494,2.9e-05,0.000244,0.000335,0.000292,3.4e-05,3.9e-05,0.00052,-0.000225,-0.000444,-0.000377,-0.000354,-0.000241,-0.000283,-5.5e-05,4.7e-05,9.1e-05,-0.000293,-0.000132,-0.000292,-0.000227,5.7e-05,0.000245,-3e-05,8.7e-05,-0.000178,-3.3e-05,-1.1e-05,0.000248,-0.000178,-0.000317,-7.5e-05,-0.00026,-7.3e-05,-0.000368,-0.000129,0.000158,4.1e-05,1e-06,-6e-06,8e-06,0.000129,4.4e-05,5.6e-05,2.9e-05,-0.000101,6.3e-05,-5e-05,0.000418,0.000134,-0.000484,-0.000224,0.000148,-0.000313,-6.7e-05,-0.000119,-0.000238,-9.9e-05,-2.4e-05,-0.000258,-3.2e-05,-0.000141,-0.000455,0.000549,0.000125,-0.00023,-0.001141,-0.000199,-0.000303,-0.000705,-0.000569,9.6e-05,-7.4e-05,-9.7e-05,-0.000103
-0.000285,-0.000246,0.000442,-2.1e-05,-0.000239,-3.4e-05,-5.7e-05,9.4e-05,-4.6e-05,-0.000345,-5.6e-05,0.000226,0.001586,-0.000214,-0.000112,0.001541,-0.000333,-0.001593,-0.000696,-0.000405,-2.3e-05,-0.000241,3.5e-05,-0.000242,-0.000475,-0.00159,0.001177,-0.000179,-0.001436,0.000841,-0.000521,-0.00037,-0.00066,-0.000919,-6.7e-05,0.000848,0.001442,0.000296,-0.000936,-0.001891,-0.000638,0.000871,-0.000618,-7e-05,-7.6e-05,-0.000442,0.000371,-0.000231,-0.000462,4.8e-05,4.6e-05,0.00016,-8.1e-05,-2.2e-05,-0.000504,3.7e-05,0.000152,0.000191,0.000169,0.000241,0.000441,3.5e-05,-0.000137,0.00044,4.1e-05,0.000233,-9.1e-05,4e-05,-0.000137,-0.000129,-1.4e-05,-7.2e-05,9.5e-05,5.3e-05,-3.2e-05,-0.000241,0.000156,1.3e-05,8e-06,1.7e-05,0.000224,0.000124,-1.1e-05,-5e-06,0.000107,-0.000104,-6.8e-05,-6.4e-05,-5.3e-05,0.000101,5.2e-05,0.000179,1.7e-05,-4e-06,0.000128,0.000204,0.000507,2e-04,-0.000144,1.8e-05,-0.000174,2.2e-05,0.000118,-4.6e-05,-6.3e-05,0.000164,-0.000334,-1e-06,0.000244,-0.000812,0.000279,-0.00021,0.000488,9e-05,-0.000173,3.7e-05,0.000218,0.000233,0.000213,9.5e-05,-2e-06
0.000132,0.000198,9e-06,-4.6e-05,0.000191,3e-05,-5e-06,0.000129,-2.9e-05,0.000135,-4.7e-05,-0.000385,-0.000542,0.000984,-3.4e-05,-0.000627,6.4e-05,-0.000573,-0.000701,0.00075,-0.000186,-0.001086,-0.000675,-0.000341,0.000516,0.000516,-0.00046,0.000269,0.000916,-0.001317,0.001217,0.002166,0.000234,-0.000262,-0.000845,0.000157,0.000272,-0.000387,0.00029,0.001677,-0.000266,-0.000291,-0.000307,0.000309,0.000118,0.000761,-0.000158,-6.8e-05,0.000272,0.000104,0.00015,6.7e-05,-1e-04,3e-05,0.000277,0.000104,8.7e-05,-5.3e-05,5.8e-05,-0.00013,-0.000231,-5.9e-05,-3.6e-05,-0.00033,4e-06,-9.7e-05,0.000101,-6.9e-05,9e-06,-5.8e-05,-8.4e-05,9.5e-05,-0.000183,-1.3e-05,5e-06,0.000187,-6.4e-05,6.3e-05,0.000147,-6.6e-05,-4e-05,3.5e-05,1e-05,5.7e-05,-9.5e-05,-1.1e-05,0.000112,-1.1e-05,8.6e-05,-0.000113,-2e-06,-0.000107,-7.9e-05,3.6e-05,-0.000108,-0.000105,-0.000166,-0.000177,5.7e-05,5.3e-05,-1.9e-05,-4.7e-05,-2e-06,7e-05,7.3e-05,-0.000131,-0.000195,0.000154,0.00057,-0.000176,1.8e-05,0.00013,-5.2e-05,5.6e-05,1.9e-05,-7e-06,0.000307,4.8e-05,3.1e-05,0.000218,0.000171
0.000211,2e-06,-0.000336,6.8e-05,2.8e-05,-3.8e-05,2e-05,-6e-06,-7e-05,2e-06,0.000123,0.000207,-0.000865,0.000251,-0.001317,-0.000548,0.00016,2.5e-05,-0.000286,-0.000651,0.000223,-0.000275,-0.00087,0.00048,-9.9e-05,0.001989,0.00031,0.000241,9.5e-05,0.001398,-0.000789,-0.00128,0.000475,-0.000104,-0.00019,6.6e-05,7e-05,0.000773,-0.000273,-0.000119,-0.000174,0.000116,0.000581,-0.000161,2e-05,-0.000289,4.6e-05,0.000144,-0.000151,-0.000351,1.4e-05,-0.00019,6.4e-05,-6.8e-05,7e-05,3.5e-05,-3.1e-05,6e-06,-7.9e-05,2.9e-05,2.4e-05,8.7e-05,0.000157,5e-05,-2.4e-05,5e-05,6e-05,4.2e-05,6.6e-05,0.000143,-3.1e-05,-5e-06,-6.4e-05,1.4e-05,-9.1e-05,0.000106,-3.3e-05,-3.7e-05,-0.00013,-4.2e-05,9.2e-05,-4.8e-05,-1.5e-05,-5.3e-05,-2.2e-05,3.5e-05,-7.4e-05,-1.1e-05,-5.1e-05,8e-06,4e-06,5e-05,3.3e-05,-6.3e-05,9e-06,-0.000116,0.00017,0.000117,-3.6e-05,0.000177,-5e-06,9.4e-05,0.000163,-0.000104,-1.9e-05,8e-06,0.000197,-9e-06,-0.000275,-0.000542,-0.000592,-0.000103,-0.00021,-0.00028,-1.7e-05,0.000129,-0.000319,-1.3e-05,0.000109,8.3e-05,0.000113
-0.000358,-5.9e-05,0.00045,3.3e-05,8.4e-05,-2.2e-05,-1e-05,1.9e-05,-3.7e-05,-5.9e-05,-0.000114,-1.9e-05,0.000604,0.00012,-0.000339,-0.000506,-8.8e-05,-0.000765,-0.000135,0.000554,-0.000215,0.000879,-0.000121,-0.000783,-0.00045,0.000123,0.000683,-0.000197,-0.000219,-0.00097,-0.000232,-0.000679,0.000604,-0.000279,0.000338,-0.000568,-0.000709,-0.000485,6.1e-05,-0.000401,0.000292,-0.000827,-0.00039,-9.8e-05,9e-06,0.000175,0.000258,6.3e-05,5.5e-05,0.000279,-0.000181,-5.6e-05,2.3e-05,-0.000236,-0.000302,-8.1e-05,8.4e-05,-4e-06,-1e-05,7.6e-05,-6.1e-05,-3e-06,-1e-05,1.3e-05,-3.7e-05,-2.9e-05,5.9e-05,1e-06,2.1e-05,-9.6e-05,6e-06,-5e-06,0.000103,2e-05,8.8e-05,-7e-05,-6e-05,4.5e-05,-3.3e-05,9e-06,-0.000104,8e-06,-3.7e-05,4.3e-05,3.1e-05,-2.5e-05,6.3e-05,3.9e-05,-6.9e-05,2.7e-05,-5e-06,-1e-05,-2e-06,1.9e-05,-5.9e-05,-9.1e-05,1.4e-05,4.3e-05,2.5e-05,-4.3e-05,7e-06,-2e-05,-7e-06,0.000174,1.3e-05,9.1e-05,-4.2e-05,-0.000123,-1.6e-05,-0.000299,-0.000413,-5.2e-05,0.00035,-0.000272,-3.8e-05,-7.1e-05,0.00028,2e-05,0.00015,-8.5e-05,-7e-05
0.000147,9.4e-05,-0.000272,-3.8e-05,-4.8e-05,6.9e-05,0,1e-05,2.3e-05,0.000109,7.6e-05,-7.7e-05,-0.000297,2.6e-05,-0.000207,-8.8e-05,-0.000363,-1.4e-05,-0.000284,-0.000642,-6.6e-05,2.8e-05,0.000118,0.000305,0.000604,0.001101,-0.000525,-0.000107,0.000407,0.000585,-9e-06,0.000613,0.000262,0.000222,-0.000369,-0.000367,0.00014,0.000233,0.000313,-6.8e-05,-0.000162,0.000379,-8.6e-05,-0.000174,7.5e-05,-0.000297,-4e-06,-1.5e-05,7.2e-05,-9.3e-05,0.000132,8e-05,-7e-06,0.000167,0.000119,-2.3e-05,-0.000182,-1.7e-05,-4e-05,-6e-06,-4.5e-05,-1.4e-05,-5.1e-05,-9e-05,3.1e-05,-1.6e-05,-4.4e-05,4.5e-05,-1.2e-05,6.6e-05,3.2e-05,7.8e-05,-3.8e-05,-1e-05,5e-06,0.000271,-4.4e-05,-3.2e-05,1.5e-05,1e-06,3.6e-05,2.6e-05,4.2e-05,-3.4e-05,3.9e-05,-2e-06,-4.3e-05,-6e-06,2.1e-05,0,-2.5e-05,-1.6e-05,8e-06,1.3e-05,-2.6e-05,5.4e-05,-0.000138,-1.1e-05,3e-06,-7.3e-05,1.3e-05,2e-05,6.2e-05,-4.2e-05,-1e-06,-0.000185,-0.000111,4e-06,-0.000359,-9e-05,6.3e-05,-2.9e-05,-0.000219,-0.000303,-7e-06,4e-05,-0.000485,-2.3e-05,9.7e-05,-5.5e-05,-0.00011
4.5e-05,-5.5e-05,1e-04,3.9e-05,2.8e-05,-0.000122,-1.4e-05,-1.2e-05,4e-05,-8.7e-05,-2.8e-05,5.1e-05,0.000162,0.000258,-0.000476,3.7e-05,0.000161,-0.000803,4.2e-05,0.000169,0.000331,-0.000188,0.000346,-0.000118,-0.000312,-0.000723,0.00043,-0.000283,-0.000316,-0.000349,0.000175,-0.000345,0.000271,-0.000608,0.000155,0.000701,0.000277,0.000141,-4.9e-05,-0.000278,3.1e-05,-0.000198,5.1e-05,0.000109,-9.8e-05,0.000166,-2.8e-05,3.4e-05,-0.000103,6.1e-05,-4.3e-05,0,-4.7e-05,-4.9e-05,9.9e-05,6.4e-05,3.7e-05,2.9e-05,4.5e-05,-7.6e-05,6.2e-05,1.2e-05,2.1e-05,5.8e-05,2.9e-05,5e-06,-3.2e-05,-6e-06,-3.3e-05,-6e-05,7e-06,-3.9e-05,-5e-06,8e-06,-6.6e-05,2.8e-05,-5.3e-05,-1.8e-05,-9.5e-05,7e-06,-6.8e-05,7e-06,-5.5e-05,3.3e-05,-1.7e-05,1.7e-05,-8e-06,-9e-06,2.9e-05,8e-06,1.3e-05,-6e-06,-2e-06,0,3e-06,3.3e-05,7.4e-05,-5.2e-05,-4.1e-05,5.8e-05,-6.1e-05,-1.6e-05,-7.3e-05,1e-05,1.1e-05,9.7e-05,4.8e-05,2.6e-05,-2.2e-05,0.00016,-8e-06,6.2e-05,0.000129,0.000375,3.8e-05,0.000173,9.9e-05,-2.6e-05,-0.000195,-8.9e-05,-3.6e-05
-1.8e-05,2.4e-05,0.000177,0,-8.7e-05,8.9e-05,-2.2e-05,-4.7e-05,1.5e-05,2.5e-05,5e-06,-8.4e-05,-0.000321,-0.000509,-8.7e-05,4.5e-05,8e-06,9e-05,0.000423,-6.3e-05,-0.000345,0.000199,6.8e-05,-0.000358,0.000251,-1.7e-05,-1.8e-05,6.7e-05,0.000403,0.000186,0.000189,-0.000586,-0.000326,0.000272,0.000167,-0.000257,-0.000374,-0.000351,-7.7e-05,0.000333,9e-06,0.00046,1e-05,-8e-05,4.2e-05,-5.1e-05,-0.000116,1.2e-05,7.1e-05,-3.6e-05,-7.2e-05,-5.5e-05,-4.1e-05,2.4e-05,-4.4e-05,5.9e-05,-2.3e-05,-4.6e-05,1e-05,3.1e-05,-3e-06,5e-06,-1.4e-05,1.9e-05,-3e-06,2.2e-05,-1.5e-05,1.4e-05,3.9e-05,9e-06,2.5e-05,-2.3e-05,2.6e-05,8e-06,9.7e-05,-0.000182,1e-05,-2.9e-05,1.2e-05,-5e-06,1.1e-05,8e-06,3.1e-05,-2.2e-05,-2e-05,-9e-06,-1.4e-05,-1.2e-05,2e-06,6e-06,-8e-06,7e-06,-1.4e-05,-2.2e-05,6.3e-05,-1.6e-05,5.5e-05,2.8e-05,0.000101,-1.9e-05,3.9e-05,1.1e-05,-7e-06,-4e-05,1.9e-05,-2.5e-05,2.3e-05,1e-05,0.000295,-0.000175,9.7e-05,6.5e-05,-9.7e-05,1.7e-05,1.8e-05,-0.000177,5.4e-05,-1.5e-05,4.7e-05,3.1e-05,9.2e-05
-4.7e-05,-9e-05,-0.000187,-3.3e-05,4.5e-05,-5.1e-05,-3.6e-05,2.8e-05,1.5e-05,-4e-05,3e-06,6.6e-05,0.000286,-8e-05,5.1e-05,0.000103,-0.000239,0.000227,0.000111,-0.000246,-0.000123,-1.1e-05,1.4e-05,3.7e-05,-0.000194,-0.000522,-0.000172,0.000112,-0.000136,-6.4e-05,-0.00038,0.000627,0.000305,0.000125,0.000114,0,8.7e-05,0.00025,2e-06,-0.000546,-3.4e-05,-0.000216,6.7e-05,2.9e-05,-1.4e-05,8.4e-05,6.9e-05,-5.1e-05,-1e-04,3.1e-05,6e-05,6e-05,3.4e-05,3.6e-05,6.6e-05,-9e-06,-3.2e-05,4.9e-05,-6e-06,1.7e-05,3.3e-05,-2.4e-05,-4.1e-05,-5.1e-05,-2e-05,-4.4e-05,0,-1.7e-05,-3e-06,2.1e-05,-2.4e-05,1.4e-05,-1.3e-05,-2e-06,-6.7e-05,-4.9e-05,2.9e-05,-7e-06,-2e-06,-3e-06,-6e-06,6e-06,-8e-06,2e-06,7e-06,-1e-06,6e-06,1.5e-05,-6e-06,1.8e-05,1.2e-05,2.4e-05,3e-06,1.2e-05,3.1e-05,-3.7e-05,-2.6e-05,-6.4e-05,-6.1e-05,-2.4e-05,1.1e-05,-7e-06,-3.2e-05,4.7e-05,-2e-05,2.8e-05,1.2e-05,-4e-06,-0.000109,0.000229,7.2e-05,-3.5e-05,-0.000139,6.5e-05,0,-4.5e-05,8e-05,-2e-05,-2.3e-05,-2.5e-05,1e-06
-3.6e-05,8.2e-05,0.000125,2e-06,-1.4e-05,3.7e-05,1.3e-05,2.2e-05,-9e-06,1.6e-05,-7e-06,1e-05,-1.9e-05,1.9e-05,5.2e-05,-1.2e-05,8.9e-05,0.000197,-0.000139,-7.3e-05,0.000191,-5.5e-05,-0.000137,0.000202,3.2e-05,8.9e-05,0.000393,-7.4e-05,0.000142,3.7e-05,0.000132,1.5e-05,-0.000193,0.000104,-0.000144,-2.4e-05,0.000106,-0.000322,3e-06,-4.3e-05,-1.6e-05,-0.000102,-4e-06,3.9e-05,-7e-06,-6.5e-05,-3.5e-05,-1.6e-05,6.8e-05,-9.1e-05,8e-06,8e-06,3.9e-05,-2.1e-05,1e-05,-9e-06,5.5e-05,-2.4e-05,9e-06,-2.9e-05,-1e-06,-3e-06,3.3e-05,4.3e-05,9e-06,4.7e-05,4e-06,-2e-06,-1.1e-05,1.2e-05,-1.2e-05,-8e-06,-1.9e-05,9e-06,1.1e-05,2.9e-05,-3e-06,1.8e-05,-3.3e-05,-1.5e-05,-1.3e-05,6e-06,3e-06,9e-06,-6e-06,1.2e-05,1.9e-05,-2e-06,-1.3e-05,-1.1e-05,9e-06,-1.7e-05,-8e-06,1.1e-05,-1.5e-05,3e-06,-4.3e-05,2.3e-05,4.9e-05,3.9e-05,-1.2e-05,-1.9e-05,4e-06,-1.9e-05,5e-06,-3.1e-05,1.8e-05,-1.5e-05,4.2e-05,-6.2e-05,1.7e-05,-5.3e-05,0.000105,-3.6e-05,-1.3e-05,7.1e-05,-1.4e-05,-1.1e-05,-0.000101,-5.9e-05,-2.2e-05
0.00012,-1e-05,-0.00014,-1e-05,-1.1e-05,-2.8e-05,-2.6e-05,6e-06,-8e-06,2e-06,3e-06,-5.8e-05,0.000102,0.000217,0.000241,-5.5e-05,0.000166,0.000124,-0.000124,-7.7e-05,2.3e-05,0.000166,-0.000343,-0.000181,4.4e-05,-0.000105,-0.000222,0.000228,-8.5e-05,0.000112,2.3e-05,-0.000455,0.000188,-0.00028,-3e-06,-0.000105,0.000147,0.00015,-0.000156,-0.000107,8.7e-05,-3.9e-05,-1.7e-05,6.4e-05,3.9e-05,3.1e-05,-2.4e-05,1.3e-05,-2.7e-05,8e-05,6.7e-05,2e-06,1.6e-05,4.7e-05,3e-05,-2.6e-05,-1e-05,1.8e-05,1e-06,9e-06,-1.3e-05,-3e-06,1.1e-05,-8e-06,4e-06,-2.1e-05,1.4e-05,-2e-06,2.6e-05,0,1.6e-05,-1.9e-05,1.6e-05,8e-06,2e-05,-2.8e-05,3.4e-05,-3.1e-05,4.1e-05,-5e-06,1.8e-05,1e-06,2.1e-05,1e-06,-1.7e-05,-8e-06,-1.7e-05,-2e-06,4e-06,-7e-06,2e-06,-3e-06,1e-06,-1e-05,-1.2e-05,2.1e-05,9.8e-05,-3.4e-05,-3.4e-05,1e-05,3.4e-05,1.9e-05,4.3e-05,1.6e-05,-1.1e-05,-4.7e-05,1e-05,-1.8e-05,0.000111,5.9e-05,-0.000161,-1.8e-05,-0.00011,1.1e-05,-2.2e-05,-5.9e-05,-5.1e-05,-1.5e-05,3.9e-05,2.2e-05,4.9e-05
-8.5e-05,-4.6e-05,0.000144,4e-06,2.9e-05,2e-06,-2e-05,1.6e-05,-1e-05,-5e-06,-1e-06,5.4e-05,1e-06,-2.1e-05,1e-04,-9e-05,-0.00015,5.6e-05,0.000273,9.3e-05,-5.5e-05,-3.9e-05,-4.8e-05,2.9e-05,3.2e-05,2.3e-05,8.7e-05,-5.9e-05,-6.5e-05,-0.000145,8.9e-05,0.000206,0.000176,0.00023,-3e-05,0.000266,-6e-05,3e-05,7.7e-05,0.000185,1.1e-05,1.3e-05,-7e-06,1.1e-05,-2e-05,-5e-05,3e-05,2.2e-05,2e-06,-4.7e-05,-2.9e-05,-1.4e-05,-1.8e-05,-6.4e-05,-7e-06,-1.8e-05,1e-06,-3.3e-05,-1.4e-05,1.3e-05,2.1e-05,1.3e-05,-2.3e-05,-1.6e-05,-1.3e-05,-7e-06,-1e-05,2e-06,-2.3e-05,-2.1e-05,-2e-06,6e-06,-4e-06,-3e-06,-2.1e-05,3.1e-05,-8e-06,8e-06,-1e-06,3e-06,-1e-05,1e-06,-3.5e-05,-1e-06,1.9e-05,8e-06,1.6e-05,-7e-06,2e-06,1.2e-05,-1e-06,3e-06,-2e-06,-8e-06,-2e-06,-1.1e-05,-8.7e-05,2.6e-05,9e-06,-3.9e-05,1.4e-05,-1.7e-05,-1.7e-05,-1.3e-05,4e-06,5e-05,7e-06,1.8e-05,-9e-05,6.4e-05,-0.00012,1.1e-05,-4.7e-05,-1.9e-05,-3.5e-05,-2.2e-05,6e-06,-1.3e-05,1.1e-05,1.5e-05,-2e-06
-1.2e-05,5.2e-05,-0.000126,7e-06,-4.2e-05,-2e-06,-5e-06,1e-05,-5e-06,2e-05,4e-06,-2.9e-05,-0.000225,-1.1e-05,0.000129,-0.000105,-6.6e-05,0.000404,-0.000289,-4.3e-05,0.000141,-9e-06,0.000153,-2.9e-05,-0.000173,-8e-06,-2.7e-05,-6.9e-05,-2.3e-05,7.6e-05,-0.000156,1e-04,0.000124,-0.000181,-5.6e-05,-0.00026,4.7e-05,-1.1e-05,-5.4e-05,0.000123,-8.3e-05,0.000199,2.5e-05,-6.1e-05,-7e-06,5.5e-05,1.9e-05,-1.7e-05,2.3e-05,1.7e-05,3e-05,2.6e-05,-2e-05,-8e-06,-4.1e-05,3.6e-05,7e-06,1e-05,-5e-06,-2e-06,-4.1e-05,0,1e-05,2.8e-05,-1e-06,1.9e-05,3e-06,-3e-06,1e-05,8e-06,2e-06,-9e-06,-8e-06,6e-06,2.1e-05,1.7e-05,1.8e-05,-2e-06,0,-5e-06,1e-05,3e-06,3.2e-05,-4e-06,6e-06,4e-06,-3.2e-05,6e-06,-5e-06,-8e-06,-6e-06,-6e-06,1e-06,6e-06,-8e-06,-8e-06,5.6e-05,7e-06,2.5e-05,-3.2e-05,1.4e-05,2.1e-05,1.8e-05,1.5e-05,-4e-06,-7e-06,2e-06,3e-06,-5e-05,6e-05,1.1e-05,1.9e-05,7.7e-05,-1.8e-05,-3.5e-05,-1.1e-05,-2.3e-05,-5e-06,4.9e-05,-8e-06,-1e-06
3.9e-05,-2.3e-05,8e-05,2e-06,2.9e-05,1.9e-05,3e-06,-6e-06,9e-06,-6e-06,-5e-06,4e-06,6.2e-05,0.000109,0.000153,-5e-05,2.4e-05,-0.000132,-0.000135,9.1e-05,-0.000182,-8.2e-05,0.000106,-0.00018,0.000166,7.5e-05,9.9e-05,-2e-06,-1.2e-05,-6e-05,1e-05,-0.000167,-0.00017,-5e-05,6.7e-05,0.000159,-2.5e-05,2.5e-05,0,-0.000203,-6e-06,-0.000149,3.4e-05,1.7e-05,-3e-06,-2.9e-05,-1.5e-05,0,-3.1e-05,-5e-05,-3.3e-05,-1.8e-05,1e-06,-1.5e-05,-1.3e-05,-5e-06,-1.8e-05,-6e-06,1e-05,-1.7e-05,-2e-06,7e-06,-2e-06,-4.5e-05,6e-06,-1.6e-05,7e-06,2e-06,2e-06,0,-6e-06,4e-06,1.1e-05,-7e-06,-3.5e-05,-2.7e-05,-5e-06,1.1e-05,3e-05,-4e-06,-1.1e-05,1e-06,-2.3e-05,-8e-06,-1.1e-05,-8e-06,7e-06,5e-06,1e-06,-8e-06,-3e-06,6e-06,3e-06,7e-06,4e-06,2e-06,-3.2e-05,1e-06,-3.1e-05,4.3e-05,-5e-06,-1.5e-05,-4.2e-05,-1.9e-05,4e-06,-1.8e-05,1e-06,-1.1e-05,-8e-06,3.9e-05,4e-05,-2e-06,4.8e-05,-2.4e-05,-1.7e-05,4.7e-05,3.5e-05,-7e-06,3.2e-05,2.2e-05,3e-06
-4e-06,1.5e-05,-6.1e-05,1e-06,-2.4e-05,-2.5e-05,-1.3e-05,-1.2e-05,0,-9e-06,3e-06,-1e-06,0,-4.2e-05,-4.4e-05,5.1e-05,7.7e-05,8.2e-05,3.9e-05,-3.7e-05,-5.2e-05,-0.000107,9e-05,1.1e-05,-8.4e-05,0.000268,-6.4e-05,2.2e-05,0.000137,0.000115,4.7e-05,-4.7e-05,-2e-06,-4e-06,5.1e-05,-1.7e-05,3.2e-05,-6.1e-05,5.4e-05,0.000211,-4.5e-05,4e-06,-0.000117,-6.1e-05,-5e-06,2.9e-05,4e-06,5e-06,2.7e-05,3.5e-05,3e-06,-7e-06,2e-05,6e-06,1.9e-05,-8e-06,1.3e-05,5e-06,-5e-06,1.7e-05,1.7e-05,-2e-06,-2.1e-05,2.7e-05,7e-06,7e-06,1e-05,1e-06,6e-06,9e-06,3e-06,1.6e-05,1.4e-05,-1e-06,4.2e-05,4.5e-05,0,-1e-05,-2e-06,1e-06,1.3e-05,-4e-06,1e-05,1.3e-05,-5e-06,-3e-06,-6e-06,-2e-06,6e-06,1e-05,-1e-06,0,-3e-06,-7e-06,1.4e-05,1.5e-05,-1.8e-05,3.3e-05,3.4e-05,1.9e-05,-6e-06,1.6e-05,2e-06,1.6e-05,1.1e-05,-4e-06,-7e-06,3e-06,-1.1e-05,5e-06,7.2e-05,-9e-06,-7.5e-05,-3.1e-05,1e-06,5e-06,1.4e-05,1e-06,2.1e-05,1e-06,-6e-06
0,-3.2e-05,3.5e-05,3e-06,1e-05,1.6e-05,6e-06,2e-06,2e-06,1.4e-05,-1e-06,-3.2e-05,0.00013,3.7e-05,-2e-06,8.7e-05,-7e-05,3.1e-05,-8.2e-05,-9e-06,0.000186,-6.5e-05,2.6e-05,3.8e-05,8.4e-05,7.4e-05,8e-05,5.5e-05,-0.000127,-0.000113,-1.2e-05,-3.5e-05,-8.6e-05,1.6e-05,-2e-06,-9.7e-05,8.6e-05,1.1e-05,1.9e-05,-0.000161,-2.5e-05,-0.000103,8.7e-05,2.8e-05,-1.1e-05,-7.5e-05,2e-05,-1.1e-05,-3.2e-05,-1.7e-05,-1e-05,6e-06,2e-05,4e-05,-4e-05,-1.2e-05,7e-06,5e-06,7e-06,-1e-06,-1.2e-05,4e-06,1.1e-05,-5e-06,-7e-06,5e-06,9e-06,7e-06,-8e-06,-6e-06,0,3e-06,-1.6e-05,5e-06,-3e-05,2.6e-05,-1.1e-05,-5e-06,1e-06,2e-06,-1.4e-05,1e-06,2e-06,-7e-06,4e-06,-1e-06,1.1e-05,-4e-06,1e-06,0,2e-06,6e-06,3e-06,-1e-06,1.1e-05,1.9e-05,3e-05,-2.5e-05,-2e-05,-4.4e-05,1.7e-05,-1.3e-05,-1.3e-05,-1.1e-05,-1e-06,0,-5e-06,3e-06,6.9e-05,2e-05,5.6e-05,1.9e-05,5.5e-05,1.6e-05,1.4e-05,-5.1e-05,0,0,-1.3e-05,-3.1e-05,-3.2e-05
-4.1e-05,2.4e-05,-5.4e-05,-1e-06,-1.8e-05,-5e-06,4e-06,-5e-06,-1e-06,-2.4e-05,0,3.1e-05,-0.000214,-6.1e-05,1.5e-05,1.4e-05,-5e-06,-0.000134,3e-06,4e-05,-2.4e-05,3.8e-05,-0.000126,-0.000108,-0.000118,0.000102,7.4e-05,-7.6e-05,-3.3e-05,0.000107,-9.4e-05,6.7e-05,2.5e-05,-7.3e-05,-4.9e-05,0.00017,-6.9e-05,3.6e-05,-3.5e-05,5.7e-05,1.8e-05,0.000138,6e-06,-3.3e-05,1.3e-05,5.2e-05,-1.7e-05,5e-06,2.7e-05,1e-05,-1.4e-05,1e-05,-5e-06,-1.6e-05,-7e-06,-4e-06,-2.9e-05,-7e-06,-5e-06,-3e-06,2.5e-05,-7e-06,1.6e-05,4e-06,2e-06,-1.3e-05,-8e-06,-6e-06,-4e-06,-5e-06,1e-06,4e-06,-7e-06,0,8e-06,-1e-05,-4e-06,-1e-06,1e-05,0,1.6e-05,3e-06,-1.1e-05,4e-06,1e-06,1e-06,1e-06,1e-06,-2e-06,1e-06,2e-06,-1.1e-05,-2e-06,2e-06,3e-06,-8e-06,-1e-05,2.1e-05,1.4e-05,-2e-06,-4e-06,8e-06,1.2e-05,1.4e-05,-5e-06,5e-06,0,-4e-06,-1.3e-05,-8.3e-05,1e-06,-5e-06,3e-06,6e-06,1.8e-05,4.7e-05,-6.6e-05,-1e-06,1e-06,1.1e-05,-1.6e-05
4.6e-05,2.8e-05,3.8e-05,-5e-06,1.4e-05,5e-06,-1e-06,2e-06,-5e-06,2.9e-05,1e-06,-1.2e-05,0.000123,1.5e-05,-0.000182,1.8e-05,5.9e-05,-6.1e-05,-3.5e-05,1.1e-05,-5.9e-05,3.5e-05,-8.3e-05,3.3e-05,6.7e-05,-0.000213,-0.000158,8e-06,0.000126,-6.9e-05,5e-06,-4.5e-05,0.000183,-2e-05,-1e-05,-0.000149,-1.2e-05,-6.5e-05,7.5e-05,0.000107,4.8e-05,-5e-06,-6.6e-05,2.8e-05,5e-06,-2.7e-05,1e-06,3e-06,-9e-06,-2.2e-05,1.1e-05,-1.7e-05,-1.8e-05,1.3e-05,1.9e-05,2.6e-05,2e-05,6e-06,-3e-06,-5e-06,-1.4e-05,-3e-06,-1.5e-05,7e-06,3e-06,1.1e-05,-9e-06,4e-06,8e-06,-3e-06,3e-06,-2e-06,1.3e-05,3e-06,1.1e-05,-8e-06,-1e-05,-5e-06,-8e-06,-3e-06,-1.2e-05,-1e-06,1.6e-05,-6e-06,-1e-06,2e-06,-6e-06,4e-06,-1e-06,-2e-06,3e-06,2e-06,3e-06,2e-06,-4e-06,-1.4e-05,2e-06,-2.7e-05,1e-06,1.5e-05,-2.6e-05,-2e-06,-2e-06,-1.7e-05,-8e-06,-8e-06,-4e-06,6e-06,-3.8e-05,4.6e-05,-7.8e-05,-1.5e-05,-1.7e-05,4e-06,1.9e-05,9e-06,-3e-06,2e-06,-3.8e-05,1.2e-05,4.1e-05
0,-4.4e-05,-1.6e-05,-2e-06,-8e-06,-7e-06,1.5e-05,4e-06,-3e-06,-2.1e-05,-1e-06,-4e-06,4.2e-05,-2e-06,-7.7e-05,-2e-05,-3.4e-05,-0.000219,-3.3e-05,-3e-05,3.1e-05,5.6e-05,-1e-06,-1e-06,-4e-06,-5.4e-05,0.000121,5.4e-05,-4.7e-05,3.2e-05,8.2e-05,1.5e-05,-6.8e-05,2e-06,-1.9e-05,8.6e-05,2e-06,5.8e-05,-4.8e-05,3.3e-05,-1.5e-05,1.9e-05,3.4e-05,1.2e-05,-1.1e-05,6.2e-05,5e-06,4e-06,-3e-06,3.1e-05,-1e-05,5e-06,-1e-05,-2.2e-05,7e-06,8e-06,-2e-06,-1.2e-05,1e-05,1.4e-05,-3e-06,1e-06,5e-06,-8e-06,-3e-06,-4e-06,-5e-06,-5e-06,-9e-06,1.1e-05,-9e-06,-1.7e-05,-7e-06,2e-06,-1.6e-05,-3.3e-05,-1e-06,-7e-06,2e-06,1e-06,1.2e-05,-2e-06,-1.6e-05,0,-2e-06,2e-06,2e-06,-2e-06,-3e-06,4e-06,-1e-06,4e-06,-1e-06,-1e-06,-3e-06,2e-06,-5e-06,8e-06,-1.6e-05,-4e-06,2e-06,-2e-06,-1e-06,1.5e-05,2e-06,-1.2e-05,-3e-06,-4e-06,7.9e-05,-0.000109,-6.4e-05,-9e-06,-5.1e-05,-5e-06,5e-06,-4.1e-05,7.8e-05,2e-06,-2.8e-05,-1e-06,1.3e-05
-3.3e-05,1.9e-05,-9e-06,0,9e-06,4e-06,1e-06,6e-06,5e-06,1.4e-05,1e-06,1.5e-05,-4.6e-05,-1.6e-05,-8.6e-05,-1.2e-05,-3.5e-05,-1.7e-05,5.5e-05,8e-05,-6e-06,1e-05,4.3e-05,-0.000125,1.4e-05,-0.000218,-8.3e-05,-5.2e-05,2.9e-05,-2.3e-05,-4.9e-05,8e-05,1.6e-05,4.2e-05,1.6e-05,-1.9e-05,-6.1e-05,-1.3e-05,3e-06,3.5e-05,-6e-06,-0.000103,1e-05,-5e-06,7e-06,-6.6e-05,-1e-06,0,9e-06,-2.7e-05,1.9e-05,3e-06,3e-06,-1.7e-05,-1.1e-05,-9e-06,0,1.5e-05,-4e-06,-1.2e-05,8e-06,-2e-06,4e-06,-7e-06,-2e-06,-4e-06,-1e-06,6e-06,8e-06,-1.1e-05,6e-06,1e-06,-2e-06,-3e-06,1.6e-05,-2.9e-05,-2e-06,-6e-06,-5e-06,-1e-06,-8e-06,-1e-06,1.1e-05,4e-06,7e-06,-6e-06,-1e-05,-2e-06,-2e-06,-4e-06,-1e-06,-2e-06,0,0,-4e-06,4e-06,-3e-06,-1.7e-05,2.6e-05,-7e-06,4e-06,6e-06,-2e-05,-1.4e-05,2e-06,4e-06,2e-06,-6e-06,-4.8e-05,6.2e-05,-1.7e-05,1.4e-05,-6e-06,-7e-06,-1e-06,4e-06,-1.8e-05,1e-06,0,1e-05,-7e-06
1.7e-05,-1.1e-05,-1.1e-05,-3e-06,-7e-06,1e-06,9e-06,0,1e-06,-1.1e-05,-1e-06,-1.2e-05,-4e-06,4e-05,-8.2e-05,-1e-06,-1.4e-05,-0.000153,7.2e-05,-5.5e-05,-4.8e-05,1.3e-05,9.2e-05,3.5e-05,-5e-05,6.5e-05,-2.7e-05,-2.1e-05,1.6e-05,2.4e-05,-6e-05,-7.2e-05,-2.1e-05,-4e-05,1.7e-05,-1.7e-05,8e-06,-4e-05,-1.5e-05,-0.000108,6e-06,-3.4e-05,-3e-05,-2e-06,-4e-06,2.5e-05,-8e-06,-2e-06,-1.4e-05,9e-06,-2e-06,0,1.3e-05,1.8e-05,1.4e-05,-1e-05,1.5e-05,-8e-06,-8e-06,0,-1.6e-05,1e-06,-7e-06,1e-05,3e-06,1e-05,5e-06,-2e-06,0,1e-05,0,4e-06,9e-06,-1e-06,-1.8e-05,3e-05,-1e-06,3e-06,-1e-05,-3e-06,8e-06,0,-9e-06,-2e-06,0,1e-06,7e-06,0,0,-2e-06,-3e-06,0,1e-06,0,6e-06,6e-06,-1e-06,8e-06,-2.4e-05,8e-06,-1.2e-05,-1e-05,6e-06,1.4e-05,1e-06,4e-06,0,5e-06,-4.1e-05,-9.5e-05,2.1e-05,5e-06,2.6e-05,-2e-06,-1.1e-05,5e-06,-1.8e-05,3e-06,-1.1e-05,-2e-06,-3e-06
4e-06,1e-05,3.6e-05,1e-06,1e-05,-1e-06,5e-06,-2e-06,2e-06,7e-06,1e-06,1.3e-05,-4.8e-05,-4e-06,4e-06,-2.1e-05,9e-05,1.4e-05,-4.7e-05,1.7e-05,0.000105,-2e-06,4e-05,-1.4e-05,3e-05,-8e-06,7.1e-05,-3.8e-05,-2.8e-05,-1.2e-05,-2.8e-05,-0.000101,-1.2e-05,3.7e-05,4e-06,8.8e-05,4.7e-05,3.3e-05,7e-06,7.2e-05,-1.8e-05,3.4e-05,3.4e-05,-1.2e-05,-3e-06,-5.3e-05,1e-06,1e-06,1.1e-05,5e-06,1e-05,-7e-06,5e-06,-1.5e-05,2.9e-05,-3e-06,-1.7e-05,9e-06,5e-06,6e-06,1.1e-05,2e-06,2e-06,-1.3e-05,3e-06,-1.1e-05,4e-06,-4e-06,-4e-06,-1e-05,0,-2e-06,-3e-06,1e-06,2.2e-05,3e-06,3e-06,-3e-06,3e-06,2e-06,-6e-06,-1e-06,3e-06,-1e-06,-3e-06,2e-06,-1e-06,3e-06,2e-06,3e-06,-2e-06,-2e-06,-1e-06,0,8e-06,-4e-06,1.9e-05,-3e-06,1.8e-05,1e-06,1e-06,1.3e-05,-5e-06,-1.4e-05,4e-06,2e-06,0,2e-06,3.6e-05,7.8e-05,4.1e-05,3e-06,-2.7e-05,-2e-06,-1.3e-05,0,-1.3e-05,1e-06,2.3e-05,-1e-06,-1e-06
7e-06,-1.1e-05,-5.9e-05,2e-06,-4e-06,0,9e-06,-2e-06,3e-06,-7e-06,-1e-06,-8e-06,4.6e-05,3.3e-05,-1.7e-05,1.1e-05,-6.3e-05,0,1.6e-05,-2.9e-05,-5.9e-05,-3e-06,-2.9e-05,-9.4e-05,1e-06,0.000126,-6.8e-05,3.3e-05,-1e-05,5e-06,9.2e-05,7.3e-05,-1e-05,-1.9e-05,-1.5e-05,-0.000123,2e-06,-2.9e-05,-4.2e-05,-6.3e-05,8e-06,9.5e-05,2e-06,6e-06,5e-06,6.6e-05,9e-06,-2e-06,-1.1e-05,-7e-06,-1e-05,7e-06,-7e-06,2.2e-05,0,1e-05,5e-06,-7e-06,1e-06,1e-06,-3e-06,2e-06,9e-06,9e-06,-2e-06,5e-06,1e-06,3e-06,0,6e-06,-1e-06,3e-06,-4e-06,-1e-06,-1.9e-05,-7e-06,0,1e-06,-7e-06,0,3e-06,-1e-06,3e-06,0,0,1e-06,5e-06,0,2e-06,-2e-06,0,4e-06,1e-06,1e-06,4e-06,-6e-06,-2.5e-05,9e-06,-1e-05,-1.4e-05,-2e-06,-1.4e-05,1.5e-05,1.3e-05,2e-06,-1.9e-05,2e-06,-3e-06,-1.2e-05,-7.6e-05,4.2e-05,-1.1e-05,0,7e-06,-1.3e-05,-1.8e-05,3e-06,1e-06,2.3e-05,7e-06,2e-06
-2.4e-05,0,5.5e-05,0,-2e-06,-3e-06,1e-06,-3e-06,-5e-06,1e-06,1e-06,-7e-06,-4.4e-05,-3.4e-05,1e-05,-7e-06,-9e-06,2e-05,1.4e-05,-2e-06,-5.7e-05,-8e-06,-3.7e-05,6.3e-05,3e-05,1.5e-05,2.8e-05,6.9e-05,2.2e-05,1.2e-05,-4.5e-05,3.7e-05,9.3e-05,1.1e-05,2e-06,6.3e-05,3.2e-05,5.1e-05,4.1e-05,1e-05,9e-06,-4e-06,-4.7e-05,-1.1e-05,-2e-06,-2.1e-05,1e-06,2e-06,8e-06,-9e-06,-7e-06,-2e-06,-1.2e-05,-5e-06,-1.3e-05,5e-06,-1e-06,2e-06,-4e-06,-5e-06,-2e-06,2e-06,-1e-05,-2e-06,-1e-06,1e-06,-3e-06,2e-06,2e-06,-1e-06,-2e-06,2e-06,5e-06,3e-06,8e-06,3.7e-05,3e-06,-1e-06,-3e-06,-3e-06,-4e-06,0,-6e-06,0,2e-06,1e-06,-5e-06,-1e-06,-1e-06,-1e-06,1e-06,-5e-06,-1e-06,0,1e-06,5e-06,1.1e-05,5e-06,0,1e-05,7e-06,1.2e-05,-2e-06,-1.3e-05,-1e-06,9e-06,1e-06,2e-06,1.5e-05,6.8e-05,8e-06,8e-06,4.7e-05,-5e-06,-8e-06,-2e-06,0,1e-06,1e-05,-4e-06,-9e-06
8e-06,1.9e-05,-4.9e-05,1e-06,4e-06,6e-06,5e-06,-2e-06,-2e-06,0,0,9e-06,9.9e-05,7e-06,0.00011,1.8e-05,2.2e-05,0.000119,-1.2e-05,4.3e-05,5.7e-05,-8e-06,-3.7e-05,-2.8e-05,-6.6e-05,8.5e-05,5.2e-05,-4.4e-05,1.3e-05,-2.1e-05,-4.2e-05,-0.000105,-3.6e-05,-3.3e-05,2.6e-05,5e-06,2.3e-05,-2.8e-05,-3.1e-05,-9e-06,2e-06,-6.4e-05,5.1e-05,3e-06,0,2e-05,5e-06,0,-3e-06,1.4e-05,2e-06,2e-06,-4e-06,4e-06,1e-06,-9e-06,-1.1e-05,-2e-06,9e-06,2e-06,9e-06,-1e-06,0,-2e-06,1e-06,-5e-06,-3e-06,-3e-06,1e-06,-1e-06,3e-06,-2e-06,-1e-06,0,6e-06,0,3e-06,-1e-06,5e-06,-1e-06,1e-06,0,8e-06,2e-06,-1e-06,-1e-06,0,-1e-06,-1e-06,3e-06,2e-06,4e-06,0,-1e-06,-3e-06,0,-8e-06,2e-06,1e-05,1e-05,5e-06,-9e-06,-4e-06,1.2e-05,-6e-06,2e-06,1e-06,-1e-06,0,-3.1e-05,-3.2e-05,1e-06,0,-2e-06,-4e-06,2.2e-05,2.2e-05,1e-06,9e-06,-3e-06,1e-06
2.1e-05,-2.5e-05,4.5e-05,1e-06,-2e-06,-5e-06,2e-06,-1e-06,-1e-06,3e-06,0,-9e-06,-8.9e-05,1e-06,2e-05,2.7e-05,-1e-06,3.1e-05,-7.2e-05,-1.5e-05,2.5e-05,-3.9e-05,-1.7e-05,-8.5e-05,3.9e-05,2e-06,-7.4e-05,4e-06,-4.7e-05,1.7e-05,-6e-06,7.3e-05,1.4e-05,-4e-06,-2.9e-05,-8e-06,-1.8e-05,-1.9e-05,2.1e-05,-4.3e-05,-1.7e-05,-4e-05,-9e-06,5e-06,5e-06,-4.5e-05,1e-06,1e-06,-3e-06,-1.8e-05,-7e-06,-1e-06,5e-06,3e-06,3e-06,-6e-06,1.1e-05,0,-4e-06,3e-06,-6e-06,-1e-06,5e-06,7e-06,0,5e-06,0,1e-06,-2e-06,0,-3e-06,1e-06,-4e-06,-1e-06,-1.3e-05,-2.2e-05,3e-06,-2e-06,-5e-06,0,0,-1e-06,-8e-06,-2e-06,2e-06,-2e-06,0,2e-06,0,1e-06,1e-06,-2e-06,1e-06,-1e-06,-3e-06,-7e-06,7e-06,4e-06,-1.7e-05,-1.5e-05,-5e-06,8e-06,1e-06,-1.1e-05,-2e-06,-2e-06,0,-3e-06,-2e-05,3.5e-05,-3.9e-05,-1e-06,-2.7e-05,0,6e-06,-1.1e-05,-3e-06,0,4e-06,1e-06,0
-2.2e-05,2e-05,-4.7e-05,-2e-06,5e-06,3e-06,-1e-06,2e-06,-2e-06,-2e-06,0,3e-06,1.9e-05,-6e-06,8.1e-05,-1.3e-05,-3.1e-05,0.00015,-5e-06,-2.6e-05,-5.7e-05,-3.4e-05,3.7e-05,3.6e-05,1e-05,-2.4e-05,3.1e-05,-6e-06,3.8e-05,-1e-05,4.4e-05,1.1e-05,-3e-05,2.4e-05,-1.6e-05,3e-05,-1.6e-05,2.7e-05,-8e-06,5.5e-05,2e-06,1.2e-05,-2.2e-05,6e-06,-5e-06,3.3e-05,1e-06,1e-06,3e-06,1e-06,5e-06,4e-06,8e-06,-1.6e-05,-2.2e-05,2e-06,-1e-06,3e-06,-1e-06,-4e-06,1e-06,0,-4e-06,-4e-06,-2e-06,-1e-06,0,-2e-06,2e-06,-1e-06,4e-06,3e-06,1e-06,0,1.3e-05,1.4e-05,1e-06,-2e-06,3e-06,0,-2e-06,0,8e-06,-1e-06,2e-06,1e-06,1e-06,0,0,-2e-06,0,-1e-06,-1e-06,1e-06,-2e-06,-5e-06,1.2e-05,-9e-06,1.8e-05,0,1e-05,-4e-06,-9e-06,1.1e-05,3e-06,-9e-06,0,3e-06,2.4e-05,5e-06,-2e-05,-5e-06,-7e-06,-1e-06,8e-06,-3e-06,-6e-06,0,-2.4e-05,-7e-06,-3e-06
1e-06,-9e-06,4.5e-05,-1e-06,2e-06,-2e-06,0,1e-06,1e-06,4e-06,0,2e-06,2.3e-05,5e-06,5.8e-05,3e-06,2.7e-05,6e-06,-9e-06,-1e-05,2.6e-05,-3.1e-05,2.1e-05,-3.9e-05,3e-06,-4.8e-05,2.5e-05,-4e-05,-2.9e-05,9e-06,-6e-06,-8.4e-05,-4.6e-05,-6.9e-05,1.1e-05,-7.5e-05,-1.8e-05,-1.6e-05,2e-05,-4.2e-05,-8e-06,7.5e-05,8e-06,-5e-06,0,-2.5e-05,-6e-06,0,-5e-06,5e-06,-3e-06,-3e-06,2e-06,8e-06,-1.1e-05,8e-06,-5e-06,-2e-06,0,1e-06,1e-06,-1e-06,1e-06,2e-06,0,-5e-06,1e-06,5e-06,-2e-06,4e-06,-4e-06,-1e-06,3e-06,-1e-06,-9e-06,-9e-06,1e-06,-3e-06,4e-06,-1e-06,2e-06,0,-5e-06,2e-06,-3e-06,1e-06,3e-06,0,0,0,-1e-06,-2e-06,1e-06,0,5e-06,0,-1.4e-05,1e-06,-1.5e-05,1.3e-05,1e-06,0,1.2e-05,-1.1e-05,2e-06,-1e-06,0,0,-1e-06,6e-06,7e-06,6e-06,2.8e-05,0,1.2e-05,1.2e-05,-1.3e-05,0,-1.7e-05,1e-06,6e-06
6e-06,5e-06,-2.7e-05,0,-9e-06,2e-06,-4e-06,1e-06,3e-06,-8e-06,0,-1e-06,-8e-06,-3e-06,-2.5e-05,-1.6e-05,1.8e-05,4.3e-05,-3.5e-05,7e-06,9e-06,-1e-05,-4e-06,-4.5e-05,-3.7e-05,-9.5e-05,-9.2e-05,3.3e-05,3e-06,-1e-06,-6.1e-05,2.2e-05,3.5e-05,3.2e-05,2.9e-05,4.5e-05,-3.8e-05,6e-06,-3.2e-05,1.5e-05,-2e-06,-2e-05,2.2e-05,-2e-06,4e-06,3.7e-05,-1e-06,0,4e-06,-6e-06,7e-06,1e-06,-4e-06,-4e-06,6e-06,5e-06,1e-05,2e-06,-3e-06,0,-4e-06,-1e-06,1e-06,-2e-06,2e-06,7e-06,-2e-06,-5e-06,-2e-06,-3e-06,0,-3e-06,0,1e-06,6e-06,-2.6e-05,-2e-06,-3e-06,-3e-06,0,-3e-06,-1e-06,1e-06,0,0,-1e-06,-1e-06,-2e-06,0,0,-2e-06,1e-06,0,-1e-06,6e-06,8e-06,-5e-06,-1.1e-05,8e-06,-6e-06,-3e-06,2e-06,-3e-06,1e-05,0,8e-06,0,-2e-06,-3e-05,1.2e-05,2.5e-05,-2e-06,-5.3e-05,-3e-06,9e-06,-1.1e-05,-1e-05,0,-1e-05,5e-06,5e-06
7e-06,-3e-06,1.1e-05,-1e-06,6e-06,-5e-06,-3e-06,1e-06,-1e-06,5e-06,0,5e-06,-8e-06,1.2e-05,2.3e-05,1e-06,-5.1e-05,1e-06,2.4e-05,1.7e-05,-5.2e-05,0,1e-06,3.5e-05,1.8e-05,-2.4e-05,6.3e-05,1.5e-05,3.6e-05,-3e-06,9e-06,4.3e-05,3e-06,-7e-06,1e-06,-3e-06,-3e-06,-5e-06,3.6e-05,-1.9e-05,1.3e-05,-1.7e-05,-2.9e-05,-1e-06,-3e-06,-2.9e-05,2e-06,-1e-06,-3e-06,-2e-06,4e-06,-2e-06,-5e-06,6e-06,3e-06,-6e-06,-5e-06,-5e-06,3e-06,0,3e-06,0,-4e-06,0,1e-06,-5e-06,-2e-06,1e-06,4e-06,3e-06,2e-06,-5e-06,-3e-06,1e-06,-4e-06,8e-06,1e-06,-2e-06,4e-06,1e-06,4e-06,0,2e-06,0,2e-06,1e-06,0,1e-06,0,-1e-06,-1e-06,4e-06,0,0,5e-06,0,4e-06,3e-06,0,-4e-06,1e-06,-7e-06,9e-06,-9e-06,0,-1e-06,0,2e-06,1.8e-05,-1.5e-05,2.6e-05,4e-06,3e-06,-2e-06,4e-06,-5e-06,2.7e-05,-1e-06,-1.3e-05,-6e-06,0
-1e-05,-1e-06,-6e-06,0,-6e-06,8e-06,-5e-06,-1e-06,0,-6e-06,0,-3e-06,-4.3e-05,-1e-05,-5.2e-05,7e-06,3.3e-05,-6.9e-05,-2e-06,-4e-06,6.2e-05,1.7e-05,-1.9e-05,-4.2e-05,1.2e-05,-3.2e-05,1e-06,2.6e-05,-2.7e-05,6e-06,3.1e-05,-4.5e-05,3e-05,-1.2e-05,-3.6e-05,-6e-06,1.5e-05,3e-06,-3.1e-05,-1.5e-05,0,-5.7e-05,2e-06,-5e-06,1e-06,2.1e-05,-2e-06,1e-06,1e-06,0,-1e-06,1e-06,-2e-06,6e-06,-5e-06,-5e-06,1e-06,3e-06,1e-06,-2e-06,0,0,0,-1e-06,-1e-06,2e-06,0,2e-06,-1e-06,-5e-06,-1e-06,-1e-06,2e-06,1e-06,0,-1e-06,-2e-06,0,0,-2e-06,-4e-06,1e-06,-4e-06,-2e-06,0,-1e-06,-3e-06,1e-06,0,0,0,-3e-06,0,1e-06,3e-06,-3e-06,1.1e-05,-2e-06,-9e-06,4e-06,-1e-06,9e-06,-5e-06,9e-06,2e-06,-1.1e-05,0,-1e-06,6e-06,1.2e-05,7e-06,-7e-06,1.9e-05,0,-4e-06,3e-06,3e-06,-1e-06,9e-06,1e-06,-6e-06
-9e-06,1.4e-05,1.7e-05,1e-06,5e-06,-8e-06,-4e-06,-1e-06,1e-06,7e-06,0,-2e-06,6.9e-05,6e-06,-5.8e-05,-1.4e-05,-6e-06,-1.8e-05,0,-2e-06,8e-06,9e-06,-1e-05,-4.6e-05,1e-05,9.4e-05,-6.7e-05,1e-06,2e-06,-7e-06,6e-06,-1.4e-05,-3.3e-05,-1.2e-05,1e-05,2.6e-05,1.1e-05,1.9e-05,1.6e-05,4.5e-05,2e-06,3.2e-05,3.4e-05,5e-06,0,-2.8e-05,0,0,1e-06,-3e-06,-2e-06,-3e-06,4e-06,-1.4e-05,9e-06,2e-06,5e-06,-3e-06,0,1e-06,-2e-06,1e-06,4e-06,4e-06,-1e-06,3e-06,2e-06,-1e-06,1e-06,3e-06,3e-06,4e-06,1e-06,-1e-06,6e-06,1e-06,-1e-06,1e-06,-3e-06,-1e-06,4e-06,0,6e-06,0,-2e-06,0,3e-06,0,0,1e-06,1e-06,1e-06,-1e-06,0,-2e-06,-1e-06,-8e-06,6e-06,1.4e-05,1e-06,-2e-06,-1e-05,3e-06,-9e-06,-1e-06,5e-06,0,-1e-06,-1.1e-05,-3e-05,-1.7e-05,4e-06,7e-06,0,-8e-06,-2e-06,-4e-06,0,1.5e-05,4e-06,-2e-06
