0.004495,0.004615,0.004856,0.005334,0.005183,0.004422,0.004355,0.004548,0.005208,0.005858,0.006016,0.005985,0.005719,0.005838,0.005916,0.00593,0.006054,0.005764,0.005338,0.0055,0.005578,0.005295,0.005367,0.005917,0.006245,0.00545,0.004555,0.004789
0.005554,0.005743,0.006022,0.006686,0.006632,0.005632,0.005418,0.005588,0.006394,0.007238,0.007445,0.007346,0.007024,0.007138,0.00726,0.007351,0.007453,0.007094,0.006595,0.006813,0.006974,0.006584,0.006584,0.007321,0.007799,0.00679,0.005652,0.005942
0.007172,0.007546,0.007905,0.008871,0.00908,0.007751,0.007205,0.007326,0.008323,0.009387,0.009665,0.009413,0.008975,0.009084,0.009279,0.009644,0.009817,0.009244,0.008603,0.008915,0.009195,0.008596,0.008392,0.009401,0.010158,0.008884,0.007454,0.00781
0.007974,0.008695,0.00905,0.010117,0.010701,0.00926,0.008305,0.008468,0.009519,0.010422,0.010715,0.010266,0.009644,0.009886,0.010193,0.011008,0.011476,0.010426,0.009647,0.010085,0.010389,0.009697,0.009256,0.010213,0.011029,0.009772,0.008469,0.00887
0.008043,0.009229,0.009397,0.01021,0.010973,0.009693,0.008549,0.008871,0.009778,0.010416,0.010875,0.010217,0.009158,0.009443,0.009995,0.011461,0.012321,0.010476,0.009539,0.010247,0.01047,0.009925,0.009491,0.00977,0.010136,0.009208,0.008455,0.008884
0.008467,0.009777,0.009556,0.010073,0.010704,0.009607,0.008519,0.008978,0.009764,0.010534,0.011166,0.010233,0.008804,0.008818,0.009841,0.012317,0.013257,0.010461,0.009244,0.010114,0.010341,0.010176,0.00998,0.00932,0.00902,0.008649,0.008491,0.008853
0.009291,0.010034,0.009603,0.010186,0.010549,0.009463,0.008727,0.009426,0.010242,0.01143,0.011633,0.010313,0.009092,0.008646,0.010027,0.01401,0.015185,0.011259,0.009379,0.010225,0.010657,0.010494,0.010361,0.00981,0.009206,0.008913,0.00916,0.0094
0.009799,0.009951,0.009719,0.010486,0.01081,0.009744,0.009222,0.010271,0.011359,0.01287,0.012622,0.010758,0.009708,0.009289,0.011105,0.0164,0.017729,0.012645,0.010022,0.010457,0.011134,0.010929,0.010563,0.010602,0.010007,0.009409,0.009926,0.010292
0.01074,0.010533,0.010396,0.011228,0.011643,0.010742,0.010713,0.012274,0.013683,0.014869,0.01414,0.011877,0.010835,0.010951,0.013426,0.019616,0.021116,0.01528,0.012047,0.011717,0.012201,0.012067,0.011492,0.011911,0.011546,0.010625,0.011163,0.011983
0.012581,0.012206,0.011784,0.012772,0.013535,0.012742,0.01317,0.015433,0.017177,0.017236,0.016024,0.013832,0.01309,0.013695,0.016137,0.0233,0.025626,0.018907,0.014983,0.014198,0.014632,0.014518,0.013576,0.014378,0.014394,0.013315,0.013771,0.014985
0.014528,0.014199,0.013018,0.014297,0.015955,0.015053,0.01508,0.01798,0.020736,0.019656,0.017711,0.015969,0.015831,0.016741,0.018554,0.02668,0.029952,0.021652,0.017123,0.017024,0.018076,0.017812,0.016446,0.017675,0.017907,0.016663,0.017094,0.018818
0.015716,0.015529,0.013907,0.015269,0.017531,0.016246,0.01539,0.018628,0.022761,0.021312,0.018548,0.017436,0.017871,0.018989,0.020234,0.028257,0.031595,0.022233,0.017568,0.018853,0.020926,0.020195,0.018128,0.019567,0.019983,0.018595,0.019419,0.021769
0.014921,0.01487,0.013615,0.015257,0.017835,0.016362,0.014389,0.016808,0.021163,0.020135,0.017333,0.016765,0.017426,0.018779,0.019457,0.025621,0.028476,0.020011,0.015808,0.018187,0.020844,0.019323,0.016685,0.018109,0.018922,0.017638,0.018622,0.020898
0.012928,0.012734,0.012185,0.014139,0.016354,0.015398,0.013276,0.013695,0.016559,0.016618,0.014398,0.01382,0.01446,0.015907,0.016207,0.019323,0.021231,0.015902,0.013109,0.015506,0.017806,0.015825,0.012794,0.013559,0.014988,0.014596,0.014985,0.01592
0.010968,0.010697,0.010773,0.012117,0.01293,0.01265,0.011453,0.011205,0.012896,0.012968,0.01116,0.011044,0.011992,0.013064,0.013245,0.014035,0.014575,0.012457,0.011567,0.013502,0.015397,0.01367,0.010412,0.009901,0.011584,0.012276,0.011621,0.011262
0.009577,0.00919,0.009904,0.010703,0.010153,0.009917,0.009967,0.010885,0.012686,0.012073,0.009967,0.010178,0.011518,0.011682,0.011751,0.012292,0.011834,0.011009,0.011122,0.012796,0.015099,0.013761,0.011034,0.010016,0.01095,0.0119,0.010852,0.010414
0.010503,0.009922,0.011025,0.012215,0.011666,0.010598,0.011075,0.013794,0.016346,0.01575,0.013181,0.012825,0.013842,0.013006,0.013507,0.015646,0.015151,0.013489,0.012762,0.013886,0.016777,0.016639,0.014753,0.012955,0.012975,0.013824,0.013414,0.013577
0.014009,0.013518,0.015061,0.017367,0.017135,0.014842,0.014861,0.018896,0.022165,0.021817,0.018845,0.018051,0.018775,0.017157,0.018029,0.022102,0.022513,0.019867,0.017654,0.017409,0.019987,0.021333,0.020369,0.017883,0.017489,0.018028,0.018348,0.019158
0.018614,0.018256,0.02025,0.02375,0.023934,0.020754,0.020265,0.024743,0.02742,0.027161,0.024607,0.023654,0.024125,0.022482,0.023658,0.028713,0.030135,0.027068,0.023581,0.022282,0.024827,0.026922,0.025436,0.022428,0.022572,0.023074,0.023664,0.02485
0.022772,0.022205,0.023959,0.02811,0.028848,0.025251,0.024764,0.028844,0.028969,0.028532,0.027943,0.027067,0.0268,0.026305,0.028851,0.03341,0.034163,0.031141,0.027524,0.025975,0.028457,0.030494,0.028274,0.025088,0.025485,0.026463,0.02724,0.028111
0.025084,0.024648,0.025728,0.02948,0.030442,0.026537,0.026416,0.029806,0.027201,0.026264,0.027097,0.026149,0.025806,0.027412,0.031261,0.03406,0.032826,0.030646,0.028682,0.027638,0.029456,0.030363,0.028488,0.02616,0.02631,0.027765,0.027444,0.027145
0.026344,0.028209,0.028696,0.028999,0.029062,0.025188,0.024262,0.026952,0.026256,0.025971,0.024518,0.022565,0.022887,0.025359,0.029579,0.031823,0.02983,0.027737,0.027239,0.027632,0.029373,0.029737,0.028554,0.026739,0.02709,0.028644,0.025941,0.025453
0.026965,0.033001,0.033317,0.028324,0.027227,0.024567,0.020753,0.023368,0.029064,0.029929,0.024086,0.020652,0.021404,0.02264,0.026007,0.028805,0.026836,0.023472,0.024728,0.029906,0.03221,0.03234,0.03097,0.026987,0.027917,0.03076,0.026652,0.026497
0.027659,0.037502,0.03738,0.027807,0.02556,0.024344,0.01977,0.023561,0.03263,0.033401,0.025608,0.021542,0.02322,0.024284,0.024784,0.025266,0.024842,0.022931,0.024949,0.032429,0.034773,0.035144,0.033421,0.027698,0.029214,0.032992,0.028782,0.028967
0.025749,0.035463,0.034634,0.024873,0.021854,0.021131,0.018565,0.023593,0.031298,0.030393,0.023253,0.019555,0.022747,0.025304,0.023172,0.022056,0.023319,0.022718,0.024022,0.0312,0.035082,0.034346,0.031006,0.025813,0.027609,0.03062,0.026999,0.027243
0.020978,0.026161,0.024563,0.019098,0.016891,0.016098,0.017012,0.022619,0.025632,0.021859,0.016821,0.014526,0.01845,0.02282,0.020043,0.017699,0.019604,0.020978,0.020776,0.024871,0.030432,0.02938,0.024051,0.021482,0.02378,0.025268,0.023797,0.023117
0.01818,0.018033,0.016302,0.015715,0.015173,0.014579,0.018304,0.023937,0.024833,0.019477,0.014092,0.011552,0.014359,0.021176,0.02044,0.015601,0.016169,0.020613,0.019774,0.018712,0.022358,0.022565,0.018668,0.018479,0.02152,0.023408,0.023737,0.021738
0.022267,0.019711,0.016281,0.0171,0.01653,0.016147,0.020286,0.024196,0.025003,0.022102,0.017125,0.013339,0.014605,0.021562,0.021753,0.01558,0.015564,0.021534,0.022078,0.018839,0.018471,0.021191,0.022301,0.021116,0.020403,0.020744,0.021829,0.021581
0.029057,0.025422,0.020181,0.021573,0.020381,0.020622,0.025131,0.025825,0.02377,0.023073,0.020807,0.01862,0.020176,0.024868,0.023962,0.016961,0.016723,0.022385,0.025534,0.024149,0.02173,0.02573,0.029417,0.026128,0.021071,0.018595,0.018912,0.022604
0.039559,0.03518,0.028046,0.029055,0.027737,0.027522,0.034252,0.034392,0.027059,0.02418,0.024352,0.02699,0.03146,0.032833,0.029013,0.020485,0.019184,0.024925,0.031342,0.033159,0.02997,0.032379,0.035059,0.032322,0.027511,0.02462,0.024837,0.030554
0.053051,0.048683,0.040001,0.03937,0.03623,0.034909,0.045213,0.047952,0.03745,0.029146,0.027017,0.035639,0.0452,0.044162,0.037399,0.025463,0.020579,0.027797,0.03967,0.04496,0.040387,0.035697,0.036935,0.040002,0.03713,0.03414,0.03444,0.041542
0.062175,0.058398,0.049895,0.046324,0.040553,0.039502,0.052161,0.05819,0.046149,0.032825,0.027531,0.040386,0.054556,0.052519,0.043131,0.028224,0.020711,0.028673,0.044457,0.053405,0.048183,0.033632,0.033754,0.044972,0.044668,0.041004,0.040156,0.04773
0.058407,0.055783,0.050034,0.043862,0.03616,0.0365,0.048608,0.057138,0.04686,0.032011,0.024325,0.037002,0.052081,0.050188,0.040267,0.02539,0.019,0.026321,0.040655,0.051545,0.048586,0.030231,0.028922,0.042675,0.044054,0.03963,0.036686,0.043165
0.041119,0.039859,0.038091,0.032479,0.025281,0.0267,0.035446,0.043994,0.041513,0.028702,0.017515,0.026115,0.037404,0.036623,0.029697,0.019279,0.015987,0.019802,0.028989,0.03845,0.040314,0.02737,0.024056,0.034142,0.035,0.029949,0.025281,0.029405
0.020973,0.020735,0.021782,0.021556,0.017793,0.019487,0.024884,0.028111,0.032464,0.025263,0.012746,0.015048,0.019861,0.021239,0.020577,0.015492,0.013379,0.014205,0.019712,0.023949,0.027097,0.020945,0.019808,0.02887,0.028143,0.021853,0.015487,0.017494
0.010735,0.011363,0.013841,0.015748,0.014749,0.016699,0.020249,0.018397,0.022099,0.020544,0.011409,0.009652,0.010177,0.013233,0.015281,0.01458,0.01281,0.013959,0.0169,0.017314,0.018867,0.014007,0.0166,0.024232,0.023652,0.019172,0.013019,0.015203
0.008471,0.009987,0.013277,0.013863,0.011194,0.012263,0.01546,0.014866,0.015942,0.015088,0.011451,0.01076,0.01021,0.010765,0.011284,0.012851,0.011469,0.012607,0.013957,0.014193,0.013938,0.009838,0.013661,0.016998,0.01655,0.015367,0.012024,0.015142
0.0066,0.007719,0.011046,0.012176,0.00863,0.007355,0.010315,0.012971,0.013997,0.012784,0.012953,0.01355,0.011926,0.011368,0.009446,0.010122,0.010505,0.01113,0.01117,0.012404,0.011524,0.008056,0.01043,0.011728,0.011237,0.01139,0.011311,0.013604
0.00575,0.005055,0.007489,0.010332,0.008599,0.005826,0.007488,0.010781,0.012948,0.013604,0.015162,0.014508,0.011984,0.011566,0.009903,0.009407,0.012937,0.012587,0.010884,0.011776,0.00938,0.006105,0.008822,0.012215,0.010576,0.010496,0.010438,0.010946
0.006538,0.004464,0.005403,0.007885,0.008273,0.005591,0.007107,0.011519,0.014158,0.016337,0.016232,0.012757,0.010363,0.010924,0.011258,0.010257,0.015922,0.016041,0.013254,0.011489,0.007824,0.00493,0.007559,0.013889,0.013261,0.012493,0.010619,0.009014
