0.000206,6e-05,1.7e-05,5.8e-05,9.7e-05,0.000179,3.4e-05,0.00012,8.9e-05,8.3e-05,0.000159,7.5e-05,4.5e-05,0.000164,1.3e-05,0.000132,4e-06,6.7e-05,3.4e-05,0.000143,8.2e-05,0.000115,1.5e-05,9.5e-05,9e-05,8.9e-05,1.5e-05,3.2e-05,0.00018,0.000117,2.9e-05,9e-06,5e-06,6e-06,4e-06,0.000217,0.000115,0.00015,9.3e-05,9.3e-05,9.1e-05,1.8e-05,3.4e-05,2.8e-05,0.00023,0.000119,6.2e-05,4.8e-05,6.4e-05,3.9e-05,1.2e-05,5.8e-05,1.3e-05,0.000104,0.000126,1.1e-05,1.7e-05,4e-06,7.9e-05,3.9e-05,3.3e-05,2e-06,5.5e-05,0.000123,6.5e-05,2e-06,5.5e-05,0.000145,3.6e-05,2.1e-05,0.000148,1e-06,6.4e-05,5e-06,4.7e-05,6.6e-05,3.9e-05,6.7e-05,6.2e-05,8.7e-05,8.7e-05,2.2e-05,4.2e-05,5.4e-05,2.8e-05,6.5e-05,0,8.5e-05,0.000134,0.000171,7.4e-05,5.2e-05,2.8e-05,1.1e-05,7.1e-05,2e-06,4.9e-05,8.7e-05,7.8e-05,5.1e-05,3.2e-05,5.3e-05,0.000121,3.5e-05,4.2e-05,9.7e-05,0.000181,3.3e-05,2e-05,9.2e-05,0.000114,5.5e-05,2.4e-05,4.1e-05,9.6e-05,0.000114,5.7e-05,9e-06,6e-05,7e-06,1.3e-05
0.000442,0.000142,2.6e-05,0.000134,0.000164,5e-04,0.000133,0.000257,0.000252,0.000167,0.000236,0.00018,0.000109,0.000344,8.7e-05,0.000367,6.4e-05,0.000206,9.7e-05,0.000353,2e-04,0.000217,5.8e-05,0.000279,0.000149,0.000189,6.9e-05,1e-04,0.000324,0.000305,0.000179,0.000142,0.000124,4.5e-05,4.5e-05,0.000496,0.000298,0.000257,0.000275,0.000106,0.000187,5.5e-05,5.1e-05,7.2e-05,0.000464,0.00021,0.000212,0.000108,0.000217,7.6e-05,6.6e-05,0.000199,0.000145,0.000136,0.000266,0.000197,0.000196,1.8e-05,0.000221,0.000171,9.6e-05,0.000128,0.000132,0.000187,0.000145,7.6e-05,9.6e-05,0.000222,4.4e-05,0.000131,0.000311,0.000126,0.000314,8.1e-05,0.000179,0.000135,2.1e-05,8.9e-05,0.000175,0.000202,0.000163,5.4e-05,0.000136,2.8e-05,2.5e-05,0.000192,7e-05,0.000232,0.000285,0.000401,0.000164,0.000115,8.8e-05,6.7e-05,0.00013,0.000124,0.000102,0.000214,0.000118,0.000133,6.8e-05,0.000145,0.000295,0.00014,0.000192,0.000187,0.000428,0.000158,2.4e-05,0.000157,0.000246,0.000159,7.2e-05,0.000152,0.000208,0.000262,9.5e-05,2.9e-05,0.000123,0.000131,2.1e-05
0.000754,0.000378,8.3e-05,0.000193,0.000524,0.000747,0.000269,0.000317,0.000399,0.000396,0.000506,7.2e-05,0.000264,0.000253,0.000246,0.000461,0.000245,0.000536,0.000518,0.000543,0.000438,0.000674,0.000262,0.000498,0.000324,0.00021,0.000251,0.000216,0.000499,0.000275,0.000146,0.000334,0.000379,0.000231,0.00038,0.000662,0.00031,0.000126,6.2e-05,0.000241,0.000301,0.00024,0.00015,0.000208,0.000801,0.000489,0.00031,0.000278,0.000342,0.00044,0.000368,0.000265,0.00049,0.000236,0.000482,0.000373,1.8e-05,0.000159,0.000289,0.000306,0.000153,0.000202,0.000151,1e-04,5.2e-05,0.000419,0.000342,0.000268,0.000292,0.00023,0.000515,0.00023,0.000474,0.000302,0.000338,0.000189,0.00042,0.000157,0.000267,0.000485,0.000243,3.4e-05,0.000156,0.00018,0.000177,0.000203,0.000146,0.000272,0.000533,0.000423,0.000238,0.000304,0.000177,0.000151,0.000316,0.000348,0.000328,0.000438,9.2e-05,2.5e-05,0.000106,0.000261,0.000422,0.000237,0.000149,0.000184,0.000519,0.000128,0.000173,9.2e-05,0.000318,0.000266,0.000154,0.000278,0.000174,2e-04,0.000187,2.8e-05,0.000191,0.00034,0.000366
0.000392,0.000178,0.00026,6.4e-05,0.000902,0.00023,0.000279,8.7e-05,0.000214,0.000319,0.001042,0.000472,0.000366,0.000609,0.000579,0.000253,0.000196,0.000864,0.000176,0.000352,0.000265,0.000935,0.000476,0.000495,0.000735,0.000417,1e-04,0.000241,0.000637,0.000231,0.000409,0.000727,0.000561,0.00021,0.000527,0.000966,0.000555,0.000373,0.000403,0.000239,0.000594,0.000716,0.00073,0.000322,0.000966,0.000849,0.000618,0.000436,0.000152,0.000647,0.000131,0.000538,0.000289,0.00053,0.000469,0.000504,0.000645,0.000419,0.000277,0.000431,0.000476,0.000425,0.000425,0.000356,0.00025,0.000649,0.00028,0.000637,0.000734,0.000736,0.000259,0.000728,0.000376,0.000439,0.000165,0.000159,0.000527,0.000462,0.000226,0.000427,0.000343,0.000214,0.000329,0.000423,3e-04,0.000229,0.000508,0.000314,0.00041,0.000776,0.000995,0.000494,0.000296,0.000113,0.000294,0.000301,0.00064,0.000304,0.000585,0.000427,0.000359,0.00033,0.000418,0.000275,0.000376,0.000432,0.000745,0.000519,0.000403,0.000557,0.000405,0.000251,0.000144,0.00026,0.000584,0.00052,0.000249,0.000339,1.9e-05,0.000226,0.000538
0.00124,0.000894,0.00052,0.000544,0.000916,0.001479,0.000817,0.000717,0.000521,0.000875,0.000749,0.00043,0.00058,0.000275,0.00118,0.000636,0.00015,0.000714,0.000723,0.001206,0.000313,0.000893,0.000631,0.000479,0.000437,0.000569,0.000356,0.000477,0.001103,0.000963,0.000365,0.000702,0.000538,0.000621,0.000506,0.000676,0.000659,0.000657,0.000643,0.000196,0.000671,0.000662,0.000263,0.000462,6.3e-05,0.000319,0.000599,0.001005,0.00114,0.00126,0.001124,0.000392,0.000416,0.000707,0.001014,0.000572,0.000535,0.000469,0.000244,0.000545,0.000398,0.00084,0.000114,0.00049,0.000349,0.000913,0.000555,0.000668,0.000953,0.000951,0.000285,8e-04,0.001238,0.000339,0.000179,0.000226,0.000622,6.5e-05,0.000213,0.00029,0.000545,0.000752,0.000739,0.000323,0.000453,0.00039,0.000554,0.000413,0.000256,0.000801,0.001328,0.000752,0.00058,0.000698,0.000369,0.000392,0.000439,0.000772,0.001079,0.000432,0.000336,0.000488,0.000875,0.000553,0.00039,0.000388,0.000413,0.000596,0.00029,0.000514,0.000306,0.000109,0.000394,0.000449,0.000731,0.00095,0.00077,0.000107,0.00021,0.000168,0.000787
0.00121,0.001238,0.00098,0.000464,0.000784,0.000556,0.000637,0.000684,0.000259,0.00055,0.000625,0.000521,2.8e-05,0.000412,0.000939,0.000608,0.000264,0.000144,0.000204,0.00092,0.000892,0.000126,0.000205,0.000205,0.000759,0.000141,0.000465,0.000519,0.000975,0.000752,0.000723,0.000375,0.000389,0.000925,0.000568,0.000168,5e-05,0.000617,0.000576,0.000988,0.000837,0.000331,0.000408,0.000389,0.00098,0.000934,0.000527,0.000841,0.000792,0.000699,0.000207,0.000291,0.000886,9.9e-05,0.000169,0.000298,0.000711,5.8e-05,0.00016,0.000341,0.000586,0.000535,0.000513,0.000693,0.000615,0.000741,0.000442,0.000512,0.000413,0.000305,0.000442,0.000657,0.000315,0.000387,0.000246,0.000323,0.000102,0.000203,0.000224,6e-05,0.000338,0.000516,0.000246,0.000317,0.000232,0.000185,0.000517,0.000383,0.000344,0.000919,0.000191,0.000176,0.000456,0.000406,0.000517,0.000446,0.000209,0.000571,0.000132,0.000353,0.000275,0.000535,0.000681,0.000556,0.000246,0.000444,0.000261,0.000191,0.000608,0.000198,0.000226,6e-06,0.000416,0.000381,0.000679,0.000474,0.000168,1.3e-05,0.000201,0.000324,0.00065
2.3e-05,0.000501,0.000781,0.000619,0.000695,0.001226,0.000516,0.001118,0.000147,0.000402,0.000629,0.001042,5.2e-05,0.000227,0.000178,0.000276,0.00042,0.000728,0.000235,0.000947,0.00068,0.000399,0.000145,0.000233,0.000705,0.000418,0.000388,0.000101,0.000462,0.000676,0.000327,0.000539,0.000185,0.001023,0.000231,0.000892,0.00099,0.000378,0.000351,0.000619,0.000714,0.000313,0.000509,0.000858,0.000939,0.000323,0.00101,0.00021,0.00039,0.000247,0.000427,0.000634,0.000915,0.000435,0.000836,0.000302,0.000435,0.00056,0.001012,0.000563,0.000566,0.000697,0.00058,0.000323,0.000144,0.000296,0.000368,0.000519,0.00048,0.000157,0.000179,0.00014,0.000269,0.00033,0.000141,0.000447,0.000534,0.000236,0.000248,0.000325,0.000561,0.000239,0.000604,0.000162,0.000269,0.000529,0.000747,0.000376,0.000516,0.000579,0.000697,0.000478,0.000425,8.9e-05,0.000519,0.000102,0.000385,0.000269,0.000238,0.00019,0.000227,0.000388,0.000242,0.00022,0.000309,0.000216,0.000335,0.000405,0.000704,7.1e-05,0.000514,0.000467,0.000336,0.000431,0.000308,0.000267,0.000387,0.000219,0.000186,0.000531,0.000503
0.001564,0.001651,0.001013,0.000601,0.000752,0.002127,0.001546,0.000484,0.001214,0.000619,0.001297,0.00211,0.001249,0.000426,0.000924,0.000303,0.001061,0.001903,0.001472,0.001868,0.002634,0.000876,0.000579,0.000501,0.001345,0.000213,0.000294,0.000297,9.6e-05,0.000749,0.000394,0.000664,0.000733,0.001317,0.001802,0.002215,0.001762,0.000865,0.000327,0.000699,0.001552,0.000859,0.00081,0.001345,0.001766,0.001134,0.001174,0.000554,0.000158,0.00039,0.000765,0.001352,0.001753,0.001112,0.001198,0.000896,0.000637,0.000622,0.001097,0.00064,0.000974,0.000757,0.000387,0.001127,0.000984,0.000739,0.000129,0.000647,0.000426,0.000589,0.000568,0.000541,4.5e-05,0.000309,0.000223,0.000365,0.00066,0.000286,0.000797,0.000935,0.001086,0.001066,0.000725,0.000997,0.00015,0.000985,0.00105,0.000569,0.000135,0.000873,0.000461,0.000428,0.000603,0.000523,0.000313,0.000557,0.000606,0.000482,0.000477,0.000358,0.00065,0.000824,0.000869,0.000573,0.000141,0.000827,0.000796,0.000695,0.000519,0.000741,0.000661,0.000368,0.00017,0.000399,0.000775,0.000599,0.001083,0.00052,0.000459,0.000995,0.000782
0.002566,0.001922,0.00339,0.003113,0.000738,0.002924,0.002405,0.00096,0.001984,0.002403,0.002888,0.004416,0.003207,0.001541,0.00186,0.001718,0.001614,0.003545,0.002538,0.000141,0.002268,0.002073,0.001707,0.000539,0.001355,0.001887,0.00162,0.001406,0.000978,7.5e-05,0.000615,8.6e-05,0.000619,0.001455,0.00155,0.001054,0.002276,0.003081,0.001641,0.001574,0.001665,0.001885,0.000986,0.001573,0.001169,0.000569,0.000521,0.000686,0.000392,0.00079,0.000848,0.002451,0.002301,0.001157,0.000254,0.001449,0.001559,0.000617,0.001569,0.001466,0.00222,0.002389,0.001842,0.001934,0.001458,0.001472,0.00088,0.000387,0.00138,0.001659,0.001135,0.000533,0.000777,0.000344,0.000513,0.00045,0.001485,0.001471,0.001847,0.002124,0.001218,0.000465,0.001394,0.001306,0.001122,0.001793,0.001548,0.001407,0.000782,0.001155,0.000751,0.001393,0.000589,0.000409,0.00052,0.000405,0.000124,0.000498,0.000905,3e-04,0.000823,0.000777,0.000338,0.001026,0.001484,0.000888,0.00131,0.00065,0.001157,0.001384,0.001417,0.001169,0.000887,0.000613,0.000926,0.000994,0.001486,0.001665,0.000724,0.000869,0.00025
0.00124,0.00135,0.002721,0.000994,0.000921,0.002313,0.001089,0.001852,0.001771,0.000761,0.001241,0.001997,0.000853,0.001468,0.000714,0.000356,0.002551,0.001306,0.000801,0.000448,0.001255,0.00037,0.00168,0.001224,0.000667,0.001671,0.000815,0.000958,0.000617,0.000468,0.00133,0.001387,0.001057,0.000859,0.000554,0.000473,0.001164,0.001272,0.000953,0.001506,0.000291,0.001623,0.000944,0.000755,0.000332,0.000628,0.000274,0.000521,0.000561,0.001314,0.001304,0.00171,0.000177,0.00029,0.000152,0.001162,0.000597,0.000283,0.001525,0.000746,0.001281,0.00035,0.00109,0.000763,0.000187,0.000907,0.00081,0.000514,0.001011,0.000715,0.000475,0.000552,0.001228,0.000387,0.000371,0.000545,0.001297,0.000927,0.000734,0.00052,0.000568,0.000898,0.000909,0.000267,0.000427,0.000918,0.00038,0.000424,0.000423,0.001259,0.001207,0.001178,0.001101,0.001054,0.000761,0.000831,0.000468,0.000407,0.000428,0.001442,0.001079,0.000445,0.000467,0.000882,0.000754,0.001576,0.000553,0.000444,0.001505,0.000436,0.00074,0.000334,0.000261,0.000745,0.000418,0.00027,0.001395,0.000969,0.000549,0.000317,0.000436
0.000174,0.001627,0.000401,0.002315,0.002439,0.002426,0.000927,0.001532,0.000881,0.000513,0.000487,0.001175,0.000643,0.001152,0.001279,0.000752,0.002197,0.002922,0.002008,0.001136,0.001576,0.001384,0.002167,0.00072,0.000516,0.000545,0.000842,0.001103,0.000402,0.001375,0.001964,0.001882,0.000903,0.001089,0.000582,0.001022,0.001071,0.00113,0.001017,0.00112,0.000748,0.001206,0.000789,0.000472,0.000953,0.001293,0.001221,0.001264,0.00095,0.000492,0.001402,0.001813,0.000984,0.000278,0.001144,0.000995,0.001596,0.001077,0.001276,0.000594,0.000453,0.000627,0.000649,0.000842,0.000899,0.000381,0.000885,0.001131,0.001145,0.000298,0.000376,0.001007,0.001331,0.001428,0.000866,0.000933,0.00149,0.000602,9.3e-05,0.00038,0.000611,0.000837,0.00098,0.000684,0.000526,0.00063,0.000824,0.000915,0.001148,0.001426,0.001832,0.001383,0.000128,0.000653,0.001164,0.00116,0.000581,0.000874,0.001353,0.002275,0.001697,0.001582,0.001451,0.000432,0.001221,0.000732,0.001052,0.001303,0.000622,0.001163,0.001036,0.000704,0.00031,0.000643,0.000186,2.9e-05,0.001248,0.000869,0.00088,0.00091,0.000413
0.00016,0.001108,0.001215,0.001665,0.000846,0.000422,7e-06,0.000856,0.000231,0.000528,0.000981,0.000752,0.000567,0.000283,0.000714,0.000846,0.000492,0.001171,0.000443,0.000412,0.001132,0.001305,0.000208,0.000342,0.000208,0.00035,0.000633,0.000367,0.000763,0.001046,0.000395,0.000923,0.000456,0.001015,0.000854,0.001208,0.001192,0.000972,0.000276,0.000991,0.000325,0.001022,0.000595,0.000646,0.000809,0.000356,0.001053,0.000643,0.000377,0.000516,0.000594,0.00071,0.000523,0.000761,0.000823,0.000375,0.001062,0.000564,0.000159,0.000681,0.000691,0.001035,0.00043,0.000309,0.000813,0.000636,0.001162,0.001102,0.000198,0.000186,0.000604,0.000923,0.000307,0.000756,0.000437,0.000612,0.000628,0.00044,0.00035,0.000424,0.000522,0.001227,0.000756,0.000992,0.000806,0.000777,0.000484,0.00051,0.000909,0.000707,0.001128,0.00052,0.000706,0.000955,0.000773,0.000787,0.000492,0.000836,0.00094,0.00075,0.00034,0.001007,0.000775,0.000748,0.000552,0.000568,0.001023,0.000764,0.000977,0.000345,0.000667,0.000509,0.000532,0.000293,8.7e-05,3.9e-05,0.000788,0.000418,0.000107,0.000345,0.00047
0.000272,0.000365,0.000542,0.000199,0.000255,0.000558,0.000113,0.00044,0.000219,0.00039,0.000439,0.000295,0.000258,0.000291,0.000427,0.00041,8.1e-05,0.000716,0.000196,9.6e-05,0.000666,0.000511,0.000262,0.000124,0.000351,0.000109,0.000405,0.000239,0.000402,0.000352,0.000121,0.000336,0.000264,0.000284,0.000281,0.000788,0.000344,0.000203,0.000459,0.000555,0.000182,0.000144,0.00025,0.000285,8.8e-05,0.000479,0.000283,0.000568,0.000252,0.000333,0.000164,0.000166,7.1e-05,0.000316,0.000607,0.000271,0.000291,0.000167,0.000188,0.000502,0.000373,0.000411,5.2e-05,0.000279,0.000633,0.000358,0.000344,0.000273,0.000485,0.000119,0.000349,0.000804,0.000441,0.000285,0.000259,0.000365,0.000219,0.000257,0.000306,0.000244,0.000241,0.00046,0.000368,0.000257,0.000407,0.000438,0.000201,0.000458,0.000155,0.000706,0.000257,0.000262,0.000108,0.000265,0.000202,0.000297,0.000285,0.000268,0.000427,0.000499,0.000412,0.000238,3.4e-05,0.000276,0.000154,0.000425,0.000323,0.000255,9.6e-05,0.000622,0.000211,0.000266,0.000271,0.000322,1.3e-05,6.6e-05,0.000354,0.000176,7.2e-05,0.000168,0.000189
0.000266,0.000187,0.000203,4.9e-05,1.9e-05,0.000395,0.000126,0.000399,0.000177,0.000199,0.000226,0.000158,0.000154,0.000219,0.000391,0.000366,6.4e-05,0.000413,0.000216,0.000158,0.000524,0.00041,0.000188,0.000121,0.000227,8.2e-05,0.000434,0.000225,0.000313,0.000258,0.000125,8.4e-05,0.000272,0.000208,0.000221,0.000512,0.000299,1.4e-05,0.00026,0.000498,0.000145,0.000226,0.000303,0.00011,0.000234,2e-04,0.000159,0.000475,0.000247,0.000175,0.000179,1e-04,0.000111,0.000288,0.000487,0.000212,0.000359,0.000204,0.00033,0.000451,0.000252,0.000227,0.000118,0.000446,0.000555,0.00031,0.000142,0.000139,0.000492,0.000284,9.9e-05,0.000467,0.00045,0.000343,0.000318,0.00026,0.000171,0.000122,0.000152,0.000247,0.00014,3e-04,0.000261,0.000318,0.000404,0.000367,0.000235,0.000214,0.000261,0.000589,0.00028,0.000243,0.000196,0.000269,6.6e-05,0.00029,0.00011,0.000218,0.000268,0.000245,0.000293,0.000165,0.000228,0.000313,0.000171,0.000262,7.6e-05,0.00025,0.00012,0.00047,0.00011,0.000255,0.000217,0.000373,4.8e-05,0.000143,0.000221,0.000121,7e-05,3.3e-05,7.1e-05
0.000152,0.000146,0.00013,0.000179,0.00024,0.000268,0.000133,0.000463,0.000212,0.000159,0.000395,0.000162,0.000244,0.000308,0.000609,0.000364,0.000203,0.000292,0.000363,9e-05,0.000602,0.000415,4.1e-05,0.000226,0.000147,0.000162,0.000577,3.2e-05,0.000444,8.5e-05,5e-05,0.000124,0.000294,0.000261,0.00031,0.000605,0.000153,0.000396,0.000577,0.000475,0.000468,0.000307,0.000219,4.2e-05,0.000272,0.000393,0.000471,0.000621,0.000374,0.000264,0.000123,0.000266,0.000463,6e-04,0.000636,0.000244,0.000326,0.000185,0.000289,0.000293,0.000303,0.000112,0.000131,0.000348,0.000354,0.000491,0.000188,0.000185,0.000618,0.000296,0.000371,0.000385,0.000328,0.000487,0.000281,0.000485,0.000172,0.000216,0.000419,0.000365,4e-05,0.000194,0.000515,3.9e-05,0.00016,0.000266,0.000106,0.000428,1.5e-05,0.00038,0.000387,0.00035,0.000459,0.000219,0.000302,0.000122,0.000262,0.000314,0.000157,0.000127,0.000407,6.4e-05,0.000361,0.000646,0.000368,5.3e-05,0.000219,0.000291,0.000117,5e-04,0.000204,0.000124,6.2e-05,0.000377,1.2e-05,0.00016,0.000195,0.000127,0.000128,0.000126,0.000111
0.000452,0.000767,0.000757,0.000868,0.000205,0.00049,0.000227,0.000421,0.000472,0.000165,0.000444,0.000519,0.000568,0.000496,0.000469,0.000565,1.9e-05,0.000146,0.000264,0.000437,0.000744,0.000265,0.000642,0.000295,0.000486,0.000152,0.000917,0.000791,0.000685,0.000498,0.000262,0.000731,0.000289,0.000304,0.000556,0.000497,0.000337,0.00081,0.000444,0.000362,0.000366,0.000359,0.000175,0.000295,0.000443,0.000947,0.000227,0.000733,0.000543,0.000263,0.000145,0.000451,0.000456,0.000928,0.00054,0.000464,0.000636,0.000125,0.000872,0.000636,0.000334,0.000478,0.000156,0.000599,0.000659,0.000639,0.000432,0.000204,0.000283,0.000494,6.9e-05,0.000729,0.000547,0.000622,0.000815,0.000843,0.000502,0.000368,0.000703,0.00026,0.000547,0.000362,0.000963,0.000507,0.000435,0.000573,0.000241,0.000827,0.000495,0.000685,0.000361,0.000811,0.000671,0.000216,0.000631,0.000176,0.000383,0.000205,0.000233,0.000268,0.000435,0.000501,0.000227,0.00072,6.6e-05,0.000541,0.000147,0.000699,0.000489,0.000602,0.000403,0.000161,0.000241,0.00072,0.000374,0.00046,0.000503,0.000166,0.000173,0.000404,0.00026
0.000887,0.001143,0.001028,0.000829,0.000905,0.000164,0.000208,0.000433,0.000869,0.000808,0.000606,0.000976,0.001126,0.001525,0.00141,0.001157,0.001136,0.000943,0.000743,0.000815,0.001019,0.001127,0.001347,0.001182,0.001257,0.000472,0.001372,0.001992,0.001228,0.000768,0.000696,0.000902,0.000649,0.000136,0.001069,0.000932,0.000772,0.001419,0.001834,0.001159,0.000459,0.000923,0.000538,0.000556,0.000885,0.00156,0.001723,0.00156,0.001899,0.001529,0.000462,0.000829,0.001167,0.002416,0.001879,0.000739,0.000928,0.000802,0.000942,0.001348,0.00116,0.000385,0.000591,0.000993,0.001336,0.000626,0.001263,0.001584,0.000744,0.000765,0.000893,0.001114,0.001804,0.001905,0.002077,0.001204,0.000477,0.000307,0.000481,0.000255,0.000612,0.001305,0.001769,0.00132,0.000787,0.00032,0.00075,0.000427,0.001185,0.00144,0.00129,1e-04,0.000574,0.000505,0.001165,0.000854,0.000632,0.000528,0.000332,0.000265,0.000718,0.000313,0.000536,0.001235,0.001375,0.00145,0.001099,0.00146,0.000765,0.000505,0.000646,0.000619,0.000575,0.001276,0.001341,0.000837,0.001037,0.000866,0.000236,0.00052,0.000386
0.001355,0.001638,0.001195,0.000461,0.001356,0.000948,0.000814,0.000868,0.001062,0.000597,0.000946,0.000655,0.000171,0.000785,0.000412,0.000198,0.000696,4e-05,0.00052,0.000654,0.000536,0.001767,0.001852,0.001088,9e-05,0.00039,0.001238,0.001579,0.00123,0.000924,0.000304,0.000465,0.000359,0.00065,0.001332,0.000762,0.000463,0.000762,0.001462,0.000902,0.000492,0.001476,0.001278,0.000571,0.00059,0.000595,0.00083,0.000602,0.00091,0.001068,0.001052,0.001413,0.00113,0.001656,0.002198,0.001479,0.001997,0.001759,0.001074,0.000381,0.000378,0.001318,0.001191,0.00016,0.000392,0.001004,0.002107,0.001126,0.000979,0.000997,0.001244,0.000141,0.001071,0.00216,0.001349,0.00046,0.000565,0.000664,0.001173,0.000843,0.000184,0.000997,0.000564,0.000572,0.000805,0.000953,0.000901,0.001009,0.001831,0.001571,0.000559,0.000644,0.000459,0.000603,0.001271,0.000769,0.00025,0.000248,0.000182,0.000718,0.000559,0.000449,0.000653,0.00103,0.001523,0.000686,0.00087,0.000598,0.000545,0.000561,0.00065,0.000348,0.00016,0.000968,0.001102,0.000963,0.000115,0.000371,0.000349,0.000174,0.000488
0.000891,0.001869,0.001011,0.000832,0.000938,0.000637,0.000615,0.00048,0.000538,0.000609,0.000646,0.001049,0.000562,0.000108,0.000246,0.000457,0.000453,0.000632,0.000193,9.4e-05,0.000579,0.001252,0.000257,0.000652,0.000558,0.000592,0.000942,0.000145,0.000794,0.000534,0.001139,0.001033,0.000459,0.000765,0.000384,0.000793,0.000412,0.00029,8e-04,0.000731,0.001067,0.000333,0.000857,0.000474,0.00071,0.000855,0.000117,6.3e-05,0.000678,0.000447,0.000557,0.00055,4e-04,0.00099,0.000789,0.000435,0.001025,0.000507,0.000345,0.000408,0.000215,0.000835,0.00012,0.000268,0.000237,0.000682,0.000776,0.000808,0.000791,0.000112,0.000529,0.000547,0.000147,0.001181,0.000507,0.000106,0.000315,0.000172,0.000721,0.00054,0.000409,0.000136,0.000745,0.000257,0.00072,0.000502,0.00018,0.000322,0.000883,0.000435,0.000475,8.9e-05,0.000478,0.000738,0.000267,0.000209,0.000131,0.000286,0.000132,0.000824,0.000352,0.000333,0.000323,0.000437,0.00053,0.000433,0.000442,0.000648,0.000384,0.000323,0.000415,0.000249,0.000143,0.000579,0.000167,0.000475,0.000498,0.000195,4.2e-05,0.000142,0.000335
0.000572,0.000575,0.000407,0.000614,0.000307,0.000199,0.000305,0.000574,0.000251,0.000748,0.000385,0.000559,0.000154,0.000192,0.000177,0.000326,0.000219,0.000674,0.000327,0.000317,0.000606,0.000468,8.6e-05,0.000295,0.000239,0.000146,0.000348,0.000111,0.000287,0.000292,0.000664,7.3e-05,0.000198,0.000309,0.000246,0.000158,0.000163,0.000163,0.000446,0.000345,0.000529,0.000829,0.000242,0.00021,0.000468,0.000584,0.000522,0.000185,0.000158,0.000297,0.000104,0.000391,0.000187,0.000553,0.000345,0.000403,0.00061,0.000432,0.00046,0.000148,0.000184,0.000414,0.000182,0.00018,0.000367,0.00015,0.000365,0.000552,0.00032,0.000508,0.00037,0.000454,0.00051,0.000302,0.000167,0.000158,8.7e-05,0.000135,0.000442,0.000112,0.000441,0.000332,0.000364,0.00022,0.000117,0.000196,0.000263,0.000283,0.000359,0.000338,7.2e-05,0.000135,0.000231,0.000213,9.3e-05,0.000132,0.000142,1.7e-05,0.000138,0.000765,0.000389,0.000364,9.2e-05,0.000248,8.6e-05,4.8e-05,0.00029,0.000442,0.000208,0.000263,0.000373,0.000161,9.2e-05,0.000265,0.000138,0.000241,0.000169,0.000144,0.00029,0.000211,0.000267
0.000147,0.000619,0.000362,0.000184,9.6e-05,0.000114,2.7e-05,0.000292,0.000278,0.000502,0.000189,0.000193,9.3e-05,0.000255,5.3e-05,9.1e-05,0.000249,0.000295,5.1e-05,0.000171,0.000416,0.00054,0.000343,2e-04,7.3e-05,1e-04,0.000297,0.000162,0.000394,0.000238,0.000327,0.000279,0.000197,0.00039,0.000227,0.000141,0.000118,0.000227,4.5e-05,0.000192,0.000376,0.000238,0.000288,7.5e-05,0.000206,9.1e-05,0.000116,0.000107,0.00026,0.000271,7.8e-05,0.000143,0.000385,0.000461,0.000333,0.000202,0.000296,0.00044,0.000429,0.00034,0.000208,0.000312,6e-05,0.000156,0.000298,0.000335,0.000415,0.00016,0.000303,0.000289,0.000235,0.000246,0.000267,0.000146,0.000237,3e-05,7.4e-05,0.000274,1.3e-05,0.000116,0.000355,0.000133,0.000167,0.000397,0.000287,0.000386,0.000147,0.000103,0.000456,9.3e-05,0.000266,0.000187,0.000141,0.000437,0.000287,3e-05,8.2e-05,9.3e-05,0.000201,0.000111,7.7e-05,0.000117,0.000121,0.000191,0.000301,0.000208,0.000244,6.8e-05,0.000105,0.000231,0.000108,0.000124,0.000127,0.000303,6.4e-05,3.6e-05,0.000217,6.3e-05,0.000209,8e-05,0.000163
0.000245,0.000653,8.2e-05,0.000201,0.000212,0.000132,0.000127,1e-04,8.6e-05,0.000331,0.000214,0.000159,8.7e-05,0.00011,0.000168,0.000148,0.000123,0.000201,0.000105,8.2e-05,0.00031,0.000131,0.000189,0.000149,0.000172,0.000199,0.000322,6.2e-05,0.000277,0.00013,0.000155,9.1e-05,0.000202,0.000129,0.000107,0.000179,5.6e-05,0.000208,0.000119,7.4e-05,0.000185,0.000315,0.000143,0.000168,0.000286,0.000276,8.9e-05,8.8e-05,0.00015,0.000166,0.000107,0.000166,0.00015,0.000294,7.2e-05,0.000141,0.000332,0.000365,0.000281,0.00015,0.000106,0.000236,0.000149,0.000134,9.8e-05,0.000311,7.4e-05,0.000148,9.1e-05,0.000362,0.000246,9e-05,0.000238,7.4e-05,0.000234,0.000166,0.000182,0.000129,0.000143,0.000118,0.000331,7.7e-05,0.000189,0.000263,8.5e-05,0.000182,4.5e-05,0.000137,0.000274,0.000161,5.7e-05,0.000323,5.1e-05,0.000444,6.9e-05,0.000116,5.5e-05,0.000113,0.000176,0.000185,0.000119,0.000212,1.2e-05,0.000186,0.000254,7.8e-05,5.4e-05,0.000113,0.000106,0.000138,0.000141,0.000133,4.2e-05,0.000106,9.8e-05,4.6e-05,5.9e-05,0.000104,5.1e-05,8.6e-05,7.6e-05
6.4e-05,0.000298,4.5e-05,0.000101,2.9e-05,8.3e-05,4.3e-05,4.6e-05,1.3e-05,2.5e-05,4.9e-05,0.000111,8.3e-05,5.8e-05,4.9e-05,5.3e-05,6.8e-05,0.000145,7.8e-05,5e-05,5.9e-05,3.9e-05,0.000118,3.3e-05,7.8e-05,3.6e-05,0.000123,9e-06,8.7e-05,8.3e-05,6e-05,8.1e-05,2.8e-05,5.9e-05,1.2e-05,6.3e-05,2.4e-05,8.4e-05,2.4e-05,5e-05,4.5e-05,7.8e-05,5.9e-05,3.2e-05,4.9e-05,8.2e-05,5.6e-05,4.9e-05,5.8e-05,8.3e-05,2e-05,6.5e-05,5.7e-05,6.2e-05,9.2e-05,0.000101,9.2e-05,0.000145,5.8e-05,2.3e-05,5.4e-05,5.8e-05,3.3e-05,4.4e-05,8.2e-05,0.000155,0.00021,0.000135,5.3e-05,9.4e-05,7.4e-05,3e-05,0.000152,7.1e-05,7.2e-05,1.6e-05,4.7e-05,5.7e-05,0.000108,2.6e-05,0.00016,5.4e-05,9.7e-05,8.1e-05,4.4e-05,8.2e-05,1.4e-05,7.6e-05,0.000142,0.000105,6.3e-05,6.2e-05,6.7e-05,0.00011,2.7e-05,8.3e-05,1.2e-05,4.4e-05,5.1e-05,0.000102,3.9e-05,9.2e-05,5.6e-05,9.7e-05,0.000164,8.7e-05,3.3e-05,8.5e-05,3.1e-05,5.6e-05,5.7e-05,2.2e-05,1.3e-05,2.7e-05,1.6e-05,2.4e-05,5.7e-05,3.3e-05,2.9e-05,1.7e-05,2.4e-05
8.1e-05,0.000262,1.3e-05,9.4e-05,0.000126,9.1e-05,5e-05,1.7e-05,3.7e-05,5.3e-05,7.4e-05,9.4e-05,1.2e-05,9.1e-05,3e-05,4.5e-05,5.4e-05,0.000111,4.3e-05,4.2e-05,9.8e-05,8e-05,0.000103,9.1e-05,3.8e-05,3.6e-05,0.000102,5.4e-05,0.000107,0.000125,0.000102,8e-05,7.7e-05,4.3e-05,3.3e-05,8.3e-05,7.8e-05,8.5e-05,5.5e-05,9e-05,6.7e-05,4.6e-05,5.3e-05,4.1e-05,4.8e-05,5.3e-05,4.7e-05,2.9e-05,8.4e-05,7.5e-05,1.3e-05,1.6e-05,3.5e-05,0.000125,6.6e-05,4.1e-05,3e-05,0.000133,6.7e-05,7.1e-05,1.9e-05,5.7e-05,5.2e-05,8e-05,3.2e-05,0.000149,9.7e-05,2.3e-05,4.9e-05,7.8e-05,6e-05,6.8e-05,6.5e-05,4.1e-05,7.8e-05,7.2e-05,6.4e-05,8.8e-05,7.5e-05,6.7e-05,0.000148,5.4e-05,5.8e-05,0.000103,6.7e-05,8.7e-05,5.3e-05,0.000125,0.000116,2.5e-05,2.9e-05,0.00011,8.2e-05,0.000133,2.1e-05,5.7e-05,5e-05,5.6e-05,7.3e-05,7.3e-05,4e-05,2.2e-05,4.6e-05,9e-05,0.000114,1.4e-05,8.1e-05,4.2e-05,1.6e-05,3.3e-05,8.8e-05,5.1e-05,2.8e-05,2.9e-05,5.6e-05,3.5e-05,6.2e-05,5.4e-05,3.6e-05,3.1e-05,1e-05
2.3e-05,0.000177,4.6e-05,0.000117,0.000128,7.7e-05,3.7e-05,7.4e-05,1.3e-05,2.7e-05,7.1e-05,0.000133,7.6e-05,6e-06,3.2e-05,1.3e-05,4.4e-05,9.4e-05,3.7e-05,1.3e-05,9.6e-05,5e-05,3.4e-05,4.2e-05,3.1e-05,6.9e-05,4.2e-05,4.3e-05,0.000104,7.8e-05,3.6e-05,0.00018,8.5e-05,6.2e-05,5.3e-05,6.1e-05,5.7e-05,0.000124,6.4e-05,0.000124,7.8e-05,6.7e-05,3.6e-05,2.5e-05,7.5e-05,4.3e-05,3.5e-05,4.4e-05,8.6e-05,6.2e-05,1e-06,4.8e-05,9.8e-05,4.9e-05,6e-05,3.6e-05,3.7e-05,0.000137,0.000107,7e-06,3.6e-05,8.8e-05,1.4e-05,7.7e-05,5e-05,8.9e-05,6.9e-05,2e-05,5.6e-05,5.7e-05,3.4e-05,6e-05,9.4e-05,3.5e-05,5.4e-05,6.8e-05,3e-05,7.3e-05,2.9e-05,3.6e-05,5.2e-05,1.9e-05,5e-05,8.4e-05,3.5e-05,7e-05,4.4e-05,8.5e-05,6.5e-05,4.7e-05,2.9e-05,0.000115,3.3e-05,0.00012,4.4e-05,1.1e-05,1.8e-05,2.1e-05,5.9e-05,6.8e-05,3.5e-05,4.2e-05,3.7e-05,0.000113,5.8e-05,2.1e-05,3.4e-05,1.4e-05,2.5e-05,1.6e-05,2.1e-05,1.2e-05,2.7e-05,4.5e-05,1.8e-05,1.9e-05,3.4e-05,3.2e-05,2.5e-05,1.2e-05,2.9e-05
5.1e-05,0.000179,3.1e-05,8.6e-05,5.2e-05,2.8e-05,4.1e-05,3.7e-05,1.9e-05,2.8e-05,3.8e-05,8.9e-05,7.4e-05,2.4e-05,3.2e-05,2.5e-05,5.2e-05,0.000109,5.2e-05,9e-06,4e-05,7.6e-05,2.8e-05,1.8e-05,3.1e-05,2.3e-05,4.6e-05,2.3e-05,6.4e-05,2.1e-05,3.7e-05,0.000105,1.2e-05,5.6e-05,3.4e-05,3.7e-05,1.6e-05,4.1e-05,6.6e-05,5.5e-05,2.4e-05,4.9e-05,3.3e-05,3.1e-05,5.7e-05,6.2e-05,2.8e-05,5.9e-05,0.000103,5.6e-05,1.6e-05,3.7e-05,7.7e-05,7.8e-05,0.000114,3.7e-05,3.2e-05,7.7e-05,3.1e-05,3.3e-05,6.4e-05,8.5e-05,2.9e-05,5.5e-05,4.3e-05,4.9e-05,2.9e-05,4e-05,5.8e-05,7.3e-05,2.8e-05,3.2e-05,6.5e-05,3.6e-05,2.3e-05,2.1e-05,5.7e-05,5.7e-05,3.4e-05,7e-06,7.2e-05,3.1e-05,7.2e-05,8.9e-05,6e-06,4.1e-05,1.1e-05,6.3e-05,6.7e-05,1.7e-05,2.4e-05,9e-05,6.3e-05,7.8e-05,1.3e-05,2.9e-05,1.3e-05,3.4e-05,7.1e-05,4.5e-05,8e-06,5.2e-05,2.3e-05,6.2e-05,4.7e-05,2.2e-05,4.8e-05,4.8e-05,2.1e-05,2.1e-05,1.1e-05,5e-06,2.5e-05,4.1e-05,3.5e-05,2.5e-05,5.1e-05,5e-06,1.1e-05,1.9e-05,6e-06
4.2e-05,0.000192,6e-06,9.1e-05,5.1e-05,2.2e-05,1.6e-05,4.9e-05,3e-05,2.4e-05,5.9e-05,8.7e-05,4e-05,2.8e-05,6e-06,3.4e-05,5.5e-05,0.000102,4e-05,3.4e-05,2.5e-05,5.1e-05,3.5e-05,1e-05,2.7e-05,9e-06,5.2e-05,1.8e-05,4.4e-05,1.8e-05,2.4e-05,8.8e-05,9e-06,4.9e-05,2.8e-05,5.4e-05,2e-05,5.7e-05,7.7e-05,3.5e-05,3.4e-05,3.3e-05,2.8e-05,4.4e-05,2.1e-05,2.3e-05,3.2e-05,3.6e-05,4.7e-05,3.3e-05,4.1e-05,2.6e-05,9.2e-05,2.8e-05,8.8e-05,1.1e-05,5.5e-05,6.3e-05,4.7e-05,2e-05,5.3e-05,7.4e-05,9e-06,5.1e-05,3.1e-05,5e-05,2e-05,4e-05,6.2e-05,5.2e-05,4e-05,1.6e-05,5.6e-05,5.9e-05,1.6e-05,3.6e-05,6e-05,2.1e-05,2.9e-05,1e-05,9.1e-05,2.1e-05,7.1e-05,8.5e-05,9e-06,3e-05,2e-06,5.8e-05,5.7e-05,4.3e-05,1.5e-05,6.4e-05,4.7e-05,7.9e-05,2.2e-05,3.4e-05,1.2e-05,2.7e-05,4.7e-05,5.3e-05,4.4e-05,2.4e-05,1.3e-05,5.4e-05,6.2e-05,2.1e-05,2.4e-05,3.6e-05,1e-05,1.8e-05,2.2e-05,1.4e-05,1.7e-05,3.3e-05,3.5e-05,3e-06,4.9e-05,1.6e-05,2.1e-05,1.3e-05,7e-06
2.4e-05,0.000184,3.2e-05,8.6e-05,4.1e-05,2.5e-05,2.3e-05,5.6e-05,2.7e-05,1.7e-05,4.8e-05,8.4e-05,7e-06,2e-05,7e-06,4.5e-05,4.6e-05,8.3e-05,4.3e-05,3e-05,2.4e-05,6.3e-05,3.8e-05,7e-06,1.1e-05,3.4e-05,4.5e-05,2.7e-05,5.2e-05,2.7e-05,4.7e-05,7.4e-05,2.8e-05,4.1e-05,1.8e-05,4e-05,1e-06,6.1e-05,5.5e-05,2.6e-05,2.9e-05,4.4e-05,5e-06,4.4e-05,1.5e-05,2.7e-05,1.2e-05,2.1e-05,4.6e-05,2e-05,2e-05,1e-05,7.2e-05,4.7e-05,6.9e-05,1.7e-05,2.7e-05,3.3e-05,2e-05,4.9e-05,4.3e-05,6.3e-05,2.8e-05,6.6e-05,4.6e-05,2.5e-05,3.5e-05,2.3e-05,4.7e-05,8.8e-05,7.1e-05,3.8e-05,4.3e-05,6.5e-05,2.7e-05,3.6e-05,2.1e-05,3.7e-05,2.6e-05,4e-06,8e-05,2.9e-05,5.9e-05,6.6e-05,3e-06,4e-05,1.2e-05,3.7e-05,4.8e-05,4.2e-05,2.5e-05,8.5e-05,2.7e-05,7.6e-05,1.5e-05,2e-05,1.5e-05,2.2e-05,5e-05,5.3e-05,3.8e-05,4.6e-05,4e-05,5.5e-05,5.2e-05,5e-06,1.6e-05,5e-06,9e-06,1.9e-05,2.4e-05,5e-06,1.5e-05,1.4e-05,4e-05,2.4e-05,5.3e-05,2.4e-05,1.7e-05,2.3e-05,1.6e-05
3.1e-05,0.00018,1.3e-05,6e-05,5.7e-05,6e-05,1.2e-05,2.9e-05,3.1e-05,1.5e-05,3e-05,8.3e-05,2.9e-05,1.7e-05,1.9e-05,4e-05,1.3e-05,7.8e-05,2.6e-05,3.4e-05,2.9e-05,6.2e-05,1e-05,2.6e-05,6e-06,2.3e-05,6.6e-05,1.1e-05,6.6e-05,1.5e-05,5.3e-05,5.1e-05,1e-05,4.6e-05,2.3e-05,3.2e-05,3.9e-05,5.7e-05,3.4e-05,3.4e-05,8e-06,3.4e-05,6e-06,1.6e-05,2e-05,3.4e-05,2.1e-05,3.4e-05,3.8e-05,4.7e-05,3.1e-05,7e-06,6.6e-05,2.8e-05,7.5e-05,2e-05,3.6e-05,4.5e-05,2e-05,5.1e-05,1.4e-05,6.8e-05,1.9e-05,4.3e-05,3.4e-05,3.4e-05,7.6e-05,1.8e-05,1e-05,4.5e-05,5.8e-05,1.3e-05,2.7e-05,4.6e-05,2.4e-05,2.6e-05,2e-05,4.7e-05,1.4e-05,1.8e-05,6.5e-05,3.1e-05,3.9e-05,7e-05,2.1e-05,3.5e-05,1.4e-05,1.7e-05,5.8e-05,5.3e-05,1.2e-05,9.2e-05,5.7e-05,7.9e-05,1.6e-05,2.2e-05,1.2e-05,1.4e-05,6.3e-05,6.4e-05,4.7e-05,2.7e-05,3e-05,4.1e-05,6.7e-05,7e-06,3.8e-05,1e-05,2.4e-05,1.7e-05,2.1e-05,1.3e-05,1.5e-05,1.9e-05,3.1e-05,1.2e-05,4.5e-05,1.1e-05,4e-06,2.1e-05,9e-06
2.6e-05,0.000147,5.8e-05,5.1e-05,3.5e-05,3.7e-05,4.3e-05,5.5e-05,2.7e-05,2.4e-05,2.5e-05,8.8e-05,5.4e-05,4.7e-05,3.4e-05,2.5e-05,3.6e-05,4.5e-05,6.9e-05,4.6e-05,4.1e-05,5.4e-05,2.8e-05,9e-06,1.7e-05,2.9e-05,4.6e-05,1.8e-05,7.5e-05,5.5e-05,4.3e-05,5.6e-05,1.2e-05,3.9e-05,1.2e-05,2.3e-05,4.4e-05,5.9e-05,2.9e-05,2.7e-05,7e-06,3.3e-05,1.5e-05,1.4e-05,2.1e-05,3.5e-05,1.7e-05,4.4e-05,5.7e-05,1.9e-05,5.2e-05,2.3e-05,4.9e-05,3.5e-05,7.9e-05,3.1e-05,3.3e-05,3e-05,1.5e-05,5.7e-05,4.2e-05,6.7e-05,1.4e-05,4.6e-05,3.3e-05,5.5e-05,3.6e-05,1.9e-05,3.4e-05,5.9e-05,4.7e-05,3e-05,2.6e-05,4.5e-05,1.2e-05,2.2e-05,3.6e-05,3e-05,2.3e-05,3.4e-05,6.2e-05,1.2e-05,4.1e-05,4.9e-05,4.3e-05,6.7e-05,1.1e-05,3.7e-05,5.9e-05,5.2e-05,1.7e-05,9.1e-05,3.3e-05,4.2e-05,1.2e-05,8e-06,1.4e-05,3e-06,3.3e-05,6.3e-05,2.8e-05,4.5e-05,1.3e-05,5.9e-05,4.5e-05,1.8e-05,1.2e-05,1.7e-05,2.8e-05,3.2e-05,2.9e-05,9e-06,1.8e-05,2.7e-05,3.2e-05,1.5e-05,5.6e-05,3.2e-05,1.4e-05,5e-06,1.2e-05
2.7e-05,0.000121,3.5e-05,4.9e-05,1.9e-05,5.9e-05,2.6e-05,3.7e-05,2.2e-05,1.6e-05,2.1e-05,7.7e-05,2.1e-05,3.7e-05,4.7e-05,2e-05,2.4e-05,9.2e-05,6e-06,2.3e-05,2.4e-05,6.1e-05,4.5e-05,4.2e-05,2e-05,3e-06,4.5e-05,2.9e-05,0.000102,1.7e-05,5e-05,7.4e-05,6.9e-05,3.6e-05,3.3e-05,5.9e-05,5.1e-05,1.7e-05,5.5e-05,2e-05,4e-06,2.8e-05,1.9e-05,3.4e-05,2.3e-05,4.9e-05,1.9e-05,3.4e-05,5.5e-05,1.8e-05,4.9e-05,1.6e-05,4.2e-05,1.2e-05,6.2e-05,3.6e-05,4.7e-05,4.7e-05,8e-06,2.6e-05,3.4e-05,7.9e-05,3.8e-05,5.1e-05,1.4e-05,6.3e-05,6.2e-05,1e-05,3.8e-05,5.6e-05,2.5e-05,2e-05,3.3e-05,1.8e-05,3.2e-05,2.6e-05,1.2e-05,3.4e-05,5.9e-05,6.9e-05,8.3e-05,4.9e-05,9.3e-05,7.8e-05,5.1e-05,8e-06,3.8e-05,1.3e-05,6.3e-05,2.9e-05,3.5e-05,7.9e-05,6.4e-05,0.000101,3.7e-05,2.4e-05,3.5e-05,3.3e-05,7.3e-05,5.5e-05,4.4e-05,3.9e-05,2e-05,3.2e-05,2.5e-05,2e-05,2.6e-05,3.1e-05,8e-06,3.1e-05,3.5e-05,3.2e-05,3e-05,2.2e-05,5.9e-05,2.8e-05,7.4e-05,6.4e-05,5.1e-05,4.6e-05,1.5e-05
2.5e-05,0.000143,3e-05,5.6e-05,3.2e-05,2.7e-05,3.3e-05,3e-05,3.4e-05,3.1e-05,1.5e-05,7.2e-05,2.8e-05,4e-05,4.4e-05,3.1e-05,4.2e-05,9.6e-05,1.9e-05,4.7e-05,3.6e-05,7e-05,3e-06,2.2e-05,2.9e-05,2.1e-05,5e-05,4.3e-05,4.8e-05,5.4e-05,7.5e-05,0.000116,7.2e-05,3e-06,5.7e-05,2.5e-05,4.8e-05,6.2e-05,2.7e-05,4.4e-05,8e-06,1.8e-05,1.7e-05,5.4e-05,7.7e-05,8e-06,2.8e-05,2.4e-05,4.2e-05,3e-05,5.1e-05,3.2e-05,7.6e-05,3.5e-05,5.6e-05,4e-06,9e-06,2.9e-05,3.4e-05,4.5e-05,3.6e-05,3.4e-05,1.7e-05,4.9e-05,4.9e-05,3.1e-05,4e-05,1e-05,7.2e-05,9.6e-05,1.8e-05,4e-06,2.7e-05,5.2e-05,1.2e-05,4.6e-05,2.2e-05,5.2e-05,7.2e-05,4.5e-05,7.4e-05,6e-05,5.1e-05,7.7e-05,2.3e-05,2.1e-05,2.2e-05,5.7e-05,5.1e-05,3e-05,4.4e-05,3.1e-05,3.5e-05,7e-05,7e-06,2.3e-05,6.1e-05,3.7e-05,4.3e-05,4.8e-05,3e-06,4e-06,5.3e-05,3.9e-05,4e-05,1.7e-05,2.4e-05,2.4e-05,3.2e-05,1.9e-05,2.7e-05,1e-05,4.4e-05,5.6e-05,2.9e-05,1.7e-05,6.9e-05,4e-05,8e-06,4.4e-05,4.4e-05
4e-05,0.00013,5.6e-05,0.000106,5.4e-05,1.3e-05,2e-06,1.8e-05,2.6e-05,2.8e-05,4.3e-05,0.000146,0.000122,8.2e-05,4.1e-05,1.2e-05,6.7e-05,0.000134,5.6e-05,0.000104,8.9e-05,3.7e-05,2.6e-05,2.5e-05,2.5e-05,1.3e-05,5e-05,3.6e-05,5e-05,4.8e-05,2.3e-05,7.9e-05,9.3e-05,8.6e-05,7.9e-05,5.4e-05,5.5e-05,6.6e-05,5.1e-05,7.7e-05,4.9e-05,5.9e-05,1.6e-05,6.6e-05,3.3e-05,5e-05,5.5e-05,4.9e-05,5.8e-05,2.9e-05,5.2e-05,8.3e-05,0.000148,0.000104,9.5e-05,6.2e-05,8.1e-05,3e-05,8.8e-05,8.1e-05,5.9e-05,6.9e-05,8e-06,1.8e-05,4.8e-05,6.9e-05,3.2e-05,3.1e-05,0.000102,1.8e-05,5.5e-05,2e-05,3.9e-05,5.2e-05,5e-06,7e-05,7.9e-05,0.000101,0.000118,4.1e-05,0.000107,0.000103,8.9e-05,7.9e-05,3.3e-05,2.2e-05,5.2e-05,6.5e-05,6.2e-05,4.6e-05,3e-05,7.7e-05,6.3e-05,9.1e-05,2.3e-05,4e-05,5.2e-05,4.6e-05,5.4e-05,1.7e-05,6.5e-05,6.3e-05,4.7e-05,0.000103,0.000105,3.6e-05,2.3e-05,3e-06,3.1e-05,1.3e-05,3.6e-05,5.6e-05,5.9e-05,1.2e-05,3e-05,1.5e-05,3.6e-05,3.7e-05,6e-05,6.3e-05,5.6e-05
8.9e-05,0.000142,7e-05,8.7e-05,0.000145,0.000119,7.8e-05,3.9e-05,4e-05,3.5e-05,7.2e-05,0.000159,5e-05,1e-05,5.9e-05,7.2e-05,8.2e-05,7.3e-05,7.9e-05,7.7e-05,7.8e-05,9e-05,4e-06,1e-05,5.4e-05,4.5e-05,1.8e-05,1.9e-05,7.7e-05,3e-05,5.3e-05,2.4e-05,7.7e-05,8.8e-05,0.000132,7.2e-05,5.7e-05,4e-05,1.6e-05,7.2e-05,9.5e-05,0.000114,9.6e-05,2.4e-05,5.4e-05,4e-05,6.6e-05,3.5e-05,3.6e-05,3.5e-05,2.2e-05,4.8e-05,0.000187,7.4e-05,4.3e-05,2.2e-05,7.6e-05,6.8e-05,9.1e-05,5.5e-05,6.9e-05,8.3e-05,4.4e-05,2.9e-05,7.6e-05,3.1e-05,3.4e-05,5.4e-05,4.3e-05,3.2e-05,3.4e-05,4.6e-05,5.1e-05,6.7e-05,4.5e-05,7.3e-05,4.8e-05,1.3e-05,1.2e-05,6.8e-05,2.6e-05,6e-05,5e-06,5e-06,5.3e-05,4.2e-05,3.7e-05,4.9e-05,7.5e-05,2.4e-05,3.2e-05,5.2e-05,5.3e-05,3.6e-05,4.8e-05,5.9e-05,6.3e-05,5.7e-05,6.4e-05,7.6e-05,3.3e-05,5.8e-05,6.2e-05,6.5e-05,5e-05,5e-06,3.9e-05,3.7e-05,3e-06,3.7e-05,3e-05,2e-05,2.3e-05,1.5e-05,1.3e-05,5.8e-05,5.8e-05,2.6e-05,3.8e-05,2.7e-05,1.6e-05
4.7e-05,0.000158,5.6e-05,2.8e-05,6.7e-05,3.4e-05,9e-06,2.9e-05,1e-05,1.5e-05,6.2e-05,8e-05,2.8e-05,2.4e-05,4e-05,2.7e-05,7.9e-05,8.5e-05,5.3e-05,2.5e-05,2.5e-05,5.1e-05,5e-06,1.4e-05,3.6e-05,3.3e-05,1.5e-05,3.7e-05,4.5e-05,9e-06,4.7e-05,5.7e-05,3.9e-05,2e-05,8.2e-05,3.9e-05,4.9e-05,4.5e-05,3.5e-05,3.6e-05,5.6e-05,3e-05,3.5e-05,1.7e-05,1.9e-05,2.8e-05,2.2e-05,1.3e-05,4.8e-05,3.6e-05,1.1e-05,4.6e-05,8.4e-05,4.5e-05,5.6e-05,3.1e-05,4.7e-05,2.6e-05,7.1e-05,5.6e-05,1.9e-05,6.5e-05,1.2e-05,3e-05,3.6e-05,3.7e-05,4.1e-05,3.8e-05,2.7e-05,2.2e-05,2.2e-05,2.1e-05,4.4e-05,1.5e-05,5e-05,2.9e-05,3.5e-05,1.1e-05,9e-06,3.3e-05,6.5e-05,1e-05,5.3e-05,3.1e-05,3.7e-05,4.2e-05,4.1e-05,4.7e-05,4.5e-05,2.7e-05,2.8e-05,2.3e-05,5.8e-05,7.2e-05,1.8e-05,2.9e-05,9e-06,3.6e-05,4.3e-05,4.1e-05,3.9e-05,1.7e-05,1.4e-05,5.5e-05,4.2e-05,2.1e-05,2.8e-05,1.8e-05,8e-06,3.4e-05,5e-06,1.4e-05,2.6e-05,9e-06,1.9e-05,3.1e-05,4.3e-05,4e-06,2.3e-05,1.9e-05,1e-05
3.1e-05,0.000123,4.2e-05,3.2e-05,1.2e-05,3.5e-05,1.1e-05,3.4e-05,1.3e-05,1.6e-05,6.9e-05,8.9e-05,2.3e-05,9e-06,2.2e-05,1.8e-05,4.8e-05,6.7e-05,5.2e-05,1.3e-05,3e-05,4.2e-05,3e-05,1.3e-05,2e-05,3e-06,2.3e-05,1.7e-05,4.4e-05,4.1e-05,3.6e-05,6.4e-05,1.4e-05,6e-06,5.5e-05,2.8e-05,1.8e-05,3.7e-05,4.5e-05,3.8e-05,3.7e-05,1.9e-05,4.9e-05,4.5e-05,2.7e-05,2.4e-05,1.1e-05,9e-06,3.7e-05,3e-05,1.9e-05,3.6e-05,6.1e-05,4.2e-05,3.5e-05,2.6e-05,4.4e-05,6.1e-05,7.2e-05,5.5e-05,4.5e-05,3.4e-05,2.8e-05,2.1e-05,3.8e-05,5.1e-05,3.5e-05,1.6e-05,2.5e-05,3.7e-05,2.2e-05,1e-05,2.6e-05,4.2e-05,3.8e-05,2.2e-05,3.4e-05,1.5e-05,1.3e-05,6e-06,7.1e-05,1.5e-05,3.3e-05,2.9e-05,3.2e-05,1.4e-05,6e-06,5.7e-05,6.1e-05,1.7e-05,1.9e-05,3.9e-05,4.2e-05,6.3e-05,2.2e-05,8e-06,1.3e-05,3.2e-05,3.1e-05,4.1e-05,4e-05,7e-06,1.7e-05,4.3e-05,2.4e-05,4e-06,2.2e-05,2.9e-05,8e-06,2.5e-05,2e-05,1.4e-05,3.2e-05,2e-05,2.1e-05,1.6e-05,3.8e-05,1e-06,2.4e-05,1.9e-05,1.3e-05
2e-05,0.000102,2.4e-05,2.6e-05,1.7e-05,2.7e-05,1.1e-05,4.1e-05,1e-05,4.3e-05,7.7e-05,6.1e-05,1.6e-05,2.5e-05,3.6e-05,2.6e-05,4.1e-05,6.8e-05,1.8e-05,2.2e-05,2.1e-05,6.7e-05,2.9e-05,5e-06,1.7e-05,1.2e-05,2.4e-05,1.3e-05,5.7e-05,4e-05,7.6e-05,7.8e-05,4.9e-05,3.5e-05,5.2e-05,2.6e-05,1.5e-05,3.4e-05,4.4e-05,2.6e-05,2.8e-05,2.5e-05,1.9e-05,4.2e-05,3.5e-05,1.2e-05,4e-06,1.2e-05,2.9e-05,2.1e-05,9e-06,3.2e-05,4.4e-05,6.3e-05,7.1e-05,1.5e-05,3.7e-05,7.2e-05,2e-05,6.2e-05,4.2e-05,5.6e-05,3.6e-05,4.9e-05,3.2e-05,3.6e-05,2.5e-05,4.8e-05,6.1e-05,3.7e-05,1.2e-05,2.4e-05,2.1e-05,4.8e-05,1.3e-05,3.3e-05,2.1e-05,1.9e-05,5e-06,2.1e-05,4.3e-05,4e-05,6e-06,5.4e-05,3.7e-05,3.9e-05,1.1e-05,5.7e-05,5.9e-05,4.2e-05,2.7e-05,4.3e-05,2.5e-05,5.3e-05,1.2e-05,1.6e-05,2e-05,2.9e-05,1.8e-05,2.7e-05,1.7e-05,1.8e-05,1.1e-05,3.8e-05,4.8e-05,3.3e-05,2.1e-05,2.3e-05,1.5e-05,1.5e-05,2.8e-05,1e-05,3.3e-05,5e-06,1.7e-05,3.4e-05,2.9e-05,1.5e-05,3.2e-05,9e-06,9e-06
7e-06,0.000108,1.9e-05,7e-06,3.3e-05,5.1e-05,2e-05,4.6e-05,2e-05,5.3e-05,3.5e-05,7.5e-05,4.5e-05,3.1e-05,2.7e-05,3.1e-05,2.1e-05,6.5e-05,3.1e-05,1.6e-05,1.9e-05,4.2e-05,3.5e-05,2.4e-05,3e-06,3e-05,2.2e-05,2.3e-05,4e-05,3.1e-05,2.9e-05,4e-05,2.3e-05,1.6e-05,2.8e-05,2.2e-05,1.4e-05,3.6e-05,3.7e-05,4.6e-05,1.8e-05,3.8e-05,1.8e-05,3.9e-05,3e-05,3.2e-05,8e-06,9e-06,4.1e-05,1.5e-05,1.9e-05,1.9e-05,2.5e-05,3.4e-05,3.2e-05,1.7e-05,2.2e-05,4.4e-05,3.1e-05,2e-05,4.1e-05,5.4e-05,2.2e-05,3e-05,4.3e-05,4.1e-05,3.7e-05,2e-05,3.2e-05,1.9e-05,6e-06,4.2e-05,4.3e-05,2e-05,2.8e-05,2.8e-05,4.4e-05,2.5e-05,3e-05,1.9e-05,4.6e-05,1.9e-05,4.2e-05,3.1e-05,2.3e-05,3e-06,1.1e-05,2e-05,7.1e-05,2e-05,1.8e-05,3.3e-05,2.7e-05,6.6e-05,2.5e-05,1.7e-05,6e-06,3.1e-05,3.9e-05,4e-05,1.4e-05,7e-06,1.5e-05,3.6e-05,5.4e-05,1.9e-05,3.3e-05,1e-05,7e-06,2e-05,7e-06,6e-06,1.2e-05,1.6e-05,3.4e-05,2.7e-05,3.6e-05,1.3e-05,1.9e-05,6e-06,4e-06
2.3e-05,9.8e-05,2.4e-05,7e-06,3.9e-05,1.6e-05,1.3e-05,2.7e-05,2.1e-05,1.7e-05,2e-05,3.5e-05,1.4e-05,9e-06,3e-06,1.5e-05,7e-06,4.6e-05,3.2e-05,1.1e-05,2.1e-05,4.6e-05,2.5e-05,2.7e-05,2.4e-05,2e-05,3e-05,3.7e-05,6.1e-05,2.8e-05,4.1e-05,2.8e-05,8e-06,1e-05,2.8e-05,2e-05,2e-05,4.1e-05,1.9e-05,2.5e-05,1.1e-05,1.5e-05,3.9e-05,8e-06,1.3e-05,1.5e-05,1e-05,4e-06,4e-05,1.6e-05,2e-05,2.8e-05,4.6e-05,2.7e-05,3.5e-05,1.1e-05,1.5e-05,3.1e-05,2.5e-05,2.1e-05,4.7e-05,4.7e-05,1.4e-05,4.6e-05,4.3e-05,4.3e-05,3.9e-05,4e-06,2.7e-05,4.9e-05,1.6e-05,2.1e-05,7e-06,2.4e-05,1.6e-05,1.7e-05,4.3e-05,1e-05,2.3e-05,1e-05,5.3e-05,1.3e-05,5.5e-05,5.5e-05,5e-06,2.1e-05,1.4e-05,3.7e-05,6.4e-05,4e-05,4e-06,3.8e-05,2.1e-05,5.4e-05,1.5e-05,1.4e-05,1.2e-05,2.7e-05,3.4e-05,4.7e-05,2.6e-05,1.4e-05,6e-06,3.4e-05,4.6e-05,3e-06,2.1e-05,7e-06,7e-06,2.4e-05,1.4e-05,1.1e-05,1.5e-05,1.8e-05,8e-06,4e-06,4.2e-05,1.2e-05,2.6e-05,1.2e-05,4e-06
8e-06,0.000106,1.6e-05,7e-06,2.9e-05,1.8e-05,3e-06,2.9e-05,1.3e-05,2e-05,2.3e-05,5.7e-05,1.1e-05,1.7e-05,1.6e-05,1.2e-05,3e-05,5.5e-05,2.5e-05,6e-06,1.7e-05,5e-05,1e-05,7e-06,8e-06,1e-05,3.2e-05,2.3e-05,5.2e-05,1.3e-05,4.4e-05,3.7e-05,1e-06,1.6e-05,3e-05,1.6e-05,7e-06,3.6e-05,2.7e-05,2.1e-05,6e-06,1.1e-05,1.9e-05,3e-06,7e-06,2.6e-05,9e-06,7e-06,3.3e-05,2.1e-05,4e-06,1.9e-05,4.5e-05,2.5e-05,3.5e-05,6e-06,2.5e-05,3.6e-05,2.5e-05,3.3e-05,3.6e-05,4.1e-05,3e-06,2.8e-05,4e-05,3.7e-05,3.3e-05,2.5e-05,2.1e-05,2.9e-05,2.9e-05,1.4e-05,1.7e-05,1.9e-05,2e-05,2e-05,4e-05,1.9e-05,1.4e-05,1.7e-05,5.3e-05,1.5e-05,5.4e-05,3.4e-05,4e-06,2.6e-05,3e-06,4e-05,4e-05,2.5e-05,1e-05,3.9e-05,2.8e-05,5e-05,1.7e-05,6e-06,2e-06,2.7e-05,2.5e-05,3.3e-05,2.7e-05,7e-06,5e-06,3.3e-05,6.2e-05,1.2e-05,1.6e-05,1.6e-05,9e-06,2.7e-05,1e-05,9e-06,1.5e-05,1.5e-05,1.3e-05,1.5e-05,4.4e-05,2e-06,2.1e-05,1.2e-05,4e-06
1.9e-05,0.000114,7e-06,5e-06,3e-05,2.1e-05,2e-06,2.5e-05,1e-05,1.3e-05,2.5e-05,6.1e-05,1.2e-05,1.3e-05,6e-06,9e-06,2.8e-05,6.6e-05,2.7e-05,8e-06,1.4e-05,5.1e-05,7e-06,1.1e-05,1.8e-05,1.2e-05,2.7e-05,2.1e-05,4.6e-05,1.5e-05,3.9e-05,4.2e-05,5e-06,1.8e-05,3.8e-05,1.7e-05,1.1e-05,3.9e-05,2.4e-05,1.9e-05,1.6e-05,1.3e-05,2.9e-05,8e-06,5e-06,2.4e-05,1.1e-05,4e-06,3.3e-05,2.2e-05,7e-06,2.2e-05,4.3e-05,2.1e-05,3.8e-05,1.2e-05,2e-05,3.6e-05,2.1e-05,3e-05,4.1e-05,4.6e-05,6e-06,3.2e-05,4.2e-05,3.6e-05,3.5e-05,2.1e-05,1.8e-05,2.6e-05,1.9e-05,3e-06,1.1e-05,2.6e-05,1.6e-05,8e-06,2.9e-05,1.2e-05,1.3e-05,1.4e-05,5e-05,1.5e-05,4.1e-05,3.4e-05,4e-06,2.3e-05,4e-06,3.5e-05,4.2e-05,3.2e-05,4e-06,4e-05,2.9e-05,5.2e-05,1.3e-05,8e-06,5e-06,2.4e-05,2.9e-05,2.8e-05,3.5e-05,1.7e-05,7e-06,2.8e-05,5.2e-05,9e-06,1.7e-05,1.5e-05,9e-06,3e-05,9e-06,1.2e-05,1.1e-05,1e-05,1e-05,1.6e-05,4e-05,6e-06,2e-05,8e-06,2e-06
1.9e-05,0.000111,1e-05,1.4e-05,3.2e-05,1.8e-05,2e-06,2.6e-05,1.1e-05,1.8e-05,2.7e-05,6e-05,9e-06,8e-06,4e-06,8e-06,2.5e-05,6.3e-05,3.3e-05,6e-06,8e-06,5.2e-05,9e-06,8e-06,1.5e-05,1.4e-05,2.7e-05,2.6e-05,4.7e-05,1.3e-05,3.9e-05,4.2e-05,1e-06,1.1e-05,2.8e-05,1.3e-05,1.1e-05,4.1e-05,2.7e-05,2.3e-05,1.5e-05,1.6e-05,2.5e-05,2e-06,5e-06,1.9e-05,1e-06,3e-06,3.2e-05,2.5e-05,9e-06,2.2e-05,4.3e-05,2.3e-05,4.3e-05,1e-05,1.6e-05,3.4e-05,2.4e-05,2.9e-05,3.2e-05,3.9e-05,6e-06,3.2e-05,4.1e-05,3.1e-05,3.4e-05,2.1e-05,2.4e-05,2.6e-05,2.1e-05,5e-06,7e-06,2.7e-05,1.9e-05,1.6e-05,3.2e-05,1.5e-05,1.6e-05,1.5e-05,5.1e-05,1.8e-05,4e-05,3.6e-05,4e-06,2.2e-05,4e-06,3.4e-05,4.5e-05,2.9e-05,6e-06,4.5e-05,2.8e-05,5.1e-05,1e-05,4e-06,2e-06,2.4e-05,3.1e-05,3.5e-05,2e-05,1.4e-05,9e-06,3.2e-05,4.8e-05,7e-06,1.9e-05,1.7e-05,7e-06,2.9e-05,9e-06,7e-06,1e-05,8e-06,1.6e-05,1.7e-05,4e-05,4e-06,2.2e-05,1e-05,4e-06
