0.328128,1.082309,1.119876,0.566605,0.540292,0.60713,0.537741,0.523368,0.617388,0.671012,0.786918,0.901664,0.857946,0.67286,0.362212,0.19797,0.17908,0.156939,0.138541,0.113381,0.089385,0.085168,0.073966,0.054023,0.038997,0.036341,0.070578,0.116994
0.410729,1.299707,1.303823,0.647572,0.630748,0.690875,0.611135,0.609328,0.728142,0.807524,0.940138,1.075184,1.02382,0.787196,0.417107,0.228998,0.20567,0.179813,0.159339,0.131263,0.104516,0.099619,0.086121,0.063452,0.046891,0.043707,0.083697,0.135324
0.55453,1.637284,1.556484,0.753107,0.783812,0.832708,0.734076,0.759448,0.922364,1.051029,1.207751,1.362865,1.290316,0.963555,0.495845,0.271737,0.237895,0.206497,0.185852,0.156519,0.126929,0.11962,0.102025,0.076208,0.059222,0.055546,0.103811,0.159864
0.659047,1.783401,1.598704,0.759635,0.901106,0.968463,0.86121,0.929732,1.131626,1.319032,1.507122,1.633769,1.4914,1.071697,0.531365,0.28481,0.236616,0.205276,0.194808,0.169907,0.138002,0.125582,0.105568,0.080148,0.067211,0.063871,0.113493,0.163424
0.686658,1.644454,1.403311,0.68934,1.012211,1.184244,1.070464,1.181973,1.438493,1.663868,1.816226,1.842494,1.620509,1.125514,0.53025,0.270677,0.215626,0.192272,0.194875,0.170589,0.134208,0.118955,0.100425,0.076922,0.069786,0.068809,0.113028,0.149538
0.689465,1.322118,1.059769,0.605422,1.174979,1.58988,1.50932,1.64438,1.986073,2.220369,2.184299,2.002284,1.729491,1.181992,0.533668,0.259316,0.202549,0.185873,0.18698,0.160014,0.123393,0.110719,0.098307,0.077709,0.072698,0.077297,0.117021,0.140961
0.771595,1.1249,0.818179,0.663351,1.644891,2.516223,2.553932,2.641365,3.067947,3.369285,3.076298,2.634925,2.285771,1.560701,0.708149,0.330844,0.250948,0.234613,0.217292,0.175762,0.140964,0.139298,0.131811,0.103231,0.089189,0.101827,0.145449,0.157639
0.927216,1.306524,0.936893,0.914168,2.637191,4.353755,4.586608,4.504574,4.999376,5.503555,5.015199,4.24173,3.692716,2.558651,1.18511,0.552112,0.425138,0.389432,0.341758,0.269342,0.222829,0.230982,0.218599,0.164639,0.132694,0.15039,0.207365,0.216198
1.039917,1.648124,1.23783,1.28175,4.163932,7.243429,7.816309,7.554983,8.07881,8.653082,7.826114,6.585155,5.804291,4.116328,1.902701,0.890757,0.718846,0.644611,0.549954,0.434733,0.357923,0.362285,0.337819,0.253878,0.202212,0.218597,0.286128,0.300738
1.09531,2.089442,1.678159,1.737227,6.042678,10.892956,12.074668,11.816958,12.091512,12.19764,10.765344,8.976256,8.17848,5.989564,2.696304,1.269558,1.102081,0.969176,0.793821,0.631467,0.514027,0.494844,0.456292,0.356597,0.294852,0.298642,0.358529,0.38304
1.1651,2.645531,2.251849,2.224424,7.781673,14.216569,16.108173,16.123499,15.718421,14.808625,12.72888,10.507605,10.106711,7.644552,3.284149,1.568776,1.470117,1.271146,0.985558,0.786653,0.63409,0.575493,0.532472,0.445721,0.388658,0.368541,0.400292,0.436331
1.304517,3.181065,2.724574,2.461971,8.416723,15.371701,17.605958,17.936037,16.653719,14.84482,12.63557,10.369565,10.617236,8.233655,3.366498,1.621589,1.607286,1.38599,1.035359,0.830812,0.652519,0.553423,0.526803,0.474141,0.429572,0.390959,0.397268,0.437803
1.34355,3.297661,2.777874,2.198299,7.165383,12.996995,14.910452,15.307763,13.652735,11.857396,10.346908,8.655872,9.078935,7.039594,2.864541,1.373066,1.349261,1.171696,0.884683,0.720486,0.533373,0.42099,0.422076,0.400644,0.364919,0.328489,0.34683,0.385353
1.1112,2.675123,2.202602,1.515607,4.565366,8.212368,9.506786,9.754055,8.388487,7.316985,6.855486,6.057895,6.079784,4.582827,1.956295,0.898181,0.818514,0.717934,0.578642,0.483355,0.332081,0.248,0.262474,0.252324,0.223393,0.210894,0.263087,0.29615
0.69414,1.61618,1.325842,0.951051,2.732463,4.630079,5.295308,5.288057,4.331838,3.827767,3.758508,3.507301,3.269376,2.335907,1.074658,0.480229,0.384159,0.330793,0.294709,0.256653,0.171053,0.122648,0.127844,0.119573,0.105244,0.123368,0.196045,0.225845
0.350265,0.855703,0.811862,0.831899,2.28188,3.454422,3.628492,3.340821,2.556679,2.294913,2.249042,2.117138,1.915162,1.264302,0.565389,0.275974,0.210923,0.169375,0.148365,0.130795,0.098165,0.078279,0.073279,0.065418,0.066926,0.107834,0.182462,0.221314
0.222915,0.592015,0.695451,0.94445,2.402854,3.246273,3.028486,2.657908,2.021654,1.845065,1.910103,1.889343,1.670464,1.137234,0.547095,0.261629,0.197974,0.148618,0.110098,0.097034,0.092328,0.08608,0.071063,0.061349,0.073393,0.134578,0.237279,0.293975
0.211004,0.542701,0.721639,1.170195,2.914454,3.688251,3.094754,2.631217,2.114157,1.976683,2.131452,2.321378,2.137221,1.545299,0.81211,0.380714,0.262835,0.182972,0.137646,0.129727,0.130692,0.115994,0.090401,0.075482,0.089228,0.173476,0.327168,0.408158
0.222464,0.548887,0.822109,1.468901,3.625486,4.493998,3.4796,2.874943,2.530186,2.376055,2.452691,2.858992,2.921138,2.238158,1.183568,0.579564,0.378583,0.23676,0.182099,0.182239,0.18487,0.149536,0.121081,0.104309,0.111112,0.21435,0.412457,0.515688
0.218334,0.5219,0.887614,1.69967,4.264039,5.319294,3.881916,3.129236,3.145752,3.067747,2.861812,3.289694,3.696452,2.962135,1.528172,0.8136,0.544541,0.310934,0.225495,0.231979,0.235726,0.171237,0.150253,0.143655,0.139964,0.251445,0.472511,0.581606
0.195472,0.439107,0.822179,1.752614,4.584936,5.763215,4.090671,3.365342,3.808607,3.797242,3.28064,3.669469,4.28832,3.415504,1.70904,1.007345,0.705335,0.38425,0.258245,0.262575,0.267765,0.178113,0.166632,0.176914,0.162141,0.262984,0.484989,0.591493
0.189843,0.354877,0.623273,1.514654,4.203494,5.40749,3.879735,3.261448,4.057022,4.139988,3.345664,3.553221,4.26044,3.444021,1.727951,1.07085,0.76876,0.414446,0.263769,0.260419,0.266061,0.174125,0.165685,0.185687,0.171289,0.257923,0.463968,0.556344
0.204637,0.308693,0.421943,1.109212,3.23435,4.392287,3.423044,2.977516,3.800001,3.827507,2.897075,2.817108,3.445543,3.042709,1.62604,0.944048,0.673712,0.384075,0.242886,0.225813,0.22575,0.170523,0.167686,0.177534,0.179851,0.261516,0.436752,0.513733
0.216522,0.303547,0.339593,0.788985,2.326962,3.563851,3.30088,2.924907,3.310491,3.204875,2.462903,2.137119,2.510761,2.427219,1.367521,0.714117,0.514011,0.355821,0.232925,0.187871,0.182119,0.176433,0.173379,0.160671,0.184997,0.263044,0.407248,0.494636
0.205609,0.287263,0.306786,0.618575,1.774931,3.004459,3.164538,2.76562,2.825413,2.744083,2.207298,1.896603,2.16416,1.967687,1.036442,0.557794,0.430674,0.346685,0.22999,0.17727,0.175946,0.183038,0.178928,0.150307,0.167803,0.236441,0.375736,0.473733
0.174264,0.236117,0.238769,0.477382,1.516505,2.707657,2.858911,2.264787,2.337592,2.509188,1.925421,1.682449,2.076943,1.736549,0.794174,0.456308,0.376182,0.30756,0.210006,0.16448,0.167773,0.170051,0.164043,0.130693,0.122413,0.180672,0.326521,0.429431
0.136782,0.169481,0.161436,0.336758,1.255842,2.409108,2.472123,1.70714,1.768733,2.14613,1.710515,1.51968,1.851659,1.432584,0.576577,0.337615,0.303102,0.242751,0.182982,0.152755,0.139708,0.127085,0.121649,0.104926,0.08627,0.123936,0.269905,0.404097
0.106089,0.146657,0.13832,0.276434,1.285067,2.471878,2.347256,1.425681,1.274792,1.64642,1.490073,1.445937,1.694802,1.233476,0.492052,0.262944,0.239649,0.199963,0.159494,0.142156,0.114965,0.084427,0.078132,0.084085,0.077,0.094673,0.217867,0.394415
0.080218,0.139361,0.130787,0.267933,1.399476,2.54962,2.226651,1.274993,0.986861,1.287338,1.325233,1.390871,1.69359,1.270427,0.515737,0.236504,0.197936,0.166007,0.125598,0.124697,0.105897,0.067299,0.053709,0.068549,0.067273,0.06759,0.177715,0.376155
0.076189,0.1455,0.142239,0.284561,1.330831,2.399052,2.114484,1.2286,0.941086,1.132373,1.089519,1.141121,1.49351,1.211669,0.517598,0.221456,0.170889,0.136964,0.098941,0.113747,0.106406,0.068932,0.051463,0.05811,0.054014,0.055276,0.168505,0.346357
0.080545,0.142089,0.145965,0.322595,1.145736,2.00891,1.853729,1.129225,0.924743,1.016327,0.815989,0.846774,1.206761,1.044422,0.50671,0.228929,0.139388,0.11263,0.101801,0.124296,0.112151,0.075132,0.064442,0.065834,0.059859,0.067754,0.173065,0.30835
0.078841,0.13053,0.139515,0.3705,1.070436,1.803671,1.611975,0.91428,0.77989,0.767228,0.541036,0.711075,1.175271,1.023841,0.550814,0.260211,0.114909,0.088618,0.114189,0.139307,0.108805,0.077299,0.074488,0.078131,0.07329,0.079102,0.156954,0.248483
0.076532,0.127609,0.126003,0.389069,1.137138,1.897361,1.649959,0.896344,0.686205,0.578034,0.446352,0.764734,1.196941,0.972326,0.570514,0.287492,0.102591,0.068027,0.115289,0.134877,0.09088,0.070616,0.07005,0.077086,0.075526,0.074956,0.128882,0.190517
0.076024,0.139174,0.113038,0.389905,1.293742,1.989218,1.76093,1.127575,0.789007,0.596464,0.462438,0.778658,1.127535,0.902309,0.527704,0.280842,0.107439,0.056626,0.095736,0.112998,0.074681,0.058436,0.051273,0.061452,0.063317,0.056029,0.103089,0.167532
0.080392,0.155364,0.103627,0.398191,1.479331,1.984955,1.745062,1.379274,0.88815,0.572023,0.428033,0.680098,0.9438,0.764053,0.415369,0.236544,0.115394,0.056429,0.067037,0.090851,0.068856,0.043632,0.032085,0.045571,0.05366,0.043445,0.083631,0.158626
0.087025,0.161432,0.096284,0.396935,1.519676,1.984664,1.781858,1.478617,0.850678,0.50006,0.405126,0.65586,0.83966,0.562195,0.300432,0.212869,0.125514,0.068476,0.050546,0.067193,0.058383,0.037166,0.025927,0.038085,0.05373,0.042999,0.069966,0.144625
0.084248,0.154398,0.094581,0.388721,1.341487,1.800483,1.699919,1.360524,0.676427,0.441848,0.446869,0.726551,0.86151,0.429789,0.214452,0.204045,0.13808,0.081508,0.04817,0.049832,0.046937,0.037215,0.024657,0.038729,0.056516,0.045345,0.064308,0.137547
0.068554,0.138611,0.102208,0.381681,1.084248,1.438257,1.450625,1.175508,0.487693,0.348438,0.49325,0.840438,0.942355,0.449643,0.168528,0.170199,0.13436,0.083097,0.043713,0.042128,0.039493,0.033348,0.022442,0.039929,0.055326,0.042307,0.062945,0.13072
0.048396,0.113484,0.108246,0.381749,1.119663,1.331235,1.34637,1.180709,0.467106,0.263108,0.476036,0.860696,0.912063,0.45356,0.132104,0.125289,0.116788,0.074156,0.035504,0.042727,0.039228,0.026085,0.017513,0.038176,0.05187,0.03574,0.052598,0.104939
0.032434,0.085819,0.103279,0.364956,1.194015,1.335685,1.286236,1.215237,0.48576,0.256858,0.43934,0.754227,0.744867,0.410712,0.11306,0.108231,0.116151,0.072583,0.035414,0.052551,0.044934,0.02062,0.012757,0.034923,0.050453,0.033771,0.037671,0.071582
