1e-06,1e-06,1e-06,0,9e-06,7e-06,3e-06,0,6e-06,2e-06,3e-06,4e-06,3e-06,7e-06,0,1e-06,0,0,2e-06,1e-06,2e-06,1.2e-05,2.7e-05,4.9e-05,2.5e-05,3.3e-05,3.7e-05,1.8e-05,6e-06,3.4e-05,4e-06,1e-06,9e-06,1.8e-05,2.2e-05,9e-06,9e-05,5e-06,7.6e-05,1e-06,2.2e-05,2.6e-05,6e-06,1.4e-05,3e-06,1.7e-05,1.2e-05,5.1e-05,4.1e-05,2e-06,8.2e-05,1.2e-05,4.9e-05,5.7e-05,4e-05,1.4e-05,1.9e-05,1.1e-05,3.3e-05,1.6e-05,1.4e-05,9e-06,4e-06,3.2e-05,3e-05,5.4e-05,4.2e-05,3.2e-05,3.3e-05,1.1e-05,7.7e-05,2.2e-05,3.7e-05,3.2e-05,1e-06,3.5e-05,1.2e-05,8e-06,1.3e-05,1.6e-05,2.4e-05,3.2e-05,1.2e-05,8e-06,1.3e-05,4e-06,0,2.5e-05,1.2e-05,2.2e-05,5.3e-05,4.2e-05,2.6e-05,1.3e-05,2e-06,1.7e-05,3.6e-05,9e-06,1.5e-05,6e-06,1e-06,3.5e-05,2.2e-05,2.4e-05,3e-06,2.1e-05,6.3e-05,2.1e-05,2.4e-05,2.1e-05,5e-06,2.7e-05,1.7e-05,2.5e-05,2e-05,8e-06,8e-06,2.9e-05,1.2e-05,1.7e-05,4e-05
1.7e-05,2.5e-05,3.2e-05,4.8e-05,4.8e-05,3.8e-05,2.3e-05,2.4e-05,2e-05,9e-06,9e-06,1.4e-05,1.1e-05,1e-05,1.2e-05,1.9e-05,3.2e-05,1.9e-05,4.3e-05,3.7e-05,2.4e-05,9e-06,7.1e-05,7.9e-05,5.5e-05,3.4e-05,8.6e-05,2e-05,5.6e-05,5.2e-05,5.8e-05,3e-05,2.6e-05,1.8e-05,7.6e-05,6.1e-05,0.000128,9.5e-05,0.000117,7.8e-05,7.1e-05,8.1e-05,6.3e-05,2.1e-05,2.6e-05,1.7e-05,3e-05,0.000109,6.2e-05,2.3e-05,0.00018,4.2e-05,0.000109,7.4e-05,9.3e-05,7.6e-05,5.8e-05,6.1e-05,3.5e-05,5.3e-05,3.6e-05,0.000111,7.9e-05,0.000101,9.6e-05,0.000149,6e-05,9.1e-05,0.000136,1.3e-05,9.7e-05,4.1e-05,4.2e-05,4.3e-05,4.5e-05,5.6e-05,6.4e-05,7.7e-05,8.4e-05,6e-05,9.5e-05,6.8e-05,3.6e-05,1.6e-05,3.7e-05,1.8e-05,4.2e-05,2.9e-05,8e-05,6.4e-05,8.1e-05,8.2e-05,8.2e-05,8.7e-05,4.1e-05,8.9e-05,4.9e-05,3.7e-05,1e-05,1.6e-05,2.6e-05,7.4e-05,2.9e-05,7.3e-05,5.3e-05,5.9e-05,0.000148,7.7e-05,4.8e-05,4.7e-05,4e-06,4.3e-05,7.1e-05,5.3e-05,2.2e-05,3.3e-05,1.9e-05,6.6e-05,1.3e-05,1.4e-05,9.9e-05
3.4e-05,3.3e-05,2.5e-05,4.4e-05,2.2e-05,1.4e-05,2e-05,1.8e-05,1.2e-05,1.4e-05,1.3e-05,2.3e-05,6e-06,3e-06,5e-06,3.1e-05,2.9e-05,3e-05,5e-05,1.1e-05,8e-06,1e-05,9.3e-05,8.2e-05,7.4e-05,4.9e-05,7e-05,2.3e-05,2.9e-05,1e-05,4.3e-05,2.1e-05,4.7e-05,6.8e-05,4.1e-05,5.5e-05,0.000141,7.5e-05,0.00011,3.6e-05,0.000122,0.00011,0.000129,3.8e-05,6e-05,1.7e-05,2.5e-05,7.6e-05,0.000125,4.1e-05,0.00021,8.8e-05,7.2e-05,8.6e-05,6.2e-05,9.3e-05,5.8e-05,6.2e-05,8e-05,9.3e-05,2.2e-05,0.000149,4.8e-05,4.2e-05,0.000146,6.9e-05,3.9e-05,3e-05,6.5e-05,8e-06,7.8e-05,2.9e-05,1.6e-05,7.9e-05,6.5e-05,3.4e-05,8e-05,2.8e-05,5.6e-05,3.3e-05,4.9e-05,4.3e-05,5e-06,3.2e-05,1.8e-05,2.6e-05,7.1e-05,8.4e-05,0.00012,2.5e-05,9.9e-05,3.3e-05,2e-06,8.3e-05,5.3e-05,8.4e-05,6.8e-05,2.5e-05,3e-05,8e-05,9e-05,1.1e-05,6e-05,2.8e-05,5.8e-05,4.7e-05,5.6e-05,4.3e-05,5.1e-05,3.6e-05,2.4e-05,0.000104,4e-05,5.5e-05,6.5e-05,4.7e-05,2.9e-05,3.5e-05,3.8e-05,7.6e-05,3.5e-05
3.2e-05,1e-05,1.4e-05,1.1e-05,1.2e-05,1.3e-05,2.5e-05,3.8e-05,3.5e-05,1.5e-05,2.1e-05,1.5e-05,2e-05,1e-05,1.7e-05,2.7e-05,7e-05,6.2e-05,3.2e-05,3.5e-05,3.2e-05,2.5e-05,7.4e-05,0.000115,5e-05,0.000102,0.000118,3.4e-05,5.7e-05,3.9e-05,4.4e-05,2.6e-05,4.3e-05,3e-05,4e-06,0.000108,8.8e-05,6.6e-05,8.7e-05,5.5e-05,0.000157,0.000113,0.000103,5.9e-05,6.4e-05,5.5e-05,4.6e-05,0.000102,0.000111,3.8e-05,0.000221,7.4e-05,0.000128,0.00013,0.000113,0.000104,0.000136,0.000126,8.4e-05,0.000117,5.3e-05,9.2e-05,0.000126,7e-05,4.9e-05,0.000146,7.2e-05,9e-06,6.9e-05,4.4e-05,0.000177,3.7e-05,2.6e-05,4e-05,3.4e-05,2.8e-05,6.3e-05,3.5e-05,8.4e-05,4.3e-05,6e-05,4.4e-05,4e-05,3.1e-05,4.1e-05,2.4e-05,6.3e-05,1.3e-05,0.000188,8.2e-05,0.000106,2e-05,1.9e-05,0.000115,2.1e-05,0.000117,9.2e-05,6.3e-05,0.000102,4.8e-05,1.5e-05,6.2e-05,3.7e-05,7.3e-05,0.000127,0.000163,0.00013,7.2e-05,0.00012,3.7e-05,4.9e-05,8.7e-05,5.7e-05,9.4e-05,7.2e-05,0.000137,4.8e-05,4.9e-05,2e-05,0.000141,0.000138
9e-06,3e-06,1e-05,1.4e-05,9e-06,6e-06,1.4e-05,9e-06,8e-06,1.2e-05,1.5e-05,7e-06,5e-06,1.1e-05,2.3e-05,2.5e-05,9.4e-05,1e-04,5.4e-05,5.2e-05,5.1e-05,4.1e-05,0.000108,0.000124,8.6e-05,0.000114,5.7e-05,7.4e-05,2.9e-05,5.4e-05,8.7e-05,4.8e-05,2.2e-05,4.6e-05,5.1e-05,8e-05,0.000184,0.000107,1e-04,9.1e-05,0.000139,0.000157,0.000106,4.3e-05,2.2e-05,9.7e-05,1.5e-05,7.6e-05,3.9e-05,5.3e-05,0.000151,0.000119,0.000254,0.000119,0.000194,9.7e-05,9.1e-05,0.000109,9.4e-05,8.2e-05,0.000153,9e-05,0.000121,0.000108,7.1e-05,8.7e-05,8.9e-05,5.4e-05,8e-05,3.5e-05,0.000149,0.000161,9.4e-05,5.3e-05,7.4e-05,8.8e-05,6.8e-05,3.3e-05,3.8e-05,1.7e-05,3.6e-05,5.3e-05,5.6e-05,5.8e-05,7.6e-05,4e-05,7.2e-05,5.2e-05,0.000191,0.000109,0.000142,4.9e-05,5.2e-05,0.000139,3.2e-05,7e-05,6.1e-05,4.5e-05,5.1e-05,3.9e-05,8.8e-05,5e-05,3.3e-05,5.5e-05,0.000139,9.1e-05,0.000152,8.4e-05,0.000185,0.000163,7.2e-05,9.9e-05,8.3e-05,0.000123,0.000128,0.000116,0.000126,0.000109,6.6e-05,0.000104,2.9e-05
1.4e-05,8e-06,1.2e-05,2.1e-05,1.2e-05,1.3e-05,1.2e-05,2e-06,6e-06,8e-06,1e-05,7e-06,1.5e-05,3.2e-05,5.4e-05,6.5e-05,3.6e-05,0.000159,0.000131,7.7e-05,4.7e-05,3.5e-05,0.000105,0.000175,7.8e-05,5.5e-05,4.3e-05,0.000131,8.7e-05,4.2e-05,0.000116,0.000106,7.2e-05,4.6e-05,6.1e-05,3.5e-05,3.9e-05,7.9e-05,9.3e-05,9.9e-05,8e-05,0.00017,0.000113,0.000122,9.7e-05,0.00013,0.000113,0.000154,7.8e-05,4.1e-05,0.000105,0.00014,9.8e-05,0.00025,0.000103,0.000165,0.00019,0.000113,9.3e-05,0.000201,0.000319,0.000165,8.2e-05,0.000166,0.000121,8.9e-05,2.5e-05,4e-05,0.00012,0.00012,0.000107,0.000126,8.2e-05,1.7e-05,3.1e-05,0.000106,0.000147,4.5e-05,2.2e-05,0.000102,0.000152,0.00013,0.000126,0.000121,0.000142,0.000133,1.6e-05,3e-05,9.7e-05,0.000118,0.000105,8.6e-05,0.000164,0.000281,0.00031,0.00021,9.9e-05,3.3e-05,8.1e-05,0.000113,0.000185,0.000164,7.3e-05,3.7e-05,0.000117,0.000169,0.000294,0.000145,9.8e-05,2.9e-05,0.000129,0.000184,0.000205,5.6e-05,0.000161,0.00016,0.000224,0.00022,0.000178,0.000121,4.5e-05
8e-06,1.4e-05,3e-06,1.5e-05,7e-06,1.4e-05,1.2e-05,2.2e-05,1.3e-05,1.4e-05,2.5e-05,2.4e-05,2.9e-05,3.2e-05,3.5e-05,3e-06,7e-05,0.000107,9.6e-05,6.2e-05,8.1e-05,8.9e-05,6.4e-05,3.7e-05,0.000155,0.000152,0.000187,6.1e-05,8.5e-05,5.9e-05,0.000185,0.000115,4.2e-05,5.5e-05,4.7e-05,0.000123,0.000194,2.8e-05,0.000174,0.000183,0.000104,0.000102,0.000154,8e-06,9.1e-05,0.000126,0.000182,0.000105,8.2e-05,8.3e-05,0.000171,0.000175,9.8e-05,0.000107,0.000229,0.000179,6.5e-05,9e-05,0.00013,0.000115,0.000228,8.2e-05,1.6e-05,8.2e-05,9e-05,0.000221,0.000112,0.000108,1e-04,0.000168,0.000104,0.000134,6e-05,0.000145,6.9e-05,0.000118,7.6e-05,5.5e-05,9.3e-05,0.00013,8.3e-05,6.6e-05,8.2e-05,0.000125,5.7e-05,0.000136,8.6e-05,0.000122,0.000107,2.6e-05,0.000108,4.4e-05,0.000197,7.6e-05,0.000269,0.000182,6.5e-05,0.00012,7.2e-05,0.000174,0.000107,2.6e-05,5.2e-05,8.8e-05,7.6e-05,7.6e-05,0.000178,0.000114,2.3e-05,7e-06,0.000117,0.000112,6.6e-05,0.00017,5e-05,0.000116,0.000104,0.000153,4.1e-05,9.4e-05,0.000213
5e-06,1.1e-05,3e-06,1.3e-05,8e-06,3e-06,1.2e-05,1.4e-05,4e-06,1e-05,1.7e-05,1.7e-05,2.4e-05,6.6e-05,3.6e-05,2.6e-05,0.000111,4.7e-05,7e-05,1.8e-05,4.7e-05,6.6e-05,0.000102,8.1e-05,7.8e-05,0.000146,0.000122,0.000161,4.3e-05,0.000197,7.8e-05,2.7e-05,4.3e-05,6.1e-05,9.9e-05,0.000155,0.000271,0.000182,4.8e-05,0.000166,0.000338,0.000223,0.000212,0.000108,6.7e-05,0.000129,0.000132,0.000137,3.7e-05,0.000191,0.000262,7.4e-05,6.7e-05,7e-05,3.5e-05,7.5e-05,0.000147,0.000115,0.000215,0.000136,0.000124,0.000155,0.000147,8.2e-05,8.1e-05,0.000228,5.2e-05,0.000154,0.000107,0.000198,0.000113,0.000225,6e-05,0.00016,0.000144,9.5e-05,1e-04,9.1e-05,0.000104,8.5e-05,0.000163,2.4e-05,9.3e-05,0.00011,0.000166,0.000114,0.000152,0.000178,0.00012,0.000103,0.000129,9.4e-05,8.3e-05,3.9e-05,0.000257,8.7e-05,6e-05,0.000113,5.3e-05,0.000147,0.000138,0.000234,0.000116,1e-04,8.6e-05,0.000181,0.000179,0.000102,9.3e-05,0.000109,4.5e-05,0.000114,1.9e-05,0.000228,0.000283,0.000292,0.000159,0.000119,9.7e-05,0.000101,0.000341
1e-05,1.2e-05,1.1e-05,2.2e-05,1.1e-05,9e-06,3e-06,1.8e-05,1.2e-05,9e-06,1.7e-05,8e-06,3.3e-05,5.7e-05,4.5e-05,2.7e-05,0.000109,7.3e-05,4.7e-05,5.2e-05,1.9e-05,4.8e-05,8.7e-05,0.000191,7.8e-05,3e-04,0.000156,0.000126,0.00013,0.000236,0.000338,0.000248,0.00023,0.000168,0.000138,7.3e-05,0.000165,2.2e-05,4.6e-05,9.4e-05,0.000263,0.000268,5.3e-05,4.7e-05,0.000132,5.8e-05,0.000229,0.000144,5.9e-05,0.000164,0.00031,0.000185,6.4e-05,0.000141,9.8e-05,0.000103,0.000198,5.8e-05,0.000151,3.7e-05,0.000133,0.000249,6.2e-05,6.4e-05,7.1e-05,0.000245,0.000184,0.000204,0.000214,0.00027,0.000245,6.1e-05,5.5e-05,7.9e-05,0.000161,0.000163,6e-05,0.000173,0.000277,8.9e-05,0.000121,0.000154,0.000105,1e-05,0.00013,9.1e-05,0.000173,5.7e-05,3.9e-05,3.5e-05,0.000122,6e-05,0.000126,0.000139,9.9e-05,1e-04,0.000168,5.6e-05,0.000115,0.000132,0.000123,0.000154,5.3e-05,0.000111,7e-05,0.000112,3.7e-05,8.3e-05,0.000141,3.9e-05,6.8e-05,0.000239,0.000226,0.000155,0.00015,3.8e-05,7.9e-05,6.5e-05,8.4e-05,0.000174,0.000168
6e-06,6e-06,8e-06,1.6e-05,2.5e-05,1.6e-05,1e-05,8e-06,9e-06,2e-06,1.3e-05,1.2e-05,3.4e-05,3e-06,7e-06,2.9e-05,4.1e-05,1.6e-05,4.5e-05,5.7e-05,6.4e-05,0.000125,2e-05,0.000153,3.3e-05,0.000194,6.4e-05,8.6e-05,4.8e-05,0.000184,0.000185,0.000147,9.7e-05,3.4e-05,2.7e-05,0.000138,0.000149,2.3e-05,0.000102,7.5e-05,9.2e-05,0.000149,7e-05,5.4e-05,0.000146,0.000118,0.000132,0.000185,6.4e-05,5.5e-05,0.000156,5.3e-05,0.000136,0.000141,5.2e-05,0.000158,0.000106,8.1e-05,0.000105,0.000112,6.5e-05,0.000155,0.000123,4.6e-05,0.000195,0.000254,7e-05,0.000117,0.000146,0.000289,9e-05,3.2e-05,8.5e-05,1e-05,0.000139,6.1e-05,5.9e-05,0.000127,0.000256,9.9e-05,0.000111,8.7e-05,2.3e-05,0.000166,9.6e-05,4.9e-05,0.000117,9.8e-05,7.3e-05,7e-05,0.000108,7.5e-05,3.9e-05,0.000115,0.000186,6.6e-05,0.00018,7e-05,8e-05,0.000103,2.6e-05,0.000189,0.000135,4.8e-05,6.6e-05,0.000118,0.000189,0.000122,0.000124,2.9e-05,8.5e-05,0.000155,4.5e-05,0.000125,7.7e-05,0.00014,3.3e-05,6.4e-05,0.000128,0.000167,0.000155
5e-06,6e-06,1e-05,1.4e-05,1.3e-05,9e-06,5e-06,1.1e-05,8e-06,8e-06,1e-05,9e-06,1.6e-05,7e-06,9e-06,5.3e-05,4.8e-05,2.3e-05,3.7e-05,3.6e-05,9.8e-05,3.6e-05,0.00013,9.1e-05,0.00011,0.000225,0.000108,3.2e-05,2.9e-05,4.8e-05,0.000125,5.2e-05,0.000131,1e-04,0.00011,0.000146,0.000141,9.5e-05,0.000131,0.00017,5.3e-05,5.5e-05,3.7e-05,0.000134,0.000198,0.000119,8.7e-05,7.5e-05,8.8e-05,0.000121,0.000127,8.4e-05,0.000154,0.000171,0.000121,0.000199,0.00024,0.00015,0.000185,0.000131,3.3e-05,0.000148,0.000126,0.000125,0.000211,6.7e-05,0.000101,4.9e-05,7.3e-05,0.000301,0.000273,6.7e-05,0.000126,6.3e-05,4.7e-05,2.9e-05,7.5e-05,0.000141,0.000331,0.000316,0.000204,0.000179,0.000101,0.000288,0.000227,4.6e-05,5.6e-05,5.1e-05,0.000102,0.000167,0.000216,1.3e-05,0.000122,0.000107,6.8e-05,0.000115,0.000115,0.000158,0.000175,8.9e-05,4.9e-05,0.000143,8.4e-05,0.000155,6.1e-05,9.5e-05,0.000189,0.000179,0.000154,0.000188,9.5e-05,6.7e-05,0.000144,9.3e-05,5.9e-05,0.000178,0.00018,6.9e-05,8e-05,0.000165,0.000196
6e-06,5e-06,7e-06,9e-06,1e-06,5e-06,5e-06,3e-06,1e-06,4e-06,5e-06,8e-06,1.5e-05,3e-06,1.1e-05,5.3e-05,3.4e-05,2.4e-05,2.7e-05,5e-05,8.4e-05,6.6e-05,0.000119,0.000112,8.3e-05,0.000154,0.000122,7.1e-05,4.4e-05,9.8e-05,4.8e-05,6.3e-05,5.2e-05,6.6e-05,5.6e-05,0.000129,5.3e-05,3.9e-05,3.9e-05,5e-05,5.7e-05,0.000161,0.000124,7.8e-05,4.1e-05,9e-05,0.000135,0.000194,0.000131,4.4e-05,0.000181,8.8e-05,7.2e-05,0.000156,5.2e-05,0.000235,0.000168,0.000199,0.00012,0.000136,8.7e-05,0.000117,9e-06,0.000119,2e-05,0.000111,5.3e-05,6.1e-05,0.000126,1e-04,0.000103,3.8e-05,9.9e-05,0.000139,8.3e-05,4e-05,5e-05,9e-05,9.4e-05,0.000148,0.000122,0.000161,6.6e-05,0.000152,0.000138,0.000138,9.8e-05,9.4e-05,5.2e-05,5.9e-05,0.000204,6e-05,0.000103,3.4e-05,0.000122,0.000116,5.3e-05,8.8e-05,3.9e-05,3.6e-05,6.2e-05,0.000148,7.3e-05,1.5e-05,4.3e-05,5.2e-05,0.000169,8.9e-05,0.000104,2.5e-05,7.1e-05,0.000127,0.000176,3.3e-05,4e-05,0.000186,0.000144,0.000127,8.4e-05,0.000124,0.00019
6e-06,5e-06,0,7e-06,6e-06,2e-06,4e-06,5e-06,2e-06,1e-06,3e-06,5e-06,1.1e-05,1.1e-05,1e-06,4.5e-05,2.3e-05,2.7e-05,3.1e-05,2.7e-05,4.4e-05,8.1e-05,8.3e-05,0.000111,4.9e-05,0.000155,6.3e-05,2e-05,4.7e-05,0.000132,6.6e-05,4e-05,5.2e-05,7.1e-05,8.5e-05,6.7e-05,0.000128,6.2e-05,2.4e-05,6.8e-05,8.3e-05,0.000108,0.000102,2.7e-05,7e-06,6.9e-05,1.6e-05,0.000107,0.000128,4.5e-05,0.000178,0.000137,7.3e-05,0.00016,0.000135,0.000314,0.000138,5.7e-05,0.000113,3.7e-05,9.6e-05,0.000108,6.8e-05,0.000145,0.000142,0.00016,6.9e-05,6.6e-05,0.000126,7.1e-05,0.000115,8.8e-05,5.6e-05,5.8e-05,5.8e-05,4.3e-05,1.2e-05,9.6e-05,0.000125,9.6e-05,0.000145,7.7e-05,6.2e-05,8e-05,1e-04,4e-05,2.3e-05,8.9e-05,2.6e-05,6.9e-05,0.00027,2.6e-05,3.9e-05,1.8e-05,0.000102,7.1e-05,5.1e-05,5e-05,4.8e-05,1.6e-05,4e-05,9.3e-05,3.5e-05,4.4e-05,6.1e-05,7.2e-05,0.000179,0.000123,9.5e-05,8.8e-05,5.3e-05,8.8e-05,0.000143,5e-05,2.8e-05,0.000172,4.2e-05,2.5e-05,6.4e-05,8.4e-05,0.000171
5e-06,4e-06,5e-06,5e-06,3e-06,6e-06,3e-06,4e-06,2e-06,3e-06,5e-06,2e-06,7e-06,5e-06,3e-06,3.9e-05,2e-05,1.9e-05,5.3e-05,3.9e-05,5e-05,9.6e-05,8e-05,0.000113,8.8e-05,0.000203,7.5e-05,3.4e-05,7.1e-05,0.000153,6.1e-05,7.5e-05,4.5e-05,7.3e-05,6.6e-05,8.5e-05,0.000123,6.8e-05,6.5e-05,7.5e-05,8.8e-05,7.9e-05,0.00012,0.000123,7.5e-05,4.9e-05,2.1e-05,0.000106,9.6e-05,4.7e-05,0.000237,0.000118,7.2e-05,0.000171,0.000131,0.000268,0.000141,0.000118,0.000107,8.4e-05,0.000116,0.000199,9.1e-05,0.000179,0.000151,0.000136,5.9e-05,0.000101,9.9e-05,0.000133,0.00019,0.000135,9e-05,4.4e-05,5.3e-05,1.4e-05,4e-05,2.7e-05,0.000155,9.2e-05,0.000105,9.5e-05,2.9e-05,4.5e-05,4.2e-05,6e-05,7.4e-05,8.7e-05,7.3e-05,1e-04,0.00027,0.000122,0.000146,3.9e-05,7.2e-05,9.3e-05,6.2e-05,9e-06,7.7e-05,8e-06,0.000126,4.9e-05,8e-05,4.1e-05,6.9e-05,5.5e-05,0.000175,0.000139,7.8e-05,0.000112,5.5e-05,0.000104,0.000133,5.7e-05,2.5e-05,0.000183,3.7e-05,2.3e-05,0.00012,0.000144,0.000231
7e-06,6e-06,9e-06,9e-06,3e-06,6e-06,7e-06,9e-06,9e-06,9e-06,1.1e-05,4e-06,3e-06,1.2e-05,8e-06,4.8e-05,4.6e-05,1e-05,8.5e-05,2.3e-05,8.1e-05,0.000147,1e-04,0.00024,0.00015,0.000229,9.4e-05,4.5e-05,9.3e-05,0.00017,1.7e-05,3.3e-05,9.6e-05,7.7e-05,0.000173,8.7e-05,0.00028,9.5e-05,0.000255,0.000181,0.000111,0.000192,5.7e-05,0.000291,9.4e-05,5.9e-05,7.2e-05,0.000264,9e-05,8.4e-05,0.000304,0.000176,3.5e-05,8.7e-05,0.000166,0.000223,0.000207,0.000163,0.000217,8.2e-05,0.000117,0.000133,0.000113,0.00023,0.000248,0.000214,0.000147,0.000254,0.000151,0.000251,6.7e-05,0.000104,0.000185,0.00018,0.000148,0.000114,9e-05,0.000192,0.000135,9.3e-05,0.000103,0.00016,5.6e-05,1e-04,6e-05,2.8e-05,0.00014,0.000248,7.7e-05,7.7e-05,0.00029,0.000103,0.000258,0.000134,8.8e-05,0.00016,4.8e-05,8.3e-05,0.000125,9.2e-05,0.000175,0.000117,5.7e-05,6.9e-05,0.000112,0.000123,0.000218,0.000178,7.3e-05,0.000168,0.000127,0.000111,0.000166,7.5e-05,7.7e-05,0.000208,0.000139,7.7e-05,0.000145,0.000121,0.000264
5e-06,1e-06,4e-06,6e-06,2e-06,2e-06,6e-06,6e-06,3e-06,5e-06,2e-06,4e-06,9e-06,1.1e-05,1e-05,2.8e-05,7.9e-05,6.1e-05,0.000193,0.000117,0.000115,9.8e-05,0.00025,0.000285,3.8e-05,0.000297,0.00018,0.000207,0.000105,0.000315,0.000148,6.2e-05,0.000235,8.5e-05,0.00019,0.000273,0.000335,5.5e-05,0.00016,0.000128,0.000165,0.000291,7.1e-05,0.000242,0.000271,0.000121,6.4e-05,0.00029,0.000266,1e-04,0.000171,0.000389,0.000354,9.8e-05,2.5e-05,0.00015,9.9e-05,6.1e-05,0.000462,0.000495,0.000286,0.00049,0.00037,0.00042,0.000279,0.000367,0.000154,0.000211,0.000345,9.3e-05,0.000232,0.000157,0.000304,0.000211,0.00022,0.000142,0.000286,0.00023,0.000148,0.000168,8.9e-05,8.5e-05,0.000113,0.000102,0.000223,0.000223,0.000158,0.000217,5.8e-05,3.7e-05,0.000209,9.6e-05,8.7e-05,5.3e-05,0.000201,0.000185,0.000179,0.000182,0.000118,0.000171,0.000183,8.5e-05,0.000202,8.9e-05,0.000177,0.000167,0.000327,0.000363,0.000167,0.000265,0.000131,0.00023,8.1e-05,9.1e-05,1.1e-05,0.000173,9.4e-05,0.00019,0.000136,0.000106,0.000305
1e-06,5e-06,1e-06,3e-06,3e-06,4e-06,7e-06,5e-06,5e-06,5e-06,5e-06,5e-06,1.1e-05,2.8e-05,9e-06,3.5e-05,5.5e-05,6.9e-05,0.000275,0.000213,0.000228,0.000169,0.000308,0.000174,0.00027,0.000239,0.000228,0.000167,9.6e-05,0.000315,7.9e-05,0.00015,0.000315,0.000132,4.5e-05,0.000106,0.000125,0.000294,0.000257,0.000265,0.000185,0.000129,0.000444,0.000288,0.000135,6.6e-05,0.000197,4e-05,0.000107,6.8e-05,0.00057,0.000558,0.000403,0.000327,0.00019,4e-04,0.000321,0.000142,0.000962,0.000809,0.000462,0.000144,0.000133,0.000413,0.000315,0.000509,9.4e-05,0.000315,0.000212,0.000439,0.000516,0.000529,0.000425,0.000191,9.2e-05,3e-04,0.000268,0.000499,0.000325,0.000228,0.00048,0.00033,0.00022,0.000263,0.00023,6.6e-05,0.000159,4.6e-05,5.3e-05,0.000148,0.000328,0.000156,0.000312,0.00019,0.000274,0.000252,0.000307,0.000144,0.000242,0.000219,0.000212,0.000409,6.3e-05,7.4e-05,0.000132,0.000306,0.000381,0.00026,0.000488,5.5e-05,0.000264,0.000191,0.000278,0.000104,0.000123,0.000181,4e-05,0.000214,0.000254,0.000167,0.000286
8e-06,6e-06,6e-06,7e-06,8e-06,6e-06,9e-06,5e-06,7e-06,8e-06,5e-06,8e-06,2.4e-05,3.5e-05,3.1e-05,7.7e-05,5.7e-05,8e-05,0.000356,0.000122,8.8e-05,0.000259,0.000321,0.000326,0.000341,0.000453,0.000316,0.000122,0.000202,0.000294,0.000192,0.000207,0.000184,0.000161,0.000163,0.000158,0.000445,0.000389,0.000118,0.000211,9.6e-05,0.000192,0.000327,0.000197,3.2e-05,2.5e-05,0.00021,0.000263,0.000168,9.2e-05,0.000706,0.000333,0.000434,0.000401,0.000286,0.000506,0.000329,7.3e-05,0.001104,0.000235,0.000459,5.5e-05,0.000213,0.000211,0.00044,0.000325,0.000418,9.6e-05,0.000618,0.00038,0.000478,0.000366,0.000429,0.000101,0.00019,0.000212,0.000204,0.000368,0.000218,0.000312,0.000454,0.000426,0.000288,0.000337,0.000143,0.000132,0.00014,0.000442,8.9e-05,0.000345,0.000621,0.000174,0.000272,3.9e-05,0.000267,0.000176,0.000429,0.000103,0.000269,0.000265,0.000597,0.000408,0.000415,0.000145,6.1e-05,0.000435,0.000594,0.000201,0.000392,0.000446,0.000225,0.000177,0.000638,0.000397,0.000412,0.000533,0.000112,0.000283,0.000451,0.00011,0.000663
8e-06,6e-06,2e-06,4e-06,1e-05,5e-06,4e-06,4e-06,6e-06,1e-05,1.2e-05,0,2.5e-05,7.4e-05,3.4e-05,0.000109,0.000166,0.000222,0.000491,0.000288,0.000363,0.000529,0.000928,0.000154,0.000124,0.000874,0.000864,0.00047,0.000346,0.000718,0.000305,6.8e-05,0.000603,7.3e-05,0.000489,0.000394,0.000427,5e-04,0.000625,0.000288,9.1e-05,0.000242,0.000312,0.000355,0.000498,0.000222,0.000291,0.000229,0.000605,0.000412,0.000101,0.001187,0.001536,0.000685,0.000157,0.001187,0.000499,0.000543,0.001055,0.000266,0.000714,0.000684,0.00064,0.000401,0.000791,0.000916,0.000202,0.000695,0.000451,0.000746,0.000877,0.00053,0.000487,0.000796,0.000122,0.000109,0.000241,0.000617,0.000525,0.000534,0.000726,0.00082,0.00134,0.000499,0.000341,0.000438,0.000206,0.000672,0.000335,0.000528,0.000886,0.000853,0.000769,0.000343,0.000599,0.000216,0.000505,7e-04,0.00031,0.000408,0.000283,0.00113,0.000397,0.000612,0.000457,0.000982,0.001375,0.000962,0.000736,0.000533,0.000407,0.000175,0.001038,0.000499,0.000412,0.000139,0.000447,0.000452,0.000366,0.000241,0.000877
5e-06,6e-06,8e-06,2e-06,5e-06,3e-06,5e-06,4e-06,6e-06,1.1e-05,6e-06,6e-06,1.2e-05,6.4e-05,5.1e-05,0.000128,0.000118,0.000196,0.000212,0.000308,0.000438,0.000832,0.001939,0.001793,0.001133,0.00144,0.002336,0.001192,0.000607,0.000909,0.000916,0.000316,0.000879,0.001256,0.001213,0.000677,0.00102,0.000215,0.000185,0.000365,0.000418,0.00036,0.001027,0.000842,0.00013,0.000168,0.000516,0.000223,0.000569,0.000189,0.000903,0.001515,0.000522,0.000835,0.000675,0.001593,0.001599,0.000881,0.000323,0.001176,0.001167,0.001172,0.000728,0.00158,0.000897,0.001982,0.001176,0.000522,0.000684,0.000338,0.00067,0.000801,0.000531,0.000724,0.000474,0.000451,0.000376,0.000802,0.001367,0.000826,0.000224,0.000106,0.001086,0.000848,0.000507,0.000659,0.00035,0.000775,0.000809,0.00099,0.000753,0.000861,0.000525,0.000508,0.000578,0.000829,0.00077,0.00128,0.000937,0.000245,0.000431,0.001546,0.001338,0.001209,0.001343,0.000581,0.000648,0.00018,0.001035,0.000921,0.001035,0.000897,0.001338,0.00101,0.000517,0.000547,0.000847,0.000319,0.000879,6e-05,0.000856
2e-06,0,5e-06,1.1e-05,7e-06,4e-06,1e-06,5e-06,3e-06,4e-06,3e-06,3e-06,6e-06,4.1e-05,5.6e-05,6e-05,4.7e-05,0.000133,8.4e-05,0.000227,0.00047,0.000149,0.001194,0.000965,0.000871,0.002166,0.001917,0.001251,0.00057,0.000832,0.001397,0.000913,0.000716,0.001342,0.000326,0.000281,0.001204,0.001382,0.000712,0.000589,0.001052,0.000265,0.001527,0.000868,0.000622,0.000491,0.000954,0.00039,6.7e-05,0.000648,0.001283,0.001197,0.001485,0.000635,0.000378,0.002085,0.002769,0.001047,0.001247,0.002403,0.000919,0.00128,0.001631,0.001534,0.001801,0.000704,0.001002,0.001359,0.000366,0.001298,0.000413,8.4e-05,0.000913,0.000853,0.000869,0.000468,0.00062,0.000892,0.000756,0.000771,0.000449,0.000631,0.001062,0.000484,0.000377,0.000381,0.000728,0.001167,0.001028,0.000776,0.001436,0.001438,0.000849,0.000606,0.001409,0.000537,0.000371,0.001107,0.000822,0.00125,0.000632,0.001465,0.001241,0.000687,0.000623,0.001348,0.001729,0.001585,0.001276,0.001117,0.001796,0.001699,0.000439,0.001186,0.001568,0.00052,0.000632,0.000675,0.001024,0.001526,0.001211
4e-06,4e-06,5e-06,8e-06,2e-06,3e-06,2e-06,3e-06,2e-06,1e-06,5e-06,1e-06,1.2e-05,5e-06,2.9e-05,6.3e-05,7.7e-05,9.1e-05,6.5e-05,0.000124,0.000223,0.000316,0.000442,0.000197,0.000414,0.001039,0.000205,0.000191,0.000103,0.000533,0.000768,0.000334,8e-04,0.000429,0.000823,0.000757,0.000758,0.001243,0.000622,0.001122,0.001392,0.001646,0.001417,0.000924,0.000781,0.00024,0.000661,0.000895,0.00063,0.000601,0.0019,0.001165,0.001265,0.000384,0.000307,0.001281,0.001743,0.001709,0.001548,0.002596,0.002027,0.00201,0.001997,0.001966,0.001893,0.001746,0.001429,0.001776,0.001474,0.002383,0.00267,0.002099,0.001936,0.000929,0.001151,0.001613,0.000472,0.000525,0.000517,0.001045,0.000508,0.000601,0.000338,0.000663,0.00073,0.000675,0.000573,0.000421,0.000472,0.000684,0.001182,0.001115,0.000739,0.000535,0.001055,0.001047,0.001003,0.000195,6.4e-05,0.000948,0.000495,0.000697,0.000587,0.000152,0.00089,0.00096,0.001217,0.000652,0.00058,0.00057,0.000637,0.000387,0.000537,0.000938,0.000345,0.000547,0.000434,0.000175,0.001227,0.001687,0.000944
2e-06,1e-06,1e-06,3e-06,2e-06,1e-06,1e-06,1e-06,1e-06,3e-06,2e-06,2e-06,8e-06,7e-06,7e-06,1e-05,1.6e-05,3.5e-05,7e-06,1.8e-05,5.3e-05,0.000115,0.000146,8.9e-05,0.00016,2e-04,0.000151,0.000105,0.000101,0.00017,0.000196,8.5e-05,0.000295,0.000232,4e-04,0.000131,0.000407,9.8e-05,0.000143,0.000323,0.000107,0.00043,0.000318,0.000262,9.1e-05,8.8e-05,0.000179,0.000285,0.000136,0.000388,0.000341,0.000172,8.7e-05,0.000241,0.000368,0.000615,0.000339,0.000494,0.00063,0.00043,0.000527,0.000627,0.000241,0.000605,0.000451,0.000158,0.000423,0.000708,0.000685,0.000463,0.000456,0.000499,3.4e-05,0.000141,0.000368,0.000447,0.000441,0.000308,0.000241,0.000305,0.000203,0.000245,0.000139,0.000223,0.000118,0.000232,0.000192,0.000306,0.000103,0.000262,0.000512,0.000377,0.000256,0.000323,6e-04,0.000445,2e-04,0.000366,0.000327,0.000298,0.000174,0.000297,0.000245,0.000105,0.000267,0.000311,0.000166,0.000273,0.000362,0.000258,7.4e-05,0.000162,0.00013,0.00016,6.5e-05,0.000169,7.1e-05,0.000156,0.00026,0.000228,6.7e-05
1e-06,2e-06,1e-06,2e-06,2e-06,3e-06,1e-06,2e-06,2e-06,2e-06,4e-06,1e-06,1.1e-05,1e-05,7e-06,1.3e-05,5e-06,3.8e-05,1.8e-05,4.3e-05,3.2e-05,4.5e-05,0.000104,0.000117,0.000202,3.5e-05,2.1e-05,0.000245,0.000251,0.000113,0.000228,4.7e-05,0.000318,8.3e-05,0.000233,8.2e-05,0.000131,0.000111,0.000196,0.00021,0.000339,0.000176,0.00036,9.3e-05,3.7e-05,3e-05,9.2e-05,6.1e-05,0.000181,0.000162,4.4e-05,0.000215,0.000391,0.000593,0.000503,0.000861,5e-04,0.000105,0.000144,0.000317,0.000115,0.000317,0.000471,3e-05,0.000383,0.000402,0.00034,0.000224,0.000183,0.000303,0.000304,0.000228,0.000152,0.000137,0.000171,0.000264,2.6e-05,0.000266,0.000114,0.000192,0.000108,6.5e-05,9.2e-05,0.000154,0.000117,0.000246,0.000183,0.000425,0.000231,0.000159,0.000278,0.000264,0.000165,0.000231,0.00024,0.00022,0.000129,0.000329,0.000129,0.000144,7.8e-05,0.000216,0.000188,9.2e-05,0.000107,0.000221,0.000116,0.000295,0.000228,2.8e-05,0.000193,6.3e-05,0.000131,0.000275,0.000116,7.4e-05,0.000137,0.000138,0.000198,0.000112,1.7e-05
1e-06,1e-06,1e-06,3e-06,1e-06,2e-06,2e-06,2e-06,0,1e-06,1e-06,4e-06,1.4e-05,1.9e-05,1.2e-05,4e-06,2.2e-05,6e-06,3.3e-05,7.2e-05,8.6e-05,0.000135,7.6e-05,0.000189,0.000349,0.000275,0.000192,4e-04,0.000196,0.000143,0.000217,0.000194,0.000318,0.000386,0.000131,5.2e-05,0.000125,0.000147,0.00017,0.000199,0.000551,0.000389,9.6e-05,0.000187,8e-05,8.1e-05,0.000235,0.000262,0.000489,0.00046,0.000326,0.000102,0.000544,0.000874,0.000846,0.000493,6.7e-05,0.000122,3.2e-05,0.000235,9.8e-05,0.000333,0.000327,0.000427,0.000211,0.000442,0.00055,0.000283,0.00019,0.000161,9.4e-05,0.000133,9.1e-05,0.000183,0.000139,0.000141,0.000285,0.000212,0.00022,6e-05,9.9e-05,0.000168,0.000252,0.000177,0.000183,0.000452,0.000118,0.000156,0.000107,0.000153,0.000418,0.000119,9.8e-05,0.000383,0.000278,0.00023,7.9e-05,0.000337,0.000372,0.000297,0.000349,7e-05,0.000239,0.000252,0.000198,0.000182,0.000368,0.000435,0.000142,0.000102,0.000194,1.5e-05,4.9e-05,0.000205,0.000111,0.000177,0.000113,0.000223,0.000125,0.000212,0.000123
2e-06,0,2e-06,2e-06,1e-06,1e-06,1e-06,3e-06,2e-06,0,0,3e-06,1.2e-05,1.4e-05,8e-06,7e-06,2.1e-05,9e-06,1.6e-05,3.2e-05,4.3e-05,0.000133,0.000113,0.000231,0.000128,0.000149,0.000229,0.000193,0.000139,7.1e-05,0.000254,0.000296,0.000333,0.000369,0.000272,0.000111,0.000207,4.2e-05,0.000154,0.000342,0.000279,0.00026,0.000103,4.5e-05,6.1e-05,6.8e-05,0.000176,0.000151,0.000355,0.000479,0.000271,9.8e-05,0.000606,0.000162,7.6e-05,0.000304,0.000614,0.000482,0.00027,2e-04,7.4e-05,0.000357,0.000149,0.000331,0.000116,0.000454,0.000501,0.000339,0.000172,8.8e-05,0.000325,8.8e-05,0.000152,0.000119,6.3e-05,9.9e-05,0.000274,0.000109,0.000146,0.00021,0.000266,5.4e-05,0.000239,0.000158,0.000218,0.000399,0.000236,0.000289,0.000128,0.000154,0.000243,0.000209,0.00023,0.000402,0.000343,0.000241,0.000153,0.00025,0.000235,0.00018,0.000276,8.1e-05,0.000198,0.000193,5.5e-05,0.000109,0.000105,0.000102,0.000146,0.000225,0.000145,0.000136,8.1e-05,0.000121,6.4e-05,0.000139,0.000128,0.000142,0.000236,5e-05,3.5e-05
2e-06,1e-06,1e-06,2e-06,0,2e-06,1e-06,2e-06,1e-06,1e-06,1e-06,3e-06,1.1e-05,4e-06,2e-06,8e-06,2.2e-05,9e-06,2.3e-05,1.7e-05,3.8e-05,8e-05,0.000103,0.000111,0.00014,0.000208,3.1e-05,7.7e-05,8.2e-05,6.9e-05,6.1e-05,0.000102,8.1e-05,0.00016,7.5e-05,0.000114,0.000234,0.000168,0.000289,0.000152,0.000223,0.000354,0.000256,0.000161,0.000102,3e-06,8.7e-05,0.000105,0.000374,0.000129,0.000255,0.000248,0.000464,0.000419,0.000348,0.000281,0.00039,0.000119,0.00017,0.000387,0.000229,0.000152,8.8e-05,7.3e-05,0.000304,9.7e-05,0.000279,0.000182,5.3e-05,0.000119,0.000174,0.000266,0.000132,3.5e-05,9.6e-05,0.000188,0.000124,0.00015,0.00014,0.000184,0.000315,0.000319,9.2e-05,3e-05,9.8e-05,0.000279,0.000217,0.000418,0.000427,0.000203,0.000182,0.000131,0.000158,0.000146,0.000149,6.9e-05,3.9e-05,7.4e-05,9.1e-05,0.000192,0.00041,0.000226,2.7e-05,8.5e-05,4.4e-05,6.6e-05,8.7e-05,0.000205,0.000237,0.000269,0.000128,0.000255,0.000127,0.000126,8e-05,0.000103,8.6e-05,0.000107,0.000134,8.7e-05,4.5e-05
0,1e-06,1e-06,1e-06,1e-06,3e-06,0,2e-06,0,0,0,2e-06,4e-06,3e-06,3e-06,6e-06,1e-05,3e-06,3e-05,1.9e-05,4.9e-05,4.1e-05,6e-05,1.5e-05,5.9e-05,0.000148,7.3e-05,6.4e-05,7.4e-05,5.2e-05,7.4e-05,0.000133,3.5e-05,0.000131,8e-06,5.7e-05,0.000149,0.00015,0.000146,0.000112,0.000172,0.000113,0.000131,7.4e-05,8.8e-05,7.3e-05,3.3e-05,3.4e-05,0.000238,0.000272,0.000389,0.000134,0.000145,0.000217,0.000302,0.000154,0.000284,0.000142,0.000247,0.000239,0.000138,0.000219,0.000254,0.000117,0.000245,0.000307,0.000227,6.4e-05,5.9e-05,0.000153,0.000149,0.000198,8.7e-05,0.000113,7.9e-05,0.000172,7e-05,0.000187,0.000165,5.6e-05,0.000151,0.000275,0.000151,4.2e-05,8.1e-05,5.6e-05,0.000245,0.000105,0.000186,0.00015,0.000225,7.7e-05,0.000125,0.000126,9.7e-05,6.9e-05,7.2e-05,2.5e-05,0.000147,6.6e-05,0.000266,0.000146,8e-05,6.8e-05,0.000111,6e-05,0.000152,0.000167,0.000267,0.000113,3.5e-05,0.000151,0.000144,0.000101,6e-05,5.2e-05,0.000114,0.000168,0.00025,0.000134,0.000108
0,2e-06,2e-06,2e-06,0,2e-06,2e-06,2e-06,2e-06,1e-06,0,2e-06,1e-06,3e-06,4e-06,3e-06,1e-06,1.4e-05,1.7e-05,1.4e-05,4.3e-05,4e-05,7.9e-05,2.5e-05,1.2e-05,0.000104,0.000115,6.7e-05,7.4e-05,3.6e-05,0.000124,7.7e-05,0.000104,0.000124,0.00011,6.2e-05,6.9e-05,0.000244,0.000102,2.6e-05,5.1e-05,7.8e-05,3.8e-05,2.5e-05,9.4e-05,0.00011,9.6e-05,1.1e-05,0.000134,0.000195,7.4e-05,3.3e-05,0.000144,0.000191,0.000135,8.4e-05,0.000367,0.000118,0.000272,7.5e-05,6.2e-05,0.000368,0.000148,1e-04,0.000129,0.000197,9.8e-05,0.000184,0.000157,5.7e-05,0.000116,9.1e-05,0.000191,0.000112,9.4e-05,0.000104,4e-05,0.000173,0.000105,7.4e-05,0.000153,0.000135,0.000111,0.00013,0.00012,8.7e-05,0.00021,0.000213,6.4e-05,9.8e-05,7.3e-05,7.4e-05,8.1e-05,6e-05,8.3e-05,0.000148,0.000115,9e-05,4.4e-05,1.1e-05,0.000124,0.000149,7.1e-05,5.9e-05,5.8e-05,4e-05,5.5e-05,5.2e-05,0.000108,9.7e-05,7.3e-05,0.000151,8e-06,5.4e-05,1.9e-05,5.2e-05,0.000159,0.000179,0.000129,9.9e-05,0.000108
2e-06,2e-06,1e-06,2e-06,1e-06,1e-06,1e-06,1e-06,0,1e-06,1e-06,1e-06,1e-06,3e-06,6e-06,6e-06,1.1e-05,1.4e-05,2e-05,1.3e-05,4.2e-05,6.4e-05,5.2e-05,4e-05,1e-05,0.000142,5.6e-05,3.8e-05,3.6e-05,5.5e-05,9e-05,8.7e-05,7e-05,8.7e-05,9e-05,3e-05,0.000112,0.000185,9.6e-05,8.2e-05,8.4e-05,0.000168,0.000163,0.000144,0.000168,5e-05,3.1e-05,3.5e-05,0.000122,6.6e-05,0.000173,0.000107,0.000164,0.000155,9.3e-05,4.2e-05,0.000251,0.000151,0.000165,6.2e-05,0.000128,0.000199,9.2e-05,0.000133,0.000101,0.000163,0.000144,0.000202,0.000188,0.000236,5.8e-05,5.2e-05,0.000132,3.1e-05,3.4e-05,6.8e-05,7e-05,0.000153,0.000235,0.000191,0.000213,3.4e-05,2e-05,9e-05,4.1e-05,0.000121,8.4e-05,0.000119,9.5e-05,0.000168,0.000196,9.6e-05,9.8e-05,3.6e-05,3.8e-05,0.00011,7.5e-05,3.6e-05,1.1e-05,7e-05,4.4e-05,0.000117,5.4e-05,6.5e-05,5.1e-05,8.3e-05,3.2e-05,8.8e-05,2.8e-05,7e-06,0.000154,0.00012,7.9e-05,3e-05,6.5e-05,6.4e-05,0.000104,6.6e-05,0.000103,0.00016,0.000175
2e-06,0,2e-06,1e-06,1e-06,2e-06,1e-06,0,1e-06,1e-06,0,1e-06,0,3e-06,5e-06,7e-06,7e-06,1.6e-05,1e-05,8e-06,1.5e-05,4.6e-05,4.3e-05,2.5e-05,1.8e-05,9.2e-05,5.4e-05,6.7e-05,7.6e-05,6.4e-05,0.000106,0.000127,9e-06,2.3e-05,4.5e-05,6.4e-05,0.000104,7.9e-05,2.2e-05,0.000148,6.5e-05,1e-04,0.000187,0.000121,4.4e-05,7.9e-05,4.3e-05,0.000134,0.000213,0.000133,0.000196,0.000129,0.000107,0.00012,5e-05,3.9e-05,0.000127,0.000133,1.5e-05,6.7e-05,0.000182,8.7e-05,9.4e-05,1e-04,9.8e-05,0.000119,0.000152,3.2e-05,0.000158,4.5e-05,3.2e-05,8.8e-05,1e-04,5.9e-05,5.3e-05,0.000102,8.8e-05,0.000114,0.000123,5e-05,8.2e-05,8.7e-05,7.4e-05,9.5e-05,0.000125,0.000168,0.00013,0.000114,4e-05,9.1e-05,3.8e-05,9.2e-05,6.3e-05,0.000131,0.000125,7.2e-05,0.000105,0.00011,0.000121,4.6e-05,6.2e-05,7.7e-05,3.2e-05,6.8e-05,4.7e-05,1.6e-05,9.7e-05,5.2e-05,4.2e-05,5.5e-05,8.5e-05,0.000101,0.000115,0.000103,0.000113,1.4e-05,0.000151,6.4e-05,0.000126,0.000111,5.5e-05
1e-06,1e-06,1e-06,1e-06,1e-06,1e-06,2e-06,1e-06,2e-06,3e-06,2e-06,1e-06,1e-06,2e-06,2e-06,6e-06,1.5e-05,8e-06,1.2e-05,9e-06,3e-05,4.2e-05,5.2e-05,5e-06,3.9e-05,9e-05,2e-05,1.1e-05,6.7e-05,7e-05,0.000114,4.3e-05,5e-05,4.7e-05,3.5e-05,4.4e-05,9.4e-05,7e-05,5.8e-05,0.000114,6.9e-05,4e-05,5.5e-05,8.3e-05,8.9e-05,7.1e-05,5e-05,0.000115,0.000121,9e-05,0.000119,7e-05,0.000126,0.000143,1.3e-05,0.000108,4.9e-05,7.1e-05,9.8e-05,0.000134,0.000155,5.6e-05,9.5e-05,6.9e-05,0.000156,1.2e-05,5.3e-05,7.9e-05,0.000106,0.000107,6e-05,7e-05,0.000135,0.000199,9.7e-05,0.00011,2.5e-05,6.3e-05,5.2e-05,0.000109,3.9e-05,7.4e-05,8.9e-05,0.000108,3.3e-05,2.9e-05,6.6e-05,7.2e-05,1.6e-05,8.2e-05,0.000123,4.9e-05,5.3e-05,0.000128,1.8e-05,0.000102,3.2e-05,4.5e-05,7.5e-05,4.8e-05,2.2e-05,4.8e-05,1.8e-05,5e-05,2.8e-05,7e-06,5.8e-05,3.7e-05,2.2e-05,6.1e-05,4.7e-05,0.000125,0.00013,5.9e-05,6.8e-05,6.5e-05,0.000126,7.4e-05,0.000154,4.8e-05,3.4e-05
1e-06,1e-06,2e-06,1e-06,1e-06,0,1e-06,2e-06,0,2e-06,0,1e-06,0,1e-06,0,5e-06,1.2e-05,2e-05,9e-06,7e-06,2e-05,3.3e-05,4.7e-05,4.8e-05,2.4e-05,9.4e-05,6.3e-05,1.5e-05,3.7e-05,9.7e-05,3.2e-05,2.9e-05,5.5e-05,7.1e-05,7.4e-05,4.5e-05,0.000103,6.4e-05,0.000117,0.000181,8.3e-05,7.4e-05,9.7e-05,4.8e-05,6.3e-05,5.6e-05,9.9e-05,3.8e-05,8.2e-05,8e-05,0.000117,0.000133,3.9e-05,3.2e-05,2.1e-05,7.6e-05,7.5e-05,7.8e-05,9.4e-05,0.000105,0.000127,0.00013,0.000153,4.6e-05,8.1e-05,0.000127,2.7e-05,7.4e-05,7.4e-05,6.1e-05,0.000105,0.000108,2.7e-05,0.000115,0.000163,8.5e-05,2.1e-05,2.4e-05,1e-05,6.1e-05,0.000124,8.4e-05,8.3e-05,7.1e-05,8e-05,5.7e-05,9.3e-05,6e-05,4.2e-05,9e-05,0.000147,0.000153,3.5e-05,9e-05,0.000104,4.7e-05,1.5e-05,3.7e-05,9e-06,7.2e-05,6e-05,3.8e-05,3.3e-05,7.5e-05,5.7e-05,3.9e-05,5.3e-05,6.7e-05,2.8e-05,5e-05,9.3e-05,0.000121,6.7e-05,9.3e-05,1.4e-05,5.3e-05,7.9e-05,1.8e-05,0.00015,6.6e-05,7.8e-05
1e-06,1e-06,0,1e-06,2e-06,2e-06,1e-06,0,1e-06,2e-06,1e-06,1e-06,2e-06,2e-06,2e-06,2e-06,9e-06,1.1e-05,1.8e-05,6e-06,2.3e-05,2.7e-05,2.2e-05,2.6e-05,1.6e-05,8.6e-05,5.8e-05,5.2e-05,4.1e-05,2.9e-05,3.5e-05,4.7e-05,4.2e-05,5.5e-05,5.6e-05,1.4e-05,6.4e-05,2.2e-05,8.3e-05,4.8e-05,1.5e-05,6e-05,0.000101,4.1e-05,3.7e-05,2.6e-05,4.8e-05,3.6e-05,0.000181,4.9e-05,6.1e-05,9e-06,7.3e-05,5.8e-05,7.8e-05,3.5e-05,3.7e-05,0.00013,0.000102,0.000136,5.3e-05,0.000159,6.5e-05,6.8e-05,6.2e-05,1.5e-05,5.1e-05,8.3e-05,9.7e-05,0.00013,2e-06,9.1e-05,2.1e-05,3.9e-05,2.5e-05,4.3e-05,7.4e-05,2.3e-05,3.2e-05,2e-05,8.5e-05,1.7e-05,3.8e-05,7.5e-05,1.9e-05,5.3e-05,6.4e-05,0.000124,1.8e-05,7.6e-05,4.8e-05,4.8e-05,0.000106,9.1e-05,5.5e-05,1.3e-05,4.7e-05,6.8e-05,6.9e-05,5.9e-05,8e-06,2.9e-05,3e-05,0.000111,0.000102,3.2e-05,5.8e-05,6.2e-05,4.3e-05,0.000125,2.1e-05,5e-05,0.000106,4.4e-05,5.7e-05,3e-05,6e-06,3.5e-05,0.000104,1.7e-05,5.4e-05
3e-06,2e-06,0,2e-06,3e-06,2e-06,1e-06,1e-06,3e-06,3e-06,2e-06,1e-06,2e-06,4e-06,4e-06,3e-06,1.2e-05,8e-06,1e-05,1e-06,2e-05,2.9e-05,3.3e-05,7e-06,2.1e-05,8.4e-05,2e-05,1.4e-05,5.1e-05,9e-05,8.2e-05,1e-04,0.000107,0.000111,0.000115,4.9e-05,3.5e-05,6.6e-05,5.4e-05,0.000126,0.000116,6.6e-05,6.5e-05,4.2e-05,2.1e-05,2.8e-05,3.3e-05,4.5e-05,0.000179,0.000163,0.000134,0.000152,0.000132,0.000131,0.00011,0.000171,7.3e-05,0.000108,5.9e-05,2.8e-05,0.000104,8.8e-05,6.4e-05,8.8e-05,1.7e-05,2.9e-05,7.4e-05,4.6e-05,7.1e-05,5.9e-05,3.4e-05,4e-05,5e-05,5.5e-05,3.4e-05,8.2e-05,0.000111,0.000145,0.000111,4.2e-05,3e-05,3.4e-05,5e-05,5.3e-05,6.5e-05,5.3e-05,4.8e-05,0.000117,4.4e-05,1.7e-05,3.2e-05,8.6e-05,8.4e-05,7.2e-05,7.2e-05,8e-06,5.7e-05,2.3e-05,0.000113,6.8e-05,2.8e-05,4.6e-05,6.3e-05,3.5e-05,2.3e-05,9.6e-05,4.1e-05,5.8e-05,3.2e-05,0.000125,6.8e-05,8.8e-05,8e-05,6.6e-05,2.1e-05,1.8e-05,1.9e-05,2.8e-05,8.9e-05,5.4e-05,3.5e-05
1e-06,1e-06,1e-06,2e-06,2e-06,2e-06,1e-06,0,3e-06,1e-06,1e-06,1e-06,1e-06,4e-06,3e-06,5e-06,9e-06,7e-06,1e-05,6e-06,2.1e-05,3.4e-05,2.3e-05,2.9e-05,2.3e-05,6.6e-05,1.6e-05,2.6e-05,3.1e-05,8.1e-05,3.3e-05,4.2e-05,3.3e-05,3.5e-05,7.5e-05,4.3e-05,6.6e-05,5.1e-05,4.2e-05,0.000121,9.4e-05,6e-05,9.3e-05,3.8e-05,5.2e-05,2.3e-05,7e-05,9.2e-05,5.4e-05,8.9e-05,5.4e-05,0.00011,8.5e-05,5e-05,8.2e-05,0.000107,8.1e-05,8.9e-05,1.3e-05,6e-05,0.000123,0.000132,8.7e-05,3.8e-05,9e-05,6.9e-05,7e-06,5.6e-05,8e-05,2.8e-05,5.4e-05,6.3e-05,3.7e-05,4.4e-05,4.9e-05,4.5e-05,4.1e-05,5.6e-05,2.1e-05,2.1e-05,2.7e-05,7e-06,2.8e-05,5.2e-05,3.7e-05,3.5e-05,8.3e-05,4.2e-05,1.4e-05,4.3e-05,5.1e-05,3.2e-05,3.6e-05,4.3e-05,3.1e-05,4.2e-05,2.2e-05,1.2e-05,7.8e-05,4.5e-05,3.2e-05,2.6e-05,3.4e-05,4e-05,2e-05,7.8e-05,3.7e-05,3.4e-05,2.6e-05,8.3e-05,3.1e-05,3.4e-05,2.3e-05,1.8e-05,3.7e-05,1.7e-05,1.3e-05,2.1e-05,0.000119,7.4e-05,1.2e-05
1e-06,1e-06,2e-06,2e-06,2e-06,1e-06,0,1e-06,1e-06,2e-06,2e-06,1e-06,0,1e-06,3e-06,4e-06,6e-06,5e-06,4e-06,1e-05,1.9e-05,3.2e-05,1.7e-05,3e-05,1.5e-05,5.8e-05,1.7e-05,4e-06,1.7e-05,5e-05,2.5e-05,4.8e-05,5.7e-05,7.6e-05,2.4e-05,2.8e-05,3.7e-05,2.1e-05,2.5e-05,6.8e-05,7.4e-05,2.5e-05,8.2e-05,6.5e-05,1.4e-05,1.1e-05,4.9e-05,5.4e-05,3e-06,8.7e-05,4.4e-05,8.4e-05,1.6e-05,4.2e-05,7.1e-05,0.000141,2.6e-05,0.00011,4.7e-05,6.4e-05,7.1e-05,9e-05,1.7e-05,6.4e-05,4.9e-05,1.6e-05,2.1e-05,6.5e-05,4.9e-05,3.9e-05,7.2e-05,3.1e-05,3.4e-05,5e-06,5.3e-05,4.5e-05,3.1e-05,5.4e-05,4.3e-05,1.5e-05,7e-06,2.4e-05,2.4e-05,5.3e-05,2.7e-05,2.3e-05,4e-05,7.7e-05,9e-06,9e-05,6.1e-05,2.4e-05,1.4e-05,5.2e-05,3.4e-05,3.3e-05,6e-06,3.4e-05,4.8e-05,4.6e-05,3.9e-05,2e-05,3.5e-05,2.4e-05,2e-05,5.7e-05,3.6e-05,2.1e-05,3.7e-05,4.7e-05,1.8e-05,2.6e-05,2.6e-05,2.6e-05,1.5e-05,2.3e-05,2.1e-05,2.8e-05,1e-04,1.5e-05,1e-05
1e-06,2e-06,2e-06,0,1e-06,1e-06,1e-06,1e-06,1e-06,2e-06,1e-06,1e-06,1e-06,1e-06,1e-06,3e-06,7e-06,1e-05,5e-06,6e-06,2.7e-05,3.4e-05,2.3e-05,2.4e-05,1.5e-05,6e-05,3.3e-05,2.7e-05,9e-06,3.3e-05,7e-06,2e-05,3.1e-05,2.5e-05,4.6e-05,5e-06,1.2e-05,1.2e-05,1.5e-05,6.9e-05,3.8e-05,2.8e-05,1.8e-05,2.6e-05,1.7e-05,1.8e-05,4.5e-05,6e-05,3e-06,4.5e-05,2.1e-05,1.6e-05,1e-05,5e-06,5.3e-05,8.8e-05,8.6e-05,0.000131,8.9e-05,4.5e-05,0.000109,7.5e-05,9e-06,2.2e-05,7.1e-05,4.7e-05,3.8e-05,6.8e-05,5.3e-05,6.3e-05,8e-06,2.9e-05,7.4e-05,5.2e-05,2.3e-05,3.5e-05,4.1e-05,4.5e-05,2.9e-05,2.8e-05,3.8e-05,4.9e-05,6.6e-05,3.4e-05,1.2e-05,5e-05,8.1e-05,7.8e-05,3.9e-05,9.5e-05,5e-05,1.7e-05,4.6e-05,1.3e-05,4e-06,1.7e-05,3.1e-05,5.3e-05,4.7e-05,6.2e-05,4.2e-05,5e-05,5.6e-05,8e-05,4.6e-05,6.5e-05,6.4e-05,7e-05,1.4e-05,6.9e-05,2.2e-05,4.6e-05,4.8e-05,6.6e-05,3.5e-05,1.1e-05,2.3e-05,4.7e-05,0.000128,5.6e-05,1.4e-05
0,1e-06,0,1e-06,0,1e-06,1e-06,0,1e-06,1e-06,1e-06,1e-06,1e-06,2e-06,2e-06,3e-06,4e-06,8e-06,5e-06,2e-06,1.9e-05,2.7e-05,1.7e-05,2.6e-05,2.4e-05,3.6e-05,1.7e-05,3e-06,1.2e-05,4.8e-05,1e-05,1.6e-05,1.8e-05,2.3e-05,2.9e-05,1.6e-05,4e-06,3.9e-05,4e-06,8.1e-05,2.7e-05,1.5e-05,3.3e-05,2.6e-05,8e-06,8e-06,5.4e-05,6.2e-05,2.7e-05,4.5e-05,3.5e-05,5.4e-05,4.2e-05,5.1e-05,3.4e-05,4.8e-05,5.4e-05,5.1e-05,2.8e-05,6.7e-05,5.4e-05,2.9e-05,3.2e-05,3.5e-05,6.4e-05,4.4e-05,6e-06,4.5e-05,5.5e-05,1.2e-05,3.4e-05,3.3e-05,2.1e-05,2.1e-05,1.7e-05,8e-06,3e-05,4.4e-05,3.9e-05,1.6e-05,4.1e-05,4.7e-05,6.8e-05,1.5e-05,1.4e-05,4.7e-05,5.3e-05,4.7e-05,4e-06,5.1e-05,1.3e-05,2e-05,5.8e-05,3.5e-05,2e-05,5e-06,2.7e-05,2.2e-05,4.3e-05,2.4e-05,1.3e-05,1.2e-05,1.3e-05,4.3e-05,2.1e-05,6.5e-05,2.5e-05,3.7e-05,6e-06,5.5e-05,1.3e-05,2.7e-05,5.6e-05,2.1e-05,2.4e-05,2.8e-05,8e-06,2.4e-05,7.5e-05,1.8e-05,1.2e-05
1e-06,1e-06,1e-06,2e-06,1e-06,1e-06,0,0,0,0,1e-06,0,1e-06,1e-06,1e-06,3e-06,3e-06,9e-06,7e-06,1e-06,1.7e-05,3.1e-05,2.1e-05,2.7e-05,1.4e-05,4.3e-05,1.5e-05,1.1e-05,1.8e-05,4.2e-05,1.3e-05,2e-06,1.5e-05,1.4e-05,3.7e-05,1.4e-05,6e-06,3.3e-05,2.1e-05,6.3e-05,2.5e-05,1.4e-05,3.5e-05,5e-06,1.5e-05,1.2e-05,4.5e-05,4.1e-05,2.2e-05,3.7e-05,2.7e-05,3.4e-05,4.1e-05,5.5e-05,8e-06,8e-06,2.4e-05,3.6e-05,1.8e-05,2.8e-05,5.7e-05,5.7e-05,2.4e-05,2e-05,5.5e-05,3e-05,1.1e-05,3.6e-05,4.1e-05,2.3e-05,3.9e-05,4.1e-05,1.1e-05,8e-06,3.1e-05,9e-06,1.5e-05,1.3e-05,1.8e-05,1.4e-05,2.5e-05,3.2e-05,3.7e-05,1.3e-05,2.1e-05,5e-06,3.9e-05,3.7e-05,7e-06,5.1e-05,4.4e-05,2e-05,3.9e-05,1.6e-05,1.9e-05,2.8e-05,1e-06,1.3e-05,3e-05,8e-06,1.4e-05,1.4e-05,1.9e-05,1e-05,8e-06,2.4e-05,4e-05,5.2e-05,1.2e-05,3.7e-05,8e-06,1.9e-05,3.8e-05,6e-06,2.2e-05,1.1e-05,7e-06,8e-06,6.6e-05,2e-05,1.4e-05
1e-06,1e-06,1e-06,1e-06,1e-06,1e-06,0,0,1e-06,1e-06,0,0,1e-06,1e-06,2e-06,2e-06,4e-06,8e-06,8e-06,1e-06,1.7e-05,2.8e-05,2.5e-05,1.2e-05,1.2e-05,4.6e-05,2e-05,8e-06,8e-06,4.7e-05,7e-06,2e-06,1e-05,2.3e-05,1.9e-05,1.7e-05,1.1e-05,2.8e-05,1.8e-05,6.1e-05,1.9e-05,8e-06,4.3e-05,1.3e-05,1.5e-05,1.2e-05,3.1e-05,3.9e-05,1.8e-05,4.8e-05,2.1e-05,3.9e-05,3.4e-05,3.9e-05,6e-06,4e-06,1.4e-05,1.8e-05,7e-06,2e-05,5.2e-05,4.4e-05,9e-06,1.4e-05,5.5e-05,3.8e-05,1.2e-05,3.4e-05,3.2e-05,2.3e-05,2.7e-05,3.5e-05,9e-06,7e-06,2.1e-05,3e-06,5e-06,5e-06,1.3e-05,1.5e-05,2.2e-05,3.4e-05,3.8e-05,1.3e-05,1.2e-05,1.1e-05,3.9e-05,4.4e-05,8e-06,5.3e-05,5e-05,4e-06,3.4e-05,2e-05,1.9e-05,2.7e-05,4e-06,1e-05,4.1e-05,1.7e-05,1.3e-05,1.3e-05,9e-06,1e-05,3e-06,2.6e-05,2e-05,4.1e-05,1.9e-05,4e-05,1.1e-05,6e-06,4.1e-05,9e-06,2.2e-05,1.9e-05,1e-05,7e-06,6.6e-05,1.4e-05,1.8e-05
1e-06,1e-06,1e-06,1e-06,1e-06,1e-06,0,0,1e-06,0,0,0,0,0,1e-06,3e-06,4e-06,8e-06,8e-06,0,1.8e-05,2.7e-05,2.2e-05,1.8e-05,1.7e-05,4.5e-05,1.3e-05,5e-06,4e-06,4.3e-05,6e-06,6e-06,1e-06,2.3e-05,2.4e-05,1.2e-05,9e-06,2.7e-05,1.4e-05,5.6e-05,2.2e-05,1e-05,4.7e-05,5e-06,1.3e-05,1.3e-05,3.2e-05,4.1e-05,1.3e-05,4.8e-05,1.9e-05,4.2e-05,3.6e-05,4e-05,2e-06,8e-06,1.7e-05,3.3e-05,9e-06,1.9e-05,6.3e-05,5.5e-05,1.7e-05,1.7e-05,5.6e-05,2.3e-05,1.5e-05,3.3e-05,2.4e-05,2.7e-05,3.4e-05,3.5e-05,2e-06,9e-06,2.4e-05,3e-06,7e-06,8e-06,1.3e-05,1e-05,2.1e-05,2.7e-05,3.6e-05,8e-06,1.3e-05,8e-06,3.4e-05,4.4e-05,9e-06,5.4e-05,4.4e-05,1.4e-05,2.8e-05,2e-05,2e-05,2.4e-05,2e-06,5e-06,3.6e-05,1.8e-05,1.6e-05,1.1e-05,9e-06,8e-06,5e-06,2.8e-05,2.7e-05,3e-05,1.6e-05,4.2e-05,8e-06,2e-06,3e-05,1e-05,1.8e-05,1.6e-05,1e-05,5e-06,6.8e-05,1.8e-05,1.5e-05
