-0.052386,-0.004192,-0.001847,-0.003655,-0.002295,-0.004451,-0.060659,-0.069159,-0.007121,-0.002094,-0.041405,-0.166175,-0.183897,-0.045654,-0.00205,-0.000582,-0.004605,-0.050098,-0.088816,-0.112457,-0.036149,-0.003036,-0.001032,-0.007447,-0.094396,-0.127953,-0.039701,-0.010257
-0.031986,0.003531,0.001362,0.001778,0.000463,-9.1e-05,-0.005022,-0.017369,-0.002664,-0.000736,-0.014696,-0.077356,-0.102064,-0.019407,-0.000219,0.000102,-0.003262,-0.027268,-0.030481,-0.084559,-0.033029,-0.001369,-0.000317,-0.004066,-0.047899,-0.065541,-0.029593,-0.008479
0.006841,-0.003298,-0.000955,-0.000514,-0.000347,-0.001125,0.008136,0.017602,0.002009,0.000811,0.014138,0.03268,0.028312,0.009941,0.000275,-6.3e-05,-0.000377,-0.014873,-0.041541,-0.032705,-9.9e-05,0.000303,0.000273,0.00171,0.008639,0.003657,0.003973,0.001696
0.046917,0.000994,0.000626,0.00156,0.000386,0.000645,0.026936,0.040969,0.005118,0.001454,0.027113,0.113746,0.130831,0.027324,0.001469,0.000417,0.003594,0.031758,0.03767,0.075375,0.032518,0.001948,0.000723,0.005892,0.06215,0.09023,0.038969,0.010795
0.023934,0.005232,0.001514,0.001162,0.000722,0.001838,0.011935,0.005264,0.000609,0.000201,0.00485,0.059728,0.076046,0.016253,0.000558,0.00029,0.00261,0.037655,0.072214,0.082957,0.022167,0.001551,0.000395,0.001852,0.026099,0.035949,0.014902,0.004161
-0.050133,-0.005529,-0.002277,-0.003637,-0.00133,-0.002638,-0.046561,-0.056995,-0.006479,-0.001716,-0.032149,-0.116962,-0.11689,-0.026176,-0.002251,-0.000661,-0.002491,-0.023165,-0.042708,-0.054683,-0.020008,-0.001734,-0.000889,-0.006496,-0.071474,-0.09491,-0.031444,-0.008803
-0.037708,-0.000927,-0.000119,0.000366,-0.000178,-0.000375,-0.004943,-0.00618,-0.001388,-0.000622,-0.014299,-0.099495,-0.119275,-0.027906,-0.00037,-7.5e-05,-0.002423,-0.027136,-0.036682,-0.056592,-0.024428,-0.001495,-0.000514,-0.003529,-0.047717,-0.060533,-0.022418,-0.006784
0.016461,0.003605,0.00158,0.002404,0.000978,0.001784,0.034331,0.042807,0.00497,0.001358,0.020931,0.043153,0.025861,0.006416,0.00147,0.000403,0.000476,0.002853,0.020999,0.023328,0.004202,0.001013,0.000639,0.003585,0.024976,0.019251,0.006181,0.002721
0.0335,-0.002361,-0.00079,-0.000428,0.000248,-0.000749,-0.002939,0.006025,0.002083,0.000938,0.019069,0.086398,0.100442,0.02693,0.000558,6e-05,0.001438,0.006352,0.006838,0.040147,0.021014,0.001351,0.000502,0.003575,0.053516,0.075067,0.025551,0.007868
0.015444,0.00217,0.000198,-0.000566,-0.000173,7.2e-05,-0.019433,-0.027412,-0.002407,-0.000613,-0.006056,0.027195,0.038626,0.005593,8.8e-05,6.8e-05,0.001003,0.011797,0.022081,0.036395,0.011994,0.000104,-0.000107,0.000443,0.02858,0.04545,0.013445,0.003059
-0.030756,0.00069,0.000247,-0.000877,-0.000591,0.000766,-0.011337,-0.02277,-0.002758,-0.001179,-0.021275,-0.060829,-0.056532,-0.01736,-0.000984,-0.000262,-0.000642,0.003937,-0.001834,-0.039921,-0.016867,-0.001252,-0.000499,-0.002878,-0.039919,-0.05892,-0.017568,-0.005774
-0.031526,-0.004134,-0.001012,8.1e-05,0.000219,0.000244,0.013918,0.021923,0.001436,0.000171,-0.00198,-0.052252,-0.042611,-0.002604,-0.000188,-0.000182,-0.001302,-0.014714,-0.044082,-0.084446,-0.023783,-0.000686,-0.000191,-0.00256,-0.045467,-0.044493,-0.010573,-0.004238
0.02045,0.002525,0.000824,0.0016,0.000742,0.000382,0.026571,0.039309,0.00385,0.001186,0.015106,0.017348,0.011711,0.007737,0.001329,0.000371,0.000196,-0.005354,-0.012832,-0.003233,0.004259,0.001064,0.000398,0.001922,0.01584,0.022727,0.007453,0.002603
0.031487,0.001716,0.000538,8.9e-05,-6.8e-05,-0.001228,-0.017556,-0.018957,-0.000334,0.000184,0.003454,0.018223,0.004793,-0.004408,-0.000168,6.8e-05,0.001139,0.013251,0.025466,0.059794,0.022876,0.001047,0.000297,0.002995,0.037025,0.025068,0.007223,0.004046
0.006114,-0.002579,-0.001204,-0.001821,-0.000973,-0.001418,-0.033417,-0.044044,-0.003863,-0.000912,-0.007575,0.010364,0.015274,0.000409,-0.000867,-0.000181,-0.000141,0.001108,0.024702,0.053844,0.012945,-9.3e-05,-0.000204,-0.000115,0.01784,0.019552,0.00248,0.000188
-0.018214,0.001827,0.000418,-0.000111,-0.000191,0.00083,0.0089,0.004696,-0.00075,-0.000372,-0.003403,0.010299,0.022031,0.01086,0.000241,-6.3e-05,-0.000527,-0.00643,0.003628,-0.004148,-0.010538,-0.000651,-0.000277,-0.001817,-0.01531,-0.011709,-0.007432,-0.004221
-0.030027,-0.00086,0.000528,0.001522,0.000687,0.000985,0.026032,0.033726,0.002787,0.000494,0.001705,-0.022725,-0.021069,-0.004211,-0.000256,-6.8e-05,3.5e-05,8.6e-05,-0.029493,-0.074486,-0.02292,-0.000783,-9e-05,-0.001428,-0.044886,-0.050443,-0.008358,-0.002216
0.005415,-0.001956,-0.000712,4.7e-05,0.000325,0.000136,0.008115,0.012692,0.001057,0.000516,0.004774,-0.017761,-0.018979,-0.007723,0.000158,0.00019,-4e-04,-0.009186,-0.023151,-0.030863,-0.004958,-0.000147,0.000214,7.9e-05,-0.008805,-0.010746,0.001632,0.002881
0.030913,0.002385,0.000225,-0.000786,-0.000242,-0.000757,-0.01844,-0.0237,-0.002267,-2e-04,-0.000148,0.007686,-0.000399,-0.000324,0.000238,6.6e-05,0.000112,0.000425,0.013902,0.04573,0.017778,0.00057,0.000176,0.001447,0.049436,0.054269,0.006181,0.002531
