-0.000175,0.000326,0.000908,0.000267,-0.000868,-0.000935,-0.000281,-0.000635,0.000128,0.000299,-0.004962,-0.021372,-0.018033,-0.008801,-0.001125,-0.00112,-1.7e-05,-0.000134,-0.000596,-0.002013,-0.001168,-0.001723,-0.003843,-0.002006,-0.000102,0.000396,0.000678,0.000521,0.000276,2e-04,-5.5e-05,-1.5e-05,-0.000418,-0.000262,0.000746,-0.000485,-0.011295,-0.017271,-0.020245,-0.013384,-0.009292,-0.006785,-0.003617,-0.001188,-0.000787,-0.001774,-0.015632,-0.010968,-0.005428,-0.000789,-0.000263,-0.000227,-0.00029,-0.000844,2.3e-05,-0.000697,-0.000998,-0.001598,-0.01552,-0.029243,-0.017359,-0.008445,-0.003347,-0.001196,-0.000456,-0.000503,-0.001718,-0.000712,-0.000358,-0.000829,-0.000475,-0.000366,-0.000753,-0.000207,-0.000552,-0.000225,-0.000104,0.000219,0.000429,0.000345,-1.9e-05,-1e-06,0.000637,-0.000173,-0.002329,-0.004347,-0.01416,-0.019596,-0.016457,-0.009236,-0.002557,-0.001451,0.000343,1.5e-05,0.000703,0.000999,0.000709,-5e-05,-0.000361,0.000732,0.001223,0.000321,0.00085,0.000645,0.000831,-0.000161,-0.00065,-0.00163,-0.021893,-0.014917,-0.005373,-0.001113,-0.000529,-0.000438,0.000627,-0.005646,-0.007515,-0.004026,-0.001346,-0.000205,-0.000204
0.001128,0.000761,0.000999,0.00088,0.001219,0.001459,0.001235,0.001095,0.000787,0.000437,0.001013,0.012561,0.009613,0.005995,0.003791,0.002411,0.003431,0.002201,0.001447,0.002577,0.001581,2.6e-05,0.002482,0.001674,0.001123,0.000761,0.000419,0.000589,0.000132,0.000286,0.000709,0.000273,0.000837,0.000969,-9.6e-05,-0.000226,0.00317,-0.002636,0.00187,0.001586,0.004855,0.002973,0.001923,0.002722,0.001593,0.00252,0.003964,0.004736,0.00266,0.001769,0.001083,0.001104,0.000736,0.001171,0.001136,0.001647,0.002077,0.000844,0.006073,0.015091,0.012445,0.00646,0.002827,0.002153,0.001237,0.000377,0.001039,9e-04,0.001184,0.001593,0.001588,0.000983,0.001328,0.001286,0.00086,0.00098,0.000644,0.000498,0.000377,5.1e-05,0.000392,0.000353,0.000635,-0.000728,0.00092,0.000729,-0.009581,-0.004954,0.00541,0.005954,0.003012,0.002573,0.000454,-0.000406,0.000462,0.000925,0.001709,0.000976,0.001069,0.000888,0.000754,0.001234,0.00178,0.001104,0.001314,0.001736,0.001907,0.000929,0.006504,0.008813,0.004443,0.001712,0.001212,0.001356,0.001544,0.001627,0.005506,0.003377,0.002178,0.001033,0.000494
0.000848,0.000235,0.000581,0.00021,6.9e-05,-0.000111,-0.000319,1.2e-05,0.000159,-0.000113,-0.000295,-0.007137,-0.006234,-0.002712,0.000587,0.000211,0.000265,-0.000407,0.000134,-0.00017,-0.000431,0.000388,-0.00127,-0.001115,-0.000269,9.3e-05,-0.00011,0.000386,0.000172,-9.3e-05,0.000195,0.000213,5.3e-05,0.000217,-0.000142,-0.000204,-0.001078,0.002431,0.007331,0.006024,0.000497,0.000287,0.001039,0.000164,0.000945,0.000519,0.000374,0.000824,0.0012,9e-04,0.000338,0.000237,-0.000205,-0.000682,4.1e-05,-0.000868,-0.000293,0.000269,-0.006775,-0.011273,-0.012035,-0.006286,-0.001019,-6.9e-05,-0.00013,8.3e-05,-0.000416,-0.000153,-0.000128,-0.000285,-0.000218,-0.000188,-0.000286,0.000295,5.5e-05,0.000343,0.000121,0.000384,0.000216,-0.000141,-7.4e-05,0.000415,-0.000435,-0.000311,-0.001053,0.000432,0.002193,0.008761,0.003803,0.002584,0.000154,-0.000342,-0.000759,0.003362,0.001925,0.000837,0.000784,3.9e-05,0.000141,0.000302,0.000409,0.000405,0.000693,0.00018,0.000776,6.2e-05,-0.000652,0.000158,-0.006953,-0.003038,-0.002264,-0.001335,-0.000966,-0.000443,-0.000443,-0.000415,-0.00149,-0.001518,-0.000439,-0.000259,-0.00041
7.7e-05,-0.000286,0.000367,-5.6e-05,-0.000259,1.9e-05,-0.000233,0.000194,2.1e-05,5.7e-05,0.000427,0.002841,0.002706,0.000569,0.000501,-0.000742,0.001226,0.000101,0.000496,0.000375,0.000209,-0.000192,0.000401,0.000614,0.000595,0.000226,-3.1e-05,0.000387,0.000264,0.000155,1e-05,-0.000303,0.000225,-7.9e-05,-0.000273,0.000356,0.000916,0.001012,-0.010436,-0.007147,-0.002576,-0.001613,-0.000847,-0.000796,-0.000299,0.000984,-0.000875,-0.003128,-0.001647,-0.000585,-6.2e-05,2.1e-05,-0.000242,-0.000127,-0.000219,0.000604,0.000118,0.000609,0.004076,0.008464,0.009222,0.00464,-0.00158,-0.001846,-0.000636,-3.5e-05,-0.000212,0.000666,4e-05,6e-06,0.00029,0.000227,-0.000109,-4.7e-05,0.000183,0.000119,-9.4e-05,0.000277,2.9e-05,-0.000161,0.000337,0.000171,-0.000268,0.000433,0.000651,-7e-06,-0.001911,-0.009736,-0.006086,-0.002453,-0.001001,-0.000365,-0.000188,-0.00073,-0.000928,-0.000725,0.000393,0.000153,-0.00022,3.6e-05,-9.2e-05,0.000633,7.5e-05,-0.000149,-1e-06,0.000433,0.000198,-0.002166,0.003096,-0.002598,-0.000586,7.4e-05,0.000893,0.000414,-1.4e-05,0.000147,0.000846,0.000529,0.000496,0.000152,0.000309
0.00027,7.9e-05,0.00023,-0.000125,-1.5e-05,0.000242,0,0.000153,0.000216,-0.000127,0.00019,-0.00399,-0.000864,0.000944,0.001235,8.8e-05,0.000736,-0.000254,-0.000114,3.8e-05,-0.000386,0.000337,-0.000347,-0.00019,-7.4e-05,-0.00034,-0.000261,-0.000115,-0.000191,0.000131,0.000205,-2e-05,-7.9e-05,-6.9e-05,-0.000277,0.000748,0.000544,-0.002012,0.005191,0.002542,0.001942,0.001502,0.001761,0.000356,0.000846,0.000521,0.000617,0.002293,0.001572,0.000296,-0.000206,0.000312,0.000107,3.5e-05,0.000476,-0.000321,0.000197,1e-04,-0.00308,-0.002557,-0.003181,4.5e-05,0.000429,-0.000119,-0.000538,-0.00036,-0.000393,-0.000307,-7e-04,-0.000295,-0.00012,-2e-05,0.000166,0.000311,-8.5e-05,-1.5e-05,-2.1e-05,0.000132,-0.000177,-2.3e-05,-4.1e-05,-0.000313,-0.000104,0.000154,-7.9e-05,-0.000178,0.000739,0.00563,0.001591,0.002685,0.000478,-0.000888,-0.001069,0.000191,0.000278,-8.7e-05,6.6e-05,-0.000585,-1.5e-05,3.2e-05,-0.000139,0.000274,-0.000275,-0.000125,0.000108,-0.000459,-0.000856,0.00026,-0.000528,0.002394,0.001949,0.000754,0.000291,-1.1e-05,-0.000196,4.2e-05,0.000945,0.000175,0.000751,0.000112,8.2e-05
-0.000551,-0.000432,-0.000182,-0.000175,-0.000418,-0.000245,-0.00033,-1.6e-05,-0.000548,-0.000493,0.000176,0.000154,0.001254,-0.002021,-0.001117,-0.000502,-0.000491,-0.000602,-0.000785,-0.000383,0.000547,-7.1e-05,-5e-05,-0.00031,-0.000393,-0.000136,-3.7e-05,7.4e-05,-0.000246,-8.6e-05,-0.000111,-0.000322,7e-06,-9.3e-05,-0.000266,-0.000128,-0.000142,0.00061,-0.004517,-0.002117,-0.001101,-0.00108,-0.001165,-0.001234,-0.000782,-0.000678,-0.000126,-0.001498,-0.000995,-0.000369,-0.000196,-0.000413,-0.000424,-2e-05,-0.000241,-0.000307,-0.000254,-0.000544,0.001967,-0.003466,0.000891,0.000324,-8.5e-05,-0.000863,-0.000662,-0.000379,-1.1e-05,9e-05,5.4e-05,0.000179,-0.000206,-0.000384,-0.000422,-0.000579,-0.000245,0.000297,-0.000125,-2.7e-05,-0.000243,-0.000171,-0.000354,-6.5e-05,-0.000195,0.000109,-0.000417,-0.000665,0.000994,0.001522,0.00015,-0.001786,-0.00156,-0.001043,-0.00048,-0.000656,-0.000888,-0.000421,-0.000157,-0.000386,-0.000271,-5.6e-05,-0.000394,-9.9e-05,-0.000362,-0.000552,-0.000217,-0.000524,-0.000509,-0.000998,-4.8e-05,-0.004551,-0.002957,-0.001534,-0.000127,-0.000235,-0.000223,0.000592,-0.000881,-4.6e-05,-0.00052,-0.000277,-0.000186
0.000183,-0.000382,-8.2e-05,-0.00046,-5.4e-05,-0.000193,-3.3e-05,-0.000164,-2.5e-05,-9.3e-05,-0.000131,0.001635,-0.000678,0.002395,0.000664,-0.00046,0.000413,5.6e-05,-0.000237,-0.000535,-0.000498,-0.000355,-0.000476,-0.000335,-9e-06,-0.000283,-0.000299,-0.000189,-0.000202,-0.000122,7e-06,-0.000112,-6.3e-05,-0.000124,-0.000251,0.000202,0.000151,-0.002447,0.001066,-0.001488,-0.001659,0.000268,0.000741,8e-04,-1.9e-05,-0.000939,-0.000313,-0.001014,-0.000739,-0.000342,-0.000393,-1e-06,2.7e-05,-0.000215,-0.000103,-0.000218,0.000109,-0.000123,-0.001081,0.005827,-0.00078,-0.001754,-0.000769,-0.000511,-0.000406,-0.000344,-0.000196,-0.000242,-0.000529,-0.000467,-0.000494,-0.000306,1.5e-05,-3e-06,-0.000104,-0.000137,-0.000264,-7.6e-05,-0.000158,-0.000263,-0.000116,-0.000414,-0.000478,0.000268,-3e-05,8.5e-05,0.000573,-0.000498,-0.002857,0.000514,0.000412,-0.000728,-0.000662,3e-06,-0.000482,-0.000323,-0.000413,-0.000326,-0.000128,-0.000209,-0.00062,5e-05,-0.000148,-0.000431,-0.000212,-0.000229,-0.00039,0.000141,3.6e-05,0.000334,0.000594,-7.7e-05,-0.000226,-0.000192,-0.00043,0.000357,-3e-05,-0.00166,-0.000538,-0.000419,-0.000392
-0.000307,-0.000214,-0.000124,-0.000354,-0.000275,-0.000149,-0.000203,-9.6e-05,-0.000265,-0.000158,-0.00023,-0.000781,0.000198,-0.002012,-0.001792,-0.000234,-0.000546,-0.001114,-0.000703,-0.000534,-0.000312,-0.000143,-7.1e-05,6.3e-05,-0.000239,-0.000433,-0.000189,-0.000251,-0.000268,-8.9e-05,-0.000117,-2.9e-05,-0.000218,-9e-05,-0.000116,-0.000223,0.000577,0.000625,0.000675,0.001521,0.001211,-0.000316,-0.000397,-0.001409,-0.000238,2e-05,0.000476,0.000483,0.000709,-0.000127,-0.000171,-0.000166,-0.000246,-0.000269,-0.000261,-0.000477,-0.000317,-8.2e-05,-0.000699,-0.002031,0.000418,-0.001747,-0.000857,0.000267,-0.000349,-7e-06,-0.000214,-2e-04,4.1e-05,0.000101,-8.3e-05,-0.000257,-0.000115,-0.000262,-0.000345,-0.000121,-0.000163,-0.000102,-5.3e-05,-9.2e-05,-0.000104,8e-05,3.1e-05,-0.000189,-0.000126,6e-05,0.000151,-0.003001,0.000336,-0.000791,-0.001646,-0.00038,-0.000536,-0.000492,-0.000711,-0.000393,-0.000496,-0.000376,-0.000264,-0.000157,-0.000284,-0.000175,-0.000332,-0.000274,-0.000174,-0.000516,-0.000376,-0.000792,0.000466,0.002372,-0.000429,-0.001296,-0.000105,-0.000353,-0.000448,0.000599,-0.000308,0.000825,0.000364,-0.000449,-0.00028
-2.7e-05,-0.000371,-0.000128,-0.000142,-0.000103,-0.000241,-0.000143,-0.000224,-1.5e-05,-0.000166,-6e-06,0.000828,-0.001601,0.00093,0.001029,-0.000763,-0.000586,0.00015,3.3e-05,-4.6e-05,0.000189,-0.000237,-0.000134,-0.000165,0.000159,-8e-05,-0.000156,-0.000173,-0.000172,-9.5e-05,-0.000161,-0.000117,0.000115,-0.000226,-0.000251,-0.000119,-0.00016,-0.000153,0.000385,-0.000379,-0.00147,-0.000478,-7.5e-05,0.000149,8.5e-05,-0.000613,1.8e-05,8.2e-05,-0.000429,-9.8e-05,3.1e-05,-0.000277,-8.1e-05,-0.000203,-8.5e-05,0,2.1e-05,-0.000519,0.000462,-0.001401,-0.000987,0.001726,0.000291,0.000503,0.000342,-9.5e-05,0.000183,0.000154,-7.2e-05,-0.000261,-0.000391,-0.000273,-0.000127,-4.6e-05,-6.2e-05,-8.6e-05,-3.3e-05,-0.000152,-0.000189,-0.000207,2.1e-05,-0.000215,-9.3e-05,8.9e-05,0.000165,-0.000206,-5.8e-05,0.001621,0.001621,0.000466,0.000462,-1e-06,-0.000443,-0.000132,-0.000517,-0.000287,-0.000409,-2e-04,-0.000116,-0.00027,-6.7e-05,-0.000188,-0.000321,-0.00035,-0.000321,-0.000291,-0.000329,0.000331,-9.5e-05,0.001044,0.000211,0.000245,0.000188,-2.6e-05,0.000168,0.000335,-0.000299,-0.000636,-0.000222,-0.000182,9.7e-05
7.6e-05,-0.000189,-0.000196,-0.000301,-0.000121,-0.000117,-0.000103,-1e-05,-6.2e-05,-0.000145,-0.000237,-0.000194,0.000115,-0.000157,-0.000776,3e-05,-8.2e-05,-0.000619,-0.000279,-0.000344,-0.000179,0.000134,0.000104,-3.6e-05,-0.000247,-8.8e-05,-0.000135,-0.00014,-8e-06,-2.1e-05,-0.000141,-5.8e-05,-9e-05,-3.9e-05,4.4e-05,-0.000151,0.000109,0.000512,-0.00186,-0.001521,0.000622,6e-06,0.000524,0.00028,0.000114,-0.000543,0.000229,0.000144,-2.5e-05,-0.000497,-0.000484,-0.000211,1.5e-05,6e-05,1.9e-05,-8.6e-05,-1e-04,4.2e-05,-0.000694,0.001649,-0.000427,-0.00148,-0.000366,6.5e-05,0.000108,-1e-06,-0.000132,-0.000176,-0.000257,0.000199,-1e-05,5.4e-05,-6.3e-05,-0.000198,-9.7e-05,-0.000127,-7.5e-05,1.9e-05,-6.5e-05,-0.000147,-1.3e-05,4.2e-05,-0.000285,-0.000139,0.000106,0.000197,2.6e-05,-0.000165,-0.001383,-0.001144,-0.00066,-0.000201,0.000324,-8.8e-05,2.3e-05,-0.000134,-0.000213,-0.000157,-0.000149,-7.9e-05,-2.7e-05,-7.4e-05,-0.00013,-0.000136,-0.000104,-2.3e-05,-0.000148,-0.000145,-8.4e-05,-0.000917,0.000212,-0.000674,2.8e-05,-0.000149,-0.000251,-2.7e-05,-0.00017,-0.000279,-0.000256,1.2e-05,-0.000364
0.000103,-2e-06,-4.4e-05,-0.000165,-0.000117,-5.3e-05,-7.5e-05,6.3e-05,-0.000156,-1.5e-05,-0.000139,-3.2e-05,0.000682,-0.000509,9.1e-05,-0.000503,-0.000442,-7.4e-05,-2.8e-05,-0.000455,-9e-06,-0.000212,-9.6e-05,-5e-05,-0.000161,7e-05,-1.8e-05,3.1e-05,-8e-05,-4e-05,-8.9e-05,-6.6e-05,-6.8e-05,-7.4e-05,-3.8e-05,-0.000124,-6e-06,-0.00025,0.000614,0.002518,-0.000137,-0.000309,-0.000234,-0.000445,-0.00027,0.000355,9.2e-05,-0.000217,0.000182,0.000379,0.000316,-4.7e-05,-0.000114,-9.7e-05,-3e-06,-0.000156,-7e-06,-0.000173,0.000417,-0.001206,-0.00031,0.000212,-0.000125,-0.000288,0.000218,-9.1e-05,6.9e-05,0.000115,-9.6e-05,-0.000186,4.2e-05,-9.1e-05,-1.8e-05,3.2e-05,-0.000147,1.4e-05,-9e-05,-0.000128,-5.9e-05,5e-06,-7.4e-05,-7.5e-05,0.000127,-0.000187,-0.000313,0.000243,-0.000156,-1.8e-05,0.001078,0.000631,-0.000707,-0.000182,-0.000527,-0.00018,-0.000158,-2.7e-05,-0.000229,-2e-04,3.8e-05,-1.9e-05,-6e-05,-1.8e-05,-0.000167,5.6e-05,-0.000174,-0.000143,-0.00016,0.000186,-6.5e-05,-0.000282,-0.000861,0.00041,-0.000392,-0.000128,7.4e-05,-2.2e-05,-3.4e-05,-3e-06,0.000204,-9.2e-05,0.000107
-0.000168,-9.9e-05,-0.000135,-6.3e-05,8.9e-05,2.7e-05,-1.3e-05,-8.6e-05,-5.6e-05,7.6e-05,-4.9e-05,0.000597,-3.7e-05,-0.000153,-0.000344,0.000498,-8.4e-05,-0.000286,-2.3e-05,8.1e-05,-6.8e-05,0.000123,-7.1e-05,-3.4e-05,0.000225,-7.2e-05,-7.7e-05,-4.4e-05,-3.1e-05,1.3e-05,1.7e-05,-8e-06,6.7e-05,-1.2e-05,-6.4e-05,-0.000181,0.000123,-0.000297,0.000144,-0.001331,-0.000118,0.000671,2e-06,0.000439,-7e-06,-0.000592,6.3e-05,0.000287,-0.000188,-0.00023,-6.1e-05,-5.3e-05,4e-05,-6e-06,-7.7e-05,6.4e-05,-1.9e-05,-6.5e-05,-0.000229,-0.000127,0.000621,-0.000254,0.000483,0.000132,-0.000125,0.000356,0.000195,3.4e-05,-9e-06,0.000145,-2.3e-05,3e-05,-4.1e-05,-7e-06,0.000149,-0.000218,-1e-06,-1.9e-05,-3.7e-05,6.1e-05,-5e-06,5e-06,2.4e-05,-1.2e-05,-0.000122,-0.000375,0.000102,-0.000337,-0.001324,-7e-04,0.00109,8.3e-05,0.001051,0.000138,-2e-06,-0.000272,9e-05,8.1e-05,-1.3e-05,-1.3e-05,-6.3e-05,4.3e-05,-4e-05,-1.8e-05,-9.5e-05,1.5e-05,6.5e-05,0.000243,-8.9e-05,-0.000243,0.000476,0.000453,-0.000126,-6.5e-05,-0.000109,-8e-05,-0.000131,-0.000102,-0.000414,-7.6e-05,-9.6e-05
7.5e-05,-2.4e-05,-5e-06,-1e-05,-2.5e-05,-1.8e-05,2.8e-05,0.000102,-3.5e-05,-9.2e-05,-4.8e-05,-0.000268,0.00022,0.000537,0.000214,-0.000424,2.6e-05,4.1e-05,-0.000147,-0.000174,-7e-06,-0.000201,1e-05,1.2e-05,-0.000161,-7e-06,4.3e-05,-9e-06,-3e-05,-3e-05,3.5e-05,-1.4e-05,-5.4e-05,3.8e-05,-7e-06,6.6e-05,-2e-06,0.000261,0.000308,-0.000148,0.000386,-0.000852,-4.5e-05,-0.000783,3e-05,0.000381,8e-05,5.9e-05,3.2e-05,7.6e-05,-0.000143,-6.1e-05,-1.5e-05,5.3e-05,-2.8e-05,-0.000138,-4.6e-05,-8.4e-05,3.5e-05,0.000952,-9.9e-05,0.000934,-0.000319,0.000239,6.9e-05,-4.2e-05,1.2e-05,2.1e-05,3.7e-05,-9e-05,-2.1e-05,4.5e-05,0.000126,-4.8e-05,-6.3e-05,-1e-05,-6.2e-05,-3.7e-05,1.4e-05,-3.4e-05,-2.9e-05,4.4e-05,2.5e-05,-6e-05,-9.7e-05,3.7e-05,-4.9e-05,0.000989,-0.000826,0.000491,-0.000815,9.4e-05,-0.000184,-1.6e-05,0.000151,0.000198,-0.000114,1.5e-05,7e-06,-2.6e-05,3.8e-05,-2.8e-05,-4.9e-05,-5.9e-05,6.8e-05,-3e-05,4.6e-05,0.000152,-0.000303,-0.000142,-0.000124,-0.000178,3.6e-05,7.4e-05,5.1e-05,-0.000203,0.000152,-9.3e-05,0.000116,-9.6e-05,-4.6e-05
-1.4e-05,2.9e-05,-2.2e-05,-6.6e-05,2.3e-05,2.4e-05,1.6e-05,-5.2e-05,6e-05,6.7e-05,3.3e-05,0.000149,-0.000309,-0.000456,0.000128,0.000195,-6.5e-05,-0.000111,9.5e-05,0.000122,3.3e-05,0.000146,2.9e-05,0.000118,5.4e-05,2.4e-05,7e-05,-2e-05,7e-06,5e-06,-5.7e-05,3.3e-05,6e-06,-4.4e-05,4.5e-05,-4.8e-05,3.4e-05,0.000108,-0.000638,-0.000554,0.000128,0.000716,-0.000142,0.000222,8e-06,-0.000167,-6.4e-05,0.000237,0.000195,0.000109,0.000154,9.2e-05,1.4e-05,5e-06,4e-06,6.3e-05,3e-05,0.000157,0.000164,-0.000985,9.6e-05,-0.000798,0.000128,0.000197,-2e-06,-4.8e-05,8.5e-05,1.6e-05,2.7e-05,-5.6e-05,8e-06,4.2e-05,-8.8e-05,2e-05,2.8e-05,-4.1e-05,-5.8e-05,-1e-06,0,1e-06,-3e-06,1e-06,-2.2e-05,-0.000113,-5.8e-05,4.9e-05,0.000268,-0.000188,0.00114,0.000211,0.000618,-0.000102,0.000174,6.5e-05,-3e-05,0.000201,5e-05,3e-06,-1.4e-05,1.3e-05,-3.1e-05,-8.8e-05,-2.2e-05,3.4e-05,0,-1e-05,2.4e-05,0.000122,-1.9e-05,0.000337,0.000292,0.000327,0.000159,2.2e-05,4.9e-05,-0.000182,-5e-06,-0.000116,-1.5e-05,9.8e-05,0.000165
5.6e-05,2e-05,5.3e-05,-3.9e-05,1.1e-05,-2.4e-05,3.1e-05,-2.5e-05,0,-4.4e-05,-2.2e-05,-2.2e-05,0.000436,0.000485,-8.7e-05,-0.00013,-1e-05,6.1e-05,-9.5e-05,2e-05,-1.5e-05,-3.1e-05,-3e-06,-7.3e-05,-4e-06,-9e-06,2.5e-05,-1.9e-05,6e-06,-5e-06,-1.2e-05,8e-06,1e-06,1.4e-05,9e-06,5.2e-05,-8.8e-05,9.3e-05,1e-06,0.001018,-0.000526,-0.000478,9e-06,0.00011,1.6e-05,-7.7e-05,-4.3e-05,4e-06,-6.7e-05,-6.8e-05,-7.4e-05,-0.000108,1e-06,3.3e-05,3.6e-05,3.7e-05,-2.7e-05,-5.4e-05,-0.000122,0.000316,0.000374,0.000348,0.000101,0.000102,-4.6e-05,1e-06,3.9e-05,0,-7.3e-05,5.8e-05,-2.9e-05,1e-05,3.6e-05,3e-06,-7e-06,-1e-05,1.7e-05,-1.9e-05,-3.4e-05,2.9e-05,4.7e-05,2e-06,5.7e-05,5.6e-05,9e-05,0.000176,-5.3e-05,-0.000186,0.000308,-0.000279,-0.000478,0.000155,0.000125,4.5e-05,8e-06,-0.000165,-5.3e-05,6e-06,1.8e-05,4.5e-05,2.5e-05,4.7e-05,1.9e-05,-1.9e-05,-2.3e-05,-1.8e-05,2.2e-05,4.4e-05,-0.000171,0.000127,-0.000349,-0.000347,-5.7e-05,1.4e-05,7.9e-05,-0.000256,3.8e-05,0.000132,-2.3e-05,-8.3e-05,-1.4e-05
-6e-06,-0.000184,-3.7e-05,-3.4e-05,-6e-06,-2.5e-05,1.5e-05,9e-06,1.5e-05,-1.5e-05,1e-06,-0.000138,-0.000281,-0.000191,-7.4e-05,0.000113,2.6e-05,-9e-06,7.5e-05,7e-06,-1.3e-05,-4.1e-05,1.7e-05,5.2e-05,-2.3e-05,-3e-05,-2.1e-05,-1.5e-05,-2e-06,-1e-06,3.7e-05,-5e-06,-1.1e-05,1.3e-05,-1.9e-05,1.1e-05,-7.2e-05,-1.2e-05,0.000396,-0.000171,0.000294,0.000297,-8.3e-05,-0.000136,-7.5e-05,1.1e-05,-2.1e-05,0.000206,-6.3e-05,-2.9e-05,1.7e-05,8.3e-05,0,-4.8e-05,-2.3e-05,-5.3e-05,1.4e-05,-1e-06,0.00025,0.000243,-0.000468,3.3e-05,-0.000161,-0.00012,-4.7e-05,-0.000122,3.4e-05,3.7e-05,-1.5e-05,-5e-06,-2.1e-05,6.1e-05,-3e-06,-1.5e-05,-2e-06,6.1e-05,2.1e-05,3.5e-05,2e-06,0,4e-06,-3.3e-05,1e-05,4e-06,4.8e-05,-0.000187,5.5e-05,-7.5e-05,-0.000238,-5.6e-05,0.000359,4.6e-05,-0.000129,-4.2e-05,-8.3e-05,1e-05,-7.5e-05,-4e-05,-3.9e-05,-1.6e-05,5.9e-05,-2.1e-05,-1.3e-05,-2.8e-05,1e-06,8e-06,4e-06,9.5e-05,-7.8e-05,-0.000231,0.000349,-2.2e-05,-0.000279,-3e-06,-8.2e-05,-4.9e-05,-4.4e-05,1.7e-05,-3.3e-05,-6.1e-05,-4e-06
-8e-06,-1e-06,6e-06,-3.5e-05,-7e-06,-2e-05,4e-06,-1.9e-05,-4.5e-05,2.5e-05,5e-05,0.000165,1e-06,-0.000171,0.000146,-8.5e-05,-4.6e-05,-5.3e-05,-6.2e-05,-7.7e-05,-2e-05,-1e-05,-2.4e-05,-7.6e-05,3e-06,-1.2e-05,-3.9e-05,-5e-06,-2.5e-05,-9e-06,1.1e-05,-2.8e-05,8e-06,-2e-06,1.4e-05,4.7e-05,-2.9e-05,-2.3e-05,-3.6e-05,-0.000136,-0.000127,-6.3e-05,3e-05,-1.6e-05,1.7e-05,-2.9e-05,-8.8e-05,-7e-06,0.000157,0.000109,2e-06,-7e-05,-7e-06,4.2e-05,1.6e-05,-1.3e-05,-1.9e-05,-1.7e-05,-0.000132,-0.000403,0.000222,0.000287,0.000405,-2e-06,8.7e-05,7.6e-05,-1.8e-05,-1e-06,-2.7e-05,2.1e-05,-1.4e-05,-9e-06,-8e-06,1.5e-05,-3.2e-05,-6.5e-05,-1.9e-05,-9e-06,-2e-06,-9e-06,-1.4e-05,1.6e-05,-1e-05,1.1e-05,-9e-06,8.8e-05,-1.4e-05,0.000262,2.5e-05,0.000192,-0.000319,-0.000188,0.000136,-1e-06,0,6.5e-05,4.7e-05,-3.6e-05,-7e-06,1.5e-05,-1.2e-05,-2e-06,7e-06,1e-06,-2.7e-05,-1.2e-05,-1.2e-05,1.7e-05,-5.3e-05,-0.00022,-0.000325,-0.000122,0.00012,-4.6e-05,6.5e-05,-5.6e-05,-5.8e-05,-0.000132,3.4e-05,4e-06,4e-06
-2e-06,7e-06,-1.4e-05,-3.7e-05,-1.1e-05,-2e-06,-7e-06,2e-06,7e-06,-1.3e-05,-1.6e-05,-0.000153,-4.9e-05,0.000212,-0.000297,-3.6e-05,3e-06,-2.4e-05,4.1e-05,-5.3e-05,3e-06,-1.4e-05,-3e-06,5.5e-05,2.6e-05,1.4e-05,2.6e-05,-1.7e-05,-9e-06,-5e-06,-7e-06,-4e-06,-6e-06,-2e-05,-5e-06,-2.3e-05,-3.4e-05,4.8e-05,-5.9e-05,-5.5e-05,-1.3e-05,-0.000118,-7.1e-05,-1e-05,3.5e-05,-4.4e-05,-6.3e-05,6.8e-05,-0.000199,-7e-05,-1.7e-05,-1.3e-05,-1.5e-05,-3.7e-05,1.2e-05,1e-05,4e-06,-3e-05,0.000111,2e-04,-0.000185,-0.000421,-0.000285,4.6e-05,3.4e-05,3e-06,1e-05,-6e-06,1.2e-05,-4.2e-05,-1e-06,-4.1e-05,-1.5e-05,-1.1e-05,1.3e-05,5.4e-05,-1.5e-05,-2.4e-05,-8e-06,-1.4e-05,-1e-05,-1.2e-05,1.5e-05,5.1e-05,-2.5e-05,4.5e-05,-8e-06,-0.000304,-0.000178,-0.00035,0.000135,7.1e-05,-1.4e-05,5.1e-05,-2.4e-05,-5e-05,-0.000118,-5e-06,-9e-06,-1.7e-05,-1e-05,2.2e-05,-9e-06,1e-06,-1e-05,-2e-06,-1.7e-05,5e-05,-3.7e-05,0.000149,0.000144,-1.2e-05,-8.1e-05,-1.2e-05,7e-06,6e-06,-8e-06,4.9e-05,-1.4e-05,1e-06,-6.1e-05
-2e-06,-4.1e-05,-9e-06,-2.6e-05,-1.7e-05,-4e-06,-4e-06,2e-05,-2.9e-05,-8e-06,-6e-06,5e-06,5e-06,-2.3e-05,0.000163,-5.6e-05,-2e-05,-5.2e-05,-3.5e-05,-5.6e-05,-6e-06,2.7e-05,-2.6e-05,-2.5e-05,-5.8e-05,1.5e-05,-2.5e-05,1e-05,-1.7e-05,-6e-06,-1.4e-05,3e-06,-2e-06,-3e-06,-1.7e-05,6e-06,-1.5e-05,-4.5e-05,-0.000254,-0.00016,3.9e-05,4e-06,0.000135,4.3e-05,-2.7e-05,-3.4e-05,-3.7e-05,-1.1e-05,0.00016,5.4e-05,1.1e-05,-3.2e-05,-1e-06,8e-06,-1.8e-05,-3.1e-05,-1.2e-05,-1.8e-05,-2.5e-05,1.8e-05,1.7e-05,0.00012,0.000122,8.7e-05,-5.8e-05,8e-05,-1e-06,9e-06,5e-06,1.3e-05,1e-05,2.9e-05,6e-06,3e-06,-1.9e-05,-2.6e-05,-1.5e-05,-7e-06,-2e-06,3e-06,-1.7e-05,3e-05,-7e-06,3e-06,-3.2e-05,-8e-06,-7e-06,5e-05,-9.2e-05,5.8e-05,-0.00017,6.7e-05,5.3e-05,-3.2e-05,1.7e-05,-2.2e-05,5.5e-05,0,-6e-06,-2e-06,-1.2e-05,-2.1e-05,-3.1e-05,-1.2e-05,-1.7e-05,-6e-06,1.9e-05,-1.9e-05,2.7e-05,4.8e-05,-6.7e-05,9.8e-05,6.1e-05,-2e-06,-2.4e-05,3.2e-05,2.8e-05,-6.5e-05,-4.8e-05,-2.3e-05,3e-06
1e-06,-7e-06,-8e-06,-2.8e-05,1e-05,-1e-06,6e-06,-9e-06,1.4e-05,-9e-06,-4e-06,4.4e-05,5.4e-05,-4.1e-05,-6.8e-05,5.9e-05,-4.1e-05,-4e-05,-7e-06,-1.1e-05,7e-06,-4.3e-05,1.1e-05,3e-06,4.1e-05,-1.3e-05,1e-06,7e-06,-7e-06,3e-06,-1.3e-05,4e-06,5e-06,-1e-06,1.2e-05,-3e-05,2e-06,9.3e-05,0.000364,7.9e-05,8.5e-05,-8.5e-05,-8.8e-05,-2.5e-05,1e-05,3.4e-05,-9e-06,8.2e-05,-3.2e-05,-7.9e-05,-3.6e-05,1.3e-05,2e-06,-6e-06,-5e-06,6e-06,1.2e-05,4e-06,-3.4e-05,-0.000207,-6.9e-05,-9.3e-05,4.4e-05,6.4e-05,-1e-05,-4.2e-05,2e-05,-4e-06,-2.5e-05,1.9e-05,3e-06,-7e-06,3e-06,-9e-06,3e-06,-3e-06,0,-1.5e-05,-1e-05,-1e-06,1e-06,-8e-06,1e-06,2e-06,-1.3e-05,7e-06,3e-06,1.5e-05,7.8e-05,0.000156,0.000163,8e-06,5e-05,2.5e-05,8e-06,1.7e-05,5e-06,-9e-06,6e-06,-3e-06,1.1e-05,5e-06,-3e-06,0,2e-06,-1.2e-05,-7e-06,2.3e-05,-3e-06,7e-05,6.8e-05,7.6e-05,4.2e-05,-5e-06,1.6e-05,6e-05,-4.9e-05,-5e-06,2.7e-05,-3.9e-05,-2e-06
6e-06,-2.7e-05,1.2e-05,-3e-05,-7e-06,9e-06,0,1.5e-05,-4e-06,5e-06,-7e-06,-0.000107,5.5e-05,1.5e-05,0.000144,-5.8e-05,-7e-06,3e-06,-1.2e-05,-3e-06,-1.8e-05,2.2e-05,3e-06,-1.3e-05,-2.1e-05,-5e-06,1e-05,-4e-06,2e-06,-2e-06,0,-6e-06,-4e-06,4e-06,-8e-06,-3e-06,3e-06,-8e-06,-0.000199,0.000251,6.3e-05,1e-04,2.3e-05,-0.000121,-8e-06,-4.3e-05,-1e-06,6e-06,2.6e-05,5.2e-05,3.2e-05,-2.5e-05,-5e-06,6e-06,-8e-06,2e-06,-1.7e-05,2.5e-05,8.3e-05,0.000355,0.000146,3e-06,-2.2e-05,-4.5e-05,6e-06,-5e-06,1.1e-05,3e-06,-3e-06,-2.5e-05,-9e-06,2.3e-05,-9e-06,-4e-06,1.5e-05,-7e-06,-1.6e-05,9e-06,-1.1e-05,-1e-06,1.2e-05,-2e-06,1.5e-05,5e-06,2.7e-05,1.3e-05,-6e-06,0.000204,0.000156,5.4e-05,-0.000118,-7e-06,6.2e-05,-1.8e-05,4e-06,-1.9e-05,-5e-06,-8e-06,7e-06,0,-1.3e-05,2e-06,-5e-06,-1e-06,-8e-06,-2e-06,9e-06,-1.3e-05,4.5e-05,-3.7e-05,-4.4e-05,6.5e-05,3.9e-05,1.3e-05,1.3e-05,8e-05,3.4e-05,-5.8e-05,-8e-06,1.6e-05,1.6e-05
9e-06,-1.3e-05,-1.7e-05,-2.5e-05,3e-06,-1e-06,4e-06,-1.2e-05,8e-06,2e-06,-3e-06,9.5e-05,9.3e-05,-2.3e-05,-0.000106,1.2e-05,0,-4e-05,1e-06,5e-06,1.3e-05,-3e-06,-2e-06,3e-05,8e-06,2e-06,-1e-06,-9e-06,-7e-06,1e-06,1e-05,-8e-06,-4e-06,5e-06,4e-06,-2.2e-05,7e-06,2e-05,0.000142,-0.000314,-0.000123,-6.8e-05,2.2e-05,7.2e-05,-1.1e-05,4.1e-05,-5e-06,4.2e-05,-9.5e-05,-1.6e-05,-2e-06,2.8e-05,0,1e-05,2.5e-05,-1e-05,1.5e-05,-3.5e-05,-9e-05,-0.000246,-2.2e-05,-6.7e-05,-4.1e-05,-4.4e-05,-3.3e-05,-1.6e-05,1e-05,1e-05,-1.3e-05,9e-06,-4e-06,9e-06,1e-05,9e-06,-5e-06,-2.4e-05,-9e-06,0,3e-06,6e-06,2e-06,-7e-06,-1e-06,-2.7e-05,1.4e-05,1.2e-05,-2e-05,-8.4e-05,-4.3e-05,-0.000122,7.5e-05,-2e-06,-1.9e-05,1.7e-05,1.4e-05,3.2e-05,-2.1e-05,-3e-06,-1.1e-05,6e-06,2e-05,-1.2e-05,-4e-06,-1.3e-05,2e-06,1e-06,1.2e-05,3e-05,3.3e-05,-0.000131,-1.4e-05,-1.5e-05,-4.5e-05,-4e-06,5e-06,6.3e-05,1.8e-05,3e-06,3e-06,-1e-05,2.3e-05
-3e-06,-1.7e-05,9e-06,-1.2e-05,5e-06,-6e-06,1e-06,-2e-06,-1.2e-05,-1.2e-05,-1e-06,-5.1e-05,-0.000166,8e-06,1.6e-05,-2.3e-05,5e-06,4e-06,-2e-06,7e-06,1e-06,-2e-06,5e-06,-1e-05,2e-06,-8e-06,0,-8e-06,5e-06,-1e-06,-3e-06,-2e-06,5e-06,-9e-06,-3e-06,6e-06,2.5e-05,1e-06,-0.000141,0.00019,7.3e-05,1.5e-05,-2.6e-05,2.5e-05,2e-06,-1.1e-05,-6e-06,-8e-06,0.000108,3.6e-05,-1.6e-05,-1.9e-05,3e-06,-1.5e-05,-1.8e-05,1e-05,-1.2e-05,2.5e-05,8.6e-05,-1.1e-05,1.6e-05,0.000151,6.2e-05,-1.1e-05,3.6e-05,-2e-06,-9e-06,-3e-06,9e-06,3e-06,-6e-06,2.1e-05,-6e-06,-8e-06,-6e-06,1.7e-05,1.1e-05,8e-06,3e-06,-2e-06,0,2e-06,0,-9e-06,-9e-06,-6e-06,-1.1e-05,-2.3e-05,-3.6e-05,6.2e-05,-4.9e-05,-6e-06,7.1e-05,-1.4e-05,-1.9e-05,-2e-06,-8e-06,-4e-06,-9e-06,-2e-06,3e-06,5e-06,5e-06,5e-06,-2e-06,-5e-06,-1e-06,-1.3e-05,1.9e-05,-2.3e-05,4.6e-05,-9.9e-05,-5.4e-05,3e-06,-1.4e-05,5.3e-05,3e-06,1.3e-05,-1.6e-05,-2.4e-05,-1.2e-05
-5e-06,-7e-06,-5e-06,-2.1e-05,-6e-06,-8e-06,6e-06,-5e-06,-2e-06,1.1e-05,0,-2.3e-05,9.9e-05,7.1e-05,-1.7e-05,1.1e-05,1.1e-05,-1.9e-05,3e-06,-2.5e-05,-1.6e-05,-1e-05,-1.5e-05,-3e-06,-6e-06,2e-06,4e-06,-1e-06,-1.5e-05,1e-06,-7e-06,1e-06,0,3e-06,4e-06,-8e-06,6e-06,-3.4e-05,0.000116,-0.000146,-0.000103,-4e-06,-2e-06,-5.7e-05,5e-06,-5.2e-05,3e-06,2.4e-05,-9.7e-05,-2.6e-05,1.5e-05,0,-9e-06,1.2e-05,8e-06,-1.3e-05,1.1e-05,-1e-05,-4.6e-05,0.00013,3.7e-05,0.000101,5e-06,5.5e-05,-7e-06,1e-05,-9e-06,-3e-06,9e-06,4e-06,-1e-05,-1.8e-05,4e-06,2e-06,4e-06,-1e-05,-5e-06,-5e-06,-7e-06,2e-06,-5e-06,7e-06,4e-06,-1.2e-05,-2.5e-05,-1.5e-05,-1.5e-05,9.8e-05,-7e-06,-6.8e-05,3.7e-05,2.7e-05,-4.1e-05,2.5e-05,-8e-06,-2.8e-05,-4e-06,-8e-06,4e-06,2e-06,-1e-05,-9e-06,-9e-06,-1e-06,0,1e-06,-1e-06,1.6e-05,1.6e-05,0.000154,-5.4e-05,1.8e-05,5.1e-05,-1e-06,1.7e-05,2.3e-05,-4e-06,-6e-05,3.1e-05,-8e-06,6e-06
-8e-06,-3.5e-05,7e-06,-2e-05,5e-06,-6e-06,2e-06,-4e-06,-2e-06,-1.4e-05,2e-06,5.8e-05,-3.8e-05,-0.000115,7e-06,6e-06,-1.9e-05,-1.4e-05,-6e-06,-3e-06,9e-06,5e-06,6e-06,-5e-06,0,-2e-06,-4e-06,1e-06,-4e-06,-3e-06,2e-06,2e-06,-4e-06,1e-06,-3e-06,1.6e-05,6e-06,4.2e-05,-0.000105,7.4e-05,0.00012,6.1e-05,2.4e-05,4e-05,5e-06,1.7e-05,3e-06,-2.3e-05,4.5e-05,-2.2e-05,-2e-05,2e-06,2e-06,-3e-06,-6e-06,-7e-06,-9e-06,-4e-06,1.3e-05,-0.000147,-4.8e-05,-4.9e-05,-1.6e-05,2.7e-05,1.2e-05,-1.6e-05,-4e-06,-2e-06,-1.4e-05,-8e-06,2e-06,1e-05,-2e-06,1e-06,-1.2e-05,0,-1.2e-05,0,-1e-06,0,-5e-06,-4e-06,5e-06,-1.2e-05,-2.9e-05,2.2e-05,3e-06,2.9e-05,-0.00024,4e-06,-1.4e-05,2e-05,2.4e-05,-1.3e-05,1e-06,3.5e-05,-9e-06,-6e-06,-2e-06,1e-06,-2e-06,1.1e-05,2e-06,-7e-06,1e-06,-1e-06,7e-06,-2.2e-05,-6e-06,2.7e-05,6.6e-05,-9.4e-05,-2.2e-05,-1e-06,-2e-06,0,-1.3e-05,3.2e-05,-4.3e-05,-1.1e-05,-6e-06
5e-06,-6e-06,-8e-06,-1.4e-05,-3e-06,-5e-06,2e-06,7e-06,6e-06,1e-06,0,-6e-05,-4.6e-05,7.9e-05,-2.4e-05,-3.4e-05,2e-06,-1e-06,-1e-06,-1.5e-05,-1.2e-05,4e-06,-8e-06,1.9e-05,6e-06,2e-06,0,-2e-06,-1e-05,0,7e-06,-4e-06,3e-06,1e-06,-3e-06,-1e-06,9e-06,-1.8e-05,8.5e-05,-0.000103,-0.000134,-1e-04,-2.6e-05,-4.6e-05,-1.2e-05,-2.5e-05,4e-06,2e-05,-8e-06,1.7e-05,1.4e-05,-8e-06,-1e-06,0,1.2e-05,1.1e-05,4e-06,-3e-06,2.5e-05,7.2e-05,-9e-06,-4.4e-05,7e-05,-1.1e-05,-2.5e-05,3.4e-05,1e-06,4e-06,-5e-06,-2e-06,3e-06,-4e-06,-5e-06,-2e-06,-1e-06,4e-06,-4e-06,-9e-06,-3e-06,-3e-06,2e-06,4e-06,-5e-06,0,-6e-06,-1.1e-05,8e-06,-0.00014,7.8e-05,2.4e-05,-6.8e-05,0,1.3e-05,8e-06,-7e-06,1e-06,-1.5e-05,-9e-06,-4e-06,-4e-06,7e-06,2e-06,2e-06,0,-6e-06,-3e-06,2e-06,8e-06,-7e-06,-7.3e-05,-8.5e-05,4.9e-05,2.7e-05,-3e-06,-2e-06,-2e-05,-2.4e-05,-3.4e-05,2.7e-05,5e-06,-1.3e-05
3e-06,-7e-06,5e-06,-1.7e-05,-3e-06,1e-06,-2e-06,-1e-06,2e-06,4e-06,1e-06,4.1e-05,7e-06,-4e-06,1.2e-05,1.2e-05,5e-06,-1.9e-05,-4e-06,-1.1e-05,4e-06,-1.8e-05,3e-06,-2.2e-05,-1.3e-05,5e-06,0,2e-06,0,0,2e-06,-2e-06,0,-2e-06,6e-06,1.1e-05,1e-06,1.1e-05,-2.6e-05,7.8e-05,0.00013,2.6e-05,5e-06,4.6e-05,-4e-06,1.4e-05,8e-06,-1.6e-05,1.4e-05,2e-05,-5e-06,-7e-06,-3e-06,-8e-06,-1.5e-05,-1e-05,-5e-06,4e-06,-4.5e-05,0.000102,-3.3e-05,-1.8e-05,-7.8e-05,-4.3e-05,-5e-06,-7e-06,-1.2e-05,-7e-06,-6e-06,3e-06,0,0,6e-06,0,8e-06,-8e-06,-1e-06,4e-06,-3e-06,2e-06,2e-06,-8e-06,3e-06,5e-06,1.7e-05,2.1e-05,9e-06,4.6e-05,0.00028,1.1e-05,0.000115,3e-06,2e-06,-1.6e-05,8e-06,-3.8e-05,1.4e-05,-4e-06,3e-06,5e-06,-3e-06,-6e-06,-7e-06,0,-2e-06,0,-8e-06,-1.3e-05,-1.9e-05,-2.9e-05,8.3e-05,5.6e-05,-3.6e-05,-5e-06,-1e-06,-3.6e-05,2.3e-05,-7e-06,-7e-06,-1.6e-05,8e-06
3e-06,-2e-05,-4e-06,-1.8e-05,1e-06,4e-06,2e-06,5e-06,-9e-06,-5e-06,0,-2e-06,3.2e-05,-4.1e-05,1.8e-05,-1e-05,-1.6e-05,-4e-06,-2e-06,-1.3e-05,3e-06,1.7e-05,0,8e-06,1.1e-05,-6e-06,-1e-06,3e-06,-3e-06,-2e-06,-6e-06,-5e-06,-3e-06,-3e-06,-7e-06,-4e-06,1e-06,7e-06,-1.2e-05,5e-06,-5.6e-05,-4e-05,3.1e-05,-1e-05,1.6e-05,7e-06,5e-06,1.1e-05,-1.3e-05,-4.1e-05,-9e-06,-3e-06,0,8e-06,5e-06,-4e-06,6e-06,-4e-06,5.2e-05,-0.000216,6.1e-05,-7.9e-05,8.7e-05,-1.9e-05,6e-06,1.1e-05,0,7e-06,3e-06,5e-06,1e-06,4e-06,0,1e-06,-8e-06,1.8e-05,-3e-06,3e-06,2e-06,-1e-06,1e-06,4e-06,3e-06,2e-06,1.8e-05,-2.1e-05,-6e-06,3e-05,-8e-05,-5.4e-05,-0.000136,-5e-06,1.1e-05,5e-06,-8e-06,2e-05,1e-05,-4e-06,-3e-06,-6e-06,0,4e-06,1e-06,-5e-06,-3e-06,-2e-06,1.1e-05,1.2e-05,-1.7e-05,-4.3e-05,-8.4e-05,2.4e-05,6e-06,2e-06,7e-06,-4.4e-05,-9e-06,-1.2e-05,-1e-06,-5e-06,-8e-06
-3e-06,-8e-06,2e-06,-1.5e-05,-5e-06,2e-06,2e-06,0,2e-06,-3e-06,0,-2.9e-05,1e-05,1.6e-05,2e-05,1.2e-05,2e-06,-1.7e-05,2e-06,2e-06,-7e-06,-1.2e-05,-4e-06,-1e-06,-1e-06,-2e-06,-7e-06,-1e-06,-2e-06,0,-5e-06,1e-06,3e-06,1e-06,4e-06,4e-06,2e-06,-1.3e-05,-3.6e-05,-3.5e-05,2e-05,2e-06,-3.6e-05,-5.9e-05,-7e-06,2.2e-05,6e-06,-2e-05,1.6e-05,3.2e-05,1.6e-05,0,0,-1e-06,-1e-06,9e-06,-5e-06,-1.1e-05,-4.2e-05,0.000178,-6.9e-05,3.4e-05,-5.9e-05,1.8e-05,-2e-06,-1.6e-05,-5e-06,-1e-06,3e-06,-3e-06,-1e-06,6e-06,-5e-06,-2e-06,7e-06,-1.4e-05,-4e-06,0,-2e-06,-2e-06,1e-06,1e-06,-3e-06,1.1e-05,4e-06,7e-06,-5e-06,-1.6e-05,-0.00013,6.8e-05,0.000104,5e-06,1.4e-05,8e-06,1.5e-05,1.6e-05,-1.3e-05,-1e-06,-3e-06,6e-06,6e-06,-3e-06,-4e-06,-2e-06,2e-06,-2e-06,-2e-06,-9e-06,-1.6e-05,2e-06,7.4e-05,3e-05,6e-06,-1e-06,-2e-06,-4.3e-05,-1e-06,-2.1e-05,-7e-06,-3e-06,2e-06
-2e-06,-2e-06,-4e-06,-1.1e-05,2e-06,-1e-06,1e-06,-4e-06,-4e-06,1e-06,0,4.2e-05,-1.8e-05,9e-06,-5.9e-05,-2.6e-05,1e-06,-1e-06,-2e-06,-1.1e-05,4e-06,6e-06,4e-06,4e-06,-5e-06,1e-06,1.1e-05,-3e-06,-3e-06,1e-06,1e-06,-1e-06,-2e-06,2e-06,-2e-06,-8e-06,-4e-06,1.3e-05,3.8e-05,2.4e-05,-9.9e-05,1.7e-05,-1e-06,5.9e-05,-4e-06,-4.3e-05,5e-06,5e-06,-2.2e-05,-5e-06,-9e-06,-3e-06,-2e-06,-3e-06,7e-06,-1e-05,5e-06,1.3e-05,2.4e-05,-6.2e-05,6.9e-05,4e-06,2.7e-05,2e-05,1.2e-05,-1.2e-05,-5e-06,-2e-06,-6e-06,-7e-06,-4e-06,1e-06,4e-06,3e-06,0,3e-06,2e-06,-2e-06,-4e-06,5e-06,-3e-06,3e-06,2e-06,5e-06,-1.4e-05,0,-2e-06,2e-06,4.7e-05,-2.8e-05,-5e-05,2.5e-05,-8e-06,3e-06,-9e-06,-2.7e-05,1.1e-05,-4e-06,3e-06,-6e-06,-1e-06,-5e-06,-1e-06,3e-06,1e-06,0,-1e-06,3e-06,-1.7e-05,0.000116,-5.5e-05,-2.1e-05,-1.4e-05,1e-06,-1e-06,-3.4e-05,1.1e-05,1.2e-05,1.4e-05,-7e-06,9e-06
-2e-06,-1.4e-05,5e-06,-1.3e-05,1e-06,-2e-06,0,-1e-06,4e-06,-1e-06,0,-3.2e-05,6.2e-05,-2e-05,3.9e-05,2e-05,-7e-06,-1.3e-05,2e-06,3e-06,-2e-06,-5e-06,-6e-06,0,6e-06,-1e-06,-4e-06,-3e-06,-7e-06,0,3e-06,0,0,1e-06,2e-06,0,-5e-06,-1.5e-05,2.3e-05,-4.2e-05,0.000122,-3.1e-05,2.6e-05,-1.4e-05,7e-06,1.8e-05,1e-06,-1.7e-05,-3e-06,-2e-06,-2e-06,9e-06,0,2e-06,-8e-06,-1e-06,-4e-06,-7e-06,-2e-06,-6.8e-05,-5e-06,8.1e-05,-3e-06,4e-06,-7e-06,-6e-06,-6e-06,1e-06,-3e-06,9e-06,-2e-06,0,1e-06,-3e-06,-5e-06,-1e-06,-1e-06,-3e-06,0,-3e-06,-2e-06,-3e-06,2e-06,3e-06,-2.1e-05,-2e-06,2e-06,1.9e-05,1.1e-05,-6e-06,2.1e-05,1e-06,8e-06,-8e-06,3e-06,1.4e-05,-2.2e-05,-6e-06,0,5e-06,-6e-06,6e-06,3e-06,-3e-06,-3e-06,-1e-06,7e-06,-9e-06,-1.2e-05,2.7e-05,4.8e-05,-4e-05,2.8e-05,2e-06,3e-06,-1.9e-05,6e-06,-3.7e-05,-2e-06,-7e-06,-5e-06
1e-06,-2e-05,-6e-06,-1.2e-05,-2e-06,-3e-06,2e-06,-3e-06,0,1e-06,0,1.3e-05,-5.8e-05,4.3e-05,1e-06,-2.4e-05,1.2e-05,-1e-06,-4e-06,-2e-06,2e-06,1e-06,3e-06,-5e-06,-1e-06,1e-06,-1e-06,0,0,-1e-06,0,-3e-06,1e-06,-3e-06,-2e-06,-7e-06,-1e-06,1e-05,-3.1e-05,-5.6e-05,-9.1e-05,4.4e-05,-1.9e-05,6e-06,3e-06,-1.5e-05,-2e-06,-1e-06,3e-05,-4e-06,3e-06,-9e-06,-1e-06,0,1e-06,5e-06,2e-06,3e-06,-1.5e-05,0.000134,-2.1e-05,-4e-06,1.1e-05,-2.3e-05,-2e-06,9e-06,-2e-06,0,-5e-06,-1e-06,0,4e-06,-2e-06,1e-06,1e-06,-3e-06,-6e-06,0,-1e-06,1e-06,0,0,-1e-06,1e-06,-6e-06,2e-06,6e-06,2.3e-05,-1.7e-05,2.6e-05,-1.8e-05,-6e-06,-6e-06,-2e-06,-4e-06,6e-06,8e-06,-5e-06,-5e-06,-2e-06,3e-06,-3e-06,-3e-06,-2e-06,2e-06,-1e-06,-3e-06,2e-06,-1e-05,-0.00012,-3.8e-05,-2.4e-05,-1e-05,-1e-06,-1e-06,-3e-06,-6e-06,5e-06,-1.5e-05,-6e-06,6e-06
0,-1e-06,5e-06,-1.2e-05,2e-06,-3e-06,0,0,2e-06,-5e-06,0,1.2e-05,4e-06,-4.4e-05,-1.3e-05,1.8e-05,0,-8e-06,0,-4e-06,1e-06,2e-06,-4e-06,3e-06,-2e-06,-2e-06,1e-06,2e-06,-7e-06,1e-06,-2e-06,-2e-06,-3e-06,0,0,2e-06,-5e-06,2e-06,-2.5e-05,9.2e-05,-2e-06,-5.8e-05,-6e-06,-2e-06,-6e-06,-2.1e-05,-2e-06,-8e-06,-2.4e-05,5e-06,-1e-06,5e-06,0,6e-06,2e-06,-7e-06,-1e-06,1e-06,2.5e-05,-7.9e-05,2e-05,9e-06,-1.5e-05,-2.6e-05,0,2e-05,-8e-06,-3e-06,2e-06,-3e-06,0,-5e-06,1e-06,1e-06,0,5e-06,-3e-06,0,-1e-06,1e-06,2e-06,0,0,-1e-06,9e-06,-4e-06,4e-06,-1.2e-05,1.4e-05,-6e-06,1.4e-05,1.1e-05,-2e-06,4e-06,-1e-06,-1.2e-05,-1e-05,-3e-06,1e-06,0,3e-06,1e-06,1e-06,1e-06,-1e-06,0,1e-06,-1e-06,-4e-06,-3.8e-05,2e-05,-3.2e-05,-1e-06,0,-1e-06,1.2e-05,4e-06,-7e-06,1.2e-05,-5e-06,1e-06
3e-06,-1e-05,-3e-06,-1.3e-05,-1e-06,-1e-06,1e-06,3e-06,-5e-06,4e-06,0,-2.8e-05,-1e-06,2e-06,-4e-06,-1.8e-05,-9e-06,-4e-06,-2e-06,-7e-06,-3e-06,-6e-06,0,-5e-06,1e-06,2e-06,1e-06,0,3e-06,0,-1e-06,-2e-06,2e-06,1e-06,3e-06,-3e-06,-3e-06,-7e-06,5e-06,-3.6e-05,5.2e-05,4.6e-05,2.5e-05,-2.7e-05,-1e-06,3.4e-05,-2e-06,-2e-06,7e-06,7e-06,4e-06,-3e-06,-1e-06,-1.1e-05,1e-06,2e-06,-1e-06,0,-2.6e-05,-3.8e-05,-6e-06,-6.5e-05,3e-05,9e-06,-1e-05,-2e-06,-3e-06,3e-06,1e-06,-1e-06,1e-06,3e-06,0,-3e-06,-4e-06,-8e-06,2e-06,3e-06,1e-06,-1e-06,2e-06,-1e-06,1e-06,-6e-06,1.4e-05,1.1e-05,-1e-06,-3.5e-05,3.3e-05,-5.3e-05,-2e-05,-1e-06,0,0,2e-06,9e-06,4e-06,-3e-06,2e-06,2e-06,-3e-06,3e-06,1e-06,-2e-06,0,0,2e-06,2e-06,0,5.3e-05,-1.3e-05,5.5e-05,-1.9e-05,-2e-06,4e-06,2.5e-05,-1.6e-05,-1.8e-05,-3e-06,0,-7e-06
-1e-06,-1.1e-05,3e-06,-1.1e-05,0,2e-06,0,0,3e-06,-4e-06,0,2.9e-05,-3e-06,2.9e-05,-2e-06,1.4e-05,5e-06,-5e-06,0,-5e-06,1e-06,6e-06,2e-06,7e-06,2e-06,-1e-06,-4e-06,1e-06,-6e-06,-1e-06,2e-06,0,0,0,-4e-06,4e-06,0,8e-06,6e-05,3e-05,5e-06,-4e-05,-2.1e-05,4.2e-05,3e-06,-1.8e-05,-1e-06,-6e-06,3e-06,-1e-05,-8e-06,-2e-06,-1e-06,8e-06,-2e-06,1e-06,-1e-06,-6e-06,2e-05,0.000137,-2.3e-05,1.1e-05,-3.9e-05,1.8e-05,6e-06,-5e-06,-1e-06,-1e-06,-3e-06,2e-06,1e-06,0,-1e-06,2e-06,4e-06,4e-06,-3e-06,1e-06,-2e-06,1e-06,-1e-06,4e-06,0,-2e-06,4e-06,-1e-05,-4e-06,1e-05,1e-06,5e-05,3.2e-05,3e-06,-1e-06,3e-06,-4e-06,-5e-06,4e-06,-3e-06,-5e-06,-3e-06,2e-06,-3e-06,-3e-06,-1e-06,-1e-06,-1e-06,0,-2e-06,5e-06,2.5e-05,3e-06,0,1.7e-05,-1e-06,-7e-06,3.2e-05,4e-06,3e-06,-5e-06,-8e-06,1e-06
0,-6e-06,-4e-06,-1.2e-05,1e-06,2e-06,1e-06,2e-06,-4e-06,0,0,-1.5e-05,-7e-06,-1.7e-05,2.2e-05,-2.2e-05,-3e-06,-4e-06,1e-06,-4e-06,3e-06,-6e-06,-3e-06,-3e-06,-5e-06,-1e-06,2e-06,1e-06,0,1e-06,3e-06,0,-2e-06,-1e-06,4e-06,-1e-06,-1e-06,-8e-06,-3.9e-05,-4.5e-05,-2.6e-05,-1e-06,3e-06,-1.3e-05,-2e-06,1.5e-05,0,-6e-06,7e-06,-1.1e-05,9e-06,-3e-06,0,-2e-06,-2e-06,-6e-06,2e-06,1e-06,-9e-06,-0.000165,1.1e-05,-4e-06,3.4e-05,1.2e-05,1e-06,-1.5e-05,-1e-06,0,-2e-06,2e-06,-1e-06,1e-06,2e-06,0,-1e-06,1e-06,-2e-06,-1e-06,-2e-06,-1e-06,-1e-06,-2e-06,-1e-06,-4e-06,-1.2e-05,2e-06,0,1.5e-05,-2.5e-05,-3e-06,-4.4e-05,1e-05,-1e-06,-7e-06,5e-06,-7e-06,1e-06,-4e-06,1e-06,4e-06,0,1e-06,1e-06,0,0,0,-2e-06,-2e-06,6e-06,2.2e-05,8e-06,4.2e-05,4e-06,0,7e-06,3.3e-05,4e-06,-2.1e-05,4e-06,-2e-06,-4e-06
-3e-06,-1e-05,5e-06,-1e-05,-2e-06,1e-06,0,-1e-06,2e-06,3e-06,0,-5e-06,1.3e-05,4e-06,-1.1e-05,2.1e-05,-2e-06,-7e-06,-1e-06,-3e-06,-1e-06,5e-06,3e-06,3e-06,6e-06,-1e-06,0,0,-4e-06,0,-1e-06,-2e-06,2e-06,-2e-06,-2e-06,4e-06,0,4e-06,8e-06,1.4e-05,-6e-06,-1.5e-05,1.7e-05,-3.7e-05,-1e-06,-2e-06,-2e-06,-1e-06,-1.8e-05,1.5e-05,-1e-06,2e-06,-1e-06,0,6e-06,4e-06,0,4e-06,-1e-06,9.1e-05,9e-06,1e-05,-2.4e-05,-1.9e-05,7e-06,-1e-06,-2e-06,0,-3e-06,-3e-06,-1e-06,0,-2e-06,0,-1e-06,-1e-06,0,-3e-06,1e-06,-1e-06,-1e-06,0,2e-06,-2e-06,-1.7e-05,-4e-06,2e-06,-4.1e-05,-5.9e-05,-1.6e-05,3.3e-05,4e-06,-2e-06,7e-06,-4e-06,1.6e-05,3e-06,-3e-06,2e-06,-4e-06,-1e-06,0,-1e-06,-1e-06,1e-06,0,4e-06,1e-06,5e-06,2e-06,-1.5e-05,8e-06,-6e-06,0,-2e-06,2.8e-05,-3e-06,5e-06,7e-06,-4e-06,0
1e-06,-7e-06,-4e-06,-1.1e-05,1e-06,-1e-06,0,0,3e-06,-6e-06,0,2e-05,1e-05,3e-06,-1.3e-05,-1.7e-05,3e-06,-1e-06,0,0,-1e-06,-4e-06,-4e-06,-6e-06,-3e-06,0,-1e-06,-1e-06,-3e-06,-1e-06,-3e-06,-1e-06,-1e-06,1e-06,0,-1e-06,2e-06,0,-3.8e-05,-4.3e-05,6.3e-05,5e-06,-1.3e-05,3e-05,1e-06,0,-1e-06,-4e-06,8e-06,1e-06,-7e-06,-3e-06,0,-2e-06,-3e-06,-1e-06,-1e-06,-4e-06,8e-06,3.2e-05,-2.2e-05,-1.5e-05,3.1e-05,-2.1e-05,-1.1e-05,4e-06,1e-06,1e-06,2e-06,0,-1e-06,1e-06,1e-06,0,1e-06,3e-06,-1e-06,0,0,2e-06,0,-2e-06,-1e-06,0,-7e-06,7e-06,2e-06,1e-05,-1.6e-05,1.4e-05,-1.3e-05,-2e-06,-1e-06,-4e-06,2e-06,-7e-06,-5e-06,-2e-06,-1e-06,2e-06,-1e-06,-3e-06,-1e-06,0,0,0,0,-1e-06,3e-06,-7e-05,2.3e-05,-2.7e-05,2e-06,0,0,1.8e-05,0,-1.8e-05,-9e-06,-5e-06,5e-06
0,-8e-06,3e-06,-1e-05,-1e-06,-3e-06,0,-2e-06,-3e-06,2e-06,0,-2.4e-05,-1.4e-05,-1.4e-05,2.2e-05,9e-06,-4e-06,-9e-06,-1e-06,-3e-06,0,3e-06,1e-06,8e-06,-2e-06,0,1e-06,-2e-06,-1e-06,0,-1e-06,-2e-06,-1e-06,1e-06,-1e-06,3e-06,1e-06,-2e-06,5.8e-05,1.4e-05,-8.7e-05,1e-05,-1.5e-05,-5e-06,-1e-06,-1.7e-05,-1e-06,0,0,-3e-06,7e-06,0,0,0,1e-06,-5e-06,1e-06,2e-06,-1e-05,-0.000106,3.1e-05,3.3e-05,-3.2e-05,-1e-06,5e-06,7e-06,0,-3e-06,0,1e-06,-1e-06,2e-06,1e-06,-1e-06,-1e-06,-4e-06,-2e-06,1e-06,-1e-06,-3e-06,1e-06,1e-06,0,1e-06,7e-06,-6e-06,1e-06,2.7e-05,8.1e-05,1.8e-05,-5e-06,4e-06,-7e-06,0,-1e-06,-9e-06,-4e-06,-4e-06,-1e-06,-2e-06,3e-06,5e-06,2e-06,-1e-06,0,0,-2e-06,3e-06,-1e-06,-2.1e-05,-3e-05,-2.9e-05,-6e-06,0,-2e-06,5e-06,1.1e-05,-5e-06,-1e-06,-3e-06,-1e-06
2e-06,-8e-06,-3e-06,-1e-05,0,-2e-06,1e-06,-1e-06,1e-06,0,0,1.5e-05,1.5e-05,2e-05,-5e-06,-9e-06,2e-06,0,0,-1e-06,0,0,-1e-06,-5e-06,2e-06,0,0,0,-4e-06,1e-06,2e-06,1e-06,1e-06,0,0,-2e-06,0,2e-06,-4e-05,2.7e-05,4.9e-05,-2.7e-05,2.9e-05,1.5e-05,-3e-06,2e-06,-1e-06,-3e-06,1e-06,-1.5e-05,0,4e-06,0,5e-06,-4e-06,5e-06,-2e-06,1e-06,8e-06,9.3e-05,-1.1e-05,1.8e-05,2.3e-05,2.2e-05,-2e-06,6e-06,1e-06,3e-06,-2e-06,0,0,-3e-06,-2e-06,2e-06,-1e-06,3e-06,-4e-06,3e-06,0,2e-06,1e-06,1e-06,1e-06,0,1.4e-05,4e-06,-1e-06,-3e-06,3.6e-05,-4.8e-05,1.7e-05,2e-06,1e-06,-1e-06,-3e-06,1.5e-05,-4e-06,-2e-06,2e-06,1e-06,-1e-06,-3e-06,-1e-06,-1e-06,0,0,5e-06,-3e-06,-4e-06,6.8e-05,3.1e-05,-1.7e-05,6e-06,0,5e-06,-8e-06,-7e-06,-3e-06,7e-06,-4e-06,4e-06
-1e-06,-1e-05,3e-06,-1.1e-05,1e-06,-1e-06,0,0,-3e-06,-2e-06,0,1e-06,-8e-06,-8e-06,-1.9e-05,6e-06,3e-06,-8e-06,-1e-06,-5e-06,0,-3e-06,-2e-06,3e-06,1e-06,0,0,1e-06,1e-06,0,2e-06,-1e-06,0,-1e-06,1e-06,1e-06,2e-06,-2e-06,3.8e-05,1.1e-05,-3.4e-05,2.3e-05,-1.9e-05,-1.7e-05,6e-06,7e-06,0,2e-06,-3e-06,1.5e-05,-5e-06,-5e-06,-1e-06,-7e-06,7e-06,-3e-06,2e-06,-2e-06,-4e-06,-5e-06,2e-06,-2.7e-05,-2.8e-05,1.7e-05,-7e-06,-4e-06,3e-06,-1e-06,-1e-06,-1e-06,0,4e-06,1e-06,-1e-06,0,0,1e-06,0,-2e-06,0,0,1e-06,-1e-06,2e-06,6e-06,-2e-06,-2e-06,-2e-05,-7.9e-05,2.2e-05,-3.2e-05,8e-06,-6e-06,8e-06,4e-06,-5e-06,3e-06,-4e-06,-4e-06,0,2e-06,0,0,0,1e-06,0,-1e-06,2e-06,-6e-06,2.9e-05,-3.4e-05,-1.7e-05,-6e-06,0,-4e-06,-2e-05,4e-06,-1.6e-05,-9e-06,-2e-06,0
0,-7e-06,-3e-06,-1e-05,-1e-06,1e-06,0,1e-06,1e-06,2e-06,0,-1.7e-05,1e-06,-1.4e-05,6e-06,-7e-06,-2e-06,-1e-06,0,-1e-06,0,4e-06,2e-06,-1.1e-05,-5e-06,0,0,0,-6e-06,-1e-06,-1e-06,0,0,0,-3e-06,-3e-06,1e-06,1e-06,-4.6e-05,-3.1e-05,5.9e-05,-3.4e-05,-3e-06,-2.7e-05,1e-06,-2.2e-05,1e-06,-2e-06,-1e-06,7e-06,3e-06,0,0,4e-06,-5e-06,-4e-06,-1e-06,-3e-06,0,-0.000107,-1e-06,-1.5e-05,4e-05,-8e-06,6e-06,0,2e-06,0,-2e-06,-1e-06,0,-4e-06,1e-06,-2e-06,0,-2e-06,-1e-06,-1e-06,-1e-06,-1e-06,0,1e-06,0,0,-9e-06,3e-06,0,7e-06,-9e-06,9e-06,4e-05,3e-06,-1e-06,-6e-06,-6e-06,-9e-06,-4e-06,-3e-06,0,0,-1e-06,3e-06,1e-06,0,0,0,-1e-06,-3e-06,-7e-06,-2.7e-05,3.6e-05,4e-05,2e-06,0,0,-2.7e-05,-2e-06,-1e-06,-1e-06,-4e-06,-4e-06
