-0.000175,-0.000962,-0.00041,0.00022,-0.001085,-0.048422,-0.144915,-0.173386,-0.155052,-0.137711,-0.145797,-0.147596,-0.139488,-0.114871,-0.057363,-0.018875,-0.006166,-0.003052,-0.001307,-0.000514,-0.000714,-0.000941,-0.000369,-0.000284,-0.000591,-0.000682,-0.000154,-0.000983
8.8e-05,4e-06,-0.000509,-0.000472,0.000995,0.05361,0.15094,0.162335,0.168869,0.17394,0.167434,0.163803,0.132385,0.104358,0.067603,0.023296,0.0074,0.002975,0.001228,0.000598,5.7e-05,1.6e-05,0.000371,0.000171,0.000439,0.000646,0.00011,-0.000666
-1e-05,-4.3e-05,0.000239,0.000253,-0.00033,-0.006429,-0.004322,0.01107,-0.016256,-0.035636,-0.019378,-0.014141,-0.014021,-0.014813,-0.011347,-0.003537,-0.001054,-0.000441,-0.000296,-0.000226,5.2e-05,0.000175,-4.1e-05,-1.2e-05,6.3e-05,0.000102,-1.2e-05,-0.000445
-9.9e-05,0.000242,0.000362,0.000176,-0.001659,-0.056931,-0.148899,-0.165001,-0.150348,-0.14208,-0.147964,-0.143422,-0.124376,-0.1003,-0.060196,-0.021452,-0.007056,-0.003075,-0.001249,-0.000552,-6.4e-05,-2.2e-05,-0.000335,-0.000181,-0.000324,-0.000427,-8.3e-05,0.000151
8e-05,0.000448,0.000582,0.000554,0.000582,0.03977,0.114141,0.120072,0.139619,0.146244,0.138122,0.134147,0.124723,0.111825,0.06269,0.020407,0.006246,0.002988,0.001402,0.000642,0.000319,0.000357,0.000335,0.000229,0.00029,0.000285,0.000104,0.000366
5.9e-05,-0.000364,-0.000654,-0.00061,0.000684,0.023501,0.062336,0.083926,0.042355,0.012866,0.03579,0.039333,0.051577,0.038599,0.01364,0.005185,0.00206,0.001115,0.000337,4.2e-05,-8.9e-05,-0.000109,8.1e-05,8e-06,-0.000126,-0.000128,-4.2e-05,-0.000508
-4.1e-05,-0.000231,-0.000677,-0.00071,-0.001015,-0.049729,-0.145227,-0.163757,-0.155042,-0.139686,-0.14613,-0.147816,-0.141379,-0.125448,-0.066216,-0.022735,-0.006978,-0.003398,-0.001445,-0.000548,-0.000294,-0.000413,-0.000355,-0.000338,-0.000532,-0.000443,-0.000135,-0.00026
-2.3e-05,5.1e-05,0.000882,0.001096,-0.000121,0.011633,0.037693,0.023624,0.065855,0.09769,0.078308,0.066038,0.030222,0.030406,0.033219,0.011609,0.003147,0.001225,6e-04,0.000342,0.00021,0.00026,0.000159,8.8e-05,0.000239,0.000359,8.8e-05,0.000454
4e-06,-4.9e-05,-0.000619,-0.000829,0.000766,0.033139,0.102251,0.124581,0.07936,0.04345,0.065562,0.075063,0.080123,0.06097,0.027012,0.010887,0.003766,0.001847,0.000636,8.8e-05,6.8e-05,0.00016,0.000153,0.00019,0.000193,6e-05,4e-05,-6.9e-05
2.2e-05,0.000385,0.000938,0.000982,-0.000192,-0.03109,-0.095485,-0.092316,-0.097998,-0.1091,-0.114371,-0.10487,-0.077867,-0.067754,-0.048874,-0.017706,-0.005329,-0.002188,-0.00081,-0.000377,-0.00022,-0.000343,-0.000232,-0.000135,-0.000332,-0.000481,-8e-05,-0.000346
-2.8e-05,3.9e-05,-0.000536,-0.000703,-0.000565,-0.005221,-0.018534,-0.040189,0.01169,0.050542,0.031749,0.019,0.001912,0.021187,0.019539,0.004759,0.000585,0.000335,0.000307,0.000268,2.9e-05,4.8e-05,4.6e-05,-1e-06,5.2e-05,0.000122,4.2e-05,-8.7e-05
-2.9e-05,-0.000378,-0.00017,-6.8e-05,0.000497,0.030705,0.098272,0.103932,0.059682,0.037509,0.071478,0.076618,0.084166,0.064249,0.033021,0.013095,0.004385,0.001795,0.000511,0.000195,0.00021,0.000365,0.000163,0.000117,0.000242,0.000324,3.9e-05,0.000245
6.1e-05,-3.5e-05,-0.000193,-0.000243,6.3e-05,-0.020555,-0.060517,-0.045326,-0.064761,-0.08406,-0.083315,-0.07631,-0.059418,-0.064996,-0.042089,-0.014154,-0.003424,-0.001769,-0.000757,-0.000303,-1.7e-05,-0.000107,-0.000124,-0.000126,-0.000223,-0.000215,-6.4e-05,0.000652
1.7e-05,0.000166,0.000581,0.000698,-0.000846,-0.022567,-0.062768,-0.071352,-0.006264,0.032965,0.002643,-0.015636,-0.054375,-0.029249,-0.001652,-0.002013,-0.001693,-0.000716,-6.2e-05,6.1e-05,-0.000196,-0.000311,-6.8e-05,-4e-05,-9.2e-05,-0.000168,1.2e-05,0.000359
-6.2e-05,-2e-05,-0.000358,-0.000437,-0.000164,0.020068,0.084043,0.094125,0.059852,0.041365,0.072523,0.080617,0.079228,0.059252,0.033189,0.013748,0.004125,0.001792,0.000591,0.000156,2.6e-05,0.000117,0.000119,0.000152,0.000291,0.000242,5.4e-05,-0.000327
3.8e-05,0.000146,0.000259,0.000243,0.000505,-0.00254,-0.006629,0.014069,-0.02411,-0.057883,-0.051586,-0.035383,0.005002,-0.012769,-0.022479,-0.007584,-0.001145,-0.000457,-0.000245,-0.000183,0.000158,0.000196,1.4e-05,-3.7e-05,-3.1e-05,2.5e-05,-2e-05,-0.000365
2.8e-05,-4.2e-05,-0.000179,-0.000332,-0.000206,-0.013956,-0.066184,-0.08938,-0.027545,0.018469,-0.02355,-0.04683,-0.065948,-0.024449,-0.008094,-0.006574,-0.002853,-0.000789,-0.000151,9e-06,-4.7e-05,-6.5e-05,-8.2e-05,-0.000105,-0.000135,-7.6e-05,-1.8e-05,-0.000131
-8.1e-05,-0.000229,-0.000215,-0.000117,1e-06,0.019438,0.061154,0.040776,0.017505,0.027272,0.059958,0.057492,0.041441,0.036789,0.02695,0.010863,0.003036,0.001146,0.000256,0.000157,-4.8e-05,-5.2e-05,1e-05,7.7e-05,0.000112,4.1e-05,-2e-06,0.000142
7e-06,6.4e-05,0.000214,0.000313,0.000665,0.008059,0.027044,0.047493,0.000599,-0.046025,-0.026013,-0.002192,0.024428,-0.012661,-0.01422,-0.002846,0.000436,-0.000181,-0.000125,-9.8e-05,6.3e-05,-2e-06,4.9e-05,1.7e-05,-2.2e-05,-2.5e-05,-1.5e-05,0.00017
