-9e-06,0.000105,-6.8e-05,-1e-06,1.6e-05,-9.5e-05,0.000132,0.00026,0.000219,0.00019,2.2e-05,0.000145,8.6e-05,8.2e-05,3.4e-05,0.000207,-0.000128,-0.000184,-8.2e-05,-0.000162,-0.000165,-6.5e-05,-6.3e-05,-0.000172,-0.000163,-0.000201,-0.000159,-4.5e-05,-5.8e-05,1e-05,-0.000112,-1.5e-05,6.3e-05,0.00025,4e-06,-0.000105,-4.3e-05,-6.3e-05,8.7e-05,1.7e-05,0.000148,-5.1e-05,-1.3e-05,-0.000118,-0.000106,0.000172,-2.6e-05,3.9e-05,0.000115,-3e-06,-0.000119,-7.7e-05,-1.6e-05,-9.9e-05,-3.8e-05,-1.7e-05,-1e-06,5.8e-05,-0.000209,9.4e-05,-1.3e-05,-6.5e-05,7.1e-05,-3.9e-05,-8.1e-05,-4.8e-05,-0.000213,-0.000163,-0.000158,0.00027,0.000154,-0.000106,4.6e-05,-0.00019,-0.000174,5.4e-05,-0.000194,-0.000103,-0.000182,8.1e-05,3e-05,1.8e-05,-5.4e-05,-7.5e-05,-0.000306,-0.000259,8.3e-05,-2.9e-05,2.3e-05,2.4e-05,5.4e-05,3.1e-05,3.8e-05,1.5e-05,-6.6e-05,-2e-05,5e-06,3e-06,5.5e-05,0.000175,-5.3e-05,0.000123,-0.000176,-0.000229,-6.5e-05,-4e-06,5.1e-05,-2e-06,-1.6e-05,-5e-05,-0.000215,-0.000135,7e-06,-9e-06,-6.5e-05,-4.1e-05,0.000148,2.1e-05,-8e-05,4.3e-05,-0.000154
-0.000314,-0.000165,-0.000385,-0.000196,-3.6e-05,-0.000199,-0.000122,-8.9e-05,-0.000108,-0.000107,-5.9e-05,-0.000133,-0.000226,2.4e-05,4.9e-05,-8.8e-05,-1.5e-05,-5e-05,-1.6e-05,0.000222,-9.5e-05,-0.000106,2.2e-05,0.000106,-7.1e-05,-9.1e-05,-9.7e-05,-2.6e-05,4.1e-05,-6.9e-05,5e-06,-0.000123,-0.000157,-0.000319,-0.000226,-5.9e-05,-0.00019,-5e-05,-3.7e-05,-0.000108,-0.000336,-0.000252,-6.8e-05,1.7e-05,6e-06,-0.00027,-0.000307,-6.7e-05,-0.000241,6e-06,-7.8e-05,6.9e-05,-7.6e-05,-8.9e-05,-1.6e-05,0.000196,-4e-06,4.5e-05,0.000136,-0.000433,-8.7e-05,6e-06,-5e-06,-5.5e-05,0.000161,-0.000125,-4.5e-05,0.000117,3.8e-05,2.9e-05,-0.000372,-2e-04,-0.000145,-3.5e-05,7.1e-05,-0.000168,5e-06,6.6e-05,-5.7e-05,-9.7e-05,-0.000141,-9.4e-05,-3.7e-05,-2.2e-05,1.7e-05,3.1e-05,-0.000197,-0.000172,-6.7e-05,-0.000339,-6.2e-05,-1.4e-05,-0.000208,-0.000199,-0.000106,-4e-05,-9.4e-05,-0.000213,-0.000105,-0.000556,-0.000253,-0.000146,3e-05,-1.9e-05,-0.000174,-0.000212,-0.000142,-9.6e-05,-2.5e-05,-0.000183,-8.9e-05,-7.4e-05,-6.2e-05,5.6e-05,-0.000219,-9.7e-05,-0.000308,-0.000293,-0.00013,-0.000144,3.3e-05
6.5e-05,0.000105,0.000208,-8.3e-05,-0.000116,0.000101,-3.1e-05,-0.000179,-8.5e-05,-3.5e-05,5.2e-05,8e-06,3.6e-05,4.2e-05,-1.3e-05,-0.000149,-8.3e-05,-0.000308,-0.000416,-0.000183,-4.3e-05,-9.3e-05,2.2e-05,-3.6e-05,-4.4e-05,-3e-05,8e-06,-9e-06,-9.9e-05,3.6e-05,-0.000102,-1e-06,-4.3e-05,-4.8e-05,5.2e-05,3.3e-05,9e-06,1.7e-05,-9.7e-05,0.000113,-0.000212,-5.4e-05,6.7e-05,0.000115,7.9e-05,2.7e-05,-3.9e-05,-0.000172,-0.00013,-0.000189,8.3e-05,5e-05,-7.2e-05,4e-06,-0.000107,-0.000271,-9e-05,-0.000304,-0.000277,-0.000117,-0.000126,-0.000125,-0.000166,5.4e-05,-8.7e-05,-4e-06,4e-06,-0.00011,-0.000204,-0.000203,-0.000231,-8.2e-05,-0.000196,-4.6e-05,-8.5e-05,-4.2e-05,-0.000149,-0.000103,-6e-05,-0.000128,-0.000138,1e-06,-4.6e-05,-7.4e-05,-4.3e-05,-1.8e-05,-0.000242,-0.00015,-0.000171,-0.000107,-8.2e-05,-4.4e-05,-0.000165,-8.2e-05,-3.8e-05,-0.00016,-6.5e-05,-1.4e-05,-8e-05,-4.2e-05,-3e-06,-7.8e-05,-0.000286,-5.6e-05,-4e-06,-2.3e-05,0.000182,-0.000235,-9.7e-05,-8.6e-05,5.7e-05,-9e-06,2.3e-05,-0.000168,6.3e-05,2.8e-05,-0.000245,-2.7e-05,4.7e-05,0.000162,-9.3e-05
6e-06,-6e-05,2.2e-05,-8.9e-05,-0.000179,-9e-05,-2.5e-05,-0.00018,-0.000157,-5.1e-05,5.5e-05,0.00011,9.9e-05,5.2e-05,-9.7e-05,1.4e-05,7e-05,0.000258,0.000189,-9e-06,0.000104,8.1e-05,-6.3e-05,-2.7e-05,-4.9e-05,-0.000107,3.6e-05,-0.000104,-0.000101,2e-06,-3.6e-05,-2.9e-05,-8.2e-05,0.00019,5.4e-05,4.4e-05,-3e-06,-8.7e-05,-7.8e-05,-0.000103,0.00013,6.8e-05,-3.1e-05,-9.1e-05,-9.2e-05,-6.1e-05,6.3e-05,-8.7e-05,2.9e-05,0.000184,1.2e-05,1.2e-05,2.6e-05,3.3e-05,4.9e-05,7.9e-05,3.7e-05,-4.2e-05,0.000169,0.000119,0.000236,0.000141,6.3e-05,-9.4e-05,-3.7e-05,5.3e-05,-4.9e-05,0.000141,7.9e-05,-3.6e-05,0.00029,-4.5e-05,-5e-05,-4.8e-05,-3.2e-05,-8.2e-05,2.8e-05,-4.9e-05,-0.000105,8.9e-05,2.4e-05,-1.3e-05,0.000121,6.8e-05,0.000128,6.4e-05,0.000172,6.5e-05,-5e-05,9.5e-05,6.2e-05,2e-06,-0.000146,-2.5e-05,1.7e-05,5.4e-05,-1.6e-05,2.1e-05,2.2e-05,3.4e-05,3.5e-05,6.4e-05,6.1e-05,8.2e-05,8.3e-05,5.3e-05,4e-06,0.000182,-2.6e-05,0.000164,3.7e-05,2.3e-05,-5.7e-05,0.000108,8.5e-05,-7e-06,0.000151,0.000231,-6.7e-05,-0.000108,-1e-04
3.5e-05,-0.000118,-0.000116,5.2e-05,-7e-05,-2.6e-05,-5.6e-05,-7.7e-05,-6.2e-05,5e-06,-2e-05,0.000133,-2.1e-05,5e-06,0.000137,-5.8e-05,9.5e-05,-0.000131,0.000111,4e-05,-6.2e-05,1.1e-05,6.7e-05,5.4e-05,-3e-05,6e-06,2.1e-05,9e-06,-3.9e-05,-9e-06,5.8e-05,0.000158,4.1e-05,1.9e-05,-0.000127,-0.00011,-3.7e-05,3.7e-05,6.6e-05,5.6e-05,9.9e-05,-3e-06,-2.9e-05,3.8e-05,1e-06,-5.6e-05,0.000124,7e-05,0.000116,4.1e-05,6.3e-05,-0.000105,-4.7e-05,-8.1e-05,1.6e-05,3.1e-05,2.5e-05,0.000147,-3.2e-05,-2.5e-05,-9.8e-05,-0.000113,-4e-05,-4.8e-05,-0.000104,-7.7e-05,-5.4e-05,1.4e-05,2.7e-05,-5.7e-05,-2.7e-05,0.000124,6.2e-05,3.9e-05,-1.6e-05,4.7e-05,0.000154,0.000229,-5.3e-05,3.7e-05,0.000136,-8e-05,-0.000122,-1.1e-05,-5.7e-05,-8.5e-05,6.5e-05,0.000107,0,6e-05,0.000101,1e-05,0.000116,0.000175,-3.4e-05,7.1e-05,0.000123,-3.9e-05,0.000181,9.2e-05,-1.9e-05,6.9e-05,8e-05,-2.1e-05,-5.7e-05,5.5e-05,-3.7e-05,1.1e-05,-1.9e-05,-3.7e-05,4.3e-05,-7.2e-05,-8.5e-05,2.4e-05,5.6e-05,0.00015,-4.8e-05,6e-06,-6e-06,2.4e-05,-3.8e-05
-0.000105,-9e-06,-4e-06,3.7e-05,1.4e-05,-0.000139,-1.5e-05,9.8e-05,8.6e-05,1.1e-05,-5.5e-05,1.2e-05,-8.9e-05,8.2e-05,6e-06,-0.000106,-0.00017,3.4e-05,4.4e-05,-6.4e-05,-5.8e-05,-8.8e-05,-3.5e-05,-0.000125,1.7e-05,-1.8e-05,-2.7e-05,-2.1e-05,0.000143,7.3e-05,4e-05,1.3e-05,9.6e-05,-8e-06,0.000117,4.9e-05,-4.8e-05,-0.000145,1e-06,0.000103,-5.4e-05,2e-06,1.9e-05,-3e-05,-8e-06,-1.7e-05,-6.7e-05,1.4e-05,2.1e-05,-7e-05,-6.2e-05,9.2e-05,2.1e-05,-2.8e-05,-7e-05,-3.1e-05,4.7e-05,-3.7e-05,-9.3e-05,-9.5e-05,0.000128,2.5e-05,0.000181,4e-06,-3e-05,5.9e-05,-8.6e-05,-9.4e-05,9e-06,8.4e-05,-0.000103,-3.6e-05,0.000164,0.000104,4.7e-05,2.2e-05,1.2e-05,1.8e-05,5.7e-05,-6.4e-05,0.000117,7.1e-05,1e-05,1.6e-05,3.2e-05,0.000131,7.1e-05,-5.4e-05,3.7e-05,2e-06,-0.000143,2.9e-05,4e-05,4e-06,-2.5e-05,0.000145,8.2e-05,-1.3e-05,-6.3e-05,-9.5e-05,9e-06,-2.5e-05,3.6e-05,5.4e-05,-1.2e-05,-7.6e-05,7.7e-05,-2.6e-05,3.3e-05,-4.1e-05,-7.2e-05,5e-05,6e-06,6e-06,-0.000145,-0.000243,-3.4e-05,-5.5e-05,-3.6e-05,4.9e-05,7.7e-05
6.7e-05,0.000121,4.9e-05,-0.000109,6e-05,0.000164,9.5e-05,0.000108,7.7e-05,-0.000108,8e-06,3.8e-05,-1.9e-05,-6.8e-05,-8.8e-05,-3e-05,-4e-05,1.8e-05,-0.000106,6.5e-05,-3e-06,2.6e-05,8.2e-05,-1e-06,1.9e-05,0.000206,9e-06,-2.3e-05,1.5e-05,-2.5e-05,-8.1e-05,8e-06,-5.7e-05,-9e-06,2.8e-05,0.000117,4e-05,1.4e-05,-3.9e-05,1e-05,2.9e-05,1.5e-05,-8.5e-05,-1e-06,-2.5e-05,1.6e-05,-0.000207,-0.000116,-4e-05,-0.000121,2.3e-05,-4.6e-05,-1.8e-05,7.4e-05,-2e-05,-0.000129,-3.1e-05,-7e-06,-5.6e-05,4.5e-05,-0.000112,-0.000156,-4.5e-05,1.6e-05,-6e-05,-5e-05,0.000156,5.1e-05,-0.000116,-2.6e-05,-0.000136,7.8e-05,-7e-06,-2.6e-05,-6.9e-05,-3e-05,-0.000123,-0.000105,1.2e-05,-3.6e-05,-0.000134,-6e-06,1.4e-05,8.1e-05,-2.6e-05,-0.000124,1.4e-05,3e-06,-2.4e-05,-3.4e-05,-2.4e-05,0.000123,-4.3e-05,-9.6e-05,-7.9e-05,-0.000162,-0.000107,7.1e-05,3e-06,-9e-06,0.000177,2.9e-05,-4.9e-05,-0.000147,-1.8e-05,-3.2e-05,2.4e-05,-6.9e-05,2.5e-05,-2.1e-05,3.7e-05,-3e-05,-2.9e-05,-3.1e-05,-8.5e-05,-8.4e-05,1.7e-05,3e-05,-9e-06,-2.1e-05,9.3e-05
8e-05,-1.3e-05,-2.3e-05,9.9e-05,1.6e-05,7.1e-05,1.2e-05,-3.4e-05,-2.7e-05,-7.2e-05,-1.2e-05,-8e-05,-4.6e-05,3.1e-05,-2.4e-05,-4e-06,5.6e-05,6.7e-05,5.2e-05,3.4e-05,1.4e-05,8.4e-05,2.5e-05,-1.5e-05,-0.000112,-0.000161,-6.1e-05,3.1e-05,-6.5e-05,-7.2e-05,-1.8e-05,-4.7e-05,-6.2e-05,-2.9e-05,-0.000168,-0.000134,-3e-05,7.1e-05,5.4e-05,-8e-06,-1.2e-05,6e-06,7.5e-05,-4.3e-05,-1.6e-05,-3.6e-05,7.2e-05,-1.5e-05,-6e-05,1.5e-05,-4.1e-05,-2.2e-05,-1e-05,-1.1e-05,5e-05,-9e-06,-6.3e-05,-3.9e-05,1.8e-05,-2.3e-05,-8.6e-05,5.1e-05,-2.5e-05,-3.5e-05,-2.9e-05,6.7e-05,-9.3e-05,-5.2e-05,0.000136,5e-05,-4.9e-05,-9.3e-05,5.6e-05,-1.1e-05,4e-06,0,-1.8e-05,-2.5e-05,-7e-05,-3.9e-05,-1.7e-05,-1.6e-05,-0.000107,-8e-06,4.6e-05,8.1e-05,2e-06,-5.5e-05,-6e-06,-1e-06,1.7e-05,-3.1e-05,-3.7e-05,-5.1e-05,-9.9e-05,5.6e-05,-6.9e-05,3.3e-05,-6e-06,8e-05,-0.000141,-4.3e-05,-1.8e-05,0.000157,2.4e-05,5.9e-05,-8.1e-05,3.2e-05,-5.7e-05,-4.4e-05,-2.9e-05,-1.9e-05,3e-06,-5.8e-05,-5.3e-05,3.1e-05,3.3e-05,7.3e-05,-1.1e-05,4.4e-05,-0.000107
-9.3e-05,-3.1e-05,1.3e-05,-1.5e-05,-6e-05,-2.3e-05,1.3e-05,-5e-05,2.7e-05,5.2e-05,1e-06,-2.3e-05,-3.2e-05,-5.7e-05,-8.2e-05,1.9e-05,1e-04,-0.00013,-6.4e-05,8.6e-05,0,-9.7e-05,-7e-05,1.2e-05,0.000104,1.7e-05,5.3e-05,-5.6e-05,-1.7e-05,2.6e-05,5.8e-05,-5e-06,-9e-06,-3.7e-05,-6.8e-05,-3.2e-05,-2.1e-05,-1.7e-05,-4.2e-05,-6.4e-05,-1.6e-05,-3.6e-05,1.9e-05,-2.5e-05,-6e-06,1.3e-05,-3.1e-05,3e-05,-0.000103,9e-06,3.4e-05,2.4e-05,3.4e-05,-4.1e-05,-3.7e-05,2e-06,-0.000105,7.4e-05,7.9e-05,1.5e-05,3.2e-05,4.7e-05,2e-05,2.6e-05,5.9e-05,-4.1e-05,-4.9e-05,-2.5e-05,-6.7e-05,-0.000187,-7e-06,1e-05,-6.8e-05,-1.2e-05,-1.8e-05,-5.6e-05,-1.5e-05,5.3e-05,-7e-06,-4.7e-05,2.7e-05,-6.7e-05,-3.9e-05,-6.4e-05,-2.7e-05,-3.4e-05,4e-06,-2e-05,-0.000154,-4e-06,7.7e-05,2.8e-05,1e-05,-1.6e-05,0.000132,-1.4e-05,2.2e-05,-2.4e-05,-1.7e-05,1.5e-05,-7.2e-05,-4e-05,4e-05,-8e-06,-2.1e-05,-3.1e-05,-4.5e-05,-7.4e-05,-0.000137,3.4e-05,6.3e-05,6.4e-05,2.6e-05,1.7e-05,5.3e-05,-7e-06,-6.1e-05,-5.6e-05,8.8e-05,2.9e-05,4.5e-05
-2e-05,-2.3e-05,4.7e-05,-8.7e-05,-4.5e-05,6.5e-05,-2.3e-05,0,-1e-05,3.9e-05,2e-05,2e-06,-1.5e-05,-2.4e-05,-4.3e-05,-6.3e-05,-1.8e-05,-2e-05,-3e-06,-0.000168,-1.1e-05,7.1e-05,-6.1e-05,-1.9e-05,-3e-05,-1e-06,2.8e-05,7.7e-05,-1.8e-05,1.6e-05,3e-05,8e-06,3.6e-05,5.9e-05,3.4e-05,2.5e-05,5.2e-05,-1e-05,-1e-06,-1.3e-05,3.9e-05,8e-06,-5e-06,3.2e-05,-9e-06,1.6e-05,3.4e-05,1.6e-05,5.1e-05,-1.2e-05,-1.8e-05,-5.1e-05,-3e-05,-4.9e-05,-3.4e-05,2.6e-05,1.9e-05,5e-06,1e-06,-8e-05,-4.6e-05,-3.8e-05,4.1e-05,-3.8e-05,-1.5e-05,6e-06,-2.2e-05,6e-06,4.3e-05,2.2e-05,3e-05,4.1e-05,-4.4e-05,-1.8e-05,5.6e-05,4e-05,1.6e-05,-3.4e-05,-2.4e-05,5.6e-05,1e-05,-3.7e-05,4.3e-05,2.1e-05,1e-05,4.1e-05,-4.3e-05,2e-05,2.9e-05,-7e-06,-1e-06,-5e-05,-3.3e-05,-2.8e-05,5e-06,-1.7e-05,-2.5e-05,-7.1e-05,1e-05,-3.6e-05,4.8e-05,4.6e-05,6e-06,-1.7e-05,-3.1e-05,-3.6e-05,2.8e-05,6e-06,7e-06,5e-06,-2.3e-05,-3.3e-05,-8e-06,-1e-05,-1.3e-05,-1.2e-05,-4.9e-05,1.2e-05,-3.8e-05,-3.9e-05,3.7e-05
5.5e-05,4.3e-05,-7.8e-05,0,1e-04,-6.7e-05,-9e-06,-7e-06,-1.4e-05,4.6e-05,-2.5e-05,-2.9e-05,-1.2e-05,3e-06,1.1e-05,-2.9e-05,6.4e-05,3e-05,-2e-06,2.7e-05,3.1e-05,-6.3e-05,3.1e-05,-5e-06,1e-05,-2.1e-05,2e-05,-7.6e-05,-2e-05,-1.7e-05,-5.9e-05,2e-05,2.2e-05,-4e-05,4.1e-05,-3.1e-05,-1e-06,2.5e-05,-6.8e-05,2.2e-05,-1.7e-05,1.2e-05,-2.6e-05,-1.7e-05,-4e-06,-1.2e-05,1.7e-05,4.6e-05,5.5e-05,2.7e-05,2.4e-05,1e-05,-1.3e-05,0,2.3e-05,-3e-06,9e-06,3.6e-05,-1e-05,4.9e-05,4.7e-05,-9.6e-05,-8.9e-05,-2.5e-05,1e-06,-3e-05,3.5e-05,4.1e-05,-4.5e-05,2.8e-05,3.5e-05,-1.2e-05,6.6e-05,3.8e-05,8e-06,-3.7e-05,-8e-06,1.4e-05,9.3e-05,-5e-06,-5.8e-05,7e-06,-2e-06,-9e-06,1.6e-05,-2.2e-05,2.8e-05,-3.8e-05,6.9e-05,3.4e-05,3e-06,5.8e-05,-6e-06,-1.2e-05,-6.2e-05,-3.7e-05,2.9e-05,-3.5e-05,-1.8e-05,-3.2e-05,-2.7e-05,5.6e-05,-1.9e-05,-5e-05,2.1e-05,3.6e-05,3.7e-05,3.6e-05,5.3e-05,4.4e-05,1.7e-05,-2.1e-05,-2.3e-05,-4.5e-05,1e-06,0,4e-05,-7e-06,-3.1e-05,3.4e-05,-1.8e-05
-2.6e-05,-1.7e-05,-8e-06,3.2e-05,-4.7e-05,-2.4e-05,-2.8e-05,1.9e-05,2e-06,1.3e-05,1.6e-05,-4.6e-05,-1.5e-05,-5e-06,-7e-06,-9e-06,3.4e-05,1.1e-05,2.4e-05,1.6e-05,-1.5e-05,7e-06,2.3e-05,-1.6e-05,-7e-06,1e-05,-1.7e-05,1.5e-05,-7e-06,-2e-06,4.4e-05,-2.5e-05,-1.2e-05,-1e-05,-2.2e-05,4.2e-05,-5.5e-05,-1e-05,1.8e-05,-2.7e-05,-2.5e-05,-2.2e-05,1.2e-05,2.9e-05,4e-06,1.9e-05,4.6e-05,-2.6e-05,-4.3e-05,-3.8e-05,-4e-05,-2.4e-05,2.5e-05,-1.4e-05,-6e-06,1.1e-05,5e-06,-4e-06,-3e-05,5.4e-05,-1.9e-05,4.9e-05,-5e-06,-1e-06,-1.9e-05,1e-06,-1e-05,-4e-06,1.8e-05,-1.4e-05,-7e-06,-6.8e-05,1.9e-05,3.4e-05,-3.8e-05,6e-06,2.8e-05,-6.1e-05,-4e-06,8e-06,2.7e-05,4.5e-05,1.4e-05,-1.9e-05,-1.8e-05,7e-06,-1.9e-05,1.5e-05,1.4e-05,3.5e-05,-4.1e-05,-4e-06,5.5e-05,2.8e-05,-2.8e-05,-1.5e-05,-2.3e-05,2.5e-05,3.7e-05,1.2e-05,1.6e-05,-1.7e-05,2.3e-05,-1.9e-05,1.9e-05,-2.6e-05,-2.3e-05,-2.8e-05,-1.3e-05,-4.7e-05,-2.2e-05,3e-06,2.3e-05,3.7e-05,-3.6e-05,-3e-06,7.6e-05,3e-06,-2.2e-05,-3e-06,6e-06
-3.2e-05,-7e-06,4e-06,-2.3e-05,-1.9e-05,1e-05,1.7e-05,-2.4e-05,2.2e-05,-3.7e-05,5e-06,-2.6e-05,3e-06,-8e-06,-1.5e-05,1e-06,-3.4e-05,-1.2e-05,-2e-06,2.1e-05,-3.6e-05,-7e-06,-2.5e-05,-2.8e-05,-1e-06,-2.4e-05,-1.8e-05,-1.1e-05,-2.1e-05,5e-06,-6.8e-05,-1e-05,1.9e-05,-1e-06,-2.6e-05,1e-06,3.2e-05,-1e-06,1.6e-05,2e-06,-2.6e-05,7e-06,-2e-06,-2e-06,1.9e-05,-1e-06,-3e-05,1e-05,4e-06,-1.8e-05,0,2.1e-05,-1.8e-05,4e-05,6e-06,7e-06,-1.1e-05,-1.3e-05,7e-06,3e-06,1.3e-05,5.1e-05,-2e-05,-6e-06,-7e-06,7e-06,3.4e-05,-8e-06,-2.1e-05,-1.1e-05,-4.6e-05,-1.3e-05,-1.4e-05,-2.3e-05,-2.8e-05,4e-06,-1.6e-05,-6e-06,-3.4e-05,-1.5e-05,5e-06,-2.1e-05,-2.2e-05,-2.1e-05,-1.4e-05,-1.4e-05,-1.9e-05,-6e-06,-6.9e-05,-2.7e-05,-2.4e-05,-7e-05,-2.1e-05,-3e-06,0,-9e-06,-4e-06,6e-06,-1e-05,1e-06,-1.9e-05,-6e-05,-1.3e-05,2.2e-05,-1.6e-05,5e-06,-2.5e-05,-1.2e-05,-1.5e-05,-1.4e-05,4e-06,3e-05,-1e-05,1.5e-05,-4e-06,-1.1e-05,-2.7e-05,-9e-06,6.4e-05,-5.2e-05,7e-06
1.9e-05,4e-06,2.4e-05,9e-06,1.9e-05,2e-06,1.6e-05,9e-06,-1.6e-05,-3.5e-05,-1.4e-05,2.7e-05,2e-06,-1.5e-05,-1.3e-05,1.8e-05,2.7e-05,-1e-06,7e-06,1.2e-05,-5e-06,3e-06,-2e-05,2e-06,1e-06,1e-06,0,7e-06,8e-06,-1.6e-05,1.5e-05,4e-06,-1.9e-05,-1.8e-05,1.4e-05,7e-06,-7e-06,1.3e-05,-1.2e-05,2e-06,-2.7e-05,0,5e-06,-2.1e-05,4e-06,6e-06,-2e-06,-1.5e-05,1.9e-05,1.2e-05,-4e-06,-2.1e-05,3e-06,-3.1e-05,0,-1.8e-05,2.1e-05,-5.3e-05,-6e-06,-2e-06,7e-06,-2.1e-05,1.5e-05,7e-06,1e-06,-2.6e-05,-2.4e-05,-3e-06,1.5e-05,7e-06,1e-06,-2.6e-05,-6.7e-05,2e-05,2e-05,-2.4e-05,7e-06,1.1e-05,8e-06,6e-06,-3.2e-05,-4e-06,-2.3e-05,-1.4e-05,4e-06,6e-06,-5e-06,1e-06,4e-06,2e-06,6e-06,0,-3e-06,2e-06,3.6e-05,0,1.6e-05,6e-06,-3.1e-05,-7e-06,1.8e-05,9e-06,-1.5e-05,5e-06,-1.9e-05,-5e-06,1.6e-05,1e-05,2.3e-05,2.4e-05,8e-06,-1.9e-05,-1e-06,-1.6e-05,1e-05,2e-05,1.9e-05,-9e-06,-2e-06,0,1.9e-05
-4.3e-05,8e-06,0,1.3e-05,1.9e-05,9e-06,5e-06,2.4e-05,-2e-06,-9e-06,4e-06,5e-06,2e-06,1.3e-05,-2.3e-05,-1e-06,-2e-06,7e-06,1e-06,-5.2e-05,9e-06,-2e-06,3.6e-05,1.6e-05,0,4e-06,5e-06,5e-06,-4e-06,-3e-06,8e-06,0,-2e-06,1.1e-05,5e-06,-2.3e-05,5e-06,-3e-06,0,1.6e-05,1.9e-05,0,6e-06,2.2e-05,-1e-06,2e-06,-1e-06,4e-06,7e-06,5e-06,1.5e-05,-7e-06,5e-06,2.1e-05,1e-06,-1e-06,1.5e-05,1.7e-05,3e-06,-2.6e-05,-1.8e-05,1.2e-05,1e-06,-4e-06,8e-06,1.4e-05,3.3e-05,6e-06,1e-06,2.6e-05,7e-06,5e-06,4.7e-05,-1e-06,2e-06,2.4e-05,-6e-06,1e-06,1.9e-05,6e-06,1.7e-05,-4e-06,1e-05,-8e-06,-7e-06,4e-06,1.8e-05,-2e-06,1.7e-05,1.2e-05,4e-06,2.3e-05,-1e-06,-6e-06,3e-06,4.4e-05,-4e-06,-2e-05,-2e-06,5e-06,3.2e-05,4e-06,1e-05,-3e-06,-1.1e-05,0,1.5e-05,-9e-06,5e-06,9e-06,-4e-06,-7e-06,-4e-06,1e-05,1e-06,-1.3e-05,1.7e-05,-2e-06,1e-06,1.5e-05,2e-06
-1.7e-05,3e-06,-9e-06,-2.9e-05,-7e-06,-1.7e-05,1e-05,-6e-06,9e-06,1.2e-05,-4e-06,1.8e-05,-6e-06,-2e-06,1.9e-05,-4e-06,5e-06,-1.1e-05,-1e-06,-1e-06,1.7e-05,7e-06,-1.7e-05,4e-06,-1e-06,1.4e-05,1.2e-05,2e-06,1e-05,6e-06,3e-06,-2e-05,3e-06,-8e-06,-6e-06,-7e-06,1.3e-05,-1.3e-05,1.7e-05,-3e-06,-3e-06,7e-06,-2e-06,-1e-05,-6e-06,3e-06,-1.5e-05,-7e-06,-3e-06,1.6e-05,-2e-06,9e-06,-2e-06,0,-3e-06,2e-06,6e-06,-2e-05,2e-06,1.1e-05,8e-06,-8e-06,-2.5e-05,-1e-06,6e-06,2e-06,-4e-06,0,2e-06,2e-06,7e-06,-5e-06,2e-06,-5e-06,3e-06,4e-06,-9e-06,2.1e-05,4e-06,1e-05,1.2e-05,1.5e-05,-2e-06,6e-06,3e-06,-1e-06,-1.5e-05,1e-06,-3e-06,-2e-06,1.1e-05,8e-06,9e-06,1e-06,8e-06,-2.2e-05,-5e-06,-2e-06,-1.8e-05,-8e-06,-1.4e-05,-4e-06,6e-06,-8e-06,6e-06,-8e-06,-1.5e-05,9e-06,2e-06,1.2e-05,1e-06,7e-06,-2e-06,-1e-06,6e-06,3e-06,9e-06,-2e-06,-4e-06,6e-06,-1.4e-05
1.3e-05,0,-4e-06,-5e-06,-7e-06,-2.1e-05,-3e-06,-9e-06,0,9e-06,1e-06,7e-06,-3e-06,2e-06,-3e-06,2e-06,1.2e-05,1.2e-05,2e-06,0,-1e-06,-5e-06,9e-06,-4e-06,8e-06,-1.1e-05,7e-06,0,-9e-06,0,-5e-06,6e-06,2e-06,4e-06,-2.2e-05,1.3e-05,-1.3e-05,9e-06,-3e-06,-1.1e-05,-2e-06,0,-4e-06,-2e-05,-1e-06,0,1.2e-05,6e-06,-8e-06,-4e-06,4e-06,2e-06,-2e-06,3e-06,7e-06,2e-06,-1.2e-05,4e-06,-9e-06,-5e-06,-1e-06,-6e-06,1.1e-05,4e-06,-3e-06,4e-06,-4e-06,5e-06,0,-1.1e-05,1e-05,7e-06,-2.8e-05,-4e-06,6e-06,-1.6e-05,-2e-06,3e-06,-6e-06,-1.2e-05,-4e-06,-3e-06,1e-06,1e-06,1e-06,2e-06,1.3e-05,-6e-06,3e-06,-3e-06,-5e-06,-2e-06,-7e-06,-1e-05,6e-06,6e-06,6e-06,1.6e-05,8e-06,-4e-06,-1.5e-05,6e-06,-6e-06,-2e-06,6e-06,9e-06,-8e-06,-2e-06,-1.2e-05,4e-06,-6e-06,0,3e-06,-3e-06,8e-06,-3e-06,1.4e-05,-4e-06,4e-06,-1e-05,1.2e-05
-1e-06,-2e-06,2e-06,1.2e-05,1e-06,6e-06,4e-06,2e-06,-3e-06,8e-06,7e-06,2e-06,-1e-06,-2e-06,-1.1e-05,-4e-06,-6e-06,-1.4e-05,-1e-06,1.2e-05,-6e-06,-1e-06,-7e-06,-9e-06,-3e-06,4e-06,2e-06,-7e-06,0,1e-06,1e-06,-6e-06,-1e-06,0,5e-06,-9e-06,4e-06,-2e-06,-9e-06,2e-06,1.1e-05,2e-06,-5e-06,7e-06,0,-1e-06,5e-06,3e-06,-5e-06,1e-06,-7e-06,5e-06,-1e-06,2e-06,-4e-06,1e-06,-6e-06,-7e-06,-6e-06,1.5e-05,7e-06,-4e-06,1.3e-05,2e-06,-6e-06,-3e-06,-1.1e-05,1e-06,-3e-06,-5e-06,5e-06,6e-06,1e-06,2e-06,0,1.1e-05,6e-06,5e-06,-1e-05,7e-06,-5e-06,-9e-06,7e-06,4e-06,-1e-06,-5e-06,-1.1e-05,0,-1.1e-05,0,-7e-06,-1.1e-05,-4e-06,-2e-06,-1.9e-05,3e-06,7e-06,1.1e-05,1e-05,1e-06,1e-06,2e-06,0,1e-06,2e-06,-7e-06,3e-06,-9e-06,-8e-06,-2e-06,-4e-06,-1e-06,0,0,-7e-06,3e-06,-6e-06,2e-06,-6e-06,-3e-06,5e-06
-6e-06,3e-06,1e-06,-8e-06,5e-06,1.7e-05,1e-06,2e-06,-1e-06,0,-4e-06,0,-4e-06,2e-06,-2e-06,0,-1.1e-05,0,-3e-06,-5e-06,-8e-06,1e-06,-1.2e-05,-8e-06,-1e-06,-1e-06,-3e-06,7e-06,1e-06,-1e-06,0,4e-06,3e-06,2e-06,1.1e-05,-1e-05,-5e-06,-3e-06,1.4e-05,3e-06,-2e-06,2e-06,7e-06,8e-06,3e-06,0,6e-06,-5e-06,5e-06,-1.1e-05,0,-1e-05,3e-06,-7e-06,-2e-06,3e-06,3e-06,8e-06,0,-1.1e-05,2e-06,1.4e-05,-3e-06,-7e-06,1e-06,3e-06,1e-06,1e-06,2e-06,6e-06,-5e-06,5e-06,-2e-06,-4e-06,2e-06,-8e-06,0,-1.1e-05,9e-06,0,9e-06,-2e-06,-1e-06,1.1e-05,5e-06,3e-06,8e-06,-2e-06,6e-06,1e-06,-9e-06,1.1e-05,5e-06,-3e-06,-3e-06,-6e-06,-1.3e-05,-4e-06,2e-06,-1e-06,-8e-06,2e-06,5e-06,9e-06,-2e-06,-1e-06,1.1e-05,8e-06,7e-06,-2e-06,-1e-06,0,-3e-06,-5e-06,-5e-06,-7e-06,-2e-06,1e-06,1.3e-05,3e-06,-8e-06
9e-06,7e-06,3e-06,-6e-06,9e-06,-2e-06,0,4e-06,0,-7e-06,1e-06,-8e-06,-1e-06,-1e-06,7e-06,2e-06,-1.2e-05,2e-06,0,-9e-06,-3e-06,2e-06,4e-06,1e-06,0,4e-06,-6e-06,-1e-05,-1e-06,1e-06,-3e-06,-2e-06,2e-06,-3e-06,-3e-06,5e-06,2e-06,6e-06,-8e-06,-2e-06,1e-06,0,1e-06,7e-06,-1e-06,1e-06,-5e-06,3e-06,-3e-06,-1e-06,-4e-06,5e-06,-2e-06,-1e-06,3e-06,0,-3e-06,-7e-06,2e-06,8e-06,-2e-06,9e-06,0,7e-06,1e-06,-2e-06,3e-06,3e-06,-3e-06,3e-06,-2e-06,-4e-06,3e-06,-1e-06,-5e-06,5e-06,2e-06,2e-06,7e-06,-3e-06,-5e-06,2e-06,1e-06,-2e-06,-1e-06,-8e-06,-3e-06,-2e-06,1.1e-05,-2e-06,3e-06,7e-06,-2e-06,5e-06,9e-06,-4e-06,9e-06,-5e-06,4e-06,0,5e-06,5e-06,-5e-06,5e-06,-3e-06,-1e-06,-3e-06,0,2e-06,-6e-06,1e-06,3e-06,-1e-06,7e-06,-2e-06,8e-06,5e-06,0,5e-06,0,-3e-06
-1e-06,-3e-06,1e-06,6e-06,-9e-06,3e-06,-1e-06,-8e-06,3e-06,-8e-06,1e-06,-9e-06,0,-2e-06,-1.2e-05,-2e-06,-3e-06,-1e-06,3e-06,-9e-06,2e-06,-6e-06,1.1e-05,5e-06,3e-06,-3e-06,-2e-06,1.1e-05,-4e-06,0,-2e-06,5e-06,-3e-06,3e-06,-9e-06,7e-06,0,-5e-06,-4e-06,-7e-06,2e-06,0,0,-3e-06,1e-06,0,2e-06,-4e-06,-3e-06,0,3e-06,0,0,-2e-06,-2e-06,-5e-06,2e-06,-1e-06,3e-06,-4e-06,1e-06,-1.6e-05,5e-06,-7e-06,1e-06,1e-06,5e-06,-4e-06,5e-06,-9e-06,-6e-06,4e-06,-7e-06,1e-06,-2e-06,-5e-06,4e-06,-3e-06,-1e-05,3e-06,-7e-06,4e-06,-6e-06,2e-06,1e-06,7e-06,2e-06,-1e-06,-6e-06,0,4e-06,1e-06,-3e-06,-2e-06,7e-06,-6e-06,0,-7e-06,4e-06,-1e-06,-1.1e-05,-1e-05,0,-3e-06,0,-1e-06,-7e-06,-6e-06,-4e-06,3e-06,3e-06,-3e-06,-1e-06,-1e-06,2e-06,-3e-06,1e-06,4e-06,0,3e-06,0
-5e-06,-2e-06,-5e-06,-2e-06,-4e-06,-1e-05,-2e-06,0,-4e-06,-1e-06,-4e-06,-1e-06,-2e-06,-1e-06,-2e-06,2e-06,-5e-06,1e-06,-2e-06,1.4e-05,3e-06,5e-06,-9e-06,0,-2e-06,-5e-06,3e-06,-8e-06,-2e-06,-2e-06,6e-06,-1e-06,0,-2e-06,1e-06,5e-06,3e-06,-4e-06,1e-06,1e-06,-3e-06,1e-06,0,-4e-06,0,0,-1e-05,2e-06,7e-06,3e-06,-1e-06,-2e-06,0,3e-06,-1e-06,1e-06,-1e-06,3e-06,2e-06,4e-06,-2e-06,1e-06,1e-06,3e-06,1e-06,0,-6e-06,-1e-06,-3e-06,4e-06,2e-06,-4e-06,1.2e-05,-3e-06,8e-06,4e-06,-2e-06,-6e-06,-1e-06,-1e-06,3e-06,0,-4e-06,-1e-06,1e-06,-5e-06,-1e-06,-1e-06,-1.1e-05,-1e-06,7e-06,-1e-05,3e-06,3e-06,3e-06,8e-06,-1e-06,3e-06,-5e-06,1e-06,3e-06,-1e-06,3e-06,-8e-06,-1e-06,-3e-06,2e-06,2e-06,0,7e-06,2e-06,-3e-06,-1e-06,-2e-06,2e-06,-1e-06,2e-06,-1e-06,-1.2e-05,1e-06,4e-06
6e-06,-1e-06,-1e-06,-5e-06,9e-06,4e-06,-1e-06,3e-06,1e-06,3e-06,4e-06,-3e-06,0,-1e-06,2e-06,-3e-06,2e-06,-3e-06,1e-06,0,1e-06,-5e-06,-4e-06,-2e-06,1e-06,2e-06,3e-06,3e-06,2e-06,1e-06,0,3e-06,0,-1e-06,6e-06,-4e-06,-5e-06,6e-06,4e-06,5e-06,4e-06,-1e-06,-2e-06,1e-06,1e-06,0,1e-06,-2e-06,2e-06,6e-06,4e-06,2e-06,0,-1e-06,2e-06,1e-06,9e-06,2e-06,-2e-06,-2e-06,-2e-06,6e-06,-4e-06,-3e-06,-1e-06,-1e-06,2e-06,3e-06,2e-06,1e-06,4e-06,-3e-06,-1e-05,-1e-06,3e-06,-4e-06,-5e-06,2e-06,3e-06,0,4e-06,-4e-06,1e-06,-3e-06,-1e-06,5e-06,-4e-06,1e-06,6e-06,-1e-06,0,0,0,-1e-06,-4e-06,-1e-05,-1e-06,3e-06,-1e-06,-1e-06,9e-06,5e-06,-1e-06,-1e-06,-2e-06,1e-06,5e-06,2e-06,6e-06,2e-06,-1e-06,4e-06,1e-06,5e-06,2e-06,0,-1e-06,1e-06,6e-06,-3e-06,-3e-06
-3e-06,4e-06,-2e-06,4e-06,2e-06,3e-06,1e-06,0,-1e-06,5e-06,-1e-06,0,-1e-06,2e-06,-5e-06,1e-06,-1e-06,4e-06,1e-06,5e-06,-1e-06,1e-06,5e-06,-3e-06,0,0,2e-06,-2e-06,-1e-06,0,-6e-06,-4e-06,-1e-06,2e-06,-3e-06,-8e-06,2e-06,0,-6e-06,1e-06,-5e-06,1e-06,-1e-06,0,0,0,1e-06,1e-06,-2e-06,-3e-06,-3e-06,-4e-06,0,0,-1e-06,-1e-06,-1e-06,-3e-06,-3e-06,-1e-06,2e-06,-1e-06,-6e-06,0,-2e-06,1e-06,3e-06,-2e-06,-3e-06,1e-06,2e-06,-6e-06,4e-06,-3e-06,-5e-06,3e-06,0,2e-06,3e-06,2e-06,-5e-06,3e-06,1e-06,-3e-06,0,-3e-06,6e-06,-2e-06,5e-06,1e-06,-4e-06,8e-06,-2e-06,1e-06,-1e-06,5e-06,3e-06,-3e-06,-1e-06,0,1e-06,1e-06,-1e-06,2e-06,-1e-06,-2e-06,0,-3e-06,1e-06,2e-06,1e-06,0,-2e-06,-3e-06,-1e-06,0,-2e-06,0,3e-06,3e-06,-5e-06
-4e-06,0,5e-06,0,-3e-06,8e-06,0,0,1e-06,3e-06,-1e-06,4e-06,-2e-06,-1e-06,-2e-06,2e-06,-7e-06,-3e-06,-1e-06,-1.2e-05,-3e-06,0,3e-06,-4e-06,-1e-06,-1e-06,-2e-06,1e-06,-1e-06,0,5e-06,1e-06,2e-06,-3e-06,-8e-06,6e-06,0,-3e-06,3e-06,-1e-06,-2e-06,0,2e-06,-5e-06,0,0,3e-06,1e-06,0,0,-1e-06,2e-06,1e-06,1e-06,-1e-06,1e-06,0,7e-06,1e-06,1e-06,0,0,6e-06,-1e-06,-1e-06,-2e-06,2e-06,2e-06,3e-06,1e-06,3e-06,-4e-06,1.3e-05,0,0,-2e-06,-1e-06,-2e-06,-1e-06,-1e-06,0,-1e-06,3e-06,-3e-06,-1e-06,1e-06,-5e-06,0,-4e-06,-1e-06,-5e-06,-4e-06,2e-06,-5e-06,-1e-06,2e-06,-4e-06,-4e-06,-3e-06,0,0,-2e-06,1e-06,2e-06,0,-1e-06,-5e-06,1e-06,-3e-06,-4e-06,-1e-06,-2e-06,-1e-06,0,-2e-06,-2e-06,4e-06,-1e-06,3e-06,0,5e-06
1e-06,0,-1e-06,-5e-06,-3e-06,-3e-06,1e-06,-3e-06,-1e-06,0,2e-06,2e-06,0,1e-06,4e-06,-1e-06,-3e-06,2e-06,0,1e-06,-3e-06,-2e-06,-3e-06,-1e-06,1e-06,-2e-06,-3e-06,0,1e-06,-1e-06,-4e-06,-2e-06,-1e-06,2e-06,0,-2e-06,-1e-06,3e-06,2e-06,-1e-06,2e-06,0,1e-06,3e-06,-1e-06,0,1e-06,-2e-06,-2e-06,-4e-06,-1e-06,-2e-06,-1e-06,0,1e-06,1e-06,-3e-06,-3e-06,1e-06,-1e-06,1e-06,1e-06,-2e-06,0,1e-06,2e-06,-2e-06,0,-1e-06,-4e-06,-3e-06,-5e-06,-8e-06,-1e-06,1e-06,2e-06,-1e-06,0,-5e-06,-1e-06,7e-06,3e-06,0,-1e-06,-1e-06,0,1e-06,-1e-06,-1e-06,0,0,-7e-06,0,0,2e-06,0,5e-06,0,4e-06,-1e-06,1e-06,0,1e-06,0,0,-1e-06,0,0,-4e-06,-1e-06,1e-06,0,0,1e-06,-1e-06,2e-06,-6e-06,0,-4e-06,-2e-06,2e-06
-2e-06,-3e-06,0,2e-06,4e-06,-3e-06,-1e-06,2e-06,1e-06,-4e-06,-2e-06,5e-06,-1e-06,0,-4e-06,0,-1e-06,-2e-06,0,2e-06,0,2e-06,0,2e-06,0,1e-06,-2e-06,1e-06,0,0,-1e-06,1e-06,1e-06,-2e-06,5e-06,-1e-06,2e-06,-1e-06,-1e-06,3e-06,-4e-06,1e-06,0,1e-06,0,0,1e-06,2e-06,0,1e-06,2e-06,3e-06,1e-06,3e-06,-1e-06,-1e-06,-1e-06,0,1e-06,4e-06,0,-2e-06,-3e-06,0,1e-06,-1e-06,-3e-06,-2e-06,1e-06,3e-06,0,-2e-06,-1e-06,0,0,-1e-06,3e-06,4e-06,0,2e-06,-3e-06,-4e-06,-1e-06,-2e-06,-1e-06,-1e-06,2e-06,-1e-06,-1e-06,0,3e-06,0,-1e-06,-2e-06,4e-06,3e-06,-5e-06,3e-06,0,0,-3e-06,-1e-06,-2e-06,-4e-06,0,-1e-06,5e-06,-1e-06,1e-06,0,1e-06,1e-06,-1e-06,-3e-06,0,1e-06,0,-1e-06,0,0,-4e-06
-4e-06,2e-06,-3e-06,1e-06,2e-06,-3e-06,1e-06,1e-06,-1e-06,-3e-06,1e-06,1e-06,-1e-06,1e-06,-3e-06,-1e-06,0,0,-1e-06,5e-06,2e-06,-3e-06,-2e-06,1e-06,0,1e-06,0,-1e-06,1e-06,0,1e-06,-3e-06,0,1e-06,0,-1e-06,-1e-06,-2e-06,-1e-06,-1e-06,1e-06,0,-1e-06,3e-06,0,0,-2e-06,-2e-06,0,1e-06,0,0,0,-3e-06,0,-2e-06,1e-06,-1e-06,1e-06,-3e-06,0,-4e-06,0,1e-06,0,1e-06,1e-06,2e-06,0,0,-1e-06,-2e-06,1e-06,1e-06,0,1e-06,2e-06,2e-06,4e-06,-2e-06,-2e-06,0,-1e-06,1e-06,0,2e-06,-1e-06,0,2e-06,0,3e-06,3e-06,0,1e-06,1e-06,-2e-06,4e-06,4e-06,0,0,2e-06,0,1e-06,0,-1e-06,-1e-06,0,1e-06,2e-06,0,1e-06,0,0,3e-06,1e-06,-2e-06,-2e-06,0,-3e-06,1e-06,-1e-06
-1e-06,1e-06,1e-06,-3e-06,0,0,0,-2e-06,0,0,1e-06,0,0,0,2e-06,0,4e-06,0,0,-1e-06,1e-06,3e-06,-1e-06,-1e-06,1e-06,1e-06,2e-06,-1e-06,-1e-06,0,1e-06,2e-06,0,-1e-06,-5e-06,-1e-06,1e-06,3e-06,1e-06,-3e-06,2e-06,0,0,1e-06,1e-06,0,-4e-06,2e-06,-1e-06,1e-06,1e-06,-3e-06,0,1e-06,1e-06,1e-06,-2e-06,1e-06,-1e-06,3e-06,0,4e-06,2e-06,-1e-06,0,0,2e-06,-1e-06,0,-1e-06,1e-06,2e-06,7e-06,1e-06,1e-06,-1e-06,-1e-06,-2e-06,-2e-06,1e-06,2e-06,1e-06,-3e-06,1e-06,0,-2e-06,0,-1e-06,1e-06,1e-06,1e-06,5e-06,1e-06,-1e-06,-2e-06,3e-06,-3e-06,0,1e-06,0,-6e-06,-1e-06,1e-06,1e-06,-1e-06,-1e-06,-3e-06,-1e-06,-2e-06,3e-06,0,-1e-06,0,-1e-06,1e-06,1e-06,-4e-06,0,1e-06,1e-06,2e-06
0,0,0,1e-06,-2e-06,5e-06,0,0,0,2e-06,-2e-06,-1e-06,-1e-06,0,-1e-06,1e-06,5e-06,0,1e-06,-4e-06,-1e-06,-3e-06,4e-06,-3e-06,-1e-06,-2e-06,2e-06,1e-06,0,0,-1e-06,-1e-06,-1e-06,0,0,6e-06,0,0,2e-06,-1e-06,-1e-06,0,1e-06,-3e-06,0,0,0,-2e-06,1e-06,2e-06,-1e-06,2e-06,0,-1e-06,-1e-06,0,2e-06,-2e-06,-2e-06,-4e-06,-1e-06,3e-06,1e-06,-1e-06,-1e-06,0,0,-1e-06,0,0,2e-06,1e-06,-1e-05,1e-06,2e-06,1e-06,0,1e-06,-2e-06,0,2e-06,1e-06,0,3e-06,0,2e-06,1e-06,0,-3e-06,-1e-06,-3e-06,-5e-06,-1e-06,2e-06,-2e-06,-5e-06,3e-06,-2e-06,-3e-06,0,-1e-06,0,-1e-06,3e-06,-1e-06,-1e-06,0,0,-2e-06,0,-1e-06,1e-06,-1e-06,-2e-06,0,-1e-06,2e-06,0,2e-06,-1e-06,2e-06
-3e-06,-2e-06,2e-06,1e-06,0,-2e-06,0,0,1e-06,2e-06,2e-06,-2e-06,0,0,-3e-06,-1e-06,1e-06,1e-06,0,-2e-06,-2e-06,2e-06,0,-3e-06,1e-06,0,0,-2e-06,1e-06,0,0,2e-06,1e-06,0,3e-06,-2e-06,-1e-06,-3e-06,-4e-06,2e-06,2e-06,0,0,-1e-06,0,0,0,1e-06,1e-06,-2e-06,-1e-06,0,0,0,0,-1e-06,0,0,1e-06,4e-06,0,-2e-06,-2e-06,1e-06,0,0,-1e-06,2e-06,-1e-06,0,1e-06,2e-06,2e-06,1e-06,-1e-06,-2e-06,-1e-06,0,-1e-06,0,-5e-06,0,1e-06,1e-06,1e-06,-3e-06,0,-1e-06,-2e-06,0,-2e-06,-1e-06,0,0,0,2e-06,-3e-06,-1e-06,1e-06,0,2e-06,0,0,1e-06,0,0,2e-06,2e-06,2e-06,-1e-06,-1e-06,0,0,3e-06,-1e-06,0,-3e-06,0,1e-06,-1e-06,-3e-06
0,0,-1e-06,-2e-06,4e-06,-1e-06,-1e-06,1e-06,-1e-06,1e-06,-1e-06,-3e-06,0,-1e-06,1e-06,0,1e-06,-1e-06,0,3e-06,-2e-06,-2e-06,-5e-06,0,0,0,-1e-06,2e-06,-1e-06,0,1e-06,-1e-06,0,0,-1e-06,0,0,2e-06,1e-06,1e-06,0,0,1e-06,1e-06,0,0,3e-06,0,-1e-06,0,-1e-06,2e-06,1e-06,1e-06,0,0,3e-06,0,0,-3e-06,1e-06,-2e-06,1e-06,-2e-06,0,0,0,-1e-06,0,1e-06,0,1e-06,3e-06,1e-06,-1e-06,2e-06,-2e-06,-3e-06,2e-06,0,1e-06,-2e-06,1e-06,2e-06,1e-06,3e-06,0,0,3e-06,0,-1e-06,4e-06,0,0,2e-06,-2e-06,4e-06,1e-06,0,0,1e-06,2e-06,1e-06,-1e-06,0,-1e-06,0,-1e-06,2e-06,-1e-06,0,-1e-06,0,-1e-06,-1e-06,0,-1e-06,0,-4e-06,1e-06,-1e-06
0,1e-06,0,0,0,-5e-06,0,0,1e-06,-1e-06,-1e-06,-1e-06,-1e-06,0,0,1e-06,1e-06,1e-06,1e-06,3e-06,0,0,2e-06,1e-06,-1e-06,0,-2e-06,-1e-06,-1e-06,0,0,1e-06,-1e-06,0,-4e-06,0,1e-06,0,1e-06,-1e-06,0,0,-1e-06,-1e-06,0,0,1e-06,-1e-06,0,-1e-06,0,-2e-06,-1e-06,-2e-06,0,1e-06,-2e-06,0,0,3e-06,0,1e-06,2e-06,2e-06,0,0,1e-06,1e-06,0,-1e-06,-1e-06,1e-06,-6e-06,1e-06,0,-1e-06,0,-1e-06,1e-06,0,2e-06,1e-06,2e-06,1e-06,0,-3e-06,0,-1e-06,1e-06,0,2e-06,2e-06,0,-2e-06,1e-06,-1e-06,-4e-06,1e-06,0,0,2e-06,0,0,-1e-06,-1e-06,0,-2e-06,-1e-06,-1e-06,-2e-06,0,0,-1e-06,0,0,1e-06,0,0,-2e-06,0,3e-06
0,1e-06,-1e-06,1e-06,-2e-06,3e-06,0,-2e-06,0,-2e-06,1e-06,-1e-06,0,0,-2e-06,0,1e-06,-1e-06,0,-1e-06,1e-06,0,3e-06,1e-06,0,-1e-06,-1e-06,1e-06,0,0,-1e-06,-1e-06,1e-06,-1e-06,-1e-06,-2e-06,-1e-06,-2e-06,0,0,1e-06,0,-1e-06,0,0,0,1e-06,1e-06,0,0,1e-06,-1e-06,1e-06,2e-06,0,-1e-06,0,-2e-06,1e-06,-2e-06,0,0,-1e-06,-1e-06,0,0,1e-06,1e-06,0,0,0,-1e-06,3e-06,1e-06,1e-06,1e-06,1e-06,1e-06,-2e-06,-1e-06,-2e-06,0,-1e-06,-1e-06,0,2e-06,1e-06,0,-3e-06,1e-06,2e-06,-1e-06,0,0,1e-06,2e-06,4e-06,-1e-06,2e-06,0,2e-06,-1e-06,0,-1e-06,-1e-06,0,0,2e-06,-2e-06,1e-06,0,1e-06,0,1e-06,0,-1e-06,-2e-06,0,1e-06,1e-06,0
-1e-06,-1e-06,0,-1e-06,-1e-06,1e-06,0,1e-06,1e-06,-1e-06,-1e-06,1e-06,0,0,0,0,2e-06,1e-06,0,-2e-06,0,-1e-06,-3e-06,-1e-06,0,-1e-06,1e-06,0,0,0,2e-06,1e-06,0,1e-06,3e-06,2e-06,1e-06,2e-06,-3e-06,2e-06,-2e-06,0,0,1e-06,0,0,-2e-06,-1e-06,0,1e-06,0,1e-06,0,-2e-06,0,-1e-06,-1e-06,2e-06,-1e-06,1e-06,0,0,-1e-06,0,0,0,-2e-06,-2e-06,-1e-06,0,0,-2e-06,-1e-06,0,0,0,0,1e-06,-1e-06,0,-2e-06,0,-1e-06,-1e-06,0,-1e-06,-2e-06,-1e-06,0,0,1e-06,-4e-06,0,-1e-06,0,-1e-06,-3e-06,-2e-06,0,0,0,0,1e-06,1e-06,0,0,2e-06,-1e-06,-1e-06,0,0,0,-1e-06,-2e-06,0,1e-06,1e-06,0,2e-06,0,-2e-06
0,-1e-06,1e-06,-1e-06,2e-06,3e-06,0,0,-1e-06,0,1e-06,2e-06,-1e-06,0,0,0,3e-06,-1e-06,0,-2e-06,-1e-06,1e-06,-1e-06,-2e-06,0,0,2e-06,0,0,0,0,-1e-06,0,-1e-06,0,-1e-06,-1e-06,0,3e-06,0,1e-06,0,0,1e-06,0,0,-1e-06,1e-06,0,0,0,-1e-06,0,2e-06,0,1e-06,0,-1e-06,-1e-06,-1e-06,0,2e-06,0,0,0,0,0,1e-06,0,0,1e-06,-3e-06,1e-06,0,-1e-06,0,1e-06,-1e-06,2e-06,0,3e-06,-1e-06,0,-1e-06,0,1e-06,0,0,1e-06,0,-2e-06,1e-06,0,0,-1e-06,2e-06,3e-06,0,0,0,1e-06,0,0,1e-06,0,-1e-06,0,-1e-06,1e-06,0,0,-1e-06,0,2e-06,0,-1e-06,-1e-06,0,0,0,0
0,1e-06,0,1e-06,0,-2e-06,0,0,1e-06,1e-06,0,2e-06,0,0,-1e-06,0,1e-06,0,0,3e-06,-1e-06,-1e-06,1e-06,-2e-06,1e-06,0,1e-06,0,0,0,-1e-06,1e-06,0,1e-06,-3e-06,-1e-06,0,-2e-06,0,-2e-06,0,0,0,1e-06,0,0,-1e-06,-1e-06,0,1e-06,-1e-06,1e-06,0,-1e-06,0,0,0,0,0,0,0,-1e-06,0,0,0,0,0,0,0,1e-06,0,-3e-06,-4e-06,0,1e-06,0,1e-06,2e-06,1e-06,0,0,-1e-06,-1e-06,-1e-06,0,0,2e-06,0,0,0,-2e-06,3e-06,0,0,0,-2e-06,-3e-06,1e-06,0,0,-2e-06,0,0,-1e-06,0,0,-2e-06,1e-06,0,0,0,1e-06,0,-1e-06,0,-1e-06,-1e-06,0,-1e-06,0,2e-06
-1e-06,0,0,-1e-06,-1e-06,-2e-06,0,0,0,1e-06,-1e-06,2e-06,0,0,0,0,-1e-06,0,0,1e-06,-1e-06,1e-06,-1e-06,-1e-06,0,0,0,0,0,0,1e-06,-1e-06,0,0,0,2e-06,0,1e-06,-3e-06,-1e-06,-2e-06,0,0,-2e-06,0,0,0,1e-06,0,-1e-06,0,-2e-06,0,1e-06,0,-1e-06,0,1e-06,0,1e-06,-1e-06,-2e-06,0,0,0,0,0,-1e-06,0,-1e-06,1e-06,-3e-06,6e-06,0,1e-06,0,-1e-06,2e-06,-1e-06,0,-3e-06,1e-06,0,-2e-06,0,0,-2e-06,0,0,0,-1e-06,-3e-06,0,1e-06,1e-06,2e-06,3e-06,2e-06,-1e-06,0,-2e-06,0,0,-1e-06,0,-1e-06,0,0,-1e-06,-1e-06,0,0,0,-1e-06,0,0,2e-06,0,-2e-06,0,1e-06
0,0,-1e-06,-1e-06,-1e-06,0,0,0,1e-06,0,1e-06,1e-06,-1e-06,0,0,-1e-06,-1e-06,0,0,1e-06,0,-1e-06,1e-06,0,0,-1e-06,-1e-06,-1e-06,0,0,-1e-06,1e-06,0,0,2e-06,-1e-06,0,0,1e-06,1e-06,2e-06,0,0,-1e-06,0,0,2e-06,0,0,0,0,0,0,-1e-06,0,0,1e-06,0,0,-2e-06,0,0,-1e-06,0,0,0,0,1e-06,0,1e-06,0,-2e-06,-1e-06,0,-1e-06,0,-1e-06,-1e-06,-1e-06,0,2e-06,0,1e-06,0,0,1e-06,0,0,-1e-06,0,1e-06,-2e-06,0,0,1e-06,-1e-06,-4e-06,1e-06,-1e-06,0,-1e-06,0,0,0,0,-1e-06,1e-06,-1e-06,0,0,0,0,0,2e-06,0,0,-1e-06,0,0,0,-2e-06
0,-1e-06,0,1e-06,1e-06,1e-06,0,0,-1e-06,0,-1e-06,0,0,0,-1e-06,0,-2e-06,1e-06,0,-3e-06,0,0,1e-06,1e-06,0,0,-1e-06,0,0,0,0,-1e-06,0,0,0,1e-06,0,-2e-06,2e-06,0,-1e-06,0,0,0,0,0,1e-06,0,0,0,1e-06,0,0,0,0,1e-06,0,-1e-06,1e-06,2e-06,0,2e-06,0,0,0,0,0,-1e-06,0,0,0,-1e-06,-4e-06,0,0,0,0,-1e-06,0,0,2e-06,0,0,0,0,-1e-06,2e-06,0,-1e-06,0,2e-06,0,0,0,0,-1e-06,4e-06,-1e-06,0,0,-1e-06,0,0,1e-06,0,0,0,1e-06,1e-06,-1e-06,0,0,0,-1e-06,0,0,2e-06,0,1e-06,0,0
-1e-06,0,-1e-06,-1e-06,1e-06,3e-06,0,0,1e-06,0,0,-1e-06,0,0,0,0,-1e-06,-1e-06,0,-1e-06,0,1e-06,-3e-06,0,0,0,0,0,0,0,0,1e-06,0,0,-3e-06,1e-06,0,1e-06,-2e-06,-1e-06,-1e-06,0,0,1e-06,0,0,1e-06,1e-06,0,0,0,0,0,1e-06,0,-1e-06,1e-06,1e-06,0,-2e-06,0,0,1e-06,0,0,0,0,0,0,0,0,0,6e-06,-1e-06,1e-06,0,0,1e-06,2e-06,0,-2e-06,0,0,1e-06,0,2e-06,-2e-06,0,2e-06,0,1e-06,3e-06,0,0,0,1e-06,-4e-06,-1e-06,0,0,0,0,0,1e-06,0,-1e-06,-1e-06,0,1e-06,0,0,0,0,0,0,0,1e-06,0,2e-06,0,2e-06
-1e-06,0,1e-06,-1e-06,0,-3e-06,0,0,-1e-06,0,1e-06,-1e-06,-1e-06,0,0,0,-1e-06,1e-06,0,0,-1e-06,-1e-06,-1e-06,-1e-06,0,0,1e-06,0,0,0,0,-1e-06,0,0,0,-3e-06,0,1e-06,-2e-06,0,1e-06,0,0,0,0,0,-1e-06,-1e-06,0,1e-06,0,1e-06,0,-1e-06,0,0,-1e-06,0,0,3e-06,0,-1e-06,0,1e-06,0,0,1e-06,1e-06,0,1e-06,0,1e-06,-2e-06,-1e-06,0,0,0,0,0,0,-1e-06,0,-1e-06,1e-06,0,-2e-06,2e-06,0,0,0,-1e-06,1e-06,0,0,0,-2e-06,3e-06,0,0,0,2e-06,0,0,0,-1e-06,0,0,0,0,1e-06,0,0,0,1e-06,0,0,-1e-06,0,-1e-06,0,0
