-0.005634,-0.014647,-0.024104,-0.018227,-0.006616,-0.001991,0.003866,-0.000972,-0.000779,0.008351,0.001438,-0.003889,0.000793,-0.002352,0.009152,-0.00157,-0.0051,0.003499,0.004384,-0.007715,-0.013586,-0.014165,-0.001894,0.014895,0.003617,0.001684,-0.002369,0.010734,0.00446,0.001435,-0.00734,-0.015627,0.000749,0.006539,0.00395,0.00434,0.013176,-0.014182,-0.008873,-0.011191,-0.000874,-0.007785,-0.014348,-0.006381,-0.007346,-0.015217,0.000167,0.004996,-0.0119,-0.023587,-0.018893,-0.015079,-0.007787,-0.013388,-0.009152,-0.005355,-0.011772,-0.011818,-0.005799,-0.003925,-0.011234,-0.012686,-0.020129,-0.010305,0.005383,-0.010833,-0.022825,-0.016648,-0.008852,-0.017508,-0.012431,-0.002788,-0.009235,-0.002666,-0.014697,-0.010914,-0.01273,-0.027314,-0.028521,-0.024039,-0.017568,-0.01757,-0.019095,-0.002904,-0.023929,-0.007118,-0.009521,-0.012742,0.008588,-0.007824,-0.019419,-0.015542,-0.029071,0.000295,-0.008005,-0.010976,-0.022553,-0.026677,-0.026804,-0.01343,-0.009919,-0.014598,0.011166,-0.006726,0.007337,0.013903,-0.005639,-0.008301,-0.014017,-0.025375,-0.014918,-0.004931,0.009935,-0.003336,0.001049,-0.015701,-0.008346,-0.017261,-0.021653,-0.003896,-0.009903
-0.003792,-0.004722,0.008584,0.008256,0.005565,0.008907,0.003186,0.002221,0.000113,0.003777,-0.000523,-0.000654,-0.00386,-0.001104,-0.007171,0.004934,0.014482,0.012528,0.019096,0.012608,0.018717,0.010998,0.001844,-0.000521,-0.018454,-0.00829,0.006593,0.009974,0.007206,0.010057,0.010066,0.010624,0.005963,0.017099,-0.003481,0.007671,0.004675,0.0136,0.010507,0.017875,0.012609,-0.002046,0.008892,-0.011308,-0.004093,0.016878,-0.00562,0.004075,0.007394,0.003168,-0.001748,-0.01089,-0.025052,0.003593,0.001802,0.019723,0.016384,0.009787,-0.00209,-0.002533,-0.000573,0.007671,-0.001619,-0.008553,0.005404,-0.01273,-0.0061,0.001181,0.014142,0.021629,-0.000123,-0.022908,-0.005448,-0.011572,0.006506,0.000935,-0.006348,-0.008266,-0.002671,-0.002638,-0.00504,0.001225,-0.011959,-0.029225,-0.010696,0.015786,-0.020448,-0.01632,-0.003508,-0.006093,0.000117,0.000697,0.008158,-0.025862,-0.000712,0.008812,0.010585,-0.012735,-0.004558,-0.003848,0.010568,-0.003768,-0.02799,0.004553,0.008024,-0.009566,0.002838,0.002585,0.008822,0.007845,0.000273,-0.007958,-0.004788,-0.007261,-0.003426,0.005834,-0.003617,-0.003932,-0.012529,-0.005556,-0.005337
0.003769,-0.001931,-0.003566,0.003204,0.003423,0.004165,-0.00578,-0.002391,0.002078,0.00021,-0.005085,-0.004987,0.005264,0.000587,0.003307,0.00511,-0.005533,0.002584,0.004041,-0.018661,-0.012988,-0.007911,-0.012037,2.9e-05,-0.005896,-0.009127,-0.01368,-0.019206,0.003224,-0.001856,-0.008933,-0.00925,-0.020876,-0.012728,-0.005858,-0.006604,0.015156,-0.00283,-0.011683,-0.018627,-0.00814,0.004259,-0.001401,-0.006704,0.013249,-0.006375,-0.013755,-0.018709,-0.015088,-0.01295,-0.002254,0.007022,0.000293,-0.007502,-0.002246,0.005696,0.00339,-0.006002,-0.002759,0.00593,-0.01842,-0.012624,0.003246,-0.008504,-0.01029,0.003892,-0.003217,-0.011321,-0.010138,-0.01424,0.017029,0.013783,0.004509,0.001088,0.007379,-0.012441,0.010793,0.009991,-0.006277,-0.005633,-0.001917,0.000413,0.009687,0.00078,0.007709,-0.003861,0.005851,0.011,0.00821,0.000755,-0.001703,0.005185,0.001374,-0.016945,0.00321,-0.003645,-0.016914,0.011101,-0.004275,0.001293,-0.002849,-0.001294,0.010947,-0.012683,0.002621,-0.002511,-0.000885,0.001517,-0.015655,-0.006345,-0.000174,0.002961,-0.010477,0.012508,-0.003029,-0.009516,0.003355,-0.002402,-0.008504,-0.013791,-0.002393
-0.00555,-0.004493,-0.005466,-0.000411,-0.008772,0.001466,0.009383,0.007244,0.005803,-0.001947,-0.005598,-0.003855,0.006502,0.008084,0.002976,0.007343,0.001317,-0.001154,-0.009697,0.004394,0.013281,0.01585,0.00116,0.006277,-0.004671,0.009347,0.013055,-0.005917,-0.002274,0.008342,0.006695,0.005153,0.003889,-0.010087,-0.00073,-0.001362,0.001604,-0.007512,0.013368,0.010925,-0.01287,-0.011288,-0.008274,0.006804,-0.014431,-0.004718,0.017306,-0.002569,-0.001518,0.000469,-0.005536,0.00766,-0.001689,-0.007493,-0.001074,-0.000917,0.001572,-0.004514,-0.013108,-0.001164,0.000453,0.0123,-0.008808,0.014816,0.009571,-0.016028,-0.004428,0.013496,-0.005472,0.005982,0.0072,-0.014012,-0.006842,-0.008947,0.008299,0.013437,-0.003121,-0.004818,0.003752,-0.006517,-0.003993,-0.002199,0.006838,0.01036,0.00224,0.001179,-0.002707,-0.005236,-0.011082,-0.015906,-0.000753,-0.00477,-0.012284,0.011281,0.012015,-0.008546,0.008192,-0.005277,0.016984,-0.003161,-0.01092,-0.008341,0.012187,0.001992,-0.0025,-0.017185,-0.003349,-0.00188,-0.004361,-0.004575,-0.000261,-0.008127,-0.007258,-0.012076,-0.006883,-0.004611,0.016498,0.004968,-0.000811,-0.004784,0.004204
-0.001121,0.000725,0.011992,0.002201,0.001484,0.000712,-0.010296,-0.010401,-0.005662,-0.007775,0.003661,0.002447,-0.003075,0.003023,-0.004435,-0.005079,-0.006249,-0.006643,-0.000133,-0.011096,-0.008378,-0.012288,-0.008509,-0.004139,0.000286,-0.004453,-0.003359,-0.008201,-0.001855,-0.006053,-0.004691,-0.005153,-0.008172,-0.007435,5.4e-05,-0.000484,-0.00669,-0.018906,-0.012719,-0.005597,0.005707,0.009445,0.011329,-0.003023,-0.017216,-0.005821,-0.009121,-0.014044,-0.005238,-0.007809,0.000501,-4e-04,0.003196,-0.007947,-0.004653,-0.012756,-0.018499,-0.012402,0.004209,0.002209,-0.002605,-0.006206,-0.007242,0.001884,-0.012793,-0.004955,-0.006819,-0.00979,-0.006525,-0.004154,-0.000233,-0.002146,-0.010877,-0.003278,-0.016494,-0.010271,0.006289,-0.004894,-0.003797,0.002388,-0.000433,0.002548,-0.009013,-0.010918,-0.004665,0.002776,-0.006827,-0.011457,-0.012434,-0.016474,-0.02307,-0.005101,-0.006597,-0.01291,0.003034,0.003799,0.006602,0.003241,-0.005678,0.00135,-0.002044,-0.008097,-0.009489,-0.00503,-0.012582,-0.001801,0.009166,0.004651,-0.004473,-0.000966,-0.009197,-0.008597,-0.003256,-0.008748,-0.002414,-0.014902,-0.008628,-0.014972,0.008795,0.006795,0.00039
-0.00132,-0.00257,-0.006456,0.004508,0.000862,0.000126,-0.001409,-0.003689,0.004816,0.001148,0.004719,-0.003187,-0.002211,-0.005178,0.000809,0.006493,0.002133,0.006975,-0.008831,-0.004462,0.002707,-0.002029,0.003836,0.000196,0.005576,-0.003807,-0.005325,-0.007358,0.001137,0.001974,0.002576,0.003263,-0.001229,-0.003756,-0.000967,0.0064,-0.001277,0.002388,0.005551,0.015521,0.003978,-0.003363,-0.005116,0.004436,-0.001629,0.00998,-0.00039,-0.001692,0.003473,0.008703,0.004506,-0.005614,0.008026,0.001824,0.008016,0.006625,-0.003757,-0.00453,-0.002319,0.005863,0.013387,-0.001838,0.00783,0.001076,0.009677,0.006817,0.015749,-0.002463,-0.000975,0.002282,-0.005712,0.003818,-0.002501,-0.001686,0.010063,0.002365,-0.010793,0.008719,0.009224,0.007781,0.013149,-0.005518,-0.000304,0.001469,0.000695,-0.011256,-0.001409,0.011848,0.004856,0.011586,0.003384,-0.008023,-0.000181,0.008611,-0.000944,-0.008591,-0.017116,0.004806,-0.005626,-0.001353,-0.004902,0.009663,0.008728,-0.002485,-0.00495,0.009124,-0.005987,-0.004357,0.001815,-0.002813,0.003303,0.003488,-0.008747,-0.011837,-0.010285,-0.000359,0.008222,0.010953,-0.004097,-0.008289,0.002619
-0.001399,0.002737,0.001959,-0.005936,-0.001291,-0.001198,-0.000566,-0.00326,0.002076,0.001745,0.000948,0.003251,0.000217,0.005004,-0.001149,0.001523,-0.002193,0.004923,0.000637,-0.004261,-0.003556,-0.002087,-0.005313,-0.004985,-0.004865,0.000197,-0.006839,-0.002125,0.001433,-0.005678,0.002454,-0.004729,-0.010056,0.003767,0.006539,0.004509,-0.00143,-0.004042,-0.000391,-0.00459,-0.004894,-0.003235,0.003938,0.007183,-0.005255,-0.004112,-0.004848,0.007746,0.008642,0.001063,0.005511,0.008059,-0.010804,0.00125,0.011895,-0.007247,-0.011053,-0.00859,0.007302,-0.004775,-0.008149,6.7e-05,-0.010901,-8.6e-05,-0.003208,0.003109,-0.007976,0.00046,-0.002263,-0.019425,0.007226,-0.005582,0.007298,0.006006,-0.007486,-0.003419,-0.007892,-0.008037,-0.012528,-0.009491,-0.017351,0.004622,-0.00409,0.001336,0.001588,0.00721,-0.005991,0.003449,0.000854,0.005882,0.008839,0.003619,0.001435,-0.002224,0.005431,0.008844,0.004909,0.003808,0.009718,0.008304,0.007833,0.004252,-0.009101,0.001337,-0.001855,-0.010538,-0.002402,0.00185,0.001378,0.006512,-0.007142,-0.001454,0.003447,-0.00653,0.010711,9e-06,-0.004584,-0.013227,0.004122,-0.006235,-0.012706
-0.002081,-0.001877,-0.001994,-0.000796,-0.001909,-0.002927,-0.003562,0.001754,0.000186,-0.00298,0.001512,0.003516,0.001578,-0.000595,0.001174,-0.004264,-0.001283,0.001951,-0.001537,0.000891,-0.008419,-0.000328,0.001267,-0.006377,-0.002629,-0.006215,0.004554,-0.002514,-0.003615,-0.00248,-0.003106,-0.004242,0.006692,-0.004261,-0.003365,-0.007311,0.001875,-0.004782,0.007954,0.000114,-0.003374,-0.007607,-0.003106,-0.000396,0.002304,0.001446,-0.002364,-0.002292,-0.002734,0.009201,0.000653,4e-06,0.009853,0.004056,-0.002966,0.001927,-0.001967,0.00608,0.003986,-0.000802,0.001679,0.001338,0.004046,-0.001374,-0.005865,-0.008271,-0.00105,0.001956,0.000958,0.002165,-0.001514,0.001144,0.002805,-0.002924,-0.003807,-0.006457,-0.007081,-0.001117,-0.003483,0.003371,0.003893,-0.001229,0.004874,-0.005259,-0.00123,-0.002957,0.005196,-0.001838,-0.007953,0.001783,-0.002511,0.005179,0.002406,-0.00064,-0.002981,-0.004652,-0.000678,-0.011367,-0.010593,0.000943,-0.005614,0.004865,0.00408,-0.003207,-0.006949,0.006338,-0.003451,-0.014419,-0.000166,-0.002676,0.000348,-0.003894,0.000864,-0.003399,0.003988,0.012552,0.008581,0.005991,-0.001678,0.006861,0.00184
0.002984,0.00128,0.002502,0.002154,0.000295,-0.000956,0.001687,-0.002577,-0.00027,-0.000866,0.001327,0.001608,-0.001465,0.002317,-0.003976,-0.000822,-0.005812,0.001934,0.002865,-0.001466,0.003269,-0.001987,-1.8e-05,0.006812,0.000412,-0.002368,0.002972,0.006749,0.003152,0.001052,-0.000544,-0.005232,-0.003944,0.002468,-0.001753,0.006116,-0.00622,0.002822,0.001934,0.002494,0.000884,-0.007551,-0.005676,0.002937,-0.000715,-0.002607,-0.001021,-0.001068,0.004965,-0.0068,0.000615,-0.00398,-0.000833,-0.004929,0.005964,0.003332,0.000546,-0.004927,0.002555,-0.006909,0.007454,0.00228,0.003196,-0.005977,-0.004516,0.002119,0.000824,-0.000711,-0.000686,-0.007872,-0.003144,-0.00155,-0.000451,0.003015,-0.001771,-0.002729,0.006975,-0.000927,0.005296,0.003745,-0.005012,0.00895,-0.003715,4.4e-05,0.006376,0.005812,-0.002664,-0.000382,0.001319,0.006034,0.005135,0.000473,0.003831,0.001906,0.001266,-0.007773,0.003768,0.004074,0.005473,-0.006201,0.00364,-0.005597,0.000457,-0.001889,-0.001516,0.001881,-0.003171,-0.001119,-0.004611,0.002594,0.004307,0.004176,-0.003465,0.002515,-0.004385,-0.005834,0.000225,-0.00523,-0.005808,-0.000164,-0.003138
0.001165,0.000967,0.000841,-0.000504,-0.002136,-0.001712,-0.00258,0.001786,0.001501,0.000651,-0.001998,-0.000816,-0.001634,-0.003858,-0.000928,-0.00039,0.000782,0.001753,-0.002556,0.000279,0.003817,0.001796,0.000877,0.001474,-0.000134,-0.00012,-0.004713,-0.00332,-0.006362,-0.005202,0.00348,0.00011,0.002622,-1.1e-05,-0.007544,-0.003491,-0.000126,-0.000589,0.00509,-0.000366,0.000441,-0.002013,0.000185,-0.005312,0.001369,-0.009011,0.004103,0.003378,-0.000368,-0.001241,-0.004121,0.001726,0.000908,-0.00059,-0.002492,-0.001232,-0.000192,0.00129,-0.003621,-0.001632,-0.002664,0.002881,0.003357,0.005294,0.003757,-0.000322,-0.005058,0.004367,-0.004093,-0.000955,-0.00509,0.001838,0.000529,0.003986,-0.005628,0.002274,-0.003101,-0.000481,-0.004375,-0.001719,0.003381,-0.000485,0.001943,-0.000691,-0.001473,-0.00503,-0.000451,0.002298,0.005289,-3.9e-05,0.002051,0.001576,-0.002404,0.001998,-0.003683,0.000469,-0.005033,-0.000363,-0.00042,-0.000895,-0.002663,0.005017,0.002554,0.003821,0.00062,0.000253,0.002069,0.002982,0.004191,-0.000968,0.000979,-0.002825,0.004056,0.003457,0.010293,0.002788,-0.002215,-0.001317,-0.007427,-0.002243,-7.4e-05
0.001131,-5.4e-05,0.002335,0.001017,0.001524,0.000631,0.000787,-0.001245,-0.000155,-0.001682,-0.001236,-0.001968,-0.00066,0.001797,0.000425,-0.00045,-0.001825,-0.002468,0.000834,0.0013,0.001461,-0.000565,0.000725,0.001171,-0.00119,-0.002891,-0.001452,0.001892,0.00049,-0.003988,-0.005171,0.003232,-0.001175,0.001971,-0.00436,-0.002076,-0.005896,-0.006031,-0.004436,-0.003557,-0.001768,0.003234,-0.001509,-0.000268,-0.006417,-0.003323,-0.00522,0.003423,0.000678,0.002426,0.001971,-0.00436,-0.002054,-0.000599,-0.004089,-0.002593,-0.003118,0.004794,0.003459,0.000315,0.00532,-0.005981,-0.006841,-0.005534,0.001721,0.000191,0.003114,-0.005924,0.003888,0.004305,2.5e-05,-0.001876,-0.003938,-0.004915,0.005182,-0.006723,0.003345,0.005251,0.002313,0.004562,-0.000697,-0.005007,-0.000986,0.001807,0.00055,-0.003017,-0.000425,0.002173,-0.003555,-0.001709,-0.005382,0.00304,-0.001974,0.001932,-0.00082,0.000364,-0.001414,0.000144,-0.006146,0.001326,-0.00042,-0.004129,-0.002182,-0.003953,0.006814,-0.003344,-0.003908,-0.001132,0.000211,0.00195,0.00297,0.003405,-0.002105,9e-04,0.002031,-0.003303,-0.00109,-0.000945,0.007203,0.004756,-0.000412
-4.2e-05,0.000185,-6.8e-05,-0.003937,0.00024,0.001452,0.000164,-0.000387,-0.003114,-0.000702,0.000399,-0.000399,-0.000672,-0.002534,0.000878,0.001023,-0.000226,-0.000237,-0.005001,-0.002066,0.003842,0.000817,0.000405,-0.000758,-0.000111,0.001306,-0.000234,0.000405,0.003211,-0.001857,0.002482,-0.003618,-0.000731,-0.003062,-0.002426,-0.002723,0.002908,0.000518,-0.003669,0.002033,0.001621,-0.00161,0.000722,0.001595,-0.000408,0.000473,0.004509,0.003487,-4.7e-05,0.000898,-0.002681,-0.00018,0.003798,0.002845,-0.000953,-0.004759,0.001478,-0.001175,-0.001101,0.000133,0.000996,-0.001979,-0.001056,-0.001138,-0.002393,0.002265,8.3e-05,-0.001318,0.001601,-0.0013,-0.002692,0.001195,0.003576,-0.001357,-0.000598,0.000273,-0.001585,-0.002082,0.001342,-0.002754,0.000625,0.000256,-0.000952,0.00201,0.000414,0.004408,-0.000408,-0.004731,-0.000284,0.002891,0.000793,-0.001404,-0.002571,0.002838,-0.002174,0.000266,-0.000995,-0.00218,0.001667,0.000155,-0.003196,0.001748,-0.005495,0.000313,-0.003504,0.005043,-0.000722,-0.00603,-0.00094,0.001301,-0.003035,-0.000266,-0.001609,-0.002018,0.000648,0.00166,-0.006036,-0.002589,-0.005294,-0.005299,0.001021
0.001093,-0.00046,0.000197,0.002132,-0.001778,-0.000667,0.000195,0.000632,-0.001934,-0.000734,-0.001615,0.000823,-0.000639,-0.000821,-0.002603,-0.001207,0.000656,-0.000343,0.001011,0.000498,0.000429,0.003613,0.000329,7e-06,-0.001262,0.000994,-0.001011,0.002734,-0.001734,0.00217,-0.002108,0.00156,0.000439,0.003928,0.000939,0.001391,0.002786,0.002395,-0.001402,0.002159,-0.001841,0.001485,0.000837,-0.00214,0.000169,-0.001618,-0.005305,0.001096,-0.001196,-0.001,0.002447,0.001799,0.000128,-0.001075,-0.001154,0.002829,-0.001695,0.001329,-0.000979,0.003098,0.001187,0.001896,0.001412,0.002903,-0.002744,-0.000963,0.002218,0.001235,-0.004193,0.000772,0.000525,0.000543,-0.000575,0.002756,0.001994,0.003073,8.7e-05,-0.000378,0.001007,-0.001311,0.001086,0.006257,-0.000924,-0.001338,-0.000566,-6e-06,0.000138,-0.0031,-0.002514,0.001554,-0.000777,-0.002842,0.003197,0.001441,-0.00059,-0.000394,-0.003182,-0.000454,0.00058,-0.003378,0.002687,-0.002244,-0.000956,0.000298,-0.006059,-0.002168,0.0018,-0.000145,0.002099,-0.000161,-8.7e-05,-0.000988,0.003248,-0.001684,0.000112,0.000885,-0.003777,9e-05,0.002757,-0.000454,1.2e-05
-0.001509,0.000529,-0.000329,0.001223,0.001065,-0.000628,0.000517,-0.000154,-0.000543,-5.4e-05,-0.00132,-0.000125,0.000161,0.00037,5.1e-05,0.00099,-0.001114,-0.000702,-0.001598,-0.00143,0.000615,-0.000613,0.000914,0.000318,-0.000441,-1.4e-05,0.00172,-0.000933,-0.000112,0.002545,0.001072,0.00102,0.001927,-0.002866,0.002065,0.00027,-0.001062,0.001228,-0.004757,0.00124,0.001823,-0.001363,0.000435,0.000591,0.00202,0.000364,-0.001021,8.7e-05,-0.002354,-0.001443,0.001797,8e-05,-0.002573,-0.001877,-0.000585,-0.001727,-0.001594,0.002257,-0.003508,0.000542,-0.000577,-0.002558,0.000959,-0.000138,0.002959,-0.001014,-0.00166,-7e-06,0.000309,-0.003157,-0.003871,0.001958,-0.002259,-0.000732,-0.001001,-0.000856,-0.003218,-0.003768,-0.000224,0.002182,-0.001541,-0.004361,-0.001747,0.001101,0.001212,-0.004006,-0.000264,0.000629,0.000282,-0.003518,-0.001806,0.001309,-0.001272,-0.001639,0.000973,-0.002241,0.001282,0.002481,-0.000165,0.001508,0.000726,0.000775,-0.000275,-0.001246,0.00305,-0.001498,-0.001081,-0.000738,-0.001273,-0.000548,-0.001149,0.000447,-0.001513,-0.000636,-0.002762,-0.002573,0.001539,0.000777,-0.000539,-0.000367,-0.000182
-0.00076,-0.00053,-7.2e-05,-0.000704,-0.000855,-0.000484,-0.00036,0.000288,-0.000137,-0.00022,0.000542,-1.3e-05,0.000491,-0.000322,-0.000162,3e-06,1.4e-05,-0.001348,0.000761,0.001234,-0.001058,-0.002005,-0.000946,-0.001191,0.00032,0.000452,0.000903,-4.7e-05,0.000723,0.001492,6.4e-05,-0.00159,0.000661,0.001329,0.00115,-0.000454,-9.1e-05,-0.001641,-0.000161,0.00045,-0.001255,0.000842,-0.000672,-0.001373,-0.00024,0.001708,0.001171,0.001203,-5.8e-05,0.000727,0.0017,0.001612,0.000857,0.000135,-9.3e-05,3.8e-05,-0.002502,-0.000234,0.001117,-0.000258,-0.002683,0.00041,-0.001176,0.000676,-0.00175,-0.000489,0.002215,0.002524,0.000965,0.000664,0.000678,-0.002568,-0.002714,-7.5e-05,-0.000734,0.003546,0.004003,0.001364,-0.002029,-0.001468,0.002085,0.002157,0.000571,-0.00232,0.000516,0.002608,-0.000463,-0.000602,0.000542,-0.003316,0.00071,-0.001274,-0.001957,0.002167,-0.000489,0.000548,0.003625,-0.000975,0.001674,-0.000599,-0.000788,-0.001137,0.001766,0.001341,0.002021,-0.001172,0.000166,0.003029,-0.001965,0.001023,-0.000528,-0.001344,-0.001156,0.001119,-0.000157,0.001213,0.001095,0.001192,0.002126,-0.001034,0.000406
0.000148,0.000145,-0.001128,-0.000918,0.001319,0.000592,-0.00021,0.000174,0.000298,-0.000388,-0.000295,0.000104,0.000318,0.000561,-0.00057,-0.000637,-0.000212,-0.001044,-0.001051,-0.000606,-0.000478,-0.000672,0.000109,0.000813,0.000263,-0.000389,-0.001045,-0.00025,0.001101,-3.2e-05,-0.000371,0.000105,-0.001004,-0.000493,7.9e-05,-0.000116,-0.002665,-0.002197,-7.2e-05,0.001573,-4.1e-05,-0.003031,0.000568,-0.000202,-0.002191,0.000143,-0.000195,0.001954,-0.002039,-0.000275,-0.001179,-0.000116,-0.000921,0.000792,-0.001574,0.001846,0.000232,0.000424,-0.000848,-0.002592,0.000965,-0.000271,0.002228,0.000104,0.000989,0.001751,0.000484,0.000158,-0.000679,-0.003066,0.001602,0.00215,-0.000151,-6.7e-05,0.000731,-0.001947,-0.000302,-0.001483,0.003928,-0.000234,-0.002494,-0.002713,0.000661,0.002224,-0.000247,0.000209,0.000315,-7.5e-05,-0.000358,0.001069,-0.00171,0.001328,0.000306,-0.001511,0.000785,0.001247,-0.001209,-0.003005,-0.002062,0.001972,-0.000609,0.000329,0.002422,0.000372,-0.000392,0.001471,0.001169,0.00075,0.001863,-0.001053,0.001844,0.001289,0.002069,0.000637,-3.3e-05,-0.002533,0.003072,-0.001366,-0.000868,0.001236,-0.00212
0.000316,9.5e-05,0.000455,-0.000887,-0.000896,-0.000647,6.1e-05,-0.000415,-0.000295,0.00033,-0.00037,-0.000462,-0.000359,0.000653,0.000394,0.000442,-0.000193,0.000111,0.000596,0.000238,0.000361,-0.000937,1.3e-05,0.000408,-0.000811,-0.000638,-0.001079,0.001046,-2e-05,-0.001296,-0.000601,-0.001462,0.00056,0.001091,0.001119,0.001022,0.001646,0.000827,-0.000711,-0.001197,-0.000538,-0.000104,-0.001122,0.000833,0.000737,-0.000534,0.001402,-0.000141,-0.000237,0.001105,0.000692,-0.000966,-0.000306,0.000217,0.001388,-0.001953,0.000636,0.001507,-5.6e-05,7.3e-05,-0.003332,-0.001586,-0.002065,-0.001039,-0.001515,-0.000757,-0.00089,-0.001152,0.000522,0.000483,0.00189,-8.8e-05,-1e-05,-0.000384,-0.001849,-0.000429,0.001474,0.001056,-0.003129,0.000896,0.001352,-0.001115,0.001311,-0.001171,-0.000239,-0.000984,-0.000355,-0.001146,0.00033,6.9e-05,-0.000818,0.000543,0.000755,0.00181,0.000405,-0.000827,-0.000987,-0.000228,0.000322,0.000753,0.000628,-7.8e-05,-0.00084,-0.000397,-0.000985,0.000633,-0.00104,8e-05,1.5e-05,0.000732,-0.000388,-0.00055,-0.001383,0.000847,-0.00177,0.00075,-8e-05,0.000104,0.001928,-7.4e-05,0.000716
-0.000161,-0.000141,-0.000407,0.000423,-0.000204,0.000211,-9.5e-05,1e-05,0.000821,0.000102,0.000441,0.00016,-0.000245,9e-05,-6e-04,-0.000389,-0.000453,6.2e-05,-0.0014,2.7e-05,0.00091,0.000617,0.000216,0.000209,0.000435,0.000114,0.000144,-0.000344,-0.001057,-0.000472,0.000718,0.000408,-0.000371,-0.001128,0.000113,-8.8e-05,-0.000932,0.001003,-0.000836,-0.001093,0.000853,-0.001098,-0.000212,-0.000243,-0.000153,0.001,0.000234,0.000213,-0.000411,-0.001283,-0.000688,0.000144,-0.001792,-0.000787,0.000928,-0.000179,0.000516,0.000904,-0.000669,-0.001955,0.000929,0.000695,-5.7e-05,0.000454,0.001525,-0.000348,0.000723,-0.000122,0.000289,0.000244,0.000346,0.000163,-3.8e-05,0.000356,0.000381,0.001097,-0.000402,4e-06,0.001487,6.2e-05,-0.001142,0.000749,-0.001527,-0.000327,-0.000946,0.000483,-0.000183,0.00086,0.00027,-0.001851,5.1e-05,-0.000984,0.000595,-0.000517,0.000129,-0.000834,-0.00045,0.000426,0.000575,-0.001987,0.000721,-0.001048,0.001154,0.000431,4.8e-05,-0.002705,9.4e-05,0.000637,-0.001275,-0.000563,0.001003,0.000108,-4.2e-05,-0.000219,-0.001037,-0.000571,0.000835,-6.6e-05,-0.001615,-0.000717,-0.000801
-0.000155,1e-04,-1.5e-05,-0.000528,0.000463,0.000196,0.000196,0.000349,0.000456,-0.000194,0.000471,0.000396,-0.000201,0.000244,0.000266,0.000199,-0.000262,-0.000167,0.000301,-0.000459,-3.6e-05,0.001325,-0.000133,-0.00055,-0.000545,-0.000224,0.000481,0.000321,0.000617,-0.000232,-0.00097,0.000154,0.000286,0.000786,-0.000749,-0.000493,0.000918,-0.000563,0.000529,-0.000966,-0.000398,0.000728,-0.000172,0.000594,0.001023,-0.000318,-0.000617,0.000139,-0.000232,0.00013,0.000126,-0.000351,0.002161,-0.000502,0.000578,0.000703,-0.000946,0.000111,0.000538,0.000786,-0.001257,0.000184,-0.000721,-0.000112,-9.8e-05,-0.000133,-0.000802,0.000117,-0.000787,5.2e-05,-0.000661,-0.000733,-0.001994,-0.000568,-0.000507,-0.002525,0.001134,0.000577,-0.000512,-0.000742,0.000381,0.000153,-1e-04,0.001539,0.000107,1.4e-05,0.000628,0.000931,-0.000529,-0.001003,-0.000449,-0.000402,-0.000746,-0.000146,0.000359,0.000388,0.000234,-0.000237,-0.000637,0.001795,-6e-04,0.001566,-0.001792,-0.000174,0.001173,0.00195,0.000341,-0.000736,0.000259,-0.000265,-0.000752,0.00025,0.001267,-0.000815,-0.000267,0.001071,-0.000314,-0.000547,0.000377,-0.000181,2.4e-05
-0.000226,-3.9e-05,-0.00019,0.000535,-0.000346,-8.2e-05,4.3e-05,-0.000304,0.000293,-0.000158,-4e-06,-0.000109,-5.9e-05,-5.3e-05,-0.000252,0.000128,-8.5e-05,0.000134,-9.3e-05,0.000263,0.000421,-0.000405,0.000223,5.4e-05,-5.6e-05,-0.000186,-3.5e-05,-0.000275,8.9e-05,-3.7e-05,0.000858,-0.000446,-0.000116,-0.000738,-0.001187,-4.8e-05,-0.001155,-0.000316,0.001003,-0.000252,-0.000429,-0.000272,0.000212,-0.000167,-0.000471,-0.001752,-0.000107,2.4e-05,0.000224,-8.6e-05,-0.000652,-0.000374,-0.001577,0.000176,0.000275,0.000591,-0.000945,0.001239,-2e-06,-0.000419,-0.000276,-0.000215,0.001787,-0.000522,-0.000581,0.000626,0.001695,9.1e-05,2.2e-05,0.000375,-0.000859,0.000438,4e-06,0.000599,0.000908,0.000992,-0.001794,-0.000381,5e-05,0.000165,0.000289,-0.000219,-0.000858,-0.000841,7.7e-05,-0.000322,-0.001074,-0.000253,0.000523,0.000194,0.001057,0.000257,0.000429,0.000597,6.2e-05,-0.000153,0.00021,-0.000354,0.00075,-0.000212,2.4e-05,-0.001293,0.000622,-3.3e-05,-0.000331,-0.000486,-0.000657,-0.001523,-0.000644,-5e-06,-0.000521,-0.000486,-0.001089,-0.000437,-0.001301,-0.001518,0.000102,-0.000492,-0.000103,-0.00029,0.000692
-0.000148,-7.3e-05,-3.5e-05,0.000762,0.000188,8.7e-05,-8.2e-05,0.000546,2.4e-05,-2.3e-05,6.6e-05,-6e-05,0.00013,-0.000291,0.000306,-0.000371,0.000112,0.00043,0.00037,-0.000317,-0.000307,-0.000428,-0.000187,-0.000241,-0.00024,0.00045,0.000278,0.000118,-0.000227,7.8e-05,-0.000493,0.00024,0.000582,0.000752,-0.001134,0.000355,0.000305,-0.000131,0.00137,-0.000346,0.000543,3.4e-05,-0.000311,-2.7e-05,0.00018,-0.000396,-0.000366,0.000215,0.000369,0.000925,-0.000329,0.000108,0.000367,0.000502,0.000104,-0.000589,-0.001024,8.3e-05,0.000575,0.000936,7.4e-05,0.000783,0.000248,9.2e-05,0.000147,-0.000219,-0.001744,0.000737,0.000562,-0.000584,-0.000288,0.000449,0.000107,-4.5e-05,0.000261,0.000922,0.000847,-0.000525,7.9e-05,0.000637,-9.4e-05,0.000507,0.000834,0.00056,-0.000147,-0.000244,0.000884,-1.9e-05,-0.000127,0.000407,-0.000374,0.000327,-0.000387,-0.001279,-0.000876,0.000399,0.000443,0.000831,-0.000355,9.1e-05,-7.7e-05,0.001465,-0.000178,0.00013,-0.000754,-6.4e-05,0.000248,-0.000521,0.000692,-0.000135,0.00068,0.000332,0.000218,8e-06,9.6e-05,0.000485,0.000293,0.000167,-9.8e-05,0.000255,-0.000307
-0.000294,7.5e-05,-0.000396,-0.000145,-0.000332,-2.6e-05,7.4e-05,-0.000338,0.00012,0.000139,0.000399,-1.8e-05,2.4e-05,6.1e-05,-0.000482,0.000389,-0.00023,2e-04,-0.000657,0.000304,-0.00054,-5.6e-05,3e-06,0.000293,-0.000142,-0.00013,-0.000219,-0.000581,0.000195,-0.000174,-1.7e-05,6.7e-05,-0.000652,-0.000495,-0.000487,-0.000438,9.9e-05,-0.000527,0.000784,-0.000581,-8.4e-05,-0.000274,0.000612,0.000417,-0.000524,8.1e-05,-0.000276,-0.000707,-7e-06,-0.00032,-0.000439,-0.000336,0.000481,-6.8e-05,-0.000135,-0.000223,0.000263,0.000121,0.000173,0.00038,-0.00079,-0.000484,-0.001153,0.000298,-0.000392,-0.000388,0.001647,-0.000754,-2.6e-05,5e-06,-9.2e-05,-0.000692,0.000579,-9.6e-05,-0.000137,-0.001007,6.5e-05,-0.000335,-7.3e-05,-0.000619,0.000412,-0.001652,0.000128,-0.000452,4.9e-05,0.000438,-0.000515,0.000422,0.000191,-0.000203,-0.000623,0.000165,0.000299,0.000626,0.000297,-0.000317,0.000332,0.000937,-0.000151,-0.001088,0.000401,-0.001102,0.000166,-0.000296,-7.3e-05,-0.000484,-0.000119,0.000967,-0.000412,-0.000197,-0.000375,-0.000163,0.000751,0.000556,-7.9e-05,-6.9e-05,-0.00081,-0.000106,4.3e-05,-0.000259,0.000107
0.000144,-1.5e-05,0.000256,-0.00033,0.000194,-0.00034,-7e-06,3e-06,-8e-06,-1e-04,-0.000228,-7.2e-05,-0.000111,-0.000436,0.000174,-0.000133,-0.000161,0.000106,0.000333,-0.00026,-0.000372,-0.000679,7.6e-05,-0.000333,9.5e-05,5e-06,-0.000615,0.000431,-4.7e-05,0.000143,0.000436,-0.000133,0.000488,0.000103,0.000125,-0.000247,0.000213,0.000102,0.000209,0.001007,-7.3e-05,-5.9e-05,-0.000142,-0.000241,0.000201,-0.000546,0.000962,-0.000275,0.00052,-0.000632,0.000446,3.2e-05,-0.00019,-0.000348,3.7e-05,0.000336,0.000592,0.000583,-5e-06,-1.4e-05,0.000859,-0.000223,6.9e-05,-0.000218,0.000727,0.000166,-0.000634,-0.000258,-0.000627,-0.001403,-0.000606,0.000186,-0.000117,-0.000364,-2.2e-05,0.001107,0.001206,-8.5e-05,0.000773,-7.3e-05,-0.00063,0.000944,0.000293,0.000367,-0.000153,0.00044,1e-06,0.000615,6.2e-05,5e-04,0.000312,0.000536,9.7e-05,-0.000768,-0.000426,-0.000496,-0.001098,-0.00034,0.000129,0.000479,-0.000449,0.000768,0.000149,0.000293,0.001121,0.000835,-0.000121,0.000496,-0.00065,0.000123,0.000837,-5.9e-05,-0.001137,0.000417,-0.000659,-0.000128,-0.000357,-0.000406,0.001031,0.000456,-0.000102
7.3e-05,-7.3e-05,-6e-05,-0.000494,8.9e-05,7.8e-05,-3.6e-05,8.2e-05,-0.000269,-0.000156,-0.000213,7.8e-05,-9.4e-05,0.000122,-0.00016,-6e-05,7.8e-05,0.000114,-0.000607,0.000112,-0.000142,0.000329,-0.000158,0.000472,-0.000368,0.000252,0.000208,-0.000142,-2.1e-05,0.000345,-0.000513,-0.000333,-0.000125,-0.000136,0.000388,0.00031,0.000258,0.000381,4.4e-05,3.7e-05,-0.000325,-0.000667,-7.6e-05,-2e-06,0.000373,-8.6e-05,-0.000692,-0.000112,4.8e-05,0.00036,-3.5e-05,0.000604,0.00059,-0.000104,-0.000474,-0.000598,-0.000281,0.000431,3.3e-05,1.8e-05,-0.000818,0.000463,-3e-06,0.000422,-0.000405,0.000265,0.000177,0.000207,0.000465,0.000607,-1.3e-05,0.000122,-0.000297,0.000376,-0.000581,-0.000218,-0.00059,0.000502,-0.000979,0.000686,0.00047,0.000865,-0.000362,3.8e-05,-6.6e-05,-0.000931,0.000157,-0.000357,-0.000262,0.000125,8.4e-05,-0.000542,0.000223,0.000122,-0.000109,0.000426,-0.000275,-0.000741,-0.000184,7e-05,0.000223,-0.000415,-0.000623,2.4e-05,0.000202,-0.000238,0.000485,0.000177,0.000378,-0.000311,-1e-04,0.000117,0.000717,-0.000263,0.001148,0.000685,-0.000831,4.6e-05,3.1e-05,-0.000237,-0.00034
5.6e-05,0.00012,0.000184,0.000408,-7.5e-05,0.000119,4.3e-05,-6.1e-05,-0.000424,3.4e-05,7.3e-05,2e-05,4.9e-05,-0.000281,8.2e-05,0.000137,-0.000146,6.8e-05,0.000259,-7.1e-05,0.000171,0.000157,9.3e-05,-0.000275,6.8e-05,-0.00034,0.000371,-6.5e-05,9.9e-05,0.000351,0.000344,-0.000186,-0.000219,0.000381,0.000457,0.000172,-0.000777,-1.7e-05,-0.00052,-4.7e-05,0.000542,-0.000227,-4.9e-05,-0.000185,0.000221,0.000534,0.000732,-0.000204,0.000195,0.000264,0.000321,5.7e-05,-0.000721,0.000262,-0.000255,0.000212,-0.00054,-0.000157,0.000192,-0.000765,0.001024,-0.000478,-6.6e-05,-0.000154,-3.4e-05,-0.000145,0.000257,-0.00018,0.000148,-0.000569,4e-06,3.4e-05,-0.000291,-0.000123,0.000424,-0.000211,0.000822,0.000218,0.00046,-0.000492,-0.000489,-0.000698,-0.000564,-0.000464,8.1e-05,0.00015,-0.000328,-0.000555,-2e-06,0.00011,0.000367,-0.000118,-0.000431,-0.000285,0.000263,4.4e-05,0.000562,0.000225,0.000465,-0.000212,-2.8e-05,0.000559,6.4e-05,-0.000232,-0.001292,-0.000353,-0.000233,-0.000587,-6e-06,0.000229,-0.000176,-0.000148,0.000176,-0.000204,3.5e-05,-0.000599,-0.000149,8e-06,0.000139,-0.000347,4.4e-05
-6.5e-05,-9.2e-05,0.000146,-2.8e-05,-0.000177,-1.3e-05,-3.4e-05,0.00018,-0.000188,1.4e-05,-0.00017,-4.3e-05,8e-05,0.00021,-9.6e-05,-0.000235,-4.3e-05,-2.9e-05,-9.7e-05,-0.000114,0.000189,-0.000419,-3.2e-05,0.000149,-0.000108,4.6e-05,-2.4e-05,-0.000263,3.9e-05,0.000101,-7.7e-05,6.7e-05,0.000326,-0.000521,0.000323,-0.000221,0.00025,-0.000525,-1.4e-05,0.000278,-0.000346,-0.000445,-3.9e-05,-7.8e-05,0,-3.8e-05,-0.000594,-0.000184,0.000179,0.000111,-0.000115,0.000231,0.001295,0.000146,-0.000293,0.000329,-0.000574,0.000233,9.2e-05,-4.7e-05,0.000268,0.000246,0.000342,-7.8e-05,5.8e-05,-0.000259,-0.00047,0.000539,-0.000394,0.000318,0.000539,-0.000276,0.000613,0.000178,-0.000424,0.000623,-0.000811,-8.1e-05,0.000128,-3e-05,0.000236,0.000455,9.3e-05,0.000577,6e-05,0.000668,0.000255,4.5e-05,-1.9e-05,0.000609,-0.000209,9.4e-05,-0.000233,-9.5e-05,6.1e-05,-0.000157,-9e-06,0.000219,-0.000216,0.00047,2e-04,-0.000525,-0.000325,0.00026,9.5e-05,0.000365,-9.5e-05,0.000488,-0.000147,-0.000104,0.000197,0.000233,-0.000843,-0.00026,-3.9e-05,0.000303,0.000145,-6.6e-05,0.00044,0.000324,1.8e-05
2.6e-05,3e-05,0.000212,-1e-04,0.000187,-2.1e-05,-7e-06,1.7e-05,-6.3e-05,-1.8e-05,-0.000274,-7e-06,-3.2e-05,-3.7e-05,-2.2e-05,0.000199,-7e-05,-0.000169,8.9e-05,0.000118,-5e-06,0.000325,-7e-06,-0.000304,-0.000119,0.000106,-0.000144,0.000265,4e-05,-0.000221,-0.000109,-8.9e-05,-1e-04,0.000384,0.000232,-0.000162,-0.000336,-0.000472,-0.000538,4.9e-05,6.1e-05,0.00024,-0.000288,7.3e-05,-5e-04,-0.000157,-0.000102,-0.000318,-6.3e-05,-0.000405,0.000198,-5.3e-05,-0.000751,-0.000225,-0.000164,-0.000259,-0.000137,0.000164,-0.000286,-0.000595,0.000169,4.4e-05,3e-04,0.00027,0.000147,0.000195,0.000728,2.4e-05,0.000247,4.2e-05,0.000132,0.000316,1.7e-05,-0.000184,0.000147,-0.000878,0.000198,-0.000169,-0.000683,0.000294,-0.000194,-0.000199,4e-06,-0.000402,6.3e-05,-0.000623,-0.000116,0.000125,-9.7e-05,0.00058,-0.000513,3.6e-05,0.000181,-9e-05,1e-06,-0.000147,0.000372,-0.000571,-0.000153,-0.000745,-0.000338,0.000244,0.000512,-2.9e-05,0.000782,0.000106,0.00024,-0.000145,-1.2e-05,-3e-05,-0.000631,-0.000149,6e-04,1e-06,0.00073,-0.000412,0.000499,-0.000354,-0.000109,-0.00042,-0.000158
-3.1e-05,2.5e-05,-7.8e-05,8e-05,-0.00011,0.000115,3.6e-05,-8.2e-05,1.5e-05,-5.3e-05,5.7e-05,-2.9e-05,-1.8e-05,0.000262,1.4e-05,-5.9e-05,-7.6e-05,-7.5e-05,-0.000232,-0.000164,1e-05,0.000224,-3e-06,0.000196,-6e-06,-0.000297,-3.4e-05,-2e-04,-0.000177,-0.00028,7.3e-05,4.1e-05,-7.2e-05,-0.00023,5.3e-05,0.000342,0.000604,0.000411,-0.000406,-0.00017,-5e-05,-0.000315,0.000205,-0.000116,0.000173,0.000446,0.000164,-0.000191,-2.7e-05,8.3e-05,-0.000203,-0.000398,0.000333,-0.000196,4.1e-05,-3.5e-05,0.000202,-1e-05,-2.9e-05,0.000511,0.000664,-0.000441,-0.000178,-0.000305,-4.7e-05,7e-05,-0.000957,-0.000289,5.3e-05,-6.2e-05,1.8e-05,-0.000263,-8.6e-05,9.4e-05,4.1e-05,0.000397,-0.00033,-0.00024,0.000427,-0.000261,0.000137,-0.000454,0.000468,0.000269,3.1e-05,7.7e-05,-0.000106,-0.000298,0.000103,-1.7e-05,9.5e-05,0.000125,3e-04,-0.000107,0.000254,-6.8e-05,-4.2e-05,-0.000344,0.000302,0.000763,0.000203,-0.000168,0.000222,-7.6e-05,-7e-06,-0.000202,-0.000221,4e-05,-9.4e-05,4.9e-05,0.000498,-7e-06,5.4e-05,0.000206,-3.6e-05,0.000556,0.000474,0.000205,2.2e-05,0.000117,0.000265
-2e-05,-4.8e-05,0.000149,1e-06,0.00017,-0.000119,1e-06,-1.9e-05,7e-06,-1.1e-05,5.6e-05,1.7e-05,-1e-05,1.1e-05,-7.8e-05,-8.8e-05,-6e-06,1.9e-05,0.000113,0.000139,-0.000183,-0.000199,4e-06,-6.5e-05,-0.000128,0.000233,-7.4e-05,1.2e-05,9.1e-05,-0.000171,3.7e-05,-7.8e-05,-0.000111,0.000146,-0.000184,1.5e-05,-0.000266,0.000402,-0.000346,-0.000359,0.000157,0.000285,-3.7e-05,0.000106,0.000137,-0.00013,-0.000117,-1.6e-05,-2.6e-05,-7.6e-05,6.8e-05,-5.9e-05,0.00011,5.9e-05,0.000205,-8.5e-05,-1e-05,-4.1e-05,-7.8e-05,-0.000135,-0.000321,0.000249,-0.000647,-2.6e-05,-0.000114,-5e-05,0.000941,1.6e-05,-0.000332,-0.000146,-0.000198,8.4e-05,-0.000446,-8e-06,5.6e-05,0.000161,0.000788,4.2e-05,-0.000368,8.5e-05,8.2e-05,0.00079,-0.000105,-1.3e-05,-3e-06,0.000334,0.000189,-0.000404,-8e-06,-0.000375,-0.000111,6.9e-05,-0.000133,-7.2e-05,-5.5e-05,9.1e-05,-0.000446,0.00038,-0.000443,-0.000159,-3.7e-05,-9.9e-05,5e-05,8.6e-05,-0.000425,-0.000278,-2.4e-05,-2e-04,2.6e-05,8e-06,-0.00014,8.2e-05,-0.00065,0.000177,0.000197,-0.000334,0.000144,-0.000273,-0.000133,0.000198,-8.6e-05
2.6e-05,3.9e-05,-5.1e-05,0.000112,-0.000198,-1.6e-05,-1.8e-05,4.5e-05,0.000147,4.4e-05,-0.000105,3.7e-05,-4.3e-05,0.000119,0.000101,0.000161,-1.5e-05,-0.000125,-0.00021,-0.000154,-0.000183,0.000186,-2.4e-05,7.5e-05,-1.1e-05,1.3e-05,-6.7e-05,-9.5e-05,9.7e-05,4.6e-05,-0.000215,3.3e-05,0.000295,-0.000159,-0.000348,-0.000248,1.4e-05,-0.000449,-0.000529,0.000147,-0.000119,-0.000363,-7.3e-05,-3e-05,0.000406,-0.000503,0.000188,-0.000163,-0.000221,0.000308,-0.000146,-0.000119,-8.4e-05,0.000155,0.000157,7.3e-05,-0.000331,4.5e-05,2.4e-05,0.000557,0.000634,-7.2e-05,-6e-06,3.6e-05,2.2e-05,-9.2e-05,-0.000615,-0.000108,0.00028,-0.000564,0.000196,-0.000146,-2.4e-05,-0.000138,0.00031,-0.000588,-0.000301,-0.000218,0.000536,6.3e-05,-5.2e-05,-3.1e-05,6.4e-05,-0.000271,1.5e-05,-0.000292,-0.000206,6.3e-05,-1.3e-05,0.000222,1.7e-05,-0.000128,-0.000217,-8.4e-05,-0.000134,8.7e-05,2.2e-05,0.000344,0.000323,3.5e-05,9.1e-05,0.000372,-3.7e-05,-6e-05,-0.000119,0.000601,0.000152,0.000338,8.1e-05,4.6e-05,7.3e-05,-7.1e-05,0.00062,-6e-06,0.000312,0.000183,0.000107,-0.000122,1.7e-05,-0.000327,-6.6e-05
7.4e-05,-8e-06,1e-05,-0.000202,-2.5e-05,3.2e-05,1.8e-05,-2.6e-05,0.00019,-3e-05,8.4e-05,-1.8e-05,-1.6e-05,-0.000101,-0.000151,-0.000125,-6.4e-05,-9.1e-05,8e-05,7.2e-05,-3e-06,-0.000288,2.8e-05,1.7e-05,-8.1e-05,-0.000185,0.000238,0.000138,-3.2e-05,0.000125,0.000346,9e-06,-0.000311,0.000161,-0.000366,1.2e-05,-0.000153,-0.000388,-7.8e-05,0.00013,-3.8e-05,3.7e-05,0.000207,1.9e-05,-0.000148,6.5e-05,0.000174,-0.000114,-4.3e-05,-4.9e-05,6.1e-05,-5.7e-05,-8.1e-05,-2.3e-05,0.000184,0.000164,-0.000251,-9.4e-05,-0.000167,-0.000122,-0.000472,-0.000126,0.000777,-6e-05,0.000248,2.6e-05,0.000247,5e-06,3.9e-05,0.000219,-7e-06,0.000313,0.000166,0.000129,-0.000419,0.000727,0.00048,0.000169,-0.000368,-0.000104,7.7e-05,-0.000347,-0.000423,0.000547,3.1e-05,-2.3e-05,7.4e-05,0.000309,2.4e-05,0.000195,-3.7e-05,-0.000136,-1.6e-05,0.000184,0.000108,-0.000193,-4.7e-05,-0.000239,3.9e-05,-0.000103,-0.000169,-0.000612,-0.000301,5.1e-05,0.000431,-0.000386,-0.000129,-0.000128,-8.9e-05,8.9e-05,0.000227,4.5e-05,-0.00016,-0.000127,-0.000196,-0.000204,-0.00012,-2.3e-05,-0.000209,0.000209,0.000111
2e-06,-1.6e-05,-1.4e-05,0.000179,0.000205,-6e-05,8e-06,0.000155,0.00014,-2.9e-05,0.000182,-8e-06,3.1e-05,2.2e-05,0.000114,7.1e-05,-2.1e-05,4.3e-05,9e-06,-4.5e-05,6.6e-05,-0.000345,-3e-05,-4.9e-05,-8.1e-05,0.00028,7.2e-05,-0.000193,-0.000131,7.7e-05,-0.000338,-0.000204,0.00024,-0.000133,-0.000195,0.000239,3.9e-05,9.2e-05,5e-05,-0.000162,0.000103,-0.000422,-2e-05,0.000129,-1e-04,3.4e-05,-0.000252,-8.1e-05,-0.000145,-0.00032,-0.000133,0.00016,-0.000191,-0.000138,0.000176,-0.000137,-0.000169,-5.3e-05,5.2e-05,0.000164,0.000207,0.000237,-0.000304,0.00012,-0.000253,-3e-05,1.7e-05,0.000291,-0.000207,-0.000517,-5.5e-05,-0.000258,0,3e-06,0.000186,-0.000157,-0.000479,1.2e-05,3.1e-05,5.4e-05,-0.000185,0.000259,5.8e-05,-0.000567,3.9e-05,0.000152,6.2e-05,-2.9e-05,-5.7e-05,-0.000364,-0.000394,2.6e-05,0.000124,-0.000221,-0.000114,-4.3e-05,0.000311,-0.000279,-0.000292,-7.5e-05,8.8e-05,0.000556,8.5e-05,1e-06,0.000119,1e-05,6.8e-05,-0.000133,0,-2.5e-05,-0.000409,-3.9e-05,-0.000342,-0.000179,-4.1e-05,-2.8e-05,-0.000101,-5.8e-05,0.00051,-9.2e-05,-0.000189
-1e-05,2.3e-05,3.4e-05,-9e-06,-0.000192,8e-06,-3e-05,-9.2e-05,4.9e-05,1.3e-05,-3.8e-05,5e-06,2.7e-05,-0.000153,-0.000111,3e-06,-2.1e-05,2.5e-05,9e-06,-5.4e-05,0.000142,0.000369,3e-06,2.8e-05,5e-06,-0.000169,-0.000226,0.000115,7.5e-05,4.4e-05,0.000221,-2e-05,-0.000115,0.000154,4e-06,-0.000118,0.000218,5.8e-05,0.000224,0.000185,-7.7e-05,-8e-05,-0.000155,-3.6e-05,-0.000111,-0.000314,5.6e-05,1.4e-05,-6e-05,5e-06,0.000137,4e-05,0.000198,-4.1e-05,0.000104,2.5e-05,8.7e-05,-1.8e-05,-0.000131,-0.000218,-0.000128,-0.000169,0.000108,3.9e-05,0.000141,9.9e-05,-0.000237,-0.000151,5.8e-05,0.00028,-0.000357,3.8e-05,-0.000267,-2e-06,-0.000199,-0.000171,0.000148,0.000258,0.000232,-2.7e-05,0.000121,-0.000632,2.2e-05,0.000252,-2e-06,1.5e-05,-0.00024,-0.000168,3.2e-05,-0.00042,1.3e-05,-8.5e-05,1e-04,0.000298,-0.000127,0.00012,0.000164,0.000286,0.000326,0.000165,2.9e-05,-0.000492,-3.9e-05,-6.7e-05,-0.000361,3e-05,4.1e-05,-0.000294,-1.8e-05,7.4e-05,0.000263,2.4e-05,0.000568,4.6e-05,0.000122,0.000151,-0.000112,-0.000102,-6.8e-05,-0.000114,4.1e-05
-2.3e-05,-1e-05,-0.00014,-0.000161,0.000164,8.1e-05,2.8e-05,6e-06,1e-05,-2e-06,1e-05,-5e-06,-2.5e-05,-6e-06,9.6e-05,-9.3e-05,-2.4e-05,1.4e-05,-0.000116,6.2e-05,5.7e-05,4.7e-05,8e-06,-8.7e-05,-0.000115,-8e-05,-1.2e-05,-4.1e-05,2.8e-05,7e-06,-6.2e-05,1.6e-05,-5.2e-05,-0.000167,1e-04,-0.000176,-0.000159,-5.7e-05,0.000355,0.000236,5.3e-05,-0.000222,0.000126,4.8e-05,0.000157,-4.5e-05,-5e-05,3.3e-05,-3e-06,0.000333,2e-06,0.000109,-0.00045,0.000111,1.1e-05,-1.4e-05,-8e-05,-0.000124,0.000166,-0.000211,-0.000399,-2.4e-05,-0.000223,-5.5e-05,-0.000128,-2.9e-05,0.000416,-6.1e-05,8.8e-05,-0.000165,-0.000129,-1e-05,-0.000204,-7.8e-05,4.1e-05,0.000437,-0.000485,-0.000133,-0.000422,5.5e-05,-0.000127,0.000331,0.000224,7.2e-05,-1.9e-05,-0.000103,0.000255,0.000121,2.2e-05,-6.4e-05,-8e-06,0.000196,-1e-05,-0.000164,0.00011,-1.9e-05,-0.000321,8.3e-05,-0.000173,-0.000169,-1.5e-05,0.000431,4.8e-05,8.2e-05,-9.9e-05,0.00011,-9.9e-05,0.000301,1e-05,8e-06,-0.000219,-1.7e-05,-0.000301,9.1e-05,-0.000349,-0.000149,-0.000188,-0.000134,0.000385,9.1e-05,3.8e-05
5e-06,-7e-06,7e-06,-2.6e-05,-0.000198,-2.4e-05,-1.2e-05,-2.5e-05,-1.7e-05,-3e-06,0.000101,9e-06,-1.5e-05,-5.9e-05,-9.3e-05,0.000113,-1.7e-05,1.1e-05,4.3e-05,-9.7e-05,-6e-06,1e-06,1e-06,6.8e-05,0,0.000228,8.9e-05,5.1e-05,-1.4e-05,2.3e-05,-6.2e-05,-4.6e-05,4.5e-05,0.000103,0.000137,8.6e-05,6.4e-05,-9.8e-05,0.000318,-3.7e-05,-7.5e-05,6.8e-05,-6.2e-05,-3.3e-05,0.000231,0.000269,-0.000133,2.9e-05,1.5e-05,-5.1e-05,9.6e-05,0.000163,0.000176,5.6e-05,-8.1e-05,-7.1e-05,-0.000306,-0.000167,-4.2e-05,-0.000134,0.000183,0.000194,-1.1e-05,8.9e-05,0.000141,-4.8e-05,-0.000683,1.3e-05,-7.4e-05,7.4e-05,3e-05,2.5e-05,2e-05,6.4e-05,0.000113,-0.000455,0.000454,-0.000122,0.000217,-9e-05,0.000131,0.000343,4.9e-05,-0.000181,-1.9e-05,-0.000105,-0.000199,0.000293,-2e-05,-2.8e-05,-4.9e-05,8.3e-05,-7.1e-05,0.000168,-4e-06,1.1e-05,-8.7e-05,-0.000389,-8.8e-05,0.000206,-4e-05,-0.000275,5.7e-05,-1e-05,0.000336,-9.1e-05,7.4e-05,0.000206,1.1e-05,4.6e-05,5.1e-05,-2.1e-05,-0.000159,4.6e-05,-0.000104,0.000129,-7.7e-05,9.2e-05,-0.000161,-5.1e-05,-0.000115
-2.1e-05,1.7e-05,-9.8e-05,-2e-05,0.000112,-7e-06,-1.8e-05,0,-0.000102,-1.8e-05,-5.2e-05,5e-06,2.5e-05,4e-06,5.1e-05,-6.9e-05,-3.7e-05,3.1e-05,-6.2e-05,7.5e-05,-5.2e-05,0.000245,-6e-06,-2.1e-05,-6e-05,-0.000259,-4.3e-05,-0.000124,-7.5e-05,1.1e-05,8.5e-05,-1e-06,7.9e-05,-2e-05,0.000121,0.00019,-0.000231,-0.000121,0.000156,-9.1e-05,8.3e-05,-9.4e-05,-0.000158,-1.9e-05,5e-05,-0.000159,0.000255,2e-06,4e-06,-0.000243,-2.2e-05,-3.6e-05,-0.000284,-7e-05,-0.000171,1.5e-05,-0.00017,-3.6e-05,0.000118,-0.000113,-0.000621,-0.000195,-0.000181,2.1e-05,-3.3e-05,-3.1e-05,0.00067,-0.000119,-3e-05,-0.000188,0.000227,3.9e-05,0.000155,-4.4e-05,-0.000159,0.000149,-0.000179,-0.00016,-0.000339,5.1e-05,-0.000106,-0.000371,-0.000109,0.000197,-6e-06,0.000266,5.5e-05,1e-05,4e-05,-0.000189,8.6e-05,-0.000106,-0.000111,2.4e-05,-8.1e-05,-6e-05,-1.4e-05,-6.6e-05,0.000303,-0.000365,1.4e-05,2e-04,-0.000101,-5.5e-05,0.000128,-9.1e-05,2e-06,3.5e-05,4.3e-05,1.5e-05,0.000235,4.9e-05,0.000546,2.6e-05,2.1e-05,-0.000214,-8.3e-05,-0.000195,0.000276,1e-05,0.000131
1.3e-05,-1.5e-05,-5.5e-05,0.000247,5.1e-05,-8e-06,3.1e-05,5.9e-05,-0.000145,-1e-06,-1e-04,-9e-06,-1.1e-05,5.2e-05,-3.5e-05,-2e-06,-1.2e-05,7.3e-05,1.2e-05,-9.9e-05,-6.8e-05,-0.000309,-2e-06,5.7e-05,-5.4e-05,9.5e-05,9e-06,0.000112,3.5e-05,-3.1e-05,-3.1e-05,-2.1e-05,-0.000153,1.5e-05,8.5e-05,-0.000169,0.000185,-0.000105,0.000236,-2.7e-05,-6.2e-05,-3.1e-05,0.00019,1.5e-05,-8.4e-05,-8.6e-05,-0.00011,3.8e-05,6.5e-05,0.000106,4.7e-05,-5.1e-05,0.000281,-7.4e-05,-0.000112,7.6e-05,1e-06,-2.8e-05,-7.1e-05,0.00018,0.000286,7.9e-05,0.000205,-0.000117,-6.1e-05,5.3e-05,-0.000581,0.00018,7.9e-05,-9.7e-05,7.5e-05,-3.8e-05,5.7e-05,5.2e-05,0.000215,9.1e-05,0.000391,2.7e-05,0.000346,5.7e-05,7.3e-05,2e-05,-0.000147,-0.000274,0,-7.3e-05,5.1e-05,-0.000182,2.4e-05,-9.4e-05,-0.000167,-0.000105,5e-05,-3.4e-05,0.000156,-2.4e-05,0.000133,0.000312,-0.000274,0.000369,4.4e-05,-0.00016,4.2e-05,4.6e-05,-0.000344,0.000173,-3.6e-05,-8.8e-05,-0.000133,-2.7e-05,-0.000284,-2.9e-05,-0.000431,-8.4e-05,-0.000267,0.00014,9.3e-05,-4.9e-05,-0.000329,-1e-06,-3e-05
6e-06,7e-06,-3.3e-05,-7.5e-05,-0.000105,-1.3e-05,-1.6e-05,2.5e-05,-0.00011,1.1e-05,4.7e-05,-3e-06,-9e-06,2.1e-05,0,5.6e-05,-1.3e-05,1.1e-05,2.6e-05,4.9e-05,-7e-06,-9.3e-05,-4e-06,-5.2e-05,-1.9e-05,0.000131,9.9e-05,-4.3e-05,5.2e-05,-5.1e-05,-4.7e-05,-7e-06,5.1e-05,-8e-05,4.4e-05,-8.6e-05,-1e-06,-4.3e-05,0.000139,3.7e-05,4.3e-05,-0.00021,-5.5e-05,-6.3e-05,-0.000165,0.000265,8.8e-05,9.4e-05,-9e-06,-1.3e-05,-7.7e-05,-0.000109,-0.000349,3.9e-05,-0.000115,2e-05,6.9e-05,-0.000203,0.000147,5.7e-05,-0.000383,6.6e-05,0.000445,2.6e-05,7.5e-05,3.6e-05,0.000276,7e-05,-3.5e-05,-7e-05,3.4e-05,-7e-06,-0.000243,-2e-05,-0.000165,-0.000311,-0.000317,4.7e-05,-0.000238,-0.00012,-1.6e-05,9e-05,-0.000127,0.000389,-5e-06,-0.000215,-0.000145,1.7e-05,-1.7e-05,-3.3e-05,-9.8e-05,2e-06,0.000119,0.000169,-3.8e-05,7.3e-05,0.000159,0.000122,5.9e-05,-9.1e-05,-4.2e-05,0.000137,-9.3e-05,-2e-06,-7.6e-05,-7.3e-05,3.4e-05,1.1e-05,-7e-06,-2e-06,0.000316,2e-06,1.4e-05,-0.000101,5.6e-05,-8.2e-05,0.000105,-1.6e-05,0.000272,1.3e-05,-6.6e-05
1e-06,3e-06,5.3e-05,-1.1e-05,6.2e-05,-2e-06,3e-06,-1.6e-05,-4e-05,-2e-05,-3.2e-05,2e-06,1.3e-05,7.6e-05,2.1e-05,-7e-05,-1.8e-05,-2.7e-05,-2.3e-05,-3.6e-05,5.4e-05,0.000214,1.4e-05,5.7e-05,-6.8e-05,-0.000252,-5.5e-05,4.1e-05,-3.4e-05,-5.9e-05,9e-05,-2.6e-05,0.000132,0.000112,-2.2e-05,0.00016,6.1e-05,7.7e-05,2.2e-05,-0.000205,-2.7e-05,-1.6e-05,-5.8e-05,2.6e-05,7.8e-05,-7.9e-05,-6.2e-05,8e-06,3.1e-05,0.000103,3.4e-05,-0.000182,0.000203,6.8e-05,-7.5e-05,-0.000118,-6.3e-05,-0.00013,-9.3e-05,0.000231,0.000132,-0.000171,-0.000309,-1.2e-05,-6.4e-05,-9e-06,-7.6e-05,-0.000104,-7.8e-05,-0.000218,-1.8e-05,-7.3e-05,-6.4e-05,2.6e-05,0.000115,0.000388,0.000177,4.2e-05,8.8e-05,7.4e-05,5e-06,-0.000467,0.000145,-0.000338,-1e-06,0.000197,0.000158,0.000181,4.2e-05,-8.5e-05,5.3e-05,2.1e-05,4.4e-05,-0.000132,-3.9e-05,1.3e-05,-0.000135,-0.000194,0.00012,-0.000105,4e-06,-2.1e-05,8.6e-05,-2.2e-05,0.000285,-2.6e-05,-2.9e-05,-7e-06,0.000167,-1.8e-05,-0.000282,1.4e-05,0.000411,4e-05,-1.5e-05,8.5e-05,0.000114,-8.8e-05,-0.000382,-6.5e-05,9.5e-05
-1.8e-05,-7e-06,-3.9e-05,-5.9e-05,-6.7e-05,1.1e-05,1.3e-05,-3.6e-05,-1e-06,0,-8.5e-05,2e-06,5e-06,-1.6e-05,-5e-05,5.5e-05,-1.3e-05,1.8e-05,-4.1e-05,-3.3e-05,5.8e-05,-0.000228,-4e-06,-0.000109,-2e-05,0.000221,-0.000121,-7.5e-05,-2.9e-05,-1.6e-05,-6.1e-05,-5.9e-05,-0.000221,-7.6e-05,-6.8e-05,9e-05,-6.5e-05,-3e-05,-3.6e-05,-8.6e-05,-4e-06,-0.000237,0.000161,-3.1e-05,0.00016,-0.000218,-4.1e-05,7.5e-05,3e-06,5.3e-05,-5.8e-05,-1.3e-05,0.000158,-3e-05,-4e-06,7.1e-05,-0.000321,-2.8e-05,0.000104,-1.9e-05,0.000101,0.000155,-0.000329,-3.2e-05,8.9e-05,-5.7e-05,-0.000174,-9e-06,0.000136,9.8e-05,6.5e-05,0.000145,4.5e-05,-2.9e-05,-3.8e-05,-0.000225,-0.000459,9.1e-05,0.000101,3.1e-05,3.2e-05,0.000621,7.7e-05,5.8e-05,-6e-06,1.5e-05,-0.000117,-3.9e-05,-2.3e-05,7.5e-05,-6.2e-05,7.1e-05,-0.000128,0.000112,0.000108,-5.2e-05,1.8e-05,-6.2e-05,-0.00019,0.000112,-2.2e-05,-8.3e-05,6.9e-05,1.3e-05,3e-05,-8e-06,-1.3e-05,-7.1e-05,-0.000141,-1.7e-05,4.2e-05,1.3e-05,-0.000473,6.2e-05,-7.6e-05,-5.3e-05,5.9e-05,-0.000111,0.000233,-2e-06,-0.000102
0,5e-06,8.8e-05,-8.8e-05,7e-05,-5e-06,-1.4e-05,1e-05,3.7e-05,7e-06,6e-05,3e-06,-2.2e-05,3.6e-05,5.6e-05,-9e-06,-2e-05,-9e-06,-1.3e-05,4.2e-05,2.3e-05,9.1e-05,-1.1e-05,0.000109,-4.9e-05,-3.4e-05,8.6e-05,7.9e-05,4.8e-05,2.3e-05,-2e-05,-1e-05,0.000147,3.8e-05,-6.9e-05,-0.00021,-0.000116,-0.000269,-0.000214,0.000146,2.8e-05,2.3e-05,-5.4e-05,-4e-06,0.000179,0.000139,-3.9e-05,4.4e-05,-1e-06,-0.000224,2.8e-05,2.8e-05,-0.000278,-6.6e-05,5.2e-05,2e-06,-0.000268,-0.00012,-0.000127,6.3e-05,-0.000143,-4.1e-05,0.00015,3.7e-05,-0.000131,5e-06,0.000365,-5.8e-05,-5.8e-05,-0.000194,1.9e-05,-1e-04,0.000226,-9e-06,-0.000128,-1.4e-05,0.000254,2.8e-05,-0.000175,-8.2e-05,-0.000114,-6.6e-05,0.000148,0.00021,-1.4e-05,-0.000114,-1e-06,-0.000216,-8e-06,0.000268,2.3e-05,0.000104,-8e-05,-1.8e-05,-6.7e-05,-3e-05,-0.000152,0.000265,8.9e-05,-9.2e-05,6.6e-05,0.000155,4.8e-05,9e-06,-0.000225,8.4e-05,3.5e-05,-8.2e-05,-4.7e-05,-3e-06,9.8e-05,-1.4e-05,0.000121,3.2e-05,0.000156,-4.9e-05,-4e-05,-3.2e-05,-0.000268,9e-06,-1e-06
-5e-06,-1e-06,2e-05,0.000125,1.2e-05,0,2e-06,-2.8e-05,8.6e-05,-7e-06,4.7e-05,-1e-06,-9e-06,-7.7e-05,-7.1e-05,-4.6e-05,-2.1e-05,-3.6e-05,1.1e-05,-8.1e-05,-3.3e-05,0.00017,1.2e-05,-0.000123,-4.7e-05,-0.000181,5.5e-05,-4.6e-05,-1.2e-05,3.7e-05,0.000108,-1.3e-05,-6.7e-05,-3.1e-05,-4.3e-05,-1.3e-05,0.000102,-8.4e-05,-0.000245,3.7e-05,-2.1e-05,-0.000229,-0.00013,5.1e-05,-6.5e-05,4e-05,6e-05,2.3e-05,1.5e-05,-4.7e-05,-4.4e-05,6.3e-05,0.000458,7e-06,9.4e-05,-8.4e-05,2.9e-05,-0.000132,6.1e-05,-0.000189,0.000503,-0.000111,1.7e-05,1.6e-05,5.8e-05,4.8e-05,-6e-04,-3.4e-05,-7.5e-05,8.6e-05,-7.5e-05,9.1e-05,-0.000107,-1.1e-05,0.000152,0.000281,-0.000205,-5.6e-05,9.6e-05,4.6e-05,0.00011,-0.000185,-0.000147,-0.000331,2e-06,5.2e-05,8.4e-05,-2.9e-05,-7e-06,0.000154,-2.9e-05,-7.8e-05,2.5e-05,-4e-06,-7.1e-05,1e-05,-6.6e-05,-2.4e-05,0.000101,0.000182,-5.6e-05,-0.000266,-3.4e-05,-2e-06,-1e-05,-9.3e-05,-7e-06,3.3e-05,6.8e-05,-3e-05,-0.000224,-2.8e-05,0.000276,-2e-05,8.2e-05,8.5e-05,-2.8e-05,-9e-06,0.000413,-4.7e-05,8.3e-05
