-0.001695,-0.000931,-0.000955,-0.00106,-0.001139,-0.000934,-0.000693,-0.000829,-0.000932,-0.000705,-0.000626,-0.001032,-0.000965,-0.000424,-0.000463,-0.000549,-0.000414,-0.00033,-0.000214,-0.000238,-0.000171,-0.000246,-0.000338,-0.000313,-0.000262,-0.00026,-0.000232,-9.6e-05
-0.001253,-0.000811,-0.000945,-0.000882,-0.000911,-0.000799,-0.000606,-0.000604,-0.000787,-0.000616,-0.000573,-0.000838,-0.000786,-0.000318,-0.000393,-0.000573,-0.00038,-0.000261,-0.000237,-0.000217,-0.000132,-0.000219,-0.000292,-0.000243,-0.000223,-0.000257,-0.000235,-0.000119
0.000587,5.2e-05,9.9e-05,0.000383,0.000452,0.000287,0.000195,0.000279,0.000269,0.000162,7.5e-05,0.000341,0.000318,9.9e-05,0.000103,1.9e-05,4.6e-05,1e-04,-6e-06,4.5e-05,3.4e-05,6.2e-05,0.000133,0.000121,6.3e-05,2.2e-05,3e-05,-2.2e-05
0.001272,0.000706,0.000779,0.000871,0.00097,0.000725,0.000512,0.000589,0.000769,0.00055,0.000418,0.000861,0.000802,0.00026,0.000317,0.000423,0.000294,0.000257,0.000137,0.000137,7.3e-05,0.000173,0.000282,0.000265,2e-04,0.000183,0.000194,7.3e-05
0.000324,0.000569,0.000498,0.00021,0.000175,0.000187,0.000206,0.000224,0.000304,0.000269,0.000346,0.000306,0.000198,0.000127,0.000163,0.000255,0.000143,7.1e-05,9.9e-05,9.2e-05,8.6e-05,5.2e-05,5.5e-05,6.2e-05,9.6e-05,0.000127,9.4e-05,7.2e-05
-0.001075,-0.000356,-0.000326,-0.000655,-0.000752,-0.000504,-0.000308,-0.000406,-0.000512,-0.000279,-0.00014,-0.000658,-0.000603,-0.000151,-0.000198,-0.000151,-0.000165,-0.000223,-3.8e-05,-7.1e-05,-4.8e-05,-0.000106,-0.00022,-0.00024,-0.000149,-8.9e-05,-0.000117,-1.4e-05
-0.000773,-0.000703,-0.000559,-0.000526,-0.000596,-0.00031,-0.000325,-0.000469,-0.000555,-0.000446,-0.000405,-0.000612,-0.000502,-0.000201,-0.000215,-0.000242,-0.00015,-0.000154,-8.2e-05,-8.8e-05,-8.7e-05,-8.5e-05,-0.00015,-0.00018,-0.000147,-0.000117,-0.000115,-6.2e-05
0.000952,6.2e-05,3.3e-05,0.000464,0.00055,0.000465,0.000223,0.000244,0.00027,9.3e-05,-1.1e-05,0.000394,0.000469,0.00015,0.000144,0.000104,0.000167,0.000195,3.2e-05,6.5e-05,5.6e-05,7.9e-05,0.000145,0.00017,0.000107,6.9e-05,8.6e-05,-6e-06
0.00093,0.000471,0.000323,0.000616,0.000686,0.000253,0.000286,0.000469,0.000545,0.000377,0.000208,0.000546,0.000594,0.000188,0.000162,0.000118,0.000123,0.000172,4e-05,3.8e-05,3.1e-05,7.2e-05,0.000173,0.000226,0.000136,8.5e-05,0.00011,1.6e-05
-0.000606,0.000152,3.7e-05,-0.000246,-0.000264,-0.00046,-0.000181,-6.4e-05,-4.3e-05,2.3e-05,4.2e-05,-0.000119,-0.000265,-0.000129,-0.000112,-0.00014,-0.000171,-0.000121,-5.5e-05,-8.1e-05,-6.2e-05,-8e-05,-8.1e-05,-6.9e-05,-6.6e-05,-8.3e-05,-6.6e-05,-2e-06
-0.001141,-0.000233,-0.000213,-0.000691,-0.000751,-0.000438,-0.000333,-0.000441,-0.000507,-0.00029,-0.00014,-0.000455,-0.000641,-0.000232,-2e-04,-0.00018,-0.000198,-0.000187,-6.9e-05,-7.3e-05,-4.3e-05,-1e-04,-0.000202,-0.000233,-0.00014,-0.000131,-0.000152,-1.1e-05
2.9e-05,-0.000237,2.2e-05,3e-05,-1.1e-05,0.000339,0.000105,-8.7e-05,-0.000147,-0.000101,-1e-06,-4.5e-05,-5.5e-05,1.8e-05,6e-05,0.000101,7.7e-05,1.6e-05,3.9e-05,9.1e-05,6.9e-05,6.8e-05,1.7e-05,-4.4e-05,1e-05,4e-05,-3e-06,9e-06
0.001119,9.3e-05,0.000218,0.000605,0.000713,0.000668,0.000352,0.000364,0.000461,0.000243,0.000168,0.000367,0.000582,0.00026,0.000232,0.000311,0.000287,0.00018,9e-05,0.000103,5.5e-05,0.000147,0.000202,0.000203,0.000128,0.000164,0.000173,3.5e-05
0.000683,0.000297,4.7e-05,0.000271,0.000299,4.1e-05,9.8e-05,0.000255,0.000302,0.000135,0.00011,0.000251,0.000355,0.000136,0.000102,1e-04,0.000116,0.00011,4.3e-05,2.5e-05,3.4e-05,1.5e-05,9.7e-05,0.000175,9.7e-05,9.8e-05,0.000135,3.2e-05
-0.000829,-6.7e-05,-0.000263,-0.000394,-0.000499,-0.000697,-0.00032,-0.000297,-0.00037,-0.000175,-0.000234,-0.000375,-0.000367,-0.000177,-0.000207,-0.000257,-0.000236,-0.000147,-4.9e-05,-0.00013,-0.00011,-0.000164,-0.000176,-0.000137,-1e-04,-0.000129,-0.000105,-2.5e-05
-0.000968,-0.000226,-0.000104,-0.000373,-0.000449,-0.000362,-0.000205,-0.000294,-0.000382,-0.000132,-0.000119,-0.00025,-0.000429,-0.000163,-0.000157,-0.000246,-0.000223,-0.000149,-3e-05,-4.7e-05,-5.3e-05,-5.9e-05,-0.00013,-0.000213,-0.000134,-0.000163,-0.000195,-5.2e-05
0.00028,-1.3e-05,0.000126,5.5e-05,0.000167,0.000415,0.00014,0.000115,0.000148,5.9e-05,8e-05,0.000258,7.9e-05,-2.9e-05,5.8e-05,4.1e-05,4.2e-05,7.1e-05,-7e-06,4.8e-05,4.7e-05,9.3e-05,7.3e-05,-2e-06,1.2e-05,-4e-06,-3.6e-05,-1.7e-05
0.000925,0.000186,0.000197,0.000412,0.000495,0.000505,0.000261,0.000332,0.000471,0.000174,0.000174,0.000328,0.000432,0.000148,0.000148,0.000199,0.000182,0.000151,-5e-06,6e-05,9e-05,0.000101,0.000158,2e-04,0.000131,0.000143,0.000146,2.2e-05
7.1e-05,5.4e-05,-3.3e-05,5e-05,2.2e-05,-0.00018,-6.9e-05,0,6.1e-05,-3.3e-05,-5e-05,-0.000248,2.6e-05,7.1e-05,-1.7e-05,4.4e-05,4.1e-05,-4.2e-05,-5.3e-05,-7.1e-05,-5.1e-05,-6.3e-05,-3e-05,8.5e-05,2.4e-05,7e-05,0.000111,1.9e-05
