1.58278,1.288687,1.221489,1.345657,1.480817,1.489532,1.342746,1.170716,1.134111,1.247553,1.337453,1.350395,1.320562,1.218265,1.159355,1.322221,1.375393,1.331744,1.632058,1.873936,1.687434,1.46785,1.601552,1.766093,1.643737,1.476729,1.494998,1.446754
1.860762,1.507587,1.47078,1.615625,1.742084,1.771085,1.639864,1.421769,1.38035,1.503139,1.563421,1.553057,1.545976,1.461257,1.391068,1.592942,1.662244,1.612575,1.928743,2.144518,1.927289,1.71573,1.861038,2.008891,1.874322,1.705076,1.694333,1.614976
2.279258,1.862945,1.890961,2.05386,2.155625,2.256349,2.180792,1.863145,1.803198,1.929501,1.914185,1.834554,1.873675,1.854593,1.797413,2.074749,2.167323,2.106716,2.393819,2.516895,2.289399,2.140424,2.283691,2.354111,2.202597,2.03422,1.926482,1.800005
2.467169,2.077959,2.163633,2.31672,2.416859,2.627951,2.604437,2.176808,2.088837,2.215727,2.13997,1.984614,2.048687,2.105964,2.117774,2.443068,2.518415,2.451819,2.629701,2.639244,2.517368,2.484565,2.572449,2.500377,2.322187,2.156816,1.903825,1.763162
2.312347,2.010185,2.087295,2.252266,2.412325,2.666058,2.60347,2.14255,2.06931,2.191604,2.095239,1.931919,1.976851,2.049152,2.16962,2.470819,2.480151,2.399157,2.443767,2.417777,2.483609,2.556249,2.582295,2.411805,2.178997,1.998761,1.684188,1.572699
1.836055,1.637007,1.679178,1.842664,2.042749,2.238785,2.104204,1.75959,1.769714,1.876898,1.740804,1.611595,1.654143,1.697007,1.858002,2.042978,1.984539,1.891034,1.872378,1.912828,2.086338,2.174644,2.181321,2.018413,1.774639,1.625597,1.385575,1.288822
1.338902,1.286104,1.361056,1.442528,1.518583,1.576037,1.496814,1.378465,1.448983,1.544119,1.427398,1.353788,1.400279,1.424518,1.494857,1.491483,1.434562,1.408754,1.378696,1.455497,1.608712,1.608859,1.564461,1.462487,1.319634,1.239422,1.15077,1.103658
1.345738,1.438581,1.568385,1.549421,1.501988,1.458448,1.483115,1.475176,1.512317,1.644188,1.647925,1.569299,1.559415,1.599632,1.520983,1.388151,1.475461,1.542247,1.405659,1.52467,1.665144,1.55164,1.437404,1.330396,1.367976,1.379251,1.290766,1.216645
1.807573,1.960032,2.16445,2.103214,1.943355,1.840473,1.926898,1.942066,2.003059,2.162622,2.212828,2.087028,1.996593,2.107788,2.019278,1.854222,2.058266,2.130752,1.819344,2.005343,2.214517,2.045814,1.867725,1.660574,1.802319,1.880478,1.734968,1.575461
2.353696,2.446501,2.708283,2.640007,2.328604,2.152059,2.291479,2.381991,2.579068,2.759178,2.774356,2.616237,2.462696,2.575924,2.478564,2.347123,2.647554,2.677946,2.255014,2.512368,2.785156,2.56747,2.325376,2.120608,2.298647,2.336205,2.225629,1.99641
2.689487,2.634897,2.874175,2.821372,2.404518,2.182994,2.359411,2.568521,2.883813,2.996859,2.969211,2.891221,2.70919,2.691829,2.548035,2.489945,2.8217,2.807587,2.457313,2.730158,2.958987,2.756129,2.522862,2.407267,2.507427,2.456389,2.516319,2.261136
2.629422,2.530358,2.667801,2.575862,2.192367,2.032341,2.222,2.475305,2.757937,2.74239,2.681472,2.720927,2.577897,2.405926,2.177249,2.167639,2.483452,2.524151,2.424745,2.620545,2.669114,2.538105,2.443566,2.388995,2.282034,2.160705,2.414649,2.211947
2.293137,2.217941,2.225795,2.13061,1.91651,1.813834,1.894624,2.127926,2.416035,2.293373,2.074196,2.229816,2.272414,2.029117,1.711222,1.706101,2.04838,2.165629,2.192898,2.269789,2.216575,2.224834,2.279055,2.152672,1.86668,1.736577,2.000434,1.896235
2.045678,1.968641,1.857792,1.854689,1.82083,1.687511,1.630241,1.769267,2.034221,1.852291,1.486385,1.683638,1.89002,1.724547,1.52704,1.551549,1.80218,1.872136,1.858367,1.885285,1.902845,2.007331,2.042663,1.8246,1.559945,1.493907,1.638313,1.535431
2.259436,2.071407,1.947842,2.200254,2.351458,2.044981,1.789464,1.654333,1.70127,1.625601,1.385878,1.454631,1.573694,1.636406,1.741103,1.68761,1.85928,2.157222,2.065604,1.847815,1.925191,2.037058,1.924799,1.809161,1.737926,1.632755,1.611925,1.436119
3.43417,3.063342,2.900058,3.352139,3.677292,3.142496,2.6873,2.292316,2.110159,2.124025,1.947161,1.823341,1.759625,2.02052,2.443454,2.242238,2.507788,3.254854,3.058969,2.606042,2.70509,2.741902,2.512134,2.499144,2.450533,2.208211,2.063279,1.817904
5.591135,4.837923,4.40055,4.90044,5.410106,4.783698,4.219429,3.556064,3.131053,3.189198,3.033827,2.823298,2.620396,2.935982,3.63437,3.439299,3.855741,4.854958,4.428436,3.793234,3.918703,3.826906,3.564862,3.680398,3.475706,3.035349,2.909871,2.642836
8.27516,6.926785,5.970102,6.236661,6.749476,6.365014,5.979548,4.904869,4.194678,4.513229,4.509021,4.276964,3.944961,3.989753,4.957603,5.160952,5.599443,6.400491,5.570528,4.821183,5.108923,4.923901,4.563013,4.828858,4.459561,3.814803,3.830522,3.534305
10.74194,8.795141,7.084253,6.822768,6.993414,7.252773,7.45783,5.87148,5.028455,5.939227,6.210198,5.979907,5.504294,4.965829,6.170049,7.194573,7.557325,7.659756,6.292525,5.558907,6.107781,5.970228,5.470765,5.816005,5.428796,4.736282,4.896089,4.304653
11.825068,9.785354,7.528231,6.610764,6.488975,7.620825,8.231376,6.143748,5.401756,7.02263,7.682446,7.585309,7.041968,5.936658,7.314732,9.098643,9.332297,8.664476,6.821949,6.166883,6.88732,6.840197,6.377472,6.831902,6.444901,5.719935,6.004272,4.970282
11.036824,9.441598,7.60644,6.476656,6.317966,7.741979,7.84018,5.600746,5.24625,7.325463,8.285268,8.424995,8.07775,6.67185,8.010491,9.874512,9.844755,8.687298,6.876842,6.54071,7.06417,7.032058,6.844237,7.473825,7.028464,6.10007,6.570798,5.353201
9.307232,8.195765,7.114088,6.376536,6.321019,7.117859,6.474339,5.013868,4.960091,6.666053,7.747957,8.028951,7.95164,6.638667,7.386321,8.659836,8.952092,7.762048,6.102879,6.208353,6.487003,6.553046,6.443753,6.905365,6.493857,5.579239,6.300793,5.217124
7.219469,6.344847,5.767957,5.379367,5.718915,6.039966,5.137232,4.628768,4.423983,5.155278,6.109973,6.407222,6.375633,5.356894,5.480666,6.243142,7.459155,6.988923,5.151108,5.014682,5.481578,5.927909,5.440466,5.340463,5.173389,4.809707,5.610809,4.656852
4.995269,4.636789,4.256009,4.003594,4.90105,5.14791,4.237662,4.091522,3.653515,3.454454,3.974288,4.481056,4.283711,3.371829,3.309985,3.769066,5.405064,6.095124,4.515406,3.720994,4.20484,4.798232,4.426207,3.924653,3.903574,4.188568,4.425609,3.586267
3.412112,3.63212,3.464574,3.217922,4.36722,4.393025,3.37096,3.332953,3.010575,2.468627,2.561374,3.254896,3.039535,2.244371,2.391603,2.77906,3.74926,4.651428,3.86595,3.052725,3.263085,3.78811,3.808228,3.308081,3.313685,3.515299,2.979501,2.386459
2.691526,3.013815,2.979136,3.047525,3.881399,3.420657,2.523453,2.574756,2.44903,2.212857,2.135205,2.530836,2.448064,1.991361,2.0954,2.268242,2.682345,3.306134,3.015185,2.481285,2.514198,2.931354,3.106203,2.820057,2.782264,2.71904,2.139161,1.685848
2.399048,2.312217,2.251147,2.612816,3.097953,2.521617,1.765268,1.778739,1.802802,1.894613,1.78445,1.871553,1.920657,1.725985,1.698538,1.652754,1.916769,2.343179,2.204416,1.792854,1.782862,2.250138,2.490742,2.24054,1.999122,1.779958,1.496824,1.22582
1.839488,1.562235,1.536889,1.868472,2.091218,1.686542,1.168144,1.280001,1.339274,1.414036,1.29179,1.242255,1.47465,1.460371,1.345572,1.177932,1.310284,1.468259,1.381858,1.177161,1.280515,1.82816,1.948038,1.604994,1.394805,1.191264,1.070034,0.960351
1.210795,0.945715,1.023937,1.200828,1.289132,1.08967,0.863603,0.97489,0.978244,0.922339,0.818592,0.849182,1.187428,1.245223,1.086608,0.961717,0.917065,0.775778,0.743437,0.82877,0.975851,1.292365,1.277497,0.96473,0.890586,0.886842,0.925688,0.878303
0.700529,0.561844,0.675428,0.769611,0.882088,0.876616,0.762948,0.747274,0.65399,0.521907,0.463266,0.605943,0.906387,0.932842,0.770006,0.783655,0.759534,0.535518,0.476754,0.621378,0.707207,0.746764,0.739411,0.66666,0.674805,0.689781,0.71489,0.70494
0.426688,0.404255,0.439701,0.516847,0.607685,0.654663,0.596904,0.501738,0.381749,0.299884,0.27705,0.379893,0.54977,0.559973,0.489623,0.572745,0.588231,0.403767,0.310842,0.414411,0.508315,0.426128,0.457335,0.610367,0.628112,0.59315,0.546473,0.502929
0.338739,0.332006,0.305591,0.346182,0.38204,0.438844,0.422962,0.313742,0.254358,0.271516,0.238187,0.226402,0.300529,0.348064,0.408337,0.491716,0.462808,0.297153,0.200671,0.321084,0.405292,0.313272,0.391142,0.61864,0.62284,0.551504,0.503873,0.405631
0.296658,0.291946,0.277602,0.292955,0.291633,0.366426,0.40884,0.278606,0.213278,0.263005,0.210583,0.188574,0.244892,0.299946,0.410015,0.469665,0.408459,0.260122,0.193485,0.314957,0.374689,0.282983,0.376025,0.617092,0.581795,0.497445,0.488733,0.382844
0.30192,0.238816,0.254358,0.298933,0.283073,0.333559,0.386685,0.250473,0.178882,0.229956,0.19331,0.194772,0.246168,0.263353,0.345093,0.387686,0.330401,0.238738,0.207082,0.29567,0.357531,0.286439,0.314051,0.502455,0.444598,0.377007,0.40852,0.337584
0.349735,0.195826,0.224196,0.298772,0.280677,0.295186,0.307686,0.202247,0.146416,0.184409,0.183051,0.195365,0.225659,0.231638,0.270278,0.321258,0.317592,0.247279,0.20807,0.241051,0.291431,0.255906,0.231735,0.329525,0.300628,0.2685,0.326595,0.306653
0.406089,0.206739,0.21681,0.27582,0.244047,0.242387,0.231824,0.170124,0.144195,0.161837,0.165374,0.171115,0.170716,0.187006,0.208646,0.264134,0.310254,0.265881,0.21304,0.217088,0.230785,0.192115,0.18745,0.222389,0.207964,0.182482,0.235874,0.260364
0.401649,0.240629,0.243373,0.255414,0.224224,0.218481,0.190376,0.15307,0.147044,0.143195,0.133765,0.147572,0.139104,0.150611,0.178374,0.230116,0.279343,0.260099,0.234301,0.232298,0.188686,0.134125,0.172992,0.187067,0.160004,0.138997,0.157321,0.180803
0.316513,0.241448,0.259087,0.262408,0.23637,0.21506,0.180693,0.151598,0.15616,0.145576,0.113481,0.143778,0.155866,0.146834,0.153818,0.211179,0.280501,0.254412,0.250938,0.244608,0.177178,0.140789,0.187708,0.177913,0.142561,0.111789,0.098782,0.105921
0.198792,0.196853,0.230717,0.23883,0.220505,0.217763,0.221653,0.177649,0.184287,0.173079,0.114441,0.139226,0.182267,0.160688,0.151241,0.20382,0.275341,0.27238,0.274775,0.221362,0.156825,0.180109,0.216117,0.174826,0.135648,0.091806,0.076348,0.094326
0.142845,0.138226,0.164746,0.180443,0.167324,0.193849,0.252147,0.186453,0.197415,0.203742,0.134388,0.153852,0.201768,0.188643,0.158968,0.174426,0.231593,0.275327,0.279238,0.17013,0.123185,0.208302,0.226709,0.184312,0.149527,0.100326,0.074263,0.104585
