-0.000252,-0.000372,-0.000275,-0.000228,-0.000311,-0.000344,-0.000298,-0.00019,-0.000166,-0.000186,-0.000225,-0.000267,-0.000298,-0.000314,-0.000409,-0.000718,-0.000573,-0.000469,-0.000526,-0.000429,-0.000328,-0.000304,-0.000333,-0.000319,-0.00035,-0.000313,-0.000235,-0.000188
-0.000214,-0.000375,-0.000237,-0.000111,-0.000177,-0.000216,-0.000214,-0.000125,-8.1e-05,-7.6e-05,-0.000104,-0.000143,-0.000125,-0.000105,-0.000189,-0.000587,-0.000405,-0.000314,-0.000399,-0.000316,-0.000159,-0.000145,-0.000206,-0.000196,-0.000207,-0.000103,-8.9e-05,-3.9e-05
-6.3e-05,-7.1e-05,-5e-05,-6e-06,1.2e-05,-4.2e-05,-8e-05,-7.3e-05,-3.9e-05,-1.3e-05,-3.6e-05,-5.9e-05,-5.7e-05,-3.3e-05,-2.6e-05,-7e-06,1.8e-05,7.2e-05,-3e-06,-0.000101,-3.9e-05,-1.5e-05,-3.2e-05,-1.2e-05,5e-06,-8e-06,-2.5e-05,7e-06
0.000146,0.000241,0.00016,8.1e-05,0.000155,0.000173,0.00016,6.8e-05,1.4e-05,5.7e-05,0.00011,0.000126,0.000146,0.000111,0.000182,0.000544,0.000346,0.000314,0.000295,0.000171,7.4e-05,9.8e-05,0.000153,0.000215,0.000204,8.2e-05,6.8e-05,6.6e-05
0.000192,0.000233,0.000165,0.000106,0.000152,0.000262,0.000243,0.000112,7.1e-05,6.6e-05,0.000107,0.000159,0.000156,0.000132,0.00022,0.000495,0.000297,0.000152,0.000286,0.000349,0.000211,0.000172,0.000225,0.000196,0.000218,0.000171,0.000118,7.6e-05
-6e-06,-1e-06,-1.8e-05,-3.6e-05,-9.3e-05,-4.8e-05,-2.1e-05,-1.1e-05,2.8e-05,-5.4e-05,-8.2e-05,-6.5e-05,-0.000119,-0.000114,-0.000139,-0.00022,-0.00014,-0.000249,-8.2e-05,4.8e-05,1.5e-05,-3.3e-05,-3.2e-05,-0.000141,-0.000118,-3.2e-05,-3.4e-05,-7.5e-05
-0.000122,-7.6e-05,-7.9e-05,-0.00013,-0.00021,-0.000274,-0.00021,-7.1e-05,-3.1e-05,-6.9e-05,-0.000102,-0.000163,-0.000197,-0.000161,-0.000266,-0.000596,-0.000343,-0.000258,-0.000305,-0.000285,-0.000194,-0.000196,-0.000234,-0.000218,-0.000284,-0.000195,-0.000104,-8.9e-05
-7.2e-05,-5.2e-05,-4e-05,-3.6e-05,-3e-06,-7.8e-05,-0.000148,-6e-05,-3.1e-05,1.4e-05,-2.9e-05,-7.4e-05,-5.7e-05,1e-05,8e-06,-0.00016,-9.4e-05,0.000107,-8.8e-05,-0.000144,-4e-05,-7e-05,-9.7e-05,-4e-06,-3.6e-05,-5.8e-05,-2.6e-05,3.6e-05
3e-05,-7.8e-05,-1.3e-05,0.000125,0.000215,0.000159,7.1e-05,7.8e-05,2.7e-05,6.5e-05,0.000108,0.000141,0.000198,0.000197,0.000255,0.000419,0.000244,0.000309,0.000222,0.000155,0.000123,0.000131,0.000145,0.000162,0.000222,0.000154,8e-05,9.7e-05
3.7e-05,-0.000107,-2.1e-05,7.7e-05,9e-05,9.7e-05,0.000153,9.9e-05,-8e-06,7e-06,0.000108,0.000138,0.000111,6.4e-05,1e-04,0.000311,0.000175,6.7e-05,0.000122,9.8e-05,-9e-06,8.6e-05,0.00012,0.000114,0.000146,7.7e-05,3.1e-05,3e-06
-1.6e-05,1.9e-05,2.2e-05,-7.9e-05,-0.000145,-1.5e-05,4.4e-05,-6.2e-05,-5.4e-05,-6.2e-05,-8e-05,-7.1e-05,-0.000136,-0.000157,-0.000163,-0.000163,-0.000125,-0.000238,-0.000147,-6.8e-05,-6.1e-05,-7.2e-05,-4.5e-05,-6.9e-05,-8.4e-05,-9.7e-05,-7.1e-05,-8.6e-05
3.2e-05,0.000243,0.000118,-3.4e-05,-9.2e-05,-1.5e-05,-5e-06,-4.5e-05,5.3e-05,2e-06,-7.1e-05,-6.7e-05,-5e-06,-1.9e-05,-0.000107,-0.000263,-0.000121,-0.000141,-6.5e-05,-5e-06,8e-05,-5e-06,-3.2e-05,-0.000104,-0.00013,1.3e-05,3.2e-05,-5e-06
4.7e-05,0.000171,3.4e-05,3e-05,4.8e-05,-7.6e-05,-7.1e-05,-1e-06,8e-05,5.8e-05,-2e-06,-7e-06,4.9e-05,3.1e-05,-1.5e-05,-7.3e-05,4.7e-05,8.7e-05,7e-05,-1.6e-05,-6e-06,3.1e-05,-1.6e-05,-1.4e-05,-4.8e-05,4.7e-05,5.8e-05,2.8e-05
-1.6e-05,-0.000143,-0.000125,-5e-06,8.2e-05,-2.6e-05,-6.3e-05,3e-06,-2.2e-05,2.6e-05,2.1e-05,5.1e-05,5.4e-05,2e-05,8.2e-05,0.000219,0.000133,0.000131,3.4e-05,-1.6e-05,-7e-05,-1.5e-05,-1.9e-05,4.9e-05,6.8e-05,-4.3e-05,-2.3e-05,2.3e-05
-4.1e-05,-0.000262,-0.000102,1.5e-05,4.4e-05,9.2e-05,5.5e-05,4.7e-05,-6.7e-05,-2.6e-05,7.2e-05,8.3e-05,9.6e-05,8.3e-05,0.000132,0.00025,3.4e-05,3.3e-05,2.6e-05,0.000116,8e-05,2e-05,4.9e-05,6.3e-05,0.000139,2.9e-05,-1.6e-05,2e-05
-4.5e-05,-8.3e-05,2.9e-05,1.7e-05,-7.6e-05,5e-06,6.2e-05,2.1e-05,-3.3e-05,-5.4e-05,-1.7e-05,-6.6e-05,-0.000119,-6.8e-05,-8.1e-05,-0.000163,-0.00015,-7.9e-05,-1.6e-05,-1.2e-05,2e-05,1e-06,2e-05,1.5e-05,2.2e-05,1.4e-05,-2.9e-05,-4.9e-05
-1e-05,0.000173,0.000107,-4.6e-05,-0.000106,-4.7e-05,1.7e-05,-1.8e-05,2.8e-05,8e-06,-4.8e-05,-9.4e-05,-0.000144,-9.5e-05,-0.00012,-0.000309,-0.00011,-9.3e-05,-9.9e-05,-0.000177,-0.000108,-5.3e-05,-5.5e-05,-6.2e-05,-0.000137,-7.6e-05,-1.7e-05,-2.2e-05
4.5e-05,0.000187,4.9e-05,-3.4e-05,4e-05,2.6e-05,-4.3e-05,-5.3e-05,3.8e-05,5.7e-05,1.3e-05,0,4.4e-05,6.4e-05,5.8e-05,1.2e-05,7.1e-05,-1.9e-05,-4.7e-05,4e-06,1.8e-05,4e-05,-2e-06,-6.3e-05,-0.000104,1e-06,4.2e-05,5.5e-05
4e-05,-3.4e-05,-6.2e-05,4.6e-05,0.000116,3e-06,-8.8e-05,-4.5e-05,4e-06,-1e-06,-2e-05,3.3e-05,6.9e-05,3.5e-05,5.9e-05,0.000238,0.000145,7.1e-05,9.4e-05,0.000153,6e-05,5.2e-05,5.7e-05,2.9e-05,4.1e-05,3.5e-05,-3e-06,-1e-06
