1.1e-05,2e-06,2e-06,2.2e-05,9e-06,9e-06,1.5e-05,3e-06,1.7e-05,7e-06,2.3e-05,2e-06,7e-06,6e-06,2.6e-05,5e-06,3.5e-05,2.4e-05,1.3e-05,1.8e-05,0.00022,3e-06,6.8e-05,0.000181,0.000235,1.6e-05,3.5e-05,1.2e-05,9.1e-05,8.1e-05,4.1e-05,0.000123,3.9e-05,0.000176,6.4e-05,0.000883,8.7e-05,0.000281,0.000117,0.001252,0.000427,0.00032,0.00034,0.001069,0.000993,1e-04,0.000548,0.000257,0.000135,0.000688,0.000518,0.000773,0.000252,0.000395,0.000105,9e-06,8.1e-05,0.000116,0.000345,0.000302,0.000356,0.000484,0.000491,0.00026,0.000121,0.000134,0.000264,0.000106,8e-06,8.4e-05,7.8e-05,0.000142,0.000148,1.6e-05,0.000218,5.1e-05,8.7e-05,1e-05,7.4e-05,0.000181,6.8e-05,3e-06,0,5.4e-05,1e-04,0.000122,5.5e-05,2.4e-05,1.7e-05,1.9e-05,6.3e-05,1.4e-05,2.4e-05,1.7e-05,4e-06,1.7e-05,1.2e-05,7e-06,1.8e-05,3.1e-05,4e-06,6e-06,2e-05,1.3e-05,4e-06,9.1e-05,3e-06,7e-06,1.8e-05,2.3e-05,1.4e-05,2.3e-05,2e-06,5e-06,7e-06,5e-06,1.5e-05,2.4e-05,1.4e-05,3.1e-05,1.1e-05
2.1e-05,1.8e-05,8e-06,3.2e-05,4.4e-05,4.4e-05,4.7e-05,1.9e-05,5.5e-05,5e-05,2.7e-05,3.2e-05,5e-05,1.3e-05,4e-05,3.3e-05,6.7e-05,2.2e-05,1.3e-05,3.2e-05,0.000501,3.4e-05,1e-04,0.000296,5e-04,5e-05,7e-05,9.1e-05,0.000115,0.000231,0.000207,0.000298,0.000381,0.000271,0.000428,0.002538,0.001885,0.00124,0.001313,0.002244,0.002759,0.002356,0.001714,0.001596,0.002172,0.002372,0.000332,0.001173,0.001753,0.001174,0.000423,0.001456,0.001359,0.001371,0.000747,0.000193,0.000549,0.000652,0.000992,0.000517,0.000932,0.001202,0.000832,0.000787,0.000272,0.000344,0.000814,0.000227,0.000218,2e-04,0.000433,0.000296,0.000519,0.000455,3.2e-05,0.00032,0.000178,8.6e-05,0.000351,0.000453,0.00039,0.00026,0.00013,0.000163,0.00012,0.000642,0.000407,0.000212,8.1e-05,3.5e-05,0.000135,7.2e-05,5.1e-05,2.5e-05,3e-05,7.5e-05,2.6e-05,4e-05,2.4e-05,4.6e-05,2.6e-05,4.8e-05,4e-05,4.8e-05,6.2e-05,0.000235,2.1e-05,2.7e-05,7.1e-05,0.000103,5.8e-05,4.8e-05,7e-05,2.9e-05,2.2e-05,2e-05,3.1e-05,4.4e-05,6.8e-05,4.7e-05,3.9e-05
2.1e-05,2.3e-05,2.8e-05,2.3e-05,4e-05,2e-05,1.5e-05,3.5e-05,3.7e-05,2.1e-05,3e-05,2.1e-05,4.7e-05,3.3e-05,0.000101,3.2e-05,0.000148,6.7e-05,3.1e-05,3.3e-05,0.000728,0.00025,0.00037,0.000347,0.000617,0.000212,0.000232,8.5e-05,0.000182,0.000234,0.000193,0.000179,0.000124,9.2e-05,0.000319,0.004378,0.003833,0.001748,0.001118,0.002766,0.002564,0.001652,0.001484,0.000823,0.001105,0.001216,0.00172,0.00079,0.002028,0.001736,0.001095,0.001993,0.002069,0.001058,0.001086,0.001094,0.000111,0.001076,0.000353,0.000316,0.000742,0.001108,0.001267,0.000793,7e-05,0.000489,0.000562,0.000464,0.000316,0.00011,0.000479,0.000307,9.9e-05,0.00019,0.000684,0.000635,0.000341,0.000135,0.000495,0.000567,0.000313,8.4e-05,7.1e-05,0.000245,0.000286,0.000755,0.000529,0.000272,0.000127,1.3e-05,0.00014,4.8e-05,9.2e-05,6.4e-05,6.6e-05,3.2e-05,2.4e-05,6.6e-05,5.1e-05,5.8e-05,5.5e-05,2.3e-05,4e-05,1.9e-05,3.8e-05,0.000206,8e-06,2.5e-05,7.2e-05,2.4e-05,5e-06,8e-06,4.3e-05,2.7e-05,2.5e-05,1.8e-05,5.8e-05,1.8e-05,4.3e-05,2.3e-05,2.8e-05
4.1e-05,4.8e-05,3.5e-05,3.4e-05,4.7e-05,4e-05,4.7e-05,3e-05,1.2e-05,3.5e-05,2.4e-05,1.4e-05,4e-05,3.5e-05,0.000188,6.4e-05,0.000149,0.000152,5e-05,6.6e-05,0.000825,0.000213,0.000212,0.00033,0.00063,0.000268,0.000127,0.000416,0.000471,7.7e-05,0.000113,7.8e-05,0.00015,0.000107,0.000198,0.005544,0.002769,0.001124,0.000329,0.002157,0.002042,0.000381,0.001954,0.001802,0.001562,0.001949,0.001226,0.001951,0.000932,0.000383,0.001108,0.002207,0.00178,0.000589,0.001639,0.000766,0.000628,0.000859,0.001179,0.001326,0.001157,0.001632,0.00158,0.000904,0.000884,0.000619,0.001232,0.001037,0.000452,0.000357,0.000764,0.000489,0.000214,0.000147,0.000843,0.000257,0.000143,6.7e-05,0.000407,0.000671,0.000458,0.00022,8.9e-05,0.000343,0.000528,0.000767,0.000325,0.000253,0.000114,9e-05,0.000174,9.9e-05,0.000147,0.000148,5.9e-05,4.1e-05,4.8e-05,8.6e-05,6.5e-05,9.2e-05,8.3e-05,5.5e-05,4.7e-05,5.1e-05,5.7e-05,0.000265,6.4e-05,4.1e-05,6e-05,8.6e-05,3.8e-05,3.6e-05,1.9e-05,4.8e-05,6.4e-05,7.5e-05,3.3e-05,6.8e-05,0.000103,5.8e-05,2.8e-05
3.5e-05,2.6e-05,2.8e-05,4.5e-05,3.2e-05,3.4e-05,4.8e-05,3.8e-05,9e-06,3.7e-05,3e-05,2.7e-05,1.4e-05,2.2e-05,0.000215,0.000143,6.4e-05,5.2e-05,8.2e-05,1.4e-05,0.00077,0.00032,0.000178,0.000431,0.000677,0.000381,0.00053,0.000251,0.000321,0.000333,0.000334,0.000199,6.7e-05,5.3e-05,0.000167,0.005998,0.002911,0.00174,0.001037,0.001424,0.003031,0.00092,0.001872,0.00203,0.001913,0.002423,0.00082,0.002682,0.002333,0.002304,0.000615,0.002815,0.000811,0.000385,0.000255,0.001013,0.001702,0.001491,0.001818,0.000787,0.00216,0.000927,0.00061,0.001059,0.000449,0.000232,0.000646,0.000905,0.000727,0.000356,0.001025,0.000273,0.000723,0.000812,0.000656,0.000593,0.000326,0.000102,0.000277,0.000639,0.000274,8.9e-05,8.4e-05,0.000265,0.000208,0.000159,9.6e-05,0.000148,8.4e-05,6.9e-05,0.000193,0.000112,8.2e-05,4.1e-05,7.3e-05,3.7e-05,5.8e-05,2.6e-05,4.4e-05,4.6e-05,1.8e-05,2e-05,2.7e-05,4.9e-05,3.6e-05,0.000262,6.3e-05,1.7e-05,5.6e-05,4.3e-05,4.1e-05,1e-05,3.3e-05,2.3e-05,2.9e-05,4.8e-05,4.7e-05,4.6e-05,4.3e-05,3.4e-05,4.2e-05
3e-05,3.5e-05,5.5e-05,6.8e-05,7.1e-05,7.3e-05,7.6e-05,8.3e-05,7.7e-05,7.9e-05,4.9e-05,5.5e-05,7.9e-05,5.4e-05,0.000292,0.000165,0.000244,0.000217,3.5e-05,9e-05,0.000584,0.000413,0.000115,0.000688,0.000724,0.000417,0.000201,0.000742,0.000432,0.000174,0.000266,6.3e-05,9e-05,0.000101,0.000313,0.006001,0.003614,0.000854,0.000973,0.001529,0.001125,0.002345,0.004467,0.005552,0.00055,0.001492,0.001337,0.001468,0.003062,0.001577,0.001221,0.003297,0.002391,0.001915,0.001896,0.001518,0.001264,0.00152,0.002296,0.002245,0.001713,0.003214,0.002801,0.002637,0.00072,0.000323,6.9e-05,0.000347,0.000261,0.001127,0.001257,0.000791,0.001638,0.000329,0.000293,0.000222,0.00013,4e-05,0.000245,0.000391,0.000249,0.000181,0.000148,0.000237,0.000348,0.000736,0.000278,0.000292,0.00013,0.000111,0.000226,6e-05,3.7e-05,4.3e-05,0.000136,0.000152,0.000149,9.1e-05,9.9e-05,0.000136,0.000109,9.7e-05,0.000112,5.2e-05,5.8e-05,0.000236,7.8e-05,4.4e-05,6.6e-05,9.6e-05,5.5e-05,6e-05,7.7e-05,6.5e-05,5.7e-05,9.3e-05,8.1e-05,8e-05,5.9e-05,7.2e-05,4.2e-05
4e-05,5.3e-05,6.9e-05,0.000103,0.000117,0.000108,0.000142,0.000152,0.000152,0.000117,0.000105,0.000133,7.2e-05,8.9e-05,0.000328,0.00016,0.000416,0.000132,6e-05,3.3e-05,0.000867,0.000184,0.000462,0.00102,0.000718,0.000479,0.000199,0.000669,0.00017,0.000359,0.000206,0.000219,1.8e-05,7e-05,0.000373,0.004735,0.003821,0.002868,0.002261,0.003614,0.005527,0.001678,0.004279,0.007866,0.00665,0.002077,0.000457,0.002665,0.003774,0.003543,0.001204,0.005447,0.006725,0.003769,0.004942,0.003036,0.001823,0.0014,0.002237,0.001249,0.000839,0.002603,0.002022,0.00257,0.002831,0.001419,0.001311,0.0013,0.000616,0.00195,0.00132,0.000749,0.001323,0.00225,0.001243,0.000607,0.000308,7.9e-05,0.000244,0.000113,0.000117,0.000109,2.2e-05,0.000111,0.000318,0.000758,0.000526,0.000233,0.000107,7.1e-05,0.000246,5.1e-05,6.8e-05,3.6e-05,0.000103,0.000116,4.7e-05,3.1e-05,4.1e-05,0.000108,9e-05,9e-06,9.6e-05,3.8e-05,3.4e-05,0.000493,2.2e-05,2.3e-05,4.5e-05,4.9e-05,2.3e-05,3.1e-05,8e-06,6.7e-05,5.1e-05,4.6e-05,5.3e-05,2.6e-05,0.00012,0.000102,6e-05
1.9e-05,2.3e-05,2.7e-05,6.1e-05,1.9e-05,2.9e-05,5.6e-05,3.9e-05,5e-05,3.2e-05,3e-05,5.2e-05,4.8e-05,4.6e-05,0.00032,0.00045,0.000343,0.000349,0.000162,2.3e-05,0.001143,0.001775,0.001679,0.001661,0.001574,0.001299,0.000676,0.001151,0.000848,0.000667,0.000716,0.000371,0.000116,0.00028,0.000256,0.00369,0.002183,0.002033,0.003004,0.002604,0.007986,0.005928,0.005806,0.002385,0.003322,0.00322,0.001939,0.005403,0.009483,0.006792,0.004552,0.007662,0.007878,0.004276,0.004117,0.005493,0.003832,0.003974,0.001868,0.000716,0.000311,0.002556,0.000998,0.001657,0.000984,0.00149,0.002037,0.002803,0.001943,0.002136,0.001312,0.001096,0.001058,0.001941,0.00197,0.001225,0.000451,0.000201,0.000261,0.000426,0.00012,9.7e-05,2.8e-05,0.000309,0.000207,0.00038,0.000133,0.000345,0.000367,0.000209,0.000371,0.000161,9.9e-05,3.5e-05,5.7e-05,7e-06,2e-05,3e-05,3.3e-05,8.1e-05,4.8e-05,3.1e-05,7.3e-05,3.7e-05,5.7e-05,0.000818,0.000243,8.2e-05,5.9e-05,7.8e-05,3.3e-05,3.8e-05,2.3e-05,4.8e-05,4e-06,3.6e-05,1.7e-05,4.5e-05,0.000151,2.6e-05,4.3e-05
2.7e-05,1.8e-05,2.8e-05,4.3e-05,4.2e-05,2.9e-05,5e-06,4e-05,1.6e-05,1.7e-05,1.7e-05,1.9e-05,1.2e-05,2e-05,0.000395,0.000598,0.001021,0.000273,3.9e-05,0.00013,0.00113,0.003657,0.001272,0.001353,0.002047,0.002752,0.00146,0.001389,0.000468,0.000181,0.000661,0.000473,0.000381,0.000167,0.000425,0.002137,0.001043,0.000822,0.002697,0.005809,0.004046,0.001637,0.002487,0.005901,0.004777,0.003293,0.001114,0.004811,0.006794,0.002129,0.001866,0.005525,0.001746,0.001198,0.001049,0.003924,0.001981,0.002877,0.002032,0.002479,0.002211,0.000293,0.001047,0.001477,0.00079,0.001261,0.001905,0.000942,0.000445,0.002167,0.00293,0.001346,0.000743,0.00175,2e-04,0.000505,0.000283,0.000193,0.000208,0.000807,0.000439,0.000217,7e-05,0.000441,0.000321,0.000572,0.000448,0.000178,0.000264,0.000136,0.000289,0.000276,0.00017,7.6e-05,5.9e-05,5.9e-05,0.000106,0.000111,6e-05,7.8e-05,8.3e-05,9.3e-05,0.000163,0.000192,0.000159,0.001185,0.000785,0.000421,0.000159,1.7e-05,1.8e-05,1.6e-05,4e-05,9e-06,2.4e-05,3.5e-05,2.7e-05,4e-05,0.000206,0.00012,4.4e-05
2.5e-05,1.9e-05,1.9e-05,1.8e-05,2.1e-05,1.6e-05,1.6e-05,3.8e-05,1.4e-05,1.9e-05,3.1e-05,2.8e-05,2.3e-05,9e-06,0.00055,0.000418,0.000523,0.001049,0.000761,0.00033,0.001115,0.003715,0.002684,0.002159,0.001192,0.001164,0.000729,0.000983,0.001068,0.000497,0.000768,0.000586,0.000352,0.000436,0.000637,0.00095,0.000707,0.000486,0.00343,0.001773,0.000455,0.00097,0.002337,0.005821,0.004037,0.002638,0.001322,0.002553,0.002451,0.001104,0.001249,0.003416,0.002257,0.001602,0.002795,0.001623,0.003846,0.002398,0.001226,0.001371,0.001549,0.000474,0.000475,0.000444,0.000551,0.000792,0.000575,0.000966,0.000238,0.002442,0.001511,0.000419,0.000892,0.000624,0.000871,0.000228,6.3e-05,0.000145,0.000323,0.000708,0.000614,0.000305,0.000125,0.000463,0.000535,0.000232,0.000398,0.000113,0.000425,0.000306,0.000394,0.000184,2.5e-05,1e-05,7.9e-05,5.7e-05,7.2e-05,6.4e-05,5.7e-05,7.9e-05,8e-06,5.1e-05,9.3e-05,0.000218,7.1e-05,0.001444,0.001463,0.000632,0.000183,2.4e-05,3.6e-05,3.1e-05,3.6e-05,5e-05,4.7e-05,6e-05,1.6e-05,4e-05,0.00024,0.000186,5.9e-05
1.5e-05,2.5e-05,1e-05,4e-06,5e-06,2.4e-05,4e-06,2.9e-05,3e-05,8e-06,2.7e-05,1.4e-05,1.2e-05,4e-06,0.000627,0.000346,0.000307,0.000683,0.000344,0.000109,0.000995,0.001981,0.000982,0.000316,0.000579,0.000946,0.000623,0.00102,0.001547,0.000893,0.00052,0.000648,0.000322,0.000246,0.00045,0.000523,0.000529,0.001281,0.003388,0.003358,0.000792,0.00218,0.002319,0.002858,0.000937,0.002318,0.001363,0.00216,0.000404,0.001463,0.001465,0.001513,0.000817,0.001147,0.002111,0.002842,0.001858,0.000905,0.000602,0.001171,0.00087,0.001217,0.000804,0.001447,6e-04,0.001259,0.001292,0.001381,0.000227,0.001915,0.001691,0.00147,0.000556,0.000196,3e-04,0.000395,0.000219,0.000177,0.000211,0.000207,0.000134,3.6e-05,3.5e-05,0.000496,0.00035,0.000245,0.000175,0.000568,0.000423,0.000156,0.000362,9e-05,2.6e-05,2.8e-05,4.4e-05,2.7e-05,7.3e-05,3.7e-05,6.9e-05,7.2e-05,7.2e-05,4.1e-05,0.000103,0.000107,0.00013,0.001552,0.00137,0.000686,0.000231,5.6e-05,1.2e-05,1.2e-05,1.5e-05,1.2e-05,6e-06,5e-05,5.8e-05,5.4e-05,0.000202,0.000144,6.4e-05
9e-06,9e-06,1.5e-05,1.8e-05,2e-05,2.1e-05,1.4e-05,6e-06,9e-06,1.6e-05,1.5e-05,1.4e-05,2.8e-05,1.6e-05,0.000571,0.000181,0.000152,0.000158,7.3e-05,2e-05,0.001175,0.000563,0.000433,0.000385,0.000743,0.000333,0.000312,0.001425,0.001284,0.000425,0.000189,0.00021,3e-05,2.2e-05,0.000274,0.000216,0.001165,0.000501,0.002248,0.000805,0.001021,0.001498,0.002106,0.001893,0.00119,0.000632,0.000847,0.001957,0.00022,0.000683,0.001499,0.000887,0.001365,0.000843,0.000727,0.001359,0.000687,0.000219,0.000731,0.001057,0.001128,0.001304,0.000681,0.000943,0.00058,0.001243,0.000733,0.000519,0.000307,0.001259,0.000967,0.000878,0.000537,0.000232,0.000198,0.000138,5e-05,3.7e-05,0.000314,0.000222,8.9e-05,4.8e-05,3.1e-05,0.000439,0.000143,0.000164,0.000193,0.000341,0.000145,5.8e-05,0.000258,0.000198,0.000134,3.4e-05,5.7e-05,3.6e-05,4.6e-05,4.4e-05,4.4e-05,2.6e-05,3.1e-05,2.2e-05,5.5e-05,2.1e-05,0.000103,0.001256,0.000377,0.000189,5.9e-05,1.9e-05,1.1e-05,1.2e-05,1.5e-05,1.6e-05,3.7e-05,3.1e-05,1e-05,3.9e-05,6.6e-05,2.6e-05,1.8e-05
1.2e-05,1.4e-05,1.2e-05,8e-06,9e-06,1.1e-05,1.2e-05,4e-06,1.3e-05,1.5e-05,1.4e-05,1.6e-05,1.6e-05,4e-06,0.000439,0.000279,7.5e-05,0.000174,0.000102,4.9e-05,0.001195,0.000764,0.000969,0.000344,0.000195,0.000219,0.000309,0.00114,0.000771,0.00041,9.9e-05,0.00012,7.5e-05,9.8e-05,0.000195,8.6e-05,0.00131,0.00234,0.002109,0.001728,0.000747,0.001767,0.001998,0.00138,0.002715,0.002249,0.002251,0.002329,0.000908,0.002293,0.001892,0.000606,0.002483,0.000268,0.002275,0.002266,0.000814,0.0017,0.001124,0.000435,0.00061,0.001658,0.00105,0.000503,0.000512,0.00074,0.000489,0.000606,0.000277,0.000814,0.00028,0.001014,0.000852,0.000684,8.8e-05,0.000273,9.6e-05,1.8e-05,0.000432,0.000242,5.2e-05,1.4e-05,1.7e-05,0.000342,1e-04,9.9e-05,0.000184,0.000378,0.000127,2.9e-05,0.000183,0.000198,9.5e-05,2.4e-05,9.2e-05,1.5e-05,1.8e-05,5e-05,3e-05,2.3e-05,2.9e-05,2.4e-05,9e-05,5.8e-05,6.8e-05,0.000682,0.000305,0.000125,2.1e-05,2.2e-05,9e-06,8e-06,1.8e-05,2e-05,4.8e-05,2.8e-05,2.6e-05,4.3e-05,8.7e-05,3.4e-05,2e-05
9e-06,1.3e-05,1.1e-05,4e-06,1.5e-05,1.9e-05,1.8e-05,2e-06,1e-05,1.8e-05,8e-06,1.7e-05,1.4e-05,1e-05,0.000449,0.000296,0.000239,0.000259,8.7e-05,4.8e-05,0.000996,0.000421,0.000495,0.000505,8.5e-05,0.000225,8.5e-05,0.00107,0.000238,0.000262,0.000218,0.000134,4.7e-05,0.000103,0.000512,0.00063,0.001151,0.005814,0.007423,0.004985,0.001136,0.002,0.00178,0.00153,0.003131,0.002037,0.000682,0.000329,0.00073,0.002069,0.002003,0.001977,0.003051,0.002883,0.002504,0.001805,0.002566,0.000684,0.001368,0.001128,0.002046,0.002255,0.002022,0.001061,0.000242,0.000937,0.000574,0.000414,0.000318,0.000721,0.000834,0.001454,0.001044,0.000811,0.001145,0.000519,0.000156,3.2e-05,0.000484,0.000347,0.000212,7.7e-05,9e-06,0.000266,0.00012,0.000177,5.3e-05,7.7e-05,6.8e-05,1.1e-05,8.4e-05,0.000214,0.000132,1e-05,0.000116,5e-05,2.5e-05,6.3e-05,2.3e-05,1.2e-05,5.4e-05,1.3e-05,7.1e-05,2.1e-05,5e-05,0.000298,6e-05,1e-05,1.7e-05,1.3e-05,3.5e-05,2.6e-05,2.9e-05,2e-05,5.3e-05,2.5e-05,2.5e-05,5.2e-05,8.9e-05,3.6e-05,1.2e-05
8e-06,1.3e-05,2.1e-05,2.4e-05,3.5e-05,2.9e-05,1.7e-05,1.5e-05,1.3e-05,2.1e-05,2.1e-05,2.2e-05,1.4e-05,1.3e-05,0.000622,0.000433,0.000435,0.000156,9.1e-05,4e-05,0.00069,0.000649,0.000849,0.000465,0.000328,0.000114,0.000117,0.00093,0.001328,0.001117,0.000979,0.000244,0.000161,7.6e-05,0.000593,0.000371,0.003612,0.00714,0.003673,0.00145,0.003094,0.004324,0.000542,0.002358,0.00276,0.00614,0.001559,0.001232,0.003193,0.00163,0.006084,0.001108,0.001395,0.001012,0.001901,0.000896,0.003484,0.001741,0.002228,0.000579,0.003387,0.002606,0.001599,0.001448,0.000995,0.000213,0.00041,0.00097,0.000257,0.001243,0.000959,0.003044,0.002231,0.002528,0.000183,0.000312,0.000361,0.000153,0.000423,0.000484,0.000275,5.3e-05,3.2e-05,0.000213,0.000159,0.00026,1e-04,5.1e-05,9.8e-05,3.6e-05,7.6e-05,0.000154,4.5e-05,4.3e-05,5e-05,0.000127,0.000134,0.000113,8.9e-05,5e-06,6.6e-05,4.6e-05,6.5e-05,4.5e-05,2.4e-05,0.000263,0.000126,5.8e-05,3.1e-05,7.1e-05,3.4e-05,7.1e-05,3.8e-05,5.4e-05,7e-05,9.3e-05,6.6e-05,5e-05,2.7e-05,5.7e-05,2e-05
1.9e-05,8e-06,9e-06,4.1e-05,7e-05,3.7e-05,2.2e-05,9e-06,8e-06,2.1e-05,1.7e-05,3.4e-05,2.1e-05,1.8e-05,0.000748,0.000259,0.000311,0.000116,1e-05,3.8e-05,0.000359,0.000188,0.001023,0.000393,0.000202,0.000178,0.000125,0.000798,0.001292,0.000603,0.000313,0.000684,0.000265,0.000114,0.000469,0.000762,0.006117,0.008513,0.009955,0.004532,0.00504,0.010715,0.009965,0.00261,0.003993,0.00873,0.0073,0.00736,0.001769,0.00704,0.004307,0.005442,0.000745,0.004306,0.006252,0.004227,0.004906,0.00504,0.002884,0.001805,0.004956,0.004395,0.003977,0.001248,0.00435,0.001068,0.001386,0.002267,0.000672,0.002096,0.001876,0.003902,0.001873,0.001779,0.001559,0.001646,0.000735,0.000455,0.000462,0.000277,0.000108,2.9e-05,2.3e-05,0.000163,0.000344,0.000127,0.000139,7.9e-05,0.000234,0.000144,0.000289,0.000105,0.000102,8.7e-05,3.7e-05,0.000241,2.5e-05,5.4e-05,0.000145,0.000136,3.3e-05,0.000115,0.000152,7.6e-05,0.000115,0.00028,0.000222,0.000148,6.8e-05,0.000154,0.000117,3e-05,0.000155,0.000169,0.000209,0.000239,0.000113,4.9e-05,4.3e-05,9.4e-05,0.000109
3.8e-05,1.5e-05,8e-06,2.7e-05,3.3e-05,2.3e-05,4.7e-05,5.3e-05,2.5e-05,2.2e-05,2.6e-05,3.2e-05,2.1e-05,1.5e-05,0.000782,0.000443,0.000286,0.000233,0.000135,0.000103,0.000175,0.000282,0.001877,0.001197,0.00068,0.00018,0.000108,0.000664,0.000589,0.000335,8.7e-05,0.000479,0.000461,0.00024,0.00048,0.000225,0.006879,0.002444,0.0062,0.004484,0.009803,0.009134,0.008701,0.011319,0.009226,0.005404,0.009712,0.001516,0.005015,0.009378,0.012314,0.011557,0.010126,0.002514,0.007054,0.00465,0.00799,0.012398,0.013904,0.010637,0.008528,0.008798,0.00992,0.008631,0.008586,0.006966,0.003863,0.001189,0.002498,0.000693,0.002212,0.004164,0.004517,0.003479,0.002505,0.001777,0.000791,0.000271,0.000433,0.000139,0.000294,0.000252,8.4e-05,0.000127,0.000189,0.000173,0.000282,0.000202,0.000245,0.000166,0.00025,0.000307,0.000169,0.000108,0.000141,0.000355,0.000298,0.000236,0.000179,7.2e-05,0.000195,0.00025,7.8e-05,8.1e-05,6.2e-05,0.000325,0.000233,0.000176,0.000116,0.000179,0.000117,0.000185,0.000226,7.8e-05,0.000172,2.4e-05,0.000286,0.000199,3.1e-05,6.8e-05,1.7e-05
1.4e-05,2.2e-05,2.7e-05,1.7e-05,3.6e-05,2.9e-05,4.4e-05,4.5e-05,2.6e-05,2.9e-05,2.6e-05,1.2e-05,6e-06,2.5e-05,0.000804,0.000697,0.00052,0.000554,0.000264,1e-04,0.000218,0.000366,0.002092,0.001156,0.000366,0.000105,0.000138,0.000616,0.000526,0.000306,0.000112,0.00033,0.000124,0.000123,0.000633,0.00069,0.005826,0.006578,0.00226,0.00133,0.006088,0.002208,0.00454,0.003013,0.006089,0.003683,0.006904,0.00938,0.006205,0.004257,0.005399,0.002741,0.002581,0.008039,0.004867,0.008493,0.005768,0.003935,0.006001,0.005335,0.00589,0.002672,0.002364,0.003948,0.005639,0.001315,0.003389,0.00497,0.004343,0.002085,0.003404,0.003552,0.004874,0.002732,0.002322,0.001316,0.00112,0.000801,0.000112,0.000307,0.000241,6.3e-05,7.7e-05,0.000131,7e-05,0.000362,0.000176,0.000113,8.3e-05,3.8e-05,0.000395,0.000639,0.000325,0.000124,0.000183,0.000239,0.00011,8.8e-05,4.8e-05,7.9e-05,0.000169,0.000131,5.6e-05,0.000107,0.000104,3e-04,0.000134,0.000169,6.8e-05,0.000136,9.2e-05,0.000227,3.4e-05,4.5e-05,0.000156,0.000192,0.000339,0.000263,0.000138,7.6e-05,2.3e-05
1.4e-05,3.1e-05,2.9e-05,1.7e-05,1.8e-05,1.8e-05,2.6e-05,3.2e-05,3.5e-05,2.6e-05,1.4e-05,1.2e-05,2e-05,2.6e-05,0.00079,0.000314,0.000559,0.000355,0.000159,2.5e-05,0.000261,0.000442,0.001544,0.00106,0.000788,0.000275,0.000186,0.000349,0.000398,0.000214,0.000553,0.000402,8.4e-05,0.000122,0.000481,0.000455,0.002876,0.001525,0.003383,0.006684,0.00292,0.001099,0.002842,0.001038,0.003603,0.002892,0.002284,0.005616,0.004468,0.001434,0.00097,0.002637,0.004902,0.006597,0.007665,0.005587,0.004298,0.001739,0.001935,0.003066,0.003921,0.004451,0.002792,0.004303,0.00196,0.001739,0.002857,0.001272,0.001423,0.001297,0.002834,0.004603,0.001638,0.001012,0.001149,0.000856,0.000675,0.000176,0.00034,0.000692,0.00034,7.6e-05,3.2e-05,0.000206,8.7e-05,0.000331,0.000251,4.8e-05,0.000102,6.5e-05,0.000616,0.001057,0.000531,0.000125,0.000132,7.8e-05,0.000119,0.000161,0.00011,7.8e-05,0.000118,2.4e-05,6.2e-05,0.000103,3.4e-05,0.000301,0.00024,0.000182,7.8e-05,0.000146,0.000217,9.3e-05,7.5e-05,0.000121,9.2e-05,0.000132,0.000115,4.8e-05,5.5e-05,5.3e-05,5.8e-05
2.5e-05,5.3e-05,1.6e-05,7e-06,8e-06,1.6e-05,7e-06,2.1e-05,3.4e-05,4.7e-05,2.8e-05,1.8e-05,1.5e-05,5e-06,0.000804,0.000512,0.000534,0.00017,9.1e-05,7.6e-05,0.000325,0.000304,0.001004,0.00046,0.000639,0.000258,7.8e-05,0.000432,0.000717,0.000453,0.000472,0.000237,0.00022,0.000145,0.000355,0.000659,0.002626,0.00293,0.004503,0.004843,0.00413,0.001157,0.001022,0.000563,0.001276,0.003678,0.003108,0.000762,0.003301,0.004392,0.002212,0.002013,0.00499,0.001604,0.003383,0.00043,0.001946,0.002773,0.001756,0.001709,0.000995,0.002236,0.002007,0.000444,0.000351,0.00104,0.001227,0.002322,0.000918,0.001224,0.002308,0.001439,0.00115,0.001126,0.000216,0.000588,0.000287,0.000125,0.000573,0.000943,0.000459,0.000149,7.8e-05,0.000234,0.000125,0.000246,0.000334,0.000255,0.000156,7.7e-05,0.000659,0.001117,0.000588,0.000203,0.000127,0.000114,2.5e-05,8.6e-05,3.4e-05,6.6e-05,5.7e-05,9.7e-05,0.000104,0.00012,0.000144,0.000411,0.00031,6.9e-05,0.000164,0.000283,0.000139,0.000202,0.000106,0.000136,0.000117,0.000225,0.00018,9.7e-05,8.2e-05,1.9e-05,0.000102
2.4e-05,3.5e-05,2.5e-05,2e-05,1.2e-05,8e-06,1.2e-05,1.8e-05,1.8e-05,2.7e-05,2.2e-05,8e-06,1.8e-05,1.8e-05,0.000757,0.000521,0.000247,0.000349,0.000162,7.8e-05,0.00029,0.000381,0.000343,0.000161,0.000249,0.000206,9.5e-05,0.000342,0.000675,0.000665,0.000471,5e-05,6.5e-05,0.000133,8e-05,0.000496,0.001697,0.002702,0.000718,0.003729,0.000474,0.000813,0.00072,0.001737,0.002134,0.001135,0.002734,0.003108,0.002957,0.001396,0.000493,0.002286,0.002376,0.002061,0.00179,0.00054,0.002093,0.000748,0.001224,0.000446,0.001056,0.000953,0.002421,0.000496,0.000954,0.00122,0.000468,0.000936,0.000556,0.00056,0.000665,0.001476,0.001619,0.000521,0.000392,7.4e-05,7.4e-05,9.9e-05,0.000442,0.000637,0.000354,9.7e-05,6.7e-05,0.000216,0.000185,1.6e-05,0.000143,3.9e-05,0.000116,6.6e-05,0.000646,8e-04,0.000316,0.000103,5.4e-05,9e-05,5.4e-05,0.000101,4.9e-05,6.6e-05,5.4e-05,6.9e-05,3.4e-05,9e-06,3.9e-05,0.000341,0.000241,0.000138,4.4e-05,9.6e-05,0.000118,0.000132,0.000153,3e-05,2.4e-05,0.000117,3.1e-05,3.8e-05,2.3e-05,4.7e-05,6.1e-05
2.5e-05,1.2e-05,8e-06,1.1e-05,7e-06,1.3e-05,1.2e-05,1.7e-05,1.8e-05,6e-06,1.4e-05,1.2e-05,1.2e-05,1.8e-05,0.000667,0.000369,0.000437,0.000278,0.000102,2.6e-05,0.000304,0.000126,0.000251,0.000324,0.000309,7.5e-05,8.3e-05,0.000376,0.000577,0.000302,0.000513,0.000422,0.000187,0.000124,7.4e-05,0.000376,0.001056,0.001319,0.000767,0.000936,0.000631,0.000696,0.000232,0.001383,0.002662,0.000817,0.000912,0.001895,0.002904,0.002479,0.001247,0.001722,0.001478,0.00154,0.001755,0.000775,0.000504,0.001354,0.001447,0.000413,0.000486,0.000472,0.001281,0.002029,0.000637,0.000872,0.000457,0.001134,0.000154,0.000565,0.000311,0.000361,0.000412,0.000475,0.000248,0.000148,0.000285,8.8e-05,0.000338,0.000395,0.000164,2.6e-05,7.8e-05,8.4e-05,8e-05,7.8e-05,3.2e-05,0.000136,7.8e-05,4.4e-05,0.000712,0.00065,0.000306,9.9e-05,6e-05,3.1e-05,1e-05,5.7e-05,3.1e-05,3.1e-05,2.6e-05,7.5e-05,8.6e-05,7.7e-05,4.3e-05,0.000273,1.7e-05,7.3e-05,6.4e-05,3.1e-05,5.1e-05,1.1e-05,6.4e-05,4.9e-05,5.6e-05,5.3e-05,3.4e-05,2.8e-05,4e-05,3.6e-05,1.6e-05
8e-06,8e-06,5e-06,4e-06,8e-06,1e-06,8e-06,7e-06,5e-06,5e-06,3e-06,3e-06,7e-06,4e-06,0.000246,0.000117,0.000136,6.1e-05,2.4e-05,6e-06,0.000126,0.000104,0.00014,0.00018,8.6e-05,4.6e-05,2.2e-05,0.000143,0.000196,0.000195,8.1e-05,8.3e-05,5.4e-05,3.7e-05,3.7e-05,0.000165,0.000573,0.000457,0.000875,0.000192,0.000704,0.000377,0.000119,0.000557,0.000534,0.000493,0.000564,0.00019,0.000618,0.000254,0.000337,0.00067,5e-04,0.000541,0.000295,0.000449,0.000477,0.000708,0.000496,0.000119,3.7e-05,0.000273,0.00034,0.000871,0.000429,0.000327,0.000154,0.000195,4.2e-05,0.000169,0.00013,8.8e-05,0.000183,0.000233,0.000146,0.000125,2.9e-05,2.3e-05,0.000149,0.000143,7.7e-05,1.3e-05,2.3e-05,7e-05,5.5e-05,5.6e-05,5e-06,9.5e-05,3.2e-05,2.3e-05,0.000362,0.000251,0.000116,3e-05,3.8e-05,2.6e-05,1.9e-05,1.5e-05,1.4e-05,8e-06,2.1e-05,2.6e-05,1.2e-05,1.9e-05,1.2e-05,6.3e-05,4.3e-05,3.2e-05,5.3e-05,2.1e-05,1.6e-05,2.2e-05,2.3e-05,2.2e-05,1e-05,2e-05,1.8e-05,1.3e-05,1.4e-05,1.4e-05,1e-05
8e-06,3e-06,2e-06,1e-06,2e-06,1e-06,6e-06,5e-06,3e-06,9e-06,7e-06,4e-06,6e-06,4e-06,0.000134,6.2e-05,5.7e-05,5.3e-05,2.6e-05,1.2e-05,0.000111,0.000122,0.000124,0.000352,0.00021,7.3e-05,2e-05,0.00016,4.9e-05,1e-05,4.3e-05,7.1e-05,2.2e-05,3.4e-05,7.1e-05,0.000164,0.00044,0.000657,0.000402,2.1e-05,0.000653,0.000608,0.000416,0.000174,0.000961,0.000507,0.000337,0.000487,0.000112,0.000306,4.8e-05,0.000402,0.000493,0.00024,0.000445,0.000521,0.000111,0.000345,0.000733,0.00013,0.000199,0.000229,0.000117,0.000445,0.000344,0.000218,0.00011,0.000188,1.5e-05,0.000141,0.000102,0.000268,9.7e-05,0.000113,3.3e-05,6e-05,3.7e-05,2e-05,0.000157,6.4e-05,3e-05,1e-05,8e-06,6.2e-05,2.3e-05,1.8e-05,2.5e-05,9.1e-05,5.4e-05,2.6e-05,0.000346,0.000206,0.000114,2.3e-05,2.2e-05,1.6e-05,1.3e-05,8e-06,9e-06,9e-06,9e-06,1.6e-05,1.6e-05,1e-05,2.8e-05,5.2e-05,2.4e-05,4.9e-05,3.4e-05,2.1e-05,1.6e-05,1.2e-05,6e-06,8e-06,8e-06,1.2e-05,5e-06,1.2e-05,1.8e-05,1.7e-05,4e-06
5e-06,5e-06,2e-06,2e-06,2e-06,4e-06,2e-06,4e-06,4e-06,5e-06,1e-06,5e-06,2e-06,6e-06,3.7e-05,8e-06,5.9e-05,2.1e-05,2.7e-05,7e-06,0.000102,4.5e-05,0.000129,2e-04,3.1e-05,4.2e-05,1.3e-05,0.000131,1.1e-05,2.1e-05,1.8e-05,8.7e-05,4.4e-05,6e-06,4.3e-05,0.000164,0.000356,0.000441,0.000516,0.000558,0.000252,0.000189,0.000209,0.000347,0.000564,0.000348,0.000153,0.000474,0.000785,0.000593,0.000163,0.000191,2.7e-05,0.000422,0.000462,0.000435,0.00025,0.000417,0.000508,9.3e-05,0.000168,0.000132,4.2e-05,0.000109,0.000109,0.000249,0.000105,0.000144,6.2e-05,0.000133,8.3e-05,0.000229,7.8e-05,2.3e-05,3.5e-05,3.6e-05,2.1e-05,2.1e-05,0.000129,4.1e-05,2.3e-05,4e-06,7e-06,5.3e-05,3e-05,1.6e-05,2.6e-05,8.7e-05,3.4e-05,9e-06,0.000312,0.000168,6.9e-05,1.3e-05,4.2e-05,1.8e-05,8e-06,9e-06,6e-06,1.4e-05,2.3e-05,6e-06,7e-06,6e-06,1.3e-05,4.8e-05,1.4e-05,4.4e-05,2.4e-05,1.8e-05,1.1e-05,3e-06,8e-06,1.1e-05,1.2e-05,7e-06,4e-06,6e-06,3e-06,6e-06,6e-06
5e-06,2e-06,2e-06,3e-06,3e-06,5e-06,7e-06,1e-06,0,5e-06,3e-06,2e-06,2e-06,4e-06,5.3e-05,1.8e-05,1.9e-05,2e-06,1.4e-05,1.1e-05,0.000104,0.000117,1.9e-05,0.000153,0.000115,5.8e-05,1e-05,0.000108,6.4e-05,6.7e-05,0.000108,3.2e-05,1.5e-05,8e-06,7.8e-05,0.00018,0.000235,0.000145,0.000673,0.000166,0.000274,0.000522,0.000236,8.4e-05,0.000491,0.000627,0.000364,0.000388,0.000412,0.000213,0.000381,0.000849,0.000452,0.000666,0.000261,0.000388,0.00021,0.000843,0.000525,0.000357,0.000317,5.4e-05,0.000251,0.000398,0.000295,0.000249,0.000151,0.000151,4.8e-05,0.000151,0.000107,0.000151,0.000127,5.1e-05,2.7e-05,2.5e-05,1.1e-05,3e-06,0.000157,2.5e-05,1e-05,1.2e-05,1.3e-05,3.9e-05,2.9e-05,1.2e-05,1e-05,5.3e-05,4.1e-05,2e-05,0.00029,0.000101,2.2e-05,3.4e-05,4e-05,1.1e-05,1.6e-05,2.3e-05,9e-06,1.1e-05,1.5e-05,1.2e-05,1e-05,6e-06,1.2e-05,5.6e-05,1.2e-05,3.7e-05,1.3e-05,2e-06,4e-06,1.2e-05,1.7e-05,1.1e-05,1e-05,2e-05,1.5e-05,2e-06,2e-06,9e-06,6e-06
4e-06,2e-06,3e-06,3e-06,3e-06,3e-06,5e-06,3e-06,4e-06,5e-06,4e-06,0,2e-06,2e-06,7.1e-05,2.2e-05,5e-06,2.7e-05,2.3e-05,1.5e-05,8.7e-05,8.3e-05,5.8e-05,9.3e-05,2.9e-05,2e-05,1.3e-05,7.9e-05,7.8e-05,5.1e-05,0.000124,3.2e-05,9e-06,1.5e-05,8.9e-05,0.000149,0.000243,0.000511,0.000289,0.00014,0.000484,0.00024,0.000489,0.000697,0.000319,0.000477,0.000288,0.000373,0.000264,0.000297,0.000244,0.000866,0.000219,0.000585,0.00039,0.000325,0.000598,0.000276,0.000419,0.000225,7.4e-05,4.9e-05,0.000134,0.000512,0.000225,0.000148,0.000135,2.9e-05,7.5e-05,2e-04,6.2e-05,0.00022,5.5e-05,6.8e-05,1.7e-05,3e-06,3.3e-05,4.1e-05,0.000164,5.3e-05,1.3e-05,5e-06,8e-06,1.4e-05,2.2e-05,1.8e-05,2.6e-05,6.3e-05,4.1e-05,1.4e-05,0.000255,0.000102,6.6e-05,3.1e-05,1e-05,6e-06,1.1e-05,9e-06,1.3e-05,1.2e-05,4e-06,1.3e-05,1.1e-05,5e-06,1.1e-05,5.2e-05,1e-05,1.7e-05,9e-06,5e-06,8e-06,1e-05,5e-06,7e-06,1.1e-05,7e-06,8e-06,1.1e-05,7e-06,9e-06,5e-06
5e-06,3e-06,2e-06,4e-06,3e-06,7e-06,3e-06,4e-06,3e-06,2e-06,1e-06,3e-06,3e-06,3e-06,4.8e-05,7e-06,1e-05,1.9e-05,7e-06,6e-06,0.000108,5.3e-05,9.1e-05,3.2e-05,8.4e-05,2.2e-05,2e-05,7.6e-05,4.7e-05,8.8e-05,0.00012,7.5e-05,3.2e-05,9e-06,7.9e-05,0.000114,0.00034,0.000416,0.000163,0.000213,0.000477,0.000216,0.00043,0.000444,0.000436,0.00015,0.000209,0.000381,0.000732,0.000477,1.1e-05,0.000579,0.000269,0.000424,4.7e-05,0.000356,0.000313,0.000367,0.000293,5.3e-05,3.2e-05,6.3e-05,7.8e-05,0.000364,0.000157,0.000148,0.00012,0.000149,2.1e-05,0.000263,0.000109,0.000218,0.000148,4.2e-05,2.3e-05,3.4e-05,2.9e-05,1.8e-05,8.9e-05,2.7e-05,2.7e-05,1.4e-05,2e-06,1.4e-05,1.3e-05,3.7e-05,4.2e-05,9.1e-05,3.3e-05,1.4e-05,0.000218,7.3e-05,3.1e-05,1.3e-05,1.8e-05,2e-06,7e-06,1.3e-05,1.5e-05,6e-06,3e-06,4e-06,8e-06,1.1e-05,1.6e-05,5e-05,1.6e-05,2.2e-05,8e-06,7e-06,2e-06,8e-06,1e-05,4e-06,1.1e-05,1.6e-05,3e-06,5e-06,1.2e-05,7e-06,6e-06
2e-06,6e-06,4e-06,2e-06,2e-06,4e-06,3e-06,1e-06,4e-06,4e-06,1e-06,1e-06,1e-06,2e-06,1.4e-05,2.8e-05,1.3e-05,7e-06,6e-06,2e-06,0.000108,0.000125,4e-05,0.000127,4.9e-05,1.4e-05,9e-06,5.1e-05,6.3e-05,8.8e-05,0.000125,8e-05,1.7e-05,5e-06,9.1e-05,0.00023,0.000153,6e-05,0.000385,0.000304,4.9e-05,0.000302,0.000403,0.00021,0.000266,0.000108,0.000152,0.000317,0.000739,0.000113,0.000225,0.000613,0.000463,7.6e-05,0.000129,0.000434,0.000641,7.1e-05,0.000227,6.3e-05,9.1e-05,0.00014,4.6e-05,0.000116,0.00032,0.000145,8.1e-05,0.000152,5.6e-05,0.000249,0.000126,0.000178,0.000101,0.000212,0.000105,6.6e-05,2.5e-05,1.9e-05,9.7e-05,3e-05,7e-06,5e-06,1e-05,2.8e-05,3.5e-05,3.1e-05,1.2e-05,6.9e-05,3.4e-05,2.1e-05,0.000183,0.000102,6.9e-05,3.4e-05,1.8e-05,2e-05,2.2e-05,2.6e-05,1e-05,9e-06,7e-06,1.4e-05,2e-06,8e-06,1.8e-05,7.5e-05,3.9e-05,1.7e-05,2.2e-05,1e-05,1.2e-05,9e-06,9e-06,5e-06,1e-05,7e-06,9e-06,5e-06,6e-06,4e-06,8e-06
5e-06,9e-06,3e-06,1e-06,3e-06,4e-06,3e-06,4e-06,2e-06,3e-06,1e-06,1e-06,2e-06,5e-06,1.2e-05,1.6e-05,2.7e-05,3.1e-05,6e-06,2e-06,8.9e-05,4.4e-05,1e-04,0.000146,9.3e-05,3.3e-05,1.3e-05,5.5e-05,5e-05,6.8e-05,0.000109,6.2e-05,4.1e-05,1.4e-05,9.1e-05,0.000185,0.000304,0.000216,0.000183,0.000608,0.000601,0.00026,0.000377,0.000302,0.000109,0.000326,4e-05,0.000135,0.000419,0.000146,0.000108,0.000527,0.000656,0.000394,0.000325,0.000367,0.000177,0.000152,0.000234,7.9e-05,0.000142,0.000294,0.000353,0.000136,0.000207,0.000126,0.000204,0.000117,9.6e-05,0.000173,0.000153,0.000233,0.00018,0.000166,2.7e-05,3.9e-05,4e-05,3.4e-05,6e-05,3.5e-05,3.8e-05,2.9e-05,1.4e-05,3.4e-05,2.4e-05,6.2e-05,3.5e-05,6.1e-05,4.5e-05,1.9e-05,0.00016,0.000156,5.4e-05,2.7e-05,3.2e-05,1.8e-05,1.1e-05,1.5e-05,1.8e-05,2.6e-05,1.4e-05,2e-05,2.4e-05,2e-05,2.7e-05,7.6e-05,2.1e-05,4.8e-05,6.1e-05,3.9e-05,2.7e-05,2.4e-05,1.5e-05,4e-06,6e-06,1e-05,3e-06,7e-06,7e-06,5e-06,1.7e-05
4e-06,5e-06,4e-06,2e-06,4e-06,3e-06,5e-06,7e-06,3e-06,3e-06,3e-06,0,3e-06,3e-06,2.4e-05,3.2e-05,6.4e-05,2.6e-05,6e-06,7e-06,7.3e-05,7.8e-05,6.9e-05,0.000175,5.5e-05,1.4e-05,2e-06,5e-05,1.3e-05,5.6e-05,0.000126,6.8e-05,4.8e-05,3.4e-05,2.8e-05,0.000152,0.000279,0.000365,0.000164,0.000792,0.000267,0.000208,0.00027,0.000173,0.000348,0.000202,0.000158,0.000182,0.000695,0.000169,0.000175,0.000322,0.00018,0.000108,0.000245,0.000253,0.000343,0.000327,0.000281,0.000168,0.000217,0.000482,9.7e-05,0.000144,0.000292,2e-04,0.000101,0.00026,0.000223,8e-05,3.3e-05,5.9e-05,0.000377,0.000262,7.8e-05,8.3e-05,1.3e-05,1.8e-05,8.6e-05,4e-05,6e-06,1.3e-05,9e-06,3.2e-05,7e-06,5.4e-05,5.1e-05,1e-05,4.6e-05,3.2e-05,0.000124,0.000134,0.000116,4.4e-05,4.9e-05,3.4e-05,1.9e-05,1.1e-05,1.2e-05,1.5e-05,4.5e-05,5e-05,2.2e-05,4e-06,1.8e-05,6.5e-05,3.9e-05,5.1e-05,3.5e-05,1.1e-05,1.9e-05,6e-06,1.2e-05,4e-06,5e-06,1.5e-05,9e-06,1.1e-05,1.7e-05,7e-06,1.8e-05
2e-06,1e-06,2e-06,4e-06,5e-06,8e-06,5e-06,2e-06,2e-06,3e-06,3e-06,3e-06,3e-06,5e-06,4.6e-05,1.5e-05,6.3e-05,3.7e-05,1.5e-05,5e-06,9e-05,0.000118,7.5e-05,0.000129,7e-05,3.7e-05,1.2e-05,5.4e-05,5e-06,5.7e-05,0.000187,1e-04,2.5e-05,2.7e-05,1e-05,9e-05,0.000149,7.5e-05,0.00015,0.000785,0.000694,0.000265,0.000126,0.000217,0.00033,0.000132,9.7e-05,0.000235,0.00063,0.000434,0.000147,0.000268,0.000235,0.00024,2e-04,0.000326,8.5e-05,0.000225,0.000309,9.9e-05,0.000148,0.00015,0.000249,6.8e-05,0.00028,0.000193,0.000106,8e-05,0.000142,0.000201,8.7e-05,9.7e-05,0.00028,0.000284,0.000269,5.5e-05,3.9e-05,2.6e-05,8e-05,4e-06,1.3e-05,7e-06,8e-06,4e-05,2.4e-05,2.7e-05,3.2e-05,5.3e-05,1.1e-05,4e-06,0.00011,4.5e-05,1.5e-05,1.8e-05,4.5e-05,4.1e-05,1.7e-05,9e-06,4e-06,2.4e-05,2.7e-05,5e-06,1.2e-05,7e-06,1.3e-05,6.1e-05,7.1e-05,1.5e-05,1.4e-05,1.6e-05,1.8e-05,9e-06,1.2e-05,9e-06,6e-06,1.1e-05,3e-06,1.1e-05,6e-06,1.7e-05,5e-06
2e-06,3e-06,2e-06,5e-06,1e-06,2e-06,1e-06,2e-06,2e-06,2e-06,2e-06,1e-06,1e-06,2e-06,8.4e-05,3.9e-05,7e-05,2e-05,1.4e-05,3e-06,0.000102,2.3e-05,4.6e-05,0.000136,2.8e-05,1.9e-05,1.6e-05,4.1e-05,6.3e-05,1.9e-05,0.000141,9.2e-05,1.8e-05,2.3e-05,3.2e-05,0.000111,0.00023,0.000116,0.000278,0.000564,2e-04,0.000151,0.000148,0.000238,0.000158,0.000131,0.000144,5.5e-05,0.000217,0.000108,1.3e-05,0.000309,0.000509,0.000268,0.000392,0.000242,0.000215,0.000214,0.000213,6.3e-05,0.000186,0.000148,0.000143,0.000316,0.000103,0.000112,0.00031,0.00014,0.000217,5.8e-05,0.000183,2.1e-05,0.000286,0.000111,7.5e-05,7.4e-05,2e-05,2e-05,8e-05,1.7e-05,8e-06,1.3e-05,4e-06,3.8e-05,8e-06,4.2e-05,1e-05,5.8e-05,5.4e-05,2.6e-05,9.1e-05,4.4e-05,3.8e-05,1e-05,3.4e-05,3e-05,1.5e-05,7e-06,4e-06,1.7e-05,2.5e-05,1.3e-05,1.3e-05,1.4e-05,6e-06,2.9e-05,5.6e-05,3.3e-05,2.8e-05,7e-06,1e-05,5e-06,5e-06,7e-06,9e-06,1e-05,3e-06,9e-06,6e-06,1.2e-05,1.2e-05
0,3e-06,3e-06,2e-06,3e-06,3e-06,4e-06,2e-06,2e-06,3e-06,1e-06,0,0,3e-06,0.000111,3.4e-05,5.5e-05,2.3e-05,1.6e-05,4e-06,0.000112,0.000146,6.7e-05,9.4e-05,6.7e-05,4.2e-05,3e-05,6.8e-05,0.000121,8.1e-05,8e-06,5.7e-05,3.9e-05,4e-06,2.8e-05,8.8e-05,0.000293,0.000298,0.000215,0.000414,0.000409,3.1e-05,0.00018,5.1e-05,0.000489,0.000153,0.000192,0.000209,0.000298,8e-05,6.1e-05,0.000392,0.000448,0.000242,0.000316,0.000225,0.00022,0.000352,0.000206,0.000113,0.00016,0.000244,4.2e-05,0.000361,0.000293,8.4e-05,0.000196,0.00014,6.2e-05,0.000153,0.000164,0.000235,0.000164,7.8e-05,5.4e-05,3.9e-05,2.9e-05,4.1e-05,3.4e-05,3.2e-05,1.9e-05,8e-06,1.4e-05,2.9e-05,1.8e-05,4.7e-05,3e-05,7.9e-05,4.2e-05,2.1e-05,7.7e-05,0.000107,3.3e-05,1.1e-05,2.6e-05,2.3e-05,1e-05,5e-06,5e-06,1e-05,1.7e-05,6e-06,1e-06,1.7e-05,8e-06,1.1e-05,4.5e-05,1.7e-05,1.6e-05,1.2e-05,7e-06,6e-06,1.6e-05,2e-06,7e-06,6e-06,8e-06,5e-06,4e-06,5e-06,7e-06
1e-06,1e-06,1e-06,2e-06,3e-06,2e-06,5e-06,3e-06,1e-06,2e-06,1e-06,2e-06,1e-06,3e-06,0.000115,7.5e-05,7.6e-05,6.4e-05,4.1e-05,1.2e-05,0.000108,0.000144,0.000101,9.2e-05,8.3e-05,3.8e-05,4.6e-05,3.4e-05,0.000122,5.2e-05,0.000129,6.5e-05,1.8e-05,1.9e-05,2.8e-05,7.7e-05,0.000161,0.000125,0.000215,4.8e-05,6.1e-05,0.000206,0.000234,0.000277,0.000248,0.000111,9.7e-05,0.000156,0.000192,7.9e-05,6.8e-05,0.000441,0.000108,0.000127,0.000224,0.000152,0.000186,0.000314,0.00019,6.6e-05,0.000163,0.000112,0.000137,0.000257,7.2e-05,0.000155,6.5e-05,2.4e-05,0.000103,0.000173,6.1e-05,0.000153,6.4e-05,4.4e-05,5.1e-05,2.7e-05,4e-05,2.6e-05,7.9e-05,2.7e-05,2.3e-05,1.8e-05,1.8e-05,2.9e-05,4.5e-05,1.5e-05,2.5e-05,7.9e-05,4.8e-05,1.2e-05,6.8e-05,0.00017,0.000124,5.5e-05,2.4e-05,1.1e-05,7e-06,6e-06,8e-06,1e-05,1.1e-05,8e-06,4e-06,6e-06,2e-06,3.2e-05,5.9e-05,3.8e-05,1.9e-05,1.1e-05,8e-06,1e-05,6e-06,2e-06,3e-06,5e-06,1.1e-05,4e-06,3e-06,6e-06,3e-06
2e-06,1e-06,1e-06,1e-06,2e-06,4e-06,1e-06,2e-06,2e-06,1e-06,1e-06,3e-06,2e-06,3e-06,9.3e-05,5.9e-05,8e-05,6.4e-05,1.9e-05,6e-06,9.8e-05,8.2e-05,8.2e-05,2.6e-05,4.8e-05,2.4e-05,2.8e-05,6e-05,0.000172,0.000138,0.000243,8.2e-05,3.2e-05,2.3e-05,6.3e-05,0.000146,0.000226,0.000133,0.000175,0.000209,0.000259,0.000246,0.000145,0.000184,0.00011,0.000162,0.000145,5.9e-05,0.000289,0.000206,2.8e-05,0.000383,0.000212,6.8e-05,0.000248,0.000139,0.000124,0.000198,0.000141,6.5e-05,2.9e-05,0.000169,2e-05,0.000322,0.000126,8.7e-05,0.000195,0.000187,0.000179,8.1e-05,0.000213,0.000118,0.000302,9.2e-05,8.7e-05,3.3e-05,3.5e-05,4.3e-05,4.4e-05,4.1e-05,4.8e-05,2.3e-05,9e-06,2.7e-05,4.6e-05,4.3e-05,1.2e-05,6.4e-05,2.1e-05,2.7e-05,4.8e-05,0.000281,0.000119,4.2e-05,3.6e-05,3.3e-05,1.3e-05,1.4e-05,5e-06,1.1e-05,7e-06,4e-06,8e-06,6e-06,2e-06,4.5e-05,6.5e-05,2.2e-05,1.6e-05,1e-06,2e-05,6e-06,2e-06,2e-06,9e-06,5e-06,8e-06,4e-06,7e-06,2e-06,5e-06
4e-06,3e-06,1e-06,2e-06,1e-06,3e-06,2e-06,1e-06,4e-06,1e-06,2e-06,2e-06,2e-06,2e-06,5.6e-05,4.5e-05,3.9e-05,3.5e-05,1.7e-05,5e-06,1e-04,0.000165,0.000182,0.000108,7.3e-05,2.9e-05,2.8e-05,3.3e-05,0.000221,4.8e-05,0.000203,0.00017,8.9e-05,2.3e-05,7e-05,0.000104,0.000198,0.00024,0.000433,0.000172,0.000165,0.000135,0.00032,0.000162,0.000357,9.9e-05,2.1e-05,0.000185,0.000559,0.000157,3.6e-05,0.000317,0.000312,0.000167,0.000196,0.000153,0.000217,0.000284,0.000176,0.000171,0.00016,0.000233,0.000217,0.000431,8.1e-05,0.000173,0.000257,9.4e-05,0.000186,0.000235,0.000371,0.000125,0.000341,0.000255,8.6e-05,9.3e-05,5.8e-05,5.3e-05,9.5e-05,5.4e-05,2.2e-05,1.6e-05,1.3e-05,2.5e-05,1.3e-05,4e-06,2.9e-05,4.8e-05,2.9e-05,3.5e-05,3.6e-05,0.000389,0.000218,7.7e-05,2.9e-05,2.9e-05,2.4e-05,9e-06,3e-06,1.1e-05,6e-06,7e-06,1.2e-05,1.7e-05,1.4e-05,4.2e-05,4e-05,1.9e-05,1.5e-05,8e-06,2.4e-05,1.4e-05,7e-06,9e-06,7e-06,7e-06,9e-06,5e-06,8e-06,4e-06,3e-06
1e-06,3e-06,2e-06,2e-06,1e-06,4e-06,2e-06,3e-06,2e-06,1e-06,1e-06,2e-06,2e-06,4e-06,1.9e-05,2e-05,5e-05,3.2e-05,9e-06,5e-06,9e-05,0.000187,5e-05,4e-06,9.7e-05,6e-05,3.9e-05,1.6e-05,0.000199,0.000182,0.000178,0.000218,9.7e-05,7e-06,8.9e-05,0.000212,0.000174,0.000229,0.000249,0.000183,0.000188,0.000139,0.000223,0.000237,0.000114,0.000225,3.8e-05,0.000222,0.000219,0.000235,1e-04,0.000417,0.000304,8.7e-05,0.00025,0.000154,0.00028,7.2e-05,0.000183,1e-04,2e-05,0.000269,0.000241,0.000263,0.000202,0.000128,0.000402,0.000155,0.000173,0.000146,0.000208,0.000414,0.000163,0.000211,0.000167,0.000189,8.2e-05,2.2e-05,6.6e-05,3.2e-05,2e-05,1.8e-05,2.1e-05,2e-05,1.8e-05,3e-06,3.2e-05,1e-05,2.6e-05,2.6e-05,4e-05,0.000403,0.00025,9.7e-05,2.4e-05,2e-05,1.7e-05,7e-06,8e-06,5e-06,5e-06,7e-06,3e-06,9e-06,6e-06,4e-05,2.9e-05,2.2e-05,1.6e-05,9e-06,1.8e-05,1.7e-05,1.3e-05,1.6e-05,1.6e-05,1.9e-05,1.2e-05,4e-06,5e-06,2e-06,0
1e-06,2e-06,3e-06,3e-06,2e-06,4e-06,1e-06,2e-06,2e-06,1e-06,0,2e-06,2e-06,1e-06,8e-06,1.3e-05,3.6e-05,2e-06,3e-06,6e-06,7.7e-05,0.00014,1e-04,5.3e-05,6.8e-05,2.2e-05,2e-06,3.1e-05,0.000107,3.2e-05,0.000155,0.000125,6.1e-05,1.3e-05,3.9e-05,0.000135,0.00022,5.7e-05,0.000237,0.000308,0.000308,0.000375,0.000391,0.000568,0.000318,0.000179,0.000193,9.7e-05,4.3e-05,0.000184,6.6e-05,0.000396,0.00018,0.000136,0.000124,0.00023,0.000225,0.000114,0.000346,0.00011,6.7e-05,0.000325,0.000109,0.000378,0.000165,0.000113,0.000248,0.00025,2.4e-05,8.9e-05,0.000158,0.000121,8.7e-05,0.000138,4.8e-05,9.1e-05,5.8e-05,1.7e-05,6.3e-05,9e-06,2e-06,7e-06,5e-06,5e-06,2.2e-05,2.3e-05,2.1e-05,1.4e-05,2.3e-05,1.6e-05,1.8e-05,0.000285,0.00014,5.7e-05,2e-05,1.5e-05,6e-06,4e-06,2e-06,1e-05,1.2e-05,7e-06,5e-06,5e-06,1e-06,2.6e-05,1.5e-05,8e-06,1e-06,1e-05,5e-06,9e-06,8e-06,9e-06,2e-06,6e-06,4e-06,2e-06,2e-06,1e-06,3e-06
0,1e-06,1e-06,0,1e-06,3e-06,0,1e-06,2e-06,1e-06,0,0,0,2e-06,1.7e-05,4e-06,3.4e-05,1.5e-05,9e-06,9e-06,7.8e-05,6.7e-05,3.6e-05,2.5e-05,3.4e-05,9e-06,1e-06,1.9e-05,4.2e-05,4.6e-05,0.000103,3.3e-05,2.4e-05,1.6e-05,1.7e-05,0.000135,0.000195,8.9e-05,9.3e-05,0.000188,0.000465,6.8e-05,0.000194,0.00031,0.000245,8.6e-05,7.1e-05,7.7e-05,0.000217,0.000127,0.000131,0.000332,0.000301,0.000184,0.000135,0.000108,0.000285,0.000284,0.000203,0.000106,4.7e-05,0.000193,0.000205,0.000307,0.000193,9.4e-05,0.000108,0.000132,0.000105,0.000125,9.9e-05,0.000149,0.000118,4.4e-05,9.4e-05,1.5e-05,1e-05,7e-06,5.4e-05,5e-06,7e-06,5e-06,4e-06,7e-06,1.3e-05,3e-06,4e-06,1.2e-05,5e-06,4e-06,3.6e-05,0.000109,4.4e-05,1.5e-05,7e-06,6e-06,4e-06,2e-06,2e-06,8e-06,8e-06,2e-06,4e-06,3e-06,3e-06,2.4e-05,7e-06,3e-06,7e-06,6e-06,7e-06,4e-06,5e-06,4e-06,4e-06,3e-06,4e-06,2e-06,3e-06,1e-06,2e-06
1e-06,0,1e-06,1e-06,0,3e-06,1e-06,1e-06,1e-06,1e-06,0,1e-06,0,2e-06,1.7e-05,5e-06,2.5e-05,1e-05,5e-06,4e-06,7.4e-05,5.6e-05,2.3e-05,3.2e-05,2.4e-05,3e-06,1e-06,1.2e-05,1.9e-05,2.4e-05,6.3e-05,1.1e-05,8e-06,1.3e-05,8e-06,0.000128,0.000174,0.000124,0.000119,0.000107,0.00033,7.4e-05,5.4e-05,0.000469,0.000339,4.6e-05,7.7e-05,0.000106,0.000157,0.000103,5.1e-05,5.9e-05,9e-05,8.6e-05,0.000207,6.7e-05,0.000196,0.000284,0.000311,4.5e-05,9.8e-05,2.2e-05,4.9e-05,0.000176,0.00013,0.000109,5.6e-05,8.4e-05,5.4e-05,0.000107,7.8e-05,0.000129,7.7e-05,3.4e-05,6e-05,1.9e-05,2e-05,6e-06,5.7e-05,8e-06,8e-06,8e-06,5e-06,5e-06,1e-06,7e-06,3e-06,1.5e-05,4e-06,6e-06,4.2e-05,2.1e-05,7e-06,5e-06,6e-06,6e-06,2e-06,2e-06,1e-06,8e-06,6e-06,2e-06,3e-06,2e-06,4e-06,2e-05,3e-06,3e-06,7e-06,5e-06,2e-06,4e-06,6e-06,3e-06,2e-06,3e-06,4e-06,1e-06,4e-06,1e-06,3e-06
0,0,1e-06,1e-06,0,3e-06,0,1e-06,1e-06,1e-06,1e-06,1e-06,0,2e-06,1.4e-05,7e-06,2.8e-05,8e-06,8e-06,3e-06,7.1e-05,6.6e-05,2.6e-05,2.1e-05,3.2e-05,5e-06,2e-06,7e-06,8e-06,2.2e-05,5.4e-05,1.1e-05,4e-06,7e-06,1e-05,0.00013,0.000204,8.8e-05,0.000127,0.000161,0.000183,0.000122,4.4e-05,0.000318,0.000202,3e-05,8e-05,9.4e-05,0.000197,0.000111,3.5e-05,0.000147,0.000198,0.000125,0.000161,0.000158,0.000177,0.00016,0.000233,2.2e-05,8.8e-05,2e-05,2.3e-05,0.000163,9.9e-05,9.3e-05,1.7e-05,7e-05,5.5e-05,0.000105,4.8e-05,0.000145,8.6e-05,4.3e-05,6.1e-05,1.4e-05,1e-05,3e-06,5.4e-05,5e-06,3e-06,4e-06,2e-06,2e-06,0,7e-06,2e-06,1.4e-05,2e-06,3e-06,4.3e-05,3.4e-05,2e-06,3e-06,1e-06,5e-06,1e-06,3e-06,1e-06,8e-06,6e-06,2e-06,3e-06,3e-06,3e-06,1.7e-05,2e-06,3e-06,9e-06,2e-06,2e-06,4e-06,7e-06,3e-06,1e-06,4e-06,3e-06,1e-06,4e-06,0,3e-06
