0.956469,0.812983,0.738181,0.675482,0.618493,0.60764,0.675793,0.709482,0.627027,0.520186,0.527367,0.568537,0.567072,0.53647,0.498772,0.490538,0.518592,0.49122,0.474457,0.478994,0.410511,0.369791,0.368155,0.346458,0.33567,0.348282,0.351384,0.323291
1.134917,0.980701,0.905027,0.824557,0.740759,0.719433,0.792132,0.821628,0.74284,0.650864,0.664024,0.710355,0.691971,0.65248,0.615162,0.595726,0.627047,0.592869,0.56633,0.567706,0.496754,0.451626,0.446661,0.420729,0.40551,0.42164,0.423353,0.383632
1.4526,1.281181,1.20553,1.080595,0.942717,0.903868,0.978085,0.995928,0.938344,0.885897,0.907492,0.964266,0.912439,0.855099,0.816153,0.777288,0.82402,0.77591,0.719971,0.709139,0.638256,0.590432,0.582858,0.546134,0.521563,0.545971,0.540629,0.477226
1.706724,1.530465,1.467105,1.286632,1.099946,1.042244,1.084752,1.082531,1.07668,1.073705,1.092359,1.162019,1.079008,1.007299,0.965677,0.921283,0.998676,0.926533,0.831698,0.81044,0.739996,0.697987,0.69161,0.632981,0.591812,0.626402,0.613258,0.532672
1.722875,1.607372,1.578379,1.33597,1.122276,1.058685,1.053941,1.04577,1.100594,1.106752,1.092724,1.17184,1.081221,1.022069,0.989389,0.943267,1.039566,0.950421,0.83517,0.81233,0.741819,0.710631,0.704528,0.62481,0.572558,0.6175,0.606286,0.530795
1.434216,1.405631,1.438769,1.198237,1.000548,0.964948,0.93717,0.935213,1.01981,0.985384,0.91966,0.984258,0.922003,0.896581,0.884677,0.829964,0.895997,0.830543,0.733474,0.714197,0.654204,0.616028,0.597917,0.538115,0.502444,0.528679,0.513441,0.461106
1.21199,1.198899,1.264809,1.131511,0.972108,0.921942,0.923411,0.960515,1.033286,0.96086,0.838538,0.835365,0.793824,0.779777,0.815135,0.755948,0.732015,0.749498,0.692932,0.646501,0.633949,0.602239,0.566313,0.530926,0.491338,0.460398,0.43434,0.396538
1.586693,1.506786,1.613228,1.545427,1.326914,1.182627,1.23461,1.355037,1.41013,1.290044,1.116999,1.099117,1.035935,1.004324,1.117607,0.990309,0.841107,0.9696,0.922471,0.808519,0.86952,0.865175,0.80725,0.746497,0.659987,0.577198,0.550643,0.512689
2.466123,2.286309,2.401798,2.33049,2.044264,1.801604,1.837421,2.017837,2.100345,1.946558,1.719697,1.701507,1.587775,1.546125,1.728925,1.475966,1.252849,1.522422,1.423102,1.186479,1.306593,1.332807,1.247146,1.142201,0.970793,0.836364,0.818097,0.77772
3.604936,3.318634,3.293836,3.209528,3.016915,2.74332,2.635699,2.759444,2.902836,2.755088,2.491319,2.471774,2.351402,2.321394,2.456255,2.013829,1.78428,2.211323,2.057206,1.689774,1.84071,1.882553,1.779525,1.663904,1.368506,1.141812,1.105158,1.061754
4.855613,4.554535,4.094571,3.897108,4.000289,3.907161,3.571424,3.436253,3.673622,3.580486,3.356708,3.351341,3.264595,3.22945,3.156314,2.568645,2.384412,2.873676,2.695901,2.259146,2.383152,2.392149,2.282887,2.243593,1.831254,1.429157,1.29729,1.239598
6.054163,5.831291,4.755364,4.339964,4.717186,5.08846,4.6028,4.057228,4.441812,4.331508,4.177707,4.29136,4.299919,4.178303,3.83455,3.287632,3.113549,3.482064,3.317975,2.894662,2.856882,2.781098,2.697163,2.756454,2.243844,1.627521,1.349286,1.262527
6.697907,6.657254,5.222951,4.669533,5.086088,6.03343,5.508147,4.454303,4.964777,4.728547,4.59439,4.994473,5.263911,4.988927,4.35019,3.962663,3.891778,4.147146,3.876251,3.445381,3.170284,3.011744,2.993238,3.084831,2.542499,1.787908,1.371096,1.225015
6.166406,6.333412,5.140617,4.660427,4.945239,6.2195,5.63507,4.202182,4.765897,4.516909,4.333883,4.979069,5.668586,5.331687,4.489044,4.215308,4.288986,4.448319,3.97519,3.503427,3.035585,2.869427,2.906625,2.993412,2.568614,1.839121,1.375864,1.167197
4.47651,4.790858,4.237129,3.920145,3.988796,5.108799,4.658182,3.336061,3.746155,3.647262,3.513396,4.146811,5.018811,4.731556,3.961085,3.872254,3.959089,3.915902,3.359485,2.987569,2.608455,2.442137,2.384118,2.492471,2.313626,1.720479,1.313403,1.111652
2.938772,3.270619,3.16833,3.055793,3.163866,3.651222,3.411014,2.81113,3.009602,2.999473,2.992984,3.350219,3.775578,3.430619,3.058408,3.389313,3.359638,2.982938,2.596895,2.44407,2.285992,2.034828,1.717257,1.883376,2.10089,1.717361,1.345651,1.21284
3.033357,3.323433,3.364044,3.326276,3.439585,3.360271,3.250118,3.282202,3.47231,3.495068,3.461321,3.579069,3.558466,3.06283,3.098468,3.713641,3.42683,2.762681,2.56066,2.588322,2.468669,1.992457,1.477922,1.823999,2.383429,2.037573,1.577401,1.483974
4.341197,4.614435,4.679502,4.396734,4.502884,4.304795,4.029975,4.074483,4.391086,4.854625,5.07473,4.907268,4.565954,4.047548,4.322806,4.94701,4.354914,3.320277,2.883731,2.9362,2.783323,2.137283,1.690067,2.188326,2.806294,2.471339,1.927301,1.801849
6.074482,6.178566,6.324921,5.816699,5.984814,5.916379,5.424579,5.170397,5.4517,6.562512,7.189353,6.633424,5.848051,5.239391,5.758607,6.411962,5.719608,4.468691,3.669335,3.710145,3.543922,2.579972,2.129432,2.798289,3.337911,2.995698,2.448307,2.253685
7.521266,7.483035,7.730876,6.981421,7.300385,7.765442,7.022099,6.251008,6.389573,7.906102,8.887267,8.03539,6.774539,5.968908,6.486532,7.034759,6.520166,5.60625,4.703547,4.578304,4.526108,3.3826,2.767854,3.569322,3.989908,3.522141,3.016612,2.742118
8.046081,8.132883,8.217905,6.949272,7.468786,8.844436,7.889722,6.613879,6.769605,8.21322,9.314466,8.416459,7.108993,6.284808,6.137627,6.188131,6.10469,6.065631,5.386929,4.874001,5.013081,4.059623,3.226117,3.977165,4.399479,3.952156,3.517234,3.08129
7.333926,7.412282,7.026083,5.545963,6.525947,8.620553,7.520489,5.95046,6.432157,7.631182,8.437165,7.545847,6.710753,6.436059,5.371514,4.565163,4.966015,5.884927,5.461734,4.484573,4.707481,4.214525,3.225881,3.676598,4.193734,4.267629,4.22811,3.48109
5.83785,5.756165,4.868573,3.792805,5.236284,7.129521,6.091321,4.610821,5.161195,6.031843,6.402902,6.019318,5.951142,6.17215,4.742852,3.541406,4.085101,5.377654,4.965644,3.605406,3.849981,3.745048,2.84734,2.993082,3.461842,4.185507,4.715579,3.874288
4.460182,4.346318,3.515986,3.202903,4.537566,5.489162,4.604343,3.488463,3.821658,4.287483,4.184533,4.363185,5.000745,5.412849,4.12474,3.024765,3.231316,4.240329,3.944566,2.877037,3.346512,3.152918,2.237774,2.201796,2.588177,3.649922,4.476407,3.941897
3.955016,3.810469,3.273453,3.233913,4.403909,4.871632,3.954848,3.140949,3.529086,3.743463,3.381082,3.705284,4.419839,4.610258,3.552262,2.535711,2.25578,2.837079,2.688485,2.225964,3.018581,2.841688,1.957144,1.792799,2.139852,3.0352,3.588663,3.400681
3.546171,3.441949,3.427248,3.317472,4.164733,4.710083,3.811675,3.105219,3.506525,3.706276,3.432255,3.510173,3.762331,3.660982,2.820192,2.051291,1.748926,2.047325,1.860967,1.625037,2.386899,2.5027,2.005488,1.774675,1.94654,2.491027,2.520997,2.299647
2.623584,2.730835,3.437623,3.217295,3.342508,4.034414,3.463638,3.012414,3.343974,3.407735,3.265474,3.028423,2.902412,2.800227,2.178322,1.834491,1.776272,1.863099,1.656093,1.373507,1.70569,1.982448,2.009529,1.794441,1.665291,2.007089,1.866984,1.372582
1.605121,1.995134,3.206398,2.891477,2.230303,2.841416,2.677205,2.449562,2.717897,2.784603,2.702702,2.227853,1.93509,1.997918,1.764045,1.719705,1.757929,1.650196,1.429016,1.141477,1.165085,1.410352,1.645832,1.543649,1.302828,1.414362,1.459047,1.08883
1.207182,1.581504,2.763695,2.400735,1.559596,1.868041,1.755664,1.671699,1.94136,2.14375,2.055004,1.533268,1.217808,1.273514,1.285334,1.409111,1.508277,1.422284,1.198894,0.887939,0.821171,1.005691,1.136184,1.04275,0.906836,0.943397,1.187496,1.092761
1.112594,1.228123,1.970294,1.723359,1.289734,1.466055,1.229753,1.218843,1.448376,1.544498,1.408468,1.110192,1.000162,1.101543,1.116972,1.088772,1.113054,1.150409,1.065106,0.878276,0.760376,0.808418,0.773063,0.57804,0.577864,0.724582,0.964941,0.968154
1.058381,0.948156,1.216681,1.283088,1.191227,1.226759,0.905685,0.8728,1.172012,1.154748,0.922621,0.78894,0.785624,0.94709,0.965069,0.783486,0.74081,0.869233,0.920276,0.859135,0.698495,0.668162,0.567742,0.324945,0.368666,0.535138,0.673471,0.681026
0.913791,0.827787,0.846154,1.035039,1.032511,1.035994,0.790217,0.632364,0.950218,0.913449,0.697898,0.61903,0.549036,0.647376,0.658714,0.463382,0.465395,0.648343,0.715739,0.708036,0.567963,0.503551,0.427333,0.251207,0.291198,0.394893,0.419875,0.400156
0.753773,0.750201,0.731789,0.878297,0.89679,0.931406,0.734748,0.455419,0.614047,0.643756,0.548352,0.457483,0.345162,0.391698,0.414883,0.294473,0.3334,0.448869,0.5102,0.564425,0.427822,0.328303,0.312721,0.223587,0.232674,0.25434,0.233205,0.243738
0.629811,0.623441,0.667151,0.786779,0.831772,0.846955,0.646304,0.353939,0.32177,0.390227,0.412205,0.339513,0.243602,0.294832,0.341228,0.281957,0.298619,0.336712,0.42333,0.494003,0.330308,0.225005,0.232467,0.18262,0.171251,0.166279,0.132877,0.157757
0.495985,0.441706,0.598243,0.698379,0.718214,0.728983,0.553699,0.347277,0.236713,0.281815,0.332706,0.323515,0.279103,0.266563,0.321741,0.29715,0.286005,0.290698,0.3671,0.406275,0.270767,0.215203,0.186419,0.140859,0.167712,0.155672,0.104956,0.124972
0.376541,0.321327,0.564118,0.62727,0.612971,0.628646,0.501599,0.365989,0.27539,0.29852,0.299159,0.338762,0.356068,0.282877,0.349801,0.342854,0.289677,0.276151,0.328116,0.359621,0.27467,0.219161,0.168853,0.132085,0.170533,0.164572,0.102733,0.108485
0.278475,0.268019,0.524254,0.638432,0.55946,0.473901,0.410097,0.365556,0.295352,0.323975,0.301356,0.371597,0.457255,0.371883,0.380774,0.377475,0.347362,0.30435,0.284056,0.327226,0.28784,0.215461,0.180371,0.13798,0.153543,0.162597,0.111284,0.122029
0.197872,0.258835,0.482364,0.601391,0.465251,0.320071,0.378534,0.42856,0.318051,0.341274,0.338294,0.391584,0.519019,0.450243,0.353997,0.361796,0.408485,0.355442,0.267449,0.28406,0.261858,0.204375,0.206535,0.137701,0.123255,0.136776,0.111099,0.136747
0.157833,0.296859,0.480558,0.482956,0.339325,0.23559,0.405826,0.513755,0.355688,0.336389,0.384591,0.386195,0.496118,0.467072,0.282684,0.298945,0.414968,0.378204,0.310994,0.304123,0.255671,0.192429,0.207102,0.130618,0.107203,0.106804,0.104345,0.135745
0.158351,0.342282,0.466177,0.33903,0.259027,0.208957,0.396886,0.54421,0.381411,0.367638,0.46706,0.384774,0.39485,0.408733,0.226809,0.227524,0.349728,0.336854,0.337361,0.349783,0.269925,0.173582,0.176623,0.11405,0.092466,0.08692,0.104541,0.117919
