-0.004107,-0.003231,-0.002827,-0.003358,-0.004979,-0.004485,-0.002468,-0.00328,-0.002906,-0.003387,-0.002436,-0.001663,-0.001969,-0.002761,-0.00325,-0.003037,-0.003319,-0.003442,-0.003327,-0.004118,-0.004744,-0.003749,-0.004865,-0.005842,-0.005393,-0.004226,-0.00428,-0.003237
-0.00179,-0.001503,-0.000915,-0.000489,-0.000854,-0.001197,-0.000199,-0.000692,-0.001229,-0.001526,-0.000147,0.000439,-3.5e-05,-0.000679,-0.001676,-0.001064,0.000444,0.000484,-0.000656,-0.000851,-0.002633,-0.001675,-0.001368,-0.00118,0.000188,0.001901,2.5e-05,-0.000926
0.00162,0.001244,0.000968,0.000952,0.001235,0.001384,0.000476,0.000488,0.00033,0.000647,0.000105,-0.000391,0.000227,0.000643,0.00051,-3.9e-05,-0.000369,0.000378,0.000523,0.000802,0.000602,0.000418,0.001901,0.002407,0.001594,0.000849,0.001225,0.000724
0.001986,0.001642,0.000948,0.000727,0.000591,0.001112,3.9e-05,0.00046,0.000889,0.001538,-2.4e-05,-0.000897,-0.000249,0.000443,0.000891,0.000274,-0.001345,-0.000568,0.000712,0.000488,0.001527,0.000633,0.001358,0.001195,-0.000323,-0.002376,-0.000301,0.000807
-0.000194,3.3e-05,0.000127,0.00071,0.000747,0.000341,0.000428,0.000908,0.000519,0.000729,0.001043,0.000682,0.000279,0.00027,0.000182,0.001398,0.002012,0.001097,0.00126,0.000978,0.00022,0.000197,4.5e-05,-0.00019,0.001021,0.001695,0.001368,0.00122
-0.002677,-0.00204,-0.001474,-0.001451,-0.001931,-0.002188,-0.000955,-0.001224,-0.00158,-0.002121,-0.00059,-0.000258,-0.000738,-0.001099,-0.001602,-0.000675,0.000137,-0.000919,-0.001124,-0.001087,-0.002298,-0.001481,-0.002101,-0.002647,-0.00127,0.000784,-0.00019,-0.000699
-0.000972,-0.001096,-0.000844,-0.001579,-0.002003,-0.001696,-0.001208,-0.001692,-0.001123,-0.001731,-0.001505,-0.000757,-0.000908,-0.000835,-0.001027,-0.002296,-0.002918,-0.002006,-0.002031,-0.001824,-0.00098,-0.000781,-0.0016,-0.001739,-0.002678,-0.003322,-0.003098,-0.002141
0.002715,0.001964,0.001794,0.001765,0.00318,0.002794,0.001365,0.001718,0.001797,0.00194,0.000906,0.001119,0.00118,0.00161,0.002097,0.000887,0.001194,0.001906,0.001044,0.001572,0.002595,0.002095,0.002388,0.003834,0.002988,0.001344,0.000881,0.000516
0.001621,0.001714,0.001199,0.001539,0.002659,0.002314,0.001317,0.001936,0.001687,0.002294,0.001455,0.000885,0.001099,0.00113,0.002039,0.002512,0.002871,0.002196,0.0018,0.001942,0.002122,0.001376,0.001893,0.002784,0.003048,0.003431,0.003306,0.001726
-0.001745,-0.001176,-0.001301,-0.00133,-0.002624,-0.002116,-0.000911,-0.001077,-0.000639,-0.000718,-0.000458,-0.000676,-0.000738,-0.001225,-0.000967,1.4e-05,-0.000778,-0.001345,-0.000382,-0.00093,-0.00061,-0.001142,-0.001979,-0.003541,-0.003402,-0.00259,-0.001329,-0.000436
-0.001369,-0.001467,-0.000837,-0.000713,-0.001707,-0.001479,-0.000347,-0.000951,-0.000984,-0.001734,-0.000683,-0.000284,-0.000349,-0.000608,-0.001289,-0.000925,-0.000716,-0.001005,-0.000725,-0.000509,-0.000796,-0.000398,-0.000845,-0.002122,-0.001784,-0.001683,-0.001916,-0.000475
0.00099,0.000613,0.000788,0.001031,0.001696,0.001354,0.000863,0.000609,7e-06,-7.2e-05,0.000167,0.000231,0.000578,0.000944,0.00054,-0.000106,0.000576,0.000937,9.1e-05,0.000616,3.9e-05,0.00096,0.002009,0.003044,0.003227,0.003057,0.001701,0.000722
0.000919,0.000944,0.000353,8e-05,0.000173,0.000148,-0.000483,-0.000378,-0.000102,0.000668,-0.000331,-0.000668,-0.00039,-0.000111,5.3e-05,-0.000826,-0.001566,-0.000385,-0.000517,-0.001443,-0.001176,-0.000575,-7e-06,0.001187,0.000423,-0.000592,-4.1e-05,-0.000666
-0.000682,-0.000376,-0.000578,-0.000869,-0.001168,-0.000809,-0.000943,-0.000719,-0.000423,9.4e-05,-0.000362,-0.000482,-0.000588,-0.00108,-0.001327,-0.000798,-0.001096,-0.000972,-0.000475,-0.001307,-0.001445,-0.001567,-0.001967,-0.002418,-0.002418,-0.002439,-0.001596,-0.000943
-0.000775,-0.000721,-0.000446,-0.000106,0.000443,0.000625,0.00057,0.000689,0.00011,-0.000129,0.000856,0.000877,0.000569,0.000153,-0.000341,0.000899,0.001802,0.000836,0.001008,0.001847,0.000986,0.000262,0.000162,-0.00107,-7.4e-05,0.002058,0.001543,0.001154
0.000394,-0.000121,9.8e-05,0.000328,0.000285,0.000182,0.00047,0.00028,0.000279,-0.00033,0.000391,0.000497,0.000228,0.000844,0.000997,0.000583,0.000386,0.000217,0.000569,0.001343,0.001442,0.00125,0.001195,0.000836,0.000509,0.00071,0.000864,0.000756
0.000944,0.000628,0.000667,0.000385,-0.000188,-0.000482,-0.000287,-0.000349,0.000244,0.000171,-0.000735,-0.00034,-0.000332,0.000428,0.001055,-0.000467,-0.001074,-0.000787,-0.000768,-0.000941,-0.000154,0.000405,0.000162,0.001135,0.000221,-0.002187,-0.001902,-0.000826
2.2e-05,0.000746,0.000455,0.000259,0.000801,0.000407,8e-06,0.000436,0.000376,0.000984,2.9e-05,0.000175,0.000232,-1.8e-05,0.000516,0.000401,0.000771,0.000557,-0.000214,-0.000337,-0.000445,-5e-04,-0.000367,0.00081,0.001496,0.001229,0.000147,-0.000334
-0.001065,-0.000418,-0.000554,-0.000678,-0.000326,-0.000247,-0.000244,-3.1e-05,-0.000151,-0.000164,0.000362,-1.3e-05,-8.1e-05,-0.000975,-0.000955,0.000347,0.000481,0.00041,0.000251,9e-05,-0.000261,-0.001047,-0.000983,-0.001193,-0.000535,0.001109,0.001147,1.6e-05
