0.021766,0.026166,0.034405,0.043136,0.044129,0.054467,0.064827,0.068348,0.071393,0.071188,0.0843,0.104483,0.118176,0.133494,0.149694,0.148088,0.141373,0.134808,0.132478,0.155714,0.186857,0.183922,0.155893,0.150058,0.158215,0.168801,0.166771,0.159872
0.026798,0.031921,0.042763,0.053504,0.05438,0.068307,0.082203,0.087623,0.090969,0.089312,0.10582,0.133588,0.152607,0.171933,0.194773,0.190112,0.179312,0.171765,0.165872,0.193226,0.228742,0.228309,0.198873,0.191234,0.199631,0.211075,0.20914,0.200261
0.03514,0.041878,0.056992,0.070253,0.071635,0.093044,0.113528,0.12249,0.125869,0.121284,0.1426,0.183236,0.211613,0.235587,0.269572,0.261919,0.244189,0.234384,0.221498,0.253747,0.296074,0.301281,0.270808,0.260145,0.26815,0.279943,0.277152,0.264033
0.040773,0.049783,0.066889,0.08045,0.084648,0.113379,0.139196,0.151203,0.154359,0.146806,0.167563,0.214014,0.247688,0.272773,0.313115,0.305609,0.283177,0.272913,0.257228,0.286912,0.331359,0.343933,0.31564,0.301972,0.306449,0.314659,0.309788,0.295049
0.044419,0.056889,0.072689,0.085693,0.096483,0.129381,0.154499,0.165684,0.173799,0.168931,0.182595,0.220851,0.248253,0.272079,0.310005,0.3124,0.290528,0.2776,0.273233,0.291402,0.330194,0.355378,0.328836,0.305539,0.30853,0.315226,0.305047,0.292522
0.055929,0.078929,0.097551,0.114046,0.1405,0.182657,0.197054,0.196003,0.221714,0.234115,0.239568,0.267222,0.289909,0.326114,0.364316,0.382474,0.35732,0.315314,0.31987,0.341437,0.388628,0.430894,0.413653,0.386959,0.384127,0.380244,0.35734,0.343202
0.089706,0.136048,0.16662,0.193375,0.250026,0.318089,0.319788,0.305287,0.366659,0.395251,0.378223,0.408294,0.452121,0.54266,0.614514,0.644923,0.594419,0.485224,0.478068,0.528792,0.6398,0.720997,0.69549,0.659636,0.64292,0.609289,0.558374,0.539973
0.150279,0.235983,0.285209,0.334236,0.444535,0.547323,0.521735,0.493529,0.624791,0.675475,0.606083,0.657448,0.763566,0.95634,1.100465,1.142531,1.023938,0.798019,0.760861,0.857207,1.104084,1.259687,1.206593,1.136264,1.087567,1.005634,0.90383,0.892011
0.230552,0.375416,0.450722,0.536491,0.728902,0.865121,0.781667,0.735668,0.986159,1.075165,0.906978,0.982834,1.200642,1.571406,1.828445,1.872725,1.647167,1.233991,1.130159,1.295871,1.770646,2.054287,1.964187,1.819651,1.716278,1.569979,1.38721,1.391967
0.309661,0.518897,0.624481,0.75827,1.042454,1.19357,1.031162,0.977145,1.37378,1.50802,1.221107,1.308468,1.667313,2.283972,2.66336,2.670999,2.325124,1.704639,1.522206,1.769965,2.494888,2.930838,2.819217,2.577545,2.423705,2.233075,1.95876,1.95627
0.352117,0.591976,0.71408,0.891286,1.229818,1.364078,1.147691,1.107089,1.600062,1.759694,1.404685,1.474301,1.929909,2.762348,3.197279,3.12164,2.717607,2.000756,1.781676,2.092678,2.940469,3.445166,3.352009,3.068563,2.921187,2.734747,2.39723,2.341937
0.319313,0.522979,0.634142,0.821693,1.127528,1.220639,1.031309,1.020588,1.465683,1.60527,1.30275,1.331229,1.760638,2.60867,2.962206,2.805896,2.474015,1.879772,1.707154,2.002163,2.705935,3.122559,3.105376,2.925222,2.856835,2.716479,2.383935,2.24874
0.225463,0.345109,0.427373,0.577256,0.778973,0.860784,0.769836,0.762974,1.023721,1.104411,0.951764,0.949,1.222186,1.807189,1.977899,1.83223,1.684752,1.370997,1.291837,1.498975,1.883825,2.102615,2.125697,2.088037,2.121018,2.070776,1.841087,1.686863
0.177503,0.231872,0.298722,0.411595,0.506961,0.620703,0.602927,0.550128,0.68253,0.728742,0.663012,0.644619,0.725286,0.919487,0.963893,1.007228,1.132017,1.017029,0.882101,1.000312,1.20705,1.306804,1.294892,1.255149,1.295454,1.351499,1.34205,1.369314
0.251741,0.296288,0.385055,0.544796,0.601725,0.772168,0.79029,0.703761,0.875442,0.913233,0.810529,0.74937,0.663786,0.653266,0.816822,1.21896,1.638481,1.509388,1.091466,1.093585,1.494891,1.71259,1.547043,1.406763,1.379245,1.460622,1.72494,2.021598
0.399552,0.468358,0.585847,0.81521,0.876546,1.145322,1.231577,1.118676,1.332599,1.367839,1.239615,1.154324,0.961045,0.923573,1.259625,1.960381,2.673173,2.482878,1.739985,1.683981,2.369053,2.684148,2.360502,2.198028,2.132414,2.220277,2.781138,3.351739
0.554908,0.652517,0.773016,1.052138,1.140424,1.505807,1.711968,1.629457,1.851819,1.867896,1.729434,1.637369,1.341403,1.325711,1.876426,2.846645,3.777813,3.521512,2.489688,2.353024,3.272877,3.590062,3.163123,3.119401,2.98178,3.024735,3.932674,4.808619
0.666628,0.773154,0.846673,1.127541,1.265072,1.689251,2.087482,2.144067,2.325928,2.307368,2.172355,2.102015,1.740397,1.780726,2.559911,3.582457,4.406195,4.162474,3.148673,2.893363,3.727691,3.852665,3.475737,3.761534,3.619078,3.573753,4.629955,5.634463
0.723403,0.803398,0.804874,1.068267,1.289717,1.799371,2.415414,2.601581,2.735965,2.718189,2.483166,2.44387,2.182357,2.293896,3.292381,4.004459,4.236376,4.084301,3.468413,3.193062,3.59423,3.342469,3.153572,3.993027,4.228845,4.041347,4.539658,5.212437
0.755896,0.780582,0.725085,0.997233,1.349388,1.981923,2.637589,2.766449,2.950806,3.025131,2.6057,2.547945,2.442828,2.599488,3.73456,4.080429,3.622987,3.442801,3.240686,3.189786,3.370518,2.898063,2.794145,4.12811,4.99504,4.570096,4.026484,4.16951
0.73094,0.7126,0.617495,0.881788,1.303789,1.901541,2.377194,2.374936,2.646932,2.815613,2.341466,2.30223,2.30102,2.450166,3.560458,3.866467,3.230078,2.920016,2.747855,2.895688,3.214283,2.798807,2.602691,3.914097,5.082224,4.558294,3.40613,3.294066
0.566052,0.544317,0.4723,0.675651,1.064604,1.499407,1.697901,1.589116,1.894144,2.076715,1.67855,1.70425,1.823931,1.946262,2.730554,3.044404,2.611301,2.417965,2.293018,2.395743,2.642378,2.305896,2.105195,3.016091,3.983794,3.522443,2.519019,2.532376
0.35869,0.37155,0.347353,0.465923,0.733099,0.95559,0.984445,0.908825,1.125273,1.238395,1.017081,1.09493,1.275764,1.318879,1.634149,1.871188,1.749775,1.749451,1.707235,1.671783,1.697586,1.495422,1.437437,1.800572,2.253928,2.040174,1.58291,1.755207
0.291141,0.339359,0.351081,0.383886,0.449963,0.525328,0.572442,0.644379,0.747145,0.724489,0.685475,0.888871,1.071958,1.005978,1.104443,1.289566,1.339268,1.394766,1.350817,1.311725,1.359783,1.259176,1.125193,1.027081,1.111946,1.254705,1.2317,1.324053
0.337127,0.405095,0.41391,0.414812,0.392341,0.448869,0.562298,0.722264,0.766741,0.636112,0.674559,0.996647,1.230069,1.227346,1.309003,1.454569,1.489056,1.499638,1.507088,1.570632,1.820316,1.739664,1.356682,1.058976,1.016063,1.231713,1.290061,1.409705
0.386722,0.466835,0.446475,0.449569,0.447663,0.526031,0.660722,0.808644,0.830663,0.728265,0.854401,1.146726,1.303929,1.425201,1.602509,1.704509,1.727967,1.725967,1.750133,2.018723,2.503868,2.376673,1.759515,1.293344,1.166195,1.348073,1.40495,1.679463
0.374128,0.465996,0.41427,0.428025,0.469505,0.543778,0.671504,0.790203,0.847128,0.863784,1.041694,1.203061,1.241585,1.424382,1.649929,1.657536,1.730128,1.820092,1.855161,2.378345,2.982557,2.757585,2.00079,1.386673,1.212044,1.416073,1.542526,1.92481
0.288293,0.369767,0.305784,0.331876,0.421087,0.474395,0.551977,0.672542,0.819957,0.935453,1.074876,1.106551,1.039784,1.207225,1.451957,1.331777,1.412877,1.703259,1.806344,2.376112,2.841711,2.549997,1.878723,1.273671,1.112633,1.284425,1.444574,1.847773
0.209103,0.24341,0.184774,0.210368,0.322758,0.364397,0.402344,0.539499,0.715694,0.835673,0.879679,0.841949,0.777951,0.93721,1.210441,1.063675,1.025647,1.396222,1.543169,1.880604,2.088513,1.814368,1.400358,1.060193,0.964281,1.00948,1.085855,1.354829
0.169644,0.177884,0.149124,0.182309,0.290429,0.308356,0.293199,0.430613,0.581217,0.608212,0.577962,0.589514,0.633711,0.762943,0.986505,0.960843,0.879876,1.10665,1.215483,1.254846,1.26056,1.067482,0.858254,0.894786,0.86836,0.76304,0.702726,0.755848
0.138395,0.148552,0.154997,0.20345,0.292776,0.311448,0.245398,0.314509,0.430427,0.424965,0.431395,0.487884,0.560028,0.658467,0.836162,0.872217,0.845979,1.03209,1.120418,0.980017,0.75502,0.595787,0.575559,0.776461,0.832103,0.674112,0.522618,0.514653
0.121058,0.151888,0.172734,0.201862,0.265765,0.296655,0.227536,0.251961,0.35591,0.357458,0.404734,0.440649,0.449398,0.526343,0.618471,0.694089,0.727756,0.847511,0.917864,0.766567,0.560187,0.526274,0.612639,0.719369,0.75634,0.603399,0.424325,0.464572
0.103492,0.146032,0.165489,0.169969,0.232232,0.252615,0.19363,0.235825,0.352179,0.355864,0.390595,0.377294,0.338308,0.399318,0.388488,0.491194,0.562207,0.556815,0.632302,0.583028,0.471317,0.513442,0.604361,0.599434,0.564627,0.437482,0.316419,0.386652
0.083767,0.120038,0.129764,0.127591,0.17815,0.17312,0.136763,0.192888,0.314718,0.334448,0.328084,0.320076,0.306106,0.331546,0.281449,0.345109,0.419445,0.388995,0.531677,0.55012,0.420262,0.424338,0.475994,0.485295,0.392271,0.258996,0.22255,0.317538
0.089116,0.098785,0.099801,0.110234,0.124147,0.101041,0.100967,0.151238,0.256861,0.292926,0.240309,0.246681,0.27056,0.262168,0.242818,0.261975,0.285937,0.336811,0.528038,0.51875,0.371461,0.307179,0.299516,0.368,0.305788,0.184738,0.179706,0.282122
0.099631,0.082958,0.076609,0.092747,0.093642,0.078874,0.093266,0.129101,0.200074,0.218764,0.159489,0.200049,0.256351,0.220733,0.222589,0.229036,0.196893,0.279763,0.477395,0.465488,0.313245,0.224767,0.222854,0.28576,0.264318,0.180183,0.188273,0.255643
0.097539,0.073485,0.070974,0.081368,0.07941,0.068827,0.081882,0.098446,0.135352,0.14735,0.122198,0.164664,0.242132,0.221096,0.241726,0.251829,0.17766,0.227735,0.408328,0.447064,0.281734,0.187488,0.198534,0.220665,0.243172,0.231485,0.214813,0.227041
0.077495,0.054527,0.067534,0.078615,0.062309,0.052568,0.05998,0.079285,0.119122,0.138371,0.126898,0.133211,0.209698,0.214144,0.263316,0.270274,0.194977,0.253051,0.447832,0.459575,0.268471,0.193122,0.197446,0.202653,0.259971,0.28557,0.22148,0.214798
0.051878,0.038234,0.059729,0.082216,0.064041,0.051356,0.049566,0.0791,0.129435,0.14428,0.142569,0.137087,0.186062,0.20215,0.279835,0.30093,0.24333,0.328179,0.52021,0.45308,0.282279,0.23031,0.228948,0.245113,0.298598,0.315313,0.224123,0.188195
0.040942,0.038597,0.051619,0.086302,0.074332,0.060754,0.057416,0.0938,0.131991,0.125645,0.145232,0.165493,0.19007,0.194871,0.279054,0.315901,0.278934,0.378275,0.551959,0.406887,0.27446,0.24928,0.24315,0.272493,0.292206,0.303162,0.236995,0.15682
