8e-05,0.000304,0.000193,0.000106,0.000187,0.000278,0.000174,0.000239,0.000181,5.1e-05,2e-06,0.000202,9.5e-05,1e-04,0.000121,5.9e-05,7.4e-05,2.4e-05,3.1e-05,2.9e-05,6.8e-05,0.000127,-0.003429,-0.016634,-0.014023,-0.008151,-0.003321,-0.034294,-0.030793,-0.016362,-0.008589,-0.002723,-0.001364,-0.000663,0.00032,0.000979,-0.000558,-0.007489,-0.008463,-0.017473,-0.017204,-0.017367,-0.013741,-0.013704,-0.017306,-0.014263,-0.013916,-0.010787,-0.011458,-0.010098,-0.007598,-0.02008,-0.015812,-0.003836,-0.011056,-0.011358,-0.009245,-0.009281,-0.011048,-0.019797,-0.016334,-0.014249,-0.010582,-0.015253,-0.010376,-0.007315,-0.006613,-0.012545,-0.010724,-0.007777,-0.009079,-0.003403,-0.005244,-0.004898,-0.015822,-0.008599,-0.003676,-0.002527,-0.001917,-0.001024,-0.000596,-0.000787,-0.001049,-0.000852,-0.000482,-0.000103,-0.000912,-0.003835,-0.001572,-0.002347,-0.000514,-0.001891,-0.001329,-0.000554,-0.000512,-0.000127,-0.002123,-0.001689,-0.00049,-0.000248,-0.000174,-9.7e-05,-0.000816,-0.000656,-0.000987,-0.002422,-0.005881,-0.00342,-0.001308,-0.00017,-7.3e-05,7.4e-05,7e-05,0.00022,0.00025,0.000422,0.000175,0.000109,8.8e-05,0.000256,0.000176
-6.8e-05,0.000116,2.4e-05,9e-06,-0.000121,-8e-05,-0.000134,2e-06,-0.000177,1.3e-05,1.1e-05,-4e-05,4e-06,-6.4e-05,-4.7e-05,-0.000163,-5.3e-05,8.4e-05,-2.5e-05,-4.3e-05,-4.1e-05,0.000171,-0.000505,0.000457,0.007707,0.0036,0.001303,0.013219,0.017742,0.007024,0.005202,0.002798,0.001155,0.000107,0.000686,-1.3e-05,-0.017856,-0.013065,-0.002443,-0.002236,0.000279,0.006518,-0.007708,-0.004777,-0.000423,-0.000861,-0.001519,-0.005412,-0.005072,-0.002054,-0.00313,-0.000129,0.003321,-0.001982,-0.000623,-0.005238,-0.007607,-0.00315,-0.003959,0.007377,0.000274,-0.002942,-0.00556,-0.003557,-0.003904,-0.005909,-0.005261,-0.003582,0.000364,-0.004833,-0.004845,-0.00621,-0.004477,-0.004584,0.000268,0.000615,7e-05,-0.00075,-0.001417,-0.001314,-0.000575,-0.000346,-0.000126,-0.000597,-0.00084,-0.000283,-0.002126,0.001726,0.001786,-0.000591,-0.000474,0.000189,0.001589,0.001555,0.000982,0.000336,0.000842,0.000879,0.000494,3e-04,0.000137,0.000164,-0.000115,0.000506,0.000149,0.000595,0.003843,0.002503,0.001133,0.000166,-8.8e-05,-6.1e-05,-7.6e-05,4.6e-05,4.1e-05,5.3e-05,-0.000112,-3.8e-05,4.7e-05,0.000137,0.000121
-4.2e-05,6.4e-05,-7.2e-05,4.6e-05,-2.5e-05,-1.5e-05,4.7e-05,-7.2e-05,-7e-05,-7.2e-05,-9.1e-05,-0.000159,-7.7e-05,-8.1e-05,-7.3e-05,-5.8e-05,-0.000141,-0.000144,-8.3e-05,-7e-05,-5.6e-05,-0.000196,-0.000516,-0.000743,-0.003502,-0.001691,-3.7e-05,-0.000231,-0.009562,-0.005498,-0.002312,-0.002375,-0.000784,7.3e-05,-0.000199,-0.000205,-0.003571,-0.001301,-0.002637,-0.00651,-0.009986,-0.010042,-0.007322,-0.003918,-0.004954,-0.00924,-0.003523,-0.002722,-0.0012,-0.001694,-0.002529,-0.006582,-0.006073,-0.001154,-0.004176,-0.00452,0.000938,-0.001626,2.2e-05,-0.008263,-0.00865,-0.000423,0.003184,0.004238,-0.004591,-0.001745,-0.001132,-0.002607,-0.001702,-0.001798,0.002252,-0.001193,0.00148,0.001355,-0.004168,-0.003913,-0.002614,-0.000243,0.000432,0.000146,0.000301,0.000305,-1.5e-05,0.000245,-0.000238,-0.000568,-0.000878,-0.001808,-0.000904,-0.00066,-0.001085,-0.001905,-0.002358,-0.000837,-0.000332,0.00023,0.000262,-3e-04,-0.000479,-0.000207,-0.000127,-0.000135,-0.000388,-0.000216,-9.9e-05,-0.00123,-0.00164,-0.000893,-0.00027,-9e-06,-8e-05,-0.000127,-0.00014,-5.7e-05,-2.6e-05,-0.000196,4e-05,7e-06,-3.3e-05,9.5e-05,7e-05
5e-06,0.000149,-8e-06,3.5e-05,-2.9e-05,2.2e-05,-2.1e-05,-0.000109,-1.6e-05,-0.000103,5e-06,-4.9e-05,2e-06,-6e-05,-5e-06,8.4e-05,-7.1e-05,6e-05,-6.2e-05,-5.9e-05,3e-06,-0.000104,-8.6e-05,-0.001162,0.000174,0.000618,-0.00011,-0.003308,0.008941,0.0053,0.002467,0.001172,2e-04,0.000146,-1.8e-05,0.000429,0.000576,0.001767,-0.002614,0.002813,0.004782,0.00723,-0.000552,0.003716,0.002111,0.003395,0.003376,0.001512,0.001117,0.003478,0.003303,0.006062,0.001939,0.002405,0.003859,0.001557,-0.005869,-0.000354,-0.002989,0.004158,0.007534,0.002484,-0.002034,-0.00497,-0.001513,0.002064,0.00188,0.000448,-0.00138,0.004983,0.001255,0.001623,0.001839,-0.000444,0.002978,0.003304,-0.000429,-0.000569,-0.000819,-0.00022,2.9e-05,-0.000241,-0.000339,0.000416,0.000241,4.4e-05,0.00063,0.001251,0.000587,-0.000267,-0.001454,0.000999,-0.000166,0.000277,0.000179,0.000475,-0.000274,-0.000117,-9.7e-05,0.000108,0.000104,5.5e-05,-0.000315,0.000234,0.000127,0.000805,0.000668,-1.3e-05,-0.000144,-0.000215,-2.7e-05,1e-05,1.5e-05,1e-05,8.9e-05,-7.3e-05,-7e-05,-8.6e-05,0.000118,-1e-06,-8.5e-05
0.000157,5.8e-05,-2.5e-05,7.2e-05,2.4e-05,0.000144,0.000103,4.1e-05,7.6e-05,4.5e-05,-6.9e-05,-1.5e-05,-5.2e-05,-1.3e-05,0.000111,8.6e-05,4.7e-05,-2.1e-05,4.2e-05,9e-05,9.3e-05,-1.1e-05,-0.000102,0.001547,-0.001188,1e-04,0.000638,-0.000918,-0.006366,-0.005938,-0.003096,-0.001254,-0.00093,-0.000311,-0.000386,0.000422,0.000488,0.001236,-0.002883,0.001498,-0.001803,-0.005934,-0.002373,-0.000381,-0.002241,-0.001739,-0.002332,0.000833,-0.000332,0.001003,0.001261,-0.000423,-0.00622,-0.00503,-0.002487,0.001686,0.001622,0.001257,-2.4e-05,-0.002827,0.000391,-0.001937,-0.001572,0.005871,0.00237,-0.000857,-0.000291,0.001768,0.001407,-0.000905,-0.00062,0.002178,-0.00044,0.001296,0.000898,0.000128,-0.000185,-0.000594,0.000452,0.000311,-6.5e-05,-0.000648,0.000274,-0.000337,0.000216,0.000194,0.000808,0.000356,-0.000485,-0.000298,-0.00029,-0.001568,-0.001913,-0.000575,-0.000167,3.5e-05,-4e-05,0.000103,6e-05,-6.6e-05,1.3e-05,-3.2e-05,0.000229,-0.000269,-0.00021,-0.000363,-0.000268,0.000503,0.000324,0.000145,0.000141,3.8e-05,5e-06,2.3e-05,0.000141,4.5e-05,5.1e-05,-4.2e-05,7.6e-05,-2.2e-05,-5.9e-05
3.1e-05,-2.5e-05,-5.6e-05,5e-05,1.1e-05,-6.2e-05,0.000117,5.8e-05,-3.3e-05,-2.7e-05,1e-05,5e-06,3e-06,6e-06,5.9e-05,3.1e-05,1.4e-05,2.3e-05,2e-06,-8.4e-05,-4.6e-05,3.2e-05,1.4e-05,-0.001194,-0.000276,-0.000942,-0.000579,0.000391,0.006173,0.002514,0.001864,0.001726,0.000686,0.000392,0.000168,0.00042,-0.000226,-0.00109,0.001848,-0.0045,0.006025,0.005716,0.004107,0.003807,0.00288,-0.001581,0.000619,0.000865,0.00094,-0.000842,0.000156,0.001181,0.003389,0.004698,0.003393,0.002175,0.000326,0.000722,0.00162,0.002956,0.001686,-0.001532,0.001604,-0.001274,0.003079,0.000574,-0.001555,5.7e-05,-0.001562,-0.001214,-0.003539,-0.001492,0.001023,0.001643,-6.4e-05,-0.00064,0.000253,-0.000331,-3.1e-05,-0.000328,0.000222,0.000343,0.00037,4.2e-05,0.000237,0.000241,0.000354,-0.000592,-0.000195,0.000714,0.00131,-6.1e-05,0.000158,0.000401,6.7e-05,0.000227,-0.000227,0.000133,-5.5e-05,-5.2e-05,8e-06,6.3e-05,-8e-06,4.2e-05,0.000109,0.000639,0.000468,-0.000257,-0.000199,-0.000139,-2.2e-05,3.1e-05,6e-05,1.2e-05,0.000142,-1e-05,2.8e-05,4.8e-05,5e-05,-3.8e-05,-0.00011
3.7e-05,-0.000127,-0.000145,-9.4e-05,2.9e-05,-6.4e-05,6e-06,-5e-05,-6.5e-05,-1.4e-05,-9.7e-05,-5e-06,-4.6e-05,-3.9e-05,-5.7e-05,-8.1e-05,1.6e-05,-9.9e-05,5.7e-05,-4.3e-05,-9.3e-05,3.2e-05,0.000123,-0.000431,-0.000158,0.001365,0.000649,-8.3e-05,-0.001206,-0.001917,-0.001046,-0.001896,-0.000886,-0.000489,-2.1e-05,0.000366,-4.9e-05,-0.001502,0.001943,0.000784,-0.008489,-0.001342,-0.004062,-0.005703,-0.001834,0.001636,-0.001162,-0.000999,-0.001704,-0.00238,0.002538,-0.000381,-0.00279,-0.000673,0.00241,-0.002739,-5.5e-05,-0.002161,0.000856,-0.000621,-0.002097,-0.000209,0.001613,-0.001873,-0.000874,0.000922,-0.001881,0.002732,0.002863,0.000905,0.000707,-0.000834,-0.00099,-0.000993,-0.001296,-0.001929,-0.000618,0.000769,0.000433,0.000355,0.000232,-0.000261,-6.1e-05,-1.5e-05,-0.00017,0.000122,-0.000136,8.7e-05,-0.001302,-0.000388,-0.000461,0.000954,-0.00016,-0.000749,-0.000479,-0.000131,-0.000133,-0.000108,-0.000114,-6.5e-05,-0.000227,-7.7e-05,-0.000105,-7e-05,-0.000196,-0.000339,-0.000747,-0.000327,-0.000204,-0.000102,-9.5e-05,-7.6e-05,-3.2e-05,-4.9e-05,4.3e-05,-5.4e-05,-9e-06,-6.3e-05,-0.000104,-7.1e-05,-9.6e-05
-4.9e-05,5e-06,0,-2.4e-05,-0.000102,-3.4e-05,-1.9e-05,-2.1e-05,-3.8e-05,1.7e-05,-8e-06,-4.9e-05,-8.1e-05,1.2e-05,-5.6e-05,-3.9e-05,-0.000155,-7.7e-05,-2.4e-05,-2.1e-05,-1.3e-05,2.4e-05,6.6e-05,7.2e-05,-0.000214,-0.002152,-0.000915,-0.000166,-0.00142,0.000245,0.000405,0.001258,0.000553,-3.3e-05,0.000106,0.000165,-0.00028,-0.004669,-0.002343,-0.002103,0.001053,0.000702,0.002723,0.00955,0.001625,-0.001506,0.001307,0.001631,-8.2e-05,-0.00044,-0.000984,-0.001518,0.002392,0.000978,-4.7e-05,0.002802,0.003581,9.4e-05,-0.002174,-0.001212,0.001003,0.004249,-9.3e-05,-0.000537,-0.001072,-0.002938,0.000397,-0.004748,0.000249,-0.00112,0.000919,0.002845,-0.000301,-0.000243,0.001012,0.000425,4.9e-05,-0.000242,-9.5e-05,-0.000167,-0.000421,0.000301,-0.000365,-0.000199,-1e-05,-0.000214,3e-05,-5.1e-05,0.000916,0.000335,-0.000217,0.001002,0.000548,0.000549,0.000116,5.1e-05,-2.4e-05,7.2e-05,5.6e-05,-6e-05,-4e-06,-9.1e-05,-8.3e-05,5.3e-05,-0.00018,8.2e-05,-0.000205,-5e-06,0.000103,2.7e-05,4.4e-05,1.5e-05,1.4e-05,4e-06,-2e-05,-6.1e-05,3.9e-05,-1.9e-05,2e-06,-5.3e-05,-3e-05
-1.6e-05,-2.6e-05,8e-06,-3.7e-05,-1.6e-05,-2e-05,-6.1e-05,-3.9e-05,2.8e-05,2e-05,8e-06,-3.1e-05,3e-05,2.4e-05,-1e-06,-4.6e-05,2.9e-05,-9e-06,-1.4e-05,-1.4e-05,-2e-05,-1.3e-05,6.6e-05,0.000321,0.000307,0.001472,0.000796,4.5e-05,0.001998,-0.002709,-0.000576,-0.001274,-0.000213,-0.000153,-0.000153,7.6e-05,-0.000183,0.001642,-0.002356,-0.000547,-0.002909,-0.000536,-0.001402,-0.008402,-0.001063,0.00033,-0.00137,-0.001305,0.001779,-0.00097,0.00047,0.000313,-0.00205,-0.002657,-0.000106,-0.00223,-0.000825,-5.8e-05,0.002277,0.00232,0.000326,-0.001146,-0.002758,8.6e-05,0.00183,0.000428,-0.000739,0.000367,4.5e-05,0.000483,0.000762,-0.000173,-0.001347,-0.000174,-0.000214,3.9e-05,0.000298,0.00071,0.000122,-5.9e-05,-3e-06,6.9e-05,0.000111,0.000209,0.000118,-0.000112,-4.9e-05,-0.000139,-0.000174,0.000621,0.000603,0.000223,4.5e-05,-0.000269,-0.000417,-8.7e-05,-0.000105,3.8e-05,-1.3e-05,5.5e-05,-4.5e-05,-9.6e-05,9.1e-05,-0.000171,-0.000145,-6.5e-05,0.000188,-1.8e-05,-0.000239,-0.000126,-4.4e-05,1.5e-05,1e-06,2.4e-05,-3.3e-05,-7.2e-05,7.4e-05,8e-06,-5.8e-05,-5.1e-05,-6.4e-05
1e-06,3.4e-05,-4e-06,-2.9e-05,5e-06,-5e-06,4.4e-05,-3.6e-05,6.2e-05,1.7e-05,3.7e-05,5e-06,2.3e-05,4.2e-05,-8e-06,1.9e-05,3.4e-05,3.4e-05,-8e-06,2.1e-05,4.5e-05,5.1e-05,-4.3e-05,7.6e-05,0.000113,0.000348,3.6e-05,-0.000113,-0.001763,0.000759,-0.000401,1e-04,0.000239,-5e-06,-0.000223,-0.000169,-0.000139,0.001998,-0.000934,0.002327,0.001211,-0.001688,0.000208,-0.000912,0.001998,-0.000889,0.000581,-0.000306,0.001039,0.000364,-0.000857,-0.00033,-1e-04,-8.4e-05,-0.000461,-0.000536,0.000325,0.00056,-0.000784,-0.001138,-0.00101,0.000431,0.002351,3.9e-05,-0.001536,0.000264,0.001012,0.001026,-0.001447,-0.00119,-0.001487,-0.000692,0.001066,-0.000404,-0.000468,-2e-06,-0.000853,-0.000321,0.000164,0.00024,0.000343,-2.1e-05,-0.000362,-0.000114,-5.6e-05,-1.2e-05,0.000163,-1.2e-05,4e-06,0.000406,-0.000219,0.000196,-0.000104,1.6e-05,-0.000102,-5.5e-05,-4e-06,-1e-06,3.1e-05,-4.5e-05,4.5e-05,3e-05,-0.00013,7.1e-05,-0.000117,-1e-05,3e-06,0.000155,-4e-06,2e-06,-1.7e-05,5.8e-05,6e-06,6.7e-05,1.2e-05,-7e-06,4e-05,5.2e-05,0,1.5e-05,1.8e-05
3e-05,-1.9e-05,-5e-06,-3.5e-05,0,-4e-06,7e-06,-4e-06,6.7e-05,2.7e-05,3.9e-05,-5.1e-05,-1.5e-05,5.2e-05,0,9e-06,0,4.4e-05,5.2e-05,2.9e-05,-3.5e-05,1.5e-05,-8.2e-05,0.000196,-9.4e-05,-0.001052,-0.000296,-0.000163,-2.1e-05,0.001216,0.000539,-0.000375,-0.000499,6.8e-05,7.1e-05,-4.5e-05,-3.9e-05,-0.000822,0.002416,-0.000136,-0.001153,-0.000611,-0.000608,-0.000629,-0.001337,0.001067,0.000199,-0.00146,-0.001453,0.000393,0.001492,0.000623,-0.000286,0.000112,-7.8e-05,-0.001678,-0.001699,-0.000118,0.00193,0.000444,0.00084,-0.001364,-0.000394,0.000421,0.000441,0.000397,0.00013,0.000266,-0.000521,-0.000155,0.000844,-0.00082,0.001148,-0.000199,0.000157,0.000165,0.000724,0.000195,-0.00065,-0.000333,1.2e-05,6e-06,-0.000118,-0.000111,-0.000151,0.000225,-4.1e-05,-0.000106,-0.000364,-0.000102,-0.000262,-0.001106,-0.000491,-0.000189,1.6e-05,3.2e-05,-8.9e-05,-6.3e-05,-2.7e-05,-1.2e-05,-4.3e-05,-7e-06,3.9e-05,0,0.000259,-3.1e-05,4.8e-05,-0.000147,4.9e-05,1.1e-05,2.5e-05,1.2e-05,7e-06,0,-3.5e-05,-1.7e-05,-1.5e-05,-2.3e-05,3.4e-05,-2.3e-05,9e-06
7e-06,-2.3e-05,-8e-06,-1.7e-05,-2.3e-05,-5e-06,-5.7e-05,2e-06,-1.3e-05,4e-06,-4.2e-05,3e-06,-2.7e-05,-5e-06,1.3e-05,-1.6e-05,-5e-06,-2.9e-05,-1.8e-05,2e-06,8e-06,1e-06,1.2e-05,0.000263,-7.5e-05,-0.00045,-7.8e-05,1e-05,-0.000248,-0.000281,-0.000849,3.1e-05,0.000364,0.000138,1.3e-05,-0.000121,-8e-06,0.000658,-5e-05,0.000647,0.001383,0.002179,-0.000358,0.000711,-0.000621,0.001321,-0.000159,0.001582,0.000121,-0.000628,-0.00077,0.000527,0.000524,-0.000596,0.001509,-0.000168,0.001778,0.001033,-0.000742,0.000408,-0.001275,0.000661,-3e-06,0.000428,0.000585,0.001057,0.000846,0.000402,2e-05,0.001221,-0.000528,0.000674,-0.00084,0.00026,-0.000469,0.000208,0.000208,-0.000105,-5.6e-05,-8.4e-05,8.1e-05,-0.000131,-6.8e-05,-8.3e-05,-8.5e-05,-0.000114,3.3e-05,2.8e-05,0.000108,-2.9e-05,-8.2e-05,-0.000104,-8.6e-05,-3e-05,-0.00026,-0.000195,2.6e-05,-8e-06,-1.6e-05,4.3e-05,-2.5e-05,1.5e-05,-2.4e-05,-4e-06,-0.000105,-0.000121,-0.000151,5e-06,-7.4e-05,-5e-05,-1.5e-05,-6.4e-05,-2e-05,-7.2e-05,-1.7e-05,9e-06,-2.8e-05,-4.4e-05,-1.8e-05,-3.1e-05,4e-06
-2.9e-05,-2.4e-05,-1.6e-05,1.4e-05,-2.7e-05,-3.2e-05,-1.4e-05,-1.2e-05,-2e-06,3e-06,-1e-05,-2.2e-05,1e-05,-1.7e-05,1.9e-05,1e-06,5e-06,2.2e-05,-1.9e-05,-1e-05,7e-06,-7e-06,1.7e-05,1.8e-05,2.5e-05,0.000378,0.000152,-0.000233,0.000162,-0.000271,0.000404,0.000126,-0.00016,-0.000137,-0.000144,7.6e-05,-5e-06,-0.000823,0.002839,0.000198,0.000987,-0.001241,9e-06,-0.000858,-0.000418,-0.000481,0.000644,-0.00139,-0.000986,-0.000119,-0.000271,0.000339,4e-04,-0.000147,-0.001404,0.000805,-0.000508,0.00076,-0.001183,-0.000261,-0.000549,-0.000773,-0.001546,-9.5e-05,-0.000523,-0.000828,-0.000552,-6.8e-05,9.5e-05,-0.000326,0.000593,-0.000911,-9.1e-05,0.000224,0.000335,0.000152,-0.000891,0.000121,-5.4e-05,4e-05,-8.2e-05,1.4e-05,2.1e-05,6.4e-05,0.000134,-0.000137,-7.7e-05,-2e-06,1.3e-05,-4.4e-05,-0.000149,0.000194,-0.000236,1.7e-05,0.000117,-6e-06,-0.000102,-2.1e-05,-7.9e-05,-1.4e-05,-2e-05,-6e-06,-3.8e-05,-1.2e-05,0.00014,1.8e-05,-2.6e-05,4.8e-05,6.8e-05,1.9e-05,1.1e-05,9e-06,2e-06,-4e-05,-1e-05,-1.8e-05,-5e-06,-6.7e-05,7e-06,1.3e-05,-1.1e-05
-8e-06,-1.1e-05,-1e-06,9e-06,-2.4e-05,0,1.2e-05,-1.7e-05,-1.1e-05,-1.1e-05,-7e-06,9e-06,1e-06,-3e-06,9e-06,5e-06,-6e-06,-2.3e-05,-1.9e-05,-6e-06,4e-06,-8e-06,1.6e-05,-0.000106,2e-06,0.00025,-0.000205,0.000259,8e-06,0.001057,0.00013,-0.000218,2e-04,-3e-05,-8e-06,3e-06,1e-05,-0.000141,-0.002126,-0.00044,-0.000489,0.000199,0.000124,0.002326,0.002297,8.4e-05,-0.000256,0.001655,0.000293,0.000446,-0.000524,-0.000306,-0.000176,0.000698,-0.00018,-0.000152,7.9e-05,9.8e-05,0.000384,-0.000272,0.000946,0.000585,0.000615,-0.000988,-0.000533,0.000224,0.000945,0.000102,0.00151,0.000383,0.000442,0.000203,0.000358,-0.000217,-1e-06,-5.1e-05,0.000622,-4.5e-05,-4.5e-05,0.000119,-4.1e-05,-6.7e-05,2.6e-05,-0.000128,2e-06,-2.9e-05,-0.000116,-1.3e-05,-1.9e-05,-0.000225,0,0.000287,0.000163,-3.9e-05,-2.8e-05,-1e-04,3.2e-05,-1.4e-05,1.3e-05,2.6e-05,1.1e-05,3.9e-05,2.5e-05,6e-06,-2.6e-05,-7.9e-05,-3e-06,-2.7e-05,-7.1e-05,-3.1e-05,1.1e-05,-2.8e-05,-1e-06,5e-06,9e-06,7e-06,-3e-06,-2.9e-05,1.5e-05,1.1e-05,1.2e-05
1e-06,1.2e-05,0,3e-06,2.5e-05,-2e-06,3e-06,1e-06,-1.2e-05,-1e-06,1e-05,7e-06,-1.3e-05,0,4e-06,3e-06,8e-06,7e-06,7e-06,7e-06,1e-06,-1e-06,4e-06,-7e-06,-2.8e-05,9.4e-05,6.1e-05,-8.5e-05,-0.000311,-0.001113,-5e-05,0.000178,-8.7e-05,-5.8e-05,-4.3e-05,-4.1e-05,-3.4e-05,-4e-06,-0.001049,3.1e-05,0.000878,-0.001037,0.000458,0.000351,-0.000302,-0.000598,0.000153,-0.000562,-9.5e-05,0.000143,-8.3e-05,-2.6e-05,-0.000237,-0.000133,-0.000698,-0.000257,-0.00024,-0.000434,-0.000162,-0.000326,-0.001019,-0.000693,0.000477,0.000345,5.7e-05,0.00032,5.6e-05,0.000658,-5.2e-05,-0.000128,-0.000932,-0.000197,0.000345,-4.9e-05,2e-05,-2e-05,7.6e-05,-6.3e-05,-2.6e-05,-0.000102,-1.9e-05,7.3e-05,0.000153,9.7e-05,2.4e-05,2.6e-05,3.3e-05,-1e-06,0.000132,0.000117,-7.1e-05,-0.000191,-2.2e-05,-5e-06,0.000203,0,-2.6e-05,-1.6e-05,-3e-05,-2.5e-05,5e-06,2.8e-05,1.2e-05,4e-06,-0.000115,5e-05,-9.3e-05,-1.9e-05,2.5e-05,6.3e-05,-5e-06,8e-06,4e-06,-1.1e-05,1.6e-05,-6e-06,-1.3e-05,5e-06,-8e-06,-3e-06,-1.4e-05
-9e-06,0,1e-06,1e-06,-9e-06,-3e-06,-6e-06,9e-06,9e-06,-3e-06,0,2e-06,1e-06,-7e-06,3e-06,-4e-06,-1.7e-05,1.1e-05,-2e-06,-3e-06,6e-06,-7e-06,-3e-06,-8.6e-05,2.2e-05,-2.2e-05,-7.7e-05,-0.000183,0.000662,0.000698,0.000406,-0.000107,3.2e-05,2.9e-05,6e-05,-2.1e-05,1e-05,6.6e-05,0.00117,0.000528,-0.000635,0.001276,-0.000415,-0.000791,-0.000635,0.000701,0.00028,0.000357,0.000101,7e-05,0.000226,-0.000201,1.1e-05,0.000112,-7.2e-05,-8.6e-05,-2.6e-05,4.7e-05,0.000363,-8.2e-05,0.000424,-7.4e-05,0.00039,9.7e-05,2.5e-05,-0.000535,-0.000435,-0.000794,-0.000797,-2e-06,0.000577,0.000152,-0.000431,0.000257,0.000173,-0.000266,-0.00023,-0.000175,4.4e-05,2e-06,6.7e-05,4.1e-05,-1.5e-05,-4.7e-05,-3e-05,-9.8e-05,3e-06,0,-7e-05,-0.000421,3e-06,-0.000219,-6.7e-05,-3.2e-05,1.5e-05,-4.7e-05,-1e-06,-1e-05,-6.8e-05,0,-9e-06,4e-06,9e-06,-1e-06,1.9e-05,-1e-05,5e-05,-1.9e-05,-3.5e-05,-4.1e-05,1.4e-05,-9e-06,-1e-06,3e-06,2.1e-05,-4e-06,-1e-05,-2e-06,-1.7e-05,-1e-06,8e-06
-3e-06,6e-06,-1e-06,0,8e-06,-1e-06,8e-06,-1.3e-05,8e-06,-4e-06,1e-06,2e-06,4e-06,0,-5e-06,2e-06,1.3e-05,-4e-06,-1e-06,1e-06,-5e-06,-2e-06,8e-06,-0.000101,4e-06,-0.000228,1.7e-05,7e-06,-0.000288,-0.00043,-0.000637,-6.7e-05,8.8e-05,-2.3e-05,-2.2e-05,2.6e-05,-1.7e-05,0.000177,0.000232,0.000323,-1.7e-05,-9.3e-05,-0.000102,0.001738,0.000724,-0.000588,-0.000509,-0.000528,0.000462,-0.00041,0.000271,-0.00016,0.000279,-0.000145,0.000194,0.000169,-0.000242,-2e-06,-0.000241,0.000246,0.000135,-8.6e-05,-0.000476,8.1e-05,0.000134,-0.000169,-0.000142,0.000152,-0.000174,-3.8e-05,-0.000238,-0.000107,-2.6e-05,-8.1e-05,-7.1e-05,-6.9e-05,-2.1e-05,0.000234,3e-05,3.5e-05,3.9e-05,-8.5e-05,2.3e-05,1.7e-05,2.6e-05,6e-06,1.4e-05,-1e-06,-6.6e-05,0.000128,1.8e-05,6.7e-05,-1.5e-05,1.6e-05,-0.000161,2.3e-05,-9e-06,-2e-06,2.6e-05,-1e-06,2.9e-05,-8e-06,1e-05,2e-06,-1.3e-05,-1e-05,-1.9e-05,1.1e-05,2.3e-05,3.9e-05,-1.4e-05,1.2e-05,1e-06,1e-06,-1e-05,-3e-06,-9e-06,-4e-06,-4e-06,-3e-06,4e-06
5e-06,-1e-05,0,-1e-05,0,3e-06,1.1e-05,-4e-06,3e-06,1e-06,5e-06,-4e-06,1e-06,-2e-06,-8e-06,-2e-06,2e-06,1.3e-05,-1e-06,5e-06,-2e-06,-4e-06,8e-06,5e-05,-2.2e-05,0.000196,2.8e-05,-5e-06,2.9e-05,4.5e-05,0.000548,5e-06,-0.000172,8e-06,3.7e-05,-3.6e-05,4e-06,0.000337,-0.000171,-0.000155,-0.001069,-0.000114,0.000263,-0.000776,-0.000298,9.3e-05,0.00027,0.000246,-0.000185,0.000343,-0.000369,-0.000183,-0.000305,-0.000307,-0.00031,5.7e-05,0.000313,-0.00045,3e-04,-0.000103,0.000111,0.000603,-0.000506,-2.9e-05,-0.000122,0.000164,1.3e-05,0.000102,0.000195,3.7e-05,6e-05,0.000279,4.4e-05,-0.000158,-1.5e-05,4.8e-05,7.4e-05,0.000154,9.5e-05,-3.7e-05,2.7e-05,-4e-06,-2.4e-05,-8e-06,2e-06,-2e-06,8e-06,6e-06,4.8e-05,2.6e-05,0,4.6e-05,-4.5e-05,-1.1e-05,4.5e-05,-4.1e-05,-1.7e-05,9e-06,-1e-05,-1.1e-05,-1.8e-05,-6e-06,0,-9e-06,-2e-06,4.9e-05,3.9e-05,1.5e-05,-9e-06,-3.9e-05,7e-06,-3e-06,-1e-06,-2e-06,1e-06,-2e-06,-7e-06,-1e-06,-2e-06,-5e-06,4e-06
8e-06,-2e-06,-4e-06,-7e-06,2e-06,-5e-06,5e-06,4e-06,-4e-06,-1e-06,-8e-06,-2e-06,-9e-06,-6e-06,-3e-06,-1e-06,-3e-06,-2e-06,2e-06,-2e-06,-1e-06,-2e-06,0,2.2e-05,-2e-05,1.1e-05,8.1e-05,2.6e-05,4.2e-05,9.4e-05,-0.000443,-5.5e-05,7.4e-05,8e-06,-3e-05,1.3e-05,-5e-06,-0.000457,3.1e-05,-0.000139,0.00064,5.2e-05,-0.000131,-0.000101,-0.000194,0.000115,-2.6e-05,-0.000255,8.1e-05,-9.2e-05,-0.000164,-0.000118,0.000202,9.9e-05,0.000102,-0.000192,-9.8e-05,2.1e-05,9.8e-05,0.000207,-0.000167,-1.1e-05,0.000636,0.000228,3.9e-05,0.00027,-0.000206,-0.000166,6.7e-05,-6.8e-05,0.000104,-5.7e-05,0.000191,-5.4e-05,1.5e-05,-2.5e-05,-3.5e-05,-0.000274,-1.6e-05,-3.2e-05,-2.3e-05,3e-06,-7e-06,-1.9e-05,-1.5e-05,1e-05,3e-06,-1.4e-05,7e-06,-0.000137,-5e-06,1e-05,3.1e-05,5e-06,-7.1e-05,3.4e-05,2e-06,-7e-06,-1.7e-05,6e-06,-7e-06,1e-05,3e-06,1.2e-05,1.6e-05,-1e-06,-4.2e-05,-2.6e-05,-1.5e-05,1e-05,3e-06,-5e-06,1e-06,-6e-06,-4e-06,-2e-06,-4e-06,-2e-06,-3e-06,-1e-06,-1e-06
2e-06,-6e-06,-2e-06,-2e-06,0,1e-06,-7e-06,-2e-06,-7e-06,-3e-06,-2e-06,-3e-06,0,-4e-06,2e-06,-1e-06,-2e-06,-4e-06,3e-06,1e-06,1e-06,-1e-06,1e-06,-1.3e-05,1.1e-05,-0.000149,-0.000109,-5e-06,-0.000139,5.6e-05,0.000277,-8e-06,1.8e-05,-1e-06,3.4e-05,-6e-06,0,0.000169,-0.000119,-4e-05,-0.00013,4.1e-05,0.00025,-0.000399,-0.000236,2e-06,2.2e-05,3.8e-05,-0.000204,-0.00021,4.7e-05,5.7e-05,-0.000135,-0.000449,5.8e-05,0.000151,-0.00015,0.000413,1e-06,9e-05,0.000172,0.000186,3e-06,7e-05,1.4e-05,1.7e-05,4.5e-05,5.9e-05,0.000124,-2.9e-05,-5.1e-05,-0.00015,-1.9e-05,9e-05,3.2e-05,2.4e-05,-8.1e-05,9e-05,-6e-06,-3.8e-05,-1.7e-05,2.9e-05,-4.5e-05,1e-06,-8e-06,-4e-06,-2e-06,-7e-06,-2.6e-05,6.4e-05,2e-05,8.3e-05,-3e-06,-1.9e-05,2.3e-05,9e-06,-2.7e-05,8e-06,1.9e-05,-1e-06,-5e-06,-4e-06,-6e-06,-4e-06,-2e-06,9e-06,7e-06,2.2e-05,5e-06,-4e-06,-3e-06,0,-1e-06,-1e-06,-7e-06,-2e-06,2e-06,-6e-06,1.2e-05,0,-1e-06
3e-06,2e-06,0,-1e-06,-5e-06,-2e-06,-3e-06,-5e-06,-9e-06,0,-5e-06,0,4e-06,-4e-06,2e-06,-1e-06,4e-06,0,0,-2e-06,1e-06,0,-1e-06,4.3e-05,1.7e-05,7.9e-05,9.7e-05,-1.8e-05,0.000148,1.3e-05,-0.000178,-4.7e-05,-4e-06,-6e-06,-7e-06,1e-06,-2e-06,-0.000302,0.000271,5.2e-05,0.000284,-8e-06,-0.000179,0.000211,0.000214,6e-06,0.00011,1.3e-05,2.8e-05,6.6e-05,0.000193,0.000104,0.000113,0.000322,0.000338,-0.000183,-0.000266,3.9e-05,2e-06,-7.4e-05,4e-05,-0.00035,1.9e-05,-0.000185,2.7e-05,-0.000355,0.000159,-7.1e-05,-0.000175,-0.000222,-3.1e-05,0.000175,-0.000262,-4.1e-05,-4e-05,6.1e-05,0.000116,-3.7e-05,-1.5e-05,3e-06,-3e-06,2e-06,-3.7e-05,-3e-06,5e-06,0,-9e-06,9e-06,7.1e-05,-4.3e-05,-1.5e-05,-9.6e-05,-3.5e-05,-1.6e-05,-3.1e-05,2e-06,-2e-06,-3e-06,-1.5e-05,-9e-06,-4e-06,0,3e-06,0,2.2e-05,-1e-05,2.5e-05,9e-06,-6e-06,1e-06,3e-06,2e-06,1e-06,3e-06,-4e-06,1e-06,6e-06,-2e-06,0,2e-06,0
-2e-06,3e-06,0,2e-06,-2e-06,0,2e-06,1e-06,-3e-06,-1e-06,6e-06,-2e-06,-3e-06,-1e-06,3e-06,2e-06,0,0,-3e-06,-1e-06,1e-06,0,0,-1e-05,-4e-06,0.000111,-6.5e-05,-8e-06,-0.000258,-2.5e-05,0.000131,3.2e-05,-4.5e-05,-1.1e-05,-3e-06,0,0,7.9e-05,0.000133,1.5e-05,0.000103,-0.000165,4.8e-05,-0.000616,0.000244,-5.1e-05,-8.9e-05,0.000183,8.7e-05,-0.000137,-7e-06,0.000124,7.3e-05,-3.8e-05,0.000295,-0.000104,0.00014,-0.000149,-9.8e-05,0.000194,-0.000158,0.000211,-0.000371,-5.6e-05,8.5e-05,0.000144,-3.3e-05,-5.2e-05,-0.000174,0.000148,6.8e-05,-5e-06,1e-06,2e-06,1.3e-05,-4.3e-05,-3.5e-05,1.8e-05,3e-06,3.4e-05,-6e-06,-9e-06,7e-06,0,8e-06,-6e-06,-2e-06,2e-06,-8e-05,1.1e-05,4e-06,-7e-05,-4e-06,9e-06,2.2e-05,-2e-06,-8e-06,-1e-06,-1e-06,7e-06,6e-06,7e-06,5e-06,-4e-06,-1.2e-05,-4e-06,-2.8e-05,-1.5e-05,6e-06,-2e-06,-3e-06,2e-06,1e-06,4e-06,-2e-06,-3e-06,1e-06,2e-06,1e-06,0,0
-1e-06,2e-06,-1e-06,3e-06,3e-06,0,-2e-06,1e-06,2e-06,-1e-06,2e-06,2e-06,-4e-06,1e-06,3e-06,0,-1e-06,1e-06,2e-06,0,1e-06,0,0,-4.9e-05,6e-06,-0.000212,4.7e-05,-4e-06,0.000142,5.7e-05,-6.5e-05,-2.9e-05,3.7e-05,-1.9e-05,-1.6e-05,2e-06,-1e-06,-6.4e-05,-0.000333,6.1e-05,0.000109,-5.8e-05,-7.6e-05,0.000542,-0.000188,2.6e-05,0.000144,-6.6e-05,-9.2e-05,0.000229,-0.000128,0.000115,-0.000108,0.000131,-0.00017,4.5e-05,-3.8e-05,5.5e-05,0.000126,-9.7e-05,9.4e-05,-3.2e-05,-7.6e-05,6.4e-05,0.000122,0.000156,6e-06,0.000177,-5.1e-05,-0.000141,-2.1e-05,-0.000142,0.00012,3.6e-05,4.4e-05,-8.2e-05,-5.7e-05,-4.6e-05,-3.7e-05,-1.1e-05,-5e-06,-5e-06,1e-06,1e-05,-2e-05,7e-06,-8e-06,3e-06,3.1e-05,3.9e-05,1.6e-05,6.2e-05,-3.1e-05,0,1.5e-05,-1.4e-05,3e-06,2e-06,-1e-06,-4e-06,-1e-06,1e-05,-5e-06,2e-06,-1.6e-05,-1e-06,8e-06,-1.4e-05,-3e-06,0,2e-06,-1e-06,-2e-06,3e-06,1e-06,1e-06,2e-06,3e-06,0,-2e-06,3e-06
-1e-06,1e-06,0,3e-06,-3e-06,1e-06,-6e-06,-4e-06,2e-06,1e-06,-1e-06,-3e-06,2e-06,0,1e-06,1e-06,-2e-06,2e-06,2e-06,1e-06,-1e-06,1e-06,0,-1.1e-05,-1e-06,4.9e-05,-4.4e-05,-5e-06,2.3e-05,-7.4e-05,6.8e-05,2.5e-05,1.8e-05,4e-06,9e-06,0,-1e-06,0.00012,-6.6e-05,1.1e-05,5.7e-05,5.5e-05,-3.3e-05,1.5e-05,-0.000147,-0.000112,-8.6e-05,0.000196,0.000101,-0.000183,0,6.7e-05,4.8e-05,-0.000142,-5.7e-05,-7.4e-05,0.000152,-0.000128,4.9e-05,3e-05,3.1e-05,0.00016,0.000339,8.4e-05,-0.000114,-0.000257,5.7e-05,-0.00021,0.00022,0.000132,-2e-06,7.4e-05,9.9e-05,-1.6e-05,-3.1e-05,7e-06,9.6e-05,7.1e-05,2.7e-05,2e-06,1e-06,-1.3e-05,-5e-06,-1.5e-05,6e-06,-3e-06,6e-06,-3e-06,-1.9e-05,2.4e-05,-1.8e-05,5.3e-05,5e-06,-5e-06,-1.1e-05,-3e-06,-8e-06,-3e-06,-3e-06,8e-06,6e-06,3e-06,4e-06,0,-6e-06,-1e-05,-8e-06,2e-05,-6e-06,4e-06,1e-06,2e-06,0,-6e-06,3e-06,-2e-06,2e-06,-5e-06,-4e-06,0,0
-1e-06,-5e-06,-1e-06,-1e-06,0,-1e-06,0,0,2e-06,1e-06,-1e-06,2e-06,2e-06,0,-3e-06,0,4e-06,2e-06,0,1e-06,0,0,0,-2.5e-05,-1.8e-05,4e-06,3.2e-05,0,-0.000103,3.3e-05,-0.00013,-4.3e-05,-5.2e-05,3e-06,-5e-06,1e-06,0,-6.5e-05,0.000162,-3.3e-05,-0.000348,5.9e-05,0.000103,-8.6e-05,4.6e-05,9.4e-05,-1.7e-05,-9.7e-05,-9e-05,-5.7e-05,1.2e-05,2.5e-05,-2e-06,-2.9e-05,5.6e-05,0.000145,-9.4e-05,-0.000183,-5.6e-05,-5.3e-05,-0.000174,-0.000202,1e-06,-0.000112,1.4e-05,6.4e-05,3.3e-05,4.4e-05,7.9e-05,-1e-05,-0.000112,4e-06,-0.00018,-3.2e-05,2.9e-05,1.1e-05,-8.5e-05,-3.9e-05,-1.2e-05,-1.2e-05,3e-06,1.6e-05,2.9e-05,-1.1e-05,8e-06,-1e-05,3e-06,-6e-06,2.4e-05,1.1e-05,3e-06,-1.6e-05,-1.3e-05,2e-06,1.6e-05,-8e-06,-5e-06,-1e-06,-3e-06,3e-06,-6e-06,-5e-06,1e-06,-2e-06,-1.5e-05,3e-06,1.2e-05,0,2e-06,-2e-06,-3e-06,-2e-06,0,0,3e-06,0,2e-06,-7e-06,-5e-06,1e-06,2e-06
-1e-06,0,-1e-06,-1e-06,-1e-06,0,4e-06,1e-06,-1e-06,0,-3e-06,-1e-06,-3e-06,0,-2e-06,0,-1e-06,-1e-06,-2e-06,-1e-06,-1e-06,0,0,-1.7e-05,-8e-06,4.7e-05,-2.2e-05,3e-06,0.000129,4.6e-05,0.00013,2.6e-05,5.5e-05,5e-06,1.5e-05,-1e-06,0,0.000107,-1e-04,-5.4e-05,0.00011,3.2e-05,-0.000182,0.000287,7.5e-05,-4e-05,2.4e-05,-1e-05,6.3e-05,6.1e-05,-2.2e-05,-2.2e-05,4.9e-05,0.00013,-5.1e-05,-0.000204,4.3e-05,3.1e-05,-2.4e-05,-0.000115,8.5e-05,-5.6e-05,-8.4e-05,9.5e-05,1.6e-05,-3e-06,-6.2e-05,0.000114,-4.3e-05,3.2e-05,5.8e-05,-5.5e-05,3.3e-05,2.5e-05,-1e-05,-1.7e-05,-2.7e-05,4.4e-05,-8e-06,-8e-06,8e-06,-1e-06,1e-05,2e-06,4e-06,4e-06,4e-06,3e-06,1.8e-05,2.3e-05,0,-2.9e-05,-1.5e-05,0,-1.5e-05,-6e-06,-7e-06,0,-4e-06,-8e-06,1e-06,-1e-06,0,1e-06,9e-06,-6e-06,-1.7e-05,-9e-06,-3e-06,-4e-06,4e-06,1e-06,-1e-06,-1e-06,2e-06,-1e-06,2e-06,-2e-06,1e-06,0,-1e-06
1e-06,-2e-06,0,-2e-06,0,0,1e-06,-2e-06,-3e-06,0,1e-06,0,-3e-06,1e-06,-1e-06,-1e-06,-1e-06,1e-06,0,1e-06,2e-06,1e-06,0,2.1e-05,2e-06,5.5e-05,1.2e-05,4e-06,-4.8e-05,-3e-06,-0.000161,-1.5e-05,-3.4e-05,2e-06,-1.8e-05,0,0,-0.000203,0.000236,-1.5e-05,-0.000233,1.9e-05,5.9e-05,4.2e-05,-6.5e-05,-7.1e-05,1.8e-05,1e-05,-3.2e-05,-3.8e-05,-7e-06,-6.8e-05,-4.8e-05,-0.000149,1.4e-05,2.9e-05,-0.000103,1e-04,-2.6e-05,6.2e-05,-3.5e-05,-2.8e-05,-0.000125,4.3e-05,-3.6e-05,5.8e-05,-1.7e-05,-0.000112,-5.7e-05,3.3e-05,5.8e-05,4.6e-05,4.3e-05,4.5e-05,5e-06,3.6e-05,8.5e-05,-4.9e-05,8e-06,-4e-06,-2e-06,1e-06,7e-06,-2e-06,2e-06,7e-06,3e-06,3e-06,-3.6e-05,-1.9e-05,-7e-06,-2.3e-05,-1e-05,2e-06,-1e-06,5e-06,-8e-06,-4e-06,0,5e-06,-7e-06,2e-06,2e-06,0,1e-05,5e-06,-1.1e-05,-4e-06,-1e-06,4e-06,-2e-06,-2e-06,0,-1e-06,3e-06,0,0,-1e-06,3e-06,-1e-06,0
1e-06,3e-06,0,-2e-06,1e-06,0,-1e-06,-2e-06,-2e-06,1e-06,-2e-06,0,3e-06,0,-1e-06,0,0,-3e-06,1e-06,-1e-06,-1e-06,0,0,1.5e-05,5e-06,-6e-05,-2.2e-05,-3e-06,6.9e-05,1e-06,0.000199,-1.4e-05,1.1e-05,-8e-06,2e-06,0,0,0.000139,-6.1e-05,2.6e-05,0.000123,-5.2e-05,-8.3e-05,-7.1e-05,-8.5e-05,5.7e-05,4.4e-05,-1e-04,-1.7e-05,6.8e-05,-3.2e-05,-7.1e-05,2.6e-05,0.000101,-0.000151,7.1e-05,7.1e-05,4.6e-05,5.5e-05,-3.2e-05,-2.5e-05,3.3e-05,0.000129,-3.8e-05,-1e-06,7e-05,-5.1e-05,3.6e-05,-8.5e-05,1.6e-05,4.3e-05,3.1e-05,2.9e-05,-3.3e-05,-1.3e-05,1.3e-05,-2.3e-05,1.6e-05,1e-05,-5e-06,-7e-06,7e-06,-7e-06,7e-06,-9e-06,-1.3e-05,-3e-06,0,2.1e-05,9e-06,4e-06,0,-1.6e-05,1e-06,-1e-06,-3e-06,-1e-06,3e-06,-6e-06,-4e-06,4e-06,1e-06,1e-06,2e-06,0,-1e-06,2e-05,1e-06,0,-4e-06,1e-06,1e-06,0,1e-06,-2e-06,0,0,-2e-06,-1e-06,0,-1e-06
-1e-06,0,0,-1e-06,-2e-06,0,1e-06,2e-06,0,0,2e-06,-1e-06,0,1e-06,0,0,1e-06,0,0,-1e-06,1e-06,0,0,1.7e-05,7e-06,-5.4e-05,9e-06,-5e-06,-6e-05,5.5e-05,-0.000156,-2e-06,-9e-06,-1e-06,5e-06,1e-06,0,-9.1e-05,-0.000125,1.1e-05,-0.000111,5.1e-05,-3.4e-05,-0.000148,0.000239,6.7e-05,-8.3e-05,4.8e-05,4.1e-05,-2.8e-05,-2.9e-05,-6.6e-05,-4.3e-05,-0.00012,-0.000147,-5.2e-05,2.8e-05,4.6e-05,-2.9e-05,3.2e-05,1.6e-05,4.3e-05,4e-05,-0.000106,-2.7e-05,-0.000144,-6e-06,-2.6e-05,-1.5e-05,-3.8e-05,2.5e-05,-1.5e-05,-3.3e-05,1e-06,-1.5e-05,-2.7e-05,-5.2e-05,-2.1e-05,6e-06,-8e-06,-2e-06,-9e-06,-7e-06,8e-06,8e-06,0,0,-1e-06,-1.4e-05,1.1e-05,-1.6e-05,3e-05,-7e-06,-1e-06,-2.1e-05,3e-06,-3e-06,-2e-06,3e-06,-2e-06,1e-06,-4e-06,0,-1e-06,1e-06,2e-06,-6e-06,7e-06,0,5e-06,-1e-06,0,0,1e-06,-1e-06,0,-2e-06,-1e-06,5e-06,0,2e-06
0,1e-06,0,0,1e-06,0,3e-06,0,2e-06,0,0,1e-06,-3e-06,1e-06,2e-06,0,0,2e-06,-1e-06,1e-06,0,0,0,2.2e-05,6e-06,6.5e-05,2e-06,-1e-06,-6e-06,-0.000103,0.000103,-1e-06,-1.3e-05,-9e-06,9e-06,0,0,0.000103,5.9e-05,5e-06,0.000251,-1.1e-05,3.2e-05,0.000145,-3.3e-05,-3.2e-05,8.8e-05,-8.3e-05,-2e-05,4.7e-05,2.3e-05,-2.3e-05,3.8e-05,0.000108,3.8e-05,-9e-06,7.3e-05,-9e-06,-3.2e-05,2.4e-05,3.6e-05,-0.000123,9.9e-05,5.9e-05,-5.9e-05,4.2e-05,-2.8e-05,-1.9e-05,0.000144,-5e-06,-0.000117,-2.1e-05,-5.5e-05,1e-05,1.5e-05,-3.3e-05,3.3e-05,4.6e-05,1.1e-05,1.3e-05,1e-06,-1e-05,-7e-06,-9e-06,-5e-06,2e-06,-4e-06,-3e-06,8e-06,-1.8e-05,1.1e-05,2.7e-05,-3e-06,2e-06,2e-06,-1e-06,-1e-06,0,-3e-06,6e-06,-1e-06,2e-06,0,0,-7e-06,4e-06,3e-06,-1.2e-05,-5e-06,-6e-06,-1e-06,-1e-06,0,-1e-06,-2e-06,0,-2e-06,0,-1e-06,0,0
0,-1e-06,0,1e-06,-1e-06,0,0,-2e-06,2e-06,1e-06,0,-1e-06,0,1e-06,2e-06,0,-1e-06,-1e-06,0,-1e-06,1e-06,0,0,0,-1e-06,4e-06,1.1e-05,0,5.7e-05,9.4e-05,-5.3e-05,1e-06,5e-05,1e-06,-1.1e-05,0,0,-4.7e-05,3.2e-05,-2e-06,3.1e-05,2.7e-05,-9.2e-05,-0.000342,-0.000246,-2.4e-05,-3.4e-05,7.9e-05,1.8e-05,-1e-06,2.1e-05,2e-06,2e-05,1.6e-05,3.1e-05,-3e-05,-5e-06,-2.6e-05,3.2e-05,-1.3e-05,-2e-06,-8e-06,-0.00022,3.8e-05,3.9e-05,4.6e-05,2.6e-05,6.4e-05,2.9e-05,-9.9e-05,-2.1e-05,7.2e-05,5e-05,1.1e-05,-1.1e-05,1e-05,3.1e-05,-2.9e-05,-7e-06,-1.1e-05,5e-06,2e-06,-1.2e-05,-4e-06,0,-1e-06,0,0,5e-06,-5e-06,5e-06,-2.5e-05,-1e-05,-6e-06,-1.2e-05,0,-6e-06,1e-06,-1e-05,-5e-06,2e-06,3e-06,1e-06,0,-1e-06,-2e-06,-6e-06,6e-06,1e-06,5e-06,2e-06,0,0,-2e-06,-2e-06,0,0,-1e-06,-3e-06,0,1e-06
0,-1e-06,0,1e-06,0,0,-2e-06,1e-06,1e-06,0,-1e-06,1e-06,1e-06,0,0,0,0,1e-06,1e-06,1e-06,-1e-06,0,0,-1e-06,-5e-06,-2.5e-05,-1.6e-05,-1e-06,-0.000102,-5e-05,7e-06,-1e-06,-4.9e-05,1e-06,-4e-06,0,0,6.6e-05,-7.9e-05,-1.5e-05,-6e-06,-0.000149,5.2e-05,0.00029,9e-06,-6e-06,-3e-05,-7.9e-05,-1.4e-05,-5.3e-05,-1.9e-05,2.9e-05,-2.4e-05,-1.2e-05,6e-05,5.2e-05,-8.1e-05,-6.3e-05,-2e-06,4.5e-05,-2e-05,-1.5e-05,4.6e-05,-1.7e-05,-2.3e-05,-3.6e-05,2e-05,-0.000101,-7.9e-05,1.8e-05,-1e-06,-2.1e-05,4.2e-05,-2.4e-05,1.1e-05,-4e-06,-5.5e-05,-3e-06,0,-5e-06,3e-06,1.4e-05,-3e-06,-5e-06,-6e-06,-2e-06,0,2e-06,5e-06,3e-06,-1.1e-05,-3.7e-05,-8e-06,5e-06,3e-05,1e-06,-2e-06,-2e-06,5e-06,0,-4e-06,2e-06,0,1e-06,-5e-06,4e-06,8e-06,1e-05,1e-06,-4e-06,-2e-06,-1e-06,0,0,-1e-06,0,-1e-06,-1e-06,0,0,0
0,0,0,1e-06,-1e-06,0,-1e-06,1e-06,0,0,-2e-06,-1e-06,0,0,0,0,2e-06,0,0,-1e-06,0,0,0,0,-8e-06,9e-06,1.6e-05,0,5.1e-05,1e-06,2.5e-05,8e-06,1.2e-05,4e-06,7e-06,0,0,-7.9e-05,1.7e-05,-1.5e-05,-1e-05,1.3e-05,-4.8e-05,-8.2e-05,0.000124,-4e-06,6.7e-05,7.3e-05,2e-06,1.1e-05,-2.7e-05,3.7e-05,7e-06,-3.8e-05,-7.7e-05,-5.9e-05,-2.1e-05,-6.2e-05,1.7e-05,-3.6e-05,4.4e-05,0.000119,6e-05,-1.4e-05,3.2e-05,-1.2e-05,3.7e-05,6e-06,-3.3e-05,-5.1e-05,7.1e-05,-8e-06,-2e-06,1.1e-05,5e-06,0,-3e-06,1.8e-05,7e-06,-1e-06,-1e-06,8e-06,1e-06,2e-06,5e-06,1e-06,1e-06,0,-1.5e-05,-1.8e-05,6e-06,1e-05,-5e-06,-2e-06,-1e-05,0,-4e-06,1e-06,4e-06,2e-06,2e-06,-3e-06,0,-1e-06,-7e-06,-2e-06,-4e-06,-4e-06,-4e-06,3e-06,1e-06,0,0,-1e-06,1e-06,-1e-06,0,-2e-06,-1e-06,0,0
0,-1e-06,0,0,0,0,1e-06,-1e-06,-1e-06,0,1e-06,1e-06,-3e-06,0,-1e-06,0,-1e-06,-1e-06,0,0,0,0,0,-1.1e-05,-3e-06,-1.2e-05,-1.4e-05,0,-1.3e-05,3.6e-05,-3.6e-05,-2e-05,1.1e-05,0,2e-06,0,0,5.5e-05,5.3e-05,2e-06,-0.000106,8.3e-05,1.2e-05,4e-05,9.4e-05,1.9e-05,-3.7e-05,-6.8e-05,7e-06,-1.2e-05,2e-05,3.9e-05,-1.8e-05,-5e-06,-1.1e-05,-1.9e-05,1.9e-05,4.7e-05,-4.1e-05,-9e-06,-2.2e-05,-1.5e-05,1.7e-05,5.6e-05,1e-05,-2e-05,8e-06,8.5e-05,6e-06,1.2e-05,4.5e-05,8e-06,-7.2e-05,1.6e-05,9e-06,1.5e-05,6.6e-05,1.4e-05,-1e-05,0,-3e-06,-1.6e-05,0,7e-06,3e-06,-1e-06,2e-06,-1e-06,1.1e-05,7e-06,0,1.5e-05,-4e-06,5e-06,-6e-06,1e-06,-3e-06,1e-06,-7e-06,-3e-06,-4e-06,-1e-06,1e-06,0,8e-06,0,-1.3e-05,-6e-06,0,-2e-06,0,0,0,2e-06,0,0,0,0,-1e-06,0,0
0,2e-06,0,0,-1e-06,0,-1e-06,-1e-06,0,0,-1e-06,-1e-06,1e-06,0,-1e-06,0,-1e-06,0,0,0,0,0,0,1e-06,2e-06,-1.3e-05,1e-05,1e-06,2e-06,6e-06,2.3e-05,1.4e-05,-8e-06,-2e-06,-3e-06,0,0,-8.4e-05,-3.1e-05,6e-06,4e-06,1.9e-05,1.7e-05,5e-06,-5.1e-05,-1.6e-05,1.7e-05,3.9e-05,1e-06,-6e-06,1.8e-05,2.2e-05,2.4e-05,5.6e-05,0.000124,9e-06,9.2e-05,7.5e-05,3e-06,-5e-06,-1e-05,3.2e-05,2.3e-05,-1.5e-05,-1.7e-05,6.8e-05,1e-06,-8e-05,9e-06,1.2e-05,-3.2e-05,1.5e-05,1.7e-05,-6e-06,4e-06,4e-06,-6.6e-05,-2.8e-05,-1.3e-05,-3e-06,0,-1.1e-05,9e-06,2e-06,-5e-06,1e-06,0,-1e-06,-1e-05,-1.1e-05,-1e-06,7e-06,-4e-06,-4e-06,1.1e-05,-1e-06,-3e-06,-1e-06,3e-06,6e-06,2e-06,0,0,0,1e-06,-1e-06,1e-05,2e-06,0,0,-1e-06,1e-06,0,0,2e-06,0,0,1e-06,2e-06,0,0
0,-1e-06,0,-1e-06,1e-06,0,-1e-06,2e-06,0,0,1e-06,1e-06,2e-06,0,-1e-06,0,1e-06,0,0,-1e-06,0,0,0,7e-06,1e-06,1.6e-05,-5e-06,0,1.6e-05,-8e-06,-1e-06,-9e-06,2e-06,-5e-06,-1e-06,0,0,8e-05,1.8e-05,5e-06,-0.000138,-3e-05,-5.4e-05,9.6e-05,-4.6e-05,2.5e-05,6e-06,-4.8e-05,-2.1e-05,0,0,1e-06,-8e-06,-1.2e-05,6.6e-05,-1.1e-05,-3.1e-05,-8e-06,1.5e-05,-1.8e-05,1.9e-05,-5.4e-05,-0.000128,-6.6e-05,3e-05,2.6e-05,-9e-06,4.9e-05,3.6e-05,8e-06,-5.6e-05,-4.6e-05,2.5e-05,-1.3e-05,-6e-06,-1.9e-05,2.1e-05,-2e-06,0,4e-06,-1e-06,7e-06,3e-06,-3e-06,5e-06,1e-06,1e-06,-1e-06,5e-06,0,-1e-06,4e-06,-4e-06,3e-06,-1.1e-05,-2e-06,-1e-06,1e-06,-1e-06,-2e-06,0,1e-06,0,0,4e-06,-1e-06,-1e-06,3e-06,0,0,0,-1e-06,0,-1e-06,0,0,0,-1e-06,3e-06,0,0
0,1e-06,0,-1e-06,-2e-06,0,1e-06,0,1e-06,0,-1e-06,0,-2e-06,0,0,0,0,0,0,1e-06,0,0,0,-1e-06,4e-06,-5e-06,2e-06,0,-3.4e-05,3.3e-05,-1.6e-05,3e-06,-3e-06,-2e-06,-1e-06,0,0,-5.2e-05,-3.9e-05,1e-06,0.000118,-3.4e-05,3.6e-05,-0.00013,1.3e-05,7e-06,-3.3e-05,2.8e-05,1.5e-05,-5e-06,-5e-06,-1.6e-05,1.2e-05,-6e-06,3.5e-05,-5e-06,-4.1e-05,1.9e-05,3e-06,3.4e-05,-1.7e-05,2.8e-05,3.8e-05,1.1e-05,1.8e-05,-8.6e-05,-7e-06,1e-06,1.2e-05,3e-05,-4e-06,2.6e-05,6e-06,4e-06,5e-06,-1e-05,2.6e-05,2.5e-05,-1.1e-05,-4e-06,0,1.1e-05,-2e-06,-6e-06,-3e-06,-2e-06,-1e-06,1e-06,2e-06,3e-06,-1e-06,-1.5e-05,-4e-06,-4e-06,0,0,-2e-06,-1e-06,-3e-06,-2e-06,1e-06,-1e-06,0,0,1e-06,0,2e-06,-5e-06,1e-06,1e-06,0,0,0,0,0,0,0,-1e-06,-2e-06,0,0
0,-1e-06,0,0,1e-06,0,1e-06,-2e-06,0,0,0,0,-1e-06,0,1e-06,0,0,0,0,-1e-06,0,0,0,8e-06,3e-06,6e-06,-4e-06,0,6.7e-05,-1.8e-05,1.1e-05,-4e-06,8e-06,1e-06,-1e-06,0,0,5.3e-05,-3e-06,-4e-06,2.4e-05,2.3e-05,-4.7e-05,9e-06,-3.8e-05,-2.4e-05,3.1e-05,-3.5e-05,-1e-05,-1.3e-05,-6e-06,-2.5e-05,-1.3e-05,-1.4e-05,-3.8e-05,-9.4e-05,-5.7e-05,2.1e-05,-1.3e-05,-2e-06,-3e-06,-2.3e-05,6e-05,4.2e-05,-1.7e-05,1.4e-05,-1.1e-05,-1.9e-05,-6.5e-05,1.3e-05,1e-05,-1.3e-05,-2.3e-05,4e-06,-9e-06,8e-06,-4.6e-05,-2.8e-05,5e-06,-3e-06,-1e-06,1e-06,1e-06,-2e-06,4e-06,-1e-06,0,1e-06,-1e-06,-1e-06,4e-06,-2.2e-05,-5e-06,1e-06,-4e-06,-2e-06,-4e-06,-1e-06,0,2e-06,-1e-06,0,0,-1e-06,-8e-06,-1e-06,-6e-06,-1e-06,-1e-06,-2e-06,1e-06,0,0,0,0,0,1e-06,-1e-06,1e-06,0,0
0,0,0,0,-1e-06,0,0,1e-06,0,0,-1e-06,0,1e-06,0,1e-06,0,0,0,0,0,0,0,0,6e-06,-1e-06,4.3e-05,5e-06,0,-4.5e-05,-2e-05,-8e-06,-2e-06,-1.1e-05,2e-06,8e-06,0,0,-4.2e-05,8.4e-05,-3e-06,5.5e-05,1.8e-05,1e-05,4.5e-05,-2.4e-05,-5e-06,-1.1e-05,3.5e-05,7e-06,2e-06,-2e-06,-2e-05,1.1e-05,1e-05,-4e-05,6.9e-05,3.7e-05,-6.2e-05,-3e-06,9e-06,-3e-06,2.2e-05,2.2e-05,-2e-05,3.1e-05,4.1e-05,-3e-05,5.8e-05,-1.4e-05,6e-06,4e-05,-5e-06,-1e-05,-1.3e-05,-2e-06,-5e-06,1.1e-05,1.2e-05,6e-06,2e-06,0,-7e-06,-2e-06,1e-06,-3e-06,4e-06,-1e-06,0,3e-06,-1e-06,-2e-06,1e-05,-7e-06,-1e-06,1e-06,0,-3e-06,1e-06,-1e-06,-4e-06,-1e-06,1e-06,0,0,0,1e-06,7e-06,4e-06,-2e-06,2e-06,-1e-06,0,0,0,-1e-06,0,0,0,-1e-06,0,0
0,0,0,0,1e-06,0,0,1e-06,0,0,-1e-06,-1e-06,1e-06,0,1e-06,0,0,0,0,0,0,0,0,-7e-06,-2e-06,-5e-05,-6e-06,-1e-06,1e-06,3.5e-05,-1.3e-05,2e-06,0,2e-06,-2e-06,0,0,3.8e-05,-8.4e-05,-2e-06,1.8e-05,-4.4e-05,-1e-05,-0.000205,4.3e-05,2.7e-05,-2e-06,-2.1e-05,1.3e-05,2.7e-05,1.4e-05,-1.3e-05,1e-06,-5e-06,4.2e-05,-1.5e-05,2.7e-05,-5.1e-05,1e-06,7e-06,-4e-06,-6e-05,-3.6e-05,-1.2e-05,-3.2e-05,5e-06,-8e-06,-5.1e-05,4.9e-05,-3e-06,-5e-06,-2e-06,1.5e-05,9e-06,-2e-06,-3e-06,4.6e-05,2e-06,-4e-06,-6e-06,2e-06,-1e-06,-1e-06,7e-06,-1e-06,-2e-06,0,-1e-06,-1e-05,7e-06,-3e-06,1.8e-05,-3e-06,2e-06,-4e-06,0,-3e-06,-1e-06,-1e-06,4e-06,0,1e-06,0,0,-5e-06,0,3e-06,4e-06,1e-06,-2e-06,0,1e-06,0,0,0,0,0,0,-3e-06,0,0
0,0,0,0,-1e-06,0,0,-1e-06,0,0,1e-06,1e-06,-2e-06,0,0,0,0,0,0,0,0,0,0,-2e-06,-1e-06,-1.2e-05,4e-06,0,3e-05,-1.6e-05,4.8e-05,-1e-05,9e-06,-2e-06,-5e-06,0,0,-4.9e-05,-1.2e-05,0,-1.1e-05,-1.3e-05,-4.3e-05,0.000175,0.000122,-1.9e-05,1.7e-05,3e-05,-2.5e-05,-2e-05,9e-06,6e-06,-8e-06,1.3e-05,2.8e-05,-7.5e-05,3.5e-05,3.1e-05,7e-06,-8e-06,4e-06,1.3e-05,-5.3e-05,4.1e-05,-2e-06,-5.3e-05,9e-06,2e-06,4e-06,-2.5e-05,-1.2e-05,2e-06,9e-06,5e-06,1e-06,8e-06,-5e-05,1.7e-05,3e-06,-3e-06,1e-06,-2e-06,-3e-06,2e-06,3e-06,-2e-06,1e-06,-1e-06,8e-06,-1e-06,3e-06,2e-06,-6e-06,-4e-06,-2e-06,0,-3e-06,0,0,1e-06,-2e-06,-2e-06,0,0,-2e-06,0,-1e-05,-5e-06,-1e-06,3e-06,1e-06,-1e-06,0,0,-1e-06,0,0,-1e-06,1e-06,0,0
0,1e-06,0,0,1e-06,0,0,-1e-06,0,0,-1e-06,-1e-06,-1e-06,0,-1e-06,0,0,0,0,0,0,0,0,-5e-06,0,2.3e-05,-5e-06,0,-3.8e-05,-1e-06,-6.2e-05,6e-06,2e-06,0,-2e-06,0,0,5.7e-05,4.6e-05,2e-06,1.1e-05,1.5e-05,3e-06,-4.6e-05,-8e-06,-2.4e-05,-2e-06,-9e-06,3.5e-05,-1.6e-05,0,1.3e-05,1.3e-05,-2.7e-05,-4.8e-05,5.4e-05,-3.3e-05,2.6e-05,-9e-06,-1e-06,-3e-06,-2.2e-05,-6e-06,-3e-06,3e-06,-1.9e-05,2.3e-05,4.6e-05,-2.1e-05,-1.5e-05,8e-06,5e-06,1.5e-05,-1e-06,8e-06,1e-06,-7e-06,-2.7e-05,6e-06,6e-06,1e-06,0,-1e-06,-2e-06,-3e-06,1e-06,0,0,-5e-06,3e-06,1e-06,-9e-06,-7e-06,3e-06,8e-06,1e-06,-2e-06,1e-06,1e-06,-3e-06,4e-06,-1e-06,0,0,5e-06,1e-06,4e-06,-4e-06,-1e-06,-4e-06,-1e-06,1e-06,0,0,0,0,0,-1e-06,1e-06,0,0
