5.3e-05,2.9e-05,4.4e-05,6.3e-05,2.4e-05,2.4e-05,3.9e-05,7.8e-05,1.4e-05,5.4e-05,4.3e-05,4e-06,4.3e-05,8e-06,4.2e-05,4.3e-05,8.8e-05,6e-06,5.8e-05,4.1e-05,8.2e-05,3.9e-05,1.4e-05,3.4e-05,0.000105,4e-06,5.7e-05,1.7e-05,5.4e-05,2.7e-05,3e-06,4.3e-05,1.3e-05,3.4e-05,4.6e-05,3e-06,8e-06,1.7e-05,1.5e-05,4.6e-05,1.9e-05,2.6e-05,4e-05,1e-05,8e-05,3e-05,4.6e-05,2.4e-05,5e-06,3.2e-05,4.1e-05,8.4e-05,3e-05,4.6e-05,2.1e-05,2.6e-05,0.000122,3.3e-05,9e-06,9e-06,6.6e-05,5.2e-05,1.1e-05,5.4e-05,4e-05,1.6e-05,4e-06,6.3e-05,7e-06,2.3e-05,2.4e-05,5e-06,4.8e-05,1.8e-05,4.2e-05,4.1e-05,2.3e-05,1.1e-05,1.3e-05,2e-06,2e-06,1.7e-05,4.4e-05,4e-05,8e-06,6.7e-05,1.4e-05,3.9e-05,0.000107,1.8e-05,2e-05,1.8e-05,9e-06,8e-06,1.4e-05,2e-05,3.6e-05,2.7e-05,3.9e-05,0,1.7e-05,3.7e-05,8e-05,2.9e-05,0,4.3e-05,1.7e-05,3.1e-05,1.7e-05,3e-06,2.4e-05,1.8e-05,4e-06,3.1e-05,5.8e-05,1e-06,2.7e-05,5e-06,3e-06,2.5e-05,1.1e-05
0.000119,8.2e-05,0.000102,0.000152,9.8e-05,7.9e-05,5.8e-05,0.000195,5.7e-05,0.000107,4.5e-05,0.000102,9.1e-05,1.2e-05,0.000191,0.000141,0.000234,7.6e-05,0.000184,0.000177,0.000282,0.000181,0.000101,0.000137,0.000269,0.000188,0.000194,9.6e-05,3.9e-05,0.000115,4e-05,0.000184,0.000165,0.000195,3.6e-05,9.6e-05,0.000184,4e-05,3.5e-05,0.000148,0.000113,0.000155,0.000145,0.000146,0.000223,0.000143,0.000149,8e-05,5.2e-05,0.000116,0.000168,0.000222,0.00013,0.00023,0.000113,8.8e-05,0.000319,0.000108,0.000104,7.4e-05,0.000209,0.000251,0.000102,0.000119,0.00011,7.1e-05,1.9e-05,0.000114,8e-05,0.000107,6.4e-05,9.5e-05,0.000168,0.000103,0.000159,0.000143,0.000142,7.8e-05,0.000107,1e-04,4.5e-05,0.000135,0.000137,0.000117,7e-05,0.000159,0.000131,0.00012,0.000236,6.9e-05,5.8e-05,6.4e-05,9.5e-05,3.6e-05,7.7e-05,2.7e-05,1e-04,7.7e-05,0.000106,5.6e-05,4.1e-05,8e-05,0.000186,4.5e-05,1.1e-05,7.5e-05,4.2e-05,6.3e-05,5.3e-05,4.6e-05,7.7e-05,6.7e-05,7.7e-05,7.6e-05,0.000159,6.9e-05,8.9e-05,3.9e-05,6.3e-05,6.8e-05,2.8e-05
0.000191,5.3e-05,0.00011,0.000289,0.00025,0.000231,4.4e-05,0.000186,0.000265,0.000378,0.000121,0.000155,5.2e-05,4.6e-05,0.000212,7.4e-05,0.000305,0.000247,0.000439,0.00026,8.2e-05,0.000346,0.000474,0.000215,0.00012,0.000476,0.000479,0.00039,0.000452,0.000159,8.1e-05,0.000274,0.000486,0.000432,0.000355,0.000248,0.000295,0.000437,0.000158,0.000124,0.000298,0.000193,0.000248,0.000257,6.5e-05,3e-04,0.000348,0.000144,2.7e-05,0.000123,0.000323,0.000103,0.000145,0.000382,0.000362,0.000105,0.000242,0.000362,0.000271,5.2e-05,0.000224,0.00027,0.000226,3e-05,0.000289,0.000297,0.000226,2.9e-05,6.5e-05,7.4e-05,4.2e-05,0.000191,0.000163,0.00026,0.00021,0.000116,0.000126,0.000221,0.00027,0.000123,0.000178,0.000233,0.000117,0.000109,0.000117,0.000168,0.000114,0.000157,5.2e-05,0.000142,0.000104,0.000218,1.6e-05,7.2e-05,6.8e-05,0.000128,8.1e-05,5.7e-05,5.6e-05,0.000196,4.7e-05,3.7e-05,9.4e-05,0.000174,4.4e-05,5.5e-05,3e-05,7.1e-05,5.5e-05,6.6e-05,0.000175,0.000128,6.8e-05,8.1e-05,6.2e-05,0.000123,3.9e-05,0.000148,3.6e-05,7.7e-05,0.00014
0.000237,0.000257,0.000153,0.000255,0.000186,2e-04,0.000164,5.5e-05,0.000233,0.000304,0.000146,6.9e-05,0.000156,6.3e-05,0.000159,0.000296,0.000175,0.000105,0.000285,0.000147,0.000132,0.000206,0.000345,0.000232,3.9e-05,0.000305,0.000242,0.000263,0.000371,0.000358,0.000182,0.000253,0.000221,7.7e-05,0.000149,0.000306,0.000117,0.000397,0.000335,0.000152,0.000118,8.7e-05,0.000153,0.000304,0.000249,0.000259,0.000201,0.000321,0.000244,0.000239,0.000157,3.9e-05,0.000137,0.000176,0.000113,0.000242,0.000252,0.00032,8.6e-05,0.000166,2.8e-05,7.5e-05,0.00013,9.4e-05,0.000229,0.000111,0.000144,0.000253,6.4e-05,0.000129,2.9e-05,0.000241,5.8e-05,0.000124,0.000158,4.4e-05,9.6e-05,0.000122,0.000182,0.000126,0.000231,0.00012,0.000179,0.000199,6e-05,9.4e-05,8.4e-05,5.9e-05,0.000184,0.000125,0.000122,0.000245,0.000186,3.2e-05,1.5e-05,0.000165,0.000112,4.2e-05,6.1e-05,0.000186,0.000176,0.000144,3.6e-05,8.6e-05,0.000114,0.000144,7.9e-05,0.000111,0.00015,2.3e-05,0.000171,6.4e-05,0.000134,0.000115,0.000201,0.000128,7.7e-05,0.000197,0.000211,0.000114,0.00016
0.000224,0.000266,0.000204,7.1e-05,5.9e-05,0.000206,0.000153,7.9e-05,0.000175,0.000459,0.000261,0.000118,0.00011,9.4e-05,4.7e-05,0.000128,0.000117,0.000148,7.5e-05,0.000107,4.9e-05,0.000111,0.000231,0.000128,0.000226,0.000304,0.000358,0.000138,0.000278,0.00023,0.000364,0.000216,0.000319,0.000153,0.000234,0.000227,0.000267,7.3e-05,0.000308,0.000264,0.000124,5.1e-05,7e-05,0.00025,0.000103,0.000183,0.000257,0.000363,0.000236,0.000312,0.000369,0.000228,0.00029,5.8e-05,0.000137,0.000192,0.000156,6.5e-05,7e-05,0.000308,0.000108,0.000153,0.000219,0.000153,0.000178,0.000193,0.000189,0.000117,0.000167,0.000264,0.000117,0.00018,0.000199,0.000124,0.000222,0.000195,0.000227,0.00011,0.000133,0.000132,0.000238,0.000222,0.000129,0.000221,7.5e-05,0.000178,0.000152,4.8e-05,0.000119,0.000114,0.000135,0.000171,0.000135,0.000154,3.5e-05,0.00012,0.000132,7.3e-05,6.8e-05,0.00015,0.000153,7.8e-05,0.000122,5.7e-05,0.000189,0.000266,1.2e-05,0.000182,8.1e-05,0.000116,0.000124,0.000204,0.000113,0.000164,0.000173,8.8e-05,9.3e-05,0.000129,0.000152,8e-05,8.1e-05
0.00049,0.000179,0.00012,0.000302,0.000311,0.000255,0.000343,0.000244,0.000182,0.000155,0.000172,0.000235,8.5e-05,8e-05,0.000139,0.000186,0.000136,0.000211,0.000235,0.000208,4.7e-05,0.000232,8.3e-05,0.000118,0.00026,0.000139,6.2e-05,2.9e-05,0.000111,0.000198,0.000357,0.000194,0.000351,0.00032,9.8e-05,0.000288,0.000281,0.000418,0.00048,0.000303,0.000135,0.000109,0.000126,0.000214,0.000114,0.000176,0.000163,0.000129,0.000287,0.000349,0.000334,0.000633,6.8e-05,9.9e-05,9.1e-05,0.000111,0.000168,0.000167,8e-05,0.000347,0.000258,0.000313,0.00024,0.000109,0.000229,0.00023,8.4e-05,0.000176,0.000203,0.00018,0.000126,8.1e-05,0.000112,1e-05,0.00022,8.7e-05,0.000164,4.2e-05,5.4e-05,3.9e-05,2e-04,0.000103,0.000252,8.3e-05,0.000147,7.3e-05,8e-05,8.1e-05,0.000202,0.000181,6.9e-05,0.000129,9e-05,0.00022,8.8e-05,0.000231,4e-05,5.4e-05,0.00014,0.000152,8.5e-05,0.00021,0.000173,0.000109,0.000229,0.000173,0.000326,3.3e-05,0.000168,9.7e-05,0.00014,4e-05,0.000147,9.9e-05,0.000116,0.00015,0.000154,0.000203,0.000119,0.000104,0.000116
0.000516,0.000392,0.000416,0.000301,0.000231,0.00015,0.000282,6.5e-05,0.000142,0.000335,0.000319,0.000123,0.000161,0.000147,0.000254,0.000252,0.000302,0.00024,2.9e-05,0.000107,7.1e-05,0.00038,0.000259,0.000474,0.000409,0.000175,0.00022,0.000135,7.7e-05,0.000415,0.000312,0.000204,0.000203,0.000294,0.000323,0.00067,0.000242,0.000417,0.000236,0.000277,0.000139,0.000114,0.000104,7e-05,0.000102,0.000187,6e-05,0.000127,0.000181,0.000333,0.000496,0.000522,0.000466,0.000127,0.000132,0.000327,0.000393,0.000224,6e-06,0.000248,0.000168,0.000263,0.000196,8.4e-05,0.000442,0.00017,0.000163,0.000111,0.000168,5e-05,0.000117,0.000131,0.000261,0.000194,8.5e-05,0.000163,0.000149,0.00027,2.6e-05,7.7e-05,0.000233,3.4e-05,6.3e-05,9.4e-05,0.000231,0.00027,0.000109,8.6e-05,0.000365,0.000309,0.000112,0.00022,2e-04,0.000329,0.000291,0.000317,7.2e-05,0.000227,0.000278,0.000359,0.000458,0.000309,0.000487,0.000209,0.000265,9.8e-05,0.000254,0.000184,0.000197,0.000137,0.000296,9.2e-05,7.7e-05,6.8e-05,0.000141,0.000206,0.000133,0.000197,0.000201,0.000276,9.6e-05
0.00056,0.000155,0.000337,0.000425,0.000432,0.00034,0.000502,0.000439,0.00013,0.000691,0.000237,0.000417,0.00062,0.000413,0.000148,0.000656,0.000212,0.000114,0.000149,0.000343,0.000282,0.000308,0.000755,0.00026,0.000116,0.000369,0.000213,0.000146,0.00029,0.000499,0.000566,0.000364,0.000518,0.000352,0.00031,0.00028,0.000426,0.000448,0.000317,0.000196,0.000201,0.000246,0.000103,0.000247,0.000246,0.000217,0.000341,0.000438,0.000126,1e-04,0.000345,0.000255,2e-04,0.000467,0.000135,4e-04,0.000319,0.000162,0.000163,0.000141,9.9e-05,7.2e-05,0.000512,0.000408,0.000427,0.000419,0.000407,7e-05,0.000355,0.000229,0.000148,0.000155,0.000478,0.000239,0.00023,0.000228,0.00021,0.000329,0.000204,0.000109,0.000282,0.000357,0.00022,1.3e-05,0.000305,0.000411,0.000434,0.000309,0.000414,0.000173,0.000227,0.00029,0.000315,0.000134,0.000152,0.000481,0.000644,0.000132,0.000103,0.000183,0.000324,0.000534,0.000372,0.000159,0.000309,0.000476,0.000412,0.000192,0.000245,8.5e-05,0.000356,0.000603,6.5e-05,6.9e-05,0.000331,9.1e-05,0.000221,0.000495,7e-05,0.000276,0.000523
0.000491,0.000362,0.000554,0.000207,0.000383,0.000217,0.000866,0.000697,0.000418,0.000829,0.00077,0.000514,0.000429,0.000592,0.000628,0.000366,0.000995,0.000701,3.3e-05,0.000527,0.000502,0.000419,0.000628,0.001091,0.001113,0.001055,0.000534,0.000161,0.000375,0.000845,0.000223,0.000192,0.000699,0.000898,0.000572,8.2e-05,0.001039,0.000482,0.000228,0.000363,0.00052,0.000637,0.000686,0.000157,0.000501,0.000669,0.000631,0.000391,0.000298,0.000602,0.000447,0.000575,0.000779,0.000562,0.000387,0.000427,0.000836,0.000858,0.000559,0.000233,7e-05,6.6e-05,0.000589,0.000832,0.000837,0.000364,0.000337,0.000455,0.000759,0.000775,0.000435,0.000249,0.000527,0.000314,0.000406,8.9e-05,0.000323,0.00017,3e-04,0.00036,0.000425,0.000681,0.000319,0.000166,0.000353,0.000593,0.00059,0.000375,0.000648,0.000887,0.00088,0.000897,0.000755,0.00045,0.000206,0.000519,0.001025,0.000602,0.00024,6e-05,0.000317,0.00052,0.001014,0.000802,0.000444,0.000356,0.000408,0.000479,0.000285,0.00017,0.000451,0.000531,0.000657,0.000286,0.000347,0.000272,0.000177,0.000518,0.000682,0.000119,0.000469
0.000603,0.000207,0.000429,0.000531,0.000443,0.000502,0.001143,0.000455,0.00023,0.000531,0.000555,0.000637,0.000805,7.9e-05,0.000153,0.000755,0.001472,0.001071,0.000718,0.000621,0.000271,0.000194,0.000338,0.000596,0.000461,0.000507,0.000484,0.000804,0.000995,0.000451,0.000604,0.000699,0.000596,0.000525,7.3e-05,0.000497,0.001438,0.001245,0.000902,0.000198,0.000384,0.000489,0.000382,0.00048,0.000551,0.000176,0.000408,0.000741,0.000607,0.000407,0.000316,0.000463,0.000679,0.00053,0.000386,0.000474,0.000764,0.000582,0.00034,0.00029,0.000332,0.000312,0.000385,0.000498,0.000136,0.000211,0.000417,0.000222,0.000565,0.000385,0.000114,0.000273,0.000115,0.000162,0.000453,0.000489,0.000476,0.000439,0.000417,0.000313,0.000571,0.000528,0.000331,0.00026,0.000348,0.000501,8.7e-05,0.000231,0.000986,0.001071,0.000329,0.000402,0.000481,0.000225,0.000114,0.000411,0.000677,0.000526,0.000284,0.000228,0.000337,0.000874,0.001343,0.001161,0.000531,0.00021,0.000621,0.000785,0.000441,0.000192,0.000348,0.000354,0.000623,0.000269,0.000189,0.000137,0.000276,0.000276,0.000307,0.000392,0.000474
5.9e-05,9.6e-05,0.00025,0.000149,6.1e-05,0.00041,0.000495,0.000418,0.000225,0.000319,0.000113,0.000354,0.000253,0.000398,0.000341,0.000649,0.000513,0.000157,0.000236,0.000216,0.000294,0.000394,0.000483,0.000171,0.000268,7.1e-05,0.000296,0.000453,0.00034,0.000415,0.000459,9.7e-05,0.000317,0.000119,0.00031,0.000433,0.000665,0.00027,0.000125,0.000182,0.000176,0.000267,7.8e-05,0.00016,0.000146,9.3e-05,0.000296,0.000519,0.000262,0.00051,0.000433,0.000169,0.000533,0.000268,0.000338,0.000194,0.000322,0.000164,9.1e-05,0.000147,0.000252,3e-05,0.00043,0.000104,0.000233,0.000166,0.000101,0.000153,0.000245,1.7e-05,5.8e-05,0.000167,2e-04,0.000108,0.00046,0.00029,0.000244,0.00025,8.1e-05,0.000187,0.000181,0.000211,0.000105,0.000348,0.000254,8.6e-05,0.000176,9e-05,0.000592,0.000121,0.000185,0.000347,8e-05,8.1e-05,1.3e-05,0.000271,0.000185,2e-04,0.000117,0.000233,0.000307,0.000474,0.000328,0.000261,0.000148,0.000177,0.000291,0.000127,9.9e-05,0.000123,0.000349,0.00037,0.000235,0.000237,9.8e-05,0.00012,0.000205,0.000125,0.000166,0.000197,0.000327
6.2e-05,0.000115,7.6e-05,0.000124,0.00011,0.000288,0.000187,9.9e-05,4.2e-05,0.000171,0.00029,0.000127,0.000131,0.000112,0.000106,0.000297,0.000231,0.000106,0.000218,6.3e-05,0.00017,0.000145,0.00012,0.000322,0.000337,0.000193,0.000157,0.000164,5.1e-05,0.000166,0.000137,9.7e-05,0.000117,8.7e-05,0.000104,0.000178,0.000368,5.9e-05,3.9e-05,0.000153,0.000115,5.1e-05,2.4e-05,7.6e-05,8.6e-05,7e-05,0.000227,0.000197,5.9e-05,0.000196,0.000101,0.000132,0.000207,8.1e-05,0.000107,0.000163,0.000147,0.000109,0.000137,0.000179,9.8e-05,9.9e-05,0.000304,8e-05,9.5e-05,0.00014,6.6e-05,8.3e-05,0.000128,8.2e-05,0.000102,9e-05,0.000108,6.3e-05,0.000211,0.000118,9.4e-05,2.9e-05,9.7e-05,9e-05,5.8e-05,0.000103,5.1e-05,0.000172,0.00011,0.000155,0.000105,0.000142,0.000198,6.6e-05,9.1e-05,0.000242,0.000189,7.7e-05,2.9e-05,0.00019,0.000113,8.2e-05,0.000147,3.6e-05,0.000107,0.000257,0.00028,4.1e-05,2.9e-05,0.000155,6.1e-05,6.1e-05,6.3e-05,7.3e-05,0.000119,0.000156,0.000123,6.7e-05,7.5e-05,4.1e-05,0.000106,8.6e-05,9.2e-05,4.7e-05,7e-05
0.000151,8e-05,1.9e-05,7.2e-05,8.6e-05,0.000183,0.000121,7.5e-05,2.6e-05,0.000163,0.000193,7.5e-05,0.000112,0.000125,0.000147,0.000193,0.000267,0.000102,0.000151,0.000171,0.000143,4.8e-05,0.000187,0.000252,0.00013,6e-05,0.000113,0.000138,0.000122,8e-05,0.000145,9.7e-05,4.1e-05,0.000139,8.2e-05,0.000129,0.000325,3.6e-05,7.5e-05,5.9e-05,0.00014,7.9e-05,7.1e-05,2.4e-05,5.7e-05,1.2e-05,0.000212,0.000136,0.000101,9.7e-05,6.1e-05,0.000103,9.1e-05,0.00012,2.9e-05,8.8e-05,5.6e-05,0.000103,0.000122,6.3e-05,0.000113,0.000101,0.00022,4.5e-05,0.000134,0.000138,0.000109,0.00011,0.000115,5.5e-05,9.1e-05,3.9e-05,8.4e-05,5.8e-05,9e-05,8.5e-05,2.4e-05,9.3e-05,5.2e-05,0.000119,6.7e-05,4.5e-05,1.7e-05,8.9e-05,7.8e-05,0.000101,6.3e-05,4.2e-05,8.9e-05,5.4e-05,0.000123,0.000129,9.9e-05,7.3e-05,2.4e-05,0.000111,7.8e-05,7.5e-05,0.000122,0.000123,4.2e-05,8.9e-05,6.8e-05,8.4e-05,3.2e-05,0.000116,4.7e-05,6.5e-05,4.7e-05,3.1e-05,5.2e-05,0.000177,7e-05,3.8e-05,0.000119,7e-05,5.5e-05,3.9e-05,7.6e-05,7.3e-05,9.1e-05
0.000112,2.2e-05,4.3e-05,4.1e-05,0.000124,0.000212,6.4e-05,5.7e-05,0.000121,2.4e-05,0.00015,0.000107,3.2e-05,5.6e-05,0.000245,0.000147,0.000177,5.9e-05,0.000122,0.000202,0.000167,0.000128,0.000106,0.000162,0.000172,6.6e-05,0.000152,0.000124,0.000115,5.5e-05,0.000152,0.000255,0.000265,0.000227,0.000157,0.000296,0.000104,0.000135,9.1e-05,4.3e-05,0.000159,0.000166,0.000146,0.000194,0.000145,0.00014,0.000126,3.7e-05,4.6e-05,7e-05,4e-05,4.2e-05,0.000103,9.5e-05,5.9e-05,0.000102,5.2e-05,8.8e-05,1e-05,9.3e-05,5.1e-05,4.4e-05,0.000132,3.5e-05,7.5e-05,5.6e-05,0.000143,9.1e-05,8.3e-05,2.3e-05,8.3e-05,5.4e-05,6e-05,9.2e-05,8.7e-05,5.3e-05,0.000118,5.1e-05,3.6e-05,6.3e-05,8.2e-05,3.5e-05,3.3e-05,0.00012,0.000151,9.8e-05,9.7e-05,0.000148,0.000136,7.4e-05,8.3e-05,6.3e-05,7.5e-05,0.00017,0.000133,0.000151,9.5e-05,0.000134,8.4e-05,0.000106,1.4e-05,6.8e-05,8.2e-05,0.000123,0.000145,5.3e-05,6.3e-05,4.4e-05,1.3e-05,1.3e-05,1.9e-05,9.3e-05,3e-05,4.3e-05,8.5e-05,6.7e-05,0.000154,0.000139,2.3e-05,9.4e-05,4.8e-05
0.000191,0.000182,4.4e-05,0.000122,0.000148,0.000132,0.000192,5.7e-05,0.00013,6.5e-05,1e-04,5.7e-05,0.000134,0.000139,0.00017,0.000223,0.000129,0.00015,5.3e-05,0.000153,0.00015,0.000142,0.000196,4.4e-05,1e-05,0.000264,0.000233,0.000131,4.7e-05,0.000139,7.5e-05,0.000204,0.000309,0.000196,0.00013,3.6e-05,0.000133,3.4e-05,8.7e-05,7.5e-05,0.000141,0.000159,0.000168,3.4e-05,0.000107,9.2e-05,8.8e-05,0.000197,0.000107,0.000119,1e-04,7.3e-05,0.000102,0.000141,5.3e-05,7.2e-05,6.4e-05,6.2e-05,6.1e-05,3e-06,5.3e-05,7.6e-05,0.000143,4.9e-05,4.1e-05,3.4e-05,4.5e-05,3.5e-05,0.000142,1.7e-05,0.000135,8.2e-05,7e-05,2.9e-05,0.000142,0.000108,0.00015,6.3e-05,7.6e-05,4.8e-05,5.1e-05,4.5e-05,7.2e-05,0.000119,0.000136,0.000117,5.1e-05,0.000182,9.3e-05,0.00011,0.000173,9e-05,7.6e-05,0.000153,5.1e-05,0.000106,0.000135,3e-05,3.1e-05,0.000145,9.4e-05,9e-05,9.7e-05,4.2e-05,0.000101,0.00017,0.000156,9.3e-05,3.9e-05,1.2e-05,2.6e-05,0.000122,6.4e-05,3.5e-05,6.2e-05,5.2e-05,0.000115,7.4e-05,5.3e-05,0.000104,4e-05
0.000134,0.000182,0.000228,8.3e-05,0.000153,4.9e-05,0.000125,0.000172,0.000139,0.00013,0.000107,8.7e-05,0.000209,0.000152,0.000181,0.00016,0.00012,0.000105,0.00021,0.000167,0.000251,4.6e-05,1.8e-05,0.000139,6.7e-05,0.00026,0.00031,0.000134,7.1e-05,0.000201,0.000124,0.000219,3.2e-05,9.8e-05,9.5e-05,8.1e-05,4.9e-05,0.000226,0.000252,0.000234,0.00016,9.4e-05,0.000162,9.9e-05,7.3e-05,9e-05,8.2e-05,0.000135,3.5e-05,5e-05,5e-05,4.8e-05,1.6e-05,6.8e-05,7.2e-05,4.8e-05,8.1e-05,5.7e-05,3.5e-05,0.000131,0.000148,9.2e-05,0.000161,0.000221,0.00016,0.00011,5e-05,4e-05,0.000137,8.4e-05,0.000113,6e-05,0.000108,4.9e-05,0.000102,4.7e-05,0.000101,5.6e-05,0.000112,0.000175,7e-05,3.7e-05,5.2e-05,0.000115,0.000118,2.7e-05,0.000108,5.7e-05,5.6e-05,0.000108,7.9e-05,7.4e-05,8.5e-05,0.000123,8.8e-05,3.9e-05,8.5e-05,1e-04,0.000132,0.000144,2.5e-05,0.000159,3.7e-05,4.1e-05,9.7e-05,0.000125,3.5e-05,6.7e-05,2.4e-05,7e-06,1.4e-05,0.000101,0.000109,3.1e-05,6.4e-05,7.6e-05,8.6e-05,0.000152,0.000103,0.000115,0.000132
9.3e-05,0.000236,0.000107,8.3e-05,0.000145,0.000215,0.000199,0.000261,0.000194,0.00013,5.5e-05,8.4e-05,0.000156,0.000109,1.5e-05,6e-05,0.000141,0.000188,0.00021,0.000231,0.00011,0.000201,0.000137,6.4e-05,2.4e-05,0.000132,8e-05,2.6e-05,6e-05,2e-04,5.1e-05,0.000221,0.000219,0.000212,0.000182,9e-05,0.000144,0.000264,5.9e-05,0.000177,0.00014,0.000181,9.9e-05,0.00017,0.000217,0.000142,0.000157,3.1e-05,2.4e-05,3.5e-05,5.5e-05,8.1e-05,3.4e-05,5.3e-05,7.4e-05,0.000106,8.7e-05,7.5e-05,9.9e-05,7.6e-05,9.8e-05,0.000124,6.5e-05,9.7e-05,3.6e-05,0.000124,0.000115,0.000105,5.6e-05,4.9e-05,3.4e-05,8e-05,6.2e-05,6.4e-05,5e-05,7.2e-05,7.1e-05,0.000122,0.000169,9.5e-05,0.000106,8.5e-05,9.2e-05,0.000181,8.6e-05,0.000138,0.00015,0.00014,5.1e-05,7.4e-05,7.8e-05,0.000115,7.5e-05,0.000164,0.00018,0.000147,7.9e-05,9.7e-05,0.000193,7.3e-05,0.000117,0.000144,9.6e-05,0.000117,0.000181,0.000124,6e-05,9e-05,8e-05,5.7e-05,4.6e-05,3.2e-05,0.000122,0.000123,0.000114,5.7e-05,6.3e-05,6.5e-05,0.000143,0.000183,0.000143
8.3e-05,0.000177,7.5e-05,5e-05,0.000119,0.000215,5.1e-05,0.00015,7.1e-05,4.8e-05,0.00015,9.5e-05,0.000131,0.000158,2e-04,7.7e-05,0.000171,0.000138,3.8e-05,8e-05,8.2e-05,0.000174,5e-05,0.000103,0.000106,0.000148,0.000225,0.000188,0.000155,0.000138,0.000139,0.000107,0.000121,0.00011,0.000126,0.000173,0.000138,0.000102,0.000157,8e-05,5.2e-05,0.000126,0.000121,0.000155,0.000156,0.00012,2.8e-05,7.7e-05,4e-05,6e-05,3.2e-05,0.000102,0.000184,0.000123,6.1e-05,0.000171,0.000148,5.7e-05,2.8e-05,8.6e-05,0.000106,5.7e-05,0.000125,5.2e-05,0.000122,8.4e-05,3.6e-05,7.4e-05,6e-05,1.8e-05,6.6e-05,5.6e-05,3.7e-05,8.7e-05,7.9e-05,6.8e-05,6.2e-05,7.6e-05,5.3e-05,3.7e-05,2.6e-05,7.3e-05,7.1e-05,8e-05,0.000133,0.000192,8e-05,7.5e-05,2.4e-05,3.7e-05,0.000134,7.8e-05,1.6e-05,8.5e-05,7.3e-05,5.2e-05,2.4e-05,6.1e-05,5.9e-05,4.6e-05,9.4e-05,8.6e-05,0.000131,8e-05,5.1e-05,6.8e-05,4.5e-05,3e-05,5.6e-05,9e-06,2.6e-05,2.3e-05,6.2e-05,8.2e-05,3.8e-05,4.5e-05,7.5e-05,1.6e-05,5.9e-05,4.3e-05,6.6e-05
9e-06,4.6e-05,5.2e-05,2e-05,0.000139,5.8e-05,7.2e-05,0.000108,8e-05,7.8e-05,6.9e-05,6.5e-05,0.000167,0.000104,0.000111,0.000129,0.000163,9e-06,8e-06,7.1e-05,0.000109,4.6e-05,6.1e-05,0.000122,0.000233,6.3e-05,0.000195,0.000121,0.000107,7e-05,0.000111,0.000147,7.3e-05,5.1e-05,0.000127,8.6e-05,0.000181,0.000144,0.000169,6.9e-05,0.000117,2.7e-05,7.9e-05,0.000131,0.000111,4.7e-05,7.2e-05,0.000144,5.1e-05,4.5e-05,7.2e-05,9e-05,0.000115,5.9e-05,6.9e-05,8.2e-05,9.5e-05,0.000115,0.000119,0.000177,0.000186,9.4e-05,0.00014,0.00012,0.000185,0.000122,9.5e-05,7.5e-05,9.4e-05,5.9e-05,0.000127,5.7e-05,6.7e-05,9e-05,6.1e-05,0.000101,4.1e-05,6.2e-05,3.8e-05,3.7e-05,5.9e-05,4e-05,0.000104,5.3e-05,0.000118,9.5e-05,4.3e-05,3.7e-05,6.9e-05,2.9e-05,0.000125,7.5e-05,2.5e-05,5.5e-05,5.3e-05,6.8e-05,4.4e-05,3.1e-05,2.4e-05,5e-05,4.7e-05,0.000131,4e-06,5.3e-05,9.3e-05,1.4e-05,2.1e-05,4.5e-05,0.000108,6.3e-05,3.5e-05,1.2e-05,7.1e-05,3.4e-05,2.8e-05,4.3e-05,8e-06,3e-05,1.8e-05,3.6e-05,8.2e-05
3.7e-05,4.8e-05,6.5e-05,0.000179,8.6e-05,4.4e-05,5.3e-05,3.8e-05,4.5e-05,0.000108,0.000127,2e-06,9.6e-05,4.9e-05,0.000104,3.8e-05,7.7e-05,6e-05,1.9e-05,4.8e-05,5.4e-05,7.5e-05,2.8e-05,1.9e-05,0.000149,0.000157,0.000117,0.000101,0.000144,0.000131,0.000106,6.2e-05,4.8e-05,5.3e-05,3.6e-05,0.000135,0.000139,0.000125,3.9e-05,6.5e-05,4.2e-05,3.4e-05,5.2e-05,8.7e-05,0.000124,7.3e-05,0.000122,0.000141,0.000167,0.000122,4e-05,0.000105,6.6e-05,5.9e-05,1.8e-05,4.4e-05,7.2e-05,0.000112,0.000146,8.8e-05,1.4e-05,1.8e-05,0.000157,6.4e-05,0.000174,0.000155,4.1e-05,6e-05,3.6e-05,0.00011,0.000118,8.5e-05,0.000111,6.9e-05,2.8e-05,4.8e-05,5.3e-05,2.9e-05,3.5e-05,3.8e-05,7.6e-05,4.3e-05,7.2e-05,8.9e-05,0.000111,8.8e-05,4.2e-05,3.2e-05,5.4e-05,4e-06,3.2e-05,2.7e-05,2.2e-05,9e-06,4.7e-05,6.2e-05,5.6e-05,5.8e-05,0.000103,3e-05,7.1e-05,6.6e-05,5.9e-05,6.9e-05,5e-05,3e-05,3e-05,5.4e-05,6.5e-05,6e-05,9e-06,1.5e-05,6.8e-05,1.9e-05,9e-06,3.7e-05,7e-05,4.4e-05,6.8e-05,6.5e-05,3.7e-05
0.000116,0.000121,0.000142,0.000212,0.000125,4.5e-05,3.5e-05,2.7e-05,5e-05,3.7e-05,0.000134,0.000102,5.9e-05,0.000103,9e-05,4.9e-05,2.6e-05,0.000115,0.000109,9.7e-05,5.3e-05,5.8e-05,1.6e-05,6.2e-05,8.1e-05,4.1e-05,4.4e-05,8.9e-05,6.6e-05,1.8e-05,6.2e-05,0.000101,2.5e-05,6.8e-05,7.8e-05,0.000112,7.9e-05,7.4e-05,9.8e-05,0.000103,5.7e-05,6.8e-05,7.8e-05,0.000117,0.00014,5.7e-05,0.000155,5.6e-05,0.00013,5.2e-05,6.8e-05,4.5e-05,6.5e-05,2.5e-05,5.8e-05,5e-05,6.6e-05,0.000105,5.1e-05,6.1e-05,6.7e-05,1.9e-05,0.000119,4.5e-05,0.000109,1e-05,3.2e-05,4.4e-05,7.4e-05,0.000103,4.4e-05,8.9e-05,4.5e-05,2.4e-05,2.2e-05,4.5e-05,4.6e-05,6.9e-05,4.6e-05,5e-05,3.9e-05,4.4e-05,2.6e-05,2.1e-05,5.6e-05,8.3e-05,3.5e-05,1.2e-05,5.3e-05,3.6e-05,6.1e-05,4.7e-05,2.1e-05,2.8e-05,1.7e-05,3.8e-05,7.1e-05,4.1e-05,5.5e-05,3.1e-05,8.4e-05,0.000103,4.2e-05,6.8e-05,7.1e-05,1.1e-05,1.4e-05,2.6e-05,8.1e-05,5.3e-05,3.9e-05,1e-05,4.1e-05,3.4e-05,1.5e-05,3e-06,4.4e-05,2.7e-05,6.3e-05,2e-05,6.3e-05
6.2e-05,7.7e-05,5.4e-05,1e-04,9.5e-05,3.8e-05,6.2e-05,4e-05,9.9e-05,8.8e-05,0.00014,1.7e-05,2.7e-05,5.3e-05,1.8e-05,1.2e-05,0.000108,3.4e-05,5.8e-05,5.5e-05,5e-06,1.1e-05,7.1e-05,7.4e-05,7.6e-05,8.9e-05,0.000112,6.6e-05,8.5e-05,6e-05,3.1e-05,6.3e-05,4e-06,4.1e-05,6.2e-05,2.2e-05,0.000148,1.7e-05,7.3e-05,7.4e-05,1.3e-05,2.1e-05,4.6e-05,0.000123,4.6e-05,1.8e-05,0.000117,2.5e-05,6.3e-05,6.5e-05,4.3e-05,5.8e-05,3.6e-05,7.3e-05,5.6e-05,3.7e-05,3.5e-05,8.8e-05,8.3e-05,7e-06,4.5e-05,2.7e-05,4.9e-05,2.3e-05,4e-06,6.1e-05,3.2e-05,5.6e-05,3.2e-05,8.9e-05,7.1e-05,3.7e-05,4e-05,1.1e-05,3.3e-05,8.6e-05,2.7e-05,7.8e-05,7.8e-05,4e-05,6e-05,7.2e-05,7.7e-05,7e-05,5.2e-05,2e-05,1.8e-05,2.2e-05,6.3e-05,1.9e-05,4.3e-05,6.7e-05,5.2e-05,4.1e-05,3.6e-05,5.1e-05,7.2e-05,6.3e-05,6.4e-05,8e-05,5.9e-05,4.6e-05,8.1e-05,3.3e-05,6.3e-05,2.2e-05,3.2e-05,3e-06,3.8e-05,2.5e-05,3e-06,2e-05,2.7e-05,2.7e-05,4e-06,1.7e-05,7e-06,2.6e-05,1.2e-05,3.4e-05,3.1e-05
7.1e-05,7.1e-05,8.3e-05,7.5e-05,5.6e-05,8.2e-05,4.5e-05,3.9e-05,3.9e-05,1.9e-05,1.9e-05,6.5e-05,3.3e-05,3.1e-05,3.7e-05,1.3e-05,5e-05,2.6e-05,3.9e-05,1.4e-05,2.9e-05,2.6e-05,4.8e-05,4.3e-05,6.3e-05,3.5e-05,5.4e-05,3.6e-05,4.9e-05,2.4e-05,2.8e-05,3.8e-05,6e-06,7e-06,5e-05,2.6e-05,9e-06,4.1e-05,4.5e-05,1.4e-05,3e-05,7e-06,5.6e-05,1.6e-05,1.8e-05,3.7e-05,7.6e-05,7e-05,5.7e-05,1.4e-05,1.8e-05,1.5e-05,9e-06,4e-05,4.1e-05,3.8e-05,2e-05,2.5e-05,3e-05,3.6e-05,1.4e-05,2.3e-05,5e-05,4e-06,6e-06,2.3e-05,9e-06,4.9e-05,2.3e-05,4.4e-05,1.8e-05,1.9e-05,1.9e-05,1.8e-05,3.7e-05,2.9e-05,2.9e-05,2.1e-05,2.6e-05,6e-06,6e-06,3.7e-05,2.5e-05,1.1e-05,1.5e-05,3.2e-05,3e-05,3.5e-05,1.7e-05,3.1e-05,1.9e-05,2e-05,2.8e-05,3.7e-05,1.9e-05,5.8e-05,3.2e-05,3.8e-05,3.6e-05,5.8e-05,3.7e-05,1.7e-05,1.8e-05,3.1e-05,1.7e-05,2.3e-05,3.6e-05,2.5e-05,2.6e-05,3.9e-05,3.1e-05,9e-06,1.6e-05,1e-05,1.2e-05,1.8e-05,2.8e-05,1.4e-05,2.1e-05,1.8e-05,1.9e-05
3.8e-05,1.2e-05,7.1e-05,2.4e-05,1.8e-05,2.5e-05,2.6e-05,3.6e-05,4.8e-05,3.5e-05,2.5e-05,5.6e-05,3.8e-05,2.2e-05,2.7e-05,6.1e-05,9.7e-05,6.7e-05,6.7e-05,3.8e-05,2.2e-05,1.6e-05,3.7e-05,5.3e-05,2.4e-05,7.9e-05,6.8e-05,2.4e-05,2.6e-05,9e-06,4.7e-05,4.2e-05,3.9e-05,2.7e-05,4.1e-05,4.4e-05,5.1e-05,3.9e-05,1.1e-05,6.8e-05,3.4e-05,2.2e-05,5.7e-05,9.7e-05,3.6e-05,2.6e-05,6.1e-05,6e-05,9e-06,4.1e-05,4.6e-05,3.1e-05,3.2e-05,2.2e-05,4.5e-05,1.7e-05,2.4e-05,3.7e-05,1e-05,1.8e-05,1.8e-05,2.3e-05,4.9e-05,2.7e-05,1.6e-05,2.2e-05,1.7e-05,5.2e-05,2e-05,5.5e-05,1.7e-05,1.9e-05,1.8e-05,2.4e-05,6.8e-05,4e-05,1.3e-05,2.7e-05,2.1e-05,3.3e-05,3.1e-05,2.7e-05,9e-06,3.5e-05,1.4e-05,4.4e-05,1.2e-05,2.2e-05,3.6e-05,6.2e-05,2.6e-05,3e-05,2.5e-05,2.6e-05,2e-05,5.8e-05,3.4e-05,2e-05,1.6e-05,2.9e-05,2.2e-05,3.7e-05,1.5e-05,3.7e-05,4.8e-05,4.3e-05,1e-05,1.5e-05,1e-05,2.4e-05,1.7e-05,2.4e-05,1.9e-05,7e-06,1.1e-05,1.4e-05,2.5e-05,4e-06,2.4e-05,2.8e-05,8e-06
8.7e-05,8.2e-05,7.6e-05,6.6e-05,1.1e-05,1.6e-05,4.7e-05,3.2e-05,4e-05,1.7e-05,6.2e-05,6.5e-05,6.8e-05,6.2e-05,6.5e-05,7.3e-05,6.6e-05,8.4e-05,4.2e-05,3.4e-05,3.7e-05,2.2e-05,4.9e-05,6.4e-05,6.1e-05,8.9e-05,5.3e-05,2.9e-05,1.7e-05,1.4e-05,4.7e-05,4e-05,4.3e-05,4.9e-05,1.9e-05,4e-05,0.000102,7.4e-05,4.2e-05,9.8e-05,6.7e-05,3.6e-05,5.9e-05,2.8e-05,5.1e-05,2.4e-05,4.4e-05,6e-06,2.2e-05,3.1e-05,2.4e-05,1.4e-05,3.2e-05,4.9e-05,5.2e-05,2.7e-05,4.9e-05,4.9e-05,4.7e-05,5.3e-05,4e-05,5.3e-05,3.6e-05,1.9e-05,4.5e-05,2.9e-05,1.1e-05,3.3e-05,3.3e-05,2.1e-05,2.9e-05,4.1e-05,5.2e-05,5e-05,4.1e-05,4.7e-05,4.3e-05,5.1e-05,5e-06,2e-05,2.9e-05,4e-05,2.8e-05,4e-05,5.2e-05,3.1e-05,3.2e-05,3.7e-05,4.9e-05,9e-06,5.6e-05,2.9e-05,2.1e-05,2.7e-05,1.2e-05,2.6e-05,1.8e-05,5e-06,1e-05,4.6e-05,3.1e-05,5.2e-05,4.1e-05,2.9e-05,4e-06,1.6e-05,1.9e-05,6e-06,2.3e-05,4e-05,1.3e-05,2.4e-05,2.5e-05,1.1e-05,9e-06,4e-06,1.9e-05,1.6e-05,1.6e-05,9e-06,1.3e-05
2.4e-05,9.5e-05,7.5e-05,2.2e-05,3.5e-05,4.4e-05,8e-05,3.8e-05,3.4e-05,3.9e-05,5.2e-05,3.6e-05,3.9e-05,4.5e-05,2.6e-05,3.4e-05,2e-06,4.2e-05,3.9e-05,3.6e-05,4.3e-05,5e-05,6.5e-05,2.7e-05,4.2e-05,3.7e-05,1e-04,7.9e-05,2.1e-05,8e-06,2.7e-05,2e-05,4.8e-05,1.7e-05,6e-06,3.2e-05,4.8e-05,2.7e-05,3.2e-05,3.7e-05,4e-06,3.5e-05,1e-06,2.2e-05,3.8e-05,4.6e-05,6.3e-05,3.1e-05,3.3e-05,4.3e-05,4.6e-05,1.6e-05,3e-05,3e-05,7e-06,9e-06,5.4e-05,3e-05,2.1e-05,3.2e-05,5e-06,4.4e-05,4.2e-05,2e-06,4e-05,1.3e-05,1e-05,4.9e-05,1.3e-05,1.7e-05,2e-05,4e-05,1.3e-05,2.5e-05,4.2e-05,1.6e-05,3.5e-05,7e-06,1.4e-05,1.9e-05,2e-05,2.1e-05,1.8e-05,3.7e-05,1e-05,1.2e-05,3.5e-05,2.7e-05,2.3e-05,6.1e-05,7.9e-05,3e-05,2.2e-05,1.6e-05,1.6e-05,1.1e-05,7e-06,1.6e-05,2.4e-05,4.4e-05,5.6e-05,2.9e-05,2.3e-05,2.2e-05,1.5e-05,1.1e-05,2.6e-05,1.9e-05,1.9e-05,1.4e-05,1.2e-05,2.9e-05,2.4e-05,1.6e-05,1e-05,8e-06,7e-06,7e-06,1.2e-05,7e-06,6e-06
7.5e-05,3.9e-05,5.5e-05,7.9e-05,6.7e-05,8.7e-05,2.1e-05,1.7e-05,6e-06,3e-05,4.2e-05,2.8e-05,1.8e-05,1.6e-05,3.8e-05,6.9e-05,3.3e-05,2.6e-05,3.8e-05,4.8e-05,5.3e-05,1.4e-05,3e-05,7.4e-05,5.2e-05,1.4e-05,6.2e-05,8e-06,2.1e-05,2.3e-05,4.4e-05,5.3e-05,6e-06,1.7e-05,6e-06,3.7e-05,2.2e-05,5.1e-05,4e-05,5.7e-05,3.6e-05,3.1e-05,1.4e-05,3.5e-05,2e-05,2.8e-05,2.9e-05,1.7e-05,5e-05,2.7e-05,1.1e-05,1.2e-05,2.9e-05,9e-06,1.8e-05,2.4e-05,3.8e-05,1.4e-05,5e-06,2.3e-05,1.1e-05,4.2e-05,1.1e-05,2.5e-05,1.2e-05,1.1e-05,7e-06,3.8e-05,3e-05,1.4e-05,1.6e-05,2.4e-05,2.6e-05,2.8e-05,2.8e-05,1.1e-05,1.6e-05,5e-06,6e-06,1.2e-05,2.9e-05,2e-05,1.8e-05,3.6e-05,3.2e-05,2.8e-05,2.6e-05,4.2e-05,5e-06,5.2e-05,2.3e-05,1.5e-05,1.8e-05,1.8e-05,2e-06,1.8e-05,1e-05,2.3e-05,3e-06,2.8e-05,9e-06,1.1e-05,2.1e-05,2.5e-05,3.9e-05,1.8e-05,3.1e-05,2.9e-05,1.3e-05,1.9e-05,2.3e-05,1.3e-05,1.7e-05,6e-06,8e-06,2e-06,1.1e-05,1.3e-05,1.9e-05,1.1e-05,9e-06
1.8e-05,2.8e-05,1.2e-05,3.4e-05,2.3e-05,2.4e-05,2.8e-05,4e-06,8e-06,2.1e-05,1.6e-05,5e-06,2.4e-05,1.2e-05,1.7e-05,2.8e-05,2.6e-05,1.9e-05,9e-06,1.5e-05,3e-05,1.5e-05,6e-06,2.5e-05,4e-05,3.8e-05,1.8e-05,4.7e-05,1.6e-05,1.3e-05,2.4e-05,3.6e-05,2.6e-05,1.9e-05,5e-06,2.4e-05,6.8e-05,6e-06,4e-06,5.5e-05,5.3e-05,5.2e-05,4.7e-05,2.7e-05,8e-06,3.1e-05,6.4e-05,5e-05,1.6e-05,2.7e-05,6e-06,2.5e-05,1.7e-05,1.2e-05,6e-06,8e-06,1.8e-05,1.9e-05,1.1e-05,2.3e-05,1.2e-05,2.1e-05,8e-06,5e-06,2.1e-05,1.3e-05,2.2e-05,7e-06,1.4e-05,8e-06,2.4e-05,2.1e-05,1.2e-05,1.3e-05,1.2e-05,1.9e-05,1e-05,1.2e-05,1.2e-05,2.2e-05,2.7e-05,2.2e-05,2e-06,2.8e-05,3e-05,1.5e-05,1.7e-05,3.8e-05,1.2e-05,4.1e-05,2.9e-05,3.9e-05,1.4e-05,1.3e-05,1.3e-05,8e-06,9e-06,1.2e-05,8e-06,1e-05,1.2e-05,1.5e-05,1.4e-05,2.4e-05,1.5e-05,1.3e-05,1.4e-05,1.4e-05,1.3e-05,1.8e-05,1.5e-05,1.9e-05,3e-06,4e-06,5e-06,9e-06,1.1e-05,1.3e-05,1.5e-05,9e-06,1.2e-05
3.6e-05,1.9e-05,1.5e-05,1e-05,2e-05,4.5e-05,3.5e-05,2.3e-05,5e-06,1e-05,1.2e-05,4e-06,2.7e-05,1.4e-05,9e-06,2.5e-05,3.1e-05,1e-05,2.2e-05,3e-05,2.9e-05,1.2e-05,1.9e-05,2.7e-05,3.5e-05,9e-06,2e-05,1.9e-05,2.5e-05,1.4e-05,1e-05,3.6e-05,2.4e-05,5e-06,1.5e-05,1.1e-05,5e-05,3.8e-05,3.1e-05,1.5e-05,1.9e-05,2.1e-05,3.3e-05,3.6e-05,2e-06,2.6e-05,3.7e-05,3.3e-05,1.1e-05,3.5e-05,2.7e-05,3.4e-05,2.8e-05,3.6e-05,2.5e-05,2e-05,2.9e-05,2.4e-05,1e-05,1.8e-05,4e-06,1.2e-05,1.7e-05,1.2e-05,3.2e-05,9e-06,2.2e-05,9e-06,2.8e-05,1e-05,3.3e-05,2.3e-05,3e-06,7e-06,7e-06,2.3e-05,1.7e-05,1.3e-05,1.9e-05,1.5e-05,3.2e-05,1.2e-05,1.2e-05,8e-06,2.9e-05,2.4e-05,2.5e-05,9e-06,1.4e-05,3.7e-05,2e-05,1.9e-05,4e-06,1.5e-05,2.7e-05,2.9e-05,2.3e-05,1.7e-05,7e-06,4e-06,2.1e-05,2.6e-05,1.8e-05,1.7e-05,2.5e-05,1.1e-05,8e-06,1e-05,1e-06,1.1e-05,8e-06,1.6e-05,3e-06,3e-06,4e-06,1.2e-05,2.3e-05,2e-06,1.2e-05,6e-06,1.4e-05
3.9e-05,2.3e-05,1.5e-05,2.4e-05,7e-06,4e-05,2.6e-05,2.3e-05,2.5e-05,1.1e-05,1.1e-05,1.1e-05,1.3e-05,1.2e-05,8e-06,2.7e-05,3e-05,2.1e-05,3.6e-05,2.5e-05,1.7e-05,1.8e-05,2.6e-05,1.1e-05,3.3e-05,2.7e-05,2.8e-05,2.2e-05,9e-06,6e-06,1.9e-05,1.6e-05,2.1e-05,2e-05,4e-06,1.5e-05,4.1e-05,2.4e-05,1.4e-05,2.2e-05,1.4e-05,9e-06,3.4e-05,3.4e-05,2.3e-05,2.9e-05,2.9e-05,1.4e-05,1e-05,2.4e-05,1.1e-05,7e-06,3e-06,1.8e-05,9e-06,3.4e-05,2e-05,1.8e-05,1e-05,5e-06,5e-06,8e-06,1.9e-05,8e-06,1e-05,1e-05,1.8e-05,2.1e-05,3.1e-05,1e-05,1.5e-05,6e-06,4e-06,6e-06,9e-06,1.8e-05,7e-06,1e-05,1.6e-05,1.2e-05,1.5e-05,8e-06,1.7e-05,1.1e-05,2.2e-05,1.2e-05,1.4e-05,1.3e-05,1.1e-05,2.4e-05,1.4e-05,2e-05,7e-06,1.5e-05,6e-06,1.6e-05,1.7e-05,2e-06,5e-06,1.3e-05,2e-05,2.9e-05,1.5e-05,1.4e-05,1e-05,1.5e-05,7e-06,3e-06,4e-06,3e-06,7e-06,1.5e-05,3e-06,6e-06,5e-06,1.4e-05,1.7e-05,1.7e-05,1.5e-05,6e-06,1e-05
3e-05,2.5e-05,2.1e-05,2.9e-05,4e-06,2.5e-05,1.2e-05,1.1e-05,1.3e-05,8e-06,1e-05,5e-06,4e-06,6e-06,7e-06,1.7e-05,2.9e-05,2.4e-05,8e-06,1.5e-05,1.1e-05,9e-06,9e-06,1.4e-05,2.2e-05,6e-06,4.1e-05,3.9e-05,6e-06,1.1e-05,1.5e-05,2.8e-05,2.4e-05,8e-06,9e-06,8e-06,2.8e-05,1.9e-05,4e-06,4.3e-05,3.8e-05,2.7e-05,2.2e-05,1.4e-05,1.6e-05,1.1e-05,1.3e-05,1.7e-05,1.6e-05,1.6e-05,1.4e-05,1.3e-05,1.2e-05,1.3e-05,9e-06,2.8e-05,1.6e-05,1e-05,6e-06,1.7e-05,9e-06,3e-06,2.1e-05,1.5e-05,1.6e-05,1.2e-05,4e-06,8e-06,1.7e-05,4e-06,7e-06,2.3e-05,9e-06,1.9e-05,2.5e-05,1e-05,7e-06,1.8e-05,9e-06,1.4e-05,6e-06,1e-05,2.2e-05,6e-06,8e-06,1e-05,1e-05,8e-06,1.1e-05,2.8e-05,1.9e-05,2e-05,7e-06,3e-06,1e-06,1e-05,1.5e-05,1.7e-05,6e-06,1.1e-05,2.2e-05,2.6e-05,1.5e-05,1e-05,9e-06,2e-06,5e-06,5e-06,8e-06,1e-06,4e-06,1.4e-05,6e-06,9e-06,8e-06,1.1e-05,1.5e-05,9e-06,1.3e-05,8e-06,6e-06
2.9e-05,1.4e-05,1.2e-05,1.3e-05,1.1e-05,3.3e-05,6e-06,6e-06,1.4e-05,1.5e-05,3e-06,1e-05,8e-06,8e-06,1.1e-05,3.1e-05,2.4e-05,6e-06,2e-06,1.8e-05,8e-06,1.5e-05,8e-06,2.1e-05,2.3e-05,2.7e-05,4.3e-05,4.1e-05,3.7e-05,3.2e-05,2.5e-05,2.9e-05,1.5e-05,8e-06,5e-06,1.2e-05,4.9e-05,2.1e-05,8e-06,2e-05,1.2e-05,1e-05,4.3e-05,3.1e-05,7e-06,1.3e-05,1e-05,1.9e-05,1e-05,1.4e-05,1.5e-05,2e-05,8e-06,1.6e-05,1e-05,2.3e-05,1.2e-05,1.4e-05,3e-06,2.5e-05,8e-06,1e-05,1.8e-05,1e-05,2e-05,1.5e-05,1.4e-05,6e-06,2.4e-05,8e-06,9e-06,1.8e-05,1.2e-05,1.1e-05,1.8e-05,1.3e-05,4e-06,8e-06,1.9e-05,8e-06,1e-05,1.8e-05,5e-06,1e-05,7e-06,1e-05,4e-06,1.4e-05,1.2e-05,1.9e-05,1.9e-05,1.5e-05,4e-06,1e-05,6e-06,1.1e-05,9e-06,1e-05,3e-06,2e-06,1.6e-05,1.6e-05,8e-06,4e-06,3e-06,1e-05,8e-06,5e-06,2e-06,9e-06,6e-06,1.5e-05,1.2e-05,6e-06,1.3e-05,7e-06,1.3e-05,7e-06,7e-06,9e-06,8e-06
5e-06,1.1e-05,1.2e-05,1.9e-05,1.2e-05,2.4e-05,7e-06,1e-05,3e-06,5e-06,1.1e-05,3e-06,6e-06,7e-06,1.4e-05,3e-05,4e-06,1.9e-05,9e-06,2.2e-05,8e-06,2.2e-05,1.2e-05,2.3e-05,1.2e-05,1.9e-05,2.5e-05,2e-05,2.4e-05,1.1e-05,4e-06,3.1e-05,1.2e-05,1e-05,1.3e-05,1.2e-05,3.2e-05,1.1e-05,1e-05,8e-06,2.5e-05,6e-06,1.8e-05,2.7e-05,4e-06,1.6e-05,1.9e-05,1.9e-05,8e-06,1.2e-05,1.4e-05,1.2e-05,7e-06,2e-05,7e-06,1.8e-05,9e-06,9e-06,1e-05,1.4e-05,7e-06,1.2e-05,2.1e-05,1e-06,1e-05,9e-06,7e-06,1e-05,1.2e-05,6e-06,1.2e-05,1.4e-05,6e-06,8e-06,1.1e-05,7e-06,7e-06,1.1e-05,1.8e-05,5e-06,7e-06,8e-06,1.2e-05,9e-06,3e-06,8e-06,5e-06,1.5e-05,4e-06,1.7e-05,1.7e-05,2.2e-05,1e-05,7e-06,2e-06,1.9e-05,5e-06,1.2e-05,4e-06,1.2e-05,1.5e-05,1.7e-05,9e-06,7e-06,1e-05,7e-06,9e-06,1.2e-05,5e-06,7e-06,1e-06,2.3e-05,1e-05,5e-06,8e-06,6e-06,1e-05,5e-06,7e-06,7e-06,4e-06
2.4e-05,1.6e-05,1.6e-05,7e-06,5e-06,2.2e-05,1.2e-05,1.2e-05,5e-06,5e-06,8e-06,2e-06,1e-05,1.2e-05,1.3e-05,2e-05,1.5e-05,5e-06,7e-06,1.1e-05,2e-05,1.4e-05,1.6e-05,2.3e-05,6e-06,1.1e-05,2.3e-05,1e-05,1.6e-05,1.4e-05,1.1e-05,2.6e-05,1e-06,2.3e-05,9e-06,1.5e-05,4.3e-05,1e-05,3e-06,5e-06,1.2e-05,1e-05,2.1e-05,3e-05,6e-06,1.9e-05,2.8e-05,3.1e-05,1.8e-05,7e-06,1.8e-05,2.1e-05,1e-05,2.2e-05,1.1e-05,1.4e-05,1.3e-05,1.2e-05,8e-06,8e-06,2e-06,1.1e-05,1.6e-05,9e-06,1.6e-05,6e-06,2e-06,1e-05,1.5e-05,1.3e-05,1.2e-05,1.8e-05,1.4e-05,2e-06,1.6e-05,1.7e-05,3e-06,1.3e-05,5e-06,8e-06,5e-06,1.2e-05,1e-06,9e-06,1.6e-05,1.4e-05,1.1e-05,2.4e-05,8e-06,2.2e-05,1.4e-05,2.2e-05,5e-06,2e-06,1e-06,1e-05,7e-06,1.8e-05,4e-06,1e-05,1.7e-05,2.2e-05,4e-06,6e-06,7e-06,3e-06,3e-06,4e-06,6e-06,3e-06,5e-06,1.9e-05,2e-06,8e-06,2e-06,3e-06,8e-06,4e-06,1e-06,7e-06,7e-06
2.2e-05,2.1e-05,2.3e-05,3.5e-05,1.5e-05,2.7e-05,1.9e-05,2e-06,8e-06,1e-06,8e-06,1.1e-05,1.5e-05,1.1e-05,5e-06,1.8e-05,1e-05,1.1e-05,1.3e-05,1.3e-05,1.7e-05,1.3e-05,1.5e-05,2.1e-05,1.3e-05,6e-06,3.3e-05,1.6e-05,2.3e-05,1.9e-05,1.3e-05,1.7e-05,1.5e-05,1.7e-05,1.4e-05,1.6e-05,3.4e-05,9e-06,1.4e-05,2e-05,1.4e-05,8e-06,1.9e-05,2.6e-05,1.1e-05,3.2e-05,1.1e-05,3.4e-05,1.5e-05,1.3e-05,4e-06,1.6e-05,6e-06,1.3e-05,2.1e-05,1.4e-05,3e-06,8e-06,1.3e-05,4e-06,1.4e-05,1e-05,2.5e-05,1e-05,2e-05,2e-06,7e-06,1.1e-05,1.8e-05,1.4e-05,4e-06,7e-06,1.2e-05,1.3e-05,1.2e-05,1.9e-05,1e-05,2e-05,1.5e-05,1.1e-05,1.3e-05,5e-06,9e-06,5e-06,7e-06,1.3e-05,7e-06,1.5e-05,2e-06,2.3e-05,1.3e-05,1.8e-05,9e-06,3e-06,4e-06,1e-05,7e-06,1.6e-05,1.4e-05,9e-06,1.4e-05,1.5e-05,1.5e-05,3e-06,9e-06,6e-06,2e-06,6e-06,8e-06,5e-06,3e-06,9e-06,6e-06,2e-06,4e-06,5e-06,1e-05,1e-05,3e-06,7e-06,2e-06
4.2e-05,2.7e-05,1.9e-05,3.2e-05,2.4e-05,2.5e-05,7e-06,5e-06,7e-06,8e-06,7e-06,6e-06,8e-06,4e-06,1.1e-05,1.5e-05,1.2e-05,7e-06,8e-06,8e-06,1.6e-05,1.2e-05,9e-06,2.2e-05,1.8e-05,3e-06,3.4e-05,1.5e-05,1.5e-05,1e-05,1.6e-05,1.1e-05,1.1e-05,2e-05,1.5e-05,1e-05,2.3e-05,1.3e-05,5e-06,3.4e-05,2e-05,1.2e-05,2.8e-05,1.1e-05,6e-06,2.9e-05,2.9e-05,1.7e-05,2.1e-05,5e-06,1.4e-05,1.6e-05,2.7e-05,1.8e-05,2e-06,2.2e-05,1.3e-05,1.1e-05,1.5e-05,2.3e-05,1.2e-05,2e-05,2.1e-05,9e-06,1.1e-05,7e-06,9e-06,6e-06,1.6e-05,1.2e-05,1.6e-05,1e-06,8e-06,1.5e-05,1.7e-05,2.2e-05,1.3e-05,1e-05,8e-06,1.4e-05,1.5e-05,8e-06,7e-06,9e-06,1.1e-05,6e-06,2e-06,1.6e-05,6e-06,1.3e-05,1.5e-05,1e-05,7e-06,4e-06,8e-06,1.2e-05,7e-06,9e-06,2e-06,3e-06,1.5e-05,1.7e-05,1.6e-05,7e-06,1.1e-05,1e-05,4e-06,4e-06,5e-06,2e-06,7e-06,2.4e-05,8e-06,2e-06,6e-06,4e-06,5e-06,4e-06,8e-06,1.1e-05,1.7e-05
2.5e-05,1.6e-05,9e-06,9e-06,5e-06,1.2e-05,1.4e-05,4e-06,1e-06,8e-06,3e-06,8e-06,1e-05,7e-06,1.3e-05,1.8e-05,1.7e-05,1.7e-05,5e-06,1.2e-05,6e-06,2.1e-05,3.3e-05,1.7e-05,7e-06,2.7e-05,3.2e-05,2.5e-05,1.7e-05,2.9e-05,2.5e-05,3.8e-05,1.5e-05,1.2e-05,3e-06,1.3e-05,1.3e-05,3.4e-05,4.3e-05,4.1e-05,3.5e-05,4e-05,1.9e-05,2.8e-05,8e-06,2e-05,7e-06,6e-06,4e-06,1.1e-05,1.3e-05,2.2e-05,3.5e-05,1.5e-05,5e-06,1.4e-05,1.1e-05,4e-06,1.3e-05,1.1e-05,1e-05,1.8e-05,4.1e-05,1.5e-05,3.2e-05,2.5e-05,7e-06,1.9e-05,1.4e-05,8e-06,1.6e-05,1.9e-05,1.7e-05,1.6e-05,1.2e-05,2e-05,8e-06,1.1e-05,1.6e-05,8e-06,1.7e-05,1e-06,8e-06,3e-06,1.4e-05,1.9e-05,1.4e-05,1.5e-05,6e-06,1.3e-05,1.4e-05,2.1e-05,8e-06,5e-06,9e-06,1.5e-05,5e-06,6e-06,1.4e-05,8e-06,1e-05,1.1e-05,9e-06,3e-06,1.3e-05,4e-06,4e-06,6e-06,5e-06,2e-06,1e-05,2e-05,4e-06,8e-06,1e-05,5e-06,8e-06,3e-06,7e-06,9e-06,8e-06
1.8e-05,1.5e-05,9e-06,1.8e-05,6e-06,1.9e-05,8e-06,1e-06,4e-06,1.2e-05,1.4e-05,1.2e-05,1.5e-05,2e-06,1.2e-05,1.6e-05,1.8e-05,1.5e-05,1e-05,1e-05,9e-06,2.3e-05,4e-06,2.2e-05,1.2e-05,1.9e-05,2.6e-05,1.8e-05,1.7e-05,1.2e-05,7e-06,2.7e-05,3e-06,5e-06,9e-06,1.5e-05,2.5e-05,3.7e-05,2.5e-05,7e-06,2e-05,3e-06,1.5e-05,5e-06,2.5e-05,3.3e-05,2.3e-05,1.4e-05,9e-06,9e-06,1.4e-05,2.5e-05,4e-06,6e-06,6e-06,2e-06,9e-06,8e-06,1.4e-05,1.5e-05,1.4e-05,1.2e-05,1.4e-05,5e-06,1.9e-05,6e-06,3e-06,1.9e-05,3.7e-05,1.8e-05,3e-06,9e-06,9e-06,1.3e-05,6e-06,1.1e-05,4e-06,5e-06,5e-06,1e-06,1.6e-05,7e-06,1.1e-05,6e-06,1e-06,2.3e-05,1e-05,2.1e-05,3e-06,2.3e-05,6e-06,1.6e-05,7e-06,9e-06,3e-06,1.1e-05,1e-06,2e-06,1.1e-05,8e-06,2.1e-05,1e-05,6e-06,8e-06,1e-05,7e-06,4e-06,4e-06,3e-06,3e-06,1e-05,1.9e-05,9e-06,2e-06,8e-06,1e-05,9e-06,4e-06,4e-06,2e-06,5e-06
1.6e-05,6e-06,7e-06,1e-05,6e-06,1.6e-05,8e-06,2e-06,6e-06,1.1e-05,6e-06,4e-06,1.2e-05,8e-06,3e-06,2.1e-05,2.5e-05,3e-06,7e-06,1.9e-05,1.1e-05,1e-05,1e-05,1.3e-05,9e-06,1.5e-05,3.2e-05,1.6e-05,1.6e-05,1.2e-05,3e-06,2.1e-05,8e-06,6e-06,5e-06,6e-06,3e-05,2.5e-05,2.7e-05,1.5e-05,1.5e-05,1.4e-05,8e-06,1.1e-05,1e-05,2.4e-05,4e-06,1.6e-05,7e-06,1.9e-05,7e-06,7e-06,1.1e-05,7e-06,1e-06,1.1e-05,4e-06,1.3e-05,8e-06,1.3e-05,3e-06,1.1e-05,1.7e-05,9e-06,1.3e-05,2e-06,5e-06,5e-06,1.8e-05,4e-06,3e-06,3e-06,5e-06,1.1e-05,5e-06,1.2e-05,6e-06,7e-06,9e-06,4e-06,9e-06,1e-06,7e-06,1.2e-05,1e-05,1.3e-05,5e-06,2e-05,6e-06,2.8e-05,9e-06,1.9e-05,1.4e-05,7e-06,8e-06,7e-06,4e-06,4e-06,6e-06,1.3e-05,1.1e-05,1.9e-05,1.3e-05,5e-06,2e-06,9e-06,7e-06,7e-06,5e-06,6e-06,5e-06,9e-06,1e-06,6e-06,4e-06,5e-06,3e-06,2e-06,2e-06,5e-06,1e-05
1.3e-05,1e-05,6e-06,5e-06,6e-06,2.1e-05,1.2e-05,4e-06,3e-06,5e-06,5e-06,2e-06,7e-06,6e-06,5e-06,1.4e-05,2.2e-05,8e-06,3e-06,1.6e-05,1e-06,1e-06,7e-06,1.7e-05,6e-06,1.5e-05,2.9e-05,1.9e-05,7e-06,5e-06,3e-06,2.5e-05,5e-06,1e-05,3e-06,4e-06,2.8e-05,1.3e-05,1.7e-05,5e-06,7e-06,9e-06,1.1e-05,1.6e-05,3e-06,8e-06,2e-05,1.6e-05,7e-06,9e-06,3e-06,6e-06,3e-06,1e-05,5e-06,8e-06,1e-06,1.5e-05,6e-06,9e-06,3e-06,6e-06,1.4e-05,7e-06,1.2e-05,8e-06,3e-06,8e-06,1.2e-05,3e-06,5e-06,3e-06,5e-06,4e-06,9e-06,1.2e-05,6e-06,6e-06,6e-06,4e-06,7e-06,5e-06,5e-06,1e-05,9e-06,1.2e-05,4e-06,1.5e-05,2e-06,1.7e-05,1.1e-05,2.1e-05,8e-06,7e-06,0,1.1e-05,1e-06,2e-06,1e-06,8e-06,1.1e-05,1.6e-05,9e-06,7e-06,8e-06,7e-06,3e-06,6e-06,6e-06,2e-06,1e-06,1.7e-05,3e-06,7e-06,4e-06,2e-06,6e-06,3e-06,2e-06,6e-06,6e-06
1.6e-05,1.1e-05,9e-06,6e-06,4e-06,1.9e-05,1e-05,1e-06,2e-06,3e-06,3e-06,3e-06,8e-06,5e-06,4e-06,1.6e-05,1.8e-05,8e-06,5e-06,1.1e-05,2e-06,3e-06,7e-06,1.5e-05,9e-06,1e-05,2.4e-05,1.8e-05,6e-06,5e-06,1e-06,2.3e-05,6e-06,7e-06,7e-06,1e-06,2.8e-05,1e-05,1.8e-05,2e-06,7e-06,9e-06,9e-06,1.7e-05,2e-06,6e-06,1.6e-05,1.4e-05,6e-06,1.2e-05,1e-06,1e-06,3e-06,7e-06,3e-06,1e-05,2e-06,1.2e-05,3e-06,1.2e-05,3e-06,5e-06,1.6e-05,4e-06,1.5e-05,7e-06,0,7e-06,1.6e-05,4e-06,2e-06,2e-06,2e-06,1e-06,8e-06,1e-05,1e-06,4e-06,5e-06,4e-06,9e-06,3e-06,8e-06,1e-05,7e-06,1e-05,2e-06,1.3e-05,1e-06,1.4e-05,1.1e-05,2.1e-05,9e-06,4e-06,3e-06,1.2e-05,1e-06,5e-06,5e-06,8e-06,1e-05,1.5e-05,1e-05,7e-06,6e-06,6e-06,2e-06,4e-06,4e-06,3e-06,2e-06,1.3e-05,2e-06,5e-06,3e-06,0,5e-06,2e-06,2e-06,3e-06,7e-06
1.5e-05,9e-06,5e-06,9e-06,4e-06,2e-05,1e-05,1e-06,1e-06,3e-06,3e-06,3e-06,7e-06,4e-06,6e-06,1.6e-05,1.8e-05,6e-06,4e-06,1e-05,1e-06,2e-06,7e-06,1.6e-05,9e-06,1.1e-05,2.4e-05,1.7e-05,6e-06,4e-06,2e-06,2.2e-05,8e-06,7e-06,5e-06,4e-06,3e-05,7e-06,1.5e-05,1e-06,7e-06,1e-05,8e-06,1.7e-05,1e-06,7e-06,1.7e-05,1.3e-05,6e-06,1e-05,3e-06,2e-06,5e-06,8e-06,2e-06,9e-06,2e-06,1.2e-05,0,1e-05,5e-06,5e-06,1.6e-05,2e-06,1.4e-05,7e-06,1e-06,6e-06,1.5e-05,3e-06,2e-06,3e-06,2e-06,0,8e-06,9e-06,2e-06,4e-06,6e-06,3e-06,9e-06,2e-06,8e-06,1e-05,8e-06,9e-06,3e-06,1.5e-05,1e-06,1.5e-05,1.1e-05,1.8e-05,8e-06,4e-06,3e-06,1.1e-05,2e-06,4e-06,5e-06,6e-06,1.1e-05,1.5e-05,1.1e-05,5e-06,7e-06,7e-06,1e-06,4e-06,3e-06,3e-06,2e-06,1.3e-05,0,4e-06,3e-06,1e-06,5e-06,3e-06,1e-06,2e-06,6e-06
