-0.001162,-0.001076,-0.001019,-0.000916,-0.001968,-0.001899,-0.00159,-0.001172,-0.00061,-0.000852,-0.001707,-0.00135,-0.001069,-0.001797,-0.003492,-0.002278,-0.001597,-0.001541,-0.002537,-0.002461,-0.002753,-0.00216,-0.001824,-0.001644,-0.001518,-0.001685,-0.002583,-0.002684,-0.00236,-0.002657,-0.001751,-0.001546,-0.001417,-0.002043,-0.003486,-0.002908,-0.002364,-0.002746,-0.001739,-0.002621,-0.001629,-0.002263,-0.002575,-0.001909,-0.001171,-0.001519,-0.001043,-0.00114,-0.002787,-0.002405,-0.002188,-0.002111,-0.003177,-0.001866,-0.003014,-0.003316,-0.002164,-0.002012,-0.001881,-0.001505,-0.002647,-0.002712,-0.002894,-0.002711,-0.002319,-0.002331,-0.001955,-0.002551,-0.002129,-0.001827,-0.002038,-0.002379,-0.002119,-0.001611,-0.002761,-0.002769,-0.004579,-0.00381,-0.001967,-0.001394,-0.001643,-0.001419,-0.002665,-0.002237,-0.002648,-0.003432,-0.002627,-0.001742,-0.002115,-0.001829,-0.00328,-0.002641,-0.00198,-0.001702,-0.002595,-0.002502,-0.002577,-0.001721,-0.001967,-0.001951,-0.002024,-0.001911,-0.002428,-0.001439,-0.001282,-0.003034,-0.002085,-0.002092,-0.002079,-0.002725,-0.002116,-0.003319,-0.002245,-0.001804,-0.001942,-0.001816,-0.001966,-0.002098,-0.002895,-0.001008,-0.002415
0.000433,0.00051,0.000465,0.00018,0.000647,0.000669,0.000608,0.000417,-0.000226,0.000161,0.001096,0.000799,0.000563,0.000704,0.002041,0.001346,6e-04,0.000654,0.000722,0.000937,0.001335,0.001574,0.000803,0.000433,0.000542,0.000336,0.001145,0.001151,0.001088,0.001428,0.000565,0.000267,0.000145,0.000508,0.002088,0.001286,0.000529,0.001894,0.000495,0.001575,0.000999,0.001002,0.001152,0.000767,0.000303,0.000693,0.000439,-0.000287,0.001155,0.000558,0.000602,0.001601,0.001712,0.000692,0.001862,0.001393,0.000744,0.000929,0.000893,0.000425,0.001401,0.001338,0.001754,0.001342,0.00066,0.000749,0.00087,0.001713,0.00103,0.000874,0.000833,0.000551,0.000671,0.000607,0.001434,0.001176,0.002311,0.001987,0.000957,0.000411,0.000184,4.2e-05,0.000953,0.00109,0.00081,0.001557,0.001414,0.000866,0.00039,0.000828,0.001287,0.001194,0.000716,0.000594,0.001616,0.001629,0.001704,0.000734,0.001128,0.000809,0.000407,0.000952,0.000883,0.000858,0.000247,0.00135,0.000616,0.000859,0.000994,0.001748,0.000921,0.001505,0.001019,0.000727,0.00095,0.000838,0.000565,0.001336,0.001261,0.000726,0.001607
-0.000403,-0.000608,-0.000434,-0.000282,-7e-06,7.4e-05,-0.000214,-0.000475,-3.3e-05,0.000218,-0.000832,-0.000917,-0.000517,-0.000223,-0.001416,-0.000658,-0.000651,-0.000338,-0.000218,-0.000388,-0.000614,-0.000934,-0.000473,-3.8e-05,-0.000188,0.00033,-0.000407,-0.000396,-0.000122,-0.000969,-0.000152,-0.000221,-0.000128,-0.000423,-0.000874,-0.000558,0.000146,-0.001481,-0.000323,-0.000695,-1.2e-05,-0.000356,-4.2e-05,-0.000432,-9.8e-05,-0.000543,-0.000892,0.000138,0.000144,0.000162,-0.000116,-0.00143,-0.001164,-0.000462,-0.001267,-0.000966,-0.000744,-0.000684,-0.000245,0.000317,-0.000956,-0.000374,-0.001076,-0.000973,-0.00062,-1.8e-05,-0.000296,-0.000926,-0.000857,-0.00029,-0.000867,-0.000229,-0.000552,-0.000664,-0.00103,-0.000547,-0.000342,-0.000664,-0.00069,-0.000351,-0.000259,-4.1e-05,-0.000324,-0.000358,-2e-04,-0.000382,-0.001101,-0.000344,-0.000105,-0.000448,-0.000364,-0.00018,-0.000411,-0.000199,-0.001337,-0.001702,-0.001394,-0.000551,-0.000658,0.000292,-0.000197,-0.000765,-0.000592,-0.000841,-0.000147,-0.000447,6.3e-05,-0.00053,-0.000147,-0.001599,-0.000841,-0.000568,-0.000858,-0.00039,-0.000767,-0.000544,-0.000405,-0.000614,-0.00029,-4.9e-05,-0.001047
9.9e-05,0.000117,-4e-05,-7.7e-05,-0.000268,-0.000404,-0.000404,1e-06,-8e-05,-0.000243,0.000104,0.000189,0.000113,-0.000179,0.000612,-0.000252,1.5e-05,0.000142,0.000177,0.000158,0.000645,0.000429,0.000311,-0.000313,-0.000117,-0.000373,-0.000264,-0.000106,-0.000239,0.000617,0.000189,1.4e-05,6e-06,-0.000106,0.000439,-0.000369,-0.000439,0.000649,-5.9e-05,0.000143,-0.000644,-0.000227,-0.000456,-1.9e-05,-0.000298,0.000257,0.000409,0.000151,-0.000721,-0.000649,-0.000382,0.000644,0.000783,0.000582,0.000573,0.000956,0.000188,0.000385,-0.000216,-0.000762,0.000562,0.000598,0.000161,0.000807,-0.000207,-0.000459,0.000233,7.3e-05,0.000449,0.000371,0.000651,0.000285,-1.6e-05,0.00029,0.000456,-0.000312,-0.000938,-0.000298,0.000125,0.000206,1.8e-05,-6.7e-05,-7.5e-05,-0.000247,6e-06,-0.000531,0.000416,0.000431,0.000301,-0.000324,-0.00014,-0.000527,0.000197,4.4e-05,0.000585,0.001293,0.000568,4.9e-05,5.4e-05,-0.000377,-0.000204,0.000563,0.000275,0.000354,-1.2e-05,0.000121,-0.000491,0.000235,-0.00016,0.000961,0.00067,-1.5e-05,9.5e-05,0.000378,0.000381,0.00054,0.00018,-2.8e-05,-0.000267,-0.000207,0.000616
-0.000125,-0.000259,-2.9e-05,5.8e-05,2.7e-05,0.000212,0.000249,0.000188,0.000147,-2.9e-05,6.9e-05,7.7e-05,-0.000149,0.000236,-0.000325,0.000743,-9.2e-05,-0.000284,-3.3e-05,-0.000363,-0.000632,-0.000415,6.5e-05,0.000335,0.000165,0.000277,0.000122,-8.6e-05,5.6e-05,-0.000278,-0.000116,-0.000136,-0.000108,-0.000131,-0.000213,0.000434,1.3e-05,-0.000243,-3.1e-05,0.000171,0.000558,0.000276,7.7e-05,-5.7e-05,8.1e-05,-0.000259,-0.000529,-0.000359,0.000347,-6.8e-05,0.000836,-0.000212,-0.000818,-0.000563,8e-05,-0.000442,-0.000276,-0.000376,-1.7e-05,0.000271,-0.00014,-0.000893,0.00028,-0.000668,-0.000283,6.4e-05,-0.000282,-4.6e-05,-0.000483,-0.00035,-0.000386,-0.000527,0.000409,-3.1e-05,-0.000203,0.000281,0.00069,0.000123,-0.000228,-0.000168,0.000181,-0.000125,-0.000378,-3.7e-05,-1.3e-05,0.000473,-0.000202,-0.000223,-0.000522,7.9e-05,-0.000169,0.000548,-0.000195,-0.000163,-4.2e-05,-0.000676,-0.000299,0.00024,5.9e-05,-4.7e-05,0.000131,-0.000525,-0.000144,-9.2e-05,-3.2e-05,-0.000244,7.5e-05,-0.000114,-0.000396,-0.000456,-0.000466,0.000263,-7e-06,-0.000158,8.9e-05,-0.000428,-0.000189,5.9e-05,1.1e-05,-0.000335,-0.000886
3.7e-05,0.000397,0.000195,0.000155,-0.000158,-1.3e-05,1.2e-05,-0.000278,-0.000135,0.000217,4e-06,-0.000267,-3.1e-05,-0.000324,0.000319,-0.000492,0.000371,0.000279,-2.8e-05,0.000406,0.000236,0.000493,-0.000396,-0.000415,-0.000184,-0.000255,0.000155,0.000284,-0.000106,0.00031,0.000242,3.9e-05,1e-05,-6.5e-05,0.000107,0.000119,0.000407,0.000181,0.00012,-8.4e-05,-0.000497,0.000101,0.000213,0.000221,-0.00018,-0.000107,0.000527,0.000298,-2e-06,0.000545,-0.000982,2.4e-05,0.000452,0.000162,-0.00036,6.9e-05,0.000639,0.00042,-8.5e-05,-4e-06,7.4e-05,0.000801,-0.000568,0.000447,0.00021,-0.000263,0.000187,4.3e-05,0.000184,1.6e-05,7e-06,0.000478,-0.000358,0.000223,8e-06,-6.3e-05,0.000123,0.000464,0.000674,0.000238,-6.5e-05,-0.000119,0.000436,0.00022,0.000104,-0.000535,-0.000368,-0.000221,0.000271,-9.7e-05,0.000119,-0.000414,9.4e-05,4.6e-05,8.9e-05,0.000498,-3.2e-05,-0.000383,-6.7e-05,0.000211,0.000345,0.000162,6.2e-05,-6.1e-05,8.4e-05,0.000238,0.000293,0.000228,0.00052,0.000175,0.000375,6.7e-05,0.000282,0.000243,2.6e-05,0.000492,0.000212,-0.000294,0.000198,0.000637,0.000791
0.000152,-0.000124,-0.000128,7.6e-05,0.000137,9e-06,0.000172,0.000221,0.000151,-6.1e-05,-3e-06,0.000405,0.000101,0.000249,-0.000269,0.000169,-0.000249,-0.000339,-1e-04,-0.000256,-0.000286,-0.000575,0.000496,0.000327,0.000205,0.000122,-4.1e-05,-0.000146,-0.00015,0.00011,-0.000305,4.5e-05,4.3e-05,0.000383,-3.9e-05,-0.000198,-0.000487,-0.000196,0.000139,0.000102,0.000176,-8.7e-05,-0.000342,-0.000384,-0.000107,6.8e-05,-0.000293,-0.000351,3e-05,-4.8e-05,0.000456,0.000227,-0.000104,-8.4e-05,0.000198,-0.00011,-0.000406,-0.000357,0.000115,-0.000163,-0.000189,-0.000759,0.000327,-0.000136,-0.000256,0.000162,0.000101,-6.3e-05,-8.6e-05,0.000108,5.1e-05,-0.000393,2.9e-05,-0.000237,-0.00017,-0.000132,-0.000144,-0.000597,-0.000849,-0.00016,0.000179,7.7e-05,-0.000255,-0.000116,6.7e-05,0.000216,1.7e-05,0.000148,-0.000188,-3.7e-05,-2.7e-05,1.6e-05,-0.000339,8.7e-05,-0.000293,-0.000365,5.3e-05,0.000292,4.6e-05,-0.000291,-0.000311,0.000104,0.000143,-7.7e-05,-0.000305,-0.000205,-0.000208,-0.000349,-0.000273,-0.000237,-0.000463,-0.000392,-0.000335,-0.000324,6.4e-05,-0.00029,-0.000181,0.000345,-0.000235,-0.000623,-4.8e-05
-5.3e-05,1.2e-05,0.000248,-0.000137,4.6e-05,-4.7e-05,-0.000345,-0.000133,-0.000147,-0.000219,9.1e-05,-0.000295,8.7e-05,-9.7e-05,6.7e-05,-0.00016,5.2e-05,0.000198,-4e-05,7.1e-05,0.000161,0.000467,-0.000174,-0.00026,-0.000163,-0.000239,-0.000271,-7.7e-05,0.000311,-0.000416,-5.8e-05,2.1e-05,0.000324,-0.000134,7e-05,-0.00013,-8e-05,6.3e-05,-0.000218,-0.000129,-0.000198,-0.000202,0.000337,0.000282,9.1e-05,-4.9e-05,0.000284,0.000258,3e-05,-0.000221,-6.5e-05,-0.000574,3.4e-05,2e-05,1e-06,0.000137,0.000164,0.00019,-5.2e-05,3.2e-05,-6.3e-05,0.000497,-5e-06,-7e-06,0.000339,-6.8e-05,-0.000244,-1.4e-05,4.7e-05,0.000108,8.9e-05,0.000305,8.8e-05,6e-06,0.000143,0.000325,-0.000297,0.000206,0.000561,-0.000134,-1.8e-05,-1e-04,0.000215,0.00011,-0.000182,0.000304,6.4e-05,-0.000121,0.00012,-0.000106,3.3e-05,-2.7e-05,0.000234,-0.000102,0.000109,5.7e-05,-0.000313,-0.000181,-0.000138,0.000241,-1.7e-05,3.1e-05,-0.000124,5.8e-05,0.000203,-1.1e-05,0.000134,0.000154,0.000122,-5.9e-05,0.000327,0.000463,0.000143,0.000119,-0.000125,9.1e-05,-1.3e-05,-0.000269,9.3e-05,0.000305,-6.8e-05
0.000123,-3.5e-05,-0.000241,-4.6e-05,9.6e-05,0.000139,0.000472,1.6e-05,-1.7e-05,0.000135,-1.2e-05,0.000175,-5e-05,0.000178,0.000135,0.000218,0.000137,-3.9e-05,2.6e-05,-2e-05,0.000103,-0.000414,-1.4e-05,0.000125,2.1e-05,0.000116,0.000246,-1.7e-05,-7.4e-05,0.000102,0.000162,0.000101,-0.000243,-5.8e-05,-3e-05,4.4e-05,0.000385,-0.000139,7.6e-05,0.000247,0.000251,0.000177,-8.3e-05,-5.9e-05,4.6e-05,0.000289,-0.000113,-0.000107,-5.1e-05,0.000477,0.000253,0.000486,-3e-06,0.000103,-8.4e-05,-2.5e-05,-0.000135,-0.000257,-0.000161,0.00011,0.00013,-0.000336,0.000177,6.5e-05,-0.000266,0.000204,0.000201,0.000248,-3.1e-05,-0.000153,-0.00014,-0.000271,0.000201,1.4e-05,-0.000165,-0.000306,0.000323,0.000118,-0.000261,0.00017,-0.000276,-6.1e-05,2.8e-05,-7e-05,0.000285,-0.000258,0.00011,0.000262,-1e-04,8.8e-05,0.000138,9.1e-05,4e-06,-0.000124,1.7e-05,-0.000149,0.000342,3e-06,0.000228,-0.000132,2.9e-05,-5.4e-05,-0.000101,-4.7e-05,-9.8e-05,0,-9.8e-05,8.2e-05,-7.9e-05,8.8e-05,1.1e-05,-0.000267,-1.3e-05,-0.000266,0.000215,0.000147,-6e-05,0.000124,-0.000173,-0.000101,4e-05
-2.6e-05,2.8e-05,0.000132,-4.2e-05,-0.000255,-5.2e-05,-0.000357,2.3e-05,9.6e-05,5.8e-05,2.5e-05,-0.000145,7e-06,-0.00016,-0.000264,-0.000188,-0.000164,3.7e-05,-5.9e-05,-0.000107,-2.9e-05,9.4e-05,1e-06,1.4e-05,8.1e-05,-0.000158,-0.000271,6.8e-05,6.1e-05,8.9e-05,-8e-05,-0.000276,9.5e-05,7.6e-05,5.1e-05,-0.000129,-3e-04,9.7e-05,5.7e-05,-6.7e-05,-0.000239,-0.000192,4.2e-05,7.8e-05,-3.2e-05,-0.000125,6.7e-05,0.00026,-6e-06,-0.000463,-0.000161,-0.000351,-0.000122,-6.6e-05,-0.000194,-7.6e-05,0.000172,5e-05,0.000159,-8.9e-05,1.4e-05,0.000144,-0.000394,-0.000303,0.000222,-0.00011,-0.000221,-0.000141,-9.2e-05,0.000288,1.5e-05,0.000129,-0.000289,-0.000159,0.000212,0.000285,-0.000295,-9.4e-05,9e-05,-0.000151,0.000149,0.000152,-0.00033,0.000217,-0.000322,8.4e-05,-1.2e-05,-9.2e-05,0,6e-06,-0.000249,-4.4e-05,1.6e-05,0.000218,3e-06,0.000362,-0.000204,4.3e-05,-9.4e-05,-1.9e-05,4.9e-05,6.8e-05,0.000354,0.000113,0.000127,8.1e-05,-2.3e-05,7.6e-05,-6.3e-05,-8e-06,-0.000133,0.000249,-3.1e-05,0.00013,-0.000266,-0.000237,0.000188,-0.00016,0.000128,0.000171,3.3e-05
9e-06,-8.2e-05,-0.000118,0.000105,0.000196,-3.5e-05,0.000197,0.000102,-0.00011,5.4e-05,1.1e-05,0.000118,1.8e-05,0.000108,0.000171,0.000187,0.000213,-0.00012,6.1e-05,8.3e-05,1e-06,0.000125,3.7e-05,-5e-06,3.3e-05,0.000124,7.3e-05,-8.2e-05,-0.000195,-7.8e-05,-4.7e-05,0.000112,4.8e-05,7.6e-05,6.1e-05,0.000137,0.000198,5.3e-05,-0.000124,-0.000203,0.000102,4e-06,-0.000173,-2.6e-05,1.5e-05,5.4e-05,-4e-05,-0.000222,-4e-06,0.000261,0.000136,0.000316,0.000145,5.9e-05,0.000351,9.2e-05,5e-06,4.6e-05,-9.4e-05,0.000103,-2.2e-05,0.000127,0.000453,0.000279,0.000156,2.1e-05,0.000135,-4.3e-05,8.4e-05,-0.000391,-6.8e-05,4e-05,8.7e-05,0.000207,-4.4e-05,-0.000259,0.000213,3.3e-05,-6e-05,6.8e-05,-5.7e-05,-1.3e-05,9.5e-05,-0.000161,0.000279,5.1e-05,-8.6e-05,-9.2e-05,-5.3e-05,-2e-05,0.00023,-6.8e-05,-1.9e-05,-0.00021,1.9e-05,-0.000228,0.000207,5.9e-05,0.000173,2e-06,-8.2e-05,-2.7e-05,-0.00028,-7.1e-05,-0.00011,-2e-05,-8e-06,-0.000232,8.4e-05,0.000116,0.000127,-0.00035,-6.2e-05,0.000175,0.000226,3.7e-05,-0.000131,6.3e-05,-8e-05,-0.000246,-6.4e-05
-6.7e-05,6.4e-05,7.6e-05,3e-06,-0.000211,-5e-06,-0.000113,-3.1e-05,0.000107,-0.000115,-7.4e-05,-7.1e-05,-2.7e-05,-9.6e-05,-5.1e-05,-9e-05,-0.00014,9.2e-05,-5.6e-05,-4.3e-05,-2.7e-05,-3.1e-05,-0.000123,-4.9e-05,-3.9e-05,-0.000111,-3.5e-05,0.000101,0.000273,0.000148,2.4e-05,-8.5e-05,-5.6e-05,-0.000174,-0.000209,-7.3e-05,-0.000147,-7.6e-05,0.000205,0.000138,-0.000105,0.000156,0.000216,-4.4e-05,0.000115,4.2e-05,-0.000157,0.000138,2e-06,-0.000164,-0.00021,-0.000129,-6.2e-05,-8.9e-05,-0.000156,-9.8e-05,-5.3e-05,1.9e-05,2.2e-05,-8.9e-05,-2.1e-05,-0.000188,-0.000357,-0.000128,-0.000182,-7.8e-05,-0.000246,0.000151,-2.1e-05,0.000135,-2e-06,-8.1e-05,2.1e-05,-4.8e-05,-2e-05,0.000187,-0.00017,-0.000152,7e-06,-1e-06,9.5e-05,1.2e-05,-2.6e-05,-7e-06,-0.000208,0.000135,9e-06,0.000205,0.000172,-5.6e-05,-0.00016,0.000192,-3.8e-05,0.000216,-5.7e-05,0.000119,-0.000107,3.9e-05,-0.000198,5e-05,5e-05,-2.5e-05,5.5e-05,3.9e-05,-7e-06,-3.1e-05,2.6e-05,0.000276,8.5e-05,-9.1e-05,-0.000107,0.000321,0.000109,-0.000198,-0.000158,-3.4e-05,0.000114,7e-05,9e-06,0.000157,9e-05
1.2e-05,-6.3e-05,0,-1.5e-05,0.00022,3.9e-05,5.7e-05,-1.5e-05,-5.4e-05,3.1e-05,1.3e-05,5.6e-05,3.4e-05,0.000104,5e-06,-1.1e-05,5.1e-05,6e-06,-1.4e-05,8e-05,2.7e-05,3.9e-05,0.000138,8.8e-05,4.5e-05,6.1e-05,1.8e-05,-8.9e-05,-0.000192,-3.4e-05,-2.1e-05,7.3e-05,-1.6e-05,8.7e-05,0.00013,-9e-06,4.9e-05,5e-06,-3.4e-05,-0.000102,4e-05,-0.000168,-9.6e-05,-6.1e-05,-0.000182,-2.2e-05,2.5e-05,-0.000133,6.4e-05,2.9e-05,3.2e-05,-0.000122,-9e-06,2e-06,-6.4e-05,7.2e-05,-1e-06,-8.4e-05,4.2e-05,4.7e-05,0.000135,1e-04,0.000144,-1.2e-05,7.3e-05,0.000137,0.000161,-0.000153,-1.2e-05,-4.1e-05,3.6e-05,4.9e-05,-2.8e-05,2.8e-05,-1.7e-05,-9e-05,0.000205,0.000162,8.4e-05,3.4e-05,-6.9e-05,-3.8e-05,8.8e-05,4e-06,6.3e-05,-0.000243,1e-06,-0.000289,-0.000181,6.6e-05,-2.3e-05,-0.00011,6.1e-05,-7.1e-05,5.6e-05,-1.9e-05,2.9e-05,-0.000114,0.000158,4.9e-05,-6.5e-05,8.7e-05,4.6e-05,-6.5e-05,7.8e-05,0,-1.1e-05,-0.000158,-0.000145,1.3e-05,3.9e-05,-0.000261,-0.000143,7.7e-05,0.000138,1.5e-05,-8.5e-05,-5.7e-05,0.000101,-0.000206,-8.3e-05
1.8e-05,3.3e-05,-2.6e-05,4e-05,-1.9e-05,-1.3e-05,-8e-06,2.2e-05,4e-05,-8e-06,-1e-06,-3.3e-05,-3.7e-05,-0.000101,1e-05,-2.5e-05,-6e-06,-4.1e-05,9.9e-05,-2.4e-05,2.1e-05,-7.8e-05,-1.2e-05,-7.7e-05,-3.9e-05,7.1e-05,-8e-06,8.3e-05,0.000192,-7.1e-05,9e-06,-2.5e-05,1.1e-05,-1e-05,1.3e-05,7.2e-05,7.4e-05,9.6e-05,-4e-05,5.7e-05,-4e-05,0.00014,8.6e-05,-7e-06,0.000168,-2e-06,1.4e-05,5.9e-05,-2.6e-05,1.4e-05,-1e-06,0.000112,1e-06,2.4e-05,0.000135,-1e-05,-4e-06,9.2e-05,2.6e-05,2e-06,-0.000114,-6.5e-05,-9.2e-05,3.4e-05,-4.1e-05,-0.000121,-5.9e-05,7.1e-05,-5e-05,4e-06,2.7e-05,-2.5e-05,-7e-06,5e-06,-4e-06,2.4e-05,-0.000119,-4.8e-05,-0.000199,-4.6e-05,8.2e-05,3.1e-05,-0.00019,-4.8e-05,1.3e-05,0.000187,0.000117,0.000151,9e-05,-3.9e-05,-2e-06,7.6e-05,-6.6e-05,-2.9e-05,-9.1e-05,-3.8e-05,-1.3e-05,1.4e-05,-0.000137,-7.7e-05,5.5e-05,-3.5e-05,4.4e-05,2.1e-05,-2.5e-05,3.8e-05,1.3e-05,-1.1e-05,5.5e-05,4e-05,1e-04,0.000197,7.9e-05,8.4e-05,-0.000118,2.7e-05,-3.9e-05,-8.9e-05,-0.000101,0.00011,5.9e-05
3e-06,-8e-06,1e-05,-4.7e-05,-3.8e-05,-1e-05,3.4e-05,-3.6e-05,-3.7e-05,-2.3e-05,1e-06,3.8e-05,3.3e-05,2.8e-05,1.7e-05,2.8e-05,4.2e-05,7.7e-05,-3.3e-05,1e-05,2e-06,2.8e-05,-9.1e-05,4e-05,2.3e-05,-8.1e-05,1.1e-05,-0.000102,-0.000118,6.7e-05,3.6e-05,-1e-06,5.8e-05,1.5e-05,-3.9e-05,-7.6e-05,-7.1e-05,-0.000101,3.9e-05,-3.4e-05,-1.3e-05,-8.3e-05,-3.5e-05,4.7e-05,-0.000127,1.7e-05,8.6e-05,-3.1e-05,-2.2e-05,-3.2e-05,6e-06,1.7e-05,-7.6e-05,3.4e-05,-7.2e-05,-2.2e-05,3.4e-05,-4.5e-05,-7.1e-05,-4.7e-05,-2.6e-05,8.1e-05,0.000117,6.5e-05,1.2e-05,0.000106,0.000101,-3.6e-05,6.9e-05,2.2e-05,-3.9e-05,1.7e-05,3.5e-05,5.7e-05,5e-06,-3.2e-05,7e-06,-4.4e-05,0.000153,6.9e-05,-1.8e-05,-5.3e-05,6.1e-05,9.8e-05,-4.3e-05,-0.000109,-5.7e-05,-6.3e-05,-1.2e-05,3.9e-05,4.3e-05,-0.000113,3.1e-05,6e-05,2.3e-05,-5e-06,3.1e-05,-7e-06,5.9e-05,8e-06,-3.6e-05,-5.5e-05,-3.4e-05,1.1e-05,2.9e-05,-3.7e-05,2.3e-05,3.6e-05,-8.7e-05,-3e-05,-0.000104,-0.00011,-6.4e-05,-0.000167,7e-06,-2.5e-05,7.4e-05,1e-04,8.1e-05,-2.2e-05,-4.3e-05
-2.5e-05,2.6e-05,-1.1e-05,2.1e-05,-1.7e-05,-1.1e-05,-3.1e-05,-4e-06,6.5e-05,4.5e-05,1.2e-05,-1.5e-05,-3e-05,-1.3e-05,-2e-06,-2.8e-05,-7.1e-05,-9.6e-05,2.1e-05,2e-05,1.1e-05,-6e-06,5.6e-05,-1.6e-05,-3.7e-05,1e-06,7e-06,5.7e-05,2.1e-05,-2.9e-05,2.9e-05,5.4e-05,-2.3e-05,-4e-06,6e-06,4.6e-05,5.1e-05,1.5e-05,8e-06,1.6e-05,4.5e-05,6.7e-05,-9e-06,7e-06,1.3e-05,-2.1e-05,-8e-05,1e-06,-4.8e-05,-3e-06,5e-05,-4.8e-05,8.6e-05,-1.5e-05,-1.7e-05,-1.5e-05,-5.3e-05,2.9e-05,7e-05,4.3e-05,5.6e-05,-5e-06,-7.7e-05,-5.6e-05,3.5e-05,-7.7e-05,3.8e-05,3.5e-05,-1.5e-05,-6.5e-05,0,1e-05,2.8e-05,8e-06,5.4e-05,-2.9e-05,1e-05,6.7e-05,-6.3e-05,-3.5e-05,1.6e-05,1.7e-05,5.8e-05,-3e-05,-8e-06,4.1e-05,-1e-06,1.8e-05,-2.8e-05,-3.4e-05,-6e-06,3.4e-05,-1.7e-05,-3.9e-05,3e-05,5e-06,-3.3e-05,2.8e-05,-3e-05,-2.3e-05,2.3e-05,4.1e-05,-3.5e-05,1.6e-05,-4e-05,4.3e-05,-4.6e-05,1.3e-05,0.000123,0,6.6e-05,4.2e-05,6.2e-05,5.4e-05,-7e-06,-1.7e-05,-5.9e-05,-1.3e-05,-5.6e-05,-8e-05,1.8e-05
-9e-06,-6e-06,1e-06,-1.2e-05,8e-06,9e-06,3.8e-05,-1e-06,-5.5e-05,-4.8e-05,-1.2e-05,2.4e-05,2.1e-05,1e-05,-1.9e-05,3.1e-05,9.6e-05,5.7e-05,-4.6e-05,-1.3e-05,-1.6e-05,-5e-06,-2.3e-05,3.4e-05,2e-06,3e-06,2e-06,-3.1e-05,1.3e-05,-3.4e-05,-0.000125,-5e-05,4e-06,-2e-06,-2.4e-05,-2.4e-05,-9e-06,1.5e-05,-8e-06,-2.9e-05,-9e-06,-3.7e-05,2.2e-05,-5.2e-05,4.4e-05,-9e-06,3.6e-05,2.4e-05,3.8e-05,3.1e-05,-3.8e-05,6e-05,-1.5e-05,1.5e-05,4.7e-05,1e-05,3.2e-05,-2.5e-05,-2e-05,-3.8e-05,-3.7e-05,-8e-06,4.2e-05,5.2e-05,-3.4e-05,4.4e-05,-3.3e-05,-6.8e-05,-1e-05,4.7e-05,1e-05,-4e-06,-6.9e-05,-6.1e-05,-2.8e-05,5.5e-05,1.6e-05,-4e-05,7e-06,1.9e-05,-7e-06,3.2e-05,1.5e-05,-1.9e-05,3e-05,-1.1e-05,1e-06,1.7e-05,1.6e-05,2.5e-05,-1.3e-05,-2.6e-05,8e-06,2.6e-05,-1e-05,6e-06,1.8e-05,-5e-06,3.4e-05,2.7e-05,1e-05,5e-06,-1.2e-05,-6e-06,-5e-06,-2.8e-05,1.8e-05,1.5e-05,-7.5e-05,3.7e-05,-1.8e-05,-8e-06,-4.4e-05,-2.2e-05,2e-06,2.9e-05,4.1e-05,1.1e-05,2.7e-05,0.000112,-2.6e-05
1.5e-05,-2.4e-05,-1.2e-05,-4e-06,1.1e-05,3e-06,-5.9e-05,1.5e-05,1.8e-05,3.8e-05,2e-06,-2.1e-05,-8e-06,-7e-06,2e-06,-1e-06,-8.9e-05,-6e-06,1.9e-05,8e-06,-1.8e-05,1e-06,3.7e-05,-3.6e-05,5e-06,-2.1e-05,-5e-06,1.4e-05,-2.3e-05,3.6e-05,7.5e-05,2.7e-05,3e-06,1.5e-05,1.9e-05,9e-06,3e-06,-1e-05,1.9e-05,-3e-06,5e-06,-2e-06,-8e-06,1e-05,-4.3e-05,4.1e-05,2.1e-05,-2.7e-05,3e-06,-3.4e-05,-1.4e-05,-2.5e-05,-2.1e-05,-4e-05,3e-06,-1.1e-05,-7e-06,2e-06,-4e-06,3.1e-05,-1.8e-05,2e-05,-3.1e-05,-5.3e-05,2.6e-05,0,7e-06,1.1e-05,-1e-06,-2.6e-05,-1.4e-05,9e-06,2.8e-05,1.6e-05,1.5e-05,-6.2e-05,-1.5e-05,2e-05,-1.5e-05,-4e-06,-1.7e-05,-2.1e-05,1.1e-05,3e-06,-4.4e-05,2.8e-05,-2e-06,3e-05,-1.1e-05,-4e-06,4e-06,-1.4e-05,-1.7e-05,-5e-06,2.4e-05,-1e-05,-1e-05,3e-06,-5e-05,-1.5e-05,-1.9e-05,1.7e-05,8e-06,-1.2e-05,4e-06,8e-06,1.9e-05,-3.1e-05,7e-06,-1.1e-05,-5e-06,-4e-05,2.3e-05,3e-06,-1.4e-05,-2.5e-05,-3e-05,-1e-06,-1.2e-05,-0.000102,2e-06
-9e-06,2.4e-05,1e-06,1.5e-05,3e-05,-1e-06,5.3e-05,-9e-06,-4e-06,-2.3e-05,6e-06,1.7e-05,-1e-06,1.5e-05,4e-06,1.5e-05,6.3e-05,-2.5e-05,-1.3e-05,-2.3e-05,3e-06,2e-06,-3.6e-05,3.1e-05,-5e-06,1.3e-05,1e-05,-4e-06,3.3e-05,-7e-06,-5.3e-05,-1.9e-05,-1.8e-05,-1e-06,-1.6e-05,-8e-06,0,4e-06,-2.2e-05,8e-06,-2.1e-05,-1.1e-05,1.2e-05,2e-06,4.4e-05,-5e-05,-1.5e-05,2e-05,1.3e-05,3.8e-05,3.4e-05,2.1e-05,1e-05,1.4e-05,-3.7e-05,-5e-06,-4e-06,2.2e-05,0,-2.7e-05,4.1e-05,-4e-05,2.5e-05,3e-06,-2e-05,2e-06,0,7e-06,3e-06,4.5e-05,3e-06,-9e-06,4e-06,1.4e-05,-1.5e-05,5e-05,-1.5e-05,2e-06,-4e-06,-9e-06,-2e-06,2.3e-05,-2.3e-05,9e-06,5.5e-05,-2.4e-05,-2e-06,-5.6e-05,2.6e-05,-3e-06,-1e-06,2.3e-05,-1.9e-05,-4e-06,-1.1e-05,4.3e-05,1e-06,-6e-06,1.3e-05,-3e-06,1.5e-05,5e-06,2.8e-05,0,-2.6e-05,-4e-06,-1.8e-05,-5e-06,-1.1e-05,-1.9e-05,2.7e-05,4.9e-05,-3e-06,0,2.9e-05,2.3e-05,2.6e-05,0,-8e-06,6e-05,1.3e-05
-6e-06,-1.7e-05,1e-05,-3e-06,-2.8e-05,-6e-06,-3.7e-05,-6e-06,7e-06,0,-5e-06,-1.3e-05,5e-06,-1.7e-05,-1.2e-05,-2.2e-05,-1.4e-05,4e-05,0,6e-06,2e-06,2.5e-05,6.3e-05,-1.9e-05,7e-06,1e-05,-6e-06,1.5e-05,-1.5e-05,-7e-06,4.7e-05,-1.6e-05,5e-06,-4e-06,1.3e-05,-8e-06,-1e-05,0,2.1e-05,1.5e-05,1.4e-05,1.2e-05,-1.1e-05,-3e-06,-1.8e-05,1.7e-05,3e-06,-1.3e-05,0,-3e-05,-2.3e-05,2e-06,-3e-06,1.1e-05,2.9e-05,5e-06,-3e-06,-2.7e-05,-7e-06,6e-06,-4e-06,3.2e-05,-3.4e-05,1e-05,1.1e-05,-1.4e-05,-3.7e-05,-1e-06,-3e-06,-2e-05,-2e-06,1.4e-05,3e-06,-2e-05,1.3e-05,-4.1e-05,1.8e-05,-1.2e-05,4.6e-05,2.3e-05,-4e-06,-1.4e-05,3.3e-05,1e-06,-3.6e-05,-8e-06,5e-06,1.9e-05,-2.7e-05,-1.1e-05,-6e-06,-2.2e-05,3.2e-05,-4e-06,7e-06,-6.8e-05,5e-06,4e-06,-6e-06,0,-1.7e-05,-2.4e-05,-1.4e-05,-7e-06,4.1e-05,-1.4e-05,2e-06,1.4e-05,3.1e-05,1.3e-05,-4.3e-05,-6.2e-05,-3e-06,2.1e-05,1e-06,-4e-06,-6e-06,-2.3e-05,1.7e-05,-2.7e-05,-6e-06
6e-06,1.2e-05,-1.4e-05,-3e-06,-1e-05,5e-06,1.9e-05,6e-06,-1.9e-05,4e-06,1e-06,2e-06,-1.1e-05,3e-06,9e-06,8e-06,-3.5e-05,-3.3e-05,1.5e-05,6e-06,7e-06,-3e-05,-8.2e-05,2e-05,-8e-06,-1.1e-05,1e-06,-2.6e-05,6e-06,3.1e-05,-1.9e-05,2.1e-05,-2e-06,-5e-06,1.2e-05,1.3e-05,-2e-06,3e-06,-8e-06,-1e-05,-1.5e-05,-1.6e-05,-1.3e-05,-6e-06,-2e-06,1.2e-05,-9e-06,1.3e-05,-6e-06,1.9e-05,2.1e-05,-4.8e-05,2e-05,0,-1e-06,0,0,2.6e-05,1.2e-05,8e-06,-2.5e-05,-3.1e-05,4.8e-05,-9e-06,6e-06,2.1e-05,3.9e-05,-1.3e-05,0,-4e-06,-3e-06,-1e-05,-3.4e-05,-1e-06,-6e-06,2.8e-05,9e-06,1.4e-05,-6.1e-05,-1.8e-05,1.1e-05,-3e-06,-3.2e-05,9e-06,3e-05,2.5e-05,1e-05,2.2e-05,3.1e-05,9e-06,9e-06,2.7e-05,-3.1e-05,1.3e-05,-8e-06,6.1e-05,-5e-06,1e-06,4e-06,1e-06,6e-06,2e-06,1e-06,0,-2.2e-05,1.3e-05,6e-06,-3e-06,-1e-05,6e-06,1.9e-05,5.5e-05,4e-06,0,1.8e-05,-2e-06,-2e-06,2.9e-05,-3.1e-05,7e-06,-4e-06
1e-06,-1.7e-05,1e-05,4e-06,-2e-06,-1e-06,-1.5e-05,2e-06,2.5e-05,-3e-06,5e-06,-1e-06,9e-06,-3e-06,-4e-06,-1.1e-05,4.8e-05,1.1e-05,5e-06,-1.3e-05,3e-06,3e-06,4.5e-05,-1.9e-05,1.1e-05,6e-06,1e-06,2.5e-05,-1.3e-05,-2.8e-05,2.5e-05,-1e-05,-2e-06,1.4e-05,-1.6e-05,-1.9e-05,3.7e-05,-1e-05,-1.6e-05,-6e-06,1.7e-05,2.1e-05,6e-06,3e-06,5e-06,-1.9e-05,3.2e-05,-3e-06,-2e-06,-7e-06,1.8e-05,2.8e-05,-1.8e-05,7e-06,-2.7e-05,-2e-06,1.3e-05,-2.1e-05,-1e-06,-1.7e-05,2.1e-05,2.4e-05,-4.2e-05,3e-06,-1.6e-05,-3.1e-05,-4.4e-05,1.9e-05,-1e-06,1.4e-05,1e-06,2e-06,4.7e-05,-6e-06,0,-8e-06,-1.7e-05,-1.7e-05,3.9e-05,5e-06,-5e-06,-1e-06,2.5e-05,-1.7e-05,-1.8e-05,-2.3e-05,-6e-06,-5.4e-05,-1.6e-05,2e-06,1e-06,-3.4e-05,2.4e-05,-1.8e-05,-3e-06,-3.9e-05,8e-06,-5e-06,-5e-06,1.4e-05,1e-06,1.6e-05,-9e-06,1e-06,1.2e-05,3e-06,-4e-06,-5e-06,-6e-06,-8e-06,-8e-06,-5.1e-05,4e-06,-7e-06,-2.7e-05,8e-06,-3e-06,-2e-06,3.7e-05,6e-06,3e-06
2e-06,1.2e-05,-2e-06,-5e-06,1.6e-05,-1e-06,5e-06,-1.6e-05,-1.4e-05,1e-05,0,6e-06,-8e-06,1.1e-05,-1e-06,8e-06,-4.9e-05,5e-06,2e-06,7e-06,-7e-06,0,-1.3e-05,1.3e-05,-9e-06,-1e-06,2e-06,-2.2e-05,-5e-06,0,-3e-05,1.3e-05,-1e-06,7e-06,-3e-06,1.3e-05,-5.2e-05,1.5e-05,1.6e-05,1.3e-05,-1.1e-05,-1.1e-05,-7e-06,1.3e-05,7e-06,1.1e-05,-3.4e-05,5e-06,7e-06,-3e-06,-2.7e-05,2e-05,-1e-06,-9e-06,7e-06,3e-06,-1.3e-05,3e-06,0,1.9e-05,0,3e-06,2.7e-05,-4e-06,1.9e-05,7e-06,1.8e-05,-4e-06,-3e-06,-2.2e-05,4e-06,2e-06,-2.3e-05,7e-06,3e-06,-1.2e-05,-1e-06,1e-05,-9e-06,1.1e-05,4e-06,1e-06,-1.3e-05,9e-06,3e-06,-1e-06,-3e-06,6.7e-05,-8e-06,2e-06,1e-06,3.2e-05,-1.4e-05,3e-06,-3e-06,9e-06,-5e-06,-6e-06,7e-06,-6e-06,0,-4e-06,6e-06,7e-06,-1.2e-05,-4e-06,-4e-06,1.3e-05,-8e-06,3e-06,-2e-06,3.7e-05,-4e-06,7e-06,1.2e-05,-1.3e-05,-5e-06,-1.9e-05,-2.9e-05,3e-06,4e-06
-3e-06,-8e-06,4e-06,8e-06,1e-06,3e-06,-3e-06,1.3e-05,5e-06,-1e-05,-3e-06,-9e-06,9e-06,-6e-06,3e-06,-1e-06,2.9e-05,-1e-05,-2e-06,-5e-06,-3e-06,-2e-06,8e-06,-3e-06,3e-06,-9e-06,2e-06,6e-06,1.9e-05,1.4e-05,5e-06,-1.1e-05,5e-06,-8e-06,7e-06,-4e-06,5.5e-05,-6e-06,-2e-06,-1e-05,7e-06,1.1e-05,1.1e-05,-1.2e-05,-2.1e-05,2e-06,8e-06,-4e-06,-4e-06,3e-06,-4e-06,-4.1e-05,-2e-06,-4e-06,2.4e-05,4e-06,8e-06,5e-06,-5e-06,-1.6e-05,-1.8e-05,-4e-06,-2.1e-05,1.5e-05,-1.6e-05,-6e-06,-3e-06,-2e-06,8e-06,2.8e-05,-2e-06,-1e-06,-5e-06,1e-05,-1.2e-05,2.2e-05,1.2e-05,4e-06,-1e-06,-1.3e-05,9e-06,0,-8e-06,3e-06,-9e-06,7e-06,6e-06,-4.8e-05,8e-06,-6e-06,-3e-06,-3.1e-05,5e-06,3e-06,7e-06,-2e-06,1e-06,6e-06,1e-06,-7e-06,1e-06,-6e-06,0,-3e-06,-7e-06,2e-06,9e-06,-2e-06,1.3e-05,7e-06,2.5e-05,-3.1e-05,-4e-06,-7e-06,-1.9e-05,6e-06,1.6e-05,6e-06,1.5e-05,-1.2e-05,4e-06
3e-06,7e-06,0,-1e-05,-4e-06,-1e-06,4e-06,4e-06,4e-06,2e-06,-1e-06,8e-06,-5e-06,0,0,5e-06,-7e-06,1.6e-05,3e-06,-1e-06,-1e-06,1.1e-05,-1.4e-05,3e-06,3e-06,3e-06,-3e-06,1e-06,-4e-06,-2.1e-05,-6e-06,3e-06,-1e-06,-3e-06,-1e-06,-2e-06,-3.7e-05,-1.5e-05,-9e-06,6e-06,-1.7e-05,1e-06,-9e-06,-6e-06,2.9e-05,-1.4e-05,5e-06,0,-5e-06,-2e-06,5e-06,2.1e-05,1e-06,-2e-06,-2.4e-05,-2e-06,-4e-06,-3e-06,4e-06,8e-06,1.3e-05,1e-06,2e-05,4e-06,9e-06,-1e-06,-3e-06,0,-7e-06,-1.5e-05,-3e-06,2e-06,-2e-06,-1.3e-05,2e-06,-2.3e-05,-2e-06,-6e-06,0,8e-06,-3e-06,-1e-06,2e-06,-1.2e-05,1e-06,9e-06,6e-06,2.7e-05,5e-06,4e-06,1e-06,1.9e-05,0,-7e-06,0,1.4e-05,-4e-06,4e-06,6e-06,-6e-06,-1e-06,-2e-06,1.1e-05,0,4e-06,-4e-06,-3e-06,-1e-05,-3e-06,-7e-06,-2.2e-05,2.4e-05,8e-06,-1.1e-05,6e-06,-3e-06,-1.4e-05,1.1e-05,-4e-06,1.8e-05,-1.2e-05
6e-06,-4e-06,-3e-06,3e-06,-9e-06,-1e-06,-1e-05,-6e-06,-2e-06,2e-06,0,-2e-06,-3e-06,-3e-06,0,-6e-06,-7e-06,-1.5e-05,-7e-06,3e-06,1e-06,-1.3e-05,1.4e-05,-4e-06,-4e-06,4e-06,1e-06,-3e-06,0,7e-06,1.9e-05,8e-06,-2e-06,6e-06,3e-06,4e-06,2.4e-05,1.1e-05,1e-05,1e-06,1.3e-05,-5e-06,-1e-06,9e-06,-2.7e-05,1.2e-05,2e-06,-6e-06,-2e-06,-4e-06,-1e-06,1.3e-05,6e-06,6e-06,4e-06,0,8e-06,-1e-06,-1.3e-05,2e-06,3e-06,-1.9e-05,-1.7e-05,-1.1e-05,6e-06,4e-06,1.8e-05,-2e-06,2e-06,4e-06,1e-06,-5e-06,2.3e-05,6e-06,-1e-06,2.7e-05,-9e-06,-5e-06,-9e-06,-7e-06,-1e-06,6e-06,-1e-06,1e-05,-4e-06,-8e-06,-4e-06,-1.2e-05,-1.8e-05,0,1e-06,-5e-06,-5e-06,1.4e-05,-1e-06,-1.2e-05,1e-06,-1e-06,-1.4e-05,8e-06,-3e-06,4e-06,-5e-06,-1e-06,-8e-06,0,-8e-06,-2e-06,0,-1e-06,1.2e-05,-1.4e-05,-8e-06,1.2e-05,-5e-06,-3e-06,1.1e-05,-7e-06,-7e-06,-1.5e-05,-1e-06
-2e-06,2e-06,8e-06,2e-06,-2e-06,-1e-06,1.3e-05,7e-06,-5e-06,-7e-06,2e-06,0,9e-06,5e-06,-2e-06,4e-06,1.1e-05,7e-06,1e-06,-6e-06,4e-06,9e-06,-1.2e-05,5e-06,6e-06,-7e-06,2e-06,1e-06,-1e-05,1.3e-05,-2.5e-05,-2e-06,1e-06,5e-06,-3e-06,-5e-06,-2e-06,5e-06,-3e-06,3e-06,-9e-06,1e-06,0,1e-06,1.6e-05,1e-06,-2e-06,4e-06,1e-06,6e-06,1e-05,-2.4e-05,-7e-06,2e-06,1.5e-05,1e-06,-2e-06,-3e-06,1.3e-05,-9e-06,-9e-06,1.8e-05,1.4e-05,2e-06,-9e-06,4e-06,0,3e-06,-1e-06,-1e-05,-3e-06,1e-06,-1.8e-05,-3e-06,5e-06,-2.6e-05,1e-06,1.2e-05,2.6e-05,1e-06,-3e-06,-3e-06,1.2e-05,-2e-06,9e-06,2e-06,-2e-06,1e-06,1.6e-05,0,-5e-06,6e-06,1e-05,-1.5e-05,0,2e-06,-4e-06,-3e-06,1.2e-05,4e-06,2e-06,6e-06,-1.3e-05,1e-06,7e-06,2e-06,1e-05,3e-06,-7e-06,6e-06,-7e-06,5e-06,0,-2e-06,5e-06,7e-06,-1e-05,4e-06,1.6e-05,8e-06,1.1e-05
-1e-06,1e-06,-6e-06,-4e-06,1.1e-05,1e-06,-9e-06,4e-06,5e-06,5e-06,-1e-06,-2e-06,-1e-05,-3e-06,2e-06,-6e-06,-6e-06,2e-06,-3e-06,7e-06,-1e-06,-2e-06,-4e-06,-1e-06,-5e-06,6e-06,-4e-06,2e-06,4e-06,-1.1e-05,3.7e-05,4e-06,-1e-06,-5e-06,1e-06,3e-06,-1.7e-05,-1.1e-05,-5e-06,-7e-06,4e-06,-6e-06,-7e-06,-2e-06,-2e-06,-9e-06,-9e-06,-2e-06,-1e-06,-9e-06,3e-06,2.3e-05,0,3e-06,-9e-06,1e-06,-6e-06,8e-06,-1e-05,1.1e-05,8e-06,-7e-06,-9e-06,-1e-06,7e-06,-1.5e-05,3e-06,-2e-06,0,1e-06,2e-06,1e-06,-3e-06,2e-06,-2e-06,2.1e-05,1e-05,-4e-06,-2.1e-05,0,1e-06,0,-2e-05,-1e-06,-9e-06,1e-06,-7e-06,0,0,-4e-06,3e-06,-2e-06,-7e-06,6e-06,-1e-06,1e-05,6e-06,-1e-06,-8e-06,-4e-06,-1e-06,2e-06,4e-06,-4e-06,-7e-06,-3e-06,-2e-06,1e-05,2e-06,-2e-06,-1.3e-05,5e-06,1e-06,-2e-06,0,-2e-06,4e-06,-2e-06,-2.2e-05,3e-06,-5e-06
1e-06,-2e-06,3e-06,5e-06,5e-06,2e-06,7e-06,-5e-06,-5e-06,-3e-06,-2e-06,2e-06,7e-06,0,-1e-06,1e-06,-7e-06,-5e-06,2e-06,-3e-06,-2e-06,1e-06,1.7e-05,2e-06,4e-06,5e-06,3e-06,-4e-06,2e-06,8e-06,-3.7e-05,-9e-06,2e-06,-3e-06,2e-06,-1e-06,2.7e-05,0,6e-06,2e-06,-7e-06,0,1e-05,-3e-06,-1.3e-05,1e-05,1.9e-05,5e-06,2e-06,8e-06,-1.2e-05,-9e-06,4e-06,-5e-06,-6e-06,0,6e-06,-3e-06,1e-05,-9e-06,0,1.2e-05,8e-06,0,-9e-06,1.7e-05,-4e-06,4e-06,4e-06,7e-06,1e-06,0,1.3e-05,2e-06,5e-06,-1.1e-05,-7e-06,-7e-06,1e-05,-2e-06,-6e-06,-2e-06,1.2e-05,0,1.1e-05,-4e-06,2e-06,0,-1.4e-05,3e-06,4e-06,-6e-06,9e-06,-8e-06,0,-2.3e-05,-3e-06,1e-06,8e-06,0,1e-06,-5e-06,3e-06,4e-06,2e-06,2e-06,-6e-06,-4e-06,6e-06,-4e-06,1.7e-05,-1.2e-05,2e-06,8e-06,0,2e-06,1e-06,-5e-06,2e-05,-1.3e-05,-2e-06
2e-06,4e-06,-3e-06,-3e-06,-6e-06,-2e-06,-6e-06,0,-3e-06,3e-06,1e-06,-2e-06,-2e-06,0,-2e-06,-1e-06,1.7e-05,7e-06,1e-06,0,-1e-06,0,-1.1e-05,-5e-06,-3e-06,-8e-06,-1e-06,0,3e-06,0,1.5e-05,0,-1e-06,2e-06,-2e-06,-3e-06,-2e-05,6e-06,-5e-06,3e-06,6e-06,1e-06,-9e-06,2e-06,2.3e-05,-6e-06,-1.4e-05,-1e-06,1e-06,-5e-06,2e-06,-8e-06,3e-06,-3e-06,1e-05,-1e-06,-3e-06,-3e-06,-6e-06,5e-06,-6e-06,-8e-06,-1e-05,-3e-06,7e-06,-5e-06,-4e-06,-1e-06,-5e-06,-2e-06,-4e-06,3e-06,-4e-06,-1.4e-05,-7e-06,5e-06,-3e-06,5e-06,-1e-06,-1e-06,3e-06,1e-06,-1e-06,-2e-06,-1e-05,2e-06,6e-06,2e-06,1.2e-05,3e-06,0,1.4e-05,-8e-06,1e-06,-1e-06,3e-05,3e-06,1e-06,-4e-06,-1e-06,2e-06,-3e-06,9e-06,1e-06,-2e-06,1e-06,5e-06,-5e-06,-3e-06,6e-06,-1.6e-05,1.4e-05,-6e-06,-5e-06,0,1e-06,-6e-06,6e-06,-1.6e-05,1.9e-05,1e-06
-3e-06,-6e-06,3e-06,2e-06,-4e-06,-2e-06,2e-06,1e-06,7e-06,0,-1e-06,2e-06,-1e-06,-2e-06,2e-06,4e-06,-1.1e-05,-7e-06,3e-06,4e-06,-2e-06,-4e-06,0,5e-06,1e-06,2e-06,0,2e-06,-1e-06,-1.1e-05,-5e-06,0,1e-06,3e-06,3e-06,4e-06,9e-06,-3e-06,2e-06,0,-1e-06,0,5e-06,1e-06,-2.4e-05,-2e-06,6e-06,1e-06,2e-06,1e-06,-3e-06,1.9e-05,-2e-06,2e-06,-4e-06,-1e-06,5e-06,2e-06,3e-06,2e-06,6e-06,-2e-06,1e-05,-3e-06,1e-06,7e-06,-2e-06,0,1e-06,5e-06,1e-06,-3e-06,-1.3e-05,2e-06,-2e-06,3e-06,2e-06,6e-06,0,3e-06,1e-06,-2e-06,2e-06,2e-06,8e-06,1e-06,-3e-06,-4e-06,-4e-06,-2e-06,0,-1.6e-05,7e-06,1e-06,1e-06,-2.9e-05,-3e-06,1e-06,3e-06,5e-06,-1e-06,4e-06,-3e-06,0,-1e-06,-2e-06,0,2e-06,-3e-06,-2e-06,1.2e-05,-1.7e-05,6e-06,-1e-06,1e-06,-3e-06,6e-06,1e-06,9e-06,-1.5e-05,1e-06
-1e-06,5e-06,-2e-06,0,-1e-06,1e-06,4e-06,1e-06,-4e-06,-4e-06,-1e-06,-1e-06,1e-06,0,-1e-06,-2e-06,4e-06,5e-06,2e-06,-3e-06,2e-06,5e-06,-1e-06,-1e-06,2e-06,1e-06,2e-06,-6e-06,-3e-06,7e-06,9e-06,2e-06,0,-3e-06,0,-4e-06,2e-06,-2e-06,0,-2e-06,-2e-06,1e-06,-3e-06,-4e-06,1.6e-05,7e-06,-3e-06,0,1e-06,0,3e-06,-2e-05,-4e-06,0,-4e-06,0,-7e-06,0,-2e-06,-7e-06,-1e-06,2e-06,-9e-06,4e-06,-3e-06,3e-06,-4e-06,-2e-06,2e-06,-1.3e-05,1e-06,1e-06,7e-06,5e-06,-2e-06,-9e-06,5e-06,-7e-06,1e-06,0,-1e-06,3e-06,0,4e-06,-6e-06,1e-06,-2e-06,7e-06,-2e-06,-2e-06,-2e-06,1.4e-05,-3e-06,-4e-06,0,2.1e-05,3e-06,-2e-06,-1e-06,1e-06,1e-06,1e-06,-6e-06,-1e-06,5e-06,0,-4e-06,-2e-06,0,-3e-06,5e-06,1.5e-05,-1e-06,-5e-06,0,2e-06,-6e-06,-4e-06,-1e-06,7e-06,3e-06
0,-4e-06,-3e-06,-2e-06,5e-06,1e-06,-2e-06,-4e-06,1e-06,4e-06,1e-06,1e-06,-1e-06,4e-06,-1e-06,3e-06,9e-06,-4e-06,-2e-06,4e-06,1e-06,-5e-06,8e-06,2e-06,-4e-06,-6e-06,0,5e-06,-1e-06,-2e-06,2e-06,3e-06,-1e-06,-2e-06,-2e-06,3e-06,-9e-06,1e-06,-3e-06,1e-06,-1e-06,3e-06,1e-06,1e-06,-6e-06,-5e-06,0,-2e-06,-1e-06,-1e-06,8e-06,4e-06,1e-06,3e-06,4e-06,1e-06,2e-06,-1e-06,0,9e-06,-4e-06,-6e-06,8e-06,5e-06,3e-06,-6e-06,6e-06,0,-1e-06,7e-06,-1e-06,-1e-06,9e-06,-4e-06,0,1.6e-05,-6e-06,2e-06,-6e-06,-1e-06,3e-06,-1e-06,-3e-06,-4e-06,4e-06,-2e-06,1e-06,-1.1e-05,0,1e-06,1e-06,-1.1e-05,0,5e-06,1e-06,-1.1e-05,-4e-06,-1e-06,-4e-06,-3e-06,-1e-06,0,-4e-06,1e-06,-6e-06,-1e-06,2e-06,-1e-06,3e-06,2e-06,-1.4e-05,-1.5e-05,0,4e-06,1e-06,-1e-06,7e-06,1e-06,-6e-06,1e-06,-6e-06
-1e-06,4e-06,3e-06,3e-06,4e-06,0,1e-06,1e-06,3e-06,-3e-06,1e-06,0,2e-06,-2e-06,1e-06,-2e-06,-1.9e-05,0,-1e-06,-3e-06,0,6e-06,-1.3e-05,-4e-06,2e-06,4e-06,2e-06,-2e-06,-1e-06,-4e-06,-9e-06,-1e-06,0,0,-1e-06,-1e-06,1.3e-05,-1e-06,3e-06,0,0,-1e-06,2e-06,3e-06,-3e-06,1e-06,4e-06,1e-06,-1e-06,0,-4e-06,9e-06,2e-06,-1e-06,1e-06,2e-06,-1e-06,0,-2e-06,-7e-06,5e-06,1.1e-05,-8e-06,-2e-06,-5e-06,-1e-06,-1e-05,-1e-06,1e-06,-3e-06,0,-2e-06,-1.1e-05,1e-06,0,-1.7e-05,-1e-06,1e-06,1e-05,4e-06,1e-06,-1e-06,8e-06,1e-06,-2e-06,5e-06,1e-06,1.4e-05,7e-06,1e-06,0,1.2e-05,4e-06,-3e-06,0,1.1e-05,3e-06,1e-06,2e-06,-5e-06,-1e-06,-1e-06,3e-06,-1e-06,1e-06,1e-06,3e-06,3e-06,-1e-06,1e-06,1.7e-05,1.3e-05,-1e-06,-5e-06,1e-06,-1e-06,-5e-06,1e-06,1.2e-05,-8e-06,-2e-06
-1e-06,-4e-06,-3e-06,-2e-06,-5e-06,-1e-06,1e-06,2e-06,1e-06,1e-06,0,-1e-06,-3e-06,-3e-06,0,-1e-06,2e-05,3e-06,-2e-06,0,0,-4e-06,1.5e-05,5e-06,-1e-06,0,-1e-06,2e-06,6e-06,9e-06,0,3e-06,0,3e-06,1e-06,0,-8e-06,-1e-06,1e-06,-3e-06,4e-06,3e-06,-1e-06,-2e-06,4e-06,4e-06,-7e-06,-3e-06,2e-06,1e-06,-7e-06,-1.8e-05,1e-06,-1e-06,-4e-06,-1e-06,-1e-06,1e-06,2e-06,3e-06,-3e-06,-6e-06,8e-06,-1e-06,4e-06,3e-06,8e-06,2e-06,-2e-06,5e-06,0,3e-06,-1e-06,-2e-06,4e-06,1.6e-05,3e-06,2e-06,-5e-06,-4e-06,0,1e-06,-9e-06,1e-06,3e-06,-2e-06,-1e-06,-1.5e-05,-8e-06,0,1e-06,-1.3e-05,-5e-06,3e-06,-1e-06,-1.6e-05,-5e-06,0,-1e-06,0,2e-06,0,5e-06,-1e-06,-4e-06,0,-5e-06,4e-06,0,-4e-06,-1.4e-05,-1e-05,2e-06,4e-06,2e-06,2e-06,2e-06,-2e-06,-1.4e-05,8e-06,7e-06
-2e-06,3e-06,1e-06,0,-5e-06,0,1e-06,-4e-06,-6e-06,0,-1e-06,-1e-06,4e-06,2e-06,0,-1e-06,-1.3e-05,-4e-06,-1e-06,1e-06,-1e-06,1e-06,-8e-06,-2e-06,1e-06,-2e-06,1e-06,-1e-06,0,-1e-06,4e-06,-1e-06,1e-06,-3e-06,-1e-06,2e-06,-2e-06,2e-06,-5e-06,2e-06,-3e-06,-3e-06,0,-1e-06,-1e-06,-7e-06,6e-06,2e-06,1e-06,-2e-06,5e-06,1.6e-05,-1e-06,-2e-06,2e-06,0,3e-06,-1e-06,0,2e-06,-3e-06,7e-06,-7e-06,1e-06,0,-6e-06,-1e-06,0,1e-06,0,-1e-06,-1e-06,8e-06,6e-06,0,-1.4e-05,2e-06,-2e-06,0,2e-06,-1e-06,-2e-06,7e-06,-1e-06,-3e-06,-3e-06,0,1.4e-05,2e-06,-1e-06,0,8e-06,5e-06,-3e-06,0,1.4e-05,5e-06,-1e-06,-1e-06,6e-06,0,4e-06,1e-06,2e-06,-1e-06,0,1e-06,-2e-06,-3e-06,3e-06,0,7e-06,-1e-06,3e-06,-2e-06,-1e-06,-1e-06,3e-06,1.4e-05,-4e-06,-3e-06
1e-06,-1e-06,-2e-06,2e-06,1e-06,0,0,-1e-06,9e-06,0,0,2e-06,-3e-06,1e-06,-1e-06,2e-06,1e-06,6e-06,0,-4e-06,0,1e-06,-2e-06,0,-2e-06,4e-06,1e-06,1e-06,-1e-06,-2e-06,-7e-06,-1e-06,0,-2e-06,1e-06,-4e-06,1.2e-05,-2e-06,5e-06,0,2e-06,0,0,1e-06,-5e-06,5e-06,-5e-06,-1e-06,-3e-06,2e-06,-3e-06,-2e-06,-2e-06,2e-06,3e-06,-1e-06,-3e-06,0,-2e-06,-6e-06,6e-06,-7e-06,6e-06,1e-06,-2e-06,2e-06,-2e-06,1e-06,1e-06,-4e-06,0,2e-06,1e-06,3e-06,-1e-06,1e-05,-4e-06,-3e-06,2e-06,0,0,1e-06,-6e-06,1e-06,3e-06,0,0,-9e-06,4e-06,2e-06,-1e-06,-2e-06,-6e-06,1e-06,-1e-06,-7e-06,-5e-06,0,4e-06,0,0,0,-2e-06,0,2e-06,1e-06,5e-06,-4e-06,3e-06,1e-06,9e-06,-2e-06,-1e-06,-1e-06,0,1e-06,0,0,-1.2e-05,-4e-06,-3e-06
0,1e-06,2e-06,-2e-06,4e-06,0,-1e-06,3e-06,-8e-06,2e-06,1e-06,-1e-06,1e-06,-1e-06,1e-06,-2e-06,1.1e-05,-6e-06,2e-06,2e-06,1e-06,-2e-06,2e-06,-2e-06,0,-1e-06,-2e-06,-3e-06,-5e-06,3e-06,1.7e-05,-1e-06,1e-06,0,-1e-06,3e-06,-1.6e-05,-2e-06,0,-1e-06,-3e-06,-1e-06,1e-06,0,9e-06,2e-06,6e-06,2e-06,-5e-06,-2e-06,2e-06,-9e-06,3e-06,1e-06,-4e-06,-2e-06,2e-06,1e-06,2e-06,8e-06,-3e-06,0,-5e-06,-1e-06,2e-06,-5e-06,1.1e-05,-1e-06,-2e-06,1e-06,0,-1e-06,-1.3e-05,-4e-06,0,-5e-06,0,6e-06,-1e-06,-3e-06,-2e-06,-1e-06,2e-06,0,-5e-06,2e-06,-1e-06,3e-06,-4e-06,0,0,-2e-06,4e-06,-2e-06,1e-06,-3e-06,4e-06,1e-06,-4e-06,-3e-06,1e-06,-2e-06,-5e-06,-1e-06,-2e-06,-1e-06,-5e-06,-2e-06,0,-2e-06,-1.4e-05,0,2e-06,1e-06,-2e-06,1e-06,1e-06,-3e-06,7e-06,8e-06,2e-06
-1e-06,1e-06,-1e-06,2e-06,2e-06,0,1e-06,-1e-06,2e-06,-2e-06,0,0,1e-06,1e-06,0,1e-06,-1.7e-05,5e-06,1e-06,-2e-06,0,2e-06,5e-06,3e-06,1e-06,-2e-06,1e-06,3e-06,2e-06,-4e-06,-1.3e-05,-2e-06,0,3e-06,-1e-06,-2e-06,1.4e-05,3e-06,-4e-06,-1e-06,5e-06,0,0,0,-8e-06,-6e-06,-4e-06,0,-1e-06,1e-06,3e-06,1.5e-05,1e-06,0,2e-06,1e-06,-3e-06,-1e-06,-3e-06,-7e-06,-2e-06,1e-06,5e-06,-3e-06,-3e-06,-3e-06,-1e-05,0,1e-06,-2e-06,0,-1e-06,1e-05,2e-06,-2e-06,-2e-06,3e-06,-2e-06,0,4e-06,-1e-06,1e-06,0,-1e-06,4e-06,1e-06,-2e-06,4e-06,-1e-06,-1e-06,0,4e-06,-2e-06,4e-06,0,1.3e-05,-3e-06,0,2e-06,0,-2e-06,-2e-06,0,0,3e-06,0,0,4e-06,0,-1e-06,1.5e-05,4e-06,-2e-06,-2e-06,-1e-06,-1e-06,-1e-06,1e-06,-2e-06,-8e-06,1e-06
0,-2e-06,-1e-06,-2e-06,-3e-06,0,2e-06,-2e-06,-1e-06,1e-06,-1e-06,1e-06,-2e-06,1e-06,-1e-06,0,1.2e-05,-1e-06,1e-06,1e-06,1e-06,-1e-06,-8e-06,-1e-06,-1e-06,2e-06,0,-4e-06,4e-06,0,1e-06,2e-06,-1e-06,-2e-06,1e-06,0,-8e-06,0,3e-06,1e-06,-5e-06,-1e-06,1e-06,-1e-06,1e-06,6e-06,-1e-06,0,3e-06,0,-5e-06,-8e-06,-1e-06,0,3e-06,1e-06,1e-06,-1e-06,3e-06,4e-06,7e-06,0,-6e-06,1e-06,2e-06,3e-06,5e-06,-1e-06,0,4e-06,0,0,4e-06,0,-1e-06,6e-06,1e-06,-2e-06,-3e-06,-3e-06,1e-06,-1e-06,-1e-06,1e-06,-4e-06,-1e-06,1e-06,-7e-06,5e-06,-1e-06,-1e-06,-5e-06,-1e-06,0,0,-1.8e-05,3e-06,0,-4e-06,4e-06,0,1e-06,5e-06,1e-06,-2e-06,0,4e-06,1e-06,-2e-06,4e-06,-5e-06,-6e-06,0,-1e-06,0,1e-06,1e-06,2e-06,-4e-06,4e-06,2e-06
2e-06,2e-06,2e-06,0,-4e-06,0,-4e-06,3e-06,3e-06,1e-06,0,0,2e-06,-2e-06,0,0,-4e-06,-3e-06,0,1e-06,0,2e-06,6e-06,0,0,-1e-06,0,2e-06,1e-06,1e-06,3e-06,0,0,-2e-06,0,1e-06,-1e-06,-4e-06,-1e-06,0,3e-06,1e-06,0,1e-06,8e-06,-2e-06,5e-06,1e-06,4e-06,0,-2e-06,-2e-06,-1e-06,-1e-06,-3e-06,0,2e-06,1e-06,-4e-06,0,-4e-06,6e-06,5e-06,2e-06,1e-06,3e-06,0,1e-06,0,-1e-06,0,-1e-06,-7e-06,1e-06,0,-1e-05,-3e-06,2e-06,2e-06,0,0,0,3e-06,-1e-06,4e-06,1e-06,2e-06,9e-06,-1e-06,1e-06,-1e-06,8e-06,2e-06,-1e-06,0,1.9e-05,-3e-06,0,1e-06,2e-06,0,2e-06,4e-06,-2e-06,0,0,-3e-06,0,2e-06,-3e-06,-3e-06,8e-06,0,1e-06,0,0,-2e-06,-1e-06,8e-06,3e-06,-3e-06
1e-06,-3e-06,-1e-06,1e-06,1e-06,0,2e-06,2e-06,-8e-06,-1e-06,0,-1e-06,-1e-06,0,0,-2e-06,-4e-06,6e-06,-1e-06,-2e-06,-1e-06,-2e-06,2e-06,-1e-06,-1e-06,-1e-06,0,-1e-06,0,0,-6e-06,1e-06,0,-1e-06,-1e-06,-2e-06,9e-06,-1e-06,-1e-06,0,-5e-06,-1e-06,0,1e-06,-1.5e-05,-4e-06,-5e-06,-1e-06,0,1e-06,4e-06,7e-06,0,1e-06,-1e-06,0,-2e-06,1e-06,5e-06,-4e-06,-3e-06,-6e-06,-5e-06,0,-2e-06,-2e-06,-9e-06,0,2e-06,1e-06,0,2e-06,-4e-06,1e-06,2e-06,1.3e-05,0,2e-06,0,2e-06,0,0,-6e-06,0,-2e-06,-1e-06,0,-9e-06,-7e-06,0,0,-1.1e-05,-4e-06,5e-06,-1e-06,-1.4e-05,2e-06,0,2e-06,-2e-06,0,0,-2e-06,0,-1e-06,1e-06,-1e-06,-1e-06,0,0,1e-05,-9e-06,2e-06,0,2e-06,-1e-06,2e-06,0,-1.1e-05,-9e-06,-2e-06
