4.4e-05,7e-06,1e-05,1.9e-05,2.1e-05,0.000127,7.8e-05,2.7e-05,3e-05,4e-06,1.1e-05,3e-06,1.8e-05,7e-06,2.2e-05,2.2e-05,6e-06,2.7e-05,2.6e-05,1.7e-05,2.5e-05,3e-06,9e-06,1.9e-05,2.2e-05,7e-06,2.5e-05,1.6e-05,9e-06,3e-06,1.1e-05,1.1e-05,5e-06,3e-06,5e-06,1.2e-05,2.2e-05,1.2e-05,7e-06,2.2e-05,5.3e-05,2.4e-05,2.2e-05,3.9e-05,2.3e-05,7e-06,1.3e-05,3.6e-05,3e-05,4.4e-05,0.00035,0.000418,0.000116,7.5e-05,0.000323,0.000109,0.00068,7.6e-05,0.000785,0.000681,0.000191,0.000187,0.000604,9e-06,0.000174,7.4e-05,0.000411,0.000499,0.000116,0.000189,0.000504,0.000127,1.4e-05,0.000105,0.000196,0.00019,0.000425,0.000129,6.6e-05,0.000215,4e-05,0.00014,0.00039,5.9e-05,7e-06,0.000141,7.3e-05,0.000283,8.6e-05,9e-06,2.5e-05,5.1e-05,0.000137,0.000127,0.000118,6.7e-05,2.2e-05,4e-05,2.3e-05,6.8e-05,1e-04,5.6e-05,2.2e-05,2.9e-05,1e-05,7e-06,2e-05,4e-06,1.5e-05,4.5e-05,1.4e-05,2.5e-05,2.2e-05,2.3e-05,3.3e-05,4.8e-05,6.7e-05,3.5e-05,2.4e-05,6.9e-05,5e-06
0.00011,3e-05,4.2e-05,3.9e-05,3e-05,0.000268,0.000105,0.000115,3.9e-05,2e-06,4.4e-05,4e-06,5.7e-05,2.1e-05,3.1e-05,3.3e-05,4.8e-05,9.8e-05,1.7e-05,4.4e-05,4.2e-05,2e-05,4.5e-05,4e-05,4e-05,4.2e-05,1.3e-05,4.7e-05,4.8e-05,1.1e-05,4.8e-05,2.9e-05,4.5e-05,3.4e-05,3.7e-05,2.9e-05,6.6e-05,2.3e-05,4e-06,2.7e-05,0.000162,0.000216,0.000209,0.000179,0.000171,5.9e-05,9.6e-05,0.000128,0.000134,4.6e-05,0.001402,0.002465,0.001752,0.001102,0.000853,0.000452,0.001874,0.00105,0.001872,0.000496,0.00218,0.001034,0.001067,0.001524,0.000719,0.000658,0.000685,0.001393,0.000675,0.001333,0.000688,0.000283,0.000164,0.000262,0.000175,0.000789,0.000544,0.000608,0.000415,0.000608,0.000275,0.000497,0.000711,0.000375,0.000827,0.000786,0.000278,0.000358,0.000287,0.000208,9.4e-05,4.4e-05,0.000367,0.000288,0.000334,0.00031,0.000109,4.7e-05,9.3e-05,9e-05,0.000297,6.7e-05,0.000103,0.000122,0.000123,8.2e-05,0.000175,0.000112,3.3e-05,4.3e-05,5.7e-05,5.5e-05,9.4e-05,2e-05,7.7e-05,6.3e-05,0.000306,0.000284,0.000137,5.4e-05,5.8e-05
9.5e-05,5.3e-05,1.8e-05,6.2e-05,1.1e-05,0.000184,0.000372,0.000139,0.000107,1.1e-05,2.1e-05,3.1e-05,6.4e-05,3.5e-05,3.8e-05,5.6e-05,6.6e-05,3.4e-05,5.5e-05,6.1e-05,6.5e-05,1.1e-05,5.2e-05,9.3e-05,3.5e-05,2.4e-05,7e-05,5.8e-05,1.3e-05,1.4e-05,2.1e-05,1.1e-05,4.9e-05,1.2e-05,5e-05,2.7e-05,5.4e-05,4.3e-05,6.7e-05,7.4e-05,0.000187,0.000311,5.4e-05,6.6e-05,2.9e-05,8.7e-05,0.000152,2.6e-05,9.4e-05,5.1e-05,0.002229,0.002864,0.001787,0.001001,0.000347,0.001018,0.002756,0.000756,0.001704,0.000504,0.002705,0.001585,0.001302,0.002312,0.001221,0.00123,0.00252,0.000214,0.000756,0.000501,0.000534,0.00076,0.000615,0.00045,0.00053,0.000577,0.000771,0.001057,0.000909,0.001498,0.001138,0.000286,0.001069,0.00071,0.001793,0.000646,0.000125,0.000604,0.000305,0.000248,7e-05,0.000307,0.00023,0.00011,8.8e-05,0.000128,0.00028,0.000156,7.2e-05,0.000331,0.000274,0.000199,0.000215,4.7e-05,0.000154,0.000177,0.000189,0.000225,0.000201,0.000117,6.4e-05,8.9e-05,0.000153,4.4e-05,2.7e-05,0.000151,0.000708,0.000679,0.000393,0.000209,5.7e-05
6.3e-05,9.5e-05,5e-05,0.000131,7.4e-05,9.7e-05,0.000723,0.000225,8.3e-05,4.4e-05,4.7e-05,2.4e-05,2.3e-05,4.1e-05,5.2e-05,8e-05,7.9e-05,7.4e-05,3.6e-05,4.2e-05,2.8e-05,2.8e-05,4.1e-05,2.3e-05,2.3e-05,2.4e-05,3.5e-05,8.2e-05,5.3e-05,5.7e-05,6.1e-05,3e-05,5.3e-05,7.8e-05,8.1e-05,4.4e-05,9.6e-05,8.5e-05,7.4e-05,5.1e-05,7.4e-05,0.000205,0.000126,1e-04,4.5e-05,2.2e-05,2.5e-05,6.4e-05,0.000122,5.8e-05,0.002456,0.0011,0.001676,0.000587,0.000731,0.001422,0.001199,0.001536,0.00168,0.000776,0.002566,0.00117,0.001004,0.001383,0.000733,0.001158,0.001598,0.000555,0.001264,0.000753,0.0018,0.001016,0.000533,0.000568,0.001045,0.000979,0.000967,0.001367,0.001564,0.000497,0.000883,0.001062,0.00128,0.000714,0.00268,0.001735,0.000924,0.001011,0.000415,0.00029,0.000565,0.000861,0.000385,0.000268,0.00012,0.000227,0.00025,0.000134,0.000137,0.000397,0.00035,0.000105,0.000144,0.000228,0.000103,5.7e-05,0.000119,5.4e-05,0.000234,9.7e-05,8.1e-05,0.000109,0.000173,8.1e-05,8.6e-05,6.6e-05,0.000985,0.000634,0.000241,0.000189,5.3e-05
0.000164,0.000108,9.4e-05,0.000165,6.8e-05,0.000285,0.000203,0.000263,6.8e-05,9e-06,0.00015,2.4e-05,5.1e-05,3.8e-05,3.9e-05,7.2e-05,0.000153,5.9e-05,0.000127,0.000119,0.000117,0.000122,4e-06,0.000123,4.9e-05,4.7e-05,0.000127,0.000164,7.6e-05,0.000146,7.8e-05,3.4e-05,3.7e-05,1e-04,6.2e-05,3.6e-05,0.000142,0.000125,0.000111,0.000146,9.4e-05,4e-05,0.000145,0.000118,0.000119,0.000175,8.3e-05,2.5e-05,0.000143,7.5e-05,0.002116,0.002209,0.001263,0.000294,0.000738,0.000358,0.001768,0.000989,0.001342,0.002315,0.002063,0.001135,0.001271,0.00049,0.000774,0.001002,0.001482,0.001438,0.001149,0.00112,0.002417,0.000788,0.000843,0.000404,0.000478,0.001292,0.002114,0.001719,0.001156,0.000628,0.000467,0.00094,0.000602,0.000876,0.002338,0.00094,4e-04,0.001238,0.000596,0.000576,0.000992,0.000246,0.000268,0.000124,0.000129,0.000395,0.00029,0.00013,0.000343,0.000542,0.000335,0.000372,0.000277,0.000129,0.000101,0.000446,0.000227,0.000173,0.000175,0.000173,0.000243,0.000165,0.000222,0.000217,4.7e-05,0.000146,0.001414,0.000707,9.7e-05,0.000361,6.8e-05
3e-04,0.000301,0.000299,0.00029,0.000248,0.00044,0.000181,8e-05,0.00014,4.1e-05,0.000184,0.000202,3.6e-05,5.2e-05,0.000178,1e-04,0.000196,0.000335,0.000351,0.000448,0.000211,0.000205,0.000248,0.000282,0.00024,0.000113,0.000299,0.000454,0.000344,0.000323,0.000388,0.000236,0.00011,0.000166,0.000307,0.000149,0.000268,0.00026,0.000204,0.00011,0.000249,0.000329,0.000297,0.000376,0.000379,0.000302,0.000297,0.000181,9.7e-05,0.000195,0.001535,0.002247,0.001245,0.001082,0.000127,0.001208,0.001678,0.002435,0.002685,0.000941,0.002113,0.001364,0.001932,0.00153,0.002261,0.003119,0.002399,0.002879,0.002388,0.001824,0.003436,0.001926,0.001445,0.000704,0.000449,0.001645,0.000276,0.001003,0.00195,0.000804,0.000914,0.001905,0.001279,0.001041,0.002071,0.001579,0.00043,0.001674,8e-04,0.000719,0.000826,0.001238,0.000915,0.000263,0.000666,0.00062,0.000594,0.000369,0.000367,0.000449,0.000547,0.000764,0.000781,0.000623,0.000107,0.000703,0.000366,0.000276,0.000164,0.000176,0.00023,0.000524,0.000715,0.000284,0.000384,0.000366,0.001646,0.000497,0.000247,0.000628,0.000542
0.000113,0.000172,7.6e-05,0.00022,0.000314,0.000835,0.00118,0.000399,0.00033,0.000326,0.000319,0.000214,0.000159,0.000121,0.000139,0.000128,0.000188,0.00028,5e-05,0.000306,0.000303,0.000322,0.000273,0.000172,0.000148,0.000111,0.000259,0.000321,0.000351,0.000177,0.000246,0.000193,0.000279,3.8e-05,0.000223,0.000182,3e-04,0.000209,7e-05,7.5e-05,0.000473,0.000243,0.000438,0.000157,0.000199,0.00031,0.00034,7.5e-05,0.000117,0.000216,0.001594,0.00346,0.00262,0.001756,0.001541,0.001095,0.003456,0.001771,0.002921,0.002411,0.00085,0.000376,0.002495,0.003376,0.000358,0.004587,0.002683,0.002021,0.002624,0.001587,0.001923,0.004027,0.002566,0.001132,0.000688,0.001053,0.002526,0.001579,0.001938,0.002268,0.002953,0.000915,0.0013,0.001969,0.003039,0.001074,0.000733,0.002394,0.00149,0.000696,0.000872,0.000894,0.000815,0.000603,0.000855,0.00088,0.000705,0.000727,0.00078,0.000838,0.000249,0.000457,1.9e-05,0.000527,0.000565,0.00083,0.000585,0.000235,0.000397,0.000306,0.000198,0.000564,0.000147,0.000297,0.00061,0.00066,0.001803,0.001007,0.000441,0.000389,0.000535
0.000139,6.1e-05,5.6e-05,0.000179,8.4e-05,0.000621,0.001269,0.000942,0.000506,0.000122,4.6e-05,0.000112,7.5e-05,7.3e-05,0.000152,0.000119,7.3e-05,0.000137,0.000167,0.000157,2.9e-05,1e-04,0.000178,8.3e-05,4.1e-05,1.9e-05,0.000166,4.9e-05,0.000168,0.000144,0.000154,0.000127,0.000203,0.000112,0.000159,0.000265,0.000274,0.000204,0.000156,6e-05,0.000474,0.000685,0.000159,0.000164,0.00016,9.3e-05,0.000241,0.000236,2.4e-05,0.00028,0.001565,0.001503,0.000494,0.000998,0.001622,0.001893,0.005454,0.004871,0.005797,0.0025,0.0021,0.001604,0.003698,0.001914,0.004063,0.006539,0.004756,0.003182,0.003175,0.002895,0.002461,0.002833,0.000899,0.000699,0.001056,0.00029,0.002519,0.003045,0.00271,0.002795,0.001427,0.002108,0.002046,0.002699,0.001951,0.001953,0.0011,0.00342,0.002475,0.000909,0.00071,0.000554,0.000862,0.000827,0.001172,0.00054,0.000296,0.000216,8.5e-05,0.000464,0.000728,0.000559,0.000299,0.000298,0.000125,0.000459,0.000292,0.000454,0.00036,0.000476,0.000415,0.000503,0.000596,0.000497,0.000224,0.000281,0.001533,0.002234,0.001274,0.000709,0.000243
6.1e-05,6.5e-05,5.9e-05,1e-06,3.9e-05,0.00052,0.000567,0.000969,0.000491,0.00012,0.000148,8.3e-05,5.8e-05,4e-05,2.3e-05,8.2e-05,5.7e-05,8.4e-05,7.7e-05,8.6e-05,6.5e-05,5e-05,9.9e-05,7.1e-05,8e-06,5.5e-05,0.000171,0.000123,5.6e-05,0.000106,0.000129,1e-04,0.00021,0.000198,7.5e-05,0.000153,0.00021,4.6e-05,9.3e-05,3.3e-05,0.000367,0.000377,0.000293,0.000235,5.2e-05,0.000136,0.000175,0.000123,0.000119,0.00026,0.001958,0.001629,0.001229,0.001218,0.003134,0.000859,0.004291,0.002533,0.004663,0.003258,0.002078,0.002275,0.00199,0.003619,0.002827,0.004708,0.002948,0.002339,0.004975,0.003403,0.002689,0.001564,0.002104,0.000376,0.000993,0.001944,0.001935,0.001489,0.000858,0.002779,0.004031,0.002817,0.00222,0.002993,0.002532,0.00293,0.002394,0.001127,0.000567,0.000238,0.000413,0.000543,0.000405,0.000734,0.000621,0.000515,0.000149,6.8e-05,0.000113,0.000202,0.00041,0.000211,0.00018,5.7e-05,8.3e-05,8.4e-05,0.000145,8e-05,0.000221,0.00013,0.000224,5.7e-05,0.000305,0.000133,0.000297,1.4e-05,0.001239,0.001491,0.000761,0.000273,9.1e-05
3.1e-05,1.9e-05,3.4e-05,6.8e-05,8.2e-05,0.000645,0.001268,0.000967,0.000376,4.7e-05,0.000191,7e-05,3.6e-05,7e-06,1.2e-05,9.6e-05,6.5e-05,4e-05,4.2e-05,4.9e-05,3.1e-05,8.1e-05,8e-06,8.9e-05,8.2e-05,3.2e-05,0.000158,2.9e-05,4.8e-05,4.1e-05,8.6e-05,8.3e-05,5.3e-05,0.000158,6.1e-05,1e-04,2.6e-05,6.7e-05,6.4e-05,6.2e-05,0.00018,0.000173,0.000135,0.000122,1.9e-05,0.000119,0.000129,5e-05,7e-05,7.7e-05,0.001765,0.002089,0.001527,0.000929,0.001407,0.001511,0.002241,0.002764,0.003786,0.002449,0.001149,0.000905,0.003065,0.00339,0.004093,0.002701,0.000602,0.001752,0.001537,0.000557,0.001407,0.001186,0.001001,0.000613,0.000734,0.0022,0.001607,0.00177,0.001213,0.001877,0.000968,0.000164,0.000398,0.001169,0.001997,0.00073,0.00051,0.000987,0.000282,0.000278,0.000439,0.000236,0.000523,0.000192,7.4e-05,0.000172,0.000153,0.000199,0.000246,0.000255,6.8e-05,2.7e-05,7.9e-05,0.000108,0.000195,0.00021,1.9e-05,0.000127,0.000104,9.1e-05,0.000154,0.000116,0.000166,0.000124,0.000138,4.2e-05,0.000793,0.000271,0.00011,0.000141,4.4e-05
7.7e-05,3.7e-05,4.5e-05,0.000103,3e-05,0.00068,0.001461,0.000889,0.000438,0.000139,0.000141,9.3e-05,4.9e-05,3.5e-05,5.6e-05,0.000108,2.1e-05,8.5e-05,4e-05,7.1e-05,6e-05,6.3e-05,1.6e-05,9.2e-05,0.000116,8.9e-05,0.000108,6.2e-05,6.8e-05,5e-05,0.000153,5.2e-05,2.6e-05,0.000105,9.1e-05,9.1e-05,5.6e-05,5.5e-05,0.000103,0.000186,0.000187,1e-04,9.3e-05,3.6e-05,4.8e-05,0.000146,0.000137,4.9e-05,5.6e-05,4.4e-05,0.00167,0.000484,0.000984,0.000816,0.001108,0.000253,0.001318,0.001605,0.002595,0.001781,0.00086,0.000534,0.002165,0.000813,0.002013,0.000997,0.001496,0.000936,0.001642,0.001517,0.001679,0.000702,0.000663,0.000304,0.000458,0.002368,0.001014,0.0017,0.000391,0.001214,0.001239,0.000711,0.000421,0.000568,0.000817,0.000865,0.000488,0.000675,0.00017,0.000211,0.000169,0.000233,0.000484,0.000232,3.5e-05,0.000265,0.000267,0.000134,0.000297,0.00019,5.9e-05,2e-05,0.000134,0.000135,0.000173,0.000187,8.7e-05,0.000159,1.8e-05,8.4e-05,0.000115,9.5e-05,0.000125,0.000116,1.2e-05,4.3e-05,0.000298,0.000138,5.4e-05,0.00013,5.9e-05
1e-04,0.000107,2e-06,4.6e-05,5e-05,0.000743,0.000582,0.000106,5.9e-05,5e-05,4.9e-05,3.2e-05,2.2e-05,1.6e-05,4.2e-05,8e-05,7e-05,3.1e-05,2.4e-05,2.3e-05,5.3e-05,8e-05,4.2e-05,7.9e-05,5e-05,3.9e-05,0.000123,0.000105,1.4e-05,4.3e-05,7.9e-05,3.5e-05,1.6e-05,4.6e-05,3.9e-05,4.6e-05,2.3e-05,0.000133,0.000142,0.000127,0.000206,0.00019,8.3e-05,0.000101,6.4e-05,0.00014,8.1e-05,8e-05,4.6e-05,8e-05,0.001501,0.001494,0.002174,0.000726,0.000629,0.001164,0.00057,0.002111,0.003249,0.000751,0.002475,0.001484,0.001283,0.001425,0.002161,0.001582,0.002038,0.001247,0.001325,7.3e-05,0.00161,0.001442,0.000385,0.001015,0.000384,0.002787,0.001487,0.001136,0.000574,0.001004,0.001397,0.000104,0.000658,0.000245,0.001952,0.000948,0.000116,0.000598,0.000157,0.000276,0.000188,0.000147,0.000371,8.6e-05,6.2e-05,0.000226,0.000257,4.6e-05,0.000236,5.2e-05,0.000104,0.000116,0.000214,9.6e-05,0.000117,0.00018,9.5e-05,6.7e-05,6.1e-05,0.000146,0.000139,4.3e-05,3.1e-05,0.000114,0.000123,7.6e-05,0.000181,0.000297,0.000168,0.000141,3.1e-05
6.8e-05,7.2e-05,2e-06,2.4e-05,8.1e-05,0.000754,0.000319,0.000158,6.8e-05,6.6e-05,5.1e-05,1.6e-05,5.1e-05,2.6e-05,3.2e-05,0.000106,5e-05,2.2e-05,1.7e-05,4.3e-05,3.7e-05,8.2e-05,4.1e-05,1.8e-05,2.4e-05,2.5e-05,0.000113,0.000113,4.5e-05,5.2e-05,7.2e-05,4e-05,2.6e-05,2.1e-05,3.1e-05,8.3e-05,2.6e-05,0.000153,5.4e-05,3.4e-05,3e-04,0.000135,0.000156,0.000103,1.6e-05,0.000178,0.00011,6.2e-05,5.5e-05,7.1e-05,0.001055,0.001714,0.001624,0.000959,0.001511,0.000442,0.000299,0.001354,0.001739,0.001958,0.003914,0.00083,0.002492,0.000834,0.002204,0.001382,0.001234,0.000236,0.00156,0.002024,0.001932,0.001609,0.002719,0.001505,0.001137,0.000514,0.000985,0.000889,0.000924,0.001558,0.001541,0.000827,0.000507,0.000432,0.002688,0.001786,0.000498,0.000359,0.000128,0.000325,0.000379,0.000119,0.00044,1.6e-05,6.9e-05,3e-04,0.000279,0.000163,0.000222,0.000122,7.4e-05,5.5e-05,3.2e-05,5.3e-05,0.000177,0.000202,4.6e-05,0.000133,2e-05,0.000159,0.000244,3.5e-05,7.7e-05,9.9e-05,0.000111,0.00011,0.000284,2.5e-05,7.2e-05,0.000133,3.4e-05
0.000225,0.000143,0.000127,4.1e-05,0.000114,0.000747,0.000343,0.000178,0.000184,0.000166,0.000177,2.6e-05,4.5e-05,3.5e-05,0.000125,0.000168,0.000155,2e-05,7e-05,0.00013,7.5e-05,8.5e-05,8.8e-05,0.000122,0.000152,8.7e-05,7.6e-05,0.000247,0.00011,6.3e-05,0.000151,0.000134,7.3e-05,2.6e-05,8.4e-05,0.000127,6.9e-05,0.00013,0.000239,1e-04,0.000336,0.000258,0.000177,0.000191,0.000124,0.000206,0.000143,0.000125,0.000116,0.000248,0.00058,0.001833,0.002503,0.001025,0.001146,0.001358,0.000724,0.002215,0.00022,0.001881,0.00113,0.00212,0.004542,0.003931,0.002596,0.000872,0.002993,0.002229,0.002183,0.001184,0.001637,0.000287,0.002132,0.000433,0.001889,0.003118,0.000726,0.000652,0.000483,0.00055,0.000434,0.001252,0.000288,0.000336,0.00178,0.001911,0.001081,0.001412,0.000893,0.000556,0.000466,0.000316,0.000491,3.9e-05,0.000212,0.000472,0.00074,0.00056,0.000116,0.000191,0.000329,0.00025,0.000382,0.00031,0.000287,0.000255,0.000114,0.000166,6.3e-05,0.000261,0.000446,0.000365,0.000128,0.000151,0.000107,0.000161,0.000342,9.9e-05,0.000229,0.00025,0.000125
0.000355,0.000317,0.000232,0.000209,5.3e-05,0.000587,0.000235,0.00045,0.000223,3.4e-05,6.3e-05,0.000247,0.000163,0.000136,0.000223,0.000152,0.000259,0.000211,0.000114,0.000244,3e-04,6.8e-05,6.7e-05,4.4e-05,0.000112,4.6e-05,0.000154,0.000245,0.000322,0.000233,0.000149,0.000117,0.000183,0.000162,7.7e-05,0.000244,0.000256,0.000224,0.000297,0.000241,0.000319,0.000319,0.000117,1e-04,4.6e-05,0.000167,6.8e-05,0.000142,3.3e-05,0.000255,0.00107,0.002993,0.002249,0.002464,0.002897,0.001642,0.00101,0.001895,0.00059,0.00501,0.002358,0.002218,0.00334,0.002351,0.002826,0.002679,0.002269,0.001457,0.003348,0.004589,0.002277,0.001062,0.001608,0.00172,0.004241,0.003808,0.003274,0.000787,0.002058,0.002573,0.00115,0.002592,0.000725,0.001445,0.003375,0.000251,0.000194,0.001752,0.000586,0.001111,0.00049,0.000164,0.000804,0.000258,0.000564,0.000472,0.000612,0.000504,4e-04,0.000242,0.000381,0.000126,0.000404,0.000375,0.000311,0.000234,0.000136,0.000134,0.000159,0.000292,0.000247,0.000396,0.000206,0.000161,0.000235,4.5e-05,0.000133,0.000235,0.000336,0.000467,0.000223
6e-05,0.000258,0.000246,3.6e-05,0.00011,0.000265,0.000275,0.000229,0.000153,0.000158,7.1e-05,0.000336,0.000216,0.00025,2.5e-05,0.000329,0.000239,0.000137,0.00013,0.00026,0.000178,0.000242,0.000147,6.3e-05,6.8e-05,7.1e-05,0.000235,6.4e-05,0.000215,0.000114,4.6e-05,3.5e-05,0.000148,0.000145,0.00014,9.5e-05,0.00012,5.9e-05,9e-05,0.000157,0.000406,0.000614,0.000295,0.000155,0.000105,0.00023,0.000173,0.000198,0.000122,0.000108,0.001056,0.006187,0.002168,0.005989,0.006399,0.002497,0.002775,0.004261,0.003793,0.005795,0.006944,0.001682,0.002825,0.007168,0.00891,0.000797,0.003247,0.001308,0.004384,0.003152,0.00439,0.001891,0.004138,0.003239,0.00492,0.008752,0.002702,0.000989,0.00226,0.003167,0.005269,0.004508,0.004211,0.001479,0.004528,0.004476,0.001001,0.001509,0.002156,0.001327,0.000943,0.000194,0.001195,0.001169,0.000687,0.000707,0.000257,0.000395,0.000796,0.000746,0.000629,0.000442,0.000432,0.000174,0.000351,0.000557,0.000311,0.000307,0.000256,0.000184,0.00015,0.000307,0.000226,0.000185,0.000203,0.000106,0.000141,5.2e-05,0.000416,0.000181,0.000367
0.000125,0.000168,0.000196,0.000173,9.6e-05,0.000261,0.000626,0.000263,0.000194,0.000158,0.000108,0.000339,0.000174,0.000245,0.000191,0.000242,0.000153,9.9e-05,7.4e-05,8.6e-05,0.000141,0.000157,0.000174,0.000136,7.3e-05,8.6e-05,0.000223,0.000121,8.5e-05,0.000104,3.9e-05,8.1e-05,8.9e-05,7.1e-05,6.9e-05,0.000111,8.4e-05,0.000175,0.000191,6.6e-05,0.000587,0.000582,0.000293,7.9e-05,0.000128,0.000167,5.8e-05,5.8e-05,0.000125,0.000151,0.001225,0.005833,0.006517,0.009675,0.003755,0.003464,0.001458,0.004547,0.007655,0.009795,0.012026,0.011904,0.005408,0.003562,0.008294,0.01006,0.009372,0.006843,0.00536,0.006097,0.009399,0.007024,0.008704,0.004401,0.006965,0.008107,0.010473,0.007739,0.004447,0.004708,0.007426,0.00522,0.006433,0.007704,0.010482,0.007028,0.005866,0.004224,0.002781,0.003895,0.004115,0.002341,0.000464,0.0018,0.001205,0.000865,0.001028,0.001024,0.000411,0.000874,0.001217,0.000942,0.000491,0.000176,0.000636,0.000932,0.000519,0.000331,0.000595,0.000282,0.000113,0.00018,0.000271,6.1e-05,0.000131,0.000209,0.000304,0.000252,0.000494,0.000613,0.000452
0.000125,3e-05,0.00024,0.000105,3.4e-05,0.000577,0.000187,0.000136,5.4e-05,4.9e-05,0.000108,0.000245,0.000202,7.2e-05,0.000114,0.000165,0.000197,0.000193,7.9e-05,6.6e-05,8e-05,0.000181,9.9e-05,0.000162,0.000102,3e-06,0.000211,0.000149,0.000152,0.000184,0.000186,9.2e-05,9.3e-05,1.8e-05,9.7e-05,5.3e-05,0.000111,0.000326,0.000136,0.000157,0.000402,0.000126,0.000131,2e-05,0.000124,0.000183,0.000221,0.000131,0.000216,9.4e-05,0.001094,0.005502,0.005544,0.006996,0.010245,0.012372,0.007886,0.005095,0.003757,0.005235,0.002793,0.008192,0.009244,0.003492,0.001778,0.004093,0.006216,0.001924,0.006842,0.001912,0.004857,0.008773,0.002282,0.008931,0.009769,0.002392,0.007621,0.007972,0.002789,0.005498,0.003755,0.002538,0.005565,0.0032,0.003715,0.002201,0.003689,0.002038,0.001644,0.002877,0.001897,0.001439,0.001437,0.001714,0.001327,0.001533,0.001019,0.000613,0.000703,0.000253,0.000492,0.000114,0.000415,0.000491,0.000523,0.000118,0.000448,0.000423,0.000307,0.000446,9e-05,0.000226,0.000568,0.000538,0.000337,0.000254,0.000222,0.000266,0.000262,0.00033,0.000168
0.000119,0.000104,0.000237,0.000159,0.000128,0.000798,0.00064,0.000466,0.000153,0.000123,0.000233,0.000126,0.000111,3.2e-05,0.000119,0.000239,0.000135,0.000114,7e-05,0.000198,0.00018,0.000255,0.00021,0.000192,9.6e-05,4.5e-05,0.000172,0.000239,0.000116,0.000145,0.000224,0.000109,0.000124,0.000187,7.6e-05,0.000112,0.000183,0.000242,0.000308,0.000126,0.000164,0.000241,0.00018,5.8e-05,0.000161,0.000129,0.000218,0.00015,0.000258,0.000178,0.000918,0.003343,0.004385,0.000474,0.003457,0.004546,0.001449,0.004655,0.005711,0.002473,0.002988,0.003014,0.003949,0.005876,0.002724,0.003357,0.001821,0.006392,0.004094,0.005354,0.001499,0.005761,0.006221,0.005864,0.002316,0.002565,0.005047,0.002904,0.007481,0.010215,0.008183,0.006819,0.004073,0.002207,0.001678,0.002344,0.003283,0.004207,0.002844,0.000731,0.001476,0.000624,0.000634,0.001058,0.000208,0.000518,0.000236,0.000562,0.001193,0.00095,0.000265,0.00016,0.000357,0.000282,0.000365,0.000583,0.000556,0.000296,0.000157,0.000264,0.000201,0.00028,0.00042,0.000448,0.000237,0.000354,0.000216,4.8e-05,0.000225,0.000197,0.000156
5.9e-05,0.000163,0.000206,6.6e-05,3.6e-05,0.000706,0.000745,0.000304,0.000225,0.00014,0.00015,0.00019,0.000233,0.000219,0.000182,0.000163,9.1e-05,0.000192,0.000289,0.000111,4.9e-05,0.000205,0.000246,0.000205,0.000163,4.9e-05,0.000181,0.000167,0.000194,0.000187,0.000177,0.000188,7.4e-05,0.000162,0.000253,0.000343,0.000203,0.000296,0.000222,0.000194,0.000285,0.000334,0.000225,0.00019,8.4e-05,0.000301,8e-05,0.000116,0.00016,0.000166,0.000438,0.003029,0.006714,0.00466,0.002655,0.002833,0.006577,0.004238,0.003682,0.004236,0.00393,0.002447,0.003278,0.005442,0.002067,0.001303,0.004382,0.008316,0.0047,0.007234,0.004884,0.002387,0.002573,0.004686,0.002409,0.001254,0.000575,0.003846,0.007466,0.002135,0.002449,0.003291,0.00129,0.001984,0.000988,0.003514,0.001372,0.001405,0.000626,0.000652,0.000777,0.000391,0.000578,0.000439,0.000693,0.000553,2.4e-05,0.000784,0.000859,0.000385,0.000172,3e-04,0.000499,0.000485,0.000311,0.000554,7.3e-05,0.000193,0.000285,0.000495,0.000257,0.00038,0.000208,0.000284,0.000411,0.000326,0.000436,0.000159,0.000122,0.00035,7.4e-05
0.000125,4.9e-05,2.7e-05,7.8e-05,0.000109,0.000558,0.000363,0.000174,0.000173,5.5e-05,0.000133,0.000137,9.2e-05,7.2e-05,0.000133,0.000113,4.6e-05,0.000128,0.000181,0.000113,8.4e-05,0.000158,6.2e-05,3.9e-05,0.00017,0.000169,0.000209,0.00013,8.3e-05,1.7e-05,6.8e-05,8.6e-05,9.4e-05,4.6e-05,0.000117,0.000115,9.3e-05,0.000104,5.5e-05,0.000139,0.00011,0.000252,0.00017,0.00017,0.000223,0.000176,0.000194,0.000134,3.1e-05,0.000116,0.000228,0.001926,0.004062,0.002343,0.003578,0.003016,0.006287,0.005136,0.003566,0.000919,0.001182,0.001951,0.002776,0.002269,0.002375,0.002247,0.003607,0.002583,0.000626,0.003709,0.001092,0.000797,0.002637,0.001719,0.002782,0.002796,0.002737,0.002835,0.001986,0.001291,0.000444,0.002563,0.003148,0.001318,0.001909,0.002243,0.000462,0.000552,0.000981,0.000448,0.000286,0.000546,0.000834,0.000953,0.00097,0.000189,0.000277,0.000651,0.000267,0.000371,0.000273,0.000305,0.000164,0.000296,0.000157,0.00012,0.000131,0.000231,9.9e-05,0.000256,0.000373,0.000114,5.5e-05,0.00028,0.000318,0.000437,0.000191,0.000124,0.000179,0.000341,0.000446
6.7e-05,5.2e-05,0.000147,0.000156,0.00011,0.000579,0.000293,0.000204,6.5e-05,3.1e-05,7.9e-05,2e-05,1.8e-05,7.8e-05,5.2e-05,2.6e-05,3.9e-05,5e-05,4.9e-05,2.5e-05,6.8e-05,5.5e-05,6.7e-05,5.7e-05,0.000154,0.000159,3e-05,5e-05,8.3e-05,0.000141,8.6e-05,7.6e-05,4.5e-05,5.6e-05,2.1e-05,3.7e-05,8.6e-05,0.000106,4.2e-05,6.4e-05,0.000271,0.00024,0.000128,8.9e-05,8.7e-05,0.000205,0.000136,0.000106,3.6e-05,0.000101,0.000101,0.000984,0.001817,0.001792,0.001706,0.001766,0.002468,0.00236,0.00099,0.001478,0.001818,0.000881,0.002185,0.00076,0.001407,0.000763,0.00196,0.001474,0.001252,0.001954,0.001175,0.0024,0.002317,0.001644,0.001819,0.002023,0.000377,0.001536,0.002879,0.000751,0.000922,0.001599,0.001114,0.000622,0.001844,0.000598,0.000563,0.00095,0.000649,0.000356,0.000242,0.000286,0.000467,0.000428,0.000376,0.000338,0.000177,0.00042,0.000143,0.000247,0.000308,0.000139,0.000172,8.6e-05,0.000236,0.000261,0.000149,9e-05,0.000103,7.4e-05,0.000274,0.000277,0.000265,0.00028,8.5e-05,0.000142,0.000387,0.000176,0.000164,0.000132,0.000194
4.5e-05,3.8e-05,7.1e-05,3.9e-05,3.4e-05,0.00023,0.000153,2.6e-05,2.4e-05,1.1e-05,2.4e-05,2.5e-05,4.9e-05,4.9e-05,2.1e-05,4.3e-05,4e-05,3e-05,3.1e-05,1.3e-05,2.5e-05,2.4e-05,1e-05,3e-05,1.7e-05,6.1e-05,5.9e-05,1.6e-05,1.4e-05,4.4e-05,2e-05,1.2e-05,2.8e-05,3.6e-05,4.7e-05,5.9e-05,1e-05,4.6e-05,2.8e-05,4.7e-05,0.000186,3.7e-05,4.5e-05,3.7e-05,4.5e-05,7.3e-05,2.7e-05,3.4e-05,7e-06,4.5e-05,0.000115,0.000645,0.001135,0.000885,0.000802,0.000368,0.000438,0.000652,0.000205,0.000636,0.000259,0.000471,0.000397,0.001182,0.000852,0.000845,0.000677,0.000891,0.000582,0.000364,0.000817,0.00072,0.001067,0.000286,0.000482,0.000872,0.000665,0.00049,0.000684,0.000767,0.000432,0.000305,0.000447,5.7e-05,0.000753,0.000399,0.000242,0.000127,0.000209,0.000194,4.7e-05,5.4e-05,0.000159,8.7e-05,0.000105,0.000104,6.6e-05,0.000124,6e-05,6.3e-05,7.8e-05,3.5e-05,4.3e-05,3.2e-05,5.5e-05,5.5e-05,2e-05,1.2e-05,7.9e-05,1e-04,5.2e-05,5.6e-05,6.6e-05,2.1e-05,6.7e-05,6.1e-05,7.9e-05,9e-06,6.4e-05,3.8e-05,7.1e-05
5.5e-05,1.6e-05,5e-05,2.5e-05,2.6e-05,0.000159,9.3e-05,3.6e-05,2.1e-05,3e-06,1.4e-05,2.1e-05,3.7e-05,3.2e-05,5e-06,2.8e-05,2.7e-05,1.4e-05,1.7e-05,7e-06,1.7e-05,2.1e-05,1.4e-05,3.1e-05,3.3e-05,4.6e-05,1.6e-05,1.4e-05,2.6e-05,3.2e-05,1e-06,2.7e-05,3e-05,1.7e-05,3.5e-05,1.7e-05,1.4e-05,4.3e-05,5.5e-05,5.8e-05,0.000108,6.4e-05,5e-06,9e-06,1.6e-05,4.6e-05,3.1e-05,2.3e-05,4e-06,2.3e-05,0.000127,0.000666,0.000519,0.000578,0.000921,0.00071,0.000932,0.000497,0.000559,0.000378,0.000271,0.000594,0.000211,0.000712,0.000626,4.4e-05,0.000703,0.000274,0.000173,0.000465,0.000183,0.000345,0.000866,0.000537,0.000538,0.000491,0.000108,0.000445,0.000398,0.000268,0.000397,0.000241,0.000465,0.00032,0.000691,0.000595,6.2e-05,0.000122,0.000217,0.000135,4.2e-05,1.8e-05,0.000131,8.2e-05,6.2e-05,6.4e-05,4.7e-05,8e-05,5.1e-05,5.6e-05,5.2e-05,1.2e-05,2.9e-05,2.6e-05,3.8e-05,5.1e-05,2.3e-05,2.3e-05,6.7e-05,7e-06,3.6e-05,2.9e-05,3.1e-05,2.9e-05,4.1e-05,2.7e-05,5.1e-05,2.9e-05,4.3e-05,3.4e-05,3.5e-05
2.8e-05,1.2e-05,3e-05,1.8e-05,2e-05,0.000111,0.000101,4.8e-05,2.6e-05,1.6e-05,1.3e-05,3e-06,2.3e-05,1e-05,1.1e-05,1.3e-05,2.3e-05,1.4e-05,1.6e-05,1e-05,5e-06,4e-05,3e-05,1e-06,5e-06,1.3e-05,2.2e-05,1.9e-05,1.5e-05,2.1e-05,1e-05,2.8e-05,2.1e-05,3e-06,2.3e-05,1.9e-05,1.4e-05,3.9e-05,3.1e-05,4.3e-05,8.1e-05,8e-06,2.2e-05,2.8e-05,1.9e-05,2.4e-05,3e-06,2.9e-05,2.4e-05,3.2e-05,7.3e-05,0.00026,0.00028,0.000345,0.000521,0.000256,0.000409,0.000265,0.000298,0.000293,0.000487,0.000127,0.000419,0.000273,0.000244,0.000623,0.000453,0.000305,0.000312,0.000521,0.000525,0.000457,0.000206,0.000411,0.000486,9.6e-05,0.000355,0.000458,0.000502,0.000133,0.000318,0.000538,0.000354,5.3e-05,0.00057,0.000431,0.000168,0.000136,0.000182,0.000166,4.8e-05,1.4e-05,8.6e-05,4e-05,5.8e-05,4.5e-05,3.7e-05,8.7e-05,4.6e-05,2.5e-05,4e-05,1.4e-05,1.9e-05,4e-05,2.2e-05,3.7e-05,1.5e-05,3e-05,6.1e-05,5.2e-05,2.9e-05,3.2e-05,3.1e-05,2.8e-05,1.8e-05,2.4e-05,2.8e-05,3e-05,4.8e-05,1e-05,1.1e-05
2.2e-05,2e-05,2e-05,1.3e-05,1e-05,6.2e-05,2.2e-05,2.4e-05,1e-05,7e-06,2.9e-05,2.1e-05,1.6e-05,1.4e-05,1.3e-05,6e-06,9e-06,1e-06,3.1e-05,1.5e-05,1e-05,3.6e-05,1.2e-05,9e-06,8e-06,2.1e-05,1.8e-05,1.3e-05,2e-05,5e-06,6e-06,1.4e-05,1.9e-05,1.4e-05,9e-06,4.2e-05,3.3e-05,2.9e-05,3.7e-05,4.2e-05,6.9e-05,3.3e-05,3.7e-05,2e-06,2.4e-05,8e-06,5e-06,2.2e-05,1.8e-05,3.6e-05,0.000107,0.000129,0.000552,0.000789,0.00049,0.00038,0.000449,0.000565,0.000221,0.000345,0.000267,0.000506,0.000407,0.000349,0.000309,0.000487,0.000435,0.000271,0.000311,0.000409,0.000281,0.000106,0.000343,0.000381,0.000362,0.000248,0.000368,0.000211,0.000412,0.000174,0.000419,0.000237,0.000322,6.3e-05,0.00031,0.000327,0.000176,0.000146,8.8e-05,0.000129,4.2e-05,2e-05,1e-04,3.1e-05,6.8e-05,3.2e-05,2.5e-05,7.6e-05,2.9e-05,2.9e-05,3.7e-05,3.8e-05,2.7e-05,1.7e-05,3.5e-05,1.7e-05,3.5e-05,1.1e-05,4.4e-05,1e-05,7e-06,6e-06,9e-06,3.3e-05,1.9e-05,1e-05,6.7e-05,1.3e-05,5e-05,9e-06,1.8e-05
2.3e-05,1.6e-05,5e-06,1.2e-05,1.1e-05,5.2e-05,3.4e-05,2.2e-05,7e-06,1e-05,1.2e-05,1.4e-05,1.6e-05,1.6e-05,1.3e-05,1.7e-05,1e-05,1.4e-05,1.7e-05,1.1e-05,3e-06,2e-05,9e-06,8e-06,9e-06,1.4e-05,1.8e-05,3e-06,1.2e-05,2.2e-05,1.8e-05,2.2e-05,2e-06,9e-06,2e-05,2.5e-05,1.4e-05,3.3e-05,5e-06,2.6e-05,8e-05,4.3e-05,4e-06,1e-05,1.6e-05,2.4e-05,1.6e-05,1.9e-05,3e-06,4e-05,0.000116,0.000181,0.000308,0.000409,9.4e-05,0.000205,0.000437,0.000511,0.000511,0.000133,0.000173,0.00062,0.000313,0.000662,0.000589,0.00076,0.000302,0.000178,0.000277,0.000429,0.000523,0.000317,0.000391,0.000193,0.000209,0.000128,0.000212,7.9e-05,0.000348,0.000242,0.000436,0.000332,0.000375,0.000167,0.00028,4e-04,0.000164,0.000139,0.000122,0.000127,1.6e-05,3.1e-05,8.1e-05,3.3e-05,4.7e-05,4e-05,6e-06,7e-05,4.9e-05,4e-05,1.3e-05,4.7e-05,4.1e-05,1.9e-05,2e-05,1.8e-05,1.8e-05,1.9e-05,1.3e-05,1.7e-05,3.7e-05,1.5e-05,1.9e-05,2e-05,7e-06,1.1e-05,7.3e-05,6e-06,3e-05,4.5e-05,3.1e-05
1e-06,1e-05,1e-05,1.5e-05,1e-05,3.1e-05,2.2e-05,1.4e-05,2e-06,1.5e-05,1.2e-05,6e-06,1.7e-05,3e-06,5e-06,1.3e-05,4e-06,5e-06,9e-06,9e-06,3e-06,9e-06,5e-06,1.6e-05,2.2e-05,1.4e-05,1.9e-05,1.1e-05,1.3e-05,2.2e-05,1e-05,1e-05,1.4e-05,7e-06,2.7e-05,2.2e-05,8e-06,3.3e-05,3.1e-05,2.4e-05,6.9e-05,5e-06,1e-05,4e-06,1.8e-05,1.5e-05,1.8e-05,1.1e-05,6e-06,1.6e-05,9.5e-05,0.000311,0.000142,0.000212,0.000174,0.000233,0.000277,0.000616,0.000874,0.000469,0.000397,0.000221,0.000485,0.000672,0.000109,0.000262,0.000346,0.000429,0.000175,0.000336,0.000331,0.000415,0.000189,0.000287,0.000357,0.000122,0.000174,0.000536,0.000556,0.000357,0.000375,7.8e-05,0.000197,9.5e-05,0.000358,0.000289,0.00014,0.000158,0.000101,0.000122,2.5e-05,1.2e-05,3.2e-05,3e-05,3.1e-05,3.8e-05,4.1e-05,3.9e-05,6.7e-05,1.6e-05,3.3e-05,1.8e-05,1e-05,1.7e-05,1.7e-05,5e-06,6e-06,3.1e-05,1.6e-05,2.5e-05,4e-05,1.3e-05,3.3e-05,3.2e-05,1.9e-05,2.7e-05,7.3e-05,1.7e-05,7e-06,2.8e-05,2.6e-05
8e-06,8e-06,8e-06,1.4e-05,1.4e-05,2.9e-05,3.6e-05,1.1e-05,1.4e-05,9e-06,1.9e-05,1.1e-05,1.2e-05,1.1e-05,6e-06,4e-06,1.1e-05,9e-06,1.7e-05,6e-06,9e-06,7e-06,3e-06,7e-06,1e-05,1.9e-05,2.3e-05,6e-06,4e-06,1.2e-05,7e-06,4e-06,2e-06,4e-06,2.1e-05,1.1e-05,1.3e-05,3e-05,1.7e-05,2.8e-05,6.5e-05,3.3e-05,1.1e-05,1.1e-05,6e-06,9e-06,1.2e-05,7e-06,1.4e-05,2.4e-05,5.8e-05,0.000229,0.000192,0.00032,0.00019,0.000158,0.000319,0.000619,0.000363,0.00032,0.000283,0.00025,0.000474,0.00022,0.000581,0.000404,0.000311,0.000327,0.000174,0.000336,0.000185,0.000313,0.00046,0.000401,0.000264,0.00023,0.000237,0.000322,0.00033,0.000218,0.00038,0.000158,0.000331,4.9e-05,3e-04,0.000325,0.000136,0.00013,0.000167,5.5e-05,2.2e-05,5.5e-05,2.4e-05,2.4e-05,7.1e-05,3.1e-05,5.3e-05,3.9e-05,8.2e-05,2.3e-05,3.7e-05,1.9e-05,1.7e-05,1.1e-05,9e-06,3e-06,1.9e-05,2.1e-05,3.4e-05,1.5e-05,3.6e-05,1e-05,3.6e-05,1.6e-05,2.8e-05,3e-06,6.4e-05,1.9e-05,3.2e-05,1.1e-05,2.2e-05
1e-05,9e-06,1e-05,9e-06,9e-06,4.3e-05,2.2e-05,9e-06,3e-06,5e-06,1.7e-05,8e-06,1.1e-05,1.5e-05,1.6e-05,1.4e-05,2e-06,3e-06,1.3e-05,5e-06,1.5e-05,2.1e-05,1e-05,4e-06,4e-06,1.1e-05,2.9e-05,7e-06,5e-06,1.3e-05,1.7e-05,2e-06,0,1.1e-05,1.6e-05,2.9e-05,1.1e-05,3.5e-05,5e-05,3e-05,7.3e-05,1.7e-05,2e-05,2.3e-05,5e-06,1.1e-05,1.3e-05,1.2e-05,1.3e-05,2.8e-05,9.8e-05,0.00032,0.000143,0.000229,2e-05,0.000146,0.000361,0.000323,0.000127,0.000122,5e-06,0.00039,0.00038,0.000143,0.000384,0.00028,0.00049,0.000325,0.000269,0.00022,0.000248,0.000177,7.7e-05,0.000356,0.000285,0.000189,0.000131,0.000194,0.000476,0.000228,0.000213,0.000124,0.000478,0.000164,0.000187,0.000379,0.000191,0.000138,9.7e-05,8.8e-05,3.2e-05,6.5e-05,9.5e-05,9.6e-05,4.8e-05,6e-05,8e-05,5.1e-05,5.5e-05,0.000118,8.2e-05,4.8e-05,1e-05,1e-05,3.8e-05,3.2e-05,6.6e-05,2.6e-05,2e-05,1.1e-05,2.3e-05,2.4e-05,3.2e-05,1.1e-05,3.1e-05,2.4e-05,3.2e-05,1.7e-05,3e-05,1.4e-05,1.5e-05
1.2e-05,1.3e-05,2.1e-05,2e-06,6e-06,5.1e-05,5.1e-05,2.1e-05,7e-06,4e-06,1.1e-05,1e-05,1.2e-05,1e-05,1e-05,7e-06,3e-06,4e-06,1.7e-05,2e-06,1.5e-05,1.7e-05,1e-05,1.8e-05,1.3e-05,1e-05,1.2e-05,5e-06,6e-06,1.5e-05,1.2e-05,2.3e-05,1.7e-05,1.5e-05,1.1e-05,1.7e-05,2.1e-05,3.8e-05,1.2e-05,1e-05,4.3e-05,3.1e-05,3e-05,1e-05,2.1e-05,1.1e-05,1.1e-05,1.3e-05,1.2e-05,2.1e-05,0.00014,0.000448,0.000284,0.000287,0.000147,7.3e-05,0.000331,0.000294,3.2e-05,2.2e-05,0.00024,0.000256,0.000225,0.000283,0.000574,0.000477,0.000469,3.7e-05,0.000327,0.000436,0.000482,0.000407,0.000259,0.000128,0.000302,0.000164,0.000217,0.000289,0.000261,0.000399,0.000455,0.000222,0.000189,0.000289,0.000283,0.00032,0.000267,0.000321,0.000213,4.6e-05,0.000111,4.6e-05,7.8e-05,7.8e-05,9.3e-05,3.2e-05,9.6e-05,8.1e-05,4.8e-05,0.000102,4e-05,1.5e-05,3.7e-05,2.4e-05,5e-05,9.5e-05,1.6e-05,2.4e-05,3.8e-05,2.3e-05,5e-06,2.3e-05,2.3e-05,2.1e-05,2.9e-05,1.3e-05,3.1e-05,1.5e-05,2e-05,8e-06,2.8e-05
2.6e-05,7e-06,2.2e-05,1.3e-05,1e-05,5.4e-05,1.6e-05,1.3e-05,1.2e-05,2e-06,9e-06,2e-06,1.1e-05,3e-06,8e-06,9e-06,4e-06,1e-05,1.5e-05,1e-05,1.3e-05,8e-06,9e-06,4e-06,1.1e-05,8e-06,1.3e-05,4e-06,9e-06,1.9e-05,4e-06,1.6e-05,1.5e-05,3e-06,3e-06,1.6e-05,1e-05,2.5e-05,1.4e-05,9e-06,2.4e-05,1.6e-05,1.6e-05,1.1e-05,1.5e-05,2.9e-05,1.9e-05,1.2e-05,1e-05,1.6e-05,0.000133,0.000111,0.000114,0.000269,0.000107,5e-05,0.00031,0.000364,0.000331,0.000149,5.7e-05,0.000235,1.7e-05,0.000253,0.000407,0.000123,0.000263,0.000298,0.000275,0.000238,0.000171,0.000221,0.000342,0.000231,0.000209,0.000135,0.000155,0.000325,0.000227,0.000256,0.000186,0.00017,0.000286,0.000142,0.000137,0.000211,0.000313,9.9e-05,0.000107,0.000128,4.5e-05,6.9e-05,7.1e-05,6.7e-05,1.9e-05,2.6e-05,8.6e-05,2.6e-05,3.8e-05,4.2e-05,3.3e-05,2.2e-05,1.2e-05,2.9e-05,5.3e-05,2.6e-05,5.7e-05,5.3e-05,1.7e-05,2.4e-05,1.5e-05,2.6e-05,3.9e-05,1.8e-05,2.9e-05,2.1e-05,1e-05,2.6e-05,3.3e-05,1.6e-05,3.7e-05
2.2e-05,1.1e-05,1.6e-05,1.6e-05,3e-06,5.4e-05,7.1e-05,3e-05,1.6e-05,4e-06,2e-06,9e-06,1.1e-05,2e-06,3e-06,9e-06,2e-06,1e-05,2.1e-05,6e-06,5e-06,5e-06,2.3e-05,2e-05,1.3e-05,9e-06,1.3e-05,6e-06,9e-06,5e-06,1e-05,1.3e-05,2.6e-05,1e-05,1.4e-05,6e-06,1.2e-05,2.3e-05,1.6e-05,1.1e-05,2.6e-05,1.1e-05,1e-05,1.3e-05,5e-06,2.2e-05,1.4e-05,9e-06,1.3e-05,1.3e-05,0.000136,0.000207,0.00017,0.000191,3.5e-05,0.000114,0.000181,0.000245,0.000159,0.000136,0.000144,0.000261,0.000213,7.4e-05,0.000258,0.000389,0.000319,0.000217,0.00044,0.000201,0.000113,0.00015,6.3e-05,0.000302,0.000103,0.000146,9.2e-05,0.000213,2.9e-05,0.000127,4.5e-05,0.000276,0.000352,0.000197,0.000278,0.000283,0.000308,0.000105,0.000162,0.000128,4.6e-05,7.4e-05,0.000147,3.9e-05,4.7e-05,6.9e-05,4.2e-05,3.8e-05,2.6e-05,5.9e-05,1.4e-05,2.6e-05,6.3e-05,3.1e-05,1.9e-05,1.8e-05,1e-05,2.5e-05,6e-06,1.5e-05,4.4e-05,2.7e-05,3.1e-05,2.9e-05,1e-05,0,3.9e-05,3.6e-05,6.9e-05,4.8e-05,4.9e-05
1.3e-05,1.2e-05,1.6e-05,1e-05,6e-06,3.6e-05,7.3e-05,2.5e-05,1.6e-05,4e-06,4e-06,3e-06,9e-06,1e-06,3e-06,1e-05,8e-06,4e-06,1.3e-05,1.1e-05,1.4e-05,9e-06,1.9e-05,2e-06,1.1e-05,1.5e-05,1.1e-05,8e-06,9e-06,1.4e-05,2e-06,8e-06,1.2e-05,3.1e-05,2.3e-05,2e-06,4e-06,5.2e-05,4.7e-05,2.6e-05,5.4e-05,2.3e-05,7e-06,1.7e-05,2.6e-05,3.7e-05,1.4e-05,1e-05,1.7e-05,1.5e-05,1e-04,0.000166,0.00018,0.000174,0.000118,0.000141,0.000384,0.000459,0.000292,7.5e-05,0.00019,0.000202,0.000313,6.7e-05,0.000157,0.000147,0.000217,0.000251,0.000536,0.000298,0.000235,0.000141,0.000359,0.000159,0.000358,9.8e-05,0.000162,1e-04,0.000249,0.000201,0.000352,0.000139,0.000304,7e-05,0.000186,0.000345,0.000267,0.000165,0.000128,8.1e-05,6.9e-05,5.5e-05,7e-05,4.7e-05,9.9e-05,9.9e-05,3.9e-05,5.2e-05,1.5e-05,6.9e-05,3.2e-05,1e-05,7.6e-05,5.3e-05,3e-05,3.3e-05,1.7e-05,2.2e-05,4.3e-05,2.5e-05,5.5e-05,1.9e-05,2.5e-05,2.8e-05,3.2e-05,2.6e-05,7.6e-05,4e-05,6.7e-05,5.5e-05,4e-05
1.3e-05,1.3e-05,9e-06,1e-06,1.1e-05,1.4e-05,1.8e-05,2.9e-05,2.3e-05,1.5e-05,1.5e-05,4e-06,1.1e-05,2e-06,6e-06,2e-06,1.6e-05,8e-06,1e-05,7e-06,1.6e-05,1.2e-05,2.2e-05,1.7e-05,2e-06,2e-05,2.2e-05,1.1e-05,2e-06,1.3e-05,3e-06,7e-06,8e-06,2.6e-05,1.3e-05,3e-06,2e-05,6.6e-05,3.6e-05,4e-06,6.1e-05,5.3e-05,2.8e-05,1.5e-05,1.3e-05,5.2e-05,2.9e-05,9e-06,1.4e-05,2.6e-05,5.2e-05,0.000162,5.7e-05,0.000285,8.5e-05,8.5e-05,0.000469,0.000224,1e-04,0.000187,0.000163,0.000224,0.000322,0.00015,0.000257,0,0.000191,0.000347,0.000372,0.000268,0.000114,0.000199,0.000277,0.000185,0.000277,0.000103,0.000137,0.000103,0.000324,0.000263,0.000105,0.00021,0.000185,0.000155,0.000225,0.000216,0.00013,0.000135,0.000117,0.000141,5e-06,3.8e-05,5.4e-05,2e-05,4.6e-05,5e-05,2.9e-05,3.5e-05,3.2e-05,3.2e-05,2.6e-05,1.6e-05,4.2e-05,3.6e-05,9e-06,2e-05,1.9e-05,1.3e-05,2.1e-05,9e-06,2.3e-05,1.4e-05,3.3e-05,2.2e-05,2.1e-05,1e-05,9.7e-05,5.8e-05,7e-06,4.1e-05,2.8e-05
4e-06,1e-05,1.3e-05,2e-06,1.1e-05,1.7e-05,4.2e-05,8e-06,1e-05,7e-06,1.1e-05,3e-06,9e-06,4e-06,1e-05,4e-06,1e-05,1e-05,2e-05,1e-05,1.5e-05,9e-06,1.5e-05,8e-06,3e-06,5e-06,1.5e-05,1.5e-05,1e-05,2e-06,3e-06,1e-06,1.2e-05,2e-05,1.2e-05,9e-06,8e-06,8e-05,4.8e-05,1.7e-05,8.4e-05,1.7e-05,2e-06,1.2e-05,7e-06,2.8e-05,1.9e-05,9e-06,1.3e-05,2.3e-05,1.4e-05,9.3e-05,4.6e-05,0.000198,8.7e-05,0.000107,0.000304,0.000381,0.00011,7.1e-05,0.000171,0.000189,0.000352,0.000129,0.00023,0.000409,0.000186,5.3e-05,0.000395,0.000218,9.5e-05,0.000129,0.000168,2e-04,0.000151,0.000143,0.000129,0.000163,0.000256,0.000183,0.000178,0.000125,0.000253,6e-05,0.000304,0.000135,0.000158,0.000116,0.000108,0.000101,3.9e-05,6.1e-05,3.4e-05,3e-06,2.7e-05,3e-05,3.4e-05,3.5e-05,3.3e-05,8e-06,1.8e-05,1.5e-05,4.7e-05,2.1e-05,2.1e-05,1.5e-05,4e-05,6e-06,1.2e-05,5e-06,2e-05,4e-06,3.2e-05,6e-06,2.9e-05,2e-05,9e-05,1.8e-05,4.2e-05,2.4e-05,1.5e-05
8e-06,1.1e-05,3e-06,2e-06,4e-06,2.4e-05,3.8e-05,2.4e-05,1.6e-05,1.4e-05,2.1e-05,1.4e-05,3e-06,3e-06,1.2e-05,8e-06,3e-06,6e-06,2.1e-05,1.3e-05,1.8e-05,9e-06,5e-06,2.6e-05,8e-06,1.3e-05,1.6e-05,1.1e-05,1.3e-05,1.6e-05,1.4e-05,3e-06,1e-05,5e-06,1.2e-05,1.9e-05,1.9e-05,7.9e-05,3.4e-05,2.1e-05,5.9e-05,7.2e-05,3.2e-05,3.2e-05,1.6e-05,4.7e-05,2.5e-05,2.3e-05,1.2e-05,2.2e-05,6.4e-05,4e-06,7.7e-05,0.000154,7.2e-05,0.000139,6.3e-05,0.000153,0.000348,0.000151,7.6e-05,0.000149,0.000335,4.5e-05,0.000322,0.00058,0.000169,0.000101,0.000379,4.9e-05,0.000211,4.9e-05,0.000338,0.000304,0.000161,0.000153,0.000183,0.000229,0.000257,5.8e-05,0.000395,6.5e-05,0.000108,0.000431,5.7e-05,9e-05,0.000208,0.000193,0.000147,0.000182,6.2e-05,6.8e-05,7.9e-05,6e-05,0.000106,4.6e-05,5.9e-05,3.8e-05,1.6e-05,4.7e-05,3.2e-05,1.8e-05,8.4e-05,8e-05,4.1e-05,3.3e-05,3.4e-05,3.4e-05,2.2e-05,2e-05,1.7e-05,1.1e-05,3e-06,1.9e-05,3.1e-05,1.2e-05,5.5e-05,3.4e-05,2.6e-05,3.8e-05,4.2e-05
1.8e-05,9e-06,8e-06,1.3e-05,1.3e-05,2.1e-05,3e-06,1.2e-05,1.1e-05,1.4e-05,9e-06,5e-06,1.3e-05,1.1e-05,1.4e-05,1e-05,3e-06,8e-06,2e-05,5e-06,1.8e-05,1.4e-05,5e-06,1.9e-05,1e-05,6e-06,1.6e-05,7e-06,1.8e-05,9e-06,1.6e-05,1.6e-05,6e-06,6e-06,1.3e-05,1.8e-05,2e-05,5.2e-05,6.2e-05,3.8e-05,6.6e-05,7.9e-05,5.5e-05,1.3e-05,1.4e-05,5e-05,1.7e-05,1.1e-05,1.8e-05,9e-06,6.5e-05,6.7e-05,8.6e-05,0.000172,0.000119,4.1e-05,0.000116,9.6e-05,0.000247,0.000164,0.000213,0.000237,0.000255,0.00015,0.000357,0.000355,0.000351,0.000268,0.000324,0.00022,0.000339,0.000289,0.000208,0.000136,0.000171,0.000191,8.9e-05,0.000261,0.000206,0.000112,0.000159,0.000263,0.000282,0.000243,0.000358,0.000196,0.000141,0.000176,0.000185,0.000125,9.9e-05,0.000103,0.000101,2.1e-05,9.2e-05,5.5e-05,4e-05,8.1e-05,2.8e-05,3.5e-05,1.1e-05,2.9e-05,5.2e-05,7.7e-05,5.9e-05,1.1e-05,3e-05,2.7e-05,3.5e-05,4.1e-05,2.2e-05,2.8e-05,1.7e-05,1.8e-05,1.8e-05,2.2e-05,4.8e-05,1e-05,4.8e-05,3.9e-05,1.1e-05
2.6e-05,9e-06,1.8e-05,1.8e-05,8e-06,1.8e-05,1.6e-05,8e-06,9e-06,2e-06,7e-06,2e-06,1.2e-05,5e-06,5e-06,8e-06,6e-06,1e-06,1.3e-05,2e-06,1.3e-05,1.4e-05,8e-06,2e-06,8e-06,1.1e-05,1.8e-05,8e-06,9e-06,2.2e-05,2e-06,6e-06,2e-06,3e-06,7e-06,1e-05,1.7e-05,3.6e-05,2.8e-05,2.3e-05,5.2e-05,3.9e-05,3.4e-05,2.6e-05,1.6e-05,2.2e-05,1.5e-05,1.3e-05,1e-05,1.6e-05,4.9e-05,0.000195,0.000108,0.000193,5.2e-05,0.000121,8.8e-05,0.000155,0.000168,6.2e-05,0.000185,0.00011,0.000146,0.000136,0.000465,0.000279,7.4e-05,6.9e-05,0.000298,0.000202,0.000275,1.1e-05,0.000183,0.000179,0.000169,0.000216,0.000238,0.000269,0.000237,4.6e-05,8.9e-05,0.000158,0.000374,0.000288,8.5e-05,6.6e-05,0.000108,5.1e-05,0.000117,0.000177,5.1e-05,3.8e-05,2.5e-05,3.2e-05,5.7e-05,1.6e-05,8e-06,6e-05,2.1e-05,2.1e-05,1e-05,3.2e-05,6.3e-05,2.8e-05,2.1e-05,2.4e-05,2.9e-05,1.3e-05,1.5e-05,2.1e-05,2.6e-05,8e-06,2.3e-05,2e-05,3.3e-05,2.4e-05,3.3e-05,1.6e-05,3.5e-05,2.1e-05,2.4e-05
1.1e-05,7e-06,1.4e-05,5e-06,6e-06,9e-06,2.7e-05,8e-06,3e-06,6e-06,8e-06,2e-06,1.2e-05,3e-06,3e-06,9e-06,3e-06,2e-06,1.7e-05,4e-06,8e-06,3e-06,4e-06,3e-06,8e-06,7e-06,1.5e-05,7e-06,5e-06,1.5e-05,5e-06,3e-06,5e-06,2e-06,4e-06,1.2e-05,5e-06,2.1e-05,1.8e-05,2.1e-05,3.5e-05,1.7e-05,1e-05,2e-06,1.2e-05,2.7e-05,1.5e-05,5e-06,5e-06,1.5e-05,2.2e-05,0.000176,4.3e-05,0.000252,7.1e-05,8.9e-05,6.2e-05,0.000143,0.000145,0.00017,0.000274,0.00023,0.000115,9.2e-05,0.00041,0.000112,2.5e-05,0.000103,0.000144,0.000135,0.000148,0.000197,0.000216,0.00016,0.000241,9e-05,0.000146,8.7e-05,0.000114,8.1e-05,0.00019,0.000229,0.000114,5e-05,0.000247,8.1e-05,0.00011,7e-05,7e-05,0.000104,2e-05,3.4e-05,5.9e-05,3.1e-05,3.4e-05,1.7e-05,2.8e-05,3.9e-05,8e-06,2.2e-05,1e-05,2.6e-05,3.3e-05,1.5e-05,3e-06,1.3e-05,1.6e-05,1e-05,1.2e-05,8e-06,1e-05,6e-06,2e-05,1.5e-05,1.2e-05,1.1e-05,3.7e-05,7e-06,2.1e-05,1.1e-05,8e-06
1.4e-05,1.1e-05,1.2e-05,4e-06,8e-06,2e-06,1.8e-05,2e-06,2e-06,4e-06,7e-06,2e-06,9e-06,3e-06,1e-06,8e-06,1e-06,5e-06,1.4e-05,2e-06,5e-06,4e-06,2e-06,5e-06,7e-06,7e-06,1.4e-05,5e-06,4e-06,1.2e-05,3e-06,3e-06,4e-06,4e-06,5e-06,1.1e-05,8e-06,1.3e-05,9e-06,1.7e-05,3.4e-05,7e-06,5e-06,2e-06,4e-06,2e-05,8e-06,2e-06,6e-06,1.3e-05,1.7e-05,0.000121,6.4e-05,0.000195,2.7e-05,6.1e-05,5e-05,0.000162,0.000182,0.000217,0.000182,0.000143,0.000248,8.7e-05,0.000228,0.000216,0.00015,0.000141,8.8e-05,8.7e-05,0.000129,8.5e-05,0.000204,0.00017,0.000193,3.7e-05,0.00022,0.00012,0.000188,0.000119,0.000206,0.000128,0.00018,4.6e-05,0.000213,0.000139,5.1e-05,3.4e-05,6.7e-05,9.2e-05,2.5e-05,2.6e-05,4.4e-05,2e-05,2.9e-05,1.8e-05,2.2e-05,4.3e-05,1e-06,2.5e-05,8e-06,1.1e-05,3.1e-05,4e-06,2e-06,9e-06,8e-06,3e-06,9e-06,1e-06,1.6e-05,4e-06,1.6e-05,1.4e-05,1.1e-05,7e-06,5e-05,2e-06,1.5e-05,4e-06,8e-06
8e-06,1.2e-05,1.2e-05,6e-06,9e-06,2e-06,2.1e-05,1e-06,1e-06,2e-06,6e-06,1e-06,9e-06,2e-06,1e-06,8e-06,1e-06,4e-06,1.3e-05,3e-06,3e-06,4e-06,0,5e-06,7e-06,7e-06,1.4e-05,3e-06,4e-06,1.3e-05,2e-06,2e-06,3e-06,4e-06,5e-06,1.1e-05,7e-06,8e-06,8e-06,1.4e-05,3.4e-05,3e-06,4e-06,3e-06,2e-06,2.1e-05,5e-06,0,7e-06,1.2e-05,2.7e-05,5.5e-05,1.3e-05,0.000153,1.8e-05,1e-06,4.6e-05,0.000117,5.4e-05,0.000112,0.000239,0.000211,0.000194,4.3e-05,0.000211,0.000135,4.5e-05,9.6e-05,0.000127,3.8e-05,8.9e-05,5e-05,0.000143,0.000174,0.000181,1.7e-05,0.000104,4.3e-05,0.000224,6.2e-05,0.000182,0.00013,0.000177,3.2e-05,0.000152,0.000119,4.5e-05,1.9e-05,5.7e-05,8.5e-05,2.9e-05,1.7e-05,5e-05,2.1e-05,2.9e-05,2.4e-05,2e-05,4e-05,6e-06,2.1e-05,9e-06,1.2e-05,3.2e-05,1e-06,0,4e-06,6e-06,1e-06,1e-05,1e-06,1.3e-05,4e-06,1.7e-05,1.1e-05,1.1e-05,6e-06,4.7e-05,2e-06,1.9e-05,2e-06,6e-06
