1e-06,4.6e-05,4e-06,6.1e-05,1.8e-05,5.1e-05,2.4e-05,2.9e-05,1.4e-05,1.7e-05,4.7e-05,3.5e-05,3.4e-05,5.8e-05,3.8e-05,1.3e-05,1.1e-05,1.6e-05,2.1e-05,2.5e-05,4.7e-05,5.2e-05,5.1e-05,1.4e-05,2.5e-05,2.7e-05,8e-06,1.6e-05,4e-05,2.1e-05,4.3e-05,1.5e-05,6.1e-05,2.9e-05,1.9e-05,4.1e-05,4e-06,4e-06,5.5e-05,3e-05,7.7e-05,3.3e-05,1e-06,6.2e-05,5.2e-05,6.1e-05,8.1e-05,2.3e-05,9.9e-05,5.3e-05,4.6e-05,2.5e-05,4.2e-05,1e-05,8.2e-05,7e-06,6.7e-05,2.1e-05,5.2e-05,9.8e-05,6.1e-05,2.1e-05,8e-06,6e-05,3.1e-05,4.6e-05,3e-06,2e-06,1.5e-05,1e-05,4.1e-05,3.8e-05,7.3e-05,6.4e-05,4e-05,4e-06,4.5e-05,3e-06,0.000103,1.6e-05,4.8e-05,1.5e-05,1.4e-05,9e-06,4.7e-05,5.8e-05,1.3e-05,0.000108,5.6e-05,5.6e-05,2.9e-05,2.7e-05,5e-06,1.7e-05,1.6e-05,4.6e-05,4.3e-05,0.000113,6.7e-05,7.2e-05,4.4e-05,6.9e-05,3.6e-05,2.8e-05,2.3e-05,4e-05,1.4e-05,2.2e-05,6.3e-05,8e-06,6.2e-05,3.7e-05,3.3e-05,1.2e-05,1.2e-05,1.1e-05,3.8e-05,5e-06,3.4e-05,4e-06,5e-06
2.8e-05,8.4e-05,8.9e-05,0.000108,8.5e-05,6.5e-05,4.3e-05,7.5e-05,6.2e-05,3.1e-05,9.5e-05,5.9e-05,0.000105,1.3e-05,0.00014,0.000139,0.000102,3.2e-05,3.7e-05,6.1e-05,8.3e-05,0.000194,0.00027,0.000219,0.000108,0.000134,8.9e-05,0.000123,7.3e-05,1.8e-05,0.000118,6.8e-05,9.2e-05,3.6e-05,5.4e-05,0.000111,0.000131,6e-05,1e-04,5.6e-05,0.000162,0.000153,0.000105,7e-05,7.5e-05,0.000135,7.1e-05,0.000141,0.000155,0.000232,0.000178,0.00016,3.7e-05,7.5e-05,0.000109,0.000153,0.000188,0.000196,0.00011,0.000231,0.000312,0.000196,7.2e-05,9.8e-05,9.3e-05,0.000148,0.000116,6.8e-05,5.2e-05,4.8e-05,5.2e-05,7e-06,0.000141,2.2e-05,0.000116,0.000111,0.000114,0.000138,0.000202,0.000185,0.000112,0.000121,6.3e-05,0.000108,0.000125,1.2e-05,5.9e-05,0.000165,0.000298,0.000149,0.000106,4.7e-05,5.3e-05,2.2e-05,8e-06,9.4e-05,0.000196,0.000178,0.000292,0.000199,0.000212,0.000116,0.000163,9.7e-05,0.000101,1e-04,6.2e-05,5e-05,0.000155,0.000165,0.000152,7.8e-05,7.7e-05,0.000108,2.7e-05,4.3e-05,7.4e-05,4.9e-05,5e-05,8.2e-05,7.9e-05
4.9e-05,5.4e-05,2.8e-05,6.9e-05,3e-05,4.6e-05,1.9e-05,5.7e-05,2e-05,1.4e-05,8.2e-05,4.4e-05,5.3e-05,2.5e-05,0.000143,4.6e-05,6.2e-05,8.3e-05,3.8e-05,2e-05,6.1e-05,0.000155,8e-05,0.000129,7e-05,7.9e-05,9.5e-05,7.6e-05,4.2e-05,8.3e-05,0.000137,8e-05,4.4e-05,6.8e-05,5.7e-05,9.1e-05,7.7e-05,0.000121,7.3e-05,3.5e-05,0.000134,6.4e-05,3.9e-05,6.9e-05,0.000102,8.8e-05,3.8e-05,6.1e-05,0.000103,2.6e-05,8.2e-05,5e-05,6.8e-05,5.2e-05,5e-06,0.000111,0.000108,8.5e-05,4.5e-05,7.1e-05,0.000214,8.3e-05,4.6e-05,0.000109,6.1e-05,5.5e-05,8e-05,2.3e-05,3.3e-05,3.6e-05,6.1e-05,9.2e-05,9.9e-05,0.000102,8e-05,7.8e-05,3.6e-05,0.000106,1.6e-05,0.000134,3.4e-05,6.6e-05,4.7e-05,0.000101,7.2e-05,9.5e-05,4.7e-05,5.8e-05,0.000156,9.1e-05,4.6e-05,8.5e-05,5.2e-05,3.5e-05,6.9e-05,7.1e-05,0.000124,3.6e-05,0.000116,6.3e-05,0.000109,8.9e-05,7.9e-05,1.2e-05,7.2e-05,0.000105,0.00014,8.4e-05,8.1e-05,5.9e-05,3.3e-05,5.5e-05,0.000115,4.1e-05,6.4e-05,1.8e-05,3.9e-05,7.3e-05,4.8e-05,7.1e-05,7.8e-05
1.5e-05,2.2e-05,5.8e-05,8.3e-05,7.9e-05,0.000109,6.1e-05,2.3e-05,5.6e-05,3.8e-05,6.6e-05,1e-06,4.7e-05,0.000114,0.000175,0.000169,6e-05,9.8e-05,3.7e-05,5.1e-05,4.6e-05,0.000105,0.000112,7.9e-05,3.6e-05,0.000114,6e-05,7.8e-05,0.000141,0.000153,0.000107,2e-05,6.3e-05,7.4e-05,0.000122,9e-06,0.00011,0.000101,5.4e-05,1.3e-05,0.000129,0.000107,5.8e-05,5.5e-05,7.4e-05,1.4e-05,5.5e-05,5e-05,0.000108,0.000159,7.6e-05,6.2e-05,3e-05,8.1e-05,2.4e-05,0.000128,2.6e-05,8.7e-05,7.8e-05,2.4e-05,0.000102,7.3e-05,4.1e-05,8.8e-05,3.7e-05,1.8e-05,5.7e-05,7.2e-05,7.9e-05,1.4e-05,3.8e-05,6.6e-05,6.4e-05,5.6e-05,4.9e-05,6.2e-05,0.000125,0.000104,3.8e-05,9.4e-05,5e-05,5.8e-05,5e-06,1e-04,0.000141,0.00014,0.000169,8.5e-05,8.6e-05,1e-05,4.5e-05,7.4e-05,2.6e-05,2.7e-05,2.5e-05,4.7e-05,0.000158,0.000115,4.4e-05,5.1e-05,7.1e-05,0.000135,6.7e-05,1.7e-05,4e-05,8e-06,0.00011,6.9e-05,9.1e-05,0.000126,8e-05,2.4e-05,5.4e-05,0.000138,0.000113,9e-05,5.6e-05,8.8e-05,0.000116,0.000135,0.000145
3.4e-05,7e-06,3.6e-05,4.1e-05,4.9e-05,9.2e-05,6.8e-05,2.4e-05,4.3e-05,4.6e-05,1.6e-05,7.3e-05,0.000121,8.9e-05,8.3e-05,4.8e-05,3.9e-05,7.3e-05,6e-05,7.5e-05,0.000133,8.8e-05,7.1e-05,5.5e-05,9.3e-05,0.000123,0.000151,0.000152,6.3e-05,3.7e-05,5e-05,5e-05,7.4e-05,0.000139,8.2e-05,4.8e-05,0.000112,4.2e-05,9.2e-05,6.9e-05,8.9e-05,6.4e-05,2.8e-05,1.3e-05,3.6e-05,8.4e-05,0.000136,8.3e-05,5e-05,0.000102,8.9e-05,4.8e-05,1.8e-05,3.8e-05,2e-05,0.000119,5.8e-05,6.1e-05,4.9e-05,5.5e-05,3.7e-05,1.3e-05,6.3e-05,0.000127,8.4e-05,3.9e-05,4e-05,6.2e-05,6.5e-05,9.6e-05,8.4e-05,8.6e-05,8.8e-05,5.1e-05,5.1e-05,3.9e-05,9.3e-05,0.000129,0.000105,3.7e-05,3.7e-05,7.3e-05,5.2e-05,6.9e-05,5.9e-05,3.6e-05,7.9e-05,9.5e-05,0.000149,0.000144,0.000105,4.8e-05,5.4e-05,5e-05,5.8e-05,2.3e-05,6.1e-05,4.4e-05,5.5e-05,9.1e-05,0.00012,4.1e-05,2.1e-05,2.7e-05,4.8e-05,7.6e-05,8.9e-05,4.3e-05,6.8e-05,5.6e-05,2.7e-05,3.3e-05,2.8e-05,7.6e-05,1.6e-05,2.1e-05,4.4e-05,7.4e-05,9.4e-05,2.2e-05,2.6e-05
2.3e-05,1.8e-05,3.5e-05,4.4e-05,3.4e-05,0.000111,6.4e-05,9.6e-05,3.3e-05,5.3e-05,3.9e-05,6.5e-05,6.6e-05,5.4e-05,4.9e-05,9.7e-05,2.4e-05,6.6e-05,0.000104,0.000123,0.000134,9e-05,0.000129,7.4e-05,0.00013,0.000119,6.7e-05,7.9e-05,0.000164,0.000136,0.000101,0.000123,9.3e-05,0.000108,1.6e-05,3.1e-05,0.000136,5.2e-05,9.2e-05,8.6e-05,6e-05,5.3e-05,3.2e-05,9.2e-05,0.000111,8.7e-05,8.1e-05,7.6e-05,4.4e-05,6.4e-05,4.3e-05,6.7e-05,5e-06,2.8e-05,6.5e-05,6e-05,4e-05,6e-05,0.000122,1e-05,4.9e-05,4.2e-05,5.8e-05,0.00014,9.5e-05,0.000101,4.9e-05,4.3e-05,9.3e-05,7.3e-05,3.4e-05,0.000108,8e-05,7.5e-05,9.2e-05,2.3e-05,7.3e-05,0.000122,0.000176,0.000236,0.000151,2.3e-05,5.2e-05,3.6e-05,3.7e-05,2.8e-05,5.5e-05,8.8e-05,8.2e-05,0.000151,7.3e-05,0.000108,0.000107,0.000112,8.8e-05,6.8e-05,3e-05,6.5e-05,5.7e-05,0.000163,0.00013,0.000134,2.5e-05,8e-05,3.9e-05,9.7e-05,0.000144,5.7e-05,5.1e-05,6.3e-05,1e-05,4.9e-05,4.3e-05,3.4e-05,3.8e-05,8.1e-05,6.3e-05,3.1e-05,6e-05,4.7e-05,3.9e-05
4.4e-05,6.3e-05,2.8e-05,7.5e-05,7.1e-05,5.6e-05,5.3e-05,8e-05,0.000145,6.7e-05,9.2e-05,9.1e-05,6.7e-05,8.7e-05,0.000104,0.00017,0.000132,7.3e-05,3.3e-05,0.000124,0.000133,5.5e-05,0.00011,0.000181,0.000122,0.000111,0.000204,0.000113,0.000134,4.2e-05,4.4e-05,9.9e-05,0.000115,8.4e-05,4.4e-05,1.4e-05,0.000118,0.000134,7.6e-05,8e-06,3.4e-05,6.9e-05,1.9e-05,0.000122,2.5e-05,0.000179,0.000225,6.2e-05,0.000102,0.000157,3.7e-05,5.7e-05,9.5e-05,0.000122,0.000135,0.000151,7.9e-05,1e-04,7.6e-05,0.000137,0.000117,0.000104,2.2e-05,0.000109,0.000105,6.1e-05,4.9e-05,4.6e-05,6.1e-05,5.7e-05,4.9e-05,0.000114,6e-06,3.7e-05,3.5e-05,0.000121,5.1e-05,2.4e-05,8.3e-05,9.6e-05,0.000155,0.000134,7.3e-05,5.3e-05,4.7e-05,5.2e-05,2.6e-05,0.000132,0.000173,8.6e-05,4.7e-05,6.2e-05,0.000113,0.000187,0.000117,0.000145,9.6e-05,8e-05,3e-05,9.7e-05,2.6e-05,5.4e-05,6.4e-05,0.000114,1e-04,2.3e-05,9.4e-05,7.2e-05,5e-05,5.2e-05,6.9e-05,3.8e-05,3.6e-05,0.000112,7.2e-05,7.3e-05,3.7e-05,8e-05,0.000169,0.000131,6.8e-05
2.6e-05,5.9e-05,9.1e-05,1.5e-05,7e-05,7.7e-05,3.5e-05,2.2e-05,0.000164,0.000155,2.7e-05,5.4e-05,6.5e-05,0.00013,5.6e-05,5.1e-05,4.2e-05,6.5e-05,3.3e-05,4.8e-05,0.00011,8.1e-05,8.8e-05,0.000232,0.000173,7.6e-05,0.000131,0.000116,3.2e-05,0.000154,0.000193,0.000212,0.000134,0.000167,0.000164,8.8e-05,0.000141,0.000164,0.000102,2e-05,5.7e-05,7.9e-05,9.8e-05,7.6e-05,9.3e-05,0.00016,8.4e-05,0.000128,0.000156,8.6e-05,0.000143,0.000141,0.000107,3.5e-05,0.00012,2.6e-05,0.000102,0.000142,0.000177,0.000106,0.000124,0.000144,0.000105,3.3e-05,6.7e-05,9.9e-05,0.000142,6.8e-05,4e-05,0.000107,0.000141,0.000164,0.000163,8.7e-05,8.6e-05,9.6e-05,6.9e-05,5.7e-05,6.4e-05,5.9e-05,6.2e-05,5.4e-05,4.1e-05,6.3e-05,2.9e-05,7.2e-05,7.7e-05,0.000178,6.5e-05,6.8e-05,4.5e-05,3.2e-05,9.8e-05,0.000185,0.000102,0.000107,0.000113,3.6e-05,4.9e-05,6.5e-05,6.4e-05,4.7e-05,2e-05,7.1e-05,5e-05,1.8e-05,9.2e-05,5.5e-05,8.6e-05,0.000123,0.000106,9.8e-05,0.000104,0.000114,4.7e-05,5.1e-05,6.2e-05,4.7e-05,0.000158,6.5e-05,3e-05
4.7e-05,6.7e-05,0.000115,9.6e-05,4.7e-05,2.9e-05,5.5e-05,1.6e-05,0.000141,4.4e-05,6.4e-05,2.1e-05,3.9e-05,1e-04,5.7e-05,6.4e-05,6.2e-05,4.2e-05,7.2e-05,6.5e-05,8.9e-05,4.6e-05,8.8e-05,0.000186,7.7e-05,6.3e-05,9.8e-05,0.000114,8.9e-05,0.00014,0.000108,0.000118,6.8e-05,0.000102,3.1e-05,2.3e-05,0.000112,9.7e-05,4.4e-05,5.7e-05,8.8e-05,4.8e-05,0.000114,0.000133,2.1e-05,0.000106,0.000114,0.000155,5.3e-05,0.000191,0.000151,5e-05,4.6e-05,6.5e-05,5.6e-05,7.5e-05,9.4e-05,8.2e-05,1.4e-05,8.7e-05,0.000197,8.8e-05,0.000117,0.000134,0.000111,5.1e-05,0.000123,0.000109,7.7e-05,0.00011,0.000107,0.000163,1.6e-05,9.7e-05,8.1e-05,5.2e-05,5.2e-05,6.9e-05,2.1e-05,1e-04,5.5e-05,4.3e-05,7.1e-05,7e-05,7e-05,5.8e-05,8.5e-05,8.8e-05,9.7e-05,8.8e-05,0.000135,0.000147,3.4e-05,0.000121,0.00013,0.000127,8.9e-05,6.4e-05,0.000126,0.000138,6.1e-05,3.6e-05,6.4e-05,3e-06,9.9e-05,3.4e-05,3.5e-05,6.1e-05,8.5e-05,0.000165,0.000133,2.7e-05,7.6e-05,0.000196,0.000174,6.6e-05,6.8e-05,6.4e-05,0.000131,0.000117,4.6e-05
7.4e-05,4.1e-05,9.1e-05,3e-05,5.2e-05,2.2e-05,8.1e-05,9.6e-05,8e-05,5.1e-05,8.9e-05,7.1e-05,0.000112,8.9e-05,8.1e-05,0.000104,6.6e-05,2.1e-05,4.3e-05,5.7e-05,5.7e-05,0.000144,5.3e-05,8.7e-05,0.000125,0.000203,0.000116,0.000164,0.000209,0.00014,3.5e-05,0.000146,8.9e-05,9.5e-05,0.000122,8.7e-05,7.2e-05,0.00011,0.000103,0.000118,6e-05,8.2e-05,0.00015,4.1e-05,4.6e-05,9.6e-05,0.000141,7e-05,5.6e-05,0.000215,0.000107,6.5e-05,5e-05,5.1e-05,9.6e-05,7.6e-05,6.9e-05,1.6e-05,4e-05,0.000161,0.000249,0.000167,0.000148,5.5e-05,6.4e-05,2.1e-05,4.4e-05,0.000131,0.000128,3.5e-05,2.3e-05,5e-05,0.000139,7.8e-05,0.000181,0.000188,0.000184,7.7e-05,4.9e-05,0.000183,0.000144,9e-05,7.7e-05,0.000176,0.000146,0.000151,0.000138,0.000125,7.9e-05,4e-05,0.00013,0.000121,5.4e-05,0.000126,0.000196,2e-04,6.3e-05,1e-05,0.000115,3.2e-05,4.5e-05,8.1e-05,4.6e-05,6.5e-05,8.9e-05,9.1e-05,4.9e-05,6.1e-05,3.3e-05,0.000197,0.000119,5.6e-05,3.4e-05,0.000105,0.000103,0.000135,0.000141,9.6e-05,0.000136,0.000167,0.000148
1.3e-05,6.1e-05,1.8e-05,3e-05,5.1e-05,6.8e-05,5.3e-05,4.5e-05,8.8e-05,4.9e-05,0.000108,2.3e-05,0.000102,7e-05,4.4e-05,0.000147,7.8e-05,3.8e-05,4.4e-05,1.9e-05,6.9e-05,0.000127,8e-05,5.5e-05,0.000107,0.000153,6.2e-05,0.000183,0.000106,0.000116,6.8e-05,9e-05,0.000142,0.000129,9.9e-05,0.000141,0.000145,4.8e-05,6.7e-05,4e-05,3.7e-05,5.5e-05,0.000187,0.000186,3.9e-05,5.8e-05,9.1e-05,5.4e-05,7e-05,0.000168,8.2e-05,1.2e-05,1.2e-05,9e-06,3.5e-05,4.2e-05,1.4e-05,1.8e-05,5.8e-05,0.000144,2.7e-05,3.4e-05,6e-05,5.8e-05,6.6e-05,7e-05,5.9e-05,0.000103,7.9e-05,5.4e-05,8.1e-05,6.3e-05,0.000104,6.8e-05,0.000134,0.000142,4.1e-05,1.8e-05,9.3e-05,5.7e-05,5.9e-05,5e-05,0.000114,0.000126,2.6e-05,8.7e-05,3e-06,0.000122,1.7e-05,7.3e-05,7.9e-05,2.5e-05,2.9e-05,0.000131,5.6e-05,0.000138,0.000153,0.000147,1.7e-05,2.2e-05,9.3e-05,2e-05,2.2e-05,7.8e-05,3.7e-05,7e-05,0.000106,5.8e-05,6.9e-05,0.000113,2.6e-05,5e-05,8e-06,3e-05,3e-05,9.5e-05,0.000119,0.000111,0.000141,6.4e-05,5e-05
5.6e-05,0.000106,9.5e-05,7.2e-05,5.3e-05,8.1e-05,7.2e-05,3.2e-05,5.9e-05,3e-05,5.9e-05,8.2e-05,5.4e-05,7.3e-05,9.5e-05,3.7e-05,5.1e-05,2.4e-05,2.5e-05,7e-05,8.2e-05,4.6e-05,8.3e-05,9.7e-05,3.2e-05,6.5e-05,5.2e-05,0.000218,0.00013,3.5e-05,2.4e-05,4.8e-05,0.000146,0.000129,4.7e-05,9.4e-05,2.1e-05,8.1e-05,9.5e-05,8.4e-05,3.2e-05,4.1e-05,0.000173,0.000142,0.000189,7.5e-05,5.7e-05,0.000101,0.000117,2.3e-05,3.7e-05,2e-05,2.4e-05,1.9e-05,2.3e-05,6.4e-05,3.8e-05,4.7e-05,4e-05,8.1e-05,6.9e-05,3.6e-05,1.1e-05,3.7e-05,3e-05,3.6e-05,3.4e-05,7.9e-05,0.000113,4.3e-05,9.9e-05,8e-05,4.2e-05,3.8e-05,8.4e-05,3.9e-05,2.8e-05,7.3e-05,6.4e-05,0.000133,3.1e-05,5.9e-05,5.4e-05,7.5e-05,5.6e-05,3.3e-05,2.5e-05,0.000103,3.3e-05,8.1e-05,0.000115,3.2e-05,4.4e-05,7.2e-05,5.4e-05,3.9e-05,1.3e-05,7e-05,4.4e-05,3.3e-05,4.8e-05,4.1e-05,3.6e-05,7.9e-05,6.3e-05,9e-05,9.5e-05,2.3e-05,9.3e-05,8.4e-05,0.00012,0.000111,5e-05,4.1e-05,4.1e-05,5.8e-05,5.6e-05,6.8e-05,4.3e-05,6e-05,8.5e-05
4.9e-05,4.6e-05,4.6e-05,4.1e-05,4.4e-05,5.1e-05,1.4e-05,1.9e-05,3.2e-05,3.9e-05,7e-05,6.3e-05,4.9e-05,6e-05,1.8e-05,2.8e-05,2.2e-05,9e-06,4.4e-05,7.7e-05,1.7e-05,2.8e-05,9.4e-05,2.8e-05,7e-05,0.000111,8.3e-05,0.000103,3.4e-05,5.7e-05,2e-05,4.7e-05,0.000104,0.000154,8.3e-05,3.2e-05,6.8e-05,8.3e-05,4.7e-05,6e-05,3.9e-05,5.9e-05,7.3e-05,3.2e-05,0.000103,7.5e-05,6.2e-05,8.9e-05,2.7e-05,3.3e-05,4.7e-05,7.2e-05,3.9e-05,3.2e-05,5.5e-05,9e-05,3.8e-05,5.2e-05,4.6e-05,4.4e-05,7.8e-05,8.9e-05,6e-06,4.4e-05,5.5e-05,5.8e-05,4.7e-05,8.2e-05,2.3e-05,3.1e-05,9e-05,8e-06,3.1e-05,5.1e-05,5.8e-05,6.3e-05,7.3e-05,2.5e-05,7.8e-05,9.7e-05,4.2e-05,4.9e-05,5.2e-05,2.6e-05,8e-06,2.9e-05,4.4e-05,3.2e-05,7.5e-05,9.6e-05,0.000118,0.000109,0.000106,7.4e-05,4.2e-05,3.2e-05,4.6e-05,2.4e-05,2.4e-05,3e-05,2.8e-05,6e-06,4.7e-05,2.4e-05,1.8e-05,6.1e-05,5.4e-05,6.1e-05,7.7e-05,6.6e-05,7.7e-05,3.5e-05,6.9e-05,6.5e-05,5.8e-05,7.5e-05,2.7e-05,7.2e-05,7.3e-05,4.5e-05,2.5e-05
1e-06,5.4e-05,4.5e-05,1.5e-05,6.2e-05,6.8e-05,3.5e-05,3e-05,4.6e-05,4.6e-05,9e-05,4.4e-05,4.3e-05,3e-05,6.1e-05,2.9e-05,1.7e-05,7.1e-05,4.6e-05,3.9e-05,0.000104,4e-05,8.5e-05,6.1e-05,7.8e-05,8.6e-05,0.000197,3.8e-05,5.9e-05,8.3e-05,6.6e-05,3.2e-05,5.1e-05,8.3e-05,3.2e-05,3.7e-05,3.2e-05,4.7e-05,7.7e-05,7.8e-05,5e-05,9.9e-05,9.1e-05,5.7e-05,2.2e-05,0.000124,5.9e-05,2.6e-05,9e-06,2.9e-05,2.3e-05,8.1e-05,6.8e-05,4.1e-05,1.4e-05,5.5e-05,6.5e-05,5.8e-05,2.4e-05,2.4e-05,0.000104,1.8e-05,9.3e-05,3e-05,4.1e-05,5.3e-05,5e-06,6.9e-05,8.8e-05,7.2e-05,7.4e-05,8.8e-05,8e-05,3.3e-05,4.9e-05,3.2e-05,5e-05,6.9e-05,4.8e-05,0.000105,8.2e-05,1.7e-05,9e-05,0.000116,5.7e-05,7e-05,3.1e-05,5.5e-05,0.000113,6.7e-05,6.9e-05,2.3e-05,8.7e-05,6.2e-05,2.9e-05,5.5e-05,0.000102,0.000115,7e-05,1.1e-05,1.4e-05,4.2e-05,5.5e-05,3.6e-05,2.9e-05,6.1e-05,8e-05,6.2e-05,3.9e-05,7e-06,0.000115,0.000125,6.6e-05,5.1e-05,8e-05,3.3e-05,1.5e-05,2.5e-05,6.3e-05,2.2e-05,1.5e-05
2.5e-05,4.5e-05,3.5e-05,2.7e-05,8.3e-05,2.4e-05,4.7e-05,4.5e-05,1.5e-05,3.8e-05,8.3e-05,7.4e-05,4.4e-05,2.1e-05,8.4e-05,3.4e-05,6.2e-05,6.5e-05,7.8e-05,0.000103,0.000165,9.1e-05,3.8e-05,4.7e-05,5.7e-05,8.9e-05,0.000167,0.000113,4.2e-05,1.2e-05,3.2e-05,8.6e-05,8.8e-05,9.1e-05,7.7e-05,6.2e-05,8.4e-05,6.5e-05,5.7e-05,8.8e-05,7e-05,0.000122,5.7e-05,3.6e-05,4.2e-05,9.5e-05,0.000114,7.7e-05,5.1e-05,3e-05,2.2e-05,8.3e-05,9.2e-05,7.8e-05,8.3e-05,3.1e-05,5.1e-05,9.3e-05,6.8e-05,6.7e-05,7.9e-05,6.6e-05,0.000106,0.000123,0.000112,0.000165,0.000106,4.3e-05,0.000129,0.000155,1e-04,6.1e-05,1.3e-05,8.2e-05,2.1e-05,4.8e-05,6.3e-05,8.5e-05,6e-05,0.00011,0.000132,9e-05,8.6e-05,6.4e-05,5.3e-05,0.000104,7.7e-05,0.000131,0.000143,8e-05,6.4e-05,6.5e-05,8e-05,0.000123,9.9e-05,5.5e-05,0.000112,2.1e-05,3.7e-05,1.2e-05,7e-06,3.2e-05,4.8e-05,3.4e-05,3.7e-05,1.8e-05,3.4e-05,7.5e-05,9.1e-05,9.1e-05,0.000118,0.000107,0.000108,7.8e-05,5.3e-05,0.000107,7.5e-05,0.000106,3.8e-05,3.9e-05,3.7e-05
5e-05,7.1e-05,7.2e-05,1e-05,7.9e-05,4.5e-05,4.7e-05,3.1e-05,3.6e-05,6.2e-05,4.6e-05,2.1e-05,1.9e-05,2.5e-05,7.3e-05,7.3e-05,9.8e-05,0.000117,3.1e-05,6.2e-05,6.1e-05,2.9e-05,5.5e-05,0.000149,0.00012,0.000107,5.3e-05,6.9e-05,7.1e-05,1.7e-05,5.8e-05,3.5e-05,3.2e-05,9e-06,2.7e-05,6.9e-05,1.5e-05,5.4e-05,1.7e-05,7e-05,4.4e-05,0.000125,5.9e-05,3.4e-05,4.6e-05,1.9e-05,3.3e-05,4.1e-05,7e-06,2.5e-05,3.7e-05,8.7e-05,2.1e-05,2.1e-05,3.9e-05,1e-04,1.6e-05,5.4e-05,5.8e-05,4.7e-05,5.8e-05,1.6e-05,4e-05,6.7e-05,4.3e-05,0.00013,5.7e-05,1.3e-05,8.7e-05,4.9e-05,2.7e-05,7.9e-05,8.8e-05,7.7e-05,0.00014,6.9e-05,6.1e-05,0.000105,8.6e-05,3e-05,6.5e-05,2.1e-05,5.8e-05,6.4e-05,6.1e-05,9.5e-05,2.7e-05,9.4e-05,6.8e-05,8.6e-05,7.5e-05,7e-06,6.6e-05,6.7e-05,5.6e-05,7e-05,4.5e-05,0.000116,2e-05,3.7e-05,6.2e-05,1.2e-05,2.1e-05,3.2e-05,3.2e-05,3.5e-05,0.000101,0.000106,3.5e-05,6.5e-05,2.9e-05,3.7e-05,6.5e-05,1e-04,0.000102,7.2e-05,0.000125,5.5e-05,0.000103,7.5e-05,9.8e-05
3.6e-05,7.6e-05,5.5e-05,9.1e-05,5.3e-05,3.2e-05,4e-06,3.8e-05,1.4e-05,7.3e-05,5.7e-05,3.7e-05,2.4e-05,6.9e-05,7.6e-05,6.4e-05,5.1e-05,3.7e-05,5.7e-05,7e-05,7.6e-05,0.00012,4.7e-05,0.000148,4.6e-05,8.1e-05,0.000177,7.2e-05,8.7e-05,0.000113,2.1e-05,3.6e-05,2.9e-05,7.4e-05,1.9e-05,8.4e-05,2.8e-05,6.8e-05,3.6e-05,0.00012,3.4e-05,0.000137,7.9e-05,8e-05,0.000117,0.000113,7.6e-05,2.8e-05,6.1e-05,5e-05,3.1e-05,9.5e-05,5.9e-05,2.4e-05,4.9e-05,0.000111,0.000125,3.6e-05,5.2e-05,3e-05,0.000139,0.000121,9.6e-05,5.7e-05,7.3e-05,6.4e-05,8.7e-05,2.9e-05,7.8e-05,9.1e-05,8e-05,0.00011,5.6e-05,3.5e-05,0.000131,5.7e-05,4.9e-05,0.000154,0.000102,2.5e-05,5e-05,1.7e-05,0.000139,0.000121,0.000109,0.00014,8.4e-05,5.7e-05,0.000177,3.3e-05,0.000162,0.000131,7e-05,5.7e-05,5.9e-05,0.000159,0.000131,0.000135,1e-04,0.000104,9.8e-05,5.4e-05,2.5e-05,6.6e-05,8.2e-05,0.000109,0.000141,9.7e-05,2.8e-05,2.5e-05,7.3e-05,1e-04,0.000121,0.00013,5.9e-05,4.9e-05,9.1e-05,8.9e-05,5.6e-05,7.7e-05,5.5e-05
2.8e-05,8.2e-05,5.8e-05,0.000107,0.000148,9.8e-05,3.3e-05,1.2e-05,1.8e-05,3.2e-05,0.000111,0.000136,0.000147,0.000157,0.000107,8.9e-05,1e-04,0.000142,8.3e-05,6.5e-05,0.000156,0.000235,9.3e-05,0.000108,0.000181,4.6e-05,0.000195,0.000255,0.000163,5.2e-05,7.1e-05,5e-05,6.7e-05,0.000102,4e-05,9e-05,0.000157,0.000118,1e-04,0.000204,0.000235,3.5e-05,5.9e-05,0.000142,0.000275,0.00037,0.000267,0.000149,4.7e-05,7.1e-05,9.1e-05,7.6e-05,0.000109,7e-05,0.000114,0.000168,5.2e-05,9e-06,3.7e-05,3.1e-05,0.000142,0.000163,1.3e-05,8.1e-05,7.7e-05,7.3e-05,0.000125,0.000193,0.000147,9.5e-05,5.1e-05,0.000194,0.000156,6.6e-05,6.7e-05,5.9e-05,7.2e-05,0.000126,0.00012,0.000119,3.4e-05,6.5e-05,0.000194,0.000176,9.9e-05,8.8e-05,8.8e-05,4.1e-05,0.000188,0.000202,0.000281,0.000262,0.000163,0.000108,7e-05,0.000137,0.000114,7e-05,4.6e-05,6.8e-05,0.000163,0.000208,0.000122,7.9e-05,1e-05,0.000103,0.000255,0.000118,8.8e-05,0.000132,0.000131,1.7e-05,4.4e-05,4.5e-05,7.4e-05,3e-05,3.4e-05,6e-05,9.6e-05,6.5e-05,6.1e-05
1.3e-05,7.6e-05,8.3e-05,1.4e-05,6.2e-05,2.8e-05,2.7e-05,2.7e-05,7e-05,8.4e-05,8.6e-05,3.7e-05,8.9e-05,3.2e-05,8e-05,7.2e-05,0.000101,0.000116,8.5e-05,0.00012,3.9e-05,0.000123,0.000168,0.000145,7.5e-05,0.000118,8.8e-05,6.5e-05,4e-05,2.1e-05,4.6e-05,1.7e-05,5.1e-05,2.9e-05,5.9e-05,6.9e-05,0.000181,0.000111,0.000202,6.3e-05,9.7e-05,9.3e-05,1.1e-05,5.9e-05,0.000167,0.000118,4.4e-05,7e-05,7.9e-05,9e-06,0.000116,0.000121,7.8e-05,4.8e-05,0.000153,8.1e-05,4.7e-05,5.1e-05,2.3e-05,2e-06,8e-05,5e-05,0.000112,8.6e-05,9.8e-05,0.000151,0.000109,6.9e-05,0.000152,8.7e-05,9e-05,0.000126,4e-05,9.1e-05,4.7e-05,4.2e-05,3.4e-05,0.000169,8e-05,0.000154,9.6e-05,0.000106,5.2e-05,5.5e-05,5.9e-05,0.000145,9.4e-05,2.3e-05,0.000141,0.000167,8e-05,9.2e-05,5.1e-05,4.2e-05,6e-05,0.000125,1.1e-05,1e-05,2.6e-05,6.9e-05,8.3e-05,7.3e-05,4.7e-05,4e-05,4.4e-05,0.000115,6.1e-05,7.8e-05,0.000105,6.6e-05,1.7e-05,5.3e-05,1e-05,1.9e-05,7.1e-05,0.000119,8.6e-05,9.8e-05,0.000157,0.000111,9.9e-05
1.6e-05,6.4e-05,5e-05,3.8e-05,1.2e-05,2.4e-05,1.1e-05,2.8e-05,5.7e-05,4e-05,2.9e-05,4.3e-05,8e-06,2.9e-05,7.3e-05,3.4e-05,4.1e-05,4.2e-05,4.7e-05,4.9e-05,5.3e-05,6.1e-05,7.6e-05,1.3e-05,8.1e-05,3.9e-05,0.000105,1e-04,3.8e-05,3.8e-05,6.1e-05,5.7e-05,3.6e-05,3.9e-05,7e-05,7.3e-05,6.2e-05,2.1e-05,0.000123,7.2e-05,1.5e-05,6e-06,3.5e-05,4.8e-05,7.8e-05,7.7e-05,4.6e-05,4.8e-05,4.3e-05,3.2e-05,9.3e-05,1.1e-05,1.2e-05,3.4e-05,7.8e-05,2e-05,6.4e-05,3e-05,6.4e-05,2.8e-05,2.7e-05,4.6e-05,4e-05,2.5e-05,5.5e-05,9.1e-05,1e-05,5.7e-05,5.6e-05,1.8e-05,6.9e-05,2.4e-05,2.7e-05,4.7e-05,1.9e-05,5.5e-05,9e-05,5.4e-05,7.9e-05,6.8e-05,7.4e-05,2.5e-05,2.6e-05,5.3e-05,2.9e-05,9.2e-05,4.1e-05,2.4e-05,5.4e-05,1.5e-05,0.000121,3.4e-05,6.3e-05,1.9e-05,2.1e-05,6.2e-05,6.3e-05,6.8e-05,5.4e-05,5.7e-05,1.1e-05,4.7e-05,3.9e-05,7.7e-05,0.000116,5e-06,4.2e-05,7.7e-05,4.6e-05,6.3e-05,3.3e-05,3e-05,2.8e-05,4e-05,7.6e-05,6.7e-05,3.7e-05,5.6e-05,4.8e-05,6e-05,3.9e-05
2.8e-05,6.5e-05,9e-06,4.7e-05,4.6e-05,4.1e-05,2.7e-05,2.1e-05,2e-05,6.2e-05,6.7e-05,1.1e-05,4.7e-05,3.2e-05,5.2e-05,2.6e-05,1.6e-05,3.5e-05,2.1e-05,3.6e-05,3.3e-05,3.4e-05,3.7e-05,2.4e-05,4.8e-05,3.1e-05,2.9e-05,4.7e-05,7e-06,2.6e-05,5.6e-05,2e-05,4.2e-05,3.4e-05,5.7e-05,1.6e-05,1e-05,2.6e-05,5.3e-05,1.7e-05,3.7e-05,1.2e-05,1.3e-05,7.9e-05,7.3e-05,5.6e-05,5.2e-05,4.3e-05,1.6e-05,1.4e-05,4.2e-05,5.9e-05,9e-06,3.2e-05,4e-05,7e-06,5.2e-05,5.1e-05,7.7e-05,3.8e-05,3.6e-05,5.2e-05,3.3e-05,4.2e-05,3.1e-05,6.5e-05,3.9e-05,1.1e-05,3e-05,1.9e-05,2.4e-05,2.4e-05,3e-05,1.4e-05,3.2e-05,3.4e-05,5e-05,7.5e-05,3.5e-05,7.6e-05,2e-05,2.4e-05,6.7e-05,4.2e-05,3.6e-05,3.5e-05,4.2e-05,5.6e-05,5.1e-05,3.3e-05,0.000107,4.2e-05,5.5e-05,3.3e-05,2.2e-05,2.6e-05,6.3e-05,4.2e-05,1.3e-05,2.4e-05,4.3e-05,2.5e-05,4.2e-05,6.9e-05,3.7e-05,3e-05,5.8e-05,6.8e-05,6.8e-05,9.2e-05,2.7e-05,4.2e-05,4.2e-05,4.8e-05,6.7e-05,4.3e-05,1.4e-05,6.9e-05,6.6e-05,2.8e-05,5.5e-05
3.2e-05,2.5e-05,1.5e-05,4.2e-05,1.8e-05,3e-06,2e-05,2.7e-05,2.1e-05,1.3e-05,2.4e-05,5.6e-05,3.8e-05,3.2e-05,1.8e-05,1.2e-05,3.6e-05,2.5e-05,4e-05,2.6e-05,2.3e-05,1.9e-05,3.7e-05,4.6e-05,4.3e-05,4.1e-05,1.7e-05,3.1e-05,2.3e-05,2.6e-05,2.9e-05,1.1e-05,3e-05,3e-05,1.3e-05,1.8e-05,4.6e-05,3.3e-05,2.5e-05,1.9e-05,7.8e-05,5.1e-05,3.2e-05,6.8e-05,1.6e-05,6.5e-05,2.4e-05,8.2e-05,6.2e-05,7e-06,1.7e-05,3.7e-05,6.5e-05,3.5e-05,4.6e-05,2.1e-05,2.3e-05,5.6e-05,3e-05,9e-06,2e-05,4.4e-05,4.9e-05,5.9e-05,5.3e-05,6.8e-05,4.9e-05,2.8e-05,2.4e-05,1.8e-05,4.1e-05,3e-05,3e-05,7e-06,2.3e-05,4.3e-05,2.2e-05,6.5e-05,2.7e-05,3.4e-05,5.4e-05,5e-05,3.8e-05,1.1e-05,4.5e-05,5.6e-05,7e-06,2.9e-05,2.2e-05,5e-05,4.4e-05,3.9e-05,3.8e-05,1.5e-05,3.3e-05,4.6e-05,5.8e-05,3.3e-05,1.8e-05,4e-05,3.7e-05,2.1e-05,2.7e-05,1.4e-05,2.6e-05,1.3e-05,6.6e-05,1.4e-05,7.6e-05,7e-06,3.9e-05,5.4e-05,6.2e-05,4.2e-05,2.3e-05,2.6e-05,2.3e-05,9e-05,5.6e-05,1.6e-05,2.8e-05
6e-06,7e-06,9e-06,7e-06,5e-06,5e-06,5e-06,6e-06,1.3e-05,4e-06,1e-05,7e-06,1.1e-05,1.2e-05,1e-05,1e-05,1.3e-05,1.2e-05,1.5e-05,7e-06,5e-06,1.6e-05,1.2e-05,1.6e-05,1e-05,8e-06,7e-06,7e-06,7e-06,8e-06,2.4e-05,2e-06,5e-06,1.5e-05,6e-06,1e-05,1.5e-05,2e-06,2e-05,1.4e-05,1.7e-05,1.6e-05,2e-06,2.7e-05,1.1e-05,1.4e-05,7e-06,1.6e-05,6e-06,1.5e-05,1.2e-05,1.3e-05,6e-06,1.3e-05,1.1e-05,1e-05,1.2e-05,1.5e-05,1.2e-05,1.1e-05,6e-06,5e-06,1.2e-05,6e-06,1.2e-05,5e-06,2e-06,6e-06,1.4e-05,1.4e-05,7e-06,1.6e-05,2e-05,2.2e-05,1.9e-05,1.4e-05,1.1e-05,1.7e-05,1.4e-05,7e-06,9e-06,1.2e-05,2.2e-05,1.7e-05,1.9e-05,6e-06,1.1e-05,1.8e-05,1.1e-05,1.9e-05,9e-06,2.1e-05,1.1e-05,5e-06,7e-06,1.4e-05,1.5e-05,1.5e-05,1.4e-05,2.2e-05,2.1e-05,1.2e-05,6e-06,8e-06,2e-05,1.3e-05,8e-06,6e-06,1.8e-05,2.3e-05,1.3e-05,1.2e-05,7e-06,1.5e-05,9e-06,2.4e-05,1.7e-05,3e-05,1.8e-05,1.7e-05,6e-06
4e-06,6e-06,2e-06,1.1e-05,4e-06,6e-06,6e-06,1e-05,1.3e-05,1e-05,9e-06,2e-06,6e-06,1.3e-05,1e-05,8e-06,8e-06,6e-06,1e-05,1.1e-05,1.7e-05,1.6e-05,8e-06,1.4e-05,1.6e-05,5e-06,4e-06,2e-05,6e-06,1e-06,1.3e-05,1.1e-05,6e-06,1.1e-05,9e-06,1.4e-05,8e-06,1.2e-05,8e-06,5e-06,7e-06,9e-06,4e-06,2e-05,1.4e-05,1.7e-05,1.7e-05,1.4e-05,4e-06,8e-06,6e-06,8e-06,1.1e-05,1.7e-05,1.2e-05,7e-06,8e-06,1.8e-05,1e-05,5e-06,7e-06,6e-06,8e-06,1.2e-05,4e-06,5e-06,1.2e-05,1e-05,7e-06,8e-06,1.9e-05,1.4e-05,6e-06,7e-06,2e-06,2.2e-05,5e-06,1.4e-05,6e-06,1.2e-05,1.1e-05,1.4e-05,4e-06,7e-06,2e-06,1.3e-05,1.4e-05,1e-06,1.1e-05,1.8e-05,6e-06,7e-06,1e-05,8e-06,1e-05,1.6e-05,9e-06,1.5e-05,5e-06,9e-06,1e-05,3e-06,1.6e-05,1.2e-05,2.6e-05,1.5e-05,4e-06,1.1e-05,2.1e-05,8e-06,1e-05,9e-06,2e-06,1.6e-05,7e-06,5e-06,1.4e-05,3.8e-05,3.7e-05,6e-06,9e-06
8e-06,1.3e-05,6e-06,9e-06,3e-06,3e-06,1.5e-05,1.4e-05,8e-06,3e-06,9e-06,7e-06,4e-06,1.4e-05,8e-06,1.2e-05,1e-05,1.7e-05,2e-05,6e-06,1.2e-05,2.8e-05,1.8e-05,7e-06,1.1e-05,1.7e-05,5e-06,2e-05,9e-06,1.1e-05,2e-05,1.8e-05,3e-06,2.1e-05,1.7e-05,1.5e-05,1e-05,1.8e-05,3.1e-05,1.5e-05,5e-06,3e-06,1e-05,1.8e-05,1.4e-05,2.9e-05,1.5e-05,2.1e-05,1.3e-05,4e-06,1.3e-05,1.2e-05,1.7e-05,1.9e-05,7e-06,1.1e-05,1.7e-05,1e-05,2.3e-05,8e-06,6e-06,7e-06,6e-06,1.2e-05,9e-06,1.1e-05,1.4e-05,1.1e-05,1.3e-05,3e-06,2.8e-05,8e-06,5e-06,9e-06,8e-06,3.1e-05,1.9e-05,9e-06,6e-06,7e-06,1.9e-05,4e-06,3e-06,4e-06,2e-06,1.4e-05,6e-06,1.3e-05,1.6e-05,8e-06,1e-06,1.1e-05,1e-05,1.3e-05,1.4e-05,6e-06,7e-06,2e-05,8e-06,7e-06,2e-05,1.1e-05,1.6e-05,1.1e-05,2.1e-05,1.5e-05,1.5e-05,1.5e-05,1.8e-05,1.4e-05,6e-06,1.4e-05,7e-06,1.2e-05,9e-06,1.2e-05,7e-06,3.4e-05,1.8e-05,9e-06,1.2e-05
1e-05,1.5e-05,9e-06,5e-06,2e-06,9e-06,1.7e-05,1.5e-05,6e-06,1.2e-05,2.2e-05,1.7e-05,1.7e-05,1.5e-05,1.7e-05,4e-06,4e-06,1e-05,1.7e-05,1.9e-05,1.6e-05,2.8e-05,5.4e-05,2.6e-05,2.8e-05,3.3e-05,2.5e-05,3.8e-05,3.3e-05,1.9e-05,3.3e-05,5e-06,1.1e-05,2.6e-05,9e-06,3.1e-05,3e-06,1e-05,2.3e-05,1.8e-05,2.3e-05,4e-06,1.3e-05,1.4e-05,2.9e-05,2.8e-05,2e-06,1.2e-05,1.6e-05,2e-05,2.5e-05,2e-05,2.1e-05,1.3e-05,1.6e-05,1.6e-05,2.4e-05,3.3e-05,1.7e-05,2.3e-05,1.2e-05,1.7e-05,1.6e-05,9e-06,2.9e-05,2e-05,3e-05,3.9e-05,2.9e-05,1.7e-05,3.4e-05,1.6e-05,5e-06,1e-05,2.3e-05,3.9e-05,6e-06,1.6e-05,2e-06,1.5e-05,1.2e-05,3e-06,1.6e-05,2e-05,1.2e-05,2e-05,1.7e-05,3.6e-05,1.4e-05,2.3e-05,6e-06,2.3e-05,2.3e-05,4e-06,3.2e-05,3.5e-05,1.5e-05,2.5e-05,1e-05,1.2e-05,2.7e-05,8e-06,5e-06,1.9e-05,2.5e-05,4.3e-05,5e-06,2.8e-05,1.1e-05,3e-06,1.9e-05,6e-06,2.7e-05,2.3e-05,1.8e-05,3.1e-05,7e-06,2e-05,2.7e-05,2.8e-05,3e-06
1.8e-05,2.7e-05,2.4e-05,1.4e-05,1.4e-05,1.3e-05,2.5e-05,3e-05,2.9e-05,1.9e-05,1.3e-05,1.2e-05,2.3e-05,9e-06,2.4e-05,2e-05,1.2e-05,6e-06,1.9e-05,3.9e-05,2.2e-05,3.4e-05,4.8e-05,3.8e-05,1.3e-05,2e-05,2.5e-05,2.5e-05,2e-05,9e-06,2.5e-05,3.9e-05,2.7e-05,4.5e-05,3.1e-05,3.3e-05,2.8e-05,1.9e-05,2.1e-05,1e-05,1.8e-05,2.4e-05,9e-06,1e-05,4e-05,2.1e-05,2e-05,1.8e-05,1.2e-05,1.1e-05,2.9e-05,1e-05,1e-05,2.6e-05,3e-05,4.1e-05,3.9e-05,1.8e-05,3.7e-05,4.1e-05,2.1e-05,1.2e-05,2.5e-05,2e-05,3.3e-05,1.8e-05,1e-05,4.4e-05,3.6e-05,2.5e-05,1.6e-05,2.2e-05,2.1e-05,1.6e-05,2.4e-05,2.8e-05,2.8e-05,3.6e-05,2.4e-05,3.8e-05,1.5e-05,1.7e-05,1.5e-05,1.5e-05,1.1e-05,1.7e-05,7e-06,2.9e-05,1.7e-05,3.7e-05,5.5e-05,1.2e-05,1.2e-05,1.5e-05,3.1e-05,9e-06,6e-06,2.4e-05,3.4e-05,9e-06,3.4e-05,4.6e-05,2.8e-05,1.7e-05,7e-06,3.3e-05,4.2e-05,4.2e-05,2.2e-05,5e-06,1.8e-05,2.8e-05,4.7e-05,3.3e-05,3.9e-05,3.2e-05,4.8e-05,3.1e-05,1.6e-05,3.4e-05,3e-05
8e-06,1.9e-05,1.9e-05,1e-05,1.3e-05,4e-06,2.2e-05,1.4e-05,7e-06,7e-06,1e-05,1e-05,1.8e-05,1.6e-05,2.5e-05,1.8e-05,2e-06,1.7e-05,2.5e-05,1.4e-05,4e-06,1.6e-05,1e-05,1.6e-05,1e-05,7e-06,1.8e-05,3.5e-05,2e-05,7e-06,1.3e-05,2.6e-05,1.2e-05,2.9e-05,1.5e-05,1.9e-05,1.9e-05,1e-05,1.4e-05,4e-06,2.3e-05,3.1e-05,2.1e-05,2.1e-05,4.7e-05,3.3e-05,2.7e-05,2.6e-05,1.6e-05,1.7e-05,4.3e-05,3e-05,1.6e-05,2.3e-05,4.1e-05,3.5e-05,1.8e-05,2e-06,2.4e-05,1.7e-05,1.2e-05,1.6e-05,2.7e-05,1e-06,4.3e-05,2.5e-05,2.1e-05,2.9e-05,1.9e-05,3.6e-05,3.2e-05,2.9e-05,1.3e-05,7e-06,1.4e-05,2.1e-05,2.7e-05,2.8e-05,1.8e-05,2.4e-05,1.6e-05,1.8e-05,2.3e-05,1.7e-05,1.6e-05,8e-06,2e-05,1.7e-05,1.5e-05,4.8e-05,5.6e-05,5.1e-05,2.8e-05,1.2e-05,3.4e-05,1.9e-05,1e-05,2.1e-05,3.9e-05,4.7e-05,4.2e-05,1.4e-05,1.7e-05,1.9e-05,2.4e-05,2e-05,1e-05,1.2e-05,1.2e-05,2.1e-05,3.6e-05,2.3e-05,1.4e-05,1.2e-05,1.9e-05,1.3e-05,2.3e-05,2.7e-05,1.7e-05,1.5e-05,1.5e-05
7e-06,8e-06,2e-06,5e-06,3e-06,5e-06,1e-05,2e-06,1.1e-05,2e-06,3e-06,2e-06,1.7e-05,1e-05,1e-06,9e-06,7e-06,2e-05,5e-06,7e-06,1.2e-05,2e-05,1.9e-05,1.3e-05,7e-06,8e-06,1.3e-05,6e-06,1.4e-05,9e-06,8e-06,2.3e-05,1.9e-05,1.4e-05,6e-06,1.6e-05,1.2e-05,4e-06,1.7e-05,9e-06,2e-05,1.4e-05,1e-05,5e-06,2.3e-05,1.3e-05,2.5e-05,1e-05,7e-06,2.2e-05,9e-06,9e-06,7e-06,8e-06,2.6e-05,8e-06,1.4e-05,1.2e-05,5e-06,1.5e-05,6e-06,1.5e-05,1.5e-05,2.7e-05,2.7e-05,1.4e-05,1.4e-05,1.5e-05,1.6e-05,1.3e-05,9e-06,1.5e-05,1.4e-05,1.4e-05,9e-06,2.2e-05,5e-06,1.9e-05,1.6e-05,1.1e-05,1.3e-05,5e-06,6e-06,8e-06,9e-06,1.2e-05,7e-06,1.3e-05,8e-06,1.9e-05,2.4e-05,2.1e-05,5e-06,1.3e-05,1.6e-05,1e-05,4e-06,1.2e-05,1.6e-05,6e-06,1.2e-05,1.2e-05,2e-05,7e-06,2e-05,4e-06,1.7e-05,9e-06,1.5e-05,1.6e-05,2e-05,1.8e-05,9e-06,6e-06,9e-06,1.7e-05,2e-05,2.3e-05,1.6e-05,1.3e-05,2e-06
3e-06,5e-06,9e-06,8e-06,2e-06,5e-06,4e-06,4e-06,4e-06,6e-06,6e-06,1e-06,1e-05,2e-06,1.2e-05,1.2e-05,1.1e-05,7e-06,6e-06,1.7e-05,1.8e-05,8e-06,2e-06,8e-06,6e-06,1.4e-05,5e-06,8e-06,7e-06,7e-06,1.2e-05,1.7e-05,1e-05,2e-06,5e-06,1.2e-05,1.2e-05,2e-06,6e-06,1e-05,2e-06,1.1e-05,3e-06,6e-06,7e-06,1.6e-05,1e-05,8e-06,1.5e-05,1.2e-05,7e-06,3e-06,8e-06,1.2e-05,1.1e-05,5e-06,8e-06,1e-05,8e-06,8e-06,8e-06,1.6e-05,1.3e-05,2.1e-05,1.6e-05,5e-06,1e-05,1.2e-05,4e-06,1.7e-05,1e-06,1.6e-05,3e-06,1.1e-05,8e-06,1.4e-05,1e-05,4e-06,1.3e-05,1e-05,4e-06,2e-06,8e-06,3e-06,1e-05,4e-06,7e-06,1.1e-05,6e-06,1.3e-05,1.3e-05,1e-05,8e-06,1.1e-05,8e-06,6e-06,5e-06,7e-06,7e-06,1.2e-05,4e-06,1e-05,8e-06,1e-05,1.1e-05,2e-06,1.8e-05,4e-06,8e-06,2.3e-05,1.4e-05,1e-05,1.1e-05,3e-06,7e-06,3e-06,3e-06,2.4e-05,1.4e-05,1e-05,2e-06
2e-06,1e-06,4e-06,4e-06,5e-06,1e-06,3e-06,2e-06,3e-06,5e-06,7e-06,8e-06,1.3e-05,1.3e-05,1.2e-05,2e-06,3e-06,1.1e-05,1.4e-05,1.2e-05,7e-06,5e-06,3e-06,1e-05,6e-06,1e-05,1e-06,1e-05,6e-06,9e-06,4e-06,3e-06,3e-06,1.3e-05,1.2e-05,1.1e-05,1.1e-05,7e-06,4e-06,3e-06,3e-06,1.4e-05,4e-06,5e-06,9e-06,2.4e-05,1.5e-05,1.2e-05,4e-06,2.2e-05,3e-06,8e-06,5e-06,6e-06,9e-06,1e-05,4e-06,1.5e-05,5e-06,1.1e-05,7e-06,1.4e-05,1.2e-05,1.6e-05,1.6e-05,1.4e-05,1.2e-05,8e-06,2e-06,1.1e-05,7e-06,1.4e-05,7e-06,1e-05,6e-06,7e-06,7e-06,1.5e-05,1.3e-05,9e-06,8e-06,7e-06,5e-06,6e-06,1e-06,4e-06,9e-06,9e-06,6e-06,1e-05,1.3e-05,4e-06,5e-06,3e-06,7e-06,1e-06,9e-06,1.6e-05,1.6e-05,1.2e-05,9e-06,1e-05,1.3e-05,1.3e-05,2e-06,9e-06,1.1e-05,2e-06,5e-06,1.7e-05,1.2e-05,1.6e-05,1.1e-05,1.1e-05,1.1e-05,1e-05,4e-06,2.2e-05,1e-05,1.3e-05,8e-06
6e-06,6e-06,3e-06,1e-05,1e-05,2e-06,6e-06,3e-06,2e-06,6e-06,2e-06,5e-06,7e-06,2e-06,2e-06,7e-06,3e-06,1.1e-05,2.4e-05,1.2e-05,2e-06,5e-06,2e-06,6e-06,1.6e-05,1.4e-05,1.1e-05,5e-06,4e-06,1.3e-05,1.6e-05,3e-06,9e-06,2.1e-05,9e-06,1.3e-05,1.1e-05,6e-06,1.2e-05,2e-06,8e-06,1.3e-05,1e-06,5e-06,6e-06,1.3e-05,7e-06,1e-05,2e-05,2.2e-05,1.6e-05,9e-06,1.3e-05,7e-06,3e-06,1.1e-05,1.3e-05,4e-06,8e-06,1.1e-05,6e-06,1.2e-05,4e-06,1.3e-05,5e-06,2e-06,1.9e-05,2e-05,2e-06,8e-06,7e-06,7e-06,4e-06,1.1e-05,5e-06,1.6e-05,4e-06,1.9e-05,1.2e-05,1.4e-05,1.5e-05,1.1e-05,2e-06,6e-06,8e-06,5e-06,7e-06,5e-06,9e-06,9e-06,9e-06,3e-06,4e-06,4e-06,1.4e-05,1.1e-05,4e-06,1e-05,2e-06,1.4e-05,9e-06,4e-06,1.5e-05,4e-06,1.3e-05,9e-06,1.2e-05,3e-06,1.3e-05,4e-06,8e-06,1.9e-05,1.8e-05,6e-06,1e-05,2e-06,2e-06,2.7e-05,2e-05,5e-06,9e-06
8e-06,4e-06,7e-06,7e-06,7e-06,9e-06,6e-06,3e-06,4e-06,2e-06,2e-06,7e-06,1e-06,1e-05,8e-06,1.2e-05,7e-06,7e-06,1.4e-05,2e-06,1.1e-05,2e-06,6e-06,9e-06,1.3e-05,9e-06,3e-06,7e-06,7e-06,9e-06,9e-06,1.6e-05,2e-06,1.4e-05,1.6e-05,1.9e-05,6e-06,9e-06,6e-06,1.1e-05,1.2e-05,1.6e-05,1.1e-05,5e-06,5e-06,6e-06,6e-06,4e-06,1.6e-05,8e-06,6e-06,6e-06,1.7e-05,9e-06,8e-06,5e-06,6e-06,9e-06,7e-06,4e-06,6e-06,4e-06,9e-06,6e-06,3e-06,8e-06,1.2e-05,3e-06,9e-06,1.3e-05,5e-06,1.2e-05,3e-06,1.1e-05,8e-06,1.2e-05,1.4e-05,9e-06,8e-06,9e-06,1.7e-05,7e-06,3e-06,1.2e-05,8e-06,7e-06,6e-06,2e-06,1.3e-05,1.5e-05,1.3e-05,5e-06,9e-06,4e-06,1e-05,4e-06,3e-06,6e-06,3e-06,2e-06,7e-06,4e-06,1e-05,7e-06,8e-06,9e-06,5e-06,7e-06,1.1e-05,1.9e-05,7e-06,9e-06,1.3e-05,7e-06,1.1e-05,6e-06,1e-06,2.8e-05,3e-06,5e-06,5e-06
3e-06,2e-06,4e-06,0,8e-06,1e-05,7e-06,3e-06,5e-06,6e-06,3e-06,8e-06,6e-06,1.1e-05,2e-06,5e-06,2e-06,4e-06,1.2e-05,8e-06,1.3e-05,1.2e-05,1.6e-05,9e-06,2e-06,9e-06,1.1e-05,1.3e-05,7e-06,5e-06,8e-06,9e-06,9e-06,3e-06,7e-06,2e-06,8e-06,5e-06,1e-05,7e-06,4e-06,8e-06,8e-06,7e-06,1.1e-05,1.8e-05,1.1e-05,4e-06,9e-06,9e-06,1e-06,6e-06,1.1e-05,8e-06,3e-06,5e-06,4e-06,2e-06,1e-06,7e-06,2e-06,0,4e-06,8e-06,1e-06,8e-06,8e-06,6e-06,6e-06,6e-06,0,1e-05,5e-06,6e-06,3e-06,8e-06,6e-06,5e-06,8e-06,5e-06,8e-06,1e-06,5e-06,1e-05,2e-06,4e-06,6e-06,3e-06,1.3e-05,9e-06,7e-06,2e-06,5e-06,4e-06,3e-06,5e-06,4e-06,4e-06,4e-06,2e-06,6e-06,5e-06,8e-06,6e-06,5e-06,4e-06,1.2e-05,8e-06,2e-06,1e-05,3e-06,1.2e-05,5e-06,2e-06,5e-06,4e-06,4e-06,1.6e-05,9e-06,6e-06,2e-06
2e-06,5e-06,3e-06,4e-06,4e-06,2e-06,3e-06,4e-06,4e-06,3e-06,3e-06,7e-06,2e-06,5e-06,1e-06,2e-06,4e-06,8e-06,7e-06,1.2e-05,5e-06,3e-06,1e-05,3e-06,4e-06,1.2e-05,4e-06,7e-06,6e-06,5e-06,9e-06,9e-06,6e-06,2e-06,5e-06,9e-06,8e-06,3e-06,2e-06,4e-06,4e-06,5e-06,3e-06,2e-06,1e-05,9e-06,1.3e-05,1.1e-05,1e-05,6e-06,4e-06,4e-06,8e-06,3e-06,4e-06,1.1e-05,6e-06,4e-06,7e-06,7e-06,7e-06,2e-06,4e-06,8e-06,1e-06,1e-05,2e-06,7e-06,3e-06,6e-06,2e-06,5e-06,6e-06,6e-06,2e-06,4e-06,1.1e-05,2e-06,9e-06,2e-06,6e-06,1e-06,5e-06,8e-06,3e-06,4e-06,3e-06,6e-06,1.1e-05,1.2e-05,7e-06,4e-06,6e-06,8e-06,2e-06,3e-06,7e-06,2e-06,5e-06,0,7e-06,5e-06,6e-06,5e-06,5e-06,2e-06,7e-06,7e-06,5e-06,5e-06,9e-06,1.4e-05,9e-06,6e-06,2e-06,9e-06,4e-06,1.3e-05,1.1e-05,5e-06,3e-06
1e-06,3e-06,5e-06,4e-06,1e-06,2e-06,4e-06,3e-06,3e-06,3e-06,4e-06,2e-06,7e-06,6e-06,5e-06,1e-06,4e-06,1.1e-05,1.1e-05,8e-06,2e-06,3e-06,7e-06,4e-06,6e-06,3e-06,2e-06,6e-06,4e-06,4e-06,7e-06,5e-06,5e-06,2e-06,2e-06,5e-06,2e-06,3e-06,5e-06,5e-06,6e-06,3e-06,3e-06,7e-06,3e-06,1.6e-05,1.1e-05,1e-05,7e-06,6e-06,7e-06,6e-06,9e-06,8e-06,1e-06,1e-05,4e-06,8e-06,2e-06,5e-06,6e-06,3e-06,7e-06,1.7e-05,1e-05,1.3e-05,9e-06,6e-06,8e-06,4e-06,6e-06,1.8e-05,5e-06,8e-06,6e-06,1e-06,3e-06,7e-06,1.2e-05,5e-06,5e-06,9e-06,7e-06,8e-06,7e-06,4e-06,4e-06,5e-06,8e-06,5e-06,7e-06,2e-06,8e-06,4e-06,7e-06,7e-06,7e-06,4e-06,1e-06,4e-06,5e-06,7e-06,8e-06,7e-06,1e-06,8e-06,8e-06,7e-06,8e-06,1.2e-05,6e-06,8e-06,8e-06,4e-06,5e-06,1.1e-05,1.9e-05,2e-05,1.5e-05,7e-06,2e-06
3e-06,3e-06,6e-06,4e-06,2e-06,3e-06,3e-06,2e-06,6e-06,2e-06,4e-06,1e-06,3e-06,3e-06,8e-06,6e-06,2e-06,7e-06,1.3e-05,3e-06,1.4e-05,1.1e-05,7e-06,6e-06,5e-06,3e-06,6e-06,8e-06,6e-06,8e-06,3e-06,1.5e-05,1.2e-05,7e-06,2e-06,1e-06,4e-06,5e-06,8e-06,5e-06,2e-06,6e-06,7e-06,6e-06,9e-06,2e-05,1.6e-05,2.4e-05,1.5e-05,1.1e-05,7e-06,1e-06,1.1e-05,1.1e-05,9e-06,7e-06,5e-06,1e-05,1e-05,1.5e-05,5e-06,6e-06,1.1e-05,5e-06,5e-06,8e-06,8e-06,1e-05,1.4e-05,1.7e-05,9e-06,1.7e-05,1.7e-05,5e-06,5e-06,1e-05,8e-06,5e-06,9e-06,7e-06,9e-06,1.9e-05,2.2e-05,8e-06,8e-06,6e-06,7e-06,8e-06,1.2e-05,1e-05,1.4e-05,8e-06,4e-06,4e-06,5e-06,7e-06,4e-06,5e-06,4e-06,2e-06,5e-06,1.1e-05,1.1e-05,4e-06,1e-05,1e-05,2.3e-05,1.5e-05,1.3e-05,9e-06,4e-06,1.7e-05,6e-06,1.1e-05,3e-06,8e-06,1e-05,9e-06,1.7e-05,1.2e-05,7e-06
1e-06,3e-06,5e-06,2e-06,1e-06,2e-06,1e-06,3e-06,9e-06,1e-05,6e-06,7e-06,4e-06,6e-06,6e-06,5e-06,4e-06,8e-06,1.3e-05,7e-06,7e-06,3e-06,3e-06,6e-06,5e-06,8e-06,5e-06,1.1e-05,1.3e-05,1.2e-05,1.2e-05,1.8e-05,8e-06,4e-06,4e-06,2e-06,7e-06,1e-06,4e-06,2e-06,3e-06,5e-06,8e-06,1.1e-05,2e-05,7e-06,5e-06,1.2e-05,2e-06,3e-06,2e-06,3e-06,1e-05,5e-06,6e-06,1e-05,1e-05,8e-06,2e-06,9e-06,1.3e-05,8e-06,3e-06,2e-06,9e-06,6e-06,7e-06,7e-06,7e-06,1.3e-05,3e-06,1.1e-05,1e-05,8e-06,2e-06,7e-06,4e-06,8e-06,9e-06,5e-06,6e-06,8e-06,7e-06,1.2e-05,8e-06,0,6e-06,8e-06,5e-06,6e-06,1.6e-05,5e-06,7e-06,7e-06,7e-06,1.4e-05,1e-05,1.1e-05,1.4e-05,8e-06,2e-06,3e-06,4e-06,5e-06,9e-06,7e-06,8e-06,5e-06,1e-06,9e-06,4e-06,8e-06,7e-06,1.1e-05,8e-06,4e-06,4e-06,7e-06,1.2e-05,6e-06,7e-06
1e-06,4e-06,1e-06,5e-06,1e-06,2e-06,5e-06,3e-06,6e-06,5e-06,3e-06,5e-06,2e-06,9e-06,3e-06,2e-06,4e-06,1e-06,6e-06,6e-06,6e-06,1e-06,4e-06,4e-06,6e-06,4e-06,4e-06,5e-06,6e-06,4e-06,5e-06,1e-06,7e-06,4e-06,0,5e-06,3e-06,2e-06,3e-06,3e-06,4e-06,6e-06,6e-06,6e-06,5e-06,7e-06,4e-06,2e-06,5e-06,6e-06,0,2e-06,5e-06,4e-06,1e-06,3e-06,4e-06,3e-06,5e-06,2e-06,3e-06,2e-06,0,6e-06,4e-06,3e-06,5e-06,2e-06,3e-06,9e-06,2e-06,4e-06,1e-06,1e-06,4e-06,5e-06,3e-06,6e-06,7e-06,4e-06,6e-06,4e-06,3e-06,4e-06,3e-06,4e-06,8e-06,4e-06,6e-06,1e-06,5e-06,1e-06,5e-06,2e-06,2e-06,7e-06,3e-06,3e-06,7e-06,1e-06,3e-06,4e-06,1e-06,4e-06,7e-06,7e-06,5e-06,4e-06,3e-06,9e-06,2e-06,8e-06,7e-06,3e-06,1e-06,4e-06,1e-06,1.2e-05,8e-06,5e-06,2e-06
1e-06,4e-06,3e-06,4e-06,0,2e-06,2e-06,2e-06,4e-06,6e-06,2e-06,4e-06,3e-06,7e-06,2e-06,3e-06,1e-06,1e-06,7e-06,5e-06,3e-06,2e-06,3e-06,3e-06,3e-06,1e-06,1e-06,3e-06,5e-06,4e-06,2e-06,3e-06,2e-06,1e-06,1e-06,6e-06,3e-06,1e-06,1e-06,1e-06,2e-06,3e-06,4e-06,5e-06,4e-06,1.1e-05,2e-06,1e-06,2e-06,5e-06,0,1e-06,3e-06,3e-06,2e-06,2e-06,1e-06,1e-06,3e-06,1e-06,4e-06,2e-06,2e-06,6e-06,0,4e-06,4e-06,2e-06,4e-06,7e-06,2e-06,4e-06,2e-06,1e-06,1e-06,3e-06,4e-06,5e-06,7e-06,1e-06,6e-06,3e-06,2e-06,3e-06,2e-06,1e-06,4e-06,4e-06,7e-06,5e-06,6e-06,1e-06,3e-06,0,2e-06,5e-06,3e-06,1e-06,7e-06,1e-06,1e-06,3e-06,4e-06,3e-06,6e-06,5e-06,4e-06,3e-06,2e-06,7e-06,5e-06,7e-06,5e-06,1e-06,2e-06,3e-06,1e-06,1.1e-05,9e-06,1e-06,2e-06
1e-06,3e-06,2e-06,4e-06,0,1e-06,2e-06,2e-06,3e-06,5e-06,1e-06,3e-06,3e-06,8e-06,1e-06,2e-06,1e-06,2e-06,7e-06,4e-06,3e-06,1e-06,3e-06,4e-06,3e-06,3e-06,0,1e-06,3e-06,1e-06,3e-06,4e-06,3e-06,1e-06,1e-06,4e-06,3e-06,1e-06,2e-06,1e-06,2e-06,4e-06,2e-06,5e-06,2e-06,1e-05,1e-06,1e-06,2e-06,5e-06,1e-06,1e-06,1e-06,2e-06,2e-06,1e-06,0,1e-06,2e-06,2e-06,3e-06,2e-06,1e-06,7e-06,1e-06,3e-06,3e-06,3e-06,3e-06,8e-06,1e-06,4e-06,1e-06,1e-06,0,5e-06,4e-06,4e-06,6e-06,2e-06,5e-06,0,3e-06,1e-06,1e-06,1e-06,5e-06,2e-06,5e-06,4e-06,8e-06,1e-06,2e-06,1e-06,1e-06,4e-06,2e-06,2e-06,6e-06,1e-06,1e-06,2e-06,5e-06,4e-06,5e-06,5e-06,4e-06,2e-06,2e-06,7e-06,4e-06,6e-06,5e-06,1e-06,1e-06,4e-06,0,1.1e-05,1e-05,3e-06,1e-06
1e-06,3e-06,2e-06,3e-06,0,1e-06,2e-06,2e-06,2e-06,4e-06,1e-06,2e-06,3e-06,7e-06,1e-06,2e-06,1e-06,2e-06,7e-06,4e-06,3e-06,1e-06,1e-06,3e-06,2e-06,2e-06,0,1e-06,4e-06,2e-06,2e-06,4e-06,3e-06,1e-06,0,4e-06,2e-06,1e-06,2e-06,0,2e-06,4e-06,2e-06,5e-06,3e-06,1.1e-05,1e-06,1e-06,3e-06,5e-06,1e-06,1e-06,0,2e-06,3e-06,2e-06,1e-06,1e-06,1e-06,2e-06,2e-06,1e-06,1e-06,6e-06,2e-06,3e-06,2e-06,2e-06,3e-06,7e-06,1e-06,4e-06,1e-06,1e-06,1e-06,5e-06,4e-06,5e-06,8e-06,2e-06,4e-06,0,3e-06,2e-06,0,0,4e-06,3e-06,4e-06,4e-06,7e-06,1e-06,2e-06,0,1e-06,4e-06,2e-06,1e-06,5e-06,1e-06,0,3e-06,4e-06,3e-06,6e-06,4e-06,3e-06,3e-06,2e-06,7e-06,3e-06,6e-06,4e-06,1e-06,0,3e-06,0,1.2e-05,8e-06,2e-06,1e-06
