-0.000638,-0.000694,-5.6e-05,-0.000206,-0.000118,-0.000344,-0.000314,-0.000582,-0.000505,-0.000387,-0.000299,1.1e-05,-0.000202,-0.000226,-0.00041,-0.000188,-0.00016,-0.00017,-1.7e-05,-0.00041,4.7e-05,0.000121,6.3e-05,0.00014,-1.1e-05,-0.000261,0.000341,7.4e-05,-0.000193,0.000135,0.000217,0.000115,-0.000807,-0.00111,-0.000813,-0.000809,-0.002218,-0.003379,-0.00345,-0.00466,-0.003404,-0.00355,-0.003796,-0.004024,-0.003424,-0.003697,-0.003351,-0.002002,-0.001712,-0.001613,-0.002546,-0.004343,-0.004114,-0.005149,-0.004761,-0.005796,-0.004419,-0.002974,-0.003298,-0.005873,-0.004421,-0.004697,-0.00595,-0.006419,-0.005465,-0.005045,-0.004183,-0.002383,-0.002604,-0.002719,-0.002189,-0.004128,-0.003029,-0.003089,-0.003195,-0.001907,-0.00423,-0.002573,-0.002928,-0.002091,-0.0018,-0.001525,-0.001026,-0.001003,-0.002116,-0.002061,-0.001222,-0.001469,-0.001478,-0.001715,-0.00178,-0.001291,-0.000889,-0.000783,-0.00086,-0.000672,-0.000902,-0.002431,-0.002625,-0.002898,-0.004183,-0.002741,-0.003853,-0.002968,-0.003961,-0.002528,-0.002232,-0.00225,-0.001266,-0.001239,-0.000496,-0.00163,-0.00149,-0.00033,-0.000669,-0.001022,-0.000798,-0.000826,-0.000251,0.000192,-3.2e-05
0.00019,0.000181,-0.000177,-0.000387,-0.000199,-7e-05,-0.000291,-0.000148,-0.000298,-0.000329,-0.000141,3.9e-05,8.5e-05,-0.000266,5.6e-05,0.000157,-0.000117,-0.000461,-0.000339,2.8e-05,-0.000323,-0.000468,-0.000384,-0.000553,0.000109,1e-06,-0.000473,-0.000811,-0.000217,-0.000323,-0.000492,-8.7e-05,0.000233,0.000241,-0.000398,-0.000494,-5.8e-05,0.001148,0.00038,0.001805,0.001346,0.001824,0.001455,0.001281,0.001818,0.000983,0.001174,-0.00029,0.000289,0.000365,0.000988,0.001292,0.001702,0.001695,0.001757,0.002398,0.002004,0.001316,0.000348,0.002115,0.002113,0.001666,0.002459,0.003886,0.003182,0.003006,0.002522,0.001099,0.001342,0.001556,0.001242,0.002079,0.001368,0.001615,0.00273,0.001455,0.002121,0.002158,0.00157,0.000841,-0.000249,0.000209,0.000186,0.000431,0.001115,0.00097,0.00114,0.000117,0.000212,7e-06,4e-06,-0.000803,-0.000338,0.000286,-0.000268,-0.000259,-0.001218,-0.000952,0.000348,-0.00148,0.000783,0.000798,-0.000438,-0.000343,-0.000189,0.000182,-0.0014,-0.001697,-0.001677,-0.001514,-0.001437,-0.00073,-0.000892,-0.001266,-0.000515,-0.000216,-0.00058,-5.3e-05,-4e-05,-0.00049,-0.000347
-0.000151,-1.7e-05,2e-05,8.5e-05,-0.000272,1e-06,6e-05,0.000321,0.000198,0.00032,0.000171,0.000244,-0.000154,-0.000129,0.000275,-1.9e-05,-4e-06,9.6e-05,1.7e-05,-2.7e-05,0.000118,5.2e-05,-5.9e-05,0.00013,-0.000176,-8e-06,-0.000147,-0.000418,-0.000361,-0.000259,-0.000283,-0.000158,8.8e-05,0.000487,0.000341,0.000401,0.000682,-0.000278,0.000518,0.000199,0.000256,0.000231,-0.00104,0.00026,-0.00142,0.000569,-0.000249,0.00083,-0.000331,-0.000328,-0.000311,-0.000431,-0.000178,0.000169,-0.000755,-0.000424,-0.000585,-0.000433,0.000411,-0.00017,-6.2e-05,-0.000107,-0.000171,-0.001731,-0.001318,-0.001649,-0.001468,-0.00076,-0.001172,-0.001172,5.5e-05,-0.001344,-0.001122,-0.001108,-0.001872,-0.001061,-0.001663,-0.001705,-0.000788,0.000493,0.000197,-4.4e-05,0.000212,-0.000728,-0.001029,-0.000985,-0.000235,0.000131,-0.000268,-0.000456,-0.000309,0.000587,0.000481,-0.000267,0.000399,0.000317,0.001072,0.002013,-8e-05,0.002482,0.001444,0.001277,0.001989,0.001387,0.001031,0.001022,0.000693,0.003158,0.001455,0.001505,0.001809,0.000524,0.0017,0.001401,0.000747,0.00061,0.000558,6.8e-05,-8.9e-05,0.000175,0.000302
0.000218,8.8e-05,-8.9e-05,-0.000241,0.000114,-0.000115,-0.000124,-0.000477,-0.000144,-0.000554,-0.000103,-2e-04,-0.000257,-4.2e-05,-0.000271,5.8e-05,-6.3e-05,0.000252,0.000146,0,-0.000136,0.000162,0.000219,0.000294,5.6e-05,-7.8e-05,5.7e-05,0.000436,0.000401,0.000149,0.00031,0.000417,-2.9e-05,-0.000494,-0.000145,-0.000319,-0.000903,-0.000195,-0.000667,-0.001107,-0.000363,-0.001029,0.000734,-0.000253,0.001127,-0.000652,0.000609,-0.000618,0.000455,0.000483,-0.000115,-0.000277,-0.000338,-0.001136,-0.000416,-0.000262,-0.00049,0.000366,-2.1e-05,0.000276,0.000371,9.1e-05,-0.000754,0.000594,5.9e-05,0.001321,0.001315,0.001211,0.001279,0.001128,-3.7e-05,0.001078,0.001492,0.001198,0.000792,0.000399,0.000831,0.001561,0.000542,-0.000418,-0.000852,-0.000936,-0.000456,8.5e-05,0.001083,-0.000266,-0.000154,-4.7e-05,0.000382,0.000722,0.000366,0.000625,0.000116,-4.6e-05,0.000247,0.000121,-0.000302,-0.00211,-0.000916,-0.002104,-0.001833,-0.001246,-0.001321,-0.000871,-0.000233,-0.000882,0.000315,-0.001717,-0.001041,-0.000147,-0.001535,-0.000246,-0.000976,-0.00076,-0.000111,-0.000431,-9.6e-05,-9.7e-05,-0.000113,-4.1e-05,-0.000395
-9e-05,-0.000138,6.6e-05,7.3e-05,2.8e-05,3.7e-05,0.000115,-3e-06,7.3e-05,0.000177,8.9e-05,6.3e-05,-7.3e-05,0.000212,0.000143,-0.000224,-9.6e-05,-0.000119,-0.000331,0.000129,-2.4e-05,6.2e-05,-0.000164,-8.4e-05,-0.000156,-0.000141,0.000102,3.4e-05,1.6e-05,-0.000136,0.00017,-8.4e-05,-0.00012,0.000127,0.000414,0.000327,0.000612,0.000647,0.000829,0.001235,0.000173,0.000563,-0.000326,-0.000143,-0.000626,0.000421,-0.000815,7.4e-05,-0.000583,-0.000386,-2.6e-05,0.000488,0.000417,0.000856,0.000886,-6.8e-05,0.000555,-0.001192,-0.000425,-0.000768,-0.000834,-0.000608,-0.000311,-0.000711,-0.000305,-0.001337,-0.001413,-0.001205,-0.000987,-0.00116,-0.000701,-0.001327,-0.001559,-0.001551,-0.000895,-0.000201,0.000371,-0.00145,-0.000587,0.000183,0.000461,0.000656,0.000129,6.7e-05,-0.001016,-0.000355,-0.000214,-0.000387,-0.000731,-0.000405,-0.000212,-0.00108,-0.000306,-0.000265,-0.000315,-0.000902,-0.000423,0.001255,0.001415,0.001065,0.001229,0.000542,0.000562,7.8e-05,-0.000598,-0.000344,-0.00094,-2.4e-05,0.000382,-0.000538,0.000528,-0.000263,0.000434,0.000361,-0.000219,0.000153,-0.000409,-8.2e-05,5e-06,-0.000212,-0.000222
-1.1e-05,0.000106,-3.1e-05,0.000224,7.5e-05,4.6e-05,-7.7e-05,0.000207,-7e-05,7.5e-05,-3.2e-05,0.00012,7e-05,-0.000167,-0.000178,-6.4e-05,-9.4e-05,-0.000262,0.000239,-0.000359,-6.3e-05,-0.000262,-7.9e-05,-0.000287,-3.5e-05,1.3e-05,-0.000139,-0.000355,-0.000472,-0.000441,-0.000229,-0.000201,2.7e-05,-0.000206,-0.000517,-0.000197,-0.000662,-0.000665,-0.000801,-0.000927,-0.00042,-0.000468,-0.000334,-0.000552,-0.000118,-0.000255,0.000214,-0.000335,-0.000217,0.000457,0.000293,-0.000441,0.000176,-0.000324,-0.000546,-0.000206,-0.000455,0.001045,0.000444,0.000642,0.000819,0.001005,0.000886,0.000744,0.000453,0.001205,0.001235,0.000661,0.000651,0.000632,0.000712,0.000639,0.000932,0.001156,0.000643,0.000156,-0.00059,0.000641,0.000562,-0.000432,-0.000769,-0.000777,-0.000622,-0.000494,0.000227,0.000639,-0.000176,-6.2e-05,0.000105,0.000628,1.6e-05,0.000205,6e-05,8.1e-05,0.000109,0.000429,0.000206,-0.000114,-0.000753,-0.000674,-0.001128,-0.000917,-0.001381,-0.000407,3.8e-05,0.000552,0.000991,0.000305,0.000333,0.000315,-0.000139,-0.000412,-0.00038,0.00017,0.000152,-0.000567,-0.00041,-0.000321,-6.2e-05,-5.1e-05,0.000276
-1.6e-05,-0.000142,4e-06,-0.000172,9.3e-05,-3.1e-05,5.6e-05,9e-06,5e-06,-0.000112,5.8e-05,-9e-05,4.4e-05,1.7e-05,0.000107,0.000121,4.3e-05,-2.1e-05,4.3e-05,0.000122,7.1e-05,-0.000108,0.000162,0.000182,-1.2e-05,1.5e-05,2.3e-05,8.8e-05,-9.4e-05,0.000224,-0.000157,-6.9e-05,-0.000138,5e-05,0.000282,0.00011,0.000665,0.000686,0.000624,0.001006,0.000818,0.000869,0.000315,0.001038,0.000463,0.000648,0.000551,0.000916,0.000729,-0.000374,-0.000383,0.000298,-0.000171,0.00079,0.000164,0.00013,0.00022,-0.000532,-0.000628,-7.7e-05,-0.000283,-0.000918,-0.000701,-0.000688,-0.000507,-0.00079,-0.000839,-0.000586,-0.000447,-0.000448,-0.000533,-0.000208,-0.000632,-0.000445,-0.00017,0.000146,-3.1e-05,-0.000538,-0.000778,0.000409,0.00085,8.1e-05,0.000193,0.000482,-0.000206,-7e-04,3.9e-05,-0.000297,0.000145,-0.000488,-0.000133,-0.000195,0.000146,0.000143,-0.000388,-0.000188,-0.000259,-0.000333,0.000334,0.000526,0.000324,0.000749,0.001153,-0.000208,0.00057,-0.000404,-0.000429,-3.5e-05,-0.000697,0.000395,-0.000314,0.000564,-1.8e-05,-0.000277,-0.000301,5.5e-05,0.000817,0.000249,0.000155,0.000101,-2.5e-05
1.8e-05,0.000218,1.7e-05,2.6e-05,-5.1e-05,-0.000164,-0.000141,-0.000197,8e-05,3.9e-05,5e-06,-4.2e-05,0.000153,-0.000152,-0.000282,-0.000213,3.2e-05,3.6e-05,-0.000256,5.8e-05,-4e-05,0.000164,-5.3e-05,4.9e-05,-5e-06,6.6e-05,0.000156,7.3e-05,0.000198,-5.1e-05,-1e-05,0.000165,0.000111,-0.000169,-0.000149,0.000338,-0.000202,-0.000256,-0.000411,-0.000947,-0.000686,-0.001254,-0.000322,-0.001104,-0.000515,-0.000735,-0.00069,-0.000794,-0.000594,0.000131,0.000268,-0.000439,-0.000376,-0.001255,-0.000368,-0.000137,-0.000693,0.000349,0.00046,-0.000171,-0.000173,0.000246,0.00037,9.5e-05,0.000284,0.000315,0.000406,0.000503,0.000314,0.000465,0.000373,0.000186,0.000394,0.000348,0.000302,-7.3e-05,0.000216,0.000249,0.000832,-0.000363,-0.000291,0.000252,-0.000223,-0.000248,0.000375,0.000426,0.000299,1e-04,-0.00017,0.000324,0.000461,0.000396,-5.4e-05,-0.000225,0.00017,0.000133,0.000233,0.000182,3.6e-05,-0.000336,4.8e-05,-0.000753,-0.000641,0.000168,-0.000798,5.3e-05,0.000175,-0.000395,0.000293,-0.000714,0.000353,-9.4e-05,-0.000547,-0.000192,-0.000279,0.000137,-0.000413,-3e-05,0.000107,0.00021,-5.4e-05
-2.3e-05,-0.000233,-1.1e-05,3.5e-05,-0.000232,0.000133,-0.00016,-2.1e-05,-6.6e-05,-4.2e-05,2.6e-05,-2.1e-05,-0.000106,4.6e-05,8.8e-05,0.000104,-0.00011,-7.6e-05,-5.2e-05,-6.9e-05,-8.6e-05,-0.000144,-6.3e-05,-5e-05,1.5e-05,6.6e-05,-0.000135,-5.9e-05,2.2e-05,4.1e-05,9.3e-05,4.2e-05,-0.000157,7.4e-05,3.1e-05,-0.000313,0.000193,0.00028,0.000269,0.000772,0.000251,0.000492,0.000209,0.000794,0.000203,0.000467,0.000364,0.000415,0.000336,-5e-06,-0.000102,0.000829,0.000412,0.001185,0.000812,0.000671,0.000808,0.000104,-0.000216,7.8e-05,3.1e-05,-0.000152,-0.000198,0.00034,2e-05,0.00014,-0.000399,-0.00047,-0.000321,-0.000497,-0.000563,-8.5e-05,-0.00025,-0.000595,-0.000313,-0.000206,-0.000285,0.000132,-0.000541,7.8e-05,-3.9e-05,-0.000185,0.000324,0.000345,-0.000107,-5.4e-05,-0.000125,0.000129,0.000221,-0.000147,-0.000297,-0.000133,-0.000215,0.000145,-9.8e-05,-7.1e-05,0.000281,-7.9e-05,-0.00012,0.00041,0.000108,0.000208,6.9e-05,0.000183,0.000408,-0.000128,0.000292,0.000292,6.6e-05,0.000439,6.1e-05,0.000118,0.000658,0.000157,0.000457,-1e-04,0.000342,5.4e-05,-3.8e-05,8.2e-05,-5.6e-05
-1.5e-05,0.000127,-2.5e-05,-4.1e-05,5.8e-05,-2.6e-05,0.000198,1.9e-05,7e-05,0.000145,2.3e-05,8.9e-05,8.4e-05,6.5e-05,0.000152,5.6e-05,7.3e-05,6.5e-05,2.4e-05,5.9e-05,0.000106,0.000138,-4.6e-05,2.1e-05,2e-06,4.3e-05,0.000144,7.1e-05,-0.000133,-0.000189,-0.000106,-3.1e-05,2e-06,3e-05,8e-06,1e-06,-9.4e-05,-0.000268,-0.000167,-0.000347,-0.000113,-8.9e-05,-0.000236,-0.000396,-0.000106,-0.000475,-8.7e-05,-0.00039,-2.9e-05,-2e-06,0.000152,-0.000636,-0.000222,-0.000891,-0.000728,-0.001038,-0.000615,-0.000307,0.000469,-9.1e-05,-9e-06,9.7e-05,0.000203,-6.8e-05,-3.6e-05,-7.1e-05,0.000341,0.000535,0.000351,0.00035,0.000183,6.2e-05,0.000327,6e-04,0.000282,5.4e-05,0.00027,-0.000223,0.000512,-7.3e-05,0.00011,0.000386,-4.7e-05,-2.3e-05,-3.5e-05,0.000164,0.000316,7.9e-05,-1.9e-05,-8.8e-05,4.3e-05,-0.000143,-5e-06,-0.000131,9.2e-05,-3.5e-05,-1.1e-05,-4.4e-05,0.000242,1e-04,-0.000341,0.000292,-0.000221,-0.000182,-0.00025,5.8e-05,-0.000187,-5.5e-05,-0.000244,-0.000411,-0.00024,-3.1e-05,-0.000216,-2.7e-05,-0.000312,-0.000109,-0.000107,-0.000146,-1.8e-05,-0.000159,-7.2e-05
-3e-05,-7.6e-05,3.7e-05,4.2e-05,7.4e-05,9e-05,-7e-06,-4.6e-05,1.2e-05,-0.000137,-7.1e-05,-7.8e-05,7.9e-05,4.6e-05,-3.3e-05,-7e-06,-1.2e-05,5e-06,0.000115,6.4e-05,6.2e-05,4.1e-05,9.7e-05,6.3e-05,-9e-06,-0.00012,-4.7e-05,-6.7e-05,6.7e-05,0.000136,0.00015,-6.6e-05,0.000141,-5.6e-05,-4e-06,-9.5e-05,-7.4e-05,9.5e-05,6.9e-05,0.000136,4e-06,0.000161,0.000177,0.000382,0.000185,0.000549,2e-05,0.000503,8.1e-05,-0.000158,-0.000104,3.7e-05,3.6e-05,0.000331,0.000167,0.000667,0.000366,0.000302,-0.000426,-2.9e-05,-0.000189,-0.000276,-0.000229,-0.000185,-6.3e-05,7.4e-05,-0.000148,-0.000198,-0.000151,-0.00014,6.1e-05,-9e-06,-7.6e-05,-9e-05,-0.000291,-3.5e-05,-0.000121,0.000303,-0.000399,5.4e-05,-2.8e-05,-0.000217,-0.000137,-5e-06,0.000115,-9.6e-05,-0.000251,-4.9e-05,-2.8e-05,-0.000259,-0.000244,-8e-05,3.4e-05,0.000187,-1.1e-05,6e-05,-0.000169,-2.2e-05,-0.000334,-0.000463,0.000151,-0.000417,0.000484,0.000328,5.8e-05,-9.5e-05,0.000101,0.000147,0.000185,0.000252,0.000111,-0.00015,-0.000164,0.000133,0.000133,0.000252,-6.1e-05,0.000143,3.2e-05,9.9e-05,-2.3e-05
-1.3e-05,5.9e-05,-4.2e-05,-5.9e-05,-2.1e-05,-5.4e-05,-3.2e-05,6.6e-05,-6.8e-05,4e-05,1.7e-05,-2.9e-05,-1.7e-05,-1.3e-05,1.4e-05,7e-06,6e-06,2e-05,-3.7e-05,-0.000121,-5.1e-05,-4.9e-05,7.4e-05,-7.4e-05,-3e-06,1.5e-05,-3e-06,7.1e-05,-2e-05,5.2e-05,8.5e-05,8.6e-05,9e-06,6.4e-05,-3.5e-05,0.000127,6.3e-05,-1.8e-05,4.7e-05,-9.1e-05,-4.3e-05,-0.000252,-9e-05,-0.000372,-8.5e-05,-0.000494,-9.9e-05,-0.000447,-9.3e-05,-1.5e-05,0.000117,0.000148,-0.000116,-6.1e-05,1.1e-05,-0.000128,3e-05,-0.000107,0.000299,0.000212,0.000196,0.000417,0.000403,0.000201,0.000201,1e-06,2.9e-05,7.2e-05,9.8e-05,9.8e-05,-5.5e-05,7.6e-05,-4.7e-05,-0.000112,0.000311,4.8e-05,0,-9.9e-05,0.000237,5.5e-05,0.00013,0.000102,0.000212,9.7e-05,-5.5e-05,3.9e-05,2.1e-05,-0.000107,8.3e-05,0.000295,2.6e-05,3.5e-05,6.8e-05,-0.000211,2.2e-05,3.9e-05,0.000201,0.000118,1.2e-05,0.000402,0.000142,0.000446,-5.7e-05,-0.000104,0.000306,0.000195,-0.000161,-0.000121,0.000169,9.6e-05,0.000236,0.000261,0.000415,8.4e-05,5e-05,-5.7e-05,0.000162,-3.9e-05,-1.6e-05,-0.000103,-1.6e-05
1.2e-05,-3.8e-05,6.2e-05,4.5e-05,3.3e-05,-1.8e-05,-1.2e-05,2.1e-05,4.1e-05,-9e-06,-1.8e-05,-3.5e-05,3.8e-05,2e-05,-2.9e-05,-7e-06,3e-05,-2e-05,-1.7e-05,2.2e-05,6e-06,-9e-06,-3e-05,1.7e-05,0,5.1e-05,-7e-05,-2.3e-05,-5.3e-05,-4e-06,1.6e-05,2.8e-05,-0.000108,-1.8e-05,-9e-06,-0.000128,-0.000125,-8e-05,-0.000106,0.000104,-4.2e-05,8.6e-05,2.6e-05,0.000241,0.000123,0.000124,1.6e-05,0.000241,5.8e-05,0.000239,-1e-04,-1.6e-05,0.000119,6.2e-05,4.9e-05,-4.4e-05,-0.00024,0.000116,-0.00023,-0.000191,-6.2e-05,-0.000163,-0.000205,-0.000245,-0.000113,-3.2e-05,-3.7e-05,-4.4e-05,-0.000116,-0.000119,7.6e-05,-7.3e-05,-0.000113,2e-05,-0.000191,-1.8e-05,7.8e-05,-7.4e-05,-8.9e-05,-3e-05,-0.000106,-6.2e-05,-9.8e-05,-3e-05,8.5e-05,2.3e-05,0.00011,0.000141,-0.000104,8.5e-05,3.3e-05,-4.5e-05,-3e-05,0.000139,-1.6e-05,7e-06,-0.000177,-4.4e-05,0.000122,-0.00023,-6.9e-05,-0.000243,-5.7e-05,-1.5e-05,-0.00032,-4.9e-05,-8.7e-05,0.000244,-0.000147,-0.00021,-0.000238,-0.000194,-7.4e-05,-3.8e-05,-0.00016,-0.000103,-0.000178,-7.1e-05,-5.2e-05,6.3e-05,3.6e-05
-1.1e-05,4e-06,-6.9e-05,-2.4e-05,-1.1e-05,-2e-05,3.5e-05,-2.4e-05,4.2e-05,0,4e-06,3e-06,-1.8e-05,-5.1e-05,3.4e-05,0,-2.5e-05,1.7e-05,7.9e-05,0.000116,-2e-06,-7e-06,7e-06,1.9e-05,-6e-06,-2e-06,-2.7e-05,-1.2e-05,7.1e-05,-6.1e-05,-1.2e-05,-9e-06,-6e-06,1.2e-05,1.7e-05,3.5e-05,1.2e-05,-3.1e-05,5e-06,-0.000155,3.4e-05,5.1e-05,7.2e-05,-1e-06,-7.7e-05,5.3e-05,7e-06,-6.7e-05,-3.1e-05,-0.000172,1.6e-05,-0.000149,4.6e-05,-2.3e-05,-4.7e-05,4.9e-05,0.000182,-0.000228,1.3e-05,7.2e-05,2.1e-05,-1.6e-05,-2.6e-05,0.00012,-4e-06,-4e-05,-5.7e-05,9.2e-05,8.7e-05,5.4e-05,1.5e-05,5.3e-05,2.2e-05,-3.2e-05,6.1e-05,4e-05,-0.000114,0.000112,-6.3e-05,1.4e-05,8.9e-05,3e-06,1.9e-05,-0.000152,-0.000144,-4e-06,-0.000117,-0.000299,2.5e-05,-0.000167,-4.2e-05,7.1e-05,-6.9e-05,5e-05,2.9e-05,-3.1e-05,-4e-05,5.5e-05,-7.1e-05,0.000111,4.9e-05,7.9e-05,2e-06,-7.5e-05,0.000164,-4.6e-05,8.3e-05,-4.5e-05,-6.6e-05,0.00013,6.7e-05,3.6e-05,-1.3e-05,-3.6e-05,0.000206,0.000124,3.9e-05,5.7e-05,-1.3e-05,-2e-05,5.4e-05
3e-06,1.6e-05,3.1e-05,1.4e-05,8e-06,-1.4e-05,-2.2e-05,3.1e-05,-3.1e-05,-1.2e-05,-2e-06,2.1e-05,1e-06,2.9e-05,2.4e-05,4e-06,6e-06,1e-05,2.8e-05,-3.7e-05,-6e-06,8e-06,-1.2e-05,-1e-06,-8e-06,-2.8e-05,-3.5e-05,1.2e-05,-2.5e-05,3.6e-05,-9e-06,-2.7e-05,4.2e-05,-5e-06,-1.3e-05,-2.8e-05,3.7e-05,5e-06,1e-05,0.000101,-4e-06,-3.9e-05,-2.2e-05,1.5e-05,-3.6e-05,0.000104,6.9e-05,-8e-06,6e-05,0.000117,-1e-06,0.000146,-8.5e-05,-8e-05,0.00012,-9.6e-05,-4.2e-05,0.000173,0.000108,-8e-05,2.2e-05,0.000103,-3.8e-05,3.7e-05,2.4e-05,6.4e-05,0.00013,-7e-05,-5.8e-05,-4.6e-05,-6e-05,5e-06,2.9e-05,3.4e-05,-6.8e-05,3.1e-05,0.000103,-5.1e-05,0.000161,-4.5e-05,-4.2e-05,4.2e-05,-1e-06,-5.9e-05,0.000135,-5e-06,1.1e-05,0.000227,-5e-06,0.000261,8e-06,-1e-06,1.5e-05,-8.6e-05,-4e-06,-1.9e-05,2.5e-05,-5e-05,-9.2e-05,-4.1e-05,-9e-06,6.8e-05,1.3e-05,0.000107,-7e-06,0.000108,-0.000128,-4.1e-05,0.000146,-8e-05,-4e-06,9.2e-05,-7.2e-05,6.3e-05,-0.000155,-4.8e-05,3.4e-05,-2.3e-05,2.5e-05,3.2e-05,-1.2e-05
7e-06,-1.5e-05,-2.5e-05,-1.1e-05,1.2e-05,2.3e-05,1.2e-05,-2.3e-05,4e-06,4e-06,6e-06,-5e-06,1.3e-05,-2.3e-05,-1.1e-05,-2e-06,-6e-06,0,-2.9e-05,7e-06,4e-06,1e-06,-1.6e-05,7e-06,8e-06,-1.6e-05,1.3e-05,-2.7e-05,-2.9e-05,-2.1e-05,1e-06,-3.2e-05,9e-06,3.4e-05,-2e-06,2.8e-05,1.4e-05,5e-06,-4.8e-05,-5.2e-05,-2.9e-05,-4.6e-05,-3.2e-05,-1e-04,3.1e-05,-0.000162,-6.3e-05,-1e-05,-6.4e-05,9e-06,-1.6e-05,-7.2e-05,-1.6e-05,9.8e-05,-8.5e-05,8.7e-05,-1e-05,-0.000172,-0.000156,3.8e-05,-5.6e-05,-0.000128,4.5e-05,-4.1e-05,-4.2e-05,-6.3e-05,-0.000107,-5.3e-05,-3.3e-05,3.8e-05,4e-05,-9.2e-05,7e-06,-2e-06,8.9e-05,-3.4e-05,-6.3e-05,5.1e-05,-0.000179,4.5e-05,3.1e-05,-3.2e-05,-3.1e-05,9.9e-05,-9.8e-05,1.5e-05,1.5e-05,-0.000111,-1.5e-05,-8e-05,7.3e-05,-3e-06,1.4e-05,1.9e-05,-3.1e-05,3.2e-05,3.1e-05,1e-06,0.000162,-6.3e-05,-9.2e-05,-0.000119,-7.5e-05,1.1e-05,4.2e-05,-2.8e-05,6.6e-05,-0.000107,-7.8e-05,9.2e-05,-6e-06,-6.1e-05,3.2e-05,-5.3e-05,9e-05,1.3e-05,-0.00011,-4e-06,-1.5e-05,1.4e-05,-2.8e-05
0,2.1e-05,2.7e-05,7e-06,-1.2e-05,3e-06,-3.1e-05,1.7e-05,-7e-06,1.2e-05,-5e-06,1.2e-05,5e-06,7e-06,3e-06,-4e-06,1.2e-05,1e-06,-2.4e-05,-1.4e-05,-1e-06,2e-05,2.4e-05,-1.9e-05,-7e-06,9e-06,2.1e-05,-2e-06,2.3e-05,4.6e-05,-9e-06,-1.3e-05,-2.3e-05,-4.3e-05,2.4e-05,4e-06,-2.3e-05,3e-05,1.1e-05,3.8e-05,3.1e-05,9.2e-05,5.2e-05,0.000109,-1.7e-05,0.000135,1.8e-05,8.7e-05,4e-05,-3.9e-05,2.1e-05,4.7e-05,6e-05,3.6e-05,7.2e-05,-5.2e-05,-2e-06,8e-05,0.000145,6.4e-05,9.4e-05,7e-05,-3.8e-05,1e-06,7.7e-05,-1.1e-05,3.9e-05,0.000119,5.5e-05,4e-06,-2.2e-05,3.5e-05,9e-06,-2e-05,-1.3e-05,1.2e-05,3e-05,-2e-05,0.000107,-9.3e-05,-3.2e-05,6e-06,3.6e-05,-9.3e-05,2.8e-05,2.3e-05,-1e-04,0.000121,5.1e-05,4e-06,-1.9e-05,3e-06,-5e-06,-1.1e-05,4.2e-05,-8e-06,-5.3e-05,-1e-06,-5.4e-05,3.5e-05,4.9e-05,3.2e-05,0.000139,-1.8e-05,-1.8e-05,7e-06,-0.000178,2.5e-05,-5.7e-05,-4.5e-05,-6e-06,-8e-06,-2.5e-05,-3.8e-05,-8.8e-05,4.3e-05,5.3e-05,2.1e-05,-3e-06,-1.9e-05,2.3e-05
8e-06,-1.7e-05,-2e-05,-7e-06,-1.6e-05,3e-06,1.8e-05,-2.3e-05,-1.9e-05,-9e-06,1.2e-05,-1e-06,-2.6e-05,5e-06,2.1e-05,9e-06,-1.4e-05,0,7e-06,-3.1e-05,-1e-06,-2e-05,-2.1e-05,-1.7e-05,2e-06,9e-06,-3e-06,1.8e-05,-1.2e-05,-1.6e-05,2.4e-05,4e-06,-4e-06,5e-06,-1.3e-05,3.2e-05,2.9e-05,-1.4e-05,-1.1e-05,-7.2e-05,-1.9e-05,-3.9e-05,-2.5e-05,-7.8e-05,-1.3e-05,-6.1e-05,1.8e-05,-9.4e-05,-2.3e-05,2.2e-05,-2.9e-05,-4.3e-05,-1.4e-05,-9.3e-05,-7.6e-05,3.6e-05,3.6e-05,1.8e-05,-0.000131,-2.8e-05,-7e-05,-3.1e-05,-2.5e-05,-1.8e-05,-2.8e-05,3.9e-05,1.5e-05,-9.3e-05,-5.1e-05,-5e-05,5.4e-05,1.1e-05,-1.5e-05,4e-06,-3e-06,9e-06,-2e-05,-9e-06,-6.5e-05,9.4e-05,4.7e-05,1.2e-05,-6e-06,-4e-06,1.2e-05,-2.3e-05,7.9e-05,-0.000105,-5.8e-05,-1.1e-05,1.1e-05,1.6e-05,-7e-06,3.3e-05,-1.6e-05,7e-06,1.7e-05,-1.1e-05,-4e-06,2.5e-05,3.9e-05,7e-05,-0.000102,2.7e-05,-4e-05,-4.4e-05,0.000121,1.2e-05,5e-05,-4.7e-05,3.5e-05,1.8e-05,1.4e-05,6e-06,-2.5e-05,-1.5e-05,-8e-06,-2.1e-05,6e-06,2.2e-05,-5e-06
0,5e-06,1.3e-05,5e-06,1e-05,0,1.3e-05,-3e-06,1.6e-05,0,-6e-06,0,-5e-06,5e-06,-2.2e-05,-8e-06,8e-06,-7e-06,1.7e-05,2.1e-05,2e-06,2e-06,6e-06,4e-06,-4e-06,-1e-06,1e-06,-2.1e-05,-1.4e-05,-2e-06,1.5e-05,1.8e-05,-9e-06,1.1e-05,-4e-06,-2.1e-05,-1.6e-05,1.6e-05,2.4e-05,7.1e-05,9e-06,2.4e-05,1e-05,7.3e-05,4.6e-05,7e-05,6e-06,9.8e-05,1.5e-05,-7.1e-05,1.1e-05,3e-05,-2.6e-05,6e-06,5.9e-05,-2.9e-05,-4e-05,-9.2e-05,7.4e-05,-1.6e-05,3.8e-05,2.6e-05,9e-06,2e-06,-7e-06,-7e-05,-1.5e-05,5.7e-05,3.8e-05,5.3e-05,-8.6e-05,-3.1e-05,6e-06,3.5e-05,-4.2e-05,-1.6e-05,-7e-06,-1e-05,3.8e-05,-8.5e-05,-4.6e-05,-2.8e-05,-1.3e-05,4.2e-05,-2.4e-05,2.1e-05,-2.3e-05,4.3e-05,6e-06,-5.9e-05,1.9e-05,-6e-06,-2.4e-05,-1.6e-05,1.5e-05,-1.5e-05,-1.1e-05,-1.3e-05,4.8e-05,-2.1e-05,-1.9e-05,-8.3e-05,5e-06,-2.3e-05,-7e-06,4.4e-05,3.7e-05,5.1e-05,1.6e-05,9.2e-05,-3.1e-05,2e-06,4.2e-05,1.9e-05,6.2e-05,-4.2e-05,-2.3e-05,-4e-06,-7e-06,-4e-06,4e-06
-5e-06,-1.5e-05,-9e-06,-2e-06,4e-06,-6e-06,-1.6e-05,3e-06,-3e-06,0,2e-06,-1.4e-05,-4e-06,-1.1e-05,-9e-06,-5e-06,-7e-06,6e-06,-6e-06,1.9e-05,-4e-06,-9e-06,1e-06,8e-06,4e-06,0,4e-06,2e-05,1.6e-05,-9e-06,-1.4e-05,-7e-06,1.2e-05,9e-06,7e-06,8e-06,2.2e-05,8e-06,-1.8e-05,-4.1e-05,-5e-06,-3.6e-05,2.2e-05,-8.3e-05,-3.1e-05,-0.00012,-9e-06,-9.8e-05,0,4.9e-05,-8e-06,1.3e-05,1e-05,7.6e-05,-2.6e-05,-1.9e-05,1.3e-05,0.000125,-2.3e-05,1.7e-05,-2e-05,-3.1e-05,-1.5e-05,1.9e-05,8e-06,7.1e-05,1.6e-05,-1.8e-05,-1.1e-05,-4e-05,7.4e-05,9e-06,-3e-06,-2e-05,4.8e-05,-1.1e-05,2.8e-05,6e-06,-1.6e-05,8.2e-05,2.8e-05,1.9e-05,2.2e-05,-5.3e-05,2.4e-05,2e-06,1e-06,-7.5e-05,1.3e-05,-2e-06,-3.4e-05,-3e-06,2.2e-05,-3e-06,-6e-06,-3e-06,1.2e-05,1e-05,-2.2e-05,1.6e-05,-2.6e-05,3.9e-05,1.5e-05,-3.7e-05,2.7e-05,-3.1e-05,-1.4e-05,-2.6e-05,-6.8e-05,-7.1e-05,-2.9e-05,3.2e-05,1.4e-05,-6e-06,-3.8e-05,2.5e-05,4.4e-05,1e-05,1.1e-05,6e-06,-2e-05
-1e-06,1.6e-05,7e-06,1e-06,-5e-06,2e-06,-2e-06,1.2e-05,-5e-06,2e-06,5e-06,8e-06,-1.3e-05,7e-06,0,5e-06,2e-06,-1e-06,-1.5e-05,-2e-05,-4e-06,1e-06,4e-06,-2e-06,-2e-06,-6e-06,-4e-06,-4e-06,-1e-06,2.2e-05,1.4e-05,-5e-06,7e-06,3e-06,0,3e-06,-3e-06,-4e-06,8e-06,1.9e-05,-3e-06,1.8e-05,-8e-06,5.1e-05,1.7e-05,9.2e-05,-6e-06,6.7e-05,-5e-06,-2.4e-05,7e-06,-3.4e-05,1.6e-05,-7.2e-05,-1.3e-05,3.3e-05,6e-06,-0.000131,-3e-06,-2e-05,-6e-06,2.4e-05,3e-05,3e-06,1.1e-05,-3.9e-05,-3.6e-05,-1.4e-05,-7e-06,3.6e-05,-2.8e-05,-1.1e-05,1.2e-05,-1.4e-05,-3e-06,1e-05,-2.9e-05,1.6e-05,-8e-06,-6.2e-05,-1.4e-05,-2.4e-05,-1.9e-05,1.8e-05,-3.7e-05,5e-06,3e-06,5.2e-05,-1.9e-05,-2.8e-05,3e-06,1.4e-05,2.5e-05,-2e-06,0,1.5e-05,-3e-06,7e-06,-1.4e-05,-1e-06,3.6e-05,-3e-06,1.8e-05,1.7e-05,-1.1e-05,1.9e-05,2.6e-05,-4e-06,5.5e-05,3.1e-05,2.7e-05,-3.8e-05,-6.3e-05,1e-06,4.4e-05,1e-05,-5.7e-05,1e-06,9e-06,2e-06,9e-06
-4e-06,-8e-06,-7e-06,-1e-06,6e-06,-3e-06,1.2e-05,-4e-06,6e-06,1e-06,-8e-06,-1e-06,-4e-06,-1.4e-05,1.7e-05,-4e-06,3e-06,4e-06,1.6e-05,9e-06,2e-06,1e-06,2e-06,3e-06,-1e-06,-7e-06,8e-06,-9e-06,-1.8e-05,-8e-06,-1.8e-05,-6e-06,-2.2e-05,-1.4e-05,-9e-06,-6e-06,3e-06,3e-06,1.5e-05,-1.2e-05,1e-05,1.8e-05,7e-06,-3.7e-05,3e-06,-5.1e-05,-8e-06,-3.8e-05,1e-06,-1e-06,5e-06,0,-1.8e-05,2.4e-05,4.6e-05,-4e-06,-9e-06,0.000104,1.5e-05,2.2e-05,3.5e-05,1.4e-05,-1.1e-05,-1e-05,-8e-06,1e-05,9e-06,7e-06,-2e-06,-3.8e-05,1.3e-05,-2.3e-05,2e-06,6e-06,-2.3e-05,4e-06,2.1e-05,-1.6e-05,2.2e-05,3.4e-05,2e-06,2.8e-05,-1e-06,3.2e-05,3.5e-05,-9e-06,1e-06,-3e-06,2.2e-05,4.2e-05,-9e-06,-2.6e-05,-1e-05,1.4e-05,-5e-06,-5e-06,1.6e-05,-3e-06,1.9e-05,-4e-06,-3.1e-05,-2.2e-05,-1.9e-05,1.9e-05,5.8e-05,-4e-06,-2.1e-05,-1.4e-05,-2e-06,1.1e-05,1.9e-05,4e-06,3e-05,-6e-06,-2.5e-05,-1.2e-05,3.3e-05,-8e-06,-5e-06,-1.2e-05,1e-06
1e-06,7e-06,8e-06,0,-1e-06,3e-06,-1.1e-05,8e-06,-4e-06,-5e-06,5e-06,4e-06,-1.2e-05,5e-06,0,1e-06,-6e-06,-3e-06,1.4e-05,-4e-06,-1e-06,1e-05,-9e-06,-3e-06,1e-06,7e-06,-4e-06,1.4e-05,1e-05,9e-06,-1.3e-05,0,1e-06,7e-06,7e-06,-1e-06,-6e-06,-2e-06,-2e-05,2.3e-05,-9e-06,-1.3e-05,9e-06,2.4e-05,-2.8e-05,4.8e-05,1.7e-05,3.4e-05,3e-06,1.3e-05,2e-06,3.7e-05,-7e-06,-1.6e-05,-5.1e-05,-1.3e-05,-1.5e-05,-7.2e-05,-2.1e-05,-4e-06,-4.8e-05,-3.5e-05,-2.3e-05,-2e-06,-2e-06,1e-05,2.1e-05,-2e-06,5e-06,2.2e-05,-9e-06,1.2e-05,-1e-06,1.3e-05,1.7e-05,-1e-06,-8e-06,2.2e-05,-2.8e-05,-1.8e-05,-2e-05,-2.7e-05,1.4e-05,-3e-05,-2.5e-05,5e-06,-2.6e-05,2e-05,-1.5e-05,-6e-06,-1.6e-05,1.6e-05,-1.3e-05,0,7e-06,5e-06,-1.2e-05,6e-06,-4.2e-05,1.6e-05,6e-06,3.6e-05,1.6e-05,-1e-06,-7.4e-05,1.1e-05,3.5e-05,-1e-06,-3e-05,-4.4e-05,-2.6e-05,6e-06,-8e-06,-1e-06,-1.9e-05,1e-05,8e-06,3e-06,-2e-06,8e-06,7e-06
2e-06,-5e-06,-6e-06,2e-06,-1e-06,3e-06,9e-06,-3e-06,-4e-06,7e-06,-4e-06,-6e-06,-3e-06,-1e-06,-9e-06,2e-06,3e-06,2e-06,-1.2e-05,-2.2e-05,-1e-06,-5e-06,0,-4e-06,-1e-06,7e-06,4e-06,-1.1e-05,1e-06,-1.4e-05,-2e-06,6e-06,1.9e-05,-6e-06,0,-4e-06,-2e-06,1e-06,1.8e-05,-2.4e-05,-3e-06,-1.2e-05,-4e-06,-2.9e-05,5e-06,-6e-05,-8e-06,-2.8e-05,-2e-05,1.4e-05,0,-3.8e-05,1.8e-05,2.6e-05,2.7e-05,1.4e-05,3.1e-05,4.3e-05,2.6e-05,-2.4e-05,4.6e-05,3.2e-05,-1e-05,-4e-06,7e-06,-1.9e-05,-7e-06,1.1e-05,3e-06,-1.4e-05,0,8e-06,5e-06,-1e-06,-1e-05,1e-06,1e-06,-2.9e-05,3.6e-05,3e-06,3.1e-05,1.1e-05,-1.9e-05,2.3e-05,1.1e-05,1.1e-05,4e-05,-1.4e-05,0,1.5e-05,-6e-06,-2e-06,-1e-05,-2.1e-05,-3e-06,-1.4e-05,7e-06,3e-06,2.9e-05,-1e-05,8e-06,-4.6e-05,-1.4e-05,-6e-06,3.2e-05,-2.2e-05,1.7e-05,-1.4e-05,5e-06,4.5e-05,7e-06,-6e-06,-6e-06,-8e-06,2e-05,8e-06,-1.3e-05,5e-06,4e-06,-1.2e-05,-1e-05
0,3e-06,4e-06,-3e-06,4e-06,-2e-06,-1.1e-05,2e-06,7e-06,-6e-06,-1e-06,2e-06,2e-06,2e-06,-2e-06,-4e-06,-3e-06,-3e-06,-1e-05,1.8e-05,0,0,-1e-06,2e-06,2e-06,-2e-06,-3e-06,6e-06,-1.6e-05,1.2e-05,-1e-06,2e-06,-4e-06,8e-06,-2e-06,-1e-06,1e-06,0,-6e-06,1.9e-05,8e-06,2.1e-05,4e-06,3.2e-05,4e-06,5.5e-05,-4e-06,1.5e-05,2e-05,-1e-06,5e-06,3e-06,1e-06,-1.8e-05,-7e-06,-1.7e-05,-9e-06,-2e-06,-2.6e-05,1.5e-05,-3.6e-05,-1.8e-05,4.1e-05,1.1e-05,-1.3e-05,2.3e-05,-1.5e-05,-1.8e-05,-4e-06,1.7e-05,1.2e-05,-2.3e-05,-1.1e-05,-1e-05,4e-06,2e-06,-4e-06,8e-06,-3.2e-05,9e-06,-4.7e-05,-1.1e-05,1.7e-05,4e-06,1e-06,-1.3e-05,-1.1e-05,-2.3e-05,6e-06,9e-06,3e-06,4e-06,1.4e-05,1.4e-05,1e-06,7e-06,-6e-06,-9e-06,1.4e-05,1.7e-05,3e-06,2.2e-05,2e-06,1.6e-05,-1.2e-05,1.6e-05,-3.4e-05,8e-06,1.9e-05,-2.4e-05,3e-06,1.3e-05,3e-06,6e-06,-3e-05,-1.5e-05,2.3e-05,-8e-06,0,1.1e-05,8e-06
2e-06,-2e-06,-4e-06,3e-06,-6e-06,2e-06,9e-06,-4e-06,2e-06,3e-06,2e-06,1e-06,-2e-06,-1e-06,6e-06,3e-06,3e-06,2e-06,1e-06,8e-06,-1e-06,-2e-06,1e-06,3e-06,-3e-06,-7e-06,0,4e-06,1.2e-05,-5e-06,3e-06,-2e-06,-1.3e-05,-2e-06,1e-06,1e-06,0,-5e-06,-1e-06,-1.3e-05,-5e-06,-3e-06,1e-06,-2.9e-05,-6e-06,-2.9e-05,1e-05,-1.2e-05,-1e-05,-9e-06,-2e-06,2.3e-05,-1.5e-05,-6e-06,6e-06,-1e-06,-1.8e-05,-2.9e-05,2.2e-05,1e-06,1.3e-05,1e-05,-1.1e-05,0,1.1e-05,-2e-05,1.5e-05,1.6e-05,7e-06,-1.2e-05,-9e-06,8e-06,0,-7e-06,-8e-06,-3e-06,4e-06,1.2e-05,2.3e-05,-2e-05,3.7e-05,4e-06,-6e-06,-7e-06,-2e-06,0,-3e-06,4e-06,-1.1e-05,-6e-06,3e-06,7e-06,3e-06,8e-06,3e-06,4e-06,7e-06,-3e-06,-3.4e-05,-1e-05,-4e-06,2e-05,-2e-06,-2.6e-05,9e-06,2e-06,5e-06,1.7e-05,-1.5e-05,9e-06,-4e-06,-6e-06,1e-05,-3e-06,3.2e-05,5e-06,-2.6e-05,7e-06,-6e-06,-8e-06,-2e-06
0,2e-06,5e-06,-2e-06,-2e-06,-5e-06,-3e-06,-4e-06,-5e-06,-4e-06,-3e-06,0,-3e-06,4e-06,-7e-06,0,-3e-06,-1e-06,7e-06,-1.3e-05,1e-06,-4e-06,4e-06,-1e-06,2e-06,0,-3e-06,-8e-06,0,1e-05,0,-2e-06,3e-06,4e-06,1e-06,3e-06,0,2e-06,2e-06,1.2e-05,0,-6e-06,2e-06,1.8e-05,1.1e-05,3.5e-05,0,1.4e-05,4e-06,1.6e-05,0,-2.1e-05,6e-06,1.8e-05,1e-06,1.9e-05,2.8e-05,5.1e-05,-2e-05,5e-06,1e-05,-2.3e-05,-1.5e-05,1e-06,-3e-06,1.7e-05,-3e-06,-1.4e-05,-9e-06,-5e-06,2e-06,2e-06,3e-06,6e-06,2e-05,-2e-06,1e-06,-1.7e-05,-9e-06,2.6e-05,-2.9e-05,7e-06,-9e-06,1e-05,7e-06,8e-06,1e-06,-3e-06,1e-05,-4e-06,8e-06,-1.3e-05,-8e-06,-1.8e-05,-3e-06,0,-2e-06,3e-06,4e-06,-1e-06,3e-06,-3.4e-05,1.3e-05,-8e-06,1e-06,-9e-06,-1.6e-05,-6e-06,-2e-06,-2e-06,3e-06,-1.2e-05,2e-06,5e-06,-1.1e-05,2e-06,8e-06,0,4e-06,1e-06,3e-06
0,-1e-06,-5e-06,1e-06,4e-06,3e-06,4e-06,2e-06,3e-06,3e-06,3e-06,0,4e-06,-6e-06,-2e-06,-2e-06,2e-06,2e-06,-1e-06,5e-06,0,3e-06,-5e-06,1e-06,0,5e-06,-1e-06,8e-06,-1.4e-05,-8e-06,3e-06,1e-06,6e-06,-3e-06,-2e-06,0,0,-1e-06,-7e-06,-1.3e-05,2e-06,-6e-06,1e-06,-2.1e-05,1e-06,-5.3e-05,-5e-06,-1.4e-05,3e-06,-2.6e-05,1e-06,6e-06,1.1e-05,3e-06,-1.1e-05,-6e-06,-2e-05,-5.5e-05,1.5e-05,-2e-06,-2.4e-05,3e-05,1.2e-05,-2e-06,0,-1e-05,0,1e-05,4e-06,1.3e-05,1e-06,-3e-06,0,1.3e-05,-1.7e-05,-1e-06,-4e-06,2.3e-05,-2e-06,-2.7e-05,1.9e-05,-1.8e-05,1.1e-05,-4e-06,-1.3e-05,-7e-06,-1e-05,1.7e-05,-3e-06,-1.7e-05,8e-06,4e-06,-6e-06,1.4e-05,1e-06,1e-06,-2e-06,3e-06,2.2e-05,3e-06,-8e-06,1.8e-05,-1.7e-05,1.5e-05,-8e-06,1e-06,1.9e-05,1e-06,9e-06,-6e-06,4e-06,7e-06,-1e-05,0,-5e-06,-8e-06,1.6e-05,-7e-06,-2e-06,1e-06,-9e-06
1e-06,-5e-06,4e-06,0,-2e-06,-1e-06,-1e-05,3e-06,1e-06,-1e-06,-1e-06,-1e-06,3e-06,3e-06,5e-06,3e-06,-2e-06,-1e-06,-9e-06,-4e-06,0,0,2e-06,-1e-06,-1e-06,1e-06,1e-06,-2e-06,7e-06,3e-06,-8e-06,2e-06,-1e-06,0,2e-06,2e-06,1e-06,1e-06,3e-06,1e-05,-1e-06,9e-06,-1e-06,2.7e-05,-4e-06,4.7e-05,-2e-06,1.7e-05,-7e-06,8e-06,-3e-06,3e-06,-6e-06,-3.2e-05,1.5e-05,-1.2e-05,1e-06,5.1e-05,-8e-06,-1.1e-05,2.9e-05,-1.4e-05,2e-06,-2e-06,0,5e-06,-6e-06,-2e-06,-3e-06,-1.3e-05,-5e-06,7e-06,4e-06,-1.1e-05,-4e-06,0,6e-06,-2.2e-05,1e-05,3.2e-05,-2.4e-05,1.3e-05,-7e-06,-7e-06,1.8e-05,-4e-06,6e-06,2e-06,-2e-06,5e-06,-3e-06,1e-06,4e-06,-8e-06,-3e-06,-9e-06,1e-06,-6e-06,-2.4e-05,-6e-06,6e-06,-1e-06,7e-06,2e-06,-1.1e-05,3e-06,-3.4e-05,-1.1e-05,3e-06,1.2e-05,-9e-06,2e-06,3e-06,3e-06,6e-06,4e-06,-2.1e-05,6e-06,-3e-06,-2e-06,6e-06
-1e-06,4e-06,-4e-06,0,0,1e-06,1e-05,1e-06,-3e-06,-1e-06,0,3e-06,3e-06,-2e-06,6e-06,-1e-06,1e-06,1e-06,4e-06,-1e-05,0,4e-06,1e-06,-1e-06,1e-06,-1e-06,-1e-06,-3e-06,1e-06,-3e-06,-6e-06,1e-06,0,1e-06,1e-06,0,-2e-06,-1e-06,-9e-06,-8e-06,0,1e-06,3e-06,-1.9e-05,-1e-06,-2.6e-05,2e-06,-1.7e-05,7e-06,-1.2e-05,1e-06,-2e-06,-1.1e-05,2.8e-05,-1.7e-05,9e-06,7e-06,-4e-05,-1e-06,3e-06,-2.5e-05,-4e-06,0,1e-06,-2e-06,-2e-06,-1e-06,0,1e-06,1.5e-05,1.1e-05,-2e-06,-1e-06,-5e-06,4e-06,4e-06,-3e-06,7e-06,-1.3e-05,-3.5e-05,3.3e-05,-1e-05,3e-06,9e-06,-1.6e-05,2e-06,1.5e-05,-7e-06,6e-06,-1.2e-05,4e-06,6e-06,1.1e-05,8e-06,4e-06,8e-06,1e-06,3e-06,1.8e-05,5e-06,-5e-06,-6e-06,0,-4e-06,2.1e-05,1e-06,0,1.8e-05,-1.3e-05,-1e-05,0,5e-06,-1e-06,-5e-06,-1.9e-05,8e-06,1.9e-05,1e-06,5e-06,3e-06,-1e-06
0,-3e-06,3e-06,0,2e-06,1e-06,-5e-06,2e-06,5e-06,2e-06,2e-06,-4e-06,5e-06,0,-5e-06,-1e-06,1e-06,-1e-06,8e-06,1.5e-05,0,-2e-06,-1e-06,0,-1e-06,-2e-06,2e-06,7e-06,-1e-05,7e-06,2e-06,-2e-06,-3e-06,-3e-06,-3e-06,2e-06,2e-06,0,4e-06,4e-06,0,-7e-06,1e-06,1.4e-05,-2e-06,2.3e-05,7e-06,1.1e-05,0,3e-06,-1e-06,5e-06,7e-06,0,1.3e-05,3e-06,4e-06,2.4e-05,8e-06,1.1e-05,1.4e-05,2e-05,1e-06,1e-06,0,-4e-06,1.6e-05,0,1e-06,-1.7e-05,-1e-05,-2e-06,-4e-06,7e-06,1.7e-05,-1e-06,1e-06,7e-06,1.1e-05,3.3e-05,-4.1e-05,7e-06,1e-06,-1e-05,7e-06,1e-06,-1.8e-05,-6e-06,-9e-06,6e-06,-1e-06,-4e-06,-6e-06,-4e-06,-1e-06,-1e-06,-3e-06,3e-06,1e-06,-5e-06,7e-06,1.1e-05,1e-06,7e-06,-1.1e-05,-6e-06,6e-06,-1.9e-05,7e-06,6e-06,8e-06,-3e-06,-3e-06,1e-06,2.3e-05,-5e-06,-1.9e-05,-5e-06,-3e-06,-2e-06,0
-1e-06,6e-06,-3e-06,0,-1e-06,-1e-06,1e-06,0,0,-2e-06,-2e-06,1e-06,3e-06,1e-06,-5e-06,1e-06,-2e-06,0,-4e-06,3e-06,0,1e-06,1e-06,2e-06,1e-06,-1e-06,-2e-06,-5e-06,6e-06,-6e-06,-6e-06,-1e-06,-1e-06,3e-06,1e-06,-1e-06,-1e-06,1e-06,-3e-06,-5e-06,1e-06,-1e-06,-2e-06,-1.4e-05,-4e-06,-4e-05,-6e-06,-4e-06,-6e-06,1e-05,-1e-06,-1.1e-05,1e-05,-1.5e-05,-4e-06,-7e-06,-1.3e-05,-6e-06,-1.1e-05,0,1e-06,-2.9e-05,-6e-06,-3e-06,-2e-06,6e-06,-9e-06,-5e-06,-1e-06,1.3e-05,7e-06,3e-06,3e-06,0,-1.8e-05,-1e-06,1e-06,-1.7e-05,-9e-06,-3e-05,3.9e-05,-5e-06,-4e-06,0,-3e-06,-4e-06,4e-06,-1.4e-05,5e-06,1e-05,-7e-06,0,-5e-06,-5e-06,0,1e-06,2e-06,-1e-06,-1.2e-05,2e-06,-1e-06,-1.7e-05,-3e-06,-3e-06,1.3e-05,6e-06,-9e-06,7e-06,6e-06,-3e-06,-3e-06,-8e-06,-2e-06,-1e-06,-7e-06,-2e-06,0,2e-06,0,1e-06,-2e-06
-1e-06,-5e-06,3e-06,0,0,0,0,0,-4e-06,2e-06,2e-06,-2e-06,4e-06,1e-06,2e-06,-1e-06,2e-06,0,-5e-06,-1e-05,0,-5e-06,-3e-06,-1e-06,-1e-06,0,2e-06,1e-06,2e-06,5e-06,5e-06,-1e-06,6e-06,-2e-06,1e-06,1e-06,2e-06,-1e-06,0,8e-06,0,7e-06,1e-06,1.5e-05,1e-06,4e-05,-4e-06,-1e-06,4e-06,-1e-05,0,1.1e-05,-8e-06,0,-3e-06,6e-06,7e-06,-1.1e-05,1.1e-05,-3e-06,-9e-06,1.9e-05,-5e-06,1e-06,5e-06,-6e-06,-5e-06,8e-06,1e-06,-1e-05,-3e-06,4e-06,-2e-06,2e-06,-2e-06,2e-06,-2e-06,1.9e-05,7e-06,2.6e-05,-3.2e-05,-3e-06,4e-06,5e-06,0,-5e-06,-1e-06,1.7e-05,3e-06,1e-06,0,-6e-06,-3e-06,7e-06,0,-1e-06,0,-3e-06,7e-06,-2e-06,-3e-06,1.2e-05,6e-06,-1.3e-05,-1.6e-05,-2e-06,2e-05,-9e-06,-1e-05,-3e-06,-5e-06,7e-06,1.2e-05,1e-06,2e-06,1e-06,1.6e-05,1e-06,3e-06,-1e-06,2e-06
0,4e-06,-3e-06,0,1e-06,-1e-06,-1e-06,0,4e-06,-3e-06,-1e-06,3e-06,4e-06,-1e-06,4e-06,0,-2e-06,0,0,6e-06,0,2e-06,2e-06,0,0,2e-06,-1e-06,4e-06,-1e-05,-5e-06,2e-06,1e-06,-1e-06,2e-06,-2e-06,-1e-06,0,0,3e-06,-6e-06,-1e-06,0,-1e-06,-1.1e-05,2e-06,-2.1e-05,7e-06,4e-06,-4e-06,1.8e-05,1e-06,-1e-06,-8e-06,9e-06,4e-06,-1e-06,6e-06,2.5e-05,-1.1e-05,-6e-06,1.3e-05,-1.5e-05,1.2e-05,0,-1e-06,7e-06,0,-9e-06,-1e-06,1.2e-05,-4e-06,-1e-06,3e-06,-7e-06,8e-06,1e-06,2e-06,-1.2e-05,-4e-06,-2e-05,2.8e-05,7e-06,-1e-06,-5e-06,3e-06,6e-06,-3e-06,-6e-06,-7e-06,6e-06,-6e-06,1e-06,7e-06,-1e-06,1e-06,-4e-06,-1e-06,0,0,2e-06,1e-06,7e-06,-8e-06,2e-06,2e-06,-1e-06,-1.3e-05,2.1e-05,0,1.1e-05,4e-06,0,-4e-06,-1e-06,-2e-06,-3e-06,-1.9e-05,-1e-06,-2e-06,0,1e-06
0,-4e-06,3e-06,0,-2e-06,1e-06,2e-06,-1e-06,-2e-06,3e-06,0,-2e-06,1e-06,1e-06,-3e-06,1e-06,2e-06,0,4e-06,-5e-06,0,0,0,0,1e-06,1e-06,2e-06,-6e-06,5e-06,5e-06,0,2e-06,-7e-06,-3e-06,0,0,0,0,-2e-06,4e-06,1e-06,-4e-06,-1e-06,1e-05,3e-06,1.8e-05,1e-06,-6e-06,4e-06,-3e-06,0,-1.1e-05,9e-06,6e-06,-6e-06,-7e-06,-1.3e-05,-3.4e-05,8e-06,0,-1.3e-05,2e-05,-2e-06,-2e-06,0,-6e-06,6e-06,6e-06,1e-06,-1.2e-05,6e-06,-1e-06,0,1e-06,2e-06,-2e-06,-1e-06,3e-06,0,1.3e-05,-2.6e-05,-7e-06,-3e-06,-3e-06,-7e-06,-2e-06,8e-06,1.9e-05,7e-06,0,-2e-06,7e-06,2e-06,-1e-06,-1e-06,6e-06,1e-06,2e-06,-4e-06,-1e-06,-1e-06,-1.7e-05,4e-06,1e-05,2e-06,0,5e-06,-1.3e-05,1.2e-05,-1e-05,1e-06,-1e-06,-1e-06,2e-06,-1.3e-05,1e-06,1.3e-05,1e-06,0,2e-06,-1e-06
1e-06,3e-06,-3e-06,0,0,0,0,0,-2e-06,-2e-06,1e-06,0,1e-06,-2e-06,-1e-06,-1e-06,-1e-06,0,0,-6e-06,0,2e-06,-1e-06,0,0,-2e-06,-1e-06,4e-06,2e-06,-3e-06,2e-06,0,3e-06,2e-06,2e-06,0,-1e-06,0,5e-06,-3e-06,0,-1e-06,1e-06,-1.1e-05,2e-06,-3.1e-05,-6e-06,5e-06,0,-1e-06,0,1.3e-05,6e-06,-1.7e-05,8e-06,4e-06,4e-06,3.8e-05,-5e-06,8e-06,8e-06,-1.6e-05,-9e-06,2e-06,0,3e-06,0,-1e-06,-1e-06,7e-06,-4e-06,1e-06,0,5e-06,-8e-06,0,1e-06,5e-06,5e-06,-6e-06,3.1e-05,7e-06,4e-06,6e-06,1.1e-05,-6e-06,-2e-06,-1.8e-05,-5e-06,0,4e-06,-4e-06,-4e-06,-5e-06,-1e-06,-2e-06,0,-2e-06,7e-06,2e-06,0,6e-06,-1e-06,-4e-06,6e-06,3e-06,1.8e-05,8e-06,-8e-06,5e-06,-1e-06,1e-06,-2e-06,-1e-06,1.2e-05,4e-06,-9e-06,1e-06,1e-06,-3e-06,-1e-06
0,-1e-06,3e-06,0,1e-06,0,-1e-06,1e-06,3e-06,1e-06,-1e-06,0,1e-06,0,4e-06,0,1e-06,0,-6e-06,1.3e-05,0,1e-06,1e-06,0,0,-1e-06,0,0,-9e-06,3e-06,-2e-06,-1e-06,6e-06,0,-1e-06,0,0,0,-3e-06,3e-06,-1e-06,5e-06,0,1.2e-05,-1e-06,3.7e-05,3e-06,-2e-06,-2e-06,-4e-06,0,-4e-06,-8e-06,4e-06,-9e-06,7e-06,1e-05,-3.4e-05,2e-06,-2e-06,-1e-06,1e-05,2e-06,0,-3e-06,-1e-06,-7e-06,-2e-06,2e-06,-1e-06,4e-06,-3e-06,0,0,3e-06,2e-06,-1e-06,-1.3e-05,-7e-06,-1e-06,-3.4e-05,-1e-05,-3e-06,-5e-06,-8e-06,3e-06,-3e-06,4e-06,0,-7e-06,0,3e-06,-2e-06,7e-06,1e-06,2e-06,0,1e-06,-5e-06,0,4e-06,5e-06,1e-06,1e-06,-5e-06,-2e-06,-1e-06,-1.5e-05,-3e-06,0,-2e-06,-2e-06,0,0,-5e-06,-1e-06,-6e-06,-3e-06,0,3e-06,2e-06
0,-2e-06,-3e-06,0,-1e-06,0,1e-06,1e-06,-2e-06,-1e-06,1e-06,0,0,0,1e-06,1e-06,-1e-06,0,1e-06,0,0,-1e-06,-2e-06,1e-06,0,1e-06,0,-3e-06,4e-06,-4e-06,1e-06,-1e-06,-4e-06,1e-06,0,0,0,0,4e-06,-4e-06,1e-06,0,-2e-06,-1.2e-05,-2e-06,-2.3e-05,2e-06,3e-06,3e-06,-1e-06,1e-06,-5e-06,-4e-06,1.3e-05,8e-06,-7e-06,-1.1e-05,2.3e-05,0,-5e-06,-5e-06,-3e-06,3e-06,1e-06,1e-06,-1e-06,2e-06,1e-06,-1e-06,-2e-06,-6e-06,1e-06,0,-2e-06,6e-06,0,1e-06,1.1e-05,5e-06,7e-06,3.5e-05,6e-06,0,2e-06,4e-06,2e-06,1e-06,-1.4e-05,4e-06,-1e-06,4e-06,-4e-06,1e-06,-1e-06,0,-4e-06,0,0,-4e-06,1e-06,-5e-06,-6e-06,-3e-06,5e-06,0,-1e-06,5e-06,1.5e-05,8e-06,-3e-06,0,0,-2e-06,-1e-06,1e-05,-1e-06,1.8e-05,1e-06,-1e-06,-3e-06,0
0,1e-06,2e-06,0,0,-1e-06,1e-06,1e-06,-1e-06,0,-1e-06,0,-1e-06,0,-4e-06,-1e-06,0,0,6e-06,-7e-06,0,-1e-06,2e-06,0,0,2e-06,0,5e-06,3e-06,3e-06,-2e-06,0,-3e-06,0,1e-06,0,0,0,-2e-06,3e-06,0,-5e-06,-1e-06,1e-05,-1e-06,1.6e-05,-2e-06,-4e-06,-4e-06,-6e-06,0,5e-06,8e-06,-9e-06,-3e-06,-2e-06,0,-9e-06,-2e-06,-3e-06,6e-06,-7e-06,0,0,1e-06,2e-06,6e-06,1e-06,0,5e-06,3e-06,1e-06,0,-4e-06,-8e-06,-2e-06,0,-4e-06,-3e-06,-1.4e-05,-3.1e-05,-1e-06,1e-06,3e-06,-1e-06,-2e-06,-4e-06,1.1e-05,-4e-06,-4e-06,3e-06,-2e-06,4e-06,-3e-06,0,0,0,1e-06,9e-06,1e-06,2e-06,4e-06,2e-06,-5e-06,-5e-06,2e-06,-9e-06,-1.5e-05,-3e-06,4e-06,-1e-06,2e-06,2e-06,0,-4e-06,0,-1.5e-05,3e-06,2e-06,1e-06,-2e-06
0,-2e-06,-2e-06,0,0,0,-1e-06,0,2e-06,1e-06,1e-06,-1e-06,-2e-06,1e-06,-1e-06,1e-06,0,0,-1e-06,6e-06,0,-1e-06,0,0,0,0,-1e-06,-4e-06,-9e-06,-2e-06,2e-06,1e-06,3e-06,-1e-06,0,0,0,0,0,-2e-06,-1e-06,1e-06,1e-06,-9e-06,-3e-06,-2.7e-05,0,4e-06,2e-06,-3e-06,0,1e-06,2e-06,-8e-06,-4e-06,9e-06,1e-05,-7e-06,3e-06,3e-06,-5e-06,1.2e-05,0,1e-06,2e-06,-2e-06,-1e-06,-1e-06,1e-06,-9e-06,1e-06,-4e-06,1e-06,3e-06,-1e-06,0,-1e-06,0,1e-06,1.9e-05,3e-05,-3e-06,-2e-06,-4e-06,0,-2e-06,3e-06,3e-06,2e-06,-2e-06,-1e-06,5e-06,-2e-06,1e-06,-1e-06,2e-06,-1e-06,-1e-06,-6e-06,-2e-06,1e-06,-7e-06,-1e-06,-7e-06,7e-06,0,0,1.3e-05,-7e-06,-2e-06,0,-1e-06,5e-06,-1e-06,-5e-06,-3e-06,6e-06,-4e-06,-1e-06,0,0
0,4e-06,2e-06,0,0,0,-1e-06,0,-1e-06,-1e-06,1e-06,2e-06,-3e-06,0,3e-06,0,-1e-06,0,-5e-06,-6e-06,0,1e-06,-1e-06,0,0,-1e-06,0,0,3e-06,4e-06,2e-06,1e-06,1e-06,1e-06,0,0,0,0,1e-06,2e-06,1e-06,3e-06,-1e-06,1e-05,1e-06,3.4e-05,1e-06,-7e-06,1e-06,6e-06,0,-2e-06,-8e-06,1.3e-05,6e-06,-4e-06,-1e-05,2.2e-05,-5e-06,6e-06,2e-06,-1.2e-05,-3e-06,-1e-06,0,2e-06,-7e-06,-1e-06,-1e-06,1e-05,-2e-06,-1e-06,-1e-06,2e-06,6e-06,1e-06,1e-06,2e-06,2e-06,-2.2e-05,-2.9e-05,4e-06,2e-06,1e-06,2e-06,4e-06,6e-06,6e-06,1e-06,3e-06,0,1e-06,-3e-06,2e-06,1e-06,-1e-06,0,1e-06,-2e-06,2e-06,0,5e-06,1e-06,4e-06,0,0,9e-06,-1.1e-05,7e-06,0,1e-06,0,-3e-06,1e-06,1e-06,-1e-06,2e-06,1e-06,0,-1e-06,1e-06
0,-3e-06,-2e-06,0,0,0,2e-06,0,0,1e-06,-1e-06,-2e-06,-3e-06,-1e-06,1e-06,-1e-06,2e-06,0,0,-3e-06,0,-1e-06,1e-06,0,0,0,0,4e-06,3e-06,-4e-06,-1e-06,0,-1e-06,-1e-06,0,0,0,0,-5e-06,-3e-06,0,1e-06,-1e-06,-9e-06,2e-06,-2.4e-05,-1e-06,9e-06,-3e-06,-3e-06,0,0,0,-2e-06,-5e-06,-4e-06,1e-06,-3.3e-05,5e-06,-1e-06,2e-06,1.5e-05,-1e-06,0,0,-1e-06,1e-06,4e-06,1e-06,-1e-05,1e-06,0,1e-06,-2e-06,5e-06,0,0,-6e-06,-2e-06,2.5e-05,3.2e-05,-8e-06,0,4e-06,-6e-06,2e-06,-4e-06,-5e-06,-4e-06,1e-06,-2e-06,-1e-06,0,0,0,2e-06,-1e-06,0,8e-06,-2e-06,0,7e-06,-1e-06,4e-06,2e-06,-2e-06,-9e-06,1.4e-05,1e-06,-1e-06,-1e-06,-1e-06,-1e-06,0,-3e-06,2e-06,-1.4e-05,2e-06,1e-06,2e-06,1e-06
