0.001031,0.001136,0.001328,0.003156,0.000456,0.002518,0.001213,0.001645,0.002045,0.002398,0.001247,0.000279,0.001354,0.001017,0.000235,0.001238,0.001053,0.000165,0.001207,0.00051,0.001009,0.000337,0.001791,9.6e-05,0.000523,1.8e-05,0.000151,0.001275,0.001155,0.001555,0.000503,0.001267,0.000513,0.001487,0.001419,0.002598,0.001073,0.000426,0.000531,0.000914,0.001101,0.001746,0.001306,0.001781,8e-06,0.000862,0.000948,0.000162,0.000261,0.001406,0.000819,0.000369,0.001408,0.000367,0.000848,0.001356,0.000435,0.000204,0.000663,0.000569,0.000422,0.002282,0.002326,0.001355,0.001676,0.000959,0.001139,1.2e-05,0.000729,0.000772,0.000422,0.000508,0.00214,0.001587,0.000518,0.000751,0.000349,0.000521,0.001444,0.000224,0.000708,0.000786,6.3e-05,0.00214,0.001558,0.000465,0.000579,0.000172,0.000468,0.002135,0.000953,0.001222,0.000582,0.000501,0.000713,0.000208,0.001275,0.000574,0.000726,0.000412,0.000913,0.00058,0.000403,0.000703,0.001252,0.00138,0.000163,0.001499,0.000103,0.000929,0.00073,0.000696,0.000386,0.000916,0.000268,0.000294,0.000581,0.000233,0.001158,0.001257,0.000138
0.002654,0.000246,0.00396,0.004865,0.003657,0.003059,0.003472,0.002693,0.001708,0.005465,0.0065,0.006311,0.003488,0.001189,0.001793,0.000676,0.002558,0.001253,0.003069,0.000545,0.002703,0.001918,0.002297,0.004713,0.003948,0.004029,0.001163,0.003792,0.000791,0.003726,0.002389,0.001977,0.002264,0.003777,0.001887,0.004659,0.002753,0.002164,0.000863,0.00269,0.004965,0.002633,0.002731,0.002313,0.001858,0.000485,0.002156,0.000405,0.000486,0.003405,0.002609,0.000924,0.001928,0.000558,0.002508,0.003468,0.000863,0.000707,0.001029,0.001675,0.001079,0.004638,0.004459,0.003193,0.004775,0.00329,0.002697,0.000609,0.001238,0.001495,0.000238,0.001839,0.0049,0.004065,0.003145,0.004808,0.002402,0.004145,0.004481,0.0014,0.002364,0.002549,0.000131,0.0042,0.004515,0.003301,0.001801,0.000622,0.002052,0.004711,0.00426,0.00089,0.002867,0.00238,0.001662,0.001318,0.002593,0.000722,0.003395,0.001513,0.000874,0.000408,0.001427,0.001341,0.003334,0.003035,0.000868,0.002667,0.001714,0.001601,0.00221,0.000316,0.001914,0.001254,0.000971,0.000709,0.001488,0.000676,0.001945,0.002316,0.000315
0.003851,0.006106,0.006891,0.003563,0.004624,0.002197,0.002718,0.003551,0.004048,0.006437,0.005747,0.004153,0.00146,0.000659,0.001485,0.001985,0.003128,0.001808,0.001433,0.001206,0.002915,0.005807,0.005374,0.008451,0.002109,0.002392,0.00029,0.003098,0.001732,0.002752,0.001529,0.002821,0.001365,0.004611,0.006031,0.004997,0.006209,0.002279,0.002844,0.001936,0.006226,0.001441,0.002362,0.001637,0.001449,0.001192,0.002161,0.000798,0.000128,0.003042,0.002,0.000697,0.00308,0.00061,0.003274,0.004641,0.001683,0.000811,0.001275,0.002109,0.002762,0.006344,0.005208,0.003689,0.005492,0.004158,0.003234,0.001121,0.002249,0.002869,0.000804,0.001219,0.005284,0.005337,0.000575,0.005215,0.000337,0.002976,0.004263,0.003435,0.001382,0.002708,0.002457,0.005183,0.00296,0.001981,0.000373,0.001652,0.002889,0.001246,0.002662,0.002655,0.004517,0.002417,0.001027,0.000999,0.002588,0.001575,0.00308,0.001926,0.001072,0.001903,0.000738,0.001197,0.002966,0.002199,0.001453,0.003041,0.002148,0.002474,0.003631,0.002929,0.003004,0.002434,0.000673,0.001134,0.0015,0.001563,0.003,0.003104,0.000752
0.00579,0.008332,0.002044,0.001288,0.004476,0.002437,0.006534,0.002094,0.004663,0.006342,0.004494,0.007845,0.006139,0.003718,0.001549,0.004517,0.002655,0.00132,0.00177,0.003696,0.003008,0.00827,0.003233,0.006368,0.002244,0.003311,0.001413,0.004141,0.002587,0.001037,0.000834,0.003301,0.003097,0.005514,0.004654,0.006622,0.006775,0.002021,0.00453,0.001362,0.00347,0.005634,0.007638,0.003071,0.003682,0.000831,0.002517,0.001398,0.000727,0.004959,0.001923,0.001148,0.004841,0.003195,0.00515,0.004157,0.004696,0.002265,0.00298,0.0049,0.007961,0.013497,0.010223,0.008468,0.009482,0.003737,0.006144,0.004439,0.004199,0.002821,0.0045,0.004448,0.001862,0.003463,0.007119,0.00708,0.001514,0.002316,0.003362,0.005154,0.002916,0.003485,0.002417,0.00459,0.004333,0.002045,0.002196,0.002148,0.002201,0.002243,0.00679,0.005889,0.00265,0.004279,2e-04,0.002559,0.002298,0.002777,0.005795,0.001341,0.001633,0.00041,0.002211,0.001781,0.003308,0.002846,0.001076,0.004533,0.00107,0.00534,0.005047,0.003869,0.003239,0.002678,0.000976,0.002197,0.003058,0.002928,0.002113,0.004017,0.003656
0.010221,0.002822,0.013144,0.010691,0.00413,0.008665,0.01425,0.00928,0.00548,0.008776,0.010572,0.006743,0.002301,0.003059,0.002527,0.00399,0.006373,0.004837,0.00147,0.006199,0.003128,0.011165,0.013288,0.006954,0.003607,0.002861,0.002414,0.0062,0.002923,0.00163,8.2e-05,0.000572,0.00588,0.005505,0.00955,0.012326,0.012231,0.008484,0.004279,0.006293,0.006487,0.007482,0.016971,0.010244,0.008912,0.006526,0.004265,0.005999,0.001825,0.010142,0.011271,0.005532,0.009196,0.004879,0.012239,0.012082,0.011972,0.007731,0.009123,0.014304,0.018153,0.021547,0.029506,0.032353,0.027351,0.018358,0.010799,0.010138,0.005187,0.006424,0.008406,0.005193,0.015015,0.007675,0.004464,0.010786,0.007398,0.006021,0.001851,0.001599,0.002861,0.003562,0.003932,0.007071,0.006889,0.005853,0.004071,0.002798,0.004097,0.002331,0.006535,0.001882,0.004778,0.00447,0.002867,0.003328,0.005625,0.00461,0.005839,0.003859,0.003942,0.005335,0.00091,0.000263,0.004172,0.005152,0.002865,0.006543,0.008602,0.009472,0.008196,0.010998,0.010782,0.00946,0.005992,0.001467,0.001376,0.006348,0.006722,0.004473,0.006486
0.017263,0.0207,0.027667,0.024243,0.022129,0.017261,0.021677,0.008572,0.009928,0.011816,0.019021,0.022934,0.017588,0.00703,0.004248,0.007742,0.004232,0.005373,0.006979,0.00882,0.01079,0.017003,0.023909,0.025738,0.010445,0.00055,0.005084,0.008237,0.012957,0.008814,0.004751,0.006191,0.01387,0.007685,0.008905,0.005897,0.021901,0.02106,0.018238,0.013022,0.007228,0.006148,0.014144,0.012306,0.009802,0.005066,0.003669,0.002107,0.001809,0.011361,0.006053,0.000131,0.009141,0.003519,0.009734,0.002429,0.005865,0.002481,0.009044,0.010854,0.005339,0.008,0.012941,0.009715,0.008197,0.008687,0.007736,0.011481,0.006864,0.012699,0.007368,0.015528,0.021321,0.026129,0.020099,0.009614,0.008352,0.000832,0.008701,0.001733,0.004628,0.006812,0.005726,0.005134,0.006629,0.005877,0.003796,0.004086,0.007322,0.009454,0.012286,0.004499,0.006557,0.005544,0.001493,0.006389,0.009355,0.004003,0.003022,0.006091,0.004639,0.012201,0.004024,0.004981,0.005319,0.003907,0.000951,0.00543,0.010867,0.004313,0.006429,0.016343,0.01336,0.0046,0.008788,0.006174,0.005094,0.007155,0.003981,0.003826,0.006021
0.006497,0.011836,0.007663,0.005876,0.005722,0.005538,0.012217,0.01556,0.013963,0.003342,0.012803,0.006432,0.007276,0.004199,0.006989,0.009852,0.007565,0.003651,0.009572,0.003255,0.006414,0.016761,0.008017,0.007432,0.014321,0.002828,0.008475,0.004018,0.017544,0.008915,0.004666,0.013562,0.011635,0.020128,0.023014,0.016938,0.018905,0.009607,0.021062,0.002161,0.007529,0.011964,0.001861,0.009265,0.003443,0.008561,0.008199,0.006214,0.002874,0.006131,0.011183,0.009794,0.010059,0.014187,0.007019,0.007587,0.004104,2.8e-05,0.006764,0.003292,0.011018,0.008055,0.002711,0.004955,0.012401,0.011286,0.009474,0.017567,0.017969,0.02631,0.024199,0.027893,0.012327,0.016584,0.001106,0.009818,0.014972,0.017123,0.019753,0.018403,0.004757,0.006267,0.007316,0.006488,0.011895,0.009578,0.003239,0.011533,0.009243,0.019325,0.009998,0.007908,0.009297,0.007123,0.006516,0.012115,0.006554,0.000655,0.005858,0.010094,0.005558,0.014839,0.014223,0.009879,0.009149,0.005235,0.007145,0.005204,0.008755,0.017869,0.008867,0.011468,0.004688,0.001747,0.006223,0.004559,0.011885,0.008253,0.01048,0.009613,0.001394
0.015242,0.007126,0.008057,0.004238,0.005798,0.005517,0.001439,0.01477,0.010174,0.012834,0.002555,0.010876,0.018165,0.01862,0.009716,0.019094,0.013999,0.013762,0.007446,0.010017,0.003358,0.005841,0.005956,0.004744,0.016686,0.02214,0.019269,0.02047,0.015877,0.003422,0.010388,0.013252,0.021481,0.014617,0.01348,0.018356,0.008766,0.012985,0.012433,0.020956,0.024663,0.027302,0.021166,0.020971,0.014883,0.014416,0.021797,0.012292,0.00337,0.003246,0.015646,0.025463,0.014112,0.012545,0.003986,0.015285,0.012917,0.004401,0.007923,0.006468,0.007651,0.00535,0.001108,0.003909,0.009111,0.000931,0.007334,0.010434,0.021305,0.011301,0.015459,0.006202,0.013488,0.01152,0.007952,0.009626,0.015007,0.014516,0.011009,0.017614,0.027287,0.026284,0.026356,0.027103,0.028381,0.027923,0.028061,0.027733,0.018993,0.015889,0.021767,0.026413,0.02872,0.027904,0.028497,0.028353,0.029569,0.018673,0.018969,0.022854,0.01164,0.012899,0.024668,0.028717,0.029539,0.028386,0.028522,0.014874,0.012956,0.021711,0.016227,0.003599,0.006626,0.005362,0.004111,0.010499,0.020914,0.02702,0.029302,0.028765,0.022084
0.00925,0.003181,0.005442,0.005685,0.007665,0.006738,0.005391,0.01338,0.019311,0.016365,0.012332,0.011814,0.014946,0.017169,0.021792,0.012862,0.018046,0.016339,0.022603,0.010296,0.014634,0.013614,0.007839,0.0034,0.014821,0.016591,0.017988,0.012896,0.012015,0.007144,0.011637,0.016291,0.008682,0.01022,0.005251,0.007979,0.002592,0.012245,0.010848,0.013983,0.007556,0.006833,0.002664,0.012741,0.018587,0.020631,0.012634,0.018224,0.017297,0.003814,0.012994,0.008219,0.00941,0.01146,0.017579,0.015291,0.006613,0.011848,0.00099,0.005484,0.008569,0.00644,0.003856,0.004425,0.002579,0.001423,0.002935,0.011347,0.005806,0.007333,0.004579,0.00509,0.003246,0.006422,0.008329,0.016493,0.002617,0.016719,0.015305,0.010583,0.009818,0.012366,0.011871,0.007831,0.006088,0.008808,0.012525,0.005432,0.009065,0.003843,0.006633,0.010134,0.008257,0.009258,0.009953,0.00526,0.010688,0.011653,0.00913,0.01101,0.007404,0.009727,0.008442,0.00694,0.009934,0.011673,0.00937,0.007735,0.011827,0.003373,0.002771,0.003751,0.005396,0.005114,0.001159,0.008034,0.007619,0.009496,0.007476,0.007752,0.00715
0.001399,0.010733,0.004206,0.00897,0.015428,0.010841,0.002477,0.005944,0.006233,0.004688,0.008296,0.004502,0.006671,0.007258,0.005995,0.006889,0.009236,0.011933,0.009195,0.009832,0.018173,0.003792,0.002715,0.009173,0.003896,0.005712,0.003544,0.005225,0.005331,0.016574,0.01192,0.009628,0.00453,0.010004,0.004645,0.002801,0.008227,0.004399,0.001407,0.003445,0.008907,0.006378,0.00331,0.004876,0.009692,0.00426,0.005003,0.008267,0.010129,0.015299,0.002396,0.005883,0.008574,0.003316,0.011278,0.00182,0.00839,0.014061,0.011309,0.006823,0.003568,0.00441,0.002518,0.003682,0.005286,0.005185,0.006611,0.005913,0.005371,0.005334,0.004009,0.004069,0.004368,0.00659,0.004948,0.007878,0.011215,0.005869,0.007727,0.009529,0.00422,0.004413,0.006232,0.008831,0.005334,0.003821,0.007356,0.007457,0.011076,0.008648,0.004978,0.003552,0.002373,0.005315,0.007953,0.005435,0.002518,0.006847,0.012832,0.007033,0.001677,0.00282,0.00503,0.005475,0.004684,0.004855,0.008185,0.004682,0.008152,0.004493,0.003652,0.000704,0.003086,0.003086,0.0045,0.0059,0.004165,0.002964,0.004624,0.004586,0.003959
0.004672,0.00539,0.004403,0.008193,0.006417,0.005944,0.006902,0.005235,0.002205,0.005863,0.00802,0.004843,0.005506,0.000712,0.003457,0.006739,0.001174,0.006924,0.002951,0.01214,0.003636,0.007031,0.001963,0.007965,0.006365,0.004318,0.002401,0.00223,0.007869,0.012129,0.002674,0.001784,0.003828,0.006482,0.002581,0.003979,0.002423,0.003617,0.003139,0.003334,0.001233,0.002149,0.003864,0.003604,0.004126,0.004357,0.005485,0.002152,0.009216,0.006118,0.002655,0.002359,0.004836,0.003009,0.002639,0.002724,0.007251,0.003253,0.001602,0.006157,0.004465,0.002896,0.001409,0.00331,0.003675,0.003655,0.005419,0.006695,0.003853,0.003488,0.004552,0.001918,0.002996,0.002603,0.007349,0.005154,0.006535,0.003911,0.004374,0.000631,0.002668,0.001596,0.001966,0.003205,0.000722,0.000717,0.00251,0.002219,0.002583,0.005365,0.005529,0.00434,0.00308,0.001963,0.002693,0.001647,0.002437,0.006972,0.002718,0.003956,0.00505,0.006788,0.004706,0.003428,0.002045,0.001847,0.003416,0.002576,0.003683,0.005306,0.009147,0.008511,0.007033,0.004742,0.003525,0.003385,0.001991,0.001898,0.002573,0.002275,0.002886
0.00385,0.005893,0.003638,0.005188,0.000551,0.00069,0.003172,0.001241,0.004014,0.003189,0.002347,0.004985,0.003791,0.004897,0.005785,0.001204,0.001532,0.002634,0.002217,0.009668,0.004914,0.002697,0.002338,0.001924,0.003339,0.00255,0.002647,0.001249,0.003194,0.003622,0.003901,0.004869,0.002767,0.001728,0.002972,0.001647,0.001387,0.004537,0.003084,0.002911,0.000482,0.002464,0.002509,0.004163,0.003372,0.001524,0.004788,0.002902,0.00413,0.001669,0.002359,0.002885,0.001426,0.003204,0.004281,0.003013,0.00176,0.001311,0.001633,0.00213,0.002458,0.000825,0.000845,0.00233,0.000957,0.002354,0.00418,0.002741,0.002017,0.002292,0.002999,0.002971,0.001593,0.001406,0.004171,0.001191,0.00457,0.002399,0.00241,0.002214,0.002634,0.001283,0.002712,0.000555,0.00251,0.001703,0.001956,0.002621,0.004212,0.002213,0.002455,0.00216,0.003032,0.000952,0.003247,0.002102,0.002904,0.004024,0.005252,0.001754,0.003319,0.00273,0.002579,0.002115,0.002034,0.001444,0.002835,0.001542,0.004708,0.002703,0.006645,0.004852,0.00226,0.001053,0.000841,0.002667,0.002663,0.002644,0.002097,0.001107,0.000662
0.003313,0.003464,0.002122,0.005039,0.001105,0.001416,0.002159,0.00272,0.003008,0.003275,0.002622,0.000367,0.003013,0.002673,0.002603,0.002386,0.001599,0.00291,0.001533,0.004521,0.003382,0.002603,0.001402,0.00116,0.002126,0.001904,0.002335,0.001085,0.001019,0.001967,0.002241,0.003324,0.002164,0.001466,0.002177,0.000834,0.000622,0.002089,0.001165,0.002368,0.001101,0.001103,0.000356,0.002909,0.001546,0.003005,0.003068,0.001928,0.002105,0.000846,0.001903,0.002549,0.001459,0.001989,0.001635,0.001874,0.001776,0.001664,0.000749,0.001961,0.002105,0.001446,0.001815,0.001948,0.001712,0.002132,0.003022,0.003055,0.002055,0.001443,0.002063,0.002271,0.002111,0.001747,0.00157,0.000842,0.003627,0.001324,0.003503,0.00329,0.001666,0.001289,0.002199,0.000829,0.001101,0.001619,0.001939,0.002158,0.004476,0.002793,0.002314,0.001448,0.000694,0.000918,0.001919,0.001323,0.00132,0.003446,0.003726,0.003414,0.001999,0.000717,0.001933,0.002012,0.001269,0.001712,0.002313,0.001315,0.00261,0.002757,0.003239,0.003225,0.002067,0.001239,0.000621,0.001999,0.002697,0.00279,0.001783,0.001025,0.000709
0.004677,0.002227,0.000561,0.003832,0.003707,0.001982,0.001773,0.000639,0.000839,0.001154,0.00192,0.002689,0.00243,0.00167,0.002566,0.002075,0.002356,0.00179,0.001078,0.000217,0.001597,0.00078,0.001208,0.000683,0.002364,0.001293,0.001674,0.001151,0.001124,0.003337,0.002276,0.001356,0.002038,0.002059,0.000985,0.001648,0.001521,0.002139,0.00126,0.002452,0.001395,0.001645,0.001594,0.000957,0.001867,0.001551,0.00199,0.002836,0.001022,0.001238,0.001608,0.001881,0.001404,0.001047,0.001276,0.002144,0.002472,0.000218,0.000538,0.001378,0.001044,0.001216,0.002147,0.002281,0.001397,0.000804,0.00238,0.001931,0.001559,0.001354,0.00167,0.00234,0.001012,0.00138,0.00443,0.003718,0.004572,0.001721,0.001037,0.001894,0.001533,0.001248,0.002328,0.000533,0.001949,0.001961,0.002254,0.00149,0.001404,0.003617,0.003305,0.001658,0.001549,0.000914,0.001582,0.001442,0.002076,0.004594,0.003133,0.002692,0.002192,0.003733,0.001616,0.001876,0.000882,0.000986,0.001668,0.000375,0.001564,0.002329,0.000804,0.000829,0.001945,0.001444,0.002326,0.001369,0.003041,0.001319,0.001176,0.000858,0.000876
0.003349,0.001723,0.004094,0.001923,0.00224,0.00614,0.003853,0.003454,0.000794,0.001819,0.001841,0.003343,0.000646,0.00172,0.002206,0.000783,0.002771,0.002713,0.000704,0.001386,0.001819,0.001188,0.003389,0.002378,0.002258,0.000876,0.001826,0.001044,0.002601,2e-04,0.002206,0.003751,0.000796,0.001033,0.001368,0.001298,0.001692,0.002041,0.001547,0.001847,0.001159,0.00102,0.001938,0.000895,0.002574,0.001472,0.001262,0.001603,0.001415,0.000818,0.001964,0.00154,0.000934,0.00097,0.001883,0.001692,0.002493,0.001463,0.000873,0.001399,0.000221,0.000251,0.001524,0.002211,0.00232,0.001845,0.002558,0.001879,0.001755,0.001286,0.001158,0.001799,0.001213,0.001663,0.003417,0.001304,0.002283,0.000728,0.002324,0.00102,0.001981,0.000946,0.00153,0.001905,0.00056,0.001898,0.001272,0.001929,0.004752,0.001131,0.003661,0.003933,0.000457,0.001063,0.001602,0.002287,0.000589,0.004968,0.002801,0.002146,0.001882,0.001283,0.001856,0.001347,0.001345,0.000868,0.00161,0.0014,0.003691,0.002497,0.000307,0.003601,0.000676,0.002537,0.003003,0.003751,0.002063,0.00178,0.000737,0.000846,0.000797
0.001588,0.001837,0.003044,0.002391,0.000925,0.004975,0.004433,0.000936,0.000371,0.00181,0.001726,0.001617,0.002074,0.001001,0.001673,0.001127,0.002209,0.001143,0.001081,0.001262,0.000805,0.002613,0.003027,0.004752,0.003523,0.000583,0.001521,0.001657,0.002927,0.001545,0.003037,0.002155,0.001202,0.000333,0.001868,0.001965,0.000711,0.001865,0.000686,0.001147,0.000933,0.000869,0.000935,0.001411,0.002525,0.001403,0.00098,0.000855,0.000657,0.000692,0.00081,0.001371,0.000217,0.000949,0.000654,0.000355,0.000965,0.000169,0.001151,0.001903,0.0015,0.000992,0.001325,0.001682,0.002104,0.000692,0.001051,0.000612,0.00126,0.000986,0.001763,0.002309,0.000415,0.001535,0.001098,0.001432,0.00115,0.000727,0.003651,0.00282,0.001863,0.001024,0.000711,0.000636,0.000713,0.001362,0.00145,0.001532,0.003521,0.001343,0.000717,0.001501,0.00087,0.000845,0.001374,0.002172,0.001386,0.003911,0.001595,0.00094,0.001123,0.001524,0.001612,0.001488,0.000852,0.001083,0.001485,0.00245,0.001169,0.001637,0.000578,0.002801,0.002033,0.001566,0.000938,0.00125,0.000859,0.001357,0.000859,0.000457,0.000736
0.002512,0.002383,0.001386,0.000644,0.001284,0.00276,0.001909,0.000522,0.000307,0.001966,0.002144,0.000259,0.001254,0.001323,0.001476,0.001276,0.002588,0.001841,0.000968,0.001717,0.001221,0.002131,0.002331,0.001462,0.000948,0.000448,0.001624,0.001585,9.6e-05,0.001859,0.00328,0.002346,0.001775,0.001728,0.001452,0.001626,0.001024,0.000734,0.001503,0.001149,0.001578,0.000276,0.001873,0.001607,0.001548,0.001022,0.00095,0.00082,0.000771,0.001302,0.000751,0.001714,0.001103,0.001636,0.000533,0.001065,0.001009,0.000486,0.000941,0.001495,0.000601,0.001657,0.001299,0.001503,0.000941,0.000845,0.000908,0.002771,0.000969,0.001301,0.001674,0.001483,0.001745,0.00055,0.002771,0.000131,0.000646,0.001067,0.002434,0.000787,0.001509,0.00053,0.001374,0.000178,0.001082,0.000758,0.001179,0.001143,0.000898,0.002301,0.001677,0.002665,0.000738,0.000981,0.001834,0.001335,0.001004,0.002861,0.001334,0.000914,0.001226,0.001854,0.001135,0.00141,0.000478,0.000747,0.001394,0.001448,0.001844,0.001725,0.001701,0.001636,0.000795,0.001684,0.001122,0.001292,0.001577,0.001596,0.000674,0.000313,0.000434
0.003169,0.000932,0.001281,0.00049,0.000873,0.003674,0.001917,0.00027,0.000345,0.00173,0.001197,0.000891,0.001215,0.000899,0.001056,0.000832,0.002081,0.00092,0.00067,0.00234,0.000507,0.001308,0.001008,0.001098,0.001894,0.000297,0.001598,0.000592,0.000977,0.000537,0.002704,0.001998,0.000908,0.001624,0.001759,0.001856,0.000804,0.001318,0.000874,0.001728,0.001156,0.000778,0.001417,0.000713,0.00077,0.001314,0.000395,0.001052,0.000767,0.000895,0.001839,0.00093,0.001243,0.00075,0.001208,0.000217,0.000386,0.000271,0.000805,0.00169,0.001245,0.001657,0.001629,0.00148,0.001226,0.001716,0.000993,0.00103,0.001525,0.000736,0.001357,0.001087,0.001236,0.000897,0.001801,0.001788,0.000576,0.001163,0.000982,0.001487,0.00071,0.001082,0.00077,0.000682,0.000284,0.001072,0.001377,0.001379,0.002841,0.001661,0.003089,0.00131,0.000841,0.00084,0.001324,0.001944,0.00078,0.002275,0.000403,0.00132,0.00147,0.001026,0.001569,0.00129,0.00075,0.000641,0.001257,0.001507,0.001422,0.001742,0.002803,0.001023,4e-04,0.000385,0.000676,0.001858,0.001593,0.001304,0.000792,0.000317,0.000245
0.001704,0.002474,0.001985,0.000156,0.001022,0.003355,0.001762,0.001241,0.001067,0.001123,0.002061,0.000704,0.000853,0.000865,0.001453,0.000655,0.001935,0.001512,0.000391,0.001511,0.001096,0.000243,0.001498,0.000893,0.001505,0.000429,0.001566,0.000511,0.001767,0.001466,0.002248,0.000684,0.001111,0.001417,0.001036,0.00077,0.001395,0.001212,0.001254,0.002107,0.001837,0.000541,0.000487,0.000935,0.001305,0.000689,0.000754,0.000659,0.001549,0.000959,0.001479,0.00154,0.000349,0.000858,0.001607,0.001074,8e-04,0.00026,0.000357,0.001485,0.001378,0.001182,0.001651,0.001193,0.000689,0.001749,0.001367,0.001572,0.001247,0.000639,0.000839,0.001043,0.000971,0.001353,0.001113,0.002469,0.002048,0.001133,0.001586,0.001767,0.000599,0.001109,0.000753,0.00119,0.000887,0.000957,0.001159,0.001098,0.001944,0.000793,0.002334,0.000584,0.000606,0.001348,0.001597,0.001762,0.000445,0.001575,0.000797,0.001694,0.001948,0.002598,0.001747,0.00119,0.000661,8e-04,0.001164,0.003989,0.002282,0.001548,0.001997,0.00284,0.000958,0.001734,0.001151,0.000775,0.001105,0.000742,0.000744,0.000449,0.000997
0.001687,0.001711,0.001032,0.001551,0.001368,0.001646,0.000989,0.001393,0.001012,0.000683,0.001784,0.000845,0.000823,0.000563,0.000715,0.001431,0.001749,0.000931,0.000803,0.001083,0.000481,0.001787,0.000953,0.000485,0.001449,0.000592,0.001524,0.00065,0.001649,0.000438,0.002057,0.001152,0.001464,0.000582,0.000586,0.001009,0.001847,0.000681,0.001471,0.00113,0.001611,0.001564,0.00033,0.000126,0.000727,0.00104,0.001378,0.000782,0.001375,0.001638,0.001149,0.001328,0.000845,0.000575,0.000622,0.000751,0.001315,0.000301,0.00075,0.001099,0.000218,0.001622,0.001056,0.001444,0.000681,0.000996,0.003184,0.000673,0.002161,0.001649,0.000383,0.001207,0.000671,0.001702,0.003505,0.000766,0.001347,0.000276,0.002285,0.001587,0.000161,0.00151,0.000374,0.002104,0.001316,0.001314,0.000292,0.001838,0.001021,0.002175,0.000373,0.001753,0.000577,0.001377,0.000851,0.001672,0.00157,0.002246,0.000377,0.000743,0.001261,0.002245,0.001038,0.000879,0.001217,0.001018,0.000821,0.004933,0.002189,0.002272,0.001383,0.002428,0.003728,0.001202,0.000609,0.001144,0.001528,0.000746,0.000626,0.000103,0.001208
0.002692,0.001234,0.000773,0.00066,0.001,0.001266,0.001419,0.000282,0.00123,0.001811,0.001578,0.001649,0.001246,0.001221,0.000731,0.000974,0.002072,0.000816,0.000849,0.000663,0.00138,0.001565,0.001924,0.002259,0.002306,0.000779,0.000407,0.00113,0.001285,0.000423,0.000746,0.000688,0.001065,0.000462,0.001291,0.001134,0.001573,0.002622,0.002552,0.002464,0.000767,0.001507,0.001327,0.000894,0.000513,0.001757,0.001318,0.001294,0.000314,0.000704,0.001365,0.001462,0.000948,0.000316,0.001246,0.000858,0.000488,0.000929,0.000665,0.001249,0.000529,0.000745,0.001113,0.001658,0.00107,0.000748,0.001716,0.001744,0.002498,0.001059,0.001287,0.000823,0.000808,0.001666,0.001874,0.002054,0.001187,0.000925,0.001784,0.002642,0.000415,0.001614,0.000602,0.000672,0.001972,0.001587,0.000547,0.001764,0.000198,0.001234,0.001204,0.000895,0.001511,0.000755,0.001502,0.001108,0.001001,0.00101,0.001583,0.001898,0.002259,0.001655,0.00205,0.001238,9e-04,0.001139,0.001535,0.003431,0.003247,0.001362,0.000713,0.000465,0.002203,0.001739,0.001535,0.001695,0.001508,0.000412,0.001283,0.000948,0.000407
0.001428,0.001507,0.001503,0.000612,0.000894,0.000953,0.001735,0.002118,0.001206,0.002031,0.001734,0.000525,0.001044,0.001807,0.002063,0.00058,0.001253,0.001728,0.002081,0.001042,0.001036,0.001056,0.001193,0.000626,0.001607,0.000175,0.000546,0.00089,0.000656,0.001399,0.002324,0.002328,0.001863,0.00232,0.002307,0.000765,0.000709,0.001085,0.000696,0.001568,0.000382,0.001773,0.001041,0.001466,0.001588,0.001397,0.000622,0.001492,0.000501,0.001198,0.00174,0.001062,0.001928,0.001218,0.001605,0.000524,0.000695,0.000528,0.000789,0.000699,0.00065,0.00104,0.000645,0.000543,0.000908,0.000246,0.000895,0.001032,0.001091,0.001509,0.000551,0.000811,9e-05,0.001413,3e-04,0.000391,0.000439,0.001695,0.000644,0.001408,0.002163,0.001864,0.000409,0.001427,0.001953,0.0027,0.00133,0.00129,0.00212,0.001306,0.000861,0.001064,0.002414,0.002731,0.002044,0.001676,0.002911,0.001673,0.000786,0.001915,0.002729,0.002009,0.001232,0.002431,0.002935,0.002992,0.001899,0.002293,0.000468,0.001577,0.000411,0.00109,0.000343,0.000836,0.001092,0.000422,0.000652,0.00151,0.002701,0.002202,0.001146
0.000432,0.00017,0.000388,0.000563,0.000576,0.000228,0.000907,0.000891,0.000555,0.000893,0.000739,0.000872,0.000424,0.000758,0.000485,0.000514,0.000607,0.000355,0.001018,0.000511,0.001319,0.00126,0.00056,0.000346,0.000528,0.001405,0.00054,0.000427,0.000441,5.1e-05,0.001067,0.000392,0.000218,0.001082,0.000425,0.000865,0.000432,0.000423,0.000204,0.000878,0.000796,0.000118,0.000723,0.000275,0.000561,0.001113,0.000632,0.000705,0.00029,0.000608,0.000218,0.000412,0.00011,0.000149,0.000627,6.6e-05,0.000385,0.000224,0.000219,0.000268,0.000193,0.000268,0.000141,0.000419,0.000543,0.000251,0.000409,0.000554,0.000487,0.000323,0.000438,0.000115,0.000146,0.000544,0.000189,0.000251,0.000641,0.001046,0.000993,0.000225,0.001085,0.001112,0.00146,0.000202,0.000323,0.000586,0.000844,0.000311,0.000524,0.000846,0.00064,0.001168,0.000136,0.000587,0.000324,0.000346,0.000839,4.2e-05,0.000472,0.000844,0.00039,0.000149,0.000424,0.000393,0.001049,0.000892,0.000303,0.000284,0.000363,0.000885,0.000476,0.000545,0.00021,0.000208,0.000259,0.000429,0.000311,0.000803,0.000588,0.000257,0.000363
0.000806,0.000416,0.00047,0.000524,0.000796,0.000645,0.001008,0.00074,0.000643,0.000374,0.000253,0.000306,0.000443,0.000302,0.000815,0.000448,0.000359,0.000597,0.000749,0.000669,0.000924,0.000496,0.00035,0.000536,7.2e-05,0.001122,0.001365,0.000592,0.000972,0.000822,0.000151,0.000848,0.001,0.000287,0.000226,0.000499,0.000348,0.000685,0.000696,0.000546,0.000603,0.000613,0.000386,0.000537,0.000373,0.001108,0.000534,0.000447,0.000321,0.000258,0.000349,0.000633,0.000586,0.000275,0.000488,0.000381,0.000152,0.000121,0.000281,0.000374,0.000509,0.00051,0.000409,0.000476,0.000677,0.00018,4e-04,0.000222,0.00028,0.000795,0.000716,0.000497,8e-05,0.000435,0.000599,0.000331,0.000603,0.00045,0.000151,0.000377,0.000356,0.000349,0.000562,0.000847,0.000364,0.000274,0.000758,0.000509,0.000703,0.000432,0.000528,0.000252,0.000337,0.000496,0.000746,0.000778,0.000206,0.000467,0.000637,8e-04,0.000472,0.000303,0.000659,0.000785,0.000584,0.000137,0.000679,0.000444,0.000177,0.000301,0.000121,0.000564,0.000371,0.000304,0.000268,0.000376,0.000388,0.000416,0.000133,0.000251,0.000272
0.001032,0.000969,0.000671,0.00045,0.00056,0.00038,0.001098,8e-04,0.000182,0.000384,0.000431,0.000233,0.000408,0.000541,0.000246,0.000915,0.001301,0.001223,0.000583,0.000259,0.000346,0.00034,0.001011,0.000599,0.000748,0.00059,0.000329,0.00079,0.000127,0.000483,0.000291,0.00037,0.00058,0.000969,0.000162,0.000219,0.000187,0.000568,0.000382,0.000437,0.000281,0.000616,0.000217,0.000361,0.00071,0.00012,0.000425,0.000815,0.000466,0.000221,0.000408,0.000381,0.000224,4.6e-05,0.000605,0.000524,0.000127,6.1e-05,0.000211,0.000483,0.000391,0.000441,0.000316,0.000337,0.000609,0.000188,0.000333,0.000243,0.000419,0.000375,0.00065,0.000206,0.000248,0.000133,0.000538,0.000273,0.000715,0.000215,0.000482,0.00043,0.000539,0.000434,0.000457,0.000388,0.000513,0.000434,0.000807,0.000221,0.000512,0.000379,0.000308,0.000438,0.000727,0.000362,0.000618,0.000279,0.000652,0.000723,0.000716,0.00068,0.000235,0.000317,0.000506,0.000568,0.000145,0.000257,0.000941,0.000267,0.000349,0.000204,0.000425,0.000791,0.000353,0.000332,0.000271,0.00045,0.000291,0.000346,0.000579,0.000156,0.00036
0.000766,0.000427,0.000333,0.000557,0.000151,0.000564,0.000266,0.000442,0.000243,0.000106,0.000646,0.000562,0.000542,0.000335,0.000222,0.000361,0.000782,0.000355,0.000849,0.000585,0.000991,0.00017,0.000483,0.00059,0.000444,0.000269,0.000383,0.000553,0.000657,0.000307,0.000102,0.00045,0.000182,0.000926,0.000813,0.00076,0.000282,0.000557,0.000232,0.000698,0.000522,0.000269,0.000217,0.000482,0.000653,0.000146,0.000468,0.00058,0.00018,0.000291,0.000248,0.000443,0.000227,0.000123,0.000659,0.000685,0.000263,9.6e-05,0.000268,0.000544,0.000283,0.000397,0.000437,0.000368,0.000421,0.000112,0.000252,0.00023,0.000258,0.000489,0.000513,0.000254,0.000158,0.000386,0.00026,0.000422,0.000322,0.000443,0.00078,0.000405,0.00064,0.000175,0.000404,0.000285,4.5e-05,0.000444,0.000493,0.000261,0.000755,0.000468,0.00046,0.000618,0.000384,0.000471,0.000341,0.000407,0.000582,0.00026,0.000579,9.9e-05,0.000424,0.000317,0.000393,0.000351,0.000205,0.000293,0.000586,2.6e-05,0.000501,0.000379,0.000257,0.000465,4.4e-05,0.000173,0.00029,0.000477,0.000327,0.000558,0.000277,3.3e-05,0.000389
0.000205,0.000874,0.000503,0.000757,7.6e-05,0.000668,0.000343,0.000285,0.000406,0.000432,0.000204,0.000726,0.001072,0.000711,0.000273,0.000674,0.000433,0.000468,8e-04,0.000276,0.000499,0.000831,0.000423,0.000423,0.000449,0.000328,6e-04,0.000358,0.000309,0.000435,0.000358,0.00023,0.000304,0.000401,0.000373,0.000457,0.00036,0.000403,0.000282,0.000569,0.000334,0.000397,0.000173,0.000466,0.00071,0.000433,0.00047,0.00031,0.000333,0.000168,0.000277,0.000436,0.000363,6.8e-05,0.000392,0.000201,0.000216,6.5e-05,0.000205,0.00044,0.000257,0.000253,0.000196,3e-04,0.000416,0.000156,0.000515,0.000251,0.000446,0.00042,0.000388,0.000188,0.000369,0.000314,0.000447,0.000281,0.000503,0.000382,0.000521,9.1e-05,0.000276,0.000191,0.000516,0.000315,0.000257,0.000283,0.00027,0.000212,0.000489,0.000359,0.000272,0.000489,0.000242,0.000326,0.000428,0.000571,0.000219,0.000153,0.000451,0.000209,0.000268,0.000233,0.000472,0.000493,0.00025,0.000105,0.00045,1e-04,0.000693,0.000558,0.000138,0.000394,3.4e-05,0.000111,0.00026,0.000419,0.000331,0.000597,0.000315,5.5e-05,0.000246
0.000342,0.000592,0.000508,0.000264,0.000203,0.000377,3e-04,4.7e-05,0.000167,0.000645,0.000482,0.000538,0.000141,0.000589,0.00055,0.000696,0.000118,0.000412,0.000253,0.000671,0.000281,0.000584,0.000198,0.000336,0.000306,0.000213,0.000454,0.000187,0.000538,0.000683,6.8e-05,0.000147,0.000292,0.000352,0.000454,0.000219,0.000117,0.00061,0.000195,0.000369,0.00038,0.000313,1e-05,0.000176,0.00022,6.5e-05,0.000612,0.000532,0.000205,3.9e-05,0.000193,0.000459,3e-05,0.000182,0.000364,0.000184,0.000241,0.000233,0.000224,0.000412,0.000341,0.00011,0.000306,0.00029,0.000318,9.5e-05,0.000475,0.000579,0.000175,0.000116,0.000323,0.000423,0.000752,0.000547,0.00083,0.000188,0.000479,0.000145,0.000376,0.000549,0.000181,0.000216,0.000505,0.000172,0.000233,0.000216,5e-04,0.000244,0.000193,0.000528,0.000352,0.000289,0.000249,0.000172,0.000328,0.000291,0.000548,0.000521,0.000334,0.000374,0.000403,0.000215,0.000453,0.000542,0.000198,0.000168,0.000477,0.000148,0.000582,0.000183,0.000438,0.000532,0.000123,0.00011,0.000157,0.000345,0.000434,0.000339,0.000278,9e-06,0.00012
0.000753,0.000256,0.000415,0.000274,0.000219,0.000592,0.000163,0.000443,0.000354,0.000435,0.000235,0.000422,0.000569,0.00039,0.000287,0.000268,0.000337,0.000383,0.000181,0.000685,0.000206,0.000672,0.000293,0.000366,0.000449,0.000157,0.000308,0.000239,0.00052,0.000956,0.000541,0.000284,0.000352,0.000429,0.000338,0.000295,0.000292,0.000506,0.000339,0.000517,0.000327,0.000226,4e-05,0.000238,0.000261,0.000281,0.000462,0.000395,9.9e-05,0.000268,0.000238,0.000355,0.000204,7.9e-05,0.000334,0.000157,0.000234,0.000167,0.000151,0.000323,0.000313,0.000287,0.000276,0.000287,0.000176,0.000152,0.000344,0.000554,0.000318,0.000407,0.000488,0.000288,0.000496,0.000435,0.000323,0.000245,0.000209,0.000235,0.000416,0.000344,0.000413,9.7e-05,0.00039,0.000384,0.000255,0.000162,0.000522,0.000231,0.000245,0.000365,0.000615,0.00075,0.000328,0.000247,0.000391,0.000287,0.000231,0.000383,0.000224,0.000116,0.000218,0.000194,0.000284,0.000354,0.000274,0.000262,0.00036,0.000237,0.000586,0.000352,0.000296,0.000332,0.000185,0.000216,0.000122,0.000443,0.000471,0.000513,0.00022,5.2e-05,9.7e-05
0.000764,0.00056,3.6e-05,0.000523,0.000423,0.000264,0.000348,0.000142,0.000151,0.000243,0.000317,6.9e-05,0.000449,0.000431,0.000436,0.00029,0.000355,0.000151,0.000203,0.000355,0.000479,0.000415,0.000359,0.000381,0.000272,0.000186,0.000436,0.000267,0.000265,0.000437,0.000262,0.000178,0.000328,0.000505,0.000169,0.000178,0.000287,0.000626,0.00012,0.00038,0.000307,0.000244,0.000196,0.000302,0.000515,0.000191,0.000316,0.000521,0.00015,0.000166,0.000318,0.000321,0.000222,1.5e-05,0.000243,0.000419,0.000246,0.000123,0.000145,0.000378,0.000231,0.000338,0.00024,0.000296,0.000289,0.00022,0.000274,0.00039,0.000237,0.000452,0.00049,0.000327,0.000403,8.1e-05,0.000192,0.000349,0.000321,0.000152,0.000139,0.000411,0.000525,0.000337,0.000355,0.000269,0.000142,0.000128,0.000448,0.000279,0.000258,0.000488,0.000315,0.000617,0.000436,0.000375,0.000425,0.000422,0.000265,0.000275,0.000222,0.000278,0.000316,0.000286,0.000479,0.000399,0.000141,0.000176,0.000382,2e-04,0.000633,0.000195,0.000156,0.000396,0.000268,0.000136,0.000102,0.000298,0.000297,0.000506,0.000243,2.8e-05,9e-05
0.000397,0.000314,0.000318,0.000284,0.000268,0.000633,0.000608,0.000279,6.9e-05,0.000446,0.000485,0.000182,0.000413,0.000511,0.000474,0.000288,0.00038,0.000234,0.000175,0.000396,0.00044,0.00021,0.000587,3e-04,0.000167,0.000245,0.000375,0.000231,0.000272,0.00029,0.000321,0.00028,5.4e-05,0.00022,0.00031,0.000235,0.000346,0.000356,0.000238,0.000333,0.000353,0.000294,0.000294,1.3e-05,0.000647,0.000325,0.000251,0.000301,0.000169,0.00013,0.000293,0.000449,0.000101,6e-05,0.000343,0.000301,0.000174,2.5e-05,0.000157,0.000319,0.000204,0.000274,0.000332,0.000211,0.000143,6.5e-05,0.000317,0.000327,0.000246,0.000226,0.00052,5.2e-05,0.000155,0.000152,0.000189,0.000349,0.000163,0.000269,0.00027,0.000236,0.000392,0.000217,0.000246,0.000162,0.000168,0.00022,0.000305,0.000152,0.000382,0.000169,1.2e-05,0.000705,0.000324,0.000236,0.000448,0.000189,0.000361,0.000419,8.5e-05,0.000175,0.000338,0.00044,0.000352,0.00044,0.000197,0.000294,0.000338,0.000133,0.000505,0.000337,0.000223,0.000461,9.1e-05,0.000187,0.000115,0.000296,0.000248,0.000504,0.000284,3.5e-05,0.000168
0.000517,0.000377,0.000392,0.000504,0.000158,0.000573,0.000426,0.000423,0.000165,0.000419,0.000351,0.000116,0.00043,0.000312,0.000355,0.000342,0.000404,0.000126,0.000241,0.000536,0.000231,0.000256,0.000412,0.000236,0.000404,0.000195,0.000458,0.000123,0.000554,0.000616,0.000377,2.6e-05,0.000136,0.00026,0.000175,0.000252,0.000197,0.000374,0.000184,0.000343,0.00027,0.000212,0.000199,0.000417,0.000496,0.000217,0.000197,3e-04,0.000157,8.5e-05,0.000268,0.000343,0.000202,1e-04,0.000271,0.00022,9.5e-05,0.000141,0.000131,0.000352,0.000263,0.000244,0.000422,0.00044,0.000325,3.9e-05,0.000286,0.00034,0.000177,0.000243,0.000321,9.7e-05,0.000177,0.000165,0.000132,1.3e-05,0.000356,0.000155,0.000432,0.000372,0.000206,0.000342,0.000338,0.000186,0.000154,0.000197,0.00035,0.00014,0.00051,0.000277,0.000345,0.00061,0.000338,0.000353,0.000596,0.000457,0.000321,0.000429,0.000299,0.000202,0.000141,0.000283,0.000371,0.000387,0.000227,0.00025,0.000438,0.000142,0.000387,0.00029,0.000282,0.000402,8.2e-05,0.000139,0.000136,0.000317,0.000364,0.000478,0.000236,5.5e-05,0.000128
0.000523,0.000593,0.000501,0.000392,6.4e-05,0.000366,0.000431,0.000339,0.000158,0.000437,0.000552,0.000118,0.000463,0.000522,0.00045,0.00026,0.00039,0.000417,0.000356,0.000281,0.000175,0.000322,0.000334,0.000395,0.000302,0.000245,0.000421,0.000113,0.000506,0.000134,0.000373,0.000169,0.00014,0.00037,0.000179,0.000248,5.5e-05,0.000466,0.00015,0.000405,0.000278,3e-04,0.000134,0.000338,0.000492,0.000269,8.9e-05,0.000278,0.00015,0.000212,0.000219,0.000353,0.000192,7.4e-05,0.000299,0.000281,0.000171,0.000111,0.000212,0.000328,0.000235,0.000235,4e-04,0.000352,0.000282,0.000113,0.000415,0.000311,0.000213,0.000233,0.000404,9.4e-05,0.000162,0.000182,0.000189,0.000266,0.000557,0.000229,0.000436,0.000343,0.000164,0.000115,0.000378,0.00023,0.000227,9.8e-05,0.000497,0.000218,0.000441,0.000159,0.000446,0.000306,0.000186,0.000149,0.000525,0.000367,0.000318,0.000246,0.000138,0.000163,0.000321,0.000172,0.000486,0.000293,0.000315,0.000267,0.000351,0.000278,0.000417,0.000362,0.000226,0.000386,0.000206,0.00015,0.000174,0.000378,0.00033,0.000372,0.000241,2.6e-05,6.1e-05
0.00057,0.000517,0.000259,0.000408,0.000244,0.000158,0.000355,1.5e-05,0.000154,0.000378,0.000354,3.8e-05,0.000397,0.00034,0.000431,0.000179,0.000399,0.000281,0.000317,0.000347,0.000391,0.000419,4.9e-05,0.00028,0.000456,0.000179,0.000481,0.000103,0.000311,0.000364,0.000181,0.000139,0.000278,0.000302,0.000254,0.000212,0.000127,0.000343,2e-04,0.000362,0.000183,0.000271,0.000174,5.8e-05,0.000251,0.000323,0.000212,0.000311,6.9e-05,0.000158,0.000153,0.000336,0.000114,1e-04,0.000309,0.00015,0.000141,4.1e-05,0.000258,0.000272,0.000182,0.000226,0.00022,0.00038,0.000199,3.2e-05,0.000372,0.000473,0.000373,0.00033,0.000243,9.8e-05,0.000107,0.000174,0.000296,0.000116,0.000484,0.000108,0.000203,0.000393,0.000223,0.000205,0.000221,0.000247,0.000326,0.00017,0.00022,0.000457,0.000391,0.000205,0.000267,0.000515,0.000191,0.000186,0.000316,0.000311,0.000435,5.9e-05,0.000214,0.000236,0.000426,0.000521,0.000434,0.000262,0.000223,0.000137,0.000352,0.000251,0.000436,0.000292,0.000179,0.000407,0.000176,0.000251,0.000119,0.000326,0.000253,0.000369,0.000277,9.4e-05,3.1e-05
0.000535,0.000674,0.000701,0.00041,0.000164,5.9e-05,0.000193,0.000129,0.000208,0.000304,0.000436,1.4e-05,0.000367,0.000215,0.000676,0.000418,0.000562,0.000267,0.00037,0.000382,0.000326,0.000366,0.000156,0.000179,0.000322,0.000205,0.000331,0.000233,4e-04,0.000376,7.3e-05,4.2e-05,0.000177,0.000204,0.000306,0.000354,0.000103,0.000305,0.000265,0.00048,7.1e-05,0.000253,9.2e-05,0.000163,0.000314,0.000231,0.000124,0.000322,0.000136,3.2e-05,0.000186,0.000389,0.000207,0.000152,0.00043,0.000285,0.000158,0.000169,0.000179,0.000206,0.000273,0.000358,0.000243,0.000368,0.000222,4.5e-05,0.000378,0.000335,0.000326,0.00021,0.000373,0.000151,0.000254,0.000117,0.000232,0.000126,0.000318,0.000194,0.00038,0.000652,0.000271,1.8e-05,0.000276,0.000221,0.000175,0.00028,8.3e-05,0.000331,0.000408,0.000343,0.000365,0.000499,0.000197,0.000339,0.000555,0.000247,0.000256,0.000183,0.000148,0.000228,0.000225,0.000336,0.000475,1e-04,0.000437,8.5e-05,0.00047,7.3e-05,0.000318,0.000287,0.000239,0.000421,2e-05,0.00012,0.000193,0.00039,0.000265,0.000352,0.000282,0.000113,0.000146
0.000408,0.000502,0.000519,0.000405,0.000416,0.000324,0.000395,0.000317,0.000221,0.00042,0.000617,0.000186,0.000455,0.000135,0.000525,4.6e-05,0.000397,0.000448,0.000529,0.000361,0.000374,0.000393,0.00037,0.000149,0.00052,0.000276,0.000107,0.000412,0.000296,0.00023,2.9e-05,0.000191,0.000329,0.000165,0.000392,0.000378,0.00021,0.000248,0.000342,0.000504,0.000228,0.000112,6.9e-05,0.000185,0.000367,0.000109,0.000198,0.000124,0.000255,6.8e-05,0.000112,0.000416,9.8e-05,6.5e-05,0.00033,0.000262,0.000168,0.000114,0.000135,0.000326,0.000211,0.000293,0.000171,0.00043,0.000198,0.000108,0.000369,0.000284,0.000441,0.000461,0.00036,0.000146,0.00027,7.3e-05,0.000203,0.000294,0.00024,0.000196,0.000429,0.00062,0.000476,0.000259,0.000201,0.000129,7.1e-05,0.000191,0.000314,0.000319,0.000564,0.000268,0.000228,0.00029,0.000123,0.000113,0.000616,0.000258,0.000389,0.00021,0.000184,0.000182,0.000253,0.000414,0.000222,0.000393,0.000455,9.3e-05,0.000576,0.000161,0.000469,0.000314,0.000179,0.000234,0.000258,3.5e-05,6.7e-05,0.00026,0.000323,0.000249,0.000385,0.000108,0.000141
0.00036,0.000229,0.000272,0.000321,0.000108,0.000185,0.000456,0.000108,0.000234,0.000329,7e-04,0.000563,0.000159,0.000511,0.000429,0.000222,0.000586,0.000182,0.000294,0.000249,0.000595,0.000179,0.000407,0.000243,0.000558,0.000248,0.000277,0.000111,0.000301,0.000229,0.000314,0.000438,1.1e-05,0.000476,0.000219,0.000293,5.1e-05,0.000328,0.000156,0.000392,0.000303,0.000375,0.000125,2e-04,0.000274,0.00015,9.9e-05,0.000368,0.000126,0.000184,0.000146,0.000242,0.000117,0.000118,0.000412,0.00021,0.000122,0.000101,0.000185,0.000371,0.000332,0.000324,0.000227,0.000281,0.000179,7.1e-05,0.000342,0.00041,0.000546,9.8e-05,0.000342,0.000122,0.000227,4.1e-05,0.000404,0.000278,0.000147,0.000377,3.3e-05,0.000459,0.000601,0.000388,0.000427,0.000289,0.000351,0.000222,0.000193,0.000465,0.000515,0.000429,0.000539,0.000741,4e-04,0.000274,0.000303,0.000124,0.000124,0.000366,7.3e-05,0.000214,0.000201,0.000424,0.000216,0.000115,0.000268,0.000505,0.000404,9.1e-05,0.000425,0.000382,9.5e-05,0.000385,0.000209,0.000128,6.4e-05,0.000361,0.000339,0.000309,0.000108,9.4e-05,0.000133
0.000314,0.000164,8.7e-05,0.00028,0.000174,0.000137,0.000465,0.000305,3.5e-05,0.000292,0.000658,0.000463,0.000164,0.000551,0.000249,0.000423,0.000408,0.00015,0.000266,0.00042,0.000281,0.000333,0.000211,0.000212,0.000483,0.000607,0.000168,0.000166,4.4e-05,0.000298,0.000608,0.000175,4.4e-05,0.000566,0.000121,0.000324,9.6e-05,0.000459,8.1e-05,0.000287,0.000206,0.000536,0.000245,0.000267,0.000339,3.6e-05,0.000269,0.000517,6.7e-05,6e-05,0.000191,0.000345,0.000225,7.2e-05,0.000398,0.000156,8.8e-05,0.000121,0.000142,0.000407,0.000274,0.000235,0.000208,0.000392,0.000163,2.2e-05,0.000336,0.000333,0.000383,0.000414,0.000448,0.000112,0.000374,0.000336,0.000145,8.4e-05,0.000176,0.000213,0.000434,0.00044,0.000168,0.000417,0.000461,0.000129,0.000302,0.000457,0.000231,0.000122,0.000619,2.5e-05,0.000508,0.000446,0.000265,0.000659,0.000312,0.000466,0.000317,0.000316,0.000158,0.000116,6.2e-05,0.000275,0.000164,0.000523,0.000232,0.000424,0.000308,0.000148,0.000232,0.000346,5.5e-05,0.000216,5.6e-05,0.000183,8.4e-05,0.000307,0.000318,0.000329,0.000198,0.000119,0.000191
0.000293,0.000388,0.000447,0.000373,0.000393,0.000172,0.000315,0.000395,0.000346,0.000112,0.000137,0.000248,0.000323,0.000484,0.000175,0.000262,0.000305,0.000282,5.1e-05,0.000355,0.000261,0.000258,7e-05,0.000103,0.000314,0.000332,0.000664,9.5e-05,0.000247,0.000128,0.000494,0.000346,0.000113,0.000331,0.000217,0.000156,0.000103,0.000327,0.000203,0.000307,0.000148,0.000395,8.5e-05,0.000203,0.000339,0.000243,0.000175,0.000232,0.000207,0.000128,0.000228,0.000349,8.6e-05,0.00012,0.000294,0.000247,6.4e-05,0.000119,0.000151,0.000348,0.000246,0.00024,0.000244,0.000368,0.000252,0.00016,0.00028,0.00033,0.000327,0.000307,0.000422,0.000199,0.000333,0.000253,0.000139,4e-05,0.000201,7.9e-05,0.000394,0.000159,0.00043,0.000437,0.000474,9.7e-05,0.000237,0.000281,0.000546,0.000244,0.000326,0.000394,0.000109,0.000322,0.000342,0.000285,0.000329,0.00017,0.000378,0.000311,7.9e-05,0.000256,0.000314,0.000218,0.00021,0.000398,7.6e-05,0.000411,0.000267,0.000217,0.000385,0.000191,9.9e-05,0.000306,8.9e-05,0.000112,9.8e-05,0.000312,0.000338,0.000292,0.00023,1.4e-05,8.7e-05
0.000491,0.000266,0.000374,0.000427,4.9e-05,0.000159,0.000151,0.000186,8.1e-05,0.000118,0.000328,9.7e-05,0.000391,0.000225,0.000295,0.000106,0.000434,0.00021,8.5e-05,0.000183,0.000456,0.000364,0.00015,0.000134,0.000147,9.5e-05,0.000275,9e-05,0.000282,0.000394,0.00026,5.1e-05,0.000168,0.000251,0.000289,0.000315,7e-05,0.000297,0.000213,0.000424,0.000312,0.00036,2.3e-05,0.000166,0.000334,0.000284,9.6e-05,0.000304,0.000141,1e-04,0.000212,0.000348,0.000115,3.6e-05,0.000384,0.000223,7.7e-05,7.8e-05,0.00017,0.000325,0.000235,0.000202,0.000181,0.00027,0.000236,8.5e-05,0.000296,0.000311,0.000241,0.000293,0.000334,0.000116,0.000274,0.000125,3e-04,0.000185,0.000194,0.000148,0.000285,0.000274,0.000426,0.000164,0.000346,0.000278,0.000241,9.9e-05,0.000404,7.9e-05,0.000454,0.000517,0.000329,0.000396,2.3e-05,0.00026,0.000274,0.000304,0.000313,0.000152,0.000122,0.000342,0.000159,0.000256,0.000223,0.000308,0.000158,0.000231,0.000365,8.3e-05,0.00045,0.000371,0.000199,0.000316,0.000124,0.000138,0.000119,0.000274,0.000287,0.000355,0.000187,5.5e-05,0.000117
0.000558,0.000513,0.000339,0.000309,0.000105,0.000232,0.000204,0.000107,0.000144,0.000271,0.000282,0.000139,0.000244,0.000269,0.000286,0.000202,0.000428,0.000287,0.000109,0.000317,0.000245,0.000358,4.1e-05,0.000136,0.000232,3.3e-05,0.000349,1.9e-05,0.000298,0.000321,0.000135,7.1e-05,8.4e-05,0.000366,0.000243,0.000289,0.000132,0.000381,0.000167,0.000395,0.000254,0.000317,5.2e-05,0.000164,0.000329,0.000213,6.9e-05,0.000332,7.6e-05,0.000102,2e-04,0.000352,0.00014,2.5e-05,0.000304,0.000229,9.3e-05,7.5e-05,0.000164,0.000318,0.000204,0.000241,0.00023,0.000312,0.000231,6.1e-05,0.000275,0.000281,0.000288,0.000312,0.000326,8.5e-05,0.000102,8.7e-05,0.000261,0.000129,0.000278,4.1e-05,0.000319,0.000259,0.000253,0.000207,0.000394,0.000244,0.000104,0.000133,0.000401,3.8e-05,0.000493,0.000279,0.000309,4e-04,1e-04,0.000205,0.000304,0.000399,0.000161,0.000105,7.3e-05,0.000314,0.000145,0.000255,0.000258,0.000382,0.000135,0.000218,0.000376,8.5e-05,0.000341,0.000387,8.7e-05,0.000288,9e-05,0.000107,0.000111,0.000311,0.000306,0.000369,0.000149,2.7e-05,9.6e-05
0.000427,0.000424,0.000228,0.000378,0.000151,0.000303,0.000232,0.000115,8e-05,0.000208,0.000225,1.8e-05,0.000255,0.000263,0.000304,0.000222,0.000265,0.000287,5.5e-05,0.000321,0.000245,0.000308,6.5e-05,9.2e-05,0.000225,4.5e-05,0.000368,4.6e-05,0.000262,0.000351,0.000117,2.3e-05,6.9e-05,0.000325,0.000265,0.000229,9.3e-05,0.000391,0.000197,0.000354,0.000246,0.000297,7.4e-05,0.000157,0.000353,0.000219,6.4e-05,0.000318,8.6e-05,0.000111,0.000208,0.000366,0.00012,1.3e-05,0.000304,0.000229,9.9e-05,0.000102,0.000173,0.000333,0.000223,0.000203,0.000244,0.000323,0.000226,8.2e-05,0.000297,0.000266,0.000287,0.000298,0.000353,6e-05,5e-05,9.6e-05,0.000258,0.000117,0.000277,4.6e-05,0.000372,0.000214,0.000233,0.000217,0.000427,0.000197,0.000117,0.000179,0.000355,6e-05,0.000355,0.000331,0.000284,0.000443,8.7e-05,0.000216,0.000345,0.000312,0.000273,0.000123,7.1e-05,0.000302,0.000118,0.000288,0.000302,0.000367,0.000134,0.000231,0.000382,7.3e-05,0.000438,0.000313,0.000135,0.000292,8.1e-05,0.000112,0.000123,0.000294,0.000322,0.000333,0.000156,2.5e-05,8.9e-05
