-0.000358,-0.000336,-0.00056,-0.000529,-0.000473,-0.000628,-0.000449,-0.001038,-0.000728,-0.000606,-0.000406,-0.000704,-0.001154,-0.000945,-0.00097,-0.000911,-0.000587,-0.000865,-8e-04,-0.00119,-0.001243,-0.000964,-0.001198,-0.00102,-0.000787,-0.001027,-0.001301,-0.001136,-0.000938,-0.000754,-0.001222,-0.000889,-0.001013,-0.000703,-0.001333,-0.000698,-0.00086,-0.00119,-0.000767,-0.000879,-0.001172,-0.001196,-0.001109,-0.002215,-0.001562,-0.001362,-0.001187,-0.001599,-0.001694,-0.001297,-0.00167,-0.001543,-0.002006,-0.00126,-0.000859,-0.000857,-0.001536,-0.001261,-0.001685,-0.001475,-0.001294,-0.001327,-0.001494,-0.001434,-0.000838,-0.000865,-0.000909,-0.001191,-0.001086,-8e-04,-0.00097,-0.001137,-0.000686,-0.000905,-0.00117,-0.0011,-0.000901,-0.000567,-0.001339,-0.000933,-0.000982,-0.000488,-0.000695,-0.000993,-0.00119,-0.000493,-0.000659,-0.001301,-0.000987,-0.000698,-0.000733,-0.00092,-0.001002,-0.000584,-0.000405,-0.000757,-0.000632,-0.000758,-0.000772,-0.000438,-0.000817,-0.001464,-0.000859,-0.000916,-0.000425,-0.00045,-0.001322,-0.000987,-0.00125,-0.000634,-0.000835,-0.00068,-0.001009,-0.001179,-0.001195,-0.001648,-0.000811,-0.000863,-0.001217,2.4e-05,-5e-04
0.000182,0.000196,0.000273,5.3e-05,9.4e-05,0.000211,5.2e-05,0.00015,-5e-05,-2.6e-05,-0.000429,0.000138,0.000265,0.000185,0.00017,0.000124,-3.8e-05,-4e-05,-0.000194,0.000485,0.000137,-2.2e-05,-0.000238,2.3e-05,-0.000198,8.1e-05,6.3e-05,-0.000107,0.000108,0.000275,0.000162,-0.000102,0.000247,1e-05,0.000258,-0.000169,-1.1e-05,0.000416,0.00019,0.000209,-0.000254,-3.5e-05,0.000544,0.00104,0.00074,0.000507,0.000236,0.000344,0.000608,0.000591,0.000896,0.000195,0.000883,0.000695,0.000286,0.00032,0.000798,0.000662,0.000282,0.000433,0.000252,9e-05,0.000407,-8.4e-05,0.000217,-0.000224,-3.1e-05,0.000341,0.000376,0.000131,0.000158,0.000337,0.000187,0.000448,0.000602,0.00025,3e-05,0.000182,0.00073,0.000351,0.000154,1.4e-05,0.000177,-0.000125,0.000536,0.000181,-1.6e-05,0.000192,0.000297,0.000272,-0.00022,0.000188,0.000137,-0.000119,-0.000364,0.000228,0.000339,0.000162,0.00012,0.000113,-4.3e-05,0.00047,0.000221,-5.4e-05,-0.000145,8.1e-05,0.000381,0.000174,0.000553,0.000196,0.00048,-2.6e-05,-2.8e-05,0.000426,0.000276,0.000763,0.000374,0.000299,0.000413,0.000119,0.000215
-0.000204,-0.000253,-0.000283,-0.000204,-2.1e-05,-0.000245,-0.000382,-0.000164,-4.8e-05,4.5e-05,0.000233,-5.5e-05,-7.6e-05,-0.000119,-0.000421,-0.000111,-9.8e-05,3.5e-05,5.3e-05,-0.000313,-0.000273,-1.5e-05,-0.000117,9.6e-05,-0.000296,-0.000352,-4.2e-05,0.000159,-0.000104,-0.000504,-0.000249,-0.000261,-0.000196,-5.4e-05,-0.000305,-1.6e-05,-0.000437,-0.000328,-3.7e-05,-0.000615,0.000164,-0.000158,-0.00032,-0.000867,-0.000821,-0.000387,-0.000174,-0.000212,-0.00062,-0.000798,-0.000744,-0.00039,-0.000599,-0.000556,-0.000265,-0.000498,-0.000748,-0.000591,0.000117,-0.000236,-0.000106,-2.4e-05,-0.000156,0.000203,-0.00043,-0.000108,0.000118,-0.000344,-0.000194,-0.000125,-0.000319,-0.000246,0.000129,-0.000267,-0.00035,0.00012,0.000185,-0.000303,-0.000751,-0.000272,-3.9e-05,-0.00011,-0.000432,0.000134,-7.6e-05,-0.000177,1e-06,-5.7e-05,-0.000268,-1.4e-05,-0.000118,-0.000104,-0.000108,4e-05,-3.8e-05,-0.000354,-0.000332,-5.3e-05,4.6e-05,-0.000193,5.6e-05,-0.000301,-0.000329,0.000219,0.000184,-0.000255,-0.000281,2e-05,-0.000306,-0.000126,-0.000509,-0.000266,-0.000204,-2.8e-05,-0.000147,-0.000443,-0.000433,-0.000429,-0.000298,-0.000496,-0.000194
1e-04,0.000115,1.1e-05,5.7e-05,-0.000212,-0.000224,0.000155,7.5e-05,-2.1e-05,-2e-05,0.000101,-0.000183,2e-05,0.000164,0.000243,-2.9e-05,3.3e-05,5.6e-05,-2.4e-05,0.000241,0.000522,3.1e-05,5.2e-05,0.000372,0.000639,3.8e-05,-0.000384,-0.000352,-6e-05,-1.2e-05,0.000216,0.000113,-0.000177,-0.000172,-5.2e-05,-0.000415,0.000307,-5.4e-05,0.000125,0.000328,0.000171,-0.000172,3.7e-05,0.000706,0.000328,-7.1e-05,7.9e-05,0.000167,0.000326,0.000371,0.000533,0.000345,0.000576,0.000449,4.7e-05,0.000317,0.000284,0.00057,9.6e-05,0.000102,-8.9e-05,1.7e-05,8e-06,0.000149,3e-04,0.000122,-0.000417,0.000134,0.00033,-4.6e-05,-4.2e-05,3.8e-05,-8.4e-05,5.9e-05,-0.000177,-0.000106,-2e-06,-0.000151,0.000283,-3e-05,0.000115,-0.000207,0.000187,7e-05,-3.8e-05,-8.1e-05,1.7e-05,0.000173,0.000217,3.2e-05,-1.1e-05,-0.000308,9.3e-05,4.9e-05,-4.6e-05,3e-05,0.000212,0.000114,3.1e-05,0.000324,-4.2e-05,0.000375,-5.9e-05,-0.000128,-0.000118,0.000184,0.000278,0.000112,0.000284,0.000151,5e-06,0.000178,0.000183,4e-05,1.8e-05,0.000245,0.000361,-3.6e-05,9.3e-05,0.00016,2.3e-05
5.8e-05,-0.000112,-3e-06,9.9e-05,3e-05,0.00022,-6.9e-05,-0.000143,3.8e-05,8e-06,2.9e-05,4.7e-05,9.3e-05,-0.000127,-0.000144,-7.8e-05,-1.6e-05,-6.3e-05,-8.7e-05,-7e-05,-0.000263,1e-04,8.8e-05,-0.000244,-0.000404,-0.000122,0.000478,0.000317,0.000182,0.000217,-0.000201,0.000148,0.000282,-0.000159,-4.8e-05,0.000209,-0.000251,-4.9e-05,-9e-05,-0.000285,-9.7e-05,0.000181,-0.000192,-0.000456,-0.000667,1e-06,-5.6e-05,-0.000428,-0.000233,-0.000161,-0.000213,-0.000392,-0.00019,-0.000133,-5.1e-05,-0.000213,8.6e-05,-0.000389,-0.000362,-0.000224,0.000153,0.000196,3.1e-05,-0.000252,-0.000389,5.2e-05,0.000318,0.000143,-0.000244,8.8e-05,8e-05,0.00014,-0.000132,-0.00035,0.00017,0.000107,2.1e-05,1.5e-05,-0.000105,2e-06,-0.000191,0.000116,-0.00011,-0.000241,-5.1e-05,0.000172,-0.00015,-0.000108,-0.000266,4.9e-05,4.1e-05,0.000149,-1e-04,-0.000153,0.000113,0.000113,-2.5e-05,-1.5e-05,7.4e-05,-7e-05,-8e-05,-0.00027,-2.9e-05,6.1e-05,7.6e-05,-0.000179,-0.000256,-7.7e-05,-0.000317,-0.000316,9.3e-05,4.2e-05,7.7e-05,-0.00036,-8.1e-05,-0.000132,-0.000351,2.6e-05,-0.000131,-0.000288,-0.000211
1.2e-05,0.000139,0.000124,7e-06,6e-05,-7.6e-05,4.2e-05,0.000149,8e-05,0.000122,-4.1e-05,-0.000128,-0.000274,8e-06,0.000321,0.000117,2e-06,-0.000129,9.9e-05,8.5e-05,4.5e-05,-0.000177,-0.000101,4e-06,3.2e-05,0.000322,-0.000435,-0.000434,-0.00026,-0.00026,0.000318,-0.000196,-0.000101,0.000211,-0.00015,-0.000184,0.000105,0.000129,9.7e-05,0.000355,0.000113,-0.000127,-1.1e-05,0.000288,0.000428,-0.000119,0.000226,0.000469,0.00026,0.000465,0.000355,0.000515,0.000119,8e-06,0.000166,0.000176,0.000284,8.3e-05,0.000197,-0.000127,-0.000358,-0.000269,-0.00019,2.5e-05,8.9e-05,-8e-05,-0.000373,5.1e-05,4.2e-05,-0.000103,3.2e-05,-1.2e-05,0.000108,1.2e-05,-3.2e-05,-3e-05,-0.000197,0.000129,0.000106,-8.3e-05,2.8e-05,-2.8e-05,0.000166,0.000121,3.3e-05,2.5e-05,0.000112,8e-05,0.00026,6.6e-05,0.000148,2.1e-05,0.000206,0.000163,4.2e-05,-2.7e-05,-1.7e-05,-0.000117,-0.000297,-4e-05,-6.7e-05,6.6e-05,-0.000142,-2.4e-05,2.4e-05,0.000167,5.9e-05,0.000328,0.00016,0.000162,-6e-06,0.000147,0.000235,0.000252,0.000268,6e-05,0.000283,2.5e-05,0.000151,0.000116,-7.2e-05
-6e-05,-4.9e-05,-6.7e-05,-0.00012,-0.000108,0.000118,-0.00013,-0.000141,-0.000123,-0.000227,-5.3e-05,0.000226,0.000232,-7e-06,-0.000194,3.9e-05,0.000139,5.8e-05,7.1e-05,-0.000179,-0.000146,-0.000197,0,-2.1e-05,2e-05,-0.000281,4e-05,-1e-05,0.000119,0.000116,2.8e-05,0.000248,3.2e-05,9e-06,4.4e-05,0.000119,8.9e-05,4e-06,-3.6e-05,-0.000152,-0.000223,9.5e-05,0.000177,-0.00023,-0.00027,-4.7e-05,-0.000315,-9.3e-05,-0.000111,-0.000436,-0.000378,-0.000364,-0.000169,-1e-05,-0.000188,-0.000236,-0.000157,-8.4e-05,-8e-05,0.000116,0.000172,0.000236,0.000137,2.8e-05,0.000119,-0.000158,0.000367,-0.000192,-7.4e-05,0.000251,-5e-05,-7e-05,-1.1e-05,0.000102,-7.5e-05,-0.000175,3.8e-05,6e-06,-4e-05,0.000184,-4.2e-05,-2e-05,-9.2e-05,-1e-04,-8.2e-05,1e-06,0.000148,5.9e-05,-5e-06,-0.00011,-0.00011,4.3e-05,-0.000169,-3.4e-05,-0.000123,-4.9e-05,4.2e-05,-5e-05,7.7e-05,-6.4e-05,-6.4e-05,1.3e-05,0.000142,-0.000166,5.1e-05,-3.2e-05,1e-05,-0.000419,-7.8e-05,6e-06,2.4e-05,-8.8e-05,-0.000185,-3.2e-05,-5.7e-05,5e-05,-0.000247,2.4e-05,-0.000104,-0.00025,0.000144
2.4e-05,-5.1e-05,-7.6e-05,-7e-06,9.5e-05,5.7e-05,2.1e-05,8.2e-05,9e-06,2.8e-05,-1.2e-05,-4.8e-05,-0.000137,7.9e-05,0.00013,7.2e-05,-2.5e-05,-1.9e-05,-0.000143,0.00018,0.000235,7.2e-05,-2.5e-05,4.5e-05,0.000243,0.000103,-0.000198,-0.000168,9.7e-05,2.8e-05,3e-06,1.1e-05,-0.000127,7.1e-05,0.000111,0.000127,-5e-05,4.6e-05,-0.000192,0.000107,1.1e-05,-5e-06,0,0.000137,0.000156,-0.000179,4.8e-05,3.1e-05,3.3e-05,0.000231,-1.5e-05,6.4e-05,-7.9e-05,-7.8e-05,0.000378,0.00015,0.000183,-1.3e-05,0.000147,0.000136,-5.2e-05,-0.00013,-0.000178,-0.000119,6.9e-05,0.000234,2.5e-05,-1.2e-05,-3e-05,-4.5e-05,-5.1e-05,-2.9e-05,-9.5e-05,2.8e-05,-8.4e-05,5.3e-05,-9.4e-05,-8.9e-05,4.8e-05,-0.000226,6e-06,-0.000136,-0.000159,0.000157,0.000102,-0.000125,3e-06,-9.7e-05,-8.2e-05,3.7e-05,-0.00021,-0.00019,-2.5e-05,5.7e-05,-2.8e-05,-4.8e-05,-7e-05,5e-06,0.000101,-2.8e-05,-8.3e-05,-0.000206,-4.9e-05,2e-05,-0.000187,-1e-04,-2.6e-05,0.000124,9.1e-05,-2.2e-05,-6.2e-05,1.6e-05,-7e-06,7.2e-05,-0.000182,-0.000131,0.000173,-9e-06,3.6e-05,0.000114,1e-06
-3.4e-05,-3.1e-05,-6.9e-05,-3.8e-05,-7.9e-05,-0.000151,-6.3e-05,-7.9e-05,-6.1e-05,3.6e-05,7.4e-05,-5.1e-05,2.8e-05,-7.4e-05,-6.2e-05,-7.2e-05,-4.6e-05,7e-05,-0.000148,-6.3e-05,9.7e-05,0.000418,8.7e-05,3e-05,-0.000239,-0.000136,0.000168,3.9e-05,-0.000205,-6.3e-05,1.3e-05,-6.5e-05,-6e-06,-0.000226,4.8e-05,1.3e-05,0.000148,-6.4e-05,3.8e-05,-8.2e-05,-1.1e-05,-5.1e-05,0.000113,9e-06,-9.7e-05,9.1e-05,-4.7e-05,-3e-05,-9.7e-05,-8.5e-05,-2e-06,6e-06,1.2e-05,-9.6e-05,-0.000262,5.9e-05,-0.000169,-4e-06,0.000138,-6.8e-05,8.4e-05,-0.000126,6.1e-05,0.000235,-8.6e-05,-0.000133,-8.5e-05,0.00019,2.5e-05,3.2e-05,-7.4e-05,-6.6e-05,0.000109,0,5.8e-05,-3.6e-05,-6.4e-05,5e-06,1.3e-05,0.000115,-5.2e-05,0.000243,2.7e-05,1e-06,-6e-05,-5e-05,-3.1e-05,7.4e-05,-4e-05,-3e-04,-3.9e-05,7.3e-05,1.2e-05,-7e-06,0.00011,0.000102,6.7e-05,0.000211,3.1e-05,-8e-06,4e-06,8.1e-05,-1e-05,-0.000101,0.000181,0.000144,2.8e-05,-2e-05,-6.3e-05,-7.4e-05,-1.7e-05,-7.8e-05,-3.4e-05,-0.000139,5e-06,3.3e-05,-0.000104,2.9e-05,4.4e-05,-8.4e-05,0.000163
1e-05,2.9e-05,3.7e-05,3.2e-05,7.1e-05,7e-05,7.5e-05,5e-06,1.3e-05,6.7e-05,-5.7e-05,2e-05,-2.1e-05,7.4e-05,6.7e-05,-6.7e-05,-5.1e-05,-0.000146,-1.6e-05,-5.1e-05,-1e-05,-0.000305,-1e-06,-7.2e-05,0.000129,0.000242,-8.8e-05,0.000111,-3.6e-05,3e-06,-0.000109,-0.000152,4.4e-05,5.7e-05,-3.6e-05,4e-06,-0.000212,1.5e-05,-7.5e-05,9.6e-05,5.8e-05,2.2e-05,-8.3e-05,5.4e-05,0.000114,-4.1e-05,0.000106,-3.2e-05,8.8e-05,0.000115,0.000176,0.000166,1e-04,7.2e-05,0.000276,-4.9e-05,0.000113,1.2e-05,0.000124,4.3e-05,-7.5e-05,-1.6e-05,-9e-06,-0.000125,-5e-06,0.000137,-0.000154,-0.00015,3.5e-05,-0.000151,7.6e-05,0.000134,-1.4e-05,-4e-06,5.7e-05,0.000112,1.8e-05,1.2e-05,5.9e-05,-7.7e-05,4.9e-05,-5.4e-05,4.5e-05,2.6e-05,1.2e-05,0.000156,-7.9e-05,6.7e-05,8e-05,0.000178,0.000101,8.3e-05,0.000103,0.000139,-6.9e-05,1.8e-05,-3.1e-05,-0.000151,1.2e-05,1.3e-05,-1.6e-05,-1.2e-05,-0.000106,2.5e-05,4.1e-05,1.8e-05,4.9e-05,0.000117,0.000197,3.5e-05,-7.6e-05,-4.4e-05,3.8e-05,-1.4e-05,6.5e-05,-3.7e-05,1.4e-05,7.4e-05,7.3e-05,1.7e-05,-8.3e-05
4.4e-05,-1.2e-05,2.2e-05,1.8e-05,-3.7e-05,-4.7e-05,-3e-05,1.5e-05,-2.4e-05,4e-06,4.7e-05,5e-06,7.1e-05,-4e-06,-7.4e-05,-2.7e-05,7.3e-05,3.4e-05,6.2e-05,-3.4e-05,7.5e-05,0.000102,-2.5e-05,8.1e-05,-7.3e-05,-7e-05,0.000167,5.5e-05,-5.3e-05,4.8e-05,0.000118,4.3e-05,-8.7e-05,1.7e-05,-2.3e-05,-4.5e-05,0.000142,-1.2e-05,5.4e-05,1.8e-05,-0.000161,-6e-06,-8.4e-05,-9.8e-05,-3.2e-05,5.5e-05,-0.000213,6.8e-05,-4.8e-05,-7e-06,-0.000132,1.3e-05,-2.9e-05,7.5e-05,-0.000174,-5.1e-05,-0.00016,-0.000113,-8.1e-05,1.1e-05,0.000105,-3.8e-05,-9.5e-05,-2.3e-05,5.9e-05,-2.4e-05,0.000133,0.000139,-2.8e-05,8.5e-05,-4e-05,-2.2e-05,0.000127,7.4e-05,-5e-05,-0.000146,3.9e-05,2.1e-05,-5.8e-05,7.1e-05,-6.2e-05,-8e-06,7e-06,-5e-05,-1e-05,1.8e-05,-1.3e-05,-5.7e-05,-2.5e-05,-0.000135,-3e-05,2.2e-05,9.5e-05,-3.6e-05,6.4e-05,-9.3e-05,-5.6e-05,6.4e-05,-5.6e-05,6e-06,3.8e-05,5e-05,7.1e-05,9e-05,-3.9e-05,-1.7e-05,4.4e-05,-2.1e-05,-0.000139,8e-06,7.1e-05,7.8e-05,-3.1e-05,-2.8e-05,-3.4e-05,3.7e-05,-6e-06,-0.000153,-6.2e-05,-2e-06,-3.5e-05
-5.6e-05,4.2e-05,-1e-05,-1.4e-05,-1.2e-05,1.6e-05,-6.4e-05,1.2e-05,5.5e-05,-4.1e-05,-6.9e-05,7e-06,-1e-06,7e-06,5e-06,6.2e-05,2e-06,-5.6e-05,-5.8e-05,-9.3e-05,-8.3e-05,-0.000111,-6.2e-05,-4.4e-05,0.000171,-0.00012,-8.7e-05,-7e-06,3.9e-05,1e-06,4.5e-05,-4.8e-05,-3e-05,3.3e-05,6.4e-05,1.4e-05,-8.7e-05,-2.8e-05,-4.4e-05,2.3e-05,0.000137,1e-05,1.8e-05,4.1e-05,0,7.8e-05,0.000111,-8.5e-05,0.000105,-5.4e-05,6.2e-05,-0.000122,5.2e-05,3.8e-05,7.9e-05,-2e-05,5.2e-05,2.2e-05,-7.5e-05,-8e-06,-6.5e-05,0.000142,3.9e-05,1.1e-05,-8.8e-05,-2.1e-05,0,-0.000107,-9.7e-05,-3.1e-05,8.6e-05,1.2e-05,3e-05,-5.8e-05,1.6e-05,2.7e-05,-7.6e-05,-3.2e-05,1.7e-05,-2.1e-05,2.6e-05,8e-06,-1e-06,3.8e-05,-1.4e-05,-3.5e-05,3.2e-05,1.7e-05,-9e-06,0.000157,-1.5e-05,-2.1e-05,-6e-05,-5.4e-05,-3.4e-05,-4e-06,2e-06,-8.9e-05,4.7e-05,5e-06,-0.000129,-4.7e-05,-2e-06,-3.3e-05,-1.6e-05,-3.7e-05,-3.5e-05,-3.4e-05,-1.9e-05,-3e-05,2e-06,-5.7e-05,7.6e-05,7.9e-05,-3.7e-05,-3.3e-05,6.1e-05,0.000109,2.3e-05,6e-06,3.5e-05
0,-5e-05,2.4e-05,0,1e-05,-3.3e-05,1.7e-05,-3e-06,-5.8e-05,-1.1e-05,3e-05,-2.2e-05,-3.2e-05,-2.6e-05,2e-06,2.5e-05,5e-06,7.6e-05,-2.5e-05,1.5e-05,-2.4e-05,5.8e-05,0.000129,2.5e-05,-0.00015,2.4e-05,-4.2e-05,-9e-06,-5.6e-05,5.5e-05,-4.9e-05,5.5e-05,6.8e-05,4.7e-05,-7.4e-05,-2.8e-05,2.8e-05,-1.3e-05,-3.6e-05,2.8e-05,-7.8e-05,-6.3e-05,2.6e-05,-6e-05,7e-06,-4.6e-05,-0.000143,1.6e-05,-6.6e-05,-8e-06,-2.2e-05,1.6e-05,-5.2e-05,-4.6e-05,-7.3e-05,-9e-05,1.3e-05,-2.2e-05,-0.000107,-1.3e-05,-2.5e-05,-8.6e-05,1.9e-05,-4.3e-05,4.6e-05,-1.7e-05,5.8e-05,-4e-06,4.6e-05,-1.5e-05,-0.000113,-3.2e-05,-0.00011,6.8e-05,1.8e-05,8e-06,3.6e-05,1.8e-05,-4.1e-05,-1.9e-05,-4.4e-05,-4.2e-05,-3.5e-05,4.3e-05,2e-05,2.4e-05,3.1e-05,-4.6e-05,2.7e-05,-0.000137,-5.9e-05,7e-06,2.2e-05,-1.9e-05,2.5e-05,5.1e-05,4e-05,-3e-06,-1.5e-05,-1e-06,6.3e-05,-1.3e-05,-4e-05,-1.3e-05,7.6e-05,6.1e-05,4.1e-05,-5e-06,4.2e-05,1.6e-05,-1.6e-05,2.6e-05,-0.00011,2.2e-05,0,6.8e-05,-6.8e-05,-0.000116,-1.9e-05,-3e-06,-1.1e-05
-2.6e-05,-2e-06,1e-05,1.7e-05,-6e-06,1.8e-05,-4.2e-05,1.7e-05,2.6e-05,2.3e-05,-1e-05,-3e-06,-4e-06,-1e-06,-6e-06,-4.6e-05,-1e-06,2.5e-05,1.2e-05,1.8e-05,-1.5e-05,-2.8e-05,-8.2e-05,1.2e-05,5e-05,5.4e-05,-5.8e-05,-1e-06,6.1e-05,-4.8e-05,-1.7e-05,2.6e-05,2.1e-05,-5.6e-05,7.8e-05,-1.3e-05,6.7e-05,1e-06,3.7e-05,-6.4e-05,-8e-06,1.9e-05,2.7e-05,5.7e-05,-3.3e-05,2e-06,7.4e-05,-5e-06,2.1e-05,0,-4.9e-05,2.9e-05,3.2e-05,2.9e-05,6.8e-05,6.3e-05,1e-05,6e-06,0.000102,-0.000113,-1.2e-05,7.2e-05,4.7e-05,6.9e-05,2.8e-05,-3.7e-05,-6.2e-05,4.3e-05,5e-06,1.3e-05,3.4e-05,6e-06,2.7e-05,-7e-06,6e-06,2.3e-05,-3.6e-05,2e-06,-3e-06,-3e-06,3.5e-05,-5e-06,-5e-06,2.8e-05,-3e-06,1.6e-05,-2.7e-05,-4.3e-05,-2.5e-05,9.1e-05,0.00013,4.1e-05,-4.9e-05,-1.1e-05,-6e-06,-3.3e-05,-2.9e-05,3.4e-05,5.6e-05,-3.8e-05,-1.2e-05,-3.5e-05,-2.5e-05,-2.2e-05,-3.6e-05,-2.2e-05,1.2e-05,-5e-06,3.1e-05,4e-05,-1.8e-05,-3.3e-05,4.2e-05,-5.3e-05,8e-06,-2.6e-05,1.8e-05,6.8e-05,1.4e-05,2.2e-05,2.1e-05
1.6e-05,3.2e-05,-2.7e-05,-6e-06,-1.1e-05,-7e-06,3.3e-05,-1.4e-05,1.7e-05,-1.8e-05,6.8e-05,1.6e-05,8e-06,2.5e-05,-5e-06,-3e-06,8e-06,-5.4e-05,1.7e-05,-7e-06,-2e-05,-1.5e-05,3e-05,-4.2e-05,1.7e-05,-5.7e-05,9e-05,-1.6e-05,-5e-06,4.1e-05,-4e-05,-3e-05,2e-06,1.1e-05,-3.1e-05,-3.2e-05,-8.3e-05,-1.4e-05,1.4e-05,7.7e-05,-4.2e-05,-6.6e-05,-2.6e-05,1.3e-05,1.3e-05,-1e-05,2.8e-05,-5e-05,8e-06,6e-06,5e-06,4e-06,-1.8e-05,-1.8e-05,-4.8e-05,-3.7e-05,4e-05,8e-06,-5.8e-05,-1.8e-05,2.3e-05,-5e-05,-4e-05,-7e-05,-1.7e-05,2.7e-05,1.8e-05,-3.2e-05,-9e-06,1e-06,-5.5e-05,1e-05,-2.5e-05,-4e-06,-1.7e-05,2e-06,3.6e-05,1.9e-05,3e-06,2.1e-05,5e-06,1.2e-05,-3e-06,1e-05,-2.8e-05,-1e-06,-6.7e-05,4.2e-05,-2.1e-05,-5.2e-05,-4e-05,-2.3e-05,-2e-06,3.2e-05,1.7e-05,-4e-05,-2.5e-05,-2.7e-05,-4.8e-05,1.7e-05,-1e-06,4.7e-05,-2e-06,1.4e-05,-4.2e-05,0,-2.7e-05,4.5e-05,4e-06,-4e-06,1.7e-05,2.8e-05,3.3e-05,3.1e-05,1.3e-05,-2e-06,2.6e-05,-1.8e-05,-8e-06,4e-06,-3e-05
-4e-06,-2.2e-05,1.7e-05,5e-06,-1.4e-05,2.5e-05,7e-06,4e-06,1.2e-05,1.8e-05,-4.2e-05,4e-06,1.3e-05,-1.1e-05,-3e-06,3e-05,-9e-06,5.6e-05,-5e-06,-1.2e-05,-2e-06,1.3e-05,-1e-05,7e-06,1.1e-05,1.8e-05,-1.7e-05,-1.5e-05,-1.9e-05,-2.5e-05,9e-06,-3e-05,-4e-06,1.3e-05,-1.5e-05,3.5e-05,4.5e-05,4.6e-05,3e-06,-8.2e-05,2.7e-05,4.6e-05,1.8e-05,-2e-05,2.6e-05,2.7e-05,1.1e-05,6.4e-05,-3.4e-05,-2e-06,5e-06,-4e-06,1.8e-05,-1e-05,-2.5e-05,2.4e-05,-2.5e-05,-1.2e-05,1.9e-05,2e-05,0,1.4e-05,-2e-06,4e-05,9e-06,5e-06,-7e-06,-7e-06,3e-06,1e-05,4.9e-05,-1e-05,2.9e-05,-2.1e-05,-2e-06,2e-05,-2e-06,2.4e-05,-1.6e-05,-4e-06,-5e-06,-1.2e-05,-9e-06,-4e-05,1.5e-05,1.4e-05,5.8e-05,-3.1e-05,1.3e-05,2.3e-05,3.6e-05,3.7e-05,3e-05,5e-06,-1.2e-05,2.9e-05,-5e-06,1.7e-05,2e-05,-1e-05,2.7e-05,-1.5e-05,3.9e-05,2e-06,-3.2e-05,7e-06,-4e-06,-3.6e-05,-1.1e-05,-3e-06,4e-06,-1e-05,-2e-05,8e-06,1.7e-05,2e-06,-5e-06,-1e-06,5e-06,-7e-06,4.7e-05
-1e-05,2e-06,-1.3e-05,0,-1e-06,-1.5e-05,-1e-06,2e-06,-1.3e-05,-7e-06,-3e-06,6e-06,-1e-05,1.1e-05,3e-06,5e-06,-1e-05,-4.9e-05,-8e-06,2e-06,7e-06,4e-06,-4e-06,-3e-06,-4e-06,-2.9e-05,-2.8e-05,7e-06,7e-06,5e-06,6e-06,1e-05,2e-06,-1.8e-05,1e-06,-1.2e-05,-2.1e-05,-3.4e-05,-2.4e-05,-1.3e-05,1.4e-05,3e-06,-2.6e-05,-5e-06,-4e-06,-1.2e-05,-3.3e-05,-7e-05,3.1e-05,1.4e-05,0,0,-1e-05,3e-06,1.8e-05,1.4e-05,-6e-06,-7e-06,-3.7e-05,2.9e-05,1.2e-05,-4.6e-05,1.2e-05,-1.3e-05,3.1e-05,3.3e-05,3.1e-05,3e-06,-6e-06,-4e-06,-2.1e-05,9e-06,-5e-06,3.3e-05,1.8e-05,-2.6e-05,-2e-06,-1e-06,3e-06,0,0,1e-05,9e-06,-1.2e-05,-7e-06,-1.7e-05,-3e-06,1.1e-05,2e-06,-5.1e-05,-1e-06,-4e-06,-2e-06,-1.2e-05,-6e-06,9e-06,7e-06,-7e-06,-4e-06,-2.2e-05,-2.2e-05,-7e-06,-4.1e-05,-1.4e-05,1.7e-05,-3e-06,-4e-06,-2e-06,-8e-06,2e-06,-5e-06,-1e-06,2.7e-05,-1.4e-05,-1.3e-05,-1.3e-05,-4e-06,2e-06,1e-06,2e-06,-5.7e-05
1e-05,9e-06,1.5e-05,-2e-06,1e-05,9e-06,3e-06,6e-06,-3e-06,-3e-06,0,-6e-06,-2e-06,-2.8e-05,4e-06,-1.2e-05,9e-06,1.4e-05,-8e-06,2e-06,-1e-05,-6e-06,-9e-06,1.4e-05,-2.2e-05,3.6e-05,-6e-06,1.2e-05,1e-05,-6e-06,-2.6e-05,-1.7e-05,3e-06,-1.6e-05,-1.2e-05,1.3e-05,-1e-06,0,6e-06,1.5e-05,-2.1e-05,-8e-06,1.8e-05,-2.7e-05,4e-06,1.6e-05,3.6e-05,2.9e-05,-2.7e-05,-2e-05,1e-05,-7e-06,0,1.6e-05,9e-06,-7e-06,-1.3e-05,-1e-06,-3.1e-05,-1e-06,4e-06,3.8e-05,2.6e-05,-3e-05,-2.3e-05,-1.6e-05,2e-06,-4e-06,1.8e-05,2.5e-05,9e-06,-7e-06,-2.3e-05,-1.2e-05,6e-06,7e-06,-6e-06,-1e-05,8e-06,-4e-06,-6e-06,-7e-06,0,5e-06,1.1e-05,-1e-06,1.9e-05,4e-06,4e-06,4.2e-05,-2.8e-05,9e-06,-6e-06,4e-06,-7e-06,2e-06,1.1e-05,-1e-05,1e-06,4e-06,-1.4e-05,1.3e-05,7e-06,8e-06,9e-06,-5e-06,2.1e-05,-5e-06,-1.9e-05,5e-06,1.3e-05,1e-06,-2.1e-05,1.9e-05,1.5e-05,8e-06,-2e-06,2.2e-05,3e-06,-5e-06,2.3e-05
-8e-06,-5e-06,-2e-06,-8e-06,-1e-05,0,0,-3e-06,1.3e-05,6e-06,-3e-06,-8e-06,3e-06,4e-06,1e-05,1e-06,5e-06,1.5e-05,9e-06,-8e-06,6e-06,-1e-06,6e-06,7e-06,1.4e-05,-1e-05,6e-06,8e-06,-1e-06,9e-06,1.3e-05,8e-06,-2.5e-05,-7e-06,5e-06,-7e-06,2.5e-05,5e-06,1e-06,-1.6e-05,3.6e-05,0,2.9e-05,2.5e-05,-1.7e-05,-6e-06,-1.2e-05,8e-06,1.9e-05,4e-06,1.5e-05,7e-06,-3e-06,-8e-06,1e-06,3e-06,8e-06,-3e-06,1.9e-05,6e-06,-1.1e-05,-1.7e-05,-1.4e-05,3.2e-05,-2.2e-05,1.1e-05,-1.7e-05,-5e-06,1e-06,-2.9e-05,-1e-06,1e-06,1.9e-05,-1.7e-05,-1.1e-05,-8e-06,4e-06,7e-06,1e-06,4e-06,5e-06,6e-06,-1.9e-05,0,-1.5e-05,3e-06,-1.2e-05,-9e-06,-5e-06,-2.1e-05,3e-06,-2e-06,0,-3e-06,7e-06,-1.8e-05,-8e-06,1.8e-05,-4e-06,1e-06,-8e-06,-9e-06,2.3e-05,-2.2e-05,-1e-05,-6e-06,-1.2e-05,9e-06,1.4e-05,-3e-06,-4e-06,-1e-06,1.3e-05,-2e-05,-1e-05,-4e-06,1.8e-05,-1.6e-05,1e-06,1e-05,2e-06
0,2e-06,7e-06,-2e-06,8e-06,-1e-06,3e-06,-6e-06,-1.6e-05,1e-06,-6e-06,1.1e-05,6e-06,-1.4e-05,-7e-06,3e-06,0,-7e-06,1.4e-05,4e-06,-4e-06,3.2e-05,-9e-06,-1e-05,-2.7e-05,-9e-06,0,2e-06,-1.1e-05,-2.1e-05,-2e-06,2e-06,-6e-06,1.2e-05,2e-06,3e-06,-1.9e-05,9e-06,-2e-06,8e-06,-1.6e-05,6e-06,-1.4e-05,0,2e-06,8e-06,-1e-05,-2.2e-05,-1.4e-05,2e-06,-1e-05,-2.3e-05,7e-06,-1.4e-05,5e-06,-6e-06,-5e-06,-2e-06,6e-06,0,1.4e-05,-1.6e-05,8e-06,-2e-05,3.5e-05,-2e-05,-4e-06,-1.2e-05,-1e-05,1.5e-05,-8e-06,-2e-06,3e-06,2e-05,-1e-05,6e-06,-1.2e-05,3e-06,-1.3e-05,2e-06,-1.5e-05,-1e-06,-1e-06,6e-06,1e-06,-3e-06,-1.1e-05,7e-06,-6e-06,1.8e-05,-7e-06,-7e-06,-2e-06,-1e-06,-7e-06,2.6e-05,2e-06,5e-06,-1e-06,1.3e-05,-2e-06,0,-1.2e-05,2e-05,-1.5e-05,1.1e-05,2e-06,5e-06,-8e-06,1e-05,-2e-06,-2e-06,-3e-06,1e-06,0,9e-06,-2e-05,4e-06,-4e-06,-4e-06,1.3e-05
-1e-06,-1e-06,-1e-05,7e-06,-1.1e-05,4e-06,-8e-06,1.1e-05,1.4e-05,2e-06,3e-06,-1e-06,1e-06,1.8e-05,2e-06,5e-06,2e-06,-2e-06,-7e-06,1.2e-05,-1e-06,-4e-05,0,-2e-06,5e-06,2.3e-05,-1.1e-05,-2e-06,1.6e-05,5e-06,1.3e-05,-4e-06,1.1e-05,1.9e-05,4e-06,3e-06,1.5e-05,-6e-06,5e-06,-1.3e-05,2e-06,8e-06,-9e-06,6e-06,7e-06,-1.1e-05,1.9e-05,2e-05,0,-1e-06,-5e-06,1.7e-05,-3e-06,7e-06,0,-2e-06,-4e-06,5e-06,3.4e-05,-1.1e-05,3e-06,5e-06,-5e-06,5e-06,-2.1e-05,-6e-06,3e-06,2.2e-05,-1.6e-05,-4e-06,-3e-06,-8e-06,-1.2e-05,-4e-06,1.2e-05,3e-06,1.1e-05,-8e-06,4e-06,-1.4e-05,9e-06,-1.3e-05,2e-06,-1.2e-05,-4e-06,-9e-06,1.5e-05,1e-06,2e-06,-1.2e-05,0,-5e-06,-9e-06,0,8e-06,-8e-06,9e-06,-1.1e-05,1e-06,1e-06,1.1e-05,-2e-06,1e-06,-1.1e-05,1.4e-05,-1.3e-05,1e-06,-1.8e-05,-5e-06,-9e-06,-7e-06,4e-06,-1e-05,4e-06,-1e-06,-3e-06,3e-06,1e-06,6e-06,0,-2.2e-05
1e-06,0,1e-05,4e-06,6e-06,-1e-05,1e-05,0,-1.2e-05,-3e-06,3e-06,-7e-06,-7e-06,-6e-06,9e-06,-7e-06,2e-06,6e-06,-4e-06,-4e-06,3e-06,2.8e-05,9e-06,-1.2e-05,-7e-06,-1.7e-05,1e-06,-6e-06,-1.7e-05,-1.1e-05,1e-06,1e-06,-1e-06,-1.7e-05,-3e-06,-8e-06,-2e-06,7e-06,4e-06,2e-05,-1.4e-05,-5e-06,-6e-06,-5e-06,-3e-06,4e-06,-2.3e-05,-4e-06,1.1e-05,1.4e-05,-6e-06,0,5e-06,1.1e-05,-1.3e-05,1e-05,1e-06,-1e-06,-1.2e-05,1e-05,-6e-06,0,6e-06,4e-06,-1e-06,1.1e-05,0,-3e-06,8e-06,0,-1e-06,1e-06,3e-06,3e-06,2e-06,0,-7e-06,3e-06,-9e-06,6e-06,-7e-06,1.5e-05,-1e-05,-2e-06,1.1e-05,2e-06,1.5e-05,-5e-06,2e-06,9e-06,1.2e-05,6e-06,-3e-06,9e-06,-2e-06,-5e-06,-5e-06,1.1e-05,0,3e-06,3e-06,-4e-06,2e-06,1.2e-05,1e-06,5e-06,-3e-06,1.7e-05,6e-06,2e-06,1e-05,-2e-06,5e-06,3e-06,-2e-06,3e-06,1e-05,-7e-06,-3e-06,4e-06,1.2e-05
0,-1e-06,-9e-06,-2e-06,-5e-06,2e-06,-8e-06,-2e-06,4e-06,2e-06,-1e-06,-2e-06,1e-06,6e-06,-9e-06,0,-1e-06,-5e-06,0,-6e-06,5e-06,-2.7e-05,-8e-06,6e-06,4e-06,0,0,-3e-06,6e-06,6e-06,-9e-06,1e-05,-2e-06,1e-06,-3e-06,5e-06,-4e-06,-6e-06,6e-06,-7e-06,1.3e-05,-5e-06,5e-06,-6e-06,-3e-06,1.3e-05,2.7e-05,-7e-06,-1.1e-05,-1.3e-05,0,4e-06,-5e-06,-1.1e-05,1.3e-05,-9e-06,2e-06,-4e-06,1.5e-05,-5e-06,9e-06,1e-06,-3e-06,-6e-06,8e-06,4e-06,-3e-06,-4e-06,1.2e-05,-5e-06,0,-1e-06,-7e-06,-1e-06,-8e-06,3e-06,1e-05,4e-06,4e-06,0,7e-06,2e-06,-1e-06,-5e-06,-9e-06,-1e-06,-4e-06,8e-06,1e-06,-6e-06,-4e-06,9e-06,1.1e-05,-4e-06,2e-06,1.2e-05,2e-06,-1.1e-05,2e-06,-6e-06,-1e-06,3e-06,-3e-06,-1.5e-05,-2e-06,5e-06,-3e-06,-8e-06,-6e-06,3e-06,-7e-06,0,5e-06,0,2e-06,1e-06,-3e-06,1.2e-05,-4e-06,-6e-06,0
-2e-06,-4e-06,6e-06,4e-06,3e-06,0,-1e-06,-1e-06,-5e-06,6e-06,1e-06,3e-06,2e-06,-5e-06,6e-06,2e-06,-4e-06,9e-06,-3e-06,-1e-06,0,3.1e-05,4e-06,6e-06,6e-06,4e-06,3e-06,-3e-06,1e-06,-3e-06,0,6e-06,-2e-06,-5e-06,-4e-06,-3e-06,1e-05,0,2e-06,-1e-06,1e-06,2e-06,4e-06,-2e-06,0,-8e-06,-3.6e-05,1.2e-05,7e-06,6e-06,4e-06,-2e-06,5e-06,-4e-06,-2e-06,3e-06,3e-06,-1e-06,-2.7e-05,-2e-06,1e-06,-9e-06,-3e-06,1e-06,5e-06,8e-06,-2e-06,5e-06,-7e-06,8e-06,1e-06,4e-06,1.2e-05,-1e-06,2e-06,-4e-06,-6e-06,-4e-06,1e-06,1e-06,-4e-06,-7e-06,-5e-06,8e-06,6e-06,-4e-06,-9e-06,0,2e-06,0,8e-06,1e-06,2e-06,1e-06,-2e-06,-7e-06,-4e-06,1.1e-05,-1e-06,-7e-06,-1.4e-05,0,-1.2e-05,1e-06,-2e-06,2e-06,4e-06,9e-06,-3e-06,0,-2e-06,-1e-06,-5e-06,-9e-06,3e-06,-1e-06,-4e-06,-1.6e-05,4e-06,4e-06,-4e-06
2e-06,6e-06,-5e-06,-1e-06,-1e-06,1e-06,-2e-06,3e-06,2e-06,-6e-06,2e-06,2e-06,-1e-06,2e-06,-2e-06,1e-06,1e-06,-6e-06,-2e-06,4e-06,2e-06,-2.1e-05,7e-06,1e-06,-7e-06,3e-06,-1.4e-05,1.1e-05,5e-06,5e-06,-1e-06,-1.1e-05,1.1e-05,3e-06,8e-06,6e-06,-1.6e-05,3e-06,-1.8e-05,6e-06,-1e-06,1.3e-05,0,1e-06,8e-06,0,2.1e-05,-1.3e-05,-1e-06,-1.1e-05,3e-06,-6e-06,-5e-06,3e-06,1.7e-05,-6e-06,-2e-06,-1e-06,2.2e-05,-2e-06,-3e-06,1.4e-05,-3e-06,7e-06,-8e-06,-3e-06,-2e-06,0,-5e-06,-5e-06,0,-1e-06,2e-06,-4e-06,9e-06,0,-3e-06,-3e-06,0,-4e-06,-2e-06,-3e-06,3e-06,4e-06,-3e-06,-1e-06,-5e-06,-3e-06,2e-06,-1e-06,3e-06,-2e-06,2e-06,-4e-06,3e-06,5e-06,-9e-06,-1.4e-05,-2e-06,6e-06,-6e-06,-1e-06,3e-06,-1e-06,5e-06,0,0,-6e-06,1e-06,-4e-06,2e-06,3e-06,2e-06,1.1e-05,5e-06,-5e-06,6e-06,9e-06,1e-06,-5e-06,6e-06
-2e-06,0,5e-06,-3e-06,0,-4e-06,-3e-06,2e-06,5e-06,-1e-06,2e-06,1e-06,-2e-06,5e-06,5e-06,-2e-06,0,1e-06,-2e-06,3e-06,5e-06,4e-06,-9e-06,5e-06,-5e-06,-6e-06,7e-06,-5e-06,8e-06,-7e-06,5e-06,-6e-06,4e-06,3e-06,0,-5e-06,1.1e-05,0,7e-06,1e-05,1e-06,-1.3e-05,2e-06,-1e-06,-1e-06,0,-2e-05,9e-06,2e-06,1e-06,4e-06,3e-06,3e-06,3e-06,-2.1e-05,-9e-06,3e-06,5e-06,-1.2e-05,5e-06,-2e-06,-1.5e-05,0,-1.2e-05,-2e-06,0,3e-06,4e-06,2e-06,0,-4e-06,-2e-06,-7e-06,6e-06,-2e-06,-3e-06,-5e-06,2e-06,6e-06,3e-06,2e-06,6e-06,4e-06,-2e-06,-1e-06,4e-06,1e-06,4e-06,-5e-06,-5e-06,-2e-06,-1e-05,0,-3e-06,-5e-06,-2e-06,8e-06,9e-06,-1e-06,4e-06,5e-06,1e-06,8e-06,1e-06,1e-06,-7e-06,2e-06,-5e-06,0,5e-06,1e-06,-2e-06,2e-06,-5e-06,1e-06,1e-06,4e-06,-3e-06,-2e-06,-1e-06,-4e-06
-1e-06,-3e-06,-1e-06,-3e-06,-2e-06,3e-06,4e-06,-2e-06,-5e-06,0,-5e-06,-7e-06,-1e-06,-6e-06,-8e-06,0,2e-06,0,-1e-06,-5e-06,-4e-06,-2e-06,8e-06,-9e-06,7e-06,-6e-06,-5e-06,4e-06,1e-06,3e-06,0,-6e-06,-8e-06,-7e-06,3e-06,1e-06,-5e-06,-2e-06,-5e-06,0,-7e-06,1e-06,-4e-06,1e-06,-6e-06,7e-06,1.7e-05,-2e-06,-4e-06,6e-06,-3e-06,-4e-06,-1e-06,-1e-06,1.4e-05,6e-06,2e-06,-1e-06,1.2e-05,-2e-06,3e-06,7e-06,-2e-06,1e-05,1e-05,-1.2e-05,0,-5e-06,2e-06,-2e-06,2e-06,-1e-06,-1e-06,-1e-06,-6e-06,5e-06,8e-06,2e-06,0,-1e-06,-1e-06,0,-3e-06,0,-1e-06,5e-06,1e-05,-4e-06,1e-06,1e-05,0,-3e-06,-1.3e-05,4e-06,1e-06,-4e-06,3e-06,-8e-06,4e-06,1e-06,-2e-06,0,-1e-05,-1e-06,-2e-06,6e-06,2e-06,7e-06,0,-1e-06,-3e-06,1e-06,-2e-06,0,-4e-06,0,-9e-06,4e-06,0,0,4e-06
2e-06,0,3e-06,3e-06,0,3e-06,0,0,6e-06,4e-06,2e-06,3e-06,4e-06,6e-06,-1e-06,1e-06,0,-7e-06,3e-06,1e-06,3e-06,8e-06,-1e-06,0,2e-06,1.3e-05,5e-06,-1e-06,2e-06,-5e-06,-5e-06,1e-06,2e-06,4e-06,-3e-06,-2e-06,-6e-06,0,1e-06,-6e-06,0,1e-06,-1e-06,1e-06,-1e-06,-2e-06,-1.2e-05,-6e-06,0,-1e-06,-4e-06,4e-06,2e-06,-4e-06,-1.9e-05,-1e-06,-3e-06,-4e-06,-7e-06,-3e-06,-1e-06,0,7e-06,-4e-06,-1.5e-05,3e-06,2e-06,2e-06,2e-06,1e-06,-5e-06,0,7e-06,-3e-06,-2e-06,-5e-06,-4e-06,-4e-06,-1e-06,4e-06,5e-06,-4e-06,0,-3e-06,4e-06,-5e-06,-3e-06,-1e-06,3e-06,-5e-06,-1e-06,1e-06,5e-06,-1e-06,1e-06,1e-06,-1e-06,2e-06,0,-5e-06,3e-06,-3e-06,3e-06,1e-06,0,-5e-06,-4e-06,-4e-06,3e-06,-1e-06,5e-06,0,4e-06,0,1e-06,2e-06,-1e-06,-6e-06,1e-06,-2e-06,-1.2e-05
0,3e-06,-2e-06,1e-06,2e-06,2e-06,4e-06,0,-4e-06,0,-2e-06,1e-06,1e-06,-6e-06,8e-06,-2e-06,2e-06,1.1e-05,1e-06,1e-06,-2e-06,-2e-05,-7e-06,0,0,-6e-06,-5e-06,1e-06,-5e-06,9e-06,1e-06,7e-06,4e-06,0,-6e-06,4e-06,1.3e-05,2e-06,4e-06,1.2e-05,-9e-06,1e-06,1e-06,0,0,0,8e-06,6e-06,0,1e-06,-2e-06,-2e-06,-1e-06,-2e-06,1.9e-05,2e-06,-3e-06,1e-06,-1.5e-05,6e-06,0,0,1e-06,-7e-06,1.5e-05,4e-06,-2e-06,0,2e-06,0,3e-06,-1e-06,-4e-06,1e-06,3e-06,1e-06,3e-06,3e-06,-4e-06,-7e-06,-5e-06,4e-06,-1e-06,5e-06,-1e-06,-2e-06,-6e-06,3e-06,-1e-06,6e-06,-1e-06,5e-06,1e-06,1e-06,-2e-06,2e-06,3e-06,-3e-06,-1e-06,5e-06,-5e-06,0,3e-06,-4e-06,2e-06,-2e-06,2e-06,1e-05,-4e-06,1e-06,-1e-06,1e-06,-5e-06,-4e-06,-2e-06,-1e-06,5e-06,6e-06,-3e-06,3e-06,1.2e-05
-1e-06,-4e-06,2e-06,-2e-06,1e-06,-4e-06,-4e-06,0,1e-06,-6e-06,-1e-06,1e-06,-3e-06,5e-06,-7e-06,3e-06,0,-2e-06,-1e-06,-2e-06,-1e-06,2.2e-05,4e-06,0,3e-06,-6e-06,4e-06,-4e-06,-1e-06,-5e-06,2e-06,4e-06,-6e-06,3e-06,6e-06,-3e-06,-1e-05,0,-2e-06,-5e-06,8e-06,-5e-06,7e-06,0,6e-06,-1e-06,0,-6e-06,-2e-06,-9e-06,3e-06,2e-06,1e-06,2e-06,-9e-06,2e-06,1e-06,0,8e-06,-4e-06,3e-06,-5e-06,1e-06,1.1e-05,-4e-06,3e-06,3e-06,1e-06,-3e-06,4e-06,-2e-06,0,3e-06,2e-06,1e-06,1e-06,-5e-06,2e-06,4e-06,3e-06,4e-06,0,-1e-06,0,-1e-06,5e-06,-5e-06,-3e-06,2e-06,-1e-05,-3e-06,4e-06,3e-06,0,1e-06,1e-06,-4e-06,7e-06,-1e-06,-3e-06,-3e-06,0,0,1e-06,-2e-06,3e-06,0,-1.4e-05,0,-2e-06,-1e-06,-1e-06,3e-06,6e-06,-1e-06,2e-06,0,-4e-06,0,1e-06,-5e-06
0,2e-06,-1e-06,0,-2e-06,-2e-06,0,2e-06,-3e-06,4e-06,0,-3e-06,0,-5e-06,2e-06,-2e-06,-3e-06,0,1e-06,-2e-06,-2e-06,-7e-06,-2e-06,5e-06,-6e-06,4e-06,-9e-06,3e-06,-2e-06,4e-06,1e-06,-2e-06,-3e-06,-5e-06,1e-06,3e-06,5e-06,-2e-06,0,-1e-06,1e-06,4e-06,0,-3e-06,-2e-06,2e-06,-4e-06,3e-06,1e-06,5e-06,1e-06,-3e-06,-2e-06,2e-06,7e-06,-6e-06,1e-06,0,-1.6e-05,1e-06,-2e-06,3e-06,-2e-06,-1e-05,-1e-06,5e-06,-5e-06,-2e-06,-1e-06,-2e-06,0,2e-06,-4e-06,-2e-06,-2e-06,2e-06,2e-06,-5e-06,-1e-06,2e-06,-6e-06,-1e-06,-1e-06,2e-06,0,2e-06,3e-06,1e-06,-1e-06,1.1e-05,-1e-06,1e-06,1e-06,-2e-06,1e-06,-6e-06,0,-5e-06,0,-4e-06,0,0,-1e-06,-4e-06,-2e-06,-1e-06,0,6e-06,6e-06,1e-06,1e-06,0,0,-3e-06,2e-06,-1e-06,-7e-06,5e-06,1e-06,1e-06,2e-06
1e-06,-1e-06,-1e-06,1e-06,-1e-06,3e-06,-2e-06,0,2e-06,-1e-06,2e-06,0,1e-06,4e-06,-3e-06,-2e-06,3e-06,2e-06,0,0,0,1e-06,-3e-06,-2e-06,6e-06,0,1e-06,-1e-06,0,-3e-06,-1e-06,0,0,-5e-06,1e-06,-2e-06,2e-06,0,2e-06,-3e-06,2e-06,1e-06,-6e-06,1e-06,-3e-06,-1e-06,7e-06,1e-06,1e-06,0,2e-06,2e-06,2e-06,0,-1e-05,2e-06,0,1e-06,2e-05,0,-1e-06,1e-06,4e-06,4e-06,2e-06,-5e-06,4e-06,-3e-06,0,-2e-06,0,1e-06,1e-06,0,2e-06,-1e-06,-2e-06,1e-06,1e-06,-1e-06,2e-06,0,0,-2e-06,-2e-06,-3e-06,4e-06,1e-06,-1e-06,-9e-06,2e-06,-3e-06,-2e-06,-1e-06,0,-1e-06,2e-06,5e-06,0,1e-06,0,2e-06,-4e-06,2e-06,1e-06,5e-06,1e-06,1e-06,-2e-06,0,0,-1e-06,-3e-06,3e-06,-3e-06,1e-06,5e-06,-4e-06,1e-06,2e-06,-5e-06
-1e-06,0,1e-06,0,1e-06,1e-06,-1e-06,-2e-06,-3e-06,0,-1e-06,0,2e-06,-6e-06,6e-06,1e-06,-1e-06,-5e-06,-1e-06,4e-06,-1e-06,-5e-06,5e-06,3e-06,-4e-06,5e-06,1e-06,0,2e-06,2e-06,-3e-06,2e-06,2e-06,4e-06,1e-06,2e-06,-6e-06,1e-06,-4e-06,2e-06,0,-2e-06,-2e-06,2e-06,2e-06,3e-06,-6e-06,-4e-06,1e-06,4e-06,0,-3e-06,-1e-06,-2e-06,2e-06,2e-06,0,-3e-06,-1.1e-05,2e-06,0,-7e-06,2e-06,2e-06,-2e-06,-2e-06,-3e-06,4e-06,-2e-06,-1e-06,-1e-06,1e-06,1e-06,3e-06,3e-06,-1e-06,2e-06,2e-06,0,-2e-06,-2e-06,1e-06,-2e-06,-1e-06,4e-06,-2e-06,0,-3e-06,0,4e-06,-1e-06,-5e-06,1e-06,1e-06,-1e-06,3e-06,-4e-06,-2e-06,1e-06,0,-1e-06,-1e-06,7e-06,-5e-06,1e-06,-4e-06,1e-06,0,-1e-06,-1e-06,-1e-06,1e-06,3e-06,-3e-06,3e-06,-2e-06,2e-06,0,0,-1e-06,6e-06
0,1e-06,1e-06,-2e-06,1e-06,-1e-06,2e-06,0,1e-06,0,2e-06,4e-06,-2e-06,2e-06,-3e-06,2e-06,1e-06,3e-06,-2e-06,-2e-06,1e-06,1e-06,-2e-06,-2e-06,1e-06,-9e-06,5e-06,2e-06,-1e-06,-5e-06,2e-06,-1e-06,1e-06,2e-06,-2e-06,0,5e-06,2e-06,4e-06,-3e-06,-3e-06,3e-06,3e-06,0,1e-06,-1e-06,3e-06,7e-06,-1e-06,-1e-06,-2e-06,1e-06,2e-06,-1e-06,2e-06,-1e-06,-1e-06,1e-06,1.1e-05,-2e-06,1e-06,5e-06,-1e-06,-6e-06,1e-06,-5e-06,4e-06,0,3e-06,0,1e-06,0,-2e-06,0,-1e-06,-1e-06,-2e-06,-2e-06,2e-06,2e-06,2e-06,-2e-06,-2e-06,1e-06,-3e-06,0,-2e-06,2e-06,1e-06,-5e-06,1e-06,-2e-06,-6e-06,0,0,2e-06,1e-06,1e-06,1e-06,1e-06,-1e-06,0,-4e-06,3e-06,-1e-06,1e-06,1e-06,2e-06,4e-06,2e-06,0,-1e-06,-1e-06,0,-3e-06,1e-06,-5e-06,5e-06,0,0,-4e-06
1e-06,-1e-06,1e-06,1e-06,0,-1e-06,-1e-06,0,0,1e-06,-2e-06,-3e-06,-2e-06,-2e-06,-3e-06,-1e-06,-2e-06,4e-06,-1e-06,-3e-06,0,9e-06,-3e-06,-1e-06,0,4e-06,-7e-06,-1e-06,0,6e-06,1e-06,-3e-06,-3e-06,0,-1e-06,-1e-06,-4e-06,0,-3e-06,-4e-06,0,0,0,-1e-06,0,-3e-06,1e-06,-5e-06,1e-06,-4e-06,-1e-06,-3e-06,-1e-06,1e-06,-1e-06,2e-06,-1e-06,2e-06,-1e-05,-1e-06,1e-06,-1e-06,-3e-06,5e-06,-4e-06,2e-06,-4e-06,-3e-06,3e-06,1e-06,-1e-06,-2e-06,1e-06,-1e-06,-4e-06,0,3e-06,-1e-06,-1e-06,0,-1e-06,2e-06,1e-06,-1e-06,1e-06,2e-06,-1e-06,1e-06,1e-06,8e-06,1e-06,0,3e-06,1e-06,0,-3e-06,4e-06,1e-06,-1e-06,-1e-06,-4e-06,-1e-06,-3e-06,-1e-06,-2e-06,4e-06,-2e-06,-8e-06,0,-2e-06,0,0,1e-06,3e-06,1e-06,-1e-06,0,-3e-06,0,0,0
0,1e-06,1e-06,1e-06,-1e-06,1e-06,2e-06,0,-1e-06,0,2e-06,1e-06,2e-06,2e-06,7e-06,-2e-06,4e-06,-4e-06,1e-06,0,0,-1.4e-05,5e-06,1e-06,-1e-06,9e-06,0,-1e-06,-1e-06,-3e-06,1e-06,-2e-06,4e-06,-2e-06,-1e-06,2e-06,2e-06,-2e-06,4e-06,4e-06,-4e-06,0,1e-06,-1e-06,-2e-06,0,-4e-06,2e-06,-1e-06,1e-06,0,2e-06,1e-06,0,5e-06,-3e-06,0,-2e-06,6e-06,2e-06,0,0,-1e-06,-1e-06,8e-06,4e-06,3e-06,0,-3e-06,-1e-06,-1e-06,0,1e-06,0,0,1e-06,-3e-06,3e-06,-3e-06,0,0,0,-1e-06,1e-06,-1e-06,1e-06,3e-06,-1e-06,-1e-06,-4e-06,0,4e-06,-1e-06,1e-06,-1e-06,-1e-06,-2e-06,-1e-06,-1e-06,2e-06,-1e-06,-1e-06,5e-06,1e-06,1e-06,-5e-06,1e-06,1e-05,-2e-06,1e-06,0,0,0,-4e-06,0,1e-06,4e-06,2e-06,-1e-06,-1e-06,3e-06
0,-1e-06,-1e-06,-2e-06,2e-06,1e-06,-2e-06,0,1e-06,-1e-06,-3e-06,-2e-06,0,0,-5e-06,0,-2e-06,5e-06,1e-06,2e-06,-1e-06,8e-06,-2e-06,-3e-06,1e-06,-1e-05,0,1e-06,-2e-06,4e-06,0,-2e-06,1e-06,-3e-06,2e-06,-3e-06,1e-06,0,-1e-06,-3e-06,3e-06,-2e-06,-1e-06,0,-1e-06,1e-06,3e-06,4e-06,0,0,0,2e-06,-2e-06,1e-06,-8e-06,0,1e-06,0,0,-1e-06,1e-06,-3e-06,1e-06,-3e-06,-7e-06,4e-06,-4e-06,1e-06,-3e-06,2e-06,0,0,0,-1e-06,3e-06,-1e-06,1e-06,0,1e-06,-1e-06,1e-06,2e-06,1e-06,-2e-06,1e-06,-2e-06,1e-06,2e-06,0,2e-06,1e-06,3e-06,4e-06,-2e-06,0,3e-06,2e-06,1e-06,0,0,-2e-06,0,-3e-06,-2e-06,0,-1e-06,-1e-06,-6e-06,2e-06,-1e-06,-1e-06,0,0,3e-06,-1e-06,0,0,-2e-06,-1e-06,-1e-06,0
0,1e-06,-1e-06,0,-1e-06,-1e-06,1e-06,0,-1e-06,1e-06,1e-06,2e-06,1e-06,-3e-06,2e-06,2e-06,0,-6e-06,0,2e-06,1e-06,0,0,3e-06,-2e-06,2e-06,1e-06,0,1e-06,-3e-06,-2e-06,4e-06,-1e-06,2e-06,3e-06,2e-06,-2e-06,1e-06,-1e-06,0,0,1e-06,-1e-06,1e-06,3e-06,2e-06,-1e-06,-6e-06,-1e-06,3e-06,0,-1e-06,1e-06,-1e-06,4e-06,0,1e-06,0,4e-06,0,-1e-06,5e-06,1e-06,7e-06,5e-06,1e-06,6e-06,1e-06,3e-06,-2e-06,-1e-06,0,2e-06,0,0,2e-06,-3e-06,-3e-06,1e-06,0,-1e-06,-5e-06,0,1e-06,-2e-06,-1e-06,-2e-06,0,-2e-06,-1e-06,0,0,1e-06,0,0,0,-1e-06,-3e-06,1e-06,1e-06,1e-06,1e-06,1e-06,-1e-06,0,2e-06,0,5e-06,0,-2e-06,1e-06,1e-06,-1e-06,-3e-06,1e-06,1e-06,-3e-06,1e-06,0,-1e-06,-2e-06
0,-1e-06,2e-06,1e-06,0,-2e-06,-1e-06,-1e-06,2e-06,-1e-06,-2e-06,-1e-06,-2e-06,1e-06,-2e-06,2e-06,0,2e-06,0,-3e-06,-1e-06,0,4e-06,-1e-06,2e-06,2e-06,-4e-06,-2e-06,0,2e-06,1e-06,3e-06,-1e-06,1e-06,-4e-06,-2e-06,6e-06,1e-06,2e-06,-1e-06,1e-06,0,-1e-06,0,1e-06,-1e-06,-1e-06,6e-06,1e-06,-2e-06,1e-06,1e-06,-2e-06,-1e-06,-7e-06,-2e-06,-1e-06,0,3e-06,-1e-06,0,-1e-06,-1e-06,-7e-06,-1e-06,-4e-06,-3e-06,-3e-06,3e-06,0,0,0,-4e-06,1e-06,-2e-06,-1e-06,3e-06,2e-06,-1e-06,1e-06,2e-06,5e-06,-1e-06,-1e-06,3e-06,2e-06,-1e-06,-1e-06,1e-06,2e-06,0,-2e-06,-4e-06,1e-06,0,0,-5e-06,1e-06,0,0,-2e-06,1e-06,0,-2e-06,-1e-06,-4e-06,1e-06,-4e-06,-2e-06,3e-06,1e-06,-1e-06,1e-06,3e-06,-2e-06,-1e-06,2e-06,0,1e-06,0,-1e-06
-1e-06,0,-2e-06,0,-1e-06,2e-06,0,-1e-06,-2e-06,0,1e-06,1e-06,1e-06,-2e-06,1e-06,-2e-06,1e-06,2e-06,0,-1e-06,2e-06,-1e-05,-5e-06,2e-06,-2e-06,2e-06,2e-06,2e-06,0,-3e-06,0,1e-06,1e-06,0,-2e-06,1e-06,-4e-06,-1e-06,-1e-06,2e-06,0,0,2e-06,0,-1e-06,-2e-06,4e-06,-4e-06,0,-1e-06,0,-1e-06,2e-06,0,1e-05,2e-06,-2e-06,1e-06,-9e-06,1e-06,1e-06,-3e-06,-1e-06,2e-06,-6e-06,-3e-06,3e-06,1e-06,-1e-06,-1e-06,0,1e-06,1e-06,0,1e-06,1e-06,-1e-06,2e-06,0,-1e-06,-2e-06,0,2e-06,0,-3e-06,0,1e-06,1e-06,1e-06,-1e-06,1e-06,-3e-06,-1e-06,0,1e-06,-2e-06,3e-06,-2e-06,0,0,0,1e-06,3e-06,0,1e-06,1e-06,0,-1e-06,0,-2e-06,-1e-06,0,-1e-06,-1e-06,2e-06,1e-06,2e-06,1e-06,1e-06,0,6e-06
0,0,2e-06,-1e-06,2e-06,1e-06,1e-06,1e-06,1e-06,1e-06,-1e-06,-2e-06,1e-06,4e-06,1e-06,-2e-06,-2e-06,-2e-06,1e-06,3e-06,0,1.8e-05,0,2e-06,2e-06,-3e-06,3e-06,-1e-06,1e-06,3e-06,0,-2e-06,-1e-06,-2e-06,0,-1e-06,1e-06,-1e-06,-1e-06,0,-1e-06,-1e-06,3e-06,0,-2e-06,-2e-06,-4e-06,0,-1e-06,-1e-06,0,3e-06,-2e-06,4e-06,-5e-06,0,0,-1e-06,7e-06,0,-1e-06,3e-06,0,2e-06,5e-06,-2e-06,-5e-06,2e-06,-3e-06,0,-1e-06,0,0,0,2e-06,-2e-06,2e-06,-3e-06,2e-06,0,2e-06,-1e-06,0,0,2e-06,0,1e-06,-1e-06,0,-1e-06,-1e-06,-1e-06,-2e-06,1e-06,0,2e-06,0,3e-06,-1e-06,-3e-06,-2e-06,0,-2e-06,0,0,1e-06,1e-06,6e-06,-1e-06,0,1e-06,1e-06,-1e-06,-2e-06,-1e-06,-1e-06,-4e-06,-2e-06,0,0,-5e-06
1e-06,1e-06,-1e-06,0,-1e-06,0,-1e-06,0,-1e-06,0,2e-06,2e-06,-1e-06,-3e-06,-5e-06,1e-06,0,2e-06,0,0,1e-06,-1.4e-05,3e-06,-3e-06,0,-4e-06,-1e-06,1e-06,0,-3e-06,1e-06,-1e-06,2e-06,-1e-06,-1e-06,0,3e-06,0,3e-06,-1e-06,1e-06,1e-06,-2e-06,0,0,1e-06,5e-06,4e-06,1e-06,0,0,-2e-06,2e-06,0,6e-06,-1e-06,0,-1e-06,-1.2e-05,-1e-06,0,-1e-06,1e-06,-7e-06,-3e-06,3e-06,5e-06,-1e-06,0,-1e-06,0,-1e-06,-1e-06,0,-1e-06,2e-06,-3e-06,0,0,0,-2e-06,-2e-06,-1e-06,-1e-06,-1e-06,0,0,-1e-06,0,1e-06,-1e-06,2e-06,3e-06,0,0,1e-06,-2e-06,-4e-06,0,0,-1e-06,-1e-06,-4e-06,0,0,-1e-06,-1e-06,-6e-06,-1e-06,0,0,0,2e-06,4e-06,1e-06,1e-06,-1e-06,3e-06,0,0,3e-06
