-2e-06,2e-06,-2e-06,-2e-06,-0.000142,-0.005163,-0.021825,-0.010784,-0.005218,-0.064798,-0.156852,-0.196172,-0.18588,-0.156694,-0.147973,-0.133291,-0.108612,-0.055551,-0.020285,-0.008599,-0.005169,-0.001208,-0.001096,-0.002244,-0.000904,-0.000427,-5.8e-05,-0.000107
0,3e-06,0,-4e-06,6e-06,-0.003521,-0.012229,-0.00652,-0.002434,0.036811,0.022523,-0.003862,0.105242,0.152788,0.110963,0.112911,0.116388,0.057669,0.021411,0.009087,0.005199,0.000812,-0.000244,-0.000659,-0.000468,0.001223,0.000443,0.000124
4e-06,3e-06,0,-3e-06,-4e-06,0.000506,0.002838,0.001626,-0.004028,-0.031409,-0.053336,-0.04348,-0.005813,-0.019178,-0.016571,-0.017512,-0.013017,-0.008499,-0.002798,-0.000851,3.9e-05,-0.000195,-0.000463,-0.000886,-0.000424,-0.00071,-0.000201,8e-06
6e-06,5e-06,2e-06,1e-06,3.9e-05,0.003459,0.013229,0.007647,-0.00531,-0.096242,-0.124366,-0.106221,-0.166127,-0.160996,-0.121915,-0.118261,-0.116014,-0.059712,-0.022311,-0.010259,-0.005633,-0.000983,-0.00041,-0.000731,0.000195,-0.000426,-0.000331,-0.000123
4e-06,8e-06,4e-06,7e-06,6.9e-05,0.002946,0.013408,0.006769,0.00019,0.030755,0.132675,0.166317,0.141129,0.150255,0.139347,0.126865,0.108296,0.057918,0.019401,0.007201,0.0042,0.001117,0.000809,0.001918,0.000992,0.001732,0.00073,9.1e-05
-1e-06,4e-06,-2e-06,3e-06,-5.3e-05,-0.002331,-0.011084,-0.00643,-0.000382,0.028353,0.104044,0.151762,0.145107,0.077932,0.068586,0.054292,0.044064,0.023972,0.008252,0.00435,0.002878,0.000291,8.1e-05,0.000603,-0.00024,-0.0016,-0.000519,6.1e-05
-1e-06,1e-06,-4e-06,-3e-06,-5e-05,-0.003885,-0.017861,-0.009282,-0.002383,-0.054885,-0.121493,-0.136737,-0.159617,-0.169189,-0.157598,-0.136128,-0.126853,-0.064902,-0.020157,-0.009034,-0.005668,-0.001408,-0.000997,-0.002127,-0.00074,8.9e-05,-2.2e-05,-0.000126
6e-06,4e-06,2e-06,-3e-06,-3e-06,0.000242,0.003255,0.001858,0.003678,0.039146,-0.000819,-0.081841,-0.042494,0.038925,0.015772,0.033191,0.045553,0.022821,0.007468,0.002295,0.000787,0.000427,-0.000201,-0.000911,-0.000103,0.001039,0.000352,3.2e-05
5e-06,4e-06,3e-06,-2e-06,1.3e-05,0.002969,0.014047,0.007569,0.004839,0.05907,0.06334,0.055904,0.103001,0.089928,0.081434,0.061309,0.065582,0.03244,0.008742,0.005506,0.003963,0.000919,0.000704,0.000825,8.7e-05,-0.000693,-0.000193,9.5e-05
-1e-06,1e-06,1e-06,-1e-06,6.1e-05,0.001312,0.003408,0.002313,-0.001447,-0.054492,-0.083409,-0.037799,-0.080373,-0.122922,-0.083084,-0.085615,-0.096651,-0.048637,-0.01235,-0.004514,-0.003134,-0.000688,0.000245,-0.000152,-0.000115,-0.000175,-0.00011,-8.3e-05
1e-06,3e-06,3e-06,3e-06,-1.5e-05,-0.001221,-0.005608,-0.003176,-0.001664,-0.008545,0.002186,0.006111,-0.031406,0.015603,0.021818,0.025996,0.01799,0.007469,0.00118,-0.000866,-0.001097,-0.000163,-0.000351,-0.000536,-1.1e-05,0.00065,0.000277,-2.7e-05
4e-06,4e-06,2e-06,6e-06,-5.6e-05,-0.001927,-0.007447,-0.004663,0.000909,0.057393,0.11668,0.119813,0.138705,0.120384,0.092406,0.073772,0.082778,0.040676,0.008459,0.00473,0.003687,0.000516,-0.000164,0.000426,5.7e-05,-0.000617,-0.000222,9.7e-05
3e-06,2e-06,3e-06,7e-06,2.6e-05,-0.000438,-0.002489,-0.001235,-0.001073,-0.032109,-0.044143,-0.030053,-0.022923,-0.081699,-0.084392,-0.072101,-0.071789,-0.032686,-0.005607,-0.001833,-0.00135,-0.000572,-0.00021,-0.000377,-0.000119,0.000183,6e-06,-3.1e-05
-1e-06,0,2e-06,1e-06,2.6e-05,0.001476,0.007151,0.00453,-0.000279,-0.029631,-0.07059,-0.126599,-0.115322,-0.048108,-0.051292,-0.020435,-0.023522,-0.012885,-0.003003,-0.00382,-0.002685,-0.000205,-0.000333,-0.001131,-0.000287,0.000352,0.000159,-6.5e-05
-4e-06,-2e-06,-2e-06,-7e-06,3e-06,0.001339,0.006466,0.003558,0.001727,0.039274,0.041234,0.013548,0.049875,0.09054,0.083216,0.062982,0.078018,0.038393,0.006515,0.002592,0.002715,0.000884,0.000322,0.000543,-1.5e-05,-0.000562,-0.000158,7.4e-05
-3e-06,-2e-06,-4e-06,-9e-06,-5e-06,-0.000533,-0.003328,-0.002209,-0.001177,-0.018464,-0.019123,0.058809,0.04278,-0.034439,-0.009138,-0.030761,-0.036961,-0.0152,-0.002159,0.000803,0.000531,-0.000213,0.000247,0.000864,0.000225,0.000223,5.5e-05,9e-06
1e-06,0,-2e-06,-6e-06,-4.7e-05,-0.001497,-0.007043,-0.003876,-0.00182,-0.034039,-0.035273,-0.003138,-0.059035,-0.05291,-0.038577,-0.018835,-0.039372,-0.022839,-0.005113,-0.003197,-0.00283,-0.000793,-0.000713,-0.000602,4.2e-05,5e-05,-3.6e-05,-8.5e-05
2e-06,1e-06,-2e-06,-3e-06,3e-06,0.000342,0.00213,0.000588,0.001829,0.042624,0.077651,0.039288,0.033542,0.078357,0.057516,0.051726,0.065013,0.027806,0.003837,0.001131,0.001311,0.00041,-6.4e-05,0.000515,0.000265,0.000134,5.9e-05,3.9e-05
-1e-06,-1e-06,-1e-06,0,2.8e-05,0.000762,0.003473,0.002173,0.000921,0.008923,0.023267,0.024272,0.052476,-0.002497,-0.013878,-0.025031,-0.015863,-0.001215,0.003148,0.003093,0.001691,0.00023,0.000431,0.000734,-3.8e-05,-0.000453,-0.00017,5e-05
