7e-05,9e-06,4e-05,1.3e-05,1e-05,3.9e-05,1e-06,1.4e-05,1.3e-05,2.4e-05,2.5e-05,1.2e-05,5e-06,2.5e-05,1.3e-05,3e-06,5.7e-05,2.5e-05,1.6e-05,3e-06,2.2e-05,4e-06,1.7e-05,1.8e-05,2.9e-05,3.1e-05,1.3e-05,1e-05,1.2e-05,3e-05,1.7e-05,1.1e-05,7e-06,3e-05,1e-05,1.7e-05,1.5e-05,4e-06,4e-06,2.5e-05,2e-05,1.5e-05,2e-06,4.7e-05,4.1e-05,2e-05,1.6e-05,1.2e-05,1.8e-05,1.1e-05,4e-06,4.3e-05,5e-06,2e-06,5e-06,1.2e-05,1.7e-05,2.6e-05,3e-06,4e-06,7e-06,2.5e-05,2e-05,1.1e-05,3.1e-05,9e-06,4e-06,2.1e-05,2.9e-05,5e-06,1.1e-05,1.2e-05,4e-05,1.6e-05,5e-06,4e-06,1.6e-05,1e-05,5e-06,7e-06,3e-06,7e-06,1e-06,2e-06,3e-05,1.8e-05,8e-06,3e-06,1.1e-05,1e-05,7e-06,5e-06,1e-05,6e-06,3e-06,3e-06,8e-06,1.6e-05,2.4e-05,1.4e-05,1.5e-05,6e-06,8e-06,2.2e-05,1e-05,6e-06,1.7e-05,2e-06,1e-06,1.3e-05,5e-06,1e-05,5e-06,1.2e-05,5e-06,6e-06,1.9e-05,1.1e-05,8e-06,1.8e-05,1.5e-05
0.000149,6.4e-05,0.000117,8.1e-05,3.8e-05,3.4e-05,3e-05,3.9e-05,4.2e-05,1.5e-05,3.2e-05,7.3e-05,3.6e-05,4.7e-05,3e-05,1.7e-05,7.9e-05,8.9e-05,0.000119,6.6e-05,6.8e-05,7.5e-05,9.3e-05,2.9e-05,5.3e-05,4.6e-05,1.8e-05,9e-06,9e-06,7.2e-05,3.8e-05,1.1e-05,2e-05,7.5e-05,3.4e-05,3.7e-05,3e-05,3.9e-05,4e-05,5.2e-05,5.6e-05,6e-05,2e-05,4.8e-05,0.000103,0.000124,1.9e-05,4.6e-05,1.3e-05,3.9e-05,4.2e-05,8.3e-05,3.1e-05,3.8e-05,1.7e-05,2.7e-05,7e-05,5.3e-05,8e-06,2.9e-05,2.6e-05,6.4e-05,8.2e-05,2.2e-05,3.1e-05,4.2e-05,5.1e-05,5.2e-05,8.2e-05,4.3e-05,3.8e-05,3.9e-05,9.8e-05,2.9e-05,3e-05,3.1e-05,2e-05,2.9e-05,1.9e-05,3.1e-05,3.6e-05,3.4e-05,1.9e-05,1.6e-05,4.4e-05,5.4e-05,5.8e-05,2.2e-05,3e-06,3.8e-05,6.9e-05,1.7e-05,3.7e-05,1.8e-05,2.6e-05,2.5e-05,1.2e-05,4e-05,6.4e-05,5.9e-05,7.3e-05,6.7e-05,4.9e-05,6.7e-05,2.7e-05,4.2e-05,3.5e-05,1e-05,1.3e-05,2.6e-05,1e-05,1.8e-05,1.1e-05,2.1e-05,2.2e-05,2.3e-05,4.2e-05,3.6e-05,9e-06,4.4e-05,2.8e-05
0.000187,0.000151,8.1e-05,9.5e-05,2.1e-05,6.3e-05,5.7e-05,0.000116,8.1e-05,8.8e-05,6.2e-05,7.8e-05,1.9e-05,6.9e-05,5.4e-05,3.6e-05,7.4e-05,4.5e-05,7.1e-05,2e-06,8.1e-05,2.5e-05,6.4e-05,7.5e-05,9.6e-05,8.2e-05,8.9e-05,0.00016,8.4e-05,0.000129,9e-05,3.7e-05,4e-05,0.000126,7.7e-05,8.4e-05,2.8e-05,7.9e-05,1.8e-05,1.8e-05,3.3e-05,5e-05,5.4e-05,7.9e-05,7.7e-05,0.000109,0.00011,6.6e-05,6e-05,5.7e-05,4.7e-05,6.8e-05,5.7e-05,4.1e-05,2.7e-05,2.2e-05,5.8e-05,7.5e-05,4.4e-05,3.4e-05,6e-05,2.5e-05,5.3e-05,3.1e-05,5.4e-05,4.8e-05,3.7e-05,5.5e-05,9e-06,3e-05,5.2e-05,7.1e-05,7.8e-05,2.7e-05,3e-05,5e-05,7.3e-05,2.9e-05,1.9e-05,8.5e-05,6.9e-05,4.1e-05,6e-06,3.6e-05,7e-06,3.7e-05,1.6e-05,3.5e-05,9e-06,5.4e-05,5.1e-05,5e-05,4.3e-05,4.8e-05,5.9e-05,2.7e-05,2.3e-05,3.2e-05,1.4e-05,4e-05,3.7e-05,4.1e-05,7.5e-05,4.2e-05,7.6e-05,1.9e-05,3.2e-05,3e-05,1.6e-05,8e-06,2.2e-05,2.2e-05,3.5e-05,3.7e-05,5e-05,5.5e-05,4.3e-05,3e-05,3.8e-05,5.3e-05,1.3e-05
0.000112,7.2e-05,0.000146,6.8e-05,4.4e-05,7.6e-05,1.4e-05,0.000106,0.00011,0.000115,6.1e-05,8.2e-05,7.8e-05,0.000109,3.2e-05,4.7e-05,9.5e-05,4.8e-05,1e-04,8.7e-05,6.4e-05,6.8e-05,8.5e-05,4.8e-05,9.2e-05,0.000124,0.000232,4.6e-05,4.3e-05,0.000101,0.000116,7.2e-05,8.6e-05,0.000169,4.4e-05,0.000108,9.5e-05,0.000139,0.000132,1.7e-05,8e-05,1.8e-05,5.5e-05,5.3e-05,5.3e-05,6.9e-05,6.4e-05,9e-06,1.9e-05,5.6e-05,6.9e-05,5.6e-05,4e-05,2e-05,3.6e-05,2.2e-05,5.3e-05,5.5e-05,0.000102,7.4e-05,0.000113,0.000149,8.1e-05,5e-05,3.8e-05,7e-05,9.7e-05,0.000113,6.9e-05,1.5e-05,4.6e-05,0.000123,0.000157,5.3e-05,2.8e-05,6.1e-05,4.9e-05,7.2e-05,4.7e-05,6.9e-05,5.1e-05,5.3e-05,3.6e-05,5e-05,6.2e-05,9.2e-05,4.5e-05,3.2e-05,4.5e-05,8.5e-05,0.000133,8.8e-05,3.8e-05,3.7e-05,2.2e-05,1.6e-05,1.5e-05,1.6e-05,3.8e-05,6.4e-05,5.6e-05,6.6e-05,3.1e-05,1.7e-05,2.8e-05,2.5e-05,5.9e-05,2.3e-05,3.4e-05,3e-05,5e-06,4.3e-05,6.2e-05,6.6e-05,1.5e-05,2.4e-05,1.5e-05,5.7e-05,7.2e-05,7.7e-05,6.3e-05
0.000113,6.3e-05,0.000168,0.000108,8.9e-05,0.00012,0.00011,4e-05,3e-05,0.000178,9.4e-05,5.3e-05,8.2e-05,6.9e-05,9.9e-05,2.1e-05,0.000134,5.2e-05,5e-05,0.000137,2e-04,6e-05,9e-05,7.1e-05,4e-06,0.000168,0.000142,0.000127,8.6e-05,0.00013,0.000149,7.5e-05,0.000165,0.000115,0.000126,2.5e-05,6.6e-05,0.000154,5.6e-05,0.000112,9.1e-05,6.4e-05,3.1e-05,0.000114,1.8e-05,0.000113,4.5e-05,7.3e-05,5.4e-05,1.6e-05,8.6e-05,9.1e-05,6.3e-05,8.5e-05,2.6e-05,1.1e-05,1.8e-05,6.3e-05,5.2e-05,1.6e-05,1e-04,0.000118,7.2e-05,2.3e-05,2.8e-05,8e-06,6.5e-05,9.5e-05,7.9e-05,2.1e-05,6.6e-05,8.1e-05,0.000228,2.3e-05,3.9e-05,3.6e-05,6.5e-05,6.8e-05,7.5e-05,3.3e-05,5.1e-05,5.5e-05,7.4e-05,3.3e-05,2.5e-05,3.8e-05,4.3e-05,5.6e-05,5.1e-05,7e-05,0.000102,7.7e-05,3.3e-05,5.1e-05,4.5e-05,6.1e-05,4.5e-05,3.7e-05,3.1e-05,9.2e-05,1.9e-05,1.7e-05,3.8e-05,7.2e-05,4e-06,8.6e-05,8e-05,7.3e-05,4.5e-05,2.3e-05,1e-05,4.7e-05,3.7e-05,8.5e-05,1.9e-05,3e-05,1.8e-05,3.5e-05,2.7e-05,8.6e-05,5.9e-05
0.000377,0.000287,0.000194,0.000226,6.3e-05,0.000154,0.000325,0.000306,0.000272,0.00027,0.000125,0.000135,8.6e-05,0.000128,0.000135,0.000145,0.000208,0.000205,6.6e-05,0.000135,0.000249,0.000157,3.9e-05,5.4e-05,0.000171,0.000231,0.000275,0.000136,7.9e-05,0.000264,0.000252,0.000192,0.000298,0.00016,0.000252,0.000269,0.000243,4.8e-05,5.1e-05,0.000189,0.000186,0.00015,4.9e-05,0.000185,0.000163,0.000208,0.000203,6.8e-05,2.7e-05,0.000134,4.1e-05,0.000175,0.000155,0.000121,9.6e-05,5.9e-05,4.6e-05,0.000112,7.1e-05,5.4e-05,0.000106,0.000131,0.000103,9.1e-05,0.000116,6.4e-05,8.2e-05,0.000143,9e-06,1e-04,8.2e-05,0.000149,0.000393,0.000263,9.6e-05,0.000121,4.6e-05,1e-04,0.000184,4e-05,2.7e-05,6.8e-05,0.000114,0.000119,0.000106,9.1e-05,0.000111,2.9e-05,0.000101,0.000143,9.5e-05,9.3e-05,6.5e-05,5.3e-05,6e-05,0.000123,4.3e-05,6.8e-05,9.3e-05,6.8e-05,9e-05,4e-05,1.1e-05,5.6e-05,0.000137,0.000104,0.000177,0.000128,6.7e-05,6e-05,5.5e-05,5.3e-05,2e-05,0.000125,8e-05,6.6e-05,3.4e-05,4.7e-05,2.5e-05,0.000135,0.000104
0.000364,0.00038,0.000402,0.000453,0.000304,0.000197,0.000373,3.3e-05,0.000192,0.000258,0.000367,5.5e-05,0.00023,0.00032,0.000211,0.000102,0.000209,0.000235,0.000166,0.000119,0.000342,0.000349,0.000243,0.000156,0.000277,0.000509,0.00038,0.000259,0.00019,0.000333,0.000354,8e-05,0.000191,0.000208,0.000267,9.1e-05,0.000457,0.000438,0.000161,0.000144,0.000158,7.9e-05,3.2e-05,0.000324,0.000533,0.000224,0.000104,0.000191,0.000152,0.00019,0.000133,2e-04,0.00022,6.2e-05,0.000143,0.000103,0.000117,0.000173,0.000199,0.000202,0.000262,0.00016,0.000149,6e-06,0.000182,0.00021,0.000263,0.000241,0.000191,0.000197,0.000141,0.000191,0.000314,0.000278,0.000263,0.000195,0.000175,0.000196,0.000196,0.00025,9.6e-05,3.2e-05,2.3e-05,9.2e-05,0.000102,0.000162,0.000198,0.000217,6e-05,0.000123,0.000196,9.4e-05,6.3e-05,0.000106,9.7e-05,4.9e-05,0.000117,0.000133,0.000248,0.000165,6.7e-05,2.3e-05,8e-05,4.5e-05,0.000122,0.000104,0.000122,0.000199,0.000166,0.00014,8e-05,0.000139,6.2e-05,8.3e-05,0.000175,0.000186,0.000121,5.2e-05,4.4e-05,0.000123,0.000251
0.000233,0.000145,0.000342,8.5e-05,8.5e-05,0.000129,0.000145,0.000222,0.000176,9.7e-05,0.000252,0.000369,0.000379,4.7e-05,4.4e-05,0.000159,0.00018,0.000144,0.000113,0.00012,0.000156,7.9e-05,0.000261,0.000103,0.000271,0.000185,0.000212,0.000162,0.000118,0.000375,0.000328,0.000226,0.00028,0.000436,0.00017,0.000231,0.000406,5.7e-05,6.2e-05,7.5e-05,5.4e-05,0.000179,0.000183,0.000303,0.000261,0.000245,0.000162,0.000142,0.000156,0.000364,9.4e-05,0.00014,2.6e-05,0.00011,0.000124,4.6e-05,0.000164,0.000135,7.3e-05,0.000147,0.000136,0.000162,0.000126,0.000108,0.000152,0.000118,0.000216,2e-05,0.000134,3.5e-05,0.000139,7.7e-05,0.000104,0.000174,0.000111,0.000129,0.000205,8.3e-05,0.000139,0.000202,0.000203,0.00015,2.7e-05,9.2e-05,4.6e-05,0.000107,0.000136,8.1e-05,0.000203,5.1e-05,0.00015,5.4e-05,0.000124,2e-05,8.7e-05,4.9e-05,0.000103,0.000153,2e-04,0.000131,5.3e-05,8.1e-05,8.9e-05,0.000127,0.000161,0.000134,0.000139,4e-05,6.1e-05,4.4e-05,4.5e-05,0.000106,0.00012,8.6e-05,8e-05,3e-05,1.4e-05,6.2e-05,7.9e-05,5.1e-05,0.000165
0.000266,0.000142,0.000326,0.000344,0.000362,0.000208,0.000131,0.000172,0.000331,0.000437,0.000129,0.000266,0.000157,0.000109,6.3e-05,0.000201,0.000201,0.000106,8.5e-05,7.1e-05,0.00016,0.000182,0.000268,0.000128,0.000127,0.000108,0.000282,0.00018,0.000303,0.00031,0.000318,0.000142,0.00026,0.00026,0.000258,0.000225,0.000155,0.000242,0.000183,5.4e-05,9e-05,0.000182,0.000357,0.000399,0.000549,0.000431,0.000185,0.000183,9.8e-05,0.00033,0.000422,0.000175,2.8e-05,0.000107,5.1e-05,6.9e-05,0.000155,0.000146,6.7e-05,0.000256,0.00024,0.000295,0.000151,2.5e-05,0.000142,7.2e-05,0.000278,0.000292,0.000169,0.000124,0.000212,0.000139,0.000177,0.000229,0.000276,0.000298,5.5e-05,8.7e-05,0.000104,0.000157,0.000119,5.6e-05,9e-05,0.000163,7.9e-05,2.1e-05,0.000139,0.000209,0.000152,0.000117,0.000123,6.3e-05,0.00017,0.000175,0.000116,0.000147,0.000115,0.000154,7.7e-05,6.4e-05,5.3e-05,0.00015,0.000222,1.1e-05,6.4e-05,8.4e-05,4.5e-05,4.8e-05,6.9e-05,6e-05,3.2e-05,0.000112,0.000132,8.9e-05,3e-05,3.9e-05,8e-05,2.1e-05,9.2e-05,5.2e-05,0.000105
0.000138,0.00023,0.000426,3.6e-05,0.000359,0.000378,0.000396,0.000122,0.000192,0.000273,0.000206,0.000163,1.1e-05,0.000131,7.7e-05,0.000239,0.000103,0.000286,0.000349,0.000219,0.000219,0.000232,0.000102,0.000154,6.4e-05,0.00018,0.000382,0.000286,0.000395,0.000172,0.000305,0.000224,0.000327,0.000285,0.000347,0.000157,7.5e-05,0.000109,5.2e-05,0.000167,0.000138,9.8e-05,0.000245,0.000352,0.000147,0.000112,3.9e-05,0.000197,0.000167,0.000168,0.00018,0.000174,9e-05,9.6e-05,0.000105,0.000118,2.9e-05,8.4e-05,7.3e-05,0.000287,0.000274,1.3e-05,0.000155,0.000127,0.000102,7.6e-05,0.000225,0.000242,9.8e-05,0.000165,0.000122,0.000109,0.000173,0.000152,5.8e-05,0.000127,9.3e-05,6.8e-05,8.4e-05,6.9e-05,8.1e-05,0.000155,0.000111,0.000127,0.000128,3.6e-05,9.5e-05,0.000135,9.8e-05,0.000102,9.4e-05,5.6e-05,0.000194,4.4e-05,2.4e-05,0.000127,4.9e-05,1e-04,0.000133,9.7e-05,0.000107,9.6e-05,0.000125,0.000183,4.9e-05,0.000109,6.7e-05,0.000127,0.000123,2.8e-05,6.4e-05,0.00013,1.5e-05,5.3e-05,3.1e-05,1.1e-05,0.000109,0.000148,0.000148,0.000102,5.8e-05
0.000281,0.000257,8.9e-05,0.000259,0.000175,0.000397,0.000252,0.000157,0.000132,0.000177,4.9e-05,0.000242,0.000169,0.000172,0.000142,0.000204,0.000313,0.000245,0.000182,0.000235,0.000183,0.000107,2.9e-05,0.000239,0.000165,0.000313,0.000101,8.6e-05,0.000259,0.000354,7.4e-05,0.000127,7.5e-05,0.000193,0.000105,8.3e-05,0.000194,1e-04,6.6e-05,0.000202,9.6e-05,0.000166,8.2e-05,0.000185,0.000276,6.9e-05,0.000102,0.000156,5.3e-05,0.000138,7.4e-05,0.000165,0.000275,0.000303,0.000195,0.000196,0.000186,0.000143,0.000138,0.000192,1.8e-05,6.6e-05,0.000161,0.000134,0.000161,9.9e-05,0.000158,4.3e-05,0.000129,0.000266,0.000202,0.00026,0.00014,0.000103,5e-06,4.6e-05,5.1e-05,7.7e-05,8.6e-05,0.00012,8.5e-05,9.2e-05,0.000116,0.000106,4.2e-05,0.00014,0.000147,3.3e-05,2.7e-05,5.8e-05,2.5e-05,1.4e-05,0.000126,0.000141,7.9e-05,7.1e-05,3.4e-05,5.3e-05,0.000106,4.1e-05,0.000109,5.7e-05,5.3e-05,5.1e-05,0.000136,0.000144,4.3e-05,0.000127,8.9e-05,6.9e-05,4e-05,3.5e-05,5.7e-05,7.7e-05,4.9e-05,4.5e-05,0.000113,0.000121,3e-05,5.5e-05,8.2e-05
0.000302,0.000149,4.7e-05,0.000153,0.000248,0.000105,8.3e-05,0.000133,0.000187,0.000116,0.000128,0.000176,0.000187,0.000112,0.000174,0.000193,5.4e-05,3.6e-05,0.000199,5.3e-05,9.5e-05,4.8e-05,0.000155,0.000179,4.4e-05,0.00018,0.000147,0.000145,6.2e-05,0.000228,0.000144,6.5e-05,9.5e-05,2.2e-05,0.000112,0.000216,0.000176,0.000128,0.000111,0.00023,0.000173,9.9e-05,0.000115,6.7e-05,5e-05,5e-05,9.3e-05,7.7e-05,5.2e-05,0.000147,5.5e-05,0.000212,0.000113,4.7e-05,4.5e-05,9.4e-05,6.4e-05,0.000126,0.000135,0.000102,0.000129,6.1e-05,6.5e-05,6.8e-05,1e-05,8.3e-05,9.9e-05,0.000118,0.000206,0.000167,9.3e-05,7.8e-05,0.00015,7e-05,9e-05,1.1e-05,2.7e-05,7.1e-05,0.000102,8.4e-05,3.9e-05,8.4e-05,5.5e-05,4.1e-05,6e-05,6.5e-05,3e-06,2.2e-05,9e-06,6e-05,2e-05,3e-05,4.4e-05,6.2e-05,2.6e-05,4.5e-05,4.8e-05,9e-05,3.3e-05,7.7e-05,0.000123,9.3e-05,7e-05,3e-05,0.000117,3.1e-05,4.1e-05,6.9e-05,7e-05,2.9e-05,3.9e-05,3.7e-05,3.3e-05,3.8e-05,5.8e-05,3e-05,6.4e-05,3.8e-05,2.8e-05,4.6e-05,4.8e-05
0.000109,0.000192,9.2e-05,7.1e-05,4e-05,6.3e-05,8.1e-05,0.000115,8e-05,6.9e-05,5.6e-05,8.8e-05,5.3e-05,2.9e-05,0.000109,4.2e-05,0.000129,4.5e-05,0.000117,2.8e-05,8.5e-05,8.2e-05,5.1e-05,4.3e-05,2.7e-05,8e-05,0.000114,8.3e-05,0.000108,8.9e-05,6.2e-05,7.5e-05,9e-06,9.3e-05,6.7e-05,0.000177,5.3e-05,1e-04,4.6e-05,0.000137,0.000107,0.000124,1.3e-05,4.9e-05,8.8e-05,2.7e-05,0.000124,0.000116,4.3e-05,9.1e-05,1.1e-05,9.1e-05,8.7e-05,5.4e-05,6.9e-05,5.7e-05,4.1e-05,6.5e-05,6.7e-05,7.7e-05,7.8e-05,2.4e-05,7.2e-05,6e-05,6.6e-05,4.5e-05,4e-05,5.3e-05,6.2e-05,4.2e-05,3.9e-05,7.3e-05,6e-05,3.9e-05,4.1e-05,5.3e-05,2.7e-05,6.2e-05,3.6e-05,0.00011,6.6e-05,9e-05,7.4e-05,5.8e-05,6e-05,2.4e-05,3.8e-05,3.6e-05,2.1e-05,3.1e-05,2.3e-05,1.8e-05,5e-06,5.3e-05,3.6e-05,4.9e-05,6.2e-05,6.5e-05,3.6e-05,7.5e-05,1.7e-05,2e-05,1.6e-05,3.4e-05,9e-05,6.7e-05,3.9e-05,4e-05,2.6e-05,1.7e-05,3.1e-05,3e-05,2.1e-05,3.3e-05,4.4e-05,2.1e-05,3.6e-05,5.1e-05,3.7e-05,5.5e-05,2e-05
8.1e-05,0.000111,0.000111,8.8e-05,0.000105,5.4e-05,5.2e-05,0.000132,0.00013,0.000117,6.3e-05,6.9e-05,7.5e-05,3.7e-05,6.2e-05,3.1e-05,8.6e-05,8.1e-05,0.000183,5.9e-05,6.9e-05,5.5e-05,9.4e-05,4.3e-05,4e-06,0.000121,0.000143,0.000129,9.9e-05,0.000172,0.000156,0.000109,7.6e-05,0.000131,5.5e-05,4.8e-05,0.000128,0.000201,0.000121,0.000143,5.3e-05,3.1e-05,5.9e-05,0.000112,7.1e-05,2.9e-05,0.000152,9.5e-05,6.9e-05,4.9e-05,8e-05,4.8e-05,2.8e-05,4.1e-05,9.5e-05,0.000124,5.2e-05,4.4e-05,6.6e-05,7e-05,6.8e-05,0.000115,0.000183,9.4e-05,7.5e-05,3.3e-05,5.9e-05,6.4e-05,6.4e-05,9.1e-05,2.7e-05,0.00012,5.9e-05,3.8e-05,2.8e-05,2e-05,4.1e-05,3.9e-05,3.9e-05,7.5e-05,2.3e-05,3.6e-05,8.1e-05,6.8e-05,2.5e-05,5.1e-05,8.6e-05,4.7e-05,8e-06,3.9e-05,6.1e-05,2.6e-05,3.8e-05,3.6e-05,5.3e-05,3e-05,6.6e-05,4.6e-05,1.1e-05,5e-05,2.5e-05,6.4e-05,5.2e-05,3.5e-05,1e-05,6.9e-05,4.9e-05,1.5e-05,6e-06,4.6e-05,6e-06,3.3e-05,4.3e-05,6.1e-05,7e-06,5e-06,5.3e-05,1.3e-05,1.2e-05,3.6e-05,3.4e-05
0.000177,0.00013,7.6e-05,7.9e-05,0.000115,8.2e-05,0.000166,0.000215,6e-05,0.000129,4.8e-05,1.7e-05,7.2e-05,2.4e-05,3.2e-05,5.7e-05,1e-05,0.000104,0.000141,8.6e-05,8e-05,7.4e-05,0.00012,1e-04,0.000115,0.000192,9.8e-05,0.000165,0.000188,0.00015,9.7e-05,7.1e-05,7e-05,8.5e-05,0.000141,6.5e-05,0.000131,6.1e-05,8.9e-05,2.8e-05,0.000162,0.000179,0.000168,7.3e-05,0.000119,4.8e-05,7.9e-05,0.00013,0.000143,0.000166,0.000157,0.000212,0.000112,5.3e-05,0.000149,3.3e-05,0.000101,0.000123,1e-04,3.7e-05,7e-05,6.5e-05,0.000118,0.000131,0.000152,0.000108,2.8e-05,0.000114,0.000145,0.000122,6.3e-05,0.000106,0.000104,3.1e-05,6.3e-05,5.7e-05,9.2e-05,0.000104,0.000115,6e-05,4.2e-05,2.1e-05,5.2e-05,1.3e-05,4.6e-05,5.7e-05,5.7e-05,5.9e-05,8.7e-05,4.7e-05,4.9e-05,6.1e-05,8e-06,5.6e-05,1.3e-05,5.8e-05,2.3e-05,1.6e-05,5.5e-05,2.2e-05,7.6e-05,9.5e-05,7.2e-05,6.2e-05,6.7e-05,6.4e-05,5.4e-05,8.2e-05,7.6e-05,2.1e-05,5.2e-05,3.4e-05,4.2e-05,3.5e-05,4.3e-05,3.8e-05,3.7e-05,5.7e-05,3.2e-05,2e-05,4.1e-05
0.000316,0.000195,8.2e-05,9.1e-05,0.000106,6.2e-05,0.000143,0.000114,0.000193,0.000199,0.000137,0.000101,0.000121,0.000146,0.000119,3.2e-05,9.9e-05,0.000168,0.000159,0.000112,6.3e-05,0.000187,0.000234,0.00019,1.8e-05,0.000125,0.000204,9.4e-05,0.000181,0.00019,0.000334,0.000257,1.4e-05,5.8e-05,0.000126,9.3e-05,9.1e-05,0.000162,0.000164,0.000125,0.000167,0.000219,9.7e-05,6e-05,0.000137,0.000131,0.000117,5.2e-05,3.8e-05,0.00011,0.000158,8.2e-05,5.6e-05,4.4e-05,0.00012,0.000133,0.000192,7.9e-05,0.000108,3.7e-05,3.5e-05,0.00011,9.1e-05,0.000102,0.000179,3.2e-05,5.3e-05,0.000197,0.000114,6.5e-05,4.8e-05,6.9e-05,0.000128,0.00015,0.000107,6.3e-05,0.000104,1e-04,2.8e-05,8.9e-05,9.4e-05,2.9e-05,3.6e-05,1.5e-05,6.1e-05,5e-05,7.5e-05,2.9e-05,4.7e-05,7.4e-05,3.2e-05,2.9e-05,2.9e-05,2.2e-05,1.3e-05,6.3e-05,1.4e-05,1.2e-05,8.9e-05,9e-05,8e-05,1.7e-05,5.9e-05,1.7e-05,7.1e-05,7.1e-05,3.4e-05,5.8e-05,2.6e-05,6.5e-05,2.4e-05,6.2e-05,2.4e-05,5.7e-05,2.6e-05,3.3e-05,3.8e-05,8e-06,2.1e-05,1.7e-05,2.6e-05
0.000133,3e-05,4.6e-05,9.6e-05,0.000176,0.000136,6.6e-05,0.000155,0.000218,0.000136,9.9e-05,3.3e-05,4.3e-05,0.000131,7.4e-05,6e-05,0.00011,0.000254,9.9e-05,0.000123,2e-04,7e-05,0.000133,1.2e-05,0.000133,0.000193,6.5e-05,0.000114,9.8e-05,9.4e-05,0.000242,0.000233,0.000251,0.000131,0.000119,0.000151,0.000102,9.3e-05,0.000118,6.9e-05,0.000198,0.000134,9.3e-05,0.00011,7.7e-05,7.3e-05,9.9e-05,7.9e-05,0.000117,8.7e-05,8.6e-05,0.000114,8.5e-05,8e-05,3.2e-05,4.5e-05,0.000107,5.9e-05,5.2e-05,7.7e-05,5.4e-05,0.000159,0.000111,6.5e-05,6.1e-05,0.000127,3.8e-05,0.000189,0.000133,9.1e-05,0.000103,0.000122,0.00011,4.8e-05,2.5e-05,4.4e-05,6.5e-05,0.000121,0.000124,3.2e-05,2.7e-05,6e-05,9.6e-05,8.6e-05,4.5e-05,1.9e-05,2.8e-05,2.9e-05,2.6e-05,7.7e-05,5.4e-05,2.9e-05,1.4e-05,3.1e-05,4.2e-05,2.2e-05,5.2e-05,2.5e-05,7.5e-05,4.9e-05,4.4e-05,2.1e-05,3.2e-05,5.4e-05,6e-06,1.9e-05,6.3e-05,5.3e-05,3.5e-05,5.4e-05,4.4e-05,3.7e-05,3.9e-05,3.6e-05,1.7e-05,3.5e-05,3.5e-05,3.2e-05,3e-05,2.1e-05,2.2e-05
0.000138,0.000106,7.9e-05,9.5e-05,0.000155,6.5e-05,0.000163,0.000263,2.5e-05,8e-05,0.000115,6e-05,4.6e-05,6.1e-05,0.000149,0.000126,0.000129,0.000133,0.000109,6.3e-05,0.000113,0.000201,0.000142,8e-05,0.000146,6.7e-05,6.4e-05,0.000101,9.5e-05,3.7e-05,0.00015,6.5e-05,6.5e-05,2.9e-05,0.00015,0.000151,0.000125,0.000194,6.3e-05,9.3e-05,7.5e-05,0.000264,0.000115,0.000103,2.5e-05,6.6e-05,0.000111,4.9e-05,0.000135,3.5e-05,0.000151,0.000139,0.000107,9.5e-05,4e-05,9.3e-05,0.000107,0.000162,0.000123,0.000127,2.6e-05,0.000153,6.7e-05,3.9e-05,3e-05,6.6e-05,5.3e-05,0.000142,2.1e-05,6.6e-05,0.000101,5.8e-05,3.8e-05,4.6e-05,2.2e-05,4.1e-05,9.9e-05,5.4e-05,1.8e-05,2e-05,2.4e-05,2.7e-05,0.000108,1.5e-05,1.3e-05,5.5e-05,3.5e-05,4.4e-05,1.1e-05,4.7e-05,2.2e-05,7e-06,4e-05,4.8e-05,3e-06,5e-06,3.8e-05,3e-05,6e-05,3.5e-05,1.3e-05,5e-05,1.9e-05,4.6e-05,1.8e-05,3.5e-05,5.8e-05,5.4e-05,4.2e-05,2.7e-05,4.5e-05,4.4e-05,4.3e-05,3.8e-05,6.5e-05,2.8e-05,1.6e-05,2.6e-05,9e-06,1.4e-05,1.9e-05
0.000223,0.000285,0.000193,0.000115,1.8e-05,0.000139,0.000105,0.000203,2e-04,0.00024,9.1e-05,0.000121,7.6e-05,9.4e-05,0.000177,0.000133,4.7e-05,0.000135,8.5e-05,9e-05,0.000178,0.000196,0.00012,5.7e-05,0.000149,0.000241,0.00017,0.000107,0.000114,0.000117,0.000114,0.000169,0.000113,8e-06,0.000212,3.5e-05,9e-05,0.000106,0.000212,0.000196,0.000123,0.00018,0.000166,0.000143,6.4e-05,7e-05,0.000142,0.000202,0.000125,9.8e-05,0.000156,0.000221,8.7e-05,9.6e-05,9.4e-05,7.9e-05,1.7e-05,0.00026,0.000196,8e-05,6.9e-05,0.000166,9.1e-05,0.000113,2.7e-05,7.2e-05,0.000116,4.4e-05,6.6e-05,5.6e-05,4.8e-05,3.6e-05,3.3e-05,5.4e-05,4.1e-05,4.9e-05,0.000113,0.000107,9e-05,6.5e-05,1.4e-05,2.6e-05,4.7e-05,7e-05,4.4e-05,0.000112,6.4e-05,3.1e-05,4.3e-05,3e-06,3.7e-05,1.2e-05,4.3e-05,8.8e-05,4.1e-05,2.3e-05,1.1e-05,5e-05,4.1e-05,3e-05,4.8e-05,1.6e-05,2.2e-05,5.4e-05,2.2e-05,3.5e-05,4.3e-05,6.1e-05,3.2e-05,3.7e-05,2.9e-05,2.6e-05,5.3e-05,2.2e-05,4.2e-05,2.5e-05,3e-05,4e-05,3.8e-05,3.6e-05,4.9e-05
0.000108,0.000202,0.000231,0.000183,0.000197,0.000194,0.000211,6.3e-05,7.8e-05,0.000168,9.7e-05,0.000215,0.00027,0.000118,0.00015,0.000133,9.3e-05,8.7e-05,0.000165,0.000142,4.7e-05,0.000112,7.4e-05,0.000137,0.000117,0.000135,0.000264,0.000286,2.3e-05,8.7e-05,8.8e-05,0.00013,0.000118,8.4e-05,0.000183,0.000235,0.000116,0.000132,9.2e-05,4.5e-05,6.9e-05,0.000231,7.4e-05,0.000106,0.000208,0.00013,9.2e-05,5.8e-05,2.9e-05,3.8e-05,1.3e-05,0.000175,0.00017,8.7e-05,0.000119,0.000114,0.000126,0.000245,7.2e-05,4.1e-05,5.8e-05,8.4e-05,0.000115,8.3e-05,4.1e-05,0.000137,0.000116,7.9e-05,0.000102,7.7e-05,3.9e-05,9.5e-05,5.2e-05,8.8e-05,3.9e-05,3.4e-05,0.000104,0.000156,0.000104,4.1e-05,4.9e-05,8.7e-05,8.4e-05,9.4e-05,5.6e-05,0.000124,5.2e-05,3.5e-05,2.1e-05,3.6e-05,4e-05,4.4e-05,2.5e-05,4.3e-05,3.9e-05,1.5e-05,2.6e-05,5.7e-05,3e-05,1.9e-05,1.2e-05,3.4e-05,3.7e-05,5.4e-05,4.2e-05,3.3e-05,1.4e-05,1.7e-05,3.8e-05,5e-05,4.3e-05,4.5e-05,1.4e-05,5.8e-05,4.8e-05,3.6e-05,3.6e-05,2.3e-05,5.7e-05,1.8e-05,3.4e-05
7.2e-05,8.2e-05,0.000101,8.5e-05,0.000134,8.8e-05,0.000122,0.000184,0.000106,0.000198,0.000186,0.000246,0.000163,0.000137,0.000165,2.4e-05,7.5e-05,0.000114,0.000175,0.000162,8.2e-05,0.000143,0.000154,7.1e-05,0.000101,9.3e-05,0.000111,0.000222,0.000195,8.8e-05,0.00016,0.000177,3e-05,6.4e-05,0.000168,3.8e-05,2.8e-05,8.2e-05,0.00014,0.000116,0.000156,5.6e-05,0.000168,0.000127,0.000152,8.5e-05,7.9e-05,7.1e-05,2.2e-05,2.1e-05,0.000103,0.00011,2.8e-05,1.8e-05,8.3e-05,6.4e-05,6.9e-05,7.3e-05,0.000113,0.000116,9.1e-05,8.3e-05,3.4e-05,3.6e-05,1.9e-05,0.000129,6.3e-05,4.6e-05,0.000121,9.9e-05,4.3e-05,0.000125,7.4e-05,7.2e-05,5.9e-05,5.5e-05,0.000117,0.000109,0.000115,6.3e-05,5.8e-05,0.000133,0.000156,5.4e-05,4.5e-05,4.1e-05,4.7e-05,4.1e-05,2.7e-05,1.8e-05,4.5e-05,4.9e-05,5.9e-05,7.9e-05,6.3e-05,5.9e-05,6.8e-05,8.2e-05,4.7e-05,3e-06,4.5e-05,7e-05,3.9e-05,1.6e-05,2e-06,5.3e-05,3.9e-05,6e-06,1.9e-05,1.6e-05,2.6e-05,3e-05,2.4e-05,2.9e-05,1.9e-05,2.8e-05,1.5e-05,3.7e-05,3.8e-05,5.6e-05,1.1e-05
6.9e-05,9.4e-05,7.7e-05,6.7e-05,5.7e-05,2.8e-05,6.4e-05,0.000126,0.000125,0.000153,0.000183,0.000109,2.4e-05,0.000129,3.1e-05,8.7e-05,4.3e-05,3.3e-05,0.000148,1e-05,7.4e-05,7.4e-05,0.000155,0.000181,2e-04,0.000111,7.1e-05,5.1e-05,3.8e-05,1.7e-05,0.000156,0.000125,0.000167,1.3e-05,5.1e-05,0.000108,4.3e-05,0.000102,0.000116,0.000119,7.4e-05,0.000114,0.000191,1.1e-05,0.00011,0.000137,7e-05,0.000106,2.1e-05,2.6e-05,9.6e-05,9.3e-05,6.2e-05,8.5e-05,8.1e-05,7.6e-05,2.3e-05,1.1e-05,6.4e-05,6.1e-05,1.7e-05,0.00012,0.000103,7.3e-05,5e-05,7.7e-05,0.000113,9e-05,6.1e-05,0.000107,5.9e-05,6e-05,4.8e-05,8.3e-05,3.7e-05,2.8e-05,4.2e-05,3.7e-05,1.3e-05,1.1e-05,2.1e-05,1e-04,7e-06,1.7e-05,1.9e-05,2.3e-05,1.7e-05,2.4e-05,1e-05,3e-05,3.1e-05,2.9e-05,4.9e-05,8.1e-05,3.7e-05,1.6e-05,7e-05,2.5e-05,1.9e-05,3.1e-05,9.6e-05,3e-05,3.4e-05,2.4e-05,2.3e-05,8.7e-05,6.2e-05,2.7e-05,1.3e-05,1.1e-05,5e-05,1.9e-05,2.2e-05,3.8e-05,2.1e-05,4.9e-05,4.5e-05,6.3e-05,3e-05,2.9e-05,1e-05
2.7e-05,0.00012,5.3e-05,2.8e-05,5.9e-05,4.3e-05,4.8e-05,7.2e-05,2.3e-05,3.1e-05,5.1e-05,5.2e-05,2e-05,5.6e-05,5.3e-05,3.4e-05,3.2e-05,1.3e-05,4.7e-05,4.5e-05,6.4e-05,5.2e-05,0.000122,1.9e-05,5.7e-05,4e-06,1.7e-05,4.1e-05,4.1e-05,2.9e-05,7.3e-05,9e-06,4.6e-05,4.7e-05,1.3e-05,1.9e-05,1.2e-05,1.8e-05,5.1e-05,6e-05,7.8e-05,4e-05,6.4e-05,6.7e-05,2.6e-05,5.9e-05,4.4e-05,6.2e-05,4.4e-05,3.5e-05,2.8e-05,2.6e-05,6e-06,6.8e-05,3.2e-05,2.5e-05,9e-06,9e-06,3.9e-05,3.7e-05,2.6e-05,4.8e-05,2.5e-05,1.5e-05,1.7e-05,7e-06,3.4e-05,1.6e-05,3.9e-05,3.3e-05,1.8e-05,3.4e-05,1.8e-05,2.7e-05,2.5e-05,2.1e-05,2.8e-05,1.2e-05,2e-06,1.2e-05,3e-06,2.7e-05,1.7e-05,1.2e-05,1.1e-05,2.4e-05,1.4e-05,2e-05,2.4e-05,9e-06,1.8e-05,2.8e-05,1.7e-05,2.2e-05,5.7e-05,4.8e-05,6e-06,2e-05,1.7e-05,9e-06,3.5e-05,2.9e-05,2.5e-05,2.5e-05,1.7e-05,2.3e-05,1.3e-05,2.4e-05,1.8e-05,8e-06,3e-05,2.6e-05,2.5e-05,3.2e-05,1.9e-05,2.7e-05,6e-06,1.4e-05,7e-06,1.4e-05,9e-06
5.4e-05,0.000113,7.2e-05,2.4e-05,3.1e-05,4.3e-05,4.5e-05,3.1e-05,3.5e-05,4.1e-05,2.3e-05,1.8e-05,1.2e-05,3.6e-05,4.2e-05,5.1e-05,2.4e-05,2.2e-05,4.1e-05,5e-06,3e-05,5.8e-05,6.2e-05,7e-05,2.6e-05,1.3e-05,4.1e-05,4.3e-05,1.8e-05,2.3e-05,3.7e-05,3e-05,1.4e-05,4e-06,3.7e-05,3.2e-05,2.8e-05,1.6e-05,5.2e-05,1e-05,4.1e-05,2.6e-05,5.4e-05,5.9e-05,3.6e-05,5.8e-05,2.7e-05,2.5e-05,4.6e-05,2.2e-05,3.2e-05,3.4e-05,3.7e-05,3.8e-05,0,1.6e-05,3.4e-05,3.6e-05,6.1e-05,5.7e-05,1.9e-05,2.3e-05,1.1e-05,2.2e-05,3.4e-05,8e-06,1.6e-05,1.5e-05,4.4e-05,6e-05,6.1e-05,3.7e-05,2.2e-05,3.4e-05,1e-05,2.8e-05,1.7e-05,1.9e-05,1.6e-05,1.8e-05,1.5e-05,1e-05,1.9e-05,1.5e-05,1e-05,2.3e-05,1.9e-05,1.3e-05,2.5e-05,3.3e-05,3.1e-05,9e-06,8e-06,2.5e-05,4.2e-05,7e-06,1.4e-05,1e-06,1.2e-05,1.6e-05,1.8e-05,1.5e-05,1.3e-05,5e-06,7e-06,1.2e-05,2.4e-05,3.2e-05,1.2e-05,2.1e-05,1.8e-05,2e-05,1.5e-05,2.8e-05,3.5e-05,8e-06,5e-06,3e-06,1.8e-05,2.6e-05,2.6e-05
4.9e-05,2.7e-05,3.2e-05,5e-05,5.2e-05,1.5e-05,9e-06,5.5e-05,5.1e-05,4.1e-05,1.3e-05,1.9e-05,2.8e-05,1.6e-05,3.5e-05,4e-05,3.7e-05,9e-06,1.1e-05,2.8e-05,1e-05,3.3e-05,6.3e-05,2.9e-05,3.4e-05,7e-06,2.9e-05,1.3e-05,2.5e-05,7e-06,3.6e-05,2.2e-05,1.8e-05,1.3e-05,3.4e-05,1.7e-05,1.9e-05,1.9e-05,1.6e-05,1.2e-05,1.5e-05,1.9e-05,3.4e-05,2.6e-05,7e-06,1.6e-05,1.5e-05,1.8e-05,3.6e-05,4.4e-05,6e-06,8e-06,2e-05,3.9e-05,2.8e-05,6e-06,2.6e-05,3e-05,1.7e-05,2.7e-05,2.1e-05,2.6e-05,2.4e-05,1.7e-05,2.1e-05,2.5e-05,1.4e-05,1.9e-05,1.1e-05,2.1e-05,2.2e-05,1.7e-05,8e-06,6e-06,9e-06,2e-05,1.6e-05,1.4e-05,1.4e-05,1.1e-05,1.1e-05,1.5e-05,6e-06,1.1e-05,9e-06,1.5e-05,1.1e-05,1.5e-05,1.5e-05,4e-06,3e-06,6e-06,1.1e-05,1.3e-05,1e-06,4e-06,5e-06,1.2e-05,1.6e-05,1e-05,2e-05,6e-06,2e-06,1e-05,2e-06,2e-06,1e-05,1.4e-05,4e-06,1.4e-05,1.7e-05,1e-05,1.3e-05,5e-06,1.8e-05,1.1e-05,6e-06,3e-06,1.2e-05,7e-06,9e-06
3.1e-05,1.9e-05,1.9e-05,2.4e-05,4.7e-05,6.1e-05,4.3e-05,4.6e-05,1.5e-05,1.1e-05,2.8e-05,3.2e-05,2.7e-05,1.9e-05,1.6e-05,1.9e-05,1.6e-05,3.1e-05,2.1e-05,1.6e-05,8e-06,5e-06,1e-05,1.5e-05,3.7e-05,1.7e-05,2.7e-05,3.6e-05,1.7e-05,1.2e-05,2e-05,1e-05,8e-06,3e-06,1e-05,1.8e-05,1.3e-05,1.7e-05,2.2e-05,5e-06,1.5e-05,1e-05,2.7e-05,1.2e-05,1.4e-05,7e-06,1.4e-05,1.9e-05,2.5e-05,1.2e-05,9e-06,1.4e-05,8e-06,1.8e-05,2.4e-05,1.9e-05,3e-06,7e-06,5e-06,2e-05,9e-06,3.5e-05,1e-05,6e-06,4e-06,2e-05,2.7e-05,6e-06,4e-06,1.2e-05,4e-06,9e-06,5e-06,6e-06,1.4e-05,1.5e-05,1.6e-05,1.5e-05,1.4e-05,1.4e-05,1.1e-05,6e-06,8e-06,6e-06,1.9e-05,1e-05,6e-06,9e-06,3e-06,6e-06,1e-05,1.1e-05,4e-06,1.2e-05,1.3e-05,4e-06,8e-06,1.4e-05,8e-06,9e-06,1.1e-05,8e-06,4e-06,5e-06,7e-06,7e-06,7e-06,9e-06,5e-06,3e-06,9e-06,6e-06,1.1e-05,1.1e-05,5e-06,1e-05,4e-06,6e-06,3e-06,1e-06,8e-06
2e-05,2.4e-05,3.4e-05,1.7e-05,2.3e-05,1.8e-05,2.1e-05,4e-05,4.6e-05,2.4e-05,3.9e-05,1e-05,3.3e-05,4e-05,1.6e-05,1.3e-05,2.3e-05,1.7e-05,9e-06,9e-06,1.6e-05,2.9e-05,1.8e-05,4.2e-05,1.6e-05,3e-06,3.8e-05,9e-06,3.1e-05,2.1e-05,1.1e-05,1.4e-05,9e-06,1.3e-05,1e-05,3e-05,1e-06,1.4e-05,2.7e-05,3.3e-05,1.3e-05,5e-06,2.1e-05,2.1e-05,2.3e-05,1.2e-05,1.4e-05,7e-06,7e-06,1.2e-05,2.1e-05,1.4e-05,1e-06,1.4e-05,7e-06,6e-06,1.8e-05,3e-05,2e-05,1.2e-05,1.2e-05,6e-06,1.2e-05,1.1e-05,1.2e-05,1.1e-05,6e-06,1.2e-05,1e-05,1.4e-05,1.1e-05,9e-06,1e-05,1.4e-05,1.3e-05,7e-06,1.7e-05,8e-06,1.7e-05,1.1e-05,5e-06,6e-06,2e-06,1e-05,1.6e-05,1e-05,1e-05,1.9e-05,7e-06,7e-06,9e-06,1.4e-05,2e-06,2e-06,1.2e-05,8e-06,8e-06,6e-06,9e-06,5e-06,1.1e-05,9e-06,4e-06,4e-06,6e-06,7e-06,3e-06,9e-06,9e-06,8e-06,6e-06,6e-06,7e-06,2e-06,7e-06,1.2e-05,9e-06,3e-06,7e-06,4e-06,8e-06
2.4e-05,8e-06,4e-06,1.3e-05,7e-06,1.3e-05,1.3e-05,1.5e-05,1.7e-05,6e-06,3.5e-05,2e-05,1.1e-05,1.8e-05,8e-06,1.7e-05,9e-06,2e-05,2.3e-05,1.1e-05,1e-05,1.5e-05,1.9e-05,3e-05,3.3e-05,2.5e-05,2.3e-05,1.5e-05,2.8e-05,1.4e-05,1e-05,1.4e-05,1.1e-05,3e-06,1.2e-05,1.2e-05,4e-06,1.9e-05,1.4e-05,2.2e-05,7e-06,1e-05,2.5e-05,2.2e-05,4e-06,8e-06,1.1e-05,2.4e-05,8e-06,7e-06,7e-06,1.6e-05,1.9e-05,1.2e-05,3e-06,3e-06,2.2e-05,1.9e-05,6e-06,9e-06,4e-06,2.2e-05,1.6e-05,7e-06,2e-06,6e-06,1.1e-05,1.1e-05,7e-06,9e-06,9e-06,2e-06,1e-05,4e-06,7e-06,1.5e-05,5e-06,9e-06,1.4e-05,5e-06,1e-05,6e-06,7e-06,9e-06,1.6e-05,6e-06,4e-06,8e-06,6e-06,1.1e-05,6e-06,4e-06,7e-06,3e-06,3e-06,7e-06,9e-06,1e-06,9e-06,2e-06,1e-05,7e-06,5e-06,7e-06,7e-06,1.1e-05,3e-06,6e-06,9e-06,2e-06,4e-06,5e-06,4e-06,9e-06,9e-06,6e-06,2e-06,2e-06,5e-06,2e-06,5e-06
2.2e-05,1.4e-05,1.1e-05,9e-06,1.2e-05,7e-06,9e-06,1e-05,1.3e-05,1.4e-05,1.8e-05,1e-05,1.6e-05,3e-05,1.8e-05,1.3e-05,9e-06,1.1e-05,1e-05,1e-05,7e-06,4e-06,1.9e-05,3e-05,1.3e-05,1.3e-05,1.5e-05,1.9e-05,2.5e-05,1.5e-05,6e-06,1e-05,1.3e-05,1.2e-05,1.4e-05,2.4e-05,7e-06,1.8e-05,6e-06,1.9e-05,8e-06,1.2e-05,2.9e-05,6e-06,8e-06,3e-06,1.5e-05,1e-05,1.1e-05,8e-06,4e-06,1.3e-05,1.9e-05,1.1e-05,5e-06,3e-06,1.4e-05,1.6e-05,6e-06,3e-06,1.1e-05,2.2e-05,1e-05,9e-06,1.1e-05,7e-06,1.3e-05,3e-06,7e-06,4e-06,1.8e-05,1e-05,7e-06,6e-06,5e-06,6e-06,1.3e-05,6e-06,2e-06,1e-05,5e-06,1.3e-05,6e-06,6e-06,7e-06,4e-06,2e-06,5e-06,4e-06,1e-05,5e-06,2e-06,2e-06,6e-06,2e-06,1.5e-05,2e-06,6e-06,5e-06,4e-06,1.1e-05,4e-06,2e-06,4e-06,4e-06,1e-05,1e-05,1.4e-05,4e-06,2e-06,7e-06,3e-06,4e-06,1.3e-05,8e-06,2e-06,3e-06,3e-06,2e-06,3e-06,3e-06
1.8e-05,1.2e-05,1.3e-05,5e-06,1.1e-05,1.7e-05,7e-06,5e-06,2.2e-05,2.1e-05,2.2e-05,5e-06,1.7e-05,3.9e-05,1.5e-05,8e-06,1.5e-05,1.1e-05,5e-06,5e-06,1.3e-05,1.1e-05,1e-05,1.8e-05,6e-06,4e-06,1.3e-05,2.6e-05,2.4e-05,1.1e-05,1.5e-05,8e-06,9e-06,1.4e-05,1.5e-05,1.8e-05,3e-06,6e-06,1.8e-05,5e-06,6e-06,7e-06,1.1e-05,3e-06,7e-06,3e-06,1.1e-05,1.2e-05,9e-06,9e-06,1e-05,1.1e-05,1.3e-05,7e-06,2e-06,1e-06,4e-06,5e-06,5e-06,3e-06,6e-06,2.2e-05,1.6e-05,4e-06,1.3e-05,7e-06,8e-06,6e-06,9e-06,1e-05,1.5e-05,3e-06,6e-06,5e-06,1e-06,4e-06,1.2e-05,6e-06,1e-05,1e-05,4e-06,1.2e-05,6e-06,3e-06,8e-06,4e-06,2e-06,6e-06,5e-06,3e-06,5e-06,7e-06,6e-06,8e-06,8e-06,5e-06,2e-06,5e-06,4e-06,3e-06,1.4e-05,6e-06,7e-06,5e-06,1e-06,3e-06,4e-06,1e-05,9e-06,5e-06,5e-06,2e-06,4e-06,8e-06,2e-06,4e-06,5e-06,2e-06,5e-06,1e-06,3e-06
2e-05,9e-06,7e-06,2e-06,7e-06,1.6e-05,7e-06,1e-05,2.4e-05,4e-06,1.5e-05,1e-06,6e-06,1.9e-05,6e-06,7e-06,8e-06,1.8e-05,1.1e-05,1.1e-05,1.4e-05,9e-06,1.1e-05,2.7e-05,9e-06,1e-05,1e-05,2e-05,1.9e-05,5e-06,8e-06,4e-06,4e-06,1.2e-05,6e-06,1.7e-05,2e-06,9e-06,2e-06,5e-06,2e-06,7e-06,8e-06,8e-06,8e-06,1e-06,5e-06,5e-06,6e-06,4e-06,6e-06,3e-06,1.1e-05,6e-06,2e-06,4e-06,8e-06,9e-06,3e-06,7e-06,5e-06,1.6e-05,9e-06,1.4e-05,1e-06,4e-06,7e-06,7e-06,9e-06,5e-06,7e-06,2e-06,5e-06,6e-06,4e-06,4e-06,4e-06,7e-06,3e-06,7e-06,6e-06,5e-06,3e-06,3e-06,9e-06,2e-06,3e-06,3e-06,7e-06,2e-06,1e-06,5e-06,4e-06,6e-06,5e-06,5e-06,2e-06,7e-06,5e-06,2e-06,1.1e-05,2e-06,3e-06,4e-06,2e-06,1e-06,0,5e-06,4e-06,2e-06,5e-06,3e-06,2e-06,2e-06,6e-06,3e-06,3e-06,2e-06,3e-06,2e-06,3e-06
2.9e-05,1.3e-05,7e-06,8e-06,7e-06,1.7e-05,9e-06,1.5e-05,1.9e-05,1.7e-05,1.5e-05,8e-06,1e-06,1.6e-05,1.1e-05,6e-06,7e-06,8e-06,2e-06,9e-06,9e-06,7e-06,1.3e-05,2.4e-05,1.4e-05,1.2e-05,9e-06,1.4e-05,1.5e-05,4e-06,8e-06,6e-06,1.2e-05,1.5e-05,1e-05,2e-05,6e-06,1.4e-05,1.3e-05,3e-06,6e-06,4e-06,1.3e-05,1.6e-05,6e-06,8e-06,6e-06,8e-06,7e-06,2e-06,9e-06,9e-06,1.3e-05,6e-06,3e-06,6e-06,4e-06,1.4e-05,2e-06,4e-06,2e-06,1.9e-05,4e-06,1.4e-05,9e-06,3e-06,7e-06,8e-06,7e-06,1e-06,1e-05,4e-06,9e-06,2e-06,2e-06,6e-06,7e-06,4e-06,3e-06,9e-06,5e-06,7e-06,4e-06,7e-06,2e-06,3e-06,3e-06,0,6e-06,5e-06,4e-06,7e-06,6e-06,7e-06,4e-06,9e-06,6e-06,1e-06,4e-06,2e-06,7e-06,2e-06,2e-06,3e-06,3e-06,2e-06,1e-06,8e-06,3e-06,4e-06,3e-06,4e-06,2e-06,4e-06,3e-06,5e-06,3e-06,0,3e-06,2e-06,3e-06
1.8e-05,1.7e-05,1.6e-05,1.8e-05,1.4e-05,1.4e-05,9e-06,3e-06,1.4e-05,4e-06,1e-05,1.4e-05,5e-06,2e-05,5e-06,6e-06,8e-06,8e-06,1.1e-05,1e-06,1.1e-05,1e-05,1.4e-05,5e-06,3e-06,4e-06,1.8e-05,2.6e-05,1.2e-05,5e-06,1.6e-05,7e-06,1.1e-05,1e-05,9e-06,2.6e-05,7e-06,1.5e-05,5e-06,6e-06,5e-06,6e-06,1e-05,1.9e-05,1.4e-05,1.4e-05,6e-06,1e-06,5e-06,2e-06,7e-06,1.3e-05,3e-06,8e-06,3e-06,5e-06,4e-06,1e-05,5e-06,3e-06,3e-06,1.4e-05,4e-06,1.5e-05,1e-06,3e-06,6e-06,9e-06,1e-05,1e-06,1e-05,9e-06,8e-06,2e-06,5e-06,4e-06,1e-06,3e-06,4e-06,2e-06,3e-06,3e-06,4e-06,6e-06,1e-05,3e-06,2e-06,3e-06,6e-06,2e-06,2e-06,5e-06,2e-06,3e-06,2e-06,1e-05,2e-06,5e-06,5e-06,1e-06,7e-06,4e-06,3e-06,5e-06,1e-06,5e-06,4e-06,9e-06,4e-06,3e-06,8e-06,4e-06,4e-06,2e-06,2e-06,2e-06,1e-06,4e-06,6e-06,2e-06,2e-06
8e-06,2.4e-05,9e-06,1.1e-05,8e-06,7e-06,9e-06,1.5e-05,5e-06,1.5e-05,7e-06,1.3e-05,1.6e-05,2.5e-05,1.5e-05,4e-06,7e-06,4e-06,8e-06,1.1e-05,1.3e-05,1.2e-05,1e-06,1.6e-05,6e-06,1.6e-05,4e-06,1.2e-05,1e-05,1.6e-05,1.1e-05,0,1.1e-05,1.8e-05,1.4e-05,2e-06,1.1e-05,1.9e-05,1.3e-05,6e-06,7e-06,9e-06,1.3e-05,1.4e-05,6e-06,5e-06,0,6e-06,5e-06,6e-06,1.2e-05,9e-06,4e-06,5e-06,3e-06,9e-06,3e-06,9e-06,4e-06,6e-06,2e-06,2.6e-05,4e-06,1e-05,3e-06,3e-06,4e-06,8e-06,3e-06,4e-06,6e-06,4e-06,1.2e-05,7e-06,1e-05,5e-06,7e-06,4e-06,1e-06,1e-06,3e-06,2e-06,2e-06,4e-06,7e-06,3e-06,1e-06,3e-06,2e-06,7e-06,1e-06,5e-06,4e-06,7e-06,3e-06,1.4e-05,7e-06,6e-06,4e-06,1e-06,8e-06,4e-06,2e-06,6e-06,4e-06,4e-06,4e-06,9e-06,1e-06,3e-06,7e-06,4e-06,3e-06,3e-06,2e-06,3e-06,1e-06,4e-06,1e-06,1e-06,1e-06
2.9e-05,1e-05,1.4e-05,8e-06,6e-06,1.1e-05,1.7e-05,1.2e-05,2.2e-05,2.8e-05,2.2e-05,9e-06,1.4e-05,2e-05,1.4e-05,7e-06,1e-06,5e-06,5e-06,5e-06,5e-06,5e-06,6e-06,1.5e-05,1.4e-05,1.8e-05,1.6e-05,1.9e-05,8e-06,1.2e-05,1.5e-05,1.1e-05,1.3e-05,1.4e-05,9e-06,2.9e-05,1.1e-05,5e-06,1e-06,8e-06,1.3e-05,5e-06,1.8e-05,1.4e-05,1.4e-05,6e-06,8e-06,8e-06,8e-06,1.1e-05,7e-06,8e-06,8e-06,5e-06,4e-06,8e-06,8e-06,1.2e-05,9e-06,4e-06,4e-06,2.4e-05,1.2e-05,1.3e-05,7e-06,4e-06,8e-06,3e-06,1e-05,4e-06,6e-06,2e-06,5e-06,6e-06,4e-06,6e-06,3e-06,4e-06,5e-06,5e-06,3e-06,4e-06,2e-06,3e-06,2e-06,6e-06,2e-06,5e-06,1e-06,8e-06,6e-06,1e-06,4e-06,3e-06,5e-06,9e-06,3e-06,7e-06,2e-06,4e-06,7e-06,1e-06,4e-06,6e-06,1e-06,4e-06,5e-06,9e-06,7e-06,3e-06,4e-06,3e-06,5e-06,5e-06,8e-06,2e-06,2e-06,5e-06,4e-06,2e-06,1e-06
1.5e-05,2e-06,5e-06,7e-06,1.1e-05,6e-06,6e-06,1.2e-05,1.4e-05,4e-06,1.5e-05,2e-06,4e-06,2.2e-05,5e-06,3e-06,3e-06,4e-06,2e-06,7e-06,9e-06,1.3e-05,1.3e-05,5e-06,6e-06,1.5e-05,1e-06,1.8e-05,5e-06,1e-05,6e-06,4e-06,1.6e-05,9e-06,6e-06,2.4e-05,5e-06,9e-06,5e-06,2e-06,5e-06,8e-06,1e-05,6e-06,1e-05,3e-06,6e-06,2e-06,2e-06,3e-06,4e-06,3e-06,8e-06,8e-06,4e-06,6e-06,5e-06,5e-06,1.1e-05,6e-06,7e-06,2e-05,5e-06,1.1e-05,6e-06,5e-06,3e-06,5e-06,2e-06,3e-06,6e-06,2e-06,5e-06,2e-06,2e-06,2e-06,1e-06,3e-06,1e-06,6e-06,3e-06,5e-06,1e-06,4e-06,9e-06,3e-06,2e-06,6e-06,2e-06,5e-06,2e-06,3e-06,3e-06,1e-06,5e-06,6e-06,2e-06,4e-06,4e-06,5e-06,7e-06,2e-06,3e-06,2e-06,2e-06,2e-06,4e-06,2e-06,2e-06,5e-06,6e-06,0,3e-06,5e-06,4e-06,3e-06,1e-06,3e-06,2e-06,2e-06,2e-06
2.1e-05,5e-06,4e-06,0,8e-06,5e-06,7e-06,8e-06,8e-06,9e-06,1e-05,3e-06,1.4e-05,1.8e-05,9e-06,4e-06,9e-06,6e-06,2e-06,7e-06,1e-06,6e-06,1.1e-05,1.1e-05,6e-06,1.1e-05,5e-06,1.6e-05,1.1e-05,5e-06,9e-06,1e-05,7e-06,1.5e-05,1.2e-05,2.4e-05,5e-06,6e-06,2e-06,8e-06,4e-06,3e-06,6e-06,2e-06,9e-06,5e-06,2e-06,6e-06,3e-06,4e-06,1e-06,1e-05,8e-06,9e-06,1e-06,3e-06,3e-06,4e-06,3e-06,6e-06,5e-06,1.1e-05,7e-06,9e-06,4e-06,4e-06,8e-06,5e-06,2e-06,2e-06,6e-06,1e-06,3e-06,3e-06,0,2e-06,6e-06,3e-06,3e-06,8e-06,3e-06,3e-06,5e-06,5e-06,7e-06,2e-06,1e-06,3e-06,4e-06,2e-06,4e-06,3e-06,2e-06,4e-06,5e-06,6e-06,1e-06,8e-06,8e-06,1e-06,6e-06,5e-06,1e-06,6e-06,3e-06,1e-06,2e-06,5e-06,2e-06,1e-06,3e-06,2e-06,2e-06,1e-06,3e-06,4e-06,0,3e-06,1e-06,1e-06,1e-06
1.9e-05,8e-06,3e-06,2e-06,6e-06,6e-06,4e-06,9e-06,6e-06,1e-05,6e-06,1.4e-05,2.4e-05,2.4e-05,5e-06,1e-06,7e-06,1e-06,2e-06,5e-06,8e-06,1.9e-05,6e-06,1.6e-05,1.1e-05,1.2e-05,1e-06,1.3e-05,9e-06,5e-06,0,8e-06,1e-06,1.7e-05,1.5e-05,2.8e-05,8e-06,3e-06,9e-06,2e-06,6e-06,8e-06,3e-06,4e-06,6e-06,7e-06,4e-06,3e-06,2e-06,9e-06,6e-06,5e-06,9e-06,1.4e-05,5e-06,4e-06,4e-06,2e-06,8e-06,8e-06,6e-06,1.7e-05,1.2e-05,7e-06,5e-06,4e-06,6e-06,4e-06,3e-06,5e-06,6e-06,3e-06,1e-06,2e-06,3e-06,5e-06,2e-06,5e-06,6e-06,9e-06,3e-06,5e-06,6e-06,8e-06,6e-06,5e-06,2e-06,3e-06,3e-06,3e-06,4e-06,3e-06,4e-06,1e-06,3e-06,7e-06,9e-06,9e-06,4e-06,2e-06,3e-06,3e-06,3e-06,4e-06,2e-06,1e-06,3e-06,3e-06,1e-06,3e-06,3e-06,2e-06,3e-06,6e-06,4e-06,3e-06,3e-06,4e-06,0,1e-06,1e-06
1.7e-05,5e-06,4e-06,7e-06,5e-06,8e-06,1e-05,1.1e-05,9e-06,1e-05,7e-06,9e-06,1.3e-05,1.7e-05,4e-06,3e-06,7e-06,7e-06,6e-06,2e-06,1.1e-05,7e-06,2e-06,1.4e-05,1.1e-05,9e-06,2e-06,1.8e-05,3e-06,2e-06,4e-06,5e-06,1.1e-05,7e-06,2e-05,1.1e-05,7e-06,5e-06,5e-06,1e-06,3e-06,8e-06,1.2e-05,6e-06,1e-05,4e-06,1e-06,3e-06,6e-06,8e-06,6e-06,6e-06,7e-06,8e-06,2e-06,4e-06,6e-06,6e-06,9e-06,9e-06,6e-06,1.7e-05,6e-06,1.1e-05,3e-06,5e-06,7e-06,5e-06,5e-06,3e-06,5e-06,4e-06,6e-06,3e-06,4e-06,4e-06,3e-06,5e-06,1e-06,3e-06,5e-06,3e-06,4e-06,2e-06,7e-06,3e-06,1e-06,2e-06,2e-06,2e-06,1e-06,3e-06,2e-06,2e-06,6e-06,5e-06,5e-06,6e-06,7e-06,2e-06,7e-06,3e-06,3e-06,8e-06,1e-06,2e-06,2e-06,4e-06,3e-06,2e-06,5e-06,1e-06,4e-06,3e-06,4e-06,3e-06,2e-06,3e-06,4e-06,3e-06,2e-06
2.1e-05,1e-06,7e-06,1e-06,1e-06,7e-06,1e-05,5e-06,2e-06,8e-06,8e-06,6e-06,4e-06,1.4e-05,3e-06,3e-06,6e-06,6e-06,4e-06,5e-06,6e-06,3e-06,7e-06,1.3e-05,9e-06,1e-05,4e-06,1.6e-05,6e-06,3e-06,3e-06,2e-06,9e-06,7e-06,9e-06,1.3e-05,2e-06,6e-06,4e-06,3e-06,1e-06,8e-06,6e-06,7e-06,7e-06,3e-06,1e-06,3e-06,2e-06,7e-06,2e-06,7e-06,3e-06,7e-06,2e-06,2e-06,2e-06,3e-06,3e-06,4e-06,4e-06,1.4e-05,7e-06,1e-05,5e-06,2e-06,4e-06,6e-06,5e-06,3e-06,1e-06,1e-06,4e-06,3e-06,2e-06,2e-06,2e-06,1e-06,1e-06,5e-06,1e-06,1e-06,0,4e-06,6e-06,4e-06,1e-06,2e-06,2e-06,2e-06,2e-06,3e-06,4e-06,3e-06,5e-06,5e-06,3e-06,4e-06,4e-06,1e-06,6e-06,2e-06,1e-06,5e-06,1e-06,2e-06,2e-06,5e-06,3e-06,2e-06,4e-06,1e-06,2e-06,2e-06,5e-06,2e-06,2e-06,1e-06,2e-06,2e-06,0
1.9e-05,5e-06,5e-06,3e-06,1e-06,7e-06,9e-06,2e-06,1e-06,6e-06,7e-06,3e-06,3e-06,1.4e-05,3e-06,4e-06,2e-06,7e-06,2e-06,2e-06,5e-06,7e-06,6e-06,1.2e-05,7e-06,8e-06,4e-06,1.5e-05,6e-06,1e-06,4e-06,3e-06,8e-06,7e-06,8e-06,1.4e-05,2e-06,4e-06,6e-06,3e-06,1e-06,8e-06,7e-06,2e-06,7e-06,6e-06,3e-06,2e-06,3e-06,5e-06,3e-06,6e-06,4e-06,6e-06,1e-06,1e-06,1e-06,6e-06,3e-06,5e-06,3e-06,1.2e-05,6e-06,8e-06,5e-06,1e-06,6e-06,4e-06,4e-06,3e-06,3e-06,1e-06,3e-06,3e-06,3e-06,1e-06,3e-06,1e-06,0,5e-06,3e-06,0,0,4e-06,6e-06,3e-06,1e-06,2e-06,1e-06,1e-06,1e-06,3e-06,3e-06,3e-06,4e-06,6e-06,1e-06,4e-06,5e-06,0,6e-06,1e-06,1e-06,4e-06,1e-06,1e-06,1e-06,5e-06,2e-06,1e-06,4e-06,1e-06,1e-06,1e-06,4e-06,2e-06,0,1e-06,2e-06,1e-06,0
1.8e-05,4e-06,3e-06,2e-06,1e-06,5e-06,1e-05,1e-06,1e-06,8e-06,8e-06,2e-06,3e-06,1.3e-05,2e-06,3e-06,3e-06,8e-06,2e-06,3e-06,6e-06,7e-06,6e-06,1.2e-05,7e-06,7e-06,4e-06,1.3e-05,7e-06,1e-06,3e-06,0,9e-06,9e-06,8e-06,1.5e-05,1e-06,4e-06,4e-06,4e-06,1e-06,7e-06,7e-06,3e-06,7e-06,5e-06,1e-06,2e-06,2e-06,4e-06,5e-06,7e-06,4e-06,6e-06,1e-06,0,1e-06,5e-06,3e-06,5e-06,3e-06,1.1e-05,5e-06,8e-06,3e-06,1e-06,5e-06,4e-06,5e-06,3e-06,3e-06,0,4e-06,4e-06,3e-06,1e-06,3e-06,1e-06,1e-06,5e-06,2e-06,1e-06,1e-06,4e-06,6e-06,3e-06,0,2e-06,1e-06,1e-06,0,3e-06,3e-06,3e-06,4e-06,5e-06,2e-06,4e-06,4e-06,1e-06,6e-06,1e-06,1e-06,4e-06,0,0,1e-06,5e-06,2e-06,1e-06,3e-06,1e-06,1e-06,1e-06,3e-06,1e-06,1e-06,2e-06,2e-06,0,0
