-0.010953,-0.009082,-0.010213,-0.009928,-0.010105,-0.010534,-0.011947,-0.009239,-0.005505,-0.0061,-0.00696,-0.005575,-0.004819,-0.003655,-0.003031,-0.004889,-0.005838,-0.005225,-0.005048,-0.004905,-0.003316,-0.005487,-0.005269,-0.005096,-0.003837,-0.00341,-0.005082,-0.003976
-0.003516,-0.002815,-0.003442,-0.00519,-0.005502,-0.005838,-0.006848,-0.004051,-0.002474,-0.00423,-0.005002,-0.004407,-0.003815,-0.002446,-0.001458,-0.002354,-0.003631,-0.003769,-0.00285,-0.001131,-0.001732,-0.002108,-0.001556,-0.001819,-0.001271,-0.001048,-0.002352,-0.002477
0.00461,0.00461,0.005862,0.004884,0.005115,0.005274,0.00603,0.0049,0.001901,0.001525,0.001963,0.001677,0.001574,0.001154,0.000764,0.002272,0.002409,0.001601,0.001929,0.002608,0.000877,0.00119,0.001474,0.001547,0.000664,0.000482,0.002096,0.001444
0.002754,0.002444,0.003686,0.005188,0.005802,0.006292,0.007665,0.004274,0.001451,0.003143,0.004007,0.003663,0.003462,0.001963,0.000551,0.002294,0.003563,0.003231,0.002324,0.000765,0.000326,-0.000288,-5.8e-05,0.000472,-0.000501,-0.001026,0.001362,0.001913
-0.000381,-0.00138,-0.002181,-0.001257,-0.001165,-0.000601,-0.000624,-0.001343,-0.000186,0.001256,0.001214,0.000677,0.000696,0.000456,0.000322,0.000198,0.000641,0.000921,0.000178,-0.000753,-0.000504,-2.5e-05,0.000472,0.000209,0.000404,0.000122,-0.000591,0.000165
-0.004455,-0.003946,-0.004901,-0.006168,-0.006653,-0.005908,-0.007338,-0.004878,-0.0019,-0.00199,-0.002832,-0.002675,-0.002571,-0.001553,-0.000314,-0.001558,-0.00256,-0.002497,-0.002152,-0.001071,-0.000833,-3e-04,6.8e-05,-0.000519,0.000519,0.00105,-0.001323,-0.00133
-0.004353,-0.003067,-0.001901,-0.00313,-0.003744,-0.003254,-0.003758,-0.002249,-0.001755,-0.002777,-0.003307,-0.00228,-0.002271,-0.00186,-0.001274,-0.001895,-0.00284,-0.003101,-0.002399,-0.001344,-0.000785,-0.002266,-0.002383,-0.001894,-0.001695,-0.001187,-0.001108,-0.001393
0.005694,0.004102,0.005494,0.005879,0.005383,0.004557,0.005835,0.004859,0.002305,0.001007,0.001424,0.001546,0.001233,0.000688,0.000115,0.000508,0.000808,0.000954,0.001504,0.001442,0.00141,0.001081,0.00065,0.001228,2.6e-05,-0.000424,0.001414,0.00075
0.007998,0.005881,0.004905,0.006636,0.006858,0.005076,0.005719,0.004705,0.003349,0.002899,0.003734,0.003132,0.002764,0.002254,0.001617,0.002222,0.003144,0.003888,0.004078,0.003183,0.002647,0.004785,0.00409,0.003474,0.002889,0.00266,0.002776,0.002083
-0.004245,-0.002941,-0.004784,-0.003209,-0.00242,-0.003002,-0.004205,-0.00399,-0.001365,-9.7e-05,-0.000112,3.9e-05,0.000312,0.000249,0.000188,0.00015,0.000573,0.001087,0.000209,-0.001179,-0.000164,0.000356,-0.000376,-0.000884,0.00039,0.001065,-0.000646,-6e-06
-0.007489,-0.005543,-0.005525,-0.006422,-0.006227,-0.004849,-0.005523,-0.004997,-0.00254,-0.001305,-0.002073,-0.002222,-0.001686,-0.001296,-0.000799,-0.001528,-0.001883,-0.002337,-0.003538,-0.00379,-0.002343,-0.003495,-0.003669,-0.003226,-0.002219,-0.002134,-0.003085,-0.002022
0.002453,0.002719,0.004261,0.001535,0.001128,0.002241,0.003355,0.003611,0.00136,0.000556,0.000744,-0.000356,-0.000749,-5.7e-05,0.000529,2.8e-05,-0.000669,-0.00156,-0.001043,0.001059,-7.9e-05,0.000142,0.000715,0.000962,0.000129,-0.000715,0.000346,-0.000309
0.004411,0.004299,0.004726,0.004558,0.004781,0.00389,0.004803,0.004578,0.001179,-0.000479,0.000712,0.000874,6e-05,0.000412,0.000295,0.000627,0.000306,0.000117,0.001722,0.003368,0.001109,0.001102,0.001961,0.001969,0.000992,0.000599,0.002577,0.001461
-0.001283,-0.002352,-0.003615,-0.000892,-0.000384,-0.001732,-0.002429,-0.003109,-0.002317,-0.00229,-0.002245,-0.000732,-0.000246,-0.000615,-0.0013,-0.000616,-0.000152,0.000378,0.000292,-0.001058,-0.000852,-0.002504,-0.001909,-0.001743,-0.001404,-0.001184,-0.000562,0.000189
-0.001754,-0.003278,-0.00377,-0.003244,-0.003505,-0.003076,-0.004151,-0.004316,-0.001518,0.000238,-0.001271,-0.001022,0.000493,-2e-04,-0.00048,2.7e-05,0.000685,0.000916,-0.000695,-0.00265,-0.001156,-0.000984,-0.00105,-0.001563,-0.000834,-0.000729,-0.002238,-0.000938
-5.9e-05,0.001057,0.00231,-0.000493,-0.001028,0.000745,0.001085,0.001517,0.00162,0.003009,0.002054,0.000972,0.001324,0.000772,0.001079,0.001263,0.001239,0.000855,0.000407,0.000742,0.000757,0.002647,0.001971,0.001307,0.001543,0.00195,0.00043,9.5e-05
-0.000171,0.001816,0.002563,0.00123,0.001138,0.002104,0.003566,0.003471,0.0017,0.001361,0.002085,0.001474,6.8e-05,6.8e-05,0.00032,-0.000283,-0.000764,-0.000985,2e-04,0.001466,0.000791,0.000557,0.00026,0.001203,0.000736,0.001228,0.001595,0.000529
0.00145,0.000421,-0.000526,0.0015,0.001351,0.000329,0.000527,0.000518,0.000173,-0.001514,-0.000254,-1.8e-05,-0.001346,-0.000637,-0.000636,-0.001647,-0.001784,-0.001428,-0.00042,-2e-04,-9.5e-05,-0.001386,-0.000858,0.000293,-0.000696,-0.001015,-9.4e-05,-0.000388
0.001168,-0.000307,-0.001245,0.000748,0.000654,-0.001071,-0.003227,-0.00231,-0.000646,-0.002026,-0.001881,-0.000906,-0.000574,-3.4e-05,-1e-04,0.000155,3e-04,0.000775,0.000466,-0.000118,0.000347,0.000948,0.001138,0.00016,-4.8e-05,-0.000364,-0.000651,-0.00037
