-0.00311,-0.002142,-0.002263,-0.000833,-0.001876,0.001041,-0.001956,-0.003083,-0.003817,-0.002838,-0.002537,-0.001728,-0.001227,-0.00178,-0.003723,-0.004454,-0.002379,-0.004199,-0.002436,-0.0026,-0.002838,-0.005164,-0.002111,0.000923,-0.000354,-0.002317,-0.00341,-0.003277,-0.002246,-0.001899,-0.00479,-0.003811,-0.00299,-0.004442,-0.00486,-0.002754,-0.002427,-0.000544,-0.006167,-0.00386,-0.002838,-0.001618,-0.001249,-0.000668,-0.002311,-0.006725,-0.004097,-0.004544,-0.002613,-0.002091,-0.003908,-0.003647,-0.004892,-0.003469,-0.002299,-0.0023,-0.002587,-0.004129,-0.002555,-0.003035,-0.00267,-0.002375,-0.002714,-0.00187,-0.002285,-0.002833,-0.001667,-0.004987,-0.002317,-0.001892,-0.002152,-0.002459,-0.004964,-0.004658,-0.004783,-0.003663,-0.004731,-0.004439,-0.005459,-0.003222,-0.003001,-0.004756,-0.004013,-0.002327,-0.004305,-0.00297,-0.00252,-0.002001,-0.00198,-0.00345,-0.001194,-0.00199,-0.003499,-0.002735,-0.002532,-0.001783,-0.002681,-0.004243,-0.003048,-0.001436,-0.000627,-0.000804,-0.001096,-0.001061,-0.000504,-0.001173,-0.001775,-0.003147,-0.002346,-0.002201,-0.001361,-0.001528,-0.001803,-0.00133,-0.00189,-0.001608,-0.001963,-0.002257,-0.001282,-0.001697,-0.001416
-0.001055,-0.00224,-0.001174,-0.002116,-0.001578,-0.002238,-0.00227,8.3e-05,-0.00057,-7.6e-05,-0.000895,-0.002839,-0.002953,-0.00112,-0.00185,-0.000667,-0.001605,-0.000596,-0.001222,-0.000324,0.000142,0.000704,-0.000119,-0.002646,-0.006203,-0.002292,-0.001918,-0.001538,-0.001152,-0.002197,0.000149,0.00075,0.000585,0.001014,-4.9e-05,0.001078,-0.001859,-0.004773,-0.001717,-0.001904,0.000203,-0.002377,-0.003384,-0.003473,-0.004513,-0.000641,0.000802,0.000673,-0.000356,-0.001202,1.6e-05,-5.4e-05,-0.000274,-0.000808,-0.002323,-0.001118,-0.001893,0.00195,0.001124,0.000999,-0.001113,-0.001434,-1.7e-05,-0.002284,-0.002117,-0.001384,-0.000245,0.001415,-0.000229,-0.003647,-0.002455,-0.001193,-0.000698,0.000952,-0.002376,-0.001,0.000169,0.001297,0.001773,-0.000655,0.001827,0.001349,-0.001296,-0.001314,0.000545,-0.000409,-6e-05,-0.001073,-0.00034,-0.000392,-0.000868,-0.001924,-0.001119,0.000244,0.000313,-0.000578,-0.00072,0.001181,0.000981,-0.000477,-0.000948,-0.00088,-0.000228,-0.00021,-0.000771,-0.001664,-0.000394,0.000327,0.000318,0.000238,-0.000214,-0.000932,-0.00088,-0.000736,-0.001326,-0.000126,-0.000264,-0.000119,-0.001197,-0.000681,-0.00078
2.7e-05,0.000299,0.000547,-0.000473,-0.000492,-6.2e-05,-0.000952,-0.000687,0.000935,-0.000704,8.1e-05,0.001053,1.6e-05,-6.3e-05,-0.000583,-0.000874,0.000805,6.1e-05,0.000436,-5.4e-05,3.5e-05,0.000474,-0.000735,-0.00052,0.001699,-0.000889,-0.000267,5e-06,0.000403,-0.000486,-0.000466,-0.00104,-0.000873,-0.001236,-0.001421,-0.000983,0.000489,-0.000757,-0.001045,-0.00021,-6.2e-05,-0.001027,-0.000479,0.001536,0.003359,-0.000464,-0.001716,-0.000227,-0.000152,0.000651,-0.00238,0.000971,-0.000147,-0.000624,0.001418,0.000479,0.000615,-0.00117,-0.002054,-0.001767,-0.000565,0.000257,-0.00082,-0.000701,0.001112,0.000923,0.000123,-0.001483,-0.001333,0.001236,0.001086,0.000392,0.000695,9.4e-05,-0.000582,-0.000915,-0.002058,-0.00205,-0.002435,-0.00054,-0.002401,-0.001856,7.2e-05,0.000207,-0.000548,-0.000197,-0.00105,0.000184,-0.000359,-0.000577,-0.000238,0.000112,0.000722,-0.000341,-0.001351,-0.000589,-0.000257,-0.000643,-0.001101,-0.000131,-0.000179,0.00039,-0.000472,-5.2e-05,0.000543,0.000339,0.000188,-0.000643,-0.000819,-0.000655,-0.000142,-0.000255,-0.000188,3.3e-05,0.000247,-9.6e-05,1.5e-05,-0.000156,0.001027,-4.7e-05,0.000102
3.6e-05,0.001144,0.00124,0.001694,0.001874,-0.000337,0.00181,0.00075,-0.000318,0.00088,0.000262,0.000628,0.001287,0.001579,0.001807,0.002934,0.000654,-0.000477,-0.000727,-0.000211,-0.000436,-4.5e-05,-8.4e-05,0.00294,0.001984,0.003787,0.001528,0.001898,-0.00032,0.001316,0.00115,0.001953,0.001115,0.001722,0.0023,0.000258,0.000196,0.002906,0.004084,0.002463,0.000603,0.002153,0.002547,0.001223,0.000126,0.001888,0.002701,-0.000134,-0.000697,-9.9e-05,0.001674,-1.7e-05,-0.000236,0.001294,-5e-05,-0.000586,6.2e-05,0.000288,0.002004,0.000861,0.00176,0.001652,0.001716,0.001873,6e-04,0.000454,0.000229,0.000845,0.000867,0.001157,0.000906,0.000838,0.000831,-0.001505,0.002216,0.001944,0.0027,0.002159,0.002603,0.001107,0.000217,0.001613,9.7e-05,0.00084,0.000807,0.001267,0.00081,0.001066,0.000878,0.001002,0.000924,0.001188,0.000402,0.00112,0.000575,0.000489,0.000761,0.000797,0.001105,0.000301,0.000621,0.000107,0.00044,0.000169,0.000218,0.001012,0.00119,0.001371,0.001246,0.00094,3.4e-05,0.000876,0.000717,0.000475,0.000566,0.000138,-0.000108,0.000474,-0.000752,-0.000169,-0.000316
-4.3e-05,-0.000441,-0.001034,-0.000872,-0.00066,0.000107,0.000488,-0.000123,7.3e-05,4.9e-05,4e-06,0.000306,-0.000306,-0.000178,-0.001308,-0.002474,-0.001685,-0.000324,0.001059,-0.000542,0.00059,-0.001331,0.00063,-0.000988,-0.000985,-0.001276,-0.000988,-0.001489,0.000423,0.000185,-0.001612,-0.001979,-0.000789,-0.001713,-0.001687,0.000694,-0.000467,-0.000616,-0.001952,-0.001256,-0.001022,-0.000115,-0.00095,-0.001066,-0.001308,-0.000759,-0.001614,-0.000913,0.000294,-0.000316,0.000434,-0.000627,0.000126,4.4e-05,-0.000481,-7.2e-05,0.000522,-0.000364,-0.001613,-0.000374,-0.000986,-0.000646,-0.001324,-0.000339,-0.000925,-0.000252,-0.000299,-1.8e-05,0.000825,-1.8e-05,-0.001441,-0.000892,-0.000239,0.001125,-0.000907,-0.001886,-0.000605,-0.000934,-0.001899,-0.000659,0.000731,-0.000629,-0.00054,-0.000414,-0.00031,-0.000914,7.8e-05,-0.000215,-0.000755,0.000424,-0.000632,-0.000939,-0.000728,-0.001768,0.000119,-0.000172,-0.000272,-3e-05,-0.000318,-0.000136,-9e-06,-0.000261,8.1e-05,-0.000545,-0.000231,-0.000881,-0.001748,-0.001177,-0.001075,-0.000113,-0.000173,-0.00035,-0.000213,0.000101,-0.000187,0.000442,0.000588,6.8e-05,0.000137,0.000608,0.000767
-0.000149,8.2e-05,9.8e-05,0.00022,-0.000402,0.000229,-0.00039,0.000482,-0.000825,-0.000315,0.000391,-2.5e-05,-0.000708,-0.001603,0.000781,4.6e-05,0.001088,0.00058,-0.000442,-0.000192,-0.000349,0.001113,0.000167,-0.000707,-0.000794,-0.000891,-6.9e-05,0.000974,0.000612,-0.000635,0.000872,0.001767,0.000985,0.000838,0.000962,-0.000409,0.000323,0.000122,-0.000151,0.000904,0.001327,0.000375,-0.000499,0.001356,0.000655,-0.000327,0.000683,0.000451,0.000899,0.000484,-0.000109,0.00029,0.000539,0.000255,9e-06,0.000681,0.000252,0.001018,0.001,-0.000518,0.000746,-0.000503,0.000806,-0.000314,0.000486,-0.000608,-0.000951,-0.000724,-0.000824,-0.000702,1.5e-05,-0.000711,-0.000762,-0.001813,0.001024,0.001484,0.000136,0.001534,0.001228,0.000725,-9.2e-05,0.000745,0.000662,-0.000304,0.000537,0.000385,-0.000505,-0.000705,0.000688,-0.000711,0.000185,0.000406,0.000294,0.000857,-0.000653,-0.000123,0.000791,0.000471,0.000706,0.000241,-0.000222,-8.4e-05,-0.000106,0.00018,-0.000237,-0.000228,0.000843,0.000533,0.001193,0.000385,0.000246,-0.000124,-9.7e-05,-0.000259,-0.000139,-1e-04,-0.00019,0.000103,0.000523,-0.000156,-0.000658
0.00051,-0.000245,-0.000157,0.000135,0.000263,-0.00077,-0.000653,-0.000401,0.000917,0.000566,-0.000737,-0.000388,0.000652,0.00064,-0.000444,0.00107,0.000582,-0.000129,0.000316,0.000729,0.000139,-0.000567,-0.000694,-0.000255,0.001014,-0.000196,0.000374,0.000218,-0.000323,-0.000141,0.00053,-0.000453,-0.000666,-0.000659,-0.000347,0.000473,-0.000684,-0.000101,-0.000123,-0.000533,-0.000423,-0.000985,0.000637,0.000168,-0.000302,0.000786,3.8e-05,0.000431,-0.000711,-0.000391,-0.000432,-0.00126,-0.000628,-0.001155,9.1e-05,-0.000558,-0.001254,-0.000338,-0.000622,0.000669,-0.000499,0.000535,0.000199,-8e-05,0.000409,0.000166,0.000633,0.000661,0.000296,0.000459,0.001244,0.000564,0.000116,0.001863,-0.000497,0.000146,-0.000426,-0.000651,-0.00087,-0.001339,-0.000288,0.000153,5e-05,0.000493,0.000122,-0.000219,0.000587,0.000177,-6.3e-05,0.000486,0.000367,0.000214,0.000349,0.00024,0.000767,0.00054,3e-05,-0.00087,-0.000516,-0.000628,-0.000178,0.000297,-0.000153,-5.4e-05,0.000407,0.000204,0.000219,0.000293,-0.000588,-0.000522,-0.000205,0.000245,0.000176,0.000117,0.000141,-0.000127,8.3e-05,-0.000137,-0.000658,-0.000391,0.00026
-6.8e-05,-0.000354,0.000274,-0.000501,-0.000306,0.000338,9.4e-05,3.4e-05,-0.000956,-0.000616,0.000714,-9e-05,0.000132,0.000624,0.000101,-0.000331,-0.000775,-0.000517,-9e-06,-0.000934,-0.000322,0.000815,5.3e-05,0.000265,-0.000255,0.000852,0.000138,-0.000575,-0.000346,0.000463,-0.000272,-5.9e-05,0.000455,0.000715,0.000146,-0.000909,0.000554,-0.000283,0.00055,0.000651,-0.000197,0.000655,0.000328,-0.00094,-0.000503,-0.000647,0.000527,8e-05,0.000488,-0.000344,-0.000101,0.000691,0.000188,0.000381,-0.000214,4e-06,0.000643,-0.000543,-0.000279,-0.000217,0.000194,0.000105,-0.000317,0.000135,-0.000707,-0.000262,-4.5e-05,-0.000387,9.3e-05,-0.000162,-0.00043,0.000565,0.001028,-0.000573,-0.000436,-8.5e-05,-0.00017,-0.000927,3.3e-05,0.000978,0.000246,-0.00041,-0.000644,-0.000339,-0.000792,0.000157,-0.000275,0.000192,-0.000402,-0.000878,-0.000939,-0.000578,0.000329,-0.000211,-0.000565,-0.000197,-0.000754,0.000562,-0.000122,0.000386,0.000311,0.000317,0.000259,0.000181,-0.000306,-0.000302,-0.000559,-0.00038,-0.000179,6.6e-05,-0.000315,-0.00019,-0.000124,-0.000148,-0.00021,0.000257,0.000113,-0.000177,0.000239,0.000235,0.000153
0.000654,0.001221,4.5e-05,-0.00013,3.3e-05,0.000636,0.000174,0.000744,0.000701,-0.000115,-0.000454,0.000132,-0.000604,-0.000396,-0.000523,-6.7e-05,-0.000215,0.000325,-0.000266,0.00106,-7.2e-05,-0.000611,0.000355,0.000399,-0.000273,-0.000336,-0.000999,-0.000102,0.000437,-0.000278,-0.000313,-0.000338,-0.00049,-0.000515,-0.00053,6.8e-05,-0.000258,-0.000441,-0.000116,-0.001862,-0.000986,-0.000673,-0.000223,-0.000375,0.00048,0.000344,-0.000495,-0.000705,-0.000241,0.00051,0.00033,0.000219,-0.000214,-6.6e-05,-6.6e-05,0.000187,-0.000395,0.000325,0.000585,0.000233,-0.000291,-0.000868,-0.000233,-8.2e-05,0.00012,-0.000172,2e-06,0.000115,-0.000139,-0.000272,2.2e-05,-0.000418,-0.000406,-0.00017,0.000255,-0.000532,-0.000302,0.000393,5.8e-05,-0.00016,-0.000526,-0.000241,0.001042,0.000371,0.00033,-0.000631,-0.00029,-0.000223,0.000439,0.000619,0.000208,0.000281,-0.00094,-0.000116,0.000348,-0.000323,0.000348,-0.00014,-0.000123,-0.00029,-0.000251,-0.000496,-0.000451,-0.000214,-5.9e-05,0.000143,0.00024,1.8e-05,5.7e-05,-0.000243,0.00026,0.000535,6e-06,-3.2e-05,0.000137,-0.000648,-0.000293,0.000296,-0.000252,-9.6e-05,0.000125
-0.000931,-0.000905,-0.000268,0.000247,0.000189,-0.000193,-5.9e-05,-0.000692,-1.6e-05,0.000136,0.000422,0.000282,0.000403,1e-04,0.000537,0.000212,0.000459,0.000294,4.4e-05,-0.000745,0.000469,0.00047,-2.3e-05,-0.000253,-0.00058,-0.001104,0.000312,-3.7e-05,-0.000319,0.000397,-0.000196,-0.000141,0.000296,0.000112,0.000316,0.000186,0.000234,0.000104,6.9e-05,0.001012,0.00096,0.000761,-9.3e-05,0.000629,-0.000133,0.000169,-0.000231,0.000171,-0.000215,-0.000272,-0.000322,0.000352,0.000433,-0.00052,-0.000234,-7.1e-05,0.00039,0.000146,-1.6e-05,-0.000265,0.000355,0.000432,-2e-04,-8.5e-05,-0.000486,0.000258,-2e-06,0.000317,-8.3e-05,0.000231,-0.000373,-4.5e-05,-0.000152,-0.000241,-0.000563,-4.1e-05,0.000177,0.00042,0.000226,-0.000208,0.000887,0.000278,-0.00098,-0.000169,0.000334,0.000551,0.000252,0.000336,-0.000255,0.000128,0.000288,-9.2e-05,0.000391,-0.000103,-0.000519,0.000107,-0.000125,-0.000171,0.00028,0.00017,-3e-06,0.000128,6.3e-05,5.2e-05,0.000173,7e-05,0.000264,0.000483,0.000273,0.000381,0.000123,-0.000199,-1.4e-05,0.000374,0.000106,-1.9e-05,9.6e-05,-0.00013,0.000341,3.8e-05,-0.000286
-0.000249,0.000193,3.6e-05,-1.7e-05,-0.000135,-0.000496,8.9e-05,-0.000208,0.00012,0.000117,-0.000378,-0.000314,-0.000293,-8.5e-05,0.000232,-0.000388,0.000162,-0.000243,0.000169,0.000488,0.000296,-0.000204,8.4e-05,0.000102,0.000599,0.000796,0.00076,0.000288,-3.8e-05,-0.000251,0.000415,7.2e-05,-0.000789,-8.9e-05,-1.7e-05,5.9e-05,-0.000377,0.000197,-0.000232,0.000446,-0.000307,-0.000119,-0.000153,0.000109,-3.6e-05,-0.000456,0.000335,-0.000101,-0.000183,-2.3e-05,-3.3e-05,-0.000134,-0.000235,0.000352,6.3e-05,-0.000126,0.000191,-8.7e-05,-0.000374,0.000363,0.000211,5e-06,0.000282,0.000328,0.000508,0.000104,8e-06,0.000191,-3.3e-05,-0.00023,0.000239,0.000248,-4.1e-05,0.000509,0.000611,0.000405,0.000803,7e-06,0.000201,0.00025,-0.000726,-0.00031,0.000257,-0.000135,-0.000243,-0.00044,-0.000118,-0.000145,0.000226,-0.000142,7.2e-05,0.000168,0.00017,0.000152,0.000703,0.00013,0.000175,0.000166,3e-05,-5.2e-05,-0.000124,0.000229,0.00018,8e-05,-0.000145,0.000127,0.000103,-0.000378,-0.000249,-4.1e-05,7.5e-05,-5.9e-05,-5.8e-05,-7.2e-05,-0.00014,0.000185,-5.8e-05,1.3e-05,-0.000158,0.000197,-0.00023
0.000361,0.000169,-8.6e-05,-0.000197,0.00014,0.000134,0.000208,0.000474,-0.000408,-2.2e-05,0.000173,4.8e-05,0.000159,4.5e-05,-0.000245,0.000215,-0.000435,0.000193,-5.7e-05,-0.000339,-0.000178,6e-06,-1e-06,-0.000319,6e-05,-0.000249,-0.000373,-0.000259,0.000115,-0.000564,3e-05,0.000158,0.000758,0.00017,0.000237,-0.000162,0.000357,-2e-05,-7.8e-05,-0.000586,6.6e-05,-0.000231,-0.000181,-0.000529,6.6e-05,9.3e-05,-0.000305,0.000151,0.00022,0.000151,0.000175,-0.000349,0.000282,-9.4e-05,0.000198,0.000149,-0.000264,-9e-06,0.000182,-0.000305,-0.000539,0.000114,-0.000147,-0.000169,-0.000241,-0.000543,5e-06,-0.000219,2.4e-05,0.000126,-3e-06,-0.000339,0.00043,-8.7e-05,-0.000182,0.000263,-0.00076,-0.000429,-0.000311,0.000125,0.000301,0.000375,-0.000475,0.000123,-0.000157,0.00015,0.000294,-8e-06,-0.000425,3.4e-05,-0.000222,-0.000179,-0.000303,-6.7e-05,-0.000569,-0.000101,-0.00018,0.000127,-8.8e-05,1.9e-05,0.000101,4.9e-05,-0.000119,-8.5e-05,7.9e-05,-0.00011,-0.000122,-5.7e-05,-3e-05,-1e-06,-0.000109,-0.000137,3.8e-05,-0.000179,3.1e-05,0.000258,6e-05,4.1e-05,0.000185,-0.000192,0.000314
0.00033,8.2e-05,0.000119,0.000138,-5.7e-05,0.00049,8.6e-05,-2.4e-05,0.000424,0.000136,-7.5e-05,-1e-06,0.000111,-3.2e-05,-0.000176,2.4e-05,2.8e-05,-0.000291,-9.4e-05,0.000103,4e-06,-7.8e-05,0.000157,0.000369,0.000118,9.1e-05,-0.000337,-0.000103,-5.1e-05,0.000557,-0.00032,6.7e-05,-0.000263,-5.1e-05,-0.000247,4.2e-05,-0.000115,4.4e-05,1e-05,-0.000129,1.6e-05,8.8e-05,0.00027,0.000233,0.000243,0.00011,0.000209,-0.000176,-0.000221,-0.000109,-0.000125,0.000298,-0.00024,-0.000231,-0.000111,0.000301,0.000119,-0.000312,6.4e-05,0.000146,0.000106,-6e-06,5.3e-05,-6.3e-05,0.000153,0.000134,8.2e-05,-0.00026,2.1e-05,-1.8e-05,-1.7e-05,3.2e-05,-0.000415,-0.000318,0.000132,-0.000315,0.000149,0.000202,0.000245,-0.000246,-3.6e-05,-0.000256,0.000756,2.9e-05,4.7e-05,0.000125,-0.000315,-8.2e-05,0.000314,3.1e-05,8.2e-05,7.5e-05,0.000208,-4e-06,0.00022,9e-06,-6.6e-05,2.4e-05,-6.1e-05,-7.5e-05,2.8e-05,-2.7e-05,-5.1e-05,2.1e-05,-1.3e-05,2.6e-05,-0.000133,0.00017,0.000208,-6.2e-05,-6e-06,0.000137,2.1e-05,-6.2e-05,-0.000166,-0.000345,-9.5e-05,-8.1e-05,-0.000143,9.6e-05,-8.7e-05
-6.6e-05,-0.000264,0.000107,5.1e-05,3.7e-05,-0.000464,-8e-06,-4e-05,-0.000236,-0.00014,-1.8e-05,8e-05,-6.2e-05,6.1e-05,0.000196,-4.4e-05,0.00013,0.000144,0.000163,0.000301,-0.00013,-9.9e-05,-0.000175,-0.000201,-0.000113,0.00023,0.000521,0.000262,-0.000284,-0.000145,0.000184,-0.000146,-0.00019,2.6e-05,6.3e-05,0.000104,6.2e-05,0.000146,-1e-05,0.000345,0.000229,-8.3e-05,-6e-06,0.000298,-0.000267,-0.000203,9e-06,0.000422,-4e-06,-1e-06,0.000162,0.000142,-2.6e-05,0.000397,1.2e-05,-0.000163,4e-05,0.000349,-0.000141,-1.5e-05,-9.1e-05,-4.6e-05,4.2e-05,4.6e-05,-7.1e-05,0.000129,8.6e-05,0.000232,9.4e-05,5e-06,0.000171,0.00015,8e-06,6.2e-05,-0.000124,0.000207,0.000162,2.4e-05,3.2e-05,0.000158,1.6e-05,0.000131,-0.000348,2.1e-05,-8.9e-05,-0.000116,0.000115,0.000181,-7e-05,-0.000152,-1.6e-05,5.1e-05,-0.000158,0.00022,-4.7e-05,1.8e-05,0.000214,-9e-06,5.1e-05,1e-05,3.1e-05,-7.2e-05,2.5e-05,3.4e-05,9.9e-05,1.4e-05,-1.9e-05,-2.5e-05,-9.9e-05,-3e-05,0.000101,-0.000117,-1.5e-05,7.4e-05,0.000129,0.000175,5.9e-05,4e-05,2.2e-05,9.9e-05,-5e-06
-0.000168,5.6e-05,-0.00015,-1e-06,4.4e-05,0.000115,-0.000201,-3.2e-05,-6.1e-05,0.000149,7.9e-05,-9.9e-05,-0.000122,1e-05,6.4e-05,-5.6e-05,5.1e-05,0.000118,-0.000116,-0.000188,-5e-05,2.8e-05,-1.6e-05,0.000171,-0.000122,-6e-06,-0.000205,-6.3e-05,0.000126,-1.3e-05,8e-06,7e-05,0.000366,0.000101,2.6e-05,-9.6e-05,-0.000193,-0.00017,7.5e-05,9.7e-05,-7.1e-05,0.000158,-8.2e-05,-0.000122,-0.000146,0.000124,-5.3e-05,-0.000205,0.00012,2.5e-05,-1.6e-05,-0.000199,-1.9e-05,-8.8e-05,8.3e-05,-7.7e-05,-0.000133,-7.8e-05,8.4e-05,-1e-06,0.000171,-0.000145,1.9e-05,1.5e-05,0.000117,0.00011,-8.5e-05,-0.000159,-1e-05,-4.5e-05,-0.000145,-9.1e-05,1.4e-05,7.6e-05,5.6e-05,-0.000262,-0.00019,-0.00015,-9.4e-05,-8.9e-05,-2.6e-05,-1.7e-05,1e-04,3.4e-05,-4.6e-05,3.1e-05,5e-06,-1e-04,3e-06,-4e-06,1.9e-05,-1.9e-05,8.7e-05,-0.000116,2.3e-05,-7.2e-05,-0.000136,2.9e-05,-2.2e-05,5.1e-05,-1.1e-05,-1.8e-05,-5.6e-05,-1e-06,-7e-06,-2.6e-05,0.000118,-2.1e-05,4e-05,-5e-06,-5.2e-05,4.6e-05,7.5e-05,-3.8e-05,5e-06,-3.5e-05,8.8e-05,-5.1e-05,1.3e-05,-9.8e-05,0.000117
-6.1e-05,0.000174,3.2e-05,-9e-05,-4.5e-05,-8e-06,-3e-06,-3.4e-05,0.000182,-8.2e-05,-9.8e-05,-1.6e-05,9.8e-05,1.4e-05,-0.000139,-1.5e-05,-5e-06,-0.000176,1.4e-05,-2.1e-05,5e-05,9.4e-05,1.3e-05,-0.000176,7.3e-05,1.4e-05,0.000167,-1.7e-05,3.6e-05,-4e-06,8.2e-05,2.8e-05,-0.000105,-0.000107,-3.7e-05,9.5e-05,0.00011,0.00011,-3.4e-05,-0.000101,-0.000129,8.4e-05,1e-06,-0.000197,0.00014,-9.8e-05,5.3e-05,-5.7e-05,-2e-05,2.4e-05,-4e-05,-4.9e-05,9.3e-05,-4e-05,-2.3e-05,-3.4e-05,7e-06,-7.4e-05,-9.9e-05,-1.6e-05,-3.2e-05,9.1e-05,0.000118,2.6e-05,-1.8e-05,6.2e-05,0.000116,4.2e-05,-6.1e-05,4.8e-05,1.6e-05,7.3e-05,5.7e-05,3.8e-05,-2.5e-05,0.000136,4.9e-05,-2.5e-05,9.2e-05,7e-06,2.2e-05,-8.4e-05,-0.00016,-7.1e-05,2.3e-05,-3.2e-05,-1.7e-05,9.3e-05,-2.4e-05,2.2e-05,9.6e-05,1.8e-05,4e-06,2.6e-05,-2.4e-05,5.3e-05,-1.7e-05,-0.000173,-3.9e-05,-4.8e-05,-4.8e-05,3.6e-05,6.1e-05,1.7e-05,-7.2e-05,7.1e-05,-7.7e-05,2e-05,-1.7e-05,7.1e-05,3e-05,-6.2e-05,4e-05,6.3e-05,-3.3e-05,2.6e-05,3.3e-05,3.8e-05,-2.6e-05,4e-06,-0.000143
5.6e-05,-9.1e-05,9e-06,8e-06,1.6e-05,2.8e-05,8e-06,-4e-06,8e-06,-2.3e-05,7.3e-05,2.4e-05,-0.000106,-5.1e-05,6e-05,-1.1e-05,-0.000138,8.3e-05,6.5e-05,0.000114,7.1e-05,0.000218,1.5e-05,6.5e-05,1e-05,2.5e-05,-0.000168,-1.9e-05,-2.4e-05,0.000151,-4.3e-05,4.1e-05,-0.00016,-2e-06,4e-05,-9.7e-05,-2.8e-05,-5.1e-05,-3.8e-05,-1.5e-05,0.000114,-0.000104,1e-06,7e-06,4.7e-05,6.8e-05,-6.4e-05,-2e-06,-8.7e-05,-3e-06,3.1e-05,3.4e-05,-0.000114,-0.000102,-6e-06,9.7e-05,8.7e-05,0.000104,3.9e-05,7.1e-05,-1e-05,-5.6e-05,-0.000124,-1.8e-05,1.3e-05,-0.000124,-5.8e-05,1.9e-05,-4.2e-05,-2.3e-05,-1.3e-05,-1.8e-05,1e-06,-0.000147,-4.4e-05,-5.8e-05,3e-06,0.000158,2.5e-05,-8.4e-05,4.5e-05,0.000127,0.00012,-1e-06,3.4e-05,2.4e-05,4.1e-05,-0.00011,4e-06,-9e-06,-0.000103,-7e-06,9e-06,-2.8e-05,0.000102,3e-06,4.8e-05,8e-05,1e-06,3e-06,-2.4e-05,-2.2e-05,-7e-06,-2.1e-05,-1.6e-05,4e-06,2e-06,-5e-06,2.9e-05,-4.5e-05,8e-06,2.4e-05,1.1e-05,-2.1e-05,3.9e-05,1.3e-05,-6e-05,-1.7e-05,5.6e-05,1.8e-05,3e-05
8.2e-05,-2e-06,1.3e-05,4.1e-05,3e-05,-0.000131,3.1e-05,-2e-05,-2.5e-05,2e-06,-6.2e-05,8e-06,0.000152,-2e-06,-3.7e-05,9.8e-05,7.7e-05,-3.7e-05,-4.2e-05,-0.000107,-2.6e-05,-0.000158,-4.6e-05,-8.4e-05,-1.5e-05,-5.9e-05,-3.2e-05,-1.3e-05,3.4e-05,-2e-04,-0.000151,-5.2e-05,0.000155,3.9e-05,-2.8e-05,0.00011,-2.5e-05,-2.4e-05,-2.4e-05,-0.000233,-4e-06,2.7e-05,-2.6e-05,0.000113,4e-06,6.2e-05,0.00013,3e-05,4.6e-05,3e-06,-4.2e-05,6.7e-05,5.1e-05,1.5e-05,1.7e-05,-8.8e-05,-2.3e-05,-4.2e-05,2.2e-05,-7e-05,7e-05,0.000126,-3.3e-05,3.1e-05,-0.000113,-3.1e-05,4.4e-05,-6e-05,2.2e-05,2.2e-05,-2.8e-05,-0.000112,-7e-06,2e-05,0,-6.1e-05,-0.00015,-6e-06,-6.5e-05,0.000102,-6.5e-05,-5.7e-05,-0.00013,-5.5e-05,3.7e-05,5.4e-05,-1.7e-05,1.8e-05,3.8e-05,7.7e-05,5.3e-05,-2.9e-05,-6.4e-05,-2e-06,-0.000146,-5.7e-05,-1.3e-05,9.2e-05,-2.1e-05,-3.5e-05,1.4e-05,-8.1e-05,-3.2e-05,9e-06,4.2e-05,-9e-06,-8e-06,7.4e-05,1.7e-05,1.6e-05,1.1e-05,-1e-05,-3.8e-05,3.4e-05,-2.9e-05,-5e-06,1.8e-05,4e-06,-7.7e-05,-4.1e-05,5.8e-05
1.4e-05,-3.3e-05,4.8e-05,-2.1e-05,-2.9e-05,0.000108,3.3e-05,3.5e-05,-3.6e-05,-4.8e-05,5.4e-05,-3e-05,-6.7e-05,1.8e-05,0.000105,3e-06,8e-05,6.2e-05,-2.4e-05,0.000126,3.8e-05,2.5e-05,4.5e-05,0.000111,-9e-06,-4.3e-05,5.6e-05,5.8e-05,5.2e-05,0.000187,5.4e-05,-7.2e-05,-9.5e-05,-6.5e-05,1.2e-05,-5e-05,7.4e-05,1e-05,3.7e-05,0.000203,3e-05,3.7e-05,0.000124,1.5e-05,-6.6e-05,-7.8e-05,-7.1e-05,9.1e-05,6.3e-05,-5.9e-05,2.2e-05,-1.4e-05,-4.1e-05,1.1e-05,-4.1e-05,-1e-05,-3.7e-05,4e-05,-6.2e-05,1.8e-05,-7.9e-05,-7.4e-05,4.1e-05,-5.3e-05,5e-05,1.2e-05,-1.4e-05,3.4e-05,6e-06,-2.5e-05,4.1e-05,7.5e-05,-6.9e-05,-1.3e-05,-7.3e-05,7.6e-05,8.5e-05,-7.6e-05,-3.5e-05,-0.000103,6e-05,-5.3e-05,0.000152,2.7e-05,-4.8e-05,0,-1.5e-05,-2e-06,-3e-06,-5.7e-05,-5.8e-05,2.2e-05,1.8e-05,7.3e-05,0.000142,6.7e-05,1.2e-05,-8.2e-05,5e-06,1.2e-05,1.3e-05,-1.1e-05,3e-05,0,-1.1e-05,3e-06,1.3e-05,-6.2e-05,-6.1e-05,1.4e-05,0,2.3e-05,8e-06,-1.9e-05,8e-06,-7.7e-05,-1.3e-05,4e-06,6.1e-05,3.9e-05,-4.9e-05
-8.6e-05,1.4e-05,-8e-05,6e-06,3.3e-05,3.6e-05,2.4e-05,-5.7e-05,-1.2e-05,5.1e-05,-6e-05,2.1e-05,-1.8e-05,2.6e-05,-8e-05,-2.4e-05,-5.7e-05,-5e-06,2.8e-05,-0.000139,-6e-05,-5.8e-05,2e-05,-6.8e-05,-8e-06,4.5e-05,0.000132,-1.6e-05,9e-06,-8.4e-05,4.5e-05,4.1e-05,5.3e-05,4.6e-05,1.2e-05,-2.7e-05,-7.1e-05,5e-06,3.5e-05,4.8e-05,-9e-05,-8.9e-05,-6.6e-05,-0.000125,6.2e-05,7.6e-05,-1.8e-05,-7e-05,-7.4e-05,1e-05,-6e-06,5.5e-05,4.2e-05,-2.3e-05,-9e-06,6e-06,1.1e-05,-5.7e-05,1e-04,-1.6e-05,6.6e-05,4.2e-05,-1.7e-05,4.9e-05,-3.1e-05,-2.2e-05,3.5e-05,-4.9e-05,4e-06,9e-06,-1.3e-05,4e-05,6.3e-05,0.000126,0.000147,-4.8e-05,4.4e-05,-2.6e-05,-1.7e-05,3.4e-05,-2.6e-05,4e-05,-9.3e-05,-1.2e-05,-2e-06,-5e-05,2.9e-05,5.3e-05,-3e-06,5e-05,2.5e-05,-5e-06,2.7e-05,-7.5e-05,-8e-05,-2.8e-05,-3.4e-05,-3.7e-05,7e-06,1.2e-05,1e-06,2.6e-05,7e-06,3e-06,1.1e-05,-3.8e-05,3.2e-05,-1.4e-05,3.3e-05,-2.5e-05,-1.7e-05,-2.3e-05,1.3e-05,-8e-06,-1e-05,7.1e-05,-3.6e-05,0,-5.4e-05,1.1e-05,2.5e-05
-7e-05,-4.5e-05,3.4e-05,4e-06,-2.7e-05,-5.3e-05,-1.8e-05,-3.1e-05,1e-06,-2.5e-05,3.6e-05,2.2e-05,2.2e-05,3e-06,-7e-06,-1.9e-05,-3.4e-05,-2e-05,-3e-06,0.000105,-2.3e-05,4.9e-05,-7e-06,1.8e-05,3.1e-05,-2.2e-05,-0.000146,-3e-06,1.4e-05,1.8e-05,5e-06,1.7e-05,-5.4e-05,-2e-05,4e-06,-2.5e-05,5.9e-05,-8e-06,-1e-06,-0.000118,1.3e-05,1.5e-05,-3e-05,8.1e-05,-3e-05,-2.8e-05,7e-05,-1.6e-05,1.6e-05,0,-1.9e-05,-1.2e-05,-3.8e-05,9.9e-05,2.6e-05,-1.5e-05,-3.8e-05,-4e-06,-3.8e-05,4e-05,-3.9e-05,-2.6e-05,-6e-06,-3.1e-05,5.4e-05,2.7e-05,-3.2e-05,-4.6e-05,-5e-06,3e-06,-5e-06,-4.9e-05,-7e-06,-8.4e-05,-9e-05,6.5e-05,-9.4e-05,7.7e-05,2.7e-05,1.7e-05,4e-06,-4.7e-05,4e-05,-1.3e-05,9e-06,4e-05,3e-06,-3.6e-05,-9e-06,-2.1e-05,-2e-05,1e-05,-3.5e-05,1.8e-05,1e-05,-1.9e-05,3.4e-05,3.6e-05,-1.5e-05,-3e-06,2e-06,1.6e-05,-2.6e-05,-5e-06,-6e-06,4e-05,-6.4e-05,3.7e-05,-1.4e-05,5e-06,1.8e-05,2.3e-05,-7e-06,-1.2e-05,-5e-06,3.3e-05,2e-06,7e-06,6.8e-05,-3.4e-05,0
3.5e-05,4.2e-05,-4e-05,4e-06,5e-06,-4.4e-05,-1.5e-05,7.8e-05,5.3e-05,3e-06,-4.7e-05,-1.4e-05,6e-06,-2e-05,7e-06,-1.7e-05,1.6e-05,4.6e-05,-1.8e-05,-6.8e-05,-3e-06,4.2e-05,1e-06,4.3e-05,1.4e-05,-1.3e-05,5e-06,9e-06,-2.2e-05,-8e-06,-3.6e-05,1.6e-05,6.5e-05,1.6e-05,-4e-06,5.1e-05,-6e-05,-1.5e-05,-2e-05,4.1e-05,5e-05,8e-06,-1.1e-05,3e-05,1e-05,-3e-05,-9.6e-05,-5.7e-05,3.8e-05,4e-06,1.3e-05,-7.7e-05,1e-06,-6.2e-05,-1.6e-05,-1.7e-05,-4e-06,7.1e-05,-3.2e-05,-2.6e-05,1.7e-05,2.9e-05,-2.6e-05,-2e-06,-3.7e-05,1.9e-05,1.8e-05,9.8e-05,1.1e-05,1.1e-05,-2.2e-05,3.1e-05,0,6e-06,3.5e-05,-5.2e-05,9.1e-05,-2.1e-05,2.2e-05,-1e-06,2.3e-05,3.8e-05,-7.3e-05,3e-06,1.6e-05,-7e-05,-3.2e-05,2.3e-05,1e-06,-3e-05,9e-06,-2e-06,1.4e-05,-6e-06,0,1.6e-05,1.4e-05,-3.2e-05,2.3e-05,-2e-06,2e-06,-4e-06,6e-06,5e-06,2e-06,-1e-05,1.4e-05,-1.7e-05,7e-06,-2e-06,1e-06,-1.1e-05,-1.4e-05,3e-05,2e-06,-3.9e-05,2.2e-05,-7e-06,-3.9e-05,1.9e-05,-3.2e-05
8.1e-05,5e-06,3.9e-05,8e-06,1.9e-05,9e-05,-1.4e-05,4e-06,-3.7e-05,2.6e-05,2.9e-05,-8e-06,-3.4e-05,-1.7e-05,3e-06,1.1e-05,2.6e-05,-4.3e-05,2.4e-05,4e-06,-3.3e-05,-3.7e-05,3e-06,-9.9e-05,-1.8e-05,1.4e-05,4.7e-05,-2.8e-05,1e-05,-2.5e-05,-2e-05,-3.3e-05,-8e-06,-8e-06,-3e-06,-4.3e-05,4.9e-05,2.8e-05,-2.7e-05,1e-04,-2.7e-05,-7e-06,8e-06,-1.1e-05,-3e-05,3e-05,6.6e-05,0.000114,-3.3e-05,1.9e-05,1.1e-05,-1.8e-05,-6e-06,-1.4e-05,-2e-06,5e-06,1.7e-05,-7.2e-05,2.5e-05,-9e-06,2.5e-05,-4.2e-05,3.5e-05,1e-06,3.3e-05,-1.1e-05,-1e-06,7e-06,-5e-06,-1.6e-05,-2e-05,-1.4e-05,1.7e-05,-5.6e-05,9e-06,2e-06,3.1e-05,-3.7e-05,-8e-06,-3.1e-05,-2.1e-05,2e-05,6.9e-05,1e-06,-2.4e-05,6.8e-05,3.7e-05,-3.8e-05,1.4e-05,1.9e-05,1.9e-05,-1.3e-05,-2.9e-05,2e-05,4.9e-05,1.3e-05,-4.4e-05,3e-06,1e-06,-1.4e-05,-1.6e-05,-1.4e-05,2e-06,-8e-06,6e-06,1.1e-05,2.5e-05,6e-06,-1.7e-05,1e-06,-1.8e-05,1.1e-05,-5e-06,-3.6e-05,2e-06,-1.4e-05,1.1e-05,9e-06,1.3e-05,-4e-06,3.2e-05
1.6e-05,-1.2e-05,2e-05,-1.5e-05,-2.6e-05,-2.8e-05,-1.5e-05,-1.2e-05,2.4e-05,-2.9e-05,-1.3e-05,0,5.8e-05,3e-06,1.2e-05,3e-05,6e-06,3.6e-05,-3e-06,3.3e-05,5.1e-05,-2e-05,-2e-06,8.7e-05,-5e-06,-8e-06,3.3e-05,6e-06,-2.9e-05,1e-05,4.6e-05,7e-06,-6e-05,-5e-06,-1e-06,2.3e-05,-2e-05,-8e-06,-4e-06,-3.8e-05,-1.8e-05,3.2e-05,2.2e-05,-6.7e-05,1.3e-05,-2.8e-05,3.1e-05,-3.6e-05,-2e-05,-1.1e-05,1e-06,3e-06,1.5e-05,2.3e-05,6e-06,4.3e-05,0,-4e-06,-1.5e-05,1.2e-05,-4.9e-05,2.6e-05,3.3e-05,1.8e-05,4e-06,-1.1e-05,-1.5e-05,-4.5e-05,-7e-06,4e-06,5.2e-05,-4.4e-05,6e-06,9.1e-05,-2.1e-05,-1e-05,-0.000101,1.8e-05,-8e-06,2.6e-05,2.9e-05,-4.7e-05,-9e-06,-1e-06,-7e-06,-2.6e-05,-2.5e-05,1.3e-05,-3.7e-05,7e-06,-2e-05,8e-06,0,1.5e-05,-7.8e-05,-3.2e-05,6e-06,4e-05,-1.7e-05,1.1e-05,7e-06,1.4e-05,-1.4e-05,0,-1e-05,9e-06,9e-06,-1.4e-05,1.3e-05,1e-05,-4e-06,3e-06,1.3e-05,1e-06,3e-06,8e-06,1.1e-05,-4e-06,-1.4e-05,-1.1e-05,-1.5e-05
-6.6e-05,-1.6e-05,-4.3e-05,2e-06,6e-06,-3.5e-05,3e-06,8e-06,-2.6e-05,1.3e-05,3e-06,1.1e-05,-7.4e-05,1.2e-05,-1.5e-05,-1.2e-05,-4.8e-05,-3.3e-05,-2.2e-05,-3.5e-05,2e-05,-1e-05,-1e-05,-3.1e-05,-1.1e-05,1.3e-05,-3.4e-05,4e-06,-2.8e-05,-3e-06,1.6e-05,1.3e-05,9.5e-05,6e-06,8e-06,-1e-05,5e-06,-1.4e-05,1.9e-05,-5.7e-05,-5e-06,-2.2e-05,2e-06,2.8e-05,-1.3e-05,1.5e-05,-8e-05,3.3e-05,3.8e-05,-1.8e-05,-1e-05,4.5e-05,-9e-06,-5.3e-05,-1.1e-05,-3.3e-05,2.8e-05,2.4e-05,1.8e-05,1.1e-05,3.7e-05,-2.1e-05,-2e-05,-2.4e-05,1.1e-05,-1.3e-05,1.2e-05,1.5e-05,5e-06,9e-06,-9e-06,4.4e-05,-2.2e-05,-3e-05,2.2e-05,2.1e-05,4.5e-05,3.2e-05,-7e-06,-3e-06,-3.1e-05,4.3e-05,2.6e-05,1.9e-05,0,9e-06,4e-06,6e-06,4.3e-05,-1.6e-05,1.8e-05,6e-06,3.8e-05,-4.8e-05,6.3e-05,2.5e-05,1.4e-05,-2.7e-05,1.9e-05,-2e-06,-2e-06,2.2e-05,1e-05,4e-06,1e-06,-2.6e-05,-6e-06,3e-06,2e-06,4e-06,-1e-06,-4e-06,-1e-06,1e-06,-7e-06,1e-05,-5e-06,-2e-06,0,4e-06,3e-06
-3.3e-05,2.6e-05,1.7e-05,9e-06,6e-06,2.7e-05,6e-06,-2e-06,-1e-06,-4e-06,3e-06,-1.6e-05,4e-05,0,2.2e-05,-2e-05,2.4e-05,2.4e-05,1.4e-05,1.8e-05,8e-06,2.2e-05,-3e-06,0,3e-06,2e-06,-1.8e-05,2.6e-05,1.5e-05,2.3e-05,-2.7e-05,5e-06,-6.4e-05,-1.1e-05,-5e-06,1.3e-05,-1.7e-05,2.4e-05,1.9e-05,1.4e-05,3e-05,1.7e-05,-1e-05,3.4e-05,2.3e-05,-1e-06,1.5e-05,-5.5e-05,-1.1e-05,2.3e-05,1e-05,2e-06,-4e-06,2.4e-05,1.4e-05,-1e-05,-1e-06,1.3e-05,-1.4e-05,-2.1e-05,-4.6e-05,1e-05,-1.2e-05,2.4e-05,-2.9e-05,1.2e-05,-9e-06,2.5e-05,3e-06,-7e-06,-4e-06,9e-06,0,6e-06,-5.8e-05,-1.6e-05,8e-06,2e-06,1.4e-05,-7e-06,5e-06,-9e-06,-7e-05,-5e-06,-1.1e-05,-7e-06,1.5e-05,6e-06,-2.8e-05,2.1e-05,-1.6e-05,-2e-06,-2.4e-05,2.5e-05,-3.4e-05,-6e-06,-7e-06,-2.7e-05,-3e-06,-4e-06,2e-06,2e-06,-1e-06,-4e-06,-1e-06,2.3e-05,-2.5e-05,1.9e-05,-2e-06,-1.3e-05,4e-06,0,3e-06,2.4e-05,9e-06,1e-06,-9e-06,2e-06,1.8e-05,7e-06,1e-06
2.7e-05,-3.3e-05,-1.3e-05,-1e-05,-1.3e-05,1.7e-05,1.5e-05,-6e-06,-5e-06,-1.3e-05,-1.5e-05,6e-06,9e-06,-6e-06,-1.9e-05,3e-06,2.2e-05,-9e-06,1e-05,-1e-05,-9e-06,0,4e-06,1.7e-05,7e-06,6e-06,-8e-06,-7e-06,-3e-06,-3.6e-05,-1.9e-05,-1.6e-05,1.2e-05,9e-06,1e-06,2.2e-05,1e-05,-9e-06,0,-3.7e-05,-3e-06,-8e-06,-2.5e-05,-9e-06,-7e-06,-3e-05,1.6e-05,1.7e-05,-2.8e-05,-2.7e-05,7e-06,-9e-06,5e-06,-1.5e-05,0,4e-06,-1.7e-05,1e-06,1e-05,9e-06,2.6e-05,8e-06,3e-06,-1.6e-05,-7e-06,2.3e-05,1.3e-05,-3e-05,-7e-06,-3e-06,-1.1e-05,-2.4e-05,8e-06,-3.7e-05,3.8e-05,2.6e-05,-6.7e-05,-4.2e-05,-2e-06,2.1e-05,-4e-06,-3e-06,7.1e-05,1.3e-05,-1e-06,-8e-06,-1.6e-05,-6e-06,7e-06,-2e-05,1.1e-05,-1e-06,0,-4e-06,1e-06,-1e-05,-1.4e-05,4.5e-05,-9e-06,-6e-06,-5e-06,-1.8e-05,-1.3e-05,-2e-06,2e-06,-2.5e-05,1.6e-05,-2.2e-05,8e-06,-1e-06,-1.3e-05,0,2e-06,-3e-06,-1.1e-05,1e-06,6e-06,-5e-06,-2.1e-05,-1e-05,-2.2e-05
3.7e-05,3.3e-05,1.8e-05,1e-06,1.3e-05,-3.2e-05,1.1e-05,-1e-05,3.1e-05,1.3e-05,1.3e-05,8e-06,-2.4e-05,-5e-06,1e-05,-7e-06,-1e-06,-4e-06,-1.8e-05,-1e-05,-1.7e-05,1e-05,2e-06,-2.4e-05,4e-06,-4e-06,4.7e-05,-2.5e-05,-1.2e-05,4.2e-05,6e-06,-1.7e-05,0,-1.3e-05,4e-06,-3.1e-05,-1e-06,-3e-06,-1.6e-05,6.6e-05,-1.6e-05,-1.6e-05,2.7e-05,-4.7e-05,1.9e-05,2.5e-05,-8e-06,2.9e-05,2.8e-05,2.6e-05,-1.7e-05,6e-06,-6e-06,-4e-06,-9e-06,2.3e-05,-1e-06,-4.1e-05,3e-06,2e-06,1e-06,3e-06,1.2e-05,7e-06,-5e-06,2e-06,-1.4e-05,1.9e-05,-2e-06,3e-06,-1.6e-05,2.2e-05,-6e-06,3.6e-05,-1e-06,-1.8e-05,7e-05,1.1e-05,-7e-06,-9e-06,9e-06,2.4e-05,-5.8e-05,-5e-06,1.3e-05,2.7e-05,4e-06,4e-06,6e-06,6e-06,-5e-06,-5e-06,4e-06,1e-05,1e-05,7e-06,-1e-06,6e-06,6e-06,0,3e-06,-2e-06,1.7e-05,0,-2e-06,1.9e-05,1.1e-05,3e-06,-6e-06,-2e-06,2e-06,-7e-06,-1e-06,-3e-06,5e-06,-3.2e-05,-2e-06,0,1.8e-05,6e-06,2.1e-05
9e-06,-2.3e-05,7e-06,5e-06,-1.1e-05,0,-1e-06,1e-05,-2.9e-05,-2e-06,-2.1e-05,-4e-06,2.4e-05,2e-06,-2.1e-05,6e-06,-1.8e-05,6e-06,1e-05,3.7e-05,-5e-06,-2.3e-05,-1e-06,2e-06,-4e-06,0,8e-06,9e-06,1.9e-05,-3.7e-05,2.5e-05,1.7e-05,0,6e-06,-3e-06,1.5e-05,-2e-06,1.3e-05,-1.4e-05,-2.6e-05,1e-05,1e-05,-1e-06,3.6e-05,-2.2e-05,-5e-06,-4e-06,-1.7e-05,4e-06,-8e-06,5e-06,-5e-06,1e-05,-7e-06,7e-06,-2.1e-05,1e-05,3.3e-05,-1e-06,-2e-06,-1.4e-05,-8e-06,-2.4e-05,-4e-06,1.3e-05,-1.3e-05,1.5e-05,1.5e-05,5e-06,3e-06,1.4e-05,-1.6e-05,-5e-06,-2e-06,-3e-06,1.8e-05,-4e-06,2.9e-05,1e-06,-1e-06,-3e-06,-2.3e-05,5.2e-05,-1.5e-05,1.4e-05,-1.5e-05,8e-06,-1.2e-05,-8e-06,1e-06,-6e-06,4e-06,3e-06,-3e-06,9e-06,5e-06,1.5e-05,-3.3e-05,-7e-06,2e-06,-1e-06,1.2e-05,2e-06,-1e-06,4e-06,-2e-06,-4e-06,1.4e-05,9e-06,2e-06,4e-06,7e-06,0,-1.2e-05,-1e-06,3.1e-05,-8e-06,-2e-06,-2.1e-05,4e-06,-9e-06
-2.9e-05,3.1e-05,-1.4e-05,-4e-06,-2e-06,2.2e-05,-1e-05,-3e-06,8e-06,0,2.3e-05,-3e-06,-8e-06,8e-06,1.7e-05,9e-06,-3e-06,-7e-06,6e-06,-4.1e-05,-3e-06,1.4e-05,3e-06,9e-06,4e-06,8e-06,-5.5e-05,9e-06,9e-06,3e-05,-8e-06,1.5e-05,-5e-06,-2e-06,3e-06,2e-06,1e-05,-8e-06,2e-06,-2e-05,3e-06,6e-06,-2e-06,7e-06,5e-06,2e-06,-1e-06,2.1e-05,-2.7e-05,-7e-06,6e-06,3e-06,-9e-06,-4e-06,0,3e-06,-4e-06,2.1e-05,-1e-06,2e-06,3.1e-05,-2e-06,-8e-06,4e-06,-6e-06,-1.1e-05,-2.2e-05,-1.7e-05,0,-6e-06,8e-06,-2e-05,3e-06,-1e-06,4e-06,-5e-06,-4.5e-05,-2.7e-05,-9e-06,-7e-06,5e-06,3e-06,-2.8e-05,1e-05,0,1e-05,-1e-05,2e-06,8e-06,-1.2e-05,1.1e-05,2e-06,-1e-06,-2.6e-05,-3e-05,-9e-06,-3e-06,1.3e-05,3e-06,-2e-06,0,7e-06,-1.8e-05,1e-06,-1e-06,-2e-06,-1.5e-05,-1.3e-05,-1.3e-05,8e-06,-4e-06,-7e-06,-2e-06,8e-06,-4e-06,7e-06,-5e-06,0,2.2e-05,-8e-06,-4e-06
-3.2e-05,-2.4e-05,-5e-06,2e-06,1.2e-05,0,-1.1e-05,-1e-05,1e-06,4e-06,-1.8e-05,3e-06,-1.9e-05,2e-06,-4e-06,-9e-06,1.7e-05,1.4e-05,-1.9e-05,3.1e-05,1.4e-05,2e-06,4e-06,-7e-06,-5e-06,-1.3e-05,1.3e-05,2e-06,-3e-06,-1.8e-05,-1.6e-05,0,-1.5e-05,-2e-06,-1e-06,-6e-06,-1.4e-05,-7e-06,1.3e-05,3.5e-05,2e-06,-7e-06,5e-06,-4e-06,-5e-06,1.7e-05,-8e-06,-3.7e-05,1.1e-05,6e-06,-9e-06,-1.1e-05,3e-06,2.5e-05,-3e-06,1.4e-05,0,-3.2e-05,-6e-06,-2e-06,-3.4e-05,4e-06,1.1e-05,-8e-06,6e-06,-3e-06,1.5e-05,1.1e-05,-2e-06,4e-06,-1e-06,3.1e-05,2e-06,-2.1e-05,2e-06,-2e-06,5.9e-05,-1.1e-05,0,1.9e-05,6e-06,-1e-06,1.3e-05,0,-4e-06,-2.1e-05,3e-06,7e-06,-5e-06,1.5e-05,-1.4e-05,-4e-06,-2e-06,2.2e-05,4.1e-05,5e-06,-1e-05,1e-06,6e-06,1e-06,3e-06,-9e-06,1.3e-05,1e-06,2e-06,1.1e-05,4e-06,5e-06,9e-06,0,-3e-06,4e-06,-2e-06,-1e-06,6e-06,-7e-06,2e-06,2e-06,-1e-05,6e-06,1.6e-05
7e-06,2.3e-05,-1e-06,0,-1.1e-05,-2.6e-05,-4e-06,1.4e-05,0,-5e-06,1.9e-05,1e-06,2.8e-05,-5e-06,6e-06,0,0,-8e-06,1.1e-05,-2.1e-05,1e-06,-2e-06,-5e-06,7e-06,5e-06,5e-06,2.5e-05,-1e-05,7e-06,1.1e-05,3e-06,-1.2e-05,3.7e-05,0,-1e-06,-1.1e-05,1.5e-05,5e-06,1e-05,2e-05,-1.4e-05,2e-06,-1.4e-05,-2.3e-05,3e-06,-1.1e-05,-4e-06,3e-05,1.7e-05,-7e-06,4e-06,-6e-06,-2e-06,-3e-05,5e-06,-1e-06,7e-06,5e-06,1.4e-05,-2e-06,2.7e-05,-4e-06,8e-06,1e-05,6e-06,3e-06,-1e-05,-1.3e-05,1e-06,-1e-06,-1e-05,-1e-06,-6e-06,1.4e-05,1e-05,-4e-06,-1.4e-05,2.4e-05,9e-06,-2e-05,-1e-05,-8e-06,-1.6e-05,0,-1e-06,1.7e-05,5e-06,-1e-06,2e-06,-4e-06,1.1e-05,0,-2e-06,-8e-06,-3e-05,0,1e-06,-2.1e-05,-8e-06,-4e-06,-3e-06,-1.1e-05,-1e-06,-4e-06,-3e-06,-1.6e-05,1.1e-05,-3e-06,-5e-06,-5e-06,-3e-06,-3e-06,-8e-06,1e-06,-4e-06,-1.8e-05,3e-06,0,6e-06,1e-06,-1.7e-05
4.1e-05,-8e-06,7e-06,-1e-06,5e-06,2.1e-05,2e-06,3e-06,-1e-05,4e-06,-1.8e-05,-3e-06,-1.6e-05,-6e-06,-5e-06,6e-06,-1.9e-05,2e-06,9e-06,1e-05,1.8e-05,-4e-06,-3e-06,1.3e-05,-6e-06,-9e-06,1.2e-05,-1.1e-05,3e-06,-4e-06,1.2e-05,-2e-06,-2.4e-05,-3e-06,0,1.1e-05,-1.5e-05,-1e-06,-2e-06,-3.4e-05,6e-06,9e-06,-3e-06,1e-05,-4e-06,4e-06,1.8e-05,-3.2e-05,-2.4e-05,-1e-06,2e-06,-4e-06,7e-06,1.5e-05,-7e-06,-2e-06,-7e-06,7e-06,-1.1e-05,3e-06,-1.4e-05,6e-06,6e-06,-7e-06,5e-06,8e-06,1e-05,-2.3e-05,0,0,-7e-06,-1.1e-05,1e-06,1.2e-05,-1.8e-05,-3e-06,-4.3e-05,1e-06,-1e-06,1.2e-05,8e-06,1.4e-05,1e-05,4e-06,4e-06,-9e-06,-9e-06,4e-06,-4e-06,-3e-06,-8e-06,-1e-06,-4e-06,6e-06,3e-06,-6e-06,9e-06,1.9e-05,2e-06,2e-06,1e-06,5e-06,-1.1e-05,0,-1e-06,7e-06,-2e-06,0,-5e-06,2e-06,2e-06,1e-06,-2e-06,-4e-06,1e-06,1.5e-05,1e-06,1e-06,-8e-06,-7e-06,5e-06
1.3e-05,-7e-06,1.5e-05,2e-06,2e-06,-2e-06,7e-06,-6e-06,1e-05,2e-06,1.1e-05,0,-1e-05,-3e-06,-5e-06,-2e-06,6e-06,-2e-06,-1.7e-05,4e-06,-4e-06,-7e-06,1e-06,-4.3e-05,1e-06,-5e-06,-3.1e-05,1.1e-05,-5e-06,-4e-06,6e-06,1.1e-05,-3e-06,8e-06,0,-1.1e-05,1.9e-05,-1e-05,-1.1e-05,-7e-06,5e-06,-8e-06,9e-06,2.1e-05,1e-06,0,1e-05,2.7e-05,-2e-06,1e-05,-2e-06,3e-06,-7e-06,-8e-06,-1e-06,1e-05,-5e-06,1.3e-05,1e-06,1e-06,2e-06,-4e-06,-6e-06,2e-06,-5e-06,1e-06,-6e-06,2.7e-05,-2e-06,1e-06,1e-05,1.2e-05,4e-06,-8e-06,4e-06,1.1e-05,4.6e-05,-9e-06,-1e-06,-8e-06,-6e-06,-1e-05,-6e-06,-1.2e-05,0,8e-06,7e-06,-7e-06,4e-06,8e-06,5e-06,3e-06,1e-05,-4e-06,8e-06,8e-06,-3e-06,1.4e-05,5e-06,-1e-06,-3e-06,1e-05,1.3e-05,3e-06,2e-06,-4e-06,-7e-06,8e-06,5e-06,-6e-06,-1e-06,1e-06,2e-06,1e-06,1e-06,-5e-06,2e-06,1e-06,-2e-06,5e-06,1.4e-05
-3.3e-05,8e-06,-2e-05,-3e-06,-5e-06,-1e-06,7e-06,-1e-06,-1e-06,-9e-06,-1.1e-05,4e-06,3.1e-05,4e-06,6e-06,5e-06,9e-06,-1e-06,6e-06,-1.2e-05,-1.7e-05,1e-05,-1e-06,4.8e-05,0,9e-06,-1e-06,3e-06,-2e-06,2e-06,-1.2e-05,-3e-06,2.5e-05,-5e-06,0,1.2e-05,-1.3e-05,8e-06,-8e-06,9e-06,-8e-06,3e-06,4e-06,-2.1e-05,1e-05,-8e-06,-2.2e-05,-1.4e-05,2.1e-05,-1.4e-05,0,2.1e-05,4e-06,-2.1e-05,6e-06,8e-06,-2e-06,-2.2e-05,1.1e-05,-5e-06,1.4e-05,5e-06,7e-06,0,-7e-06,-1e-06,5e-06,-1e-05,1e-06,-1e-06,1e-06,-1.5e-05,5e-06,-5e-06,-5e-06,-8e-06,-1.6e-05,-2e-06,2e-06,4e-06,-1e-06,-1e-06,1.8e-05,1e-06,-3e-06,-9e-06,0,-1e-06,2e-06,-8e-06,1e-06,0,-2e-06,-8e-06,1e-06,-5e-06,-6e-06,-2.8e-05,-3e-06,-1e-06,2e-06,-1e-06,-5e-06,0,0,-2e-06,-7e-06,-1.1e-05,-3e-06,-1e-06,-4e-06,0,0,2e-06,0,1.2e-05,7e-06,-1e-06,6e-06,3e-06,-1.8e-05
-2.4e-05,-6e-06,3e-06,-1e-06,7e-06,-1.1e-05,2e-06,-1e-06,1e-06,7e-06,6e-06,-2e-06,-3.5e-05,3e-06,-4e-06,-2e-06,3e-06,5e-06,9e-06,1.2e-05,-5e-06,2e-06,-3e-06,-3.4e-05,3e-06,-4e-06,3e-06,-1e-06,-4e-06,0,-5e-06,-1.2e-05,-1.9e-05,1e-06,0,-9e-06,5e-06,5e-06,4e-06,-2e-05,0,-4e-06,-5e-06,-1e-06,-4e-06,8e-06,2e-06,1.6e-05,-1.3e-05,1.1e-05,2e-06,8e-06,-4e-06,2e-05,-5e-06,-1.1e-05,2e-06,-1.2e-05,-9e-06,3e-06,-2.5e-05,-8e-06,5e-06,0,-2e-06,-3e-06,-6e-06,-1.7e-05,2e-06,-3e-06,4e-06,-7e-06,-2e-06,-7e-06,8e-06,6e-06,-3.1e-05,1e-06,2e-06,-6e-06,-2e-06,2e-06,-2.7e-05,4e-06,0,2e-06,-4e-06,-2e-06,-8e-06,2e-06,-3e-06,-2e-06,-4e-06,1.3e-05,-1.5e-05,0,2e-06,1e-06,0,0,0,-1.3e-05,-9e-06,-3e-06,1e-06,1.5e-05,1.3e-05,2e-06,7e-06,7e-06,3e-06,1e-06,-2e-06,3e-06,-1e-06,-8e-06,2e-06,1e-06,-3e-06,-5e-06,1.3e-05
1.2e-05,7e-06,-2e-06,2e-06,-4e-06,1.6e-05,-2e-06,-1e-06,2e-06,0,1e-06,-1e-06,2.4e-05,0,6e-06,-8e-06,-9e-06,-5e-06,-1.6e-05,-8e-06,-6e-06,-2e-06,3e-06,9e-06,-1e-06,4e-06,3.3e-05,0,-3e-06,-1e-06,7e-06,-9e-06,8e-06,-2e-06,0,5e-06,-3e-06,-7e-06,1.1e-05,2.4e-05,2e-06,3e-06,1e-06,7e-06,5e-06,-6e-06,2.1e-05,-7e-06,-1.3e-05,-5e-06,1e-06,-4e-06,5e-06,-8e-06,2e-06,-2e-06,8e-06,3.4e-05,5e-06,1e-06,2.5e-05,9e-06,-8e-06,0,0,-3e-06,-1e-06,2e-05,-1e-06,5e-06,2e-06,2.2e-05,-2e-06,2e-05,-7e-06,-6e-06,4.4e-05,6e-06,-1e-06,1e-05,1e-06,-2e-06,2e-05,-1e-06,1e-06,3e-06,4e-06,9e-06,1.1e-05,3e-06,5e-06,0,6e-06,-1.1e-05,2.3e-05,4e-06,4e-06,2.4e-05,-3e-06,-2e-06,0,-5e-06,1.4e-05,-2e-06,-1e-06,-1.6e-05,2e-06,6e-06,-7e-06,-2e-06,1e-06,-1e-06,1e-06,-1e-06,3e-06,-1.2e-05,-4e-06,-1e-06,4e-06,5e-06,1e-06
2.9e-05,-1.3e-05,6e-06,-1e-06,-3e-06,-8e-06,-3e-06,-1e-06,-8e-06,-5e-06,-4e-06,2e-06,-3e-06,-2e-06,-4e-06,2e-06,-3e-06,4e-06,9e-06,2e-06,1e-05,-1e-05,3e-06,2.3e-05,3e-06,4e-06,-2.4e-05,-1e-06,-5e-06,-4e-06,3e-06,1.3e-05,-8e-06,1e-06,0,7e-06,2e-06,8e-06,6e-06,-9e-06,6e-06,0,-4e-06,1.1e-05,-1e-05,-6e-06,-1.2e-05,-9e-06,2e-05,2e-06,-3e-06,-1.5e-05,-4e-06,7e-06,1e-06,4e-06,3e-06,-2e-06,0,0,-2.4e-05,-8e-06,-4e-06,2e-06,3e-06,3e-06,4e-06,-1.1e-05,-2e-06,-2e-06,-1.1e-05,-2e-06,0,-1e-05,2e-06,4e-06,-1.1e-05,-7e-06,-3e-06,-9e-06,3e-06,1.2e-05,-1.4e-05,4e-06,1e-06,0,0,-5e-06,-9e-06,-7e-06,-7e-06,2e-06,1e-06,6e-06,-1.5e-05,-3e-06,3e-06,-1.3e-05,-1e-06,1e-06,0,7e-06,-5e-06,2e-06,1e-06,1.4e-05,-6e-06,-6e-06,5e-06,2e-06,2e-06,1e-06,5e-06,-5e-06,-3e-06,1e-05,-4e-06,0,-7e-06,-2e-06,-1.3e-05
8e-06,1e-05,7e-06,0,7e-06,-1e-06,-5e-06,3e-06,3e-06,7e-06,7e-06,-1e-06,-1.1e-05,0,5e-06,4e-06,1e-05,-4e-06,9e-06,4e-06,5e-06,0,0,-3.5e-05,-4e-06,0,-1.3e-05,5e-06,-5e-06,1e-05,-2e-06,1.1e-05,1.7e-05,3e-06,0,-6e-06,4e-06,3e-06,-4e-06,-2e-06,-6e-06,-2e-06,0,-1.7e-05,5e-06,5e-06,-1e-06,1.1e-05,-3e-06,3e-06,3e-06,-9e-06,1e-06,-8e-06,-4e-06,-4e-06,-1e-06,-1.8e-05,-8e-06,-3e-06,1.2e-05,6e-06,-3e-06,-1e-06,1e-06,4e-06,-4e-06,-1.2e-05,2e-06,-3e-06,3e-06,-9e-06,1e-06,4e-06,9e-06,-4e-06,-2.7e-05,-3e-06,-1e-06,2e-06,2e-06,-6e-06,1.2e-05,-1e-06,0,3e-06,-3e-06,4e-06,2e-06,9e-06,4e-06,1e-06,2e-06,-4e-06,0,-4e-06,-6e-06,-2e-06,3e-06,-1e-06,0,6e-06,-8e-06,3e-06,0,-1.3e-05,-5e-06,2e-06,3e-06,1e-06,-1e-06,0,0,0,2e-06,1.2e-05,-5e-06,-1e-06,3e-06,-4e-06,1.5e-05
-2.1e-05,-3e-06,-1.1e-05,1e-06,-5e-06,-1e-06,-4e-06,1e-06,3e-06,-4e-06,-1.1e-05,-1e-06,6e-06,2e-06,-4e-06,2e-06,-2e-06,2e-06,-1.7e-05,-7e-06,6e-06,8e-06,1e-06,2.4e-05,2e-06,2e-06,1e-06,-1e-06,5e-06,-1.2e-05,-4e-06,-4e-06,-2.1e-05,0,-1e-06,4e-06,-7e-06,-8e-06,-1e-05,1.9e-05,-1e-06,5e-06,8e-06,2e-06,-1.1e-05,-4e-06,1.4e-05,-8e-06,-1.7e-05,-1e-06,-1e-06,1e-06,-2e-06,2e-06,4e-06,-5e-06,0,-7e-06,7e-06,3e-06,1e-06,-6e-06,1e-06,0,4e-06,2e-06,7e-06,2.1e-05,1e-06,4e-06,7e-06,8e-06,-1e-06,-1.3e-05,-3e-06,3e-06,4.8e-05,1.3e-05,-1e-06,2e-06,1e-06,-1e-06,-1.1e-05,-5e-06,0,-6e-06,3e-06,-8e-06,3e-06,-5e-06,-1e-06,0,-2e-06,1e-06,6e-06,1e-05,2e-06,1.8e-05,-2e-06,-1e-06,-1e-06,-5e-06,1.2e-05,-1e-06,0,5e-06,2e-06,-2e-06,-2e-06,-6e-06,2e-06,0,-1e-06,1e-06,0,-1e-05,-4e-06,0,0,4e-06,-8e-06
-2.5e-05,-2e-06,-1e-06,-1e-06,0,6e-06,1e-06,-3e-06,3e-06,-1e-06,1.1e-05,1e-06,1.1e-05,2e-06,-1e-06,3e-06,-9e-06,0,7e-06,8e-06,5e-06,7e-06,0,-1.3e-05,-2e-06,-1e-06,3.1e-05,-2e-06,0,7e-06,1e-06,-1e-05,1e-06,2e-06,1e-06,-1e-06,6e-06,5e-06,-5e-06,-5e-06,6e-06,-3e-06,-2e-06,4e-06,1.2e-05,3e-06,-1.9e-05,2.1e-05,1.5e-05,-3e-06,0,2e-06,3e-06,-4e-06,-1e-06,1e-06,-1e-06,1.6e-05,-3e-06,-2e-06,-1.2e-05,8e-06,1e-06,0,-1e-06,-1e-06,-7e-06,-6e-06,-2e-06,-1e-06,1e-06,-1e-05,2e-06,1.8e-05,0,-5e-06,-2e-05,-4e-06,2e-06,0,-2e-06,1e-06,1e-05,0,0,7e-06,-1e-06,3e-06,-4e-06,0,-3e-06,-2e-06,-2e-06,6e-06,-1e-06,-6e-06,5e-06,-1.8e-05,-2e-06,-2e-06,0,-8e-06,-5e-06,-3e-06,0,4e-06,9e-06,1e-06,0,-1e-06,2e-06,0,0,5e-06,-2e-06,-9e-06,1e-06,0,3e-06,-2e-06,-1e-06
7e-06,0,-5e-06,0,3e-06,-4e-06,4e-06,0,-6e-06,4e-06,-1.3e-05,1e-06,-3e-05,-1e-06,-1e-06,-1e-06,2e-06,-2e-06,8e-06,-8e-06,-8e-06,-3e-06,-1e-06,2e-06,2e-06,-2e-06,-1.5e-05,1e-06,1e-06,1e-06,2e-06,-1e-06,3e-05,-2e-06,-1e-06,0,-7e-06,1e-06,4e-06,-1.2e-05,-1e-06,-2e-06,-4e-06,1e-05,-1e-05,5e-06,-7e-06,-2.4e-05,5e-06,6e-06,2e-06,5e-06,-2e-06,-1.7e-05,-3e-06,3e-06,-1e-06,8e-06,-5e-06,2e-06,2.2e-05,-8e-06,1e-06,-2e-06,0,-2e-06,7e-06,-7e-06,0,-3e-06,0,-4e-06,0,-1.2e-05,-6e-06,5e-06,-2.8e-05,-7e-06,2e-06,-3e-06,0,-4e-06,-9e-06,2e-06,-1e-06,-9e-06,-3e-06,-3e-06,2e-06,5e-06,4e-06,1e-06,1e-06,-8e-06,-1.2e-05,-3e-06,-1e-06,-8e-06,1e-06,0,1e-06,4e-06,-6e-06,1e-06,0,-8e-06,-3e-06,3e-06,-4e-06,3e-06,0,-1e-06,-1e-06,-2e-06,3e-06,8e-06,5e-06,0,-1e-06,-2e-06,7e-06
