0.008444,0.01878,0.032046,0.036895,0.032588,0.026536,0.020878,0.015325,0.010721,0.009272,0.009189,0.007534,0.005912,0.006115,0.005994,0.005047,0.004713,0.004867,0.005578,0.006029,0.005377,0.005309,0.005359,0.005085,0.005928,0.006383,0.005632,0.005584
0.010228,0.02256,0.038603,0.04445,0.039052,0.031486,0.024395,0.017837,0.012632,0.010873,0.010616,0.008771,0.00714,0.007403,0.007232,0.006151,0.005788,0.005987,0.006796,0.00726,0.006509,0.006316,0.006311,0.006149,0.007124,0.007644,0.006896,0.006881
0.013339,0.029064,0.049186,0.056088,0.048892,0.039011,0.029405,0.021247,0.015433,0.013187,0.012512,0.010535,0.009116,0.009437,0.009182,0.007966,0.00757,0.007801,0.008619,0.009095,0.008365,0.007992,0.007899,0.007949,0.00897,0.00954,0.008911,0.008978
0.016443,0.036205,0.05949,0.064972,0.055482,0.044622,0.032355,0.022558,0.017216,0.01464,0.013087,0.011206,0.010325,0.010582,0.010295,0.009312,0.00893,0.008911,0.00929,0.009928,0.009738,0.009281,0.009126,0.009278,0.009979,0.010486,0.010132,0.010378
0.020069,0.046262,0.074374,0.076257,0.061649,0.049465,0.034631,0.024019,0.019852,0.016565,0.013332,0.011187,0.010722,0.010933,0.010676,0.010256,0.010058,0.009505,0.008997,0.010018,0.010713,0.01035,0.010118,0.009931,0.010184,0.010528,0.010305,0.010834
0.024633,0.059341,0.091757,0.090345,0.071445,0.056023,0.038864,0.027966,0.024108,0.019773,0.014449,0.011607,0.011382,0.011367,0.010903,0.011118,0.011455,0.010672,0.009401,0.010407,0.011612,0.011467,0.010954,0.010042,0.01006,0.010545,0.010378,0.010763
0.028828,0.071218,0.103197,0.099829,0.082391,0.062528,0.04405,0.033646,0.029103,0.024313,0.017064,0.013176,0.012913,0.012285,0.011376,0.012091,0.012949,0.012216,0.010662,0.011504,0.012804,0.01262,0.01218,0.011129,0.010981,0.011466,0.011233,0.011238
0.031856,0.07887,0.108934,0.104399,0.092113,0.069703,0.051513,0.042903,0.036031,0.030186,0.021636,0.016191,0.014955,0.013577,0.012181,0.012948,0.014149,0.014058,0.012735,0.013812,0.015314,0.014294,0.013735,0.013336,0.013701,0.014162,0.01347,0.012762
0.034057,0.081979,0.116432,0.115621,0.105453,0.08196,0.064093,0.055492,0.044125,0.035901,0.027175,0.02076,0.017891,0.015572,0.013883,0.014438,0.015806,0.016368,0.015543,0.017228,0.018938,0.016647,0.015397,0.015458,0.016901,0.017988,0.016972,0.015257
0.036872,0.080951,0.121602,0.130366,0.120001,0.096129,0.078534,0.066924,0.050154,0.040141,0.032118,0.025008,0.020956,0.017919,0.015959,0.016583,0.018423,0.019021,0.018181,0.020475,0.022261,0.018746,0.016825,0.017038,0.018839,0.021009,0.021171,0.018922
0.040595,0.08296,0.126686,0.140048,0.127594,0.105044,0.087018,0.070626,0.050618,0.040405,0.033423,0.026427,0.022702,0.01983,0.017264,0.017975,0.020344,0.020478,0.019646,0.022451,0.023848,0.01955,0.017177,0.017389,0.018652,0.021333,0.023489,0.021815
0.039747,0.079268,0.122749,0.134269,0.116447,0.097306,0.082841,0.06521,0.046252,0.036621,0.030298,0.024761,0.022415,0.020474,0.017692,0.017936,0.020203,0.020346,0.019917,0.022124,0.02235,0.018125,0.015575,0.015934,0.01686,0.019033,0.022411,0.022039
0.033653,0.063272,0.097802,0.103725,0.084196,0.072855,0.066512,0.053405,0.039206,0.030762,0.026143,0.022485,0.020723,0.019933,0.017098,0.016282,0.018348,0.019219,0.01905,0.019795,0.018813,0.015447,0.013236,0.013619,0.014526,0.015726,0.01891,0.019264
0.026975,0.045133,0.065968,0.06664,0.051362,0.046656,0.045846,0.039363,0.030724,0.02445,0.022441,0.020214,0.018466,0.018248,0.015472,0.014397,0.016398,0.017145,0.017027,0.017169,0.015995,0.013818,0.012627,0.012562,0.013236,0.014411,0.015933,0.015497
0.024437,0.041915,0.053582,0.046591,0.034015,0.0295,0.028627,0.026391,0.022744,0.020088,0.019528,0.017979,0.0172,0.016953,0.01456,0.013826,0.015468,0.01602,0.016258,0.016955,0.016194,0.014784,0.014805,0.014374,0.015283,0.016759,0.015197,0.013612
0.03006,0.05908,0.070949,0.052666,0.033252,0.023941,0.022139,0.021422,0.021014,0.021865,0.021288,0.019445,0.019571,0.018909,0.016806,0.016161,0.01717,0.018599,0.020424,0.021922,0.020324,0.018215,0.018887,0.018195,0.020009,0.021552,0.017045,0.014782
0.041284,0.085503,0.102673,0.07411,0.044154,0.029749,0.026083,0.024436,0.026543,0.029083,0.026488,0.02442,0.025336,0.02358,0.021338,0.021275,0.022603,0.024492,0.028003,0.030569,0.027277,0.023102,0.023423,0.022635,0.025277,0.02671,0.02082,0.019018
0.052083,0.108498,0.131002,0.096484,0.058083,0.040097,0.035426,0.031847,0.034359,0.036846,0.032288,0.029886,0.031415,0.029875,0.027585,0.026827,0.027749,0.030064,0.035625,0.039111,0.034533,0.028803,0.027635,0.025808,0.028388,0.030412,0.025793,0.024943
0.060131,0.122068,0.148627,0.1164,0.07444,0.052592,0.046545,0.04058,0.042458,0.042757,0.035338,0.032246,0.035061,0.036122,0.033826,0.030923,0.030654,0.033038,0.040552,0.044506,0.039987,0.034734,0.032095,0.02879,0.029131,0.031709,0.030475,0.030037
0.063972,0.130717,0.1611,0.134199,0.091224,0.065162,0.057467,0.047531,0.048496,0.046992,0.036403,0.031525,0.036134,0.040358,0.038494,0.034696,0.033343,0.033826,0.041877,0.047733,0.044721,0.040174,0.036928,0.033569,0.030616,0.031078,0.032534,0.033381
0.064702,0.145951,0.180046,0.146839,0.101909,0.076359,0.068658,0.05361,0.052262,0.049404,0.036639,0.029516,0.035637,0.040938,0.040875,0.039435,0.037329,0.035674,0.041696,0.049459,0.049298,0.045118,0.042879,0.040026,0.033344,0.030191,0.032,0.034126
0.065296,0.169316,0.208494,0.156791,0.109138,0.088558,0.080645,0.060334,0.05478,0.050398,0.039403,0.031849,0.035939,0.039363,0.041116,0.043438,0.041297,0.038521,0.040445,0.049581,0.054553,0.051122,0.048336,0.045192,0.038287,0.033028,0.032214,0.033619
0.072088,0.199825,0.236914,0.155664,0.108486,0.094261,0.083946,0.063862,0.054031,0.048168,0.042772,0.037326,0.037882,0.036138,0.037055,0.044063,0.044724,0.043084,0.039952,0.047505,0.059372,0.056261,0.047539,0.045793,0.044062,0.037583,0.033589,0.033553
0.082893,0.228136,0.254244,0.140264,0.093804,0.083661,0.070124,0.056218,0.045932,0.041592,0.04346,0.040864,0.037325,0.030986,0.030799,0.042288,0.047753,0.045359,0.036645,0.042239,0.05857,0.054603,0.039257,0.040434,0.044975,0.039321,0.036752,0.035719
0.082468,0.22046,0.240485,0.126899,0.08046,0.065106,0.047858,0.043013,0.036624,0.033228,0.04017,0.039735,0.034923,0.028631,0.027676,0.039749,0.047796,0.041632,0.029254,0.0334,0.047937,0.044031,0.029038,0.032201,0.038656,0.03483,0.035633,0.034934
0.071622,0.16821,0.179195,0.104239,0.068916,0.047332,0.031957,0.03875,0.038672,0.030973,0.033817,0.033944,0.030987,0.026872,0.02581,0.039434,0.047418,0.035441,0.023534,0.024238,0.032539,0.033588,0.025838,0.027617,0.031629,0.029034,0.030128,0.030412
0.056418,0.098624,0.101925,0.073314,0.056999,0.037582,0.02888,0.042313,0.044118,0.031882,0.029242,0.029798,0.027134,0.025279,0.026494,0.039715,0.045668,0.033749,0.02464,0.02023,0.021792,0.028796,0.028989,0.028819,0.03233,0.030725,0.027338,0.025476
0.041787,0.051207,0.057686,0.054783,0.050101,0.036722,0.031768,0.044943,0.046893,0.032144,0.026495,0.030057,0.028569,0.027336,0.030827,0.040365,0.040911,0.033439,0.029059,0.022484,0.019165,0.026425,0.030631,0.031915,0.035739,0.034025,0.02811,0.022934
0.036107,0.041312,0.051185,0.053314,0.052605,0.041885,0.036878,0.048789,0.051207,0.035744,0.026377,0.030333,0.033702,0.034824,0.037592,0.041484,0.037357,0.035971,0.036923,0.029642,0.024112,0.027904,0.029317,0.03185,0.037469,0.036621,0.031356,0.025292
0.042323,0.053211,0.067235,0.070395,0.064092,0.053273,0.045106,0.050162,0.051074,0.038046,0.029037,0.032849,0.039284,0.047678,0.05144,0.048932,0.042814,0.045738,0.051371,0.041541,0.030916,0.031089,0.031567,0.033327,0.039928,0.043433,0.041076,0.034557
0.055193,0.074646,0.094081,0.095147,0.079964,0.069285,0.059095,0.052951,0.044811,0.036347,0.033427,0.038589,0.044446,0.060601,0.065624,0.05469,0.050876,0.059985,0.06972,0.055352,0.036336,0.035283,0.040082,0.042847,0.048069,0.053656,0.054699,0.047954
0.067483,0.09406,0.115123,0.115364,0.096776,0.083621,0.071167,0.057527,0.039525,0.033979,0.03707,0.044216,0.048586,0.068852,0.075358,0.056772,0.053748,0.070377,0.083162,0.064097,0.037815,0.037434,0.046527,0.050637,0.055741,0.061018,0.062773,0.056851
0.074647,0.104621,0.117335,0.116995,0.101125,0.085082,0.071286,0.056579,0.033743,0.028909,0.035861,0.043499,0.045589,0.064793,0.072847,0.052691,0.048829,0.068949,0.081045,0.060497,0.033998,0.034678,0.043768,0.048191,0.053282,0.056402,0.056768,0.05353
0.076274,0.111331,0.107445,0.103969,0.098926,0.078807,0.060225,0.044589,0.024484,0.022703,0.035691,0.041005,0.036055,0.047936,0.054684,0.041633,0.040814,0.055057,0.062317,0.04648,0.026031,0.026916,0.033406,0.036328,0.039595,0.039985,0.038547,0.038912
0.069279,0.108895,0.098153,0.086036,0.087966,0.069672,0.046632,0.031284,0.019509,0.019862,0.040738,0.044181,0.028693,0.03034,0.032963,0.028915,0.033257,0.037288,0.040558,0.036415,0.024876,0.024182,0.027692,0.027605,0.027918,0.02587,0.022915,0.027974
0.059096,0.094509,0.09397,0.072626,0.068705,0.060769,0.043837,0.028458,0.019359,0.021246,0.047085,0.048208,0.025053,0.02432,0.027929,0.025398,0.02771,0.02564,0.030369,0.035049,0.029013,0.027417,0.028936,0.030375,0.031751,0.025483,0.022097,0.029402
0.048826,0.072932,0.088837,0.071157,0.059262,0.057862,0.044838,0.028186,0.020928,0.022428,0.047852,0.051774,0.028578,0.025167,0.027963,0.024003,0.023572,0.024412,0.030731,0.034845,0.030651,0.030496,0.031688,0.034371,0.036648,0.028611,0.026867,0.03278
0.044023,0.060063,0.075693,0.065567,0.049072,0.051191,0.042693,0.02763,0.021423,0.021349,0.041179,0.047815,0.029339,0.023792,0.024561,0.023053,0.025189,0.031126,0.034518,0.032126,0.028044,0.028753,0.030887,0.034484,0.036375,0.028545,0.030057,0.031346
0.038541,0.045525,0.05785,0.055865,0.039841,0.044443,0.039946,0.027334,0.020604,0.022209,0.032359,0.036492,0.024024,0.019143,0.01968,0.021774,0.027797,0.037816,0.037506,0.032765,0.027754,0.024595,0.029099,0.034904,0.034038,0.027778,0.028952,0.025626
0.03258,0.034314,0.049689,0.048196,0.036702,0.043767,0.037433,0.02513,0.022697,0.024366,0.024593,0.024312,0.015664,0.014408,0.018665,0.019017,0.026326,0.039227,0.035526,0.034328,0.031552,0.022115,0.026435,0.033195,0.031788,0.028162,0.023666,0.023136
