0.009524,0.009269,0.009407,0.008811,0.008123,0.008582,0.007961,0.007844,0.008952,0.009506,0.009761,0.010327,0.010834,0.010121,0.009492,0.010574,0.011344,0.010884,0.010254,0.009283,0.008845,0.009475,0.009022,0.008563,0.00924,0.009695,0.010353,0.010207
0.010908,0.01067,0.010868,0.010342,0.009612,0.010021,0.00924,0.00915,0.010439,0.011095,0.011508,0.012318,0.012911,0.011999,0.011426,0.012732,0.01341,0.012656,0.01199,0.010936,0.010308,0.011042,0.010624,0.010191,0.010886,0.011625,0.012641,0.012215
0.012714,0.012666,0.013051,0.012737,0.011984,0.012311,0.011455,0.011341,0.012688,0.013782,0.014744,0.015887,0.016424,0.015148,0.014824,0.016433,0.016738,0.015352,0.014806,0.013844,0.012873,0.013546,0.013182,0.012955,0.013671,0.014905,0.016319,0.015265
0.013273,0.014083,0.014912,0.014659,0.013838,0.014103,0.013694,0.013311,0.014389,0.016579,0.018514,0.019644,0.019629,0.018298,0.018437,0.019861,0.019392,0.017416,0.017348,0.016916,0.015851,0.015965,0.015315,0.015359,0.016118,0.017941,0.019,0.01693
0.014658,0.017285,0.018462,0.017546,0.016454,0.016893,0.017216,0.016018,0.016755,0.020905,0.024196,0.024897,0.024113,0.02307,0.023558,0.024304,0.023172,0.021113,0.021789,0.022199,0.021133,0.019958,0.018227,0.018199,0.01936,0.022301,0.021995,0.01818
0.018207,0.022359,0.024114,0.022578,0.021177,0.021903,0.023211,0.02157,0.021909,0.028215,0.032889,0.032782,0.031105,0.030337,0.031794,0.032671,0.030464,0.027577,0.029187,0.030825,0.029724,0.02677,0.023728,0.02432,0.026408,0.030485,0.028719,0.023353
0.024043,0.028682,0.030861,0.02923,0.028396,0.029573,0.032032,0.031009,0.030913,0.039155,0.044202,0.042262,0.039569,0.038701,0.04212,0.043887,0.04019,0.036314,0.039574,0.042656,0.040428,0.036038,0.033951,0.037472,0.040327,0.042208,0.038096,0.033929
0.031865,0.037217,0.03948,0.038607,0.041153,0.043343,0.045708,0.045158,0.0452,0.057571,0.06272,0.056425,0.050994,0.048669,0.056301,0.060263,0.053947,0.049427,0.055357,0.059185,0.053716,0.048655,0.05051,0.060051,0.06362,0.057373,0.048243,0.050238
0.044151,0.051868,0.055004,0.054932,0.062366,0.066052,0.066336,0.0648,0.067141,0.087086,0.092789,0.081557,0.071636,0.065234,0.078391,0.085375,0.075518,0.071552,0.08089,0.082709,0.072689,0.069302,0.076454,0.093823,0.098558,0.081045,0.063486,0.073266
0.062581,0.073684,0.078413,0.079022,0.090351,0.094473,0.089656,0.085379,0.093205,0.123325,0.129772,0.114302,0.101142,0.090758,0.106513,0.114754,0.102034,0.099892,0.115163,0.115487,0.100729,0.099791,0.1097,0.132344,0.137915,0.111788,0.086491,0.10062
0.084201,0.096122,0.103253,0.105808,0.116912,0.122291,0.110681,0.101856,0.11872,0.154647,0.159307,0.144259,0.13543,0.124002,0.134656,0.142364,0.129627,0.127037,0.147686,0.149823,0.132269,0.133841,0.141474,0.161293,0.167688,0.141014,0.113812,0.126311
0.108629,0.113634,0.122666,0.125892,0.129641,0.141404,0.126187,0.114357,0.143013,0.17443,0.174888,0.165917,0.1697,0.164238,0.165114,0.169311,0.159815,0.153727,0.173074,0.177601,0.161349,0.166723,0.163935,0.168597,0.179951,0.165139,0.139505,0.145323
0.129017,0.123944,0.136641,0.133961,0.121595,0.144355,0.135076,0.125315,0.163171,0.186982,0.181673,0.177487,0.196764,0.200183,0.191085,0.187257,0.182875,0.173383,0.184719,0.190904,0.182264,0.195271,0.179356,0.160422,0.176149,0.178363,0.153966,0.156431
0.127761,0.11617,0.132117,0.124083,0.102575,0.131189,0.129224,0.124671,0.161693,0.176111,0.167103,0.163825,0.192382,0.205259,0.18765,0.176024,0.180256,0.169619,0.169453,0.174515,0.175738,0.194186,0.17434,0.145836,0.159974,0.168262,0.144986,0.149256
0.097285,0.085107,0.099884,0.093262,0.076266,0.098427,0.098372,0.10016,0.126643,0.130091,0.123614,0.121658,0.147613,0.163183,0.140425,0.127255,0.140127,0.134553,0.124951,0.123448,0.129999,0.146128,0.133955,0.117279,0.127133,0.13035,0.11077,0.114164
0.060735,0.052831,0.058431,0.054778,0.047273,0.057049,0.057624,0.063142,0.076882,0.075917,0.075101,0.076037,0.092126,0.099599,0.07908,0.073054,0.087362,0.085178,0.073297,0.067639,0.071407,0.081054,0.083398,0.083405,0.085286,0.084564,0.079116,0.078582
0.045712,0.04096,0.03932,0.037197,0.035403,0.036401,0.036645,0.043385,0.050651,0.050294,0.052606,0.060039,0.06767,0.060132,0.048999,0.054054,0.061875,0.058143,0.047793,0.040765,0.043048,0.056846,0.067487,0.067033,0.061195,0.065226,0.075486,0.072613
0.043981,0.040206,0.037849,0.037344,0.039929,0.040178,0.038046,0.042862,0.046601,0.04741,0.050364,0.056766,0.062809,0.05388,0.045593,0.052757,0.056331,0.051946,0.046503,0.03963,0.044427,0.06206,0.069934,0.067614,0.059164,0.063019,0.078023,0.075655
0.043691,0.044832,0.042507,0.041366,0.047919,0.048768,0.047299,0.052421,0.050999,0.051194,0.05211,0.052526,0.062485,0.060797,0.049239,0.052033,0.052562,0.046005,0.047087,0.046138,0.054289,0.068939,0.070363,0.071869,0.064727,0.060945,0.072138,0.071055
0.050584,0.055587,0.05555,0.055914,0.064114,0.062369,0.062021,0.067799,0.060112,0.058763,0.058299,0.055479,0.070627,0.075935,0.062728,0.063857,0.063222,0.049958,0.051113,0.05573,0.065162,0.075863,0.076671,0.086272,0.078115,0.065149,0.075098,0.078013
0.061701,0.06904,0.072832,0.074444,0.082373,0.076103,0.077303,0.088352,0.077965,0.073688,0.072339,0.065695,0.079691,0.090048,0.080306,0.081348,0.07877,0.064084,0.066205,0.069472,0.07186,0.078691,0.088621,0.107983,0.09429,0.074368,0.086923,0.094593
0.067235,0.079083,0.087416,0.08556,0.091554,0.083503,0.089778,0.10734,0.098788,0.098829,0.095795,0.078933,0.080395,0.090275,0.092018,0.093478,0.084839,0.073808,0.084095,0.087689,0.080861,0.083967,0.101528,0.126662,0.107585,0.080845,0.09125,0.101022
0.067022,0.080863,0.089998,0.082105,0.085118,0.079286,0.092783,0.116473,0.114846,0.128627,0.128718,0.100124,0.079303,0.081483,0.096401,0.096609,0.079311,0.072194,0.094314,0.103179,0.089541,0.089495,0.111241,0.136342,0.113212,0.086135,0.091268,0.094549
0.064943,0.074895,0.081727,0.07272,0.075373,0.072151,0.084036,0.111438,0.121268,0.147274,0.152658,0.118668,0.084306,0.079828,0.096222,0.097016,0.07716,0.06345,0.088761,0.108549,0.097797,0.094316,0.115521,0.139531,0.116445,0.098706,0.10488,0.091644
0.061198,0.068365,0.077375,0.068913,0.068113,0.062655,0.066267,0.09242,0.109813,0.136447,0.14482,0.116882,0.084388,0.081048,0.089901,0.08912,0.076497,0.055917,0.07389,0.099073,0.097993,0.092797,0.10694,0.133589,0.122905,0.111547,0.113945,0.089979
0.052491,0.059144,0.069268,0.060711,0.056667,0.048438,0.045675,0.065604,0.080585,0.096233,0.106649,0.095031,0.073525,0.075012,0.081278,0.079461,0.068575,0.050939,0.06424,0.083159,0.09012,0.087072,0.091693,0.114254,0.118268,0.109019,0.101503,0.077673
0.041042,0.045546,0.051957,0.04759,0.04473,0.038298,0.037739,0.049197,0.055232,0.062201,0.069909,0.068758,0.060068,0.064103,0.071332,0.068332,0.054737,0.045019,0.05217,0.060419,0.073103,0.077747,0.076774,0.087092,0.097162,0.090491,0.077165,0.062426
0.038633,0.037782,0.036894,0.037737,0.039341,0.038439,0.043315,0.049072,0.049454,0.05451,0.053615,0.046954,0.047093,0.055302,0.059112,0.053102,0.044063,0.042746,0.046638,0.047345,0.056417,0.065141,0.060659,0.058071,0.069126,0.070028,0.058656,0.052302
0.039504,0.037281,0.03547,0.037539,0.039705,0.043073,0.050347,0.051428,0.048745,0.051425,0.046908,0.04009,0.044333,0.050477,0.04551,0.042116,0.043406,0.043356,0.044509,0.044723,0.051059,0.058995,0.05141,0.049004,0.056984,0.054731,0.049616,0.047299
0.04585,0.042636,0.044268,0.049526,0.051403,0.053574,0.05593,0.057091,0.050994,0.043258,0.040699,0.039378,0.048788,0.054584,0.040829,0.038886,0.045577,0.042651,0.044908,0.048009,0.049063,0.051461,0.044206,0.050153,0.057263,0.04933,0.046425,0.04582
0.05741,0.050077,0.055073,0.068385,0.072355,0.070464,0.063009,0.063619,0.052542,0.036163,0.038704,0.041128,0.05782,0.069071,0.049901,0.040649,0.04921,0.048846,0.053122,0.059938,0.053561,0.043565,0.037646,0.051519,0.059094,0.052353,0.055082,0.058069
0.065218,0.056743,0.061695,0.080901,0.087848,0.084616,0.071745,0.067467,0.054245,0.036591,0.040871,0.044499,0.06505,0.081799,0.06034,0.041123,0.049778,0.054564,0.062765,0.071743,0.058416,0.040701,0.037323,0.054643,0.062442,0.056337,0.064141,0.070993
0.059619,0.053557,0.055667,0.075957,0.085191,0.082359,0.069347,0.06226,0.052285,0.037406,0.039402,0.042124,0.060637,0.080281,0.06302,0.040109,0.046236,0.05433,0.065429,0.070922,0.053906,0.036252,0.037445,0.054569,0.058664,0.051688,0.064504,0.072425
0.042141,0.039359,0.038688,0.05512,0.064151,0.061816,0.055106,0.053952,0.046345,0.035353,0.036026,0.036993,0.048662,0.06574,0.061275,0.042266,0.041078,0.052379,0.061118,0.055934,0.040364,0.02984,0.041479,0.05331,0.046297,0.043401,0.061434,0.062581
0.027857,0.024728,0.025972,0.037662,0.042856,0.038683,0.037706,0.041568,0.035843,0.032046,0.038152,0.043552,0.049442,0.054522,0.061528,0.0556,0.046689,0.051671,0.052386,0.0436,0.031937,0.027735,0.050801,0.060605,0.043697,0.037658,0.053875,0.051874
0.021381,0.017939,0.022439,0.032479,0.035682,0.033611,0.034187,0.032188,0.02925,0.035094,0.05119,0.06427,0.060097,0.050898,0.070282,0.070324,0.055109,0.049813,0.050701,0.048636,0.030552,0.029475,0.061797,0.079175,0.057817,0.038362,0.043716,0.041161
0.019058,0.015995,0.01834,0.025924,0.032327,0.036369,0.033111,0.027497,0.03347,0.044915,0.072206,0.092282,0.069298,0.046646,0.077458,0.078018,0.058484,0.050406,0.054889,0.057486,0.032024,0.029423,0.064772,0.093226,0.075595,0.042807,0.043287,0.039475
0.018327,0.016356,0.017604,0.023412,0.032665,0.037321,0.027771,0.024937,0.043194,0.05734,0.094636,0.120423,0.077577,0.042068,0.07143,0.079629,0.061213,0.049474,0.057321,0.062955,0.03318,0.026424,0.056627,0.092168,0.086223,0.052199,0.050077,0.040176
0.023952,0.020739,0.01901,0.027088,0.036587,0.032545,0.020579,0.021879,0.051019,0.068052,0.110137,0.139866,0.078596,0.036956,0.055254,0.077687,0.069796,0.057078,0.06603,0.063765,0.033928,0.030038,0.048606,0.076032,0.08269,0.057473,0.053773,0.042061
0.03794,0.030756,0.019406,0.03019,0.03754,0.024853,0.01621,0.021936,0.056015,0.079681,0.122653,0.149195,0.072047,0.036916,0.045484,0.07451,0.075922,0.078158,0.081967,0.05989,0.039222,0.044123,0.054059,0.060743,0.06633,0.052872,0.049717,0.038653
