-0.000252,-0.000296,-0.00036,-0.000309,-0.000227,-0.000204,-0.000124,-0.000439,-0.000283,-0.00047,-0.000392,-0.00056,-0.000637,-0.000522,-0.000311,-0.000525,-0.000379,-0.000379,-0.000565,-0.000895,-0.000481,-0.000441,-0.000521,-0.000779,-0.000826,-0.00043,-0.000562,-0.000551,-0.000589,-0.000633,-0.000842,-0.000922,-0.000959,-0.000905,-0.00076,-0.000489,-0.000601,-0.000564,-0.001172,-0.001087,-0.000941,-0.000757,-0.000585,-0.000561,-0.001074,-0.000829,-0.000712,-0.000457,-0.000577,-0.000475,-0.001391,-0.001158,-0.000803,-0.000851,-0.00146,-0.001279,-0.001001,-0.00085,-0.000704,-0.001136,-0.000836,-0.001052,-0.00071,-0.001029,-0.00099,-0.001016,-0.001065,-0.001358,-0.000867,-0.000454,-0.000664,-0.001324,-0.000607,-0.001239,-0.001226,-0.001039,-0.001066,-0.000426,-0.000961,-0.001444,-0.001607,-0.001571,-0.001658,-0.001733,-0.001893,-0.001537,-0.001089,-0.001228,-0.001395,-0.001481,-0.001695,-0.001709,-0.001553,-0.001085,-0.001351,-0.00113,-0.001454,-0.000934,-0.001152,-0.001872,-0.002087,-0.002401,-0.002027,-0.001038,-0.001502,-0.001041,-0.001551,-0.001979,-0.001465,-0.000884,-0.001219,-0.001703,-0.001808,-0.001654,-0.001194,-0.000735,-0.000597,-0.000508,-0.001237,-0.000788,-0.000639
2.5e-05,0.00017,0.000201,0.000335,2.6e-05,-5.8e-05,-0.00016,7.4e-05,-4.3e-05,-6e-06,-0.000109,0.000132,0.000184,0.000201,8.6e-05,0.000277,0.000205,-4.5e-05,0.000412,0.000439,2e-04,-6.6e-05,-0.000114,0.000243,0.000344,0.000259,0.000164,0.000176,0.000247,0.000185,0.000114,0.000403,0.000259,0.000328,0.000438,8.6e-05,6.9e-05,-4.5e-05,0.000266,0.000273,0.000136,0.00033,0.000211,0.00023,0.000532,0.000585,0.000469,0.000143,0.000196,0.000253,0.000839,0.000626,0.000215,0.000206,0.000492,0.000731,0.00028,0.000494,-3e-05,0.000323,0.000373,0.000378,0.000264,0.000149,3e-06,0.000126,-0.000193,0.000329,0.00011,-6.9e-05,0.000248,0.000696,0.000196,0.000458,0.000562,0.00068,0.000491,0.00018,0.000318,0.000847,0.000775,0.000232,0.000497,0.000879,0.000983,0.00098,0.000542,8.1e-05,0.000521,0.000711,0.00091,0.000498,0.000479,0.000307,0.00053,3e-04,0.000625,0.000321,0.00062,0.001035,0.00097,0.000932,0.000583,4e-06,0.000317,0.00021,0.000525,0.000987,0.000682,0.000412,0.000409,0.000389,0.000655,0.000656,0.000831,3e-04,0.00024,0.000225,0.000719,0.000215,-5.6e-05
-8.6e-05,-0.000228,-2.1e-05,-0.00014,-0.000148,-4e-06,-0.000135,-6.4e-05,-0.000109,5e-06,-7.8e-05,-0.000138,-0.000163,-0.000131,-3.9e-05,-0.000116,-7.1e-05,2.8e-05,-0.000113,-0.000173,-0.000247,-5e-05,-0.000276,-0.000413,-0.00058,-0.000374,-0.000185,-0.000198,-8.1e-05,5.6e-05,0.000235,-3e-05,-5e-05,-0.00043,-0.000432,-0.000109,0.000132,4.8e-05,-0.000414,-0.000235,-4.5e-05,-0.000419,-0.000319,-0.000204,-0.000301,-0.000437,-0.000362,-0.00015,-0.000293,-0.000212,-0.000455,-0.000411,-0.000293,-0.000369,4.8e-05,0.000165,0.000123,-0.000108,5.1e-05,-0.000252,-0.000252,-0.000115,-0.000124,0.000362,-0.000241,3.5e-05,0.000229,0.00013,0.000131,0.000297,-0.00014,-0.000597,-0.00033,-0.000253,-0.000391,-0.00052,-0.000691,-0.000274,-0.000373,-0.000361,-0.00037,0.000303,6.6e-05,-0.000306,-0.000342,-0.00085,-0.000162,-2e-06,3.2e-05,0.000154,-0.000228,0.000141,0.000161,-0.00027,0.000175,-4.5e-05,2.4e-05,-0.000142,-0.00038,-0.000509,-0.00041,-0.000118,-0.000131,8.7e-05,0.000209,0.00024,-0.000301,-0.000354,-3.7e-05,-0.000348,-0.000355,2.5e-05,0.000193,-0.000288,-0.000324,-0.000252,-9e-05,0.000173,-3.9e-05,3.1e-05,0.000109
-0.000114,8.5e-05,-9.6e-05,-2.1e-05,-2e-06,-5.5e-05,-6.5e-05,-7.2e-05,-1.9e-05,-0.000217,8.8e-05,5.3e-05,0.000177,0.000168,-9.2e-05,2e-06,-2e-06,-1.5e-05,4.1e-05,-1e-06,-6.5e-05,-0.000121,-0.000158,-5.5e-05,0.000145,0.000208,9.2e-05,-2.1e-05,-0.000112,-0.000122,6e-06,-0.000167,1.4e-05,0.000336,0.000206,-6.7e-05,-0.000235,-0.000211,0.000277,2e-06,5.2e-05,0.000106,-9.1e-05,-0.000142,9.3e-05,0.000147,-0.000111,-5.1e-05,0.000102,0.000134,6.7e-05,0.000173,0.000251,0.00026,0.000165,-0.000396,-0.000263,-6.4e-05,4.4e-05,0.000105,0.000274,9.8e-05,-7e-05,-0.000369,-3.4e-05,-0.000308,-0.000122,-0.000109,-7.6e-05,-0.000105,-0.000126,0.000274,0.000162,-0.000255,-4e-06,2.3e-05,0.000353,0.00012,0.000258,2.3e-05,-3.7e-05,-0.000366,-0.000333,-5.8e-05,-0.000392,1.2e-05,-0.000124,-0.000187,-0.00041,-0.000533,-0.000458,-0.000439,-0.000416,-0.000137,-0.000479,-0.000329,-0.000597,-0.000164,0.000214,-1.2e-05,0.000523,-8.1e-05,2.5e-05,-3e-05,-0.000276,-0.000251,5.3e-05,-3.6e-05,-0.000442,-0.000127,-0.000336,-0.000264,-0.000353,-5.2e-05,-0.00019,-4e-06,-0.00019,-0.000184,-0.000242,-6.7e-05,-0.000151
0.000164,-3.9e-05,9.6e-05,-3e-06,9.5e-05,6.3e-05,6.2e-05,-5.4e-05,0.000132,3.2e-05,-9.1e-05,-0.00011,-8.5e-05,-0.00022,-5.6e-05,-0.000197,-0.000126,-3.2e-05,-9.6e-05,-3e-06,-1.6e-05,0.000122,0.000203,0.000191,-6.1e-05,-6.2e-05,9.6e-05,-0.000131,-0.000145,7.8e-05,2.4e-05,-2.4e-05,-0.000158,-0.000308,-0.000211,8.9e-05,0.000255,-0.000111,-6.3e-05,8e-05,1.6e-05,-0.000232,-1.7e-05,2.5e-05,-6.3e-05,-0.000223,-0.000148,8.1e-05,-0.000208,-0.000164,0.00013,-0.00023,-0.000159,3e-06,-0.000314,-5.5e-05,1.5e-05,-0.000104,-1.2e-05,-0.00032,-0.000302,-0.000198,0.000182,9.7e-05,-0.00011,-0.000202,-8.9e-05,0.00017,-0.000122,-0.000105,0.000117,-0.000373,0.000102,1.1e-05,2.5e-05,-2.1e-05,-0.00017,-0.000114,-8.3e-05,-0.000153,0.000181,0.000172,7.9e-05,-5.3e-05,5.2e-05,4.1e-05,1e-05,0.000216,-2.4e-05,0.000451,0.000327,0.00038,0.000403,0.000329,0.000256,0.000304,0.000407,8.9e-05,-9.8e-05,-0.000175,-0.000459,-0.000176,-0.000294,-0.000206,4e-06,8e-05,-9.7e-05,2.1e-05,0.000277,-0.00016,0.000218,0.000177,2.5e-05,-0.000258,-6.8e-05,2.6e-05,0.000187,-8.7e-05,0.000229,0.000143,-3.2e-05
-0.00011,0.000152,0,-7.1e-05,-4.9e-05,-1e-06,3.9e-05,0.000139,7.4e-05,3.2e-05,6e-06,6.4e-05,6.3e-05,0.000146,0.000163,4.4e-05,7.7e-05,7.2e-05,4e-05,-0.000143,-5.5e-05,6.2e-05,4.8e-05,8.4e-05,0.000238,0.000148,3.4e-05,4.7e-05,9.4e-05,5.2e-05,4.5e-05,5.3e-05,0.000196,0.000206,0.00015,8.1e-05,-0.000101,0.000135,0.000181,0.000249,0.000138,0.000185,5e-05,-3.8e-05,0.000137,0.000232,7.8e-05,7e-05,0.000139,0.000204,-0.000149,0.000197,0.000131,-5.7e-05,0.000372,0.000186,0.000298,0.000285,6.7e-05,7e-05,0.000264,0.000121,-0.000197,8.4e-05,0.000228,0.000105,0.00027,-0.000128,0.000233,4.3e-05,-0.000243,0.000173,-1.2e-05,4.9e-05,6.9e-05,-1e-06,0.00023,0.000188,-5.7e-05,0.000328,-0.000226,-4.3e-05,0.000291,0.000439,0.000329,0.000169,0.000148,0.000204,0.000295,-0.000177,-0.00017,-0.000132,-0.000446,-6.6e-05,9.8e-05,0.00024,-0.000244,0.000114,-3.5e-05,0.000447,0.000418,0.000507,0.000341,0.000211,0.000158,5e-06,5.1e-05,5.1e-05,-0.000158,8.4e-05,-0.000192,0.000113,0.000263,0.000553,0.00017,-2e-05,-4.2e-05,0.000107,3.2e-05,-3e-06,-4.7e-05
7.3e-05,-5e-05,5.8e-05,-7e-06,2.7e-05,-2.2e-05,-7.3e-05,-7.7e-05,-1.2e-05,1.6e-05,-3.8e-05,5.3e-05,-9e-06,-9.3e-05,-0.000132,-6.1e-05,-7.7e-05,-0.00011,-1.7e-05,-5.1e-05,-6.9e-05,4.4e-05,-0.000109,-0.000164,-0.000279,-7e-05,-7.6e-05,-4.1e-05,-4.9e-05,4e-06,-4e-06,-0.000128,-7.5e-05,2.5e-05,-0.000157,-4e-06,8.3e-05,6.2e-05,-0.000116,-0.000128,-0.000127,0,-0.000131,3.7e-05,-8.3e-05,-0.000189,9.6e-05,-0.000101,6.6e-05,-0.000189,0.000131,-3e-04,-0.000123,-4.8e-05,-0.000241,-0.000244,-0.000411,-0.000131,-0.000163,0.000221,-0.000104,-3.4e-05,-1.7e-05,-5.7e-05,-0.000169,7.6e-05,-0.00014,-3.2e-05,-9e-05,7.9e-05,5.4e-05,0.000134,-8.3e-05,-6e-06,-2.1e-05,-7.4e-05,-0.000146,0.000183,8.4e-05,-0.000206,0.00033,-6.1e-05,-0.000129,-0.000544,-0.000467,-5e-06,-0.000124,-0.00039,-2.7e-05,-1.6e-05,8.8e-05,-6.9e-05,0.00021,-1e-06,-8e-06,-0.000367,-6.6e-05,-9.8e-05,3.4e-05,-0.000306,-0.000388,-0.000381,-0.000283,-5e-05,-5.2e-05,-5e-06,-0.000122,-0.000326,5.8e-05,-8.3e-05,8.7e-05,-2.6e-05,-9.5e-05,-0.000242,-0.000258,-0.000112,5.3e-05,-7.2e-05,-7.6e-05,-0.000129,6e-05
-3.5e-05,4.1e-05,-1.3e-05,3e-06,-1.8e-05,-3e-05,4.1e-05,-5.7e-05,-1.1e-05,-8.4e-05,2e-05,-5.5e-05,-3.9e-05,6.5e-05,-7e-06,-1.2e-05,-1.4e-05,9.2e-05,2.6e-05,7.6e-05,0.000135,-2.3e-05,0,5e-06,0.000177,-7.9e-05,-1.6e-05,-1e-05,-1.1e-05,-3.4e-05,0.000129,9e-06,7.9e-05,-4.4e-05,0.000157,-7.1e-05,-0.00017,-0.00015,4.3e-05,5e-05,1.1e-05,5.5e-05,6.4e-05,-0.000155,-5.9e-05,0.000139,5.9e-05,7.9e-05,-7.5e-05,-2.8e-05,-5.2e-05,0.000259,0.000148,-4e-06,0.000113,9.7e-05,0.000117,-1.7e-05,-3.3e-05,-0.000332,4.5e-05,4.3e-05,3.1e-05,4.1e-05,-1.4e-05,2.7e-05,9e-05,0.000144,7.8e-05,-0.000187,-0.000186,-0.00023,-0.000162,-3.5e-05,-9.8e-05,-2e-05,4.9e-05,-0.000216,-9.5e-05,2.2e-05,-1.2e-05,0.000115,-7.6e-05,0.000176,0.000286,5.9e-05,-9e-06,0.000252,-3e-05,8.6e-05,0.00036,0.00013,-3.5e-05,-2.5e-05,4.1e-05,0.000148,3.3e-05,-2e-06,0.000123,0.000162,3.1e-05,0.00017,0.000172,2e-06,5.6e-05,-6.1e-05,7.1e-05,0.000195,1.4e-05,0.000228,-1.8e-05,-5.8e-05,6e-05,3.9e-05,3e-04,6.3e-05,-7.8e-05,0.000122,7e-05,-5.3e-05,-6.4e-05
-9e-06,-4.2e-05,4.5e-05,1e-05,5.6e-05,-4.5e-05,-2.5e-05,-7.3e-05,5e-06,-3.1e-05,3.8e-05,-2.7e-05,5.3e-05,-4.5e-05,-6.1e-05,1e-05,-7.7e-05,1e-05,-2.7e-05,-0.000154,1.2e-05,-6e-05,-3.8e-05,-2.4e-05,-0.000131,-4.6e-05,2.5e-05,1e-05,-8e-05,-3.6e-05,-5.3e-05,2e-06,9.4e-05,4.7e-05,-6.5e-05,0.000129,2.7e-05,2.5e-05,-0.000109,-0.000175,-1.2e-05,-7.3e-05,-0.000123,7e-06,5e-06,2.7e-05,-3.7e-05,-0.000194,-4.8e-05,1.8e-05,7e-05,-8.4e-05,-0.000129,6.5e-05,-5.9e-05,1e-05,-5e-05,1.4e-05,5.3e-05,0.000123,1.6e-05,-9e-06,1.3e-05,-0.000153,0.000102,5.3e-05,7.7e-05,-7.6e-05,8e-06,5.8e-05,1e-05,9.6e-05,0.000173,-6.5e-05,5.8e-05,3.8e-05,-1.7e-05,5.9e-05,-2e-06,-0.000164,-5.3e-05,-0.000191,1.7e-05,0.00012,-0.000102,-0.000173,-5.8e-05,-0.000142,4.8e-05,0.000143,-0.000363,-2e-05,-7.3e-05,-4e-05,2.8e-05,9.5e-05,0.000148,0.000195,-0.000162,-0.000204,0.000286,-0.000123,7e-05,-4.7e-05,-5.3e-05,8e-05,-0.000186,-9.5e-05,0.000108,-5.1e-05,3.7e-05,-5.3e-05,2.1e-05,1.9e-05,-8.9e-05,-3.4e-05,-4.3e-05,-0.000107,-3.2e-05,2e-06,8e-05
-9e-05,-6.6e-05,-1.5e-05,7e-06,2.2e-05,4.3e-05,-3.6e-05,1.8e-05,-5.6e-05,3.2e-05,4.4e-05,6.7e-05,-3e-06,4.7e-05,9.3e-05,-2e-06,0.000128,9.7e-05,-2e-05,7.5e-05,3.9e-05,4.1e-05,6e-06,2e-06,0.000139,1e-04,-3.3e-05,-0.000152,2.9e-05,-8e-05,2e-06,-7e-06,-3.8e-05,2.5e-05,3.2e-05,-2.8e-05,4.4e-05,-6.3e-05,6.1e-05,0.000127,6.4e-05,-2e-06,1.7e-05,5.1e-05,-2.1e-05,-7.4e-05,1.9e-05,7e-05,1.5e-05,-2.1e-05,-6.4e-05,8e-06,0.000105,-3.6e-05,5e-06,2.4e-05,1.6e-05,6.2e-05,-6.9e-05,-0.000119,-0.000137,-2.3e-05,-7e-05,0.000149,-7.3e-05,-0.000135,6.7e-05,6.3e-05,-7.6e-05,1.8e-05,5.8e-05,7.5e-05,-8.5e-05,-1e-05,6e-05,-5.3e-05,-5.8e-05,-0.000164,-2.7e-05,9.7e-05,-4.1e-05,0.000227,-6.2e-05,-1e-06,2.3e-05,5.8e-05,-0.000144,-2e-05,-0.00012,-0.000183,0.000184,3.7e-05,-7.4e-05,-5e-05,-0.000188,-0.000187,-0.000238,-0.000244,1.6e-05,9.3e-05,-9.8e-05,3.8e-05,-1.6e-05,4.1e-05,7e-06,-2.6e-05,0.000117,-3.7e-05,-4.6e-05,-9.3e-05,7.4e-05,1.3e-05,-0.000167,2.8e-05,-1e-06,-3e-05,-5.9e-05,-2.8e-05,-4.9e-05,-5.7e-05,-5e-06
0,6.5e-05,-1.3e-05,-3e-05,2.2e-05,-3.9e-05,4.7e-05,3.2e-05,7.1e-05,6.6e-05,-1.9e-05,-1.9e-05,-5.8e-05,3e-05,-4.9e-05,-3.1e-05,-5.6e-05,1.7e-05,1e-06,2.4e-05,3e-06,0,6.1e-05,-5e-06,5.3e-05,7.3e-05,1e-04,7.9e-05,-5.4e-05,3.6e-05,-8.2e-05,-3.2e-05,1.9e-05,-5.1e-05,-1.7e-05,7.3e-05,-5.9e-05,3e-05,-4.2e-05,-2.3e-05,1.4e-05,7e-05,-6.2e-05,2e-06,5.4e-05,-1.9e-05,4.1e-05,-2.9e-05,3.7e-05,1.5e-05,-1.6e-05,4.7e-05,-1e-05,-2.5e-05,8e-06,-0.000116,-2e-06,-7.3e-05,6.4e-05,7.3e-05,0.000108,0.00011,5.4e-05,-5e-05,9.5e-05,-0.00011,5.1e-05,-6.9e-05,0.000119,-1.3e-05,-7.4e-05,-1.6e-05,0.000158,0.000158,2.5e-05,6.3e-05,0,0.000117,5e-05,5.3e-05,-2.1e-05,-0.000122,3.9e-05,2.3e-05,1.1e-05,7e-06,0.000229,3.9e-05,5.3e-05,7.7e-05,-4e-06,-8.5e-05,0.000116,5.7e-05,0.000153,5.4e-05,4e-05,0.000225,0.000131,-5.9e-05,-9.6e-05,-7.6e-05,5.3e-05,0,2.5e-05,8e-06,-0.000103,5.3e-05,2.5e-05,0.000152,4.3e-05,-1.3e-05,6e-05,-6.3e-05,-0.000113,-3e-06,0.000102,-3.8e-05,2.2e-05,1.7e-05,-4.5e-05
-2.5e-05,-6e-05,-2.4e-05,-2e-05,2.4e-05,-6e-06,-2.4e-05,-2e-06,-3.6e-05,-3.5e-05,-2.3e-05,5e-06,-2.8e-05,-2.1e-05,3.1e-05,7e-06,1e-05,-1.3e-05,-6e-06,-1.8e-05,5e-06,-5.9e-05,-1e-06,-1.4e-05,-0.000107,1.9e-05,-6e-05,4.3e-05,1.6e-05,-4.6e-05,5.7e-05,5e-06,-4e-06,3.3e-05,-4.5e-05,4e-06,5e-06,-4.4e-05,2.1e-05,4.2e-05,-3e-05,7e-06,7.2e-05,-5e-06,7e-06,2e-05,-2e-05,0.000115,3.1e-05,3.5e-05,3.5e-05,-6.1e-05,-2e-05,1.7e-05,-5.5e-05,3.5e-05,2e-05,0.000109,1e-06,6e-06,-7e-05,-2.3e-05,-4.4e-05,-7e-05,-4.9e-05,0.000166,-3.3e-05,-1.5e-05,-5.6e-05,-2.7e-05,8e-06,-6e-05,-1.1e-05,-0.00012,-1e-05,-5.6e-05,-2.6e-05,-1e-05,-2e-06,-4.8e-05,0.000102,1e-06,-3.6e-05,3.9e-05,6.3e-05,-4.1e-05,-3.9e-05,5e-06,0.000137,-7.5e-05,1.2e-05,5.3e-05,-0.000164,-4.9e-05,-8.6e-05,-4.7e-05,0,-6.3e-05,-0.000107,-4.1e-05,8.5e-05,0.000107,-3.7e-05,-4.5e-05,8.2e-05,-1.8e-05,0.000127,3.6e-05,-4.9e-05,-9.4e-05,1e-06,-3.9e-05,-3e-06,6.2e-05,0.000129,2.4e-05,-9.6e-05,-3.1e-05,1.2e-05,-2.9e-05,2.2e-05
-4.6e-05,4e-06,8e-06,-5e-06,-5e-06,-4e-06,-2.1e-05,-2.2e-05,1.2e-05,1e-05,1.8e-05,-2.8e-05,9e-06,1e-06,-7e-06,1.4e-05,-8e-06,-1.3e-05,-1e-06,-2.3e-05,4.8e-05,8e-06,2.1e-05,1e-06,5.9e-05,-8.8e-05,1e-05,2e-06,-2.4e-05,4.7e-05,4e-06,2.7e-05,-3.8e-05,-6e-06,2.2e-05,-2.9e-05,-5e-05,1.2e-05,-2.2e-05,-4.9e-05,-5.3e-05,-1.8e-05,-3.6e-05,-2.2e-05,1.3e-05,1.5e-05,2.5e-05,-9e-06,-2.8e-05,2.4e-05,-1.1e-05,8e-05,3e-06,-2.5e-05,1e-06,7e-06,2.2e-05,-3e-05,8e-06,-1.2e-05,8e-06,-2.4e-05,4.3e-05,2.1e-05,4e-06,-8.1e-05,-4e-05,7e-06,-1e-05,6.5e-05,8.6e-05,5.4e-05,-3.2e-05,0.000102,1.4e-05,-2e-05,7e-06,3.5e-05,-2.3e-05,-4e-06,-7.4e-05,-6e-06,2.6e-05,-1e-04,-0.000116,6e-06,-6e-06,-5.4e-05,-0.000137,4.6e-05,-5.6e-05,-3.8e-05,9.3e-05,8.3e-05,2.4e-05,-3.6e-05,5.7e-05,1.6e-05,2.9e-05,4e-05,-8.8e-05,-3.5e-05,-1e-05,7e-06,2e-05,-3.2e-05,-9.8e-05,-4.5e-05,1.4e-05,4e-05,-1.2e-05,6e-05,0,-6.7e-05,-9.5e-05,-9e-06,7.6e-05,5.2e-05,1.2e-05,1.9e-05,3e-06
-1e-06,8e-06,-1.7e-05,1.2e-05,-2.6e-05,2e-06,-1.3e-05,1.2e-05,-3.1e-05,8e-06,1.2e-05,2.7e-05,1.6e-05,-1.4e-05,-1e-06,1.1e-05,4e-06,1e-05,-2e-06,8e-06,-1.9e-05,5.3e-05,1e-06,-1.3e-05,-1e-05,2e-06,-9e-06,-1.4e-05,-4e-05,-5.4e-05,-2.9e-05,-2.2e-05,9e-06,-3.3e-05,-8e-06,-2.2e-05,4e-05,2e-06,1.7e-05,2.3e-05,4.1e-05,-5e-06,2e-06,3.3e-05,-4.9e-05,3e-06,-1.7e-05,2.4e-05,8e-06,-6.2e-05,-2.9e-05,-5.5e-05,4e-06,4e-06,-6e-06,1.9e-05,4e-06,-8e-06,-2.6e-05,-3.5e-05,-4e-06,-2.6e-05,-2.9e-05,8e-06,-1.2e-05,-3.2e-05,-5.2e-05,-2e-06,1.7e-05,-0.000117,-4.1e-05,-1.1e-05,-9e-06,-0.000117,4e-06,-1.6e-05,1.1e-05,-6.8e-05,-1.4e-05,2.8e-05,2.1e-05,5e-05,2.8e-05,-4e-06,3.1e-05,2.2e-05,-6e-06,-2.2e-05,6.2e-05,-2.5e-05,8.8e-05,-2.7e-05,-7.7e-05,-1.7e-05,4.2e-05,-2.9e-05,-3.3e-05,-1.8e-05,3e-06,1.7e-05,8.3e-05,-2.6e-05,-2.5e-05,-2.8e-05,-2.8e-05,2.2e-05,2.8e-05,3e-05,8e-06,-1.6e-05,5.5e-05,1.9e-05,7.8e-05,0,5.4e-05,-6e-06,-1.1e-05,0,-2.8e-05,0,-1.1e-05
3.3e-05,-1.1e-05,3e-06,-3e-06,-7e-06,1e-06,4e-06,0,4e-06,-1e-06,1.9e-05,-4e-06,-6e-06,1.6e-05,-3.8e-05,-1.9e-05,6e-06,-2.3e-05,-1e-05,-1.8e-05,-1.3e-05,1e-05,-2e-05,1.1e-05,-6e-06,-1.5e-05,6e-06,9e-06,3e-05,2.4e-05,4e-05,-9e-06,-3e-05,2e-05,2e-06,8e-06,-3.6e-05,-3.8e-05,-2e-06,1.1e-05,-1.7e-05,1.6e-05,-9e-06,0,1e-06,-2.3e-05,1.1e-05,-1.2e-05,-2.9e-05,2.4e-05,2.6e-05,4.3e-05,3e-06,-2.5e-05,2.4e-05,-3.2e-05,-7.1e-05,1e-05,2e-05,5.4e-05,-1.9e-05,2.7e-05,2e-06,2.4e-05,9e-06,1.9e-05,3.7e-05,-6e-05,-3.4e-05,4.7e-05,2.1e-05,-5e-06,-1.3e-05,5.4e-05,8e-06,1.4e-05,-7e-06,5e-05,1.9e-05,-7e-06,-6.3e-05,-1.2e-05,-3.4e-05,9e-06,2.8e-05,4e-06,-2.6e-05,5.2e-05,-8e-06,4.4e-05,-4.3e-05,1.6e-05,2.5e-05,1.5e-05,-2.3e-05,8e-05,9e-06,2.1e-05,-1.4e-05,-4.7e-05,1e-05,1.4e-05,3e-06,4.9e-05,-2.9e-05,-9e-06,1e-05,-1.3e-05,-2.4e-05,1.2e-05,-3.6e-05,3.8e-05,-1.9e-05,2e-06,-1.7e-05,-2.3e-05,9e-06,-3e-05,-3e-06,-2.4e-05,3e-05
-9e-06,-7e-06,6e-06,-4e-06,-1.4e-05,3e-06,1e-06,-1.4e-05,2e-06,-6e-06,-1.4e-05,9e-06,2e-06,-2.4e-05,2e-05,-1e-05,-6e-06,9e-06,1e-06,7e-06,3e-06,1.6e-05,7e-06,2e-06,2.7e-05,-6e-06,-6e-06,8e-06,-7e-06,-1.4e-05,-3.8e-05,-1.5e-05,1.8e-05,-3.2e-05,2e-06,-3.1e-05,1.8e-05,9e-06,-3e-06,-4.1e-05,3.6e-05,1.7e-05,1.4e-05,-8e-06,1.5e-05,-7e-06,0,1e-05,6e-06,1.2e-05,-3.1e-05,-1.5e-05,-2.2e-05,3.2e-05,1e-06,2e-06,5.1e-05,-1.8e-05,-2.2e-05,-4.2e-05,1.1e-05,-2.7e-05,-2e-06,-3.2e-05,0,-2e-05,1e-05,1.2e-05,3.5e-05,-2.2e-05,-7e-06,1.4e-05,-1.5e-05,1.6e-05,-8e-06,2.9e-05,2e-06,-1.3e-05,-3e-06,1e-06,1.5e-05,-1.2e-05,3.1e-05,-1.1e-05,6e-06,-1.9e-05,1.4e-05,-4.6e-05,3e-05,-2.7e-05,1.1e-05,-2.3e-05,2e-05,1e-06,4.7e-05,-5e-06,3.5e-05,2.4e-05,-2.1e-05,-2e-06,6e-06,-7e-06,2.6e-05,-2.6e-05,9.1e-05,-2.8e-05,-4.1e-05,1e-05,-1e-06,-7e-06,-2e-06,-1.3e-05,-6e-06,-2.5e-05,-2.1e-05,-5e-06,-2.7e-05,-4.5e-05,1e-06,2.3e-05,-8e-06
0,4e-06,-6e-06,-8e-06,-8e-06,4e-06,-3e-06,-8e-06,2e-06,1e-06,-1.4e-05,-1.5e-05,7e-06,1e-06,-2e-06,0,8e-06,-2.1e-05,3e-06,5e-06,-9e-06,-3e-06,-5e-06,7e-06,-8e-06,2e-06,2e-06,1.7e-05,9e-06,1.1e-05,1.7e-05,1.2e-05,-2.4e-05,-5e-06,1e-06,1e-06,-1.1e-05,7e-06,8e-06,6e-06,-2e-05,-3e-06,-8e-06,0,-1.5e-05,-1.2e-05,6e-06,-2.7e-05,-5e-06,-7e-06,1.4e-05,-1.6e-05,8e-06,-3.7e-05,-1e-06,1.9e-05,1e-05,7e-06,-8e-06,1e-05,-9e-06,-1.5e-05,-1.2e-05,1e-06,-2.7e-05,3.8e-05,1e-06,6e-06,-3.5e-05,5e-06,-4e-06,-1.4e-05,-1.5e-05,-5.2e-05,7e-06,-2.2e-05,-1.6e-05,-5e-06,-1.2e-05,-7e-06,6e-06,1.4e-05,-8e-06,3.7e-05,-1.2e-05,4e-06,-1.7e-05,5.3e-05,-1.8e-05,0,4e-06,5.2e-05,7e-06,1.6e-05,-4.1e-05,-1.3e-05,-5.4e-05,-7e-06,3e-06,8e-06,6e-06,1.2e-05,1e-06,2.1e-05,-8.2e-05,-8e-06,3.4e-05,-6e-06,-2e-06,2.3e-05,-1e-06,6e-06,7e-06,3.2e-05,3.4e-05,7e-06,1.4e-05,3.2e-05,-6e-06,-1.6e-05,-8e-06
8e-06,0,8e-06,2e-06,6e-06,-3e-06,3e-06,-1e-05,2e-06,1e-05,-1.4e-05,6e-06,-7e-06,2e-06,-1e-05,-3e-06,-7e-06,7e-06,0,5e-06,-5e-06,-1e-06,-5e-06,-3e-06,-1e-06,5e-06,-2e-06,2e-06,-1.5e-05,-1.1e-05,-2e-05,0,-1.4e-05,2.1e-05,5e-06,5e-06,1.5e-05,2e-06,-9e-06,-4e-06,3e-06,6e-06,-5e-06,7e-06,9e-06,1e-06,-1.2e-05,-9e-06,-7e-06,-4e-06,1.5e-05,3.3e-05,-7e-06,1.6e-05,-3e-06,-4e-06,-1.8e-05,-2e-06,5e-06,-2e-06,1.2e-05,1.8e-05,-1.2e-05,1.6e-05,2.6e-05,7e-06,3e-06,1e-05,2e-06,2.7e-05,-2e-06,-1.5e-05,2.9e-05,3.3e-05,1.1e-05,1e-05,4e-06,-8e-06,1.3e-05,1.3e-05,1.4e-05,-6e-06,-9e-06,-1.9e-05,-3e-06,1.8e-05,-5e-06,-4.8e-05,-3e-06,-4.1e-05,-2.1e-05,-2.6e-05,0,-8e-06,8e-06,1.9e-05,4.2e-05,-1.2e-05,1.3e-05,9e-06,-4.1e-05,-2.8e-05,3e-06,-1.6e-05,3.5e-05,1.7e-05,-2e-05,1.4e-05,-7e-06,-2e-06,2e-06,2e-06,-8e-06,-1.1e-05,-3.1e-05,4e-06,-1.6e-05,3e-06,-1e-06,1.2e-05,9e-06
-1e-05,-5e-06,-1e-06,-4e-06,-9e-06,4e-06,5e-06,3e-06,1e-06,3e-06,0,3e-06,2e-06,-2e-06,7e-06,6e-06,9e-06,-1.3e-05,-2e-06,-4e-06,-7e-06,-1.5e-05,-3e-06,3e-06,-2e-06,1.3e-05,2e-06,1e-06,-3e-06,1e-06,7e-06,-1.1e-05,1.3e-05,-1.9e-05,-5e-06,2e-06,-8e-06,-4e-06,1.5e-05,1.6e-05,-2e-06,1e-06,3e-06,1e-06,-2e-06,0,2e-06,5e-06,1.4e-05,6e-06,-1.3e-05,-1.6e-05,-3e-06,-6e-06,-4e-06,3e-06,1.5e-05,-8e-06,-2e-06,-6e-06,-3e-06,1e-06,9e-06,-1e-05,-1e-05,-1e-05,-2.8e-05,2.3e-05,2.1e-05,-4.7e-05,3e-06,1.5e-05,-2e-06,-1.3e-05,-4e-06,-1.4e-05,-3e-06,-2.3e-05,-1.1e-05,1e-05,-2e-05,-3e-06,-5e-06,-1e-06,3e-05,-9e-06,1.3e-05,2e-05,-1e-06,4.7e-05,-4e-06,0,-2e-06,-1.4e-05,-2.2e-05,-1.1e-05,5e-06,1.1e-05,-2.2e-05,-8e-06,1.3e-05,9e-06,-1.5e-05,8e-06,-3e-06,5e-06,2e-06,-6e-06,-1.1e-05,-3e-06,-4e-06,-1.4e-05,-5e-06,7e-06,1.3e-05,-5e-06,6e-06,1.7e-05,3e-06,-1.9e-05,-6e-06
-9e-06,4e-06,1e-06,3e-06,2e-06,-7e-06,1e-06,2e-06,2e-06,-1e-06,8e-06,-2e-06,-4e-06,0,-7e-06,-1e-06,-1.2e-05,-3e-06,1e-06,-4e-06,2e-06,-5e-06,5e-06,4e-06,3e-06,-6e-06,-5e-06,2e-06,-2e-06,-3e-06,0,1e-06,-4e-06,8e-06,3e-06,-2e-06,-3e-06,3e-06,-1.5e-05,-1.7e-05,-1.5e-05,2e-06,-5e-06,-8e-06,8e-06,-5e-06,-1e-06,5e-06,5e-06,7e-06,1e-06,1.8e-05,2e-06,-3e-06,3e-06,-1.4e-05,0,1.3e-05,3e-06,1.5e-05,6e-06,-3e-06,1e-06,1e-06,0,-1.2e-05,-1e-06,-1.3e-05,-1e-06,3.1e-05,-8e-06,-8e-06,-1.1e-05,3e-06,1e-06,6e-06,-4e-06,2.7e-05,9e-06,-1.2e-05,5e-06,-4e-06,-2e-06,-7e-06,-2.4e-05,-5e-06,-3e-06,-1.6e-05,1.1e-05,-1.1e-05,6e-06,1.4e-05,-5e-06,9e-06,-5e-06,-1.9e-05,1e-06,-1.3e-05,1.6e-05,-1.2e-05,2.9e-05,1.8e-05,-7e-06,7e-06,-1.7e-05,-3e-06,9e-06,-2e-06,1.4e-05,-9e-06,-9e-06,-1.1e-05,-1.1e-05,7e-06,3e-06,-6e-06,-7e-06,-2e-05,1e-06,1.4e-05,1.4e-05
3e-06,-6e-06,-6e-06,1e-06,-6e-06,1e-06,0,1e-06,1e-06,-2e-06,2e-06,-8e-06,0,2e-06,1e-05,-4e-06,4e-06,-3e-06,-1e-06,1e-06,-1.2e-05,-9e-06,3e-06,-7e-06,-9e-06,-7e-06,0,1.1e-05,-1e-06,1e-06,-8e-06,1e-06,1.6e-05,7e-06,-5e-06,3e-06,2e-06,0,1.1e-05,-2e-06,1.7e-05,1e-06,5e-06,-5e-06,-3e-06,6e-06,-6e-06,8e-06,-9e-06,-9e-06,-2e-06,-1.4e-05,1e-06,-1e-06,-4e-06,6e-06,1.3e-05,-8e-06,-6e-06,-8e-06,6e-06,-7e-06,-2e-06,-7e-06,2e-06,-6e-06,-6e-06,-6e-06,1e-06,-1.4e-05,1.9e-05,-8e-06,9e-06,6e-06,-4e-06,-3e-06,3e-06,-2e-06,-5e-06,2e-06,5e-06,1.4e-05,-1e-06,-2e-06,0,-3e-06,1.7e-05,-5e-06,-2e-06,4e-06,0,-1.6e-05,-1e-06,-7e-06,1.1e-05,1e-06,-2.6e-05,1.1e-05,1e-06,9e-06,-2.3e-05,-8e-06,0,-7e-06,1.2e-05,-5e-06,-1.7e-05,1.2e-05,-2e-06,2.6e-05,-7e-06,5e-06,2e-06,-7e-06,-2e-06,2e-06,1.6e-05,-5e-06,1e-06,-1.9e-05,-3e-06
-8e-06,4e-06,2e-06,-1e-06,2e-06,0,0,-2e-06,-5e-06,7e-06,-3e-06,5e-06,1e-06,1e-06,-9e-06,-2e-06,4e-06,7e-06,0,-4e-06,-7e-06,6e-06,-4e-06,4e-06,4e-06,-8e-06,-1e-06,2e-06,-7e-06,-1e-06,3e-06,-1e-06,-3e-06,-7e-06,2e-06,5e-06,-1e-06,-4e-06,-9e-06,2e-05,0,-6e-06,-1e-05,1.2e-05,-1e-05,-4e-06,-5e-06,7e-06,4e-06,-5e-06,6e-06,0,-2e-06,3e-06,5e-06,-1e-06,-1.3e-05,-3e-06,5e-06,-1e-05,-1.2e-05,0,-5e-06,1.1e-05,-4e-06,1.4e-05,1e-05,3e-06,-1.7e-05,2e-06,-1.2e-05,1.2e-05,-1.7e-05,-1.6e-05,-3e-06,5e-06,-6e-06,-8e-06,2e-06,0,1.5e-05,-1.3e-05,3e-06,1.2e-05,1.4e-05,-3e-06,-1.6e-05,8e-06,-5e-06,-2e-05,-1.1e-05,1.1e-05,-3e-06,9e-06,-2e-06,1.7e-05,2.3e-05,-8e-06,-5e-06,-5e-06,2.6e-05,7e-06,5e-06,7e-06,2e-06,0,8e-06,-6e-06,-5e-06,-9e-06,-6e-06,0,-2e-06,0,-4e-06,-3e-06,-1.8e-05,5e-06,3e-06,1.2e-05,-4e-06
-8e-06,-2e-06,-3e-06,-4e-06,-1e-06,-1e-06,0,-1e-06,4e-06,-3e-06,-1.1e-05,2e-06,-7e-06,-3e-06,2e-06,-3e-06,-2e-06,-2e-06,0,0,0,1e-06,0,-3e-06,-6e-06,1e-06,0,-6e-06,-7e-06,-2e-06,6e-06,-6e-06,-4e-06,2e-06,4e-06,-1e-06,3e-06,0,6e-06,-1.1e-05,-1e-06,0,5e-06,-8e-06,9e-06,3e-06,0,-1e-06,0,8e-06,3e-06,5e-06,2e-06,-1e-06,-4e-06,8e-06,3e-06,5e-06,-1e-06,8e-06,7e-06,1e-06,6e-06,-3e-06,5e-06,1e-06,6e-06,-9e-06,1.3e-05,-4e-06,8e-06,-1e-06,-3e-06,9e-06,3e-06,3e-06,0,3e-06,-1e-06,5e-06,-4e-06,5e-06,1e-06,0,-5e-06,4e-06,-6e-06,-1.3e-05,-5e-06,1.7e-05,6e-06,-1.1e-05,-5e-06,5e-06,8e-06,-1.5e-05,-1e-05,-1e-06,-2e-06,3e-06,-1.7e-05,-1.1e-05,5e-06,-1.1e-05,-1.5e-05,1e-06,2e-06,1e-06,3e-06,-1.1e-05,2e-06,7e-06,4e-06,3e-06,2e-06,-5e-06,1.9e-05,7e-06,-1e-06,-4e-06,1e-06
2e-06,-3e-06,5e-06,1e-06,7e-06,0,2e-06,-2e-06,-3e-06,-2e-06,-2e-06,1e-06,7e-06,3e-06,3e-06,1e-06,1e-06,8e-06,0,-1e-06,-3e-06,6e-06,-1e-06,-2e-06,-4e-06,5e-06,4e-06,2e-06,1e-05,1e-06,-2e-06,2e-06,9e-06,5e-06,-6e-06,-1e-06,-7e-06,-2e-06,-7e-06,2e-06,3e-06,3e-06,-2e-06,5e-06,-1e-06,-3e-06,-1e-06,0,2e-06,0,-9e-06,-8e-06,2e-06,1e-06,3e-06,0,2e-06,-5e-06,-1e-06,-4e-06,-9e-06,6e-06,-3e-06,-3e-06,-8e-06,-1.9e-05,3e-06,1e-06,6e-06,4e-06,7e-06,-7e-06,5e-06,-1e-06,-4e-06,-3e-06,0,2e-06,0,-4e-06,-1.7e-05,-4e-06,2e-06,6e-06,-7e-06,1e-06,1e-05,2.1e-05,0,-9e-06,-2e-06,9e-06,-2e-06,0,2e-06,-6e-06,5e-06,6e-06,6e-06,-8e-06,-1.1e-05,2e-06,3e-06,1.1e-05,2e-06,3e-06,-1.2e-05,1e-06,3e-06,1.6e-05,-4e-06,5e-06,9e-06,-2e-06,4e-06,-1e-06,-1.3e-05,1e-06,-3e-06,-6e-06,0
-1e-06,3e-06,-3e-06,1e-06,1e-06,-1e-06,0,-2e-06,4e-06,2e-06,2e-06,-5e-06,2e-06,1e-06,-3e-06,0,-2e-06,-2e-06,0,2e-06,1e-06,-1e-06,2e-06,-1e-06,5e-06,5e-06,-5e-06,1.2e-05,-1.1e-05,-1e-06,0,-2e-06,-6e-06,-3e-06,2e-06,6e-06,7e-06,1e-06,5e-06,-7e-06,-8e-06,-1e-06,1e-06,-8e-06,-2e-06,0,-2e-06,-1e-05,1e-06,-3e-06,0,9e-06,-1e-06,-2e-06,-4e-06,-7e-06,0,2e-06,0,1e-06,-2e-06,4e-06,-3e-06,1e-06,9e-06,2e-06,-4e-06,7e-06,-9e-06,-7e-06,-7e-06,6e-06,5e-06,-3e-06,1e-06,1e-06,1e-06,3e-06,-3e-06,-3e-06,9e-06,4e-06,1e-06,-2e-06,-2e-06,-1e-06,-1e-05,-5e-06,1.4e-05,6e-06,7e-06,-7e-06,6e-06,4e-06,6e-06,1.9e-05,1e-06,-6e-06,-5e-06,1e-06,1.4e-05,-2e-06,-4e-06,-6e-06,1.8e-05,1e-06,1.2e-05,-3e-06,-1e-06,-1.3e-05,-2e-06,1e-06,-2e-06,0,-8e-06,2e-06,1e-05,-1.1e-05,-1e-06,7e-06,2e-06
-5e-06,-2e-06,2e-06,0,4e-06,1e-06,0,-3e-06,-3e-06,4e-06,4e-06,0,0,-2e-06,0,-3e-06,4e-06,4e-06,0,-5e-06,-3e-06,9e-06,-1e-06,-1e-06,-2e-06,-5e-06,5e-06,3e-06,-1e-06,2e-06,-6e-06,-1e-06,8e-06,4e-06,0,-1e-06,-3e-06,1e-06,-3e-06,1e-05,4e-06,-5e-06,-3e-06,1e-05,4e-06,3e-06,0,2e-06,-4e-06,1e-06,6e-06,-5e-06,0,1e-06,2e-06,-3e-06,6e-06,-3e-06,0,1e-06,1e-06,-4e-06,0,1e-06,-6e-06,7e-06,-2e-06,-9e-06,3e-06,1e-05,-2e-06,-3e-06,4e-06,4e-06,3e-06,-2e-06,-2e-06,1e-06,2e-06,3e-06,1e-06,-2e-06,0,-9e-06,9e-06,1e-06,1.1e-05,7e-06,-1.4e-05,-2e-06,-3e-06,-1e-06,-5e-06,-9e-06,0,-7e-06,5e-06,7e-06,-6e-06,0,-1e-05,0,-4e-06,4e-06,-1.5e-05,1e-06,-1.4e-05,4e-06,1e-06,1.1e-05,-3e-06,6e-06,2e-06,1e-06,3e-06,-1e-06,-1.1e-05,-3e-06,2e-06,-3e-06,-1e-06
3e-06,1e-06,-1e-06,0,3e-06,-1e-06,1e-06,-2e-06,1e-06,-2e-06,2e-06,4e-06,2e-06,0,0,1e-06,-4e-06,-1e-06,0,1e-06,2e-06,-6e-06,0,2e-06,-7e-06,4e-06,-5e-06,-3e-06,-1e-06,-2e-06,6e-06,-1e-06,-1e-06,-2e-06,1e-06,-3e-06,2e-06,-1e-06,0,-2e-06,-1e-06,-3e-06,1e-06,-5e-06,-1e-06,-2e-06,0,-7e-06,3e-06,4e-06,-4e-06,0,4e-06,-2e-06,-2e-06,2e-06,-4e-06,3e-06,0,-6e-06,-5e-06,3e-06,3e-06,3e-06,1e-06,2e-06,1e-06,-1e-06,-6e-06,-9e-06,2e-06,-3e-06,0,-8e-06,-5e-06,1e-06,1e-06,-9e-06,-1e-06,1e-06,3e-06,1e-06,-1e-06,-2e-06,-5e-06,2e-06,-7e-06,-3e-06,4e-06,7e-06,0,-3e-06,-1e-06,4e-06,-6e-06,-9e-06,-7e-06,-6e-06,9e-06,-5e-06,9e-06,4e-06,-2e-06,-6e-06,-8e-06,2e-06,7e-06,1e-06,3e-06,-5e-06,2e-06,-4e-06,-1e-06,-2e-06,3e-06,-3e-06,8e-06,0,-1e-06,1e-06,-2e-06
1e-06,-3e-06,-1e-06,-1e-06,-1e-06,1e-06,-1e-06,0,0,-1e-06,-4e-06,1e-06,-3e-06,1e-06,1e-06,-1e-06,1e-06,3e-06,0,1e-06,2e-06,-2e-06,2e-06,0,4e-06,-4e-06,4e-06,-1e-06,-3e-06,1e-06,0,2e-06,-7e-06,-1e-06,-1e-06,6e-06,-5e-06,0,1e-06,-7e-06,1e-06,3e-06,-1e-06,2e-06,-1e-06,1e-06,0,4e-06,3e-06,-3e-06,5e-06,-3e-06,0,2e-06,1e-06,6e-06,5e-06,1e-06,0,5e-06,6e-06,2e-06,-2e-06,-5e-06,4e-06,0,5e-06,4e-06,1e-05,1e-06,-4e-06,8e-06,2e-06,1e-05,-1e-06,0,-2e-06,6e-06,0,0,-7e-06,0,-1e-06,2e-06,-4e-06,0,9e-06,-1e-06,-5e-06,-1.2e-05,0,4e-06,3e-06,-4e-06,-3e-06,1.2e-05,-1e-06,4e-06,-4e-06,-3e-06,-2e-06,-2e-06,0,0,1.6e-05,-3e-06,2e-06,1e-06,0,2e-06,0,-7e-06,-4e-06,1e-06,-3e-06,0,-8e-06,8e-06,-2e-06,-1e-06,0
-4e-06,2e-06,1e-06,0,2e-06,-2e-06,0,1e-06,-1e-06,1e-06,-1e-06,-4e-06,1e-06,2e-06,-1e-06,0,0,1e-06,0,-2e-06,0,-2e-06,1e-06,1e-06,-1e-06,-1e-06,-4e-06,4e-06,2e-06,-2e-06,-4e-06,-2e-06,3e-06,2e-06,-1e-06,-4e-06,2e-06,-2e-06,-1e-06,7e-06,3e-06,-1e-06,-2e-06,-4e-06,-2e-06,-1e-06,2e-06,2e-06,-1e-06,-2e-06,-5e-06,-2e-06,-1e-06,-1e-06,0,-2e-06,-3e-06,-2e-06,1e-06,0,-3e-06,-7e-06,-3e-06,1e-06,-8e-06,-9e-06,1e-06,-1e-06,-5e-06,2e-06,5e-06,-2e-06,-1.1e-05,-7e-06,-2e-06,2e-06,-2e-06,1e-06,3e-06,-4e-06,-3e-06,0,-1e-06,2e-06,7e-06,-3e-06,-3e-06,0,7e-06,1e-06,4e-06,2e-06,-4e-06,-2e-06,-2e-06,2e-06,8e-06,0,0,-1e-06,-1.2e-05,3e-06,4e-06,0,0,-4e-06,-1e-05,1e-06,-2e-06,-5e-06,2e-06,1e-06,1e-06,0,3e-06,0,7e-06,1e-06,1e-06,1e-06,1e-06
0,0,1e-06,-1e-06,-2e-06,1e-06,0,0,1e-06,1e-06,0,1e-06,-2e-06,-3e-06,1e-06,0,2e-06,0,0,2e-06,3e-06,0,0,1e-06,-2e-06,-5e-06,4e-06,3e-06,-7e-06,2e-06,4e-06,-3e-06,-8e-06,-5e-06,3e-06,-1e-06,1e-06,2e-06,2e-06,-3e-06,-3e-06,-3e-06,1e-06,6e-06,1e-06,1e-06,1e-06,3e-06,-1e-06,2e-06,-1e-06,1e-06,2e-06,1e-06,-1e-06,-2e-06,-4e-06,-1e-06,0,-3e-06,3e-06,1e-06,3e-06,1e-06,8e-06,-1e-06,3e-06,6e-06,-5e-06,-1e-06,-3e-06,-5e-06,1e-06,1e-06,-1e-06,-2e-06,2e-06,-1e-06,-3e-06,2e-06,0,1e-06,1e-06,3e-06,1e-06,1e-06,-1e-06,-4e-06,-1e-06,5e-06,-5e-06,-1e-06,7e-06,3e-06,0,-1e-05,-2e-06,-2e-06,2e-06,2e-06,9e-06,-2e-06,1e-06,-2e-06,-1.1e-05,0,1e-05,0,2e-06,-3e-06,2e-06,-5e-06,0,1e-06,-2e-06,-1e-06,-3e-06,-3e-06,1e-06,-3e-06,-1e-06
0,-4e-06,-1e-06,1e-06,0,-1e-06,0,-1e-06,-1e-06,-1e-06,4e-06,2e-06,-1e-06,3e-06,0,-2e-06,0,1e-06,0,0,3e-06,-4e-06,-1e-06,1e-06,5e-06,4e-06,-4e-06,1e-06,0,-2e-06,-4e-06,2e-06,3e-06,-1e-06,-2e-06,-1e-06,-3e-06,0,-2e-06,3e-06,-1e-06,-1e-06,-1e-06,-5e-06,2e-06,-1e-06,-1e-06,5e-06,-2e-06,1e-06,6e-06,-4e-06,-1e-06,0,2e-06,-3e-06,2e-06,1e-06,0,2e-06,2e-06,3e-06,0,0,-8e-06,5e-06,-3e-06,1e-06,7e-06,-3e-06,-2e-06,5e-06,2e-06,1e-06,2e-06,0,-1e-06,-3e-06,1e-06,1e-06,5e-06,-2e-06,-2e-06,-1e-06,-5e-06,3e-06,-6e-06,3e-06,-2e-06,5e-06,3e-06,4e-06,-3e-06,-2e-06,0,3e-06,-1e-06,2e-06,2e-06,-3e-06,-6e-06,0,0,3e-06,8e-06,2e-06,-8e-06,3e-06,0,1e-05,3e-06,1e-06,-1e-06,0,-3e-06,-2e-06,4e-06,-5e-06,-1e-06,3e-06,1e-06
-4e-06,4e-06,1e-06,0,-2e-06,0,0,-1e-06,1e-06,-2e-06,4e-06,0,2e-06,-1e-06,0,-1e-06,-2e-06,-2e-06,0,0,2e-06,4e-06,1e-06,0,-4e-06,2e-06,4e-06,-3e-06,-1e-06,2e-06,0,0,2e-06,3e-06,1e-06,2e-06,1e-06,-3e-06,3e-06,-6e-06,0,0,1e-06,3e-06,-2e-06,0,3e-06,-7e-06,2e-06,-2e-06,-3e-06,1e-06,-1e-06,-2e-06,-2e-06,2e-06,-2e-06,1e-06,0,-2e-06,-3e-06,1e-06,-1e-06,-1e-06,6e-06,4e-06,-2e-06,-6e-06,-2e-06,6e-06,7e-06,-1e-06,-1e-06,-4e-06,-2e-06,0,0,2e-06,0,-1e-06,-1e-06,2e-06,2e-06,-3e-06,-1e-06,-3e-06,4e-06,-6e-06,-1e-06,-7e-06,-2e-06,-3e-06,2e-06,3e-06,0,6e-06,-4e-06,-2e-06,-4e-06,-1e-06,3e-06,-2e-06,-1e-06,-4e-06,-2e-06,1e-06,0,0,1e-06,-6e-06,2e-06,1e-06,0,2e-06,4e-06,0,-6e-06,2e-06,0,-3e-06,-1e-06
-1e-06,-2e-06,2e-06,0,0,0,0,-1e-06,0,1e-06,1e-06,-2e-06,-1e-06,-2e-06,-1e-06,-2e-06,2e-06,-2e-06,0,-1e-06,2e-06,1e-06,0,1e-06,2e-06,0,-4e-06,0,-1e-06,-2e-06,1e-06,-1e-06,-4e-06,-5e-06,-1e-06,-5e-06,-2e-06,0,-2e-06,3e-06,-2e-06,0,-2e-06,-5e-06,2e-06,0,3e-06,6e-06,0,0,-1e-06,0,-1e-06,1e-06,3e-06,2e-06,0,-1e-06,0,-1e-06,2e-06,-2e-06,-2e-06,0,-2e-06,-3e-06,-3e-06,3e-06,4e-06,-5e-06,-4e-06,-3e-06,6e-06,6e-06,0,0,0,-1e-06,0,-1e-06,-1e-06,-1e-06,0,-1e-06,4e-06,-3e-06,-5e-06,5e-06,1e-06,-1e-06,-1e-06,1e-06,-1e-06,0,3e-06,-8e-06,6e-06,1e-06,1e-06,-1e-06,8e-06,-1e-06,-3e-06,6e-06,-1e-06,0,5e-06,-1e-06,-3e-06,0,2e-06,1e-06,1e-06,0,0,1e-06,6e-06,5e-06,0,-1e-06,1e-06
0,-1e-06,-2e-06,-1e-06,-2e-06,0,0,-1e-06,0,2e-06,-2e-06,0,1e-06,1e-06,0,0,0,-1e-06,0,1e-06,1e-06,3e-06,-1e-06,0,2e-06,0,5e-06,3e-06,-3e-06,2e-06,2e-06,-2e-06,5e-06,1e-06,1e-06,4e-06,4e-06,0,1e-06,1e-06,3e-06,-1e-06,2e-06,6e-06,1e-06,0,-1e-06,-9e-06,-1e-06,2e-06,1e-06,0,0,0,-2e-06,1e-06,1e-06,0,0,1e-06,-3e-06,0,3e-06,2e-06,-2e-06,-6e-06,0,1e-06,-6e-06,2e-06,0,4e-06,1e-06,-5e-06,1e-06,0,-1e-06,3e-06,0,1e-06,-4e-06,1e-06,0,-1e-06,-2e-06,3e-06,9e-06,-1e-06,2e-06,4e-06,2e-06,-1e-06,1e-06,0,3e-06,0,-7e-06,1e-06,2e-06,1e-06,-1e-05,3e-06,0,-4e-06,2e-06,-1e-06,-9e-06,1e-06,1e-06,-1e-06,2e-06,5e-06,2e-06,-1e-06,-3e-06,0,-6e-06,1e-06,0,1e-06,0
-3e-06,2e-06,0,0,0,0,0,-1e-06,1e-06,-1e-06,-3e-06,2e-06,-1e-06,-1e-06,0,0,0,-1e-06,0,-1e-06,1e-06,0,0,-1e-06,0,0,-5e-06,2e-06,-3e-06,-2e-06,-1e-06,2e-06,-5e-06,3e-06,1e-06,-2e-06,-4e-06,1e-06,-1e-06,-2e-06,0,0,-2e-06,-6e-06,-2e-06,0,2e-06,3e-06,1e-06,0,-1e-06,0,-1e-06,0,1e-06,-1e-06,-1e-06,1e-06,0,-3e-06,-1e-06,-1e-06,-2e-06,-1e-06,5e-06,1e-06,0,-2e-06,0,2e-06,5e-06,-2e-06,-2e-06,1e-06,-1e-06,0,-1e-06,-3e-06,0,1e-06,2e-06,-2e-06,1e-06,2e-06,-3e-06,2e-06,-8e-06,2e-06,-1e-06,0,0,-1e-06,-3e-06,0,1e-06,8e-06,5e-06,-2e-06,-4e-06,-2e-06,5e-06,-2e-06,0,5e-06,2e-06,-1e-06,6e-06,1e-06,0,0,1e-06,-1e-06,0,0,2e-06,-1e-06,4e-06,-4e-06,0,0,0
-1e-06,-1e-06,0,0,-2e-06,0,0,-1e-06,-1e-06,-1e-06,1e-06,0,0,0,0,0,-1e-06,-1e-06,0,0,1e-06,3e-06,0,0,-1e-06,-2e-06,5e-06,-3e-06,1e-06,2e-06,0,0,2e-06,-3e-06,-3e-06,3e-06,2e-06,0,0,2e-06,-1e-06,0,0,4e-06,-1e-06,-1e-06,1e-06,-4e-06,0,-2e-06,3e-06,-2e-06,0,0,0,-2e-06,0,0,0,1e-06,0,0,0,-1e-06,-6e-06,6e-06,0,3e-06,5e-06,-5e-06,-4e-06,-2e-06,-4e-06,2e-06,1e-06,0,1e-06,0,0,0,5e-06,1e-06,-1e-06,1e-06,2e-06,-1e-06,1e-05,-2e-06,-1e-06,-2e-06,-2e-06,3e-06,0,-2e-06,-2e-06,-6e-06,0,2e-06,1e-06,-1e-06,-1e-06,2e-06,1e-06,-2e-06,-5e-06,-1e-06,-2e-06,0,-1e-06,1e-06,1e-06,-1e-06,0,-1e-06,1e-06,0,-5e-06,-5e-06,0,-2e-06,0
1e-06,0,0,0,0,0,0,0,1e-06,1e-06,3e-06,-2e-06,1e-06,-2e-06,0,0,1e-06,2e-06,0,0,-1e-06,-4e-06,0,-1e-06,1e-06,0,-5e-06,-2e-06,-3e-06,-2e-06,-2e-06,-1e-06,5e-06,2e-06,1e-06,-3e-06,-1e-06,-2e-06,0,-2e-06,1e-06,1e-06,-1e-06,-4e-06,0,1e-06,-1e-06,4e-06,0,1e-06,-2e-06,0,1e-06,1e-06,0,1e-06,-1e-06,-1e-06,0,0,-1e-06,0,-1e-06,0,6e-06,0,1e-06,-3e-06,-2e-06,6e-06,1e-06,4e-06,-1e-06,-4e-06,0,-1e-06,-1e-06,2e-06,1e-06,-1e-06,-1e-06,0,0,1e-06,2e-06,-2e-06,-6e-06,0,-1e-06,1e-06,1e-06,-4e-06,-3e-06,-1e-06,-4e-06,-3e-06,0,-2e-06,1e-06,0,-1e-06,-1e-06,2e-06,2e-06,0,-1e-06,-4e-06,1e-06,-1e-06,0,0,0,-1e-06,-2e-06,-3e-06,1e-06,6e-06,2e-06,0,2e-06,0
-2e-06,1e-06,-1e-06,0,0,0,0,0,-1e-06,0,3e-06,0,-2e-06,2e-06,0,-1e-06,0,-2e-06,0,-1e-06,0,1e-06,0,0,2e-06,0,5e-06,2e-06,0,2e-06,3e-06,-1e-06,-3e-06,2e-06,-1e-06,4e-06,1e-06,1e-06,-1e-06,3e-06,-3e-06,1e-06,0,5e-06,0,-1e-06,1e-06,2e-06,0,1e-06,-2e-06,0,-1e-06,-1e-06,1e-06,2e-06,1e-06,0,0,-1e-06,2e-06,0,3e-06,0,-5e-06,-4e-06,-2e-06,-2e-06,2e-06,-5e-06,0,-2e-06,0,4e-06,0,0,0,-1e-06,-1e-06,0,-2e-06,0,0,0,-1e-06,0,5e-06,-1e-06,3e-06,3e-06,2e-06,1e-06,2e-06,0,-1e-06,9e-06,-4e-06,2e-06,-1e-06,-1e-06,7e-06,0,-1e-06,1e-06,5e-06,0,7e-06,1e-06,2e-06,1e-06,0,-4e-06,-2e-06,0,1e-06,0,-6e-06,4e-06,0,-1e-06,0
-1e-06,-1e-06,1e-06,0,0,0,0,0,0,-1e-06,-1e-06,2e-06,1e-06,0,0,-1e-06,-1e-06,1e-06,0,0,-1e-06,-4e-06,0,-1e-06,-1e-06,0,-5e-06,2e-06,-4e-06,-2e-06,-1e-06,0,5e-06,-2e-06,1e-06,-3e-06,-1e-06,1e-06,2e-06,-2e-06,3e-06,-1e-06,0,-5e-06,0,1e-06,0,1e-06,-1e-06,-1e-06,3e-06,1e-06,0,0,-1e-06,1e-06,-1e-06,0,0,1e-06,0,0,-3e-06,0,2e-06,-2e-06,0,2e-06,-4e-06,3e-06,-3e-06,-3e-06,1e-06,-4e-06,1e-06,0,0,0,0,1e-06,-2e-06,0,-1e-06,-2e-06,0,1e-06,-8e-06,-2e-06,-1e-06,-5e-06,-2e-06,-1e-06,-1e-06,-1e-06,-1e-06,-3e-06,3e-06,-1e-06,-1e-06,-1e-06,-6e-06,0,0,-2e-06,-2e-06,2e-06,-8e-06,-1e-06,0,-2e-06,-1e-06,-1e-06,0,0,2e-06,-1e-06,6e-06,2e-06,0,0,0
1e-06,0,0,0,1e-06,0,0,-1e-06,0,-1e-06,-4e-06,0,0,-1e-06,0,-1e-06,0,-1e-06,0,-1e-06,-1e-06,0,0,0,2e-06,1e-06,5e-06,-2e-06,-1e-06,2e-06,-2e-06,1e-06,-4e-06,2e-06,0,1e-06,-1e-06,0,-2e-06,0,-1e-06,1e-06,-1e-06,4e-06,0,0,-3e-06,2e-06,1e-06,-1e-06,-2e-06,2e-06,1e-06,-1e-06,1e-06,-2e-06,0,0,0,-1e-06,0,1e-06,1e-06,-1e-06,0,3e-06,0,-1e-06,1e-06,-2e-06,3e-06,4e-06,4e-06,1e-06,-1e-06,0,-2e-06,0,0,0,3e-06,0,0,-1e-06,1e-06,-1e-06,5e-06,1e-06,1e-06,0,2e-06,0,1e-06,0,-1e-06,-7e-06,1e-06,0,3e-06,-2e-06,2e-06,-1e-06,-1e-06,2e-06,-2e-06,1e-06,4e-06,2e-06,-1e-06,1e-06,-1e-06,-2e-06,0,-1e-06,-2e-06,0,-5e-06,-4e-06,0,1e-06,0
-2e-06,0,0,0,1e-06,-1e-06,0,-1e-06,0,1e-06,-2e-06,-2e-06,-1e-06,2e-06,0,-1e-06,0,1e-06,0,0,-1e-06,-1e-06,0,1e-06,-2e-06,1e-06,-5e-06,-3e-06,1e-06,-2e-06,3e-06,-2e-06,-2e-06,0,-1e-06,-2e-06,2e-06,-1e-06,3e-06,1e-06,1e-06,2e-06,1e-06,-4e-06,1e-06,-1e-06,0,-1e-06,1e-06,1e-06,0,1e-06,0,1e-06,-1e-06,-2e-06,2e-06,-1e-06,0,0,1e-06,-1e-06,0,1e-06,-3e-06,5e-06,1e-06,1e-06,3e-06,2e-06,0,-1e-06,0,2e-06,0,0,1e-06,0,0,-1e-06,1e-06,0,0,0,0,-1e-06,-6e-06,-2e-06,-1e-06,3e-06,-1e-06,1e-06,-2e-06,0,-1e-06,7e-06,-1e-06,1e-06,-1e-06,0,-1e-06,1e-06,-1e-06,-3e-06,2e-06,0,1e-06,1e-06,2e-06,1e-06,-1e-06,1e-06,0,2e-06,1e-06,1e-06,6e-06,-4e-06,0,-1e-06,-1e-06
-2e-06,0,-1e-06,0,1e-06,0,0,0,0,0,1e-06,0,1e-06,-1e-06,0,0,1e-06,1e-06,0,0,-2e-06,4e-06,0,0,-1e-06,0,5e-06,0,-4e-06,2e-06,-2e-06,1e-06,3e-06,-1e-06,2e-06,4e-06,-2e-06,0,-3e-06,-2e-06,0,0,-1e-06,5e-06,0,1e-06,0,0,-1e-06,0,2e-06,0,0,-2e-06,1e-06,1e-06,-1e-06,0,0,1e-06,-1e-06,0,2e-06,0,5e-06,-1e-06,1e-06,1e-06,-4e-06,-4e-06,-4e-06,-2e-06,-2e-06,-3e-06,1e-06,0,0,1e-06,0,0,-1e-06,-1e-06,0,0,-1e-06,0,8e-06,2e-06,1e-06,2e-06,0,-1e-06,3e-06,0,2e-06,2e-06,0,-1e-06,-1e-06,-2e-06,-4e-06,-1e-06,2e-06,2e-06,1e-06,-1e-06,-6e-06,-1e-06,0,0,-2e-06,3e-06,1e-06,1e-06,1e-06,0,-6e-06,1e-06,0,-1e-06,1e-06
