7.6e-05,5e-05,-6.6e-05,6.7e-05,1.4e-05,-2.7e-05,0.000219,0.000186,0.000268,0.000118,3.5e-05,-7.2e-05,3.7e-05,4.4e-05,-1.8e-05,0.000179,0.000228,2.9e-05,4.7e-05,-8e-06,9.2e-05,2.2e-05,2.4e-05,4.4e-05,4.8e-05,-4.9e-05,-2e-05,-6.6e-05,-2.4e-05,0.000139,0.000181,-1e-06,-1.7e-05,-8e-06,-2.5e-05,0.00028,0.000198,0.000153,6.4e-05,-1.9e-05,2.9e-05,0.000168,0.000143,0.000182,5.2e-05,8.8e-05,0.000111,0.00025,5.9e-05,-0.000117,-0.000103,9.2e-05,1.8e-05,0.000153,2.2e-05,1.6e-05,2.9e-05,5.4e-05,-5.6e-05,0.000113,0.000229,0.000119,0.00018,0.000238,-4.1e-05,5.3e-05,0.000142,0.000144,9.3e-05,-2.4e-05,3.9e-05,1e-04,3.6e-05,0.000157,-1.2e-05,-0.000122,-6.4e-05,3.5e-05,2e-06,-8e-05,-4e-05,-3e-05,0,3e-04,0.000249,0.00016,-3.3e-05,3.2e-05,8.4e-05,-6.8e-05,0.000155,5.2e-05,0.000127,0.000141,6.9e-05,3.3e-05,4.4e-05,3.9e-05,0.000154,0.000175,7.2e-05,-6e-05,0.00012,0.000169,2.2e-05,0.000123,0.000161,-2.2e-05,0.000161,4.1e-05,0.000122,2.3e-05,-2.1e-05,2.6e-05,-6e-05,0.00016,6.3e-05,8.8e-05,2.9e-05,4.4e-05,7e-05
-0.000125,-5.5e-05,8e-06,-0.000173,-0.000164,-0.00023,-0.000106,-0.00023,-0.000162,-1.9e-05,8e-06,9.3e-05,-8.7e-05,-3.2e-05,-4.1e-05,-6.5e-05,-0.000266,-0.000244,-2.3e-05,-8e-06,-0.000211,-5.9e-05,-6.1e-05,-0.000121,-4.1e-05,-2.8e-05,9e-06,-0.000133,-7.7e-05,-0.000121,-0.000254,-0.000137,-7.4e-05,-8.8e-05,-3.7e-05,-0.000176,-7.2e-05,-0.000238,-0.000161,-4.7e-05,-4.8e-05,-7e-05,-0.000237,-9.1e-05,-7.6e-05,-5.6e-05,-0.000126,-0.000474,-0.000307,-0.000123,1.5e-05,-0.000143,-8.7e-05,-7e-06,2e-05,-5.6e-05,-5.3e-05,-0.000139,2.2e-05,-0.000211,-0.000234,-0.000149,3.6e-05,-5.9e-05,5.1e-05,-2.9e-05,2e-05,0.000153,3.5e-05,3e-05,-9.7e-05,1.8e-05,1e-05,4e-06,-0.000131,-0.000137,-9.4e-05,-1e-05,-7e-06,-1.6e-05,-0.000193,-8.3e-05,-2e-05,1.9e-05,3.7e-05,4.1e-05,-2.8e-05,-1.1e-05,-4.4e-05,-0.000158,-0.000152,-0.000318,-0.000188,-0.00019,-3.4e-05,-1.3e-05,-3.5e-05,1.9e-05,-0.000197,-0.000158,-9.5e-05,-2.5e-05,7e-05,-9.6e-05,-6.7e-05,-0.000244,-0.000362,-0.000208,-0.000253,-0.000114,0,-2.1e-05,-4e-05,-7.6e-05,3.5e-05,-8.2e-05,1.9e-05,-2.2e-05,-1e-05,1.4e-05,1e-05
-0.000207,-0.000124,-0.000105,-0.000116,-0.000252,1.7e-05,-0.000124,-0.000106,-0.00017,-0.000131,1.3e-05,1.4e-05,-0.000125,-8.8e-05,-6e-06,-1.7e-05,8e-06,0.000105,-4.4e-05,-4.5e-05,-5.8e-05,-0.000109,-0.000133,-1e-06,-0.000123,-5.2e-05,-6.9e-05,0.00011,8.8e-05,-0.000141,-0.000221,-7.5e-05,2.1e-05,-6.3e-05,-7.6e-05,-0.000152,-0.000145,-8.5e-05,-0.000117,-9.5e-05,-5.6e-05,-0.000172,-0.000161,-1.6e-05,-9.7e-05,-0.000237,1.8e-05,-8.1e-05,-0.000147,-4.2e-05,-8e-05,-0.000167,-7.7e-05,-2e-05,-0.000146,-0.000104,-0.000227,-2.9e-05,1.8e-05,-0.000174,-0.00026,-1.8e-05,5e-06,-6.7e-05,-1.5e-05,-7.6e-05,-0.000108,-8e-06,-9.5e-05,-5e-05,-0.000121,-0.000109,4.4e-05,-3.6e-05,-0.000169,-1.4e-05,2e-06,-5e-06,9e-06,3.5e-05,2.2e-05,-8.6e-05,-1.5e-05,-0.000183,-7.5e-05,-1.8e-05,-2.4e-05,-0.000144,-9.7e-05,-6.6e-05,-5.1e-05,-0.000163,-0.000144,-0.000171,-9.7e-05,3e-06,-4.9e-05,-8.8e-05,-0.00017,-0.000148,-5.7e-05,6.2e-05,-9e-05,-7.4e-05,-8.9e-05,-0.000156,-0.000176,-2.2e-05,-0.000152,-0.000236,-5.3e-05,-0.000142,-9.5e-05,-8.5e-05,-8.4e-05,-0.000113,-0.000213,-0.000187,-0.000139,-9.8e-05,-0.00019
1.5e-05,-9.6e-05,-2.8e-05,6.4e-05,0.000301,0.000179,-1.8e-05,0.000121,0.000184,5e-06,-3.8e-05,-4.9e-05,2.2e-05,-0.000145,5.3e-05,-8.3e-05,0.000186,3.9e-05,-1.7e-05,-1.5e-05,9.4e-05,5.9e-05,0.000112,6.1e-05,2.9e-05,-3e-06,-7e-06,1e-05,-1e-06,-1e-05,3.6e-05,4.9e-05,1e-06,-3.4e-05,-4.6e-05,-3.6e-05,-5.7e-05,0.000141,0.000174,0.000102,6.4e-05,-5.6e-05,9.3e-05,-4.4e-05,5.9e-05,2.2e-05,-3e-06,1.6e-05,0.000154,-4e-06,-5.9e-05,-2.4e-05,1.8e-05,6e-06,-4e-06,4.5e-05,2.6e-05,8.2e-05,2.5e-05,7e-06,4.6e-05,-1.7e-05,-2.2e-05,8e-05,6.3e-05,-3.1e-05,3.2e-05,-4.7e-05,-1.4e-05,-2.2e-05,-3.5e-05,-2.2e-05,-0.000122,-1.8e-05,0.000111,0.000178,1e-04,8e-06,6.5e-05,5e-05,9.9e-05,8.2e-05,2.1e-05,-0.000117,4.3e-05,3.1e-05,-1.8e-05,-8.6e-05,-9.6e-05,0.000168,0.000108,6.5e-05,4.5e-05,-0.000133,-5e-05,-4.5e-05,-6.2e-05,-4.1e-05,-6e-06,4.5e-05,-1.9e-05,-1.1e-05,-0.000104,-6.4e-05,-5.6e-05,4.5e-05,8.1e-05,0.000198,6.8e-05,6.6e-05,-1e-05,-5.3e-05,-2.3e-05,5.8e-05,4.7e-05,8.4e-05,-8e-06,1.3e-05,0.000204,1.7e-05,-6.7e-05
0.000132,3.3e-05,4.5e-05,1e-06,-7.2e-05,-0.000137,2e-05,9e-05,0.000105,-9.3e-05,-1e-06,-9e-06,-2.6e-05,0.000136,-7.5e-05,-3.8e-05,-6.3e-05,-0.000108,-3.1e-05,3e-05,-2.4e-05,-7.8e-05,-5.4e-05,-1.8e-05,-2.5e-05,1.9e-05,0.000117,-9.1e-05,-1e-04,0.000103,6.1e-05,1.1e-05,2.7e-05,8.5e-05,5.1e-05,3.8e-05,-4e-06,1.7e-05,6.3e-05,-1e-06,3.6e-05,-0.000127,-5.7e-05,-6.3e-05,4.7e-05,6.7e-05,-3.6e-05,0.000116,0.000108,1.4e-05,-2.8e-05,2.6e-05,4.4e-05,-3.5e-05,-6e-05,-2.5e-05,2e-05,-1.8e-05,4.1e-05,-1.1e-05,0.000183,0.00012,1e-06,5.1e-05,8.3e-05,-5.9e-05,6e-06,-4.6e-05,-3.7e-05,5.6e-05,4.6e-05,8.1e-05,4.4e-05,0.000113,4.4e-05,-9.5e-05,-7.3e-05,-1e-06,-3.8e-05,4.1e-05,3.8e-05,3e-06,9e-06,5.1e-05,1.3e-05,-0.00019,4.8e-05,0.000158,0.000163,-4.9e-05,-6e-06,0.000206,0.000171,0.000189,0.000112,-2.1e-05,9.2e-05,0.000151,7.7e-05,0.000117,-5.6e-05,-7.7e-05,-6.9e-05,-8.8e-05,5.5e-05,2.1e-05,0.000166,-3.6e-05,2.5e-05,0.000102,5.5e-05,4e-05,3.4e-05,4.9e-05,2.4e-05,0.000123,6.2e-05,-3e-06,-4.7e-05,5e-05,2.6e-05
-3.2e-05,6.4e-05,6.2e-05,-2.9e-05,-0.000117,-3.1e-05,-2.9e-05,-0.000167,-6.3e-05,-1.7e-05,2.7e-05,-5.4e-05,6.8e-05,1.5e-05,-2.6e-05,3e-06,-7e-05,-7.2e-05,7e-06,0.000108,-1.2e-05,5.1e-05,-5e-06,-8.1e-05,7.2e-05,5.8e-05,-1e-04,8.2e-05,9e-06,2e-05,3.9e-05,-5.4e-05,-3.2e-05,-6.2e-05,2e-05,-1.4e-05,6e-05,3.4e-05,-0.000134,2.2e-05,-2.4e-05,-1.3e-05,-3.3e-05,-4.1e-05,-0.000109,-1.2e-05,8.9e-05,0.000144,-2e-05,5e-05,8.6e-05,1.8e-05,-8e-06,2.8e-05,3.2e-05,1e-05,5.8e-05,4.2e-05,6e-06,4.1e-05,-5.3e-05,6e-06,-5.9e-05,-6e-06,2.3e-05,7.7e-05,3.3e-05,-8e-05,-2.9e-05,-1.6e-05,7e-06,5.7e-05,-3e-05,-4.7e-05,-4e-06,1.6e-05,4.2e-05,-2.7e-05,4.1e-05,-1.2e-05,-2e-06,-7.9e-05,-2e-06,4.8e-05,-8.8e-05,-6.9e-05,-5.3e-05,-2.2e-05,4.1e-05,-4.2e-05,-9.9e-05,-9.4e-05,4e-05,9.9e-05,1.2e-05,9e-06,3e-05,4.7e-05,-4.6e-05,-2.7e-05,-1.3e-05,5.6e-05,7.8e-05,4.1e-05,7e-06,-1e-05,-3.3e-05,-0.000133,-0.000113,2e-05,6.4e-05,4.9e-05,6.9e-05,-1.8e-05,3.8e-05,1.1e-05,4e-06,9.7e-05,-5.8e-05,2.9e-05,1.7e-05
-1.4e-05,5.8e-05,4.3e-05,-1.9e-05,-3.4e-05,1e-06,-1.5e-05,-5.3e-05,-0.00011,-4.5e-05,3.4e-05,0,-5e-06,0,-6e-05,0.000101,-1.3e-05,4.6e-05,-4.2e-05,1.1e-05,-3.8e-05,0.000105,-6.9e-05,-7.1e-05,-5.4e-05,1.3e-05,5e-06,4.5e-05,4e-05,-1.4e-05,-6.7e-05,-7e-06,8e-06,8e-06,5e-05,-5.8e-05,0.000134,5.5e-05,-3.4e-05,-2.4e-05,1.2e-05,7e-05,-3.2e-05,-7e-06,-9e-06,-8.6e-05,-1e-06,-8.9e-05,-5.9e-05,-6e-06,3.6e-05,1.3e-05,-6.5e-05,1.5e-05,-2.4e-05,-1.9e-05,-4.2e-05,-2.1e-05,-2.9e-05,-6.6e-05,-0.000138,-0.000146,-2.2e-05,-1e-04,-1.2e-05,-0.00011,-9.6e-05,-6.5e-05,-8.1e-05,-1.7e-05,-4e-06,-3.3e-05,-1e-05,5e-06,-5.5e-05,-3.8e-05,6.2e-05,7e-06,6e-06,-5.6e-05,-0.000108,-2.9e-05,6.8e-05,-4.1e-05,-5.5e-05,-5e-05,-6.6e-05,-2.7e-05,-2.3e-05,-1.6e-05,6.5e-05,-3.3e-05,-0.000161,-7.8e-05,-9e-06,-5.2e-05,-4.5e-05,5.8e-05,-4.5e-05,-6.4e-05,6.5e-05,5.6e-05,-4.9e-05,-1e-06,-8.7e-05,-0.000117,-0.000151,-2e-05,8.1e-05,-0.000105,-0.000121,-3.1e-05,-1.6e-05,-7.5e-05,-9.2e-05,-3.6e-05,-7e-05,-1.8e-05,-6.1e-05,-6e-06,1.7e-05
-6.1e-05,-8.6e-05,-8.2e-05,-1.2e-05,4.8e-05,0.000148,2.4e-05,-5.1e-05,-5e-06,1.3e-05,3.8e-05,-3e-06,2.4e-05,-6.6e-05,2e-05,8e-06,-1.5e-05,5e-06,1.7e-05,-4.1e-05,-4.3e-05,-3.8e-05,5.8e-05,4.2e-05,-4.8e-05,-0.000107,-4.1e-05,3.8e-05,-2.6e-05,2.1e-05,-8.1e-05,-1.8e-05,5e-05,2e-05,-8.4e-05,-3.4e-05,-3.4e-05,-5.1e-05,1.1e-05,-1.7e-05,-3.7e-05,-3.3e-05,2.5e-05,-1.9e-05,-9.9e-05,3.8e-05,-6.1e-05,1.8e-05,-1.6e-05,-6.8e-05,-5.6e-05,1.8e-05,5.6e-05,-2.9e-05,5e-06,7.4e-05,-4e-05,-2.5e-05,2.8e-05,5.5e-05,-1e-05,-8.2e-05,0,-6.5e-05,-5e-05,-1e-05,-7.9e-05,6e-06,-5e-06,-2.9e-05,-1.8e-05,2e-06,3.2e-05,5.8e-05,0,5.1e-05,-1.4e-05,4e-06,-4.8e-05,-1.7e-05,3.9e-05,1.8e-05,-3.5e-05,6e-06,-2e-06,5e-06,-6.7e-05,-1.6e-05,-5.7e-05,-8e-06,2.6e-05,6.1e-05,2.1e-05,-8e-06,1.6e-05,-2.2e-05,2.2e-05,-2e-05,-7.6e-05,-4.6e-05,-1e-06,2.5e-05,1.2e-05,8e-06,-5.1e-05,2e-05,-2e-06,3.2e-05,5.6e-05,-3.3e-05,-4.4e-05,1.5e-05,0,-8e-06,-7.1e-05,-3.3e-05,-8.6e-05,-9e-05,-2.9e-05,3.8e-05,-3.8e-05
2.8e-05,-3.2e-05,-2.3e-05,2.8e-05,-5.3e-05,-7.7e-05,2.4e-05,5.6e-05,3.3e-05,-4.4e-05,-8.1e-05,-5.3e-05,-8e-06,-2.8e-05,2.6e-05,-1.9e-05,8e-06,-3e-05,-5.8e-05,-2e-06,2.2e-05,-1e-04,-3.9e-05,5e-06,-2.4e-05,-8.6e-05,3e-06,-1.6e-05,2e-06,2.7e-05,9e-06,-9e-06,-1.6e-05,-1.8e-05,1e-06,3.1e-05,-1.7e-05,-5.7e-05,-5e-06,1.3e-05,1.7e-05,-3.7e-05,-8e-06,1e-06,-3.8e-05,-2.9e-05,-0.000115,-6.1e-05,-3e-06,-3.2e-05,-1.6e-05,-5.7e-05,-2.7e-05,-1.1e-05,-2.3e-05,4.1e-05,3e-05,-3.1e-05,-5.8e-05,-4.5e-05,-3.6e-05,-1.9e-05,5e-06,-3.9e-05,-8e-06,-2.2e-05,3e-06,5.3e-05,1e-06,2.1e-05,-2e-05,9e-06,-4.1e-05,1.1e-05,-3e-06,-4.9e-05,-4.2e-05,-2.3e-05,-3e-05,-2.8e-05,-4.2e-05,-2.2e-05,-6e-05,1.6e-05,6.6e-05,-7.6e-05,-5.1e-05,-3.5e-05,-2.2e-05,4.7e-05,-2.1e-05,-1.6e-05,4.5e-05,1.6e-05,-5.7e-05,-3.3e-05,-4.8e-05,-2.3e-05,6.5e-05,-6e-06,-8.5e-05,-1.7e-05,-8e-06,-1.1e-05,1.1e-05,9e-06,1.1e-05,-1e-05,-6.2e-05,-1.9e-05,-1.9e-05,-3e-05,-6.5e-05,-2.1e-05,5.3e-05,-6e-06,8e-06,-3.7e-05,2.1e-05,3.4e-05,-2.9e-05
3e-06,1.5e-05,3e-06,7e-06,4.4e-05,4e-06,-0.000106,2.4e-05,-6.5e-05,-1.5e-05,-2.8e-05,4.5e-05,6e-06,-6e-06,3e-06,4.9e-05,3.5e-05,5.9e-05,-2.1e-05,-1.9e-05,1.3e-05,9e-06,-3.1e-05,1.2e-05,1.1e-05,7.3e-05,1.8e-05,-2.7e-05,4.3e-05,-2.7e-05,6e-06,1.8e-05,-1.5e-05,-4e-06,1.5e-05,-6e-06,-2.3e-05,9e-06,3e-06,5.9e-05,2e-05,1.5e-05,-1.4e-05,8.8e-05,0.00011,4.9e-05,3.1e-05,-4.2e-05,6.2e-05,8.2e-05,1.6e-05,-1e-06,-4e-06,2.3e-05,1e-05,-7e-06,0,7e-06,2.8e-05,2e-05,1.3e-05,6.7e-05,-1.7e-05,-4.5e-05,-7e-06,2e-05,3.8e-05,-4e-05,4e-06,5e-05,2.9e-05,-2.9e-05,-3.8e-05,3.1e-05,-8e-06,-2.4e-05,5.2e-05,-9e-06,-1.8e-05,-2.1e-05,3.5e-05,2.3e-05,-1.2e-05,-4e-06,2.9e-05,5.5e-05,-1.3e-05,7.1e-05,4.6e-05,1e-06,-2.6e-05,-4.1e-05,6e-05,4.9e-05,3.4e-05,6.2e-05,-1.3e-05,-9e-06,-7e-06,4e-06,7e-06,-2e-05,-8e-06,-1.4e-05,1.9e-05,2e-06,-3e-06,8e-06,-1.7e-05,1.1e-05,5.8e-05,4.9e-05,1.2e-05,1.8e-05,-6e-06,-2.1e-05,5e-06,-1.6e-05,2.6e-05,6e-06,7e-06
-3.8e-05,1.2e-05,-2.4e-05,2e-06,-3.7e-05,7e-06,5.7e-05,-3.5e-05,-2.8e-05,-1.2e-05,-1.2e-05,-1.7e-05,9e-06,1.8e-05,-7e-06,-8e-06,1e-05,5e-06,4.1e-05,3e-06,5e-06,-2e-06,3.3e-05,-1.3e-05,-1.4e-05,-3.8e-05,1.1e-05,3.1e-05,-3.5e-05,-1.7e-05,8e-06,-1.6e-05,2.3e-05,-7e-06,-1.4e-05,1.8e-05,2e-06,4.8e-05,2.7e-05,0,1.5e-05,1e-05,3.1e-05,1.2e-05,2.7e-05,-4e-06,2.2e-05,-6e-06,-6e-06,2.2e-05,6e-06,2.2e-05,8e-06,-5e-06,-7e-06,-2.7e-05,-4.3e-05,-1.5e-05,1.7e-05,-8e-06,1.3e-05,-1.6e-05,-7.7e-05,-1.8e-05,0,3e-06,-1.8e-05,-2.2e-05,-6e-06,2e-05,-6e-06,2.2e-05,-9e-06,1.9e-05,-2.5e-05,-6e-06,1.7e-05,1.3e-05,4.6e-05,8e-06,-4e-05,-9e-06,3.6e-05,1.5e-05,-5e-06,4.5e-05,3e-05,-6.9e-05,-3.1e-05,-3.6e-05,5.3e-05,5e-06,-4.3e-05,2.4e-05,-4.4e-05,2.1e-05,-1.4e-05,-6e-06,4e-05,-1.9e-05,3.5e-05,-1e-05,-3e-05,-3e-06,3.9e-05,-8e-06,-8e-06,-1.5e-05,3.1e-05,-3.5e-05,1.3e-05,2.1e-05,-2e-06,2e-05,1e-05,1.4e-05,1.8e-05,2.3e-05,-1.8e-05,-5e-06,1.4e-05
-2.9e-05,6e-06,2.9e-05,-3.6e-05,1.8e-05,1e-06,2.6e-05,4.5e-05,-2.4e-05,1.7e-05,-1.2e-05,-2.6e-05,-1.7e-05,-2.7e-05,-5.3e-05,-7e-06,-2.6e-05,-2.3e-05,4e-06,-3.4e-05,1e-06,0,-7e-06,9e-06,-2.2e-05,1.6e-05,-7.4e-05,-1.1e-05,-1.2e-05,5e-06,-3e-06,-3e-06,4e-05,7e-06,-5e-06,-1.9e-05,-7e-06,5e-06,-3.1e-05,0,-2.2e-05,6e-06,-5e-06,1e-06,-2.5e-05,1.1e-05,2.1e-05,6e-06,2.2e-05,-5.5e-05,-1e-06,-7e-06,1e-05,-1.5e-05,-1e-06,-1.2e-05,3.6e-05,1.3e-05,-4e-06,7e-06,9e-06,-1.1e-05,1.1e-05,2e-05,-1.5e-05,-2.5e-05,1.8e-05,1.5e-05,0,-3.4e-05,-2e-06,-1e-05,2.8e-05,-2.1e-05,-6e-06,8e-06,-3e-06,-8e-06,5e-06,-3e-06,8e-06,1.4e-05,-8e-06,7e-06,-3.2e-05,1e-06,0,-2.9e-05,1.8e-05,3e-06,2e-06,1.9e-05,-1.6e-05,-4.3e-05,-1.1e-05,-4.1e-05,-2.1e-05,-1.3e-05,1.5e-05,9e-06,2.3e-05,-2.6e-05,0,1.4e-05,2.9e-05,-3.5e-05,1.1e-05,-1.4e-05,1.9e-05,4e-05,-3.4e-05,-1.5e-05,-3e-06,-2e-06,-3.9e-05,-3.6e-05,-1.5e-05,-1e-06,-3.8e-05,-5e-06,1.4e-05
-3e-06,-2.9e-05,-1e-05,-1.7e-05,-5e-06,-1e-06,1.3e-05,-1.6e-05,6e-06,-1.2e-05,-1.6e-05,-3.5e-05,-7e-06,3.2e-05,2.9e-05,-2.6e-05,-2.2e-05,-1.3e-05,-1.3e-05,8e-06,-6e-06,-1.5e-05,-2.8e-05,-1.3e-05,5e-06,0,-6e-06,-1.3e-05,-3.2e-05,-2e-05,1.9e-05,1.3e-05,-5.5e-05,-9e-06,-3e-06,-1e-05,-2.6e-05,-1.7e-05,-1e-05,-1.7e-05,-2e-06,-5e-06,-4e-06,-4.2e-05,6e-06,-1.2e-05,-2.2e-05,-1.4e-05,-5e-06,4e-06,-2e-06,4e-06,-2.7e-05,-5.5e-05,-3e-06,-1.2e-05,-1e-06,4e-06,-2.1e-05,1.6e-05,7e-06,2e-06,4.4e-05,1.4e-05,-2e-06,1e-05,1e-05,2e-05,1.6e-05,0,-2e-06,-5e-06,-6e-06,-2.2e-05,-2e-06,2.3e-05,-2.4e-05,-1.4e-05,-1.5e-05,-6e-06,-1e-06,1e-06,-2.1e-05,1.8e-05,-1e-06,-1e-05,2.8e-05,-1.2e-05,-1e-05,-9e-06,1.7e-05,-2.1e-05,1.5e-05,1e-06,-2e-06,-2.8e-05,-1.8e-05,-3e-06,-2.7e-05,-4e-06,-1.4e-05,8e-06,4e-06,-1.6e-05,6e-06,1.9e-05,1.6e-05,-1.1e-05,-2e-05,3.4e-05,-1.6e-05,-2e-05,2e-06,-1.9e-05,1.2e-05,-4e-06,1.8e-05,-3.7e-05,-1.1e-05,-3.5e-05,-1e-05
4e-06,7e-06,-1.1e-05,1.3e-05,-3e-06,-2e-05,-3.7e-05,-3.4e-05,2.6e-05,3e-06,3e-06,3e-06,-1.2e-05,7e-06,5e-06,-2.2e-05,-7e-06,-3e-06,1.5e-05,9e-06,-2e-06,-1.8e-05,1.3e-05,-2e-06,1.9e-05,0,-6e-06,-2e-05,1.8e-05,-8e-06,1.3e-05,-4e-06,-3.2e-05,-5e-06,1.2e-05,-1.1e-05,-2.4e-05,-8e-06,-1e-06,1.4e-05,2.3e-05,-7e-06,-2e-06,-6e-06,6e-06,-1.6e-05,6e-06,-2.2e-05,-1.9e-05,6e-06,-1e-05,4e-06,2.1e-05,1.9e-05,-5e-06,-3e-06,2.4e-05,-3e-06,1e-06,-2.4e-05,-1e-06,1e-06,1.2e-05,6e-06,-1e-05,-5e-06,-1.3e-05,1.8e-05,0,-2.6e-05,2.5e-05,0,-9e-06,-2.6e-05,-1.2e-05,-5e-06,1e-05,-2e-06,1e-06,-8e-06,2e-06,6e-06,9e-06,-2.8e-05,2e-06,-5.6e-05,-5e-06,-2e-05,-7e-06,2.2e-05,-1.1e-05,-3e-06,-2e-05,1.3e-05,6e-06,-1e-05,-2e-06,-4e-06,1.9e-05,1.1e-05,-1.2e-05,4e-06,1.5e-05,4e-06,-1.9e-05,1.2e-05,6e-06,-8e-06,-1.5e-05,-2.1e-05,8e-06,3e-06,0,-9e-06,8e-06,1.5e-05,-2e-06,9e-06,-6e-06,-6e-06,1.5e-05
1.6e-05,8e-06,7e-06,-1e-06,-5e-06,-1.1e-05,2.5e-05,1.2e-05,-3e-06,-5e-06,1e-06,1.1e-05,0,-8e-06,1.1e-05,1.3e-05,-2e-06,1.1e-05,3e-05,-1.6e-05,1e-06,1.9e-05,5e-06,2e-06,-1e-06,1.1e-05,1.4e-05,-1e-05,1.6e-05,8e-06,-1.7e-05,4e-06,0,-1e-06,4e-06,8e-06,1.3e-05,1e-06,-5e-06,-9e-06,8e-06,4e-06,2e-06,-1e-06,-9e-06,1.9e-05,2.6e-05,9e-06,-1e-05,1.3e-05,-3e-06,-8e-06,-5e-06,2.4e-05,4e-06,-1e-06,-5e-06,-2e-06,-3e-06,-6e-06,-5e-06,-1.7e-05,-1.9e-05,-3e-06,1e-06,5e-06,6e-06,3e-06,-2e-06,-1.3e-05,9e-06,1e-06,-1.6e-05,-1.2e-05,3e-06,-1e-06,2.6e-05,8e-06,4e-06,-2e-06,4e-06,8e-06,9e-06,1e-06,5e-06,7e-06,1.3e-05,-2.1e-05,8e-06,-2e-06,-2.5e-05,1.2e-05,-1.1e-05,0,-1e-05,1.8e-05,1.3e-05,1e-06,-9e-06,3e-06,7e-06,-5e-06,-3e-06,3e-06,-8e-06,6e-06,2e-06,-1e-06,-9e-06,-3e-06,1.2e-05,6e-06,2e-06,-3e-06,-4e-06,-1e-06,-1.3e-05,1e-05,1.3e-05,-1e-06,1.5e-05
4e-06,-1.3e-05,-1e-06,1.4e-05,-3e-06,-8e-06,-2e-06,1.6e-05,6e-06,8e-06,5e-06,7e-06,1e-06,-4e-06,2e-06,2e-06,5e-06,7e-06,-7e-06,5e-06,-4e-06,1.7e-05,-3e-06,5e-06,0,-1.4e-05,-5e-06,5e-06,-1.5e-05,3e-06,1e-06,1e-06,9e-06,6e-06,-9e-06,3e-06,0,-4e-06,8e-06,-1.6e-05,-9e-06,1e-06,5e-06,4e-06,-1.3e-05,-6e-06,-2e-06,1.8e-05,-1.1e-05,-1e-06,6e-06,5e-06,-4e-06,-3e-06,-1e-06,-7e-06,1e-06,0,1e-06,1.3e-05,-6e-06,4e-06,-1.2e-05,-1.8e-05,-5e-06,-5e-06,4e-06,-1.6e-05,2e-06,5e-06,1.2e-05,-6e-06,1.2e-05,3e-06,-7e-06,-2e-06,-2e-06,-1e-05,-5e-06,2e-06,-2e-06,4e-06,1.7e-05,5e-06,3e-06,2.4e-05,-1.5e-05,1.6e-05,-8e-06,2e-06,2.3e-05,-5e-06,4e-06,-1e-05,4e-06,8e-06,3e-06,-3e-06,1e-05,7e-06,1.8e-05,-4e-06,-1e-06,-2e-06,-6e-06,3e-06,1e-06,8e-06,1e-05,7e-06,-3e-06,-9e-06,1e-05,2e-06,8e-06,4e-06,3e-06,8e-06,1.2e-05,-1e-05,4e-06
6e-06,-1e-05,1e-06,1e-06,-7e-06,4e-06,-3e-06,-8e-06,-5e-06,-3e-06,8e-06,4e-06,-5e-06,1e-05,-1e-05,-6e-06,5e-06,3e-06,-1e-05,1.4e-05,5e-06,4e-06,5e-06,-2e-06,-5e-06,0,1.7e-05,6e-06,-6e-06,-1e-05,1e-06,-2e-06,5e-06,-1e-06,3e-06,-5e-06,1e-06,-7e-06,2e-06,3e-06,2e-06,6e-06,-4e-06,4e-06,-6e-06,-5e-06,-1.9e-05,7e-06,-5e-06,3e-06,4e-06,-3e-06,3e-06,-2e-06,-1e-06,-9e-06,0,-1e-06,9e-06,-3e-06,1e-06,1e-05,-1e-06,-3e-06,3e-06,2e-06,0,-2e-06,0,3e-06,0,4e-06,1e-06,6e-06,-2e-06,-2e-06,-9e-06,2e-06,-5e-06,0,3e-06,0,-8e-06,-6e-06,-1e-06,4e-06,-1e-05,6e-06,-1.5e-05,-3e-06,1e-06,0,1.7e-05,5e-06,-2e-06,1e-06,1e-06,3e-06,5e-06,0,-2e-06,1e-06,8e-06,1e-06,1e-06,-3e-06,-2e-06,8e-06,5e-06,-1.1e-05,9e-06,1e-06,-5e-06,6e-06,2e-06,0,1e-06,-7e-06,-7e-06,-2e-06,-1e-06
-1e-06,5e-06,-1.1e-05,-7e-06,5e-06,-1e-06,2e-06,1.2e-05,-5e-06,-1e-06,-4e-06,3e-06,0,-8e-06,-2e-06,-2e-06,-1e-06,-6e-06,0,3e-06,0,-7e-06,-1e-06,-2e-06,5e-06,-2e-06,-1.5e-05,-8e-06,-4e-06,6e-06,-4e-06,2e-06,7e-06,0,4e-06,4e-06,2e-06,0,-4e-06,-8e-06,-5e-06,-5e-06,3e-06,-3e-06,1.2e-05,1.4e-05,-2e-06,8e-06,5e-06,1.2e-05,-1e-06,2e-06,3e-06,0,0,-1e-06,-3e-06,-1e-06,-2e-06,-3e-06,-1e-06,4e-06,8e-06,-2e-06,4e-06,1e-06,0,6e-06,1e-06,5e-06,5e-06,0,-1e-06,-5e-06,-1e-06,-2e-06,-8e-06,0,-3e-06,0,-8e-06,6e-06,-4e-06,0,-6e-06,-9e-06,-6e-06,0,9e-06,-8e-06,2e-06,7e-06,-1.5e-05,2e-06,3e-06,-1e-06,-2e-06,0,1e-06,1e-06,-9e-06,1.2e-05,-5e-06,-2e-06,7e-06,-4e-06,1e-06,-8e-06,-5e-06,-1.1e-05,1.6e-05,-1e-06,-2e-06,4e-06,-4e-06,-1e-06,-6e-06,4e-06,0,1e-06,5e-06
-4e-06,1e-06,1e-06,-1e-06,-1e-06,-2e-06,0,-7e-06,-3e-06,-1e-06,0,-4e-06,-2e-06,-5e-06,-2e-06,1e-06,-1e-06,-6e-06,-2e-06,-5e-06,0,1e-06,-6e-06,1e-06,-7e-06,2e-06,5e-06,1e-06,8e-06,2e-06,1e-06,0,-1.2e-05,0,-4e-06,-3e-06,1e-06,5e-06,-3e-06,-2e-06,0,3e-06,-2e-06,-2e-06,1e-05,-9e-06,3e-06,3e-06,1e-06,3e-06,-3e-06,-2e-06,-4e-06,4e-06,-1e-06,5e-06,-4e-06,1e-06,0,0,3e-06,-3e-06,3e-06,0,1e-06,-3e-06,2e-06,7e-06,1e-06,-2e-06,-3e-06,-1e-06,-8e-06,0,-5e-06,-1e-06,-2e-06,-3e-06,5e-06,-1e-06,7e-06,1e-06,2e-06,1e-06,-3e-06,-2e-06,3e-06,5e-06,-4e-06,4e-06,-2e-06,-6e-06,4e-06,-6e-06,3e-06,1e-06,-2e-06,2e-06,6e-06,-3e-06,0,5e-06,-1e-06,2e-06,1.1e-05,-2e-06,1e-06,-4e-06,-4e-06,1.1e-05,-7e-06,0,0,1e-06,-8e-06,-2e-06,-1e-06,4e-06,-1e-05,1e-06,4e-06
-2e-06,-4e-06,6e-06,-1e-06,-4e-06,0,-1.1e-05,-5e-06,-1e-06,-2e-06,2e-06,-4e-06,2e-06,2e-06,1e-05,2e-06,-4e-06,-1e-06,4e-06,3e-06,-1e-06,5e-06,3e-06,-5e-06,0,-1e-06,-5e-06,1e-06,3e-06,-6e-06,2e-06,0,1e-06,-1e-06,-1e-06,0,6e-06,3e-06,-3e-06,-3e-06,-2e-06,1e-06,2e-06,-7e-06,-8e-06,-1e-06,8e-06,-1e-06,0,-1e-05,4e-06,2e-06,1e-06,-1e-06,1e-06,5e-06,6e-06,1e-06,2e-06,0,1e-06,-2e-06,-1e-06,4e-06,-1e-06,-1e-06,1e-06,1e-06,1e-06,-2e-06,1e-06,1e-06,-1e-06,2e-06,1e-06,0,0,1e-06,6e-06,-2e-06,-6e-06,2e-06,3e-06,2e-06,1e-06,-3e-06,6e-06,-4e-06,-4e-06,2e-06,-4e-06,-4e-06,4e-06,-6e-06,-5e-06,-8e-06,-4e-06,0,-1e-06,2e-06,9e-06,-3e-06,0,-2e-06,1e-06,4e-06,4e-06,-1e-06,1e-06,2e-06,-9e-06,-3e-06,0,-3e-06,1e-06,0,4e-06,-5e-06,-5e-06,1e-06,1e-06
-1e-06,-5e-06,-6e-06,2e-06,4e-06,-1e-06,1.2e-05,1e-06,1e-06,2e-06,-4e-06,-1e-06,0,2e-06,2e-06,2e-06,-1e-06,5e-06,1e-06,-1e-06,-1e-06,-1e-06,2e-06,4e-06,0,2e-06,-1e-06,6e-06,-1e-06,6e-06,3e-06,1e-06,7e-06,0,0,0,0,2e-06,-3e-06,-1e-06,0,0,-2e-06,1e-06,-1e-06,6e-06,-6e-06,-6e-06,-2e-06,-3e-06,2e-06,-1e-06,2e-06,-6e-06,-1e-06,4e-06,-5e-06,0,-4e-06,-1e-06,-1e-06,0,-5e-06,3e-06,-1e-06,0,-1e-06,-3e-06,1e-06,-5e-06,-1e-06,1e-06,1e-06,-1e-06,-3e-06,-1e-06,-6e-06,0,-1e-06,-2e-06,5e-06,4e-06,-3e-06,-6e-06,3e-06,3e-06,6e-06,4e-06,0,-1e-06,2e-06,2e-06,-2e-06,5e-06,2e-06,-6e-06,-4e-06,0,-1e-06,-2e-06,4e-06,-5e-06,1e-06,2e-06,-3e-06,-1e-06,4e-06,-1e-06,1e-06,-3e-06,0,-1e-06,-2e-06,-3e-06,5e-06,-2e-06,-1e-06,-3e-06,6e-06,7e-06,2e-06
-4e-06,2e-06,-1e-06,2e-06,-6e-06,6e-06,-3e-06,-6e-06,-1e-06,-2e-06,-6e-06,2e-06,2e-06,0,-1e-06,-3e-06,2e-06,2e-06,-2e-06,-2e-06,0,-6e-06,-4e-06,0,1e-06,0,1e-06,2e-06,-3e-06,1e-06,-1e-06,0,0,0,2e-06,-1e-06,-4e-06,-2e-06,1e-06,2e-06,3e-06,1e-06,0,0,0,-5e-06,-2e-06,-4e-06,-3e-06,7e-06,-5e-06,1e-06,-3e-06,4e-06,0,2e-06,4e-06,1e-06,-5e-06,1e-06,2e-06,-6e-06,-5e-06,3e-06,-3e-06,0,1e-06,-3e-06,-1e-06,5e-06,2e-06,0,4e-06,3e-06,-1e-06,4e-06,-1e-06,-2e-06,-4e-06,-2e-06,-2e-06,-1e-06,-4e-06,4e-06,2e-06,-4e-06,1e-06,-4e-06,5e-06,5e-06,2e-06,-1e-06,-6e-06,0,0,6e-06,-2e-06,-1e-06,4e-06,3e-06,-5e-06,0,-2e-06,-1e-06,-4e-06,3e-06,3e-06,1e-06,1e-06,6e-06,5e-06,0,0,-2e-06,-2e-06,-1e-06,-5e-06,-1e-06,2e-06,3e-06,0
0,3e-06,1e-06,-1e-06,1e-06,2e-06,0,1e-05,2e-06,1e-06,-2e-06,3e-06,0,0,-4e-06,3e-06,1e-06,2e-06,0,-3e-06,0,-3e-06,0,1e-06,1e-06,5e-06,4e-06,-2e-06,3e-06,-5e-06,0,1e-06,-4e-06,-1e-06,0,1e-06,2e-06,-1e-06,3e-06,2e-06,0,-2e-06,2e-06,5e-06,-6e-06,1e-06,5e-06,-6e-06,-1e-06,1e-06,0,0,2e-06,2e-06,0,1e-06,-1e-06,0,3e-06,-1e-06,-1e-06,0,5e-06,-3e-06,-2e-06,-2e-06,0,0,1e-06,1e-06,0,-1e-06,-2e-06,4e-06,0,0,5e-06,-1e-06,0,0,2e-06,4e-06,2e-06,1e-06,-1e-06,-5e-06,-1e-06,-6e-06,-5e-06,-6e-06,-2e-06,-6e-06,5e-06,-3e-06,-4e-06,6e-06,-2e-06,-1e-06,-2e-06,-1e-06,-4e-06,3e-06,-1e-06,0,-4e-06,-2e-06,1e-06,5e-06,-1e-06,2e-06,0,2e-06,1e-06,1e-06,2e-06,2e-06,1e-06,2e-06,1e-06,1e-06,3e-06
-1e-06,-4e-06,3e-06,-1e-06,1e-06,1e-06,-4e-06,-3e-06,0,-2e-06,0,-2e-06,1e-06,0,-4e-06,0,2e-06,-1e-06,5e-06,-2e-06,0,3e-06,3e-06,-1e-06,-2e-06,-4e-06,-6e-06,1e-06,-5e-06,1e-06,0,1e-06,4e-06,0,-3e-06,-1e-06,-2e-06,0,-1e-06,-1e-06,-2e-06,2e-06,-2e-06,-1e-06,0,2e-06,5e-06,-1e-06,1e-06,-2e-06,2e-06,-1e-06,-1e-06,-2e-06,0,1e-06,2e-06,-1e-06,2e-06,0,-2e-06,2e-06,5e-06,-1e-06,-1e-06,0,0,4e-06,0,5e-06,0,2e-06,-5e-06,0,-3e-06,1e-06,1e-06,2e-06,0,1e-06,-1e-06,1e-06,4e-06,-3e-06,-2e-06,8e-06,-4e-06,4e-06,3e-06,0,-2e-06,4e-06,2e-06,2e-06,2e-06,1e-06,0,-1e-06,3e-06,3e-06,3e-06,-1e-06,2e-06,0,-2e-06,1e-06,1e-06,-4e-06,-1e-06,-5e-06,-1e-06,0,0,2e-06,0,-1e-06,2e-06,1e-06,0,2e-06,1e-06
1e-06,-3e-06,-1e-06,-1e-06,-3e-06,-1e-06,6e-06,1e-06,0,1e-06,1e-06,-5e-06,1e-06,2e-06,6e-06,0,-1e-06,-5e-06,-2e-06,2e-06,0,3e-06,-3e-06,-1e-06,2e-06,-3e-06,2e-06,0,0,2e-06,-1e-06,0,1e-06,0,2e-06,1e-06,-1e-06,-1e-06,0,5e-06,0,0,1e-06,0,3e-06,0,-5e-06,0,2e-06,0,1e-06,2e-06,1e-06,-3e-06,0,1e-06,0,0,-1e-06,1e-06,0,6e-06,-2e-06,-3e-06,1e-06,-1e-06,0,2e-06,0,1e-06,0,0,0,-1e-06,0,-1e-06,-1e-06,-1e-06,-1e-06,1e-06,-1e-06,0,1e-06,1e-06,-1e-06,2e-06,-3e-06,-4e-06,-2e-06,2e-06,1e-06,-1e-06,-4e-06,1e-06,1e-06,-6e-06,0,0,1e-06,-1e-06,5e-06,-4e-06,0,0,3e-06,1e-06,1e-06,-3e-06,1e-06,-3e-06,4e-06,-2e-06,1e-06,2e-06,1e-06,1e-06,-5e-06,-2e-06,-6e-06,-1e-06,0
1e-06,2e-06,-2e-06,0,1e-06,-1e-06,-5e-06,1e-06,1e-06,-1e-06,1e-06,0,-1e-06,0,1e-06,-1e-06,-1e-06,-1e-06,-3e-06,1e-06,0,0,0,-1e-06,-1e-06,4e-06,-2e-06,0,2e-06,-3e-06,0,0,0,0,1e-06,-1e-06,-1e-06,0,-2e-06,2e-06,0,0,-1e-06,-2e-06,3e-06,-2e-06,-4e-06,4e-06,4e-06,2e-06,-1e-06,-2e-06,-3e-06,-1e-06,0,0,-2e-06,0,2e-06,0,1e-06,-2e-06,-5e-06,-2e-06,1e-06,1e-06,0,-3e-06,0,-1e-06,-1e-06,-2e-06,2e-06,0,-2e-06,-2e-06,-1e-06,0,-1e-06,0,1e-06,2e-06,-3e-06,2e-06,0,0,-2e-06,-5e-06,1e-06,-2e-06,1e-06,0,0,0,-2e-06,-1e-06,0,0,-1e-06,1e-06,-1e-06,-3e-06,-1e-06,0,4e-06,0,0,0,1e-06,2e-06,0,2e-06,-1e-06,0,-4e-06,1e-06,-1e-06,1e-06,-1e-06,-2e-06,0
1e-06,2e-06,1e-06,0,0,1e-06,2e-06,-4e-06,-1e-06,1e-06,-1e-06,2e-06,0,-4e-06,3e-06,-1e-06,-1e-06,2e-06,2e-06,-1e-06,0,-2e-06,2e-06,1e-06,1e-06,-4e-06,1e-06,-2e-06,2e-06,0,-1e-06,0,-3e-06,0,-1e-06,0,-2e-06,0,-2e-06,1e-06,0,0,1e-06,0,3e-06,3e-06,1e-06,2e-06,3e-06,0,-3e-06,1e-06,3e-06,5e-06,0,-2e-06,1e-06,0,-1e-06,0,0,0,-1e-06,1e-06,1e-06,-2e-06,2e-06,-2e-06,0,-3e-06,-1e-06,2e-06,2e-06,-3e-06,-2e-06,0,2e-06,0,1e-06,-1e-06,-2e-06,0,0,0,1e-06,-8e-06,1e-06,1e-06,-2e-06,3e-06,-1e-06,1e-06,1e-06,0,2e-06,0,1e-06,0,2e-06,-1e-06,-4e-06,1e-06,0,0,1e-06,1e-06,0,-1e-06,0,-1e-06,-2e-06,1e-06,1e-06,-1e-06,0,-1e-06,3e-06,1e-06,1e-06,-2e-06,1e-06
1e-06,-2e-06,0,1e-06,-3e-06,-1e-06,-1e-06,0,0,-1e-06,2e-06,1e-06,0,3e-06,-2e-06,1e-06,0,2e-06,0,3e-06,0,2e-06,-2e-06,0,-1e-06,2e-06,0,-3e-06,0,2e-06,1e-06,0,-2e-06,0,0,0,1e-06,1e-06,1e-06,2e-06,0,0,-1e-06,0,-3e-06,-1e-06,3e-06,4e-06,0,-3e-06,3e-06,-1e-06,-2e-06,0,0,-3e-06,-1e-06,0,-2e-06,0,0,-3e-06,2e-06,1e-06,0,0,0,0,0,-1e-06,-2e-06,0,-3e-06,-1e-06,0,-1e-06,3e-06,0,3e-06,-1e-06,2e-06,0,1e-06,-2e-06,1e-06,1e-06,2e-06,1e-06,1e-06,-2e-06,0,2e-06,0,0,0,1e-06,0,0,-3e-06,1e-06,0,3e-06,1e-06,0,-1e-06,-1e-06,1e-06,1e-06,-1e-06,-1e-06,-2e-06,-1e-06,0,-1e-06,3e-06,0,-2e-06,0,1e-06,-1e-06,0
1e-06,-3e-06,-2e-06,0,2e-06,-1e-06,1e-06,2e-06,-1e-06,0,2e-06,0,0,0,-4e-06,0,1e-06,1e-06,-1e-06,1e-06,0,2e-06,1e-06,0,0,-1e-06,2e-06,0,-5e-06,-2e-06,1e-06,0,0,0,0,0,1e-06,0,0,0,-1e-06,1e-06,0,0,-3e-06,-1e-06,1e-06,1e-06,-1e-06,0,1e-06,1e-06,0,-3e-06,0,-2e-06,-1e-06,0,1e-06,0,0,-1e-06,2e-06,2e-06,0,0,-1e-06,1e-06,0,0,-1e-06,-1e-06,-1e-06,1e-06,-2e-06,1e-06,-1e-06,-2e-06,1e-06,-1e-06,-2e-06,1e-06,1e-06,2e-06,0,2e-06,3e-06,-3e-06,-1e-06,-1e-06,-1e-06,-1e-06,-3e-06,1e-06,-1e-06,-1e-06,0,1e-06,2e-06,-1e-06,3e-06,1e-06,-1e-06,0,-1e-06,1e-06,1e-06,3e-06,0,3e-06,1e-06,0,0,-1e-06,-1e-06,0,-3e-06,0,3e-06,-2e-06,-1e-06
-1e-06,0,0,-1e-06,-1e-06,-2e-06,-2e-06,-1e-06,0,-1e-06,-1e-06,0,0,-2e-06,0,0,0,-1e-06,0,0,0,0,0,0,0,1e-06,-2e-06,0,0,0,0,0,2e-06,0,0,0,-1e-06,0,0,1e-06,0,0,1e-06,1e-06,1e-06,1e-06,-3e-06,1e-06,-2e-06,2e-06,-2e-06,-1e-06,1e-06,0,0,-1e-06,1e-06,0,0,0,0,-3e-06,0,1e-06,-1e-06,-1e-06,1e-06,1e-06,0,1e-06,-2e-06,1e-06,0,-1e-06,-1e-06,1e-06,-1e-06,2e-06,-2e-06,-1e-06,2e-06,-1e-06,-3e-06,0,-1e-06,3e-06,0,2e-06,2e-06,0,0,1e-06,2e-06,0,1e-06,2e-06,-1e-06,0,-2e-06,1e-06,1e-06,-1e-06,-1e-06,0,-3e-06,-1e-06,1e-06,-1e-06,0,2e-06,3e-06,1e-06,0,0,0,0,1e-06,-1e-06,-1e-06,-1e-06,0
0,2e-06,0,0,-1e-06,-1e-06,3e-06,1e-06,0,0,-2e-06,0,0,0,1e-06,-1e-06,1e-06,-3e-06,1e-06,-1e-06,0,-2e-06,-1e-06,-1e-06,-1e-06,2e-06,1e-06,0,2e-06,1e-06,0,0,1e-06,0,0,0,1e-06,-1e-06,1e-06,-1e-06,0,0,0,0,-1e-06,-1e-06,1e-06,-2e-06,-1e-06,0,0,0,0,1e-06,0,-1e-06,0,0,-1e-06,0,0,2e-06,-1e-06,0,-1e-06,0,0,0,0,1e-06,-1e-06,0,3e-06,-1e-06,-1e-06,1e-06,1e-06,-1e-06,-2e-06,0,-1e-06,0,-1e-06,-2e-06,0,0,-1e-06,1e-06,-2e-06,-1e-06,1e-06,0,1e-06,0,0,2e-06,-1e-06,0,1e-06,0,-2e-06,-1e-06,0,0,-1e-06,1e-06,0,-3e-06,0,-1e-06,-2e-06,-1e-06,0,1e-06,-1e-06,0,0,1e-06,-3e-06,0,0
-1e-06,-1e-06,-1e-06,0,2e-06,0,-2e-06,1e-06,0,0,-1e-06,-1e-06,-1e-06,3e-06,3e-06,1e-06,-1e-06,-1e-06,0,0,0,-1e-06,1e-06,0,1e-06,-2e-06,-1e-06,0,2e-06,0,0,0,-1e-06,0,-1e-06,0,0,0,-1e-06,-1e-06,0,0,0,0,1e-06,1e-06,3e-06,-2e-06,0,-2e-06,1e-06,0,-1e-06,0,0,0,0,0,2e-06,0,-1e-06,2e-06,-1e-06,-1e-06,0,-1e-06,-1e-06,-2e-06,0,0,-1e-06,-1e-06,0,1e-06,-1e-06,1e-06,1e-06,0,0,1e-06,1e-06,0,1e-06,1e-06,0,-5e-06,-2e-06,-1e-06,0,2e-06,-1e-06,-1e-06,-1e-06,0,-1e-06,-2e-06,-1e-06,0,0,1e-06,-2e-06,1e-06,1e-06,0,1e-06,0,0,0,0,-1e-06,0,0,0,1e-06,1e-06,0,-2e-06,-1e-06,0,-1e-06,0
-1e-06,-3e-06,1e-06,0,-2e-06,0,1e-06,-3e-06,0,0,-1e-06,-1e-06,0,-2e-06,-1e-06,-1e-06,-1e-06,2e-06,1e-06,-1e-06,0,1e-06,1e-06,0,0,0,0,0,-1e-06,-1e-06,0,0,-1e-06,0,1e-06,0,0,0,-1e-06,-1e-06,0,0,0,-1e-06,3e-06,-1e-06,0,-2e-06,0,-1e-06,1e-06,0,1e-06,-1e-06,0,0,0,0,1e-06,0,0,1e-06,0,-1e-06,0,1e-06,1e-06,-1e-06,0,-1e-06,0,1e-06,-1e-06,-1e-06,0,0,0,0,0,1e-06,-1e-06,-1e-06,2e-06,1e-06,0,3e-06,-1e-06,0,0,-1e-06,1e-06,-1e-06,-1e-06,0,1e-06,-3e-06,-1e-06,0,0,0,1e-06,2e-06,0,0,1e-06,0,0,0,0,1e-06,0,0,0,0,-1e-06,0,-1e-06,0,0,1e-06,-1e-06
0,1e-06,0,0,0,0,-2e-06,2e-06,0,0,-1e-06,1e-06,0,0,-2e-06,1e-06,0,2e-06,0,-1e-06,0,0,0,1e-06,1e-06,0,0,2e-06,-1e-06,0,0,0,1e-06,0,0,0,1e-06,0,0,-1e-06,0,0,1e-06,0,0,1e-06,-3e-06,-2e-06,0,1e-06,-1e-06,1e-06,-1e-06,-1e-06,0,1e-06,-1e-06,0,-2e-06,0,0,-1e-06,1e-06,-1e-06,0,-1e-06,0,1e-06,0,-2e-06,-1e-06,0,-2e-06,0,-1e-06,-1e-06,-1e-06,1e-06,-1e-06,0,0,0,-1e-06,-1e-06,0,0,-1e-06,-2e-06,0,0,0,1e-06,2e-06,0,-1e-06,-1e-06,0,0,0,0,2e-06,0,-1e-06,0,1e-06,1e-06,0,0,0,-2e-06,0,0,0,0,-1e-06,0,1e-06,0,2e-06,2e-06,0
0,2e-06,0,0,1e-06,0,3e-06,-3e-06,0,0,0,2e-06,0,0,-2e-06,-1e-06,0,0,-1e-06,0,0,-1e-06,0,0,0,0,0,1e-06,-1e-06,1e-06,0,0,1e-06,0,-1e-06,0,-1e-06,0,0,-2e-06,0,0,0,0,-1e-06,0,0,0,0,0,-1e-06,-1e-06,0,2e-06,0,1e-06,1e-06,0,0,0,0,-1e-06,1e-06,0,0,0,0,2e-06,0,0,0,-1e-06,1e-06,1e-06,-1e-06,-1e-06,-1e-06,-1e-06,0,-1e-06,0,-1e-06,-1e-06,-1e-06,0,1e-06,1e-06,1e-06,-1e-06,0,0,-1e-06,0,-1e-06,0,3e-06,0,0,-1e-06,0,0,-2e-06,1e-06,0,0,-1e-06,0,2e-06,0,-2e-06,-1e-06,0,0,-1e-06,1e-06,0,-1e-06,0,2e-06,1e-06,-1e-06
0,-1e-06,-1e-06,0,-2e-06,1e-06,-3e-06,2e-06,0,0,0,0,0,1e-06,0,0,1e-06,-1e-06,1e-06,1e-06,0,0,1e-06,0,0,-1e-06,-1e-06,0,1e-06,-1e-06,0,0,-1e-06,0,0,0,0,0,0,-1e-06,0,0,0,1e-06,-1e-06,-2e-06,1e-06,1e-06,-1e-06,-1e-06,1e-06,1e-06,1e-06,0,0,2e-06,-1e-06,0,0,0,0,-1e-06,-1e-06,0,0,0,0,0,0,1e-06,-1e-06,0,2e-06,0,-1e-06,0,1e-06,1e-06,1e-06,-1e-06,0,-1e-06,1e-06,1e-06,0,-3e-06,1e-06,-1e-06,1e-06,-1e-06,0,0,-1e-06,0,1e-06,1e-06,0,0,0,0,-2e-06,-2e-06,0,0,0,1e-06,0,0,0,1e-06,-1e-06,0,0,0,-1e-06,0,-2e-06,0,-2e-06,1e-06,0
1e-06,-2e-06,0,0,0,1e-06,1e-06,0,0,0,1e-06,-2e-06,0,-1e-06,3e-06,0,0,-2e-06,1e-06,0,0,1e-06,-1e-06,0,0,1e-06,1e-06,0,0,0,0,0,0,0,1e-06,0,0,0,1e-06,-1e-06,0,0,1e-06,0,-2e-06,3e-06,2e-06,2e-06,-1e-06,0,0,0,-1e-06,-1e-06,0,1e-06,0,0,-1e-06,0,0,-2e-06,-1e-06,1e-06,0,0,0,-1e-06,0,1e-06,0,0,0,0,-1e-06,0,0,-1e-06,1e-06,-1e-06,0,0,1e-06,0,0,0,1e-06,-2e-06,-1e-06,1e-06,0,0,1e-06,0,-1e-06,-1e-06,0,0,0,0,-1e-06,0,0,0,-1e-06,-1e-06,0,-2e-06,0,1e-06,2e-06,0,0,0,0,0,0,-1e-06,-1e-06,1e-06,0
0,0,1e-06,0,0,1e-06,-1e-06,-1e-06,0,0,1e-06,0,0,0,1e-06,0,0,-1e-06,0,0,0,1e-06,0,0,0,-1e-06,0,0,1e-06,1e-06,0,0,0,0,0,0,-1e-06,0,0,0,0,0,0,0,1e-06,-1e-06,-1e-06,1e-06,-1e-06,1e-06,-1e-06,0,0,0,0,1e-06,0,0,1e-06,0,0,1e-06,1e-06,0,0,0,0,-1e-06,0,0,0,0,-2e-06,1e-06,-1e-06,1e-06,-1e-06,0,-1e-06,0,0,-1e-06,0,-1e-06,0,2e-06,0,0,0,0,0,1e-06,1e-06,-1e-06,0,0,0,0,-1e-06,0,2e-06,1e-06,0,0,-1e-06,1e-06,0,0,0,-1e-06,0,0,0,0,-1e-06,0,0,0,0,1e-06,-1e-06
0,2e-06,-2e-06,0,-2e-06,0,1e-06,1e-06,0,0,0,1e-06,0,0,0,0,0,1e-06,0,0,0,0,0,0,0,2e-06,0,1e-06,1e-06,-1e-06,0,0,0,0,0,0,0,0,-1e-06,0,0,0,0,0,2e-06,-1e-06,-1e-06,2e-06,0,0,0,0,0,1e-06,0,0,0,0,1e-06,0,0,1e-06,0,0,0,-1e-06,0,0,0,0,1e-06,0,-1e-06,0,-1e-06,0,0,-1e-06,-2e-06,1e-06,1e-06,-1e-06,-2e-06,1e-06,0,0,-1e-06,0,0,0,0,0,-1e-06,0,1e-06,1e-06,0,0,0,0,1e-06,0,0,0,0,0,0,0,0,1e-06,-1e-06,0,0,0,1e-06,0,-1e-06,0,-1e-06,0,0
0,-1e-06,0,0,1e-06,0,-2e-06,-2e-06,0,0,0,1e-06,0,1e-06,-2e-06,0,0,2e-06,1e-06,1e-06,0,0,-1e-06,0,0,0,1e-06,0,-2e-06,0,0,0,0,0,0,0,0,0,0,0,0,0,0,0,0,2e-06,1e-06,0,1e-06,-1e-06,0,0,1e-06,0,0,0,0,0,-1e-06,0,0,2e-06,0,0,0,0,0,1e-06,0,-1e-06,0,1e-06,1e-06,-1e-06,-1e-06,0,0,1e-06,0,1e-06,-1e-06,-1e-06,0,1e-06,0,0,-1e-06,-2e-06,0,0,0,1e-06,-1e-06,0,-1e-06,-1e-06,0,0,0,0,-1e-06,-1e-06,0,0,0,0,0,-1e-06,0,2e-06,-1e-06,0,0,0,0,0,-1e-06,0,2e-06,0,0
0,-2e-06,1e-06,0,-1e-06,-1e-06,2e-06,1e-06,0,0,0,-1e-06,0,-2e-06,-2e-06,1e-06,0,1e-06,0,-1e-06,0,0,0,0,0,-1e-06,0,-1e-06,-1e-06,1e-06,0,0,-1e-06,0,1e-06,0,0,0,0,1e-06,0,0,0,0,1e-06,-1e-06,2e-06,0,1e-06,0,1e-06,0,-1e-06,-1e-06,0,-1e-06,0,0,1e-06,0,0,-1e-06,0,0,0,0,0,1e-06,0,0,1e-06,0,1e-06,0,-1e-06,0,1e-06,-1e-06,1e-06,0,1e-06,-1e-06,1e-06,-1e-06,0,-3e-06,0,1e-06,0,-1e-06,0,-1e-06,1e-06,0,0,-2e-06,0,0,-1e-06,0,-2e-06,-1e-06,0,0,0,0,0,1e-06,0,-2e-06,1e-06,0,0,0,-1e-06,0,1e-06,0,0,-1e-06,0
0,0,0,0,-1e-06,0,-1e-06,0,0,0,-1e-06,0,0,0,1e-06,-1e-06,0,-1e-06,0,0,0,0,0,0,0,1e-06,0,0,0,0,0,0,0,0,0,0,1e-06,0,0,1e-06,0,0,0,0,0,0,-1e-06,-2e-06,1e-06,0,0,0,0,0,0,-1e-06,0,0,0,0,0,0,0,0,0,0,0,0,0,0,0,0,0,0,-1e-06,-1e-06,0,1e-06,0,0,-1e-06,-1e-06,0,0,0,1e-06,0,1e-06,0,0,0,0,0,0,1e-06,1e-06,0,0,1e-06,0,0,1e-06,0,0,0,0,-1e-06,0,0,-1e-06,1e-06,0,0,0,1e-06,0,0,0,-1e-06,-1e-06,0
