0.045481,0.044284,0.043247,0.040912,0.043009,0.042364,0.036477,0.032968,0.032033,0.032364,0.032392,0.034564,0.040004,0.041989,0.038379,0.036177,0.033296,0.0283,0.027356,0.028748,0.029315,0.026721,0.023552,0.023393,0.021246,0.018224,0.017322,0.017703
0.063935,0.058778,0.055627,0.053379,0.055231,0.052626,0.045971,0.04327,0.041479,0.041769,0.041648,0.042455,0.048077,0.050393,0.047276,0.045395,0.041957,0.03743,0.036175,0.036879,0.036253,0.032133,0.027625,0.027347,0.025965,0.021981,0.019838,0.02037
0.104847,0.090362,0.082153,0.081575,0.08366,0.076752,0.067996,0.066572,0.063505,0.064051,0.062456,0.059725,0.065674,0.068375,0.067154,0.066441,0.061579,0.058187,0.056079,0.054773,0.051013,0.043105,0.03542,0.035113,0.035516,0.029587,0.024802,0.025108
0.157295,0.132438,0.117879,0.119392,0.122842,0.111342,0.099965,0.100334,0.095111,0.095331,0.091502,0.08508,0.091248,0.093969,0.095799,0.096111,0.089219,0.086787,0.082878,0.0783,0.07067,0.05765,0.045386,0.045425,0.0473,0.038796,0.031262,0.030439
0.199156,0.169994,0.153904,0.155604,0.158373,0.144532,0.13207,0.135537,0.127917,0.127562,0.122011,0.111655,0.117581,0.121045,0.125257,0.125146,0.116825,0.114322,0.107836,0.099503,0.088892,0.072113,0.056536,0.05702,0.058316,0.047377,0.038173,0.036383
0.199938,0.177967,0.169914,0.170066,0.168259,0.155362,0.145095,0.15357,0.146364,0.145264,0.137973,0.124016,0.127407,0.130471,0.135263,0.13424,0.127624,0.124535,0.114941,0.104801,0.095786,0.079299,0.063379,0.063206,0.061725,0.050451,0.041611,0.040116
0.158013,0.150575,0.154784,0.154184,0.147126,0.1351,0.126597,0.138197,0.136603,0.135365,0.125605,0.111081,0.111037,0.112196,0.114644,0.112877,0.112062,0.108752,0.096382,0.086769,0.083223,0.072792,0.060381,0.058055,0.05332,0.044591,0.039258,0.04012
0.129964,0.135544,0.138072,0.135029,0.127187,0.110568,0.095757,0.101516,0.104384,0.104578,0.095157,0.085567,0.085896,0.084177,0.082023,0.081583,0.086994,0.084096,0.072137,0.065492,0.064941,0.062287,0.055326,0.049432,0.042247,0.036715,0.037195,0.042382
0.192076,0.203261,0.191142,0.177788,0.160115,0.130962,0.102793,0.097384,0.101074,0.102378,0.094966,0.094007,0.105161,0.101824,0.090909,0.088354,0.098331,0.097559,0.085,0.083553,0.07987,0.075111,0.068015,0.058278,0.049914,0.044706,0.049789,0.058613
0.348314,0.368908,0.345144,0.306892,0.259977,0.213572,0.164073,0.149893,0.160199,0.165581,0.155524,0.155514,0.18449,0.180202,0.15125,0.145714,0.170355,0.172141,0.147484,0.151008,0.145526,0.130368,0.115261,0.097879,0.083014,0.074629,0.083574,0.095135
0.592523,0.63079,0.598763,0.517138,0.417547,0.351782,0.271602,0.244838,0.273195,0.288126,0.268819,0.265953,0.330056,0.325206,0.257289,0.246642,0.304937,0.310672,0.258922,0.272676,0.267448,0.235252,0.204839,0.171287,0.143096,0.126823,0.142375,0.159202
0.89295,0.960024,0.931161,0.789688,0.621014,0.537658,0.421344,0.376283,0.428267,0.45993,0.430392,0.425405,0.551878,0.549816,0.413184,0.394691,0.510745,0.518988,0.424927,0.456571,0.44975,0.391209,0.337017,0.279274,0.232158,0.201949,0.229455,0.255268
1.127074,1.231119,1.225937,1.033625,0.819816,0.732429,0.578944,0.508289,0.578772,0.633081,0.603611,0.603957,0.81019,0.813144,0.594475,0.576671,0.759049,0.755776,0.614472,0.670271,0.656342,0.566889,0.485294,0.404297,0.339067,0.289954,0.331636,0.367009
1.138395,1.263853,1.290717,1.08966,0.904411,0.85301,0.689959,0.589032,0.648987,0.719932,0.707728,0.721115,0.987347,0.997158,0.723072,0.723632,0.948734,0.913759,0.745124,0.824373,0.802175,0.691392,0.588128,0.501438,0.436641,0.370931,0.413548,0.453342
0.963291,1.051078,1.063994,0.908565,0.835163,0.854475,0.742961,0.620167,0.626521,0.69241,0.694844,0.706467,0.957003,0.97641,0.72753,0.760111,0.953741,0.876725,0.735774,0.830295,0.822362,0.724038,0.610982,0.542694,0.507457,0.430449,0.438355,0.476951
0.913564,0.953348,0.870182,0.750452,0.811228,0.850218,0.816853,0.710862,0.649759,0.672789,0.67255,0.675354,0.816926,0.836927,0.682027,0.726819,0.795148,0.693746,0.665686,0.784027,0.826476,0.776856,0.641432,0.581538,0.587946,0.499786,0.445035,0.480774
1.042016,1.099083,0.96156,0.851808,0.983577,0.986507,0.984981,0.902242,0.823957,0.805186,0.742021,0.775283,0.912888,0.89639,0.73797,0.765288,0.735746,0.630503,0.702743,0.876183,0.975731,0.941752,0.73976,0.636965,0.679244,0.60083,0.50553,0.539332
1.159506,1.278605,1.134671,0.998112,1.122783,1.088049,1.08871,1.047796,1.004065,0.938863,0.773287,0.858657,1.092513,1.031686,0.81003,0.854814,0.85986,0.715095,0.734751,0.951516,1.073638,1.021795,0.796772,0.655266,0.714882,0.679773,0.571716,0.588918
1.228009,1.31123,1.149578,0.998671,1.085232,1.025916,1.005996,1.045194,1.087976,0.982243,0.740334,0.838788,1.10507,1.027797,0.830273,0.881855,0.909903,0.749664,0.702242,0.924049,1.012667,0.917231,0.755426,0.639028,0.72633,0.740978,0.578719,0.537126
1.309139,1.275077,1.0604,0.876963,0.925503,0.861132,0.808529,0.915503,1.059558,0.945556,0.669152,0.733248,0.944047,0.93212,0.876701,0.875194,0.842725,0.714991,0.65678,0.852204,0.924075,0.743488,0.630321,0.607618,0.727899,0.755478,0.515947,0.407534
1.334068,1.273602,1.041857,0.854862,0.885696,0.783547,0.68081,0.775246,0.941202,0.844689,0.581959,0.624196,0.791394,0.867917,0.94862,0.876303,0.741541,0.67898,0.678185,0.787889,0.848818,0.63792,0.531964,0.576104,0.65808,0.643138,0.412029,0.320739
1.188796,1.240384,1.041301,0.845444,0.866757,0.769405,0.650346,0.684122,0.751239,0.675999,0.511209,0.578376,0.728321,0.791453,0.901451,0.829652,0.638658,0.615993,0.661948,0.657893,0.703127,0.582478,0.484214,0.530002,0.525745,0.449664,0.313061,0.26988
0.833095,0.9813,0.868385,0.706448,0.701718,0.660125,0.606564,0.595891,0.547892,0.496475,0.462822,0.559138,0.689922,0.68353,0.733374,0.733299,0.576195,0.534897,0.584525,0.517904,0.513857,0.480995,0.40972,0.41885,0.367404,0.284725,0.244806,0.229986
0.480267,0.639107,0.631349,0.569819,0.554064,0.550682,0.554458,0.516758,0.433617,0.407489,0.451972,0.52898,0.596059,0.541725,0.541065,0.582386,0.50392,0.469322,0.499902,0.438554,0.403846,0.386694,0.310728,0.289844,0.26261,0.210426,0.212418,0.218059
0.414843,0.558951,0.592925,0.585577,0.549962,0.517848,0.528361,0.525166,0.445057,0.400363,0.48313,0.533051,0.514981,0.427631,0.394263,0.427713,0.447045,0.45497,0.466231,0.44364,0.389365,0.315976,0.237361,0.232355,0.232386,0.198584,0.195652,0.217002
0.506106,0.615179,0.671034,0.682154,0.596009,0.531678,0.539113,0.568043,0.517904,0.452111,0.536459,0.575465,0.498114,0.389853,0.378791,0.418226,0.448968,0.448724,0.44491,0.469671,0.420102,0.293347,0.218093,0.244608,0.256335,0.226516,0.189909,0.203977
0.635647,0.683011,0.750451,0.779179,0.669926,0.588692,0.576311,0.606555,0.634981,0.5961,0.634466,0.652816,0.527661,0.392662,0.430891,0.47217,0.478904,0.459069,0.415334,0.483501,0.50151,0.357175,0.265557,0.303438,0.326985,0.305287,0.218499,0.189378
0.748032,0.799974,0.846016,0.778126,0.683068,0.651211,0.624883,0.647423,0.763853,0.751961,0.73067,0.796112,0.709382,0.525468,0.543396,0.553781,0.534249,0.47971,0.372526,0.449737,0.524765,0.407796,0.350831,0.404906,0.41396,0.384642,0.267249,0.194546
0.796244,0.916262,0.900248,0.691364,0.638592,0.656128,0.631993,0.654835,0.806444,0.825376,0.790446,0.935386,0.924851,0.710218,0.652519,0.617817,0.58046,0.498718,0.342943,0.397689,0.47509,0.402183,0.427441,0.49558,0.463955,0.42407,0.330649,0.245603
0.74012,0.907292,0.863449,0.677738,0.683437,0.639518,0.575332,0.571724,0.697942,0.748517,0.75144,0.949485,1.002337,0.816437,0.68411,0.617986,0.587084,0.479155,0.298374,0.328194,0.374414,0.358062,0.456489,0.497457,0.436745,0.418642,0.382461,0.311978
0.649156,0.766836,0.749301,0.717527,0.744769,0.651952,0.555274,0.465032,0.523473,0.556668,0.565962,0.747918,0.842464,0.744996,0.60939,0.548854,0.510716,0.393763,0.246816,0.254835,0.278829,0.322106,0.416084,0.399949,0.36365,0.390286,0.387328,0.333529
0.560028,0.550865,0.621612,0.718183,0.686174,0.57619,0.535461,0.451349,0.44578,0.423008,0.384788,0.460261,0.534061,0.517289,0.432291,0.403755,0.361398,0.285699,0.235346,0.26165,0.277121,0.293924,0.318087,0.303531,0.312037,0.332377,0.32663,0.285052
0.460624,0.397433,0.479432,0.577817,0.487774,0.397706,0.440872,0.45551,0.461203,0.400073,0.299776,0.285606,0.293294,0.300216,0.275653,0.271852,0.237632,0.202548,0.230066,0.286783,0.297703,0.25526,0.211705,0.222186,0.247715,0.269037,0.269639,0.216062
0.377095,0.346946,0.349397,0.357875,0.271962,0.251263,0.313725,0.389001,0.431617,0.359841,0.275572,0.227723,0.189181,0.203066,0.212572,0.190647,0.147254,0.148015,0.207111,0.261929,0.293902,0.250785,0.176537,0.172242,0.166283,0.181881,0.203963,0.163292
0.286263,0.300727,0.24862,0.210133,0.165013,0.208192,0.240174,0.273334,0.319582,0.284022,0.266842,0.199083,0.135037,0.163828,0.168889,0.119883,0.074444,0.113573,0.171245,0.195098,0.244371,0.245163,0.184497,0.14828,0.113082,0.103734,0.125296,0.111981
0.236131,0.226895,0.163561,0.158116,0.161292,0.204784,0.180259,0.160895,0.184332,0.181788,0.219954,0.169737,0.101021,0.131649,0.123245,0.069816,0.042708,0.088261,0.133778,0.145961,0.176619,0.193274,0.16477,0.115309,0.081402,0.06567,0.080385,0.083809
0.204681,0.18841,0.119751,0.134965,0.166154,0.185154,0.15176,0.122172,0.11477,0.105556,0.142107,0.122798,0.075905,0.094546,0.091319,0.059454,0.04413,0.072581,0.114037,0.119479,0.109037,0.12008,0.116019,0.072876,0.051089,0.048221,0.060362,0.069053
0.153676,0.159146,0.10755,0.114387,0.140615,0.140474,0.119118,0.103738,0.093011,0.070333,0.074645,0.074622,0.056657,0.066266,0.082826,0.071493,0.048829,0.059195,0.093813,0.089927,0.068637,0.077301,0.073482,0.045182,0.034695,0.042838,0.043165,0.052605
0.094461,0.110929,0.096702,0.098728,0.096811,0.086062,0.077335,0.082402,0.096536,0.071995,0.044018,0.048915,0.05819,0.057823,0.078232,0.080144,0.052965,0.060733,0.082956,0.063472,0.043369,0.066714,0.065965,0.038625,0.032285,0.043151,0.034705,0.035063
0.056707,0.0614,0.081493,0.092393,0.075498,0.058441,0.052987,0.06968,0.097419,0.080092,0.036115,0.043799,0.064432,0.0647,0.080789,0.078889,0.061542,0.076677,0.090943,0.05589,0.031093,0.058474,0.060434,0.034302,0.032927,0.041331,0.027225,0.023032
