3.2e-05,0.000143,7e-06,0.000103,2.5e-05,4e-05,5e-05,2.1e-05,7e-06,5.8e-05,3.6e-05,1.1e-05,5.1e-05,6.6e-05,5.5e-05,6e-05,0,6e-05,1.4e-05,9.6e-05,3e-05,4.6e-05,1.4e-05,4.5e-05,3.8e-05,3.3e-05,5.6e-05,3.1e-05,4.5e-05,1e-05,3.5e-05,4.8e-05,4.3e-05,4.8e-05,9.3e-05,3.1e-05,1.4e-05,4e-06,8e-06,0.000181,0.000155,0.000243,0.000498,0.000555,0.000507,0.000702,0.000391,0.000392,5.7e-05,0.000165,0.000284,1e-04,2.3e-05,0.000286,0.000307,0.000181,0.000235,5e-05,9.4e-05,2.4e-05,5.4e-05,1e-06,1.5e-05,6.5e-05,1.9e-05,4.9e-05,2.8e-05,1.8e-05,1.7e-05,1.9e-05,2.9e-05,3e-06,3.7e-05,3.9e-05,8e-06,1.5e-05,5e-06,1.2e-05,2.1e-05,2e-06,1.7e-05,8e-06,5e-06,6e-06,6e-06,0.000299,5.5e-05,0.000152,4.6e-05,0.000315,0.000123,0.000184,0.000186,4e-06,0.000138,0.000229,0.000163,0.000148,1.9e-05,2.5e-05,4.5e-05,6.4e-05,5.9e-05,0.000144,3.8e-05,4.4e-05,2.4e-05,6e-06,1.8e-05,2.4e-05,3.3e-05,9e-06,3.2e-05,5.4e-05,1.5e-05,6.6e-05,1.7e-05,1.1e-05,0.00065,0.000381,4.6e-05
0.000263,0.000237,0.000277,0.000175,0.000215,9.2e-05,0.000108,0.000124,0.000187,0.000172,0.00015,5.9e-05,7.3e-05,0.000198,0.000131,0.000231,0.000197,0.000167,0.00016,0.000143,0.000187,0.000105,0.000111,0.000129,0.000166,0.000144,0.000164,9.5e-05,0.000106,8.9e-05,4.6e-05,0.000152,0.000197,0.000137,0.000231,0.000157,0.000136,9.8e-05,6.3e-05,0.000455,0.000356,0.000939,0.000624,0.001088,0.002343,0.00084,0.001679,0.000626,0.000541,0.000112,0.000233,0.000599,0.000338,0.000646,0.00091,0.000417,0.000217,0.000134,7.9e-05,0.000166,0.000113,0.000106,1.8e-05,0.000125,5.2e-05,6.9e-05,5.6e-05,2.7e-05,3.5e-05,1.6e-05,7.4e-05,5.3e-05,9.3e-05,0.000139,0.000156,0.000151,3.9e-05,1.3e-05,5.4e-05,5.3e-05,6.1e-05,4.4e-05,8.1e-05,8.6e-05,7.9e-05,0.000646,0.000474,0.000517,0.00058,0.000643,0.000378,0.000369,9.9e-05,0.000161,0.000228,0.000301,0.000656,7e-04,8.3e-05,0.000128,0.000157,0.00018,0.000101,0.000386,0.000212,0.000208,9.8e-05,6.2e-05,9.8e-05,0.000135,7.6e-05,0.000149,0.000195,0.000106,4e-05,0.000108,0.00011,3.3e-05,0.001291,0.001034,0.00075
0.000102,4.1e-05,0.000137,4.8e-05,0.000102,4.9e-05,1.8e-05,4.2e-05,0.000148,4.8e-05,0.000214,0.000307,2e-04,4.4e-05,8e-05,0.000134,1.1e-05,0.00012,0.000103,0.000103,0.000215,4.5e-05,0.000102,2e-05,6.8e-05,5e-05,5.1e-05,5.6e-05,6.6e-05,2.9e-05,4.2e-05,0.000123,0.000107,4.5e-05,0.000117,7.8e-05,3.1e-05,4e-05,3.7e-05,0.000678,0.000309,0.001221,0.002354,0.001589,0.00143,0.00216,0.002033,0.000891,0.00064,0.000556,0.000337,0.000344,0.000323,0.000694,0.001044,0.000407,0.000372,7.9e-05,9.6e-05,9.6e-05,5e-05,6e-05,6.6e-05,0.000156,7.9e-05,0.000157,0.000101,5.4e-05,3.7e-05,6.2e-05,5.9e-05,3.8e-05,8.2e-05,6e-06,7.1e-05,9.8e-05,9.7e-05,2.8e-05,4.6e-05,4.7e-05,2.8e-05,8e-05,0.00019,6.3e-05,5.3e-05,0.000719,0.001086,0.000669,0.000294,0.001587,0.000604,0.000187,0.000147,4.9e-05,0.000403,0.00051,0.000296,0.000301,0.000444,0.000242,0.000132,8.7e-05,5.2e-05,0.000562,0.000311,0.000145,0.000148,9.7e-05,9.7e-05,6e-05,6.3e-05,0.000184,9.2e-05,8e-06,7.9e-05,6.6e-05,4.4e-05,0.000131,0.001267,0.000967,0.001001
0.000162,5.2e-05,0.000102,9.1e-05,0.000136,0.000105,6.1e-05,7.9e-05,8.4e-05,2.5e-05,0.000407,0.000448,0.000359,9.4e-05,6.5e-05,0.00015,0.000123,0.000147,9.4e-05,0.000249,0.000262,0.000253,0.000155,0.000126,8.1e-05,8.3e-05,9.3e-05,5.6e-05,1.5e-05,2e-05,6.2e-05,4.6e-05,3.1e-05,6.9e-05,0.000153,4.2e-05,3.8e-05,6.3e-05,5.3e-05,0.001199,0.001126,0.002527,0.000544,0.000637,0.00237,0.002806,0.001334,0.000347,0.000312,0.000876,0.000676,0.000935,0.000455,0.000803,0.000978,0.000792,0.000357,0.000494,0.000361,0.000149,1.3e-05,2.6e-05,6e-05,7.7e-05,1.1e-05,0.000151,9.2e-05,5.5e-05,2.3e-05,6.5e-05,1.8e-05,2.6e-05,1.1e-05,4.5e-05,2.2e-05,6.6e-05,5.7e-05,5.2e-05,7.2e-05,4.8e-05,5.2e-05,0.000202,0.000211,0.000169,4.1e-05,0.00068,0.001805,0.000956,0.000242,0.002012,0.00242,0.002022,0.001239,0.000661,0.000894,0.000616,0.000694,0.000482,0.000926,0.000923,0.000517,0.00019,6.3e-05,0.000641,0.000458,0.000425,0.000164,9.6e-05,0.000125,0.000114,2.1e-05,0.000288,0.000281,0.000202,0.000234,0.00012,9.4e-05,9.7e-05,0.001643,0.000467,3e-05
8e-05,0.000143,1.2e-05,0.000171,8.8e-05,2.2e-05,0.000142,8.1e-05,0.000145,3.8e-05,0.000741,0.000508,0.000131,8.5e-05,8.4e-05,2e-05,1.7e-05,8.1e-05,0.000137,0.000433,5.9e-05,0.000121,2.7e-05,3.9e-05,1.1e-05,6.8e-05,4.2e-05,1.9e-05,3.5e-05,2.2e-05,5.1e-05,2.6e-05,7e-06,3.9e-05,0.000114,4.4e-05,3.7e-05,2.5e-05,6.4e-05,0.001942,0.000897,0.002136,0.002715,0.001625,0.003573,0.001107,0.001713,0.000849,0.000254,0.001519,0.001056,0.000551,0.000331,0.000856,0.001768,0.000654,0.000597,0.000278,0.000283,0.000135,3.8e-05,4.7e-05,0.000114,4.7e-05,8.3e-05,0.000104,3.5e-05,2e-06,9e-06,3.6e-05,2.6e-05,3.6e-05,6.5e-05,5.1e-05,4.5e-05,2.8e-05,5.9e-05,4e-05,1e-05,2.8e-05,5.6e-05,0.000424,0.000261,0.000149,3.8e-05,0.000653,0.001634,0.001028,0.000964,0.001153,0.001223,0.000339,0.00022,6e-05,0.001088,0.000478,0.000445,0.000684,0.000775,0.000309,0.000159,0.000102,3.3e-05,0.000644,0.000524,0.000248,0.000143,4.3e-05,7.4e-05,9.5e-05,0.000131,0.000312,1.6e-05,0.00014,8.8e-05,6e-06,5.3e-05,0.000143,0.001939,0.001429,0.001664
0.000398,0.000358,0.000261,0.000243,0.00016,0.000119,0.000139,0.000119,0.000185,0.000106,0.001117,0.001366,0.000794,9.5e-05,4.5e-05,7.8e-05,3.9e-05,0.000119,0.00016,0.000578,0.000593,0.000369,0.000119,2.9e-05,3.9e-05,3.5e-05,8.1e-05,1.6e-05,3.1e-05,2.2e-05,8e-06,1.3e-05,3.4e-05,2.9e-05,0.000132,2.8e-05,5.5e-05,5.5e-05,6.1e-05,0.002827,0.001868,0.001908,0.000639,0.000237,0.003816,0.003914,0.001811,0.001178,0.000207,0.001757,0.001208,0.000992,0.000428,0.000957,0.002318,0.001713,0.00121,0.000879,0.000524,0.000202,7.2e-05,9.1e-05,8.5e-05,0.000214,0.000192,0.000179,7.5e-05,2.2e-05,1.3e-05,5.3e-05,7e-05,5.7e-05,7e-05,3.3e-05,6.6e-05,5.4e-05,2.1e-05,8e-06,3.4e-05,2.4e-05,5.6e-05,0.000729,0.000726,0.000435,0.00012,0.000664,0.00207,0.001687,0.000587,0.001724,0.000636,0.000167,0.000136,9.1e-05,0.001738,0.001024,0.000738,2e-04,0.000199,0.000255,6.9e-05,2.4e-05,3.6e-05,0.000632,0.000186,0.000408,0.000285,0.000131,0.000101,0.000111,0.000122,0.000333,0.000454,5.4e-05,7e-05,7.7e-05,1.2e-05,9.5e-05,0.002745,0.003463,0.001007
0.000136,0.000159,0.000103,4.6e-05,7.3e-05,4.1e-05,3.9e-05,8.6e-05,1e-05,9.4e-05,0.001346,0.001248,0.000493,0.000281,0.000184,9.5e-05,4.9e-05,0.000167,0.000264,0.000499,0.000708,0.000337,0.00011,0.000128,6.9e-05,4.3e-05,6.3e-05,8.1e-05,7.3e-05,2.2e-05,3.6e-05,2.4e-05,1.1e-05,1.5e-05,0.000174,0.000171,0.000104,0.000148,0.000142,0.003481,0.002364,0.004055,0.003575,0.001376,0.004473,0.002212,0.001176,0.000992,0.000991,0.002444,0.000405,0.000599,0.000736,0.001332,0.002791,0.004166,0.001818,0.001103,0.000629,0.000119,6.1e-05,0.000133,8.6e-05,0.000218,0.000189,0.00018,0.000112,3.9e-05,8e-06,4.5e-05,6.5e-05,4.7e-05,0.000128,0.000134,0.000103,5.3e-05,2.7e-05,2.6e-05,6e-05,5.8e-05,4.6e-05,0.000831,0.000184,0.000158,0.000257,0.000734,0.005168,0.002536,0.001497,0.00136,0.00073,0.000418,0.00023,0.000259,0.002646,0.001297,0.000817,0.000726,0.000909,0.000477,0.000251,6.6e-05,3.7e-05,0.000574,0.000544,0.000381,6.4e-05,5.4e-05,7e-05,0.000227,0.000104,0.000415,0.000498,0.000515,0.000254,0.000107,6.7e-05,4.7e-05,0.00314,0.004499,0.004013
0.000137,7.1e-05,5.3e-05,1.1e-05,6.6e-05,1e-04,7.6e-05,8e-05,0.000122,0.000144,0.001431,0.000359,0.000118,0.000452,0.00038,0.00019,0.000118,0.00022,0.000299,0.000457,0.000218,9.3e-05,7.2e-05,6.6e-05,6.3e-05,8.4e-05,6.9e-05,8.5e-05,3.1e-05,6.4e-05,6.1e-05,3.4e-05,1.3e-05,5.2e-05,0.000179,0.000276,0.000147,8.1e-05,0.000112,0.003959,0.002608,0.003654,0.002746,0.003007,0.002803,0.002773,0.001982,0.001106,0.00046,0.002482,0.002069,0.001045,0.000221,0.00091,0.003273,0.003779,0.003323,0.001532,0.000622,0.000375,0.000149,0.000125,0.000147,0.000145,7.5e-05,0.000158,0.000273,0.000183,4.8e-05,3.3e-05,1.9e-05,5.6e-05,0.000153,0.00012,3e-05,0.000134,0.000228,9.6e-05,4.3e-05,7.7e-05,8.2e-05,8e-04,0.000646,0.000369,0.000106,0.000497,0.007135,0.003709,0.001819,0.001206,0.001308,0.000489,0.000588,0.00031,0.002945,0.001938,0.000476,0.000871,8e-04,0.000279,0.000137,8.4e-05,7.1e-05,0.000446,0.00095,0.000604,0.000203,4.2e-05,4.3e-05,0.000234,0.000259,0.000384,0.000107,0.000454,0.000401,0.000169,0.000181,0.000131,0.003089,0.003194,0.000767
7.6e-05,0.000119,6.4e-05,4.6e-05,4.1e-05,1.7e-05,4.3e-05,9e-05,6.5e-05,4.3e-05,0.00129,0.00078,0.000388,0.000233,0.000174,0.000173,0.000113,0.000225,0.000183,0.000496,0.000375,0.000158,7.2e-05,2.3e-05,8.4e-05,2.1e-05,6.7e-05,7.4e-05,8.4e-05,4e-05,3.9e-05,2.7e-05,4.9e-05,9.2e-05,6.6e-05,0.00022,0.000139,0.000101,5.5e-05,0.003762,0.005433,0.00317,0.001501,0.004161,0.004446,0.000819,0.00194,0.000691,0.001058,0.00271,0.001456,0.000619,0.000468,0.001363,0.002355,0.001751,0.00098,0.000616,0.000292,0.000137,0.000151,0.00017,0.000109,0.000226,0.000147,0.000103,0.000235,8.9e-05,5.4e-05,8e-06,5.2e-05,4.4e-05,0.000125,4.4e-05,2.5e-05,0.000291,0.000121,8.5e-05,7.3e-05,7.5e-05,0.000114,0.000679,0.00043,0.000172,0.000151,0.00069,0.006197,0.003067,0.000773,0.002422,0.000189,8.5e-05,0.000367,0.000178,0.002951,0.001977,0.001377,0.00061,0.000287,7.9e-05,9.8e-05,4.6e-05,4.3e-05,0.000621,0.001102,0.000465,0.000126,1.1e-05,5.4e-05,0.000166,6.3e-05,0.000601,0.000158,0.000542,0.000279,0.000124,0.000183,1.8e-05,0.002949,0.002002,0.001117
0.000137,7.6e-05,3e-05,4e-05,7.4e-05,5.5e-05,3.9e-05,6.5e-05,9.2e-05,4.8e-05,0.001001,0.000599,0.000529,0.000287,0.000123,0.000142,9.3e-05,0.000185,0.000516,0.000598,0.000233,1.3e-05,9e-05,7.1e-05,5.1e-05,2.9e-05,0.000123,8.8e-05,2.2e-05,4.6e-05,3.2e-05,4.1e-05,9.2e-05,0.000123,0.000119,0.000142,0.000117,0.000106,7.5e-05,0.003068,0.003252,0.003251,0.002067,0.005228,0.004964,0.003296,0.003082,0.001859,0.001054,0.003073,0.002234,0.001517,0.000557,0.001297,0.002771,0.00146,0.001874,0.00065,0.000503,0.000448,0.000192,0.000129,7.2e-05,0.00025,0.000188,0.000248,0.000217,0.00011,5.7e-05,7.3e-05,9.9e-05,7.1e-05,0.000113,5.8e-05,6e-05,0.000358,0.000463,0.000323,9.7e-05,6e-05,0.000107,0.000326,0.000155,0.000228,0.00032,0.000538,0.002999,0.004826,0.004364,0.001633,0.001516,0.00095,0.000261,0.000121,0.002118,0.001172,0.000359,0.000612,0.00058,0.000195,4.7e-05,9.4e-05,3e-05,0.001224,0.00115,0.000436,3.5e-05,4.5e-05,4.1e-05,0.000131,0.000121,0.000724,0.000693,0.000376,0.000193,0.000148,0.000306,0.00024,0.002621,0.002831,0.001727
0.00016,0.000107,1.9e-05,4.5e-05,4.5e-05,5.5e-05,2e-05,8.5e-05,0.000145,0.000125,0.000673,0.000505,0.000234,0.000166,0.000183,0.000112,4.3e-05,0.000209,0.000494,0.00035,0.000152,7.6e-05,5e-05,7e-05,5.5e-05,2.7e-05,9.4e-05,5.8e-05,3.1e-05,3.7e-05,6.6e-05,5.8e-05,7.2e-05,0.000118,4.8e-05,0.000141,8.7e-05,0.000145,0.000102,0.002024,0.002645,0.002894,0.00168,0.005064,0.002857,0.002618,0.003055,0.001324,0.000432,0.001343,0.000945,0.000321,0.00021,0.001196,0.00318,0.001003,0.001926,0.001617,0.000566,0.000105,0.000111,0.000158,1e-04,0.000382,2.7e-05,0.000178,9e-05,2.7e-05,3.9e-05,3.6e-05,5.2e-05,4e-05,2.3e-05,5.3e-05,6e-05,0.000315,0.000289,0.000113,5.2e-05,4.4e-05,0.000102,0.000248,0.000189,0.000316,0.000153,0.000277,0.001028,0.004155,0.002139,0.001562,0.001774,0.000941,0.000191,9.6e-05,0.001105,0.000466,4.2e-05,0.000532,0.00031,0.000303,0.000128,3e-05,9.8e-05,0.001754,0.00107,0.000514,0.000178,9.3e-05,4.3e-05,0.000108,0.000137,0.000641,0.000379,0.000227,0.000162,0.00016,0.000304,0.000113,0.002152,0.002173,0.001057
6.1e-05,1.6e-05,2e-05,3.1e-05,2.9e-05,4.2e-05,2.2e-05,6.4e-05,6.8e-05,1.5e-05,0.000451,9.1e-05,0.000277,0.00019,3.1e-05,4.2e-05,5e-06,0.00017,0.000202,9e-05,0.000109,1.5e-05,1.9e-05,4e-05,8e-06,2.4e-05,3.2e-05,7e-06,2.8e-05,6e-06,2.8e-05,2e-05,1.8e-05,1.6e-05,8e-06,7.8e-05,1.6e-05,8.4e-05,3.6e-05,0.001257,0.001759,0.000722,0.000375,0.003014,0.000905,0.00103,0.000549,0.000335,0.00015,0.000888,0.000485,0.000177,0.000111,0.001298,0.001533,0.001835,0.000364,0.000358,0.000105,2.9e-05,0.00011,0.000108,4.1e-05,0.000365,0.000207,2.8e-05,5e-05,3e-05,4.4e-05,4.5e-05,1.2e-05,6e-06,3.5e-05,2.3e-05,4.8e-05,0.000162,5.9e-05,2.6e-05,1.5e-05,5.8e-05,1.1e-05,0.000116,4e-05,0.000117,3.2e-05,0.000394,0.001998,0.002706,0.00049,0.001199,0.00035,0.000168,0.000131,0.00011,0.000661,0.000477,0.000243,0.000373,0.000138,7.4e-05,2e-06,2.8e-05,4.5e-05,0.001611,0.000561,0.000449,0.000121,2.6e-05,3.6e-05,1.7e-05,0.000122,0.000393,0.000175,0.000202,0.000131,3e-05,0.000171,0.000115,0.001464,0.000903,9.3e-05
5.4e-05,4.4e-05,3.8e-05,9e-06,3e-06,3.1e-05,2.6e-05,4.5e-05,4e-05,2.9e-05,0.000211,0.000199,0.000148,9.9e-05,6.7e-05,8e-05,6.4e-05,0.000154,0.000232,5.8e-05,3.6e-05,3.6e-05,3.4e-05,9e-06,2.5e-05,3.5e-05,3.1e-05,9e-06,2e-05,1.9e-05,1.2e-05,2.1e-05,2.1e-05,6.8e-05,1.8e-05,2.6e-05,4.3e-05,5e-05,4.3e-05,0.00117,0.00029,0.000695,0.000414,0.001343,0.000523,0.000645,0.000947,0.000887,0.00059,0.001524,0.00092,0.000675,0.000282,0.001275,0.001316,0.000919,0.00045,8.4e-05,7.2e-05,1.1e-05,0.000106,9.9e-05,4.6e-05,0.000309,0.000209,9.3e-05,5.4e-05,3.1e-05,5.1e-05,4.6e-05,1.6e-05,1.4e-05,1.5e-05,2.7e-05,3.9e-05,8.3e-05,6.6e-05,7e-06,2.3e-05,4.5e-05,3e-05,0.000191,0.000113,4.7e-05,3.7e-05,0.000507,0.002084,0.000907,0.000648,0.00029,0.000287,1.9e-05,9.3e-05,5e-05,0.000784,0.000515,0.000221,0.000225,0.000117,6e-05,1.8e-05,2.6e-05,3.4e-05,0.001085,0.000616,0.000354,9.5e-05,6.5e-05,2.2e-05,2.6e-05,9.8e-05,0.000284,0.000104,0.000172,4.5e-05,6.5e-05,0.000115,4.5e-05,0.000931,0.00037,0.000297
7.5e-05,8.6e-05,4.4e-05,1.4e-05,3.1e-05,2e-05,3.1e-05,2.8e-05,2e-05,2.5e-05,0.000275,0.000131,0.00018,0.000176,3.9e-05,5.3e-05,3.4e-05,9.4e-05,1e-04,0.000198,4.2e-05,2.4e-05,3e-05,1.6e-05,1.2e-05,1.6e-05,1.4e-05,2e-05,1.9e-05,1e-05,6e-06,1.5e-05,2.2e-05,6.6e-05,8.4e-05,3.8e-05,5.4e-05,5.9e-05,5.1e-05,0.001247,0.001081,0.000424,0.001298,0.00148,0.000459,0.000744,0.00082,0.000459,0.000223,0.001685,0.000817,0.000209,0.000127,0.001267,0.001499,0.001082,0.00102,0.000269,3.1e-05,1.5e-05,8.1e-05,9.9e-05,5.5e-05,0.000269,0.000252,0.000347,0.000159,5.9e-05,6.4e-05,2.7e-05,3.5e-05,1.9e-05,1.7e-05,7e-06,4.6e-05,3.5e-05,2.5e-05,1.6e-05,1.4e-05,4.3e-05,2.7e-05,0.000281,5.7e-05,4.5e-05,5e-05,0.000465,0.002228,0.00076,0.001299,0.000993,0.000284,0.000175,1.5e-05,9.2e-05,0.000937,0.001122,0.000448,0.000323,0.000121,0.000188,5.9e-05,3.3e-05,2.7e-05,0.000488,0.000119,0.00021,3.8e-05,4.6e-05,3.3e-05,4.9e-05,0.000138,0.000166,0.000105,0.000101,0.000183,0.000102,8.2e-05,6.8e-05,0.000889,0.000819,0.000354
7.7e-05,4.1e-05,4.3e-05,3.5e-05,6e-05,2.9e-05,2.5e-05,5.3e-05,2.9e-05,2.6e-05,0.000521,0.000364,7.2e-05,7.8e-05,0.000126,3.8e-05,7e-06,6.4e-05,1.5e-05,0.000328,0.000315,6.7e-05,3.5e-05,1.1e-05,1.7e-05,2.3e-05,7e-06,1.9e-05,2.9e-05,2.9e-05,1.8e-05,2.1e-05,1.6e-05,2.8e-05,9.7e-05,3.5e-05,4.9e-05,4.6e-05,3.5e-05,0.001269,0.001361,0.001427,0.000828,0.000185,0.000644,0.000986,0.001506,0.00153,0.000594,0.001573,0.001582,0.000424,0.000358,0.001121,0.00023,0.001445,0.000458,0.000549,0.000288,0.000101,4.1e-05,8e-06,1.7e-05,0.000287,0.00024,0.000154,8.3e-05,3.4e-05,3.5e-05,4.8e-05,5e-05,2.8e-05,2.8e-05,1.8e-05,4e-05,6.4e-05,3.8e-05,1.9e-05,1.5e-05,5.7e-05,2.1e-05,0.000373,0.000389,0.000152,6.6e-05,0.000415,0.001503,0.001923,0.001011,0.000231,0.000539,0.000414,0.000121,8.4e-05,0.001219,0.000677,6.8e-05,0.000334,0.000397,4.4e-05,4.4e-05,1.6e-05,2e-05,0.00036,0.000797,0.000483,0.000227,0.000129,1.6e-05,1.5e-05,0.000138,0.000247,7.1e-05,0.000134,3.5e-05,3.4e-05,9.1e-05,0.00013,0.001123,0.000542,0.000531
0.000102,0.000119,5.1e-05,1.7e-05,4.8e-05,4.3e-05,4.3e-05,4e-05,4.1e-05,6.6e-05,0.00066,0.000703,0.000483,0.000217,7.9e-05,5.8e-05,2.7e-05,9.7e-05,0.000106,0.00034,0.000268,0.00022,5.3e-05,2.6e-05,1.8e-05,5e-05,6.3e-05,2.9e-05,3.3e-05,3.9e-05,2.5e-05,1.6e-05,1.9e-05,5.8e-05,0.00011,6.4e-05,3.4e-05,6.6e-05,9e-05,0.001503,0.000971,0.000338,0.000466,0.001983,0.00168,0.002171,0.002484,0.001128,0.000781,0.000719,0.000702,0.001075,0.000811,0.001271,0.001433,0.002766,0.002368,0.001452,0.00067,0.000222,0.000108,7.7e-05,6.5e-05,0.000218,9.5e-05,0.000186,0.000215,0.000137,3e-05,1.7e-05,1.8e-05,3e-05,2.2e-05,2.1e-05,3.4e-05,6.6e-05,5.3e-05,2.3e-05,5e-06,7.2e-05,8e-05,0.000386,0.000488,0.000353,0.000243,0.000401,0.001275,0.00287,0.001754,0.001234,0.000806,0.000457,0.000193,6.9e-05,0.000894,0.000708,0.00068,0.000691,0.000604,0.000345,0.000209,0.000125,7.1e-05,0.000572,0.001371,0.000692,0.000303,7.2e-05,4.4e-05,7.3e-05,0.000124,0.000189,0.000372,0.000319,0.000125,9.4e-05,0.000263,0.000247,0.001147,0.000856,0.000253
0.000212,7.3e-05,2.8e-05,3.6e-05,3.5e-05,1.9e-05,3.9e-05,3.7e-05,1e-05,5.7e-05,0.000532,0.000306,0.00012,0.00016,2.7e-05,8e-05,5e-05,0.000185,0.000218,0.000429,9.1e-05,0.000104,8.9e-05,9e-06,3.9e-05,4.2e-05,7.1e-05,5.3e-05,4.6e-05,3.7e-05,1.9e-05,6e-06,2.5e-05,9.2e-05,0.00013,8.3e-05,7.1e-05,0.000107,9.5e-05,0.002226,0.00041,0.001388,0.001343,0.00246,0.002973,0.002674,0.000764,0.000997,0.000906,0.001361,0.000824,0.001364,0.000722,0.001248,0.000297,0.002044,0.001543,0.00051,0.000251,0.000118,8.1e-05,0.000105,3.7e-05,0.000197,0.000124,8e-05,7.7e-05,1.6e-05,1.7e-05,4.9e-05,2.4e-05,1e-05,5e-05,1.1e-05,4.7e-05,6.5e-05,9e-06,4.8e-05,5.5e-05,5.7e-05,1.8e-05,0.000168,0.000107,2.1e-05,9e-05,0.000418,0.001433,0.002104,0.002791,0.001479,0.000571,0.000263,9.6e-05,6.1e-05,0.000955,0.000917,2e-04,0.000221,0.000176,0.000133,7.3e-05,6.8e-05,2.1e-05,0.001069,0.000528,0.000499,0.000301,0.000111,2.5e-05,6.9e-05,0.00019,9.6e-05,0.000191,4.1e-05,0.00017,0.00018,3e-04,0.000121,0.001197,0.001121,0.000213
0.000142,1e-05,1.7e-05,2.3e-05,5e-06,5.2e-05,5.1e-05,5.2e-05,2e-05,5.5e-05,0.000294,0.000286,0.000382,9.9e-05,0.000129,0.000108,0.000105,0.000197,0.000232,0.000195,0.000243,9.7e-05,2e-05,8.4e-05,4.3e-05,6.2e-05,5.7e-05,9.9e-05,1.8e-05,2.6e-05,3.5e-05,1.5e-05,2.6e-05,0.000132,7.9e-05,0.000127,0.000176,2.1e-05,2.6e-05,0.00273,0.002023,0.001722,0.003016,0.002389,0.004219,0.002738,0.000297,0.001851,0.001211,0.003382,0.00322,0.000992,0.000809,0.00117,0.002977,0.002134,0.000581,0.000387,0.000185,0.000159,8.1e-05,7.9e-05,3.5e-05,0.000147,0.000153,0.000112,0.000122,6.3e-05,5.6e-05,7e-05,4.4e-05,5e-05,8.7e-05,9.8e-05,2.3e-05,0.000148,0.000133,2.8e-05,5.2e-05,9.7e-05,0.000117,0.000182,1e-04,9e-05,8e-05,0.000363,0.001979,0.001026,0.002483,0.001712,0.002036,0.001086,0.000353,0.000107,0.002333,0.002035,0.001549,0.001193,0.00054,0.000225,7.4e-05,8.3e-05,6.7e-05,0.001501,0.001405,0.000772,0.000227,6.5e-05,2.1e-05,3.7e-05,0.00018,0.000385,0.000247,9.8e-05,0.000181,0.000207,0.000211,0.000207,0.000867,0.002318,0.001646
0.000176,0.000178,0.000123,6.3e-05,6.6e-05,0.000108,4e-05,7.6e-05,5.8e-05,4e-05,9.3e-05,0.000691,0.000195,0.000122,0.000169,0.00019,0.000104,0.000288,0.000618,0.000439,0.000179,0.000244,6.6e-05,0.000112,7.7e-05,0.000134,6.7e-05,8.6e-05,9.3e-05,6e-05,4.5e-05,5.7e-05,8.2e-05,9.1e-05,0.000153,0.000188,2.7e-05,2.5e-05,4.3e-05,0.002893,0.004976,0.005697,0.001946,0.001966,0.002829,0.005024,0.004338,8.4e-05,0.001007,0.00365,0.002044,0.001836,0.000436,0.000719,0.005213,0.005389,0.003094,0.001377,0.000217,0.000206,0.000169,4.6e-05,4.5e-05,0.000178,0.000552,0.000274,0.000189,9.8e-05,6.3e-05,7.5e-05,3.8e-05,4.3e-05,0.000138,0.000147,1e-04,8.2e-05,7.4e-05,6e-05,5.1e-05,0.000102,5.1e-05,0.000382,0.000346,0.000117,0.000138,0.000459,0.00397,0.003957,0.003062,0.002648,0.001894,0.000699,0.00016,6.6e-05,0.003173,0.001407,0.000773,0.00074,0.000386,0.000218,4.7e-05,4.4e-05,5.5e-05,0.001617,0.000904,0.000292,7.4e-05,2.2e-05,1.9e-05,8.9e-05,0.000203,0.000934,0.000337,0.000211,0.000244,8.3e-05,6e-05,9.4e-05,0.000788,0.00341,0.002308
0.000268,0.000157,4.5e-05,6e-06,6.2e-05,0.000158,0.000136,6.7e-05,1.4e-05,3.2e-05,0.00015,0.000726,0.000559,0.00035,5.5e-05,0.000101,0.000104,0.000341,0.000689,0.000177,0.000379,0.000143,0.000162,5.1e-05,0.000107,0.000132,0.000173,0.000135,0.00013,3.4e-05,3.8e-05,3.7e-05,6.2e-05,0.000133,6e-05,0.000107,0.000131,0.000138,8.6e-05,0.002701,0.005201,0.002818,0.002167,0.002741,0.003424,0.004034,0.000461,0.00197,0.000604,0.002827,0.002061,0.001009,0.001088,0.000582,0.005192,0.003215,0.002037,0.000814,0.000451,0.000245,0.000207,0.000189,7.5e-05,0.000216,0.000861,0.000433,0.000117,6.2e-05,4.6e-05,5.2e-05,6.4e-05,5.6e-05,7e-05,2.9e-05,2.1e-05,6.4e-05,3.8e-05,4.9e-05,2.5e-05,8.1e-05,8.8e-05,0.000442,2.4e-05,0.000142,0.000325,0.000189,0.004684,0.003787,0.002813,0.003481,0.001521,0.000458,8.1e-05,3.2e-05,0.003194,0.00313,0.001587,0.000907,0.000308,0.00013,0.000158,6.5e-05,5.4e-05,0.001393,0.000725,0.00029,0.000106,6e-05,1.2e-05,0.000119,0.000256,0.001101,0.001003,0.000378,0.000188,0.000111,9.3e-05,8.1e-05,0.000468,0.003212,0.001522
0.000308,0.000175,6.3e-05,6.2e-05,9.6e-05,5.2e-05,1e-04,9.5e-05,6.6e-05,3.9e-05,0.000339,0.000662,0.000508,0.000349,9.4e-05,0.000128,0.000146,0.000232,0.000378,0.000397,0.00041,0.000342,0.000161,0.000109,7.2e-05,9e-05,0.000191,7e-05,5.1e-05,0.000105,5.2e-05,3.5e-05,0.000118,9.8e-05,0.000114,5.9e-05,0.000139,0.000254,9.6e-05,0.00219,0.002483,0.002593,0.003831,0.001532,0.003101,0.001597,0.002649,0.002418,0.001782,7e-04,0.002891,0.002989,0.00175,0.001013,0.003255,0.007218,0.004717,0.002107,0.000594,0.000214,0.000118,7.7e-05,9.2e-05,0.000263,0.000643,0.000495,0.000268,3e-05,2e-05,6.5e-05,5.6e-05,4.7e-05,3.2e-05,3.9e-05,4.3e-05,3.3e-05,6.1e-05,4.9e-05,3.5e-05,2e-05,6.6e-05,0.000519,0.000375,7.1e-05,0.000189,0.000323,0.004016,0.00198,0.002911,0.003058,0.001298,0.000541,0.000291,7.4e-05,0.002223,0.002559,0.0017,0.001062,0.000449,0.000478,0.00025,0.000155,7.8e-05,0.001462,0.000831,0.00066,0.000233,7.9e-05,2.7e-05,0.000104,6.8e-05,0.000861,0.000187,0.000345,0.000218,0.000184,0.000287,0.000146,0.000179,0.002696,0.001968
0.000172,8.1e-05,3.4e-05,6e-05,3e-05,7.1e-05,5.5e-05,4.6e-05,5.9e-05,2.2e-05,0.000566,7.9e-05,0.000293,0.000365,0.000219,0.000153,7.8e-05,0.000232,0.000407,0.00037,0.000103,8.7e-05,5.6e-05,0.000105,2.5e-05,7.3e-05,0.000203,0.000137,5e-05,2.3e-05,3.6e-05,2.4e-05,0.000124,1.6e-05,9.2e-05,0.000137,0.000122,0.000207,0.000281,0.001334,0.000595,0.001461,0.00229,0.00048,0.002021,0.001073,0.000936,0.001159,0.00027,0.000937,0.002298,0.000909,0.000508,0.000634,0.00177,0.002907,0.000714,0.000183,0.000208,0.000121,6.9e-05,0.000113,2.1e-05,0.000236,0.000369,0.000358,0.000143,0.000118,8.5e-05,5.1e-05,6.7e-05,6.7e-05,4.2e-05,2.1e-05,5.7e-05,7.8e-05,8.5e-05,7.1e-05,2.4e-05,2.9e-05,7.2e-05,0.000516,0.000387,0.000334,0.000215,0.000268,0.002244,0.000928,0.00319,0.002591,0.001667,0.000522,4.7e-05,5.2e-05,0.000881,0.001181,0.000561,0.000397,7.5e-05,0.000192,5.4e-05,9.8e-05,2.3e-05,0.001677,0.000608,0.000464,0.000199,4e-05,3.6e-05,7.6e-05,0.000161,0.000567,0.000466,0.000364,0.000156,0.000147,0.000232,0.000139,0.000544,0.001719,0.000544
0.000122,0.00011,7.2e-05,4.5e-05,4.1e-05,4.3e-05,1e-05,2.4e-05,5.4e-05,2.7e-05,0.000371,0.00034,0.000178,8e-05,6.1e-05,9.8e-05,6.6e-05,8.7e-05,0.000167,4.2e-05,3.3e-05,3.8e-05,2e-05,3e-05,3.2e-05,5.2e-05,7.5e-05,2.8e-05,6.2e-05,3.8e-05,3e-06,7e-06,4.4e-05,5.2e-05,7.1e-05,7.5e-05,5.4e-05,1.4e-05,9.2e-05,5e-04,0.000162,0.001046,0.000996,0.001512,0.000514,0.000988,0.000961,0.000512,0.000346,0.000955,0.001617,0.000993,0.000416,0.000307,0.000448,0.001227,0.000856,0.00031,3.8e-05,5.2e-05,4.7e-05,3.1e-05,3.6e-05,7.2e-05,9.5e-05,6.2e-05,3.9e-05,6.5e-05,3.3e-05,3.2e-05,3.9e-05,3e-06,2.2e-05,2.8e-05,5.4e-05,4.2e-05,6e-06,2.5e-05,4e-05,4.1e-05,4.5e-05,0.000207,0.000128,7.3e-05,5.6e-05,0.000141,0.000392,0.000595,0.002131,0.001442,0.000433,6.3e-05,1e-05,2.9e-05,0.000272,0.000369,0.000172,0.000248,0.000163,4.1e-05,1.6e-05,3.7e-05,3.2e-05,0.000852,0.000865,0.000357,9e-05,1.3e-05,5e-06,2.1e-05,7.1e-05,0.000183,7.2e-05,5.8e-05,2.6e-05,8e-06,0.00014,0.00014,0.000426,0.000811,0.000376
8.7e-05,2e-05,1.3e-05,5e-06,1.8e-05,3e-06,1.3e-05,2e-05,3.9e-05,3.6e-05,0.000424,0.000243,6.3e-05,5e-05,5.8e-05,9.8e-05,4.9e-05,2e-05,0.000137,0.000101,3.9e-05,1.9e-05,4e-06,2.4e-05,1.8e-05,3.4e-05,2.8e-05,3e-05,4.7e-05,2.4e-05,1.1e-05,1.1e-05,1.3e-05,4e-05,8e-06,4.1e-05,2.3e-05,4.7e-05,9.5e-05,0.000306,0.00015,0.000942,0.000215,0.000871,0.000608,0.000812,0.000121,0.000354,1e-04,0.001068,0.000905,0.000281,2.4e-05,0.000241,0.000156,0.000363,0.000457,0.000249,6.7e-05,2.9e-05,7e-06,5e-06,1.6e-05,8.5e-05,0.000123,0.000106,4e-05,1.6e-05,1.4e-05,1e-06,1.3e-05,2.1e-05,2.4e-05,2.6e-05,1.7e-05,1.6e-05,2.1e-05,2.4e-05,2.1e-05,1.8e-05,3.6e-05,0.000197,9e-05,2.7e-05,4.5e-05,0.000111,0.000113,0.00058,0.001199,0.000278,0.000112,1.6e-05,1.9e-05,3.4e-05,0.000482,0.000245,0.000224,0.000119,6.1e-05,1.8e-05,4e-06,2.7e-05,8e-06,0.000766,0.000543,0.000258,5.8e-05,1.6e-05,6e-06,2e-05,6.4e-05,2.9e-05,7.7e-05,0.000174,0.000159,6.4e-05,0.000174,9.6e-05,0.000387,0.000866,0.000511
3.1e-05,4.1e-05,1.8e-05,1.3e-05,5e-06,1.4e-05,4e-06,2e-05,1.9e-05,2.3e-05,0.000354,0.000158,7.3e-05,2e-05,5.3e-05,1.1e-05,1.6e-05,3e-05,0.000115,0.000132,8.3e-05,1.8e-05,1.4e-05,1.6e-05,1.1e-05,5.1e-05,3.3e-05,7e-06,9e-06,9e-06,7e-06,7e-06,6e-06,4.3e-05,4.6e-05,5.2e-05,5.3e-05,4e-05,1.7e-05,0.000269,0.000221,0.000704,5e-04,0.000416,0.000315,0.000242,0.000222,0.000112,0.000116,0.000863,0.000335,0.000179,0.00012,0.000183,0.000265,0.000332,0.00022,0.000122,3.7e-05,3.1e-05,5e-06,8e-06,1.2e-05,0.000101,0.000176,0.000115,7.7e-05,3.8e-05,1.8e-05,1.3e-05,1.1e-05,1.6e-05,1.6e-05,1.4e-05,2.2e-05,8e-06,5e-06,8e-06,3e-05,3.4e-05,2e-05,0.000135,8.6e-05,6.9e-05,2.7e-05,9.4e-05,0.000242,0.00034,0.000514,0.000105,8.1e-05,3.9e-05,2.2e-05,3.2e-05,0.000453,0.000161,0.000204,4.2e-05,7e-05,5.8e-05,1.5e-05,1.4e-05,9e-06,0.000558,0.000182,6.6e-05,3.5e-05,2.7e-05,8e-06,1e-05,6.2e-05,5.3e-05,0.000106,9.6e-05,2.1e-05,3.1e-05,0.000171,6.3e-05,0.000487,0.000485,0.000161
2.1e-05,3.1e-05,2.7e-05,1.2e-05,1.8e-05,2.7e-05,1.1e-05,8e-06,1.9e-05,1.1e-05,0.000259,7.6e-05,7.2e-05,6.9e-05,2.6e-05,1.8e-05,1.5e-05,5.4e-05,1.4e-05,8.8e-05,9.2e-05,4.3e-05,2.5e-05,1.2e-05,6e-06,5.3e-05,5.6e-05,4.1e-05,2.5e-05,5e-06,3e-06,4e-06,9e-06,2.5e-05,2.8e-05,4.4e-05,2.6e-05,6.2e-05,4.3e-05,0.000214,0.000202,0.000107,0.000313,0.000368,0.000313,7.4e-05,0.000147,0.000115,3.2e-05,0.000529,8.1e-05,8.2e-05,1.3e-05,0.000148,0.000405,7.3e-05,0.000241,8.6e-05,6.1e-05,2.7e-05,3.4e-05,2.5e-05,6e-06,0.000122,0.00016,6.6e-05,3.1e-05,1.5e-05,7e-06,1e-05,4e-06,5e-06,1.6e-05,5e-06,1.1e-05,2e-05,9e-06,9e-06,3e-05,2.2e-05,2.2e-05,7.9e-05,5.3e-05,3.8e-05,4.1e-05,1e-04,0.000287,0.000309,0.000547,0.000421,8e-05,3.2e-05,4.8e-05,1e-06,0.000271,0.000172,8.4e-05,4.1e-05,5.2e-05,2.4e-05,7e-06,1e-05,6e-06,0.000334,9.6e-05,8e-06,1e-06,8e-06,2e-05,5e-06,5.7e-05,0.000115,4.5e-05,5e-05,1.7e-05,2.5e-05,0.000131,0.000101,0.000493,0.000403,0.000313
2.7e-05,3.7e-05,1.8e-05,2.1e-05,1.1e-05,1.8e-05,1.2e-05,1.7e-05,1.5e-05,2.2e-05,0.00016,0.000116,7.6e-05,4e-05,1.9e-05,2e-05,1.6e-05,6.6e-05,4.6e-05,6.5e-05,4.6e-05,1.9e-05,7e-06,2e-06,1.5e-05,2.4e-05,7.5e-05,5.6e-05,2.2e-05,1e-05,1e-05,3e-06,7e-06,1.5e-05,3.4e-05,2.3e-05,2.5e-05,6.5e-05,2e-05,0.000136,0.000246,0.000292,0.000258,6.6e-05,0.000639,0.000477,0.000258,4.7e-05,0.000114,0.000254,0.00012,0.000187,8.5e-05,0.000125,0.000343,0.00053,0.000316,0.000163,9.9e-05,5.5e-05,6.5e-05,2e-05,4e-06,0.000109,0.000164,9.5e-05,4.6e-05,1.4e-05,9e-06,4e-06,6e-06,1.1e-05,4e-06,1e-06,1.1e-05,2.4e-05,1.8e-05,4e-06,1.7e-05,1.4e-05,3.3e-05,6.1e-05,3.8e-05,1.2e-05,5.1e-05,0.000139,0.000278,0.000243,0.000731,0.000257,0.000187,7e-05,1.7e-05,3.1e-05,1e-04,0.00024,0.000154,5.7e-05,3.4e-05,2.5e-05,9e-06,1.4e-05,5e-06,0.000182,0.000113,5e-05,2.3e-05,3e-06,1.5e-05,1.8e-05,6.1e-05,0.000157,0.000155,0.000133,7.4e-05,2.2e-05,9.5e-05,6.7e-05,0.00053,0.000317,6.7e-05
1.5e-05,2.5e-05,2.2e-05,1e-05,1.7e-05,6e-06,1.5e-05,8e-06,1.9e-05,2.3e-05,6.9e-05,9.5e-05,3.6e-05,1.9e-05,8e-06,2.8e-05,3e-06,8.3e-05,9e-06,7.1e-05,2.1e-05,1.7e-05,6e-06,5e-06,2e-05,3.8e-05,6e-05,2.1e-05,1.9e-05,1.7e-05,9e-06,4e-06,3e-06,1.3e-05,2.1e-05,1.2e-05,2.7e-05,3.8e-05,1.6e-05,7.9e-05,0.000234,0.000645,5e-05,8.3e-05,0.000461,0.00018,9.6e-05,0.000188,6.9e-05,0.000188,0.000146,4.1e-05,6.6e-05,4.4e-05,0.000156,0.000198,0.000164,0.00011,3.7e-05,1.5e-05,1e-05,1.6e-05,2e-06,9.3e-05,9.1e-05,2.7e-05,2e-05,9e-06,4e-06,5e-06,5e-06,7e-06,7e-06,4e-06,4e-06,1.5e-05,8e-06,1e-05,6e-06,1.7e-05,1.5e-05,1.7e-05,8e-06,2.3e-05,4.3e-05,5.4e-05,0.000311,0.000134,0.000569,0.000275,5e-05,2.7e-05,4.2e-05,1e-05,0.000162,0.000183,8.9e-05,1.9e-05,2.1e-05,1e-05,1.6e-05,4e-06,3e-06,0.000131,9.4e-05,3.7e-05,1.1e-05,9e-06,1.9e-05,2.2e-05,7.2e-05,0.000113,1.4e-05,4.4e-05,2.9e-05,3.2e-05,9.4e-05,6.2e-05,0.000555,5.6e-05,8.4e-05
1.8e-05,1.1e-05,4e-06,7e-06,3e-06,1.5e-05,1.6e-05,6e-06,1.3e-05,7e-06,2.8e-05,4.5e-05,1.9e-05,1.4e-05,2.2e-05,4.8e-05,2e-05,7.6e-05,6.5e-05,5.2e-05,2.3e-05,2e-05,6e-06,9e-06,9e-06,1.7e-05,2e-05,1.6e-05,2.8e-05,2.3e-05,1e-05,4e-06,3e-06,1.5e-05,2e-05,9e-06,2.5e-05,3.4e-05,1.3e-05,0.000194,0.000103,0.000463,0.000631,0.000498,0.000511,0.000512,0.000393,0.000369,0.000238,0.000201,5.3e-05,6.2e-05,2.9e-05,3.3e-05,0.000325,0.00052,0.00031,9.1e-05,2e-05,2e-05,9e-06,5e-06,2e-06,8.9e-05,4.9e-05,1.8e-05,1e-05,7e-06,8e-06,3e-06,4e-06,2e-06,6e-06,5e-06,3e-06,6e-06,6e-06,6e-06,7e-06,1.4e-05,1.2e-05,6e-06,4e-06,1.9e-05,3.7e-05,8.6e-05,0.00033,1.8e-05,0.00033,0.000329,0.000108,3.7e-05,2.6e-05,3.1e-05,2e-04,0.000163,0.000115,8.9e-05,6.3e-05,3.6e-05,2.5e-05,2.7e-05,1.1e-05,0.000112,0.000127,7.2e-05,2.3e-05,9e-06,1.2e-05,8e-06,4.9e-05,3.1e-05,6.3e-05,4.5e-05,3.3e-05,1.8e-05,6.9e-05,1.6e-05,0.000511,0.000175,7e-05
1.3e-05,1.5e-05,1.6e-05,1e-05,1.1e-05,6e-06,8e-06,1.5e-05,1.6e-05,1.1e-05,3.2e-05,5.7e-05,5.9e-05,2.9e-05,3.5e-05,2.7e-05,2.2e-05,7.3e-05,8.9e-05,7.4e-05,2.8e-05,9e-06,6e-06,3e-06,5e-06,2e-05,1.8e-05,1e-06,1.4e-05,4e-06,7e-06,5e-06,5e-06,6e-06,1.6e-05,2.2e-05,2.9e-05,3.2e-05,1e-05,0.000274,0.000322,9.7e-05,0.000492,0.00033,0.000461,0.000221,0.000244,0.000148,3.7e-05,0.000296,0.000171,9.6e-05,5.3e-05,4e-05,0.000353,0.000513,0.000236,0.00013,3.6e-05,1.2e-05,9e-06,8e-06,6e-06,6.8e-05,9.7e-05,2.7e-05,1.7e-05,2.4e-05,6e-06,6e-06,5e-06,7e-06,6e-06,4e-06,7e-06,7e-06,6e-06,7e-06,5e-06,1.3e-05,1.1e-05,2.3e-05,6e-06,1.3e-05,1.8e-05,0.000145,0.00022,2.8e-05,7.4e-05,0.000257,0.000166,4.1e-05,1.7e-05,2.3e-05,0.000209,0.000117,1.9e-05,6.6e-05,4.6e-05,2.2e-05,2.3e-05,2.2e-05,1.5e-05,0.000129,0.000142,5.4e-05,6e-06,8e-06,4e-06,1e-06,4.9e-05,0.000128,4.1e-05,5.1e-05,1.3e-05,6e-06,3.7e-05,2.3e-05,0.000463,0.00015,0.000133
3.1e-05,1.4e-05,1.4e-05,1e-06,8e-06,9e-06,6e-06,1.5e-05,9e-06,8e-06,2.1e-05,6.2e-05,4.2e-05,6.1e-05,2.5e-05,1.4e-05,1.1e-05,7.8e-05,9e-05,2.7e-05,2.4e-05,1.6e-05,1.1e-05,1.4e-05,9e-06,1.3e-05,2e-05,2.4e-05,1.2e-05,4e-06,2e-06,5e-06,5e-06,0,1.3e-05,1.6e-05,2.5e-05,1.4e-05,2.2e-05,0.000332,0.000172,0.000258,0.000444,0.000275,9.5e-05,0.000211,0.000113,9.7e-05,5.8e-05,0.000347,0.000267,0.000159,8.2e-05,4.4e-05,0.000262,3.2e-05,8.6e-05,4.9e-05,1.6e-05,1.5e-05,4e-06,9e-06,1.3e-05,6e-05,6.9e-05,6.6e-05,1.9e-05,7e-06,4e-06,1.1e-05,9e-06,6e-06,3e-06,2e-06,3e-06,5e-06,6e-06,1.2e-05,8e-06,1.3e-05,1e-05,3e-05,2.9e-05,1.7e-05,1e-05,0.000134,0.000281,0.000107,0.000307,0.000129,6.1e-05,3.7e-05,2.5e-05,1.7e-05,0.000219,0.000111,8e-06,6.7e-05,1.8e-05,7e-06,1.3e-05,1.1e-05,5e-06,0.000144,6.5e-05,5.8e-05,3.2e-05,1.6e-05,4e-06,7e-06,4.6e-05,0.000208,0.000171,4.2e-05,1.4e-05,5e-06,1.8e-05,1.9e-05,0.000411,0.000162,9.3e-05
1.5e-05,1e-05,1.4e-05,4e-06,1.1e-05,8e-06,7e-06,1.1e-05,1.3e-05,1.7e-05,2.5e-05,2.8e-05,7e-05,4.3e-05,3.6e-05,3.6e-05,3.1e-05,6.8e-05,3.9e-05,3.8e-05,3.4e-05,4e-06,1.4e-05,7e-06,4e-06,1.5e-05,1.5e-05,1.1e-05,5e-06,5e-06,1e-06,3e-06,4e-06,2e-06,1.3e-05,1e-05,3.5e-05,2.5e-05,2.2e-05,0.000336,0.00027,0.000311,0.000482,4.7e-05,0.000151,0.000125,0.00012,9.4e-05,3.3e-05,0.000491,0.000121,7.6e-05,2.8e-05,2.8e-05,0.000237,0.000129,9.5e-05,5.2e-05,3.3e-05,2.4e-05,2.1e-05,2e-05,2.7e-05,5.8e-05,3.1e-05,2.1e-05,2.7e-05,1.8e-05,8e-06,6e-06,3e-06,8e-06,8e-06,6e-06,1e-06,4e-06,7e-06,1.2e-05,4e-06,9e-06,1.3e-05,3.1e-05,1.4e-05,2.3e-05,5e-06,0.000107,0.000499,0.000306,0.000452,3.5e-05,9.1e-05,6.7e-05,2.3e-05,6e-06,0.000229,0.000208,8.8e-05,5.2e-05,3.1e-05,1.5e-05,1.6e-05,1e-05,9e-06,0.000137,7.8e-05,2.2e-05,1.7e-05,1.7e-05,1.2e-05,1.7e-05,4.5e-05,0.000162,2.3e-05,2e-05,2.1e-05,2.6e-05,2.4e-05,1.3e-05,0.000335,0.000145,8.9e-05
1.4e-05,1e-05,6e-06,5e-06,9e-06,6e-06,1.3e-05,9e-06,3e-06,1.3e-05,6.7e-05,3.6e-05,9e-05,2.7e-05,3.5e-05,3.8e-05,4e-06,6.1e-05,2.6e-05,1.4e-05,3.1e-05,2.6e-05,1.1e-05,1.2e-05,2e-06,1.5e-05,1e-05,1.1e-05,9e-06,6e-06,5e-06,4e-06,4e-06,2e-06,1e-05,3e-06,4e-06,1.3e-05,1.1e-05,0.000337,0.000275,0.000243,0.000318,5.4e-05,0.000205,8.2e-05,5.7e-05,7e-05,9.7e-05,0.000454,0.00018,0.000139,3.4e-05,2.7e-05,0.000256,0.000272,5.4e-05,3.5e-05,1.2e-05,1.3e-05,7e-06,2.6e-05,1.1e-05,4.8e-05,6.6e-05,7.6e-05,3.7e-05,1.2e-05,4e-06,2e-06,3e-06,5e-06,5e-06,3e-06,5e-06,5e-06,5e-06,1.2e-05,8e-06,6e-06,1.5e-05,4.5e-05,3.1e-05,2.5e-05,1.2e-05,7.9e-05,0.000605,0.000105,0.000299,0.000213,3.6e-05,2.8e-05,2.7e-05,7e-06,0.000122,2.5e-05,7.4e-05,1.7e-05,1.9e-05,1.6e-05,1.3e-05,1.5e-05,1.4e-05,9.4e-05,3.8e-05,2.3e-05,7e-06,7e-06,8e-06,2e-05,2.9e-05,7.7e-05,7.2e-05,9e-06,2.7e-05,1.9e-05,1.4e-05,1.5e-05,0.000271,0.000178,0.000108
1.7e-05,1.3e-05,6e-06,8e-06,1.5e-05,3e-06,7e-06,1.2e-05,1.7e-05,1.8e-05,0.000104,1.4e-05,6.5e-05,3.7e-05,6e-05,2.7e-05,2.4e-05,2.6e-05,9.2e-05,6e-05,1.3e-05,5e-06,7e-06,8e-06,7e-06,1e-05,6e-06,2e-06,3e-06,4e-06,5e-06,6e-06,3e-06,1e-05,1.6e-05,7e-06,2.1e-05,1.8e-05,2e-06,0.000307,0.000179,0.000484,0.000516,0.000179,0.000162,0.000317,0.000168,0.000238,3e-05,0.000325,0.000125,0.000158,7.4e-05,6e-05,0.000263,0.000319,0.000167,3e-05,2.6e-05,1.5e-05,9e-06,1.9e-05,2.9e-05,6.2e-05,8.2e-05,5.2e-05,2.8e-05,1.1e-05,2e-06,2e-06,3e-06,8e-06,7e-06,6e-06,7e-06,7e-06,6e-06,1.2e-05,7e-06,7e-06,1.4e-05,6.1e-05,2.3e-05,1.2e-05,3.5e-05,0.000107,0.000529,0.000354,0.000362,0.000214,6e-05,3.8e-05,1.7e-05,1.2e-05,9.7e-05,7.3e-05,3.9e-05,3.5e-05,1.5e-05,2.5e-05,1.6e-05,1.1e-05,4e-06,2.6e-05,1e-05,3.9e-05,2.3e-05,1.8e-05,4e-06,6e-06,3.9e-05,8.8e-05,5.3e-05,3.5e-05,2.1e-05,3.1e-05,3.5e-05,2.8e-05,0.00023,8.6e-05,5.6e-05
2.5e-05,1.7e-05,2e-05,1.2e-05,7e-06,4e-06,4e-06,1e-05,2e-05,3.2e-05,0.000125,5.8e-05,6.5e-05,4e-05,2.4e-05,1.8e-05,7e-06,2.4e-05,0.000123,5.9e-05,1.9e-05,1e-05,8e-06,1.2e-05,2e-06,8e-06,7e-06,6e-06,4e-06,5e-06,6e-06,4e-06,2e-06,1.1e-05,1.8e-05,1.1e-05,2.1e-05,7e-06,3e-06,0.000246,0.000225,0.000471,0.000174,0.000137,0.000327,0.000335,0.000294,0.000203,0.00019,0.000188,0.000207,0.000157,4.4e-05,8.6e-05,0.000293,9.4e-05,9.7e-05,4e-05,1.5e-05,1.2e-05,5e-06,1.5e-05,1.9e-05,5.9e-05,6e-05,6.7e-05,1.2e-05,2e-06,1.2e-05,2e-06,6e-06,8e-06,9e-06,3e-06,6e-06,5e-06,3e-06,6e-06,1e-06,1e-05,7e-06,5.8e-05,3.6e-05,5e-06,4.7e-05,0.000133,0.000326,0.000439,0.000354,0.000302,0.000114,6e-05,3.5e-05,4e-06,0.000331,0.000269,7.4e-05,2.5e-05,5.6e-05,1.7e-05,2e-05,4e-06,8e-06,5.2e-05,6.5e-05,3.8e-05,2.3e-05,8e-06,4e-06,8e-06,3.6e-05,4.4e-05,4.7e-05,3.3e-05,1e-05,1.7e-05,3.3e-05,9e-06,0.000176,8.1e-05,8.4e-05
4e-06,3e-06,1.3e-05,1e-06,1.2e-05,4e-06,1e-05,1.2e-05,2.6e-05,2e-06,8.5e-05,0.000112,0.000112,5.4e-05,1.9e-05,1.8e-05,2.6e-05,3.5e-05,0.000113,7.8e-05,3.1e-05,3e-06,1e-06,3e-06,1.1e-05,7e-06,9e-06,4e-06,6e-06,8e-06,1e-06,5e-06,2e-06,1e-05,1.3e-05,1e-05,8e-06,1.1e-05,1.3e-05,0.000164,8.9e-05,0.000419,0.000443,0.000385,0.000129,0.000454,0.000386,0.000305,4.3e-05,0.000251,0.000154,0.000135,0.000119,9.7e-05,0.000245,0.000145,0.000164,5.6e-05,8e-06,6e-06,7e-06,2.5e-05,9e-06,4.5e-05,5e-05,8.7e-05,6.8e-05,2.4e-05,4e-06,1.2e-05,3e-06,6e-06,5e-06,3e-06,6e-06,5e-06,1.2e-05,8e-06,5e-06,6e-06,2e-05,4.2e-05,3.4e-05,2e-05,5.9e-05,8.2e-05,0.000312,0.000369,0.000669,0.000483,0.000254,7.2e-05,2.4e-05,9e-06,0.000465,0.000325,0.000212,6.1e-05,6.9e-05,5.1e-05,1.9e-05,5e-06,9e-06,0.000122,1.1e-05,3.8e-05,3e-05,1.9e-05,9e-06,1.4e-05,2.4e-05,3.7e-05,3.8e-05,1.8e-05,4e-06,2e-06,2.4e-05,2.3e-05,0.000169,0.000175,5.1e-05
1.9e-05,1.3e-05,9e-06,1.1e-05,1.4e-05,1.5e-05,1.4e-05,1.8e-05,1.3e-05,2.7e-05,4e-05,0.000106,1.7e-05,1.4e-05,4e-06,3e-06,1.9e-05,2e-05,8.4e-05,7.5e-05,4.5e-05,2.2e-05,1.1e-05,1.1e-05,1.6e-05,9e-06,2.2e-05,1.3e-05,7e-06,5e-06,5e-06,1e-05,8e-06,7e-06,1.4e-05,1.2e-05,1.4e-05,2.2e-05,1.7e-05,0.000126,0.000199,0.000298,0.00033,0.000268,0.000251,0.000683,0.000443,0.000224,0.000137,0.000307,0.000191,7.2e-05,3.3e-05,4.7e-05,0.000164,0.000221,7.5e-05,3.1e-05,1.9e-05,3.6e-05,2.8e-05,3e-05,3.5e-05,3.2e-05,6.6e-05,6.8e-05,2.5e-05,1.2e-05,4e-06,4e-06,6e-06,1e-06,9e-06,1.1e-05,7e-06,6e-06,1.2e-05,5e-06,5e-06,3e-06,1.7e-05,3.1e-05,2.6e-05,7e-06,7.1e-05,9.9e-05,0.000266,0.000153,0.000213,0.000154,7e-06,3e-06,1.4e-05,1e-05,0.00045,0.000423,0.000191,6.3e-05,5.4e-05,1e-05,8e-06,1.3e-05,1.3e-05,0.000138,8.4e-05,1.3e-05,2.3e-05,1.2e-05,6e-06,1.3e-05,4.7e-05,7.4e-05,5.2e-05,4.2e-05,4.3e-05,2.4e-05,1.4e-05,2.7e-05,0.000247,0.000215,0.000243
3e-05,2.6e-05,2.5e-05,2e-05,2.5e-05,2.2e-05,8e-06,8e-06,1.3e-05,1.9e-05,3.1e-05,4.2e-05,8.3e-05,6.7e-05,2.8e-05,2.2e-05,1.9e-05,9e-06,5.4e-05,1.1e-05,1.1e-05,1e-05,8e-06,1.4e-05,1.3e-05,2.1e-05,5e-06,3e-06,7e-06,1e-06,5e-06,5e-06,2e-06,2e-06,6e-06,9e-06,1.1e-05,8e-06,2e-05,7.6e-05,0.000234,6.8e-05,0.000316,6.4e-05,2.8e-05,0.000346,0.000251,0.000163,1.1e-05,0.000276,3.8e-05,6.5e-05,6e-05,6e-05,0.000208,0.00034,0.000104,9e-05,8e-06,2.5e-05,5e-06,1.8e-05,2.6e-05,4.2e-05,7.1e-05,2.7e-05,2.1e-05,1.6e-05,2e-06,1e-06,8e-06,5e-06,8e-06,8e-06,1.2e-05,6e-06,8e-06,1.4e-05,5e-06,6e-06,1.4e-05,1.6e-05,3e-06,1.9e-05,6.5e-05,0.000108,0.000224,0.000272,0.000137,0.000141,9.3e-05,7.3e-05,2.6e-05,1.5e-05,0.000312,0.000161,6.7e-05,7e-05,2.5e-05,2.5e-05,8e-06,1e-06,9e-06,0.000119,7.3e-05,3.5e-05,8e-06,5e-06,6e-06,1.7e-05,4.6e-05,1.3e-05,3.5e-05,2.6e-05,2.9e-05,2e-05,1.8e-05,1.4e-05,0.000277,0.000227,0.000147
1.3e-05,4e-06,1.3e-05,1.1e-05,5e-06,3e-06,6e-06,3e-06,4e-06,1.9e-05,2.2e-05,3.3e-05,5.5e-05,3.2e-05,2.2e-05,2.7e-05,1.2e-05,4e-06,2.1e-05,2.7e-05,8e-06,7e-06,9e-06,7e-06,8e-06,1.3e-05,2e-06,1e-06,4e-06,1e-06,3e-06,2e-06,3e-06,1e-06,8e-06,2e-06,5e-06,3e-06,7e-06,5e-05,0.000302,0.000129,0.000231,0.000119,8e-05,0.000177,0.000101,1.9e-05,2.2e-05,0.000166,5.8e-05,1.8e-05,3.4e-05,7.4e-05,0.000196,2.1e-05,0.000171,6.7e-05,1.2e-05,1e-05,8e-06,2.3e-05,5e-06,3.2e-05,2.6e-05,5e-05,2.4e-05,1.5e-05,3e-06,7e-06,2e-06,4e-06,7e-06,7e-06,7e-06,3e-06,2e-06,4e-06,4e-06,2e-06,9e-06,4e-06,2e-06,1.7e-05,4.3e-05,9.3e-05,0.00016,0.000228,0.000269,0.000152,6.3e-05,2.5e-05,2.8e-05,1.7e-05,0.000189,5.5e-05,5.4e-05,5.1e-05,1.1e-05,2e-06,5e-06,2e-06,5e-06,6e-05,8.1e-05,4e-05,6e-06,8e-06,3e-06,8e-06,2.9e-05,2.3e-05,1.8e-05,1.5e-05,3.7e-05,7e-06,1e-05,9e-06,0.00029,0.000231,8.9e-05
1.3e-05,7e-06,8e-06,4e-06,2e-06,1e-06,5e-06,4e-06,6e-06,4e-06,4e-06,1.6e-05,2e-05,3e-06,1.1e-05,8e-06,5e-06,5e-06,9e-06,5e-06,9e-06,8e-06,5e-06,3e-06,1e-06,1e-05,2e-06,4e-06,4e-06,1e-06,2e-06,3e-06,2e-06,2e-06,9e-06,5e-06,8e-06,7e-06,5e-06,1.7e-05,0.000191,0.000173,0.000165,6.6e-05,8.9e-05,9.4e-05,5e-05,5.3e-05,4.4e-05,0.000196,1.5e-05,4.5e-05,1.3e-05,5.9e-05,0.000119,0.000171,0.00014,4.6e-05,6e-06,1.6e-05,1.1e-05,1.2e-05,1.1e-05,2.6e-05,3e-06,3e-05,1.2e-05,4e-06,3e-06,5e-06,4e-06,1e-06,6e-06,6e-06,2e-06,1e-06,3e-06,3e-06,4e-06,4e-06,9e-06,5e-06,3e-06,4e-06,2.3e-05,7.1e-05,0.000213,0.000108,0.000173,2.6e-05,6.1e-05,1.9e-05,1.3e-05,8e-06,0.000155,4.6e-05,2.2e-05,3.4e-05,3e-06,1e-05,1e-05,5e-06,4e-06,3.4e-05,3.7e-05,2.4e-05,1.3e-05,4e-06,4e-06,6e-06,2.5e-05,2.5e-05,4.3e-05,2.2e-05,1.2e-05,9e-06,7e-06,7e-06,0.000296,0.000137,2.6e-05
8e-06,9e-06,1e-06,2e-06,2e-06,0,3e-06,3e-06,3e-06,5e-06,1.1e-05,9e-06,1.5e-05,2e-06,5e-06,5e-06,5e-06,1e-06,7e-06,8e-06,8e-06,5e-06,5e-06,2e-06,3e-06,1.1e-05,2e-06,3e-06,5e-06,1e-06,2e-06,3e-06,3e-06,2e-06,8e-06,5e-06,5e-06,6e-06,3e-06,2.2e-05,4.7e-05,2.4e-05,0.000107,9e-06,8.5e-05,0.000129,3.1e-05,3e-05,8e-06,0.000177,7e-06,2.1e-05,2.3e-05,4e-05,0.000118,0.000118,5.2e-05,3.4e-05,1.9e-05,1e-05,3e-06,3e-06,4e-06,2.4e-05,6e-06,1.6e-05,3e-06,4e-06,2e-06,3e-06,5e-06,1e-06,4e-06,2e-06,1e-06,1e-06,2e-06,4e-06,3e-06,4e-06,9e-06,1e-06,8e-06,4e-06,1.9e-05,8.1e-05,0.000235,3.6e-05,0.000193,0.000102,5e-06,1.4e-05,1.5e-05,1.1e-05,0.00013,4.9e-05,2.6e-05,4.2e-05,9e-06,4e-06,5e-06,2e-06,0,2.9e-05,5e-06,7e-06,4e-06,1e-06,2e-06,1e-06,2.4e-05,1.6e-05,4.5e-05,1e-06,1.3e-05,5e-06,2e-06,3e-06,0.00027,5.9e-05,7e-06
9e-06,6e-06,2e-06,4e-06,2e-06,1e-06,3e-06,3e-06,3e-06,4e-06,2e-05,6e-06,1e-05,3e-06,3e-06,6e-06,5e-06,2e-06,1.2e-05,9e-06,2e-06,4e-06,3e-06,1e-06,2e-06,1e-05,2e-06,2e-06,4e-06,2e-06,1e-06,2e-06,3e-06,2e-06,8e-06,5e-06,4e-06,5e-06,3e-06,2.4e-05,2.2e-05,5.4e-05,0.000146,2.5e-05,9.8e-05,8.5e-05,3.1e-05,2e-05,2e-06,0.000176,2.2e-05,6e-06,2.6e-05,4.3e-05,9.6e-05,8.4e-05,7.4e-05,3.7e-05,1.7e-05,7e-06,3e-06,7e-06,4e-06,2.2e-05,7e-06,1.6e-05,0,6e-06,1e-06,5e-06,2e-06,0,5e-06,1e-06,2e-06,1e-06,2e-06,4e-06,3e-06,3e-06,8e-06,3e-06,9e-06,4e-06,2.3e-05,7.8e-05,0.000182,3.3e-05,0.000139,5.2e-05,1.8e-05,6e-06,8e-06,2e-06,0.000149,3.2e-05,1.7e-05,4e-05,9e-06,3e-06,4e-06,2e-06,1e-06,1.9e-05,1.5e-05,6e-06,3e-06,4e-06,2e-06,3e-06,2.2e-05,9e-06,3e-05,8e-06,1e-05,2e-06,2e-06,4e-06,0.000246,0.000106,2.4e-05
