0.044022,0.065049,0.075339,0.062735,0.039896,0.025744,0.018936,0.020517,0.047014,0.080305,0.079278,0.072149,0.08591,0.080222,0.056445,0.052766,0.059625,0.052368,0.045591,0.042701,0.036563,0.032035,0.035402,0.056536,0.066551,0.066494,0.071062,0.061754
0.052977,0.079026,0.092086,0.075937,0.047193,0.030601,0.022835,0.024363,0.05865,0.100448,0.096463,0.087588,0.105083,0.09522,0.065607,0.06307,0.071753,0.063065,0.053498,0.047767,0.040403,0.036087,0.04023,0.064584,0.076231,0.076793,0.084218,0.073266
0.066391,0.100363,0.118463,0.09687,0.057863,0.037551,0.028718,0.030004,0.076963,0.132173,0.122438,0.112237,0.136333,0.117704,0.078624,0.078879,0.090236,0.079411,0.064998,0.053081,0.043459,0.04036,0.04593,0.074309,0.088844,0.091844,0.104668,0.090845
0.071757,0.108706,0.131787,0.108547,0.061941,0.039871,0.031428,0.032007,0.084411,0.14533,0.133111,0.128316,0.157026,0.129407,0.084928,0.087652,0.099932,0.087486,0.068666,0.050014,0.038898,0.038902,0.046354,0.076227,0.093826,0.102002,0.120212,0.102758
0.069318,0.103799,0.129543,0.107243,0.058319,0.03697,0.030062,0.030205,0.076668,0.132473,0.128674,0.137615,0.165286,0.133087,0.08866,0.089511,0.098853,0.085385,0.064557,0.042521,0.03267,0.035698,0.044732,0.078029,0.099996,0.107759,0.127535,0.111952
0.07284,0.106932,0.131005,0.106142,0.057914,0.035898,0.029228,0.028973,0.068589,0.124485,0.135687,0.152909,0.171193,0.137861,0.100335,0.099002,0.098991,0.080482,0.060948,0.040158,0.032084,0.035275,0.048738,0.095355,0.126131,0.121584,0.13044,0.122432
0.096494,0.137529,0.159933,0.129983,0.076443,0.042442,0.031377,0.032558,0.078539,0.149411,0.169067,0.182308,0.190678,0.156569,0.127229,0.128689,0.119904,0.093199,0.07213,0.047429,0.037762,0.041699,0.062518,0.131175,0.183655,0.167891,0.151475,0.14574
0.146059,0.196207,0.225932,0.195127,0.118169,0.056465,0.036082,0.039885,0.104564,0.199035,0.220386,0.235142,0.247153,0.206636,0.175481,0.183342,0.173038,0.136839,0.104938,0.065585,0.051218,0.055825,0.082935,0.177702,0.265282,0.253134,0.212738,0.194026
0.219188,0.274971,0.324802,0.302268,0.182005,0.078688,0.045242,0.05061,0.138466,0.260789,0.278304,0.295731,0.319607,0.266617,0.228402,0.253024,0.24681,0.19799,0.149185,0.087464,0.067243,0.07214,0.105588,0.230784,0.361412,0.358729,0.294727,0.250301
0.296278,0.364255,0.445072,0.432588,0.257727,0.104201,0.056696,0.063482,0.176546,0.333675,0.343492,0.346405,0.36995,0.299942,0.258324,0.311791,0.319857,0.261939,0.192874,0.106445,0.080461,0.084222,0.123775,0.28117,0.456818,0.458431,0.368532,0.29052
0.34271,0.44451,0.557339,0.540686,0.322243,0.126079,0.065843,0.076577,0.203665,0.382172,0.387954,0.368383,0.379107,0.296082,0.249788,0.327076,0.357819,0.302445,0.219517,0.116266,0.085132,0.08758,0.129717,0.30278,0.505795,0.504864,0.396494,0.296139
0.328334,0.48458,0.623742,0.579665,0.348648,0.137396,0.067486,0.083267,0.205031,0.37182,0.380033,0.346451,0.340372,0.263778,0.218845,0.296908,0.340019,0.301693,0.225417,0.118137,0.081125,0.082774,0.125724,0.286573,0.471873,0.461858,0.357867,0.267474
0.267879,0.462014,0.615605,0.541994,0.322781,0.130658,0.062329,0.080093,0.175032,0.300853,0.321899,0.299215,0.28284,0.219632,0.180869,0.235698,0.275458,0.272749,0.223838,0.12006,0.074295,0.073204,0.110053,0.232175,0.364131,0.354075,0.281649,0.219054
0.208759,0.385572,0.514451,0.431043,0.248466,0.105685,0.053728,0.070324,0.133349,0.210819,0.238608,0.232511,0.217973,0.170924,0.136835,0.170899,0.201715,0.223656,0.206646,0.119332,0.067732,0.059914,0.086543,0.169209,0.250467,0.247987,0.199961,0.162052
0.16256,0.291801,0.369155,0.291377,0.158317,0.07479,0.04645,0.061714,0.107499,0.154463,0.174839,0.174046,0.163463,0.137044,0.113849,0.13408,0.154623,0.168571,0.162374,0.101776,0.056852,0.047529,0.067286,0.13081,0.193831,0.200696,0.162157,0.130089
0.154046,0.296159,0.380565,0.273601,0.127356,0.07126,0.049124,0.057651,0.103703,0.16074,0.185632,0.184117,0.179422,0.1655,0.143367,0.149938,0.16328,0.158756,0.144056,0.095269,0.053342,0.042819,0.059864,0.124624,0.195237,0.227654,0.202938,0.157727
0.196882,0.418744,0.568733,0.395981,0.164374,0.096357,0.068984,0.063799,0.105421,0.180737,0.2365,0.249712,0.253298,0.248827,0.209787,0.20263,0.223973,0.216934,0.194701,0.127354,0.065852,0.051813,0.068481,0.140172,0.229172,0.298553,0.288345,0.231451
0.252443,0.566186,0.816872,0.585428,0.233157,0.139978,0.108798,0.081519,0.112237,0.205638,0.292302,0.318634,0.351023,0.369282,0.290994,0.270492,0.308337,0.292284,0.264671,0.176685,0.090657,0.070871,0.087964,0.175455,0.299657,0.411236,0.39705,0.318434
0.282403,0.653824,1.020397,0.780841,0.324277,0.202613,0.165394,0.107544,0.126031,0.236272,0.33639,0.382943,0.478616,0.513999,0.366299,0.339945,0.395193,0.34679,0.311451,0.215832,0.115961,0.092034,0.109486,0.218875,0.403295,0.57813,0.526125,0.386166
0.272046,0.621821,1.04661,0.870508,0.407361,0.273865,0.22628,0.132813,0.132666,0.247767,0.359218,0.468038,0.634542,0.639139,0.407535,0.383493,0.456594,0.366248,0.310686,0.224683,0.138971,0.112966,0.128845,0.268235,0.51616,0.742818,0.624937,0.398315
0.244363,0.514252,0.863362,0.774093,0.452317,0.344241,0.271175,0.146753,0.128645,0.231724,0.362624,0.564416,0.769003,0.70233,0.40816,0.396431,0.496285,0.374724,0.280662,0.211411,0.162815,0.133823,0.13594,0.290077,0.563934,0.801035,0.64914,0.36691
0.211786,0.385227,0.577583,0.556404,0.439546,0.378182,0.273137,0.141264,0.123059,0.198527,0.328347,0.594208,0.801192,0.67939,0.375196,0.379401,0.492289,0.364194,0.250576,0.195683,0.183647,0.158066,0.134769,0.258566,0.496225,0.701052,0.588673,0.340588
0.160922,0.259682,0.334631,0.361263,0.387889,0.352675,0.232426,0.127098,0.11934,0.169675,0.276355,0.515515,0.695577,0.582051,0.318262,0.327211,0.424605,0.327446,0.230877,0.182204,0.197137,0.17641,0.132399,0.197915,0.366796,0.538691,0.492078,0.320338
0.136411,0.189292,0.205964,0.245452,0.333087,0.311994,0.192332,0.116919,0.117221,0.149116,0.249597,0.421175,0.540163,0.483689,0.290126,0.297822,0.371111,0.300347,0.226102,0.177466,0.204512,0.18117,0.127322,0.15114,0.25446,0.415388,0.429903,0.325428
0.141913,0.168489,0.168376,0.226213,0.344644,0.319459,0.184277,0.115045,0.111695,0.134768,0.273067,0.403929,0.439779,0.442918,0.307917,0.285771,0.335532,0.282108,0.225525,0.169577,0.199301,0.189603,0.1335,0.128046,0.172041,0.295715,0.391248,0.368497
0.141405,0.13964,0.133759,0.223485,0.38184,0.359269,0.198571,0.121809,0.112116,0.125109,0.299835,0.428419,0.446005,0.516865,0.391355,0.277927,0.283329,0.250455,0.218681,0.164205,0.188556,0.205788,0.159691,0.13741,0.152565,0.219159,0.357557,0.408392
0.128188,0.120626,0.122041,0.234599,0.425782,0.414321,0.224201,0.130202,0.117144,0.126691,0.30373,0.421124,0.469254,0.625034,0.500279,0.277671,0.221337,0.208207,0.212701,0.185621,0.212224,0.235603,0.188231,0.164375,0.191469,0.220347,0.33238,0.428889
0.122159,0.117343,0.132586,0.254311,0.465982,0.494723,0.282668,0.144988,0.125273,0.153832,0.336832,0.442598,0.513929,0.730432,0.616214,0.306835,0.198911,0.201064,0.240597,0.234782,0.259123,0.282227,0.210689,0.170498,0.235045,0.285761,0.355862,0.422955
0.133307,0.104521,0.136902,0.282146,0.497786,0.567962,0.359856,0.168833,0.129073,0.201509,0.452515,0.548916,0.602511,0.907074,0.790558,0.365601,0.205359,0.204206,0.278202,0.283686,0.29183,0.336384,0.238253,0.154369,0.273327,0.410302,0.46588,0.427244
0.167106,0.089715,0.136889,0.325552,0.546977,0.621494,0.441657,0.227438,0.150517,0.24629,0.553197,0.644884,0.680366,1.068895,0.949729,0.409588,0.201668,0.209295,0.313222,0.326919,0.346881,0.410687,0.271827,0.149931,0.328707,0.572331,0.623199,0.497946
0.205738,0.085575,0.144543,0.349708,0.581543,0.633635,0.499093,0.341293,0.214597,0.268041,0.560841,0.635588,0.660364,1.079244,0.982184,0.397065,0.171516,0.191215,0.307102,0.36312,0.426198,0.459703,0.284033,0.160327,0.370453,0.711402,0.781128,0.609711
0.234683,0.089302,0.152964,0.382964,0.596949,0.570067,0.505171,0.476803,0.308313,0.265577,0.483948,0.531847,0.565774,1.031708,0.988644,0.354904,0.119142,0.150874,0.263705,0.376872,0.478915,0.459571,0.271256,0.165098,0.373946,0.769881,0.936601,0.725357
0.239263,0.091406,0.159438,0.443545,0.609617,0.486706,0.503425,0.629108,0.437246,0.261194,0.47638,0.549038,0.576855,1.141842,1.072918,0.310026,0.081324,0.140502,0.270967,0.391968,0.466779,0.44057,0.266862,0.165015,0.387207,0.745157,1.020965,0.817843
0.216244,0.087807,0.148113,0.457969,0.589176,0.474873,0.590713,0.800388,0.587721,0.29524,0.542482,0.65503,0.642752,1.246398,1.113488,0.26261,0.069332,0.137056,0.287673,0.387143,0.397602,0.393297,0.257343,0.171184,0.476715,0.798704,1.072737,0.883422
0.214185,0.090279,0.13679,0.409933,0.546014,0.548589,0.690172,0.885835,0.700188,0.338195,0.598026,0.724117,0.722574,1.365404,1.121398,0.232853,0.078143,0.126093,0.271398,0.362802,0.354642,0.366033,0.260689,0.203908,0.609758,0.947149,1.171538,0.99351
0.260237,0.097167,0.142019,0.344827,0.493363,0.661143,0.755727,0.837083,0.706503,0.370267,0.62569,0.713257,0.763633,1.514617,1.174489,0.230213,0.091624,0.118036,0.259042,0.371803,0.36725,0.332368,0.246723,0.233103,0.699291,1.000442,1.16236,1.123936
0.31235,0.117274,0.169465,0.321432,0.495865,0.775005,0.827571,0.73177,0.588604,0.363041,0.600212,0.679808,0.765451,1.575162,1.234557,0.239773,0.096871,0.132279,0.276716,0.376139,0.399025,0.309041,0.20977,0.240399,0.689833,0.970448,1.060467,1.188254
0.327997,0.139115,0.212052,0.373928,0.562731,0.835201,0.80843,0.578505,0.444644,0.350339,0.561235,0.616208,0.690236,1.478623,1.196098,0.224441,0.09059,0.155616,0.295093,0.413087,0.45171,0.296729,0.176939,0.224912,0.587803,0.92046,0.938273,1.110939
0.311642,0.147293,0.237769,0.398227,0.553703,0.784975,0.685507,0.477409,0.420705,0.385633,0.59257,0.594782,0.687494,1.356479,1.102192,0.233334,0.093493,0.188597,0.338476,0.469947,0.49965,0.317921,0.204755,0.235906,0.475313,0.777533,0.848751,1.003157
0.325477,0.140968,0.227762,0.372975,0.447874,0.640029,0.622393,0.529122,0.500202,0.470114,0.654048,0.63869,0.738593,1.199028,0.95818,0.269132,0.113646,0.215572,0.364455,0.47786,0.495789,0.357389,0.309359,0.30368,0.373754,0.553491,0.814881,0.950548
