-0.000188,-0.000187,-0.000216,-0.000171,-0.000163,-0.000153,-0.000131,-0.00013,-0.000101,-0.000116,-0.000133,-0.000129,-9.8e-05,-0.000145,-0.000214,-0.000295,-0.000328,-0.000241,-0.000228,-0.000224,-0.000314,-0.000242,-0.000172,-0.00015,-0.000147,-0.000186,-0.000183,-0.000121
-8.8e-05,-1.8e-05,-4.7e-05,-6.3e-05,-2.3e-05,-5e-05,-4.8e-05,-3.4e-05,-1.5e-05,-5e-06,-2.4e-05,9e-06,1e-06,-4.5e-05,-0.000169,-0.000199,-0.000146,-4.9e-05,-2.2e-05,4.9e-05,-2e-05,-1.9e-05,-5e-05,-6.3e-05,-6.5e-05,-5.5e-05,-6.4e-05,-4.7e-05
2.3e-05,5e-05,4.6e-05,1.8e-05,2.7e-05,1.2e-05,1.3e-05,2.3e-05,5e-06,1.5e-05,2.8e-05,2e-05,1e-05,0,-4.6e-05,-3e-06,2e-05,3.2e-05,5e-05,4.2e-05,1.7e-05,2.4e-05,1.7e-05,1.7e-05,2.5e-05,7e-06,-2e-06,-3e-06
5.8e-05,1e-05,1.4e-05,1e-05,-3.5e-05,2e-06,3.1e-05,2e-05,-8e-06,-2.3e-05,6e-06,-3.1e-05,-2.3e-05,1e-06,8e-05,0.00014,9.2e-05,-1.6e-05,-3.4e-05,-8.8e-05,-3.6e-05,-4.2e-05,-1e-05,2.2e-05,3.1e-05,-3e-06,2.1e-05,2.7e-05
8e-05,4.1e-05,7e-05,7.2e-05,5.7e-05,7.2e-05,6.3e-05,5.1e-05,4.6e-05,3.4e-05,3.1e-05,4.9e-05,4.2e-05,7.9e-05,0.000182,0.000194,2e-04,0.000101,6.8e-05,9.3e-05,0.000191,0.000113,5.5e-05,4.8e-05,4.3e-05,0.000102,0.000128,7.8e-05
3e-06,-9e-06,2.6e-05,6.9e-05,0.000101,4.2e-05,-1.3e-05,8e-06,2.5e-05,2.6e-05,-5e-06,3.1e-05,3.3e-05,5.9e-05,8.3e-05,5e-06,4.1e-05,9.1e-05,9e-05,9.5e-05,9.4e-05,8.5e-05,5.3e-05,1.9e-05,1.8e-05,7.6e-05,4.8e-05,1.1e-05
-1e-04,-8.9e-05,-0.000117,-6.8e-05,-5.8e-05,-8.4e-05,-9.4e-05,-7.6e-05,-5.1e-05,-4.6e-05,-4.5e-05,-6.1e-05,-6.1e-05,-6.5e-05,-0.000124,-0.000183,-0.000234,-0.00012,-0.000103,-0.000134,-0.000221,-0.000159,-7.4e-05,-5.3e-05,-5.1e-05,-9.8e-05,-0.00014,-9e-05
-5.5e-05,-2e-06,-5.4e-05,-9.9e-05,-0.000108,-5.7e-05,-2.2e-05,-2.5e-05,-1.8e-05,0,1.9e-05,-1.5e-05,-3.1e-05,-7.7e-05,-0.000152,-8.8e-05,-0.000131,-0.000107,-1e-04,-6.3e-05,-9.8e-05,-0.000107,-8.9e-05,-5.1e-05,-4.5e-05,-9.3e-05,-9.2e-05,-4.1e-05
3.4e-05,7.2e-05,8.6e-05,5e-06,1.1e-05,3.9e-05,6e-05,4.9e-05,1.6e-05,2.5e-05,1.9e-05,1.5e-05,2.2e-05,-5e-06,-3.2e-05,4.5e-05,0.000116,5.3e-05,6.1e-05,9.3e-05,1e-04,8.1e-05,2.5e-05,1.5e-05,9e-06,1.3e-05,5.3e-05,3.5e-05
3.8e-05,5e-06,5.2e-05,6.4e-05,5.1e-05,2e-05,3.6e-05,2e-05,-1.4e-05,-5e-05,-4.4e-05,-1.8e-05,-6e-06,1.9e-05,6.6e-05,5.4e-05,0.000113,4e-05,5.5e-05,8e-06,3.9e-05,6.7e-05,8e-05,5.3e-05,3.3e-05,3.8e-05,7.4e-05,3.3e-05
3e-05,-2.3e-05,-2.3e-05,3.8e-05,1.4e-05,-1e-06,-7e-06,-1.5e-05,3e-06,-1.6e-05,8e-06,3.2e-05,1.5e-05,3e-05,0.000102,5.2e-05,1.4e-05,-1.1e-05,-1.9e-05,-3.3e-05,2.9e-05,1.9e-05,3.8e-05,2.9e-05,3.2e-05,5.6e-05,4.1e-05,2.9e-05
3e-05,1.2e-05,-1.9e-05,2e-06,1.8e-05,3.1e-05,-1.9e-05,-4e-06,3.8e-05,6.9e-05,5.2e-05,4.3e-05,4.4e-05,5e-05,6.5e-05,2.4e-05,-3.5e-05,3.3e-05,8e-06,3.8e-05,2.9e-05,1.7e-05,-1.2e-05,-1.3e-05,8e-06,4.4e-05,-1.1e-05,-1e-06
-2.7e-05,7e-06,-8e-06,-2.5e-05,-6e-06,-1e-06,-1.7e-05,3e-06,4e-06,2.7e-05,-5e-06,-4.1e-05,-1.9e-05,6e-06,-3.2e-05,-4.9e-05,-6.1e-05,3.5e-05,2.5e-05,1e-06,-7.8e-05,-4e-05,-2.9e-05,-2.9e-05,-2.4e-05,-4.5e-05,-7.2e-05,-4.9e-05
-6.5e-05,-1.5e-05,-5e-06,-4.4e-05,-4.7e-05,-3.8e-05,8e-06,-7e-06,-2.1e-05,-3.3e-05,-2.8e-05,-3e-05,-4.2e-05,-5.7e-05,-0.000101,-3.9e-05,-1.7e-05,-3.8e-05,-3.5e-05,-3.6e-05,-4.6e-05,-5.1e-05,-2.3e-05,-2.3e-05,-3.2e-05,-8.1e-05,-4.4e-05,-2.2e-05
-2e-06,-1.1e-05,1e-05,-1.5e-05,-1e-05,-9e-06,2e-05,-1.1e-05,-1.7e-05,-3e-05,-1.9e-05,1.8e-05,1.9e-05,-4.5e-05,-6.5e-05,2e-06,4e-05,-4.8e-05,-3.2e-05,1.2e-05,6.6e-05,2.7e-05,-1.1e-05,3e-06,-8e-06,-1e-05,4.2e-05,3e-05
5.7e-05,7e-06,1.8e-05,4.1e-05,4.1e-05,2.4e-05,1.2e-05,6e-06,-9e-06,-7e-06,-6e-06,5e-06,2.8e-05,2.3e-05,3e-05,-6e-06,2.5e-05,0,3e-05,6e-06,2.8e-05,5.1e-05,2.5e-05,3.1e-05,1.8e-05,4.6e-05,5.7e-05,2.3e-05
2.6e-05,1.1e-05,0,3.6e-05,1.3e-05,1e-05,-8e-06,2.3e-05,2e-05,2.3e-05,3.8e-05,-1e-06,-1.4e-05,3.8e-05,8.3e-05,2.1e-05,-6e-06,1.9e-05,2.1e-05,-1.3e-05,-2.9e-05,3e-06,3.6e-05,1.1e-05,1.9e-05,3.6e-05,4e-06,-8e-06
-1.5e-05,-1e-06,-1.6e-05,0,-1.4e-05,-2e-06,-2.7e-05,3e-06,3.1e-05,3.2e-05,4.1e-05,2.7e-05,9e-06,2.4e-05,5.9e-05,5.4e-05,-1.9e-05,1.7e-05,-1.8e-05,1.1e-05,-1e-05,-3.7e-05,-1.7e-05,-2.3e-05,7e-06,1.5e-05,-2.9e-05,-4e-06
-3.7e-05,-2e-05,-2.5e-05,-2.8e-05,-8e-06,-1.4e-05,-2e-05,-2.9e-05,-1e-05,-9e-06,-4.7e-05,-2.7e-05,-9e-06,-1e-06,-2.5e-05,-1.4e-05,-2.3e-05,2.2e-05,0,0,-1.7e-05,-4.1e-05,-5.4e-05,-2.4e-05,-1.9e-05,-2.8e-05,-3.7e-05,-1.4e-05
