3.5e-05,4e-06,1.1e-05,1e-05,1.2e-05,6e-06,2.2e-05,2.3e-05,5e-06,1.2e-05,6e-06,4e-06,0,5e-06,1.3e-05,1.1e-05,9e-06,2.2e-05,8e-06,8e-06,3e-06,9e-06,4e-06,2.4e-05,2e-06,7e-06,1e-05,1.1e-05,1.7e-05,2.4e-05,1.2e-05,8e-06,2.2e-05,2e-06,6e-06,1.4e-05,1.5e-05,1.7e-05,1.5e-05,4e-05,1.3e-05,2.4e-05,2e-06,6e-06,4.8e-05,2.2e-05,5.8e-05,1.7e-05,2.6e-05,1.7e-05,6e-06,1.7e-05,4e-06,3e-06,8e-06,0,3.2e-05,9e-06,7e-06,1.4e-05,2e-06,2.5e-05,8e-06,2.4e-05,1.2e-05,2.3e-05,2.3e-05,2.3e-05,2.1e-05,9e-06,0,9e-06,9e-06,1e-06,3.2e-05,1.8e-05,8e-06,2.4e-05,0,2.5e-05,7e-06,1.1e-05,1.6e-05,6e-06,2e-06,7e-06,7e-06,4e-06,7e-06,1.9e-05,1e-06,1.6e-05,1.9e-05,0,1.1e-05,2.5e-05,2.5e-05,1.7e-05,8e-06,2.5e-05,6e-06,9e-06,3e-06,2.2e-05,1.6e-05,1.1e-05,1.5e-05,1.5e-05,2.1e-05,1.1e-05,2e-05,9e-06,1e-05,2.1e-05,4e-06,1.8e-05,1e-06,2.1e-05,7e-06,7e-06,1.7e-05
5e-05,5e-06,3.2e-05,1.5e-05,1.3e-05,1.6e-05,4.7e-05,5.9e-05,2.1e-05,2.7e-05,2.7e-05,3.9e-05,1.8e-05,1.5e-05,3.1e-05,2.6e-05,2.1e-05,3.8e-05,1.1e-05,4.5e-05,1.8e-05,2.5e-05,3.6e-05,3.6e-05,1.5e-05,2.7e-05,4.5e-05,9e-06,1.1e-05,4.4e-05,2e-05,2e-05,8.1e-05,2e-06,2.2e-05,3.3e-05,6.4e-05,7.4e-05,4.8e-05,5.1e-05,2.9e-05,5.4e-05,3e-06,4.3e-05,8.1e-05,2.2e-05,0.000122,7.4e-05,5.7e-05,3.5e-05,1.4e-05,2.9e-05,7e-06,3.1e-05,1.8e-05,1.7e-05,5e-05,2.5e-05,3e-05,4.6e-05,2.3e-05,7.4e-05,2e-05,5.2e-05,1.8e-05,4.5e-05,6.2e-05,7.3e-05,5.9e-05,3.1e-05,2e-05,2.4e-05,3.8e-05,1e-05,4.4e-05,3.2e-05,9e-06,3.3e-05,2.7e-05,5.6e-05,3.4e-05,1.3e-05,4e-05,3.2e-05,1.7e-05,1e-05,1e-05,2e-06,4.1e-05,3.6e-05,3e-05,5.3e-05,3.4e-05,1.6e-05,4.2e-05,7.5e-05,6.5e-05,4.9e-05,2e-05,5.2e-05,8e-06,2.4e-05,1.8e-05,5.5e-05,6e-05,5.4e-05,3.6e-05,3.9e-05,5.2e-05,1.9e-05,3.8e-05,1.1e-05,2.8e-05,4.6e-05,8e-06,3.8e-05,1.2e-05,4.6e-05,3.4e-05,2.9e-05,1.6e-05
8.3e-05,4.8e-05,6.2e-05,3.3e-05,2e-05,5.3e-05,2.5e-05,3e-05,2e-05,1.7e-05,3e-05,2e-05,4.1e-05,2.3e-05,2e-05,2.5e-05,2.9e-05,5.9e-05,2.9e-05,6.4e-05,3.2e-05,3e-05,1.8e-05,5.5e-05,1.4e-05,2.6e-05,9.5e-05,4.7e-05,3.8e-05,2e-06,2.4e-05,3.1e-05,6.3e-05,4.9e-05,6.4e-05,3.4e-05,8.9e-05,0.000154,4e-05,4.7e-05,6.5e-05,0.000102,1.3e-05,4.5e-05,0.000121,5.8e-05,0.000141,5.1e-05,3.1e-05,2e-05,2.5e-05,9e-06,3.2e-05,3.2e-05,3.4e-05,5.3e-05,0.000101,4.4e-05,5.6e-05,6e-05,4.8e-05,3.3e-05,1.8e-05,4.8e-05,2.3e-05,7.3e-05,3.7e-05,5.2e-05,7.7e-05,4.8e-05,7e-05,8.6e-05,6.2e-05,3.1e-05,6.7e-05,2.2e-05,4.9e-05,4.4e-05,4.9e-05,7.4e-05,2.6e-05,6.1e-05,4.5e-05,6.1e-05,3.7e-05,4.3e-05,4.3e-05,1.1e-05,5.9e-05,5.3e-05,6.1e-05,4.2e-05,1.5e-05,4.5e-05,5.2e-05,2.7e-05,3.7e-05,5.2e-05,1.8e-05,4.7e-05,5.1e-05,1e-05,2.2e-05,5.7e-05,6.7e-05,4.3e-05,9e-06,5e-05,2.8e-05,6.6e-05,2.9e-05,4.1e-05,3e-05,9.1e-05,5.6e-05,2e-05,6.3e-05,9e-05,2.5e-05,2.1e-05,1.2e-05
7.4e-05,8.6e-05,5.7e-05,6.4e-05,7.3e-05,7.6e-05,9.8e-05,6e-05,1e-04,6.1e-05,0.00011,5.3e-05,4.4e-05,6.4e-05,4.6e-05,5.6e-05,1.6e-05,5.6e-05,6.5e-05,1.5e-05,9.5e-05,0.000108,4.4e-05,0.000106,6.5e-05,9.3e-05,6.2e-05,3.5e-05,4.2e-05,5.8e-05,1.9e-05,4.6e-05,6.5e-05,4.3e-05,9.3e-05,7.6e-05,0.00011,0.000205,7.2e-05,4.3e-05,0.000137,3e-05,3e-05,8.8e-05,0.000106,6.9e-05,0.000127,8.8e-05,5.4e-05,2.2e-05,4.7e-05,9.4e-05,2.2e-05,4.1e-05,6.5e-05,0.000137,1.4e-05,4.8e-05,1.2e-05,6e-05,7.4e-05,5e-06,2.6e-05,2.3e-05,5.4e-05,0.000118,0.00011,6.7e-05,7.9e-05,5.8e-05,1.2e-05,5.7e-05,4.6e-05,3e-05,9.1e-05,5e-05,3.1e-05,6.2e-05,2e-05,5.8e-05,5.9e-05,0.000111,9.9e-05,6.4e-05,1.2e-05,3.4e-05,7.9e-05,6.6e-05,5.4e-05,9e-06,5.5e-05,4.6e-05,3.3e-05,3.3e-05,1e-05,7.6e-05,3.9e-05,8.3e-05,3.3e-05,8.5e-05,0.000115,9.2e-05,4.3e-05,8.4e-05,9.4e-05,7.3e-05,5.7e-05,2.3e-05,4.5e-05,1.4e-05,3.8e-05,8.9e-05,3e-06,6.2e-05,4.3e-05,4.1e-05,9.1e-05,3.7e-05,7.1e-05,7e-05,4.2e-05
0.000103,7.8e-05,3.4e-05,6.7e-05,0.000106,1.3e-05,5e-05,5.3e-05,0.000129,3.9e-05,0.000133,8.5e-05,4.2e-05,9.4e-05,2.8e-05,8.7e-05,0.000103,6.7e-05,8.3e-05,6.1e-05,4.7e-05,9.6e-05,9.9e-05,9.5e-05,9.7e-05,5.2e-05,1.6e-05,3e-05,4.2e-05,9.6e-05,5.4e-05,2.1e-05,0.000104,3.7e-05,5.2e-05,5.6e-05,7.6e-05,6e-05,0.000109,6.2e-05,4.6e-05,9.5e-05,8.2e-05,4.3e-05,0.000113,6.3e-05,0.000164,0.000108,0.00014,8.5e-05,6.5e-05,9.3e-05,4.3e-05,5e-06,3.9e-05,9.1e-05,8.3e-05,0.000114,0.000108,8.8e-05,5.2e-05,0.000149,0.000102,0.000126,8.8e-05,8.2e-05,0.000123,0.000169,7.3e-05,0.000106,4.9e-05,4.1e-05,7.5e-05,2.6e-05,6.9e-05,8.4e-05,3.8e-05,0.000145,5.4e-05,5.7e-05,5.6e-05,6.2e-05,6.9e-05,0.00014,6.9e-05,4.6e-05,7.8e-05,4.3e-05,0.000141,0.000101,5.5e-05,1.7e-05,4.6e-05,4e-05,3.9e-05,0.000116,0.000103,9.1e-05,2.6e-05,7e-05,3.6e-05,2.7e-05,3.4e-05,5.8e-05,7.1e-05,9.7e-05,6.1e-05,2.7e-05,5.9e-05,2.2e-05,2.7e-05,6.8e-05,8.1e-05,5.5e-05,1.7e-05,3e-05,6.1e-05,0.000106,8.4e-05,4.1e-05,3.1e-05
2.5e-05,0.000136,7.3e-05,0.000126,6.1e-05,9.1e-05,0.000103,6.7e-05,7.8e-05,7.9e-05,0.000127,9.8e-05,0.000108,6.7e-05,4.8e-05,0.000102,7.7e-05,0.00021,3.3e-05,4e-05,5.5e-05,0.000121,0.000144,0.000118,0.000125,0.000116,4.8e-05,2e-05,4.9e-05,6.8e-05,2.1e-05,4.4e-05,0.00016,8.2e-05,0.000122,0.000137,8.1e-05,9.4e-05,1.2e-05,8.9e-05,3.1e-05,9.8e-05,0.000124,9.5e-05,9.6e-05,0.000169,0.000211,1.8e-05,3.2e-05,2e-05,0.000118,0.000136,1.4e-05,0.000112,2.9e-05,0.000114,5.6e-05,8.5e-05,8.8e-05,7.8e-05,2e-05,0.000143,0.000149,0.00011,5.7e-05,7.3e-05,5e-05,0.000116,0.000164,6.2e-05,3.8e-05,4.5e-05,9.8e-05,3e-05,0.000102,0.000102,9.4e-05,0.000207,9.1e-05,5.3e-05,8.7e-05,5e-06,0.000138,0.000134,1.1e-05,5.5e-05,5.5e-05,1e-04,0.000155,5.9e-05,0.000108,9.1e-05,8.7e-05,7.6e-05,5.2e-05,8e-05,3.1e-05,6e-05,8e-05,5.9e-05,4.3e-05,8e-05,9.9e-05,0.00013,5e-05,2.1e-05,0.000127,6.8e-05,0.00013,0.000147,2.4e-05,6.2e-05,6.8e-05,0.000103,7.5e-05,2.9e-05,2.5e-05,0.000114,6.1e-05,8.5e-05,3.6e-05
6.5e-05,0.000335,6.5e-05,0.000124,0.000219,0.000233,0.000148,0.000217,0.000301,0.000233,0.000239,0.00024,0.000123,0.000113,9.3e-05,0.000158,0.000109,0.000261,0.000269,0.000143,9.9e-05,5.7e-05,0.000324,0.000362,0.00023,8.1e-05,0.000185,0.00019,0.000127,0.000161,0.000181,0.000204,0.000258,9.1e-05,3.1e-05,9.9e-05,9.1e-05,0.000175,6.2e-05,0.000192,0.000117,0.000117,7.9e-05,0.00027,0.000343,0.000324,0.000473,0.000422,0.000215,0.000112,7.5e-05,7.9e-05,0.000124,0.000293,0.00024,2e-04,0.000227,0.000125,0.00022,0.000285,0.000249,7.5e-05,0.000252,0.000309,0.000363,0.000293,3e-04,0.000247,0.000302,0.000246,0.000126,0.000197,2.2e-05,4.9e-05,0.000251,0.000206,0.000222,0.000319,0.000252,0.000354,0.000169,4.6e-05,7.3e-05,0.000337,0.000226,5e-05,4.6e-05,0.000161,0.000155,0.00024,0.000318,0.000237,0.000269,0.00018,9.4e-05,0.00019,0.000179,0.000171,0.000221,0.000168,0.000116,0.000213,0.000137,0.000108,0.000101,0.000107,0.000207,8.7e-05,0.00018,0.000191,0.000209,0.000134,3.9e-05,0.000205,1.4e-05,0.000156,0.000169,0.000117,0.000127,0.000253,0.000168
0.000246,0.000481,0.000405,0.000225,0.000291,0.000148,7.5e-05,0.000188,0.000456,0.00029,0.000174,8.9e-05,0.000123,0.000189,0.000374,0.000308,0.000219,0.000146,0.000297,0.000188,0.000174,0.000181,0.000428,0.000391,0.00018,0.000128,0.00023,0.000164,0.000244,0.000114,0.000252,0.000183,9.7e-05,6.6e-05,0.000117,0.000103,3.6e-05,7.4e-05,0.000269,0.000225,0.000114,0.00017,9.5e-05,0.000422,0.000216,1.5e-05,0.000139,0.000218,0.000359,0.000107,8.4e-05,0.000144,3.9e-05,0.000312,0.000177,4.6e-05,0.000198,0.000207,0.000139,0.000128,0.000185,0.000128,0.000296,0.000258,0.000122,0.000131,0.000155,0.000291,0.000114,0.00012,0.000181,0.000181,0.000162,0.000104,0.000242,8.5e-05,1e-04,0.000163,0.000186,0.000334,0.000369,0.00029,0.000181,0.00042,0.000505,0.000279,0.00015,0.000118,0.000205,0.00025,0.000233,0.000132,0.000169,6.4e-05,0.000132,0.000178,0.000135,0.000186,0.000152,0.00013,4.1e-05,0.000259,0.000235,0.00015,0.000116,5.9e-05,0.000152,0.000214,0.000264,8.4e-05,0.00011,0.000186,0.000205,0.000204,0.000258,9.7e-05,0.000145,0.000376,0.00023,0.000155,9.9e-05
0.000153,0.00036,0.000396,0.000149,0.000254,0.000385,0.000345,8.8e-05,0.000354,0.000187,0.00018,0.000186,0.000207,0.000133,0.000382,0.000221,0.000129,1e-04,0.000238,6.3e-05,0.000213,0.000116,0.000295,0.000292,0.00036,0.000371,5.9e-05,0.000205,0.000198,0.000116,0.000251,0.000417,0.000506,0.000236,0.000257,0.000278,0.000162,0.000174,0.000392,0.000521,0.000416,0.000224,0.000177,0.000433,0.000471,0.000355,0.000432,0.000151,0.000301,0.000384,0.000171,0.000206,0.000165,0.000405,0.000233,9.3e-05,0.000143,0.000294,0.000269,0.000126,7.3e-05,4e-05,0.00026,6.4e-05,0.000148,0.000143,0.000154,5.9e-05,6.6e-05,0.000221,0.000322,0.000453,0.000149,0.000169,0.000239,0.000225,0.000348,0.00022,0.000315,0.000483,6.3e-05,0.000158,0.000371,0.000299,0.000304,0.000176,0.000172,8.9e-05,0.000101,0.000177,0.000157,0.000126,6.3e-05,5.7e-05,0.000183,6.5e-05,8.2e-05,9e-05,3.1e-05,0.000147,0.000168,0.000219,0.000228,0.000243,0.000267,0.000195,8e-05,0.000313,0.000176,0.000118,9.5e-05,9.8e-05,8.8e-05,0.000364,0.000408,0.000312,9.2e-05,0.000332,0.000428,0.000207,0.00017
0.000426,0.000411,0.000184,0.000456,0.000474,0.00059,0.000499,0.000437,0.00041,0.00028,0.00026,5.8e-05,5.7e-05,9.1e-05,0.000324,0.000125,8.7e-05,0.000318,0.00048,0.000289,0.000235,0.00027,0.000228,0.000108,0.000389,7.9e-05,0.000316,0.000439,0.000242,0.000122,0.000273,0.000211,0.000245,0.000381,0.000349,0.000329,0.000225,0.00027,0.000363,0.000144,0.000337,0.000287,0.000156,0.000279,0.00041,0.000431,0.000358,0.000738,0.000202,0.000395,0.000375,0.000168,0.000351,0.000111,0.000275,0.000172,5.5e-05,0.000208,0.000123,0.000252,0.000266,0.000174,0.00023,0.000177,4.4e-05,0.000239,0.000326,7.9e-05,3.6e-05,2e-04,0.000433,0.000186,0.000163,0.00032,0.000205,0.00019,0.000298,0.000502,0.000593,0.000623,0.000498,8.3e-05,0.000513,0.000699,0.000376,0.000133,4.3e-05,5.5e-05,2.4e-05,0.000179,0.000226,0.000208,0.000199,0.000149,0.000187,9.9e-05,0.000223,0.000136,0.000132,0.000174,0.000311,0.000414,0.000282,0.000237,0.000309,0.00011,0.000124,0.000368,0.000203,5.6e-05,3.3e-05,5.1e-05,0.000118,0.000296,8.8e-05,3.2e-05,5.6e-05,0.000225,0.000184,0.000205,0.00022
0.000194,1.3e-05,2.6e-05,0.000384,0.000539,0.000182,0.000173,0.000145,0.000107,0.00021,0.00022,0.000271,0.000126,1.7e-05,0.000222,0.000251,0.000218,0.000513,0.000442,0.000175,7.2e-05,7e-05,0.000163,0.000261,0.000218,0.000251,4e-04,0.000307,0.000306,0.000197,2e-04,5.8e-05,0.000219,0.000301,0.000243,0.000244,0.000151,0.000143,9.8e-05,0.000131,0.00015,0.000372,0.000284,0.000155,0.000139,0.000228,0.000407,0.000585,0.000446,9.2e-05,8.1e-05,0.000164,0.000354,0.00033,0.000116,0.000118,5.3e-05,0.00017,0.000326,0.000135,8.6e-05,6.6e-05,0.000176,5.7e-05,7.7e-05,0.000238,0.00032,0.000296,0.000106,0.00019,0.000257,0.000314,0.000237,0.00011,0.000329,0.000309,0.000427,0.000353,0.000195,0.000366,0.000364,0.000307,0.000248,0.000509,0.000365,0.000183,3.9e-05,5.5e-05,8.5e-05,0.000131,0.000128,9.7e-05,0.000117,3.1e-05,0.000117,0.000125,0.000247,9.3e-05,0.000143,0.000291,0.000169,9.8e-05,0.000354,0.000226,0.000213,0.000137,0.000194,0.000213,0.000274,0.000278,0.000214,0.000142,8e-05,1e-04,0.000131,0.00011,0.000109,0.000115,0.000223,0.000155,0.000205
5.3e-05,6.3e-05,0.000117,0.000234,1e-04,6.9e-05,3.4e-05,3.8e-05,0.000104,7.7e-05,3.7e-05,0.000127,2.7e-05,2e-05,9.9e-05,0.000132,0.000172,0.000232,6.2e-05,1.3e-05,2.7e-05,9.2e-05,6.5e-05,0.000155,5.9e-05,0.000119,0.000156,0.000164,0.000138,3.3e-05,6e-05,9.2e-05,9.1e-05,0.000205,8e-05,0.000103,4.8e-05,0.000184,0.000136,0.000104,9.4e-05,0.000207,0.000138,0.000136,0.000138,7e-05,0.000166,0.000145,8.9e-05,0.000168,0.00016,0.000251,0.000111,3.8e-05,5.9e-05,2.8e-05,0.000103,0.000136,7.7e-05,4.2e-05,9.3e-05,0.000146,0.00018,0.000116,3.8e-05,0.000101,0.000156,1.5e-05,6.7e-05,0.000156,6.2e-05,0.000118,3.9e-05,0.000136,0.000145,0.000139,6.3e-05,0.000138,0.000122,0.000135,0.000135,7.6e-05,0.00011,0.000208,0.000149,0.00011,0.000133,0.000112,6.9e-05,7.7e-05,2.5e-05,0.00015,3.6e-05,1.9e-05,5.5e-05,0.000103,5.4e-05,2.9e-05,7.5e-05,0.000153,6.3e-05,5.8e-05,0.000145,0.000159,6.4e-05,8.7e-05,8.8e-05,6.3e-05,0.000146,5e-05,0.000126,0.000154,6.4e-05,7.6e-05,0.000119,1e-05,7.4e-05,5.4e-05,0.000137,6.8e-05,0.000142
6.8e-05,1.4e-05,5.1e-05,7.5e-05,6.5e-05,8.1e-05,7.3e-05,6.3e-05,1.3e-05,8.7e-05,8e-06,2.5e-05,7e-05,7.2e-05,2.4e-05,0.000143,3.7e-05,0.000139,7.9e-05,3.4e-05,6.4e-05,7.5e-05,8.6e-05,6.4e-05,7.3e-05,9.1e-05,3.9e-05,0.000142,6.2e-05,2.4e-05,8.3e-05,8.4e-05,7.6e-05,0.000136,2.4e-05,5.2e-05,4e-05,0.000152,7.3e-05,4.4e-05,5.7e-05,0.000103,0.000121,7.6e-05,0.000121,4.7e-05,5.7e-05,6.6e-05,0.000115,3.7e-05,0.000106,0.000157,2.7e-05,3.7e-05,4.2e-05,1.9e-05,0.000101,7.6e-05,4e-05,5.5e-05,2e-05,7.5e-05,8.8e-05,7e-06,4.8e-05,0.000109,0.000102,9.4e-05,8.7e-05,8.2e-05,4.6e-05,3.5e-05,2.6e-05,0.000123,9.4e-05,9.1e-05,8.3e-05,0.000128,0.000119,0.000118,7.8e-05,0.000118,2.9e-05,0.000128,0.000145,4.4e-05,7.7e-05,6.4e-05,3.8e-05,3.1e-05,1.9e-05,9.2e-05,3.4e-05,1.7e-05,1.4e-05,3e-05,3.3e-05,2.5e-05,6e-05,7.5e-05,2.3e-05,3.7e-05,5e-05,4.4e-05,2.1e-05,7.3e-05,0.00011,4.9e-05,0.000112,6.9e-05,8e-05,4.6e-05,2.4e-05,8.1e-05,3.5e-05,3.6e-05,1.9e-05,2.2e-05,1e-04,7.5e-05,7.7e-05
0.000113,0.000125,0.00017,0.000175,6.4e-05,8.2e-05,0.00011,2.1e-05,5.6e-05,0.000154,9.4e-05,0.000145,0.000152,4.4e-05,8.4e-05,9.6e-05,0.000133,6.6e-05,0.000159,0.000127,0.000125,7.9e-05,0.000134,0.000125,0.000164,8.4e-05,4.8e-05,0.000105,0.000172,0.000179,0.000173,0.000161,0.000131,0.000179,7.4e-05,0.000108,4.7e-05,0.00015,0.000171,0.000109,0.000135,0.000141,0.000176,0.000128,2.5e-05,0.000108,0.000116,4.9e-05,7.9e-05,0.000178,0.00021,0.000219,1.9e-05,3e-05,5.3e-05,5.1e-05,4.3e-05,7.3e-05,3.7e-05,7e-05,5.7e-05,0.000112,0.000133,0.000102,4.3e-05,0.000104,2.6e-05,8.3e-05,5.4e-05,0.000112,0.000104,5.8e-05,5.6e-05,0.000175,9.3e-05,0.000107,7.2e-05,0.000111,0.000136,6.8e-05,0.00011,8.8e-05,0.000138,0.000122,5.5e-05,9e-05,7.7e-05,0.000167,0.000123,7.7e-05,3.5e-05,9.7e-05,4.6e-05,1.4e-05,3.2e-05,5.5e-05,6.2e-05,6.1e-05,0.000103,7.6e-05,0.000117,0.000105,1.3e-05,3.7e-05,2e-05,9e-05,9.4e-05,4.8e-05,9.3e-05,9.8e-05,0.000105,0.000102,0.00012,0.00013,9.2e-05,1.8e-05,7.4e-05,7.3e-05,5.2e-05,5.3e-05,9.8e-05
0.000116,0.000123,0.000139,0.000231,0.000266,0.000231,0.000243,0.000209,7.4e-05,0.000105,0.000162,0.000151,5.2e-05,2.1e-05,0.000151,0.000105,0.00012,0.000138,0.000123,8e-05,3.3e-05,5.1e-05,9.4e-05,0.00026,0.000148,0.000153,7.6e-05,0.000139,0.000103,0.00011,3.2e-05,0.000112,0.000127,9.7e-05,9.6e-05,0.000161,0.00021,0.000205,4.6e-05,0.000118,7.1e-05,9.5e-05,8.2e-05,6.1e-05,6.8e-05,5.1e-05,6.3e-05,8.7e-05,4.8e-05,0.000102,0.000229,8.7e-05,0.00016,0.000117,7e-05,4.5e-05,3.6e-05,0.000128,7.3e-05,7e-05,2.6e-05,8.7e-05,8e-05,0.000102,0.000134,6.3e-05,9.1e-05,5.7e-05,8.3e-05,3.3e-05,0.000167,0.000106,0.000121,0.000151,8e-05,4.3e-05,3.8e-05,0.000134,5.1e-05,6.1e-05,2.2e-05,1.5e-05,4.6e-05,6.4e-05,9.8e-05,0.000142,1.1e-05,0.000142,6.7e-05,7.9e-05,5.6e-05,0.000125,8.4e-05,6.5e-05,7e-05,0.000106,2.5e-05,3.6e-05,6.3e-05,5.1e-05,0.000108,0.000118,0.000123,6.8e-05,6.3e-05,7.5e-05,0.000103,0.000167,7.6e-05,0.000131,0.000146,4.2e-05,8.3e-05,0.000103,3.7e-05,3e-06,7.6e-05,1.7e-05,4.7e-05,4.8e-05,9.2e-05
0.000109,5.8e-05,0.00015,0.00016,5e-05,8e-05,0.000119,1e-04,5.6e-05,6.9e-05,7e-06,3.8e-05,0.000159,8.7e-05,0.000116,3.4e-05,3.9e-05,7.2e-05,0.000148,5.1e-05,3e-05,7.5e-05,0.000121,0.00029,0.000113,0.000115,0.000111,2.6e-05,6.9e-05,3.1e-05,5.1e-05,0.00017,0.000126,1.7e-05,7.3e-05,0.000208,8e-05,0.000159,9.6e-05,0.000155,1.4e-05,9.8e-05,0.000149,0.000182,5.8e-05,2.1e-05,0.000152,2e-04,0.000187,0.000102,0.000146,0.000142,0.000131,2.7e-05,3e-05,7.8e-05,6.4e-05,9.3e-05,9.9e-05,7.3e-05,3.6e-05,7e-05,1.3e-05,8.8e-05,2.7e-05,6.1e-05,8.1e-05,0.000117,7.7e-05,0.000129,1.8e-05,8.1e-05,0.00015,7.9e-05,5.2e-05,3.8e-05,7.9e-05,0.000118,5.1e-05,4.2e-05,5.1e-05,5.4e-05,8.5e-05,0.00014,7.9e-05,0.000125,0.000131,4.1e-05,7.1e-05,0.000136,3.1e-05,7.4e-05,8.9e-05,5.7e-05,7e-05,1.9e-05,3.9e-05,4.5e-05,5.6e-05,0.000133,4e-05,5.1e-05,6.2e-05,7.4e-05,9.7e-05,5e-05,1.5e-05,0.000112,0.000157,0.000112,5.8e-05,4.1e-05,3.1e-05,8.3e-05,5.8e-05,2.8e-05,2.7e-05,6.6e-05,2.3e-05,1.1e-05,9.3e-05
6.4e-05,7.9e-05,4.5e-05,0.000219,0.000128,4.9e-05,9e-05,7.8e-05,4.3e-05,2.4e-05,4.9e-05,0.000137,0.000229,0.000127,6.3e-05,0.000132,9.6e-05,7.4e-05,0.000106,5.6e-05,4.4e-05,2.1e-05,0.000127,0.000138,0.000208,8.6e-05,0.000118,7.4e-05,1.5e-05,9.5e-05,9.3e-05,0.000175,0.000222,0.000156,0.000104,3.6e-05,8.8e-05,0.000161,0.000133,7.3e-05,0.000115,0.000115,9.5e-05,0.000123,2.8e-05,7.6e-05,0.000189,0.000127,0.000106,0.000167,0.000113,9.3e-05,3.2e-05,0.000118,8.5e-05,0.000105,1.6e-05,5.3e-05,6.8e-05,7e-05,2.8e-05,6e-05,9.1e-05,0.000113,0.000102,9e-05,5.8e-05,0.000128,4.8e-05,0.000173,0.000159,0.000215,0.00013,3.7e-05,0.000131,0.000108,7.7e-05,0.000192,4.7e-05,6.7e-05,9.2e-05,0.000156,0.000283,0.00014,4.8e-05,1.6e-05,3.9e-05,6.6e-05,6.6e-05,6.8e-05,0.000101,7.7e-05,6.5e-05,9.5e-05,0.000147,0.000148,1e-04,7.3e-05,2.3e-05,0.000103,0.000132,3.4e-05,6e-05,2.6e-05,9.4e-05,6.6e-05,6.5e-05,8.5e-05,3.3e-05,0.000126,0.000106,6.3e-05,1.6e-05,6.9e-05,2.9e-05,6.5e-05,3.7e-05,7.8e-05,0.000128,4.2e-05,8.8e-05
7.9e-05,6.2e-05,0.000152,0.00013,3.2e-05,8e-05,3.6e-05,7.1e-05,4.3e-05,2.5e-05,5.3e-05,0.000139,7.2e-05,2.3e-05,5.8e-05,0.000113,8.6e-05,0.000112,4.2e-05,6e-05,9e-05,6.5e-05,5.1e-05,2.1e-05,0.000124,5.3e-05,0.000155,9.3e-05,5.7e-05,7e-05,7.8e-05,0.000165,3.3e-05,6.2e-05,6.4e-05,5.3e-05,1.3e-05,0.000153,9.8e-05,9e-06,9.3e-05,3.5e-05,0.000104,3e-05,5.4e-05,9.5e-05,7.5e-05,0.000117,0.000101,0.000116,6.1e-05,0.000119,0.000105,8.2e-05,8.2e-05,3.2e-05,8.6e-05,3.5e-05,3e-05,1.1e-05,3.2e-05,1.4e-05,6.5e-05,8.4e-05,7.4e-05,2.8e-05,0.000118,1e-04,6.6e-05,0.000125,4.6e-05,0.000112,8.9e-05,8e-05,5e-05,3.6e-05,2.8e-05,9.8e-05,9.6e-05,8.9e-05,0.000178,4e-05,0.000171,0.000117,8.1e-05,2.7e-05,2.1e-05,2.8e-05,1.9e-05,3.6e-05,7.1e-05,6.9e-05,0.000118,2.8e-05,6.7e-05,7.6e-05,4.1e-05,8.1e-05,7.7e-05,6.9e-05,1e-04,6.8e-05,3.5e-05,4.1e-05,8e-05,4.2e-05,7.5e-05,9e-06,8.8e-05,0.000159,2.5e-05,3.2e-05,7.7e-05,8.8e-05,2e-05,8e-05,3.9e-05,0.000101,5.9e-05,1.5e-05,5.1e-05
0.000135,3.7e-05,0.000131,9.3e-05,5.5e-05,0.000113,0.000115,0.000132,0.000113,7.9e-05,7.2e-05,9.7e-05,0.000137,0.000131,0.00011,2.7e-05,2.2e-05,9.8e-05,5.1e-05,7.3e-05,0.000178,0.000114,0.000116,9.8e-05,0.000139,0.000212,0.000214,0.000128,4e-05,4.5e-05,7.1e-05,0.000106,0.000135,0.000137,8.1e-05,0.000156,0.000131,0.000135,9.4e-05,0.000115,7.3e-05,3.3e-05,0.000122,7.5e-05,8.6e-05,3.2e-05,1.2e-05,9.6e-05,8e-05,0.000155,0.000149,6.2e-05,9.3e-05,1e-04,5.4e-05,7.9e-05,9.4e-05,0.000114,6.3e-05,2.7e-05,4.7e-05,1e-05,3.3e-05,5.9e-05,0.000168,0.000105,0.00011,0.000145,9.9e-05,9.8e-05,0.000141,0.000121,0.000127,1.9e-05,2.9e-05,5.7e-05,7.5e-05,0.000148,0.000172,0.000104,0.00011,9.2e-05,0.00013,5e-05,6.8e-05,1.4e-05,2.6e-05,7.3e-05,6.3e-05,8e-06,5.6e-05,1.2e-05,4.2e-05,4.6e-05,5.4e-05,0.00012,0.000122,7.1e-05,9.4e-05,8.5e-05,3.3e-05,4.8e-05,6.9e-05,3.4e-05,8.1e-05,6.1e-05,4.3e-05,1.7e-05,8e-05,8.3e-05,0.000144,5.8e-05,7.6e-05,2.8e-05,6.8e-05,0.000109,7.4e-05,9.7e-05,0.000116,7.5e-05,6.6e-05
6.7e-05,5.3e-05,4.5e-05,5.7e-05,2.6e-05,0.000119,8.7e-05,4.5e-05,0.00011,4e-05,3.8e-05,7.4e-05,0.000103,0.000125,7.3e-05,0.000126,0.000111,5.4e-05,4.1e-05,5.9e-05,0.00017,0.000103,3.7e-05,4e-05,7.6e-05,9.3e-05,8.6e-05,6.5e-05,0.000111,0.000123,5.7e-05,2e-05,6.5e-05,9.7e-05,8.2e-05,0.000111,0.000163,7.2e-05,8.2e-05,6.9e-05,0.00012,7.8e-05,0.000102,6e-05,0.000107,2.7e-05,2.5e-05,0.000117,4.8e-05,9.3e-05,1.8e-05,9.5e-05,4.1e-05,1.2e-05,3e-05,5.3e-05,8.2e-05,5.3e-05,8.4e-05,9.2e-05,8.4e-05,9e-05,7.4e-05,8.4e-05,0.000146,8.1e-05,5.9e-05,4.3e-05,6.6e-05,5.5e-05,7.9e-05,7.8e-05,5.9e-05,5.6e-05,1.9e-05,6.6e-05,0.000136,2.6e-05,0.000103,5.7e-05,0.000149,7.8e-05,3.6e-05,4.2e-05,6.4e-05,2.2e-05,2.4e-05,5.7e-05,3.7e-05,4.3e-05,3.8e-05,4.6e-05,5.1e-05,4e-05,7.9e-05,7.4e-05,9.7e-05,0.000176,4.6e-05,2.2e-05,7e-05,7.8e-05,6.4e-05,6.5e-05,6.3e-05,1.2e-05,8.3e-05,7.8e-05,3.9e-05,2.3e-05,9.1e-05,3.3e-05,4.5e-05,4.7e-05,7.9e-05,1.4e-05,0.000104,3e-05,3e-05,7.4e-05,1.9e-05
2.8e-05,4.3e-05,2.9e-05,7e-05,3.8e-05,7.7e-05,1.9e-05,4.1e-05,9.8e-05,7.3e-05,5e-05,2.9e-05,1.1e-05,5e-05,6.5e-05,9.4e-05,9.1e-05,7.4e-05,5.6e-05,9e-05,5.8e-05,1e-04,2.9e-05,6.3e-05,1.5e-05,3.6e-05,6.7e-05,4.9e-05,9.5e-05,7.3e-05,3.7e-05,2.9e-05,2.6e-05,1.7e-05,7.2e-05,2.9e-05,8.9e-05,2.9e-05,8.7e-05,6.2e-05,9.7e-05,0.000141,0.000109,5.1e-05,0.000114,3.4e-05,1e-05,5.3e-05,7.1e-05,7.7e-05,0.000101,6.2e-05,6.9e-05,6.9e-05,4.8e-05,9e-05,6.7e-05,7.4e-05,6.5e-05,3.4e-05,3.9e-05,3.7e-05,2.3e-05,5.1e-05,5.9e-05,6.4e-05,5.6e-05,2.4e-05,4.3e-05,5.5e-05,2.7e-05,7e-05,3.6e-05,6.9e-05,4.5e-05,6.7e-05,7e-05,6.7e-05,4.7e-05,5.8e-05,7.5e-05,9.6e-05,6e-05,7.2e-05,8.3e-05,5.4e-05,2e-05,5.1e-05,6.7e-05,2.8e-05,4.6e-05,4.8e-05,6.9e-05,5e-05,0.000103,2.7e-05,1.5e-05,7.1e-05,5e-05,2.2e-05,4.6e-05,5e-05,5.1e-05,1.8e-05,6.6e-05,7.5e-05,7.4e-05,7.4e-05,5.3e-05,7.3e-05,2.2e-05,5.6e-05,1.5e-05,2.9e-05,2.2e-05,3e-06,7e-05,5.8e-05,5.9e-05,5.9e-05,5.3e-05
8.7e-05,4.9e-05,9.4e-05,2.8e-05,1.5e-05,9.9e-05,5.4e-05,9e-06,0.000115,0.000101,6.1e-05,5.5e-05,4.7e-05,3.3e-05,2.3e-05,5.5e-05,4.6e-05,8.5e-05,7.5e-05,8.4e-05,5.2e-05,0.000105,1.9e-05,9.5e-05,1.5e-05,3.5e-05,2.2e-05,5e-06,0.000143,0.000113,7.3e-05,1.4e-05,3.4e-05,4e-05,9.3e-05,2.3e-05,3.4e-05,0.000102,0.000108,6.6e-05,9e-05,4.7e-05,7e-06,3e-05,7.9e-05,5.1e-05,3e-05,1.2e-05,6.2e-05,3.2e-05,7e-05,6.6e-05,8.8e-05,4.6e-05,9e-06,8e-05,7.5e-05,8e-05,5.8e-05,1.5e-05,1.4e-05,1.1e-05,2.8e-05,4.6e-05,5.3e-05,9e-06,7.2e-05,7e-05,9.1e-05,7.2e-05,4.1e-05,7.1e-05,2.2e-05,5.4e-05,7.7e-05,4.9e-05,6.1e-05,6e-05,3.7e-05,7.9e-05,6.6e-05,0.000125,1.3e-05,7.5e-05,3.1e-05,5.8e-05,1.4e-05,5.1e-05,8.6e-05,9.1e-05,9.6e-05,3.2e-05,1e-04,3.9e-05,9.1e-05,8.3e-05,4.9e-05,9.6e-05,5.2e-05,2.7e-05,1.2e-05,4.8e-05,2.5e-05,3.1e-05,3.2e-05,2.7e-05,4.7e-05,1.7e-05,6e-05,5.9e-05,6.3e-05,9.4e-05,0.000109,5.9e-05,4.9e-05,4.7e-05,1.4e-05,3.7e-05,1.9e-05,1.6e-05,2.6e-05
8e-05,6.5e-05,3.8e-05,3.4e-05,1.3e-05,6.6e-05,3.1e-05,1.9e-05,6.1e-05,4.1e-05,3.7e-05,9e-06,2.2e-05,1.2e-05,2.9e-05,3.9e-05,3.4e-05,5.8e-05,2.1e-05,1e-05,1e-05,2.5e-05,1.6e-05,4e-05,4.4e-05,1.3e-05,1.8e-05,1.7e-05,6.6e-05,6.8e-05,3.9e-05,2.3e-05,2.5e-05,3.5e-05,1.2e-05,4e-05,1.9e-05,2.2e-05,3e-05,3.4e-05,4.1e-05,3.4e-05,4.8e-05,2.6e-05,3.1e-05,4.1e-05,3.3e-05,5.1e-05,2.8e-05,1.4e-05,1.8e-05,4.8e-05,1.5e-05,1.3e-05,1.1e-05,4.5e-05,6e-05,4.6e-05,5.3e-05,5.6e-05,5.6e-05,3.3e-05,2e-05,1.9e-05,1.1e-05,1.3e-05,3.7e-05,3.3e-05,2.9e-05,1.3e-05,3.5e-05,4.2e-05,3.2e-05,5e-06,3.8e-05,3e-05,1.5e-05,3.7e-05,4.3e-05,3.2e-05,1e-05,5.3e-05,6.7e-05,4.8e-05,2.3e-05,2.1e-05,3.2e-05,1.4e-05,1.9e-05,2.1e-05,4.4e-05,3.3e-05,3.8e-05,2.9e-05,3.7e-05,5.8e-05,3.5e-05,7.7e-05,3.7e-05,1.7e-05,8e-06,3.5e-05,3.3e-05,4.8e-05,3.7e-05,2.3e-05,3e-06,1.5e-05,3.6e-05,4e-05,8e-06,2.7e-05,3.1e-05,4.4e-05,3.6e-05,2.3e-05,5.5e-05,2.4e-05,4e-06,2.1e-05,3.3e-05
4.5e-05,1.2e-05,2.8e-05,2.9e-05,7e-06,5.9e-05,5.2e-05,5.5e-05,8.1e-05,5.8e-05,3.4e-05,3.1e-05,3.6e-05,3.7e-05,7.1e-05,5.7e-05,3.8e-05,3.1e-05,3.8e-05,4.4e-05,3.2e-05,9e-06,2.3e-05,2.3e-05,2.9e-05,1.1e-05,2.6e-05,4.7e-05,3.5e-05,1.6e-05,3.5e-05,2.2e-05,1.3e-05,3.7e-05,4.6e-05,5.6e-05,7.9e-05,3.3e-05,2.9e-05,1.6e-05,1.2e-05,3.3e-05,3.1e-05,2.6e-05,3.8e-05,3.7e-05,3e-05,5.3e-05,4.7e-05,2.9e-05,4.2e-05,4.6e-05,3.2e-05,1.8e-05,1.5e-05,4e-05,4.6e-05,2.1e-05,2.5e-05,4.1e-05,3.1e-05,2.7e-05,3.8e-05,1.2e-05,1.1e-05,2.1e-05,6e-06,4.3e-05,2e-05,3.6e-05,2.6e-05,2.3e-05,5.4e-05,4.6e-05,2.3e-05,1.7e-05,2e-05,3.5e-05,2.5e-05,3.3e-05,3.9e-05,6e-05,3.2e-05,4.8e-05,1.9e-05,1.8e-05,4.5e-05,4.1e-05,2.7e-05,1.9e-05,5.2e-05,9e-06,1.9e-05,2.9e-05,6.3e-05,8.4e-05,4.1e-05,8e-05,6.1e-05,2.4e-05,6e-06,3.8e-05,1.1e-05,3.7e-05,3.7e-05,2.8e-05,3.2e-05,4.2e-05,1.2e-05,4e-05,5.7e-05,3.5e-05,2.6e-05,2.9e-05,9.2e-05,7.5e-05,2.2e-05,2e-05,5e-06,1.6e-05,4.1e-05
5.2e-05,6.1e-05,2.5e-05,1e-05,2.2e-05,5.4e-05,1.6e-05,2.9e-05,2.7e-05,3.7e-05,3e-05,2e-05,1.8e-05,9e-06,6e-05,7.5e-05,6.2e-05,5e-05,2.6e-05,7.1e-05,6.9e-05,5.6e-05,2.6e-05,5.5e-05,2.4e-05,4.4e-05,1.1e-05,3.3e-05,2.6e-05,1.6e-05,2.6e-05,1.9e-05,2.7e-05,4.5e-05,1.4e-05,4.3e-05,5.7e-05,4.9e-05,2.8e-05,3.1e-05,2.5e-05,6.8e-05,6.8e-05,1.9e-05,3.6e-05,2.3e-05,6e-06,2.8e-05,4.9e-05,3.1e-05,1.9e-05,6.7e-05,3.4e-05,4.9e-05,6.1e-05,4.7e-05,2.1e-05,1.2e-05,2.7e-05,2.2e-05,4.9e-05,2.6e-05,1.3e-05,2.1e-05,1.3e-05,4e-05,2.5e-05,5.3e-05,4.5e-05,4.9e-05,5.4e-05,1.8e-05,3.6e-05,1.5e-05,2.3e-05,2.4e-05,4.7e-05,4.5e-05,4e-05,7.4e-05,7.1e-05,7.7e-05,5.7e-05,5.7e-05,3.8e-05,1.5e-05,3.2e-05,6e-06,4.3e-05,4.1e-05,6.9e-05,6.9e-05,2.6e-05,3.3e-05,2.8e-05,4.9e-05,1.9e-05,5.3e-05,3.1e-05,2e-05,1.2e-05,2.8e-05,3.1e-05,2e-05,5e-06,2.7e-05,2e-06,4e-05,3.6e-05,2.2e-05,3.1e-05,3.4e-05,6.2e-05,2.6e-05,8.8e-05,8.9e-05,8.2e-05,4.8e-05,2.2e-05,2e-05,2.9e-05
2.7e-05,2.8e-05,1.6e-05,7e-06,9e-06,2.9e-05,3.9e-05,2.3e-05,4.2e-05,1.3e-05,7e-06,5e-06,1.3e-05,2e-05,4.6e-05,2.7e-05,3.8e-05,1.6e-05,4.1e-05,2.6e-05,1.6e-05,7e-06,3.3e-05,5.2e-05,4e-05,6e-05,4.7e-05,9e-06,5e-06,2.2e-05,8e-06,7e-06,4e-06,3e-05,5.3e-05,3e-06,6.6e-05,4.1e-05,3.1e-05,3.3e-05,4.8e-05,5.2e-05,1.9e-05,3.1e-05,3.8e-05,3.3e-05,2.4e-05,2.6e-05,2.9e-05,1.9e-05,1.7e-05,2.2e-05,2.5e-05,3.8e-05,3.8e-05,1.3e-05,9e-06,2.1e-05,1.3e-05,4.4e-05,2.1e-05,3.6e-05,2.8e-05,3.5e-05,2.3e-05,4.4e-05,1.9e-05,2.6e-05,1.8e-05,3.7e-05,4.4e-05,5.4e-05,3.9e-05,3.2e-05,1.8e-05,8e-06,2.5e-05,2.9e-05,4.6e-05,6e-05,4.6e-05,1.1e-05,3.1e-05,3e-05,1e-05,2.2e-05,2.6e-05,2.4e-05,2.8e-05,1.3e-05,3.3e-05,2.7e-05,2.2e-05,2.5e-05,4.3e-05,1.2e-05,1.9e-05,4.8e-05,1.5e-05,6e-06,1.9e-05,8e-06,2.5e-05,2.1e-05,8e-06,1.9e-05,3.4e-05,2.4e-05,1.5e-05,4e-06,3.5e-05,4.6e-05,4.5e-05,1e-05,5.3e-05,3.7e-05,8e-06,2.6e-05,1.9e-05,3.7e-05,1.1e-05
2.2e-05,4e-06,6e-06,2.1e-05,1e-05,2e-05,2.8e-05,4e-06,2.4e-05,1.6e-05,1.4e-05,1.1e-05,7e-06,1.6e-05,1e-05,2.3e-05,1.1e-05,1.3e-05,1e-06,1.3e-05,1.7e-05,1.9e-05,2e-06,2.4e-05,8e-06,3.4e-05,1.2e-05,8e-06,1e-05,1.9e-05,2e-05,6e-06,1.4e-05,2.5e-05,1.1e-05,2e-05,2.2e-05,1.7e-05,2.3e-05,2.2e-05,2.2e-05,2.1e-05,6e-06,1.6e-05,1.2e-05,1.5e-05,1.1e-05,8e-06,1.6e-05,1e-05,5e-06,1e-06,2e-05,1.6e-05,1.4e-05,7e-06,2e-05,1.3e-05,9e-06,3.6e-05,1.6e-05,2.7e-05,7e-06,1.5e-05,7e-06,1.2e-05,6e-06,1.6e-05,5e-06,1.6e-05,1.2e-05,2.2e-05,1e-06,2.3e-05,1.7e-05,1e-05,5e-06,1.1e-05,2.7e-05,2.3e-05,9e-06,1.2e-05,9e-06,8e-06,1e-05,3.2e-05,3e-06,2e-05,5e-06,9e-06,2e-06,1.7e-05,6e-06,1.4e-05,1.6e-05,2e-06,9e-06,2.5e-05,1.1e-05,6e-06,1.8e-05,1e-05,1.4e-05,1.8e-05,5e-06,7e-06,1.7e-05,2.6e-05,2e-05,2.8e-05,1.3e-05,2.8e-05,9e-06,1.6e-05,2.9e-05,1.2e-05,8e-06,1.5e-05,1.5e-05,3.6e-05,1.7e-05
5e-06,8e-06,9e-06,2.1e-05,9e-06,1.8e-05,1.3e-05,1e-05,5e-06,8e-06,8e-06,1e-06,1.4e-05,1.5e-05,2.7e-05,1.3e-05,5e-06,3.5e-05,1.8e-05,1.8e-05,1.3e-05,1.4e-05,1.5e-05,2.3e-05,8e-06,1.2e-05,6e-06,7e-06,8e-06,7e-06,1e-05,1.4e-05,2e-06,1.4e-05,9e-06,5e-06,2.8e-05,1.9e-05,1.7e-05,1.3e-05,2e-05,2.2e-05,6e-06,7e-06,2e-05,2.1e-05,3e-06,9e-06,1.2e-05,8e-06,1e-05,7e-06,9e-06,1.4e-05,1.1e-05,2e-06,1.8e-05,1.2e-05,8e-06,1.1e-05,2e-06,1.1e-05,9e-06,1.5e-05,5e-06,6e-06,1.2e-05,1.8e-05,7e-06,3e-06,7e-06,1.1e-05,2e-06,1.9e-05,9e-06,1.4e-05,8e-06,1.9e-05,1.2e-05,6e-06,7e-06,1.3e-05,2.1e-05,1.3e-05,7e-06,1.7e-05,1.4e-05,2e-05,4e-06,1.5e-05,1.3e-05,7e-06,7e-06,4e-06,1.9e-05,8e-06,5e-06,1.7e-05,7e-06,1e-06,1.5e-05,5e-06,7e-06,9e-06,8e-06,3e-06,1.1e-05,1.1e-05,1.6e-05,1.5e-05,1.4e-05,1.4e-05,5e-06,8e-06,2e-05,1.5e-05,9e-06,8e-06,1.6e-05,1.8e-05,1.1e-05
7e-06,8e-06,2.1e-05,2.5e-05,5e-06,1.4e-05,8e-06,7e-06,1.4e-05,1.3e-05,7e-06,3e-06,9e-06,1.8e-05,1.2e-05,8e-06,3e-06,3.1e-05,8e-06,1.4e-05,4e-06,2.1e-05,4e-06,2.2e-05,1.2e-05,1.3e-05,6e-06,1.3e-05,7e-06,1.1e-05,1e-05,5e-06,1.1e-05,1.1e-05,1.5e-05,4e-06,2.4e-05,1.4e-05,2.1e-05,2.1e-05,1.5e-05,3e-06,1e-05,6e-06,8e-06,1e-05,1.8e-05,9e-06,1.5e-05,9e-06,6e-06,1.1e-05,6e-06,1.1e-05,8e-06,3e-06,1.2e-05,8e-06,4e-06,9e-06,6e-06,1e-06,6e-06,9e-06,9e-06,1.6e-05,9e-06,1.2e-05,1.2e-05,8e-06,5e-06,1.4e-05,7e-06,8e-06,1.6e-05,9e-06,3e-06,1.8e-05,1.6e-05,1.1e-05,5e-06,1e-05,2.3e-05,1.9e-05,4e-06,6e-06,5e-06,6e-06,1e-05,1e-05,6e-06,8e-06,5e-06,1.3e-05,2.4e-05,9e-06,1e-05,1.1e-05,8e-06,5e-06,1.7e-05,1.4e-05,1.1e-05,5e-06,2e-06,5e-06,6e-06,4e-06,9e-06,1.4e-05,8e-06,2e-06,1.6e-05,9e-06,4e-06,1.1e-05,7e-06,9e-06,1.1e-05,1.3e-05,1.3e-05
4e-06,5e-06,9e-06,2.4e-05,6e-06,1.5e-05,8e-06,8e-06,9e-06,5e-06,7e-06,4e-06,7e-06,1e-05,3e-06,1.2e-05,4e-06,2.4e-05,6e-06,8e-06,3e-06,1.8e-05,2e-06,1.9e-05,1.5e-05,2.4e-05,4e-06,7e-06,1e-06,1.5e-05,8e-06,6e-06,1.8e-05,7e-06,4e-06,6e-06,2.3e-05,1.3e-05,1e-05,8e-06,1.1e-05,9e-06,1.2e-05,4e-06,1e-06,6e-06,1.1e-05,5e-06,9e-06,6e-06,7e-06,1.2e-05,7e-06,8e-06,6e-06,8e-06,8e-06,5e-06,4e-06,1.1e-05,6e-06,6e-06,6e-06,3e-06,3e-06,1.3e-05,1e-05,6e-06,4e-06,6e-06,5e-06,7e-06,6e-06,4e-06,8e-06,1.1e-05,5e-06,1e-05,1.4e-05,1.2e-05,8e-06,8e-06,1.9e-05,1.4e-05,3e-06,2e-06,1e-06,5e-06,2e-06,7e-06,3e-06,3e-06,5e-06,1.4e-05,1.5e-05,8e-06,8e-06,9e-06,5e-06,0,1e-05,1e-05,5e-06,3e-06,5e-06,6e-06,3e-06,2e-06,4e-06,1e-05,3e-06,9e-06,1.6e-05,9e-06,9e-06,5e-06,4e-06,7e-06,7e-06,1.3e-05,5e-06
1e-05,7e-06,6e-06,2.1e-05,4e-06,1.1e-05,2e-05,2e-06,7e-06,2e-06,5e-06,3e-06,8e-06,6e-06,1.2e-05,6e-06,5e-06,2.3e-05,7e-06,4e-06,8e-06,1.4e-05,4e-06,7e-06,1.7e-05,2.4e-05,1.9e-05,3e-06,3e-06,1.4e-05,5e-06,8e-06,8e-06,1.3e-05,1.2e-05,1.3e-05,1.2e-05,1.7e-05,1.4e-05,3e-06,1.5e-05,1.6e-05,1.1e-05,1.5e-05,3e-06,5e-06,1e-06,9e-06,1.6e-05,1.3e-05,1.5e-05,1.5e-05,1.2e-05,8e-06,6e-06,7e-06,4e-06,6e-06,2e-06,7e-06,6e-06,5e-06,1e-05,5e-06,1.2e-05,9e-06,1.4e-05,2e-05,1e-05,1e-05,6e-06,2.2e-05,7e-06,5e-06,1.4e-05,1.4e-05,9e-06,2.1e-05,6e-06,8e-06,6e-06,1.2e-05,1.6e-05,1.7e-05,1e-05,5e-06,6e-06,1.2e-05,2e-06,3e-06,0,7e-06,9e-06,1e-05,2e-05,1.2e-05,1.2e-05,7e-06,1.2e-05,1e-06,4e-06,4e-06,9e-06,2e-06,4e-06,9e-06,1.2e-05,1.2e-05,1.1e-05,9e-06,8e-06,4e-06,7e-06,1.5e-05,1e-06,2e-06,3e-06,8e-06,5e-06,8e-06,8e-06
1.5e-05,7e-06,5e-06,5e-06,7e-06,1e-06,9e-06,5e-06,5e-06,7e-06,8e-06,1.1e-05,5e-06,1.3e-05,1.3e-05,1.1e-05,4e-06,2.3e-05,8e-06,4e-06,4e-06,2e-05,6e-06,1.8e-05,1.2e-05,1.1e-05,9e-06,9e-06,9e-06,1.6e-05,1e-05,1e-06,5e-06,6e-06,1.9e-05,1.7e-05,2.7e-05,8e-06,1.2e-05,1.3e-05,9e-06,1.4e-05,1e-05,1.3e-05,0,6e-06,7e-06,1.8e-05,4e-06,1e-06,6e-06,1e-05,5e-06,8e-06,1.2e-05,5e-06,1e-05,2e-06,8e-06,1e-05,1.3e-05,2e-06,1.2e-05,1.7e-05,7e-06,1.8e-05,1e-05,7e-06,7e-06,5e-06,7e-06,2e-05,5e-06,5e-06,1.2e-05,1.2e-05,1.1e-05,2.4e-05,1.9e-05,9e-06,1.1e-05,1.7e-05,1.8e-05,2.2e-05,1.2e-05,1.3e-05,2e-06,8e-06,8e-06,4e-06,9e-06,9e-06,1.2e-05,1.3e-05,5e-06,6e-06,2e-06,1e-05,1.2e-05,1.3e-05,2.2e-05,1.4e-05,6e-06,1.5e-05,1.1e-05,9e-06,8e-06,4e-06,1.6e-05,9e-06,8e-06,9e-06,6e-06,5e-06,1.1e-05,5e-06,7e-06,6e-06,1.9e-05,1.2e-05,1.3e-05
1.1e-05,1.1e-05,7e-06,2.2e-05,6e-06,3e-06,1.6e-05,7e-06,1.3e-05,5e-06,1.1e-05,2.6e-05,2.2e-05,2.4e-05,1.8e-05,1.6e-05,1.2e-05,2e-05,4e-06,1e-06,1.1e-05,3.4e-05,4e-06,2e-05,8e-06,9e-06,6e-06,4e-06,9e-06,9e-06,5e-06,1.4e-05,7e-06,1e-06,1.7e-05,1.3e-05,1.4e-05,2.3e-05,1.7e-05,2e-06,1e-05,9e-06,1.1e-05,7e-06,7e-06,5e-06,6e-06,2.9e-05,1.8e-05,5e-06,6e-06,1.3e-05,2.2e-05,2.1e-05,6e-06,1.6e-05,1.6e-05,1.4e-05,1e-05,2.1e-05,7e-06,7e-06,1e-05,7e-06,1.1e-05,1.6e-05,2.2e-05,1.4e-05,1.1e-05,5e-06,7e-06,6e-06,9e-06,2e-06,1.7e-05,3e-06,3e-06,2.1e-05,8e-06,4e-06,1e-06,6e-06,1e-05,2.6e-05,1e-05,1e-05,1e-05,1.2e-05,1.3e-05,7e-06,9e-06,1.5e-05,1.5e-05,5e-06,2.2e-05,7e-06,4e-06,1.5e-05,1.4e-05,1e-05,1e-05,1e-05,9e-06,1.7e-05,9e-06,4e-06,6e-06,1.4e-05,1.5e-05,2e-06,7e-06,1e-06,1.2e-05,4e-06,1.3e-05,6e-06,3e-06,1.4e-05,2e-05,7e-06,1.2e-05
1e-05,2.6e-05,2.5e-05,2.2e-05,1.2e-05,7e-06,1.1e-05,1.1e-05,1.3e-05,4e-06,5e-06,1.8e-05,1.9e-05,1e-05,1e-06,1.4e-05,7e-06,2.2e-05,8e-06,3e-06,1.1e-05,1.9e-05,1.2e-05,1.3e-05,1.5e-05,6e-06,8e-06,1.3e-05,3e-06,5e-06,1.3e-05,2.5e-05,2.4e-05,1.2e-05,1.2e-05,2.2e-05,1.9e-05,2.4e-05,3.5e-05,2.1e-05,2e-05,1.1e-05,9e-06,1.3e-05,1.4e-05,1.6e-05,1.2e-05,1e-05,1e-05,1.3e-05,3e-06,3e-06,1.6e-05,7e-06,1e-05,1.3e-05,1.5e-05,6e-06,2e-05,1.3e-05,1.9e-05,1.6e-05,2.5e-05,2.2e-05,2.4e-05,4e-06,1.8e-05,2.4e-05,1.6e-05,3e-06,1.1e-05,1.3e-05,7e-06,4e-06,1.6e-05,1.5e-05,1e-05,1.7e-05,1.2e-05,1.2e-05,1e-06,9e-06,1.5e-05,2.1e-05,1.6e-05,2.4e-05,1.3e-05,3e-06,4e-06,7e-06,5e-06,4e-06,1.2e-05,1.6e-05,2.9e-05,2e-05,1.7e-05,1.4e-05,2.2e-05,1.8e-05,7e-06,1.2e-05,1.9e-05,2.5e-05,1.3e-05,8e-06,2e-05,1.1e-05,1.4e-05,2.4e-05,9e-06,5e-06,1.3e-05,9e-06,1.2e-05,1e-05,7e-06,2.1e-05,3.1e-05,3.3e-05,1.9e-05
1.1e-05,1.7e-05,7e-06,2e-06,4e-06,6e-06,6e-06,7e-06,6e-06,5e-06,9e-06,5e-06,2e-06,2e-06,5e-06,1.7e-05,1e-06,1.7e-05,7e-06,8e-06,8e-06,1.9e-05,7e-06,3e-06,1e-05,1.1e-05,1.2e-05,7e-06,9e-06,6e-06,1.5e-05,2e-06,1.3e-05,7e-06,7e-06,1.1e-05,7e-06,8e-06,3e-06,1.2e-05,1e-05,1e-05,8e-06,1e-06,7e-06,3e-06,6e-06,5e-06,5e-06,4e-06,1e-06,8e-06,1.3e-05,1.1e-05,1.4e-05,5e-06,1.1e-05,7e-06,1.2e-05,1e-05,8e-06,3e-06,1.4e-05,1.8e-05,5e-06,1e-05,5e-06,3e-06,3e-06,9e-06,1.5e-05,2e-06,5e-06,6e-06,4e-06,5e-06,1.3e-05,2.4e-05,7e-06,6e-06,9e-06,1.2e-05,1.5e-05,2e-05,1.2e-05,3e-06,6e-06,7e-06,4e-06,4e-06,4e-06,7e-06,1.6e-05,1.2e-05,1e-05,7e-06,7e-06,1.6e-05,8e-06,1e-05,8e-06,1e-05,1.2e-05,2e-06,1e-06,7e-06,1.5e-05,1.5e-05,8e-06,9e-06,9e-06,5e-06,6e-06,2e-06,1e-05,9e-06,2e-06,1.7e-05,8e-06,1.5e-05,1.5e-05
4e-06,1e-05,5e-06,1.3e-05,1e-06,4e-06,5e-06,6e-06,9e-06,5e-06,2e-06,4e-06,3e-06,3e-06,7e-06,1e-05,2e-06,1.8e-05,2e-06,3e-06,3e-06,1.9e-05,4e-06,1e-05,4e-06,3e-06,1.3e-05,5e-06,2e-06,3e-06,9e-06,6e-06,7e-06,6e-06,3e-06,3e-06,3e-06,6e-06,1.1e-05,7e-06,4e-06,5e-06,3e-06,1e-06,3e-06,1e-06,5e-06,7e-06,3e-06,1e-06,4e-06,5e-06,2e-06,9e-06,1.3e-05,7e-06,5e-06,3e-06,8e-06,5e-06,4e-06,3e-06,5e-06,1.1e-05,2e-06,9e-06,2e-06,4e-06,6e-06,4e-06,6e-06,8e-06,4e-06,4e-06,4e-06,4e-06,7e-06,1.5e-05,6e-06,5e-06,8e-06,6e-06,1.9e-05,1.2e-05,3e-06,4e-06,2e-06,5e-06,3e-06,4e-06,6e-06,5e-06,5e-06,7e-06,1.1e-05,2e-06,7e-06,6e-06,8e-06,6e-06,7e-06,9e-06,1e-06,2e-06,1e-06,6e-06,1e-06,7e-06,4e-06,6e-06,4e-06,8e-06,8e-06,4e-06,2e-06,1e-06,4e-06,1.1e-05,7e-06,1.8e-05,5e-06
1e-06,7e-06,3e-06,7e-06,2e-06,2e-06,2e-06,4e-06,6e-06,1e-06,3e-06,2e-06,4e-06,3e-06,7e-06,8e-06,4e-06,1.8e-05,4e-06,3e-06,6e-06,1.5e-05,4e-06,1.2e-05,6e-06,8e-06,4e-06,2e-06,3e-06,4e-06,4e-06,7e-06,3e-06,3e-06,3e-06,2e-06,9e-06,4e-06,7e-06,7e-06,2e-06,5e-06,1e-06,1e-06,3e-06,5e-06,5e-06,6e-06,4e-06,6e-06,7e-06,3e-06,3e-06,7e-06,7e-06,4e-06,4e-06,4e-06,1e-06,9e-06,7e-06,5e-06,4e-06,9e-06,2e-06,6e-06,1e-06,1e-06,6e-06,1e-06,5e-06,9e-06,2e-06,5e-06,5e-06,3e-06,2e-06,1.3e-05,6e-06,5e-06,3e-06,5e-06,1.7e-05,1.1e-05,1e-05,4e-06,1e-06,5e-06,4e-06,4e-06,4e-06,5e-06,4e-06,2e-06,9e-06,3e-06,1e-06,8e-06,2e-06,3e-06,6e-06,5e-06,2e-06,2e-06,3e-06,4e-06,6e-06,1.1e-05,1e-06,1e-06,3e-06,5e-06,5e-06,4e-06,2e-06,4e-06,2e-06,9e-06,3e-06,7e-06,6e-06
1e-06,1.1e-05,6e-06,9e-06,2e-06,5e-06,6e-06,2e-06,6e-06,3e-06,4e-06,7e-06,6e-06,6e-06,4e-06,1.1e-05,3e-06,1.6e-05,2e-06,2e-06,4e-06,1.4e-05,2e-06,1.2e-05,5e-06,1.3e-05,5e-06,3e-06,5e-06,3e-06,4e-06,6e-06,2e-06,3e-06,1e-06,2e-06,8e-06,3e-06,7e-06,5e-06,3e-06,4e-06,3e-06,2e-06,0,4e-06,4e-06,1e-06,2e-06,4e-06,3e-06,2e-06,3e-06,3e-06,3e-06,2e-06,2e-06,3e-06,2e-06,5e-06,1e-06,5e-06,3e-06,5e-06,1e-06,5e-06,5e-06,5e-06,3e-06,3e-06,6e-06,8e-06,2e-06,4e-06,1e-06,1e-06,3e-06,1.5e-05,4e-06,7e-06,2e-06,2e-06,1.1e-05,1e-05,4e-06,3e-06,2e-06,7e-06,4e-06,4e-06,1e-06,5e-06,5e-06,2e-06,1e-05,1e-06,2e-06,5e-06,8e-06,6e-06,6e-06,1e-06,1e-06,1e-06,4e-06,2e-06,9e-06,6e-06,3e-06,2e-06,2e-06,5e-06,4e-06,3e-06,1e-06,4e-06,5e-06,3e-06,5e-06,1.2e-05,6e-06
2e-06,8e-06,2e-06,9e-06,2e-06,4e-06,4e-06,4e-06,5e-06,3e-06,1e-06,4e-06,6e-06,5e-06,6e-06,1.1e-05,1e-06,1.5e-05,3e-06,2e-06,4e-06,1.2e-05,2e-06,1.2e-05,3e-06,9e-06,5e-06,1e-06,5e-06,4e-06,4e-06,5e-06,2e-06,3e-06,2e-06,2e-06,1.1e-05,2e-06,5e-06,5e-06,2e-06,2e-06,1e-06,5e-06,1e-06,1e-06,5e-06,4e-06,5e-06,1e-06,3e-06,1e-06,3e-06,6e-06,6e-06,2e-06,1e-06,2e-06,2e-06,4e-06,2e-06,3e-06,2e-06,5e-06,3e-06,8e-06,4e-06,4e-06,6e-06,4e-06,5e-06,8e-06,6e-06,3e-06,5e-06,4e-06,2e-06,1.4e-05,9e-06,2e-06,1e-06,2e-06,1.2e-05,1.1e-05,4e-06,1e-06,1e-06,6e-06,2e-06,3e-06,2e-06,5e-06,4e-06,1e-06,7e-06,3e-06,2e-06,5e-06,8e-06,2e-06,7e-06,3e-06,2e-06,2e-06,5e-06,3e-06,5e-06,6e-06,0,2e-06,1e-06,6e-06,6e-06,5e-06,3e-06,2e-06,4e-06,8e-06,8e-06,1e-05,5e-06
2e-06,7e-06,3e-06,9e-06,3e-06,6e-06,5e-06,4e-06,7e-06,2e-06,2e-06,4e-06,5e-06,5e-06,5e-06,1e-05,1e-06,1.3e-05,3e-06,2e-06,2e-06,1.6e-05,1e-06,7e-06,1e-06,1.1e-05,7e-06,1e-06,6e-06,2e-06,3e-06,5e-06,3e-06,3e-06,4e-06,1e-06,1e-05,1e-06,6e-06,6e-06,2e-06,3e-06,3e-06,6e-06,1e-06,2e-06,4e-06,4e-06,1e-06,5e-06,6e-06,2e-06,1e-06,8e-06,2e-06,5e-06,5e-06,5e-06,4e-06,5e-06,4e-06,5e-06,5e-06,8e-06,1e-06,7e-06,4e-06,1e-06,4e-06,2e-06,4e-06,7e-06,3e-06,3e-06,5e-06,2e-06,3e-06,1.1e-05,5e-06,2e-06,1e-06,2e-06,1.6e-05,1.5e-05,2e-06,2e-06,3e-06,5e-06,2e-06,3e-06,2e-06,4e-06,3e-06,1e-06,6e-06,1e-06,1e-06,6e-06,3e-06,2e-06,8e-06,1e-06,1e-06,1e-06,3e-06,2e-06,6e-06,7e-06,1e-06,3e-06,2e-06,5e-06,3e-06,2e-06,3e-06,4e-06,3e-06,9e-06,5e-06,9e-06,3e-06
2e-06,5e-06,3e-06,1.1e-05,3e-06,5e-06,4e-06,3e-06,5e-06,2e-06,2e-06,3e-06,5e-06,3e-06,3e-06,1.1e-05,0,1.4e-05,0,0,1e-06,1.3e-05,3e-06,8e-06,4e-06,1.2e-05,4e-06,2e-06,4e-06,3e-06,3e-06,5e-06,3e-06,2e-06,2e-06,2e-06,8e-06,4e-06,6e-06,6e-06,5e-06,1e-06,2e-06,6e-06,2e-06,2e-06,3e-06,5e-06,2e-06,4e-06,5e-06,1e-06,1e-06,6e-06,4e-06,3e-06,3e-06,3e-06,2e-06,5e-06,3e-06,4e-06,2e-06,5e-06,1e-06,6e-06,5e-06,2e-06,3e-06,3e-06,4e-06,6e-06,2e-06,4e-06,4e-06,1e-06,2e-06,1.2e-05,5e-06,3e-06,1e-06,2e-06,1.4e-05,1.3e-05,5e-06,4e-06,1e-06,4e-06,2e-06,4e-06,1e-06,3e-06,4e-06,1e-06,7e-06,1e-06,0,5e-06,4e-06,4e-06,7e-06,2e-06,1e-06,1e-06,2e-06,2e-06,5e-06,5e-06,1e-06,4e-06,1e-06,4e-06,4e-06,3e-06,1e-06,2e-06,5e-06,9e-06,8e-06,9e-06,2e-06
2e-06,5e-06,2e-06,1e-05,3e-06,5e-06,4e-06,2e-06,5e-06,2e-06,2e-06,2e-06,5e-06,5e-06,5e-06,1e-05,0,1.5e-05,0,0,1e-06,1.5e-05,2e-06,8e-06,2e-06,1e-05,5e-06,0,4e-06,3e-06,4e-06,4e-06,3e-06,4e-06,3e-06,1e-06,9e-06,3e-06,8e-06,5e-06,4e-06,1e-06,3e-06,4e-06,0,1e-06,4e-06,5e-06,0,3e-06,6e-06,1e-06,1e-06,5e-06,5e-06,3e-06,3e-06,3e-06,2e-06,6e-06,3e-06,3e-06,1e-06,6e-06,1e-06,6e-06,5e-06,2e-06,2e-06,2e-06,5e-06,7e-06,2e-06,2e-06,5e-06,1e-06,1e-06,1.3e-05,6e-06,3e-06,1e-06,3e-06,1.4e-05,1.3e-05,4e-06,3e-06,1e-06,3e-06,3e-06,3e-06,0,4e-06,3e-06,1e-06,7e-06,2e-06,1e-06,6e-06,4e-06,3e-06,8e-06,2e-06,1e-06,1e-06,2e-06,1e-06,7e-06,6e-06,1e-06,4e-06,1e-06,5e-06,4e-06,3e-06,1e-06,0,5e-06,8e-06,7e-06,8e-06,3e-06
