-2e-06,3e-06,0,-2e-06,-3e-06,-2e-05,-0.005967,-0.037853,-0.04772,-0.063366,-0.182684,-0.227849,-0.217975,-0.183276,-0.156148,-0.152226,-0.121311,-0.086697,-0.030938,-0.010511,-0.00198,-0.001072,-0.002757,-0.001062,-0.002761,-0.00587,-0.001531,-0.00025
-6e-06,-1e-06,-4e-06,-6e-06,-7e-06,-2.6e-05,-0.004039,-0.032974,-0.052049,-0.031524,-0.060354,-0.059471,0.06947,0.137346,0.12212,0.080158,0.078337,0.078542,0.033416,0.009774,0.001673,-0.000635,-0.001566,-0.000645,-0.002543,-0.005935,-0.001237,-0.000107
-2e-06,1e-06,-3e-06,-5e-06,-4e-06,-1e-05,0.000234,-0.002969,-0.008483,0.02035,-0.005999,-0.035124,0.043525,0.015135,-0.019174,-0.020536,-0.00857,-0.005691,-0.005782,0.000589,0.001147,0.001044,0.000763,-3e-06,7.9e-05,0.000165,0.000357,0.000158
6e-06,6e-06,2e-06,1e-06,2e-06,1.7e-05,0.002493,0.025304,0.040268,0.022557,0.006026,-0.022066,-0.104303,-0.171393,-0.155578,-0.105589,-0.083554,-0.077149,-0.031295,-0.01135,-0.000276,0.002014,0.001654,0.000663,0.002116,0.004959,0.001275,0.000187
9e-06,8e-06,7e-06,6e-06,6e-06,2.6e-05,0.00294,0.028402,0.0444,-0.001275,0.086336,0.202044,0.114733,0.123475,0.132051,0.139584,0.110844,0.071993,0.027752,0.007321,0.003774,0.003181,0.001908,0.000812,0.001863,0.004108,0.000593,-2.4e-05
2e-06,3e-06,2e-06,2e-06,0,3e-06,0.000507,-0.003907,-0.008467,-0.023743,0.014298,0.123505,0.114801,0.123819,0.102394,0.076161,0.041352,0.028567,0.008915,0.007062,0.002273,0.000955,-0.000534,-0.000399,-0.000513,-0.001154,-0.000692,-0.000169
-6e-06,-3e-06,-4e-06,-4e-06,-6e-06,-1.3e-05,-0.002267,-0.025183,-0.03885,-0.010658,-0.07166,-0.177095,-0.174708,-0.175625,-0.139395,-0.148642,-0.131636,-0.084569,-0.027744,-0.00972,-0.0027,-0.000948,-0.001348,-0.00066,-0.001937,-0.004391,-0.00078,-2.5e-05
-2e-06,0,-4e-06,-3e-06,-4e-06,-1.1e-05,-0.002479,-0.015955,-0.022579,0.017392,-0.001147,-0.120989,-0.067453,-0.022222,0.000737,-0.001811,0.022986,0.023002,0.010425,0.00012,-0.001072,-0.000315,-4.1e-05,-0.000102,-0.000993,-0.002419,5e-06,0.000133
6e-06,6e-06,1e-06,2e-06,1e-06,-1e-06,-0.000264,0.00617,0.010424,0.006479,0.011058,0.082907,0.1599,0.140121,0.075464,0.075914,0.07695,0.052316,0.011882,0.007223,0.000501,-4.5e-05,0.000297,0.000192,0.000861,0.001999,0.000432,5.3e-05
9e-06,8e-06,7e-06,6e-06,6e-06,1.2e-05,0.002214,0.020067,0.028108,-0.013603,-0.030172,0.048231,0.01532,-0.079256,-0.095537,-0.06633,-0.058406,-0.04084,-0.013597,-0.005156,-0.001668,0.000163,0.000549,0.000431,0.001425,0.00342,0.000351,-5.9e-05
6e-06,6e-06,7e-06,6e-06,6e-06,8e-06,0.001812,0.009497,0.01191,0.001204,0.028316,0.006224,-0.072458,-0.049664,-0.01156,0.0042,0.004072,-0.006053,0.000852,-0.004798,-0.000763,0.000854,0.000839,0.000101,0.000202,0.000528,-3e-05,-4.6e-05
1e-06,2e-06,4e-06,3e-06,4e-06,-5e-06,-0.000501,-0.010769,-0.015819,0.016838,0.061162,0.041412,0.037519,0.125189,0.110446,0.077788,0.052049,0.032079,0.009639,0.006758,0.00124,-1.4e-05,6e-05,-0.000318,-0.000881,-0.002084,-0.000217,3.6e-05
-1e-06,-1e-06,0,-2e-06,1e-06,-6e-06,-0.001608,-0.014474,-0.019442,-8.5e-05,-0.016304,-0.047151,-0.015225,-0.037951,-0.031442,-0.053247,-0.062583,-0.029594,-0.00656,-0.000115,-0.001182,-0.001377,-0.000999,-0.000215,-0.000619,-0.001544,-0.000146,1.8e-05
2e-06,0,-4e-06,-5e-06,-1e-06,1e-06,-0.001134,-0.002668,-0.00128,-0.018388,-0.068566,-0.094329,-0.054119,-0.096341,-0.053125,-0.041089,-0.023728,-0.018603,-0.004783,-0.006318,-0.002303,-0.000574,-0.000336,5.1e-05,0.000134,0.000172,-9.8e-05,-4.6e-05
5e-06,2e-06,-5e-06,-5e-06,-2e-06,4e-06,0.000678,0.011513,0.016884,-0.010073,-0.023853,0.046474,0.071891,0.091442,0.057932,0.064267,0.077252,0.046711,0.01093,0.004578,-8e-05,-0.000105,0.000307,0.00019,0.000444,0.001047,6.8e-05,-4e-06
3e-06,1e-06,-4e-06,-3e-06,-2e-06,2e-06,0.00158,0.010822,0.013319,0.002197,0.014574,0.086646,0.040702,0.026031,-0.012502,-0.005805,-0.010045,0.004603,0.000229,0.003917,-0.000301,-0.000246,0.000598,0.000262,0.000298,0.000897,0.00033,7.1e-05
-1e-06,-1e-06,-2e-06,-1e-06,-2e-06,-7e-06,-8.7e-05,-0.005111,-0.008117,0.003236,-0.002737,-0.040968,-0.074509,-0.091236,-0.056302,-0.043074,-0.049326,-0.040661,-0.01151,-0.006703,-0.001825,-0.000263,0.000298,-0.000146,-0.000123,-0.000163,5e-05,-1e-05
-4e-06,-4e-06,-2e-06,-1e-06,-1e-06,-9e-06,-0.000878,-0.010266,-0.015058,0.004841,0.005414,-0.059948,-0.019635,0.046371,0.04558,0.029808,0.030141,0.011782,0.005006,6.2e-05,-1e-06,-0.000676,-0.000697,-0.000346,-0.000297,-0.000813,-0.000321,-9.6e-05
-2e-06,-6e-06,-4e-06,-1e-06,1e-06,2e-06,-3.8e-05,-0.001553,-0.003074,0.003264,0.023304,0.009601,0.033857,0.054635,0.023264,0.00219,0.007251,0.019235,0.005553,0.005121,0.000618,-0.000931,-0.000838,-0.000129,-0.00015,-0.000486,-0.000238,-4.2e-05
