-0.031501,-0.020521,-0.017542,-0.007752,-0.008356,-0.008666,-0.008128,-0.004619,-0.001292,-0.002451,-0.00249,-0.00203,-0.002104,-0.001183,-0.0013,-0.001886,-0.001027,-0.000537,-0.000529,-0.000272,-3.4e-05,6.4e-05,-0.00043,-0.000267,-0.00033,-0.000469,-0.000327,-0.000148
-0.080534,-0.053786,-0.047644,-0.025081,-0.020436,-0.021504,-0.02071,-0.017186,-0.011379,-0.010789,-0.007493,-0.00726,-0.00664,-0.003816,-0.004494,-0.005452,-0.003348,-0.001895,-0.001537,-0.001034,-0.000731,-0.000822,-0.001226,-0.000797,-0.001052,-0.001191,-0.001032,-0.001101
-0.058089,-0.039548,-0.03599,-0.021602,-0.013771,-0.014756,-0.01411,-0.014012,-0.011874,-0.009751,-0.005678,-0.006104,-0.005144,-0.003038,-0.003488,-0.00389,-0.002649,-0.00148,-0.001063,-0.000845,-0.000933,-0.001124,-0.000892,-0.000662,-0.000816,-0.000665,-0.000545,-0.000439
0.004187,0.003634,0.000844,-0.005305,0.001659,0.002998,0.003397,-0.000897,-0.004771,-0.001697,0.000609,-0.000341,0.000406,0.000109,0.000172,0.000825,8.8e-05,4.7e-05,0.000276,-4.2e-05,-5e-04,-0.000748,8.9e-05,-8.6e-05,-3e-05,0.000304,0.000236,0.000194
0.048243,0.035496,0.028459,0.009559,0.011385,0.015348,0.014663,0.008247,0.002364,0.005407,0.005209,0.004429,0.004535,0.00257,0.002719,0.00398,0.00218,0.001102,0.001107,0.000532,-2.5e-05,-0.000258,0.000638,0.000309,0.000419,0.000587,0.000499,0.000524
0.042498,0.031088,0.02554,0.013375,0.009039,0.012612,0.010113,0.005374,0.003608,0.005513,0.004147,0.004104,0.003577,0.002213,0.001849,0.002713,0.001845,0.000786,0.000692,0.000387,0.000116,-3.5e-05,0.000239,0.00017,0.00025,0.000111,3.3e-05,-4.4e-05
0.001843,0.00031,0.000627,0.006388,-0.000971,-0.001148,-0.004003,-0.004506,-0.000345,-0.000302,-0.000861,-0.000331,-0.00107,-0.000283,-0.001217,-0.00142,-0.000247,-0.00031,-0.000394,-0.000172,9.6e-05,6.8e-05,-0.000459,-0.000147,-0.00015,-0.000467,-0.000551,-0.000608
-0.03511,-0.025744,-0.020381,-0.003682,-0.009112,-0.013002,-0.013132,-0.009889,-0.003843,-0.005567,-0.004612,-0.004204,-0.004619,-0.002326,-0.003147,-0.004193,-0.00189,-0.000935,-0.001004,-0.000502,9.7e-05,0.000226,-0.000552,-6.2e-05,-0.000106,-3e-04,-0.000429,-0.000489
-0.035414,-0.023221,-0.017647,-0.007256,-0.007749,-0.012187,-0.008376,-0.004192,-0.002098,-0.00468,-0.003497,-0.003682,-0.003509,-0.001928,-0.001831,-0.002834,-0.001511,-0.000467,-0.000585,-0.000281,0.000182,0.000439,-3.4e-05,0.000184,0.00022,0.000303,0.000226,0.000245
0.00213,0.003558,0.005235,-0.001356,0.002268,0.000202,0.0053,0.008077,0.00413,0.001867,0.001214,0.000682,0.001249,0.000453,0.001584,0.001402,0.000447,0.000564,0.00039,0.00027,0.000357,0.000566,0.000512,0.00021,0.000359,0.000548,0.00063,0.000651
0.039923,0.026484,0.023745,0.006275,0.010693,0.011958,0.014063,0.015239,0.009104,0.00791,0.004763,0.00465,0.00513,0.002451,0.00385,0.004501,0.002021,0.001043,0.000902,0.000597,0.000384,0.000456,0.000605,5e-05,0.000168,0.000227,0.000476,0.00047
0.038005,0.022391,0.018592,0.006423,0.008311,0.012192,0.009555,0.01007,0.007749,0.007535,0.003677,0.004566,0.004575,0.002169,0.002789,0.00357,0.001677,0.000434,0.000433,0.000362,8.1e-05,2.8e-05,0.00011,-0.000277,-0.000366,-0.000473,-0.00018,-0.000321
-0.001465,-0.004481,-0.005142,-0.001032,-0.002416,0.0016,-0.003421,-0.003058,0.00052,0.000633,-0.000924,0.000702,0.000207,-0.000111,-0.000639,-0.000432,-0.000244,-0.000694,-0.000496,-0.000169,-0.000247,-0.000406,-0.00045,-0.000436,-0.000629,-0.000633,-0.000458,-0.000629
-0.038521,-0.028293,-0.025465,-0.008363,-0.010156,-0.009542,-0.012976,-0.012928,-0.007052,-0.007106,-0.004723,-0.003381,-0.004035,-0.002336,-0.003369,-0.003775,-0.001977,-0.001292,-0.000986,-0.000545,-0.000471,-0.000596,-0.00054,-0.000206,-0.000364,-0.000198,-0.000191,-0.000241
-0.037779,-0.026085,-0.023335,-0.008081,-0.007243,-0.011463,-0.010946,-0.011735,-0.009252,-0.009262,-0.004308,-0.004228,-0.004577,-0.002554,-0.003133,-0.00356,-0.001996,-0.000818,-0.000574,-0.000487,-0.000481,-0.00049,-0.000163,0.000158,0.000175,0.000373,0.000229,0.000283
-0.003373,0.00011,-0.000761,-0.000592,0.001918,-0.003807,9.8e-05,-0.002016,-0.005163,-0.004283,-0.000192,-0.00151,-0.00141,-0.000663,-0.000439,-0.000336,-0.000378,0.000264,0.000327,-7.4e-05,-0.000144,-7.2e-05,0.000306,0.000357,6e-04,6e-04,0.000376,0.000682
0.027154,0.024502,0.019685,0.005898,0.006526,0.005207,0.009471,0.006204,0.000914,0.003267,0.00374,0.001846,0.002199,0.001567,0.00203,0.002619,0.001332,0.000934,0.000789,0.000234,0.000146,0.000272,0.000408,0.000269,0.000464,0.000145,-0.000122,1.4e-05
0.027679,0.025273,0.020058,0.005861,0.003052,0.008236,0.009379,0.006084,0.004091,0.007152,0.004078,0.002696,0.003043,0.002237,0.002088,0.002612,0.001678,0.000665,0.000433,0.000264,0.000287,0.000359,0.000127,6.9e-05,5e-05,-0.000283,-0.000423,-0.000284
0.006472,0.00523,0.004569,0.002194,-0.002125,0.004657,0.001635,-3.7e-05,0.00302,0.004853,0.000939,0.000653,0.000866,0.00098,0.000105,2.2e-05,0.000588,-0.000116,-0.000306,8.7e-05,0.00028,0.000198,-0.000256,-0.000127,-0.000325,-0.000403,-0.000425,-0.000634
