0.020771,0.031722,0.03667,0.039333,0.043132,0.039792,0.038191,0.041427,0.040595,0.033579,0.028496,0.028582,0.027036,0.030767,0.037102,0.032487,0.026926,0.026156,0.027365,0.027475,0.029574,0.031583,0.027737,0.026512,0.027972,0.027137,0.027237,0.02837
0.025569,0.039513,0.04582,0.048915,0.053671,0.04966,0.047394,0.051347,0.050789,0.042246,0.035479,0.035498,0.03397,0.039091,0.047597,0.041703,0.034364,0.033247,0.034047,0.033788,0.036936,0.039805,0.034953,0.033252,0.034604,0.032911,0.03277,0.034624
0.033751,0.051661,0.059837,0.063882,0.070162,0.065612,0.062684,0.067637,0.067773,0.057173,0.047555,0.047491,0.046108,0.053184,0.065017,0.057194,0.047318,0.04534,0.044633,0.043604,0.048389,0.052516,0.046202,0.043906,0.04518,0.042009,0.04131,0.044143
0.042089,0.059388,0.067738,0.073315,0.080238,0.076997,0.075376,0.081285,0.0826,0.070483,0.058695,0.05895,0.05706,0.06383,0.076795,0.070451,0.06128,0.056099,0.051473,0.04983,0.054794,0.059253,0.053355,0.051042,0.052273,0.048633,0.047316,0.050116
0.058724,0.070812,0.080185,0.090118,0.097516,0.097633,0.098279,0.107861,0.11192,0.092632,0.077245,0.078703,0.074316,0.078358,0.08939,0.088383,0.085259,0.072705,0.060805,0.061138,0.064983,0.068055,0.06433,0.062035,0.062693,0.06058,0.059699,0.063271
0.098225,0.108056,0.126686,0.147226,0.159153,0.163816,0.161347,0.177741,0.186652,0.147797,0.121857,0.124025,0.114548,0.120809,0.133199,0.133592,0.136877,0.113179,0.090146,0.095814,0.101414,0.105331,0.104235,0.098531,0.094894,0.093077,0.09328,0.102436
0.168568,0.179175,0.216616,0.256372,0.276637,0.285957,0.279719,0.305393,0.313711,0.241345,0.198251,0.201123,0.183997,0.1998,0.221503,0.220092,0.230775,0.189454,0.145369,0.158571,0.172274,0.181915,0.18257,0.169002,0.156454,0.152002,0.152572,0.170054
0.266111,0.275921,0.338418,0.405548,0.436467,0.453101,0.452931,0.487568,0.47634,0.358624,0.30144,0.308317,0.277543,0.303704,0.340484,0.346001,0.372313,0.302452,0.224084,0.243912,0.270238,0.29127,0.294943,0.270988,0.245776,0.235624,0.235672,0.261847
0.369756,0.378694,0.460133,0.5576,0.604821,0.63124,0.654045,0.691529,0.63097,0.466798,0.410825,0.434075,0.386437,0.404762,0.455274,0.48745,0.534894,0.431689,0.318402,0.337973,0.376345,0.411593,0.417057,0.38954,0.357026,0.335873,0.330496,0.35885
0.432414,0.447185,0.5255,0.646318,0.72596,0.770964,0.826236,0.850167,0.720952,0.523541,0.48123,0.534025,0.478419,0.463012,0.522603,0.594683,0.646758,0.52232,0.403797,0.416863,0.458302,0.498309,0.500015,0.485609,0.457552,0.422819,0.411212,0.427128
0.410522,0.43982,0.491358,0.611263,0.741621,0.823191,0.893659,0.888167,0.714113,0.513958,0.485083,0.55854,0.503466,0.447047,0.510698,0.605496,0.630505,0.518465,0.441981,0.446678,0.479847,0.513413,0.510045,0.514232,0.493699,0.452371,0.440326,0.437685
0.305122,0.346777,0.378071,0.471105,0.630609,0.743192,0.805125,0.792186,0.640572,0.47655,0.444607,0.495757,0.438056,0.364138,0.425307,0.501651,0.487692,0.424036,0.412462,0.40474,0.42757,0.467157,0.453015,0.451812,0.44045,0.407311,0.395657,0.398725
0.178854,0.22026,0.253583,0.317021,0.448595,0.551929,0.59967,0.602394,0.518703,0.417383,0.377312,0.384349,0.324896,0.261217,0.311616,0.357272,0.329635,0.311275,0.337708,0.316005,0.325105,0.378756,0.365093,0.344428,0.328029,0.302681,0.293917,0.318042
0.094976,0.13024,0.164829,0.196855,0.271894,0.331063,0.354924,0.373439,0.353799,0.312237,0.280694,0.265214,0.214739,0.18005,0.218388,0.236668,0.209711,0.210846,0.240712,0.212614,0.210255,0.266058,0.267205,0.239477,0.213935,0.187713,0.183377,0.213482
0.063701,0.082284,0.105217,0.122736,0.158496,0.170933,0.171295,0.19372,0.201689,0.193573,0.177129,0.166454,0.143671,0.13053,0.144075,0.144453,0.125168,0.125462,0.142993,0.130096,0.129999,0.16222,0.170044,0.153321,0.131377,0.114568,0.122324,0.136625
0.060158,0.067403,0.086696,0.10377,0.113985,0.111603,0.119762,0.143216,0.156188,0.150634,0.136787,0.131832,0.131216,0.132271,0.123301,0.122703,0.108436,0.083801,0.087588,0.100762,0.111252,0.117061,0.12934,0.13798,0.120886,0.105061,0.129924,0.133796
0.067231,0.075664,0.092565,0.106663,0.112311,0.115092,0.130314,0.158698,0.184077,0.17653,0.155383,0.146687,0.150701,0.155263,0.135312,0.13196,0.117454,0.085434,0.086777,0.105651,0.123534,0.131252,0.149173,0.163128,0.139577,0.121858,0.156529,0.157959
0.075148,0.091483,0.106363,0.114739,0.122289,0.128916,0.137909,0.163012,0.193298,0.187086,0.16526,0.154921,0.160175,0.162572,0.136166,0.12595,0.116235,0.097366,0.095807,0.10933,0.132779,0.145169,0.157422,0.165235,0.147391,0.134505,0.162171,0.162432
0.089881,0.11494,0.127329,0.13814,0.141555,0.13894,0.143236,0.159929,0.18319,0.177611,0.162805,0.160314,0.167387,0.164573,0.134182,0.11675,0.115049,0.114955,0.10388,0.110697,0.138106,0.152099,0.151584,0.144775,0.143298,0.137728,0.143677,0.142589
0.107731,0.131551,0.142978,0.1699,0.16389,0.143686,0.152516,0.164903,0.179739,0.171994,0.158357,0.162695,0.175027,0.172644,0.148337,0.137181,0.138418,0.135139,0.1092,0.11328,0.14133,0.160333,0.157422,0.140545,0.140686,0.131787,0.128542,0.134262
0.120828,0.134991,0.145942,0.191655,0.177453,0.143629,0.161991,0.166212,0.164989,0.154779,0.142645,0.150721,0.16799,0.16498,0.154414,0.168171,0.166411,0.140199,0.10662,0.113128,0.141412,0.163308,0.15632,0.137827,0.133288,0.121413,0.125908,0.138006
0.119587,0.120646,0.134785,0.187486,0.174993,0.144329,0.171379,0.167914,0.145758,0.130834,0.120222,0.131243,0.14146,0.127715,0.138536,0.183259,0.175772,0.126529,0.095926,0.112266,0.137974,0.153817,0.140535,0.12354,0.122007,0.113773,0.123074,0.133873
0.102851,0.099667,0.112921,0.152627,0.154173,0.143161,0.173053,0.162755,0.12625,0.113428,0.105494,0.113448,0.105979,0.083545,0.117287,0.175251,0.160187,0.110245,0.08652,0.105599,0.130629,0.139956,0.128329,0.116801,0.118596,0.112952,0.113731,0.12069
0.08089,0.082911,0.092404,0.11881,0.133129,0.139269,0.162512,0.147094,0.114428,0.109871,0.100442,0.095029,0.076988,0.061805,0.10707,0.158649,0.138067,0.095829,0.071266,0.081039,0.103998,0.10818,0.102292,0.103911,0.111873,0.109002,0.09741,0.100165
0.064199,0.077429,0.087466,0.109064,0.122837,0.131663,0.146062,0.1288,0.106772,0.102559,0.089739,0.073272,0.054973,0.052084,0.092398,0.125588,0.106023,0.077932,0.055573,0.053701,0.074397,0.081256,0.077538,0.08778,0.098423,0.095297,0.081001,0.083922
0.055901,0.067351,0.076967,0.091725,0.106467,0.116351,0.117486,0.099188,0.087339,0.088795,0.085499,0.062403,0.039254,0.045176,0.071747,0.084324,0.076602,0.067629,0.050521,0.042516,0.058008,0.068105,0.066773,0.076794,0.082171,0.072339,0.060861,0.068265
0.056964,0.064851,0.062883,0.065295,0.083672,0.093329,0.085123,0.075914,0.074486,0.080113,0.082353,0.059132,0.035182,0.041029,0.057978,0.062278,0.062695,0.06251,0.047392,0.038348,0.051997,0.06474,0.068675,0.071843,0.063677,0.050455,0.04158,0.050868
0.05861,0.06248,0.049914,0.045499,0.064372,0.076369,0.068114,0.068798,0.080151,0.081429,0.072369,0.056091,0.045762,0.043802,0.047116,0.054415,0.063891,0.066233,0.051013,0.039738,0.049006,0.065729,0.075253,0.066878,0.048459,0.042478,0.040149,0.043302
0.055262,0.056704,0.048547,0.042406,0.053103,0.067706,0.066113,0.070263,0.087056,0.088259,0.068411,0.058597,0.064963,0.053981,0.042032,0.052529,0.065525,0.064771,0.058202,0.051422,0.054531,0.068338,0.076191,0.064608,0.045784,0.042973,0.045119,0.044275
0.050805,0.051631,0.049757,0.049485,0.064303,0.071945,0.062609,0.07264,0.091318,0.094414,0.07456,0.067943,0.085883,0.073869,0.054325,0.060704,0.062797,0.053018,0.062874,0.072508,0.07577,0.078871,0.079209,0.068554,0.050064,0.047541,0.051524,0.050925
0.059234,0.059064,0.054728,0.058034,0.079771,0.076451,0.055693,0.075127,0.096085,0.097244,0.083887,0.077046,0.09771,0.093555,0.072819,0.072387,0.05947,0.040967,0.065882,0.094246,0.103025,0.097794,0.086157,0.072969,0.059256,0.061325,0.066577,0.063997
0.067506,0.067384,0.061903,0.065456,0.087769,0.075449,0.048683,0.072691,0.096793,0.094279,0.08468,0.07507,0.092697,0.101201,0.08488,0.080224,0.059278,0.034374,0.063452,0.104401,0.120162,0.110421,0.082708,0.065376,0.062031,0.071212,0.077982,0.072797
0.064763,0.065139,0.059565,0.061501,0.078924,0.062786,0.040172,0.060068,0.083244,0.079667,0.072615,0.065731,0.078656,0.090656,0.079957,0.075688,0.053607,0.029883,0.055893,0.094089,0.11039,0.099371,0.064375,0.047543,0.051686,0.066078,0.073971,0.067436
0.052497,0.053384,0.046144,0.044744,0.056889,0.04358,0.028908,0.041138,0.057467,0.056776,0.053647,0.052278,0.062895,0.067832,0.058752,0.05737,0.04135,0.027679,0.045452,0.065745,0.075649,0.066952,0.041613,0.032048,0.034176,0.046449,0.054342,0.049853
0.04312,0.048939,0.034707,0.026497,0.038609,0.033648,0.023655,0.028708,0.033409,0.037372,0.039634,0.040157,0.047914,0.047247,0.040723,0.040646,0.031354,0.025278,0.036258,0.038356,0.038589,0.033493,0.022309,0.023016,0.02448,0.02776,0.033862,0.035772
0.036617,0.046892,0.028932,0.017308,0.027055,0.03013,0.025878,0.023683,0.02394,0.034341,0.035651,0.033201,0.035207,0.032878,0.03313,0.036037,0.028734,0.023517,0.031101,0.026303,0.024071,0.021776,0.015685,0.02052,0.025439,0.024438,0.02485,0.028256
0.033137,0.040329,0.025257,0.01418,0.020065,0.026987,0.028201,0.0247,0.024791,0.037142,0.034644,0.028639,0.029944,0.026961,0.032596,0.036359,0.026676,0.021854,0.025408,0.022608,0.025986,0.025984,0.016505,0.017309,0.026202,0.031325,0.029613,0.030887
0.032409,0.031013,0.021224,0.015195,0.01851,0.02283,0.026489,0.025609,0.030507,0.040621,0.029917,0.025596,0.030796,0.025048,0.031727,0.035935,0.024491,0.023157,0.022681,0.022524,0.029482,0.029276,0.017618,0.016481,0.029492,0.038296,0.036287,0.037043
0.032014,0.025203,0.020395,0.017715,0.017118,0.018856,0.022302,0.023817,0.035148,0.040686,0.023017,0.022272,0.032963,0.027629,0.032724,0.035603,0.024231,0.02324,0.02309,0.023809,0.028397,0.027943,0.018206,0.020211,0.03686,0.041453,0.038425,0.041575
0.032009,0.02461,0.021419,0.01852,0.016754,0.018939,0.019664,0.01975,0.034314,0.036167,0.01816,0.019152,0.031109,0.028165,0.031389,0.032467,0.021535,0.019986,0.024377,0.024664,0.022095,0.022141,0.019171,0.025,0.041504,0.038596,0.033241,0.041165
