-0.000813,-0.000687,-0.000616,-0.000252,-0.000616,-0.000859,-0.000833,-0.000951,-0.000666,-0.000692,-0.00121,-0.000891,-0.001103,-8e-04,-0.000608,-0.000439,-0.00088,-0.000721,-0.000889,-0.00075,-0.000137,-0.000294,-0.000233,-0.000631,-0.000793,-0.000665,-0.000654,-0.001035,-0.000527,-0.000314,-0.000455,-0.001441,-0.000893,-0.000178,-0.000758,-0.000443,-0.000586,-0.000514,-9e-04,-0.000888,-0.000684,-0.000425,-0.000747,-0.000569,-0.000402,-0.000199,-0.000334,-0.000865,-0.001079,-0.000398,-0.000717,-0.000574,-0.000724,-0.000898,-0.000475,-0.000126,-6e-06,-0.001273,-0.00158,-0.001041,-0.000548,-0.000824,-0.00053,-0.000684,-0.00072,-0.000725,-0.000846,-0.001095,-0.000256,-0.000703,-0.001012,-0.000873,-0.000714,-0.001048,-0.000859,-0.00052,-0.000133,-0.00012,-0.000197,-0.001328,-0.000675,-0.000753,-0.000598,-0.000594,-0.000368,-0.000245,-0.000331,-0.001395,-0.000882,-0.001126,-0.001069,-0.001621,-0.001053,-0.000837,-0.001214,-0.000827,-6.9e-05,-0.000224,-0.000463,-0.000572,-0.000814,-0.000621,-0.000645,-0.000443,-0.000297,-0.000168,-0.000216,-0.000363,-0.000362,-0.001404,-0.000826,-0.001126,-0.001058,-0.001419,-0.001125,-0.000626,-0.000412,0.000208,-0.000151,-0.000451,-0.000473
0.000646,0.00053,1.6e-05,-6.1e-05,1.6e-05,0.000295,0.000196,0.000229,3e-06,0.000289,0.000654,0.000633,0.000575,0.000514,4.5e-05,-4.7e-05,0.000687,0.000577,0.00026,0.000291,0.00024,5.6e-05,0.000139,0.000236,0.00054,0.000227,0.000397,0.000361,0.000228,-4e-05,3.4e-05,0.000544,-1e-04,1.3e-05,0.000398,9e-05,4.6e-05,0.000177,0.000456,0.000377,0.000156,0.000127,0.000365,0.00021,-0.000241,-0.000384,-6.4e-05,0.000163,0.000645,0.000642,0.000464,0.000364,0.000366,5.1e-05,0.000394,-0.000136,-0.000307,0.000542,0.001066,-8e-06,-0.000102,5.3e-05,0.000361,0.000368,0.000205,0.000199,-0.000171,0.00027,0.00023,0.000144,9.7e-05,0.000231,-2.9e-05,0.000405,0.000347,0.000161,-0.000466,-0.000109,0.000248,0.000842,0.000449,0.000271,9e-06,0.000163,3e-06,-0.000111,-0.000631,0.000622,0.00065,0.000928,0.000128,0.000369,0.000413,0.000607,2.5e-05,-7.9e-05,-1.1e-05,-4.9e-05,0.000181,0.000181,0.000436,0.000184,0.000395,9.8e-05,-0.000227,-0.000139,-0.000239,0.000364,0.000144,0.000568,0.00027,0.000332,0.00087,0.000948,0.000465,0.000391,0.000193,-0.000168,-0.000283,6.6e-05,-3.6e-05
-0.000558,-4e-04,0.000108,-0.000254,-0.000263,-0.00039,0.000165,-6.9e-05,-4.4e-05,-0.000171,-0.000328,-2.3e-05,-0.00048,-0.000497,-0.000291,-8.8e-05,-1e-04,-0.000595,-0.000129,-0.000259,-0.000171,0.000256,-1e-04,-0.000137,-0.00035,-0.000282,-0.000283,-0.000345,0.000208,0.00016,-0.000278,-0.000216,0.000518,4.4e-05,-0.000371,-0.000249,-4.5e-05,-0.000348,-0.000416,-9e-06,-0.000133,-0.000119,-0.000153,-2.3e-05,-0.000132,0.000259,0.000219,-4.2e-05,-0.00062,-0.000758,-0.000351,-0.000256,-0.000398,-0.000112,0.000142,4e-06,1.7e-05,-0.000525,-0.000859,-0.000185,-0.00018,-0.000172,-0.00086,-0.000295,-0.000261,-0.000167,0.000513,0.000112,-0.000273,-4.8e-05,-0.000636,-0.000429,8e-06,-0.000475,-0.000283,-0.000135,-0.000189,-0.000111,-0.000226,-0.000572,-0.000362,-0.000527,-0.000692,-0.000425,-0.000169,-0.000474,-8e-06,-0.000449,-0.000354,-0.000369,-7e-05,-5.8e-05,-9.2e-05,-0.000204,-0.000443,-0.000128,-0.000391,-1.7e-05,-0.00039,-0.000378,-0.000404,3.1e-05,-0.000225,1.5e-05,6.9e-05,-0.000252,-0.00011,-0.000338,-1.5e-05,-0.000786,-0.000122,-7.2e-05,-0.000592,-0.001002,-0.00079,-0.000414,-4e-05,-0.000608,-0.000238,-0.000155,-0.000462
0.000581,0.000349,0.000162,0.000105,0.000521,0.000273,-0.000145,0.000241,0.000213,2e-06,7.8e-05,0.000201,0.00031,0.000341,0.000258,-6.6e-05,0.000266,0.00026,0.000336,0.000482,0.000234,-0.000111,3.2e-05,-7.4e-05,0.00019,0.00017,1.2e-05,0.000211,-2.6e-05,-0.000193,0.000208,5.5e-05,-0.000168,1.5e-05,0.000283,0.000342,2.4e-05,0.000409,0.000345,9.5e-05,-2.8e-05,-8.2e-05,-0.00012,-9e-05,0.000359,-5e-06,4.2e-05,0.000167,0.000387,0.000572,0.000132,0.00014,0.000383,3.4e-05,0.000143,0.000187,-3.8e-05,0.000441,0.000268,0.000534,0.000142,-0.00018,0.000151,0.000463,0.000483,4.3e-05,-0.000212,2.5e-05,-0.000191,7.7e-05,0.000538,0.000598,-0.000249,9e-05,-0.000103,3e-05,-6e-06,0.000193,-0.000204,0.00031,6.7e-05,0.000162,0.00019,-4.3e-05,-0.000156,0.000107,0.000331,0.000608,0.000511,0.000438,0.000178,-7.3e-05,-2e-04,-0.000157,0.000452,0.000359,0.000359,0.000261,0.000196,0.00033,0.000212,0.000257,0.000238,9e-05,-0.00017,-0.000247,-5.1e-05,-0.000105,7.8e-05,0.000622,0.000295,0.000201,0.000564,0.000584,0.000491,0.000194,-4e-05,0.000361,-5.4e-05,-1.2e-05,-7e-06
-0.000273,-0.000215,-9e-06,0.000135,-0.00019,-4e-06,3.3e-05,-3.8e-05,-9e-05,3.4e-05,-3e-06,-0.00023,3.1e-05,-4.9e-05,-0.000197,9.1e-05,7.8e-05,-0.000284,-0.000417,-8.6e-05,-0.000268,2.8e-05,3.2e-05,0.000149,0.000115,-3e-06,0.000211,-2e-06,-0.00014,0.000109,0.000131,9.7e-05,0.00011,0.000294,-0.000324,-0.000232,5.4e-05,-5.2e-05,-0.000142,5.3e-05,0.000155,0.000154,7.6e-05,3.6e-05,-0.000194,-6.8e-05,0.000144,-0.000296,-0.000139,-0.000263,-0.000349,-0.000214,0.000102,-3.7e-05,3.3e-05,9e-05,0.000361,-8.1e-05,9.9e-05,-0.000177,-0.000203,3.2e-05,-1.2e-05,-0.000282,-0.000227,3e-04,4.3e-05,0.000139,-1.1e-05,-2e-06,-0.000264,-0.000381,0.000484,0.000348,0.00016,4.3e-05,0.000156,0.000318,0.000182,-2.8e-05,-1.3e-05,4.6e-05,-7.5e-05,-1.5e-05,0.000166,-8.9e-05,7e-05,-0.000197,-0.000569,-0.000256,-1e-05,0.000223,0.000318,5e-05,-0.00028,-0.000582,-0.000118,-5.4e-05,-1.4e-05,-4e-06,-0.00013,-0.000328,-0.000239,0.000103,0.000262,0.000142,0.000375,0.000242,-4.9e-05,-3.9e-05,-0.000178,-0.000241,-0.000316,4.7e-05,-0.000376,4.3e-05,-2.2e-05,0.000299,0.000214,0.000207,0.000296
0.000314,0.000211,-8.4e-05,7.4e-05,3.3e-05,4e-05,9.9e-05,3.8e-05,-0.000111,9.1e-05,-4.6e-05,0.000198,-8.5e-05,4.8e-05,0.000176,-7.2e-05,-7.4e-05,0.00019,0.000205,-3.6e-05,-0.000132,-0.000136,6.7e-05,4.7e-05,0.000278,9.2e-05,-8.4e-05,-3.8e-05,8.5e-05,-0.000264,-2.4e-05,1.8e-05,4.1e-05,-3.3e-05,-4.3e-05,0.000237,-9.2e-05,0.000134,0.000442,-0.000114,-0.000194,-4.3e-05,-0.000183,4.8e-05,8.3e-05,6.1e-05,-0.000333,0.000203,2.3e-05,0.000307,0.00012,-0.000106,-0.000221,-0.000269,7.2e-05,5.3e-05,4.7e-05,-9.1e-05,-0.000144,-0.000168,-4.3e-05,0.000327,9.7e-05,0.000176,3.5e-05,-0.000184,0.000277,-0.000416,-6.8e-05,0.000181,0.000323,0.000208,-9.3e-05,-6.5e-05,-8.3e-05,-3.3e-05,-0.000193,-0.000131,0.000208,1e-04,7.1e-05,-0.000102,0.000122,0.000285,-0.000174,5e-06,-0.000405,-0.000167,0.000223,0.000361,-2.8e-05,-6e-05,-1.2e-05,3e-06,0.000316,0.00044,0.00017,7.9e-05,-1e-05,0.000112,0.000193,0.000206,1.1e-05,-9.2e-05,1.6e-05,5.1e-05,-7.7e-05,-0.000137,0.000163,-6.4e-05,0.000184,0.000132,-3e-06,0.00028,0.000572,0.000203,-7.5e-05,5e-05,0.000244,-8.9e-05,-8.2e-05
-0.000237,-0.000303,0.000161,9.8e-05,-0.000122,-0.000183,-0.000115,-3.2e-05,7.6e-05,7.9e-05,-3.3e-05,-0.000148,-8e-06,-0.000135,-0.000246,-3.5e-05,0.000146,-9.2e-05,-8.2e-05,7e-05,8.2e-05,-6.5e-05,-5.6e-05,4.7e-05,-7.3e-05,-6.9e-05,0.000193,9.6e-05,-3.9e-05,-0.000223,-0.000171,-0.00013,-0.000295,-0.000135,0.000117,-0.00027,-3.9e-05,-0.000214,-0.000221,2.3e-05,-6e-06,5.2e-05,-5e-05,7.1e-05,-1e-06,0.000192,-2e-05,8e-06,-2.3e-05,-0.00021,-0.000174,5.9e-05,0.000111,0.000386,8e-05,-0.000292,0.000149,0.000247,-7.4e-05,9.7e-05,0.00032,-0.000161,-0.000132,0.000114,1.4e-05,0.000133,-0.000182,0.000169,4.1e-05,-9.7e-05,-5.8e-05,-6.1e-05,9.8e-05,1e-04,0.000207,0.000265,4e-06,-8.3e-05,2.5e-05,-0.000111,6e-06,-9.4e-05,6.8e-05,-4.6e-05,0.000131,0.00012,6e-06,0.000262,-0.000222,-0.000257,1.9e-05,-0.000176,-2.1e-05,-1.5e-05,-0.000299,-0.000263,6.5e-05,0.000142,-8e-06,-0.000128,-8.3e-05,-0.000122,-2.2e-05,-0.000115,-9.9e-05,5.2e-05,0.000119,-0.000118,-9e-06,-4.6e-05,6.2e-05,0.000311,0.000102,-0.000375,-0.000457,-0.000293,-4e-06,0.000162,-0.00019,-1e-04,0.000214
1.1e-05,9e-06,-8.9e-05,-0.000258,-3.8e-05,1.9e-05,5.7e-05,0.000105,6.9e-05,7e-05,2.5e-05,4e-06,-0.00014,-0.000212,9e-05,-0.00011,-0.00027,0.000102,0.000101,6.4e-05,-3.1e-05,-9.3e-05,0.000129,2.2e-05,-5.9e-05,-0.000136,-0.00023,-4e-05,6e-05,0.000159,2e-05,-0.000124,0.000389,0.000379,-8.5e-05,-2.9e-05,1.2e-05,0.000174,7.2e-05,-0.00019,0.000119,-9.9e-05,-0.000119,-0.000205,-0.000158,-4.9e-05,0.000223,-3.2e-05,5.2e-05,-3.3e-05,0.000221,-8.9e-05,-8.2e-05,-0.000231,-0.000116,3.9e-05,-0.000159,-0.000171,8.9e-05,-0.000239,-0.000167,-0.000108,-7.7e-05,-4.7e-05,-6.5e-05,-0.000305,0.000102,9e-06,-0.00017,-1.3e-05,8e-06,2.4e-05,-0.000124,-0.000162,-0.000261,-0.00031,-4e-06,-7.5e-05,-7e-06,-7.3e-05,-3.4e-05,-3.9e-05,-0.000191,-0.000352,-8.2e-05,-0.000324,-5.2e-05,-0.000215,-4.8e-05,0.000203,-0.000118,0.000197,2.7e-05,9.5e-05,-0.000128,9.7e-05,-3.1e-05,2.8e-05,-0.000115,4.6e-05,7.7e-05,0.000129,-8.6e-05,7e-06,0.000104,-1.2e-05,-0.000133,-9.7e-05,4.1e-05,-0.000109,-0.000216,-3.3e-05,-7.7e-05,0.000495,0.000163,0.000174,-8.5e-05,-7.9e-05,-0.000209,-9.7e-05,-0.000197
1e-05,-0.000194,0.000123,0.00032,0.00012,0.000183,4.1e-05,-0.000185,-0.000182,-0.000106,2.9e-05,-0.000167,0.000204,0.000142,6.8e-05,0.000126,0.000218,0.000129,-0.000159,-0.000136,-5.4e-05,0.000125,-0.000184,-8.3e-05,1.6e-05,0.000135,0.000144,3.7e-05,-2.8e-05,-2.1e-05,2.3e-05,6.1e-05,-0.000142,-0.000191,4.5e-05,7.2e-05,-0.000188,-6.7e-05,6.7e-05,0.000152,-0.00028,-2.9e-05,0.000104,4.1e-05,9.7e-05,-0.000122,-0.000145,0.000104,5.6e-05,-5.6e-05,-0.000177,6e-06,6.9e-05,3.7e-05,-2.5e-05,-0.000134,2.8e-05,0.000119,-6.8e-05,0.000118,-7.3e-05,6.5e-05,-7.8e-05,-0.000259,-8.9e-05,0.000313,-9.1e-05,-0.000216,-5.9e-05,-0.000111,-7e-05,-0.000152,-0.000169,4.6e-05,-4.6e-05,9.8e-05,-0.000157,-5.7e-05,6.1e-05,8.2e-05,-8.5e-05,-5.4e-05,8.7e-05,0.000121,-0.000144,0.000113,0.000152,-2e-05,-2.1e-05,-0.000198,1.4e-05,3.9e-05,-7.5e-05,-0.000315,2.6e-05,-7e-05,-0.000223,-2.6e-05,-9.1e-05,-3.4e-05,-3.8e-05,-0.000153,-0.000141,-0.000104,-6.6e-05,-7.6e-05,2e-05,-9.8e-05,-5.5e-05,5.5e-05,-7e-06,-0.000164,-6.4e-05,-0.000245,-0.00021,-0.00017,-0.00027,8e-06,8.9e-05,7.3e-05,0.000126
-3.7e-05,0.000173,-9.4e-05,-9.3e-05,-9.2e-05,-7e-06,6.3e-05,0.000192,4.4e-05,5e-05,7.2e-05,0.000134,-0.000242,-8.5e-05,-0.000139,-8.9e-05,-4e-05,-6.4e-05,-1.1e-05,0.000168,-4e-06,-0.000117,-1.3e-05,7.7e-05,-5.5e-05,-6.7e-05,-0.000128,-1.7e-05,4.4e-05,-0.000133,-0.000136,-0.000102,-2.1e-05,1.9e-05,-0.000198,-1.3e-05,0.000277,3.2e-05,-4.3e-05,-0.000144,5.4e-05,2.2e-05,6.6e-05,-6.8e-05,-2.5e-05,0.000111,3e-06,5.2e-05,3.2e-05,-1.5e-05,1e-05,3e-05,7.1e-05,-3e-05,7.3e-05,-9.3e-05,0.000146,7.4e-05,3.1e-05,-8e-06,-3.6e-05,5.1e-05,9.7e-05,-0.000121,7.1e-05,-0.000251,0.000135,0.000239,8.2e-05,-0.000146,2.7e-05,0.000157,6.5e-05,6.8e-05,4.5e-05,3e-05,0.000128,2.3e-05,7e-06,8e-06,7.1e-05,0.000219,2.9e-05,-0.000107,7.8e-05,8e-05,4.1e-05,-7e-06,-1.6e-05,8.6e-05,-7e-05,-9.1e-05,7.6e-05,0.000201,-4.6e-05,7.1e-05,7.8e-05,-0.000121,0.000124,0.000166,-2.4e-05,0.000111,0.000143,-2.3e-05,2.1e-05,9.6e-05,2e-06,0.00013,6.5e-05,-3e-06,6.2e-05,0.000241,-2.3e-05,0.000206,0.000232,0.000143,6.9e-05,-3.6e-05,-1.8e-05,1.9e-05,-1.6e-05
-7e-06,-7.4e-05,5.3e-05,-9.5e-05,7e-06,-6.9e-05,-0.000114,-0.000158,-7.4e-05,5.4e-05,-4.2e-05,-6.2e-05,0.000192,-3.8e-05,1.5e-05,1.4e-05,-0.000218,5.3e-05,-0.000132,-7e-06,7e-06,4e-05,-8.6e-05,2e-05,4.2e-05,-6.9e-05,8.2e-05,-0.000142,-2.2e-05,0.000147,2.8e-05,-1.3e-05,-1.1e-05,-2.3e-05,0.000135,-2.9e-05,-9e-05,-8.9e-05,2e-06,5e-05,-5.5e-05,-4.5e-05,-0.000172,-6.1e-05,-3e-05,-3e-05,5.6e-05,0,-0.000108,7.3e-05,-7.5e-05,1.3e-05,8e-05,8.5e-05,-0.000115,1.9e-05,-3.2e-05,1.6e-05,-7.6e-05,-5.3e-05,0.000112,-0.000118,-4e-05,3e-05,-2.3e-05,5e-06,7e-06,-0.000118,-4.9e-05,8.1e-05,7.4e-05,-2.9e-05,0.000209,-5.4e-05,-5e-06,-4.3e-05,-7.8e-05,-4.5e-05,0.000121,-6.5e-05,2.4e-05,-5.7e-05,-8.3e-05,6e-05,3e-05,0.000117,9.9e-05,4.3e-05,0,-9.6e-05,-5.6e-05,7.5e-05,4.3e-05,-0.000199,6.6e-05,-1.6e-05,3.8e-05,0.000118,-1.1e-05,-7.9e-05,9.7e-05,-9.9e-05,-6.4e-05,4e-06,-4.3e-05,1.3e-05,2.5e-05,-3.8e-05,1e-05,2.4e-05,8.6e-05,-3.8e-05,2.3e-05,-7.9e-05,-5.4e-05,-4.6e-05,4.9e-05,-9.9e-05,-1.8e-05,4.3e-05,5e-05
2e-05,8e-06,-6.1e-05,0.000191,5e-06,6.4e-05,-2.3e-05,8.4e-05,-2.6e-05,-8.9e-05,-3.5e-05,-5.5e-05,-0.000112,6.9e-05,-1e-04,-1.9e-05,0.00014,3.4e-05,4.9e-05,-3.3e-05,-3.2e-05,6e-06,-4.7e-05,-3.5e-05,1.7e-05,-2.5e-05,-0.000115,2.4e-05,2.7e-05,-0.000112,-3.4e-05,2.9e-05,7.9e-05,5.3e-05,-1.7e-05,2.7e-05,0.000147,5.8e-05,-1e-06,-5.9e-05,-8e-06,8e-06,8.8e-05,-4.9e-05,-4e-06,7e-05,-0.000104,-6.8e-05,0.000176,3e-06,3.4e-05,-7e-06,3.4e-05,2e-06,-1e-06,-8.2e-05,-0.000115,2.5e-05,6.7e-05,-4.1e-05,1.3e-05,5.6e-05,1e-06,0.000176,-4.3e-05,4e-06,3e-06,-2.4e-05,-4.8e-05,-0.000113,-2.5e-05,9.1e-05,-0.000301,5.9e-05,9e-06,7.7e-05,5.8e-05,1.9e-05,3.3e-05,-5e-05,-3.8e-05,6.4e-05,-4.8e-05,-2e-06,-5.6e-05,7.6e-05,-0.000109,4.2e-05,-5.5e-05,1.8e-05,-2.2e-05,-6.6e-05,-7.5e-05,0.000122,9e-06,-7.1e-05,-4.6e-05,-5.9e-05,-6.1e-05,6.5e-05,2.7e-05,5.8e-05,3.1e-05,3.3e-05,-7e-06,-1.3e-05,-4.8e-05,2.2e-05,-8.6e-05,7.4e-05,1e-06,5e-06,-1e-05,9.5e-05,6.4e-05,-4.3e-05,-5.8e-05,4.6e-05,-1.8e-05,-5.5e-05,-5e-05
7.4e-05,-8.7e-05,8.4e-05,-5.6e-05,-1.1e-05,-2.3e-05,-1.8e-05,-2.8e-05,3.8e-05,-1e-05,-4.1e-05,5.2e-05,0.000112,-5.7e-05,5.7e-05,1e-05,8e-06,4.7e-05,6e-06,3.2e-05,-4.8e-05,-2e-05,-3.2e-05,4.8e-05,-1e-05,-2e-06,8.9e-05,-1e-06,-6e-06,1.8e-05,8.4e-05,-4.7e-05,-2.7e-05,-6e-06,-0.000103,-1.2e-05,-3.8e-05,6.6e-05,-6.1e-05,5.9e-05,3.3e-05,-3.1e-05,-6e-05,-3.7e-05,-3.5e-05,-4e-05,-3.3e-05,-1.6e-05,-9e-05,-5e-06,4.2e-05,-3.1e-05,1.2e-05,-2.9e-05,3.8e-05,4.1e-05,3.9e-05,3.8e-05,-5.7e-05,-9e-06,0,0.00012,-2.9e-05,-0.000169,-5.4e-05,0,-7.8e-05,2.1e-05,-3.4e-05,0.000108,-2.2e-05,2.3e-05,8.6e-05,-2.3e-05,-3.4e-05,-0.000102,-0.000147,-1.8e-05,-0.000107,-6e-06,-2.6e-05,2.8e-05,-3.2e-05,-5.7e-05,2.3e-05,-7.3e-05,1.3e-05,9e-06,9e-05,-7.9e-05,-1e-05,2e-06,2e-06,-5.1e-05,-4.6e-05,-1.3e-05,-1.9e-05,1e-06,-7e-06,-5.3e-05,-3.9e-05,-5.4e-05,-5.5e-05,-3.7e-05,-2.2e-05,2.2e-05,2.8e-05,-5.2e-05,-3.3e-05,-3.1e-05,-6.9e-05,2.7e-05,-3.2e-05,-0.000105,-1.9e-05,2e-06,-5.4e-05,-0.000135,6.7e-05,6.3e-05,-4.9e-05
-7.4e-05,1e-05,-7e-05,5.1e-05,-6e-06,3.6e-05,3.4e-05,5.2e-05,-1.9e-05,1.1e-05,-1.3e-05,4e-06,-8.3e-05,1.9e-05,-1e-06,-9e-06,-3.3e-05,3.6e-05,3.1e-05,-2.3e-05,5.3e-05,-2.9e-05,-4.9e-05,-3.1e-05,5e-06,-2.1e-05,-3.5e-05,9e-06,-2.5e-05,-1.3e-05,-5.9e-05,1.1e-05,-8.9e-05,-2.1e-05,8.4e-05,3.1e-05,4.6e-05,-8.1e-05,7.3e-05,-5.3e-05,-5.7e-05,-1.5e-05,3.5e-05,3.8e-05,2.4e-05,-8e-06,5.2e-05,4.2e-05,-1.1e-05,-2e-06,-1.1e-05,-3.2e-05,1e-06,-5e-05,1.6e-05,4e-06,-8.1e-05,1e-06,5e-05,3.4e-05,-1.7e-05,-0.000139,7e-06,0.000102,3.8e-05,-6e-05,0,-3.5e-05,5.5e-05,-7.1e-05,-6e-06,-1.2e-05,1.9e-05,-8.9e-05,2.1e-05,1.5e-05,7.9e-05,1e-06,-3.2e-05,-6.7e-05,4e-06,1.4e-05,-1.4e-05,2.8e-05,3e-05,9.1e-05,-1e-05,-3e-06,-4.5e-05,1.6e-05,-4.1e-05,-2.2e-05,4.7e-05,3e-06,5.4e-05,-6.5e-05,-1e-06,1.5e-05,-2.5e-05,-8e-06,-2.9e-05,4e-05,-6e-06,-2e-06,-2.1e-05,1.3e-05,-3.3e-05,-2e-06,2.9e-05,2.8e-05,2e-06,-7.2e-05,-1.8e-05,-1.4e-05,0.000108,-1e-06,1.7e-05,6e-06,-6e-06,-1e-05,9e-06
1e-05,3.1e-05,-1e-06,5e-06,-6e-06,-2e-06,-6.8e-05,-6.9e-05,-1e-06,-5e-06,5.9e-05,5e-06,3.5e-05,-1.3e-05,-1.1e-05,-1e-05,-1.5e-05,-3.5e-05,0,3.3e-05,-6.1e-05,3e-05,-1.1e-05,-1.3e-05,2.6e-05,1.6e-05,3.6e-05,-2.8e-05,-1.4e-05,-1.7e-05,3.3e-05,-1e-05,-2.1e-05,2e-06,-4.1e-05,-3.3e-05,6e-06,1.2e-05,-5.2e-05,1.9e-05,7e-06,-3.4e-05,-2e-05,3e-05,-1.5e-05,2.8e-05,6e-06,-6e-06,3e-05,1.1e-05,-1.6e-05,3.2e-05,-3.4e-05,2.8e-05,-3.2e-05,-3.9e-05,-3.5e-05,8e-06,-3.4e-05,-3.3e-05,3.6e-05,2.1e-05,-2.1e-05,-0.000115,3.5e-05,5.5e-05,2.4e-05,-9e-06,-3.5e-05,3.5e-05,-3.7e-05,1.6e-05,5.3e-05,7.9e-05,-2.7e-05,2e-06,-6.4e-05,9e-06,4.3e-05,5e-05,5e-06,1.2e-05,2e-06,-1.2e-05,-3.4e-05,-6.1e-05,2e-05,-1e-05,-5.2e-05,5.6e-05,3e-05,-8e-06,-4.3e-05,-5e-06,-9.4e-05,1.7e-05,1.9e-05,1.5e-05,2.8e-05,-1.5e-05,3.8e-05,-2.5e-05,2.4e-05,2.4e-05,-1.9e-05,2.9e-05,5e-06,-2.3e-05,-3.8e-05,3.5e-05,8e-06,-8e-06,1e-06,3e-05,-4e-06,-1.4e-05,-4e-05,-4.4e-05,-5.4e-05,-1.1e-05,1.7e-05
1e-05,-2.9e-05,-4.6e-05,1.4e-05,3e-06,3e-06,-3.6e-05,3.3e-05,1.8e-05,-2.3e-05,-2.9e-05,-2.3e-05,7e-06,3e-06,1.9e-05,-1.6e-05,1.7e-05,-1.2e-05,1.2e-05,2e-06,2.8e-05,-6e-06,3.5e-05,-4.5e-05,-7e-06,2.2e-05,-2.5e-05,-2.2e-05,1e-06,-3e-06,1.9e-05,0,-3.3e-05,-4e-06,-4e-06,1e-06,1.4e-05,-3.2e-05,2.9e-05,-2.4e-05,5e-06,-1.1e-05,1.6e-05,-4e-06,1.3e-05,-7e-06,-1.2e-05,-2.2e-05,1.8e-05,-3.3e-05,-1.2e-05,0,-1.3e-05,-1.4e-05,-1.4e-05,2.7e-05,1e-05,-6e-06,5e-05,1.4e-05,2.8e-05,4.2e-05,-9e-06,0.000102,2.8e-05,-2e-06,-4.7e-05,1.7e-05,2e-06,-1.7e-05,-7e-06,-8e-06,-4.9e-05,-1.9e-05,5e-06,-2.6e-05,2e-05,-7e-06,-3.2e-05,-7e-06,2e-06,2.5e-05,6e-06,-3e-05,1.3e-05,1e-05,-8e-06,-7e-06,4e-05,-4.4e-05,9e-06,-8e-06,-6e-06,2e-06,6.2e-05,-1.8e-05,1.7e-05,-4.9e-05,-2.7e-05,2e-06,5.2e-05,-1e-05,1e-05,-1.4e-05,1.8e-05,-5e-06,-2e-06,-1e-06,-4e-06,-1.2e-05,-1.6e-05,1e-05,1.6e-05,-3.9e-05,-1.1e-05,1.4e-05,5.5e-05,3.5e-05,5.3e-05,2.4e-05,8e-06
-1.7e-05,-1e-06,1.9e-05,1e-05,-5e-06,-3.3e-05,4.6e-05,-2.6e-05,-1.8e-05,-3e-05,-3e-06,-2.4e-05,-2.6e-05,7e-06,-1.1e-05,5e-06,-1.1e-05,1.1e-05,-2.6e-05,-2.3e-05,-8e-06,8e-06,2.6e-05,1e-06,-1.3e-05,-1.7e-05,2.3e-05,-8e-06,1e-06,9e-06,-4.2e-05,-1.1e-05,4e-05,3.4e-05,2.2e-05,2e-05,5e-06,-1e-05,-3e-06,1.9e-05,3.8e-05,1.7e-05,-1.2e-05,-1.2e-05,5e-06,1e-06,-1.2e-05,-6e-06,-1.7e-05,-9e-06,-9e-06,1.2e-05,-3.2e-05,1.6e-05,3.4e-05,-3.7e-05,-1.3e-05,-7e-06,-1.7e-05,6e-06,1.2e-05,5e-06,1.2e-05,-1.3e-05,-2.5e-05,-7e-06,3e-06,-2.2e-05,-2e-06,9e-06,1.4e-05,4e-06,2e-05,-2.4e-05,-1.3e-05,1.9e-05,1.1e-05,-6e-06,-4.5e-05,-3e-05,3e-06,1e-05,4e-06,-1.4e-05,5e-06,3.8e-05,-1.7e-05,4e-06,1.4e-05,3.1e-05,-1.4e-05,3e-06,2.4e-05,3e-06,-2.1e-05,-3e-06,-2.3e-05,6.5e-05,-3e-06,-3.1e-05,-1.2e-05,8e-06,-2.7e-05,-1.9e-05,1.6e-05,1e-05,0,1.7e-05,2.3e-05,1.4e-05,-1.2e-05,-5e-06,-1.1e-05,-1.7e-05,3.5e-05,-1.5e-05,-7.2e-05,-2e-06,-6e-06,3.9e-05,-5e-06
-5e-06,2.5e-05,-3e-06,-1.1e-05,0,1.4e-05,-1.6e-05,1.9e-05,-5e-06,2.1e-05,6e-06,1.1e-05,1.3e-05,-1.4e-05,-1e-05,-8e-06,9e-06,7e-06,2.2e-05,1.1e-05,-1.9e-05,-1.7e-05,-1.3e-05,-1.8e-05,7e-06,-3e-06,-2.7e-05,1.2e-05,4e-06,-1.8e-05,1.8e-05,0,8e-06,-1.9e-05,-3.7e-05,-1.8e-05,-9e-06,-6e-06,5e-06,-2.5e-05,-4e-05,-3e-06,2e-06,-4e-06,7e-06,-1.9e-05,-2.3e-05,-2e-06,-3e-06,1.8e-05,2.8e-05,-1.2e-05,8e-06,-1.7e-05,-3e-06,2.4e-05,1.7e-05,3e-06,2.5e-05,-2.7e-05,-2.2e-05,-1.8e-05,-6e-06,-1.8e-05,-1e-05,-2.8e-05,6e-06,3e-06,1.2e-05,-1.4e-05,-1.8e-05,0,-3e-06,2.3e-05,1.3e-05,4e-06,-1.5e-05,-1e-06,7e-06,2.1e-05,3e-06,1.6e-05,1e-05,-4e-06,-1.9e-05,-2e-06,-2e-05,-2e-06,1.3e-05,-4e-06,1.8e-05,-7e-06,-8e-06,-3e-05,-6e-06,6e-06,-7e-06,-4.7e-05,1.2e-05,1.9e-05,1.8e-05,9e-06,7e-06,9e-06,1e-06,5e-06,-2e-06,6e-06,8e-06,7e-06,4e-06,1.2e-05,-1.6e-05,-7e-06,2.6e-05,1.6e-05,0,3.5e-05,-2.6e-05,-5e-06,-3e-06
2e-06,-1.7e-05,1.8e-05,-8e-06,0,-5e-06,-1e-06,-1.2e-05,-2e-06,8e-06,-1.7e-05,1e-05,-1e-06,8e-06,1.4e-05,6e-06,-2.3e-05,-1.5e-05,-1.3e-05,-1.7e-05,8e-06,1.4e-05,1.6e-05,5e-06,-5e-06,-4e-06,1.5e-05,3e-06,-2e-06,6e-06,-7e-06,-5e-06,4e-06,-4e-06,1.5e-05,1e-05,3e-05,4e-06,1.3e-05,1.7e-05,1.2e-05,-1.1e-05,-1.2e-05,4e-06,-1e-06,1.1e-05,0,-6e-06,-3e-06,-2.4e-05,-2e-05,-6e-06,-8e-06,9e-06,-9e-06,-3.2e-05,-1.1e-05,-1.8e-05,-1e-05,-3e-06,1.5e-05,-1e-06,-3e-06,-4.3e-05,-1e-05,2.5e-05,2.2e-05,1.9e-05,-1.1e-05,-2.1e-05,9e-06,3e-06,1.4e-05,4e-06,-6e-06,-8e-06,-4e-06,-4e-06,1.5e-05,2e-06,7e-06,-2e-06,-1e-06,1e-06,1.4e-05,1.5e-05,-1.5e-05,-4e-06,-2.8e-05,8e-06,-1.1e-05,1.3e-05,-1.4e-05,3.2e-05,1.9e-05,-1.6e-05,4e-06,2.5e-05,-7e-06,-5e-06,3e-06,1e-06,2e-06,-1.9e-05,1e-05,4e-06,6e-06,-5e-06,1.6e-05,-1.2e-05,1.3e-05,-3.3e-05,2.2e-05,8e-06,-3e-05,-7e-06,-3e-06,-3e-06,-2e-06,6e-06,6e-06
2e-05,-1.5e-05,-9e-06,2e-05,2e-06,0,5e-06,8e-06,-1.8e-05,-6e-06,7e-06,-1.2e-05,-4e-06,-5e-06,-1.2e-05,-6e-06,2.2e-05,-1.6e-05,-3e-06,-1.4e-05,-6e-06,-1.1e-05,-1.3e-05,-1.4e-05,-4e-06,2e-06,-2e-05,2e-06,-5e-06,-1.8e-05,-7e-06,-4e-06,-2e-05,1e-06,-1e-05,-7e-06,-1.8e-05,1.2e-05,-1.3e-05,-1e-05,-4e-06,1.2e-05,1.5e-05,-1.9e-05,3e-06,-3e-06,2.5e-05,-2e-06,8e-06,2.2e-05,4e-06,1e-06,1e-05,-2e-06,-1e-05,1.1e-05,2e-05,-9e-06,6e-06,-2e-06,4e-06,2.8e-05,1e-06,4.7e-05,-4e-06,-9e-06,-1.8e-05,-2.7e-05,-1.4e-05,5e-06,2e-06,-3e-06,-3.4e-05,-1e-05,9e-06,2.7e-05,4e-06,-2e-06,-9e-06,-1.6e-05,-3e-06,8e-06,-6e-06,-1.8e-05,0,-2e-06,-5e-06,1.1e-05,-1.3e-05,-1.2e-05,-2e-06,-8e-06,5e-06,-2.8e-05,-9e-06,7e-06,2e-06,-1.4e-05,-7e-06,2e-06,1e-06,-8e-06,-3e-06,1e-05,-1e-06,-1e-06,-5e-06,-7e-06,-1.2e-05,1.7e-05,3e-06,3.2e-05,-1.2e-05,-1.3e-05,1.9e-05,-2e-06,1.4e-05,1.7e-05,1.5e-05,1e-06,-3e-06
-1.2e-05,-2e-06,3e-06,-3.6e-05,-3e-06,-5e-06,9e-06,0,-4e-06,-1e-06,1.1e-05,9e-06,1.1e-05,-5e-06,3e-06,0,-1e-05,0,-4e-06,1e-05,1e-06,-1e-06,-2e-06,1.5e-05,-1e-06,-5e-06,1.2e-05,-4e-06,2e-06,1.5e-05,1e-06,-3e-06,-7e-06,-8e-06,6e-06,6e-06,1e-05,-1.3e-05,1e-05,8e-06,-2.1e-05,-1.6e-05,1e-06,-7e-06,-1.4e-05,-2e-06,1e-06,4e-06,-1.8e-05,0,-1.3e-05,-2e-06,-1.2e-05,1.1e-05,1.5e-05,-7e-06,7e-06,1e-06,8e-06,-1e-06,1e-05,-3e-06,-8e-06,-1.9e-05,0,-1.9e-05,-1e-06,1e-05,-1e-06,-9e-06,6e-06,-2e-06,-1.8e-05,8e-06,-2e-05,-1.9e-05,-1e-05,2e-06,-1.1e-05,4e-06,-6e-06,-8e-06,6e-06,6e-06,-1.4e-05,-9e-06,6e-06,0,1.8e-05,-5e-06,-9e-06,9e-06,5e-06,2.2e-05,5e-06,-1.5e-05,-9e-06,4e-06,3e-06,0,3e-06,1e-06,-3e-06,6e-06,1e-06,-2e-06,2e-06,-5e-06,4e-06,-9e-06,-1e-05,-8e-06,-3e-06,2.2e-05,-1.4e-05,7e-06,-2.6e-05,-4e-06,3e-06,-1e-05,-3e-06
-1e-06,1e-06,-7e-06,1.1e-05,1e-06,1e-06,6e-06,-1e-06,3e-06,9e-06,-3e-06,2e-06,-1.7e-05,-2e-06,-6e-06,-4e-06,-1.3e-05,-9e-06,-7e-06,5e-06,2e-06,7e-06,-1.2e-05,1e-06,3e-06,1e-06,-1.3e-05,-9e-06,-2e-06,-1.8e-05,1.1e-05,-2e-06,1.8e-05,1e-06,-7e-06,-3e-06,-8e-06,1.4e-05,0,-1.2e-05,2.4e-05,1e-05,-5e-06,-7e-06,4e-06,-2e-06,-9e-06,8e-06,1.1e-05,-4e-06,8e-06,4e-06,2e-06,-1.5e-05,-4e-06,-1e-06,0,-1.4e-05,-1e-06,6e-06,-9e-06,-3.2e-05,-2e-06,2.6e-05,1e-05,1.4e-05,-1e-06,1e-06,1.5e-05,5e-06,2e-06,-1e-06,3e-06,2e-06,1.2e-05,1e-06,4e-06,0,1.5e-05,8e-06,3e-06,1.3e-05,-6e-06,-8e-06,1.1e-05,0,5e-06,2e-06,-1.4e-05,-2e-06,-2e-06,-2e-06,-5e-06,-1.1e-05,-5e-06,4e-06,1e-06,-1e-06,-1e-06,-8e-06,-1.5e-05,-5e-06,-1.1e-05,-3e-06,-4e-06,0,2e-06,-1.1e-05,2e-06,-1e-06,-4e-06,7e-06,5e-06,1e-06,1.1e-05,-1.1e-05,-6e-06,4e-06,-1.9e-05,1e-06,1e-06
1.4e-05,7e-06,5e-06,1e-06,0,1e-06,-1.9e-05,1e-06,-4e-06,1.8e-05,0,-6e-06,2.6e-05,4e-06,-3e-06,0,1.6e-05,-9e-06,9e-06,-6e-06,-6e-06,2e-06,-7e-06,0,3e-06,0,1.4e-05,3e-06,4e-06,1e-05,-9e-06,-2e-06,1e-06,4e-06,-7e-06,-1e-06,-1.3e-05,-6e-06,-1.1e-05,8e-06,-2.6e-05,-1e-05,-2e-06,2e-06,-7e-06,-3e-06,1e-06,1e-06,7e-06,1e-06,6e-06,2e-06,-9e-06,6e-06,-7e-06,7e-06,-7e-06,-3e-06,3e-06,-6e-06,-7e-06,2.5e-05,-3e-06,-4.3e-05,3e-06,4e-06,1.3e-05,-1.3e-05,-1.3e-05,1e-05,-1e-06,-3e-06,4e-05,-5e-06,-6e-06,3e-06,-5e-06,1e-06,1e-06,-6e-06,1e-06,-1.3e-05,-4e-06,4e-06,5e-06,-1.2e-05,-2e-06,-3e-06,1.1e-05,-9e-06,-6e-06,2e-06,2e-06,1e-06,-6e-06,-4e-06,1e-06,6e-06,0,7e-06,-1.3e-05,1.1e-05,6e-06,3e-06,0,1e-06,-2e-06,6e-06,-1e-06,8e-06,0,-6e-06,-1.3e-05,7e-06,-3e-06,8e-06,0,-2.3e-05,1.2e-05,9e-06,1e-06
-2e-05,-1e-05,1e-06,-1.1e-05,-2e-06,0,1.2e-05,-1e-06,4e-06,-1.2e-05,-4e-06,-4e-06,-2.7e-05,-4e-06,6e-06,-3e-06,2e-06,9e-06,4e-06,1.1e-05,2e-06,-9e-06,-1.9e-05,-1e-06,0,-1e-06,-7e-06,-6e-06,-3e-06,-5e-06,6e-06,-2e-06,1e-06,3e-06,1e-05,2e-06,5e-06,4e-06,3e-06,-8e-06,9e-06,1e-06,-2e-06,-1e-06,4e-06,1e-05,-1.3e-05,-8e-06,-2.1e-05,-8e-06,-6e-06,-4e-06,3e-06,-5e-06,5e-06,-8e-06,8e-06,4e-06,0,-8e-06,2e-06,1e-05,-5e-06,2.4e-05,2e-06,-1e-05,-3e-06,1.3e-05,-2e-06,-5e-06,5e-06,2e-06,-4.1e-05,4e-06,0,-8e-06,2e-06,0,2e-06,-9e-06,0,5e-06,0,-1.5e-05,-1e-05,2e-06,-8e-06,-5e-06,0,1.6e-05,4e-06,-2e-06,0,-1e-06,1e-06,-5e-06,5e-06,-8e-06,-1e-06,1e-06,1.1e-05,-9e-06,6e-06,-3e-06,-3e-06,-3e-06,1e-06,2e-06,-5e-06,-7e-06,3e-06,3e-06,9e-06,8e-06,-2.1e-05,-4e-06,-4e-06,1e-06,1.2e-05,-4e-06,-3e-06
0,1e-05,2e-06,6e-06,1e-06,-3e-06,1e-06,3e-06,2e-06,-5e-06,-6e-06,-3e-06,1.9e-05,1e-06,-9e-06,0,-1.1e-05,-1.1e-05,2e-06,-1.1e-05,-7e-06,9e-06,7e-06,7e-06,1e-06,-6e-06,1.1e-05,-5e-06,3e-06,-6e-06,3e-06,-2e-06,-7e-06,-1.4e-05,-1.3e-05,1e-06,-1.4e-05,-5e-06,-4e-06,5e-06,-2e-06,-5e-06,1e-06,-2e-06,-1e-06,-9e-06,5e-06,5e-06,1.4e-05,6e-06,-3e-06,3e-06,1e-06,1.1e-05,5e-06,6e-06,-1.1e-05,-6e-06,1.1e-05,-4e-06,8e-06,-2.4e-05,-2e-06,-6e-06,-7e-06,-1e-06,0,-3e-06,2e-06,5e-06,-3e-06,-4e-06,1.7e-05,0,-8e-06,8e-06,-4e-06,-2e-06,1.1e-05,1e-06,-1e-06,-7e-06,-4e-06,0,3e-06,-8e-06,-4e-06,1e-06,-6e-06,-1.2e-05,-3e-06,-1e-06,-2e-06,2e-06,2e-06,2e-06,-2e-06,5e-06,-5e-06,6e-06,2e-06,7e-06,-8e-06,-1e-06,-6e-06,-1e-06,-2e-06,2e-06,-7e-06,1e-06,1e-06,7e-06,3e-06,5e-06,1.7e-05,0,3e-06,-1.5e-05,-1.5e-05,7e-06,1e-06
5e-06,-9e-06,-3e-06,-5e-06,-1e-06,8e-06,-5e-06,-9e-06,-5e-06,9e-06,4e-06,6e-06,-1.2e-05,1e-06,8e-06,-2e-06,5e-06,-7e-06,-1e-06,1e-06,4e-06,-3e-06,-2e-06,-1e-06,0,8e-06,-5e-06,-8e-06,-4e-06,3e-06,-7e-06,-2e-06,3e-06,9e-06,5e-06,-3e-06,3e-06,1e-06,-1e-06,-5e-06,-2e-06,4e-06,1e-06,6e-06,1e-06,9e-06,1.1e-05,8e-06,-1e-06,-3e-06,-5e-06,-5e-06,5e-06,-6e-06,0,-6e-06,4e-06,2e-06,-1e-05,1e-06,-6e-06,3e-06,-2e-06,1.4e-05,-2e-06,1.1e-05,1e-06,-7e-06,3e-06,-4e-06,2e-06,2e-06,8e-06,-4e-06,9e-06,-6e-06,0,0,-8e-06,0,-1e-06,2e-06,-1e-06,-3e-06,2e-06,-3e-06,-2e-06,0,3e-06,7e-06,3e-06,0,3e-06,-1e-06,1e-06,-1.1e-05,-2e-06,-2e-06,4e-06,-2e-06,-1.3e-05,-8e-06,-3e-06,-2e-06,3e-06,-1e-06,1e-06,0,1e-05,1e-06,2e-06,4e-06,-4e-06,-6e-06,-9e-06,4e-06,-2.4e-05,0,1e-06,-2e-06,1e-06
-2e-06,3e-06,-1e-06,6e-06,0,-2e-06,-1e-05,1e-05,0,-4e-06,3e-06,1e-06,5e-06,2e-06,-3e-06,0,1e-06,8e-06,0,2e-06,-1e-06,-3e-06,1e-06,0,-3e-06,-4e-06,4e-06,-3e-06,2e-06,-4e-06,3e-06,-3e-06,-1e-06,3e-06,-4e-06,1e-06,-1e-05,4e-06,-1e-06,5e-06,2e-06,-7e-06,2e-06,3e-06,0,-9e-06,1e-06,-1e-06,-8e-06,0,6e-06,1e-06,5e-06,1e-06,-9e-06,-3e-06,-9e-06,4e-06,1.3e-05,0,-5e-06,1.7e-05,-1e-06,-1.6e-05,5e-06,-9e-06,2e-06,6e-06,-3e-06,-2e-06,-1e-06,-3e-06,4e-06,-2e-06,-8e-06,1e-06,-2e-06,0,3e-06,-4e-06,0,-1e-05,2e-06,-5e-06,-5e-06,1e-06,6e-06,1e-06,-8e-06,3e-06,-2e-06,-3e-06,0,-7e-06,1e-06,3e-06,1e-06,3e-06,0,5e-06,-7e-06,8e-06,2e-06,-5e-06,-5e-06,-2e-06,-2e-06,-3e-06,-1e-05,-1.4e-05,2e-06,-6e-06,0,2e-06,-1e-05,-6e-06,1e-05,-5e-06,8e-06,-7e-06,1e-06
6e-06,-8e-06,2e-06,-5e-06,1e-06,0,-1e-06,-9e-06,-4e-06,-4e-06,-1e-06,-4e-06,2e-06,-5e-06,-1e-06,-2e-06,-2e-06,0,-4e-06,0,-2e-06,3e-06,7e-06,1e-06,-1e-06,0,-7e-06,-2e-06,-3e-06,-3e-06,-2e-06,-2e-06,0,-7e-06,-5e-06,1e-06,2e-06,-6e-06,-2e-06,-5e-06,-6e-06,6e-06,-2e-06,-4e-06,3e-06,7e-06,-5e-06,-2e-06,6e-06,1e-06,2e-06,1e-06,1e-06,-5e-06,8e-06,0,2e-06,-3e-06,-9e-06,0,-5e-06,-7e-06,-3e-06,-2e-06,3e-06,-1e-06,-4e-06,-4e-06,-6e-06,-6e-06,-3e-06,2e-06,-7e-06,1e-06,4e-06,4e-06,-1e-06,-1e-06,8e-06,1e-06,-1e-06,-3e-06,-2e-06,-4e-06,5e-06,-1.4e-05,8e-06,1e-06,1e-05,1e-06,2e-06,-2e-06,-1e-06,1e-05,0,-7e-06,2e-06,-4e-06,-4e-06,-8e-06,5e-06,-5e-06,2e-06,6e-06,7e-06,-1e-06,2e-06,-4e-06,0,5e-06,-1e-06,-5e-06,-1e-06,-1e-06,2e-06,5e-06,-6e-06,4e-06,-2e-06,2e-06,-1e-06
-5e-06,0,0,0,-1e-06,1e-06,6e-06,8e-06,-7e-06,-9e-06,0,1e-06,-8e-06,-1e-06,3e-06,0,0,0,1e-06,3e-06,5e-06,0,0,1e-06,1e-06,1e-06,2e-06,2e-06,2e-06,6e-06,-1e-06,-2e-06,-3e-06,4e-06,8e-06,-1e-06,-8e-06,6e-06,7e-06,3e-06,5e-06,-7e-06,0,-4e-06,-2e-06,-4e-06,-5e-06,-1e-06,1e-06,2e-06,-2e-06,0,1e-06,6e-06,0,-4e-06,-4e-06,6e-06,1e-05,-1e-06,4e-06,-1.2e-05,-1e-06,3e-06,-1e-06,1e-06,-8e-06,-4e-06,2e-06,0,0,-2e-06,-6e-06,2e-06,-5e-06,-5e-06,1e-06,1e-06,-5e-06,3e-06,-1e-06,-3e-06,1e-06,-2e-06,0,1e-06,0,1e-06,-6e-06,-2e-06,-2e-06,1e-06,3e-06,-1.1e-05,-1e-06,-1e-06,-2e-06,3e-06,4e-06,6e-06,-1e-06,5e-06,2e-06,-3e-06,-5e-06,-2e-06,-2e-06,2e-06,1e-06,-6e-06,-3e-06,2e-06,0,-9e-06,0,-3e-06,5e-06,5e-06,-9e-06,0,1e-06
7e-06,2e-06,0,3e-06,1e-06,-3e-06,-1e-05,-6e-06,-1e-06,0,-2e-06,3e-06,1.1e-05,1e-06,-3e-06,-2e-06,0,3e-06,-4e-06,2e-06,-7e-06,0,4e-06,-1e-06,-1e-06,-1e-06,-5e-06,1e-06,-1e-06,-8e-06,2e-06,-1e-06,-5e-06,2e-06,-9e-06,0,-1e-06,-3e-06,-2e-06,-3e-06,-1.1e-05,3e-06,-2e-06,-3e-06,1e-06,2e-06,-3e-06,1e-06,-2e-06,2e-06,-3e-06,1e-06,-3e-06,-3e-06,-1e-06,3e-06,3e-06,2e-06,-5e-06,-6e-06,-3e-06,1e-05,-1e-06,7e-06,-3e-06,7e-06,3e-06,8e-06,5e-06,-4e-06,-3e-06,1e-06,-4e-06,-3e-06,3e-06,4e-06,-2e-06,0,-6e-06,-3e-06,1e-06,-3e-06,1e-06,-1e-06,-5e-06,-7e-06,-1e-06,-1e-06,-4e-06,-3e-06,0,-2e-06,-3e-06,8e-06,-1e-06,0,-1e-06,-2e-06,-1e-06,-6e-06,-4e-06,-4e-06,-4e-06,2e-06,8e-06,-1e-06,2e-06,1e-06,4e-06,-2e-06,-1e-06,5e-06,4e-06,-1e-06,-7e-06,-1e-06,-1.8e-05,9e-06,3e-06,-1e-06,-1e-06
-4e-06,4e-06,-5e-06,-3e-06,-1e-06,3e-06,2e-06,7e-06,-3e-06,6e-06,-1e-06,1e-06,-9e-06,-1e-06,1e-06,0,3e-06,1e-06,0,-4e-06,2e-06,0,-2e-06,-3e-06,0,0,2e-06,1e-06,1e-06,3e-06,-1e-06,0,1e-06,-2e-06,2e-06,0,-3e-06,1e-06,2e-06,1e-06,1.1e-05,-4e-06,2e-06,0,-2e-06,0,5e-06,0,1e-06,-4e-06,-2e-06,-1e-06,0,3e-06,-5e-06,-3e-06,-3e-06,0,6e-06,-4e-06,-4e-06,8e-06,-2e-06,-1e-06,-3e-06,-1.3e-05,2e-06,-3e-06,-7e-06,5e-06,0,-1e-06,1.2e-05,1e-06,-3e-06,-3e-06,1e-06,0,0,-3e-06,1e-06,-5e-06,-1e-06,-3e-06,3e-06,-2e-06,-6e-06,0,7e-06,4e-06,-3e-06,0,-2e-06,-5e-06,-2e-06,-5e-06,0,0,-1e-06,2e-06,-2e-06,3e-06,-2e-06,1e-06,-5e-06,-1e-06,-2e-06,-2e-06,2e-06,7e-06,0,-9e-06,-4e-06,-3e-06,6e-06,4e-06,4e-06,2e-06,9e-06,6e-06,0
-8e-06,-3e-06,2e-06,-1e-06,0,0,2e-06,-8e-06,-1e-06,-6e-06,1e-06,-3e-06,5e-06,0,-1e-06,-1e-06,-3e-06,1e-06,1e-06,2e-06,-1e-06,-1e-06,-2e-06,0,2e-06,-1e-06,-1e-06,1e-06,-1e-06,-2e-06,1e-06,-1e-06,6e-06,-1e-06,0,1e-06,-5e-06,-2e-06,2e-06,-2e-06,-9e-06,3e-06,0,-2e-06,0,-3e-06,6e-06,-3e-06,-2e-06,2e-06,3e-06,-1e-06,-1e-06,-5e-06,6e-06,1e-06,5e-06,6e-06,-5e-06,-1e-06,-3e-06,-1.2e-05,-1e-06,-6e-06,0,6e-06,2e-06,-2e-06,-1e-06,0,-1e-06,0,-1.1e-05,5e-06,2e-06,0,-2e-06,0,6e-06,3e-06,-1e-06,-3e-06,0,-4e-06,2e-06,-1e-06,0,-2e-06,-4e-06,-7e-06,1e-06,1e-06,6e-06,2e-06,0,3e-06,1e-06,-1e-06,1e-06,0,0,-2e-06,5e-06,-3e-06,6e-06,-1e-06,2e-06,2e-06,-2e-06,-5e-06,1e-06,2e-06,0,-3e-06,-1e-05,-5e-06,-4e-06,6e-06,-8e-06,-1e-06,0
8e-06,-3e-06,-2e-06,3e-06,1e-06,-3e-06,2e-06,6e-06,2e-06,-1e-06,1e-06,0,-1e-06,1e-06,-2e-06,0,-1e-06,5e-06,2e-06,-3e-06,0,0,-7e-06,-1e-06,1e-06,1e-06,3e-06,0,0,-1e-06,1e-06,-1e-06,3e-06,4e-06,-5e-06,-1e-06,6e-06,1e-06,0,3e-06,-1e-06,-4e-06,0,-2e-06,-1e-06,5e-06,0,1e-06,4e-06,-2e-06,2e-06,1e-06,2e-06,4e-06,0,2e-06,-1e-06,-1e-06,7e-06,-1e-06,1e-06,-5e-06,-2e-06,1e-06,2e-06,1e-06,-4e-06,5e-06,3e-06,1e-06,0,0,-1e-06,-3e-06,-5e-06,3e-06,1e-06,-1e-06,-8e-06,-1e-06,0,-1e-06,1e-06,-2e-06,-3e-06,-6e-06,0,0,4e-06,2e-06,-3e-06,0,0,-1e-06,1e-06,-5e-06,0,1e-06,-3e-06,1e-06,0,1e-06,-1e-06,2e-06,-4e-06,0,-2e-06,0,6e-06,0,1e-06,-3e-06,4e-06,-1e-06,6e-06,4e-06,3e-06,1e-06,-3e-06,-5e-06,0
-5e-06,0,7e-06,-2e-06,-1e-06,2e-06,-3e-06,-3e-06,-1e-06,4e-06,1e-06,1e-06,-4e-06,1e-06,2e-06,-1e-06,4e-06,4e-06,0,0,2e-06,0,1e-06,-2e-06,0,1e-06,-1e-06,0,0,-1e-06,-1e-06,-2e-06,-3e-06,-3e-06,4e-06,0,-6e-06,1e-06,-1e-06,-3e-06,5e-06,3e-06,-1e-06,0,-1e-06,-5e-06,-5e-06,1e-06,-3e-06,1e-06,-1e-06,-1e-06,-1e-06,-2e-06,-3e-06,-4e-06,1e-06,0,-5e-06,1e-06,-1e-06,1.3e-05,-1e-06,2e-06,3e-06,0,2e-06,-6e-06,0,3e-06,1e-06,1e-06,2e-06,-1e-06,3e-06,-5e-06,-2e-06,0,-3e-06,-2e-06,1e-06,-1e-06,-2e-06,-2e-06,2e-06,6e-06,6e-06,0,-7e-06,-2e-06,0,0,-5e-06,1e-06,0,0,-1e-06,-3e-06,1e-06,-2e-06,1e-06,0,-3e-06,-2e-06,2e-06,0,2e-06,-2e-06,-4e-06,0,1e-06,4e-06,0,4e-06,2e-06,-3e-06,-8e-06,-1e-06,9e-06,1e-06,-1e-06
2e-06,1e-06,-5e-06,2e-06,0,-1e-06,0,0,0,5e-06,-1e-06,-1e-06,8e-06,-1e-06,-1e-06,0,-1e-06,-3e-06,1e-06,3e-06,-2e-06,-1e-06,-4e-06,-1e-06,0,-1e-06,2e-06,-2e-06,0,0,0,-2e-06,-4e-06,0,-4e-06,1e-06,7e-06,-2e-06,-2e-06,3e-06,-1e-05,-5e-06,0,2e-06,0,4e-06,-3e-06,-3e-06,0,0,-2e-06,1e-06,1e-06,3e-06,0,3e-06,2e-06,4e-06,2e-06,0,1e-06,1e-06,-1e-06,7e-06,1e-06,-7e-06,1e-06,0,-3e-06,-3e-06,0,0,1.3e-05,2e-06,-1e-06,4e-06,1e-06,1e-06,7e-06,1e-06,0,-2e-06,0,-4e-06,0,-5e-06,0,1e-06,1e-06,1e-06,-1e-06,0,2e-06,-1e-06,0,-2e-06,0,4e-06,1e-06,2e-06,-3e-06,-1e-06,0,0,-3e-06,0,-2e-06,0,2e-06,-7e-06,0,1e-06,-4e-06,-1e-06,-9e-06,0,-6e-06,-3e-06,0,-1e-06,0
3e-06,-1e-06,4e-06,0,0,1e-06,7e-06,0,-1e-06,1e-06,-2e-06,-1e-06,-1e-05,-1e-06,0,-1e-06,-3e-06,1e-06,-1e-06,-2e-06,0,3e-06,0,1e-06,-1e-06,0,0,-3e-06,1e-06,0,2e-06,-1e-06,1e-06,1e-06,1e-06,0,-4e-06,3e-06,0,-2e-06,8e-06,4e-06,0,-1e-06,0,-5e-06,-1e-06,-1e-06,4e-06,-1e-06,-2e-06,0,-1e-06,-4e-06,2e-06,-3e-06,0,-3e-06,2e-06,-3e-06,-3e-06,-1.5e-05,-2e-06,-1.1e-05,-1e-06,1e-05,0,4e-06,-2e-06,0,2e-06,0,-1e-05,-1e-06,0,-2e-06,-2e-06,0,-4e-06,-1e-06,1e-06,0,0,-2e-06,-2e-06,0,-1e-06,1e-06,5e-06,1e-06,1e-06,0,3e-06,0,0,-3e-06,1e-06,-3e-06,-2e-06,-2e-06,-1e-06,1e-06,1e-06,1e-06,-1e-06,0,2e-06,1e-06,-4e-06,4e-06,-1e-06,-3e-06,3e-06,3e-06,8e-06,2e-06,2e-06,-6e-06,-7e-06,-3e-06,0
-2e-06,-1e-06,-6e-06,1e-06,0,1e-06,-4e-06,1e-06,-3e-06,-3e-06,0,0,1e-05,1e-06,1e-06,0,3e-06,4e-06,0,-1e-06,-1e-06,-3e-06,1e-06,0,0,1e-06,-1e-06,-3e-06,-1e-06,-1e-06,-3e-06,-1e-06,1e-06,-3e-06,-1e-06,0,4e-06,-2e-06,-1e-06,1e-06,-8e-06,-4e-06,0,-1e-06,1e-06,4e-06,5e-06,1e-06,-3e-06,1e-06,3e-06,0,-1e-06,2e-06,0,1e-06,0,1e-06,-3e-06,-4e-06,1e-06,6e-06,-2e-06,4e-06,-3e-06,-5e-06,-3e-06,-4e-06,3e-06,-2e-06,0,0,2e-06,-2e-06,-3e-06,-2e-06,1e-06,0,0,-2e-06,0,2e-06,-2e-06,-2e-06,2e-06,5e-06,-5e-06,0,-5e-06,1e-06,0,0,-2e-06,2e-06,-1e-06,2e-06,0,3e-06,1e-06,1e-06,4e-06,-2e-06,3e-06,-2e-06,1e-06,0,-2e-06,-2e-06,-2e-06,0,-1e-06,0,-2e-06,4e-06,-2e-06,-3e-06,-2e-06,-1e-06,2e-06,4e-06,0
3e-06,2e-06,6e-06,1e-06,1e-06,-2e-06,0,-1e-06,-3e-06,3e-06,0,1e-06,-8e-06,-1e-06,-2e-06,-1e-06,1e-06,-3e-06,1e-06,1e-06,-1e-06,1e-06,2e-06,-1e-06,0,-2e-06,-2e-06,-3e-06,1e-06,-1e-06,2e-06,-1e-06,2e-06,2e-06,-2e-06,1e-06,1e-06,1e-06,-2e-06,-1e-06,3e-06,3e-06,0,-1e-06,1e-06,-2e-06,5e-06,1e-06,0,-2e-06,1e-06,1e-06,-1e-06,-1e-06,-3e-06,-1e-06,-1e-06,1e-06,1e-06,-2e-06,2e-06,1.2e-05,-1e-06,-5e-06,-2e-06,-1e-06,1e-06,1e-06,1e-06,-2e-06,0,-1e-06,-1e-06,1e-06,2e-06,5e-06,-2e-06,0,3e-06,1e-06,0,1e-06,0,-1e-06,0,-5e-06,0,0,5e-06,0,1e-06,0,-1e-06,-3e-06,0,-4e-06,0,-2e-06,1e-06,2e-06,2e-06,2e-06,-1e-06,3e-06,-4e-06,0,2e-06,1e-06,3e-06,-2e-06,1e-06,1e-06,0,0,-2e-06,4e-06,-2e-06,-5e-06,6e-06,0,0
-5e-06,-2e-06,-5e-06,-2e-06,0,3e-06,0,-1e-06,-2e-06,3e-06,0,-1e-06,4e-06,0,1e-06,0,-1e-06,0,-2e-06,-2e-06,2e-06,0,1e-06,1e-06,-1e-06,2e-06,-1e-06,-1e-06,-1e-06,1e-06,2e-06,-1e-06,1e-06,0,2e-06,0,1e-06,-1e-06,0,1e-06,-3e-06,-3e-06,0,0,0,0,-2e-06,0,1e-06,2e-06,0,-1e-06,0,3e-06,2e-06,0,1e-06,-4e-06,-2e-06,0,2e-06,-1.2e-05,-2e-06,1.2e-05,1e-06,-2e-06,3e-06,2e-06,-5e-06,0,0,0,2e-06,0,-2e-06,-5e-06,1e-06,0,0,0,0,0,0,-3e-06,-1e-06,8e-06,0,-1e-06,-4e-06,0,-1e-06,0,2e-06,3e-06,-1e-06,1e-06,0,1e-06,-2e-06,-3e-06,-1e-06,-2e-06,-3e-06,-2e-06,4e-06,1e-06,-2e-06,1e-06,-3e-06,7e-06,2e-06,4e-06,2e-06,1e-06,6e-06,-3e-06,-9e-06,-1e-06,-4e-06,-2e-06,0
2e-06,1e-06,6e-06,3e-06,0,-1e-06,1e-06,4e-06,-3e-06,-1e-06,1e-06,-1e-06,0,0,-1e-06,-1e-06,-1e-06,1e-06,-1e-06,1e-06,0,1e-06,1e-06,-1e-06,0,-1e-06,-1e-06,0,2e-06,-3e-06,-3e-06,-1e-06,-1e-06,-2e-06,-4e-06,0,4e-06,0,0,-2e-06,-1e-06,2e-06,0,-1e-06,0,1e-06,-5e-06,-1e-06,-1e-06,-1e-06,-2e-06,0,0,-3e-06,0,1e-06,-2e-06,2e-06,2e-06,1e-06,0,-5e-06,-2e-06,-1e-05,2e-06,7e-06,0,-5e-06,0,-1e-06,0,0,-1e-06,-1e-06,0,4e-06,-2e-06,0,-2e-06,-1e-06,0,1e-06,-1e-06,-2e-06,1e-06,1e-06,4e-06,0,1e-06,2e-06,0,-1e-06,-1e-06,-3e-06,1e-06,-2e-06,0,-1e-06,1e-06,4e-06,1e-06,2e-06,2e-06,1e-06,-5e-06,0,1e-06,-1e-06,1e-06,-3e-06,0,-2e-06,-2e-06,1e-06,-4e-06,1e-06,3e-06,-1e-06,-4e-06,2e-06,0
0,-3e-06,-6e-06,-2e-06,0,-1e-06,-1e-06,-4e-06,-1e-06,-4e-06,0,1e-06,-4e-06,-1e-06,-1e-06,0,3e-06,-4e-06,-1e-06,1e-06,0,-1e-06,0,1e-06,1e-06,1e-06,0,0,-1e-06,1e-06,2e-06,-1e-06,-1e-06,2e-06,0,0,-2e-06,0,0,2e-06,3e-06,-3e-06,0,-2e-06,1e-06,-2e-06,-2e-06,1e-06,0,-1e-06,-2e-06,0,0,1e-06,0,-1e-06,1e-06,-2e-06,-5e-06,0,0,1.2e-05,-1e-06,4e-06,1e-06,-8e-06,-2e-06,1e-06,3e-06,1e-06,0,1e-06,-2e-06,1e-06,-2e-06,0,1e-06,0,2e-06,0,0,4e-06,0,-2e-06,-1e-06,0,0,0,1e-06,-3e-06,-1e-06,0,0,2e-06,0,-2e-06,0,2e-06,0,-2e-06,3e-06,-3e-06,2e-06,1e-06,7e-06,0,-1e-06,1e-06,1e-06,2e-06,-1e-06,-3e-06,-1e-06,-2e-06,2e-06,1e-06,-3e-06,5e-06,7e-06,-2e-06,0
-3e-06,3e-06,6e-06,0,0,1e-06,-3e-06,3e-06,1e-06,-2e-06,0,0,7e-06,1e-06,1e-06,-1e-06,0,-2e-06,1e-06,-1e-06,0,2e-06,-4e-06,-1e-06,0,-1e-06,2e-06,2e-06,1e-06,0,1e-06,-1e-06,-1e-06,1e-06,1e-06,0,6e-06,-1e-06,1e-06,-2e-06,-8e-06,3e-06,0,-1e-06,-1e-06,3e-06,2e-06,1e-06,0,2e-06,1e-06,-1e-06,0,-2e-06,-2e-06,0,-2e-06,-3e-06,5e-06,-3e-06,0,1e-06,-1e-06,-8e-06,-1e-06,2e-06,-2e-06,3e-06,-1e-06,1e-06,-1e-06,-1e-06,-4e-06,0,1e-06,-4e-06,-2e-06,0,2e-06,0,0,1e-06,0,-2e-06,-1e-06,7e-06,0,1e-06,-4e-06,0,0,0,1e-06,-1e-06,0,1e-06,0,-2e-06,-1e-06,1e-06,2e-06,3e-06,-2e-06,-2e-06,-6e-06,1e-06,1e-06,0,1e-06,3e-06,0,2e-06,2e-06,-3e-06,6e-06,-3e-06,2e-06,1e-06,2e-06,-1e-06,0
