-0.00332,-0.003938,-0.004791,-0.004163,-0.005496,-0.006479,-0.005785,-0.005252,-0.004012,-0.003631,-0.003772,-0.00412,-0.005228,-0.004055,-0.003645,-0.005297,-0.00438,-0.005052,-0.00456,-0.002466,-0.003004,-0.006654,-0.004945,-0.00555,-0.00812,-0.009662,-0.006604,-0.006287
-0.001152,-8.2e-05,-0.000704,-0.002391,-0.004906,-0.005447,-0.004184,-0.000533,-0.001345,-0.001798,-0.002075,-0.001876,-0.004232,-0.002812,-0.000603,0.000985,-0.000788,-0.001113,-0.003351,-0.004127,-0.002046,-0.001063,-0.002628,-0.003553,-0.005483,-0.007147,-0.002032,0.000359
-0.00062,-0.001011,-0.002073,-0.002463,-0.002021,-0.001766,-0.000975,-0.001039,-0.001331,-0.001131,-0.001973,-0.002723,-0.00329,-0.001569,7.8e-05,0.000506,-4.4e-05,-0.000761,-0.00317,-0.004624,-0.002591,-0.001708,-0.002064,-0.00215,-0.001924,-0.002595,-0.00212,-0.002182
-0.000115,-0.001615,-0.002749,-0.002049,0.001059,0.002666,0.002435,-0.000735,-0.00048,2.9e-05,-0.000888,-0.001889,-0.000123,0.000618,-0.000344,-0.001777,-0.000287,-8e-04,-0.001628,-0.002903,-0.002067,-0.002017,-0.000888,-6e-04,0.001743,0.002529,-0.001212,-0.004234
0.002012,0.002824,0.003043,0.002093,0.003227,0.005439,0.004746,0.004131,0.003157,0.002889,0.002895,0.003234,0.004765,0.003572,0.001827,0.002879,0.002863,0.003834,0.003184,0.001289,0.002176,0.005452,0.003512,0.002897,0.00607,0.007716,0.005485,0.004288
-0.000244,0.000749,0.000937,0.001057,-0.000502,-0.000577,-0.000721,-0.000482,-3.7e-05,0.000229,0.000918,0.001057,0.001039,0.000441,-7e-06,0.00057,0.000553,0.000959,0.001198,0.002289,0.001878,0.001508,0.000923,0.000235,-0.000129,-0.000189,0.001186,0.00185
-0.001839,-0.002354,-0.002601,-0.001186,-0.003038,-0.005593,-0.00535,-0.004479,-0.002973,-0.002905,-0.002027,-0.001964,-0.002968,-0.003,-0.00252,-0.004273,-0.003638,-0.004608,-0.001916,0.001767,-0.000734,-0.006261,-0.002937,-0.002194,-0.006853,-0.008441,-0.005216,-0.004347
0.001607,0.001929,0.003236,0.002865,0.001604,-0.000556,-0.000527,0.002514,0.001878,0.000451,0.001063,0.002454,0.001327,-0.000165,0.000971,0.001727,3.3e-05,0.000362,0.002885,0.003371,0.001507,0.001055,0.001317,0.002581,-0.000215,-2e-06,0.00137,0.003394
0.00147,0.001445,0.003176,0.003526,0.004098,0.003746,0.003342,0.003007,0.002536,0.002193,0.001879,0.00262,0.00277,0.001697,0.00224,0.003797,0.002827,0.00422,0.004424,0.002399,0.001924,0.005396,0.002891,0.003221,0.005374,0.007352,0.003918,0.004705
-0.001526,-0.003158,-0.003173,-0.001448,0.000994,0.002428,0.001729,-0.002379,-0.001449,-0.00017,-0.000946,-0.001734,-0.000496,0.000348,-0.0012,-0.00289,-0.000416,-0.000461,-0.001046,-0.001553,-0.001463,-0.001093,-0.000996,-0.001591,0.002022,0.002502,-0.001536,-0.003739
-0.000373,-0.000263,-0.000909,-0.002426,-0.001488,0.000698,0.000651,0.000145,-0.000603,-0.000242,-0.000551,-0.001379,-0.001293,6.9e-05,-0.000824,-0.001376,-0.00076,-0.001639,-0.00337,-0.003353,-0.001646,-0.000966,-0.000786,-0.001696,-8.9e-05,-0.001982,-0.000399,-0.001268
0.000303,0.002061,0.001004,-0.001649,-0.002801,-0.002643,-0.001621,0.000637,-0.000566,-0.000448,-0.000353,-0.001376,-0.00256,-0.000843,0.000976,0.002697,0.000597,-0.000228,-0.003636,-0.003418,-0.000738,-9e-06,-0.000238,-0.000403,-0.002108,-0.004498,0.000225,0.00154
-0.001282,-0.001224,-0.003325,-0.002793,-0.003246,-0.004993,-0.004112,-0.00308,-0.002526,-0.002253,-0.002177,-0.002815,-0.003259,-0.002141,-0.001043,-0.001738,-0.001584,-0.002436,-0.003655,-0.002683,-0.001936,-0.005295,-0.002923,-0.002068,-0.005687,-0.006065,-0.004394,-0.004955
0.000414,-0.000159,-0.000775,-0.00011,-1e-06,-0.000164,-0.00016,0.000985,0.001186,-9.3e-05,-0.00022,0.001122,0.001825,0.000159,-0.00078,-0.001742,-0.000881,-0.000206,0.00213,0.001082,0.00024,-0.000994,-6e-04,-0.000544,-0.001201,0.001495,-0.000528,-0.001855
0.001889,0.001971,0.003561,0.003621,0.003142,0.004435,0.00399,0.003329,0.003433,0.002707,0.002547,0.003982,0.005064,0.002576,0.001846,0.003193,0.002544,0.004535,0.006474,0.004253,0.003493,0.006725,0.003185,0.002087,0.00582,0.009042,0.005503,0.005861
-0.000152,-0.000781,0.000641,0.002223,0.001881,0.002217,0.001508,-0.001761,-4e-04,0.001072,0.001383,0.001072,0.001721,0.001255,0.000469,0.000157,0.000863,0.001013,0.002002,0.003086,0.00157,0.001565,0.000861,0.000701,0.003357,0.003555,0.001492,0.001683
-0.000787,-0.000967,0.000197,0.00025,-0.000204,-0.000899,-0.001389,-0.001115,-0.001144,-0.000648,0.000172,-0.000402,-0.001251,-0.000764,-0.001338,-0.002534,-0.001839,-0.003294,-0.00183,0.000932,-0.000866,-0.002994,-0.000701,0.000342,-0.001642,-0.004401,-0.001993,-0.00135
-0.00025,0.000884,0.001627,0.000223,-0.000252,-0.001928,-0.001641,0.001516,0.000221,-0.000769,-0.000329,-0.000412,-0.00203,-0.001241,0.000163,0.001497,-0.000108,-0.000462,-0.000936,-0.000431,-0.000638,0.000329,0.000866,0.001707,-0.00194,-0.004424,-0.000763,0.001357
-0.000853,-0.000971,-0.00235,-0.001184,-0.00013,-0.001592,-0.001379,-0.00162,-0.001263,-0.001421,-0.001882,-0.00193,-0.002268,-0.000887,0.000256,0.000708,0.000668,0.000955,-0.001229,-0.002221,-0.001252,-0.000675,-0.000341,-0.000107,-0.001343,-0.00143,-0.001908,-0.001965
