0.022719,0.023659,0.024732,0.024905,0.0256,0.027086,0.029199,0.030634,0.030948,0.029364,0.02651,0.027108,0.028181,0.030069,0.036708,0.039628,0.038151,0.03468,0.030125,0.03102,0.036021,0.034639,0.026478,0.02662,0.033065,0.034356,0.031367,0.031117
0.031925,0.033122,0.033863,0.03388,0.035469,0.037872,0.04088,0.042975,0.043791,0.041081,0.036285,0.037055,0.03846,0.041355,0.050628,0.054938,0.054181,0.048817,0.041049,0.042869,0.050343,0.048026,0.036438,0.036799,0.046379,0.048629,0.044164,0.042938
0.050573,0.052345,0.051889,0.051519,0.054969,0.059029,0.06418,0.068428,0.070768,0.066304,0.057795,0.057927,0.05971,0.065169,0.078856,0.084687,0.085541,0.077322,0.063825,0.066865,0.078826,0.075548,0.058022,0.058531,0.07358,0.077959,0.071244,0.06809
0.07127,0.074176,0.072017,0.071108,0.076451,0.081665,0.089846,0.098438,0.103594,0.098505,0.08746,0.085211,0.086155,0.095128,0.111395,0.11508,0.116917,0.108651,0.091362,0.094224,0.109046,0.106426,0.086497,0.086897,0.105067,0.112022,0.104865,0.101558
0.08959,0.095474,0.093843,0.093013,0.098731,0.103809,0.117469,0.13361,0.139388,0.135704,0.129781,0.124592,0.120304,0.133758,0.148747,0.140312,0.13687,0.13325,0.121432,0.124943,0.137779,0.136409,0.122237,0.123647,0.138196,0.146452,0.144678,0.149447
0.112208,0.1226,0.127051,0.127819,0.131414,0.136749,0.159098,0.188451,0.19124,0.18739,0.197281,0.193364,0.1777,0.196015,0.209389,0.173911,0.153894,0.160726,0.166961,0.174657,0.178948,0.177282,0.177056,0.180631,0.181889,0.188312,0.200052,0.224176
0.153099,0.168177,0.178759,0.18131,0.18288,0.187042,0.218454,0.268046,0.272056,0.2663,0.289733,0.289105,0.263591,0.288738,0.302772,0.233142,0.191027,0.209071,0.235741,0.249345,0.241522,0.238813,0.256566,0.264053,0.250056,0.254799,0.279535,0.323734
0.196688,0.217807,0.229169,0.230303,0.232347,0.235017,0.27469,0.340394,0.347908,0.342076,0.368864,0.371548,0.345817,0.377464,0.387891,0.292093,0.235485,0.260196,0.300521,0.317534,0.299116,0.299213,0.334497,0.343421,0.319472,0.318946,0.342569,0.400219
0.211065,0.23556,0.242693,0.243154,0.250386,0.250737,0.288902,0.354144,0.367352,0.366654,0.383878,0.388932,0.373601,0.402787,0.403257,0.308179,0.262894,0.290392,0.324032,0.333285,0.309477,0.316225,0.36238,0.371262,0.345594,0.337771,0.344971,0.396087
0.192078,0.211589,0.215366,0.220961,0.232871,0.232902,0.258784,0.300846,0.317136,0.325653,0.330007,0.332862,0.329624,0.346499,0.336622,0.277579,0.273523,0.297205,0.295385,0.287738,0.276016,0.290075,0.330722,0.344679,0.320831,0.297495,0.291672,0.321266
0.161218,0.17351,0.188899,0.203839,0.216196,0.223359,0.233457,0.250188,0.270687,0.283018,0.284483,0.280721,0.282366,0.294731,0.279299,0.251397,0.280382,0.299127,0.262534,0.243544,0.251838,0.27215,0.300721,0.317541,0.289382,0.245779,0.246881,0.270703
0.142813,0.152917,0.189904,0.209201,0.211662,0.226001,0.237634,0.255479,0.274559,0.280201,0.289821,0.271492,0.258725,0.285061,0.283865,0.261515,0.293838,0.312688,0.26683,0.242397,0.25835,0.278157,0.286134,0.282624,0.254483,0.223408,0.243707,0.280828
0.137086,0.148058,0.195763,0.214817,0.202155,0.206519,0.222148,0.24788,0.272524,0.286424,0.305942,0.281465,0.246485,0.273955,0.28375,0.262658,0.297161,0.319713,0.279608,0.263591,0.281143,0.286771,0.269227,0.230629,0.206134,0.218804,0.259934,0.291559
0.123838,0.133661,0.183898,0.208539,0.179392,0.161187,0.180906,0.21122,0.247429,0.280148,0.300485,0.285515,0.238869,0.242154,0.252101,0.236082,0.27377,0.301947,0.276828,0.274608,0.288581,0.287541,0.259839,0.208716,0.193052,0.217667,0.258759,0.283367
0.103653,0.115463,0.152499,0.177667,0.149785,0.128371,0.154568,0.175351,0.210265,0.261794,0.284284,0.278422,0.246987,0.244223,0.243447,0.214176,0.239799,0.267457,0.249548,0.24672,0.255562,0.265801,0.245332,0.21367,0.220726,0.225625,0.254772,0.304416
0.113665,0.137509,0.151188,0.159996,0.150605,0.144608,0.182407,0.187784,0.201638,0.265586,0.302828,0.293426,0.294208,0.351798,0.355279,0.262578,0.225919,0.264297,0.269041,0.235384,0.231505,0.259682,0.257315,0.270826,0.320061,0.30878,0.325844,0.425045
0.16169,0.201023,0.200207,0.189194,0.187914,0.189292,0.244503,0.253708,0.259225,0.34202,0.398629,0.382196,0.403164,0.54002,0.565638,0.38829,0.271148,0.326375,0.368116,0.319397,0.318439,0.347334,0.340232,0.38958,0.485092,0.469169,0.487258,0.650505
0.220731,0.275285,0.272892,0.245708,0.231545,0.23166,0.312144,0.33787,0.338849,0.440285,0.5073,0.483324,0.520897,0.732635,0.791123,0.539394,0.355525,0.423335,0.506569,0.472814,0.473906,0.472467,0.454462,0.530953,0.647392,0.636144,0.675203,0.897145
0.26964,0.330033,0.330389,0.288178,0.246832,0.247225,0.356209,0.406202,0.412033,0.520451,0.57469,0.534804,0.572772,0.823471,0.92122,0.640561,0.40596,0.467306,0.598506,0.61911,0.625977,0.577817,0.555478,0.643138,0.729126,0.717067,0.785514,1.02548
0.307054,0.366786,0.371046,0.313863,0.238788,0.246006,0.3751,0.441099,0.456716,0.545545,0.571425,0.51593,0.538673,0.758171,0.868776,0.637319,0.397635,0.436859,0.605285,0.705905,0.731912,0.643449,0.613645,0.691222,0.719818,0.679586,0.753235,0.956835
0.331327,0.388534,0.392558,0.324768,0.232072,0.241451,0.361331,0.448626,0.489974,0.542652,0.54885,0.48805,0.487567,0.599338,0.659121,0.549164,0.373082,0.381817,0.551853,0.699051,0.736508,0.641615,0.607833,0.650912,0.627478,0.56121,0.610591,0.748276
0.339761,0.37361,0.359993,0.310568,0.24462,0.24414,0.331324,0.429027,0.487556,0.528026,0.53464,0.485844,0.45165,0.477667,0.501939,0.467957,0.365374,0.371147,0.497799,0.59976,0.63055,0.577779,0.557085,0.564609,0.518371,0.456801,0.469359,0.556087
0.291966,0.308465,0.284637,0.266426,0.255673,0.252247,0.290101,0.368845,0.423796,0.458298,0.46171,0.430607,0.407448,0.448737,0.453211,0.397786,0.339596,0.372149,0.445523,0.450451,0.451941,0.446025,0.46413,0.463412,0.399092,0.346191,0.354189,0.428803
0.203709,0.230214,0.221196,0.224847,0.257232,0.268975,0.268773,0.30475,0.331851,0.356583,0.358015,0.324935,0.339176,0.402,0.379857,0.326947,0.298048,0.321,0.352759,0.31258,0.301525,0.308471,0.377467,0.399485,0.294731,0.244191,0.275067,0.324183
0.142591,0.168519,0.168479,0.185934,0.232084,0.25432,0.256935,0.257872,0.243687,0.274044,0.289169,0.25572,0.278611,0.318158,0.281043,0.261814,0.256436,0.238454,0.249147,0.23647,0.217569,0.204463,0.279079,0.313925,0.220591,0.18877,0.220711,0.235504
0.117852,0.14281,0.137317,0.159621,0.194458,0.201161,0.20583,0.198676,0.20025,0.238872,0.243029,0.226058,0.221248,0.215549,0.191238,0.198612,0.225271,0.182777,0.176543,0.207558,0.179336,0.146057,0.185078,0.202458,0.16176,0.150701,0.16705,0.174366
0.090612,0.114984,0.118372,0.137093,0.154887,0.150863,0.142263,0.146306,0.182252,0.209169,0.192993,0.194524,0.166999,0.133583,0.128099,0.153822,0.215064,0.184021,0.165412,0.209043,0.171925,0.130552,0.136797,0.123828,0.108906,0.111368,0.130514,0.151267
0.074512,0.091437,0.095583,0.101635,0.116627,0.135465,0.125006,0.119743,0.161458,0.18334,0.147081,0.143656,0.126829,0.09217,0.088638,0.119371,0.191474,0.176954,0.14947,0.187069,0.15552,0.127332,0.138813,0.118897,0.092764,0.087173,0.108723,0.128501
0.068402,0.070455,0.064003,0.068854,0.094244,0.127536,0.124247,0.104441,0.126954,0.143702,0.108265,0.099163,0.090789,0.067822,0.070175,0.090422,0.13997,0.138871,0.114434,0.133165,0.110781,0.108607,0.138606,0.120898,0.088279,0.073739,0.08978,0.106766
0.067308,0.059585,0.045148,0.053869,0.085163,0.116934,0.116848,0.086305,0.084881,0.099567,0.086595,0.089435,0.082709,0.062367,0.072406,0.079319,0.091898,0.096641,0.089479,0.09017,0.081718,0.098393,0.120596,0.102139,0.082491,0.071369,0.085108,0.098438
0.067547,0.050661,0.042836,0.053862,0.077192,0.094321,0.090022,0.064302,0.050404,0.063364,0.070787,0.083643,0.081531,0.064423,0.078806,0.075419,0.067146,0.074665,0.085484,0.079784,0.076216,0.099155,0.098504,0.07807,0.078268,0.068691,0.08013,0.099419
0.065777,0.045537,0.049418,0.05547,0.065753,0.06778,0.058054,0.046941,0.03352,0.04946,0.064115,0.0699,0.069273,0.05918,0.076785,0.077569,0.068368,0.07401,0.092688,0.081609,0.07101,0.102158,0.098478,0.073783,0.075267,0.064755,0.079321,0.105241
0.060616,0.044381,0.052638,0.048101,0.047528,0.046078,0.03703,0.037979,0.031142,0.045908,0.061681,0.056802,0.055865,0.050498,0.062044,0.070397,0.066959,0.068275,0.087597,0.077814,0.062425,0.090669,0.094555,0.071395,0.064685,0.055552,0.071437,0.097328
0.0479,0.043777,0.051214,0.03567,0.031136,0.036357,0.03437,0.03714,0.033109,0.04325,0.057012,0.048847,0.048743,0.044931,0.044228,0.053313,0.054006,0.05285,0.067203,0.065056,0.05745,0.07291,0.074959,0.062724,0.05737,0.045196,0.053456,0.072358
0.033105,0.039811,0.044702,0.028219,0.026307,0.030099,0.029986,0.034063,0.033578,0.036471,0.044311,0.037681,0.041166,0.043433,0.039512,0.043514,0.040633,0.039176,0.045486,0.046507,0.052171,0.064111,0.059707,0.053765,0.050913,0.038492,0.036424,0.044923
0.023588,0.033145,0.035714,0.025256,0.026604,0.024423,0.023067,0.02974,0.029927,0.025543,0.027663,0.028046,0.036145,0.042788,0.040818,0.041163,0.036546,0.030927,0.037934,0.040154,0.044806,0.056949,0.057032,0.050866,0.041017,0.03083,0.0296,0.032701
0.016664,0.024387,0.025936,0.02257,0.025972,0.023811,0.023344,0.028352,0.025138,0.018034,0.019247,0.022898,0.030629,0.040654,0.042729,0.038097,0.033299,0.027664,0.038524,0.041,0.039064,0.048264,0.056686,0.054075,0.033594,0.021591,0.026813,0.027695
0.014103,0.017668,0.019094,0.021412,0.022566,0.024393,0.029671,0.029169,0.021675,0.018132,0.02267,0.026029,0.030122,0.037455,0.038429,0.029901,0.026519,0.022302,0.035096,0.038656,0.032935,0.034559,0.046985,0.053182,0.030804,0.018558,0.02378,0.023425
0.016748,0.017424,0.019199,0.021888,0.017833,0.0237,0.035656,0.030132,0.018544,0.018271,0.025473,0.02889,0.028664,0.030088,0.02834,0.019254,0.017586,0.015081,0.026965,0.030717,0.023562,0.020246,0.032504,0.048504,0.034963,0.023871,0.020544,0.018402
0.019145,0.020468,0.023409,0.023856,0.015894,0.024804,0.037498,0.027535,0.016929,0.018392,0.023941,0.026956,0.022882,0.019555,0.018338,0.012106,0.01209,0.013118,0.020811,0.0216,0.014773,0.013162,0.02289,0.042559,0.042312,0.030898,0.018485,0.01583
