-0.006293,-0.006619,-0.009118,-0.009551,-0.007723,-0.009898,-0.008444,-0.008911,-0.006775,-0.008651,-0.006794,-0.007427,-0.007658,-0.006852,-0.005231,-0.006486,-0.005732,-0.006835,-0.007049,-0.007255,-0.003763,-0.004001,-0.004057,-0.00487,-0.005787,-0.004436,-0.003636,-0.004037
0.00361,0.004848,0.006515,0.00448,0.004384,0.007044,0.002847,0.005469,0.002209,0.001558,0.003465,0.003706,0.003711,0.003691,0.002995,0.002397,-0.00022,9.1e-05,0.00251,0.004249,0.000511,-0.000696,0.000171,-0.000392,0.000555,0.000121,-0.000479,0.002104
-0.000858,-0.001603,-0.000621,-0.001152,-0.002683,-0.002025,-0.001091,-3.9e-05,2e-06,0.000796,-6.7e-05,-0.000522,-0.001364,-0.002236,-0.000944,-0.001081,-0.001541,-0.000316,-0.000127,-0.001221,-0.0027,-0.001704,-7.3e-05,-0.000549,-0.000133,0.000201,-1.7e-05,-0.000389
-0.005698,-0.00807,-0.008822,-0.00659,-0.008081,-0.0095,-0.005861,-0.00827,-0.004101,-0.002845,-0.005237,-0.006409,-0.007205,-0.008079,-0.00518,-0.005598,-0.003524,-0.002362,-0.004316,-0.006537,-0.00581,-0.003447,-0.00125,-0.001356,-0.002087,-0.001711,-0.000787,-0.003496
0.004305,0.004543,0.006813,0.007838,0.006412,0.008285,0.005318,0.004649,0.003758,0.005207,0.003952,0.004884,0.005489,0.004378,0.003442,0.004073,0.002847,0.003613,0.004398,0.005514,0.001133,0.000961,0.002232,0.003254,0.003561,0.001862,0.00181,0.002517
0.002003,0.003246,0.004066,0.002785,0.003135,0.003039,0.001959,0.003058,0.001851,0.001581,0.002166,0.003729,0.004158,0.003303,0.002368,0.003239,0.001196,0.000731,0.002154,0.002483,0.002246,0.000919,0.000494,0.00069,0.000717,0.000935,0.000419,0.001588
-0.00615,-0.005938,-0.009328,-0.009821,-0.00738,-0.010226,-0.007536,-0.008127,-0.005639,-0.008072,-0.005892,-0.006585,-0.006693,-0.005635,-0.00439,-0.005116,-0.004057,-0.005352,-0.006105,-0.007008,-0.0014,-0.001837,-0.003113,-0.004455,-0.005277,-0.003243,-0.002902,-0.003255
0.002731,0.004167,0.003438,0.002983,0.004031,0.0051,0.003188,0.003551,0.0015,0.000401,0.002091,0.001348,0.001919,0.003899,0.001932,0.001499,0.002108,0.001859,0.001408,0.003288,0.003292,0.00255,0.000564,0.000504,0.001172,0.00034,7e-05,0.001299
0.005367,0.006568,0.007793,0.006652,0.006216,0.007389,0.006752,0.008115,0.005046,0.006539,0.005215,0.005596,0.005929,0.006732,0.00409,0.005003,0.004891,0.005095,0.004728,0.005342,0.004625,0.004537,0.002469,0.003668,0.004371,0.003311,0.002563,0.002567
-0.003938,-0.005571,-0.006892,-0.005456,-0.00497,-0.007006,-0.0042,-0.006271,-0.002669,-0.001491,-0.00355,-0.004348,-0.004657,-0.004305,-0.00296,-0.003043,-0.001212,-0.00185,-0.003251,-0.005362,-0.001615,-0.000344,-0.000686,-5e-04,-0.001636,-0.000509,0.000189,-0.002226
-0.000563,-0.001925,-0.001235,0.001094,0.000631,0.001122,-0.000786,-0.002438,-0.001332,-0.001313,-0.000777,-0.001349,-0.001391,-0.001302,-0.000681,-0.001487,-0.000801,-0.000904,-0.000468,0.000102,-0.001681,-0.001467,-0.000183,-0.000204,-0.000677,-0.00079,-0.000309,5.6e-05
0.003455,0.003597,0.006444,0.00497,0.003392,0.005197,0.004132,0.007188,0.00272,0.00238,0.003688,0.005142,0.004517,0.002715,0.002414,0.002708,0.001066,0.001887,0.003533,0.004405,2.1e-05,-0.00052,0.000875,0.000752,0.001438,0.001363,0.000265,0.001702
-0.004357,-0.005128,-0.006178,-0.007911,-0.007369,-0.008266,-0.004667,-0.003366,-0.002814,-0.003639,-0.003479,-0.003311,-0.004112,-0.005873,-0.003059,-0.003029,-0.003545,-0.003335,-0.003453,-0.005117,-0.003493,-0.002939,-0.001625,-0.003044,-0.003,-0.001616,-0.001727,-0.002819
-0.002188,-0.002452,-0.003947,-0.002664,-0.002205,-0.002024,-0.003074,-0.005153,-0.002373,-0.002739,-0.002875,-0.004268,-0.00371,-0.003118,-0.001846,-0.002372,-0.002676,-0.002225,-0.002449,-0.001664,-0.002207,-0.002093,-0.001036,-0.001419,-0.000952,-0.002408,-0.001093,-0.000841
0.005199,0.006533,0.007882,0.008171,0.006396,0.007465,0.004891,0.0055,0.004281,0.005148,0.003642,0.00434,0.004847,0.005365,0.003246,0.003788,0.002317,0.003387,0.003764,0.005431,0.002018,0.001364,0.001459,0.003196,0.004021,0.001534,0.001774,0.003061
-0.000284,2.8e-05,-0.000773,-0.001414,-0.00139,-0.002992,-0.001044,-0.000316,0.001304,0.001787,-0.00027,0.000733,0.000646,3e-04,5.2e-05,0.000631,0.001041,0.00048,-0.000255,-0.002165,0.000837,0.000896,0.000312,0.000982,0.000148,0.001472,0.00101,-0.000445
-0.002705,-0.002731,-0.004398,-0.003361,-0.001471,-0.002316,-0.003108,-0.005449,-0.002786,-0.003482,-0.001935,-0.002873,-0.001847,-0.000738,-0.001219,-0.001523,0.000218,-0.001485,-0.001785,-0.002234,0.00096,0.000585,-0.000478,-0.001122,-0.002012,-0.00064,-0.000641,-0.001071
0.0027,0.004038,0.005508,0.004821,0.00499,0.005973,0.004132,0.004421,0.000389,-2e-05,0.00319,0.003356,0.003945,0.004852,0.001994,0.002117,0.001942,0.001431,0.002606,0.004644,0.003074,0.002191,0.000524,0.000407,0.000968,0.000451,-6.2e-05,0.001877
-0.000225,-0.000171,0.000242,-0.002009,-0.001887,-0.002358,0.001071,0.003042,0.000187,0.000616,0.000562,0.00129,9.1e-05,-0.000767,-0.000231,-0.000132,-0.000441,-3e-04,6e-06,-0.00113,0.000317,0.000997,-0.000412,-0.000833,-0.000698,0.000293,-0.00015,-0.000719
