-0.006849,-0.005172,-0.005362,-0.003889,-0.002774,-0.005295,-0.005661,-0.003689,-0.005728,-0.005628,-0.005139,-0.005325,-0.004914,-0.005997,-0.005979,-0.003861,-0.003458,-0.004058,-0.006496,-0.007076,-0.004365,-0.003351,-0.002731,-0.003096,-0.003616,-0.00405,-0.003734,-0.004093
0.000215,-0.000639,-0.001744,-0.00176,-0.001395,-0.000704,-0.001424,0.000192,0.001371,-0.001564,0.000419,0.001475,8.9e-05,-0.00108,0.000796,0.000381,-0.000309,-0.001568,-0.00393,-0.00309,0.000239,0.00095,-0.000937,-0.000756,0.000342,0.000564,0.001045,0.001572
7e-06,-0.000308,0.000839,-0.000193,-0.001062,-7e-05,-0.000522,0.000139,0.00043,-8.8e-05,-0.000606,-4e-05,0.000554,0.000255,0.000618,9.6e-05,-0.000396,-0.000465,6e-04,0.001638,0.000777,0.000205,-1.5e-05,0.00027,0.000759,0.001004,0.000601,0.000424
-0.001888,0.000102,0.00129,0.000198,-0.000316,-0.000488,-0.00044,-0.000949,-0.00135,0.000424,-0.002702,-0.002567,-0.001216,-0.000478,-0.001016,-0.00101,-0.001433,1.7e-05,0.003769,0.002255,-0.001244,-0.00171,0.000339,-1e-04,-0.000841,-0.000939,-0.001609,-0.002008
0.002572,0.002164,0.000647,0.00024,0.000899,0.00277,0.002895,0.001026,0.002994,0.002161,0.00074,0.001763,0.001261,0.001214,0.002282,0.001351,0.00044,0.001134,0.003102,0.000489,0.000255,0.000973,0.000941,0.000478,0.000778,0.001175,0.001483,0.001962
-0.000727,-0.00233,-0.003243,-0.00182,-0.000846,-0.000157,-0.000286,-0.000403,-4e-04,-0.00192,-0.001075,-3e-04,-0.000209,-0.002107,-0.001136,-0.000366,-0.001092,-0.001928,-0.003282,-0.00363,-0.000688,0.000535,-0.000591,-0.000735,-0.000217,8.3e-05,0.00071,0.000515
-0.004392,-0.003035,-0.00233,-0.001611,-0.001202,-0.003734,-0.003877,-0.001918,-0.004457,-0.003696,-0.002284,-0.002928,-0.002502,-0.003353,-0.004153,-0.002626,-0.002314,-0.002879,-0.004734,-0.002333,-0.001621,-0.001732,-0.00153,-0.001362,-0.001998,-0.002471,-0.002418,-0.003001
0.003132,0.003791,0.003941,0.002221,0.001745,0.001586,0.001743,0.001621,0.001965,0.002574,0.004178,0.003102,0.002142,0.003913,0.002597,0.001123,0.002245,0.002446,0.001565,0.004381,0.002457,0.000838,0.000402,0.001298,0.001415,0.001249,0.000926,0.001558
0.004432,0.002794,0.003503,0.003171,0.002402,0.003877,0.004267,0.002146,0.003739,0.004419,0.004657,0.003646,0.00336,0.00516,0.004264,0.002851,0.003538,0.00378,0.004098,0.003925,0.002575,0.001858,0.001466,0.002037,0.00254,0.002801,0.002418,0.002731
-0.00271,-0.001928,-0.001708,0.000396,0.000554,-0.001521,-0.001101,-0.001115,-0.002099,-0.000313,-0.001923,-0.002802,-0.00197,-0.001239,-0.001988,-0.000528,-0.000446,3e-05,0.001026,-0.00221,-0.002026,-0.001185,0.00055,-0.00027,-0.001468,-0.001943,-0.00195,-0.002718
-0.001353,-0.000595,-0.002098,-0.0014,-0.001036,-0.002324,-0.002161,-0.000746,-0.001354,-0.001723,-0.001863,-0.001494,-0.001942,-0.002482,-0.002064,-0.001272,-0.000883,-0.000855,-0.00125,-0.002367,-0.001414,-0.00096,-7.8e-05,-0.000688,-0.001574,-0.001993,-0.001314,-0.001219
0.00246,0.000239,0.000303,-0.000426,-0.001256,0.000989,0.000648,0.0014,0.002098,-0.000758,0.001341,0.00273,0.001554,-7.3e-05,0.001744,0.001115,0.001197,0.000111,-0.001582,0.001192,0.002024,0.001592,-0.000111,0.000293,0.001538,0.002011,0.002138,0.002743
-0.002182,-0.001435,0.000419,-0.00055,-0.001096,-0.000455,-0.001277,-0.000645,-0.001238,-0.001667,-0.001826,-0.001164,-0.000606,-0.001096,-0.000619,-0.00039,-0.000574,-0.001121,-0.00132,0.000175,9.2e-05,-0.000413,-0.001081,-9e-04,-3.2e-05,0.000381,-0.000515,-0.000731
-0.002823,-0.000198,-3e-04,-0.001534,-0.000812,-0.001177,-0.001586,-0.002081,-0.001681,-7.6e-05,-0.00316,-0.002979,-0.001605,-0.001087,-0.001848,-0.001908,-0.001974,-0.001238,0.000112,-0.002231,-0.002298,-0.001831,-0.001001,-0.00132,-0.001683,-0.001604,-0.001798,-0.001805
0.003618,0.001077,-0.000719,0.000142,0.000753,0.002086,0.002487,0.000724,0.002865,0.002491,0.000953,0.001454,0.001826,0.001349,0.002019,0.001347,-4.2e-05,0.000534,0.001663,-0.00081,7.5e-05,0.001513,0.001122,0.000843,0.000984,0.001114,0.001848,0.00196
0.002304,-0.000252,-0.000835,0.000996,0.001105,0.000663,0.001178,0.000887,0.000163,-0.00014,0.00094,0.000606,0.000662,0.000334,0.000762,0.001025,-0.000428,-0.00019,0.000989,0.001614,0.001092,0.001231,0.000916,0.000848,0.000814,0.000685,0.000929,0.000218
-0.002024,0.000766,0.001133,-3.6e-05,-5.1e-05,-0.001885,-0.001434,-0.000547,-0.002872,-0.002176,0.00016,-0.000855,-0.001706,-0.000781,-0.001827,-0.001626,-0.000804,-0.00063,-0.00052,0.002072,-0.00017,-0.001513,-0.000869,-0.000571,-0.001164,-0.00163,-0.001871,-0.001834
-0.000122,0.001021,0.001805,4.6e-05,0.000142,0.001108,0.001055,0.000573,0.000856,0.000248,0.002587,0.00219,0.00046,0.000826,0.000626,0.000285,0.001603,0.00091,-0.001151,0.000266,0.00019,-0.000438,-0.000676,5.3e-05,0.000477,0.000517,0.00033,0.001301
-0.000181,-0.001588,-0.000491,0.000757,0.000803,0.001237,0.000539,0.000527,0.001193,0.001453,0.000838,0.00031,0.000891,0.001188,0.000958,0.001141,0.001182,0.000396,-0.000893,-0.00203,0.000332,0.000548,0.000321,0.000574,0.000854,0.001212,0.000952,0.000751
