0.008774,0.006672,0.024752,0.113901,0.195386,0.249415,0.401177,0.446002,0.69015,1.347073,1.676487,1.325111,1.016333,1.188355,1.18222,0.974791,0.931148,0.785229,0.436862,0.248195,0.225105,0.282154,0.261433,0.097557,0.037546,0.028141,0.018268,0.017918
0.010483,0.008048,0.029728,0.134755,0.228139,0.294144,0.477272,0.509336,0.741396,1.480889,1.884228,1.505745,1.171491,1.372795,1.34568,1.097343,1.054831,0.886916,0.493775,0.287371,0.261922,0.323954,0.297852,0.112542,0.044732,0.032585,0.020849,0.020641
0.013097,0.010182,0.037054,0.166134,0.277082,0.358433,0.58307,0.592821,0.787895,1.618908,2.131903,1.739637,1.391243,1.62188,1.545205,1.232503,1.171972,0.973265,0.546649,0.337205,0.311358,0.373566,0.336714,0.131864,0.057358,0.039308,0.02397,0.023975
0.014746,0.0115,0.041987,0.189751,0.311753,0.384947,0.613189,0.629418,0.819662,1.632879,2.141422,1.777498,1.482759,1.689791,1.556851,1.209388,1.06491,0.840549,0.492992,0.348735,0.327394,0.37048,0.32195,0.133813,0.067931,0.043406,0.024119,0.023739
0.015633,0.012479,0.046839,0.219119,0.364921,0.404015,0.583486,0.652816,0.966897,1.774213,2.165847,1.826191,1.5958,1.664836,1.45821,1.130305,0.867071,0.608606,0.398231,0.349063,0.333596,0.350033,0.287892,0.124001,0.071596,0.044603,0.023629,0.02247
0.016414,0.013579,0.055196,0.267038,0.456107,0.470674,0.577084,0.710144,1.230981,2.086971,2.355375,2.090306,1.929424,1.806986,1.502674,1.199415,0.864477,0.532712,0.364338,0.359567,0.34538,0.345448,0.271673,0.113131,0.067053,0.044,0.025347,0.0242
0.01726,0.015313,0.066438,0.31818,0.541221,0.570188,0.643587,0.86481,1.64226,2.597437,2.875424,2.861474,2.846683,2.501349,1.991472,1.632016,1.218796,0.711867,0.422095,0.396964,0.377393,0.370683,0.28588,0.110096,0.063071,0.045886,0.029267,0.027909
0.018951,0.017316,0.076525,0.354937,0.592006,0.664427,0.776048,1.210894,2.523221,3.810812,4.178723,4.441072,4.713659,4.206876,3.286688,2.71162,2.089158,1.191001,0.593889,0.51116,0.479797,0.439075,0.334121,0.127407,0.075121,0.057239,0.037144,0.035093
0.022162,0.020074,0.088837,0.410133,0.685452,0.801976,0.98439,1.829837,4.177633,6.121343,6.456251,6.933124,7.654589,6.972368,5.438091,4.603768,3.659509,2.042733,0.899102,0.715368,0.645972,0.540085,0.411787,0.166631,0.104197,0.079507,0.051069,0.047652
0.025473,0.023402,0.108672,0.515102,0.856398,0.964353,1.176217,2.675184,6.741756,9.489521,9.436885,10.173613,11.307266,10.258322,8.143605,7.273397,5.980589,3.245056,1.276369,0.952785,0.835614,0.637815,0.485307,0.210688,0.138871,0.107513,0.070233,0.065119
0.02755,0.025731,0.123277,0.594877,0.977902,1.047666,1.266961,3.544602,9.703206,13.134019,12.328434,13.225504,14.308235,12.786782,10.558432,10.036416,8.50934,4.513756,1.641883,1.198244,1.036447,0.702211,0.507506,0.233625,0.165665,0.131312,0.086897,0.082385
0.027489,0.025364,0.128551,0.631025,1.023182,1.042504,1.266654,4.051303,11.658467,15.265025,13.578582,14.393213,14.935294,13.115529,11.356756,11.394833,9.882451,5.159544,1.813825,1.353721,1.177574,0.715845,0.468863,0.22552,0.171727,0.138711,0.093033,0.093512
0.025928,0.023894,0.123956,0.605979,0.994573,1.017848,1.23633,3.793508,11.037907,14.381541,12.450179,12.872758,12.711292,10.883758,9.840173,10.174333,8.800505,4.567326,1.673996,1.375704,1.219965,0.658141,0.383521,0.197988,0.157838,0.127946,0.085214,0.089431
0.023075,0.02282,0.120855,0.586242,1.025917,1.090652,1.196496,2.827111,7.785748,10.448575,9.304484,9.458263,9.03175,7.365059,6.652709,6.822587,5.657737,2.972742,1.260993,1.192627,1.10834,0.572414,0.311189,0.171269,0.138787,0.106908,0.064237,0.06655
0.019065,0.020099,0.131398,0.712679,1.324337,1.347156,1.176171,1.720969,4.002513,5.886884,5.834136,5.683948,5.247683,4.142454,3.523962,3.37573,2.585678,1.445577,0.804879,0.853634,0.862415,0.507027,0.290822,0.172155,0.148655,0.097673,0.041928,0.038349
0.018144,0.018233,0.144904,0.924197,1.809064,1.740273,1.176346,1.092921,2.075096,3.215906,3.617229,3.514346,2.970322,2.306941,1.875214,1.536278,1.070833,0.700427,0.535124,0.683456,0.768472,0.543611,0.336725,0.213804,0.199829,0.121105,0.037912,0.025598
0.021768,0.02138,0.162088,1.20127,2.410281,2.227828,1.284584,0.998228,1.853196,2.834992,3.416395,3.161706,2.433168,2.069196,1.651637,1.193448,0.810273,0.554474,0.502674,0.864718,0.997111,0.658146,0.388831,0.266493,0.265546,0.16393,0.048896,0.027748
0.027126,0.028006,0.204415,1.612279,3.175384,2.807818,1.511665,1.143396,2.265924,3.595647,4.315936,3.724231,2.805838,2.629799,2.145168,1.532011,1.072269,0.714186,0.63256,1.18688,1.335582,0.768015,0.414419,0.301187,0.309851,0.196095,0.059434,0.032007
0.034127,0.03486,0.250657,1.957012,3.783715,3.248226,1.654341,1.317093,3.057675,5.019724,5.679539,4.579232,3.513188,3.637186,3.145657,2.284593,1.596153,0.996947,0.800062,1.436271,1.570866,0.805388,0.387441,0.290938,0.312539,0.204763,0.064443,0.034158
0.041861,0.038991,0.265645,1.99167,3.843877,3.274008,1.610053,1.439758,3.869841,6.619736,7.181604,5.409117,4.213838,4.847217,4.518494,3.305073,2.189181,1.273306,0.969246,1.524108,1.566967,0.737667,0.323839,0.244719,0.278214,0.192312,0.063929,0.035645
0.047499,0.039295,0.239896,1.672062,3.257964,2.804845,1.394559,1.570648,4.617359,8.218004,8.942439,6.575805,4.894761,5.789628,5.757291,4.195315,2.590224,1.385186,1.076402,1.476397,1.395156,0.66882,0.30474,0.19833,0.210136,0.155084,0.060673,0.039871
0.048566,0.03782,0.198095,1.232263,2.408568,2.176961,1.22901,1.757646,4.98871,9.004009,10.25708,7.662752,5.246301,6.062241,6.321182,4.525079,2.582855,1.2659,1.007858,1.304099,1.180303,0.610811,0.288899,0.162939,0.144939,0.108641,0.054543,0.043847
0.047577,0.039909,0.164779,0.896244,1.771318,1.791778,1.198277,1.824772,4.63418,8.29507,10.110167,7.821239,5.083072,5.699399,5.860314,4.033773,2.274088,1.069132,0.807547,1.062324,0.975035,0.517341,0.226401,0.119255,0.09164,0.068883,0.046725,0.043968
0.048244,0.043506,0.137643,0.633505,1.285034,1.502247,1.158768,1.732144,3.910936,6.567479,8.361863,6.864655,4.324301,4.41506,4.250421,2.819648,1.733951,0.870828,0.644839,0.908929,0.863656,0.431756,0.150252,0.077036,0.057568,0.050018,0.045215,0.042099
0.045786,0.043513,0.115551,0.451115,0.944746,1.224459,1.034292,1.599552,3.517068,5.19753,6.110783,5.261605,3.346747,2.93961,2.58184,1.72805,1.315442,0.787542,0.60465,0.820727,0.774849,0.372932,0.104422,0.051958,0.040001,0.039255,0.040802,0.038692
0.039077,0.042042,0.097034,0.357397,0.754168,0.990708,0.895914,1.548776,3.558792,4.680281,4.329933,3.552745,2.56795,2.139243,1.705224,1.205709,1.103051,0.777876,0.579845,0.721092,0.679348,0.328968,0.080332,0.040149,0.032,0.029389,0.029986,0.033531
0.029855,0.03754,0.087338,0.335809,0.627958,0.735471,0.720012,1.607555,3.557211,3.873736,2.786982,2.312861,1.987705,1.71187,1.297664,1.02986,1.066223,0.789877,0.558727,0.662165,0.628347,0.298576,0.067393,0.035238,0.028601,0.022292,0.019838,0.02679
0.023777,0.030254,0.077678,0.322159,0.5128,0.489905,0.567862,1.682314,3.261923,2.88955,1.848242,1.749637,1.566715,1.263138,0.97123,0.88469,0.950919,0.711948,0.552984,0.700098,0.65452,0.28844,0.061965,0.038035,0.033843,0.023827,0.017055,0.021928
0.024614,0.030058,0.073341,0.283889,0.40523,0.342261,0.469164,1.648291,2.757714,2.179425,1.482511,1.451295,1.293735,0.983751,0.809544,0.834375,0.85017,0.654898,0.572688,0.797023,0.780257,0.337431,0.067995,0.045773,0.041316,0.029993,0.021394,0.022823
0.034763,0.043102,0.079562,0.237545,0.32726,0.317671,0.46025,1.502731,2.224411,1.686624,1.237444,1.134936,0.994945,0.80304,0.774407,0.874465,0.819595,0.607702,0.556484,0.817652,0.835119,0.374037,0.083586,0.058181,0.046473,0.036723,0.032373,0.032244
0.049029,0.060828,0.091813,0.247187,0.328546,0.314634,0.465782,1.398796,1.93519,1.526705,1.319916,1.118325,0.820846,0.697808,0.731125,0.812693,0.717245,0.510489,0.4652,0.680425,0.721923,0.355335,0.102848,0.075531,0.05518,0.045302,0.04576,0.044996
0.057953,0.071867,0.104049,0.282784,0.360749,0.296589,0.437742,1.401354,2.044258,1.663856,1.537687,1.354801,0.935655,0.697158,0.631952,0.657947,0.625475,0.47272,0.381269,0.50035,0.532952,0.298329,0.11433,0.086241,0.062215,0.052882,0.05525,0.05286
0.053934,0.066779,0.103734,0.296497,0.394987,0.319204,0.409851,1.365337,2.023127,1.597235,1.643068,1.672797,1.178822,0.799471,0.669763,0.636002,0.633737,0.505366,0.357771,0.48775,0.522173,0.295947,0.111186,0.08019,0.058187,0.051503,0.053155,0.049036
0.039365,0.047337,0.08456,0.270591,0.391098,0.362824,0.418271,1.293265,1.784457,1.33012,1.547411,1.833668,1.385324,0.87783,0.728236,0.716799,0.678302,0.503931,0.335989,0.520576,0.604564,0.330728,0.100715,0.061912,0.046927,0.044522,0.039552,0.034822
0.031599,0.030685,0.061052,0.242754,0.391387,0.380425,0.378589,1.14097,1.536881,1.129664,1.280041,1.70378,1.53036,0.944382,0.773978,0.833708,0.696111,0.419035,0.290759,0.496574,0.616267,0.339727,0.097146,0.051112,0.039723,0.038135,0.02448,0.023159
0.033307,0.0271,0.055922,0.23503,0.390371,0.345139,0.307132,1.00904,1.46135,1.109506,0.989097,1.364808,1.484895,0.920708,0.747889,0.846274,0.633525,0.294866,0.258635,0.469247,0.592229,0.330667,0.086956,0.044737,0.038775,0.037014,0.022903,0.020728
0.03367,0.023482,0.051063,0.210265,0.331876,0.270315,0.274026,0.881323,1.361664,1.188361,0.923559,1.145681,1.304393,0.795213,0.621919,0.717091,0.537124,0.236277,0.28051,0.489945,0.590058,0.323043,0.069745,0.039273,0.037982,0.033253,0.024337,0.018515
0.031796,0.021403,0.041012,0.166357,0.242373,0.197914,0.24405,0.713937,1.134582,1.14126,0.863709,1.109479,1.301535,0.844386,0.540954,0.562076,0.474236,0.247069,0.294528,0.455938,0.523573,0.283422,0.048106,0.031008,0.034281,0.026516,0.023578,0.017589
0.026436,0.021533,0.034049,0.135526,0.22498,0.193083,0.230112,0.647836,0.884308,0.933285,0.688526,0.962409,1.32835,0.976126,0.533929,0.510385,0.444635,0.267609,0.295294,0.376414,0.394615,0.219232,0.033983,0.02479,0.032796,0.025659,0.024973,0.024382
0.019636,0.021477,0.035083,0.123697,0.245262,0.2131,0.23061,0.679961,0.893463,0.809968,0.5683,0.737353,1.188562,1.017468,0.57479,0.471254,0.390555,0.260939,0.321316,0.36154,0.308213,0.1573,0.031871,0.021521,0.029299,0.029936,0.030454,0.033715
