2e-05,4e-06,2.6e-05,2.1e-05,1.9e-05,3e-06,1.4e-05,1.2e-05,4.8e-05,1.6e-05,3e-06,1.2e-05,1.7e-05,1.9e-05,1.4e-05,6.3e-05,7e-06,1e-05,2.5e-05,4.1e-05,0,2.6e-05,4e-06,6.8e-05,3.7e-05,2.8e-05,1e-05,1.4e-05,2e-05,2e-05,2.7e-05,1.2e-05,7e-06,3.3e-05,3.5e-05,4e-06,1.7e-05,5.3e-05,5e-05,2.7e-05,1.1e-05,8e-06,2.1e-05,2e-05,3.5e-05,2e-05,2e-06,3.6e-05,2.6e-05,7e-06,7.6e-05,4e-05,2.3e-05,3.5e-05,2e-06,3.7e-05,2.3e-05,4e-06,2.8e-05,1.2e-05,4.3e-05,6e-06,2.1e-05,9e-06,3.6e-05,1.3e-05,6e-06,1.2e-05,2.7e-05,3.3e-05,9e-06,2.9e-05,5e-06,9e-06,2.1e-05,1e-06,3e-06,1.5e-05,3.5e-05,1.2e-05,9.1e-05,1.3e-05,1.3e-05,5.2e-05,4e-06,0,1.5e-05,4.7e-05,1.6e-05,3.6e-05,3.5e-05,1.3e-05,1e-05,2.4e-05,6e-06,4e-06,8e-06,1e-06,4.3e-05,2e-06,4.5e-05,1.5e-05,3e-06,1e-05,2.8e-05,2e-05,4e-06,6e-06,4.8e-05,2e-06,7e-06,3.9e-05,2e-06,1.8e-05,2.4e-05,2.2e-05,5.1e-05,2e-06,2.9e-05,7e-06,8e-06
4e-05,7.8e-05,6.1e-05,2.2e-05,2.1e-05,3.5e-05,1.1e-05,3.7e-05,0.000133,4.7e-05,7.3e-05,8.5e-05,7.1e-05,4.2e-05,2e-05,0.000123,5.1e-05,5.3e-05,1.5e-05,7.5e-05,1.1e-05,2.3e-05,2.3e-05,0.000101,4.4e-05,4.8e-05,2.9e-05,3.7e-05,8.4e-05,3.1e-05,5.3e-05,6.4e-05,1.8e-05,7e-05,2.9e-05,5.8e-05,5.8e-05,0.000115,0.000143,6e-05,5.3e-05,2.9e-05,4.2e-05,3.6e-05,9.1e-05,1.7e-05,3.1e-05,3e-05,7.9e-05,3.6e-05,0.000188,8.6e-05,5.5e-05,7.4e-05,3.5e-05,8.4e-05,3.2e-05,3.3e-05,6.4e-05,4.3e-05,8.2e-05,3.6e-05,6.1e-05,2.6e-05,8.2e-05,1.4e-05,3.5e-05,2e-05,4.7e-05,6e-05,5.5e-05,2.7e-05,2.5e-05,4.2e-05,1.6e-05,3.4e-05,2.7e-05,5.1e-05,3.5e-05,4.4e-05,0.000175,3.2e-05,8e-06,0.00012,2.1e-05,3.9e-05,5.8e-05,9.8e-05,3.2e-05,9.2e-05,7e-05,5e-05,1.9e-05,4.1e-05,1.9e-05,2e-06,2.7e-05,2.3e-05,9.8e-05,1.4e-05,8.1e-05,1.5e-05,3.3e-05,1.1e-05,5.2e-05,4.1e-05,2.2e-05,2.9e-05,7.4e-05,2.2e-05,7e-06,6e-05,4.5e-05,4.3e-05,4.9e-05,7.9e-05,8.8e-05,2.1e-05,3.8e-05,1.8e-05,2e-05
4.1e-05,0.000132,7.7e-05,7e-06,8.7e-05,3.4e-05,7.1e-05,0.000106,0.000116,1.9e-05,0.000111,2.8e-05,2.8e-05,8.2e-05,4.3e-05,0.000139,7.8e-05,2.9e-05,5.9e-05,0.000119,5.4e-05,6e-06,2.3e-05,9.2e-05,0.000165,3.4e-05,2.6e-05,5.7e-05,4.4e-05,5.7e-05,4.1e-05,5.4e-05,5.3e-05,6e-05,8.6e-05,7.5e-05,2.7e-05,0.000171,0.000169,6.9e-05,5e-05,0.000106,6.6e-05,8e-05,6.1e-05,9.2e-05,6.4e-05,9.3e-05,7.2e-05,6.5e-05,0.000143,0.000168,4.1e-05,9.7e-05,2.7e-05,9.5e-05,0.000155,6.9e-05,6.4e-05,0.000105,0.000136,2.1e-05,9.5e-05,3.8e-05,0.000122,6.1e-05,3.6e-05,4.9e-05,3.8e-05,5.1e-05,4.9e-05,7.8e-05,7.1e-05,7.1e-05,7.3e-05,4.2e-05,5.9e-05,6.1e-05,2.6e-05,6.1e-05,0.000126,9e-05,5.9e-05,0.000122,6.2e-05,8.1e-05,0.00011,7.3e-05,0.000102,0.000134,5.4e-05,5e-05,2.4e-05,0.000112,7.2e-05,9.5e-05,6.9e-05,5.9e-05,0.000172,5.3e-05,7.5e-05,3.9e-05,5e-05,4.1e-05,2.4e-05,3.2e-05,3.2e-05,5.7e-05,0.000123,4.9e-05,2.3e-05,0.000106,5.4e-05,2.3e-05,8.8e-05,0.000101,8.2e-05,3.8e-05,1.3e-05,5.4e-05,3.7e-05
2e-04,0.000129,5.4e-05,9.1e-05,0.000115,9.4e-05,0.000151,0.000103,0.00024,0.000155,0.000129,0.000136,6.7e-05,0.000121,9e-05,0.000202,7.3e-05,3e-05,7.8e-05,0.000112,6.7e-05,8.3e-05,6.1e-05,7.4e-05,0.000184,0.000134,7.6e-05,5.1e-05,7.9e-05,9.8e-05,5.1e-05,0.000113,8e-05,3.4e-05,0.000115,0.000116,3.5e-05,0.000174,0.000145,2.9e-05,6.4e-05,0.000144,7.4e-05,9.2e-05,0.000231,0.000206,8.4e-05,0.000189,0.000128,0.000132,0.000205,0.00014,5e-05,0.00011,8.4e-05,9.9e-05,0.000148,6.1e-05,4e-05,0.00026,0.000215,8.6e-05,6.9e-05,6.3e-05,5.3e-05,4.7e-05,7.4e-05,9.1e-05,5.5e-05,6.6e-05,2.5e-05,5.7e-05,0.000141,6.1e-05,0.000103,6.6e-05,7.3e-05,6.1e-05,7.1e-05,4.4e-05,0.000236,0.000117,7.1e-05,0.000189,4.5e-05,0.000108,8.7e-05,6.5e-05,8.6e-05,8.3e-05,5.6e-05,9.1e-05,9.9e-05,0.000133,2e-05,8.6e-05,3e-05,5.7e-05,0.000163,6.5e-05,0.000138,5e-06,9.2e-05,5.9e-05,5.4e-05,6.9e-05,5.6e-05,7.8e-05,5.2e-05,1.4e-05,2.5e-05,0.000112,9.3e-05,9.8e-05,0.000141,9.6e-05,0.000103,2.6e-05,0.000124,7.4e-05,6.2e-05
5.4e-05,0.000151,2.9e-05,0.00013,9.2e-05,3.6e-05,0.000105,7.9e-05,0.00018,0.000127,0.000131,1.6e-05,4.7e-05,6.9e-05,5.8e-05,0.000146,0.000173,9e-05,7.2e-05,9.9e-05,7.6e-05,3.1e-05,9e-05,0.000132,0.000125,0.000132,7.8e-05,3.2e-05,0.000242,0.000135,9e-05,0.000153,8.2e-05,7.5e-05,0.000145,6.8e-05,0.000112,0.000184,0.000186,0.000224,2e-05,0.000146,0.000144,0.000137,0.000275,0.00015,4.6e-05,7.7e-05,0.000146,4.5e-05,0.000156,6.5e-05,8.1e-05,0.000111,0.000185,0.000126,0.000248,2.3e-05,7.9e-05,0.000269,0.000175,7.2e-05,8.5e-05,7.3e-05,4.7e-05,0.000107,3e-05,4.8e-05,5.2e-05,3.7e-05,0.000112,3.8e-05,7.8e-05,2.1e-05,0.000137,0.00013,5.2e-05,4.3e-05,3.2e-05,9.3e-05,0.000241,2.4e-05,6.6e-05,9.3e-05,0.000162,4.5e-05,0.000129,0.00011,0.000185,0.000186,3.5e-05,8.5e-05,6.8e-05,0.000168,9.8e-05,6.1e-05,5.6e-05,5.1e-05,0.000177,6.3e-05,0.000126,0.000142,9.7e-05,5e-05,9.5e-05,4.9e-05,7.9e-05,0.000111,0.000129,9.5e-05,2.8e-05,0.000125,9.7e-05,0.000109,0.000171,0.000104,0.000158,0.000111,0.000253,7.9e-05,0.000115
0.000303,0.000182,0.000218,0.000218,0.000303,0.000132,0.000151,0.000181,0.000101,0.00022,8.3e-05,5.1e-05,0.000212,5.5e-05,0.000132,9.5e-05,0.000108,3.4e-05,3.9e-05,7.9e-05,0.000135,0.000192,1.8e-05,0.000117,0.000323,3.5e-05,9.2e-05,0.000204,0.000389,0.000199,0.000109,0.000151,8.5e-05,0.000225,0.000221,0.000119,0.000121,0.00022,0.000156,0.000283,0.000234,0.000151,4.6e-05,0.000199,0.000103,0.000153,0.00012,0.000269,6e-05,0.000208,0.000162,3e-06,2e-05,0.000223,0.000236,1e-05,0.000207,0.000217,6.5e-05,0.000149,0.000132,0.00018,7.2e-05,0.000118,9.2e-05,0.000108,4.7e-05,0.000151,0.000116,8.2e-05,4.2e-05,0.000107,6.8e-05,5.7e-05,0.000132,0.000118,5e-05,0.000159,8.1e-05,8.9e-05,0.000173,8.4e-05,2.7e-05,2.1e-05,5.7e-05,0.000139,0.000113,0.000334,0.00017,7.3e-05,7.8e-05,5.6e-05,7.1e-05,0.000159,0.000115,0.000111,5e-05,8.1e-05,0.00016,5.3e-05,0.000122,8.9e-05,0.000167,0.000197,0.000208,0.000107,0.000203,0.000165,0.000138,0.000102,0.000137,0.000237,0.000297,0.000225,0.000233,0.000224,0.000323,0.000103,0.000294,0.000483,0.000383
0.000279,0.000357,0.00052,0.000155,0.000349,0.000288,2.5e-05,0.00011,0.000102,0.000378,0.000213,0.000133,0.000299,0.000209,0.000255,0.000177,0.000156,0.000112,7.5e-05,8e-05,0.000274,5.3e-05,0.000197,0.000175,0.000454,0.000525,0.000107,0.000217,5e-04,0.000432,0.000366,0.000149,0.000178,0.000301,0.000153,9.1e-05,0.000144,0.00022,0.000543,0.000274,5.5e-05,0.000205,0.00022,0.000476,0.000291,0.000104,7.9e-05,0.000282,7.8e-05,0.000416,0.000341,0.00012,0.000282,0.000123,0.000218,0.000386,0.000443,0.000379,0.000304,7.9e-05,0.000335,5.5e-05,0.000224,5.4e-05,0.000152,7.7e-05,0.00021,0.000425,0.000161,0.000111,0.000124,0.000101,2.5e-05,9.7e-05,0.000149,0.000255,0.000291,0.000141,0.000211,0.00024,0.00056,0.000195,0.000117,0.00014,0.000166,7.3e-05,0.000228,0.000267,0.000376,0.000368,0.000197,0.00021,0.000176,4.8e-05,0.000272,0.000345,0.000288,0.000205,0.00023,9.7e-05,0.00019,0.000183,0.000241,0.000128,0.000113,0.000127,0.000223,0.000119,0.000275,0.000267,0.000326,0.000488,0.000743,0.000683,0.000285,0.000171,0.000548,0.000571,0.000786,0.000628,0.000193
0.000466,0.000236,0.00062,0.000515,0.000317,0.000194,0.000254,0.000101,0.000238,0.000373,0.000541,0.000156,0.000375,0.000228,0.000289,0.000287,0.000396,0.000164,0.000171,4.1e-05,0.000358,0.000455,0.000216,4.3e-05,0.000245,0.000447,6e-04,0.000338,0.000294,6.3e-05,0.000614,0.000502,0.000131,0.000205,0.000289,0.000195,0.00015,0.000217,0.000616,0.000628,0.000282,0.000283,0.000151,0.000432,7.9e-05,0.000481,0.000515,0.000241,0.000293,0.000513,0.000539,0.000462,0.000327,9.5e-05,0.000497,0.000669,0.000263,5.3e-05,0.000376,0.000199,0.000346,0.000418,0.00045,0.000279,7.3e-05,0.000305,0.000314,0.000319,0.000638,0.000334,0.000253,0.000419,0.000324,0.000117,8.8e-05,2.8e-05,0.000327,0.000226,0.000135,9.3e-05,0.000699,0.000371,0.000225,0.000365,0.000511,0.000322,0.000137,0.000193,0.000334,0.000431,0.00023,7.6e-05,9.3e-05,0.000258,0.000458,0.000352,4.9e-05,9.3e-05,0.000447,0.000127,0.000229,0.00046,0.000224,0.000173,0.000303,0.000357,0.000438,0.000136,0.000281,0.000127,0.000292,0.00034,0.000394,4.2e-05,0.000313,0.00022,0.000394,0.000587,0.000319,0.000256,0.000225
0.000582,0.000645,0.000228,0.000338,0.000312,0.000195,0.000227,0.000332,9.1e-05,2.7e-05,0.00053,0.000725,0.000105,0.000543,0.000676,0.000863,0.000976,0.000877,0.000782,5e-04,0.000552,7.8e-05,0.000542,0.000428,9.5e-05,0.000183,0.000302,0.000302,0.000352,0.000171,0.000693,0.000148,0.000262,0.000345,0.00013,0.000417,0.000521,0.000707,0.00039,0.000491,0.000517,0.000368,5.7e-05,0.000265,0.000389,0.000775,0.000342,0.000353,0.000386,0.000417,0.000612,0.000949,0.0011,0.000695,0.000863,0.001499,0.001155,0.000528,0.000487,0.000762,0.000654,0.000127,0.000162,0.000217,0.000306,0.000521,0.00052,0.000603,0.000675,0.000513,0.000491,0.000248,0.000259,0.000332,0.000339,0.000207,0.000336,0.000132,6.9e-05,0.000111,0.00079,0.000851,0.000447,0.000507,0.000674,0.000638,0.000255,0.000307,0.000175,0.000352,0.000226,0.000138,0.000146,0.000321,0.000665,0.000533,0.000289,0.000206,0.000459,0.000677,0.000609,0.00057,0.000639,0.000647,0.000178,0.00037,0.000508,0.000333,0.000262,0.000122,0.000358,0.000132,0.000369,0.000303,0.000318,0.000317,0.000362,0.000488,0.000718,0.000524,0.000746
0.000262,0.000109,0.000465,0.000137,2.4e-05,9.9e-05,0.000103,0.000325,0.000369,0.000125,0.000526,0.000519,0.000579,0.000634,0.000446,0.00032,0.000329,0.000343,0.000242,5.3e-05,0.000286,0.000419,0.000798,0.000634,0.000433,0.000321,0.00016,0.00026,0.000417,0.000437,0.000428,0.000428,0.00048,6.5e-05,0.000407,0.000588,0.000184,0.000404,0.000429,0.000575,0.000201,0.000149,0.00028,0.000146,0.000278,0.000472,0.000427,0.000485,0.000259,0.00015,0.000505,0.000444,0.00038,0.000661,0.000254,0.000834,0.000537,0.000356,0.000575,0.000578,0.00018,0.000157,0.000296,0.000105,0.000241,0.000349,0.000175,0.000369,0.000148,0.000241,0.000157,0.00038,8.2e-05,0.000214,0.000139,0.000398,0.000289,0.000253,0.000342,0.000192,0.000631,0.000486,0.000252,0.000198,0.000193,0.000299,0.000298,0.000194,0.000115,0.000312,0.000376,6.2e-05,0.000304,0.000133,0.000395,0.000501,0.000347,0.000126,0.000512,0.00082,0.000299,8.8e-05,0.000408,0.000262,0.000252,0.000256,0.000483,0.000261,0.000177,0.000297,0.000235,0.000147,0.000349,0.000211,0.000365,0.00015,0.000546,0.000183,0.000239,0.000383,0.000456
0.000136,0.000178,0.000367,0.000292,0.00026,0.000133,5.4e-05,0.000331,0.000205,0.00023,0.000365,0.000156,0.000337,0.000116,0.000131,0.000337,0.000122,0.000389,0.000535,0.000447,0.000203,0.000168,0.000412,0.000107,0.000245,0.000232,0.000417,0.000575,8.2e-05,0.000173,0.000406,2e-04,0.000252,0.000385,0.000259,0.000194,0.00022,0.000317,0.000438,0.000169,0.000261,0.000244,0.000333,0.000367,5.7e-05,0.000227,9.2e-05,0.000296,0.000242,0.000234,0.000202,5.6e-05,0.000406,0.000112,0.000415,0.000352,0.000167,0.000275,0.00029,9.1e-05,3.7e-05,0.000117,0.00024,0.000238,0.000139,4e-05,0.000129,4.1e-05,0.000138,0.000287,0.000346,0.000436,0.000368,9.9e-05,0.000179,0.000227,9.5e-05,0.00027,8.5e-05,0.000189,0.000535,0.000266,0.000249,0.000312,0.000246,0.000243,0.000303,0.00021,0.000112,0.000285,0.000365,0.000415,0.000246,0.000303,6.8e-05,0.000336,0.00015,4.6e-05,0.000431,0.000386,0.000483,0.00033,0.000135,0.000251,6e-05,0.000187,0.000359,0.000163,0.000192,0.00042,0.00039,0.000171,0.000168,0.000229,3.2e-05,0.000278,0.000231,8.7e-05,9.4e-05,0.000289,0.000149
5.1e-05,0.00013,8.6e-05,5.9e-05,0.000109,2.5e-05,6.3e-05,0.000167,6.7e-05,0.000121,0.000255,0.00019,0.000219,0.000209,0.000147,0.00014,0.000184,0.00022,9.3e-05,0.000106,4.1e-05,7.4e-05,0.000176,0.000126,6.5e-05,0.000155,0.000228,0.000229,0.000216,0.000127,1e-04,0.00011,0.000175,6.8e-05,0.000251,8.5e-05,1e-04,0.000262,0.00015,0.000231,0.000228,0.000167,9.7e-05,9.7e-05,0.000136,1.6e-05,9.9e-05,0.000168,9.3e-05,8.1e-05,8.9e-05,8.1e-05,0.000147,0.000104,0.000283,0.00028,0.000146,8.2e-05,0.000194,0.000145,2.1e-05,7.8e-05,0.000115,0.000138,0.00016,6.3e-05,1.7e-05,2.7e-05,0.000103,8.9e-05,0.000113,0.000142,0.00011,5.5e-05,0.000134,0.000178,3.5e-05,0.000126,0.000145,0.000141,0.000195,8.5e-05,4.5e-05,0.000159,5.5e-05,0.000193,5.4e-05,3.7e-05,5.6e-05,0.000169,0.000102,8.7e-05,5.4e-05,0.000203,0.000108,0.000136,0.000132,0.000124,0.000253,6.4e-05,0.000226,5.1e-05,8.7e-05,0.000158,0.000169,7.2e-05,4e-05,3e-05,0.000208,0.000232,0.000113,4.6e-05,0.000121,5.1e-05,2.8e-05,0.00015,0.000127,8e-05,4.9e-05,5e-05,3.9e-05
7.2e-05,6.3e-05,3.6e-05,0.000116,8.8e-05,2.8e-05,0.000115,9.1e-05,6.5e-05,0.000112,5.5e-05,0.000109,0.000118,0.000132,0.000139,0.000144,0.000117,8.6e-05,6.4e-05,8.8e-05,5.3e-05,9.1e-05,7.6e-05,5.9e-05,3.8e-05,5.7e-05,0.000104,9.6e-05,9.8e-05,7.5e-05,9.2e-05,4.8e-05,0.000128,7.7e-05,0.000115,5.9e-05,7.4e-05,0.000146,0.000136,0.00013,6.5e-05,0.000112,8.2e-05,2.9e-05,7.8e-05,9e-06,7.5e-05,6.5e-05,0.00011,4.2e-05,1.8e-05,3.3e-05,0.000109,9.2e-05,0.000134,0.000113,8.8e-05,5.2e-05,0.000112,7e-05,7.8e-05,4.7e-05,8.4e-05,2.9e-05,6.5e-05,1.8e-05,5.9e-05,5.7e-05,7.1e-05,9.2e-05,5.9e-05,7.5e-05,3.6e-05,5.8e-05,6.7e-05,0.000124,8.2e-05,1.7e-05,0.000147,1.8e-05,9.2e-05,3.8e-05,4e-05,7.4e-05,7.9e-05,5.1e-05,2e-05,3.2e-05,8.2e-05,4e-05,1.2e-05,5.4e-05,3.1e-05,0.000156,4.5e-05,0.000102,5.3e-05,3.2e-05,9.2e-05,3.5e-05,0.000103,8.7e-05,4.8e-05,3.7e-05,0.000102,9.4e-05,7.8e-05,3.4e-05,9e-05,0.000123,0.000117,2e-06,8e-05,9.5e-05,3.1e-05,0.000111,8.6e-05,0.000111,5.4e-05,8.9e-05,7.1e-05
2.4e-05,3.8e-05,9.1e-05,0.000161,5.3e-05,2.3e-05,0.000116,0.000132,0.000139,5.8e-05,0.000193,0.000178,7.4e-05,7.1e-05,0.000149,6.9e-05,5.6e-05,2.6e-05,4.8e-05,4.1e-05,1.4e-05,7e-05,0.000102,7.5e-05,5.4e-05,5.9e-05,0.000128,0.000126,6.6e-05,8e-05,6.9e-05,6.6e-05,0.000111,2.9e-05,8.6e-05,1.9e-05,5.8e-05,7.1e-05,0.000209,8.2e-05,0.000104,0.000106,6.8e-05,0.000105,2e-05,6.7e-05,5.4e-05,5.2e-05,7.5e-05,5.3e-05,4.3e-05,0.000122,0.000118,8.8e-05,0.000129,0.000106,0.00011,8.2e-05,0.00015,0.000123,0.000117,6.9e-05,3.4e-05,7e-05,0.000114,0.000111,0.000106,0.000107,0.000106,0.000114,0.000125,0.00016,8.6e-05,0.000128,3.9e-05,8.3e-05,6.2e-05,6.2e-05,0.000178,9.8e-05,5.7e-05,4.9e-05,2.8e-05,2.4e-05,8.9e-05,0.000109,9.7e-05,4e-05,1e-04,4.8e-05,8.3e-05,0.00016,0.000129,0.000117,7.5e-05,9.4e-05,9e-05,4.8e-05,0.000148,2e-05,1.2e-05,4.8e-05,8.2e-05,1.6e-05,8.3e-05,4.4e-05,0.000122,7.4e-05,6.8e-05,5.2e-05,5.2e-05,5.6e-05,4.9e-05,6.9e-05,5.7e-05,8.9e-05,5.8e-05,8.4e-05,4.1e-05,2.7e-05,6e-05
5.6e-05,7.7e-05,4.4e-05,0.000121,0.000129,5.6e-05,0.00014,9.9e-05,0.000119,7.4e-05,0.000157,7e-05,0.000176,1.4e-05,0.000158,0.000112,0.00011,2.3e-05,4.2e-05,8.6e-05,4.6e-05,7.3e-05,0.000133,5.9e-05,0.00014,2e-05,0.000166,2.9e-05,6.4e-05,5.3e-05,9.6e-05,6.3e-05,4.3e-05,0.000121,0.000165,6.9e-05,2.2e-05,0.000146,0.000158,8.9e-05,0.000167,0.00015,0.00014,0.000216,0.000127,9.9e-05,5.5e-05,4.6e-05,0.000107,0.000179,0.000267,7.6e-05,9.5e-05,0.000111,0.000163,4.7e-05,0.000151,4.1e-05,3.9e-05,1e-04,0.000139,0.000173,7.3e-05,0.000113,5e-05,6.5e-05,3.5e-05,9.7e-05,6.8e-05,0.00015,7.4e-05,4.1e-05,5.9e-05,0.000144,0.000106,1.3e-05,0.00012,8.4e-05,9.5e-05,0.000115,0.00011,1.3e-05,8.5e-05,6.4e-05,0.000151,0.000178,5.3e-05,8.8e-05,8.9e-05,0.000108,9.6e-05,5.2e-05,0.000133,0.000117,0.000123,9.4e-05,7.5e-05,0.000114,9.3e-05,0.000145,6.9e-05,5.2e-05,0.000139,9.6e-05,2.5e-05,0.000105,9e-05,2.7e-05,7.8e-05,0.00012,7.5e-05,9.8e-05,0.000198,0.000189,9.7e-05,6.7e-05,4.3e-05,0.000133,0.000152,0.000187,9.7e-05
0.000141,4.4e-05,7.8e-05,3e-05,2.5e-05,6.1e-05,0.000102,8.5e-05,0.000111,8.3e-05,0.000108,0.000122,0.000113,0.000191,9.3e-05,6.7e-05,0.000126,0.000176,0.000187,5.5e-05,0.000102,0.000102,0.000118,9e-05,0.000244,0.000238,9.5e-05,6.7e-05,0.000131,9.7e-05,0.000115,7.1e-05,0.000104,1e-05,5.2e-05,6.4e-05,9.7e-05,8.9e-05,0.000129,0.000105,9.3e-05,0.00017,5.7e-05,0.000145,8.8e-05,5.4e-05,0.000168,0.000141,0.00014,0.000179,0.000158,0.000167,0.000147,0.000171,9.9e-05,4.6e-05,0.000197,0.000119,8.2e-05,6e-06,0.000207,6.4e-05,8.4e-05,2.3e-05,0.000106,5.9e-05,9.7e-05,5.8e-05,0.000112,0.000123,0.000195,0.000137,6.5e-05,9.3e-05,8.8e-05,0.000175,5.3e-05,6.7e-05,1.4e-05,6.6e-05,0.000146,1e-04,4.6e-05,0.000196,5.6e-05,5.9e-05,0.000118,0.000141,0.000116,4e-05,1.9e-05,1.4e-05,9.8e-05,4.6e-05,9.4e-05,6e-05,0.000111,9.8e-05,0.000127,0.000201,0.000226,0.000188,8.9e-05,8.2e-05,0.000139,0.000143,8e-05,0.00011,6.3e-05,0.000124,0.000121,0.000165,0.000102,0.00022,0.000139,9.2e-05,0.000116,0.00016,0.000136,9.5e-05,2.1e-05
0.00014,8.4e-05,3.4e-05,0.000109,0.00013,0.00011,5.4e-05,4.6e-05,4.1e-05,0.00012,0.000168,2e-05,6.7e-05,8.4e-05,0.00011,0.00012,0.000127,0.00022,1.8e-05,8e-06,9.4e-05,0.000216,0.00014,0.000216,0.000105,9.8e-05,0.000101,2.6e-05,0.000145,0.000103,0.000165,0.000231,0.000221,0.000125,7.3e-05,3.8e-05,5.5e-05,0.000124,2.4e-05,9.3e-05,4.3e-05,5.1e-05,0.000131,0.00016,0.000104,0.000104,0.000154,9.8e-05,7.2e-05,0.000216,8.2e-05,7.6e-05,6.9e-05,1.5e-05,0.000253,0.000146,3.9e-05,5.7e-05,4.1e-05,4.7e-05,0.00015,0.000205,6.7e-05,3.1e-05,0.000198,0.000135,0.000148,0.000119,8.2e-05,0.000115,0.000102,8.3e-05,0.000101,8.3e-05,3.2e-05,0.000142,7.1e-05,3.4e-05,0.000141,8.3e-05,0.000215,0.000216,8.6e-05,0.000254,0.000146,0.000173,0.000167,4.8e-05,7.5e-05,7.2e-05,2.5e-05,3e-05,4.6e-05,5.1e-05,0.000142,0.000189,0.000259,0.000208,9e-05,8.2e-05,0.000172,6.7e-05,0.000141,0.000113,0.00012,0.000205,0.000114,0.000161,0.000211,0.000121,4.5e-05,2e-05,0.000121,5.6e-05,5.5e-05,1e-05,5.1e-05,0.000154,8.3e-05,3.5e-05,9e-05
0.000149,0.000103,5.5e-05,0.000101,3.2e-05,9.8e-05,0.000176,0.000117,0.000152,0.000175,7.3e-05,6.1e-05,6.9e-05,8.7e-05,6.7e-05,6.9e-05,0.000116,0.000147,0.000165,8.9e-05,3.9e-05,0.000175,0.000181,0.000169,0.000127,5.4e-05,0.000174,0.000201,0.000129,4.1e-05,0.000246,3.6e-05,0.000144,7.3e-05,2.2e-05,9.4e-05,6.6e-05,0.000125,0.00022,0.000173,0.000159,8.1e-05,0.000162,4.6e-05,0.000115,8.5e-05,4.1e-05,4e-06,7.8e-05,9.5e-05,0.000115,0.000152,0.000158,7e-05,0.000295,0.000127,0.000129,9e-05,0.000103,0.000145,0.00016,5.4e-05,5.7e-05,6.3e-05,0.000166,6.3e-05,1e-05,0.000101,7.6e-05,7.6e-05,0.000105,0.000118,9.1e-05,3.4e-05,9.3e-05,0.00012,7.6e-05,0.000101,0.000132,8e-05,0.000209,0.000183,8.5e-05,0.000247,0.000126,0.000179,0.000135,7.2e-05,7.3e-05,7.4e-05,0.000144,7.3e-05,0.000106,1.8e-05,0.000112,0.000271,1.9e-05,6.3e-05,9.6e-05,6e-06,8.7e-05,0.00016,0.000135,0.000111,8.9e-05,5.9e-05,1.7e-05,0.000128,6.8e-05,6.8e-05,0.000124,3.9e-05,6.1e-05,0.000142,3e-05,7.1e-05,6.8e-05,9.9e-05,4.7e-05,1.7e-05,0.000163
2.7e-05,4.5e-05,0.000158,0.00015,5.6e-05,7.9e-05,9.8e-05,0.000145,0.000118,0.000119,0.000136,6.5e-05,9.8e-05,0.000125,0.000166,1.2e-05,8.8e-05,8.1e-05,2e-05,0.000111,0.000109,0.000192,0.000115,0.000203,1.8e-05,8.6e-05,0.000189,0.000347,0.00017,3.1e-05,0.000187,0.000191,1.9e-05,0.000153,7.3e-05,0.000186,0.000234,0.000118,0.000219,0.000188,7.3e-05,1.9e-05,0.000139,0.000158,0.000107,0.00015,0.000136,0.000109,0.000108,5.3e-05,0.000102,8.1e-05,0.000245,0.000141,0.000275,3e-04,0.000206,6.8e-05,0.000126,0.000171,0.000233,0.000118,6.3e-05,6.3e-05,0.000112,0.000188,0.000154,7.6e-05,0.000157,0.000133,5e-05,0.000165,0.000249,0.000147,6.6e-05,7.5e-05,0.000138,8.9e-05,0.000165,9.7e-05,0.000137,5e-05,0.000114,9.5e-05,0.000163,0.00023,0.000122,5.5e-05,0.000119,8.2e-05,0.000111,5.9e-05,0.000167,9.4e-05,6.6e-05,8.5e-05,0.00011,9e-05,1.7e-05,5e-05,0.000134,6.8e-05,0.00027,0.000167,0.000185,0.000102,3e-05,0.000128,6.9e-05,4.6e-05,0.000149,0.000204,5.9e-05,0.000127,0.000184,0.00021,0.000107,9.8e-05,0.000162,2.9e-05,0.000123
0.000119,4.3e-05,0.000163,8.6e-05,0.000122,0.000182,0.000173,0.000105,0.00017,0.00025,0.000189,9e-05,7.3e-05,0.000107,0.000126,0.00012,2.1e-05,4e-05,7.1e-05,0.00017,2.9e-05,0.000167,9.6e-05,0.000137,0.000136,5.6e-05,7.4e-05,0.000184,0.000232,0.000121,0.000111,0.000113,5.7e-05,0.00016,0.000172,9.9e-05,0.000142,9e-05,0.000206,0.000135,5.3e-05,8.1e-05,8.1e-05,0.000148,0.000212,0.000215,0.000144,0.000102,1e-04,0.000117,0.000136,0.000123,0.000252,0.000306,0.000151,9e-05,0.000291,0.000189,0.000222,4.7e-05,0.000161,0.000185,3.4e-05,0.000112,0.000178,0.000166,0.00015,6.1e-05,8.1e-05,6.4e-05,0.000112,8.4e-05,0.00018,6.4e-05,0.000139,0.000167,9.4e-05,0.000181,0.000112,5.6e-05,6.8e-05,3.8e-05,0.000163,0.000193,0.000179,0.00011,8.3e-05,6.5e-05,0.000145,0.000143,0.000194,0.000149,0.00017,9.8e-05,0.000116,0.000101,8e-05,0.000107,0.000132,0.00015,0.000146,0.000131,0.000236,0.000108,0.000186,4.4e-05,2.6e-05,0.000113,5.4e-05,7.9e-05,9.3e-05,0.000137,0.000139,0.000139,0.00013,6.6e-05,9.2e-05,1e-04,0.000154,7.1e-05,0.000108
0.00011,5.9e-05,0.000151,0.000153,0.000135,8.6e-05,0.000115,0.000146,0.00012,3.5e-05,8.2e-05,0.000146,9.9e-05,3.8e-05,5.8e-05,9.6e-05,0.000157,6.7e-05,5.4e-05,0.000175,0.000127,0.000136,0.000234,2.4e-05,0.000103,0.000155,0.00012,0.000132,5.1e-05,9.2e-05,0.00013,5.8e-05,8.6e-05,5.8e-05,4.5e-05,0.000127,3.2e-05,0.00012,6.4e-05,7e-05,0.000159,3.2e-05,9e-05,9.5e-05,6.6e-05,0.000175,0.000168,0.000198,0.000145,5.3e-05,0.000148,0.000203,0.000122,2e-04,0.000152,0.000246,0.000306,0.000146,0.000137,0.000147,0.000198,0.00019,0.000192,8e-05,5.8e-05,1.3e-05,0.000161,0.000207,0.000211,0.000106,0.000187,0.000209,0.000104,0.000121,0.000145,7.4e-05,3.5e-05,9.8e-05,0.000119,6.6e-05,0.000144,0.000152,0.000214,0.000108,8.8e-05,0.000155,0.000119,0.000102,1e-04,0.000106,3.9e-05,9.3e-05,0.000146,0.000132,0.000106,0.000142,0.000115,6.7e-05,0.000124,1.8e-05,0.000155,2.9e-05,5.5e-05,6.1e-05,0.000111,0.000119,5.5e-05,0.000108,0.000175,0.000145,9.9e-05,8.4e-05,6.2e-05,0.000135,0.000145,9e-05,7.2e-05,9.5e-05,0.000215,0.000119,0.000127
0.000107,3.4e-05,9.9e-05,0.000152,6.3e-05,8.9e-05,7.4e-05,6.8e-05,0.000103,0.000152,0.000157,0.000179,9.3e-05,0.000154,6.7e-05,8.1e-05,9.3e-05,2.9e-05,6.8e-05,5.9e-05,8.7e-05,0.000151,2.2e-05,0.000103,0.00011,0.000141,0.000137,4.5e-05,8.5e-05,4.6e-05,8.4e-05,0.000128,0.000138,0.000156,0.00016,0.000184,0.000104,0.000129,0.000106,0.000107,0.000135,4.2e-05,0.000102,6.8e-05,7e-05,6.8e-05,0.000105,0.000109,0.000143,5.5e-05,6.5e-05,0.000166,0.000186,7.2e-05,8.6e-05,0.000232,5.8e-05,1.9e-05,0.00013,5.5e-05,0.000118,6.7e-05,0.000145,9.1e-05,3.7e-05,3.3e-05,9.1e-05,0.000111,0.000136,1.1e-05,0.00013,8.5e-05,4.7e-05,0.000106,2.3e-05,0.00012,7.2e-05,1.4e-05,7.6e-05,8.6e-05,0.000172,0.000126,5.7e-05,0.000131,9.2e-05,0.000128,5.6e-05,0.000111,0.000125,6.5e-05,3.6e-05,0.00013,4e-05,9.7e-05,4.7e-05,0.000137,0.000144,0.00011,8.3e-05,0.000101,9.5e-05,0.000109,0.000179,9.7e-05,5.9e-05,0.000103,0.00012,0.000174,9.1e-05,5.5e-05,7.2e-05,5.9e-05,0.000142,8e-05,0.000166,0.000112,5.3e-05,1.2e-05,0.000124,9.3e-05,7.4e-05
4.3e-05,4.7e-05,4.6e-05,6.6e-05,6.3e-05,5.2e-05,7e-05,7.4e-05,4e-05,6.2e-05,3.8e-05,4.9e-05,3.2e-05,7.1e-05,3.2e-05,3.2e-05,3.3e-05,7.4e-05,7e-05,3e-05,2.5e-05,3.7e-05,4.9e-05,1.3e-05,3.6e-05,7.3e-05,4.8e-05,1.7e-05,1.6e-05,2.8e-05,2.3e-05,2.4e-05,4.4e-05,6.4e-05,6.3e-05,4.4e-05,3.8e-05,7.6e-05,6.7e-05,5.6e-05,8.2e-05,3.6e-05,6.5e-05,5.7e-05,1e-04,2.4e-05,3.2e-05,6.3e-05,8.9e-05,2.7e-05,2.1e-05,8.1e-05,6.2e-05,5.1e-05,6.4e-05,6.9e-05,3.5e-05,4.2e-05,4.6e-05,4.2e-05,1.8e-05,4.9e-05,4.3e-05,3.7e-05,4.3e-05,4.1e-05,2.8e-05,4e-05,5e-06,6.9e-05,6.5e-05,7.9e-05,7.8e-05,2.9e-05,2.4e-05,2.5e-05,2.5e-05,6.6e-05,1.9e-05,2.5e-05,4e-05,5.4e-05,5.5e-05,6e-05,6.2e-05,1.6e-05,4.1e-05,7.4e-05,1e-05,6.7e-05,2.8e-05,4.9e-05,1.7e-05,6.7e-05,7.2e-05,6.1e-05,2.3e-05,3.1e-05,1.6e-05,6.1e-05,3.3e-05,1.2e-05,9e-05,5.5e-05,4.1e-05,2.7e-05,3.2e-05,3.1e-05,0.000105,6e-05,2.5e-05,6e-05,3.1e-05,8.1e-05,2.7e-05,1.4e-05,2.9e-05,1.5e-05,2.7e-05,3.7e-05,7e-05
2e-05,4.4e-05,4.4e-05,6.6e-05,2.6e-05,1.9e-05,4.5e-05,8.5e-05,8.1e-05,1.5e-05,6.7e-05,0.000102,1e-05,6.2e-05,6.8e-05,6.2e-05,3e-05,6.7e-05,2e-05,4e-05,1.7e-05,3.3e-05,7.6e-05,4.6e-05,4.3e-05,3.8e-05,4.7e-05,3.5e-05,8e-06,2.5e-05,1.1e-05,4.3e-05,4.4e-05,6.7e-05,8.3e-05,2.6e-05,5.6e-05,7e-06,7.8e-05,7.5e-05,0.000116,0.000171,0.000166,0.000101,5.9e-05,7.2e-05,6.1e-05,3.6e-05,0.00012,0.000148,0.000148,0.000106,2.8e-05,3.9e-05,1.3e-05,2.7e-05,4e-05,3.6e-05,1.9e-05,1.9e-05,1.1e-05,6.7e-05,9.9e-05,9.5e-05,7.3e-05,4e-05,5.4e-05,1.5e-05,1.7e-05,9.4e-05,0.000117,2.8e-05,8.5e-05,4.5e-05,4e-06,6.9e-05,6.7e-05,8.3e-05,6.4e-05,4e-06,3e-05,5e-05,4e-05,7.5e-05,3.4e-05,4.3e-05,5.5e-05,0.000117,0.000116,7.6e-05,0.000119,7.8e-05,4.4e-05,6.3e-05,0.000103,6.7e-05,3.2e-05,1.1e-05,3.7e-05,7e-05,5.5e-05,5.6e-05,6.2e-05,6.1e-05,6e-05,5.5e-05,4.8e-05,7e-06,6e-05,5e-06,2.9e-05,5.4e-05,7.4e-05,8.9e-05,5.4e-05,4.4e-05,7.4e-05,5.9e-05,1.9e-05,5e-05,7.3e-05
3.6e-05,4.9e-05,3e-06,3.1e-05,8e-06,1.9e-05,5.9e-05,1.7e-05,4.9e-05,4.9e-05,7e-05,8.1e-05,9.6e-05,3.3e-05,4.1e-05,5.2e-05,3.6e-05,2.7e-05,1.5e-05,3.8e-05,3.4e-05,1e-05,6e-05,3.3e-05,5.4e-05,4.1e-05,1e-05,1.8e-05,2.8e-05,1.2e-05,4e-06,4.7e-05,2.9e-05,2.7e-05,7.3e-05,5.1e-05,7.9e-05,5.7e-05,7.4e-05,1.9e-05,9.2e-05,0.000123,5.8e-05,4.6e-05,2.2e-05,3.2e-05,2.6e-05,1.7e-05,5.5e-05,7.1e-05,4.8e-05,2.3e-05,5.6e-05,3e-05,5e-06,1.8e-05,3.1e-05,3.6e-05,3.6e-05,2.4e-05,3.4e-05,3.7e-05,2.4e-05,6.3e-05,3.3e-05,5.8e-05,4.3e-05,1.5e-05,3.6e-05,8.9e-05,3.1e-05,7.4e-05,6.1e-05,8.5e-05,4.8e-05,5.7e-05,5.1e-05,6.1e-05,2.7e-05,4.1e-05,1.8e-05,4.5e-05,2e-05,5.4e-05,4.3e-05,3e-05,2.2e-05,6.4e-05,6.6e-05,0.000129,8.9e-05,3.5e-05,2.7e-05,8.5e-05,1e-05,5.8e-05,3.8e-05,3.2e-05,5.1e-05,1.5e-05,4.2e-05,1.7e-05,4.3e-05,6.7e-05,3.7e-05,1.2e-05,2.2e-05,1.7e-05,2.5e-05,2e-05,4.4e-05,2.4e-05,1.9e-05,1.3e-05,1.1e-05,3.6e-05,0.000102,9.3e-05,7.3e-05,3.4e-05,5.1e-05
1.9e-05,1.1e-05,3.3e-05,4.6e-05,2.2e-05,1e-05,3.9e-05,4.8e-05,1.9e-05,2.8e-05,5.3e-05,1.5e-05,3.3e-05,1.5e-05,2.6e-05,1.4e-05,2.2e-05,1.5e-05,2.2e-05,1.1e-05,1.5e-05,1.5e-05,3.6e-05,1.1e-05,3.4e-05,2.5e-05,1.4e-05,1.1e-05,1.3e-05,2e-05,1.9e-05,2.2e-05,3.7e-05,2.6e-05,2.5e-05,3.7e-05,1.8e-05,2.9e-05,2.7e-05,3.5e-05,6.4e-05,3.1e-05,2e-05,3.5e-05,3.4e-05,1.7e-05,1.9e-05,1e-05,1.5e-05,2.3e-05,2.3e-05,3e-05,3.9e-05,4.1e-05,3.5e-05,1.1e-05,7e-06,1.2e-05,8e-06,2.1e-05,1.7e-05,1.1e-05,1.6e-05,9e-06,1.3e-05,1.7e-05,1.7e-05,1.4e-05,2.7e-05,2.6e-05,3.5e-05,4.4e-05,3.2e-05,5.7e-05,3.3e-05,2.9e-05,3.4e-05,1.5e-05,3.4e-05,1e-05,3.6e-05,3.9e-05,3.6e-05,2.1e-05,1.1e-05,1.3e-05,7e-06,3.1e-05,2e-05,5e-05,2.4e-05,6e-06,2e-05,4e-05,4e-05,2.1e-05,2.7e-05,4e-05,3.4e-05,3e-05,5.4e-05,3e-05,2e-05,4e-05,9e-06,1e-05,3.2e-05,2.2e-05,2e-06,1e-05,4.3e-05,3e-06,2.3e-05,1.7e-05,1.8e-05,2.9e-05,4.8e-05,4.1e-05,2.1e-05,6.5e-05,2e-05
7e-06,1.1e-05,3.1e-05,1.8e-05,2.1e-05,2.5e-05,3.4e-05,3.6e-05,4.8e-05,3.1e-05,1.7e-05,3.8e-05,4.5e-05,1.2e-05,1.6e-05,2.2e-05,1.6e-05,3.1e-05,2.7e-05,3.1e-05,2.4e-05,2.5e-05,1.9e-05,1.5e-05,4e-06,5e-06,2.1e-05,1.1e-05,1.9e-05,1.7e-05,1e-05,7e-06,1.3e-05,7e-06,2.7e-05,2.6e-05,2.3e-05,3.9e-05,1e-05,1.4e-05,3.6e-05,3.2e-05,4.9e-05,2.1e-05,2.1e-05,1.6e-05,2.1e-05,1.1e-05,3.4e-05,2.7e-05,6e-06,4.1e-05,3.6e-05,1.8e-05,4e-06,1.7e-05,3e-06,2.4e-05,1.5e-05,1.7e-05,1.3e-05,1.9e-05,1.5e-05,2e-05,1.9e-05,2.3e-05,3.1e-05,2.6e-05,1.2e-05,1.2e-05,6e-06,3.6e-05,4.2e-05,2e-06,1.9e-05,1.6e-05,3.2e-05,1.5e-05,3e-06,2.6e-05,5e-05,1.8e-05,1.8e-05,2.2e-05,2.1e-05,1.7e-05,7e-06,2.5e-05,2e-05,2e-05,3.3e-05,2.7e-05,2.5e-05,4e-06,1.2e-05,1.3e-05,3e-05,1.7e-05,4.7e-05,3.9e-05,2.3e-05,6e-06,2.2e-05,1e-05,1.4e-05,2.2e-05,1.9e-05,1e-05,3e-06,5e-06,2.2e-05,1.7e-05,3.1e-05,1.5e-05,1.4e-05,3.3e-05,5.1e-05,2.3e-05,1.1e-05,3.3e-05,1.9e-05
5e-06,8e-06,1.1e-05,2.8e-05,2.6e-05,1.2e-05,1e-05,1.2e-05,2.8e-05,2.1e-05,8e-06,2.7e-05,1.8e-05,2.4e-05,4e-05,2.4e-05,1.2e-05,1.8e-05,1.5e-05,1e-05,2.7e-05,2.2e-05,1.8e-05,1.9e-05,1.9e-05,5e-06,2.1e-05,8e-06,1.1e-05,1.9e-05,1.5e-05,1.6e-05,2.1e-05,1.1e-05,3.1e-05,1.5e-05,3e-06,8e-06,1.5e-05,4e-06,1.6e-05,1.6e-05,1.3e-05,8e-06,1.3e-05,1.7e-05,1.2e-05,1.2e-05,1.8e-05,1e-05,3.3e-05,1.5e-05,2.3e-05,1.1e-05,1.5e-05,2.5e-05,8e-06,1.4e-05,4e-06,3e-06,1.2e-05,1.7e-05,9e-06,1.8e-05,1e-06,1.9e-05,1.2e-05,1.2e-05,1e-06,9e-06,2.2e-05,3.5e-05,1.4e-05,1.1e-05,1.6e-05,1.6e-05,1.3e-05,3.1e-05,2.3e-05,2.8e-05,4.2e-05,2.6e-05,1.2e-05,2.5e-05,1.4e-05,2.2e-05,1.7e-05,1.6e-05,1.6e-05,2.2e-05,2.3e-05,1.2e-05,1.2e-05,1.6e-05,9e-06,1.4e-05,1.5e-05,1.3e-05,3.8e-05,3e-06,1.6e-05,8e-06,2.2e-05,1.4e-05,1.4e-05,1.6e-05,2.2e-05,5e-06,2e-05,1.3e-05,1.2e-05,8e-06,1.6e-05,1.6e-05,2.1e-05,3e-06,3.7e-05,1.6e-05,2.1e-05,4.5e-05,1.6e-05
6e-06,1.4e-05,1.8e-05,3.8e-05,1.6e-05,1.6e-05,8e-06,5e-06,1.4e-05,1.5e-05,1.2e-05,2.7e-05,3e-05,3.1e-05,1.1e-05,2e-05,1.7e-05,1e-05,1.2e-05,9e-06,6e-06,6e-06,1.4e-05,2e-05,1.9e-05,1e-05,1.3e-05,9e-06,4e-06,6e-06,8e-06,2.7e-05,1.7e-05,9e-06,1.9e-05,7e-06,8e-06,1.9e-05,6e-06,8e-06,2.5e-05,4e-06,1e-05,3e-06,9e-06,1.7e-05,1.7e-05,9e-06,6e-06,6e-06,1.9e-05,5e-06,3.7e-05,4e-06,1.8e-05,2.3e-05,5e-06,1e-05,3e-06,1.2e-05,1e-05,1.1e-05,5e-06,1.8e-05,8e-06,1.5e-05,1.4e-05,1.6e-05,9e-06,1.6e-05,9e-06,2.2e-05,7e-06,9e-06,5e-06,2e-05,7e-06,1.5e-05,1.5e-05,3e-06,2.6e-05,1e-05,1e-05,2.1e-05,8e-06,1e-05,3e-06,6e-06,1.3e-05,2.7e-05,1.1e-05,7e-06,1.7e-05,7e-06,1.4e-05,4e-06,1.1e-05,1e-05,3.3e-05,1.7e-05,1.9e-05,7e-06,2e-05,5e-06,9e-06,1.5e-05,1.4e-05,7e-06,2.8e-05,1.2e-05,7e-06,6e-06,1e-05,8e-06,9e-06,7e-06,3.3e-05,3e-06,1.6e-05,2.8e-05,1.7e-05
1.6e-05,0,1.5e-05,1.7e-05,5e-06,1.7e-05,1.4e-05,1e-05,8e-06,1.1e-05,1.2e-05,1.9e-05,2.5e-05,2e-05,1.5e-05,2.4e-05,1.4e-05,9e-06,7e-06,3e-06,1.7e-05,1e-06,2.3e-05,1.3e-05,2.1e-05,7e-06,1.8e-05,1.2e-05,1e-06,6e-06,5e-06,1e-05,1.7e-05,7e-06,1.9e-05,1e-05,8e-06,1.5e-05,5e-06,1e-05,1.8e-05,1.8e-05,9e-06,9e-06,5e-06,1.7e-05,1.5e-05,1.3e-05,1.3e-05,6e-06,1.2e-05,1.4e-05,1.6e-05,2.2e-05,1e-05,1.4e-05,1.1e-05,1.4e-05,6e-06,9e-06,7e-06,7e-06,6e-06,6e-06,8e-06,1.3e-05,1.3e-05,1.8e-05,1e-05,1.3e-05,1.4e-05,1.9e-05,1e-05,1.5e-05,1.3e-05,1.1e-05,1e-05,1.7e-05,8e-06,8e-06,2.1e-05,2e-06,1.4e-05,1.7e-05,9e-06,3e-06,4e-06,1e-05,4e-06,1.9e-05,1.1e-05,5e-06,1.6e-05,1.5e-05,1e-05,1.1e-05,1.2e-05,4e-06,3.2e-05,1.4e-05,2.5e-05,4e-06,1.2e-05,6e-06,7e-06,1.4e-05,1.3e-05,4e-06,1.3e-05,7e-06,9e-06,1e-06,6e-06,4e-06,1e-05,4e-06,3.1e-05,1.2e-05,1.5e-05,2.9e-05,1.1e-05
1.7e-05,1e-05,2.3e-05,1.1e-05,1.7e-05,6e-06,6e-06,1.1e-05,1.4e-05,1.1e-05,9e-06,1.5e-05,1.6e-05,1.6e-05,1e-05,1.9e-05,8e-06,7e-06,9e-06,3e-06,2.9e-05,1.8e-05,1.9e-05,3.1e-05,1e-05,7e-06,1.3e-05,8e-06,1.2e-05,8e-06,6e-06,2.4e-05,1.7e-05,2e-05,5e-06,1.3e-05,7e-06,8e-06,1.4e-05,1.2e-05,1.2e-05,6e-06,1.9e-05,1e-05,5e-06,1.2e-05,2.3e-05,2e-05,1.4e-05,1.6e-05,7e-06,1e-05,2e-05,3.3e-05,1.8e-05,1.1e-05,2.1e-05,7e-06,8e-06,5e-06,1e-05,6e-06,4e-06,1.1e-05,4e-06,9e-06,1.1e-05,4e-06,1.1e-05,8e-06,1e-06,1.9e-05,9e-06,8e-06,3e-06,2e-05,1.3e-05,9e-06,9e-06,7e-06,1.8e-05,8e-06,1.7e-05,8e-06,9e-06,1e-06,1.2e-05,3e-06,5e-06,1.7e-05,1.2e-05,7e-06,1.4e-05,6e-06,1.2e-05,1.1e-05,3e-06,1e-06,2.6e-05,1.4e-05,2.2e-05,5e-06,8e-06,2e-06,3e-06,1.7e-05,1.3e-05,2e-06,9e-06,5e-06,1.9e-05,1.1e-05,5e-06,7e-06,1.1e-05,5e-06,3.3e-05,1.3e-05,1.6e-05,2.6e-05,1.3e-05
1.2e-05,1.5e-05,1.3e-05,2.2e-05,2.6e-05,1e-05,1.8e-05,1.3e-05,6e-06,1.2e-05,8e-06,2.7e-05,1.8e-05,9e-06,2e-05,1.9e-05,6e-06,4e-06,3e-06,1.4e-05,3.7e-05,1.3e-05,2.9e-05,2.4e-05,1.6e-05,1.3e-05,1.5e-05,1.5e-05,1.2e-05,1.2e-05,1.6e-05,1.9e-05,2.1e-05,2.5e-05,5e-06,3e-06,1e-05,1.1e-05,4e-06,1.3e-05,1.4e-05,2.5e-05,2.3e-05,7e-06,5e-06,1.9e-05,2.4e-05,1.1e-05,9e-06,2e-05,2.3e-05,1.3e-05,2.6e-05,1.7e-05,3e-06,2.4e-05,2.4e-05,2.1e-05,1e-05,1.8e-05,2.2e-05,1.7e-05,1e-05,2e-06,5e-06,1.3e-05,9e-06,9e-06,1.5e-05,1.4e-05,9e-06,1.5e-05,4e-06,1.6e-05,1.5e-05,2.5e-05,2.2e-05,1.6e-05,1.7e-05,1e-05,1.1e-05,2e-06,1.7e-05,7e-06,2e-06,9e-06,1.6e-05,2.2e-05,1.5e-05,1.3e-05,4e-06,1.7e-05,7e-06,5e-06,1.2e-05,2e-06,6e-06,9e-06,1.9e-05,1.4e-05,1.6e-05,1.1e-05,1e-05,1e-06,4e-06,2e-05,2.5e-05,9e-06,1.9e-05,1e-05,1.4e-05,3e-06,8e-06,2e-06,2.3e-05,1.5e-05,4.1e-05,1.2e-05,1.7e-05,2.4e-05,1.2e-05
2.9e-05,3.4e-05,2.8e-05,4.3e-05,2.2e-05,2.6e-05,3e-05,1.5e-05,1e-05,8e-06,1e-05,2e-05,1.4e-05,1.6e-05,1.8e-05,2.6e-05,1.7e-05,1.9e-05,2.6e-05,2.9e-05,3e-05,2.7e-05,3.4e-05,3.1e-05,2.2e-05,5.4e-05,2.9e-05,3.4e-05,3.2e-05,1.2e-05,6e-06,1.6e-05,1.6e-05,1.8e-05,3.8e-05,2.3e-05,4e-06,3e-06,2e-05,7e-06,2e-05,2.2e-05,3.2e-05,8e-06,1e-05,2e-05,5.3e-05,3.1e-05,4e-06,1.4e-05,2.4e-05,2.1e-05,1e-05,2.2e-05,2.8e-05,4e-05,3.3e-05,6e-06,1.1e-05,3e-05,3.4e-05,2.1e-05,2.7e-05,2.5e-05,9e-06,1.6e-05,1.5e-05,7e-06,1e-05,1.7e-05,4e-06,3e-05,1.1e-05,1e-05,1.6e-05,2.1e-05,3.2e-05,1.5e-05,1.4e-05,4e-06,2.3e-05,1.5e-05,3e-05,3.3e-05,2.2e-05,2.3e-05,1.7e-05,1.7e-05,8e-06,5e-06,2e-05,2.8e-05,9e-06,1e-05,1.6e-05,2.9e-05,2e-05,2.4e-05,3.9e-05,2.1e-05,2.3e-05,2.5e-05,2.5e-05,7e-06,4e-06,1.5e-05,2.3e-05,1.3e-05,2.9e-05,9e-06,1.4e-05,1.2e-05,1e-05,4e-06,2.5e-05,2.6e-05,1.8e-05,1.6e-05,1.1e-05,1.8e-05,9e-06
3.1e-05,1.1e-05,6e-06,2.3e-05,2.1e-05,2.7e-05,1.9e-05,1e-05,1.7e-05,1.4e-05,1.5e-05,6e-06,3.2e-05,2.8e-05,2e-06,9e-06,2.3e-05,2.2e-05,1.5e-05,2.5e-05,7e-06,6e-06,1.6e-05,2.5e-05,1.1e-05,4.6e-05,3.8e-05,3.2e-05,2.4e-05,8e-06,6e-06,2.5e-05,1.2e-05,3.8e-05,3e-05,1e-06,1.3e-05,2.5e-05,2.2e-05,3e-05,1.8e-05,8e-06,1.1e-05,3.3e-05,3.3e-05,3.2e-05,1.1e-05,2e-05,2.1e-05,1.3e-05,2.2e-05,3.5e-05,4e-05,3.2e-05,1.7e-05,1.9e-05,1.4e-05,1.5e-05,5e-06,1.6e-05,3.9e-05,2.2e-05,2.5e-05,2.1e-05,8e-06,1.5e-05,3.1e-05,2.1e-05,8e-06,8e-06,2.2e-05,4.1e-05,3.4e-05,1.9e-05,2.7e-05,1.6e-05,1.3e-05,9e-06,1.7e-05,2.1e-05,2e-05,1.4e-05,1.7e-05,2.3e-05,1.6e-05,1e-05,6e-06,2e-05,2.7e-05,1.8e-05,1.3e-05,1.9e-05,2.1e-05,1.7e-05,9e-06,3.2e-05,2.3e-05,1.7e-05,1e-05,2e-05,1e-05,1.2e-05,1.1e-05,2.5e-05,8e-06,1.5e-05,7e-06,8e-06,1.9e-05,1.4e-05,1.6e-05,5e-06,1.8e-05,1.1e-05,2.1e-05,1.8e-05,1.4e-05,1.9e-05,1.1e-05,3.3e-05,1.6e-05
6e-06,1.5e-05,1.4e-05,1.7e-05,2e-06,9e-06,9e-06,8e-06,1.5e-05,1.6e-05,3e-06,2e-05,4.1e-05,9e-06,1.1e-05,1.4e-05,1.7e-05,3e-05,9e-06,1.3e-05,9e-06,5e-06,3.7e-05,8e-06,3e-05,1.8e-05,7e-06,8e-06,1.2e-05,1.6e-05,1.4e-05,2.1e-05,1.2e-05,2.2e-05,1.6e-05,1.8e-05,6e-06,1.5e-05,1.5e-05,1.9e-05,2.6e-05,8e-06,1e-06,1.8e-05,7e-06,2.6e-05,3.5e-05,7e-06,1.1e-05,1.9e-05,3.2e-05,3.6e-05,1e-06,2.6e-05,9e-06,1.6e-05,1.9e-05,1.4e-05,1.7e-05,6e-06,2e-05,1.1e-05,8e-06,6e-06,8e-06,1.1e-05,1.4e-05,1.4e-05,1.5e-05,1.5e-05,2.3e-05,1.6e-05,1.3e-05,9e-06,1.7e-05,1.6e-05,1.1e-05,7e-06,1.4e-05,1.1e-05,2.4e-05,1e-05,2.2e-05,1.3e-05,1.7e-05,2.4e-05,2.1e-05,2.1e-05,1e-05,1e-06,5e-06,1.4e-05,8e-06,7e-06,1.2e-05,9e-06,9e-06,1.3e-05,2.1e-05,1.2e-05,1.6e-05,1.5e-05,9e-06,1.8e-05,1.7e-05,1.3e-05,1.6e-05,0,2.1e-05,7e-06,1.5e-05,4e-06,1.4e-05,1.3e-05,6e-06,1e-05,3.3e-05,1.2e-05,7e-06,2.8e-05,3.3e-05
7e-06,6e-06,1.6e-05,2.6e-05,1.8e-05,1e-05,5e-06,5e-06,2e-06,1e-05,9e-06,2.3e-05,6e-06,8e-06,1.1e-05,1.5e-05,7e-06,1.1e-05,3e-06,1.1e-05,1.7e-05,7e-06,3e-05,8e-06,2.5e-05,1e-05,1.5e-05,1.7e-05,7e-06,7e-06,2e-06,6e-06,1.6e-05,9e-06,9e-06,1.9e-05,1.2e-05,1.3e-05,4e-06,1.9e-05,1.9e-05,1.7e-05,1.3e-05,2.3e-05,1e-05,2.3e-05,1.3e-05,4e-06,9e-06,1.5e-05,1.3e-05,2.5e-05,2e-05,1.6e-05,1.1e-05,6e-06,1.4e-05,1.1e-05,1.7e-05,6e-06,1.5e-05,6e-06,1e-05,1.4e-05,4e-06,1.1e-05,7e-06,1.2e-05,1.8e-05,2e-06,2.1e-05,1.7e-05,1.3e-05,1e-05,1e-05,6e-06,4e-06,1.9e-05,6e-06,1.1e-05,2.3e-05,1.1e-05,9e-06,1.1e-05,1.1e-05,8e-06,7e-06,6e-06,1.1e-05,1.6e-05,3e-06,9e-06,1.3e-05,7e-06,9e-06,9e-06,1.3e-05,1.9e-05,1.4e-05,9e-06,1.1e-05,1.8e-05,9e-06,4e-06,3e-06,1.1e-05,1.1e-05,1e-06,2.1e-05,9e-06,1.1e-05,6e-06,9e-06,6e-06,3e-06,1.2e-05,1.8e-05,7e-06,8e-06,1.3e-05,2.2e-05
4e-06,4e-06,1e-05,1.4e-05,7e-06,1e-05,1e-05,1e-05,1e-05,5e-06,2e-06,2.1e-05,2e-05,1.3e-05,6e-06,1e-05,1e-05,7e-06,1e-05,1.7e-05,1.1e-05,1e-05,1.4e-05,1.7e-05,2.6e-05,1e-05,1.4e-05,5e-06,7e-06,3e-06,5e-06,2e-05,1.1e-05,0,1.9e-05,1e-05,5e-06,1.3e-05,2e-06,1.2e-05,1.5e-05,1e-05,1.1e-05,1.4e-05,1e-06,1.9e-05,1.8e-05,1.1e-05,3e-06,1e-05,8e-06,1e-05,1.9e-05,1.5e-05,1.2e-05,7e-06,2e-05,2e-06,5e-06,7e-06,1.4e-05,2e-06,1e-05,1.3e-05,8e-06,5e-06,4e-06,9e-06,1.2e-05,8e-06,1.1e-05,7e-06,1.2e-05,5e-06,7e-06,6e-06,1e-06,1.1e-05,4e-06,8e-06,2.1e-05,3e-06,3e-06,1e-05,1.2e-05,1.5e-05,3e-06,9e-06,7e-06,5e-06,6e-06,8e-06,9e-06,4e-06,7e-06,9e-06,1.4e-05,5e-06,1.6e-05,3e-06,1.4e-05,9e-06,1.1e-05,8e-06,7e-06,1.1e-05,8e-06,2e-06,1.7e-05,8e-06,7e-06,7e-06,4e-06,8e-06,7e-06,1.7e-05,2e-05,1.1e-05,1.2e-05,2.1e-05,2e-05
2e-06,2e-06,6e-06,6e-06,4e-06,8e-06,5e-06,8e-06,6e-06,6e-06,4e-06,2e-05,1.7e-05,6e-06,8e-06,1.1e-05,1.1e-05,8e-06,0,1e-05,6e-06,7e-06,2.8e-05,1.1e-05,2.6e-05,1e-06,1.3e-05,1e-05,3e-06,4e-06,3e-06,2.2e-05,5e-06,4e-06,1.8e-05,6e-06,9e-06,6e-06,1e-06,9e-06,1.7e-05,6e-06,1.2e-05,6e-06,3e-06,1.8e-05,1.8e-05,1.2e-05,1e-06,3e-06,1e-06,9e-06,1.3e-05,2e-05,1.2e-05,1.7e-05,1.2e-05,4e-06,5e-06,2e-06,5e-06,7e-06,9e-06,8e-06,6e-06,5e-06,9e-06,1.6e-05,4e-06,7e-06,9e-06,7e-06,3e-06,2e-06,7e-06,9e-06,4e-06,1e-05,4e-06,4e-06,1.7e-05,6e-06,5e-06,6e-06,8e-06,5e-06,3e-06,4e-06,6e-06,1.3e-05,4e-06,2e-06,9e-06,9e-06,4e-06,1e-05,3e-06,1e-05,1.8e-05,5e-06,1.2e-05,9e-06,1.2e-05,4e-06,5e-06,5e-06,1e-05,6e-06,1.4e-05,8e-06,7e-06,3e-06,5e-06,4e-06,3e-06,1e-05,2.2e-05,6e-06,1e-05,2.4e-05,1.4e-05
3e-06,3e-06,8e-06,5e-06,6e-06,2e-06,4e-06,7e-06,5e-06,2e-06,5e-06,1.6e-05,1.7e-05,4e-06,1e-05,1.4e-05,1.3e-05,1.3e-05,5e-06,2e-06,2e-06,7e-06,2.3e-05,8e-06,2.2e-05,3e-06,6e-06,3e-06,8e-06,2e-06,4e-06,1.5e-05,1.2e-05,3e-06,1.5e-05,1e-06,8e-06,1.5e-05,5e-06,1.3e-05,1.4e-05,6e-06,1.5e-05,1.1e-05,7e-06,1.3e-05,1.4e-05,4e-06,5e-06,2e-06,3e-06,1e-05,1.6e-05,1.7e-05,7e-06,1.2e-05,1e-05,4e-06,5e-06,7e-06,1.2e-05,1e-06,7e-06,6e-06,6e-06,5e-06,5e-06,1.6e-05,8e-06,6e-06,1e-05,8e-06,3e-06,4e-06,4e-06,1e-05,3e-06,1.2e-05,2e-06,6e-06,1.9e-05,8e-06,1.1e-05,6e-06,1e-06,8e-06,4e-06,4e-06,4e-06,7e-06,2e-06,4e-06,8e-06,4e-06,3e-06,6e-06,8e-06,7e-06,1.6e-05,5e-06,1.1e-05,8e-06,1e-05,1e-06,3e-06,8e-06,7e-06,6e-06,1.1e-05,6e-06,9e-06,2e-06,4e-06,6e-06,4e-06,7e-06,2.2e-05,7e-06,1e-05,2.2e-05,1.4e-05
1e-06,5e-06,7e-06,4e-06,4e-06,5e-06,3e-06,5e-06,2e-06,0,3e-06,1.2e-05,1.1e-05,7e-06,9e-06,1.4e-05,1.1e-05,9e-06,6e-06,2e-06,4e-06,8e-06,1.9e-05,1.4e-05,2e-05,1e-06,6e-06,2e-06,5e-06,3e-06,4e-06,1.6e-05,1e-05,2e-06,1.5e-05,5e-06,1e-05,1.1e-05,2e-06,1.1e-05,1.1e-05,6e-06,1.6e-05,8e-06,5e-06,1.5e-05,1.8e-05,4e-06,2e-06,7e-06,2e-06,1.1e-05,1.4e-05,1.4e-05,7e-06,1.3e-05,8e-06,7e-06,2e-06,3e-06,8e-06,1e-06,5e-06,9e-06,7e-06,4e-06,4e-06,1.7e-05,4e-06,4e-06,9e-06,7e-06,2e-06,2e-06,6e-06,7e-06,4e-06,1.1e-05,1e-06,5e-06,1.6e-05,3e-06,2e-06,6e-06,1e-06,9e-06,2e-06,6e-06,2e-06,9e-06,2e-06,3e-06,3e-06,5e-06,4e-06,2e-06,2e-06,1e-05,1.7e-05,2e-06,1.2e-05,7e-06,1.2e-05,2e-06,4e-06,7e-06,7e-06,1e-06,1.1e-05,3e-06,1e-05,2e-06,3e-06,5e-06,2e-06,8e-06,2e-05,5e-06,7e-06,2.2e-05,1.7e-05
2e-06,1e-06,7e-06,4e-06,3e-06,5e-06,1e-06,2e-06,3e-06,2e-06,2e-06,1.1e-05,1.4e-05,6e-06,6e-06,1.2e-05,1.3e-05,1.1e-05,3e-06,1e-06,4e-06,7e-06,1.9e-05,1.2e-05,1.7e-05,3e-06,5e-06,2e-06,6e-06,4e-06,3e-06,1.4e-05,9e-06,2e-06,1.7e-05,5e-06,8e-06,1.3e-05,2e-06,1.1e-05,1.1e-05,5e-06,1.2e-05,8e-06,2e-06,1.2e-05,1.6e-05,5e-06,2e-06,5e-06,1e-06,1e-05,1.1e-05,1.5e-05,1e-05,1.4e-05,1.3e-05,7e-06,3e-06,1e-06,8e-06,2e-06,5e-06,6e-06,4e-06,0,4e-06,1.1e-05,6e-06,4e-06,1e-05,7e-06,1e-06,3e-06,5e-06,8e-06,4e-06,9e-06,1e-06,4e-06,1.3e-05,2e-06,4e-06,4e-06,3e-06,7e-06,2e-06,3e-06,3e-06,7e-06,2e-06,3e-06,6e-06,5e-06,3e-06,4e-06,3e-06,8e-06,1.7e-05,4e-06,1.3e-05,1e-05,9e-06,2e-06,5e-06,6e-06,7e-06,2e-06,1e-05,4e-06,9e-06,3e-06,2e-06,4e-06,4e-06,6e-06,2e-05,3e-06,1.1e-05,2e-05,1.4e-05
1e-06,2e-06,7e-06,3e-06,4e-06,4e-06,2e-06,2e-06,2e-06,1e-06,2e-06,1.1e-05,1.3e-05,7e-06,7e-06,1.3e-05,1.1e-05,1.2e-05,4e-06,1e-06,5e-06,7e-06,2e-05,1.3e-05,1.6e-05,1e-06,5e-06,1e-06,4e-06,1e-06,3e-06,1.3e-05,8e-06,2e-06,1.6e-05,4e-06,7e-06,1.2e-05,1e-06,9e-06,1.1e-05,4e-06,1.1e-05,7e-06,3e-06,1.3e-05,1.6e-05,6e-06,2e-06,4e-06,1e-06,1.2e-05,1.1e-05,1.4e-05,7e-06,1.2e-05,1.2e-05,4e-06,2e-06,1e-06,8e-06,1e-06,6e-06,7e-06,4e-06,0,5e-06,1.1e-05,6e-06,4e-06,1e-05,8e-06,3e-06,3e-06,6e-06,7e-06,2e-06,9e-06,2e-06,6e-06,1.3e-05,2e-06,2e-06,5e-06,1e-06,7e-06,1e-06,3e-06,1e-06,7e-06,3e-06,3e-06,5e-06,4e-06,2e-06,0,2e-06,6e-06,1.6e-05,5e-06,1.4e-05,8e-06,8e-06,1e-06,4e-06,7e-06,8e-06,1e-06,1.1e-05,4e-06,9e-06,3e-06,0,2e-06,1e-06,7e-06,2e-05,5e-06,1e-05,2.1e-05,1.4e-05
