-0.000707,-0.002853,-0.007322,-0.010716,-0.019928,-0.017981,-0.009818,-0.014765,-0.022661,-0.014993,-0.012502,-0.011173,-0.014716,-0.02101,-0.024751,-0.035253,-0.039576,-0.027171,-0.020986,-0.027054,-0.036012,-0.041709,-0.02723,-0.031558,-0.039247,-0.03803,-0.030559,-0.02033
-0.000322,-0.00276,-0.007948,-0.004428,-0.003283,-0.008886,-0.000782,-0.003109,-0.012086,-0.010164,-0.006526,-0.005194,-0.004826,-0.003371,0.004213,0.012447,0.016459,0.001035,-0.004663,-0.016623,-0.023451,-0.012284,-0.016131,-0.016001,-0.01189,-0.015225,-0.012717,-0.009366
-0.000262,-0.000472,-0.001606,-0.002348,-0.004389,-0.006135,-0.007056,-0.005661,-0.008643,-0.009376,-0.004541,-0.002986,-0.01026,-0.010154,-0.008848,-0.006717,-0.001809,-0.00448,-0.004564,-0.007587,-0.00433,0.001499,-0.004165,-0.002354,0.0013,0.001388,0.000913,-0.002428
6.3e-05,0.002191,0.006209,0.003616,0.003671,0.004533,-0.006614,-0.003419,0.001526,-0.002749,0.000835,-0.001953,-0.011605,-0.012554,-0.020853,-0.030501,-0.021175,-0.009274,-0.006756,0.000133,0.012884,0.001887,-0.004347,-0.008955,-0.00454,0.004261,0.006133,-0.002043
0.000599,0.002425,0.007445,0.010791,0.019388,0.016025,0.00813,0.010922,0.017866,0.011593,0.011179,0.005557,0.008961,0.013261,0.013549,0.018221,0.027935,0.016367,0.009087,0.016564,0.027187,0.020574,-0.001006,-0.006367,0.009536,0.015695,0.012194,0.005362
-7.8e-05,-0.00123,-0.002237,-0.003462,-0.007758,-0.006421,-2e-05,-0.002122,-0.00607,-0.000538,-0.000918,-0.000258,0.006139,0.004704,0.007971,0.012261,0.006594,-0.000295,-0.001161,-0.003863,-0.005383,-0.00747,-0.016599,-0.019155,-0.011182,-0.011805,-0.012982,-0.006104
-0.000377,-0.002794,-0.008269,-0.011621,-0.019685,-0.014995,-0.004922,-0.00982,-0.019795,-0.009641,-0.012374,-0.007827,-0.004605,-0.009588,-0.013457,-0.024019,-0.03447,-0.020399,-0.014703,-0.026566,-0.0331,-0.036833,-0.01804,-0.020815,-0.032837,-0.037599,-0.026807,-0.015053
0.000347,-0.000134,-0.002486,0.001762,0.008711,0.006414,0.009111,0.008064,0.008309,0.006512,-0.002496,-0.000915,0.007219,0.009949,0.011098,0.013627,0.010098,0.005893,0.004111,-0.000629,-0.003552,0.003314,0.014471,0.015078,0.00923,0.000657,0.005097,0.003664
0.000115,0.001704,0.004133,0.005069,0.008048,0.006864,0.004023,0.007021,0.0163,0.009487,0.003201,0.00493,0.00718,0.008076,0.014374,0.028983,0.025129,0.014705,0.014691,0.024017,0.023124,0.030818,0.024577,0.030772,0.038062,0.03677,0.024791,0.014517
-0.000377,0.001451,0.005286,0.000823,-0.003155,0.000185,-0.005858,-0.002953,0.005194,9.3e-05,0.001419,0.002635,-0.005906,-0.010595,-0.011948,-0.013904,-0.014875,-0.001584,0.002276,0.013977,0.011829,0.001335,0.001061,0.004194,0.004016,0.013009,0.00746,0.002539
7.3e-05,0.000288,0.00202,0.003046,0.005578,0.00404,0.00114,0.001394,0.002718,0.000197,0.003985,0.000941,-0.001183,0.001525,-0.002293,-0.008755,-0.003387,0.002178,-0.002043,2.9e-05,-0.00142,-0.007918,-0.004149,-0.003056,-0.011873,-0.014053,-0.007851,-0.002629
0.000123,-0.001659,-0.004484,-0.0035,-0.005502,-0.006818,-0.002625,-0.005496,-0.013717,-0.006541,-0.000264,-0.002139,0.000903,0.008074,0.008437,0.009916,0.013099,0.001269,-0.001853,-0.011195,-0.009453,0.004542,0.006619,0.013082,0.003134,-0.011174,-0.009671,-0.000114
-0.000115,-0.001591,-0.005878,-0.007469,-0.011355,-0.009879,-0.008892,-0.011616,-0.020281,-0.013084,-0.006782,-0.004757,-0.008744,-0.008354,-0.010581,-0.020753,-0.018372,-0.013099,-0.009275,-0.017726,-0.012707,-0.007174,0.003455,0.007499,-0.002452,-0.00463,-0.004789,-0.003115
2e-04,0.000883,0.000939,0.004203,0.011188,0.005897,0.00175,0.003903,0.00615,-6.5e-05,-0.000927,0.000381,-0.001739,-0.006011,-0.008187,-0.015703,-0.012357,-0.00511,-0.00698,-0.002541,0.00256,-0.008384,-0.003511,-0.010074,-0.003586,0.007163,0.009013,-0.001253
2.5e-05,0.001602,0.005279,0.006351,0.008307,0.004499,0.004507,0.009299,0.014704,0.008257,0.005921,0.005803,0.00776,0.004654,0.008266,0.02448,0.020464,0.007632,0.004712,0.014064,0.015136,0.0134,-0.003754,-0.011957,0.012155,0.022083,0.013916,0.003842
-0.000341,0.000239,0.002703,-0.00176,-0.008686,-0.002264,-0.000213,0.001213,0.000421,0.002322,0.004184,0.003333,-0.000297,-0.001385,0.000229,0.008695,0.003023,0.001731,0.005008,0.005795,0.00214,0.007921,-0.006301,-0.007441,-0.00032,0.002445,-0.003201,0.000237
7.5e-05,-0.000887,-0.001531,-0.001121,-0.00087,0.00292,0.004636,0.001298,-0.001302,0.00231,0.001735,-4e-04,-0.001703,-0.000119,-0.001909,-0.011726,-0.011017,0.000215,-0.001255,-0.01017,-0.014193,-0.012394,-0.007197,-0.006866,-0.023194,-0.031519,-0.017752,-0.006585
0.000202,-0.001353,-0.004192,-0.001776,-0.000285,-0.000917,0.00293,-0.001678,-0.003641,0.002608,-0.000832,-0.002232,0.004666,0.007942,0.010619,0.010645,0.00895,0.002832,-1e-06,-0.009689,-0.008919,-0.003088,-0.001011,-0.004067,-0.009204,-0.017063,-0.007052,-0.004036
-0.000147,-0.000352,-0.002482,-0.004067,-0.005637,-0.00304,-0.004247,-0.006156,-0.005277,-0.002633,-0.004256,-0.00405,-0.002101,-0.001881,0.000913,0.002729,-0.000663,-0.005407,0.002289,0.003651,0.004268,0.00387,-0.000232,-0.004422,0.007662,0.018466,0.00959,0.001977
