-0.01159,-0.010592,-0.010415,-0.010076,-0.006693,-0.011231,-0.010897,-0.013415,-0.011948,-0.005715,-0.006268,-0.004873,-0.008827,-0.008826,-0.011123,-0.008448,-0.005293,-0.006652,-0.008613,-0.00934,-0.006289,-0.006626,-0.006802,-0.005476,-0.00412,-0.005702,-0.00765,-0.008037
-0.001593,-0.001349,-0.002565,0.000104,-0.000488,-0.002235,-0.006049,-0.002954,0.000481,0.001277,0.003209,0.002633,0.006135,0.004029,-0.000822,-0.000442,0.000271,0.001416,0.003372,-0.000757,-0.002389,0.003138,0.001063,-0.002248,-0.000932,-1.1e-05,0.000294,0.001615
-0.000668,-0.00039,-0.000496,-0.000882,-0.003741,-0.002213,-0.000444,-0.000529,-0.000748,-0.001939,-0.00101,-0.001177,-0.001831,-0.002131,-0.000808,-0.001351,-0.001682,-0.001629,-0.000915,-0.000876,-0.000664,-0.001624,-0.001835,-0.000811,-0.000299,-0.000804,-0.000556,0.000216
-0.002975,-0.001027,0.000628,-0.002712,-0.005573,-0.002776,0.00354,-0.00044,-0.004296,-0.00556,-0.005878,-0.004721,-0.009168,-0.008415,-0.002828,-0.003181,-0.002834,-0.002973,-0.005011,-0.001313,0.000215,-0.006496,-0.005006,-0.000465,-0.000898,-0.002457,-0.0034,-0.004028
0.003927,0.006343,0.007052,0.005832,0.003131,0.006833,0.006619,0.008183,0.006554,0.002097,0.003946,0.003292,0.006093,0.004682,0.00454,0.003576,0.003124,0.005817,0.006672,0.006719,0.003652,0.004133,0.003386,0.00198,0.000899,0.002789,0.003194,0.002413
-0.002354,-0.000488,-0.000792,-0.000622,-0.000303,-0.000444,-0.002838,-0.001599,0.000173,0.000897,0.001926,0.001348,0.00158,0.000227,-0.003089,-0.00122,-2e-05,0.000438,0.001171,-0.000434,-0.000758,0.001833,0.000341,-0.00119,-0.000868,0.000168,0.000459,0.000137
-0.007743,-0.008251,-0.008513,-0.00769,-0.005369,-0.010636,-0.009838,-0.013437,-0.010586,-0.003559,-0.006225,-0.004679,-0.009985,-0.009468,-0.009851,-0.005967,-0.003677,-0.006845,-0.009153,-0.009285,-0.005317,-0.006455,-0.005933,-0.003574,-0.002368,-0.004487,-0.005137,-0.00445
0.007534,0.003219,0.001944,0.004683,0.004886,0.003041,0.001083,0.002102,0.003862,0.004043,0.002975,0.002527,0.005327,0.005939,0.005744,0.005131,0.00311,0.002398,0.002925,0.001813,0.00117,0.003125,0.003905,0.002572,0.00175,0.001798,0.002834,0.004317
0.01009,0.006637,0.00559,0.006669,0.007459,0.010739,0.00879,0.012416,0.009916,0.004961,0.006593,0.004388,0.009163,0.010276,0.010653,0.006717,0.003203,0.004342,0.006315,0.006834,0.005082,0.006183,0.006912,0.004826,0.003148,0.004105,0.004987,0.005355
-0.004685,-0.003486,-0.002347,-0.003992,-0.000563,-0.000124,0.002342,0.001092,-0.003255,-0.003321,-0.003904,-0.003269,-0.006062,-0.004358,-0.002272,-0.003486,-0.002746,-0.002824,-0.004376,-0.001126,0.000536,-0.003751,-0.002185,-0.000177,-0.000524,-0.001693,-0.002984,-0.004546
-0.00335,-0.001097,-0.000165,-0.000373,0.000669,-0.001248,-0.00238,-0.002243,-0.001401,-0.001023,-0.001885,-0.000625,-0.00017,-0.000397,-0.001948,-0.001351,0.000218,0.000926,0.000801,0.000141,-0.001298,-0.000512,-0.000838,-0.001405,-0.000898,-0.000356,8.7e-05,-0.001524
0.002891,0.003046,0.002452,0.002672,0.000542,0.000731,-0.0032,-0.000948,0.003146,0.002297,0.00352,0.002883,0.006427,0.005632,0.003019,0.002773,0.002148,0.002306,0.004646,0.001218,-0.001067,0.003925,0.001792,-0.000731,0.000419,0.002165,0.004445,0.004458
-0.003878,-0.004239,-0.003685,-0.005264,-0.006803,-0.006788,-0.004197,-0.007212,-0.006642,-0.003432,-0.003722,-0.002942,-0.006129,-0.005705,-0.003097,-0.002515,-0.002352,-0.004323,-0.005707,-0.005321,-0.002529,-0.00445,-0.00477,-0.002691,-0.001532,-0.002614,-0.003401,-0.002478
-0.003426,-0.002747,-0.001666,-0.0023,-0.003812,-0.003008,0.001144,-0.001332,-0.002907,-0.001825,-0.00259,-0.001406,-0.00318,-0.004187,-0.002226,-0.001623,-0.001121,-0.000487,-0.002419,-0.001229,8.5e-05,-0.002761,-0.002259,-0.000577,-0.001239,-0.002423,-0.005124,-0.004252
0.002126,0.00413,0.003703,0.004323,0.002745,0.00614,0.006155,0.009365,0.008678,0.004184,0.00527,0.00368,0.00641,0.004535,0.002858,0.001828,0.001306,0.003971,0.005875,0.005606,0.003214,0.00529,0.004617,0.002784,0.001499,0.002429,0.001813,0.002433
-0.001124,0.000681,-9.9e-05,-0.000365,0.000331,0.000308,0.001167,0.001641,0.001198,0.00051,-0.000597,-0.001168,-0.003872,-0.003623,-0.002854,-0.002188,-0.001107,-0.00191,-0.001363,0.000317,0.000366,-0.000208,-0.000115,0.000461,0.000943,0.000942,0.00131,0.001289
0.001447,-0.000233,-0.001063,-0.000708,0.000154,-0.003912,-0.003809,-0.006541,-0.005347,-0.001923,-0.004024,-0.002411,-0.005385,-0.005019,-0.004184,-0.001385,-9.2e-05,-0.001858,-0.003216,-0.002529,-0.001831,-0.003263,-0.002743,-0.001518,-0.000425,-0.000667,-0.000463,-0.00113
0.007424,0.00294,0.002058,0.003519,0.003049,0.001859,-0.001527,-0.000671,0.000776,0.001381,0.003856,0.002838,0.005934,0.00563,0.003234,0.003465,0.001681,0.001994,0.002851,0.000473,-0.000212,0.002641,0.002253,0.00017,-4e-06,0.001352,0.002294,0.001734
-0.000338,-0.002552,-0.001645,-0.001151,0.000392,0.001645,0.001212,0.002087,-0.000433,-0.00078,0.0021,0.000199,0.000814,0.002098,0.002237,0.000668,-0.000873,-0.001282,-0.001463,-0.001589,0.000389,5.9e-05,0.001051,0.001013,0.000226,-0.000213,0.000246,0.000128
