-0.000178,-0.000141,-0.00012,-0.000136,-0.000248,-0.000349,-0.000148,-8.7e-05,-0.000133,-0.000301,-0.00017,-0.000119,-0.000143,-0.00018,-3.3e-05,-3.6e-05,-9e-05,-6.5e-05,-0.000133,-0.000213,-0.000163,-0.000212,-0.000171,-0.000284,-0.000301,-0.000256,-0.000243,-0.000187
-0.000205,-0.000228,-0.000275,-0.000219,-0.000416,-0.00048,-0.000239,-0.000161,-0.000166,-0.000325,-0.000224,-0.000204,-0.000185,-0.000259,-0.000189,-0.000182,-0.000223,-0.000169,-0.00023,-0.000369,-0.000309,-0.000225,-0.00019,-0.000413,-0.000405,-0.000302,-0.000272,-0.000246
-0.000182,-0.000194,-0.000195,-0.000125,-0.000243,-0.000192,-0.000196,-0.000199,-0.000127,-0.000122,-0.000183,-0.000214,-0.000146,-0.000166,-0.00025,-0.000245,-0.000228,-0.000198,-0.000283,-0.000301,-0.000295,-0.000121,-0.000128,-0.000264,-0.000213,-0.000219,-0.000139,-0.000192
4.2e-05,1.2e-05,5.6e-05,6.9e-05,0.000116,0.000267,9e-06,-7.9e-05,1.7e-05,0.000222,4.5e-05,-3.2e-05,1e-06,4.6e-05,-0.000113,-0.000142,-9e-05,-5.5e-05,-3.9e-05,6e-06,-8.9e-05,0.000112,9e-05,0.000147,0.000161,4.3e-05,0.000113,5.2e-05
0.000205,0.000133,0.000148,8.7e-05,0.000214,0.000337,0.000102,2e-06,3.6e-05,0.000226,0.000121,9.8e-05,6.3e-05,5.1e-05,-3.4e-05,-5.9e-05,-5.3e-05,0,0.000135,0.000105,-4.7e-05,9.1e-05,0.000151,0.000248,0.000211,0.000195,0.00017,0.000174
3.2e-05,2.2e-05,4e-06,-9.9e-05,-3.6e-05,-6e-05,-5.1e-05,-9.1e-05,-0.000144,-0.000218,-0.000147,-1.4e-05,-8.9e-05,-0.000209,-0.000197,-0.00015,-0.000182,-0.000136,-5.6e-05,-0.000169,-0.00019,-0.000156,-7.9e-05,-0.000182,-0.000169,-2.7e-05,-8.6e-05,-4.1e-05
-8.6e-05,-2.6e-05,-0.000103,-0.00013,-0.000149,-0.000294,-9e-05,-5.1e-05,-0.000165,-0.000323,-0.000178,-3.7e-05,-0.000109,-0.00023,-0.000237,-0.000125,-0.000114,-9.2e-05,-8.1e-05,-0.000199,-7.7e-05,-0.000152,-0.000166,-0.000365,-0.000289,-1e-04,-0.000148,-0.000118
-2.3e-05,4.2e-05,-7.1e-05,7e-06,-1e-06,-0.000111,4.5e-05,0.000102,5.2e-05,2.2e-05,4.5e-05,1.9e-05,3.2e-05,2.9e-05,-5.7e-05,6.2e-05,0.000101,5.8e-05,5.9e-05,9.2e-05,0.000215,8.5e-05,-3.6e-05,-0.000128,-5.1e-05,4.9e-05,6.8e-05,3e-05
-3.4e-05,1.8e-05,-7e-06,8e-05,0.000144,0.000181,0.000119,0.000132,0.000184,0.000243,0.000133,-4e-06,7.6e-05,0.000165,7.3e-05,0.00016,0.000173,6.2e-05,3.5e-05,0.000237,0.000273,0.000167,2.9e-05,0.000133,0.000163,2.4e-05,0.000109,3.8e-05
-1.2e-05,-1.2e-05,4.3e-05,5.2e-05,0.000126,0.00024,7.2e-05,6.8e-05,0.000143,0.000219,0.000144,0,5.1e-05,0.000147,0.000179,0.000182,0.000157,9e-05,6.6e-05,0.000178,7.8e-05,5.5e-05,7.7e-05,0.000319,0.000252,1e-06,-9e-06,7e-06
6.7e-05,-1.2e-05,1.5e-05,-5.8e-05,-6.8e-05,-8e-06,-7.1e-05,-4.8e-05,1.5e-05,-2.3e-05,4.9e-05,6e-06,2.5e-05,6.3e-05,0.000206,0.000102,0.000103,9.2e-05,3.3e-05,-3.7e-05,-0.000123,-8.7e-05,7.2e-05,0.000218,0.000104,3.5e-05,-6.2e-05,2e-06
1.3e-05,-5.4e-05,-4.8e-05,-0.000128,-0.000232,-0.000256,-0.00019,-0.000135,-9.8e-05,-0.000254,-0.000116,-7e-06,1.6e-05,-7e-06,8.8e-05,-2.8e-05,6e-06,1.9e-05,-0.000132,-0.00023,-0.000154,-0.000122,-3.5e-05,-5.6e-05,-0.000111,1e-06,-8.9e-05,-6.6e-05
-2.6e-05,-4.1e-05,-7.2e-05,-4.3e-05,-0.000129,-0.000172,-0.000117,-8.8e-05,-5.8e-05,-8.5e-05,-6e-05,2.9e-05,3.2e-05,5.7e-05,3.8e-05,-6.3e-05,-3.5e-05,-3e-06,-6.8e-05,-9.1e-05,2.6e-05,2.4e-05,-3.4e-05,-7.1e-05,-8.1e-05,3.4e-05,-1.3e-05,-2.8e-05
3.5e-05,3e-06,-5.8e-05,7.3e-05,9.5e-05,0.000117,5.4e-05,5e-06,4.5e-05,0.000161,4.2e-05,1.7e-05,-7e-06,9.3e-05,5.9e-05,-5.9e-05,-4.6e-05,-3.2e-05,7.2e-05,0.00017,0.000181,8.6e-05,-3.4e-05,-2e-06,3.2e-05,4.8e-05,0.000117,6e-05
-3.7e-05,-5.6e-05,-1.9e-05,8.7e-05,0.000139,0.000216,9e-05,2.4e-05,2.9e-05,9.1e-05,-2.7e-05,-5.9e-05,-9.1e-05,-6.4e-05,-3.5e-05,-7.5e-05,-0.000105,-0.000108,2e-05,0.000161,6.1e-05,-5.5e-05,-0.000103,-7.8e-05,1.5e-05,-0.000114,2e-05,-2.7e-05
-6.2e-05,-3.3e-05,5.4e-05,7.7e-05,6.3e-05,6e-05,3.5e-05,3.2e-05,-3.1e-05,-4.8e-05,-5.3e-05,-3.4e-05,-8.7e-05,-0.000166,-9.3e-05,-5.9e-05,-8.7e-05,-8e-05,8e-06,2.9e-05,-9.1e-05,-9.9e-05,-1e-05,-9.1e-05,-3.9e-05,-0.000158,-0.000105,-5.9e-05
3e-06,7e-05,9.3e-05,4.6e-05,-2.3e-05,-0.000156,-1.6e-05,2.4e-05,-0.000103,-0.000181,-9.1e-05,1.4e-05,-6e-06,-0.000119,-0.000102,-5.7e-05,-3.9e-05,-3.5e-05,-3.4e-05,-0.000128,-0.000113,-4.4e-05,5.7e-05,-0.000106,-8.9e-05,1.1e-05,-3.7e-05,-8e-06
-6e-06,5.8e-05,4.7e-05,-1e-05,-6e-05,-0.000189,-7e-06,3e-05,-8.6e-05,-0.000159,-0.000122,-1.2e-05,4.7e-05,-4.2e-05,-0.000162,-5.1e-05,-4.3e-05,-6.4e-05,-0.000104,-0.00018,-0.000102,6e-06,-1.3e-05,-0.000114,-8.7e-05,0.000105,3.3e-05,-2.6e-05
1e-05,1.9e-05,-3e-05,-2.9e-05,2.2e-05,3.5e-05,9e-05,7.1e-05,4.4e-05,9.5e-05,6e-06,-1.5e-05,5.1e-05,6.4e-05,-0.000106,2e-06,-2.1e-05,-6.8e-05,-9e-06,-1.7e-05,-4.7e-05,6.3e-05,-2.1e-05,5.8e-05,5.5e-05,0.000112,2.5e-05,-3.2e-05
