2e-06,7e-06,1e-06,1.4e-05,1e-05,3e-06,1e-05,1.7e-05,0,9.1e-05,0.000353,5.1e-05,1.3e-05,5e-05,0.000171,2e-06,4.2e-05,0.000167,3.4e-05,8.1e-05,6.2e-05,0.000209,0.000131,3.8e-05,4.9e-05,0.001421,0.00027,0.00033,0.000336,0.000756,0.000374,0.00034,0.000132,0.000793,0.000235,0.00014,0.000105,0.00012,3e-05,0.000523,8.5e-05,0.000542,0.000331,0.000353,0.000196,0.000162,0.000565,0.000218,0.000295,0.000712,0.000354,0.000228,9.9e-05,0.000217,3.2e-05,3.6e-05,1.8e-05,0.000191,0.000303,3.4e-05,0.000165,9.6e-05,7.6e-05,1.2e-05,0.000147,5.6e-05,3.8e-05,5.1e-05,6e-06,6e-06,0.000135,8.9e-05,4.3e-05,3.8e-05,2.1e-05,5.8e-05,2e-06,0.000193,0.000117,1.9e-05,1.3e-05,9e-06,3e-06,3.9e-05,0.000143,4.5e-05,7e-05,3.3e-05,1e-06,1.4e-05,1.8e-05,1e-05,2e-05,1.1e-05,5e-06,4e-06,5e-06,3e-06,2.2e-05,1.4e-05,1.8e-05,3.1e-05,2e-06,1e-06,2.8e-05,3.2e-05,1.7e-05,2.6e-05,1e-06,3e-05,1.2e-05,1.8e-05,3e-05,1e-05,7e-06,1.7e-05,5.3e-05,3.2e-05,4.5e-05,3.6e-05,2.8e-05
4.4e-05,7.4e-05,4e-05,5.2e-05,6.1e-05,3.4e-05,4e-05,6.7e-05,8.4e-05,0.000277,0.000873,0.000212,0.000193,0.000148,0.00027,5.2e-05,0.000166,0.000309,9.2e-05,0.000272,0.000172,0.000241,0.000559,0.000487,0.000268,0.003618,0.001948,0.000939,0.001241,0.000662,0.001111,2e-04,0.001167,0.001195,0.001651,0.000799,0.000788,0.001473,0.000701,0.000726,0.001154,0.00174,0.000476,0.000951,0.000628,0.001018,0.000868,0.001072,0.001035,0.001692,0.000687,0.000468,0.000486,0.000752,0.000321,0.000391,0.000295,0.000743,0.000411,0.000263,0.000427,0.000435,0.000158,0.000173,0.000146,0.000276,0.000146,0.000195,0.000123,5.2e-05,0.000273,8.3e-05,0.000411,0.000238,0.000102,0.00013,0.000107,0.000442,0.000482,0.000335,0.000181,5.7e-05,1.8e-05,7.5e-05,0.000225,0.000213,2.9e-05,0.000142,0.000115,4.8e-05,3.6e-05,3.9e-05,3.6e-05,6.7e-05,5.8e-05,3.8e-05,3.8e-05,4.4e-05,4.7e-05,1.7e-05,4.6e-05,8.9e-05,5.8e-05,5.3e-05,7.3e-05,0.000124,9.4e-05,0.000108,0.000102,0.000102,9.4e-05,9.5e-05,0.00011,0.000121,8.4e-05,9.8e-05,0.000152,0.000197,0.000135,0.000166,0.000165
4.8e-05,4.3e-05,5.7e-05,2.1e-05,3.6e-05,3.1e-05,5.7e-05,4.3e-05,4.9e-05,0.000229,0.001136,0.000385,0.000245,0.000237,0.00016,0.000281,0.000136,0.000199,0.000261,0.000249,0.000294,0.000107,0.000368,0.000162,8.6e-05,0.004862,0.002703,0.000948,0.001905,0.000703,0.000541,0.00132,0.000892,0.00011,0.001906,0.000962,0.001414,0.000526,0.001168,0.00079,0.001658,0.002058,0.002083,0.001479,0.000707,0.001078,0.001069,0.00158,0.000917,0.001807,0.000455,1.7e-05,0.000491,0.000449,0.000358,0.000557,0.00015,0.000515,0.000705,0.000336,0.000416,0.000102,0.000202,0.000366,0.000222,0.00028,9.4e-05,0.000131,0.000226,0.000102,0.000232,0.000466,0.000706,0.000241,3.7e-05,0.000156,0.000256,0.000274,0.000426,0.000156,0.000105,4e-05,8.1e-05,0.000194,5e-06,9.1e-05,0.000116,0.000191,7.2e-05,8e-06,3.6e-05,7.1e-05,2.6e-05,9.6e-05,9.2e-05,4.8e-05,7.4e-05,2.9e-05,4.9e-05,2e-05,4.6e-05,4.1e-05,8.9e-05,2.8e-05,3.9e-05,6e-05,1.7e-05,6e-05,7.7e-05,1.8e-05,4.3e-05,4.5e-05,2.8e-05,6e-05,9e-06,7.3e-05,2.9e-05,9.6e-05,7.5e-05,5.7e-05,4.3e-05
3.4e-05,4.5e-05,1.9e-05,2.4e-05,4.7e-05,4.6e-05,2.1e-05,6.8e-05,4e-05,0.00022,0.000805,0.00028,0.000197,0.00015,0.000405,0.000481,0.000496,0.000855,0.000553,0.000274,0.000474,0.000135,0.000261,0.000162,5.8e-05,0.005057,0.003803,0.002357,0.002274,0.001297,0.000956,0.001468,0.002735,0.000845,0.000248,6e-04,0.002043,0.00125,0.000578,0.001432,0.000558,0.002732,0.002236,0.001822,0.000933,0.001183,0.000656,0.000537,0.001014,0.002505,0.001451,0.000395,0.000855,0.00049,0.00062,0.000873,0.000643,0.000293,0.00068,0.000585,9.7e-05,0.00071,0.000393,0.000749,0.000458,4e-04,0.000377,0.000217,0.000266,0.000147,0.000105,0.000785,0.000608,0.000416,6.3e-05,7.5e-05,0.000148,0.00053,0.00043,0.000306,0.000163,0.000114,0.000138,0.000197,0.000214,5.7e-05,7.5e-05,0.000123,5.2e-05,6.5e-05,8.6e-05,8e-05,5.7e-05,7.3e-05,4.9e-05,3.8e-05,6.4e-05,7.1e-05,8.3e-05,2.9e-05,4.9e-05,8.9e-05,7.7e-05,9.2e-05,3.4e-05,4e-05,2.6e-05,2.7e-05,3.8e-05,1.8e-05,2.9e-05,2.2e-05,2.7e-05,4.9e-05,5.9e-05,3.5e-05,4.3e-05,0.000108,3.5e-05,5.4e-05,7e-05
2.7e-05,1.2e-05,9e-06,1.3e-05,3.1e-05,2.9e-05,4.5e-05,6.8e-05,5e-05,0.00022,0.000791,0.000201,0.000241,0.000176,0.001243,0.000344,0.000433,0.00134,0.000267,0.000192,0.000327,0.000153,2.9e-05,6.3e-05,1.8e-05,0.00421,0.002895,0.000933,0.001783,0.001426,0.000465,0.001974,0.001428,0.002147,0.000236,0.000535,0.003058,0.002383,0.000575,0.000864,0.001505,0.001258,0.002008,0.000906,0.001922,0.002442,0.001769,0.000996,0.001008,0.001658,0.002064,0.001187,0.001063,0.002003,0.000648,0.000255,0.000174,0.000865,0.001118,8.3e-05,0.000212,0.000422,0.000435,0.000561,0.000158,0.000552,0.000518,0.000207,0.000208,0.000144,6.3e-05,0.000802,0.000529,0.000154,0.000211,0.000128,0.000128,0.000568,0.000106,9e-05,0.000111,4.3e-05,2.9e-05,3e-04,5.9e-05,6.8e-05,7.1e-05,7.7e-05,9.7e-05,4.4e-05,2.5e-05,2.1e-05,4.6e-05,9e-05,8.2e-05,4e-05,8.2e-05,3e-05,1.8e-05,3.3e-05,3.8e-05,6e-05,1.3e-05,4.7e-05,4.6e-05,2.4e-05,3e-05,3.3e-05,1.1e-05,2.4e-05,5e-05,3e-05,2.3e-05,2.7e-05,3.3e-05,1.3e-05,1.8e-05,4.8e-05,4.3e-05,1.6e-05,5.7e-05
4.5e-05,7.2e-05,6.8e-05,4.7e-05,3.2e-05,5.7e-05,2.5e-05,6.1e-05,2.9e-05,0.00023,0.001313,0.000267,0.000344,0.000211,0.002131,0.001259,0.000974,0.001932,0.000726,0.000428,0.000631,0.00076,0.00039,2e-06,7.5e-05,0.002868,0.002512,0.000438,0.004762,0.001942,0.000985,0.001353,0.002549,0.000917,0.000934,0.000205,0.006044,0.002625,0.000382,0.000766,0.001028,0.001597,0.002039,0.001573,0.00391,0.000705,0.001564,0.001434,0.002245,0.002128,0.000997,0.000404,0.000796,0.001364,0.00074,0.001651,0.000249,0.000984,0.002102,0.000819,0.000447,0.000573,0.000487,0.000568,0.00049,0.00049,2.8e-05,0.000294,0.000238,0.000127,5.9e-05,0.00077,0.000164,0.000131,0.000143,0.00023,0.000219,0.000755,0.000387,0.000125,9.4e-05,4.8e-05,5.1e-05,0.000255,0.000281,5.8e-05,7.4e-05,0.00015,5.3e-05,4.5e-05,6.8e-05,8.5e-05,4.1e-05,9.3e-05,7.8e-05,5.3e-05,3.5e-05,2e-05,3.7e-05,1e-06,2.9e-05,5.9e-05,3.8e-05,5.9e-05,4.5e-05,3.2e-05,7.2e-05,5.2e-05,5.4e-05,3.6e-05,2.1e-05,5.4e-05,4e-06,3.7e-05,1.5e-05,2.9e-05,2.2e-05,2.3e-05,4.6e-05,7.6e-05,4e-06
1.2e-05,5.9e-05,1.6e-05,2.4e-05,7.4e-05,0.00011,0.000101,0.000176,7.3e-05,0.00022,0.000879,0.000322,0.000539,0.000492,0.002787,0.000902,0.000139,0.001909,0.000682,0.000776,0.001924,0.000209,0.000163,0.000101,4e-05,0.002235,0.003501,0.002557,0.00589,0.007185,0.00402,0.001341,0.002192,0.004446,0.002809,0.002802,0.007561,0.003036,0.000794,0.002164,0.001146,0.004295,0.004149,0.004484,0.002451,0.002069,0.001338,0.001402,0.002529,0.002457,0.003357,0.001287,0.003056,0.000838,0.000962,0.002293,0.001904,0.001458,0.001059,0.001108,0.000222,0.000957,0.000579,0.000638,0.000171,0.000428,0.000418,0.000242,0.000286,0.000102,5.3e-05,0.000709,0.000414,0.000107,0.000252,0.000212,0.000225,0.000681,0.000477,0.000237,0.000157,4.3e-05,6.1e-05,0.000188,0.000185,0.000195,0.000119,9.9e-05,0.000107,7.9e-05,2.3e-05,4e-05,7.1e-05,0.000259,0.000114,2.2e-05,3.2e-05,9.3e-05,6.7e-05,3.8e-05,4.4e-05,4.4e-05,4.9e-05,8.1e-05,6.9e-05,1.6e-05,5.4e-05,4.6e-05,8.1e-05,2.3e-05,2.6e-05,6e-05,5e-05,7.4e-05,6.5e-05,6.7e-05,2.8e-05,2.9e-05,5.1e-05,4.8e-05,3.9e-05
2.9e-05,2.2e-05,2.9e-05,3.6e-05,8.8e-05,0.000104,4.3e-05,0.000182,0.000111,0.000277,0.001557,0.000457,0.000443,0.000601,0.003236,0.002495,0.001254,0.002139,0.001839,0.001276,0.002477,0.001895,0.000912,0.000206,0.000164,0.00232,0.003127,0.003821,0.008335,0.001113,0.00272,0.005275,0.000143,0.006197,0.003435,0.004983,0.007709,0.005274,0.001633,0.003034,0.003473,0.005598,0.001857,0.003761,0.006522,0.003006,0.002196,0.002563,0.001177,0.002141,0.00403,0.003465,0.003445,0.004246,0.003683,0.003962,0.00111,0.000795,0.000954,0.001334,0.001035,0.000974,0.00086,0.00123,0.000918,0.000556,0.00017,0.00035,0.000358,0.000176,0.000142,0.000813,0.000341,0.000378,0.000305,0.000411,0.000561,0.000525,0.000636,0.000262,0.000184,0.000172,0.000159,0.000302,0.000401,0.000433,0.000239,0.000151,2.2e-05,4e-06,1.1e-05,2.4e-05,9.5e-05,0.000391,0.000213,9.1e-05,4.7e-05,7.4e-05,5.3e-05,6e-06,6.9e-05,5.3e-05,2.3e-05,0.000146,0.000109,8.6e-05,2.4e-05,2.6e-05,3.5e-05,5.9e-05,4.6e-05,3.6e-05,3.6e-05,5e-05,2.6e-05,3.8e-05,2.2e-05,2.9e-05,5.4e-05,2e-05,1.1e-05
2.1e-05,1.5e-05,1.8e-05,3.3e-05,2.6e-05,4.6e-05,5.2e-05,0.000137,0.000111,0.000215,0.002543,0.002692,0.002065,0.00223,0.002436,0.002956,0.001046,0.00382,0.003511,0.001347,0.001457,0.000531,0.00037,0.00042,0.000399,0.002073,0.003682,0.000548,0.006352,0.005993,0.000655,0.003398,0.005637,0.004355,0.003974,0.005165,0.001231,0.001151,0.000984,0.001752,0.002196,0.003456,0.003029,0.000905,0.003423,0.002886,0.003462,0.001809,0.00077,0.001496,0.000809,0.002017,0.003182,0.001884,0.001363,0.001154,0.00153,0.001524,0.001783,0.001515,0.00042,0.000794,0.001211,0.000692,0.000397,0.000375,0.000147,0.000315,0.00013,7.7e-05,0.000168,0.000764,0.000566,0.000366,2e-04,0.000376,0.000789,0.000556,0.000198,0.000165,0.000257,0.000215,0.000129,0.000268,0.000573,0.00085,0.000357,0.00011,5.6e-05,1.2e-05,2.1e-05,1.5e-05,0.000131,0.000494,0.000275,1e-04,7.2e-05,1.4e-05,6.9e-05,4.1e-05,4.4e-05,4.5e-05,5e-05,0.000154,5.5e-05,7.5e-05,3.9e-05,3.7e-05,5.2e-05,6.8e-05,5.6e-05,9.1e-05,3.9e-05,4.5e-05,4.1e-05,4.5e-05,3.5e-05,2.4e-05,8.2e-05,3.5e-05,1.6e-05
4.5e-05,1.6e-05,2.2e-05,1.4e-05,1.3e-05,3.5e-05,1.5e-05,8.4e-05,3.7e-05,9.8e-05,0.002492,0.003694,0.001411,0.002147,0.002216,0.002624,0.001647,0.005183,0.003466,0.001605,0.000659,0.000384,0.000557,0.000104,0.000209,0.001249,0.001007,0.001646,0.004166,0.000413,0.00157,0.0016,0.002783,0.001129,0.000114,0.003798,0.000568,0.001145,0.000481,0.000974,0.001446,0.000854,0.001122,0.000774,0.00085,0.000875,0.002121,0.000373,0.000866,0.000949,0.001312,0.002248,0.001884,0.000901,0.00074,0.000875,0.000484,0.000443,0.000317,0.000183,0.000199,0.000359,0.000697,0.000498,0.000215,0.000227,0.000178,6.3e-05,0.000164,0.000117,0.000179,0.000603,0.000614,0.000431,0.000157,0.000215,0.000317,0.000502,0.000279,0.000221,9.4e-05,1.2e-05,0.000108,0.000164,0.000314,0.00045,0.000322,0.000142,0.00016,8.1e-05,4.2e-05,4.5e-05,7.5e-05,0.000601,0.000383,0.000124,8.9e-05,3.9e-05,0.000101,5.8e-05,5.4e-05,1.7e-05,4.3e-05,0.000134,6.4e-05,7.7e-05,3.4e-05,3.8e-05,1.7e-05,2.1e-05,2.7e-05,3.3e-05,6.3e-05,6.6e-05,4.9e-05,5.5e-05,4.5e-05,5e-06,8.2e-05,9e-05,7.7e-05
3.5e-05,3.1e-05,7e-06,1.4e-05,1.1e-05,1.4e-05,1.3e-05,6.9e-05,6.2e-05,0.000137,0.001941,0.001941,0.001209,0.001025,0.001787,0.000589,0.000192,0.004294,0.003176,0.002253,0.000841,0.000783,0.000372,0.000227,0.000152,0.000703,0.001686,0.000955,0.00182,0.001629,0.000268,0.001325,0.002096,0.00151,0.002902,0.000307,0.001856,0.001439,0.001641,0.000486,0.000549,0.001618,0.001605,0.001165,0.000441,1.7e-05,0.001068,0.000744,0.000311,0.001286,0.000603,0.000901,0.000796,0.000618,0.00065,0.000523,8.1e-05,0.000232,0.000407,0.000209,0.00021,0.000335,0.000464,0.000169,8.7e-05,4e-05,6.1e-05,0.000171,6.7e-05,1.9e-05,9.9e-05,0.000499,0.000157,5.2e-05,0.000109,0.00016,0.000158,0.000556,0.000273,5.1e-05,5.9e-05,6.6e-05,6.1e-05,0.000294,0.000411,0.000633,0.000258,0.000286,0.000108,2.2e-05,2.8e-05,7.4e-05,9.2e-05,0.000478,0.000231,9.6e-05,8e-05,0.000115,5.3e-05,6e-05,1.9e-05,2e-05,3.8e-05,8.4e-05,0.000124,5.2e-05,1.5e-05,4.2e-05,4.5e-05,2.4e-05,2.3e-05,1.6e-05,4.8e-05,1.4e-05,3.5e-05,1.9e-05,8e-06,2.5e-05,4.7e-05,3.7e-05,1.9e-05
9e-06,1.4e-05,1.3e-05,1e-05,2e-06,2.9e-05,2.7e-05,5.3e-05,3e-05,0.00014,0.0016,0.000394,0.000914,0.000796,0.000558,9.5e-05,0.000243,0.002806,0.001757,0.000325,0.000941,0.000325,0.000204,7.5e-05,4.8e-05,0.000293,0.002056,0.001976,0.002583,0.001585,0.002954,0.001359,0.004015,0.00091,0.001629,0.001333,0.000832,0.000609,0.000546,0.000788,0.001047,0.00211,0.000904,0.001511,0.001086,0.001771,0.002395,0.001189,0.001012,0.001452,0.001245,0.000748,0.001063,0.000737,0.001413,0.000691,0.000292,0.000265,0.000493,0.000199,0.000178,0.000195,0.000499,0.000205,1.5e-05,3.8e-05,0.000165,0.000116,3.5e-05,2.3e-05,8.9e-05,0.000153,0.000246,0.00013,8.5e-05,0.000227,0.00029,0.000163,0.000101,4e-05,7.4e-05,4.1e-05,2.1e-05,0.000283,0.000472,0.000357,0.000234,0.000228,0.000115,2.1e-05,3.1e-05,4.9e-05,6.3e-05,0.000243,0.000108,4.1e-05,3.6e-05,3.1e-05,4.9e-05,3.7e-05,3.8e-05,1.8e-05,2.5e-05,9.3e-05,0.000104,3.3e-05,1.1e-05,1.9e-05,1.6e-05,3.3e-05,2.3e-05,3.3e-05,1.7e-05,4e-06,1.9e-05,2.6e-05,3e-05,9e-06,3.9e-05,5.3e-05,4.2e-05
7e-06,6e-06,2.1e-05,8e-06,3e-06,3e-05,1.2e-05,2.7e-05,3.2e-05,0.000132,0.001104,0.000592,0.001066,0.000812,0.00054,0.000354,0.000159,0.00146,0.000199,0.000182,0.000359,0.000199,5.8e-05,4.9e-05,9.2e-05,0.000722,0.001423,0.001611,0.002789,0.003113,0.002026,0.000869,0.003497,0.001617,0.001073,0.000757,0.002344,0.003016,0.001443,0.000856,0.001938,0.001613,0.001831,0.001273,0.000575,0.002201,0.003238,0.001354,0.001386,0.001357,0.00034,0.001365,0.001279,0.000118,0.001008,0.000509,0.000363,0.000135,0.000388,0.000594,0.000379,0.000433,0.000463,0.000277,7e-05,0.000164,0.000122,1.5e-05,5e-05,5.7e-05,5.8e-05,0.000211,0.000181,0.000142,0.000132,0.000117,0.00013,8.3e-05,3.4e-05,2.5e-05,4.7e-05,4.7e-05,1.2e-05,0.000268,0.000139,0.000136,3.5e-05,0.000108,5.6e-05,5e-06,2.3e-05,4.5e-05,0.000105,4.9e-05,6.2e-05,3.4e-05,2.1e-05,2.7e-05,6e-05,5e-05,3.5e-05,5e-05,2e-05,6.9e-05,4.1e-05,3.6e-05,3.2e-05,1e-05,4.2e-05,1.2e-05,1e-05,2.6e-05,4.1e-05,2.9e-05,1.5e-05,1.8e-05,3.4e-05,1.9e-05,2.9e-05,4.9e-05,8e-06
2.3e-05,7e-06,2.4e-05,7e-06,6e-06,3.6e-05,2.7e-05,3.3e-05,2.5e-05,0.000137,0.000726,0.000337,0.000929,0.000663,0.000733,0.000321,0.000275,0.000623,0.000167,0.000322,0.000196,0.000226,0.000169,7.9e-05,0.000105,0.001478,0.001683,0.001728,0.002639,0.000791,0.000993,0.001011,0.003312,0.001726,0.001804,0.002299,0.000743,0.00117,0.003334,0.003333,0.001045,0.000562,0.002596,0.001559,0.002448,0.001497,0.002644,0.00179,0.001601,0.001037,0.000433,0.000664,0.000905,0.00077,0.001024,0.000802,0.000259,0.000448,0.000617,0.000127,0.000278,0.000531,0.000823,4.4e-05,0.00032,0.000591,0.000593,0.000409,0.000154,2.6e-05,6e-05,0.000447,0.000418,0.00013,0.000147,2.3e-05,3.5e-05,0.000198,5.2e-05,3.3e-05,5.7e-05,4.9e-05,1.5e-05,0.000214,0.000339,9.5e-05,3.8e-05,7.1e-05,1.5e-05,2.3e-05,2.8e-05,2.1e-05,9.2e-05,0.000163,8.2e-05,6.2e-05,4e-05,9e-05,6.3e-05,6.7e-05,3e-05,4e-05,2.1e-05,6e-05,0.000105,4.3e-05,2.2e-05,1.6e-05,4.3e-05,7e-06,3.9e-05,2.8e-05,3.3e-05,3.1e-05,2.6e-05,4.3e-05,2.5e-05,1.4e-05,3.9e-05,3e-05,2.7e-05
1.4e-05,1.9e-05,5e-05,1.4e-05,1e-05,4.3e-05,1.1e-05,4.7e-05,1e-05,0.00014,0.000792,0.000155,0.000675,0.000127,0.000943,0.000267,0.000261,0.000212,0.000847,0.000129,0.000498,0.000304,6.2e-05,7.5e-05,0.000173,0.001961,0.002646,0.001244,0.001942,0.004251,0.001097,0.002321,0.003875,0.001068,0.001469,0.005562,0.004852,0.000892,0.001667,0.002666,0.001588,0.001902,0.002278,0.003178,0.003254,0.000764,0.002359,0.002259,0.001875,0.0028,0.000761,0.001809,0.002528,0.001935,0.002287,0.000372,0.000833,0.000696,0.001325,0.000737,0.00026,0.000866,0.001256,0.000632,0.001097,0.000556,0.000396,3e-04,0.000242,0.000118,4.3e-05,0.000637,0.00027,0.000159,0.000195,0.000245,0.000287,0.000319,0.000156,8.5e-05,7.9e-05,4.8e-05,8e-06,0.000154,0.00027,8.9e-05,1.9e-05,6e-05,5.4e-05,5.2e-05,4e-05,1.8e-05,0.000207,0.000141,2.5e-05,2e-05,6.6e-05,0.000141,9.8e-05,5.5e-05,5.6e-05,6.1e-05,5.1e-05,9.6e-05,5.1e-05,6.2e-05,3.5e-05,6.7e-05,6.6e-05,2.9e-05,7.3e-05,7.6e-05,4.1e-05,3.8e-05,1.1e-05,6.4e-05,4.3e-05,2.9e-05,3.8e-05,6.1e-05,1.9e-05
0.000105,4.5e-05,6.8e-05,7.2e-05,5e-05,7.8e-05,7e-05,3e-05,4.4e-05,0.000132,0.000432,0.000533,0.000497,0.000931,0.001026,0.000347,0.000175,0.000279,0.000896,0.000878,0.00017,0.000266,0.000254,9.4e-05,0.000169,0.001674,0.005612,0.008389,0.00294,0.006342,0.008837,0.006903,0.009246,0.008633,0.003009,0.007706,0.001128,0.007909,0.006544,0.00374,0.006904,0.004855,0.001661,0.006396,0.004931,0.005412,0.004068,0.001744,0.003345,0.002313,0.003273,0.003568,0.003111,0.001863,0.003306,0.00262,0.001772,0.000688,0.002739,0.000984,0.000848,0.001222,0.0029,0.002834,0.000821,0.002013,0.001194,0.00025,0.00025,0.000261,0.000109,0.00054,0.000879,0.000338,0.000197,3.5e-05,0.00021,0.000334,0.000133,5e-05,9.4e-05,7.9e-05,8.5e-05,9.2e-05,0.000217,9.5e-05,7.2e-05,5e-05,6.1e-05,0.000119,4.7e-05,4.4e-05,0.000313,0.000148,7.7e-05,5.5e-05,0.000122,0.000159,0.00016,0.000161,9.5e-05,0.000195,0.000152,0.000228,0.000198,7.4e-05,0.000141,6e-05,9.4e-05,8.5e-05,0.00012,6.7e-05,0.00013,3.4e-05,8e-05,5.7e-05,0.000172,0.000137,8.8e-05,2.3e-05,6e-05
0.000153,0.000104,4.5e-05,7.4e-05,5.8e-05,8.5e-05,2e-05,3.3e-05,4.3e-05,0.000119,0.000659,0.000312,0.001277,0.000312,0.000531,8.1e-05,0.000131,0.000578,0.001162,0.000165,0.000196,0.000262,0.000237,0.000127,0.000103,0.000832,0.003601,0.007483,0.005873,0.002828,0.006449,0.007092,0.008228,0.007309,0.008997,0.009779,0.009722,0.012395,0.010467,0.012718,0.013154,0.012816,0.010612,0.008571,0.009403,0.011772,0.004666,0.005678,0.006303,0.007424,0.00472,0.006659,0.002865,0.003612,0.002323,0.005569,0.00289,0.001482,0.004369,0.004777,0.002311,0.000887,0.002199,0.002105,0.002762,0.002659,0.001946,0.001364,0.000386,0.000158,0.000285,0.000373,0.000258,0.000171,0.000278,0.000374,3.8e-05,0.000146,0.000149,0.000124,0.000117,0.000116,9.4e-05,0.000152,0.000176,4.6e-05,3.5e-05,6.5e-05,0.000113,0.000209,0.000216,0.000134,0.000473,0.000371,0.000305,2e-04,0.000157,0.000281,0.000464,0.000398,0.000312,0.000177,6.9e-05,0.000173,0.000314,0.000299,0.000187,0.000168,0.000229,0.000261,0.000157,0.000244,0.000195,0.000159,0.000157,0.000114,0.000148,0.000186,1.2e-05,0.000113,9.2e-05
6e-05,5.6e-05,2.4e-05,3.7e-05,3.4e-05,2.9e-05,4.5e-05,2.6e-05,2.8e-05,0.00014,0.001094,0.001258,0.002174,0.00138,0.001094,0.000514,0.000146,0.001391,0.001508,0.001,0.000677,0.000402,0.000149,0.000124,8.5e-05,0.000942,0.000697,0.005797,0.003084,0.000957,0.005299,0.008773,0.003513,0.006378,0.006547,0.001777,0.004935,0.002417,0.006234,0.006162,0.003,0.004599,0.002943,0.005533,0.008612,0.004301,0.006295,0.009989,0.004712,0.007245,0.006754,0.003079,0.005795,0.005772,0.004925,0.002463,0.001746,0.001894,0.002215,0.003135,0.001639,0.001229,0.000604,0.000706,0.001229,0.00086,0.000459,0.000493,0.000327,0.000227,9.4e-05,0.000359,0.000393,0.000109,0.000119,0.000234,9.5e-05,9.5e-05,0.000143,7.5e-05,3.7e-05,7.5e-05,0.000145,0.000144,0.000255,0.000152,0.000173,0.000145,1e-04,0.000102,9.7e-05,2e-05,0.000425,0.000242,0.000194,7.3e-05,9.5e-05,0.000132,0.000243,6.8e-05,5.3e-05,0.00013,8.6e-05,9.8e-05,7.5e-05,0.000118,0.000116,7.9e-05,0.000105,0.000198,0.000222,0.000341,0.000195,5.7e-05,5.7e-05,0.000129,0.000174,7.2e-05,0.000111,0.000211,0.000183
4.5e-05,1.7e-05,2.9e-05,2.5e-05,4e-05,3.8e-05,4.2e-05,3.2e-05,1.9e-05,9.5e-05,0.001088,0.000293,0.001476,0.000854,0.00025,0.000371,0.000343,0.002223,0.000574,4.4e-05,0.000827,0.000413,0.000184,2.7e-05,2.4e-05,0.001406,0.004868,0.002623,0.005244,0.006219,0.002907,0.00305,0.001911,0.001917,0.005897,0.004379,0.002521,0.003068,0.005651,0.002297,0.002436,0.00259,0.003292,0.001569,0.001947,0.004578,0.001212,0.004918,0.00606,0.006171,0.002252,0.005854,0.002905,0.006068,0.003109,0.003386,0.002181,0.001272,0.001762,0.000855,0.000685,0.001141,0.001388,0.000797,0.001279,0.001444,0.000888,0.000208,0.000234,0.000123,0.000173,0.000393,0.000763,0.000561,0.000292,0.000237,0.000252,0.000153,5.3e-05,5.3e-05,8.7e-05,1.3e-05,0.000108,7.2e-05,0.000344,0.000342,0.000107,0.000134,3.7e-05,7.1e-05,0.000125,6.1e-05,0.000285,0.000127,0.000107,6.5e-05,9e-05,9.3e-05,4.1e-05,0.000161,0.000178,8.9e-05,5.4e-05,9.9e-05,0.000122,0.000134,4e-05,0.000119,0.000143,0.000124,4.2e-05,0.000148,0.00012,9.6e-05,9.7e-05,9.3e-05,7.9e-05,0.00015,0.000128,0.000112,0.000101
2.2e-05,1.3e-05,1.7e-05,3e-06,2.1e-05,1.9e-05,8e-06,2.2e-05,1.6e-05,7.1e-05,0.000671,0.000708,0.000855,0.000453,0.000449,0.000142,0.000264,0.002162,0.001099,0.000594,0.001362,0.00073,0.00032,5.2e-05,4.9e-05,0.001439,0.005162,0.005087,0.001964,0.003872,0.004003,0.003268,0.002229,0.002581,0.004116,0.00054,0.002041,0.000833,0.000976,0.001463,0.003569,0.002534,0.003444,0.00502,0.003425,0.003395,0.003334,0.000375,0.003225,0.000625,0.002661,0.00143,0.000868,0.004058,0.000563,0.000568,0.001288,0.001117,0.001169,0.000823,0.000523,0.000423,0.000978,0.000399,0.000463,0.001216,0.00068,0.000714,0.000436,0.000145,0.000108,0.00073,0.00122,0.001145,0.000557,0.000233,0.000309,0.000191,2.3e-05,2.9e-05,5.2e-05,5.8e-05,5.1e-05,0.00017,0.000106,8.7e-05,8.2e-05,7.8e-05,8.1e-05,5.1e-05,5.9e-05,1.3e-05,0.000138,0.000115,4.1e-05,2.2e-05,9.5e-05,9.3e-05,3.9e-05,0.000145,8e-05,2.3e-05,4.4e-05,0.000112,0.000243,0.00012,6.6e-05,0.000129,8e-05,0.00016,0.000147,6.1e-05,0.000107,7.7e-05,4e-05,9.9e-05,3.7e-05,9.1e-05,9.7e-05,8.3e-05,5.9e-05
2.8e-05,3.3e-05,1.9e-05,1.2e-05,1.7e-05,2.6e-05,4e-05,2e-05,2e-05,5e-05,0.000595,0.000775,0.001025,0.00063,0.000469,3.7e-05,0.000145,0.001446,0.000712,0.000756,0.000969,0.000439,0.000113,3e-05,1.9e-05,0.001166,0.00342,0.000262,0.001092,0.003192,0.000705,0.001677,0.001971,0.001688,0.001631,0.00313,0.003014,0.00191,0.000982,0.0021,0.001274,0.001233,0.00392,0.001241,0.00168,0.001778,0.002636,0.001707,0.001858,3e-04,0.000861,0.000802,0.001674,0.000554,0.001852,0.001028,0.001263,0.000954,0.001047,0.000574,0.000749,0.000161,0.000509,8e-04,6.4e-05,0.000874,0.000371,0.000457,0.000226,8.2e-05,6.4e-05,0.000706,0.000146,0.000359,0.00017,0.00014,0.000294,0.000241,0.000131,7.9e-05,5e-05,2e-05,3e-05,0.000147,0.000165,0.000103,0.000109,5.9e-05,2.6e-05,3.6e-05,8.1e-05,0.000111,0.000101,7.2e-05,9.8e-05,7.8e-05,2.3e-05,1.8e-05,0.000118,7e-05,0.000107,7.4e-05,8.2e-05,0.000168,0.000297,0.000166,8.4e-05,4.9e-05,6.2e-05,7.2e-05,1.7e-05,6e-05,9.8e-05,9.7e-05,6.2e-05,1.6e-05,9.1e-05,0.000136,6.9e-05,2.4e-05,8.5e-05
1.6e-05,1.4e-05,2.2e-05,3.5e-05,3e-05,3.9e-05,1.7e-05,4e-06,8e-06,6.4e-05,0.00065,0.000158,0.000213,0.000192,0.000292,6.7e-05,0.000189,0.001142,0.000457,0.000418,0.000554,0.000344,0.000163,7.3e-05,6.2e-05,0.000767,0.001817,0.000965,0.000823,0.001395,0.000792,0.001762,0.001156,0.000822,0.00091,0.002149,0.000406,0.00033,0.001316,0.001677,0.001139,0.000585,0.002762,0.002265,0.000743,0.000571,0.002388,0.001149,0.001433,0.00084,0.000745,0.001017,0.00164,0.000667,0.001038,0.000231,0.001147,0.000685,0.000618,9e-05,0.000169,0.00055,0.000385,0.000316,0.000388,0.000163,0.000101,0.000164,5.8e-05,8.6e-05,7.5e-05,0.000621,0.000824,0.00043,0.000114,0.000129,0.00029,1e-04,3.1e-05,3.4e-05,1.5e-05,3.6e-05,1.2e-05,0.000181,9.1e-05,7e-05,0.000116,0.000104,4.8e-05,7.6e-05,1.8e-05,0.000105,5.9e-05,8.7e-05,2.1e-05,2.3e-05,5.7e-05,6.6e-05,5e-05,1.4e-05,3.7e-05,6.2e-05,3.3e-05,8.6e-05,6.9e-05,3e-06,2.8e-05,4.6e-05,5.4e-05,3.5e-05,5.9e-05,4.8e-05,5.8e-05,1.5e-05,1.9e-05,1.1e-05,4.5e-05,5.4e-05,1.5e-05,4.2e-05,1.1e-05
5e-06,5e-06,8e-06,3e-06,3e-06,5e-06,8e-06,5e-06,2e-06,3.3e-05,0.00022,0.000153,4.4e-05,0.000209,0.000209,9.7e-05,6.8e-05,0.000268,0.00016,0.00024,0.000256,0.000157,6.9e-05,4.8e-05,2.9e-05,0.000212,9.2e-05,0.000683,0.00017,0.000275,0.000417,0.00069,0.000654,5e-04,0.00067,0.000277,6.7e-05,0.000309,0.000263,0.000427,0.000606,0.000241,0.000849,0.000303,0.000557,0.000311,0.000407,0.000321,0.000184,0.000134,0.000526,0.000212,0.000408,0.000243,0.000534,0.000228,0.000181,0.000185,0.000287,8.8e-05,7.2e-05,0.000169,5.1e-05,3.2e-05,0.000114,7.9e-05,2.1e-05,3.5e-05,2e-05,2.8e-05,2.9e-05,0.000232,0.00021,0.000202,0.000123,0.000109,8.2e-05,5.8e-05,2.8e-05,1e-05,1.5e-05,1.8e-05,1.7e-05,7.7e-05,5.2e-05,3.4e-05,2.8e-05,3.2e-05,1.6e-05,3.2e-05,3.8e-05,2.5e-05,2.5e-05,3.6e-05,3.6e-05,1.9e-05,4.2e-05,4e-06,1e-06,1.5e-05,2.5e-05,1.6e-05,2.5e-05,2.8e-05,3.6e-05,2e-05,1.7e-05,1.6e-05,3.3e-05,2.3e-05,4e-06,1.8e-05,1.8e-05,1.9e-05,1.3e-05,1.1e-05,1.1e-05,2.2e-05,1.2e-05,1.7e-05,9e-06
4e-06,4e-06,8e-06,1e-06,3e-06,3e-06,7e-06,7e-06,6e-06,2.8e-05,4.9e-05,9.6e-05,1e-04,0.000212,0.000119,4.6e-05,6.5e-05,0.000275,1e-04,8.5e-05,4.7e-05,5.7e-05,2.8e-05,3.6e-05,4.4e-05,0.000115,0.000363,0.000483,0.000468,0.000422,0.000285,0.000533,0.000518,0.000574,0.000437,3.1e-05,0.000403,0.000208,0.000639,0.000395,0.000607,0.000445,0.000485,0.000554,0.000551,0.000405,9.3e-05,0.000529,0.000466,0.000489,0.000338,0.000363,0.000314,0.000236,0.000435,0.000124,0.000241,4.4e-05,0.000277,9.5e-05,6.9e-05,9.5e-05,8.6e-05,5.4e-05,9.2e-05,7.6e-05,2.7e-05,2.3e-05,3.1e-05,2.3e-05,1.2e-05,0.00011,0.000365,0.000161,4.2e-05,5.4e-05,1.3e-05,1.3e-05,1.3e-05,1.9e-05,1.8e-05,2.6e-05,1.8e-05,8.4e-05,7.4e-05,3.7e-05,3.7e-05,3e-05,1.9e-05,2.5e-05,2.2e-05,2.3e-05,3.1e-05,9e-06,1.3e-05,2.5e-05,1.5e-05,1.8e-05,1.7e-05,5e-06,7e-06,5e-06,6e-06,2.1e-05,4.6e-05,3.6e-05,5e-06,2e-06,1.7e-05,4e-06,1.4e-05,8e-06,1.6e-05,1.5e-05,9e-06,8e-06,1.2e-05,1.1e-05,7e-06,1.2e-05,6e-06
5e-06,4e-06,3e-06,7e-06,4e-06,7e-06,2e-06,6e-06,2e-06,2e-05,3.9e-05,8.9e-05,4.3e-05,0.000165,7.3e-05,5.3e-05,5.4e-05,0.000319,0.00014,4.2e-05,0.000172,9.4e-05,1.5e-05,1.2e-05,1e-05,0.000196,0.000646,0.000287,0.00026,0.000232,8.6e-05,0.00061,0.000277,0.000733,0.00044,0.000338,0.00013,0.000251,9.6e-05,0.000512,0.000507,0.000419,0.000549,0.000159,0.000312,0.000272,0.000412,0.000205,0.000418,0.000464,0.000155,6.1e-05,0.000272,8.9e-05,0.000336,0.000103,9.2e-05,3.7e-05,0.000189,2.8e-05,8.8e-05,7.1e-05,7e-05,5.6e-05,8.7e-05,9.3e-05,3.7e-05,2.2e-05,2e-06,4e-06,1.3e-05,4.6e-05,0.000269,0.000145,7.7e-05,4.7e-05,2.2e-05,2.4e-05,5e-06,2.7e-05,2.8e-05,2.4e-05,7e-06,5.2e-05,2.2e-05,1.8e-05,4.3e-05,1.8e-05,1.2e-05,8e-06,1.7e-05,1.9e-05,2.5e-05,3e-06,1.1e-05,1e-05,1.9e-05,6e-06,1.7e-05,1.1e-05,1e-05,9e-06,9e-06,4.3e-05,1.7e-05,1.3e-05,5e-06,1.4e-05,1e-05,7e-06,1.8e-05,4e-06,6e-06,1e-05,3e-06,7e-06,1e-05,1.3e-05,8e-06,9e-06,5e-06
1e-06,4e-06,4e-06,2e-06,2e-06,4e-06,6e-06,3e-06,6e-06,1.9e-05,3.7e-05,0.000137,9.9e-05,0.000155,0.000138,9e-06,4.7e-05,0.000242,9.3e-05,3.5e-05,0.000217,7.7e-05,1.3e-05,1.5e-05,5e-06,0.000282,0.000603,0.000161,0.000106,0.000411,0.000207,0.000538,0.000226,0.00085,0.000404,0.000552,0.000271,0.000291,0.000341,0.000342,0.000298,0.000303,0.000138,0.000627,9e-06,0.000378,0.00058,0.000518,7.8e-05,0.000253,0.000409,0.000265,0.000278,0.000131,0.000434,5.6e-05,0.000131,5.6e-05,0.000178,3e-05,6.1e-05,0.000124,3.2e-05,9.3e-05,0.000109,3.9e-05,2.5e-05,1e-05,3.3e-05,1.2e-05,1.9e-05,2.1e-05,0.000276,0.00012,8.4e-05,2.1e-05,2.2e-05,3.7e-05,2.1e-05,2.5e-05,9e-06,1.6e-05,1.2e-05,4.2e-05,4.2e-05,2.6e-05,3.8e-05,1.6e-05,3e-06,5e-06,9e-06,1.1e-05,2.6e-05,1e-05,6e-06,1.5e-05,2.2e-05,1.8e-05,1.2e-05,3e-06,1.1e-05,1.1e-05,5e-06,3.7e-05,3e-05,1e-05,7e-06,9e-06,1.6e-05,4e-06,1.7e-05,2e-06,1.1e-05,8e-06,6e-06,5e-06,2e-06,9e-06,8e-06,1e-05,3e-06
6e-06,1e-06,4e-06,5e-06,3e-06,1e-06,5e-06,4e-06,2e-06,2.4e-05,5.7e-05,0.00017,8e-05,0.000102,3.1e-05,1e-05,6.2e-05,0.000165,8.1e-05,4e-05,0.000166,0.000109,3.1e-05,1.1e-05,2.6e-05,0.000292,0.000509,0.000452,0.000403,5.9e-05,0.000279,1.8e-05,0.000227,0.000565,0.00035,0.000292,0.000162,1.6e-05,0.000385,0.000213,0.000287,0.000519,0.000374,0.000345,0.000545,0.000121,0.00049,0.00026,0.000195,0.000144,0.000231,6.2e-05,0.000246,0.000294,0.000338,9.4e-05,0.000171,4.5e-05,0.000153,3.2e-05,4e-05,0.000105,6.8e-05,6.3e-05,2.6e-05,4.9e-05,5.2e-05,5e-05,2.5e-05,3e-05,2.2e-05,4.3e-05,0.000277,0.000194,7.7e-05,2.8e-05,3.9e-05,4.1e-05,5e-06,1.4e-05,3e-06,1.2e-05,8e-06,4e-05,3.2e-05,8e-06,2.8e-05,2e-05,2.1e-05,4e-06,1e-05,7e-06,7e-06,4e-06,2e-06,1.3e-05,1e-05,8e-06,2.4e-05,2.2e-05,1.4e-05,1.2e-05,1.1e-05,3.6e-05,8e-06,1.5e-05,9e-06,7e-06,8e-06,7e-06,1e-05,6e-06,1e-05,1e-05,1e-06,5e-06,6e-06,5e-06,9e-06,1.2e-05,6e-06
4e-06,0,2e-06,4e-06,5e-06,5e-06,2e-06,5e-06,6e-06,1.8e-05,0.000104,7.1e-05,8.2e-05,9.1e-05,0.000143,1.9e-05,3.3e-05,7e-05,5.9e-05,6.5e-05,0.000195,0.000114,3.6e-05,2.4e-05,9e-06,0.000246,0.000299,2e-05,0.000509,0.000186,0.000127,0.000234,0.000116,5.7e-05,4.5e-05,0.000265,0.000346,0.000256,0.000105,0.000272,0.000183,0.000381,0.00032,0.000625,0.000689,0.000324,0.000337,1e-04,0.000161,8.4e-05,0.00018,0.000121,0.000215,0.000241,0.000291,0.000108,0.000135,4.3e-05,5.3e-05,3.5e-05,3.8e-05,6.2e-05,2.5e-05,7.4e-05,8.2e-05,0.000106,6.9e-05,5.4e-05,4.8e-05,1.8e-05,6e-06,2e-05,0.000232,0.000172,6.5e-05,1.5e-05,2.7e-05,1.5e-05,1.1e-05,9e-06,9e-06,7e-06,7e-06,2.9e-05,3.1e-05,7e-06,2.9e-05,1.4e-05,1.2e-05,1.5e-05,1.4e-05,1.5e-05,9e-06,3e-06,1e-05,1.9e-05,9e-06,1.4e-05,9e-06,1.7e-05,1.1e-05,1.7e-05,3e-06,3.6e-05,1.1e-05,2.2e-05,1.3e-05,1.2e-05,6e-06,6e-06,1.2e-05,8e-06,1.2e-05,9e-06,4e-06,8e-06,6e-06,6e-06,1.1e-05,9e-06,2e-06
2e-06,1e-06,1e-06,5e-06,8e-06,5e-06,4e-06,2e-06,5e-06,2.5e-05,0.000103,9.1e-05,0.000108,4.5e-05,6.3e-05,2.3e-05,5.7e-05,4.2e-05,9e-05,0.000145,3e-04,0.000143,6.2e-05,1.5e-05,6e-06,0.000183,0.000239,0.000305,0.000315,0.000197,0.000282,0.000273,0.000272,0.00044,0.000356,0.000394,0.000508,0.000234,0.000369,0.000118,0.00036,0.000268,0.000208,0.000527,6.4e-05,0.000258,0.000298,0.000143,0.000276,0.00027,8e-05,0.000139,6.1e-05,0.000125,0.000285,9.6e-05,0.000192,6.9e-05,0.000206,3.7e-05,0.000107,0.000138,0.000108,5.3e-05,0.000103,8.1e-05,3e-05,6.2e-05,3.9e-05,1e-05,5e-06,1.2e-05,0.000226,0.000202,0.000106,4.9e-05,5.1e-05,4.9e-05,3.2e-05,1e-05,7e-06,1.6e-05,9e-06,2.5e-05,7e-05,3.7e-05,1.8e-05,1.6e-05,1.1e-05,1.7e-05,4e-06,1.5e-05,1.5e-05,1.2e-05,1.7e-05,2e-05,1.7e-05,1.9e-05,8e-06,1.6e-05,2.7e-05,4e-06,4e-06,2.4e-05,3e-06,2.3e-05,1.2e-05,7e-06,2e-06,7e-06,3e-06,1.1e-05,7e-06,4e-06,1e-06,2e-06,1.2e-05,1.6e-05,1.6e-05,2e-05,1.4e-05
2e-06,3e-06,1e-06,1.1e-05,1.1e-05,6e-06,8e-06,6e-06,6e-06,2.6e-05,6.1e-05,5.8e-05,1.4e-05,0.000114,9.2e-05,3.5e-05,4e-05,9.9e-05,2e-05,5.5e-05,0.000157,8.8e-05,5.8e-05,2.4e-05,1.2e-05,0.000163,0.000348,0.000452,0.000438,0.000265,0.000353,0.000391,0.000267,0.000341,0.000327,0.000609,0.000305,0.000169,0.000169,0.000106,0.000262,0.000285,0.000259,0.000213,0.000343,0.000184,0.000179,0.000289,0.00061,0.000141,1e-04,0.000168,0.000175,0.000292,0.000279,0.000117,0.000162,0.000135,0.000186,0.000159,3.3e-05,0.000145,0.000161,0.000132,1.3e-05,4.6e-05,4.1e-05,9.3e-05,8.6e-05,5.4e-05,2.9e-05,5e-05,0.000207,0.000279,0.000164,7.9e-05,5.9e-05,3.1e-05,3.4e-05,7e-06,1.4e-05,1.3e-05,4e-06,3.5e-05,6.7e-05,4.3e-05,3.9e-05,2.5e-05,1.6e-05,1.2e-05,1e-05,1.1e-05,3.2e-05,1.3e-05,1.6e-05,7e-06,2.9e-05,3.4e-05,4.2e-05,2.7e-05,3e-05,2.2e-05,8e-06,2.6e-05,1.1e-05,1.2e-05,1.4e-05,9e-06,1.5e-05,9e-06,1.5e-05,1.1e-05,8e-06,1.2e-05,7e-06,5e-06,1.5e-05,2e-06,1.4e-05,2e-06,8e-06
5e-06,2e-06,4e-06,7e-06,4e-06,2e-06,6e-06,5e-06,7e-06,2.6e-05,8.9e-05,0.000107,4.4e-05,0.000102,0.00011,4.3e-05,1e-05,8.7e-05,2.8e-05,1.9e-05,1.1e-05,1.6e-05,2.9e-05,2.3e-05,6e-06,0.000163,0.000205,0.000139,0.000225,0.000392,0.000101,6.7e-05,0.000348,4.6e-05,0.000132,0.000291,0.000401,0.000253,0.000285,0.000351,0.000192,0.000223,0.000198,0.000193,0.000324,0.00014,0.000151,8.9e-05,0.000553,0.000266,0.000219,0.000193,0.000265,9.6e-05,0.000258,0.000168,9.1e-05,0.000184,0.000124,8.7e-05,0.000192,0.00018,9.4e-05,8.8e-05,6.8e-05,0.000122,0.000103,0.000117,3.8e-05,2e-05,8e-06,4.3e-05,0.000144,0.000187,9e-05,5.1e-05,2e-06,1.5e-05,8e-06,2.3e-05,1.9e-05,1.7e-05,1.5e-05,5.1e-05,1.3e-05,2.4e-05,4.1e-05,2.4e-05,1.3e-05,3e-06,5e-06,1.6e-05,4.2e-05,2.5e-05,1.8e-05,1e-05,2.6e-05,2e-05,1.6e-05,3e-06,1.2e-05,5e-06,1.8e-05,2.4e-05,2.4e-05,2.1e-05,9e-06,1e-05,1.2e-05,6e-06,2.2e-05,1.1e-05,2.1e-05,1.2e-05,9e-06,1.2e-05,1.6e-05,1.6e-05,5e-06,7e-06,5e-06
5e-06,5e-06,1e-06,0,2e-06,2e-06,3e-06,3e-06,3e-06,2.1e-05,0.000113,9e-05,8.4e-05,0.000139,7.3e-05,1.7e-05,1.1e-05,6.2e-05,0.000125,6.3e-05,0.00016,0.000112,7e-06,6e-06,2.1e-05,0.000202,0.000124,0.00013,0.000218,0.000188,7.2e-05,0.000301,0.000172,7.8e-05,0.000299,0.000126,0.00015,0.000117,0.000278,0.000159,0.000292,0.00015,0.000213,0.00017,0.000179,0.000287,0.000452,0.000309,0.000393,6.6e-05,0.000233,0.000167,0.000326,0.000134,0.000167,0.000189,0.000113,6.3e-05,0.000161,0.000107,8e-05,0.000134,6.5e-05,0.000147,0.00011,0.000114,3e-05,5.1e-05,2.8e-05,1e-05,1.4e-05,4e-05,0.000174,2.9e-05,5.9e-05,5.6e-05,2.9e-05,2.6e-05,2.5e-05,2.2e-05,2e-05,1.7e-05,4e-06,3.9e-05,6e-05,4.5e-05,2.3e-05,9e-06,8e-06,6e-06,8e-06,8e-06,3.3e-05,3.2e-05,1.6e-05,6e-06,6e-06,5e-06,8e-06,1.3e-05,1.1e-05,5e-06,1.6e-05,3.5e-05,1.2e-05,4e-06,2e-06,8e-06,6e-06,1.1e-05,6e-06,6e-06,1.4e-05,1.7e-05,2.4e-05,3e-06,1.7e-05,4e-06,6e-06,2e-06,8e-06
2e-06,2e-06,4e-06,4e-06,3e-06,2e-06,1e-06,4e-06,6e-06,2.1e-05,9.7e-05,0.00019,0.000147,7.2e-05,0.000123,5.6e-05,3.9e-05,0.000191,0.000159,0.000142,0.00021,5.4e-05,2.6e-05,3.1e-05,3.1e-05,0.000205,0.000179,0.000318,0.000168,0.000325,0.000276,0.000398,0.000131,0.000114,0.00024,0.000139,6.2e-05,0.000138,7.9e-05,3.7e-05,0.000153,0.000213,0.000236,0.000316,0.000252,0.000204,0.000465,0.000168,9.7e-05,0.000134,0.000111,8.3e-05,0.000187,0.000149,0.000103,7.8e-05,3.7e-05,8.2e-05,0.000225,0.000139,5.6e-05,0.000179,9.9e-05,9e-05,0.000143,0.000119,5.4e-05,2e-05,1.2e-05,2.5e-05,1e-05,1.6e-05,0.000135,6.4e-05,6e-05,7e-06,6.4e-05,5.1e-05,2.1e-05,4e-06,2.5e-05,2.5e-05,9e-06,3e-05,5.7e-05,2.7e-05,1e-05,3.1e-05,2.2e-05,9e-06,1.3e-05,9e-06,2.7e-05,8e-06,3e-06,4e-06,8e-06,9e-06,1e-06,5e-06,9e-06,1.3e-05,3e-06,2.2e-05,1.3e-05,6e-06,1e-05,1e-05,1.1e-05,1.5e-05,1e-05,3e-06,1e-05,1.2e-05,9e-06,1.1e-05,6e-06,1.4e-05,7e-06,9e-06,3e-06
3e-06,2e-06,4e-06,1e-06,4e-06,2e-06,4e-06,5e-06,7e-06,2.8e-05,8.6e-05,0.000242,0.000121,0.000149,6.7e-05,5.5e-05,9e-06,0.000224,0.000132,0.000103,0.000126,0.000129,5.7e-05,6e-06,1e-05,0.000183,0.000427,0.000375,0.000522,0.000329,0.000219,0.000224,0.000129,0.000238,0.00022,0.000258,0.000292,0.000265,0.000302,0.00012,0.000288,0.000186,0.000162,0.000162,0.000227,0.000133,0.000282,0.000168,0.000198,0.000163,3.4e-05,6.8e-05,0.000286,0.000125,0.000201,4.5e-05,5e-05,9e-05,5.7e-05,8.8e-05,7.4e-05,0.00013,9.7e-05,0.000119,1.3e-05,4.2e-05,5e-05,6.3e-05,6.1e-05,1.4e-05,2.8e-05,1.8e-05,0.00014,9.2e-05,8.6e-05,4.7e-05,6.9e-05,5.5e-05,3e-05,1.7e-05,2e-05,2.8e-05,6e-06,3e-05,2.5e-05,1.5e-05,1.9e-05,3.7e-05,1.9e-05,9e-06,1.3e-05,1.1e-05,1.8e-05,1.6e-05,9e-06,6e-06,1.4e-05,1e-05,7e-06,3e-06,1.7e-05,1.3e-05,1.8e-05,2.7e-05,1.1e-05,5e-06,1.4e-05,5e-06,1.4e-05,1e-05,7e-06,2e-06,7e-06,9e-06,4e-06,6e-06,3e-06,7e-06,1e-06,1.4e-05,1e-05
5e-06,3e-06,3e-06,1e-06,2e-06,3e-06,7e-06,7e-06,3e-06,2.4e-05,7.7e-05,0.000155,0.000103,8.2e-05,0.000103,3.5e-05,5.5e-05,0.000173,9.9e-05,8.7e-05,0.000121,7.3e-05,2.2e-05,1.1e-05,1.5e-05,8.4e-05,0.000416,0.000172,0.000426,0.000118,9.2e-05,0.000249,0.000145,0.000248,0.000342,0.000457,4.1e-05,0.000176,0.000148,0.000254,0.00027,7.4e-05,0.000148,0.00023,4e-05,0.00017,8.6e-05,0.000157,0.000296,0.000159,0.000201,0.000119,0.000415,0.000151,0.000236,7.3e-05,0.000105,6.5e-05,9.3e-05,4e-05,1.1e-05,6.7e-05,2.2e-05,0.000103,6.2e-05,2.7e-05,4.2e-05,3.8e-05,5.6e-05,3.6e-05,4.4e-05,3.4e-05,0.000105,0.000179,9.8e-05,1.1e-05,0.000102,5.9e-05,2.8e-05,1.9e-05,2.5e-05,1.6e-05,2.3e-05,3.8e-05,5.1e-05,2.2e-05,3.1e-05,3.3e-05,1.2e-05,5e-06,6e-06,1.2e-05,1e-05,1.6e-05,1.1e-05,6e-06,1.1e-05,3e-06,5e-06,2e-06,1.6e-05,3e-06,1.1e-05,1.2e-05,1.6e-05,1.5e-05,7e-06,8e-06,1e-05,4e-06,4e-06,5e-06,1.4e-05,1.2e-05,6e-06,7e-06,2e-06,9e-06,3e-06,1.4e-05,9e-06
2e-06,1e-06,2e-06,3e-06,2e-06,1e-06,7e-06,1e-06,2e-06,2.3e-05,8.4e-05,0.000142,0.000262,0.000159,7.1e-05,6e-06,4e-05,0.000245,0.000124,0.000121,0.000135,4.4e-05,2.5e-05,2.5e-05,1.8e-05,7.4e-05,0.00027,6.7e-05,0.00038,7.1e-05,0.000119,0.000348,4.8e-05,9.9e-05,0.000168,4.3e-05,0.000227,0.000176,0.000133,0.000216,0.000247,0.000214,0.000213,0.000364,0.000187,0.000154,0.000135,6.3e-05,0.000551,0.000311,0.000134,5.1e-05,0.000374,0.000191,0.000119,6.4e-05,0.000157,3.9e-05,9.1e-05,0.000113,0.000106,0.000146,8.4e-05,9.1e-05,9.5e-05,7.2e-05,2.2e-05,7.9e-05,3.1e-05,2e-05,2.2e-05,1.6e-05,0.000104,0.000386,0.000202,5.2e-05,7.2e-05,0.00014,6.4e-05,3.1e-05,3.5e-05,3.4e-05,1.7e-05,4.2e-05,2.6e-05,2.1e-05,3.6e-05,1.3e-05,9e-06,2e-06,7e-06,4e-06,1.6e-05,1.6e-05,1.4e-05,9e-06,1.9e-05,3e-06,7e-06,5e-06,2e-05,6e-06,6e-06,1.5e-05,4e-06,1.3e-05,4e-06,1.2e-05,1.6e-05,8e-06,4e-06,4e-06,8e-06,3e-06,2e-06,6e-06,3e-06,7e-06,8e-06,9e-06,7e-06
3e-06,4e-06,3e-06,3e-06,1e-06,4e-06,4e-06,2e-06,4e-06,2.2e-05,9.1e-05,0.000201,0.000363,0.000144,0.000144,5.5e-05,4e-05,0.000272,0.000226,2.8e-05,0.000117,7.8e-05,4.5e-05,7e-06,1.1e-05,0.000115,8.1e-05,0.000386,0.000482,0.000263,0.000254,0.000183,3.9e-05,3.5e-05,5.5e-05,0.000112,0.00017,0.000238,0.00017,0.000214,8.7e-05,0.000277,7e-05,0.000261,0.000379,0.000242,9.1e-05,0.000132,0.000615,0.000228,0.000351,0.000254,0.000363,0.000262,0.000173,0.000213,0.000116,9.2e-05,0.000107,5.6e-05,0.000103,0.000195,9.1e-05,0.000207,0.00022,8.6e-05,8.5e-05,0.000139,1e-04,5.6e-05,2.7e-05,1.9e-05,0.000114,0.000626,0.000284,0.000113,6.2e-05,1e-04,7.4e-05,3.9e-05,2.3e-05,8e-06,1.5e-05,3.3e-05,1.8e-05,2e-05,1.6e-05,1.6e-05,6e-06,5e-06,9e-06,2e-05,3.6e-05,3.2e-05,1.8e-05,6e-06,1.8e-05,2.6e-05,2.2e-05,5e-06,1.7e-05,1.3e-05,1.2e-05,1.8e-05,3e-06,1.8e-05,1.6e-05,9e-06,8e-06,8e-06,1.6e-05,8e-06,4e-06,1e-06,4e-06,3e-06,2e-06,1.3e-05,1.6e-05,4e-06,8e-06
3e-06,1e-06,3e-06,4e-06,2e-06,1e-06,3e-06,4e-06,3e-06,2.5e-05,7.4e-05,8e-05,0.000163,0.000177,0.000165,5.7e-05,2.3e-05,0.000323,0.000262,0.000276,0.000207,0.000127,3.4e-05,3e-05,1e-05,8.6e-05,0.000144,0.00022,0.000309,0.000201,8.6e-05,0.000195,0.000179,5.2e-05,0.000227,0.000212,0.000107,0.000249,1.3e-05,0.00014,0.000346,0.000219,0.000111,0.000125,0.000357,0.000155,0.000193,0.000198,0.000508,0.000487,0.000415,0.000179,0.000319,0.000177,0.000144,0.000279,0.000308,0.000143,0.000169,0.000178,8.4e-05,6.1e-05,7.7e-05,0.000239,0.00012,5.2e-05,5.3e-05,0.000104,0.000131,7.9e-05,2.9e-05,1e-05,8.5e-05,0.000645,0.000446,0.000209,4.9e-05,6.9e-05,4.8e-05,2.2e-05,1.7e-05,1.6e-05,5e-06,2.5e-05,2.9e-05,1.8e-05,2e-05,1.3e-05,5e-06,7e-06,4e-06,1.8e-05,2.9e-05,1e-05,1e-06,6e-06,1e-05,2.3e-05,1.4e-05,1.3e-05,1.6e-05,2e-05,7e-06,2.3e-05,1.2e-05,2e-05,1.9e-05,2e-05,2.5e-05,2.1e-05,5e-06,2e-06,7e-06,1e-05,3e-06,7e-06,7e-06,1.8e-05,2.2e-05,2.1e-05,1.6e-05
1e-06,2e-06,2e-06,2e-06,4e-06,3e-06,3e-06,2e-06,2e-06,2.3e-05,4.5e-05,6.5e-05,6.1e-05,7.2e-05,4e-05,3.6e-05,2.4e-05,0.00031,0.000117,9e-05,0.000188,0.000176,0.000103,3.9e-05,7e-06,5e-05,0.00018,9.1e-05,0.000134,9e-05,0.000131,0.000315,0.000181,0.000226,0.000107,0.000105,0.000136,0.000165,0.000229,0.000168,0.000323,0.000328,6.6e-05,0.000228,0.000398,0.000127,0.000235,0.000162,0.000152,0.000199,0.00012,0.000151,8.1e-05,0.000172,0.000202,0.000336,0.000273,0.000134,0.000152,7.5e-05,7.3e-05,7.6e-05,9.4e-05,0.000186,0.000187,0.000112,4.9e-05,6.5e-05,6.3e-05,2.2e-05,7e-06,1.2e-05,7.8e-05,0.000427,0.000235,0.000101,2.3e-05,3.5e-05,8e-06,1e-05,1.7e-05,1.8e-05,9e-06,2.3e-05,6e-06,4e-06,2.2e-05,6e-06,9e-06,8e-06,5e-06,1.2e-05,1.6e-05,2e-06,6e-06,2e-06,3e-06,1.2e-05,2e-06,4e-06,4e-06,7e-06,8e-06,2.2e-05,1.2e-05,1.8e-05,7e-06,5e-06,9e-06,4e-06,2e-06,2e-06,1.1e-05,4e-06,6e-06,3e-06,3e-06,1.6e-05,1e-05,4e-06,2e-06
1e-06,1e-06,2e-06,3e-06,4e-06,1e-06,4e-06,3e-06,1e-06,2.4e-05,3.3e-05,6.4e-05,5.6e-05,4.6e-05,7.3e-05,0,8e-06,0.000247,2.6e-05,7.1e-05,0.000113,3.6e-05,2.3e-05,1.4e-05,8e-06,5.4e-05,0.000213,0.000174,0.00014,4.4e-05,7.6e-05,0.000129,0.000156,0.000364,0.000287,0.000282,0.000372,0.000422,6e-05,0.000267,5.9e-05,0.000455,0.000316,0.000189,0.000174,0.000161,9.6e-05,8.3e-05,0.000195,0.000197,0.000213,2.9e-05,0.000133,0.000119,0.000105,0.000155,1.6e-05,7.5e-05,8.3e-05,1.9e-05,2.2e-05,2.9e-05,6.5e-05,7.9e-05,0.000105,9e-06,2.6e-05,6.1e-05,2.2e-05,2e-06,3e-06,1e-05,6.7e-05,0.000144,4.6e-05,4.1e-05,2.3e-05,9e-06,4e-06,8e-06,1e-05,1e-05,4e-06,1.3e-05,7e-06,2e-06,2.1e-05,8e-06,3e-06,2e-06,6e-06,8e-06,1.1e-05,4e-06,1e-06,3e-06,2e-06,8e-06,3e-06,1e-06,3e-06,1e-06,3e-06,1.7e-05,1e-05,1.1e-05,3e-06,3e-06,5e-06,6e-06,5e-06,0,8e-06,1e-06,3e-06,2e-06,4e-06,1.2e-05,4e-06,1e-06,3e-06
1e-06,1e-06,3e-06,3e-06,2e-06,2e-06,4e-06,2e-06,2e-06,2.4e-05,2.3e-05,2.8e-05,1.7e-05,3e-05,6.5e-05,1e-05,2e-06,0.000195,6e-06,6.8e-05,7e-05,8e-06,7e-06,5e-06,3e-06,5e-05,0.000161,0.000165,9e-05,8.5e-05,1.6e-05,0.000159,0.000136,0.00026,8.6e-05,0.000186,0.000174,0.000263,8.9e-05,0.000197,0.000259,0.000129,0.000174,0.000238,0.000119,5.7e-05,0.000226,0.000106,0.000155,0.000133,9.8e-05,2.4e-05,7.7e-05,0.000112,0.000105,0.000104,5.8e-05,3e-05,6.4e-05,1.1e-05,4e-06,3.4e-05,5.1e-05,6.2e-05,7.2e-05,3.3e-05,1e-05,4.6e-05,2e-05,4e-06,4e-06,1.3e-05,5.6e-05,4.4e-05,1.1e-05,1.7e-05,1.1e-05,8e-06,8e-06,9e-06,8e-06,6e-06,2e-06,7e-06,2e-06,3e-06,2e-05,2e-06,5e-06,3e-06,5e-06,4e-06,9e-06,2e-06,4e-06,3e-06,1e-06,8e-06,2e-06,1e-06,2e-06,1e-06,2e-06,1.8e-05,9e-06,1.3e-05,3e-06,2e-06,4e-06,6e-06,5e-06,0,6e-06,1e-06,3e-06,2e-06,4e-06,1e-05,4e-06,1e-06,0
1e-06,2e-06,3e-06,2e-06,3e-06,2e-06,4e-06,2e-06,2e-06,2.4e-05,1.1e-05,2.6e-05,6e-06,3e-05,6.1e-05,1e-05,9e-06,0.000187,4e-05,5.5e-05,6.4e-05,5e-06,5e-06,3e-06,4e-06,4.6e-05,9.2e-05,0.000197,0.000157,0.000122,3.6e-05,0.000244,0.00016,0.000119,0.000145,0.000108,8.8e-05,0.000307,0.000113,0.000159,0.000271,0.000138,0.000182,0.00017,0.000133,8.3e-05,0.000177,2.3e-05,0.000115,0.000126,0.000143,4.1e-05,0.000111,9.3e-05,0.000107,7.2e-05,4.6e-05,3.5e-05,5.2e-05,1.3e-05,9e-06,3.6e-05,4.7e-05,5.1e-05,6.2e-05,3.6e-05,7e-06,3.4e-05,1.7e-05,1e-06,3e-06,1.1e-05,4.6e-05,4.1e-05,4e-06,1.3e-05,1.2e-05,7e-06,9e-06,6e-06,9e-06,6e-06,3e-06,5e-06,3e-06,3e-06,1.8e-05,3e-06,3e-06,5e-06,2e-06,4e-06,1e-05,2e-06,2e-06,3e-06,1e-06,7e-06,1e-06,1e-06,3e-06,1e-06,1e-06,1.6e-05,7e-06,9e-06,1e-06,1e-06,3e-06,5e-06,4e-06,1e-06,7e-06,1e-06,3e-06,2e-06,4e-06,9e-06,3e-06,2e-06,2e-06
