-0.001336,-0.010812,-0.008647,-0.012785,-0.008565,-0.008964,-0.008276,-0.01024,-0.011852,-0.010969,-0.002278,-0.017481,-0.021733,-0.018269,-0.002026,-0.020915,-0.015215,-0.025643,-0.012993,-0.008929,-0.021975,-0.026186,-0.011703,-0.011533,-0.022419,-0.023493,-0.015422,-0.000809,-0.012342,-0.031614,-0.022576,-0.018504,-0.013397,-0.017867,-0.016265,-0.009061,-0.017041,-0.033858,-0.03002,-0.015171,-0.020273,-0.010575,-0.014503,-0.026113,-0.018637,-0.017169,-0.012973,-0.023366,-0.026319,-0.013552,-0.005484,-0.019437,-0.005395,-0.024806,-0.021819,-0.024895,-0.010528,-0.016337,-0.007372,-0.008959,-0.027339,-0.013847,-0.004031,-0.014295,-0.014137,-0.022865,-0.03423,-0.013928,0.004576,-0.022154,-0.031463,-0.022341,-0.024943,-0.024211,-0.018671,-0.020747,-0.025212,-0.020466,-0.007465,-0.026632,-0.011001,-0.020787,-0.017284,-0.012583,-0.024375,0.002307,-0.013042,-0.008871,-0.031451,-0.012891,-0.022577,-0.011293,-0.028785,-0.012004,-0.018193,-0.026124,-0.014591,-0.019246,-0.019247,-0.009408,-0.014058,-0.020413,-0.003446,-0.002814,-0.020275,-0.013358,-0.003487,-0.013125,-0.010872,-0.011938,-0.015765,-0.005785,-0.026167,-0.030811,-0.018785,-0.015997,-0.01492,-0.016005,-0.026353,-0.01979,-0.016241
-0.001168,0.002166,0.005146,0.008716,-0.003083,-0.000674,0.000339,-0.001476,0.003037,-0.008275,-0.007205,0.000424,0.00713,0.005327,-0.003821,0.004029,0.001379,0.016376,0.012208,-0.000437,0.007183,0.011268,0.006638,-0.015095,0.00792,0.012174,-0.003142,-0.013826,-0.004056,0.011179,-0.000274,-0.008269,-0.009604,0.003619,0.006494,-0.009249,-0.002835,0.010904,0.018497,0.013178,-0.000184,0.005788,-0.012966,-0.014086,-0.003247,0.002508,-0.016633,0.003789,0.024977,0.008442,0.003945,-0.012509,0.01735,0.018315,0.00133,-0.004783,0.002551,-0.002113,-0.016428,-0.018358,0.010031,-0.005936,-0.01098,0.002103,-0.010592,0.001552,-0.000585,0.010397,-0.021292,0.000899,0.001806,0.010865,-0.001973,0.010777,5e-05,0.012582,-0.000907,-0.018869,-0.005318,-0.00053,-0.002787,-0.004609,0.003853,-0.007173,-0.000131,-0.001551,-0.004722,-0.011082,-0.000393,-0.003417,-0.00406,-0.010564,0.012656,0.005056,0.010894,0.007052,0.000889,-0.008427,0.002875,-0.005259,0.002162,0.006517,0.010729,0.009633,0.008538,0.016359,-0.000995,0.000249,-0.01521,-0.019039,-0.009556,0.00432,0.000164,0.002601,0.003927,-0.005068,0.017602,-0.020053,0.001641,0.001904,0.004041
-0.002207,-0.006223,-0.002616,-0.004022,0.00908,-0.000638,0.005578,0.006587,-0.000477,0.001731,-0.000578,-0.004195,-0.003014,-0.002932,0.000463,0.002651,0.003285,-0.011035,-0.006634,-0.005577,0.006823,-0.011592,-0.009075,0.00838,-0.003798,-0.004293,-0.011573,-0.000123,0.01553,-0.0066,0.000603,0.014818,0.006109,-0.017571,-0.007007,-0.012691,-0.011253,-0.00612,-0.014989,-0.016003,-0.010599,0.004884,-0.00339,0.008677,0.007761,-0.00472,0.020681,0.001309,-0.00504,-0.010917,-0.008426,0.000944,-0.00813,-0.014798,0.000913,-0.004269,-0.000794,0.005331,0.000178,0.010433,-0.005984,0.006372,0.009026,-0.013391,0.001461,-0.005565,0.003196,0.001789,0.012525,-0.006136,-0.002516,-0.014425,0.002712,-0.000559,0.012294,0.004471,0.003138,0.008868,0.007966,-0.002816,-0.009757,0.002066,0.013202,0.008238,-0.007034,0.006943,0.007447,0.008835,0.00527,-0.000342,0.012924,0.004649,0.006247,0.0016,-0.005106,-0.014647,-0.008438,0.001081,-0.013348,0.003019,0.005218,0.003537,-0.018153,-0.011856,-0.010645,0.000825,0.002716,0.002744,0.000855,0.009409,-0.003591,-0.008193,-0.009044,0.003995,-0.011959,0.011468,-0.010098,0.009561,0.005436,-0.002294,0.01284
-2.1e-05,-0.002405,5.2e-05,0.000489,-0.01068,-0.001408,-0.007996,-0.009127,-0.000658,-0.010336,0.002262,0.003609,-0.004644,0.002888,0.000207,-0.004147,0.003676,0.005745,0.006868,-0.000886,8e-04,0.010206,0.005358,0.006941,0.001858,0.005839,0.013141,0.006096,-0.003934,0.004122,-0.007091,-0.011768,-0.006365,0.005297,-0.001114,0.008311,0.005877,-0.014584,0.008114,-0.000374,0.004943,-0.005051,-0.00204,0.002556,-0.002183,0.007688,-0.015274,-0.015512,0.006502,0.012501,0.005796,0.010442,0.004019,0.007023,0.011832,0.008202,-0.006032,-0.002434,0.006824,-0.016053,-0.018027,-0.001328,-0.008591,-0.009672,-0.000476,0.005568,-0.002075,0.002776,0.005449,0.003584,0.010351,0.008195,0.011561,0.001076,-0.002926,0.003637,-0.006633,-0.008903,-0.011276,0.001099,-0.005667,-0.012685,-0.014145,-0.01364,-0.000523,-0.01331,-0.006009,-0.012177,-0.000714,0.012703,-0.009707,-0.022745,-0.005457,-0.003452,-0.005877,0.009271,-0.001041,0.00335,0.003074,-0.005017,-0.011584,-0.004829,0.003421,0.005041,0.001943,-0.003294,-0.001498,0.006325,-0.004543,-0.004308,0.011776,0.007549,0.016064,0.005907,-0.002611,0.001596,0.001922,-0.002425,0.006685,0.000652,-0.003636
-0.001036,0.001726,0.002252,-0.00271,-0.001288,-0.007278,0.002206,0.003896,-0.003886,0.001935,-0.005322,-0.008144,-0.000323,-0.000182,-0.007929,-0.002502,0.003211,-0.006242,-0.008354,-0.007698,-0.008193,-0.008584,-0.008716,-0.007403,-0.009948,-0.003122,-0.009915,-0.007554,5.1e-05,-0.002666,-0.001102,0.001802,-0.005337,-0.008069,-0.010786,-0.004857,-0.011267,-0.001157,-0.005568,-0.011604,-0.000156,0.005717,-0.004096,-0.008085,-0.003993,-0.007514,0.002725,0.002166,0.002421,-0.003902,-0.010626,-0.013607,-0.014815,-0.013077,-0.011932,-0.012629,-0.001539,-0.007886,-0.00292,0.000417,0.003927,-0.007489,0.009571,-0.001268,0.010602,0.001245,0.003716,-0.007845,-0.001426,-0.011951,-0.009313,-0.0045,-0.015001,-0.009538,-0.002413,-0.002046,-0.010735,0.005311,-0.005351,-0.009977,0.00515,0.000572,-0.004982,0.005123,0.003283,0.010954,0.003023,-0.009988,-0.003492,0.000492,-0.008847,0.006362,0.000749,-0.008502,0.005264,0.002701,-0.008147,-0.003264,0.006378,-0.003239,-0.0086,-0.003485,-0.011205,-0.016198,-0.008858,0.000101,-0.003518,-0.016367,-0.003405,-0.007226,-0.010308,-0.006133,-0.01181,-0.00369,0.001734,-0.004721,-0.001792,0.001995,0.000457,-0.010659,-0.00119
-0.001869,-0.000972,-0.003186,0.001893,-0.002476,0.00356,-0.004244,0.002848,0.003899,0.001911,-0.005551,-0.000872,0.002995,0.000516,0.000765,0.009527,-0.005056,-0.002232,-0.004383,-0.003397,0.002038,0.008273,-0.000453,0.007409,0.00345,0.005603,0.005639,0.00497,0.009378,0.000578,0.003964,0.010735,0.004916,-0.003362,-0.001847,-0.003242,0.01299,0.006842,0.00816,0.008862,0.008517,-0.002405,0.000915,-0.006164,-0.003643,0.005348,0.000357,0.00178,-0.000771,-0.004542,-0.006808,0.000241,0.006193,0.004341,0.007721,0.003575,0.002145,0.000626,0.001072,-0.002093,-0.000459,-0.004722,-0.006299,-0.000199,-0.004262,-0.001499,0.000794,0.012459,0.000423,0.003603,0.00328,0.01244,0.009926,0.003871,0.001872,-8.1e-05,0.009626,0.000862,-0.00114,-0.007261,-0.002236,-0.001223,0.002285,0.009397,0.000458,-0.013086,0.010976,0.010724,0.007415,-0.002898,0.002339,-9.5e-05,0.004474,0.007817,-0.00179,-0.009108,0.006632,0.005674,-0.00029,-0.001383,0.011963,0.015201,0.004286,-0.008082,-0.001946,-0.000989,-0.004341,-0.002572,0.005992,0.012765,0.016252,-0.00642,-0.002614,0.003372,0.002423,6.5e-05,-0.008729,-0.001949,-0.006788,0.003517,3e-06
0.002722,-0.003374,-0.001562,0.003808,0.003893,-0.006143,-0.003993,-0.004601,0.001328,0.00076,0.00219,0.002929,-0.002845,-0.000824,7e-04,0.000341,0.004312,0.004707,0.00099,0.002362,-0.000623,-0.00801,-0.005515,-0.004072,0.003574,1.7e-05,-0.009536,0.001629,-0.003776,-0.004276,-0.001688,-0.009119,-0.005456,-0.002854,0.003926,-0.008579,-0.005616,-0.00325,-0.00403,-0.002416,-0.009233,0.004782,-0.004156,0.009636,0.003868,0.001069,0.002948,-0.007472,-0.001621,-0.004534,0.005259,0.000647,-0.009453,0.010816,-0.004315,-0.002284,-0.007929,0.000645,0.004891,-0.007147,-0.001874,0.009219,0.000643,0.00233,-0.002641,0.007288,-0.000699,-0.009345,-0.005715,0.004405,-0.001139,-0.001882,-0.007142,-0.00772,-0.00939,0.00332,-0.001243,0.00244,-0.005947,0.000695,-0.007199,-0.008787,-0.00688,-0.004057,-0.000675,0.001603,0.001365,-0.004824,-0.003083,0.001691,0.004023,-0.001772,-0.001222,-0.009521,-0.005598,-0.006866,-0.003873,-0.007367,0.002499,0.00162,-0.001396,-0.006137,-0.003371,-0.006077,-0.00306,-0.00067,-0.002094,-0.00709,0.000688,-0.002211,-0.004152,-0.004258,0.009153,-0.006719,0.002311,0.001708,0.005756,0.00599,0.006642,-0.003302,-0.00442
-0.002499,0.00121,-0.003256,-0.004111,-0.00201,0.000211,-0.002393,0.003852,-0.000674,-0.001841,0.000762,-0.002026,-8.7e-05,0.001348,0.000997,-0.002455,-0.004647,-0.006714,-0.001534,0.000858,-0.004578,0.008433,0.00088,0.001541,-0.00442,-0.005744,0.005249,0.00499,-0.004606,-0.001349,-0.002006,0.003093,0.001116,0.000822,0.004473,0.003892,-0.00195,0.011007,0.001214,0.002374,0.00254,-0.004097,0.003399,0.001236,-0.005402,0.002813,-0.002534,0.000282,-0.006878,0.000139,-0.000584,0.001398,0.007183,-0.001532,0.001231,-0.003402,0.002674,-0.006515,-0.003147,-0.000461,-0.001135,-0.007683,0.002147,-0.001987,-0.002399,-0.005752,-0.002613,0.004613,3e-04,0.001101,-0.004473,-0.004084,0.004666,0.002922,0.007386,-0.012643,-0.002214,0.005465,0.005827,0.009923,0.004929,0.000986,0.002063,0.003972,-0.00559,-0.004875,0.001984,-0.001187,-0.007637,0.003501,-0.00318,0.006965,0.004933,0.004879,-0.005286,-0.000364,-0.002035,-0.00165,-0.000422,-0.003473,-0.00277,-0.006099,-0.000483,0.002481,0.005004,0.002741,-0.00149,0.000103,0.004973,0.004738,-0.006,0.004301,-0.001484,0.00279,-0.005596,-0.006177,-0.007706,0.00061,0.002777,-0.001742,-0.00788
0.000905,0.002346,-0.000209,0.003068,8.3e-05,0.003256,0.004777,-0.00272,0.000899,0.001296,0.00365,0.000852,0.003968,-0.004458,-0.002334,-0.000623,-7.7e-05,-6.6e-05,0.000329,-0.005375,-0.000218,0.003367,-0.002057,-0.00078,-0.000265,-0.000975,-0.001093,-0.005566,3.6e-05,0.002104,0.005385,-0.008988,3.9e-05,0.001158,-0.007841,-0.001463,-0.003831,-0.005943,-0.003611,-0.004557,-0.002997,0.006691,-0.003653,-0.005296,0.004889,0.001223,0.002479,0.000504,-0.0019,-0.004954,-0.004857,0.004041,0.000293,0.00212,-0.001765,-0.002386,0.001583,0.003913,-0.002789,0.003014,0.001569,-0.003832,-0.005842,-0.000366,0.002624,0.000252,0.000876,0.003399,-0.000732,-0.001854,0.003604,0.000522,-0.003337,-0.000684,-0.005357,0.000811,-4e-06,-0.000421,0.001549,-0.004704,-0.004955,0.004353,-0.007496,-0.004019,0.006006,0.003192,-0.003719,-0.002353,0.001223,-0.002283,0.002246,-0.001252,0.000191,-0.003344,-0.011954,-0.008621,-0.001856,0.000786,0.006231,-0.006132,0.002024,0.000467,-0.004549,0.004381,0.000756,-0.003802,0.003242,0.0041,-0.003015,-0.006297,-0.000725,-0.000839,0.001601,0.007108,0.006232,-0.003166,0.002323,0.000649,-0.008854,-0.005291,0.003605
-0.002009,-4e-04,0.001724,-0.002626,-0.000753,-0.001079,-0.002291,-0.000352,-0.001333,-0.001537,0.000293,0.000912,-6.8e-05,0.000442,0.00076,0.001524,0.002715,-0.00023,0.000244,0.007841,0.000767,-0.005581,0.002289,-0.004113,-0.001458,-0.001254,-0.0034,0.003477,0.00426,-0.002384,-0.00359,0.004952,-0.002888,-0.00292,0.002221,0.000772,0.001436,0.000404,-0.001529,0.004273,0.003614,-0.004259,0.001115,0.003164,0.00054,0.000846,-0.002428,-0.004297,0.00265,0.000736,0.00225,-0.000677,-0.004562,-0.003401,0.000698,0.004485,-0.003138,-0.005945,-0.000941,-0.000943,0.000417,-0.003762,-0.002251,-0.000329,-0.001649,-0.002558,0.001271,-0.00894,0.000856,0.006245,0.004339,0.002091,0.001938,-0.00386,0.001049,-0.002009,0.006182,-0.004032,-0.000871,0.002402,-0.002299,-0.001453,0.001007,0.000227,0.002153,-0.000637,0.004381,-0.001261,-0.001091,-0.005641,-0.001957,-0.001389,-0.002428,-0.002977,0.007002,0.008571,0.009679,0.003639,-0.009814,0.003753,0.002025,0.001337,-0.000511,-0.00418,-3.6e-05,0.000635,-0.001242,-0.00376,0.003583,0.006188,-0.004535,-0.000496,-0.006008,-0.006243,-0.005151,0.004062,0.002727,-0.001263,0.003277,0.007767,-0.003194
0.001452,0.001139,-0.000506,0.002837,-0.000532,-0.000179,0.003404,-0.001815,0.000602,0.000356,-0.001157,0.002611,-0.001574,0.000531,-0.002738,-0.003696,-0.00354,0.002925,8.6e-05,-0.004019,0.000667,0.002335,-0.000844,0.002513,0.000419,-0.001624,0.001232,-0.004138,-0.004114,-0.001097,-0.001624,-0.003897,-0.001663,0.001886,0.001997,0.006531,0.003294,0.000454,0.000551,0.000286,0.001495,-0.004919,-0.00033,-0.001477,-0.000701,-0.003584,0.003887,-0.000606,-0.003427,-0.004267,-0.001075,0.00067,0.000396,0.001593,-0.004243,-0.002112,0.000114,0.007306,-0.000295,-0.001271,0.000862,-0.00404,9e-04,0.002084,0.004903,-0.001085,-0.000573,0.004215,-0.000727,-0.001814,-0.008958,-0.002361,-0.005346,-0.000965,0.001564,-0.000952,-0.002693,0.004443,0.001109,-0.000331,-0.000238,0.002574,-0.00213,-0.001799,-0.001478,0.001109,-0.005539,0.004921,0.000135,0.00435,0.004784,0.001829,-0.003075,-0.000888,0.000399,-0.002123,-0.00219,0.001003,0.00153,0.002871,0.000758,-0.000935,0.000512,-0.000721,-0.002514,0.003173,0.001038,0.002002,0.001784,-0.001058,0.000346,-0.001887,0.003088,0.00335,0.003734,-4.6e-05,-0.005204,-0.001014,-0.004195,-0.004866,0.003293
-0.001758,0.001546,-0.00072,-0.001645,0.000789,-0.001142,-0.00105,-0.00082,0.00107,0.000286,-0.001135,0.000895,0.003474,-0.000666,0.003914,-0.000156,-0.001023,-0.001642,-0.001179,0.003317,0.001851,0.00065,-0.000858,-0.005893,-0.000593,0.002787,-0.001847,0.003897,0.00295,0.004045,-0.000514,0.003235,-0.00061,-0.000787,0.001171,0.000701,-0.003411,-0.002216,0.001312,0.000207,0.00263,0.004139,0.001568,0.005223,0.000977,0.004365,-0.001923,0.002046,0.003952,0.004449,0.002839,-0.004528,0.004244,0.000465,-0.001572,0.002314,0.004901,-0.001976,-0.001581,0.000694,0.000766,0.007693,0.004807,-0.001654,-0.002917,0.002106,-0.001333,-0.000599,0.000654,0.002892,0.001249,-0.000478,0.004176,0.000976,-0.001596,0.000503,0.002971,-0.00298,0.001267,-0.00012,0.003426,-0.002074,-0.000315,-0.002789,0.002877,-0.002581,-0.001002,0.001989,0.00105,-0.001617,0.000989,0.001639,7.7e-05,0.000336,-0.000727,0.002193,0.001953,-0.001446,0.002986,0.000214,0.000708,0.002259,0.00176,-0.000317,-0.001203,0.00391,-0.001464,-0.001981,0.000927,0.000392,0.002087,-0.00501,-0.005574,0.000192,-0.000438,0.001681,0.000607,0.000877,0.001096,-0.000786,-0.001904
0.000468,-0.001017,0.001209,-0.001533,-0.001197,0.000928,0.000499,0.000823,-0.000865,0.000196,0.000282,-0.001491,-0.000985,-0.000335,-0.003308,0.001099,0.000122,-0.000392,0.000649,-0.003061,-0.000195,0.000364,0.003598,0.003376,-0.000616,-0.001356,0.002001,-0.003523,0.002614,-0.00176,-0.001549,-0.003315,0.001616,-4e-05,-0.002954,-0.000406,0.000269,0.000135,0.001572,0.001637,-0.000258,0.003191,-0.000839,-7.8e-05,0.000501,-0.003752,0.002747,-0.000252,-0.000643,-0.001863,0.000176,-0.000606,-0.000744,-0.004799,-0.002745,-0.002307,-0.002386,-0.000372,0.003119,0.001193,-0.001866,-0.001083,-0.007309,0.001447,-0.000632,-0.001803,-0.003184,0.000535,-0.001089,-0.00289,0.004086,0.000828,0.000386,-0.000982,-0.000731,-0.002056,4.2e-05,0.002182,-0.001422,0.000367,0.000297,0.002439,0.000455,-0.001244,-0.001633,-0.000333,-0.00445,0.001799,-0.000775,-0.001316,-0.001258,-0.003099,-6e-04,0.001024,0.002633,-0.001813,-0.001222,0.00171,-0.001698,-0.003043,2.9e-05,0.000495,0.00021,-0.003004,0.000595,-0.001611,-0.00099,0.000264,-0.004846,0.000541,0.001227,0.002636,0.002984,0.000174,-0.003311,-0.000278,0.003947,-0.003046,-0.001462,0.003343,0.002786
0.000521,0.000814,0.000157,-0.00028,0.00107,-0.001077,-0.000311,-0.000149,0.000533,0.00071,0.000492,-7.8e-05,-0.001362,0.002009,0.003479,-0.000466,-0.000268,0.001611,0.001017,0.001819,0.000849,-0.003373,-0.000902,-0.003974,-0.000436,0.000168,-0.001708,-0.000949,3.9e-05,-0.001316,0.001076,0.003191,-0.000904,0.001301,0.002358,-0.002048,0.000491,0.000847,0.000737,-0.000754,2.2e-05,-0.001975,-0.00049,-0.0019,-0.00207,-0.001724,-0.001133,-0.0035,-0.000313,0.002153,0.000584,0.000724,-0.000562,0.001686,0.003138,-0.001061,-0.000943,-0.00054,-0.001724,-0.00287,0.001559,0.000397,0.002169,0.001056,-0.000938,-0.003351,0.002129,-0.000247,0.000628,0.000624,-0.000936,-0.000441,4.7e-05,-0.001065,0.000468,0.002349,-0.001251,-0.001469,-0.001038,-2.3e-05,-0.000282,0.000107,0.000436,-0.000782,-0.002237,0.001958,0.001325,-0.000515,0.000574,0.00301,0.001042,0.001603,0.000819,-0.000928,-0.001195,0.001839,0.001184,-0.001216,0.002142,0.002019,-0.001077,0.000471,-0.000713,0.004708,-0.000944,-0.001304,0.000853,0.000746,-0.000144,0.000845,0.001799,0.001876,-0.001048,-0.00037,0.002236,-0.002056,-0.000806,-0.000214,0.002273,-0.000343,-0.003178
-0.000326,0.000635,-0.000458,-0.000154,-0.001355,0.000744,0.000872,0.001193,-0.000176,-0.000345,0.001024,-0.000495,0.000989,-3.9e-05,-0.002052,0.000418,0.000676,-0.001333,-1.3e-05,-0.000418,-0.000366,0.000897,-0.000883,0.003172,0.001073,0.000829,0.002251,0.000849,-0.002971,0.000232,-0.001097,-0.000781,0.001542,-0.001412,-0.002062,0.000374,0.000473,-0.00077,4.8e-05,0.000765,-0.001036,-0.001029,0.000403,-0.000217,-0.001615,0.001954,0.002365,0.002075,-0.000598,0.000275,2e-05,-0.00031,-9.5e-05,0.000587,0.00058,0.002383,0.002025,0.000433,0.002685,0.001561,0.001195,-0.000191,-0.000956,-0.001188,-0.001357,0.000518,0.000151,0.000718,-0.000206,7.4e-05,0.000498,0.001605,-4.9e-05,-0.00093,0.001102,0.001276,0.001458,0.00133,0.001046,-0.00044,1.1e-05,0.001148,0.00127,-4e-06,0.000814,-0.000435,0.000146,0.000863,0.000139,-0.004226,-0.000414,0.001459,8.3e-05,0.001011,-0.001061,-0.001309,-0.00053,0.000153,0.000325,0.000879,0.000281,-0.001662,-0.000387,0.000525,0.000837,-0.000483,0.001222,-0.001374,-0.001475,0.000213,-0.001086,-0.001576,-0.002536,-0.001693,0.000403,-0.000534,-0.000783,0.00059,-0.001221,3.7e-05,0.002193
0.000342,0.00013,0.00021,0.000291,0.000927,0.000228,-0.000495,-0.000771,-0.000178,1.5e-05,-0.000693,0.000576,8.9e-05,-0.00041,0.000767,-0.000935,0.001338,0.001363,-2e-06,-4.5e-05,-0.00025,-0.000247,0.000761,-0.000895,-0.000654,-0.000441,-0.000198,-0.001162,-0.000353,0.00016,0.000654,-0.000738,-0.001925,0.001792,0.002256,-0.000656,-0.000566,-0.003294,-0.000563,-0.000619,-0.000438,-0.000103,-0.000509,0.000957,0.001284,-0.001421,-0.001253,-0.000321,-0.000834,-0.001858,0.001029,0.000309,-0.000303,-0.002081,0.001104,-0.000648,-0.000178,0.000331,-0.002114,0.001216,-0.001137,0.000626,-7.1e-05,0.000472,0.001209,-0.000597,0.00128,-0.000437,0.000112,-0.000416,0.00033,0.001096,-0.002057,0.001396,-0.001025,-0.002525,-0.002166,-0.000727,0.000432,0.000259,1.1e-05,0.001942,-0.000912,-0.000772,-0.000996,-0.000593,0.000451,0.001602,-0.000452,-7.8e-05,0.000148,-0.002258,-0.000203,0.00029,-0.001056,0.001527,-7.7e-05,-0.000664,-0.000875,-0.001206,-0.000344,-0.000691,-9.9e-05,-0.000964,-0.001161,0.000214,-0.002065,0.001231,-0.000998,-0.000985,0.000893,0.001908,0.001449,0.000471,-4.6e-05,-0.000179,0.000188,-0.000537,0.002528,-0.001394,-0.000341
-4.8e-05,4e-06,0.000115,6.7e-05,-0.000102,-0.000461,0.000374,0.001195,-0.00031,0.000231,-0.000196,0.000415,-0.001256,0.000545,0.000147,0.001493,-0.000171,-8.1e-05,-0.000322,0.000739,6.7e-05,-0.001859,0.000224,0.000975,0.000676,-0.000275,-0.001892,0.001148,0.000868,-0.000679,0.000541,-0.001074,0.00099,0.000381,-0.000437,0.001262,-0.000661,0.002406,-0.001148,0.000123,-0.00053,-0.001535,0.000533,0.000451,-1.3e-05,0.000639,-0.000348,-0.001322,-0.000212,0.000418,0.000519,-0.001923,-0.001086,0.000767,0.000464,0.000831,-0.000795,-0.000389,0.000458,-0.001214,-0.000536,0.000285,0.000921,1.7e-05,-0.001238,0.000599,-0.000273,-0.000956,0.000501,-0.000158,1.9e-05,-0.000363,0.002052,-0.000906,-2.6e-05,0.001422,0.000415,0.001096,0.000258,0.000576,-0.000608,2.2e-05,-0.00107,0.000824,0.000485,-0.00014,0.000539,-0.000631,-0.000223,0.000572,0.000471,0.000526,0.001092,-0.000616,-0.001157,-0.000813,0.000144,0.000608,-0.00012,-7.9e-05,0.000466,0.000113,-8.9e-05,-0.000611,-0.000808,-0.000847,0.000157,-0.001059,-0.000631,0.00078,-0.002059,-0.000536,-0.000126,-0.001272,-0.000698,1.1e-05,-0.000499,0.000332,-0.001328,0.001091,-0.000109
-0.000164,0.000377,-1e-06,-0.000929,6e-05,9.3e-05,0.000129,-0.000702,-0.000105,0.000177,-0.000336,-0.000427,-0.000427,-0.000219,-0.000252,-0.00045,0.000117,-0.001241,8e-06,-0.001097,-0.000109,0.001568,-5.1e-05,-5.8e-05,-0.000692,-0.000749,0.001734,-0.001669,-0.000455,0.000234,-0.000152,-9.2e-05,-0.000561,-0.000771,-0.000645,-0.00038,0.001455,0.001107,-0.000112,-3.6e-05,0.000459,0.001047,-0.000531,-0.00018,0.000803,-0.000273,0.000739,0.000229,0.000824,-0.000138,-0.000668,0.000429,0.001187,-0.000319,-0.001006,-0.000169,0.000354,-0.00036,0.000383,0.000427,0.001075,0.000587,0.000182,0.000289,0.001856,0.001452,0.001008,0.002372,-0.000369,-0.000725,0.00068,-0.000835,-0.001082,0.000922,0.000193,-0.00135,-0.000796,2.1e-05,-0.000542,-0.000525,5e-05,-0.000618,0.000434,0.000726,-8.3e-05,5e-05,0.001183,0.00034,3.8e-05,0.000876,-0.000468,0.000679,-9.7e-05,-0.000104,2.9e-05,0.000912,0.000719,-0.000595,-0.00013,-0.000165,-0.000291,-0.000437,-0.000277,-6.6e-05,0.000536,-0.00032,0.000101,0.00033,-0.000393,-0.000909,-0.000593,-0.001263,-0.000834,-0.000204,0.000447,0.000194,0.000833,-0.000282,0.000704,-0.000241,-0.000673
0.000179,5.2e-05,1.6e-05,0.001114,-0.000179,-0.000442,0.000289,0.000159,-6.2e-05,-0.000297,0.000249,6.7e-05,0.001115,-0.000181,0.000195,-0.000106,-0.000789,0.001165,0.000425,0.001258,-2.3e-05,0.000199,0.000318,3.1e-05,0.000453,0.000124,-0.001333,0.001011,-0.000594,0.000498,9.8e-05,-8.2e-05,0.000119,0.000653,-0.000304,0.00066,0.000168,-0.001003,-0.000262,0.000414,-6.1e-05,8.8e-05,0.000563,-0.000886,-0.001015,0.000797,-0.000323,0.000783,-0.000341,-0.000199,0.000507,-0.000788,0.000358,0.000892,0.000411,-0.000744,0.000838,0.000806,-0.001076,-0.000172,-0.000268,-0.00259,-0.000595,-7e-05,-0.001037,-0.000257,-0.000635,-0.00082,-5.6e-05,-0.00017,-0.001631,-0.000153,0.000753,-0.001361,-0.000356,-3.4e-05,-1.9e-05,3.6e-05,0.000273,0.000401,9.7e-05,0.000536,0.000341,0.000413,-0.000439,-0.000849,0.000881,-0.000427,-0.000207,-0.000761,-0.000187,-0.00039,6.9e-05,7.9e-05,0.002247,0.000138,-0.000731,0.000355,0.000261,0.001335,-0.000733,0.000663,0.000176,-0.000156,-8.4e-05,-0.000225,-0.000188,0.000347,9.6e-05,-0.000224,-0.000904,0.000572,0.00092,0.001447,3.9e-05,0.000895,-0.000507,0.000474,-0.000996,0.000222,0.001163
-0.000235,-0.000233,4e-05,-0.000273,9.2e-05,0.000566,-0.000501,-0.000347,-0.000149,0.000361,0.000202,-0.000167,-0.00054,7.2e-05,0.000233,-0.000235,-0.000308,-0.000244,3.2e-05,-0.001194,0.000574,-0.000442,-7.5e-05,0.000256,-2.6e-05,0.000324,0.000571,-0.000323,0.000977,-7.6e-05,-4.6e-05,-0.000295,-0.000162,6.6e-05,0.001358,-0.000609,-0.000615,0.000467,1.8e-05,-0.000399,5.1e-05,0.00064,-0.000568,-0.000262,8.9e-05,-5e-06,-0.000165,-0.001084,0.000647,0.000204,0.000171,0.001466,-0.001395,0.000759,-0.000938,0.001202,-0.000879,-0.000414,0.000403,0.000199,-0.000702,0.001102,0.000361,-0.000151,0.000436,0.000738,0.000133,-0.000752,-0.000248,-0.00018,0.001167,0.000423,-0.000442,0.000384,0.000594,-9e-05,-0.000672,-0.000466,0.000103,-0.000118,-0.000206,0.000449,1.6e-05,0.000268,0.000358,0.000826,-0.000434,0.001277,0.000316,0.000643,7.3e-05,-0.000331,0.000387,-0.000137,-0.000587,0.000112,-0.000552,-0.000584,-0.001374,-6e-05,0.000546,-9.8e-05,-1e-05,0.001424,0.000117,0.000521,0.000141,-0.000736,0.000174,-0.00028,-0.000148,0.000548,-0.000892,-0.000756,-0.000244,-0.000443,5.2e-05,0.000241,0.000567,-0.00112,0
0.000165,6.3e-05,0.000231,0.000174,0.000123,-0.000363,0.000437,-1.5e-05,0.000205,-0.00021,0.000151,-8.4e-05,-0.00062,-7e-05,-0.00099,0.000213,0.000134,-0.000361,-6.2e-05,0.001137,-9.9e-05,-0.000154,0.000103,-0.000405,-0.000173,-0.000253,-3.5e-05,0.000581,0.000851,-0.000487,0.000231,0.000678,-0.000277,0.00035,-0.000618,-0.000259,-0.000192,0.000512,0.000586,8e-05,-7e-05,-0.001508,0.000533,0.000489,-0.000301,0.00044,-0.000361,-0.000167,0.000268,0.000478,7e-06,-0.000185,0.000527,-0.00077,0.000538,-0.001401,-3.1e-05,0.000618,-0.000108,-0.000392,0.000533,-0.000413,0.000424,-2e-05,-0.000495,-8.1e-05,-0.000535,0.00029,0.000385,-1.6e-05,0.000809,-0.000857,4e-06,-0.000893,-0.000444,-0.000718,0.000179,0.000602,-0.000415,-0.000212,0.000292,0.000628,-0.000411,-0.00013,-0.000827,-0.000319,0.00033,-0.000262,-9.2e-05,0.000234,-0.000108,0.000895,-0.000719,-7.4e-05,-0.000255,0.000305,0.000257,0.000119,0.000145,-0.00058,0.000228,0.000321,1.2e-05,-6.3e-05,-0.000559,0.000262,-7.5e-05,0.000837,0.000734,-9.5e-05,0.001003,-0.000468,0.000518,-0.000116,-0.000223,-0.000241,0.000639,0.000239,-0.000937,0.001395,-0.000176
-0.000163,0.000119,-1.1e-05,-0.000146,-0.000177,0.000171,-0.000243,-0.000156,-0.000182,0.000191,-0.000348,-3e-06,0.000532,3.4e-05,0.001465,-6e-06,-4.3e-05,0.000763,-3.6e-05,-0.001116,-4.6e-05,0.00116,0.000165,-5.8e-05,3.4e-05,0.000322,-0.000254,-0.000353,-0.000621,0.000392,-0.000165,-9.2e-05,-0.000103,-0.000159,-0.000295,-0.000331,0.000482,0.000598,0.000316,-1.2e-05,-0.000399,0.00063,-0.000337,-1.9e-05,0.000308,-1.5e-05,0.000234,0.000547,-0.000661,-0.000595,0.000442,0.000399,-5.1e-05,0.000313,-0.000595,0.000709,0.000967,-0.000879,-6e-06,0.000279,0.000223,0.001747,-0.001059,0.000174,-0.000106,-0.000376,0.000663,0.000464,-0.000155,-0.000464,-0.001403,0.000322,0.000122,0.000935,0.000104,0.001292,-0.000664,-0.000938,0.000498,-7.5e-05,0.000183,-0.000159,6.4e-05,3.1e-05,0.000307,0.000221,-0.000707,-9.1e-05,0.000198,-0.000638,0.000334,-0.000678,-0.00027,-6.5e-05,0.000975,8.5e-05,-0.00023,-0.000153,0.000882,-0.000573,-0.000518,-0.000146,-6.2e-05,-0.000318,8.6e-05,-0.000231,-0.00011,-0.000737,8.1e-05,9.8e-05,-0.000121,0.000274,-0.000526,0.000283,0.000496,-6.9e-05,-0.000728,-9.1e-05,0.000517,-0.000158,-0.000249
0.000137,-0.000266,-0.000169,-6.2e-05,0.000207,-2.2e-05,0.000213,-0.000204,6.2e-05,-0.00013,-0.000101,-0.000136,0.00016,0.000189,-0.001517,-0.000352,2.8e-05,-0.00057,-0.000118,0.001062,-5.6e-05,-0.000341,-0.000228,-5.4e-05,-0.000101,0.000116,0.000256,-1.4e-05,-0.000717,-0.000147,-0.000197,0.000661,4e-06,0.000146,0.000198,-0.000373,7.2e-05,8.7e-05,0.000479,-0.000128,-0.00026,0.000722,6.5e-05,-0.000375,-0.00021,0.000289,0.000179,-0.000458,-0.000104,0.000864,-0.000303,-0.000199,0.000382,1.7e-05,8.3e-05,0.000246,-0.000536,0.000307,0.000188,0.000371,-0.000458,-0.00058,0.000618,2e-06,0.000168,-0.000207,-0.00049,-0.000313,-2e-06,0.000532,0.000235,-6.7e-05,0.000304,-0.000605,3.4e-05,-0.00015,1e-04,0.000549,0.000277,0.000365,-0.000351,1.7e-05,0.000283,-0.00047,0.000473,-0.000461,9.6e-05,-0.000191,3.6e-05,0.00049,-0.000403,-0.000293,0.00017,7e-05,-0.001357,0.000313,-4e-06,-0.000113,-0.001017,0.000794,-1e-04,-2.7e-05,-1.6e-05,-0.000939,-0.000109,-0.000839,0.00014,0.000291,0.000535,-0.000261,0.001047,-0.000558,0.000472,-0.000272,-0.000711,-0.000357,9.4e-05,-0.000101,-0.000457,-0.000683,0.000462
-1.7e-05,-0.000111,0.000118,0.000386,-0.000231,-0.000132,-0.000126,0.000386,0.000124,0.000248,-8.9e-05,0.000158,-0.000511,-6e-05,0.001282,8.8e-05,0.000214,0.000194,4.6e-05,-0.000745,-0.000178,-0.000388,0.000225,-0.000343,0.00012,-9.9e-05,-0.00032,0.000269,0.000323,-0.00039,0.00011,-0.00074,6.2e-05,0.000314,-4.2e-05,0.000487,-0.000398,0.000358,-0.000208,0.000177,-0.000235,0.000149,4.9e-05,-0.000557,0.000428,-0.000597,-0.000473,-0.000489,-0.000161,-0.000713,1.2e-05,-0.000477,-0.000777,0.00067,-0.000422,-0.00016,-0.000322,0.00019,0.000126,-0.000619,5.5e-05,-0.000114,-0.000668,-0.000172,-6.6e-05,-0.00059,0.000229,-0.000164,0.000113,-0.000237,0.000909,0.000204,-0.000247,0.00013,-7.5e-05,-0.000378,-2.1e-05,-0.000585,-0.000245,-0.000198,-0.000205,2e-04,-5.8e-05,-0.000394,-0.000258,0.000298,-0.000951,-9.3e-05,-1.7e-05,-1.7e-05,5e-06,0.000961,-0.000194,0.000229,-0.00036,-1.5e-05,-0.000174,0.000102,0.001014,0.000114,0.000254,-0.00022,-5.6e-05,0.000712,-4.1e-05,9.6e-05,-0.00028,6.1e-05,0.000232,0.000162,-9.1e-05,-0.000109,-0.000749,0.00025,0.000718,0.000199,0.000649,7.2e-05,0.000564,0.000427,-0.000306
-1e-04,2.2e-05,8e-05,-0.00022,0.000166,5.7e-05,0.000253,-4.1e-05,-0.000135,-0.000235,0.000194,5.2e-05,0.000118,-4.1e-05,-0.000801,0.000133,-6.4e-05,0.000294,0.000134,0.000448,7.9e-05,0.000988,0.000109,0.000453,3e-05,1.9e-05,0.000473,-0.00034,-3.4e-05,0.000217,-0.00018,0.000466,-0.000127,-0.000215,0.000279,-1.6e-05,1.7e-05,-0.000319,-0.000245,-0.00028,9.7e-05,-0.001078,-0.000128,3.1e-05,-0.000164,0.000314,4.9e-05,0.000407,-4.3e-05,0.000419,0.000181,0.000358,0.000701,-0.00025,0.000383,0.000282,0.000505,-8.8e-05,-5.4e-05,0.000264,0.000324,-0.000294,0.000483,1.4e-05,0.000402,-0.000186,-0.000306,0.000631,-9.1e-05,0.000231,-0.000581,0.000166,2e-06,-0.000582,4.4e-05,0.000633,-0.000215,0.000142,-0.000242,-2e-06,0.000273,-0.000243,2.3e-05,-0.00035,0.000466,-0.000344,-9.2e-05,0.000173,-0.000147,-0.000804,-0.000196,-0.000452,0.000155,-0.000276,0.000168,0.000417,7.8e-05,-7.4e-05,-0.000141,-0.000322,6.3e-05,-0.000239,-2.9e-05,4.1e-05,-0.000143,0.000477,0.00016,-0.000358,0.000218,-0.000104,-0.000285,0.000707,0.000125,6.9e-05,-0.000491,0.000353,-0.000639,-0.000195,-6e-06,-1e-04,0.000123
0.000169,-0.000234,-0.000108,-0.000253,-0.000103,-0.000128,-0.000212,0.000171,4.3e-05,0.00024,7.9e-05,-6.9e-05,0.000553,9.8e-05,0.000109,6.1e-05,9.1e-05,-0.000488,-7e-06,-0.000152,-2.3e-05,-0.000486,-0.000245,-0.00053,-1e-04,-0.000285,-0.000379,0.000411,-0.000421,0.000172,-2.6e-05,-0.001051,4.4e-05,0.000235,-0.000154,4.1e-05,0.000304,-1.6e-05,-0.000454,0.000164,8.1e-05,0.00049,0.000193,0.000349,8e-06,-7.8e-05,0.000252,-0.000152,0.000174,-0.000301,-3.1e-05,-0.000138,-0.000432,-0.00087,2.9e-05,-0.000538,3e-05,8e-05,2e-06,-9.1e-05,-0.000184,0.000851,-5e-06,0.000142,-0.000335,0.000132,0.000285,-0.000791,2.4e-05,-9.5e-05,0.000137,-0.000378,-0.000198,0.000257,-0.000125,-0.000791,0.000328,-0.000147,0.000155,0.000171,-0.000318,0.000102,-0.00028,-2e-04,-3.1e-05,0.00034,-0.000295,-0.000515,-4.7e-05,0.000774,0.000102,-0.000293,-1.2e-05,0.000142,-0.000125,-0.000272,-2.4e-05,0.000178,-0.00018,-7e-06,-6.2e-05,0.000368,3.2e-05,0.000328,-0.000221,0.000192,0.000105,0.000556,-9.8e-05,0.000197,-0.000228,-7.5e-05,0.000121,6.2e-05,0.000125,-0.000112,0.00024,-8.7e-05,0.000231,0.000225,-0.000114
-0.000164,-0.000143,4.5e-05,0.000171,0.000149,0.000236,7e-06,-5.1e-05,3e-05,-0.000214,4.4e-05,-2.7e-05,-0.000366,-6.7e-05,0.000483,-0.000149,7.8e-05,0.000139,-2.8e-05,-0.000137,-2.4e-05,-0.000313,0.000126,0.000734,4e-06,0,0.000155,-0.000603,0.000169,-0.000178,5.8e-05,0.000704,-0.000212,-1.3e-05,-0.000114,-5.1e-05,4.1e-05,0.000215,-0.00029,-8.1e-05,0.00025,-0.00018,-0.000233,-6e-06,2.1e-05,-0.000485,-0.00036,-0.000474,0.000183,7e-06,-7.7e-05,0.000487,-7.9e-05,0.00049,0.000491,0.000457,-0.000473,-0.000307,-9e-05,8.1e-05,-5e-05,-0.000404,-0.000111,-9.5e-05,0.000142,-0.000205,-4.6e-05,0.000269,-0.000117,0.000108,-8e-05,0.000563,-2.1e-05,-0.000255,0.000205,0.000326,-0.000206,0.000153,0.000129,-0.000172,-8e-06,-1e-06,0.000156,-3.2e-05,-0.000223,-0.000187,0.000334,-5e-06,-8.7e-05,-0.000383,-8.9e-05,0.000381,-0.000108,8.7e-05,0.00077,0.000564,-8.4e-05,-0.000179,0.000105,0.000273,-0.000177,-0.000165,-2.5e-05,0.000201,5.5e-05,-0.00028,-0.00021,-0.000543,7.7e-05,-7.5e-05,-0.000607,-0.000286,-0.000539,6e-05,5e-05,4.7e-05,7.6e-05,-8.5e-05,-7.4e-05,-0.000423,0.000293
0.000111,2e-05,9.4e-05,-0.000137,-0.000166,-0.000191,-4.6e-05,0.000158,-7e-06,0.000219,-0.000135,-7.9e-05,-0.000171,-6.4e-05,-0.000784,0.000129,-7.1e-05,0.00019,-4.8e-05,0.000385,0.000177,0.000293,0.000122,-0.000618,3.3e-05,3.4e-05,-2.4e-05,0.000454,0.000779,-3.8e-05,3e-06,-0.000914,2.7e-05,0.000147,-0.000194,-0.000117,-0.000238,-0.000549,8.2e-05,2.2e-05,6.1e-05,5.6e-05,0.000256,-0.000236,-0.000167,0.000352,0.00028,0.00013,0.000113,6.3e-05,8e-06,-0.000398,0.000433,2e-05,-3.9e-05,-0.000155,0.000238,0.000312,-3.4e-05,-7.5e-05,0.000235,0.000214,-9e-06,-4.8e-05,-0.00016,0.000218,0.000275,0.000342,0.000112,0.00018,-3.7e-05,-4e-04,0.000447,4e-05,-0.00013,-0.000266,0.000293,-7.9e-05,-0.000108,-1.7e-05,3.2e-05,-2.3e-05,-5e-06,-4.5e-05,0.000242,5.1e-05,-1.2e-05,-0.000212,4.1e-05,0.000179,3.4e-05,0.000147,0.00029,-0.000108,0.000206,-0.000311,-0.000115,0.000103,-8.3e-05,0.00023,0.000169,9.2e-05,-1.7e-05,-0.000401,-0.000127,1.6e-05,0.000151,0.000314,-0.000229,5.8e-05,3.9e-05,0.000247,0.000369,-0.000259,-1.7e-05,8.8e-05,-0.000444,2.6e-05,-5.1e-05,3e-04,-0.000191
-4.7e-05,-0.000122,-1.5e-05,0.000254,8.4e-05,6.6e-05,6.1e-05,-0.000121,1.7e-05,-0.00022,-5.1e-05,7.2e-05,0.000415,4.8e-05,0.000806,4e-05,1.3e-05,-0.000275,-5e-06,-0.000495,-6.2e-05,7.9e-05,-0.000134,0.00068,3.4e-05,-7.5e-05,-0.000207,-0.000313,-1e-05,7e-05,2.1e-05,0.000887,-2.2e-05,0.000115,0.000589,-0.000149,1.9e-05,0.000101,0.000122,-2.5e-05,4.7e-05,0.000292,-0.000254,-0.000179,-1.2e-05,-0.00025,-0.00037,0.000107,7e-05,2.8e-05,-2.2e-05,-0.000221,-0.000265,-0.000148,-2.6e-05,-9.4e-05,0.000286,-4.7e-05,8e-06,-5.5e-05,-0.000132,-0.000901,-4.3e-05,3.7e-05,-9.3e-05,6.6e-05,1.7e-05,-0.000277,0,3.6e-05,0.000175,1.3e-05,-0.000364,-0.000284,2.1e-05,-0.000294,-7e-05,0.00013,1.7e-05,0.000107,8.3e-05,-0.00015,1.1e-05,0.000298,-0.000195,-7.9e-05,0.000337,9.4e-05,7.9e-05,-1.6e-05,-0.000103,-0.000606,7.5e-05,-2.4e-05,-0.000417,0.000391,0.000217,-8.8e-05,0.000117,-0.00024,0.000165,0.000146,2.5e-05,-0.000364,-9.8e-05,0.000195,-4.6e-05,-9.3e-05,-0.00017,8.7e-05,-0.000131,-0.000254,-0.000201,0.000304,5.5e-05,-0.000352,0.000561,-4.5e-05,-9e-05,-7.9e-05,0.000133
1e-06,-0.000156,-3.7e-05,-0.000293,1.3e-05,-4.4e-05,-4.9e-05,-8.9e-05,-3.2e-05,0.000203,-3e-06,3.8e-05,1.3e-05,-2.5e-05,-0.000554,0,-9.9e-05,0.000208,6.2e-05,0.000579,-6e-05,-0.000596,3.8e-05,-0.000518,-1e-06,0.000232,0.000194,0.000114,-0.000493,-5.2e-05,-2e-05,-0.000478,-0.000148,-0.000175,-0.000379,8e-06,0.000126,2.2e-05,0.000403,1.7e-05,-6.7e-05,2.7e-05,0.000233,0.000196,9.1e-05,0.000137,0.000482,-0.000381,-0.000231,3.4e-05,-4e-06,-0.00018,6.3e-05,-4.3e-05,-0.00012,0.000284,-0.000392,-9.1e-05,-0.000163,0.000232,-0.000142,0.000587,0.000228,1.5e-05,3.8e-05,3.8e-05,0.000163,-2.4e-05,3.2e-05,4e-06,-0.000447,9.5e-05,0.00023,2.3e-05,2.7e-05,0.000645,0.000222,-5.6e-05,7.9e-05,-0.000122,-0.000174,-0.00013,1.8e-05,0.000135,7.9e-05,0.000107,0.000265,-9.3e-05,2.9e-05,6e-06,0.000132,0.000417,-5.2e-05,2.6e-05,0.000166,-0.000137,-6.7e-05,9.1e-05,-0.000291,-0.000148,-0.000224,-1.6e-05,1.8e-05,0.000438,-8.2e-05,0.000136,-0.00013,-0.000197,-0.00014,-2.1e-05,0.000352,-9.9e-05,-0.000189,-7.8e-05,-0.000148,7e-06,-0.000169,0,-0.000143,0.000207,-5.8e-05
3.2e-05,1.3e-05,-1e-06,1.1e-05,-4.3e-05,-1.5e-05,6.4e-05,-1.7e-05,-1e-06,-0.000209,0.000106,0,-0.000344,6e-06,0.00019,-0.000103,-6.1e-05,7e-06,2.6e-05,-0.00059,3e-06,0.000119,2.2e-05,0.00037,-7.3e-05,-4.8e-05,-0.000133,3.5e-05,-4.8e-05,-0.000114,7.1e-05,0.000735,4.9e-05,0.000222,4.4e-05,0.00013,4e-06,-0.000295,0.000151,8e-06,-1.8e-05,-0.000385,-0.000184,0.00031,9.3e-05,-7.2e-05,-0.000427,-9.6e-05,-9.2e-05,5.2e-05,4.2e-05,1.1e-05,-0.000249,-0.000362,-0.000283,-0.000105,4e-05,3.8e-05,0.000241,-0.000288,0.000149,0.000158,-0.000271,-2.3e-05,6.6e-05,0.000273,-0.000173,-9.7e-05,-8.8e-05,-3.5e-05,2e-04,-0.00024,-0.000293,-0.000183,-8.6e-05,-0.000304,-7.1e-05,0.000183,-7.6e-05,-2.9e-05,0.000158,1.3e-05,1.2e-05,0.000265,3.8e-05,-0.000103,0.000181,-0.00026,9.9e-05,-9.7e-05,-4e-06,0.000156,-2e-06,3.1e-05,-0.000149,0.000235,2.4e-05,-1.3e-05,8.1e-05,-2e-06,1.5e-05,-0.000119,-4.2e-05,0.000152,-2.7e-05,-0.000196,0.000199,0.000375,-9.8e-05,3.3e-05,0.000293,0.000252,0.00031,-0.000251,0.000141,8.1e-05,-0.000294,4.7e-05,3.9e-05,-0.000402,-1.5e-05
-5.6e-05,-3.3e-05,3.2e-05,0.000189,5.3e-05,3.5e-05,-4.5e-05,-1.9e-05,2.6e-05,0.000208,1.5e-05,1e-05,0.000131,3.1e-05,0.00015,4.2e-05,3.3e-05,-0.000149,-2.2e-05,0.000575,-5.7e-05,0.000382,-4.2e-05,-0.000256,3.1e-05,3e-06,0.000102,-0.000179,0.000156,7.5e-05,-1.1e-05,-0.000421,-0.000154,4.1e-05,-0.000112,1.6e-05,-7.6e-05,-2.5e-05,8.4e-05,-1.7e-05,-2.2e-05,-9.2e-05,0.00014,2.8e-05,-9.9e-05,0.00012,0.000256,0.000161,-8.5e-05,-3.3e-05,-6.8e-05,0.000228,0.00048,0.000415,0.000125,3.6e-05,0.000272,-9.1e-05,-0.000115,0.000146,-3.4e-05,0.00027,0.000142,-2.2e-05,-1.2e-05,3.2e-05,-6.8e-05,0.000303,2.2e-05,8e-05,0.00039,0.000291,0.000169,7.1e-05,0.000106,0.000118,0.00016,-0.000181,-0.00013,0.000169,-7e-05,-0.000163,2.8e-05,0.000101,-0.000134,5e-06,8.8e-05,-6e-06,-3.6e-05,-7.7e-05,7.2e-05,-0.000517,-0.000143,-8.3e-05,-0.000677,-0.000117,1e-06,1.7e-05,3e-04,0.000181,0.000148,-7.7e-05,6e-06,1.6e-05,4.2e-05,-0.000239,-3.9e-05,-0.000428,-0.000136,-1.1e-05,7e-05,1.6e-05,-0.000251,0.000196,0,-7e-06,0.000532,5.9e-05,-0.000149,0.000275,-3.8e-05
3.4e-05,-0.000103,1e-06,-6.7e-05,-5.6e-05,-7.3e-05,-1.8e-05,-6.2e-05,1.8e-05,-2e-04,-1.1e-05,-2e-05,0.000263,-9e-06,-0.000329,4.4e-05,5e-06,0.000173,-2.8e-05,-0.000502,4.3e-05,-5e-04,4.5e-05,4.2e-05,2.9e-05,8.6e-05,-4.5e-05,0.00026,-0.000268,4.9e-05,-2.8e-05,0.000158,7e-06,-4.4e-05,0.000218,6.1e-05,-2.3e-05,0.00037,-0.000142,2.4e-05,6.5e-05,0.000426,-0.000108,-0.00014,7.8e-05,-4.3e-05,-7.3e-05,-0.000206,-2.6e-05,-6.4e-05,-4.2e-05,-1.2e-05,-0.000413,0.000147,-0.000166,-0.000106,-0.000169,0.000177,1.3e-05,2.1e-05,-0.000155,-0.000315,-8.8e-05,3.5e-05,7.6e-05,6.7e-05,-0.00017,-0.000246,5.9e-05,-2.8e-05,-5e-04,-0.000342,6.2e-05,-0.000134,-6.4e-05,0.000184,-4.3e-05,0.00022,0.000117,-0.000126,-3.7e-05,-0.000141,-6.1e-05,6.7e-05,1e-04,7.4e-05,-0.000134,-8.3e-05,-2.2e-05,0.000255,-7.1e-05,0.000336,1.3e-05,-4e-06,0.000281,0.000226,1.6e-05,2.1e-05,-0.000451,-5.8e-05,-9.2e-05,3.2e-05,-8e-06,0,-0.000135,3.6e-05,-0.000112,0.000326,-8.8e-05,5.1e-05,0.000119,-7.5e-05,9.9e-05,-0.000153,-0.000134,0.000163,-0.000424,5.8e-05,0.000237,2.5e-05,4.3e-05
-2e-06,-4e-06,-3.5e-05,4.2e-05,5.5e-05,9.9e-05,-2.9e-05,3.2e-05,-5e-05,0.000187,-5.5e-05,1.9e-05,-0.00028,2e-06,0.000307,-5e-05,4.1e-05,-4.1e-05,-8e-06,0.000425,2.2e-05,0.000131,-3.6e-05,3.7e-05,-2.2e-05,-0.000192,-7e-06,-0.000266,-0.000205,-5.4e-05,2e-05,-0.000228,-6.8e-05,1.9e-05,-0.000125,-1.2e-05,7.1e-05,0.000116,-0.000257,-3.9e-05,8.4e-05,-1.7e-05,6.8e-05,-2.4e-05,-0.000176,7.7e-05,6.6e-05,-0.000213,0.000101,0.000116,2.4e-05,-2.1e-05,0.000161,-0.000239,0.000198,9e-05,-0.000146,-4.4e-05,0.000172,-8.5e-05,0.000107,-0.000124,0.000177,1.3e-05,-8.9e-05,3.9e-05,-1.5e-05,2.2e-05,-5.3e-05,-1.7e-05,1.6e-05,0.00032,-1.8e-05,-6.8e-05,1.4e-05,-0.000385,4.6e-05,-0.000202,0.000117,3.5e-05,-1e-06,0.000113,4.5e-05,-2.7e-05,-0.000134,-7.7e-05,-1e-05,7.7e-05,-6.1e-05,-0.000234,2e-05,8.6e-05,2.5e-05,4.4e-05,0.000201,-0.000124,5.3e-05,-1.9e-05,0.000406,-0.00013,-2.2e-05,-1.2e-05,1e-06,-0.000177,-6.5e-05,0.000302,6.9e-05,-0.000155,1.3e-05,-4.6e-05,-0.000307,4.2e-05,-0.000151,1e-05,0.000136,4.6e-05,-2.7e-05,-2.8e-05,-0.000109,-0.000128,1.3e-05
-3.4e-05,4e-05,2.6e-05,-0.000114,-6.2e-05,-0.000106,2.2e-05,4.2e-05,-8e-06,-2e-04,-2.8e-05,-6e-06,-0.000101,1e-05,-0.000113,-2.3e-05,7.2e-05,-0.000139,1e-05,-0.000312,-1.9e-05,0.000327,-8e-06,-0.000159,-6e-06,3.6e-05,1.9e-05,0.000278,0.000435,2e-05,-1.1e-05,-0.000216,-5e-06,2.7e-05,0.000108,-7e-06,1.2e-05,-0.000199,-0.00018,6e-05,8.4e-05,-0.000213,-2.5e-05,0.00017,6.8e-05,-3.5e-05,-7.5e-05,0.000112,0.000157,-0.000184,9e-06,-0.000138,3.8e-05,2.1e-05,-0.000136,3.5e-05,0.000197,-0.000134,-0.000166,6.4e-05,7.9e-05,3e-05,-0.000296,-2.7e-05,3.6e-05,-0.000175,5e-06,0.000197,2e-05,-9e-05,0.000316,2.3e-05,-8.3e-05,-5.7e-05,-3e-06,0.000304,2.7e-05,0.000127,-0.000121,3e-05,2.9e-05,-8.3e-05,3e-06,-0.000182,-4.4e-05,5e-05,-0.000197,-0.000114,-7e-05,7.9e-05,-2.3e-05,-0.000277,-8.4e-05,9e-06,3.4e-05,9.1e-05,-3.8e-05,2.3e-05,-6.9e-05,-1.4e-05,5.9e-05,6.2e-05,1.6e-05,-0.000195,-5.1e-05,8.9e-05,-2.4e-05,-7.1e-05,1e-05,2.3e-05,-9.2e-05,-0.000138,9.1e-05,8.5e-05,-4.4e-05,-0.000146,0.00043,9e-06,0.00023,5.9e-05,-4.4e-05
7.4e-05,-3.1e-05,3.5e-05,3.1e-05,7.6e-05,4.1e-05,-6e-06,5.3e-05,3.2e-05,2e-04,1.5e-05,-6e-06,0.000274,-1e-05,-0.000191,4.1e-05,-2.7e-05,0.000157,1.7e-05,0.000206,4.8e-05,-0.000164,4.3e-05,0.000178,-9e-06,-4.3e-05,-4.2e-05,-0.000222,0.000348,2.6e-05,-1.3e-05,0.000116,-7.4e-05,6.5e-05,-0.000167,-0.000112,-2.3e-05,0.000312,-0.000137,-4.3e-05,2.2e-05,-0.000131,-2e-05,0.000199,1.7e-05,8.1e-05,8.9e-05,-8.9e-05,6.2e-05,0.000176,-4e-05,1.1e-05,-8.3e-05,5.5e-05,9.9e-05,-9.3e-05,-1e-05,0.000155,7.9e-05,-6.7e-05,-0.000127,0.000391,0.000303,-1.8e-05,-0.000106,-9.5e-05,4.1e-05,-0.000293,-3.2e-05,3.9e-05,-0.00023,-0.000239,-2.4e-05,-3.5e-05,-1.5e-05,-0.000274,-5.3e-05,-8.6e-05,-6.5e-05,-0.000138,-2.3e-05,-0.000175,-2.8e-05,-0.000133,7.4e-05,-8.6e-05,-7.6e-05,-7e-06,-9e-06,8.5e-05,2.4e-05,1e-06,5.4e-05,-4.5e-05,0.000467,1.4e-05,1.3e-05,-4.7e-05,-0.00017,0.000156,-1.5e-05,1e-06,-2e-05,0.000176,6e-06,-0.000279,3.3e-05,0.000236,0.000116,-1.2e-05,-0.000199,3.8e-05,-5.6e-05,-1.9e-05,-6e-05,-6.3e-05,-0.000471,-1e-06,-0.000148,-4.7e-05,6.3e-05
-9e-05,1.2e-05,-3.6e-05,0.000195,-6.4e-05,-3.7e-05,-3e-06,-8e-06,4e-06,-0.000192,5.9e-05,2e-05,-4.7e-05,-2.2e-05,0.000445,3.3e-05,-1.8e-05,-8e-05,-3e-06,-6.2e-05,-3.4e-05,-0.000159,-5.3e-05,-0.000125,2.6e-05,-2.9e-05,1.6e-05,0.000142,-0.000224,-3.3e-05,-2.2e-05,-0.000265,-1.4e-05,-0.000104,4.3e-05,3.5e-05,-4.5e-05,0.000229,8.9e-05,2.3e-05,-2.4e-05,0.000253,4.7e-05,-3.3e-05,1.6e-05,-6.2e-05,-6.4e-05,-0.000215,-9e-06,-0.000113,2.3e-05,0.000112,-6e-06,0.000266,-2.3e-05,0.000108,-0.000172,-0.000111,-2.6e-05,0.000108,1.2e-05,-0.000156,-0.000137,2.5e-05,0.000101,-0.000134,8.1e-05,8.8e-05,5.3e-05,-4.9e-05,4.2e-05,0.000297,1.3e-05,3e-06,3.7e-05,-7.7e-05,3.2e-05,3.8e-05,6.3e-05,5.7e-05,-2.7e-05,-5.5e-05,-7e-06,-0.000225,-7.7e-05,9.7e-05,-0.000208,1.7e-05,2.9e-05,-0.000211,2.2e-05,0.000405,1e-06,3e-05,-0.000275,-4.7e-05,5.1e-05,3.5e-05,0.00021,2e-05,-7e-06,4.1e-05,8e-06,0.000272,-3e-05,-0.000153,-2.5e-05,-0.000342,0.00011,-2.1e-05,-3.6e-05,0.000131,-0.000157,4e-05,0.000149,-1.3e-05,0.000193,1.6e-05,0.00015,1e-04,-6e-06
9.6e-05,9.4e-05,-1.6e-05,-0.000205,2.8e-05,2.2e-05,2.5e-05,2.2e-05,-9e-06,0.000182,4e-06,-6e-06,-0.000253,1.4e-05,-0.000593,-2.5e-05,-2.8e-05,-2.9e-05,-1.4e-05,-5.6e-05,-3.7e-05,0.000369,-1e-06,7.4e-05,2e-06,0.000141,-1.7e-05,-7.1e-05,-0.000257,-3.2e-05,1e-05,0.000512,-6.7e-05,9e-06,9.5e-05,4e-05,1.9e-05,1.7e-05,0.000167,-3e-06,-5.7e-05,-0.000119,-6.7e-05,-0.000168,-2e-06,7e-06,5.4e-05,1.7e-05,-9.5e-05,5.6e-05,-2.3e-05,0.000123,4.6e-05,-8.1e-05,0.000103,2.7e-05,0.000153,0.000159,-4e-05,-0.000145,0.000155,-0.000192,-0.000141,1.3e-05,-4.7e-05,-0.000157,5.9e-05,0.000176,-2.1e-05,8e-06,2.4e-05,-0.000286,9.2e-05,-0.000144,-5e-05,0.000322,-6.5e-05,-3.6e-05,5e-05,5.5e-05,5.9e-05,7.5e-05,-1e-06,-8.7e-05,3e-05,-0.000106,1e-05,5.7e-05,3.5e-05,0.000208,-2e-05,-0.000396,-1e-06,4.8e-05,-0.000141,8.3e-05,-6e-06,-2.4e-05,-0.000224,-8.4e-05,-2.5e-05,-7e-06,3e-06,-0.000155,-0.000109,0.000172,-2.4e-05,0.000322,5.7e-05,-8e-06,0.000195,-6.9e-05,0.000117,-0.000135,-0.000187,-2.2e-05,0.000198,-4e-05,-0.000221,-7.8e-05,-8e-06
-8.2e-05,3.2e-05,2.8e-05,4.6e-05,3e-06,-6e-06,-3e-05,1.1e-05,-2.5e-05,-0.000188,-1.7e-05,1.4e-05,0.000156,-4e-06,0.00057,-5e-06,-1.9e-05,0.000114,-8e-06,0.000185,4e-05,-6e-06,4.2e-05,7.4e-05,-3.6e-05,-6.7e-05,3e-06,8e-06,0.00013,2.6e-05,2e-06,-0.000299,-2.3e-05,4.4e-05,-2.2e-05,5e-06,4.9e-05,-6.4e-05,0.000256,-3e-06,-7.3e-05,0.000174,7.7e-05,-5.6e-05,2.4e-05,7.6e-05,-9.7e-05,-2.4e-05,-0.000105,1.3e-05,-1.6e-05,-1e-06,7.4e-05,-0.000264,3.6e-05,-4.7e-05,3.3e-05,-0.00019,1.1e-05,6.9e-05,-6.1e-05,-0.000146,0.00029,-2.4e-05,2.1e-05,3.4e-05,6.3e-05,-0.000105,-2e-05,-1.7e-05,-0.000106,0.000201,4.9e-05,-3e-06,3.4e-05,-0.000263,1.5e-05,4.4e-05,-5.4e-05,-7.8e-05,-6e-05,-1.5e-05,4.3e-05,-0.000103,2.5e-05,0.000129,-7.7e-05,4.5e-05,7.5e-05,-8.1e-05,4.2e-05,-5.5e-05,0.000107,-3.3e-05,3e-05,-8.2e-05,-4.4e-05,9e-06,0.000166,3.2e-05,1e-05,-6e-05,-1.9e-05,4.4e-05,-7.7e-05,0.000175,7e-05,-0.00022,4.3e-05,1e-06,7.3e-05,-3.3e-05,-0.000148,4.2e-05,0.000161,8.3e-05,-0.000432,-3.7e-05,0.000149,4e-06,-4.3e-05
3.7e-05,1.8e-05,-2e-06,-4.1e-05,-1.3e-05,-3.7e-05,-7e-06,-2.8e-05,7e-06,0.000183,-2.8e-05,-1.8e-05,0.000173,-1.1e-05,-0.00041,2e-05,4e-05,-9.4e-05,6e-06,-0.000276,-1.6e-05,-0.00035,-4.5e-05,-0.000181,2.1e-05,7.8e-05,-1.6e-05,8.2e-05,-4.5e-05,6e-06,-1.2e-05,0.000546,-2.3e-05,-1.1e-05,-5e-05,4.5e-05,-9e-06,-3.7e-05,0.00014,1.2e-05,-4.3e-05,-6.2e-05,-8.7e-05,9.2e-05,-7.6e-05,-0.000126,0.000157,-0.000177,-5.4e-05,-5e-06,2.8e-05,-0.000117,-0.000219,0.000152,3e-06,-4.7e-05,-0.000134,9.4e-05,-3e-06,4.4e-05,-8.6e-05,0.000191,-0.000239,-5e-06,7.7e-05,-4.3e-05,-1.5e-05,-1e-04,1.1e-05,-2.7e-05,0.000177,-0.000107,-0.000139,-0.00012,-1.5e-05,0.000203,-6.3e-05,-6.6e-05,-3e-05,5.5e-05,1.4e-05,-0.000101,-4e-06,1.8e-05,3e-06,-0.000143,7.2e-05,-8e-06,1.4e-05,-0.000109,-1.4e-05,0.000412,-4e-05,-2e-05,-0.00042,8.4e-05,2.2e-05,4e-06,-0.000176,9e-06,6e-05,-3.1e-05,1.6e-05,-1e-04,-3.4e-05,-0.000133,-6.8e-05,4.2e-05,7.4e-05,1e-06,0.00017,6.3e-05,5.7e-05,7.7e-05,-0.000104,9.8e-05,0.000356,1.4e-05,-0.000221,7e-06,3.3e-05
-3e-06,9.7e-05,-2.1e-05,6.8e-05,1.9e-05,4.7e-05,-2.8e-05,1.3e-05,3.4e-05,-0.000186,-1.5e-05,-1.5e-05,-0.000238,1.2e-05,0.000189,-1e-05,1.4e-05,1.9e-05,9e-06,0.000361,5e-06,0.000272,0,0.000298,7e-06,2.3e-05,9e-06,-0.000177,-0.000297,-2.8e-05,9e-06,-0.000511,-7.9e-05,-3.4e-05,-2.8e-05,-2.3e-05,-4.8e-05,4e-06,-2.4e-05,-2e-05,-1.4e-05,-0.000135,9.6e-05,7.7e-05,1.6e-05,9e-05,-0.000168,-3.3e-05,-9e-06,-1.6e-05,-2e-05,-9.6e-05,0.000187,0.000119,-1.2e-05,6.6e-05,8e-05,1.5e-05,-3e-06,-9.3e-05,0.000107,0.000246,0.000136,2.4e-05,-0.000103,6.8e-05,-1e-06,0.000104,2e-06,3.2e-05,-0.000132,-9.7e-05,3.8e-05,5.4e-05,-1.1e-05,4.6e-05,1e-05,9.4e-05,5.8e-05,-2.1e-05,-3.3e-05,4.3e-05,-4.7e-05,1e-04,-5e-06,0.000127,1.3e-05,6.8e-05,-7e-06,0.000158,1.6e-05,-0.000309,-2e-05,3.3e-05,6.2e-05,-0.000114,-2.8e-05,-4e-06,1.5e-05,5.3e-05,-7.7e-05,2.3e-05,-3e-06,-7.2e-05,-4e-06,-0.000182,-3e-06,0.000135,-5.1e-05,-1e-05,-1.1e-05,-6.9e-05,-2.7e-05,-2.4e-05,3.6e-05,-7e-06,-4.7e-05,1.9e-05,0.00019,5.7e-05,-2.6e-05
-1.9e-05,7.3e-05,3e-06,7.5e-05,-2.7e-05,-5.8e-05,3.8e-05,-5.5e-05,-7e-06,0.000183,7e-06,1.5e-05,-5.1e-05,3e-06,8e-06,-1.4e-05,-2e-05,7.9e-05,-1e-06,-0.000393,1.9e-05,6.7e-05,2.1e-05,-0.00039,1.2e-05,-0.000111,-4e-06,0.000203,7.5e-05,-7e-06,4e-06,0.000392,-4e-06,-2.8e-05,8.4e-05,2.2e-05,-6e-06,-0.000177,-0.000146,1.8e-05,2.2e-05,-0.00011,-0.000103,-6.8e-05,4.2e-05,-7.8e-05,0.000117,-2.4e-05,7.3e-05,4.2e-05,-9e-06,1.9e-05,-4.4e-05,-0.000102,-7.7e-05,4e-05,3.7e-05,-4.3e-05,3.2e-05,9.3e-05,1.1e-05,-8.7e-05,-0.000117,0,9.8e-05,0.000135,-8.3e-05,5.6e-05,1.6e-05,9e-06,-0.000119,0.000274,-9.5e-05,-0.000174,3.3e-05,-0.000265,-7.1e-05,-0.00011,7e-06,-6.9e-05,4.6e-05,2.2e-05,1.8e-05,0.000121,-5e-06,-0.00013,0.000141,1.9e-05,-2.6e-05,-0.000104,-1.5e-05,-4.6e-05,2.1e-05,2e-06,0.000262,0.000124,4e-05,9e-06,0.000218,-2.6e-05,-2.9e-05,4.1e-05,-1.2e-05,7e-06,-6.1e-05,4.2e-05,5.8e-05,-0.000283,-6.7e-05,6e-06,-0.000119,-1.6e-05,-0.000145,3.2e-05,2.1e-05,-6.3e-05,-0.000296,1.6e-05,-0.000151,-0.000102,1.9e-05
