-1e-05,-2.2e-05,-0.005897,-0.035554,-0.040184,-0.029139,-0.02088,-0.021023,-0.08602,-0.156203,-0.153817,-0.146636,-0.146432,-0.144403,-0.112041,-0.085438,-0.064865,-0.044997,-0.021458,-0.007233,-0.001317,-0.001002,-0.001473,-0.001074,-0.000552,-0.000363,-0.000303,-0.000319
-8e-06,-7e-06,0.001568,0.010033,-0.002983,-0.011139,-0.011102,-0.007171,0.037304,0.131562,0.168399,0.178196,0.186268,0.175867,0.124147,0.090096,0.072996,0.053086,0.023035,0.006268,0.00129,0.001197,0.001438,0.000774,0.000645,0.000439,0.000335,0.000368
-3e-06,-3e-06,-0.001886,-0.011544,0.001271,0.0063,-0.000397,0.000128,-0.002079,-0.018856,-0.020016,-0.006854,-0.012995,-0.003173,-0.006923,-0.014216,-0.012734,-0.005988,-0.001869,-1e-04,-0.000177,-0.000124,7.5e-05,0.000128,-4.8e-05,-4.7e-05,-1.6e-05,1e-05
4e-06,8e-06,0.004745,0.031775,0.037228,0.026861,0.015972,0.011909,-0.030878,-0.12923,-0.163307,-0.166686,-0.167079,-0.165714,-0.126815,-0.093816,-0.068886,-0.050785,-0.023289,-0.007062,-0.001378,-0.001192,-0.001442,-0.000742,-0.00062,-0.000416,-0.000345,-0.000382
2e-06,1.3e-05,0.002037,0.007517,0.000136,-0.001429,0.010317,0.012458,0.063624,0.141458,0.147856,0.138613,0.145204,0.122252,0.096776,0.087019,0.07225,0.047548,0.020308,0.006111,0.001301,0.001006,0.001195,0.000758,0.000572,0.000388,0.000282,0.000266
-1e-05,-1.1e-05,-0.006922,-0.042982,-0.041756,-0.023133,-0.008388,-0.009872,0.001831,0.044974,0.056539,0.053617,0.045446,0.058701,0.049756,0.034272,0.016602,0.015435,0.00855,0.003279,0.000411,0.000386,0.000548,0.000201,0.000179,0.000113,0.000139,0.000163
-8e-06,-1.5e-05,0.000632,0.011583,0.006413,-0.002874,-0.010559,-0.012095,-0.068761,-0.156287,-0.168072,-0.172165,-0.171356,-0.150681,-0.11637,-0.097345,-0.078005,-0.05336,-0.022816,-0.007824,-0.001586,-0.001175,-0.00168,-0.001133,-0.000681,-0.000437,-0.000336,-0.000351
-1e-06,-1e-06,0.002899,0.013083,0.016534,0.010652,-0.005479,0.000587,0.023265,0.048985,0.067696,0.070702,0.082993,0.056122,0.038642,0.040005,0.039386,0.024564,0.009079,0.001613,0.000562,0.000517,0.00063,0.000514,0.000344,0.000226,0.00012,9.6e-05
4e-06,1e-05,0.000285,3.4e-05,0.008825,0.012857,0.008086,0.004134,0.029026,0.0749,0.08566,0.097567,0.089885,0.090559,0.071834,0.052653,0.033927,0.025231,0.011127,0.004893,0.000781,0.000642,0.001167,0.000809,0.000348,0.000204,0.000195,0.000227
6e-06,1.1e-05,0.000368,0.004402,-0.004575,-0.008413,0.010409,0.006248,-0.034446,-0.100094,-0.133671,-0.136526,-0.138866,-0.110319,-0.082347,-0.075185,-0.059853,-0.042862,-0.016931,-0.004423,-0.001091,-0.000953,-0.001266,-0.000834,-0.000565,-0.000357,-0.000251,-0.000234
2e-06,-3e-06,-0.003008,-0.020268,-0.021311,-0.014364,-0.002767,0.004642,0.015258,0.024961,0.023627,0.017708,0.029784,0.004852,-0.000295,0.01225,0.022513,0.0129,0.003857,-0.000247,0.000226,0.000113,-0.000197,-0.000205,7.8e-05,7.2e-05,-5e-06,-2.9e-05
4e-06,-7e-06,0.000739,0.009261,0.00937,0.005826,-0.006358,-0.008005,0.021824,0.078471,0.105193,0.110155,0.102366,0.091974,0.074452,0.061402,0.039264,0.030792,0.011746,0.004036,0.00093,0.00079,0.001198,0.000743,0.000435,0.000246,0.000213,0.00022
6e-06,2e-06,0.002163,0.011026,0.012681,0.009731,-0.002708,-0.007324,-0.035176,-0.07987,-0.095398,-0.098861,-0.106279,-0.07625,-0.058004,-0.06002,-0.052687,-0.034831,-0.013377,-0.003846,-0.000904,-0.000641,-0.000732,-0.000385,-0.000387,-0.000259,-0.000148,-0.000123
2e-06,6e-06,-0.001165,-0.012759,-0.00658,0.000619,0.000206,0.003166,-0.002035,-0.016995,-0.019647,-0.019799,-0.010088,-0.027614,-0.028025,-0.017169,0.001568,-0.001458,2.8e-05,-0.001547,-0.000211,-0.000214,-0.000533,-0.00029,-7.1e-05,-2.3e-05,-7.6e-05,-9e-05
-4e-06,2e-06,0.000154,0.005212,-0.001663,-0.007536,0.004456,0.004593,0.02453,0.07107,0.098817,0.10369,0.101069,0.087074,0.070711,0.062735,0.042775,0.030381,0.012071,0.004626,0.00102,0.000756,0.001123,0.000643,0.000417,0.000252,0.00019,0.000156
-5e-06,-1e-06,-0.001355,-0.005815,-0.00547,-0.003448,0.003598,0.004644,-0.00996,-0.03367,-0.054932,-0.058982,-0.065681,-0.03683,-0.02151,-0.028061,-0.03161,-0.022321,-0.00879,-0.000943,-0.000448,-0.000327,-0.000294,-0.000251,-0.000263,-0.000156,-5.4e-05,-3e-05
-5e-06,-9e-06,0.000575,0.003065,0.004641,0.005876,-0.001926,-0.001114,0.000239,-0.022208,-0.044929,-0.04468,-0.036491,-0.05083,-0.047369,-0.031058,-0.00809,-0.007223,-0.002602,-0.002263,-0.00046,-0.000453,-0.000828,-0.000461,-0.000207,-0.000103,-0.000128,-0.000107
-3e-06,-7e-06,0.002149,0.01071,0.008982,0.004124,-0.003637,-0.007867,0.009173,0.046238,0.078328,0.083415,0.083853,0.069525,0.051136,0.050032,0.034011,0.026868,0.010168,0.002576,0.000829,0.000588,0.00085,0.000561,0.000361,0.000206,0.000129,8.6e-05
-1e-06,1e-06,-0.002561,-0.018796,-0.013126,-0.004671,-0.003756,-0.002552,-0.017929,-0.023133,-0.023719,-0.029761,-0.034843,-0.006674,0.000665,-0.010125,-0.023488,-0.015794,-0.007131,-0.000796,-0.000202,-6.6e-05,0.000136,3.3e-05,-7.4e-05,-7.5e-05,-1e-06,1.4e-05
