-0.000296,-0.000195,-0.000202,-0.000213,-0.000246,-0.000172,-0.000168,-0.000195,-0.000193,-0.000116,-0.000132,-0.000241,-0.000253,-0.000163,-0.000115,-0.000154,-0.000141,-0.000116,-0.000125,-0.000186,-0.000231,-0.000213,-0.000206,-0.000228,-0.000129,-0.000183,-0.000146,-0.000106
-0.00037,-0.000258,-0.00032,-0.000313,-0.000282,-0.000213,-0.000192,-0.000249,-0.000228,-0.000145,-0.000214,-0.000355,-0.000356,-0.000212,-0.000132,-0.000195,-0.000208,-0.000148,-0.000163,-0.000263,-0.000313,-0.000273,-0.000276,-0.00031,-0.000176,-0.00023,-0.000196,-0.000179
-2.3e-05,-3.7e-05,-0.000114,-9.1e-05,9e-06,-2.2e-05,-9e-06,-3.2e-05,-7e-06,-2.4e-05,-8.4e-05,-9.7e-05,-7.6e-05,-3.3e-05,-1.8e-05,-3e-05,-6.4e-05,-3.1e-05,-3e-05,-5.2e-05,-4.4e-05,-2e-05,-3.1e-05,-4.7e-05,-3.9e-05,-2.1e-05,-4.2e-05,-8.4e-05
3e-04,0.000189,0.000181,0.000183,0.000248,0.000158,0.000146,0.000183,0.000188,9.5e-05,0.000116,0.000235,0.000247,0.000151,1e-04,0.000138,0.000119,0.000104,0.000119,0.000196,0.000253,0.000224,0.000223,0.000249,0.000121,0.000176,0.000124,6.9e-05
0.000226,0.000164,0.000249,0.000208,0.000133,0.000109,9.4e-05,0.00014,0.000129,7.9e-05,0.000161,0.000258,0.00024,0.000127,8.8e-05,0.000118,0.000138,7.9e-05,1e-04,0.000192,0.000225,0.000161,0.000178,0.00023,0.000118,0.00013,0.000111,0.000118
-9.4e-05,-3.9e-05,5.1e-05,1.7e-05,-0.000124,-5e-05,-5.2e-05,-5.2e-05,-7.2e-05,-1.4e-05,4.6e-05,5e-06,-2e-05,-2.7e-05,-1.7e-05,-1.5e-05,2.4e-05,-2.5e-05,-2.2e-05,-1.6e-05,-4.8e-05,-8.1e-05,-6.7e-05,-4.3e-05,-1.2e-05,-5.6e-05,-1.6e-05,5.3e-05
-0.000258,-0.000166,-0.000169,-0.000139,-0.000178,-0.000111,-9.8e-05,-0.000134,-0.000154,-6.5e-05,-9.2e-05,-0.000203,-0.000196,-0.000113,-9.4e-05,-9.9e-05,-7.8e-05,-6.6e-05,-9.5e-05,-0.000179,-0.000234,-0.000188,-0.000199,-0.000234,-1e-04,-0.000124,-7.5e-05,-3.8e-05
-8.9e-05,-6.8e-05,-0.000167,-0.000111,-1e-05,-3.6e-05,-1.8e-05,-4.4e-05,-3.7e-05,-2.8e-05,-0.000119,-0.000156,-0.000122,-5.7e-05,-5.8e-05,-5.8e-05,-7.6e-05,-3.1e-05,-5.9e-05,-0.000121,-0.000135,-6e-05,-8.4e-05,-0.000137,-6e-05,-2.3e-05,-2.1e-05,-7e-05
0.000155,8.6e-05,-4e-06,1.1e-05,0.000135,6.2e-05,5.6e-05,7.6e-05,0.000111,2.9e-05,-2.3e-05,4.8e-05,5e-05,3.8e-05,4.3e-05,2.8e-05,-1.4e-05,2.7e-05,3.6e-05,6.5e-05,0.000103,0.000117,0.000109,1e-04,3e-05,6.7e-05,3.2e-05,-3.2e-05
0.000177,0.000105,0.000113,5.8e-05,8e-05,5.6e-05,2.9e-05,7.3e-05,9.9e-05,2.2e-05,6.3e-05,0.000141,0.000109,6.2e-05,7.9e-05,4.9e-05,2.4e-05,2.6e-05,6.9e-05,0.000147,0.000185,0.000122,0.000142,0.000181,5.2e-05,3.2e-05,1e-06,9e-06
-1.9e-05,-1.8e-05,8.2e-05,2.4e-05,-6e-05,-6e-06,-1.7e-05,-1.6e-05,-3.1e-05,-1.1e-05,7.1e-05,5.1e-05,2.4e-05,1.1e-05,1.3e-05,1.2e-05,2.6e-05,-8e-06,1.8e-05,4.4e-05,4.3e-05,-1.7e-05,6e-06,4.8e-05,1e-05,-4.1e-05,-4.1e-05,2.1e-05
-0.000142,-8.2e-05,3e-06,1.2e-05,-7.3e-05,-2.5e-05,-6e-06,-5.1e-05,-9.6e-05,-5e-06,2.1e-05,-5.6e-05,-3e-05,-1.7e-05,-3.9e-05,3e-06,3.7e-05,8e-06,-2.6e-05,-8.5e-05,-0.000114,-0.000105,-0.000102,-0.000102,-1.4e-05,-2.6e-05,-5e-06,2.8e-05
-8.3e-05,-3.4e-05,-4.6e-05,2.1e-05,4e-06,-2.2e-05,1.1e-05,-1.9e-05,-4.8e-05,5e-06,-4.6e-05,-6.8e-05,-1.9e-05,-2.5e-05,-4.7e-05,-1.2e-05,1.6e-05,8e-06,-4.2e-05,-9.7e-05,-0.000119,-6.7e-05,-8e-05,-0.00012,-1.2e-05,4.4e-05,5.8e-05,1.6e-05
5.1e-05,5.2e-05,-2.8e-05,1.8e-05,5.5e-05,-1e-06,0,2.4e-05,4.1e-05,3e-06,-5.7e-05,1e-05,5e-06,-1.6e-05,-9e-06,-3e-05,-2.7e-05,-7e-06,-1e-05,1.1e-05,9e-06,2.8e-05,2.5e-05,-1e-06,6e-06,5.5e-05,5.5e-05,-3e-06
9.2e-05,6.1e-05,5e-06,-1.7e-05,2.5e-05,1.8e-05,-2.1e-05,2.2e-05,7e-05,-6e-06,-1.6e-05,6e-05,3e-06,8e-06,3.5e-05,-2.5e-05,-5.1e-05,-1.8e-05,2.9e-05,9.3e-05,0.000106,7.6e-05,8.6e-05,9.8e-05,5e-06,-2.6e-05,-3.2e-05,-1.5e-05
3.1e-05,-1.1e-05,1e-06,-5.2e-05,-2.2e-05,2.3e-05,-1.5e-05,-6e-06,1.8e-05,-8e-06,3.3e-05,1.9e-05,-1.3e-05,2.7e-05,3.5e-05,1.7e-05,-2.4e-05,-8e-06,3.3e-05,5e-05,7e-05,5e-05,4.7e-05,6.7e-05,-1.3e-05,-8.5e-05,-9e-05,-1.2e-05
-4.5e-05,-5.8e-05,-1e-05,-3.8e-05,-1.8e-05,1.2e-05,1.9e-05,-1e-05,-4e-05,3e-06,5e-05,-4.3e-05,4e-06,3.1e-05,1.1e-05,6.4e-05,4.1e-05,3.3e-05,1.4e-05,-5.1e-05,-3.2e-05,-2e-06,-2.5e-05,-2.7e-05,-8e-06,-2.7e-05,-3.3e-05,0
-7.5e-05,-3.8e-05,-1e-06,6e-06,-1.5e-05,-3e-05,2.6e-05,-8e-06,-4.7e-05,1e-05,1.7e-05,-5.3e-05,1.5e-05,-9e-06,-3.3e-05,3e-05,5.8e-05,2.4e-05,-2.6e-05,-9e-05,-9.1e-05,-4.5e-05,-6.3e-05,-7.6e-05,1e-05,6.7e-05,6.3e-05,-7e-06
-1e-05,4.2e-05,2.7e-05,4e-05,-1.8e-05,-5.2e-05,-6e-06,-2e-06,-3e-06,1e-05,-1.9e-05,3e-06,0,-4.6e-05,-4.1e-05,-4.5e-05,1.6e-05,-2e-05,-3.9e-05,-1.3e-05,-4.2e-05,-5.3e-05,-3.7e-05,-3.3e-05,2.3e-05,7.8e-05,8.2e-05,-5e-06
