2.2e-05,1e-05,4.8e-05,2e-06,5.8e-05,1.1e-05,5.3e-05,7.8e-05,2e-06,2e-05,1.3e-05,3.4e-05,5.9e-05,5.2e-05,1.1e-05,2.1e-05,2.2e-05,2.1e-05,3e-05,5e-06,8e-06,3.3e-05,5.1e-05,2.8e-05,1.8e-05,2.3e-05,1.2e-05,1.8e-05,7e-06,3e-05,3e-05,1.5e-05,1.3e-05,3e-05,1.7e-05,1.3e-05,7e-06,1.1e-05,2.4e-05,3e-05,4.4e-05,2.9e-05,1.4e-05,3.6e-05,1e-05,4.3e-05,1e-05,7e-06,2.5e-05,4.3e-05,4.1e-05,7e-05,5e-05,4.4e-05,5.4e-05,3e-06,3.8e-05,9.8e-05,3e-05,8.4e-05,1.6e-05,2.4e-05,3.9e-05,2.9e-05,5e-05,7.4e-05,5.6e-05,5e-06,2.4e-05,7.3e-05,2.8e-05,3.6e-05,4.6e-05,3e-06,1.4e-05,1.9e-05,5.3e-05,1.6e-05,1.9e-05,2.5e-05,2.1e-05,2e-06,3e-06,5e-06,2.2e-05,2e-05,4.4e-05,1.1e-05,1.6e-05,1e-05,3.5e-05,4e-06,3.4e-05,3e-05,2.3e-05,2.2e-05,3.1e-05,5e-06,1.7e-05,1.8e-05,1e-06,2e-06,6e-05,4.5e-05,1.4e-05,3e-06,1.3e-05,4.2e-05,1.9e-05,9e-06,7e-06,1.2e-05,2e-06,3e-06,1.9e-05,3.3e-05,2e-06,3.9e-05,1.1e-05,5.3e-05,5e-06
4.1e-05,2.3e-05,9.3e-05,3.7e-05,0.000155,4.6e-05,8e-05,0.000155,5.1e-05,3.5e-05,5.1e-05,9.2e-05,0.000102,0.000113,4.9e-05,3.6e-05,5.3e-05,4.7e-05,9e-05,4.6e-05,2.1e-05,7.6e-05,0.000133,5.1e-05,2.2e-05,1.7e-05,3.7e-05,5.5e-05,5.5e-05,5.3e-05,0.000121,4e-05,2.5e-05,0.000106,3.6e-05,4.9e-05,3.9e-05,3.5e-05,3.4e-05,4.9e-05,0.000118,6.1e-05,2.9e-05,8.4e-05,4e-05,4e-05,2.2e-05,2.6e-05,8.5e-05,4e-05,6.2e-05,0.000131,1.6e-05,5.8e-05,5.8e-05,4.7e-05,5.1e-05,0.000165,9.9e-05,0.000134,3.1e-05,7.4e-05,8.8e-05,4.5e-05,0.000114,0.000119,0.000118,2.1e-05,6.2e-05,0.00013,4.7e-05,8.8e-05,0.000129,6e-05,5e-05,4.2e-05,8.9e-05,6.6e-05,3.9e-05,3.7e-05,5.4e-05,2e-05,4e-05,7.7e-05,4.8e-05,8.1e-05,7.2e-05,6.2e-05,6.1e-05,3.5e-05,5.9e-05,4e-05,8.1e-05,2.9e-05,6.5e-05,2.3e-05,2.1e-05,8.2e-05,5.9e-05,3.1e-05,9.7e-05,6.4e-05,5.7e-05,9e-05,6.5e-05,3.3e-05,2.3e-05,7.3e-05,7.1e-05,3.4e-05,4.5e-05,6.3e-05,5.5e-05,3.1e-05,3.5e-05,7.1e-05,2.7e-05,7.8e-05,5e-05,8.9e-05,4.7e-05
4.1e-05,3.8e-05,0.000151,6.2e-05,0.000114,5.8e-05,7.6e-05,7.6e-05,5.5e-05,5.8e-05,3.8e-05,0.000101,0.000113,0.000144,4.4e-05,6.5e-05,5e-05,3.8e-05,0.00012,2e-05,1.9e-05,8.4e-05,0.000147,0.000129,4.6e-05,8.1e-05,5e-06,6.4e-05,8e-05,9.2e-05,8e-05,5.6e-05,1.4e-05,0.00011,3.9e-05,2.7e-05,6.9e-05,1.9e-05,6.9e-05,4.3e-05,9.3e-05,4.1e-05,1.7e-05,0.000132,7.5e-05,0.000116,4.6e-05,2.5e-05,0.000102,0.000135,8.3e-05,4e-05,9.2e-05,5.9e-05,3.3e-05,3.3e-05,7.1e-05,0.000202,0.000142,0.00014,1e-05,8.5e-05,5.5e-05,8.1e-05,4.3e-05,0.000161,7.3e-05,1.9e-05,7.2e-05,0.000165,7e-05,8.3e-05,0.000182,7.1e-05,6.5e-05,1.4e-05,4.1e-05,3e-05,0.000115,4.7e-05,9e-06,5.4e-05,3.3e-05,4.1e-05,3.6e-05,4.4e-05,8.3e-05,3.3e-05,5.5e-05,7.3e-05,8.4e-05,3.4e-05,0.000101,4e-05,4.7e-05,4.4e-05,7e-05,8.7e-05,6.9e-05,0.000109,5.9e-05,3e-05,8.1e-05,0.000131,7.1e-05,2.2e-05,6e-05,8e-05,1.7e-05,1.8e-05,8.4e-05,0.000101,4.4e-05,7.3e-05,2.5e-05,6.7e-05,4.4e-05,7.9e-05,5.4e-05,0.000108,4e-05
4e-05,2.3e-05,0.000133,3e-05,7.9e-05,0.000124,2.3e-05,0.000173,2.3e-05,8.3e-05,0.000101,4.9e-05,0.000104,0.000223,7.6e-05,8.2e-05,6.6e-05,5e-05,0.000135,1e-05,1.5e-05,1e-04,8.1e-05,6.6e-05,0.000168,9.2e-05,3.8e-05,0.000106,6.2e-05,0.000149,0.000184,8.3e-05,6.8e-05,9.1e-05,1.3e-05,1.2e-05,9.6e-05,0.000121,3.7e-05,6.1e-05,0.000176,8.4e-05,6.3e-05,0.000148,0.000107,0.000113,4.3e-05,3.7e-05,7.6e-05,2.9e-05,1.9e-05,0.000145,0.000169,0.000116,0.000151,7.2e-05,3.8e-05,0.000126,0.000113,2e-04,4.2e-05,8.9e-05,3.2e-05,5.5e-05,1e-04,0.000119,0.000145,4.7e-05,8.1e-05,0.000205,8.5e-05,1.8e-05,0.000103,0.000129,5.4e-05,9e-05,6.3e-05,5.7e-05,0.000127,0.000107,6.3e-05,8.4e-05,6.8e-05,6.1e-05,1.6e-05,2.4e-05,2.2e-05,9.6e-05,0.000154,3.4e-05,5.4e-05,3.1e-05,7e-05,2.9e-05,6.6e-05,6.5e-05,9.7e-05,0.000103,9.8e-05,0.000131,0.000119,2.5e-05,8.6e-05,0.000144,9.7e-05,5.4e-05,6.8e-05,5.4e-05,6.9e-05,6.3e-05,7.8e-05,6.3e-05,5.5e-05,1.6e-05,4.9e-05,0.000134,0.000116,0.000147,4.4e-05,0.00013,8.4e-05
0.000129,0.000128,0.00016,5.7e-05,9.5e-05,5.4e-05,0.000104,0.000328,0.000134,9e-05,0.000166,0.00012,0.000248,0.000361,0.000188,1.7e-05,6e-05,6.9e-05,0.000236,0.000145,0.000131,0.000146,4.6e-05,0.000112,6.7e-05,0.000156,0.000112,6.3e-05,6.5e-05,0.000165,0.000136,0.000105,0.00015,0.000149,0.000176,7.3e-05,0.000172,8e-05,9.8e-05,7.2e-05,0.00024,7.2e-05,0.000158,0.000202,0.000128,3.3e-05,3.5e-05,5.5e-05,2.2e-05,8e-06,0.000154,0.000246,0.000109,0.000198,0.000112,9.9e-05,8.8e-05,0.000244,0.00019,0.000349,8.7e-05,6.8e-05,0.000112,8.3e-05,8.5e-05,0.000128,0.000125,0.000162,0.000113,0.000207,0.000148,7.6e-05,0.000104,0.000212,4.1e-05,0.000135,0.000106,6e-05,8.7e-05,0.000174,0.000211,0.000141,7.2e-05,6.1e-05,6.1e-05,5.5e-05,5.4e-05,0.000112,0.000173,0.000151,0.000181,3.9e-05,0.000117,0.000114,0.00012,8.1e-05,0.000114,0.000165,0.000173,1e-04,7.2e-05,7.2e-05,9e-05,0.000137,4.6e-05,9.7e-05,0.00014,6.3e-05,0.000107,6.3e-05,0.000137,8.4e-05,0.000121,5.8e-05,4.1e-05,0.000105,6.5e-05,0.000121,7.2e-05,0.000147,6e-05
0.000144,0.000245,0.00031,9.5e-05,0.000158,0.000189,0.000259,0.000377,8.2e-05,0.000171,0.00021,0.000121,0.000394,0.00035,0.000164,9e-05,0.000175,0.000111,0.000241,0.000166,7.7e-05,0.000161,0.000304,0.000224,8.1e-05,0.000173,0.000111,4.9e-05,1e-04,0.000214,9e-05,8.6e-05,0.00028,0.000189,0.00019,0.000139,0.000142,0.000179,0.000192,0.000119,0.000239,0.000207,0.000361,0.000122,0.000329,4.6e-05,7.2e-05,9e-05,0.000149,9.2e-05,0.000167,0.000315,0.000285,0.000112,0.000121,0.000113,9.5e-05,0.000394,0.000397,0.000282,0.000231,0.000136,0.00012,0.000161,0.000294,0.000374,0.000195,0.000307,0.000151,0.000266,5.7e-05,0.000212,0.000209,0.000226,0.000201,0.000117,0.000169,2e-04,0.000102,0.000246,0.000235,0.000174,0.000113,0.000117,0.000118,3.6e-05,0.000141,0.00016,0.000249,0.000129,0.000168,0.000207,1e-04,8.7e-05,6.1e-05,3.7e-05,3.9e-05,0.000248,4.1e-05,0.000148,0.00029,0.000119,9.9e-05,4.6e-05,0.000117,3.1e-05,0.000244,0.000239,0.000123,0.000106,8.2e-05,3.1e-05,0.000146,0.000158,0.000161,0.000215,0.00016,0.000154,0.000106,0.000191,0.000173
0.000254,0.000338,0.000625,0.00055,0.000201,0.000454,0.000276,0.000594,0.000564,0.000738,0.000545,0.000376,0.000447,0.000915,0.00058,0.000511,0.000697,0.000517,0.000332,0.000292,0.000284,0.000534,0.000678,0.000447,0.000537,0.000297,0.000205,0.000158,9.1e-05,0.000434,0.000173,0.000384,0.000516,0.000372,0.000383,0.000175,0.000146,0.000163,0.000394,0.000217,0.000348,0.000284,0.000558,0.000468,0.000422,0.000485,0.000172,0.000101,0.000284,0.000216,0.000146,0.000497,0.000531,0.000418,0.000227,0.000161,0.000188,0.000483,0.000434,0.000515,0.000272,0.000341,0.000135,0.000342,0.000265,0.000478,0.000337,0.000349,0.000253,0.000271,0.000497,0.000468,0.000322,0.000521,0.000517,0.000421,0.000375,0.000396,0.000326,0.000361,0.000317,0.000274,0.000128,0.000195,9.1e-05,0.000198,0.000275,0.000373,0.000303,0.000401,8e-06,0.000219,0.000328,0.000276,0.000344,0.00016,8.3e-05,9.9e-05,0.000196,7.1e-05,0.000273,0.00044,0.000584,0.000302,0.000124,0.000229,0.000203,0.000596,0.000449,0.000345,0.000309,0.000187,0.000202,4.1e-05,0.000235,0.000161,0.000255,0.000223,0.000123,0.000121,0.000171
0.000129,0.000298,0.000198,0.000624,0.000861,0.000873,0.000874,0.000469,0.00064,0.00032,0.000552,0.000499,0.000243,0.001194,0.000696,0.000372,0.000875,0.000991,0.001146,0.000761,0.000604,0.000385,0.000808,0.000499,0.000633,0.001117,0.000606,0.000177,0.00012,0.000369,0.000801,0.000282,0.000891,0.000363,0.000222,4.4e-05,0.000171,0.000346,0.000599,0.000446,0.000553,0.000278,0.000535,3.4e-05,0.000297,0.000212,0.000338,3.8e-05,0.000629,0.000308,5.4e-05,0.000386,9.6e-05,7.9e-05,0.000546,0.000277,0.000135,0.000916,0.000302,0.000579,0.00041,0.000299,0.000341,0.000334,0.000592,0.000334,0.000478,0.000279,0.000228,0.000298,0.000574,7.8e-05,0.000237,0.000529,0.00067,0.000223,0.000411,0.000292,0.000196,0.000124,0.000684,0.000593,0.000373,0.000476,0.000331,0.000278,0.000453,0.00027,0.000162,0.000508,0.000375,0.000515,8e-05,0.000481,0.00024,0.000187,0.000151,9.4e-05,0.000148,0.000202,0.000236,0.000611,0.000326,0.000495,0.000357,0.000153,0.000341,0.000614,0.000487,0.000478,0.000103,0.000208,4.9e-05,6.5e-05,0.000357,0.000333,0.000211,0.000545,0.000428,0.00028,6.4e-05
0.000681,0.000509,0.000231,0.000512,0.000321,0.000218,0.000218,0.000502,0.000527,0.000894,0.000189,0.000298,0.000145,0.001062,0.000741,0.000239,0.000648,0.000255,0.001013,0.000886,0.000381,0.000607,0.000175,0.000454,0.000128,0.000827,0.000425,4.6e-05,3.4e-05,0.000184,0.000685,0.000946,0.000419,0.000584,0.000391,7.6e-05,3e-04,0.000288,0.000277,0.000224,0.000566,0.000532,0.000136,0.000397,0.00052,0.000334,0.000573,0.000438,0.000977,0.000558,0.000478,2.4e-05,0.000304,0.000455,0.000562,0.000361,0.000351,0.000778,0.001131,0.000429,0.000643,0.000325,0.000866,0.000845,0.000369,0.000764,0.000511,0.000293,0.000456,0.000379,5e-04,0.000624,0.00069,0.000544,0.000804,0.000645,0.000567,0.000525,0.000362,0.000226,0.000663,0.000121,0.000468,0.000174,0.000137,6.3e-05,0.000486,0.000474,0.000182,0.000359,0.00028,0.000512,0.000431,0.00045,0.000815,0.000557,0.000449,0.000359,0.000335,0.000398,0.000218,0.000483,0.001022,0.001326,0.000849,0.000777,0.00083,0.000985,0.000139,0.000257,0.000398,0.000269,0.000128,0.000146,0.000241,0.000121,0.000197,0.000475,0.000525,7.5e-05,0.000405
0.000554,5e-05,0.000248,0.000381,0.000516,0.000235,5.9e-05,0.000504,0.000387,0.000437,0.000374,9.8e-05,0.000243,0.000437,0.000429,0.000752,0.001011,0.000846,0.000303,0.000173,1.6e-05,0.000487,0.00036,0.000506,0.000473,0.00055,0.000862,0.000683,0.000257,0.000163,0.00072,0.000573,0.000585,0.000237,6.6e-05,0.000277,0.000526,0.000649,0.000202,0.000353,0.000755,0.000563,0.000459,2e-04,0.000642,0.000455,0.00059,0.000351,0.000819,0.000411,0.000391,0.000364,0.000354,0.00065,0.000609,0.000374,0.000327,0.000547,0.000754,0.000476,0.000869,0.000738,0.00099,0.000623,0.000454,0.000548,0.000439,0.000219,0.000657,0.00121,0.000713,0.00053,0.000602,0.000935,0.000636,0.000811,0.001028,0.000809,0.000612,0.000431,0.000684,0.000628,0.000647,0.000594,0.000354,0.000113,0.00024,0.000487,0.00043,0.000303,0.000204,0.000668,0.000283,0.000534,0.000826,0.000456,0.000119,0.000167,0.000524,0.000486,0.000274,0.000328,0.000813,0.00065,0.000467,0.000535,0.000542,0.000841,0.000999,0.000809,0.000596,0.000355,0.00031,0.000316,0.000209,4.1e-05,0.000186,0.000634,0.000341,0.000328,0.000443
0.000208,0.000177,0.000121,0.000115,0.000177,0.000172,7.3e-05,0.000407,0.000249,0.000323,0.000153,0.000154,6.7e-05,9.5e-05,0.000346,0.000396,0.00029,7.6e-05,0.000253,6.3e-05,0.00015,0.000135,0.000194,0.000228,2.4e-05,0.000405,0.000447,0.000307,0.000293,0.000118,0.00021,0.000154,6e-05,0.000125,0.000128,0.000242,0.00027,0.000335,0.000328,9.4e-05,0.000214,0.000196,5e-05,0.000393,0.000374,0.000167,0.000137,3.7e-05,0.000549,0.000434,6.8e-05,0.000174,0.000167,0.000375,0.000105,0.000178,7.6e-05,0.000428,0.000231,0.000378,0.000425,0.000316,0.000276,0.000146,0.000513,0.000151,0.000335,0.000383,0.000425,0.000576,0.000335,6e-05,0.000307,0.00029,0.000178,0.000535,0.000546,0.000119,0.000235,0.000127,0.000377,8e-05,0.000408,0.000201,5.7e-05,0.000101,0.000105,0.000322,0.000281,0.000166,0.000314,0.00026,0.000305,0.000526,9.4e-05,0.000121,0.000109,0.000137,0.000328,9.1e-05,0.000126,0.000138,0.000365,0.000293,0.000528,0.000343,0.000476,0.000294,0.000246,0.000167,0.00013,0.000185,0.000194,0.000233,0.000202,0.000155,9.8e-05,0.00033,0.000156,0.000247,9.6e-05
4.8e-05,6.3e-05,9.3e-05,5e-05,0.000197,8.6e-05,0.000112,0.000145,0.000118,6.5e-05,0.000113,0.000107,0.000104,0.000159,0.000179,0.000175,3e-05,0.000207,0.00016,7.3e-05,8.8e-05,7.2e-05,0.000223,4.1e-05,4.2e-05,0.000222,0.000101,0.000135,0.000128,0.000199,0.000132,0.000154,0.00013,6.7e-05,4.9e-05,0.000145,5.7e-05,0.000137,0.000144,0.000195,0.000177,0.000176,0.000133,0.00025,6.7e-05,0.000163,5.7e-05,0.000101,0.00017,3.9e-05,6.6e-05,7e-05,0.000168,0.000109,5.5e-05,6.3e-05,0.000106,0.000273,0.000186,0.000168,0.000163,9.7e-05,0.000118,5.5e-05,0.000228,0.000191,0.000137,9.4e-05,0.000176,0.000243,0.000105,0.000169,2.4e-05,0.000261,4.2e-05,0.000285,0.000107,8.6e-05,0.000163,8.9e-05,0.000153,0.000233,0.000105,3.5e-05,7.3e-05,2.7e-05,0.000125,6e-05,0.000131,8.9e-05,0.000122,0.000151,6.4e-05,0.00026,0.000157,2.7e-05,6.1e-05,9.7e-05,8.8e-05,2.7e-05,6.3e-05,9.2e-05,0.000159,0.000189,0.000248,3.3e-05,0.000334,9.7e-05,8.4e-05,8.8e-05,5.1e-05,0.000117,6.7e-05,5.4e-05,4.3e-05,4.7e-05,7e-06,0.000203,9.5e-05,5.4e-05,0.000192
4.5e-05,7.8e-05,9.4e-05,1.2e-05,7.7e-05,2.1e-05,2.8e-05,0.000112,0.000105,8e-06,4.3e-05,0.000117,4.7e-05,0.000218,0.000107,0.000127,5.9e-05,0.000149,7.2e-05,3.9e-05,3.9e-05,4.5e-05,0.000125,4.4e-05,8.6e-05,0.000166,0.000107,2.9e-05,8.5e-05,0.000145,6.4e-05,9.8e-05,2.7e-05,0.000156,2.8e-05,0.000102,3.8e-05,7.1e-05,5.5e-05,6.5e-05,0.000119,0.000112,4.8e-05,0.000188,1.7e-05,7.4e-05,4.8e-05,0.000102,0.000109,7e-05,4.5e-05,4.5e-05,0.000165,7.4e-05,5.7e-05,7.8e-05,3.9e-05,0.00019,0.00011,0.00011,0.000104,0.000153,9e-05,3.3e-05,0.000123,0.000109,4.4e-05,5.5e-05,7.8e-05,0.000158,0.000118,0.000156,5.4e-05,0.000265,8.6e-05,0.000191,5.4e-05,2.6e-05,0.000111,8.2e-05,6.8e-05,0.000132,7.6e-05,0.000119,4.1e-05,4.7e-05,7.9e-05,0.000108,0.000136,9.2e-05,7.1e-05,4.2e-05,5.9e-05,0.000126,0.000139,2.7e-05,5.3e-05,0.000103,9.3e-05,1.6e-05,4.5e-05,4.8e-05,0.000219,6.6e-05,0.00013,7e-05,0.000235,7e-05,9.9e-05,8.5e-05,6e-05,3.9e-05,6.3e-05,7e-05,4.1e-05,4.4e-05,7.3e-05,6.4e-05,6.5e-05,1.3e-05,0.000162
3.4e-05,0.000111,7.8e-05,8e-05,0.000103,6e-05,0.000114,3.3e-05,9.2e-05,0.000118,4.8e-05,0.000131,0.000125,0.000205,9.7e-05,9.5e-05,0.000106,5.6e-05,1.1e-05,7.4e-05,4.5e-05,0.000104,9.8e-05,6.7e-05,9e-05,0.000181,1.7e-05,8e-05,7.2e-05,0.000176,0.00016,0.000117,8.4e-05,0.000159,0.000162,0.000142,0.000153,0.000145,0.000146,6.1e-05,5.5e-05,9.7e-05,0.000152,6.8e-05,0.000113,6.8e-05,0.000105,0.000167,7.5e-05,3.3e-05,0.000106,0.00011,0.000107,6.1e-05,0.00014,0.00017,0.000214,0.000154,0.000113,7e-05,8.7e-05,0.000162,1.4e-05,2.5e-05,0.000199,0.000145,2.6e-05,9.2e-05,6.6e-05,0.000141,5.6e-05,0.00014,7.9e-05,0.000181,3.4e-05,0.000157,0.000106,8e-05,8.8e-05,4.9e-05,3.5e-05,0.000151,4e-05,0.000121,9.8e-05,3.9e-05,8e-05,5.9e-05,7e-05,5.7e-05,2.6e-05,2.9e-05,0.000119,0.000101,0.000163,0.000121,0.00014,6.6e-05,4.3e-05,5.8e-05,9.3e-05,0.000103,0.000163,0.000213,0.000228,0.000196,0.000153,0.000141,0.00012,9e-05,0.000133,2.4e-05,6e-06,0.000176,0.000103,5.9e-05,0.000122,5e-05,6.6e-05,9.1e-05,6.1e-05
7.5e-05,4.4e-05,0.000104,0.00012,0.000241,0.00015,7.4e-05,0.000201,0.000152,0.000117,3.2e-05,0.000154,0.000211,0.000147,4.6e-05,0.000113,0.000103,0.000135,9.5e-05,8.4e-05,9.1e-05,0.000179,7.2e-05,0.000102,1.4e-05,0.000117,4.1e-05,0.00011,9.3e-05,0.000138,0.000108,6.9e-05,0.000133,0.000178,0.000153,5.9e-05,9.4e-05,1.6e-05,0.000114,0.000104,4.7e-05,2.5e-05,0.000175,0.00023,6.5e-05,0.000197,0.000142,0.000168,0.000217,0.000178,0.00026,0.000246,0.000193,0.00011,0.000241,0.000132,0.000136,6.9e-05,8.2e-05,0.000139,2e-04,7.9e-05,0.000102,1.6e-05,0.000264,0.000162,0.000123,0.000161,0.000151,2.6e-05,0.000137,0.000185,0.000141,0.000164,9e-05,0.000143,0.000204,8.3e-05,0.000115,0.000135,9.5e-05,0.00018,0.000143,0.000197,0.000133,0.000116,5e-05,2.8e-05,6.3e-05,7.2e-05,8.4e-05,7.3e-05,0.000113,0.000103,0.000132,0.000129,0.000162,0.000146,0.000173,9.5e-05,0.00015,0.000198,0.000194,0.000142,0.000122,0.00014,5.6e-05,1e-04,8.9e-05,4.8e-05,3.3e-05,3.5e-05,5.9e-05,0.000145,0.000184,0.000103,0.00013,0.000229,0.000156,0.00016,0.000111
0.000133,0.000139,9.9e-05,5e-05,0.000147,8e-05,0.000111,0.000164,6.7e-05,0.000155,0.000148,0.00016,0.000136,0.000273,0.000147,3.6e-05,1.8e-05,9.9e-05,1.5e-05,0.000123,0.000104,0.000153,5e-05,0.000119,0.000166,0.00011,7.4e-05,3e-06,0.000158,4.4e-05,8.5e-05,9.3e-05,0.000193,0.000127,0.000147,0.000108,0.000115,0.000113,0.000105,6.2e-05,0.000187,0.000104,0.000112,0.000113,0.00019,0.000115,3.7e-05,0.000151,0.000125,9.2e-05,0.00016,1.6e-05,0.000127,5.8e-05,0.000145,0.000199,5.8e-05,7.5e-05,8.3e-05,4.7e-05,0.000167,6.9e-05,0.000179,0.000213,0.000279,0.000134,8.6e-05,6.4e-05,0.000117,8.6e-05,7.7e-05,8.1e-05,5.9e-05,0.000121,0.000145,7.4e-05,6e-05,3.6e-05,0.000112,8.5e-05,3.6e-05,5.3e-05,7.1e-05,9.1e-05,4.3e-05,6.6e-05,1.2e-05,4.9e-05,7.7e-05,8.2e-05,7e-05,0.000168,0.000139,0.000111,0.000133,0.000143,0.000211,7.6e-05,0.00018,0.000118,0.000148,2.1e-05,2.2e-05,5.1e-05,8.3e-05,7.9e-05,0.000227,0.000101,9.7e-05,5.8e-05,6.6e-05,7.8e-05,4.4e-05,1.1e-05,0.00012,1.4e-05,9.4e-05,0.000202,4.7e-05,6.7e-05,0.000105
4.6e-05,0.000102,3.1e-05,7.9e-05,7e-05,7.9e-05,9.1e-05,0.000205,9.2e-05,0.00016,0.000247,0.000183,0.000122,0.000146,0.000183,0.000218,0.000155,0.000132,8.7e-05,0.00021,0.000152,5.4e-05,0.000168,0.000234,0.00023,0.000272,0.000227,7.4e-05,0.000129,0.000217,0.000168,4.2e-05,0.000145,5.5e-05,0.000156,0.00014,2.6e-05,0.000115,3e-05,9.2e-05,0.000206,9.9e-05,0.000105,0.000245,0.000251,0.00025,0.000152,0.000139,7e-06,6.8e-05,0.000201,0.000161,5.4e-05,0.000101,7.1e-05,0.000146,0.000184,9.3e-05,7.7e-05,0.000143,3.6e-05,6.4e-05,0.000173,0.000157,0.000154,0.000118,1e-05,4.6e-05,0.000194,8.6e-05,1e-06,5.1e-05,0.000105,1e-04,0.000132,2.1e-05,3.1e-05,8.1e-05,8.4e-05,7.9e-05,0.000131,7.4e-05,8.8e-05,3.6e-05,3e-05,4.2e-05,7.3e-05,5.3e-05,6.7e-05,0.000128,6.5e-05,2e-04,8.4e-05,7.1e-05,0.000107,0.000113,0.000163,0.000131,0.000131,0.000162,7.6e-05,3e-05,2.2e-05,5.9e-05,0.000109,2.2e-05,0.000237,4.3e-05,0.000123,0.000185,5.8e-05,0.000137,0.000122,0.000163,0.000105,0.00012,0.000129,2.7e-05,0.000117,0.00019,0.000121
3.2e-05,6.9e-05,0.000103,4.3e-05,4.2e-05,4e-05,2.5e-05,0.000153,0.000177,0.000207,7e-05,8.2e-05,3.4e-05,9.5e-05,7.8e-05,0.00015,0.000137,6.6e-05,2.5e-05,0.000171,0.000163,0.000171,0.000234,0.00015,4e-06,0.000154,8.5e-05,2e-06,5.5e-05,0.000159,3.3e-05,7.1e-05,7.2e-05,7e-05,0.000176,5.9e-05,2.1e-05,0.000109,4.8e-05,0.000122,4e-05,6.7e-05,0.000123,8.2e-05,2.2e-05,0.000111,9.5e-05,0.000114,0.000158,0.000118,0.000117,5.3e-05,5.5e-05,7.3e-05,3.9e-05,9e-05,0.00014,0.000106,8.3e-05,0.000187,4.4e-05,6.9e-05,0.000154,4.8e-05,6.2e-05,8.1e-05,5.6e-05,1.1e-05,0.000133,0.000188,0.000137,0.000112,7.9e-05,8.9e-05,5.1e-05,0.00011,0.000125,0.000129,0.000194,0.000189,0.000158,2.7e-05,4.1e-05,3.6e-05,1e-06,2.8e-05,7.4e-05,2.7e-05,3.7e-05,0.000157,0.000208,6.3e-05,7.1e-05,0.000172,6.5e-05,0.000152,1e-04,8.6e-05,6.3e-05,0.000168,8.5e-05,1e-05,2.3e-05,0.000119,0.000113,6.9e-05,2e-04,5.8e-05,3.4e-05,0.000111,7.2e-05,0.000106,4.6e-05,9.1e-05,8e-06,7.3e-05,7.5e-05,6.1e-05,0.000123,0.00012,0.000122
6.5e-05,3e-06,1e-04,0.000116,0.000125,0.000121,0.000122,0.000116,3.4e-05,5.7e-05,8.3e-05,9.6e-05,7e-05,0.000153,0.000108,0.00013,0.000115,9.9e-05,3.8e-05,0.000121,7.3e-05,0.000183,0.000102,0.000125,5.1e-05,0.000117,0.00014,0.000128,4.4e-05,6.6e-05,9.5e-05,4.8e-05,4.3e-05,4.4e-05,0.000133,0.000107,2.5e-05,9.8e-05,7.2e-05,0.000174,0.000155,0.000134,5.5e-05,7.1e-05,0.000187,0.000135,0.000131,3.6e-05,0.000148,0.000131,0.000124,0.000185,3.4e-05,6.3e-05,3.2e-05,8.8e-05,0.000135,6.5e-05,5.1e-05,5.7e-05,0.000108,8.1e-05,9.5e-05,7e-05,4.8e-05,0.000133,0.000151,0.000131,0.000107,8.8e-05,8.8e-05,0.000129,0.000109,0.00024,5.1e-05,0.000105,0.00012,8.6e-05,6.9e-05,3.1e-05,0.000138,0.000118,6.8e-05,3e-05,4.8e-05,3.5e-05,8.8e-05,9.2e-05,4e-05,0.000116,0.000117,7.3e-05,6.1e-05,0.000143,0.000148,8.7e-05,4.4e-05,8e-06,7.6e-05,0.000145,9.4e-05,3.6e-05,1.3e-05,1e-04,3.6e-05,4e-05,5.8e-05,8.5e-05,1.9e-05,0.000116,0.00012,6.3e-05,1.1e-05,4.2e-05,2.1e-05,3.2e-05,7.2e-05,6.1e-05,5.1e-05,0.000155,8.3e-05
0.000183,9.2e-05,0.000133,0.000128,1.6e-05,6e-05,6.7e-05,8.3e-05,2.1e-05,1.3e-05,6.1e-05,5.2e-05,8.1e-05,6.3e-05,4.5e-05,0.00013,0.000105,9.9e-05,0.000108,0.000101,1.6e-05,0.000117,0.000168,0.000142,7e-05,0.000105,7.9e-05,8.5e-05,0.000113,0.000121,0.000101,0.000138,0.000152,0.000109,0.000124,3.4e-05,7.9e-05,9.5e-05,4.9e-05,7.1e-05,2.4e-05,4.1e-05,5.2e-05,7e-05,0.000172,0.000174,0.000136,5.5e-05,0.000151,7.6e-05,5.8e-05,0.000142,0.000164,0.000142,8.5e-05,0.000121,5.6e-05,3.2e-05,6.7e-05,0.000104,0.000117,7.6e-05,8.8e-05,6.3e-05,8e-05,0.000116,0.000113,4.7e-05,2.5e-05,7.3e-05,0.000143,0.000139,3e-05,0.000149,0.000114,8.5e-05,3.5e-05,1e-04,0.000128,7.5e-05,0.000101,5.7e-05,2.4e-05,0.000119,2.9e-05,6.1e-05,0.000148,0.000114,3.9e-05,8.2e-05,0.000201,0.000119,8.3e-05,9.7e-05,0.000108,1.2e-05,5.5e-05,8e-05,3e-05,5.9e-05,0.000117,2.7e-05,4.4e-05,8.5e-05,4.6e-05,3.7e-05,4.7e-05,9.7e-05,0.000108,0.000124,0.000156,2.4e-05,2.9e-05,3.5e-05,5.9e-05,9.8e-05,0.000131,0.00012,6.2e-05,0.000122,0.000156
7.5e-05,4.4e-05,6.5e-05,3.2e-05,4.9e-05,6.1e-05,2.8e-05,0.000134,9.3e-05,4.9e-05,4.6e-05,1.7e-05,5.7e-05,0.00016,9.6e-05,5.2e-05,4.1e-05,9.3e-05,5.1e-05,0.000124,0.000134,6.8e-05,0.000155,0.00012,4.7e-05,2.2e-05,6.9e-05,6e-05,4.5e-05,7.5e-05,3.9e-05,0.00013,8.1e-05,8e-06,5.2e-05,5e-05,8.3e-05,7.5e-05,4.2e-05,2.2e-05,7.5e-05,4.6e-05,0.000111,7.5e-05,5.7e-05,7.9e-05,2.4e-05,4.3e-05,0.000115,2.2e-05,3.7e-05,9e-05,0.000108,6.5e-05,3.4e-05,9.1e-05,6.6e-05,4.7e-05,2.2e-05,7e-05,5e-05,8.4e-05,4.5e-05,2.3e-05,0.00015,7.2e-05,5.8e-05,8.8e-05,6.4e-05,9.8e-05,7.9e-05,8.2e-05,2.5e-05,0.000121,0.000115,0.000168,2.6e-05,5.3e-05,0.000115,2.4e-05,1.8e-05,2.3e-05,3.4e-05,0.000136,7.5e-05,6.2e-05,3.8e-05,4.7e-05,5.7e-05,0.000108,0.000148,5.6e-05,6.4e-05,0.000106,8.9e-05,9e-05,7.1e-05,3.3e-05,7.4e-05,6.8e-05,7.9e-05,0.000128,1.2e-05,4.9e-05,1e-04,3.3e-05,7.3e-05,2.8e-05,5.8e-05,0.000127,2.5e-05,6.1e-05,7.2e-05,2.4e-05,7.6e-05,8.5e-05,5.5e-05,7.7e-05,6e-06,5.9e-05,7e-05
8.9e-05,4e-05,5.4e-05,5.1e-05,6e-05,3.6e-05,6.4e-05,0.000132,2.5e-05,2.3e-05,8.6e-05,6e-05,4.4e-05,0.000241,0.000148,6.9e-05,0.000129,0.000128,0.000112,0.000156,6e-05,7.9e-05,0.000115,5.7e-05,1.6e-05,6.6e-05,0.000147,8.2e-05,0.000104,6.2e-05,5e-05,0.00014,5.6e-05,2.6e-05,4.2e-05,0.000136,0.000107,7.2e-05,0.000131,7e-05,0.000164,0.00014,8.3e-05,0.000139,0.000123,7.4e-05,3.9e-05,3.1e-05,7.7e-05,8.5e-05,3.8e-05,7.9e-05,6.5e-05,0.000103,7e-05,5.9e-05,6.5e-05,4.4e-05,4.1e-05,4.5e-05,5.3e-05,9.5e-05,2.2e-05,4.3e-05,8.2e-05,0.000162,8.3e-05,4.9e-05,1.5e-05,8.6e-05,4e-05,8.8e-05,0.000115,7.4e-05,5e-05,6e-05,9.2e-05,4.6e-05,9.5e-05,9.1e-05,8.4e-05,3.8e-05,7.4e-05,9.7e-05,0.000112,4e-05,7.2e-05,2.1e-05,7.5e-05,6e-05,4.9e-05,2.5e-05,0.000142,3.1e-05,9.9e-05,0.000144,9.4e-05,9.3e-05,0.000135,7.9e-05,0.000116,0.00017,0.000132,3.9e-05,5e-05,2.2e-05,5e-05,7.7e-05,6.2e-05,5.4e-05,9.7e-05,6.8e-05,8.7e-05,0.000121,9e-06,4.7e-05,3.5e-05,8.1e-05,0.000111,4.7e-05,5.7e-05
3.6e-05,2.7e-05,6.9e-05,8.2e-05,7.4e-05,5.7e-05,9.1e-05,0.000109,4e-05,3.1e-05,9.9e-05,0.000102,2.4e-05,0.000154,5.2e-05,7.9e-05,0.000122,6.6e-05,6.9e-05,6.3e-05,6e-05,5.9e-05,6.6e-05,5.2e-05,3.9e-05,5.8e-05,1.9e-05,6.8e-05,1.8e-05,6.3e-05,6.4e-05,7.4e-05,2.4e-05,3.1e-05,1.9e-05,9.9e-05,0.000122,5.4e-05,7.6e-05,2.6e-05,6.5e-05,8.2e-05,8.3e-05,2.8e-05,1.7e-05,5.1e-05,5.2e-05,5.1e-05,4.1e-05,5.8e-05,7.7e-05,6.6e-05,4.4e-05,8e-05,3.2e-05,6.9e-05,3.9e-05,3.2e-05,3.4e-05,6.8e-05,4.3e-05,6.6e-05,4.6e-05,6.8e-05,2.9e-05,6.9e-05,3.8e-05,5.9e-05,2.4e-05,2.5e-05,5.4e-05,3.2e-05,5.8e-05,3.4e-05,1.6e-05,1.5e-05,2.1e-05,7.6e-05,8.9e-05,4.7e-05,5e-05,7.1e-05,3.2e-05,7.8e-05,7.9e-05,9.5e-05,9.3e-05,7.4e-05,8e-06,4.2e-05,3.2e-05,1.2e-05,9.9e-05,7.7e-05,6.7e-05,7.9e-05,1.1e-05,4.1e-05,4.6e-05,5.2e-05,6.6e-05,6.1e-05,8.3e-05,4.9e-05,6e-05,2.7e-05,8.4e-05,2.4e-05,3.9e-05,1.2e-05,4.1e-05,4.8e-05,2.7e-05,6.8e-05,4.2e-05,1.7e-05,2.5e-05,5.6e-05,0.000115,4e-05,3.6e-05
2.9e-05,3.7e-05,5.1e-05,0.000102,9.2e-05,3.1e-05,0.000122,0.000147,0.000114,4.8e-05,7.2e-05,0.000124,9.5e-05,5e-05,9.3e-05,0.000148,0.000112,8.9e-05,7.4e-05,6.8e-05,6.5e-05,5.5e-05,4.7e-05,2.4e-05,3.4e-05,1.2e-05,4.5e-05,0.000105,0.000108,7.2e-05,4.8e-05,0.000106,9.5e-05,5e-05,5.4e-05,0.000106,8e-05,0.00012,5.5e-05,7e-05,6.5e-05,6.6e-05,4.3e-05,4.5e-05,8e-05,6.6e-05,1.6e-05,2.5e-05,5e-05,1.5e-05,5.7e-05,4.3e-05,6.2e-05,0.000101,5.2e-05,7.9e-05,5.3e-05,3.3e-05,4.9e-05,6.2e-05,5.9e-05,8e-05,2.4e-05,6.8e-05,5.2e-05,6e-05,5.3e-05,4.8e-05,9.7e-05,6.9e-05,4.3e-05,5.6e-05,6.3e-05,4.8e-05,4.7e-05,2.8e-05,2.8e-05,0.000106,9.1e-05,4.6e-05,4.2e-05,4.3e-05,3.1e-05,7.6e-05,2.1e-05,9.7e-05,6.6e-05,2.8e-05,5e-05,7e-06,4.8e-05,3.6e-05,9.3e-05,9.8e-05,5.3e-05,6.4e-05,7.2e-05,7.7e-05,9.8e-05,2.8e-05,3.7e-05,7.2e-05,2.2e-05,1.6e-05,7.6e-05,9.2e-05,5.4e-05,2.7e-05,3.3e-05,4.9e-05,8.2e-05,1e-04,9e-05,1.3e-05,3.1e-05,2.5e-05,3.8e-05,8.1e-05,7.7e-05,8.2e-05,3.1e-05
2.4e-05,2.1e-05,2.9e-05,4.8e-05,3.9e-05,3.5e-05,7.3e-05,3.6e-05,3.5e-05,4.4e-05,6.3e-05,5.4e-05,2e-05,2.4e-05,5.1e-05,2.9e-05,2.9e-05,3.2e-05,3.4e-05,3.6e-05,1.8e-05,4.1e-05,1.2e-05,1.8e-05,1.5e-05,3.3e-05,5.2e-05,8.7e-05,3.2e-05,2.8e-05,2.8e-05,3.3e-05,5e-05,4.3e-05,5.4e-05,1.5e-05,1.7e-05,5.7e-05,3.7e-05,6.7e-05,4.3e-05,3.7e-05,3.7e-05,6.7e-05,6.7e-05,4.4e-05,4.5e-05,2.6e-05,3.3e-05,1.7e-05,4.2e-05,5.5e-05,2.7e-05,6e-05,3.7e-05,5.9e-05,2.8e-05,3.1e-05,3.4e-05,2e-05,4.3e-05,4.1e-05,4.4e-05,6e-05,4.1e-05,6e-05,4.1e-05,6.9e-05,7.3e-05,2.2e-05,3.9e-05,3.7e-05,1.8e-05,2.1e-05,3.4e-05,1.4e-05,3.5e-05,6.8e-05,2.1e-05,3.3e-05,3.1e-05,6e-06,3.1e-05,5e-05,6.2e-05,5.8e-05,5.1e-05,2.3e-05,2.5e-05,3.3e-05,6.5e-05,6.3e-05,7e-06,4e-05,3.7e-05,4.7e-05,1.6e-05,2.6e-05,8.1e-05,6.5e-05,3.8e-05,4.4e-05,3.3e-05,3.8e-05,4.4e-05,7.2e-05,0.000129,4.6e-05,1.2e-05,4.1e-05,4.7e-05,4.4e-05,3.4e-05,4.7e-05,3.7e-05,1.3e-05,2.6e-05,4e-05,1.2e-05,3.6e-05,3.9e-05
2.6e-05,1.8e-05,1.9e-05,1.8e-05,2.7e-05,2.2e-05,2.2e-05,2.2e-05,1.4e-05,2.8e-05,1.9e-05,3.7e-05,2.2e-05,3.1e-05,1e-05,3.9e-05,1e-05,3.3e-05,1.6e-05,2.9e-05,8e-06,3.8e-05,4.3e-05,5.1e-05,2.1e-05,4.9e-05,4.4e-05,3.4e-05,2.4e-05,1.9e-05,1.7e-05,2.8e-05,2.4e-05,1.5e-05,4.9e-05,2.4e-05,3.9e-05,2.3e-05,6e-06,5.1e-05,3e-05,2.7e-05,2.3e-05,2.7e-05,1e-05,4e-05,3.9e-05,2.4e-05,1.7e-05,1.6e-05,2e-05,2.3e-05,5e-05,3.2e-05,5.5e-05,3.9e-05,2.3e-05,2e-05,1e-05,2.5e-05,4.4e-05,3.5e-05,3.5e-05,1.9e-05,2.1e-05,3.9e-05,1.8e-05,3.2e-05,1.9e-05,2.2e-05,3.2e-05,2.8e-05,1.2e-05,4.4e-05,5e-06,2.5e-05,3.3e-05,1.9e-05,2.8e-05,8e-06,3.5e-05,5.9e-05,5.8e-05,2.8e-05,2.1e-05,3.5e-05,3.1e-05,3.8e-05,3.4e-05,2.6e-05,1.3e-05,3.9e-05,9e-06,1.8e-05,3.7e-05,2.1e-05,1.6e-05,3.2e-05,5.9e-05,2.5e-05,1.8e-05,2.5e-05,2.7e-05,4.2e-05,3.2e-05,3.8e-05,5.7e-05,3.3e-05,2e-05,4e-05,3.6e-05,2.3e-05,3.3e-05,1.5e-05,1.5e-05,1.6e-05,1.4e-05,3.9e-05,2.4e-05,1.1e-05,4e-06
1.3e-05,2.5e-05,1.6e-05,1.9e-05,5e-06,1.4e-05,1.8e-05,1.4e-05,2e-05,3.5e-05,3.5e-05,7e-06,1.4e-05,1.7e-05,1.9e-05,3.4e-05,6e-06,3.9e-05,1.9e-05,2.1e-05,1.1e-05,3.3e-05,3.2e-05,2e-05,3.9e-05,1.9e-05,3.4e-05,1.2e-05,9e-06,2.9e-05,2.6e-05,1.6e-05,2.3e-05,2e-05,3.8e-05,1.7e-05,4.2e-05,2.7e-05,2.1e-05,2.6e-05,2e-06,3.7e-05,7e-06,2.2e-05,3e-05,3.5e-05,2.9e-05,1.3e-05,1.8e-05,1.1e-05,4e-06,1.5e-05,2.4e-05,4.1e-05,2.7e-05,4e-06,3e-06,2.5e-05,4.2e-05,1.7e-05,4.2e-05,2.3e-05,1.4e-05,1e-05,3.3e-05,1e-05,2.1e-05,2.4e-05,3.1e-05,1.6e-05,2.2e-05,2.8e-05,7e-06,3.8e-05,2e-05,2.7e-05,5e-06,2.6e-05,1.3e-05,1.1e-05,3.6e-05,3.2e-05,2.5e-05,2.1e-05,2.6e-05,1.6e-05,1.7e-05,2.6e-05,2.5e-05,1.6e-05,2.2e-05,1.2e-05,9e-06,2.4e-05,4.4e-05,2.7e-05,6e-06,3.7e-05,4.2e-05,3.8e-05,1.4e-05,8e-06,3.5e-05,2.1e-05,1.7e-05,2.1e-05,3.6e-05,1.3e-05,7e-06,2.1e-05,3.8e-05,2.1e-05,1.2e-05,2.7e-05,1.8e-05,2e-05,3.1e-05,3.7e-05,1.6e-05,7e-06,1.4e-05
1e-05,3.1e-05,2.1e-05,1.8e-05,4e-06,4e-06,2.1e-05,1e-05,1.3e-05,1.6e-05,3.8e-05,1.8e-05,1.9e-05,2e-05,7e-06,1e-05,1.6e-05,1.7e-05,1.5e-05,1e-05,1e-05,1.8e-05,2e-05,8e-06,2.6e-05,3e-05,8e-06,1.6e-05,1.2e-05,1.8e-05,1.8e-05,1.3e-05,1.6e-05,2.3e-05,6e-06,3.4e-05,7e-06,1.3e-05,1.6e-05,1e-05,2.6e-05,2.4e-05,9e-06,9e-06,2.2e-05,1.1e-05,2.4e-05,7e-06,2.4e-05,4e-06,4e-06,2.2e-05,1.4e-05,2.4e-05,1.5e-05,1.4e-05,1.4e-05,2.1e-05,2.9e-05,2e-06,1e-05,2.8e-05,1.5e-05,2.7e-05,1.4e-05,1e-05,1.3e-05,1.3e-05,1.7e-05,1.7e-05,2.3e-05,1e-05,4e-06,3.3e-05,2e-05,2.1e-05,2.8e-05,3.5e-05,1.3e-05,1.3e-05,1.3e-05,7e-06,7e-06,1.3e-05,1.2e-05,8e-06,1.6e-05,1.1e-05,1.6e-05,1.2e-05,3.1e-05,3e-05,2.1e-05,1.2e-05,1.9e-05,7e-06,1.3e-05,2.1e-05,3.1e-05,2.2e-05,9e-06,1.7e-05,1.3e-05,1.2e-05,4e-06,8e-06,3.6e-05,7e-06,1.1e-05,2.3e-05,1.7e-05,9e-06,5e-06,1.4e-05,5e-06,2.1e-05,1.5e-05,8e-06,6e-06,1.3e-05,1.2e-05
1.8e-05,2.2e-05,7e-06,1.1e-05,4e-06,6e-06,2e-05,4e-06,8e-06,7e-06,1.9e-05,1.7e-05,8e-06,2.1e-05,7e-06,1.6e-05,6e-06,1.9e-05,1.6e-05,1.1e-05,1e-05,1.6e-05,2.3e-05,2e-06,1.3e-05,7e-06,1.1e-05,1.3e-05,1.8e-05,1.5e-05,8e-06,7e-06,1.1e-05,1.1e-05,8e-06,2.2e-05,1.6e-05,3e-06,1e-05,1e-05,2e-05,1.3e-05,8e-06,7e-06,5e-06,6e-06,2.5e-05,2e-06,1.6e-05,1e-05,1.1e-05,1e-05,1.7e-05,2.4e-05,4e-06,1.7e-05,9e-06,1.3e-05,2.5e-05,5e-06,2e-05,2e-05,2.3e-05,1.1e-05,6e-06,4e-06,8e-06,1.5e-05,1.2e-05,4e-06,1.1e-05,1.6e-05,4e-06,5e-05,1.1e-05,1.2e-05,2.7e-05,1.6e-05,8e-06,2.3e-05,2.5e-05,9e-06,1.8e-05,2.1e-05,8e-06,7e-06,1.9e-05,1.4e-05,1.2e-05,0,2.3e-05,2.3e-05,8e-06,1.1e-05,8e-06,2.5e-05,1.5e-05,1.6e-05,2.1e-05,8e-06,1.9e-05,1.7e-05,1.2e-05,1.2e-05,9e-06,1.6e-05,3.8e-05,8e-06,7e-06,1.1e-05,1e-05,7e-06,4e-06,1.3e-05,1.5e-05,1.5e-05,1e-05,9e-06,1e-06,8e-06,1.5e-05
1e-05,8e-06,1.6e-05,2.2e-05,8e-06,7e-06,2.3e-05,5e-06,1.1e-05,6e-06,2.9e-05,7e-06,2.6e-05,3e-06,3e-06,1.3e-05,6e-06,1.7e-05,1.1e-05,5e-06,5e-06,1.7e-05,1.4e-05,5e-06,1.1e-05,1.1e-05,6e-06,6e-06,3e-06,2e-06,1.4e-05,1.1e-05,1.6e-05,4e-06,1.5e-05,2.5e-05,9e-06,2e-06,6e-06,1.6e-05,1.4e-05,7e-06,7e-06,1.8e-05,1e-05,1.9e-05,2e-05,7e-06,1.6e-05,1e-05,1.2e-05,2.3e-05,2.4e-05,7e-06,7e-06,2e-05,9e-06,8e-06,1.3e-05,9e-06,1.6e-05,1.8e-05,2.1e-05,2.4e-05,9e-06,1.4e-05,1.5e-05,1.2e-05,1.5e-05,9e-06,9e-06,7e-06,9e-06,4.2e-05,1.2e-05,4e-06,2.2e-05,8e-06,6e-06,1.4e-05,1.3e-05,7e-06,2.1e-05,1e-05,2.5e-05,5e-06,8e-06,9e-06,1.3e-05,1.7e-05,2.4e-05,9e-06,1e-05,8e-06,1.6e-05,1.9e-05,4e-06,1.1e-05,2.5e-05,1.4e-05,4e-06,1e-05,1.9e-05,1.5e-05,1.1e-05,1.2e-05,4.6e-05,6e-06,5e-06,1.6e-05,1.7e-05,1.3e-05,1.5e-05,1.6e-05,1.6e-05,4e-06,8e-06,1e-05,3e-06,1.3e-05,2.4e-05
1.1e-05,2.4e-05,1.5e-05,1.3e-05,5e-06,1.2e-05,2.5e-05,1.4e-05,1.3e-05,1.9e-05,2.1e-05,2e-06,2.9e-05,2.2e-05,2.8e-05,2.2e-05,2.3e-05,2e-05,2.2e-05,7e-06,1.2e-05,9e-06,9e-06,1.1e-05,2e-05,1.1e-05,4e-06,1.3e-05,1.3e-05,1e-06,1.2e-05,1.6e-05,7e-06,8e-06,1.9e-05,2.8e-05,1.5e-05,1e-06,8e-06,1.9e-05,2.8e-05,6e-06,3e-06,1.5e-05,1.5e-05,1.5e-05,2.6e-05,1.7e-05,1.9e-05,7e-06,1.3e-05,1.1e-05,2.5e-05,1.4e-05,1.4e-05,2.1e-05,1.2e-05,1e-05,2.2e-05,1.6e-05,2.6e-05,2.1e-05,2.1e-05,2.1e-05,2e-05,1.6e-05,2e-05,7e-06,1.2e-05,6e-06,2.1e-05,2.5e-05,2.1e-05,4.3e-05,1.8e-05,1.2e-05,1.1e-05,1.3e-05,5e-06,1.6e-05,2.1e-05,1.3e-05,1.1e-05,1.1e-05,1e-05,1.8e-05,2e-05,1.2e-05,1.3e-05,1.1e-05,2.8e-05,2.5e-05,9e-06,7e-06,2.1e-05,2e-05,1e-05,1.8e-05,4.4e-05,1.8e-05,1.5e-05,1.1e-05,1.6e-05,1.5e-05,1.9e-05,1.1e-05,4.8e-05,1.7e-05,1.6e-05,8e-06,2.4e-05,1.3e-05,1.4e-05,8e-06,7e-06,3e-06,1.5e-05,1e-05,1e-06,1.5e-05,2.5e-05
3.2e-05,4.6e-05,2.5e-05,1.9e-05,1.8e-05,2.4e-05,1.5e-05,1.3e-05,9e-06,1.4e-05,3.5e-05,1.3e-05,2.9e-05,5.5e-05,1e-05,2.1e-05,2e-05,1.9e-05,2.7e-05,1.7e-05,1.1e-05,1.4e-05,3.3e-05,3.5e-05,6e-06,1.7e-05,2.4e-05,2.4e-05,7e-06,6e-06,1.9e-05,3.6e-05,4.8e-05,2e-05,1.4e-05,2.7e-05,3.1e-05,2.8e-05,2.1e-05,3e-06,2.3e-05,1.1e-05,1.5e-05,2.1e-05,1.9e-05,2.8e-05,2.1e-05,2e-05,3.8e-05,3.6e-05,2.3e-05,2.4e-05,3.2e-05,4e-06,2.6e-05,3.1e-05,1.3e-05,1.8e-05,2.3e-05,3.1e-05,3.2e-05,8e-06,2.7e-05,7e-06,1.8e-05,2.8e-05,3.2e-05,1.9e-05,1.1e-05,3e-06,1.6e-05,1e-05,1.3e-05,3.4e-05,1.5e-05,1.7e-05,2.8e-05,3e-06,2.3e-05,2.6e-05,4e-05,7e-06,1.8e-05,7e-06,1.1e-05,2.9e-05,2.8e-05,1.4e-05,1.6e-05,1.8e-05,3.5e-05,2.4e-05,1.2e-05,2.1e-05,1.4e-05,2.2e-05,5e-05,4.7e-05,5.7e-05,4.8e-05,8e-06,3.3e-05,8e-06,7e-06,1.6e-05,7e-06,4.5e-05,2.8e-05,3.5e-05,2.6e-05,3.1e-05,2.1e-05,3.1e-05,3.5e-05,3.7e-05,1.6e-05,2e-05,3e-06,1e-05,1.5e-05,4.4e-05
3.5e-05,1.1e-05,8e-06,9e-06,1e-05,3.3e-05,4e-05,1.1e-05,1.9e-05,7e-06,1.2e-05,1.3e-05,1.8e-05,2.3e-05,2.6e-05,2.5e-05,3.8e-05,3.2e-05,1.9e-05,2e-05,1.5e-05,5e-06,3.5e-05,1.7e-05,3.1e-05,2.4e-05,1.5e-05,6e-06,1e-05,1.7e-05,3.9e-05,5.6e-05,3.6e-05,1.5e-05,5e-06,1.7e-05,2.9e-05,1.1e-05,2.1e-05,1.9e-05,7e-06,1.9e-05,2.5e-05,1.9e-05,1.2e-05,1.4e-05,2.3e-05,3.9e-05,1.9e-05,1.3e-05,1.6e-05,2.9e-05,2.9e-05,2.8e-05,3.5e-05,1.7e-05,7e-06,2.6e-05,3.9e-05,3.1e-05,1e-05,2.8e-05,1.8e-05,7e-06,1.4e-05,1.4e-05,5e-06,1.4e-05,2.9e-05,1.3e-05,9e-06,2.1e-05,2e-05,2.4e-05,1.1e-05,3.1e-05,4e-06,1.8e-05,2.3e-05,1e-05,3.9e-05,5.5e-05,3.8e-05,2.9e-05,2.1e-05,3.5e-05,1.5e-05,1.6e-05,1.3e-05,2.3e-05,2e-05,2.5e-05,3.2e-05,1.7e-05,7e-06,2e-05,4.7e-05,4.1e-05,1.3e-05,1.8e-05,3.1e-05,4.5e-05,4.6e-05,2.1e-05,2.2e-05,1.7e-05,3.3e-05,1.4e-05,2e-05,9e-06,4e-06,2e-05,1e-05,2.4e-05,1.7e-05,1.6e-05,1.4e-05,2.1e-05,2.5e-05,6e-06,2.2e-05
1.5e-05,9e-06,1e-06,1.2e-05,4e-06,2.8e-05,1.3e-05,3e-06,1.6e-05,1.5e-05,1.6e-05,6e-06,7e-06,1.1e-05,3e-06,8e-06,2.4e-05,2.6e-05,1.8e-05,7e-06,7e-06,1.5e-05,1.5e-05,1.3e-05,1e-05,2.8e-05,9e-06,3e-06,1e-05,1.9e-05,2.3e-05,1.5e-05,2.3e-05,1.9e-05,8e-06,5e-06,1.4e-05,1.1e-05,1.5e-05,5e-06,1.3e-05,2.1e-05,1e-05,2.3e-05,1.5e-05,1.2e-05,2.2e-05,6e-06,1.6e-05,5e-06,1.6e-05,1.1e-05,1.1e-05,8e-06,1.1e-05,1.5e-05,3e-06,2.1e-05,1e-05,1.1e-05,2.1e-05,1.8e-05,1.9e-05,5e-06,1e-05,1e-05,1.2e-05,1.9e-05,1.2e-05,8e-06,7e-06,1.9e-05,1.9e-05,3.4e-05,7e-06,1.2e-05,1.4e-05,1.8e-05,9e-06,1.3e-05,1.1e-05,3.2e-05,3e-06,8e-06,1.5e-05,1.3e-05,1e-06,1.3e-05,1.1e-05,2e-05,3.9e-05,1.4e-05,1.1e-05,8e-06,1.6e-05,1.2e-05,2e-05,7e-06,1.5e-05,6e-06,4e-06,1.3e-05,6e-06,5e-06,2.7e-05,9e-06,3.2e-05,1.5e-05,1.4e-05,3e-06,1.6e-05,2.3e-05,2.6e-05,6e-06,1.2e-05,4e-06,8e-06,2.6e-05,1.6e-05,1.4e-05,1.6e-05
1.4e-05,8e-06,9e-06,9e-06,9e-06,1.2e-05,1.7e-05,5e-06,8e-06,7e-06,1.9e-05,1.4e-05,1.9e-05,1.7e-05,4e-06,1.4e-05,2.2e-05,2.8e-05,1e-05,5e-06,1.3e-05,1.8e-05,2.4e-05,1.3e-05,9e-06,2.3e-05,1.2e-05,5e-06,1.3e-05,1e-05,1.3e-05,1.8e-05,1.1e-05,1.4e-05,8e-06,1.5e-05,8e-06,2e-06,2e-06,8e-06,1.8e-05,2e-05,1.4e-05,7e-06,1e-05,5e-06,1.4e-05,8e-06,1.4e-05,2.1e-05,1.2e-05,1.5e-05,1.3e-05,8e-06,6e-06,7e-06,6e-06,9e-06,1.1e-05,1.6e-05,1.1e-05,1.7e-05,2.1e-05,4e-06,8e-06,1e-05,4e-06,5e-06,1.2e-05,7e-06,1.6e-05,1.9e-05,1.6e-05,2.6e-05,1.5e-05,1.8e-05,1.9e-05,2.1e-05,5e-06,1.4e-05,2.2e-05,1.1e-05,7e-06,5e-06,1.9e-05,1.1e-05,0,5e-06,1.8e-05,8e-06,2.1e-05,1e-05,1.1e-05,7e-06,1.4e-05,7e-06,1.4e-05,1.7e-05,1e-05,1.9e-05,6e-06,1e-06,1.1e-05,5e-06,1.9e-05,1.9e-05,3.5e-05,1.3e-05,1e-06,1.1e-05,1.5e-05,1e-05,9e-06,5e-06,1.2e-05,1.3e-05,7e-06,8e-06,1.4e-05,1.4e-05,1.1e-05
1.9e-05,9e-06,7e-06,1.3e-05,9e-06,1e-05,2e-05,5e-06,6e-06,6e-06,1.7e-05,9e-06,1.2e-05,2.2e-05,1e-06,1.3e-05,1.3e-05,2.6e-05,1.1e-05,1e-06,1.1e-05,1.3e-05,2.7e-05,1.6e-05,3e-06,1.6e-05,1.1e-05,8e-06,9e-06,1.1e-05,9e-06,1.7e-05,4e-06,5e-06,1.7e-05,8e-06,1.1e-05,7e-06,3e-06,9e-06,1.3e-05,1.6e-05,1.3e-05,1.2e-05,1e-05,7e-06,1.3e-05,4e-06,1.8e-05,1.9e-05,1e-05,1.9e-05,9e-06,8e-06,7e-06,1.2e-05,5e-06,1e-05,5e-06,9e-06,7e-06,2.1e-05,1.3e-05,3e-06,9e-06,6e-06,1.1e-05,9e-06,1.8e-05,0,9e-06,2e-06,1.3e-05,3.8e-05,7e-06,1.2e-05,2.4e-05,1e-06,1.2e-05,1.1e-05,1.8e-05,1.7e-05,1.4e-05,1e-06,1.6e-05,2e-06,4e-06,6e-06,4e-06,4e-06,2.3e-05,1.3e-05,3e-06,2e-06,2.2e-05,1.2e-05,9e-06,1e-05,1.4e-05,1.7e-05,1e-05,8e-06,1.2e-05,1e-06,1e-05,9e-06,3.2e-05,3e-06,2e-06,1.4e-05,2e-06,1.3e-05,1e-05,6e-06,4e-06,4e-06,1.1e-05,7e-06,6e-06,4e-06,9e-06
8e-06,7e-06,4e-06,1e-05,1e-05,1e-06,1.8e-05,3e-06,8e-06,9e-06,1.6e-05,9e-06,5e-06,1.2e-05,6e-06,4e-06,5e-06,1.4e-05,1.8e-05,6e-06,6e-06,8e-06,2e-05,8e-06,9e-06,1.3e-05,1e-05,3e-06,5e-06,7e-06,7e-06,1.8e-05,4e-06,1e-06,1.1e-05,8e-06,1.1e-05,4e-06,8e-06,1.2e-05,1.6e-05,1.3e-05,4e-06,1.4e-05,1.1e-05,1e-05,1.1e-05,1e-06,1.2e-05,2e-06,4e-06,1.8e-05,1.5e-05,2e-06,1e-06,9e-06,9e-06,3e-06,1.6e-05,5e-06,1.4e-05,2.5e-05,2e-05,6e-06,1.3e-05,5e-06,5e-06,9e-06,1.4e-05,1e-06,8e-06,1e-05,4e-06,2.7e-05,3e-06,1.1e-05,2.1e-05,1.1e-05,7e-06,1.3e-05,7e-06,9e-06,7e-06,3e-06,1.3e-05,6e-06,3e-06,3e-06,5e-06,2e-06,2e-05,1e-05,1e-06,5e-06,2.2e-05,5e-06,6e-06,7e-06,1e-05,1.2e-05,5e-06,6e-06,6e-06,3e-06,8e-06,9e-06,3.3e-05,9e-06,3e-06,1.1e-05,7e-06,7e-06,7e-06,7e-06,5e-06,3e-06,7e-06,4e-06,2e-06,7e-06,9e-06
1e-05,6e-06,2e-06,7e-06,7e-06,4e-06,1.5e-05,3e-06,6e-06,1e-05,1.7e-05,1.2e-05,4e-06,1.2e-05,4e-06,9e-06,2e-06,2.1e-05,1.2e-05,3e-06,1e-06,6e-06,1.2e-05,3e-06,9e-06,1.4e-05,1.3e-05,3e-06,8e-06,6e-06,4e-06,1.3e-05,8e-06,1e-06,1.2e-05,5e-06,9e-06,3e-06,3e-06,1e-05,8e-06,1e-05,2e-06,1.2e-05,8e-06,6e-06,8e-06,1e-06,7e-06,5e-06,3e-06,1.4e-05,6e-06,2e-06,1e-06,3e-06,8e-06,4e-06,1.1e-05,1.5e-05,1.2e-05,2.8e-05,8e-06,8e-06,1.1e-05,5e-06,3e-06,7e-06,1.2e-05,2e-06,6e-06,1e-05,9e-06,3.2e-05,3e-06,1e-05,1.1e-05,1.4e-05,6e-06,1.1e-05,4e-06,8e-06,9e-06,4e-06,1.5e-05,4e-06,4e-06,2e-06,5e-06,7e-06,2.3e-05,1e-05,2e-06,5e-06,1.9e-05,7e-06,2e-06,4e-06,1.1e-05,5e-06,6e-06,5e-06,9e-06,3e-06,9e-06,6e-06,3.3e-05,7e-06,3e-06,5e-06,7e-06,5e-06,2e-06,2e-06,3e-06,4e-06,2e-06,6e-06,2e-06,7e-06,1.2e-05
1.1e-05,1.1e-05,5e-06,1e-05,7e-06,4e-06,1.6e-05,4e-06,1e-06,7e-06,1.2e-05,6e-06,2e-06,1.5e-05,6e-06,7e-06,3e-06,2.3e-05,1e-05,1e-06,1e-06,7e-06,1.5e-05,8e-06,7e-06,1.4e-05,1e-05,4e-06,3e-06,7e-06,4e-06,1.3e-05,5e-06,6e-06,1.4e-05,1e-05,6e-06,6e-06,4e-06,7e-06,1.1e-05,1e-05,0,1e-05,2e-06,6e-06,1.1e-05,3e-06,9e-06,4e-06,4e-06,1e-05,8e-06,2e-06,3e-06,6e-06,7e-06,3e-06,7e-06,1.6e-05,1.4e-05,1.9e-05,1.3e-05,6e-06,4e-06,3e-06,2e-06,3e-06,1.1e-05,2e-06,8e-06,1.6e-05,1e-06,3.1e-05,4e-06,8e-06,9e-06,1.3e-05,6e-06,1.1e-05,2e-06,1e-05,5e-06,8e-06,9e-06,5e-06,3e-06,4e-06,7e-06,8e-06,1.9e-05,9e-06,2e-06,3e-06,1.6e-05,7e-06,3e-06,6e-06,1.6e-05,5e-06,5e-06,5e-06,1.2e-05,3e-06,1.1e-05,6e-06,2.9e-05,1.1e-05,6e-06,1e-05,5e-06,5e-06,6e-06,1e-06,0,2e-06,5e-06,7e-06,4e-06,5e-06,1.1e-05
7e-06,6e-06,6e-06,7e-06,5e-06,2e-06,1.5e-05,2e-06,3e-06,6e-06,1.4e-05,5e-06,4e-06,1.4e-05,5e-06,5e-06,2e-06,1.7e-05,1.2e-05,3e-06,5e-06,6e-06,1.8e-05,3e-06,5e-06,1.4e-05,7e-06,5e-06,5e-06,5e-06,6e-06,1.7e-05,4e-06,3e-06,7e-06,5e-06,7e-06,4e-06,5e-06,6e-06,1.2e-05,8e-06,1e-06,9e-06,6e-06,9e-06,1.1e-05,2e-06,9e-06,3e-06,1e-06,7e-06,5e-06,4e-06,2e-06,8e-06,7e-06,2e-06,1.1e-05,9e-06,1.3e-05,1.6e-05,1e-05,3e-06,5e-06,3e-06,5e-06,8e-06,1.3e-05,2e-06,7e-06,1.2e-05,3e-06,3e-05,4e-06,8e-06,1e-05,8e-06,4e-06,1.3e-05,5e-06,1.2e-05,6e-06,2e-06,1.1e-05,4e-06,2e-06,3e-06,5e-06,8e-06,2.2e-05,9e-06,2e-06,4e-06,1.6e-05,7e-06,4e-06,2e-06,1.3e-05,9e-06,4e-06,6e-06,9e-06,2e-06,1e-05,8e-06,2.8e-05,7e-06,2e-06,8e-06,7e-06,3e-06,4e-06,2e-06,3e-06,3e-06,6e-06,4e-06,2e-06,4e-06,1e-05
7e-06,6e-06,4e-06,6e-06,6e-06,1e-06,1.5e-05,1e-06,3e-06,4e-06,1.3e-05,7e-06,5e-06,1.4e-05,2e-06,8e-06,3e-06,1.8e-05,1.1e-05,3e-06,3e-06,7e-06,1.8e-05,5e-06,7e-06,1.4e-05,1e-05,3e-06,4e-06,6e-06,6e-06,1.6e-05,3e-06,1e-06,7e-06,9e-06,6e-06,3e-06,2e-06,7e-06,1.1e-05,7e-06,1e-06,1e-05,9e-06,6e-06,1e-05,1e-06,7e-06,4e-06,3e-06,1.1e-05,8e-06,4e-06,1e-06,5e-06,8e-06,3e-06,1.1e-05,1e-05,1.1e-05,1.7e-05,1.1e-05,4e-06,4e-06,2e-06,4e-06,5e-06,1.2e-05,3e-06,6e-06,1.2e-05,1e-06,2.8e-05,4e-06,1e-05,1.3e-05,1e-05,3e-06,1.1e-05,3e-06,1.1e-05,6e-06,1e-06,1.1e-05,4e-06,4e-06,3e-06,4e-06,7e-06,1.9e-05,9e-06,2e-06,4e-06,1.6e-05,5e-06,6e-06,2e-06,1.1e-05,8e-06,4e-06,5e-06,9e-06,2e-06,8e-06,6e-06,2.9e-05,2e-06,3e-06,9e-06,7e-06,2e-06,3e-06,1e-06,2e-06,3e-06,3e-06,4e-06,1e-06,7e-06,1e-05
5e-06,7e-06,4e-06,7e-06,6e-06,1e-06,1.5e-05,2e-06,3e-06,6e-06,1.1e-05,5e-06,4e-06,1.4e-05,1e-06,6e-06,4e-06,1.9e-05,1.1e-05,2e-06,5e-06,7e-06,1.6e-05,5e-06,7e-06,1.4e-05,1e-05,2e-06,3e-06,6e-06,5e-06,1.6e-05,0,2e-06,9e-06,7e-06,7e-06,2e-06,1e-06,7e-06,1.1e-05,9e-06,1e-06,1e-05,7e-06,9e-06,1.1e-05,1e-06,5e-06,2e-06,3e-06,1e-05,8e-06,4e-06,0,5e-06,7e-06,3e-06,8e-06,1e-05,1.2e-05,1.7e-05,1.2e-05,2e-06,6e-06,2e-06,3e-06,6e-06,1.3e-05,2e-06,5e-06,1.1e-05,2e-06,2.7e-05,4e-06,7e-06,1.2e-05,9e-06,2e-06,1.1e-05,3e-06,1.2e-05,7e-06,1e-06,1.1e-05,2e-06,3e-06,2e-06,4e-06,6e-06,1.8e-05,9e-06,2e-06,2e-06,1.7e-05,7e-06,4e-06,2e-06,1.2e-05,7e-06,4e-06,7e-06,1e-05,2e-06,1.1e-05,7e-06,2.9e-05,4e-06,1e-06,6e-06,6e-06,2e-06,2e-06,1e-06,2e-06,2e-06,3e-06,3e-06,1e-06,6e-06,1.1e-05
