1.5e-05,1.2e-05,0.000106,3.1e-05,7.8e-05,3.7e-05,2.1e-05,2e-06,3.2e-05,0,2e-05,1.3e-05,1.6e-05,1.2e-05,1.4e-05,0.000262,0.000206,3e-06,6.7e-05,7.6e-05,3.5e-05,5.6e-05,3.2e-05,5.1e-05,1.3e-05,0.000208,2.8e-05,8e-06,1.8e-05,0.001142,0.000646,5.9e-05,0.000438,0.00016,3e-04,0.000815,0.000193,0.000143,0.000942,9.4e-05,0.000422,2e-05,0.000482,0.000289,0.000242,0.000241,0.000457,0.000103,5e-04,0.000194,8e-06,0.000403,0.000274,0.000539,0.00033,2.3e-05,0.000254,0.000126,9.9e-05,0.000313,5.7e-05,4.1e-05,9e-05,3.7e-05,2.3e-05,9.4e-05,7.1e-05,3.6e-05,5.2e-05,0.000127,0.00013,0.000192,6e-06,9.9e-05,7.1e-05,3e-06,5.8e-05,4.3e-05,1.2e-05,5.2e-05,6.2e-05,4e-06,2.4e-05,6e-06,1.1e-05,3e-05,3e-05,5e-05,2.6e-05,0.000153,4.3e-05,5.5e-05,4.7e-05,7e-05,1.3e-05,0.000171,0.000545,7.5e-05,6e-05,7e-06,1.3e-05,7.2e-05,3e-05,2.4e-05,0.000107,3.3e-05,2.2e-05,4e-05,6e-06,2.6e-05,1.4e-05,2.8e-05,1.5e-05,4e-06,1.1e-05,2.8e-05,2.6e-05,3e-05,5.1e-05,3e-06,2.1e-05
7.7e-05,5.7e-05,0.000265,0.000305,0.000226,0.000221,0.000104,2.5e-05,5.2e-05,4.7e-05,1.8e-05,1e-06,3.5e-05,6.4e-05,4.9e-05,0.000503,0.00059,0.000223,6e-05,0.00012,8.9e-05,0.000122,9.8e-05,0.00011,0.000102,0.000677,0.000554,0.00028,0.000164,0.003075,0.000577,0.000888,0.0014,0.000107,0.001011,0.002634,0.001891,0.001884,0.002449,0.001661,0.000492,0.00076,0.001745,0.000393,0.000192,0.000232,0.000543,0.000345,0.001495,7.9e-05,0.000661,0.001384,0.001481,0.001102,0.001063,0.00088,0.000185,0.000453,0.000377,0.000706,0.000186,0.000198,0.000174,6.2e-05,0.00028,7.9e-05,0.000335,2.7e-05,0.000131,0.000206,0.000379,0.00081,0.000555,0.000272,0.000125,0.000147,2.8e-05,3.5e-05,6.7e-05,9.2e-05,0.000188,5.2e-05,3.4e-05,3.6e-05,8.7e-05,8.7e-05,6.9e-05,0.000111,0.000402,0.00046,0.000374,0.000396,0.000167,0.000155,0.000243,0.000315,0.001278,0.000807,0.000582,0.000256,9.7e-05,0.00012,0.000162,0.00018,0.000218,0.00019,0.000121,0.000136,0.000121,8.7e-05,8.8e-05,4.3e-05,7.4e-05,5.8e-05,5.6e-05,8.5e-05,0.000128,0.000107,0.000135,0.000139,8.7e-05
8.3e-05,6.5e-05,0.000374,0.000817,0.000443,0.000123,1.8e-05,7.7e-05,3.2e-05,4.3e-05,2.7e-05,1.5e-05,2e-05,3.5e-05,4.6e-05,0.000511,0.000901,6.5e-05,0.000127,0.000275,0.000175,0.000153,0.000233,0.000228,0.000389,0.000401,0.000313,0.000158,0.000207,0.004778,0.003248,0.001271,0.000107,0.000416,0.001926,0.002488,0.000321,0.001473,0.003615,0.003122,0.002865,0.00109,0.002211,0.002293,0.001563,0.001157,0.001805,0.001155,0.00086,0.00095,0.000733,0.001917,0.000451,3.7e-05,0.00067,0.001292,0.001072,0.000526,0.000855,0.00081,0.00027,0.000332,0.000539,0.000494,0.000634,0.000465,0.00066,0.000625,8.3e-05,8.8e-05,0.00027,0.000874,0.00039,0.000254,0.000143,7.5e-05,8.3e-05,0.000125,0.000171,0.000186,0.000333,0.000228,0.000132,3.3e-05,7.6e-05,3.8e-05,0.00016,3.7e-05,0.000605,0.00035,8.4e-05,0.000233,0.000716,0.000627,0.000112,0.000301,0.000883,0.000774,0.000218,9.2e-05,9e-05,0.000104,4.5e-05,0.000105,0.000133,6.8e-05,5.2e-05,5e-05,2.3e-05,2.4e-05,2.8e-05,5.4e-05,4.6e-05,2e-05,3.4e-05,2.9e-05,6.4e-05,1.5e-05,5.8e-05,8e-05,2.6e-05
7e-05,4.9e-05,0.000546,0.001219,0.000571,0.000204,2.4e-05,9e-05,6e-05,6.9e-05,6.8e-05,7.7e-05,5.8e-05,1.2e-05,6e-05,0.000452,0.000424,0.000381,6.8e-05,0.000256,0.000203,0.000193,0.000256,0.000508,0.000631,0.000351,6.6e-05,0.000143,0.000116,0.006033,0.005575,0.002681,0.00045,0.000956,0.002189,0.001178,0.002512,0.000649,0.003707,0.002288,0.000879,0.001916,0.00133,0.000576,0.001044,0.000805,0.002225,0.000551,0.001627,0.00114,0.001773,0.000284,0.000814,0.000402,0.000697,0.001152,0.000382,0.000421,0.000649,0.001085,0.000762,0.000217,0.000588,0.000352,0.000715,0.001025,0.000481,0.000355,0.000467,0.000731,0.000226,0.000483,0.000353,0.000154,3.9e-05,0.000127,6.6e-05,7.1e-05,9.2e-05,3.3e-05,0.000102,4.9e-05,4.5e-05,0.000113,4.1e-05,3.7e-05,0.000224,0.000193,0.000639,0.000294,0.000191,0.000189,0.000977,0.000526,0.000295,0.000509,0.001475,0.000699,0.00053,0.000149,9.2e-05,4.5e-05,3.4e-05,4.7e-05,0.000141,6.7e-05,2.4e-05,4.6e-05,6.5e-05,3.9e-05,3.1e-05,4e-05,5.7e-05,4.9e-05,7e-06,2.6e-05,5.3e-05,4.6e-05,7.4e-05,1.8e-05,8e-06
5.6e-05,5.3e-05,0.000682,0.001151,0.000525,0.000261,0.000153,0.000119,5.8e-05,8.2e-05,2.7e-05,5.6e-05,2.1e-05,1.5e-05,1.1e-05,0.000508,0.000637,0.000629,0.000293,0.000422,0.00028,0.000175,0.00026,0.000173,0.000762,0.000237,0.000178,0.000212,0.000242,0.007065,0.003693,0.00232,0.000517,0.002248,0.003207,0.00253,0.004121,0.001576,0.00625,0.00317,0.00128,0.002298,0.002026,0.001367,0.000936,0.000732,0.000375,0.001405,0.000882,0.000578,0.002873,0.001681,0.000777,0.00098,0.000886,0.000263,0.000497,0.000275,0.001051,0.000292,0.000795,0.000639,0.00107,0.000423,0.000459,0.001046,0.001121,0.000887,0.001096,0.00022,0.000231,0.00054,0.000164,4.1e-05,7.4e-05,5.1e-05,5.3e-05,8.7e-05,0.000119,0.000147,9.2e-05,7.8e-05,3.6e-05,8.9e-05,4.3e-05,1.7e-05,0.00019,0.000165,0.000507,0.000801,0.000362,0.000155,0.000912,0.000343,7.3e-05,0.000776,0.001599,0.000819,0.000261,6.1e-05,6.6e-05,4.8e-05,8.9e-05,5e-05,0.000208,2.7e-05,5.7e-05,1.1e-05,5.2e-05,3e-05,5.6e-05,4.7e-05,2.4e-05,3e-05,5e-05,2.7e-05,3.4e-05,9.8e-05,9.9e-05,4.7e-05,2.4e-05
5e-05,0.000112,0.00096,6e-04,0.000441,0.000272,0.000107,3.3e-05,3.6e-05,7.5e-05,7.9e-05,3e-06,4.4e-05,4.3e-05,6.8e-05,0.000486,0.001102,0.000246,9e-05,0.001254,0.00058,0.000153,0.000391,0.000103,0.000766,0.001086,0.000389,5.8e-05,0.000208,0.006713,0.003278,0.001636,0.00097,0.002287,0.002207,0.000193,0.002634,0.003715,0.005438,0.003404,0.001527,0.001273,0.000751,0.001322,0.001386,0.000475,0.001519,0.001424,0.002416,0.001964,0.001086,0.000953,0.001731,0.001931,0.001281,0.001339,0.002288,0.000274,0.001358,0.001488,0.000262,0.000158,0.00084,0.000381,0.000778,0.000981,0.001234,0.001033,0.000274,0.000758,0.000279,0.000337,0.000333,8.2e-05,8.6e-05,0.000108,4.4e-05,9.3e-05,4e-05,0.000113,0.00015,0.000147,6.3e-05,4.7e-05,5.1e-05,7.7e-05,0.000205,7.5e-05,0.000494,0.001003,0.000504,0.000164,0.000704,0.000341,0.000254,0.000543,0.001536,0.001006,0.000414,0.000101,0.000207,0.000135,0.000121,2e-05,0.000261,0.000142,0.000114,6.7e-05,6.9e-05,6.3e-05,5e-05,0.000106,3.6e-05,7.2e-05,9.3e-05,6.6e-05,3.9e-05,6.3e-05,6.6e-05,3.4e-05,4.2e-05
7.8e-05,0.000103,0.00112,0.000771,0.000121,0.00027,0.000239,0.000125,0.000115,8.8e-05,5.8e-05,6.3e-05,5.7e-05,9.5e-05,0.000154,0.000338,0.000423,0.000517,0.00068,0.001977,0.000721,0.000214,0.000462,0.001013,0.000705,0.000376,0.000345,0.000119,0.000374,0.005816,0.00373,0.000978,0.000618,0.001941,0.004202,0.002647,0.001233,0.001207,0.004619,0.002764,0.001935,0.003934,0.00115,0.001431,0.00154,0.000526,0.002431,0.002144,0.002733,0.002235,0.001714,0.000706,0.003084,0.000433,0.000983,0.003599,0.002291,0.003705,0.003146,0.001306,0.000789,0.000701,0.000643,0.001899,0.002475,0.001996,0.000609,0.000451,0.000221,8.2e-05,0.000375,0.000457,2e-04,0.000145,0.00012,3.3e-05,4.7e-05,3.2e-05,0.000101,0.000139,0.000256,0.000155,0.000105,9.8e-05,9.2e-05,8.6e-05,0.00016,0.000141,0.000384,0.000492,0.000324,0.000122,0.000568,0.00017,9.1e-05,0.000328,0.000649,0.001111,0.000432,0.000157,0.000455,0.000153,0.000143,8.3e-05,0.000383,0.000109,6.4e-05,3.8e-05,1.1e-05,4e-05,6.5e-05,0.000126,0.000133,0.00016,0.000209,0.000148,0.000155,0.000113,6.6e-05,6.9e-05,0.00012
6.4e-05,6.8e-05,0.001513,0.00132,0.000649,0.000327,0.000136,0.000125,2.3e-05,1.5e-05,2.9e-05,2.5e-05,1.7e-05,8.8e-05,0.000143,0.00042,0.002569,0.001776,0.001089,0.001867,0.001469,0.000557,0.000523,0.001474,0.000979,0.000221,0.000323,0.000115,0.000571,0.003686,0.005072,0.0034,0.002222,0.002617,0.008418,0.007347,0.005131,0.002441,0.001682,0.003828,0.003717,0.006432,0.005107,0.002517,0.000881,0.001554,0.001864,0.000552,0.004585,0.007147,0.003937,0.003049,0.00295,0.003063,0.000839,0.003632,0.005473,0.00607,0.002667,0.002624,0.002254,0.001196,0.000748,0.002455,0.001093,0.001245,0.002257,0.001071,0.000832,0.000698,0.000378,0.000485,0.000714,0.000413,0.000264,0.00013,4.1e-05,6e-05,6.1e-05,0.000193,0.000318,0.000131,8.6e-05,0.000235,0.000191,0.000111,0.000104,0.00028,0.000496,0.000705,0.000121,6.1e-05,0.000616,0.000646,0.000404,0.000796,0.000869,0.001552,0.00099,0.000362,0.00044,0.000252,0.000158,0.000128,0.000723,0.000439,0.000212,7.5e-05,1.2e-05,7e-06,0.000137,0.000122,8.9e-05,3.9e-05,6.8e-05,5.2e-05,7.7e-05,0.000413,0.000206,0.000104,4.4e-05
6.7e-05,4e-05,0.001719,0.004249,0.002404,0.000859,0.000266,0.000145,7.7e-05,1.2e-05,2.4e-05,4e-05,5.8e-05,0.000107,3e-04,0.000162,0.00416,0.002435,0.002061,0.003387,0.002587,0.001255,0.000736,0.001042,0.001155,0.001342,0.000634,0.000389,0.000585,0.002481,0.002712,0.001831,0.000479,0.001662,0.008495,0.003484,0.001208,0.001216,0.00109,0.00298,0.001551,0.004218,0.004022,0.002431,0.001506,0.002304,0.000582,0.000915,0.003183,0.004652,0.00675,0.004453,0.003649,0.003059,0.004404,0.004008,0.004227,0.001364,0.001555,0.001301,0.000633,0.000555,0.000117,0.001773,0.001012,0.001323,0.000455,0.000624,0.002603,0.001848,0.001012,0.000646,0.000298,0.000138,5.3e-05,3.9e-05,3.3e-05,0.000114,0.000104,0.000134,0.000163,8.7e-05,0.000101,0.000184,0.000128,6.8e-05,0.000196,4e-04,0.00013,0.000895,0.000603,0.000278,0.000513,0.000971,0.000578,0.001628,0.001456,0.00063,0.000459,0.000301,0.000336,0.000455,0.000194,0.000171,0.000876,0.001794,0.000846,0.000287,6.3e-05,4.9e-05,0.000128,0.00015,8.8e-05,4.5e-05,2.1e-05,3.4e-05,5.9e-05,0.000577,0.000379,0.000194,6.2e-05
4.4e-05,4.8e-05,0.001742,0.00532,0.003003,0.000986,0.000401,0.000232,7.8e-05,2.6e-05,1.8e-05,9e-06,3.6e-05,0.000125,0.000232,0.000548,0.005265,0.006227,0.002546,0.002601,0.001676,0.000715,0.000689,0.001419,6.7e-05,0.000595,0.000198,0.000262,0.000677,0.000711,0.002201,0.000386,0.000718,0.002488,0.005641,0.003795,0.001587,0.001668,0.000403,0.001384,0.000887,0.001984,0.002171,0.001031,0.001191,0.001733,0.001836,0.000951,0.002199,0.001463,0.001651,0.001808,0.000961,0.001448,0.001832,0.001726,0.000343,0.001458,0.001572,0.000522,0.000561,0.000283,0.00046,0.000571,0.000562,0.000571,0.000881,0.000757,0.002416,0.001287,0.000229,0.000156,6.2e-05,0.000106,6e-05,8e-05,4e-05,9.9e-05,7.8e-05,0.000121,0.000311,0.000109,0.00011,3.4e-05,0.000134,7.1e-05,0.000324,0.000581,0.000536,0.000622,0.000435,0.00035,0.000335,0.00061,0.000181,0.001719,0.001516,0.001163,0.000443,0.000105,0.00059,0.000478,0.000299,0.000288,0.000822,0.00216,0.001229,0.000496,6e-05,2e-05,9e-05,3.3e-05,5.7e-05,5.6e-05,6.7e-05,3.1e-05,6.9e-05,0.000493,0.000273,8.4e-05,3.1e-05
1.6e-05,2.5e-05,0.001702,0.003189,0.002035,0.00117,0.000292,0.000105,3.3e-05,3.6e-05,9e-06,1.7e-05,2.7e-05,0.000102,7.8e-05,0.000639,0.004792,0.003355,0.001844,0.000911,0.000437,0.000212,0.000572,0.001309,0.001209,0.001138,0.000595,0.000133,0.000407,0.000575,0.001014,0.000734,0.001158,0.001935,0.00433,0.002255,0.000914,0.000977,0.001145,0.001513,0.000405,0.002968,0.00046,0.000449,0.001593,0.00086,0.00165,0.001622,0.002101,0.00097,0.00177,0.000381,0.000332,0.001899,0.001056,0.000765,0.00189,0.001086,0.000119,0.000325,0.000721,0.00043,0.000548,0.000736,0.000616,0.000267,0.000495,0.00046,0.002378,0.000907,0.000135,0.000293,9.9e-05,7.8e-05,4.6e-05,5.8e-05,8e-05,4e-05,2.4e-05,4.9e-05,0.000287,0.000192,0.000132,0.000101,0.000115,9.7e-05,0.000383,0.000416,0.000294,0.000389,0.000119,0.000203,0.000353,0.000109,9.9e-05,0.001475,0.001457,0.000729,0.000157,7.5e-05,0.000766,0.000435,0.000274,0.000417,0.000736,0.001141,0.000712,0.000301,4.6e-05,2.7e-05,4.8e-05,5.3e-05,3.8e-05,7.5e-05,3.3e-05,7.1e-05,0.000138,0.000178,1e-04,6.6e-05,5.3e-05
1.7e-05,2.4e-05,0.001518,0.001761,0.00043,5.2e-05,0.000161,4.5e-05,1.7e-05,2.4e-05,2.2e-05,1.4e-05,1e-05,9.7e-05,5e-05,0.000516,0.004389,0.002043,0.001295,0.001033,0.000328,0.000133,0.00036,0.00058,0.000152,0.000709,0.000719,0.000362,0.000205,0.000476,0.001141,0.00099,0.001737,0.002519,0.00302,0.001535,0.001948,0.002262,0.00248,0.001581,0.000528,0.002989,0.001945,0.001169,0.001027,0.001266,0.000653,0.000749,0.001528,0.000611,0.001704,0.00071,0.000397,0.001084,0.001269,0.000576,0.001582,0.000536,0.000393,0.000691,0.000576,0.000248,0.000735,0.000553,0.000425,5.5e-05,0.000456,0.000425,0.001767,0.001267,0.000426,0.000179,0.000217,9.8e-05,2.7e-05,8.9e-05,7.7e-05,8.4e-05,3.5e-05,7.9e-05,0.000182,8.7e-05,9.1e-05,7.9e-05,2.8e-05,4e-05,0.000408,0.000253,3.7e-05,0.000262,0.000135,0.000106,0.000212,0.000441,8.1e-05,0.000931,0.000364,4.4e-05,3.8e-05,4.1e-05,0.000572,0.000283,1.3e-05,0.000205,0.000313,0.000541,0.00018,4.6e-05,2.6e-05,2e-05,8e-05,2.3e-05,5.5e-05,1.6e-05,3.2e-05,5.3e-05,6.4e-05,0.000102,4.5e-05,1.6e-05,2.9e-05
2.6e-05,3.6e-05,0.001239,0.000609,0.000615,0.000194,8e-06,3e-05,3.6e-05,1.6e-05,6e-06,5e-06,9e-06,4.7e-05,0.00012,0.000267,0.002334,0.00147,0.000876,0.000262,0.000253,0.000184,0.000146,0.000491,0.00082,0.000292,4e-04,0.000236,0.000153,0.000472,0.001423,0.002217,0.000838,0.002257,0.000882,0.000353,0.000999,0.001114,0.001878,0.001001,0.000285,0.00137,0.000898,0.001842,0.001566,0.002107,0.003387,0.000927,0.001232,0.001625,0.000576,0.001609,0.00103,0.001775,0.001686,0.000332,0.001656,0.00012,0.000518,0.000752,0.000736,0.000284,0.000792,0.001044,0.00057,0.000225,0.000572,0.00037,0.000822,0.000129,0.000461,0.000256,6.5e-05,0.00016,2.7e-05,4.5e-05,0.000101,6.8e-05,4.3e-05,0.000124,0.000171,4e-06,8.2e-05,3.5e-05,7.6e-05,1.4e-05,0.000365,0.000105,8.5e-05,0.000252,4.2e-05,0.000104,0.000273,4e-04,0.000175,0.000384,0.000124,3e-05,7.9e-05,4.4e-05,0.000281,0.000153,9.7e-05,0.000158,0.000358,2.7e-05,5.2e-05,6.2e-05,1.3e-05,2.9e-05,0.000112,7.7e-05,4.9e-05,4e-06,2.6e-05,1e-05,7.1e-05,0.000112,6e-06,2.4e-05,2.5e-05
2.5e-05,2.1e-05,0.000993,0.001314,0.000489,0.000249,0.000116,5.4e-05,4.2e-05,3.9e-05,3.1e-05,1.8e-05,2.6e-05,4e-06,0.000172,0.000394,0.000865,2e-05,6.5e-05,0.00051,0.000304,7.8e-05,0.000172,0.000333,0.000559,0.000369,5.4e-05,6.3e-05,0.000118,0.001139,0.000822,0.001647,0.001182,0.003017,0.000513,0.002676,0.002114,0.002861,0.001277,0.001957,0.001406,0.002482,0.00231,0.003228,0.000944,0.001025,0.001218,0.001228,0.001014,0.001431,0.002469,0.000652,0.001443,0.001771,0.001846,0.001021,0.002382,0.002566,0.000714,0.001681,0.000806,0.001212,0.000314,0.000887,0.001181,0.000494,0.000508,0.000202,0.000725,0.001132,0.000524,0.000249,9.3e-05,0.000127,8.6e-05,5.8e-05,9.5e-05,2.7e-05,2.8e-05,0.00013,8.9e-05,6.5e-05,5.8e-05,5.1e-05,1.9e-05,1.3e-05,0.000359,0.000194,5.2e-05,0.000385,0.000172,0.000117,0.000422,0.000514,0.000234,0.000963,0.000422,6.4e-05,8.3e-05,0.000127,3.2e-05,4.9e-05,4.6e-05,4.9e-05,0.00029,0.000177,4e-05,5.2e-05,4.3e-05,4.2e-05,7.6e-05,4.8e-05,6.5e-05,2.9e-05,3.2e-05,4.5e-05,5.5e-05,0.000104,4.5e-05,4e-05,3.3e-05
3e-05,7e-06,0.000738,0.001535,0.000706,0.000124,0.000187,8.5e-05,5.1e-05,5e-06,1.2e-05,2e-05,3e-05,5.4e-05,0.00019,0.000359,0.002696,0.002124,0.000786,0.000402,0.000212,8.4e-05,0.000143,0.000428,0.000399,0.000242,0.000134,5.8e-05,0.000181,0.001986,0.001289,0.002025,0.004169,0.003975,0.002335,0.003476,0.005166,0.004746,0.000896,0.000316,0.001846,0.006809,0.001933,0.004013,0.003965,0.004599,0.000748,0.002279,0.003645,0.002232,0.002773,0.000662,0.001781,0.003213,0.003037,0.001093,0.002696,0.001107,0.001097,0.001948,0.002569,0.001994,0.000833,0.001176,0.001476,0.001108,0.001578,0.000511,0.000862,0.001454,0.000186,0.000119,0.000116,9.4e-05,0.000105,0.000197,7.9e-05,8.8e-05,7.5e-05,0.000144,0.000304,0.000181,9.1e-05,8e-06,5.2e-05,5.9e-05,0.000355,0.000292,0.000233,0.00033,0.000244,6e-05,0.000435,0.000215,0.000241,0.001414,0.00086,0.000475,3.8e-05,0.000125,0.000118,0.000168,0.000156,5.9e-05,0.000285,0.000144,9.5e-05,7.4e-05,5.4e-05,6.9e-05,4.2e-05,6e-05,8.8e-05,1.2e-05,4.5e-05,5e-06,3.8e-05,4.1e-05,5.1e-05,3.6e-05,2.4e-05
3e-05,4e-05,0.000533,0.001106,0.00069,0.000205,0.000201,7.9e-05,2.1e-05,1e-05,9e-06,1.4e-05,3.2e-05,4.9e-05,9.6e-05,0.000316,0.0026,0.001474,0.000678,0.000407,9.5e-05,6.9e-05,7e-05,0.000476,0.001024,0.001058,0.000275,6.4e-05,0.000119,0.002389,0.003859,0.006749,0.004026,0.002827,0.005645,0.007787,0.008193,0.009753,0.009745,0.001468,0.004465,0.005506,0.005413,0.003264,0.00183,0.007138,0.010776,0.001908,0.00537,0.005506,0.002742,0.004765,0.001071,0.003449,0.00505,0.004393,0.001711,0.004471,0.0048,0.001426,0.003135,0.001663,0.000231,0.000753,0.002702,0.001209,0.002035,0.000969,0.001761,0.001155,0.001059,0.000459,0.000191,0.000133,6.2e-05,0.000211,0.000237,0.000225,0.000227,0.000228,0.000522,0.000467,0.000142,5.7e-05,0.000101,0.000181,0.000449,0.000106,7.9e-05,0.000268,0.00051,9.1e-05,0.000331,0.000318,0.000195,0.000995,0.000521,0.000316,7.9e-05,0.000224,0.000221,0.000168,3.5e-05,0.000124,0.000403,0.000131,5.7e-05,0.000102,0.000112,0.000173,0.000139,0.000217,0.000184,0.000122,6.1e-05,9.2e-05,8.5e-05,0.000128,2.8e-05,3.1e-05,0.000104
1.6e-05,6e-06,0.000295,0.001137,0.000333,0.000498,0.000236,7.2e-05,5.4e-05,2.4e-05,1.9e-05,2e-05,3.2e-05,5e-05,8.3e-05,0.000316,0.001232,0.000856,0.000822,0.000749,0.000368,0.000257,0.000223,0.000369,0.00066,0.000443,0.000585,0.000323,0.000107,0.002637,0.004234,0.009213,0.013026,0.013832,0.009544,0.001089,0.003056,0.003978,0.00791,0.011582,0.007575,0.003584,0.005441,0.004894,0.009139,0.010331,0.004595,0.010806,0.012116,0.012611,0.010492,0.00919,0.004914,0.005207,0.003049,0.00466,0.006451,0.002399,0.005972,0.003687,0.002525,0.003876,0.003577,0.001387,0.003543,0.00238,0.002032,0.002768,0.001678,0.003679,0.003778,0.001842,0.000537,9.6e-05,0.000252,0.000207,0.000549,0.000496,0.00017,0.000114,6e-04,0.000806,0.000819,0.000468,8.5e-05,0.000304,9.1e-05,0.000206,9.1e-05,0.000212,0.000348,0.000434,8.5e-05,6.6e-05,0.000135,0.000327,0.000482,0.00025,0.000326,0.000359,0.000154,0.00015,0.000156,0.000224,0.000471,0.000269,0.000308,0.000291,0.000265,3e-05,0.000393,0.000153,0.000305,0.000231,0.000146,0.000157,0.00015,0.000184,0.000193,0.000138,0.000208
2.3e-05,1.5e-05,0.000138,0.001306,0.000887,0.000404,0.000352,0.000175,6.4e-05,1.2e-05,1.4e-05,1.4e-05,1e-05,5.2e-05,0.000253,0.000156,0.001286,0.001516,0.000421,0.000378,0.000276,0.000113,0.000284,0.00031,0.000641,0.000375,0.000444,0.00024,0.000176,0.002285,0.001121,0.006266,0.004543,0.005339,0.002744,0.002529,0.005961,0.004537,0.002937,0.006399,0.010757,0.008791,0.004508,0.001549,0.008596,0.000503,0.005701,0.00825,0.000597,0.004883,0.004714,0.0094,0.011514,0.009258,0.007976,0.009742,0.001904,0.004604,0.006162,0.003128,0.002202,0.002097,0.001242,0.004249,0.005056,0.004404,0.001638,0.000961,0.001896,0.002359,0.003274,0.001736,0.000467,0.000219,0.000279,0.000377,0.000499,0.000634,0.000404,0.000455,0.000193,0.000265,0.000181,0.000311,0.000211,0.000181,0.000376,0.000318,0.000158,0.000369,0.000506,0.00034,6.9e-05,0.000528,0.000154,0.000674,0.000473,0.000315,0.000265,6e-05,0.000165,3.1e-05,5.2e-05,5.9e-05,0.000589,0.000423,0.000173,0.00023,0.000122,0.000141,0.000446,0.000413,0.000261,6.9e-05,0.000101,0.000133,3.6e-05,3.2e-05,0.00011,4.9e-05,0.000135
1.1e-05,2.3e-05,0.000199,0.001587,0.000808,0.000517,0.000195,6.9e-05,1.6e-05,3.1e-05,2e-05,2.3e-05,2.7e-05,2e-05,0.000286,0.000443,0.001395,0.00238,0.001418,0.001098,0.00036,0.000196,0.000329,0.000549,0.000472,5e-04,0.000498,0.000247,0.000106,0.001826,0.005846,0.001596,0.001062,0.002295,0.001417,0.006097,0.007715,0.005721,0.004593,0.002271,0.00317,0.001404,0.003694,0.006604,0.006101,0.004937,0.005087,0.002439,0.003787,0.001515,0.005559,0.00172,0.004915,0.006173,0.001935,0.004358,0.005383,0.006517,0.001936,0.00215,0.002233,0.002011,0.001915,0.003436,0.00077,0.002341,0.001846,0.000571,0.001217,0.003123,0.000314,0.000212,0.000489,0.000224,0.000231,0.000186,0.000231,0.00023,0.000121,0.000319,0.000466,0.00023,8.1e-05,0.000198,0.000181,0.000136,0.000226,0.000142,0.000129,0.000533,0.000341,0.000113,0.000266,0.000751,0.000382,0.001001,0.001106,0.000706,0.000164,3.6e-05,0.000175,0.000183,7.8e-05,6e-05,0.000394,0.000195,0.000157,8.7e-05,5.6e-05,1e-05,0.000414,0.000383,0.000208,7.1e-05,5.3e-05,1.5e-05,2.5e-05,6.8e-05,0.000121,9.9e-05,5.8e-05
1.6e-05,4e-06,0.000349,0.001317,0.000534,0.000266,0.000179,7.5e-05,2.4e-05,2.3e-05,4e-06,1.5e-05,1e-06,1.7e-05,0.000316,0.000119,0.001263,0.002165,0.001071,0.000818,0.000126,9.5e-05,0.000242,0.000356,0.000468,0.000729,0.000564,0.000329,0.000161,0.001247,0.006225,0.005322,0.00294,0.001031,0.002417,0.004137,0.000844,0.000572,0.002178,0.002301,0.001543,0.001121,0.005598,0.007218,0.003284,0.002148,0.000929,0.001478,0.002876,0.00066,0.003661,0.003587,0.002669,0.00198,0.004082,0.002801,0.003012,0.003629,0.003207,0.001485,0.000487,0.002261,0.001746,0.003424,0.003202,0.000234,0.000532,0.000535,0.001647,0.001179,0.000654,0.000336,0.000155,0.000161,9.2e-05,0.000269,0.000309,0.000183,0.000237,0.000101,0.000305,9e-05,0.000171,5.9e-05,0.000177,8.2e-05,0.000211,0.000186,0.000126,0.000785,0.000642,0.000384,0.000144,0.000881,0.000961,0.000388,0.001456,0.000756,0.000299,0.000173,0.000182,0.000265,0.000115,0.000129,7.5e-05,0.000172,0.000129,9e-05,0.000124,4.6e-05,0.000305,7.6e-05,1.3e-05,4.3e-05,5.7e-05,4e-05,3.5e-05,5.6e-05,3.1e-05,1.1e-05,2.3e-05
2.3e-05,4e-06,0.000461,0.000499,0.000316,0.000107,0.000154,8.6e-05,4.2e-05,8e-06,1.1e-05,1.2e-05,1e-05,2.5e-05,0.000365,0.000366,0.001685,0.001397,0.000561,0.00044,5.2e-05,3.7e-05,0.00012,0.000411,0.000472,0.000873,0.000397,8.4e-05,0.00011,0.000974,0.004271,0.000896,0.001478,0.000268,0.001629,0.002004,0.000755,0.001713,0.000919,0.001172,0.001768,0.000887,0.00398,0.001467,0.000146,0.001354,0.00137,0.001571,0.000433,0.002585,0.001402,0.000753,0.001652,0.002271,0.002439,0.002591,0.001322,0.000941,0.00016,0.000438,0.000945,0.001474,0.000997,0.00172,0.000705,0.000915,0.000905,0.000506,0.000811,0.001196,0.00033,0.000175,4.2e-05,7.7e-05,6.4e-05,7e-05,6.7e-05,8.5e-05,0.000108,0.000304,0.000252,0.00025,0.000142,7.5e-05,0.000135,0.000134,3.8e-05,0.000113,0.000333,0.000511,0.000485,0.000204,0.000139,0.000693,0.000939,0.000615,0.000779,0.00036,0.000305,0.00012,0.000411,0.000157,0.000114,7.7e-05,0.000212,0.000263,0.000251,7.7e-05,7.5e-05,6.2e-05,0.000151,9.1e-05,5.7e-05,1.7e-05,4.2e-05,7e-06,2.3e-05,8e-06,3.6e-05,5e-05,8e-06
3.8e-05,1.9e-05,0.000517,0.000415,0.000199,4.2e-05,6.3e-05,1.9e-05,6e-06,2.1e-05,1.5e-05,1.5e-05,1.3e-05,2.2e-05,0.000323,7.4e-05,0.001912,0.000292,0.000325,0.00062,2e-04,0.000112,7e-05,0.000139,0.000224,0.000133,0.000125,5.9e-05,2.7e-05,0.000769,0.002276,0.00174,0.000921,0.000223,0.000692,0.000746,0.002035,0.002814,0.002296,2.8e-05,0.001956,0.001388,0.001025,0.00165,0.001591,0.001188,0.000509,0.001395,0.001257,0.001784,0.001546,0.000253,0.001191,0.001894,0.001309,0.000966,0.001273,0.000726,0.000166,0.000829,0.00027,0.000497,0.000417,0.000532,0.000142,0.000122,0.000397,0.000375,0.000269,0.000634,0.00052,0.000211,5.1e-05,5e-05,3.7e-05,1.5e-05,7.9e-05,1.8e-05,0.000123,3e-04,0.000267,0.000118,9.4e-05,8.9e-05,3.8e-05,6.3e-05,0.00012,7e-05,0.000204,0.000604,0.00028,0.000109,0.000237,0.000799,0.000608,0.000357,0.000357,0.000256,2e-04,0.000124,0.000372,0.000231,0.000158,0.000225,8.3e-05,0.000122,4.1e-05,6.4e-05,6.6e-05,3.9e-05,0.000106,6.7e-05,4.2e-05,2.6e-05,2.3e-05,1.6e-05,8e-06,2.9e-05,3.4e-05,2.2e-05,2.1e-05
1.3e-05,9e-06,0.000271,0.000114,4.1e-05,5.7e-05,3e-05,1.3e-05,1.4e-05,9e-06,8e-06,2e-06,9e-06,6e-06,0.000125,0.000192,0.000595,0.000238,8.1e-05,0.000152,2.9e-05,1.6e-05,1.7e-05,1.9e-05,5e-05,0.000148,7.9e-05,2.2e-05,1.1e-05,0.00028,0.000402,0.000534,0.000413,0.000212,0.000273,0.000648,0.000417,0.000719,0.000442,0.000302,0.000463,0.000299,0.000611,0.000414,0.000217,0.000432,0.000637,0.000516,0.000717,0.000709,0.000584,0.000577,0.000445,0.000399,0.000376,0.000455,0.000213,0.000681,0.000183,0.000262,0.000207,0.000151,1.7e-05,0.000295,0.000232,9.3e-05,0.000171,9.3e-05,0.000129,5.1e-05,0.000108,6.1e-05,9.1e-05,4.9e-05,1.5e-05,1.7e-05,2.6e-05,6e-06,4.7e-05,0.000142,5.8e-05,2e-05,2e-05,2.4e-05,3.5e-05,7e-06,2.9e-05,3.2e-05,8.1e-05,0.000308,0.000191,0.000108,9.7e-05,0.000328,0.000143,0.000275,0.000266,7e-05,3.7e-05,7.6e-05,1e-04,3.9e-05,3.9e-05,7.4e-05,5.1e-05,2.9e-05,2.8e-05,1.4e-05,1e-05,6e-06,6.3e-05,3.8e-05,2.5e-05,1e-05,1e-06,9e-06,1.3e-05,4e-06,8e-06,8e-06,7e-06
7e-06,4e-06,0.000278,0.000125,1.8e-05,1.9e-05,3.7e-05,1.4e-05,1.4e-05,1.6e-05,8e-06,3e-06,4e-06,1e-05,9.9e-05,5.5e-05,0.000263,9.5e-05,0.000165,0.00018,1.5e-05,2.5e-05,3.5e-05,1.6e-05,5.3e-05,0.000249,9.2e-05,2.8e-05,1.8e-05,0.000147,0.000135,0.000469,0.000487,0.000221,0.000375,0.000371,0.000369,0.000335,0.000493,0.000315,0.000369,0.000356,0.000344,0.000414,0.000471,0.000232,0.00015,0.000434,0.000432,0.000472,0.000117,0.000515,0.000291,0.000298,0.000285,0.000341,0.000399,0.000522,0.000181,1.1e-05,8.8e-05,5.1e-05,7.1e-05,0.000241,9.7e-05,8.3e-05,6.9e-05,5.3e-05,0.00014,0.000172,0.00012,6.4e-05,2.5e-05,2.4e-05,3.1e-05,1.7e-05,1.4e-05,6e-06,5e-05,0.000128,3.1e-05,4e-06,3.3e-05,2.9e-05,1.4e-05,2e-06,1.3e-05,3.8e-05,5.6e-05,2e-04,6.8e-05,2.9e-05,2.6e-05,0.000344,1e-04,0.000262,0.000156,8.5e-05,1.5e-05,4.7e-05,3.5e-05,4.1e-05,1.8e-05,2.6e-05,6e-05,1e-06,2.6e-05,2.3e-05,1.3e-05,1.2e-05,6.6e-05,3.1e-05,1.3e-05,3e-06,1.1e-05,1e-05,7e-06,9e-06,1e-06,8e-06,8e-06
5e-06,4e-06,0.000275,9.7e-05,9.2e-05,3.5e-05,3.4e-05,2.4e-05,7e-06,7e-06,1e-06,4e-06,5e-06,9e-06,8.5e-05,0.000124,0.00031,8.9e-05,0.000137,9.8e-05,3.1e-05,3.2e-05,5e-05,8e-06,1.3e-05,0.000178,9.5e-05,2.7e-05,1.9e-05,4.3e-05,0.00031,0.000174,0.000316,0.000312,0.000456,0.000599,0.000344,0.000459,0.000562,0.000306,0.00048,0.000777,0.000499,0.000852,0.000281,0.000187,0.000514,0.000186,0.000527,0.000547,0.000481,0.000143,0.000342,0.00035,8.7e-05,0.000363,0.000277,0.000291,0.000113,8.4e-05,5.6e-05,4.9e-05,4.9e-05,0.000148,0.000127,4.8e-05,6.2e-05,8.2e-05,0.000168,0.000164,0.000102,3.3e-05,3e-05,4e-05,1.2e-05,1e-05,4e-06,7e-06,4.7e-05,0.000103,1.9e-05,1.6e-05,1.3e-05,1.6e-05,1.9e-05,1.2e-05,2.3e-05,1.7e-05,5.9e-05,5.9e-05,4e-06,1e-05,2.2e-05,0.000282,0.000124,0.000153,5.1e-05,1.7e-05,1.4e-05,2.7e-05,6.3e-05,3.8e-05,2.4e-05,2e-05,5.9e-05,4.2e-05,7e-06,2.8e-05,1.2e-05,1.1e-05,5e-05,3.2e-05,1.7e-05,7e-06,1.5e-05,1.7e-05,1.3e-05,3e-06,4e-06,6e-06,7e-06
3e-06,4e-06,0.000263,0.000226,7.3e-05,2.6e-05,1.5e-05,9e-06,5e-06,5e-06,1e-05,6e-06,3e-06,5e-06,9.9e-05,8.5e-05,0.000247,3.9e-05,6.7e-05,0.000162,2.8e-05,1.7e-05,3.5e-05,8.3e-05,2.2e-05,3.6e-05,1e-05,1.9e-05,1.3e-05,7.4e-05,0.000413,0.000212,0.000359,0.00021,0.000255,0.00045,0.000395,0.000224,0.000496,0.000385,0.000252,0.000617,0.000201,0.000793,0.000401,0.000138,0.00036,0.000278,0.000575,0.000477,0.000351,0.000365,0.000319,0.000412,0.000259,0.000104,0.000265,0.000261,0.000176,2.6e-05,7.3e-05,5.1e-05,9.1e-05,0.00013,6.1e-05,6e-05,4.3e-05,7.2e-05,9.2e-05,6.5e-05,9.7e-05,4.5e-05,4.4e-05,2.2e-05,1.9e-05,1.3e-05,1.7e-05,1.5e-05,1.8e-05,9.3e-05,2.5e-05,3.4e-05,1.8e-05,1.1e-05,2.2e-05,1.7e-05,1.9e-05,3.6e-05,6.4e-05,4.5e-05,3.1e-05,2e-05,3.2e-05,0.000228,0.000118,7.5e-05,3.9e-05,7e-05,3.1e-05,2.4e-05,8e-05,5e-06,1.6e-05,1.7e-05,6.6e-05,2.2e-05,1.7e-05,1.4e-05,1.4e-05,9e-06,5.8e-05,3.8e-05,2.5e-05,1.2e-05,1.1e-05,1.2e-05,2e-06,2e-06,6e-06,6e-06,5e-06
0,2e-06,0.00024,0.000201,0.000102,5e-05,1.8e-05,1.1e-05,3e-06,7e-06,4e-06,1e-06,3e-06,3e-06,9.3e-05,0.000102,3.5e-05,8.7e-05,3.5e-05,8.3e-05,3.2e-05,1.2e-05,3.7e-05,6.8e-05,7.8e-05,0.000178,6.6e-05,1.4e-05,3.8e-05,7.3e-05,0.000284,0.000446,0.000242,0.00022,0.000446,0.000492,0.000576,0.000166,0.000273,0.00027,0.000645,0.000209,0.000114,0.000398,0.00019,4.8e-05,7.5e-05,0.000482,0.000429,0.000425,0.000306,0.000791,0.000619,0.00022,0.000178,0.000369,0.000452,0.000198,0.000231,1e-04,3.1e-05,0.000119,6.5e-05,4.8e-05,0.000123,8.2e-05,8.5e-05,1.8e-05,5.7e-05,0.000191,0.000164,8e-05,4.3e-05,3.1e-05,1.4e-05,7e-06,6e-06,2.6e-05,3e-05,9.2e-05,3.1e-05,3.1e-05,1.4e-05,1.6e-05,1.4e-05,1.9e-05,2.5e-05,2.8e-05,3.1e-05,0.000115,1.5e-05,6e-06,2.1e-05,0.000225,0.000128,0.000136,0.000129,4.8e-05,9e-06,3.5e-05,5e-05,6.2e-05,3.8e-05,2.3e-05,4.5e-05,2.8e-05,5e-06,1.9e-05,2.2e-05,7e-06,8.3e-05,3.3e-05,1.8e-05,1.1e-05,1e-05,6e-06,1.2e-05,1.1e-05,3e-06,5e-06,6e-06
4e-06,1e-06,0.000208,7.5e-05,4.8e-05,3.1e-05,7e-06,8e-06,4e-06,8e-06,6e-06,5e-06,3e-06,7e-06,7.7e-05,0.000103,0.00033,0.000228,0.000134,0.000134,2.7e-05,1.1e-05,3.2e-05,9.1e-05,4.6e-05,0.000191,0.000119,6.3e-05,9e-06,5.4e-05,0.000329,0.000374,0.000262,0.00014,0.000449,0.000505,3.6e-05,0.000271,0.000216,0.00024,0.00015,0.000186,0.000125,0.000422,0.000365,0.000198,0.000248,0.000212,0.000299,0.000335,0.000229,0.000236,0.000338,0.000524,0.000135,0.000657,2.6e-05,0.000166,0.000163,0.000131,2.8e-05,0.000134,0.000143,8.3e-05,9.4e-05,4.4e-05,2.5e-05,1.8e-05,0.000114,0.000144,0.000128,2.6e-05,2.6e-05,8e-06,2.6e-05,1.6e-05,1.1e-05,2.4e-05,2.8e-05,9.6e-05,3e-05,3.3e-05,1.9e-05,1.3e-05,9e-06,8e-06,2.7e-05,2.8e-05,1.3e-05,0.000139,8.1e-05,5.7e-05,5.2e-05,0.000173,9.6e-05,0.000135,0.000142,4.6e-05,1.3e-05,4.6e-05,7.3e-05,2.6e-05,1.8e-05,2e-05,2.5e-05,6e-06,1.1e-05,2.5e-05,8e-06,8e-06,9.2e-05,5.4e-05,2.8e-05,5e-06,1.5e-05,1.2e-05,4e-06,1.8e-05,5e-06,1e-05,4e-06
5e-06,2e-06,0.000166,8.1e-05,3.5e-05,1.8e-05,2e-05,1e-06,8e-06,4e-06,5e-06,2e-06,2e-06,5e-06,5.8e-05,6.7e-05,0.000522,0.000114,8.7e-05,5.7e-05,1.6e-05,1.1e-05,3.7e-05,3.7e-05,0.000122,8.9e-05,5.2e-05,3.4e-05,1.7e-05,8.7e-05,0.00025,0.000272,6.7e-05,0.00023,0.000363,0.000327,0.000322,0.000385,0.000253,0.000217,0.000124,0.000155,0.000174,0.000312,1.9e-05,8.8e-05,0.000108,0.000115,0.000221,0.000261,0.00048,0.000502,0.000127,0.000193,0.000169,0.000386,0.000399,0.000434,0.000135,1.3e-05,4.9e-05,0.000147,0.000184,8.3e-05,0.000123,0.000147,7.7e-05,5e-05,8.9e-05,0.000212,0.000144,9.8e-05,1.9e-05,2.6e-05,6e-06,1.3e-05,6e-06,1.3e-05,2.7e-05,8.6e-05,5.4e-05,2.6e-05,2e-05,1.1e-05,2.2e-05,1.2e-05,2.2e-05,9e-06,5.6e-05,0.000201,0.000103,1.9e-05,2.7e-05,0.000104,0.000119,8.9e-05,3.6e-05,5.3e-05,5e-06,4.7e-05,4.4e-05,1.3e-05,1.7e-05,4.4e-05,4.8e-05,4.7e-05,1.3e-05,3.7e-05,2.8e-05,1.3e-05,9.3e-05,5e-05,1.4e-05,5e-06,1.4e-05,2e-06,4e-06,8e-06,1.1e-05,1.4e-05,8e-06
0,6e-06,0.000137,3.9e-05,4e-05,3.1e-05,1.3e-05,1.3e-05,1.6e-05,1e-05,9e-06,7e-06,5e-06,1e-06,7.4e-05,0.000133,0.000496,0.000206,0.00013,0.000159,3e-05,1.4e-05,2.1e-05,1.6e-05,0.000132,7.7e-05,3.7e-05,1.5e-05,2.1e-05,0.000132,0.000171,0.000101,7.6e-05,0.000152,0.000304,0.000521,0.000119,0.000147,0.000189,0.000373,0.000201,2e-04,0.000543,0.000425,0.000177,0.000119,0.000201,0.00022,0.000291,0.000131,0.000172,0.000294,0.000262,0.000561,0.000375,0.000446,8.7e-05,0.000497,0.000293,0.000194,8.3e-05,0.00024,0.000438,0.000366,0.000114,0.000191,4.2e-05,6.5e-05,0.00013,0.000106,0.000149,0.000101,7.7e-05,2.8e-05,2.7e-05,3e-06,1.4e-05,1.7e-05,1.2e-05,7.6e-05,2.2e-05,3e-05,2.7e-05,1.9e-05,2.9e-05,3e-05,8e-06,2.8e-05,8.3e-05,9.3e-05,6.8e-05,4.2e-05,3.4e-05,0.000118,0.000167,0.000127,6.5e-05,4.2e-05,2.8e-05,2.4e-05,5e-05,4e-06,2.8e-05,4.4e-05,6.1e-05,2.6e-05,3.6e-05,8e-06,7e-06,1.1e-05,7.3e-05,6.4e-05,2.8e-05,1.3e-05,4e-06,3e-06,2e-06,2e-06,9e-06,1.5e-05,1e-05
2e-06,9e-06,0.00013,7e-05,5.8e-05,3.6e-05,1.2e-05,9e-06,9e-06,6e-06,1e-05,7e-06,2e-06,4e-06,0.000109,5.1e-05,0.000366,0.000201,0.000104,8.7e-05,2.4e-05,1.1e-05,2.4e-05,4e-05,0.000167,5e-06,1.8e-05,2.5e-05,3e-06,0.000128,0.000369,0.000268,5.6e-05,7.6e-05,0.000585,0.000529,0.000459,0.000391,9.3e-05,8.9e-05,0.000124,0.000465,0.000548,5.5e-05,7e-05,0.000143,0.000206,0.000203,0.000134,0.000392,0.000349,0.000197,0.000166,0.000371,0.000448,0.000123,0.000471,7.3e-05,0.000141,6.5e-05,0.000143,0.000237,0.000146,0.000217,0.000331,8.7e-05,0.000117,0.000119,9.7e-05,0.000208,0.000211,0.000113,3.5e-05,3.3e-05,3.3e-05,2.2e-05,2.9e-05,2.8e-05,2.7e-05,8.1e-05,4.5e-05,2.5e-05,7e-06,2e-05,1.8e-05,7e-06,1.9e-05,4.4e-05,3.8e-05,7.4e-05,5.7e-05,1.7e-05,3.5e-05,6.4e-05,0.000137,6.6e-05,3.6e-05,4.1e-05,2.8e-05,1.9e-05,4.1e-05,2.7e-05,1.3e-05,1e-05,2.8e-05,2.5e-05,4.6e-05,2.7e-05,8e-06,1e-05,8e-05,1.4e-05,9e-06,1e-05,1e-05,5e-06,1e-06,7e-06,1.7e-05,4e-06,2e-06
4e-06,6e-06,0.000164,8e-05,1.2e-05,3.6e-05,3.2e-05,1.8e-05,4e-06,5e-06,2e-06,5e-06,8e-06,0,0.000142,0.000136,0.000245,0.000279,0.000221,0.000113,4e-06,2.3e-05,3.9e-05,2.8e-05,0.000172,0.000163,6.8e-05,5.1e-05,3.2e-05,9.5e-05,0.000295,0.000148,2.8e-05,6.8e-05,0.000428,8e-05,1.5e-05,0.000319,0.000308,0.000175,8.4e-05,0.000386,0.000389,0.000555,0.000175,0.000155,0.000164,0.000243,0.000103,0.000417,0.000123,0.000303,0.000201,8e-05,0.000158,0.000195,0.000237,0.000144,4e-05,0.000141,0.000159,0.000364,2e-04,5.6e-05,0.000185,8.1e-05,0.000138,1e-04,0.000155,0.000144,6.8e-05,7.3e-05,6.2e-05,2.8e-05,1.4e-05,4e-06,3.1e-05,2.6e-05,2.5e-05,7.2e-05,6.3e-05,1.9e-05,2.1e-05,9e-06,7e-06,5e-06,1.6e-05,4e-05,6.4e-05,3.9e-05,2.7e-05,2.5e-05,2.2e-05,4.9e-05,5.9e-05,6.3e-05,4.9e-05,1.4e-05,1e-05,1.9e-05,1.9e-05,3.1e-05,3.4e-05,5.1e-05,5e-05,2.8e-05,1.7e-05,1.5e-05,1e-05,5e-06,9.1e-05,5.4e-05,1.5e-05,1.1e-05,1.3e-05,9e-06,7e-06,1.3e-05,1e-05,6e-06,5e-06
5e-06,9e-06,0.000187,0.000145,6.2e-05,5.9e-05,2.3e-05,4e-06,5e-06,6e-06,1e-06,6e-06,2e-06,3e-06,0.000155,3.5e-05,0.000129,0.000184,9e-06,0.000108,7e-06,2.8e-05,3.3e-05,1.1e-05,0.00014,0.000187,0.000101,3.4e-05,2.6e-05,6.3e-05,0.000132,0.000187,5.5e-05,8e-05,0.000411,9e-05,0.00014,0.000226,5.6e-05,0.000156,0.00021,0.000266,0.00038,0.000325,0.000204,0.000158,0.000377,0.000173,0.000171,0.000229,0.000366,8.3e-05,0.000227,0.000102,6.6e-05,5.3e-05,0.000383,9.5e-05,2.4e-05,6.7e-05,5.8e-05,0.000178,0.000132,0.000148,4.8e-05,4.8e-05,7.2e-05,1.6e-05,0.000114,0.000103,0.000109,6.5e-05,2.3e-05,3.4e-05,2.4e-05,1.8e-05,1.7e-05,1.7e-05,1.1e-05,7.7e-05,1.8e-05,1.7e-05,1.4e-05,6e-06,7e-06,7e-06,9e-06,2.3e-05,5e-05,4.6e-05,3e-06,1.1e-05,2.6e-05,5.2e-05,8.2e-05,5.4e-05,4.1e-05,3.7e-05,3.1e-05,1.9e-05,3.8e-05,2.1e-05,3e-05,3.5e-05,3.2e-05,5e-06,2.9e-05,2.4e-05,2.2e-05,1.5e-05,9.3e-05,6.5e-05,2.3e-05,7e-06,5e-06,8e-06,4e-06,1.2e-05,6e-06,4e-06,1e-06
2e-06,4e-06,0.000207,0.000314,0.000134,9.4e-05,4.8e-05,2.2e-05,5e-06,6e-06,3e-06,4e-06,3e-06,3e-06,0.000159,0.00017,0.000113,0.000116,8.6e-05,7.1e-05,3.7e-05,2e-05,4.2e-05,3.8e-05,0.000171,0.000121,8.5e-05,3.9e-05,1.9e-05,0.000147,0.000149,0.000106,7.4e-05,6.9e-05,0.000324,0.000418,0.000197,0.000165,0.000177,0.000131,0.000215,0.000623,0.000487,0.000461,0.000127,0.000121,0.000127,0.000148,0.000196,0.000423,0.00017,0.000112,0.000105,0.000192,0.000124,8.9e-05,0.000308,0.00021,3.2e-05,7.1e-05,7.1e-05,3.6e-05,7.9e-05,0.000131,0.000109,3.2e-05,2.2e-05,3.5e-05,0.000157,3e-05,9e-05,2.5e-05,1.8e-05,3.6e-05,4.9e-05,3.2e-05,2.9e-05,9e-06,1.9e-05,4.8e-05,2.2e-05,1.1e-05,1.8e-05,1.1e-05,1.5e-05,1.2e-05,2.3e-05,3.6e-05,3.6e-05,7.7e-05,4.6e-05,2.9e-05,5e-06,5.5e-05,0.000122,8.3e-05,4.2e-05,3.4e-05,2.1e-05,3.4e-05,9.5e-05,7.9e-05,4.5e-05,1.4e-05,6.5e-05,4.1e-05,4.8e-05,1.6e-05,1.1e-05,4e-06,9.8e-05,9.1e-05,4.3e-05,1.6e-05,1.1e-05,8e-06,6e-06,1e-05,2e-06,3e-06,3e-06
3e-06,3e-06,0.000198,0.000205,0.000125,6.5e-05,2.6e-05,9e-06,1e-06,6e-06,1e-05,4e-06,2e-06,5e-06,0.000146,0.000109,0.000154,0.000318,0.00019,8.5e-05,4.5e-05,5.3e-05,7.5e-05,9e-05,9.2e-05,0.000106,8.4e-05,4.7e-05,1.8e-05,2e-04,0.000217,0.000176,0.000106,8.9e-05,0.000202,0.000327,0.000145,0.000302,0.000122,0.000225,0.000169,0.00048,0.000223,0.000136,0.000227,0.000148,0.000329,0.000301,0.00022,4e-05,0.000112,0.000276,0.000106,0.00022,2.2e-05,7.5e-05,0.000279,0.000196,4.1e-05,0.000141,0.000133,9.4e-05,0.000109,9.7e-05,8.1e-05,2.7e-05,4.6e-05,4.4e-05,0.000248,0.000237,2.9e-05,2.7e-05,2e-05,8e-06,1.4e-05,2.3e-05,2.9e-05,2.6e-05,1e-05,5.6e-05,1.4e-05,1.2e-05,1.7e-05,1.6e-05,7e-06,1.2e-05,2.8e-05,5.2e-05,6.1e-05,5.2e-05,4.4e-05,3.8e-05,1.3e-05,9e-05,0.000134,0.000113,5e-05,3.7e-05,1.4e-05,5e-06,8.5e-05,1.5e-05,1.1e-05,4.4e-05,8.9e-05,6.1e-05,1.3e-05,6e-06,8e-06,1.2e-05,9.6e-05,2.9e-05,6e-06,4e-06,1.1e-05,1e-05,1e-05,1.7e-05,1.1e-05,4e-06,1e-06
1e-06,5e-06,0.000165,6.4e-05,1.4e-05,1.7e-05,2.1e-05,1.2e-05,1e-05,2e-06,6e-06,2e-06,4e-06,6e-06,0.00012,0.000104,0.000127,0.000297,0.000111,8.8e-05,3.3e-05,1.9e-05,6.6e-05,6.8e-05,0.000101,0.000204,8.5e-05,2.7e-05,1.1e-05,0.000235,0.000342,0.000288,0.000105,6.2e-05,0.000215,0.000283,4e-05,0.000202,0.00046,0.000273,4e-05,0.00013,0.000274,0.000159,3.6e-05,0.000196,0.000238,0.000189,0.000202,8.9e-05,0.000289,0.000222,8e-05,0.000211,0.000169,1.3e-05,0.000322,0.000375,0.000125,0.000126,0.000251,0.000256,0.000266,0.000242,0.000248,0.000167,0.00012,3.7e-05,0.000272,4.8e-05,0.000179,2e-05,3.9e-05,2.3e-05,2.4e-05,4.5e-05,4.3e-05,2.9e-05,6.4e-05,3.8e-05,6e-05,4.2e-05,3.9e-05,1.6e-05,1.8e-05,3e-06,3.4e-05,4.6e-05,7.2e-05,7e-05,6.1e-05,3.3e-05,4.8e-05,8.8e-05,0.000233,0.000145,2.9e-05,3e-05,2.1e-05,2.1e-05,4.4e-05,7.8e-05,5.8e-05,6.3e-05,7e-05,6.1e-05,3.4e-05,8e-06,1.1e-05,7e-06,7.9e-05,2.5e-05,5e-06,3e-06,5e-06,4e-06,2e-06,4e-06,8e-06,6e-06,2e-06
2e-06,5e-06,0.000125,0.000101,4.8e-05,3.9e-05,3.3e-05,1.4e-05,1e-05,7e-06,2e-06,4e-06,5e-06,1e-06,8.4e-05,0.000108,5.8e-05,0.000188,0.000128,0.000131,5.2e-05,3.9e-05,3.7e-05,7.2e-05,8.1e-05,0.000312,0.00015,5.9e-05,1.2e-05,0.000246,0.000242,8.7e-05,0.00017,0.000166,0.000357,0.000165,0.000304,0.000104,0.000691,0.000321,6.8e-05,0.00043,0.000349,0.000376,0.000218,0.000125,0.000106,4.5e-05,7.7e-05,0.000306,0.000252,0.000154,7.6e-05,5.7e-05,9.9e-05,0.000102,0.000244,0.000444,0.00021,0.000295,0.000407,0.000195,0.000256,0.00017,8e-05,5.6e-05,8.3e-05,0.00012,0.000132,0.000175,0.000166,0.000133,9.8e-05,5.2e-05,5e-06,3.2e-05,6e-06,3.3e-05,7.2e-05,5.6e-05,8.4e-05,3e-05,5.1e-05,2.9e-05,1.1e-05,2.2e-05,4.7e-05,1.9e-05,3.9e-05,4.3e-05,3.7e-05,2.8e-05,2.6e-05,9.7e-05,0.000436,0.000188,0.000115,9.2e-05,4.5e-05,3.8e-05,2.3e-05,5.6e-05,6.5e-05,5e-05,8.8e-05,3.8e-05,2.2e-05,7e-06,1.1e-05,1.2e-05,6.4e-05,6.4e-05,3.3e-05,1.2e-05,7e-06,4e-06,2e-06,5e-06,4e-06,4e-06,3e-06
5e-06,8e-06,8.5e-05,9e-05,5.4e-05,1.9e-05,1.2e-05,5e-06,6e-06,3e-06,3e-06,2e-06,2e-06,2e-06,5.1e-05,2.4e-05,0.00015,0.000236,0.000123,0.000197,6e-05,3.5e-05,3e-05,7.6e-05,0.000166,0.000414,0.000264,9.6e-05,1.9e-05,0.000193,0.000273,0.000224,9.9e-05,0.000212,0.000441,0.000365,0.00038,0.000383,0.000849,0.000342,0.000143,0.000434,0.000553,0.000484,0.000127,0.00018,0.00039,7.4e-05,0.000208,0.000227,0.000143,0.000273,0.000113,0.000117,0.000125,0.000214,0.000243,0.000343,9.3e-05,0.000378,0.000103,2.1e-05,0.000246,0.000183,0.000117,0.000166,5.4e-05,2.1e-05,0.000128,0.000182,0.000139,2.7e-05,2.6e-05,3.3e-05,2.9e-05,1.1e-05,1.2e-05,2.8e-05,3.1e-05,5.7e-05,8.3e-05,5.9e-05,3.8e-05,2.8e-05,1.2e-05,1.5e-05,3.4e-05,2.8e-05,3.6e-05,4.3e-05,4.3e-05,6.7e-05,6.4e-05,6.4e-05,0.000458,0.00026,0.00015,2.4e-05,2.9e-05,2.3e-05,5.1e-05,5.8e-05,1.3e-05,1.2e-05,6.8e-05,1.9e-05,7e-06,8e-06,5e-06,9e-06,6e-05,6.8e-05,2.8e-05,8e-06,2e-06,6e-06,3e-06,9e-06,8e-06,5e-06,1e-06
5e-06,0,7.2e-05,0.000137,5.9e-05,1.4e-05,6e-06,1e-06,3e-06,2e-06,5e-06,4e-06,4e-06,2e-06,2.3e-05,7.7e-05,9e-05,0.000182,0.000103,9.2e-05,1.1e-05,7e-06,2.4e-05,5.4e-05,9.8e-05,0.000262,0.000142,4.6e-05,9e-06,0.000141,6.5e-05,0.000167,5.6e-05,0.000152,6.9e-05,0.000309,4.4e-05,0.000296,0.00031,0.000205,0.000224,0.000117,0.000302,0.000195,8.8e-05,0.000284,0.000139,0.000207,0.000198,1.1e-05,0.000269,0.000174,0.000152,0.000102,0.000106,0.00015,0.000335,6.9e-05,0.000204,0.000255,0.000185,2e-05,8.8e-05,8.1e-05,8.2e-05,0.000186,0.000172,0.000124,0.000194,0.000159,3.8e-05,2.2e-05,2.6e-05,1.9e-05,1.4e-05,1.2e-05,0,1.1e-05,2.2e-05,6.1e-05,4.2e-05,3.4e-05,2.6e-05,1.8e-05,6e-06,1.6e-05,1.4e-05,8e-06,2e-05,2.7e-05,2.4e-05,3e-05,2e-05,0.000109,0.000268,0.000156,2.3e-05,4e-05,2.3e-05,8e-06,4.2e-05,1.5e-05,9e-06,1e-05,4.8e-05,6e-06,7e-06,3e-06,3e-06,1e-06,3.8e-05,1e-05,1.1e-05,8e-06,5e-06,2e-06,3e-06,7e-06,2e-06,5e-06,0
2e-06,2e-06,6.2e-05,8.7e-05,6e-05,2.4e-05,3e-06,3e-06,3e-06,5e-06,4e-06,3e-06,2e-06,2e-06,9e-06,8.8e-05,6.9e-05,6.2e-05,5.3e-05,9e-05,1e-05,1.3e-05,7e-06,2.1e-05,9.9e-05,8.9e-05,3.9e-05,1.1e-05,1.2e-05,8.3e-05,0.000116,0.000142,0.000153,9.9e-05,0.000244,0.000258,0.000189,9.8e-05,0.000185,0.000106,0.00033,0.000161,0.00017,0.000197,6.7e-05,0.000154,0.000161,0.000183,0.000222,0.00041,0.000104,8.3e-05,5.7e-05,0.000119,7.2e-05,1.6e-05,0.000242,8.2e-05,0.00017,5.3e-05,5.4e-05,3e-05,0.000112,7e-06,3.6e-05,8.1e-05,5.4e-05,5.3e-05,9.2e-05,2.7e-05,2.5e-05,4.1e-05,4.6e-05,1.3e-05,1.8e-05,6e-06,7e-06,6e-06,1e-06,4.3e-05,1.3e-05,1.2e-05,8e-06,3e-06,4e-06,1.6e-05,2e-05,5e-06,2.6e-05,1.3e-05,1.5e-05,1.6e-05,6e-06,8.7e-05,5.8e-05,6e-06,3.6e-05,1e-05,1.4e-05,1.2e-05,2.8e-05,9e-06,5e-06,1.1e-05,4.3e-05,7e-06,4e-06,2e-06,1e-06,1e-06,2.1e-05,1.2e-05,8e-06,1e-06,3e-06,2e-06,3e-06,3e-06,1e-06,4e-06,1e-06
2e-06,0,4.7e-05,6.8e-05,3.7e-05,1.6e-05,8e-06,5e-06,2e-06,2e-06,3e-06,1e-06,1e-06,1e-06,7e-06,7.4e-05,2.8e-05,1.1e-05,2.8e-05,7.8e-05,5e-06,1.3e-05,4e-06,1.8e-05,7.5e-05,1.5e-05,4e-06,1.3e-05,4e-06,4.2e-05,5.6e-05,3.5e-05,6.4e-05,7.7e-05,0.000249,5.6e-05,9.7e-05,9.1e-05,0.000108,1e-04,0.000257,0.000104,4e-06,0.000168,2.6e-05,8.1e-05,0.00017,9.5e-05,8.2e-05,0.000266,0.000129,9.3e-05,9.3e-05,0.000116,7.1e-05,0.000106,0.000141,0.000194,0.000193,6.6e-05,1.4e-05,1.1e-05,7.5e-05,2.3e-05,3e-05,1.2e-05,5.7e-05,2.1e-05,7.1e-05,5e-05,3.9e-05,2.7e-05,1.5e-05,5e-06,6e-06,1e-05,6e-06,9e-06,4e-06,4.1e-05,6e-06,1.5e-05,4e-06,5e-06,7e-06,1.1e-05,2.2e-05,3e-06,2.6e-05,1.5e-05,1.2e-05,1.3e-05,9e-06,7.9e-05,2.1e-05,2.4e-05,3.1e-05,1.6e-05,1.6e-05,1.8e-05,2.5e-05,5e-06,6e-06,8e-06,4e-05,2e-06,4e-06,2e-06,2e-06,2e-06,8e-06,4e-06,2e-06,2e-06,4e-06,3e-06,3e-06,4e-06,2e-06,3e-06,1e-06
1e-06,1e-06,2.9e-05,6.7e-05,1e-05,7e-06,3e-06,1e-06,1e-06,1e-06,1e-06,0,1e-06,0,8e-06,7.5e-05,2.1e-05,9e-06,1.8e-05,8.4e-05,4e-06,1e-05,2e-06,1.9e-05,5.8e-05,1e-05,9e-06,1.1e-05,6e-06,5.1e-05,0.00012,8.7e-05,4.7e-05,6.9e-05,0.000203,4.7e-05,4.4e-05,5.1e-05,0.000101,0.000101,0.00022,0.000152,8.1e-05,0.00019,2.9e-05,0.000102,9.7e-05,9.5e-05,6.8e-05,0.000187,0.000145,0.000214,0.000103,3.9e-05,6.1e-05,9.2e-05,0.000193,0.00017,0.000153,3.8e-05,1.8e-05,4e-06,7.1e-05,2.1e-05,1.9e-05,1e-05,4e-05,2.1e-05,6.4e-05,5.1e-05,3.4e-05,1.3e-05,1.1e-05,9e-06,6e-06,8e-06,7e-06,7e-06,5e-06,4e-05,1e-06,1.3e-05,6e-06,2e-06,7e-06,1.2e-05,2e-05,2e-06,2.7e-05,8e-06,1e-05,1e-05,9e-06,6.8e-05,6e-06,1.6e-05,2.6e-05,6e-06,1.4e-05,1.2e-05,2.2e-05,5e-06,6e-06,8e-06,4.2e-05,5e-06,2e-06,5e-06,3e-06,5e-06,6e-06,3e-06,6e-06,3e-06,4e-06,2e-06,2e-06,4e-06,3e-06,4e-06,1e-06
