-0.000383,-0.000588,-0.000887,-0.000871,-0.000932,-0.002147,-0.004643,-0.00484,-0.006118,-0.006693,-0.006873,-0.007075,-0.008098,-0.012167,-0.010441,-0.01225,-0.009336,-0.010261,-0.010268,-0.006104,-0.005289,-0.005293,-0.003792,-0.002976,-0.004337,-0.006408,-0.006385,-0.007735
0.000115,-0.00011,-0.000252,-0.000434,-4e-06,-0.000637,-0.00407,-0.004194,-0.00371,-0.002296,-0.000765,-0.003266,-0.000771,0.001094,-0.001396,-0.00419,-0.004045,-0.002513,-0.000104,-0.000935,-0.002373,-0.002332,-0.000454,-0.000158,-0.003123,-0.005098,-0.003527,-0.004323
8.1e-05,0.000125,0.000182,0.000125,-1.7e-05,-0.000152,0.00047,0.000828,0.001567,0.001842,0.000785,0.000122,-0.000387,-0.000325,-0.000676,-0.001008,-0.000623,-0.001925,-0.000393,6.1e-05,-0.000159,0.000474,0,-0.000858,-0.000932,-0.000528,-0.001243,0.000423
-9.2e-05,0.000118,0.000275,0.000459,6e-05,0.000725,0.004339,0.00445,0.003977,0.002868,0.000967,0.003059,0.000499,-0.001137,-0.00027,0.002099,0.002453,-0.000426,-0.001723,-5e-05,0.001382,0.001908,-0.00025,-0.001499,0.001237,0.003428,0.000328,0.00225
0.000167,0.000267,0.000394,0.00046,0.000698,0.001948,0.003315,0.002668,0.001965,0.002097,0.003684,0.004647,0.006004,0.01004,0.008104,0.009497,0.006606,0.009781,0.008077,0.003706,0.003701,0.003278,0.002628,0.002056,0.003421,0.00488,0.004237,0.003434
-3.3e-05,-0.000157,-0.000302,-0.00036,-0.000256,-0.000737,-0.002691,-0.002954,-0.003418,-0.003376,-0.002372,-0.002911,-0.002048,-0.001613,-0.000317,-0.00173,-0.002199,0.001721,0.001215,-0.000499,-0.000699,-0.001215,0.00031,0.00099,-7.6e-05,-0.001224,0.000563,-0.00156
-0.000236,-0.000422,-0.000597,-0.000605,-0.000769,-0.002306,-0.004743,-0.004013,-0.003175,-0.003556,-0.005049,-0.005881,-0.006832,-0.012551,-0.009993,-0.011397,-0.007914,-0.010747,-0.00977,-0.004318,-0.004565,-0.004538,-0.003279,-0.001822,-0.003854,-0.006088,-0.004401,-0.004883
0.000167,0.000186,0.000321,0.000218,0.000432,0.000552,0.000167,0.000777,0.002722,0.003616,0.003466,0.002162,0.003912,0.004819,0.00213,0.002895,0.002798,-0.000665,0.001301,0.001992,0.000435,0.000496,5.5e-05,0.000997,-0.000216,-0.000721,0.000895,0.002149
0.00012,0.000331,0.000448,0.000361,0.000364,0.001321,0.003569,0.003237,0.002732,0.002818,0.002911,0.003473,0.003967,0.007499,0.006779,0.008636,0.006143,0.006094,0.005837,0.002468,0.00317,0.003185,0.001968,0.001597,0.003193,0.004452,0.003917,0.005031
-0.000232,-0.000169,-0.000276,-7e-05,-0.000378,-2.8e-05,0.00204,0.001193,-0.00158,-0.002894,-0.003446,-0.000567,-0.003355,-0.005777,-0.002985,-0.001973,-0.001314,-0.000838,-0.00376,-0.002998,-4.8e-05,3.9e-05,-0.000663,-0.001705,0.001137,0.002386,-0.001098,-0.001667
4.4e-05,-0.000121,-0.000142,-2.8e-05,0.000101,0.000145,-0.001067,-0.001369,-0.001562,-0.00134,0.000291,9.3e-05,-0.000193,0.000173,-0.00133,-0.00298,-0.002167,0.001265,0.00061,-0.000159,-0.000568,-0.000637,-0.000147,-0.00075,-0.000791,-0.00049,-0.001403,-0.002927
0.00017,6.6e-05,0.000137,-6.5e-05,7.2e-05,-0.000678,-0.00307,-0.002063,0.000389,0.001124,0.002253,-0.000693,0.000276,0.00237,0.001255,-0.001649,-0.001476,0.002228,0.004641,0.00232,-0.000156,5.6e-05,0.001224,0.001022,-0.001712,-0.002379,0.000651,0.000578
-0.00016,-0.000101,-0.000121,-0.000179,-0.000348,-0.001246,-0.001322,-0.000365,0.000551,5.3e-05,-0.001848,-0.002255,-0.002972,-0.00694,-0.004509,-0.004345,-0.002902,-0.007115,-0.005827,-0.001638,-0.001818,-0.001612,-0.001292,-0.000968,-0.002587,-0.003444,-0.002452,-0.000869
-4.7e-05,4.9e-05,3.6e-05,0.000109,0.000205,0.001029,0.002599,0.001767,0.000352,0.000654,0.000212,0.001538,0.002682,0.002745,0.001303,0.004106,0.002652,-0.00307,-0.003542,-0.000498,-1.3e-05,-0.000506,-0.001222,-0.00038,0.000278,0.000262,-0.001623,-0.000828
0.000161,0.000237,0.000233,0.000166,0.000247,0.001422,0.002592,0.001212,-0.000473,0.00032,0.001569,0.002282,0.003563,0.009113,0.00789,0.008782,0.005048,0.007364,0.006469,0.001851,0.002486,0.002058,0.001486,0.001877,0.003595,0.004024,0.003174,0.002635
-4.1e-05,-9.2e-05,-0.000123,-3.6e-05,-0.000254,-0.000691,-0.000938,-0.000748,-0.000571,-0.001216,-0.001837,-0.000924,-0.002949,-0.005223,-0.001792,-0.002957,-0.001718,0.002287,0.001027,-0.001104,0.000308,0.000876,0.000836,0.000422,0.001632,0.001665,0.002041,0.001361
-5e-05,-0.000223,-0.000156,4e-06,7.2e-05,-0.000702,-0.002463,-0.00115,0.001314,0.000495,0.000282,-0.000332,-0.001341,-0.005023,-0.005691,-0.006686,-0.002978,-0.002414,-0.002594,-0.00074,-0.001594,-0.000925,-0.000714,-0.000901,-0.00148,-0.001651,-0.000417,-0.001019
5.1e-05,2.3e-05,6.4e-05,-9.7e-05,0.000109,-7.4e-05,-0.001074,-0.000351,0.000764,0.000722,0.001544,-0.000575,0.00115,0.003817,0.000932,0.00079,0.00093,0.000893,0.002018,0.0015,-0.000561,-0.000562,-1.9e-05,-9.9e-05,-0.001693,-0.001714,0.000309,8.5e-05
-8.8e-05,4.9e-05,-7.9e-05,-2e-04,-0.000328,-0.000267,0.001263,0.00047,-0.00216,-0.001664,-0.002915,-0.00258,-0.00166,-0.002052,-7.3e-05,0.001167,7.6e-05,-0.002733,-0.002383,-0.000826,-8.2e-05,-0.000654,-0.000249,-0.000663,-0.001062,-0.000892,-0.001542,-0.000852
