6.3e-05,3.6e-05,0.000161,0.000127,0.000142,0.000183,9.1e-05,0.000108,1.9e-05,0.000118,4.1e-05,0.000153,8.8e-05,-1.2e-05,2.1e-05,0.000147,0.000101,9.5e-05,4.7e-05,7.4e-05,7e-05,1.4e-05,6.4e-05,2.8e-05,2.3e-05,6.2e-05,7.7e-05,9e-05,6.4e-05,3.8e-05,4.5e-05,0.000116,8.7e-05,6.7e-05,0.000108,0.000113,2.7e-05,6.9e-05,9e-06,6.4e-05,6.7e-05,6.1e-05,0.000198,0.000118,4.6e-05,9.6e-05,4.5e-05,5.3e-05,7.1e-05,0.000101,9.9e-05,0.000133,8.5e-05,3.7e-05,0.000159,0.000171,3.7e-05,8e-05,1e-05,3e-05,2.7e-05,-7.1e-05,-8.6e-05,-8e-06,6.8e-05,-3.8e-05,-4e-06,-3.7e-05,-1e-04,7.4e-05,6.1e-05,9e-06,4e-05,5.3e-05,4.2e-05,0.000114,6.7e-05,4.9e-05,5.4e-05,0.00013,9.1e-05,-2e-05,8.8e-05,0.000195,0.000143,0.000126,1.9e-05,5.6e-05,8.8e-05,1.4e-05,0.000188,0.000104,0.000123,0.000102,1.2e-05,-6.4e-05,8e-06,-2.1e-05,2.6e-05,-2e-06,8.4e-05,0.000107,0.000108,0.000115,7.8e-05,-4e-06,4.7e-05,-3e-06,9e-06,5.8e-05,0.000133,0.000147,6.6e-05,5.7e-05,0.000117,0.000194,5.9e-05,9.3e-05,5.5e-05,0.000165,7.1e-05
-0.000121,-4.2e-05,-7e-06,-7.8e-05,3.7e-05,-4.5e-05,-4.5e-05,-2.2e-05,-5e-06,-7.9e-05,-6.5e-05,-6.2e-05,-8.4e-05,-2e-05,-5.9e-05,-7.1e-05,5.4e-05,-4.1e-05,-7.5e-05,-8.8e-05,-6.4e-05,-4.8e-05,-2e-06,-0.000139,-8.4e-05,3.1e-05,-3.5e-05,-0.000107,-1.7e-05,-3e-06,-2e-05,-3e-06,4.3e-05,-8.1e-05,-1e-05,-7.4e-05,-1.8e-05,-2.3e-05,5e-06,-0.000161,-3e-05,-0.000138,3.6e-05,9e-06,-3.9e-05,-1e-04,-2.8e-05,-4e-05,0,-6e-05,-7.5e-05,-4.1e-05,-0.000136,-0.000101,-0.000173,4.4e-05,1.8e-05,6.7e-05,7.8e-05,7.1e-05,-0.000136,-4.4e-05,-8e-06,-0.000118,4e-05,-4.8e-05,0.000107,2e-05,4.7e-05,-5.8e-05,-9.5e-05,2.3e-05,0.000131,-0.00013,-3e-06,-1.1e-05,-6.3e-05,3.4e-05,-0.000117,-0.000116,-9.3e-05,-3.6e-05,-9.4e-05,-4.9e-05,-0.000184,-0.00011,-5.2e-05,-1.4e-05,-7.9e-05,-8.4e-05,3e-05,-0.000113,-0.000101,-0.000101,-4.3e-05,1.3e-05,2.6e-05,-7.1e-05,-8.4e-05,-4e-05,-8.1e-05,-4.6e-05,-3.3e-05,-3.7e-05,-8.9e-05,-2.1e-05,-1.2e-05,1.9e-05,-4.2e-05,-8e-06,5e-05,1.3e-05,-2e-05,1.7e-05,-0.000103,-0.000128,-5.9e-05,-2.1e-05,5e-06,-3e-06,3.1e-05
-0.000124,-8e-05,-0.000111,-0.000119,-2.9e-05,-0.000174,-0.000129,-8.9e-05,-6.1e-05,-4.1e-05,-7.1e-05,1e-05,-2.1e-05,-3.6e-05,-2.3e-05,-8.4e-05,-9e-05,-0.000156,-0.000137,-0.000154,-8.8e-05,-7.3e-05,-9.5e-05,-0.000127,-7.7e-05,-5.3e-05,5.7e-05,-9.1e-05,-2.9e-05,-3.4e-05,-2.4e-05,-7.6e-05,3.1e-05,-6.1e-05,-7.8e-05,-0.000112,-1.4e-05,-9.1e-05,-0.000141,-9.1e-05,-1.3e-05,-6.2e-05,-6.7e-05,-0.000218,-7.9e-05,-5.1e-05,-4.6e-05,-8.6e-05,-9.8e-05,-0.000104,-4e-05,-5.1e-05,5.5e-05,1.5e-05,-0.000142,-0.000101,-1e-05,-0.000143,2.3e-05,2.8e-05,-6.7e-05,-4.3e-05,1.5e-05,2.4e-05,-9.7e-05,3.2e-05,-3.2e-05,-7.3e-05,3.1e-05,-3.4e-05,-0.000111,-2.8e-05,-2.6e-05,-0.000142,-3.8e-05,-8.4e-05,-3.7e-05,9.3e-05,-9.5e-05,-0.000139,-0.000166,-0.000113,-0.000145,-0.000126,-9.4e-05,-0.000152,-0.000131,-7.1e-05,-0.00014,-1.2e-05,-8e-06,-6.6e-05,-0.000145,-0.000219,-0.000113,-2.4e-05,-4.8e-05,-0.000108,-8.8e-05,-2.9e-05,-7.8e-05,-0.000161,-9.3e-05,-0.000135,-9.5e-05,-0.000135,-0.000121,-0.000106,-7e-06,-3.8e-05,-9e-06,-0.000135,-2.8e-05,-2.9e-05,-8.1e-05,-0.000104,-0.000144,-9e-05,-2.8e-05,-0.000111,-3.9e-05
-4.1e-05,-1.1e-05,-1.9e-05,-5e-06,1.5e-05,-7.9e-05,-4.9e-05,-5.8e-05,1.1e-05,-6e-06,6e-06,4.4e-05,-5.5e-05,-3e-05,9e-06,-2e-05,4e-06,-4.9e-05,-3.7e-05,-6.7e-05,-2.8e-05,6e-06,-2e-05,3.4e-05,-5e-06,3e-06,-8e-06,2e-06,2.1e-05,1.8e-05,9.7e-05,-4.8e-05,1.9e-05,3e-05,-2.9e-05,-2.9e-05,-3e-06,3.7e-05,8e-05,-1.9e-05,-2.1e-05,6e-06,2.5e-05,-3.3e-05,-7.1e-05,-7e-06,-2e-05,6.2e-05,-3.1e-05,-5.7e-05,2.3e-05,-6.9e-05,-8e-06,2.9e-05,-1.4e-05,-0.000149,-0.000135,-6.6e-05,-2.7e-05,-3.6e-05,4.2e-05,2.9e-05,2.7e-05,-6.6e-05,-6.4e-05,-0.000137,-1e-05,-3.9e-05,-7.4e-05,-9.9e-05,-6e-05,7.5e-05,3.5e-05,9.6e-05,3.2e-05,-6e-06,6e-06,-3.9e-05,3e-06,-6e-06,-5.1e-05,-8.7e-05,5.2e-05,-0.00011,8.8e-05,-6.2e-05,1.4e-05,3.3e-05,0,1e-05,-9.3e-05,4.3e-05,-4.8e-05,-6e-05,-1.2e-05,-3.9e-05,-2.7e-05,3.4e-05,2.3e-05,-1e-05,-3.9e-05,-3.2e-05,-2.3e-05,-5e-06,3.8e-05,4.2e-05,-1.8e-05,-6.7e-05,-2.5e-05,-0.000106,-3.3e-05,-9.7e-05,-3.7e-05,-4.5e-05,1.3e-05,-2.4e-05,-8e-05,-3.1e-05,-1e-05,-1.2e-05,4.1e-05
9.5e-05,2.8e-05,5.7e-05,0.000134,0.000135,5.6e-05,8.6e-05,5.8e-05,4.6e-05,7.1e-05,3.8e-05,0.000107,7.3e-05,8e-06,2.5e-05,-1e-05,-5.2e-05,-3e-05,9.9e-05,0.00011,9.9e-05,3.8e-05,1.8e-05,6.2e-05,8.3e-05,2.6e-05,-2.1e-05,2e-06,-1e-06,9e-06,2.6e-05,4.4e-05,-1.1e-05,5.6e-05,5.8e-05,9.6e-05,7.1e-05,-3e-06,6e-05,3.2e-05,7.1e-05,5.2e-05,6e-05,-4e-06,5e-05,1e-05,4.6e-05,1e-05,0.000145,4.5e-05,1.5e-05,-3.6e-05,-7.5e-05,3.5e-05,-2.9e-05,-9.4e-05,-4.4e-05,4.2e-05,-2e-05,1.6e-05,1.8e-05,3.5e-05,-8.7e-05,-3.1e-05,3e-05,-8.1e-05,-6.9e-05,-9.4e-05,-4.7e-05,4.1e-05,-3.6e-05,1.7e-05,-0.000153,-6.4e-05,-4e-05,-2.8e-05,-8e-06,-3e-05,0.000116,0.000133,-7e-06,3.6e-05,-5.3e-05,2e-05,2.7e-05,5.4e-05,6e-05,-6e-06,3.1e-05,2.6e-05,1e-06,1.8e-05,1.2e-05,7.5e-05,2.7e-05,4.8e-05,2.5e-05,7.3e-05,3.8e-05,2.5e-05,-2e-05,1.1e-05,-2e-05,5.2e-05,5.6e-05,9.9e-05,-2.2e-05,3.1e-05,-3e-06,1e-06,8e-05,-3.3e-05,-3.2e-05,4.1e-05,5.2e-05,6.1e-05,4.7e-05,8.1e-05,3.2e-05,3.4e-05,3.1e-05
5.2e-05,6.4e-05,1.3e-05,-2.3e-05,5.6e-05,1.7e-05,5.2e-05,5.1e-05,-5.3e-05,-1.4e-05,9.6e-05,2.6e-05,-6e-06,4.5e-05,-2.3e-05,6e-05,-2.6e-05,3.4e-05,2.7e-05,3.5e-05,6.8e-05,6.7e-05,-2.9e-05,4.2e-05,8e-06,2.1e-05,-1e-05,-3.3e-05,4.2e-05,-1.3e-05,7e-06,-1e-06,5.2e-05,1.9e-05,2.6e-05,5.4e-05,-5.8e-05,1.2e-05,9e-06,5e-05,4.2e-05,4e-05,-1.1e-05,6.2e-05,3.1e-05,-9e-06,2.5e-05,1.2e-05,2.3e-05,2.2e-05,3e-06,1e-06,-6.4e-05,-8.6e-05,4.1e-05,5.5e-05,-4.9e-05,1.6e-05,-1e-06,6.8e-05,2.2e-05,-3.2e-05,3e-05,-3e-05,-3.9e-05,3.8e-05,-1e-05,6e-05,-1.7e-05,-3.1e-05,2.6e-05,-7.5e-05,1e-06,1.9e-05,0.000116,2.9e-05,2.9e-05,-4e-06,-3.6e-05,3e-06,0.000115,9.8e-05,-2.5e-05,2.4e-05,-1.5e-05,4.8e-05,2.7e-05,5.3e-05,2.3e-05,-1e-06,3.5e-05,0,4.6e-05,4.3e-05,6.4e-05,-2.1e-05,-1.2e-05,-2.2e-05,2.1e-05,9e-06,3e-05,2.5e-05,6e-06,3.3e-05,3.6e-05,-8e-06,7.7e-05,2.4e-05,-4.4e-05,3.4e-05,-7e-05,-8e-06,-4.7e-05,2.9e-05,-4e-06,1.3e-05,7.4e-05,2.9e-05,1.5e-05,2.6e-05,3.6e-05
-1.1e-05,-3.9e-05,-9e-06,-4.3e-05,-6.7e-05,-1.8e-05,-4.8e-05,-3.7e-05,-3.5e-05,2.2e-05,-4.3e-05,-9e-05,-8.9e-05,-2.9e-05,-2.1e-05,-3.1e-05,-9.5e-05,-1.4e-05,-3.2e-05,-3.2e-05,-2.3e-05,1.2e-05,-5e-05,-5.9e-05,-2e-05,-1.4e-05,-5.9e-05,1e-06,1.8e-05,0,-1.9e-05,-8e-06,-2.7e-05,-3.3e-05,-4.4e-05,2.5e-05,-1e-05,5e-06,-4.2e-05,3.2e-05,-9e-06,1.1e-05,-6.7e-05,-5e-06,3.2e-05,-4.3e-05,1.5e-05,-3e-05,2e-06,-2.5e-05,-5.8e-05,4.8e-05,-1.6e-05,-5e-06,-1.8e-05,4.4e-05,-7.2e-05,1.7e-05,-0.000109,3.7e-05,2.9e-05,2e-05,3.3e-05,1e-05,0,1.8e-05,-2.3e-05,-4.7e-05,6e-06,-1.8e-05,9.2e-05,-2.5e-05,-0.000109,7e-06,4.7e-05,-5e-06,2.8e-05,-1e-05,-4e-06,-5.6e-05,4e-06,-5e-06,-2.5e-05,3.8e-05,-6.2e-05,-7.2e-05,-4.7e-05,-3.1e-05,-1.5e-05,-1.3e-05,-5.8e-05,-7.7e-05,-6.1e-05,2.5e-05,-3e-05,-1.4e-05,2.2e-05,6e-06,-4.6e-05,4e-06,-2e-05,-1.3e-05,-9.7e-05,-1e-05,-3.6e-05,-2.6e-05,-2.2e-05,5.5e-05,3e-06,2e-06,-5.5e-05,1e-05,-3.7e-05,-1.2e-05,1.7e-05,-5.2e-05,-2.1e-05,-1.3e-05,-7.4e-05,-2e-06,-1.4e-05
-3.8e-05,-5.6e-05,-2.1e-05,-5.9e-05,-5.1e-05,-1.7e-05,-6.4e-05,-2.2e-05,-4.8e-05,-2.6e-05,-4.3e-05,-4.8e-05,-2e-05,-1e-05,2.3e-05,1e-06,-3e-06,2.9e-05,-6.3e-05,-2e-05,-4.1e-05,-1.4e-05,1.1e-05,8e-06,-2.4e-05,-2.7e-05,-1.5e-05,1.8e-05,-5e-05,-1.4e-05,-1.4e-05,-3.1e-05,-7.3e-05,-2.6e-05,-2e-05,-6e-06,2.3e-05,-2.7e-05,-1.3e-05,-4.6e-05,-5.1e-05,-1.8e-05,-2.9e-05,-1e-05,-2.7e-05,-1.3e-05,-6e-05,-3.3e-05,-5.5e-05,-4.3e-05,-8.6e-05,-4.3e-05,-1.1e-05,-2.3e-05,-2.6e-05,-1.4e-05,2.8e-05,2.5e-05,-9e-06,-2.3e-05,-4.1e-05,-4e-06,3.7e-05,1.9e-05,-0.000102,-1.5e-05,-3.1e-05,2e-06,0,5.5e-05,3.8e-05,-1.1e-05,-1.6e-05,-1.4e-05,-7.1e-05,-2.3e-05,2e-06,-1.4e-05,-4.4e-05,-1.6e-05,-5e-05,-4e-06,5.3e-05,6e-06,-5.9e-05,-4.4e-05,-4.8e-05,-3.1e-05,-2e-06,-2.3e-05,-2.8e-05,-3.4e-05,-4.2e-05,-1.2e-05,-8e-06,-1.1e-05,5e-06,-2.4e-05,-5e-06,-7.2e-05,-3e-05,9e-06,-5.6e-05,-4e-05,-3.8e-05,-2.1e-05,-1.6e-05,-4.2e-05,1.2e-05,1e-05,-1.8e-05,-2.1e-05,5e-06,2.2e-05,-2.6e-05,-1.7e-05,-1.9e-05,-4.2e-05,-5.6e-05,-1.2e-05,-3.6e-05
-2e-05,4e-06,-1.6e-05,-2.2e-05,-3.1e-05,-2.6e-05,-4.7e-05,-1.1e-05,2.1e-05,3.4e-05,-7e-06,-1.6e-05,-5e-06,-2.9e-05,-2.6e-05,-4e-06,4.6e-05,-5e-06,-1.9e-05,-2.6e-05,-2.2e-05,-4.2e-05,1e-05,-3.2e-05,1e-06,-3.4e-05,-3e-06,7e-06,-3.5e-05,-1.6e-05,1e-05,1.1e-05,-2.8e-05,-4e-05,2e-06,-9e-06,2.7e-05,-2.7e-05,7e-06,2e-06,-7e-06,-3.7e-05,4.3e-05,1.8e-05,5e-06,1.3e-05,-1e-06,-1e-06,5e-06,-1.1e-05,4e-05,6e-06,2.7e-05,-6e-06,-1.2e-05,-1.4e-05,8.1e-05,1.3e-05,-2.6e-05,5.4e-05,-1.2e-05,-3.7e-05,-1.6e-05,-9e-06,-4.3e-05,-7e-06,4.3e-05,1e-05,6.2e-05,-4.3e-05,-3e-05,1.3e-05,3.6e-05,3e-06,-5.4e-05,-3.7e-05,-5.7e-05,9e-06,-3.2e-05,2.6e-05,-1.6e-05,-2.3e-05,1e-05,1.9e-05,-4.8e-05,4.1e-05,-5e-06,-1.6e-05,-2e-06,3.3e-05,2e-06,-1e-06,6.1e-05,-1.2e-05,-3.2e-05,3.6e-05,-2.4e-05,-9e-06,2.1e-05,2.3e-05,1.1e-05,2e-06,3.8e-05,4e-06,4e-06,7e-06,-6e-06,-1.9e-05,3e-05,2e-06,-1.4e-05,-2e-05,1.7e-05,-6e-06,-3e-05,4.1e-05,1.2e-05,-4.1e-05,-6e-06,2.4e-05,-8e-06
2.5e-05,1.7e-05,2.2e-05,2.3e-05,1.8e-05,2.9e-05,2e-06,2.7e-05,2.8e-05,0,1.6e-05,0,1.3e-05,0,3.1e-05,2.1e-05,2.3e-05,5.3e-05,4.5e-05,3.8e-05,1e-06,1.7e-05,1.7e-05,2.2e-05,1e-05,2.1e-05,1.2e-05,1.5e-05,9e-06,-7e-06,-1.6e-05,-1.3e-05,-1.4e-05,-1.4e-05,3.6e-05,6e-06,3.2e-05,4.9e-05,7e-06,1.5e-05,-1e-05,8e-06,7e-06,3.4e-05,-1.3e-05,3e-05,3e-06,2.4e-05,-6e-06,5e-06,2.6e-05,2.3e-05,3.2e-05,-1.8e-05,5.6e-05,7e-06,2.7e-05,0,4e-05,-1e-05,-2.6e-05,-1.5e-05,-4e-06,1.3e-05,4.5e-05,-3e-06,4.4e-05,2e-05,2e-06,4.5e-05,-2.3e-05,2.8e-05,-3.9e-05,7e-06,4.5e-05,-6e-06,-3.4e-05,7e-06,-1e-06,2e-05,1.9e-05,-6e-06,3.7e-05,-1e-06,8.4e-05,1.7e-05,1.3e-05,2.7e-05,1.2e-05,1.2e-05,4e-05,0,5.5e-05,2.3e-05,-1.1e-05,-2.2e-05,1.6e-05,4e-06,3e-06,2.3e-05,2.8e-05,-5e-06,4.1e-05,-2.1e-05,1.8e-05,1.5e-05,2e-05,-1.1e-05,2e-05,7e-06,3e-05,3.7e-05,2.6e-05,7e-06,9e-06,6.3e-05,2.8e-05,2e-06,1.1e-05,6e-06,2.7e-05
-2.4e-05,1.9e-05,8e-06,-3e-06,0,2.5e-05,0,2.1e-05,-1.1e-05,-1.1e-05,6e-06,2.5e-05,6e-06,2.1e-05,-4e-06,-1.1e-05,-4e-06,1.7e-05,9e-06,-2e-06,2.3e-05,2.8e-05,1.3e-05,-2.6e-05,5e-06,1.8e-05,1.1e-05,4e-06,2.9e-05,1.4e-05,-1.7e-05,-1e-06,2.7e-05,-1e-06,5e-06,1.3e-05,-4e-06,-2.2e-05,3.1e-05,2.4e-05,1.1e-05,2.2e-05,0,1.1e-05,-3e-06,-2e-06,-2.1e-05,1e-05,-7e-06,4e-06,2.5e-05,2.2e-05,2.2e-05,6e-06,7e-06,7e-06,3.3e-05,-1.3e-05,5e-06,-1.1e-05,1.2e-05,1.4e-05,2.7e-05,-6e-06,-6e-06,3.2e-05,2.3e-05,-1e-05,5e-06,2e-06,-2.1e-05,2e-05,-2.4e-05,-3.8e-05,2.6e-05,2.1e-05,3e-06,-1.7e-05,-3.3e-05,-1.6e-05,3.3e-05,8e-06,-5.5e-05,2e-06,4.2e-05,1.4e-05,1.3e-05,2.2e-05,1e-05,-6e-06,5e-06,2.8e-05,-1e-05,1.5e-05,1.3e-05,-4e-06,-1.4e-05,-4e-06,1.2e-05,-9e-06,1.2e-05,2e-05,2.3e-05,3e-06,5e-06,1e-06,1.6e-05,1.3e-05,-1.6e-05,9e-06,1.8e-05,1.2e-05,-2e-06,-2.1e-05,-9e-06,-3e-06,0,2.6e-05,7e-06,-4e-06,-1e-06
-5e-06,-6e-06,-7e-06,-5e-06,-1.8e-05,1e-06,3e-06,-9e-06,-1.3e-05,-1.5e-05,-9e-06,-8e-06,-1.2e-05,-1.1e-05,-2.4e-05,-1e-06,-7e-06,-1.5e-05,3e-05,5e-06,-1.5e-05,2e-06,-9e-06,-9e-06,-1e-06,-9e-06,-1.3e-05,-1.1e-05,-6e-06,-4e-06,-2.2e-05,-1.3e-05,-1e-06,-1.4e-05,-3.6e-05,-2.5e-05,-1.1e-05,-1.6e-05,1e-06,-1.3e-05,-3e-06,-2.1e-05,-2e-06,-1.5e-05,-1.6e-05,-8e-06,-5e-06,-2.5e-05,-2.7e-05,-5e-06,-2e-06,-3e-06,-3.2e-05,-5e-06,-2e-05,6e-06,-3e-06,-3.9e-05,-1.5e-05,-1.8e-05,-2.3e-05,-9e-06,3e-06,-1.5e-05,-1.5e-05,-1.2e-05,-2e-05,-5e-06,-1.7e-05,-1.4e-05,-1.3e-05,-7e-06,6e-06,-7e-06,1.2e-05,1e-06,1.8e-05,-2.1e-05,6e-06,1.3e-05,-9e-06,1e-05,-1.6e-05,-2.6e-05,1e-06,1e-06,-1.2e-05,-3e-05,-5e-06,-8e-06,-9e-06,6e-06,-5e-06,-1.7e-05,1e-06,-2.5e-05,-5e-06,1e-05,-9e-06,-1e-06,8e-06,-6e-06,-7e-06,-3.9e-05,-9e-06,-5e-06,-2e-06,-1.5e-05,-1.3e-05,-2e-05,6e-06,-2e-06,-7e-06,-2.9e-05,-5e-06,1.3e-05,-5e-06,2e-06,-1.2e-05,-1.8e-05,-1e-06
1.2e-05,-3e-06,-1.3e-05,6e-06,-1.1e-05,-5e-06,1.7e-05,-1.1e-05,-6e-06,-1.8e-05,8e-06,-1.4e-05,1e-06,-6e-06,-7e-06,1e-06,-2.3e-05,-1e-06,1e-05,-3e-05,9e-06,-1e-05,-1.4e-05,1.4e-05,1.1e-05,-7e-06,-6e-06,2e-06,7e-06,-3e-06,3e-06,1e-06,-8e-06,-1.8e-05,4e-06,-1e-05,-1.2e-05,-6e-06,-6e-06,-8e-06,4e-06,-1.3e-05,-2.8e-05,-3e-06,-1.1e-05,-2.6e-05,-2e-06,-4e-06,6e-06,2e-06,-1.4e-05,-1e-06,-2e-05,1e-05,2.6e-05,-3e-06,-2.1e-05,-1.6e-05,-1.2e-05,-3.4e-05,1.6e-05,-1e-06,4e-06,-8e-06,1.6e-05,3.2e-05,-8e-06,-1e-06,7e-06,-1e-05,-3e-05,-3.1e-05,2.9e-05,1.7e-05,1e-05,-1.1e-05,-2e-06,-2.2e-05,1.9e-05,-2e-05,-1.7e-05,-9e-06,4e-06,3e-06,-3e-05,1e-06,8e-06,-1.8e-05,-8e-06,-1e-06,-1.5e-05,-1.5e-05,-1.6e-05,-1.8e-05,4e-06,9e-06,-8e-06,-1e-06,-3e-06,-1e-05,-8e-06,-7e-06,-3e-06,-1.2e-05,4e-06,-1.1e-05,-3e-06,1.6e-05,-4e-06,-1e-05,-1.4e-05,-4e-06,-3e-06,-1.7e-05,1e-06,-1.1e-05,-1e-05,-1e-06,-4e-06,-2.4e-05,3e-06
4e-06,1e-06,-4e-06,-3e-06,-2e-06,3e-06,8e-06,-1.1e-05,-1.1e-05,3e-06,-2e-06,-6e-06,-4e-06,3e-06,-4e-06,-1e-06,1e-06,1e-06,-4e-06,4e-06,-3e-06,-7e-06,7e-06,3e-06,-6e-06,4e-06,-5e-06,-1e-06,1.8e-05,4e-06,0,-2e-06,0,5e-06,-1.4e-05,-3e-06,3e-06,-2e-06,1e-06,4e-06,-4e-06,-4e-06,-6e-06,7e-06,-5e-06,-3e-06,3e-06,-4e-06,-5e-06,1e-06,2e-06,-1.3e-05,5e-06,1e-05,-8e-06,-6e-06,0,-3e-06,-2e-05,-6e-06,-1.9e-05,6e-06,-1e-06,1e-06,1.5e-05,-1.4e-05,-6e-06,-8e-06,-8e-06,6e-06,-2e-06,-2.5e-05,-1e-05,-1.1e-05,9e-06,2e-06,-5e-06,-2e-06,4e-06,-2e-05,3e-06,-1.3e-05,3e-06,2e-06,-1.6e-05,-2.4e-05,8e-06,-1e-06,-2e-06,-4e-06,-2e-06,1.6e-05,-6e-06,1.3e-05,2e-06,3e-06,3e-06,-5e-06,0,1.3e-05,-1.7e-05,5e-06,-7e-06,5e-06,-1.3e-05,2e-06,4e-06,-1.7e-05,1.3e-05,5e-06,-7e-06,-4e-06,2e-06,1.4e-05,-6e-06,-1.6e-05,1e-06,4e-06,-1.6e-05,-1e-06,3e-06
-1e-06,-1.4e-05,6e-06,-5e-06,1e-06,1e-06,1e-06,-6e-06,6e-06,0,3e-06,-3e-06,-8e-06,8e-06,8e-06,0,1.1e-05,1e-06,-1.3e-05,-3e-06,8e-06,-2e-06,1.3e-05,4e-06,2e-06,-1e-06,7e-06,0,1e-06,4e-06,7e-06,4e-06,-2e-06,5e-06,-1.9e-05,2e-06,2e-06,1e-05,-8e-06,1e-05,2e-06,-2e-06,-7e-06,0,0,2e-06,9e-06,2e-06,0,-1e-06,0,2e-06,1.7e-05,5e-06,0,0,3.3e-05,2e-06,-8e-06,-1.6e-05,6e-06,1e-06,-1e-06,-2e-06,-1.3e-05,-1e-06,4e-06,5e-06,1.1e-05,-1e-06,-8e-06,-3e-06,-1.1e-05,-5e-06,1.2e-05,-6e-06,1e-05,1e-05,6e-06,6e-06,2.2e-05,8e-06,2.1e-05,2e-06,-1e-05,2e-06,-5e-06,6e-06,2e-06,1e-06,3e-06,-1e-05,-1.6e-05,-1e-06,2e-06,7e-06,-3e-06,7e-06,-2e-06,-3e-06,8e-06,-5e-06,-1.2e-05,1.2e-05,-4e-06,1e-06,5e-06,4e-06,9e-06,4e-06,-5e-06,5e-06,8e-06,1e-06,8e-06,-3e-06,1e-06,1e-06,0,-2e-06,-8e-06
8e-06,0,2e-06,-1e-06,-1e-06,3e-06,5e-06,-2e-06,2e-06,0,-9e-06,-5e-06,6e-06,-2e-06,5e-06,0,8e-06,-2e-06,-1.2e-05,-1e-06,-9e-06,0,1e-06,7e-06,-1e-06,-4e-06,1.1e-05,1e-06,-7e-06,-1e-06,7e-06,-2e-06,-6e-06,8e-06,-3e-06,-2e-06,5e-06,-6e-06,-5e-06,2e-06,-3e-06,2e-06,1.7e-05,-5e-06,-2e-06,7e-06,-3e-06,1e-06,9e-06,-1e-06,4e-06,5e-06,4e-06,-6e-06,-1.2e-05,5e-06,1.3e-05,3e-06,2e-06,7e-06,3e-06,-4e-06,4e-06,5e-06,-1.3e-05,4e-06,3e-06,-6e-06,-4e-06,-4e-06,2e-06,3e-06,-8e-06,3e-06,-1.8e-05,-1e-06,1e-06,6e-06,1e-06,-1.3e-05,-1.1e-05,3e-06,-2e-06,2e-06,-8e-06,8e-06,-5e-06,1.4e-05,0,1e-06,-1e-06,0,8e-06,-4e-06,-2e-06,1e-06,1.2e-05,-7e-06,2e-06,-8e-06,4e-06,1e-06,9e-06,3e-06,-3e-06,1e-06,-5e-06,3e-06,6e-06,-4e-06,0,-1e-06,-1e-06,5e-06,-2e-06,2e-06,-5e-06,-4e-06,3e-06,-3e-06,-3e-06
3e-06,0,-1e-06,0,7e-06,-2e-06,-1e-06,1e-06,-2e-06,2e-06,1e-06,0,-1e-06,-5e-06,3e-06,3e-06,-3e-06,-2e-06,-7e-06,3e-06,4e-06,-5e-06,2e-06,-2e-06,-1e-06,1e-06,-5e-06,-2e-06,-1.3e-05,-2e-06,-1e-06,2e-06,-7e-06,1e-06,8e-06,1e-06,-2e-06,-3e-06,-3e-06,3e-06,-1e-06,3e-06,-7e-06,2e-06,1e-06,1e-06,4e-06,3e-06,2e-06,0,9e-06,-4e-06,-3e-06,-6e-06,5e-06,-2e-06,0,6e-06,6e-06,6e-06,-5e-06,2e-06,-4e-06,-6e-06,-1e-06,1.1e-05,2e-06,4e-06,-4e-06,7e-06,9e-06,1.1e-05,-6e-06,-3e-06,-1.8e-05,-3e-06,4e-06,-2e-06,-9e-06,2e-06,-5e-06,-7e-06,-1e-05,-2e-06,5e-06,2e-06,2e-06,2e-06,-2e-06,0,4e-06,0,1e-06,3e-06,-2e-06,0,-1e-05,0,1e-06,4e-06,-1e-06,-1e-06,1.2e-05,1.1e-05,-3e-06,2e-06,4e-06,2e-06,-7e-06,1e-06,2e-06,-4e-06,1e-06,3e-06,-5e-06,1e-06,2e-06,-5e-06,8e-06,2e-06,2e-06
0,5e-06,2e-06,-5e-06,-1e-06,2e-06,-8e-06,4e-06,-1e-06,0,0,7e-06,0,2e-06,-2e-06,-3e-06,-3e-06,-2e-06,-6e-06,7e-06,-4e-06,-1e-06,1e-06,-3e-06,0,2e-06,-2e-06,-3e-06,-1e-06,-1e-06,-3e-06,0,0,2e-06,-1e-05,3e-06,-5e-06,2e-06,4e-06,5e-06,-3e-06,2e-06,-4e-06,0,3e-06,2e-06,0,4e-06,-5e-06,1e-06,2e-06,1e-06,-8e-06,-4e-06,-2e-06,-3e-06,-4e-06,-1e-06,1e-06,2e-06,0,-2e-06,-2e-06,-1e-06,1e-05,-5e-06,-5e-06,-4e-06,-4e-06,-5e-06,2e-06,1e-06,5e-06,5e-06,-3e-06,-3e-06,-5e-06,-4e-06,-2e-06,6e-06,7e-06,0,-2e-06,0,1.6e-05,-5e-06,1e-06,3e-06,1e-06,0,1e-06,0,-9e-06,0,-2e-06,-5e-06,-1e-06,0,-1e-06,3e-06,-1e-06,1e-06,3e-06,0,1e-06,2e-06,2e-06,-5e-06,-2e-06,1e-06,5e-06,5e-06,-2e-06,5e-06,4e-06,-2e-06,3e-06,-1e-06,-1e-06,-2e-06,-1e-06
1e-06,3e-06,0,3e-06,2e-06,1e-06,1e-06,2e-06,-6e-06,-1e-06,-1e-06,1e-06,-1e-06,2e-06,2e-06,0,-4e-06,-2e-06,2e-06,1e-06,-2e-06,5e-06,-3e-06,-1e-06,2e-06,5e-06,-3e-06,0,4e-06,0,-4e-06,1e-06,8e-06,-5e-06,-2e-06,3e-06,-3e-06,-1e-06,0,3e-06,2e-06,5e-06,4e-06,-4e-06,1e-06,-3e-06,-5e-06,-2e-06,2e-06,0,2e-06,1e-06,-6e-06,1e-06,1e-06,2e-06,-2e-06,3e-06,-4e-06,6e-06,0,-1e-06,-6e-06,-1e-06,-7e-06,0,-4e-06,-3e-06,1e-06,0,4e-06,-4e-06,1e-06,-4e-06,2e-06,1e-06,-6e-06,-2e-06,-3e-06,-3e-06,2e-06,4e-06,3e-06,0,9e-06,6e-06,-2e-06,4e-06,-1e-06,-1e-06,0,2e-06,-4e-06,-1e-06,-2e-06,1e-06,2e-06,-1e-06,0,-5e-06,0,0,-3e-06,0,1e-06,-1e-06,1e-06,5e-06,-1e-06,2e-06,1e-06,1e-06,0,-1e-06,-1e-06,-2e-06,-2e-06,1e-06,0,0,1e-06
-3e-06,-2e-06,-1e-06,-1e-06,-4e-06,0,2e-06,-1e-06,-5e-06,2e-06,1e-06,-1e-06,0,-1e-06,-2e-06,0,-4e-06,-4e-06,3e-06,-2e-06,1e-06,2e-06,-1e-06,-5e-06,-1e-06,-3e-06,0,-3e-06,-2e-06,1e-06,-1e-06,-1e-06,0,-4e-06,3e-06,1e-06,-2e-06,-5e-06,2e-06,-1e-06,0,2e-06,-6e-06,-2e-06,1e-06,-3e-06,-2e-06,-1e-06,-1e-06,0,-5e-06,-1e-06,2e-06,2e-06,-4e-06,2e-06,-3e-06,3e-06,-7e-06,6e-06,-2e-06,0,1e-06,0,-5e-06,3e-06,-3e-06,3e-06,1e-06,2e-06,5e-06,-7e-06,4e-06,0,1e-06,0,2e-06,1e-06,-1e-06,5e-06,-2e-06,1e-06,-1e-06,1e-06,-6e-06,-1e-06,1e-06,-7e-06,-2e-06,1e-06,-4e-06,1e-06,-1e-06,2e-06,1e-06,2e-06,-1e-06,0,0,1e-06,1e-06,0,-2e-06,-4e-06,0,-1e-06,0,-2e-06,4e-06,-1e-06,-4e-06,-3e-06,1e-06,0,-1e-06,-4e-06,-2e-06,2e-06,-4e-06,1e-06,0
2e-06,3e-06,-1e-06,1e-06,-3e-06,-2e-06,2e-06,-1e-06,1e-06,0,0,-2e-06,-2e-06,-3e-06,1e-06,0,5e-06,-3e-06,1e-06,3e-06,-1e-06,1e-06,3e-06,0,0,-2e-06,0,1e-06,0,-1e-06,-2e-06,0,-2e-06,-4e-06,-1e-06,0,3e-06,5e-06,0,-2e-06,1e-06,-2e-06,-1e-06,1e-06,0,1e-06,-1e-06,-2e-06,-4e-06,1e-06,-2e-06,1e-06,3e-06,2e-06,0,0,4e-06,1e-06,-4e-06,2e-06,1e-06,0,1e-06,1e-06,9e-06,2e-06,-1e-06,-2e-06,2e-06,-3e-06,0,-4e-06,-7e-06,0,-3e-06,-1e-06,0,2e-06,3e-06,-3e-06,-7e-06,-2e-06,7e-06,-2e-06,-7e-06,-5e-06,2e-06,-3e-06,0,1e-06,1e-06,0,-2e-06,-2e-06,0,0,-2e-06,2e-06,-1e-06,0,-4e-06,0,0,-1e-06,0,0,-3e-06,2e-06,3e-06,0,0,1e-06,1e-06,1e-06,2e-06,-2e-06,2e-06,0,-5e-06,0,2e-06
-2e-06,-2e-06,0,0,0,1e-06,4e-06,0,0,1e-06,3e-06,-2e-06,0,1e-06,2e-06,0,5e-06,0,-3e-06,-2e-06,0,-1e-06,0,-1e-06,1e-06,2e-06,2e-06,-1e-06,5e-06,-1e-06,0,-1e-06,-1e-06,-4e-06,-2e-06,1e-06,3e-06,-2e-06,-2e-06,0,0,0,2e-06,0,0,1e-06,-1e-06,2e-06,1e-06,0,0,-2e-06,5e-06,1e-06,2e-06,-2e-06,7e-06,-1e-06,-1e-06,2e-06,-2e-06,1e-06,-2e-06,-1e-06,0,3e-06,3e-06,-1e-06,-2e-06,1e-06,0,2e-06,-6e-06,-2e-06,5e-06,-1e-06,1e-06,1e-06,2e-06,4e-06,2e-06,1e-06,-5e-06,2e-06,-9e-06,0,0,2e-06,-1e-06,0,0,-1e-06,-2e-06,0,0,-1e-06,1e-06,-1e-06,1e-06,3e-06,0,-1e-06,-3e-06,-3e-06,0,-1e-06,3e-06,-3e-06,0,2e-06,-2e-06,0,2e-06,-1e-06,-1e-06,-2e-06,0,2e-06,-3e-06,1e-06,0
0,-3e-06,0,-1e-06,-1e-06,0,4e-06,0,1e-06,-1e-06,-2e-06,-2e-06,0,3e-06,-1e-06,0,-1e-06,-2e-06,-3e-06,0,2e-06,1e-06,0,1e-06,-1e-06,0,1e-06,-1e-06,4e-06,2e-06,0,1e-06,-1e-06,1e-06,1e-06,0,1e-06,0,-1e-06,-1e-06,0,-1e-06,3e-06,-2e-06,-2e-06,2e-06,1e-06,0,-1e-06,0,1e-06,1e-06,2e-06,0,-5e-06,0,-1e-06,0,4e-06,-3e-06,1e-06,0,0,-1e-06,-6e-06,-5e-06,1e-06,1e-06,0,1e-06,-3e-06,5e-06,5e-06,0,6e-06,0,-2e-06,-1e-06,2e-06,-1e-06,4e-06,1e-06,-2e-06,-1e-06,0,3e-06,-1e-06,2e-06,0,0,1e-06,0,1e-06,2e-06,1e-06,-1e-06,-1e-06,1e-06,-1e-06,-2e-06,1e-06,0,3e-06,-1e-06,-1e-06,0,-1e-06,1e-06,-3e-06,0,0,0,-1e-06,-2e-06,1e-06,3e-06,-1e-06,0,1e-06,0,-1e-06
1e-06,0,0,0,0,0,2e-06,0,0,0,1e-06,1e-06,0,-1e-06,1e-06,0,-3e-06,-1e-06,-3e-06,0,0,0,1e-06,1e-06,0,-2e-06,0,-1e-06,-3e-06,0,1e-06,-1e-06,-1e-06,2e-06,1e-06,-2e-06,-2e-06,1e-06,0,-1e-06,-1e-06,-2e-06,-2e-06,1e-06,-2e-06,0,0,0,0,0,3e-06,2e-06,-5e-06,-1e-06,3e-06,1e-06,-8e-06,-3e-06,2e-06,0,-1e-06,0,-2e-06,0,0,3e-06,0,-2e-06,-2e-06,-1e-06,-4e-06,5e-06,1e-06,1e-06,-3e-06,0,2e-06,-2e-06,2e-06,-1e-06,-4e-06,-1e-06,3e-06,1e-06,3e-06,0,0,1e-06,0,0,-1e-06,-1e-06,4e-06,-1e-06,0,0,0,0,0,-3e-06,1e-06,0,6e-06,-1e-06,0,0,-1e-06,0,-2e-06,-1e-06,2e-06,1e-06,0,-3e-06,1e-06,0,0,0,3e-06,-1e-06,0
2e-06,1e-06,0,0,2e-06,0,0,1e-06,-3e-06,-1e-06,-1e-06,1e-06,0,-2e-06,-2e-06,0,-2e-06,-1e-06,-2e-06,0,0,-1e-06,-1e-06,2e-06,0,0,-3e-06,0,-4e-06,-1e-06,1e-06,0,-3e-06,0,0,-2e-06,-1e-06,-3e-06,1e-06,-1e-06,0,-1e-06,-1e-06,1e-06,-2e-06,0,2e-06,1e-06,1e-06,0,1e-06,-1e-06,-4e-06,-1e-06,-2e-06,0,-5e-06,-1e-06,0,-5e-06,0,0,3e-06,0,1e-06,1e-06,-1e-06,0,1e-06,-1e-06,-3e-06,-1e-06,0,-1e-06,-6e-06,-1e-06,1e-06,-2e-06,-1e-06,2e-06,-2e-06,1e-06,-3e-06,0,7e-06,-2e-06,0,-2e-06,0,0,0,0,-2e-06,-1e-06,0,0,1e-06,-1e-06,0,4e-06,-1e-06,-1e-06,1e-06,0,0,0,0,0,0,0,1e-06,-2e-06,-1e-06,0,-1e-06,1e-06,1e-06,-2e-06,0,0,1e-06
-1e-06,2e-06,0,-1e-06,1e-06,0,-2e-06,1e-06,-2e-06,0,0,2e-06,0,0,0,1e-06,-1e-06,0,0,-1e-06,0,-1e-06,-2e-06,0,0,1e-06,0,-1e-06,0,0,1e-06,0,1e-06,2e-06,-2e-06,-1e-06,-1e-06,2e-06,1e-06,0,0,-1e-06,2e-06,-1e-06,-1e-06,-2e-06,1e-06,-1e-06,0,0,0,0,-1e-06,0,2e-06,-1e-06,-4e-06,0,-3e-06,-4e-06,-1e-06,0,0,0,2e-06,0,-1e-06,-1e-06,1e-06,0,-3e-06,-3e-06,-3e-06,0,0,-1e-06,2e-06,0,-1e-06,-1e-06,1e-06,0,4e-06,0,5e-06,2e-06,-1e-06,0,0,0,0,0,-3e-06,2e-06,0,1e-06,-2e-06,0,0,-1e-06,0,0,-2e-06,1e-06,0,0,1e-06,-2e-06,2e-06,1e-06,-1e-06,1e-06,0,0,1e-06,0,0,0,0,-1e-06,0
2e-06,-1e-06,0,1e-06,-1e-06,0,0,0,-1e-06,0,0,1e-06,-1e-06,2e-06,0,-1e-06,1e-06,1e-06,3e-06,1e-06,0,0,2e-06,0,0,0,-1e-06,1e-06,1e-06,0,1e-06,0,3e-06,0,-1e-06,-1e-06,1e-06,0,1e-06,0,0,0,-2e-06,0,-2e-06,0,-1e-06,1e-06,1e-06,0,-1e-06,0,4e-06,-1e-06,-2e-06,0,0,0,-4e-06,0,0,0,0,0,-2e-06,0,0,-2e-06,1e-06,2e-06,-2e-06,-4e-06,-1e-06,0,1e-06,1e-06,-2e-06,1e-06,-1e-06,-1e-06,2e-06,-1e-06,0,0,0,1e-06,0,1e-06,0,0,-1e-06,1e-06,3e-06,0,0,1e-06,1e-06,-1e-06,0,-1e-06,0,0,-2e-06,2e-06,0,0,0,2e-06,1e-06,0,0,1e-06,1e-06,1e-06,0,0,-1e-06,0,-2e-06,0,0
0,1e-06,0,0,0,0,0,-1e-06,-1e-06,0,0,-1e-06,0,-1e-06,1e-06,1e-06,3e-06,1e-06,2e-06,0,-2e-06,0,0,0,1e-06,0,2e-06,-1e-06,0,0,0,0,0,-1e-06,1e-06,0,1e-06,-1e-06,0,-1e-06,0,1e-06,-1e-06,0,0,-1e-06,0,-1e-06,1e-06,0,-2e-06,0,3e-06,0,1e-06,1e-06,2e-06,-1e-06,-1e-06,-2e-06,0,0,0,-1e-06,-1e-06,-1e-06,1e-06,2e-06,-1e-06,-2e-06,-1e-06,-1e-06,1e-06,-1e-06,1e-06,0,-2e-06,1e-06,-2e-06,1e-06,-1e-06,0,-2e-06,0,-5e-06,-3e-06,1e-06,-1e-06,0,0,0,0,-1e-06,-1e-06,-1e-06,0,0,0,0,0,0,0,0,0,0,0,-1e-06,-1e-06,-1e-06,-1e-06,-1e-06,-2e-06,1e-06,0,-1e-06,0,0,1e-06,-2e-06,0,1e-06
0,0,0,-1e-06,-1e-06,0,0,0,1e-06,0,1e-06,-2e-06,0,-1e-06,0,-1e-06,1e-06,1e-06,1e-06,0,1e-06,-1e-06,-1e-06,-1e-06,0,-1e-06,1e-06,0,-1e-06,0,-1e-06,0,0,-1e-06,-1e-06,0,0,0,0,-1e-06,0,1e-06,2e-06,1e-06,0,1e-06,0,1e-06,-1e-06,0,1e-06,0,0,0,0,0,-1e-06,1e-06,0,2e-06,0,0,0,1e-06,3e-06,1e-06,1e-06,-2e-06,-1e-06,3e-06,1e-06,2e-06,0,0,-2e-06,0,0,0,0,-1e-06,-2e-06,0,1e-06,0,-5e-06,0,1e-06,0,0,0,0,0,-1e-06,1e-06,0,-1e-06,0,0,0,1e-06,0,0,0,1e-06,0,0,0,0,-2e-06,0,-1e-06,1e-06,0,1e-06,1e-06,0,0,0,-2e-06,0,0
0,-2e-06,0,1e-06,-1e-06,0,2e-06,0,0,0,-1e-06,-1e-06,0,0,0,0,-2e-06,1e-06,0,1e-06,-1e-06,0,1e-06,-1e-06,0,1e-06,0,0,2e-06,0,-1e-06,0,-1e-06,-2e-06,-2e-06,1e-06,-1e-06,1e-06,-1e-06,0,0,1e-06,0,0,1e-06,0,-1e-06,0,0,0,0,0,-2e-06,1e-06,0,-1e-06,-5e-06,0,3e-06,1e-06,0,0,2e-06,-1e-06,0,0,0,1e-06,0,-2e-06,2e-06,3e-06,1e-06,0,3e-06,0,1e-06,-1e-06,0,-1e-06,1e-06,0,0,0,-2e-06,1e-06,-1e-06,1e-06,0,0,1e-06,0,0,0,0,0,-1e-06,0,0,1e-06,0,0,0,0,0,0,0,-1e-06,-1e-06,1e-06,1e-06,0,0,0,0,1e-06,0,1e-06,1e-06,0,0
-1e-06,-1e-06,0,0,0,0,3e-06,0,-1e-06,0,0,0,0,1e-06,0,1e-06,-1e-06,1e-06,-1e-06,0,1e-06,0,0,-1e-06,0,1e-06,-1e-06,0,3e-06,0,-1e-06,0,0,-1e-06,1e-06,1e-06,-1e-06,-2e-06,-1e-06,0,0,1e-06,-1e-06,0,0,0,0,0,0,0,1e-06,0,-3e-06,0,1e-06,0,-5e-06,0,1e-06,2e-06,-1e-06,0,-1e-06,0,-3e-06,-1e-06,-1e-06,0,1e-06,1e-06,2e-06,2e-06,-1e-06,0,4e-06,0,0,-1e-06,0,0,2e-06,-1e-06,-1e-06,0,2e-06,-1e-06,0,1e-06,0,0,-1e-06,0,1e-06,-1e-06,0,0,1e-06,0,0,-1e-06,0,0,2e-06,-1e-06,0,0,0,0,1e-06,0,0,0,0,0,0,0,0,0,1e-06,0,0
0,0,0,-1e-06,0,0,1e-06,0,-1e-06,0,-1e-06,1e-06,0,0,-1e-06,-1e-06,0,1e-06,-1e-06,0,0,0,-1e-06,0,0,-1e-06,-1e-06,0,-1e-06,0,0,0,0,-1e-06,0,1e-06,0,2e-06,0,0,0,1e-06,0,1e-06,1e-06,-1e-06,-1e-06,0,-1e-06,0,0,1e-06,0,0,-2e-06,0,-1e-06,1e-06,-1e-06,2e-06,0,0,0,0,1e-06,0,-1e-06,-2e-06,1e-06,0,2e-06,-2e-06,-1e-06,0,-1e-06,0,-1e-06,0,1e-06,0,-1e-06,1e-06,3e-06,0,5e-06,-1e-06,0,0,0,0,0,0,-2e-06,1e-06,0,0,-1e-06,0,0,-1e-06,0,0,1e-06,-1e-06,0,0,-1e-06,0,1e-06,0,0,1e-06,0,0,1e-06,0,0,0,0,0,0
0,1e-06,0,1e-06,0,0,0,0,-2e-06,0,0,1e-06,0,-1e-06,1e-06,0,0,1e-06,-1e-06,0,0,0,1e-06,0,0,-1e-06,0,0,-3e-06,0,0,0,-1e-06,0,-1e-06,0,0,-1e-06,0,0,0,0,1e-06,0,0,0,0,0,0,0,-1e-06,0,2e-06,-1e-06,2e-06,0,0,0,-2e-06,0,0,0,-1e-06,0,1e-06,-1e-06,0,1e-06,0,0,1e-06,-3e-06,-1e-06,0,-3e-06,0,0,1e-06,0,0,-2e-06,0,-1e-06,0,3e-06,1e-06,0,-1e-06,0,0,0,0,-1e-06,0,0,0,1e-06,0,0,2e-06,0,0,-1e-06,-1e-06,0,0,1e-06,0,0,0,0,-1e-06,1e-06,0,-1e-06,0,0,-1e-06,0,0,0
0,0,0,0,0,0,0,0,-1e-06,0,0,1e-06,0,0,0,0,1e-06,1e-06,1e-06,0,0,0,1e-06,1e-06,0,1e-06,0,0,0,0,1e-06,0,1e-06,0,0,0,1e-06,0,0,0,0,0,-1e-06,0,0,0,0,0,1e-06,0,0,0,3e-06,0,-2e-06,0,1e-06,-1e-06,-2e-06,1e-06,0,0,0,0,0,0,1e-06,-2e-06,-1e-06,0,0,-2e-06,2e-06,0,-1e-06,0,2e-06,1e-06,0,1e-06,1e-06,-1e-06,-1e-06,0,1e-06,0,0,0,0,0,0,0,0,-1e-06,0,1e-06,-1e-06,0,0,-1e-06,0,0,-1e-06,0,0,0,0,-1e-06,-1e-06,0,0,0,0,0,0,0,0,0,-1e-06,0,0
0,0,0,0,0,0,-1e-06,0,0,0,0,0,0,1e-06,0,0,1e-06,0,1e-06,0,0,0,-1e-06,0,0,0,0,0,1e-06,0,0,0,1e-06,1e-06,1e-06,0,0,1e-06,1e-06,0,0,-1e-06,0,1e-06,-1e-06,0,0,-1e-06,0,0,-1e-06,0,1e-06,-1e-06,2e-06,0,2e-06,0,0,0,0,0,1e-06,-1e-06,-1e-06,0,0,1e-06,-1e-06,0,-1e-06,1e-06,1e-06,0,1e-06,0,0,0,0,0,1e-06,0,2e-06,0,-3e-06,-1e-06,0,0,0,0,0,0,0,1e-06,0,0,0,0,0,0,0,0,0,0,0,0,0,1e-06,-1e-06,0,-1e-06,1e-06,0,-1e-06,0,-1e-06,0,0,-1e-06,0,0
1e-06,1e-06,0,0,0,0,-1e-06,0,0,0,0,-1e-06,0,0,0,0,-1e-06,0,1e-06,0,0,1e-06,0,0,0,-1e-06,0,0,-1e-06,0,0,0,0,0,0,-1e-06,0,-1e-06,0,0,0,-1e-06,2e-06,0,-1e-06,1e-06,1e-06,1e-06,0,0,0,0,-2e-06,0,-1e-06,0,-2e-06,0,2e-06,-2e-06,0,0,-1e-06,0,-1e-06,0,0,0,0,1e-06,-1e-06,2e-06,-1e-06,0,0,0,-1e-06,-1e-06,-1e-06,1e-06,0,0,-2e-06,0,-4e-06,0,0,0,0,0,0,0,-1e-06,0,0,0,0,0,0,0,0,0,1e-06,1e-06,0,0,0,0,0,0,0,-1e-06,0,0,-1e-06,0,0,0,-1e-06,0,0
0,0,0,0,0,0,0,0,0,0,0,-1e-06,0,-1e-06,0,0,-2e-06,0,0,0,0,0,1e-06,0,0,0,0,0,-1e-06,0,0,0,0,0,0,-1e-06,-1e-06,0,0,0,0,-1e-06,-1e-06,0,-1e-06,0,0,0,0,0,0,0,-2e-06,0,1e-06,0,-2e-06,-1e-06,1e-06,-1e-06,0,0,0,0,2e-06,-1e-06,0,-1e-06,1e-06,-1e-06,-2e-06,2e-06,0,0,-2e-06,0,-1e-06,0,0,-1e-06,-2e-06,0,1e-06,0,-2e-06,1e-06,0,0,0,0,0,0,0,-1e-06,0,0,0,0,0,0,0,0,0,0,0,0,0,0,1e-06,0,0,0,0,0,0,0,0,0,0,0,0
1e-06,0,0,0,0,0,1e-06,0,-1e-06,0,0,0,0,0,0,0,0,0,-1e-06,0,0,0,-1e-06,0,0,0,0,0,1e-06,0,0,0,-1e-06,0,0,0,0,0,0,0,0,-1e-06,-1e-06,0,-1e-06,0,0,0,0,0,0,0,-1e-06,1e-06,0,0,0,0,1e-06,-2e-06,0,0,-1e-06,0,0,0,0,1e-06,0,1e-06,-1e-06,0,-1e-06,0,1e-06,0,1e-06,0,0,1e-06,0,0,1e-06,0,1e-06,0,0,0,0,0,0,0,0,1e-06,0,1e-06,0,0,0,1e-06,0,0,0,1e-06,0,0,0,0,1e-06,0,0,0,0,0,0,0,0,1e-06,1e-06,0,0
0,0,0,0,0,0,0,0,-1e-06,0,0,0,0,1e-06,0,0,0,0,-1e-06,0,0,0,0,0,0,0,0,0,3e-06,0,0,0,0,0,0,0,0,-1e-06,0,0,0,0,0,0,0,0,0,0,0,0,0,-1e-06,2e-06,0,0,0,3e-06,0,-2e-06,0,0,0,1e-06,0,-2e-06,0,0,-1e-06,0,-1e-06,-1e-06,-2e-06,0,0,3e-06,0,0,0,0,0,2e-06,0,-2e-06,0,4e-06,0,0,0,0,0,0,0,-1e-06,0,0,-1e-06,0,0,0,-2e-06,0,0,0,0,0,0,0,0,0,0,0,-1e-06,0,0,0,0,0,0,0,0,0
0,0,0,0,0,0,1e-06,0,-1e-06,0,0,1e-06,0,0,0,0,1e-06,-1e-06,-1e-06,0,0,0,1e-06,0,0,0,0,0,0,0,0,0,0,0,0,0,1e-06,1e-06,0,0,0,0,1e-06,0,0,0,0,0,0,0,0,0,2e-06,0,1e-06,0,3e-06,-1e-06,-2e-06,0,0,0,0,0,1e-06,0,0,0,-1e-06,0,0,-2e-06,0,0,0,0,0,0,0,0,-1e-06,0,1e-06,0,3e-06,0,0,-1e-06,0,0,0,0,-1e-06,-1e-06,0,0,0,0,0,1e-06,0,0,-1e-06,0,0,0,0,0,-1e-06,0,0,0,0,0,0,0,0,0,0,0,0
0,0,0,0,0,0,1e-06,0,-1e-06,0,0,0,0,-1e-06,0,0,1e-06,-1e-06,0,0,0,0,0,0,0,0,0,0,-2e-06,0,0,0,-1e-06,0,0,0,0,0,0,0,0,0,0,0,0,0,0,0,0,0,0,0,1e-06,0,-1e-06,0,2e-06,0,-1e-06,1e-06,0,0,-1e-06,0,1e-06,-1e-06,0,0,0,0,1e-06,-1e-06,0,0,-2e-06,0,-1e-06,0,0,0,-1e-06,0,-1e-06,0,1e-06,0,0,0,0,0,0,0,0,0,0,0,0,0,0,0,0,0,-1e-06,-1e-06,0,0,0,0,-1e-06,0,0,0,0,0,0,0,0,0,0,0,0
0,0,0,0,0,0,0,0,0,0,0,0,0,0,0,0,0,-1e-06,0,0,0,0,0,0,0,0,0,0,-1e-06,0,0,0,1e-06,0,0,0,0,-1e-06,0,0,0,1e-06,-1e-06,0,0,1e-06,0,0,0,0,0,0,-1e-06,0,2e-06,0,1e-06,0,1e-06,2e-06,0,0,1e-06,0,-1e-06,0,0,-1e-06,0,0,1e-06,2e-06,0,0,0,0,1e-06,0,0,0,0,0,-1e-06,0,-3e-06,0,0,0,0,0,0,0,1e-06,0,0,0,0,0,0,0,0,0,0,0,0,0,0,0,0,0,0,0,0,0,0,0,0,0,0,0,0
