0.76931,0.552165,0.631958,0.47119,0.1408,0.077372,0.195146,0.734625,0.988716,0.524451,0.434903,0.51148,0.233055,0.121276,0.232675,0.221499,0.472598,1.094036,1.035683,0.414938,0.112773,0.086595,0.079329,0.070147,0.052863,0.037861,0.032098,0.124172
0.96814,0.680686,0.744322,0.544657,0.161123,0.089105,0.234599,0.860704,1.148718,0.619535,0.5111,0.583602,0.263531,0.140735,0.266899,0.252848,0.562492,1.274633,1.182313,0.47302,0.132181,0.100302,0.090054,0.080121,0.061453,0.045018,0.038763,0.153553
1.318055,0.903914,0.903378,0.64222,0.185946,0.104973,0.307488,1.07081,1.380053,0.750446,0.633502,0.688304,0.300536,0.168629,0.314661,0.294306,0.676316,1.498738,1.365388,0.549028,0.157936,0.116931,0.101784,0.091881,0.072596,0.055138,0.048597,0.199589
1.643219,1.101523,0.965265,0.664273,0.187372,0.114123,0.391958,1.243836,1.488441,0.793906,0.725623,0.754661,0.307065,0.17961,0.338037,0.310534,0.681589,1.526096,1.422154,0.58455,0.16256,0.115258,0.097977,0.093394,0.078025,0.059528,0.05216,0.221304
2.015301,1.333688,1.003996,0.683338,0.200026,0.140899,0.504873,1.432154,1.589367,0.819247,0.800871,0.814232,0.307136,0.18458,0.361967,0.327793,0.616121,1.516034,1.569155,0.677693,0.162935,0.11004,0.092984,0.095088,0.086467,0.063673,0.052873,0.214485
2.644933,1.738085,1.165905,0.812845,0.263917,0.205899,0.65512,1.777095,1.950069,0.997989,1.009601,1.034501,0.377097,0.222103,0.447455,0.399058,0.622867,1.773211,2.082362,0.956056,0.204667,0.136328,0.116289,0.11539,0.110803,0.085154,0.068427,0.21917
3.978283,2.532679,1.592779,1.138149,0.389192,0.30617,0.833871,2.274355,2.565271,1.373192,1.538991,1.595662,0.565207,0.315881,0.655538,0.579205,0.720046,2.313023,2.989234,1.44671,0.297599,0.192692,0.168295,0.158936,0.155165,0.129569,0.106835,0.278936
5.867534,3.5857,2.116757,1.531661,0.546038,0.419316,1.042723,2.884141,3.343384,1.89961,2.387478,2.481588,0.843671,0.436638,0.93087,0.833269,0.908996,3.051923,4.120903,2.056195,0.422438,0.26443,0.235556,0.219526,0.215773,0.188032,0.15976,0.373469
7.571535,4.470718,2.436014,1.766737,0.662673,0.489338,1.155606,3.353551,4.062384,2.451462,3.297572,3.401209,1.101853,0.526756,1.149534,1.058661,1.128155,3.726504,5.048789,2.536887,0.526061,0.321715,0.287609,0.269013,0.266244,0.235992,0.203754,0.447467
8.124756,4.66703,2.385747,1.718532,0.668964,0.473621,1.096073,3.409563,4.305813,2.717915,3.821912,3.880803,1.192858,0.540713,1.210629,1.154096,1.207644,3.889797,5.191103,2.567879,0.545738,0.332181,0.288736,0.271471,0.273412,0.243887,0.210921,0.444873
6.799564,3.879209,2.106152,1.51311,0.568969,0.381281,0.94086,3.172772,4.040956,2.549535,3.692871,3.676887,1.075775,0.497337,1.113123,1.081512,1.065353,3.359975,4.380666,2.086342,0.463719,0.294712,0.236589,0.221377,0.229404,0.205008,0.178607,0.381504
4.553654,2.738136,1.841592,1.342593,0.44467,0.268049,0.771092,2.745429,3.506272,2.16571,3.033264,2.982587,0.863099,0.443734,0.927932,0.87638,0.847682,2.737935,3.490199,1.570371,0.359255,0.246245,0.173863,0.15949,0.168949,0.151182,0.134274,0.303072
3.162864,2.226969,1.886614,1.39441,0.391703,0.192643,0.650033,2.463017,3.25912,1.928324,2.348314,2.360158,0.725115,0.405215,0.784558,0.71537,0.751746,2.58671,3.309035,1.440768,0.299497,0.210201,0.138792,0.12419,0.133845,0.122327,0.112091,0.258409
2.653667,2.147319,2.04084,1.506333,0.392955,0.170008,0.611341,2.462306,3.332673,1.842351,1.9377,2.102381,0.74456,0.408183,0.766656,0.671533,0.719324,2.63502,3.507885,1.585315,0.292349,0.195141,0.133568,0.115448,0.125767,0.113805,0.10519,0.239931
2.421923,2.109862,2.350875,1.770881,0.442533,0.19111,0.728215,2.975336,3.998548,2.04984,1.889232,2.33621,0.996108,0.463014,0.852267,0.732621,0.743059,2.695298,3.728889,1.809239,0.337663,0.203975,0.151993,0.136244,0.145348,0.119334,0.105918,0.227931
2.680286,2.439839,3.090694,2.409722,0.593008,0.250227,0.982038,3.971847,5.482433,2.843039,2.252368,3.062238,1.505741,0.581572,0.997736,0.892153,0.851416,2.949215,4.440241,2.429078,0.480846,0.271815,0.227721,0.21493,0.213814,0.156698,0.123479,0.250248
3.717892,3.434573,4.50277,3.579308,0.865397,0.338412,1.342319,5.442259,7.668862,4.05143,3.017788,4.302028,2.257754,0.801297,1.320462,1.219879,1.139682,3.90331,6.269701,3.655438,0.710154,0.394951,0.359561,0.343195,0.332904,0.23763,0.169268,0.324695
5.048992,4.709394,6.069169,4.840426,1.164055,0.422304,1.729011,7.482266,10.526641,5.409725,4.073276,5.83234,3.027276,1.104065,1.879361,1.712819,1.606759,5.606546,8.872302,5.075895,0.960674,0.548536,0.517862,0.487138,0.467016,0.341237,0.232994,0.414752
6.041124,5.624838,6.929553,5.467281,1.317798,0.46322,1.984466,9.125282,12.63628,6.221513,4.807594,6.717756,3.328494,1.356758,2.482167,2.183316,2.048668,7.445067,11.195225,6.012259,1.136365,0.704367,0.643699,0.583283,0.550679,0.418037,0.287792,0.492217
6.259452,5.760841,6.690478,5.158633,1.249175,0.428205,1.935967,9.556315,13.427184,6.588849,4.839903,6.351284,2.915301,1.459809,2.916986,2.450793,2.212389,8.463303,12.141713,6.050136,1.144322,0.781379,0.665608,0.587468,0.541618,0.424439,0.301159,0.51866
6.12712,5.779908,6.706335,5.128213,1.150245,0.333944,1.556023,8.516019,13.034524,6.954196,4.2929,5.064551,2.121797,1.411204,3.136248,2.550836,1.982184,8.08427,11.702515,5.741026,1.094418,0.754541,0.588411,0.539252,0.48701,0.367818,0.260922,0.46311
5.606838,5.571943,6.872171,5.423309,1.142182,0.24891,1.067683,6.974879,12.318782,7.363168,3.873529,4.215713,1.632013,1.225573,2.950092,2.35019,1.503441,6.399516,9.622836,4.956702,1.051062,0.662206,0.470347,0.473489,0.430729,0.292546,0.214669,0.400826
4.557018,4.646965,6.076306,4.905703,1.037466,0.196609,0.7411,5.436274,10.433474,6.624423,3.431332,3.726097,1.47432,0.993419,2.313268,1.808025,0.967493,4.056871,6.341542,3.544055,0.930484,0.570075,0.393923,0.426156,0.387415,0.23977,0.201735,0.371602
3.264852,3.095678,4.396358,3.588591,0.792636,0.167124,0.556614,3.886624,7.284227,4.64947,2.686073,2.972793,1.294043,0.810594,1.509995,1.139246,0.66083,2.777968,4.444382,2.588893,0.756958,0.486263,0.333108,0.367512,0.352607,0.222829,0.1895,0.307102
2.153819,1.6725,2.988686,2.574484,0.599766,0.151049,0.447976,2.550892,4.172476,2.525332,1.838194,2.075918,1.037377,0.640301,0.822629,0.581045,0.511536,2.520945,4.215381,2.472379,0.666207,0.432824,0.268489,0.284059,0.298883,0.210674,0.158815,0.209368
1.48321,0.820996,1.915247,1.812449,0.472402,0.13482,0.355946,1.750099,2.39524,1.27357,1.152587,1.327796,0.757703,0.480866,0.46293,0.313388,0.436773,2.188295,3.700202,2.189141,0.553086,0.353814,0.200953,0.194102,0.210191,0.163633,0.113527,0.122276
1.135557,0.4774,1.152131,1.166054,0.343659,0.106727,0.306383,1.316084,1.652862,0.81952,0.764994,0.888688,0.510996,0.318079,0.319664,0.248398,0.372466,1.71803,2.950475,1.753661,0.390352,0.249697,0.148188,0.140626,0.13835,0.109237,0.085458,0.094641
0.96423,0.35937,0.720184,0.732432,0.238658,0.08517,0.329685,1.329757,1.649732,0.819576,0.679284,0.725035,0.340045,0.208671,0.302728,0.287651,0.405665,1.911721,3.140029,1.703958,0.308536,0.199958,0.140185,0.122459,0.103239,0.079515,0.074531,0.09326
0.837906,0.321915,0.63839,0.635235,0.202904,0.078206,0.36539,1.503075,1.910637,0.978963,0.834989,0.875398,0.352958,0.19038,0.312697,0.323688,0.502042,2.27137,3.369636,1.616386,0.286967,0.209577,0.155709,0.12445,0.097192,0.074258,0.071128,0.08952
0.708527,0.351676,0.757637,0.71188,0.207065,0.074124,0.386309,1.611808,2.096175,1.121956,0.973681,1.042472,0.422032,0.203442,0.337455,0.351384,0.536629,2.294085,3.135372,1.380278,0.265782,0.211767,0.151332,0.11826,0.099494,0.077591,0.063911,0.082116
0.568097,0.401591,0.889479,0.784577,0.202857,0.061381,0.380658,1.633997,2.125407,1.135388,0.946638,1.04015,0.441117,0.223856,0.377739,0.366441,0.481992,1.927254,2.466296,1.031309,0.220427,0.180288,0.120285,0.093362,0.093267,0.079089,0.059406,0.085649
0.441067,0.438699,0.968712,0.788135,0.172364,0.049015,0.344604,1.663788,2.158864,1.040428,0.774057,0.856923,0.378858,0.236115,0.424522,0.377234,0.375396,1.55628,2.015814,0.808169,0.164367,0.143166,0.094347,0.06971,0.080817,0.078334,0.063113,0.096179
0.311518,0.453767,1.036579,0.804281,0.145843,0.044842,0.289044,1.536472,1.970796,0.861153,0.597727,0.659796,0.294179,0.209741,0.405188,0.347257,0.281288,1.427873,1.945119,0.764404,0.1248,0.114812,0.084116,0.059937,0.065342,0.067303,0.058493,0.08866
0.255807,0.471673,1.119462,0.899265,0.160638,0.048579,0.246534,1.250902,1.558652,0.685429,0.528096,0.617838,0.276045,0.160009,0.311011,0.273025,0.242175,1.394462,1.902774,0.748401,0.107449,0.090386,0.074089,0.053374,0.049191,0.047428,0.04155,0.061227
0.304445,0.503913,1.138834,0.935675,0.179725,0.061751,0.220896,0.934462,1.163265,0.591271,0.626778,0.739345,0.305896,0.122785,0.203099,0.185391,0.22851,1.255813,1.627497,0.635017,0.117913,0.099111,0.083137,0.06401,0.053664,0.035982,0.024675,0.03612
0.370207,0.513489,1.052476,0.860095,0.17292,0.069574,0.19691,0.734283,1.076036,0.641207,0.736534,0.878601,0.332162,0.116061,0.157071,0.137254,0.235076,1.040682,1.198205,0.458614,0.123103,0.107692,0.091592,0.075723,0.062132,0.033839,0.019379,0.036882
0.45214,0.507427,0.906998,0.722731,0.144683,0.062087,0.176313,0.739724,1.193269,0.727536,0.819567,0.951305,0.314411,0.11394,0.173418,0.139942,0.224547,0.803875,0.814005,0.325377,0.115004,0.095476,0.084819,0.076523,0.061774,0.034238,0.022122,0.041939
0.536549,0.454931,0.732413,0.615264,0.131783,0.043202,0.158074,0.78452,1.311213,0.811852,0.882066,0.969546,0.277338,0.116375,0.205705,0.159236,0.204981,0.641799,0.673604,0.27572,0.089437,0.068884,0.07545,0.07257,0.050202,0.032589,0.028632,0.044321
0.583659,0.368496,0.536654,0.495951,0.123379,0.037865,0.142541,0.725644,1.279611,0.84436,0.892212,0.996668,0.312488,0.141192,0.233259,0.18172,0.182948,0.501149,0.582772,0.24832,0.063796,0.049783,0.072099,0.069723,0.040616,0.034517,0.036755,0.044466
0.562659,0.310431,0.377004,0.375526,0.123441,0.062584,0.145956,0.587087,1.124946,0.856374,0.856164,0.979838,0.374004,0.186593,0.240937,0.191346,0.152324,0.360376,0.457087,0.208556,0.057055,0.055174,0.086661,0.082502,0.053998,0.041028,0.045185,0.049037
