-0.000571,-0.000462,-0.000752,-0.000389,-0.001175,-0.000993,-3.6e-05,0.000293,-0.000221,-0.001077,-0.000577,-0.000382,0.000873,-4.4e-05,-0.000402,0.000381,0.000604,0.000376,9.3e-05,0.000373,7.4e-05,-0.000521,-0.00115,-0.000936,-0.000546,-5.2e-05,-0.000644,0.00059,-0.000136,1.7e-05,-0.000209,0.000626,0.001318,0.000315,0.00016,-0.000296,0.000618,-0.000243,-0.000362,0.000539,-0.00011,-0.000724,-8.8e-05,0.000836,0.00133,-0.000255,-0.000414,-0.00066,-0.00061,-0.000346,-0.000503,-0.000749,-0.001133,-1.3e-05,0.001452,0.000913,6.1e-05,-7.1e-05,-0.00047,-0.000324,0.000149,-0.000111,-0.000668,-2e-04,-7.1e-05,3.4e-05,-0.001368,0.001626,0.000182,0.000711,0.000192,-2.3e-05,4.7e-05,0.000192,-0.000192,0.000212,-0.000939,-0.00076,-0.000722,-0.000745,-0.001099,-0.001316,7.9e-05,-4e-05,-0.000122,9.8e-05,0.000209,2.9e-05,7e-06,-0.000189,-0.000899,-0.000358,-0.000337,-0.000584,-2.2e-05,-0.000189,-2e-04,0.000682,0.000255,9e-06,0.000101,3e-04,0.000827,7e-05,-0.000614,0.000145,-0.000209,0.000154,-0.000569,4.7e-05,-0.000849,-0.000643,-1.2e-05,-0.000592,-0.000635,-0.000736,-0.000277,-0.000904,-0.000346,-0.000997,-0.001288
0.000469,9e-06,0.000317,-4.2e-05,-0.000217,0.000616,0.000254,0.00021,4.6e-05,0.000444,-0.00105,-2.4e-05,0.000293,0.000373,0.001071,0.000164,-0.000102,5.1e-05,0.001116,0.00033,-0.000266,0.000129,0.000782,0.000732,-0.000604,-0.000236,0.000365,0.000216,-0.000163,0.00064,0.000711,0.000521,0.000984,0.000769,0.000506,0.000611,0.001075,0.000582,0.001388,7e-04,0.000278,0.000716,0.000561,0.000702,0.00066,0.000289,9.5e-05,0.000326,-0.00057,-0.000158,0.000225,0.000299,0.000673,0.000527,0.00039,-0.00034,0.000966,0.001282,0.000585,0.000588,-0.00055,0.000357,0.000764,0.000378,7.1e-05,8.4e-05,0.001814,0.000131,-0.000131,0.000551,4.2e-05,-0.000169,-0.000819,-3e-04,-0.00023,-0.000549,0.000102,-0.000248,0.00034,0.000178,-0.000449,0.000145,0.000151,-0.001085,-0.001251,-0.000573,-0.000226,-0.000661,0.000102,-0.000293,-0.000502,-0.000517,-0.000527,0.000261,0.000245,0.000387,0.000603,0.00069,-0.000904,-0.000677,-0.000604,-0.000573,-0.000841,-4.5e-05,-6.7e-05,0.000146,-4.9e-05,-0.000768,-0.000556,0.001246,0.000385,0.000273,0.000704,0.000223,0.000444,0.000878,-0.000331,-0.000304,-0.001021,0.000169,0.000552
-0.001034,3e-05,9e-05,-7.8e-05,0.000296,4.2e-05,0.000698,-0.000655,-0.001065,-0.000798,0.000677,3e-05,-0.000643,-0.000222,-0.00079,-0.000381,-0.000165,-0.000138,-0.000455,-0.001099,-0.000552,-8.5e-05,-0.000546,-0.000206,0.000322,-6e-06,-0.000105,-0.001283,-0.000479,0.000531,-0.000684,-0.000219,-0.000828,-0.000349,-0.000458,0.000118,0.000323,-0.000775,-0.001081,-0.000895,-0.000348,0.000223,3.1e-05,2.9e-05,-8e-06,-0.00119,-0.000758,-0.000533,-0.000146,1e-04,-0.000585,-0.000484,0.000129,3.4e-05,-0.000594,6.2e-05,-0.000811,-9.7e-05,0.000529,-0.000211,-0.00038,-0.000537,-1.6e-05,-0.000745,-9e-05,0.000301,-0.000629,-0.001415,-0.001606,-0.000678,-0.000373,0.00039,-0.000998,-0.000664,-6.4e-05,-0.000783,0.000221,-4e-04,-0.001145,-0.001328,0.000304,-0.000205,-0.000638,-0.000556,4.3e-05,-0.001238,-0.001221,0.000316,0.000454,4.4e-05,0.000145,-0.001335,-0.000576,-0.000321,-4.4e-05,-8.9e-05,-0.001329,-0.000666,-0.001224,-0.000635,-0.000798,-0.000161,-6.4e-05,0.000366,0.000158,-0.001305,-0.000195,0.000406,0.000543,-0.000754,-0.001152,-0.000786,-0.001149,-0.001413,-0.000565,-0.000769,-0.000359,-0.000424,0.000141,-5.1e-05,0.000148
0.00027,-0.000631,-5.5e-05,0.00033,-0.000552,-0.000421,-2.2e-05,-0.000209,-0.000263,0.000418,0.000355,0.000684,-0.000184,-0.000168,-8.7e-05,-0.000758,-0.00067,-0.000608,0.000432,-0.001373,-0.000704,-0.000188,-0.000336,-0.000392,-6.6e-05,-0.000325,0.000269,2e-05,-0.000309,-0.000579,0.000926,0.000105,5.9e-05,-0.000416,-0.000913,0.000175,-0.000562,0.000384,0.000515,-0.000745,-5.1e-05,-6.2e-05,-0.000904,-0.000194,-0.000432,0.00017,0.000173,0.000247,-1.7e-05,-9.7e-05,-0.000324,-0.00029,-0.000189,-0.000121,-0.000907,0.000507,0.00055,-0.000401,-0.000585,-0.000583,-0.000224,-0.000137,-0.00028,-0.000237,5.8e-05,-0.000474,-0.000287,-0.000793,0.001263,-0.001366,-0.000569,0.000371,0.000353,-7.7e-05,-0.000115,0.000309,-0.000406,-0.00054,0.001048,0.000578,-0.000253,7e-05,-0.000992,0.000328,0.000984,0.000947,-0.000599,-0.000649,-0.000569,-0.001032,-0.000478,0.001034,0.000593,-0.000118,-0.000239,-5.6e-05,-0.000529,-9.4e-05,0.000128,0.00013,0.001255,0.000684,0.000704,0.000239,0.000224,-5.8e-05,-0.00017,0.000197,1.9e-05,-0.000571,0.000854,0.000294,4.1e-05,0.000811,-1.8e-05,0.000753,0.000665,-0.000339,0.000491,-0.000259,-1e-04
0.000261,-0.000174,-0.000612,-0.000966,0.000163,0.000138,0.000233,-0.000481,-2e-06,-0.00029,-0.000285,-0.000646,-0.00042,-0.000236,-0.000322,-0.000341,5e-05,-0.000483,-0.00036,-0.000203,-0.000777,-0.000515,-9.2e-05,-0.000327,-0.000304,1.1e-05,-0.00017,3.6e-05,-0.000392,7.7e-05,-0.00075,-0.001136,-0.00105,-0.001085,0.000158,0.000361,-7.1e-05,-0.000441,-0.000648,-0.000118,-0.000786,-5.2e-05,4.1e-05,0.00011,-0.000746,-0.000291,-0.000178,-0.000586,0.000231,-0.000513,-0.000348,-0.00039,0.000146,-2e-04,-0.00039,-0.000417,-0.000593,5.4e-05,0.000314,0.000139,0.000147,-0.000562,-0.000574,-0.000465,5.6e-05,-0.000434,-0.000612,-0.000735,-0.000508,-0.000773,0.000403,-0.000406,-5.7e-05,0.000126,-0.00028,-0.000332,-0.000261,0.000737,0.000115,-0.000319,0.000312,4.1e-05,0.000334,0.000605,-0.000449,0.00039,0.000232,-0.000422,-3e-05,0.000171,0.000493,0.000478,-0.000488,1.1e-05,0.000606,0.000316,0.000164,0.000504,0.000767,0.001023,0.000267,-0.000591,-0.000453,0.000278,-0.001292,-0.000681,-0.000152,-4.9e-05,-0.000301,-0.000339,-0.000436,-3.8e-05,-0.000193,1.9e-05,-0.00048,-0.000795,-0.000511,-0.000336,-0.000762,0.000392,0.000211
-2.1e-05,5.9e-05,-0.000181,0.000244,-0.000119,-0.000159,-0.000239,-1.6e-05,-2.4e-05,0.000112,-0.000217,-0.000242,-9.6e-05,-0.000645,-0.000868,-7.4e-05,-0.000506,-0.000712,0.000313,-0.000248,3.5e-05,0.000233,-0.00045,-1e-04,6e-05,-0.000149,-8.6e-05,-0.00047,-0.000854,4.4e-05,-0.000302,-0.000113,-0.000801,-0.000906,-0.000715,-0.000107,-0.000606,-0.000469,-0.000736,-0.000345,-0.000513,-0.000297,-0.000249,-0.000197,-0.000494,-0.000158,0.000393,1.3e-05,-4.3e-05,0.000517,0.000449,0.000325,-0.000169,-0.000196,-2.7e-05,-0.00104,-0.000572,-0.000676,-0.000555,-0.000327,5.2e-05,-0.000273,-0.000355,0.000155,8.8e-05,-9.3e-05,-0.000304,0.000118,-0.001098,-0.000259,-0.000302,6e-05,-0.000202,0.000119,0.000631,6.5e-05,-2.4e-05,-0.000272,-0.000701,-4e-06,-0.000323,-0.000284,-0.000139,-0.000464,-0.000569,0.000172,0.000616,-0.000219,-0.000742,0.000234,0.000184,-0.00032,-0.00027,-0.000474,6e-05,-1e-04,3.4e-05,-0.001006,-0.000231,8.2e-05,-0.00033,-2.3e-05,0.000141,-0.000663,9.8e-05,0.000177,-0.000463,0.000103,0.000439,8e-06,-0.000268,0.000295,0.000171,0.000379,0.000327,-7.7e-05,-6.7e-05,0.00062,0.000778,-0.000671,2.5e-05
-0.000661,-0.000152,-2.5e-05,-5.4e-05,0.000235,-0.000261,-0.000194,-0.000248,0.00037,-9.4e-05,0.000119,-9.2e-05,-0.000251,-0.00056,-7.1e-05,-0.000169,-0.000718,-0.000136,2.1e-05,0.000249,0.000183,-0.000114,0.000249,-0.000213,-0.000133,0.000285,8.7e-05,9.7e-05,-0.000155,-0.000235,-0.000519,-0.00025,-0.000302,0.000107,0.000206,-0.000226,-0.000227,-0.000788,-0.001155,-0.000463,-0.000405,-0.000382,-0.000322,-0.000361,-0.000432,-0.000469,-0.000433,7.1e-05,-0.000178,-0.000139,-0.00014,0.000438,-1.4e-05,-7.7e-05,-8e-05,-0.000396,-0.000432,-0.000377,-0.000569,-0.00053,-0.000576,-0.000454,-0.000422,-0.000542,-0.00024,-5e-06,-0.000291,-0.000899,-0.001097,-0.000176,0.00099,-3.1e-05,0.000135,-0.000188,-0.00025,-0.000382,-0.000211,-0.000119,8e-06,-0.000305,9.2e-05,0.000247,-0.000373,-0.000253,-4.4e-05,-0.000628,-0.000409,-0.00011,0.000427,0.00025,-0.000231,1e-05,-0.000383,-0.000642,-0.000446,-0.000462,-0.000683,-0.000623,-2e-05,-0.000261,0.000192,-0.000126,5e-06,-0.000444,-0.000196,-0.000402,-7.9e-05,-3.3e-05,-0.000448,-0.000266,-0.000473,-0.000296,-0.000186,-0.000726,-8.7e-05,-0.00036,-0.000532,-0.000227,-0.000546,-0.00014,-0.000243
0.000104,0.000183,-0.000339,-9.2e-05,0.000191,0.000141,-0.000105,3.8e-05,-2e-06,-3.7e-05,-8.5e-05,0.000159,-0.00014,0.000127,-0.000144,-4.5e-05,7.4e-05,0.000259,-0.000352,-3.3e-05,0.000227,-0.000156,-1e-04,0.000207,0.000243,-0.000209,-9.9e-05,-0.000184,1.6e-05,-1.3e-05,9e-06,-0.000216,-0.000114,-0.000152,3.8e-05,-0.000435,-0.000206,-0.00022,0.00014,-0.000326,7.6e-05,-2.4e-05,0.000113,-0.000352,0.000251,0.000108,-0.000179,3.7e-05,-1e-06,-0.000121,9.7e-05,-8e-06,8.9e-05,-5.9e-05,-0.000138,-9.7e-05,-2.1e-05,-0.000391,-7.2e-05,0.000235,-0.000191,0.000326,8.1e-05,-3e-06,-0.000116,-7.3e-05,-0.000311,0.000324,0.000384,-3.3e-05,-0.00041,-0.000146,-7.1e-05,-0.000333,0.000552,-3.5e-05,-0.00021,0.000403,-0.000156,0.000171,0.000101,-0.000286,0.000529,-0.000288,0.000247,0.000313,-0.000422,0.000127,-0.000326,0.000182,7.8e-05,0.000149,0.000331,0.000321,0.000118,-0.000168,0.000164,0.000195,-0.000587,-0.000335,-1.7e-05,-5.1e-05,-0.000596,-1.5e-05,0.000276,0.000124,-5.1e-05,-0.000377,-7.4e-05,0.000116,0.000289,0.000146,-0.000178,-0.000308,0.000201,-5e-06,6.3e-05,-0.000236,-0.00017,9.2e-05,0.000217
0.000102,-0.000275,0.000196,0.00016,-9.2e-05,7.9e-05,-7e-05,9.1e-05,-0.000188,0.00012,-2.4e-05,-0.000445,-5.6e-05,-5.3e-05,6e-06,-6.5e-05,2.8e-05,-5.1e-05,-0.00023,-6.6e-05,0.000228,0.000159,-7.1e-05,-2.6e-05,-5.3e-05,2.7e-05,0.000162,1e-06,0.000415,-0.000218,-0.000183,-0.000687,-5.6e-05,-6.3e-05,-0.000329,-0.000136,0.000156,-9.9e-05,2.2e-05,1e-04,0.000303,-0.000474,-0.000103,-0.000192,0.000127,-0.000147,0.000207,0.000184,7.9e-05,-4.9e-05,-4e-06,-1.4e-05,1.1e-05,-0.000226,-1.6e-05,0.000155,0.000181,0.000246,-0.000255,-0.000285,-0.000302,-6.6e-05,0.000394,0.000169,-0.000226,-6e-05,4.8e-05,-3.2e-05,0.000179,-8e-05,-0.000241,-0.000278,0.000252,-0.000161,-5.3e-05,-0.000122,0.00034,-0.000544,0.000237,0.000136,3.9e-05,0.000195,-0.000105,2.8e-05,0.000146,5.6e-05,0.000142,0.000121,-0.000365,2.5e-05,-0.000384,-6.1e-05,-6e-06,4.9e-05,-0.000119,-0.000122,-1.7e-05,5.4e-05,5e-05,-5e-05,0.000175,-0.000129,-0.000493,6.5e-05,5.7e-05,0.000341,0.00047,0.000156,-5.6e-05,-0.000198,-0.000212,0.000356,0.000174,0.000133,-0.000605,-8.3e-05,-5.6e-05,0.000177,-2.1e-05,-8.3e-05,-0.000233
0.000245,4.7e-05,0.00019,8.5e-05,-0.000191,-3.2e-05,7.5e-05,-6.7e-05,-0.000123,-0.000201,-0.000213,0.000218,0.000257,0.000219,-8.5e-05,0.000243,0.000257,0.000116,-3e-04,-0.000299,-1.3e-05,0.000157,-2e-05,0.000188,8.5e-05,-8.3e-05,-2.8e-05,-9.4e-05,5e-06,-0.000488,0.000296,0.000422,5.5e-05,5.7e-05,0.000554,-0.000346,-0.000162,0.000151,6.3e-05,0.000168,-0.000125,0.000232,-7e-06,2.9e-05,-0.000307,0.000112,0.000406,-0.000178,-0.00021,-6.4e-05,-0.000114,7.6e-05,7.6e-05,0.000158,0.000217,0.000551,0.000196,-4.2e-05,0.000141,8.8e-05,0.000184,-0.00014,-0.000287,9.2e-05,-8e-06,-0.00013,-8.3e-05,0.000172,0.000187,-0.000194,-0.000148,-0.00023,-0.00054,-4e-05,-0.00051,-1.3e-05,0.000325,0.00018,-1.7e-05,-0.00023,-0.000426,-3.5e-05,0.000113,7.5e-05,-0.000342,-0.000495,5.6e-05,2.7e-05,0.000283,-0.000141,0.000312,0.000227,7.6e-05,-5.9e-05,-0.000119,0.000288,0.000258,0.000297,9.4e-05,0.000148,-0.000138,9e-06,0.000608,-0.000261,-0.000309,0.000273,-0.000147,-0.000179,3.3e-05,8.3e-05,0.000379,0.000173,-1.3e-05,0.000144,0.000123,0.000209,-3.7e-05,7e-06,4.4e-05,0.000155,0.000142
-0.000199,9.9e-05,-0.000117,9e-05,0.000202,-2.5e-05,-0.000186,3.4e-05,0.000205,0.000132,3.9e-05,-1.6e-05,-0.000237,-6.8e-05,2.9e-05,-3.5e-05,0.000242,-9.1e-05,-4.1e-05,0.000394,-2.8e-05,8.8e-05,0.000234,-1.8e-05,-0.000102,-7.8e-05,-9.5e-05,2.8e-05,-0.000116,-9.1e-05,-0.00028,0.000245,0.000317,0.000138,-0.000182,-4.4e-05,-0.000143,-0.000147,-0.000197,8.8e-05,0.000136,8.6e-05,-0.000107,-7.7e-05,4e-05,-9.6e-05,-2e-06,9e-06,6.9e-05,0.00035,6.1e-05,-0.00026,-1.8e-05,8e-06,-0.000164,6.8e-05,9.9e-05,0.000244,0.00024,0.000222,4.3e-05,4e-06,2.1e-05,0.000219,-0.000135,-6.2e-05,0.000178,8.7e-05,0.00016,0.000652,-0.000113,-0.000133,-2.5e-05,3.8e-05,0.000105,0.000166,-0.000176,-0.000194,-2.2e-05,0.000264,-4.3e-05,-2e-06,-0.000173,3e-05,3.9e-05,-8.1e-05,6.5e-05,-0.000361,7.4e-05,2e-05,-9.5e-05,-0.00025,-0.000169,0.000119,-0.000149,-0.000201,-2.1e-05,-4.9e-05,-0.000286,-5.6e-05,-0.000594,-0.000105,-4.3e-05,0.000235,0.000278,-0.000142,8e-06,-0.000101,-0.000128,0.000191,0.000101,-0.00034,-2.2e-05,-2.2e-05,4.8e-05,3.5e-05,-2.4e-05,0.00011,-1.9e-05,-1.1e-05,-0.000411
8.4e-05,8.5e-05,2.1e-05,8.4e-05,-0.000278,6e-06,7e-06,7.4e-05,-8.4e-05,6.2e-05,5.4e-05,0.000126,3e-06,-2.6e-05,0.000194,-1.5e-05,-1.4e-05,0.000236,0.000117,-2e-06,0.000151,-1.5e-05,1e-06,-3.9e-05,-1.2e-05,-5e-06,-0.000114,3.4e-05,6.6e-05,0.00022,0.000151,0.000117,-0.000248,-3e-05,-8.5e-05,0.000132,-5.9e-05,0.000213,0.000138,-6.9e-05,-9.9e-05,1.7e-05,0.000201,0.000175,0.000136,9.9e-05,-5.3e-05,-1.5e-05,4.5e-05,-3e-05,9.6e-05,0.00027,5.7e-05,0.000114,0.000198,-0.000101,-2.9e-05,0.000214,0.00013,-4.9e-05,-5.4e-05,-4e-05,0.000117,-0.000135,0.000138,8.9e-05,-7e-05,4.5e-05,-6.9e-05,0.000211,-0.000243,4.3e-05,0.00023,0.000179,0.000125,0.000107,-3e-06,-2.7e-05,5.7e-05,-0.000113,0.000247,0.000175,0.000202,0.000188,-5.6e-05,0.000136,-0.000204,0.000235,0.00017,8.6e-05,0.000113,-3.3e-05,6.6e-05,-4.9e-05,-0.000123,5.5e-05,1.7e-05,8.9e-05,-3.2e-05,4.7e-05,6.4e-05,8.2e-05,6.2e-05,0.00011,1.5e-05,0.000156,7.1e-05,-0.000119,8.3e-05,-1.3e-05,-7e-06,-0.000194,1e-06,6.5e-05,0.000309,7.1e-05,0.000238,-0.000246,8e-06,-0.000119,0.000237
-0.000127,-0.000103,-5.2e-05,1.9e-05,0.000119,-1.1e-05,0.000101,-2.2e-05,-6.3e-05,-0.000105,6.5e-05,-0.000129,0.000206,-7.4e-05,8.9e-05,2.8e-05,-0.000111,0.000124,7.3e-05,6e-06,-9.3e-05,-0.000117,7e-06,7.1e-05,-1e-06,-1.6e-05,0.000117,3.8e-05,-9e-06,0.000243,0.000112,3.7e-05,0.000272,5.3e-05,-4.3e-05,1e-05,9.4e-05,9.5e-05,-3.2e-05,1.4e-05,0.000139,0.000208,9.4e-05,0.000103,0.000105,6.7e-05,-0.000105,7.8e-05,4.3e-05,-3.4e-05,-1.6e-05,-0.000122,-0.000193,-0.000122,-6e-05,-0.000103,2.4e-05,-0.000102,5.9e-05,0.00014,0.000105,0.000114,-3.1e-05,-6.7e-05,9.8e-05,6.7e-05,-3.4e-05,0.000179,-0.000205,1.4e-05,0.000284,5.1e-05,-9.5e-05,7e-06,7.5e-05,-3e-05,0.000115,9.2e-05,-0.00021,-4.6e-05,0.000125,-8.7e-05,4.5e-05,4e-05,0.000203,9.8e-05,0.000145,-1.8e-05,0.000156,-0.00016,0.000157,-9.4e-05,-3.5e-05,8.7e-05,0.000166,-7.8e-05,-5.1e-05,-9.4e-05,0.000124,-9e-06,0.00016,8e-05,-7.3e-05,-3.7e-05,5.7e-05,1.2e-05,1.3e-05,0.000181,-3.2e-05,-0.000125,3.4e-05,-6.1e-05,0.000121,7.4e-05,-0.000158,-2e-04,-5.7e-05,0.000131,0.000124,-2.5e-05,-7.1e-05
4.4e-05,-3.7e-05,2.7e-05,-5.4e-05,-4e-05,-5.3e-05,2.5e-05,5.7e-05,8.2e-05,0.000113,-2e-06,9.5e-05,-2.2e-05,7.4e-05,-0.000112,-1e-05,-8e-06,-5.7e-05,7.9e-05,4e-05,5.2e-05,3.8e-05,-1.7e-05,-8.6e-05,-5.7e-05,-3e-05,-2.5e-05,5.8e-05,5.5e-05,8.3e-05,-0.000115,-0.000152,-6e-06,-3.2e-05,0.000109,0.000211,0.000179,-9.7e-05,6.3e-05,4.7e-05,-1.9e-05,-5.6e-05,-7.3e-05,-3.7e-05,8.1e-05,7.8e-05,-0.000108,-5.1e-05,1.8e-05,-1.9e-05,-8e-05,-8.4e-05,-3.5e-05,4e-05,5.3e-05,1.3e-05,6e-06,-2.9e-05,-0.000147,-4.9e-05,-9e-06,8.6e-05,-7e-06,9.5e-05,6.8e-05,1e-06,2e-05,-6.4e-05,7.8e-05,-0.000202,0,0.000275,8e-06,7.3e-05,-0.00024,-1e-04,6e-06,0.000189,0.000102,9.3e-05,-1.5e-05,-4.5e-05,-0.000199,-5.4e-05,7.3e-05,-4.1e-05,0.00014,7.8e-05,-7.8e-05,-0.000196,-0.00011,4.3e-05,5.8e-05,1e-06,4.4e-05,9e-05,1.7e-05,5.8e-05,0.000136,-5.5e-05,5.1e-05,5e-06,5.3e-05,4e-05,-2.8e-05,-0.000161,-4.4e-05,0.000142,3.7e-05,0.000148,-0.000127,-5.7e-05,3.4e-05,-0.000129,-0.000126,-2.1e-05,0.000124,-4.9e-05,1.6e-05,0.000125,6.2e-05
3e-06,3e-05,1.9e-05,6.2e-05,1e-06,1.6e-05,3.8e-05,-3.1e-05,8e-06,5e-06,-2.3e-05,-9.1e-05,-5.9e-05,2e-05,0,5.1e-05,2.5e-05,-7e-05,6.2e-05,3.1e-05,-2e-05,2.8e-05,-4e-05,9.6e-05,2.7e-05,8.1e-05,-1e-06,-5.9e-05,2.6e-05,-4.8e-05,9.2e-05,4.1e-05,0.000152,-2.4e-05,-0.000123,4.4e-05,3.7e-05,-5.9e-05,0.000113,-1.3e-05,3.8e-05,-8e-06,-6.4e-05,1.2e-05,-4.8e-05,-5.6e-05,-0.000155,-0.000136,-2.9e-05,2.6e-05,-1.9e-05,6.8e-05,-1.3e-05,-5.5e-05,-1.8e-05,-3.8e-05,-1.3e-05,-3.1e-05,0.000163,2.3e-05,-2e-06,-2.4e-05,3e-05,-6e-06,4.4e-05,5e-06,-4.1e-05,8.3e-05,-3.1e-05,-7e-06,-6.1e-05,-1.2e-05,2.4e-05,3.7e-05,-4.5e-05,-4e-06,2.7e-05,-6.1e-05,2e-06,-8.7e-05,-7.6e-05,-4.1e-05,0.000153,-4.7e-05,-2e-06,8e-05,-0.000104,-0.000118,1e-05,2.5e-05,5e-06,0.000123,-2.2e-05,-3.8e-05,1e-06,-2.4e-05,3.4e-05,3.1e-05,3.2e-05,-1.5e-05,-1.4e-05,3e-05,9.1e-05,0.000169,-1.2e-05,3.6e-05,3.2e-05,0.000102,2.5e-05,4.5e-05,0.000151,6.9e-05,-9e-06,4.6e-05,4.3e-05,7.5e-05,-6.1e-05,3.3e-05,2.8e-05,-1.6e-05,-4.2e-05
3.5e-05,1.7e-05,1.3e-05,-1.3e-05,-1.9e-05,3.2e-05,-3.6e-05,7e-06,1.1e-05,-2.3e-05,4e-05,4.1e-05,1.9e-05,-4.1e-05,-4.9e-05,-3.8e-05,5e-06,-3.2e-05,2.5e-05,-2.5e-05,-6e-06,-1.5e-05,-1.5e-05,-4.1e-05,-3e-06,-1.1e-05,2.3e-05,-1e-06,3.5e-05,-5e-06,4e-05,0.000108,-8.4e-05,1.2e-05,1.7e-05,-1.7e-05,-3e-06,2.8e-05,-3.1e-05,-3.3e-05,-5e-05,-4e-05,9.6e-05,2.7e-05,-3.1e-05,1.4e-05,1e-06,-4.7e-05,-5.3e-05,-2e-06,5.3e-05,-4.3e-05,2.5e-05,-4.2e-05,-3.7e-05,0.000165,4.8e-05,8.6e-05,-8e-05,-1.5e-05,-1.3e-05,-5e-05,1.6e-05,-2.3e-05,3.2e-05,-2.2e-05,-1.4e-05,-3.4e-05,8.1e-05,0.000103,5.8e-05,6e-05,-7.1e-05,-6.7e-05,6.1e-05,1.6e-05,9e-06,0,1e-06,6.4e-05,7.3e-05,5e-06,-5e-05,-8.3e-05,-0.000115,-2.7e-05,-4.8e-05,8.5e-05,-5.9e-05,1.3e-05,-8.2e-05,-4.5e-05,-2e-05,-1.5e-05,6.1e-05,1.2e-05,1.1e-05,7e-06,-4e-06,-4.6e-05,-8.1e-05,-1.7e-05,-0.000129,-0.000217,4.3e-05,-9e-06,2e-06,-5.5e-05,-3.6e-05,-4e-05,-4.8e-05,5.2e-05,-2e-05,-4.9e-05,6.5e-05,4.2e-05,-2e-05,-7.1e-05,-5.2e-05,7.6e-05,0.000125
4.2e-05,-6e-06,2.1e-05,-1.1e-05,5.7e-05,-3.4e-05,-3.7e-05,-1.9e-05,3.5e-05,2.7e-05,-1.4e-05,3.2e-05,3.2e-05,3e-05,3.3e-05,-1e-05,9e-06,3.2e-05,-2.4e-05,-2e-06,-2.6e-05,7e-06,1.4e-05,-9e-06,2.5e-05,-5e-06,-3.4e-05,0,-6.2e-05,-8e-06,2e-05,-7.1e-05,-4.1e-05,7e-06,6.7e-05,-3.2e-05,-5.4e-05,3.2e-05,-5.6e-05,1.5e-05,1.2e-05,-5.4e-05,-2.1e-05,-3.4e-05,-1.1e-05,3.1e-05,5.1e-05,4.9e-05,3.1e-05,-6.4e-05,-2.2e-05,2.9e-05,5.9e-05,6e-05,4.5e-05,2.3e-05,-3e-05,-4.1e-05,6.2e-05,1.6e-05,-1.8e-05,-8e-06,-3.7e-05,3.2e-05,-5.7e-05,1.9e-05,4.3e-05,1.4e-05,0.000113,2.5e-05,9.9e-05,-4.7e-05,2.4e-05,0,-5e-06,8e-06,1.2e-05,3.6e-05,9.5e-05,-1.1e-05,4e-06,-7e-06,-4.8e-05,2.8e-05,-4.9e-05,-1e-05,6.8e-05,-8.7e-05,-3.8e-05,-6.2e-05,5e-05,3.8e-05,-9e-06,3.7e-05,-2.9e-05,5.5e-05,1.2e-05,8e-06,4.9e-05,4e-06,1.6e-05,-1.9e-05,2.4e-05,1.5e-05,-1.2e-05,5.7e-05,-8e-06,-2.9e-05,2.6e-05,1.2e-05,-9e-06,2.5e-05,-2.8e-05,-4e-06,2.4e-05,2.1e-05,-6e-05,4.4e-05,2.5e-05,-1.9e-05,-0.000116
-2e-05,-2.9e-05,-3.4e-05,2.4e-05,-3.1e-05,-2e-06,-2.2e-05,2.6e-05,-1.3e-05,-2.5e-05,3.5e-05,-2.1e-05,2e-06,-2e-06,3.6e-05,3.7e-05,5.3e-05,5.9e-05,-1e-05,1.4e-05,-2e-05,-2e-06,-2e-06,1.6e-05,-3e-06,2.6e-05,-1e-06,-5e-06,1.2e-05,-2e-06,-1e-05,-2e-06,1.5e-05,1e-05,-5e-05,-6e-05,1.6e-05,2.7e-05,-1.4e-05,4.7e-05,-8e-06,2.3e-05,6e-06,1.7e-05,7.7e-05,-2e-05,2.9e-05,2.4e-05,-7e-06,-8e-06,-2.6e-05,-6.4e-05,2.2e-05,-1.1e-05,-5e-06,-1.6e-05,1.7e-05,7.4e-05,-8.9e-05,1.6e-05,-6e-06,2e-05,4e-06,3.2e-05,-8e-06,1e-05,0,2.2e-05,-0.000105,-8.7e-05,3.6e-05,-4.8e-05,1.9e-05,8e-06,6.7e-05,8e-06,-1.8e-05,-4e-05,-4.5e-05,-3.6e-05,2e-05,4.2e-05,5.7e-05,5e-06,5e-05,4.7e-05,1.9e-05,5.3e-05,4.5e-05,-2e-06,-7.9e-05,2.1e-05,-9e-06,2e-06,-8e-06,0,-1.2e-05,-7e-06,-7e-05,8e-06,8e-06,-9e-06,2.4e-05,7.7e-05,2.8e-05,-6.4e-05,-8e-06,-3.5e-05,-3.5e-05,1.6e-05,7.1e-05,-1.5e-05,-2e-06,3.4e-05,-0.000109,-2.2e-05,4.5e-05,3.2e-05,-9e-06,-4e-05,2e-05
-1.6e-05,6e-06,2e-06,-3.9e-05,2.4e-05,1.5e-05,3e-06,-4e-06,-7e-06,2.2e-05,-2.9e-05,3.2e-05,-3.2e-05,-5.4e-05,-8e-06,-5e-06,-3.9e-05,-7e-06,-3.5e-05,-1e-05,-1.2e-05,2.1e-05,3e-06,-3.1e-05,1e-06,-1e-05,-4e-06,3e-06,1.2e-05,-2.5e-05,-1.4e-05,6.7e-05,3.7e-05,-9e-06,5.3e-05,-9e-06,1e-05,7e-06,2.8e-05,-4.2e-05,3.4e-05,6.1e-05,-1.2e-05,2.7e-05,2.4e-05,3.9e-05,-3.6e-05,4e-06,5e-06,4.6e-05,1.2e-05,2.1e-05,-5.1e-05,2.8e-05,-1.9e-05,-4.9e-05,-1e-05,-3.5e-05,0.000113,3e-06,3e-06,2e-05,3.9e-05,-2.1e-05,-3.5e-05,-6e-06,-7e-06,-1.4e-05,2e-06,7e-06,-2.3e-05,-1.6e-05,4.5e-05,8e-06,-5.5e-05,8e-06,-4.3e-05,-1.3e-05,-4e-06,3.3e-05,-4.3e-05,-2.1e-05,-5e-06,2.1e-05,3e-05,-1e-05,-7.7e-05,8e-06,5.8e-05,5.3e-05,2.5e-05,-7.5e-05,1.8e-05,4e-06,-2e-06,-9e-06,1.1e-05,7e-06,-2.7e-05,3.4e-05,5.8e-05,8e-06,4e-05,-7e-06,-2.4e-05,-2.9e-05,3e-06,-3.2e-05,3e-05,-9e-06,-7e-05,1.3e-05,-3e-05,4e-06,3e-05,-2.7e-05,2e-06,-1.6e-05,-1.4e-05,-1.1e-05,1e-05
-2.6e-05,1.2e-05,-2.6e-05,1.1e-05,-1e-06,-1.2e-05,2.9e-05,6e-06,3.4e-05,-1.4e-05,3e-06,-2.1e-05,1.7e-05,2.6e-05,-1.4e-05,-7e-06,-2.7e-05,-3.3e-05,-3e-06,1.6e-05,-1.4e-05,-2.1e-05,3e-06,1.9e-05,5e-06,2e-06,8e-06,9e-06,2.1e-05,-2.5e-05,8e-06,1.9e-05,2e-06,-1.2e-05,-3.5e-05,-1.6e-05,4.6e-05,0,4e-06,-3e-06,-1.2e-05,2e-05,3.8e-05,-4e-06,-3.8e-05,-3e-06,-1.5e-05,-2e-05,-4e-06,8e-06,6e-06,3e-05,1.1e-05,-2.1e-05,3.6e-05,-3.3e-05,-1.4e-05,3e-06,-2.2e-05,1.5e-05,-2e-06,-4e-06,-2.2e-05,-8e-06,2e-06,-1.2e-05,-1.7e-05,2.8e-05,-2.5e-05,3.2e-05,-4.1e-05,-2.5e-05,-5.7e-05,5e-06,-1.8e-05,1e-06,1e-05,2.3e-05,4e-06,-2.9e-05,-3.2e-05,9e-06,-3.2e-05,6.5e-05,2.9e-05,-3.5e-05,1.4e-05,-8e-06,-2.8e-05,2.1e-05,1.9e-05,1.9e-05,-5e-06,1.2e-05,-1.7e-05,-1.6e-05,-7e-06,-2.5e-05,1e-05,1.2e-05,2.3e-05,7e-06,-7e-06,4e-06,-9e-06,4e-05,1.4e-05,-2e-06,-2.4e-05,5e-06,2.9e-05,5.9e-05,3.7e-05,2.7e-05,3.2e-05,-7e-06,3.6e-05,-1.5e-05,2.7e-05,1.9e-05,-2e-05
9e-06,2e-06,1.6e-05,-1.9e-05,3e-06,-1.1e-05,1.8e-05,-2e-06,-9e-06,5e-06,-2e-06,2.2e-05,4.3e-05,1.2e-05,5e-06,4e-06,6e-06,-2.4e-05,1.7e-05,0,-1.3e-05,-2.3e-05,-1.6e-05,-1.3e-05,-1e-06,-5e-06,2.9e-05,-7e-06,1e-05,1.7e-05,-2e-06,-8e-06,1.4e-05,1.1e-05,7e-06,5.2e-05,-6e-06,1.2e-05,5.3e-05,1.2e-05,3e-06,1.3e-05,-3.1e-05,1.2e-05,-1e-06,1e-05,-1e-06,-1.2e-05,9e-06,-2.4e-05,-1e-05,-2.4e-05,-6e-06,1e-05,-3e-05,-2e-06,1.9e-05,-3.1e-05,1.5e-05,-9e-06,7e-06,-1.6e-05,-1e-05,1.9e-05,2.9e-05,4e-06,-2e-06,-2.3e-05,-2.9e-05,2.8e-05,1.5e-05,6e-06,3e-05,2.3e-05,2.7e-05,-5e-06,2.8e-05,-5e-05,-2.8e-05,1.3e-05,-8e-06,-6e-06,1.5e-05,-3.7e-05,-2.3e-05,7e-06,5.7e-05,-1e-06,2.2e-05,2.7e-05,-6e-06,2e-06,5e-06,-9e-06,-8e-06,2.3e-05,4e-06,2e-05,-1.6e-05,2.3e-05,-5.4e-05,-1e-06,-1.2e-05,4.8e-05,2.5e-05,-6.7e-05,-1.8e-05,1.8e-05,1.9e-05,3e-06,-1.9e-05,2.2e-05,-3e-05,-5e-06,2.9e-05,6e-06,-4e-06,2.2e-05,6e-06,6e-06,-4e-06
-5e-06,-1.4e-05,3.7e-05,-9e-06,-1.4e-05,1.8e-05,-9e-06,-6e-06,-2.2e-05,8e-06,9e-06,-2.9e-05,-4.3e-05,-1.1e-05,-1.1e-05,1e-06,-1.9e-05,-3e-06,7e-06,-1.3e-05,-1.2e-05,1.8e-05,-8e-06,5e-06,4e-06,-1e-06,-3.2e-05,4e-06,-1.1e-05,4e-05,8e-06,-4e-05,-2.3e-05,-2e-06,9e-06,4e-05,-1.6e-05,-2.6e-05,3e-06,1.7e-05,-1e-05,-6e-06,2.6e-05,8e-06,-2e-06,0,-1.6e-05,1e-05,-6e-06,-1.9e-05,1e-06,2.2e-05,2.1e-05,-6e-06,1.7e-05,4.2e-05,-2.1e-05,1.2e-05,-3e-05,-1e-06,4e-06,-1e-06,2e-05,-9e-06,2.1e-05,9e-06,2e-06,9e-06,6e-05,-4.5e-05,0,3.2e-05,3.3e-05,5e-06,6.3e-05,-4e-06,-1.5e-05,4.3e-05,4e-05,6e-06,4.5e-05,-9e-06,1.4e-05,-3e-06,-3.6e-05,6e-06,-1.7e-05,-1.3e-05,-2.1e-05,2.6e-05,1.6e-05,-2.9e-05,-9e-06,-1.4e-05,3e-06,-8e-06,7e-06,-1e-06,3e-05,-1.3e-05,-1e-05,2e-06,-3e-06,-3.8e-05,-6e-06,4e-06,1.4e-05,1.6e-05,-7e-06,-1.3e-05,-7e-06,1e-06,1.1e-05,-2e-05,-2.8e-05,1e-05,3e-06,1e-06,7e-06,1.8e-05,-1e-06
1.3e-05,-6e-06,-2.1e-05,-3e-06,1.7e-05,-4e-06,-1.1e-05,1.1e-05,2.6e-05,-1.5e-05,8e-06,2.6e-05,-8e-06,0,1.8e-05,7e-06,2.3e-05,3.1e-05,1.8e-05,4e-06,-7e-06,1.5e-05,0,-1e-05,-3e-06,1e-06,0,2e-06,-2e-06,3e-05,2.3e-05,-1.2e-05,1.4e-05,4e-06,1.3e-05,1.3e-05,-1.4e-05,2.4e-05,-2.9e-05,-3.4e-05,-3e-06,-3.4e-05,-4e-06,-1e-05,2.1e-05,1.2e-05,2.3e-05,2.3e-05,5e-06,1.2e-05,7e-06,-2e-06,-8e-06,-1.2e-05,-2e-06,3.3e-05,1.3e-05,-1.4e-05,-3e-06,6e-06,-7e-06,-2e-06,-1e-06,9e-06,2e-05,1.1e-05,-7e-06,2e-06,2e-05,-5.2e-05,-1.8e-05,1.9e-05,-5.4e-05,4e-06,-1.2e-05,-5e-06,-1.9e-05,-8e-06,-1.1e-05,-8e-06,1.2e-05,0,-1.9e-05,-1.7e-05,1.2e-05,-3e-06,-3.3e-05,1.2e-05,-7e-06,1e-05,-1.9e-05,2e-05,-3e-06,1.3e-05,5e-06,9e-06,1e-06,2e-06,-2e-06,-7e-06,5e-06,2e-06,2.3e-05,-3.7e-05,8e-06,1.9e-05,-9e-06,1e-05,4e-06,1.6e-05,1.7e-05,-1.3e-05,-5e-06,-6e-06,-3.2e-05,2.1e-05,-1.4e-05,1e-06,3e-06,1.1e-05,2.3e-05
5e-06,1.2e-05,-2e-06,-1e-05,-2.1e-05,-7e-06,-5e-06,-7e-06,-3e-06,1.5e-05,-6e-06,-1.9e-05,3.7e-05,2e-06,-1e-05,-1e-05,8e-06,1e-06,4e-06,4e-06,-1e-05,-3e-06,-4e-06,-5e-06,4e-06,0,-1e-06,-5e-06,-6e-06,-8e-06,-2e-05,4.6e-05,-8e-06,-8e-06,-2.9e-05,2.1e-05,2.3e-05,1e-06,-2.4e-05,1.3e-05,1.2e-05,-5e-06,4e-06,4e-06,1.3e-05,0,3.6e-05,8e-06,-2e-06,1.8e-05,-7e-06,1e-06,1.7e-05,1.7e-05,-1.4e-05,-3e-06,0,8e-06,0,-1.1e-05,-6e-06,1.9e-05,-9e-06,1.4e-05,4e-06,-7e-06,-1e-06,-7e-06,-6e-06,1.2e-05,2e-06,2.2e-05,4.7e-05,-9e-06,-6.3e-05,1e-06,-4e-06,1e-06,9e-06,1e-05,-1e-06,7e-06,-2e-06,-2.8e-05,1.8e-05,8e-06,1.2e-05,-5e-06,1e-06,9e-06,0,-2e-05,0,8e-06,1e-05,0,1e-06,-9e-06,1.9e-05,-2.1e-05,7e-06,-2e-06,-2.8e-05,3.1e-05,-1.7e-05,-2.2e-05,0,9e-06,0,3e-06,-7e-06,-3.1e-05,-1e-06,-8e-06,2.5e-05,-2e-06,-8e-06,-9e-06,-6e-06,-3.4e-05,-1.2e-05
-5e-06,4e-06,-1.1e-05,0,5e-06,3e-06,2e-06,5e-06,-1.7e-05,-9e-06,4e-06,2e-05,-1.3e-05,-1.8e-05,-8e-06,4e-06,-3e-06,-3.6e-05,2e-06,-9e-06,2e-06,-1.6e-05,-5e-06,5e-06,-3e-06,-4e-06,6e-06,-1e-06,9e-06,-2.1e-05,5e-06,1.2e-05,-6e-06,1e-06,2.2e-05,-2.6e-05,1.3e-05,4e-06,3.1e-05,1.3e-05,2e-06,-8e-06,-2.1e-05,3e-06,-1.1e-05,3e-06,3.1e-05,-2.3e-05,-2e-06,-1.5e-05,-2e-06,1.3e-05,-1.3e-05,-1.5e-05,1.8e-05,-2.8e-05,-1.5e-05,2.6e-05,5e-06,1.1e-05,-1e-06,-1e-06,8e-06,-1.8e-05,-4e-06,-7e-06,-1e-06,6e-06,-2.4e-05,3.8e-05,5e-06,1.7e-05,-4e-06,5e-06,6e-06,4e-06,-5e-06,1.8e-05,2e-06,-6e-06,-2.4e-05,-3e-06,2.2e-05,1.4e-05,2.9e-05,1.2e-05,3e-05,2e-05,-8e-06,1.3e-05,-9e-06,6e-06,5e-06,-9e-06,4e-06,4e-06,-2e-06,0,5e-06,-4e-06,1.2e-05,1e-06,-1e-06,-4e-06,-1e-06,-1e-06,-2e-06,1.6e-05,-2e-06,-1.5e-05,2e-06,-3.4e-05,1e-06,-4e-06,1e-05,-1.2e-05,3e-06,1.6e-05,-2e-06,2e-06,2.3e-05
-1.2e-05,-6e-06,-6e-06,-1e-05,-2e-06,6e-06,6e-06,-2e-06,1.9e-05,-3e-06,-7e-06,-9e-06,-1.5e-05,3e-06,9e-06,5e-06,-1.4e-05,-9e-06,-1e-06,-1e-06,-9e-06,3e-06,5e-06,-7e-06,1e-06,8e-06,4e-06,3e-06,9e-06,-8e-06,3e-06,-2.6e-05,9e-06,-2e-06,5e-06,-2.5e-05,1e-06,1.2e-05,7e-06,-9e-06,-3e-06,6e-06,2.2e-05,-4e-06,-1.6e-05,6e-06,-1.7e-05,-1.2e-05,-5e-06,-1e-05,9e-06,5e-06,-3e-06,1.5e-05,-1.4e-05,-1.9e-05,1.2e-05,-1.9e-05,1.6e-05,-3e-06,-5e-06,-3e-06,7e-06,7e-06,-2.2e-05,1e-06,0,-1.1e-05,-1.6e-05,-5e-06,9e-06,-3e-05,-2.6e-05,-9e-06,3.2e-05,4e-06,-8e-06,7e-06,-2.1e-05,2e-06,8e-06,9e-06,-1.9e-05,7e-06,-2.5e-05,-5e-06,-2.1e-05,-3.5e-05,-3e-06,-1.1e-05,-2e-06,1.4e-05,-5e-06,9e-06,9e-06,-4e-06,0,1e-06,0,-1e-06,-9e-06,1e-06,1.9e-05,-1.7e-05,1e-05,-2e-06,5e-06,-1.1e-05,-4e-06,4e-06,-3e-06,-7e-06,-3e-06,1.7e-05,1.3e-05,-1e-05,-2e-06,3e-06,-1e-06,3e-06,-1.7e-05
3e-06,-7e-06,1e-05,5e-06,-2e-06,-9e-06,1e-06,0,-2e-06,9e-06,7e-06,7e-06,1.1e-05,1e-05,-3e-06,0,-7e-06,7e-06,-1e-05,2e-06,4e-06,1.3e-05,-5e-06,6e-06,-1e-06,-3e-06,0,-5e-06,2e-06,5e-06,-9e-06,2e-06,0,4e-06,-2.3e-05,-1.9e-05,-5e-06,-6e-06,8e-06,-9e-06,-3e-06,2.3e-05,1e-06,4e-06,-3e-06,-1e-06,-1e-05,1e-05,5e-06,9e-06,-3e-06,-1.2e-05,-8e-06,-9e-06,6e-06,-1.1e-05,-1.2e-05,-2e-06,-1.2e-05,0,0,-8e-06,-1.3e-05,7e-06,-8e-06,6e-06,-3e-06,8e-06,-1e-05,-3.5e-05,7e-06,9e-06,3.3e-05,1e-06,9e-06,-3e-06,1e-06,-2.9e-05,1.4e-05,-1e-06,2e-06,-1e-06,3e-06,1.6e-05,-2.3e-05,-5e-06,-1.9e-05,2.6e-05,2.1e-05,-2.6e-05,3e-06,-1.6e-05,3e-06,-2e-06,-1e-05,-3e-06,0,-6e-06,-1.6e-05,8e-06,-8e-06,-5e-06,-4e-06,2.8e-05,0,3e-06,-7e-06,-1.2e-05,-2e-06,1.1e-05,-6e-06,1.2e-05,-3e-06,8e-06,-3.7e-05,-5e-06,1.2e-05,-7e-06,-6e-06,1e-05,1.7e-05
-2e-06,4e-06,1.2e-05,-7e-06,-1e-06,4e-06,-9e-06,2e-06,-1.3e-05,-9e-06,-6e-06,-3e-06,6e-06,-7e-06,2e-06,-6e-06,2e-06,1.4e-05,-3e-06,1e-06,-3e-06,-5e-06,-5e-06,-9e-06,0,1e-06,-1e-06,4e-06,-4e-06,0,1.1e-05,1.4e-05,-1.1e-05,-5e-06,2.2e-05,-9e-06,-1.1e-05,3e-06,1.1e-05,9e-06,-7e-06,9e-06,-4e-06,6e-06,2.2e-05,8e-06,-1.1e-05,1.2e-05,-2e-06,1.3e-05,-7e-06,4e-06,2e-06,5e-06,5e-06,1.6e-05,3e-06,-1.7e-05,1.1e-05,2e-06,0,1e-06,-2e-06,-1.2e-05,-1.2e-05,2e-06,-5e-06,-3e-06,1e-05,-1.5e-05,3e-06,-3.4e-05,-1e-05,4e-06,-2.2e-05,-1e-06,8e-06,1.6e-05,-5e-06,-3e-06,6e-06,-5e-06,4e-06,1.3e-05,0,8e-06,2.6e-05,-1.6e-05,-5e-06,-1e-05,6e-06,2.5e-05,-6e-06,-7e-06,1e-06,5e-06,4e-06,5e-06,9e-06,1e-05,3e-06,1e-06,1.1e-05,5e-06,2e-06,3e-06,4e-06,-1.6e-05,3e-06,-7e-06,-6e-06,2e-06,8e-06,-1e-06,-1e-06,1.3e-05,-2e-06,-1e-06,6e-06,8e-06,-3.8e-05
2e-06,4e-06,1e-06,5e-06,5e-06,5e-06,2e-06,-2e-06,1.5e-05,3e-06,4e-06,-7e-06,0,1e-06,1e-06,4e-06,-3e-06,2e-06,-3e-06,-5e-06,3e-06,-1.1e-05,0,4e-06,0,2e-06,-1e-05,1e-06,1e-06,-4e-06,-2e-06,4e-06,8e-06,1e-06,-8e-06,1.5e-05,2e-06,-2e-06,-1.7e-05,3e-06,6e-06,0,-8e-06,-6e-06,3e-06,-3e-06,-3e-06,-3e-06,1e-06,-2e-06,5e-06,-6e-06,2e-06,-6e-06,-9e-06,2.1e-05,6e-06,2e-05,-1.9e-05,-5e-06,-1e-06,3e-06,1.2e-05,8e-06,1.1e-05,-3e-06,3e-06,-3e-06,2.8e-05,2.6e-05,-2e-06,6e-06,-6e-06,1e-06,-1.6e-05,-2e-06,-2e-06,2e-06,2e-06,2e-06,-1.9e-05,1e-06,5e-06,-1.2e-05,1.4e-05,-6e-06,9e-06,1.6e-05,0,-5e-06,9e-06,-4e-06,1e-06,6e-06,-8e-06,-1e-06,-3e-06,0,-1.5e-05,5e-06,6e-06,3e-06,-1.6e-05,-2.6e-05,-1.2e-05,-1.2e-05,-4e-06,-6e-06,-4e-06,-4e-06,1.3e-05,-4e-06,-1.2e-05,3e-06,2.1e-05,1e-05,6e-06,9e-06,2e-06,1e-06,2.1e-05
7e-06,-1e-06,-9e-06,1e-06,-3e-06,-3e-06,-2e-06,1e-06,-1e-06,0,-5e-06,1e-05,-1.1e-05,-1e-06,-7e-06,2e-06,1e-05,-1.9e-05,2e-06,5e-06,1e-06,4e-06,-2e-06,-3e-06,0,0,4e-06,-3e-06,-1e-06,-2e-06,-3e-06,-1.3e-05,-1e-05,-3e-06,0,1.8e-05,3e-06,-1e-06,-1.2e-05,-8e-06,-2e-06,-6e-06,1.2e-05,3e-06,-9e-06,1e-06,-6e-06,-1.2e-05,0,-1.4e-05,2e-06,8e-06,1e-05,2e-06,8e-06,4e-06,-9e-06,-2e-05,3e-06,3e-06,0,1e-06,-4e-06,4e-06,5e-06,-4e-06,-1e-06,3e-06,-1.5e-05,1.2e-05,3e-06,-3e-06,1.4e-05,2e-06,-7e-06,-1e-06,-1.1e-05,-2.4e-05,1.2e-05,-3e-06,-4e-06,-4e-06,-1.3e-05,-1e-06,2.1e-05,-6e-06,-2.3e-05,-1.1e-05,-4e-06,-1.7e-05,-6e-06,-1.6e-05,0,2e-06,0,1e-06,1e-06,1e-06,7e-06,1e-06,4e-06,-1e-06,1e-06,1.3e-05,3e-06,2e-05,2e-06,5e-06,9e-06,5e-06,-9e-06,8e-06,1.3e-05,-1e-05,1.1e-05,-1e-06,-8e-06,0,-1e-06,-1.3e-05,-1.3e-05
-3e-06,-4e-06,-5e-06,-3e-06,3e-06,-4e-06,1e-05,0,-1.4e-05,-3e-06,4e-06,-9e-06,3e-06,-8e-06,5e-06,-1e-06,3e-06,-1.3e-05,4e-06,-3e-06,2e-06,1.1e-05,-5e-06,-1e-06,1e-06,-1e-06,3e-06,1e-06,3e-06,8e-06,3e-06,-1.5e-05,1e-05,2e-06,2e-06,1.9e-05,1.3e-05,4e-06,1.3e-05,3e-06,5e-06,-1.3e-05,-4e-06,0,-7e-06,1e-06,8e-06,-9e-06,2e-06,2e-06,-4e-06,-6e-06,-2e-06,4e-06,-3e-06,-1.2e-05,7e-06,2.5e-05,-1.3e-05,-4e-06,-2e-06,-1e-06,-5e-06,-7e-06,1.4e-05,2e-06,-3e-06,-6e-06,2e-06,-2e-05,-8e-06,8e-06,-1e-05,1e-06,3e-05,1e-06,-1e-06,2e-05,-1.4e-05,1e-06,-1e-06,0,4e-06,-1.4e-05,0,4e-06,-4e-06,8e-06,-6e-06,-1.4e-05,9e-06,2e-05,-2e-06,-4e-06,0,0,0,-5e-06,-6e-06,-7e-06,-1e-06,0,7e-06,5e-06,6e-06,-1e-06,-2e-06,6e-06,-6e-06,-2e-06,6e-06,1.5e-05,-6e-06,-8e-06,-1.1e-05,-5e-06,2e-06,-1e-06,4e-06,-3e-06,7e-06
-2e-06,0,-5e-06,9e-06,2e-06,6e-06,3e-06,-1e-06,1.4e-05,4e-06,0,9e-06,1.5e-05,1e-06,-1e-06,-2e-06,-1e-05,9e-06,2e-06,0,3e-06,-4e-06,1e-06,4e-06,1e-06,1e-06,4e-06,1e-06,2e-06,9e-06,-2e-06,1.4e-05,-5e-06,-1e-06,1e-06,8e-06,-7e-06,1e-06,1.9e-05,0,-3e-06,-9e-06,-1e-06,-5e-06,-2e-06,2e-06,5e-06,5e-06,-2e-06,1e-05,-1e-06,-1.7e-05,-2e-06,-5e-06,-4e-06,-1.1e-05,-3e-06,-1.2e-05,1.5e-05,3e-06,-2e-06,-1e-06,4e-06,1e-06,4e-06,4e-06,-1e-06,6e-06,-5e-06,-1.8e-05,2e-06,9e-06,9e-06,-1e-06,1.3e-05,0,8e-06,-2e-06,6e-06,0,1.8e-05,4e-06,1.5e-05,-8e-06,-2.1e-05,-1e-06,2.2e-05,-1.3e-05,1e-06,4e-06,-9e-06,-1.6e-05,3e-06,3e-06,0,2e-06,0,3e-06,1.2e-05,-3e-06,-2e-06,0,-8e-06,-1.7e-05,0,-1e-05,2e-06,1.2e-05,7e-06,-2e-06,-1e-06,9e-06,1e-06,2e-06,-2.1e-05,-7e-06,-8e-06,-1e-06,-4e-06,1e-06,-6e-06
-3e-06,4e-06,5e-06,-4e-06,-1e-06,1e-06,-3e-06,-2e-06,0,-5e-06,1e-06,-8e-06,-1.2e-05,5e-06,0,1e-06,3e-06,1.4e-05,2e-06,0,2e-06,-1.1e-05,0,-6e-06,0,-1e-06,-2e-06,-2e-06,-1e-06,2e-06,-2e-06,1.6e-05,-1e-06,0,-8e-06,-8e-06,-3e-06,0,-7e-06,3e-06,-1e-06,3e-06,0,2e-06,1e-05,-1e-06,-1.1e-05,9e-06,1e-06,0,4e-06,1.6e-05,-6e-06,7e-06,8e-06,-7e-06,-2e-06,7e-06,2e-06,-1e-06,-1e-06,1e-06,1e-06,2e-06,-1e-06,0,-2e-06,-4e-06,-2.5e-05,9e-06,-3e-06,1e-05,-4e-06,-3e-06,-1.9e-05,2e-06,1e-06,-1e-05,-4e-06,1e-06,-2e-06,0,-2.1e-05,8e-06,-1.9e-05,-1e-06,-1e-06,1e-05,4e-06,6e-06,-3e-06,-3e-06,-2e-06,0,2e-06,-3e-06,0,1e-06,-6e-06,-6e-06,-2e-06,1e-06,-2e-06,6e-06,-2e-06,1.5e-05,0,2e-06,-5e-06,1e-06,-9e-06,8e-06,2e-06,-1e-06,1.4e-05,-1e-06,5e-06,7e-06,1e-06,1e-06,1.5e-05
1e-06,0,1.2e-05,5e-06,0,-3e-06,-7e-06,3e-06,-1.2e-05,3e-06,0,1e-05,-6e-06,-3e-06,3e-06,2e-06,-5e-06,2e-06,0,1e-06,2e-06,1e-06,-3e-06,6e-06,1e-06,0,-7e-06,2e-06,-1e-06,-7e-06,4e-06,-1.1e-05,-1e-06,-1e-06,1.2e-05,-1.2e-05,-4e-06,3e-06,1e-06,-2e-06,0,4e-06,2e-06,0,4e-06,2e-06,-1.2e-05,2e-06,0,-7e-06,-1e-06,-8e-06,2e-06,-6e-06,-9e-06,3e-06,5e-06,-1.4e-05,8e-06,-1e-06,-1e-06,2e-06,-4e-06,-1e-06,-8e-06,-2e-06,0,0,2.6e-05,2e-05,-2e-06,-4e-06,4e-06,1e-06,-1.9e-05,-1e-06,-2e-06,1.3e-05,-4e-06,-1e-06,1e-06,0,8e-06,4e-06,1.1e-05,2e-06,-1.9e-05,-1e-06,-4e-06,7e-06,4e-06,1.3e-05,-1e-06,-3e-06,3e-06,-1e-06,0,-2e-06,7e-06,4e-06,-1e-06,0,9e-06,1.3e-05,-7e-06,-6e-06,-2e-06,0,2e-06,-1e-06,1.1e-05,5e-06,-3e-06,6e-06,1e-05,5e-06,-2e-06,1e-06,0,1e-05,-7e-06
1e-06,-2e-06,-2e-06,2e-06,0,1e-06,-3e-06,1e-06,1e-05,0,-1e-06,-1e-05,1.2e-05,-1e-06,-5e-06,-1e-06,-2e-06,-1.3e-05,-1e-06,-3e-06,0,1.1e-05,-2e-06,-4e-06,-1e-06,0,3e-06,0,0,-7e-06,-1e-06,-1.3e-05,2e-06,0,-4e-06,-1.9e-05,6e-06,-4e-06,-6e-06,-2e-06,-2e-06,1e-05,-3e-06,-2e-06,-4e-06,-1e-06,-2e-06,-9e-06,0,-4e-06,-2e-06,3e-06,0,6e-06,7e-06,1.4e-05,-4e-06,7e-06,-1.2e-05,2e-06,-1e-06,1e-06,2e-06,-3e-06,-1e-05,-2e-06,-2e-06,1e-06,2e-06,-1e-06,-2e-06,6e-06,-3e-06,-1e-06,6e-06,1e-06,2e-06,2e-06,8e-06,2e-06,-9e-06,1e-06,9e-06,1e-05,1.9e-05,3e-06,7e-06,-2e-06,5e-06,1e-05,-7e-06,-1.6e-05,1e-06,1e-06,-2e-06,1e-06,0,1e-06,-4e-06,2e-06,3e-06,-1e-06,-6e-06,-1.3e-05,4e-06,3e-06,1e-06,-3e-06,-2e-06,1e-06,-1e-05,-7e-06,2e-06,7e-06,2e-06,3e-06,5e-06,-3e-06,-4e-06,-1e-06,3e-06
2e-06,-1e-06,-4e-06,-1e-06,-1e-06,2e-06,1e-06,-3e-06,2e-06,-3e-06,1e-06,6e-06,-1e-06,1e-06,1e-06,-2e-06,5e-06,-1.1e-05,-1e-06,0,2e-06,-2e-06,-1e-06,1e-06,0,0,-1e-06,-2e-06,1e-06,0,-1e-06,7e-06,-2e-06,0,-8e-06,-8e-06,1e-06,1e-06,-4e-06,3e-06,3e-06,7e-06,1e-06,1e-06,-8e-06,-1e-06,5e-06,-7e-06,-1e-06,6e-06,2e-06,-2e-06,5e-06,-6e-06,-2e-06,5e-06,3e-06,-4e-06,1e-06,-4e-06,0,-2e-06,4e-06,4e-06,-4e-06,1e-06,-2e-06,-3e-06,-8e-06,-1.9e-05,6e-06,-1e-05,2e-06,0,3.5e-05,-1e-06,3e-06,-1.3e-05,-4e-06,-1e-06,7e-06,-4e-06,-9e-06,7e-06,4e-06,-3e-06,1.5e-05,5e-06,-1e-06,1.2e-05,9e-06,1.1e-05,-1e-06,2e-06,3e-06,1e-06,0,1e-06,6e-06,6e-06,0,0,8e-06,2e-06,4e-06,0,0,-5e-06,0,3e-06,7e-06,-1.5e-05,0,-2e-06,-1.7e-05,2e-06,-2e-06,1e-06,4e-06,-6e-06,4e-06
-1e-06,2e-06,-5e-06,3e-06,-1e-06,-1e-06,6e-06,2e-06,-1.1e-05,6e-06,-1e-06,-2e-06,-4e-06,-4e-06,2e-06,3e-06,3e-06,6e-06,-1e-06,0,-1e-06,-1e-05,-2e-06,2e-06,-1e-06,0,3e-06,1e-06,2e-06,3e-06,2e-06,1e-05,2e-06,0,1.2e-05,4e-06,1e-06,0,6e-06,4e-06,-4e-06,-3e-06,4e-06,0,0,1e-06,-1e-06,4e-06,0,6e-06,0,-3e-06,0,4e-06,-4e-06,-3e-06,1e-06,0,-1e-05,3e-06,-1e-06,-2e-06,-3e-06,0,-1e-06,2e-06,1e-06,5e-06,1.6e-05,-6e-06,-1e-06,-5e-06,3e-06,-1e-06,-1.3e-05,0,-3e-06,1.4e-05,2e-06,-2e-06,-4e-06,1e-06,-3e-06,-4e-06,-1.1e-05,0,-1.1e-05,-6e-06,1e-06,9e-06,-5e-06,0,0,-3e-06,-2e-06,0,0,0,-9e-06,0,-2e-06,0,-7e-06,1e-05,0,-2e-06,0,0,0,-2e-06,-1e-06,-1.1e-05,-3e-06,1e-06,-3e-06,-1e-06,1e-06,3e-06,-1e-06,-4e-06,-6e-06
0,1e-06,-5e-06,0,1e-06,-1e-06,5e-06,1e-06,8e-06,-6e-06,1e-06,-1e-06,-1e-06,-1e-06,-2e-06,0,1e-06,1.2e-05,0,-2e-06,1e-06,1e-06,-1e-06,-3e-06,1e-06,1e-06,2e-06,0,0,2e-06,-2e-06,-2e-06,-1e-06,0,-6e-06,1e-05,-2e-06,-1e-06,1.4e-05,-7e-06,3e-06,-5e-06,-3e-06,-1e-06,9e-06,-2e-06,4e-06,9e-06,1e-06,-6e-06,-1e-06,9e-06,0,-2e-06,6e-06,-4e-06,-2e-06,1.1e-05,8e-06,-2e-06,-1e-06,0,-3e-06,-5e-06,8e-06,0,-1e-06,-5e-06,-1.7e-05,1.5e-05,3e-06,2e-06,-5e-06,3e-06,-1.3e-05,0,-1e-06,-8e-06,1e-06,3e-06,4e-06,1e-06,1e-05,-5e-06,-1.7e-05,1e-06,-1.2e-05,5e-06,-2e-06,8e-06,4e-06,-8e-06,1e-06,1e-06,-1e-06,-1e-06,-1e-06,-3e-06,7e-06,-1e-06,0,0,-2e-06,-1.2e-05,-3e-06,7e-06,0,-3e-06,1e-06,-1e-06,-5e-06,-5e-06,6e-06,-3e-06,1.3e-05,-4e-06,-2e-06,1e-06,-1e-06,0,0
-1e-06,-1e-06,3e-06,-1e-06,-2e-06,1e-06,-4e-06,-1e-06,3e-06,4e-06,-1e-06,1e-06,2e-06,3e-06,2e-06,-1e-06,-6e-06,3e-06,0,-1e-06,-2e-06,9e-06,0,3e-06,0,-1e-06,-2e-06,-1e-06,-2e-06,0,1e-06,-1e-05,0,-1e-06,-4e-06,1.7e-05,-3e-06,2e-06,-2e-06,1e-06,-2e-06,-7e-06,0,1e-06,2e-06,-1e-06,4e-06,2e-06,0,-5e-06,1e-06,-4e-06,-2e-06,-1e-06,-6e-06,-2e-06,2e-06,-1e-05,-4e-06,1e-06,-1e-06,1e-06,3e-06,3e-06,6e-06,-1e-06,-2e-06,2e-06,-3e-06,1.2e-05,-1e-06,-9e-06,9e-06,-2e-06,-1.5e-05,0,5e-06,-7e-06,-5e-06,-5e-06,-8e-06,-1e-06,-2e-06,-9e-06,1e-06,-3e-06,1.5e-05,-5e-06,-1e-06,1e-06,-1e-06,1.6e-05,-2e-06,2e-06,-2e-06,1e-06,1e-06,2e-06,-1.1e-05,-5e-06,0,1e-06,8e-06,-4e-06,-3e-06,-9e-06,1e-06,1e-06,1e-06,3e-06,6e-06,-5e-06,-5e-06,-7e-06,8e-06,0,-1e-06,0,3e-06,2e-06,-8e-06
-1e-06,0,1e-05,1e-06,2e-06,-1e-06,-2e-06,-1e-06,-1.1e-05,0,1e-06,-1e-06,7e-06,-1e-06,-2e-06,-1e-06,1e-06,-1e-05,0,1e-06,-1e-06,0,-1e-06,-2e-06,0,1e-06,-1e-06,2e-06,-1e-06,1e-06,0,2e-06,0,1e-06,8e-06,9e-06,2e-06,-1e-06,-1.1e-05,7e-06,2e-06,-6e-06,0,0,-5e-06,0,1e-06,-7e-06,0,2e-06,1e-06,4e-06,-2e-06,3e-06,3e-06,-3e-06,-2e-06,5e-06,1.4e-05,1e-06,-1e-06,2e-06,1e-06,-4e-06,7e-06,0,-1e-06,0,1e-05,-9e-06,2e-06,9e-06,-6e-06,0,1.3e-05,1e-06,2e-06,1e-05,3e-06,2e-06,4e-06,2e-06,-9e-06,-5e-06,1.4e-05,0,7e-06,6e-06,-1e-06,-4e-06,-3e-06,-1.2e-05,1e-06,-3e-06,0,-1e-06,0,2e-06,7e-06,-3e-06,2e-06,0,-8e-06,1.2e-05,4e-06,3e-06,-1e-06,0,-1e-06,0,-5e-06,-1e-06,3e-06,2e-06,-6e-06,1e-06,0,0,-2e-06,6e-06,1.1e-05
1e-06,0,2e-06,0,-1e-06,0,-5e-06,2e-06,7e-06,-2e-06,-1e-06,3e-06,-8e-06,0,1e-06,1e-06,-2e-06,-1.1e-05,0,-1e-06,-2e-06,-1e-05,-2e-06,1e-06,0,-1e-06,-2e-06,-1e-06,-1e-06,0,0,1.2e-05,0,-1e-06,-2e-06,-1e-06,2e-06,1e-06,1e-06,-6e-06,2e-06,1e-06,3e-06,0,-5e-06,0,-6e-06,-7e-06,1e-06,7e-06,-1e-06,-4e-06,-1e-06,-4e-06,1e-06,4e-06,0,-1e-05,-7e-06,-2e-06,-1e-06,0,-2e-06,0,-2e-06,1e-06,0,-1e-06,-6e-06,-1.5e-05,-1e-06,-5e-06,-1e-06,0,2.5e-05,-1e-06,-4e-06,-2e-06,-1e-06,1e-06,-4e-06,0,9e-06,1e-06,1.3e-05,1e-06,-1.5e-05,-7e-06,2e-06,-7e-06,3e-06,2e-06,-1e-06,1e-06,0,-1e-06,0,-2e-06,-8e-06,-1e-06,2e-06,-1e-06,3e-06,-8e-06,3e-06,1e-06,1e-06,0,2e-06,-2e-06,2e-06,6e-06,0,-1e-06,-1.4e-05,1e-06,0,3e-06,0,1e-06,-1.1e-05
0,0,-4e-06,-3e-06,2e-06,-1e-06,3e-06,1e-06,4e-06,4e-06,1e-06,-7e-06,-4e-06,0,1e-06,0,-1e-06,4e-06,0,0,-2e-06,1e-06,-1e-06,2e-06,0,0,1e-06,-1e-06,1e-06,-1e-06,1e-06,-1e-06,-2e-06,1e-06,-6e-06,-1e-05,2e-06,0,3e-06,-3e-06,-3e-06,5e-06,-3e-06,0,2e-06,-2e-06,1e-06,3e-06,-1e-06,-1e-06,0,-2e-06,1e-06,5e-06,-5e-06,1e-06,1e-06,1.5e-05,6e-06,2e-06,0,0,0,3e-06,-4e-06,0,0,3e-06,1e-06,4e-06,1e-06,6e-06,1.1e-05,0,-1.6e-05,0,-1e-06,-1e-05,-1e-06,-4e-06,6e-06,-2e-06,2e-06,4e-06,-4e-06,1e-06,-2e-06,9e-06,-1e-06,-9e-06,-5e-06,1e-05,-1e-06,2e-06,0,0,0,-1e-06,9e-06,3e-06,-2e-06,0,-1e-06,-4e-06,-1e-06,-5e-06,-2e-06,3e-06,-2e-06,0,1e-06,8e-06,-2e-06,0,5e-06,0,1e-06,0,1e-06,-4e-06,1.1e-05
