-0.000718,-0.001024,-0.000657,-7e-04,-0.000527,-0.000491,-0.000338,-0.00029,0.000177,-0.013632,-0.007786,-0.00331,-0.000837,-0.001858,-0.003874,-0.002423,-0.001134,0.007992,-0.001982,-0.007363,-0.004895,-0.010569,-0.013977,-0.008901,-0.007578,-0.004279,-0.008143,-0.013185,-0.006384,-0.009347,-0.009674,-0.015703,-0.013081,-0.013693,-0.007335,-0.020369,-0.005558,-0.012396,-0.008473,-0.01465,-0.014466,-0.012806,-0.011628,-0.013916,-0.007093,-0.012862,-0.010636,-0.009749,-0.010134,-0.010031,-0.008947,-0.00881,-0.004466,-0.003124,-0.00254,-0.002422,-0.003004,-0.002735,-0.001342,-0.001422,-0.001199,-0.001568,-0.001152,-0.000145,-0.001928,-0.001335,-0.000905,-0.000814,-0.001164,-0.000909,-0.000507,-0.000792,-0.001046,-0.001448,-0.001112,-0.000744,-0.001536,-0.001006,-0.000527,-0.001254,-0.001349,-0.001244,-0.000681,-0.000699,-0.001735,-0.001157,-0.001225,0.000386,0.000203,-0.00075,-0.002464,-0.003279,-0.001904,-0.00079,-0.000566,-0.004086,-0.003092,-0.001866,-0.000539,0.002625,-0.00091,0.002711,-0.002785,-0.00616,0.001349,0.001597,-0.000453,-0.000683,-0.000383,-0.009455,-0.010601,-0.006347,-0.003128,-0.000742,2e-05,-0.000323,-0.000487,-0.000761,-0.002223,-0.001988,-0.001181
0.000138,0.000245,0.000387,0.000169,-0.000126,-1.1e-05,3e-06,-0.000398,-0.00133,0.006154,0.00354,0.001353,-0.000216,0.001468,-0.000281,2.4e-05,0.000173,-0.000289,-0.009737,-0.004959,-0.0038,-0.004322,-0.001773,-0.004825,-0.011822,-0.004106,-0.000248,-0.001889,-0.003442,-0.002525,-0.003267,-0.003457,-0.000883,-0.003889,-0.000816,0.00245,-0.003955,-0.001373,-0.000616,0.0013,-0.001647,-0.00498,-0.001367,-0.003107,-0.00445,0.000224,0.002282,-0.003538,0.001167,0.001145,-0.00304,0.0018,-0.000237,-0.000813,-0.000895,-0.002879,-0.000989,0.000314,-0.001118,-0.001153,0.000146,-0.000104,-0.000157,-0.00074,-0.000188,-0.000439,-0.000612,-0.000458,-0.000317,-0.000114,-1e-06,-2.1e-05,-0.00049,-0.000506,-0.001091,-8e-04,-0.000462,-0.000179,-0.000497,-0.000156,-0.000493,-0.000182,-0.000332,-1e-04,0.000342,7.7e-05,8.1e-05,-0.000358,-0.001123,-0.00037,0.000594,-0.000321,-0.001073,-0.000442,-0.001867,0.001508,0.001215,6.4e-05,-0.001648,-0.003782,-0.005002,-0.002763,-0.004354,-0.003898,-0.00692,-0.003998,-0.000519,-0.000175,0.001184,-0.001608,0.003923,0.002785,0.001316,0.000359,-0.000266,-0.000378,-0.00011,-9.5e-05,0.000795,0.000859,0.000532
-0.000202,-4.6e-05,-0.000247,-0.000109,0.000266,4.3e-05,0.000169,0.000319,9.6e-05,-0.00323,-5e-04,0.000299,0.000721,-0.000514,0.000487,0.000386,0.000417,-0.000171,-0.011982,-0.008465,-0.003379,-0.003046,0.002832,-0.002067,-0.007485,-0.003926,-0.002146,-0.001983,-0.002027,-0.000964,-0.001118,-0.000448,-0.006409,-0.003051,0.000634,-0.002703,-0.004617,-0.006884,-0.007663,-0.006046,0.002498,0.006147,0.004192,0.002758,-0.002705,-0.004401,-0.000947,-0.003847,-0.000107,0.000358,0.003202,-0.000561,-0.002638,0.000733,0.000921,0.000124,-3.9e-05,-0.000513,-0.000737,-0.000667,-0.000536,-0.002167,-0.00032,0.000255,-0.000688,0.000234,0.000485,0.00013,0.000137,0.000126,-0.000537,5.5e-05,0.000911,0.000104,0.000769,0.000481,-5.9e-05,-3.8e-05,0.00052,2.7e-05,0.000259,-0.000377,-0.00018,-0.000107,0.000178,0.000245,-0.000224,-0.000734,-0.000218,0.000352,0.000264,-0.000688,0.000441,0.000938,-3.7e-05,0.000359,-0.000728,-0.000108,0.000945,-0.0021,-0.001037,5.6e-05,6.4e-05,0.0022,0.001827,0.000724,-0.000386,-0.000302,-0.002937,0.000319,-0.002053,0.000225,0.000337,0.000266,0.000546,0.000729,0.000193,0.000298,-0.000236,-2.8e-05,-0.000191
-8.4e-05,-8e-05,-0.000125,-8.3e-05,-0.00038,-0.00012,-0.000116,-0.000215,-7e-04,0.000372,0.000413,7.1e-05,-0.00023,-0.00037,-0.000453,-0.000167,-0.000194,-0.000177,0.002784,0.004235,0.003821,0.002472,-0.005591,-0.004907,0.002287,0.001526,0.001422,0.003478,0.001502,0.001037,0.002991,0.001229,0.004737,0.001276,-0.002389,-0.003158,-0.002878,0.003385,0.000616,-0.000764,-0.005072,-0.008093,-0.001221,0.000138,-0.002402,-0.001717,0.001687,0.000909,8.8e-05,0.000529,0.000185,0.001548,0.002759,0.000553,-0.002007,0.000948,-7e-06,0.000135,0.00064,0.000567,0.000479,0.001237,0.000225,0.000376,0.0013,0.000817,0.000183,0.000141,-0.000154,-7.7e-05,0.000106,-0.000384,-0.000515,0.000491,-0.00047,-0.000776,-0.000457,-0.000108,-0.000125,2.7e-05,-0.00048,-0.00019,-0.000162,-0.00031,-0.000532,-0.000205,-0.000118,0.000471,0.000706,3.6e-05,-0.000996,-0.000762,-0.000461,-0.000382,-0.000177,-0.001468,0.000175,-0.001046,-0.000916,-4.3e-05,-0.003097,0.000266,-0.000169,0.00102,-0.001915,-0.001917,0.000161,0.000754,-0.000598,-0.001863,-0.000236,-2.5e-05,0.000132,-0.000101,-0.000477,-0.000278,-0.000157,-0.000182,-0.000178,-0.000289,-0.000114
0.000114,-0.00022,0.000337,0.000324,0.000284,-7.8e-05,-4.3e-05,5.1e-05,0.000413,0.00036,-0.000602,-0.000904,-0.000219,1.1e-05,-0.000215,-0.000112,1.7e-05,-0.000351,0.000883,0.000507,0.003069,0.001863,-0.002527,0.005962,0.003116,0.001564,0.000492,0.003364,-0.002809,0.00111,-0.002116,0.001487,-0.000957,0.002429,0.00143,0.000126,0.001557,0.00015,-0.002706,0.001851,0.001263,0.00391,0.003129,-0.001419,-0.000522,-0.001317,0.000639,0.001683,0.000209,0.000766,-0.000261,-0.00069,-0.000968,-0.002104,0.000489,0.000682,0.001413,0.00059,0.000261,-1.5e-05,-5.3e-05,0.000646,0.000644,-3.5e-05,-0.000458,-0.000619,-2.7e-05,-0.000176,-0.000385,0.000193,-2e-06,-0.000181,-7.6e-05,-0.000448,-0.000275,0.000278,0.000609,0.000226,-8.8e-05,0.00011,0.000778,0.000492,7.9e-05,0.000214,0.000147,0.000259,-4.6e-05,-0.000313,3.8e-05,-0.000162,0.000939,0.000696,-0.000379,-0.00021,-0.000418,0.000286,-7.1e-05,0.000569,-8.9e-05,-0.000636,0.000463,-0.006086,-0.002852,0.00159,-0.00235,0.001323,0.001076,-0.000394,-0.000261,-0.000942,-0.000945,-0.00025,-0.000242,-0.000208,5e-05,3.9e-05,-0.000206,-4.6e-05,0.000258,-2.1e-05,4e-06
-8.4e-05,0.000158,-0.000166,-0.000148,-0.000218,0.000281,0.000158,8.5e-05,-0.000155,-0.000556,0.000322,-0.000162,0.000394,-0.000513,-0.000515,-0.000678,-8.3e-05,-2.3e-05,2.4e-05,0.000552,0.002334,0.001058,0.002373,-0.003614,0.002539,0.000388,0.001954,0.000359,0.000724,-0.000707,0.001757,-0.002653,0.00275,0.00251,-0.000109,0.000244,-0.00313,-0.008759,0.002257,0.003161,-0.000752,-0.004379,-0.002508,-0.002384,0.002855,0.003369,-6.1e-05,-0.00092,0.000815,-0.001239,0.000163,-0.001796,0.00038,0.000947,0.000582,-0.00076,-0.000532,-0.000419,-0.000156,-8.4e-05,-0.000312,5.5e-05,-0.000667,-0.000422,0.000238,-2.6e-05,-0.000246,-0.000205,0.000317,-0.000334,6e-05,3.3e-05,-0.000263,0.000383,0.00031,0.000725,-8.2e-05,-0.000302,0.000256,-0.000199,-0.000444,-0.000345,6.5e-05,0.000119,5e-05,-0.000283,4.2e-05,0.000112,-0.000811,0.000467,-9.4e-05,6.9e-05,-0.000358,0.000538,0.000146,0.000503,-0.001068,0.000132,0.000485,-2e-05,-0.000122,-6.8e-05,0.000664,-0.000958,-0.00184,-0.000333,0.000183,9.5e-05,0.000101,0.001562,-0.000845,-0.000207,0.00075,0.000533,3.7e-05,0.000374,0.000109,5.2e-05,0.000212,1.3e-05,0.00021
0.000221,-0.000191,8.1e-05,0.000105,9.8e-05,-0.00014,-0.000134,-9.6e-05,-9.1e-05,8.7e-05,-0.001141,-0.000268,0.000399,0.000387,0.000131,1e-04,-3.6e-05,0.000125,-0.000498,0.001628,0.001089,0.000289,-0.001255,0.002038,-0.000691,-0.002143,-2.6e-05,0.001222,0.000945,-0.001095,0.000529,0.001006,-0.000858,-0.002022,0.000453,2.8e-05,0.003744,0.001355,-0.00275,-0.000591,0.00115,0.004052,0.001826,0.00195,-0.000169,0.001018,0.001777,0.002196,-0.001067,0.003027,-0.000161,-0.000503,-0.001509,-0.000631,-0.000817,0.000211,-0.001281,-0.00045,0.000318,-0.000311,0.000299,7.1e-05,0.000165,8e-05,-0.000126,0.000276,-0.000311,2.1e-05,-0.000246,-0.000161,-3.9e-05,1.4e-05,8.6e-05,-0.000226,-0.000114,-0.000353,-1.7e-05,0.000189,-5.7e-05,0.000174,0.000189,0.000357,0.000197,-0.000114,-0.000346,4.8e-05,-0.000129,3e-06,5.3e-05,-0.000344,-0.000251,-0.000291,-0.000391,-0.000837,0.000225,5.5e-05,0.000412,-0.000269,-0.000115,0.000826,-0.000643,-0.003548,-0.001626,0.000836,-0.001372,-0.001025,-0.00037,9.9e-05,-0.000344,-0.000382,0.000876,-0.000168,-0.000797,-0.000368,-0.000355,-0.000221,0.000127,-5.3e-05,-0.000384,-0.000231,-0.000448
-6.9e-05,9.2e-05,-4e-06,-0.000297,-7.2e-05,-1e-06,9.3e-05,8.6e-05,0.000127,-0.000103,-0.000113,-8.7e-05,-0.000177,0.000174,3e-06,-1e-05,0.000153,-0.000278,0.000115,-0.001171,-0.000376,-0.00157,1e-05,-0.004225,-0.001699,-0.001316,0.001919,0.000868,-0.001707,0.001076,6.7e-05,0.00192,-0.002389,-0.002587,0.002376,0.000605,-0.001027,-0.001038,0.001828,0.000951,-0.000659,-0.00141,-0.002863,1.8e-05,-0.003424,-0.000719,-0.000825,-0.001831,-0.000578,-0.000641,-0.000298,-0.000952,0.000158,0.000413,0.000794,-0.00061,0.000252,0.000312,-0.000442,0.000414,-0.000197,0.000297,-0.000217,-0.000764,-8.5e-05,-0.000539,0.000252,-0.000179,-0.000117,-7.3e-05,0.000146,0.000187,-0.000342,-0.000365,-6.8e-05,-3.9e-05,-0.000142,3.7e-05,3.2e-05,7.9e-05,-9.8e-05,-0.000417,-0.000146,3.6e-05,0.000221,7.6e-05,-0.000182,-0.000158,-9.2e-05,0.000194,8.3e-05,0.000272,0.000213,-0.000344,-0.000434,0.000127,-0.000475,0.000154,0.000739,-0.000617,-3.4e-05,0.000745,0.002111,0.000992,0.00076,-0.001734,-0.000371,0.000642,-4.2e-05,0.002197,0.000667,0.000197,0.000332,-0.000202,-0.00028,2.6e-05,-0.000282,-0.000127,0.000379,0.00023,0.000439
-7.6e-05,-1e-04,-6.4e-05,0.000197,7.1e-05,9.5e-05,-2.6e-05,-5.2e-05,-9.1e-05,-7.5e-05,-0.00019,-0.000724,-0.000187,-0.000467,0.000114,1e-06,-0.00037,6.9e-05,0.000108,-0.003706,-0.001561,0.001484,-0.000356,-0.001212,-4.5e-05,0.004251,0.001015,-2.5e-05,-0.000434,-0.000458,-0.000379,-0.000249,0.00222,-3.9e-05,-0.002094,0.000108,0.000769,0.000172,-0.000641,-0.002774,-0.000389,-0.000708,0.003451,0.000272,0.001483,-0.000736,0.001187,0.003036,0.001867,0.001942,-0.000601,0.000201,0.000477,-0.00062,7.6e-05,-0.000318,0.000682,1.5e-05,1.8e-05,-0.000106,-1.4e-05,-0.000792,0.000386,5.5e-05,8.3e-05,5.6e-05,-0.000381,4.3e-05,8.5e-05,8.6e-05,-8e-06,-0.000171,0.000256,0.000382,0.000167,4.5e-05,6e-05,-2.1e-05,5.8e-05,-0.000179,-1.9e-05,0.000135,-4.4e-05,3e-06,-9.7e-05,-0.000188,0.000218,0.000195,0.000167,0.000252,0.000153,-0.000103,0.000661,0.000215,0.000124,-0.000174,-5e-04,-0.000241,-0.000912,0.000269,0.000172,0.001098,0.002532,9.8e-05,0.000285,-0.000384,-0.000349,-6.6e-05,0.000176,-0.001303,-0.000773,-0.000531,-0.000185,0.000158,6e-06,-9.7e-05,7e-06,0.000116,-0.000146,-0.000139,-0.000537
6.4e-05,0.000132,4.6e-05,-1e-04,4.8e-05,-6.4e-05,-9.2e-05,-7.3e-05,-2.6e-05,0.00011,0.000351,0.00033,-3.9e-05,6.1e-05,-0.000119,-7e-05,0.000206,2.9e-05,4e-06,-0.00069,-0.001486,0.000209,-0.000924,0.000293,0.000374,-0.001744,-0.000961,0.00078,-0.000797,-0.000413,-0.000711,-0.000136,0.000175,0.001181,-0.001173,-0.001186,0.000831,0.000721,0.002628,-0.000332,0.000552,-0.000138,-0.000617,-0.001334,-0.00177,0.000174,0.000503,-0.000892,-0.001148,-0.001079,-7.8e-05,0.000379,-0.000564,0.000796,-0.000787,0.000662,-0.000222,0.000152,-0.000213,6.4e-05,0.000162,0.000328,-0.000235,6.8e-05,-0.000186,-0.00013,4.5e-05,-9.2e-05,1.8e-05,5.4e-05,0.000123,5.7e-05,5.2e-05,-0.00014,-9.7e-05,-0.000322,-0.000126,1.9e-05,-8e-05,8.8e-05,-2.7e-05,2.4e-05,7.5e-05,-8.8e-05,0.000179,0.000102,-0.000164,1.9e-05,-6e-05,0.000219,-7e-05,5.5e-05,-0.000183,-9.5e-05,0.000435,-4.3e-05,0.000494,-0.000232,0.000138,6e-06,-0.000542,9.2e-05,-0.003283,0.000313,-2.5e-05,0.000269,0.000599,-0.000257,-0.000431,-0.000349,0.000248,-7e-05,-0.000102,-0.000324,-6.9e-05,-0.000161,-8.1e-05,-0.000143,-2.6e-05,2.9e-05,0.000286
-1e-05,1.4e-05,-9.4e-05,9.7e-05,1.1e-05,6.6e-05,3.1e-05,2.6e-05,1.5e-05,3.9e-05,0.000157,-0.00023,-7.6e-05,-7.2e-05,0.000184,0.000175,-9.3e-05,-0.000101,-0.000217,7.1e-05,-0.000937,0.000937,0.000196,0.001595,-0.001506,-0.000213,-0.001793,-0.00117,0.000236,0.000242,-0.000445,0.000839,0.00016,-0.001123,0.000416,-0.001356,0.000445,0.000562,0.00056,-0.001151,-0.000862,0.001184,6.2e-05,0.000923,-0.000949,-0.001361,-0.000107,0.000304,0.000979,-0.00061,-0.000423,-0.001689,0.000881,-6.1e-05,0.000554,-0.000256,-0.000421,-5.1e-05,0.000519,8e-06,-0.000134,-0.000133,-0.000255,0.000394,-1.1e-05,7.2e-05,-7.3e-05,0.000124,-0.000108,-1.7e-05,-6.9e-05,-1.1e-05,-7.3e-05,0.000214,2.9e-05,6.9e-05,0.000209,-0.000201,-3.1e-05,-1.5e-05,4.6e-05,7.4e-05,-3.6e-05,3.6e-05,-5.5e-05,2.5e-05,0.00019,5.5e-05,0.000105,-0.000389,0.000138,2.3e-05,-8.4e-05,-4.4e-05,-0.000226,3.5e-05,0.000258,-6.3e-05,2.3e-05,-0.000474,0.000189,0.000373,6.2e-05,-0.000349,-0.000348,-3.8e-05,-0.000371,0.000349,0.000148,0.000167,-0.000427,-0.00079,-0.000557,4.4e-05,2.7e-05,5.2e-05,-2e-06,-3e-06,3.1e-05,2.8e-05,-0.000187
-1.2e-05,-1.3e-05,3.2e-05,-9.9e-05,-1.6e-05,-6.2e-05,2e-06,-2.6e-05,-3.4e-05,-2.4e-05,-0.000312,0.000309,-0.000336,-8.9e-05,4e-06,5.1e-05,-4.2e-05,3.2e-05,6.2e-05,9.7e-05,0.002231,0.000903,0.000375,-0.000474,-0.000241,-0.001375,-0.001604,-3.7e-05,0.000298,0.001284,0.000666,0.000171,-0.001125,-0.000752,-0.000258,-2.6e-05,-4.8e-05,-0.000706,-0.001642,0.00066,0.000277,0.000121,-0.000105,-0.00043,-0.00209,-0.000698,-0.001071,-0.000431,-0.001451,-0.00065,0.000388,0.001324,0.000314,-0.000504,-4.1e-05,0.000178,0.000387,-2.9e-05,-0.000146,-6.3e-05,0.000181,8.9e-05,0.000198,-0.00012,5.6e-05,5e-05,0.000276,0.000143,1.8e-05,-0.000102,-0.000123,4.6e-05,2.9e-05,-6.6e-05,6.9e-05,5.4e-05,-0.000125,5.9e-05,-0.00016,-0.000112,8e-05,5.2e-05,-7e-06,-1.5e-05,1e-05,-4.9e-05,-5.1e-05,1.7e-05,-0.000134,-0.00024,-0.000103,-8e-06,-7.8e-05,6.1e-05,0.000172,0.000187,-2e-05,-0.000101,0.000107,0.000131,-5.1e-05,-0.000825,0.001127,-0.000206,-0.000452,-0.00027,-0.000329,0.000205,4.7e-05,0.000326,-4.7e-05,0.00042,0.000672,-8.1e-05,9e-06,-3.9e-05,3.9e-05,6.9e-05,-4e-06,-2.8e-05,9.4e-05
-1.3e-05,1e-05,-6.1e-05,-1.3e-05,-5.3e-05,2.8e-05,2.4e-05,3.1e-05,7e-06,-3.7e-05,4.1e-05,0.000126,-9e-06,-0.000111,-0.000121,-8e-05,-3.1e-05,-3.7e-05,0.000116,0.000605,0.00061,-0.000574,7e-05,0.00081,0.000481,-0.000812,0.000207,0.001307,-0.000101,-0.000278,-0.001382,0.000248,-0.000275,-2.3e-05,-0.000267,0.00048,-0.000161,0.000439,0.001479,-0.000929,-0.00066,-0.000382,-0.000669,0.00012,0.001357,0.000648,-0.000625,0.000839,-7.9e-05,-0.000325,-0.000873,-0.000271,-0.000189,-0.000211,-0.000281,0.000287,-0.000165,0.000122,-0.000191,6.2e-05,-0.000163,-0.000315,-6.5e-05,-0.000106,0.000146,-0.00012,-0.000167,-0.000179,0.000177,0.000104,-3e-06,-1.4e-05,6e-05,3.1e-05,-8.8e-05,1.4e-05,5.6e-05,6.9e-05,0.000171,5.9e-05,-7.1e-05,-9.3e-05,4.6e-05,5.9e-05,-3.8e-05,3.5e-05,6.5e-05,1e-06,7.2e-05,-3.9e-05,7.7e-05,-1.6e-05,2.4e-05,-4.1e-05,-5e-06,-0.000132,0.00041,-0.000128,-0.000248,-0.000129,-0.000101,-0.000276,-0.000278,0.000569,-0.00016,0.000672,-0.000283,0.000328,2.9e-05,-0.000222,0.000265,0.000154,-0.000308,-0.000193,-0.000139,-0.00011,3.8e-05,-3e-05,-7.2e-05,9e-06,1.3e-05
-9e-06,-4.8e-05,2.8e-05,2.2e-05,2.3e-05,-7e-06,-3.3e-05,-2e-06,-1.3e-05,-1.8e-05,7.3e-05,0.000181,-0.000154,0.000108,0.000132,2.4e-05,3.9e-05,9e-06,-7.2e-05,0.000523,-0.001391,-0.000161,-0.000995,-0.001069,-0.000115,-0.000239,0.000795,-0.000714,-0.000231,0.000337,-7.2e-05,-0.000229,0.000523,0.000197,0.00075,-0.000103,-0.001395,0.000576,-0.001117,0.000888,0.000196,3.5e-05,0.000891,-0.000241,0.000186,-0.000549,0.00021,0.000207,-0.000212,0.000863,0.000255,-0.000134,0.000244,-6e-06,-0.000141,-0.00052,-0.000304,-0.00015,0.000217,-7.4e-05,7e-06,0.000225,-2.1e-05,-0.000177,-0.000165,-7.9e-05,0.000115,0.000109,-7.1e-05,6.5e-05,-4.2e-05,-9.4e-05,-7.2e-05,1e-05,-3.5e-05,-5.7e-05,5.1e-05,4e-06,-5.6e-05,0,3.7e-05,7e-06,-4.1e-05,-5.5e-05,5.3e-05,2.8e-05,4.4e-05,-5.2e-05,-1.6e-05,0.00015,4.8e-05,7.4e-05,0.000138,0.00021,1e-06,-9.8e-05,-0.000365,-0.000166,6.7e-05,0.000183,7.6e-05,8.2e-05,-0.001265,-0.000419,3.8e-05,-0.000161,0.000212,-0.000224,2.2e-05,-0.000391,-8.5e-05,3.8e-05,0.000104,0.000105,3.5e-05,-5.7e-05,-2.7e-05,2.4e-05,1.1e-05,0,1.2e-05
7e-06,3.6e-05,-2e-06,-1e-06,-8e-06,1e-05,1.7e-05,-1.7e-05,-2.8e-05,2.9e-05,-0.000121,-0.000654,6e-06,-4.2e-05,-5.7e-05,-2.5e-05,1.4e-05,3.6e-05,-6.4e-05,0.00032,-0.00167,-0.000299,0.000592,-0.000648,6.2e-05,0.000526,0.000923,-0.000257,0.000161,-0.000387,-0.000365,-0.000192,-0.000513,-0.000316,-0.000175,-2e-05,0.000302,-0.000417,0.000725,-0.000348,-0.00045,0.000245,-0.000296,-0.000493,-0.000717,0.000869,-0.000103,-0.000125,-3.1e-05,-0.000298,1.8e-05,-0.000145,-7.2e-05,0.000217,9.9e-05,0.000243,0.000382,7e-05,-0.000287,0.000104,9.4e-05,5.1e-05,5.5e-05,0.000178,-1.3e-05,4.5e-05,-4.6e-05,3.3e-05,-1.7e-05,-3.3e-05,-1.9e-05,1.1e-05,-3e-06,-3.1e-05,3.2e-05,7.9e-05,-1.4e-05,1e-06,8.1e-05,-4.7e-05,2.4e-05,3.7e-05,2e-05,4.6e-05,-2.3e-05,-1.5e-05,-5.9e-05,1.6e-05,-6.5e-05,-4.2e-05,-5.6e-05,-3.9e-05,-8.5e-05,-1.4e-05,-2.2e-05,0.000123,-0.000196,0.000129,-4.7e-05,5.7e-05,-1.3e-05,0.000115,0.000109,-0.000687,4.2e-05,-6e-05,5.6e-05,-9.9e-05,-1.3e-05,6e-05,-4.9e-05,3e-05,4.2e-05,-9.2e-05,-7.5e-05,4.1e-05,4.1e-05,-1e-06,-2e-05,-2e-06,5.7e-05
1.1e-05,-5e-06,3.9e-05,-3.9e-05,2.6e-05,-1.1e-05,-2e-06,-4e-06,1.8e-05,1.8e-05,8.1e-05,0.000289,-0.00014,-4.3e-05,0.000141,3.1e-05,5.7e-05,-4.9e-05,6.6e-05,6e-06,0.00036,0.000288,0.000727,0.000589,-0.000224,0.000393,-4.7e-05,0.00011,8.6e-05,0.000196,0.000534,-6.7e-05,-0.00041,0.000536,-0.00059,-0.000345,0.000199,-0.000465,-0.000116,0.001387,0.000657,-0.000205,-0.00029,0.000517,0.00107,-0.000726,0.000342,0.000519,8.3e-05,7.4e-05,0.000212,-0.000206,0.000292,1.7e-05,5.8e-05,7.4e-05,1.4e-05,2.3e-05,0.000273,-6.7e-05,-2.7e-05,3.1e-05,5.4e-05,3.1e-05,-3.8e-05,3.5e-05,2.5e-05,-1.3e-05,-4.9e-05,2.9e-05,1.6e-05,-2e-05,-1.1e-05,1.9e-05,3e-05,4.1e-05,-2.3e-05,-6.4e-05,-5.7e-05,-5e-06,-4.9e-05,-5e-05,-3.8e-05,-5e-06,1.5e-05,-1.8e-05,5.3e-05,-6e-06,6e-05,-5e-06,-0.000155,2.5e-05,7.8e-05,-0.000143,1e-06,-2.2e-05,0.000103,0.000101,2.9e-05,-0.000193,-4e-06,0.000265,0.000341,0.000196,4.2e-05,-0.000427,-0.000103,0.000119,2.4e-05,4e-06,1.8e-05,-9.8e-05,-0.000145,5.8e-05,6.3e-05,8e-06,-3.1e-05,1e-06,-3.8e-05,-6e-06,-9.1e-05
-5e-06,-2e-06,5e-06,6.9e-05,-3.3e-05,2.1e-05,-4e-06,1.5e-05,-1.3e-05,-8e-06,-4.1e-05,3e-06,0.000164,6.2e-05,-7.1e-05,-5e-06,-2.3e-05,6e-05,1.7e-05,-0.000169,0.000277,5.2e-05,1.3e-05,-5.4e-05,0.000323,-0.000175,-0.000257,-0.000328,-0.000116,5.9e-05,0.000325,4e-04,0.000434,-0.000102,0.000161,3.1e-05,0.000252,6.5e-05,5.4e-05,-0.000223,8.5e-05,-7e-06,0.000598,-0.000145,-0.000314,-0.00043,-0.000208,-0.000158,5.8e-05,-9e-06,7.3e-05,-7e-05,0.000145,0.000136,-0.000132,-0.000114,-9.5e-05,-4.4e-05,-0.00015,6e-06,2.9e-05,4.1e-05,-4.8e-05,-3e-05,4.1e-05,1.4e-05,4e-06,-4e-06,2.9e-05,-6e-06,-4e-06,5.8e-05,3.7e-05,-2.8e-05,-2.4e-05,-2.4e-05,8.2e-05,-1.9e-05,3e-06,5.1e-05,-2.2e-05,3e-06,2.1e-05,-2.1e-05,1.5e-05,4e-06,0,-1e-05,-2.4e-05,3.8e-05,3e-05,-1.6e-05,-0.000156,-8.3e-05,-4e-05,-2e-05,0.000117,1e-06,-4.3e-05,0.000208,-7e-06,-0.000171,-0.00014,-0.000164,1.8e-05,0.000142,-1.9e-05,1.6e-05,3.8e-05,7.7e-05,-1.8e-05,-1.7e-05,7.4e-05,-1.4e-05,-2.8e-05,1.4e-05,2e-05,1.2e-05,5.6e-05,1.4e-05,6.3e-05
-1.4e-05,-1.8e-05,1.4e-05,-2.7e-05,2e-06,-1.1e-05,1.2e-05,5e-06,3e-06,-1.9e-05,7.7e-05,-0.000176,-1e-05,-1.1e-05,1.8e-05,-4e-06,-2.4e-05,-1.9e-05,-3.3e-05,-4e-04,0.000294,-0.000177,-0.000296,4e-06,0.000124,-0.000381,-0.000261,-0.000168,1.3e-05,-5.7e-05,-8.9e-05,-0.000108,-4.1e-05,-0.000119,6.2e-05,0.000308,-0.000205,-0.000135,-5.6e-05,5e-05,0.000312,2.2e-05,-0.000511,8.2e-05,-0.000475,0.000503,-0.00019,0.000125,0.000219,1.5e-05,-0.00024,0.000141,-5.6e-05,-2.8e-05,4.3e-05,0.00017,-4e-05,7.6e-05,-1.6e-05,1.8e-05,-7e-06,-3.2e-05,-1e-06,2.1e-05,1e-05,-1.6e-05,1.6e-05,-7e-06,9e-06,-2.6e-05,-4e-06,-1.4e-05,2.7e-05,3.4e-05,-9e-06,-4e-06,-5.1e-05,7.6e-05,-3e-06,-8e-06,2.7e-05,-2e-06,1.9e-05,3e-05,-1.6e-05,-1e-05,1e-06,-1.9e-05,1.2e-05,-2.2e-05,6.1e-05,1.4e-05,1e-06,5.3e-05,3.4e-05,-4.7e-05,4.4e-05,3.2e-05,-5.8e-05,-9.1e-05,-5e-06,-9e-05,0.000143,-0.000122,-6.5e-05,-3.6e-05,-8e-06,0.000124,1.8e-05,-0.000109,7e-06,-0.000151,-9.5e-05,-3.7e-05,3.2e-05,6e-06,-2.2e-05,-1e-05,-6e-06,-9e-06,-8.1e-05
1.3e-05,6e-06,-5e-06,3e-05,-1.3e-05,-1.1e-05,-1.2e-05,-4e-06,1e-06,-3e-06,-2.2e-05,0.000257,9.3e-05,-2.8e-05,3.4e-05,-1.1e-05,2.2e-05,3.8e-05,-8e-06,-0.000365,0.00019,-0.000187,-4.5e-05,-0.000109,-0.000144,2e-04,1.9e-05,-0.000182,-0.000106,-7.9e-05,-0.00012,-0.000203,8.4e-05,-0.000194,4.1e-05,0.000128,-8.2e-05,-0.000217,-0.000231,6e-05,-0.000291,6.6e-05,-1.6e-05,-0.00021,3.4e-05,-0.000113,-7e-05,-0.000302,8.3e-05,9.5e-05,-7.9e-05,0.000182,8.6e-05,2.1e-05,-1.1e-05,2.8e-05,0.00011,-1.5e-05,7e-05,-8e-06,-3.9e-05,2.6e-05,1.8e-05,5.6e-05,-1.6e-05,-1.9e-05,-3e-06,1.4e-05,-2.8e-05,6e-06,9e-06,2e-06,-2.3e-05,8e-06,3e-06,-1.6e-05,-1.4e-05,-2.2e-05,6e-06,2e-06,-1.4e-05,2.8e-05,-1.2e-05,-9e-06,-1.6e-05,1.4e-05,-1.2e-05,-1.8e-05,-3.5e-05,3.1e-05,-3.4e-05,-1.1e-05,2e-05,-2e-06,-4.4e-05,4.2e-05,9.2e-05,1.8e-05,2.5e-05,6e-06,-1.2e-05,-9.2e-05,0.000249,0.000169,3.1e-05,-2.3e-05,-1.6e-05,-0.000146,3.1e-05,-7.7e-05,3.2e-05,8.4e-05,0.000104,5e-06,-3.1e-05,-3e-06,2e-06,1.2e-05,-7e-06,-2e-06,6.6e-05
5e-06,-4e-06,-1.6e-05,-3.5e-05,1.2e-05,2e-05,0,-1e-06,1e-06,1.3e-05,-3.3e-05,-0.000128,1.5e-05,7e-06,-6e-06,1.9e-05,-3e-06,-2.3e-05,1.9e-05,-9.3e-05,6.8e-05,-0.000114,0.00036,0.000139,-8.2e-05,-0.000106,1.3e-05,7.1e-05,-3e-06,-6.7e-05,-0.000159,5e-05,-0.000239,0.000457,0.000248,-0.000112,-7.1e-05,7.7e-05,0.000313,0.000296,-8.3e-05,3.9e-05,-3.3e-05,-0.00014,0.000277,0.000116,-2.1e-05,-9e-06,-0.000179,-4.3e-05,1.9e-05,-3.6e-05,-4.8e-05,2.6e-05,-3e-05,-0.000101,-9.9e-05,-1.9e-05,-4.2e-05,1.5e-05,1.5e-05,-1.1e-05,-7e-06,-1.9e-05,2e-05,1.9e-05,-7e-06,2e-05,4.3e-05,1.7e-05,1.7e-05,-3e-06,-3e-06,-2e-05,1.5e-05,-8e-06,2.9e-05,-7e-06,5e-06,5e-06,9e-06,-5e-06,-2e-06,-4e-06,-3e-06,5e-06,1.4e-05,1.8e-05,7e-06,1.6e-05,-1.1e-05,1e-05,3.9e-05,1.2e-05,3.3e-05,-5e-06,-6.7e-05,-5.2e-05,-9e-06,7.4e-05,-1.5e-05,-4.4e-05,-0.000388,5e-06,-8e-06,-5.5e-05,-3.7e-05,-4.3e-05,5e-06,6.9e-05,-3.9e-05,-4.8e-05,-6.1e-05,-3.8e-05,1.1e-05,-8e-06,0,-2e-06,7e-06,4e-06,-4e-05
-8e-06,-1e-06,7e-06,1.6e-05,-1.1e-05,-1.6e-05,1e-06,1e-06,-2e-06,6e-06,2e-06,5.9e-05,1.9e-05,1.6e-05,2.9e-05,2e-06,-3e-06,9e-06,1.1e-05,8.7e-05,0.000148,-0.000197,4.2e-05,-0.00034,-6.5e-05,0.000319,7.5e-05,0.000252,2.2e-05,4.4e-05,0.000143,2.5e-05,-2.7e-05,-0.000333,-8.8e-05,-5.1e-05,6.7e-05,-3.6e-05,-0.000411,-0.00064,-1.9e-05,2.4e-05,-8e-05,0.000158,-0.000132,-0.000258,0.000113,-2e-04,-2.2e-05,4.1e-05,8.6e-05,-9.5e-05,0.000122,-8.8e-05,1.2e-05,0.000126,-1.6e-05,-5e-06,3.6e-05,-8e-06,1e-05,-2.1e-05,-3.5e-05,-7.4e-05,-8e-06,-3e-06,1.8e-05,-6e-06,3e-06,-9e-06,3e-06,1.1e-05,-2e-06,2.1e-05,-7e-06,-2e-05,-1.9e-05,-2e-06,-1.1e-05,-3e-06,1.1e-05,-1e-05,0,-9e-06,6e-06,-1.4e-05,5e-06,-6e-06,-6e-06,8.7e-05,4.5e-05,-7e-06,4.9e-05,7.4e-05,-5.2e-05,-3e-06,1e-06,-2.1e-05,3.4e-05,-0.000102,-4e-06,0.000127,-0.000111,1e-05,3.2e-05,9.5e-05,9.3e-05,-3.3e-05,1.3e-05,7.6e-05,-1.2e-05,2.1e-05,5e-06,0,-3.2e-05,-1.7e-05,-1e-06,-5e-06,1.1e-05,-4e-06,1.5e-05
-3e-06,9e-06,-1.5e-05,-1.8e-05,1.6e-05,1e-05,3e-06,2e-06,0,-8e-06,-1.9e-05,-2.9e-05,-2.1e-05,-2.2e-05,-2.6e-05,-2.3e-05,-9e-06,-5e-06,-1.7e-05,0.000108,0.00014,-1.7e-05,-7.3e-05,0.000482,9.4e-05,0.000135,-1.7e-05,-0.000134,-4.1e-05,-2.4e-05,0.000156,1.3e-05,0.000173,8.6e-05,-0.000339,4.8e-05,-5.1e-05,-1.1e-05,0.000138,1.4e-05,0.000125,-0.000119,0.000359,-3.9e-05,-0.000417,-2e-05,0.000177,-8e-05,1.9e-05,1.9e-05,-2.7e-05,-8.2e-05,-1.8e-05,2.1e-05,1.5e-05,-0.000132,4.2e-05,0,-3.5e-05,-3e-06,-2e-05,-3.5e-05,3.8e-05,1e-05,0,1e-06,-1.2e-05,1.3e-05,-4e-06,1.7e-05,1.1e-05,1.1e-05,1.5e-05,-1.8e-05,0,1.6e-05,-8e-06,-2.3e-05,-2e-06,-1e-06,-2e-06,1.1e-05,4e-06,1.4e-05,-5e-06,7e-06,-9e-06,2e-06,1.3e-05,-5.3e-05,-8e-06,-1e-06,-6.4e-05,-3.8e-05,2e-05,-2.3e-05,1.9e-05,1.1e-05,-5.8e-05,8.3e-05,-1.1e-05,4e-06,0.000397,0.000124,-1.2e-05,-4.4e-05,-4.7e-05,3.8e-05,1.2e-05,3e-05,3e-05,6e-06,1.4e-05,1e-06,1e-06,-1.3e-05,3e-06,1e-05,-8e-06,-1e-06,1e-05
2e-06,-4e-06,1e-06,4e-06,-9e-06,-9e-06,-2e-06,-3e-06,1e-06,-8e-06,3.2e-05,-1.9e-05,-1.7e-05,-1.3e-05,3.5e-05,4e-06,2e-06,6e-06,-2e-06,0.000169,0.000112,-1.3e-05,-3.3e-05,-0.000206,-0.000227,1.4e-05,-0.000216,0.000102,-3.4e-05,0.000117,4.7e-05,-6.3e-05,-0.000169,-4.8e-05,0.000117,8.1e-05,0.000178,6.2e-05,4e-06,-0.000167,0.000179,-5.5e-05,-0.000189,2.3e-05,0.000248,7.5e-05,-2.8e-05,-0.000122,-7.6e-05,-0.000136,-4.7e-05,-3.2e-05,-8.2e-05,3.9e-05,-6.8e-05,1.4e-05,3e-05,1.6e-05,6e-06,-1.5e-05,3.3e-05,4.1e-05,2e-06,1.1e-05,0,2e-06,1e-05,-1.5e-05,-3.1e-05,-1.9e-05,-3e-06,-1.2e-05,-6e-06,1e-06,0,-5e-06,2.7e-05,3.5e-05,-2e-06,-1e-06,-1.3e-05,2e-05,3e-06,-4e-06,7e-06,5e-06,-2e-06,-8e-06,-1.5e-05,-4.5e-05,-3e-05,1e-06,6e-06,-2.6e-05,-3e-06,2.3e-05,-8.8e-05,-2.5e-05,6e-06,-2.8e-05,2e-06,-1.2e-05,6e-05,1.2e-05,-1e-06,-3.3e-05,-1.6e-05,-9e-06,8e-06,-4.8e-05,1e-06,3.3e-05,3.2e-05,-1.6e-05,-5e-06,-1.1e-05,-1e-06,3e-06,-1e-06,1e-06,-3e-06
3e-06,4e-06,-8e-06,-7e-06,6e-06,1e-06,-2e-06,1e-06,0,2e-06,-1.3e-05,-4.9e-05,-6.9e-05,1e-06,-1.3e-05,2e-06,-8e-06,-4e-06,1e-05,0.000192,-0.000526,8.7e-05,8.2e-05,-0.000113,-4e-05,-0.000192,-5.5e-05,0.000192,3.7e-05,-0.000108,-0.000226,3e-06,-5.1e-05,9.4e-05,8.9e-05,-2e-06,-3.1e-05,6.6e-05,-0.000122,3.4e-05,-8.5e-05,7.6e-05,-5.4e-05,1.2e-05,6.5e-05,-0.000161,-0.000184,7.5e-05,3e-06,8e-05,-5.5e-05,5e-06,0.000122,2.2e-05,5.5e-05,3.7e-05,-8.9e-05,-2.8e-05,1.8e-05,1.8e-05,-2.7e-05,-3.8e-05,-1.2e-05,4.3e-05,-8e-06,-4e-06,-7e-06,1.9e-05,1.5e-05,-8e-06,-2e-06,-6e-06,5e-06,0,0,-8e-06,-1e-05,3e-06,8e-06,-4e-06,2e-06,-1.7e-05,-3e-06,-5e-06,7e-06,-7e-06,7e-06,-3e-06,1e-05,-3.3e-05,2e-05,-3e-06,-4.1e-05,0,-1.9e-05,-2e-06,5e-05,-2.7e-05,-9e-06,-2.9e-05,4e-06,-4.2e-05,-0.000258,4e-06,-8e-06,-8.8e-05,-4.3e-05,-6.9e-05,1.1e-05,0,8e-06,1.9e-05,-1.2e-05,5e-06,9e-06,0,1e-06,2e-06,6e-06,-1e-06,7e-06
1e-06,-4e-06,1.5e-05,1.4e-05,-6e-06,6e-06,3e-06,-4e-06,0,7e-06,1.9e-05,-3.5e-05,-1.9e-05,-1e-06,8e-06,7e-06,2.6e-05,4e-06,0,-7e-06,-9.5e-05,0.000114,0.000131,-0.000105,1.9e-05,-0.000146,6.7e-05,-2.1e-05,5e-06,3.1e-05,-8.2e-05,-1e-06,8.7e-05,-0.000232,5e-06,-5.9e-05,-9e-06,-0.00013,0.000102,-1.5e-05,-4.6e-05,8.4e-05,0.000159,-0.000169,-0.000219,-2.8e-05,-6.4e-05,-9.4e-05,5.8e-05,-6.4e-05,6.9e-05,3.6e-05,-6e-05,-4.2e-05,-1e-05,-3.7e-05,1.7e-05,5e-06,-1.6e-05,-3e-06,9e-06,1.6e-05,1.1e-05,-1.2e-05,-9e-06,1.3e-05,9e-06,1e-06,1.7e-05,1.1e-05,-7e-06,-9e-06,-2e-06,2e-06,8e-06,1.1e-05,-6e-06,-1.6e-05,5e-06,-9e-06,-4e-06,1e-06,-5e-06,5e-06,0,-2e-06,-4e-06,7e-06,-2e-06,2.8e-05,2e-05,1e-06,2.8e-05,3.7e-05,1.5e-05,5e-06,5.7e-05,4e-06,1.5e-05,6.7e-05,-1e-06,-6.2e-05,-1.3e-05,4.9e-05,-1.1e-05,5.1e-05,4e-05,-8e-06,5e-06,4.5e-05,0,-5.2e-05,-1.8e-05,-8e-06,-1e-05,3e-06,4e-06,-1e-06,-7e-06,-1e-06,-2.3e-05
-5e-06,-1e-06,-6e-06,-1e-05,6e-06,-9e-06,-3e-06,2e-06,0,1e-06,-4e-06,0.000122,-5e-06,-6e-06,1e-06,-3e-06,-1.3e-05,-4e-06,-5e-06,-0.000111,0.000208,4.3e-05,6e-06,0.000168,3.1e-05,6.6e-05,0.000138,-3e-06,2.6e-05,-3.1e-05,-9.8e-05,-1.3e-05,-1.4e-05,-9.2e-05,4.8e-05,-5.6e-05,-2.2e-05,1.8e-05,-0.000204,0.000222,-0.000156,-1.7e-05,-0.000214,8e-05,-6.2e-05,8.2e-05,7.2e-05,7.8e-05,4e-06,-5.1e-05,1.7e-05,-8.4e-05,-3.4e-05,5e-06,1.2e-05,3.7e-05,3.3e-05,9e-06,0,1.2e-05,9e-06,1.1e-05,4e-06,-9e-06,3e-06,0,-9e-06,-2.4e-05,-1.1e-05,-1e-06,0,1.4e-05,-9e-06,6e-06,-4e-06,1.1e-05,1e-05,-1e-06,-1e-05,0,-2e-06,4e-06,3e-06,0,-7e-06,7e-06,-2e-06,3e-06,-2e-06,-1e-06,-2.2e-05,-1e-06,2.6e-05,-3.2e-05,-7e-06,-1.6e-05,1.2e-05,8e-06,-2.4e-05,-6.3e-05,0,2.7e-05,0.000125,-5.8e-05,1.2e-05,-5.6e-05,-1.3e-05,-3e-06,2e-06,2e-05,-1e-05,2.3e-05,1.7e-05,0,0,1e-06,-3e-06,1e-06,0,1e-06,2.7e-05
-2e-06,-2e-06,5e-06,9e-06,-4e-06,3e-06,2e-06,0,0,-4e-06,5e-06,-9e-05,-2.5e-05,4e-06,-2e-06,-4e-06,1.4e-05,4e-06,1e-06,-8.7e-05,9.4e-05,6.2e-05,-7.5e-05,-0.000102,-6.3e-05,5.7e-05,6.2e-05,0,-4e-06,1.9e-05,0.000155,0,3.2e-05,1e-06,1.9e-05,-2.6e-05,5.5e-05,2.1e-05,1e-04,1.6e-05,0.000134,-2.9e-05,0.000129,1.5e-05,7.5e-05,1.5e-05,4.7e-05,-2.9e-05,4e-06,5.3e-05,1e-05,7.2e-05,3e-06,1.6e-05,-4.5e-05,3.2e-05,-3e-05,4e-06,8e-06,-4e-06,-2e-05,-6e-06,-1.4e-05,-8e-06,1.2e-05,-1.3e-05,1.4e-05,1.6e-05,6e-06,0,-2e-06,2e-06,0,-1e-05,-3e-06,-1e-06,-6e-06,-1.1e-05,1.4e-05,1e-06,3e-06,6e-06,3e-06,-1e-06,0,-5e-06,-5e-06,-3e-06,1e-06,-7e-06,4e-06,2e-06,-7e-06,-7e-06,-2e-06,5e-06,3.5e-05,-1e-06,-1e-06,3e-05,2e-06,1e-05,-8.4e-05,-1.1e-05,-9e-06,5e-06,-7e-06,4.6e-05,4e-06,-2.5e-05,0,-4.8e-05,-5.7e-05,3e-06,-5e-06,4e-06,1e-06,4e-06,2e-06,-1e-06,-2.7e-05
6e-06,-1e-06,2e-06,-8e-06,6e-06,2e-06,-1e-06,3e-06,0,-3e-06,-2.1e-05,9.6e-05,3e-06,1e-06,4e-06,-9e-06,-1.1e-05,-3e-06,4e-06,-0.000138,-6.9e-05,2e-06,4e-06,0.000202,-5.1e-05,-2.4e-05,3.7e-05,6.3e-05,-2.1e-05,-1.9e-05,-6e-06,-5e-06,-8.3e-05,4.6e-05,-0.000166,2e-05,-4.1e-05,-9.9e-05,-0.000115,0.000154,4.1e-05,-2.5e-05,-9e-06,-1e-06,4.5e-05,-0.000142,4.1e-05,6.2e-05,-4.9e-05,-7.8e-05,-4.6e-05,2.9e-05,-7.1e-05,-1e-06,4.7e-05,-6.3e-05,-1.4e-05,-1.5e-05,-1e-05,-1.2e-05,1.5e-05,8e-06,-3e-06,1.6e-05,-3e-06,-3e-06,-1.1e-05,-6e-06,-1e-06,3e-06,-5e-06,-1e-06,4e-06,8e-06,3e-06,-8e-06,-1e-05,1e-05,-1.5e-05,0,6e-06,-4e-06,-2e-06,-2e-06,1e-06,2e-06,7e-06,-1e-06,3e-06,6e-06,1.3e-05,-4e-06,-2e-06,1.4e-05,2.5e-05,5e-06,-2.4e-05,3e-06,-2.4e-05,1.5e-05,0,2.2e-05,2.2e-05,2.2e-05,1.1e-05,-1.7e-05,-2e-05,-8e-06,3e-06,-4.2e-05,3e-06,2.4e-05,3.7e-05,-7e-06,-6e-06,4e-06,-5e-06,-1e-06,-2e-06,0,1.3e-05
0,2e-06,2e-06,9e-06,-4e-06,0,-1e-06,-3e-06,0,2e-06,1e-06,-5.4e-05,7e-06,-1.7e-05,3e-06,8e-06,5e-06,2e-06,-2e-06,-8.2e-05,-5.9e-05,2.6e-05,0.000101,-0.000134,4.8e-05,8.1e-05,-5.3e-05,-3.1e-05,3.2e-05,-1.7e-05,4e-06,4.3e-05,1.8e-05,-8.4e-05,1.6e-05,3.1e-05,8e-06,-6.4e-05,0.000111,9.7e-05,0.000102,3.4e-05,-1.1e-05,-1.4e-05,-0.000174,-1.6e-05,4.1e-05,4.5e-05,1.6e-05,0.000124,-1.3e-05,-3.6e-05,2.9e-05,4e-06,-3.2e-05,5.5e-05,3.7e-05,-1e-06,2.3e-05,1e-06,-6e-06,6e-06,1e-05,-2e-05,-4e-06,-1e-06,1.2e-05,3e-06,6e-06,-5e-06,2e-06,-4e-06,6e-06,-4e-06,-1e-06,3e-06,8e-06,1.1e-05,1e-05,2e-06,1e-06,-6e-06,2e-06,6e-06,-1e-06,0,-5e-06,-2e-06,1e-06,-1.4e-05,1e-06,2e-06,-4.2e-05,6e-06,-2.7e-05,1e-06,-6.5e-05,9e-06,2.2e-05,-4.9e-05,-2e-06,3e-06,5.4e-05,-7.5e-05,-1e-05,2.2e-05,2.5e-05,-2.1e-05,2e-06,-1e-06,-5e-06,-1.4e-05,-8e-06,-1.3e-05,-2e-06,3e-06,3e-06,2e-06,-1e-06,0,-8e-06
-4e-06,-1e-06,1e-06,-1.1e-05,2e-06,-3e-06,0,2e-06,0,3e-06,2e-06,-5.9e-05,2.2e-05,4e-06,-6e-06,3e-06,-1.5e-05,-1e-06,-2e-06,3e-05,3e-06,2e-05,8e-05,-9.6e-05,-2e-06,-0.000151,-8.2e-05,-6.8e-05,-1.5e-05,1e-05,-5.2e-05,-1.8e-05,7.6e-05,4.8e-05,7.5e-05,-3.6e-05,-3e-05,7.7e-05,-2.4e-05,-6.1e-05,-8.7e-05,1.5e-05,0.000116,-1.6e-05,-7.5e-05,2.7e-05,-3.4e-05,0,3e-06,-1.2e-05,2.8e-05,4.4e-05,-4.3e-05,-7e-06,1.2e-05,-3.1e-05,-1.5e-05,1e-05,-3.1e-05,0,-3e-06,-1.1e-05,-4e-06,3e-06,1e-06,1.2e-05,-1.2e-05,0,-1.6e-05,-5e-06,-3e-06,-4e-06,1e-06,-1e-06,4e-06,-1e-06,0,-1.3e-05,-1.2e-05,5e-06,-3e-06,2e-06,-5e-06,-4e-06,-2e-06,-2e-06,-4e-06,4e-06,-5e-06,7e-06,-1.2e-05,-2e-06,2.2e-05,0,1.7e-05,-6e-06,2.1e-05,-6e-06,-1.7e-05,6e-05,-3e-06,-4.2e-05,-8.2e-05,1.6e-05,7e-06,-1.8e-05,-2e-06,1e-05,2e-06,1.3e-05,-3e-06,1.5e-05,3.2e-05,3e-06,-2e-06,-4e-06,2e-06,2e-06,2e-06,-1e-06,8e-06
1e-06,1e-06,-5e-06,7e-06,-1e-06,4e-06,0,-2e-06,0,0,1e-06,8.4e-05,3e-05,7e-06,2e-06,-7e-06,9e-06,0,2e-06,5.4e-05,-1.9e-05,2e-05,-6.5e-05,7.9e-05,-4.1e-05,-4.7e-05,-2.1e-05,-2.6e-05,-7e-06,-4e-05,2.9e-05,-9e-06,-7.7e-05,-4e-06,4e-06,-4.8e-05,6e-05,-1.2e-05,-2e-06,-3.4e-05,-2.3e-05,8e-06,-0.000177,-3.5e-05,8.2e-05,3e-06,-6.8e-05,7.3e-05,-5e-05,2.1e-05,7e-06,-9.9e-05,-1.6e-05,6e-06,-1.8e-05,-2.1e-05,-3.3e-05,-7e-06,2.8e-05,9e-06,9e-06,-1e-06,-3e-06,5e-06,2e-06,2e-06,1.2e-05,-7e-06,3e-06,9e-06,0,7e-06,-4e-06,4e-06,-4e-06,-5e-06,-8e-06,-4e-06,1.1e-05,1e-06,1e-06,1e-05,3e-06,-2e-06,1e-06,4e-06,1e-06,2e-06,2e-06,2e-06,4e-06,1e-06,8e-06,-5e-06,-8e-06,-2e-06,1.7e-05,-1e-05,2e-06,-4.3e-05,-3e-06,0,-4.9e-05,-1.5e-05,-4e-06,-3.6e-05,-1.9e-05,1.1e-05,0,-7e-06,0,6e-06,-2.8e-05,1e-06,-1e-06,-3e-06,-1e-06,0,0,0,5e-06
2e-06,-1e-06,3e-06,-6e-06,1e-06,-1e-06,1e-06,2e-06,0,-3e-06,1.9e-05,-6.6e-05,1.8e-05,-8e-06,-1e-06,-1e-06,-1e-06,0,1e-06,4.1e-05,4.3e-05,-6e-06,-5.2e-05,2.9e-05,-4.3e-05,1.4e-05,2e-06,5.4e-05,3.3e-05,3.9e-05,4.1e-05,7e-06,7e-06,-1.1e-05,3.9e-05,6e-06,-8e-06,-3.2e-05,0.00011,-0.000139,-1.4e-05,-3.8e-05,1.6e-05,3.5e-05,-7.4e-05,3.2e-05,5e-06,-2.7e-05,6.8e-05,1.4e-05,-1.1e-05,-6.7e-05,1e-06,1e-05,3.4e-05,5.6e-05,1.4e-05,-1e-06,-2.3e-05,2e-06,-9e-06,9e-06,6e-06,2e-05,-4e-06,-7e-06,-1.2e-05,8e-06,1e-05,-4e-06,0,-2e-06,-4e-06,-1e-06,-1e-06,1e-06,1.2e-05,0,-3e-06,-3e-06,-6e-06,-7e-06,2e-06,4e-06,0,0,1e-06,-2e-06,-3e-06,4.3e-05,-4e-06,-1e-06,1.8e-05,3e-06,0,7e-06,6e-06,1e-06,-1.4e-05,9e-06,-3e-06,-7e-06,9.3e-05,-1e-05,1e-06,-8e-06,2e-06,3.8e-05,2e-06,-2.5e-05,1e-06,-1e-05,1.2e-05,0,-2e-06,-4e-06,-2e-06,1e-06,-1e-06,1e-06,-2e-06
1e-06,2e-06,-6e-06,7e-06,-3e-06,0,-1e-06,0,0,-1e-06,-1.3e-05,2e-05,6e-06,-4e-06,3e-06,3e-06,0,0,-2e-06,7.6e-05,-2e-05,-2e-05,3.8e-05,-3.2e-05,3.8e-05,5.3e-05,2e-05,-8.5e-05,-3.6e-05,5e-06,3.7e-05,1.4e-05,3.7e-05,-9.5e-05,-5e-06,4e-05,-1.4e-05,2.2e-05,-6.1e-05,-8e-06,5.2e-05,4e-06,9.1e-05,2.4e-05,-5.7e-05,-8.2e-05,6.9e-05,5.6e-05,-1.8e-05,-4.7e-05,-1.7e-05,4.8e-05,-5.2e-05,-3e-06,-4.4e-05,-3.9e-05,1.2e-05,3e-06,1.3e-05,-2e-06,-3e-06,-1.8e-05,1e-06,-1.5e-05,-2e-06,-4e-06,1e-05,-3e-06,-4e-06,1e-06,3e-06,1e-06,3e-06,4e-06,3e-06,0,1e-06,4e-06,-3e-06,3e-06,1e-06,-3e-06,-3e-06,-1e-06,-1e-06,-4e-06,-2e-06,-2e-06,4e-06,-1e-05,-1e-06,1e-06,-1e-06,-9e-06,3e-06,2e-06,4.9e-05,-6e-06,1e-06,2.5e-05,-1e-06,1.1e-05,4e-05,-4e-06,4e-06,1.1e-05,9e-06,-9e-06,2e-06,-9e-06,4e-06,2.1e-05,2e-06,-5e-06,-1e-06,-4e-06,1e-06,2e-06,1e-06,-1e-06,0
-1e-06,0,3e-06,-8e-06,2e-06,-1e-06,0,0,0,2e-06,1.1e-05,6e-06,-5e-06,5e-06,-2e-06,0,3e-06,0,0,3.4e-05,-2.1e-05,-3.9e-05,6.7e-05,2.9e-05,-4e-06,6.7e-05,0,-5.1e-05,1.4e-05,1e-05,-1.9e-05,0,-1.5e-05,2.9e-05,-0.000105,2.6e-05,-4e-06,8e-06,4.3e-05,-1e-04,3.2e-05,9e-06,-7.5e-05,-4.3e-05,4.5e-05,-2e-06,5.6e-05,-2e-05,1.3e-05,3.4e-05,0,1e-05,2.8e-05,-1.4e-05,3.7e-05,3e-06,-1.6e-05,-2e-06,0,-7e-06,7e-06,1e-05,-8e-06,0,4e-06,-2e-06,-7e-06,-1e-06,-4e-06,2e-06,1e-06,-5e-06,2e-06,-3e-06,0,-1e-06,-9e-06,1e-05,1e-06,0,-1e-06,3e-06,0,-1e-06,0,2e-06,-4e-06,0,-5e-06,-8e-06,-1e-06,-1e-06,-2.7e-05,-5e-06,-7e-06,-3e-06,-2.2e-05,-1.1e-05,1e-06,-4.4e-05,0,1.6e-05,-8.5e-05,2.9e-05,-5e-06,-2.5e-05,7e-06,-5e-06,1e-06,1.9e-05,2e-06,-2.2e-05,-1.6e-05,-8e-06,-4e-06,-2e-06,1e-06,1e-06,1e-06,0,-4e-06
-2e-06,1e-06,-5e-06,4e-06,-1e-06,-2e-06,0,-1e-06,0,1e-06,-1.3e-05,1e-05,-1e-05,-9e-06,-6e-06,0,-5e-06,0,2e-06,-4.2e-05,4e-05,-3.7e-05,-6e-06,-3.3e-05,-7e-06,-3e-06,1.3e-05,4e-05,2.3e-05,-3.7e-05,-4.6e-05,-2.7e-05,2.6e-05,1.5e-05,7e-06,-2.2e-05,1.1e-05,-3.3e-05,2e-05,-4e-06,-2.7e-05,1.6e-05,1e-04,1.3e-05,5e-06,1e-06,-2.4e-05,4.1e-05,-6e-06,-1.4e-05,1.2e-05,4e-05,-3.4e-05,5e-06,-2.1e-05,3.3e-05,-1e-06,5e-06,-1.1e-05,-1e-06,-9e-06,0,4e-06,-9e-06,-1e-06,4e-06,3e-06,1e-06,-3e-06,-4e-06,1e-06,3e-06,0,1e-06,0,0,9e-06,-7e-06,1e-06,-5e-06,4e-06,4e-06,-2e-06,1e-06,2e-06,2e-06,3e-06,2e-06,3e-06,-2.2e-05,1e-06,0,-2e-06,7e-06,5e-06,-3e-06,-2.2e-05,-3e-06,-1e-05,3.9e-05,0,-1.2e-05,-8e-06,-1.6e-05,5e-06,0,-1.3e-05,2e-06,-1e-06,1.3e-05,0,1.1e-05,1e-06,1e-05,-2e-06,0,0,0,-1e-06,0,0
1e-06,-2e-06,3e-06,-4e-06,1e-06,4e-06,0,0,0,-1e-06,-4e-06,-1.4e-05,-1.9e-05,-2e-06,6e-06,-2e-06,5e-06,0,0,-2.7e-05,1e-04,-3.8e-05,-5.7e-05,-8.5e-05,-1.2e-05,-2.8e-05,-1.8e-05,-1.1e-05,-3.8e-05,3.5e-05,-6e-06,1.8e-05,-3.9e-05,-4.3e-05,6.1e-05,-2.8e-05,-2.8e-05,1.2e-05,8e-06,-5e-06,-1.5e-05,-1.6e-05,-6.2e-05,-1.2e-05,-0.000119,-4e-05,-4.5e-05,3e-06,-2.3e-05,-9e-06,3e-06,4.1e-05,-5e-06,6e-06,1.3e-05,-6e-05,1.3e-05,-3e-06,1.7e-05,1e-06,9e-06,-3e-06,2e-06,8e-06,-2e-06,2e-06,0,-4e-06,1e-05,-2e-06,1e-06,4e-06,1e-06,1e-06,-1e-06,5e-06,1e-06,-4e-06,5e-06,2e-06,0,-3e-06,3e-06,0,1e-06,-3e-06,1e-06,0,-1e-06,7e-06,1e-06,0,-6e-06,6e-06,1e-06,5e-06,5e-06,0,-3e-06,-1.6e-05,1e-06,-3e-06,5.3e-05,3.1e-05,-5e-06,-2.1e-05,1e-06,1.6e-05,0,-3e-06,-1e-06,-2.2e-05,-1e-06,-5e-06,0,1e-06,-1e-06,0,1e-06,1e-06,-6e-06
3e-06,-1e-06,0,7e-06,-1e-06,-4e-06,0,1e-06,0,-1e-06,2e-06,2e-05,-1.5e-05,9e-06,-7e-06,-4e-06,-2e-06,0,-2e-06,-3.4e-05,-9e-06,-2.1e-05,-1.7e-05,0.00014,2.7e-05,-3e-06,8e-06,-1.6e-05,2.8e-05,-1.2e-05,-6e-06,4e-06,1.6e-05,9e-06,3e-06,1.2e-05,2.7e-05,-1.1e-05,2.7e-05,0.000161,-1.7e-05,-1.5e-05,-1.8e-05,-5e-06,-1.2e-05,2.6e-05,-3.3e-05,1.3e-05,2.8e-05,1.2e-05,-8e-06,-5.8e-05,2.8e-05,-3e-06,-2.3e-05,2.3e-05,-9e-06,1e-06,-1.5e-05,5e-06,0,5e-06,-3e-06,3e-06,2e-06,1e-06,-2e-06,5e-06,-9e-06,5e-06,-1e-06,1e-06,-1e-06,-4e-06,0,0,-1.1e-05,3e-06,-7e-06,0,2e-06,-3e-06,1e-06,-1e-06,-1e-06,1e-06,-2e-06,-1e-06,2e-06,0,0,0,2.3e-05,-8e-06,0,2e-06,-3.5e-05,-1e-06,-8e-06,-1.4e-05,2e-06,-1.1e-05,-1.5e-05,-1e-06,4e-06,2e-05,-5e-06,1.2e-05,-1e-06,-5e-06,0,1.3e-05,4e-06,-3e-06,-2e-06,2e-06,-2e-06,1e-06,0,-1e-06,5e-06
-2e-06,0,3e-06,-5e-06,0,1e-06,0,0,0,0,-5e-06,-2e-06,-2.2e-05,-8e-06,4e-06,4e-06,4e-06,0,0,-5.5e-05,-6.7e-05,-3e-06,4e-05,-4.9e-05,3.6e-05,-5.4e-05,1.4e-05,-9e-06,3e-06,-8e-06,2.3e-05,3e-06,3.9e-05,-9e-06,2.3e-05,2.5e-05,-1e-06,-4.4e-05,-1.4e-05,-1.6e-05,4.4e-05,1.3e-05,6.8e-05,2.1e-05,6.9e-05,-1.9e-05,-8e-06,1e-06,-3.9e-05,-6.4e-05,-1.4e-05,-1.7e-05,-3.7e-05,-4e-06,2.9e-05,1.6e-05,-1.6e-05,-2e-06,1.4e-05,3e-06,-8e-06,2e-06,1e-06,-2e-06,1e-06,-1e-06,6e-06,-3e-06,-1e-06,0,1e-06,-3e-06,-1e-06,4e-06,0,-3e-06,7e-06,3e-06,1e-06,-3e-06,-1e-06,-1e-06,-2e-06,1e-06,0,0,-2e-06,-1e-06,-1e-06,-2e-06,-2e-06,0,5e-06,2e-06,4e-06,-1e-06,0,-3e-06,7e-06,3.6e-05,2e-06,-4e-06,-9e-06,1e-05,-3e-06,-2.4e-05,7e-06,-1.7e-05,0,9e-06,-1e-06,-6e-06,-6e-06,-1e-06,0,3e-06,1e-06,-1e-06,-1e-06,1e-06,2e-06
-3e-06,0,1e-06,4e-06,0,2e-06,0,1e-06,0,1e-06,1.3e-05,-5e-05,-8e-06,-5e-06,-6e-06,2e-06,-8e-06,0,2e-06,-2.2e-05,-4.9e-05,4e-06,2.8e-05,8e-06,-2.6e-05,6.7e-05,1.7e-05,2.9e-05,-2.9e-05,1.3e-05,-3.3e-05,-1.4e-05,-5.5e-05,-3.3e-05,-8e-06,1.3e-05,1e-06,1.5e-05,1.9e-05,8.3e-05,-4e-06,4e-06,-0.000108,1e-06,-8.9e-05,-4e-06,5e-06,2e-06,2.9e-05,2.5e-05,-6e-06,-1.3e-05,3.9e-05,3e-06,-2.3e-05,-5e-05,8e-06,2e-06,-1.3e-05,-3e-06,1e-05,-3e-06,2e-06,-2e-06,-3e-06,-2e-06,-9e-06,-1e-06,5e-06,-2e-06,0,-3e-06,0,-2e-06,1e-06,1e-06,1e-06,4e-06,2e-06,2e-06,-3e-06,4e-06,0,0,-1e-06,0,4e-06,0,1e-06,2e-06,-1e-06,0,-4e-06,5e-06,-4e-06,-5e-06,3.7e-05,1e-06,-7e-06,-3.9e-05,0,1.1e-05,1.4e-05,-4e-06,2e-06,-6e-06,-7e-06,-1e-05,0,1.2e-05,-1e-06,6e-06,2e-05,-1e-06,-3e-06,2e-06,1e-06,0,0,0,1e-06
1e-06,1e-06,-2e-06,-4e-06,1e-06,-1e-06,0,-1e-06,0,0,-1e-06,4.4e-05,0,7e-06,0,-4e-06,5e-06,0,0,1.3e-05,1.8e-05,1.8e-05,-3.2e-05,-2.5e-05,1.5e-05,2.9e-05,7e-06,4.4e-05,3.3e-05,-1.2e-05,1.1e-05,0,2.3e-05,-5.2e-05,-6.4e-05,-2.4e-05,-6e-06,2e-05,-4.8e-05,6e-06,2e-06,4e-06,7.8e-05,-2.6e-05,-8.9e-05,-9e-06,3.2e-05,-1.7e-05,5e-06,-4e-06,1.1e-05,-4e-05,0,2e-06,1.7e-05,5.4e-05,1e-05,1e-06,8e-06,-3e-06,-7e-06,4e-06,-2e-06,3e-06,-2e-06,-1e-06,1.3e-05,1e-06,1e-06,1e-06,0,2e-06,0,1e-06,-1e-06,2e-06,-8e-06,-4e-06,-1e-06,2e-06,0,-1e-06,0,-1e-06,0,1e-06,0,1e-06,0,-1.6e-05,4e-06,0,-1.1e-05,-6e-06,3e-06,2e-06,-1e-06,0,2e-06,2.2e-05,-1e-06,0,-2e-06,6e-06,1e-06,-9e-06,4e-06,2e-06,-1e-06,-3e-06,0,9e-06,6e-06,4e-06,1e-06,1e-06,0,1e-06,0,0,0
2e-06,-1e-06,4e-06,7e-06,0,0,0,0,0,-1e-06,1e-06,-9e-06,1.2e-05,-4e-06,3e-06,-2e-06,-7e-06,0,-2e-06,3e-06,3.7e-05,1.5e-05,-5.8e-05,1.2e-05,3.1e-05,2e-06,-1e-06,-3.5e-05,-1.7e-05,6e-06,-3e-05,1.6e-05,1.8e-05,5e-06,-2e-06,-2.5e-05,1e-05,-4.2e-05,7e-06,1.5e-05,-3.5e-05,-1.8e-05,3.5e-05,1.3e-05,9.4e-05,-4.2e-05,3.5e-05,-2.1e-05,-1.7e-05,-8e-06,6e-06,1.9e-05,-6e-06,-1e-06,-2.3e-05,-1.1e-05,-1.2e-05,-4e-06,-2e-06,-3e-06,1e-06,0,-1e-06,-1e-06,3e-06,-1e-06,-1.5e-05,0,-3e-06,-2e-06,1e-06,1e-06,1e-06,1e-06,-1e-06,-1e-06,5e-06,-5e-06,0,-1e-06,-2e-06,-4e-06,1e-06,0,-1e-06,-2e-06,-1e-06,1e-06,0,1e-06,-5e-06,0,-1.3e-05,2e-06,1e-06,3e-06,1e-05,-5e-06,-1.7e-05,6e-06,-1e-06,3e-06,-1.8e-05,-1.5e-05,-3e-06,-1e-05,-5e-06,4e-06,-1e-06,-1.2e-05,0,-1.4e-05,-9e-06,-3e-06,-4e-06,-1e-06,-1e-06,0,-1e-06,0,1e-06
-1e-06,1e-06,-5e-06,-5e-06,-1e-06,-1e-06,0,0,0,0,0,-2.1e-05,1.7e-05,-5e-06,-5e-06,1e-06,7e-06,0,0,1.3e-05,-1.8e-05,1.8e-05,7e-06,-7.5e-05,3e-06,-2.5e-05,-1.4e-05,-1.1e-05,-2.3e-05,-1.8e-05,3.3e-05,-1.1e-05,-2.5e-05,-5e-06,3.8e-05,5e-06,-1.2e-05,-1.4e-05,-2.1e-05,-0.000127,2.3e-05,1.4e-05,-7.6e-05,-1e-05,5e-06,1e-06,-2.1e-05,-3.6e-05,2.6e-05,5.7e-05,1e-06,1.8e-05,3.7e-05,1e-06,3.3e-05,-3.3e-05,-4e-06,0,-4e-06,2e-06,5e-06,-7e-06,1e-06,-1e-06,1e-06,2e-06,1.5e-05,3e-06,-4e-06,1e-06,-1e-06,1e-06,0,-2e-06,1e-06,-1e-06,4e-06,2e-06,-4e-06,0,3e-06,-2e-06,0,0,1e-06,-1e-06,-1e-06,-1e-06,0,-1e-06,2e-06,0,1.3e-05,1e-06,-6e-06,0,1e-06,-4e-06,9e-06,-3.1e-05,-1e-06,-4e-06,-2e-06,2e-06,3e-06,2e-06,2e-06,-3e-06,0,-4e-06,1e-06,1.4e-05,-7e-06,-3e-06,1e-06,-3e-06,0,0,0,0,-4e-06
