-0.000421,-0.00026,-0.000443,-5e-04,-6e-05,-0.000305,-0.000489,-0.000299,-0.000153,-0.000209,-0.000201,-0.000502,-0.000631,-0.000434,-5.2e-05,-2.3e-05,-0.000143,-0.000313,-0.000401,-0.000507,-0.000244,-0.000134,-0.000301,-0.000251,-0.000362,-0.000713,-0.000448,-0.000373
-0.000551,-0.000347,-0.000677,-0.000806,-0.000294,-0.000425,-0.00061,-0.000526,-0.000453,-0.000597,-0.000534,-0.000653,-0.000766,-0.00061,-0.000293,-0.00025,-0.000195,-0.000388,-0.000428,-0.000655,-0.000416,-0.000301,-0.000496,-0.000459,-6e-04,-0.00097,-0.000681,-0.00067
-0.00022,-0.000164,-0.000248,-0.000272,-0.000237,-3.1e-05,-0.000126,-0.000362,-0.000245,-0.00037,-0.000399,-0.000141,-0.000164,-0.000109,-0.000145,-0.000344,-0.000194,-0.000332,-0.000262,-5.1e-05,-5e-05,-0.000238,-0.000459,-0.000354,-0.000333,-0.00028,-0.00037,-0.000406
0.00026,0.000211,0.000506,0.000576,8.8e-05,0.000479,0.000435,-8.6e-05,3.2e-05,1e-04,4.3e-05,0.000567,0.000608,0.000506,0.000222,-3.7e-05,1e-04,0.000161,0.000242,0.000642,0.000444,0.000117,1e-05,3.2e-05,0.000168,0.000674,0.000389,0.000224
0.000258,0.000118,0.000398,0.000456,-3.4e-05,0.000183,0.000175,-0.000219,-0.000219,-3.2e-05,4e-06,0.000359,0.000414,0.00037,5.7e-05,-0.000112,0.000126,0.000366,0.000403,0.000499,0.000356,0.000136,0.000283,0.000125,0.000205,0.000589,0.000407,0.00032
-0.000352,-0.000516,-0.00034,-0.000286,-0.000556,-0.00061,-0.000605,-0.000663,-0.000785,-0.000678,-0.000429,-0.000431,-0.000523,-0.000444,-0.000597,-0.000658,-0.000256,-4e-06,-0.000143,-0.000377,-0.000283,-0.000207,-7.9e-05,-0.000177,-0.000159,-0.000286,-0.000226,-0.000147
-0.000559,-6e-04,-0.000564,-0.000483,-0.000605,-0.000745,-0.000642,-0.000433,-0.000665,-0.000729,-0.000462,-0.000697,-0.000788,-0.000789,-0.000727,-0.000579,-0.000333,-0.000229,-0.000331,-0.00067,-0.000634,-0.000346,-0.000262,-0.000287,-3e-04,-0.000708,-0.000499,-0.000307
-0.000132,-7.9e-05,-0.000168,-0.000136,-0.000225,-0.000206,9.9e-05,0.000412,0.000119,2.4e-05,-3.4e-05,-0.000252,-0.000176,-0.000317,-0.000251,-4.4e-05,-0.000102,-0.000137,2e-06,-9.7e-05,-0.000362,-0.000269,-6.2e-05,2.7e-05,-2.4e-05,-0.000315,-0.000299,-9e-06
0.000246,0.000246,0.000329,0.000176,-3.2e-05,0.000198,0.000549,0.000714,0.000517,0.000606,0.000338,3e-04,0.000425,0.000216,0.000172,0.000238,-1e-05,-7.3e-05,0.000149,0.000385,5.3e-05,-0.000172,3e-05,0.00035,0.000317,0.000319,8.8e-05,0.000194
0.000267,0.000234,0.000383,2.4e-05,-0.000103,6.5e-05,0.000325,0.00038,0.000297,0.000487,0.000335,0.000392,0.000439,0.000278,0.000209,0.000322,5e-06,-6.9e-05,9.9e-05,0.000332,3.3e-05,-0.00018,7.9e-05,0.000268,0.000232,0.000346,0.000239,3.7e-05
5.1e-05,1.9e-05,-3.1e-05,-0.000327,-0.000174,-0.000349,-0.000194,4.2e-05,-1.2e-05,4.7e-05,0.000138,0.000107,-5e-06,-1.7e-05,-0.000134,0.000117,-3.2e-05,-2.6e-05,-0.000166,-0.000241,-0.000289,-0.000243,8.2e-05,-4.4e-05,-0.000131,-0.000168,-1.1e-05,-0.000257
-6.1e-05,-0.000169,-0.000374,-0.000312,-3.9e-05,-0.000398,-0.000399,-5.3e-05,-2.9e-05,-0.000181,3.9e-05,-0.000183,-0.00032,-0.000158,-0.000295,-0.000154,-0.000143,-0.000111,-0.000366,-0.000608,-0.000368,-0.000114,-3.5e-05,-0.000258,-0.000284,-0.000441,-0.000185,-0.000334
1.6e-05,2.8e-05,-0.00023,4.1e-05,0.000283,3.1e-05,-8.6e-05,-4.6e-05,0.000134,-0.000112,6e-06,-0.000167,-0.000155,-1.8e-05,-4e-05,-4.4e-05,-0.000103,-0.000106,-0.000107,-0.000281,-0.000142,0.00016,1.9e-05,-0.000306,-0.000173,-0.000162,-7.2e-05,-1.2e-05
0.00011,0.000393,0.00018,0.000236,0.00035,0.000436,0.000249,-0.000246,0.000132,5.6e-05,-5.3e-05,9.8e-05,0.000224,0.000186,0.000221,9.3e-05,1.9e-05,7.7e-05,0.000173,0.000176,5.6e-05,0.000127,5.9e-05,-0.00018,4.4e-05,0.000282,0.00015,0.000323
-3.2e-05,0.000268,0.000301,0,4e-05,0.000275,5.3e-05,-0.000595,-0.000211,-9.4e-05,-0.000214,0.000225,0.000258,0.000128,0.000135,-8.7e-05,-2.1e-05,5.8e-05,6.7e-05,0.000239,6e-06,-0.000243,-0.000235,-9.2e-05,8e-05,0.000419,0.000239,0.00019
-0.00021,-6e-06,0.000147,-0.000232,-0.000173,-0.000142,-0.000274,-0.000518,-0.000386,-0.000378,-0.000285,0.000185,0.000136,4.8e-05,-9.8e-05,-0.000139,2.3e-05,0.000129,4.3e-05,-1.8e-05,-0.000129,-0.000249,-0.000308,-8.5e-05,-9.4e-05,0.000132,0.000133,-8.3e-05
-0.000192,-0.000167,-0.000201,-0.000294,-0.000256,-0.000313,-0.000242,-3.9e-05,-0.00027,-0.000377,-0.000181,-9.9e-05,-0.000123,-5.7e-05,-0.000304,-0.000129,7e-05,0.000127,-0.000176,-0.000419,-0.000206,4.9e-05,-0.000117,-5.2e-05,-2e-04,-0.000286,-6.2e-05,-0.000161
-7.2e-05,-0.000278,-0.000532,-0.000255,-0.000189,-0.000198,-4.8e-05,0.000275,-6.8e-05,-0.000201,7e-06,-0.000347,-0.000275,-7.3e-05,-0.000232,-0.000132,-5e-05,-6.6e-05,-0.000266,-0.000393,-0.000116,0.000229,-4.3e-05,-2.5e-05,-7.5e-05,-0.000326,-0.000215,-1e-04
0.000133,-0.000148,-0.000365,2.3e-05,5.2e-05,0.000119,0.000193,0.000266,-5.8e-05,-6e-05,9.9e-05,-0.000257,-0.000149,-8.8e-05,-7.2e-05,-3.2e-05,-4.2e-05,-3.8e-05,0.00011,9.5e-05,0.00011,0.000317,0.000109,0.000145,0.000251,6.6e-05,-6e-05,2.9e-05
