0.001157,0.000469,0.000944,0.001331,0.000218,0.000197,0.00095,0.000397,0.000132,0.000404,8.5e-05,0.000156,0.001096,0.000141,0.000354,0.000738,0.000225,2e-04,0.000286,0.000202,0.000546,4.6e-05,0.000132,3.4e-05,0.000722,0.000417,6.6e-05,0.000558,0.000179,0.000107,0.000696,0.00016,2.6e-05,0.000663,0.00063,1.3e-05,0.000178,1.7e-05,0.000158,5.9e-05,0.000171,0.000221,0.000436,0.000368,0.00036,0.000339,3.6e-05,8.3e-05,1.3e-05,0.000134,0.000677,0.00095,0.001539,0.000946,8.5e-05,0.001023,0.000995,0.000175,0.001875,0.000424,0.001637,0.001402,1.7e-05,0.001205,0.000802,0.002072,0.000921,0.00065,0.001467,0.000738,0.001794,0.000766,0.001159,0.001555,0.001818,0.000903,0.000189,0.00091,0.001176,2e-05,0.001129,0.00045,0.000841,0.001744,0.000448,0.000506,0.002192,0.00088,0.001711,0.002088,0.000185,0.000583,0.000405,0.001125,0.001192,9e-06,0.000917,0.000564,0.001476,0.00102,0.00063,0.000634,0.000603,0.000843,0.000721,0.000977,2e-06,0.000957,0.001171,0.001214,0.001312,0.000819,0.001382,0.000517,0.00049,0.000642,0.000704,0.000601,0.000104,0.001131,0.000994
0.002574,0.001602,0.002078,0.002738,0.00073,0.000751,0.002059,0.000982,0.00026,0.001072,0.000593,0.000477,0.002375,0.000269,0.000821,0.001624,0.000491,0.000426,0.000428,0.000319,0.001389,0.000364,0.000355,0.000117,0.001439,0.000832,0.000311,0.001109,0.000347,0.000306,0.001644,0.000533,0.000109,0.001549,0.001568,5.6e-05,0.000364,9.2e-05,0.000392,0.000169,0.00025,0.000542,0.000939,0.000742,0.000905,0.000633,0.000142,0.000251,0.000108,0.000112,0.001474,0.002131,0.00314,0.002052,0.000427,0.002077,0.002209,0.00047,0.004266,0.001859,0.002651,0.004862,0.001646,0.002578,0.002339,0.0038,0.002444,0.00237,0.002613,0.001098,0.004452,0.003967,0.001898,0.002993,0.001087,0.002779,0.0028,0.000787,0.002733,0.001695,0.002553,0.000668,0.002884,0.002478,9.8e-05,0.001265,0.003197,0.003967,0.00064,0.007255,0.005275,0.002423,0.000545,0.00278,0.001903,0.000807,0.002547,0.001269,0.002508,0.004275,0.001873,0.002016,0.002435,0.002757,0.002071,0.002924,0.001189,0.003118,0.002015,0.001535,0.002416,0.002069,0.003947,0.001344,0.001329,0.000484,0.001812,0.002319,0.001126,0.003725,0.002401
0.002441,0.001448,0.001971,0.003594,0.001371,0.001953,0.003188,0.001694,0.000464,0.001512,0.001597,0.000849,0.003296,0.000213,0.00088,0.001885,0.000283,0.000546,0.001193,0.000774,0.00218,0.000386,0.000943,0.000425,0.001802,0.000817,0.000383,0.00158,0.000823,0.000622,0.002379,0.000559,0.000604,0.001813,0.001758,0.000848,0.000199,0.00088,0.000215,0.00038,0.000191,0.000739,0.001122,0.001686,0.001157,0.001018,0.000619,0.000315,0.000268,0.000246,0.002168,0.002727,0.00385,0.002316,0.001766,0.002887,0.003189,0.000777,0.003537,0.00454,0.003341,0.004505,0.000857,0.00324,0.002651,0.005216,0.00037,0.003241,0.004936,0.002528,0.001832,0.002243,0.002471,0.003882,0.002739,0.000803,0.002179,0.001136,0.003816,0.001738,0.002958,0.001212,0.003526,0.004485,0.001148,0.003939,0.001806,0.000212,0.000794,0.004267,0.001678,0.002713,0.003431,0.003863,0.003145,0.000687,0.003277,0.002337,0.004085,0.004921,0.005317,0.004707,0.002795,0.002353,0.002679,0.000819,0.000718,0.004145,0.00157,0.001728,0.002438,0.000564,0.003191,0.001764,0.000317,0.000984,0.001457,0.0027,0.002327,0.002716,0.002452
0.00477,0.003949,0.001426,0.005697,0.007555,0.006584,0.008825,0.009837,0.006177,0.005339,0.004385,0.002618,0.006582,0.004514,0.00251,0.004572,0.002848,0.001986,0.003703,0.004622,0.001553,0.002561,0.003202,0.002961,0.003935,0.00354,0.000672,0.002676,0.002626,0.002814,0.005161,0.004343,0.002475,0.002992,0.004328,0.003159,0.002255,0.00242,0.002337,0.00119,0.001125,0.00096,0.002858,0.002427,0.004092,0.004921,0.003269,0.001571,0.001261,0.000346,0.003457,0.005244,0.006411,0.004124,0.004619,0.001691,0.006282,0.003545,0.009426,0.006928,0.008074,0.002378,0.002797,0.004515,0.002803,0.000823,0.003393,0.002127,0.006028,0.004739,0.005029,0.003931,0.003653,0.004067,0.007685,0.001552,0.001624,0.003738,0.003474,0.002026,0.001148,0.003784,0.004437,0.005874,0.001942,0.006256,0.001712,0.002413,0.00376,0.001779,0.003873,0.001289,0.00251,0.007148,0.001026,0.002869,0.001362,0.003676,0.002364,0.003475,0.003386,0.003389,0.005914,0.003191,0.00406,0.004465,0.002449,0.003852,0.004473,0.002309,0.005542,0.005149,0.005263,0.005522,0.005127,0.005925,0.003763,0.004339,0.004621,0.005673,0.006946
0.009581,0.008324,0.004167,0.006533,0.011046,0.00316,0.005258,0.006111,0.005058,0.001669,0.007214,0.004482,0.00371,0.005627,0.00084,0.004234,0.002419,0.001086,0.002423,0.00641,0.005295,0.003791,0.001683,0.001563,0.002809,0.003467,0.002974,0.001352,0.00276,0.001054,0.002787,0.004088,0.002253,0.001461,0.003685,0.002646,0.000727,0.000799,0.001421,0.001184,0.000886,0.000933,0.002598,0.002592,0.004411,0.005784,0.004163,0.003099,0.000146,0.00069,0.004002,0.008594,0.014924,0.015536,0.009255,0.011608,0.014225,0.018909,0.014985,0.015898,0.004783,0.012417,0.004178,0.010829,0.001686,0.008155,0.006975,0.006924,0.006833,0.004774,0.001222,0.002844,0.003244,0.006455,0.009021,0.004895,0.003454,0.004513,0.002776,0.002394,0.004058,0.005158,0.003718,0.0073,0.00336,0.010301,0.006972,0.005355,0.000287,0.007555,0.003538,0.002991,0.002373,0.010031,0.0058,0.004236,0.003999,0.002679,0.005955,0.004259,0.007828,0.003345,0.005248,0.005351,0.007096,0.007272,0.003405,0.004471,0.003551,0.005658,0.004646,0.005422,0.00799,0.005261,0.011117,0.006892,0.006272,0.005998,0.004488,0.000991,0.004824
0.006105,0.00238,0.007971,0.004956,0.007036,0.008291,0.007959,0.004454,0.004323,0.00547,0.007221,0.006076,0.001957,0.002232,0.005837,0.004782,0.005323,0.002628,0.003793,0.004704,0.001418,0.001399,0.003286,0.001338,0.002424,0.002107,0.002439,0.00195,0.003698,0.003833,0.001736,0.000891,0.000691,0.002342,0.001604,0.00112,0.001387,0.000823,0.00247,0.001071,0.000791,0.0011,0.002165,0.004184,0.00182,0.003374,0.001112,0.002233,0.00234,0.000965,0.002731,0.003361,0.006299,0.007721,0.006221,0.011672,0.006094,0.016026,0.027757,0.024252,0.027498,0.0287,0.015579,0.011374,0.017194,0.02203,0.005885,0.010903,0.009099,0.015927,0.009607,0.004737,0.008547,0.008097,0.016032,0.006753,0.006364,0.00916,0.000798,0.007463,0.007338,0.010423,0.012113,0.007796,0.003164,0.014118,0.009918,0.013647,0.007879,0.007814,0.009216,0.010329,0.0047,0.013098,0.005004,0.003399,0.004397,0.005437,0.005641,0.007758,0.012346,0.012414,0.008692,0.011152,0.003486,0.011665,0.009928,0.00322,0.007826,0.009659,0.006004,0.004788,0.008017,0.004305,0.011091,0.012243,0.006719,0.013041,0.011451,0.006126,0.006982
0.006288,0.00833,0.013043,0.010879,0.007986,0.006419,0.006479,0.007605,0.00478,0.005469,0.004491,0.006623,0.005115,0.004887,0.007703,0.005801,0.006733,0.006629,0.003198,0.006193,0.007993,0.003629,0.00221,0.001119,0.001286,0.00257,0.002044,0.005115,0.006098,0.003485,0.00218,0.001413,0.000659,0.003707,0.004764,0.003392,0.002866,0.002208,0.001487,0.002194,0.001641,0.001435,0.001891,0.003371,0.0021,0.002083,0.003043,0.001794,0.002186,0.001232,0.001484,0.000877,0.002489,0.002274,0.003328,0.005055,0.011387,0.008917,0.009505,0.005334,0.016676,0.00869,0.010342,0.00916,0.021095,0.006159,0.020103,0.016353,0.00372,0.019179,0.010561,0.011284,0.004867,0.011315,0.017684,0.017554,0.006845,0.012642,0.012442,0.007166,0.006325,0.012388,0.010779,0.006139,0.012628,0.011621,0.00767,0.013463,0.007257,0.003956,0.012688,0.005677,0.005565,0.010723,0.013821,0.006992,0.009413,0.009118,0.011705,0.019768,0.017752,0.006878,0.013732,0.002717,0.008365,0.011823,0.004964,0.009647,0.010633,0.010041,0.003952,0.012344,0.003396,0.009005,0.001865,0.007733,0.017542,0.01153,0.005973,0.006809,0.011517
0.016289,0.003541,0.009848,0.01592,0.016633,0.009098,0.006512,0.016712,0.018259,0.019255,0.019208,0.013346,0.01132,0.010447,0.00613,0.002181,0.009143,0.009446,0.005336,0.0054,0.007979,0.007048,0.007,0.004867,0.004218,0.005832,0.007044,0.010257,0.011113,0.009651,0.007944,0.00444,0.002065,0.003262,0.004548,0.00496,0.003218,0.001219,0.002117,0.002717,0.002788,0.003179,0.003234,0.002315,0.00111,0.002778,0.003112,0.003054,0.001464,0.000496,0.000326,0.00301,0.003499,0.002834,0.006082,0.004465,0.012019,0.015265,0.007848,0.011276,0.005499,0.011242,0.010379,0.015979,0.004717,0.015357,0.019835,0.023299,0.026389,0.01386,0.007183,0.019399,0.025263,0.0277,0.01131,0.012283,0.024386,0.028429,0.026486,0.027177,0.019346,0.006351,0.019201,0.020454,0.023116,0.016334,0.011077,0.019177,0.026704,0.025487,0.027184,0.024839,0.023549,0.006767,0.013697,0.025391,0.022073,0.006821,0.014711,0.023091,0.014453,0.003897,0.015296,0.022175,0.017597,0.020498,0.02611,0.028343,0.029446,0.028968,0.023921,0.026972,0.021234,0.013702,0.005459,0.013584,0.021259,0.02547,0.017958,0.015584,0.02013
0.001952,0.004942,0.004003,0.005833,0.001853,0.00354,0.005792,0.008177,0.007133,0.00808,0.004241,0.002732,0.004215,0.002296,0.002576,0.002374,0.004617,0.000603,9.4e-05,0.002855,0.002812,0.001833,0.001987,0.000688,0.001982,0.002086,0.002616,0.004101,0.002419,0.002043,0.002438,0.001399,0.000653,0.001207,0.001527,0.001631,0.000547,0.000429,0.001282,0.001213,0.001619,0.000819,0.00097,0.000166,0.001432,0.001557,0.000463,0.001068,0.000597,0.000416,0.000685,0.002841,0.002033,0.001593,0.002405,0.001352,0.006619,0.001943,0.002097,0.009607,0.005257,0.004029,0.004184,0.003966,0.004797,0.008193,0.005109,0.006076,0.010015,0.004872,0.002792,0.009724,0.013291,0.006374,0.005376,0.015213,0.0096,0.005112,0.009312,0.008818,0.005944,0.009599,0.012098,0.011313,0.011805,0.009784,0.013534,0.002434,0.012962,0.008843,0.006228,0.012804,0.01246,0.008369,0.011511,0.009749,0.00726,0.000818,0.013389,0.001973,0.010851,0.010258,0.005957,0.012275,0.006404,0.009412,0.014174,0.007003,0.007159,0.007154,0.00978,0.007244,0.012935,0.010129,0.011998,0.012997,0.002453,0.005832,0.008016,0.009321,0.007002
0.001045,0.001141,0.002749,0.003052,0.002978,0.00116,0.005078,0.004208,0.001274,0.005223,0.006212,0.000872,0.002606,0.00204,0.002274,0.002614,0.002966,0.00203,0.001264,0.002031,0.001071,0.000947,0.000832,0.000714,0.001624,0.001414,0.001413,0.001604,0.001785,0.001872,0.000292,0.000884,0.001008,6.4e-05,0.000219,0.000992,0.000397,0.00035,0.001137,0.00028,0.00068,0.001026,0.000816,0.000325,0.001086,0.000458,0.000182,0.000805,8.3e-05,0.000224,0.000933,0.00168,0.000848,0.001031,0.001409,0.001721,0.002415,0.00514,0.00119,0.006651,0.000552,0.002459,0.002566,0.003374,0.000726,0.002787,0.002554,0.002382,0.004064,0.001744,0.001404,0.002854,0.004196,0.002511,0.005057,0.005263,0.004555,0.001214,0.005422,0.004323,0.006254,0.001663,0.000916,0.010492,0.007,0.008907,0.001721,0.003538,0.004087,0.01075,0.007677,0.002859,0.008674,0.008138,0.010324,0.008526,0.010029,0.01247,0.010027,0.00484,0.009621,0.007759,0.006375,0.006174,0.003765,0.003435,0.003569,0.007583,0.005261,0.000859,0.006742,0.006508,0.004072,0.006827,0.004386,0.004875,0.004839,0.003902,0.005275,0.006398,0.00352
0.001708,0.002339,0.001771,0.000469,0.001902,0.000917,0.003441,0.003392,0.000971,0.001553,0.002712,0.000848,0.001608,0.001261,0.001152,0.000971,0.001522,0.000984,0.000541,0.001224,0.000791,0.000322,0.000871,0.000399,0.000868,0.000885,0.001546,0.001473,0.000826,0.001342,0.001222,0.000235,0.000281,0.001145,0.000878,0.000253,0.000282,0.000267,0.000651,0.000251,0.000368,0.000341,0.000393,0.000657,0.000888,0.000598,0.000104,0.000722,0.000316,0.000199,0.000592,0.001191,0.000564,0.000287,0.000903,0.000905,0.001411,0.004101,0.001794,0.001787,0.002436,0.003149,0.000927,0.001966,0.001416,0.002024,0.004234,0.003994,0.001223,0.001672,0.002683,0.004272,0.003377,0.003167,0.002914,0.004177,0.00478,0.003108,0.004121,0.00464,0.002325,0.004821,0.003547,0.005063,0.004947,0.003112,0.005781,0.00432,0.00425,0.006012,0.003013,0.003314,0.004153,0.010294,0.005124,0.003543,0.007484,0.016273,0.008993,0.004779,0.008427,0.004699,0.004135,0.002489,0.00544,0.00619,0.00315,0.003367,0.002357,0.002653,0.00188,0.001604,0.001651,0.007162,0.005904,0.005174,0.004022,0.004489,0.002588,0.003306,0.001631
0.001373,0.001078,0.000702,0.001265,0.000854,0.000386,0.002194,0.001638,0.000639,0.001842,0.002103,0.000179,0.00097,0.001371,5e-04,0.001084,0.000875,0.000431,0.000259,0.001038,0.000899,0.00086,0.000536,0.000286,0.000529,0.000649,0.000914,0.001096,0.000869,0.001058,0.000548,0.000676,0.000449,0.000524,0.000601,0.000153,0.000307,6.8e-05,0.000635,7.8e-05,2.9e-05,0.000428,0.000178,0.000285,0.000743,0.00032,9.1e-05,0.000385,4.5e-05,8.8e-05,0.000509,0.00087,0.000568,0.000282,0.000744,0.000764,0.001457,0.001609,0.001513,0.001443,0.001039,0.001519,0.000797,0.002097,0.002595,0.002761,0.00195,0.001141,0.00224,0.001762,0.003205,0.001482,0.002407,0.00201,0.0023,0.002146,0.003074,0.003609,0.002146,0.002301,0.001915,0.003881,0.003141,0.002581,0.002954,0.002301,0.004692,0.003165,0.002738,0.001141,0.001948,0.003168,0.002838,0.006078,0.002083,0.003879,0.004579,0.00667,0.000596,0.001404,0.00343,0.00387,0.000968,0.003951,0.003073,0.002604,0.002362,0.002626,0.002123,0.002461,0.000425,0.003416,0.002319,0.001325,0.001012,0.00175,0.003523,0.000973,0.001806,0.001618,0.001747
0.001042,0.001049,0.000584,0.000803,0.000337,0.000405,0.001742,0.001729,0.000336,0.001544,0.001906,0.000391,0.000849,0.001004,0.000304,0.00096,0.000943,0.000431,0.000183,0.000747,0.001133,0.00054,0.000415,0.000262,0.00044,0.000442,0.000999,0.000909,0.000719,0.00078,0.000237,0.000412,0.000363,0.000569,0.000402,0.000126,0.000158,3.6e-05,0.00053,3.1e-05,0.000181,0.000269,0.000202,0.000353,0.000614,0.000343,8.7e-05,0.000333,0.000102,0.000106,0.000469,0.000816,0.000591,9e-05,0.000754,0.000607,0.001373,0.002593,0.000928,0.00356,0.001068,0.001385,0.000187,0.001972,0.001771,0.001603,0.001672,0.001649,0.001391,0.001843,0.00119,0.001989,0.001491,0.001577,0.002728,0.003552,0.001541,0.001776,0.001154,0.001859,0.003162,0.001348,0.000835,0.000513,0.002887,0.003029,0.001635,0.001689,0.00208,0.001288,0.001295,0.001701,0.001917,0.001721,0.001473,0.001816,0.003405,0.003227,0.001865,0.001893,0.001025,0.005224,0.002496,0.002593,0.002801,0.002605,0.002433,0.001021,0.00144,0.001856,0.001728,0.001677,0.00213,0.000705,0.001906,0.002067,0.001724,0.002061,0.001087,0.000538,0.00156
0.001451,0.000795,0.000546,0.001267,0.000476,0.000438,0.001616,0.001489,0.000132,0.001988,0.001549,0.000433,0.001104,5e-04,0.000365,0.000857,0.00042,0.000381,0.000602,0.00086,0.000456,0.000263,0.000443,0.000469,0.000748,0.000144,0.00077,0.000897,0.000282,0.001065,0.00018,0.000674,0.000566,0.000579,0.000377,0.000239,0.000189,0.000178,0.000466,0.000306,0.000319,7e-05,0.000371,0.000403,0.000542,0.000231,0.000104,0.000345,0.000126,8.6e-05,0.000502,0.000521,0.000679,3.8e-05,0.000874,0.000772,0.001637,0.001359,0.000592,0.002591,0.000837,0.001283,0.00076,0.000375,0.002074,0.000326,0.001537,0.001849,0.001303,0.001923,0.00399,0.002175,0.002041,0.001493,0.002125,9e-05,0.002293,0.0019,0.000427,0.002169,0.003,0.001213,0.003586,0.001984,0.002872,0.002384,0.001646,0.00346,0.001738,0.000392,0.001436,0.002988,0.002083,0.00361,0.002362,0.002137,0.003578,0.004039,0.001123,0.001518,0.001289,0.002644,0.00188,0.000687,0.000904,0.002071,0.0016,0.00104,0.001113,0.001576,0.002283,0.002009,0.001492,0.002689,0.001702,0.001294,0.002349,0.001221,0.001792,0.000879,0.001992
0.00103,0.000663,0.000254,0.001402,0.000734,0.000458,0.001962,0.000884,0.000671,0.001633,0.001391,0.001018,0.00031,0.000684,0.000349,0.00024,0.000392,0.000464,0.000258,0.000422,0.00013,0.00068,0.000102,0.000548,0.000353,0.000474,0.000565,0.001063,0.00064,0.00088,0.000753,5.7e-05,0.000166,0.000347,0.000651,0.000342,0.000374,0.000217,0.000128,0.000402,0.000433,0.000532,0.000114,0.00032,0.00059,0.00015,0.000117,0.00013,0.000155,0.00025,0.000193,0.000506,0.00073,0.000361,0.00062,0.000466,0.001241,0.002844,0.001284,0.002265,0.000578,0.000869,0.001898,0.003247,0.004542,0.001524,0.000201,0.001227,0.001062,0.003312,0.006976,0.006061,0.001379,0.000938,0.002682,0.003226,0.001842,0.001032,0.00089,0.002028,0.004888,0.004345,0.003017,0.002341,0.00098,0.002965,0.007507,0.002955,0.001133,0.000759,0.000842,0.00208,0.001356,0.003437,0.002865,0.000707,0.002041,0.001292,0.002086,0.001339,0.002152,0.002076,0.001827,0.002002,0.000887,0.000341,0.002319,0.000653,0.000838,0.001459,0.001627,0.001266,0.001249,0.002762,0.002396,0.00325,0.001284,0.001731,0.002119,0.002655,0.000775
0.000508,0.000717,0.000269,0.000567,0.000393,0.000621,0.001103,0.000643,0.000288,0.001085,0.001314,0.000449,0.00076,0.000732,0.000294,0.000426,0.000223,0.000218,0.000193,0.000479,0.000608,0.000267,0.000226,0.000255,0.000257,0.000201,0.000437,0.000638,0.000518,0.000285,0.000333,0.000194,0.000383,0.000195,0.00042,9.4e-05,1.3e-05,0.000212,0.000405,0.000198,0.000103,0.000174,0.000159,0.000276,0.000445,0.000207,2.5e-05,0.000189,3.2e-05,0.000158,0.000351,0.000552,0.000502,0.00014,0.000612,0.000134,0.000747,0.002056,0.001938,0.001654,0.001516,0.000406,0.002358,0.001957,0.002473,0.002762,0.001513,0.000708,0.001331,0.003334,0.007032,0.002897,0.000195,0.000909,0.003154,0.000961,0.001459,0.001673,0.001013,0.001511,0.005008,0.00276,0.001561,0.001162,0.002002,0.002516,0.005038,0.002298,0.002116,0.001344,0.001113,0.001055,0.001533,0.001555,0.002212,0.001909,0.001582,0.000559,0.000421,0.000638,0.002116,0.003631,0.003125,0.000864,0.001666,0.001366,0.001902,0.000955,0.000855,0.001189,0.001455,0.001185,0.001082,0.001924,0.000498,0.001351,0.000901,0.001205,0.001322,0.002296,0.000266
0.000589,0.000518,0.000339,0.000359,0.000219,0.00056,0.0012,0.000649,0.000513,0.001028,0.001339,0.000477,0.000565,0.000621,0.000221,0.000589,0.000219,0.00021,0.000401,0.000278,0.000571,0.000292,0.00018,9e-05,0.000239,1e-04,0.000514,0.000572,0.000537,0.000254,0.000274,9.9e-05,0.000218,0.000204,0.000265,0.000106,7.4e-05,0.000223,0.000195,0.000117,4.2e-05,0.000147,0.000211,0.000236,0.000382,0.000271,6.6e-05,0.000241,4.9e-05,0.000101,0.000407,0.000416,0.00057,7.5e-05,0.000591,0.000423,0.001167,0.001923,0.000401,0.00206,0.001,0.001244,0.002242,0.002692,0.003681,0.002606,0.002192,0.000387,0.001276,0.003126,0.004513,0.003458,5e-04,0.00028,0.002421,0.002396,0.000819,0.001584,0.000418,0.000895,0.004165,0.004236,0.003347,0.001614,0.001138,0.002288,0.003595,0.002283,0.001649,0.000376,0.000601,0.00155,0.001378,0.000775,0.002126,0.00125,0.001518,0.000829,0.000923,0.000926,0.00165,0.003299,0.000333,0.00111,0.00286,0.00126,0.002067,0.000682,0.00069,0.000904,0.000544,0.001802,0.001024,0.000931,0.001285,0.001577,0.000562,0.001314,0.001382,0.001034,0.001069
0.001203,0.000888,0.000458,0.000416,0.000559,0.000464,0.001135,0.00093,0.000355,0.001118,0.001025,0.000934,0.000822,0.000627,0.000175,0.000267,0.000125,0.000243,0.000401,0.000403,0.000529,0.000161,5.2e-05,2.1e-05,0.000397,0.000197,0.000494,0.000479,0.000432,0.000287,0.00028,0.000139,0.000251,0.000154,6.9e-05,7.8e-05,3.3e-05,7.6e-05,0.000282,3.4e-05,0.000122,0.000164,6.9e-05,0.000261,0.000258,0.000171,6.3e-05,0.000189,4e-05,9.2e-05,0.000368,0.000484,0.000721,0.000237,0.000841,0.000468,0.001612,0.001602,0.00093,0.001507,0.000987,0.001419,0.004032,0.002606,0.002965,0.003414,0.001412,0.00048,0.001657,0.002417,0.003612,0.000895,0.001363,0.000872,0.002186,0.001195,0.000552,0.000774,0.000483,0.001112,0.002572,0.004032,0.001987,0.001354,0.00141,0.001992,0.002203,0.001979,0.002174,0.000989,0.000475,0.00156,0.000853,0.000333,0.002212,0.001841,0.001224,0.001318,0.000208,0.000613,0.001117,0.002416,0.002199,0.000852,0.001807,0.001783,0.002114,0.000858,0.00047,0.000486,0.000983,0.000716,0.001372,0.000369,0.001005,0.001378,0.001636,0.001468,0.001445,0.001147,0.000949
0.001188,0.000783,0.00048,0.001085,0.001169,0.001215,0.000704,0.000931,0.000139,0.000637,0.00085,0.000532,0.000436,0.000337,0.000731,0.000339,0.000268,0.000458,0.000314,0.00029,0.000929,0.00049,0.000234,0.000474,0.000123,0.000363,0.000332,0.00031,0.00056,0.000269,0.000179,0.000179,0.000142,7.5e-05,0.000336,0.000274,0.000223,9.1e-05,0.000461,0.000292,0.000119,0.000187,0.000213,0.000225,0.00029,0.000288,0.000105,9.5e-05,0.000168,0.000223,0.000253,0.000287,0.000443,0.000619,0.001119,0.000746,0.00183,0.000235,0.000365,0.001162,0.000499,0.000806,0.00383,0.004173,0.000138,0.001835,0.000776,0.000542,0.001621,0.001624,0.001641,0.001453,0.000901,0.001001,0.001097,0.001901,0.001379,0.00033,0.000609,0.000894,0.001587,0.003812,0.002901,0.000774,0.000991,0.001687,0.001997,0.001271,0.001191,0.000618,0.000393,0.001285,0.000616,0.001437,0.001321,0.001368,0.001626,0.001367,0.000759,0.000592,0.000237,0.001557,0.001224,0.000541,0.000726,0.001079,0.001343,0.000917,0.000585,0.000687,0.001265,0.00106,0.001356,0.00108,0.001197,0.001092,0.00148,0.000683,0.001317,0.001355,0.000951
0.001406,0.001007,0.000617,0.000721,0.000183,0.001577,0.002319,0.000514,0.000706,0.000674,0.000898,0.000208,0.000498,0.000461,0.000367,5e-04,0.000233,0.000307,0.000344,0.000214,0.000731,0.000124,0.000487,0.000261,0.000352,0.000686,0.000381,0.000567,0.000294,0.000265,7.4e-05,0.000165,0.000206,0.000151,0.000121,0.000373,0.000183,2e-05,0.000332,0.000138,0.000235,0.000427,0.000212,0.000273,0.000527,0.000137,5.8e-05,0.00014,0.000196,0.000226,0.000406,0.000232,0.000409,0.001,0.000385,0.000118,0.000884,0.001694,0.000584,0.000138,0.000912,0.001175,0.002422,0.000596,0.000957,0.000327,0.001045,0.00074,0.00137,0.00216,0.001493,0.001078,0.000496,0.000981,0.000595,0.000867,0.001022,0.001076,0.000377,0.000286,0.000917,0.003229,0.000747,0.001253,0.00133,0.001057,0.001296,0.001347,0.000849,0.001471,0.00102,0.001706,0.000884,0.002109,0.002429,0.001721,0.001285,0.001419,0.000803,0.001951,0.002055,0.001884,0.001861,0.000552,0.000813,0.00067,0.001035,0.001532,0.001133,0.001662,0.000769,0.000458,0.000941,0.001544,0.001219,0.00138,0.001286,0.001376,0.001004,0.000677,0.002107
0.000564,0.000782,0.000149,0.000468,0.000213,0.001276,0.001105,0.000856,0.000667,0.000895,0.000904,0.000515,0.000537,0.000669,0.000267,0.000233,0.000337,1.6e-05,0.000113,0.000402,9.8e-05,0.000494,0.000535,0.000229,0.000207,0.000257,0.000536,0.000708,0.00055,0.00034,0.000112,8.2e-05,0.000195,9.5e-05,0.000124,0.00021,7.6e-05,8.7e-05,0.000112,0.00022,9.5e-05,9.8e-05,0.000214,7.2e-05,0.000295,0.000205,0.000135,0.000194,0.000153,3.6e-05,0.000226,0.000348,0.000261,0.000362,0.000645,0.000889,0.000592,0.00088,0.000303,0.00091,0.00051,0.000171,0.001472,0.000394,0.000846,0.001288,0.001949,0.002426,0.001195,0.001465,0.002463,0.00204,0.001257,0.001408,0.000701,0.001974,0.000397,0.001394,0.001257,0.000895,0.00171,0.002244,0.001458,0.002365,0.002051,0.000973,0.001388,0.00148,0.001201,0.001765,0.001885,0.000943,0.002315,0.002679,0.000467,0.001497,0.001138,0.000725,0.001521,0.002396,0.000685,0.001031,0.000554,0.001266,0.001402,0.001804,0.000416,0.000387,0.001465,0.001326,0.001907,0.001238,0.000989,0.001161,0.000921,0.000672,0.000355,0.001068,0.000322,0.000635,0.001587
0.000505,0.000304,0.000331,0.000276,0.000212,0.000908,0.000544,0.00083,0.000204,0.000679,0.00108,0.000507,0.000258,0.00023,0.000148,0.000506,0.000275,3.2e-05,8.4e-05,0.000449,0.000162,6.3e-05,0.000265,9.5e-05,7.9e-05,3.5e-05,0.000346,0.00044,0.000401,0.000247,3.6e-05,0.000143,0.000133,7.6e-05,0.000232,9.9e-05,4.6e-05,9.1e-05,0.000227,5.6e-05,3.6e-05,0.000143,0.000174,0.00011,0.000201,0.000125,6.5e-05,0.000158,7e-05,7.9e-05,0.000282,0.000331,0.000196,0.000166,0.000214,0.000532,0.000478,0.000515,0.000248,0.001501,0.000969,0.00113,0.001006,0.001232,0.00064,0.000977,0.000658,0.001092,0.00051,0.001458,0.001348,0.001524,0.001484,0.002207,0.001497,0.002262,0.000719,0.002464,0.001475,0.002701,0.000484,0.002768,0.001127,0.00072,0.002034,0.00056,0.001438,0.000917,0.000928,0.000831,0.001364,0.000381,5e-04,0.001304,0.002453,0.001734,0.000805,0.000532,0.001507,0.000706,0.001048,0.000482,0.001646,0.001985,0.001494,0.001315,0.000542,0.001977,0.002603,0.002627,0.001298,0.001705,0.001139,0.001128,0.00056,0.000852,0.000476,0.000928,0.000738,0.000391,0.00054
2e-05,0.000124,0.000117,8.4e-05,5.1e-05,0.000347,0.000351,0.000372,4.7e-05,0.000452,0.000395,7e-05,7.4e-05,0.000134,0.000104,0.000156,0.000143,4.9e-05,3.8e-05,0.000167,0.000145,7e-05,0.000126,5.2e-05,2e-05,3.6e-05,0.000169,0.000196,0.000184,0.000104,3.9e-05,4.9e-05,6.1e-05,6e-05,1e-04,1.1e-05,1.2e-05,5e-05,0.000115,2.8e-05,8e-06,7.8e-05,4.7e-05,4.1e-05,0.000103,7.8e-05,2.4e-05,6.6e-05,2.5e-05,3.5e-05,9.8e-05,0.000196,3.6e-05,6.7e-05,4.7e-05,0.000194,0.000225,0.000639,4.6e-05,0.000631,0.000255,0.000393,0.000186,0.000645,0.000483,0.000278,8.9e-05,8e-05,0.000385,0.000692,0.000237,0.000202,0.00112,0.000213,0.000365,0.000924,0.000866,0.000216,0.00094,0.000486,0.000575,0.000694,0.000895,0.000385,0.000639,0.00058,0.001459,0.000863,0.000993,0.000433,0.000861,0.000319,0.000885,0.000719,0.000651,0.000389,0.000813,0.000341,0.000669,0.00073,0.000568,0.000332,0.000912,0.000724,0.000587,0.000413,0.001158,0.000528,0.000372,7.6e-05,0.000319,0.000723,0.000517,0.000503,0.000139,0.000623,0.000227,0.000327,0.000331,0.000179,0.000153
0.00021,0.000123,0.000131,7e-05,0.000135,0.000206,0.000384,0.00034,0.000157,0.000485,0.000416,0.000101,6.4e-05,0.000119,9e-05,0.000177,0.000136,5.4e-05,6.6e-05,0.000151,0.000124,6.9e-05,0.000119,5.5e-05,2.3e-05,1.6e-05,0.000133,0.000173,0.000139,6e-05,1.2e-05,4.8e-05,6.4e-05,4.6e-05,6.2e-05,1.2e-05,6e-06,5.7e-05,0.000125,8e-06,3.5e-05,4.3e-05,5.5e-05,5.4e-05,0.000119,4.4e-05,1.3e-05,8.1e-05,4.2e-05,8e-06,7.9e-05,0.000168,0.000117,5.4e-05,0.000167,7.4e-05,0.000275,0.000338,0.000104,0.000294,0.000403,0.000108,0.000395,0.000249,9.5e-05,0.000449,0.000597,0.000587,0.001078,0.000488,0.000427,0.000579,0.000726,0.000228,0.000424,0.000114,0.000604,0.000818,0.000358,0.000395,0.000246,0.000492,0.000477,0.000856,0.000345,0.000947,0.00058,0.000638,0.000656,0.000794,0.000888,0.000926,0.000686,0.000496,0.000182,0.000606,0.000662,0.000238,0.000385,0.000286,0.000896,0.000572,0.000746,0.000461,0.000815,0.000653,0.001052,0.000894,0.000586,0.000648,0.000858,0.000689,0.000201,0.00021,0.000103,0.000542,0.000441,0.000733,0.000292,0.000154,0.000341
7.1e-05,9.4e-05,7e-05,8.8e-05,0.000131,0.00022,0.000337,0.000257,5.2e-05,0.000347,0.000365,8.8e-05,8.1e-05,0.000142,8.4e-05,0.000172,0.000101,2.3e-05,4.5e-05,0.00013,0.000161,7.5e-05,8.5e-05,7.3e-05,1.5e-05,9e-06,0.00017,0.000166,0.000156,0.000103,2.2e-05,6.2e-05,0.000101,1.9e-05,7.2e-05,5e-06,3e-06,4.2e-05,0.000116,4e-06,2.6e-05,8.2e-05,4.5e-05,5.2e-05,0.000131,5e-05,1.2e-05,5.5e-05,2.8e-05,1.8e-05,8.6e-05,0.00017,0.000121,2.6e-05,0.000174,9.1e-05,0.000194,0.000416,0.000331,0.00051,0.000301,5.6e-05,0.000342,0.001049,0.000494,0.000636,0.000385,0.00021,0.000804,0.000554,0.000273,0.000388,0.000236,0.000811,0.000208,0.000452,0.000903,0.000525,0.000571,0.000453,0.000886,0.000601,0.000317,0.000697,0.000282,0.000414,0.000778,0.000392,0.000554,0.000782,0.000172,0.000375,0.000745,0.000332,0.000507,0.000722,0.000315,0.000271,0.000623,0.000325,0.000432,0.000817,0.000309,0.000172,0.000383,0.000415,0.000275,0.000412,0.000255,0.000595,0.000441,0.000343,0.000369,0.000498,4.3e-05,0.000481,0.000382,0.000187,0.000287,0.000309,0.000134
0.000204,0.000199,0.000123,9.8e-05,0.000112,0.000203,0.000363,0.000277,3.4e-05,0.00032,0.000356,0.000146,0.00017,0.000113,0.000128,0.000147,0.000108,3.6e-05,2.5e-05,9.5e-05,9.5e-05,8.8e-05,8.4e-05,5.4e-05,4.4e-05,2.3e-05,0.000172,0.000197,0.000148,1e-04,6e-05,4.1e-05,6.2e-05,9e-06,7.3e-05,8e-06,1.3e-05,3.9e-05,9.4e-05,2.8e-05,1.7e-05,8.2e-05,5.5e-05,5.4e-05,0.000116,5.2e-05,1.4e-05,5.8e-05,4.4e-05,8e-06,0.000107,0.000184,7.4e-05,4.6e-05,0.000161,9.9e-05,0.000194,0.000167,0.000498,0.000333,0.000103,0.000147,0.000327,0.000492,0.00016,0.000287,0.000196,0.000335,0.000223,0.000294,0.00043,0.000362,0.000647,0.00029,8e-05,0.000324,0.000595,0.00069,0.000284,0.000279,0.000787,0.00061,0.000291,0.000501,0.000435,1.7e-05,0.000357,0.000444,0.000649,0.000399,0.000437,0.000307,0.000535,0.000357,0.000407,0.000346,0.000712,0.00086,0.000629,0.000276,5e-04,0.000691,0.000697,0.00031,0.000328,0.00032,0.000446,0.000333,0.000392,0.000211,0.000523,0.000526,0.000385,0.000413,0.000287,0.000203,2e-04,0.000421,0.000327,0.000165,0.000289
0.000123,0.000121,0.000101,4.1e-05,8.7e-05,0.000237,0.000315,0.000259,3e-05,0.000308,0.000356,0.000107,8.6e-05,0.000134,7.6e-05,0.000129,9.7e-05,2.4e-05,4.7e-05,0.00013,0.000117,8e-05,0.000117,4.5e-05,2.4e-05,1.5e-05,0.000155,0.00017,0.000141,5.2e-05,3.7e-05,3.1e-05,4.4e-05,3.6e-05,8.4e-05,2.5e-05,9e-06,3.8e-05,8.5e-05,1.7e-05,9e-06,6.5e-05,4.5e-05,4.2e-05,0.000125,4.4e-05,2.2e-05,6.1e-05,2.1e-05,1.3e-05,9e-05,0.000155,6.9e-05,2.6e-05,0.000165,0.000107,0.000173,0.000466,0.000291,0.000466,0.000314,0.000327,0.000353,0.00032,0.000381,0.000442,0.000347,0.000335,0.000359,0.000491,0.000385,0.000372,0.000398,0.000186,0.000109,0.000264,0.000328,0.000388,0.000118,0.000235,0.000479,0.000787,0.000416,0.000509,0.000141,0.000248,0.000174,0.000317,0.000616,6.7e-05,0.00015,0.000287,0.000395,0.000184,0.00046,0.000389,0.000563,0.000758,0.000292,0.000286,0.000499,0.000228,0.000393,0.000439,0.000264,3.5e-05,0.000376,0.000117,0.000126,0.000301,0.000379,0.000416,0.000201,0.000202,6.2e-05,0.000461,0.000414,0.000542,0.000342,0.000102,0.000188
0.000158,9.8e-05,6.6e-05,9.1e-05,2.4e-05,0.000211,0.000321,0.000233,0.000109,0.000308,0.000357,4.3e-05,8.8e-05,0.000134,8.6e-05,0.000123,0.000106,2.7e-05,5.6e-05,0.000134,0.000111,6e-05,9.5e-05,2.5e-05,3.2e-05,4e-06,0.000141,0.000186,0.000129,6.8e-05,5.5e-05,7.2e-05,9.6e-05,4.3e-05,8e-05,1.3e-05,1.9e-05,3.3e-05,0.000102,1.2e-05,1.2e-05,5.9e-05,6.1e-05,6.4e-05,9.8e-05,4.6e-05,2.2e-05,7.4e-05,1.2e-05,1.1e-05,8.4e-05,0.000155,8.1e-05,3.9e-05,0.000137,8.1e-05,0.000183,0.000525,0.000414,4.7e-05,0.00036,0.000222,0.000345,0.00048,0.000405,0.000284,0.000257,0.000148,0.000496,0.00058,0.000668,0.000638,0.000728,8.7e-05,0.000241,0.000527,0.000342,0.000419,2.3e-05,0.000282,0.000454,0.000317,0.000459,0.000167,0.000218,0.000198,0.000383,0.000378,0.000474,8.1e-05,0.000243,0.000308,0.000134,0.000272,0.000521,0.000527,0.000588,0.000403,0.000258,0.000301,0.000544,0.000278,0.000515,0.000294,0.000402,8.2e-05,0.000338,0.000261,0.000167,0.000307,0.000416,0.000386,0.000355,0.000267,0.000164,0.000508,0.000301,0.00037,0.000272,9.1e-05,0.000167
0.000132,0.000118,4.8e-05,5.1e-05,5.3e-05,0.000243,0.000258,0.000231,8.6e-05,0.000344,0.000349,7.3e-05,0.000115,0.000129,7.7e-05,0.000121,7e-05,2.7e-05,3.3e-05,0.000132,9.5e-05,6e-05,8.1e-05,3.6e-05,3.6e-05,3.3e-05,0.00011,0.000157,0.000142,0.000111,4.7e-05,5.6e-05,7.2e-05,2.1e-05,4.8e-05,2e-06,9e-06,2.1e-05,8.5e-05,1.5e-05,2e-05,5.4e-05,5.5e-05,6.9e-05,0.000117,3.6e-05,2.8e-05,5.9e-05,8e-06,1.8e-05,8.4e-05,0.000168,8.1e-05,3.7e-05,0.000108,0.00012,0.000189,0.000566,9.3e-05,0.00036,0.00034,0.000375,0.000215,0.000387,0.000105,0.000136,0.00015,0.000252,0.000452,0.000584,0.000257,0.000272,0.00022,0.000173,0.00045,3e-05,0.000244,0.000421,0.000162,0.000139,0.000288,0.000102,0.00043,9.2e-05,0.000414,0.000202,0.000154,0.000289,0.000413,8.4e-05,9.2e-05,0.000584,0.000135,0.000317,0.000238,0.000428,0.000436,0.000245,0.000327,0.000133,0.000663,0.000291,0.00048,0.000408,0.000367,0.000261,0.000335,0.000135,7e-05,0.000264,0.000501,0.000432,4e-04,0.000242,8.1e-05,0.000483,0.000352,0.000469,0.000151,8.3e-05,8.5e-05
9.1e-05,7e-05,9.4e-05,0.000107,2.9e-05,0.00015,0.000324,0.000251,5.4e-05,0.000284,0.000312,4.4e-05,0.000132,0.000137,8.6e-05,0.000125,7e-05,5.5e-05,5e-05,0.000134,9.3e-05,6.5e-05,0.000102,2.7e-05,3e-05,2.4e-05,0.000118,0.000188,0.00012,8.7e-05,3.3e-05,3.8e-05,4.9e-05,2.7e-05,6.9e-05,2.2e-05,1.7e-05,3.8e-05,9.3e-05,1.7e-05,1.4e-05,4.7e-05,5.4e-05,7.6e-05,0.000119,3.4e-05,9e-06,5.9e-05,9e-06,8e-06,6.5e-05,0.000169,4.6e-05,2.3e-05,0.000138,9.4e-05,0.00019,0.000415,0.000104,0.000558,0.000205,0.000166,0.000288,0.000522,0.000471,0.000148,0.000246,0.000295,0.000354,0.000619,0.00031,0.000188,0.000319,0.000263,0.000451,0.000378,0.000473,0.000446,0.000216,0.000251,0.000414,0.000468,0.000288,0.000319,0.00031,0.000452,0.00058,0.000507,0.000285,0.000356,0.000306,0.000464,0.000274,0.000107,0.000169,0.000348,0.000353,0.000724,0.000214,0.000264,0.000398,0.00034,0.000374,0.000385,0.000253,0.000317,0.000392,0.000226,2e-04,0.000234,0.00043,0.000346,0.000284,0.000318,0.000138,0.000419,0.000203,0.000263,0.000221,7.2e-05,0.000177
6.5e-05,8.5e-05,0.000101,5.7e-05,9.1e-05,0.000203,0.000309,0.000261,0.000101,0.000257,0.000322,7.1e-05,0.000105,0.000112,8.7e-05,0.000138,6.4e-05,2.3e-05,3.7e-05,0.000128,0.000139,8.3e-05,7.4e-05,1.8e-05,2.1e-05,2.8e-05,0.000117,0.000181,0.000133,6.7e-05,5e-06,3.5e-05,3.8e-05,1.9e-05,8.3e-05,1.2e-05,2e-06,3.3e-05,8.5e-05,1e-05,8e-06,5.3e-05,4.8e-05,5.7e-05,0.000115,5.7e-05,2.7e-05,6e-05,1.5e-05,1e-05,7.9e-05,0.000132,8.4e-05,2.5e-05,0.000142,9.8e-05,0.000143,0.000326,0.000233,0.000374,0.000227,3.6e-05,0.000353,0.000165,0.000263,0.000137,9.4e-05,0.000198,0.000343,0.000366,0.000228,4.7e-05,0.00036,0.00012,0.000264,0.000181,0.000457,0.000546,0.000129,0.000145,0.000607,0.000326,0.000191,0.000163,0.000256,0.00045,0.000688,0.000142,0.00045,0.000182,3.3e-05,3e-04,0.000191,0.000106,0.000315,4e-04,0.000198,0.000802,0.000141,0.000204,0.000411,0.000341,0.000226,0.000118,0.000266,0.000372,0.000411,0.000224,0.000113,0.000125,0.000483,0.000477,0.000273,0.000138,0.000138,0.000343,0.000162,0.000366,0.00014,6e-05,0.000127
8.5e-05,6.1e-05,8.5e-05,8.7e-05,0.000112,0.00015,0.000288,0.000279,3e-05,0.000255,0.00033,4.7e-05,0.000131,0.00014,8e-05,0.000121,6.2e-05,4e-05,3.7e-05,9.3e-05,0.000106,7e-05,7.4e-05,4.1e-05,1.2e-05,1.8e-05,0.000141,0.000148,9.7e-05,5.4e-05,2.2e-05,3.6e-05,5.6e-05,1.3e-05,4.8e-05,2.9e-05,1.6e-05,2e-05,7.2e-05,1.2e-05,1.2e-05,5.7e-05,5.1e-05,5.3e-05,0.000103,5.4e-05,1.2e-05,6.2e-05,2e-05,4e-06,8e-05,0.000132,6.8e-05,2.6e-05,0.000123,8.4e-05,6.1e-05,0.000561,0.000181,0.000348,0.00025,0.000159,0.000178,0.000199,0.000284,0.00021,0.000268,0.000228,0.000388,0.000458,5.3e-05,8.2e-05,0.000347,0.000164,0.000254,0.000344,0.000293,0.000412,0.000206,0.000179,0.000404,0.00041,0.00033,0.000198,0.000366,0.000405,0.000379,0.000132,0.000362,8.6e-05,5.9e-05,0.000441,0.000157,9.4e-05,0.000244,0.000347,0.000107,0.000314,0.000125,0.00024,0.000488,0.000289,0.000209,0.00039,0.000403,0.000214,0.000379,0.000237,9.8e-05,0.00013,0.000279,0.000335,0.000385,0.000229,4.9e-05,0.000353,4.3e-05,0.000183,0.000223,9.5e-05,5.2e-05
0.000173,7.3e-05,7.1e-05,8.3e-05,0.00012,0.000151,0.000292,0.00027,7e-05,0.00025,0.000345,6.7e-05,0.000131,9.2e-05,6.2e-05,9.5e-05,9.4e-05,4e-05,4e-05,0.000108,0.000109,6.9e-05,8.2e-05,4.9e-05,2.5e-05,7e-06,0.000127,0.000134,0.000123,7e-05,1.9e-05,2.1e-05,4.6e-05,2.3e-05,5.2e-05,1e-05,3e-06,2.5e-05,7.7e-05,6e-06,9e-06,5.5e-05,5e-05,6.1e-05,0.000108,3.7e-05,9e-06,6.3e-05,2.5e-05,1.2e-05,6.7e-05,0.000147,5.9e-05,1.2e-05,0.00013,7.5e-05,2.4e-05,0.000482,0.000234,0.000212,0.000138,0.000151,8.8e-05,0.000326,0.000169,2.6e-05,0.000267,0.000107,0.000207,0.000403,0.00023,5.2e-05,0.000351,8.7e-05,0.000294,0.000319,0.00035,0.000516,0.00015,0.00012,9.6e-05,0.000353,0.000228,0.000176,0.000336,0.000456,0.000418,0.000135,0.000535,0.000127,7.7e-05,0.000531,0.000174,0.000135,0.00016,0.000436,5.3e-05,0.00063,0.000184,0.00035,0.000453,0.000315,2.4e-05,0.000132,0.000296,0.000201,0.000382,0.000284,0.000114,0.000226,0.000273,0.000354,0.000282,0.00034,0.000149,0.000284,0.000207,0.000103,0.000158,8.8e-05,0.000206
5.2e-05,8.2e-05,3.3e-05,7.3e-05,0.000115,0.000151,0.000367,0.000311,6.5e-05,0.000312,0.000325,7.6e-05,8.3e-05,0.000108,5.8e-05,0.000127,6.5e-05,2.8e-05,3.2e-05,0.000106,9.2e-05,5e-05,8.7e-05,1.9e-05,3.5e-05,2e-05,9.1e-05,0.000149,0.000129,8.2e-05,2.4e-05,1.7e-05,5.3e-05,1.4e-05,6.1e-05,1.1e-05,9e-06,3.2e-05,7.6e-05,1.5e-05,3e-06,5.1e-05,5.7e-05,4.1e-05,9.5e-05,3.5e-05,2.8e-05,5.8e-05,7e-06,8e-06,7.1e-05,0.000127,7.3e-05,3.2e-05,0.000136,9.9e-05,8.2e-05,0.000271,0.000109,0.000351,0.000268,5.1e-05,0.000279,0.000238,0.000143,0.000203,0.00011,0.00027,0.000436,0.000415,8.4e-05,0.000131,0.000358,0.000228,0.000288,0.000382,0.000187,0.000271,0.000185,0.000225,0.000223,0.000222,0.000361,8.1e-05,0.000205,0.000176,0.000309,0.000212,0.00035,0.00015,0.00022,0.000276,0.000213,0.000101,0.000268,0.000446,0.000115,0.000343,0.000278,0.000336,0.000366,0.000173,0.000113,0.000148,0.000316,0.000305,0.000363,0.000278,0.000283,0.00012,0.000424,0.000259,0.00022,0.000238,2.8e-05,0.000378,0.000254,0.000276,0.000266,6.6e-05,7.8e-05
0.000106,9e-05,8.3e-05,4.1e-05,5.6e-05,0.000231,0.000291,0.000272,3.7e-05,0.000275,0.000321,6.1e-05,1e-04,0.000106,5.5e-05,0.00013,8.1e-05,5.1e-05,2.9e-05,9.8e-05,0.00011,4.4e-05,9.8e-05,4e-05,2e-05,2.2e-05,0.000107,0.000138,0.000133,9.2e-05,1.7e-05,3.8e-05,3e-05,2.1e-05,5.1e-05,8e-06,1.4e-05,2.5e-05,7.9e-05,1e-05,6e-06,4.5e-05,4.7e-05,6.3e-05,0.000115,4.9e-05,2.1e-05,5.7e-05,4e-06,1.5e-05,6e-05,0.000105,6.5e-05,6e-05,0.000139,8.2e-05,0.000135,0.000514,2e-04,0.000464,0.000188,8.6e-05,0.00021,0.000261,0.000261,0.00032,0.000203,0.000201,0.00024,0.000631,0.000308,0.000329,0.000535,0.000345,0.00039,0.000389,0.00038,0.000427,3e-04,0.000201,8.3e-05,0.000169,0.000156,0.00035,0.000197,7.9e-05,0.000309,0.000104,0.000364,9.2e-05,0.000232,0.000404,0.000345,0.000226,0.000366,0.000635,0.000218,0.000177,0.000199,0.000279,0.000391,0.000331,0.000192,0.000245,0.000372,0.000168,0.000258,0.000133,0.00023,0.000228,0.000334,0.000287,0.000261,0.000177,6.3e-05,3e-04,0.000163,0.00019,0.000135,3e-05,0.00015
4.3e-05,8.4e-05,8.4e-05,3.8e-05,7e-05,0.000166,0.000275,0.00027,8e-05,0.000256,0.000317,6.4e-05,8.9e-05,0.000129,8.6e-05,9.9e-05,9.4e-05,4.5e-05,2.1e-05,0.000132,9.2e-05,5.7e-05,8.7e-05,4.6e-05,1.7e-05,3.7e-05,1e-04,0.00015,0.000135,4.3e-05,4e-05,3.9e-05,5e-05,1.1e-05,5.8e-05,1.6e-05,3e-06,2.6e-05,8.3e-05,8e-06,2e-06,5.3e-05,4.3e-05,7.2e-05,9.9e-05,4.3e-05,1e-05,5.7e-05,1e-05,7e-06,7.2e-05,0.000123,7.7e-05,3.1e-05,0.000129,6.7e-05,0.000138,0.000364,0.00019,0.000376,0.000268,8.3e-05,0.000131,0.000161,0.000127,0.000154,0.000136,0.000119,0.000161,0.000327,0.000233,0.000232,0.00044,4.2e-05,0.000258,0.00024,0.000287,0.000291,0.000299,0.000206,0.000239,0.00016,0.000108,0.000389,0.000329,0.000343,0.000147,0.000117,0.000328,0.000281,0.000222,0.000214,0.00024,0.000457,0.000147,0.000555,0.000161,0.000425,1e-04,0.000148,0.000288,0.000408,0.000131,0.000258,0.000227,0.000208,0.00022,0.000222,0.000227,3.4e-05,0.000445,0.000274,0.000192,0.000126,1.5e-05,0.000346,4.3e-05,0.000346,0.000241,2.6e-05,0.000224
0.000125,8.9e-05,8.3e-05,1.3e-05,7e-06,0.000184,0.000265,0.000278,5.1e-05,0.000255,0.000288,7.8e-05,8.4e-05,0.000108,7.7e-05,0.00012,7.7e-05,3.9e-05,3.2e-05,0.000117,0.000102,4.3e-05,7.2e-05,3e-05,2e-05,2e-05,0.000105,0.000145,0.000145,8.2e-05,2.3e-05,4.3e-05,3.4e-05,8e-06,6.2e-05,6e-06,6e-06,2.8e-05,8.6e-05,1.2e-05,1.3e-05,3.9e-05,4.3e-05,6.9e-05,0.000112,4.6e-05,1.4e-05,7.8e-05,1.7e-05,1.2e-05,6.6e-05,0.000108,7e-05,3.2e-05,0.000143,7e-05,0.000112,0.000386,9.8e-05,0.00038,0.000173,0.000103,0.00011,0.000134,0.000251,0.000117,0.00015,0.000268,0.000171,0.000624,7.4e-05,0.000171,0.000569,0.000453,0.000398,0.000741,0.000335,0.000288,0.000353,0.000419,0.000468,0.000465,0.000449,0.000495,0.00033,0.000369,0.000231,0.000382,0.00031,0.000443,0.000564,0.000445,0.000184,0.000201,0.00049,0.000131,0.000417,0.000472,0.000113,0.000171,0.000485,0.000177,0.000169,0.000226,0.000296,0.000257,0.000433,0.000315,5.4e-05,0.000237,0.000375,0.000267,0.000149,0.000254,2.5e-05,0.000287,4.4e-05,0.000252,0.000238,8.7e-05,7.7e-05
6.8e-05,8.2e-05,6.7e-05,1.3e-05,4.8e-05,0.000143,0.000282,0.000259,1.5e-05,0.000239,0.000313,6e-05,0.000101,8.1e-05,5e-05,0.000112,7.8e-05,4e-05,1.9e-05,1e-04,0.000101,6e-05,9.7e-05,1.7e-05,2.3e-05,2e-05,9.3e-05,0.000145,0.000129,5.5e-05,3.4e-05,4.5e-05,5.3e-05,1.2e-05,6.2e-05,7e-06,4e-06,2.5e-05,8.4e-05,1.5e-05,2e-06,4.5e-05,4.4e-05,6.6e-05,9.6e-05,4.1e-05,2.6e-05,4.4e-05,1e-05,8e-06,6.4e-05,0.000103,8.4e-05,4e-05,0.000121,6.4e-05,5.7e-05,0.000354,5.7e-05,0.000394,0.000126,0.000159,0.000305,0.000216,0.000211,0.000102,0.000101,0.000146,3.8e-05,0.000467,0.000163,7.1e-05,0.000417,0.000371,2.5e-05,0.000613,0.000243,0.000727,0.000318,0.000264,0.000269,0.000195,0.00035,0.000214,0.000456,0.000433,0.000753,0.000413,0.00031,0.000153,0.000194,0.000127,0.00025,0.000105,0.000423,0.000104,0.000231,0.000397,0.00018,0.000247,0.000304,0.000149,0.000324,0.000228,0.000122,0.000201,0.000572,0.000265,7.1e-05,0.000192,0.000192,0.000367,0.000234,0.000183,3e-06,0.000256,0.00011,0.00023,0.000232,0.000102,8.1e-05
9e-05,5.3e-05,6.7e-05,1.8e-05,6.2e-05,0.000163,0.00028,0.000271,2.6e-05,0.000261,0.000298,9.4e-05,7.1e-05,9.9e-05,5.6e-05,0.000107,6.7e-05,5.2e-05,3.8e-05,9.2e-05,0.000105,7e-05,7.9e-05,3.9e-05,2.5e-05,1e-05,0.000117,0.000128,0.000122,7e-05,3.6e-05,2.8e-05,4.8e-05,1.4e-05,5.9e-05,7e-06,5e-06,2.7e-05,7e-05,5e-06,5e-06,4.6e-05,4e-05,5e-05,9.8e-05,4.6e-05,2.3e-05,5.1e-05,1.5e-05,1e-06,6.5e-05,0.000129,5.4e-05,3.2e-05,0.000136,6.3e-05,3.5e-05,0.000386,0.000123,0.000341,0.000168,0.000142,0.000144,0.00018,9.4e-05,3.6e-05,0.000101,7.5e-05,0.000145,0.000114,0.000265,3.4e-05,0.000247,0.000315,0.000148,0.000339,0.000657,0.00038,0.00016,0.000146,0.00019,0.000259,0.000205,0.000144,0.000481,0.000298,0.00056,0.000276,0.000339,8.8e-05,0.000164,0.000375,0.000294,0.000144,0.000369,0.000293,0.000228,0.000397,0.000178,0.000284,0.000417,0.000359,0.000119,9.5e-05,0.00031,0.00016,0.00044,0.000223,8.4e-05,1.4e-05,0.000347,0.000237,0.000244,0.000189,1.2e-05,3e-04,4.5e-05,0.000258,0.000151,3.5e-05,7.2e-05
1e-04,7.2e-05,7.2e-05,8e-06,4.4e-05,0.000155,0.000268,0.000247,2.4e-05,0.000246,0.000302,7.4e-05,8.2e-05,0.000104,6.7e-05,0.000122,6.8e-05,3.7e-05,2.9e-05,9.6e-05,9.4e-05,6.5e-05,7.8e-05,3.8e-05,1.7e-05,1.4e-05,0.00012,0.000148,0.00012,5.9e-05,2.9e-05,3.3e-05,4.2e-05,1.1e-05,6.1e-05,5e-06,7e-06,3.3e-05,7.2e-05,9e-06,8e-06,4.7e-05,3.8e-05,5.4e-05,9.1e-05,3.8e-05,2.1e-05,5.1e-05,1.6e-05,6e-06,6.3e-05,0.000128,7.3e-05,6e-06,0.000126,7.3e-05,6.4e-05,0.000402,9e-05,0.000297,0.000259,0.00012,0.000114,2e-04,0.000191,0.00015,7.5e-05,0.000128,0.000275,0.000211,0.000229,0.000153,0.000308,0.000126,0.000133,0.000271,0.000409,0.000326,0.000164,0.000244,0.000252,0.00036,0.000316,7.7e-05,0.000216,0.000283,0.000366,0.000209,0.000371,4.8e-05,0.000123,0.00036,6.1e-05,8.9e-05,0.000308,0.000297,0.000169,0.000356,0.00013,0.000271,0.000404,0.000295,0.000172,8.2e-05,0.000208,0.000162,0.000324,0.000149,6.6e-05,0.000129,0.000393,0.000329,0.000162,0.000235,1.4e-05,0.000319,8.1e-05,0.000248,0.000179,2.2e-05,9.2e-05
0.000102,7.4e-05,6.7e-05,1.5e-05,5.2e-05,0.000149,0.000258,0.000248,1.4e-05,0.000252,0.00032,7.6e-05,8e-05,9.6e-05,5.7e-05,0.000115,7.3e-05,3.1e-05,2.3e-05,0.000104,9.5e-05,5.7e-05,7.8e-05,2.9e-05,1.7e-05,1.4e-05,0.000115,0.000131,0.000105,6.6e-05,2.3e-05,3.4e-05,4.9e-05,1e-05,6.1e-05,2e-06,2e-06,3.1e-05,6.7e-05,5e-06,7e-06,4.9e-05,3.6e-05,5.3e-05,1e-04,3.9e-05,1.9e-05,5.4e-05,1.7e-05,3e-06,6.2e-05,0.000119,7.1e-05,2.1e-05,0.000133,8e-05,6.5e-05,0.000356,7.3e-05,0.000289,0.000135,1.6e-05,9.1e-05,0.000249,7.7e-05,2.4e-05,2e-05,0.000111,0.000113,0.000276,5.6e-05,0.000142,0.000426,0.00016,9.3e-05,0.000246,0.000357,0.000329,7e-05,0.000198,0.000146,0.000219,0.000229,2.7e-05,0.000297,0.000291,0.000357,0.000167,0.000365,2.2e-05,6.3e-05,0.000237,5.7e-05,7.2e-05,0.000272,0.000288,0.000213,0.000338,4.2e-05,0.000214,0.000392,0.000279,0.000127,3e-05,0.000246,0.000203,0.000365,0.000165,3.4e-05,9.5e-05,0.000386,0.000276,0.000176,0.000193,1.8e-05,0.000346,7.7e-05,0.000218,0.000194,5.3e-05,9.7e-05
9e-05,7.5e-05,6e-05,1e-05,5.6e-05,0.000156,0.000249,0.000254,2.1e-05,0.000249,0.000302,8.1e-05,9e-05,0.000104,6.8e-05,0.000108,7e-05,3.6e-05,3.6e-05,9.9e-05,9.4e-05,5.6e-05,7.8e-05,2.8e-05,1.5e-05,9e-06,0.000118,0.000145,0.000108,5.9e-05,1.8e-05,3e-05,4.9e-05,2e-06,5.5e-05,6e-06,1e-06,2.9e-05,6.8e-05,8e-06,7e-06,4.9e-05,4.4e-05,5.4e-05,9.7e-05,3.8e-05,1.8e-05,5.2e-05,1.6e-05,2e-06,6e-05,0.000122,6.7e-05,1.5e-05,0.000132,7.4e-05,6.3e-05,0.000352,8.6e-05,0.000326,0.000171,1.4e-05,0.000106,0.000227,3.4e-05,4.3e-05,2.3e-05,5e-05,0.000143,0.000352,2.8e-05,0.000192,0.000321,0.000169,3.8e-05,0.000253,0.000346,0.000341,4.9e-05,0.000178,0.00016,0.000181,0.000167,6.8e-05,0.000273,0.000196,0.000334,0.000146,0.000357,3.7e-05,4.2e-05,0.000241,0.000116,5.8e-05,0.000303,0.000301,0.000255,0.000359,6.4e-05,0.000244,0.000446,0.000237,0.000182,6.7e-05,0.000222,0.000225,0.000348,0.000221,1.8e-05,9.6e-05,0.000354,0.000279,0.000199,0.000212,2.1e-05,0.000339,8.9e-05,0.000213,0.000184,5.4e-05,8.6e-05
