-2.1e-05,-2e-05,-3.4e-05,-5.6e-05,-3.7e-05,-3.7e-05,-0.001614,-0.019254,-0.01896,-0.012469,-0.097155,-0.20622,-0.207198,-0.176725,-0.150081,-0.147875,-0.136233,-0.073994,-0.027058,-0.010272,-0.003896,-0.004743,-0.005413,-0.001839,-0.002688,-0.002396,-0.001329,-0.000738
-5.6e-05,-5.6e-05,-6e-05,-8e-05,-4.2e-05,-3.2e-05,-0.001139,-0.012383,-0.007506,0.001011,0.034755,-0.044417,-0.089866,0.008333,0.081342,0.139289,0.12175,0.064181,0.019589,0.008416,0.003282,0.001088,0.002821,-9.6e-05,-0.00136,-0.001461,-0.001223,-0.000494
-5e-05,-3.3e-05,-4.1e-05,-5.6e-05,-6.8e-05,-5.5e-05,1e-04,0.002596,0.00381,-0.00037,-0.008485,-0.063955,-0.089443,-0.018795,-0.016286,-0.012428,-0.00033,-0.002749,-0.004213,-0.000245,-0.000141,-0.001599,-0.001444,-0.000615,-0.000488,-0.001226,-0.001099,-6.9e-05
-7e-06,2.5e-05,3.2e-05,3e-05,-1.2e-05,-5e-06,0.001186,0.014012,0.009843,-0.001078,-0.043733,-0.043036,-0.023866,-0.043401,-0.091613,-0.141627,-0.140798,-0.079858,-0.026872,-0.010594,-0.003641,0.000285,-0.001607,-0.000369,0.000101,0.000732,0.001319,0.000586
3.3e-05,6e-05,7e-05,8.1e-05,5.4e-05,5.9e-05,0.001132,0.012097,0.009374,0.009475,0.081172,0.210355,0.220959,0.145712,0.119828,0.119061,0.103953,0.058087,0.024569,0.00833,0.003442,0.005648,0.007108,0.001962,0.001969,0.003179,0.002656,0.000557
-9e-06,8e-06,-4e-06,6e-06,-2e-06,-5e-06,-0.000766,-0.010176,-0.009805,-0.000818,0.030656,0.116273,0.127635,0.072458,0.067363,0.061206,0.079159,0.050683,0.01909,0.00716,0.002112,-0.001218,-0.001858,0.000125,0.001428,0.001586,0.000351,-0.000431
-4e-05,-4.8e-05,-6.7e-05,-4.9e-05,-2.4e-05,-4.6e-05,-0.001415,-0.01625,-0.014061,-0.01008,-0.093797,-0.184887,-0.156162,-0.145066,-0.118836,-0.135739,-0.137451,-0.07325,-0.028048,-0.011004,-0.004617,-0.005427,-0.006203,-0.001501,-0.001121,-0.00093,-0.000814,-0.000521
4e-06,-2.7e-05,-5.3e-05,-3.4e-05,1.3e-05,5e-06,8.3e-05,0.001766,0.00433,0.001455,-0.014013,-0.101706,-0.129211,-0.074202,-0.029502,0.029946,0.015282,0.007386,0.002822,0.000516,0.000416,0.001527,0.003358,3.2e-05,-0.001892,-0.002101,-0.001337,-5.6e-05
1.3e-05,-7e-06,-1.6e-05,6e-06,8e-06,8e-06,0.000846,0.010427,0.009781,0.003512,0.045638,0.061593,0.000499,0.04439,0.044629,0.075617,0.094288,0.05086,0.016008,0.007173,0.002994,0.00206,0.001852,0.000315,-0.000146,-0.001254,-0.001238,0.000348
2.8e-05,2.5e-05,3.3e-05,5.1e-05,2.3e-05,1.9e-05,0.000532,0.006883,0.003998,-0.003069,-0.011802,0.00877,0.018847,0.028305,-0.000853,-0.069239,-0.080193,-0.047594,-0.018092,-0.006835,-0.002552,-0.000764,-0.002281,-4.4e-05,0.000918,0.000661,0.000646,0.000588
1.6e-05,2.7e-05,3.5e-05,3e-05,1.7e-05,2.3e-05,-0.000418,-0.006639,-0.008167,-0.003139,0.001327,0.039324,0.063127,0.030937,0.015429,0.001701,-0.012105,-0.012349,-0.002241,-0.002014,-0.000573,0.001573,0.002169,0.000336,3.2e-05,0.000638,0.000683,-0.000192
-1.3e-05,1e-06,-7e-06,-1.6e-05,-1.5e-05,-1.5e-05,-0.000567,-0.008644,-0.007874,-0.000237,0.029902,0.081821,0.071438,0.027116,0.036277,0.062465,0.090865,0.052525,0.020192,0.008779,0.003081,-0.000246,0.000733,0.000339,0.000152,0.00048,5e-05,-0.000524
-1.5e-05,-1.8e-05,-3.4e-05,-3.2e-05,-1.6e-05,-3.3e-05,-9e-05,0.001107,0.004807,-0.000697,-0.029313,-0.058685,-0.031786,-0.041575,-0.021518,-0.045588,-0.05495,-0.024264,-0.00826,-0.002219,-0.001606,-0.003739,-0.004704,-0.000587,0.000249,0.000401,0.000159,4e-06
-2.2e-05,-3.6e-05,-4.1e-05,-2.9e-05,-9e-06,-2.3e-05,0.000511,0.008002,0.008583,-0.001289,-0.044743,-0.10293,-0.075703,-0.061837,-0.066451,-0.037525,-0.054816,-0.032461,-0.013341,-0.005951,-0.002044,0.002137,0.002788,-0.000141,-0.001053,-0.001408,-0.000823,0.000161
-2.4e-05,-3.3e-05,-1.6e-05,-3e-06,-7e-06,-8e-06,0.000133,0.000198,-0.003693,0.000202,0.028112,0.048215,0.008387,0.019671,-0.00144,0.046027,0.078667,0.041331,0.014349,0.005342,0.002906,0.001172,0.000762,0.00031,-0.001177,-0.001586,-0.001003,-2.3e-05
-1.4e-05,-1.2e-05,2.6e-05,3.1e-05,-1e-05,-7e-06,-0.00013,-0.000632,-0.000601,0.001171,0.038413,0.063804,0.032461,0.057562,0.061561,0.009864,0.002029,0.002345,0.000554,0.000359,0.000294,-0.000433,-0.000893,0.000152,0.000181,0.000255,-5e-06,-0.000106
4e-06,1.2e-05,3.9e-05,2.2e-05,-1.2e-05,1e-06,-0.00033,-0.003279,-0.000898,-0.000918,-0.018547,-0.052788,-0.031375,-0.007252,0.012727,-0.020771,-0.054437,-0.02907,-0.009912,-0.005157,-0.002495,3.8e-05,0.000658,-0.000369,0.000437,0.000611,6.8e-05,-0.00031
9e-06,2.2e-05,2.6e-05,2e-06,2e-06,1.5e-05,-0.000122,-0.003374,-0.003435,0.000512,-0.003417,-0.00684,0.002737,-0.022301,-0.022132,0.015483,0.039649,0.020803,0.009238,0.003629,0.001495,-0.000628,1.1e-05,-7e-06,-8.9e-05,0.000411,0.000669,1.2e-05
2.2e-05,1.1e-05,2e-06,-1.1e-05,1e-05,1e-05,0.000283,0.003104,0.003254,0.001838,0.017,0.037354,0.029262,0.004444,0.005794,0.001074,0.006226,0.00406,0.00198,0.002856,0.001018,-0.001138,-0.002242,-0.000108,-8e-05,0.000146,0.000639,0.000338
