0.032809,0.044245,0.119875,0.203998,0.202954,0.141553,0.076995,0.046503,0.054591,0.262422,0.456308,0.334671,0.273178,0.430826,0.783654,1.013932,0.845958,0.699297,0.868085,0.957811,0.822053,0.643596,0.49296,0.39051,0.351856,0.343364,0.231386,0.130459
0.039276,0.052713,0.137729,0.240844,0.247067,0.171645,0.092453,0.055804,0.06479,0.300809,0.52073,0.389199,0.324978,0.473015,0.837567,1.116263,0.966647,0.81649,0.983254,1.072687,0.940108,0.743196,0.567758,0.45013,0.402499,0.391718,0.267747,0.154897
0.048095,0.064686,0.161161,0.292705,0.312828,0.218794,0.11839,0.070263,0.078457,0.340426,0.583696,0.452393,0.400436,0.523106,0.885762,1.245067,1.148372,1.004008,1.139965,1.213582,1.088855,0.874295,0.678101,0.53082,0.461964,0.448769,0.314967,0.191419
0.050569,0.069367,0.167613,0.313116,0.344789,0.248544,0.13839,0.076699,0.078733,0.316303,0.537044,0.438164,0.434058,0.560881,0.93955,1.359443,1.306326,1.173286,1.238778,1.257287,1.108319,0.897863,0.735551,0.557059,0.454392,0.436311,0.315278,0.20582
0.049588,0.073024,0.175774,0.318373,0.347599,0.261744,0.150144,0.075718,0.069114,0.270099,0.452806,0.378923,0.432344,0.634857,1.096264,1.561271,1.521502,1.382545,1.372583,1.337004,1.116299,0.885796,0.75912,0.535393,0.40378,0.386642,0.28542,0.192392
0.05355,0.085992,0.199944,0.333353,0.353173,0.282007,0.167657,0.0799,0.069142,0.295783,0.482256,0.383405,0.482015,0.819048,1.41555,1.885156,1.836294,1.725495,1.696914,1.636127,1.286719,0.944169,0.7831,0.513508,0.374082,0.362664,0.261416,0.163729
0.063686,0.105614,0.248434,0.373085,0.374737,0.342797,0.220478,0.094178,0.083313,0.412869,0.670996,0.498628,0.62296,1.181596,1.961417,2.416656,2.458506,2.492481,2.496776,2.388053,1.798687,1.216063,0.94365,0.626939,0.484548,0.433194,0.266666,0.1498
0.072682,0.121409,0.322664,0.485201,0.479825,0.460284,0.293797,0.111338,0.105628,0.576475,0.961522,0.694434,0.824192,1.816126,3.053404,3.668582,3.96914,4.256432,4.257149,3.946191,2.965871,2.010019,1.513049,1.038405,0.806001,0.618473,0.31273,0.180834
0.080329,0.131912,0.391709,0.627437,0.642648,0.601258,0.364694,0.12734,0.131018,0.749703,1.289631,0.924799,1.059686,2.874084,5.170854,6.228059,6.812685,7.31676,7.150979,6.406861,4.889022,3.500326,2.674726,1.829117,1.356186,0.919955,0.397455,0.250066
0.089657,0.142902,0.433941,0.733523,0.792617,0.721057,0.415877,0.137995,0.151735,0.947079,1.669745,1.168462,1.305814,4.386202,8.406453,10.099019,10.770442,11.310939,10.851386,9.600469,7.467431,5.556676,4.325863,2.95508,2.139031,1.349038,0.517067,0.343983
0.090534,0.146765,0.450937,0.801132,0.915232,0.812973,0.442687,0.135844,0.154536,1.093262,1.989286,1.384284,1.547416,6.115513,12.172898,14.406556,14.674436,14.885822,14.116815,12.484228,9.845377,7.525198,5.969389,4.086796,2.971585,1.842584,0.661241,0.438587
0.078813,0.139932,0.463724,0.865352,1.007306,0.854861,0.438943,0.123948,0.135918,1.070725,2.037438,1.452965,1.636901,7.221983,14.661059,16.960676,16.35461,15.974567,15.167605,13.402736,10.510726,8.214164,6.658052,4.569219,3.386351,2.148336,0.774527,0.495714
0.066132,0.129011,0.45013,0.871216,1.014381,0.823627,0.407323,0.108377,0.107028,0.86966,1.774956,1.354377,1.530553,6.861571,13.876211,15.51438,14.171673,13.795072,13.52046,11.611413,8.649717,6.903028,5.733194,3.924657,2.984618,1.99549,0.775729,0.472108
0.057871,0.115104,0.390746,0.79086,0.931662,0.728733,0.356371,0.097634,0.082666,0.609306,1.375,1.173711,1.326171,5.091058,9.858621,10.482132,9.205816,9.468138,9.607318,7.728942,5.341643,4.37846,3.714253,2.538411,1.983258,1.423884,0.64097,0.362969
0.050651,0.098607,0.356398,0.720857,0.8249,0.665281,0.35109,0.100256,0.074442,0.479186,1.103739,1.015754,1.259457,3.211465,5.460298,5.538452,4.737837,5.189419,5.348938,4.213581,2.870494,2.30701,1.936793,1.332518,1.054598,0.884385,0.532372,0.274353
0.055458,0.101906,0.410366,0.788326,0.848334,0.725258,0.421309,0.129116,0.091731,0.519828,1.056814,0.987506,1.549373,2.552994,3.24073,3.362401,2.93215,2.96994,2.991525,2.58783,1.853694,1.42534,1.368455,0.933869,0.631382,0.735309,0.605595,0.298648
0.080353,0.138413,0.575913,1.074847,1.11833,0.967822,0.578908,0.186283,0.13199,0.692555,1.267438,1.169847,2.169187,3.19834,3.412935,3.488462,3.048491,2.77755,2.535177,2.362872,1.837027,1.431261,1.565029,1.072758,0.679133,0.918905,0.788429,0.379474
0.117544,0.191242,0.793687,1.489698,1.537106,1.272241,0.741195,0.251714,0.183201,0.979979,1.720703,1.539509,2.977266,4.090151,4.0904,4.338481,3.816858,3.225426,2.784003,2.767666,2.238508,1.867208,2.137509,1.40469,0.90805,1.212882,0.969763,0.460268
0.167281,0.249869,0.989847,1.911443,1.963985,1.473591,0.811265,0.31196,0.237499,1.355334,2.414393,2.081315,3.772546,4.764632,4.467449,5.248926,4.83577,3.744282,3.021256,3.10436,2.577096,2.33091,2.734839,1.760342,1.195909,1.499158,1.094263,0.511729
0.222412,0.30695,1.094223,2.172974,2.235126,1.502309,0.773192,0.362431,0.297898,1.685462,3.059697,2.539712,4.20303,5.06033,4.759417,6.491593,6.165951,4.162322,3.061982,3.130578,2.635796,2.61134,3.182557,2.102549,1.480329,1.700837,1.148433,0.533102
0.262946,0.347427,1.057853,2.13125,2.240266,1.473644,0.763229,0.404645,0.358094,1.817391,3.284343,2.60535,4.03009,4.911101,5.176964,8.022898,7.677221,4.747903,3.244585,2.973801,2.41919,2.547699,3.153435,2.203119,1.629335,1.716271,1.102297,0.527158
0.265093,0.339939,0.87564,1.824525,2.038599,1.355295,0.690098,0.390263,0.381949,1.664768,2.902633,2.17889,3.234194,4.328217,5.664031,9.116927,8.435575,5.086591,3.462809,2.716512,2.042259,2.16946,2.58253,1.958806,1.595278,1.511972,0.920358,0.482114
0.241324,0.29172,0.618612,1.391144,1.702493,1.117222,0.524523,0.318547,0.339177,1.3115,2.207118,1.592386,2.219937,3.482747,5.851139,8.939101,7.650102,4.846322,3.641324,2.556011,1.683424,1.657247,1.831878,1.489457,1.330409,1.182347,0.71377,0.408443
0.204263,0.230526,0.411109,0.981675,1.276236,0.828248,0.379347,0.253849,0.275337,0.98763,1.629771,1.1682,1.501252,2.7203,5.183831,7.144821,5.819354,4.4667,3.720915,2.216638,1.279933,1.276048,1.27984,1.009786,0.981365,0.921641,0.562516,0.319836
0.173316,0.197144,0.303661,0.652366,0.850719,0.590459,0.306716,0.218757,0.238919,0.717346,1.121077,0.839213,1.196067,2.194673,3.851176,5.001736,4.32837,3.860125,3.202423,1.81595,1.167083,1.123003,0.947532,0.712076,0.770553,0.764988,0.485828,0.267903
0.150809,0.182797,0.26029,0.449039,0.569923,0.427247,0.235921,0.176106,0.195249,0.529798,0.810693,0.654258,1.084605,1.926156,3.076038,3.957267,3.440157,2.845799,2.192714,1.451112,1.162494,0.931027,0.722989,0.582159,0.640781,0.62558,0.416312,0.247926
0.146835,0.167342,0.233036,0.357904,0.437548,0.346718,0.201911,0.155785,0.16762,0.409739,0.600565,0.515221,0.934395,1.684595,2.644504,3.209208,2.615084,1.939064,1.33199,1.133993,1.092059,0.7065,0.521799,0.514239,0.585058,0.538488,0.380789,0.254236
0.155469,0.164906,0.213425,0.302272,0.361737,0.32964,0.216142,0.152102,0.15539,0.322753,0.442487,0.409226,0.893253,1.68293,2.581745,2.878673,2.185238,1.487956,0.983717,1.07521,1.105752,0.650395,0.431751,0.508538,0.6747,0.596212,0.393887,0.263171
0.159316,0.168529,0.204495,0.261018,0.341483,0.376591,0.271848,0.183679,0.17369,0.320896,0.429431,0.376072,0.886665,1.866841,2.608925,2.595187,1.9325,1.259762,0.866076,1.073535,1.094792,0.638049,0.41034,0.50489,0.794203,0.760179,0.495567,0.317849
0.164372,0.166422,0.190628,0.267938,0.391051,0.424327,0.301563,0.214623,0.193633,0.309971,0.419604,0.346966,0.790892,1.987776,2.730986,2.471348,1.767306,1.117554,0.815265,0.966236,0.931828,0.571435,0.411886,0.485128,0.832765,0.898877,0.611183,0.368426
0.151552,0.142619,0.164984,0.284833,0.423138,0.399626,0.265757,0.204162,0.180277,0.248962,0.364819,0.321646,0.644217,1.912041,2.619914,2.135198,1.509485,0.977474,0.709802,0.790524,0.792532,0.571897,0.463074,0.484949,0.779495,0.896712,0.645947,0.362362
0.11287,0.10335,0.13583,0.268956,0.394205,0.322293,0.186078,0.150985,0.13704,0.176597,0.293027,0.301307,0.595811,1.770754,2.423207,1.941299,1.439288,0.934011,0.55993,0.668698,0.75244,0.583755,0.507602,0.481057,0.697658,0.780722,0.574668,0.313496
0.077754,0.06669,0.099232,0.223841,0.340971,0.268618,0.138667,0.104403,0.095817,0.135628,0.255939,0.273411,0.607711,1.637018,2.265319,2.071978,1.596435,1.006127,0.557564,0.660677,0.735283,0.544602,0.49531,0.469437,0.679456,0.687711,0.486317,0.289477
0.055759,0.0571,0.094628,0.22557,0.331328,0.255429,0.138428,0.089516,0.072028,0.121728,0.231292,0.229247,0.585293,1.621066,2.258483,2.235069,1.816828,1.15285,0.651225,0.688414,0.706522,0.477345,0.415275,0.418111,0.634693,0.660372,0.458573,0.255766
0.047468,0.061403,0.105845,0.241107,0.321897,0.226213,0.128638,0.0894,0.072064,0.116645,0.205253,0.196912,0.575746,1.791629,2.509433,2.315291,1.844747,1.198163,0.687036,0.655912,0.626604,0.388293,0.338097,0.371917,0.51402,0.569402,0.408822,0.216806
0.04493,0.060976,0.110921,0.240312,0.288985,0.17436,0.103562,0.089669,0.094739,0.13407,0.202127,0.201702,0.573533,1.939722,2.900379,2.471363,1.707498,1.10556,0.781013,0.670557,0.57226,0.378718,0.317775,0.370595,0.413144,0.417702,0.319736,0.178066
0.044218,0.059056,0.116377,0.24239,0.26482,0.150397,0.095044,0.091427,0.12185,0.17234,0.235225,0.229806,0.524572,1.909974,3.125671,2.596759,1.502969,1.050381,1.002427,0.798853,0.592701,0.450948,0.342395,0.351814,0.379823,0.334679,0.267908,0.174559
0.050653,0.054464,0.112049,0.231315,0.258207,0.162294,0.098376,0.109149,0.143813,0.198433,0.259005,0.238206,0.502296,1.766667,2.87725,2.315224,1.16657,0.985514,1.182238,0.964508,0.71186,0.531922,0.353779,0.300266,0.421175,0.429655,0.323307,0.199749
0.057619,0.046911,0.099555,0.199378,0.247732,0.177246,0.099179,0.123641,0.144558,0.189936,0.244179,0.214659,0.528721,1.535084,2.169405,1.695368,0.879046,0.935014,1.15948,0.982616,0.75189,0.539193,0.376322,0.274615,0.429143,0.534604,0.376337,0.209168
0.060076,0.04267,0.089882,0.190044,0.241982,0.181921,0.112248,0.123715,0.128439,0.154287,0.189289,0.191921,0.529664,1.181388,1.382678,1.249286,0.809265,0.826749,0.924595,0.817349,0.65748,0.451772,0.362239,0.251895,0.399771,0.577801,0.375032,0.188508
