-0.293541,-0.294157,-0.256182,-0.310536,-0.307722,-0.246442,-0.270819,-0.318468,-0.300793,-0.241973,-0.224601,-0.195792,-0.226098,-0.272449,-0.305885,-0.341777,-0.323205,-0.22897,-0.228775,-0.246094,-0.211662,-0.283692,-0.2996,-0.326792,-0.312105,-0.285895,-0.282897,-0.261302
-0.423667,-0.490754,-0.35373,-0.420981,-0.496755,-0.42225,-0.355409,-0.380673,-0.45399,-0.387686,-0.37833,-0.364586,-0.413141,-0.407955,-0.427866,-0.49237,-0.434332,-0.373368,-0.428461,-0.385611,-0.32784,-0.35027,-0.39873,-0.4967,-0.489139,-0.475857,-0.497286,-0.355178
-0.124907,-0.223632,-0.118432,-0.094021,-0.190106,-0.208326,-0.114556,-0.083753,-0.184497,-0.196706,-0.229699,-0.252236,-0.220466,-0.130364,-0.114624,-0.133058,-0.072738,-0.16658,-0.233629,-0.143703,-0.133892,-0.020782,-0.075318,-0.132012,-0.147736,-0.208498,-0.252027,-0.077541
0.226753,0.203575,0.13273,0.227677,0.244486,0.124447,0.154669,0.191463,0.15464,0.107551,0.062536,-0.02017,0.060973,0.155979,0.224153,0.268865,0.273571,0.100966,0.079298,0.174542,0.132305,0.266717,0.214724,0.299327,0.297134,0.158555,0.11809,0.171842
0.289624,0.378558,0.196323,0.219532,0.365888,0.275121,0.222797,0.224482,0.284585,0.269397,0.277632,0.185664,0.193623,0.167724,0.213151,0.263567,0.224867,0.187354,0.239076,0.255626,0.209685,0.187017,0.16062,0.30541,0.333405,0.26198,0.278964,0.144503
0.035181,0.140299,0.046563,-0.029496,0.082238,0.119605,0.046492,0.018295,0.12664,0.12533,0.187345,0.177501,0.105443,-0.033422,-0.061852,-0.044727,-0.073658,0.077119,0.154339,0.051827,0.057478,-0.102626,-0.075007,-0.052309,-0.031074,0.074324,0.15185,-0.044677
-0.204829,-0.175231,-0.080834,-0.179817,-0.22618,-0.07575,-0.090212,-0.13302,-0.093426,-0.087267,-0.053308,0.014355,-0.014936,-0.111821,-0.166268,-0.189467,-0.206877,-0.023469,-0.009958,-0.140693,-0.080129,-0.20146,-0.116501,-0.271203,-0.296019,-0.095888,-0.030811,-0.100767
-0.175477,-0.22807,-0.044763,-0.097197,-0.229278,-0.101757,-0.079589,-0.079196,-0.157474,-0.126546,-0.151478,-0.071251,-0.018684,0.034643,0.020079,-0.01713,-0.04404,0.007423,-0.072624,-0.110318,-0.046298,-0.01235,0.066406,-0.134222,-0.188477,-0.05217,-0.063801,0.0086
-0.022335,-0.058648,0.013897,0.061416,-0.011487,-0.052833,-0.049219,0.008149,-0.087128,-0.064551,-0.083612,-0.039102,0.005132,0.150147,0.170902,0.147902,0.127357,0.020588,-0.043229,0.026125,0.024247,0.158423,0.16085,0.134963,0.113679,0.057576,-0.027222,0.065348
0.079409,0.121623,0.012462,0.126971,0.174545,0.001785,-0.000887,0.01837,0.010255,-0.001282,0.034089,0.030743,-0.018051,0.06789,0.088716,0.075787,0.094747,-0.058809,-0.035595,0.074275,0.020473,0.087516,0.017924,0.205955,0.236277,0.025454,-0.055063,0.001641
0.065225,0.141811,-0.004843,0.053566,0.148725,0.02659,0.026106,0.005887,0.063039,0.025728,0.083719,0.046732,-0.051467,-0.110817,-0.143283,-0.140788,-0.064038,-0.122417,-0.06071,-0.0054,-0.056801,-0.117511,-0.182831,0.013069,0.050789,-0.124352,-0.126164,-0.071204
-0.024074,0.02237,0.000305,-0.057545,-0.02136,-0.007738,0.004674,-0.002177,0.058704,0.01415,0.052139,0.031942,-0.029341,-0.186558,-0.241203,-0.202432,-0.115761,-0.068574,-0.028719,-0.065702,-0.070593,-0.162067,-0.182626,-0.179084,-0.168435,-0.152013,-0.091627,-0.061856
-0.11311,-0.115892,-0.024411,-0.118071,-0.149861,-0.042647,-0.016342,-0.011225,0.000482,0.008409,-0.012146,-0.026284,0.004895,-0.10842,-0.064403,0.010887,-0.002199,0.05157,0.036225,-0.03273,0.011402,0.001409,0.026503,-0.149377,-0.160358,-0.002677,0.042669,-0.008999
-0.071892,-0.130135,-0.066653,-0.076195,-0.103329,-0.01218,-0.013068,-0.004196,-0.053229,0.003866,-0.088883,-0.109749,0.01222,0.057569,0.187364,0.23084,0.099549,0.117715,0.059152,0.045667,0.091201,0.14832,0.195182,0.046025,0.0396,0.164993,0.147329,0.046949
0.093068,0.004179,-0.017927,0.067619,0.051545,0.018862,-0.013431,0.013801,-0.035779,-0.023226,-0.103876,-0.091232,0.006059,0.177956,0.235334,0.158333,0.045113,0.077773,0.043674,0.081206,0.086596,0.112507,0.150686,0.175361,0.183723,0.193072,0.13901,0.065535
0.159068,0.108872,0.083065,0.166688,0.117275,0.016075,0.027544,0.033802,0.02817,-0.026651,0.00676,0.052798,0.018875,0.131255,0.047098,-0.077769,-0.071268,-0.035429,0.000765,0.019257,0.001179,-0.047515,-0.032913,0.10387,0.100666,0.033067,0.019912,0.013187
0.032893,0.075551,0.086292,0.069463,0.037881,-0.016565,0.021475,-0.007565,0.026827,-0.00629,0.102832,0.136502,0.03545,-0.035918,-0.17718,-0.191793,-0.080929,-0.114871,-0.060562,-0.073115,-0.083002,-0.147482,-0.160076,-0.058072,-0.08757,-0.169026,-0.128967,-0.081489
-0.10859,0.002634,-0.015906,-0.13169,-0.063883,-0.029841,-0.040457,-0.082375,-0.029282,0.022281,0.086187,0.082445,0.036202,-0.133667,-0.19696,-0.086998,0.008283,-0.088698,-0.074148,-0.08746,-0.095047,-0.075205,-0.107971,-0.121988,-0.14438,-0.179928,-0.145051,-0.093398
-0.098751,-0.041431,-0.092675,-0.181297,-0.067828,0.030187,-0.024016,-0.05671,-0.012864,0.071836,0.040417,-0.007424,0.00645,-0.067661,0.008508,0.100794,0.07374,0.022434,0.000935,-0.003999,-0.021822,0.073368,0.046774,-0.034883,-0.028186,-0.013694,-0.003042,0.030048
