-0.000148,-0.000215,-0.000185,-0.000345,-0.000432,-0.000388,-0.00032,-0.000264,-0.00026,-0.000326,-0.000281,-0.000238,-0.000311,-0.000355,-0.000263,-0.000228,-0.000221,-0.000206,-0.000217,-0.00018,-0.000158,-0.000209,-0.000259,-0.000219,-0.000242,-0.000264,-0.000242,-0.00025
4.2e-05,9.3e-05,0.000101,0.000168,0.000168,0.000161,0.00024,0.000202,0.000147,7.5e-05,7.3e-05,0.000104,0.000139,0.000202,0.000118,0.000118,7.2e-05,8.7e-05,9.2e-05,9.6e-05,0.00011,0.000172,0.000198,0.000167,0.000141,0.000129,0.000129,5.6e-05
-1.4e-05,0,-8e-06,7e-06,-2e-06,2.1e-05,-5.2e-05,-6.3e-05,-4.3e-05,6.8e-05,4.1e-05,-2.9e-05,-4.7e-05,-3.1e-05,1e-06,-4.8e-05,-9e-06,-1.2e-05,-3.7e-05,-5.1e-05,-3.5e-05,-5e-05,-7.5e-05,-5.8e-05,-5.1e-05,-2.6e-05,-3e-06,7e-06
1.5e-05,-7e-05,-6.7e-05,-7.4e-05,-6e-05,-0.000102,-0.000137,-0.000108,-5.8e-05,-1.3e-05,-4e-05,-6.3e-05,-0.000112,-0.000163,-5.6e-05,-1e-06,1e-06,-1.8e-05,-2.4e-05,-2.8e-05,-6.1e-05,-0.000102,-0.00012,-8.5e-05,-5.8e-05,-6.1e-05,-8e-05,-3.7e-05
5.7e-05,8.2e-05,7.1e-05,0.00015,0.000223,0.000177,0.000204,0.000141,0.000138,7.5e-05,8.6e-05,0.000122,0.000177,0.000202,0.000135,0.000138,9e-05,9.7e-05,0.000122,0.000125,0.000103,0.000136,0.00019,0.000162,0.000163,0.000135,0.000108,0.000122
-6.1e-05,-9e-06,-2e-06,-3.3e-05,-3.9e-05,3.4e-05,-2.5e-05,-2e-05,-4.2e-05,-5.1e-05,-9e-06,-4e-06,6.2e-05,8e-05,-2.8e-05,-9.9e-05,-5.3e-05,-5e-05,-5.1e-05,-6.2e-05,-1.2e-05,-2.2e-05,-2.3e-05,-4.4e-05,-7.8e-05,-4.5e-05,3e-06,1e-06
-2.7e-05,-6e-05,-4.7e-05,-0.000115,-0.000205,-0.000182,-0.000115,-3.7e-05,-7.4e-05,-9.8e-05,-1e-04,-7.9e-05,-9.5e-05,-0.000141,-0.000113,-7e-05,-5.1e-05,-4e-05,-3.5e-05,-5.2e-05,-5.5e-05,-6.8e-05,-9.5e-05,-8.1e-05,-8.2e-05,-8.2e-05,-9.5e-05,-0.000137
5.4e-05,5.6e-05,2.6e-05,3.8e-05,-4e-06,-5e-05,5.5e-05,7e-06,3.4e-05,5e-05,3e-05,1.4e-05,-4.5e-05,-4e-05,5.1e-05,6e-05,4e-06,3.3e-05,4.3e-05,7.8e-05,2.9e-05,4.4e-05,6.6e-05,8.1e-05,0.000121,7.1e-05,-8e-06,-6e-06
1.7e-05,4.2e-05,2.2e-05,3.9e-05,0.000137,0.000144,-5e-06,-2.3e-05,2.1e-05,8.6e-05,8.1e-05,3.2e-05,1.1e-05,4.5e-05,4.7e-05,4e-06,1.8e-05,-3e-05,-5.5e-05,-3.2e-05,2e-06,-1.9e-05,-2.5e-05,-1.5e-05,-2e-05,9e-06,6.4e-05,9.9e-05
-3.1e-05,-3.6e-05,-3e-06,2.4e-05,9.6e-05,7.6e-05,2.2e-05,6.5e-05,2.5e-05,-2.3e-05,-4.7e-05,-1.5e-05,1.7e-05,2.7e-05,-2.7e-05,3.3e-05,7.3e-05,3.2e-05,2.3e-05,-2.8e-05,-6e-06,7e-06,-3.4e-05,-2.8e-05,-5.2e-05,-3.1e-05,4.4e-05,1.7e-05
-4.1e-05,-7.8e-05,-4.4e-05,-4.2e-05,-0.000135,-0.000158,3e-06,-2.9e-05,-4e-05,-0.000102,-7.7e-05,-4.7e-05,-4.6e-05,-3.9e-05,-3.7e-05,-2.9e-05,-3.8e-05,1.8e-05,3.9e-05,3.4e-05,-9e-06,1.1e-05,1.4e-05,3e-06,7e-06,-1.9e-05,-8e-05,-6.6e-05
2.2e-05,4e-06,-2.6e-05,-7.5e-05,-0.000112,-3.8e-05,-5e-05,-4.5e-05,-4.2e-05,1.1e-05,7e-05,4.4e-05,1.7e-05,-2.5e-05,-6e-06,-8.1e-05,-9.7e-05,-7e-05,-6.9e-05,-2.2e-05,-1.2e-05,-3.4e-05,1.3e-05,-1.9e-05,-2.6e-05,3e-06,-2.7e-05,2e-06
4.7e-05,9e-05,6.8e-05,9.8e-05,0.000136,0.000146,6.5e-05,9.2e-05,8.4e-05,0.000132,7.6e-05,7.7e-05,0.000118,8.4e-05,6.6e-05,6.6e-05,6e-05,4.1e-05,4.4e-05,2.3e-05,3.7e-05,5.7e-05,8.1e-05,7.2e-05,7.6e-05,8.4e-05,0.000119,5.7e-05
-1.6e-05,-1.9e-05,1e-05,4.6e-05,3.5e-05,-4.5e-05,-1.5e-05,-2.3e-05,9e-06,-1.9e-05,-7e-05,-6.5e-05,-2.2e-05,3.8e-05,2.3e-05,5.6e-05,7.3e-05,4.5e-05,3.6e-05,1e-05,5e-06,1.2e-05,-1.1e-05,1.7e-05,3.7e-05,-7e-06,-1.6e-05,-2.2e-05
-4.9e-05,-6.7e-05,-5.7e-05,-0.000108,-6.6e-05,-5.9e-05,-7.9e-05,-7.7e-05,-8.6e-05,-0.000145,-6.5e-05,-5.5e-05,-0.000127,-1e-04,-8.4e-05,-6e-05,-5.3e-05,-7.5e-05,-0.000106,-7.6e-05,-2.5e-05,-6.4e-05,-0.000114,-0.000104,-0.000108,-0.000102,-9.4e-05,-2.8e-05
1.3e-05,6.1e-05,4.8e-05,4.1e-05,6.2e-05,0.000106,0.000103,5.9e-05,3.4e-05,3.2e-05,4.2e-05,6.2e-05,2.7e-05,-2.1e-05,-1.5e-05,3e-06,-1.5e-05,1.8e-05,4.1e-05,4.3e-05,2.5e-05,4.3e-05,4.1e-05,2.8e-05,2.5e-05,4e-05,5.8e-05,4e-05
4e-05,1.8e-05,9e-06,1.2e-05,-6.1e-05,-6.4e-05,-1.4e-05,1e-05,3.9e-05,9.3e-05,2.6e-05,-7e-06,6.5e-05,7e-05,5.2e-05,1.3e-05,3.5e-05,5.3e-05,8.3e-05,6.3e-05,-2e-05,-1e-06,4.5e-05,4.2e-05,4.3e-05,3.2e-05,6e-06,-1.3e-05
-8e-06,-5.1e-05,-6e-05,-9.3e-05,-0.000107,-9.7e-05,-0.000106,-5e-05,-4.1e-05,-3.1e-05,-5e-06,-3.4e-05,-4.6e-05,-3.2e-05,-5e-06,-4.9e-05,-5.2e-05,-5.1e-05,-7.8e-05,-7.7e-05,-4.8e-05,-5.8e-05,-5.1e-05,-5.9e-05,-6.5e-05,-4.5e-05,-6.4e-05,-3.4e-05
-2e-05,2.5e-05,3.2e-05,9.6e-05,0.000151,0.000133,0.000119,3.2e-05,1e-05,-1.2e-05,1.8e-05,4.6e-05,6e-06,-1.8e-05,1.2e-05,3.9e-05,-1.5e-05,-8e-06,-5e-06,-4e-06,4.6e-05,5.2e-05,5.1e-05,5.6e-05,5e-05,4.6e-05,6.2e-05,2.2e-05
