2e-05,1e-05,1e-06,1e-06,2e-06,2.6e-05,9e-06,1e-06,6e-06,9e-06,3e-06,3.1e-05,1.9e-05,1.1e-05,4e-06,2.2e-05,1.1e-05,4.8e-05,1.4e-05,1.7e-05,3.7e-05,2.1e-05,3.3e-05,6.7e-05,7e-06,2.5e-05,4e-06,4.7e-05,4.7e-05,6.3e-05,2.2e-05,1.1e-05,2.6e-05,1.7e-05,3.4e-05,3.3e-05,4.4e-05,4.1e-05,2e-06,2e-06,4e-05,4.9e-05,3.5e-05,1e-06,1e-05,4e-06,1.9e-05,6.9e-05,4.9e-05,0.00013,1.3e-05,4.7e-05,3.5e-05,9.2e-05,5.7e-05,2e-06,2.8e-05,4.9e-05,6.7e-05,2.7e-05,5.3e-05,6e-06,3.4e-05,9.8e-05,6.2e-05,0.000124,3e-06,4.8e-05,4e-06,7.7e-05,7.1e-05,5e-05,4.4e-05,3.3e-05,9.7e-05,3.9e-05,0.000128,1.3e-05,1.7e-05,6.6e-05,0.000113,7e-06,2.2e-05,0.000126,4.1e-05,5e-05,2.5e-05,6e-06,1.1e-05,1.1e-05,3.5e-05,2e-06,0.000108,8.4e-05,8.6e-05,7e-06,2.1e-05,9.5e-05,3e-05,1.9e-05,1.2e-05,3.9e-05,6.4e-05,2.9e-05,2.9e-05,8.4e-05,4e-05,5.5e-05,6.7e-05,1.7e-05,4e-06,3.7e-05,2.9e-05,1.5e-05,2.2e-05,6.1e-05,5.3e-05,2.6e-05,5.9e-05,5.6e-05,2e-06
5.7e-05,5.5e-05,4.4e-05,3.7e-05,4.5e-05,6.2e-05,5.1e-05,1.3e-05,1.7e-05,6.6e-05,2.3e-05,3.5e-05,7.2e-05,1.5e-05,1.3e-05,5.4e-05,5.5e-05,0.000101,2.8e-05,3.2e-05,9.4e-05,2e-05,6.7e-05,0.000188,1.6e-05,6.4e-05,4.6e-05,0.000103,9.7e-05,8.7e-05,4.1e-05,3.9e-05,7.8e-05,4e-05,0.000128,9.8e-05,7e-05,8e-05,5.2e-05,4.7e-05,6.5e-05,0.000103,5.5e-05,3.7e-05,1.8e-05,2.3e-05,3.5e-05,0.000146,0.000152,0.00024,3.9e-05,0.000114,9.5e-05,0.000163,0.000119,2.8e-05,6e-05,0.000123,6.6e-05,1e-04,0.000103,3e-05,0.000104,0.000218,0.000127,0.000267,2.4e-05,9.3e-05,7e-06,0.000124,0.000111,8.9e-05,9.7e-05,4.9e-05,0.000202,7.7e-05,0.000234,2.7e-05,8e-05,0.000126,0.000238,4e-05,7.3e-05,0.000225,0.000115,0.000114,6.5e-05,4.1e-05,1.2e-05,3.5e-05,6.6e-05,1.2e-05,0.000218,0.000177,0.000181,4.2e-05,5.4e-05,0.000209,4.9e-05,1.4e-05,5.9e-05,5.4e-05,0.000137,0.000113,8.9e-05,0.000192,6.9e-05,0.000112,0.000128,1.6e-05,1e-05,9.5e-05,6.5e-05,2.2e-05,3.8e-05,0.000178,8.6e-05,0.00012,0.00016,0.000134,2.4e-05
1.6e-05,9.8e-05,6.2e-05,3e-05,6.4e-05,3.7e-05,1.3e-05,6e-05,2.4e-05,5.7e-05,8e-06,8e-06,6.9e-05,2.5e-05,1.9e-05,5.8e-05,1.6e-05,0.00011,0.000122,3.9e-05,6.5e-05,6.9e-05,3.3e-05,0.000112,0.000105,0.00011,0.000123,0.000188,5.3e-05,0.000104,8.7e-05,3.2e-05,6.3e-05,8e-05,0.000187,1.7e-05,0.000169,0.000127,8.1e-05,4.7e-05,8.6e-05,0.000152,5.7e-05,0.000115,8.8e-05,8e-06,4.3e-05,0.000131,0.000184,0.000282,5.5e-05,0.000162,9.3e-05,0.000127,0.000145,0.000132,4.2e-05,0.000113,0.000122,3.7e-05,0.000131,3.8e-05,0.000124,0.000216,0.000207,0.000243,0.000106,0.000186,0.000103,9.7e-05,6.8e-05,0.000126,9.3e-05,0.000199,0.000282,0.000119,0.000266,6.5e-05,0.000109,7.8e-05,0.000345,7.2e-05,6.1e-05,0.000192,3.9e-05,0.000157,5.4e-05,8.7e-05,0.000138,6.3e-05,7.4e-05,3.4e-05,0.000292,0.000141,0.000133,4.7e-05,4.3e-05,0.000169,2.5e-05,4e-05,2.9e-05,6.4e-05,9e-05,0.000166,0.00018,0.000164,6.1e-05,0.00021,0.000217,0.000103,2.7e-05,7e-05,5.7e-05,5.8e-05,1.8e-05,0.000211,0.000102,0.000199,5.1e-05,0.000121,4.5e-05
6.6e-05,9.7e-05,3.1e-05,5.4e-05,5.6e-05,3.4e-05,0.000101,0.000114,8e-05,4.6e-05,6.3e-05,5.2e-05,0.000142,9.6e-05,0.000125,7e-06,4.8e-05,5.5e-05,0.000125,0.000135,0.000132,0.000106,0.00013,2.6e-05,6.8e-05,0.00012,0.000159,0.000198,0.000124,0.000166,0.000169,0.000128,0.000118,0.000159,0.000112,9.6e-05,0.00014,0.000102,0.00015,0.000198,0.000129,0.000249,9.7e-05,0.000185,6.7e-05,6.3e-05,4.1e-05,0.000171,0.000206,0.000335,0.000123,0.000101,0.000214,0.000253,0.000121,0.000132,0.000123,6.7e-05,0.000168,2e-05,0.000216,8.1e-05,0.00017,0.000274,0.00025,0.000247,1.9e-05,0.000161,6.9e-05,0.000157,2e-04,0.000175,1.1e-05,0.000162,0.000239,0.000185,0.000368,0.000112,0.000152,0.000144,0.000223,2.6e-05,8.9e-05,0.000159,0.000104,0.000148,0.000123,0.000126,0.000344,0.000227,1.7e-05,0.000104,0.000166,0.000256,0.000135,3.7e-05,0.000105,0.000346,0.000128,0.000119,8.7e-05,5.4e-05,5.9e-05,0.000275,4.9e-05,0.000315,0.00019,0.000305,3.9e-05,0.000174,8.4e-05,0.000184,5.5e-05,0.000227,0.000141,0.000173,5.6e-05,8.8e-05,7.7e-05,0.00026,0.000111
2.1e-05,3e-05,2.7e-05,0.000103,6.6e-05,0.000125,0.000114,9e-05,4.9e-05,6.7e-05,5.3e-05,3.8e-05,0.000169,0.000146,0.000149,1e-04,0.000125,0.00019,0.000143,0.00013,0.000143,5.7e-05,0.000136,0.000197,0.000101,0.000239,0.000136,5e-05,0.000125,0.000232,0.00028,0.000147,0.000131,0.000148,0.000163,8.4e-05,3.2e-05,0.000133,1.7e-05,0.000122,0.000108,3e-04,0.000301,0.000107,0.000119,0.00012,0.00012,0.000183,0.000203,0.000368,0.000132,0.00014,0.000224,0.000163,0.000283,0.000207,0.000119,0.00019,0.000269,0.000127,0.000222,4.7e-05,0.000141,0.000201,0.000249,0.000327,8.7e-05,0.000125,8.2e-05,0.000161,0.000287,0.000148,9.7e-05,0.000121,0.000279,0.000266,0.000315,5e-06,0.000119,0.000179,0.000269,7.5e-05,0.000253,0.000306,9.6e-05,0.000193,0.000198,0.000322,0.000231,0.000246,0.00013,0.000209,0.000289,0.000109,0.000154,2.1e-05,0.000159,0.000331,0.000122,0.000151,2.1e-05,0.000149,0.000299,0.000259,0.00013,0.000283,0.000184,0.000152,0.000132,0.00025,0.00027,0.000338,8.3e-05,0.000269,4.2e-05,7.4e-05,0.000335,6.1e-05,6.6e-05,0.000106,0.000169
4.7e-05,5.2e-05,5.4e-05,0.000136,0.000103,0.000121,0.000172,9.8e-05,0.000119,0.000194,6.4e-05,6.5e-05,0.000124,0.000117,1e-04,4.4e-05,0.000303,0.000279,5.3e-05,0.000148,0.000238,7.5e-05,3.7e-05,0.000369,0.000129,9.7e-05,0.000115,0.000221,0.000267,0.000298,0.000325,0.000447,0.000197,0.000265,0.000108,2.8e-05,0.000197,0.000272,6.8e-05,0.000166,0.000181,7.3e-05,0.000169,0.000207,0.000272,0.00012,0.000167,0.000181,0.000124,0.000369,0.000208,0.000211,0.000171,0.000464,0.000265,0.000371,7e-05,0.000101,0.000171,8.7e-05,0.000145,0.000249,0.000296,0.000341,0.000474,0.000303,0.000147,0.000228,0.000176,0.000113,0.00034,0.000179,0.000317,0.000143,0.000442,0.000134,0.000543,7e-05,0.000263,3.1e-05,0.00038,0.000194,0.000332,0.000288,0.00022,0.000132,0.000107,0.000159,0.000526,0.000132,7.1e-05,0.000144,0.000424,0.00026,0.000407,0.000277,0.000161,0.00042,0.000218,0.000224,0.000251,0.000285,0.000401,0.00018,8.9e-05,0.000371,0.000316,0.000345,0.00022,0.000277,0.000149,0.000526,0.00025,0.000384,0.000139,0.000269,0.000189,0.000261,0.000296,0.000219,1.9e-05
6.6e-05,5.6e-05,5.8e-05,4.7e-05,0.000141,0.000195,0.000125,8.3e-05,0.000231,0.000356,0.000369,0.000167,8.8e-05,0.000154,8.3e-05,0.000302,0.00038,0.000413,0.000256,2e-04,0.000376,0.000395,0.000407,0.000419,0.000304,0.000438,0.000122,0.000697,0.000651,0.000299,0.000316,0.000345,0.000462,3.5e-05,0.000219,7.6e-05,0.000322,3.1e-05,6e-06,0.000364,0.000661,7.2e-05,0.000404,0.000489,0.000397,0.000605,0.000238,0.000372,4.9e-05,0.000598,0.000308,0.000383,0.000331,0.000648,3.4e-05,0.000211,0.000258,0.000319,0.00041,0.000536,0.000294,0.000244,0.000417,0.000485,0.000691,0.000534,0.000168,0.000556,0.00023,0.000432,0.000358,0.000256,0.000697,0.000201,0.00073,0.000556,0.000777,6.5e-05,0.000399,0.000421,0.000191,0.000405,6.4e-05,0.000633,0.000391,0.000264,0.00016,0.000279,0.000606,0.000719,0.000383,0.000371,0.000686,0.000867,0.000507,0.000432,0.000169,0.000533,0.000199,0.000141,0.000402,0.000155,0.000529,0.000427,0.000149,0.000678,0.000416,0.000552,0.000324,0.000142,0.000307,0.001427,0.000445,0.000455,0.000435,0.000939,0.000247,0.00016,0.000539,0.000599,0.000198
1.2e-05,0.000127,0.000123,0.000119,9.2e-05,0.000228,0.000227,0.000124,0.000165,0.000257,0.000461,0.000212,0.000381,0.000201,0.000199,0.000397,0.000858,0.000387,0.000309,0.000352,0.000161,0.000743,0.000388,0.000816,0.00084,0.000241,0.000602,0.000713,0.000267,0.000984,0.000957,0.000572,0.000106,0.000393,0.000232,0.000328,0.000307,0.00045,1.5e-05,0.000626,0.001029,0.001114,0.00066,0.001294,0.000725,0.000708,0.000506,0.000827,0.000172,0.00128,0.000815,0.000413,0.000869,0.000938,0.00104,0.000349,0.000955,0.000255,0.000917,0.001388,0.001338,0.000424,0.000332,0.000798,0.000215,0.001023,0.000184,0.000539,0.000859,0.000591,0.000799,0.000422,0.00058,0.001031,0.00151,0.001701,0.000687,0.000862,0.000103,0.00031,0.00088,0.000506,0.000141,0.00101,0.001176,0.001733,0.001061,0.000465,0.000276,0.000553,0.000557,0.000808,0.000594,0.001287,0.000803,0.001133,0.000961,0.001193,0.000398,0.000364,0.00052,0.000943,0.000603,6.6e-05,0.000571,0.000432,0.001161,0.000715,0.000225,0.000464,6e-04,0.001361,0.00146,0.00127,0.000966,0.001352,0.00133,0.000211,0.000632,0.000878,0.000987
0.000209,0.000235,0.000102,0.000128,5.1e-05,0.000233,0.000342,0.000317,0.000322,0.000457,0.000104,0.000191,0.000486,0.000221,0.000285,0.000629,0.000592,0.000509,0.000899,0.000245,0.000168,0.000786,0.000902,0.000832,0.000566,0.000925,0.000959,0.001001,0.001396,0.001297,0.001307,0.000909,0.000976,0.000266,0.000391,0.000271,0.000189,0.000314,0.000531,0.000636,0.000625,0.000887,0.000982,0.000654,0.000586,0.001423,0.000831,0.000825,0.000808,0.001453,0.001502,0.000415,0.001071,0.001416,0.002476,0.002602,0.002644,0.00159,0.00034,0.002138,0.000788,0.00073,0.000753,0.001692,0.001676,0.002485,0.001577,0.001461,8e-04,0.001801,0.000921,0.000952,0.001006,0.000446,0.000821,0.000633,0.002067,0.001814,0.001736,0.000622,0.001515,0.001798,0.001269,0.001475,0.00156,0.000678,0.00044,0.0012,0.001199,0.001154,0.000194,0.000884,0.000973,0.000916,0.00101,0.000931,0.001415,0.000851,0.00147,0.000559,0.000889,0.000904,0.000914,0.000165,0.000733,0.00135,0.001902,0.001465,0.000741,0.000339,0.000756,0.001825,0.001751,0.000123,0.000439,0.001086,0.002122,0.002291,0.001594,0.000419,0.001089
6.3e-05,0.000117,8.8e-05,0.000105,7.8e-05,0.000144,8.9e-05,0.000167,0.000127,0.000162,0.000213,0.000198,0.000195,0.000359,5.9e-05,0.000362,0.000378,0.000118,0.000647,0.000697,0.000345,0.000313,0.000708,0.000456,0.000241,0.000544,0.000205,0.000103,0.000902,0.000311,0.000689,0.000691,0.001003,0.000571,0.000434,0.00045,0.000216,0.00038,0.000823,0.000986,0.001169,0.000293,0.000689,0.00109,0.000494,0.001058,0.000555,0.000598,0.001303,0.001456,0.001544,0.001669,0.001771,0.001051,0.001509,0.001436,0.000674,0.00038,0.000862,0.001512,0.0012,0.001112,0.00066,0.001631,0.001353,0.002569,0.002562,0.000566,0.000368,0.001742,0.001171,0.001294,0.000644,0.000976,0.00171,0.001368,0.00282,0.0028,0.001381,0.000882,0.001062,0.001914,0.000715,0.001186,0.00109,0.001585,0.001326,0.001581,0.001004,0.000887,0.001435,0.001426,0.00094,0.000692,0.001352,0.001348,0.001225,0.000696,0.001323,0.000979,0.000977,0.000461,0.000982,0.001269,0.001246,0.000703,0.000812,0.00072,0.000563,0.000274,0.000648,0.000721,0.000902,0.000986,0.000287,0.000875,0.00103,0.00069,0.000772,0.000679,0.001135
8.3e-05,1.8e-05,3.2e-05,0.00011,8.5e-05,1.5e-05,2.5e-05,0.000158,5.5e-05,8e-05,0.000115,0.000162,0.000249,0.000299,0.000256,0.000114,2e-04,0.000397,0.000258,0.000203,0.000219,0.000137,0.000281,0.000295,5e-05,0.000269,0.000377,0.000326,0.00061,0.00041,0.000127,0.000627,0.000433,0.000345,0.000611,0.000423,0.000423,0.000466,0.000607,0.000711,0.000524,0.000473,0.000249,0.00025,0.000533,0.00014,0.000257,0.000611,0.000497,0.000797,0.00077,0.000732,0.000592,0.000783,0.000655,0.00044,0.000577,9.1e-05,0.00078,0.000252,0.000229,0.000374,0.000648,0.000425,0.000687,0.001216,0.000678,0.000958,0.000936,0.000658,0.000329,0.00036,0.000191,0.000452,0.000949,0.001117,0.001639,0.000846,0.001162,0.000796,0.001418,0.00032,0.000367,0.000992,0.000287,0.000333,0.000535,0.000837,0.000601,0.001084,0.000609,7e-06,0.000672,0.000764,0.001208,0.000897,0.000747,0.000397,0.000558,0.000534,0.00016,0.000182,0.000569,0.000547,0.000268,0.000919,0.000535,0.000483,0.000505,0.000481,0.000429,0.00098,0.000257,0.00024,6.8e-05,0.000289,0.00073,0.000399,0.000195,0.000242,0.000577
5.3e-05,2.8e-05,3e-06,3.1e-05,5.7e-05,8.7e-05,8.4e-05,5.5e-05,2.9e-05,7e-05,2.1e-05,9.2e-05,0.000142,7.3e-05,6.5e-05,7.9e-05,5.8e-05,0.000215,4.5e-05,0.00011,0.000185,0.000224,8.4e-05,7.6e-05,9.1e-05,9.3e-05,0.000141,0.000253,7.6e-05,0.000257,8.3e-05,3e-04,0.000113,0.000147,0.000233,0.000149,0.000119,0.000179,0.000259,0.000183,5.4e-05,0.00014,0.00017,0.000201,0.00026,0.000259,0.000108,0.000296,0.000142,0.000479,0.000418,0.000403,0.00011,0.000321,0.000366,0.00022,0.000208,5.8e-05,0.000571,2e-04,0.000228,0.000184,0.000261,0.000314,0.000576,0.000548,9.9e-05,0.000435,0.000314,0.000242,0.000124,0.000261,6.6e-05,0.000167,0.000492,0.000508,0.000789,0.000187,0.000324,0.000183,0.000411,0.000171,0.00019,0.000606,0.000188,0.00026,0.000197,0.000342,0.000407,0.000302,0.000175,9.4e-05,0.000312,0.000396,0.000406,0.000427,5e-05,0.000117,0.000252,0.000189,0.000244,0.000189,0.000266,0.000349,7.8e-05,4e-04,0.000186,0.000337,9.2e-05,0.000196,0.000141,0.000527,0.000113,0.000106,6.5e-05,0.000358,0.000517,0.000263,0.000196,0.000158,0.000236
7.5e-05,6e-06,2.5e-05,3.3e-05,6.1e-05,7.1e-05,8.7e-05,7.7e-05,5.6e-05,6.2e-05,6.1e-05,6e-05,0.000123,4.1e-05,3.9e-05,9e-05,4.9e-05,8.1e-05,6.8e-05,3.2e-05,0.000137,6.6e-05,3.2e-05,0.000128,0.000102,9.8e-05,8.8e-05,0.00024,0.000138,0.000178,2.4e-05,0.000188,0.000115,8.8e-05,0.000102,7.6e-05,6.2e-05,9.4e-05,0.000199,9.6e-05,4.4e-05,8.4e-05,7.7e-05,7.1e-05,0.000207,7.2e-05,8.8e-05,0.000191,0.000176,0.000248,0.000229,0.000303,0.000159,0.000244,0.000209,0.000232,0.000263,0.000131,0.00046,0.000203,0.000185,5.2e-05,0.000172,0.000309,0.000398,0.000457,1e-04,0.000334,0.00017,0.000182,0.000151,0.000214,0.000113,0.000144,0.000394,0.000501,0.000574,0.000169,0.000204,0.000245,0.000232,0.000171,0.000251,0.000433,8.1e-05,0.000133,0.000276,0.000191,0.000296,0.000189,0.000129,0.000104,0.000212,0.000257,0.000261,0.000355,5.1e-05,4.2e-05,0.000253,0.000242,0.000214,0.000147,0.00016,0.000234,3.8e-05,0.000206,0.000204,0.000134,5.8e-05,0.000144,9.3e-05,0.000345,0.000146,0.000109,6.9e-05,0.000213,0.000375,0.000279,0.000243,0.000128,0.000117
0.000102,5.6e-05,3.5e-05,5.4e-05,0.000132,0.000156,0.000177,0.000134,0.000146,7e-05,8.3e-05,0.000139,0.000175,0.000173,0.000198,0.000158,4.5e-05,0.000117,8.2e-05,5.3e-05,0.000117,0.000116,0.00013,0.000168,0.000162,0.000191,0.000171,4e-04,0.000113,0.000211,9e-05,0.000196,0.000239,3.2e-05,0.000192,8.6e-05,6.9e-05,9.6e-05,0.000165,0.000224,2.5e-05,0.000207,8.4e-05,5.4e-05,0.000151,0.000155,0.000289,0.000245,0.000281,0.000335,0.000221,0.000332,6.3e-05,6.9e-05,0.000306,7.3e-05,0.000127,0.000184,0.000329,0.000472,0.000419,0.000362,0.000341,0.000347,0.000448,0.000384,0.000254,0.000539,0.000122,8.6e-05,0.000192,0.000179,0.000149,0.000232,0.00025,0.000126,0.000518,0.000161,0.000372,0.000369,0.000181,2e-04,0.000238,0.000399,0.000245,0.000215,0.000508,0.000247,0.000288,8.8e-05,0.000206,0.000175,9.6e-05,0.000103,0.000468,0.000366,0.000426,4e-05,0.000226,1e-04,0.000305,0.000272,6.4e-05,0.000218,0.000133,0.000118,0.000148,0.000217,6.9e-05,0.000278,0.000128,0.000334,0.000243,0.000237,5.9e-05,0.000155,0.000353,0.000325,0.00049,0.00016,9.9e-05
3.4e-05,7.4e-05,8e-05,1.2e-05,0.00011,9.4e-05,4.5e-05,0.000167,0.000129,0.000119,0.000104,7.7e-05,0.000102,0.000165,0.000176,0.000169,0.000121,0.000132,1.1e-05,0.000148,0.000106,0.000376,0.000348,6.2e-05,0.000159,7.5e-05,7.4e-05,0.000448,0.000222,0.00014,9.5e-05,0.000251,0.000197,0.000276,0.000399,0.000289,0.000309,0.000116,0.000231,0.000338,0.000274,0.000218,0.000144,0.000123,0.000166,0.000108,0.000328,0.000365,0.000171,0.00012,0.000369,0.000519,0.00046,0.000257,0.000619,0.000384,3e-05,0.000119,0.000573,0.000699,0.000384,0.000211,0.000308,0.000405,0.000406,0.000456,0.000473,0.000325,0.000597,0.000637,0.000184,0.000305,0.000299,0.000125,0.000149,0.000217,0.000353,0.000385,0.000264,0.000242,0.00037,0.000296,0.000425,0.000184,0.000105,0.000273,8.7e-05,0.000549,0.000704,0.000329,0.00011,0.000342,0.000466,0.00021,0.000618,0.000317,0.000444,0.000479,0.000158,9.5e-05,0.000452,0.000295,0.000271,0.000228,0.000347,0.000362,0.000191,0.00022,0.000309,0.000453,0.000177,0.000395,0.000369,0.000221,0.000271,0.000508,0.000638,4.3e-05,0.00045,0.000358,0.000239
0.000101,0.000121,4.2e-05,2.4e-05,5.4e-05,4e-05,7.7e-05,4.8e-05,7.3e-05,0.000124,3.2e-05,4.2e-05,0.000133,6.7e-05,0.000185,0.000116,5.9e-05,6.7e-05,2.4e-05,0.000273,0.000212,0.000367,0.000201,0.000259,0.000103,0.000185,1.7e-05,0.000366,0.000278,0.000125,0.00016,0.000174,0.000194,5.7e-05,0.000218,0.000271,7.2e-05,0.000115,0.000339,0.000111,1e-05,0.000238,0.000513,0.00035,0.000225,0.000165,0.00038,0.00021,5.4e-05,0.000313,0.000504,0.000479,0.000242,0.000225,0.00022,7.6e-05,0.000199,0.000133,0.000651,0.000311,0.000329,0.000118,0.000202,6.5e-05,0.000225,0.000339,0.000228,0.000468,0.000193,0.000398,0.000561,0.000342,0.000186,0.000109,0.000126,0.000547,0.000404,0.000293,0.000491,0.000359,0.000218,0.000543,9.7e-05,0.000468,0.000242,0.00031,0.00024,0.000466,0.00035,0.00045,0.000218,0.000474,0.000237,0.000154,0.000282,0.000206,0.00015,0.000168,0.000533,0.00032,0.000718,0.000264,0.000455,0.000198,0.000189,0.000215,0.000501,0.000261,7.5e-05,0.000121,0.000227,0.000522,0.000296,0.000201,0.000408,0.000495,0.000272,0.000661,0.000473,0.000368,0.000246
7.3e-05,2.1e-05,6.4e-05,5.2e-05,4.8e-05,3.9e-05,2.8e-05,7.9e-05,0.000121,8.2e-05,9.6e-05,4.3e-05,7.5e-05,7e-05,0.000183,0.000219,0.00021,0.000255,0.000189,0.00027,0.000308,0.000106,9.8e-05,0.000188,0.00029,0.000143,0.00019,0.000313,0.000209,9.1e-05,0.000107,0.000196,5.2e-05,7.4e-05,0.000186,0.000218,0.000176,0.000392,0.000359,0.000463,2e-04,0.000198,0.00037,0.00055,0.000626,0.000535,0.000163,0.000383,0.000267,0.000478,0.000353,0.000351,0.000729,0.000458,0.000502,0.000375,0.00024,0.000155,0.000486,0.000273,0.000331,0.000373,0.000306,0.000131,0.000411,0.000671,0.000385,0.000522,0.000733,9.6e-05,0.000475,0.000685,0.000328,0.000195,0.000288,0.000413,0.000289,0.000435,0.000541,0.000599,0.000247,0.000426,0.000428,0.000456,0.00052,0.000293,0.000548,0.00034,0.000492,0.000974,0.000707,0.000582,0.00071,0.000394,0.000177,0.000297,0.00013,0.000403,0.000576,0.00038,0.000633,0.000733,0.000818,0.000455,8.8e-05,0.000371,0.000262,0.000329,0.000179,0.000109,0.000199,0.00039,0.000617,0.000553,0.000339,0.000836,0.001085,0.001184,0.000777,0.000573,0.000596
1e-05,3.4e-05,3.8e-05,3.8e-05,1.1e-05,6e-05,4.9e-05,4.5e-05,7.1e-05,7.5e-05,6.7e-05,4.6e-05,0.000112,5.7e-05,0.000104,8.2e-05,0.000118,0.000179,9.8e-05,0.00015,3.6e-05,0.000174,8.4e-05,9.3e-05,0.000101,0.000248,0.000109,0.000115,8.4e-05,7.8e-05,0.000144,0.000338,8.1e-05,7.2e-05,8.5e-05,0.000225,0.000144,0.000383,0.000115,0.00031,0.00029,0.000215,0.00016,0.000248,0.000256,0.000192,0.000152,0.000302,0.000196,0.000328,0.000419,0.000309,0.00033,0.000278,0.000533,0.000559,0.000153,0.000151,0.000296,0.000187,0.000336,9.1e-05,0.000136,5.7e-05,0.000391,0.000252,0.000186,0.000396,0.000411,0.000287,0.000474,0.000389,0.000186,8.2e-05,0.000266,0.00033,0.000255,0.000334,0.000426,0.000331,0.000267,0.000385,0.000257,0.000292,0.000377,2.4e-05,0.000338,0.00033,0.000389,0.000326,0.000299,0.000414,0.000144,0.000188,4.8e-05,0.000298,0.000371,0.000707,0.000263,0.000228,0.000558,0.000475,0.000161,0.000308,0.000449,4.5e-05,0.000254,0.000251,0.00018,0.000211,0.00017,0.000146,0.000396,6.1e-05,0.000247,0.00034,0.000604,0.000174,0.000327,0.000538,0.000216
2.3e-05,4e-05,2.8e-05,4.5e-05,4.9e-05,2.8e-05,3.9e-05,4.2e-05,3.1e-05,8.4e-05,8.1e-05,6.7e-05,0.000123,0.000112,6.3e-05,0.000119,0.000128,7.9e-05,6.4e-05,4.5e-05,5.4e-05,0.000132,0.000114,0.000113,0.00014,5.3e-05,0.000108,0.000169,0.000257,0.000216,0.000229,4.7e-05,7.7e-05,6.1e-05,0.000113,0.000206,9.4e-05,0.000218,8.1e-05,0.000125,9.2e-05,0.000178,0.000229,0.000326,0.000148,0.000138,4.3e-05,5.4e-05,0.000156,0.000234,0.000101,0.000217,0.000233,0.000192,0.000428,0.000175,0.00015,0.000225,0.000387,0.000286,0.000192,8e-05,8.1e-05,0.000258,0.000167,0.000301,0.000211,0.000186,0.000328,5.9e-05,0.00026,6.3e-05,0.000153,0.000218,0.000319,0.000354,0.000412,0.000333,0.000799,0.00047,0.000283,0.000346,0.000241,0.000394,0.000201,0.000141,8.1e-05,0.000285,0.000395,0.000201,0.000326,0.000419,0.000446,0.00013,9.8e-05,9.5e-05,0.000325,0.000249,0.000432,0.000353,0.000162,0.000174,0.000134,0.000131,0.000407,0.000323,0.000112,7.8e-05,0.000151,0.000148,0.000392,0.000533,0.000323,0.000213,0.000217,0.000223,0.000315,0.000125,0.000318,9.8e-05,0.000419
1.2e-05,1.6e-05,2.3e-05,3.6e-05,1e-06,3.3e-05,1.5e-05,2.3e-05,1.4e-05,5.9e-05,9e-05,3.3e-05,8.7e-05,3.5e-05,2.3e-05,8.2e-05,8.4e-05,0.000136,8.4e-05,0.000142,0.000143,4.1e-05,8.9e-05,5.9e-05,4.9e-05,7e-05,8.3e-05,7.6e-05,0.000118,5.3e-05,0.000102,0.000216,9.4e-05,5.6e-05,0.000117,0.000133,9.7e-05,9.3e-05,0.000119,6e-06,5.8e-05,0.000251,5.3e-05,0.000222,0.000169,0.000148,9.6e-05,0.000177,0.000271,0.000345,0.00014,0.000343,0.000272,0.000127,0.000361,0.000177,0.000129,0.00023,0.000292,8.1e-05,0.000104,2.2e-05,5e-06,0.000263,0.000185,0.000198,0.000124,6e-05,0.000163,3.1e-05,1.2e-05,7.9e-05,0.000114,0.000175,9.8e-05,0.000249,0.000341,0.000118,0.00044,0.000221,0.000127,0.000145,0.00012,0.000213,0.00025,0.000202,0.000109,8.7e-05,0.000229,0.000291,0.000102,0.000187,0.000147,0.000152,0.000115,0.000177,0.00026,0.000247,0.000255,9e-06,0.000164,0.000181,0.000155,0.00015,0.000392,0.000172,0.000103,0.000194,0.000236,0.000139,0.000228,0.000169,0.000122,0.000131,9e-05,0.000165,1e-04,0.000175,0.000126,8.3e-05,0.000301
2.3e-05,1.1e-05,3e-06,4.2e-05,2.1e-05,4e-05,3.8e-05,3.5e-05,2.4e-05,4.3e-05,1.4e-05,3.5e-05,7.1e-05,0.000105,8.6e-05,5.2e-05,0.000158,2.7e-05,3e-05,4.9e-05,2.9e-05,0.000102,4.2e-05,6.4e-05,4.8e-05,8.5e-05,1.9e-05,0.00011,9.8e-05,3.1e-05,9.6e-05,0.000156,0.000123,0.000119,0.00016,4.1e-05,6.2e-05,3.7e-05,0.000128,9.2e-05,4.1e-05,0.000177,0.000187,0.00015,0.000188,7.3e-05,2.8e-05,0.000184,0.000347,0.000108,0.000126,0.00022,1.2e-05,0.000262,0.000266,7.2e-05,0.000115,0.000163,0.000268,5.6e-05,6.9e-05,0.000133,4e-05,0.000194,0.000133,0.000174,0.000119,2.7e-05,0.000216,0.000113,0.000208,0.000103,0.000246,5.1e-05,2.1e-05,9.3e-05,0.000203,0.000105,0.000137,0.000169,7.4e-05,7.1e-05,3.6e-05,0.000142,6.8e-05,8.3e-05,0.000188,0.00016,0.000294,0.00046,0.000301,0.000218,0.000107,5.2e-05,4.5e-05,0.000196,0.000221,5.4e-05,0.000191,0.000203,7.2e-05,0.000133,0.000167,0.000143,9.8e-05,0.000194,0.000165,3e-05,0.00016,3.9e-05,0.000133,5.6e-05,2.7e-05,3e-05,9.2e-05,0.000189,9e-06,0.000238,0.000327,1.9e-05,0.000155
9e-06,4e-06,8e-06,1.6e-05,2.9e-05,2.6e-05,3.1e-05,2.2e-05,3e-05,3.1e-05,8e-06,1.1e-05,3e-05,4e-05,2.8e-05,7.4e-05,0.000136,0.000129,3.7e-05,5.6e-05,9.5e-05,4.3e-05,6.7e-05,5.4e-05,4e-05,0.000117,0.000115,7.8e-05,0.000161,4.9e-05,1.7e-05,0.000101,8.3e-05,1e-04,0.000107,5.2e-05,9.9e-05,5.4e-05,4.6e-05,4.6e-05,3.1e-05,0.000141,8.2e-05,6.8e-05,8.5e-05,0.000101,7.9e-05,8.4e-05,0.000209,0.000163,0.000161,0.000102,9.7e-05,0.000173,0.000253,0.000209,6.5e-05,4.7e-05,0.000232,5e-05,2.5e-05,0.000131,8.9e-05,0.000169,0.000177,8.5e-05,0.000119,8.3e-05,3.1e-05,4.4e-05,0.000144,0.00011,0.000201,9.8e-05,9.7e-05,0.000156,0.000204,0.000242,0.000142,0.00018,0.000178,8.3e-05,0.000149,0.000164,8.4e-05,6.5e-05,0.000149,1.9e-05,0.000163,0.000238,0.000132,6.5e-05,0.000128,9.7e-05,0.000172,0.000118,4.2e-05,0.000122,9.8e-05,0.000142,0.00012,8.7e-05,9.6e-05,0.000111,0.00013,9.7e-05,0.000223,0.000162,0.00011,0.000101,0.000171,9.4e-05,8.5e-05,0.000144,8.2e-05,0.000137,9.9e-05,0.000209,0.000111,0.000194,0.000149
7e-06,1.5e-05,1.3e-05,7e-06,2e-05,1e-05,8e-06,8e-06,7e-06,1.4e-05,7e-06,5e-06,1e-05,3.2e-05,1.9e-05,2.9e-05,1.4e-05,1.6e-05,3.2e-05,9e-06,3e-05,1.1e-05,2.6e-05,4.9e-05,3.2e-05,3e-05,4.8e-05,1.7e-05,5e-05,4.8e-05,8e-06,8.3e-05,2.1e-05,3.2e-05,6.9e-05,6e-05,7.8e-05,4.3e-05,2.7e-05,4.5e-05,1.8e-05,6.4e-05,5.3e-05,1e-05,6.4e-05,2.2e-05,3.8e-05,8.6e-05,4.4e-05,8.8e-05,3.4e-05,2.4e-05,3.4e-05,8.1e-05,8.9e-05,0.000144,8e-05,4.2e-05,0.000132,3.7e-05,3.6e-05,2.7e-05,1.9e-05,4.6e-05,4.7e-05,7.4e-05,3.2e-05,2.4e-05,6.6e-05,2.2e-05,2.8e-05,5e-06,1e-04,4.2e-05,8.3e-05,4.4e-05,0.000126,6.1e-05,8.7e-05,1e-04,8.2e-05,5.3e-05,9.4e-05,7e-05,1.4e-05,3.7e-05,7.9e-05,3.4e-05,0.000103,7.3e-05,4.6e-05,4.1e-05,5.8e-05,4e-05,5e-05,5.6e-05,7.8e-05,3.9e-05,8.1e-05,5e-06,3.4e-05,0.000116,3.3e-05,2.7e-05,8.4e-05,6.1e-05,0.000107,7.4e-05,5.8e-05,4e-05,5.2e-05,2.1e-05,4.2e-05,0.000124,6.2e-05,4.6e-05,5.4e-05,5.4e-05,5.1e-05,4.9e-05,7.2e-05
1e-06,1.1e-05,8e-06,4e-06,1.4e-05,9e-06,1.2e-05,1.3e-05,1e-05,1.7e-05,2.5e-05,2.6e-05,2.9e-05,2.6e-05,4.9e-05,2.8e-05,5e-06,1e-05,2.2e-05,3.1e-05,2e-05,3.8e-05,4.5e-05,5.9e-05,3.9e-05,3.3e-05,5.3e-05,9.3e-05,5.3e-05,5e-05,5.5e-05,5.2e-05,4.8e-05,3.8e-05,1.6e-05,4.1e-05,7.2e-05,2.9e-05,4.6e-05,5.4e-05,5.6e-05,1.5e-05,0.000102,0.000104,0.000107,8.3e-05,1e-04,7.5e-05,7.1e-05,0.000148,8.3e-05,3.9e-05,4.1e-05,0.000101,0.000146,9.9e-05,2.7e-05,3e-05,9.4e-05,0.000129,0.000106,2.8e-05,2.9e-05,5.6e-05,4.5e-05,8.6e-05,2.7e-05,4.5e-05,0.000106,9.5e-05,9e-05,5.7e-05,6.9e-05,9.9e-05,0.000156,0.000148,0.000197,8.6e-05,4.2e-05,0.00014,4.3e-05,4.5e-05,8.4e-05,0.000134,0.000104,6.5e-05,9.3e-05,6.4e-05,7.9e-05,0.000134,5.8e-05,4.1e-05,9.1e-05,7e-05,4.5e-05,6.9e-05,7e-05,7.3e-05,3.6e-05,2.7e-05,4.9e-05,0.000106,5.2e-05,7.8e-05,2.4e-05,5.4e-05,8.3e-05,8e-05,3.2e-05,5.2e-05,4.1e-05,6.8e-05,7.1e-05,6.4e-05,6.7e-05,6.6e-05,5.8e-05,4.7e-05,5.4e-05,2.6e-05,6.5e-05
5e-06,8e-06,1.3e-05,1.2e-05,1.2e-05,3e-06,8e-06,1.4e-05,4e-06,8e-06,1.3e-05,2.2e-05,1.9e-05,3.4e-05,3.7e-05,3e-05,4.8e-05,4e-05,3e-05,3.1e-05,4.5e-05,2.1e-05,5.2e-05,5.1e-05,1.7e-05,4.5e-05,4.5e-05,3.6e-05,3e-05,2.8e-05,4.5e-05,6.2e-05,4e-05,3.3e-05,7.4e-05,2.3e-05,3.2e-05,5.2e-05,8.5e-05,0.000117,6.2e-05,6.4e-05,0.000183,7.6e-05,5.7e-05,8.9e-05,3.7e-05,0.000175,4e-05,4.4e-05,4.5e-05,0.000102,3.4e-05,6.3e-05,0.000124,0.000151,7.5e-05,7.3e-05,0.000144,0.000138,7.4e-05,8.1e-05,5e-05,6.1e-05,7.9e-05,0.000136,0.000124,4.1e-05,0.000132,0.000195,7.1e-05,8e-05,8.5e-05,8.6e-05,4.4e-05,0.000135,4.3e-05,5.2e-05,5.6e-05,8.7e-05,8.6e-05,0.000135,5.7e-05,4.6e-05,0.000103,5.2e-05,3.5e-05,1e-05,4.5e-05,4.5e-05,4.3e-05,7.7e-05,9.1e-05,4.1e-05,8e-06,2.6e-05,7e-05,0.000106,3.5e-05,7.5e-05,6.8e-05,0.000131,7.8e-05,9.9e-05,6.7e-05,8.5e-05,0.000109,8.8e-05,0.000117,0.00013,7.1e-05,5.4e-05,9.2e-05,8.3e-05,0.000108,0.000122,0.000138,9e-05,6.9e-05,1.5e-05,1.4e-05
3e-06,4e-06,5e-06,2e-06,2e-05,1.4e-05,1.2e-05,9e-06,1.7e-05,8e-06,2e-06,2.9e-05,3.7e-05,1.7e-05,4e-06,2.1e-05,4.6e-05,1e-05,2.7e-05,9e-06,1.5e-05,1.6e-05,4e-05,9.6e-05,6.8e-05,7.8e-05,4.1e-05,5.8e-05,6.8e-05,6.7e-05,1e-04,3.9e-05,2.1e-05,3.2e-05,7.9e-05,0.00011,3.7e-05,9.8e-05,2.8e-05,0.000104,4.1e-05,7.9e-05,0.000113,0.000123,9.8e-05,6.9e-05,6.6e-05,0.000153,0.000151,0.000101,9.5e-05,0.000127,9.7e-05,0.000146,4.9e-05,1.3e-05,3.2e-05,3.1e-05,9.6e-05,7.6e-05,1.9e-05,4.9e-05,6.4e-05,2.9e-05,0.000112,8.8e-05,2.2e-05,5.5e-05,0.000132,0.000161,9.4e-05,9.7e-05,2.2e-05,4.1e-05,2e-05,0.000114,0.000122,0.000108,7e-05,2.9e-05,9e-06,8.2e-05,6.3e-05,4.6e-05,5.3e-05,8.2e-05,6.1e-05,2.7e-05,1e-04,3e-05,7.5e-05,9e-05,7.9e-05,3.6e-05,7e-05,6.5e-05,5.4e-05,0.000127,8.6e-05,7.8e-05,0.000103,4e-05,7.8e-05,0.000122,6.9e-05,1.4e-05,0.000136,0.000125,7.4e-05,7e-06,3.2e-05,1e-04,8.6e-05,7.5e-05,0.000165,4.9e-05,0.000103,3.2e-05,8.5e-05,2e-05,4e-05
3e-06,1e-05,5e-06,9e-06,2e-05,1.6e-05,3.8e-05,2.8e-05,2.1e-05,2.6e-05,3.9e-05,3.4e-05,2.5e-05,5.6e-05,3.3e-05,4.6e-05,3.3e-05,1e-05,3.2e-05,3.6e-05,2.5e-05,3.8e-05,7.8e-05,0.000114,5.2e-05,2.9e-05,5e-05,4.1e-05,6.7e-05,2e-06,7.8e-05,0.00014,5.2e-05,6.4e-05,7.8e-05,0.000147,0.000158,0.000118,0.000131,4.6e-05,9.3e-05,0.000138,0.000121,6e-05,1e-05,4.5e-05,2e-05,7.7e-05,0.000109,3.8e-05,0.000122,9e-05,5.7e-05,9.6e-05,0.000124,8.3e-05,5.8e-05,4e-06,7e-05,9.1e-05,8.4e-05,5.2e-05,5.7e-05,1e-04,0.000121,0.000111,0.000122,9.3e-05,0.000211,2.4e-05,6.2e-05,9.3e-05,6.8e-05,0.000121,3.7e-05,3.1e-05,8.1e-05,0.000138,0.000194,1.6e-05,7.7e-05,6.6e-05,3.6e-05,3.7e-05,7.9e-05,3.6e-05,6.5e-05,6.2e-05,5e-05,6.8e-05,0.000194,0.000196,0.00015,8.2e-05,8.4e-05,8.3e-05,0.000154,0.000104,1e-04,0.000135,0.00011,6.1e-05,6e-05,3.8e-05,3.8e-05,5.8e-05,0.00011,0.000138,0.000123,9.4e-05,4.6e-05,0.000109,4.3e-05,0.000104,5.7e-05,5.2e-05,0.000123,0.000109,0.000117,0.000108,4.5e-05
1e-06,1.7e-05,1.9e-05,2.3e-05,1e-06,1.5e-05,4.8e-05,4.4e-05,1.4e-05,1.5e-05,3.3e-05,2.3e-05,2.7e-05,3.9e-05,1.9e-05,1.8e-05,3.5e-05,7.1e-05,4e-05,2.5e-05,8.2e-05,1.5e-05,8.3e-05,2.7e-05,2.6e-05,2.7e-05,3.6e-05,6.5e-05,9.7e-05,6e-05,4.8e-05,8.2e-05,3.8e-05,7.6e-05,6.4e-05,5.1e-05,5.2e-05,5.2e-05,6.2e-05,3.2e-05,8.5e-05,6.5e-05,8.2e-05,0.000143,9e-05,7.9e-05,5.1e-05,2.3e-05,5.8e-05,0.000112,0.000159,0.000114,0.000148,7.3e-05,0.000126,0.000106,0.000122,9.8e-05,2.7e-05,8.6e-05,0.000104,5.6e-05,4.9e-05,8.7e-05,6e-05,2.9e-05,9.3e-05,5.7e-05,0.000121,1.4e-05,4.3e-05,7.4e-05,6.2e-05,7.7e-05,0.000118,8.1e-05,0.000135,0.000133,0.000103,0.000157,0.000125,0.000154,8.2e-05,8.7e-05,7.6e-05,8.3e-05,2.9e-05,6.6e-05,4.5e-05,9.4e-05,0.000119,0.000113,7.3e-05,5.2e-05,0.000149,9e-05,0.000205,0.000169,8.3e-05,8e-05,4e-05,4.2e-05,8.1e-05,5.8e-05,1.5e-05,9e-05,4.1e-05,6e-05,6.1e-05,3.8e-05,5.2e-05,9e-05,3.2e-05,9.5e-05,8.2e-05,0.000132,4.4e-05,0.000105,3.5e-05,6e-05,4.1e-05
3e-06,1.4e-05,4e-06,1e-05,9e-06,1.2e-05,1.8e-05,1.4e-05,1.1e-05,1e-05,8e-06,4e-06,2e-05,1.4e-05,1.4e-05,1.4e-05,4.2e-05,5e-05,1.6e-05,3.5e-05,3.7e-05,3.9e-05,6e-05,4.9e-05,3e-05,1.6e-05,5.7e-05,1.7e-05,7.6e-05,7.9e-05,5e-05,0.000108,3.3e-05,4.5e-05,2.6e-05,3.6e-05,2.2e-05,4.2e-05,5.9e-05,6.8e-05,8.1e-05,2.5e-05,3.4e-05,8.8e-05,2.3e-05,5.1e-05,5.8e-05,4e-05,6.5e-05,5.7e-05,4.5e-05,5.8e-05,7.9e-05,8.5e-05,6.3e-05,6.1e-05,7.2e-05,3.1e-05,0.000106,2e-05,0.000122,0.000151,0.000132,0.000102,9e-05,0.000116,1.4e-05,4.5e-05,0.000135,9.8e-05,0.000123,0.000102,2.8e-05,7.6e-05,6.1e-05,9.7e-05,6.4e-05,5.8e-05,9.5e-05,0.000113,6.3e-05,8.6e-05,5.3e-05,4.6e-05,0.00014,9.8e-05,5.8e-05,4.5e-05,5.3e-05,0.000103,0.000111,4.2e-05,7.3e-05,5.9e-05,7.2e-05,9.4e-05,0.000149,9.6e-05,7.3e-05,7.7e-05,5e-05,2.9e-05,6.4e-05,6.3e-05,3.3e-05,0.000122,0.000132,4.5e-05,1.7e-05,5e-05,3.7e-05,5.8e-05,4.7e-05,3.5e-05,4.2e-05,0.000113,4.8e-05,8.3e-05,2.2e-05,3.9e-05,8.1e-05
8e-06,8e-06,5e-06,5e-06,1.1e-05,1.1e-05,2.7e-05,6e-06,1.1e-05,1.8e-05,2e-05,6e-06,9e-06,2.4e-05,6e-06,1.8e-05,2.6e-05,4.5e-05,3e-05,4.1e-05,2.4e-05,3.4e-05,1.6e-05,2.2e-05,2.2e-05,7e-06,5.2e-05,6e-06,6.7e-05,1.6e-05,7.2e-05,8e-05,5.9e-05,3e-05,2.2e-05,3.5e-05,7.5e-05,0.000104,9.9e-05,7e-06,8.9e-05,7.1e-05,7.8e-05,6.3e-05,4.3e-05,1.8e-05,1.8e-05,5.9e-05,5.2e-05,5.2e-05,6.4e-05,7.8e-05,5.1e-05,0.000112,8.3e-05,6e-06,2.9e-05,2.1e-05,6.4e-05,3.4e-05,8.2e-05,4.4e-05,6.3e-05,7.6e-05,5.8e-05,0.000109,6.1e-05,5.1e-05,3.9e-05,8e-05,6.2e-05,3e-05,3.2e-05,3.3e-05,0.000102,7.5e-05,4.9e-05,2.9e-05,1.5e-05,9.3e-05,6.6e-05,4.4e-05,4.2e-05,5.5e-05,9e-05,7.6e-05,4.2e-05,4.9e-05,7.4e-05,4.3e-05,8.4e-05,7.8e-05,4.5e-05,5.5e-05,8.3e-05,4.5e-05,0.000161,0.000123,0.000134,8.6e-05,0.000132,0.000172,9.3e-05,6.8e-05,3.4e-05,0.000102,0.000166,9.5e-05,6.6e-05,2.9e-05,4.5e-05,9.6e-05,2.6e-05,7.6e-05,6.1e-05,5.8e-05,3.7e-05,1.7e-05,3.7e-05,2.5e-05,6.5e-05
1e-05,3e-06,7e-06,1e-06,1.2e-05,1.6e-05,3.3e-05,2.1e-05,2e-05,2.6e-05,5e-06,1e-05,5e-06,2.3e-05,1.3e-05,1.1e-05,3e-06,5e-05,3.6e-05,2.1e-05,2.1e-05,2e-05,4.5e-05,1.8e-05,1.6e-05,2.7e-05,4.1e-05,5.2e-05,4e-05,4.9e-05,6.5e-05,8e-05,7e-05,4.5e-05,3.2e-05,4.6e-05,6.1e-05,4.8e-05,4.1e-05,6.9e-05,3.5e-05,3e-05,3.8e-05,3e-05,3.5e-05,4.3e-05,4.7e-05,4.7e-05,1.7e-05,5.2e-05,4e-05,2.4e-05,3.5e-05,8.3e-05,5.5e-05,5.4e-05,6e-05,1.6e-05,2.2e-05,2.8e-05,5.2e-05,6e-06,6e-05,2.4e-05,4.1e-05,2.8e-05,1.2e-05,1.2e-05,2.2e-05,5.8e-05,3.6e-05,8.6e-05,5.3e-05,2.3e-05,4.1e-05,2.1e-05,3.5e-05,1.8e-05,5.8e-05,4.5e-05,2.5e-05,2.5e-05,2.3e-05,4.9e-05,7e-06,8.6e-05,6.5e-05,3.5e-05,3.1e-05,2.9e-05,9.9e-05,2.1e-05,4.7e-05,2.7e-05,0.000105,3.6e-05,3.3e-05,5.8e-05,7.2e-05,6.5e-05,0.000108,0.000108,2.9e-05,2e-05,1.8e-05,9.5e-05,8.7e-05,6.7e-05,4.5e-05,1.5e-05,5.6e-05,3.6e-05,4.8e-05,9.7e-05,0.000106,5.7e-05,6.7e-05,2.9e-05,7e-06,5.4e-05,3.6e-05
4e-06,8e-06,5e-06,3e-06,1e-05,2e-05,2.4e-05,1.5e-05,1.2e-05,4e-06,5e-06,8e-06,6e-06,1.4e-05,8e-06,2.4e-05,4e-05,5.5e-05,1.5e-05,2.4e-05,3.8e-05,2e-05,3.3e-05,1e-05,1.7e-05,2.3e-05,2.7e-05,1.3e-05,2.5e-05,3.2e-05,1.6e-05,3.9e-05,1.6e-05,3.6e-05,3.4e-05,3.8e-05,6.4e-05,6.2e-05,3.8e-05,4.5e-05,3e-05,1.9e-05,2.1e-05,6.1e-05,4.7e-05,4e-05,3.5e-05,4.2e-05,2.8e-05,2.8e-05,5e-05,2e-05,3.9e-05,9.4e-05,0.000104,7.3e-05,5.1e-05,2.3e-05,3.6e-05,3e-05,1.8e-05,1.5e-05,5.9e-05,6.8e-05,0.000111,0.000101,4.6e-05,5.1e-05,8.8e-05,8.5e-05,6.2e-05,1.3e-05,6.5e-05,1.7e-05,4.9e-05,5.1e-05,5.3e-05,1.1e-05,3.8e-05,3.5e-05,2e-05,7.3e-05,3.1e-05,6.9e-05,4.2e-05,2.2e-05,1.9e-05,5.6e-05,3e-06,3e-05,6.8e-05,4.5e-05,5.2e-05,5.2e-05,5.7e-05,3.9e-05,9.9e-05,1e-05,6.3e-05,9.5e-05,1.5e-05,0.000118,4.7e-05,4.2e-05,3.8e-05,8.2e-05,9.7e-05,4.9e-05,4.3e-05,1.9e-05,1.5e-05,1.5e-05,4.1e-05,5.2e-05,8.1e-05,3.3e-05,9.6e-05,8e-05,4e-05,5.9e-05,2.4e-05
1.1e-05,7e-06,4e-06,4e-06,8e-06,5e-06,2.1e-05,6e-06,4e-06,5e-06,1e-05,1.1e-05,8e-06,1.4e-05,5e-06,2e-05,2.3e-05,3e-05,7e-06,2.1e-05,3.2e-05,1.3e-05,3.4e-05,2.9e-05,1.1e-05,2.8e-05,2.3e-05,1.5e-05,6.4e-05,1.3e-05,2.4e-05,5e-05,2.5e-05,2.3e-05,5.5e-05,4.2e-05,5.7e-05,4.5e-05,2.2e-05,3.1e-05,2e-05,1.5e-05,2.7e-05,4.5e-05,7.6e-05,2.2e-05,1e-05,7.8e-05,5.3e-05,7.3e-05,4e-05,5.4e-05,3.1e-05,3.8e-05,0.000114,6.1e-05,7.9e-05,3.4e-05,4.1e-05,2.9e-05,7.1e-05,2.6e-05,7.6e-05,4.6e-05,8.6e-05,8e-05,9.9e-05,3.9e-05,5.7e-05,0.000123,0.000122,2.2e-05,8.3e-05,7.8e-05,7.1e-05,8e-06,4e-05,6.9e-05,1.8e-05,7e-05,5.8e-05,0.000104,0.000102,9.5e-05,4.2e-05,0.000138,7.8e-05,0.000101,1.3e-05,2.3e-05,6.4e-05,4.6e-05,5.9e-05,2.4e-05,5.4e-05,3.6e-05,7.9e-05,7.5e-05,2.3e-05,4.6e-05,4.3e-05,0.00015,7.2e-05,1.6e-05,5.7e-05,5.9e-05,5.5e-05,4.1e-05,2.7e-05,3.8e-05,2.1e-05,3.4e-05,4.7e-05,9.2e-05,0.000116,0.00015,3.4e-05,8e-05,6.1e-05,6.9e-05,3.4e-05
9e-06,1.1e-05,5e-06,7e-06,2e-06,0,2.5e-05,2e-05,7e-06,1e-06,8e-06,4e-06,1.7e-05,1.3e-05,8e-06,7e-06,1.5e-05,7e-05,1.1e-05,1.8e-05,4.5e-05,2.3e-05,9e-06,5e-06,4e-05,3.6e-05,5.7e-05,3.8e-05,6.8e-05,5.7e-05,4.4e-05,0.000108,8.6e-05,3.7e-05,6.2e-05,3.2e-05,0.000126,9.1e-05,3.1e-05,5.4e-05,6.4e-05,2.3e-05,6.2e-05,0.000119,0.00011,0.000178,0.000139,0.000121,0.000122,0.00015,4.9e-05,6.2e-05,6.5e-05,0.000143,8.4e-05,8.6e-05,0.000236,0.000186,7.2e-05,1.4e-05,0.000141,0.000176,7e-05,0.000113,0.00015,0.000131,0.00024,0.00022,0.000189,0.000159,3e-05,0.000169,7e-05,9.9e-05,5.8e-05,0.000172,0.000225,0.000137,3.6e-05,0.00012,0.000132,0.000139,0.000195,9.5e-05,7.5e-05,0.000289,0.00015,9.8e-05,0.000112,9.3e-05,3.3e-05,0.000158,0.00022,0.000116,0.000115,5.6e-05,3e-06,5e-05,6.9e-05,0.000115,0.000123,0.000229,0.000167,9e-05,0.000103,3.7e-05,3.1e-05,5.6e-05,3.8e-05,7e-05,0.000106,0.000144,6.7e-05,0.000101,0.000148,6.7e-05,0.000172,0.00016,0.000153,8e-05,8e-06
1.8e-05,3e-05,1.9e-05,9e-06,1.5e-05,1.1e-05,2.1e-05,1e-05,1.4e-05,1.3e-05,1.5e-05,1.6e-05,2.8e-05,2.3e-05,1.1e-05,1.6e-05,1.2e-05,6.5e-05,6.4e-05,4.5e-05,8e-06,3.9e-05,5e-05,3.8e-05,7e-05,4.7e-05,6.1e-05,9.1e-05,8.9e-05,2.1e-05,4.7e-05,6.7e-05,7.8e-05,6.1e-05,6.6e-05,8.8e-05,0.000176,0.000205,0.00017,0.000115,8.6e-05,0.000107,8e-05,4.5e-05,4.8e-05,8.7e-05,4.7e-05,7e-06,8.6e-05,0.000112,0.000114,9.8e-05,6.8e-05,0.000135,0.000125,8.1e-05,0.000166,8.9e-05,0.000104,4.5e-05,0.000143,0.000194,0.000168,0.000195,0.000213,0.000267,0.000142,7.1e-05,4.1e-05,7.1e-05,0.000119,0.000204,0.000108,4.4e-05,0.00019,0.000263,0.00025,5.3e-05,4.1e-05,7e-05,2.8e-05,4.2e-05,0.000127,0.00015,5.5e-05,0.000186,0.000121,9.3e-05,0.000185,0.000192,0.000148,0.000217,0.000218,0.000144,0.000162,0.000174,0.000101,3.7e-05,6.6e-05,1e-04,6.1e-05,0.000283,0.00027,0.000164,0.000128,0.000107,9.6e-05,8.1e-05,8.5e-05,7.3e-05,5.6e-05,0.000169,8.8e-05,5.2e-05,9.3e-05,0.000152,0.000213,0.000237,0.000122,0.000131,0.000113
8e-06,1.8e-05,2.2e-05,2.1e-05,1.4e-05,1e-05,1.1e-05,1e-05,1.5e-05,1.4e-05,1.4e-05,1.2e-05,2.6e-05,2e-05,2.5e-05,4.1e-05,3.2e-05,5.5e-05,4.1e-05,1.7e-05,3e-05,3.1e-05,5.2e-05,4e-05,1.7e-05,3.7e-05,7.7e-05,5.2e-05,3e-05,2e-05,6.4e-05,5.4e-05,5.2e-05,4.4e-05,4e-05,5.3e-05,9.8e-05,2.1e-05,5.1e-05,4e-06,4.6e-05,4.5e-05,1.6e-05,3e-05,2.5e-05,2.4e-05,4.3e-05,5e-05,5.3e-05,2e-05,3.6e-05,4.5e-05,5.2e-05,5.7e-05,6.1e-05,4.7e-05,4.8e-05,2.2e-05,8.8e-05,3.8e-05,9.7e-05,3.2e-05,3.6e-05,7e-05,5.2e-05,9.6e-05,3.1e-05,4e-05,8.1e-05,4.1e-05,5.7e-05,4.7e-05,5.1e-05,4.9e-05,0.000126,0.00012,7.5e-05,6.1e-05,4.1e-05,6.3e-05,7.1e-05,7.4e-05,4.2e-05,3.8e-05,4.4e-05,6e-05,1.7e-05,1.5e-05,0.000115,5.3e-05,5.3e-05,6.3e-05,6.7e-05,2.8e-05,6.7e-05,8.7e-05,4.2e-05,3.8e-05,7.2e-05,6.1e-05,1.8e-05,0.000168,9.2e-05,1.4e-05,6.5e-05,8e-06,4.8e-05,1.3e-05,5.4e-05,1.2e-05,5.4e-05,9.2e-05,3.1e-05,4.5e-05,5.1e-05,0.000115,5.9e-05,4.5e-05,2.2e-05,0.00011,4.9e-05
3e-06,1e-05,6e-06,5e-06,8e-06,8e-06,7e-06,2e-06,9e-06,4e-06,6e-06,1e-05,8e-06,6e-06,1.2e-05,1.6e-05,2e-06,3.5e-05,1.6e-05,1.4e-05,2.8e-05,2.4e-05,1.3e-05,1.1e-05,7e-06,2.6e-05,4.1e-05,1.1e-05,2.4e-05,3.3e-05,2.8e-05,4e-05,1.2e-05,1.6e-05,1.7e-05,2.5e-05,2.2e-05,1.1e-05,3.6e-05,2e-05,2.5e-05,4.3e-05,2e-05,2.8e-05,4.2e-05,3.4e-05,3e-05,3e-05,4.7e-05,1.3e-05,7e-06,2.2e-05,4.2e-05,2.9e-05,5.2e-05,6e-05,2.9e-05,2.9e-05,5.6e-05,1.6e-05,5.1e-05,2.2e-05,1.7e-05,5e-05,3.9e-05,7.1e-05,4.4e-05,2.7e-05,5.5e-05,4e-06,3.6e-05,2e-05,2.8e-05,1.6e-05,1e-04,1e-04,7.2e-05,5.3e-05,3.5e-05,2e-06,1.2e-05,1.2e-05,2e-05,2.7e-05,3.2e-05,4.2e-05,2.7e-05,2.5e-05,5.3e-05,5.2e-05,2.9e-05,5.6e-05,2.7e-05,1.2e-05,4.3e-05,2.7e-05,6e-06,3.1e-05,1e-05,4.5e-05,2.2e-05,7.1e-05,1.3e-05,2.8e-05,1.3e-05,2.7e-05,2.3e-05,2.8e-05,7e-06,1.2e-05,5.3e-05,4.2e-05,1.3e-05,4.4e-05,1.6e-05,1e-04,2.3e-05,2.9e-05,2.1e-05,6.2e-05,1e-05
5e-06,7e-06,6e-06,4e-06,8e-06,7e-06,7e-06,1e-06,5e-06,8e-06,8e-06,5e-06,5e-06,3e-06,9e-06,1.1e-05,1e-05,3.1e-05,8e-06,1.9e-05,2.7e-05,1.3e-05,1.1e-05,1.9e-05,1.4e-05,1.3e-05,2.7e-05,7e-06,2e-05,1.6e-05,2.6e-05,2e-05,2.4e-05,2.9e-05,3e-06,1.3e-05,2.8e-05,2.2e-05,1.6e-05,7e-06,2e-05,2.5e-05,2.9e-05,9e-06,2.3e-05,3.3e-05,1.5e-05,1.5e-05,1.3e-05,1.2e-05,1e-05,2.2e-05,2.3e-05,3.5e-05,5.6e-05,4.8e-05,2e-05,1.7e-05,5.3e-05,1.9e-05,3.4e-05,5e-06,2e-06,2.1e-05,1.8e-05,5.7e-05,3e-05,7e-06,5.5e-05,1.5e-05,1.7e-05,3.8e-05,2.5e-05,6e-06,8.3e-05,7.2e-05,7.7e-05,4.5e-05,3.5e-05,1.5e-05,1.7e-05,3.3e-05,2.1e-05,2.8e-05,2.1e-05,3e-05,2e-06,2.9e-05,5.1e-05,3.9e-05,1.4e-05,4.3e-05,2.3e-05,3e-06,2.3e-05,4.6e-05,2.3e-05,1.9e-05,2.3e-05,2.2e-05,1.9e-05,4.2e-05,1.3e-05,1.8e-05,7e-06,2e-05,1.5e-05,1.5e-05,2e-05,1.7e-05,5.2e-05,5.5e-05,4e-06,3.1e-05,1e-05,9.6e-05,2.8e-05,1.6e-05,3.2e-05,5.6e-05,1.2e-05
3e-06,3e-06,1e-06,1e-06,6e-06,5e-06,7e-06,2e-06,2e-06,7e-06,6e-06,4e-06,7e-06,1e-06,2e-06,5e-06,3e-06,2.8e-05,1.1e-05,1.4e-05,2.4e-05,1.2e-05,1e-05,8e-06,1.2e-05,1.1e-05,2e-05,1.2e-05,1.6e-05,1.6e-05,2.5e-05,1.7e-05,1e-05,1e-05,1.1e-05,1.6e-05,1.6e-05,3e-05,2.5e-05,1e-05,1.3e-05,2.8e-05,2.5e-05,1.5e-05,2.1e-05,1.9e-05,2e-06,3e-06,2.8e-05,3e-06,4e-06,3.5e-05,1.4e-05,3.2e-05,5.9e-05,4.5e-05,1.1e-05,1.1e-05,4.9e-05,2.3e-05,1.2e-05,2.7e-05,1.3e-05,2e-05,1.3e-05,5e-05,1.1e-05,1.7e-05,4.6e-05,4e-06,2.2e-05,2e-05,1.1e-05,7e-06,7.7e-05,8.1e-05,6.9e-05,4.6e-05,2.1e-05,1.2e-05,1.1e-05,2.7e-05,1e-05,2e-05,3.4e-05,4.9e-05,1.7e-05,1.1e-05,4e-05,4.6e-05,1e-05,4.5e-05,1.4e-05,7e-06,1.9e-05,4.4e-05,1.4e-05,8e-06,1.1e-05,3.4e-05,1.4e-05,1.7e-05,1.1e-05,1.1e-05,7e-06,1.8e-05,1.3e-05,1e-05,1.5e-05,1.7e-05,4.8e-05,4.3e-05,1.8e-05,3.2e-05,1.4e-05,8.4e-05,1.1e-05,1.8e-05,2.2e-05,3e-05,1.2e-05
1e-06,2e-06,3e-06,1e-06,6e-06,3e-06,9e-06,1e-06,2e-06,6e-06,8e-06,2e-06,7e-06,2e-06,3e-06,1e-06,1e-05,2.6e-05,9e-06,1.2e-05,2.1e-05,1e-06,1e-05,9e-06,6e-06,9e-06,2.3e-05,6e-06,1.6e-05,1.5e-05,2.5e-05,2e-05,1e-05,1.5e-05,1e-05,1.4e-05,1.4e-05,2.6e-05,8e-06,2e-06,9e-06,2.5e-05,1.8e-05,1.8e-05,2.2e-05,2.3e-05,5e-06,2e-06,1.8e-05,1e-05,4e-06,2.3e-05,1.3e-05,2.3e-05,6.5e-05,3.8e-05,1.4e-05,8e-06,5.2e-05,1.5e-05,6e-06,1.1e-05,7e-06,2e-05,2.5e-05,4.4e-05,6e-06,4e-06,3.8e-05,1e-05,1.1e-05,1.2e-05,1.2e-05,1.3e-05,7.1e-05,7.1e-05,6.4e-05,3.5e-05,2.8e-05,1e-05,9e-06,1.7e-05,1.1e-05,4e-06,2.8e-05,4.7e-05,6e-06,1.1e-05,4.2e-05,3.7e-05,5e-06,3.4e-05,1.3e-05,0,7e-06,4.7e-05,2.1e-05,8e-06,4e-06,2.7e-05,1e-05,1.1e-05,4e-06,8e-06,5e-06,1.7e-05,1.1e-05,7e-06,1.9e-05,1.6e-05,4e-05,3.3e-05,5e-06,3.3e-05,1e-05,6e-05,1.4e-05,2.2e-05,7e-06,3.3e-05,8e-06
1e-06,1e-06,2e-06,1e-06,6e-06,4e-06,7e-06,1e-06,2e-06,5e-06,7e-06,2e-06,6e-06,1e-06,3e-06,2e-06,1e-05,2.9e-05,8e-06,1.4e-05,2e-05,5e-06,4e-06,7e-06,1e-05,1e-05,2e-05,3e-06,1.7e-05,1.4e-05,2.5e-05,2.1e-05,7e-06,1.3e-05,8e-06,1.4e-05,1.1e-05,2.5e-05,1e-05,4e-06,1.2e-05,3e-05,1.6e-05,2.2e-05,2.4e-05,2.2e-05,4e-06,3e-06,2.2e-05,9e-06,2e-06,2e-05,1.4e-05,2.6e-05,5.5e-05,3.9e-05,1e-05,6e-06,5e-05,9e-06,4e-06,9e-06,7e-06,2.2e-05,2.2e-05,5e-05,6e-06,4e-06,3.6e-05,7e-06,7e-06,1.8e-05,8e-06,1.1e-05,6.7e-05,6.1e-05,6.3e-05,3.5e-05,2.7e-05,8e-06,6e-06,1.6e-05,1.5e-05,5e-06,3.3e-05,4.9e-05,8e-06,7e-06,3.6e-05,3.9e-05,6e-06,3e-05,5e-06,6e-06,5e-06,4.4e-05,1.1e-05,6e-06,4e-06,2.7e-05,3e-06,1.1e-05,5e-06,6e-06,4e-06,1.5e-05,1.3e-05,3e-06,1.3e-05,1.1e-05,4.4e-05,3e-05,1.6e-05,3.4e-05,7e-06,5.4e-05,5e-06,2.6e-05,7e-06,3.6e-05,7e-06
1e-06,1e-06,2e-06,1e-06,5e-06,3e-06,6e-06,0,2e-06,5e-06,7e-06,2e-06,6e-06,1e-06,2e-06,1e-06,8e-06,2.7e-05,8e-06,1.1e-05,1.9e-05,3e-06,4e-06,8e-06,6e-06,1e-05,2.2e-05,5e-06,1.7e-05,1.7e-05,2.3e-05,2.3e-05,7e-06,1.2e-05,9e-06,1.4e-05,1e-05,2.3e-05,9e-06,1e-06,1.2e-05,2.8e-05,1.5e-05,2.3e-05,2.1e-05,2.1e-05,2e-06,2e-06,2.1e-05,5e-06,2e-06,2.2e-05,1.3e-05,3e-05,5.7e-05,4.1e-05,1.4e-05,5e-06,4.7e-05,9e-06,3e-06,6e-06,5e-06,1.8e-05,2e-05,4.5e-05,7e-06,4e-06,4.2e-05,9e-06,7e-06,2.2e-05,8e-06,1e-05,6.5e-05,6.3e-05,6.2e-05,3.2e-05,3.1e-05,7e-06,4e-06,2e-05,1.3e-05,7e-06,2.6e-05,4.3e-05,9e-06,1e-05,3.7e-05,4.5e-05,3e-06,2.7e-05,4e-06,6e-06,6e-06,4e-05,1.1e-05,3e-06,1e-06,2.3e-05,2e-06,7e-06,3e-06,8e-06,4e-06,2e-05,1.4e-05,3e-06,1.3e-05,9e-06,4.3e-05,3.3e-05,7e-06,3.1e-05,5e-06,5.9e-05,7e-06,2.6e-05,1e-05,3.2e-05,7e-06
