0.015158,0.015008,0.014323,0.034484,0.13429,0.500085,0.798554,0.567757,0.306246,0.386157,0.546727,0.508202,0.470823,0.506515,0.547795,0.660515,0.630995,0.51375,0.410719,0.292022,0.202524,0.183803,0.260138,0.217604,0.090849,0.070647,0.057181,0.040385
0.018551,0.01833,0.01726,0.04073,0.161146,0.586526,0.911736,0.638203,0.348421,0.443049,0.62194,0.584754,0.55192,0.569474,0.623697,0.788314,0.749554,0.61538,0.506175,0.357343,0.239996,0.217593,0.329529,0.279849,0.110341,0.081869,0.066602,0.047492
0.024141,0.024023,0.022216,0.049733,0.202834,0.712404,1.050097,0.713168,0.409063,0.544358,0.754132,0.720384,0.703663,0.684739,0.767177,1.027753,0.969211,0.800942,0.673653,0.470631,0.299023,0.266313,0.440562,0.381569,0.142505,0.099786,0.081802,0.059338
0.027755,0.028072,0.025742,0.051945,0.225426,0.782604,1.082045,0.702271,0.441174,0.652251,0.902371,0.87947,0.892601,0.850229,0.960419,1.281977,1.199647,0.992571,0.819364,0.561462,0.337574,0.288108,0.504099,0.441587,0.164618,0.111616,0.09164,0.068089
0.027749,0.029171,0.027188,0.047548,0.231502,0.812636,1.08804,0.690801,0.463623,0.775171,1.136325,1.158553,1.176965,1.11737,1.24411,1.585973,1.478491,1.190526,0.902914,0.590116,0.352433,0.287752,0.47652,0.414243,0.168066,0.116396,0.094467,0.072763
0.025978,0.028234,0.027565,0.043807,0.271014,0.917466,1.173513,0.725857,0.493997,0.957541,1.552717,1.677739,1.689388,1.607856,1.699932,2.022128,1.923761,1.511805,1.014114,0.603456,0.378554,0.298844,0.381141,0.322357,0.164931,0.122198,0.097652,0.07927
0.026548,0.028298,0.029633,0.0488,0.383647,1.265754,1.555894,0.922805,0.614717,1.366833,2.409371,2.766069,2.791031,2.640016,2.653925,2.944918,2.880532,2.327146,1.501919,0.810788,0.499593,0.386132,0.358079,0.30548,0.21963,0.165626,0.125839,0.106132
0.033385,0.033213,0.035221,0.061773,0.519215,1.702197,2.068722,1.211961,0.837488,2.184882,4.120753,4.878112,4.88155,4.603314,4.583159,4.843252,4.758196,4.005925,2.601821,1.346558,0.795268,0.606301,0.505066,0.43284,0.34812,0.264859,0.200476,0.168858
0.045385,0.043208,0.044691,0.078271,0.62953,1.997673,2.368308,1.393511,1.077369,3.363917,6.763292,8.187035,8.140609,7.775284,7.749516,7.78993,7.54933,6.513052,4.284006,2.19826,1.25255,0.934991,0.736861,0.620513,0.519754,0.402823,0.311901,0.261884
0.056825,0.051784,0.053215,0.093124,0.70222,2.07015,2.323155,1.405262,1.330129,4.832251,10.123527,12.374017,12.222219,11.977241,11.891262,11.239211,10.717852,9.460139,6.362937,3.29777,1.802936,1.296019,0.969652,0.803456,0.703168,0.556268,0.436387,0.367964
0.061209,0.054293,0.057795,0.099915,0.743296,2.042473,2.153061,1.33957,1.548425,6.206022,13.240208,16.226006,15.957132,16.009779,15.825976,14.216743,13.376998,11.94112,8.193296,4.361591,2.286815,1.569628,1.134866,0.944835,0.877426,0.706127,0.543153,0.454904
0.058656,0.055816,0.063883,0.100548,0.73199,2.011631,2.137759,1.338736,1.57035,6.553663,14.196785,17.497314,17.388202,17.803912,17.532895,15.585689,14.48524,12.629572,8.734301,4.799303,2.454841,1.659983,1.197349,1.004134,0.969749,0.780677,0.573898,0.473435
0.057732,0.063941,0.073958,0.09871,0.643507,1.852916,2.06099,1.252122,1.299342,5.382128,11.853943,14.675413,15.07357,15.777589,15.349518,14.248544,13.202086,10.665742,7.28429,4.168561,2.142512,1.49762,1.117334,0.934405,0.886344,0.695074,0.486529,0.395493
0.060753,0.070435,0.077751,0.095058,0.484099,1.435538,1.672689,1.013572,0.945737,3.591383,7.804876,9.453929,10.118739,10.816997,10.377321,10.278964,9.511979,7.054344,4.708832,2.815021,1.521599,1.159102,0.879317,0.698491,0.620776,0.468178,0.324355,0.266057
0.065492,0.068945,0.070869,0.087139,0.33303,0.988018,1.182753,0.758516,0.721613,2.106771,4.223008,5.045703,5.670779,6.009362,5.813237,6.086813,5.408293,3.733671,2.455555,1.51508,0.891405,0.758119,0.593979,0.424296,0.332594,0.255539,0.201525,0.174233
0.074015,0.064856,0.059444,0.076165,0.269637,0.785214,0.896767,0.600129,0.657694,1.39199,2.437775,2.866569,3.300609,3.586002,3.634126,3.739695,3.179459,2.225528,1.425453,0.843574,0.51589,0.447245,0.3799,0.259951,0.182081,0.156487,0.134189,0.113801
0.085994,0.068695,0.058328,0.070135,0.281636,0.836736,0.911479,0.610848,0.740141,1.319908,2.081762,2.309759,2.656008,3.075497,3.096336,3.04905,2.74506,2.0904,1.245517,0.649426,0.388099,0.307061,0.302576,0.229564,0.14053,0.127013,0.101622,0.077875
0.095282,0.07633,0.065343,0.074179,0.330535,0.967256,1.065214,0.767372,0.926736,1.446904,2.143854,2.313653,2.680046,3.248864,3.139286,2.977476,2.922389,2.482842,1.550598,0.771237,0.438451,0.345469,0.383279,0.314055,0.159612,0.123391,0.104573,0.081333
0.097107,0.080413,0.075623,0.090005,0.3896,1.127672,1.342153,1.021947,1.106304,1.595396,2.207301,2.385724,2.845422,3.447873,3.320716,3.148474,3.309857,3.134327,2.144378,1.108429,0.595688,0.459145,0.537765,0.460269,0.213546,0.140489,0.132834,0.113854
0.094064,0.079636,0.085004,0.107479,0.429688,1.306099,1.725206,1.278257,1.138086,1.744094,2.451356,2.653171,3.030844,3.342491,3.175379,3.158895,3.590225,3.715261,2.748157,1.492256,0.76748,0.571667,0.694054,0.614955,0.276216,0.168182,0.170114,0.160741
0.094286,0.080533,0.090055,0.11776,0.438248,1.391303,1.998404,1.42419,1.01275,1.897136,2.98801,3.141511,3.049305,2.929804,2.734032,2.821204,3.45868,3.851677,3.079671,1.79353,0.897068,0.620056,0.768648,0.699894,0.318434,0.196109,0.208749,0.208208
0.092855,0.080562,0.09477,0.125187,0.397372,1.265303,1.946948,1.403393,0.859409,1.993491,3.453242,3.454021,2.80146,2.386967,2.321869,2.51782,3.131432,3.650118,3.084886,1.836092,0.895104,0.570709,0.691882,0.636699,0.312969,0.222978,0.246858,0.238506
0.090052,0.078245,0.100086,0.12857,0.300491,0.912648,1.493931,1.146942,0.751497,1.990567,3.490626,3.319563,2.486377,2.043194,2.090184,2.315461,2.665709,3.17499,2.833612,1.627699,0.744323,0.459902,0.508383,0.469097,0.276463,0.233558,0.265674,0.248253
0.084846,0.072723,0.097425,0.120776,0.191448,0.538799,0.902408,0.735432,0.636847,1.734892,2.897728,2.728625,2.073549,1.74382,1.940301,2.155119,2.211241,2.560329,2.35923,1.305824,0.581022,0.398048,0.367552,0.327661,0.232683,0.208506,0.24667,0.245866
0.070792,0.069557,0.101558,0.1214,0.142378,0.318007,0.466757,0.41329,0.584617,1.392415,2.056084,1.993262,1.682022,1.511622,1.721194,1.869387,1.834803,2.089211,1.935707,1.013334,0.444138,0.385565,0.310864,0.241402,0.18922,0.168075,0.207008,0.226291
0.053838,0.0636,0.098944,0.11528,0.126725,0.209041,0.264476,0.279521,0.557046,1.273828,1.741267,1.598416,1.375338,1.318432,1.493921,1.609982,1.539443,1.68541,1.514585,0.786557,0.416421,0.416108,0.322535,0.211472,0.155534,0.139779,0.165253,0.180925
0.041335,0.055505,0.08411,0.090867,0.101808,0.149736,0.175466,0.222717,0.509495,1.191609,1.766284,1.580209,1.220587,1.181757,1.344979,1.520037,1.546407,1.542127,1.255858,0.713346,0.44741,0.424425,0.322222,0.195823,0.137873,0.136704,0.134901,0.12449
0.031397,0.041715,0.05797,0.05763,0.07557,0.13048,0.156536,0.210867,0.439928,1.012975,1.672827,1.539264,1.153949,1.164644,1.31794,1.486729,1.567926,1.472362,1.106294,0.690962,0.4377,0.348053,0.272644,0.193008,0.141367,0.136306,0.120771,0.088241
0.026993,0.030916,0.035829,0.033482,0.055843,0.123146,0.154443,0.20309,0.388432,0.943037,1.552672,1.432158,1.138278,1.190682,1.359462,1.486681,1.586451,1.443327,1.021862,0.639656,0.354904,0.226838,0.204511,0.186594,0.139101,0.116012,0.102369,0.066949
0.02744,0.029586,0.034081,0.031507,0.05433,0.120468,0.138184,0.183642,0.410867,1.044251,1.470111,1.257027,1.047292,1.128088,1.38442,1.446869,1.469205,1.288551,0.871262,0.520981,0.254256,0.161824,0.165813,0.165906,0.117024,0.08043,0.074794,0.054945
0.033688,0.038463,0.046145,0.039832,0.060032,0.1134,0.115432,0.151251,0.396373,1.10163,1.54211,1.244972,0.937629,1.000446,1.357162,1.478387,1.387351,1.147105,0.75857,0.446969,0.22009,0.153919,0.16181,0.154014,0.101355,0.062453,0.061022,0.053737
0.038034,0.045351,0.055332,0.046697,0.060068,0.099904,0.103812,0.121339,0.325261,0.9841,1.479579,1.256571,0.939602,0.963492,1.332287,1.528364,1.287777,0.985649,0.727214,0.503942,0.280812,0.168275,0.14788,0.148334,0.111854,0.061622,0.057186,0.056553
0.034459,0.042593,0.052808,0.0439,0.0516,0.094024,0.106513,0.094698,0.265443,0.82414,1.259391,1.155746,0.956138,0.977545,1.320882,1.476596,1.016296,0.717447,0.702863,0.596885,0.345949,0.176733,0.123317,0.149562,0.1316,0.063358,0.048789,0.050168
0.023572,0.029947,0.038269,0.031624,0.04092,0.088347,0.100676,0.069157,0.249338,0.97136,1.400864,1.155443,0.924809,0.875115,1.260011,1.367638,0.785274,0.534388,0.67658,0.612883,0.354464,0.170739,0.110619,0.153312,0.146504,0.071557,0.042012,0.036406
0.013192,0.015797,0.021747,0.019106,0.033393,0.081966,0.089211,0.056384,0.250416,1.240202,1.651113,1.088895,0.784591,0.758087,1.225401,1.380957,0.803508,0.493831,0.601984,0.501707,0.296148,0.177707,0.127052,0.144802,0.138935,0.071817,0.035636,0.028482
0.011296,0.010357,0.015274,0.015,0.033107,0.081401,0.086298,0.052045,0.252239,1.476992,1.843802,0.953925,0.720208,0.839178,1.176211,1.2646,0.81384,0.468706,0.460291,0.322758,0.206557,0.173467,0.134967,0.114431,0.111154,0.061957,0.034329,0.032946
0.014714,0.012613,0.01504,0.014789,0.038849,0.087603,0.086417,0.050185,0.259591,1.610011,1.992718,0.888606,0.76433,1.063147,1.048571,0.972412,0.744047,0.446434,0.332993,0.217856,0.162897,0.151817,0.121323,0.078095,0.085717,0.057357,0.03617,0.035878
0.020765,0.017703,0.016167,0.017658,0.047523,0.09392,0.088212,0.050386,0.255447,1.603025,1.941391,0.81983,0.863324,1.227625,0.92365,0.773123,0.620414,0.426012,0.346844,0.223559,0.162877,0.130944,0.100573,0.066017,0.072006,0.053717,0.038861,0.034922
0.028531,0.02338,0.017571,0.021773,0.053799,0.097331,0.090007,0.056863,0.242358,1.462889,1.780249,0.809316,0.944246,1.286132,0.951856,0.804985,0.571122,0.419815,0.423522,0.27043,0.176338,0.122355,0.092729,0.064247,0.05587,0.043222,0.036015,0.033831
0.03453,0.028265,0.020741,0.02548,0.052366,0.096859,0.100676,0.068784,0.23223,1.223762,1.648993,0.965341,0.978153,1.200073,0.978452,0.897518,0.681215,0.507477,0.472251,0.282381,0.187494,0.120482,0.100589,0.065045,0.040835,0.031011,0.029757,0.031231
