-0.000469,-0.00022,-1.8e-05,-0.000129,0.00018,1.1e-05,-0.000209,0.000257,6.4e-05,-3.9e-05,0.000249,0.000512,0.000275,0.000187,0.000102,0.000226,0.000206,0.000539,0.000237,-8.9e-05,-0.000209,-1e-06,0.000134,0.000352,0.000347,7.7e-05,4.5e-05,-1.8e-05,1e-04,-0.000194,5.6e-05,6e-05,-6.1e-05,1.5e-05,9.8e-05,0.000244,0.00038,0,-0.001855,-0.029348,-0.028081,-0.01662,-0.010656,-0.007921,-0.004272,-0.002618,-0.00275,-0.001928,-0.002578,-0.00168,-0.000174,0.000597,-0.005717,0.001476,-0.016436,-0.022514,-0.012459,-0.014539,-0.016192,-0.026629,-0.017228,-0.016848,-0.017186,-0.01172,-0.01067,-0.014455,-0.012045,-0.012195,-0.011539,-0.01192,-0.013097,-0.017589,-0.014712,-0.018083,-0.019545,-0.010061,-0.017394,-0.012699,-0.015813,-0.014375,-0.012874,-0.004915,-0.006539,-0.008406,-0.00734,-0.008013,-0.009427,-0.010439,-0.006742,-0.00505,-0.003927,-0.001845,-0.002633,-0.001501,-0.000331,-0.000116,0.000488,0.004109,0.003194,0.001722,-0.004964,-0.001483,0.001046,0.000817,0.00069,0.000236,-0.001214,-0.001605,-0.001057,-0.000599,-0.000358,-0.000306,6.3e-05,-0.000122,-0.000207,-0.000268,-0.000156,-0.001254,-0.00264,-0.001719,-0.000865
0.00028,0.000184,0.000247,0.000212,0.000121,7.1e-05,5.3e-05,0.000361,0.000205,-2.3e-05,0.000158,-5.1e-05,5.6e-05,0.000255,0.000189,0.000234,-7.7e-05,0.00024,0.000169,0.000168,0.000168,6.4e-05,0.000104,-1.5e-05,3.8e-05,4.3e-05,-7.1e-05,-4.7e-05,-8.5e-05,1.5e-05,-2.6e-05,7.1e-05,0.000175,0.000266,0.000194,0.000284,0.000402,0.000298,0.000877,0.007231,0.013045,0.007941,0.008257,0.003394,0.002342,-0.000535,0.00079,0.001102,-1e-05,0.001248,0.001826,0.00126,0.001625,-0.013305,-0.002004,0.005164,0.003407,0.005034,0.006091,0.00211,-0.002165,0.000762,0.000464,-0.004773,-0.007516,0.002672,-0.004426,-0.007783,-0.006265,-0.002543,0.001097,0.001483,0.010689,0.000329,-0.002684,-0.002807,0.004284,-0.001061,6e-04,0.004348,-0.000114,-0.003916,-0.005239,-0.002911,-0.001888,-0.002312,-0.003641,-0.003425,-0.000445,-0.003437,-0.002981,-0.000175,-0.001812,-0.001206,0.000173,-0.000134,0.00104,0.000875,0.001899,0.001446,-0.002136,-0.00215,0.001208,0.00149,0.001444,0.000335,0.000118,0.000548,0.000463,0.000784,0.000299,0.000356,0.000432,5.8e-05,0.000207,9.3e-05,-1.9e-05,-0.000122,-0.00012,7.7e-05,-3.8e-05
-5.8e-05,1.7e-05,7e-05,4.6e-05,-0.000241,-0.000206,-0.000309,-0.000187,-0.000133,1.9e-05,6.9e-05,-0.000106,4e-05,-0.000539,-0.000374,-6e-05,5.3e-05,7.1e-05,2.7e-05,-4.2e-05,-7.2e-05,-0.000217,-2.5e-05,-1.3e-05,1e-06,-8e-06,-2.1e-05,-8e-06,-0.000138,-7.1e-05,-0.000225,-4.3e-05,-0.00027,-8.4e-05,-5.6e-05,0.000282,2.6e-05,-0.000311,-0.001479,0.000378,-0.003047,0.000433,-0.004579,-0.001834,-0.00163,-5.6e-05,-0.000492,-0.001233,0.000526,-0.001736,-0.001271,0.000875,-0.000825,-0.005911,-0.009153,0.001402,-0.004806,-0.00022,-0.003584,-0.004348,7e-06,0.00282,-0.001921,0.000229,0.001698,-0.00376,0.003016,0.002498,0.000754,-0.004164,-0.00617,0.000864,-0.009126,-0.007831,-0.001686,-0.001549,-0.005335,-0.004129,-0.000283,-0.011622,-0.00579,-0.000577,0.003219,0.000187,-0.00517,-0.002851,-0.002473,-0.002004,-0.002164,-0.001532,-0.000851,-0.000926,-0.001716,0.000264,-0.00018,-3.5e-05,0.00111,-0.001659,-0.000525,-0.000126,0.000135,0.000853,-0.002305,-0.001296,-8.7e-05,0.000525,0.000343,-7.4e-05,0.000191,-0.000634,-0.000243,6e-05,-0.00011,9.6e-05,-2.2e-05,2.2e-05,-0.000231,-1.6e-05,0.000743,0.000156,0.000127
-0.000206,-0.000158,0.000112,0.000164,-6.8e-05,-5e-05,-2.6e-05,6.7e-05,-7.7e-05,3e-05,-2.3e-05,-0.000171,-0.000108,-0.000297,4.5e-05,-4e-06,7e-05,0.000127,-3e-06,4e-05,-7.9e-05,6.2e-05,0.00014,-3.1e-05,-0.000152,1.4e-05,1.2e-05,2.8e-05,-7.5e-05,-4e-06,-0.000175,-4.5e-05,-8.4e-05,-3e-05,2.5e-05,0.000205,-9.8e-05,0.000199,0.00028,-0.000672,0.000239,8.7e-05,0.001589,0.00018,-0.000766,-0.00152,0.000357,0.000833,0.000179,-0.000138,-0.000148,-0.00037,-0.001774,-0.002035,0.001592,0.004371,-0.003177,-0.001473,0.004189,0.002302,0.00191,0.007455,-0.001127,0.003998,0.00142,-0.003565,0.002973,-0.002322,-0.00319,0.001422,0.001696,0.003453,0.005012,0.003582,0.001566,0.003775,0.000414,0.002069,-0.001749,0.005146,0.003818,0.000177,-0.001961,-0.001741,0.000856,0.001136,0.002424,0.002213,0.000363,0.000943,-0.001146,-0.00077,-0.000318,0.000222,-7.8e-05,-9e-06,-0.000141,-0.000785,1.5e-05,-0.000178,0.000628,0.000102,-0.000572,0.000161,0.000493,0.000249,-9.9e-05,0.000459,0.000333,-1.7e-05,-9.4e-05,0.000159,0.000377,6.4e-05,0.000122,8.8e-05,1.5e-05,-0.00015,-0.000163,0.000282,0.000267
0.000521,0.000126,7.6e-05,0.000181,9.2e-05,4.6e-05,0.000263,0.000219,0.000136,9e-06,0.000254,1.2e-05,-6.2e-05,-0.000102,0.00011,0.000177,2.6e-05,-2e-06,-9.1e-05,-4e-06,0.000127,-7.3e-05,0.000113,2.3e-05,-9.4e-05,-4.2e-05,3.7e-05,9e-06,-3.7e-05,7.3e-05,4.9e-05,0.000103,2.6e-05,5.3e-05,-4.8e-05,-1.4e-05,-9.7e-05,0.000101,7.4e-05,-0.000387,-2e-04,0.000854,-0.002014,-0.000729,0.000898,0.000799,-0.00105,-0.000601,0.001335,0.000369,0.000639,-0.000491,0.001499,0.001035,0.004166,-0.00043,0.001806,0.004102,-0.006648,-0.001846,0.003312,-0.006075,-0.002403,-0.000824,-8.8e-05,0.001085,-0.002761,0.002621,0.003792,-0.000986,-0.007133,-0.004997,-0.007331,-0.006948,-0.000984,-0.001028,-7.2e-05,-0.000165,0.00168,-0.002414,-0.002335,0.001393,0.00104,0.001118,-0.000638,0.000599,0.000938,0.00039,0.000441,-0.000718,0.001137,0.00174,0.001346,0.000688,5.3e-05,-6.1e-05,-0.000615,-0.001543,-0.001587,-4.2e-05,-0.000633,0.000422,-0.001777,-0.001341,-0.000593,0.000235,-0.000188,-8.8e-05,-3e-06,-3.8e-05,0.000103,2.6e-05,-0.00018,-0.000219,-8.2e-05,-2e-05,5.2e-05,-0.000131,0.000107,-3.6e-05,-0.000117
-9.1e-05,-0.000172,3.5e-05,1.5e-05,-3.9e-05,0.000216,9.4e-05,-5.7e-05,9.1e-05,3.1e-05,-2e-06,1.4e-05,-5e-06,-8.1e-05,2e-06,0.000155,-0.000204,-1.2e-05,-0.000151,0.000129,2.9e-05,-8e-06,-2.6e-05,-5.6e-05,-5.5e-05,-3.5e-05,9e-06,0.000114,7.1e-05,6.4e-05,4.1e-05,-0.000162,-7.2e-05,8.3e-05,-3e-05,2.4e-05,-7.7e-05,-4.5e-05,0.000249,0.000388,0.000556,-0.000104,-0.000338,0.00048,-0.000325,-0.000211,0.000887,0.000404,-0.000319,-0.001255,5.1e-05,-0.000332,0.000427,-0.001439,-0.00444,-0.003862,-0.006599,-0.002994,0.000513,0.003846,-0.005428,0.000689,-0.003878,-0.004838,0.003433,0.000842,-0.000113,0.002677,0.000105,0.000395,0.003435,0.004243,0.003155,0.005066,0.003255,-0.001096,0.000505,-0.00144,-0.00062,-0.001386,-0.000622,0.000713,0.000113,-0.000424,0.001965,0.001641,-0.000871,0.000937,0.002447,0.000378,0.001241,0.000354,-0.000706,-0.000629,-0.000582,-0.000161,0.000245,-4.4e-05,-0.001587,-0.000848,-0.000566,-0.001279,-0.001867,4e-06,0.000231,0.000166,0.000229,0.000264,6.3e-05,-0.000158,-0.000146,0.000122,-6.9e-05,-3.5e-05,0.000137,-3.7e-05,1.6e-05,0.00013,3e-05,-0.000293,-5.9e-05
-0.00023,-9.4e-05,-0.000127,3.4e-05,-0.000129,2.1e-05,-3.1e-05,-8.4e-05,6.6e-05,-5.5e-05,-8.9e-05,-0.000161,-0.000141,-9.6e-05,-0.000197,-6.1e-05,-9.2e-05,-8.2e-05,-0.000126,1.1e-05,9.5e-05,-4.3e-05,2.7e-05,-4.1e-05,7e-06,-4.1e-05,-3.8e-05,-8.8e-05,4.6e-05,2e-06,-4.5e-05,-0.00012,-3.2e-05,4.1e-05,1.5e-05,-1e-06,-0.000142,-0.000206,-0.000148,0.000329,0.000462,-0.001034,-2.5e-05,3e-05,0.000972,0.001706,0.000614,-0.000734,-0.000289,-0.000417,0.000572,-0.000537,-0.000232,0.002319,-0.003432,-0.002473,-0.002104,0.00087,-0.001534,-0.003051,-0.00067,-0.003085,0.005813,0.00166,-0.0027,-0.001966,-0.000241,-0.00205,-0.00128,0.000241,-0.00082,-0.001065,0.000848,-0.001459,-0.005823,-0.000481,-0.002129,-0.002773,-0.003393,0.000555,8e-06,-0.001658,-0.000344,-0.000369,-0.000603,-0.000879,0.001376,-0.000345,-0.002665,-0.000967,-0.00013,-0.000181,-9.9e-05,-0.000313,-0.000452,-0.000256,0.000423,-0.000201,-0.001308,-0.001229,-0.000693,0.001257,0.001552,-0.000464,-0.000485,-0.000223,5e-06,-0.000129,-0.000469,-0.000299,-1e-04,-8.2e-05,-0.000193,-0.000155,-0.000171,-5.9e-05,-0.000128,1.5e-05,1.5e-05,-3.8e-05,-2.4e-05
1.2e-05,6e-05,-0.000124,3.6e-05,4.2e-05,-0.000173,-2.1e-05,-7.4e-05,-3.1e-05,-7.7e-05,-2e-06,-0.000111,-0.000125,-1.4e-05,-0.000152,-9.4e-05,-0.000118,-6.6e-05,-9e-05,2.7e-05,3.8e-05,6.5e-05,4e-06,-0.000132,-3e-06,-1.8e-05,1e-06,-3.7e-05,-0.000106,-6.9e-05,4.6e-05,9e-06,-4.6e-05,-1e-05,-0.00015,-7e-06,-0.00012,-0.000155,1e-05,-9.1e-05,-0.000369,0.002607,0.001617,0.000203,0.000109,-0.001363,-0.00089,0.000148,-0.000233,-1e-05,-0.001536,-0.000724,0.000991,-0.002065,-0.002292,0.003731,0.001699,-0.000649,-0.001627,0.000517,0.0036,-0.001802,-0.005785,-0.001951,0.000487,2.5e-05,-0.001607,-0.000493,-0.001035,-0.002069,-0.000966,-2.2e-05,-0.00087,0.002843,0.005943,0.000208,-7.2e-05,0.004283,0.000831,0.000286,0.001475,0.000112,0.000534,0.002066,-0.000386,0.000397,6e-06,-0.000872,0.000596,0.00079,-0.000566,-4.1e-05,-0.000149,-0.000271,-0.000557,0.000346,-0.000372,0.00013,6.6e-05,-0.000873,-0.000625,0.000141,-0.000487,-0.000518,-0.000629,-8e-06,-0.000298,-5.7e-05,1.6e-05,-3.3e-05,-0.000334,-0.000153,8e-06,6e-06,-0.000134,-8.8e-05,5.8e-05,-9e-05,-9.5e-05,5.8e-05,0.000126
0.000141,1.7e-05,3.8e-05,2.8e-05,-9.2e-05,-7e-05,-1.7e-05,-1.2e-05,-1.1e-05,2.6e-05,-2e-06,-9.5e-05,-1.5e-05,6.2e-05,-6.3e-05,0.000108,-9e-06,-7.3e-05,1.5e-05,-4.8e-05,-6.9e-05,-3e-05,7e-06,-3.3e-05,-6.4e-05,-7.9e-05,2e-05,-3.4e-05,5.6e-05,-4.7e-05,-0.000114,2e-05,1.5e-05,-3.9e-05,-7.2e-05,-4.1e-05,-3.2e-05,-0.000169,6.2e-05,4.3e-05,-8.6e-05,-0.003577,-0.000911,-0.001225,0.000351,0.00055,0.000405,0.000135,-0.000179,-0.000475,-0.000176,-0.000882,0.000535,1e-06,0.002469,0.001714,-0.002965,-0.004264,-0.000774,-0.002002,-0.00061,0.001726,0.00078,0.00094,-0.00096,-0.000909,-0.001128,0.000202,0.00138,0.000723,0.000825,-0.000379,0.001193,-0.00053,-0.001647,3.2e-05,0.000631,-0.001644,-0.001397,0.001146,0.000648,0.001506,-0.001224,-0.001822,0.001055,0.000499,-0.000134,0.000475,-0.000759,0.000372,-0.000167,-0.001351,-0.000149,-5.6e-05,-0.00018,-0.000381,-0.000565,-0.000437,0.000305,-0.00072,-0.00021,-0.00155,-0.000604,-0.000345,-0.000692,-0.000223,-7.1e-05,-6.4e-05,-3.7e-05,-5.1e-05,-4.4e-05,-9.5e-05,-3.7e-05,-0.000199,2.3e-05,1e-05,5e-06,-0.000105,-6e-05,-7.2e-05,-9.8e-05
0.000153,-4.5e-05,-3.7e-05,9.1e-05,1e-06,-4.2e-05,-2.8e-05,2.5e-05,4.3e-05,5.6e-05,1.3e-05,-1.8e-05,4.5e-05,9.5e-05,-2.7e-05,5.5e-05,6.8e-05,-1.5e-05,-1.9e-05,-4.4e-05,5.5e-05,4.2e-05,-4.3e-05,1.4e-05,-4e-06,-4.1e-05,-7e-06,-2e-05,1.6e-05,2.4e-05,4.1e-05,7.2e-05,6.4e-05,-3e-06,-5.6e-05,-9e-06,-0.000101,1.8e-05,2e-05,-0.000261,7.1e-05,0.001234,0.001574,0.000326,-0.001313,-7.1e-05,-0.00053,-0.00035,0.000223,6.6e-05,-0.000214,0.000375,0.000457,-0.000263,5.7e-05,-0.001789,0.001596,0.000387,-0.001042,0.00259,0.003225,-0.00103,-0.000532,-0.000119,0.000521,0.000509,9e-06,-0.000489,0.000101,0.000492,0.000381,0.000729,1e-05,0.001477,0.000747,0.001115,0.000592,0.001956,0.000981,-1.8e-05,-0.000246,-0.001896,6e-04,0.000963,-0.000432,-7.6e-05,-0.001313,-0.001228,0.000388,0.000225,0.000599,-2.4e-05,0.000156,0.000365,0.000201,0.000138,-0.000342,-6.1e-05,0.000342,-4.1e-05,0.000193,-0.000447,-3.4e-05,0.000645,-8.1e-05,-2.1e-05,-2e-04,-0.000146,5.1e-05,1.8e-05,7.7e-05,-1.3e-05,-9.4e-05,1.9e-05,-4.7e-05,-7.8e-05,4.7e-05,4.9e-05,2e-06,6.9e-05,1.1e-05
-5.6e-05,-0.000131,-6.6e-05,-3.3e-05,-3.1e-05,1.6e-05,3.2e-05,3.6e-05,1.5e-05,-4.7e-05,-8e-06,6.9e-05,3.3e-05,0.000106,-1e-06,3.5e-05,-4.1e-05,1.5e-05,-6.7e-05,-4.1e-05,-2.8e-05,-7.6e-05,-1.1e-05,-1.2e-05,-6e-06,1.3e-05,-4.3e-05,2e-06,3e-05,-2.4e-05,5.6e-05,3e-05,2e-06,-2.1e-05,2.8e-05,-2.1e-05,-3.1e-05,1.1e-05,-0.000109,2.7e-05,-9.9e-05,0.000448,-0.00155,-0.000263,0.000656,-2.7e-05,0.000254,0.000371,-0.000373,-0.000219,-1e-06,-0.000152,0.000469,-8.4e-05,7.3e-05,-0.001704,-0.001081,-0.000322,-0.000876,-0.002713,-3e-06,0.002046,0.003697,0.000944,-0.000688,-0.000877,-0.001107,-7.1e-05,0.000284,9.1e-05,0.000232,-0.004051,-0.002046,-0.000765,-0.000259,-0.00168,-0.000368,-0.001086,0.00045,4e-06,-0.000776,-0.000822,0.000302,-0.000929,0.000803,-0.000192,6e-06,0.000546,-0.000393,-2.1e-05,-0.000333,3.8e-05,-2.6e-05,-1.6e-05,-3e-06,-0.000268,-6.9e-05,0.000172,0.000122,6.1e-05,0.000319,0.000207,2.4e-05,4.7e-05,-0.000293,-8.7e-05,-2.2e-05,0.000104,-0.000468,-6.7e-05,-2.7e-05,1.7e-05,4e-05,-2e-05,-3.9e-05,-8.1e-05,-7.9e-05,2.4e-05,3.4e-05,-4.9e-05,-6.9e-05
-4.4e-05,0.000173,1.9e-05,-5.2e-05,-4.5e-05,-2.7e-05,3.2e-05,-1.4e-05,-1.6e-05,-6e-05,7e-06,-5.1e-05,-2e-06,-3.5e-05,2.5e-05,-0.000115,-8.7e-05,-1.9e-05,-4.3e-05,-5.1e-05,1.4e-05,-2.6e-05,-3.1e-05,-4.5e-05,1.7e-05,-3e-05,-4.2e-05,-1.3e-05,1e-05,2.7e-05,-1.7e-05,-5.8e-05,0,-3.4e-05,7e-06,-1.3e-05,-1.8e-05,1.9e-05,-5.5e-05,5.2e-05,0.000285,0.000729,0.000934,0.000131,-0.000373,-4.5e-05,-0.000262,0.000112,0.00013,5.1e-05,0.000395,-4.8e-05,-0.000144,-6e-05,0.000953,-5.8e-05,-0.000392,0.000229,-0.000611,0.00104,0.000526,-0.001006,-0.002639,-0.000651,0.001287,-0.000422,0.001205,0.001028,-0.000308,-0.000519,-0.000249,0.001676,0.001398,-0.001337,-0.000246,0.002509,0.000318,0.00031,-0.000638,0.00069,6.7e-05,0.00176,-7.4e-05,0.000196,-0.000257,-9.4e-05,-0.000132,0.00049,7.1e-05,-0.000479,-0.00018,0.000584,5.1e-05,2.4e-05,-4.9e-05,0.00013,-7.8e-05,-0.000117,-0.000221,0.000229,0.000131,0.000568,0.000125,-0.000379,-4.8e-05,0.000131,-0.000142,-3.9e-05,-1e-06,-4e-05,6.5e-05,3.6e-05,-3.1e-05,8e-05,4.4e-05,-4.5e-05,4.2e-05,5.7e-05,0,3.6e-05,-5.9e-05
-1.6e-05,-2e-05,8e-06,-4.5e-05,-7e-06,-8e-06,-5e-05,-3.2e-05,-1.7e-05,-9.5e-05,-2.8e-05,-3e-06,1.9e-05,-4.6e-05,3.4e-05,-8.6e-05,-2.2e-05,4e-06,3.1e-05,-3.4e-05,0,1e-05,2.9e-05,-3.8e-05,6e-06,8e-06,-6e-06,-3e-06,4e-06,1e-06,-7e-06,2e-06,-1e-06,-1.2e-05,-3e-06,-5e-06,-4e-06,-4e-06,-0.000119,0.000107,-0.00014,-0.00214,0.000755,5e-05,0.000431,0.000368,9.5e-05,-0.000515,-0.000168,-0.000186,-0.000331,-0.000184,-0.000343,-0.000239,-0.000329,-0.000498,-0.001037,0.00221,-0.000928,-0.000378,-0.001073,-0.000233,0.001887,0.000391,-0.00137,0.000846,0.000159,-0.000626,0.001001,-0.001008,-9e-06,0.000168,0.000905,0.000913,-0.001183,-0.001333,-0.000307,0.000524,0.001548,-8.5e-05,-0.000575,5.7e-05,-0.000546,0.000112,-0.00062,-0.000264,0.001245,2.2e-05,0.000296,0.000579,-0.000173,-0.000157,0.000476,-2.5e-05,9.3e-05,6.6e-05,3.8e-05,0.000147,-0.000243,0.00021,0.000169,0.000327,-0.000101,0.000146,5.4e-05,-8.2e-05,-0.000125,-7.3e-05,4.4e-05,4e-06,7.4e-05,-7e-05,-3.6e-05,-7.6e-05,-2.9e-05,2.5e-05,-9e-06,-2.2e-05,-2.8e-05,-6.4e-05,4.1e-05
-3.7e-05,1.1e-05,-4e-06,-2.2e-05,-1.3e-05,2.8e-05,-1.3e-05,-2.5e-05,7e-06,-7e-05,-1.7e-05,-1.7e-05,2.3e-05,-5e-06,3e-06,-3.3e-05,-2.3e-05,-1e-06,-1.3e-05,-1.7e-05,1e-06,-1.7e-05,-1.2e-05,-2e-06,-9e-06,5e-06,-2e-06,6e-06,-1.8e-05,1.1e-05,1e-06,-2.8e-05,-6e-06,-8e-06,-3.8e-05,-2.5e-05,-1.5e-05,2.5e-05,-9.5e-05,-4.2e-05,7e-06,0.001208,-0.001072,-3e-05,-0.000571,1.2e-05,4e-06,0.000263,0.00021,1.1e-05,0.00015,1.1e-05,-0.000585,0.000183,-0.001643,-0.000352,0.000317,-0.003132,0.000174,-0.000631,0.000919,0.000457,-0.002154,0.000426,0.000708,0.000871,-0.00055,-0.000501,0.00029,0.001451,-0.000137,0.001217,-0.000696,0.000874,0.000266,-7.4e-05,2e-05,-0.000159,-0.000609,0.000286,0.000289,-0.000614,0.000576,0.000686,0.000446,0.000563,-0.000595,-0.000597,-0.000144,-0.000564,0.000153,8.7e-05,-0.000213,-1.7e-05,7.1e-05,-0.000102,-2.2e-05,3e-06,8.1e-05,0.000347,5.7e-05,3e-06,0.00015,1.6e-05,0.000166,-0.000106,-0.000113,4e-05,-1.6e-05,8e-06,-3.2e-05,4.9e-05,6.9e-05,-1.1e-05,0,1.9e-05,6e-06,4e-06,1e-06,3e-05,2.7e-05
-2e-05,-7.6e-05,2e-06,-1.4e-05,-4e-06,3.6e-05,-5e-06,-2e-05,-1.4e-05,2.7e-05,1.3e-05,-1e-06,-4e-06,1e-05,-1e-06,-2.8e-05,1e-06,-2.1e-05,-3e-06,1.8e-05,-7e-06,6e-06,1.4e-05,-2e-06,-1.3e-05,-1.7e-05,7e-06,-1e-06,1.5e-05,5e-06,-3e-06,3.6e-05,2e-06,2e-06,-2.3e-05,-5e-06,-8e-06,-2.5e-05,-4.4e-05,-3.8e-05,-0.000107,-0.000325,0.000341,1.7e-05,0.000257,-4e-05,-4e-05,-0.000325,-0.000205,-6.8e-05,8.6e-05,-6e-05,-0.000105,-0.000222,0.000701,0.000709,-0.000669,0.002475,0.000208,0.000478,-0.000461,-0.00113,0.001245,-0.000322,0.000102,-0.000719,0.000441,-0.000386,-8.2e-05,-0.000815,-9.9e-05,-0.000375,-7.6e-05,-0.000399,0.000482,0.000249,8.3e-05,3e-05,-0.00016,-8e-06,2.7e-05,2.4e-05,-6.8e-05,-0.000268,-0.000324,-0.000174,-0.000423,-1.5e-05,0.000207,6.4e-05,-5.7e-05,-6.6e-05,-8e-06,-3.7e-05,-4.7e-05,-9e-06,0.000205,-2.8e-05,0.000153,1.4e-05,0.000164,8e-06,-7.8e-05,-8.5e-05,-0.000162,7.6e-05,-8e-06,-8e-06,1.6e-05,7e-06,1.6e-05,-1.4e-05,-1.4e-05,3.2e-05,-1.4e-05,2e-06,-4e-06,4.3e-05,4e-06,6e-06,-7.7e-05
2.7e-05,-4.7e-05,-1.8e-05,-1e-06,-7e-06,-2.4e-05,-5e-06,0,-9e-06,2e-06,-1.2e-05,-1.1e-05,2.1e-05,-2e-06,-7e-06,2e-06,-1.2e-05,7e-06,-1.4e-05,1.2e-05,-5e-06,-7e-06,-4e-06,-7e-06,1e-05,3e-06,1.7e-05,-1.1e-05,-2e-05,3e-06,-8e-06,9e-06,4e-06,4e-06,-1.4e-05,1.5e-05,-4e-06,-1.7e-05,-3.1e-05,-1.5e-05,2.5e-05,-1.7e-05,0.000388,0.000384,-0.00013,-5e-05,3.2e-05,0.000152,0.000159,-3.8e-05,-0.000194,7.5e-05,-0.000133,0.000353,4e-06,0.000184,4.9e-05,-0.000388,-0.000498,-0.000271,1.1e-05,0.000538,-0.000304,0.000217,-3.2e-05,0.000161,6.8e-05,0.000469,-4.9e-05,0.000117,6.9e-05,2.7e-05,0.000254,-0.000375,-0.000134,-0.000472,0.000179,-0.000364,-0.000257,-0.000269,-2.3e-05,1.5e-05,-2.1e-05,-0.000126,0.000225,0.00023,0.000152,-1.8e-05,-0.000208,-6.9e-05,5.1e-05,6e-06,-1.7e-05,0.000217,-4.1e-05,-9e-06,-9.8e-05,2.2e-05,8.9e-05,-0.000261,-2.1e-05,-7.5e-05,-3e-05,3.9e-05,0.000209,-6.6e-05,-5.4e-05,-2.4e-05,5e-05,-2.6e-05,-1.2e-05,1.7e-05,-4e-06,-3e-05,1.1e-05,7e-06,-3e-06,1.6e-05,2e-05,8e-06,6.1e-05
1.5e-05,3.8e-05,-2e-06,1e-05,-2e-06,0,-7e-06,4e-06,4e-06,-2e-06,3e-06,-2e-06,0,1e-06,-2.3e-05,2.5e-05,-8e-06,-5e-06,-6e-06,3e-06,-4e-06,-6e-06,9e-06,3e-06,2e-06,-8e-06,8e-06,-7e-06,8e-06,-2e-06,5e-06,2e-06,5e-06,4e-06,1e-06,6e-06,-8e-06,2e-06,-6e-06,-2e-06,4.6e-05,0.000172,-0.000376,-0.000303,-8.1e-05,-6e-05,6.8e-05,6e-06,-5.4e-05,-4.9e-05,2.8e-05,-1.9e-05,-0.000248,-0.000141,-0.000639,-0.000368,-0.000371,-0.00085,0.000179,6.3e-05,0.000247,-0.001011,4.9e-05,0.000196,0.000412,0.000552,-0.000504,-0.00021,1.5e-05,0.000311,-7.5e-05,-8.1e-05,-0.000886,0.000278,-0.000413,0.000559,-6.8e-05,0.000464,1e-06,0.000206,4.6e-05,-0.000305,-4.3e-05,-6.3e-05,-0.000339,-0.00016,0.000529,-2.8e-05,0.000116,-4.6e-05,-0.000219,5.2e-05,-8.7e-05,-5e-05,-3.1e-05,2.9e-05,5.1e-05,2.5e-05,2.4e-05,-0.000195,0.000103,0.000104,9e-06,-4e-06,-9.9e-05,3.8e-05,1.5e-05,2.9e-05,-5.7e-05,4e-06,-6e-06,-8e-06,-5e-06,2.7e-05,-7e-06,-9e-06,-1.3e-05,-2.7e-05,-1e-05,-1.3e-05,2.8e-05
-1.6e-05,1.4e-05,4e-06,1.3e-05,-1e-06,6e-06,7e-06,1e-05,9e-06,4e-06,-2e-06,-4e-06,9e-06,-1e-06,-1.2e-05,3.4e-05,-7e-06,1e-06,-1.4e-05,1.1e-05,-9e-06,-9e-06,-8e-06,-4e-06,-1e-06,-5e-06,-1e-06,-2e-06,-1.3e-05,-3e-06,-7e-06,-7e-06,1e-06,4e-06,-1e-05,3e-06,-6e-06,-8e-06,0,-1.5e-05,3.9e-05,-0.000226,-0.000236,4.3e-05,2.1e-05,7.6e-05,-4e-05,6.7e-05,-6.1e-05,1.9e-05,1.1e-05,-3e-05,-7.3e-05,0.000123,0.001015,-0.000421,-0.000163,-0.000559,-0.000128,5.2e-05,-0.000398,0.000631,2.2e-05,-0.000336,-0.000583,0.000203,0.000405,-0.000261,0.00024,-0.000365,0.000143,0.000146,0.000221,-3.7e-05,0.000769,-6.9e-05,-0.00017,-0.000596,0.000159,-7.1e-05,-0.000218,-0.000179,0.000429,-0.000203,3.5e-05,-1.6e-05,-0.000202,0,4.1e-05,0.000156,0.000297,-1.3e-05,6.1e-05,-2.2e-05,-3e-06,3e-06,-2.5e-05,-1.4e-05,-0.000108,8e-05,3.5e-05,-0.00014,-5.3e-05,4.7e-05,-0.00015,-7.1e-05,0,-2e-06,2.6e-05,-2e-06,2.9e-05,4e-06,-5e-06,-3.1e-05,-1.2e-05,-1.3e-05,-7e-06,-8e-06,6e-06,5e-06,-1.1e-05
-8e-06,3e-06,-8e-06,7e-06,-1.1e-05,-6e-06,7e-06,-5e-06,0,-9e-06,-1e-06,-4e-06,3e-06,-6e-06,2e-06,-1.6e-05,-9e-06,-2e-06,-5e-06,8e-06,1e-05,6e-06,-1e-06,0,-3e-06,-5e-06,-2e-06,-3e-06,5e-06,-1e-06,3e-06,-1.3e-05,-2e-06,4e-06,7e-06,-1e-06,-2e-06,6e-06,6e-06,-2.2e-05,-6e-06,1.7e-05,0.000305,-8e-06,9.2e-05,-3.5e-05,-2.2e-05,-4.3e-05,7e-06,-4.8e-05,-3.7e-05,-2.6e-05,-2.1e-05,-0.000156,6.6e-05,4.7e-05,2.1e-05,0.000402,-0.000291,-0.000166,2e-05,-0.000166,0.000484,0.000201,0.000583,-0.000157,-0.00016,0.000159,-9.5e-05,0.00016,-2.7e-05,-0.00015,0.000521,0.000167,-0.000804,-0.000251,0.000116,0.000717,-4e-05,-2.1e-05,4.9e-05,0.000525,-9.4e-05,0.000121,8.2e-05,-0.00017,-1.4e-05,0.000118,-1.2e-05,2.6e-05,-8.1e-05,-6.4e-05,4e-06,-6.3e-05,2.3e-05,3e-06,-1e-06,-1e-06,-8.6e-05,4.3e-05,7.9e-05,3.1e-05,-4e-05,1e-06,-1.3e-05,1.7e-05,0,-7e-06,-8.9e-05,-3e-06,6e-06,-4e-06,2e-06,1.3e-05,4e-06,-9e-06,1e-05,1.2e-05,-5e-06,-1.8e-05,-3.1e-05
1e-06,-5e-06,1.1e-05,8e-06,1e-06,-3e-06,4e-06,0,-5e-06,-1.2e-05,-2e-06,-2e-06,4e-06,-4e-06,1e-06,9e-06,-1e-05,-1e-06,4e-06,-4e-06,-1e-05,-2e-06,-3e-06,-9e-06,0,1e-06,0,-1e-06,-4e-06,-2e-06,8e-06,-3e-06,0,-2e-06,-3e-06,-1.3e-05,-2e-06,8e-06,7e-06,-2.1e-05,-2.3e-05,6.7e-05,-0.000142,-2e-05,-0.000195,-0.00013,4.9e-05,-7.3e-05,-2.2e-05,-4.9e-05,4.6e-05,2.2e-05,-1.6e-05,0.000137,-0.000557,0.000172,-5.8e-05,5.6e-05,1e-04,0.000139,-0.000327,6.8e-05,-0.000565,-1.3e-05,-0.00037,0.000228,9.7e-05,0.000148,1.9e-05,2.8e-05,7.6e-05,-8.8e-05,-0.000223,-0.000123,0.000262,-1.3e-05,0.000107,-0.00019,0.000105,5e-06,-7.1e-05,-0.000222,-8.6e-05,-6e-06,-0.000154,5.8e-05,-0.000115,-1.3e-05,-9e-06,4.8e-05,-3.9e-05,1e-06,-3.3e-05,-1.6e-05,1.6e-05,7e-06,-1.8e-05,2.1e-05,4.3e-05,9.1e-05,3.1e-05,-3.6e-05,2.7e-05,-8.3e-05,5e-06,-3e-06,-2e-05,1e-05,3.2e-05,-5e-06,2.5e-05,6e-06,7e-06,-8e-06,6e-06,-8e-06,-1.2e-05,6e-06,4e-06,2e-06,1.2e-05
-4e-06,-1.8e-05,2e-06,6e-06,-4e-06,-1.3e-05,4e-06,-3e-06,4e-06,-4e-06,2e-06,-6e-06,2e-06,-3e-06,5e-06,-1.1e-05,0,2e-06,0,-9e-06,8e-06,-3e-06,-2e-06,-4e-06,3e-06,-4e-06,-2e-06,0,-2e-06,1e-06,-1.1e-05,3e-06,0,-3e-06,3e-06,0,-5e-06,8e-06,5e-06,0,-2e-05,8.6e-05,-5.1e-05,-3.8e-05,0.000168,2e-06,-3.8e-05,8e-05,1.4e-05,-1.1e-05,-4.6e-05,-4.4e-05,2.2e-05,-0.000119,0.000104,5.2e-05,-0.000145,0.000229,-0.000425,-0.000125,0.000178,0.000373,0.000147,0.000149,0.000141,4.6e-05,9.6e-05,-0.000131,1.5e-05,-3e-05,7e-05,-1.1e-05,-0.000322,-5.5e-05,0.000178,0.00015,-9e-05,-0.000118,9e-06,-0.000103,4.7e-05,-0.00019,-0.000106,0.000148,0.000141,-3.1e-05,4e-05,-1.4e-05,-1.2e-05,-0.00011,4.4e-05,3.4e-05,9e-06,2.7e-05,3e-06,6e-06,-2.5e-05,-1.8e-05,7.4e-05,0.000154,4.3e-05,6.3e-05,-6e-06,7e-05,2.7e-05,-6e-06,-9e-06,-2e-06,-9e-06,-6e-06,1.6e-05,-1.1e-05,1.5e-05,7e-06,-1.1e-05,-4e-06,6e-06,-6e-06,-5e-06,3e-06,0
5e-06,-1e-06,-1.1e-05,2e-06,-4e-06,8e-06,1e-06,-2e-06,3e-06,3e-06,0,2e-06,3e-06,-1e-06,4e-06,1.9e-05,1e-06,-3e-06,-1.3e-05,-8e-06,3e-06,0,0,-1e-06,0,-3e-06,-3e-06,4e-06,-2e-06,1e-06,1e-06,1.2e-05,-1e-06,1e-06,-8e-06,0,-2e-06,-1e-06,0,9e-06,0,-0.000169,0.000148,2.5e-05,-4.8e-05,6e-05,3e-06,-5.3e-05,-2e-05,-2.8e-05,4.8e-05,8e-06,0.000121,8.6e-05,-0.000135,0.000101,-0.000231,0.000323,-0.000338,-0.000139,-0.000105,-0.000641,-6.8e-05,-9.7e-05,1.8e-05,0.000105,-0.000294,0.000115,-1e-04,0.000153,-0.000142,-0.000215,7.1e-05,7.1e-05,2.8e-05,5e-05,-6.6e-05,-0.000134,3e-05,-8e-06,0.000111,0.000124,7.9e-05,-9.4e-05,-0.000134,7e-05,0.000264,-6.5e-05,2.5e-05,-3.3e-05,-1.1e-05,-1e-05,3.5e-05,5.4e-05,-4e-06,0,-5e-06,6e-06,4.4e-05,2.6e-05,2.3e-05,7e-05,-1.2e-05,6e-06,1e-06,2.7e-05,-1.5e-05,-9e-06,8e-06,-2e-06,7e-06,2e-06,-1.5e-05,-4e-06,1e-06,-3e-06,-2e-06,-3e-06,2e-06,2e-06,4e-06
1.4e-05,1.4e-05,5e-06,-1e-06,-2e-06,7e-06,-1e-06,-3e-06,-2e-06,3e-06,-3e-06,-3e-06,1e-06,4e-06,-4e-06,-1e-05,-6e-06,0,-6e-06,-6e-06,0,-6e-06,1e-06,1e-06,-3e-06,2e-06,-2e-06,-1e-06,2e-06,2e-06,4e-06,-1e-06,1e-06,-5e-06,-6e-06,6e-06,-1e-06,-6e-06,-3e-06,6e-06,1e-05,1e-06,-0.000252,3e-05,3.8e-05,-7.3e-05,9e-06,-2e-05,2.6e-05,-3.6e-05,1e-06,-1e-06,7.4e-05,-5.4e-05,-0.000236,4.5e-05,8e-06,-0.000544,4.9e-05,8.7e-05,3e-05,0.000339,0.000186,0.000184,-6.4e-05,-2.8e-05,0.000206,-8.2e-05,2.8e-05,-7.4e-05,1e-06,0.000193,4.7e-05,5.4e-05,6e-06,6.7e-05,4.3e-05,0.000113,-6e-06,-6.3e-05,-4.6e-05,0.000227,4.6e-05,4.7e-05,2.2e-05,1e-06,-0.000128,-4.6e-05,-9e-06,6e-06,1e-05,2e-06,-4.7e-05,0,-2.3e-05,-1.3e-05,1.5e-05,1.1e-05,6e-06,-9.4e-05,2.7e-05,-3.2e-05,1.9e-05,-4.6e-05,-2e-06,-2.3e-05,-1.1e-05,-1e-06,-1.7e-05,3e-06,-2e-05,6e-06,-1e-06,-7e-06,2e-06,-1e-06,-1e-06,4e-06,2e-06,2e-06,6e-06
5e-06,4e-06,0,-3e-06,-1e-06,-5e-06,-1e-06,3e-06,-2e-06,-1e-06,4e-06,-2e-06,1e-06,0,-3e-06,5e-06,-6e-06,0,1e-06,-5e-06,5e-06,2e-06,0,-4e-06,0,-5e-06,-2e-06,0,-4e-06,1e-06,-3e-06,1e-06,0,1e-06,-5e-06,0,-3e-06,-4e-06,-8e-06,0,1e-06,0.000227,0.000138,-7e-06,-3.2e-05,2.8e-05,-3.8e-05,7.1e-05,-2e-05,-7e-06,-2.2e-05,-2e-06,6.3e-05,-2e-06,0.000105,-7.1e-05,-0.000202,0.000188,-0.000143,-0.000112,2.3e-05,-4e-04,-1.1e-05,-2.3e-05,-4.3e-05,0.000197,-9.5e-05,-9.4e-05,-6e-06,2.3e-05,-5.9e-05,8.2e-05,2.6e-05,-6.9e-05,3e-06,-9.4e-05,6e-05,-5e-06,-9e-06,-5e-06,7e-05,-0.00015,6.4e-05,-0.000131,7e-05,2e-05,-0.000142,-2.2e-05,-4.6e-05,0,-2.7e-05,-2.5e-05,3.7e-05,-3.2e-05,-6e-06,-8e-06,3e-06,-5e-06,-6.8e-05,-5.9e-05,8e-06,-3.2e-05,-2.5e-05,1.2e-05,3.9e-05,1.2e-05,-1e-05,2e-06,-5e-06,-3e-06,1.7e-05,1e-06,3e-06,9e-06,0,5e-06,-3e-06,5e-06,2e-06,-3e-06,-1.6e-05
-9e-06,-9e-06,-4e-06,-7e-06,-3e-06,2e-06,-1e-06,1e-06,1e-06,-1.3e-05,-1e-06,-2e-06,1e-06,-3e-06,-2e-06,-2e-06,-7e-06,-1e-06,-4e-06,-2e-06,-2e-06,-3e-06,3e-06,-1e-06,1e-06,1e-06,-1e-06,-2e-06,4e-06,1e-06,-2e-06,-9e-06,0,-1e-06,-1e-06,-3e-06,-1e-06,-3e-06,-1.1e-05,-2e-06,1e-06,-0.000177,-2.4e-05,5e-05,-3.8e-05,-1.2e-05,3e-05,-1.4e-05,1.4e-05,-2e-05,1e-06,8e-06,7.9e-05,1.7e-05,0.000218,-2.4e-05,7.1e-05,0.000128,1.6e-05,7.1e-05,-7.7e-05,6.1e-05,-0.000106,-7.6e-05,8.4e-05,-3.3e-05,-6.4e-05,-4.2e-05,-4e-05,-3.2e-05,4.7e-05,0.000206,3e-05,-2.3e-05,8.3e-05,0.000101,-2e-05,4e-06,-0.000151,3e-06,-0.000108,-0.000209,-0.000156,5.2e-05,-9.1e-05,-3.6e-05,2e-05,1.3e-05,-5e-06,7.5e-05,-2.5e-05,-2.8e-05,-8e-06,-1.6e-05,1.4e-05,2e-06,9e-06,-2e-06,-3.3e-05,-1.3e-05,1.2e-05,-2e-05,-7e-06,-3e-06,-3.1e-05,-1.7e-05,-1e-05,-4e-06,3e-06,-3e-06,-1e-05,5e-06,-5e-06,-8e-06,-3e-06,3e-06,3e-06,-3e-06,1e-06,-2e-06,1.3e-05
-5e-06,-1.4e-05,-1e-06,-9e-06,-3e-06,2e-06,-2e-06,1e-06,3e-06,-1.2e-05,-2e-06,0,0,0,-4e-06,-7e-06,-4e-06,3e-06,-2e-06,2e-06,2e-06,1e-06,-1e-06,-1e-06,1e-06,-2e-06,1e-06,-3e-06,-4e-06,-1e-06,2e-06,0,0,0,-1e-06,0,-2e-06,1e-06,-1.2e-05,1e-06,-4e-06,3.5e-05,-5.2e-05,-3.2e-05,6.9e-05,-4e-06,8e-06,-3.2e-05,-1.2e-05,-1.9e-05,0,-1.4e-05,2.7e-05,-1.8e-05,0.000139,8.2e-05,-0.000211,-0.000368,3.2e-05,-6.1e-05,3.1e-05,0.000164,-0.000117,-4e-05,5.2e-05,5e-06,0.000199,0.000224,1.9e-05,1.2e-05,5.7e-05,-9.5e-05,3e-06,8.2e-05,-0.000311,2.9e-05,-1.9e-05,0.00014,7.2e-05,-5.9e-05,-3e-06,0.000241,7.8e-05,-5.9e-05,8.1e-05,-1e-05,5.8e-05,4.9e-05,1.7e-05,-3.7e-05,3.7e-05,-9e-06,-2.2e-05,-1e-05,1e-06,-4e-06,-3e-06,8e-06,1.7e-05,-1e-06,0,2.6e-05,5e-06,1.8e-05,-4.3e-05,1e-05,-5e-06,-2e-06,1e-06,-2e-06,1.6e-05,-5e-06,1.2e-05,8e-06,1e-06,-1e-06,0,-6e-06,-4e-06,-4e-06,-2e-06
0,7e-06,3e-06,-3e-06,2e-06,1e-06,-1e-06,-1e-06,-4e-06,-4e-06,0,1e-06,0,0,-1e-06,-8e-06,-2e-06,-2e-06,-1e-06,4e-06,-3e-06,-2e-06,0,-2e-06,0,-2e-06,2e-06,-1e-06,4e-06,0,0,0,-1e-06,2e-06,1e-06,-2e-06,0,4e-06,-1.2e-05,2e-06,4e-06,4e-05,5.9e-05,2.5e-05,-7e-05,1.9e-05,-1.4e-05,3.8e-05,5e-06,-6e-06,-2.2e-05,-1.2e-05,-8e-06,3.4e-05,-0.00027,6.4e-05,-3.5e-05,-3.6e-05,-6.8e-05,2.2e-05,-0.000133,-0.000119,0.000218,1e-05,-0.00012,-4.4e-05,-8.4e-05,-9.9e-05,-0.000158,2e-05,0,-5.3e-05,-8.8e-05,1.4e-05,0.000304,-0.000148,7e-06,-0.000272,4e-06,0,-3e-06,-0.000107,2.9e-05,5.7e-05,-6.6e-05,3e-06,-2.8e-05,1.5e-05,-2.9e-05,5.7e-05,0,2.7e-05,2.7e-05,1.3e-05,-2e-06,6e-06,0,-2e-06,3.7e-05,4.1e-05,6e-06,-3.3e-05,9e-06,-6e-06,5e-06,-1.5e-05,-5e-06,6e-06,-4e-06,-3e-06,5e-06,0,-1e-06,-9e-06,0,-4e-06,-3e-06,2e-06,1e-06,1e-06,-9e-06
0,1.3e-05,0,-1e-06,-3e-06,-1e-06,0,0,-1e-06,-2e-06,2e-06,-4e-06,0,-1e-06,2e-06,-4e-06,-1e-06,0,-4e-06,4e-06,2e-06,-1e-06,-1e-06,-1e-06,-1e-06,0,2e-06,-2e-06,-3e-06,-1e-06,-1e-06,6e-06,0,-1e-06,-2e-06,1e-06,-2e-06,2e-06,-1e-05,0,3e-06,-7.6e-05,1.6e-05,-2.4e-05,2.7e-05,1.3e-05,1.1e-05,-4.9e-05,-1e-06,-2.3e-05,2.7e-05,5e-06,-1.4e-05,-4.8e-05,1.6e-05,-5.5e-05,-0.000151,0.000128,-4.9e-05,-1.7e-05,0.000186,0.000233,0.000156,7.2e-05,0.000116,8.9e-05,-2.3e-05,-1.7e-05,1.7e-05,-3.9e-05,3.3e-05,-6.4e-05,4e-06,-7.1e-05,1.4e-05,7.9e-05,7e-06,0.000174,4.2e-05,-2.3e-05,0,6.8e-05,-3.1e-05,-4.4e-05,5.9e-05,1e-06,8.7e-05,-1e-06,2.8e-05,-2e-05,-3.3e-05,2.1e-05,-2.4e-05,2.5e-05,3e-06,-1.4e-05,5e-06,-5e-06,2.3e-05,4.6e-05,-2e-06,1.2e-05,-6e-06,-1.9e-05,-1.1e-05,5e-06,-3e-06,-3e-06,1e-06,-3e-06,1.6e-05,-1e-06,-6e-06,5e-06,-1e-06,-7e-06,2e-06,3e-06,-2e-06,0,6e-06
-1e-06,-1e-06,0,4e-06,-1e-06,-5e-06,-1e-06,-2e-06,1e-06,4e-06,-1e-06,2e-06,0,1e-06,1e-06,7e-06,-1e-06,1e-06,-5e-06,3e-06,-6e-06,-1e-06,0,-1e-06,0,-2e-06,1e-06,2e-06,2e-06,-1e-06,1e-06,2e-06,0,2e-06,0,-1e-06,-1e-06,3e-06,-8e-06,-2e-06,1e-06,8.3e-05,-8.8e-05,1e-05,2.1e-05,-3.7e-05,-8e-06,1.9e-05,-3e-06,-2.1e-05,-1.5e-05,3e-06,-1.4e-05,5.4e-05,1.1e-05,-8.3e-05,-2.1e-05,0.000208,-0.000162,-2.3e-05,-7.7e-05,-0.000181,-0.000265,-6.8e-05,-0.000101,-4.3e-05,4.7e-05,-4.9e-05,-4.8e-05,4.2e-05,-3.1e-05,1.6e-05,8.9e-05,-1.5e-05,-0.000139,-8.4e-05,1.3e-05,-7.9e-05,-2.5e-05,1.4e-05,7.1e-05,2.4e-05,-6.6e-05,6.2e-05,-1.5e-05,6e-06,-0.000135,1.4e-05,-3.9e-05,-1e-06,2.8e-05,1e-06,3e-06,-5e-06,-4e-06,3e-06,-1e-06,8e-06,2e-06,3.1e-05,2e-06,-2.2e-05,5e-06,1.7e-05,3e-06,3e-06,-2e-06,-3e-06,-1e-06,-2e-06,0,-2e-06,-1e-06,-2e-06,-1e-06,-6e-06,-1e-06,-1e-06,4e-06,0,2e-06
5e-06,-8e-06,-1e-06,4e-06,0,1e-06,0,0,2e-06,3e-06,-1e-06,-4e-06,-1e-06,1e-06,0,1e-06,-3e-06,-1e-06,-2e-06,1e-06,2e-06,-2e-06,-1e-06,0,0,0,0,0,-1e-06,0,-2e-06,0,0,-1e-06,-3e-06,2e-06,0,-1e-06,-5e-06,-1e-06,-4e-06,-7e-05,7.3e-05,-2.4e-05,-4.8e-05,5.1e-05,0,-1.4e-05,4e-06,-1.1e-05,1.4e-05,-4e-06,-5e-05,-5.7e-05,-0.000326,-2.6e-05,-0.000126,-9.4e-05,-0.000142,0,-1.8e-05,5.7e-05,9.5e-05,-4.9e-05,0.000143,-1.1e-05,-7.3e-05,6.6e-05,2.2e-05,-5e-06,-4e-06,-3.3e-05,0.00011,7.3e-05,6.4e-05,-1e-06,6e-06,1e-04,1.2e-05,-7e-06,-2.8e-05,-1.8e-05,8.7e-05,-4.1e-05,-3.5e-05,-8e-06,-1e-06,-1.2e-05,3.6e-05,6e-06,-3e-06,-3e-06,6e-06,0,-3e-06,-2e-06,-5e-06,-4e-06,-3.6e-05,1e-05,-2e-06,1.1e-05,4e-06,0,0,4e-06,-3e-06,5e-06,-1e-05,1e-06,0,-1e-06,1e-06,1e-06,2e-06,-3e-06,0,-3e-06,-2e-06,-2e-06,3e-06
1e-06,-7e-06,2e-06,4e-06,-2e-06,2e-06,1e-06,1e-06,-3e-06,-2e-06,2e-06,2e-06,0,0,0,3e-06,-4e-06,1e-06,1e-06,-1e-06,-1e-06,0,0,0,0,-2e-06,-1e-06,1e-06,2e-06,0,2e-06,-5e-06,0,1e-06,-1e-06,1e-06,-1e-06,-2e-06,-3e-06,0,-3e-06,3.8e-05,3.1e-05,1.7e-05,1.3e-05,-9e-06,-5e-06,4.2e-05,-2e-06,-2.3e-05,-1.2e-05,1e-06,-3.7e-05,5.5e-05,0.000146,-1.2e-05,-1.8e-05,3.3e-05,-4.4e-05,-2.9e-05,7.7e-05,-8.6e-05,-0.000202,2.1e-05,-0.000134,-3e-06,5.4e-05,-3.6e-05,-2e-06,-2.8e-05,-1.1e-05,1.8e-05,-0.000124,2e-05,-4e-06,5.6e-05,-1.8e-05,-5e-05,1e-06,-1.8e-05,3e-06,-0.00011,1.2e-05,2.5e-05,5.5e-05,7e-06,9.1e-05,-1.6e-05,-1e-05,-2.7e-05,0,8e-06,-9e-06,-2.1e-05,3e-06,4e-06,2e-06,-3e-06,-1.9e-05,-3.1e-05,-1e-06,3e-05,-1.3e-05,-1e-05,1.1e-05,-2e-06,-1e-06,-2e-06,-3e-06,-4e-06,-7e-06,4e-06,4e-06,0,-2e-06,0,-1e-06,0,3e-06,1e-06,-1e-06
-5e-06,3e-06,-1e-06,3e-06,-1e-06,-1e-06,0,1e-06,0,-3e-06,0,-1e-06,0,0,-1e-06,0,-4e-06,-1e-06,-1e-06,-2e-06,-2e-06,-1e-06,0,-1e-06,-1e-06,0,-1e-06,0,-1e-06,0,1e-06,-1e-06,0,-1e-06,-2e-06,-1e-06,0,-2e-06,-1e-06,1e-06,1e-06,-5.3e-05,-5.8e-05,-1.7e-05,3.2e-05,-5e-06,-9e-06,-4.1e-05,4e-06,-1.1e-05,-3e-06,-1e-06,-2.6e-05,-4.6e-05,0.000286,2.4e-05,-6.9e-05,-9.9e-05,-6.7e-05,5e-06,-8.3e-05,-4.5e-05,0.000297,1.2e-05,4.2e-05,4.9e-05,-1.9e-05,2.4e-05,-4e-05,4.4e-05,-6e-06,-2.9e-05,-9.9e-05,-2.8e-05,-0.000138,-3.1e-05,-1.7e-05,-1.5e-05,-3.2e-05,5e-06,-3.5e-05,-1.3e-05,-3e-05,-2.2e-05,-7.3e-05,-2.6e-05,5.2e-05,-3e-06,1e-06,1e-06,0,4e-06,-5e-06,-2e-06,0,2e-06,-4e-06,4e-06,7e-06,-4.6e-05,-4e-06,-1.6e-05,9e-06,7e-06,7e-06,0,-3e-06,-2e-06,-2e-06,-3e-06,2e-06,2e-06,-1e-06,-4e-06,-1e-06,1e-06,1e-06,2e-06,-3e-06,-3e-06,2e-06
-3e-06,9e-06,-2e-06,2e-06,0,-1e-06,1e-06,-1e-06,1e-06,-4e-06,0,-2e-06,0,0,-1e-06,3e-06,-1e-06,1e-06,-4e-06,-3e-06,4e-06,0,0,-1e-06,0,-2e-06,-1e-06,-1e-06,2e-06,0,-2e-06,1e-06,0,0,-1e-06,-1e-06,0,-2e-06,-1e-06,0,4e-06,9.9e-05,5.8e-05,2.8e-05,-4.1e-05,1.3e-05,6e-06,1.8e-05,-4e-06,-4e-06,4e-06,0,-2.4e-05,3.8e-05,-0.000213,4.8e-05,-9.4e-05,5e-06,-5.3e-05,-1.3e-05,2.9e-05,7.8e-05,-0.000128,-4.3e-05,4.3e-05,-2.9e-05,1.6e-05,-2.7e-05,3e-05,-2.1e-05,2.6e-05,4.3e-05,0.000116,-4.5e-05,8.6e-05,3.2e-05,1e-05,-0.000107,1.2e-05,-7e-06,-1.4e-05,0.000159,-2.1e-05,1.4e-05,5.4e-05,1.9e-05,-7.3e-05,1.4e-05,1e-05,5e-06,-1.1e-05,-3e-06,8e-06,3e-06,-1e-06,1e-06,2e-06,0,1.9e-05,-1.2e-05,-5e-06,1.2e-05,2e-06,2e-06,1e-06,-4e-06,-2e-06,4e-06,1.1e-05,-2e-06,1e-06,1e-06,3e-06,4e-06,1e-06,1e-06,-2e-06,0,1e-06,1e-06,-6e-06
3e-06,-1e-06,2e-06,1e-06,0,3e-06,1e-06,0,2e-06,-3e-06,0,1e-06,-1e-06,0,-1e-06,-2e-06,-1e-06,0,-2e-06,-2e-06,-3e-06,-2e-06,0,-1e-06,0,-1e-06,0,0,-2e-06,0,1e-06,3e-06,0,0,0,-1e-06,0,1e-06,0,0,1e-06,-7e-05,-2.3e-05,1e-05,4.4e-05,1.3e-05,9e-06,9e-06,5e-06,-2.2e-05,1e-06,-4e-06,-1.4e-05,-3.6e-05,1.3e-05,2.4e-05,-4.8e-05,8.2e-05,-2.1e-05,1e-05,-4.3e-05,-7.3e-05,0.000111,7e-06,-7.9e-05,-4e-06,-1.4e-05,-2.3e-05,-3.2e-05,1e-05,2e-06,2.1e-05,-5e-06,3.3e-05,5.4e-05,-4e-06,1.4e-05,8.6e-05,-9e-06,-3e-06,1.3e-05,-0.000113,0,-2.1e-05,-2.6e-05,-1.7e-05,-1.5e-05,2.4e-05,-1.4e-05,8e-06,1.4e-05,-7e-06,-7e-06,1.7e-05,1e-06,1e-06,-1e-06,-3e-06,2e-05,1.7e-05,-7e-06,-3.2e-05,-3e-06,3e-06,-1.7e-05,2e-06,-3e-06,0,-3e-06,-2e-06,1e-06,-2e-06,-5e-06,-4e-06,0,0,0,-2e-06,-2e-06,0,-3e-06
1e-06,-3e-06,1e-06,-1e-06,-1e-06,0,0,0,-3e-06,1e-06,0,-3e-06,0,0,-1e-06,-2e-06,-1e-06,0,-1e-06,-1e-06,3e-06,0,0,0,0,0,0,-1e-06,2e-06,0,1e-06,2e-06,0,-1e-06,0,-1e-06,0,1e-06,-1e-06,0,-2e-06,0,-2e-05,-2e-06,-4.9e-05,-1.6e-05,2e-06,-2.8e-05,-3e-06,-1.2e-05,3e-06,-1e-06,7e-06,2.7e-05,0.000131,-3.3e-05,-8.1e-05,-0.000118,-4.8e-05,-7e-06,6.6e-05,0.000126,-0.000228,2.7e-05,6.3e-05,1.9e-05,-1e-06,4.4e-05,-1e-05,2e-06,9e-06,4.6e-05,-4.8e-05,4.6e-05,-3.4e-05,1.2e-05,-1.4e-05,5.3e-05,-2.6e-05,1.8e-05,7e-06,-1.7e-05,3.7e-05,3e-06,-2.6e-05,2.7e-05,-3.7e-05,1.1e-05,1.7e-05,-3e-06,-2e-06,-9e-06,-1e-06,5e-06,-1e-06,-1e-06,0,2e-06,-2e-06,1.8e-05,-6e-06,1.4e-05,3e-06,-9e-06,-6e-06,-7e-06,-2e-06,-1e-06,0,0,9e-06,-2e-06,-1e-06,4e-06,0,0,0,-1e-06,1e-06,0,4e-06
1e-06,-6e-06,-2e-06,-2e-06,0,1e-06,0,0,0,1e-06,0,2e-06,0,0,0,2e-06,-3e-06,1e-06,-2e-06,0,-1e-06,-1e-06,0,0,0,-2e-06,0,0,-2e-06,0,-1e-06,-1e-06,0,1e-06,-1e-06,2e-06,0,2e-06,-1e-06,0,-3e-06,8e-06,4.2e-05,-1.3e-05,5.3e-05,2.2e-05,2e-06,1.1e-05,2e-06,-5e-06,2e-06,-3e-06,1.3e-05,-1.4e-05,-0.000278,-3.4e-05,-1.5e-05,5e-06,-1e-06,-4e-06,-6.4e-05,-6e-05,0.000243,9e-06,-2.5e-05,1.2e-05,-9e-06,1.5e-05,3.8e-05,-1.4e-05,9e-06,6e-06,7.5e-05,-1.5e-05,-6.5e-05,5e-06,-7e-06,-6e-05,6e-05,-2e-06,2.2e-05,6.5e-05,6e-06,1.1e-05,4e-05,-2.1e-05,7.8e-05,4e-06,-1.1e-05,5e-06,-1.1e-05,-6e-06,4e-06,-4e-06,1e-06,3e-06,2e-06,1e-06,-1.6e-05,3e-05,-6e-06,-1e-06,2e-06,3e-06,-2e-06,9e-06,-2e-06,2e-06,-5e-06,-3e-06,2e-06,-1e-06,5e-06,-4e-06,0,-2e-06,0,1e-06,0,-1e-06,-1e-06
2e-06,0,1e-06,-3e-06,-1e-06,-2e-06,0,0,2e-06,-2e-06,0,-2e-06,0,0,0,1e-06,-3e-06,0,-1e-06,1e-06,1e-06,0,0,0,0,0,0,0,2e-06,0,0,-2e-06,0,-1e-06,0,1e-06,0,0,-2e-06,0,-1e-06,8e-06,-2.1e-05,3e-06,-4.7e-05,-2.2e-05,-1e-05,1.4e-05,-1e-06,-2.2e-05,-1.2e-05,4e-06,1.1e-05,3e-06,-7.2e-05,-8e-06,-6.9e-05,3.5e-05,-6.7e-05,5e-06,1.5e-05,2e-05,-0.000204,-4.6e-05,-5e-06,-2.9e-05,-4e-06,8e-06,-2.3e-05,1.8e-05,-3e-06,-2.8e-05,-4.6e-05,-4.8e-05,0.00011,-1.7e-05,9e-06,5.4e-05,-4.7e-05,1e-05,8e-06,6.2e-05,-5.9e-05,-1.6e-05,-5.1e-05,1.4e-05,2.7e-05,-8e-06,6e-06,-1.4e-05,8e-06,3e-06,-9e-06,-1.1e-05,2e-06,0,0,-4e-06,-1.7e-05,2.3e-05,-4e-06,1.1e-05,-8e-06,8e-06,-1.1e-05,-7e-06,-2e-06,-1e-06,3e-06,-2e-06,2e-06,-1e-06,-2e-06,2e-06,0,-2e-06,0,1e-06,0,-1e-06,3e-06
1e-06,7e-06,1e-06,-2e-06,-1e-06,0,0,0,0,-2e-06,0,1e-06,0,0,0,-2e-06,-2e-06,0,0,2e-06,0,0,0,0,0,-1e-06,1e-06,0,-2e-06,0,1e-06,-2e-06,0,1e-06,-2e-06,1e-06,0,-1e-06,-3e-06,0,2e-06,-1.3e-05,-1.7e-05,8e-06,3.9e-05,6e-06,2e-06,-1.3e-05,0,-1.2e-05,3e-06,-1e-06,1.9e-05,7e-06,0.000195,-1.5e-05,-5.7e-05,5e-05,-0.000107,-4e-06,1.1e-05,1e-06,0.000237,-4e-06,1.8e-05,-1e-05,5.6e-05,-6.2e-05,5.7e-05,-1.9e-05,1.3e-05,-3.9e-05,-7.3e-05,2.1e-05,-0.000119,-2.2e-05,1.7e-05,-8.8e-05,4.5e-05,-8e-06,-1.1e-05,-7.5e-05,2.3e-05,2.9e-05,3.9e-05,-2.1e-05,-5.9e-05,-1.3e-05,-6e-06,-9e-06,2e-06,0,4e-06,-1.1e-05,-2e-06,1e-06,0,3e-06,-1e-06,-1.6e-05,-5e-06,-7e-06,3e-06,-5e-06,7e-06,8e-06,-1e-06,-2e-06,-4e-06,-1e-06,-6e-06,1e-06,3e-06,-1e-06,0,-3e-06,0,-1e-06,1e-06,-1e-06,-1e-06
-4e-06,3e-06,-1e-06,-2e-06,0,1e-06,0,0,-2e-06,-4e-06,0,-1e-06,0,0,0,-1e-06,-2e-06,0,-3e-06,2e-06,1e-06,-1e-06,-1e-06,0,0,0,1e-06,1e-06,1e-06,0,0,1e-06,0,0,0,-2e-06,0,-1e-06,-3e-06,0,3e-06,3e-06,3.2e-05,-1.4e-05,-2.8e-05,6e-06,1e-05,-7e-06,0,-6e-06,-4e-06,0,1.1e-05,-1.6e-05,-2.7e-05,-2.9e-05,-8.9e-05,-1.4e-05,-4.9e-05,6e-06,-3.7e-05,-6.7e-05,-0.000237,3.1e-05,-1.5e-05,1.2e-05,-7.1e-05,1.2e-05,-3.1e-05,1.2e-05,-1.6e-05,-3.1e-05,7.3e-05,4.1e-05,7e-06,5e-06,-2e-06,-3e-06,-4.2e-05,9e-06,-1e-05,1.7e-05,3.3e-05,-2.7e-05,-3.3e-05,8e-06,-5.7e-05,-4e-06,-1e-06,4e-06,-4e-06,0,-1e-06,6e-06,-1e-06,-2e-06,2e-06,1e-06,1.2e-05,-3.5e-05,-3e-06,1e-06,1e-06,-1e-06,1.5e-05,-5e-06,-2e-06,0,0,-4e-06,-1e-06,2e-06,-2e-06,0,-1e-06,-3e-06,0,-1e-06,-2e-06,0,-2e-06
-2e-06,-4e-06,0,0,-1e-06,-1e-06,0,0,-1e-06,-3e-06,0,-1e-06,0,0,0,-2e-06,-1e-06,0,-2e-06,1e-06,0,0,0,-1e-06,0,-1e-06,0,0,-1e-06,0,0,2e-06,0,0,-1e-06,-2e-06,0,-1e-06,-4e-06,0,1e-06,5e-06,-1.7e-05,1.2e-05,2.5e-05,-7e-06,-1e-05,2.3e-05,-1e-06,-1.9e-05,1.1e-05,-2e-06,5e-06,2.2e-05,-5.2e-05,-1e-05,-2.2e-05,7e-06,-6e-05,1e-06,2.6e-05,3.5e-05,0.000199,1.5e-05,1.6e-05,-1.1e-05,4.9e-05,9e-06,1.7e-05,-4e-06,-4e-06,2.4e-05,3.5e-05,-1e-05,0.000135,-8e-06,-7e-06,4.9e-05,1.2e-05,1.2e-05,-1.5e-05,6.2e-05,-7e-06,3.6e-05,6e-06,-1.9e-05,7.3e-05,-8e-06,4e-06,-7e-06,3e-06,-2e-06,-4e-06,1.4e-05,2e-06,1e-06,-1e-06,-3e-06,1.5e-05,-1.8e-05,-4e-06,5e-06,-3e-06,-4e-06,-8e-06,4e-06,-1e-06,0,-2e-06,0,-6e-06,1e-06,-2e-06,1e-06,0,-2e-06,-1e-06,1e-06,1e-06,1e-06,1e-06
1e-06,-7e-06,1e-06,1e-06,-1e-06,-1e-06,0,0,2e-06,-1e-06,0,1e-06,0,0,0,2e-06,-1e-06,1e-06,-1e-06,0,-2e-06,-1e-06,0,0,0,-1e-06,0,0,1e-06,0,0,2e-06,0,0,-1e-06,0,0,0,-4e-06,0,0,1e-06,-1.4e-05,-1.4e-05,-3e-05,-1.4e-05,-3e-06,-2.3e-05,1e-06,-9e-06,-2e-06,2e-06,-1e-06,-2.7e-05,0.00012,2.7e-05,-4.6e-05,-1.4e-05,-3.1e-05,0,-1.8e-05,-2.8e-05,-0.000235,-1.6e-05,5e-06,-4.1e-05,-1.9e-05,3e-05,3.2e-05,-4e-06,7e-06,-7e-06,-4.5e-05,-4.9e-05,-7.6e-05,-6e-06,-1e-06,4.2e-05,3e-06,1.1e-05,-3e-06,-9.1e-05,-4.6e-05,-4.1e-05,2e-05,1.7e-05,2.4e-05,-5e-06,-6e-06,6e-06,0,1e-06,-1e-06,5e-06,-1e-06,-2e-06,0,2e-06,4e-06,1e-06,-4e-06,-6e-06,4e-06,4e-06,2e-06,-4e-06,-1e-06,-1e-06,3e-06,0,1e-06,0,1e-06,-3e-06,0,-1e-06,1e-06,1e-06,-2e-06,0,0
1e-06,2e-06,0,2e-06,-1e-06,2e-06,0,0,0,1e-06,0,-2e-06,0,0,0,-1e-06,-2e-06,0,-1e-06,-1e-06,3e-06,0,0,0,0,0,0,-1e-06,-2e-06,0,0,-1e-06,0,0,0,0,-1e-06,1e-06,-4e-06,0,-1e-06,1.6e-05,2.1e-05,1.3e-05,3.2e-05,1.2e-05,6e-06,5e-06,-2e-06,-7e-06,-2e-06,-2e-06,-2e-06,3.2e-05,-3.9e-05,3.2e-05,-5.8e-05,-3.8e-05,-3.2e-05,1.1e-05,3.1e-05,1.9e-05,0.000259,-1.1e-05,-5.7e-05,-2.4e-05,-3.4e-05,-2e-05,-1e-05,1.6e-05,-1e-06,3.6e-05,-8e-06,8e-06,-9e-06,2.2e-05,-4e-06,-7.1e-05,-1.6e-05,-1e-06,1.1e-05,1.6e-05,8e-06,4.3e-05,-4e-05,-1.5e-05,-9e-06,2e-06,6e-06,1.1e-05,-1e-06,3e-06,6e-06,-5e-06,-1e-06,0,0,1e-06,-6e-06,1.6e-05,-5e-06,8e-06,-3e-06,2e-06,3e-06,1e-06,-2e-06,0,-2e-06,-3e-06,-1e-06,-1e-06,-1e-06,3e-06,-1e-06,0,0,0,2e-06,-1e-06,1e-06
