5.5e-05,1.5e-05,4e-05,1.3e-05,8e-06,1.2e-05,5.2e-05,1.5e-05,5.9e-05,1.9e-05,8.3e-05,1.6e-05,6.9e-05,1.3e-05,9.1e-05,2.8e-05,0.000106,7.1e-05,0.000121,4e-05,0.000131,8.9e-05,3.9e-05,6.1e-05,0.000156,2e-05,0.000107,0.000231,2.8e-05,9e-05,9.7e-05,0.00022,5.2e-05,9e-06,3.2e-05,9e-06,5.1e-05,6.7e-05,1e-06,3e-05,0.00011,8.4e-05,0.000142,0.000154,0.000163,5.1e-05,2e-06,2e-04,1.5e-05,0.00019,9e-05,4.2e-05,1.3e-05,1.6e-05,0.000102,7.2e-05,7.5e-05,1.7e-05,0.000117,0.000207,1.2e-05,3.4e-05,0.000124,0.000105,9e-05,2e-06,0.000216,0.000253,0.000136,0.000157,0.000186,0.000134,0.000173,0.000234,0.000196,6e-05,5.9e-05,0.000186,5.2e-05,7e-06,2.9e-05,0.00026,6.2e-05,0.000158,0.000118,0.000135,0.00018,1.6e-05,2.7e-05,5e-06,7e-05,0.000132,3.8e-05,7.2e-05,0.000169,4.4e-05,0.000142,5e-05,1.4e-05,2e-06,2e-05,3.1e-05,1.8e-05,6.2e-05,0.000176,2.1e-05,2.7e-05,5.4e-05,0.000126,2.8e-05,3.7e-05,6.4e-05,7.4e-05,9.9e-05,0.000159,5.7e-05,0.000129,0.000164,0.00028,0.000104,4.3e-05
7.1e-05,4e-06,6.3e-05,1.6e-05,4e-05,6.9e-05,0.000162,6.3e-05,7.7e-05,6.9e-05,0.000133,4.4e-05,0.000154,2e-05,0.000209,0.000108,0.000173,0.000171,0.000296,0.000117,0.000269,0.00019,9.1e-05,0.000135,0.000354,0.000119,0.000173,0.000549,3e-05,0.000236,0.000234,0.000387,0.000201,4e-05,0.000159,9.4e-05,0.000142,0.000189,5.9e-05,0.00013,0.000236,0.000155,0.000367,0.000262,0.000371,0.000197,9.3e-05,0.000439,0.000114,4e-04,0.000179,6.2e-05,9.8e-05,0.000106,0.000327,0.000461,0.000169,0.000162,0.000206,0.000602,0.000133,0.000162,0.000349,0.000269,0.000326,0.000182,0.000413,0.000397,0.000337,0.000328,0.000459,0.000189,0.000471,0.000478,0.000329,0.000304,9.6e-05,0.000437,4.2e-05,9.9e-05,0.000297,0.000547,0.000187,0.000254,0.000201,0.000114,0.000298,0.000298,1.9e-05,2.4e-05,0.000122,0.000248,2.1e-05,0.000163,0.000418,0.000174,0.000229,6.9e-05,1e-04,0.000105,7.9e-05,6.2e-05,3.3e-05,0.000207,0.000372,8.5e-05,0.000116,7.2e-05,0.000199,4.9e-05,7.6e-05,0.000107,0.000231,0.000186,0.00042,0.000199,0.000154,0.000407,0.000502,0.000248,4.6e-05
6.9e-05,1.1e-05,9.7e-05,0.000109,8.7e-05,0.000156,0.000163,6.5e-05,5.6e-05,0.000235,0.000115,0.000133,0.000234,6.5e-05,0.000267,0.000101,0.000128,0.000184,0.000357,0.000167,0.000392,0.000195,0.000279,4.3e-05,0.000284,5.1e-05,0.000303,0.00051,0.000201,0.000288,0.000251,0.000508,0.000401,0.000335,0.000123,0.000309,6e-05,0.000206,1e-04,0.000176,0.000344,0.000175,0.000613,0.000532,0.000608,0.000141,0.000178,0.000686,3e-04,0.00039,0.000198,0.000408,0.000214,0.000225,0.000211,0.000148,8.8e-05,0.000264,8.7e-05,0.000691,0.00027,0.000353,0.000611,9.9e-05,0.000416,0.00016,0.000697,0.000493,0.000443,0.000139,0.000151,0.000334,0.000422,0.000229,0.00078,0.000516,0.000191,0.000418,0.000194,0.000384,0.00027,0.000838,0.000478,0.000548,0.000661,0.000165,0.000492,5e-04,0.000435,0.000321,0.000112,0.000238,0.000215,0.000114,0.000512,0.000418,0.000551,0.00019,0.000202,0.000305,0.000133,0.000205,0.000144,0.000612,0.000374,0.000251,0.00029,0.000298,0.000309,0.000206,0.000189,0.000389,0.00036,0.000148,0.000722,0.000494,0.000503,0.000578,0.000812,0.000658,0.000234
0.000242,7.3e-05,0.000147,0.000184,0.000105,0.000325,0.000468,0.000154,0.000101,0.000386,0.000547,0.000221,0.000359,6.8e-05,0.000246,0.000544,0.000402,0.00038,0.000536,0.000458,0.000899,0.000532,0.000347,0.000175,0.000411,0.00026,0.000754,0.000843,0.000293,0.00022,0.00035,0.00083,0.000242,0.000619,0.000861,0.00079,0.000447,0.000424,0.000335,0.000245,0.00031,0.000178,0.000871,0.000621,0.00079,0.000651,0.000626,0.00125,0.000632,0.000417,0.000338,0.000341,0.000149,0.000259,0.000227,0.000267,0.000258,0.000293,0.000374,0.000324,0.000563,0.000609,0.000269,0.000264,0.000624,0.000523,0.000787,0.001456,0.000881,0.00032,0.00038,0.000699,0.000703,0.000664,0.000736,0.000513,0.000113,0.000639,0.00035,0.000668,0.000615,0.000949,0.000438,0.001346,0.000124,0.000574,0.000597,0.000344,0.000454,0.000785,0.000617,0.000498,0.000191,5e-04,0.00046,0.000306,0.000704,0.000329,0.000358,0.000591,0.000912,0.000847,0.000326,0.000851,0.001592,0.000826,9e-04,0.000703,0.001049,3.2e-05,0.000202,0.00091,0.000999,0.000709,0.000994,0.000474,0.000749,0.00016,0.000253,0.000807,0.000974
0.00022,0.000144,0.000148,5.1e-05,0.000276,0.000308,0.000301,0.000322,2.8e-05,0.000313,0.000702,0.000656,0.000515,0.000605,0.000106,0.000643,0.000495,0.000265,0.000682,0.000787,0.000267,0.000509,0.000363,0.00043,0.000599,0.000703,0.001337,0.000315,0.000706,0.000569,0.000775,0.000681,0.000867,0.000595,0.000431,0.001008,0.000818,0.000304,0.00081,0.000526,0.000416,0.000857,0.000926,0.000704,0.000805,0.001233,0.000234,0.000573,0.000353,0.000791,0.000927,0.000916,0.000565,8.9e-05,0.000477,0.000612,0.000545,0.000204,0.000479,0.000425,0.000522,0.001118,0.001408,0.000655,0.000335,0.000406,0.001024,0.002273,0.001173,0.00026,0.000396,0.00146,0.001026,0.000155,0.000159,0.000498,0.000962,0.000964,0.000332,0.000273,0.000488,0.000732,0.000549,0.000715,0.000832,0.000825,0.000572,0.001681,0.001117,0.001332,0.001128,0.000942,0.000237,0.000697,0.000537,0.000274,0.000797,0.000758,0.000986,0.001101,0.00014,0.000498,0.000962,0.000269,0.001298,0.001232,0.000591,0.000286,0.000591,0.001116,0.001137,0.001661,0.000939,0.000532,0.000706,0.000502,0.000555,0.000378,0.000289,0.000568,0.000222
0.000368,0.000146,0.000108,0.000441,0.000391,8.8e-05,0.000285,0.000725,0.000574,0.00026,0.000579,0.000304,0.000554,0.000507,0.000471,0.000512,0.000442,0.000358,0.00026,0.000199,0.000244,0.000225,7.2e-05,0.000574,0.000918,0.0013,2.5e-05,0.000249,0.000811,0.000365,0.000807,0.001081,0.000998,0.000598,0.00065,0.000521,0.000659,0.000777,0.000368,0.000332,0.000445,0.000345,0.000386,0.000437,0.000498,0.000255,0.000903,0.000432,0.000284,0.000497,0.001029,0.000866,0.000602,0.000481,0.000443,0.000283,0.000815,0.000641,0.00044,0.00084,0.00069,0.000225,0.001067,0.000897,0.000376,0.000418,0.000217,0.000863,0.000996,0.000786,0.00078,0.001274,0.001054,0.001156,0.000908,0.000705,0.001547,0.000943,0.001065,0.000688,0.000402,0.001377,0.000165,0.001008,0.000685,0.000725,0.000414,0.001734,0.001573,0.000821,0.000636,0.000414,0.000381,0.000854,0.001565,0.000878,0.000943,0.001049,0.000987,0.001171,0.000685,0.000714,0.00096,0.000617,5.6e-05,0.000816,0.000764,0.000524,0.00028,0.001074,0.001087,0.000565,0.00024,0.000568,0.00026,0.00016,0.000526,0.000235,0.000244,0.000154,0.000885
0.000227,0.000241,0.000147,0.000504,0.000349,9e-05,0.000405,0.000501,0.00029,0.000722,0.000364,0.000341,0.000444,0.000372,0.000305,0.000535,0.000163,0.000229,0.000144,0.000494,0.000201,0.000462,0.000355,0.00059,0.000896,0.000714,0.000498,0.000144,0.000388,0.000199,0.000303,0.000596,0.000603,0.000562,0.000403,0.00024,0.000363,0.000374,0.000244,0.00037,0.000457,0.000287,3e-04,0.000655,0.000229,1e-04,0.000563,0.000462,0.000888,0.00075,0.000305,0.00046,0.000529,0.000294,0.000526,0.000431,0.000721,0.000257,0.000457,7e-04,0.000422,0.000157,0.000969,0.000261,0.000545,0.00027,0.000631,0.000883,0.000961,0.000442,0.00076,0.000536,0.000781,0.001405,0.000309,0.000875,0.001956,0.000559,0.000483,0.000175,0.000285,0.001287,0.000902,0.001173,0.000873,0.001308,0.000806,0.001334,0.000783,0.000482,0.000948,0.000952,0.000332,0.000716,0.000872,0.00055,0.001473,0.00073,0.000427,0.000619,0.001194,0.000245,0.001708,0.000405,0.000813,0.001825,0.000584,0.000211,0.001,0.000949,0.000983,0.00081,0.000849,0.000679,0.000584,0.000657,0.000489,0.00122,0.000263,0.000802,0.00132
0.000431,0.000789,0.000444,0.00055,0.000473,0.000321,0.000605,0.000528,0.00082,0.000545,0.000475,0.000607,0.000277,0.000431,0.000805,0.001199,0.000782,0.00039,0.000422,9.7e-05,0.000598,0.000723,0.000714,0.000329,0.001139,0.001837,0.000369,0.00057,0.000624,0.000482,0.00114,0.001832,0.001167,0.000374,0.000326,0.000502,0.000267,0.000488,0.00074,0.000567,0.001437,0.000858,0.000138,0.001156,0.000624,0.000588,0.00035,0.000683,0.001817,0.000549,0.000622,0.000215,0.000969,0.001405,0.001196,0.001111,0.000877,0.001289,0.000679,0.000227,0.001767,0.000718,0.00214,0.001643,0.000653,0.000775,0.001316,0.002836,0.003836,0.001486,0.000386,0.001666,0.001614,0.001872,0.00232,0.000591,0.001986,0.003166,0.000975,0.000836,0.001082,0.001895,0.002497,0.000906,0.002015,0.000709,0.000538,0.001066,0.001028,0.000593,0.001018,0.000443,0.000735,0.000936,0.000543,0.001,0.001028,0.002239,0.001527,0.000515,0.000906,0.002069,0.002293,0.002902,0.000888,0.002546,0.00159,0.001099,0.001258,0.001535,0.001755,0.001648,0.00158,0.000726,0.001392,0.001864,0.00062,0.001497,0.002021,0.001768,0.001952
9.5e-05,0.000853,0.00063,0.000691,0.001195,0.001267,0.001308,0.00045,0.000408,0.000961,0.001025,0.001213,0.000793,0.000453,0.001105,0.000411,0.000325,0.000498,0.000787,0.00058,0.000642,0.000195,0.000779,0.001399,0.00089,0.001035,0.002393,0.00174,0.002227,0.002126,0.002953,0.002958,0.003019,0.002628,0.001082,0.000429,0.000852,0.001375,0.001122,0.000855,0.002684,0.002984,0.001801,0.001655,0.001155,0.00053,0.001215,0.000847,0.000917,0.002735,0.00266,0.001826,0.001143,0.001428,0.000706,0.000835,0.001895,0.00204,0.002436,0.001562,0.002457,0.001533,0.003079,0.002855,0.001617,0.002057,0.001257,0.002513,0.00336,0.003198,0.002131,0.001896,0.002822,0.003221,0.001731,0.002803,0.002332,0.001523,0.004237,0.002,0.001555,0.003098,0.004428,0.003357,0.002879,0.002223,0.000231,0.002422,0.002742,0.001319,0.001962,0.000428,0.000413,0.001826,0.000961,0.00111,0.001979,0.002167,0.001772,0.000968,0.000415,0.002569,0.004861,0.003613,0.001283,0.001901,0.003144,0.003214,0.002863,0.00431,0.001658,0.000785,0.001407,0.001168,0.001211,0.002103,0.002331,0.002201,0.001756,0.000769,0.001261
0.000193,0.000809,0.000235,0.000526,0.000801,0.000653,0.000422,0.000541,3.8e-05,0.000655,0.000256,0.000893,0.001026,0.000712,0.001105,0.001347,0.000676,0.000937,0.001413,0.000713,0.000485,0.000481,0.000632,0.000789,0.000876,0.000739,0.001658,0.001066,0.0015,0.001098,0.001291,0.001263,0.001194,0.000439,0.001328,0.000784,0.000739,0.000663,0.000346,0.00043,0.002492,0.00062,0.00052,2.3e-05,0.000634,0.000533,0.001169,0.001368,0.000848,0.002063,0.001472,0.000748,0.000564,0.001816,0.000911,0.000587,0.000971,0.000369,0.001817,0.000526,0.002373,0.002005,0.00246,0.001115,0.000813,0.00164,0.002402,0.001004,0.002125,0.001976,0.0011,0.002646,0.000973,0.002223,0.003059,0.002473,0.002101,0.002962,0.002716,0.00133,0.001898,0.00052,0.00262,0.000641,0.001158,0.002147,0.00188,0.002018,0.000601,0.001829,0.000955,0.001699,0.000439,0.001759,0.002117,0.000753,0.001928,0.00083,0.001834,0.000824,0.001207,0.002776,0.001697,0.000914,0.001439,0.000716,0.002781,0.000833,0.001649,0.002374,0.002243,0.000956,0.001042,0.001851,0.00149,0.000337,0.001665,0.001752,0.000339,0.001098,0.001441
0.000355,0.000432,0.000644,0.00083,0.00039,0.000259,0.000591,0.00074,0.000643,0.000479,0.000567,0.000997,0.000526,0.000998,0.000985,6.1e-05,0.000164,0.001443,0.00054,0.000672,0.000693,0.000119,0.000225,0.00071,0.000493,0.000692,0.001535,0.001415,0.000603,0.00105,0.001652,0.002641,0.001536,0.000404,0.001999,0.002266,0.002293,0.001735,0.000966,0.000832,0.001278,0.002054,0.001112,0.000373,0.00069,0.000363,0.000947,0.001398,0.001456,0.002066,0.001032,0.000513,0.001039,0.00123,0.001011,0.00078,0.000644,0.000557,0.001813,0.002339,0.002617,0.000959,0.002756,0.002715,0.002937,0.003453,0.001457,0.000436,0.002158,0.001501,0.002373,0.001147,0.001053,0.001714,0.000643,0.000358,0.00259,0.002725,0.004202,0.003181,0.00286,0.002125,0.001019,0.001691,0.000716,0.001975,0.002443,0.002905,0.0032,0.003148,0.003031,0.003472,0.002197,0.001621,0.003442,0.004043,0.003782,0.001179,0.00171,0.001951,0.002333,0.000586,0.001608,0.001899,0.003376,0.002612,0.003349,0.003426,0.00114,0.002569,0.003115,0.002143,0.000452,0.001113,0.000322,0.000386,0.001649,0.002363,0.001402,0.001957,0.002326
0.000194,8.8e-05,0.000367,0.000867,0.000944,0.000754,0.000653,0.000231,0.000424,0.000547,0.000587,0.000579,0.000606,0.000602,0.000128,0.000146,0.000443,0.001526,0.0011,0.000949,0.000543,0.000691,0.000142,0.000385,0.000903,0.000309,0.000249,0.000769,0.00052,0.000326,0.00084,0.001271,0.001294,0.001321,0.000973,0.000541,0.000721,7e-04,0.000838,0.000217,0.000588,0.001191,0.001049,0.001162,0.000503,0.000453,0.00102,0.00039,0.000685,0.000567,0.000413,0.000699,0.000444,0.001229,0.000462,0.000323,0.000538,0.000614,0.001064,0.001157,0.000334,0.000998,0.000496,0.00115,0.001021,0.000853,0.000956,0.00115,0.000623,0.00054,0.001049,0.000969,0.001598,0.000363,0.000583,0.000103,0.001992,0.000536,0.001277,0.000949,0.00123,0.000516,0.001429,0.000637,0.000749,0.001753,0.000521,0.000842,0.002359,0.000968,0.001249,0.001762,0.001313,0.002033,0.001506,0.002044,0.001136,0.001002,0.001386,0.000644,0.001885,0.001345,0.00133,0.000557,0.001606,0.000329,0.00176,0.001501,0.000582,0.001407,0.001432,0.000812,0.000564,9e-04,0.000424,0.000661,0.000487,0.000645,0.000604,0.001041,0.000972
0.000214,7.3e-05,0.000172,0.000473,0.000491,0.000165,8.2e-05,2.6e-05,0.000341,0.000289,0.000321,0.000176,0.000168,0.000466,0.000347,0.000272,0.000459,0.000508,0.000162,0.000121,0.000151,0.000288,0.000248,0.000304,9.3e-05,0.000595,0.000387,0.000259,0.00018,0.000189,0.000573,0.000381,0.00042,0.000477,0.000346,0.000374,0.000345,0.000253,6.8e-05,0.000131,0.000157,0.000708,0.000372,0.000435,0.000275,0.000249,0.000342,0.000127,0.000402,0.000635,0.000242,0.000506,0.000139,0.000479,2.5e-05,0.000216,0.000433,0.000102,0.000534,0.000469,0.000315,0.000301,0.000469,0.000599,0.000515,0.000532,4e-04,0.000249,0.00099,7.1e-05,0.000897,0.000232,0.000934,0.000166,0.000139,0.000405,0.000799,0.000131,0.000554,0.000295,0.000483,0.000928,0.000422,0.000404,0.000403,0.000772,0.000381,0.000436,0.000908,0.000152,0.00082,0.000536,0.000348,0.000672,0.00075,0.001138,0.000286,0.000531,0.000246,0.000232,0.000941,0.000229,0.000434,0.000609,0.000457,0.000768,0.000683,9.3e-05,0.000469,0.000918,0.000433,0.00012,0.000155,0.000456,0.000349,0.000115,0.000372,0.000133,0.000406,0.000673,0.00034
0.000172,6.1e-05,0.000144,0.000371,0.000294,0.000103,9.6e-05,8.6e-05,0.00032,0.00018,0.000425,0.000101,4e-05,0.000188,0.000272,0.000114,0.000188,0.00044,0.000176,8.7e-05,0.000279,0.00012,4.4e-05,0.000164,0.000192,0.000517,0.000182,6.7e-05,0.000324,0.000241,0.000377,0.000336,0.000296,0.000368,0.000357,0.000306,0.00021,0.000179,0.000288,0.000107,4.9e-05,0.000512,0.000193,0.000396,0.00014,0.00023,0.000262,2e-04,4e-04,0.00032,0.000247,0.000478,9.5e-05,0.000477,0.000152,0.000194,0.000181,5.8e-05,0.000341,0.000118,0.000326,0.000311,0.000367,0.000271,0.00024,0.000385,0.000338,0.000287,0.000678,0.000224,0.000644,0.000304,0.000738,7.5e-05,4.3e-05,0.000407,0.000643,0.000246,0.000248,0.000345,0.000146,0.000686,0.000583,0.000347,0.000525,0.000454,0.000286,0.000144,0.000753,0.000263,0.000413,0.000268,0.000422,0.00066,0.00054,0.00085,0.000107,0.000406,0.000167,0.000274,0.000532,5.5e-05,0.000309,0.000487,0.000466,0.000579,0.000396,9.7e-05,0.000308,0.000618,0.000321,0.000246,0.000313,0.000434,7.5e-05,4.8e-05,0.000174,0.000228,0.000245,0.000541,0.000397
2.5e-05,5.9e-05,0.000163,0.000257,0.000195,9.7e-05,0.000207,0.000141,0.000205,0.000121,0.000514,0.000166,0.000149,9.7e-05,0.00027,0.000194,0.000123,0.000439,0.00031,0.000349,0.000106,0.000122,0.00018,0.000179,0.000188,0.000323,0.000267,0.000122,0.000417,0.000233,0.000352,2e-04,0.000325,0.000409,0.000299,0.000184,0.00024,7.8e-05,0.000309,0.000326,0.000328,0.000621,0.000186,0.000463,0.000216,0.000262,0.000357,0.000289,0.000146,0.000414,0.000422,0.00035,9.4e-05,0.000608,0.00021,0.000337,0.000284,0.000109,0.000395,4.7e-05,0.000281,0.000154,0.000383,0.000105,0.000295,0.000247,3e-04,0.000613,0.00051,0.000427,0.000403,0.00066,0.000798,0.00015,0.000239,0.000189,0.000992,0.000343,0.000301,0.000527,0.000249,0.000182,0.000105,0.000134,0.000762,0.00017,0.000288,0.000281,0.000751,0.000661,0.000155,0.000274,0.000391,0.000631,0.000309,0.000789,0.000257,0.000424,0.000219,3.2e-05,0.000493,0.000365,0.000355,0.000479,0.000318,0.000512,0.000278,0.000334,0.000318,4e-04,0.00029,0.000121,0.000121,0.000526,0.000258,0.000244,0.000207,0.000477,0.000149,0.000524,0.000342
0.000173,0.000169,0.00022,0.000141,0.000166,0.000302,0.000224,0.000407,0.00031,0.000323,0.000412,0.000213,0.000334,0.000381,0.000103,0.000227,0.000176,0.00015,0.000263,0.000447,0.000201,0.000191,0.000224,0.000315,0.000342,0.000656,0.000168,0.000388,0.00054,0.000171,0.000183,0.000215,0.000454,0.000284,0.000184,0.000216,0.000121,0.000377,7.4e-05,0.000183,0.00079,0.000482,8.7e-05,0.000312,0.000405,0.000794,0.000294,0.000354,0.000353,0.000345,0.000646,0.000416,3.3e-05,0.000842,0.000272,0.000315,0.000351,0.000167,0.000466,0.000175,0.000427,0.000272,0.000299,0.000102,0.000272,0.000249,0.00034,0.000404,0.000704,0.000359,0.00092,0.000867,0.000526,0.000139,0.000405,0.000151,0.000775,0.000488,0.000643,0.000776,0.000249,0.000402,0.000207,3e-04,0.000929,0.000838,0.000783,0.000543,0.000771,0.000965,0.001182,0.000452,0.000639,0.000974,0.000985,0.000855,0.000368,0.000781,0.000185,0.00018,0.000847,0.000465,0.000457,0.000352,0.000732,0.001079,0.000301,0.000324,0.000399,0.000226,0.000515,0.000298,0.000605,0.000503,0.000521,0.000515,0.000345,0.00026,0.000188,0.000773,0.000304
0.000185,0.000128,0.000256,0.000875,0.000559,0.000282,0.000226,0.000345,5.3e-05,0.000374,0.001074,0.00087,0.000267,0.000793,0.000238,0.000458,0.000415,0.000452,0.000687,0.000935,0.000497,4.5e-05,0.000583,0.000483,2.4e-05,0.000819,0.000762,0.000365,0.000704,0.000699,0.000156,0.000306,0.000369,0.000743,0.000818,0.000881,0.000438,0.000406,0.000123,0.000661,0.00055,0.001505,0.000965,0.000866,0.000999,0.000525,0.000287,0.000401,0.000259,0.000154,0.000692,0.001422,0.000954,0.001055,0.001765,0.000549,0.001051,0.000507,0.000745,0.001255,0.001038,0.000422,0.000601,0.000732,0.001156,0.001035,0.00052,0.000371,0.00102,0.000299,0.000735,0.001204,0.001853,0.001177,0.000884,0.000587,0.00058,0.002039,0.001827,0.000755,0.000949,0.000969,0.001655,0.000499,0.001131,0.00079,0.001137,0.00125,0.000525,0.002539,0.001635,0.001082,0.000513,0.000356,0.000376,0.000646,0.00077,0.000858,0.000893,0.000455,0.001131,0.000231,0.000403,9e-05,0.000831,0.001527,0.001329,0.00071,0.00057,0.000208,0.000294,0.001375,0.001378,0.001346,0.001242,0.000772,0.001281,0.000636,0.000732,0.001814,0.000357
0.000659,0.00034,0.000252,0.000844,0.000279,0.000331,0.000389,0.000194,0.000188,0.000148,0.001081,0.002076,0.001309,0.001339,0.000765,0.000467,0.000569,0.000382,0.001386,0.001483,0.001494,0.001095,0.000925,0.00029,0.000179,0.000567,0.000868,0.000814,0.001431,0.00193,0.001885,0.000827,0.000641,0.000989,0.001548,0.000328,0.000845,0.001086,0.000762,0.001094,0.001052,0.001228,0.001548,0.001565,0.001448,0.001671,0.001339,0.000974,0.000438,0.000654,0.000833,0.001798,0.001104,0.001766,0.002965,0.002432,0.001793,0.000842,0.000379,0.001022,0.002348,0.001746,0.001059,0.001402,0.000726,0.000793,0.001567,0.001575,0.002184,0.001498,0.000336,0.000637,0.000963,0.000474,0.001538,0.001742,0.001083,0.002267,0.002696,0.002585,0.001523,0.001276,0.001882,0.001278,0.001088,0.001695,0.000182,0.002998,0.00241,0.003051,0.001729,0.001053,0.001041,0.000936,0.000936,0.001359,0.00084,0.002262,0.002775,0.001267,0.000682,0.001897,0.001301,0.000743,0.000418,0.002786,0.002419,0.001129,0.000924,0.000722,0.000302,0.001312,0.00196,0.000689,0.000564,0.001077,0.001889,0.002321,0.001985,0.001347,0.001507
0.000428,0.000411,0.00027,0.00065,0.000573,0.00042,0.000416,0.000235,0.000121,0.000213,0.00097,0.001106,0.000761,0.000315,0.000507,0.00041,7.6e-05,0.000455,0.001316,0.000389,0.000699,0.000696,0.001076,0.000803,0.000411,0.000378,0.000379,0.000192,0.001068,0.001211,0.000989,0.00059,0.000412,0.000208,0.000636,0.000607,0.00083,0.000343,0.000601,0.000868,0.000544,0.000425,0.000682,0.001092,0.000328,0.001108,0.000616,0.000154,0.000366,0.000953,0.001468,0.000787,0.000764,0.001428,0.001381,0.001145,0.000877,0.000746,0.000801,0.00126,0.001807,0.000852,0.000507,0.000341,0.000459,0.000623,0.000465,0.000935,0.001888,0.00178,0.001355,0.000824,0.000411,0.000586,0.001903,0.001088,0.000437,0.001781,0.00084,0.000967,0.000824,0.000809,0.00107,0.001064,0.002032,0.001886,0.001597,0.002404,0.001995,0.00055,0.000942,0.001076,0.001232,0.002081,0.001145,0.000424,0.000386,0.002252,0.002347,0.001386,0.000635,0.001052,0.001422,0.001193,0.000861,0.001755,0.001241,0.001162,0.001151,0.000499,0.000803,0.001507,0.000558,0.001118,0.00084,0.001005,0.001162,0.00155,0.001157,0.001806,0.001377
9.8e-05,8.4e-05,0.000124,0.00029,0.000305,0.000364,0.000128,0.000197,0.00025,0.000355,0.000274,0.000408,6.3e-05,0.000321,0.000218,0.000239,0.000336,0.000296,0.000451,0.000665,0.000238,0.000603,0.00112,0.00075,0.000275,9.8e-05,0.000348,0.000531,0.000204,0.000315,0.000439,0.000432,7e-05,0.000481,0.000377,0.00012,0.000554,0.000628,0.000272,0.000415,0.000618,0.000508,0.000178,0.000453,0.000477,0.000454,0.000273,0.000116,0.000362,0.000824,0.000353,2.1e-05,0.000581,0.000327,0.000693,0.00057,7.4e-05,0.000471,0.000336,0.000576,0.000732,0.00064,0.000268,0.000296,0.000541,0.00046,0.000131,0.000526,0.000723,0.000209,0.000568,0.000463,0.000448,0.000293,0.000923,0.000326,0.000353,0.00107,0.000511,0.000652,0.000905,0.000673,0.000472,9.2e-05,0.001099,0.000351,0.000133,0.001509,0.000348,0.000924,0.00011,0.000696,0.000621,0.000873,0.000613,0.00015,0.000547,0.001205,0.000126,0.000154,0.000562,0.000798,0.000504,0.000475,0.000412,0.001194,9.5e-05,0.00056,0.000462,0.000678,0.000556,0.000206,0.00057,0.000288,0.000491,0.000301,0.000467,0.00087,0.000117,0.000754,0.000224
0.000121,6.4e-05,7.7e-05,0.000223,0.00013,0.000231,0.000356,0.000291,0.000199,9.6e-05,0.000171,0.000255,0.000287,0.000312,0.000112,0.000242,0.000431,0.000243,0.000205,0.000607,0.000298,0.000288,0.000748,0.000402,0.000292,0.000121,0.000205,0.000298,0.00022,6.2e-05,0.000273,0.000149,0.000165,0.000448,0.000297,0.000336,3.8e-05,0.000383,0.000347,0.000356,8.3e-05,0.000377,0.000332,0.000277,0.000189,0.000256,7.8e-05,0.000133,0.000225,0.000315,0.000316,0.000271,0.000638,0.000478,0.000327,0.000392,0.000152,0.000353,0.000195,0.000589,0.000248,0.000473,0.000475,0.000165,0.000511,0.000567,0.000646,0.000355,0.000198,0.000301,0.000141,0.000413,0.000137,0.000497,0.000717,9.2e-05,0.000214,0.000901,0.000511,0.000477,0.000205,0.000471,0.00029,0.000352,0.000261,8.7e-05,0.000257,0.000742,0.000388,0.000475,0.000325,0.000276,0.000629,0.000743,0.000562,0.000367,0.000443,0.000841,0.000407,0.000158,0.000155,0.000226,0.000445,0.000265,0.000128,0.000506,2e-04,0.000234,0.00022,0.000178,0.000246,0.000312,0.000394,0.000369,0.000318,0.000679,0.000439,0.00033,0.000142,0.000346,0.000137
0.000183,7.9e-05,0.000125,0.000123,4.3e-05,2.8e-05,0.000161,4.4e-05,0.000172,0.000181,0.000146,0.000118,0.000229,0.000204,0.000165,0.000143,0.000154,9.1e-05,0.000339,0.000242,8e-05,0.000215,0.000388,0.000117,0.000122,0.000178,0.00036,0.000244,0.000203,9.5e-05,0.000357,0.000297,7.4e-05,0.000313,0.000142,1.7e-05,0.000128,0.000243,0.000222,6.5e-05,0.000264,0.000277,0.000272,0.000137,0.000115,6.2e-05,0.000166,8.9e-05,0.000368,0.000246,0.000151,0.000232,0.000147,0.00017,0.000327,0.000173,0.000111,7.4e-05,0.000161,0.000221,0.000337,0.000189,0.000146,0.00017,0.000408,0.000374,0.00029,0.000442,0.000374,0.000135,0.000262,0.000544,0.000494,0.000398,0.000302,1e-04,0.00011,0.000297,0.000371,0.000386,0.000325,0.000236,0.000437,0.000425,0.000585,0.00029,0.000239,0.000377,0.000147,0.000209,0.000311,5.4e-05,0.000191,0.000129,0.000524,0.00025,7.2e-05,0.000274,0.000319,0.000198,0.000153,0.000379,0.000326,0.000197,0.000306,0.000318,0.00017,0.000139,0.000326,0.000239,0.00023,0.000294,0.000226,0.000139,0.000148,0.000471,0.000389,0.00018,0.000253,0.000272,0.000102
5.9e-05,4e-05,5.5e-05,8.3e-05,4.3e-05,3.6e-05,5.2e-05,1.1e-05,3e-05,6.9e-05,6.2e-05,6.3e-05,0.000145,0.000126,1.5e-05,3.2e-05,5.8e-05,7e-05,0.000127,0.000145,6.6e-05,6e-06,0.000205,5.5e-05,7.8e-05,9.1e-05,7.3e-05,4.2e-05,7.5e-05,3.3e-05,9.7e-05,7.3e-05,1.5e-05,5.6e-05,0.000116,5.7e-05,2.2e-05,0.000117,4.6e-05,3.2e-05,0.000104,0.000117,0.00011,6.4e-05,6.5e-05,5e-05,6.8e-05,4.6e-05,0.000197,6.9e-05,0.000112,9.5e-05,8.4e-05,0.000136,4.5e-05,7.2e-05,4.5e-05,2.5e-05,6.2e-05,0.000179,5.5e-05,5.3e-05,4.5e-05,8.9e-05,0.000131,0.00014,6.5e-05,0.000178,8.4e-05,5.5e-05,8.8e-05,0.000189,0.000139,0.000214,0.000148,6.8e-05,1e-04,0.000143,3.7e-05,0.000156,0.000101,0.000167,4.6e-05,9.2e-05,0.000279,0.000129,0.000124,0.000176,6.2e-05,0.00018,8.6e-05,0.000125,1.3e-05,9.2e-05,0.000128,6.5e-05,0.00011,9.6e-05,6.9e-05,5.9e-05,9.8e-05,0.000128,7.7e-05,7.9e-05,0.000148,9.2e-05,1e-04,8.7e-05,0.000101,8.9e-05,1.9e-05,4.5e-05,5.7e-05,0.00011,2.8e-05,0.000191,0.000191,0.000162,0.000168,8.5e-05,3.1e-05
4e-05,1.9e-05,5.3e-05,6.1e-05,7.2e-05,2e-05,5.7e-05,2.5e-05,2e-05,6.3e-05,8.2e-05,7e-05,3.7e-05,5.1e-05,2.6e-05,4.7e-05,5.7e-05,5.9e-05,2.8e-05,1.4e-05,8e-05,2.5e-05,2e-04,0.000131,2.4e-05,4.8e-05,1.5e-05,5.5e-05,5.3e-05,6e-05,1.4e-05,5.7e-05,3.7e-05,9.5e-05,5.9e-05,3.2e-05,3.9e-05,8e-05,7.9e-05,1.4e-05,7e-05,6.8e-05,4e-05,9.2e-05,5.7e-05,5.2e-05,8.3e-05,8.8e-05,3.9e-05,8e-05,0.000141,0.000106,3.1e-05,0.00012,4.8e-05,4e-05,4.6e-05,2.2e-05,0.000112,0.000127,7.1e-05,2.1e-05,7.3e-05,8.4e-05,5e-05,4.3e-05,0.000171,0.00016,0.000114,4.8e-05,1.4e-05,0.00018,0.000116,0.000106,9.1e-05,0.000141,4.3e-05,9.4e-05,4.4e-05,0.000151,4.4e-05,0.000184,5.7e-05,4.2e-05,0.000252,9.7e-05,3.8e-05,0.000151,6.2e-05,0.000223,6.4e-05,2.3e-05,4.8e-05,6.9e-05,8.3e-05,6.8e-05,8.5e-05,0.000156,0.000118,0.000123,3.9e-05,0.000191,7.3e-05,8.7e-05,5.7e-05,0.000197,2.6e-05,8.9e-05,0.00019,7.5e-05,0.000146,0.000135,6.4e-05,2.8e-05,0.000126,0.000223,8.8e-05,0.000136,2e-05,8.8e-05,7.5e-05
3.7e-05,8e-06,2.6e-05,5.8e-05,5.5e-05,2e-05,2.1e-05,3e-05,1e-05,4.2e-05,4.7e-05,5.1e-05,5.3e-05,6.6e-05,2.6e-05,2.9e-05,2.6e-05,1.9e-05,5.9e-05,5.5e-05,2e-05,4.8e-05,0.000122,7.9e-05,9.6e-05,8.5e-05,6.5e-05,3.6e-05,9.9e-05,2.7e-05,8.6e-05,9.7e-05,1.8e-05,7.9e-05,8.8e-05,5.2e-05,5.3e-05,7.6e-05,5.2e-05,4.7e-05,4.1e-05,2.4e-05,6.8e-05,8e-05,6.3e-05,5.5e-05,6e-05,4.5e-05,7.1e-05,5.2e-05,5.8e-05,5.1e-05,6.7e-05,5.8e-05,0.00016,4.7e-05,6.1e-05,3.9e-05,9.9e-05,0.000211,5.9e-05,3.8e-05,7.9e-05,0.000132,0.000111,1.9e-05,8.4e-05,0.000137,0.000115,0.000125,8.6e-05,9.7e-05,8e-05,0.000184,1.6e-05,6e-05,0.000133,0.000149,6.4e-05,0.000105,0.000133,5.2e-05,0.000147,8.4e-05,0.000175,2.2e-05,2.3e-05,0.000178,5.8e-05,8e-05,0.000101,0.000136,0.000121,2.5e-05,0.000194,0.000101,5.6e-05,0.000103,0.000133,0.000115,3.2e-05,0.000124,2.9e-05,2.4e-05,8.6e-05,0.00019,7.8e-05,0.000129,5.4e-05,5e-05,8.7e-05,2.7e-05,2.4e-05,7.3e-05,0.000117,0.00011,0.000144,0.000134,3.9e-05,7e-05,4e-06
3.3e-05,9e-06,3.6e-05,4.4e-05,4.7e-05,3e-06,1.5e-05,2.8e-05,2e-05,3.9e-05,3.9e-05,4.4e-05,3.7e-05,7.3e-05,3.6e-05,5.8e-05,1.7e-05,2.6e-05,5.4e-05,6.3e-05,3.4e-05,3.7e-05,0.000107,2.7e-05,5.3e-05,2.3e-05,5.5e-05,1.8e-05,5.2e-05,1.4e-05,6.1e-05,4.3e-05,3.6e-05,5.9e-05,7.1e-05,7e-06,2.3e-05,6.3e-05,3.8e-05,2.5e-05,4.3e-05,6.9e-05,3.2e-05,3.7e-05,5.2e-05,1.8e-05,4.5e-05,2.3e-05,7.7e-05,2.8e-05,7.8e-05,4.7e-05,4.2e-05,4.2e-05,0.000114,6.2e-05,3.7e-05,1.9e-05,4.4e-05,0.000144,0.000102,3.9e-05,8.8e-05,1e-04,6.2e-05,7.2e-05,0.00014,4.5e-05,9.8e-05,7.2e-05,5.6e-05,4.6e-05,1.5e-05,0.000122,0.000103,4e-06,5.8e-05,5e-05,3.6e-05,3.4e-05,4.8e-05,8.7e-05,4.6e-05,2.2e-05,0.000141,2.2e-05,2.4e-05,0.000109,9.8e-05,0.000168,0.000149,4e-05,6.1e-05,4.4e-05,0.000111,2.5e-05,4.7e-05,0.000146,5.7e-05,0.000141,9.4e-05,0.000111,9.6e-05,9.1e-05,8.6e-05,0.000137,4.3e-05,4.4e-05,8.1e-05,4.8e-05,5.6e-05,5.1e-05,7e-06,4.7e-05,3.4e-05,0.000107,9e-05,0.000158,1.2e-05,2.9e-05,6e-05
2.3e-05,1.6e-05,3e-05,5.5e-05,2.5e-05,4e-06,2.5e-05,2.1e-05,3e-06,3.6e-05,3.8e-05,2.5e-05,4.6e-05,8.2e-05,2.9e-05,2.8e-05,1.7e-05,7e-06,3.8e-05,4.7e-05,1.8e-05,5.4e-05,5.1e-05,2.4e-05,2.7e-05,3.6e-05,3.6e-05,1e-05,4.1e-05,3.6e-05,5.9e-05,2.9e-05,1.3e-05,6.7e-05,3.3e-05,1.2e-05,4.7e-05,4.3e-05,2.2e-05,3.2e-05,2.8e-05,5.2e-05,4e-05,2e-05,2.7e-05,2e-05,6.9e-05,5.3e-05,4.1e-05,2.9e-05,6.7e-05,2.2e-05,4.6e-05,4.1e-05,7e-05,4.7e-05,3e-05,2.9e-05,4.4e-05,0.000163,5.2e-05,1.5e-05,6.5e-05,8e-05,8e-05,6.8e-05,0.000109,8.1e-05,5e-05,7.8e-05,1.3e-05,3.4e-05,3.1e-05,8.5e-05,4.6e-05,4e-05,4.1e-05,0.000103,3.2e-05,5e-06,2.4e-05,0.000145,2.9e-05,1.1e-05,0.000116,1.6e-05,2.9e-05,6.8e-05,6.5e-05,8.7e-05,0.000118,6.8e-05,3.7e-05,5.1e-05,0.000122,5.2e-05,3.1e-05,9.7e-05,3.4e-05,9e-05,5.1e-05,0.000103,0.000132,6.8e-05,7.4e-05,0.000128,2.6e-05,4.6e-05,8.7e-05,1.7e-05,2e-05,3.6e-05,2.8e-05,1.2e-05,3.3e-05,0.000129,5.8e-05,0.000112,3.4e-05,3e-06,3e-05
3.8e-05,9e-06,1.2e-05,5.2e-05,4.1e-05,1.9e-05,1.4e-05,1.4e-05,1.1e-05,4.3e-05,2.8e-05,9e-06,1.8e-05,3.1e-05,2.5e-05,1.8e-05,1.4e-05,3e-06,3.6e-05,3.9e-05,7e-06,4.1e-05,4.6e-05,1.5e-05,1.1e-05,2.9e-05,3.3e-05,1.4e-05,2.2e-05,4.6e-05,4.9e-05,1.1e-05,6e-06,5.1e-05,6.5e-05,3.2e-05,2.8e-05,1.8e-05,2.4e-05,2.4e-05,4e-06,4.3e-05,2.6e-05,2.8e-05,3.4e-05,1.8e-05,5.6e-05,3.8e-05,5.5e-05,3.3e-05,4.5e-05,3e-05,4.6e-05,1.3e-05,9.2e-05,3.9e-05,4.1e-05,2e-05,3.3e-05,0.00014,7.7e-05,2.4e-05,6.8e-05,8.7e-05,6.3e-05,9.4e-05,0.000131,8.2e-05,5.3e-05,5.3e-05,4.1e-05,4.7e-05,3.7e-05,8.5e-05,4e-05,5.1e-05,2.7e-05,9.7e-05,6e-05,4e-05,2.6e-05,0.000102,5.2e-05,2.6e-05,0.000119,1.2e-05,2.3e-05,6.6e-05,4.3e-05,8.1e-05,9.5e-05,5.6e-05,1.8e-05,8e-05,0.000103,5.4e-05,3.8e-05,9.5e-05,4.8e-05,4.1e-05,9e-05,8e-05,8.1e-05,3.5e-05,6.7e-05,0.000101,1.9e-05,6.3e-05,8.8e-05,1.1e-05,5.3e-05,3.3e-05,2.7e-05,2.5e-05,3.3e-05,9.2e-05,5.2e-05,0.000117,2.3e-05,2.7e-05,6e-06
2.7e-05,3e-06,1.7e-05,5.3e-05,4.6e-05,1.2e-05,2.6e-05,1.3e-05,3e-06,2.8e-05,2.6e-05,1.6e-05,2.2e-05,4.8e-05,1.1e-05,2.3e-05,1.9e-05,1.2e-05,3.8e-05,2.7e-05,2.8e-05,2.2e-05,4.7e-05,9e-06,1.5e-05,3.6e-05,4.7e-05,2.2e-05,3.6e-05,1e-06,5.2e-05,3.4e-05,1.6e-05,2.6e-05,7.4e-05,8e-06,6e-06,7e-06,3e-05,2.4e-05,3e-05,4.2e-05,3.6e-05,2.5e-05,3.8e-05,1.5e-05,4.1e-05,1.6e-05,6.7e-05,3.5e-05,6.1e-05,7e-06,5.2e-05,2.2e-05,2.1e-05,2.4e-05,2.3e-05,1.4e-05,3.2e-05,0.000116,7.5e-05,1.8e-05,6.5e-05,6.7e-05,3.2e-05,7.9e-05,0.000107,5.1e-05,6.9e-05,2.2e-05,5.5e-05,5.2e-05,4.4e-05,9.2e-05,4.2e-05,9.6e-05,8.5e-05,5.6e-05,3.4e-05,6.4e-05,1.4e-05,9.4e-05,3.5e-05,1.7e-05,5.1e-05,4.2e-05,3.8e-05,6.5e-05,6e-05,0.000107,0.000116,5.8e-05,2.3e-05,5e-05,0.000101,4.6e-05,2.3e-05,0.000124,7.1e-05,4.9e-05,5e-05,7.7e-05,5.4e-05,6.6e-05,5.3e-05,0.000114,2.3e-05,2.8e-05,6.1e-05,6e-06,4e-05,6.2e-05,3.6e-05,2.2e-05,2.6e-05,0.000114,6.1e-05,8.4e-05,1.2e-05,8e-06,1.5e-05
3e-05,1.2e-05,2e-05,4.8e-05,4.2e-05,3.4e-05,1.3e-05,1.8e-05,1.3e-05,2.9e-05,3.3e-05,4e-06,2.4e-05,5.1e-05,1.1e-05,3.6e-05,2e-05,1.9e-05,3.1e-05,5.6e-05,1.7e-05,3.6e-05,4.1e-05,1.4e-05,2.1e-05,3.6e-05,2.1e-05,2.8e-05,6.5e-05,3e-05,5.7e-05,3e-05,9e-06,3.3e-05,2.8e-05,2.6e-05,4.5e-05,1.9e-05,1.1e-05,2.8e-05,3e-05,1.8e-05,9e-06,2.8e-05,1.1e-05,1.9e-05,2.8e-05,2.8e-05,5.8e-05,3.7e-05,1.2e-05,1.7e-05,5e-05,3.9e-05,9.4e-05,3.2e-05,2.6e-05,6e-06,1.6e-05,0.000111,5e-05,3.4e-05,4.5e-05,4.4e-05,3.6e-05,8e-05,9.3e-05,3.9e-05,3.2e-05,6.8e-05,2.1e-05,3e-05,4.5e-05,8.5e-05,7.8e-05,4.7e-05,3.8e-05,5.4e-05,4.6e-05,6.2e-05,6.7e-05,0.000101,1.9e-05,1e-05,8.4e-05,5.6e-05,2.1e-05,7e-05,5.5e-05,7.2e-05,9.8e-05,5.3e-05,1.5e-05,9.3e-05,0.000113,0.000103,3.1e-05,7.9e-05,1.1e-05,5.2e-05,8.3e-05,9.7e-05,6.1e-05,5e-05,7e-05,0.000132,2.7e-05,4.6e-05,6.3e-05,2.2e-05,3.3e-05,1.4e-05,2.1e-05,9e-06,1.3e-05,0.000137,3.5e-05,6.9e-05,1.2e-05,1.1e-05,1.4e-05
3.3e-05,4e-06,1.9e-05,7.6e-05,5.8e-05,2.9e-05,4.2e-05,8e-06,9e-06,3.7e-05,3.9e-05,2.3e-05,1.9e-05,4.6e-05,9e-06,2.9e-05,2.8e-05,2.8e-05,2.2e-05,4.9e-05,2.7e-05,4.1e-05,6.4e-05,3.5e-05,3.6e-05,3.4e-05,6.6e-05,4.8e-05,9e-05,3.3e-05,3e-05,4.8e-05,2.3e-05,5e-05,8.2e-05,4.9e-05,4.1e-05,7e-05,3.9e-05,3.6e-05,2.6e-05,1.9e-05,3.3e-05,2.1e-05,3.1e-05,4.1e-05,5.2e-05,3.7e-05,7.4e-05,4.6e-05,5.9e-05,4.1e-05,3.4e-05,4.2e-05,7.5e-05,1.3e-05,2.7e-05,4e-05,3.9e-05,0.000107,8.1e-05,1.2e-05,4.7e-05,8e-05,7.9e-05,6.4e-05,0.000113,1.8e-05,5.3e-05,3e-05,3.7e-05,2.9e-05,4.4e-05,3.8e-05,9.1e-05,4.5e-05,7e-05,3.6e-05,8e-05,9.5e-05,7.5e-05,2.6e-05,6.2e-05,2.8e-05,0.000119,3.6e-05,4.4e-05,6.8e-05,7.5e-05,8.5e-05,3.7e-05,5.7e-05,5.4e-05,5.4e-05,0.000123,3.6e-05,2.5e-05,4.7e-05,5.1e-05,9e-05,4e-05,3.1e-05,0.000109,9.7e-05,4e-06,0.000155,4.8e-05,3e-05,6e-05,2.8e-05,3.3e-05,1.3e-05,3e-05,2.6e-05,4.6e-05,6.4e-05,5.8e-05,5.3e-05,2.8e-05,1.4e-05,3.6e-05
3.4e-05,4e-06,1.9e-05,6.2e-05,2e-05,2.8e-05,4e-05,1.7e-05,3e-05,1.8e-05,3.4e-05,2.4e-05,3.3e-05,5.1e-05,9e-06,1.6e-05,2.3e-05,2.4e-05,2.4e-05,1.4e-05,3.7e-05,3e-05,4e-05,1.8e-05,1.1e-05,1.9e-05,7.1e-05,2.4e-05,5.8e-05,3.8e-05,3.2e-05,2.7e-05,3.8e-05,5.1e-05,5e-05,9.2e-05,3.1e-05,3.6e-05,2.1e-05,7.9e-05,1.2e-05,3.5e-05,5.9e-05,2.1e-05,5.8e-05,2.8e-05,5.6e-05,3.1e-05,3e-05,2.2e-05,4.2e-05,1.3e-05,1.8e-05,4.7e-05,0.000108,3.4e-05,1e-05,1.4e-05,3.8e-05,7.3e-05,3.8e-05,4.2e-05,8.6e-05,6.1e-05,6.1e-05,8.8e-05,0.000122,6.8e-05,2.8e-05,1.7e-05,1.5e-05,3.9e-05,6.2e-05,9.3e-05,6.5e-05,3.4e-05,1.7e-05,4.6e-05,0.000111,2.3e-05,3.1e-05,8e-05,3.4e-05,1.7e-05,6.3e-05,3.1e-05,5e-05,7.2e-05,4.8e-05,0.000106,8.9e-05,3.3e-05,7e-05,6.5e-05,5.4e-05,3.9e-05,5.5e-05,4.6e-05,3.7e-05,8.8e-05,6.3e-05,3.9e-05,0.000116,5.1e-05,5.1e-05,0.000141,4.4e-05,3e-05,3e-06,4.2e-05,5.5e-05,1.7e-05,9e-06,3.1e-05,3.6e-05,9.8e-05,7.2e-05,0.000109,4.8e-05,5.4e-05,3.2e-05
2e-05,1.2e-05,3.8e-05,5.2e-05,4.2e-05,2e-06,4.3e-05,3.3e-05,2.2e-05,3.4e-05,2.3e-05,3e-06,5.5e-05,7e-05,2.8e-05,2.8e-05,2.3e-05,2.3e-05,1.7e-05,4.2e-05,1.5e-05,1.9e-05,1.8e-05,4.2e-05,3.1e-05,5e-06,3.7e-05,3.9e-05,4.7e-05,8e-06,5.3e-05,2.2e-05,4.6e-05,0.00011,4e-05,2.7e-05,2.2e-05,4.1e-05,3.9e-05,4.9e-05,3.6e-05,4e-05,6.1e-05,6.4e-05,9.3e-05,5.3e-05,4.9e-05,1e-05,4.2e-05,3e-05,2e-05,2.3e-05,5.3e-05,1.6e-05,7.2e-05,4e-05,1.1e-05,7e-06,6e-05,0.000108,9.8e-05,8.8e-05,2.1e-05,2.8e-05,3.8e-05,6.9e-05,0.00011,3.7e-05,6.4e-05,1.7e-05,4.3e-05,8e-06,1.4e-05,8.3e-05,0.000101,5.7e-05,6.4e-05,0.00012,8.8e-05,8e-05,1.3e-05,7.5e-05,3e-05,2e-05,0.000123,0.000111,1.6e-05,8.8e-05,8.6e-05,0.000113,3e-05,1.5e-05,6.2e-05,6.2e-05,0.000112,7.8e-05,3.6e-05,7e-06,7e-05,4.2e-05,7.7e-05,2.6e-05,8.5e-05,6e-05,7.5e-05,0.000148,6.6e-05,7.9e-05,6.2e-05,3.6e-05,2.2e-05,4.7e-05,1.5e-05,1.3e-05,5.2e-05,7.8e-05,8.6e-05,8.8e-05,2.8e-05,5.9e-05,6.4e-05
2.7e-05,1.3e-05,4.9e-05,5.3e-05,4.9e-05,1.9e-05,3.8e-05,4.8e-05,3.9e-05,2.3e-05,1.5e-05,1.7e-05,4.4e-05,2.6e-05,2.3e-05,3.9e-05,4.4e-05,2.3e-05,1e-06,2.5e-05,3.9e-05,5.6e-05,3.4e-05,8e-05,6.1e-05,4.9e-05,7.9e-05,6.8e-05,7.7e-05,8.4e-05,4e-05,5.3e-05,2.2e-05,5.5e-05,1.1e-05,7.4e-05,4.6e-05,3.4e-05,5.2e-05,5.5e-05,3.5e-05,6.8e-05,0.000105,0.000106,4.7e-05,5.2e-05,4.9e-05,2.8e-05,5e-05,5.5e-05,4.6e-05,4.8e-05,9.3e-05,8.3e-05,3.7e-05,3.1e-05,1.5e-05,4e-06,7.5e-05,6.9e-05,0.00014,0.000126,8.6e-05,8.6e-05,7.1e-05,5.3e-05,0.000113,2.6e-05,0.000125,2.8e-05,8.1e-05,3.1e-05,4.5e-05,5.6e-05,4.7e-05,2.2e-05,7.9e-05,7e-05,0.000128,9.1e-05,8.7e-05,7.2e-05,5e-05,6.6e-05,0.000174,5.1e-05,0.00011,6.3e-05,7.8e-05,7.5e-05,7.5e-05,2.7e-05,8.5e-05,0.000122,0.000195,7.6e-05,2e-05,3.7e-05,8.6e-05,0.000166,0.000161,4.5e-05,0.000139,7e-06,5.9e-05,0.000128,5.9e-05,5.1e-05,3.6e-05,2e-05,3.1e-05,3.9e-05,5.7e-05,5.1e-05,8e-05,9.5e-05,5e-05,9.1e-05,4e-05,6.3e-05,0.000102
2.2e-05,1.8e-05,2.6e-05,5.1e-05,4.2e-05,9e-06,1e-05,2.1e-05,4e-06,1.5e-05,1.8e-05,3.3e-05,1.3e-05,2.6e-05,2e-06,6e-06,3.6e-05,2.8e-05,1.7e-05,1.5e-05,4.4e-05,3.1e-05,1.1e-05,5.2e-05,3e-05,4.7e-05,7e-05,2.8e-05,2.8e-05,5e-05,7.4e-05,4.3e-05,2.7e-05,6.9e-05,4.8e-05,4e-05,3.8e-05,4.4e-05,3.3e-05,2.4e-05,3.6e-05,2.7e-05,1.9e-05,3.7e-05,2.7e-05,2.5e-05,2.4e-05,4.8e-05,6e-06,4.6e-05,1.5e-05,5.3e-05,3.2e-05,3.5e-05,3.5e-05,1.3e-05,7.5e-05,6.2e-05,7.7e-05,0.000103,6.3e-05,0.000108,7.9e-05,5.9e-05,2.9e-05,3.6e-05,9.3e-05,5.9e-05,7.3e-05,0.000103,0.000144,9.8e-05,7.6e-05,9.2e-05,9.9e-05,5.4e-05,5.8e-05,9e-05,5.5e-05,4.3e-05,6.5e-05,0.000134,6.3e-05,3.5e-05,3.3e-05,0.000117,0.000116,0.000136,2.6e-05,0.000122,0.00011,2.8e-05,5.2e-05,6.6e-05,6.7e-05,0.000129,6.5e-05,3.2e-05,5.6e-05,7.6e-05,0.000118,0.000166,3.9e-05,6e-05,2.4e-05,0.000137,2.8e-05,3.9e-05,9.5e-05,2.2e-05,9e-06,1.2e-05,2.2e-05,5.9e-05,4.9e-05,6.3e-05,8.4e-05,0.000115,5.1e-05,0.000108,3.7e-05
2.9e-05,1.3e-05,2.5e-05,5.2e-05,4.2e-05,7e-06,8e-06,1.3e-05,5e-06,9e-06,8e-06,1.3e-05,1.5e-05,4.1e-05,4e-06,1.1e-05,4e-06,1.9e-05,1e-05,4.1e-05,3.2e-05,3.3e-05,2.9e-05,2.2e-05,1.7e-05,2.5e-05,5e-05,2.3e-05,4.3e-05,2.3e-05,5.4e-05,1.5e-05,1.6e-05,3.9e-05,3.3e-05,1.8e-05,7e-06,4e-06,2.6e-05,1.8e-05,3.4e-05,3.5e-05,1.7e-05,2.9e-05,4.7e-05,2.4e-05,3.4e-05,3.3e-05,3.1e-05,1.6e-05,3.7e-05,1.5e-05,3.4e-05,3.3e-05,4.3e-05,1.5e-05,5.3e-05,3.4e-05,2.2e-05,4.3e-05,3.9e-05,1.3e-05,5.9e-05,5.2e-05,3.1e-05,4.9e-05,6.6e-05,9.1e-05,3.6e-05,5.4e-05,5.1e-05,6e-06,9.8e-05,2.2e-05,5e-05,3.4e-05,1.1e-05,5.4e-05,2.2e-05,3.2e-05,3.1e-05,8.7e-05,3e-05,2.3e-05,7.3e-05,2.7e-05,2.9e-05,0.000116,5.2e-05,9.7e-05,5.8e-05,3e-05,2.6e-05,2.4e-05,1.4e-05,7.6e-05,2.3e-05,6.4e-05,2.3e-05,4.8e-05,5e-05,8.5e-05,6.9e-05,4.7e-05,3.8e-05,9.8e-05,8e-06,2.3e-05,6.7e-05,1.9e-05,1.4e-05,2.9e-05,2e-05,5.7e-05,2e-05,8.4e-05,7.8e-05,0.000114,1.3e-05,6.3e-05,3.1e-05
2e-05,6e-06,2.1e-05,5.5e-05,3.5e-05,2.4e-05,1.6e-05,1.8e-05,4e-06,1.5e-05,1.1e-05,2.6e-05,1.1e-05,4.6e-05,7e-06,1.5e-05,1.9e-05,1.7e-05,5e-06,2.9e-05,2.9e-05,4.9e-05,2.5e-05,2e-06,3.1e-05,3e-06,3.4e-05,3.4e-05,2.9e-05,4.2e-05,5e-05,2e-05,1.1e-05,3.4e-05,6.7e-05,4.2e-05,3.7e-05,1.6e-05,3.1e-05,3.2e-05,3.6e-05,9e-06,1.4e-05,1.7e-05,3.8e-05,3.4e-05,3.2e-05,1.4e-05,6.3e-05,5e-05,5.6e-05,4.7e-05,4.1e-05,3.8e-05,5.2e-05,2.2e-05,1.5e-05,3.1e-05,2e-06,6.1e-05,4.5e-05,2.3e-05,4.3e-05,8.1e-05,3.1e-05,1.8e-05,0.000139,7.1e-05,2.7e-05,1.3e-05,3.7e-05,6e-05,7.1e-05,7.4e-05,8.2e-05,1.6e-05,1.5e-05,5.8e-05,3.4e-05,1.9e-05,4.8e-05,0.000112,7.7e-05,6.8e-05,0.00011,3.1e-05,3.1e-05,9.2e-05,2.3e-05,1e-04,5.4e-05,3e-05,2.6e-05,2.9e-05,3.9e-05,6.2e-05,3.9e-05,7e-05,2.7e-05,6.4e-05,4.6e-05,0.000107,5.6e-05,7.9e-05,1.8e-05,0.000133,3.2e-05,6.2e-05,3.3e-05,1.4e-05,4e-06,3.9e-05,5.6e-05,5.5e-05,5.5e-05,0.000114,6.4e-05,9.9e-05,4.4e-05,6.1e-05,5e-05
2e-05,1e-05,2.6e-05,4.4e-05,2.1e-05,1.5e-05,5e-06,9e-06,5e-06,1.5e-05,1e-05,3.4e-05,1.6e-05,3.2e-05,1.8e-05,2.2e-05,3.7e-05,3.6e-05,1.5e-05,8e-06,3.2e-05,1.3e-05,3.8e-05,2.7e-05,1.8e-05,1.8e-05,2.4e-05,2.2e-05,4.3e-05,2.8e-05,2.4e-05,3.6e-05,1.5e-05,1.2e-05,5e-05,3.6e-05,2.5e-05,2.5e-05,9e-06,5e-06,3.3e-05,4.3e-05,2.8e-05,1.6e-05,1.2e-05,8e-06,3e-05,7e-06,4.1e-05,2.8e-05,8.7e-05,3.7e-05,2.1e-05,1.7e-05,3.1e-05,2.9e-05,5.1e-05,1.1e-05,1.5e-05,6.1e-05,2.4e-05,2.4e-05,6.4e-05,0.000101,3.5e-05,4.4e-05,8.3e-05,3.5e-05,3.2e-05,2.4e-05,3.5e-05,4.4e-05,8.2e-05,6e-05,6.8e-05,4.7e-05,2.4e-05,2.3e-05,1e-05,1.5e-05,3.6e-05,9.5e-05,4.2e-05,3.8e-05,0.000103,6.9e-05,4.6e-05,7.4e-05,4.8e-05,3e-05,0.000107,4.4e-05,5.5e-05,1.1e-05,4.6e-05,4.2e-05,1.3e-05,8.7e-05,2.6e-05,2.8e-05,5e-05,0.000117,4.7e-05,3.2e-05,4.7e-05,8e-05,1.9e-05,4.9e-05,7.1e-05,4e-05,1.7e-05,3.3e-05,3.9e-05,6e-06,4.4e-05,0.000126,3.3e-05,2.4e-05,3.8e-05,7.1e-05,3.2e-05
2.2e-05,7e-06,2.4e-05,5.2e-05,2.2e-05,1.2e-05,1.2e-05,1.7e-05,8e-06,1.6e-05,1.4e-05,1.2e-05,1e-05,2.8e-05,1.1e-05,9e-06,1.9e-05,1.2e-05,8e-06,3.3e-05,2.1e-05,3.1e-05,2.7e-05,2e-06,1.7e-05,2.2e-05,1.8e-05,9e-06,3e-05,1.3e-05,1.3e-05,3.8e-05,1.6e-05,2e-05,5.1e-05,2.1e-05,3e-06,1.5e-05,1.8e-05,2.4e-05,5e-06,2.9e-05,1.8e-05,2.6e-05,2.1e-05,6e-06,2.5e-05,2.4e-05,3.7e-05,1.3e-05,2.6e-05,1.1e-05,2.1e-05,1e-05,2.9e-05,3.2e-05,2.5e-05,9e-06,1.9e-05,6.8e-05,6.6e-05,1.8e-05,3.9e-05,5.8e-05,2.9e-05,6e-05,0.00011,6.7e-05,3.1e-05,8e-06,3e-05,4.5e-05,7.5e-05,7.1e-05,4.9e-05,2.6e-05,3.5e-05,2e-05,2.5e-05,8e-06,2.7e-05,8.3e-05,4e-05,1.3e-05,6.2e-05,1.1e-05,2.1e-05,8.1e-05,8.3e-05,9.6e-05,5.7e-05,1.9e-05,2.8e-05,3.4e-05,5.6e-05,7.8e-05,3.2e-05,6.1e-05,5.5e-05,5.2e-05,3.5e-05,7.6e-05,4.7e-05,5.7e-05,5e-05,0.000124,3.6e-05,3.1e-05,6.6e-05,5e-06,2.1e-05,2.6e-05,2.1e-05,1.8e-05,3.1e-05,9.3e-05,4.3e-05,6e-05,2.9e-05,4.2e-05,2.9e-05
2.4e-05,4e-06,2.8e-05,5e-05,3e-05,1.1e-05,1.5e-05,8e-06,3e-06,1.2e-05,7e-06,8e-06,1.1e-05,3e-05,8e-06,6e-06,1.2e-05,1e-05,1e-05,3.3e-05,1.2e-05,2.3e-05,1.6e-05,1.6e-05,1.6e-05,9e-06,2e-05,5e-06,3.1e-05,1.8e-05,1e-05,7e-06,9e-06,3.2e-05,4.8e-05,5e-06,1e-05,8e-06,1.9e-05,1.4e-05,9e-06,3e-05,8e-06,7e-06,2.2e-05,1.5e-05,1.9e-05,1.7e-05,4.1e-05,1.1e-05,2.8e-05,1.3e-05,3e-05,2.2e-05,3.2e-05,2.8e-05,1.8e-05,1e-05,2e-05,5.1e-05,5.9e-05,1.2e-05,3.9e-05,6e-05,3.7e-05,5.7e-05,8.3e-05,4.9e-05,2.1e-05,1.6e-05,1.9e-05,4.1e-05,4.7e-05,4.5e-05,4.7e-05,1.5e-05,2e-05,3.7e-05,1e-05,1.5e-05,5e-06,8e-05,4e-05,3.2e-05,3e-05,3.9e-05,2e-05,7.3e-05,6.4e-05,8.2e-05,6.7e-05,1.5e-05,9e-06,5e-06,4.8e-05,6e-05,2.5e-05,5.9e-05,3.2e-05,3.7e-05,2.8e-05,8.1e-05,3e-05,7.7e-05,7e-05,0.000101,1.6e-05,4.6e-05,5.5e-05,1.4e-05,1.8e-05,1.3e-05,2e-05,1.5e-05,2.8e-05,8.6e-05,4.2e-05,6.6e-05,2.4e-05,4.1e-05,1.2e-05
2e-05,5e-06,2.4e-05,4.9e-05,3e-05,1.3e-05,1.1e-05,1e-05,2e-06,1.3e-05,6e-06,1.4e-05,9e-06,3.1e-05,9e-06,8e-06,5e-06,9e-06,1.1e-05,3.4e-05,7e-06,1.9e-05,1.8e-05,1.3e-05,2.1e-05,3e-06,2.6e-05,5e-06,2.9e-05,8e-06,2.4e-05,2.2e-05,4e-06,2.3e-05,4.3e-05,4e-06,1.2e-05,6e-06,1.1e-05,1.8e-05,1.1e-05,1.8e-05,5e-06,7e-06,2.2e-05,1.6e-05,2.3e-05,1.1e-05,4.2e-05,7e-06,3.4e-05,1.1e-05,2.1e-05,1.9e-05,3.2e-05,2.7e-05,1.8e-05,1e-05,1.7e-05,4.8e-05,4.4e-05,4e-06,3.9e-05,6.5e-05,2.6e-05,5.7e-05,7.9e-05,5.4e-05,3.5e-05,1.7e-05,2.4e-05,2.9e-05,5.2e-05,5.2e-05,4.6e-05,2e-05,2.2e-05,1.4e-05,7e-06,2e-05,1.5e-05,8.1e-05,2.5e-05,2.6e-05,4.4e-05,1.6e-05,1.5e-05,7.5e-05,5.6e-05,8.5e-05,6.1e-05,7e-06,1.3e-05,9e-06,6e-05,5.8e-05,2.5e-05,4.8e-05,3.5e-05,5.4e-05,3e-05,8.3e-05,4.6e-05,4.4e-05,5.1e-05,0.000104,2e-06,2.3e-05,6.2e-05,9e-06,6e-06,1.4e-05,2.1e-05,1.8e-05,2.3e-05,8.7e-05,3.1e-05,7.2e-05,1.8e-05,2.5e-05,7e-06
2e-05,4e-06,2.3e-05,4.9e-05,2.6e-05,8e-06,8e-06,1e-05,2e-06,1.2e-05,7e-06,4e-06,1.6e-05,3.2e-05,8e-06,9e-06,4e-06,9e-06,4e-06,3e-05,4e-06,2e-05,1.8e-05,9e-06,1.9e-05,4e-06,2.7e-05,2e-06,2.5e-05,4e-06,2.6e-05,1.9e-05,3e-06,2.6e-05,4.5e-05,5e-06,1e-05,1e-05,6e-06,1.5e-05,9e-06,1.6e-05,4e-06,1e-06,2.1e-05,1.1e-05,2.3e-05,1.3e-05,4.2e-05,4e-06,2.7e-05,4e-06,2e-05,1.9e-05,2.9e-05,2.5e-05,2e-05,1.1e-05,1.7e-05,5.5e-05,4.9e-05,4e-06,4.4e-05,6.6e-05,2.3e-05,5.2e-05,8.4e-05,4.5e-05,3.4e-05,1.5e-05,1.9e-05,2.2e-05,5.6e-05,5.3e-05,3.6e-05,1.9e-05,2.1e-05,2.2e-05,1.7e-05,0,1.2e-05,7.8e-05,2.9e-05,1.9e-05,5e-05,1.8e-05,6e-06,6.6e-05,5.4e-05,7.8e-05,6.1e-05,8e-06,8e-06,2.1e-05,4.7e-05,6.3e-05,2.1e-05,4.7e-05,2.2e-05,4.9e-05,3e-05,8.5e-05,5.6e-05,5.3e-05,4.5e-05,1e-04,1e-06,2.4e-05,6.2e-05,1.4e-05,4e-06,1.7e-05,2.1e-05,1.8e-05,2.2e-05,8.5e-05,3.1e-05,6.6e-05,8e-06,3.3e-05,3e-06
