0.005501,0.005076,0.004691,0.004473,0.004847,0.005713,0.005567,0.00477,0.004958,0.004724,0.00434,0.004744,0.005161,0.005385,0.004878,0.004364,0.004435,0.004389,0.004151,0.003944,0.004813,0.005481,0.004983,0.005242,0.006505,0.006502,0.005651,0.005349
0.006766,0.006188,0.005658,0.005451,0.005989,0.006964,0.006843,0.005985,0.006092,0.005735,0.005286,0.005791,0.006268,0.006444,0.005859,0.005294,0.005286,0.005197,0.004973,0.004804,0.005792,0.006537,0.005977,0.006198,0.007631,0.007703,0.006791,0.0064
0.008745,0.007889,0.007147,0.007025,0.007831,0.008967,0.009003,0.008104,0.00797,0.007371,0.006819,0.007536,0.00807,0.008149,0.007526,0.006846,0.006653,0.006456,0.006268,0.006213,0.007389,0.00822,0.007545,0.007642,0.009398,0.009624,0.008512,0.008031
0.009721,0.008846,0.008011,0.007965,0.008784,0.009943,0.01043,0.009695,0.009079,0.008212,0.007697,0.008572,0.009068,0.00913,0.008703,0.007944,0.007565,0.007234,0.007036,0.007092,0.008324,0.009159,0.00848,0.008435,0.010455,0.010738,0.009271,0.008847
0.009537,0.009285,0.008521,0.008202,0.00859,0.009472,0.010358,0.009968,0.009027,0.008043,0.007837,0.008773,0.009033,0.009211,0.009154,0.008471,0.008032,0.007545,0.007232,0.00724,0.008328,0.009209,0.008717,0.008732,0.010642,0.010654,0.008987,0.00856
0.009434,0.010002,0.009303,0.008476,0.008392,0.008926,0.009516,0.009142,0.008543,0.007971,0.008288,0.009103,0.008924,0.009188,0.009358,0.008815,0.008514,0.008166,0.007694,0.007372,0.00821,0.009205,0.008831,0.008979,0.010636,0.010602,0.0093,0.008514
0.010217,0.011003,0.01029,0.009402,0.009587,0.009776,0.009376,0.008627,0.00887,0.00916,0.009721,0.010351,0.009875,0.010081,0.010416,0.009616,0.008988,0.009101,0.008826,0.008301,0.008975,0.009834,0.009053,0.009075,0.010859,0.011516,0.010966,0.009929
0.011965,0.012607,0.011391,0.01059,0.011729,0.01205,0.010925,0.009563,0.010114,0.01104,0.011412,0.012111,0.011942,0.011953,0.012576,0.011558,0.010294,0.011061,0.010925,0.009934,0.010528,0.010996,0.009663,0.009664,0.011613,0.012706,0.012695,0.011829
0.014206,0.014885,0.013377,0.012424,0.01386,0.014596,0.013554,0.011431,0.011605,0.012989,0.013123,0.013977,0.014778,0.015015,0.015783,0.014376,0.012635,0.014131,0.013857,0.012314,0.012957,0.013068,0.011583,0.011846,0.01379,0.014317,0.014142,0.014168
0.016601,0.017454,0.015702,0.014608,0.015406,0.016441,0.016289,0.013591,0.01331,0.015082,0.014859,0.01598,0.017904,0.017978,0.018506,0.01716,0.015407,0.017106,0.016626,0.014895,0.015574,0.015564,0.014128,0.01466,0.017054,0.0172,0.016154,0.016857
0.018305,0.019668,0.017529,0.016072,0.015882,0.01668,0.017408,0.014772,0.014497,0.016514,0.01608,0.017819,0.020115,0.019429,0.019848,0.019006,0.017505,0.018658,0.017938,0.016697,0.017573,0.017755,0.016292,0.016271,0.018676,0.019065,0.018007,0.01913
0.018484,0.019779,0.017768,0.016692,0.016111,0.016233,0.017024,0.014543,0.014146,0.016339,0.016362,0.018386,0.01979,0.01851,0.019407,0.019198,0.01827,0.01883,0.017808,0.017275,0.018742,0.019546,0.017801,0.016045,0.017205,0.018021,0.018056,0.01935
0.01693,0.016783,0.016027,0.017064,0.017304,0.016419,0.015864,0.013183,0.012757,0.015184,0.015609,0.01712,0.017197,0.015918,0.017821,0.018213,0.017526,0.018097,0.017524,0.017198,0.018671,0.019929,0.017926,0.01504,0.014952,0.015716,0.016626,0.017182
0.01505,0.013396,0.014085,0.016685,0.017565,0.016267,0.014469,0.012169,0.011913,0.01368,0.013748,0.014525,0.014326,0.014087,0.016738,0.017236,0.0161,0.016557,0.016663,0.016256,0.017311,0.018886,0.017219,0.014548,0.014198,0.014443,0.014794,0.014365
0.014218,0.012241,0.013052,0.015405,0.016412,0.015541,0.013681,0.012556,0.012785,0.013424,0.013061,0.012989,0.012974,0.01433,0.016891,0.017062,0.015833,0.016091,0.016282,0.015178,0.015478,0.017388,0.016504,0.014962,0.015133,0.014637,0.014187,0.013329
0.015625,0.012981,0.013166,0.015616,0.017038,0.016689,0.015201,0.014884,0.015649,0.015804,0.015887,0.015689,0.016102,0.018614,0.020058,0.019248,0.018393,0.0187,0.018962,0.017053,0.016353,0.018079,0.017461,0.017513,0.018121,0.016444,0.015666,0.014437
0.021407,0.01624,0.015644,0.018254,0.019535,0.020739,0.01971,0.01916,0.019827,0.019746,0.021704,0.022296,0.02301,0.025546,0.025043,0.023106,0.023333,0.024696,0.025149,0.021632,0.018821,0.020561,0.020758,0.022562,0.023932,0.020554,0.018962,0.017192
0.030696,0.020879,0.019349,0.022378,0.023727,0.026779,0.025747,0.02471,0.024805,0.024665,0.029214,0.030064,0.03054,0.03287,0.030123,0.02725,0.029319,0.032088,0.03201,0.02673,0.022162,0.024459,0.025064,0.027908,0.031522,0.027151,0.023778,0.020976
0.039789,0.025273,0.02333,0.027625,0.029715,0.033028,0.031176,0.029318,0.02804,0.028238,0.035172,0.035937,0.035621,0.03755,0.034637,0.031882,0.034146,0.03659,0.035342,0.030267,0.026819,0.030865,0.030491,0.03159,0.037694,0.033427,0.028108,0.025247
0.043954,0.027646,0.026048,0.032041,0.035028,0.037107,0.034467,0.031376,0.028565,0.029643,0.036909,0.036883,0.035746,0.037985,0.03809,0.036053,0.035352,0.035538,0.03416,0.031275,0.030509,0.038263,0.037749,0.033732,0.039352,0.036529,0.030872,0.029499
0.043493,0.028344,0.027853,0.03452,0.037867,0.039299,0.035489,0.030474,0.028706,0.030911,0.035699,0.03476,0.032714,0.038196,0.044683,0.040689,0.03405,0.033822,0.034337,0.032119,0.032593,0.043385,0.043391,0.033465,0.035074,0.034546,0.03086,0.03256
0.04351,0.031197,0.031036,0.03649,0.038669,0.041744,0.038925,0.030806,0.029978,0.032859,0.035014,0.033736,0.030688,0.037994,0.049655,0.04498,0.035381,0.037436,0.039307,0.034393,0.03232,0.042052,0.043518,0.032614,0.030661,0.031914,0.031084,0.036171
0.044449,0.033664,0.03083,0.036104,0.038895,0.043881,0.044038,0.03576,0.034387,0.034602,0.034273,0.033961,0.030848,0.037025,0.049874,0.048027,0.03946,0.04131,0.042028,0.0352,0.030141,0.036475,0.040699,0.034514,0.032534,0.034658,0.034306,0.03873
0.040591,0.03196,0.026127,0.033366,0.038088,0.041579,0.043974,0.039304,0.037097,0.033631,0.032171,0.03303,0.031011,0.036649,0.0473,0.047891,0.043546,0.042354,0.039075,0.032924,0.027212,0.032446,0.039416,0.037395,0.037394,0.039035,0.036955,0.039484
0.033595,0.027132,0.02002,0.027124,0.032642,0.03451,0.038436,0.038544,0.035925,0.030679,0.030036,0.031125,0.028555,0.032761,0.042177,0.043887,0.042282,0.039431,0.033352,0.029439,0.02791,0.034118,0.038975,0.037616,0.039417,0.040566,0.036537,0.036605
0.027615,0.023471,0.018294,0.023373,0.027218,0.025924,0.027973,0.031497,0.029754,0.02531,0.027249,0.028823,0.024776,0.026844,0.036198,0.037118,0.035193,0.034202,0.02938,0.026751,0.029197,0.035774,0.037944,0.035573,0.036794,0.039759,0.036648,0.03359
0.02672,0.025964,0.024088,0.026402,0.028088,0.02267,0.020262,0.023499,0.023359,0.021595,0.026602,0.031285,0.027756,0.027687,0.032479,0.030298,0.02849,0.030191,0.028702,0.027007,0.031218,0.034984,0.035093,0.034394,0.034965,0.040003,0.039476,0.034926
0.02914,0.02954,0.032242,0.029851,0.02796,0.024755,0.025308,0.025855,0.025918,0.02519,0.029594,0.038926,0.03726,0.03712,0.037489,0.031912,0.029112,0.031026,0.035252,0.035474,0.035935,0.032272,0.03055,0.034146,0.036534,0.041338,0.043541,0.039168
0.03313,0.033418,0.040943,0.035387,0.029925,0.031048,0.037073,0.034877,0.034,0.032295,0.034075,0.047943,0.050478,0.05135,0.049574,0.040542,0.034923,0.037698,0.048044,0.051826,0.045753,0.035463,0.035224,0.038381,0.041735,0.045759,0.050737,0.047858
0.038501,0.040056,0.048019,0.042847,0.039862,0.043288,0.052344,0.049169,0.046196,0.042667,0.038378,0.051944,0.062456,0.066901,0.063601,0.052624,0.045115,0.049345,0.063293,0.073257,0.061064,0.043459,0.045955,0.048875,0.052495,0.058763,0.064824,0.056948
0.041685,0.047864,0.053154,0.0473,0.052388,0.057667,0.066394,0.06118,0.054559,0.050464,0.039656,0.052918,0.073702,0.082381,0.077521,0.065457,0.056447,0.060339,0.074759,0.092075,0.07589,0.052263,0.056375,0.059479,0.061989,0.072268,0.081502,0.066066
0.038882,0.052368,0.055519,0.04759,0.059787,0.066569,0.072988,0.06496,0.054263,0.050579,0.040047,0.057177,0.080309,0.091791,0.090024,0.073614,0.063967,0.067173,0.081058,0.099884,0.08249,0.058697,0.061872,0.063926,0.066878,0.079024,0.090917,0.071907
0.031661,0.047714,0.049244,0.041706,0.055446,0.061813,0.067275,0.063088,0.050349,0.046518,0.043639,0.058258,0.071771,0.083346,0.087065,0.067011,0.059034,0.062662,0.075816,0.088667,0.072552,0.054712,0.055972,0.057126,0.062301,0.071007,0.084004,0.068988
0.024575,0.035047,0.034184,0.028402,0.038959,0.043907,0.053537,0.059668,0.04581,0.040408,0.045032,0.049265,0.049449,0.058691,0.065123,0.046901,0.04247,0.046636,0.055869,0.061472,0.051183,0.040936,0.040591,0.042887,0.047293,0.049281,0.063479,0.060313
0.017748,0.021726,0.021682,0.016549,0.020977,0.025551,0.043066,0.055087,0.041744,0.036699,0.040452,0.034227,0.02814,0.033941,0.037604,0.029001,0.027843,0.032099,0.03446,0.03536,0.035132,0.031131,0.029165,0.03178,0.029983,0.026631,0.041383,0.044644
0.011863,0.013222,0.017341,0.014418,0.013069,0.017319,0.033043,0.04321,0.033338,0.029949,0.030397,0.023047,0.020083,0.020294,0.019892,0.019952,0.021799,0.021847,0.022839,0.020895,0.024616,0.027773,0.025098,0.022847,0.016303,0.013591,0.02686,0.027979
0.007742,0.009001,0.014477,0.013182,0.010572,0.013836,0.021827,0.027317,0.022191,0.020871,0.019704,0.015538,0.017025,0.017184,0.016558,0.016788,0.016002,0.013475,0.015444,0.014435,0.018306,0.022714,0.019794,0.017442,0.011207,0.009851,0.018604,0.017984
0.006053,0.00876,0.012729,0.010768,0.007673,0.01104,0.013886,0.017977,0.016538,0.014805,0.014744,0.013907,0.014538,0.015497,0.015169,0.013751,0.011467,0.010434,0.011465,0.010733,0.017846,0.020586,0.01532,0.013531,0.010795,0.011305,0.016419,0.015093
0.00581,0.009962,0.013487,0.009486,0.006537,0.010534,0.011659,0.015065,0.015013,0.010877,0.012142,0.01406,0.012937,0.012297,0.014516,0.013288,0.01192,0.013292,0.012104,0.010393,0.018011,0.0216,0.01631,0.012055,0.011291,0.014737,0.016057,0.015337
0.006469,0.010853,0.015308,0.01019,0.006717,0.010611,0.012929,0.013828,0.014969,0.011028,0.013076,0.01543,0.013633,0.010375,0.013305,0.012875,0.012527,0.018266,0.016096,0.011683,0.016617,0.021022,0.017568,0.012448,0.012933,0.019166,0.01877,0.019546
