-7.2e-05,-2e-05,-5e-06,-1e-06,-6e-06,-7e-06,-2.8e-05,-0.001283,-0.02885,-0.035115,-0.095742,-0.192621,-0.172488,-0.184992,-0.203295,-0.183202,-0.147828,-0.093723,-0.064646,-0.034491,-0.015762,-0.007385,-0.004596,-0.007849,-0.006012,-0.016483,-0.015767,-0.001014
-4.4e-05,-1.4e-05,-3e-06,3e-06,-3e-06,-3e-06,-3.4e-05,-0.00133,-0.024101,-0.029028,-0.026527,0.05287,0.134415,0.121923,0.086172,0.140579,0.147745,0.083651,0.058013,0.035123,0.018375,0.008842,0.00297,-9.9e-05,-0.000664,0.002565,0.001424,-0.000248
4.8e-05,1.8e-05,1.1e-05,4e-06,-1e-06,0,-9e-06,-0.000305,-0.003585,-0.00691,-0.032049,0.003781,0.016883,0.010827,-0.005641,0.000283,-0.005871,-0.018761,-0.012838,-0.005435,-0.001471,-0.001292,-0.002136,-0.002991,-0.001918,-0.005492,-0.004727,-3.1e-05
7.1e-05,3.1e-05,1.9e-05,6e-06,8e-06,8e-06,2.5e-05,0.000929,0.022622,0.023448,-0.030941,-0.105168,-0.150972,-0.15053,-0.140486,-0.169571,-0.142904,-0.070462,-0.056477,-0.036468,-0.018415,-0.009383,-0.006209,-0.005279,-6.2e-05,0.003597,0.004486,0.000491
2e-06,9e-06,1.3e-05,9e-06,1.1e-05,7e-06,2.1e-05,0.000976,0.022412,0.030271,0.085708,0.117449,0.107757,0.134875,0.155316,0.145073,0.123219,0.086776,0.065423,0.033764,0.014362,0.006682,0.003771,0.006839,0.00742,0.018174,0.015107,0.000687
-6.6e-05,-2.2e-05,-7e-06,-2e-06,-5e-06,-1e-05,-2.1e-05,-0.000401,-0.013306,-0.011523,0.05469,0.091879,0.085137,0.111016,0.140655,0.120991,0.062354,0.017059,0.019146,0.015138,0.007254,0.003088,0.002698,0.003795,-0.002262,-0.010963,-0.009525,-0.000633
-3.4e-05,-1.6e-05,-1.3e-05,-5e-06,-7e-06,-8e-06,-2.4e-05,-0.000884,-0.021062,-0.025445,-0.069912,-0.153492,-0.165087,-0.191149,-0.178947,-0.177329,-0.146375,-0.084016,-0.067069,-0.037097,-0.017436,-0.008311,-0.004374,-0.006417,-0.0078,-0.014191,-0.010584,-7e-04
4.6e-05,1.4e-05,5e-06,7e-06,2e-06,2e-06,-1e-06,-9e-05,0.002732,0.001697,-0.025107,-0.0282,0.010973,-0.022912,-0.062721,-0.001267,0.036818,0.02241,0.019857,0.010938,0.005675,0.003603,0.002158,0.00157,0.002111,0.006603,0.004798,0.000235
4.9e-05,2.1e-05,1.6e-05,8e-06,2e-06,0,3e-06,0.000366,0.0124,0.014132,0.039431,0.116777,0.131858,0.144236,0.109341,0.114451,0.087868,0.035611,0.029617,0.019242,0.010705,0.005543,0.003777,0.005446,0.000599,-0.001528,0.000879,0.000358
-1.2e-05,2e-06,8e-06,3e-06,5e-06,6e-06,1.6e-05,0.000329,0.007456,0.008664,-0.01515,-0.050211,-0.091418,-0.080866,-0.060138,-0.117457,-0.097712,-0.029662,-0.035228,-0.024521,-0.012408,-0.006262,-0.00357,-0.003214,0.001998,0.006676,0.005659,0.000365
-3.8e-05,-1.3e-05,-6e-06,3e-06,3e-06,0,-3e-06,-6.4e-05,-0.005254,-0.005652,-0.012426,-0.049851,-0.046126,-0.04394,-0.021107,-0.018032,-0.005215,0.003257,0.007584,0.00228,-0.000629,-0.001056,-0.00237,-0.002864,0.001254,0.005864,0.003671,-4.3e-05
-5e-06,-9e-06,-9e-06,2e-06,-3e-06,-2e-06,-1.3e-05,-0.000382,-0.013791,-0.015784,0.033249,0.095383,0.117013,0.132915,0.138016,0.155134,0.096444,0.026885,0.030565,0.023628,0.012192,0.005196,0.00163,0.000625,-0.003173,-0.010449,-0.009187,-0.000514
3.1e-05,7e-06,-1e-06,3e-06,0,3e-06,-2e-06,-0.000108,-0.00063,-0.00254,-0.02237,-0.024337,-0.048184,-0.058011,-0.037201,-0.061378,-0.061581,-0.024039,-0.027249,-0.016949,-0.006988,-0.003281,-0.001506,-0.00312,-0.003253,-0.005129,-0.00319,-7.6e-05
2e-05,1e-05,8e-06,5e-06,3e-06,0,9e-06,0.00027,0.010341,0.009902,-0.042635,-0.093089,-0.084641,-0.112551,-0.121535,-0.098145,-0.052913,-0.026308,-0.013081,-0.010287,-0.006498,-0.002994,-0.000821,0.001487,0.004268,0.007425,0.004901,0.000303
-2e-05,-4e-06,5e-06,-2e-06,-1e-06,-5e-06,6e-06,0.00021,0.003581,0.004542,0.028704,0.070087,0.102061,0.109053,0.063027,0.099357,0.082604,0.031438,0.02674,0.018523,0.00939,0.005082,0.003697,0.007369,0.003226,0.001111,0.001537,0.000147
-2.9e-05,-1.2e-05,-9e-06,-8e-06,-1e-06,-1e-06,5e-06,9.4e-05,-0.002028,-5.2e-05,0.023666,0.039167,0.012814,0.038168,0.031782,-0.011916,-0.009462,0.017678,-0.004499,-0.005695,-0.001112,8.2e-05,0.000605,-0.000419,-2.3e-05,0.001948,0.002218,4.8e-05
-1e-06,-8e-06,-1.5e-05,-6e-06,-4e-06,-3e-06,-9e-06,-5.1e-05,-0.003756,-0.005867,-0.031248,-0.083333,-0.097929,-0.102275,-0.072641,-0.098159,-0.061933,-0.025915,-0.015275,-0.010772,-0.00755,-0.004492,-0.003346,-0.006212,-0.001685,1.3e-05,-0.001669,-0.000231
1.4e-05,-1e-06,-6e-06,-3e-06,-5e-06,-3e-06,-1.5e-05,-0.000256,-0.00415,-0.006979,0.006851,0.033754,0.059553,0.044196,0.053011,0.091356,0.055363,0.005324,0.01542,0.015693,0.006944,0.002681,-2.7e-05,-0.000658,-0.003206,-0.006674,-0.004911,-0.000217
-4e-06,2e-06,4e-06,-1e-06,-2e-06,-2e-06,3e-06,-0.000107,0.002912,0.003812,0.022293,0.063813,0.054854,0.058285,0.05964,0.052398,0.016649,0.012843,0.00135,-0.000648,0.003177,0.002286,0.001091,0.000852,0.000249,0.000507,0.000767,0.000124
