0.123773,0.135164,0.138575,0.120278,0.116366,0.125563,0.127675,0.131867,0.127306,0.130153,0.135606,0.113446,0.099162,0.116096,0.132804,0.13877,0.138115,0.136552,0.132916,0.131464,0.141272,0.141171,0.143189,0.139339,0.135269,0.138954,0.128084,0.123119
0.154743,0.174223,0.179492,0.152312,0.14848,0.162498,0.166544,0.173034,0.168846,0.174372,0.179604,0.145338,0.121679,0.143697,0.170477,0.178525,0.17875,0.17929,0.170728,0.163771,0.173211,0.174447,0.181082,0.177496,0.172419,0.179176,0.1637,0.157149
0.207155,0.239957,0.249724,0.20709,0.204288,0.228589,0.237034,0.246318,0.241293,0.250952,0.254933,0.19848,0.158288,0.18961,0.234455,0.244334,0.245197,0.250592,0.234509,0.218579,0.225796,0.229484,0.245335,0.243456,0.239044,0.251087,0.227614,0.219073
0.243743,0.280483,0.295944,0.244239,0.240897,0.275032,0.29101,0.300417,0.292216,0.303686,0.302339,0.232468,0.183614,0.218287,0.273815,0.28045,0.27943,0.289093,0.269713,0.251784,0.257813,0.263898,0.28736,0.293058,0.295683,0.309446,0.281696,0.272489
0.253082,0.279047,0.296876,0.249815,0.242009,0.2755,0.296105,0.303042,0.296683,0.308067,0.294821,0.236611,0.200783,0.223535,0.266594,0.263269,0.259495,0.27372,0.262474,0.256191,0.265265,0.271876,0.29355,0.309699,0.322769,0.332257,0.311139,0.299987
0.265865,0.282862,0.298273,0.258415,0.241873,0.257702,0.272202,0.278959,0.285776,0.300837,0.271162,0.240302,0.235311,0.243334,0.261768,0.250629,0.245159,0.259475,0.254647,0.261618,0.283032,0.288448,0.294658,0.309529,0.330585,0.344493,0.344905,0.326842
0.347103,0.355799,0.371153,0.338728,0.308639,0.299613,0.307473,0.322924,0.334486,0.345229,0.311604,0.302253,0.321989,0.339318,0.344065,0.325803,0.310964,0.303748,0.2987,0.315673,0.351776,0.370482,0.357224,0.347262,0.377784,0.407502,0.430834,0.411407
0.560177,0.551974,0.560586,0.542004,0.491699,0.440262,0.442853,0.483616,0.494967,0.485788,0.459113,0.477153,0.515457,0.575884,0.558148,0.497474,0.464221,0.40442,0.410397,0.466243,0.531684,0.583011,0.537977,0.492171,0.558003,0.609798,0.637007,0.611998
0.947974,0.935583,0.929183,0.91627,0.82437,0.697422,0.715767,0.821124,0.832508,0.77244,0.747769,0.804627,0.874025,1.030256,0.968685,0.801525,0.724026,0.600693,0.659467,0.797922,0.911997,1.007792,0.900867,0.78395,0.908554,0.987877,1.022437,1.008304
1.527434,1.522077,1.489319,1.477431,1.318401,1.078843,1.143458,1.362966,1.392248,1.256201,1.221884,1.331895,1.43934,1.735768,1.616792,1.276058,1.106994,0.922595,1.0898,1.351221,1.52671,1.674567,1.484289,1.237241,1.401937,1.498929,1.586539,1.635872
2.218394,2.235454,2.173496,2.159069,1.909241,1.54224,1.667196,2.023511,2.088607,1.864196,1.843201,2.04625,2.146569,2.551016,2.385098,1.844076,1.535998,1.306405,1.642854,2.063259,2.29281,2.488152,2.220001,1.807514,1.954956,2.024413,2.213022,2.379365
2.764806,2.823715,2.707378,2.683222,2.353639,1.898634,2.086911,2.534111,2.624137,2.362905,2.414914,2.7023,2.679607,3.078126,2.946862,2.300569,1.861354,1.624486,2.115711,2.653483,2.882586,3.097847,2.82181,2.295782,2.353323,2.342801,2.675711,2.980752
2.756968,2.854805,2.685862,2.668264,2.337244,1.88999,2.088845,2.497756,2.589233,2.412017,2.587898,2.871556,2.62657,2.870128,2.886432,2.348417,1.894987,1.729317,2.226078,2.71243,2.852501,3.032029,2.852158,2.367268,2.348286,2.281583,2.729773,3.092923
2.091345,2.178672,2.008989,2.016818,1.789879,1.462939,1.592693,1.846045,1.926289,1.890847,2.128346,2.309099,1.937184,1.99519,2.165993,1.887323,1.555082,1.526467,1.869321,2.118124,2.115099,2.213484,2.163714,1.874476,1.904477,1.888545,2.278744,2.519382
1.367244,1.416927,1.318422,1.279363,1.161192,1.072769,1.172754,1.235593,1.291343,1.352924,1.482612,1.462364,1.178927,1.218915,1.408538,1.288246,1.086695,1.150844,1.36579,1.4156,1.292116,1.296463,1.305087,1.230158,1.351925,1.419005,1.610779,1.622423
1.324883,1.39607,1.359907,1.195007,1.018285,1.105646,1.350983,1.257092,1.184848,1.353634,1.360645,1.083155,1.01095,1.282686,1.350392,1.128808,0.984702,1.012735,1.195699,1.288011,1.109814,1.092489,1.128215,1.069409,1.162624,1.282951,1.355231,1.189635
1.625232,1.729982,1.696952,1.442504,1.190525,1.351886,1.729393,1.53804,1.324906,1.560489,1.587523,1.21701,1.235996,1.605102,1.599221,1.373034,1.265185,1.205199,1.320435,1.438917,1.259231,1.29462,1.375871,1.235864,1.234493,1.380792,1.491085,1.285133
1.753781,1.896024,1.94758,1.675226,1.348442,1.521662,2.007968,1.813798,1.550253,1.800144,1.812305,1.47571,1.538949,1.787574,1.697804,1.652922,1.627847,1.402992,1.367185,1.52138,1.392537,1.411831,1.494898,1.374754,1.394781,1.538212,1.610393,1.374285
1.651522,1.875407,2.192086,2.034903,1.530761,1.498685,1.975872,1.939436,1.805649,1.956275,1.834248,1.640467,1.816445,1.947512,1.786304,1.957749,1.995705,1.579218,1.395913,1.618059,1.570229,1.44906,1.432187,1.418119,1.574434,1.70262,1.758637,1.496427
1.62047,1.863496,2.40072,2.468746,1.798443,1.390328,1.643962,1.800577,1.935218,1.957966,1.711829,1.661021,1.993454,2.210036,2.040474,2.271171,2.242611,1.685933,1.468819,1.736774,1.736561,1.496967,1.393559,1.460136,1.722717,1.806289,1.859885,1.632192
1.595959,1.831222,2.342922,2.538053,1.870574,1.268513,1.303223,1.495938,1.781095,1.777321,1.553761,1.565742,1.883663,2.188534,2.084804,2.215885,2.063348,1.567691,1.414688,1.602202,1.597999,1.360167,1.291841,1.374995,1.636538,1.69801,1.749663,1.643248
1.368007,1.545834,1.8714,2.046696,1.585846,1.077549,1.015201,1.160106,1.354307,1.354383,1.309845,1.354378,1.479586,1.679729,1.663994,1.669758,1.472492,1.263194,1.207009,1.190385,1.138285,1.032012,1.091287,1.139377,1.27178,1.331374,1.44343,1.516603
0.924514,1.007349,1.151399,1.258665,1.062638,0.814726,0.732355,0.835053,0.94904,0.910878,0.944935,0.998387,0.946334,0.9706,1.05742,1.043066,0.889214,0.902549,0.892141,0.769993,0.696588,0.751904,0.909581,0.892642,0.862544,0.906023,1.102249,1.235922
0.545844,0.560493,0.589817,0.642035,0.674024,0.661734,0.571632,0.580737,0.684321,0.685334,0.673484,0.701094,0.650459,0.593513,0.710738,0.770237,0.628763,0.608792,0.593232,0.492396,0.464682,0.588896,0.750597,0.742725,0.657559,0.643355,0.797108,0.891246
0.389106,0.405272,0.499067,0.560703,0.632137,0.667959,0.576802,0.526635,0.586055,0.626345,0.591432,0.604344,0.601522,0.541586,0.587904,0.661933,0.603875,0.565291,0.533808,0.399495,0.361706,0.461376,0.593946,0.694635,0.587032,0.45407,0.57052,0.752654
0.369628,0.376166,0.533846,0.607824,0.660594,0.710165,0.687056,0.680043,0.648617,0.649215,0.615907,0.608778,0.60789,0.542592,0.516018,0.56897,0.613981,0.611779,0.549412,0.374553,0.346414,0.430463,0.60147,0.888917,0.741714,0.442442,0.502033,0.772991
0.46283,0.437153,0.573018,0.625453,0.708748,0.778732,0.790304,0.899879,0.815569,0.708766,0.685473,0.705187,0.68276,0.557424,0.5511,0.638667,0.652056,0.617282,0.538317,0.346393,0.373015,0.526715,0.762783,1.184275,1.013328,0.566038,0.531441,0.822533
0.652429,0.591579,0.648851,0.677402,0.770262,0.820732,0.846045,1.081436,1.029084,0.801202,0.75636,0.813492,0.767548,0.596092,0.706454,0.922191,0.80415,0.609777,0.54635,0.403274,0.458689,0.689492,0.922774,1.340531,1.250653,0.737749,0.564933,0.831602
0.919397,0.814266,0.771921,0.822533,0.946427,0.897485,0.86747,1.147651,1.220507,0.964888,0.804385,0.819412,0.760734,0.583855,0.838954,1.227887,0.992317,0.650714,0.636001,0.546394,0.555559,0.830594,0.994164,1.238371,1.315922,0.862284,0.54528,0.776563
1.108444,0.985996,0.887106,0.988174,1.144236,0.945461,0.783499,1.001872,1.213973,1.037139,0.772554,0.720368,0.653538,0.516423,0.852142,1.382838,1.13442,0.763366,0.813207,0.697786,0.604284,0.886688,0.97459,0.977319,1.197838,0.891106,0.469752,0.618491
1.06842,0.973424,0.873169,1.015587,1.156482,0.876102,0.679229,0.776729,1.005524,0.92519,0.613839,0.539874,0.525102,0.43087,0.706323,1.235947,1.062435,0.775257,0.895936,0.733777,0.58769,0.841848,0.875137,0.842407,1.080689,0.832625,0.414249,0.453052
0.803525,0.792938,0.744968,0.849912,0.903387,0.698977,0.605086,0.616522,0.768399,0.758752,0.434603,0.354015,0.446559,0.41558,0.532948,0.858461,0.763613,0.621078,0.779399,0.606862,0.451927,0.633103,0.648358,0.694471,0.860268,0.635087,0.33359,0.375289
0.525426,0.593573,0.562801,0.560207,0.517952,0.439282,0.473334,0.49105,0.578417,0.632218,0.384877,0.300334,0.409617,0.40581,0.423418,0.497079,0.420144,0.393384,0.522849,0.416046,0.275359,0.351578,0.387319,0.464998,0.518188,0.387914,0.273329,0.354407
0.349832,0.369054,0.333442,0.290122,0.250659,0.250402,0.366658,0.39916,0.452434,0.522444,0.373104,0.290596,0.32438,0.32254,0.341885,0.311203,0.209832,0.203714,0.270444,0.239316,0.156538,0.158498,0.195562,0.247156,0.240718,0.231161,0.247352,0.320831
0.213772,0.181888,0.161262,0.175175,0.17887,0.185585,0.291902,0.311185,0.318971,0.370377,0.300131,0.236205,0.203578,0.20308,0.235942,0.226223,0.164471,0.119888,0.119682,0.128762,0.112087,0.093186,0.097759,0.110752,0.135087,0.198987,0.260529,0.28239
0.140263,0.123256,0.143261,0.166948,0.155392,0.160456,0.271885,0.274554,0.208804,0.231215,0.211195,0.157972,0.131745,0.150706,0.161301,0.160702,0.154521,0.107413,0.078958,0.093654,0.107319,0.099665,0.094118,0.10221,0.142955,0.18517,0.236768,0.226865
0.111016,0.124701,0.159249,0.175359,0.147707,0.14191,0.243736,0.249976,0.186404,0.18146,0.153685,0.10363,0.100846,0.135514,0.139577,0.123792,0.126886,0.090754,0.058603,0.074112,0.109057,0.11446,0.110636,0.118041,0.149977,0.146171,0.17205,0.168916
0.077061,0.1118,0.14944,0.154293,0.137763,0.128847,0.185777,0.203286,0.185235,0.145667,0.101708,0.074694,0.076732,0.107952,0.119786,0.106774,0.099831,0.075307,0.051774,0.059949,0.110558,0.136093,0.121607,0.112281,0.130769,0.099584,0.106271,0.114249
0.057502,0.093629,0.114552,0.111924,0.12022,0.119921,0.12702,0.145033,0.162301,0.102566,0.073196,0.067705,0.064351,0.090683,0.092197,0.088691,0.093285,0.069999,0.056153,0.063071,0.110363,0.14208,0.114797,0.085693,0.096442,0.081365,0.077393,0.074854
0.060967,0.079613,0.076039,0.084406,0.10071,0.11754,0.094844,0.112433,0.124487,0.070695,0.075087,0.079852,0.067459,0.076286,0.070964,0.089472,0.095065,0.062559,0.055229,0.060013,0.09407,0.122067,0.095914,0.064849,0.06225,0.068691,0.057764,0.055552
