-0.00656,-0.005806,-0.001689,-0.002055,-0.000393,-0.005414,-0.008078,-0.006508,-0.004313,-0.002097,-0.004077,-0.005684,-0.004634,-0.003897,-0.003517,-0.004929,-0.005044,-0.004726,-0.005677,-0.006895,-0.003718,-0.006949,-0.004796,-0.003134,-0.000806,-0.001577,-0.005535,-0.004118,-0.003504,-0.002971,-0.003977,-0.004164,-0.004877,-0.006451,-0.005125,-0.005269,-0.006895,-0.005377,-0.002354,-0.00699,-0.005987,-0.003798,-0.006177,-0.003679,-0.002468,-0.003071,-0.005677,-0.003707,-0.002526,-0.005067,-0.003171,-0.010246,-0.009776,-0.007629,-0.004193,-0.003891,-0.006376,-0.00485,-0.004586,-0.006733,-0.004483,-0.005939,-0.00297,-0.000798,-0.002837,-0.003131,-0.004519,-0.00649,-0.003696,-0.009694,-0.011072,-0.004551,-0.003651,-0.002265,-0.004677,-0.008328,-0.010037,-0.008758,-0.00386,-0.003445,-0.005608,-0.008312,-0.005307,-0.007838,-0.002273,-0.003946,-0.004175,-0.008836,-0.006921,-0.007089,-0.002987,-0.005868,-0.004768,-0.0059,-0.005827,-0.005326,-0.005226,-0.004466,-0.003181,-0.002115,-0.004249,-0.004007,-0.003338,-0.006474,-0.004779,-0.004017,-0.004764,-0.003546,-0.003707,-0.003773,-0.002171,-0.001934,-0.003553,-0.00517,-0.006221,-0.003781,-0.008547,-0.008842,-0.006466,-0.006761,-0.004699
0.000972,-0.001565,-0.00311,-0.000757,-0.001621,-0.001623,0.001687,-5.1e-05,-0.003571,0.000144,0.001235,0.002983,0.000127,0.001351,0.000729,-0.001073,0.001893,-0.000251,-0.000347,-0.001096,-0.000286,-0.000753,0.00225,-0.000916,-0.006738,-0.003701,-0.001205,0.002695,-0.000445,0.001412,0.002267,0.000741,0.000309,0.003922,0.000707,0.002849,0.003617,0.000602,0.000689,0.00149,0.000216,-0.001728,0.001343,-0.001065,-9e-04,-0.000581,-0.001693,0.000515,-0.000862,0.000633,0.000537,0.004784,0.00208,0.003148,0.000629,-0.001039,-0.002205,0.001145,0.000553,0.000488,0.000409,0.000541,0.000505,-0.006618,-0.005193,-0.002267,0.000834,0.003072,0.001197,0.003246,0.003263,0.000258,-0.000142,-0.002784,0.001658,0.004686,0.00394,0.002104,-0.001265,-0.002246,-0.001983,0.003665,0.000327,0.002959,-0.0021,0.001036,0.000166,0.004604,-0.001163,0.000976,-0.001318,0.001484,0.00198,0.000758,-0.001119,-0.002141,-0.000302,0.000458,-0.001951,-0.001082,-0.001342,0.000949,-0.001311,0.001325,0.000149,0.001402,0.000162,0.000769,-0.001312,-0.001165,-0.001645,-0.002601,0.000235,0.002759,0.000323,-0.000966,0.002166,0.002526,-0.000916,-0.000699,-0.001959
-0.001773,0.001864,-0.001198,-0.001958,-0.000407,0.001841,-0.002415,1.8e-05,0.001204,-0.001489,8.4e-05,-0.002247,-0.002038,-0.000838,0.000232,0.00162,-0.002554,0.000321,-0.000911,8.8e-05,0.001353,0.001758,-0.002158,-0.000516,-0.000279,0.000285,-0.001716,-0.003533,-0.003959,-0.001913,-0.000942,-0.001292,0.000502,-0.001624,-0.000766,-0.001729,0.000442,0.001739,-0.000409,-0.001993,-0.003692,-0.00062,0.000151,-0.002019,-0.002099,-0.001387,-0.001941,7e-06,0.000399,-0.001327,0.000196,-0.002177,-0.001868,-0.00236,-0.001143,-0.002808,-0.000144,-0.001124,-0.003549,-0.001859,-9.1e-05,-0.002011,-0.000743,6.1e-05,0.003003,0.001265,-0.000547,-0.001846,-0.00402,-0.002237,-0.002771,-0.003453,-0.001746,-0.000108,-0.001497,-0.002737,-0.002408,-0.000315,-0.000262,0.001083,0.003203,-0.001322,0.000257,-0.001176,-0.000165,-0.001782,-0.000426,-0.00106,0.001876,-0.000603,-0.000542,-0.00312,-0.003956,-0.003363,0.001612,0.003062,6e-04,-0.000468,0.001453,-0.001872,-0.00052,-0.000682,0.000826,-0.000178,0.001138,-5.6e-05,-0.000324,-0.000726,-0.000616,-0.000675,-0.001745,-0.000917,-0.000338,-0.002762,4.6e-05,0.001393,-0.000328,-0.00208,0.000711,0.000732,0.001486
0.002468,-9e-05,0.001564,0.000748,0.00105,0.000806,0.005192,0.001258,0.0016,0.003874,-0.000616,-0.001864,0.001712,0.000349,-0.000545,-0.001372,0.001916,0.00116,0.001008,1.7e-05,0.000396,8.7e-05,0.001301,0.001001,0.002657,0.001748,0.002235,0.003014,0.001997,0.000707,0.000125,0.000553,-0.000471,0.001866,0.001581,0.000802,-0.002581,-0.001767,-0.002132,0.001323,0.003009,0.003371,0.000213,0.002729,0.002743,0.001207,0.003876,0.001624,0.000189,-0.000342,0.000741,3.1e-05,0.00234,0.002187,0.002217,0.002854,0.003006,0.003082,0.003142,0.002778,0.001927,0.001842,-0.000323,0.002597,0.003816,-2.8e-05,0.001674,-0.000519,0.003189,0.002652,0.002884,0.005473,0.001949,0.00097,0.001378,0.002223,0.003103,0.001182,0.000286,0.000553,-5e-04,0.001496,0.000201,0.001129,-0.000341,0.002228,0.001318,-3.3e-05,-0.000942,0.00141,0.001887,0.001533,0.005381,0.002133,-4.5e-05,-0.000427,0.000564,0.002005,0.001241,0.002292,0.002656,0.000465,0.000767,-0.000119,-0.001583,-7.9e-05,0.000881,0.00105,0.000628,0.000769,0.003819,0.003843,0.002021,0.001597,0.001091,0.001707,0.000665,0.000515,0.000205,4e-04,-0.001131
-0.001625,-0.001496,-0.000264,-0.000839,-0.001944,-0.001652,-0.003788,-8.5e-05,-0.00081,-0.00254,-0.001856,0.000748,-0.000713,-0.000409,-2.9e-05,0.00017,-0.000291,-0.00298,0.00111,0.000779,-0.001788,-0.001829,-0.001821,2.6e-05,-0.000784,-0.00278,-0.00036,0.000309,-0.000235,-0.000725,-0.000309,-0.000576,0.000276,-0.001468,-0.001917,-0.000793,0.001934,0.000516,0.001379,-0.000262,-0.00096,-0.002203,-0.001596,-0.00098,-0.001308,-0.001203,-0.000912,-0.001366,-0.001714,0.000303,-0.001314,-0.001258,-0.002046,-0.002183,-0.001727,-0.001428,-0.002762,-0.003163,-0.001449,-0.000771,-0.000914,-0.000511,0.000523,-0.000412,-0.003433,-0.000962,-0.000117,0.000794,-0.000571,-0.002223,-0.002579,-0.004175,-0.000289,-0.000221,-1e-04,-0.000106,-0.002592,-0.001217,0.000171,-0.001033,-0.00115,-0.002277,0.001132,0.000221,0.000551,-0.001138,-0.001953,-0.000316,0.001251,-0.001073,-0.001817,-0.000444,-0.005511,0.000405,-0.001717,-0.002154,1.7e-05,-0.00076,-0.00078,-0.000419,-0.00151,0.000359,-0.000324,-0.00125,0.000621,-0.000628,-0.001149,-0.001065,0.000481,0.001722,5e-05,-0.00228,-0.000651,0.000659,0.000571,-0.001097,-0.000895,0.001144,0.000595,-0.001863,0.00118
0.002504,0.001977,-0.00041,-0.000387,-0.000169,-9.2e-05,-0.000656,0.000116,-0.000247,-0.001308,0.000592,0.000946,-0.000794,-0.001997,-0.000723,-0.000616,0.001728,0.004042,0.000616,-0.000732,0.000672,-0.00013,0.000853,0.000289,-0.000277,-0.000503,-0.001372,6.5e-05,0.00066,0.001533,0.000565,-0.000433,-0.002469,-0.000443,0.000834,0.002305,-0.001177,-0.000846,-0.000833,0.000642,0.000777,0.000396,-0.00021,0.001815,-0.000221,-8e-04,-0.001758,-0.000955,-0.000801,-0.000619,0.000783,0.0016,0.002656,0.00182,0.000795,0.000545,0.00152,0.000941,0.000605,-0.000132,-0.000611,-0.000848,-0.000484,-0.000352,-0.000378,-0.000116,-0.001291,-0.000884,-0.000634,-0.000348,0.00229,0.001479,0.001254,0.00021,-0.000847,0.000703,0.000475,0.001547,0.000373,-0.001365,-0.000301,0.000773,-0.002041,-0.00061,0.000734,-0.001418,0.000233,0.000876,-0.000129,0.0011,0.000892,-0.001796,0.003711,-0.000902,0.001668,0.002652,0.000547,-0.000348,-0.000563,-0.000101,-0.000121,-0.000241,-0.000784,0.001453,0.000588,0.000544,0.000825,0.001043,0.000544,-0.001533,-0.000567,-0.000172,-0.000736,-0.000362,-0.00128,-0.00082,0.000376,0.000778,0.000491,0.002037,-0.000881
-0.001519,-0.000125,-0.000355,0.001041,0.00037,0.000201,0.000398,-0.002655,-0.000158,1.5e-05,-0.000845,-0.000838,0.001867,0.000821,0.000279,-0.000173,-0.001765,-0.002866,-0.002193,0.001009,-2.3e-05,0.001763,0.000707,-0.001082,-0.000138,0.001944,0.000111,-0.001845,-0.001525,-0.001461,-0.001009,-0.000288,0.001782,0.000227,0.000246,-0.002273,0.000118,0.000185,5.8e-05,-0.001133,-0.000916,0.000247,0.001207,-0.00154,-2.2e-05,-0.000313,0.002198,0.001179,0.001576,0.00107,0.000851,0.000811,-0.001659,-0.000575,-0.001335,0.000265,-0.000685,-0.000866,-0.001186,-0.000247,0.000877,-0.000439,-9.8e-05,0.000261,0.001093,-0.000525,-0.000604,-0.000331,0.000528,-0.000442,-0.001486,-0.002137,-0.002449,-0.000424,-0.001168,-0.000389,6.6e-05,0.000268,-0.000359,0.001645,0.001157,0.001112,0.001878,0.00033,9.6e-05,0.00072,0.000167,-0.000966,-0.000862,-0.000795,-0.000941,0.001228,0.001324,0.000564,4.2e-05,-0.001132,2e-06,0.000106,0.000738,0.001206,-0.000476,-0.000944,-0.000282,-0.000774,0.00028,1e-06,-0.000799,-0.001184,-0.001044,-0.001165,-0.000999,0.000425,-0.000116,-0.001011,0.000674,0.002269,0.000639,-0.0019,-0.001441,-0.001557,0.000338
-0.000699,-0.000571,0.00061,0.001067,0.000855,0.000544,0.000348,0.001359,0.000664,0.001793,0.000223,0.001507,-0.000436,-0.000311,0.00033,0.000808,0.000644,9e-04,0.000125,-0.001733,7.5e-05,-0.000367,-0.000952,-2e-05,0.000178,0.000452,-6.7e-05,-0.000167,0.001601,5.9e-05,0.000577,-9.7e-05,-0.001535,0.000714,-0.00066,0.000216,-8.3e-05,-0.000118,0.000479,-4.7e-05,0.000292,0.00128,-0.000298,0.000803,0.001614,0.00128,-0.001306,0.000188,-0.000285,-0.000132,-0.000656,-0.000793,-4.8e-05,0.000111,0.001303,-0.000173,0.000878,0.000413,0.001028,-0.000306,-0.000763,0.001154,0.000597,-0.00079,-0.000181,0.00155,0.001969,4.2e-05,0.000727,0.000404,0.001111,0.001718,0.002158,-0.000709,0.001216,-0.000479,0.000211,-0.000891,0.000496,-0.000291,-0.000383,-0.001733,-0.001949,-0.000107,-0.000464,-0.000174,-0.000244,0.001116,0.000645,-0.000466,0.001015,5.6e-05,-0.001569,-0.000654,0.000661,-0.000105,-0.000562,8.6e-05,-0.000112,-0.000537,0.000818,-3.5e-05,-0.000748,-5.2e-05,-0.000358,-0.001282,0.000324,0.001004,0.001296,0.001473,0.000429,0.000211,0.001288,0.001075,0.000477,-0.002757,0.000204,0.000849,0.000425,0.000953,0.000122
-0.00065,-0.000219,-0.000271,-0.000672,0.000134,-0.000573,-0.000623,-0.000227,4e-05,-0.001038,-8.1e-05,-0.00059,0.000816,0.000631,0.000128,6.2e-05,0.000265,-0.000495,0.000192,0.001197,0.000404,0.000555,0.000684,-0.000721,0.000906,-0.000553,0.000274,0.001109,-8.1e-05,-7.8e-05,-0.00093,-0.000345,0.000992,-0.000982,0.001066,0.000661,0.000523,0.000327,-0.000154,0.000972,0.000144,-0.00051,-0.000416,3.3e-05,-0.001472,-0.000337,0.000164,-0.001064,-0.000869,-0.000193,-0.000371,-0.000181,-2.3e-05,-0.000596,-1.5e-05,-0.000321,-0.00068,-0.000275,-0.001037,0.000441,0.000249,-0.000509,0.000549,0.000902,9e-05,0.000482,-0.001365,0.000319,-0.000206,0.00021,-0.000306,-0.002138,-0.000616,0.001698,-0.000284,0.001158,-0.000911,-1.8e-05,-0.000175,0.001232,-0.000524,0.00094,0.000276,0.000117,1.4e-05,0.000804,-0.000119,-0.001768,0.000238,0.001396,-0.000361,-0.000331,-0.000634,0.000466,-0.000778,-0.000159,0.000321,-0.000431,-2.1e-05,-0.000797,-0.000437,0.000379,0.001351,-0.000336,-5.4e-05,0.00071,-0.000564,-0.000518,-0.000581,-0.000889,4.8e-05,-0.000469,-0.000792,-0.000568,-4.3e-05,0.000373,-0.000728,7.4e-05,0.000459,-0.000357,-0.000431
0.000946,1.9e-05,-0.000441,-0.000384,-0.000223,0.000827,0.000604,-0.000502,-0.000984,-0.000109,0.000745,0.000208,3.9e-05,3.6e-05,0.000881,-0.00013,-0.001052,0.000546,0.000881,0.000413,-0.000607,-2.5e-05,0.000202,0.000612,-0.000899,-0.000202,-0.000633,-0.000429,-0.000596,0.000725,0.000139,0.000777,-0.000311,-0.000209,-9.3e-05,-0.000519,-0.000973,-6e-06,0.000158,-0.000318,0.000516,-0.000216,2e-06,0.000196,0.00026,-0.000809,-0.000347,0.000571,0.00083,-8.6e-05,-0.000293,0.00059,9.2e-05,0.001001,-5.8e-05,0.00062,0.000158,-0.00019,0.000276,-0.000351,-0.000561,-2.4e-05,-4e-06,-0.000364,-0.000225,-0.001233,0.000834,0.000345,0.001278,-0.000567,-0.000206,0.000901,-0.000583,-0.001603,-0.000538,-0.000645,0.000568,0.000482,6.7e-05,-0.001269,0.000458,0.000383,0.000801,0.00011,0.000132,-3.8e-05,-0.000128,0.001019,-0.000204,-0.001146,-0.000443,-0.000298,0.000222,0.00027,-0.000814,0.000248,-0.000214,0.000381,0.000199,0.000985,-4e-06,0.000131,-0.000502,0.000134,0.000301,-9.7e-05,0.000545,-0.000236,0.000439,0.000561,0.000391,-0.000216,-0.000219,-0.00094,-0.000289,0.000522,0.001072,-0.00019,-0.000587,-3.3e-05,-0.000185
-0.000371,-0.00053,0.001238,6.2e-05,0.000103,-7.5e-05,-2.2e-05,-0.000111,-0.000431,-0.000159,-0.000148,1.2e-05,-0.001074,-0.000324,-0.00044,-0.000148,0.000509,0.000524,-0.000812,-4e-04,-0.000356,0.000125,-0.000425,0.000663,0.000318,-2.5e-05,0.00138,-0.000145,-0.000117,-0.000701,-0.00021,-0.000479,0.00029,2.4e-05,-7e-05,0.00024,0.000717,6e-05,-0.000255,0.000244,-0.00033,-0.000437,-4.5e-05,0.000291,-0.00021,0.000562,0.000669,0.000164,-0.000153,0.000273,0.000141,-0.000124,0.000147,-0.00088,-0.000296,0.000371,0.000196,0.000241,6.5e-05,8.8e-05,1e-05,4e-04,-0.000557,-0.000258,-0.000104,0.000647,0.000103,-0.000775,-0.001633,0.001072,0.000287,0.000455,-0.000265,0.000335,0.000305,-0.000188,-2.3e-05,-0.000429,-0.000201,0.000424,0.000477,-0.000721,-0.000232,-0.00055,-0.000111,-0.000994,0.000378,-0.000617,-4.3e-05,0.000703,0.00049,0.001115,-2.9e-05,0.000605,0.001433,-0.00044,0.000321,-0.000453,0.000258,-0.000621,0.00067,-0.000596,6e-06,0.000372,-0.000547,0.000553,-4.2e-05,2.6e-05,-0.000145,-3.2e-05,-0.000535,-0.000801,0.000169,0.000123,0.000131,-0.00024,-0.00048,-0.000223,-0.000273,-0.000269,0.000945
0.000293,0.001008,-0.000793,0.000279,-0.000209,-2.8e-05,-7.9e-05,0.000976,0.000939,0.000413,-0.000461,0.000162,0.000232,0.000197,-9.4e-05,-0.000319,-0.000432,8e-06,0.000511,-6.1e-05,0.000296,-0.000606,-0.000313,-0.000891,-0.000381,0.000493,-6.1e-05,0.000546,0.000116,8.1e-05,0.00081,0.00016,-0.000311,-0.000119,-0.000621,-0.000235,-0.000106,-0.000129,-3.1e-05,-4.4e-05,-0.000572,0.000417,0.000278,-0.000559,-0.000141,0.00018,-3.3e-05,1.8e-05,-0.000295,-0.000174,0.000202,-0.00013,-0.000267,0.000443,0.000758,-0.000277,-0.000147,0.000366,0.000578,-0.000146,0.000275,0.000221,-0.000276,0.000667,0.000186,0.000534,-0.000216,0.000377,0.000579,-0.000537,-0.000486,0.000318,0.000301,4.2e-05,0.000179,-0.000277,2e-06,0.000232,0.000502,7e-06,-0.000268,-6.5e-05,-8.7e-05,0.000491,-3.8e-05,0.000569,2.2e-05,0.000431,-0.000243,-0.000198,6e-05,-0.000501,-0.000321,-0.000677,-0.000511,0.00019,-0.000394,0.000138,-0.000207,0.000267,-0.000436,0.000507,-2.7e-05,2.9e-05,7.1e-05,-0.000322,-0.000383,5.6e-05,7.1e-05,-5.9e-05,0.000426,0.000728,-0.00046,0.000564,-5.8e-05,0.000433,-0.000108,0.000207,0.000213,0.000771,-0.000697
0.000325,-0.000376,-4.9e-05,-0.000213,-0.000206,-0.000366,5.5e-05,-0.000667,-0.000407,0.000113,0.000136,-0.000709,0.000427,-0.000104,0.000395,-4.3e-05,0.000171,-0.000742,3.2e-05,0.000146,0.000344,0.00027,9e-05,0.000714,0.00068,8.5e-05,-0.000553,-0.000121,0.000176,0.000354,2.2e-05,-0.000193,0.000289,-1.7e-05,0.00069,0.000707,-8.1e-05,-8.3e-05,-7.3e-05,-0.000102,0.00038,-0.000165,-0.000139,0.000437,0.000157,-0.000401,0.00031,0.000276,0.00014,4e-05,0.000221,0.000501,6.5e-05,0.000205,-0.000936,0.000137,-1e-06,-0.000334,-0.000281,-8.2e-05,0.000137,-0.000392,0.000396,-0.000503,-0.000153,-0.000649,6.1e-05,6e-06,-4.8e-05,0.000589,0.000184,-0.00037,-0.000397,0.000166,-5.1e-05,-0.000123,0.000155,-0.000371,-0.000495,9e-06,-9.2e-05,0.000375,0.000268,7.6e-05,-0.000307,-0.000375,0.000163,-0.000726,0.000492,-8e-05,-0.000304,-0.000161,-0.000354,-0.00023,0.000132,0.000168,0.000228,0.000238,-2.1e-05,-0.000332,-1.9e-05,-3.9e-05,0.000237,0.000245,0.000345,0.000139,0.000362,1e-04,2.6e-05,-0.000154,9.4e-05,-9e-05,0.000192,-0.000319,-0.000186,-0.000519,-3e-05,0.00015,-9.5e-05,-0.000581,0.000148
1.3e-05,0.000297,0.000172,-0.000252,7.3e-05,9e-05,-0.000197,0.000268,0.00024,6.9e-05,0.000204,0.000103,-0.000486,-0.000151,-0.000239,0.000121,0.000229,0.000449,8e-06,-0.000271,-0.000498,-1e-05,-0.000204,-0.000116,-0.000185,-0.000421,5.8e-05,-2.5e-05,-5.3e-05,-0.000114,0.000138,0.000256,-1e-05,0.000173,-0.000178,-0.00018,8.5e-05,1.8e-05,-3e-05,-8.8e-05,-0.000111,0.000151,0.000317,-0.000214,0.000121,0.000102,-0.000214,-0.000432,5.3e-05,6.1e-05,-5.7e-05,-0.000301,0.000174,-0.000288,0.000351,-0.000327,-7e-05,-0.000127,1.4e-05,1.3e-05,-0.000149,0.000491,-0.000104,0.00017,6.2e-05,-3e-05,-0.000327,-0.000208,-0.000105,-4.1e-05,-0.00029,-0.000494,-0.000163,-0.000158,0.000304,0.000336,-9.3e-05,0.000371,0.000496,0.000109,-0.000136,-0.000191,3.2e-05,0.000228,0.000356,0.000111,-0.000251,0.000644,-0.000481,0.00029,0.000243,0.000173,0.000227,0.000162,-0.000273,2e-04,4.2e-05,-0.000244,-0.000126,0.000211,0.000263,4e-05,-0.000176,-0.00039,-0.000477,-0.000118,1e-06,-3.9e-05,-6.1e-05,9.4e-05,-0.000106,0.000168,7.3e-05,1.8e-05,5e-05,1e-05,-0.000251,-0.000247,0.000173,0.000229,-0.000143
-0.000486,-0.000167,-0.000311,0.000174,1e-04,5e-06,3.4e-05,0.000103,-0.000153,-0.000124,-3.2e-05,7.8e-05,0.00048,5.1e-05,-4.1e-05,0.000218,-5.1e-05,-4.2e-05,-0.000113,0.000188,7e-05,0.000225,5.2e-05,-0.000374,0.000249,0.000103,1.7e-05,0.000145,-4.9e-05,-0.00011,-0.000632,5.8e-05,-3.5e-05,-6.9e-05,-0.000171,0.00015,-5.7e-05,0.000326,-7.1e-05,0.000164,5.4e-05,-0.000342,0.000137,6.7e-05,-0.000443,2.9e-05,5e-06,-7.3e-05,-1.2e-05,8.7e-05,0.000159,4.8e-05,-0.000252,0.000308,3e-05,5.4e-05,-6.5e-05,-0.000139,4e-04,0.000145,9.4e-05,-0.000339,-0.000145,-0.000313,-0.000116,0.000254,-0.000229,4.3e-05,-0.000235,-0.000233,7.2e-05,0.00037,0.000411,0.000148,-0.000226,-0.000371,-0.000129,-0.000205,-0.000212,0.000241,0.000184,-0.000266,-0.00055,-0.000335,-0.000168,0.000329,-0.000256,-0.000247,0.000108,-0.000207,-0.000269,-2.6e-05,0.000625,-0.000266,-0.00011,3.9e-05,-1.1e-05,7.7e-05,1.8e-05,-0.000119,-0.000299,-0.000139,-7e-06,0.000303,5.2e-05,-0.000192,3.1e-05,-4e-06,-0.00011,-0.000183,4.1e-05,-4.6e-05,-8e-05,-1.2e-05,-0.000122,0.000217,0.000237,-1.2e-05,-0.00011,-0.000177,0.000158
0.000151,-6.8e-05,0.000207,-0.000252,9.3e-05,3.7e-05,1.5e-05,-0.000228,0.000115,5.5e-05,-0.000146,-0.000113,-0.00014,5.8e-05,-0.000145,-0.000211,0.000128,-0.00022,7e-06,0.000108,2.2e-05,-0.000258,0.000123,4.9e-05,-0.000208,7e-06,-3.1e-05,-0.000115,4e-05,-0.000111,0.000141,-9.1e-05,6e-05,-5.6e-05,9.9e-05,-4.4e-05,0.000169,-0.000318,0.000116,-0.000174,9.3e-05,0.000105,5.1e-05,1.7e-05,0.000163,8e-06,1e-05,-3.7e-05,-0.000147,-4.6e-05,-6.7e-05,-0.000181,-1.4e-05,-0.000252,0.00012,9e-06,-7.3e-05,0.000101,-0.000316,4.6e-05,-9.6e-05,0.000148,7.4e-05,0.00013,0.000127,-0.000276,0.000334,7.2e-05,9.7e-05,0.000134,-1.8e-05,-0.000123,1e-05,-0.00012,-0.00022,-3.9e-05,0.000298,-2.2e-05,-2.7e-05,-0.000469,-0.000127,8e-06,0.000436,7e-06,0.000135,-0.000186,0.000333,2.1e-05,-9.6e-05,8.7e-05,3.2e-05,-4.3e-05,-0.000428,0.000198,0.000412,-0.000421,-2.1e-05,-0.000143,5.5e-05,-1e-06,0.000326,3.2e-05,8.5e-05,-4.6e-05,0.00015,2e-04,-6.8e-05,-0.000127,-3e-05,6.2e-05,-0.000154,-0.00021,0.000125,0.000104,1e-05,-0.000146,-0.000219,6.7e-05,0.000166,-5.1e-05,-0.000102
-0.000163,0.000143,-5.8e-05,0.000175,-0.000114,2.3e-05,-8e-05,-0.000205,9.1e-05,-1.9e-05,2.4e-05,-9.7e-05,-0.000275,-3e-06,0.00021,4.4e-05,-0.000166,4.4e-05,-0.000121,-0.000178,1.8e-05,-8e-05,-3.8e-05,2.8e-05,0.000237,0.000155,0.000196,3.8e-05,0.000102,0.000171,0.00022,3.4e-05,-1.5e-05,2e-04,-0.000155,-0.000178,-0.000248,0.000187,-5.2e-05,0.000101,-0.000186,4.9e-05,-0.000174,-0.000217,-9.6e-05,0.00012,3.5e-05,6e-06,-6.2e-05,8.2e-05,-6.8e-05,-7.3e-05,9.5e-05,0.000121,-0.000131,-0.000132,8.7e-05,0.000214,-4.3e-05,-6.3e-05,1.3e-05,-8.1e-05,4.9e-05,-8e-06,-0.000136,0.000125,0.00012,-0.000109,-0.000197,-3.7e-05,-4.5e-05,0.000331,2.7e-05,0.000163,0.000273,0.000328,6.9e-05,-3.7e-05,7.4e-05,0.000268,6.2e-05,0.000198,-0.000144,3e-05,-0.00013,-0.000135,7e-06,0.000132,8.4e-05,-2e-06,0.000115,7e-05,6.8e-05,-1.6e-05,-0.000154,0.000249,0.000116,0.000133,-7.6e-05,-0.000155,-1e-04,-3.1e-05,1.9e-05,-1.9e-05,3.9e-05,-0.000104,1.7e-05,7.7e-05,-8.9e-05,4.7e-05,1.3e-05,6.9e-05,-9e-06,-0.000142,-2.5e-05,-0.000179,5e-05,-8.3e-05,-0.00011,0.000252,0.000211
0.000136,-0.00018,0.000102,5.9e-05,-9.9e-05,-2.7e-05,9.6e-05,0.00036,-6.8e-05,-0.000101,1.1e-05,2.4e-05,0.000218,-3e-06,-0.000199,4.3e-05,1.1e-05,-8.2e-05,-4.6e-05,0.000221,7.2e-05,-0.000118,-5.8e-05,8.9e-05,-9.7e-05,-3.1e-05,-4e-06,-8.3e-05,1.8e-05,-2e-06,-7.8e-05,-7.3e-05,4.3e-05,-0.000182,8.9e-05,0.000126,0.000156,-0.000217,-3e-05,9.9e-05,0.000118,0.000138,2.4e-05,0.000237,6e-06,-5e-06,-0.00014,-4.9e-05,4.2e-05,-2.4e-05,-2e-05,0.000194,-9.1e-05,-1.5e-05,-9.6e-05,9.2e-05,-6e-05,-2.3e-05,0.000111,-3e-05,0.00012,8.2e-05,-0.00018,1.8e-05,0.000165,0.000221,-0.000288,2.4e-05,0.000183,6.4e-05,0.000139,-6.8e-05,-7.4e-05,-0.000182,7.4e-05,-8e-05,-0.00021,-3.2e-05,-7e-05,-1e-04,-6.6e-05,-2.8e-05,6e-05,2.7e-05,6.4e-05,4.9e-05,7e-06,-0.000104,-0.000154,-9.9e-05,-0.000118,-2.7e-05,8.5e-05,-9.5e-05,8.9e-05,-2.8e-05,-0.000131,-2.8e-05,8e-06,0.000145,-9.1e-05,-0.000101,-2e-06,-6.3e-05,4.1e-05,3.9e-05,-8.5e-05,6.6e-05,2.7e-05,-2.8e-05,-5.8e-05,-5.2e-05,-3.3e-05,6.8e-05,8e-05,0.000241,-3.5e-05,8e-05,-5.6e-05,-0.000175,-0.000262
0,2.5e-05,-0.000158,-0.000141,7.3e-05,2.7e-05,-2e-05,-0.000116,1.3e-05,0.00016,6.5e-05,3.3e-05,-2.3e-05,-5.6e-05,-0.000116,0.000102,-2.1e-05,0.000263,1.9e-05,-0.000203,-1.4e-05,0.000113,1e-05,-1.3e-05,2.8e-05,-0.000151,-8e-05,1.7e-05,3e-06,-7e-05,-0.000123,4.7e-05,-1.2e-05,6.8e-05,-0.000183,-1.6e-05,-0.000148,0.00015,-4e-06,-0.000106,-3.3e-05,-4.1e-05,5.9e-05,-0.000136,0.000148,-5.3e-05,0.000173,5.8e-05,0.000205,-2.8e-05,-8.1e-05,-0.000125,8.7e-05,-3.1e-05,0.000102,-2e-06,-2e-06,-9.5e-05,-9.6e-05,-2.6e-05,-0.000131,-7.6e-05,0.000116,-5e-06,-0.000101,-0.000244,0.000197,4.4e-05,-2e-05,1.1e-05,-7e-05,-1e-05,0.000151,0.000154,3.4e-05,-2e-05,8.3e-05,0.000107,4.9e-05,0.00015,5.2e-05,-2e-04,3.4e-05,-2.1e-05,-3e-05,-2e-05,3e-05,3.8e-05,7.4e-05,0.000123,3e-05,-6.1e-05,-7.7e-05,0.000101,-0.000142,3.9e-05,-4.7e-05,-8e-05,1.6e-05,3.5e-05,4.5e-05,0.00011,-4.3e-05,-1e-05,1.2e-05,0.000109,7e-05,-3.4e-05,-5.4e-05,-2.6e-05,4.1e-05,-6.5e-05,-2.1e-05,6.3e-05,-8e-05,-7.2e-05,5.1e-05,-8e-05,0.000129,0.000155,0.000118
7e-05,-1.4e-05,0.000171,6.9e-05,6.9e-05,-4.5e-05,-3.9e-05,0,-0.000137,-0.000115,-4.2e-05,-3.1e-05,-7.8e-05,-1e-06,0.000192,1.7e-05,-4.3e-05,-0.000261,5.1e-05,7.9e-05,-3.3e-05,8.4e-05,2.8e-05,0.000119,-2.3e-05,2e-06,-5e-06,-2.7e-05,4.5e-05,7.6e-05,0.000133,2.4e-05,5.6e-05,1.1e-05,0.000147,-4.4e-05,0.000123,-4e-05,0.000113,1.7e-05,-5.9e-05,6.3e-05,8.3e-05,-5e-06,-0.000157,2.4e-05,5e-06,-3.4e-05,-0.000146,7.3e-05,5e-05,-7e-06,-1.9e-05,1.2e-05,1.1e-05,8.9e-05,-1.1e-05,-5.5e-05,7.6e-05,-4.5e-05,0.000102,5.1e-05,0.000107,2.6e-05,6.2e-05,-0.000108,-9.5e-05,-1.3e-05,-7.1e-05,-1.7e-05,7.2e-05,4.9e-05,-0.00022,-9.6e-05,-0.000102,0.000125,-9.3e-05,-7.5e-05,-7e-05,-5e-05,-2.9e-05,9.7e-05,-4.8e-05,-3.3e-05,1.8e-05,0.000145,-6.9e-05,-3.3e-05,-1.3e-05,-0.000113,-1e-06,7.4e-05,0.000181,-3.1e-05,6.6e-05,-6.6e-05,5.4e-05,0.000106,-5.4e-05,-0.000102,-7.2e-05,-2.9e-05,2.1e-05,0.000155,-1e-06,-0.000108,4.1e-05,-3.7e-05,3.2e-05,2.8e-05,6.9e-05,-2.6e-05,5.3e-05,-0.000162,8.9e-05,8.9e-05,3.4e-05,2.3e-05,-6.4e-05,-0.000144,-1.9e-05
2e-05,2.9e-05,-0.000116,2.6e-05,2.4e-05,2.6e-05,2.4e-05,0.000117,1.2e-05,-2.8e-05,3e-06,8.5e-05,0.000121,2.9e-05,-0.000125,3.9e-05,2.7e-05,0.000129,1.9e-05,-2.9e-05,-5.1e-05,-3.9e-05,3.6e-05,-9.9e-05,3.5e-05,3.6e-05,4e-05,-2.1e-05,-0.000113,6e-06,8e-06,-7e-06,-7.7e-05,-6e-05,-6.9e-05,4.7e-05,-0.000132,1.9e-05,-0.000126,1.8e-05,0.000115,-9.5e-05,-6.6e-05,-8e-06,6e-06,8e-06,-6e-06,4.9e-05,-9.7e-05,-1.8e-05,-3.4e-05,5.9e-05,-2.6e-05,-2.2e-05,1.7e-05,-1e-04,1e-05,-3.6e-05,6.5e-05,8.6e-05,-7.4e-05,0,-4.6e-05,-9e-06,-4.8e-05,0.000177,-0.000146,-5.8e-05,0.000153,-8e-06,1.7e-05,-7.9e-05,3.8e-05,2.4e-05,4.6e-05,-8.2e-05,2e-05,1.9e-05,0.000102,-3.7e-05,1e-05,0.000139,3.3e-05,1.7e-05,-4.3e-05,3.3e-05,8.3e-05,2.9e-05,2.5e-05,2.9e-05,-1.3e-05,1.2e-05,-0.000298,-0.000102,0.000145,-6.6e-05,9e-06,-6e-05,4e-06,1e-04,4.9e-05,3e-05,-4.9e-05,-7.3e-05,8.6e-05,1.4e-05,-6.5e-05,1.4e-05,-3.1e-05,-6.7e-05,-3.3e-05,4e-06,-7.4e-05,0.000118,-3e-05,-0.000118,1.9e-05,6.1e-05,1.8e-05,7.2e-05,1e-05
-4.4e-05,3.2e-05,-2.2e-05,4e-06,-5e-05,-3e-06,-2.2e-05,-5.8e-05,3.5e-05,6.1e-05,1.1e-05,-2.5e-05,-0.00011,5e-06,-2.7e-05,-3.7e-05,-1.8e-05,-6.7e-05,-4.5e-05,3.4e-05,9.8e-05,-0.000141,-1.9e-05,1.4e-05,-6.7e-05,1.3e-05,-0.000112,0.000118,5e-06,-3e-05,4.6e-05,-1.5e-05,9.3e-05,3.5e-05,1e-06,8e-06,0.000117,4.1e-05,6.5e-05,-2.2e-05,-4.2e-05,5.2e-05,-1.7e-05,-1.5e-05,1.9e-05,-2e-06,4.6e-05,2e-05,4.4e-05,-2.6e-05,2.8e-05,-1.7e-05,7.4e-05,6.9e-05,1.8e-05,3.6e-05,2.8e-05,0.000109,-7.6e-05,2.8e-05,3.1e-05,-3e-05,-8.4e-05,3e-06,2.5e-05,-2.4e-05,0.000221,2.8e-05,-4.5e-05,-1.1e-05,-3.1e-05,1.7e-05,5.5e-05,3.9e-05,-0.000121,-4.3e-05,9.5e-05,3e-05,-0.000125,-6.5e-05,-4.7e-05,-9.8e-05,8e-06,2.1e-05,4.9e-05,-0.00017,-2e-05,-0.000139,-1e-06,4e-06,-4e-06,-3.8e-05,4.2e-05,0.000159,-0.00015,0.00014,-7e-05,1.8e-05,1.4e-05,-6.4e-05,-5e-06,-6.1e-05,4.4e-05,-2.9e-05,-8.9e-05,-1.5e-05,4.6e-05,-1e-06,4.3e-05,1.5e-05,0,1.6e-05,6e-05,1e-06,6.4e-05,-2e-06,3e-05,-3.2e-05,-4.8e-05,1.4e-05,-2.7e-05
-2.8e-05,4.7e-05,7.6e-05,6e-06,-2.5e-05,2e-05,-1.2e-05,-0.000106,-9e-06,-4e-05,-3.5e-05,3e-05,-5e-05,4e-06,1e-06,-1.2e-05,3.8e-05,4.9e-05,4.9e-05,-7.7e-05,-3.4e-05,6.3e-05,-4.3e-05,1.3e-05,1.1e-05,-7e-06,5.8e-05,-5.3e-05,5e-05,-4.2e-05,-1.2e-05,0,-4.7e-05,1.2e-05,-4.4e-05,2.5e-05,-9.4e-05,-7.6e-05,1.5e-05,1.8e-05,-4e-06,1.9e-05,8e-06,8.4e-05,1.3e-05,1.1e-05,-6.8e-05,-5.7e-05,4.7e-05,3.2e-05,1.6e-05,5.1e-05,-7.2e-05,-0.000115,-3.6e-05,1.4e-05,-1.6e-05,7e-06,-1.1e-05,2e-06,0,-1e-06,6.6e-05,-3e-06,-1.4e-05,-7.9e-05,0,6.4e-05,3e-05,6e-06,6.1e-05,-1.5e-05,-6e-05,-6.2e-05,8.5e-05,2.2e-05,-1.4e-05,-1.6e-05,9.4e-05,3.7e-05,-6e-06,-7.9e-05,-3.8e-05,8e-06,-4.9e-05,6.3e-05,-4.1e-05,0.000192,2.6e-05,-2.9e-05,2.6e-05,-9e-06,0.000135,-5.2e-05,5.9e-05,-3.6e-05,6e-05,2e-05,3.1e-05,5.4e-05,1.4e-05,5.4e-05,-8e-06,-3.1e-05,-5.6e-05,-1.6e-05,-1.4e-05,-2e-06,-1.9e-05,3.2e-05,-2e-05,0.000108,-1.2e-05,-5.5e-05,-6.3e-05,-1.9e-05,-4e-06,-8e-06,2.8e-05,4.7e-05,4.6e-05
-2.1e-05,-5.3e-05,-9.5e-05,-1.3e-05,3.7e-05,-4e-06,5.1e-05,3.2e-05,5.1e-05,4e-05,7e-06,3.6e-05,0.000106,4e-06,0.000103,1e-06,-1.4e-05,-3.1e-05,-1.1e-05,0.000131,2e-06,5.8e-05,2.1e-05,-0.000105,-3.9e-05,-6.4e-05,5.7e-05,-5.8e-05,-6.6e-05,4.5e-05,-0.000108,5e-06,4.1e-05,-3e-05,6.9e-05,-8.7e-05,8.9e-05,3.7e-05,-2.1e-05,8e-06,-3e-06,-2.8e-05,2.8e-05,-0.00011,-3.5e-05,7e-06,-8.6e-05,1e-05,3.4e-05,-1.7e-05,2.9e-05,-4.3e-05,-4e-06,7.6e-05,-5e-06,-2.5e-05,2.1e-05,-4.6e-05,6e-05,-5e-06,5.3e-05,-1e-06,1.1e-05,-1.6e-05,3.2e-05,9.9e-05,-0.000111,-7.9e-05,3.8e-05,-1.1e-05,-5.6e-05,8.5e-05,-1.6e-05,5.2e-05,8e-05,5e-06,-8.2e-05,2.3e-05,-6.8e-05,-5e-06,7.5e-05,9.3e-05,-1.4e-05,-2.2e-05,5.6e-05,-1.5e-05,3e-05,-0.000124,6e-06,3.5e-05,-3.9e-05,3.9e-05,-9.8e-05,5.7e-05,-8.2e-05,3.3e-05,1.7e-05,-2.3e-05,1.3e-05,-2.8e-05,5e-06,-2.9e-05,3.6e-05,5.7e-05,7.6e-05,3.3e-05,-1.7e-05,3.3e-05,3.7e-05,-2.3e-05,-1.1e-05,-9.1e-05,-4.9e-05,2.8e-05,5.7e-05,8.7e-05,1.9e-05,-1.2e-05,1e-06,-6.4e-05,-5.5e-05
3e-06,1.8e-05,5.8e-05,-1.2e-05,-1.2e-05,-3e-06,-2.8e-05,3.3e-05,-9e-06,-2e-06,2.1e-05,8e-06,-4.9e-05,-1.8e-05,-9e-05,4e-05,2.1e-05,2.8e-05,-4.5e-05,-0.000141,-4.6e-05,6.6e-05,1.2e-05,0.000125,6.7e-05,-2e-05,-5.7e-05,6.8e-05,3.1e-05,2.8e-05,-1.5e-05,-7e-06,-2.7e-05,2.6e-05,-8e-06,4.5e-05,-9.2e-05,-4.2e-05,-4.5e-05,0,-3.5e-05,-3e-06,-5e-06,6.1e-05,6.7e-05,-9e-06,4.9e-05,-1.2e-05,-6.6e-05,-2.8e-05,-2.2e-05,-1e-05,3.1e-05,-2.2e-05,2.3e-05,3e-05,-1.8e-05,-7e-06,-4.3e-05,-3.6e-05,-8.1e-05,-9e-06,-4.3e-05,1.3e-05,-1.2e-05,-2.8e-05,0.000113,-1e-06,8e-06,2e-06,8e-06,-9e-06,3.1e-05,-2.4e-05,-5.6e-05,-6e-06,6.8e-05,-3.1e-05,3e-05,5.4e-05,-2.2e-05,4.8e-05,9.2e-05,1.1e-05,-5.2e-05,-3.9e-05,1e-06,5.6e-05,1e-06,-3.1e-05,2.2e-05,-3.4e-05,3.7e-05,1.2e-05,5.2e-05,-4.2e-05,-3.9e-05,1.1e-05,3e-06,-1.9e-05,-5.7e-05,-1.1e-05,-4.1e-05,1.4e-05,-8.2e-05,-3.3e-05,1.1e-05,-2.8e-05,1.8e-05,1e-05,0,2.9e-05,5.1e-05,7e-06,-6.2e-05,-7.2e-05,-1.7e-05,2.8e-05,-1.2e-05,3.8e-05,4.4e-05
-1e-06,-2.8e-05,-8e-06,1.3e-05,1e-05,-6e-06,-3e-06,-7.9e-05,1e-06,-4.9e-05,4e-06,-2.6e-05,1.3e-05,-1e-06,-1.3e-05,8e-06,3e-06,-2.2e-05,1.1e-05,0.000107,2.6e-05,-3.2e-05,-2.9e-05,-3.6e-05,-8e-05,6.3e-05,3.4e-05,-4.9e-05,1.5e-05,-4.1e-05,8.4e-05,1.4e-05,3.7e-05,2.6e-05,9e-06,1.7e-05,6.4e-05,5.3e-05,6.7e-05,-2e-06,5.1e-05,-5.9e-05,-2.8e-05,2.4e-05,-9.9e-05,-4e-06,-1.7e-05,1.8e-05,-1.9e-05,3.1e-05,-2.2e-05,4.6e-05,-2.5e-05,-2.2e-05,-3.2e-05,-3e-06,0,4e-06,-1.6e-05,2.1e-05,7.2e-05,-5.3e-05,5e-06,-1e-05,9e-06,-9.2e-05,-1.5e-05,5.6e-05,-6.3e-05,-5e-06,-9e-06,1.8e-05,2.4e-05,1.6e-05,-2e-06,-3e-06,4e-06,8e-06,-5e-06,-5.5e-05,2.2e-05,-9.3e-05,-0.000109,-8e-06,4.2e-05,0.000119,4.7e-05,-2.9e-05,-1.3e-05,2.6e-05,-2.1e-05,1e-06,-2.4e-05,-4.9e-05,7.9e-05,1e-05,1e-06,-1.2e-05,6e-06,-3e-06,4.1e-05,1.8e-05,1e-05,-6.3e-05,-6e-06,5e-05,9e-06,-5e-06,8e-06,5e-06,6e-06,-5.6e-05,4e-06,-1.9e-05,3.9e-05,4e-05,3e-06,-2e-05,2e-05,-4.1e-05,-2.1e-05
3.8e-05,-3.1e-05,-9e-06,0,6e-06,-1e-06,2.1e-05,8.3e-05,4e-06,1.9e-05,-1.8e-05,1.1e-05,3.9e-05,4e-06,0.00011,-1e-05,-1.4e-05,1.4e-05,2.3e-05,-6.5e-05,3.6e-05,-4.7e-05,1.4e-05,9e-06,3.3e-05,-1e-05,-2.1e-05,-1.6e-05,-3.4e-05,0,3.5e-05,-6e-06,-3.3e-05,-5e-05,-2e-05,-5e-05,-4.7e-05,-1.4e-05,-3.6e-05,-1.1e-05,-9e-06,8e-06,1.1e-05,-4.2e-05,4e-05,5e-06,0,-5e-06,5e-06,-1.6e-05,1.8e-05,-2.2e-05,3e-05,5e-05,6.3e-05,-3.1e-05,6e-06,5e-05,3.2e-05,4e-06,-5e-05,5.8e-05,4.4e-05,2.5e-05,-2.4e-05,0.000102,-0.000125,-3.6e-05,6.1e-05,-4e-06,-2.8e-05,-3.5e-05,-4.3e-05,-1.1e-05,-2e-06,-2e-06,-3.2e-05,9e-06,-6e-06,-3.2e-05,-6.2e-05,-2.4e-05,8.7e-05,-1.3e-05,-2.5e-05,-2.7e-05,-1.8e-05,5.5e-05,1.1e-05,0,2.3e-05,1.6e-05,1.9e-05,-1.6e-05,-0.000138,-3.7e-05,3.9e-05,1e-06,-1.2e-05,4.4e-05,-7e-06,-1.1e-05,-1.8e-05,-4e-06,5e-05,-1.7e-05,-1.8e-05,7e-06,9e-06,-3.5e-05,1.6e-05,-3e-06,-2.8e-05,-6e-06,-5.4e-05,2e-05,-1.3e-05,-2.3e-05,3e-06,4.6e-05,-5e-06
6e-06,3.4e-05,-4e-06,-3e-06,-1.3e-05,9e-06,-3.7e-05,3.2e-05,3e-06,2.2e-05,-1e-06,3e-06,-5.6e-05,5e-06,-5.5e-05,-2.1e-05,4e-06,2.5e-05,-1.6e-05,1.9e-05,-2.8e-05,-4e-06,9e-06,3.4e-05,-5.1e-05,-1e-05,-4.9e-05,5.3e-05,3.8e-05,1.5e-05,-5.5e-05,-4e-06,3.1e-05,3.6e-05,5.5e-05,1.4e-05,4.1e-05,9e-06,-1.6e-05,-6e-06,-2.5e-05,2.5e-05,-6e-06,2.3e-05,1.4e-05,-4e-06,5.1e-05,-4e-06,5.2e-05,-2.5e-05,-3.4e-05,-4e-06,-2e-06,-5.9e-05,-6.3e-05,4.4e-05,-6e-06,-3.2e-05,-9e-06,1.4e-05,2.5e-05,-6e-05,-3.1e-05,-2.9e-05,1.2e-05,2e-05,0.000105,-2.2e-05,-9.4e-05,1e-06,2.6e-05,-1.4e-05,4.6e-05,-5e-06,0,8e-06,3.1e-05,-1.3e-05,2.1e-05,8e-06,2.6e-05,8.8e-05,-3.4e-05,9e-06,1.3e-05,-6.1e-05,-2.9e-05,-7.1e-05,-1.9e-05,-6e-06,-1.9e-05,-7e-06,6.6e-05,6.7e-05,5.5e-05,1.3e-05,-3e-05,1e-05,-8e-06,-5.6e-05,-1e-06,1.4e-05,1.6e-05,2.3e-05,-3.1e-05,-1.4e-05,8e-06,0,1e-06,-2e-06,0,1.6e-05,2.7e-05,3.1e-05,4e-05,-1.5e-05,-1.6e-05,2.4e-05,2e-06,2.3e-05,1e-06
8e-06,-3.7e-05,8e-06,-2e-05,4e-06,1e-06,2.1e-05,-4.1e-05,-1.2e-05,-2.6e-05,9e-06,-3.2e-05,0,5e-06,-8e-06,4e-06,-1.4e-05,-5.9e-05,-4e-06,-1e-06,5e-06,3.8e-05,-2e-05,-4.2e-05,3.3e-05,-1.7e-05,2.1e-05,-3.7e-05,-3e-06,7e-06,0,4e-06,-1.5e-05,-1e-05,-6.1e-05,8e-06,-3.2e-05,-2.3e-05,2.5e-05,1.7e-05,1.4e-05,-1e-06,9e-06,-2e-05,-2e-05,4e-06,-1.2e-05,0,-2.3e-05,1.3e-05,2.2e-05,9e-06,-2e-06,4.1e-05,1.8e-05,-5e-06,-3e-06,-4.8e-05,-9e-06,0,1.6e-05,2.5e-05,-3.7e-05,2.1e-05,-3e-06,-0.000101,5e-06,3.9e-05,4e-05,-4e-06,-2.8e-05,1.6e-05,-1e-06,1.2e-05,-2.7e-05,4e-06,-1.9e-05,4e-06,-3.6e-05,1.3e-05,0,1e-06,-1.1e-05,1.4e-05,-8e-06,1.2e-05,1.5e-05,6.5e-05,0,3e-06,4e-06,-8e-06,-6.3e-05,-7.9e-05,-2.6e-05,3.4e-05,-1e-05,-5e-06,1e-05,2.9e-05,3.2e-05,-2.4e-05,-4e-06,3.3e-05,3.3e-05,-4e-06,9e-06,0,6e-06,1.9e-05,-4e-06,-2.6e-05,-2.2e-05,-2.8e-05,-4.7e-05,-3.5e-05,-1.1e-05,4e-06,-6e-06,-5.5e-05,2.1e-05
-2.5e-05,3.6e-05,-1.4e-05,3e-06,-1.8e-05,3e-06,7e-06,-1.8e-05,-2.2e-05,3e-05,5e-06,1e-06,4.9e-05,-3e-06,2.6e-05,2.2e-05,3e-06,6.8e-05,1.1e-05,1.9e-05,-1.2e-05,1.6e-05,4e-06,4e-06,-3.1e-05,-1.4e-05,7e-06,4e-06,-3.3e-05,-1.3e-05,-4e-06,-1e-06,1.1e-05,-2e-05,6.2e-05,1.4e-05,1.9e-05,-4e-06,4e-06,-9e-06,-1e-06,4e-06,-2.6e-05,3.6e-05,1.2e-05,8e-06,-3.3e-05,7e-06,-1.3e-05,-8e-06,-1.1e-05,-1.2e-05,1.4e-05,-9e-06,-8e-06,-2.1e-05,-6e-06,3.3e-05,1.6e-05,-1.8e-05,-2.8e-05,-2e-05,3.5e-05,-1.7e-05,6e-06,5e-05,-7.3e-05,-7e-06,-1.4e-05,3e-06,1.2e-05,-2e-06,-1.2e-05,1e-06,5.5e-05,1e-06,-1.7e-05,-3e-06,4.7e-05,2.3e-05,1.9e-05,-8.1e-05,1e-05,-1e-06,0,-1.4e-05,-1.2e-05,-3.6e-05,-1.8e-05,-3e-06,1e-05,1.7e-05,-3.7e-05,3.3e-05,4.5e-05,-1e-05,2.4e-05,-2e-06,6e-06,-3e-06,-4e-05,3e-05,1.5e-05,-4.3e-05,4e-06,-5e-06,-1.4e-05,8e-06,-1.5e-05,-1.8e-05,4e-06,1.3e-05,-1.7e-05,1e-06,3.8e-05,2.2e-05,-1.4e-05,-5e-06,7e-06,4.7e-05,-2.3e-05
-3e-06,7e-06,-1.3e-05,1.3e-05,2e-05,-5e-06,-2e-05,4e-05,-1.1e-05,-1.2e-05,-1.3e-05,-1.2e-05,-3.7e-05,-8e-06,2.7e-05,9e-06,-2e-06,-7.3e-05,1.4e-05,-3.4e-05,4e-06,3e-06,1.2e-05,-2.2e-05,-1.3e-05,5e-05,-2e-06,2e-05,1.6e-05,-1e-06,1.8e-05,-5e-06,-3e-06,2.2e-05,-6.4e-05,-1.7e-05,-7e-06,1.4e-05,-2.8e-05,0,6e-06,5e-06,6e-06,-2.7e-05,-7e-06,-1e-05,6e-06,1.4e-05,1e-06,-2e-05,1.1e-05,1.1e-05,-2.6e-05,-2e-06,8e-06,3e-06,-3e-06,3.2e-05,-8e-06,7e-06,3e-06,1e-05,2.5e-05,1.9e-05,5e-06,4.5e-05,8.8e-05,-2.8e-05,-2e-05,-7e-06,6e-06,1.8e-05,-1.9e-05,-2.9e-05,-3.6e-05,1e-06,4.1e-05,8e-06,-4.5e-05,-3e-06,7e-06,1.4e-05,9e-06,-1.2e-05,0,3.4e-05,2.2e-05,-1.2e-05,8e-06,9e-06,-2.2e-05,-5e-06,7.4e-05,4e-06,2.4e-05,-6e-06,-5e-06,7e-06,-5e-06,-6e-06,9e-06,-2.1e-05,-9e-06,-1.6e-05,3e-06,1.6e-05,1e-05,1e-06,1e-06,1.6e-05,-7e-06,-1e-06,2.5e-05,2.6e-05,-3.5e-05,-3.8e-05,0,-5e-06,-7e-06,-4.4e-05,1.1e-05
-1.1e-05,-4e-06,2.2e-05,-1e-05,4e-06,0,2.4e-05,-5.8e-05,1.5e-05,-3.1e-05,0,-9e-06,1.3e-05,-2e-06,-4.2e-05,0,4e-06,8.6e-05,-1.9e-05,4.3e-05,4e-06,-3.7e-05,-1.1e-05,3.2e-05,2e-06,-5e-06,-1e-06,-1.8e-05,-3e-06,1.2e-05,1.1e-05,1e-06,6e-06,0,7.8e-05,-4e-06,-2e-06,-4e-06,2.7e-05,1e-05,-6e-06,-9e-06,3e-06,-1e-05,-2e-05,0,-3.1e-05,-1.4e-05,-1e-05,1.6e-05,5e-06,-2e-06,-1e-06,-2e-06,3e-06,1.2e-05,2e-06,1.4e-05,-9e-06,-2e-05,1.2e-05,-2.6e-05,-3.4e-05,-1.3e-05,-1.2e-05,-6.8e-05,-1.6e-05,1.4e-05,-6e-06,3e-06,-6e-06,-7e-06,2.3e-05,4.3e-05,8e-06,9e-06,-1.2e-05,0,3.8e-05,-3e-05,-2.7e-05,7.3e-05,-2.4e-05,1e-06,0,3.6e-05,-2e-06,3.2e-05,-1.4e-05,-1.2e-05,1.8e-05,-9e-06,-4.6e-05,-1.1e-05,-9.1e-05,-3.3e-05,-1.7e-05,-9e-06,-7e-06,2.2e-05,0,8e-06,2e-06,2.1e-05,2.1e-05,-1.3e-05,3e-06,-1.8e-05,-1.5e-05,3e-06,-6e-06,1.9e-05,3e-06,-2.3e-05,3.5e-05,5.6e-05,-3e-06,7e-06,3e-06,5.5e-05,-3e-06
3e-06,1.3e-05,-1.8e-05,5e-06,-1.2e-05,-3e-06,-1.2e-05,1.8e-05,1.1e-05,3.9e-05,8e-06,2e-06,1.6e-05,2e-06,-2e-06,-5e-06,3e-06,-7.9e-05,-4e-06,-2.9e-05,1.6e-05,-1.7e-05,3e-06,-2.1e-05,2e-06,-1.4e-05,7e-06,3e-06,-1.3e-05,-9e-06,-2.8e-05,7e-06,-7e-06,-1.8e-05,-7.7e-05,1.9e-05,9e-06,2.3e-05,-5e-06,-1.2e-05,-8e-06,4.4e-05,1.2e-05,3.5e-05,2.4e-05,1e-06,-2.7e-05,-1e-06,2.3e-05,-7e-06,-8e-06,-1.4e-05,6e-06,3e-06,-1e-06,-1.5e-05,0,-3.5e-05,1e-05,5e-06,-1.7e-05,2.3e-05,-7e-06,2e-06,3e-06,2.3e-05,-7.7e-05,1.9e-05,2.1e-05,0,2.1e-05,6e-06,-1.9e-05,-4.2e-05,6e-06,-1e-05,-4.4e-05,-8e-06,-2.7e-05,-1.3e-05,2e-05,-2.8e-05,2.5e-05,9e-06,-3e-06,-5.5e-05,-1.6e-05,-1.7e-05,9e-06,3e-06,-1e-06,7e-06,3e-06,-1.4e-05,6.4e-05,5.5e-05,1.7e-05,6e-06,-6e-06,-2.8e-05,-1.5e-05,-2e-06,-5e-06,1.7e-05,-1.8e-05,1.4e-05,-1e-05,1.1e-05,-3e-06,-2.3e-05,4e-06,8e-06,-1.7e-05,0,-2.7e-05,-1e-05,6e-06,1e-06,-6e-06,-2.1e-05,-5e-06
0,-1.7e-05,-3e-06,0,7e-06,2e-06,-9e-06,3e-05,5e-06,-8e-06,0,6e-06,-3.5e-05,2e-06,4.7e-05,-6e-06,2e-06,5e-05,1.9e-05,-3e-06,-2.2e-05,-2e-06,2e-06,2.3e-05,-2e-06,-3e-06,-2.4e-05,1e-06,1.7e-05,-4e-06,-3.3e-05,-2e-06,1e-06,1.7e-05,4.7e-05,-1.9e-05,-1.4e-05,-3.2e-05,-1.1e-05,0,1.1e-05,-2.4e-05,-1.3e-05,-2.9e-05,4e-06,0,3.8e-05,-1.2e-05,-1.2e-05,-1.9e-05,1.6e-05,1.7e-05,-4e-06,8e-06,8e-06,9e-06,0,-4.4e-05,0,1.1e-05,8e-06,-1.7e-05,3.2e-05,-2e-06,-8e-06,3.9e-05,6.1e-05,-1.9e-05,-1e-05,1e-06,-1.2e-05,-1.5e-05,-8e-06,3.6e-05,8e-06,-1.1e-05,3e-05,5e-06,2.4e-05,2.2e-05,-2.7e-05,-6.3e-05,-4e-06,2e-06,3e-06,1.1e-05,2.2e-05,-6e-06,-4e-06,-2e-06,-1.6e-05,2e-06,1.5e-05,6e-06,-1.3e-05,-7e-06,2e-06,-2e-06,-1e-05,8e-06,3.6e-05,1e-06,-1e-06,-9e-06,-1.2e-05,6e-06,3e-06,2e-06,-1e-05,0,2e-06,-7e-06,1.6e-05,9e-06,3.4e-05,-2.4e-05,7e-06,-7e-06,-3e-06,-3e-06,8e-06
1.6e-05,-8e-06,2.9e-05,-4e-06,-1e-05,1e-06,1.9e-05,-7e-06,8e-06,-1.3e-05,-7e-06,-1.1e-05,5e-06,3e-06,-4.8e-05,0,0,-2e-05,-7e-06,3.2e-05,-4e-06,2.8e-05,-3e-06,7e-06,-4e-06,-2e-06,-2e-06,1.2e-05,-2e-06,6e-06,4.1e-05,0,6e-06,1e-06,-4e-05,4e-06,1.7e-05,1.6e-05,7e-06,4e-06,6e-06,1.1e-05,-8e-06,5e-06,-2.7e-05,4e-06,1.2e-05,2e-06,8e-06,1.5e-05,-1.7e-05,-1.2e-05,1.3e-05,-2.1e-05,-1.1e-05,-5e-06,1e-06,2.5e-05,-1.1e-05,-4e-06,9e-06,3e-06,-8e-06,1e-06,1.5e-05,-6.3e-05,-2e-06,-1.1e-05,2e-05,0,8e-06,3e-06,2.1e-05,-3.1e-05,-2.4e-05,1.2e-05,3e-06,-1e-06,-1.8e-05,1.1e-05,2.4e-05,4.2e-05,-2.4e-05,-1e-05,-1e-06,5e-06,-1.3e-05,3e-06,1.1e-05,3e-06,1.9e-05,-9e-06,-4.1e-05,-1.5e-05,2e-05,-1.5e-05,-1.2e-05,-8e-06,-2e-06,1.7e-05,-1.5e-05,2e-06,1e-06,-3e-05,2.5e-05,-1.7e-05,3e-06,1e-06,-1e-06,4e-06,0,-3e-05,-9e-06,-5e-06,-2.6e-05,3.3e-05,1e-05,0,-1e-06,-5e-06,-1e-06
3e-06,0,-4e-05,1.2e-05,9e-06,0,-1.6e-05,-6e-06,-8e-06,1.8e-05,0,1.3e-05,2.8e-05,-2e-06,1e-05,1e-05,0,8e-06,-1.5e-05,-4.5e-05,1.6e-05,1.3e-05,3e-06,-3.4e-05,5e-06,2.5e-05,1.6e-05,-1e-06,-1e-05,4e-06,2.4e-05,-1e-06,-7e-06,-1.8e-05,4.1e-05,2e-06,-2.2e-05,-2e-05,5e-06,-4e-06,-1e-05,-1.9e-05,3e-06,4e-06,2.6e-05,-2e-06,2e-06,5e-06,-1.5e-05,2e-06,7e-06,2e-06,-2e-06,2.4e-05,-7e-06,-6e-06,-1e-06,3.3e-05,9e-06,-2e-06,-2.8e-05,1e-06,-2.7e-05,8e-06,-1e-05,1.3e-05,-4.2e-05,2.2e-05,8e-06,-1e-06,1e-06,-6e-06,-8e-06,2e-05,9e-06,-4e-06,-5e-06,-1e-06,1.2e-05,2e-05,-2.2e-05,5.1e-05,3.9e-05,-1e-06,-1e-06,-4.1e-05,0,2.4e-05,-1e-06,6e-06,-7e-06,4e-06,6.8e-05,4.4e-05,-5e-06,-2.3e-05,6e-06,1e-05,8e-06,-1.4e-05,2e-06,-8e-06,2e-06,1.7e-05,-3.4e-05,7e-06,-7e-06,1e-06,-6e-06,-1e-05,3e-06,-4e-06,-1.1e-05,-2e-06,2.7e-05,-2.5e-05,1e-05,-2e-06,2e-06,1e-05,-4e-06
-1e-06,-1e-06,2.9e-05,0,-2e-06,0,4e-06,2.3e-05,4e-06,-1.9e-05,8e-06,1.5e-05,-2.9e-05,-3e-06,1e-06,1e-06,0,-7e-06,1e-05,4.2e-05,-6e-06,-2.1e-05,-3e-06,3.6e-05,9e-06,0,-1.5e-05,-1.6e-05,1.1e-05,-3e-06,-1.4e-05,-3e-06,8e-06,2.3e-05,-4.7e-05,-2e-06,3e-05,1.8e-05,-1.6e-05,5e-06,-5e-06,-1.3e-05,8e-06,-4e-06,-2.3e-05,-1e-06,2.7e-05,0,-1e-06,-1.3e-05,-1.3e-05,6e-06,2e-06,-2.1e-05,1.5e-05,1.5e-05,4e-06,1.4e-05,4e-06,-1.4e-05,2.3e-05,4e-06,1.8e-05,-4e-06,1e-05,5.5e-05,6.5e-05,-3e-06,-8e-06,0,-9e-06,9e-06,-2e-06,-6e-06,4e-06,-1.1e-05,2.3e-05,-2e-06,-5e-06,-2.7e-05,2e-05,-5.2e-05,-3.4e-05,5e-06,4e-06,5.3e-05,3e-06,-4.2e-05,9e-06,-1.4e-05,-8e-06,5e-06,-3.9e-05,-2.7e-05,-6.8e-05,9e-06,6e-06,-8e-06,6e-06,-5e-06,5e-06,1.1e-05,7e-06,1.9e-05,-5e-06,-6e-06,6e-06,-4e-06,0,1.1e-05,2e-06,-1.1e-05,2.4e-05,3e-06,-2.5e-05,-9e-06,7e-06,5e-06,6e-06,-3e-06,0
-4e-06,4e-06,-1.6e-05,-5e-06,1e-06,-1e-06,1.1e-05,-2.2e-05,-8e-06,1e-06,-1e-06,-1e-05,1.5e-05,-2e-06,8e-06,-9e-06,-5e-06,-3e-06,9e-06,-2.6e-05,2e-06,-2.7e-05,-3e-06,-3.2e-05,-1e-06,-1.8e-05,1.4e-05,1.8e-05,-4e-06,-7e-06,-1.1e-05,4e-06,-8e-06,-9e-06,3.8e-05,4e-06,-3.1e-05,5e-06,1.3e-05,0,7e-06,1.7e-05,-2e-06,7e-06,7e-06,-2e-06,-2.1e-05,4e-06,3e-06,1.2e-05,1.2e-05,-8e-06,2e-06,1.2e-05,0,-2e-06,1e-06,-2.2e-05,-8e-06,2e-06,-7e-06,4e-06,2e-05,-1e-06,-1.5e-05,-5.1e-05,-1.4e-05,-1.9e-05,2.3e-05,0,9e-06,4e-06,6e-06,-2e-06,-1.2e-05,1e-05,-2.1e-05,-3e-06,-6e-06,-6e-06,1e-06,-3.7e-05,1.1e-05,1e-06,-6e-06,2e-05,-1.5e-05,3.8e-05,0,1.5e-05,2e-05,-5e-06,-1.2e-05,1e-06,7.5e-05,2.6e-05,-1.2e-05,4e-06,-1e-06,1.4e-05,-2.3e-05,-9e-06,-2e-06,-5e-06,1.7e-05,2e-06,1e-06,-2e-06,0,2e-06,-4e-06,2.5e-05,-3e-06,2e-06,2.3e-05,2.1e-05,6e-06,1e-06,-2e-06,8e-06,5e-06
-8e-06,1.4e-05,-3e-06,2e-06,5e-06,0,-1.8e-05,-2.2e-05,-5e-06,2.5e-05,-6e-06,3e-06,1.1e-05,1e-06,-1.7e-05,-3e-06,1e-06,2.1e-05,-1.2e-05,1.5e-05,-3e-06,6e-06,5e-06,9e-06,0,-1e-06,4e-06,2e-06,-9e-06,6e-06,-1.8e-05,2e-06,6e-06,-1.2e-05,-3.7e-05,-4e-06,2.9e-05,-8e-06,3e-06,-4e-06,3e-06,-1.5e-05,-4e-06,-1.3e-05,1.2e-05,2e-06,-3.2e-05,-1e-06,1.3e-05,4e-06,-6e-06,8e-06,-1.6e-05,1e-06,-7e-06,-1.1e-05,0,-3.8e-05,2e-06,2e-06,-4e-06,-4e-06,-2.3e-05,-4e-06,1.3e-05,-1.3e-05,-4.6e-05,1.3e-05,-1.8e-05,0,-1.1e-05,-3e-06,6e-06,-1e-06,1.7e-05,1e-06,-1.9e-05,6e-06,1.5e-05,-3e-06,-5e-06,5.8e-05,1.1e-05,0,9e-06,-4.8e-05,1.8e-05,-1.9e-05,4e-06,-7e-06,-2e-05,1e-06,4e-05,1.8e-05,-2.3e-05,-8e-06,2e-06,2e-06,-3e-06,-1.3e-05,2.4e-05,5e-06,0,-2.3e-05,-2.5e-05,5e-06,-4e-06,0,3e-06,-1.4e-05,-3e-06,0,-9e-06,-8e-06,-2.4e-05,-1.6e-05,0,-4e-06,0,-1.2e-05,-1e-05
-4e-06,-2e-06,1.1e-05,0,-7e-06,0,1.2e-05,1.9e-05,-5e-06,-2.5e-05,-1e-06,1.1e-05,-2.6e-05,4e-06,2e-06,2e-06,0,-3.5e-05,-7e-06,-2.1e-05,0,2.3e-05,0,1.3e-05,5e-06,4e-06,-1.3e-05,-1.7e-05,9e-06,3e-06,0,-4e-06,-9e-06,1.8e-05,4.1e-05,5e-06,-3.3e-05,8e-06,-1.6e-05,4e-06,1e-06,1e-06,-2e-06,1.3e-05,-1.4e-05,0,1.3e-05,4e-06,-3e-06,-9e-06,-4e-06,-4e-06,0,-1.4e-05,3e-06,8e-06,0,2e-05,5e-06,1.1e-05,8e-06,1.9e-05,-1.3e-05,4e-06,-1.2e-05,5.5e-05,4.7e-05,1.1e-05,1.2e-05,1e-06,3e-06,1e-06,-1e-05,1.2e-05,-5e-06,-7e-06,3.3e-05,-2e-06,-1.9e-05,2.5e-05,0,2.2e-05,-1.4e-05,0,-9e-06,9e-06,-4e-06,1e-06,-3e-06,3e-06,1.2e-05,5e-06,-3e-05,-5e-06,4e-06,-2e-06,9e-06,-3e-06,-2e-06,1.6e-05,-5e-06,-2e-06,-9e-06,5e-06,1.2e-05,-1e-06,3e-06,7e-06,1e-06,1e-06,1e-06,2e-06,9e-06,6e-06,2.1e-05,2.2e-05,-2e-06,1e-06,1e-06,-6e-06,1.2e-05
0,2e-06,-2e-05,1e-06,0,1e-06,-1e-06,-1.2e-05,-4e-06,3e-06,6e-06,-9e-06,6e-06,1e-06,1.5e-05,-1e-06,-1e-06,4.5e-05,1.4e-05,3.8e-05,2e-06,1.8e-05,-4e-06,-1.5e-05,8e-06,1.1e-05,8e-06,9e-06,-3e-06,-2e-06,3.5e-05,-1e-06,9e-06,-8e-06,-4.6e-05,-2e-06,3.7e-05,-2.5e-05,1.1e-05,-3e-06,-7e-06,1e-06,9e-06,-2e-06,-3e-06,0,-1e-05,0,-2.6e-05,1.4e-05,1.3e-05,0,2e-06,1.6e-05,-1.1e-05,2e-06,-2e-06,3.3e-05,-4e-06,5e-06,-1e-06,-1.2e-05,2.5e-05,-3e-06,1.7e-05,-3.2e-05,-2.2e-05,-1.9e-05,-1.2e-05,-2e-06,2e-06,-9e-06,7e-06,-2.2e-05,2e-06,6e-06,-2e-06,-2e-06,2.3e-05,1e-06,-2.5e-05,-6.2e-05,1e-06,0,8e-06,-5e-06,-3e-06,-5e-06,0,1e-06,2e-06,-4e-06,9e-06,-2e-05,-6e-06,-1e-05,-7e-06,3e-06,-3e-06,-1.2e-05,0,0,3e-06,2.4e-05,8e-06,4e-06,-2e-06,-3e-06,5e-06,-5e-06,-2e-06,1e-06,-1e-05,2e-06,-2.2e-05,4e-06,-6e-06,3e-06,2e-06,2.3e-05,-8e-06
7e-06,-1e-06,2.4e-05,-2e-06,0,0,-1.1e-05,1e-06,1.1e-05,1.7e-05,0,-1e-05,2.2e-05,-1e-06,-1.7e-05,-1e-06,1e-06,-5.5e-05,4e-06,-5.8e-05,1e-06,-1e-05,2e-06,1.4e-05,8e-06,0,3e-06,4e-06,-3e-06,1e-06,4e-06,2e-06,-1.1e-05,-8e-06,5.1e-05,-3e-06,-3.6e-05,2.6e-05,7e-06,-2e-06,-3e-06,-6e-06,-3e-06,-1.2e-05,1.5e-05,1e-06,4e-06,-3e-06,1.2e-05,9e-06,-1.3e-05,3e-06,-1e-06,-9e-06,1.6e-05,-3e-06,0,-9e-06,-2e-06,-9e-06,-1.4e-05,1.6e-05,4e-06,8e-06,-1.5e-05,-2.3e-05,-2.5e-05,-4e-06,7e-06,2e-06,-7e-06,7e-06,0,3e-05,-1.5e-05,4e-06,-1.7e-05,3e-06,-2.4e-05,8e-06,2.7e-05,-8e-06,1.8e-05,-1e-06,-8e-06,-1.1e-05,7e-06,2.6e-05,-6e-06,-1.1e-05,-1e-05,-3e-06,5e-06,1.8e-05,-3.9e-05,9e-06,-4e-06,-3e-06,3e-06,-8e-06,1.1e-05,2e-06,-1e-06,-5e-06,-1.2e-05,-4e-06,0,-1e-06,4e-06,-4e-06,0,-1.8e-05,-5e-06,-6e-06,2e-05,-2.9e-05,-9e-06,0,-2e-06,-3.1e-05,5e-06
