-0.055387,-0.05579,-0.004515,-0.000385,-0.004962,-0.022474,-0.039422,-0.054749,-0.073475,-0.15386,-0.1617,-0.143373,-0.136285,-0.141983,-0.151511,-0.104626,-0.030562,-0.00657,-0.003563,-0.002863,-0.002786,-0.001844,-0.001189,-0.000411,-0.000219,-0.000181,-0.000172,-0.000275
-0.061249,-0.065878,-0.004958,0.00022,-0.00172,-0.010369,0.001252,0.017643,0.086133,0.15219,0.177363,0.180738,0.163042,0.157033,0.175306,0.122293,0.035414,0.006813,0.003474,0.002946,0.003224,0.001892,0.000864,0.000222,0.000166,0.000164,0.000164,9.1e-05
-0.005635,-0.007219,-0.000423,3e-06,-0.000809,-0.002005,-0.005044,-0.006655,-0.025036,-0.009222,-0.003782,-0.027849,-0.038239,-0.040389,-0.01613,-0.022662,-0.009204,-0.001716,-0.001304,-0.00069,-0.000332,-9.7e-05,-0.000272,-8.7e-05,-4.4e-05,-6e-05,-5.2e-05,-3.8e-05
0.05397,0.055814,0.004284,-0.000194,0.003149,0.016381,0.006876,-0.012472,-0.08323,-0.1394,-0.157143,-0.147007,-0.124667,-0.122301,-0.161079,-0.10516,-0.030408,-0.006637,-0.003013,-0.002607,-0.003052,-0.001975,-0.00072,-0.000172,-0.00018,-0.000174,-0.000189,-0.000147
0.049607,0.053188,0.004215,0.000211,0.004958,0.021659,0.032291,0.044385,0.07358,0.130423,0.128027,0.141924,0.137305,0.150964,0.147911,0.113081,0.035815,0.006704,0.004013,0.002886,0.00277,0.00163,0.000975,0.000255,0.000158,0.000162,0.000147,0.000147
-0.014459,-0.01151,-0.000888,9.2e-05,-0.003751,-0.016894,-0.011502,-0.002883,0.003504,0.030513,0.041198,0.024351,0.012211,0.008242,0.048037,0.020044,0.004059,0.001557,0.000303,0.000952,0.001202,0.000992,0.000517,0.000239,9.6e-05,6.4e-05,7.6e-05,0.000111
-0.053436,-0.054716,-0.004484,-0.000203,-0.004741,-0.022212,-0.024316,-0.044059,-0.080336,-0.161448,-0.149884,-0.141628,-0.119974,-0.138327,-0.172782,-0.112335,-0.033521,-0.006927,-0.003869,-0.003909,-0.003578,-0.001989,-0.00115,-0.000344,-0.000113,-0.000118,-0.000156,-0.000132
-0.024312,-0.029353,-0.002357,-2.3e-05,0.001653,0.005407,-0.002038,0.000325,0.052669,0.065156,0.064081,0.083012,0.073497,0.082182,0.077059,0.063098,0.021382,0.003739,0.002061,0.001848,0.001463,0.000552,0.000336,-2.3e-05,7e-06,7.4e-05,4.5e-05,-6.4e-05
0.023533,0.020547,0.001799,0.00013,0.001725,0.010333,0.009083,0.022034,0.026681,0.084146,0.073019,0.051379,0.025907,0.037464,0.089881,0.036299,0.008869,0.002996,0.001034,0.001463,0.001713,0.000972,0.000251,5.1e-05,1e-06,1.9e-05,7.6e-05,5.1e-05
0.035366,0.039231,0.003197,-9e-06,0.001492,0.008985,0.014772,0.006079,-0.059583,-0.10042,-0.098936,-0.10617,-0.07861,-0.087863,-0.13401,-0.087811,-0.026373,-0.004968,-0.002239,-0.002484,-0.002425,-0.001124,-0.000445,-1.9e-05,-4.8e-05,-9.4e-05,-0.000109,3.1e-05
0.00928,0.015564,0.001314,-6.2e-05,0.000641,0.000747,-0.003068,-0.003619,0.030505,0.019756,0.028099,0.046346,0.052289,0.062379,0.032488,0.044027,0.015432,0.002096,0.00167,0.001059,0.000525,-0.000166,0.000168,5.4e-05,4.6e-05,4.4e-05,6e-06,-4e-06
-0.020687,-0.019392,-0.001522,2e-06,-0.004002,-0.018529,-0.011145,-0.001548,0.023157,0.068165,0.063236,0.057385,0.024114,0.031889,0.09992,0.047386,0.010943,0.002383,0.000716,0.001393,0.001856,0.001133,0.000123,-6e-05,5e-06,1e-05,7.2e-05,-3.4e-05
-0.023262,-0.028877,-0.002655,-1e-06,-0.001253,-0.006159,-0.003547,-0.009348,-0.055474,-0.086785,-0.08338,-0.082359,-0.058624,-0.090079,-0.110278,-0.07454,-0.023429,-0.004992,-0.002575,-0.002217,-0.001999,-0.000581,-6.3e-05,5.9e-05,-3e-05,-5.8e-05,-6.5e-05,-2.4e-05
-0.002449,-0.009202,-0.000998,9e-06,0.003269,0.014195,0.001622,-0.006786,0.015219,-0.00764,-0.002629,0.011506,0.032642,0.023912,-0.014554,0.013836,0.008678,0.000986,0.000718,-0.000169,-0.000455,-5e-04,-8e-05,-4.5e-05,4.8e-05,5.8e-05,-1.6e-05,1.2e-05
0.01673,0.017515,0.001747,4.2e-05,0.000885,0.006565,0.009967,0.016148,0.03315,0.087872,0.072654,0.057197,0.014878,0.049588,0.10712,0.049278,0.013023,0.003582,0.001505,0.00228,0.002204,0.000829,0.000153,-3.9e-05,1e-06,3.9e-05,9e-05,3.4e-05
0.015162,0.022909,0.002324,2e-06,-0.000715,-0.002684,0.006024,0.008504,-0.041276,-0.041437,-0.042218,-0.051696,-0.044808,-0.049397,-0.063706,-0.048742,-0.01724,-0.003064,-0.000996,-0.001433,-0.001126,-0.000132,3.5e-05,9.6e-05,-4.9e-05,-5.4e-05,-3e-06,5.4e-05
-0.002117,0.003091,0.000235,-5.8e-05,-0.000702,-0.006188,-0.016487,-0.018481,0.004688,-0.03879,-0.026381,-0.011795,0.024433,0.003269,-0.046844,-0.001459,0.003937,0.000223,0.000452,-0.000444,-0.000847,-0.000644,-0.00022,-2e-06,9e-06,9e-06,-5.8e-05,-1.7e-05
-0.012715,-0.016618,-0.001764,2.9e-05,-0.00142,-0.006739,-0.000212,0.002745,0.039652,0.059261,0.051996,0.048288,0.016311,0.040822,0.09187,0.04575,0.011608,0.00317,0.000714,0.001744,0.001612,0.000432,-1e-04,-0.000127,2.1e-05,1.3e-05,3.9e-05,-3.1e-05
-0.007455,-0.01543,-0.001702,0,0.000651,0.003847,0.007087,0.005792,-0.02994,-0.017126,-0.015185,-0.020272,-0.02643,-0.030734,-0.025027,-0.029274,-0.012852,-0.002907,-0.001488,-0.001224,-0.000705,0.00031,0.000205,3e-05,-4.5e-05,-6e-05,8e-06,-5e-06
