-5e-06,-0.001234,-0.003028,-0.021065,-0.0307,-0.02144,-0.110611,-0.124132,-0.090506,-0.037477,-0.012788,-0.002792,-0.001154,-0.000937,-0.001537,-0.001163,-0.001907,-0.003359,-0.003657,-0.005618,-0.011956,-0.009745,-0.005178,-0.011921,-0.006023,-6.3e-05,-0.000973,-0.002003
-6e-06,-0.001378,-0.002748,-0.019146,-0.032528,0.018662,0.083793,0.112474,0.092691,0.019759,0.008024,0.001777,0.000843,0.000765,0.000344,-1.1e-05,-0.000997,-0.001519,-0.001481,0.001221,0.008643,0.005242,-0.002606,-0.007581,-0.004138,4e-06,-0.000589,-0.001429
-3e-06,-4.8e-05,-6.7e-05,0.000401,0.00065,-0.000761,0.001947,-0.00797,-0.002832,-0.005447,-0.003492,-0.000354,-9e-05,-0.000134,7e-06,8.8e-05,0.000425,0.000602,-0.000632,-0.001013,-0.003223,-0.001245,0.00169,0.003404,0.001882,1.1e-05,8.4e-05,0.000196
0,0.00102,0.0022,0.016724,0.028371,-0.018799,-0.080405,-0.106647,-0.093862,-0.026035,-0.009301,-0.00214,-0.000969,-0.000759,-0.000482,-0.00016,0.001127,0.00171,0.001175,0.001068,-0.000596,-3.3e-05,0.003346,0.009865,0.005425,3e-05,0.000644,0.001538
1e-06,0.000754,0.001987,0.015421,0.023076,0.018021,0.084905,0.109141,0.080402,0.037541,0.014273,0.002653,0.001275,0.001038,0.000997,0.000676,0.000759,0.001328,0.002067,0.003178,0.007733,0.004439,0.000444,0.004144,0.002106,5.1e-05,0.00054,0.001132
-4e-06,-0.000222,-0.000721,-0.006728,-0.011164,0.004919,0.026217,0.036183,0.042955,0.017744,0.003854,0.00087,0.000313,7.5e-05,-3.9e-05,-2.1e-05,-0.001207,-0.002134,-0.001638,-0.00505,-0.013931,-0.009035,-0.003431,-0.009075,-0.004818,-4.4e-05,-0.000429,-0.001018
-6e-06,-0.000654,-0.001664,-0.016489,-0.025943,-0.029042,-0.119233,-0.127131,-0.098565,-0.040504,-0.014085,-0.003176,-0.001371,-0.001042,-0.001085,-0.000818,-0.001321,-0.002172,-0.001804,-0.000306,-0.000689,-0.002709,-0.002086,-0.007845,-0.004104,-4.7e-05,-0.000598,-0.001398
-2e-06,-0.000398,-0.000683,-0.003443,-0.007193,0.001481,0.024539,0.037824,0.021542,-0.001495,0.002417,0.000669,0.000274,0.00049,0.000522,0.000173,0.000722,0.001374,0.000106,0.004051,0.01288,0.008036,0.002077,0.004617,0.002418,4.6e-05,-2.6e-05,-8.7e-05
-1e-06,3e-06,7e-06,0.007961,0.013422,0.015415,0.081399,0.073625,0.060741,0.019695,0.005166,0.001961,0.000786,0.00047,0.00047,0.000454,0.001072,0.001318,-0.00122,-0.003674,-0.008221,-0.002689,0.001381,0.007265,0.003947,2.6e-05,0.000274,0.000765
2e-06,0.000338,0.000791,0.007417,0.013845,-0.014411,-0.057544,-0.069603,-0.061392,-0.013482,-0.005516,-0.001492,-0.000723,-0.000704,-6e-04,-0.000233,3e-06,-0.000302,-0.000523,-0.002203,-0.005933,-0.003047,-0.000409,0.001096,0.000503,-1.6e-05,0.000524,0.001218
3e-06,0.000388,0.000989,0.00131,0.001413,-0.006273,-0.023447,-0.000268,-0.004185,0.005277,0.003683,-0.000237,0.000105,0.000282,0.000249,9.2e-05,-0.000534,-0.000786,0.000762,0.000822,0.00232,0.002709,-0.000429,-0.004594,-0.002704,2e-06,0.000112,0.000125
2e-06,0.000103,0.000114,-0.005026,-0.009387,0.013779,0.055061,0.057944,0.061623,0.019651,0.004705,0.001305,0.000666,0.000466,0.000303,0.00014,-0.000371,-0.000463,3.5e-05,-0.001345,-0.00343,-0.000843,-0.000266,-0.00456,-0.002416,-1e-05,-0.000589,-0.001365
1e-06,-0.000302,-0.000878,-0.005846,-0.009431,-0.005418,-0.029536,-0.044462,-0.036232,-0.019349,-0.007407,-0.001227,-0.00076,-0.000685,-0.000751,-0.000538,6.2e-05,0.000291,0.000357,0.001209,0.004346,0.001326,-0.000569,0.002075,0.0013,-1.1e-05,-0.00037,-0.000805
4e-06,-0.000376,-0.000802,0.000795,0.000627,-0.008985,-0.034182,-0.025153,-0.033697,-0.017315,-0.002663,-0.000676,-0.000425,-9.4e-05,-6e-06,-9.5e-05,0.000436,0.000863,0.000998,0.001404,0.003218,0.000652,4.6e-05,0.004761,0.002674,2.5e-05,0.000319,0.000744
2e-06,8e-06,3.3e-05,0.004258,0.007382,0.014211,0.059784,0.051854,0.046417,0.017239,0.005571,0.001888,0.000911,0.00061,0.000719,0.00061,0.000113,2.1e-05,5.9e-05,-0.002771,-0.008465,-0.004509,-0.000591,-0.000416,-0.000225,-3e-06,0.000366,0.000909
-1e-06,0.000386,0.000989,0.002169,0.005206,0.002972,0.00622,-0.004732,-0.002331,0.006502,0.001132,-7e-06,1.8e-05,-0.00025,-0.000174,2.8e-05,-0.000176,-0.000282,-1.7e-05,0.001549,0.004698,0.003009,0.000662,-0.002752,-0.001649,-2.1e-05,5.4e-05,0.000163
-3e-06,0.000264,0.000658,-0.000451,-0.000713,-0.013772,-0.058878,-0.037032,-0.033577,-0.00583,-0.001174,-0.001598,-0.00063,-0.000284,-0.000407,-0.000379,-7.7e-05,8e-06,-0.000151,0.001043,0.004195,0.002857,0.000148,-0.000997,-0.000533,6e-06,-0.000347,-0.000817
-3e-06,-0.00012,-0.000311,-0.001248,-0.003978,0.006158,0.024236,0.021475,0.026725,0.006581,0.00042,0.00054,0.00044,0.000427,0.000275,8.4e-05,-4e-05,-0.000104,-0.000325,-0.002012,-0.005525,-0.003365,-0.000625,0.00055,0.000493,0,-0.000272,-0.000687
-2e-06,-0.00031,-0.000887,-0.003268,-0.005767,0.008751,0.034816,0.016584,0.013461,-0.002976,-0.001219,0.00077,4.5e-05,-0.000166,0.000107,0.000103,-9.2e-05,1.6e-05,0.001336,0.000589,0.000933,0.001022,3.5e-05,0.001547,0.000826,-1.5e-05,0.000197,0.000395
