0.085934,0.03182,0.01371,0.008986,0.007752,0.048578,0.133114,0.18811,0.338659,0.750157,1.171009,1.336276,1.227842,1.018669,0.833272,0.780345,0.941951,1.045159,0.981461,0.72112,0.405443,0.262456,0.277861,0.352256,0.289839,0.1676,0.111664,0.054763
0.107369,0.037565,0.015626,0.010616,0.009392,0.056178,0.151955,0.216626,0.39452,0.874949,1.364015,1.589169,1.480187,1.185346,0.935058,0.890586,1.092645,1.211372,1.140693,0.846304,0.478432,0.302692,0.319857,0.417252,0.345592,0.192496,0.125214,0.061163
0.145117,0.046822,0.018754,0.013291,0.012054,0.065949,0.175176,0.252573,0.465153,1.044069,1.643573,1.982443,1.8846,1.440097,1.095569,1.075031,1.302354,1.411237,1.347034,1.027975,0.579334,0.350455,0.375814,0.509765,0.422706,0.221201,0.136573,0.066114
0.175208,0.053185,0.020823,0.0151,0.013617,0.065067,0.17058,0.250669,0.455908,1.072865,1.772203,2.226009,2.177746,1.639458,1.256938,1.270851,1.399232,1.402756,1.389362,1.113498,0.607182,0.341763,0.38699,0.549,0.448204,0.21495,0.120304,0.057083
0.185981,0.056877,0.022362,0.015836,0.013953,0.059833,0.157643,0.228022,0.384838,1.026409,1.851052,2.345737,2.340594,1.85951,1.546409,1.593699,1.523754,1.312854,1.305732,1.084782,0.557236,0.289426,0.359754,0.539027,0.433376,0.187901,0.089594,0.040777
0.178238,0.057821,0.023686,0.016339,0.014831,0.062108,0.162492,0.224438,0.348656,1.07155,2.005416,2.392718,2.380633,2.081471,1.947281,2.019495,1.758977,1.376697,1.256866,0.972421,0.471333,0.252216,0.34776,0.528378,0.409646,0.16508,0.070901,0.031132
0.17773,0.058646,0.024346,0.017667,0.017511,0.07125,0.175435,0.243674,0.390494,1.342989,2.401951,2.625638,2.646258,2.538288,2.562519,2.563691,2.151208,1.734969,1.494395,1.030721,0.480633,0.293058,0.416817,0.578039,0.404402,0.162441,0.075255,0.033603
0.201129,0.062805,0.024888,0.02098,0.022566,0.100984,0.24311,0.324333,0.511316,1.906533,3.339742,3.587694,3.738805,3.709634,3.895044,3.871897,3.220993,2.683671,2.267217,1.527651,0.75081,0.466937,0.628916,0.793085,0.49944,0.195872,0.095172,0.044131
0.250516,0.071455,0.027205,0.026685,0.029583,0.146805,0.358997,0.461949,0.704129,2.752076,4.991967,5.511078,5.878386,6.02357,6.471487,6.486821,5.351449,4.344506,3.561504,2.40617,1.237332,0.760653,0.961699,1.162116,0.720146,0.282931,0.135879,0.062669
0.316984,0.082653,0.032197,0.034449,0.037564,0.196636,0.483247,0.60426,0.906373,3.610684,7.074525,8.291741,8.968801,9.430946,10.214505,10.253365,8.343744,6.466803,5.150568,3.508233,1.834589,1.096196,1.301342,1.551179,0.994295,0.395041,0.180281,0.082772
0.375177,0.094108,0.03964,0.043313,0.044624,0.237296,0.576525,0.696441,1.017035,4.020314,8.922385,11.36698,12.260384,13.079237,14.191779,14.180641,11.355654,8.311253,6.42937,4.43883,2.345104,1.360857,1.491075,1.769817,1.202477,0.481507,0.20424,0.095809
0.396942,0.099991,0.04668,0.050443,0.048936,0.260069,0.621407,0.736934,1.047471,3.848644,9.841653,13.606825,14.413571,15.40469,16.524995,16.207785,12.831662,8.892466,6.6225,4.639347,2.510096,1.428013,1.461706,1.760904,1.261439,0.501648,0.19733,0.095478
0.361212,0.093428,0.049468,0.052284,0.048252,0.264961,0.624494,0.771079,1.110486,3.408774,9.45494,13.738798,14.15154,14.915223,15.413721,14.468663,11.493352,7.715476,5.408309,3.825261,2.168409,1.234276,1.244574,1.578933,1.1724,0.450493,0.161339,0.083173
0.300329,0.083369,0.046977,0.047999,0.042802,0.24891,0.582159,0.763961,1.144094,2.804832,7.515413,11.080813,11.259806,11.721282,11.296172,9.646018,7.749286,5.351264,3.64096,2.584139,1.498666,0.860611,1.074273,1.485099,1.045247,0.361104,0.116048,0.066
0.288873,0.085963,0.044767,0.043533,0.035877,0.212604,0.500558,0.704584,1.133159,2.533802,5.556304,7.451094,7.214916,7.201525,6.324357,4.825329,4.027756,3.113319,2.370534,1.728918,0.912013,0.530534,1.08446,1.55396,0.93235,0.277786,0.088605,0.052737
0.302613,0.093239,0.044118,0.04388,0.033193,0.183996,0.461949,0.696469,1.112617,2.409949,4.384441,4.916415,4.192591,3.893144,3.288,2.458368,2.10159,1.800107,1.883681,1.599856,0.715595,0.406919,1.247958,1.79745,0.955453,0.251078,0.081637,0.045189
0.382195,0.112588,0.04588,0.047938,0.034937,0.16932,0.475366,0.751512,1.080628,2.328743,4.027065,4.176781,3.342195,2.931865,2.431007,1.885962,1.704983,1.606466,2.147778,1.934801,0.747166,0.402724,1.46393,2.132977,1.102292,0.267332,0.078998,0.043685
0.604387,0.169464,0.057506,0.058027,0.042724,0.171997,0.532192,0.861643,1.077385,2.359814,4.16448,4.40631,3.716172,3.332221,2.86582,2.441309,2.354707,2.239698,3.145834,2.867134,0.999887,0.420395,1.64441,2.467708,1.307026,0.308192,0.079646,0.048083
0.933807,0.257876,0.080814,0.084244,0.06272,0.201012,0.654862,1.067813,1.216822,2.695526,5.119945,5.551713,4.675383,4.45146,4.124489,3.710769,3.635002,3.307758,4.510311,4.186273,1.454569,0.477785,1.880874,2.988064,1.669641,0.380293,0.085597,0.060864
1.271157,0.345801,0.103572,0.117028,0.087323,0.232924,0.773296,1.26908,1.369015,3.234184,6.987062,7.848798,6.024235,5.634078,5.605735,5.180466,5.076337,4.375849,5.758155,5.457417,1.931497,0.572825,2.049064,3.388765,1.995831,0.471686,0.101747,0.077428
1.461348,0.387513,0.111034,0.137658,0.101805,0.236247,0.793878,1.316982,1.399122,3.686628,8.720499,10.060227,7.007451,6.147983,6.593323,6.140221,6.016118,5.011986,6.278337,6.007652,2.156376,0.64155,1.964766,3.288454,2.002674,0.503389,0.11453,0.089263
1.373284,0.351794,0.098455,0.130013,0.09408,0.217997,0.715697,1.142556,1.197324,3.591976,9.027255,10.681057,7.063057,5.800953,6.470488,5.882989,5.75296,4.853592,5.803543,5.489333,2.01351,0.64926,1.599667,2.638189,1.627956,0.427668,0.113226,0.091252
1.023607,0.257624,0.076664,0.096862,0.068318,0.171057,0.536884,0.805327,0.891956,3.285866,8.143795,9.483548,6.461855,5.130517,5.186238,4.423793,4.351643,3.80612,4.393997,4.060109,1.551914,0.567254,1.097743,1.77355,1.128523,0.3135,0.101678,0.080779
0.609843,0.155169,0.054695,0.062398,0.046017,0.117866,0.349136,0.517609,0.733202,3.211397,6.849985,7.293945,5.505779,4.367632,3.684101,3.056595,2.929129,2.585737,2.938511,2.574604,1.000008,0.424723,0.669924,1.073982,0.759262,0.240736,0.085993,0.067941
0.329091,0.089216,0.04312,0.045834,0.037354,0.094048,0.251453,0.377232,0.63315,2.738905,5.244203,5.424096,4.622858,3.789164,2.989765,2.551317,2.414935,2.053255,2.198705,1.811049,0.647195,0.308831,0.504046,0.763502,0.535701,0.176161,0.067602,0.057824
0.206825,0.068827,0.040414,0.038432,0.032981,0.087798,0.216547,0.329761,0.554361,1.973541,3.808022,4.299724,3.835296,3.389823,2.946804,2.327167,2.025277,1.737365,1.805548,1.442167,0.526721,0.269551,0.456056,0.698626,0.480939,0.153068,0.055057,0.04787
0.171436,0.067367,0.046451,0.042439,0.036534,0.081842,0.183467,0.28843,0.526376,1.680931,2.985317,3.167692,2.83897,3.04785,3.126936,2.38403,1.796234,1.61489,1.894435,1.472086,0.526382,0.265637,0.464914,0.729773,0.503547,0.159308,0.052828,0.04627
0.168662,0.067641,0.050501,0.047753,0.042255,0.077962,0.166523,0.259992,0.499961,1.774613,2.988815,2.706896,2.148408,2.494819,3.029003,2.606709,1.921189,1.670981,2.005835,1.615635,0.624814,0.287923,0.470372,0.720917,0.487783,0.161724,0.057179,0.049348
0.158988,0.061225,0.051763,0.052368,0.0455,0.077257,0.172496,0.256378,0.45186,1.647878,2.8192,2.515684,1.674143,1.635412,2.402789,2.551989,2.060538,1.674197,1.914495,1.695925,0.735794,0.312244,0.466946,0.712081,0.486289,0.166968,0.057928,0.046737
0.158364,0.06367,0.055401,0.056253,0.047243,0.077109,0.176795,0.250541,0.395107,1.261691,2.249156,2.10249,1.240729,0.977745,1.693851,2.080542,1.770708,1.434868,1.805413,1.755215,0.761483,0.297601,0.41416,0.643572,0.470188,0.170245,0.055481,0.045189
0.150478,0.070847,0.061071,0.059409,0.055541,0.085426,0.165523,0.223559,0.342165,0.95753,1.78722,1.745475,1.054867,0.979439,1.479347,1.486438,1.155088,1.058085,1.66443,1.686201,0.700506,0.246863,0.330442,0.524299,0.394253,0.1518,0.049528,0.043691
0.126827,0.074288,0.066841,0.061423,0.062726,0.090501,0.141962,0.17553,0.280325,0.970253,1.964928,1.877101,1.095658,1.088827,1.369709,1.121998,0.80027,0.844302,1.431383,1.409541,0.588032,0.203785,0.276989,0.432887,0.294915,0.111193,0.043284,0.041963
0.10497,0.070474,0.062117,0.053042,0.058117,0.08158,0.116276,0.139501,0.212944,1.055026,2.513734,2.418945,1.309518,1.119758,1.283383,1.098389,0.776154,0.752785,1.131977,1.076647,0.469581,0.190111,0.226656,0.33913,0.20929,0.06798,0.036894,0.037307
0.104356,0.063796,0.046467,0.036632,0.042046,0.058214,0.078404,0.096943,0.165575,1.074749,2.870973,2.778,1.41209,0.998655,1.004259,0.94576,0.706663,0.617534,0.881838,0.889022,0.441214,0.207382,0.169473,0.241017,0.155669,0.045674,0.027163,0.028014
0.115016,0.05639,0.031927,0.025594,0.02679,0.035903,0.051013,0.062742,0.145701,1.056378,2.829984,2.712869,1.380332,0.938542,0.773543,0.722211,0.63413,0.554655,0.783227,0.776673,0.444397,0.226994,0.134112,0.156242,0.106103,0.036168,0.022462,0.022421
0.118037,0.052028,0.023296,0.017701,0.017542,0.031998,0.05905,0.061112,0.130269,0.908404,2.365819,2.481826,1.529621,1.134665,0.809555,0.622422,0.527962,0.484487,0.689122,0.635609,0.390121,0.229093,0.141366,0.12451,0.077976,0.035545,0.024383,0.024178
0.10459,0.040966,0.015698,0.011053,0.016573,0.042497,0.079727,0.072925,0.122771,0.656044,1.657402,2.077539,1.718548,1.34697,0.836022,0.557796,0.44165,0.376497,0.532326,0.514817,0.319919,0.228749,0.166255,0.111205,0.056556,0.03293,0.028425,0.02675
0.085753,0.029346,0.013702,0.008972,0.016986,0.055094,0.099996,0.081135,0.132038,0.429346,1.053862,1.54262,1.688488,1.377939,0.701624,0.435873,0.374148,0.279556,0.40816,0.490551,0.302795,0.219936,0.187266,0.116033,0.046379,0.028089,0.033146,0.031078
0.083265,0.030938,0.015645,0.008994,0.016954,0.061344,0.111425,0.085978,0.133735,0.350159,0.89694,1.275778,1.562437,1.198101,0.496273,0.37005,0.315015,0.28022,0.400962,0.512906,0.320533,0.192513,0.178488,0.116855,0.052668,0.034021,0.039009,0.036952
0.081983,0.035028,0.017571,0.010954,0.01912,0.05901,0.109873,0.086385,0.117803,0.419949,0.929296,1.219643,1.525907,1.001691,0.350045,0.38404,0.354318,0.307256,0.383307,0.489527,0.310443,0.142152,0.13878,0.113826,0.072087,0.046563,0.043607,0.042679
