-1.3e-05,-0.002734,-0.018142,-0.027958,-0.124221,-0.153732,-0.141161,-0.136714,-0.14946,-0.157142,-0.166832,-0.142439,-0.095486,-0.044019,-0.009539,-0.003764,-0.001366,-0.00091,-0.000626,-0.000332,-0.000334,-0.00019,-0.000198,-0.00017,-7.8e-05,-6.3e-05,-6.9e-05,-7.5e-05
0,0.002982,0.02105,-0.00278,-0.066312,0.082078,0.105772,0.121767,0.161685,0.16548,0.172709,0.143212,0.088211,0.050488,0.011143,0.004359,0.00118,0.000829,0.000631,0.000376,0.000367,0.000175,0.000199,0.000158,5.9e-05,4.5e-05,6.8e-05,7.5e-05
-3e-06,6.5e-05,-0.000269,0.00105,0.007476,-0.022398,-0.038256,-0.044583,-0.029202,-0.018631,0.005451,-0.012255,-0.012779,-0.002619,-0.000847,-0.000498,-0.00032,-0.000174,-8.4e-05,-0.000124,-9.7e-05,-9.5e-05,-5.2e-05,-8e-06,-2.5e-05,-3.1e-05,-2.2e-05,-2.8e-05
1e-06,-0.002249,-0.015569,0.006766,0.067026,-0.060904,-0.089002,-0.096446,-0.12476,-0.152691,-0.179618,-0.128958,-0.075897,-0.047573,-0.010889,-0.004376,-0.001259,-0.000843,-0.000651,-0.000346,-0.00037,-0.000192,-0.000216,-0.000191,-8.2e-05,-7e-05,-8.1e-05,-8.1e-05
0,0.001633,0.012914,0.018934,0.086389,0.13588,0.12652,0.129398,0.134601,0.1427,0.135151,0.131864,0.092871,0.041842,0.009309,0.003914,0.001436,0.000976,0.000622,0.000381,0.000358,0.00023,0.000201,0.00014,8.2e-05,6.9e-05,7.7e-05,8.4e-05
-1e-06,0.000665,0.003488,-0.007809,-0.040243,-0.011424,-0.008482,-0.001942,0.015073,0.050421,0.090045,0.04453,0.022075,0.017232,0.00376,0.001494,0.000497,0.000284,0.000252,5.9e-05,0.000109,5.7e-05,9.6e-05,0.000115,4.8e-05,4.1e-05,3.6e-05,2.9e-05
0,-0.001832,-0.012925,-0.023982,-0.122277,-0.144006,-0.117722,-0.105576,-0.12035,-0.158886,-0.18636,-0.145529,-0.095122,-0.049593,-0.010672,-0.004603,-0.001456,-0.001048,-0.000708,-0.000328,-0.000339,-0.000168,-0.00019,-0.000167,-7.4e-05,-5.1e-05,-7.2e-05,-7.2e-05
1e-06,0.000301,0.002722,0.001226,-0.011059,0.05311,0.074965,0.064201,0.062385,0.061963,0.034831,0.037265,0.024447,0.016501,0.003777,0.001553,0.000365,0.000324,0.00021,0.000197,0.000155,0.000101,6.9e-05,1.9e-05,2.2e-05,2.5e-05,3.1e-05,3.5e-05
-1e-06,0.001426,0.010314,0.01751,0.084392,0.071635,0.038126,0.024037,0.036281,0.08186,0.131239,0.07514,0.045345,0.030406,0.006102,0.002531,0.000718,0.000513,0.000376,0.000116,0.000155,3.3e-05,9.5e-05,0.000114,3.2e-05,2e-05,3.1e-05,2.7e-05
-1e-06,-0.000803,-0.007211,0.002532,0.046541,-0.044312,-0.070385,-0.040259,-0.057931,-0.117869,-0.13039,-0.078111,-0.041149,-0.034698,-0.007549,-0.003406,-0.000833,-0.000589,-0.000466,-0.000249,-0.00026,-0.000149,-0.000151,-0.00012,-6.6e-05,-5.8e-05,-6.9e-05,-6.6e-05
1e-06,-0.001308,-0.008512,-0.005831,-0.01073,0.009118,0.019664,0.027265,0.032215,0.021746,-0.01953,0.008804,0.005955,-0.001799,0.000283,0.000288,4.7e-05,0.00013,6.1e-05,6.3e-05,3e-05,5.2e-05,-6e-06,-3.6e-05,2e-06,-3e-06,1.1e-05,1.4e-05
3e-06,0.001387,0.012174,0.000162,-0.045792,0.013077,0.02131,-0.012945,0.009443,0.091568,0.144218,0.070024,0.028498,0.029456,0.006444,0.003145,0.000779,0.00044,0.000399,0.000132,0.000201,8.2e-05,0.000134,0.000138,5.9e-05,4.1e-05,5.8e-05,5.4e-05
3e-06,0.000432,0.000766,-0.00676,-0.050463,-0.061502,-0.05265,-0.033399,-0.042908,-0.087746,-0.08342,-0.062441,-0.033779,-0.02181,-0.004915,-0.002265,-0.000541,-0.000536,-0.000356,-0.000145,-0.000123,-6.4e-05,-7.1e-05,-4.4e-05,-3e-05,-2.1e-05,-3.8e-05,-3.7e-05
-1e-06,-0.001742,-0.013356,-0.004229,0.013635,0.005313,0.019525,0.03157,0.024695,-0.015926,-0.081209,-0.043004,-0.015258,-0.012858,-0.002748,-0.001373,-0.000433,-0.000155,-0.000127,1.4e-05,-4.9e-05,2.4e-05,-6.3e-05,-8.3e-05,-1.3e-05,-4e-06,-1e-05,-7e-06
1e-06,0.000978,0.009886,0.015673,0.070325,0.071323,0.062458,0.020561,0.013338,0.093406,0.131461,0.076175,0.039051,0.029795,0.00618,0.002961,0.00076,0.000587,0.000422,0.000179,0.000196,8.2e-05,0.000127,0.000106,5.3e-05,4.6e-05,4.9e-05,4.6e-05
4e-06,0.001123,0.005503,0.004146,0.023488,-0.007102,-0.010423,0.01465,-0.018891,-0.05144,-0.012341,0.012493,0.009358,-0.005195,-0.00113,-0.000716,4e-06,-6.6e-05,-0.00015,-8.8e-05,-7.1e-05,-7.8e-05,-2.2e-05,2e-06,-2.4e-05,-1.5e-05,-3.3e-05,-3.3e-05
-5e-06,-0.001848,-0.0145,-0.014536,-0.051709,-0.046627,-0.026618,0.002288,0.017713,-0.045077,-0.109003,-0.062145,-0.032357,-0.023194,-0.004272,-0.002058,-0.000625,-3e-04,-0.000229,-0.000114,-0.000175,-6.4e-05,-0.000109,-0.00011,-4.5e-05,-3.5e-05,-3.2e-05,-3e-05
-5e-06,0.000457,0.006326,-0.000544,-0.043399,0.006536,0.01889,-0.040016,-0.008737,0.076394,0.088719,0.025461,-0.002102,0.016451,0.003965,0.002197,0.000334,0.000175,0.000254,7.4e-05,9.7e-05,3.6e-05,7.7e-05,6e-05,3.2e-05,2.1e-05,4.6e-05,4.4e-05
-2e-06,0.001122,0.006821,0.003166,0.00786,0.002914,-0.008843,-0.009138,-0.027292,-0.022335,0.036733,0.031583,0.01845,0.007106,0.000948,0.000546,0.00028,-3.3e-05,-5.9e-05,-1.1e-05,3.7e-05,-5e-06,3e-05,5.1e-05,0,-3e-06,-8e-06,-1.3e-05
