-0.001847,-0.003791,-0.004516,-0.003396,-0.002774,-0.002043,-0.002978,-0.003407,-0.00322,-0.001853,-0.002299,-0.002531,-0.002655,-0.004816,-0.00274,-0.002339,-0.002269,-0.00312,-0.003707,-0.00464,-0.003255,-0.002579,-0.003072,-0.002019,-0.001574,-0.001204,-0.001938,-0.003327,-0.003046,-0.00244,-0.001516,-0.002477,-0.003227,-0.00346,-0.00342,-0.001573,-0.001709,-0.00102,-0.003394,-0.002182,-0.001938,-0.00307,-0.003157,-0.00213,-0.001194,-0.003309,-0.003098,-0.001715,-0.001342,-0.001605,-0.001594,-0.002697,-0.001292,-0.001898,-0.002465,-0.002833,-0.002663,-0.001041,-0.001038,-0.001469,-0.001912,-0.001886,-0.001671,-0.002546,-0.00158,-0.001348,-0.000841,-0.000907,-0.001297,-0.000464,-0.001217,-0.003181,-0.001814,-0.001201,-0.00112,-0.001549,-0.002485,-0.002249,-0.002199,-0.001078,-0.000587,-0.001191,-0.002323,-0.002169,-0.003089,-0.003246,-0.002074,-0.001323,-0.001626,-0.001841,-0.001162,-0.002791,-0.00203,-0.002019,-0.001067,-0.001602,-0.002157,-0.002099,-0.003249,-0.002149,-0.002524,-0.001507,-0.001328,-0.002268,-0.001751,-0.001943,-0.001362,-0.001479,-0.001953,-0.002471,-0.001886,-0.001131,-0.002105,-0.001584,-0.001023,-0.001299,-0.001346,-0.001953,-0.002151,-0.001872,-0.000858
0.00088,0.001691,0.002102,0.002019,0.001275,-0.000581,0.00087,0.000961,0.000733,0.001744,0.001053,0.000924,0.000696,0.002122,0.00019,0.001184,0.00101,0.001283,0.001378,0.002574,0.002205,0.001981,0.001013,-9.9e-05,0.000906,0.000452,0.000938,0.001425,0.001695,-0.000213,-0.000517,-0.000469,0.000865,0.000818,0.001016,0.000106,0.000281,0.000269,0.00129,-4.9e-05,0.000342,0.000686,0.000586,0.000549,-9.8e-05,0.00144,0.002191,0.000769,-0.000147,8e-04,0.000109,0.000611,-0.000221,-0.000118,0.001,0.000247,0.00102,0.000133,9.5e-05,0.000707,0.001149,0.000641,0.000668,0.001235,0.000178,4.1e-05,0.000145,2e-05,5.5e-05,-7.6e-05,0.001014,0.002028,0.000489,0.000339,0.000774,9.6e-05,0.000301,0.000715,0.000274,0.000612,-2.1e-05,-0.000146,0.000686,0.000996,0.001324,0.001553,0.000222,0.000158,0.001133,0.000167,-0.000709,0.000594,0.000436,0.000908,6.3e-05,0.000219,0.000747,0.000146,0.000791,0.000845,0.001278,0.000975,-0.000491,0.000558,0.000322,0.000763,9.1e-05,6e-05,0.000123,0.001046,0.000249,-0.000623,0.000216,0.000569,-0.000462,0.000448,0.000804,5.3e-05,0.000822,0.001531,0.000249
4.3e-05,-0.001076,-0.002115,-0.001793,-0.00016,0.000253,-0.000114,0.000224,-0.000431,-0.001399,-0.000191,0.000253,0.000695,-0.001067,0.000294,-0.000878,-0.000775,-0.000439,-0.000147,-0.001506,-0.002284,-0.001521,-5e-06,-0.000611,-0.00024,-0.000289,-0.000955,-0.001289,-0.000992,0.000685,0.000726,0.000955,-0.000175,-0.001115,0.000525,0.000419,0.000435,-0.000347,-0.00056,-0.000143,-0.000628,-0.000293,-9.4e-05,-0.000614,-0.000887,-0.000726,-0.001173,-0.000461,0.000328,-0.000252,0.00048,0.000271,0.000813,0.000613,-0.000185,0.000105,-0.000463,-0.00049,-0.00031,-0.000949,-0.001453,-0.000562,-0.000315,-0.000768,-0.000243,1.1e-05,-0.000136,0.000101,-0.000139,4.2e-05,-0.000471,-0.001352,-0.000259,0.000445,-0.000767,-9.8e-05,-0.000376,-2.1e-05,0.000571,0.00025,-0.000184,8e-05,-4.4e-05,0.000143,-0.000419,0.00015,0.000823,-0.000197,-0.000277,0.000704,0.000165,0.000644,-0.000499,-0.001099,-0.000144,-6.2e-05,-0.000797,0.000811,6.2e-05,-9.7e-05,-0.001017,-0.001042,0.000532,7.5e-05,0.000288,0.000293,0.000159,4.5e-05,0.000687,-3.1e-05,-4e-04,6.3e-05,-0.000574,-0.000647,-0.00044,-7e-04,-0.00102,0.000201,-0.000492,-0.001376,-0.000473
-0.000605,0.000145,0.001168,0.000805,-0.00017,0.000388,-0.000342,-0.000402,0.000102,0.000899,-0.000803,-0.000847,-0.001664,-0.000502,-0.000134,0.000133,-3.7e-05,-0.000472,-8.3e-05,0.000601,0.000735,0.000943,-0.000319,-0.000554,0.000208,1.4e-05,0.000474,0.000291,0.000103,-0.000512,-0.001244,-0.000964,0.000105,0.000749,-0.001307,-0.001077,-0.000632,-3e-05,-0.000289,2.5e-05,0.000463,-0.000615,2.3e-05,-0.000233,0.000267,-0.000844,0.000765,-0.000146,-0.000502,0,-0.000803,-0.000796,-0.000691,-0.001461,-0.000341,0.000505,0.000124,6e-06,8e-06,0.000475,0.00028,-6.3e-05,7.5e-05,-0.00016,-0.000167,-0.000692,-0.000671,-0.000136,-0.000342,-0.000491,4.8e-05,-0.000338,-4.3e-05,-0.000954,0.000343,0.000397,3e-05,-0.000737,-0.001007,-0.000837,-0.000324,0.000854,-0.000428,-0.00087,-0.000212,-0.000858,-0.001486,-0.000257,-0.000314,-0.001204,-0.000256,-0.001186,-0.00086,0.00039,0.000213,-1e-04,1.8e-05,-0.001302,-0.000602,-0.000276,0.000336,0.000262,-0.000677,-0.000393,-0.000934,-0.000291,-0.000244,-0.000646,-0.001042,0.000195,0.000467,-0.000122,0.000238,-2e-06,-7.2e-05,9.9e-05,0.000651,-9.8e-05,-0.00032,0.000331,1.7e-05
0.000722,0.00014,-0.000736,-0.001211,0.000192,-3.4e-05,0.000455,-0.000607,-0.00043,-0.000357,0.000487,0.00066,0.000536,0.001217,-0.00056,-0.000486,0.000188,5e-05,5.4e-05,-0.000646,-0.000118,-0.000676,0.000403,0.000524,-0.000566,0.000102,-0.000153,-0.00039,2.1e-05,-0.000586,0.000841,0.000788,-5.4e-05,-0.000468,0.000568,0.000834,0.000322,9e-06,-6.9e-05,-0.000415,-0.000487,0.000923,-0.000218,3.8e-05,-0.000601,0.001252,-3.8e-05,-0.000228,6e-04,-7e-06,1.5e-05,0.000521,0.000563,0.001337,0.000504,-0.000848,-0.000137,-0.000128,6.9e-05,0.000246,0.000122,-0.000323,-9e-06,0.000463,0.000766,0.000474,6.5e-05,7.3e-05,0.000328,0.000144,0.00038,0.000468,0.000333,0.000734,6.8e-05,-0.000539,-0.000572,0.000243,0.000508,3e-05,0.000269,-0.000562,-4.9e-05,0.000523,0.000411,0.000627,0.001172,0.000359,-0.000115,0.000752,0.000555,0.001423,0.001212,-0.000103,-0.000424,0.000235,-5.1e-05,0.001045,0.000451,0.000445,1.9e-05,0.000327,-0.000104,0.000319,0.00055,-0.000364,-0.000394,0.000461,0.000773,-0.000758,-0.000215,0.000341,-0.000121,-0.000586,0.000401,0.00017,-0.000281,-0.000184,0.00015,-0.000484,-9.2e-05
-0.000315,0.000175,0.000628,0.001561,-0.00025,-0.000477,-0.000489,0.000767,0.000437,-6.8e-05,-0.000276,-0.000349,-0.000193,-0.000646,0.000287,0.001024,-0.000253,0.000727,0.000185,0.000752,-0.000181,0.000108,-0.000411,-0.000854,-4.7e-05,-0.000151,-2.8e-05,0.000613,-0.000294,0.000583,-0.000546,-0.000413,-0.000244,0.000251,-0.000377,-0.000224,-7.2e-05,-0.000497,0.000105,0.000595,0.000849,-0.000324,0.000186,0.000582,0.000659,-0.001011,-0.000296,0.000325,-5.5e-05,0.000149,-0.000118,0.000254,-0.001056,-0.000677,-0.000665,0.000597,0.000349,3.9e-05,-0.000476,0.000169,0.000368,0.000148,-7.9e-05,-0.00024,-0.000977,-5.4e-05,-0.00011,3.8e-05,3e-05,0.000165,0.000124,-0.000346,-0.000131,-5.8e-05,-9.9e-05,0.000207,0.000469,-0.000412,-5.1e-05,0.000168,0.000241,0.000158,0.00045,-4.2e-05,0.000164,2.1e-05,-0.00021,0.000256,5.1e-05,-0.000263,-0.000423,-0.000471,-0.00082,0.000177,0.000725,5e-05,0.000267,-0.000943,-0.000126,-0.000303,-8.2e-05,-0.000343,0.000133,-0.000197,-0.000501,0.00084,0.000961,-0.000209,0.000297,0.000474,0.000236,8.1e-05,0.000425,0.00044,-2.9e-05,6.2e-05,-0.000232,0.000275,4.3e-05,0.000516,-0.000167
0.000187,-0.000115,-0.000642,-0.000771,0.000273,0.000519,0.000919,-0.000669,-0.000274,0.000388,0.000296,-0.000452,-0.000173,0.000431,-0.000496,-0.00071,2e-04,-0.000902,-0.00018,-0.000952,0.000173,-0.000288,0.000466,0.000766,-0.000304,-0.000645,-2.2e-05,-5.4e-05,2.3e-05,-0.000293,-1.7e-05,4.9e-05,-0.000462,0.000315,0.000258,0.000176,-0.00017,0.000262,-0.000196,-0.000289,-0.00028,7.5e-05,-0.000271,-0.000252,-0.000277,-0.00029,4.6e-05,0.000259,-0.000116,-0.000303,-5e-05,-0.000762,0.000702,0.000974,0.000574,-0.000401,-0.000568,-0.000101,4.4e-05,-0.000482,-0.000182,-0.000123,-1.5e-05,0.000196,0.000661,4.2e-05,0.000433,-0.000193,2e-06,-1.3e-05,-0.000491,0.000203,4e-06,-0.000155,0.000105,-0.000313,-0.000471,0.000387,-0.000102,-0.000434,-0.000268,0.000247,-0.000387,-0.000309,-0.000154,-0.000338,-0.000114,-0.000441,-7.6e-05,0.000288,-6.5e-05,-0.000104,0.000156,-0.000269,0.000328,-0.000139,-7.8e-05,0.000492,-0.000131,0.000285,0.000195,7.8e-05,-3.4e-05,0.000188,0.000297,-0.000843,-0.000954,0.000302,-0.000211,-1.4e-05,-0.000113,-0.000363,-0.000163,0.000394,8.3e-05,-0.000328,-9.2e-05,-0.00011,0.000234,-0.000282,-0.000239
-4.7e-05,-0.000155,0.000179,0.000534,3.7e-05,-0.000294,-0.000883,0.000737,5e-04,0.000446,-2.1e-05,0.000601,-1.1e-05,-0.000334,0.000453,0.000255,-8e-05,0.000504,6e-06,0.000416,0.000181,0.000591,-0.000558,-0.000122,5.7e-05,0.000441,0.00012,0.000307,5.2e-05,0.00021,0.000385,0.00018,0.000527,-0.000636,-0.000409,0.000155,0.000134,-0.000143,0.000155,0.000247,-0.000195,-0.000166,9.8e-05,0.000185,0.00018,0.000139,-0.000273,-0.000225,-0.000161,-2.5e-05,9.3e-05,0.00057,-0.000169,-0.000518,-0.000463,0.000517,0.000459,0.000272,0.000211,0.000309,-6.4e-05,0.000641,0.000166,-0.000117,-0.000345,-0.00013,7.8e-05,0.000117,0.000274,-9e-05,-3.2e-05,-5.3e-05,0.000187,0.000168,0.000105,-9e-06,0.000266,3.1e-05,0.000227,0.000269,0.000242,-9.7e-05,0.000167,0.000203,0.000336,0.000202,0.000376,0.000311,0.000296,0.000128,0.000346,-5e-05,0.000413,-0.000329,-0.000143,2.8e-05,0.000174,-1e-04,0.000289,-0.00032,-0.000252,-0.000207,2.5e-05,0.000207,-0.000466,0.000241,2e-04,-0.00029,-2.8e-05,-0.000398,0.000117,-3.5e-05,-0.000158,-0.000358,0.000199,-0.000155,-0.000149,-5.1e-05,-0.000342,8.3e-05,0.000171
-0.000576,0.000214,-0.000325,-0.000753,0.000176,0.000194,0.000348,-0.00026,-0.000666,-0.000588,-0.000434,-0.000756,-9e-06,6.5e-05,-0.000741,2.1e-05,-0.000276,-0.000123,-0.000102,9.2e-05,-2.6e-05,-0.00041,0.00041,-0.00027,8.6e-05,-0.000351,-0.000266,-0.000444,-1.6e-05,0.000123,-3.4e-05,-0.000342,-0.000441,0.000291,0.000498,-0.000436,2.1e-05,-7.2e-05,-7.2e-05,-0.00013,0.000108,0.000348,0.000232,-0.000293,-2.8e-05,0.000566,0.000101,0.00028,0.000126,9.9e-05,-0.000113,-0.000505,-0.00031,-0.000187,0.000286,-0.000375,-0.000116,-0.000191,-3.2e-05,-0.000191,-1.4e-05,-0.000512,-0.000229,-0.000192,0.000113,7.3e-05,-0.000306,-1.3e-05,-0.000584,-0.000154,-4.3e-05,2.7e-05,-0.000306,-0.000314,-6.1e-05,-4.9e-05,7.7e-05,-9.2e-05,-8.6e-05,7.3e-05,-0.000245,0.000113,3.3e-05,-0.000206,-0.00014,-0.000134,-4.4e-05,-0.000155,-5.1e-05,-0.000131,-0.00057,4.6e-05,-0.000142,1.5e-05,-0.000175,-4e-05,-0.00025,0.000378,-0.000185,0.000187,0.000521,0.000226,0.00024,-0.000343,0.000366,5.8e-05,0.000136,6.9e-05,-0.000192,0.000352,-0.00011,-1.4e-05,0.000198,-0.000103,-0.000178,0.000153,0.000246,-3.9e-05,0.000384,1.6e-05,5.7e-05
0.00033,-0.00012,0.00027,0.000474,-0.000139,-8.3e-05,-8e-06,0.00017,0.00031,9.9e-05,3e-04,-0.000147,-0.000224,0.000229,0.000372,0.000178,0.000251,1.9e-05,0.000262,-9.1e-05,9.7e-05,6.6e-05,-0.000131,0.000456,-6.1e-05,0.000158,-4e-05,0.000311,7.8e-05,-0.000226,-0.000151,0.000217,0.000337,0.000143,-2.9e-05,0.000454,0.000177,0.00015,6.6e-05,0.000157,-0.000104,-0.000246,-0.00037,0.000326,-8.8e-05,-0.000242,-3.6e-05,-3.6e-05,7e-06,0.000315,0.000116,0.000485,0.000449,6.8e-05,-5.3e-05,0.000378,-5.6e-05,-6.4e-05,3.5e-05,-2.1e-05,0.000121,0.000153,9.7e-05,0.000391,-1.5e-05,-9.1e-05,9.7e-05,-3e-06,0.000277,8.1e-05,1e-06,0.000102,5e-04,0.000132,-4.5e-05,0.000105,6.1e-05,0.000222,-0.00015,-0.000144,-1e-06,-0.00021,-2e-04,0.000216,-8.6e-05,3.4e-05,-0.000106,-8.1e-05,-8.3e-05,-3e-06,0.000466,9.8e-05,-3.8e-05,0.000209,1.6e-05,-0.000171,1.5e-05,-0.000168,-4e-06,3e-06,-0.000294,-0.000232,-0.000297,-0.000195,-0.000119,-0.00027,-4.9e-05,0.000182,0.000214,-0.000297,-0.000111,0.000232,-5.2e-05,0.000115,-0.00019,-0.000103,0.000104,5e-05,-0.00022,-7.6e-05,0.000124
-1e-04,9.6e-05,8.6e-05,-0.000101,5e-06,7.2e-05,-9e-06,-0.000185,-9.4e-05,0.000135,-0.000158,6.9e-05,0.000153,-3.4e-05,0.000105,-0.000443,0.000107,0.000153,-2.7e-05,0.000108,6.2e-05,3.7e-05,0.000286,-0.000242,0.000212,7.4e-05,-8e-05,-9.8e-05,6.7e-05,0.000256,0.000408,-7.8e-05,-5.9e-05,0.00016,-9.2e-05,-0.000238,-0.000185,-0.000105,-5.9e-05,-3.2e-05,-0.000322,0.000346,0.000206,-0.000174,-0.000143,0.00016,-0.000195,8.6e-05,4e-05,-0.000144,-8.7e-05,-8.6e-05,-0.000305,4e-05,-9.3e-05,-0.000305,6e-06,0.000155,-2.2e-05,-0.000221,5.1e-05,-0.000212,-1e-05,-0.00043,4e-06,0.000163,-8.8e-05,-7.7e-05,-0.000174,-6.3e-05,0.000219,3.9e-05,-0.000217,-8.7e-05,0.000182,5.8e-05,-6.6e-05,-0.00019,0.000214,-1.2e-05,-3.8e-05,-5.2e-05,0.000152,-6.8e-05,0.000165,-9.5e-05,0.000103,3e-04,-8.4e-05,-0.000199,-0.000137,-0.000125,-3.9e-05,-2.4e-05,1.4e-05,0.000262,0.000149,0.000155,-1.1e-05,-0.000168,0.000109,0.000137,0.000104,0.000151,0.000108,0.000258,-0.000136,0.000281,-0.00012,-3.6e-05,0.00014,-0.000361,0.000179,-0.000132,6.4e-05,0.000259,-9e-05,-5e-05,9.2e-05,0.000114,-0.000137
0.00028,1.8e-05,-0.000111,0.00018,-7.6e-05,-6.7e-05,-4.8e-05,-6e-05,6.2e-05,-6.3e-05,0.000246,3.7e-05,-8.8e-05,0.000111,-0.000106,0.000411,-0.000156,-0.000237,-0.000104,-9.5e-05,-1.9e-05,-9.3e-05,-0.000196,0.00014,-0.000137,-3e-06,0.000254,4.4e-05,3.3e-05,-0.000132,-0.000272,-0.000177,-0.000133,-0.00037,3.8e-05,-2.9e-05,0.000146,2.7e-05,-3.1e-05,-6.5e-05,0.000506,-0.000168,-0.000115,-7.3e-05,0.000204,-3e-06,-7.4e-05,4e-05,3e-06,1.1e-05,3.7e-05,-1.7e-05,-2.8e-05,6.1e-05,-6.3e-05,0.000131,-1.6e-05,4.8e-05,-7.6e-05,-6e-06,-0.000132,5.1e-05,-8.1e-05,5.4e-05,-9.8e-05,-0.000207,6.9e-05,2e-06,-6e-06,-9e-06,-1e-05,-1e-05,-0.000165,-0.000108,-0.000184,-0.000202,1.9e-05,8e-06,4.7e-05,-9.2e-05,-7.6e-05,9.5e-05,-5.3e-05,-1.4e-05,-0.000107,-6e-05,-0.000141,-0.000182,0.000117,0.000182,-8.5e-05,-7.7e-05,0.000144,-5.8e-05,3.1e-05,-0.000393,-0.00011,-0.000218,0.000124,0.00018,8.7e-05,0.000116,-1.3e-05,-1.3e-05,-3e-05,-0.000348,0.000109,-0.000503,0.000241,0.000162,-0.000229,0.00031,-7.4e-05,0.000127,0.000109,-0.000147,-5.2e-05,-5.5e-05,-0.000136,-0.000106,4.1e-05
-0.000439,-0.000172,0.000199,-5.2e-05,-0.000103,3e-05,-2.9e-05,0.000348,-0.000114,-1.3e-05,-0.000228,0.000163,-3.5e-05,0.000104,0.000162,-0.000495,0.000104,0.000188,8.5e-05,-3e-06,-0.000265,0.000232,8e-06,-0.00017,-3.4e-05,3.9e-05,-5.3e-05,-0.000182,-0.000134,-2.4e-05,-1.2e-05,0.000226,0.000106,0.000165,2.6e-05,-0.000153,-0.00015,8.8e-05,1e-04,-2e-05,-0.00018,1e-05,2.2e-05,-2.1e-05,-0.00019,-0.000289,0.000195,-1e-06,-0.00011,8.7e-05,-5.8e-05,9.4e-05,0.000126,-7.8e-05,4.5e-05,-6.4e-05,1e-05,-0.000176,-5.1e-05,0.000137,0.000135,0.000172,8.7e-05,-6e-06,2.7e-05,0.000196,-1.1e-05,3.5e-05,-2.2e-05,0.000136,-3.8e-05,-1.3e-05,5.9e-05,9.2e-05,0.000127,-0.000145,4e-06,6.2e-05,-4e-06,5.1e-05,7e-06,8e-06,-8.6e-05,3e-05,-5.3e-05,-8e-06,-3.3e-05,0.00022,-6e-06,-5.7e-05,7.9e-05,0.000192,-2.9e-05,0.000121,-0.000182,4e-05,-0.000101,0.000112,-4.2e-05,-0.000142,-0.000148,-8.5e-05,-2.2e-05,7.9e-05,9.2e-05,0.000311,-4.7e-05,0.000257,-8.1e-05,-0.000107,0.000175,-0.000171,-0.000125,1.5e-05,-7e-05,0.000189,-5.5e-05,-5.3e-05,0.000134,0.000101,-2.2e-05
0.000506,0.000255,-0.000144,9.9e-05,0.000137,1e-06,-1.9e-05,-0.000396,3.6e-05,7.2e-05,0.000163,-6.9e-05,0.000107,-2.7e-05,-0.000267,0.000261,4.2e-05,-0.000174,-7.6e-05,-4.9e-05,0.000311,-0.000105,6.7e-05,0.000172,3.7e-05,2.1e-05,0.000145,0.000181,2.1e-05,3.5e-05,-2e-06,-7.9e-05,-5.7e-05,1.2e-05,3.1e-05,0.000216,-2.2e-05,-3e-06,-7e-05,-7.6e-05,9e-06,-0.000128,0.000103,6.5e-05,0.000204,7e-05,5.8e-05,-9.3e-05,0.000153,-3e-06,4.4e-05,-3.7e-05,-8.4e-05,4.6e-05,0.000107,-4.2e-05,9e-06,0.000122,7.1e-05,2e-06,-1.6e-05,-0.000186,-5.1e-05,-8e-06,2.1e-05,-6.3e-05,-3.5e-05,5.9e-05,1.4e-05,-7.2e-05,1.2e-05,1.2e-05,6.8e-05,-0.000158,-2.2e-05,0.000289,-4.6e-05,-8.9e-05,-5.6e-05,-2.1e-05,4.9e-05,3.5e-05,3e-06,-0.000149,3.1e-05,-1.3e-05,2.8e-05,-8.8e-05,-5.6e-05,3.1e-05,-0.000191,-0.000173,-6.8e-05,-2.5e-05,-0.000106,1e-05,0.000107,-2.6e-05,9.1e-05,-2.3e-05,7.9e-05,6.4e-05,3e-06,-6e-06,-0.000124,-0.000188,2.7e-05,-0.000174,2e-06,0.000159,-3.6e-05,-2.9e-05,0.000102,-0.000103,1.7e-05,-0.000152,0.000124,2.8e-05,-0.000102,-0.000185,9e-06
-0.000224,-0.00015,4.3e-05,2.1e-05,7.4e-05,3.8e-05,9.7e-05,0.000213,6.7e-05,-0.000148,-0.000187,5.6e-05,0.000127,1.6e-05,6.4e-05,-0.000234,-4e-05,6.4e-05,2.6e-05,-1.6e-05,-0.000226,8e-06,-0.000125,-0.000231,-6.1e-05,2.8e-05,-4.3e-05,-0.000171,3.1e-05,-1e-06,-1e-05,-9e-06,7.2e-05,-0.000164,-4.9e-05,-0.000152,5.1e-05,-3.3e-05,7e-06,3.5e-05,-1.5e-05,8.3e-05,-6.9e-05,-1.7e-05,-0.000229,0.00011,-2.4e-05,-2e-05,-0.000261,2.2e-05,6.4e-05,5.1e-05,7.9e-05,8.9e-05,-1.8e-05,0.000166,-4e-06,-1.7e-05,-7.3e-05,-3e-06,-1.1e-05,6.4e-05,5e-06,-4.2e-05,1.6e-05,2.5e-05,-3.4e-05,-2.3e-05,2e-05,2.8e-05,1.5e-05,0,-0.000118,7.6e-05,-5.5e-05,-0.000155,8.1e-05,-3.9e-05,3.2e-05,2.1e-05,-1.1e-05,7e-06,2.2e-05,7.7e-05,-5.4e-05,3.1e-05,2.9e-05,5.6e-05,4.7e-05,-5.8e-05,5.7e-05,0.000103,3.3e-05,-0.000173,-3.1e-05,-9e-06,-6.9e-05,0.000109,-0.000179,7.3e-05,-7.5e-05,2.4e-05,-4.6e-05,-5.1e-05,-3.7e-05,8.1e-05,-1.4e-05,-4.3e-05,2e-06,-0.000127,-8.8e-05,-7.8e-05,-3.9e-05,6.1e-05,5e-05,1.1e-05,-3.3e-05,6.4e-05,6.8e-05,8.8e-05,5.2e-05
7.5e-05,7e-05,1e-06,-0.000111,-0.000118,7.8e-05,-0.000102,-0.000133,-1.5e-05,1.6e-05,0.000157,-7.9e-05,2.2e-05,3e-05,2.2e-05,0.000178,-6e-06,6.3e-05,-2.3e-05,0.000102,6.3e-05,2.4e-05,0.000118,0.000213,0.000111,-7.9e-05,3.4e-05,9.6e-05,1.5e-05,-6.3e-05,-3.8e-05,8e-05,-5.2e-05,0.000127,3.6e-05,0.000142,-3.4e-05,-1e-06,2.3e-05,-1.6e-05,-5.1e-05,-0.000112,-5.1e-05,-3.5e-05,0.000155,-2.7e-05,2.9e-05,1e-04,0.000206,1.4e-05,-3e-06,-9.4e-05,8.5e-05,-0.000141,-5.5e-05,-0.000129,1.2e-05,3e-06,0.00011,7.3e-05,-6.8e-05,-8.4e-05,7e-06,0.000122,-5.8e-05,4e-06,9.3e-05,-3.8e-05,0.000105,3.3e-05,1.3e-05,-6e-06,2.4e-05,3.5e-05,3.5e-05,1e-04,1.3e-05,4.9e-05,4e-06,1.8e-05,-1e-06,-0.000145,-1.3e-05,3.7e-05,2e-06,-3.1e-05,-4.7e-05,-4e-06,-6.3e-05,2.1e-05,-3.2e-05,-1.2e-05,-2.8e-05,6e-05,0.000103,6.7e-05,-2.1e-05,-1.7e-05,4.1e-05,-4.8e-05,1.3e-05,-3.5e-05,-2.1e-05,8e-06,-2.7e-05,2.1e-05,-1e-05,2.4e-05,7.6e-05,-2.1e-05,0.000107,0.00013,-2.3e-05,-2.3e-05,-5.7e-05,-1.1e-05,7.6e-05,2.3e-05,-4.3e-05,8e-06,2e-05
-2.8e-05,-1.6e-05,-4.5e-05,4.8e-05,-5.9e-05,-7e-05,3.2e-05,0.000168,-5.6e-05,7.9e-05,-0.00011,3.4e-05,-8.1e-05,-6.7e-05,5.7e-05,-3.6e-05,-0.000101,-5.2e-05,-1.8e-05,-3.3e-05,-9e-06,-5.1e-05,-8e-05,-0.000124,-4.9e-05,7e-05,9e-06,-6.1e-05,-1.2e-05,0.000106,7e-05,-5.6e-05,5.1e-05,-0.000113,-4.8e-05,-3.7e-05,0,-1.5e-05,-3.4e-05,3.6e-05,2.2e-05,0.000141,1.5e-05,9e-06,-3e-06,1.3e-05,-5e-05,-0.000128,-0.000143,-9e-06,-1e-05,7.7e-05,-0.000122,7.8e-05,-5.8e-05,8.8e-05,-1.8e-05,-1.1e-05,-8.1e-05,-6e-05,4e-06,7.1e-05,5e-06,-5e-06,7.5e-05,-2e-06,-3.5e-05,-1.9e-05,4e-06,-1.5e-05,-3.1e-05,1.3e-05,4.9e-05,-2e-05,-4.6e-05,-5.9e-05,-2.8e-05,-4e-05,-4.3e-05,1.6e-05,-1.3e-05,6.6e-05,-2.5e-05,-6e-05,7e-06,2.2e-05,1e-05,-2.1e-05,3.4e-05,-2e-06,0.000101,-1e-06,-5e-06,6e-06,-1.3e-05,-1e-05,5.4e-05,-3.8e-05,-1.8e-05,6.6e-05,2.2e-05,1e-05,7.8e-05,5.1e-05,4e-05,-3.6e-05,5.5e-05,-2.6e-05,-0.000146,3.1e-05,-5.3e-05,-9.4e-05,-4.4e-05,2.4e-05,2.7e-05,-8e-06,-6.4e-05,5e-06,3.6e-05,-6e-06,-2.5e-05
2e-05,-1.8e-05,6e-05,-8.2e-05,2.6e-05,-2.3e-05,-4e-06,-6.3e-05,7.5e-05,-3.7e-05,6.8e-05,-3.8e-05,6e-06,8e-06,-1.3e-05,-1e-06,5.2e-05,3.2e-05,5.1e-05,-1.3e-05,2.9e-05,0.000117,6.6e-05,8.1e-05,-3e-06,-2.4e-05,-2.7e-05,4.9e-05,2e-06,-7.4e-05,-3.7e-05,-1.8e-05,-5.5e-05,4.1e-05,2.8e-05,1e-05,-3.8e-05,8e-06,3.5e-05,-1.8e-05,-5.8e-05,-6.4e-05,-5.4e-05,-1.6e-05,-7.6e-05,3.8e-05,-3.6e-05,-6.4e-05,5.9e-05,-3.1e-05,5e-06,-4.3e-05,7e-05,-6.4e-05,2e-05,-0.000133,2.1e-05,1.3e-05,-1e-05,-6e-06,6e-06,1.2e-05,1e-06,-9e-06,-1.6e-05,1.7e-05,1e-05,2.1e-05,-5.9e-05,0,5.7e-05,9e-06,-4.6e-05,2.9e-05,2e-06,-1e-06,-2e-06,3.3e-05,5.9e-05,-2e-05,1.5e-05,-2.7e-05,3.1e-05,3.2e-05,2.2e-05,-2.3e-05,1.4e-05,2e-05,-1.7e-05,3.2e-05,-8.6e-05,-4.9e-05,8e-06,-1.2e-05,-1e-05,-1.1e-05,-2.3e-05,-3.9e-05,-2.7e-05,-9e-06,-7e-05,1.8e-05,-8e-05,-3.2e-05,8e-06,4.5e-05,-5.1e-05,-3.7e-05,3.4e-05,-6e-05,3.7e-05,3.3e-05,6.3e-05,8e-06,-2e-06,3e-05,-8e-06,-6e-06,-5.6e-05,-2e-06,-2e-05
-1.6e-05,3.3e-05,-1.5e-05,5.8e-05,2.5e-05,-1.9e-05,1e-05,-4e-05,-3.8e-05,2.2e-05,-2.4e-05,-0.000103,4.9e-05,-4e-06,-2e-06,8.4e-05,3.3e-05,-2.7e-05,2e-06,-1.6e-05,-0.000102,-9.1e-05,-6.8e-05,-5.3e-05,2.6e-05,1.6e-05,4e-06,1.2e-05,-1.6e-05,6.2e-05,6e-06,2e-06,7e-06,1.6e-05,-2.7e-05,2.9e-05,6e-05,-4e-06,-2.7e-05,1.1e-05,2.9e-05,4.7e-05,4.4e-05,5e-05,6.5e-05,-7.3e-05,9e-06,5.3e-05,-7e-06,1e-06,1.5e-05,2.5e-05,-3.4e-05,3.5e-05,1.7e-05,7.5e-05,-9e-06,-1.7e-05,1.4e-05,1.3e-05,-3.9e-05,-8.9e-05,-1.8e-05,-5e-06,3e-06,-1.7e-05,-3.9e-05,1e-05,2.7e-05,4e-06,-3.9e-05,1e-06,3.9e-05,-3.4e-05,-5e-06,-1.7e-05,-6e-06,-1.7e-05,-7.3e-05,-1e-06,5e-06,-1e-06,-3e-06,1.1e-05,1.1e-05,-3e-06,1e-06,-5e-05,-1.6e-05,-3e-06,7.4e-05,3.6e-05,-4e-06,3.5e-05,3e-05,5e-06,1e-06,2e-06,1e-05,-3.9e-05,4.7e-05,-1.7e-05,5e-05,-3.1e-05,9e-06,-4.6e-05,2.3e-05,5e-05,-1.6e-05,4.7e-05,-4e-06,5.5e-05,-2.1e-05,-3.9e-05,-8e-06,-1.1e-05,-2e-06,-1.1e-05,1.6e-05,-2e-06,1.4e-05
-2e-05,-4e-05,7e-06,-3.6e-05,1e-05,3.4e-05,0,1.5e-05,-9e-06,6e-06,1e-05,9e-05,-5e-06,-3e-05,2.4e-05,-8.9e-05,-3e-05,3.4e-05,-2.2e-05,6e-06,0.000129,4.6e-05,3.6e-05,4e-05,-6.3e-05,1.2e-05,-1e-05,2e-06,4e-06,-3.2e-05,0,3e-06,2.6e-05,-2.4e-05,1.6e-05,1.1e-05,-2.4e-05,5e-06,1.8e-05,8e-06,1.4e-05,-6.7e-05,-1.7e-05,-4.4e-05,-2.7e-05,-5e-06,1.3e-05,-4.1e-05,5e-06,-1.9e-05,4e-06,0,2.4e-05,-4e-06,8e-06,-2.7e-05,0,-2e-06,1.1e-05,-2.7e-05,8e-06,5.4e-05,1.1e-05,-1e-05,1.5e-05,1e-06,2.5e-05,-3e-06,-3.8e-05,-7e-06,2e-05,-1.2e-05,-2e-06,3.2e-05,1.8e-05,-1e-06,5e-06,-3e-05,1.5e-05,1.6e-05,-4e-05,3e-05,-9e-06,-2.5e-05,-2e-06,1.5e-05,4e-06,4.3e-05,1.2e-05,-2.8e-05,-2.8e-05,-2.4e-05,2e-06,-2.1e-05,4.8e-05,-2.3e-05,1e-05,3.1e-05,-8e-06,3.3e-05,1e-06,1.4e-05,-4.9e-05,-7e-06,-1e-05,3.1e-05,-1.2e-05,-4.3e-05,1.3e-05,-1.6e-05,-1.4e-05,-5.4e-05,-1.9e-05,2.9e-05,-1.2e-05,2.8e-05,-6e-06,-4e-06,-7e-06,2.4e-05,7e-06
5.6e-05,9e-06,7e-06,1e-05,-3.2e-05,-5e-06,-1.8e-05,-2.6e-05,3.1e-05,-3.5e-05,-6e-06,-1.4e-05,5e-06,-4e-06,-3e-05,7.8e-05,-2.6e-05,-1.8e-05,1.1e-05,-2e-06,-9.7e-05,-2.1e-05,-4.9e-05,-4.3e-05,3.3e-05,9e-06,1.7e-05,-9e-06,-1e-06,-9e-06,8e-06,-1e-05,-2.5e-05,1.5e-05,-4e-06,-4.4e-05,8e-06,0,-1.1e-05,-2.3e-05,-1.4e-05,6.4e-05,-9e-06,1e-05,-6e-06,2.4e-05,2.2e-05,1e-05,-1e-06,1.3e-05,0,-4.3e-05,2e-06,5e-06,-2e-06,3.9e-05,-3e-06,2.9e-05,0,2e-06,2e-06,-4e-05,3e-06,7e-06,1e-06,9e-06,1e-06,-1e-06,-9e-06,1.5e-05,-2.8e-05,-7e-06,-2e-06,-3.3e-05,-1.7e-05,1.4e-05,3e-06,2.8e-05,1.8e-05,1e-06,2.2e-05,-3.3e-05,6e-06,-3.6e-05,8e-06,-7e-06,1.3e-05,-2.4e-05,-1.5e-05,2.4e-05,-2.4e-05,3e-06,-8e-06,1.6e-05,-4e-06,2e-06,-8e-06,-5e-06,8e-06,-3.2e-05,-3.7e-05,-1e-05,4.1e-05,9e-06,-2e-06,-2e-05,-1e-06,0,-2.8e-05,-1.6e-05,1.7e-05,2.6e-05,5e-06,2e-06,5e-06,-1.9e-05,2.2e-05,-2e-06,2.2e-05,-3.3e-05,1.6e-05
-8.4e-05,3.2e-05,-3e-06,-1.3e-05,2.3e-05,3.1e-05,3e-06,6.3e-05,-3.4e-05,2.9e-05,-1.5e-05,2.5e-05,0,2e-06,2.9e-05,-8.1e-05,5.7e-05,-1.6e-05,-1e-06,5e-06,7e-05,-1.2e-05,4.1e-05,6e-05,1.4e-05,-1e-05,1e-06,1.7e-05,0,2.2e-05,-1.7e-05,2e-06,3.6e-05,1.8e-05,4e-06,1.9e-05,8e-06,-1e-05,-2e-06,1.7e-05,-1.2e-05,-4.9e-05,1.8e-05,1.5e-05,1.5e-05,1.4e-05,-3e-06,-2.5e-05,7e-06,3e-06,0,1.2e-05,3e-06,-1.8e-05,-1.8e-05,-3.9e-05,1.4e-05,-3.4e-05,1.1e-05,-8e-06,1.6e-05,5.6e-05,0,-3.1e-05,-7e-06,-2.3e-05,1.1e-05,-8e-06,-9e-06,-1.3e-05,4e-06,-1e-06,-1.2e-05,6e-06,9e-06,1.2e-05,0,1e-05,-2.2e-05,-8e-06,-4e-06,1.8e-05,-1e-06,3.7e-05,9e-06,-5e-06,-6e-06,7e-06,1.4e-05,-9e-06,2.4e-05,5e-06,-3e-06,-2.5e-05,-1.8e-05,-1.6e-05,1e-06,-4e-06,-1e-06,1.1e-05,3.2e-05,1.5e-05,-8e-06,1.6e-05,-6e-06,8e-06,8e-06,2.5e-05,1.1e-05,4.5e-05,-9e-06,-3.2e-05,3e-06,-5e-06,2e-06,-1.6e-05,6e-06,1e-06,-2.7e-05,7e-06,-4e-06
8.7e-05,-4.7e-05,-9e-06,2.1e-05,-2.7e-05,-3e-05,2.8e-05,-3.6e-05,2.6e-05,-8e-06,2.8e-05,-1e-06,4e-06,-2e-05,-2.3e-05,7.1e-05,-3.5e-05,3.3e-05,-2e-05,6e-06,-4.9e-05,3.9e-05,-2.2e-05,-5.4e-05,-1.4e-05,-1.3e-05,0,6e-06,2e-06,-2.6e-05,2.8e-05,1.8e-05,-1e-05,-3e-06,-1.9e-05,5e-06,1.1e-05,4e-06,1.2e-05,-1.4e-05,2.4e-05,3.2e-05,-1.7e-05,2e-06,-1.6e-05,-1e-05,-2.7e-05,1.7e-05,-1e-05,-1.5e-05,7e-06,-1.5e-05,-1.6e-05,2.5e-05,0,2.3e-05,-1.7e-05,6e-06,-8e-06,9e-06,-2.6e-05,-1.6e-05,-5e-06,1e-06,-3e-06,2.3e-05,-1.5e-05,0,2e-06,4e-06,7e-06,4e-06,3.6e-05,3e-06,1.3e-05,-1.3e-05,3e-06,-1.5e-05,1.8e-05,4e-06,-8e-06,1.4e-05,-1.4e-05,-7e-06,-3e-06,-3e-06,5e-06,2e-06,1.2e-05,2.2e-05,-1.4e-05,1.5e-05,5e-06,-4e-06,-1.1e-05,1.7e-05,6e-06,-2.9e-05,-4e-06,8e-06,-1.5e-05,-5e-06,5e-06,1e-05,0,-3e-06,-1.8e-05,1e-05,2.6e-05,-3.7e-05,0,1.7e-05,9e-06,4e-06,-9e-06,2.3e-05,-2.5e-05,0,1.6e-05,3e-06,-7e-06
-4.9e-05,3.2e-05,4e-06,-5e-06,2e-06,-4e-06,-2.7e-05,3.2e-05,-1.7e-05,-7e-06,-3e-05,-8e-06,2.1e-05,-1e-06,7e-06,-6.1e-05,-5e-06,-1.6e-05,1.7e-05,2e-06,6.5e-05,-3.3e-05,2.3e-05,4e-05,2.6e-05,2.1e-05,-4e-06,-1.4e-05,3e-06,2.4e-05,-1e-05,-8e-06,-1e-05,-9e-06,-1e-06,-4.7e-05,-3.1e-05,6e-06,-1e-05,1e-05,-1e-06,-3.8e-05,1.7e-05,-1.7e-05,-2e-06,1.3e-05,7e-06,3.7e-05,7e-06,-6e-06,-6e-06,1e-06,1e-05,4e-06,1.1e-05,-1.6e-05,3e-06,6e-06,-2.2e-05,0,1.8e-05,-3.1e-05,-3e-06,5e-06,9e-06,-1.8e-05,-4e-06,1.1e-05,-7e-06,9e-06,0,2e-06,-4.3e-05,-1.1e-05,-2.9e-05,-1e-06,-6e-06,1e-05,-1.9e-05,-2e-06,3e-06,-1.1e-05,-1e-06,2.5e-05,8e-06,2e-06,-7e-06,-1.4e-05,-2.3e-05,-2.5e-05,3e-06,-1.2e-05,5e-06,-3e-06,1.2e-05,-2.5e-05,-1e-05,4e-06,-1.9e-05,-1.2e-05,-2e-06,-1e-05,-1.2e-05,-1.6e-05,6e-06,-1e-06,1.6e-05,-3e-06,-5e-06,1.7e-05,-1.3e-05,-3e-05,-4e-06,-1.5e-05,9e-06,-2.5e-05,-2e-06,-3e-06,-8e-06,1e-06,-4e-06
2.7e-05,2e-06,6e-06,-2.7e-05,1.6e-05,-4e-06,7e-06,-6e-05,1.3e-05,9e-06,3.3e-05,-3e-06,-8e-06,2e-06,2.4e-05,8e-06,6e-06,-3e-06,-2e-06,-1.2e-05,-6.5e-05,1.4e-05,-2.7e-05,-2.4e-05,-3.6e-05,-2.5e-05,-7e-06,9e-06,-7e-06,-9e-06,4e-06,4e-06,-6e-06,1.3e-05,-1e-06,3.1e-05,8e-06,-7e-06,1.3e-05,-5e-06,-7e-06,4.8e-05,2e-06,1.5e-05,2.1e-05,-1.6e-05,1.2e-05,-2.2e-05,-9e-06,7e-06,4e-06,-2.8e-05,-4e-06,-1.3e-05,6e-06,6e-06,5e-06,2e-06,1.6e-05,9e-06,4e-06,1.2e-05,5e-06,4e-06,-1.1e-05,1.6e-05,6e-06,-3e-06,2.7e-05,-6e-06,9e-06,-1e-06,1.7e-05,2.3e-05,2.3e-05,-1.4e-05,-3e-06,-1.3e-05,1.3e-05,-3e-06,6e-06,1.5e-05,3e-06,-2.3e-05,-1.3e-05,-8e-06,0,1.4e-05,0,5e-06,3e-06,4e-06,-1.2e-05,7e-06,-5e-06,-1e-05,5e-06,-6e-06,-1e-06,9e-06,2.9e-05,1.1e-05,1.9e-05,-1e-06,-2e-06,2e-06,-9e-06,1.6e-05,-1.6e-05,-6e-06,1e-05,3.2e-05,3e-06,1.5e-05,-7e-06,1.9e-05,-6e-06,-2e-06,1.2e-05,3e-06,0
-4.2e-05,-2.7e-05,-1.5e-05,1.6e-05,1e-05,1.5e-05,1e-06,4.4e-05,3e-06,-4e-06,-3.6e-05,-2.4e-05,6e-06,-7e-06,-1e-06,8e-06,6e-06,-4e-06,3e-06,-1e-06,4.9e-05,-1.1e-05,1.6e-05,1.9e-05,1.1e-05,2.1e-05,-3e-06,-1.8e-05,-5e-06,1e-06,-6e-06,-1e-06,7e-06,-6e-06,1e-05,-5e-06,3e-06,0,-1.5e-05,-3e-06,-4e-06,-3.5e-05,-2.3e-05,-7e-06,-2.5e-05,-1.7e-05,-8e-06,2.7e-05,2e-06,-2e-06,1e-06,2.6e-05,1e-06,6e-06,2e-06,1.9e-05,2e-06,-1.3e-05,0,-2e-06,2e-06,-1.3e-05,3e-06,-3e-06,5e-06,-7e-06,5e-06,-5e-06,-4e-06,-5e-06,-1.1e-05,-5e-06,6e-06,-2.2e-05,-4e-06,4e-06,1e-06,3e-06,3e-06,3e-06,-4e-06,-2e-05,-1e-05,-7e-06,5e-06,-2e-06,-7e-06,-2e-05,9e-06,-9e-06,7e-06,1e-06,6e-06,1.3e-05,-1.6e-05,6e-06,1e-06,2.9e-05,-6e-06,0,-2.2e-05,-5e-06,-2.3e-05,1.2e-05,5e-06,-6e-06,1e-06,-5e-06,-3e-06,-2.1e-05,-4e-06,-1.9e-05,1e-05,4e-06,7e-06,-6e-06,-1e-06,5e-06,-1.1e-05,-3e-06,7e-06
5.6e-05,3.4e-05,1.6e-05,-5e-06,-7e-06,-2e-06,3e-06,-1.9e-05,-2.8e-05,9e-06,3.5e-05,1.6e-05,4e-06,3e-06,0,9e-06,1e-06,8e-06,1.4e-05,3e-06,-1.4e-05,4e-06,-1.2e-05,-2e-05,4e-06,1e-06,-1e-06,1.9e-05,0,-5e-06,1e-05,-6e-06,-1.2e-05,-2.2e-05,3e-06,-1.6e-05,4e-06,1e-06,8e-06,-1e-06,-3e-06,2.8e-05,9e-06,-2e-06,2.6e-05,1.7e-05,0,7e-06,-1e-06,-4e-06,-2e-06,4e-06,1.9e-05,-3e-06,-1.2e-05,-1.8e-05,1e-06,1.1e-05,8e-06,5e-06,-4e-06,4.1e-05,-4e-06,1.6e-05,1e-06,-3e-06,-3e-06,-1e-06,4e-06,1e-05,9e-06,-5e-06,-8e-06,1.1e-05,-1.2e-05,1.6e-05,1e-06,1.3e-05,-1.5e-05,5e-06,-1e-06,-8e-06,1e-06,1.4e-05,-1e-05,5e-06,5e-06,1.5e-05,-3e-06,1.1e-05,-2.9e-05,3e-06,1e-05,-1.7e-05,-1.3e-05,-1e-06,-4e-06,-2e-06,1.5e-05,-1.4e-05,2.6e-05,-9e-06,2.6e-05,0,-4e-06,1e-05,1e-06,-2e-06,1.1e-05,2.4e-05,0,2.2e-05,-7e-06,-1.3e-05,1e-06,1e-05,1.7e-05,8e-06,8e-06,3e-06,3e-06
-4.2e-05,-2.2e-05,-1e-06,1.2e-05,-1.3e-05,1e-06,1e-06,1.7e-05,3.1e-05,-4e-06,-3.2e-05,-2.8e-05,0,7e-06,-9e-06,-1.8e-05,6e-06,2e-06,-1.5e-05,2e-06,-6e-06,1.9e-05,1e-06,2.3e-05,-1.3e-05,-3e-06,-1e-06,-1.7e-05,3e-06,6e-06,-1.5e-05,0,1.5e-05,2.4e-05,-4e-06,2.6e-05,3e-06,0,-2e-06,-1e-05,5e-06,-3.6e-05,-1.4e-05,7e-06,-8e-06,1.2e-05,-1e-06,1.2e-05,-2e-06,2e-06,2e-06,-1.1e-05,-3.5e-05,4e-06,-7e-06,2.5e-05,-4e-06,-3e-06,-1e-06,-4e-06,5e-06,-2.3e-05,-2e-06,4e-06,4e-06,7e-06,-2e-06,2e-06,1e-05,-4e-06,-8e-06,-1e-06,-1.4e-05,0,1.7e-05,-9e-06,-1e-06,-1.3e-05,2.6e-05,-2e-06,1e-06,1.4e-05,8e-06,-1.7e-05,1e-06,-1e-06,-8e-06,-1e-05,8e-06,-2e-06,2e-05,-1e-05,-1e-05,1.5e-05,6e-06,1.3e-05,1e-06,1e-06,0,1.6e-05,7e-06,1.2e-05,-2e-05,-9e-06,6e-06,-1.1e-05,-7e-06,4e-06,-8e-06,-1.5e-05,9e-06,-1.9e-05,2e-06,7e-06,-6e-06,-2e-06,-2e-06,6e-06,-1e-06,-5e-06,0
7e-06,1e-06,-1e-05,-1.2e-05,-6e-06,-8e-06,-9e-06,-1.4e-05,-9e-06,-6e-06,3.1e-05,1.8e-05,-4e-06,3e-06,7e-06,2.2e-05,-1.1e-05,-1.2e-05,-1.2e-05,5e-06,5e-06,-2.2e-05,8e-06,-2.1e-05,2.7e-05,1e-06,2e-06,1e-05,1e-06,-9e-06,1.3e-05,-7e-06,8e-06,-2.1e-05,-6e-06,-4e-06,-4e-06,2e-06,0,4e-06,-4e-06,2.5e-05,-2e-06,-1.8e-05,-9e-06,-1.2e-05,-8e-06,8e-06,1e-06,1e-06,-2e-06,9e-06,3.3e-05,-3e-06,6e-06,-3.6e-05,6e-06,-3e-06,-1.1e-05,1e-06,9e-06,-9e-06,2e-06,-1e-06,-9e-06,-6e-06,1e-06,0,-9e-06,-4e-06,-1e-06,2e-06,2.2e-05,-9e-06,-1e-05,6e-06,0,-2e-06,-2.8e-05,-2e-06,2e-06,-3e-06,-2e-06,2e-06,-4e-06,-5e-06,3e-06,5e-06,-7e-06,-4e-06,-8e-06,6e-06,3e-06,-8e-06,1.4e-05,3e-06,-1e-06,-1.8e-05,9e-06,-1.2e-05,-1.9e-05,-9e-06,1e-05,-5e-06,-1e-05,1.3e-05,9e-06,-1.8e-05,5e-06,8e-06,-8e-06,-4e-06,-8e-06,-1e-06,4e-06,-1.7e-05,-5e-06,0,1e-06,1e-06,-6e-06
1.1e-05,2.1e-05,1.1e-05,9e-06,1.5e-05,-2e-06,3e-06,-7e-06,-1e-05,-2e-06,-2.9e-05,1.4e-05,-3e-06,5e-06,-1e-06,-2.4e-05,1e-05,1.3e-05,1.1e-05,-1e-06,7e-06,1.5e-05,-2e-06,1.7e-05,-1.7e-05,0,1e-06,-1.1e-05,-2e-06,1.4e-05,-7e-06,4e-06,-1.5e-05,5e-06,-3e-06,-1e-05,8e-06,-1e-06,5e-06,-5e-06,6e-06,-2.9e-05,1.1e-05,1.9e-05,1e-05,4e-06,6e-06,-9e-06,0,1e-06,-2e-06,1e-06,-2.5e-05,1e-06,8e-06,2.5e-05,-2e-06,3e-06,-8e-06,-1e-06,-9e-06,-1e-06,3e-06,-3e-06,1.2e-05,6e-06,3e-06,0,-5e-06,5e-06,6e-06,3e-06,-9e-06,1.3e-05,-1e-06,-1e-05,0,5e-06,1.6e-05,4e-06,-6e-06,5e-06,-4e-06,1.6e-05,-2e-06,0,0,0,-7e-06,4e-06,-7e-06,0,2e-06,-1e-05,-4e-06,-8e-06,1e-06,7e-06,-5e-06,8e-06,1.8e-05,0,-4e-06,-3e-06,3e-06,-1.2e-05,-6e-06,1e-05,-2e-06,3e-06,6e-06,1.3e-05,5e-06,0,1e-06,1.7e-05,-1e-06,-4e-06,-8e-06,-5e-06,-2e-06
-7e-06,-2.7e-05,-7e-06,2e-06,4e-06,6e-06,9e-06,2.9e-05,1.1e-05,3e-06,2.2e-05,-1e-05,8e-06,7e-06,7e-06,3.1e-05,-7e-06,-1e-06,-7e-06,-4e-06,-2.5e-05,-1.9e-05,9e-06,-1e-05,0,-4e-06,1e-06,1.2e-05,-3e-06,-1.3e-05,5e-06,-1e-06,9e-06,3e-06,6e-06,1.8e-05,-1.7e-05,-1e-06,-7e-06,5e-06,3e-06,3.3e-05,-1.3e-05,-8e-06,-1.1e-05,1e-06,9e-06,7e-06,-3e-06,-1e-06,3e-06,7e-06,1.3e-05,-1e-06,3e-06,-1.3e-05,-1e-06,3e-06,1e-05,-2e-06,2e-06,2e-06,-2e-06,-3e-06,-7e-06,-4e-06,2e-06,3e-06,-1e-06,-1e-06,-6e-06,-1e-06,-1e-05,-1.6e-05,4e-06,2e-06,-2e-06,-4e-06,4e-06,2e-06,1e-06,3e-06,3e-06,-2e-06,4e-06,3e-06,4e-06,-3e-06,1.1e-05,-3e-06,1.3e-05,-2e-06,-2e-06,9e-06,-4e-06,-1e-06,-2e-06,1e-06,0,-1e-06,-1.4e-05,2e-06,-2e-06,7e-06,-2e-06,1e-05,3e-06,-7e-06,1e-05,-1.3e-05,-4e-06,-1.9e-05,-1e-06,5e-06,-4e-06,-1.6e-05,2e-06,-5e-06,5e-06,9e-06,1e-06
6e-06,1.5e-05,-2e-06,6e-06,-7e-06,3e-06,-1.1e-05,-2.7e-05,-4e-06,3e-06,-1.7e-05,2.1e-05,3e-06,6e-06,-1e-06,-2.8e-05,-5e-06,-5e-06,3e-06,-1e-06,1.6e-05,8e-06,-1.2e-05,6e-06,7e-06,-4e-06,0,-1e-05,0,3e-06,-4e-06,0,-5e-06,-7e-06,6e-06,0,9e-06,2e-06,5e-06,3e-06,-7e-06,-2.3e-05,5e-06,2e-06,2e-06,-1.1e-05,5e-06,-1.4e-05,8e-06,0,-2e-06,-1e-06,-5e-06,-2e-06,-4e-06,1e-05,-2e-06,-7e-06,2e-06,-1e-06,0,2.1e-05,-1e-06,-4e-06,0,-1e-06,-5e-06,-2e-06,-6e-06,-1e-06,6e-06,-3e-06,2e-05,1.6e-05,1e-06,-5e-06,-1e-06,4e-06,-9e-06,-3e-06,3e-06,-1.1e-05,-1e-06,-3e-06,-2e-06,-3e-06,-1e-06,6e-06,-4e-06,1.1e-05,-3e-06,-2e-06,-4e-06,-4e-06,8e-06,-1.2e-05,0,1.3e-05,-3e-06,-3e-06,-6e-06,-4e-06,2e-06,6e-06,6e-06,-4e-06,-1e-06,-8e-06,-9e-06,1.5e-05,-1e-06,1.2e-05,-3e-06,-7e-06,-2e-06,1.3e-05,-3e-06,-3e-06,-2e-06,-4e-06,4e-06
-1.1e-05,2e-06,7e-06,-8e-06,-2e-06,-3e-06,3e-06,2.6e-05,5e-06,-2e-06,1.3e-05,-1.9e-05,-4e-06,0,-6e-06,1.7e-05,8e-06,1e-06,1.2e-05,0,3e-06,3e-06,7e-06,-3e-06,-1.6e-05,9e-06,-2e-06,8e-06,2e-06,3e-06,5e-06,4e-06,-5e-06,4e-06,3e-06,-1.9e-05,3e-06,0,-6e-06,0,-5e-06,1.9e-05,-1e-06,-2e-06,6e-06,6e-06,0,7e-06,-1.3e-05,6e-06,2e-06,7e-06,1e-05,6e-06,-7e-06,-5e-06,3e-06,4e-06,2e-06,0,1e-06,-2e-05,1e-06,-9e-06,0,5e-06,2e-06,-4e-06,-2e-06,1e-06,-5e-06,-2e-06,-8e-06,-1e-05,-8e-06,7e-06,1e-06,-2e-06,1.1e-05,1e-06,-4e-06,5e-06,-4e-06,-5e-06,4e-06,0,4e-06,-7e-06,0,-9e-06,-7e-06,6e-06,3e-06,4e-06,7e-06,-3e-06,1e-06,-2e-06,-4e-06,3e-06,6e-06,4e-06,-1e-06,-4e-06,-7e-06,-2e-06,-1e-06,1e-06,5e-06,-7e-06,4e-06,4e-06,-1e-06,3e-06,6e-06,-3e-06,1e-05,1e-06,4e-06,-1e-06,2e-06
2e-05,-1.5e-05,-6e-06,-3e-06,-5e-06,0,0,-4.4e-05,-8e-06,3e-06,-7e-06,-8e-06,-2e-06,7e-06,8e-06,-6e-06,-4e-06,1e-06,-5e-06,3e-06,-2e-05,-5e-06,-9e-06,1e-06,1.8e-05,-8e-06,0,-4e-06,-1e-06,-8e-06,-7e-06,-2e-06,8e-06,6e-06,-6e-06,2e-05,3e-06,-2e-06,4e-06,3e-06,4e-06,-2.6e-05,-6e-06,5e-06,-1e-05,7e-06,-1.2e-05,-1.3e-05,1.3e-05,1e-06,-1e-06,1e-06,-1.7e-05,-1e-05,0,4e-06,-1e-06,3e-06,-1e-06,0,-7e-06,0,1e-06,1e-06,4e-06,-5e-06,0,2e-06,6e-06,-1e-06,5e-06,1e-06,-7e-06,2e-06,7e-06,1e-06,0,-7e-06,-5e-06,1e-06,1e-06,2e-06,1e-06,-7e-06,-2e-06,2e-06,-1e-06,6e-06,3e-06,6e-06,1e-05,-3e-06,-1e-06,-2e-06,0,0,-3e-06,-6e-06,1e-06,0,-1.2e-05,-3e-06,-3e-06,-3e-06,6e-06,9e-06,4e-06,-1e-06,-5e-06,-1e-06,-3e-06,0,0,4e-06,-4e-06,2e-06,-5e-06,2e-06,-5e-06,7e-06,-3e-06
-2.5e-05,2e-05,1e-06,8e-06,6e-06,0,1e-06,3.7e-05,4e-06,-2e-06,2e-06,-4e-06,2e-06,3e-06,-3e-06,-5e-06,-2e-06,2e-06,-3e-06,0,2.3e-05,1e-05,1e-05,0,-1e-05,6e-06,-1e-06,3e-06,0,1.2e-05,5e-06,0,2e-06,-4e-06,-6e-06,-6e-06,-5e-06,2e-06,0,-2e-06,3e-06,2.5e-05,9e-06,-5e-06,1.1e-05,-5e-06,-8e-06,-1.9e-05,-1.2e-05,-3e-06,-2e-06,6e-06,1.4e-05,7e-06,4e-06,-1.1e-05,0,-6e-06,-8e-06,1e-06,-1e-06,-2e-06,0,3e-06,-8e-06,4e-06,3e-06,1e-06,-3e-06,3e-06,-5e-06,2e-06,9e-06,6e-06,1e-06,1e-06,0,6e-06,3e-06,-1e-06,1e-06,-7e-06,2e-06,2e-06,3e-06,0,2e-06,-4e-06,-6e-06,-7e-06,-4e-06,-1e-06,-1e-06,0,-6e-06,1e-06,1e-06,-1.1e-05,3e-06,-2e-06,5e-06,-1e-06,4e-06,4e-06,-4e-06,-1.1e-05,-6e-06,-5e-06,3e-06,2e-06,1e-06,-1.3e-05,1e-06,-4e-06,-2e-06,6e-06,-3e-06,1e-06,4e-06,-7e-06,-2e-06
2.2e-05,-1.4e-05,6e-06,-3e-06,3e-06,1e-06,0,-1.8e-05,2e-06,-3e-06,3e-06,0,0,-2e-06,1e-06,1.8e-05,1e-05,-6e-06,1e-06,1e-06,-1.8e-05,-1.4e-05,-5e-06,-1e-06,0,0,0,-1e-06,2e-06,-1e-05,-2e-06,-1e-06,-8e-06,0,-1e-06,-1.7e-05,9e-06,1e-06,-1e-06,0,-1e-06,-2.1e-05,-8e-06,2e-06,-4e-06,-1e-06,4e-06,8e-06,7e-06,0,3e-06,5e-06,-7e-06,-4e-06,3e-06,4e-06,0,3e-06,-1e-06,0,3e-06,8e-06,-1e-06,0,5e-06,-2e-06,-3e-06,1e-06,4e-06,-2e-06,2e-06,1e-06,3e-06,-1e-05,-1.1e-05,-5e-06,0,1e-06,0,-2e-06,0,5e-06,-3e-06,1.2e-05,-1e-06,-3e-06,-2e-06,3e-06,5e-06,7e-06,-6e-06,2e-06,1e-06,0,-3e-06,-2e-06,0,3e-06,3e-06,4e-06,0,3e-06,-3e-06,3e-06,3e-06,1.2e-05,3e-06,9e-06,-5e-06,-8e-06,-1e-06,1.6e-05,-2e-06,2e-06,6e-06,-1.3e-05,1e-06,0,-2e-06,3e-06,-1e-06
-1.2e-05,-1e-06,-5e-06,-1e-06,-2e-06,2e-06,-3e-06,2.1e-05,-7e-06,3e-06,-7e-06,-2e-06,-1e-06,2e-06,-1e-06,-2.6e-05,-5e-06,3e-06,-1.2e-05,0,1.2e-05,1.1e-05,8e-06,3e-06,1e-05,-2e-06,1e-06,-1e-06,0,2e-06,1e-06,-2e-06,7e-06,5e-06,7e-06,2.1e-05,-7e-06,-2e-06,2e-06,-1e-06,-2e-06,2.1e-05,-3e-06,0,-5e-06,4e-06,4e-06,-1e-05,-3e-06,3e-06,-1e-06,-8e-06,-4e-06,1e-06,-2e-06,3e-06,2e-06,1e-06,7e-06,1e-06,-4e-06,7e-06,1e-06,3e-06,1e-06,1e-06,0,-1e-06,4e-06,-1e-06,1e-06,-1e-06,-1.6e-05,1.2e-05,1.3e-05,2e-06,-1e-06,-1e-06,-4e-06,1e-06,-1e-06,-4e-06,0,-6e-06,0,0,1e-06,-1e-06,1e-06,-3e-06,1e-05,1e-06,0,-3e-06,1e-06,-2e-06,-2e-06,9e-06,0,-4e-06,-1e-05,-3e-06,-1e-06,-1e-06,-5e-06,-1.1e-05,-1e-06,-6e-06,1e-06,8e-06,1e-06,-1.6e-05,0,-2e-06,-1e-06,1e-05,-3e-06,0,0,-2e-06,2e-06
2e-06,1.4e-05,-1e-06,-2e-06,-1e-06,-3e-06,1e-06,-1.1e-05,7e-06,-3e-06,1.1e-05,2e-06,-2e-06,0,1e-06,2.1e-05,-8e-06,2e-06,4e-06,-5e-06,-1.7e-05,-3e-06,-6e-06,-6e-06,-1.7e-05,-1e-06,1e-06,2e-06,-2e-06,0,-1e-06,0,-3e-06,-1e-06,5e-06,-1.3e-05,0,0,-3e-06,0,-2e-06,-2.1e-05,2e-06,-4e-06,1.3e-05,-6e-06,4e-06,2e-06,0,1e-06,-2e-06,2e-06,1.2e-05,0,-4e-06,-3e-06,1e-06,-1e-06,4e-06,0,-1e-06,-1.6e-05,0,6e-06,-2e-06,0,-2e-06,-1e-06,-1e-06,3e-06,-2e-06,-1e-06,1.4e-05,-1.1e-05,-6e-06,-3e-06,1e-06,0,5e-06,0,0,-1e-06,2e-06,3e-06,0,2e-06,-3e-06,0,-4e-06,-1e-06,-3e-06,-4e-06,2e-06,4e-06,-2e-06,2e-06,2e-06,5e-06,-2e-06,4e-06,7e-06,2e-06,2e-06,-4e-06,5e-06,7e-06,2e-06,5e-06,1e-06,-1e-06,-1e-06,2e-06,2e-06,-1e-06,-4e-06,-1e-05,1e-06,2e-06,-1e-06,0,2e-06
1e-06,-1.8e-05,5e-06,6e-06,0,0,3e-06,-1.3e-05,-4e-06,0,-1.3e-05,1.6e-05,1e-06,-5e-06,0,-2e-05,1.1e-05,-4e-06,1.1e-05,3e-06,3.1e-05,-1e-06,3e-06,8e-06,1.3e-05,1e-06,1e-06,-2e-06,1e-06,-3e-06,3e-06,-2e-06,-3e-06,-3e-06,-1e-06,-2e-06,0,1e-06,2e-06,1e-06,2e-06,1.8e-05,-9e-06,5e-06,-1.4e-05,-2e-06,2e-06,-7e-06,1e-06,-2e-06,2e-06,2e-06,-1.2e-05,0,-1e-06,9e-06,-1e-06,-3e-06,-2e-06,0,1e-06,1e-06,0,1e-06,-1e-06,-2e-06,3e-06,0,-1e-06,-2e-06,2e-06,0,0,8e-06,-4e-06,3e-06,0,-4e-06,-9e-06,-1e-06,2e-06,8e-06,-2e-06,2e-06,-1e-06,-2e-06,1e-06,1e-06,3e-06,0,-4e-06,2e-06,-1e-06,-4e-06,-3e-06,1e-06,-1e-06,-2e-06,-6e-06,-3e-06,-7e-06,1e-06,-5e-06,-3e-06,-4e-06,-3e-06,0,2e-06,1e-06,-1e-06,1e-06,1e-05,0,4e-06,2e-06,6e-06,6e-06,3e-06,2e-06,3e-06,0
2e-06,1.2e-05,-4e-06,-1e-06,1e-06,1e-06,-3e-06,1.8e-05,-2e-06,4e-06,1.5e-05,-5e-06,0,0,0,1.8e-05,-7e-06,0,-3e-06,1e-06,-3.8e-05,0,-6e-06,-1e-05,-5e-06,-1e-06,0,3e-06,2e-06,5e-06,-4e-06,1e-06,9e-06,5e-06,-8e-06,8e-06,5e-06,-1e-06,-1e-06,1e-06,1e-06,-2e-05,5e-06,-6e-06,9e-06,8e-06,-5e-06,4e-06,-1e-06,0,-1e-06,-3e-06,1.1e-05,2e-06,4e-06,-1.4e-05,0,6e-06,-3e-06,0,3e-06,3e-06,-1e-06,0,6e-06,1e-06,-1e-06,0,1e-06,-2e-06,-1e-06,1e-06,-1.1e-05,-1e-06,9e-06,2e-06,0,2e-06,5e-06,-1e-06,-2e-06,-5e-06,-2e-06,-8e-06,0,-1e-06,-1e-06,-2e-06,-1e-06,-2e-06,6e-06,1e-06,-1e-06,3e-06,-2e-06,2e-06,0,-9e-06,-2e-06,2e-06,0,-1e-06,6e-06,3e-06,3e-06,-3e-06,-1e-06,-2e-06,-1e-06,0,1e-06,-8e-06,0,-3e-06,3e-06,3e-06,-7e-06,2e-06,0,-1e-06,-2e-06
0,1e-06,0,-4e-06,1e-06,3e-06,1e-06,-2.1e-05,5e-06,-1e-06,-1.7e-05,2e-06,-3e-06,-3e-06,0,-1.4e-05,-1e-06,2e-06,3e-06,0,3.3e-05,-7e-06,2e-06,1e-05,-4e-06,-1e-06,0,-6e-06,0,-1e-06,3e-06,0,-1e-06,-4e-06,-4e-06,2e-06,-4e-06,0,0,0,2e-06,2.4e-05,0,4e-06,0,-2e-06,-2e-06,1.3e-05,0,0,0,-5e-06,-1.4e-05,-3e-06,3e-06,8e-06,1e-06,-4e-06,-5e-06,0,-2e-06,8e-06,1e-06,0,-5e-06,0,1e-06,2e-06,-2e-06,2e-06,1e-06,1e-06,7e-06,-6e-06,-6e-06,0,0,2e-06,0,1e-06,0,1e-06,2e-06,-4e-06,-1e-06,2e-06,1e-06,2e-06,2e-06,7e-06,-3e-06,-1e-06,1e-06,1e-06,4e-06,0,1e-06,-4e-06,-3e-06,-2e-06,6e-06,1e-06,-3e-06,4e-06,-3e-06,7e-06,3e-06,-1e-06,1e-06,-4e-06,0,6e-06,0,0,-4e-06,-7e-06,2e-06,0,0,1e-06,-1e-06
-1.1e-05,-1.2e-05,3e-06,-1e-06,0,-3e-06,1e-06,3.1e-05,-3e-06,-1e-06,1.8e-05,0,1e-06,-4e-06,-2e-06,7e-06,0,2e-06,1e-06,-1e-06,-2e-05,8e-06,-1e-06,-9e-06,1.1e-05,5e-06,-1e-06,6e-06,0,-1e-06,-1e-06,0,-6e-06,-2e-06,3e-06,-1.8e-05,-3e-06,0,1e-06,-1e-06,0,-2e-05,-6e-06,-2e-06,-8e-06,-5e-06,3e-06,-1e-06,1e-06,1e-06,1e-06,-3e-06,1.5e-05,4e-06,-2e-06,-5e-06,0,0,2e-06,-1e-06,1e-06,1e-06,0,-4e-06,-1e-06,0,-2e-06,0,-1e-06,0,-2e-06,0,6e-06,1e-05,-1e-06,-1e-06,0,-2e-06,-8e-06,0,2e-06,3e-06,1e-06,2e-06,1e-06,0,-1e-06,-2e-06,2e-06,-6e-06,-5e-06,-1e-06,1e-06,-4e-06,3e-06,-6e-06,-1e-06,2e-06,2e-06,2e-06,-1e-06,0,2e-06,0,4e-06,-9e-06,-2e-06,5e-06,-2e-06,2e-06,1e-06,-4e-06,0,2e-06,-1e-06,1e-05,3e-06,-2e-06,-1e-06,-1e-06,1e-06
