0.000522,0.00098,-0.000358,-0.001692,-0.000633,2.7e-05,-0.000778,-0.001825,-0.001985,-4e-05,-0.00035,-0.001102,-0.000805,-0.000302,0.001251,-2.6e-05,-6.1e-05,-0.000751,-0.000525,3.6e-05,0.000641,1e-06,-0.000522,-0.000187,-0.000674,-2.2e-05,-0.00026,-0.001101,-0.000962,-0.000418,-4.4e-05,0.000172,-0.000534,-0.000443,0.00035,0.001085,0.000444,0.000766,-6.8e-05,0.001133,-0.000438,-0.001114,0.001015,0.000249,0.001115,0.001615,0.001425,0.002024,0.000423,0.000467,0.000467,-0.000536,-0.000306,-0.000297,-0.000186,-0.000601,-0.001732,-0.00194,-0.000546,-0.001147,-0.001453,-0.000776,-0.000919,-0.000446,-0.000932,0.00034,-0.001082,-0.001451,-0.001698,-0.001258,-0.001762,-1e-04,-0.000629,-0.000393,-0.001228,-0.000742,-0.001701,0.000327,-0.000118,0.000379,-0.001373,-0.000448,-0.001041,-0.000661,-0.000817,-0.000982,-0.000212,-0.001489,-4.8e-05,-4.6e-05,-0.001371,0.000282,-0.000489,-0.001153,0.001291,0.000373,0.00031,0.001205,0.000615,0.000343,-1.5e-05,0.000901,-0.000268,1.2e-05,0.000341,-3.1e-05,-0.000253,-0.00079,-0.000361,-0.000206,0.000168,-0.000596,-0.000355,0.000203,-0.000523,-0.000479,-0.001938,-0.001381,-0.000733,-0.001091,-0.000391
-0.000867,0.000641,-0.000819,0.000283,0.000583,0.000301,0.000378,0.001161,0.000778,0.00048,-0.000238,0.000426,-0.000119,-1.4e-05,-0.001567,-0.000229,-0.000566,-0.000343,-0.000617,0.00055,0.000532,0.001187,0.000951,5.6e-05,-0.00099,0.000151,9e-05,0.000265,-0.000453,0.000274,0.000169,0.000725,4.5e-05,-0.000699,-0.000428,-0.002098,-0.000834,-0.001319,-0.000257,-0.000944,0.000305,-0.000285,0.00026,0.000126,-0.001347,-0.000839,-0.000482,-0.000774,-0.000322,0.000147,-0.000475,0.001084,5e-06,-0.000764,-0.000972,-8.4e-05,0.000508,0.000426,0.000588,0.000405,0.000349,0.000712,-0.000838,-0.000845,-0.000229,-0.000886,-0.000423,0.000492,0.000598,-0.000199,0.000409,0.000437,-0.001038,-0.00094,0.000382,0.000434,0.001279,0.001302,-0.001085,-0.000427,-0.001405,-0.000766,0.000844,0.001094,0.000388,0.000115,0.000376,0.000666,4.5e-05,0.000177,0.000792,-0.000148,-0.000734,-2.9e-05,0.000465,0.000207,-0.000885,-0.001543,-0.000928,-0.00046,-0.000148,-4.5e-05,-0.000336,-0.000297,0.000142,0.000575,0.001243,0.001321,-0.000149,-0.000674,0.000265,-0.000272,7e-04,-0.000116,-0.00066,-0.000457,-0.000159,0.000534,0.000277,-0.000105,-0.000682
0.000502,0.000673,0.000525,-0.000621,-0.000471,-0.000787,-0.000144,-0.00026,-0.000545,-0.001503,-0.000713,-0.000746,-0.000454,-0.001363,-0.001814,-0.002114,-0.00061,-9.4e-05,-0.000281,-0.000492,-0.001061,0.000498,-0.001256,-0.000537,0.000759,0.000453,0.000345,0.000114,9e-04,-0.000337,-0.00071,-0.000315,0.000594,0.000729,-0.000108,-0.00101,-0.001043,-0.000737,-0.001622,-0.002501,-0.001298,-0.001757,-0.001195,5.8e-05,0.00037,-0.000747,0.000336,0.000103,-0.00057,-0.000385,-0.000154,0.000101,-0.000261,3e-06,-0.000386,-0.000585,-0.001177,-0.000164,-0.000618,-0.000613,-0.001239,2e-04,0.000486,-0.000351,-3.9e-05,0.000312,0.000554,-0.000188,-0.000829,-0.000144,-0.000395,-0.001128,-0.000333,0.000211,-2.9e-05,-0.000207,-0.000207,-0.000674,-0.000895,-0.000487,0.000799,-2.2e-05,-0.000376,-0.001025,-0.001063,-0.00022,-0.000873,-0.001197,-0.000557,-1e-04,-0.001072,-0.000941,-0.000695,-0.000157,-8.9e-05,0.000117,-0.001083,-0.00072,-0.00016,-9.7e-05,1.7e-05,-0.000392,-0.000257,-0.000125,0.000478,0.000248,-0.000681,-0.000432,0.00073,-0.000437,-0.001519,-0.000124,-0.000761,-0.00034,0.00021,-0.000297,0.000794,-0.000458,-0.000305,0.000159,0.000255
-0.000428,-0.000849,-0.000274,0.000317,-2e-05,-1.3e-05,0.000688,1.1e-05,-7.7e-05,-0.000378,-0.000458,-0.00076,-0.000147,-0.001189,-0.00036,0.000129,-0.000132,0.000632,0.000306,0.000458,-0.001142,-0.000523,-0.000117,-0.000527,-0.000751,-0.001382,-0.000459,-0.000109,-0.001451,-0.00071,-0.000303,-0.000293,-0.000364,-0.001231,-0.001259,0.000661,-0.000329,0.001003,-0.00035,0.000244,-0.000275,0.000517,-0.000532,-0.000545,-0.001501,-0.000273,-0.000264,0.000554,9.4e-05,-0.000968,-0.00025,-0.000625,9.6e-05,-0.000659,-0.000392,-0.000263,0.000804,-0.000537,-0.000253,-9.1e-05,0.000106,-0.000413,-0.000214,-1.7e-05,-0.000281,-0.000352,-0.000125,2.3e-05,0.000383,1.4e-05,0.001007,-0.000701,-0.001221,-0.000176,5.6e-05,-8.1e-05,-0.000202,0.000125,-1.6e-05,0.000281,0,-0.000723,-0.000236,0.000322,0.000216,-0.000257,0.000228,0.000921,-0.000313,-0.000472,0.000779,0.000244,0.000286,0.000194,-0.001046,-4e-04,0.001033,0.000667,0.000879,-0.000879,-0.000198,-0.000787,0.000151,-3.4e-05,-0.001529,-0.000265,-0.000782,-0.000109,8.2e-05,-0.000348,-4.5e-05,0.000191,6e-06,-0.001505,-0.000433,-0.000413,-0.000748,0.000243,2.2e-05,-0.00092,-0.000764
0.000398,0.000156,0.00048,0.000553,0.000921,0.000234,-0.000554,0.000199,-0.000177,-0.000326,-0.001038,-0.000261,-0.000563,0.000734,-0.000351,0.001097,-0.000781,-0.001212,7.1e-05,-0.000851,-0.000596,-0.000814,-0.001025,0.000219,0.000758,0.000803,0.000549,-0.00061,6.7e-05,0.000316,0.000362,0.000183,0.000171,-0.000721,-2.2e-05,0.000865,0.000789,-0.00027,0.00053,0.001634,0.000545,-0.000188,-0.000927,-5.7e-05,-0.000112,0.000565,-0.000688,-0.000606,3.4e-05,-0.000671,0.000466,0.000138,-0.000564,0.000625,0.000978,-4.4e-05,1e-05,0.000172,0.000473,0.000401,0.000101,-5e-04,-0.000262,-1.8e-05,-0.000201,0.000197,-0.000344,0.000259,-0.00027,1.9e-05,-0.000355,-0.000317,-0.00075,-0.001034,-0.000363,-0.000694,-0.000563,-0.000504,-0.000364,-0.000205,5.8e-05,-0.000247,-0.000239,-0.001011,-1.8e-05,-0.000123,2.3e-05,1e-05,-0.001316,-0.001127,-0.000833,2.6e-05,0.000313,-0.000113,-0.000204,0.000396,-0.000221,-0.000477,-0.000179,-0.00037,3.2e-05,0.000212,-0.00043,-0.000334,-0.000845,0.000117,-0.000282,0.00062,-0.000388,0.000334,8.8e-05,-0.000298,0.000308,-0.000812,-0.001063,-0.000254,-2.3e-05,-0.000158,-0.000555,0.00033,0.00079
0.000623,-7.2e-05,-0.000345,-0.000339,-0.000302,-0.000801,-0.000442,-0.000459,-8.4e-05,0.000339,0.00012,-0.000217,0.000382,5.5e-05,0.000652,-0.000288,-0.000206,0.000374,0.000139,-9.7e-05,4e-06,-0.000106,-0.000298,0.000236,-1.1e-05,-0.000152,-0.000848,-0.000179,0.000668,-0.000367,0.000384,-0.001033,-0.00088,0.00055,0.000799,0.000103,9.7e-05,-0.000176,0.000156,-0.000156,0.000542,0.000648,0.000262,0.000568,0.000564,0.000108,-0.000701,-0.000942,-0.000939,0.000144,-0.000206,-4.2e-05,-0.000276,-0.001103,-0.00028,-0.00096,-0.000415,-0.000678,-0.00051,-0.000117,0.00011,0.000372,0.000323,0.000501,-0.000366,0.000241,4.8e-05,-0.000528,1.8e-05,0.000527,-6.7e-05,0.000444,0.000753,0.000848,-0.000126,4e-05,-0.000541,-0.000295,-0.00023,0.000593,0.000151,0.001005,0.00086,0.000755,0.000654,0.000174,0.000223,-0.000234,0.000386,-0.00051,-0.000165,-0.000589,-0.000732,0.000347,0.00051,-0.000542,-0.000225,-0.001512,-0.000943,-0.000152,-0.000293,-0.000279,-0.000402,-0.001085,-0.000492,0.000131,3e-06,-0.001057,-0.000832,-0.000123,6.8e-05,6.1e-05,-0.000449,4e-04,0.000522,7.8e-05,0.000193,2.7e-05,-0.000209,-0.001213,-0.001017
-0.001009,-0.000701,-0.000283,-0.00027,-0.000474,0.000311,-0.000202,0.000147,-4.3e-05,4.5e-05,0.000463,0.000197,-2.9e-05,0.000133,0.00051,-0.000555,-0.00019,0.000201,6.4e-05,0.000168,-0.000648,-0.001302,-5.9e-05,-0.000408,0.000507,6.2e-05,-0.000127,-0.000197,-0.000451,-0.000412,0.000198,0.000182,-0.000289,-0.000507,-0.000122,0.000238,-0.000539,0.000489,-0.000601,0.000155,-0.000153,0.000517,0.000478,0.000773,-0.000306,-0.000343,-0.000257,-0.000374,-0.000848,-0.000567,-0.000944,-8.7e-05,-0.000389,-0.000651,-0.00061,0.000947,0.000153,0.000393,0.000568,-9.1e-05,-0.000311,-0.000691,-0.000636,-9.2e-05,0.000357,0.000203,6.1e-05,0.000288,-9.4e-05,-0.000921,-0.000114,-0.000417,0.000705,0.000412,0.000447,-2.9e-05,5.1e-05,0.000132,0.000223,-0.001114,-0.000271,-0.000306,-2.2e-05,-0.000129,-0.000171,3.2e-05,-0.000196,-0.000334,-0.00011,0.000267,3.9e-05,-0.000306,-0.000141,-0.000873,-0.000844,-0.000397,-5.3e-05,0.000496,0.000178,-9.1e-05,0,8.4e-05,-0.00088,0.000217,0.000193,-1.4e-05,0.000157,-0.000161,-0.00045,-0.000572,-0.000331,-0.000223,6.1e-05,0.000135,-0.000265,0.000564,0.000242,-0.000381,-0.000352,0.000241,-0.000181
-0.000407,0.000193,-0.000471,0.000558,0.000187,0.000229,0.000192,-6.1e-05,0.000245,0.000244,0.000168,0.000894,0.000573,4.8e-05,-9.2e-05,-0.000692,0.000719,0.000255,6.9e-05,0.000182,0.000245,-9e-06,-5.2e-05,-0.000627,-0.00035,-0.000107,-0.000348,-0.000273,5.9e-05,-4.3e-05,-0.000369,3.5e-05,1.1e-05,0.000326,4.9e-05,-0.000471,-0.000368,0.00041,-0.000366,-0.000536,-0.000931,-0.000458,6.3e-05,-4.3e-05,1.9e-05,-0.000251,0.000229,-0.000173,0.000257,-0.000413,-0.00022,-0.000274,-0.000292,0.000306,0.000153,-0.000348,-0.000307,8.4e-05,-0.000352,-0.000192,-1.7e-05,0.000166,0.000416,-0.000426,0.000172,-0.000302,4.1e-05,-0.000568,-0.000345,4.8e-05,0.000103,-0.000117,-0.000262,-4.5e-05,-0.000322,-9.5e-05,1e-04,-0.000807,-0.000241,0.000651,0.000306,-0.000653,-3.1e-05,6.2e-05,-3e-06,-0.000426,-0.000121,0.000173,0.000173,-9.8e-05,-0.00033,0.000373,-0.000128,0.000267,0.000309,6.4e-05,-2.5e-05,6.9e-05,-9.5e-05,-7.5e-05,-0.00026,-0.000244,-8.5e-05,-0.000202,-0.00037,0.000745,-0.000514,-0.000734,0.000155,0.000387,-0.00047,0.000242,2.8e-05,-3.2e-05,-0.000163,-0.000691,-0.000458,0.000515,0.000491,0.00036,-0.000235
3e-06,-5.6e-05,-0.000248,5e-06,-2.8e-05,-5.6e-05,1.5e-05,-0.000511,-0.000187,-0.000319,-0.000298,-0.000457,-0.000256,-0.000204,-0.000286,-0.000104,-0.000195,-0.000419,-0.000356,-0.000365,0.000307,-0.000342,-0.000303,-0.000158,-0.00029,-0.000249,0.000108,8.4e-05,-7.2e-05,-3.7e-05,-0.00014,0.000195,0.000217,4.7e-05,0.000279,-0.000572,-7.6e-05,0.000489,0.000479,-0.000282,0.000365,-0.000454,-0.000564,-0.000529,-0.000165,-0.000332,0.000786,-0.000281,0.00013,-0.00012,-0.00027,-0.000625,9.7e-05,0.000568,-0.000264,2.3e-05,-0.000228,-7.7e-05,-0.000124,-0.000157,-0.000177,0.000302,4.7e-05,0.000387,-0.000159,0.000106,0.000122,0.000746,0.000158,0.000138,0.000121,0.000404,0.000194,0.000173,-5.6e-05,6e-06,3.4e-05,0.000201,0.000196,0.000873,8.5e-05,0.00042,-0.000258,-9.4e-05,-0.000384,7.5e-05,-0.000136,-2.4e-05,-0.000341,0.000118,0.000292,0.000219,0.000438,0.000101,0.000171,5.8e-05,-0.000511,-4e-06,1.4e-05,-0.000416,9.4e-05,-0.000329,0.000435,1e-05,3.1e-05,-0.000434,0.000153,7e-06,-0.000193,0.000211,0.00026,0.00012,-0.000282,-0.000223,0.000414,0.000479,-0.000119,-0.000251,-0.000397,0.000257,-2.6e-05
-0.000145,-0.000482,-3.6e-05,0.000214,0.000169,-0.000385,-0.000348,0.000217,0.000207,-5.8e-05,5.1e-05,0.000377,0.000346,-2.3e-05,2.6e-05,0.000244,-0.000479,-1e-05,0.000615,5.8e-05,2.5e-05,0.00081,0.000559,6.8e-05,-0.000149,-8.1e-05,0.000337,-0.000297,0.000267,0.000434,5.4e-05,-8.1e-05,1e-05,0.000452,-0.000224,0.000241,0.000174,-0.000131,-0.000171,0.000312,0.000167,-0.000371,-0.000127,-0.000104,-3.5e-05,1.6e-05,-0.000641,0.000148,-0.000322,0.000244,0.000242,0.000445,0.000314,-6.9e-05,0.000177,-8.9e-05,-0.000203,-0.000422,-0.000253,0.000374,0.000318,2.7e-05,-6e-05,-2.9e-05,1.9e-05,-7.7e-05,-0.000203,-0.00032,5e-05,0.000124,-5.4e-05,0.000149,-0.000166,-0.000149,0.00024,-5.1e-05,-1.4e-05,0.000447,-8.1e-05,-0.000147,-0.000279,-0.000108,-0.000216,-0.000209,8.4e-05,0.000266,5.2e-05,3.2e-05,-4.9e-05,0.000141,4.3e-05,-2.6e-05,-0.000248,0.000167,0.000154,0.000355,-0.000361,-0.000365,-0.000267,-6e-06,-0.000194,-3e-05,-0.000265,-0.000207,0.000387,-0.000669,-0.000457,0.000202,0.000224,-0.000361,-0.000279,-0.000277,7e-06,3e-04,0.000121,0.000199,0.00028,-3.7e-05,0.000347,-0.000487,0.000274
0.000108,8.6e-05,1.7e-05,-6.8e-05,-0.000528,0.000136,0.000173,4.9e-05,0.000202,-0.000119,4e-06,-8.6e-05,-0.000287,-0.000215,-9.7e-05,0.000251,0.000141,-0.000155,-0.000391,-3e-05,-0.000395,0.000176,0.000131,0.000164,0.000306,4.1e-05,-0.000119,0.000125,-0.000292,-3.1e-05,-0.000239,-0.000153,-0.000113,-8.1e-05,-5.9e-05,5.5e-05,-0.000123,-0.000689,-0.000141,-0.000107,-7.1e-05,0.000194,7.7e-05,-0.000133,0.000242,8.2e-05,-0.000161,0.000232,0.000165,0.00051,0.000256,5e-05,-4.4e-05,9.4e-05,-0.000444,-0.000295,0.000467,0.000251,-6.1e-05,-0.00035,0.000101,2.5e-05,-8e-05,0.000169,-8.2e-05,-0.000391,-8.5e-05,-0.000167,0.000157,-0.000121,-0.000224,-0.000358,-1e-05,-0.000171,0.000144,0.000109,0.00016,5.5e-05,0.000248,-0.000401,-6.2e-05,0.000227,-2.4e-05,-8e-06,-0.00018,0.000353,8.6e-05,4e-06,0.000181,3e-05,0.000202,0.000304,0.000157,-6.1e-05,-6.9e-05,-1.3e-05,0.00025,8.1e-05,0.000198,0.000595,0.000232,0.000193,0.00021,8.6e-05,3.4e-05,8.3e-05,0.000225,0.000149,-8.9e-05,-8.3e-05,0.000199,-9.7e-05,-0.000329,-7.6e-05,-0.000116,-3.6e-05,-0.000242,0.000387,-0.000313,0.000268,-0.000123
7.3e-05,1.1e-05,0.000222,-0.000175,0.000284,-7.1e-05,-0.000197,-5.2e-05,-0.000238,0.000238,-5.6e-05,-0.000236,-0.000182,0.000155,0.000206,0.000163,0.000393,0.000133,-0.000246,-6.7e-05,0.000142,0.000171,0.00018,8.4e-05,-0.000189,7.5e-05,6.1e-05,-1.4e-05,0.000126,0.000152,0.00013,-0.000165,0.000321,-0.00012,0.000112,-5e-06,0.000213,7.7e-05,0.000319,-0.00021,-0.000122,0.000235,0.000112,-0.00021,0.000316,-3.8e-05,0.000149,0.000385,0.000283,-2.1e-05,-3.4e-05,-0.000135,-1.8e-05,0.000225,7.3e-05,0.000485,4e-06,0.000147,-8e-06,7.9e-05,-4e-05,-0.000169,0.000173,-0.000207,-8e-06,6.2e-05,6.2e-05,0.000353,-0.000245,0.000122,0.000305,7.1e-05,0.000315,-5e-05,-0.000295,-3.9e-05,-5.3e-05,2.4e-05,-0.000117,-0.000221,8.3e-05,-0.000259,0.000149,0.000161,3.6e-05,-0.000134,-4.2e-05,-5e-05,0.000157,-0.000243,-0.000285,5e-06,-3.1e-05,-6e-05,5.3e-05,-0.000119,0.000133,-0.000141,1.6e-05,3e-05,6.9e-05,0.000114,-9e-05,0.000159,0.000196,-0.000114,-9.5e-05,6e-06,0.000129,0.000148,6.6e-05,7.8e-05,0.000313,3.7e-05,7.6e-05,-0.000102,0.000192,-0.000169,0.000224,-0.00015,0.000213
0.000208,0.000258,0.000196,-0.00022,-7.5e-05,0.000133,0.000141,7e-06,4e-05,-0.000347,4.6e-05,3e-06,4.8e-05,-5.2e-05,-0.000141,2.9e-05,0.00026,-7.7e-05,8.5e-05,2.9e-05,0.000109,-0.000246,-0.00015,0.000302,-0.000121,-7.3e-05,-0.000161,0.000162,-9.3e-05,-2.7e-05,-0.000306,5.2e-05,-0.000109,8e-06,-0.000273,0.000237,1.2e-05,0.000109,0.000235,-4.1e-05,0.000101,-3.8e-05,0.000107,0.000169,0.000256,3.2e-05,3.5e-05,3.7e-05,-0.000195,-0.000122,-3.5e-05,4.7e-05,-0.000172,-0.000158,0.000168,-5.1e-05,2e-06,-6.7e-05,0.000144,8.9e-05,-7.1e-05,7.1e-05,-9.5e-05,-9.5e-05,0.000103,0.000204,-2.3e-05,-0.000135,0.00012,3.5e-05,-5.6e-05,0.00025,-0.00035,-5e-05,-9.4e-05,-0.000139,7.1e-05,3.1e-05,-1.3e-05,-5e-05,0.000114,6.5e-05,-8.6e-05,1.8e-05,0.000176,0.000124,-0.000205,-2.7e-05,-0.000148,0.000112,7.8e-05,3.4e-05,4.1e-05,-2e-05,4.8e-05,5.3e-05,0.000329,0.000162,-3.1e-05,-0.000177,-6.1e-05,-2.6e-05,-0.000151,9e-05,-4.6e-05,-0.000108,0.000151,-5.2e-05,2.7e-05,-3.9e-05,-8e-06,2.3e-05,1.8e-05,0.000104,-9.4e-05,-0.00017,-6.8e-05,-0.000128,-6.1e-05,0.000149,0.000186
-8.3e-05,0.000138,-8.7e-05,-0.000142,-3.2e-05,1.9e-05,3.5e-05,3.7e-05,-1e-05,0.000231,2.6e-05,0.000148,-6.8e-05,6.2e-05,9.8e-05,-0.000227,-0.000153,3.7e-05,2.6e-05,7e-05,-5.6e-05,4.2e-05,-5.1e-05,0.000157,-0.00015,7.7e-05,-3.8e-05,3.8e-05,3.9e-05,1.2e-05,0.000115,0.000112,-3.8e-05,8e-06,0.000132,-4.3e-05,-0.000175,-1.3e-05,1.1e-05,0.000207,0.000125,-0.000132,-1.3e-05,-6.6e-05,-0.000109,6e-06,0.000281,-0.000286,-6e-06,0.00013,9e-05,8.6e-05,0.000169,3.3e-05,0.000235,-1e-04,-1e-05,9.7e-05,-3.2e-05,-5.4e-05,-3e-05,0.000101,1.5e-05,-7.5e-05,-8.4e-05,-6e-06,2.9e-05,-8.9e-05,-9e-06,-0.000102,0.000172,-1e-04,-1.4e-05,7e-06,-8.2e-05,0.000108,-3.7e-05,4.4e-05,5.3e-05,-0.00011,8.2e-05,0.000127,-9e-06,2.3e-05,-5.9e-05,-0.000148,0.000146,-1.8e-05,-0.000105,2.7e-05,-8.7e-05,-7.8e-05,-9e-05,-5.9e-05,0.000131,-0.000111,-1.9e-05,7.3e-05,9e-06,-6e-06,-2.6e-05,0.000104,7.4e-05,-6.6e-05,8.6e-05,0.000184,0.000241,-5.2e-05,0.00019,-2.2e-05,0.000122,3.2e-05,7.2e-05,-4.7e-05,0.000113,-0.000236,3.8e-05,-1.1e-05,-6.4e-05,1.3e-05,-0.000102
-6.4e-05,-6.4e-05,4.7e-05,-3.7e-05,5.5e-05,-0.000125,-3.3e-05,0.000141,-5.4e-05,-9.2e-05,-5.6e-05,-5.2e-05,4.1e-05,2.7e-05,-1e-05,-1e-04,-0.000138,-1.3e-05,-3e-05,-9.2e-05,-1.2e-05,9e-06,3e-06,-0.000154,9.7e-05,-2.7e-05,5.6e-05,-0.000177,-5.4e-05,-4.3e-05,0.00016,4.5e-05,-1.6e-05,5.5e-05,-0.000112,-7.2e-05,5.1e-05,-0.000108,-2e-05,-0.000179,-0.000143,7.7e-05,3.9e-05,5.8e-05,1.1e-05,5e-06,3e-06,-8e-05,8e-05,0.000142,-1e-05,-2.9e-05,-1.3e-05,1e-04,-2.7e-05,0.000117,-0.000114,-0.00011,1.3e-05,-2.1e-05,8.1e-05,-3.5e-05,3e-06,-5e-06,-5.3e-05,-1.1e-05,3.5e-05,8.4e-05,-8.3e-05,7.4e-05,-5.7e-05,-9.1e-05,-2.9e-05,3.8e-05,5.6e-05,-7.8e-05,5.8e-05,-2.9e-05,-1.4e-05,5.9e-05,2.5e-05,-0.000128,1.3e-05,-4.6e-05,4.6e-05,-2.1e-05,9.3e-05,7.4e-05,7.7e-05,7.6e-05,3.3e-05,-4e-06,1.3e-05,4.9e-05,-1.7e-05,4.4e-05,-0.00015,0.000121,-5.5e-05,0.00013,9.6e-05,-5.1e-05,6.9e-05,-7.8e-05,4e-05,8.2e-05,-0.000165,-0.000101,-8.4e-05,2e-05,-2.3e-05,-2.3e-05,1.7e-05,2.8e-05,-4.7e-05,0.000149,-2.8e-05,-9.7e-05,3.9e-05,3.7e-05,-2e-04
6.1e-05,-6.4e-05,-0.000122,1.9e-05,7.8e-05,5.3e-05,6.5e-05,6.7e-05,-1.7e-05,4e-05,4.7e-05,-8.4e-05,2.6e-05,5.7e-05,-6e-06,-6.8e-05,0,3.6e-05,0.000161,2.7e-05,5.4e-05,-7.6e-05,0.000104,2.5e-05,-6e-06,3.7e-05,9e-05,-8e-06,9e-06,4.1e-05,-8e-06,-1.7e-05,-3e-05,-0.00014,0.000141,-1e-06,2.4e-05,-0.000191,-5e-06,0.000116,8.4e-05,0.000106,-1.7e-05,2.1e-05,-3.8e-05,3.8e-05,-0.000149,-5e-06,-4.1e-05,-6.8e-05,-6.1e-05,-4e-06,8e-06,-2e-05,8.2e-05,-4e-05,6.5e-05,3e-06,1.1e-05,1.1e-05,-1.5e-05,2.2e-05,-5e-06,-9.2e-05,-1.2e-05,0,2.1e-05,-3e-06,6.2e-05,-1.2e-05,-0.000112,4.4e-05,0.000155,1e-05,0.000146,-4e-06,-1.8e-05,-9.4e-05,2.8e-05,0.000164,-1.5e-05,3e-05,2.8e-05,2e-05,1e-06,-6.4e-05,4.5e-05,4e-06,3.1e-05,-4.7e-05,5.8e-05,-1e-04,-2.2e-05,2.2e-05,-1e-04,9e-06,4e-05,-1.3e-05,5e-06,-3.4e-05,-1.3e-05,-3e-05,3.9e-05,8e-06,5.1e-05,9e-06,-1.4e-05,0.000104,9e-06,4.5e-05,-2.9e-05,-6.1e-05,-7.4e-05,3e-05,7.4e-05,-4.5e-05,5.2e-05,0,-1.8e-05,-0.000183,9.7e-05
0,1.8e-05,3.8e-05,5.9e-05,-8.5e-05,5e-06,-8.7e-05,-5.5e-05,-3.9e-05,-8e-06,-8e-06,-1e-06,2.9e-05,-4.1e-05,2.3e-05,-4e-06,5.3e-05,1e-05,3e-05,6.1e-05,-1.4e-05,0.000161,4e-06,6e-06,7.8e-05,-2e-05,8e-06,-2.2e-05,-2.9e-05,2.3e-05,-1e-06,-2e-05,9.6e-05,5e-05,-9.8e-05,-0.000117,-8.2e-05,-2e-05,-3.7e-05,5.4e-05,1.2e-05,-2.4e-05,-2.3e-05,6e-05,0,4.2e-05,-2.7e-05,0.000139,-4.8e-05,-6.8e-05,-4e-06,1e-05,1.8e-05,-6.6e-05,-1.6e-05,6.6e-05,-2.5e-05,1e-05,3.4e-05,4.2e-05,-8e-06,-8e-05,1.3e-05,7.8e-05,1.6e-05,0,1.7e-05,2.6e-05,-8e-06,5e-06,-2.5e-05,6.6e-05,-0.000196,3e-06,-8e-06,3.2e-05,1.3e-05,2.8e-05,-5.5e-05,-0.000116,-5.7e-05,-3.4e-05,5.5e-05,2.2e-05,-6e-06,1.6e-05,-4.1e-05,-5.1e-05,-8e-06,-8.1e-05,-3.8e-05,-1.1e-05,6e-06,6.1e-05,-2.1e-05,-3e-05,-0.000119,-6.8e-05,4.2e-05,-7.4e-05,2.3e-05,4e-06,-3.4e-05,-2e-06,-3.6e-05,8.4e-05,4.3e-05,4.6e-05,-2.7e-05,-5.2e-05,2e-05,2.9e-05,1.1e-05,-3.2e-05,-8e-06,1.3e-05,-9.5e-05,7.9e-05,-1.7e-05,0.000162,-5.4e-05
-3.4e-05,4.7e-05,5.1e-05,1.8e-05,2.6e-05,2.5e-05,3.3e-05,-4.1e-05,1.8e-05,7.1e-05,1e-06,-1.6e-05,-6e-06,1.6e-05,-3.8e-05,6.3e-05,0.00012,-1.9e-05,5.2e-05,-2.7e-05,-5.1e-05,6.6e-05,-7e-06,-9.6e-05,1e-05,2.9e-05,2.7e-05,4.7e-05,2.1e-05,-2.1e-05,8.9e-05,-4.1e-05,2.8e-05,6e-06,7e-05,-8e-06,-1.1e-05,8.5e-05,-2.1e-05,-4.2e-05,2e-05,-7.1e-05,6e-06,7e-06,-4.8e-05,0,2.7e-05,5e-05,6.4e-05,0.000108,2.7e-05,0,-3e-06,4.5e-05,-4.6e-05,3.9e-05,-4.7e-05,4.4e-05,-3.6e-05,-2.1e-05,4.4e-05,-3.5e-05,-4.1e-05,-1.2e-05,4.5e-05,6e-06,-1e-05,-5.6e-05,1.2e-05,-4e-05,7e-06,-5.7e-05,1.2e-05,6.7e-05,4e-06,-2.7e-05,1e-06,5.9e-05,5.8e-05,-6.5e-05,-2.7e-05,8.2e-05,-2.6e-05,-2.4e-05,1.8e-05,7.1e-05,6e-05,4.1e-05,-4.4e-05,3e-06,4.5e-05,-4e-06,-3.9e-05,-3.9e-05,3.2e-05,3.8e-05,-8e-06,2.6e-05,-1.4e-05,4e-06,-2.7e-05,4e-06,-2e-06,5.8e-05,2.8e-05,0.000112,-3e-06,4.9e-05,3.3e-05,7e-06,-2.9e-05,-4e-06,1.4e-05,-8e-06,-4.6e-05,3.2e-05,-4.1e-05,2.3e-05,3.1e-05,-5.7e-05,8.5e-05
3.4e-05,-3.3e-05,-2.4e-05,1.1e-05,2.1e-05,-5e-06,-9e-06,3.1e-05,-4.6e-05,-8.4e-05,8e-06,-1.5e-05,4.8e-05,-8e-06,2.7e-05,7.1e-05,-6.1e-05,3.4e-05,1.1e-05,1.1e-05,4e-05,3.7e-05,3.3e-05,0,9.2e-05,-2e-05,-5.8e-05,2.1e-05,-9e-06,2.3e-05,-5e-05,5.3e-05,2.5e-05,-6e-06,3e-06,1.3e-05,6.7e-05,5e-05,4.5e-05,5.6e-05,-5e-05,-2.1e-05,-1.3e-05,-7e-06,2.4e-05,9e-06,0.00013,1e-05,-7e-06,6.5e-05,-3e-06,4.1e-05,-1.4e-05,-6e-06,-1.5e-05,-0.000111,7.7e-05,-3.3e-05,2.2e-05,-1.4e-05,-4e-06,2e-05,5.8e-05,5.8e-05,-1.9e-05,-2.5e-05,-6e-06,4.5e-05,-2e-06,6.2e-05,3.3e-05,-7e-06,-2.3e-05,2.3e-05,-1.7e-05,-6e-06,-2e-06,-1.3e-05,-5.3e-05,7.7e-05,-1.8e-05,-6.5e-05,-2.7e-05,-5e-06,-1.6e-05,-1.9e-05,-5.1e-05,-3e-05,-1.9e-05,7.5e-05,-2.9e-05,-3.1e-05,1.8e-05,-2e-06,-1.4e-05,-2.5e-05,-6e-06,-3.1e-05,-2e-06,2.7e-05,2.6e-05,9e-06,-3.1e-05,-2.5e-05,6e-06,-8.6e-05,-2.2e-05,2.3e-05,4.7e-05,5e-05,6e-06,3.3e-05,-2.8e-05,2e-05,4.1e-05,-6.3e-05,1.2e-05,-4.7e-05,0,7.9e-05,-9e-06
5.7e-05,1.3e-05,4.9e-05,2.6e-05,-1e-05,-2.4e-05,1.9e-05,-6e-06,0,5.7e-05,-1.3e-05,4.6e-05,-3e-06,-2.8e-05,-2.4e-05,1.4e-05,-7.7e-05,-2.8e-05,-6.5e-05,-2e-06,3.1e-05,-0.000136,-1.3e-05,6.5e-05,-8e-06,1.7e-05,-2.2e-05,-3.7e-05,1.9e-05,0,1.2e-05,3.3e-05,-4.1e-05,-6.8e-05,8e-06,-1e-05,-1.6e-05,8.8e-05,2.3e-05,0,-5e-06,-4e-06,-5e-06,-3.6e-05,7e-06,8e-06,-2.7e-05,-2.6e-05,-4.3e-05,-4.1e-05,3.2e-05,-2.2e-05,7e-06,-1.9e-05,5e-06,6.2e-05,1.2e-05,-2.6e-05,-2.5e-05,-1e-06,-4e-06,1.2e-05,-2.1e-05,-3.2e-05,-9e-06,2e-06,6e-06,4.3e-05,-4e-06,1.2e-05,2.2e-05,5.4e-05,6.7e-05,1.9e-05,-1e-05,2.4e-05,0,-2.3e-05,4.3e-05,4.2e-05,-2.7e-05,5e-06,-2.6e-05,1e-06,-1e-06,1.5e-05,2e-06,-1e-05,4.7e-05,-2.6e-05,-3.5e-05,1e-05,-2.4e-05,-4.1e-05,-3.6e-05,-1.5e-05,1.5e-05,4.9e-05,7e-06,6.4e-05,2.1e-05,9e-06,-1.6e-05,-2e-06,3.3e-05,-6.5e-05,-3.5e-05,-3.9e-05,4.2e-05,-3e-05,1.8e-05,-2e-05,5e-06,-2.5e-05,-1.1e-05,6.9e-05,3e-05,2.4e-05,-8e-06,-5.2e-05,3.9e-05
-1.2e-05,1.4e-05,1.6e-05,2.4e-05,-1.1e-05,1.9e-05,1.2e-05,9e-06,-7e-06,-3.6e-05,1e-05,-7e-05,4.1e-05,2e-06,1.6e-05,-2e-05,4.4e-05,2.5e-05,2.1e-05,-1.3e-05,-2.8e-05,-1.5e-05,0,4.8e-05,5e-06,-4e-06,4e-06,-5e-06,-1.3e-05,-1.6e-05,-3.7e-05,-1.5e-05,-2.7e-05,2.1e-05,8e-06,8.5e-05,-2.7e-05,-2.1e-05,-1.5e-05,-1.5e-05,7.6e-05,7e-06,7e-06,-8e-06,9e-06,-7e-06,-4.4e-05,-3.4e-05,3.3e-05,-2.3e-05,-6e-06,-4e-06,-5e-06,-7e-06,1.4e-05,1.6e-05,9e-06,3.7e-05,6e-06,3.7e-05,-1.1e-05,2.9e-05,-3e-06,4.1e-05,0,5e-06,-8e-06,-0.00011,2e-06,-3.8e-05,-1e-06,6e-06,-5e-05,-5e-06,-1.5e-05,-2.1e-05,5e-06,-1.7e-05,-4.5e-05,2.6e-05,-4e-06,2.2e-05,6e-05,9e-06,-4e-06,-0.000108,7e-06,3.4e-05,9e-06,0,5.2e-05,-2.2e-05,-1.6e-05,2.1e-05,3.3e-05,-5e-06,5.9e-05,-2.2e-05,-1.9e-05,-1.4e-05,-1.9e-05,5e-06,3.4e-05,-1.5e-05,-2.9e-05,3.7e-05,5.7e-05,-2.5e-05,-1.7e-05,-3.2e-05,5e-06,-7e-06,1.8e-05,-3e-06,2.7e-05,-2.4e-05,-3e-05,-1e-06,6e-06,1.5e-05,-3.3e-05
-2.1e-05,-5e-06,-3e-06,2.7e-05,-6e-06,-7e-06,-3.1e-05,2e-06,9e-06,0,7e-06,1.3e-05,-1.6e-05,-4e-06,-1.1e-05,-3.2e-05,4.2e-05,-1.3e-05,3e-06,1e-05,-2e-05,1.6e-05,-1e-06,-1.1e-05,-6.6e-05,1e-05,2.2e-05,-2e-05,1.4e-05,-1.7e-05,3e-06,-1.1e-05,9e-06,2.8e-05,-8e-06,2.2e-05,2.2e-05,-2.6e-05,4e-06,-1.9e-05,-4.3e-05,-1.3e-05,1.1e-05,5e-06,-1.6e-05,1e-06,-1.8e-05,-1.1e-05,3e-06,2.2e-05,-3e-06,2.2e-05,2.7e-05,1.4e-05,5e-06,-1.7e-05,3e-06,-7e-06,7e-06,-4.6e-05,5e-06,-2.8e-05,1e-06,-1e-05,1.4e-05,-2.2e-05,-1e-06,6.8e-05,-7e-06,1.7e-05,-1.8e-05,-3.7e-05,-8e-06,-7e-06,3.1e-05,-6e-06,4e-06,2.3e-05,2.9e-05,-7e-06,6e-06,1.5e-05,-1e-05,2e-06,6e-06,2.8e-05,-3.1e-05,-2e-05,-3.2e-05,-2.8e-05,-2.5e-05,-1.5e-05,1.3e-05,-2e-06,3e-06,1.6e-05,8e-06,1.1e-05,1.7e-05,-8.2e-05,2e-06,-3e-06,1.1e-05,1.4e-05,8e-06,-5.6e-05,0,-9e-06,-2.7e-05,4.6e-05,1e-06,-5e-06,-1.5e-05,1e-05,-1.7e-05,3e-05,1e-06,-3e-05,-1.3e-05,-3.7e-05,-8e-06
2e-05,7e-06,2e-06,2.1e-05,3.1e-05,-2e-06,2.1e-05,2e-05,-7e-06,1.8e-05,-9e-06,2.1e-05,4e-06,7e-06,-2e-06,-4.7e-05,2.6e-05,0,-5.4e-05,1.1e-05,3.5e-05,3e-05,-2e-06,-3e-06,7e-06,-1.4e-05,2.8e-05,1.5e-05,-9e-06,1.3e-05,3e-06,-1.1e-05,1.9e-05,-2.5e-05,1.4e-05,-1.1e-05,-4e-06,6.1e-05,1.1e-05,3e-05,-3.4e-05,-2e-06,-7e-06,-3.6e-05,-9e-06,6e-06,-2.3e-05,-1.1e-05,-3.2e-05,3.3e-05,3e-06,-1e-06,-5e-06,-3.1e-05,3.1e-05,3.6e-05,-4.5e-05,1.5e-05,8e-06,8e-06,0,-2.1e-05,-1e-06,1.5e-05,3e-06,1.4e-05,0,1.5e-05,1e-06,2e-06,-9e-06,6e-06,4e-06,-1e-05,8e-06,2.4e-05,-5e-06,-1.1e-05,-1.9e-05,2.2e-05,1.6e-05,-2.3e-05,-5.2e-05,0,2e-06,-5.2e-05,3.3e-05,9e-06,-7e-06,0,2e-05,-2e-06,-1.5e-05,2.2e-05,-3.6e-05,-1e-05,2e-05,-2.3e-05,-3e-06,3e-05,1e-06,7e-06,1e-06,4e-06,-1e-06,-2.2e-05,-1.6e-05,1.1e-05,3e-06,-1.2e-05,2e-06,1.1e-05,3.6e-05,-1.5e-05,8e-06,2.8e-05,1.3e-05,2.6e-05,2e-05,4.8e-05,-4e-05
3e-06,3.6e-05,-2.2e-05,-1.1e-05,-3.5e-05,2.2e-05,-1.7e-05,2.2e-05,-3e-06,-2.4e-05,5e-06,-2.1e-05,-1.3e-05,-2.1e-05,-1e-06,-7e-06,-4.9e-05,-6e-06,1.6e-05,-1.2e-05,-2e-06,4.1e-05,1.9e-05,-2e-06,-3.1e-05,1.7e-05,1.1e-05,-1e-06,7e-06,-4e-06,-1.1e-05,-5e-06,2.6e-05,-1.6e-05,-9e-06,1.6e-05,-3.2e-05,1.5e-05,-1.1e-05,-4.8e-05,5.4e-05,2e-05,3e-06,3e-06,-2.3e-05,1e-06,6e-05,1.8e-05,2.5e-05,-1.7e-05,-1.3e-05,-9e-06,1e-06,-7e-06,1e-05,-4.9e-05,-1.2e-05,-1.8e-05,-8e-06,2.2e-05,6e-06,-1e-06,5e-06,-9e-06,8e-06,1.9e-05,-4e-06,-4.8e-05,0,-5e-06,-2e-06,3.6e-05,3.1e-05,-1.4e-05,9e-06,-2.2e-05,-1e-06,-2.9e-05,1e-06,-4.6e-05,1e-05,-1.1e-05,2.9e-05,-1e-06,0,4.2e-05,-1e-06,3e-06,5e-06,1e-05,-5e-06,1.1e-05,-4e-06,9e-06,-2e-06,1e-05,-4.5e-05,2.7e-05,-5e-06,5e-05,1.6e-05,-1e-06,-1.1e-05,-5e-06,1.2e-05,3.7e-05,1.5e-05,3.3e-05,-8e-06,-2e-05,-4e-06,5e-06,-2e-05,-3e-06,-2e-06,7e-06,0,1.1e-05,-8e-06,-5e-06,4.3e-05
-2.9e-05,-2.6e-05,-1e-06,-2.5e-05,1.1e-05,-2.8e-05,2.2e-05,-5e-06,1.2e-05,7e-06,1e-06,2.1e-05,2e-06,2e-05,3e-06,1.6e-05,-4e-05,1.3e-05,-4e-06,-2e-06,-2.2e-05,1e-06,1.4e-05,-2.8e-05,1.4e-05,-6e-06,-2.5e-05,-2.1e-05,-1e-06,-1.3e-05,6e-06,2.4e-05,-3e-06,3e-06,-1e-05,-3.6e-05,9e-06,2e-06,-1.4e-05,4.3e-05,-1.8e-05,3e-05,2e-06,1e-05,-6e-06,2e-06,3e-05,1.8e-05,-3e-06,-3.1e-05,-8e-06,-3e-06,-4e-06,-2e-06,1.4e-05,2e-06,1e-06,-6e-06,9e-06,-1.1e-05,-1e-06,-1e-06,-1.8e-05,1.2e-05,-1.8e-05,-9e-06,5e-06,2.7e-05,7e-06,-1.8e-05,2e-05,-1.9e-05,1.4e-05,-1.9e-05,-1.2e-05,1e-05,0,3e-05,3e-06,-3.1e-05,4e-06,2.9e-05,2.3e-05,-6e-06,1e-06,-1.5e-05,0,-1.8e-05,2e-05,9e-06,-7e-06,-5e-06,2e-06,-1.5e-05,3.2e-05,-3e-06,-1.3e-05,-1.3e-05,3e-06,-1.6e-05,-1.4e-05,-7e-06,-7e-06,-6e-06,-2.4e-05,-1.7e-05,-2e-06,1.7e-05,3.9e-05,1.9e-05,-6e-06,-1e-06,3e-06,1e-06,3e-06,-2e-05,-9e-06,-1.6e-05,2e-06,1.3e-05,-2.6e-05
8e-06,-2.4e-05,1e-06,-2.6e-05,2e-05,9e-06,-4e-06,-2.5e-05,-3e-06,7e-06,0,1.5e-05,-1e-05,-1.4e-05,-3e-06,2e-05,2.3e-05,-5e-06,0,1.1e-05,8e-06,6e-06,-2.4e-05,-3.1e-05,-2.3e-05,0,-1.1e-05,-5e-06,-6e-06,7e-06,1.5e-05,1e-05,-7e-06,3.1e-05,8e-06,-3.5e-05,1.5e-05,-2.5e-05,2e-06,-1.4e-05,1e-05,-1e-06,-7e-06,2.1e-05,-9e-06,4e-06,-3.9e-05,1.4e-05,-1.6e-05,2e-05,1.3e-05,1.1e-05,-3e-06,-9e-06,-1e-05,3.9e-05,6e-06,-1e-06,0,-3e-06,-4e-06,2.7e-05,1.9e-05,-2e-05,5e-06,-8e-06,3e-06,-2e-06,-7e-06,3.1e-05,-2.3e-05,-1.8e-05,-3.3e-05,-1e-05,-3.5e-05,-5e-06,1e-06,6e-06,-2e-06,4.6e-05,-8e-06,-4e-06,-1.8e-05,9e-06,1e-06,5.8e-05,-1.3e-05,1.6e-05,-6e-06,-9e-06,4e-06,1e-06,-1.4e-05,-3e-06,-4e-06,-9e-06,-1.9e-05,2e-05,0,-4.2e-05,2e-06,-3e-06,-5e-06,4e-06,4e-06,1.4e-05,5e-06,-4e-06,-9e-06,-1e-06,2e-06,-3e-06,5e-06,-6e-06,-1e-06,1.1e-05,-1.6e-05,1.2e-05,-2e-06,-4e-05,2e-05
2.5e-05,1.2e-05,8e-06,-1.9e-05,-9e-06,5e-06,-8e-06,7e-06,4e-06,-7e-06,4e-06,-1.1e-05,-5e-06,1.1e-05,1e-06,2.2e-05,2.2e-05,5e-06,9e-06,-8e-06,1.6e-05,-6.1e-05,5e-06,1e-06,3.1e-05,1e-06,-5e-06,-4e-06,5e-06,-5e-06,-5e-06,-9e-06,-1.6e-05,-2.2e-05,-1.4e-05,3e-06,-1.3e-05,-5.3e-05,3e-06,-6e-06,-4.7e-05,-1.5e-05,7e-06,7e-06,5e-06,-1e-06,-2e-05,2e-06,1.2e-05,2e-05,6e-06,-1e-06,5e-06,-8e-06,-2e-06,-3.2e-05,1.5e-05,1.8e-05,-1e-06,-2e-06,4e-06,4e-06,-7e-06,5e-06,2e-06,3e-06,-1e-06,6e-06,-2e-06,-1e-06,-6e-06,1.9e-05,2.2e-05,-2e-06,4e-06,-3e-06,1e-06,-1.5e-05,1e-06,-1e-06,-9e-06,-1.4e-05,0,0,-2e-06,-2e-05,2.2e-05,-5e-06,-2.5e-05,-2e-06,-1.3e-05,1e-05,3e-06,-1.5e-05,-2.4e-05,4e-06,-7e-06,-1.7e-05,1e-06,1.6e-05,2e-06,5e-06,4e-06,2e-06,-5e-06,5.8e-05,-1.7e-05,-1.3e-05,2e-06,-9e-06,-3e-06,-7e-06,-2.5e-05,-3e-06,1e-06,-3.6e-05,-2e-06,-2e-06,3e-06,2.9e-05,8e-06
-6e-06,1.4e-05,1.3e-05,-8e-06,-2.2e-05,3e-06,5e-06,7e-06,4e-06,-1e-06,-3e-06,6e-06,3e-06,-8e-06,-2e-06,2e-06,1.5e-05,-2e-06,9e-06,2e-06,-1.7e-05,-7e-06,3e-06,1.9e-05,-1e-06,2e-06,3e-06,1.5e-05,-5e-06,-1e-05,1.1e-05,-7e-06,5e-06,-1e-06,1.2e-05,-8e-06,-2e-06,-9e-06,-8e-06,1.8e-05,6.1e-05,-1e-05,-7e-06,0,-7e-06,1e-06,-1.5e-05,-2.5e-05,4e-06,-1.3e-05,1e-06,-4e-06,-2e-06,2e-06,-8e-06,1.5e-05,1.6e-05,-4e-06,0,1.6e-05,-5e-06,-1.5e-05,1e-06,-2.2e-05,4e-06,3e-06,2e-06,-1.4e-05,4e-06,-1.5e-05,1.5e-05,1.5e-05,-6e-06,2e-06,1.9e-05,3e-06,-3e-06,3e-06,-2e-06,-1.1e-05,-4e-06,7e-06,2e-06,-6e-06,-2e-06,-1.1e-05,-1.1e-05,-5e-06,7e-06,-1.2e-05,1.8e-05,-4e-06,-2e-06,8e-06,1.5e-05,-2e-06,2.5e-05,6e-06,2e-06,2.3e-05,3e-06,4e-06,1.4e-05,4e-06,9e-06,5e-06,5e-06,-1.8e-05,-2e-05,1e-06,4e-06,8e-06,2.1e-05,2e-06,3e-06,2.7e-05,1.8e-05,-1.7e-05,-2e-06,-1.5e-05,2e-06
-8e-06,-7e-06,2e-06,3e-06,3.1e-05,-9e-06,-1.3e-05,-2e-06,-2e-06,1.7e-05,1e-06,1.3e-05,-1.4e-05,8e-06,2e-06,-1.2e-05,-3.5e-05,1e-06,8e-06,7e-06,-4e-06,4e-06,-9e-06,5e-06,2.6e-05,-4e-06,2.2e-05,-2e-06,4e-06,-2e-06,-4e-06,-9e-06,3e-06,7e-06,-7e-06,1.9e-05,1.1e-05,1e-06,2e-06,-1e-06,-2e-05,-6e-06,2e-06,-1e-06,5e-06,2e-06,2.8e-05,-7e-06,-1.6e-05,-2.3e-05,1e-06,-5e-06,5e-06,-8e-06,-9e-06,-9e-06,8e-06,-1e-05,1e-06,-1.3e-05,2e-06,-9e-06,-3e-06,1.3e-05,0,-5e-06,-1e-06,-6e-06,-3e-06,8e-06,6e-06,-2e-05,2.9e-05,9e-06,1.2e-05,0,-1e-06,-5e-06,4e-06,-1.1e-05,0,1e-06,-5e-06,0,0,-2.1e-05,-1e-06,1.2e-05,1.4e-05,3e-06,-3e-06,3e-06,-8e-06,8e-06,9e-06,3e-06,-7e-06,-6e-06,-3e-06,3e-06,-8e-06,-2e-06,-4e-06,-1e-06,-1.5e-05,-3.5e-05,1.3e-05,0,8e-06,1.1e-05,-2e-06,-2e-06,-3e-06,-9e-06,-1.1e-05,-2.5e-05,-2e-06,8e-06,4e-06,1.8e-05,-1.7e-05
1.1e-05,1e-06,0,3e-06,-1.1e-05,-1e-06,1.6e-05,-7e-06,-1e-06,-2.4e-05,2e-06,-5e-06,1.4e-05,-1.5e-05,3e-06,-2.1e-05,-2e-05,4e-06,8e-06,-8e-06,1.5e-05,4.2e-05,1.1e-05,0,-1.3e-05,3e-06,5e-06,-1.7e-05,-4e-06,3e-06,-5e-06,8e-06,6e-06,1.7e-05,1e-06,2.2e-05,-3e-06,-3e-06,7e-06,-3e-06,-1.5e-05,-4e-06,2e-06,6e-06,-2e-06,-1e-06,2.4e-05,-5e-06,5e-06,3e-06,-2e-06,8e-06,2e-06,-6e-06,-3e-06,-1.6e-05,-1.4e-05,2e-06,-5e-06,-1e-06,-2e-06,-9e-06,6e-06,-1.6e-05,-7e-06,-5e-06,-2e-06,3.6e-05,2e-06,1e-06,8e-06,-3e-06,-3.6e-05,9e-06,2e-06,-3e-06,0,6e-06,-4e-06,4e-06,2e-06,1.4e-05,1.4e-05,2e-06,-2e-06,1.1e-05,8e-06,-9e-06,-2e-06,4e-06,-2e-06,2e-06,6e-06,9e-06,-9e-06,1e-06,2.6e-05,8e-06,-1e-06,-2e-05,7e-06,1e-06,-3e-06,-9e-06,4e-06,5e-06,-1e-05,7e-06,-3e-06,-9e-06,-1e-06,4e-06,-9e-06,-2e-06,7e-06,-2e-06,-1.3e-05,6e-06,-2e-06,1e-06,-2e-06
3e-06,3e-06,-7e-06,3e-06,-9e-06,1.1e-05,-6e-06,-3e-06,2e-06,2.2e-05,0,6e-06,-8e-06,6e-06,-5e-06,-1.1e-05,2.2e-05,0,-7e-06,-1e-06,1e-06,1.5e-05,-5e-06,8e-06,1.6e-05,0,-5e-06,-1.1e-05,4e-06,-3e-06,7e-06,9e-06,4e-06,-1.4e-05,7e-06,1e-05,-1.1e-05,4e-06,-6e-06,-5e-06,-1e-06,-9e-06,-1e-06,-1e-05,2e-06,0,-8e-06,1e-05,1.2e-05,2.2e-05,-8e-06,1e-06,-3e-06,1e-06,1e-05,3.3e-05,-1.2e-05,1e-06,3e-06,1e-06,1e-06,1.7e-05,0,1.4e-05,1e-06,4e-06,1e-06,-3.9e-05,0,-6e-06,1e-06,1.5e-05,7e-06,9e-06,-7e-06,1e-06,1e-06,3e-06,2e-06,-2e-06,2e-06,-2.5e-05,-3e-06,2e-06,3e-06,6e-06,-1.5e-05,-2e-06,-6e-06,9e-06,1e-06,1e-06,-7e-06,-2e-06,-8e-06,0,-3e-06,-3e-06,2e-06,-2.1e-05,-5e-06,-3e-06,-3e-06,6e-06,-5e-06,8e-06,-1e-06,1.2e-05,1.5e-05,-3e-06,4e-06,-7e-06,1.6e-05,6e-06,-5e-06,2e-06,6e-06,-7e-06,-1e-06,-1.8e-05,0
-1.7e-05,-9e-06,-3e-06,4e-06,5e-06,-1.2e-05,5e-06,9e-06,1e-06,-1.6e-05,0,4e-06,1.2e-05,-2e-06,5e-06,1e-06,8e-06,1e-06,-1.1e-05,6e-06,-1.3e-05,-1.5e-05,-8e-06,-2e-06,-1.2e-05,-2e-06,-8e-06,-3e-06,-2e-06,-1e-06,-9e-06,0,-3e-06,-7e-06,-5e-06,5e-06,2e-06,-1.7e-05,-5e-06,1.1e-05,2.5e-05,1e-06,1e-06,-9e-06,-5e-06,1e-06,-1.8e-05,1e-05,-1.9e-05,-1.2e-05,1e-06,-7e-06,0,-3e-06,4e-06,-1.8e-05,-1.3e-05,7e-06,2e-06,8e-06,1e-06,1.2e-05,-7e-06,-9e-06,3e-06,3e-06,-2e-06,5e-06,0,-6e-06,-1.3e-05,-4e-06,-1.3e-05,7e-06,-7e-06,-4e-06,-1e-06,-1.4e-05,-3e-06,-3e-06,3e-06,1.3e-05,-1.5e-05,-3e-06,2e-06,1.8e-05,8e-06,5e-06,-1e-05,-1.1e-05,-4e-06,-1e-06,-1e-06,-1e-06,1.2e-05,-2e-06,-4e-06,5e-06,0,2.7e-05,4e-06,4e-06,-4e-06,0,4e-06,-3e-05,4e-06,6e-06,-1e-05,6e-06,-6e-06,2e-06,-9e-06,-7e-06,1e-06,-7e-06,7e-06,4e-06,1e-06,1e-06,1e-06
-1e-06,3e-06,-4e-06,6e-06,9e-06,4e-06,-4e-06,9e-06,-5e-06,1.1e-05,0,-1.6e-05,-6e-06,1e-06,-3e-06,6e-06,4e-06,-6e-06,7e-06,-2e-06,5e-06,-1.5e-05,1.2e-05,-1.9e-05,1e-05,0,-1e-05,1e-05,1e-06,2e-06,-2e-06,-6e-06,-2e-06,1.5e-05,5e-06,-1.2e-05,4e-06,4e-06,4e-06,-2.1e-05,-1.3e-05,1e-05,-1e-06,-7e-06,3e-06,-1e-06,-2.1e-05,2e-06,6e-06,-1.9e-05,1e-06,2e-06,0,-2e-06,-1e-06,-3e-06,-4e-06,-4e-06,-2e-06,-9e-06,-3e-06,-4e-06,5e-06,1.2e-05,3e-06,-1e-06,0,3e-05,2e-06,1.6e-05,-1.4e-05,-1e-05,2.3e-05,4e-06,-2e-06,4e-06,-1e-06,1e-05,2e-06,2.1e-05,3e-06,9e-06,4e-06,0,-2e-06,1e-05,1e-06,-4e-06,6e-06,-5e-06,4e-06,0,-1e-06,-1.2e-05,0,1e-06,-5e-06,-4e-06,0,1.6e-05,-5e-06,-2e-06,4e-06,1e-06,-8e-06,1e-06,4e-06,-6e-06,0,0,1e-06,-2e-06,-2e-06,-1e-06,0,1e-06,-4e-06,3e-06,-1e-06,1.3e-05,4e-06
1.2e-05,1e-05,3e-06,8e-06,-9e-06,8e-06,-5e-06,-1e-05,-1e-06,-4e-06,1e-06,6e-06,9e-06,-4e-06,4e-06,8e-06,-2.3e-05,8e-06,-1.4e-05,-3e-06,7e-06,-2.4e-05,-9e-06,-6e-06,-2e-05,2e-06,1e-06,-1e-06,0,0,0,0,-7e-06,5e-06,-5e-06,-1.8e-05,-6e-06,2.2e-05,-1e-06,2.1e-05,-1.1e-05,1.3e-05,1e-06,6e-06,0,0,1.2e-05,2e-06,1e-05,7e-06,0,2e-06,0,2e-06,5e-06,1.2e-05,1.3e-05,-2e-06,2e-06,0,1e-06,-5e-06,-2e-06,-6e-06,-2e-06,3e-06,1e-06,-3e-05,-1e-06,-5e-06,4e-06,8e-06,-3e-05,-2e-06,0,-3e-06,0,7e-06,-4e-06,-3e-06,3e-06,-1.4e-05,1.1e-05,1e-06,3e-06,6e-06,-5e-06,2e-06,1.1e-05,-3e-06,-4e-06,1e-06,-5e-06,-2e-06,-6e-06,-2e-06,-1.6e-05,-1e-06,-1e-06,-1.8e-05,5e-06,-1e-06,3e-06,0,3e-06,4e-06,-5e-06,-4e-06,-5e-06,-8e-06,3e-06,4e-06,1e-05,4e-06,-3e-06,6e-06,-5e-06,-8e-06,0,-7e-06,1e-06
-1e-06,-9e-06,3e-06,7e-06,-4e-06,-1.5e-05,1e-05,-4e-06,1e-06,0,1e-06,3e-06,-5e-06,2e-06,-4e-06,5e-06,-3e-06,-6e-06,-1e-06,4e-06,-6e-06,7e-06,-7e-06,3e-06,6e-06,-1e-06,7e-06,-1e-05,-1e-06,1e-06,1e-06,-4e-06,3e-06,-9e-06,6e-06,-8e-06,-2e-06,1.4e-05,-3e-06,-1.4e-05,-1e-06,4e-06,-2e-06,-5e-06,4e-06,1e-06,2.7e-05,-1.2e-05,-1.2e-05,1.3e-05,4e-06,1e-06,2e-06,2e-06,1e-06,-1.9e-05,1e-05,-4e-06,1e-06,6e-06,-2e-06,-1.4e-05,1e-06,1e-05,0,1e-06,-1e-06,7e-06,0,-7e-06,1.6e-05,7e-06,-5e-06,-4e-06,3e-06,-1e-06,1e-06,-1.2e-05,3e-06,-1.3e-05,1e-06,9e-06,-4e-06,-1e-06,-1e-06,-1e-05,4e-06,1e-06,-7e-06,7e-06,6e-06,-1e-06,1e-06,3e-06,2e-06,2e-06,5e-06,5e-06,0,-2.4e-05,-3e-06,-1e-06,2e-06,-1e-06,-5e-06,-2.1e-05,-4e-06,-6e-06,3e-06,9e-06,-6e-06,0,-1.4e-05,-2e-06,-1e-06,1e-06,-5e-06,2e-06,1e-06,6e-06,8e-06
-6e-06,-7e-06,3e-06,3e-06,1.1e-05,8e-06,-7e-06,4e-06,-4e-06,-1e-06,0,-1.3e-05,2e-06,-2e-06,1e-06,-1e-06,1.8e-05,4e-06,3e-06,-1e-06,-5e-06,6e-06,1.1e-05,-1e-06,-1.4e-05,0,5e-06,-9e-06,0,0,0,3e-06,1e-06,-9e-06,-5e-06,-9e-06,6e-06,1.4e-05,2e-06,4e-06,3.5e-05,-2e-06,3e-06,8e-06,-1e-06,0,0,1e-06,-1e-06,-3e-06,0,-4e-06,-3e-06,-3e-06,-5e-06,1.8e-05,9e-06,7e-06,-3e-06,-1e-06,0,4e-06,-4e-06,-7e-06,-2e-06,-2e-06,1e-06,7e-06,0,6e-06,3e-06,-1e-05,-1e-06,-8e-06,6e-06,4e-06,0,1e-06,-2e-06,4e-06,0,-1.3e-05,-4e-06,2e-06,-2e-06,-1.4e-05,1e-06,-2e-06,-6e-06,2e-06,-1e-06,0,-1e-06,6e-06,4e-06,0,-7e-06,-6e-06,0,2e-05,-1e-06,2e-06,-2e-06,-2e-06,2e-06,2.1e-05,7e-06,0,4e-06,-4e-06,6e-06,-1e-06,1e-05,0,-1e-06,8e-06,2e-06,5e-06,-1e-06,-5e-06,-1.4e-05
6e-06,7e-06,3e-06,-2e-06,-1e-06,5e-06,9e-06,3e-06,-1e-06,5e-06,0,6e-06,-1e-06,0,1e-06,-5e-06,1e-06,-2e-06,1e-06,-3e-06,7e-06,3e-05,-8e-06,2e-06,1.2e-05,2e-06,3e-06,-2e-06,-1e-06,1e-06,2e-06,4e-06,4e-06,1.5e-05,0,5e-06,-1e-06,0,1e-06,2e-06,-3.9e-05,-6e-06,-3e-06,-4e-06,4e-06,0,-1.5e-05,-7e-06,1.1e-05,-1.8e-05,-2e-06,1e-06,2e-06,3e-06,-4e-06,-2e-06,3e-06,1e-06,2e-06,-4e-06,0,1.2e-05,4e-06,9e-06,3e-06,-1e-06,0,-4e-06,0,0,-6e-06,-2e-06,3e-06,-9e-06,-1e-06,-6e-06,-1e-06,6e-06,3e-06,2e-06,-3e-06,2.2e-05,0,-1e-06,2e-06,-2e-06,-2e-06,3e-06,0,-3e-06,-5e-06,-2e-06,-4e-06,6e-06,-1e-06,-1e-06,1.1e-05,8e-06,1e-06,1.8e-05,0,1e-06,-3e-06,2e-06,-2e-06,2.5e-05,-2e-06,5e-06,-3e-06,-3e-06,-1e-06,0,-1e-06,3e-06,-1e-06,5e-06,8e-06,-5e-06,-1e-06,-9e-06,4e-06
6e-06,4e-06,-4e-06,-4e-06,-9e-06,-8e-06,-8e-06,-4e-06,1e-06,-7e-06,0,-4e-06,-1e-06,2e-06,-1e-06,-7e-06,1e-06,0,4e-06,3e-06,1e-06,3e-06,-1e-06,6e-06,-1.1e-05,-2e-06,-3e-06,7e-06,1e-06,2e-06,-1e-06,1e-06,1e-06,1e-06,1e-06,1.7e-05,-7e-06,-6e-06,-2e-06,0,1.2e-05,-6e-06,1e-06,1.3e-05,-2e-06,1e-06,-1.6e-05,5e-06,-8e-06,3e-06,0,1e-06,0,2e-06,0,-1.9e-05,-1.1e-05,-3e-06,0,2e-06,0,5e-06,1e-06,-8e-06,1e-06,2e-06,-1e-06,-1e-06,0,-6e-06,-1e-06,7e-06,0,-6e-06,-6e-06,1e-06,0,-1e-06,-3e-06,2e-06,-3e-06,-1.5e-05,1e-06,-1e-06,-2e-06,0,-1e-06,-3e-06,5e-06,-7e-06,7e-06,0,2e-06,-4e-06,-3e-06,0,2e-06,-8e-06,1e-06,-1.4e-05,1e-06,-1e-06,0,1e-06,3e-06,-1.7e-05,-3e-06,2e-06,-1e-06,5e-06,-3e-06,-1e-06,-9e-06,-3e-06,0,-7e-06,-4e-06,3e-06,0,1.4e-05,-4e-06
-1e-05,-2e-06,-2e-06,-4e-06,3e-06,4e-06,2e-06,-3e-06,-1e-06,9e-06,1e-06,-5e-06,1e-06,-1e-06,1e-06,-2e-06,-1.6e-05,1e-06,1e-06,-1e-06,-4e-06,-1.7e-05,7e-06,5e-06,1.2e-05,0,-7e-06,-1e-06,0,1e-06,5e-06,-6e-06,-2e-06,-1.1e-05,0,1.1e-05,2e-06,5e-06,1e-06,0,-2e-06,-5e-06,1e-06,-2e-06,3e-06,0,-1e-06,5e-06,-4e-06,1.6e-05,0,0,0,0,-3e-06,2e-05,-9e-06,-2e-06,-2e-06,2e-06,0,0,-3e-06,9e-06,0,-2e-06,1e-06,-8e-06,0,0,-6e-06,-2e-06,-1.8e-05,-4e-06,-2e-06,4e-06,0,-3e-06,2e-06,-2e-06,-2e-06,-1e-06,6e-06,0,-1e-06,2e-05,4e-06,-1e-06,5e-06,0,-5e-06,0,-5e-06,-3e-06,2e-06,0,5e-06,6e-06,-2e-06,-1.8e-05,-2e-06,-1e-06,1e-06,-3e-06,-4e-06,-1e-06,1e-06,3e-06,-5e-06,0,5e-06,2e-06,1.4e-05,-1e-06,-1e-06,1.4e-05,-6e-06,2e-06,1e-06,-7e-06,7e-06
-5e-06,-2e-06,-3e-06,-2e-06,1e-05,0,2e-06,0,-1e-06,-6e-06,0,7e-06,-6e-06,-2e-06,-1e-06,1e-06,5e-06,-1e-06,0,-4e-06,0,-1.9e-05,-1.2e-05,-2e-06,-8e-06,1e-06,-1e-06,-9e-06,0,-1e-06,-4e-06,2e-06,-3e-06,-3e-06,-5e-06,7e-06,4e-06,1e-06,1e-06,-2e-06,2.1e-05,-6e-06,-1e-06,5e-06,-2e-06,-1e-06,2.1e-05,3e-06,9e-06,-3e-06,-2e-06,-1e-06,0,0,-2e-06,-1.2e-05,-9e-06,1e-06,2e-06,-1e-06,-1e-06,-1.3e-05,1e-06,-1e-05,0,-1e-06,-1e-06,1.9e-05,0,8e-06,0,-4e-06,1.3e-05,1e-06,1e-06,-5e-06,0,0,-1e-06,1e-06,-1e-06,4e-06,-2e-06,0,2e-06,-8e-06,-3e-06,5e-06,-7e-06,3e-06,2e-06,0,0,-6e-06,-1e-06,0,3e-06,-7e-06,2e-06,5e-06,0,-1e-06,3e-06,3e-06,2e-06,2.2e-05,2e-06,-2e-06,6e-06,-4e-06,-4e-06,-1e-06,-1e-05,4e-06,-4e-06,-1.5e-05,5e-06,-5e-06,1e-06,4e-06,-8e-06
8e-06,0,-2e-06,-1e-06,-1.4e-05,-2e-06,-4e-06,8e-06,2e-06,-2e-06,0,-1e-06,6e-06,0,2e-06,2e-06,1.2e-05,1e-06,1e-06,3e-06,4e-06,-9e-06,3e-06,-1e-06,1.3e-05,-1e-06,0,-9e-06,0,2e-06,1e-06,-1e-06,-4e-06,1.1e-05,7e-06,0,-6e-06,-2e-06,0,6e-06,-2.8e-05,1e-06,1e-06,-8e-06,2e-06,0,1.3e-05,5e-06,-5e-06,-1.4e-05,1e-06,-1e-06,0,4e-06,1e-06,3e-06,-1e-06,5e-06,0,1e-06,1e-06,-6e-06,-1e-06,8e-06,-1e-06,0,0,-9e-06,0,-7e-06,9e-06,5e-06,-3e-06,4e-06,5e-06,2e-06,0,4e-06,0,-2e-06,0,-1e-06,-7e-06,0,-1e-06,1.7e-05,-2e-06,-3e-06,-4e-06,3e-06,2e-06,0,-2e-06,-1e-06,1e-06,0,-5e-06,9e-06,-1e-06,2.3e-05,1e-06,2e-06,1e-06,-3e-06,1e-06,-1.1e-05,-1e-06,-2e-06,-4e-06,4e-06,0,2e-06,1e-06,-2e-06,0,8e-06,4e-06,2e-06,-2e-06,-6e-06,1.2e-05
2e-06,-1e-06,4e-06,0,1e-06,0,7e-06,-1e-06,1e-06,5e-06,1e-06,-2e-06,-5e-06,1e-06,0,0,-8e-06,-3e-06,0,1e-06,-1e-06,1.8e-05,6e-06,-2e-06,-1.1e-05,-1e-06,1e-06,-1e-06,0,1e-06,-1e-06,1e-06,4e-06,1e-06,-6e-06,-1.1e-05,-2e-06,-8e-06,0,-1.2e-05,3e-06,5e-06,-1e-06,2e-06,-2e-06,0,-8e-06,-9e-06,-5e-06,0,2e-06,2e-06,-1e-06,1e-06,2e-06,1.3e-05,9e-06,-3e-06,-1e-06,-4e-06,-1e-06,7e-06,3e-06,-9e-06,1e-06,1e-06,1e-06,-1.5e-05,0,-1e-06,0,2e-06,1.6e-05,7e-06,1e-06,3e-06,0,0,-1e-06,-4e-06,2e-06,8e-06,1e-06,0,0,-2.6e-05,6e-06,-2e-06,3e-06,-3e-06,-3e-06,-1e-06,-2e-06,3e-06,-2e-06,1e-06,3e-06,-1e-05,0,-5e-06,1e-06,0,-2e-06,3e-06,2e-06,-1.3e-05,-1e-06,1e-06,6e-06,0,4e-06,-3e-06,9e-06,-2e-06,-2e-06,-9e-06,-3e-06,2e-06,1e-06,2e-06,-8e-06
