-0.006753,-0.010429,-0.014705,-0.012628,-0.012099,-0.00898,-0.00866,-0.005683,-0.004532,-0.007239,-0.009731,-0.008494,-0.006293,-0.00619,-0.008278,-0.008779,-0.00818,-0.006528,-0.006903,-0.00442,-0.00686,-0.007534,-0.007052,-0.006709,-0.005581,-0.008292,-0.009041,-0.007383
-0.002257,-0.006493,-0.009001,-0.005853,-0.005715,-5e-06,-0.00347,-0.003252,-0.00257,-0.000834,-0.000366,-0.000707,-0.000466,-0.001002,0.000161,-0.000719,-0.003379,-0.002397,-0.003156,-0.001213,0.000419,0.000169,-0.001063,0.000978,-0.000565,-0.001689,-0.004304,-0.004043
-0.002469,-0.002178,-0.001505,0.000888,0.000709,-0.00273,-0.004454,-0.003474,-0.003362,-0.001147,-0.00023,-0.000245,-0.001615,-0.001291,6.1e-05,0.000131,-0.000572,-9e-05,2e-05,-0.000718,-0.00031,-0.001019,-0.000555,-0.00056,-0.000124,-0.000403,-3.7e-05,0.00027
0.000484,0.005085,0.008406,0.006116,0.005489,-0.001131,-0.000784,-0.000688,-0.00154,-0.000175,-0.000334,0.000203,-0.001614,-0.000469,-0.000711,-0.001498,0.001259,0.001901,0.001974,-0.000233,-0.001647,-0.001518,-0.000298,-0.002139,-0.001065,-0.000601,0.002535,0.002478
0.005926,0.00938,0.012676,0.007307,0.006161,0.008679,0.008785,0.005063,0.003583,0.005332,0.006581,0.005106,0.003324,0.004579,0.004302,0.002106,0.003714,0.004439,0.003301,0.002426,0.004669,0.006465,0.004495,0.004305,0.002015,0.003991,0.004975,0.003427
-0.001544,-0.004082,-0.006511,-0.005896,-0.005697,-0.001711,5.9e-05,0.000103,-0.000179,-0.001977,-0.001731,-0.002373,-0.00182,-0.000927,-0.002351,-0.002935,-0.002921,-0.001889,-0.002539,-0.001116,-0.000185,0.000276,-0.001084,-0.000561,-0.001128,-0.001909,-0.002946,-0.002229
-0.004813,-0.010423,-0.015325,-0.009475,-0.007548,-0.00833,-0.007211,-0.003473,-0.002901,-0.005996,-0.007589,-0.005533,-0.003384,-0.004829,-0.005298,-0.003465,-0.00481,-0.005439,-0.004137,-0.003184,-0.006437,-0.007677,-0.005391,-0.005217,-0.002852,-0.005999,-0.007532,-0.004907
0.003165,0.001536,0.002147,0.003825,0.004383,0.004432,0.002887,0.002786,0.003319,0.004102,0.004691,0.004823,0.005086,0.002378,0.005309,0.00728,0.004225,0.001667,0.003032,0.002151,0.002284,0.001859,0.00271,0.003666,0.00408,0.004559,0.002355,0.002313
0.002196,0.005984,0.00956,0.005993,0.004476,0.00339,0.004175,0.003181,0.004132,0.004508,0.004818,0.003172,0.003157,0.00294,0.003964,0.004461,0.004578,0.003478,0.003232,0.002699,0.004852,0.005003,0.003493,0.00339,0.003661,0.006291,0.006144,0.004838
-0.00127,0.003408,0.004953,0.000533,-0.000277,-0.002785,-0.000681,-0.000648,-6.6e-05,-0.001821,-0.004493,-0.003925,-0.002394,-0.000819,-0.00407,-0.004991,-0.000902,-0.00019,-0.001152,-0.000741,-0.002336,-0.002197,-0.001884,-0.003522,-0.003136,-0.002349,0.000604,-0.000156
0.001364,0.001722,0.001576,0.000814,0.001615,0.003762,0.001843,-0.000627,-0.000827,-9.6e-05,0.000271,0.000944,0.000831,0.001709,9e-06,-0.000354,1.5e-05,0.000287,-0.000144,0.000461,0.000135,0.000485,0.001157,0.001481,-0.001297,-0.000985,0.00053,-0.001346
-0.001669,-0.006289,-0.008753,-0.002915,-0.00224,-0.000248,-0.002332,-0.002931,-0.003199,-0.00155,0.001666,0.001328,-0.000266,-0.000312,0.001384,0.002284,-0.001123,-0.000908,-0.000458,0.00025,0.002063,0.001362,0.000846,0.002171,0.001211,0.000557,-0.000658,-0.001112
-0.004533,-0.007712,-0.010401,-0.005758,-0.006155,-0.007808,-0.007813,-0.004414,-0.004979,-0.004682,-0.004947,-0.003901,-0.00451,-0.005155,-0.003324,-0.003959,-0.004499,-0.003687,-0.002933,-0.002773,-0.004341,-0.005445,-0.00505,-0.005558,-0.002423,-0.00494,-0.005894,-0.003305
0.001472,0.004242,0.00605,0.001302,0.000528,0.001792,0.001022,0.001853,0.000854,0.002003,0.000833,0.000299,-0.000523,-0.000765,-0.000402,-0.002151,-0.000131,0.000554,0.000218,-0.000724,-0.001562,-0.000584,-0.00053,-0.00102,-0.001221,-0.0014,-0.001673,-0.000624
0.003578,0.007311,0.010189,0.004605,0.004796,0.004983,0.006268,0.005103,0.004281,0.004517,0.005333,0.002595,0.002258,0.003369,0.002045,0.002079,0.003396,0.003828,0.002699,0.00186,0.004666,0.006376,0.00493,0.004817,0.002255,0.004535,0.004869,0.003994
0.001096,0.000816,0.000104,0.001889,0.002741,-0.00214,0.001382,0.001559,0.001164,-0.001057,-0.001657,-0.000915,0.000425,0.00106,-0.000206,0.000428,0.000528,0.000569,0.00056,0.000113,0.000101,6.3e-05,0.00035,-0.00052,0.00051,0.000647,0.002077,0.002191
0.001112,-0.002239,-0.003648,0.000407,0.000357,0.000816,0.000256,-0.000626,0.000366,-0.001086,-0.001614,0.001383,0.001664,0.000459,0.0014,0.001412,-0.000698,-0.001111,-0.000277,-0.000285,-0.002232,-0.00305,-0.001858,-0.000873,0.000537,-0.000721,-0.000835,-0.001096
-0.002111,-0.004852,-0.005446,-0.003574,-0.004267,0.001412,-0.001027,-0.001796,0.000365,0.000506,0.001295,0.001114,0.00107,5.8e-05,0.001353,0.001816,-0.000305,-0.001042,-0.000773,0.000289,0.001081,0.000414,-0.000568,0.001502,0.001752,0.001585,-0.001024,-0.001417
-0.004673,-0.002282,-0.002785,-0.004421,-0.004252,-0.004061,-0.004274,-0.002803,-0.001491,-0.000998,-0.002848,-0.004146,-0.002517,-0.002115,-0.002573,-0.002324,-0.000575,-0.001864,-0.001958,-0.001083,-0.001414,-0.002024,-0.002122,-0.002973,-0.001844,-0.001882,-0.002779,-0.001557
