-0.006407,-0.008292,-0.010745,-0.012434,-0.009925,-0.011785,-0.009661,-0.010541,-0.007261,-0.011259,-0.00839,-0.01166,-0.00676,-0.00446,-0.005363,-0.009613,-0.009441,-0.008484,-0.010099,-0.010643,-0.009677,-0.010136,-0.011357,-0.006471,-0.008177,-0.008238,-0.00656,-0.009167,-0.006698,-0.007155,-0.012227,-0.014954,-0.010195,-0.008763,-0.005492,-0.009625,-0.009983,-0.007199,-0.006779,-0.009329,-0.008947,-0.010713,-0.011827,-0.014688,-0.010093,-0.013681,-0.011378,-0.010202,-0.007894,-0.00887,-0.005158,-0.008169,-0.007924,-0.006221,-0.008083,-0.004746,-0.012829,-0.005953,-0.004765,-0.00449,-0.00642,-0.005604,-0.002385,-0.005182,-0.007297,-0.007525,-0.005022,-0.004453,-0.011383,-0.007196,-0.005229,-0.009559,-0.010402,-0.012546,-0.008011,-0.008843,-0.010281,-0.012013,-0.010381,-0.006719,-0.00942,-0.005597,-0.006218,-0.005257,-0.008644,-0.005403,-0.00325,-0.006532,-0.007286,-0.006806,-0.007768,-0.007891,-0.006288,-0.007047,-0.007762,-0.007536,-0.006495,-0.00921,-0.009021,-0.007398,-0.006589,-0.011902,-0.008598,-0.00895,-0.005781,-0.007793,-0.006283,-0.004882,-0.011754,-0.008441,-0.007777,-0.005886,-0.004698,-0.002936,-0.006079,-0.009245,-0.003872,-0.008686,-0.004985,-0.006102,-0.010473
-0.0011,0.000933,0.004347,0.004995,0.002473,0.001741,0.002321,0.002631,0.005264,0.006539,0.003885,0.005378,0.002615,-0.00125,-0.001911,0.002677,0.003406,0.000353,0.004117,0.003241,0.001112,0.00658,0.00436,0.000528,-0.000604,0.002431,0.00179,0.004378,0.003051,0.003394,0.0075,0.007142,0.003898,0.005021,0.000993,0.004334,0.003645,0.00077,0.001259,0.001965,0.000526,0.004752,0.005231,0.004915,0.004015,0.007682,0.007667,0.003925,0.000905,0.0028,-0.000824,0.001149,-0.001573,0.002768,0.004439,-0.001182,0.003861,-0.002598,-0.001013,-0.003083,-0.000491,-0.002636,-0.001954,0.002267,0.003212,0.003016,-0.001596,5e-06,0.004861,0.00149,0.00207,0.000711,0.001644,0.004844,0.002201,-0.000267,0.001215,0.004872,0.006163,0.000346,0.001833,0.000134,-0.001044,-8.6e-05,0.002685,0.000807,-0.000689,0.000893,0.002014,-1.4e-05,-0.000545,0.001852,0.000468,0.001722,0.000177,6e-04,-0.00131,0.001296,0.003639,0.000307,0.000232,0.006456,0.005074,0.005205,0.00199,0.000256,8.1e-05,0.001167,0.002178,0.000185,0.000634,0.000547,-0.002187,0.000178,0.001908,0.003325,-0.000261,-0.000442,0.001968,0.002353,0.006132
0.001057,0.000126,-0.000909,-0.003928,-0.000664,0.001181,0.002436,-0.000799,-0.001748,-0.006007,-0.004759,-0.000909,-0.003318,-0.001177,0.003049,0.000121,-0.00067,0.001859,-0.000653,-0.000651,0.001893,-0.001402,-0.004451,-0.004804,0.000379,-0.001011,-0.000986,-0.003652,-0.001661,-0.003673,-0.005671,-0.003806,-0.002598,-0.003714,0.000171,-0.002611,-0.003937,-0.001675,0.000768,0.000733,0.002092,-0.001716,-0.002406,-0.000421,-0.001578,-0.005298,-0.004566,-0.000571,0.001233,-0.001609,-0.001276,-0.000479,0.000698,-0.002776,-0.003366,-0.000973,-0.002424,-0.002411,-0.002629,0.001338,8.4e-05,0.001471,0.000152,-0.001582,0.001175,-0.001808,-0.000904,-0.001147,-0.003889,-0.002959,-0.001245,0.000417,0.000346,-0.003886,-0.002524,0.002402,0.002845,-0.004025,-0.003313,-0.000833,-0.002361,-0.001609,-0.001217,-0.001027,-0.002642,-0.000686,7.3e-05,7.5e-05,0.000331,-0.000312,0.000682,-0.000418,-0.001148,0.000478,0.00132,-0.000527,0.001492,0.002507,-0.002885,-0.001291,0.001067,-0.002273,-0.002308,-0.003246,-0.003309,-0.000829,-0.000676,-0.001963,0.000381,-0.000337,0.000207,-0.002612,0.000158,-0.002358,-0.000835,0.000237,-0.001787,-0.000677,-0.000468,-0.000728,-0.004629
0.00034,3.4e-05,-0.001279,0.003262,-0.000242,0.00104,-0.002225,0.000874,0.001118,0.00695,0.004912,-9.1e-05,0.000835,0.001655,-0.002275,-0.00022,-0.000708,-0.001302,0.001365,-0.000324,-0.000812,-0.002237,0.004151,0.005899,0.000859,0.000407,0.001861,0.002652,0.00118,0.001279,0.004021,0.003572,0.003683,0.003263,0.000479,0.001813,0.005853,0.00396,-0.000109,-0.00121,-0.002177,0.001439,0.002162,0.001346,0.000805,0.003399,0.002469,-0.000723,-0.000263,0.000165,3.5e-05,0.001581,0.002011,0.000582,0.001326,0.002837,0.003569,0.002806,0.006113,0.002424,0.000871,-0.000235,0.001021,0.000414,-0.002258,0.000856,0.002648,0.001829,0.001141,0.003214,-3.3e-05,-0.001831,0.001177,0.003597,0.002932,-0.00138,-0.001331,0.003538,0.002571,0.001608,0.001967,0.001546,0.002365,0.002502,0.002802,0.000976,0.001495,-0.000472,-0.001173,0.000768,0.002774,0.002021,4e-05,-0.001026,-0.001505,0.000881,1.2e-05,-0.002506,0.001265,0.001934,0.001473,-0.000594,0.001151,0.000755,0.003971,0.00119,0.001736,0.001039,-0.000849,0.0015,-5.1e-05,0.002974,0.000527,0.002258,7.7e-05,-0.001279,0.002207,0.002438,0.00189,0.00021,0.002383
-0.00135,0.000284,0.002263,-0.000914,0.001285,-0.000884,-0.00157,-0.00267,-0.002251,-0.005126,-0.004679,0.000249,0.000303,-0.000916,0.000691,-0.000312,0.000483,0.00056,-0.002255,0.000486,-0.00131,0.001106,-0.003016,-0.003541,-0.000792,-0.001028,-0.002505,-0.00185,-0.001358,-0.000305,-0.001901,-0.004245,-0.005924,-0.004431,-0.002243,-0.001205,-0.003373,-0.003488,-0.001764,0.001524,0.000164,-0.001635,-0.002176,-0.003703,0.000428,-0.001543,-0.00329,0.001489,0.000958,-0.000863,0.000793,-0.001388,-0.002316,-0.000997,-0.000346,-0.001026,-0.002997,-0.001068,-0.003581,-0.002674,-0.000918,-0.000492,-3e-05,-0.00108,0.001551,-0.000873,-0.001394,-0.00144,-0.001691,-0.002081,0.000149,0.001581,-0.001643,-0.002731,-0.002404,-0.000151,-0.00078,-0.00052,-0.001388,-0.002099,-0.000282,-0.001026,-0.001464,-0.001381,-0.001188,-0.001461,0.000147,7e-04,0.001604,-1.4e-05,-0.003438,-0.003377,0.001044,-0.001142,3.5e-05,-0.001154,0.000342,0.000353,-0.000995,-5.4e-05,-0.000563,0.001182,-0.001193,0.000908,-0.00261,0.000332,-0.00068,3.7e-05,0.000571,-0.000465,0.000389,-0.002192,-0.001925,-0.001725,0.000248,-5e-06,-0.001001,-0.001315,-0.003197,-3.6e-05,3.7e-05
0.002504,-2.2e-05,-0.000484,0.000214,-0.000747,0.000186,0.003129,0.00384,0.00217,0.0014,0.00337,-4.2e-05,0.001527,0.000617,0.000249,-0.000139,0.000641,0.000375,0.001252,0.002362,0.002433,0.000381,0.002483,0.001264,-0.001415,-0.000121,0.002451,0.00083,0.000571,6e-06,0.000302,0.002556,0.005622,0.003582,0.002471,6e-04,0.000844,0.003097,0.002118,-0.000643,0.001131,0.00139,0.002274,0.003675,-0.001741,0.000599,0.00279,-0.00146,-0.002258,0.001217,-0.00022,0.000344,0.001857,0.003961,0.001391,-0.00087,0.000977,-0.000808,-0.000683,0.000479,0.000424,-0.000496,0.000799,0.001049,-0.000542,-1e-06,0.00054,0.000545,0.001504,0.000611,0.000226,-0.000534,5e-05,0.001301,0.001219,0.001214,0.002375,-2.9e-05,0.000762,0.001902,0.000686,0.001134,0.000744,0.000356,-0.000153,0.002158,-0.001899,-0.000606,-0.001451,-0.000606,0.002542,0.002204,-0.00179,0.001822,0.001548,0.000625,0.000137,1.8e-05,0.001825,-0.000198,-0.000387,-0.000409,0.00053,-0.001005,0.001623,-0.001404,-0.001455,0.000265,0.000164,0.000888,0.000561,0.000913,0.0021,6.5e-05,-0.000584,0.000783,0.002005,-0.00019,0.003091,0.000723,0.000878
-0.001703,-0.000148,-0.002353,0.000441,0.001923,0.000677,-0.000312,-0.002831,-0.001465,-0.000365,-0.000745,-0.001094,-0.001198,0.000749,0.000652,0.001304,-0.001559,-0.000898,-0.000475,-0.003326,-0.001953,9.6e-05,-0.001521,-0.000704,0.001389,0.002489,-0.000325,0.000317,3e-04,0.000978,0.000166,-0.001911,-0.002701,-0.001425,-0.000767,-7.2e-05,-0.000391,-0.002233,-0.000318,0.000272,-0.00128,-0.00053,-0.00154,-0.002243,0.001507,-0.000285,-9.7e-05,0.001969,0.0018,-0.00049,-0.000343,0.00056,-0.000264,-0.001703,-0.001409,0.000577,0.000264,0.0023,0.002007,0.000547,0.00028,0.00158,-0.000298,0.000212,-0.001607,0.001462,-0.00016,0.000963,-0.000257,0.00026,0.001165,0.000552,0.002201,0.000935,-0.000216,-0.000343,-0.001706,-0.001743,-0.000487,-0.001807,-0.00071,-0.002726,-0.000175,-0.000875,7.5e-05,-0.001326,0.000821,0.000462,0.000474,0.000307,-0.001335,-3.7e-05,0.002635,1e-04,-0.000243,0.001413,0.001194,0.001865,-0.00098,-0.00061,-0.000399,-0.000184,0.00014,0.000523,-0.001282,0.001878,0.002278,0.000358,-0.000585,-0.001407,-0.000257,0.000524,-0.00043,-4.2e-05,0.000275,-0.000357,-0.001868,0.001138,-0.000866,-0.001484,-0.000893
-7.4e-05,-0.000747,0.002415,-0.000754,-0.001641,-0.001245,-0.00038,0.000193,0.000959,0.000695,-0.001361,0.001491,0.000859,-0.00044,-0.001524,-0.001524,0.001114,0.000584,-0.000173,0.002064,0.00188,-0.000702,8.2e-05,0.001429,0.000168,-0.002197,-0.000766,0.00012,-0.000529,-0.000927,0.000694,0.002628,0.001018,0.000413,4.3e-05,-0.000301,0.000599,0.000531,-0.000553,-0.000572,0.000641,-0.000347,0.000296,0.001471,-0.000779,0.000332,-0.000485,-0.002027,-0.001283,0.00101,-6e-05,-0.000314,-0.000349,-0.001194,-0.000318,-0.000829,-0.000555,-0.002259,-6.8e-05,0.00045,-0.00034,-0.000618,-0.000229,-0.001199,0.001791,-0.000603,-0.000502,-0.000374,0.00028,-0.000503,-0.001428,4.8e-05,-0.002281,-0.00064,-0.000101,-0.000218,0.000372,0.002163,0.000637,0.000763,0.000401,0.002966,0.000481,0.000505,0.000586,-0.000212,-0.000345,0.000533,-0.000642,0.000314,0.000744,-0.00051,-0.002232,-0.000492,-0.000874,-0.000861,-0.001504,-0.002243,-0.001024,0.000554,0.00062,5.6e-05,-0.000406,-0.000628,0.000464,-0.001132,-0.001632,-0.000539,0.00019,0.000676,-0.000597,-0.000187,0.000301,0.001324,-0.000525,0.000143,0.000575,-0.000972,-0.001391,0.000615,0.000523
0.00114,0.002246,0.000544,0.000216,-4.9e-05,0.000593,-0.000463,0.00161,-0.000801,-0.000561,0.000931,-0.002025,-0.000172,0.000973,0.002022,0.00092,1.9e-05,-0.000295,0.000455,3.9e-05,-0.000799,0.001036,0.001445,-0.000458,0.000266,0.000221,-0.000191,-0.001111,0.000386,0.001348,-0.00023,-0.001923,-0.000693,-0.000229,0.000509,0.000134,-0.000497,-0.001089,-0.000492,0.000571,0.000397,0.00085,-0.000802,-0.000911,0.000555,5.6e-05,0.00029,0.001078,0.000553,-0.000308,0.000205,0.000861,-0.000686,0.000548,-0.000143,0.001412,0.000403,0.001493,-0.000398,-0.00108,-0.000318,1.5e-05,3.1e-05,0.000979,-0.000528,-0.000569,0.000543,-0.000863,-0.000227,-0.000194,0.000406,-0.000528,0.001155,-0.000324,0.00066,8.2e-05,-0.000148,-0.001038,-0.001578,-0.000727,-0.000519,-0.000542,-0.000292,0.000432,-0.000489,-6.5e-05,0.000302,-0.000433,0.00026,-0.000567,-8.6e-05,-0.000187,0.000985,-0.000472,0.001007,-7.9e-05,0.000628,0.000322,0.001718,0.000361,0.000796,0.000668,2.9e-05,-4e-06,0.000284,0.000392,0.000213,0.000288,0.000428,1.7e-05,0.000504,-0.000403,-0.001016,-0.000799,0.001212,-4.7e-05,-6.6e-05,7.5e-05,0.000673,0.000411,-0.000802
-0.000655,-0.001331,-0.001458,0.000792,6e-05,-0.000112,0.000433,-0.001201,0.000911,0.000769,0.000488,0.001745,6e-06,-8e-04,-0.000819,-4e-06,0.000132,-2.6e-05,-0.000702,-0.000331,-0.000432,-0.000672,-0.001181,-0.000257,-0.000939,0.000855,0.000224,0.001341,1.2e-05,-0.001585,-0.000212,0.00112,0.000996,0.000229,-0.000265,0.000164,0.000667,0.001259,0.000936,-0.000577,-0.00019,-1e-06,0.000922,0.000746,-0.000691,-0.001462,-0.000185,-0.001248,6.8e-05,-0.000337,0.000139,-0.000103,0.000245,0.001221,0.000677,-0.000486,-0.000648,-0.000997,-0.000603,0.000618,0.000664,-7.1e-05,-0.000358,0.000123,0.000405,0.001108,5e-05,0.000385,0.000129,0.000251,0.000984,-0.000157,-0.000522,-0.000233,-0.000533,0.000203,-0.000211,0.000153,0.001346,0.000909,0.000288,-0.000381,-5e-05,-0.000242,0.000106,0.000576,1.9e-05,-0.000135,0.000558,0.000515,-0.000285,0.000587,-0.000369,3.6e-05,-0.000796,0.000192,-0.000251,0.000797,-0.001182,-0.000942,-0.001332,-0.000346,0.000187,0.000572,-0.000121,-0.000288,5.9e-05,-0.000294,4e-05,-0.000234,-0.000742,-7.4e-05,0.000955,0.000472,-0.000652,0.000157,8e-05,-4.5e-05,0.000444,-0.000479,0.00092
-0.000117,-0.000493,0.000144,-0.000857,-0.000254,-1.1e-05,0.00034,-0.000465,-0.000793,-0.000344,-0.000907,-0.000512,-0.000148,-0.000539,-0.000249,-0.000784,-0.000686,0.000552,0.000481,-0.00043,8e-05,0.000199,5e-05,-0.000175,0.000584,-4.5e-05,-0.000589,-0.000982,-0.000195,0.001288,-0.000103,-1.6e-05,-0.000194,-0.000386,-0.000723,-0.000459,-0.000227,-0.000197,-0.000707,0.000693,-9e-05,-0.000476,-0.000216,-0.000616,0.001024,0.001914,0.000148,0.001077,-0.00035,0.000313,-0.000306,-0.000847,0.000289,-0.001556,-1e-06,-0.000454,0.000703,0.00058,0.00051,0.000146,-0.000613,-0.000366,0.000351,2.6e-05,-0.000421,-0.001085,0.000304,0.000681,-0.000383,5.9e-05,-0.000781,0.000279,-0.00077,0.000681,0.000155,-0.001123,0.000179,0.000881,-9e-05,-0.00056,-0.000684,-0.000377,-0.000709,-0.000217,0.000179,4.4e-05,0.000192,-4e-04,-0.000688,-0.000466,0.000636,-8.2e-05,2.7e-05,0.000736,0.000555,-0.000374,0.000114,-0.000312,0.00029,0.000924,0.000835,-0.000177,-8e-06,-0.000648,-0.000209,0.000133,-9.8e-05,-0.000616,-0.000503,-1.2e-05,0.000828,0.000534,-0.000453,-0.000207,0.000413,-0.000302,-5.7e-05,-0.000614,-0.000278,-0.000172,-0.000375
0.00026,0.00083,-7.9e-05,-0.000312,0.000165,0.000264,-0.000788,0.000774,0.000672,8.7e-05,0.000589,0.000825,-0.000233,0.000754,-0.00014,0.000488,0.000751,-0.000226,-0.000169,0.000351,0.000145,-7.8e-05,0.000152,-0.000415,-0.000507,-0.000113,0.000231,-0.000302,3.7e-05,-0.00078,-0.000226,-0.000751,-0.000214,0.000396,0.00063,0.000693,-0.00022,-0.000432,0.000884,-0.000624,-0.000341,0.000247,-0.000188,0.000233,-0.001228,-0.000679,0.000106,-0.000292,0.000525,0.000107,0.000714,0.000498,6e-05,0.000698,-5e-06,0.000296,-0.000324,-0.000356,-0.000374,-0.000289,0.000498,8.5e-05,1.6e-05,-0.000501,0.000225,-2.8e-05,-0.000615,-0.000539,7.7e-05,-0.000358,0.000324,0.000191,0.001153,-0.000648,-0.00033,0.001237,-1.1e-05,-0.000584,-4e-05,6.3e-05,0.000361,0.000404,0.001061,-4.3e-05,-0.000468,-0.000433,-0.000427,0.000876,0.000392,0.000162,-0.000558,0.000256,-3.2e-05,-0.000764,-0.000499,4.8e-05,-0.000475,-2e-06,0.000343,-0.000285,-0.000649,0.000119,-0.000264,0.000838,-7.5e-05,7.1e-05,-7e-06,0.001209,0.000131,-0.000136,-0.00059,-0.000373,-0.000134,-0.000242,-0.000653,0.000199,-6.5e-05,0.000884,-2.9e-05,0.000289,-0.000351
0.000167,-8.3e-05,0.000488,0.000866,9.4e-05,-0.000264,0.000492,8.6e-05,0.000186,-0.000404,-0.000584,-0.000817,-3.9e-05,-0.000425,0.000451,1.7e-05,-0.000134,-5e-05,-0.000142,-0.000136,-1.2e-05,0.00029,0.000141,0.000651,0.000297,-0.000709,0.00042,0.000836,2.8e-05,0.000103,0.000256,0.00046,-0.000346,-0.000524,-0.000185,-0.000153,0.000115,0.000131,-0.000893,0.000472,0.000662,7e-06,0.000387,1.3e-05,0.00078,-0.000266,-1.8e-05,0.000302,-0.000501,3.1e-05,-0.000371,-0.000189,8.3e-05,9.2e-05,-8.3e-05,0.000304,9.1e-05,0.000258,0.000645,0.00029,-0.000337,0.000261,-4.3e-05,0.000226,1.7e-05,0.000264,-2.7e-05,9.1e-05,0.000294,0.000467,-0.000334,-0.000207,-0.000476,0.00041,0.000285,-0.000739,-3.3e-05,-0.00049,-0.000222,-0.000171,-1.1e-05,0.000252,-0.000309,6.6e-05,0.000391,0.000197,0.00027,-0.000231,-7.7e-05,4.1e-05,0.000114,-0.000187,0.00063,0.000677,0.000227,0.000444,4.4e-05,-5.6e-05,-0.000168,-0.00035,9.6e-05,8.7e-05,0.000195,-0.000463,-3e-06,-1e-06,0.000164,-0.000456,-0.000135,0.00041,0.000453,5.3e-05,0.000149,8.7e-05,0.000833,0.000539,0.00025,-0.000151,8.4e-05,-8.7e-05,0.000243
-0.000116,-0.000648,-0.000186,-0.000166,-0.00013,0.000642,-0.000204,-7.8e-05,-0.000711,0.000625,0.000548,0.000353,0.000415,0.000131,-0.000511,-0.00014,-0.000153,-0.000299,2e-04,0.000259,-8e-05,-0.000513,-0.000296,-0.000142,-0.000156,0.000459,-0.000238,-5.6e-05,1.3e-05,2e-05,-0.000121,0.000122,0.00036,0.000411,5.5e-05,-0.000127,-0.000173,0.000182,0.000705,-0.000241,-0.000349,-0.000271,-0.000539,-2.6e-05,-0.000491,0.000343,-0.000244,-0.000406,0.000452,-0.000217,0.000101,0.000289,-0.000457,-0.000329,0.000221,-0.000295,-0.00026,-0.000162,-0.000641,3.9e-05,0.00026,2.8e-05,-7.3e-05,-1.2e-05,-8.2e-05,8.3e-05,0.00028,-0.000267,-0.000121,-0.000112,8.9e-05,-0.000325,4.8e-05,-4.6e-05,8.4e-05,0.000252,6e-06,0.000882,-7.2e-05,0.000351,3.8e-05,-8.5e-05,-0.000167,0.000281,-2.8e-05,0.000162,3.8e-05,6.9e-05,4.1e-05,-0.000225,0.00023,-0.000141,-0.000909,-0.000656,-8.7e-05,-0.00029,0.000314,4.8e-05,-4.1e-05,0.000285,0.00017,3e-05,0.000113,5.7e-05,3.3e-05,-0.000243,-3.3e-05,-0.000267,6.7e-05,6.8e-05,-0.000233,0.00015,-1.6e-05,0.000317,-0.000762,-0.000761,-0.000354,-2.3e-05,0.000214,0.000211,-5.5e-05
-1e-06,0.000439,-0.000285,-0.000288,-7.5e-05,-0.000562,0.000287,-0.000256,0.00046,-0.000216,-0.000206,-0.000484,-0.000272,-0.000192,-0.000165,-9.4e-05,0.000301,0.000176,-0.000178,-0.000541,-5.7e-05,0.000343,1.7e-05,-0.00046,0.000139,4.7e-05,0.000107,-0.000188,0.000173,4.8e-05,9.5e-05,-9.4e-05,-7.1e-05,-0.000253,-0.000164,7.7e-05,0.00012,-0.00023,-0.000338,0.00026,-6.7e-05,0.000116,0.000287,0.000144,0.000349,-5e-05,0.000267,0.000247,-0.000257,5.6e-05,-0.000168,-0.000315,8.6e-05,6.9e-05,-0.000209,0.000171,4.4e-05,8.2e-05,0.000324,-0.000312,-0.000154,-0.00031,-2.9e-05,0.00012,0.000188,-6.1e-05,-0.000435,0.000336,-0.00013,-0.000229,-0.000292,0.000539,0.000225,-0.000364,-0.000166,-0.000101,0.000219,-0.000421,0.000152,-0.000145,8e-05,0.00013,7.4e-05,-0.000197,-0.000162,-0.000215,-5.7e-05,-0.00018,-0.000221,6.8e-05,-0.00047,7.2e-05,0.000442,0.000456,-0.000225,3.6e-05,-0.000167,0.000227,-0.000244,-3.2e-05,-1.5e-05,-0.000267,-0.000256,7.6e-05,0.000104,0.000181,-7.5e-05,0.000308,4e-05,-0.000467,0.000176,-9.9e-05,0.000193,-0.000126,0.000413,0.000207,0.00024,5.2e-05,-0.000289,-0.000279,-0.000127
3.7e-05,2.7e-05,-7.4e-05,0.000172,0.000258,0.000206,-0.000109,0.000179,-0.000148,-0.000127,-3.3e-05,-6.1e-05,1.6e-05,1e-04,0.000209,-3.4e-05,-0.000304,-2.9e-05,7.6e-05,0.000497,-1.7e-05,2e-05,0.000151,0.000603,-0.000201,6.4e-05,-2.6e-05,4.9e-05,-0.000126,-0.000112,6e-06,6.3e-05,-8.4e-05,0.000106,0.000172,-1e-04,4.3e-05,0.000268,8.3e-05,-0.000287,0.00013,0.000156,5.6e-05,-0.000184,-0.00035,-0.000161,9.5e-05,-5.4e-05,-9.2e-05,-1.2e-05,0.00014,4e-06,2.7e-05,-2.5e-05,-6.9e-05,-0.000145,0.000201,-0.000194,-2.6e-05,0.000162,5e-05,7e-05,-7.5e-05,-0.000193,-0.000297,-7.1e-05,0.000421,1.5e-05,6.1e-05,9.4e-05,0.000188,-0.000116,-0.000422,0.000351,0.00011,8.9e-05,-0.000116,-0.000157,-9.2e-05,-0.000108,-0.000175,-0.000206,-6e-05,4.3e-05,-1.1e-05,-0.000113,0.000147,0.000271,7.7e-05,7.3e-05,0.000288,0.000145,3.9e-05,-0.000112,0.000173,1e-04,0.000119,-0.000279,0.000311,2.3e-05,-0.00014,0.000155,0.000131,6.1e-05,-9e-06,6.7e-05,7e-05,-7e-05,0.000169,0.000375,-7.2e-05,-6e-05,-0.000208,-1.6e-05,-0.000209,-3.1e-05,-0.000158,3.2e-05,-0.000104,0.00022,0.000134
-5.4e-05,-0.000184,0.000364,2.5e-05,-6.4e-05,-0.000313,-0.000311,0.00026,-4.2e-05,0.000111,-9.3e-05,0.000703,8.8e-05,-4.5e-05,0.000282,0.000193,0.000132,-7.3e-05,-7e-06,-6.3e-05,0.000222,-5.9e-05,1e-06,-0.00047,0.000225,-0.000296,0.000207,2.3e-05,-6.1e-05,8.2e-05,4.9e-05,-9e-05,6.8e-05,5.1e-05,-4.6e-05,5.5e-05,-5.3e-05,-0.000123,9.6e-05,2e-04,-6e-05,-0.000163,-0.00018,0.000124,0.000291,0.000243,-0.000355,5.6e-05,-7e-05,-1.7e-05,2.7e-05,-9.2e-05,1.9e-05,0.000286,0.000217,-4.1e-05,-0.000198,0.000235,-0.000153,7e-05,-8.4e-05,6e-06,-4.6e-05,0.000136,0.000196,7.9e-05,-0.000163,-7.8e-05,0.000108,-7e-05,-3.5e-05,-2e-05,0.00023,-0.000108,-9e-05,-6.2e-05,-8.7e-05,0.00035,4.1e-05,1.6e-05,5.5e-05,0.000135,0.000152,-0.000103,4.7e-05,0.000124,-0.000276,-0.000304,6.2e-05,-3e-06,-9.5e-05,-0.00018,-0.000106,-0.000169,-6.4e-05,-6e-05,-5.1e-05,6.1e-05,4.7e-05,-6.6e-05,0.000264,2e-05,2.9e-05,-2e-04,0.000111,-0.000109,-3.4e-05,-8.2e-05,-0.000105,-0.000341,3.1e-05,-1.8e-05,0.000101,-1.9e-05,0.00021,0.000167,1.4e-05,-0.000104,0.000139,-6.9e-05,-0.000149
-0.000107,-1.5e-05,-9.9e-05,-0.000139,3.5e-05,0.000321,0.000316,-0.000343,1.9e-05,-0.000122,0.000307,-0.000476,-0.000104,0.000211,-0.000275,-1.4e-05,-0.000185,8.3e-05,-1.4e-05,-0.000285,-0.000149,7.8e-05,-6.4e-05,9.2e-05,-0.000105,0.000262,-9.4e-05,4.7e-05,8.6e-05,-1.8e-05,-1.2e-05,-6.6e-05,2.2e-05,-9.4e-05,9.4e-05,-1e-06,-8e-06,0.000158,-0.000264,-0.000148,-5.8e-05,5.5e-05,0.000191,-0.000102,-0.000282,-0.000196,0.000142,-0.00014,0.000257,7e-06,-9.6e-05,0.000181,6.9e-05,-0.000259,7e-06,9.9e-05,4.7e-05,-0.000123,0.000142,-8.2e-05,0.000192,0.000129,0.000133,7e-06,-0.000184,-1.5e-05,7.8e-05,-2.2e-05,-1.6e-05,4.1e-05,0.000132,1.2e-05,0.000208,-0.000108,0.000102,7.9e-05,0.00016,-0.000178,-9.2e-05,5.4e-05,9e-06,4.8e-05,-3.6e-05,4.5e-05,-1e-06,4.4e-05,0.000181,0.000173,5.9e-05,-2.1e-05,-3.4e-05,7e-05,0.000106,0.000172,-2.6e-05,2.9e-05,4e-06,2.7e-05,-0.000242,9.5e-05,-0.000168,-4.3e-05,-5.1e-05,0.000185,-0.000122,0.000116,-3.7e-05,3.2e-05,-5.3e-05,0.000274,-3.5e-05,5e-06,-8.7e-05,-7.4e-05,-0.00015,-0.000106,7e-06,7.2e-05,3.8e-05,-0.000118,0.000156
6e-05,0.000189,-0.000148,8e-05,-6.4e-05,-0.000216,-9.6e-05,0.000107,-6e-05,2.5e-05,-0.000311,0.000223,-3.4e-05,-0.000254,0.000118,-9.8e-05,0.000162,-4.2e-05,8.6e-05,0.000192,-3.3e-05,-1.8e-05,-0.000146,0.000241,0.000132,-3.6e-05,-9.4e-05,-2.8e-05,6.3e-05,-3.3e-05,-7e-06,9.8e-05,-9.6e-05,0.000112,-0.000169,-6e-06,-1.1e-05,-0.000103,0.000319,6.7e-05,0.00018,6e-05,-5.9e-05,4.4e-05,0.000247,0.000129,8.5e-05,7.3e-05,-0.00014,1.7e-05,6.4e-05,-2.7e-05,-9.5e-05,-5.6e-05,-0.000104,-6.7e-05,-2.5e-05,8e-06,-9.2e-05,-4.3e-05,-0.000195,-0.000147,-5.5e-05,4e-05,7.3e-05,0.000131,1.5e-05,-5.9e-05,-5.9e-05,-1e-06,-0.00016,6.9e-05,-0.00025,0.000167,-5.9e-05,-7.7e-05,-6.1e-05,-0.00016,3.7e-05,-7e-06,-6.2e-05,-8.3e-05,-1.7e-05,9e-06,2.1e-05,-6.4e-05,-2.3e-05,-0.000111,-0.000147,4.5e-05,7.1e-05,4.4e-05,-3.2e-05,-9.7e-05,7.7e-05,3.5e-05,2.1e-05,6.6e-05,0.000156,-2e-06,-3.7e-05,-7e-06,-4.6e-05,1.4e-05,-1.1e-05,-0.000173,3.3e-05,1.8e-05,2e-05,3.4e-05,0,1.2e-05,6.6e-05,9.5e-05,0.000148,-0.000119,-6.8e-05,-0.000102,-7e-05,1.9e-05,1.4e-05
-4e-06,-0.000127,0.000176,8.1e-05,4.5e-05,0.000193,3.5e-05,5.2e-05,7.7e-05,0.000122,0.000131,-1e-04,-6e-06,0.000179,0,0.000116,-5.1e-05,6.2e-05,-5.4e-05,3.1e-05,0.000135,-7.3e-05,0.000182,-0.000238,-0.000107,5.2e-05,-3.7e-05,3e-05,-6.5e-05,4.9e-05,-1.5e-05,-5e-05,0.000122,-0.000118,0.000182,3.4e-05,4e-06,-8e-05,-0.000203,-8.1e-05,-0.000131,-0.000168,-3.8e-05,9e-06,-0.000188,3.4e-05,-6.4e-05,6.3e-05,6.7e-05,-5.6e-05,-4.6e-05,1.5e-05,9.8e-05,0.000211,8e-06,6.6e-05,-6.7e-05,-4.3e-05,2.6e-05,6.6e-05,0.000189,7.5e-05,5.4e-05,-6.3e-05,5.4e-05,-8.4e-05,-2.5e-05,0.000112,5.1e-05,9e-06,9.4e-05,-2.3e-05,0.000128,-9.1e-05,-2.1e-05,8.9e-05,-1e-05,0.000132,7.2e-05,1.9e-05,6.4e-05,1.7e-05,-7.1e-05,8e-06,1.8e-05,-5.3e-05,-7.2e-05,2e-05,0.000128,4e-06,-0.000126,-3e-05,-0.00011,0.000136,-6e-05,-0.000114,2.3e-05,-8.8e-05,-2e-06,-7.3e-05,0.000235,1.5e-05,6.8e-05,-6.2e-05,0.000107,0.000166,-4e-05,2.6e-05,-1.5e-05,-0.000127,-2.7e-05,5.5e-05,-4.1e-05,-5e-06,-0.000137,0.000129,0.000126,1.6e-05,-4e-05,8e-05,-0.00015
1.2e-05,-5.5e-05,-4.4e-05,-9.7e-05,-6.2e-05,-0.000129,-3.4e-05,-1e-04,3.6e-05,6e-06,5e-05,5e-05,9.2e-05,-1.4e-05,-1.2e-05,-5.6e-05,-8.3e-05,-4.1e-05,9e-06,-6.3e-05,-0.000163,3.5e-05,2.1e-05,0.000115,3.8e-05,-8.4e-05,5.4e-05,-6e-05,-1.1e-05,7e-06,1e-06,-4.8e-05,-0.000106,7e-05,-0.000147,-3.8e-05,4e-06,0.000106,0.000139,6.8e-05,5.6e-05,0.000122,7.4e-05,1.3e-05,0.000172,-0.000151,2e-06,0,-3.1e-05,1.1e-05,-2.6e-05,-4.2e-05,-6.3e-05,-5.6e-05,8.2e-05,-5.7e-05,0.000142,6.5e-05,2.1e-05,-2.1e-05,-0.000148,-7.9e-05,-2.4e-05,-3.2e-05,-1.1e-05,-8.9e-05,-2.8e-05,-2.9e-05,3.3e-05,3.7e-05,-3.5e-05,7e-06,-7.9e-05,1.4e-05,9.4e-05,-2.7e-05,3e-06,0.000146,-2.4e-05,-2.6e-05,-4e-05,4.1e-05,3.9e-05,1e-05,-5.6e-05,4.2e-05,9.6e-05,2.2e-05,-5.3e-05,-2.1e-05,0.00011,2.1e-05,0.00016,-8.4e-05,0.000101,9e-05,-6.8e-05,-1.7e-05,1.3e-05,9.4e-05,-0.00031,-1.1e-05,8e-06,6.8e-05,-0.000134,-0.000141,-9e-06,-7.6e-05,2e-05,0.000134,5.3e-05,-5.8e-05,-2.6e-05,-3.9e-05,7.5e-05,-4.5e-05,-8.4e-05,1e-05,0.000101,-6e-05,0.000165
-1e-05,0.000122,-8.4e-05,2e-05,3.5e-05,5e-05,-8.6e-05,0.000131,-6.9e-05,-0.000148,-8.4e-05,-8.6e-05,-8.9e-05,-8.9e-05,-6.4e-05,6e-06,3.6e-05,2.6e-05,6e-06,-5.9e-05,8.7e-05,6.5e-05,-0.000134,3.3e-05,-4.8e-05,2.6e-05,2.6e-05,7e-06,9e-06,1.9e-05,1e-05,1.7e-05,1e-06,3.5e-05,8.7e-05,2.2e-05,4.5e-05,-0.000114,-0.000137,-5.6e-05,-6.7e-05,9e-06,-8.9e-05,1.5e-05,-0.000156,8.9e-05,-2.1e-05,-1.7e-05,-5.1e-05,3.6e-05,-1.4e-05,-1.1e-05,1.7e-05,-0.000174,-0.00012,-1.3e-05,-0.000126,-2e-06,-7.8e-05,-3.3e-05,0.000124,3e-05,-3e-06,9e-05,-1.6e-05,0.000179,4.1e-05,-9e-05,-4.4e-05,-2.9e-05,2.9e-05,7e-06,4e-06,6.9e-05,-5.5e-05,-9e-06,0,-0.000255,-7.4e-05,-1.8e-05,3.2e-05,-6.9e-05,2.5e-05,3.3e-05,2.2e-05,1.1e-05,-9e-06,-1e-05,-2.5e-05,3e-06,-5.8e-05,-3.3e-05,-6.2e-05,-3.5e-05,-9e-05,-2.2e-05,7.8e-05,2.1e-05,5e-06,-3.8e-05,0.000216,-1e-06,-1.9e-05,-5.5e-05,0.000113,1e-04,3.5e-05,7.4e-05,1.3e-05,-6.9e-05,-5.1e-05,-6.2e-05,8.7e-05,1.2e-05,-4.8e-05,1.8e-05,8.4e-05,-4e-06,9e-06,1e-06,-1.9e-05
2e-06,-8e-06,7.4e-05,7e-06,-4.6e-05,-1.4e-05,0.000162,-8.9e-05,2e-05,4.3e-05,5.5e-05,-3.2e-05,5.2e-05,6.4e-05,0.000101,4.4e-05,-5.1e-05,-3e-06,-2.4e-05,7e-05,-4e-06,-7e-05,8.1e-05,-7e-05,8.6e-05,8.1e-05,-3.1e-05,7.2e-05,-1.3e-05,-3.6e-05,-6e-06,3.5e-05,0.000107,-7.3e-05,-3.6e-05,-2.1e-05,-2.2e-05,0.000118,3.5e-05,6.6e-05,3.2e-05,-6.3e-05,1e-05,-5.7e-05,0.000176,4.8e-05,1.4e-05,-6.4e-05,7.9e-05,1e-05,1.8e-05,6e-05,1e-06,0.000113,-2e-05,-6e-06,6.8e-05,-3e-05,9.4e-05,7e-05,-0.000112,-1.3e-05,1e-06,-5e-06,-6.5e-05,-9e-05,-5.3e-05,2.3e-05,-2.3e-05,1.2e-05,-8e-06,-1.8e-05,0.000115,-5.4e-05,1.4e-05,-5e-06,-1e-06,0.000127,5.9e-05,5.1e-05,-8e-06,1.1e-05,-7e-06,-7.1e-05,1.9e-05,-3.2e-05,-0.000131,7e-06,0,-1e-06,-2.6e-05,-4.7e-05,-4.7e-05,7.9e-05,5.4e-05,-3.3e-05,-3.1e-05,7.5e-05,-9.1e-05,-2.5e-05,-0.000151,8e-06,-1.4e-05,4e-05,-5.7e-05,-9e-05,-1.8e-05,2.6e-05,2.6e-05,-5.9e-05,1.4e-05,7.6e-05,-7e-05,-6e-06,8.1e-05,3e-06,-8.1e-05,3.7e-05,-0.000101,4.9e-05,-7.7e-05
2.3e-05,-9.3e-05,3.8e-05,-4.6e-05,2.1e-05,-2.1e-05,-8.4e-05,3.5e-05,2.4e-05,4.7e-05,-2.3e-05,9.8e-05,3.1e-05,-4e-05,-7e-06,-5.1e-05,7.5e-05,1.8e-05,3.1e-05,4.6e-05,-2e-06,2.4e-05,1e-06,2.7e-05,-6.1e-05,-1.5e-05,3e-05,-5.9e-05,2.5e-05,3.4e-05,7e-06,-4.8e-05,-0.000132,3.9e-05,3e-05,1.2e-05,2e-06,-3.7e-05,2.7e-05,-4.7e-05,4.6e-05,4e-05,6e-05,1.7e-05,-0.000171,-9.9e-05,3.3e-05,6.3e-05,-5.6e-05,-3.9e-05,-8e-06,-7e-06,-3.3e-05,8.2e-05,0.000103,8.9e-05,-3.3e-05,-9e-06,-4.8e-05,-4.2e-05,9.5e-05,3.2e-05,-4e-06,-4.3e-05,0.000118,-0.000124,0.000107,6.4e-05,3.3e-05,-5.3e-05,-2.3e-05,1.5e-05,-7.9e-05,-1.5e-05,-4.4e-05,5e-05,-6e-06,0.00012,6.1e-05,-5.5e-05,2.5e-05,4e-05,1.4e-05,1e-05,-8e-06,-1.3e-05,0.000155,-3.9e-05,4.6e-05,-9e-06,8.3e-05,4.4e-05,9.8e-05,-6e-05,1.4e-05,4.1e-05,-5e-06,-7.4e-05,8.6e-05,2.6e-05,0.000135,4e-06,1.5e-05,-4.5e-05,-7e-06,7.5e-05,-3e-06,-0.000116,-3.1e-05,0.00011,-7e-06,-1.5e-05,4.2e-05,-2.5e-05,-9.2e-05,-1.4e-05,3.4e-05,6e-06,2.2e-05,3e-06,4.7e-05
-2.5e-05,4.7e-05,-5.9e-05,7.2e-05,3e-06,-3e-06,6e-06,2.5e-05,-8.5e-05,-1.3e-05,0,-0.000115,-4.2e-05,1.3e-05,-1.9e-05,2.1e-05,-3.6e-05,1e-05,-1.3e-05,-0.000114,-3.5e-05,-1.2e-05,-7e-06,5e-06,4.2e-05,-8.8e-05,-4.6e-05,1.3e-05,-1.4e-05,-3.3e-05,-7e-06,4.9e-05,9.5e-05,-2e-05,-4.4e-05,-1.5e-05,-4e-06,1.4e-05,-2.2e-05,3e-05,-6.9e-05,-5.5e-05,-5.3e-05,-7e-06,0.000149,4.6e-05,-2.9e-05,-3.9e-05,6.9e-05,-3e-06,4e-06,3e-06,6e-05,-9.5e-05,8e-06,-9.3e-05,-3e-05,2.5e-05,1.6e-05,-1.4e-05,-8.1e-05,-4e-05,1.5e-05,2e-06,-8.2e-05,0.000155,-0.000114,5e-06,2.2e-05,2e-05,9.2e-05,-1e-06,-3.3e-05,3.6e-05,5.3e-05,-0.000112,1e-05,-0.000223,-3.9e-05,5.1e-05,-9e-06,-1e-06,-4.5e-05,-1.1e-05,1.1e-05,3.4e-05,-1e-04,4.9e-05,-3.2e-05,9e-06,-8.3e-05,1.6e-05,-0.000124,6.3e-05,-2.8e-05,-2.1e-05,3e-06,-1.8e-05,-1.6e-05,-7e-06,-9e-05,4e-06,-1.9e-05,2.2e-05,4.2e-05,-7.4e-05,1.6e-05,8e-05,-1.6e-05,-0.000113,3.7e-05,-2e-06,-4.2e-05,4e-05,8.5e-05,-1.3e-05,8e-06,5e-06,6.3e-05,-5.8e-05,-9e-06
0,4.8e-05,4e-06,1e-05,6e-06,5.3e-05,1.6e-05,-8.5e-05,6e-05,-8e-06,-1e-06,0.000298,5.3e-05,-2.7e-05,-8.5e-05,-1.4e-05,3.4e-05,-2.8e-05,2e-06,2.7e-05,4.9e-05,2.2e-05,-2.6e-05,-4.3e-05,-6.4e-05,3.4e-05,6.6e-05,5.3e-05,-1.2e-05,2.3e-05,0,-9e-06,-2.4e-05,6e-06,1.2e-05,1.3e-05,-1e-05,9e-06,3.2e-05,-2.5e-05,4.8e-05,4.9e-05,2.4e-05,2.2e-05,-0.000131,3.6e-05,-1e-05,4.3e-05,-3.9e-05,5.7e-05,-1.6e-05,-2.1e-05,-5.3e-05,-1.3e-05,-4.9e-05,7.5e-05,7.8e-05,2e-06,-1.2e-05,4.6e-05,6.6e-05,1.2e-05,-1.8e-05,-1e-06,5.9e-05,-3.8e-05,7.4e-05,-6.1e-05,-1.1e-05,2e-06,-0.000108,-6e-06,5.8e-05,-1e-05,1.6e-05,0.00013,-1.5e-05,9.1e-05,-1.5e-05,-4.4e-05,-1e-06,-2.2e-05,7e-06,4e-05,-6e-06,6e-06,4.3e-05,-3.9e-05,1.2e-05,7e-06,5.5e-05,-4.3e-05,0.000123,-9.4e-05,1.6e-05,2e-06,-2e-06,1.3e-05,-3.8e-05,-3e-06,9.2e-05,-9e-06,2.2e-05,1e-05,-5.1e-05,6.4e-05,-1.3e-05,4.1e-05,-2e-06,8.8e-05,-7e-06,1.2e-05,3.5e-05,-6e-06,-8.5e-05,3e-06,-3.4e-05,-1.1e-05,-7e-06,-2e-06,-9e-06
2e-06,-5.8e-05,5e-06,-6.7e-05,-6e-06,-8.2e-05,-2.4e-05,8.4e-05,-1e-06,2e-05,3.2e-05,-0.000262,-3.2e-05,1.4e-05,6.3e-05,1.2e-05,-4.7e-05,-5e-06,7e-06,7.9e-05,-2.6e-05,-1.8e-05,-1e-05,-8e-06,4.1e-05,4.2e-05,-3.5e-05,-6.6e-05,2.9e-05,-1.7e-05,-1e-06,-4.1e-05,-3.1e-05,3.8e-05,-2e-06,-5e-06,1e-05,-6.8e-05,-5.3e-05,2.3e-05,-2.6e-05,2e-06,-5e-06,7e-06,0.000118,-4e-05,1e-05,-7.2e-05,-2.4e-05,-4e-05,3.3e-05,-1.2e-05,4.4e-05,3e-05,3.1e-05,-8.2e-05,-8.3e-05,-2.1e-05,7e-06,-2.4e-05,-5.4e-05,-4.4e-05,2.5e-05,4.6e-05,-1.1e-05,-8.2e-05,-7.7e-05,6e-06,-1.8e-05,-6e-06,6.1e-05,-1.4e-05,-4.6e-05,-1.6e-05,-4.6e-05,-0.000109,1e-05,8.5e-05,-2.9e-05,3.2e-05,-6e-06,-4.3e-05,3.8e-05,0,-1.2e-05,-1.6e-05,3.6e-05,4.4e-05,-8e-06,-1.2e-05,-1.1e-05,3.3e-05,-6.7e-05,7e-05,-1.4e-05,2.7e-05,-1e-05,4.7e-05,3.9e-05,-7e-06,-9.6e-05,-3e-06,-5e-06,-4e-06,3.6e-05,-3.8e-05,9e-06,-0.000109,1.3e-05,-2.1e-05,-1.7e-05,-2.4e-05,-1.3e-05,-2.1e-05,7.1e-05,6.2e-05,4.6e-05,1.9e-05,-5.3e-05,4.6e-05,9e-06
-1.1e-05,-1.6e-05,-1.6e-05,2.3e-05,7e-06,8e-05,5.1e-05,-4.1e-05,-1.3e-05,-4.4e-05,-9.3e-05,5.8e-05,6e-06,-4.1e-05,1.9e-05,2.3e-05,2.5e-05,-8e-06,-1.5e-05,-7.6e-05,-7e-06,8e-06,7.8e-05,2e-05,-1.6e-05,-4e-05,9e-06,-3.1e-05,-2.1e-05,1.7e-05,9e-06,4.3e-05,4.6e-05,-7.7e-05,3.4e-05,5e-06,8e-06,3.9e-05,6.4e-05,-2.1e-05,0,-2.6e-05,-1.5e-05,-2e-06,-0.000118,-1.4e-05,1.2e-05,7.5e-05,1.7e-05,5e-06,-2.7e-05,6e-06,-1.8e-05,5.3e-05,-1e-06,6e-05,4.9e-05,5e-06,0,-2.2e-05,4.3e-05,5.6e-05,-3e-06,-4.8e-05,-3.8e-05,8.5e-05,4.1e-05,2.2e-05,-1e-06,3.2e-05,-6.2e-05,6e-06,4.6e-05,2e-05,2.5e-05,2.7e-05,6e-06,-0.000102,2.8e-05,-1.9e-05,-1.5e-05,6.9e-05,-2.2e-05,-2.8e-05,1.4e-05,-3e-06,-7.4e-05,-4.5e-05,1.8e-05,4e-06,-4.3e-05,5e-06,-9e-06,-2e-06,6e-06,-1.6e-05,1.2e-05,-2.2e-05,-2.8e-05,2e-05,4.2e-05,2e-05,7e-06,-2.4e-05,-7e-06,2.1e-05,0,5.6e-05,1.6e-05,-3.2e-05,-4e-06,1.2e-05,-2.4e-05,1.6e-05,-8.6e-05,-4e-05,-5.1e-05,-3e-05,1.1e-05,-1.5e-05,-2.1e-05
9e-06,5.7e-05,5.7e-05,2.2e-05,1e-06,-5.8e-05,-7.1e-05,-9e-06,4.7e-05,-5e-06,0.000151,-2.2e-05,9e-06,9.9e-05,-5.1e-05,-3.9e-05,6e-06,1.1e-05,9e-06,1.4e-05,3.7e-05,-8e-06,-2.7e-05,1.7e-05,4.7e-05,-7e-06,-2.1e-05,7.8e-05,-8e-06,-3e-05,1e-06,-2.6e-05,-2.5e-05,6e-05,-3.4e-05,2e-06,-3e-06,9e-06,-6.3e-05,1.5e-05,1.1e-05,1.5e-05,3.8e-05,-1.1e-05,0.000111,5.1e-05,5e-06,-3.7e-05,1.4e-05,1.1e-05,1.1e-05,1.3e-05,-1.6e-05,-7.6e-05,-3e-05,-5.3e-05,-1.9e-05,0,-1.5e-05,3e-05,-2.9e-05,-2.6e-05,-3e-06,-1e-06,9e-06,-2.1e-05,-1.1e-05,1.8e-05,1.4e-05,-1.5e-05,7e-05,1.4e-05,1e-06,-1.8e-05,-1.4e-05,1e-05,-1e-05,-2e-06,1.4e-05,1e-05,1e-05,-4.4e-05,1.8e-05,-1e-06,-1e-06,1.9e-05,4.6e-05,3.7e-05,-2.7e-05,8e-06,7.5e-05,-1.3e-05,2.8e-05,-3e-05,-6e-06,-1.5e-05,-1.4e-05,-3.3e-05,3.5e-05,-9e-06,-1e-05,-1.3e-05,-1.5e-05,3.3e-05,3e-06,-2e-05,-1e-05,3.3e-05,3e-06,5.2e-05,5e-06,-1e-06,3.1e-05,-1.1e-05,7.5e-05,-2.5e-05,6.2e-05,8e-06,4.3e-05,-8e-06,0
-2e-06,-1.9e-05,-3.1e-05,-3e-05,-1e-05,5.4e-05,3.5e-05,5.4e-05,-5.4e-05,6e-05,-0.000134,-4e-06,-2e-05,-0.000107,2.9e-05,7e-06,1.1e-05,-5e-06,-7e-06,-8e-06,-2.8e-05,1.3e-05,-5.3e-05,-3.8e-05,-4.7e-05,-2e-05,-4e-06,-2.2e-05,2.2e-05,2.7e-05,-8e-06,4e-06,-5e-06,-2.3e-05,0,-5e-06,-4e-06,-1.5e-05,4.3e-05,-6e-06,-8e-06,-1.5e-05,-2.1e-05,-1.2e-05,-0.000107,-2.6e-05,-2.4e-05,5.8e-05,-2.1e-05,-2e-06,9e-06,-3e-06,2.5e-05,-2e-06,0,7.6e-05,-1.4e-05,1.9e-05,2.1e-05,-2e-06,1.9e-05,-1.5e-05,-4e-06,5e-06,-1.1e-05,-3e-06,2.2e-05,-1.8e-05,3e-06,1e-05,-6.9e-05,-1.9e-05,-4.3e-05,-7e-06,3e-05,-1.8e-05,7e-06,7.7e-05,-3.6e-05,-1e-05,-2e-06,3e-05,-2.7e-05,3e-06,-7e-06,-6e-06,-1.2e-05,-4e-05,-6e-06,-6e-06,-6.2e-05,2e-06,3e-05,3.4e-05,-2.5e-05,2.5e-05,3e-06,1e-05,-1e-05,-1e-05,6e-06,1e-06,-5e-06,-8e-06,-2.2e-05,1.5e-05,-4e-06,-6e-05,-8e-06,-4.1e-05,2e-06,1.4e-05,-3.3e-05,-1e-06,-4.8e-05,1e-05,-5.2e-05,-1.4e-05,-1.4e-05,1.1e-05,3.6e-05
4e-06,-3.7e-05,-5.2e-05,2.4e-05,3e-06,-4.5e-05,1.6e-05,-7.2e-05,8e-06,-2.3e-05,5.4e-05,3.5e-05,6e-06,6.7e-05,3.5e-05,9e-06,1.1e-05,-4e-06,-1e-06,4.5e-05,1e-05,-1e-05,3.4e-05,5.9e-05,1.8e-05,3e-05,2.6e-05,-2.8e-05,-1.7e-05,-2e-05,4e-06,2.5e-05,2.5e-05,-6e-06,1.7e-05,-1e-06,-2e-06,3.9e-05,-3.1e-05,0,1.4e-05,1.4e-05,-1.1e-05,1.2e-05,9.9e-05,-3.2e-05,1e-06,-7.5e-05,3.1e-05,-1.2e-05,-7e-06,-1e-06,-4.1e-05,7.3e-05,6e-06,-7.6e-05,3.9e-05,-3.5e-05,-1.7e-05,-2.5e-05,-1.4e-05,1.8e-05,-2e-06,2.2e-05,4.3e-05,4.1e-05,-1.6e-05,-1.2e-05,-2e-06,-2.2e-05,6e-05,-9e-06,1.6e-05,2.5e-05,-2.5e-05,4e-06,-1e-06,-4.3e-05,-1.2e-05,7e-06,4e-06,-1.8e-05,-8e-06,1.4e-05,5e-06,-7e-06,-2.5e-05,4.7e-05,3.6e-05,2e-06,2.2e-05,-1.4e-05,-0.000111,-5.5e-05,3.2e-05,-2.2e-05,2e-06,3.5e-05,-2.8e-05,1.7e-05,-4e-06,3e-06,1.5e-05,-3.6e-05,3.1e-05,9e-06,5e-06,2.6e-05,-1.9e-05,1.6e-05,3e-06,-3e-06,2.9e-05,1.5e-05,3.5e-05,3e-05,1.9e-05,0,-2.9e-05,2e-05,-3.7e-05
5e-06,3.8e-05,5.8e-05,1.1e-05,-1.1e-05,7e-06,-2.2e-05,3.8e-05,3e-05,-3e-05,1.4e-05,-4.1e-05,-1.1e-05,-1.4e-05,-3.6e-05,5e-06,-2.5e-05,6e-06,5e-06,-3.7e-05,-1e-05,6e-06,2.3e-05,-1.2e-05,-2.2e-05,1e-05,-1.7e-05,3.6e-05,-4e-06,1.5e-05,0,-1.5e-05,-2.7e-05,3.3e-05,-1.2e-05,-2e-06,-6e-06,-3e-05,2.8e-05,1e-06,-2.3e-05,-5e-06,2.4e-05,0,-9.3e-05,4.4e-05,2.2e-05,4.6e-05,-2.9e-05,1e-06,9e-06,-1.8e-05,4.3e-05,-5.2e-05,7e-06,8e-05,-5.4e-05,2.4e-05,8e-06,2.5e-05,1e-05,-3.2e-05,3e-06,-1.2e-05,-3.5e-05,-4.5e-05,2.7e-05,-4e-06,-5e-06,-1e-06,-4.1e-05,2e-05,1.4e-05,-1.3e-05,-1.1e-05,7e-06,3e-06,-6e-05,3.4e-05,-1e-06,2e-06,-1e-05,3e-05,4e-06,-9e-06,1e-06,5.4e-05,-3.2e-05,-2.1e-05,3e-06,2.1e-05,-6e-06,0.000139,6.7e-05,-2.9e-05,8e-06,-1e-05,-1.1e-05,3.8e-05,-1e-05,2.1e-05,-1e-06,6e-06,3.1e-05,-2.4e-05,-1.9e-05,-4e-06,7e-06,1e-06,-2e-05,-8e-06,-1.6e-05,-1.9e-05,-7e-06,-3.7e-05,-6e-06,-1e-06,7e-06,1.2e-05,-3.1e-05,2e-06
-5e-06,7e-06,1.4e-05,-3.5e-05,9e-06,-1e-05,1.3e-05,2e-05,-3.6e-05,2.3e-05,-1.8e-05,8.4e-05,1.9e-05,6e-06,-2.8e-05,7e-06,2e-05,-3e-06,-6e-06,-2.8e-05,2.2e-05,-5e-06,-2.7e-05,-4.7e-05,3.6e-05,-3.8e-05,1.1e-05,-4.2e-05,2.2e-05,-8e-06,2e-06,-6e-06,1.2e-05,-5.6e-05,1.6e-05,3e-06,4e-06,1.9e-05,1e-06,-1e-06,4e-06,-1e-06,-9e-06,1e-05,9.1e-05,-5e-06,-7e-06,-4.3e-05,-5e-06,2.2e-05,-1.2e-05,3e-06,-2.3e-05,-2.2e-05,1.3e-05,-9e-05,4.2e-05,-1.2e-05,6e-06,5e-06,-5e-06,2.6e-05,1e-06,-1.9e-05,2.8e-05,3e-06,-3.1e-05,3.3e-05,-4e-06,-2e-06,4.3e-05,-7e-06,-1.3e-05,-1.2e-05,3e-05,-3e-06,-6e-06,9.3e-05,2.3e-05,1e-06,0,3.4e-05,-1.2e-05,-1e-05,-2e-06,1.2e-05,-3.6e-05,1.8e-05,2e-06,-2e-06,-4.3e-05,2.7e-05,-9.3e-05,-4e-05,1.4e-05,8e-06,1.4e-05,-2.3e-05,-2e-05,-1e-06,-1.3e-05,0,-8e-06,-5e-06,0,9e-06,-1e-06,-5e-06,1e-05,1e-06,-5e-06,2.1e-05,7e-06,-8e-06,3.2e-05,-2.9e-05,-1.1e-05,3e-06,2.4e-05,-3e-06,3e-05
4e-06,-3.1e-05,-4.9e-05,1e-05,-3e-06,9e-06,-3e-05,-4.7e-05,1.3e-05,8e-06,-1.7e-05,-1e-04,-2.3e-05,-1.1e-05,5.3e-05,-2.8e-05,-2.5e-05,1e-06,3e-06,6.3e-05,-2.5e-05,-1e-06,-5e-06,6.9e-05,-2e-05,6e-06,-2e-05,8e-06,-1.6e-05,6e-06,-2e-06,9e-06,1.3e-05,5e-05,-1.7e-05,0,4e-06,-3.2e-05,-2.5e-05,4e-06,1.6e-05,2e-06,-4e-06,-3e-06,-8.9e-05,-2.2e-05,-1.1e-05,5.4e-05,3.3e-05,-2.4e-05,1.5e-05,1.2e-05,6e-06,4.8e-05,-1.3e-05,8.1e-05,-2.7e-05,2.1e-05,-1e-05,-3e-05,-1e-06,-1.5e-05,2e-06,1.1e-05,-2.6e-05,5.4e-05,2.1e-05,-1e-05,4e-06,-5e-06,-4.3e-05,-5e-06,1.7e-05,1.5e-05,-1.5e-05,-5e-06,2e-06,-1.9e-05,-2e-05,-1e-06,1e-06,-3.4e-05,1.1e-05,0,1.3e-05,-5e-06,-1e-05,-1.3e-05,0,-2e-06,5.3e-05,-9e-06,2.9e-05,-2e-06,-4e-06,-1.5e-05,-4e-06,4e-06,-4e-06,2e-06,-2.4e-05,-2e-06,-1.5e-05,-8e-06,2.2e-05,-1e-06,1e-06,-8e-06,1.2e-05,1.1e-05,1.2e-05,-1.9e-05,6e-06,1e-05,-2.4e-05,1.6e-05,2.9e-05,5e-06,-1.2e-05,2.3e-05,-2.4e-05
-3e-06,8e-06,1.7e-05,1.9e-05,6e-06,8e-06,3.4e-05,3.9e-05,1.4e-05,-2.7e-05,4.4e-05,0.000122,7e-06,1e-05,-1e-05,1.5e-05,3.9e-05,-4e-06,0,-2e-05,2.8e-05,4e-06,2e-05,-4.6e-05,1.7e-05,4e-05,2.2e-05,4.4e-05,-7e-06,-5e-06,0,-5e-06,-2.7e-05,-1.8e-05,1.1e-05,0,-2e-06,-5e-06,2.3e-05,-5e-06,-1.6e-05,-4e-06,4e-06,-5e-06,8.6e-05,2.1e-05,0,-5.1e-05,-3.4e-05,-5e-06,-8e-06,5e-06,1e-05,-1e-06,-1.1e-05,-7.1e-05,0,-3e-05,1.8e-05,2.1e-05,7e-06,0,-3e-06,1.6e-05,2e-06,-4.6e-05,-2.2e-05,-2.3e-05,4e-06,1.8e-05,1.7e-05,0,-1.7e-05,-5e-06,-1e-06,3.1e-05,4e-06,-6.2e-05,-1.9e-05,-5e-06,-4e-06,2.9e-05,-1.4e-05,-7e-06,-9e-06,-6e-06,4e-05,8e-06,6e-06,3e-06,-4e-05,-9e-06,-7e-06,2.1e-05,5e-06,6e-06,4e-06,2.5e-05,9e-06,1e-06,3.7e-05,-3e-06,1.5e-05,-2e-06,-3.3e-05,1.1e-05,0,1e-06,-1e-06,7e-06,4e-06,8e-06,-1.3e-05,-5e-06,1.9e-05,-1e-06,-4.3e-05,4e-06,-1.2e-05,2e-06,1.1e-05
-2e-06,2e-05,2.6e-05,-1.5e-05,-3e-06,-9e-06,-2e-06,-2.3e-05,-3.1e-05,1.9e-05,-5.4e-05,-0.000126,1.5e-05,-9e-06,-2.5e-05,1e-05,-1.8e-05,3e-06,2e-06,-3.6e-05,-1.9e-05,2e-06,1e-05,-2.2e-05,-3.3e-05,-1.8e-05,-9e-06,-3.1e-05,2e-05,6e-06,2e-06,-3e-06,2.2e-05,-1.1e-05,-1.4e-05,2e-06,0,3.5e-05,-3.3e-05,7e-06,8e-06,1.4e-05,-1.4e-05,-2e-06,-8.3e-05,-4e-06,9e-06,3.5e-05,3.1e-05,1.9e-05,-2e-06,-4e-06,-2.8e-05,-3.9e-05,1.6e-05,7.1e-05,2.3e-05,1.7e-05,-1.2e-05,7e-06,-1.2e-05,-5e-06,-1e-06,-7e-06,1.7e-05,-4.2e-05,1.7e-05,5e-06,-1e-06,-8e-06,9e-06,2e-06,-9e-06,0,-1.2e-05,-3.9e-05,-6e-06,6.3e-05,1.3e-05,1e-05,0,-2.1e-05,-1e-05,-2e-06,-5e-06,0,-4.8e-05,-3e-06,-1.2e-05,-2e-06,9e-06,1.6e-05,1.8e-05,-3.2e-05,3e-06,1.1e-05,1e-06,-5e-06,-7e-06,-1e-06,-2.4e-05,0,4e-06,1.2e-05,3.2e-05,-2.1e-05,0,1.9e-05,-6e-06,-2e-06,-4e-06,1.5e-05,1.3e-05,-1e-06,-1.2e-05,0,4.3e-05,0,7e-06,-2.2e-05,-2e-06
2e-06,-1.4e-05,-4e-05,4e-06,6e-06,1.9e-05,-2.1e-05,3e-06,2.8e-05,1.1e-05,3.4e-05,2.4e-05,-2.6e-05,-2e-06,6e-06,-1.5e-05,2e-06,5e-06,6e-06,3.3e-05,-3e-06,-9e-06,-2.3e-05,5.7e-05,2.1e-05,-8e-06,5e-06,-8e-06,-1e-05,-4e-06,0,1.1e-05,-7e-06,2.9e-05,1.7e-05,-2e-06,-3e-06,-2.2e-05,4.2e-05,-9e-06,-3e-06,-1.7e-05,1.1e-05,-1e-06,8.1e-05,-9e-06,1e-06,-3.5e-05,-2.1e-05,-4e-06,7e-06,-9e-06,3.3e-05,1.3e-05,-8e-06,-7.5e-05,-4.1e-05,-7e-06,3e-06,-2.6e-05,1.6e-05,-1e-06,2e-06,-9e-06,-1e-05,6.8e-05,-6e-06,2.2e-05,-3e-06,1.2e-05,-1.7e-05,1e-06,1.7e-05,1.1e-05,1.9e-05,3.8e-05,4e-06,-3e-06,2e-05,-7e-06,-1e-06,1.6e-05,1.6e-05,1.3e-05,1.2e-05,8e-06,3.1e-05,-3e-06,6e-06,1e-06,2.8e-05,-2e-06,-2.9e-05,4.7e-05,-7e-06,-1.3e-05,1e-06,-2.2e-05,1.3e-05,-4e-06,6e-06,-1e-06,-2e-06,-7e-06,-2.4e-05,1.9e-05,3e-06,-2e-05,-9e-06,2e-06,-7e-06,-2.1e-05,-1.9e-05,7e-06,1.8e-05,5e-06,-3.4e-05,-4e-06,8e-06,1.2e-05,-6e-06
-4e-06,-1e-05,1.5e-05,7e-06,-1e-06,-2.1e-05,1.3e-05,2.8e-05,7e-06,-2.4e-05,1.8e-05,1.4e-05,1.7e-05,9e-06,3e-05,1.1e-05,-1.3e-05,3e-06,0,5e-06,1.4e-05,7e-06,-2.1e-05,-4.6e-05,-1e-05,7e-06,-9e-06,1.2e-05,-8e-06,3e-06,0,-5e-06,-9e-06,-4.2e-05,-1.7e-05,1e-06,-2e-06,2.8e-05,-2.3e-05,1e-05,-3e-06,6e-06,6e-06,4e-06,-8e-05,9e-06,-6e-06,4e-05,-4e-06,-1.4e-05,-4e-06,-2e-06,-2.8e-05,2.9e-05,-2e-05,8.2e-05,3.6e-05,1.7e-05,5e-06,2e-05,-2e-05,-8e-06,-6e-06,-4e-06,9e-06,-1.4e-05,4e-06,-7e-06,-1e-06,-1e-05,2.3e-05,1e-06,1e-06,-1.2e-05,2e-06,-1.8e-05,-3e-06,-4e-05,-1.6e-05,6e-06,-1e-06,-1e-05,1e-06,0,-8e-06,-4e-06,6e-06,1e-05,-7e-06,1e-06,-4.8e-05,-6e-06,4.1e-05,-4.5e-05,1.2e-05,4e-06,4e-06,1e-06,-1.4e-05,8e-06,-2e-06,-2e-06,-1.1e-05,-8e-06,1.2e-05,-1.4e-05,-4e-06,-5e-06,-3e-06,-1.5e-05,5e-06,9e-06,1.6e-05,-6e-06,-1.8e-05,-2e-06,2.2e-05,1e-06,-6e-06,1.2e-05,1.6e-05
3e-06,1.3e-05,2e-05,-1.2e-05,3e-06,1.3e-05,-8e-06,-4.8e-05,-2.9e-05,5e-06,-6.9e-05,1.5e-05,-3e-06,-2.9e-05,-3.1e-05,-9e-06,-3e-06,-1e-06,2e-06,-9e-06,-4e-06,3e-06,3.5e-05,6e-06,2.4e-05,4e-06,-2e-06,-9e-06,1.1e-05,-2e-06,0,-5e-06,2.2e-05,4.1e-05,2.1e-05,0,3e-06,-3e-05,6e-06,-1e-05,6e-06,6e-06,-1.9e-05,1e-06,7.9e-05,-2e-06,-1e-06,-3.5e-05,1.5e-05,6e-06,2e-06,6e-06,1.8e-05,-1.4e-05,2.7e-05,-8.6e-05,-3.1e-05,-2.8e-05,-9e-06,5e-06,2.2e-05,1.5e-05,-1e-06,1.9e-05,-1.3e-05,-6e-05,-6e-06,-1.9e-05,3e-06,-5e-06,-3.1e-05,-6e-06,-7e-06,-4e-06,-1.6e-05,-3e-06,2e-06,1.5e-05,-2.5e-05,-9e-06,1e-06,-2e-06,5e-06,6e-06,-4e-06,-2e-06,-2.3e-05,-1.4e-05,1.6e-05,0,4.4e-05,-1e-06,-7e-05,2.1e-05,-3e-06,5e-06,-4e-06,2.1e-05,6e-06,-5e-06,9e-06,1e-06,1e-05,6e-06,-2e-06,1.6e-05,-2e-06,2.8e-05,7e-06,1.2e-05,1e-06,-6e-06,-9e-06,-2e-06,1.8e-05,-1e-05,-9e-06,-7e-06,-6e-06,-1.4e-05,-1.3e-05
0,6e-06,-2.8e-05,2e-06,-2e-06,-1.2e-05,1.1e-05,3.4e-05,2.3e-05,2e-05,8.2e-05,3.3e-05,-6e-06,4.5e-05,-8e-06,-1e-06,1.8e-05,-2e-06,-2e-06,-1.9e-05,0,-6e-06,9e-06,3.4e-05,-2.6e-05,1.5e-05,9e-06,3e-06,-5e-06,2e-06,1e-06,9e-06,-1.9e-05,-1.7e-05,-2.7e-05,0,2e-06,-1e-06,-2e-06,1.1e-05,-5e-06,-7e-06,1.4e-05,2e-06,-7.6e-05,1e-06,0,2.6e-05,-9e-06,1.2e-05,-2e-06,2e-06,-1e-06,-3.2e-05,2.2e-05,8.6e-05,8e-06,1.9e-05,5e-06,-2e-05,-2.4e-05,-2.2e-05,1e-06,-7e-06,4e-06,5.6e-05,-3e-06,1.1e-05,1e-06,-2e-06,4.2e-05,3e-06,5e-06,1.2e-05,3e-06,1.3e-05,0,3.2e-05,4e-06,7e-06,0,1.5e-05,-1e-05,-1.3e-05,1.4e-05,-1e-06,1.4e-05,1.6e-05,-1.3e-05,-1e-06,-2.3e-05,-8e-06,9.1e-05,2e-06,-6e-06,-1.1e-05,-2e-06,-1e-06,7e-06,-1e-06,-1.6e-05,0,-5e-06,7e-06,-6e-06,-2.2e-05,2e-06,-2.5e-05,8e-06,-1.6e-05,-2e-06,2e-06,-2e-06,5e-06,-2e-05,-3e-06,-7e-06,1e-06,5e-06,-1.1e-05,-4e-06
-1e-06,-1.5e-05,7e-06,9e-06,-1e-06,9e-06,-6e-06,2e-06,-1.1e-05,-1.8e-05,-5e-05,-6.7e-05,9e-06,-4.4e-05,1.9e-05,1.1e-05,-1.4e-05,-1e-06,-3e-06,1.9e-05,-1.2e-05,0,-2.9e-05,-2.8e-05,1.1e-05,-2.5e-05,-9e-06,1.3e-05,0,-1e-06,-1e-06,-5e-06,2e-06,-1.6e-05,2.4e-05,-1e-06,2e-06,9e-06,-1.1e-05,-1.1e-05,3e-06,3e-06,1e-06,-1e-06,7.5e-05,-2e-06,6e-06,-3.1e-05,2e-06,-1.2e-05,1e-06,-2e-06,-1.4e-05,3.2e-05,-3e-05,-8e-05,1.1e-05,-1.2e-05,-1e-06,1.4e-05,2.6e-05,1.1e-05,1e-06,-9e-06,-5e-06,0,-2e-06,5e-06,-2e-06,-6e-06,-4.8e-05,5e-06,-8e-06,-2e-06,8e-06,-9e-06,-2e-06,-2.9e-05,2.5e-05,-3e-06,2e-06,-1.6e-05,-1e-05,-6e-06,-7e-06,4e-06,0,-1.9e-05,5e-06,1e-06,-8e-06,8e-06,-6.5e-05,-1.8e-05,1e-05,7e-06,4e-06,-2.1e-05,-1.1e-05,4e-06,3.3e-05,-1e-06,8e-06,-7e-06,1.3e-05,2.2e-05,-2e-06,1e-06,5e-06,1.4e-05,-3e-06,7e-06,9e-06,-2e-06,2e-05,2.2e-05,2.7e-05,-1e-06,1e-06,1.7e-05,1.1e-05
2e-06,1e-06,1.1e-05,-2e-06,-2e-06,-4e-06,-1e-05,-3.3e-05,-1.5e-05,-1.2e-05,9e-06,7.4e-05,-8e-06,2.8e-05,1.1e-05,-5e-06,1.5e-05,-1e-06,0,2.6e-05,1.8e-05,4e-06,1e-06,-1e-06,-1.6e-05,-1e-05,1.2e-05,-3e-06,5e-06,-1e-06,1e-06,-5e-06,1.6e-05,3.6e-05,-1.9e-05,0,-1e-06,-1.4e-05,2.3e-05,1.1e-05,2e-06,-1e-06,-9e-06,-1e-06,-7.6e-05,-3e-06,2e-06,3.3e-05,1.4e-05,-5e-06,3e-06,-1e-06,2.5e-05,2e-05,-1.1e-05,7.6e-05,-3.6e-05,2.1e-05,-3e-06,7e-06,-2.9e-05,-1.5e-05,3e-06,-3e-06,4e-06,-3.1e-05,8e-06,2e-06,0,1.2e-05,4.2e-05,-5e-06,0,-5e-06,6e-06,-1.4e-05,3e-06,-2e-05,2e-06,5e-06,-2e-06,1.1e-05,9e-06,6e-06,-6e-06,-3e-06,-1.9e-05,2.1e-05,1e-06,0,3.4e-05,8e-06,6e-06,3.5e-05,-1.3e-05,4e-06,-8e-06,2e-06,3e-06,-3e-06,-4.9e-05,2e-06,-1.1e-05,-9e-06,-2.1e-05,-1.6e-05,-1e-06,2e-05,-6e-06,-9e-06,2e-06,-9e-06,-1.3e-05,-3e-06,-2.3e-05,0,-3.6e-05,3e-06,-1e-06,4e-06,-2e-06
