-0.000959,-0.002906,-0.003879,-0.006484,-0.010128,-0.008996,-0.008139,-0.007085,-0.007844,-0.007247,-0.007869,-0.007205,-0.007992,-0.006659,-0.005202,-0.004584,-0.004205,-0.003027,-0.003648,-0.003894,-0.003445,-0.003261,-0.003332,-0.002662,-0.00253,-0.002611,-0.00151,-0.00137
-0.000979,-0.002319,-0.003255,-0.006209,-0.008561,-0.007181,-0.006824,-0.004023,-0.004132,-0.00429,-0.004719,-0.003594,-0.004398,-0.004161,-0.002632,-0.001666,-0.000666,-0.000658,-0.002075,-0.001887,-0.002201,-0.003207,-0.003073,-0.001808,-0.001361,-0.001575,-0.001051,-0.001399
-1.9e-05,0.000662,0.00053,0.001282,0.003459,0.002074,0.000196,0.001681,0.002442,0.001989,0.001261,0.001046,0.000108,-0.000294,0.000622,0.000675,0.000805,0.000265,2e-04,0.000867,0.000855,-0.000262,-2.3e-05,0.000222,0.000793,0.000888,0.000294,-5.7e-05
0.000673,0.00198,0.002595,0.005479,0.009174,0.006679,0.004401,0.003699,0.004533,0.003878,0.004414,0.00295,0.002099,0.002106,0.002016,0.001014,0.000178,0.000113,0.001393,0.00139,0.001675,0.002203,0.002391,0.001597,0.001339,0.001413,0.000921,0.000944
0.000496,0.00088,0.001731,0.002289,0.001864,0.002362,0.003993,0.002072,0.001832,0.001531,0.003534,0.00315,0.004095,0.004152,0.00243,0.001674,0.0014,0.00134,0.001913,0.00111,0.00081,0.002269,0.001918,0.00145,0.000499,0.000305,0.000439,0.000809
-8.1e-05,-0.000989,-0.001226,-0.003109,-0.007404,-0.004518,-0.000571,-0.002331,-0.003757,-0.002393,-0.002432,-0.001277,0.000744,0.000806,-0.000683,-0.000255,0.000157,3e-04,-2e-05,-0.00028,-0.00051,4.1e-05,-0.000706,-0.000615,-0.000741,-0.000697,-0.000487,-0.000122
-0.000452,-0.001438,-0.002388,-0.003567,-0.005358,-0.003881,-0.003577,-0.003411,-0.004075,-0.002896,-0.00503,-0.004106,-0.003387,-0.003457,-0.003079,-0.00198,-0.001877,-0.00139,-0.001882,-0.001634,-0.001281,-0.001706,-0.001654,-0.001792,-0.00104,-0.000707,-0.00054,-0.000578
-2.2e-05,0.000526,0.000533,0.001767,0.005474,0.003648,0.00014,0.00169,0.003012,0.00179,0.000853,0.000732,1.5e-05,-0.00092,-7.6e-05,0.000285,-6.4e-05,2.3e-05,-0.000552,-0.000342,-0.000222,-0.001217,-0.000141,-8.7e-05,0.000338,0.000364,0.000275,-0.000129
0.000195,0.001204,0.001905,0.003464,0.007313,0.004103,0.001587,0.002976,0.004063,0.00281,0.003733,0.002966,0.001178,0.000754,0.001863,0.001183,0.001029,0.000627,0.000739,0.001321,0.000976,-8e-05,0.000388,0.001071,0.000902,0.00053,0.000303,0
-0.000137,-0.000417,-0.000106,-0.000737,-0.002279,-0.002873,-0.001844,-0.00091,-0.001557,-0.001261,0.000165,-0.00097,-0.002412,-0.00076,0.000349,-0.000414,0.000109,-0.000369,0.000349,0.000636,0.000576,0.000654,-0.000181,0.000403,-9.7e-05,-0.000357,-0.000312,-0.000184
-0.000251,-0.001206,-0.001711,-0.003854,-0.008274,-0.005082,-0.002443,-0.003,-0.00382,-0.003109,-0.002034,-0.002375,-0.001583,-2.5e-05,-0.000864,-0.001012,-0.000507,-0.000417,-0.000293,-0.001145,-0.000889,0.000813,6.4e-05,-0.000413,-0.000851,-0.000585,-0.000251,4.9e-05
0.000179,0.000315,-0.000361,-0.000771,-0.002111,0.000656,0.00208,-0.000195,8.1e-05,0.000189,-0.000648,0.000895,0.002851,0.001784,-0.000172,0.000162,-0.000365,0.000232,7.8e-05,-0.000632,-0.000384,0.000669,0.000633,-0.000471,-2.9e-05,0.000494,0.000321,0.00053
0.000419,0.0011,0.0011,0.003351,0.006634,0.005039,0.003865,0.00275,0.003491,0.003394,0.001169,0.002371,0.002931,0.000751,0.000494,0.001318,0.000652,0.000624,0.000386,0.000967,0.000937,-0.000183,0.000418,0.000141,0.000991,0.000963,0.000444,0.000344
-8e-06,2e-06,0.001129,0.002726,0.005735,0.00244,0.00049,0.001372,0.001404,0.001565,0.001249,0.000438,-0.000312,-0.000717,0.000227,0.000733,0.000893,0.000497,4e-06,0.000555,0.000344,-0.001076,-0.000297,0.000398,0.000197,-0.000419,-0.000182,-0.000444
-0.000353,-0.000726,-3.2e-05,-0.001296,-0.002754,-0.003198,-0.002815,-0.001657,-0.002667,-0.002713,-0.001202,-0.002037,-0.002484,-0.001091,-0.000403,-0.001322,-0.000926,-0.000687,-0.00071,-0.000892,-0.001119,-0.000858,-0.000909,-7e-05,-0.0011,-0.001405,-0.000684,-0.000709
-0.000189,-0.000204,-0.001078,-0.003273,-0.006643,-0.004265,-0.002715,-0.001523,-0.002525,-0.002869,-0.002005,-0.002151,-0.002406,-0.000757,-0.000232,-0.001186,-0.000861,-0.000736,5e-06,-0.000212,-0.000427,0.000559,-0.000226,-0.000239,-0.000437,9.4e-05,4.1e-05,9.3e-05
0.000138,0.000307,-0.000981,-0.00099,-0.00108,0.000568,5.2e-05,0.000321,0.001041,0.001117,0.001119,0.000841,0.00032,0.000677,0.000416,0.000856,0.000979,0.000429,0.000817,0.000904,0.001144,0.001211,9e-04,0.000153,0.001014,0.001551,0.00074,0.000674
0.000189,0.000242,0.000282,0.002231,0.005427,0.004085,0.002478,0.000966,0.002653,0.002631,0.002278,0.002882,0.002647,0.001143,0.000121,0.000603,8.4e-05,0.000158,-2e-06,-1.4e-05,0.000572,0.000131,0.000314,-7e-06,0.00059,0.000336,0.000194,0.000313
-5.4e-05,-0.000247,0.000976,0.002076,0.003468,0.001258,0.001666,8.6e-05,0.000505,0.000295,-0.000296,0.00068,0.001341,-0.000408,-0.000549,-0.000476,-0.00092,-0.000273,-0.00079,-0.001085,-0.001036,-0.000951,-0.000797,-0.000277,-0.000592,-0.001226,-0.000646,-0.000421
