0.000141,0.000124,9.6e-05,3.2e-05,3.9e-05,8.6e-05,6.7e-05,4.5e-05,5.1e-05,5.9e-05,5.9e-05,0.000104,0.000278,0.000439,0.000305,0.000312,0.000243,0.000166,0.000144,7.8e-05,0.000288,0.000234,0.000129,7.2e-05,2.6e-05,0.000227,0.000187,0.000161,7.1e-05,0.000231,0.00015,0.000104,0.000105,0.000138,0.000113,0.000157,9.1e-05,5.3e-05,5.1e-05,7.9e-05,8.8e-05,8.6e-05,2.4e-05,5.4e-05,6.6e-05,4e-05,7.7e-05,4.8e-05,0.000135,7.6e-05,8.7e-05,0.000257,0.000164,8.3e-05,0.000241,0.000243,0.000225,0.000305,0.00023,0.000241,0.000143,8.7e-05,4e-05,7.3e-05,-9e-06,5.5e-05,4.2e-05,0.000208,0.000123,7.8e-05,4e-05,0.00011,0.000183,0.000348,0.000358,0.000271,0.000175,0.000204,0.000156,7.2e-05,7.9e-05,0.000209,8.1e-05,6.8e-05,0.000167,0.000165,0.000128,0.000117,7.2e-05,0.000124,0.000264,0.000163,0.000112,5.1e-05,0.000394,0.000361,0.000208,0.000228,8.5e-05,0.000331,0.000163,0.00025,0.000295,0.000162,0.000199,0.000402,0.000193,0.000186,0.000213,0.000125,0.000121,0.000304,0.000242,0.000209,0.000366,0.00052,0.000403,0.000237,0.000151,0.000245,0.000154
6.1e-05,9e-05,8.2e-05,4.5e-05,1e-05,6.1e-05,-0.000115,2e-05,8e-06,3.6e-05,-5.3e-05,-3.7e-05,7.9e-05,0.000298,0.000222,0.000247,5.7e-05,9e-06,2.3e-05,-1.3e-05,0.000127,8.1e-05,4.8e-05,-2.1e-05,-1.8e-05,8.5e-05,7.8e-05,2.8e-05,7e-06,0.000103,4.1e-05,4.5e-05,4.1e-05,9.2e-05,6.6e-05,5.9e-05,3.1e-05,5e-06,-2.3e-05,-4.8e-05,2.2e-05,-1.2e-05,-4e-06,-1.7e-05,4e-06,-2.2e-05,3e-06,3.3e-05,5.3e-05,-6.1e-05,-1.8e-05,0.000106,-2.9e-05,-1.1e-05,-4.2e-05,0.000141,5.8e-05,0.000127,9.1e-05,6.3e-05,1e-05,-1e-06,3.7e-05,2e-05,6.8e-05,3.8e-05,-4.8e-05,-0.000105,-3.4e-05,-4.5e-05,-8e-05,1e-06,4.1e-05,0.000165,0.000172,0.000104,8.1e-05,4e-06,-2.6e-05,2.1e-05,4e-05,3.9e-05,1.3e-05,-4.5e-05,6.2e-05,-1e-05,5.8e-05,5.7e-05,-1e-05,2.9e-05,0.000103,1.2e-05,-1.1e-05,1e-06,8.9e-05,0.000117,2.3e-05,4.8e-05,-6.2e-05,-8.8e-05,-0.000128,3.1e-05,-3.3e-05,-5e-06,-1.3e-05,1.7e-05,4.4e-05,3.2e-05,4.5e-05,-8e-06,2.7e-05,4e-06,4.8e-05,3.1e-05,1.4e-05,-8e-06,1.7e-05,5.8e-05,2.2e-05,4e-06,-8.6e-05
1.8e-05,2e-05,-5.1e-05,-5.2e-05,-1.7e-05,-4.5e-05,-6.3e-05,-3.2e-05,3e-06,-2.6e-05,-5e-05,-4.9e-05,-0.000112,9.3e-05,5.5e-05,0.000154,7.3e-05,1.9e-05,-6.9e-05,1.1e-05,4.9e-05,-2.8e-05,-2e-06,-7e-06,-8e-06,6.5e-05,-7e-06,3.1e-05,-1.9e-05,8.3e-05,6.1e-05,5.3e-05,6e-06,6.3e-05,3.4e-05,-1.6e-05,1e-06,-3e-06,-2.6e-05,-8e-05,1.5e-05,-2.9e-05,-6e-05,-4.9e-05,-5.8e-05,-3.6e-05,-2.5e-05,-3.1e-05,-5.8e-05,-7.1e-05,3e-06,-1.1e-05,-3.3e-05,-2.9e-05,-8.7e-05,6e-05,4.7e-05,4e-05,1.6e-05,4.4e-05,2.7e-05,-5.2e-05,-7.6e-05,-4e-05,-4.4e-05,2e-06,2e-05,-0.000184,-8.2e-05,-6e-05,2e-06,-3.9e-05,-3.4e-05,7e-05,1.1e-05,0.000125,1.3e-05,2.1e-05,1.9e-05,-1.8e-05,-2.5e-05,-0.000121,-5e-05,-4e-05,-4.2e-05,-1e-04,-1.4e-05,1.3e-05,-7.3e-05,-4.3e-05,2e-05,-8.4e-05,-4.7e-05,-6.2e-05,-4.8e-05,-0.000111,-1.1e-05,-7e-05,-1.5e-05,-8.8e-05,-0.000111,8e-06,-5.2e-05,-2.5e-05,-3.6e-05,-5.5e-05,1.9e-05,2.2e-05,-7.7e-05,-3.7e-05,-4.9e-05,-2.1e-05,-7e-06,3e-06,-5.5e-05,2.1e-05,9e-06,3.8e-05,5.6e-05,-5e-05,-6e-05
-6e-06,-9e-06,1e-05,-1.5e-05,2e-05,-1.3e-05,-3.3e-05,8e-06,3.3e-05,-2.9e-05,2.1e-05,-0.000101,-3.9e-05,6.4e-05,-5.5e-05,9.1e-05,6.2e-05,8e-06,1.5e-05,2.9e-05,-4e-05,-1e-05,4.5e-05,4.9e-05,2.1e-05,6e-05,1.9e-05,6.3e-05,5.7e-05,7.1e-05,2.2e-05,3.3e-05,7e-06,3e-05,-6e-06,-1.6e-05,-2e-05,2e-06,-4.5e-05,4e-06,2.4e-05,-2.9e-05,-2e-05,-4.1e-05,-4e-05,-2.7e-05,-4.3e-05,-4e-06,-7.1e-05,-1e-05,3.9e-05,-2.5e-05,2.8e-05,9e-05,2.9e-05,1.9e-05,9e-06,7e-06,8.2e-05,6.2e-05,0,4.2e-05,6.3e-05,-3.4e-05,2.1e-05,2.4e-05,5e-06,-2.6e-05,2.3e-05,-5.2e-05,-1.1e-05,-9.8e-05,-3.5e-05,6.9e-05,-5.1e-05,5.7e-05,-8.9e-05,-2.6e-05,2.6e-05,-2.3e-05,4.3e-05,-6.6e-05,-3.6e-05,-4.5e-05,1.7e-05,-2.4e-05,4e-06,-2.7e-05,9e-06,2.5e-05,8e-05,1.3e-05,7e-05,-4.9e-05,-0.000164,-5.8e-05,2.7e-05,8e-06,4.7e-05,-0.000151,1.3e-05,3.8e-05,-9.8e-05,-2.3e-05,7e-05,-0.00011,-9e-06,4.5e-05,-6e-05,-7.9e-05,-4.7e-05,3e-06,-2.8e-05,3e-05,5.7e-05,-5.6e-05,1e-06,4e-06,3.7e-05,-8.1e-05,6.7e-05
-1e-06,2.1e-05,-4.4e-05,-3.3e-05,-2.8e-05,-2.6e-05,2.3e-05,3e-05,-2.1e-05,2e-06,1.8e-05,-1.8e-05,4.8e-05,1.1e-05,-0.000159,6.1e-05,-1.3e-05,2.4e-05,1.5e-05,4e-06,-1.1e-05,-4e-05,1.6e-05,5.3e-05,-1.9e-05,8e-06,-4.6e-05,5.1e-05,5e-06,2e-05,-6.4e-05,7e-06,9e-06,-1.1e-05,-9e-06,1e-06,-4.5e-05,-1.7e-05,-6e-06,3e-05,4.1e-05,-1.8e-05,2.2e-05,-1e-05,6e-06,-1.6e-05,7e-06,-5.9e-05,-4.5e-05,2e-06,8e-05,-3.3e-05,9e-06,5e-05,3.5e-05,-1.8e-05,1.3e-05,1.8e-05,4.7e-05,9e-06,1e-06,5.7e-05,9.1e-05,2.9e-05,1.1e-05,-5.1e-05,-4.4e-05,-6e-06,4.7e-05,-6e-06,-9e-06,-4.2e-05,-4e-05,4e-06,-9.3e-05,9e-06,-5.2e-05,-1.6e-05,-9.8e-05,-5.2e-05,4.9e-05,-2.5e-05,1e-05,3e-05,3.5e-05,-4.8e-05,3.3e-05,-2.3e-05,-8e-06,0,-1.2e-05,-2.6e-05,5.2e-05,-4.5e-05,-0.00021,-9.8e-05,-1.6e-05,-1e-05,-4.3e-05,-8.9e-05,4.6e-05,-3.1e-05,-6.8e-05,-3.9e-05,8.6e-05,-3.7e-05,-5e-06,2.3e-05,1e-05,-5.1e-05,5.2e-05,-4e-06,-3.5e-05,2.8e-05,3.2e-05,-0.00012,-0.000108,-4.2e-05,2.9e-05,0,3.6e-05
-2.7e-05,-3.8e-05,1e-06,-3.5e-05,9e-06,-1.9e-05,9e-06,5e-05,-1e-05,-4e-05,-1.2e-05,-5e-06,-7.8e-05,-4.9e-05,-0.000137,6e-06,-5.6e-05,-2.7e-05,-2.3e-05,2.7e-05,-2.6e-05,-9.5e-05,-3.5e-05,3e-06,-1.4e-05,-1.2e-05,-9.1e-05,-4e-06,-1.6e-05,-1e-06,-8.9e-05,2e-06,3e-05,-3.3e-05,4e-06,-2.9e-05,-5e-05,-1.1e-05,1.2e-05,4e-06,-2.7e-05,-5e-06,-2.6e-05,1.6e-05,-3.7e-05,-4e-06,-1.2e-05,-4e-05,-1.9e-05,1e-05,-1e-05,-6e-06,-3.1e-05,5e-06,9e-06,-4.8e-05,-2.5e-05,1.2e-05,-8e-06,-5.9e-05,-2.2e-05,1.8e-05,-5.8e-05,-3.2e-05,-4.2e-05,-2.5e-05,-4e-05,-2.5e-05,-2e-06,3.8e-05,-3.8e-05,5e-06,-5.3e-05,-1.6e-05,-0.000144,-6.4e-05,-2.3e-05,-5e-06,-8.7e-05,-4.7e-05,-4.6e-05,1.3e-05,2e-05,-3.6e-05,-3.1e-05,-3e-06,0,-6.4e-05,-3e-06,-2.4e-05,-1.2e-05,-6e-05,3.4e-05,0,-1.3e-05,3e-05,2.7e-05,1.8e-05,6.5e-05,-6e-06,-3.8e-05,-4.1e-05,-1e-05,-1e-06,5.5e-05,2.5e-05,2e-05,-6e-06,8e-06,-6.2e-05,4.7e-05,-1.4e-05,-2.2e-05,-3.6e-05,-4.4e-05,-0.000211,-0.000254,-7.1e-05,-4.7e-05,1.3e-05,-5.7e-05
-1.9e-05,-9.4e-05,-3.5e-05,-4.8e-05,-4e-06,-2.4e-05,7e-06,4e-06,-3.7e-05,-4.8e-05,-3.5e-05,-1.5e-05,-5.1e-05,-0.000141,-0.000156,-3.2e-05,-9.6e-05,-5.1e-05,-1.3e-05,2.6e-05,-1.3e-05,-7.2e-05,-5.5e-05,9e-06,2.3e-05,-1.7e-05,-6.7e-05,2.9e-05,1.3e-05,-2.9e-05,-4e-05,4e-06,1.8e-05,-2.2e-05,-2.3e-05,-3e-05,-1.9e-05,2.4e-05,-2e-06,-2.5e-05,-4.5e-05,-3.4e-05,-3.7e-05,-7e-06,-2.9e-05,-1.4e-05,-1.5e-05,-2.5e-05,-8e-06,1.1e-05,1e-06,-1.3e-05,-7.5e-05,-6.4e-05,-2.6e-05,-7e-05,-3.7e-05,-1.1e-05,-4.4e-05,-6.6e-05,6e-06,6e-06,-3.2e-05,-3.4e-05,-2.5e-05,-1.7e-05,3e-06,-3.9e-05,-9.6e-05,-3.7e-05,-4.9e-05,-1.5e-05,-4.2e-05,-7.7e-05,-9.5e-05,-9.1e-05,-6.4e-05,-2e-05,-3.1e-05,-3.2e-05,4e-06,-1.6e-05,-2.6e-05,1.3e-05,-5.6e-05,-4.4e-05,-2.2e-05,-1e-05,1.3e-05,-3.4e-05,-7.6e-05,-7.7e-05,-2.2e-05,-1.9e-05,-1e-06,-9e-06,-4.2e-05,-7.2e-05,1.1e-05,-4e-05,-1.9e-05,-1.7e-05,-2.3e-05,-2.9e-05,5e-06,-8e-06,-3.9e-05,-3.9e-05,-6.3e-05,1.1e-05,-9e-06,4e-06,-3.1e-05,-6.2e-05,-4.9e-05,-2.3e-05,-0.000113,-6e-05,-6.3e-05,-6.9e-05,-7.9e-05
0,-3.7e-05,-1.6e-05,-4.9e-05,2.4e-05,-5.5e-05,-4e-06,-6e-05,-4e-06,-1.6e-05,-5.2e-05,-2.5e-05,-3.3e-05,-9.8e-05,-6.5e-05,-7.2e-05,-9.3e-05,-2.8e-05,5.3e-05,3.2e-05,2e-05,-2.5e-05,-3.8e-05,8e-06,1.3e-05,2.3e-05,-1.9e-05,3.9e-05,6e-06,-1.9e-05,-3e-05,-3e-05,1.1e-05,-3e-05,-2.2e-05,-2.7e-05,-2e-06,1.3e-05,-1e-06,-1.3e-05,-8e-06,-1.2e-05,-1.1e-05,6e-06,-3.5e-05,-4e-06,-1.6e-05,1e-06,-4e-06,1.3e-05,2e-06,-4.1e-05,-6.2e-05,-2.1e-05,3.1e-05,-7.8e-05,-5.1e-05,-9.3e-05,-3.2e-05,-5.2e-05,6.1e-05,2.1e-05,-1.9e-05,-4.5e-05,0,6e-06,1e-06,7e-06,3e-06,-1.5e-05,1.2e-05,-1.9e-05,-1.8e-05,-7.1e-05,-3.1e-05,-4.1e-05,-4.4e-05,5.7e-05,8e-06,-1.4e-05,-7e-06,-2.1e-05,2e-06,-1.5e-05,-1.4e-05,-1.9e-05,3.3e-05,-1.8e-05,6.1e-05,1.4e-05,-2.4e-05,-1.2e-05,-2.1e-05,2.7e-05,2e-06,8e-06,-4.2e-05,-2.6e-05,1e-06,-4.3e-05,-2.5e-05,3.4e-05,-2.6e-05,-0.00012,-3.3e-05,-4.7e-05,-9.6e-05,-4.5e-05,-6.1e-05,1.3e-05,-2e-06,-3.3e-05,-0.000115,-3.2e-05,-4.5e-05,5.9e-05,2.8e-05,-9.2e-05,-4.9e-05,-6.2e-05,-5.4e-05
5e-06,-1.8e-05,-3.9e-05,-7e-06,7e-06,2e-06,-1.2e-05,-5e-06,-2.5e-05,-7e-06,-1.3e-05,-1.1e-05,1.5e-05,-1.9e-05,-4.4e-05,-7.3e-05,-7.1e-05,-3.1e-05,6.6e-05,1.6e-05,-1.2e-05,1.1e-05,-1.2e-05,2.9e-05,0,1.2e-05,-5e-06,3.9e-05,1.1e-05,4e-06,-2.4e-05,-3.6e-05,-4e-06,-1.8e-05,-2.1e-05,-1.5e-05,-1.1e-05,1e-05,1e-06,-2.4e-05,7e-06,-1.3e-05,2.6e-05,-3e-06,1.2e-05,-3e-06,1e-06,9e-06,1.1e-05,-1.4e-05,2e-06,-2e-06,-5.8e-05,-2.1e-05,3.9e-05,4.8e-05,-1.4e-05,-5.5e-05,-1.1e-05,-1e-05,2.5e-05,2e-06,-5e-06,-2.8e-05,-5e-06,6e-06,-1.1e-05,3.6e-05,-5e-06,-8e-06,2.6e-05,-1e-06,3.1e-05,-3.6e-05,-4.3e-05,-3e-05,-3.8e-05,6.3e-05,2.5e-05,-3e-06,2e-05,-1.2e-05,-7e-06,3.2e-05,2e-05,-2.5e-05,5.8e-05,1.1e-05,-3e-06,3.3e-05,-2.3e-05,6e-06,-9e-06,5.5e-05,3.2e-05,2.3e-05,-6.7e-05,1.2e-05,-2.9e-05,2.3e-05,-3.9e-05,-1e-06,1.8e-05,-7.8e-05,-3.5e-05,-5.4e-05,-1.3e-05,-7.9e-05,-5.8e-05,-2e-06,-2.9e-05,-1.9e-05,-7.7e-05,-2.7e-05,-1.9e-05,-1.7e-05,1.1e-05,-2.5e-05,-4.4e-05,-2.1e-05,-9e-06
-2.5e-05,-1.7e-05,7e-06,2.9e-05,3.7e-05,2.8e-05,3e-06,7e-06,1.3e-05,1.6e-05,-1e-05,-3e-06,2.5e-05,2.9e-05,-5.3e-05,-6e-05,-3.9e-05,-2.2e-05,1.3e-05,-1e-05,-2.1e-05,-6e-06,-2.2e-05,-6e-06,-1.5e-05,-7e-06,-2.1e-05,-2.7e-05,-1.6e-05,-1e-05,-8e-06,-1.5e-05,1e-05,-1e-05,-1.6e-05,-8e-06,-1.2e-05,1.3e-05,-2e-06,-3e-06,7e-06,1.9e-05,3.5e-05,2.4e-05,3.3e-05,1.8e-05,3.6e-05,1.6e-05,2.6e-05,1.3e-05,-9e-06,1e-06,-1.7e-05,-6e-06,3.2e-05,4.5e-05,2.6e-05,-2.1e-05,2e-06,-4.7e-05,-1.6e-05,-5e-06,-4e-06,5e-06,5.3e-05,8e-06,3e-06,1e-06,1.2e-05,4.9e-05,2.1e-05,1.3e-05,6e-06,7e-06,-4.2e-05,-2.6e-05,-1.3e-05,2.8e-05,-1e-06,1.6e-05,3.9e-05,2.8e-05,1e-05,1.4e-05,-1e-06,1.5e-05,3.6e-05,5e-06,-2.2e-05,2e-05,1.9e-05,2.8e-05,-2e-05,3.1e-05,4e-06,-1.5e-05,-5.3e-05,6e-06,-2.6e-05,8e-06,1.5e-05,-4.4e-05,1.2e-05,1.1e-05,-4.5e-05,-3.1e-05,1.1e-05,-2.9e-05,-2.1e-05,-2.4e-05,-3.1e-05,3e-06,1e-05,-4e-06,-3.6e-05,-4.1e-05,1.7e-05,4.6e-05,-2.2e-05,-2.3e-05,1.7e-05
-2.1e-05,-8e-06,6e-06,1e-05,1.1e-05,1e-06,1.8e-05,2.8e-05,9e-06,-1e-06,1.4e-05,8e-06,8e-06,-2e-06,-3.9e-05,-3.7e-05,-3.3e-05,-2e-06,1.7e-05,-4e-06,-2.3e-05,-4e-06,-1.3e-05,-1.3e-05,-3e-06,-1.5e-05,1e-06,-3.3e-05,-1.1e-05,-2.5e-05,-1.8e-05,-1.5e-05,6e-06,1.3e-05,-4e-06,-1.3e-05,-4e-06,-1e-06,-1.3e-05,3e-06,-5e-06,-3e-06,3e-06,-1e-06,-2e-06,-4e-06,1e-05,-1.3e-05,7e-06,1.6e-05,-5e-06,1.6e-05,1.8e-05,-4e-06,-9e-06,-1.1e-05,1.2e-05,-3.8e-05,-5e-06,-2.8e-05,1e-06,5e-06,1e-06,5e-06,0,1e-05,1.2e-05,5e-06,1e-06,3.3e-05,1.4e-05,1.6e-05,9e-06,-5e-06,-2.3e-05,3e-06,6e-06,1.8e-05,-1.4e-05,8e-06,2.7e-05,-4e-06,-2e-06,-2e-05,4e-06,-5e-06,-1.3e-05,-1e-05,4e-06,3e-06,-1e-06,1.2e-05,-3.4e-05,-2.1e-05,-1.4e-05,2e-06,-8.2e-05,-3.6e-05,-3.6e-05,-5e-05,-9e-06,-3.4e-05,-2e-05,2.6e-05,4e-06,0,6e-06,1.2e-05,-1.7e-05,-2.1e-05,-3.2e-05,1e-06,2.8e-05,2e-06,-3.5e-05,-1.2e-05,1.9e-05,2.2e-05,0,-2.3e-05,1e-06
-1e-05,8e-06,-4e-06,1e-05,-8e-06,-4e-06,-1.6e-05,1.2e-05,-1.8e-05,3e-06,1e-06,4e-06,-5e-06,-1.3e-05,1e-05,-4e-06,-3e-05,-6e-06,0,1e-06,-1.3e-05,-5e-06,-2e-06,-2.1e-05,6e-06,2e-06,-1.6e-05,-2.9e-05,-1e-05,-7e-06,-9e-06,-7e-06,-9e-06,-8e-06,4e-06,-4e-06,2e-06,-1e-05,-7e-06,1e-06,-3e-06,-5e-06,9e-06,0,1e-06,0,-4e-06,-3e-06,3e-06,-2e-06,-1.2e-05,-3.1e-05,1e-06,-5e-06,0,-2.9e-05,1e-06,-1.9e-05,-1.2e-05,-1.8e-05,1.1e-05,1.3e-05,-7e-06,-1.1e-05,1e-06,-4e-06,-1e-06,6e-06,3e-06,-3e-06,-2e-05,-2e-06,-8e-06,7e-06,-2e-06,2.3e-05,3e-06,-1.9e-05,-1.2e-05,-6e-06,8e-06,-1.3e-05,-3e-06,-4.8e-05,0,-1.6e-05,-2.6e-05,-2.4e-05,-2e-05,1e-05,-7e-06,-2e-06,-1.9e-05,9e-06,5e-06,-4e-06,-1e-05,-2.3e-05,-1.8e-05,-3.1e-05,-1.5e-05,-1.7e-05,-1.1e-05,2.8e-05,1e-06,-1.2e-05,9e-06,1.3e-05,-2e-06,1.4e-05,-8e-06,-5e-06,1.2e-05,-1.7e-05,-1.5e-05,1.6e-05,1.1e-05,5e-06,-1.8e-05,-2.3e-05,-1.2e-05
-4e-06,1e-06,6e-06,-2e-06,1e-06,-1.4e-05,-8e-06,9e-06,8e-06,-5e-06,-2e-06,0,-5e-06,1.2e-05,1e-05,1.9e-05,-2.9e-05,-2e-06,2e-06,-7e-06,-6e-06,-1.1e-05,4e-06,-4e-06,1e-06,-7e-06,-1e-05,-1.6e-05,0,0,-7e-06,-4e-06,-7e-06,-1.7e-05,4e-06,-2e-06,3e-06,-1.5e-05,0,2e-06,-1e-05,-4e-06,-8e-06,-5e-06,-4e-06,-2e-06,-1e-06,-3e-06,0,1e-06,-3e-06,-1.1e-05,2e-06,-6e-06,8e-06,-9e-06,-7e-06,-9e-06,-1.5e-05,-1.1e-05,2e-06,3.3e-05,2e-06,-4e-06,0,-2e-06,0,-4e-06,5e-06,-1.3e-05,-1.6e-05,-1.1e-05,-4e-06,2e-05,1.1e-05,-6e-06,-3e-06,-2.6e-05,-1.1e-05,-5e-06,-8e-06,0,2e-06,-1.2e-05,-4e-06,6e-06,-2.6e-05,-3e-06,6e-06,-5e-06,-1e-06,-6e-06,-6e-06,1.8e-05,-2e-06,-1e-06,1.4e-05,-2.1e-05,-1.1e-05,3e-06,4e-06,2.9e-05,1e-05,1.3e-05,-2.1e-05,-1e-06,-3e-06,-2.1e-05,2e-06,2.5e-05,2e-05,5e-06,-1e-06,-1.6e-05,-7e-06,1.9e-05,-2e-06,9e-06,-6e-06,-2e-06,-1e-06
1.6e-05,-6e-06,-3e-06,6e-06,-6e-06,-3e-06,-1e-06,5e-06,1e-06,-3e-06,1.8e-05,1e-06,-1e-06,0,0,5e-06,1e-06,-4e-06,8e-06,3e-06,3e-06,-3e-06,-6e-06,-4e-06,-3e-06,-6e-06,-4e-06,-2.4e-05,-3e-06,-2e-06,-8e-06,8e-06,-7e-06,-1.2e-05,3e-06,-3e-06,-1e-06,-1e-05,-3e-06,2e-06,-4e-06,3e-06,-6e-06,-1e-06,-9e-06,2e-06,-4e-06,8e-06,1e-06,-1e-06,5e-06,9e-06,-6e-06,-5e-06,1e-06,-5e-06,-3e-06,5e-06,4e-06,-3e-06,-1e-05,1.6e-05,-5e-06,1e-06,1.2e-05,-2e-06,-3e-06,-1.2e-05,-3e-06,2e-06,2e-06,0,8e-06,3e-06,9e-06,-8e-06,6e-06,-9e-06,-1.1e-05,-2e-06,3e-06,-1.1e-05,-3e-06,-1.3e-05,-2e-06,-1e-05,-1.7e-05,-1.2e-05,-8e-06,-2.1e-05,-2e-06,-2e-06,1e-06,3.3e-05,-2.2e-05,1e-06,4e-06,2e-06,-1.4e-05,1.4e-05,8e-06,3.6e-05,1.5e-05,-4e-06,-1.7e-05,0,-4e-06,0,0,-3e-06,4e-06,3e-06,-1.1e-05,1.4e-05,2e-06,1.3e-05,0,-1.4e-05,1.3e-05,6e-06,-4e-06
2e-06,-7e-06,3e-06,-2e-06,-6e-06,-1e-05,1e-06,-9e-06,-1e-06,2e-06,-3e-06,-1e-06,2e-06,-1e-06,-1.8e-05,0,-1e-05,-3e-06,-1e-05,5e-06,-1e-06,-2e-06,-1e-06,-1e-06,-3e-06,-1e-06,-8e-06,-9e-06,1e-06,-4e-06,-3e-06,3e-06,-7e-06,-3e-06,4e-06,2e-06,-4e-06,-1e-06,0,-1e-06,4e-06,-1e-06,3e-06,-2e-06,0,-1e-06,-4e-06,2e-06,1e-06,1e-06,1.1e-05,6e-06,-5e-06,2e-06,-2e-06,-5e-06,-2e-06,4e-06,2e-06,-1e-06,-1.4e-05,1e-06,-5e-06,-3e-06,1.1e-05,-5e-06,-1e-06,0,-1e-06,0,7e-06,0,0,0,-8e-06,-7e-06,-5e-06,-1.3e-05,-6e-06,0,-8e-06,-4e-06,3e-06,5e-06,2e-06,3e-06,-2e-06,-5e-06,-5e-06,0,-2e-06,-1e-06,4e-06,9e-06,-1.2e-05,1e-06,2.1e-05,1.1e-05,0,1e-06,-1.3e-05,1e-05,-4e-06,-3e-06,6e-06,1e-06,-7e-06,1e-06,-6e-06,-4e-06,7e-06,4e-06,-5e-06,1.7e-05,3e-06,-4e-06,6e-06,-7e-06,1e-05,-1e-06,-4e-06
-6e-06,-2e-06,-3e-06,3e-06,-8e-06,-5e-06,-1e-06,-1.3e-05,-5e-06,3e-06,-3e-06,1e-06,3e-06,-1e-06,-1.7e-05,-3e-06,2e-06,-3e-06,-7e-06,4e-06,-2e-06,1e-06,-3e-06,1e-06,1e-06,0,-1e-06,3e-06,2e-06,-3e-06,1e-06,-1e-06,1e-06,1e-06,-5e-06,-1e-06,0,-3e-06,2e-06,-4e-06,4e-06,-2e-06,2e-06,-1e-06,3e-06,0,-1e-06,-9e-06,1e-06,-2e-06,6e-06,-2e-06,-1e-05,0,-6e-06,-2e-06,-2e-06,-3e-06,5e-06,-6e-06,-9e-06,5e-06,-1e-06,-3e-06,1e-06,3e-06,3e-06,0,-4e-06,-6e-06,-2e-06,-2e-06,1e-06,-7e-06,-6e-06,-3e-06,-6e-06,-1.7e-05,-1e-05,1e-06,-1.4e-05,-1e-06,-2e-06,-2e-06,-9e-06,-8e-06,0,-4e-06,-5e-06,3e-06,-6e-06,3e-06,7e-06,0,6e-06,-1e-06,8e-06,1.4e-05,7e-06,-1e-06,2e-06,-1e-06,-1e-06,-1.7e-05,1e-05,-1e-06,-5e-06,-3e-06,1e-06,-6e-06,6e-06,0,-1.3e-05,-1e-06,0,0,1e-05,-5e-06,-1.4e-05,6e-06,3e-06
-3e-06,1e-06,-1e-06,7e-06,-6e-06,3e-06,0,-3e-06,-3e-06,2e-06,-5e-06,-1e-06,1e-06,4e-06,-9e-06,-5e-06,-3e-06,-4e-06,-9e-06,4e-06,-1e-06,2e-06,-9e-06,4e-06,2e-06,0,-2e-06,6e-06,1e-06,-1e-06,-3e-06,-6e-06,0,0,-3e-06,-3e-06,-1e-06,-4e-06,1e-06,-1e-06,1e-06,1e-06,1e-06,0,2e-06,0,0,-5e-06,2e-06,-4e-06,2e-06,-3e-06,-9e-06,0,-5e-06,7e-06,3e-06,2e-06,4e-06,-6e-06,-1e-06,-3e-06,-1e-06,-2e-06,1e-06,0,-2e-06,-3e-06,2e-06,1e-06,-7e-06,-1e-06,0,-2e-06,-4e-06,1e-06,-4e-06,-1.6e-05,-5e-06,1e-06,-2e-06,0,0,1e-06,-1e-06,1e-06,-6e-06,1e-06,2e-06,0,1e-06,3e-06,4e-06,-5e-06,-1e-06,-2e-06,-6e-06,-1e-06,6e-06,3e-06,-3e-06,-9e-06,3e-06,-1.6e-05,7e-06,0,6e-06,-4e-06,2e-06,3e-06,2e-06,2e-06,-9e-06,-1e-06,-1e-06,6e-06,7e-06,5e-06,-5e-06,4e-06,2e-06
0,0,-1e-06,4e-06,-4e-06,1e-06,-1e-06,0,-2e-06,0,-3e-06,-1e-06,0,-1e-06,0,-1e-05,-5e-06,0,-6e-06,2e-06,1e-06,-2e-06,0,1e-06,0,0,-5e-06,8e-06,1e-06,-3e-06,-4e-06,-3e-06,2e-06,-2e-06,1e-06,0,1e-06,-3e-06,-1e-06,-1e-06,1e-06,0,0,-1e-06,2e-06,0,1e-06,0,0,0,0,3e-06,-2e-06,1e-06,-5e-06,-2e-06,3e-06,-4e-06,0,-6e-06,1e-06,-9e-06,-2e-06,-1e-06,0,-1e-06,0,0,-2e-06,4e-06,-7e-06,2e-06,-2e-06,-1e-06,0,5e-06,-1e-06,-9e-06,-1e-06,0,1e-06,0,0,-4e-06,3e-06,-1e-06,-6e-06,-2e-06,4e-06,1e-06,0,0,0,-1e-06,-5e-06,1e-06,-1.5e-05,-4e-06,0,2e-06,-4e-06,5e-06,1e-06,2e-06,7e-06,0,1e-06,-3e-06,-5e-06,8e-06,-2e-06,0,5e-06,-3e-06,-2e-06,6e-06,0,1.1e-05,1e-06,-3e-06,3e-06
0,3e-06,1e-06,3e-06,-2e-06,-3e-06,0,2e-06,1e-06,1e-06,0,0,-1e-06,-4e-06,2e-06,-8e-06,-1.3e-05,-1e-06,-3e-06,1e-06,1e-06,-2e-06,0,2e-06,-2e-06,1e-06,-3e-06,1.1e-05,2e-06,0,-6e-06,-2e-06,1e-06,-1e-06,1e-06,-2e-06,-1e-06,0,-1e-06,0,-3e-06,1e-06,-2e-06,0,-2e-06,0,-1e-06,1e-06,0,-1e-06,-4e-06,1e-06,1e-06,-1e-06,-1e-06,-1e-05,1e-06,-6e-06,-3e-06,-3e-06,-3e-06,-5e-06,1e-06,-1e-06,0,-2e-06,-1e-06,-1e-06,3e-06,1e-06,-6e-06,0,1e-06,1e-06,-1e-06,1e-06,0,-5e-06,-3e-06,0,-3e-06,-2e-06,0,-1e-06,0,-4e-06,-2e-06,-2e-06,-3e-06,0,-1e-06,-1e-06,-3e-06,0,-8e-06,0,-1.1e-05,1e-06,1e-06,-2e-06,1e-06,7e-06,-2e-06,1.1e-05,1e-06,-1e-06,0,-3e-06,-3e-06,0,-2e-06,0,7e-06,-6e-06,-2e-06,2e-06,-2e-06,3e-06,-6e-06,-5e-06,0
1e-06,1e-06,1e-06,0,-1e-06,-4e-06,1e-06,2e-06,2e-06,-2e-06,0,0,-1e-06,3e-06,-8e-06,0,-1.1e-05,-1e-06,-2e-06,0,-1e-06,-1e-06,-1e-06,2e-06,-1e-06,-1e-06,-2e-06,4e-06,0,0,-3e-06,-2e-06,1e-06,-3e-06,-1e-06,-2e-06,-1e-06,2e-06,1e-06,0,-3e-06,-2e-06,-5e-06,-2e-06,-1e-06,-1e-06,-4e-06,2e-06,-1e-06,-1e-06,-2e-06,-4e-06,2e-06,-3e-06,-1e-06,-3e-06,-2e-06,-2e-06,-2e-06,-3e-06,-5e-06,-3e-06,-1e-06,-2e-06,-2e-06,-1e-06,2e-06,-2e-06,-1e-06,-7e-06,-2e-06,-1e-06,-1e-06,5e-06,-1e-06,-2e-06,-2e-06,-1e-06,-1e-06,-2e-06,1e-06,-1e-06,0,-2e-06,0,0,2e-06,-2e-06,5e-06,-2e-06,0,-2e-06,-4e-06,2e-06,2e-06,-1e-06,-9e-06,-3e-06,-1e-06,3e-06,-2e-06,2e-06,1e-06,8e-06,-3e-06,0,1e-06,2e-06,0,-4e-06,-2e-06,0,3e-06,-1e-06,-1e-06,0,-1e-06,-3e-06,1e-06,0,-3e-06
0,-3e-06,-2e-06,2e-06,-1e-06,-1e-06,-1e-06,3e-06,-1e-06,0,3e-06,0,0,0,-8e-06,3e-06,-8e-06,-1e-06,1e-06,-1e-06,-1e-06,-1e-06,0,1e-06,0,0,-2e-06,2e-06,0,1e-06,0,-2e-06,0,-2e-06,0,1e-06,-1e-06,3e-06,-1e-06,0,0,1e-06,-3e-06,0,0,1e-06,0,-1e-06,1e-06,-1e-06,-1e-06,1e-06,-1e-06,-2e-06,0,5e-06,-1e-06,-3e-06,-1e-06,-2e-06,0,-4e-06,-1e-06,-2e-06,3e-06,0,-2e-06,-1e-06,0,-3e-06,2e-06,-2e-06,2e-06,1e-06,-3e-06,-2e-06,-1e-06,4e-06,-5e-06,-1e-06,-3e-06,0,0,4e-06,1e-06,-4e-06,6e-06,0,-1e-06,-2e-06,-1e-06,-1e-06,-4e-06,-3e-06,0,0,-7e-06,0,-5e-06,1e-06,-2e-06,-5e-06,2e-06,2e-06,-4e-06,-1e-06,-1e-06,2e-06,0,-2e-06,-4e-06,0,-3e-06,3e-06,-1e-06,-1e-06,2e-06,-3e-06,3e-06,0,-1e-06
-1e-06,-1e-06,2e-06,1e-06,1e-06,0,0,2e-06,1e-06,0,2e-06,-1e-06,1e-06,0,-5e-06,5e-06,-3e-06,0,-4e-06,-1e-06,-1e-06,1e-06,-1e-06,-1e-06,1e-06,0,-2e-06,-2e-06,-1e-06,-1e-06,0,2e-06,1e-06,-2e-06,2e-06,-1e-06,0,2e-06,-1e-06,0,1e-06,0,0,0,-1e-06,0,0,-3e-06,-1e-06,0,-1e-06,1e-06,-3e-06,-1e-06,0,2e-06,0,1e-06,1e-06,-1e-06,3e-06,2e-06,1e-06,-1e-06,1e-06,0,2e-06,0,-1e-06,1e-06,2e-06,1e-06,0,0,-1e-06,-2e-06,0,3e-06,-2e-06,1e-06,-3e-06,0,0,-1e-06,-1e-06,1e-06,8e-06,-1e-06,0,1e-06,0,1e-06,-3e-06,-6e-06,-1e-06,0,0,1e-06,-4e-06,0,2e-06,-7e-06,-1e-06,-3e-06,-5e-06,0,-1e-06,-3e-06,-3e-06,1e-06,-1e-06,0,-4e-06,1e-06,-1e-06,1e-06,4e-06,-6e-06,0,-3e-06,-1e-06
-1e-06,0,-1e-06,1e-06,1e-06,-1e-06,0,-4e-06,-1e-06,1e-06,0,0,0,-1e-06,-1e-06,3e-06,-2e-06,-1e-06,0,-2e-06,0,0,-1e-06,-1e-06,0,0,0,-3e-06,-1e-06,0,-1e-06,1e-06,0,1e-06,0,0,0,1e-06,-1e-06,0,2e-06,0,1e-06,1e-06,1e-06,0,-1e-06,-1e-06,0,0,0,2e-06,-4e-06,0,0,-2e-06,0,0,1e-06,-2e-06,4e-06,2e-06,0,-1e-06,-1e-06,1e-06,-2e-06,0,0,0,-1e-06,1e-06,0,-1e-06,1e-06,-2e-06,-1e-06,2e-06,-2e-06,0,2e-06,-1e-06,0,-2e-06,-1e-06,-3e-06,3e-06,0,3e-06,2e-06,-1e-06,1e-06,-1e-06,-5e-06,-2e-06,0,4e-06,1e-06,-5e-06,-2e-06,-3e-06,3e-06,-1e-06,-3e-06,-5e-06,-1e-06,-2e-06,-1e-06,0,4e-06,2e-06,1e-06,-1e-06,2e-06,0,2e-06,2e-06,0,0,0,0
1e-06,-1e-06,0,2e-06,1e-06,-1e-06,0,-4e-06,-1e-06,0,0,0,0,1e-06,-1e-06,0,-2e-06,-1e-06,2e-06,-1e-06,0,0,-2e-06,-2e-06,-1e-06,0,-2e-06,-6e-06,0,0,-3e-06,1e-06,0,2e-06,-1e-06,0,-1e-06,1e-06,0,-1e-06,0,-1e-06,-1e-06,0,2e-06,0,0,-1e-06,0,0,1e-06,-3e-06,-4e-06,1e-06,0,1e-06,1e-06,-1e-06,1e-06,-1e-06,0,0,-1e-06,-1e-06,-2e-06,-1e-06,1e-06,0,0,-2e-06,-3e-06,-1e-06,0,-1e-06,-1e-06,1e-06,-2e-06,3e-06,-1e-06,0,0,0,0,-4e-06,1e-06,0,-3e-06,-1e-06,-1e-06,0,1e-06,1e-06,0,-1e-06,0,0,5e-06,-3e-06,-2e-06,2e-06,-1e-06,5e-06,1e-06,-7e-06,-1e-06,0,1e-06,-1e-06,0,1e-06,2e-06,0,-3e-06,0,0,1e-06,0,3e-06,0,2e-06,1e-06
1e-06,0,0,2e-06,1e-06,2e-06,-1e-06,-1e-06,0,0,-3e-06,0,0,0,-5e-06,-2e-06,-3e-06,0,1e-06,0,0,-1e-06,-1e-06,-2e-06,-1e-06,0,-2e-06,-5e-06,0,-1e-06,-3e-06,-1e-06,0,0,0,-1e-06,-1e-06,0,0,0,-1e-06,0,0,0,-1e-06,0,1e-06,1e-06,0,0,1e-06,-1e-06,-3e-06,1e-06,1e-06,0,0,1e-06,0,-1e-06,-1e-06,1e-06,1e-06,-1e-06,-2e-06,0,0,0,-1e-06,0,-4e-06,-1e-06,-1e-06,0,-1e-06,2e-06,-1e-06,2e-06,0,0,1e-06,0,0,-3e-06,1e-06,-1e-06,-2e-06,-1e-06,-1e-06,0,0,0,2e-06,-1e-06,-1e-06,0,2e-06,-1e-06,-1e-06,1e-06,1e-06,5e-06,1e-06,-6e-06,3e-06,0,2e-06,0,-1e-06,-4e-06,1e-06,0,-3e-06,-2e-06,0,0,-1e-06,2e-06,-3e-06,0,1e-06
0,1e-06,0,1e-06,1e-06,-1e-06,0,1e-06,0,0,0,0,-1e-06,-1e-06,-6e-06,-4e-06,-5e-06,-1e-06,3e-06,0,0,-1e-06,0,-1e-06,0,0,0,-5e-06,0,0,-1e-06,0,-1e-06,-2e-06,0,0,-1e-06,-1e-06,-1e-06,0,-2e-06,0,-1e-06,0,0,0,0,1e-06,0,0,1e-06,2e-06,-1e-06,0,1e-06,-3e-06,0,0,0,-1e-06,-1e-06,-1e-06,0,-1e-06,0,0,0,0,1e-06,2e-06,0,1e-06,1e-06,0,-1e-06,1e-06,0,3e-06,-3e-06,0,3e-06,0,0,-2e-06,-1e-06,-2e-06,0,-1e-06,-1e-06,0,0,0,2e-06,-2e-06,0,0,2e-06,2e-06,1e-06,0,-2e-06,-2e-06,-1e-06,1e-06,3e-06,0,-1e-06,-2e-06,-1e-06,-1e-06,1e-06,0,2e-06,0,0,0,-1e-06,5e-06,-1e-06,-1e-06,0
-1e-06,0,0,0,1e-06,-1e-06,0,1e-06,0,-1e-06,-2e-06,0,0,1e-06,-4e-06,-3e-06,-4e-06,0,1e-06,0,0,0,-1e-06,0,1e-06,0,-2e-06,-1e-06,0,0,0,-1e-06,0,-2e-06,0,0,0,-1e-06,0,0,-1e-06,-1e-06,-2e-06,0,0,0,0,-1e-06,0,0,1e-06,0,0,0,0,-1e-06,0,-1e-06,0,-1e-06,1e-06,-2e-06,-1e-06,-1e-06,0,0,1e-06,-1e-06,-1e-06,0,2e-06,0,0,1e-06,-1e-06,0,0,1e-06,-2e-06,0,0,0,0,-1e-06,0,0,0,0,0,-1e-06,0,-1e-06,2e-06,-2e-06,0,0,-3e-06,0,1e-06,0,-1e-06,-5e-06,0,6e-06,2e-06,0,0,1e-06,0,2e-06,1e-06,0,3e-06,1e-06,0,0,0,-2e-06,1e-06,0,0
-1e-06,-1e-06,0,0,0,-1e-06,0,1e-06,0,0,1e-06,0,0,0,-1e-06,-1e-06,-5e-06,0,1e-06,1e-06,0,0,0,0,0,0,-1e-06,0,0,0,0,-1e-06,0,0,0,-1e-06,0,-1e-06,0,0,0,0,0,0,-1e-06,0,0,-1e-06,0,0,0,-1e-06,0,-1e-06,0,3e-06,0,0,0,-1e-06,2e-06,0,1e-06,-1e-06,0,0,-1e-06,0,1e-06,-2e-06,2e-06,0,0,0,0,-1e-06,-1e-06,0,-1e-06,0,-1e-06,0,0,-1e-06,0,-2e-06,0,0,-2e-06,-1e-06,0,0,1e-06,-2e-06,0,0,-5e-06,0,2e-06,1e-06,0,-1e-06,1e-06,5e-06,2e-06,0,0,-1e-06,0,2e-06,-1e-06,0,1e-06,0,0,1e-06,1e-06,-2e-06,0,1e-06,-1e-06
0,0,0,0,0,0,0,2e-06,0,0,1e-06,0,0,1e-06,-1e-06,1e-06,-2e-06,0,0,0,0,0,0,1e-06,0,0,0,4e-06,0,0,-1e-06,-1e-06,0,1e-06,0,0,0,-1e-06,0,0,1e-06,0,1e-06,0,1e-06,0,0,-1e-06,0,0,0,-1e-06,-1e-06,-1e-06,0,2e-06,0,0,0,-1e-06,-1e-06,0,0,-1e-06,0,0,1e-06,0,-1e-06,0,0,-1e-06,0,0,1e-06,-1e-06,-1e-06,-1e-06,-1e-06,0,1e-06,0,0,-1e-06,-1e-06,1e-06,0,0,1e-06,1e-06,0,0,0,-1e-06,-1e-06,0,-5e-06,1e-06,1e-06,1e-06,-2e-06,1e-06,0,1e-06,0,0,-1e-06,1e-06,-1e-06,1e-06,-1e-06,0,-2e-06,-1e-06,0,0,1e-06,-2e-06,0,-1e-06,0
1e-06,0,0,0,0,0,0,0,0,1e-06,1e-06,0,0,-1e-06,-3e-06,2e-06,-3e-06,0,0,0,0,0,-1e-06,1e-06,0,0,-1e-06,3e-06,0,0,-2e-06,0,0,1e-06,0,0,0,-1e-06,0,0,1e-06,1e-06,1e-06,0,0,0,1e-06,0,0,0,-1e-06,1e-06,-2e-06,0,0,-2e-06,0,0,0,-1e-06,-2e-06,0,-1e-06,-1e-06,0,0,0,0,0,2e-06,-2e-06,0,-1e-06,0,0,-1e-06,0,-1e-06,0,0,-1e-06,0,0,-1e-06,0,-2e-06,-3e-06,0,0,0,0,0,-1e-06,0,0,0,-4e-06,0,0,0,0,4e-06,0,-3e-06,-1e-06,0,0,-1e-06,-1e-06,-2e-06,0,0,-2e-06,1e-06,0,0,0,-1e-06,1e-06,-1e-06,0
0,-1e-06,0,0,0,-1e-06,0,-2e-06,0,0,1e-06,0,0,0,-4e-06,2e-06,-2e-06,0,1e-06,0,0,0,-1e-06,1e-06,0,0,-1e-06,4e-06,0,0,-2e-06,1e-06,0,0,0,0,0,-1e-06,0,0,0,-1e-06,0,0,0,0,0,1e-06,0,0,-1e-06,1e-06,-2e-06,0,0,-2e-06,0,-1e-06,0,-1e-06,-1e-06,2e-06,0,-1e-06,-1e-06,0,0,0,0,1e-06,-2e-06,1e-06,0,0,-1e-06,1e-06,0,-1e-06,-1e-06,0,0,0,0,-1e-06,0,0,-3e-06,0,-1e-06,0,0,0,-1e-06,1e-06,0,0,-1e-06,-2e-06,0,0,0,-1e-06,0,-3e-06,-1e-06,0,0,0,0,-1e-06,0,0,0,-1e-06,0,0,0,1e-06,0,0,0
0,0,0,1e-06,0,0,0,-2e-06,0,0,0,0,0,0,-3e-06,1e-06,-3e-06,0,-1e-06,0,0,0,0,1e-06,0,0,0,3e-06,0,0,-1e-06,1e-06,0,0,0,0,0,0,0,0,-1e-06,0,0,0,0,0,0,0,0,0,-1e-06,-1e-06,-2e-06,1e-06,0,1e-06,0,0,0,0,0,1e-06,0,-1e-06,0,0,0,0,0,-1e-06,-1e-06,0,0,0,0,1e-06,-1e-06,-1e-06,-2e-06,0,1e-06,0,0,-1e-06,0,-1e-06,0,0,1e-06,0,0,0,-1e-06,0,0,0,1e-06,0,-2e-06,1e-06,-1e-06,-3e-06,0,-4e-06,-2e-06,0,1e-06,-1e-06,0,1e-06,-1e-06,0,-1e-06,0,0,0,0,3e-06,-1e-06,0,0
0,1e-06,0,0,0,0,0,0,0,0,-1e-06,0,0,0,-1e-06,-1e-06,-3e-06,0,0,0,0,0,-1e-06,0,0,0,-1e-06,2e-06,0,0,0,0,0,-1e-06,0,0,0,0,0,0,-1e-06,0,0,0,-1e-06,0,0,-1e-06,0,0,0,0,-1e-06,0,0,0,0,0,0,-1e-06,1e-06,1e-06,0,-1e-06,0,0,1e-06,0,0,1e-06,1e-06,0,0,0,0,1e-06,0,-1e-06,-1e-06,0,0,0,0,0,0,-1e-06,2e-06,0,0,0,0,0,-1e-06,0,0,0,3e-06,1e-06,-1e-06,0,0,-2e-06,0,-3e-06,-2e-06,0,0,0,-1e-06,2e-06,0,0,-1e-06,0,0,0,0,1e-06,0,-1e-06,0
0,0,0,0,0,0,0,1e-06,0,0,0,0,0,0,-1e-06,-2e-06,-3e-06,0,-1e-06,0,0,0,0,0,0,0,-1e-06,-1e-06,0,0,0,0,0,-1e-06,0,0,0,1e-06,0,0,0,0,0,0,0,0,0,0,0,0,0,0,-1e-06,0,0,-1e-06,0,-1e-06,0,0,0,1e-06,1e-06,-1e-06,1e-06,0,-1e-06,0,0,1e-06,1e-06,0,0,0,0,0,0,-1e-06,-1e-06,0,0,0,0,0,0,0,2e-06,0,0,0,0,0,0,0,0,0,3e-06,0,-1e-06,0,0,1e-06,0,2e-06,-1e-06,0,0,0,0,0,1e-06,0,1e-06,0,0,0,0,1e-06,0,0,0
0,0,0,0,0,-1e-06,0,1e-06,0,0,-1e-06,0,0,0,-2e-06,-2e-06,-2e-06,0,-1e-06,0,0,0,0,0,0,0,0,-1e-06,0,0,-1e-06,0,0,0,0,0,0,0,0,0,0,0,0,0,0,0,-1e-06,0,0,0,0,0,0,0,0,1e-06,0,0,0,0,-1e-06,0,0,-1e-06,0,0,1e-06,0,0,0,0,0,0,0,0,0,0,-1e-06,0,0,0,0,0,-1e-06,0,-1e-06,1e-06,0,1e-06,0,0,0,0,1e-06,0,0,1e-06,0,0,0,-1e-06,4e-06,0,4e-06,0,0,0,0,0,-1e-06,0,0,1e-06,0,0,0,0,-2e-06,-1e-06,0,0
0,0,0,0,0,0,0,1e-06,0,0,1e-06,0,0,0,-3e-06,-1e-06,-2e-06,0,0,0,0,0,0,-1e-06,0,0,0,-4e-06,0,0,-1e-06,-1e-06,0,1e-06,0,0,0,1e-06,0,0,1e-06,0,1e-06,0,0,0,0,0,0,0,0,0,0,0,0,1e-06,0,0,0,0,-1e-06,-1e-06,0,-1e-06,0,0,0,0,0,-1e-06,-2e-06,0,0,0,0,-1e-06,-1e-06,0,-1e-06,0,-1e-06,0,0,-1e-06,0,0,0,0,0,0,0,0,1e-06,1e-06,0,0,-1e-06,1e-06,0,1e-06,0,0,0,3e-06,1e-06,0,0,0,-1e-06,-1e-06,0,0,0,0,0,0,0,-2e-06,0,0,0
0,0,0,0,0,0,0,1e-06,0,0,-1e-06,0,0,0,-2e-06,0,-2e-06,0,-1e-06,0,0,0,0,-1e-06,0,0,-1e-06,-3e-06,0,0,-1e-06,0,0,1e-06,0,0,0,0,0,0,0,0,0,0,0,0,0,0,0,0,0,-1e-06,-1e-06,0,0,-1e-06,0,0,0,0,1e-06,0,1e-06,-1e-06,0,0,0,0,0,0,-2e-06,0,0,0,0,0,0,0,-2e-06,0,-1e-06,0,0,-1e-06,0,-1e-06,-1e-06,0,0,0,0,0,1e-06,0,0,0,-2e-06,0,1e-06,0,0,-1e-06,0,0,1e-06,0,0,0,0,1e-06,0,0,-1e-06,0,0,0,0,-1e-06,0,0,0
0,-1e-06,0,0,0,0,0,-1e-06,0,0,1e-06,0,0,0,-1e-06,1e-06,-3e-06,0,0,0,0,0,0,0,0,0,0,-3e-06,0,0,-1e-06,0,0,0,0,0,0,0,0,0,0,0,0,0,0,0,0,0,0,0,0,1e-06,-1e-06,0,0,-1e-06,0,0,0,0,1e-06,-1e-06,0,-1e-06,0,0,0,0,0,0,-1e-06,0,0,0,0,0,0,0,-1e-06,0,0,0,0,-1e-06,0,0,-1e-06,0,0,0,0,0,1e-06,0,0,0,-3e-06,-1e-06,1e-06,0,-1e-06,-3e-06,0,-3e-06,1e-06,0,0,0,0,2e-06,0,0,-1e-06,0,0,0,0,1e-06,0,0,0
0,0,0,0,0,-1e-06,0,-2e-06,0,0,0,0,0,0,-1e-06,1e-06,-2e-06,0,0,0,0,0,0,0,0,0,-1e-06,-1e-06,0,0,0,0,0,-1e-06,0,0,0,0,0,0,-1e-06,0,0,0,-1e-06,0,0,0,0,0,0,0,-2e-06,0,0,1e-06,0,-1e-06,0,0,0,-1e-06,0,-1e-06,0,0,0,0,0,0,1e-06,1e-06,0,0,0,1e-06,0,0,-1e-06,0,0,0,0,-1e-06,0,-1e-06,1e-06,0,0,0,0,0,0,0,0,0,-3e-06,0,1e-06,0,0,0,0,-3e-06,1e-06,0,0,-1e-06,0,0,0,0,0,0,0,0,0,1e-06,0,0,0
0,0,0,0,0,0,0,-1e-06,0,0,1e-06,0,0,0,-2e-06,1e-06,-3e-06,0,0,0,0,0,0,0,0,0,-1e-06,0,0,0,0,0,0,-1e-06,0,0,0,0,0,0,0,0,-1e-06,0,0,0,0,0,0,0,0,0,-2e-06,0,0,1e-06,0,0,0,0,-1e-06,0,1e-06,-1e-06,0,0,0,0,0,0,1e-06,0,0,0,0,0,0,0,0,0,0,0,0,-1e-06,0,-1e-06,2e-06,0,-1e-06,0,0,0,0,0,0,0,-1e-06,1e-06,0,0,0,3e-06,0,-3e-06,0,0,0,1e-06,-1e-06,-1e-06,0,0,0,0,0,0,0,1e-06,0,0,0
0,0,0,0,0,0,0,1e-06,0,0,0,0,0,0,-2e-06,0,-2e-06,0,0,0,0,0,0,0,0,0,0,2e-06,0,0,0,0,0,0,0,0,0,0,0,0,0,0,0,0,0,0,0,0,0,0,0,0,-1e-06,0,0,-1e-06,0,0,0,0,-1e-06,0,0,-1e-06,0,0,0,0,0,0,0,0,0,0,0,0,0,0,0,0,0,0,0,-1e-06,0,0,0,0,0,0,0,0,0,0,0,0,0,-1e-06,-1e-06,0,0,1e-06,0,-1e-06,0,0,0,-1e-06,0,-1e-06,0,0,-1e-06,0,0,0,0,0,0,0,0
0,0,0,0,0,0,0,1e-06,0,0,0,0,0,0,-2e-06,-1e-06,-1e-06,0,0,0,0,0,0,0,0,0,-1e-06,2e-06,0,0,-1e-06,0,0,0,0,0,0,-1e-06,0,0,0,0,0,0,0,0,0,0,0,0,0,0,0,0,0,0,0,0,0,0,0,0,0,-1e-06,0,0,0,0,0,0,-1e-06,0,0,0,0,0,0,0,-1e-06,0,0,0,0,-1e-06,0,-1e-06,-1e-06,0,0,0,0,0,0,0,0,0,2e-06,0,-1e-06,0,0,0,0,2e-06,-1e-06,0,0,1e-06,0,0,0,0,0,0,0,0,0,-1e-06,0,0,0
