0.000247,0.000195,0.000207,0.000115,0.000299,0.000152,0.000165,-3.9e-05,-3.4e-05,-5.6e-05,-9e-06,7.1e-05,5e-05,0.000156,2e-06,7.3e-05,-2e-05,8.6e-05,-2e-05,-2.5e-05,-6.2e-05,2.2e-05,3.8e-05,0.000189,0.000115,7.9e-05,0.000145,0.00014,0.000296,0.000122,-8.3e-05,0.000175,0.000183,0.000851,-0.005379,-0.004704,-0.002155,-0.000508,-0.010115,-0.024004,-0.023045,-0.011795,-0.003828,-0.004369,-0.000311,-0.000347,0.000998,0.000543,0.008181,-0.004305,-0.015491,-0.010935,-0.019091,-0.013686,-0.011898,-0.027789,-0.02449,-0.00903,-0.005598,-0.011446,-0.013493,-0.011145,-0.016589,-0.01627,-0.009054,-0.005944,-0.013629,-0.013128,-0.01386,-0.018087,-0.015245,-0.015352,-0.014813,-0.008086,-0.004019,-0.007477,-0.011612,-0.013812,-0.006941,-0.005802,-0.008497,-0.002955,-0.002175,-0.006912,-0.003621,-0.004903,-0.004558,-0.002114,-0.000634,-0.00944,-0.00603,-0.002489,-0.004505,-0.008611,-0.004826,-0.002053,0.000351,-0.000862,0.001169,0.000993,0.000329,0.000106,0.00013,-0.000104,0.000113,-0.004635,-0.007342,-0.003962,-0.00107,-0.000739,-0.000514,-0.000398,-0.000144,-3.1e-05,-6.6e-05,4.2e-05,-0.000213,-5.8e-05,-7.4e-05,-0.000311,-0.00025
0.000231,-6.2e-05,4.2e-05,-4.9e-05,3.4e-05,1.8e-05,3.7e-05,-8e-06,4.2e-05,-5.6e-05,4.2e-05,4.2e-05,1.2e-05,6e-05,1.4e-05,1.2e-05,4e-05,6.9e-05,2e-06,-7.1e-05,-9.4e-05,-6e-05,9.6e-05,-4e-06,-4e-06,0.00011,4.9e-05,5.8e-05,3.1e-05,6e-06,7.1e-05,8.6e-05,-1.1e-05,-0.000171,0.004958,0.003413,0.001648,0.000303,0.001682,0.002789,0.008742,0.004208,0.000782,-3.8e-05,-0.002452,0.000357,0.001378,0.001138,-0.000176,-0.012327,-0.003249,-0.005721,-0.000329,0.000209,-0.001748,0.007113,0.002249,-0.012065,-0.007918,-0.011154,0.006382,0.008523,0.002088,-0.000107,-0.004412,-0.004469,-0.000859,-0.000625,0.00084,-0.002771,-0.001567,0.001752,0.000793,-0.003667,-0.000169,-0.003608,-0.005387,-0.001331,-0.002188,-0.000325,-0.002187,-0.006208,-0.004373,-0.004573,-0.002417,-0.003078,-0.002453,-0.001023,-0.001608,-0.004178,-0.003256,9e-05,-0.005661,-0.005926,0.000254,0.001415,0.00154,0.002434,0.001534,-0.000596,5.1e-05,4e-05,6e-05,2e-06,0.000289,0.000141,0.004087,0.001951,0.000262,0.000243,0.000309,7.1e-05,0.000158,0.000162,-3.7e-05,7.2e-05,0.000133,0.000203,-0.000156,-7.7e-05,-8.4e-05
6.4e-05,3.7e-05,-4.2e-05,-3.8e-05,8.3e-05,3.5e-05,0.000187,4e-05,-6.8e-05,-7.8e-05,-0.000164,-0.00012,-9.4e-05,-3.2e-05,-8.1e-05,-5.6e-05,0.00012,-9e-06,5.1e-05,-3.2e-05,-8.9e-05,-9e-06,-9.1e-05,-5.3e-05,-1.6e-05,1.1e-05,-2.1e-05,-8.1e-05,1.4e-05,-0.000132,-2.8e-05,0.000121,-7.2e-05,-0.000101,-0.002329,-0.002252,-0.00056,0.000312,0.000726,0.002623,-0.003037,-0.002609,-0.000934,0.001098,0.000808,0.000786,0.000737,-5.2e-05,0.000634,-0.004966,-0.001115,-0.003031,-0.003721,-0.003638,-0.002148,-0.006447,0.001042,-0.006529,-0.004523,-0.004614,-0.011412,-0.00658,-0.010679,-0.00092,-0.000415,0.002685,-0.000123,-0.001165,-0.0036,-0.006574,-0.000333,-0.002246,-0.005646,-0.004885,-0.003969,-0.000571,0.000316,-0.001822,0.000168,0.002764,-0.000917,-0.00076,0.004243,-0.001145,-0.002122,0.000483,0.001817,0.000895,0.000477,0.001153,-0.001908,-0.001475,-0.000379,-0.006046,-0.003187,-0.001203,-0.000768,0.000562,-0.004062,-0.003208,-0.001381,-0.000393,-0.000339,1.9e-05,0.000234,0.000536,-0.001522,-0.000661,-0.000556,-0.000306,0.00021,-2.8e-05,-9.9e-05,6e-06,7.5e-05,7.5e-05,2.9e-05,0.000219,-0.000115,-9.1e-05,0.000259
1.9e-05,8.2e-05,7.5e-05,-3.8e-05,-7.9e-05,1.7e-05,2e-05,-5.3e-05,-3.6e-05,-1.8e-05,-1.7e-05,1.5e-05,-8e-06,0.000112,-2e-06,-6e-05,-3e-05,9e-06,-2.3e-05,9e-06,4.4e-05,0.000115,-1.4e-05,5.4e-05,1e-06,-6.6e-05,-2.9e-05,-0.00011,-3.2e-05,7.3e-05,-2.3e-05,-4.8e-05,-1.4e-05,-0.000183,0.000584,-0.000585,-0.000501,-0.000376,0.000339,0.00104,0.00262,0.00205,-0.000177,0.000978,-0.002543,9.7e-05,-0.000263,-0.000891,-0.000867,-0.003197,0.000778,-0.00156,-8.7e-05,-0.001274,0.001924,0.00494,-0.00132,-0.005214,0.001153,-0.002384,0.002163,-0.002363,0.00761,0.000667,-0.002261,-0.000451,-0.000783,-0.001847,-0.000642,0.002263,-0.004148,0.002063,0.005141,0.004174,0.000301,0.002348,0.002593,0.002823,0.000421,-6e-06,-0.000337,0.001427,-0.002036,0.001092,-0.001044,0.000945,0.000748,-0.001007,-0.000304,0.000217,-0.000301,-0.000625,-0.000276,0.002398,0.000471,-0.000432,-6.3e-05,9.2e-05,-0.002464,-0.000374,0.000307,0.00027,-0.00015,-0.000143,-0.000207,0.000273,0.000449,1.5e-05,-0.000301,0.000131,-4.9e-05,-0.000103,-0.000158,-0.00027,-3e-05,-0.000151,-0.000239,-0.000154,-0.000182,-0.000171,-0.000231
6.4e-05,6.4e-05,0.000163,0.000246,3.8e-05,5.4e-05,1.3e-05,6.5e-05,3e-05,9.8e-05,2.2e-05,2.6e-05,0.000104,4.4e-05,7.1e-05,1.5e-05,3.2e-05,7e-06,-1.7e-05,6.7e-05,7.4e-05,-1.7e-05,-4.3e-05,-0.000146,-2.9e-05,6.7e-05,-4.9e-05,0.000123,0.000147,0.000102,0.000126,5.7e-05,4.9e-05,-5e-06,-0.001803,0.000993,0.000451,0.000282,-0.000523,-0.002047,-0.003668,-0.000971,0.000486,-0.000488,-1.8e-05,0.000279,0.000404,-0.000569,-0.000191,-0.002225,0.000655,-6.9e-05,-0.001019,0.00248,0.000551,-0.002694,-0.000703,0.002946,0.001649,0.00147,-0.002948,-0.000173,-0.000923,-0.000569,0.003347,-0.005045,-0.002793,-0.000983,0.004882,0.002747,0.002604,-0.002569,-0.0022,-0.001538,0.000889,0.00083,-0.002321,-0.000848,-0.001374,-0.002048,-0.001319,0.001718,-0.000255,0.001005,0.002043,-0.001361,-0.000323,-0.000137,0.000154,0.001081,0.002023,0.000762,0.001141,-0.000297,-0.000466,-0.000297,0.000237,-0.001052,-0.004233,-0.001598,-0.000777,-1e-04,5.9e-05,0.000121,6.2e-05,-0.000122,-6.5e-05,1.9e-05,0.000327,6.1e-05,-0.000164,8.9e-05,-1.5e-05,-5.8e-05,-9.1e-05,0.000144,0.000173,0.000214,0.000194,0.000132,3.1e-05
2.5e-05,-8.6e-05,0.000114,4.5e-05,7.9e-05,1e-06,-2e-05,-0.000135,-5.3e-05,1.1e-05,-2e-06,7.5e-05,4.8e-05,4.8e-05,4.8e-05,7.3e-05,8.3e-05,-4.1e-05,3e-06,-3.8e-05,-5.9e-05,3e-05,1.9e-05,-8e-06,3.3e-05,5.5e-05,8.3e-05,-2e-06,3.6e-05,0.000198,-4e-06,3.6e-05,-2.1e-05,-0.00014,0.000524,-0.000686,-9.2e-05,5.9e-05,0.000292,0.001965,0.003067,0.0018,0.000476,0.000269,-0.000336,-0.000413,-0.001033,-0.000628,-0.000381,-2e-05,0.000262,-0.002477,0.000599,0.001263,-0.00216,-0.002281,-0.003758,0.003811,-0.001937,0.001594,-0.002447,0.005064,0.004642,0.003789,-0.004812,-0.004149,-0.001726,0.001746,-0.001925,0.000719,-0.000108,-0.002239,0.002135,0.001085,-0.003058,0.00168,-0.001795,-0.000757,-0.000971,0.002071,0.001176,-0.001636,0.001725,-0.000179,-0.000122,0.001607,-0.000216,-0.00012,2.5e-05,0.000128,0.001543,0.001443,0.000823,-0.000103,-0.001833,-0.001593,0.000769,-0.001046,0.002771,0.00071,0.000307,-2.2e-05,-1e-05,-3.9e-05,-1.7e-05,9.2e-05,-0.000281,9.4e-05,2.3e-05,5.1e-05,0.000137,-7.4e-05,4e-06,-7.1e-05,-2.9e-05,0,-2.2e-05,0.000157,-0.000111,2.8e-05,3.3e-05
-5.6e-05,-9.1e-05,-5.4e-05,2.1e-05,-6.8e-05,-0.000157,-9.2e-05,-3.7e-05,-3.5e-05,1e-05,3e-06,-2.8e-05,-7.9e-05,-4.3e-05,-4.8e-05,-2.5e-05,1.5e-05,-1e-06,1.4e-05,6.1e-05,0,0.000101,-2.2e-05,-0.000184,-0.000256,-4e-06,-0.000141,-7.6e-05,-3.5e-05,-3.9e-05,-6e-05,-2.4e-05,4.1e-05,-0.000114,0.000277,0.000343,0.000115,-4.3e-05,-0.000223,-0.000294,-0.001265,-0.00139,-0.000572,-0.000318,-9e-05,-0.000697,-0.00078,-0.000893,-0.000499,0,-0.002475,8e-04,-0.000138,-0.001866,0.000984,0.001518,0.001379,-0.000887,0.006112,0.00203,-0.005006,0.002701,-0.001059,-0.000454,0.00402,0.003126,-0.000558,0.001097,0.002322,-0.001591,-0.00031,0.000946,-0.002886,-0.002391,-0.000703,-0.000126,0.001486,0.000216,0.000581,-0.001317,-0.001361,0.000598,-0.00097,0.001406,0.001959,8.1e-05,0.000258,0.000126,0.000385,-0.000873,-0.001697,0.000347,0.000115,-0.00204,0.000971,-0.000167,0.000696,0.000169,0.000258,-0.000349,0.000149,-0.000118,-8.7e-05,-5.6e-05,-5.7e-05,0.000269,-0.000178,-0.000378,-0.000247,-7.4e-05,-0.000103,-0.00011,-0.000107,1e-06,-6e-05,-1.3e-05,-0.000144,-0.000131,-0.000104,-0.000131,-0.000172
-3.8e-05,-8.5e-05,-0.000122,-5e-05,-9.5e-05,-4.7e-05,-3.4e-05,-2.2e-05,-3.5e-05,-6.7e-05,-5.2e-05,-5.4e-05,-2.9e-05,-9.7e-05,9e-06,-1.3e-05,-1.8e-05,-3.3e-05,-5e-05,-1.5e-05,-1.6e-05,-6e-05,-1.5e-05,1.7e-05,-8.3e-05,-0.000125,-5.4e-05,-0.000111,-9.2e-05,2e-05,-7.2e-05,-4.6e-05,-0.000103,-3.6e-05,-0.000295,-3e-06,0.000257,-0.000105,0.000164,7.7e-05,0.000217,0.000719,-0.00052,0.000227,0.000128,-0.00094,-0.000795,9e-06,-9.9e-05,0.000178,-0.005131,-0.001534,-0.001061,-0.000943,-0.000923,-0.001075,-0.000736,-0.001917,-0.001332,0.000314,0.000152,-0.004745,-0.003883,-0.00615,-0.002615,4.9e-05,-0.002983,0.000145,-0.000252,-0.000721,0.001258,0.000783,0.001109,0.000137,-0.00171,-0.001277,-0.000611,0.001332,-0.000111,-0.000199,0.000398,-0.00271,-9.1e-05,-5.4e-05,-0.001583,0.000624,0.00017,-0.000165,0.000525,0.000297,-0.000645,-0.000863,0.000898,0.00063,-4.1e-05,-0.000912,4e-06,-0.000499,-2.5e-05,0.000492,-0.000298,-0.000313,-9.5e-05,-0.000182,-0.000177,0.000191,-3.5e-05,0.000229,0.000122,8.9e-05,6.7e-05,1e-05,-9.9e-05,5e-05,-2.7e-05,-6e-05,-9.3e-05,5e-05,2.6e-05,-7.3e-05,-5e-06
-3.1e-05,-6.1e-05,-1.7e-05,-2.5e-05,-7e-05,-6.1e-05,-3.9e-05,-1.7e-05,-5.4e-05,-3.3e-05,2.7e-05,-5e-06,-6.3e-05,-4.7e-05,1e-06,-5.4e-05,-3e-05,-4.3e-05,1.8e-05,-1.4e-05,3e-05,-2.2e-05,-7e-05,5.4e-05,1.3e-05,9e-06,-8.7e-05,-4.2e-05,-5.5e-05,1e-06,-2.1e-05,-2.8e-05,-0.000107,0.000118,4.8e-05,0.000194,0.00012,7e-05,-0.000125,-0.000342,-0.000441,-0.000494,0.000645,0.000424,4e-06,-0.000534,-0.000237,-0.000602,-0.000169,-0.000307,-0.000528,-0.001064,-0.000498,-2.6e-05,0.000916,-0.00021,0.001334,0.003718,-0.000814,-0.002325,0.000942,0.001345,0.002867,0.003454,-0.000395,-8e-06,0.003514,-0.001161,-0.001309,0.001152,-0.003577,0.000286,0.001349,-0.00023,0.002744,-0.001158,0.001902,-0.000983,-0.000244,0.00059,0.000561,0.001398,-0.000104,-0.000213,-0.000455,-0.00117,-0.000679,-0.000276,-0.001219,-0.000508,0.001147,-2.9e-05,-0.001245,0.000249,-0.000368,-0.000235,-4.3e-05,0.000468,0.000543,-0.000596,-0.001012,-0.000384,-0.000102,-8.2e-05,-5.2e-05,-5e-06,-4.3e-05,-0.000215,9.3e-05,-0.000135,-4.8e-05,4.5e-05,1.7e-05,-1.1e-05,6.3e-05,-0.00015,-0.000165,-0.000136,-0.000109,-5.4e-05,-4.7e-05
8e-06,3e-06,-3.9e-05,-3.4e-05,3e-05,-2e-06,9e-06,1.5e-05,-1e-05,3.7e-05,-3e-05,-7e-06,5.9e-05,2.9e-05,3.2e-05,-8e-06,-2.3e-05,-2e-06,1e-06,1.1e-05,-1e-05,-4.8e-05,2.5e-05,6e-06,-1.6e-05,-1.2e-05,1.1e-05,-7e-06,1.4e-05,2.4e-05,7e-06,1.6e-05,-5.8e-05,-6.7e-05,-0.000193,-0.000423,-0.000269,-0.000268,0.000103,8.6e-05,0.000265,7e-06,0.000509,1.7e-05,-0.000646,0.001012,0.000386,0.000111,0.00027,-0.000228,0.007313,0.001546,0.001661,0.000262,-0.001752,0.000832,-7.8e-05,-0.000189,0.00052,-0.000714,0.001505,-0.002495,5e-05,-0.001268,-0.000615,0.000205,-4.7e-05,0.00106,0.000391,0.000956,0.000663,0.002124,-0.000832,0.000771,-0.001118,2.1e-05,-0.000432,-0.000496,0.000371,-0.001603,-7e-05,0.001481,0.001671,0.000779,-0.000178,-0.000516,0.001043,0.000148,0.000292,-1.8e-05,-0.000727,-0.000368,-0.000386,0.000329,0.000201,-0.000147,7.9e-05,-2e-04,0.00055,0.00089,-3.6e-05,2e-06,4.6e-05,6.8e-05,-9e-06,0.000101,2e-06,0.000111,-0.00031,2.1e-05,-3.7e-05,-6.2e-05,-3.9e-05,-2.1e-05,2e-06,-1.6e-05,2e-05,1.7e-05,2.2e-05,8.6e-05,7.7e-05
-1.6e-05,-2e-06,-1e-06,2.9e-05,3e-06,2.8e-05,-4.5e-05,-1.2e-05,-3.7e-05,7e-06,2.9e-05,9e-06,-1.6e-05,-1.4e-05,-1.1e-05,-5e-06,2.6e-05,-1.2e-05,1.3e-05,-4e-06,1.7e-05,4.2e-05,3e-06,-2e-05,-1e-05,4e-06,-3e-06,1.3e-05,-3e-05,-9e-06,1.2e-05,1.3e-05,-4.4e-05,1.2e-05,0.000135,0.000311,1.1e-05,-0.000167,1.4e-05,5.8e-05,0.000205,0.000406,-0.000236,-0.000303,0.000506,-4.1e-05,-0.000729,-0.000165,0.000366,-2.4e-05,-0.002464,0.000247,5e-05,0.000472,0.002437,0.001205,-0.000469,-6.3e-05,-0.003503,0.004255,-0.000274,-0.000194,-2e-06,0.001542,0.000365,-0.000186,0.000193,-0.001118,0.000478,-0.000199,0.000844,-0.000718,-0.000157,-0.00093,0.001287,0.000212,-0.000565,0.001569,-0.000777,0.000249,-0.000358,-9e-06,-0.001129,-2e-04,0.000453,-0.000269,-0.000837,4.5e-05,-0.000316,-0.000181,0.00037,0.000112,-0.000545,0.00023,0.000203,0.000384,-0.000131,-0.000315,2.8e-05,-0.000135,-0.000188,-7e-05,-8e-06,9.1e-05,4.1e-05,-0.000108,-1e-06,3.1e-05,0.000322,2.4e-05,-2e-06,3.9e-05,0.00017,5.3e-05,2.8e-05,1.4e-05,1.1e-05,-3.9e-05,5.8e-05,5.4e-05,-1e-06
-3.6e-05,-1.1e-05,-6.1e-05,-1.9e-05,-2.5e-05,-1.6e-05,-3e-05,-1.6e-05,2.6e-05,2.4e-05,6e-06,-1e-05,8e-06,7e-06,1.9e-05,-1.7e-05,-1.7e-05,-6e-06,-2e-05,-3e-05,1.2e-05,8e-06,-2e-06,-2.2e-05,2.1e-05,-1.6e-05,-3e-06,-5.5e-05,-2.2e-05,-2.9e-05,-1e-04,-2.1e-05,-4e-06,-2e-05,-5.5e-05,-0.000149,9.1e-05,0.000125,5.3e-05,2e-06,-0.00031,-0.000119,0.000312,-0.000179,-0.000189,0.000166,-0.000129,0.000215,0.000232,-6.6e-05,-0.00019,0.000705,0.004135,0.000883,-0.001243,0.000937,-0.000329,-0.000538,-0.001097,-0.000914,-0.000519,-0.002424,-0.000332,-0.001997,-0.000278,0.000423,-0.000692,-0.001055,1.2e-05,-0.000291,-0.000583,0.000235,-0.000516,0.000184,-9.8e-05,-0.001594,0.000231,-0.001186,-0.000177,4.6e-05,0.001108,-0.000273,-0.001546,-0.00024,0.000107,0.000729,0.000634,-2.9e-05,-0.000282,0.000265,-0.000438,0.000251,7e-04,-2.5e-05,-0.000141,0.000522,-0.000593,-0.000408,-0.000484,-0.000156,0.000351,0.000183,-8e-06,2e-05,-2.3e-05,-5.6e-05,4e-06,8.7e-05,-0.000261,-2e-05,2.9e-05,-3.3e-05,2.1e-05,2.9e-05,-1e-06,-1.6e-05,-2.9e-05,-5.5e-05,-6.2e-05,2.4e-05,-2.4e-05
-8e-06,-1e-06,1.4e-05,-3e-06,-3.5e-05,-2.5e-05,2e-06,6e-06,8e-06,-2.2e-05,-1.7e-05,0,-8e-06,-3.7e-05,-2.4e-05,-2.5e-05,1.5e-05,4e-06,-5e-06,1.2e-05,-1.2e-05,-1.9e-05,1.3e-05,1.7e-05,1.9e-05,1e-05,1.4e-05,2.4e-05,-3.7e-05,-9e-06,-1.1e-05,-3e-06,-1.2e-05,2.4e-05,-0.00014,-3e-06,-3.9e-05,-0.000165,-9e-06,0.000137,0.000198,-0.000232,-0.000683,6.7e-05,0.000212,0.000172,0.000286,-0.000108,0.000335,-0.000297,-0.000143,-0.000565,-0.002025,-0.000149,-0.000818,0.000521,-2.6e-05,0.000426,0.001281,-7e-05,-0.000642,-0.002046,0.001004,-0.000115,0.002087,-0.000501,-0.000957,-0.001055,0.000962,0.000477,0.00015,-0.001506,0.000542,0.000555,0.000537,0.000635,0.000789,0.000142,0.000232,0.000797,-0.000762,0.000323,0.00059,-9.8e-05,1e-06,7.3e-05,-0.000427,-6.3e-05,1e-04,2.8e-05,0.000556,-5e-05,0.00027,-7.7e-05,7.5e-05,-0.000447,-0.000256,-0.000158,0.000257,0.000309,0.000217,-0.000208,-2.2e-05,1.6e-05,-5.6e-05,-1.2e-05,-3e-05,-5.9e-05,0.000152,9e-06,-0.000143,4e-05,-3.9e-05,-1e-06,-3.4e-05,-1.8e-05,-3.2e-05,-2.4e-05,7e-06,1e-05,-4e-06
-1.8e-05,-1e-05,-1.9e-05,8e-06,-1.5e-05,4e-06,2e-06,-5e-06,5e-06,2e-05,9e-06,3e-06,-2e-06,-9e-06,-1.1e-05,6e-06,-1.5e-05,-1.3e-05,1.2e-05,-1e-05,7e-06,1e-06,-2e-05,-2e-06,5e-06,-1.1e-05,-2e-05,-1e-05,-2e-05,-3e-05,-6e-06,-5e-06,-1.6e-05,1.3e-05,4.8e-05,2e-05,-6.9e-05,0.000289,-2e-06,9.7e-05,4.2e-05,9.4e-05,-0.000191,1.7e-05,-0.000255,-0.000409,8.8e-05,3.4e-05,7e-06,-0.000155,-0.000571,0.000243,-0.000358,-5.8e-05,0.000324,-0.00026,-0.000336,-0.000529,-0.00039,0.000741,-0.001147,0.000839,-0.00072,0.000408,7.7e-05,0.00145,0.001053,8.8e-05,-0.000681,-6.6e-05,0.000411,0.001733,-0.000222,-0.000637,-0.000377,0.000388,0.000371,0.000291,0.000283,-0.000441,0.000353,-0.001049,0.000286,0.000183,3e-04,-0.000279,0.00029,5.2e-05,1.8e-05,-9.6e-05,-0.00044,-0.000433,-0.000455,-0.000369,-1.9e-05,-0.000423,-0.000385,9.2e-05,9.9e-05,-0.000264,-2.1e-05,-0.000184,4.5e-05,1e-06,2.7e-05,-6e-06,-4e-06,1.1e-05,-0.000242,-2e-05,-4.2e-05,-6.5e-05,4.9e-05,2e-06,0,6.3e-05,-2.8e-05,-1.5e-05,1e-05,3e-06,3.3e-05
2.3e-05,-5e-06,-6e-06,8e-06,-3e-06,5e-06,0,7e-06,1.6e-05,1e-05,-1.6e-05,1e-06,-5e-06,1.1e-05,1e-05,0,3e-06,2e-06,-8e-06,-3.6e-05,3e-06,1e-05,1.1e-05,0,-1.6e-05,5e-06,1.7e-05,6e-06,1.9e-05,3e-06,-3e-06,-1e-05,4e-06,3.6e-05,-9e-06,-5e-05,-2.2e-05,-0.000155,-3.4e-05,-4e-05,7e-05,5.8e-05,0.000978,2.9e-05,9.4e-05,-4.4e-05,0.000224,0,-4.6e-05,0,-0.000416,0.000282,5.1e-05,-0.000179,-0.000111,-7.1e-05,0.00012,0.00054,-0.000578,-0.001561,0.000637,0.001392,-0.000568,-7.6e-05,-0.00123,-0.000742,-0.000641,6.6e-05,0,-0.000616,-0.001243,0.000778,1.2e-05,2e-05,0.000682,0.000235,-8.3e-05,-0.000453,-0.000309,-0.000106,-0.000343,0.000142,0.00052,0.000133,-0.000201,-0.000233,8.7e-05,9.6e-05,2.5e-05,5e-05,7.7e-05,0.000368,9.9e-05,-2e-05,1.8e-05,0.000121,-0.000284,8e-05,-3.1e-05,0.000147,7e-05,-6.3e-05,-8.7e-05,-9e-06,4.3e-05,-7.5e-05,3e-06,-1e-06,0.000114,3.5e-05,5.2e-05,2.3e-05,4e-06,-1.3e-05,1.7e-05,-8e-06,1.7e-05,1e-05,-2e-05,-2.5e-05,1.7e-05
4e-06,-5e-06,7e-06,3e-06,-9e-06,-5e-06,8e-06,-5e-06,8e-06,7e-06,-1e-06,-2e-06,0,-8e-06,-6e-06,-3e-06,-3e-06,1e-06,3e-06,-4e-06,-9e-06,9e-06,-7e-06,1.6e-05,-1.1e-05,-1.2e-05,-1.7e-05,3e-06,-6e-06,-1.2e-05,-1.3e-05,0,-7e-06,3.4e-05,3.9e-05,-2.1e-05,-3.7e-05,3.9e-05,-7.6e-05,3.5e-05,-3.3e-05,-0.000187,-0.000725,-0.000142,-1.2e-05,-6.2e-05,-0.00011,-3.9e-05,0.000131,-2e-05,-0.000119,-0.000674,0.000212,0.000185,-0.000375,-0.000621,-0.000181,-0.000745,0.001075,0.000462,0.001323,3.8e-05,-0.00049,-0.000241,0.00038,-3e-05,0.000155,9.3e-05,-0.000376,0.000233,0.000814,-0.000845,0.000673,-4e-05,-0.000758,-0.000178,-0.000423,0.000274,-0.000259,-3.8e-05,0,-0.000209,-0.00024,-0.000243,9.7e-05,-4.9e-05,0.000132,-9.1e-05,5.8e-05,0.000177,-2e-06,-9.8e-05,-0.00022,-5.5e-05,-2.9e-05,7.9e-05,0.000136,1.7e-05,-0.000217,-0.000106,-8.8e-05,0.000207,3e-05,-2e-05,2e-05,-2.5e-05,-1.3e-05,1.3e-05,-1.6e-05,-2.1e-05,6e-06,0,7e-06,3e-06,5e-06,-3e-06,3e-06,1.1e-05,-1.5e-05,7e-06,1.1e-05
-3e-06,-7e-06,-7e-06,-2e-06,1e-06,1e-06,-1.1e-05,3e-06,-6e-06,-7e-06,-1e-06,1e-06,8e-06,1e-06,-4e-06,-2e-06,-1e-06,-4e-06,-4e-06,-5e-06,3e-06,0,3e-06,-1e-05,-1.1e-05,5e-06,5e-06,9e-06,-1e-06,6e-06,5e-06,1e-06,-8e-06,-1.1e-05,-2.3e-05,3.6e-05,8.7e-05,9e-06,9e-06,-9.7e-05,-2.4e-05,5.9e-05,0.000628,-4.1e-05,-3.7e-05,3.8e-05,-0.000108,5.8e-05,-1.4e-05,-5.8e-05,0.000158,0.000534,-0.00049,-0.000104,1.7e-05,-0.000108,-6.9e-05,0.000319,-0.00046,8.1e-05,-0.000224,-0.000124,-7e-06,-9e-05,-0.000132,-0.000417,0.000354,0.00011,-0.000305,0.000542,-0.000475,0.000115,0.000136,9e-05,-2.3e-05,-0.000192,-0.000108,3.1e-05,0.000106,-9.2e-05,3.8e-05,5.9e-05,0.000225,-0.000199,1e-04,0.000242,5e-05,-6.7e-05,4.8e-05,-0.000165,-5e-05,5e-06,0.000183,3.1e-05,-5e-06,-2.6e-05,-1.8e-05,-5e-06,5e-06,3e-05,-9.9e-05,0.000104,-1.8e-05,1.6e-05,-6e-06,-1.4e-05,2e-06,0,9.4e-05,-2e-06,-1e-06,1.1e-05,-1e-06,-3e-06,5e-06,-1.1e-05,-2e-05,-1e-06,2.1e-05,2.1e-05,-2.1e-05
-3e-06,3e-06,2e-06,1e-06,4e-06,7e-06,-7e-06,-2e-06,4e-06,4e-06,-4e-06,1e-06,-7e-06,5e-06,1e-06,2e-06,-6e-06,0,4e-06,0,-1e-06,-7e-06,-1e-06,-2e-06,1e-06,-2e-06,-6e-06,-9e-06,9e-06,8e-06,0,2e-06,-9e-06,8e-06,-2.5e-05,-1e-06,-3.4e-05,-0.000107,-3.4e-05,6.7e-05,8.5e-05,2.4e-05,-0.000205,0.000106,1.2e-05,0.000172,-2.8e-05,-8e-05,-5.7e-05,1.1e-05,0.001903,0.000631,-0.000368,-7.8e-05,3.9e-05,0.000295,-0.000483,-0.000296,0.000596,-0.000334,-0.000334,0.000836,-0.000142,-0.000476,0.000394,0.000548,-0.000481,-0.00035,-0.000159,-0.000166,0.000242,-8.2e-05,-0.000307,8e-06,-8.7e-05,0.000308,-0.000362,-0.000306,0.000179,0.000222,-1.3e-05,0.000292,-9.1e-05,8.9e-05,-0.000155,-1.2e-05,-0.000239,5.8e-05,-3.2e-05,0.000129,4.2e-05,-1.4e-05,4.1e-05,-3e-06,-6e-06,-1.6e-05,0.000181,-9e-06,6e-05,-2.1e-05,-6.2e-05,-1.3e-05,-2e-06,5e-06,-9e-06,1.8e-05,7e-06,-1e-06,-3.2e-05,-1.2e-05,-9e-06,-2e-05,1.1e-05,-3e-06,-7e-06,6e-06,4e-06,9e-06,-1.9e-05,3e-06,6e-06
0,2e-06,-4e-06,-3e-06,2e-06,-5e-06,1e-06,0,0,-2e-06,0,-1e-06,8e-06,-1e-06,4e-06,0,1e-06,-1e-06,0,9e-06,-3e-06,1e-06,1e-06,-2e-06,6e-06,3e-06,3e-06,0,-3e-06,4e-06,-3e-06,1e-06,-1.4e-05,4e-06,4.2e-05,-2.9e-05,3e-06,2.6e-05,3.2e-05,-1.2e-05,7e-06,-4e-05,-0.00012,7e-06,3.1e-05,0.000126,-9e-05,4.6e-05,0,2.5e-05,-0.001489,-0.000422,0.000115,0.000175,0.000174,0.000105,0.000167,0.000122,0.000333,0.000484,-3e-05,0.000207,6.4e-05,0.000458,0.00028,-0.000283,-0.000189,0.000112,-0.000113,-0.000276,-0.000397,-8.2e-05,5.9e-05,-3.3e-05,0.000417,-0.000157,0.000222,5.3e-05,0.000114,-8.5e-05,9.2e-05,-0.000149,-0.000122,-5.9e-05,6.3e-05,4.4e-05,4.2e-05,1.1e-05,0.000107,-5.7e-05,-0.000102,-1.1e-05,-3.6e-05,-4.3e-05,-1e-05,-6.1e-05,0.000229,-2.3e-05,-0.000137,2.8e-05,-9e-06,8e-06,-7e-06,1.4e-05,-1e-06,2.4e-05,-6e-06,1.3e-05,5.7e-05,9e-06,-5e-06,1.8e-05,1.6e-05,-2e-06,-3e-06,-1.5e-05,3e-06,-8e-06,1e-06,1.4e-05,-1.4e-05
-3e-06,-2e-06,-2e-06,-4e-06,-7e-06,-5e-06,-5e-06,-2e-06,-3e-06,1e-06,-1e-06,1e-06,-2e-06,0,-5e-06,-3e-06,4e-06,-3e-06,-3e-06,-1e-06,1e-06,-1e-06,-1e-06,3e-06,9e-06,1e-06,0,-5e-06,-3e-06,9e-06,-1.5e-05,-1e-06,-6e-06,2e-06,-2e-05,-6e-06,-2.7e-05,-2.3e-05,2e-06,-6e-06,-2.4e-05,3.9e-05,6.2e-05,4.4e-05,-7.4e-05,-0.000122,3.9e-05,-6.6e-05,-6e-06,-2.6e-05,-6.5e-05,0.000284,0.000118,6e-05,-5.2e-05,0.000127,-0.000119,-9.9e-05,-0.000518,0.000211,-0.000378,-0.000505,0.000171,-0.000486,-4.6e-05,0.000314,-0.000116,0.000307,3.5e-05,7.5e-05,0.00034,0.000173,0.000209,-8.3e-05,-6.7e-05,-0.000242,7.1e-05,0.000148,-0.000141,0.000219,-5.9e-05,-0.000226,-0.000116,-4.1e-05,9e-06,-0.000178,1.6e-05,6e-06,-0.000126,4.5e-05,9.5e-05,4.4e-05,-1e-04,-4.4e-05,7e-06,5.5e-05,2e-06,1.9e-05,-7.9e-05,5e-06,-4.1e-05,-2.8e-05,1e-06,1.1e-05,-2e-06,5e-06,-2e-06,-1.7e-05,-4.3e-05,0,9e-06,-9e-06,-4e-06,-1e-06,3e-06,5e-06,-1.1e-05,-1e-06,4e-06,2e-06,0
-2e-06,0,-1e-06,0,-2e-06,1e-06,4e-06,2e-06,6e-06,-4e-06,-2e-06,0,-2e-06,-7e-06,0,-3e-06,2e-06,1e-06,1e-06,2e-06,-1e-06,0,1e-06,4e-06,1e-06,-2e-06,-1e-06,0,-4e-06,-1e-06,-2e-06,-1e-06,-6e-06,2e-06,-2e-06,4e-05,3.6e-05,1.2e-05,-1.4e-05,7e-06,-5e-06,1.2e-05,3.4e-05,-2e-05,7e-05,2.9e-05,0.000137,4.3e-05,2e-06,-2.5e-05,6.1e-05,-9.9e-05,-0.000254,-5e-05,0.000221,-0.000132,-0.000142,-0.000127,0.000207,-0.000164,-0.00021,-0.00022,0.000236,1.9e-05,-0.000258,-0.000271,0.000295,5.8e-05,0.000171,6.7e-05,-0.000256,-6.5e-05,-7.8e-05,-2.1e-05,0.000104,0.000142,-0.000161,-5.2e-05,1.3e-05,-0.000208,2.3e-05,7e-05,0.000159,2.3e-05,-5.5e-05,7.9e-05,8.3e-05,-3.8e-05,-3.7e-05,-5e-05,-8e-05,-4.3e-05,-3e-05,-4.7e-05,1.1e-05,3.6e-05,4.1e-05,-9e-06,3.2e-05,-5.1e-05,8e-05,-3.3e-05,-8e-06,-6e-06,-3e-06,1e-06,3e-06,3e-06,6.1e-05,2e-06,-3e-06,6e-06,6e-06,-1e-06,-1e-06,-2e-06,-1.2e-05,-1e-05,-3e-06,-3e-06,6e-06
2e-06,-3e-06,-4e-06,0,-2e-06,-4e-06,0,0,5e-06,1e-06,-1e-06,1e-06,-1e-06,-3e-06,3e-06,-1e-06,-3e-06,-1e-06,1e-06,5e-06,-1e-06,-2e-06,-1e-06,-3e-06,-5e-06,0,3e-06,0,-1e-06,4e-06,2e-06,0,-7e-06,2e-06,-9e-06,-4.4e-05,9e-06,2e-06,5e-06,-1.9e-05,4.7e-05,3e-06,1.9e-05,-4.3e-05,-8.4e-05,-0.000127,-4.1e-05,-2e-05,-1e-06,1.7e-05,-0.00018,-0.000102,-0.000419,5.1e-05,-3e-04,-0.000329,-2.1e-05,0.00011,-0.00023,-0.00025,0.000387,0.000162,-3.5e-05,0.000261,0.000454,-2.6e-05,7e-06,-0.00028,0.000141,-0.000122,0.000173,4.9e-05,-3e-06,-1.2e-05,-8.2e-05,0.000108,-1e-05,-0.000105,3.2e-05,-8.4e-05,-1.2e-05,-0.000144,5.9e-05,2.7e-05,0.000109,3e-05,-0.000104,2.9e-05,-1.2e-05,5e-05,7e-06,6e-06,0.00016,3e-06,-2e-05,-9.6e-05,4.4e-05,-1.1e-05,4.4e-05,5.8e-05,1.3e-05,-4.9e-05,5e-06,-1e-06,5e-06,9e-06,-6e-06,-4e-06,-4.7e-05,3e-06,-1e-06,-4e-06,-2e-06,0,4e-06,0,-3e-06,2e-06,-7e-06,-1e-06,1.8e-05
2e-06,-3e-06,1e-06,2e-06,1e-06,1e-06,-2e-06,-1e-06,1e-06,1e-06,-2e-06,0,-1e-06,5e-06,-1e-06,0,2e-06,-1e-06,1e-06,-2e-06,0,0,0,3e-06,-4e-06,1e-06,-5e-06,0,-1e-06,-4e-06,-3e-06,-1e-06,-2e-06,0,0,2.1e-05,3e-06,-1.3e-05,-2e-06,9e-06,1.2e-05,-2.2e-05,-0.000122,-1e-06,8e-05,-3.2e-05,-3.5e-05,7e-06,-3e-06,-2e-06,0.000171,0.000182,-0.000432,-6e-05,0.000235,-0.000116,0.000117,2.5e-05,-0.000107,0.000149,0.000283,-0.000123,-0.000156,-4.4e-05,-0.000388,9e-06,-0.000368,-3.3e-05,-0.000115,2.4e-05,-9.7e-05,-0.000316,-5.8e-05,-0.000104,7.9e-05,4.1e-05,-0.000283,2.6e-05,-4.7e-05,6.9e-05,1e-05,8.7e-05,-2.4e-05,6e-05,-6.5e-05,7.1e-05,-2e-05,6e-06,-3e-05,-2.3e-05,1.3e-05,3.7e-05,-1.1e-05,-1.1e-05,-1e-06,-6.3e-05,-4.3e-05,-5e-06,-7.8e-05,-7e-05,-1.3e-05,-6e-06,-6e-06,-5e-06,8e-06,6e-06,-4e-06,3e-06,3.1e-05,-8e-06,-8e-06,-1e-06,-5e-06,-4e-06,1e-06,5e-06,0,1e-06,5e-06,-6e-06,-6e-06
0,-1e-06,-1e-06,1e-06,-2e-06,4e-06,-1e-06,-1e-06,4e-06,1e-06,1e-06,0,1e-06,-2e-06,-1e-06,-2e-06,-1e-06,1e-06,-1e-06,0,-1e-06,3e-06,0,-2e-06,-6e-06,-1e-06,3e-06,1e-06,-1e-06,-2e-06,-1e-05,0,-3e-06,0,2.1e-05,-5e-06,-2e-05,1.6e-05,9e-06,-7e-06,-3e-05,3.2e-05,9e-05,1.1e-05,-6.2e-05,4.1e-05,1e-06,-1.2e-05,-2e-06,-2.7e-05,9.7e-05,-1.8e-05,0.000345,5.5e-05,8.9e-05,-5.7e-05,-2.4e-05,-0.000121,-7e-06,-4.6e-05,-0.000149,-0.000436,5e-05,-0.000213,0.00023,0.000112,0.000176,-8e-06,0.000106,0.000105,0.000104,-0.000136,8.1e-05,8.1e-05,-0.000107,-9.1e-05,4.7e-05,-3.6e-05,-7e-06,-2.3e-05,-6.5e-05,6.9e-05,-0.000145,-1.3e-05,-1.7e-05,-6.5e-05,2.7e-05,-2e-06,-1.5e-05,2.3e-05,-4.6e-05,-4e-05,-3.9e-05,-9e-06,1.2e-05,3.7e-05,-9.7e-05,-2e-06,-4e-05,5.7e-05,1.8e-05,2e-05,-1.5e-05,-3e-06,1e-06,1e-06,4e-06,-8e-06,-1.1e-05,1e-06,5e-06,2e-06,6e-06,-1e-06,-3e-06,2e-06,-4e-06,-2e-06,-3e-06,4e-06,-6e-06
-2e-06,-1e-06,0,1e-06,-1e-06,-2e-06,-1e-06,-1e-06,3e-06,-1e-06,-3e-06,0,-1e-06,0,2e-06,-2e-06,1e-06,-1e-06,0,0,0,2e-06,-1e-06,-1e-06,-1e-06,0,-4e-06,2e-06,0,-4e-06,2e-06,0,-3e-06,0,-1.3e-05,-1.3e-05,2e-06,2.6e-05,-1.1e-05,9e-06,0,-2.1e-05,-6.9e-05,1.6e-05,2.7e-05,5.4e-05,-1.1e-05,0,-4e-06,1e-06,0.000145,-3.5e-05,0.000124,-9.3e-05,-3.8e-05,-1.2e-05,-0.000233,0.000155,-0.000104,4e-05,-0.000195,-4.5e-05,2.3e-05,6.3e-05,-7e-05,-9.5e-05,-0.000148,1.6e-05,-6e-05,6.2e-05,-0.000252,-0.000111,-6.1e-05,-3.2e-05,3.6e-05,7.6e-05,6.6e-05,4.5e-05,-8e-06,0.000113,5.1e-05,-1.2e-05,9.3e-05,-1e-06,4.8e-05,-4e-05,-4.2e-05,-1.1e-05,2.8e-05,-1e-05,2.9e-05,-1.2e-05,-2.8e-05,-9e-06,-9e-06,1.2e-05,-4.8e-05,-1e-06,5.2e-05,-2.4e-05,-4.2e-05,4.2e-05,8e-06,1e-06,-6e-06,0,-2e-06,5e-06,1.1e-05,5e-06,6e-06,4e-06,-3e-06,2e-06,0,-4e-06,-1e-06,0,-5e-06,7e-06,-9e-06
1e-06,1e-06,0,1e-06,2e-06,-1e-06,0,1e-06,0,-1e-06,1e-06,0,3e-06,2e-06,0,0,-3e-06,0,1e-06,-3e-06,-1e-06,0,1e-06,1e-06,2e-06,1e-06,4e-06,-2e-06,0,-3e-06,1e-06,0,-2e-06,1e-06,1e-06,1.9e-05,0,-4.8e-05,1e-05,-1.6e-05,1.9e-05,-2.8e-05,0.00011,-8e-06,-5e-06,3.9e-05,2.5e-05,1.6e-05,-2e-06,1.4e-05,0.000264,9.3e-05,-0.000227,-3e-06,-2.2e-05,9.1e-05,1.7e-05,-0.000158,5.2e-05,0.000165,1.7e-05,0.000361,-5.6e-05,2e-06,-6.5e-05,3e-05,-6.2e-05,-0.000233,1.5e-05,-3.6e-05,0.000322,0.000135,-2.7e-05,-6.6e-05,-0.000176,0.000134,3.3e-05,4.2e-05,-1.5e-05,-0.000105,-2.8e-05,0.000123,2.5e-05,4.9e-05,-2.8e-05,-1.6e-05,3e-05,-9e-06,3.2e-05,1.9e-05,-5e-05,2.5e-05,-1.8e-05,-1.3e-05,-4e-06,3.7e-05,-4.3e-05,1e-05,1.8e-05,-7e-06,1e-06,2.4e-05,-1e-06,6e-06,-1e-06,-7e-06,-2e-06,2e-06,-9e-06,-9e-06,-1e-05,-1.2e-05,0,-1e-06,0,-1e-06,-4e-06,-1e-06,2e-06,-1e-06,7e-06
1e-06,1e-06,0,0,0,1e-06,1e-06,0,2e-06,-1e-06,0,0,-2e-06,-2e-06,-2e-06,1e-06,0,1e-06,0,-1e-06,1e-06,-1e-06,0,0,4e-06,0,-3e-06,-1e-06,0,-1e-06,-4e-06,0,-6e-06,-1e-06,-1e-06,-7e-06,1.2e-05,3.4e-05,-3e-06,8e-06,-3e-06,4e-05,-0.00018,-1.2e-05,-1.9e-05,3.5e-05,-2e-06,-2.3e-05,-1e-06,-1.4e-05,-0.000577,-8.5e-05,2.1e-05,-4e-06,6.5e-05,7.9e-05,4e-06,0.000176,-1.4e-05,-0.000172,-0.000129,-0.000101,0.000126,9.4e-05,-6.5e-05,-4.7e-05,8.9e-05,-5.5e-05,-2e-05,-6e-05,-0.000243,0.000226,6.5e-05,6e-05,3.1e-05,-0.000132,7.1e-05,-4.6e-05,-7.3e-05,4.1e-05,-3e-06,-8.6e-05,-5.2e-05,1.8e-05,-2e-05,9e-06,-1.4e-05,1.1e-05,-4e-06,-1e-05,3.9e-05,5e-06,6e-06,-1.4e-05,1.1e-05,-7.9e-05,-6.9e-05,-4e-06,-3.8e-05,2.3e-05,-2.4e-05,-2.1e-05,-1.2e-05,4e-06,3e-06,-8e-06,4e-06,1e-06,2.1e-05,1.1e-05,-1e-06,8e-06,1e-06,1e-06,0,3e-06,-4e-06,4e-06,1e-06,2e-06,0
0,0,1e-06,-1e-06,-2e-06,-2e-06,-1e-06,0,1e-06,-1e-06,-2e-06,0,1e-06,1e-06,1e-06,-1e-06,0,-1e-06,0,-1e-06,0,0,0,1e-06,2e-06,-1e-06,2e-06,1e-06,-1e-06,-3e-06,-5e-06,-1e-06,-4e-06,0,-1e-06,-9e-06,-5e-06,-1.7e-05,0,-1.2e-05,-1.3e-05,-3.5e-05,5.7e-05,-3e-06,1.1e-05,-5.4e-05,-1.7e-05,1e-05,-1e-06,-1e-05,-8.2e-05,2.4e-05,9.5e-05,1.3e-05,3.6e-05,3e-05,5e-06,-0.000149,8.2e-05,6.3e-05,-8.2e-05,-4e-06,4.3e-05,-0.00017,0.000233,6.4e-05,-4.9e-05,5.1e-05,2e-06,-3e-06,0.000161,-0.000147,-2.3e-05,-3.4e-05,5.7e-05,-1.9e-05,-3.7e-05,2.9e-05,-1.2e-05,-3.6e-05,5e-06,-9.9e-05,5.3e-05,-2.7e-05,1.2e-05,4.3e-05,7.1e-05,-3e-06,5.2e-05,0,-3.8e-05,9e-06,8e-06,-1e-05,-4e-06,-9e-06,2.5e-05,0,-2e-05,-2.6e-05,-2.2e-05,-3e-05,1.1e-05,1e-06,1e-06,0,-1e-06,2e-06,-6e-06,-7e-06,3e-06,-3e-06,-3e-06,-4e-06,1e-06,-6e-06,-3e-06,-1e-06,-6e-06,-1e-06,3e-06
-1e-06,-1e-06,-2e-06,-1e-06,-1e-06,-2e-06,-1e-06,0,1e-06,-1e-06,1e-06,0,0,-2e-06,0,-1e-06,1e-06,0,0,-2e-06,0,1e-06,0,-1e-06,-1e-06,0,-1e-06,-1e-06,0,3e-06,3e-06,0,-3e-06,0,5e-06,4e-06,-2.1e-05,-1.6e-05,2e-06,8e-06,-1.8e-05,3e-06,0.000132,3e-06,2e-06,-7e-05,9e-06,-1.4e-05,1e-06,1.3e-05,0.000269,1e-06,9.1e-05,-2.3e-05,-5e-05,-5e-06,-4.6e-05,0.00017,0.000117,6.8e-05,0.000245,0.00011,-1.7e-05,-1.3e-05,-0.000191,-3.6e-05,6e-05,5.3e-05,9e-06,6e-06,-4.2e-05,-8.1e-05,7.4e-05,-2.2e-05,5.5e-05,-2.2e-05,-4.3e-05,1.8e-05,2.2e-05,-7e-06,1.4e-05,4.8e-05,-1.8e-05,7e-06,8e-06,-1.5e-05,-4.2e-05,1e-06,-1.9e-05,2e-06,4e-06,-1.6e-05,-4e-06,-4e-06,-6e-06,3.3e-05,2e-06,1e-06,4.8e-05,1.9e-05,1.3e-05,5e-06,-7e-06,-2e-06,-2e-06,-2e-06,-4e-06,1e-06,1.8e-05,2e-06,3e-06,2e-06,-1e-06,2e-06,0,1e-06,-3e-06,-1e-06,3e-06,-6e-06,1e-06
0,0,0,0,1e-06,2e-06,0,0,1e-06,-1e-06,-1e-06,0,-1e-06,-1e-06,-1e-06,0,-1e-06,0,1e-06,-1e-06,1e-06,-1e-06,0,0,-1e-06,1e-06,0,-1e-06,0,0,2e-06,0,-4e-06,0,-8e-06,7e-06,7e-06,2.4e-05,-3e-06,-8e-06,1.8e-05,7e-06,-0.000124,8e-06,-1.3e-05,1.2e-05,-1e-05,1.1e-05,0,-1e-06,-7.8e-05,7e-06,-4.9e-05,1.3e-05,-3.3e-05,-4e-05,5.2e-05,-0.000129,-5.2e-05,-0.000107,0.000131,0.000124,-2e-05,7.5e-05,0.000171,7e-06,-0.000162,-1.5e-05,2.8e-05,-2.1e-05,6e-06,7.9e-05,-4e-05,2.3e-05,-3e-05,6.7e-05,9.1e-05,-2.6e-05,5e-06,5.8e-05,-1.7e-05,1.8e-05,6.9e-05,-4e-06,-1.5e-05,-2e-06,-2.8e-05,-6e-06,1.1e-05,-4e-06,6e-06,-2.1e-05,-2.7e-05,-7e-06,6e-06,1.1e-05,2.4e-05,2e-06,1.3e-05,-1.9e-05,9e-06,1.3e-05,-1e-06,-3e-06,-1e-06,-2e-06,2e-06,-1e-06,-2.4e-05,2e-06,-1e-06,-3e-06,-4e-06,1e-06,0,2e-06,-2e-06,0,0,1e-06,0
0,-1e-06,-1e-06,0,-1e-06,1e-06,-1e-06,0,1e-06,0,0,0,1e-06,3e-06,0,0,0,-1e-06,0,0,0,-1e-06,0,0,-3e-06,0,1e-06,1e-06,0,4e-06,-4e-06,0,-2e-06,0,5e-06,-7e-06,3e-06,-2.2e-05,5e-06,8e-06,-6e-06,-6e-06,2e-05,4e-06,2.5e-05,-2e-05,-5e-06,-2.1e-05,0,-1.6e-05,0.000112,3.1e-05,-8.1e-05,-6e-06,-3e-06,-2.2e-05,0,7.2e-05,-1.5e-05,2e-05,-0.000211,-9.6e-05,-8.9e-05,2e-06,-0.000106,-1.2e-05,1.5e-05,-0.000124,-2.1e-05,4e-06,2e-05,-7.9e-05,1.5e-05,-4e-05,5e-05,-3.6e-05,-2.7e-05,6e-06,-2.7e-05,-3.3e-05,3e-06,1.4e-05,-0.000158,-1.3e-05,0,-2.7e-05,1.5e-05,2e-06,-4e-05,3e-06,-2.3e-05,2.1e-05,-6e-06,-4e-06,0,-3.2e-05,8.9e-05,2e-06,-3.9e-05,2e-05,-7e-06,-2e-06,-3e-06,-3e-06,1e-06,2e-06,0,-3e-06,2.8e-05,-3e-06,-1e-06,5e-06,2e-06,1e-06,0,1e-06,-3e-06,0,-5e-06,-1e-06,-6e-06
0,-1e-06,0,0,0,-2e-06,0,0,1e-06,0,0,0,-1e-06,-1e-06,1e-06,-1e-06,0,0,0,-1e-06,0,0,0,0,-2e-06,-1e-06,-2e-06,1e-06,0,2e-06,-5e-06,0,-3e-06,0,3e-06,-7e-06,1.4e-05,2.5e-05,-4e-06,-7e-06,-7e-06,-5e-06,1.4e-05,0,-4.1e-05,5.6e-05,3.6e-05,1.2e-05,1e-06,2e-06,-2e-06,-3.3e-05,0.000159,3.1e-05,-8.1e-05,2.1e-05,-0.000132,3.7e-05,7.8e-05,1.7e-05,-7.1e-05,-2.5e-05,-4e-05,-7.7e-05,-3.5e-05,-1e-05,5.3e-05,2.1e-05,-1e-05,5.1e-05,-3e-06,8.7e-05,7e-06,-3.6e-05,6e-06,-7.5e-05,0.000122,-1.7e-05,-2.9e-05,2.8e-05,6e-06,5.1e-05,9.3e-05,-9e-06,1.1e-05,3.4e-05,-3e-06,7e-06,-1e-05,-6e-06,1.6e-05,1.3e-05,2.4e-05,-6e-06,-4e-06,-1.9e-05,1.8e-05,-1e-06,-6e-06,-1.1e-05,1.5e-05,1e-06,-1e-06,1e-06,1e-06,-1e-06,-3e-06,0,-1.9e-05,4e-06,-1e-06,-4e-06,-1e-06,-3e-06,0,-2e-06,-1e-06,0,2e-06,1e-06,-2e-06
0,1e-06,0,0,-1e-06,1e-06,0,0,1e-06,1e-06,-1e-06,0,1e-06,0,-1e-06,-1e-06,1e-06,0,0,1e-06,1e-06,1e-06,0,1e-06,0,0,3e-06,-1e-06,-1e-06,1e-06,2e-06,0,-3e-06,0,-1e-06,1.3e-05,-1.2e-05,-2e-05,2e-06,2e-06,-1.7e-05,7e-06,-6e-06,-6e-06,3.9e-05,4e-05,-1.3e-05,-4e-06,0,7e-06,-1.5e-05,1.1e-05,0.000151,-2.4e-05,0.000101,3.8e-05,-1e-05,-6.3e-05,-9.5e-05,-4.5e-05,9.7e-05,-4e-05,2e-05,-1.1e-05,1.3e-05,2.1e-05,-9.7e-05,0,7e-06,1.8e-05,2.1e-05,3.1e-05,-2.4e-05,2.2e-05,-1.7e-05,0.000105,-4.8e-05,1e-06,2e-05,-4.9e-05,-1.1e-05,-6e-05,-2.9e-05,-2e-05,-8e-06,-3e-06,2.7e-05,-4e-06,-1.6e-05,9e-06,-2.5e-05,-6e-06,3.1e-05,-6e-06,4e-06,-1.2e-05,1.7e-05,-5e-06,3.4e-05,1e-06,-5e-06,3e-06,-1e-06,0,-1e-06,1e-06,2e-06,-2e-06,2e-05,-1e-06,2e-06,4e-06,-3e-06,0,1e-06,3e-06,-2e-06,-2e-06,1e-06,2e-06,4e-06
0,0,0,1e-06,1e-06,0,1e-06,0,0,0,0,0,-1e-06,1e-06,-1e-06,0,-1e-06,0,0,1e-06,0,1e-06,0,0,1e-06,1e-06,-3e-06,1e-06,0,1e-06,1e-06,0,-2e-06,0,1e-06,-1e-05,-6e-06,8e-06,-3e-06,0,1.3e-05,5e-06,-2e-06,1e-06,-3e-05,2e-06,-1.6e-05,-1e-06,0,-1.1e-05,-2.2e-05,2.2e-05,-2.8e-05,6e-06,-7.7e-05,4.4e-05,1.3e-05,7.2e-05,2.8e-05,1.7e-05,-8.8e-05,3.7e-05,-2.5e-05,-8e-06,3.9e-05,2.2e-05,9.6e-05,7.8e-05,-3e-05,-1.8e-05,-3.5e-05,-3e-05,2.3e-05,-3.1e-05,-7.3e-05,-8e-06,3.6e-05,3.1e-05,1.1e-05,2e-05,1.2e-05,2e-05,5e-05,0,3e-06,7e-06,-4.7e-05,-3e-06,-5e-06,-8e-06,1.6e-05,-1.4e-05,8e-06,-5e-06,1e-06,3.6e-05,1.3e-05,-3e-06,6e-06,2e-06,-2.1e-05,2e-06,1e-06,2e-06,-1e-06,4e-06,2e-06,1e-06,-1.2e-05,0,0,-6e-06,2e-06,1e-06,0,-1e-06,-3e-06,0,-4e-06,-2e-06,5e-06
0,0,0,0,0,-2e-06,-1e-06,0,1e-06,0,-1e-06,0,1e-06,-1e-06,1e-06,0,-1e-06,0,0,0,0,0,0,0,2e-06,0,3e-06,0,0,-2e-06,-5e-06,0,-3e-06,0,-5e-06,2e-06,4e-06,5e-06,3e-06,-2e-06,-4e-06,-1.1e-05,-5e-06,3e-06,1.5e-05,-3.4e-05,5e-06,0,0,-6e-06,-0.000149,-3.4e-05,-3.6e-05,-1.3e-05,-2.5e-05,2.7e-05,1.6e-05,-6.3e-05,-1.7e-05,2.7e-05,-3.5e-05,-6.4e-05,5.6e-05,6.8e-05,-6.2e-05,-3.9e-05,-5.8e-05,-5.6e-05,-1.6e-05,-2.6e-05,6.3e-05,8e-05,-6.1e-05,-1.6e-05,-1.1e-05,-1.9e-05,-2e-05,-1e-05,1e-06,1.8e-05,-1e-05,-3e-05,-3.7e-05,0,0,-2e-05,3.9e-05,-1e-06,-1.2e-05,9e-06,-2e-05,-1.7e-05,-3.3e-05,-5e-06,-5e-06,1e-06,-1.6e-05,0,-3.1e-05,-7e-06,5e-06,-6e-06,-2e-06,0,1e-06,1e-06,-2e-06,-1e-06,1.4e-05,0,0,3e-06,0,1e-06,0,0,-2e-06,1e-06,2e-06,0,0
0,0,0,0,-1e-06,0,0,0,0,-1e-06,0,0,-1e-06,1e-06,0,0,0,0,0,1e-06,0,0,0,0,1e-06,0,-2e-06,1e-06,0,0,-3e-06,0,-2e-06,0,2e-06,4e-06,1.1e-05,-7e-06,-1e-06,2e-06,-6e-06,1.3e-05,4.1e-05,2e-06,0,-2e-05,-1e-05,-2e-06,0,1e-05,2.1e-05,2e-06,-1.4e-05,1.8e-05,3.8e-05,4e-06,-8e-05,3.2e-05,-0.000112,-1.3e-05,0.000162,3.6e-05,6.8e-05,-8.9e-05,8.1e-05,-1.3e-05,-2.4e-05,-6.4e-05,2e-06,-9e-06,-6.5e-05,-3.3e-05,0,2e-05,-2e-06,-3e-06,2.2e-05,-2e-05,-8e-06,-1.4e-05,1.3e-05,-2.5e-05,-1.7e-05,-1.5e-05,-6e-06,-2e-06,-2.8e-05,4e-06,2e-05,-9e-06,4e-06,4e-05,-3e-06,-4e-06,2e-06,-2.5e-05,-3.7e-05,2e-06,-2e-06,1.5e-05,-1.6e-05,-1.3e-05,-4e-06,1e-06,1e-06,0,1e-06,1e-06,-7e-06,0,-2e-06,-2e-06,-2e-06,-1e-06,0,1e-06,-2e-06,0,-1e-06,-2e-06,-4e-06
0,-1e-06,0,0,0,1e-06,0,0,0,0,0,0,0,-1e-06,0,-1e-06,0,0,0,0,0,0,0,0,0,0,2e-06,-1e-06,0,-3e-06,4e-06,0,-3e-06,0,1e-06,-9e-06,1e-06,-6e-06,0,-3e-06,-3e-06,-3e-06,-4.9e-05,-2e-06,-1.3e-05,-4.4e-05,1.3e-05,0,0,-1e-06,0.00021,6e-06,5.9e-05,-6e-06,-8e-06,-1e-05,4.6e-05,1.3e-05,0.00013,1.4e-05,7e-06,-3.7e-05,-3.2e-05,5e-06,-4.7e-05,3.8e-05,3.6e-05,-5.7e-05,1e-06,-2e-06,4.2e-05,5.3e-05,-1.6e-05,-3.9e-05,2.7e-05,-1.2e-05,-2e-06,2.4e-05,-4e-06,1.4e-05,-4e-06,2.5e-05,4.6e-05,-1e-06,9e-06,2e-06,1e-05,2e-06,1.9e-05,8e-06,-2e-06,0,6e-06,-4e-06,3e-06,-6e-06,-4e-05,3e-06,2.7e-05,-1.7e-05,2e-06,-5e-06,4e-06,-2e-06,-1e-06,1e-06,2e-06,1e-06,7e-06,-1e-06,0,1e-06,0,-1e-06,0,-1e-06,-3e-06,0,-2e-06,-2e-06,-1e-06
0,0,0,0,0,-1e-06,0,0,0,-1e-06,-1e-06,0,0,-1e-06,1e-06,0,0,0,0,0,0,0,0,0,-1e-06,0,-1e-06,0,0,-1e-06,0,0,-3e-06,0,-1e-06,6e-06,-8e-06,1.5e-05,1e-06,4e-06,0,1e-06,2.3e-05,-5e-06,1.2e-05,1.6e-05,5e-06,-8e-06,0,-1e-05,-8.3e-05,-4.4e-05,-3e-06,1e-06,1.7e-05,-2e-05,1.1e-05,-6.3e-05,-7e-06,-4e-06,-0.000151,3.9e-05,-8e-06,2.8e-05,-3.5e-05,-2.3e-05,-8.8e-05,3.1e-05,1.3e-05,-1e-06,-4.7e-05,-1e-06,-5e-06,2e-06,2.9e-05,5.6e-05,2.5e-05,-1e-05,-4e-06,-3.3e-05,-1e-06,2.6e-05,-3e-05,5e-06,-6e-06,5e-06,-1.3e-05,-5e-06,-1e-06,-1e-05,-6e-06,-1.8e-05,-2e-06,-4e-06,-3e-06,1.1e-05,-1.8e-05,1e-06,1e-06,1.2e-05,3e-06,1.2e-05,-8e-06,0,-1e-06,-1e-06,-2e-06,0,-8e-06,1e-06,1e-06,-3e-06,1e-06,1e-06,0,-1e-06,-2e-06,0,0,1e-06,-2e-06
0,0,0,-1e-06,0,0,1e-06,0,1e-06,0,1e-06,0,0,2e-06,0,0,0,0,0,0,0,0,0,0,-2e-06,0,0,0,0,-1e-06,-5e-06,0,-2e-06,0,1e-06,-1e-06,-5e-06,-1.4e-05,-2e-06,-6e-06,4e-06,-3e-06,-2.4e-05,0,-9e-06,4.5e-05,-7e-06,5e-06,0,5e-06,1.3e-05,2.6e-05,-6.4e-05,-5e-06,-5.8e-05,-1.5e-05,-7.9e-05,6.7e-05,-0.000119,-3.4e-05,3.1e-05,3e-06,1.2e-05,-6.7e-05,7.4e-05,1.2e-05,8.3e-05,2.3e-05,5e-06,1.4e-05,8e-05,-2.5e-05,-2.5e-05,1.9e-05,2e-06,-7.9e-05,-5.1e-05,-1.6e-05,-1e-05,1.7e-05,5e-06,-3.1e-05,1e-06,-3e-06,-2e-06,8e-06,1.4e-05,2e-06,2.6e-05,8e-06,0,-1.6e-05,-1e-06,-4e-06,0,1e-05,-3.7e-05,-1e-06,-2.8e-05,-3e-06,-5e-06,1.5e-05,3e-06,-1e-06,0,-1e-06,0,0,1e-05,0,-1e-06,6e-06,0,0,0,0,-1e-06,1e-06,0,0,2e-06
0,0,0,0,0,1e-06,-1e-06,0,0,0,-1e-06,0,0,-1e-06,-1e-06,0,0,0,0,-1e-06,0,0,0,0,-1e-06,0,1e-06,1e-06,0,0,-2e-06,0,-3e-06,0,0,-5e-06,5e-06,2e-06,1e-06,6e-06,-2e-06,6e-06,7e-05,3e-06,-1e-06,1.4e-05,6e-06,-4e-06,0,6e-06,-8.1e-05,-2.7e-05,-2e-05,1.8e-05,3.7e-05,-4e-06,-3.3e-05,-7.2e-05,0.000123,9e-06,6.7e-05,6.2e-05,-5.8e-05,2.3e-05,-6.8e-05,-1e-06,-2.9e-05,-6.1e-05,2e-06,2.5e-05,-0.00011,-6.8e-05,-1.7e-05,-4.2e-05,1.5e-05,8e-06,2.3e-05,2.1e-05,-6e-06,1e-06,-1e-06,2.8e-05,-1.3e-05,9e-06,8e-06,-1.1e-05,1.8e-05,-1e-06,-7e-06,-1e-05,-5e-06,1.5e-05,-1.2e-05,-4e-06,3e-06,-2.1e-05,1.6e-05,-1e-06,-2e-06,-2e-06,9e-06,-1e-06,-2e-06,0,1e-06,1e-06,2e-06,1e-06,-9e-06,-1e-06,-1e-06,-4e-06,-1e-06,0,0,2e-06,-2e-06,-1e-06,-3e-06,2e-06,2e-06
0,0,0,0,0,-1e-06,0,0,0,1e-06,0,0,0,0,0,-1e-06,0,0,0,-1e-06,0,0,0,0,0,0,-2e-06,-1e-06,0,1e-06,3e-06,0,-2e-06,0,1e-06,4e-06,1e-05,1e-05,-1e-06,-6e-06,0,-1e-06,-8.8e-05,2e-06,1.5e-05,1.8e-05,-1e-05,1e-06,0,-1e-05,3.5e-05,-2e-06,4.7e-05,-1.4e-05,4.2e-05,-4e-06,1.2e-05,4.5e-05,6e-06,9e-06,-9.1e-05,-8.3e-05,9e-06,2.1e-05,5.4e-05,-2e-06,-2.6e-05,-2.6e-05,1.1e-05,5e-06,9e-05,-5.8e-05,2.5e-05,9e-06,2.4e-05,4.2e-05,-6.7e-05,-1.6e-05,-6e-06,2e-06,1e-06,-1.9e-05,3.4e-05,0,-4e-06,-1e-06,-3.8e-05,3e-06,-1e-06,9e-06,0,1.2e-05,-1.6e-05,-4e-06,-2e-06,-2.3e-05,1.1e-05,-1e-06,2.6e-05,4e-06,-8e-06,-7e-06,3e-06,0,0,-1e-06,-2e-06,-1e-06,9e-06,0,0,2e-06,2e-06,-1e-06,0,-2e-06,-4e-06,-1e-06,1e-06,0,5e-06
0,0,0,0,0,-1e-06,0,0,1e-06,0,1e-06,0,1e-06,1e-06,0,0,0,0,0,0,0,0,0,0,1e-06,0,3e-06,1e-06,0,0,-1e-06,0,-2e-06,0,0,-1e-06,-7e-06,-1.4e-05,1e-06,6e-06,-1e-06,-1e-05,2.4e-05,0,-2.7e-05,-2.2e-05,-5e-06,-5e-06,0,-4e-06,2.7e-05,-1.3e-05,-3.5e-05,1.1e-05,-5.7e-05,-6e-06,3e-05,0,-7.6e-05,-3e-06,-2.3e-05,1.3e-05,4e-05,-5.8e-05,-1.8e-05,-3.5e-05,5.1e-05,-2.7e-05,-5e-06,-1.7e-05,-0.00011,6.3e-05,-1.3e-05,5e-06,-2.5e-05,-1.1e-05,3.2e-05,-1.1e-05,-1.1e-05,1.3e-05,0,2e-06,4e-06,3e-06,-2e-06,-5e-06,3.1e-05,-2e-06,-2.3e-05,-9e-06,-4e-06,8e-06,5e-06,-4e-06,-1e-06,5e-06,1.1e-05,0,-1e-06,-8e-06,-9e-06,-3e-06,-8e-06,0,0,-1e-06,-1e-06,-1e-06,-1e-05,1e-06,1e-06,-2e-06,1e-06,1e-06,0,1e-06,-2e-06,0,-1e-06,-2e-06,-3e-06
