0.000232,0.000139,0.000187,2e-06,0.000152,0.000144,5e-06,1.8e-05,7e-05,0.000173,8.1e-05,8.3e-05,8e-06,6.5e-05,4.2e-05,2.1e-05,1.6e-05,4e-06,3.2e-05,6e-06,6.6e-05,5.9e-05,1.4e-05,3.3e-05,8e-06,4.3e-05,0.000109,0.000125,1.9e-05,4.8e-05,5.8e-05,3.9e-05,0.000135,8.4e-05,0.000186,0.000121,0.000111,7.2e-05,6.7e-05,8.2e-05,4e-05,0.000147,3.3e-05,8.6e-05,2e-06,6e-05,3.3e-05,1e-06,7.2e-05,1.4e-05,2e-06,2.2e-05,2.3e-05,2.5e-05,3.5e-05,3.3e-05,4.6e-05,6.2e-05,3.2e-05,3.3e-05,2.6e-05,2e-05,2e-05,1.5e-05,2.9e-05,1.8e-05,9e-06,2.4e-05,3.3e-05,1e-06,1.9e-05,2e-05,2.3e-05,1.8e-05,5e-06,2e-06,1.1e-05,1e-05,4e-06,0,1e-05,2.6e-05,5e-06,2.1e-05,1e-05,5e-06,8e-06,2.1e-05,1.2e-05,2.3e-05,7e-06,1.7e-05,4.7e-05,2.6e-05,4e-05,1.1e-05,1.7e-05,2e-06,7e-06,2.1e-05,1e-06,1.5e-05,2.7e-05,2.4e-05,4e-05,1e-06,1.4e-05,1.3e-05,8e-06,7e-06,5e-06,1.6e-05,2e-06,1.8e-05,8e-06,7e-06,1e-06,8e-06,1.1e-05,1.6e-05,1.7e-05
0.000518,0.000339,0.000508,0.000463,0.000451,0.000666,0.000453,0.000329,0.000221,0.000465,0.000522,0.000247,0.000133,4.6e-05,4.8e-05,7.2e-05,6.4e-05,3.9e-05,7.3e-05,7.6e-05,0.000103,0.000244,0.000206,0.00015,0.000129,0.000144,0.000289,0.000479,0.00048,0.000471,0.000341,0.000286,0.000265,0.000395,0.000382,0.000523,0.000309,0.000267,0.000167,2e-04,0.000286,0.000381,0.000382,0.00021,0.000156,5.8e-05,3.2e-05,6.4e-05,0.000151,0.000121,7.1e-05,2.2e-05,4.9e-05,1e-04,0.000117,0.00016,9.8e-05,0.000164,0.000104,9.6e-05,5.6e-05,6e-05,5.8e-05,7e-05,3.6e-05,4.6e-05,8e-05,8.8e-05,0.000113,9.4e-05,4e-05,8e-06,5.8e-05,2.8e-05,3.6e-05,3.7e-05,2.3e-05,4.3e-05,3.5e-05,4.9e-05,2.6e-05,2.5e-05,4.7e-05,4e-05,5.6e-05,3e-05,2.7e-05,3.3e-05,3.6e-05,6.7e-05,6e-05,2.3e-05,5.2e-05,0.000106,7.6e-05,6e-05,5e-06,2e-05,2.7e-05,3e-05,3.4e-05,2.4e-05,5.1e-05,8.4e-05,2.8e-05,4e-05,2.6e-05,2.9e-05,1.7e-05,1e-05,2.2e-05,1.3e-05,3.3e-05,3.3e-05,1.8e-05,3.2e-05,3.1e-05,1e-05,2.1e-05,3.1e-05,1.8e-05
6.8e-05,8.5e-05,0.000308,0.000103,0.000322,0.000278,0.000166,0.000242,7.6e-05,0.000276,0.000134,8.5e-05,5.2e-05,0.000102,5.1e-05,4.9e-05,7e-05,0.000102,6.1e-05,3.4e-05,3.9e-05,0.000158,0.000135,6.7e-05,4.8e-05,0.000102,8.2e-05,0.000197,0.000221,0.000282,9.8e-05,0.000166,9.8e-05,0.000147,0.000187,7e-05,5.2e-05,5.9e-05,6.3e-05,0.00012,0.000214,9.7e-05,8.5e-05,2.6e-05,5.9e-05,3.3e-05,1e-05,5.9e-05,0.000142,0.000283,0.00023,1e-04,7.1e-05,3.2e-05,6.9e-05,6.1e-05,1.3e-05,7.2e-05,6.1e-05,4e-05,3.6e-05,3.9e-05,4.7e-05,6.5e-05,5.4e-05,6.1e-05,2.6e-05,3.8e-05,3.8e-05,2.4e-05,1e-05,2.8e-05,2.3e-05,2.8e-05,3.1e-05,3.6e-05,3.1e-05,2.4e-05,5.6e-05,3.4e-05,2.5e-05,2.1e-05,3.4e-05,1.7e-05,2.7e-05,3.5e-05,2.8e-05,1.8e-05,1.8e-05,3.1e-05,3.5e-05,5.7e-05,3e-06,2.7e-05,2.8e-05,4.8e-05,2.9e-05,2.9e-05,5.3e-05,3e-05,3.4e-05,3.7e-05,4.2e-05,2.4e-05,2.4e-05,9e-06,8e-06,3.4e-05,1.5e-05,9e-06,2.3e-05,9e-06,4.3e-05,3.2e-05,2.8e-05,3.9e-05,1e-05,2.5e-05,3.2e-05,3.5e-05,1.7e-05
0.000199,0.000106,0.000227,0.000209,0.000195,0.000381,0.000215,0.000154,0.000285,8.5e-05,8.5e-05,7.6e-05,8.8e-05,8.6e-05,4.7e-05,5e-05,6.4e-05,7.5e-05,7.2e-05,3.1e-05,1.3e-05,8.4e-05,3.5e-05,6.2e-05,0.000121,3.5e-05,5.3e-05,0.000136,0.000118,0.000123,6.1e-05,0.000127,2.6e-05,8.2e-05,9.3e-05,0.000104,3.7e-05,4.8e-05,4.2e-05,4.6e-05,0.000166,7.2e-05,1.8e-05,2.7e-05,5.6e-05,3.8e-05,4.1e-05,7e-05,0.000123,0.000225,0.000109,5.8e-05,3.8e-05,4.7e-05,1.5e-05,5e-05,2.9e-05,7.2e-05,4.1e-05,3.1e-05,5e-05,4.4e-05,9.1e-05,4.6e-05,9.1e-05,5.1e-05,5e-05,5.2e-05,4.3e-05,1.8e-05,1.1e-05,4.6e-05,3.4e-05,4.1e-05,5.6e-05,4.3e-05,6.5e-05,3.4e-05,6.8e-05,8e-05,5.7e-05,4.5e-05,1.7e-05,3.9e-05,4.6e-05,6.9e-05,5.1e-05,4.9e-05,1.7e-05,1.2e-05,7.2e-05,6.2e-05,4e-05,6.5e-05,3.3e-05,5.1e-05,7.7e-05,3.2e-05,3.3e-05,3.6e-05,4.3e-05,3.7e-05,5.7e-05,5.8e-05,4.6e-05,5.5e-05,3.8e-05,6.3e-05,3.3e-05,5.5e-05,4.4e-05,3.2e-05,6.5e-05,6.1e-05,3.9e-05,7.1e-05,4.7e-05,5.6e-05,4.4e-05,6.6e-05,4.9e-05
0.000179,5.1e-05,1e-04,0.000186,0.000163,5.2e-05,6.2e-05,2e-04,0.000131,5.7e-05,3.6e-05,3.8e-05,4.3e-05,3.9e-05,2.5e-05,4.1e-05,7e-06,3e-05,2.8e-05,2.2e-05,1.6e-05,3.6e-05,5e-05,3e-05,7.1e-05,2.6e-05,1.3e-05,5.8e-05,0.000103,3.7e-05,2e-05,9.7e-05,1.5e-05,5.9e-05,5.2e-05,6.2e-05,3.2e-05,5.3e-05,3.3e-05,5.3e-05,0.000123,2.9e-05,4.7e-05,2.5e-05,4.2e-05,1.8e-05,3.1e-05,5.7e-05,6.2e-05,7.7e-05,3.6e-05,2.7e-05,2.7e-05,9e-06,4.5e-05,2.9e-05,2e-05,7e-05,3.3e-05,2.2e-05,3.6e-05,7e-06,6e-05,2.3e-05,8.1e-05,3.1e-05,1.5e-05,2.8e-05,3.4e-05,3.2e-05,1.6e-05,4.4e-05,4.4e-05,1e-05,1.5e-05,1.3e-05,4.4e-05,3e-05,5.1e-05,1.5e-05,1.7e-05,2.7e-05,1.8e-05,3.2e-05,2.2e-05,2.8e-05,7.1e-05,7.2e-05,4.1e-05,2.9e-05,7.6e-05,6.3e-05,3.4e-05,5.8e-05,1.6e-05,7.7e-05,6e-05,5.1e-05,4.5e-05,4.8e-05,5e-06,8e-06,1.1e-05,2.7e-05,1.3e-05,3e-05,2.1e-05,6e-05,2.6e-05,6.8e-05,2.5e-05,2.5e-05,3.6e-05,1.3e-05,4.5e-05,5.7e-05,2.9e-05,3.5e-05,3.3e-05,4.7e-05,2.5e-05
8.5e-05,0.000146,5.1e-05,0.000125,9.4e-05,8.8e-05,5.1e-05,0.000113,9.2e-05,4.5e-05,5.9e-05,6.7e-05,5.3e-05,8.5e-05,5.5e-05,6.2e-05,6.8e-05,2.8e-05,1.5e-05,8e-06,1.8e-05,3.8e-05,3.9e-05,1.1e-05,4.6e-05,2e-06,3.1e-05,6.3e-05,0.000103,5.2e-05,4e-05,5.1e-05,1.5e-05,3.9e-05,7.5e-05,3.6e-05,5.5e-05,7e-05,5.5e-05,8.5e-05,7.1e-05,5.2e-05,7e-06,5.9e-05,2.8e-05,2e-05,4.1e-05,3.8e-05,9.8e-05,6.8e-05,5.6e-05,4.6e-05,8e-06,1.9e-05,5.7e-05,6.3e-05,3e-05,6.6e-05,5.6e-05,4.6e-05,5.7e-05,5.2e-05,4.3e-05,3.7e-05,3.6e-05,5e-05,2.3e-05,3.3e-05,2.7e-05,2e-05,1.8e-05,2.5e-05,4.3e-05,5.2e-05,3.2e-05,3e-05,8e-06,5.4e-05,2.3e-05,6e-06,2.7e-05,5.5e-05,3.4e-05,1.2e-05,2e-05,2.3e-05,7.5e-05,7.7e-05,5.3e-05,2.8e-05,3.7e-05,7.2e-05,3.7e-05,4.1e-05,6.5e-05,7.3e-05,0.000109,0.000114,7e-05,4.2e-05,3.8e-05,2.2e-05,3.5e-05,3e-06,1.2e-05,1.9e-05,3.1e-05,2.6e-05,3.7e-05,3.8e-05,5.9e-05,2.5e-05,1.9e-05,3.8e-05,4.4e-05,6e-05,4.1e-05,2.2e-05,3.1e-05,3.1e-05,2e-05
7e-06,5.7e-05,3.5e-05,0.000116,3.2e-05,7e-05,7.1e-05,2.7e-05,3.3e-05,3.1e-05,2.7e-05,1.6e-05,2.2e-05,4.3e-05,1.5e-05,3.6e-05,4.5e-05,2.2e-05,1.5e-05,2.3e-05,3.4e-05,2.8e-05,2.3e-05,2.7e-05,9e-06,2e-05,2.4e-05,7e-05,7.2e-05,3.7e-05,3e-05,5.6e-05,2.1e-05,6.2e-05,2.7e-05,2.4e-05,4.6e-05,5.4e-05,7e-06,5.5e-05,3.5e-05,5e-06,1.8e-05,4.3e-05,2.9e-05,2.1e-05,4.4e-05,2.3e-05,4.9e-05,2.1e-05,4.1e-05,3.5e-05,2.4e-05,4.5e-05,2.9e-05,2e-05,2.7e-05,6.5e-05,4.2e-05,2.9e-05,4.6e-05,2.6e-05,3.7e-05,1.4e-05,3.4e-05,2.9e-05,2.8e-05,1.1e-05,1.9e-05,5e-06,1.4e-05,3.6e-05,2.9e-05,1.8e-05,2.4e-05,2.2e-05,3e-05,4.3e-05,2.5e-05,7e-06,3.1e-05,2.1e-05,1e-05,1.2e-05,7e-06,8e-06,3.9e-05,2.9e-05,1.5e-05,1.7e-05,1.7e-05,2.9e-05,4.2e-05,2.4e-05,3.7e-05,1.9e-05,5e-05,2.5e-05,2.5e-05,2.8e-05,8e-06,1.9e-05,3.3e-05,3.6e-05,2e-05,3.3e-05,3.3e-05,4.1e-05,2.1e-05,3.5e-05,2e-05,2.1e-05,2.2e-05,7e-06,2.9e-05,3.1e-05,3.4e-05,2e-05,3.9e-05,1.2e-05,3.1e-05
1.8e-05,2e-05,1.5e-05,9.2e-05,2.1e-05,6.1e-05,4.7e-05,1.6e-05,3.1e-05,2.1e-05,3.1e-05,1.4e-05,1.8e-05,1.2e-05,4e-06,2.5e-05,1.4e-05,6e-06,2.1e-05,1.5e-05,1.3e-05,1.4e-05,1e-06,6e-06,1.7e-05,1.3e-05,1e-05,3.8e-05,6.2e-05,1.7e-05,7e-06,3.5e-05,2.6e-05,5e-05,2e-05,2e-05,1.7e-05,1.8e-05,1e-05,3.7e-05,4.6e-05,8e-06,2e-05,1.6e-05,0,1.8e-05,1e-05,7e-06,2e-05,3e-05,2.3e-05,1.2e-05,4e-06,2.3e-05,5e-06,1.6e-05,2.7e-05,1.9e-05,1.7e-05,2.3e-05,1.9e-05,9e-06,2.4e-05,1.8e-05,5e-06,1.9e-05,1.9e-05,1.8e-05,6e-06,7e-06,1.5e-05,1.6e-05,1.2e-05,6e-06,1.8e-05,4e-06,2.3e-05,1.4e-05,5e-06,5e-06,1.8e-05,1.2e-05,8e-06,1.1e-05,1.8e-05,1.1e-05,1.4e-05,1.4e-05,2e-06,1e-06,6e-06,1.5e-05,1.6e-05,1.5e-05,1.8e-05,2.1e-05,8e-06,1.1e-05,8e-06,1.5e-05,3e-06,7e-06,1.9e-05,1.7e-05,1e-05,2.1e-05,1.5e-05,1.2e-05,8e-06,7e-06,1.1e-05,1.2e-05,1.2e-05,2.3e-05,2.2e-05,7e-06,1.4e-05,7e-06,1.4e-05,5e-06,1.4e-05
8e-06,1.3e-05,2.6e-05,7.7e-05,1.5e-05,4.3e-05,8e-06,2.1e-05,3e-05,9e-06,1.4e-05,1.5e-05,7e-06,7e-06,9e-06,1.9e-05,1.5e-05,4e-06,8e-06,1.6e-05,7e-06,9e-06,1.8e-05,1e-05,2.1e-05,8e-06,1e-05,4.4e-05,5.6e-05,1.7e-05,1.1e-05,2.8e-05,3.2e-05,4.4e-05,2.5e-05,1.4e-05,2.3e-05,2.2e-05,8e-06,1.8e-05,4.4e-05,1.2e-05,1.7e-05,1.8e-05,1.6e-05,4e-06,1e-05,1e-06,2.1e-05,2.4e-05,1.6e-05,2.3e-05,5e-06,1.6e-05,4e-06,1.6e-05,1.3e-05,8e-06,1.2e-05,2.3e-05,1.4e-05,9e-06,2.8e-05,1.6e-05,1.3e-05,4e-06,1.2e-05,1.8e-05,1e-05,4e-06,5e-06,2.2e-05,1.3e-05,1.6e-05,4e-06,1.6e-05,1.1e-05,7e-06,6e-06,6e-06,1.2e-05,8e-06,3e-06,1.1e-05,2e-05,9e-06,2.5e-05,5e-06,1.3e-05,1.2e-05,1e-05,8e-06,1e-05,4e-06,2.3e-05,2.7e-05,2.4e-05,1.2e-05,1.8e-05,7e-06,1.2e-05,3e-06,7e-06,2e-05,1.5e-05,2.3e-05,1.3e-05,1.9e-05,9e-06,2e-06,6e-06,3e-06,1.9e-05,2.1e-05,2.2e-05,1.1e-05,1.2e-05,5e-06,7e-06,1.2e-05,3e-06
7e-06,9e-06,1e-05,6.5e-05,1.6e-05,2.8e-05,1.7e-05,2.5e-05,2.9e-05,6e-06,2.8e-05,1.7e-05,1.3e-05,6e-06,1.5e-05,8e-06,2.1e-05,5e-06,3e-06,8e-06,9e-06,1.2e-05,4e-06,1e-05,2.9e-05,1.3e-05,7e-06,2.9e-05,5.1e-05,1.7e-05,1.1e-05,2e-05,2.3e-05,3.1e-05,2.4e-05,1.7e-05,1e-05,1.3e-05,1e-05,2.6e-05,2e-05,1.8e-05,1.2e-05,8e-06,9e-06,5e-06,3.1e-05,2.8e-05,5e-06,2.7e-05,7e-06,2.3e-05,2.4e-05,1.4e-05,1.4e-05,9e-06,1e-05,4e-06,1.3e-05,1.5e-05,9e-06,6e-06,1.9e-05,9e-06,5e-06,1.6e-05,1.3e-05,1.7e-05,1.8e-05,9e-06,6e-06,2.4e-05,1e-05,4e-06,1.3e-05,2e-05,2.9e-05,1.2e-05,1.8e-05,9e-06,1.8e-05,1e-06,2e-06,1.3e-05,2.4e-05,2.2e-05,2.2e-05,8e-06,1.7e-05,2e-05,2e-05,1.7e-05,1.5e-05,2.1e-05,1.8e-05,2.7e-05,1.9e-05,1.6e-05,1.5e-05,2e-05,1.1e-05,1.2e-05,4e-06,1.2e-05,8e-06,2.3e-05,4e-06,5e-06,6e-06,5e-06,1.3e-05,1.5e-05,2.1e-05,2.8e-05,1e-05,1e-05,5e-06,2e-05,1.4e-05,1.2e-05,6e-06
1e-05,2.6e-05,2.8e-05,5.4e-05,2.8e-05,3.6e-05,1.9e-05,9e-06,2.4e-05,1e-06,1.9e-05,2.1e-05,1.9e-05,1.5e-05,1.8e-05,1.2e-05,9e-06,1.5e-05,1.8e-05,1.7e-05,1.8e-05,2.3e-05,1.4e-05,7e-06,1.9e-05,2.2e-05,7e-06,2.4e-05,4.8e-05,8e-06,8e-06,3.7e-05,2.9e-05,4.3e-05,2.1e-05,1.7e-05,1.2e-05,1.7e-05,7e-06,1.8e-05,4e-06,1.3e-05,9e-06,2.8e-05,9e-06,2.9e-05,1.3e-05,8e-06,4e-06,2.3e-05,1.7e-05,1.6e-05,2.1e-05,2.6e-05,1.6e-05,1.1e-05,2.9e-05,2.1e-05,1.7e-05,1.7e-05,1.3e-05,1.6e-05,2.5e-05,9e-06,2e-05,1.8e-05,5e-06,1.2e-05,2.1e-05,1.1e-05,5e-06,1.5e-05,2.6e-05,1.7e-05,5e-06,8e-06,2.7e-05,1.8e-05,1e-05,1.3e-05,2.9e-05,8e-06,1.3e-05,2.8e-05,1.8e-05,1.9e-05,1.6e-05,1.6e-05,1.4e-05,1e-05,1.6e-05,1.3e-05,2.7e-05,2.2e-05,1.5e-05,3e-05,1e-05,8e-06,9e-06,1.9e-05,5e-06,0,1.3e-05,1.2e-05,1.9e-05,2.4e-05,1.6e-05,1.8e-05,8e-06,1e-05,1.6e-05,2.2e-05,3.3e-05,2e-05,2e-05,2.6e-05,2e-06,1.8e-05,1.8e-05,1.6e-05,4e-06
1.6e-05,2.5e-05,4.3e-05,4.7e-05,3.9e-05,1.3e-05,2.6e-05,2.4e-05,1.5e-05,1.1e-05,2.2e-05,4e-05,1.1e-05,2.3e-05,4.7e-05,1.1e-05,3.6e-05,2.2e-05,1.8e-05,1.3e-05,2.4e-05,2.2e-05,2.3e-05,3.7e-05,4.4e-05,1.4e-05,1.3e-05,4.4e-05,3.9e-05,2.4e-05,2.5e-05,4.2e-05,1.8e-05,3.2e-05,3.7e-05,2.5e-05,2.5e-05,2.7e-05,9e-06,1e-05,1.1e-05,1.9e-05,1.9e-05,2.8e-05,2.4e-05,3.6e-05,1.5e-05,3.3e-05,1.1e-05,1.8e-05,1.7e-05,3.5e-05,4.9e-05,1.2e-05,3.1e-05,3.2e-05,3.6e-05,5.6e-05,3e-05,1.6e-05,2.5e-05,2.5e-05,6e-06,2.9e-05,2.6e-05,4.8e-05,3.1e-05,1.3e-05,3.5e-05,4e-05,2.5e-05,1e-05,3.7e-05,4.6e-05,2.4e-05,2.6e-05,3.6e-05,4.1e-05,3e-05,2.1e-05,4.9e-05,3.9e-05,1.9e-05,1.9e-05,3.5e-05,4.5e-05,4.5e-05,3.2e-05,1.5e-05,2.2e-05,2.3e-05,1.3e-05,1.6e-05,3e-05,3.8e-05,4.7e-05,2.9e-05,6e-06,2.5e-05,3.5e-05,3.2e-05,6e-06,1.9e-05,3.2e-05,5.6e-05,5.4e-05,1.8e-05,2.6e-05,6e-06,2.6e-05,2.7e-05,2.2e-05,7e-05,7.5e-05,4.8e-05,2.4e-05,2.7e-05,1.4e-05,3.1e-05,1.6e-05,2e-05
3.5e-05,2.8e-05,5.9e-05,7.1e-05,4.2e-05,5.4e-05,2.5e-05,2.6e-05,2.6e-05,2.8e-05,3.4e-05,6.6e-05,8.1e-05,6.2e-05,1e-04,6.4e-05,7.6e-05,7.5e-05,7e-05,5.1e-05,1.1e-05,2.1e-05,3.2e-05,3.2e-05,8.1e-05,7.7e-05,5.8e-05,5.9e-05,8.7e-05,5.8e-05,4.3e-05,2.7e-05,3.5e-05,3.1e-05,4e-05,1.9e-05,3.4e-05,5.3e-05,5e-05,5.1e-05,3.7e-05,5.3e-05,7.6e-05,4e-05,1.1e-05,3.9e-05,5.8e-05,7.7e-05,7.5e-05,2.9e-05,2.3e-05,2.7e-05,0.000101,0.000123,0.00011,8.8e-05,8.8e-05,0.000106,7.8e-05,6.1e-05,6.1e-05,5.8e-05,4.1e-05,5.3e-05,2.7e-05,6.9e-05,3.3e-05,4e-05,5e-05,3.6e-05,2.1e-05,1.4e-05,3.7e-05,5.9e-05,7e-05,7.1e-05,6.2e-05,9.7e-05,4.7e-05,5.3e-05,4.8e-05,5.8e-05,8.4e-05,7e-05,7.5e-05,7.9e-05,5.6e-05,3.8e-05,5.2e-05,5e-05,5.9e-05,5.8e-05,3.4e-05,7e-05,9.4e-05,9.8e-05,6.2e-05,4.5e-05,8e-06,5.9e-05,8.2e-05,5.6e-05,2.2e-05,1.4e-05,8e-05,5.3e-05,5.6e-05,9e-06,3.7e-05,7.1e-05,7.1e-05,6.4e-05,8.8e-05,9.5e-05,5.2e-05,3.2e-05,5.4e-05,4.9e-05,5.4e-05,6.1e-05,5.6e-05
1.7e-05,2.9e-05,8.1e-05,0.000122,2.9e-05,4.1e-05,2.7e-05,3.3e-05,7e-06,1.1e-05,3.6e-05,3.6e-05,7.3e-05,8.7e-05,2.6e-05,7.5e-05,6.4e-05,1.8e-05,3.8e-05,3.6e-05,4.5e-05,5.9e-05,1e-05,2e-05,3.7e-05,4.1e-05,4.1e-05,2.7e-05,5e-05,1.8e-05,3e-05,3.7e-05,4.3e-05,5e-05,5.4e-05,6.5e-05,1.5e-05,4.6e-05,2e-05,2.5e-05,3.5e-05,3.1e-05,5e-05,6.8e-05,1.6e-05,2e-05,4.9e-05,5.7e-05,8e-06,2.7e-05,4.5e-05,3.9e-05,8.6e-05,7.4e-05,6.1e-05,1.3e-05,4e-05,2e-05,2.7e-05,2.4e-05,2.1e-05,6.4e-05,5.2e-05,1.4e-05,3.2e-05,8.4e-05,5.3e-05,4.7e-05,2.4e-05,4e-06,1.9e-05,6e-06,3.8e-05,2.2e-05,4.5e-05,6.6e-05,7.3e-05,5e-05,4.3e-05,5e-05,2.1e-05,3.5e-05,4.5e-05,3.9e-05,3.8e-05,1.7e-05,2.6e-05,2.8e-05,3.6e-05,5e-06,3.2e-05,4.5e-05,4.7e-05,7.2e-05,2.4e-05,3e-06,1.4e-05,9e-06,3.3e-05,4.6e-05,3.3e-05,1.8e-05,2.1e-05,2.6e-05,5.8e-05,2.8e-05,4.6e-05,3.5e-05,5.8e-05,3.8e-05,4e-06,1.3e-05,3e-05,3.4e-05,2.6e-05,3.6e-05,1.6e-05,3.2e-05,3.1e-05,2.9e-05,4e-06
3.2e-05,1.4e-05,5.4e-05,2.2e-05,2.7e-05,4.1e-05,1e-05,3.1e-05,2.2e-05,1.3e-05,3.1e-05,3e-05,3.4e-05,2.2e-05,2.1e-05,4.5e-05,1.5e-05,3.3e-05,2.4e-05,3.9e-05,1.1e-05,2.9e-05,3.1e-05,1.6e-05,1.6e-05,3.5e-05,9e-06,3.5e-05,1.2e-05,4.3e-05,3.1e-05,4.3e-05,7e-06,2.8e-05,4.6e-05,4.6e-05,3.8e-05,4.9e-05,2.8e-05,1.6e-05,4.2e-05,9e-06,4.9e-05,4.6e-05,4.7e-05,5e-05,1.4e-05,1.1e-05,2.5e-05,3.4e-05,2.4e-05,1.2e-05,3.4e-05,3.9e-05,2e-05,2.8e-05,9e-06,2.4e-05,3e-06,1.3e-05,1.7e-05,3.7e-05,1.9e-05,1.1e-05,4.2e-05,3.1e-05,2e-05,1e-05,1.2e-05,1.1e-05,3.6e-05,3.5e-05,1.7e-05,4.1e-05,2.1e-05,3.3e-05,1.1e-05,1.9e-05,1.8e-05,2.4e-05,2.5e-05,2.4e-05,5.5e-05,1.8e-05,1.7e-05,1.5e-05,3.9e-05,1.7e-05,3.6e-05,2.8e-05,3.5e-05,1.1e-05,2.9e-05,1.5e-05,2.3e-05,3.7e-05,1.9e-05,1.1e-05,2.8e-05,4e-06,2.3e-05,1.1e-05,5e-06,1.2e-05,3.1e-05,3.8e-05,2.6e-05,8e-06,3.4e-05,3.2e-05,2.1e-05,1.6e-05,6e-06,1.8e-05,1.7e-05,1.2e-05,1.7e-05,1.8e-05,4.2e-05,2.3e-05,1.5e-05
2.2e-05,3.6e-05,2e-05,2.5e-05,7e-06,7e-06,1.8e-05,1e-05,2.9e-05,2.5e-05,4e-06,2.6e-05,2.1e-05,1.5e-05,9e-06,1.9e-05,1.7e-05,1.6e-05,1.7e-05,1.8e-05,2.1e-05,1e-05,1.6e-05,1.4e-05,1.5e-05,1.6e-05,2.3e-05,3.2e-05,1.1e-05,2.3e-05,2.2e-05,1.5e-05,1.1e-05,3.3e-05,3.4e-05,8e-06,2.6e-05,1.9e-05,9e-06,3.2e-05,4.8e-05,5e-06,2e-05,2.6e-05,2.6e-05,2.8e-05,3.3e-05,1.6e-05,4.1e-05,1.2e-05,8e-06,9e-06,2.6e-05,2.7e-05,1.1e-05,2.3e-05,3.1e-05,2.7e-05,1e-05,1.7e-05,3.2e-05,1.4e-05,1.8e-05,5e-06,2.7e-05,3.9e-05,2.9e-05,1.6e-05,8e-06,2e-05,2.9e-05,2e-06,6e-06,3.4e-05,4.7e-05,4.6e-05,1.6e-05,8e-06,1.6e-05,2.7e-05,8e-06,1.8e-05,2.8e-05,1.6e-05,5e-06,1.1e-05,1.8e-05,3.4e-05,2.7e-05,2.6e-05,1.4e-05,2.1e-05,2.3e-05,7e-06,7e-06,3.2e-05,1.8e-05,2.7e-05,8e-06,1.6e-05,1.2e-05,1.2e-05,7e-06,4e-06,2.5e-05,2.5e-05,1.3e-05,2.3e-05,3e-06,3e-06,4e-06,1.7e-05,7e-06,1.1e-05,1.7e-05,2.2e-05,2e-05,1.1e-05,2.5e-05,1e-05,1.3e-05
3.7e-05,1.2e-05,3.3e-05,3.5e-05,1.6e-05,1.2e-05,6e-06,8e-06,4e-05,2.8e-05,3.8e-05,1.5e-05,2.6e-05,5e-06,2.1e-05,2.5e-05,1e-05,2e-05,1.4e-05,2.1e-05,1e-05,8e-06,3e-06,6e-06,1.8e-05,9e-06,7e-06,2.8e-05,2.7e-05,2.8e-05,8e-06,1.3e-05,2e-06,2.9e-05,6e-06,5e-06,2.9e-05,1.7e-05,1.2e-05,3.3e-05,8e-06,2.7e-05,1.8e-05,2.4e-05,1.4e-05,4.1e-05,1.3e-05,1.7e-05,3.5e-05,4.3e-05,1.2e-05,2.1e-05,4.1e-05,2e-05,7e-06,1.3e-05,1.4e-05,6e-06,1.2e-05,1.4e-05,1.1e-05,9e-06,1.8e-05,1.7e-05,1.2e-05,1.1e-05,1.3e-05,1.1e-05,9e-06,1.6e-05,1.8e-05,1.7e-05,6e-06,2e-05,3.8e-05,1.8e-05,1.5e-05,1.8e-05,1.7e-05,3.8e-05,3.9e-05,3.5e-05,1.2e-05,1e-05,1.6e-05,9e-06,9e-06,2.7e-05,2.7e-05,7e-06,1.2e-05,1.6e-05,2e-05,1e-05,2e-05,9e-06,1.8e-05,2.2e-05,3.6e-05,6e-06,4e-06,1.1e-05,1.8e-05,2.1e-05,2.2e-05,2e-06,1.9e-05,1.8e-05,9e-06,1.6e-05,1e-06,9e-06,1.5e-05,1e-05,1.3e-05,9e-06,2.2e-05,1.6e-05,2e-05,2.3e-05,2.4e-05
4e-06,1.3e-05,1.8e-05,5.9e-05,2e-05,1.3e-05,3e-06,1.6e-05,2.5e-05,2.4e-05,2.8e-05,3.7e-05,1e-05,1.1e-05,1.7e-05,1.3e-05,3e-06,7e-06,1.2e-05,6e-06,6e-06,9e-06,1e-05,4e-06,5e-06,3e-06,5e-06,1.5e-05,2.5e-05,7e-06,1.6e-05,2.2e-05,8e-06,2.6e-05,1.8e-05,1e-05,1.9e-05,1.5e-05,1e-05,3.1e-05,3.1e-05,2.1e-05,1.3e-05,9e-06,5e-06,1.8e-05,3.6e-05,1.7e-05,1.8e-05,2.2e-05,1.4e-05,1.5e-05,1.8e-05,1.4e-05,9e-06,3e-06,1.3e-05,1.5e-05,3e-06,1.3e-05,1.1e-05,8e-06,1.1e-05,5e-06,1.6e-05,1.5e-05,2.2e-05,6e-06,4e-06,8e-06,1e-05,4e-06,2.4e-05,1.9e-05,2.2e-05,1.1e-05,2.2e-05,1.5e-05,9e-06,2.3e-05,8e-06,1e-05,1.6e-05,1.2e-05,3e-06,4e-06,1.7e-05,6e-06,1e-05,1.8e-05,1.3e-05,4e-06,8e-06,7e-06,1.7e-05,1.8e-05,8e-06,1.6e-05,6e-06,9e-06,2e-06,1e-05,8e-06,4e-06,4e-06,7e-06,8e-06,9e-06,3e-06,1e-05,1e-05,5e-06,5e-06,1.2e-05,1.4e-05,1.5e-05,1.7e-05,9e-06,1.4e-05,1.8e-05,1.2e-05
5e-06,1e-05,9e-06,3.4e-05,8e-06,1.2e-05,3e-06,1.6e-05,1.9e-05,8e-06,1.3e-05,1.2e-05,5e-06,1.6e-05,1.4e-05,1.8e-05,7e-06,1.3e-05,1e-06,9e-06,7e-06,8e-06,7e-06,3e-06,1.8e-05,9e-06,1e-05,2.7e-05,2.2e-05,3e-06,2e-06,1.7e-05,6e-06,2.7e-05,1.7e-05,9e-06,1.5e-05,1.4e-05,8e-06,1.6e-05,2e-05,1.1e-05,9e-06,5e-06,6e-06,8e-06,1.6e-05,9e-06,2e-05,1.7e-05,8e-06,6e-06,1.3e-05,1.4e-05,5e-06,2e-06,1.4e-05,1.5e-05,6e-06,1.1e-05,6e-06,7e-06,5e-06,2e-06,1.9e-05,9e-06,1.6e-05,1.2e-05,7e-06,5e-06,4e-06,6e-06,1.3e-05,8e-06,7e-06,2e-06,9e-06,8e-06,1e-05,1.3e-05,1e-05,2e-06,1.3e-05,1e-06,6e-06,6e-06,8e-06,2e-06,1.3e-05,3e-06,8e-06,9e-06,1.1e-05,4e-06,6e-06,1.6e-05,9e-06,9e-06,6e-06,1.1e-05,9e-06,3e-06,6e-06,7e-06,6e-06,7e-06,2e-06,5e-06,6e-06,2e-06,7e-06,3e-06,8e-06,7e-06,1.6e-05,7e-06,4e-06,3e-06,2e-06,1.7e-05,1e-05
1.6e-05,1.2e-05,8e-06,3.1e-05,7e-06,2.1e-05,6e-06,9e-06,7e-06,7e-06,5e-06,9e-06,9e-06,1.7e-05,8e-06,9e-06,2e-06,1.5e-05,1e-05,8e-06,6e-06,7e-06,4e-06,2e-06,1.7e-05,2e-06,8e-06,1.4e-05,1.9e-05,8e-06,2e-06,1.3e-05,7e-06,2.1e-05,1.4e-05,1.2e-05,1.6e-05,1.1e-05,9e-06,1.6e-05,1.7e-05,1.1e-05,9e-06,5e-06,4e-06,7e-06,1.3e-05,9e-06,1.2e-05,1e-05,6e-06,1.2e-05,1e-05,1e-05,4e-06,1e-06,9e-06,1.5e-05,3e-06,3e-06,2e-06,7e-06,9e-06,6e-06,6e-06,9e-06,4e-06,8e-06,5e-06,5e-06,6e-06,7e-06,9e-06,5e-06,1e-05,4e-06,6e-06,2e-06,3e-06,6e-06,2e-06,3e-06,1e-05,4e-06,3e-06,9e-06,6e-06,8e-06,5e-06,4e-06,4e-06,6e-06,8e-06,9e-06,5e-06,8e-06,6e-06,2e-06,1.4e-05,5e-06,7e-06,4e-06,2e-06,2e-06,9e-06,7e-06,3e-06,8e-06,2e-06,9e-06,1e-06,5e-06,5e-06,5e-06,4e-06,1.1e-05,6e-06,4e-06,5e-06,1.1e-05,1.1e-05
1.2e-05,1.7e-05,6e-06,3.1e-05,9e-06,1.7e-05,7e-06,2e-06,1.3e-05,6e-06,1.1e-05,7e-06,1e-05,1e-05,1e-05,1.5e-05,4e-06,7e-06,5e-06,8e-06,5e-06,3e-06,3e-06,2e-06,4e-06,8e-06,1.3e-05,2.4e-05,2.2e-05,5e-06,5e-06,2.2e-05,1e-06,1.7e-05,1.5e-05,1.4e-05,1.7e-05,5e-06,3e-06,1e-05,1.4e-05,1e-05,3e-06,1e-05,7e-06,3e-06,1.2e-05,1e-05,1.3e-05,9e-06,4e-06,9e-06,1e-05,1.1e-05,6e-06,1.1e-05,9e-06,1e-05,5e-06,6e-06,7e-06,3e-06,4e-06,1.4e-05,1.4e-05,7e-06,7e-06,4e-06,5e-06,4e-06,1e-06,9e-06,7e-06,8e-06,1.3e-05,8e-06,3e-06,1e-06,9e-06,4e-06,1e-05,3e-06,4e-06,4e-06,2e-06,8e-06,7e-06,1.2e-05,1e-05,3e-06,5e-06,4e-06,1e-06,3e-06,2e-06,1e-05,5e-06,3e-06,1.1e-05,9e-06,9e-06,1e-06,7e-06,4e-06,2e-06,4e-06,4e-06,5e-06,6e-06,8e-06,6e-06,5e-06,4e-06,3e-06,4e-06,7e-06,5e-06,1e-06,7e-06,1.2e-05,4e-06
9e-06,1.2e-05,9e-06,2.8e-05,1e-05,8e-06,2e-06,7e-06,1e-05,1.4e-05,3e-06,3e-06,6e-06,2e-06,4e-06,1e-05,1e-05,1e-05,2e-06,4e-06,6e-06,2e-06,3e-06,3e-06,9e-06,3e-06,6e-06,1.6e-05,2.1e-05,8e-06,4e-06,2e-05,3e-06,1.2e-05,9e-06,1.2e-05,5e-06,7e-06,3e-06,1e-05,1.9e-05,1.3e-05,6e-06,5e-06,1e-05,4e-06,1.2e-05,1.1e-05,1.4e-05,1.1e-05,4e-06,1e-05,1.4e-05,1.1e-05,4e-06,1.3e-05,6e-06,1e-05,4e-06,8e-06,8e-06,5e-06,9e-06,1.5e-05,2e-06,9e-06,8e-06,3e-06,6e-06,3e-06,0,3e-06,8e-06,6e-06,6e-06,4e-06,9e-06,8e-06,6e-06,4e-06,2e-06,4e-06,5e-06,4e-06,5e-06,5e-06,1.1e-05,1.1e-05,4e-06,2e-06,9e-06,9e-06,5e-06,9e-06,7e-06,7e-06,4e-06,2e-06,3e-06,2e-06,3e-06,6e-06,6e-06,4e-06,5e-06,3e-06,4e-06,1e-06,3e-06,3e-06,6e-06,2e-06,4e-06,2e-06,5e-06,7e-06,3e-06,6e-06,5e-06,1.3e-05,5e-06
2e-06,5e-06,2e-06,1.3e-05,3e-06,7e-06,2e-06,5e-06,6e-06,7e-06,4e-06,3e-06,1e-06,5e-06,1e-06,5e-06,5e-06,2e-06,2e-06,2e-06,4e-06,4e-06,1e-06,2e-06,5e-06,1e-06,1e-06,6e-06,9e-06,4e-06,2e-06,6e-06,2e-06,8e-06,3e-06,4e-06,4e-06,4e-06,3e-06,7e-06,1e-05,2e-06,4e-06,2e-06,2e-06,4e-06,3e-06,4e-06,6e-06,5e-06,4e-06,4e-06,6e-06,4e-06,2e-06,5e-06,7e-06,6e-06,4e-06,6e-06,2e-06,3e-06,4e-06,4e-06,4e-06,2e-06,4e-06,1e-06,3e-06,2e-06,2e-06,2e-06,3e-06,1e-06,2e-06,5e-06,5e-06,5e-06,2e-06,6e-06,5e-06,1e-06,2e-06,1e-06,1e-06,2e-06,1e-06,4e-06,4e-06,1e-06,5e-06,2e-06,0,3e-06,1e-06,2e-06,2e-06,2e-06,1e-06,1e-06,1e-06,4e-06,6e-06,3e-06,5e-06,4e-06,1e-06,3e-06,1e-06,2e-06,1e-06,3e-06,4e-06,0,2e-06,4e-06,4e-06,2e-06,2e-06,4e-06,1e-06
2e-06,4e-06,3e-06,1.5e-05,5e-06,8e-06,5e-06,4e-06,6e-06,5e-06,4e-06,3e-06,2e-06,3e-06,2e-06,3e-06,5e-06,5e-06,2e-06,2e-06,2e-06,3e-06,3e-06,4e-06,5e-06,2e-06,3e-06,8e-06,9e-06,3e-06,2e-06,6e-06,1e-06,1.1e-05,5e-06,5e-06,6e-06,4e-06,4e-06,1e-06,8e-06,1e-06,4e-06,3e-06,2e-06,2e-06,5e-06,4e-06,5e-06,4e-06,3e-06,3e-06,3e-06,4e-06,2e-06,1e-06,4e-06,3e-06,3e-06,2e-06,1e-06,1e-06,2e-06,4e-06,2e-06,2e-06,4e-06,2e-06,3e-06,2e-06,2e-06,2e-06,4e-06,1e-06,2e-06,3e-06,2e-06,2e-06,1e-06,5e-06,2e-06,1e-06,4e-06,1e-06,1e-06,4e-06,0,3e-06,3e-06,3e-06,4e-06,4e-06,4e-06,5e-06,5e-06,3e-06,1e-06,3e-06,2e-06,1e-06,2e-06,5e-06,2e-06,3e-06,3e-06,2e-06,1e-06,2e-06,2e-06,4e-06,4e-06,3e-06,2e-06,2e-06,0,1e-06,4e-06,2e-06,2e-06,3e-06,3e-06
4e-06,4e-06,2e-06,1.4e-05,5e-06,5e-06,3e-06,2e-06,6e-06,4e-06,4e-06,2e-06,2e-06,2e-06,3e-06,5e-06,3e-06,0,3e-06,5e-06,3e-06,1e-06,2e-06,2e-06,4e-06,0,2e-06,1.1e-05,8e-06,5e-06,1e-06,4e-06,2e-06,1e-05,4e-06,3e-06,5e-06,6e-06,3e-06,3e-06,1e-05,3e-06,2e-06,2e-06,3e-06,4e-06,2e-06,6e-06,4e-06,4e-06,4e-06,4e-06,3e-06,5e-06,2e-06,1e-06,5e-06,6e-06,2e-06,4e-06,3e-06,2e-06,2e-06,4e-06,4e-06,1e-06,3e-06,1e-06,2e-06,2e-06,2e-06,2e-06,1e-06,3e-06,1e-06,3e-06,1e-06,1e-06,0,4e-06,3e-06,1e-06,4e-06,3e-06,4e-06,3e-06,3e-06,2e-06,2e-06,3e-06,2e-06,4e-06,2e-06,3e-06,3e-06,2e-06,3e-06,2e-06,4e-06,1e-06,1e-06,1e-06,2e-06,2e-06,2e-06,2e-06,2e-06,1e-06,2e-06,4e-06,4e-06,3e-06,1e-06,1e-06,0,1e-06,1e-06,2e-06,4e-06,2e-06,1e-06
5e-06,3e-06,4e-06,1.4e-05,3e-06,6e-06,1e-06,2e-06,3e-06,3e-06,2e-06,2e-06,3e-06,5e-06,1e-06,3e-06,2e-06,4e-06,2e-06,5e-06,1e-06,3e-06,1e-06,1e-06,3e-06,2e-06,1e-06,1e-05,1.1e-05,6e-06,1e-06,6e-06,2e-06,7e-06,6e-06,2e-06,3e-06,6e-06,2e-06,7e-06,8e-06,4e-06,2e-06,3e-06,5e-06,6e-06,8e-06,5e-06,6e-06,3e-06,2e-06,2e-06,6e-06,6e-06,3e-06,1e-06,1e-06,3e-06,2e-06,5e-06,4e-06,3e-06,2e-06,3e-06,2e-06,1e-06,1e-06,1e-06,1e-06,3e-06,3e-06,3e-06,1e-06,2e-06,1e-06,1e-06,0,3e-06,1e-06,4e-06,1e-06,3e-06,2e-06,3e-06,2e-06,2e-06,1e-06,2e-06,3e-06,3e-06,2e-06,2e-06,2e-06,3e-06,2e-06,3e-06,1e-06,2e-06,4e-06,2e-06,1e-06,3e-06,1e-06,1e-06,1e-06,1e-06,2e-06,2e-06,2e-06,3e-06,2e-06,0,2e-06,2e-06,2e-06,1e-06,2e-06,3e-06,2e-06,2e-06,3e-06
5e-06,5e-06,3e-06,1.3e-05,4e-06,5e-06,4e-06,1e-06,4e-06,4e-06,2e-06,2e-06,3e-06,2e-06,2e-06,3e-06,1e-06,2e-06,1e-06,1e-06,1e-06,0,2e-06,1e-06,3e-06,1e-06,1e-06,9e-06,8e-06,4e-06,1e-06,7e-06,2e-06,4e-06,4e-06,4e-06,6e-06,5e-06,2e-06,8e-06,8e-06,2e-06,3e-06,3e-06,3e-06,2e-06,6e-06,5e-06,4e-06,6e-06,2e-06,2e-06,4e-06,2e-06,2e-06,2e-06,1e-06,4e-06,3e-06,2e-06,2e-06,3e-06,2e-06,3e-06,2e-06,2e-06,4e-06,2e-06,3e-06,3e-06,1e-06,2e-06,3e-06,5e-06,4e-06,1e-06,3e-06,3e-06,3e-06,2e-06,3e-06,3e-06,2e-06,3e-06,4e-06,2e-06,1e-06,2e-06,3e-06,1e-06,3e-06,2e-06,1e-06,3e-06,3e-06,4e-06,2e-06,1e-06,3e-06,2e-06,1e-06,2e-06,3e-06,1e-06,2e-06,2e-06,1e-06,1e-06,3e-06,2e-06,0,1e-06,2e-06,2e-06,1e-06,1e-06,2e-06,1e-06,1e-06,2e-06,4e-06
3e-06,5e-06,4e-06,1.4e-05,3e-06,5e-06,4e-06,2e-06,3e-06,4e-06,2e-06,3e-06,3e-06,4e-06,3e-06,5e-06,2e-06,3e-06,1e-06,1e-06,1e-06,1e-06,4e-06,2e-06,4e-06,1e-06,2e-06,6e-06,9e-06,4e-06,1e-06,7e-06,1e-06,6e-06,4e-06,4e-06,5e-06,5e-06,1e-06,5e-06,8e-06,0,1e-06,2e-06,2e-06,1e-06,7e-06,2e-06,3e-06,7e-06,1e-06,3e-06,1e-06,2e-06,3e-06,1e-06,3e-06,3e-06,5e-06,1e-06,2e-06,3e-06,1e-06,3e-06,2e-06,2e-06,3e-06,1e-06,1e-06,1e-06,2e-06,2e-06,4e-06,3e-06,3e-06,4e-06,1e-06,1e-06,2e-06,2e-06,1e-06,0,2e-06,1e-06,1e-06,2e-06,1e-06,1e-06,3e-06,1e-06,2e-06,1e-06,1e-06,3e-06,1e-06,4e-06,1e-06,2e-06,3e-06,1e-06,2e-06,1e-06,1e-06,2e-06,1e-06,2e-06,2e-06,2e-06,1e-06,5e-06,1e-06,2e-06,1e-06,2e-06,2e-06,1e-06,1e-06,2e-06,1e-06,2e-06,2e-06
5e-06,4e-06,2e-06,1.4e-05,2e-06,3e-06,3e-06,2e-06,5e-06,0,4e-06,4e-06,2e-06,3e-06,2e-06,2e-06,4e-06,1e-06,2e-06,2e-06,3e-06,2e-06,1e-06,1e-06,4e-06,1e-06,0,5e-06,7e-06,2e-06,1e-06,5e-06,3e-06,8e-06,5e-06,3e-06,4e-06,3e-06,1e-06,5e-06,7e-06,2e-06,2e-06,2e-06,2e-06,1e-06,5e-06,3e-06,5e-06,6e-06,3e-06,2e-06,4e-06,3e-06,2e-06,3e-06,2e-06,3e-06,1e-06,4e-06,3e-06,3e-06,2e-06,2e-06,2e-06,1e-06,3e-06,2e-06,2e-06,1e-06,1e-06,2e-06,2e-06,3e-06,4e-06,1e-06,0,3e-06,3e-06,1e-06,2e-06,1e-06,2e-06,0,0,1e-06,2e-06,3e-06,1e-06,2e-06,1e-06,1e-06,2e-06,3e-06,2e-06,3e-06,1e-06,1e-06,1e-06,1e-06,1e-06,1e-06,1e-06,0,1e-06,0,1e-06,2e-06,2e-06,3e-06,0,1e-06,1e-06,2e-06,1e-06,3e-06,2e-06,2e-06,1e-06,2e-06,1e-06
5e-06,3e-06,2e-06,1.1e-05,4e-06,4e-06,2e-06,1e-06,4e-06,3e-06,3e-06,2e-06,2e-06,5e-06,3e-06,4e-06,2e-06,3e-06,2e-06,2e-06,3e-06,4e-06,3e-06,2e-06,3e-06,2e-06,2e-06,8e-06,7e-06,3e-06,1e-06,3e-06,1e-06,7e-06,3e-06,4e-06,4e-06,3e-06,0,5e-06,6e-06,3e-06,3e-06,1e-06,2e-06,3e-06,4e-06,4e-06,5e-06,4e-06,0,0,2e-06,4e-06,2e-06,1e-06,2e-06,4e-06,0,1e-06,2e-06,1e-06,2e-06,1e-06,1e-06,1e-06,1e-06,1e-06,1e-06,2e-06,1e-06,2e-06,3e-06,3e-06,5e-06,3e-06,2e-06,3e-06,3e-06,3e-06,2e-06,1e-06,1e-06,1e-06,1e-06,1e-06,3e-06,6e-06,3e-06,2e-06,3e-06,1e-06,1e-06,2e-06,1e-06,3e-06,1e-06,0,1e-06,2e-06,2e-06,1e-06,2e-06,1e-06,2e-06,1e-06,1e-06,2e-06,1e-06,3e-06,1e-06,1e-06,1e-06,1e-06,1e-06,2e-06,2e-06,1e-06,2e-06,1e-06,1e-06
3e-06,5e-06,2e-06,1.3e-05,3e-06,6e-06,2e-06,1e-06,7e-06,5e-06,2e-06,2e-06,1e-06,3e-06,2e-06,2e-06,1e-06,1e-06,4e-06,3e-06,1e-06,4e-06,1e-06,2e-06,5e-06,2e-06,1e-06,6e-06,6e-06,2e-06,2e-06,6e-06,2e-06,6e-06,3e-06,3e-06,3e-06,2e-06,2e-06,4e-06,8e-06,1e-06,2e-06,1e-06,2e-06,0,3e-06,4e-06,6e-06,4e-06,2e-06,1e-06,2e-06,4e-06,1e-06,2e-06,3e-06,3e-06,4e-06,0,2e-06,2e-06,1e-06,1e-06,1e-06,2e-06,0,1e-06,1e-06,3e-06,2e-06,3e-06,3e-06,1e-06,1e-06,1e-06,3e-06,2e-06,3e-06,1e-06,2e-06,1e-06,0,2e-06,1e-06,1e-06,4e-06,1e-06,1e-06,1e-06,1e-06,2e-06,2e-06,1e-06,1e-06,2e-06,2e-06,1e-06,2e-06,2e-06,2e-06,1e-06,1e-06,3e-06,2e-06,2e-06,2e-06,2e-06,2e-06,3e-06,1e-06,3e-06,1e-06,1e-06,1e-06,1e-06,2e-06,1e-06,1e-06,2e-06,1e-06
4e-06,4e-06,3e-06,1.3e-05,1e-06,2e-06,2e-06,3e-06,4e-06,2e-06,4e-06,3e-06,2e-06,3e-06,2e-06,1e-06,4e-06,5e-06,1e-06,4e-06,2e-06,2e-06,1e-06,1e-06,2e-06,1e-06,1e-06,8e-06,1e-05,3e-06,4e-06,4e-06,1e-06,5e-06,2e-06,4e-06,3e-06,3e-06,1e-06,2e-06,6e-06,2e-06,2e-06,1e-06,2e-06,2e-06,4e-06,3e-06,4e-06,5e-06,2e-06,2e-06,4e-06,6e-06,3e-06,2e-06,2e-06,2e-06,2e-06,3e-06,2e-06,2e-06,1e-06,2e-06,3e-06,1e-06,2e-06,0,0,2e-06,1e-06,3e-06,5e-06,1e-06,1e-06,3e-06,2e-06,3e-06,2e-06,0,3e-06,2e-06,3e-06,3e-06,4e-06,3e-06,3e-06,4e-06,2e-06,1e-06,1e-06,3e-06,1e-06,2e-06,2e-06,4e-06,1e-06,2e-06,2e-06,3e-06,2e-06,2e-06,3e-06,4e-06,2e-06,1e-06,1e-06,1e-06,2e-06,3e-06,2e-06,1e-06,1e-06,1e-06,2e-06,2e-06,1e-06,1e-06,1e-06,1e-06,1e-06
2e-06,3e-06,1e-06,1.1e-05,3e-06,3e-06,2e-06,2e-06,3e-06,2e-06,4e-06,1e-06,3e-06,3e-06,2e-06,5e-06,1e-06,2e-06,1e-06,3e-06,3e-06,3e-06,2e-06,2e-06,3e-06,0,1e-06,8e-06,7e-06,4e-06,2e-06,5e-06,1e-06,6e-06,4e-06,5e-06,3e-06,4e-06,2e-06,4e-06,7e-06,2e-06,3e-06,1e-06,1e-06,1e-06,4e-06,3e-06,2e-06,3e-06,1e-06,1e-06,4e-06,4e-06,2e-06,1e-06,1e-06,4e-06,2e-06,2e-06,1e-06,1e-06,2e-06,1e-06,1e-06,1e-06,2e-06,2e-06,0,1e-06,2e-06,1e-06,4e-06,1e-06,0,3e-06,3e-06,1e-06,2e-06,1e-06,1e-06,1e-06,4e-06,1e-06,3e-06,3e-06,3e-06,3e-06,1e-06,1e-06,1e-06,2e-06,3e-06,1e-06,2e-06,0,3e-06,2e-06,0,2e-06,2e-06,0,2e-06,1e-06,1e-06,2e-06,1e-06,1e-06,2e-06,3e-06,3e-06,3e-06,2e-06,2e-06,0,1e-06,2e-06,1e-06,2e-06,1e-06,2e-06
5e-06,3e-06,1e-06,1.2e-05,4e-06,5e-06,2e-06,1e-06,3e-06,1e-06,2e-06,1e-06,1e-06,3e-06,1e-06,5e-06,1e-06,1e-06,2e-06,2e-06,1e-06,4e-06,2e-06,0,4e-06,1e-06,1e-06,6e-06,6e-06,3e-06,1e-06,4e-06,1e-06,5e-06,4e-06,3e-06,4e-06,4e-06,2e-06,6e-06,8e-06,2e-06,3e-06,2e-06,1e-06,2e-06,4e-06,4e-06,5e-06,4e-06,2e-06,2e-06,3e-06,3e-06,0,2e-06,3e-06,4e-06,1e-06,2e-06,0,1e-06,1e-06,2e-06,1e-06,2e-06,2e-06,2e-06,3e-06,2e-06,1e-06,1e-06,4e-06,2e-06,1e-06,3e-06,0,1e-06,0,3e-06,3e-06,3e-06,2e-06,2e-06,2e-06,3e-06,1e-06,2e-06,2e-06,2e-06,1e-06,2e-06,3e-06,4e-06,2e-06,2e-06,1e-06,1e-06,1e-06,1e-06,2e-06,2e-06,2e-06,2e-06,1e-06,1e-06,1e-06,1e-06,1e-06,1e-06,1e-06,0,2e-06,2e-06,2e-06,1e-06,2e-06,1e-06,2e-06,2e-06,1e-06
2e-06,0,3e-06,1.1e-05,3e-06,2e-06,2e-06,2e-06,4e-06,3e-06,4e-06,3e-06,1e-06,4e-06,1e-06,5e-06,1e-06,1e-06,2e-06,2e-06,0,3e-06,2e-06,1e-06,2e-06,2e-06,2e-06,8e-06,6e-06,4e-06,0,5e-06,3e-06,7e-06,4e-06,4e-06,4e-06,4e-06,2e-06,6e-06,5e-06,1e-06,1e-06,2e-06,2e-06,2e-06,2e-06,3e-06,4e-06,4e-06,2e-06,2e-06,2e-06,2e-06,0,2e-06,2e-06,3e-06,1e-06,2e-06,1e-06,1e-06,1e-06,2e-06,3e-06,1e-06,2e-06,3e-06,1e-06,0,0,3e-06,4e-06,3e-06,4e-06,4e-06,2e-06,1e-06,3e-06,4e-06,2e-06,1e-06,4e-06,1e-06,1e-06,1e-06,3e-06,3e-06,1e-06,3e-06,3e-06,3e-06,3e-06,3e-06,1e-06,4e-06,4e-06,3e-06,3e-06,1e-06,0,1e-06,1e-06,2e-06,2e-06,2e-06,1e-06,1e-06,2e-06,1e-06,2e-06,2e-06,2e-06,3e-06,1e-06,0,2e-06,1e-06,0,3e-06,2e-06
6e-06,4e-06,2e-06,1.1e-05,2e-06,3e-06,3e-06,2e-06,5e-06,1e-06,3e-06,1e-06,3e-06,2e-06,2e-06,3e-06,1e-06,2e-06,2e-06,1e-06,2e-06,3e-06,0,0,2e-06,1e-06,3e-06,5e-06,9e-06,3e-06,1e-06,7e-06,1e-06,6e-06,2e-06,6e-06,0,3e-06,1e-06,3e-06,6e-06,3e-06,1e-06,1e-06,1e-06,1e-06,4e-06,1e-06,6e-06,4e-06,1e-06,1e-06,3e-06,4e-06,0,1e-06,1e-06,2e-06,0,1e-06,1e-06,1e-06,2e-06,1e-06,0,1e-06,4e-06,1e-06,1e-06,1e-06,1e-06,2e-06,2e-06,1e-06,2e-06,3e-06,1e-06,1e-06,2e-06,1e-06,2e-06,2e-06,1e-06,1e-06,1e-06,1e-06,2e-06,2e-06,1e-06,1e-06,0,1e-06,2e-06,2e-06,1e-06,4e-06,2e-06,2e-06,3e-06,2e-06,1e-06,1e-06,2e-06,2e-06,2e-06,4e-06,1e-06,1e-06,1e-06,1e-06,2e-06,1e-06,2e-06,1e-06,1e-06,2e-06,2e-06,1e-06,1e-06,2e-06,1e-06
4e-06,6e-06,1e-06,1e-05,2e-06,5e-06,4e-06,1e-06,6e-06,3e-06,1e-06,1e-06,1e-06,2e-06,0,3e-06,2e-06,3e-06,2e-06,1e-06,1e-06,4e-06,2e-06,1e-06,3e-06,0,1e-06,4e-06,6e-06,3e-06,1e-06,6e-06,2e-06,6e-06,4e-06,6e-06,5e-06,3e-06,1e-06,2e-06,5e-06,1e-06,3e-06,1e-06,2e-06,1e-06,5e-06,2e-06,4e-06,4e-06,1e-06,3e-06,4e-06,3e-06,2e-06,2e-06,2e-06,3e-06,1e-06,1e-06,1e-06,1e-06,1e-06,1e-06,3e-06,3e-06,4e-06,3e-06,2e-06,1e-06,0,1e-06,3e-06,2e-06,1e-06,3e-06,3e-06,1e-06,1e-06,3e-06,2e-06,1e-06,3e-06,2e-06,3e-06,1e-06,1e-06,0,1e-06,1e-06,2e-06,2e-06,1e-06,2e-06,1e-06,4e-06,2e-06,2e-06,0,0,1e-06,0,1e-06,2e-06,1e-06,2e-06,1e-06,2e-06,2e-06,1e-06,1e-06,1e-06,1e-06,2e-06,1e-06,3e-06,2e-06,0,1e-06,1e-06,2e-06
2e-06,3e-06,2e-06,1.2e-05,2e-06,5e-06,1e-06,0,2e-06,3e-06,2e-06,1e-06,2e-06,4e-06,0,4e-06,2e-06,1e-06,0,3e-06,1e-06,2e-06,1e-06,1e-06,3e-06,0,1e-06,6e-06,8e-06,3e-06,1e-06,5e-06,1e-06,8e-06,3e-06,5e-06,3e-06,3e-06,2e-06,3e-06,7e-06,1e-06,1e-06,3e-06,1e-06,1e-06,3e-06,2e-06,2e-06,4e-06,2e-06,1e-06,1e-06,1e-06,2e-06,1e-06,3e-06,4e-06,2e-06,3e-06,1e-06,2e-06,1e-06,1e-06,3e-06,1e-06,1e-06,1e-06,1e-06,1e-06,2e-06,1e-06,2e-06,1e-06,0,1e-06,1e-06,2e-06,2e-06,1e-06,2e-06,1e-06,2e-06,1e-06,3e-06,2e-06,1e-06,2e-06,2e-06,2e-06,2e-06,1e-06,2e-06,3e-06,1e-06,2e-06,1e-06,3e-06,2e-06,2e-06,1e-06,1e-06,1e-06,2e-06,2e-06,1e-06,1e-06,3e-06,1e-06,2e-06,2e-06,1e-06,1e-06,1e-06,3e-06,2e-06,2e-06,1e-06,1e-06,2e-06,2e-06
3e-06,3e-06,2e-06,1e-05,3e-06,4e-06,1e-06,2e-06,3e-06,2e-06,2e-06,0,2e-06,2e-06,2e-06,4e-06,0,3e-06,1e-06,2e-06,1e-06,3e-06,0,1e-06,3e-06,0,1e-06,6e-06,7e-06,4e-06,1e-06,5e-06,1e-06,7e-06,2e-06,5e-06,2e-06,2e-06,1e-06,4e-06,6e-06,1e-06,1e-06,2e-06,0,1e-06,3e-06,2e-06,4e-06,3e-06,1e-06,1e-06,2e-06,1e-06,0,1e-06,2e-06,3e-06,1e-06,1e-06,1e-06,3e-06,2e-06,1e-06,1e-06,1e-06,2e-06,1e-06,1e-06,0,1e-06,1e-06,2e-06,1e-06,1e-06,2e-06,0,2e-06,0,2e-06,1e-06,2e-06,1e-06,1e-06,2e-06,2e-06,0,3e-06,1e-06,0,1e-06,1e-06,2e-06,2e-06,1e-06,2e-06,1e-06,2e-06,0,1e-06,0,1e-06,2e-06,1e-06,1e-06,1e-06,1e-06,1e-06,1e-06,2e-06,1e-06,1e-06,0,1e-06,1e-06,1e-06,1e-06,1e-06,1e-06,0,1e-06
2e-06,3e-06,1e-06,1e-05,3e-06,5e-06,2e-06,1e-06,5e-06,2e-06,2e-06,0,1e-06,2e-06,1e-06,4e-06,0,3e-06,0,2e-06,0,3e-06,1e-06,1e-06,3e-06,0,1e-06,6e-06,7e-06,3e-06,1e-06,5e-06,0,6e-06,3e-06,4e-06,2e-06,3e-06,0,4e-06,7e-06,2e-06,1e-06,1e-06,0,1e-06,4e-06,2e-06,3e-06,3e-06,1e-06,0,2e-06,2e-06,1e-06,1e-06,1e-06,3e-06,1e-06,1e-06,0,2e-06,1e-06,1e-06,2e-06,0,1e-06,0,1e-06,1e-06,1e-06,0,3e-06,1e-06,1e-06,1e-06,1e-06,1e-06,1e-06,1e-06,1e-06,1e-06,2e-06,1e-06,2e-06,0,1e-06,1e-06,1e-06,0,1e-06,0,1e-06,2e-06,1e-06,2e-06,1e-06,1e-06,0,1e-06,1e-06,1e-06,1e-06,1e-06,0,1e-06,1e-06,1e-06,1e-06,1e-06,0,1e-06,0,1e-06,1e-06,1e-06,0,0,1e-06,1e-06,1e-06
2e-06,3e-06,2e-06,1.1e-05,3e-06,4e-06,1e-06,0,4e-06,1e-06,2e-06,0,2e-06,3e-06,1e-06,4e-06,1e-06,2e-06,0,2e-06,0,3e-06,0,1e-06,3e-06,0,1e-06,6e-06,7e-06,3e-06,1e-06,5e-06,0,6e-06,3e-06,4e-06,3e-06,2e-06,0,4e-06,6e-06,1e-06,1e-06,1e-06,0,0,4e-06,1e-06,3e-06,3e-06,1e-06,0,2e-06,3e-06,0,1e-06,1e-06,3e-06,1e-06,1e-06,0,2e-06,2e-06,1e-06,1e-06,0,1e-06,0,0,0,0,0,3e-06,1e-06,1e-06,1e-06,0,1e-06,0,2e-06,1e-06,1e-06,2e-06,0,1e-06,1e-06,1e-06,1e-06,1e-06,1e-06,0,0,2e-06,1e-06,1e-06,3e-06,1e-06,1e-06,1e-06,1e-06,1e-06,0,1e-06,1e-06,0,1e-06,0,0,1e-06,2e-06,0,1e-06,0,0,1e-06,0,1e-06,0,0,1e-06,1e-06
2e-06,3e-06,2e-06,1.1e-05,2e-06,5e-06,2e-06,0,4e-06,1e-06,2e-06,0,1e-06,3e-06,1e-06,4e-06,0,2e-06,1e-06,2e-06,0,2e-06,1e-06,1e-06,3e-06,0,1e-06,6e-06,7e-06,3e-06,1e-06,5e-06,0,6e-06,3e-06,4e-06,3e-06,3e-06,0,4e-06,6e-06,1e-06,1e-06,1e-06,1e-06,1e-06,3e-06,1e-06,3e-06,4e-06,1e-06,1e-06,2e-06,3e-06,0,1e-06,1e-06,3e-06,1e-06,1e-06,0,1e-06,1e-06,1e-06,1e-06,0,1e-06,0,0,0,1e-06,1e-06,3e-06,0,1e-06,1e-06,0,1e-06,0,2e-06,1e-06,1e-06,1e-06,0,1e-06,1e-06,0,1e-06,1e-06,0,1e-06,0,1e-06,1e-06,1e-06,3e-06,0,1e-06,0,1e-06,0,0,1e-06,1e-06,0,1e-06,0,0,1e-06,2e-06,0,1e-06,0,1e-06,1e-06,0,1e-06,0,0,1e-06,1e-06
