1e-06,2.4e-05,2.8e-05,3e-05,2.6e-05,1e-06,4e-06,8e-06,2e-06,2e-06,6.8e-05,1.6e-05,3.7e-05,1e-05,0.000223,4.2e-05,0.000117,0.000401,0.000792,0.000167,0.000437,0.000412,0.000641,0.000333,0.000306,0.000581,4.9e-05,0.000126,0.000415,0.000921,0.000297,0.000313,0.000434,0.000713,1.9e-05,0.000151,6.2e-05,0.000217,0.000282,0.000135,0.000487,2e-05,0.000203,0.000173,4.4e-05,9.7e-05,0.000179,4.7e-05,0.00015,7.9e-05,0.000142,0.000131,4.3e-05,8e-05,0.000112,3.4e-05,9e-05,0.00018,5.1e-05,0.00013,1e-06,9.2e-05,6.1e-05,5e-06,5.3e-05,5e-06,3.1e-05,0.000101,8e-06,0.000113,5.7e-05,8.8e-05,3.2e-05,0.000105,0.000608,2.4e-05,0.000827,0.000473,8.6e-05,0.000497,3e-06,5.1e-05,6.3e-05,4.8e-05,0.000218,4.1e-05,1e-05,3.1e-05,2.3e-05,2.5e-05,5e-06,4.2e-05,1.5e-05,2e-05,7e-05,4e-05,6.2e-05,8e-05,1.3e-05,5.6e-05,3e-05,1.7e-05,1e-05,3.2e-05,1.1e-05,1.6e-05,3.3e-05,2.8e-05,5.5e-05,2.8e-05,0.000101,0.000287,5.2e-05,5.1e-05,8e-06,2.7e-05,1.4e-05,1.1e-05,5e-06,3.7e-05,1.1e-05
1.2e-05,4.8e-05,7.2e-05,7.6e-05,5.5e-05,3.6e-05,2.9e-05,3e-05,3.3e-05,0.000114,0.000237,6e-05,4.2e-05,5.5e-05,0.000476,0.000106,0.000196,0.001443,0.002472,0.001857,0.002836,0.002524,0.000775,0.001846,0.002366,0.001493,0.001152,0.00074,0.001518,0.001563,0.000556,0.001165,0.000826,0.001607,0.000221,0.001024,0.000967,0.000733,0.000446,5.2e-05,0.001102,0.000528,0.000755,0.000684,0.000647,0.000374,0.000645,0.000184,0.000257,0.000437,7.6e-05,0.000347,0.000423,0.000414,0.000417,0.000375,0.000181,0.000318,0.000277,0.000342,0.000282,0.000182,0.000238,0.00021,0.000142,0.000144,8.8e-05,0.000189,0.000148,0.000154,0.000276,6.8e-05,0.000368,0.000156,0.001187,0.000851,0.002083,0.001845,0.001196,0.001574,0.000337,0.000118,0.000308,0.00053,0.000877,0.000379,0.000169,0.000222,0.000163,0.000141,0.000137,0.000124,0.000109,0.000137,0.000136,0.000119,0.000135,0.000218,0.000166,5.8e-05,0.000149,0.000118,9.6e-05,8.8e-05,5.8e-05,9.3e-05,0.000105,0.000146,0.000107,0.000136,6.2e-05,0.000502,6.5e-05,7e-05,8.1e-05,5.6e-05,6.3e-05,7.5e-05,7e-05,5.8e-05,7.5e-05
3.8e-05,1.6e-05,3.8e-05,9e-05,3.4e-05,3.1e-05,1.2e-05,3.3e-05,5.4e-05,0.000437,0.000208,0.000182,7.5e-05,7.9e-05,0.000384,0.000197,0.000253,0.002318,0.000837,0.001643,0.002536,0.001926,0.00324,0.003129,0.000377,0.001605,0.000641,0.000551,0.00146,0.001625,0.001504,0.001345,0.000912,0.001404,0.000696,0.001422,0.000277,8.1e-05,0.000565,0.000495,0.001142,0.000943,0.000202,0.000426,0.000786,0.000236,0.000445,0.000336,8.1e-05,0.000336,0.000383,0.000318,2.4e-05,0.000359,0.000161,0.00015,1.7e-05,0.000302,0.000296,9.3e-05,0.000134,4.2e-05,7.6e-05,0.000174,4.4e-05,8e-05,7.4e-05,1.7e-05,8.9e-05,4.9e-05,0.000138,0.000301,0.00076,0.000438,0.000954,0.002383,0.002602,0.002495,0.001801,0.001031,0.001063,0.000611,0.000251,0.000207,0.001217,0.000644,0.000182,0.000176,3.5e-05,6e-05,7.4e-05,4.5e-05,3.8e-05,0.000232,0.000103,0.000253,8.5e-05,7.5e-05,0.000154,0.00011,0.000206,3.3e-05,8e-05,3.5e-05,3.2e-05,8e-05,5.8e-05,7.2e-05,0.000145,3.6e-05,6.4e-05,0.000632,8.3e-05,4.4e-05,2.5e-05,3.7e-05,1.7e-05,4.2e-05,4.3e-05,5.3e-05,7e-05
6.9e-05,6.2e-05,0.000106,8.1e-05,4.2e-05,5e-05,4.6e-05,3.4e-05,8.9e-05,0.000728,0.000518,5e-05,5.2e-05,8e-05,0.00057,0.000427,0.000205,0.002431,0.002285,0.001904,0.004967,0.002133,0.002255,0.001369,0.001851,0.001579,0.000923,0.001193,0.000916,0.000477,0.002796,0.003546,0.002243,0.002135,0.001211,0.001186,0.001783,0.000346,0.000586,0.001058,0.002057,0.001589,0.00126,0.00093,0.000246,0.000717,0.000716,0.000628,0.00078,0.000492,0.000133,3.8e-05,0.000214,0.000262,0.000127,0.00013,4.7e-05,0.000397,0.000142,0.000178,0.000138,9.8e-05,6.8e-05,0.000152,9.7e-05,1.4e-05,5.2e-05,6.1e-05,0.000144,0.000242,0.00021,0.000307,0.000826,0.00051,0.000678,0.002056,0.003232,0.001915,0.000925,0.001842,0.001833,0.00081,0.000309,0.001019,0.001128,0.000791,0.000405,8.1e-05,9.2e-05,7.7e-05,4.2e-05,2.2e-05,0.000118,0.000444,0.000249,0.000451,0.000257,9.6e-05,0.000138,1.9e-05,0.00013,0.000107,5e-05,1.9e-05,2.5e-05,6.3e-05,4.4e-05,9.3e-05,0.000213,0.000213,0.000111,0.000962,0.000388,0.000222,0.000124,5.6e-05,5e-05,2.2e-05,3e-05,3.7e-05,4.7e-05
3.4e-05,3.4e-05,5.4e-05,0.000181,5.5e-05,2.2e-05,7e-06,1.4e-05,2.4e-05,0.000812,0.000465,7.9e-05,0.000159,7e-05,0.001451,0.00063,0.00041,0.00191,0.001662,0.000632,0.004165,0.00348,0.001743,0.001488,0.002711,0.000411,0.00069,0.001482,0.001007,0.001306,0.001527,0.00164,0.00097,0.001225,0.002858,0.001319,0.002004,0.001396,0.000767,0.001522,0.000801,0.001231,0.00079,0.001028,0.000627,0.00073,0.000694,0.000486,0.000419,0.000226,0.000271,9.9e-05,0.000369,0.000265,0.000201,0.00021,9.5e-05,0.001119,0.000802,0.000264,8.8e-05,6.4e-05,5.5e-05,0.000135,0.000109,5.3e-05,4.3e-05,1.9e-05,7.9e-05,0.000249,9.6e-05,0.000638,0.000286,0.000129,7.8e-05,0.001289,0.001813,0.000746,0.000888,0.000714,0.00076,0.000393,0.000457,0.001088,0.000523,0.00024,0.000378,0.000154,0.000145,7.3e-05,4.7e-05,1.4e-05,0.000282,0.000386,0.00024,0.000524,0.000503,0.000323,9.2e-05,6.9e-05,0.000142,4e-05,7.2e-05,0.000114,0.000102,1e-05,1.5e-05,8.2e-05,0.000231,7.4e-05,8.7e-05,0.000595,0.000342,0.000197,0.000154,7.5e-05,8.4e-05,4.2e-05,1.4e-05,4.6e-05,1.3e-05
1.2e-05,3.2e-05,7.2e-05,2e-04,7.1e-05,3.2e-05,1.8e-05,2.5e-05,3.3e-05,0.00097,0.000753,0.000171,0.000171,7.5e-05,0.002239,0.000806,0.000662,0.002696,0.000184,0.000787,0.002573,0.001,0.000781,0.001107,0.001864,0.001667,0.000661,0.000222,0.002877,0.003139,0.001974,0.001404,0.000981,0.001545,0.003011,0.002263,0.002683,0.001301,0.001224,0.001068,0.001822,0.000891,0.001106,0.000234,0.000217,0.001046,0.000338,0.000186,0.000399,0.000304,0.000334,0.000238,0.000228,0.000331,0.000206,0.000199,0.000151,0.001772,0.000101,0.000114,8.9e-05,9.8e-05,0.000193,8.1e-05,4.1e-05,4.7e-05,0.00016,8.9e-05,0.000112,0.000271,0.000204,0.000738,0.000461,0.000181,0.000467,0.000315,0.001656,0.000682,0.001021,0.000918,0.000342,6.3e-05,0.000696,0.001181,0.000579,0.000367,0.000193,0.000162,0.000118,0.000121,9.4e-05,4.7e-05,0.000493,5.8e-05,0.000132,0.000959,0.000603,0.00028,0.000115,0.000103,7.8e-05,8.3e-05,4.2e-05,8.1e-05,0.000112,5.3e-05,1e-05,8e-05,0.000145,1e-04,0.000167,0.000579,0.000264,4.5e-05,4.4e-05,2.9e-05,5.5e-05,4.2e-05,1.8e-05,2.6e-05,1.3e-05
4.8e-05,9e-06,0.000112,1e-04,3.5e-05,1.6e-05,3.4e-05,1e-05,6.5e-05,0.001319,0.000962,0.000349,0.000112,5.2e-05,0.002768,0.000901,0.00103,0.003791,0.002956,0.00117,0.0028,0.002059,0.001678,0.001563,0.002577,0.002286,0.001382,0.002878,0.0041,0.001735,0.006177,0.006499,0.003394,0.001475,0.001378,0.001799,0.003037,0.004511,0.003484,0.000963,0.001897,0.002719,0.000882,0.000905,0.001019,0.000525,0.000533,0.000904,0.000397,0.000356,0.000334,0.000479,0.000402,0.000306,0.000433,0.000333,0.000214,0.001963,0.001546,0.000592,0.000236,0.000182,0.000518,0.000202,9.3e-05,0.00015,8.9e-05,7e-05,0.000268,0.000432,0.000202,0.000595,0.000404,0.000338,0.001021,0.000399,0.001351,0.001008,0.001466,0.001792,0.000838,0.000282,0.000551,0.001239,0.000948,0.000395,0.00053,0.000278,0.000112,0.000129,7.2e-05,2.9e-05,0.000739,0.000126,0.000144,0.001121,0.000401,0.000152,0.000102,0.000303,0.000127,5.4e-05,0.000118,0.000112,0.000152,3.6e-05,4.4e-05,9.2e-05,9.5e-05,8.4e-05,0.000281,0.001961,0.000462,0.000134,4.4e-05,2.3e-05,2.8e-05,3e-05,4.3e-05,2.6e-05,6e-06
3.1e-05,3.8e-05,8e-05,0.000589,0.000195,9.4e-05,3.6e-05,2.5e-05,3.4e-05,0.001611,0.002034,0.001392,0.000595,0.000326,0.003126,0.002603,0.000936,0.005017,0.00498,0.003697,0.001164,0.003459,0.000794,0.000811,0.002469,0.003543,0.002834,0.004121,0.001106,0.002858,0.006282,0.005554,0.00349,0.004374,0.002457,0.002412,0.004443,0.005302,0.002097,0.001685,0.002366,0.00336,0.002878,0.000638,0.000652,0.001041,0.000706,0.001062,0.001181,0.000229,0.000339,8.5e-05,0.000431,0.000628,0.000384,0.000481,0.000251,0.001845,0.001394,0.000969,0.000487,0.00028,0.000716,0.000441,0.000217,0.000264,0.000282,0.000202,0.000213,0.000248,0.00041,0.000531,0.000592,0.000359,0.001774,0.000725,0.001057,0.00086,0.000749,0.002512,0.001104,0.000133,0.000486,0.000322,0.001014,0.000726,0.000719,0.000376,9.6e-05,0.000118,6.2e-05,2.9e-05,0.000987,0.000742,0.000416,0.001048,0.000777,0.000309,0.000244,0.000575,0.000339,0.000237,0.000156,0.000126,0.000179,0.000152,0.000161,3.8e-05,8.8e-05,5.4e-05,0.000372,0.003307,0.002209,0.000831,0.00033,9.9e-05,1.3e-05,1.6e-05,2.7e-05,2.2e-05,2e-05
6.4e-05,1.5e-05,8.3e-05,0.000935,0.000731,0.000363,6.6e-05,0.000106,2.1e-05,0.001682,0.00131,0.001154,0.001327,0.000761,0.002871,0.002448,0.001241,0.003947,0.004447,0.000683,0.003097,0.004993,0.004887,0.001682,0.001596,0.003002,0.001075,0.00166,0.003138,0.003555,0.001687,0.001378,0.001809,0.003008,0.003245,0.003546,0.002342,0.002131,0.003672,0.003462,0.002109,0.001022,0.000827,0.001162,0.001049,0.000368,0.000684,0.000798,0.000624,0.000666,0.000389,0.000357,0.000226,0.000345,0.000523,0.000154,0.000272,0.001122,0.001174,0.000853,0.000418,3.8e-05,0.000429,0.000368,0.00015,9.2e-05,8.7e-05,7.6e-05,0.00021,0.000379,2e-04,0.000268,0.000503,0.000454,0.001708,0.001206,0.001077,0.000758,0.001142,0.00132,0.001543,0.000786,0.000589,0.000567,0.001108,0.000638,0.000328,0.000954,0.000577,0.000115,6.3e-05,2.6e-05,0.001124,0.001186,0.000491,0.000825,0.001366,0.00068,0.000335,0.000439,0.000419,0.000513,0.000349,0.000158,0.000278,0.000232,4.4e-05,0.000174,8.9e-05,0.000102,0.000515,0.003557,0.003886,0.001947,0.000607,8.4e-05,4.5e-05,5.6e-05,3.6e-05,6e-06,2.9e-05
1.1e-05,3.3e-05,0.000156,0.000931,0.000628,0.000171,9.9e-05,0.000194,0.00018,0.001321,0.002994,0.001839,0.001332,0.000434,0.002303,0.002292,0.000963,0.003542,0.002357,0.002269,0.002141,0.003154,0.002851,0.001878,0.001211,0.000778,0.002097,0.001532,0.003058,0.001556,0.001622,0.001581,0.001772,0.000802,0.000837,0.001635,0.001394,0.000975,0.001409,0.000785,0.000927,0.000773,0.001209,4.9e-05,0.000256,0.000382,0.000585,0.000473,0.000191,0.00018,6.2e-05,0.000185,7.9e-05,0.000246,0.000343,0.000111,0.000215,0.000841,0.001354,7e-04,0.000173,7e-05,0.00016,8.1e-05,9.9e-05,4.7e-05,0.000149,0.000124,0.000163,0.000371,0.000315,0.000483,0.000374,0.000268,0.002043,0.00111,0.000539,0.000159,0.000559,0.001222,0.001869,0.000935,0.000972,0.000429,0.000733,0.000215,0.000405,0.0011,0.000498,0.000165,2.6e-05,0.000109,0.001133,0.000986,0.000478,0.000512,0.000953,0.00051,0.000408,0.000265,0.00034,0.00017,0.000244,0.000257,8.3e-05,0.000119,0.000184,2.8e-05,0.000128,5.7e-05,0.000595,0.002224,0.000891,0.000576,0.000306,6.9e-05,3.3e-05,3.9e-05,1.8e-05,3.1e-05,3.1e-05
4.7e-05,5.1e-05,0.000104,0.000524,0.000311,0.000209,6.6e-05,6.9e-05,9.7e-05,0.001055,0.002086,0.000913,0.000527,0.000172,0.001963,0.002255,0.001563,0.003391,0.001456,0.000892,0.00338,0.000731,0.003122,0.00189,0.001849,0.000965,0.001131,0.000853,0.001802,0.001522,0.00198,0.002076,0.000354,0.000506,0.001201,0.000547,0.001611,9.8e-05,0.000723,0.00049,0.000898,0.001209,0.000749,0.000667,0.000309,0.000377,0.000471,0.000587,0.000142,0.000172,0.000121,0.000116,1e-04,0.000186,0.000417,0.00039,0.000262,0.000756,0.00093,3e-04,0.000145,0.000182,7.8e-05,1.5e-05,6.4e-05,5.6e-05,0.000136,6.5e-05,0.000224,0.000312,0.000183,0.000275,0.000137,9.9e-05,0.001819,0.001468,0.000249,0.000278,0.00087,0.001529,0.001869,0.00083,0.000965,0.000821,0.000629,0.000404,0.000201,0.000748,0.000466,0.000292,0.000155,0.000116,0.00107,0.001231,0.000579,0.000471,0.00039,0.000191,0.000195,0.000206,0.000106,7.1e-05,0.000185,4.6e-05,0.000136,7e-05,8.5e-05,0.000138,0.000181,0.000156,0.000709,0.000702,0.001151,0.000446,7.2e-05,2.4e-05,1.7e-05,4e-05,5.4e-05,5.2e-05,2.4e-05
1.3e-05,2.5e-05,0.000137,0.000286,0.000115,3.9e-05,2.1e-05,3.6e-05,5.3e-05,0.00112,0.000343,0.000172,0.00066,0.000332,0.001713,0.000971,0.000356,0.001851,0.000704,0.000598,0.002563,0.000575,0.000678,0.000348,0.001295,0.000623,0.001687,0.001121,0.001592,0.001225,0.000991,0.001451,0.00178,0.000571,0.002312,0.000854,0.001329,0.000326,0.000558,0.000549,0.001239,0.000342,0.000154,9.7e-05,0.000293,0.000129,0.000447,0.000282,2e-04,0.000123,3.7e-05,0.000113,0.00011,0.000155,0.000355,0.000265,0.000142,0.000942,0.000854,0.000715,0.000208,7.8e-05,0.000166,0.000212,9.9e-05,1e-05,1e-05,5.6e-05,0.000193,0.000206,0.000149,0.000239,0.000125,0.000105,0.001111,0.000757,0.000673,0.000111,0.000802,0.001664,0.000513,0.000224,0.000695,0.000587,1e-04,6.4e-05,0.000226,0.000582,0.000281,0.000125,6.2e-05,3e-05,0.000894,0.00094,0.00051,0.000307,8.7e-05,7.1e-05,4.2e-05,0.000142,3.9e-05,0.000239,7.7e-05,4.9e-05,8.9e-05,2.2e-05,3.3e-05,8.3e-05,0.000152,5.5e-05,0.000733,0.000662,0.000265,0.000163,1.6e-05,2.7e-05,2.5e-05,2.8e-05,1.6e-05,9e-06,5e-06
8e-06,1.8e-05,0.000123,0.00021,7.2e-05,3.5e-05,2.2e-05,2.9e-05,3.9e-05,0.001446,0.000941,0.000326,0.00065,0.000306,0.001191,0.000203,0.000224,0.000938,0.000962,0.000558,0.001987,0.001248,0.001746,0.000868,0.001473,0.00265,0.000303,0.000437,0.001544,0.001497,0.000286,0.000195,0.001302,0.000849,0.001535,0.000248,0.00139,0.000488,0.001068,0.000656,0.001435,0.000687,0.000297,0.000168,0.00047,0.000335,0.000293,0.00019,2e-04,0.000135,0.000117,0.000144,0.000129,0.000171,0.000214,8e-05,8.4e-05,0.00079,0.000534,7.8e-05,4.2e-05,7.1e-05,0.000105,5e-05,0.000204,2.6e-05,5.9e-05,4.8e-05,0.000188,0.000126,2.6e-05,0.000116,6.1e-05,6.1e-05,0.000209,0.00014,0.000259,0.000393,0.00082,0.000772,0.000172,5.6e-05,0.000598,0.000526,0.000181,0.000151,0.000164,0.000154,8.9e-05,5.5e-05,6.1e-05,3.1e-05,0.000684,0.000232,0.000112,2e-04,6.8e-05,0.000104,8e-06,7.9e-05,9.5e-05,0.00025,5.1e-05,4.2e-05,3.3e-05,9e-06,4.2e-05,6.1e-05,0.000144,8.4e-05,0.000815,0.000214,0.000208,5.1e-05,4e-05,3.1e-05,1.6e-05,4e-06,3e-06,8e-06,1.2e-05
2e-06,8e-06,0.000135,7.9e-05,1.7e-05,1.3e-05,5.9e-05,3.5e-05,4.7e-05,0.001611,0.000207,0.000248,0.000398,0.000235,0.000628,0.000218,0.000226,0.00131,0.000452,0.000124,0.001538,0.001129,0.003845,0.002175,5.4e-05,0.003484,0.000964,0.001333,0.001831,0.00215,0.002203,0.005198,0.000727,0.002228,0.002443,0.001319,0.001978,0.001475,0.001956,0.001475,0.001462,0.001044,0.000673,0.000345,0.00063,0.000206,0.000422,0.000414,0.000284,0.000159,0.000181,4.5e-05,5.7e-05,0.000204,0.000314,7.7e-05,0.000188,0.000317,0.000237,0.000221,1.5e-05,0.000104,9.6e-05,0.00011,0.00018,0.00019,0.000131,7.4e-05,0.000289,0.000119,4.1e-05,6.7e-05,9e-05,6.7e-05,0.000294,0.000262,0.000107,0.000139,0.000711,0.001066,0.000732,0.000208,0.000419,0.000491,0.000139,7.2e-05,0.000234,0.000203,6.7e-05,3.8e-05,4.3e-05,5e-06,0.000485,9.9e-05,1.6e-05,0.000203,2.5e-05,6.7e-05,6.1e-05,7.9e-05,0.000139,4.3e-05,0.000129,4e-05,6.3e-05,2.2e-05,3e-05,4.7e-05,0.000111,5.8e-05,0.000839,0.000316,9e-05,8.8e-05,7.4e-05,7.3e-05,3.3e-05,1.8e-05,2.1e-05,1e-05,1.3e-05
1.5e-05,6e-06,0.000135,0.000227,4.9e-05,7e-06,4.8e-05,1.4e-05,0.000105,0.001818,0.001613,0.000839,0.000716,0.000183,0.000896,0.000425,0.00024,0.00384,0.002757,0.001283,0.001672,0.002373,0.006285,0.004192,0.001932,0.004986,0.00291,0.00346,0.002447,0.004038,0.006922,0.0038,0.004375,0.001962,0.004053,0.002193,0.000195,0.001441,0.002422,0.002711,0.000824,0.003353,0.001988,0.002027,0.002151,0.001049,0.000239,0.001291,0.000563,0.00032,0.000214,0.000134,0.000125,0.00018,0.000506,0.000216,0.000219,0.000503,0.000417,0.000502,0.000311,0.000163,0.000179,0.000113,0.000178,0.000158,5.9e-05,0.000105,0.000342,0.000227,7.9e-05,1.9e-05,0.000104,0.000276,0.000181,0.00024,0.000245,0.000295,0.000523,0.001236,0.00097,0.000489,0.000449,0.000522,0.000218,0.000107,0.000318,0.000196,0.000104,2.7e-05,4e-05,4e-05,0.000275,0.000321,0.000127,0.000152,7.6e-05,3.7e-05,3.4e-05,7.3e-05,0.00019,0.000165,0.000156,8.5e-05,2.2e-05,6e-05,3.3e-05,5.2e-05,0.000132,4.6e-05,0.000831,0.000689,0.000384,0.000191,7.5e-05,3.2e-05,2.8e-05,1.9e-05,1.9e-05,1.7e-05,2.3e-05
1.2e-05,7e-06,0.000145,0.000178,0.000151,5.5e-05,1.4e-05,3.2e-05,9.8e-05,0.00194,0.001307,0.000552,0.000559,0.000493,0.001282,0.000817,0.000291,0.005235,0.002565,0.000754,0.001472,0.004918,0.006079,0.00557,0.007239,0.010614,0.005869,0.003221,0.007299,0.003651,0.006245,0.00975,0.002921,0.00566,0.005557,0.001393,0.003884,0.002031,0.002049,0.003676,0.001113,0.004631,0.003222,0.000533,0.001187,0.000773,0.000761,0.001941,0.000602,0.000308,0.000386,0.000439,4.6e-05,0.000292,0.000427,0.00046,0.000289,0.000936,0.001036,0.000259,3.5e-05,0.000179,4.3e-05,0.000384,0.00023,0.000171,0.000189,3e-05,0.00039,0.000232,0.000118,0.000245,6.7e-05,0.000337,0.000968,0.000286,0.000224,0.000234,0.000347,0.001029,0.000518,3.5e-05,0.000192,0.000567,2e-04,0.000253,0.000134,0.000116,4.2e-05,6e-06,4.4e-05,2.9e-05,0.000106,0.000563,0.000295,0.000213,0.000124,0.000105,5.5e-05,0.000118,0.000189,0.00032,0.000197,5.9e-05,4.3e-05,3.7e-05,6.8e-05,7.7e-05,0.000212,0.000122,0.000848,0.001257,0.000657,0.000225,3.5e-05,5.1e-05,3.9e-05,1.5e-05,1.5e-05,1.1e-05,3.6e-05
4e-06,8e-06,0.000143,0.000106,3.5e-05,1.3e-05,4.2e-05,3e-05,0.000116,0.001432,0.001052,0.000496,0.001608,0.00076,0.001676,0.000485,7.8e-05,0.004755,0.002996,0.001452,0.001376,0.006574,0.010299,0.007879,0.003856,0.006897,0.008306,0.006465,0.007312,0.00816,0.005803,0.002688,0.008411,0.009288,0.010667,0.009757,0.008613,0.006714,0.005237,0.002753,0.002614,0.00394,0.00154,0.001598,0.002303,0.001874,0.00128,0.001269,0.00148,0.000402,0.00032,0.000433,0.00056,0.000234,0.000272,0.000246,7e-04,0.001972,0.001029,0.000381,0.000274,0.000183,0.000295,0.000747,0.000755,0.000893,0.000738,0.000434,0.00034,0.000415,0.000543,0.000147,0.000224,0.00046,0.002129,0.001766,0.000765,0.000368,0.000434,0.001626,0.000848,0.000428,0.000465,0.000393,0.000159,0.000143,0.000292,0.000139,0.000103,5.5e-05,3.2e-05,2.9e-05,5.6e-05,0.000361,0.000234,0.000258,1.4e-05,2e-05,5.8e-05,5.9e-05,0.000292,0.000525,0.000372,0.000174,6.4e-05,7e-06,9.3e-05,0.00013,0.000211,0.000128,0.000785,0.00073,0.000508,0.000194,5.5e-05,4.7e-05,2.6e-05,3.2e-05,5e-05,4.4e-05,4.9e-05
8e-06,1.4e-05,0.000143,0.000112,3.5e-05,2.2e-05,9.9e-05,8.2e-05,6.1e-05,0.000708,0.001646,0.000887,0.001628,0.00088,0.001695,0.001398,0.00075,0.00273,0.00043,0.000181,0.001731,0.004369,0.002233,0.006578,0.009192,0.004669,0.007341,0.006909,0.007969,0.008629,0.004534,0.002311,0.007414,0.006823,0.004736,0.008829,0.002762,0.003325,0.000386,0.005579,0.004737,0.004007,0.001895,0.002059,0.002189,0.001154,0.000495,0.001296,0.001999,0.001487,0.000659,8e-05,3e-04,0.000731,3e-04,0.000307,0.000285,0.002039,0.001402,0.000654,0.000254,0.000304,0.000606,0.000535,0.000186,0.000528,0.00045,0.000174,0.000192,0.000199,0.000495,5e-04,0.000489,0.000415,0.002475,0.001998,0.001018,0.000338,0.000559,0.001287,0.000804,0.000546,0.000477,0.000337,0.000347,0.000112,0.000252,0.00022,7e-05,4.9e-05,5.3e-05,2e-05,8.4e-05,0.000156,4.2e-05,0.000155,5.8e-05,3.4e-05,9.7e-05,9.1e-05,0.000222,0.000913,0.00051,0.000194,5e-06,3.4e-05,6.4e-05,4e-06,0.000124,4.3e-05,0.000727,0.000661,0.000587,0.000253,4.2e-05,2.3e-05,6.8e-05,2.8e-05,4.2e-05,5.1e-05,3.8e-05
6e-06,1.7e-05,0.000111,3.2e-05,2.9e-05,4.3e-05,9.1e-05,2.4e-05,0.000105,0.000253,0.001039,0.000843,0.002101,0.001153,0.001593,0.000835,0.000157,0.000641,0.000582,0.000278,0.001339,0.001188,0.002354,0.005226,0.005638,0.002966,0.006868,0.004284,0.002268,0.006784,0.001789,0.001943,0.004779,0.000514,0.002895,0.004255,0.003914,0.001281,0.001617,0.004383,0.001159,0.000889,0.001044,0.001333,0.000885,0.000644,0.000252,0.000968,0.001078,0.000898,0.000627,7.3e-05,0.000235,0.000711,0.000554,0.000244,0.000312,0.001318,0.000159,0.000139,0.000266,0.000125,0.000453,0.000536,0.000414,0.000374,0.000106,0.000117,8e-05,0.000286,0.000267,8.7e-05,0.00023,0.000351,0.001417,0.000498,0.000236,0.000212,0.000404,0.001731,0.000551,0.000382,0.00054,0.000625,0.000528,0.000235,0.000244,0.000239,0.000122,4.4e-05,4.8e-05,3.7e-05,8.8e-05,5.8e-05,9e-05,0.000178,8.5e-05,4.3e-05,8e-05,7.2e-05,0.00034,0.001251,0.000439,0.000138,2.4e-05,9e-06,1.8e-05,2.4e-05,0.000121,0.000103,0.000705,0.001427,0.00067,0.000285,2.9e-05,1.2e-05,5.8e-05,2.9e-05,3.9e-05,2.2e-05,2e-06
6e-06,1.9e-05,0.000122,3.4e-05,6.1e-05,3.1e-05,7.8e-05,7.1e-05,0.000151,0.000168,0.000475,0.00017,0.00114,0.000491,0.000778,0.000532,0.00036,0.001641,0.001352,0.000783,0.00086,0.003605,0.003795,0.005141,0.001361,0.002372,0.002889,0.004443,0.004004,0.001227,0.003854,0.003546,0.003229,0.001424,0.000839,0.002774,0.002317,0.003222,0.001755,0.003186,0.003509,0.002328,0.001911,0.001672,0.001807,0.001245,0.000812,0.001457,0.000435,0.00066,0.000257,0.000165,5.6e-05,0.000607,0.00048,0.000217,0.000505,0.000979,0.00077,0.000461,0.000256,0.000194,0.00024,0.000254,8.2e-05,0.000183,9.5e-05,0.000222,0.000238,0.000212,0.000226,2e-04,0.000151,9.9e-05,0.000416,0.000479,0.000509,0.000217,0.000732,0.002326,0.002312,0.001106,0.000397,0.000443,9.7e-05,9.2e-05,5.7e-05,9e-05,5.5e-05,5.6e-05,2e-05,1.5e-05,4.6e-05,0.00013,0.000159,0.000181,6.6e-05,0.000124,7.4e-05,4.2e-05,0.000377,0.001358,0.000969,0.000445,0.000142,5.5e-05,4.4e-05,2.4e-05,0.000119,4.7e-05,0.00061,0.000922,0.000329,0.000111,4e-05,3.2e-05,2.6e-05,1.7e-05,2.5e-05,1.2e-05,2.5e-05
1.2e-05,1.4e-05,0.000102,2.6e-05,7.6e-05,3.9e-05,7.2e-05,3.8e-05,0.000129,0.000628,0.000596,0.00021,0.000698,0.000349,9.2e-05,0.000307,6.6e-05,0.001716,0.000914,0.000341,0.000837,0.003741,0.000372,0.001697,0.002164,0.003194,0.002455,0.004731,0.00044,0.000752,0.002535,0.001497,0.000937,0.000839,0.001703,0.002099,0.000881,0.002076,0.001038,0.000755,0.001809,0.00075,0.001027,0.000389,0.000993,0.000307,0.00049,0.000971,0.000405,0.000147,0.000104,3.8e-05,0.000158,0.000383,0.000243,0.00026,0.000188,0.000448,0.000227,3.8e-05,5.7e-05,8.4e-05,7.8e-05,7.9e-05,0.000111,0.000139,0.000112,0.000119,0.000286,0.000201,0.000104,0.00022,0.000127,0.000104,0.000872,0.000683,0.000348,4.6e-05,0.000842,0.001499,0.001599,0.000717,0.000433,0.000435,0.000226,7.1e-05,9e-05,0.000126,0.00012,7.4e-05,1.8e-05,1.7e-05,7.6e-05,0.000184,0.000177,0.000124,9.7e-05,3.8e-05,3.9e-05,5.7e-05,0.000316,0.00099,0.00043,0.000122,3.5e-05,2e-05,3.1e-05,2.6e-05,7.5e-05,4.4e-05,0.000523,0.000463,0.000238,8.9e-05,5e-05,5e-06,2.4e-05,3.7e-05,8e-06,1.3e-05,2e-05
1.2e-05,1.8e-05,9.5e-05,7.9e-05,1.1e-05,2.3e-05,4.8e-05,4.2e-05,0.000149,0.000794,0.000887,0.000515,8.9e-05,8.3e-05,0.000362,0.000172,0.000103,0.001158,0.000428,0.000184,0.000626,0.002096,0.000986,0.00288,0.001117,0.000337,0.001675,0.003181,0.002441,0.000709,0.00318,0.001953,0.000366,0.000748,0.000863,0.000796,0.000703,0.00084,0.000573,0.001012,0.000522,0.000397,0.001108,0.000539,0.000527,0.000381,0.000531,0.000162,0.000212,9.1e-05,9.8e-05,6.5e-05,0.000156,0.000298,0.000219,0.000126,0.000115,0.00011,0.00025,5.4e-05,0.000111,3.7e-05,3.2e-05,9.7e-05,0.000109,6.3e-05,3.6e-05,6.4e-05,0.000146,6.9e-05,4.8e-05,0.000176,4.3e-05,9.8e-05,0.001242,0.000541,0.000268,0.000122,0.00087,0.002342,0.001326,0.000499,0.000358,0.000427,0.00019,0.000105,6.5e-05,6.7e-05,7.8e-05,8.4e-05,8.9e-05,5.6e-05,3.7e-05,0.000146,2.5e-05,0.000134,0.000133,9.5e-05,4.3e-05,1.3e-05,0.000354,0.000419,0.00021,5.2e-05,3.5e-05,1.5e-05,2e-05,1e-05,2.6e-05,8e-06,0.000444,0.00093,0.000523,0.000178,4.5e-05,1.3e-05,1.2e-05,2.1e-05,2.8e-05,1e-05,2.3e-05
4e-06,4e-06,4.2e-05,3.1e-05,7e-06,1.5e-05,4e-06,1.5e-05,6.9e-05,0.000358,8.9e-05,0.000132,0.000147,9e-05,0.000232,0.000149,3.6e-05,0.00036,8.9e-05,5.4e-05,0.000154,0.000347,0.000737,0.000479,0.000411,0.000522,0.000596,0.001128,0.000185,0.000459,0.000992,0.000604,0.000221,0.000166,0.000241,0.000468,0.000386,0.000126,0.000146,0.000479,0.000658,0.000361,0.000193,0.000132,3e-05,4.7e-05,0.000115,5.8e-05,8.2e-05,5.4e-05,6.8e-05,2.5e-05,3e-05,4.2e-05,2e-05,3e-05,3.8e-05,0.000101,1.7e-05,8e-06,4.5e-05,1.3e-05,2.1e-05,5e-06,4.8e-05,3.5e-05,1.9e-05,2.7e-05,3.5e-05,3.5e-05,2e-05,6.4e-05,2.7e-05,5.9e-05,0.000583,0.000308,5.5e-05,5.8e-05,0.000343,0.001021,0.000412,0.00015,0.000138,4.5e-05,1e-05,1.4e-05,3.2e-05,5.1e-05,1.6e-05,1.3e-05,1.4e-05,1e-06,2.9e-05,4.2e-05,4.1e-05,1.1e-05,2.7e-05,8e-06,1e-05,1.5e-05,0.000185,7.7e-05,3.2e-05,3e-06,8e-06,5e-06,9e-06,1.3e-05,8e-06,4e-06,0.000184,0.000338,0.000142,5.8e-05,2e-05,1.4e-05,5e-06,6e-06,2e-06,5e-06,2e-06
2e-06,4e-06,3.9e-05,9e-06,1e-05,1.3e-05,1.5e-05,5e-06,7.3e-05,0.000319,0.000186,0.000197,0.000115,2e-05,0.000263,0.000168,1e-04,9e-05,0.000273,7.2e-05,0.000149,0.000154,0.000513,0.000658,0.000507,0.000137,0.000609,0.000717,0.000904,0.00048,0.000557,0.00069,0.000242,0.000328,0.000414,0.00054,0.000122,0.000279,0.000288,4e-04,0.000436,0.000105,3.3e-05,0.000135,4.2e-05,9.1e-05,0.000107,9e-05,5.5e-05,1.8e-05,2.5e-05,4.1e-05,2.4e-05,5.9e-05,6e-05,2.5e-05,6e-06,0.000159,9.1e-05,2.8e-05,1.2e-05,3e-05,1e-06,2.4e-05,2.8e-05,2.3e-05,1.2e-05,6.3e-05,7.2e-05,5.1e-05,1.4e-05,4.8e-05,1.4e-05,4.4e-05,0.000367,0.000133,0.000108,6.5e-05,0.000297,0.000636,0.000195,8.8e-05,0.000101,6.6e-05,2.2e-05,2.4e-05,4.2e-05,4.7e-05,3.3e-05,1.3e-05,1.3e-05,6e-06,4.5e-05,3.1e-05,1e-05,1.8e-05,1.5e-05,3e-06,1.3e-05,1.6e-05,0.000175,0.000169,8.7e-05,2.8e-05,3e-06,4e-06,2e-06,2e-06,1e-05,1e-06,0.000153,0.000192,0.000104,2.9e-05,1.2e-05,7e-06,9e-06,1.1e-05,1.2e-05,6e-06,5e-06
5e-06,2e-06,3.2e-05,1.9e-05,1e-05,8e-06,3e-06,5e-06,7.3e-05,0.000189,9.7e-05,0.000114,9.7e-05,6.2e-05,0.00022,0.000151,2.9e-05,0.000288,0.000104,3e-05,0.000134,0.000514,0.000656,0.000521,0.000248,0.000452,0.000488,0.000236,0.000245,0.00016,0.000225,0.00042,0.000109,0.000406,0.000365,0.000352,7e-05,0.000162,0.000156,0.000219,0.000337,7.1e-05,0.000198,9.9e-05,9.3e-05,7e-06,2.8e-05,0.000101,3e-05,4.5e-05,1.3e-05,1.7e-05,1.4e-05,8e-05,7e-05,5e-05,2.5e-05,0.000114,3.7e-05,1.5e-05,2e-05,2.9e-05,1.8e-05,1.8e-05,3.4e-05,9e-06,1.5e-05,4.3e-05,3.1e-05,9e-06,1.2e-05,3.3e-05,4e-05,1.8e-05,0.000163,0.000105,4.1e-05,5.1e-05,0.000209,0.000589,0.00022,0.000133,8.1e-05,8.6e-05,2.8e-05,1.4e-05,4.9e-05,1.7e-05,2.1e-05,9e-06,1.4e-05,3e-06,4.9e-05,1.7e-05,5e-06,3e-05,1.9e-05,1.6e-05,5e-06,6e-06,0.000169,0.000114,4.9e-05,2e-05,1.1e-05,6e-06,7e-06,4e-06,4e-06,2e-06,0.000127,0.000187,9.9e-05,2.8e-05,1.1e-05,1e-05,1e-06,6e-06,7e-06,3e-06,2e-06
4e-06,2e-06,2.8e-05,1.2e-05,5e-06,3e-06,1e-06,3e-06,7.9e-05,1.3e-05,5.2e-05,0.000124,6.5e-05,4.4e-05,0.000199,0.000115,4.8e-05,0.000445,0.000249,0.000104,0.000177,0.000861,0.000422,5e-04,0.000401,0.000604,0.000832,0.000344,0.000477,0.000239,0.000326,0.000727,0.000335,2.2e-05,0.000229,0.000662,0.000119,7e-05,0.00016,8.4e-05,0.000291,3e-05,0.000133,3.1e-05,2.2e-05,2.1e-05,4e-05,4.7e-05,2.3e-05,2.4e-05,1.4e-05,1.2e-05,9e-06,7e-05,1.7e-05,4e-06,3.2e-05,6.3e-05,4.6e-05,1e-05,1.5e-05,2.4e-05,2.1e-05,2.5e-05,2.6e-05,1.8e-05,2.1e-05,2e-05,3.6e-05,3.3e-05,2.5e-05,2.6e-05,3.5e-05,5e-05,8e-05,0.000101,6.7e-05,2.6e-05,0.00013,0.000359,9.3e-05,8e-05,3.6e-05,3.1e-05,2.9e-05,4.1e-05,3.3e-05,3e-05,0,1.3e-05,1e-05,7e-06,4.7e-05,5e-06,3e-06,1.5e-05,9e-06,3e-06,2e-06,1.2e-05,0.00016,8.1e-05,3e-05,1.9e-05,6e-06,3e-06,7e-06,5e-06,1e-05,2e-06,0.000106,8.5e-05,6.1e-05,2.9e-05,1.1e-05,5e-06,2e-06,6e-06,6e-06,2e-06,8e-06
2e-06,2e-06,2.6e-05,1.5e-05,1e-06,9e-06,1.1e-05,5e-06,7.8e-05,4.7e-05,7.3e-05,0.000123,5.8e-05,3.9e-05,0.000171,3.6e-05,7.6e-05,0.000319,3.2e-05,7.4e-05,0.000204,0.000685,0.000322,0.000445,0.000331,0.000142,0.000516,5.3e-05,0.000554,0.000282,0.000393,0.000425,0.000125,0.000272,0.000377,0.000415,0.000353,0.000181,5.4e-05,0.000244,0.000328,8.2e-05,0.000105,7.2e-05,2.6e-05,3.9e-05,5.9e-05,8.4e-05,6e-05,3e-06,2.7e-05,2.5e-05,6e-06,5.2e-05,1.5e-05,1e-05,8e-06,1.6e-05,5.5e-05,2.8e-05,2.3e-05,1e-05,3.1e-05,5e-06,2.7e-05,2.5e-05,1.3e-05,1.5e-05,2.9e-05,1.9e-05,2.7e-05,9e-06,4.4e-05,1.1e-05,0.000177,4.4e-05,9.2e-05,6e-05,5e-05,0.000305,0.000195,5.6e-05,5.4e-05,0.000137,1.8e-05,2e-05,2.3e-05,1.6e-05,1.3e-05,1.3e-05,1.7e-05,1.4e-05,3.9e-05,7e-06,9e-06,2.8e-05,1.1e-05,7e-06,5e-06,1.1e-05,0.000145,7.9e-05,3.8e-05,2.7e-05,1.9e-05,1e-05,1.2e-05,1.7e-05,5e-06,8e-06,0.000103,0.00011,3.6e-05,3.7e-05,2.1e-05,1.9e-05,1.4e-05,9e-06,6e-06,2e-06,1.1e-05
2e-06,1e-06,2.2e-05,7e-06,6e-06,1.2e-05,3e-06,3e-06,7.3e-05,9.6e-05,5.2e-05,0.000118,4.6e-05,1.4e-05,2e-04,0.000163,0.000106,3e-04,0.000139,6e-05,0.000249,0.000254,0.000295,0.000505,0.00035,0.000344,0.000219,0.000361,0.000419,0.000283,0.000312,0.000661,0.00049,0.000188,0.000416,0.000185,0.000124,0.000217,0.000438,0.000141,0.000162,4.8e-05,7.2e-05,0.00012,7.4e-05,3.1e-05,6.8e-05,0.000158,6.4e-05,4.3e-05,3.8e-05,1.3e-05,2.7e-05,3.3e-05,2.2e-05,1.6e-05,3e-05,8.4e-05,3.1e-05,8e-06,1.7e-05,1.7e-05,6e-06,1.1e-05,2.1e-05,2.6e-05,2.1e-05,1.3e-05,2.1e-05,5e-06,2.5e-05,3.7e-05,2.6e-05,1.5e-05,0.00017,0.000122,0.000129,0.000102,5.2e-05,9.1e-05,0.000133,5.5e-05,6e-05,9.2e-05,8.5e-05,4.8e-05,4.4e-05,1.8e-05,1.1e-05,1.9e-05,1.3e-05,5e-06,4.7e-05,1.4e-05,1.6e-05,2.9e-05,6e-06,1.4e-05,7e-06,4e-06,0.000136,8.5e-05,5.6e-05,2.4e-05,7e-06,2e-06,4e-06,8e-06,4e-06,4e-06,9.4e-05,0.000109,2.4e-05,2.5e-05,1e-06,9e-06,6e-06,5e-06,1.3e-05,4e-06,3e-06
3e-06,3e-06,2.1e-05,1.3e-05,4e-06,6e-06,5e-06,5e-06,7.2e-05,0.000135,6.1e-05,0.00011,5.8e-05,3.2e-05,0.00022,0.000114,3.1e-05,0.000405,0.000278,0.00017,0.000274,0.000587,0.000502,0.000278,0.000336,0.000274,0.000285,0.000251,0.000384,7.6e-05,0.000219,0.000393,0.000275,9.2e-05,0.000216,0.000121,0.00038,7e-05,0.000439,0.000341,0.00018,7.6e-05,0.000183,5.7e-05,3.5e-05,3.6e-05,7.1e-05,0.000157,8.4e-05,4.9e-05,3.5e-05,3.8e-05,2.4e-05,3.5e-05,3.3e-05,2.8e-05,2.7e-05,0.000113,9.9e-05,2.6e-05,1.4e-05,7e-06,1.4e-05,1.4e-05,1.4e-05,2e-06,3.3e-05,3.6e-05,2e-05,3e-05,4.4e-05,5e-05,8e-06,2.2e-05,8.9e-05,4e-05,5.1e-05,5.5e-05,6.7e-05,0.000227,8.2e-05,4.4e-05,7.4e-05,4.7e-05,4.2e-05,1.2e-05,3.1e-05,2.4e-05,2e-05,2.3e-05,1.7e-05,7e-06,4.9e-05,1.1e-05,1.2e-05,2.8e-05,7e-06,1e-05,9e-06,8e-06,0.000114,0.000149,6.1e-05,2.3e-05,9e-06,7e-06,6e-06,3e-06,1.2e-05,4e-06,8.4e-05,2.2e-05,7.8e-05,4e-05,1.1e-05,5e-06,1.2e-05,1e-05,7e-06,2e-06,8e-06
2e-06,1e-06,1.6e-05,1.8e-05,9e-06,3e-06,2e-06,7e-06,6.3e-05,8.6e-05,9.7e-05,0.000109,2.7e-05,3.5e-05,0.000221,0.00015,9e-05,0.000381,8.2e-05,4.5e-05,0.000226,0.000477,0.000286,0.000273,0.000345,0.000123,0.000309,0.000285,0.000369,0.000296,1e-04,0.000407,0.000466,0.000216,0.000257,0.000362,0.000359,0.000309,0.000248,0.000286,8.2e-05,0.000176,0.000256,0.000197,0.000138,5.9e-05,0.00015,0.000278,0.000151,5.4e-05,7.6e-05,1e-04,2.8e-05,2.6e-05,5.3e-05,6.2e-05,7.1e-05,0.000126,8.1e-05,5.6e-05,3.7e-05,1.5e-05,1.3e-05,6e-06,1.6e-05,2.7e-05,3.6e-05,2.2e-05,2.4e-05,4.9e-05,4.5e-05,0.000116,3.7e-05,3.9e-05,3.4e-05,6e-05,8.6e-05,3.2e-05,0.000107,0.000475,0.000263,9e-05,7.2e-05,6.6e-05,6.4e-05,6.2e-05,2.4e-05,1.6e-05,2.2e-05,1.8e-05,2e-05,6e-06,5.4e-05,1.7e-05,1.5e-05,3.6e-05,8e-06,1.4e-05,1.5e-05,1.6e-05,9.7e-05,0.000144,6.6e-05,2.1e-05,8e-06,3e-06,4e-06,1e-05,1.2e-05,1e-05,8.4e-05,7.5e-05,3.7e-05,1e-05,7e-06,1.7e-05,1.7e-05,1e-05,6e-06,3e-06,1.6e-05
0,2e-06,1.5e-05,1.6e-05,9e-06,7e-06,6e-06,4e-06,6.3e-05,0.000112,0.000104,0.00016,9.6e-05,3e-05,0.000201,4.6e-05,5.2e-05,0.00029,1.9e-05,1.9e-05,0.000264,0.000291,0.000254,0.000281,0.000384,0.000254,0.000279,0.000305,0.00015,0.000154,0.000164,0.000436,8.6e-05,5.5e-05,3.5e-05,0.000251,0.000219,0.000237,0.000133,0.000116,0.000188,0.000148,0.000163,0.000155,0.000119,7.3e-05,0.000191,0.000152,0.000117,9.2e-05,8.9e-05,6.1e-05,6.1e-05,4.3e-05,7.2e-05,2.9e-05,4.3e-05,0.000115,4.3e-05,2.2e-05,2.2e-05,2.8e-05,1.7e-05,3.7e-05,4.3e-05,1.9e-05,3.5e-05,5.2e-05,1.8e-05,4.9e-05,1.7e-05,9.7e-05,8e-05,5.1e-05,8.5e-05,4.2e-05,0.00014,7.7e-05,7e-05,0.000535,0.000292,0.000129,8.2e-05,6.1e-05,3.9e-05,4.8e-05,2.3e-05,1.9e-05,1.5e-05,2.4e-05,8e-06,6e-06,3.3e-05,2.3e-05,2e-05,3.4e-05,1e-05,6e-06,4e-06,4e-06,9.9e-05,9e-05,6.2e-05,1.5e-05,1.3e-05,1.1e-05,2e-06,8e-06,1.1e-05,1.2e-05,7.8e-05,5.1e-05,2.2e-05,3.9e-05,1.6e-05,1.5e-05,1.1e-05,2e-06,1.2e-05,4e-06,1.5e-05
2e-06,0,1.4e-05,1e-05,1.6e-05,8e-06,3e-06,6e-06,5.4e-05,9.9e-05,2.8e-05,0.000126,6.5e-05,2.9e-05,0.000188,0.000109,5.8e-05,0.000298,9.2e-05,8.6e-05,0.000224,4e-04,0.000151,0.000162,0.00032,0.000163,0.000226,1.6e-05,0.000365,6.3e-05,0.000192,0.000267,9.2e-05,0.000263,0.000313,0.000296,0.000169,0.000259,0.000201,0.000134,0.000208,4.9e-05,0.000409,0.000206,0.000156,0.000106,0.000107,0.000152,1.9e-05,5.5e-05,0.000128,7.9e-05,4.7e-05,0.000117,4.3e-05,3.4e-05,4.2e-05,4.8e-05,3.1e-05,1.6e-05,4.5e-05,2.6e-05,7.2e-05,1.6e-05,4.1e-05,4.7e-05,4.5e-05,5.7e-05,3.6e-05,3.5e-05,1.8e-05,4.2e-05,5.4e-05,2e-05,0.000121,4.7e-05,0.000158,0.00011,9e-05,0.000583,0.000252,0.000135,5.6e-05,4.3e-05,4.6e-05,3.2e-05,3.3e-05,1.2e-05,1.7e-05,9e-06,9e-06,7e-06,2.8e-05,2.5e-05,3e-06,2.4e-05,1.3e-05,1.1e-05,1.2e-05,5e-06,8.7e-05,8.2e-05,2e-05,1.2e-05,1.9e-05,1.3e-05,7e-06,3e-06,7e-06,4e-06,7.3e-05,6.2e-05,3.7e-05,2.6e-05,1.7e-05,4e-06,2.1e-05,1.8e-05,1e-05,9e-06,1.2e-05
2e-06,2e-06,1.2e-05,1.3e-05,1.4e-05,7e-06,4e-06,1e-05,6.3e-05,8.5e-05,8.7e-05,8.7e-05,6.9e-05,5.9e-05,0.000172,0.000136,7.2e-05,0.000269,7.7e-05,8.8e-05,0.000254,0.000189,0.000448,0.000257,0.000252,0.000332,8e-05,0.000268,0.000205,0.000265,0.000362,0.00027,7.9e-05,0.000181,0.000132,0.000162,0.000126,0.000161,5.5e-05,0.000242,0.000304,0.000136,0.000446,0.000199,0.000147,8.8e-05,9.2e-05,1e-04,0.000134,2.8e-05,7.6e-05,9.4e-05,5e-05,0.000118,5.4e-05,2.8e-05,4.2e-05,6e-05,5.5e-05,1.7e-05,2.7e-05,3e-06,6.7e-05,8.5e-05,9e-05,3.2e-05,1.6e-05,5e-05,4.5e-05,2.9e-05,2.7e-05,2.3e-05,5.4e-05,2e-05,0.000142,6e-05,9.3e-05,1.7e-05,5.6e-05,0.000527,0.000237,9.6e-05,3.1e-05,6.5e-05,3.8e-05,1.4e-05,6e-06,1.2e-05,7e-06,1.5e-05,1.6e-05,7e-06,3.3e-05,8e-06,1.1e-05,3.5e-05,3e-06,1.2e-05,1.1e-05,1.1e-05,7.8e-05,7.8e-05,5.8e-05,1.7e-05,1.1e-05,5e-06,8e-06,1e-05,1.3e-05,1.2e-05,5.8e-05,8e-05,4.6e-05,5e-06,8e-06,7e-06,1.5e-05,7e-06,1e-06,2e-06,0
3e-06,6e-06,1.7e-05,2.2e-05,7e-06,1.4e-05,1.7e-05,2.8e-05,8.5e-05,0.00014,0.000108,0.000129,5.1e-05,4.7e-05,0.000184,0.000121,4.1e-05,0.000291,7e-06,3.6e-05,0.000268,0.000299,0.000183,0.000138,0.000257,0.000213,0.000161,0.000111,0.000207,0.000128,0.000357,7.7e-05,0.000102,0.000198,0.000225,0.000238,9e-05,0.000155,0.00029,0.000249,0.000544,0.000356,0.000169,0.000338,0.000305,0.000193,0.000176,0.000104,8e-06,1.5e-05,3.8e-05,7.8e-05,7.3e-05,8.7e-05,2.2e-05,5.3e-05,5e-05,5.3e-05,6.3e-05,6e-05,2.3e-05,7e-06,4.9e-05,1.1e-05,2.8e-05,3.8e-05,1.1e-05,3.3e-05,5.4e-05,4.9e-05,1.9e-05,1.6e-05,5.9e-05,6.9e-05,0.000106,5.3e-05,8.7e-05,2.7e-05,5.8e-05,0.000412,0.000212,0.000118,2.6e-05,5.5e-05,2.9e-05,4.1e-05,3.4e-05,2.7e-05,1.8e-05,9e-06,2e-06,9e-06,2.8e-05,3e-06,4e-06,3e-05,4e-06,9e-06,6e-06,6e-06,6.6e-05,7e-05,5.1e-05,1.2e-05,2e-05,1.3e-05,1.2e-05,2e-06,1.5e-05,1.3e-05,5.1e-05,8.7e-05,3e-05,2.4e-05,1.2e-05,3e-06,1.6e-05,1.2e-05,7e-06,6e-06,1.1e-05
3e-06,3e-06,1.5e-05,1.6e-05,1.1e-05,1.4e-05,3e-06,1.8e-05,4.5e-05,4.8e-05,0.000173,7.2e-05,0.000194,0.000113,0.000118,0.000146,0.000127,0.000369,0.00019,0.000101,0.000226,0.000307,0.000348,0.00025,0.000228,8.3e-05,0.00017,0.00037,0.000167,0.000279,0.000188,0.000422,0.000155,0.000259,0.000354,0.000132,0.000104,0.000173,0.000129,0.000258,0.000339,0.00015,0.00024,0.00019,5.1e-05,5e-05,8.4e-05,4.3e-05,4.7e-05,6.3e-05,5.4e-05,6.4e-05,4.4e-05,0.000104,8e-05,3.4e-05,2.5e-05,8.6e-05,3.2e-05,1.9e-05,1.1e-05,1.6e-05,2.5e-05,3.8e-05,2.5e-05,1.4e-05,1e-05,2.2e-05,1.9e-05,3e-05,1.6e-05,5e-06,3.5e-05,3.5e-05,9.5e-05,1.5e-05,0.000179,9.6e-05,7.6e-05,0.000333,0.000221,9.9e-05,4.6e-05,1.6e-05,3.4e-05,2.7e-05,1.1e-05,1e-05,6e-06,1.2e-05,1.6e-05,1e-05,4.7e-05,3.2e-05,2.6e-05,2e-05,1.8e-05,9e-06,7e-06,1.1e-05,5.8e-05,9.8e-05,3.4e-05,4e-06,2e-05,1.1e-05,4e-06,4e-06,2e-05,5e-06,4.6e-05,0.000136,6.3e-05,2.3e-05,7e-06,5e-06,1.3e-05,8e-06,7e-06,5e-06,1.1e-05
1e-06,3e-06,1.6e-05,5e-06,1e-05,1.5e-05,1.6e-05,2e-06,4.4e-05,8.7e-05,9.2e-05,0.000194,0.000233,0.000109,8e-05,9.2e-05,7.7e-05,0.000252,0.000196,8.7e-05,0.000246,0.000195,0.000308,0.000173,0.000214,0.000185,0.00022,0.000324,7.5e-05,0.000199,0.00044,0.000423,0.000224,0.000206,9e-06,0.000178,0.000266,0.00038,0.000386,5.5e-05,0.00026,0.000363,0.00042,0.000385,0.000195,0.000205,6.1e-05,0.000114,8.8e-05,5e-06,4.6e-05,1e-04,0.000113,0.000151,0.000105,8e-05,5.2e-05,6.6e-05,1.3e-05,7e-06,1.5e-05,7e-06,9e-06,3e-05,4.1e-05,1.7e-05,7e-06,7e-06,6e-06,3.8e-05,6.9e-05,7.7e-05,5e-05,5.3e-05,8e-05,6.2e-05,0.000201,0.000165,2.9e-05,0.00043,0.000206,8.2e-05,3.4e-05,4.7e-05,2.7e-05,4.6e-05,2.9e-05,1.4e-05,1.1e-05,1.8e-05,1.2e-05,1.2e-05,4.1e-05,3.9e-05,2.7e-05,9e-06,1.5e-05,1.4e-05,3e-06,7e-06,6.8e-05,0.000119,4.4e-05,7e-06,8e-06,6e-06,6e-06,3e-06,1.3e-05,1.1e-05,4e-05,0.000161,8.1e-05,4e-05,1.2e-05,1e-05,6e-06,1e-06,4e-06,2e-06,4e-06
1e-06,2e-06,1.3e-05,1.2e-05,1.2e-05,5e-06,1e-05,1.2e-05,3.9e-05,0.000104,0.000106,4.3e-05,0.000332,0.00016,7.1e-05,0.000117,6.2e-05,1e-04,0.000248,0.000157,0.000253,0.000365,4e-04,0.000258,0.000218,0.000119,0.000153,0.000185,8.7e-05,0.000151,0.000457,0.000402,0.000193,0.000267,0.000305,0.000239,0.000178,0.000191,0.000241,0.000141,0.000433,0.000624,0.000344,0.000186,0.00012,0.000201,0.000219,0.000107,0.000175,9.3e-05,1.4e-05,6.3e-05,6.7e-05,0.000115,4.5e-05,5.8e-05,3.2e-05,5.7e-05,2.5e-05,5.1e-05,9e-06,4.5e-05,2.7e-05,4.3e-05,1.8e-05,1.9e-05,1e-05,1e-05,2.1e-05,1.5e-05,6.1e-05,2.5e-05,4.9e-05,2.3e-05,7.2e-05,8e-05,0.000271,0.000275,0.000169,0.000301,0.000172,6.9e-05,2.6e-05,0.000144,0.000112,8.1e-05,4.3e-05,1.6e-05,7e-06,1.6e-05,1.7e-05,1.8e-05,4.1e-05,3.1e-05,8e-06,1.8e-05,7e-06,1.4e-05,1.2e-05,1.1e-05,4.6e-05,0.000166,0.000108,3.9e-05,1.1e-05,5e-06,7e-06,4e-06,7e-06,7e-06,3.5e-05,0.000155,0.00013,5.9e-05,1.7e-05,2e-06,2e-06,3e-06,4e-06,4e-06,4e-06
2e-06,1e-06,1.4e-05,1.5e-05,5e-06,7e-06,7e-06,8e-06,2.5e-05,3e-05,0.000127,0.000141,0.000197,0.000158,0.000145,0.00017,9.9e-05,0.000252,0.000364,0.000178,0.000191,3e-04,0.00018,0.00025,0.000209,0.000213,0.000256,0.000286,0.000296,0.000148,0.000201,0.00022,0.000181,0.000275,0.000267,0.000238,8.4e-05,0.000157,0.000309,0.000191,0.000407,0.000444,0.000312,0.000244,0.000304,0.000126,3.1e-05,0.000122,0.000232,0.00015,6.3e-05,6.6e-05,3.3e-05,7.6e-05,8.5e-05,6.3e-05,3.9e-05,6.2e-05,1e-04,2.9e-05,5.2e-05,3.8e-05,5.3e-05,8e-06,1.9e-05,3e-05,2.5e-05,2.9e-05,1e-05,2.9e-05,2.7e-05,5.2e-05,3.9e-05,2.3e-05,7.6e-05,8.3e-05,0.000192,0.000213,0.000201,0.000261,0.000216,0.000126,2.3e-05,0.000158,0.000157,8e-05,2.7e-05,2.1e-05,1.8e-05,1.2e-05,1.6e-05,9e-06,3.3e-05,6e-06,3e-06,1.8e-05,1.9e-05,1e-05,2e-06,7e-06,4.8e-05,0.000167,0.00015,8.2e-05,2.8e-05,1.1e-05,9e-06,4e-06,2e-06,3e-06,2.4e-05,0.000145,9e-05,4.2e-05,1e-05,7e-06,7e-06,4e-06,5e-06,4e-06,4e-06
0,1e-06,1.6e-05,2e-05,1.1e-05,3e-06,4e-06,1.1e-05,2.7e-05,8.9e-05,3.5e-05,0.000131,0.000141,5.4e-05,7.5e-05,0.000149,7.3e-05,0.000396,0.000327,0.000167,0.000221,0.000133,4e-04,0.000177,0.000203,0.000146,0.00029,0.000213,0.000244,0.000206,0.000136,0.000219,0.000134,0.000297,3.6e-05,7.8e-05,1e-04,0.000154,0.000189,0.000376,0.00015,0.000348,0.00023,0.000122,0.000166,0.000144,8.7e-05,9.6e-05,0.000188,8.1e-05,5.1e-05,5.6e-05,2.5e-05,3.7e-05,6.2e-05,4.4e-05,2.5e-05,9e-05,1e-06,5.7e-05,3.1e-05,3.7e-05,3.4e-05,3.1e-05,2.2e-05,3.1e-05,3.1e-05,4.5e-05,5.1e-05,1.1e-05,1.6e-05,2.7e-05,1.3e-05,1.4e-05,3.8e-05,2.7e-05,0.00015,0.000107,3.9e-05,0.00023,0.000136,5.4e-05,2.4e-05,9.7e-05,6.3e-05,4.8e-05,3.5e-05,3.7e-05,1.5e-05,7e-06,8e-06,5e-06,4e-05,1.8e-05,9e-06,2.7e-05,9e-06,1e-06,5e-06,5e-06,4.3e-05,0.000121,5.5e-05,1.5e-05,4e-06,7e-06,4e-06,3e-06,2e-06,2e-06,1.6e-05,0.000114,4.8e-05,1.2e-05,4e-06,6e-06,5e-06,6e-06,7e-06,4e-06,6e-06
0,1e-06,1.6e-05,1.7e-05,5e-06,1e-06,3e-06,9e-06,1.8e-05,9e-05,7.6e-05,9.3e-05,3.4e-05,1.8e-05,4.3e-05,6.9e-05,2.5e-05,0.000431,9.6e-05,3e-05,0.000175,6.9e-05,0.00037,0.000262,0.000199,0.000104,0.000227,0.000146,0.000225,0.000162,5.6e-05,0.000152,5.7e-05,0.000305,0.000184,0.000159,9.7e-05,0.000229,0.000153,0.000118,0.000195,0.000143,6.5e-05,8.3e-05,5e-05,1.4e-05,4.4e-05,8.7e-05,4.5e-05,1e-05,1.2e-05,1.1e-05,2.4e-05,3.2e-05,3.6e-05,1.1e-05,3.7e-05,5.9e-05,2.4e-05,3.5e-05,1.9e-05,1.3e-05,1.7e-05,1.3e-05,2e-05,8e-06,1.1e-05,1.3e-05,1.6e-05,9e-06,1.7e-05,2.1e-05,1.8e-05,1e-05,1.9e-05,1.5e-05,0.000102,3.1e-05,6.6e-05,0.000138,3.3e-05,9e-06,3.2e-05,8.9e-05,1.9e-05,1.9e-05,1e-05,1.2e-05,4e-06,7e-06,1.1e-05,5e-06,4e-05,1.6e-05,3e-06,2.7e-05,5e-06,2e-06,5e-06,4e-06,3.4e-05,5.1e-05,1.8e-05,3e-06,5e-06,6e-06,7e-06,2e-06,2e-06,3e-06,9e-06,6.1e-05,8e-06,1.1e-05,5e-06,2e-06,5e-06,1e-06,6e-06,3e-06,3e-06
1e-06,1e-06,1.6e-05,1.4e-05,6e-06,1e-06,2e-06,8e-06,1.1e-05,5.6e-05,4.2e-05,1e-04,1.2e-05,1.3e-05,3e-05,5e-05,2.1e-05,0.000416,5.5e-05,1.6e-05,0.000152,0.000212,0.00035,0.000147,0.000141,0.000108,0.000281,0.000201,0.000128,9.2e-05,5.3e-05,0.000133,0.000134,0.000213,7.4e-05,0.000172,5.3e-05,0.000203,3e-05,0.000182,0.000142,0.00016,7e-05,6.1e-05,1e-05,2.2e-05,2.2e-05,5.6e-05,5.2e-05,7e-06,4e-06,3e-06,8e-06,4.1e-05,1.3e-05,1.3e-05,3.1e-05,4.4e-05,1.6e-05,7e-06,1e-06,1.7e-05,1e-05,1.3e-05,1.9e-05,7e-06,7e-06,1e-05,1.8e-05,1.1e-05,1.5e-05,2.4e-05,5e-06,2e-06,1.1e-05,1.4e-05,9.1e-05,2.2e-05,5.2e-05,8.6e-05,1.4e-05,8e-06,2.6e-05,7.5e-05,2e-05,9e-06,5e-06,1.1e-05,2e-06,7e-06,7e-06,4e-06,4e-05,9e-06,1e-06,3e-05,6e-06,3e-06,4e-06,4e-06,2.9e-05,1.2e-05,9e-06,4e-06,8e-06,3e-06,2e-06,1e-06,2e-06,1e-06,7e-06,4.7e-05,1.5e-05,1.3e-05,3e-06,4e-06,3e-06,2e-06,4e-06,1e-06,1e-06
0,1e-06,1.6e-05,1.3e-05,6e-06,1e-06,3e-06,7e-06,8e-06,4.4e-05,3.9e-05,9e-05,8e-06,8e-06,1.4e-05,4.8e-05,1.4e-05,0.000391,2.5e-05,2.6e-05,0.000133,0.000212,0.000287,0.000225,5.9e-05,3e-05,0.000213,0.00023,0.000119,0.000124,4.4e-05,0.000148,0.000119,0.000126,6.5e-05,0.000119,7.3e-05,0.000152,2.3e-05,0.000174,0.000142,0.000134,5.4e-05,4.9e-05,3e-06,1.3e-05,1.5e-05,3.8e-05,4.9e-05,3e-06,2e-06,2e-06,7e-06,3.8e-05,1e-05,1.4e-05,2.7e-05,3.7e-05,2.2e-05,4e-06,1.3e-05,8e-06,7e-06,1.2e-05,1.6e-05,5e-06,4e-06,6e-06,1.6e-05,1.1e-05,1.2e-05,2e-05,9e-06,2e-06,9e-06,1.4e-05,6.8e-05,1.9e-05,5.2e-05,0.000102,6e-06,1.4e-05,1.6e-05,6.9e-05,1.8e-05,6e-06,2e-06,1.1e-05,2e-06,4e-06,8e-06,2e-06,4.1e-05,8e-06,2e-06,2.8e-05,5e-06,2e-06,4e-06,4e-06,2.5e-05,1.8e-05,2e-06,6e-06,7e-06,1e-06,3e-06,1e-06,2e-06,1e-06,5e-06,4.5e-05,1.2e-05,5e-06,5e-06,2e-06,1e-06,2e-06,5e-06,1e-06,1e-06
