0.000187,1.1e-05,4.8e-05,2.6e-05,4e-06,4.2e-05,9e-06,3.2e-05,0.000105,9.4e-05,0.000101,8.5e-05,6.2e-05,0.000163,0.000117,4e-05,5.4e-05,0.000167,1.5e-05,0.000402,0.000205,0.000115,0.00017,0.000144,0.000562,0.000373,3.8e-05,0.000239,0.000188,0.000262,8.8e-05,0.000337,0.000598,0.000106,1.8e-05,0.000405,0.000389,0.000118,0.000242,0.000467,0.000191,0.000199,0.000268,2.8e-05,8.6e-05,0.000635,0.000165,0.000304,1.5e-05,0.000735,8.8e-05,3.6e-05,5.3e-05,0.000951,0.000309,0.000341,0.000642,8.8e-05,1.1e-05,0.000433,0.00063,0.000152,1.1e-05,4.6e-05,0.000673,0.000158,0.000125,0.000176,0.000606,0.000562,9e-05,0.000356,0.000234,2e-06,8.9e-05,0.000198,8.9e-05,0.000246,9.1e-05,0.000471,0.000207,0.000343,0.000219,0.000212,9.3e-05,0.000374,0.000159,0.000281,0.00014,0.000401,0.000126,0.000148,0.000139,0.000156,0.000278,0.00063,6e-05,0.000228,0.00057,0.00034,0.000111,0.000815,0.000413,0.000604,0.000187,0.000602,0.00042,0.000593,1.1e-05,0.000458,3e-04,0.000394,0.000907,2e-04,8.7e-05,0.000497,0.000254,0.000376,7.2e-05,0.000424,0.000855
0.000553,0.000306,0.000164,9.5e-05,8.4e-05,0.000131,4.1e-05,6.8e-05,0.000298,0.000107,0.000218,0.000126,0.000176,0.000289,0.000187,0.000357,0.000408,0.000294,0.000392,0.001021,0.000149,0.000103,0.000361,0.000203,0.001521,0.000986,0.00016,9.2e-05,0.000722,0.000633,0.000211,0.000266,0.001671,0.000135,1e-04,0.00093,0.000678,0.000258,0.000383,0.001234,0.000505,0.000395,0.000719,0.000448,0.000206,0.001449,0.000796,0.000404,0.000792,0.001669,0.000429,0.000651,0.000725,0.001858,0.001237,0.000516,0.001218,0.000448,0.00083,0.000916,0.001497,0.000993,0.000125,0.000404,0.001165,0.00054,0.000249,0.000631,0.001361,0.00153,0.000578,0.000698,0.000688,0.000668,0.000658,0.000885,0.000405,0.000408,0.000668,0.001509,0.000111,6.9e-05,0.000657,0.000517,0.000743,0.001766,0.001335,0.000865,9.1e-05,0.000647,0.000275,0.000506,0.000333,0.000824,0.000476,0.001265,0.000346,0.001008,0.001067,0.001049,0.000157,0.001694,0.000855,0.001514,0.000723,0.001445,0.001171,0.001421,0.000832,0.000803,0.000925,0.000621,0.001212,0.001744,0.001536,0.00042,0.001074,0.000214,0.000251,0.000943,0.002331
0.000603,0.000415,0.000142,0.000101,0.000127,0.000137,8.2e-05,4.8e-05,0.000393,0.000261,0.000135,0.000158,0.000194,0.000231,0.000524,0.00059,0.000285,0.000521,0.000597,0.000382,0.000481,0.000289,0.000468,0.000615,0.001959,0.00115,0.000431,0.000713,0.000379,0.000791,0.000748,0.000846,0.00119,0.000518,0.000529,0.001247,0.000855,0.000603,0.000513,0.00065,0.000267,0.00013,0.001116,0.000615,0.000774,0.000739,0.001069,0.001656,0.000317,0.000984,0.000903,0.000482,0.000987,0.002538,0.000604,0.000466,0.001209,0.001199,0.000378,0.001752,0.001095,0.000875,0.000671,0.001029,0.002096,0.000393,0.000405,0.000507,0.001308,0.001285,0.00099,0.000756,0.000407,0.000736,0.001111,0.000414,0.000403,0.000581,0.000819,0.001236,0.001428,0.001327,0.000434,0.00081,0.001047,0.001389,0.000956,0.000344,4.4e-05,0.000485,0.00032,0.000548,0.001025,0.000701,0.001285,0.001694,0.000685,0.002104,0.002201,0.001146,0.000622,0.002276,0.000727,0.000455,0.000752,0.000173,0.001551,0.001464,0.001225,0.002334,0.00099,0.001437,0.002528,0.001309,0.001166,0.000713,0.000662,0.001202,0.000753,0.001918,0.00181
0.000631,0.000386,0.000206,0.000153,0.000103,0.000101,7.8e-05,0.000173,0.000897,0.000575,7.5e-05,0.000206,0.000385,0.000192,0.000589,0.000129,0.000508,0.000669,0.000611,0.00032,0.000355,0.000683,0.000944,0.000926,0.001797,0.001175,0.00111,0.000654,0.000562,0.000282,0.000719,0.001268,0.00098,0.000892,0.000361,0.001515,0.000566,0.000445,0.000392,0.001397,0.000148,0.000774,0.000582,0.001006,0.001269,0.00149,0.00156,0.001363,0.000444,0.001936,0.001073,0.000644,0.000453,0.001851,0.002513,0.001415,0.000772,0.00078,0.001491,0.000756,0.001216,0.000588,0.000182,0.000397,0.00192,0.001095,0.001191,0.00067,0.001827,0.001554,0.001007,0.001581,0.000312,0.001339,0.001118,0.000598,0.000731,0.000732,0.000825,0.002066,0.001364,0.001453,0.000604,0.000931,0.001495,0.001392,0.00178,0.000832,0.000735,0.000561,0.001071,0.002165,0.001744,0.000262,0.000742,0.002086,0.001723,0.001423,0.001923,0.001231,0.000347,0.003348,0.001809,0.001053,0.000412,0.001337,0.001841,0.00172,0.000948,0.002083,0.001541,0.001637,0.001549,0.000448,0.000483,0.001035,0.000463,0.00087,6.4e-05,0.001246,0.001748
0.00066,0.00038,0.000125,2.9e-05,0.000111,7.5e-05,0.000158,0.000139,0.00131,0.000397,2.9e-05,0.000458,0.000783,0.000831,0.000781,8.3e-05,0.000647,0.001235,0.00097,0.000939,0.000871,0.00092,0.002151,0.001088,0.003475,0.001767,0.001166,0.000437,0.001428,9e-04,0.001797,0.001713,0.002459,0.000975,0.001155,0.000499,0.000944,0.001293,0.000957,0.002217,0.000978,0.001903,0.001899,0.001582,0.000601,0.001529,0.001236,0.001412,0.001902,0.00404,0.001036,0.001208,0.001042,0.002458,0.00346,0.001703,0.001037,0.0018,0.002034,0.003422,0.001617,0.000198,0.000771,0.001492,0.002094,0.001581,0.000882,0.000704,0.002744,0.003884,0.001319,0.001054,0.001293,0.002905,0.001953,0.001746,0.001583,0.001391,0.001285,0.000682,0.002169,0.001872,0.001428,0.000922,0.005004,0.001224,0.00253,0.001771,0.001539,0.002271,0.001154,0.002206,0.002022,0.001091,0.001199,0.002432,0.001966,0.002727,0.001493,0.000427,0.001022,0.003258,0.002446,0.003476,0.003087,0.002193,0.003196,0.003613,0.003772,0.003434,0.00149,0.002236,0.003453,0.001422,0.000468,0.001218,0.00304,0.003282,0.002582,0.002156,0.00333
0.000952,0.000734,0.000387,9.1e-05,0.000158,0.000273,0.000203,0.000378,0.001067,0.001405,0.000604,0.000978,0.000488,0.001034,0.000888,0.000494,0.00066,0.00039,0.001885,0.002844,0.002856,0.002018,0.002591,0.003608,0.00116,0.003129,0.002394,0.002505,0.000833,0.000766,0.002193,0.002038,0.00397,0.00335,0.003516,0.00215,0.000737,0.00051,0.001823,0.002027,0.000947,0.002573,0.001334,0.000409,0.000546,0.000379,0.002374,0.002217,0.000889,0.0025,0.001847,0.002017,0.003994,0.003781,0.00098,0.001236,0.001058,0.00203,0.001985,0.002686,0.005224,0.001545,0.000895,0.002853,0.004193,0.002001,0.000877,0.002502,0.001305,0.003708,0.003734,0.003324,0.003312,0.00188,0.003179,0.003385,0.001529,0.000728,0.001959,0.004286,0.004729,0.00067,0.002015,0.000374,0.007277,0.005403,0.001486,0.003765,0.003133,0.000229,0.001568,0.004594,0.002926,0.001221,0.002739,0.003411,0.004753,0.004952,0.005729,0.002374,0.002953,0.004118,0.000333,0.002573,0.005795,0.008688,0.0016,0.001089,0.003411,0.002627,0.000653,0.004612,0.00889,0.005826,0.001547,0.001124,0.00336,0.005436,0.005646,0.006208,0.006513
0.001319,0.000412,6.3e-05,2.3e-05,0.000151,0.000176,0.000227,0.000427,0.000914,0.000207,0.000422,0.000992,0.000447,0.000947,0.001401,0.001634,0.000893,0.000667,0.001687,0.001954,0.001322,0.000945,0.00219,0.002934,0.003494,0.001596,0.003185,0.002512,0.001379,0.00121,0.001844,0.000905,0.003883,0.002321,0.00084,0.004087,0.001271,0.003129,0.004092,0.004066,0.003878,0.001564,0.00323,0.003173,0.00207,0.00273,0.002398,0.003871,0.001741,0.003844,0.000645,0.00279,0.003892,0.001877,0.002647,0.002349,0.001595,0.001264,0.00388,0.004436,0.006075,0.004528,0.002292,0.003528,0.002255,0.003697,0.002441,0.003985,0.005008,0.001856,0.006285,0.004072,0.001708,0.003442,0.002069,0.001363,0.001714,0.002343,0.002364,0.004617,0.002793,0.004889,0.00352,0.004112,0.007453,0.006017,0.000935,0.004094,0.002142,0.001549,0.000419,0.004383,0.004985,0.005193,0.000203,0.001799,0.004928,0.004013,0.004632,0.007638,0.004785,0.005136,0.005043,0.006605,0.006093,0.003896,0.008724,0.005209,0.004399,0.003729,0.00459,0.004953,0.006761,0.002721,0.003945,0.002689,0.003698,0.003576,0.004437,0.00235,0.004002
0.001566,0.001042,0.000276,0.000102,6.1e-05,3.1e-05,0.000379,0.000313,0.001819,0.000799,0.000251,0.001073,0.000742,0.000262,0.000555,0.000261,0.000497,0.000705,0.002096,0.004008,0.002019,0.001645,0.004126,0.003333,0.002911,0.004097,0.006024,0.004186,0.003561,0.001569,0.002382,0.002415,0.004533,0.00285,0.001345,0.006468,0.005582,0.008708,0.001966,0.003509,0.006051,0.00674,0.005485,0.0013,0.006788,0.004673,0.004246,0.002312,0.005723,0.006149,0.005521,0.003956,0.008385,0.002706,0.005169,0.003418,0.004356,0.002492,0.001811,0.001179,0.004094,0.004015,0.002146,0.00326,0.006627,0.009085,0.004656,0.005004,0.004703,0.004573,0.006125,0.004232,0.002844,0.00159,0.003181,0.004278,0.005353,0.001489,0.001636,0.005246,0.004779,0.005167,0.007107,0.004294,0.007344,0.003526,0.004931,0.003501,0.001194,0.003136,0.003378,0.004253,0.001593,0.002943,0.005081,0.000708,0.005714,0.007592,0.008876,0.005906,0.005837,0.004781,0.002631,0.010272,0.007043,0.003622,0.008635,0.004412,0.002579,0.006634,0.009209,0.011198,0.013592,0.010846,0.006446,0.001948,0.002503,0.005189,0.009112,0.008206,0.006013
0.001626,0.002198,0.001382,0.000409,2.3e-05,7.5e-05,0.000459,0.00091,0.002591,0.003435,0.001977,0.000507,0.000797,0.000809,0.000497,0.000913,0.00104,0.000446,0.002352,0.006104,0.005346,0.002862,0.002399,0.006348,0.010156,0.010158,0.001851,0.001006,0.003848,0.005542,0.006762,0.003598,0.005596,0.005849,0.003797,0.006834,0.004095,0.0058,0.004607,0.005348,0.0063,0.001687,0.004215,0.003642,0.005794,0.009934,0.003906,0.003435,0.007509,0.008671,0.007995,0.005406,0.007977,0.005994,0.006611,0.005186,0.008065,0.005556,0.002976,0.002275,0.005394,0.006531,0.002631,0.001729,0.003935,0.00829,0.002753,0.005097,0.010827,0.01027,0.001782,0.000499,0.001658,0.004662,0.004128,0.005571,0.003754,0.004473,0.002989,0.001546,0.005576,0.002283,0.005458,0.004098,0.004278,0.004974,0.003467,0.00135,0.001767,0.003437,0.008135,0.005654,0.00571,0.002507,0.003213,0.004879,0.007345,0.007513,0.008486,0.007574,0.002443,0.003779,0.004763,0.011748,0.011082,0.007616,0.001017,0.001579,0.006273,0.003993,0.003621,0.003179,0.003114,0.011171,0.006313,0.002255,0.003333,0.004026,0.006337,0.002569,0.008549
0.001374,0.000963,0.000385,0.000251,0.000138,0.000236,0.000423,0.000408,0.002856,0.001835,0.000984,0.00068,0.000528,0.000345,0.000722,0.001268,0.00072,0.000153,0.002365,0.002782,0.001368,0.000755,0.002522,0.003122,0.004873,0.002086,0.003792,0.004554,0.003204,0.00242,0.003011,0.003099,0.004767,0.004006,0.003483,0.002324,0.001589,0.004831,0.00323,0.002783,0.002731,0.003494,0.004614,0.002706,0.006324,0.002783,0.004724,0.004443,0.001828,0.002862,0.001345,0.00284,0.004428,0.003224,0.001258,0.000287,0.004239,0.003126,0.000812,0.002558,0.005959,0.00594,0.003172,0.001243,0.003319,0.003188,0.004105,0.002822,0.004368,0.003037,0.004687,0.002644,0.003465,0.002899,0.001575,0.003241,0.003904,0.003202,0.001686,0.000989,0.00414,0.000729,0.004835,0.001054,0.001437,0.004799,0.004587,0.003051,0.001209,0.002591,0.006406,0.002453,0.004455,0.003933,0.001102,0.003847,0.002837,0.00418,0.003919,0.00126,0.00252,0.003072,0.008057,0.002966,0.003238,0.002899,0.001069,0.00342,0.004371,0.003043,0.002186,0.000656,0.00248,0.007345,0.003385,0.002131,0.003467,0.001769,0.001698,0.005145,0.007421
0.000945,6e-04,0.000244,0.000249,0.000124,0.000251,0.000152,0.000427,0.001485,0.001511,8e-04,0.000849,0.000599,0.000566,0.000454,0.000678,0.000559,0.000907,0.001055,0.00104,0.000472,0.001321,0.000859,0.002701,0.004078,0.001945,0.002047,0.001298,0.001054,9e-04,0.001605,0.002554,0.001307,0.002746,0.001695,0.000904,0.001449,0.002429,0.001342,0.002445,0.000902,0.001643,0.002444,0.001201,0.002837,0.002447,0.003258,0.002376,0.002995,0.001164,0.000831,0.002628,0.001537,0.000497,0.000832,0.001551,0.001475,0.001362,0.001601,0.002665,0.001089,0.003493,0.00323,0.002829,0.001715,0.000962,0.001511,0.00151,0.000453,0.003032,0.003959,0.003103,0.004722,0.003809,0.003666,0.004084,0.006101,0.003916,0.002038,0.000417,0.003138,0.0035,0.005279,0.005508,0.003262,0.002428,0.003456,0.000797,0.002745,0.001765,0.004945,0.004013,0.003581,0.002935,0.002178,0.002487,0.001839,0.004396,0.000397,0.002795,0.00291,0.002768,0.005541,0.006871,0.006371,0.00724,0.002335,0.003583,0.000636,0.001054,0.002613,0.004644,0.005831,0.000337,0.000556,0.002259,0.001239,0.001383,0.002765,0.004281,0.004446
0.000516,0.000376,8.5e-05,6.2e-05,3.9e-05,0.000149,0.000101,0.000128,0.00043,0.000604,0.000155,0.000224,7.9e-05,0.000403,0.000151,0.000499,0.000322,0.000474,0.001277,0.001039,0.000452,0.001059,0.000746,0.001272,0.001927,0.000634,0.000505,0.001219,0.001398,0.00092,0.000309,0.001493,0.002661,0.000927,0.001906,0.001858,0.000351,0.001234,0.001695,0.001681,0.001114,0.001529,0.001104,0.001768,0.0036,0.002077,0.001359,0.000109,0.001319,0.000996,0.000745,0.000892,0.000965,0.000403,0.00066,0.001402,0.001348,0.001532,0.000453,0.000962,0.002158,0.001525,0.001317,0.001859,0.001605,0.000674,0.000907,0.00112,0.001015,0.000853,0.001309,0.000762,0.002357,0.001309,0.001099,0.000467,0.0028,0.003571,0.00309,0.002746,0.002361,0.00241,0.001453,0.001305,0.000326,0.002558,0.001681,0.001787,0.001925,0.001374,0.002001,0.000963,0.003114,0.000697,0.000867,0.002423,0.001755,0.00284,0.002594,0.002574,0.00078,0.002125,0.00383,0.00204,0.002045,0.001396,0.001403,0.00206,0.001662,0.002169,0.003431,0.001376,0.00169,0.000633,0.001057,0.002854,0.00189,0.00206,0.001556,0.000927,0.001843
0.000188,0.000211,4e-05,3.4e-05,2.9e-05,0.000122,5.9e-05,6.4e-05,0.00019,0.00038,6.9e-05,0.000143,7.4e-05,0.000267,0.000178,0.000363,0.000194,0.000498,0.00073,0.000418,0.000287,0.000404,0.00052,0.000377,0.001105,0.000334,0.000157,0.001048,0.000349,0.000629,0.000633,0.000967,0.001393,0.000942,0.001294,0.000834,0.000692,0.000472,0.000632,0.001798,0.000338,0.001271,0.000114,0.000567,0.002422,0.001349,0.002331,0.000704,0.001095,0.000527,0.000259,7.4e-05,0.000743,0.001057,0.000549,0.000381,0.001931,0.000904,0.00066,0.000674,0.001529,0.001458,3e-04,0.001383,0.000473,0.00074,0.001719,0.000339,0.00069,0.000378,0.000753,0.001238,0.00063,0.000436,0.000868,0.000929,0.001506,0.000695,0.00059,0.000491,0.000551,0.00055,0.001081,0.001537,0.001034,0.001095,0.002075,0.000498,0.000631,0.001062,0.000887,0.001226,0.000448,0.000754,0.001216,0.000931,0.001317,0.001769,0.001113,0.000762,0.001194,0.001925,0.001783,0.001352,0.000945,0.001119,0.001106,0.000895,0.001484,0.001493,0.001856,0.002411,0.000998,0.00127,0.001744,0.00108,0.00131,0.001005,0.001171,0.002435,0.000537
0.000157,0.000145,1.5e-05,6.2e-05,1.2e-05,8.5e-05,8.2e-05,3e-05,0.000302,0.000206,7.1e-05,0.000148,4.1e-05,0.000228,0.000116,0.00034,6.8e-05,0.000308,0.000855,0.00034,0.000388,0.00045,0.000822,0.000954,0.001652,0.000464,0.000244,0.00098,0.000826,0.000568,0.000292,0.001223,0.0011,0.000459,0.000656,0.000769,0.001067,0.000813,0.000714,0.000941,0.001803,0.001176,0.001161,0.001148,0.002155,0.00191,0.001786,0.001528,0.001717,0.000481,0.000413,0.000796,0.000958,0.001181,0.001195,0.000392,0.001113,0.000279,0.002296,0.001819,0.000529,0.002317,0.001074,0.000801,0.001012,0.001353,0.001904,0.00031,0.000829,0.001793,0.002279,0.001817,0.000372,0.000607,0.002191,0.00184,0.001628,0.001597,2e-04,0.000674,0.001407,0.001526,0.001806,0.001778,0.000453,0.001776,0.00335,0.000702,0.000986,0.001016,0.000527,0.001133,0.001562,0.001628,0.001168,0.002096,0.002299,0.002076,0.002527,0.001564,0.0015,0.000678,0.00117,0.001608,0.000642,0.001891,0.000813,0.002252,0.000146,0.001975,0.001346,0.003288,0.001482,0.001107,0.001283,0.001988,0.001792,0.002051,0.002047,0.002661,0.001975
0.000223,0.000209,1e-06,6e-05,3.7e-05,3.1e-05,6.6e-05,4.7e-05,0.000196,0.000244,8.8e-05,0.000138,0.000101,0.000431,0.000389,0.000749,0.000207,0.00035,0.000456,0.000503,0.000429,0.000128,0.001125,0.000776,0.002222,0.000244,0.000392,0.000787,0.000118,0.000764,0.000272,0.000394,0.000559,0.00187,0.001159,0.000982,0.002185,0.00073,0.001133,0.001042,0.001337,0.001333,0.001168,0.001414,0.001124,0.002179,0.00147,0.001196,0.001755,0.000835,0.001467,0.001931,0.000639,0.001697,0.001502,0.001573,0.001363,0.000833,0.003006,0.00525,0.005853,0.000599,0.000908,0.001923,0.000453,0.000939,0.001712,0.00144,0.001165,0.000828,0.003377,0.00153,0.00163,0.002456,0.002322,0.00459,0.002451,0.000314,0.00252,0.000831,0.001807,0.000378,0.001328,0.000752,0.001081,0.004215,0.002327,0.001888,0.00288,0.000825,0.001049,0.002159,0.001541,0.001809,0.003127,0.000596,0.000539,0.000721,0.001517,0.002778,0.000568,0.003404,0.002294,0.002549,0.002013,0.000976,0.00219,0.0045,0.003194,0.002858,0.002071,0.004339,0.002163,0.001567,0.001556,0.001417,0.003395,0.001207,0.002935,0.00017,0.001849
0.000311,0.000123,4.5e-05,4.8e-05,1.2e-05,9.6e-05,5e-05,6.8e-05,0.000137,0.000276,8.5e-05,4.8e-05,9.3e-05,0.000348,0.000318,0.00054,4e-04,0.00021,0.00082,0.001321,0.000704,0.000207,0.001398,0.002834,0.002258,0.001228,0.000803,0.000566,0.00073,0.001264,0.00112,0.00033,0.000457,0.001069,0.002128,0.001385,0.00061,0.001416,0.001391,0.001434,0.000665,0.001104,0.001406,0.000853,0.002021,0.003429,0.000925,0.001786,0.000926,0.001391,0.003086,0.004379,0.005229,0.003951,0.001765,0.001525,0.001481,0.001079,0.003738,0.002806,0.001809,0.004154,0.003961,0.004089,0.001584,0.000582,0.003615,0.003525,0.002857,0.002213,0.002524,0.000775,0.002423,0.002441,0.002422,0.002681,0.00203,0.000547,0.003369,0.001986,0.002039,0.001941,0.00059,0.000735,0.000834,0.003189,0.004877,0.003595,0.001301,0.001818,0.001961,0.001707,0.001544,0.000962,0.002172,0.003204,0.003601,0.002249,0.003948,0.005988,0.003343,0.004599,0.003705,0.002075,0.002016,0.003172,0.004129,0.001778,0.003225,0.001928,0.000581,0.00127,0.001132,0.001659,0.005047,0.003797,0.000889,0.004613,0.001562,0.00208,0.001656
4e-04,0.000123,1.7e-05,5e-05,0.000102,0.000217,0.000144,4.8e-05,0.000204,0.000158,0.000259,0.000297,0.000167,0.000394,0.000169,0.000622,0.000445,9.3e-05,0.000671,0.000998,0.000243,0.000185,0.001655,0.002389,0.003845,0.003314,0.001128,0.000524,0.000817,0.001985,0.002487,0.002465,0.002234,0.001238,0.00233,0.001657,0.001825,0.000614,0.00138,0.000858,0.001425,0.001179,0.000914,0.00172,0.002718,0.000965,0.001703,0.002027,0.001699,0.001729,0.003493,0.001776,0.003075,0.001749,0.003123,0.001359,0.001178,0.001712,0.002573,0.00212,0.001096,0.002874,0.002226,0.000394,0.001629,0.001106,0.00373,0.001128,0.003059,0.002812,0.004187,0.002579,0.002459,0.001058,0.002477,0.000936,0.000512,0.000252,0.003012,0.001713,0.002356,0.000886,0.001002,0.000522,0.000877,0.003104,0.002816,0.001303,0.002184,0.002602,0.001442,0.003465,0.004507,0.003249,0.001929,0.002121,0.001739,0.000556,0.00347,0.005546,0.004762,0.005521,0.002116,0.002416,0.001967,0.002469,0.001188,0.003398,0.002436,0.002146,0.001158,0.002194,0.001326,0.000855,0.006289,0.001895,0.000718,0.004888,0.004729,0.004117,0.00154
0.000505,0.000508,0.000109,8.2e-05,0.000111,0.000137,6.8e-05,0.000165,0.000692,0.000401,0.000285,0.000289,3e-04,0.000373,0.000523,0.000284,0.000572,0.000442,0.000338,0.001547,0.000703,0.000516,0.00145,0.001252,0.001722,0.000339,0.001075,0.001358,0.000375,0.001044,0.000857,0.001778,0.001312,0.00086,0.003124,0.002197,0.000517,0.001648,0.001133,0.000893,0.000669,0.00091,0.002007,0.002451,0.000393,0.002025,0.001792,0.000188,0.000893,0.001245,0.003208,0.000631,0.002869,0.002829,0.002751,0.003909,0.000987,0.002211,0.001195,0.001189,0.002408,0.000777,0.000688,0.000957,0.002758,0.002923,0.000844,0.002408,0.001464,0.001431,0.003108,0.002075,0.000855,0.002405,0.001515,0.00268,0.002754,0.001629,0.000428,0.002106,0.002782,0.005074,0.004062,0.002229,0.000856,0.00257,0.00203,0.002153,0.001746,0.000225,0.001877,0.001675,0.001658,0.001621,0.000962,0.000463,0.002493,0.001851,0.002956,0.001252,0.001869,0.000981,0.001553,0.001878,0.003462,0.002324,0.002279,0.001202,0.001298,0.005377,0.004263,0.003437,0.003096,0.002316,0.004427,0.004499,0.001039,0.003451,0.001685,0.003317,0.002009
0.000552,0.000913,0.000616,0.000218,6.4e-05,0.000158,9e-05,0.000199,0.000901,0.000612,0.000336,0.00027,0.000189,0.00048,0.000497,0.000686,0.000211,6.2e-05,0.000266,0.001711,0.001228,0.000404,0.001396,0.001837,0.00154,0.000849,0.00106,0.000911,0.001248,0.001505,0.000744,0.002229,0.001557,0.001121,0.002115,4e-04,0.001373,0.001845,0.00177,0.0012,0.000762,0.002091,0.002167,0.002258,0.001416,0.002301,0.000932,0.001979,0.000745,0.001382,0.00044,0.003577,0.001812,0.000967,0.002377,0.002622,0.004636,0.001295,0.001487,0.000722,0.002436,0.003056,0.002408,0.000824,0.002894,0.000635,0.001896,0.002262,0.001668,0.002366,0.000931,0.00162,0.000545,0.001138,0.0014,0.0027,0.001331,0.000818,0.001981,0.003418,0.001631,0.005393,0.003118,0.000984,0.001158,0.002903,0.003361,0.0014,0.002263,0.001777,0.002993,0.001699,0.00137,0.000792,0.001005,0.000313,0.001805,0.001631,0.000965,0.000573,0.001967,0.001002,0.000675,0.001457,0.003303,0.00309,0.002094,0.003473,0.001112,0.005092,0.001144,0.002542,0.000449,0.001368,0.00315,0.004428,0.003612,0.001773,0.00346,0.002422,0.001031
0.000468,0.000361,0.000135,8.1e-05,8.3e-05,0.000196,0.000149,0.000108,0.000899,0.000518,6.1e-05,0.000282,0.000109,0.00016,0.000418,0.000186,0.000345,0.000116,0.000431,0.001328,0.000984,0.00125,0.001584,0.001822,0.002798,0.00214,0.001606,0.001933,0.001626,0.000233,0.000664,0.002545,0.000622,0.001322,0.002048,0.001525,0.000853,0.000258,0.001983,0.000862,0.000442,0.001546,0.000963,0.002801,0.001512,0.000899,0.002132,0.003885,0.002414,0.001335,0.00188,0.003495,0.003751,0.002554,0.001898,0.000581,0.003362,0.002235,0.001718,0.001058,0.002238,0.000268,0.001529,0.00209,0.001448,0.002008,0.003826,0.001703,0.000724,0.002051,0.001714,0.003801,0.003366,0.001559,0.00096,0.001663,0.002622,0.001023,0.002657,0.001583,9.1e-05,0.004575,0.00321,0.00145,0.001811,0.002948,0.002474,0.001845,0.001082,0.000335,0.002148,0.000213,0.000684,0.000323,0.001664,0.00102,0.001476,0.002753,0.001006,0.002047,0.002631,0.00338,0.001667,0.001958,0.003674,0.001082,0.000686,0.003656,0.001713,0.003628,0.004474,0.004021,0.003779,0.003096,0.003922,0.002862,0.002947,0.002759,0.003142,0.001877,0.002925
0.000392,0.00016,6.4e-05,2.2e-05,5.8e-05,0.000126,9.7e-05,0.00015,0.00069,0.000204,0.000184,0.000366,0.00028,0.000155,0.000453,0.000312,0.000333,0.000334,0.000418,0.00052,0.000512,0.000436,0.00056,0.000723,0.001156,0.001157,0.000678,0.000569,0.000309,0.000704,0.001397,0.001763,0.002123,0.00082,0.000711,0.00031,0.001264,0.001147,0.002243,0.001365,0.000821,0.001526,0.001455,0.002011,0.000788,0.001013,0.002121,0.001051,0.000832,0.000933,0.002021,0.001619,0.001691,0.001196,0.001441,0.002963,0.001971,0.00132,0.001351,0.001244,0.002113,0.00237,0.000511,0.000358,0.001056,0.000584,0.002581,0.002881,0.00074,0.001388,0.002251,0.003338,0.003267,0.002028,0.000584,0.001229,0.000698,0.00109,0.002027,0.001499,0.001392,0.001842,0.001608,0.00162,0.002258,0.000256,0.00239,0.001386,0.001423,0.000865,0.001891,0.001891,0.000819,0.000499,0.002078,0.001926,0.00181,0.003289,0.004353,0.002953,0.001276,0.003656,0.002663,0.000444,0.000911,0.001372,0.000855,0.003222,0.004961,0.0024,0.003383,0.001351,0.001493,0.001555,0.000667,0.001348,0.002125,0.000461,0.001425,0.003804,0.00313
0.000253,5.7e-05,2.1e-05,2.4e-05,2.7e-05,0.000118,8e-05,9.7e-05,0.000195,7.3e-05,0.000117,0.000133,0.000102,0.000112,0.000305,0.000154,8.5e-05,0.000145,0.000577,0.000216,0.00027,0.00012,0.00046,0.000103,0.000384,0.000259,0.000406,0.00041,7.5e-05,0.00045,0.000707,0.000452,0.001065,0.000602,0.000606,0.000208,0.000614,0.000633,0.00115,0.000661,0.000782,0.000495,0.000635,0.000854,0.000666,0.001469,0.001355,0.001017,0.000378,0.001434,0.001533,0.00204,0.002069,0.000474,0.001601,0.001911,0.001021,0.001202,0.000897,0.000433,0.001445,0.000742,0.000807,0.00074,0.001113,0.000658,0.000632,0.00183,0.001567,0.000899,0.002437,0.000581,0.00179,0.000985,0.001433,0.001393,0.000779,0.001107,0.000342,0.000569,0.001357,0.001338,0.001663,0.002511,0.000944,0.000513,0.001655,0.001289,0.000895,0.001025,0.000865,0.000191,0.000473,0.000617,0.001202,0.000409,0.00055,0.001478,0.001208,0.000639,0.001276,0.001956,0.000611,0.000645,0.000885,0.001527,0.000617,0.001243,0.00194,0.001971,0.000706,0.000395,0.000769,0.001266,0.002043,0.000228,0.000679,0.000295,0.000705,0.001644,0.001594
5.6e-05,2.4e-05,4e-06,7e-06,1.2e-05,3.6e-05,8e-06,1.5e-05,8.4e-05,6.6e-05,4.7e-05,3e-05,3.8e-05,2.2e-05,7e-05,5.3e-05,3.7e-05,9.6e-05,0.000258,7.4e-05,0.000157,8.8e-05,0.000157,9.8e-05,0.000224,0.000181,7.4e-05,0.00011,0.000108,0.000194,5.6e-05,0.000119,0.00029,0.000122,0.000275,0.000153,0.000236,0.000301,0.000441,0.000228,0.000164,0.000344,0.000161,0.000271,0.00014,0.000428,0.000239,0.000462,6.1e-05,0.000749,0.000338,0.000435,0.000525,0.000271,0.00072,6.1e-05,0.000195,0.00034,3e-04,0.000255,0.000446,0.000507,0.000431,0.000348,0.000325,0.00031,0.000629,0.000348,0.000443,0.000115,0.000723,0.000768,0.000434,0.000771,0.001147,7.6e-05,0.000163,0.000121,0.000331,0.000352,0.000417,0.000391,0.000772,0.000616,5e-04,0.000185,0.000503,0.000309,0.000384,0.000285,0.000281,8.5e-05,0.000354,0.000216,0.000284,0.000423,0.000246,0.000306,0.000391,0.00026,0.000437,0.000419,0.000481,0.000124,0.000723,7.9e-05,0.000428,0.000449,0.000965,0.000425,0.000571,0.000182,0.000211,0.000267,0.000612,0.000351,0.000727,0.000125,0.000345,0.000243,0.000352
3e-05,1.1e-05,1e-06,8e-06,7e-06,3.2e-05,1.3e-05,1e-05,0.00012,3.5e-05,2.4e-05,1.5e-05,3.7e-05,4.3e-05,0.000121,1e-05,2.9e-05,7.6e-05,0.000237,0.000152,0.000206,0.000137,8.8e-05,0.00031,0.000342,0.000113,0.000273,0.000159,0.000324,0.000309,8.7e-05,0.000288,0.000446,0.000473,0.000493,0.000289,0.000538,0.000504,0.00043,0.000184,0.000206,0.000241,0.000189,0.000114,0.000332,0.000173,0.000158,0.000304,0.000263,0.000618,0.000216,0.000397,0.000388,0.000105,0.000488,0.000232,0.000176,0.000408,0.000388,0.000235,0.000817,0.000476,0.00069,0.000618,0.000574,0.000522,0.000599,0.000124,0.000226,0.000293,0.000597,0.000308,0.000473,0.000615,0.000767,5.7e-05,0.000232,0.000207,0.000204,0.000309,0.000164,0.000561,0.000687,0.00076,0.000225,0.000442,1e-04,0.000156,0.000143,0.000398,0.000362,0.00034,0.000313,0.000453,0.000387,0.000341,0.000426,0.000495,0.000733,0.000456,0.000267,0.000118,0.000685,0.000567,0.000522,0.000203,0.000359,4.1e-05,0.000828,0.000322,0.000431,0.000384,0.000285,0.000193,0.000389,0.000392,0.00049,0.000382,0.000535,0.000633,0.000315
4.6e-05,1e-05,7e-06,4e-06,9e-06,2.8e-05,2.4e-05,5e-06,7.4e-05,1.2e-05,1.7e-05,5e-06,5.6e-05,7.4e-05,8.9e-05,7e-05,5.4e-05,1.9e-05,0.000189,0.000101,6.6e-05,9.1e-05,9.9e-05,0.000268,0.000161,0.00017,0.000228,0.000384,0.000141,0.000286,0.000415,0.000355,8.3e-05,0.00022,0.000266,0.000285,0.000619,5.9e-05,8e-05,0.000238,0.00047,0.000738,0.000287,0.000309,0.00019,0.000128,0.000295,0.000231,0.000215,0.000455,0.000424,0.000364,0.000539,7.4e-05,0.00051,0.000428,0.000201,0.000357,0.000325,0.000525,0.000453,0.000295,0.000465,0.000137,0.000482,0.000301,0.000257,0.000289,0.000101,9.4e-05,0.000667,0.000383,0.000793,0.000247,0.00059,0.000188,0.000394,0.000348,0.000434,0.000526,0.000519,0.000504,0.000348,0.000306,0.000746,0.00044,0.000415,0.000236,0.000371,0.000804,0.000284,0.000275,0.000153,0.000217,0.00038,0.000231,0.000262,0.000208,0.000364,0.000307,0.000206,0.000334,0.000388,0.000562,0.000652,0.000406,0.000203,0.000416,0.000621,0.000345,0.000144,0.000196,0.000195,0.000289,0.00027,0.000325,0.000399,6.6e-05,0.000424,0.000352,0.000418
4.2e-05,1.6e-05,1.4e-05,8e-06,3e-06,1.5e-05,2.1e-05,2.1e-05,6.6e-05,5.5e-05,2.2e-05,1.2e-05,4.9e-05,2.6e-05,6.6e-05,9e-06,2.2e-05,1.9e-05,4.2e-05,0.000228,0.000104,5.2e-05,6.1e-05,0.000118,0.000142,0.000221,0.000328,0.000149,0.000404,0.000126,0.000302,0.000183,0.000179,0.000181,0.000404,0.000198,0.000373,0.000678,0.000404,0.000355,0.000366,0.000283,0.000755,6e-05,0.00012,0.000117,0.000346,0.000172,0.000472,0.000247,0.000258,0.000578,0.000246,0.000346,0.000184,0.000654,7.4e-05,0.000316,0.000763,0.000455,0.000284,0.000124,0.000317,0.000327,0.000275,0.000586,0.000503,0.00026,0.000406,0.00029,0.000287,5.8e-05,0.000561,0.000119,0.00079,0.000398,0.000552,0.000282,0.000474,0.000116,0.000377,0.000146,0.000315,0.000378,0.000504,9.5e-05,0.000249,0.00038,0.000337,0.000627,0.000538,0.000215,0.000211,0.000109,0.000451,0.000383,0.00038,0.000507,0.000394,0.000279,2.8e-05,0.000233,0.000482,0.000397,0.000192,0.00066,0.00013,0.000422,0.00031,0.000552,0.000323,0.000414,0.000357,0.000419,0.000369,0.000145,0.000172,0.000286,0.000137,0.000362,0.000622
2.1e-05,1.5e-05,9e-06,3e-06,4e-06,1.2e-05,1.2e-05,8e-06,9.8e-05,3e-05,5e-06,1.9e-05,4e-05,5e-05,6.1e-05,5.1e-05,1.7e-05,3.3e-05,2.4e-05,0.000166,0.000105,0.000121,8e-05,0.000153,0.000164,0.000176,0.000234,0.000345,4e-04,0.000249,0.000185,0.000242,0.000106,0.000192,0.00058,0.000198,0.000175,0.000161,0.000345,0.000368,0.00044,0.000336,0.000349,0.000267,0.000159,0.000383,0.000237,0.000221,0.000412,0.000359,0.000273,0.000358,0.000534,0.000762,6e-04,0.000335,0.000461,0.000196,0.000665,0.000215,0.000517,0.000221,0.000255,7e-05,0.000213,0.000338,0.00048,0.000275,0.000578,0.000248,0.000304,0.000462,0.000153,0.000139,0.000488,0.000398,0.000763,0.00043,3.3e-05,0.000298,8.7e-05,7.3e-05,0.000257,0.000154,0.00028,0.000325,0.000518,0.000814,0.00082,0.000192,0.000219,6.3e-05,0.000166,0.000272,0.000427,0.000289,0.000372,0.000628,0.000137,0.00018,0.000194,0.000329,0.000673,0.000168,6.1e-05,0.000249,0.000185,0.000301,0.000528,0.000327,0.000235,0.000339,0.00023,0.000397,0.000328,0.000265,0.000446,0.00049,0.000138,0.000517,0.000222
1.2e-05,2e-06,4e-06,2e-06,7e-06,1.4e-05,1e-05,1.6e-05,7.5e-05,2.1e-05,1.8e-05,1e-05,3.8e-05,6e-05,1.9e-05,2.8e-05,2.4e-05,5.6e-05,1.3e-05,5e-05,6.8e-05,0.000125,0.000192,9e-05,0.000138,0.000345,0.000143,0.000148,0.000258,0.000205,0.000117,0.000205,0.000249,0.000355,0.000293,0.000293,0.000192,0.000264,0.00045,0.00034,0.000117,0.000361,0.000433,0.000404,0.000159,0.00049,0.000421,0.000251,0.000498,0.00011,0.000119,0.000224,4e-05,0.000255,5.6e-05,0.000218,0.000209,0.000468,0.000617,0.000245,0.000431,0.000462,0.000216,0.00018,0.000124,0.000385,0.000611,0.000257,0.000516,0.000241,0.00032,0.000304,0.000422,0.000352,0.000297,3.5e-05,0.000441,0.00024,0.000157,0.000526,0.000378,0.000307,0.000477,0.000222,0.000149,0.000497,6.1e-05,0.000406,7.8e-05,0.000115,0.000234,0.000281,0.000227,0.00018,0.000252,0.000425,0.000392,0.000365,0.000378,6.7e-05,1.5e-05,0.000185,0.000343,9.6e-05,2e-04,0.00049,0.000377,0.00016,0.000377,0.000193,0.000147,0.00042,8.8e-05,0.000488,0.000489,0.000411,0.00033,0.000765,0.00036,0.000387,0.000398
3e-05,7e-06,1.1e-05,4e-06,7e-06,5e-06,8e-06,1.1e-05,5.8e-05,3.8e-05,2e-05,1.3e-05,3.2e-05,5.2e-05,3.8e-05,5.2e-05,1.8e-05,5.1e-05,0.000111,6.8e-05,0.000184,0.000265,0.000135,0.000316,0.000119,0.000248,9.8e-05,4.4e-05,0.000206,0.00029,0.000269,2.3e-05,0.00033,0.000371,0.000437,0.000403,0.000614,0.000254,0.000426,0.000356,2e-04,0.000119,0.000367,0.000357,0.000362,0.000625,0.000607,5e-05,0.000281,0.000139,0.000135,0.000535,0.000469,0.000163,4.6e-05,0.000274,0.000206,0.000273,0.000215,0.000668,0.000305,0.000242,1.4e-05,0.000245,0.000382,0.000456,0.000526,0.000239,0.000349,0.000264,0.000523,0.000584,0.000786,0.00019,0.000664,7.8e-05,0.000257,0.000529,0.000261,0.000401,0.000559,3.5e-05,0.00044,0.000644,0.000254,0.000101,0.000133,0.000353,0.000502,0.000613,0.000282,0.000488,0.000248,0.000314,0.000231,0.000445,0.000301,0.000393,0.000483,0.000267,0.000215,0.000215,0.000187,0.000173,0.00026,0.000437,0.000556,0.000247,0.000177,0.000214,0.000126,0.000584,0.000329,0.000439,0.000256,0.000405,0.000577,0.000669,0.000383,0.000309,0.000245
2.8e-05,1.6e-05,1e-06,1.4e-05,6e-06,4e-06,3e-06,1.3e-05,6.5e-05,1.8e-05,1.4e-05,7e-06,1.2e-05,4e-05,3.8e-05,6.2e-05,2.5e-05,7.2e-05,0.000186,0.000202,0.000197,0.00012,0.000332,0.000307,0.000313,0.000308,0.000478,0.000496,6.4e-05,7.2e-05,0.000398,0.00025,0.00055,0.000649,0.00042,7.9e-05,0.00034,0.000746,0.000855,0.000407,0.000202,0.000704,0.000923,0.00055,0.000315,0.000652,0.000746,0.000875,0.000359,0.000417,0.000196,0.000412,0.000338,0.000368,2.3e-05,0.00037,0.000405,0.000604,0.001253,0.001328,0.000862,0.00047,6e-05,0.000266,0.000489,0.000904,0.000581,0.000114,0.000277,0.000406,9.7e-05,8.2e-05,0.000537,0.000786,0.000536,0.000253,0.001049,0.001124,0.001008,0.000738,0.000881,0.000559,0.000289,0.001179,0.001057,0.000109,0.000399,0.000804,0.000755,0.000639,0.000651,0.000913,0.000899,0.001161,0.00097,0.000941,0.000879,0.000697,0.000636,0.000965,0.00061,0.000681,0.000543,0.000372,0.000419,0.000969,0.000574,0.000586,0.000547,0.000796,0.000522,0.000587,0.000238,0.000389,0.000754,0.000219,0.000109,0.000774,0.000299,0.000289,0.000167
8e-06,1.7e-05,7e-06,1.3e-05,1.2e-05,1.1e-05,4e-06,1.9e-05,7.4e-05,4.1e-05,1.1e-05,4e-06,4.1e-05,5.4e-05,3.7e-05,6.9e-05,5.6e-05,4.1e-05,0.000138,0.000187,0.000397,0.000321,0.000306,0.000518,0.000612,0.000223,0.000465,0.000568,0.000718,0.000485,0.000191,0.000216,0.000702,0.001253,0.001605,0.001357,0.000367,0.000655,0.001088,0.000656,0.000595,0.000854,0.001087,0.001064,0.00037,0.000957,0.000523,0.000527,0.000137,0.000801,0.000502,0.000413,0.000933,0.000256,0.000686,0.000683,0.000669,0.000299,0.00097,0.000191,0.000632,0.000182,0.000212,0.000367,0.000223,0.000467,0.001071,0.000775,8.4e-05,0.000762,0.001195,0.001045,0.000646,0.001126,0.001213,0.000913,0.001523,0.001078,0.000435,0.000423,0.000464,0.000273,0.000683,0.001093,0.000881,0.001093,0.000893,0.000812,0.001162,0.001316,0.00116,0.00017,0.00029,0.000926,0.001216,0.001124,0.001161,0.000984,0.000248,0.000757,0.000911,0.000395,0.000709,0.000618,0.000159,0.001053,0.001366,0.000708,0.000358,0.000383,0.000966,0.000257,4e-04,0.000382,0.000236,0.00048,0.00082,0.00111,0.001171,0.000711,0.000444
2.8e-05,2.6e-05,1.2e-05,6e-06,4e-06,1.3e-05,1.3e-05,1.5e-05,6.1e-05,4.5e-05,5e-06,2.2e-05,5.4e-05,2.2e-05,1.7e-05,7.1e-05,4e-05,2.8e-05,0.000125,0.000252,0.000524,0.000337,0.000199,0.000459,0.000601,0.000309,0.000499,0.000126,0.000421,0.000903,0.000578,0.000205,0.000786,0.000256,0.000793,0.000824,0.001413,0.000867,0.000613,0.000249,0.000942,0.001672,0.000338,0.00078,0.000753,0.001267,0.000903,0.000708,0.000849,0.001044,0.000247,0.000634,0.000616,0.001295,0.001419,0.002079,0.000736,0.000576,0.000328,0.000693,0.000539,0.000501,0.000675,0.000685,0.000562,1.4e-05,0.000803,0.000238,0.000585,0.001081,0.000622,0.000723,0.001122,0.000771,0.000319,0.000336,0.000759,0.000876,0.000412,0.000949,0.001151,0.00055,0.000403,0.000296,0.000499,0.000639,0.000403,0.000831,0.001444,0.001286,0.000516,0.000446,0.000586,0.000323,0.000589,0.001067,0.000551,0.000864,0.000739,0.000128,0.000243,0.000218,0.000918,0.000969,0.000542,0.00082,0.000833,0.000694,0.00027,0.000428,6e-04,0.000366,0.000604,0.000321,0.000741,0.001242,0.000723,0.000257,0.00066,3.9e-05,0.000368
5.9e-05,3e-05,1.7e-05,1.2e-05,9e-06,1.1e-05,5e-06,4e-06,7.9e-05,2.3e-05,4e-06,2.9e-05,2.5e-05,4.3e-05,7.1e-05,0.000127,7.1e-05,5.7e-05,8.2e-05,0.000144,0.000298,0.000134,0.00026,0.000476,0.000145,7.3e-05,0.000632,0.000638,0.000276,0.000665,0.000751,0.000518,0.000567,0.000656,0.000529,0.000366,0.001186,0.000898,0.000368,0.000281,0.001095,0.001075,0.000848,0.00033,0.000492,0.000449,0.00117,0.000585,0.000339,0.000634,0.000914,0.001006,0.000379,0.001468,0.000177,0.001357,0.001129,0.00121,0.000735,0.000519,0.000937,0.000897,0.000148,6.8e-05,0.000424,0.000315,0.000554,0.000571,0.000556,9e-04,0.00115,2e-04,0.000655,0.001409,0.001013,0.000532,0.000529,0.000894,0.001262,0.001096,0.000888,0.000397,0.000379,0.00064,0.001373,0.000913,0.000242,0.000467,0.000422,0.000511,0.000506,0.000856,0.001203,0.001081,0.000185,0.000229,0.000432,0.000649,0.001197,0.000632,0.00023,0.000288,0.000536,0.000806,0.000757,0.000543,0.000211,0.000637,0.00024,0.00044,0.000501,0.000337,0.000293,0.000196,0.000867,0.000951,0.000825,0.000714,0.000582,0.000614,0.000796
6.8e-05,3.7e-05,2.1e-05,1.5e-05,6e-06,8e-06,1.4e-05,4e-06,6.1e-05,4.2e-05,1.9e-05,2.4e-05,3.9e-05,1.4e-05,7.7e-05,0.000106,2.4e-05,4.6e-05,9.1e-05,0.000149,0.000175,0.000222,0.000116,0.000392,0.000371,0.000326,0.000668,0.000453,0.000154,8.8e-05,0.000325,0.000262,0.000323,0.000458,0.000655,0.000731,0.000155,0.00047,0.000384,0.000115,0.000723,0.000508,7.7e-05,0.000317,0.000162,4.4e-05,0.001098,0.000568,0.000388,0.000367,0.000796,0.000498,0.000465,0.001304,0.00144,0.000134,0.000138,0.00047,0.000639,0.000753,0.000369,0.000575,0.000674,0.000591,0.000446,0.000298,0.000458,0.000506,0.000511,0.000274,0.000365,0.000108,0.000615,0.000248,0.00067,3.9e-05,0.000116,0.001245,5.2e-05,0.000449,0.000487,0.000557,0.000261,0.000499,0.000931,0.000647,0.000734,0.000503,0.00017,0.000308,0.000111,0.000697,0.000533,0.000662,0.000614,0.000215,0.000816,0.000918,0.000434,0.000329,0.000204,0.000372,0.000699,0.000431,0.000373,0.000746,0.000785,0.001027,0.000521,0.000794,0.000576,0.000383,0.000264,0.000425,0.000389,0.000946,0.000598,0.000551,0.000565,0.000676,0.000921
5.1e-05,3.1e-05,8e-06,8e-06,1e-05,6e-06,7e-06,1.8e-05,1.4e-05,4.2e-05,1.4e-05,1.4e-05,2e-05,2.9e-05,6.6e-05,1.7e-05,2.6e-05,2.6e-05,0.000177,9.5e-05,9.4e-05,3.9e-05,0.000143,0.000374,1e-04,0.000121,0.000245,0.000128,0.000403,0.000336,7e-05,0.000123,0.000417,0.000294,0.000278,0.000233,0.000308,0.00049,0.000186,0.000117,0.000238,0.00034,0.000638,0.000711,0.000576,0.000271,0.000556,0.000576,0.000637,9.8e-05,0.000573,0.000526,0.000125,0.000529,0.000339,0.00041,0.000348,4e-05,0.000252,0.000535,0.000269,0.000211,7.5e-05,0.000339,0.000228,0.000118,0.000326,0.000153,0.00014,0.000284,0.00022,0.000375,0.000609,4e-04,0.000368,0.000664,0.000401,0.000792,0.000798,0.000979,0.000468,9.5e-05,0.00019,0.000224,0.00044,0.000117,0.000641,0.000875,0.000936,0.00044,0.00031,0.000545,0.000664,0.00028,0.000641,0.001032,0.000425,0.000132,0.000363,0.000553,0.000545,0.000378,7e-04,0.000321,0.000162,0.000436,0.000295,0.000136,0.00025,0.000193,0.00023,0.000154,7.8e-05,0.000475,0.000341,0.000268,0.00026,0.000646,0.000256,0.000376,0.000272
2e-05,1.1e-05,1e-05,1e-05,6e-06,8e-06,5e-06,5e-06,6.2e-05,3.9e-05,2e-05,8e-06,2.6e-05,3.1e-05,4.7e-05,2.1e-05,4e-06,1.8e-05,0.000145,1.3e-05,0.000119,5.2e-05,9.5e-05,0.000155,0.000226,9.1e-05,0.000154,0.000114,0.000217,7.1e-05,8.8e-05,0.000142,0.000329,0.000216,3.5e-05,0.000225,0.000331,0.000183,0.000205,7.2e-05,0.000161,4.8e-05,0.000405,0.000485,0.000109,0.000407,0.000168,0.000657,0.000182,0.000223,0.000208,0.000486,0.000333,0.000117,2.7e-05,0.000129,0.000379,0.000141,0.000154,0.000198,0.000378,0.000186,0.000295,0.000125,0.000338,0.000352,0.000479,6.9e-05,0.00027,0.000382,0.000144,0.000243,0.00039,0.000228,0.000218,0.000497,0.000293,0.000128,9.7e-05,0.000492,0.000444,0.000284,0.000158,0.000262,0.000266,0.000159,0.000373,0.000463,0.000217,7.3e-05,6.3e-05,0.000377,0.000318,0.000316,0.000272,0.000342,0.000186,0.000284,0.000468,0.000298,0.000406,0.00022,0.000426,0.000157,0.000181,0.000113,0.000123,0.000207,0.000163,8.3e-05,0.000396,0.000246,0.000331,0.00034,0.000222,0.000409,0.00013,0.000432,0.000161,0.000396,0.000309
1.4e-05,1.6e-05,1.2e-05,1.6e-05,1.4e-05,6e-06,8e-06,2e-06,6.5e-05,5.4e-05,1.8e-05,1.2e-05,2.7e-05,4.3e-05,7.7e-05,2.5e-05,4.1e-05,4e-06,4.9e-05,8.7e-05,8.2e-05,0.00014,0.000211,0.000167,0.000188,0.000181,0.000132,5.3e-05,0.000271,0.000191,0.000102,0.00019,7.3e-05,0.000648,0.000427,0.000294,0.00026,0.000315,0.000485,0.00035,0.000273,0.000227,0.000351,0.000741,0.000753,0.000538,0.00012,0.00077,0.000622,0.000331,0.000138,0.000528,0.000517,0.000294,0.000299,0.000103,0.000347,0.000618,0.000638,0.000849,0.000748,0.000307,0.000292,0.000116,0.000536,0.000254,0.000211,0.00068,0.00058,0.000296,0.000599,0.000443,0.000606,0.000353,0.000226,0.000753,0.000556,0.000632,0.000564,0.000304,2e-04,0.000303,0.000131,0.000362,0.000603,0.000128,8.8e-05,7.6e-05,0.000581,0.000543,0.000165,0.000371,0.000264,0.000532,0.00048,0.000197,0.000158,0.000395,0.000129,0.000417,0.000356,0.000546,0.00042,0.000286,0.000254,0.00036,0.00048,0.000391,0.000416,0.000184,0.000395,0.000227,0.000531,0.000437,0.000243,0.000444,0.00049,0.000277,0.00016,0.000258,0.000351
3.6e-05,2.1e-05,3e-06,1e-05,1e-05,8e-06,1.1e-05,1.1e-05,2.8e-05,4.7e-05,1.5e-05,1e-05,3.5e-05,7.1e-05,5.6e-05,6.2e-05,1.7e-05,2.4e-05,9.5e-05,6.2e-05,0.000141,0.000177,0.000129,8.6e-05,0.000208,0.000391,0.000365,0.000126,0.000338,0.000194,0.000267,0.000361,0.000206,0.000707,0.000515,0.000232,0.000518,0.000131,0.000284,0.000103,0.000195,0.000496,9.2e-05,0.000407,0.000226,0.000601,0.000538,0.000296,0.000593,0.000107,0.000175,0.000852,0.000528,0.000322,0.000261,0.000357,0.000399,0.000769,0.000861,0.000259,0.000185,0.000415,0.000606,0.000838,0.000897,0.000621,0.000369,0.000573,0.000445,0.000297,0.000357,0.000243,0.000337,0.000255,0.000579,0.000355,0.000468,0.000318,0.000613,0.000516,0.000544,0.00057,0.000687,0.00059,0.000323,0.000541,0.000259,0.000277,0.000927,0.000653,0.000498,0.000451,0.000439,0.000299,0.000167,0.000373,2.7e-05,0.000371,0.00023,0.000171,0.000682,0.000656,0.000391,0.000354,0.000488,0.000239,0.000554,0.000532,0.000474,0.000285,0.000227,0.000395,0.000556,0.000512,0.00025,0.00038,0.001046,0.000445,0.000126,0.000313,0.000227
3.6e-05,2e-05,1.3e-05,6e-06,6e-06,5e-06,5e-06,5e-06,4.1e-05,3.5e-05,1.1e-05,7e-06,2.2e-05,3.8e-05,2.5e-05,6.3e-05,2.5e-05,3.8e-05,0.000109,3.4e-05,0.00011,5e-05,0.000102,0.000115,0.00011,0.000299,0.000228,0.000193,0.000297,0.000472,0.000371,2.4e-05,0.000111,0.000314,0.000127,0.000239,0.000304,0.000343,7.9e-05,0.000279,0.000198,0.000125,0.000145,0.000175,0.000515,0.000625,0.000385,0.000101,0.000333,0.000457,0.000436,0.000458,0.000105,0.000361,0.000585,0.000175,0.00015,0.000528,0.000125,0.000398,0.000399,0.000439,0.000231,0.000315,0.000397,7.1e-05,2.6e-05,0.000536,0.000623,0.000312,0.000245,0.000502,0.000274,0.000127,0.000711,0.000535,0.000148,9.5e-05,0.000212,0.000264,0.000366,0.000304,0.00024,0.00026,0.000258,0.000523,0.000431,0.000646,0.000353,0.000128,0.000257,0.000665,0.000643,0.000378,0.00026,0.000122,0.00012,0.000222,0.000339,0.000478,0.000802,0.000513,0.000242,0.000131,0.000355,0.000599,0.000159,0.000663,0.000558,0.000116,0.000372,0.000237,0.000179,0.00032,0.000322,0.000184,0.000652,0.000454,0.000373,0.000255,0.00038
2.4e-05,1.3e-05,7e-06,4e-06,5e-06,4e-06,4e-06,7e-06,6.9e-05,2.1e-05,9e-06,4e-06,1.3e-05,3.6e-05,3.5e-05,4.2e-05,1.5e-05,2.1e-05,6.2e-05,7e-05,4.4e-05,2.7e-05,1.9e-05,9.9e-05,0.000105,0.000123,3e-05,0.000104,0.000134,0.000115,0.000107,0.000154,0.00022,0.000194,0.000142,0.000124,0.000128,0.00017,0.000217,0.000127,0.000152,0.000164,0.000179,0.000105,0.000283,0.000271,0.000122,0.00023,0.000162,8.4e-05,0.000366,0.000299,0.000143,0.000253,0.000344,0.000264,0.000219,0.000253,0.000165,0.000117,0.000149,0.000256,0.000208,0.00021,0.000272,0.000363,0.000287,0.000545,0.000125,0.000126,0.000234,9.7e-05,0.000104,0.000238,0.000407,0.000244,0.000241,0.000158,0.000335,0.000315,0.000377,0.000171,6.6e-05,0.000392,6e-05,0.000339,0.000221,0.000285,3.2e-05,4.7e-05,6.2e-05,0.000468,0.000154,0.000121,0.000181,0.000131,0.000193,0.000147,0.000252,0.000242,0.000358,0.000246,0.000174,0.000119,0.000233,0.00042,0.000477,0.00027,0.000429,7.5e-05,0.000318,0.000251,0.000129,0.000193,0.000285,0.000192,0.000191,4.9e-05,0.000143,0.000306,0.000102
1.9e-05,1.3e-05,3e-06,4e-06,2e-06,2e-06,3e-06,5e-06,5.9e-05,3.2e-05,6e-06,6e-06,1.5e-05,3.8e-05,3.3e-05,2.8e-05,1e-05,1.7e-05,7.5e-05,8.3e-05,2.7e-05,1.8e-05,4.1e-05,6.8e-05,3.9e-05,9.3e-05,4.4e-05,0.000104,4.4e-05,7e-05,4.2e-05,8.7e-05,0.000105,1.5e-05,9.9e-05,9.3e-05,0.000139,0.000102,0.000123,0.000234,0.000195,0.000143,0.000106,2.3e-05,0.000208,9.2e-05,0.000204,0.000102,0.000112,1e-04,0.000299,0.000216,0.000128,0.000193,3.6e-05,6.1e-05,8.7e-05,0.000162,9.7e-05,7.5e-05,0.000183,1e-04,7.2e-05,0.000167,9.2e-05,0.000149,0.000142,0.000272,0.000175,2.8e-05,0.000223,8.8e-05,0.000117,0.000145,0.000108,0.000129,0.000198,4.4e-05,0.000133,0.000193,0.000141,0.000123,7e-06,0.000243,0.000214,6.7e-05,0.000268,0.000286,0.000145,8.8e-05,0.000189,9.1e-05,0.00015,3.7e-05,0.000181,5.1e-05,0.000148,6.3e-05,0.000174,0.000152,0.000101,6.7e-05,0.000358,7.3e-05,0.000131,0.000382,0.000345,0.00021,0.000378,0.000152,0.000194,0.000159,5.6e-05,0.000105,0.000221,0.000171,0.000172,1.1e-05,0.000138,0.000193,0.000143
2e-05,1.3e-05,7e-06,2e-06,2e-06,1e-06,2e-06,5e-06,4.9e-05,3.4e-05,2e-06,3e-06,1.5e-05,3.2e-05,3.2e-05,2.7e-05,1.3e-05,9e-06,6.8e-05,6.8e-05,1.5e-05,9e-06,4.9e-05,5.1e-05,2.1e-05,7.2e-05,4e-05,9.1e-05,1.8e-05,6.4e-05,3.9e-05,3.9e-05,8e-05,1.9e-05,9.6e-05,0.000106,0.000132,8.6e-05,0.000107,0.000142,7.9e-05,0.000147,0.00014,7.1e-05,0.000216,5e-05,9.7e-05,4.9e-05,8.3e-05,9.6e-05,0.00024,0.000217,0.000101,0.000115,6.9e-05,4e-05,3e-05,0.000186,4.5e-05,2.2e-05,0.000147,1e-05,7.3e-05,0.000142,7.7e-05,9.2e-05,7.1e-05,0.000193,0.000167,4.5e-05,0.000138,7.3e-05,6.6e-05,0.000208,0.000212,6.6e-05,0.000133,3.8e-05,5.2e-05,2e-04,0.000175,0.000123,2.3e-05,0.000183,0.000171,0.000113,0.000213,0.000236,6.9e-05,7.1e-05,0.000194,0.000106,0.000136,4.2e-05,0.000124,9.3e-05,0.000111,6.4e-05,0.000215,0.000186,0.000115,9.9e-05,0.00029,1.6e-05,1e-05,0.000296,0.000285,0.000133,0.000268,8.6e-05,0.000159,0.000123,2.6e-05,0.000169,0.000219,9.3e-05,0.000142,3.5e-05,0.000109,0.000272,9.4e-05
