-0.005641,-0.008929,-0.006747,-0.007268,-0.007144,-0.005981,-0.007021,-0.004741,-0.005623,-0.008958,-0.006939,-0.005591,-0.008135,-0.00539,-0.002869,-0.003223,-0.008222,-0.010993,-0.00763,-0.006916,-0.006029,-0.006436,-0.00818,-0.008163,-0.006075,-0.008061,-0.007438,-0.005779
-0.005137,-0.005939,-0.00344,-0.00402,-0.004596,-0.000258,-0.00117,-0.003225,-0.002994,-0.000713,-0.002029,-0.002088,0.000726,-0.001821,-0.00344,-0.00151,-8e-06,-0.004705,-0.002766,-0.00109,-0.002024,-0.000533,0.000709,-0.000484,0.000265,9.2e-05,0.000291,-0.000252
-0.002329,-0.002301,-0.001539,-2e-06,-0.001355,-0.003031,-0.003823,-0.006489,-0.005393,-0.002775,-0.003549,-0.004755,-0.002858,-0.003945,-0.005701,-0.003507,-0.00111,-0.001091,-0.001806,-0.001087,-0.000465,-0.000262,-0.001713,-0.001467,-0.001742,-0.003966,-0.004827,-0.003466
0.001758,0.00236,-0.000251,0.002188,0.00234,-0.00375,-0.003581,-0.006384,-0.005455,-0.003134,-0.002866,-0.003957,-0.004332,-0.004602,-0.005515,-0.003847,-0.000574,0.003638,7.2e-05,-0.000766,0.000521,-0.001058,-0.003488,-0.001831,-0.002597,-0.004753,-0.005514,-0.00343
0.003937,0.005894,0.002572,0.003628,0.005229,0.003548,0.004491,0.000721,0.001017,0.005676,0.004726,0.003825,0.005263,0.001417,-0.000808,6e-04,0.006499,0.008636,0.005351,0.004402,0.003034,0.002575,0.005377,0.005938,0.004349,0.006332,0.006,0.004956
-0.001598,-0.002983,-0.002016,-0.002091,-0.002009,-0.001318,-0.002128,-0.000744,-0.001264,-0.00258,-0.001663,-0.001422,-0.002172,-0.001624,-0.001181,-0.001249,-0.00222,-0.003853,-0.001752,-0.00133,-0.001958,-0.001883,-0.000259,9.1e-05,0.00031,0.000753,0.000285,0.000315
-0.004586,-0.007382,-0.003705,-0.005605,-0.006474,-0.004806,-0.006312,0.000183,-0.000419,-0.00817,-0.007183,-0.005865,-0.007772,-0.002881,-0.000343,-0.002294,-0.007838,-0.010585,-0.006542,-0.0056,-0.004579,-0.003954,-0.006077,-0.006225,-0.004096,-0.005341,-0.00475,-0.004078
0.000496,0.002088,0.003629,0.001486,0.001328,0.005206,0.005893,0.00946,0.009088,0.006551,0.004226,0.004069,0.006553,0.006624,0.006147,0.00404,0.003714,0.003042,0.003457,0.003439,0.002665,0.004645,0.005896,0.00328,0.003046,0.005678,0.007616,0.004754
0.003614,0.005232,0.004248,0.005138,0.004699,0.004879,0.006767,0.006798,0.005487,0.006978,0.006997,0.006038,0.006616,0.005959,0.006032,0.004711,0.003924,0.006605,0.005281,0.004395,0.004212,0.00368,0.005231,0.003801,0.001867,0.00413,0.005287,0.003791
0.002949,0.001998,-0.000926,-6.4e-05,0.000147,-0.002514,-0.001271,-0.002511,-0.0039,-0.003668,-0.000639,0.00013,-0.004361,-0.002315,0.000858,0.000355,-0.003507,-0.000846,-0.002071,-0.003217,-0.001277,-0.004394,-0.006789,-0.004201,-0.004531,-0.005715,-0.005517,-0.003544
0.00138,0.002393,-0.000408,-0.002574,-0.001358,0.000508,0.000536,-0.003441,-0.002503,0.000621,0.000217,0.001283,0.000208,-0.001416,-0.000744,0.000153,0.000284,-0.000607,-0.001685,-0.001717,-0.001673,-0.001356,-0.002103,-0.000137,4.1e-05,-0.000712,-0.000755,-0.000165
-0.002772,-0.002456,-0.000713,-0.001995,-0.0033,-0.000867,-0.002214,-0.005621,-0.003766,-0.000938,-0.002435,-0.002407,7.1e-05,-0.001797,-0.003565,-0.001694,-0.000238,-0.003342,-0.002481,-0.000505,-0.001388,0.001307,0.001501,0.001,0.001433,-0.000501,-0.001979,-0.000993
-0.004499,-0.007415,-0.00397,-0.002156,-0.004296,-0.006871,-0.0078,-0.007162,-0.007028,-0.009328,-0.008596,-0.008718,-0.007366,-0.005278,-0.00619,-0.004445,-0.003762,-0.005898,-0.004709,-0.002988,-0.002422,-0.002328,-0.004286,-0.004818,-0.003467,-0.006415,-0.008015,-0.005529
-0.000405,-0.00092,-0.001727,0.00097,0.002388,-0.001319,-0.000581,0.000246,-0.000242,-3.4e-05,-0.000519,-0.002092,0.000345,-0.000497,-0.002491,-0.00127,0.002826,0.003869,0.00329,0.002344,0.001569,0.000623,0.002028,0.000746,0.000295,0.00186,0.002413,0.001691
0.00297,0.004565,0.002169,0.003979,0.005822,0.003478,0.003452,0.003778,0.003907,0.006371,0.005848,0.003781,0.004856,0.002043,0.000792,0.000778,0.003225,0.006815,0.006909,0.004675,0.003413,0.002814,0.006176,0.005403,0.003633,0.006745,0.007096,0.005095
0.002597,0.0026,0.002453,0.001091,0.00087,0.001038,-0.000544,0.002067,0.002286,-0.000971,-4.2e-05,0.00127,-0.002297,-0.001166,0.00108,-0.000409,-0.002816,-0.00104,-0.000454,-0.001261,-0.000596,-0.001658,-0.00261,-0.000635,-1.6e-05,0.000421,-0.000537,-0.001095
-0.000104,0.000805,0.001979,-0.002048,-0.002006,0.002955,0.002611,0.005048,0.0054,0.002121,0.000504,0.002874,0.001456,0.002098,0.00315,0.001433,0.000439,-0.001684,-0.002069,-0.000946,-0.001376,-0.000214,-0.000985,-0.000926,0.000582,0.001366,0.002094,0.000231
-0.003179,-0.002111,0.000334,-0.000741,-0.001546,0.002729,0.004051,0.004701,0.004245,0.004923,0.003508,0.00339,0.005298,0.004891,0.00364,0.002449,0.002076,-0.000581,0.000153,0.00177,0.000852,0.003051,0.004287,0.001347,0.00137,0.001616,0.003198,0.002367
-0.002319,-0.003506,-0.002119,0.000772,-0.000812,-0.002416,-0.001263,-0.001371,-0.003125,-0.003877,-0.001001,-0.001338,-0.002627,0.000432,0.001381,0.000796,-0.00194,-0.002541,-0.001498,-0.001372,0.000662,-0.000905,-0.002842,-0.002304,-0.002778,-0.004921,-0.004727,-0.002218
