5.2e-05,4e-05,7.9e-05,0.000111,3e-05,9.3e-05,0.000118,0.000104,6.5e-05,3.2e-05,0.000122,0.000124,7.6e-05,2.5e-05,5.5e-05,5.2e-05,2.3e-05,3.7e-05,8e-06,3.8e-05,0.000102,6.3e-05,6.5e-05,0.000138,0.000329,0.000171,0.000327,5.9e-05,7.5e-05,4.3e-05,0.000101,5.4e-05,2.7e-05,2.2e-05,8.9e-05,8.7e-05,6.1e-05,1.7e-05,8e-06,5.6e-05,0.00011,9.3e-05,9.6e-05,0.000116,2.8e-05,7e-06,4.4e-05,4.5e-05,6.5e-05,7e-06,6.9e-05,2.2e-05,1.3e-05,6.2e-05,9.5e-05,2.2e-05,9.5e-05,3e-05,5.5e-05,9e-06,0.000573,0.000611,4.3e-05,0.000615,0.000384,0.000419,0.000376,0.000275,0.000309,0.00017,0.000173,1.8e-05,0.000285,0.000449,1e-06,0.000387,0.00045,0.00042,0.000808,0.000466,0.000343,8.7e-05,8.5e-05,0.00012,0.000349,0.000206,0.000548,0.000111,0.000253,0.000443,0.000279,0.000161,0.000206,0.000274,0.000308,0.00022,0.000336,8.1e-05,3.3e-05,0.000125,0.000496,0.000734,0.000686,0.000729,0.000729,0.000628,0.000247,6.9e-05,0.000308,0.000746,0.001165,0.001252,0.001003,0.00076,0.000432,0.000178,0.000106,3.1e-05,3.7e-05,0.000118,0.000192
0.000242,0.00022,0.000106,0.000227,0.000212,0.000306,0.00034,0.000332,0.000247,0.000185,0.000356,0.000294,0.000109,4.3e-05,0.000126,0.00019,0.000237,0.000179,0.000104,0.000193,0.000353,0.000344,0.000344,0.00038,0.000657,0.000277,0.000589,0.00014,0.000103,0.000236,0.000286,0.000106,0.000149,0.000213,0.000296,0.000268,0.000263,0.000206,0.000116,9.5e-05,0.000182,0.000202,0.000218,0.000292,2.1e-05,0.000105,0.000176,0.000189,0.000161,0.000113,0.000186,5.8e-05,7.5e-05,0.000176,0.000239,6.4e-05,0.000297,0.000168,0.000107,0.000151,0.001236,0.001296,0.000313,0.001405,0.001036,0.001024,0.000936,0.000709,0.000679,0.000348,0.000487,0.000228,0.000601,0.00108,0.00046,0.000972,0.000991,0.001047,0.001814,0.001119,0.000792,0.000253,0.00044,0.000465,0.00086,0.000597,0.001217,0.00035,0.000628,0.001101,0.000613,0.000603,0.000551,0.000782,0.000873,0.000494,0.000872,0.000157,0.000263,0.000245,0.001081,0.001654,0.00138,0.001627,0.0016,0.001491,0.000948,0.000887,0.000933,0.001549,0.002434,0.002715,0.002185,0.001784,0.001023,0.000594,0.000495,0.000495,0.000449,0.000484,0.000519
0.000367,0.000177,0.000205,0.000116,0.000214,0.000115,0.000212,0.000233,2.5e-05,0.000122,0.000379,0.000357,0.000206,0.000175,0.000146,0.000111,0.000361,0.000273,3.9e-05,0.000148,0.000135,0.00018,0.000142,0.000464,0.000986,0.000656,0.000917,0.00018,0.000214,0.000349,0.000486,0.000285,0.000205,0.000323,0.000431,0.00032,0.000315,0.000149,0.000154,0.000293,0.000269,7.1e-05,0.000243,0.000438,0.000156,0.000249,0.00035,0.000182,0.000162,0.00024,0.000409,3.5e-05,0.000209,0.00037,0.000362,9.2e-05,0.000467,7.5e-05,0.000242,0.000515,0.001654,0.001991,0.000958,0.001988,0.001747,0.001465,0.001487,0.001182,0.001262,0.000704,0.000695,0.000569,0.001219,0.001517,0.001324,0.001804,0.001762,0.001993,0.002856,0.002514,0.001705,0.001246,0.001742,0.002163,0.001566,0.00067,0.002346,0.001171,0.001588,0.002449,0.001699,0.001887,0.002044,0.002381,0.002401,0.002104,0.00192,0.001011,0.000666,0.000752,0.001529,0.002555,0.002546,0.002481,0.002901,0.002896,0.002886,0.002355,0.002078,0.002545,0.00327,0.003564,0.003279,0.003042,0.002459,0.001966,0.002128,0.00213,0.002174,0.002115,0.002034
0.001045,0.000595,0.000272,0.000134,0.000155,0.000346,0.000521,0.000156,0.000385,8e-05,0.000615,0.000859,0.000618,0.000273,8.5e-05,0.000108,0.000364,0.000348,0.000264,4.6e-05,0.000516,0.000634,0.000588,0.000796,0.00151,0.001183,0.001429,0.00053,0.000367,0.000739,0.000691,0.000589,0.000562,0.000961,0.000847,0.000566,9.2e-05,0.000525,3e-05,0.000364,0.000333,0.000248,0.000506,0.000699,0.000184,0.000185,0.000261,0.000253,0.000304,0.000558,4.7e-05,0.000393,0.000376,0.000293,0.000221,0.000299,0.000487,0.000679,0.00071,0.001266,0.003391,0.005667,0.004967,0.004786,0.005511,0.005525,0.005595,0.004837,0.004816,0.003436,0.002475,0.002594,0.003406,0.004066,0.004836,0.005603,0.005176,0.003699,0.004084,0.005615,0.004542,0.002449,0.000585,0.002748,0.004495,0.003961,0.004015,0.003909,0.001572,0.003493,0.004816,0.003278,0.00299,0.00415,0.005331,0.005202,0.005271,0.005315,0.00494,0.003887,0.002122,0.001754,0.00232,0.00198,0.001487,0.002763,0.004989,0.006014,0.005042,0.0045,0.005324,0.005266,0.004792,0.004999,0.00559,0.005692,0.005655,0.006731,0.007249,0.006657,0.005724
0.002616,0.002002,0.00086,0.000361,0.000267,0.000391,0.000859,0.001098,0.001133,0.000879,0.000838,0.001192,0.001471,0.001288,0.000799,0.000664,0.000752,0.000856,0.000847,0.000444,0.000706,0.001497,0.001979,0.002487,0.003316,0.003867,0.004186,0.003644,0.00206,0.000239,0.001226,0.002075,0.002549,0.003102,0.00344,0.003038,0.001866,0.001129,0.000649,0.000517,0.000828,0.000995,0.00119,0.001582,0.001209,0.000586,0.000654,0.000859,0.000934,0.000936,0.000886,0.000828,0.000885,0.00087,0.00071,0.000755,0.000985,0.001006,0.000743,0.00067,0.003322,0.005817,0.005757,0.005258,0.005547,0.004203,0.003487,0.004005,0.00337,0.00139,0.000978,0.001707,0.001311,0.001671,0.002135,0.001334,0.001109,0.000595,0.001958,0.002468,0.000633,0.000601,0.001323,0.000824,0.002211,0.002677,0.002108,0.001891,0.001586,0.002845,0.001677,0.00139,0.002082,0.002073,0.002476,0.002093,0.002618,0.003138,0.002469,0.002488,0.001676,0.002199,0.002297,0.001732,0.001237,0.00083,0.000953,0.000657,0.001378,0.002836,0.002562,0.00265,0.002459,0.002576,0.002387,0.002706,0.003446,0.00413,0.003445,0.003102,0.00298
0.000902,0.000213,0.000246,0.000228,0.000211,7.7e-05,0.000495,0.000622,0.000478,6.4e-05,0.000262,0.000327,0.000489,0.000197,1.2e-05,0.000375,0.000243,0.000314,0.00023,0.000317,0.000769,0.000607,0.000685,0.001563,0.001635,0.001551,0.001228,0.001186,0.00074,7e-04,0.000735,0.001137,0.0011,0.001336,0.001211,0.000758,0.000715,0.000337,0.000102,0.000463,0.000547,0.000429,0.000427,0.000501,0.000474,0.000302,0.00061,0.000311,0.000538,0.000218,0.000357,0.000141,0.000392,0.000329,0.000315,0.00032,0.000323,0.000302,0.000202,0.000936,0.001786,0.001334,0.001817,0.00168,0.001456,0.000816,0.001697,0.00157,0.000484,0.000119,0.00062,0.000933,0.000703,0.000703,0.00041,0.000612,0.000211,0.000736,0.00081,0.00039,0.000364,0.000301,0.000842,0.001088,0.000691,0.001877,0.000545,0.001309,0.000597,0.00168,0.002322,0.002417,0.002808,0.003276,0.003307,0.003942,0.004485,0.005264,0.006019,0.006512,0.006614,0.007122,0.007129,0.006729,0.006665,0.006023,0.005691,0.005716,0.00649,0.007023,0.007149,0.007217,0.006836,0.007122,0.006772,0.007417,0.008017,0.008102,0.007773,0.007313,0.007021
0.000313,0.000283,0.000122,0.000327,0.000262,3.9e-05,0.000308,0.000303,0.000176,0.000225,7.2e-05,0.000268,1.1e-05,0.000142,1e-04,0.000192,0.000352,0.000167,0.000317,0.000159,0.000348,0.000389,0.000299,0.000784,0.000833,0.001174,0.000394,0.00082,0.000495,0.000418,0.000208,0.000415,0.000564,0.000709,0.000576,0.00036,0.000428,0.000197,0.000141,0.00025,0.000119,0.000414,0.00028,0.000291,0.000261,0.000173,0.000228,0.000617,3.6e-05,2e-04,0.000198,6.5e-05,0.00029,0.000149,0.000182,6e-05,0.000288,0.00033,0.000153,0.000909,0.000845,0.000413,0.001237,0.000897,0.000572,0.000926,0.001277,0.001276,0.000275,0.000483,0.001082,0.001074,0.00057,0.000561,0.001132,0.001514,0.000952,0.000622,0.001351,0.001123,0.000256,0.000417,0.000618,0.001258,0.000718,0.000955,5e-04,0.000267,0.000743,0.000134,0.000806,0.000761,0.000788,0.001567,0.002066,0.002646,0.003729,0.004661,0.005877,0.00702,0.00839,0.008624,0.008707,0.008778,0.008104,0.00828,0.007861,0.007435,0.006332,0.005392,0.004574,0.004538,0.005399,0.005918,0.006178,0.006207,0.006529,0.006977,0.006926,0.006784,0.006736
0.000112,9.5e-05,0.000245,0.00034,0.000193,0.000231,0.000362,0.000378,0.000177,0.000125,0.000302,0.000446,0.000235,0.000114,0.000106,0.000116,0.00022,0.00027,0.000535,0.000322,0.000274,0.000385,0.000282,0.000884,0.00113,0.000642,0.00038,0.001018,0.000636,0.00062,0.00014,0.000374,0.000187,0.000458,0.000473,0.000609,0.000116,7.4e-05,0.000223,0.000159,0.000322,0.00028,0.000291,0.00041,0.00075,0.000399,0.000384,0.000368,0.000239,0.000158,0.000236,0.00017,0.000172,0.000316,0.00022,0.000278,0.000317,0.000284,0.000302,0.000899,0.00037,0.001421,0.002067,0.001113,0.00161,0.0021,0.001003,0.000363,0.000609,0.000439,0.000594,0.00053,0.000477,0.00056,0.001046,0.000615,0.000288,0.000531,0.000658,0.000366,0.000582,0.000241,0.00104,0.000848,0.000639,4e-04,0.000371,0.000554,0.00088,0.000284,0.000488,0.000637,0.000132,0.001267,0.000599,0.001559,0.00133,0.001979,0.002434,0.002995,0.003694,0.003591,0.003684,0.003784,0.003803,0.003546,0.003532,0.003022,0.001988,0.001112,0.00088,0.000816,0.000617,0.000861,0.000982,0.002235,0.00205,0.002588,0.002226,0.002682,0.002627
0.000175,0.000233,0.000272,9.2e-05,0.000142,3e-04,0.000357,0.000108,0.000216,3.2e-05,0.000319,0.000103,0.00023,5.4e-05,0.000101,0.000197,0.000287,0.000125,0.000293,0.000214,0.000364,0.000202,0.000254,0.001226,0.00232,0.002819,0.001992,0.002342,0.001779,0.000766,0.00053,0.000615,0.000613,0.000678,0.000479,0.000394,0.000246,0.000132,0.000355,0.000365,0.000688,0.000493,0.000464,0.00021,0.000544,0.000365,7.8e-05,0.000355,0.000491,9.3e-05,0.000247,0.000127,6.7e-05,0.000582,0.00046,0.000275,6.3e-05,0.000142,0.000208,0.000579,0.000692,0.000698,0.000947,0.000363,0.000865,0.001078,0.000561,0.00056,0.000366,0.000106,0.000517,0.000331,0.000429,0.000475,0.000757,0.000444,0.000246,0.000147,0.000219,0.000432,0.000376,0.000209,0.000646,0.00096,0.000401,0.000612,0.000374,0.000666,0.000472,0.00066,0.001047,0.00098,0.001084,0.001438,0.001631,0.001749,0.001921,0.002072,0.002829,0.003311,0.004347,0.005241,0.005814,0.006158,0.006318,0.005979,0.005835,0.006055,0.006285,0.007166,0.007776,0.00754,0.006983,0.006589,0.006525,0.006394,0.005933,0.005234,0.004647,0.004369,0.004412
5.9e-05,0.000144,4.5e-05,0.000179,0.00024,0.000272,9.9e-05,9.6e-05,9.7e-05,0.000153,0.000328,0.000353,0.000217,0.000123,7.2e-05,0.000275,0.000379,0.000299,8.5e-05,0.000101,0.00015,0.000125,0.000288,0.000998,0.001545,0.00077,0.001121,0.000295,0.000191,0.000173,0.000731,0.000243,0.000422,8.2e-05,0.000294,0.000113,2.8e-05,9.9e-05,0.000245,0.000307,0.000362,0.000286,0.000103,0.000316,0.000113,5.6e-05,6.1e-05,0.000162,0.00029,0.000439,0.000215,0.000168,0.000229,0.000352,0.000162,0.000154,0.000194,0.000159,0.000209,0.000313,0.000228,0.00053,0.000329,6.8e-05,0.000817,0.000698,0.000317,0.000746,0.000262,1.6e-05,0.00024,0.000291,0.00037,0.000583,0.000891,0.000216,0.000461,0.000588,0.000182,0.000213,7.8e-05,0.000262,0.000162,0.000613,0.000417,0.000633,0.000414,0.000265,0.000481,0.000119,0.000483,0.000488,0.000228,0.00053,0.000553,0.000346,0.000415,0.000474,0.000643,0.000968,0.000698,0.001332,0.001599,0.001784,0.001646,0.002655,0.003523,0.004157,0.004351,0.004953,0.004339,0.004269,0.004285,0.004448,0.004179,0.003745,0.002771,0.002059,0.001541,0.001738,0.001708
0.000191,8.7e-05,0.000126,2e-04,3.5e-05,0.000137,6.1e-05,0.000128,0.000112,9.8e-05,0.000109,0.000212,0.000174,5.7e-05,0.000109,0.000113,5.9e-05,6.4e-05,9.5e-05,5.3e-05,0.000198,0.00027,0.00046,0.000222,0.000678,0.000527,0.000397,0.000284,0.000123,0.000228,0.000378,0.000162,0.00035,0.000132,0.000156,0.000294,2e-04,0.000173,2.9e-05,0.000206,0.000178,9.1e-05,8.8e-05,0.000132,7.3e-05,8.9e-05,0.000118,0.000102,0.00012,0.000189,0.000198,8.6e-05,0.000127,0.000124,8.5e-05,0.00017,8e-05,0.000131,0.000148,0.000145,0.000271,0.000533,0.000452,2.9e-05,0.000857,0.000379,0.000421,0.00042,0.000248,0.000146,0.000139,0.000181,0.000164,0.000539,0.000259,0.000331,0.000134,0.000337,0.000159,0.000272,0.000257,0.000161,0.000346,0.000528,0.000222,0.000375,0.000303,0.000181,0.000402,0.000196,0.000429,0.000182,0.000256,0.000357,0.000249,0.000151,0.000209,0.000274,0.000216,0.000496,0.000288,0.000225,0.000306,0.000396,0.000421,0.001191,0.001825,0.001991,0.002449,0.002278,0.001878,0.001578,0.002002,0.002264,0.002094,0.001826,0.001153,0.000678,0.000714,0.000464,0.000512
0.000117,4.9e-05,0.000121,3.2e-05,2.6e-05,0.000112,8.2e-05,6.6e-05,5.7e-05,7.6e-05,0.000118,0.000133,4.5e-05,6e-05,4.6e-05,6.4e-05,5.3e-05,2.2e-05,7.1e-05,7.5e-05,0.000161,0.000189,0.000347,0.000208,0.000283,0.000254,0.000289,0.000176,0.000134,4.6e-05,0.000249,7e-05,0.000276,0.000168,0.000254,0.000204,4e-05,7.1e-05,3e-05,6.7e-05,5.4e-05,4.9e-05,1.9e-05,0.000158,3.5e-05,8.6e-05,0.000118,7.3e-05,6.1e-05,0.000119,9.5e-05,6.6e-05,8e-05,6.9e-05,6e-05,7.3e-05,1.6e-05,6.3e-05,3.8e-05,0.000132,0.000215,0.000464,0.00038,0.000118,0.00046,0.000376,0.000275,0.000287,0.000106,0.00012,0.000106,0.00024,0.000251,0.000316,0.000355,0.000296,0.000124,0.000259,0.000179,8.8e-05,0.000108,0.000149,0.000171,0.000418,3.9e-05,0.00039,0.000239,6.9e-05,0.000319,8.9e-05,0.000242,0.000132,1.5e-05,0.000171,0.000199,0.000184,0.000253,0.000386,0.000297,0.000462,0.000246,0.000116,0.000212,0.000322,0.000404,0.000912,0.001539,0.001701,0.001823,0.001605,0.001222,0.000983,0.001323,0.001759,0.001816,0.001473,0.000894,0.000402,0.000346,0.000331,0.000316
9.9e-05,3.1e-05,6.6e-05,3e-06,1.9e-05,7e-05,7e-05,0.000133,3.9e-05,3.6e-05,6.4e-05,0.000118,8.6e-05,9e-05,6.3e-05,6.9e-05,3.1e-05,5.3e-05,3.4e-05,5.1e-05,0.00015,0.000143,0.000266,0.00012,0.000235,0.000162,0.000292,0.000108,6.1e-05,3.4e-05,0.000196,0.000114,0.000287,0.000201,0.000229,0.000176,3.6e-05,5.1e-05,6.2e-05,0.000104,4.3e-05,4.1e-05,9e-06,9e-05,9e-06,0.00011,9.7e-05,8.2e-05,3.7e-05,8.9e-05,5.2e-05,4.3e-05,7e-05,6.1e-05,5.6e-05,8.2e-05,1.4e-05,4.7e-05,1.9e-05,0.000108,0.000199,0.000463,0.000343,0.000162,0.000468,0.00034,0.000235,0.000312,0.000116,7.3e-05,7.1e-05,0.000175,0.000227,0.00027,0.000271,0.000239,0.000121,0.000211,0.000162,0.000112,5.6e-05,7.5e-05,0.000167,0.000446,0.000114,0.000371,0.000165,6.1e-05,0.000266,7e-05,0.000154,0.000105,8.9e-05,0.000212,6.7e-05,7.7e-05,0.000243,0.000221,0.000125,0.000357,8.2e-05,0.000117,0.00019,0.000189,0.000273,0.000801,0.001253,0.001524,0.001411,0.001201,0.000846,0.00061,0.000868,0.00149,0.001278,0.001056,0.000638,0.000363,0.000243,0.000166,7e-05
0.000102,8.4e-05,2.8e-05,7.9e-05,6.8e-05,6.4e-05,6.6e-05,0.000153,7.7e-05,0.000105,8.1e-05,7.6e-05,1.4e-05,0.000172,0.000122,0.000125,8.4e-05,6.5e-05,3.6e-05,8e-05,0.000131,0.000129,0.000236,0.000127,0.000172,0.000193,0.000161,4.6e-05,4.5e-05,8.9e-05,0.00018,8.9e-05,0.000277,6.4e-05,0.000246,0.000159,5.9e-05,1e-05,5.5e-05,5.2e-05,3.3e-05,0.000112,6.2e-05,0.000144,5.6e-05,0.000114,8.3e-05,6.9e-05,7.7e-05,4.7e-05,0.000125,2.3e-05,0.000124,0.000108,5e-05,2.8e-05,8.8e-05,6.9e-05,4.7e-05,1e-04,0.000264,0.000351,0.000312,9.6e-05,0.000486,0.000287,0.00025,0.000323,0.000154,6.8e-05,0.000157,0.000228,0.000178,0.000202,0.000237,0.000175,0.000125,0.00019,7.6e-05,0.000152,0.00012,0.000161,0.000206,0.000334,0.000134,0.000273,0.000153,1.8e-05,0.000227,5.9e-05,0.000133,0.000148,7.1e-05,0.000231,0.00012,5.7e-05,0.000197,0.000168,0.00013,0.000137,0.000201,0.000287,0.000256,0.000223,0.00022,0.00068,0.001398,0.00138,0.001388,0.001131,0.000709,0.000391,0.000626,0.001159,0.001323,0.001051,0.000658,0.000386,0.00018,0.000179,0.000111
6.3e-05,0.000107,6.7e-05,7e-05,2e-05,3.5e-05,9.7e-05,3.2e-05,6.9e-05,3.6e-05,0.000125,8.7e-05,2.9e-05,0.000114,0.000108,3.2e-05,3e-05,7.2e-05,6.5e-05,4.4e-05,0.000148,9.6e-05,2e-04,2.7e-05,0.00012,0.000107,0.000158,9.6e-05,9.5e-05,0.000132,0.000117,0.00011,9e-05,0.000148,0.000195,0.000105,6.4e-05,3.9e-05,4.8e-05,9.9e-05,5.5e-05,7.1e-05,4.5e-05,7.8e-05,6.3e-05,0.000122,1.5e-05,4.8e-05,6.7e-05,6.3e-05,0.000141,0.000123,0.000148,3.7e-05,4.5e-05,2.9e-05,9.1e-05,6.8e-05,3e-05,4.2e-05,0.000222,0.000384,0.000375,0.000121,0.000439,2e-04,0.000151,0.000328,0.00015,4.2e-05,0.000129,0.000233,7.4e-05,0.000244,0.000293,0.000244,0.00016,0.000133,8e-05,0.000122,0.000135,0.000106,0.000213,0.000353,0.00012,0.000289,0.000103,8.9e-05,0.000253,4e-05,0.000173,4.4e-05,0.000164,1e-04,2e-04,0.000239,0.00029,0.000398,0.000361,0.000544,0.000623,0.000255,0.000176,0.000151,0.000333,0.000648,0.001249,0.00121,0.000894,0.000294,0.000451,0.000445,0.000933,0.001444,0.001347,0.001021,0.00072,0.000381,0.000212,0.000103,0.000114
0.000123,0.000119,7.4e-05,4.3e-05,3.3e-05,5.5e-05,6e-05,1.5e-05,5.9e-05,8e-05,9.6e-05,9.7e-05,1.6e-05,5e-05,0.000104,5.9e-05,3.5e-05,2.6e-05,8.7e-05,5.3e-05,0.000128,4.4e-05,0.000155,7.8e-05,0.000138,6.2e-05,0.000176,5.6e-05,4.6e-05,7e-05,6.3e-05,0.000146,0.000173,0.00017,0.000125,6.2e-05,0.00011,4.9e-05,6.5e-05,5.1e-05,8.8e-05,9.4e-05,9e-06,3.5e-05,4.4e-05,9.9e-05,7.1e-05,9e-05,2.3e-05,7.7e-05,4.7e-05,5.1e-05,0.000124,8.3e-05,3.2e-05,7.1e-05,9.8e-05,9.4e-05,6.3e-05,6.6e-05,0.000219,0.000289,0.000288,0.000126,0.000406,0.000149,0.000231,0.000236,0.000144,7e-05,7.1e-05,0.000159,0.000194,0.000267,0.000314,0.000141,0.000109,0.000148,0.00015,0.000153,4.7e-05,0.000149,0.000258,0.000264,0.000114,3e-04,0.000151,4.8e-05,0.000243,0.000106,0.000147,5.9e-05,0.000131,7.4e-05,0.000137,0.000237,0.000243,0.00038,0.000238,0.000481,0.000397,0.000128,0.000219,0.000197,4.9e-05,0.000428,0.00099,0.001058,0.000797,0.000581,0.00041,0.000314,0.000698,0.000977,0.001076,0.000948,0.000468,0.000181,8.3e-05,0.000175,0.000269
3.9e-05,9.6e-05,9.1e-05,4.3e-05,5.7e-05,4.1e-05,2.9e-05,7.8e-05,5.7e-05,0.000107,5.7e-05,0.000113,0.000103,9.6e-05,2.5e-05,2.5e-05,6.4e-05,3.2e-05,4.1e-05,1.4e-05,8.5e-05,0.000166,0.00017,0.000129,0.000132,0.000103,0.000105,7.5e-05,4.9e-05,4.3e-05,0.000121,0.000147,0.000121,0.000131,8.5e-05,0.000177,0.000112,0.000103,6.5e-05,8.7e-05,1.7e-05,0.000108,5.5e-05,7.6e-05,6.8e-05,9.1e-05,3.6e-05,5.8e-05,9.8e-05,0.000135,2.8e-05,0.000103,9.8e-05,4.1e-05,6.8e-05,0.000126,3.3e-05,0.000138,2.8e-05,7.7e-05,0.000209,0.000266,0.000237,0.000145,0.000343,0.000202,0.000132,0.000268,0.000138,0.000114,7.1e-05,8.6e-05,0.000208,0.000133,0.000241,0.000192,8.8e-05,0.000124,5.7e-05,0.000171,4.1e-05,7.2e-05,0.000294,0.000371,0.000104,0.000222,0.000166,3.2e-05,0.000174,8e-05,0.000155,0.000108,0.000125,0.000276,0.00031,0.000389,0.000411,0.000465,0.000417,0.000441,0.000447,0.000442,0.000522,0.000531,0.00024,0.000681,0.001074,0.001098,0.000861,0.000356,0.000364,0.000449,0.000841,0.0012,0.00141,0.001124,0.000567,4.9e-05,0.00021,0.00048,0.000605
0.000132,6e-05,5.4e-05,2.5e-05,6.8e-05,9.6e-05,9.2e-05,1.3e-05,9e-05,0.000116,0.000134,8.7e-05,5.8e-05,3.5e-05,2.2e-05,7.3e-05,6.8e-05,0.000147,5.5e-05,8e-06,7.7e-05,0.000155,0.000194,7.8e-05,0.000193,0.000108,2e-04,2.7e-05,0.000107,5.5e-05,0.000167,6.1e-05,8.7e-05,4.9e-05,0.000109,8.7e-05,5.7e-05,3.7e-05,4.1e-05,7.3e-05,9.3e-05,0.000113,0.000111,2.4e-05,5.8e-05,1.5e-05,0.000109,6.9e-05,7e-05,0.000139,7.4e-05,0.000123,0.00011,6.7e-05,9e-05,8.7e-05,0.000143,0.000235,0.000151,7.5e-05,0.000101,0.000342,0.000187,0.000122,0.000328,0.000186,0.000118,0.000227,0.000191,0.000206,1.5e-05,0.000165,0.000194,0.000118,0.000298,0.000148,0.000114,0.000176,7.9e-05,0.000234,0.000138,0.000185,0.000316,0.000208,0.000125,0.000189,0.000147,1.9e-05,0.000191,9e-06,0.000204,7.7e-05,4.8e-05,0.000153,0.000103,6.2e-05,5.7e-05,0.000164,4.9e-05,0.000206,0.000177,7.2e-05,0.00014,0.000307,6.6e-05,0.000522,0.000921,0.001089,0.000707,0.000309,0.000435,0.000433,0.00078,0.000712,0.000898,0.000294,0.000345,0.000622,0.000659,0.000968,0.000961
5.5e-05,0.000158,0.00019,0.000163,0.000117,0.000117,4.9e-05,2.9e-05,6.2e-05,0.000142,7.4e-05,0.000107,0.00016,5.5e-05,3.2e-05,9.8e-05,0.000154,0.000214,0.000215,0.000111,0.000163,0.000118,0.000159,0.000139,0.000298,0.000423,0.000242,0.000143,9.6e-05,8e-05,0.000125,0.000139,0.000222,0.000171,0.000245,0.000107,0.000152,0.00012,0.000116,7.8e-05,7.1e-05,0.000147,0.000245,0.000159,6.2e-05,5.4e-05,0.000149,6.1e-05,3.9e-05,1.9e-05,5.5e-05,9.6e-05,0.000134,8.9e-05,0.000118,5.6e-05,0.00015,0.00016,8.1e-05,0.000124,9.1e-05,0.000372,0.000177,0.000245,0.000324,0.000102,0.000186,0.00023,0.000176,8.6e-05,0.000206,0.000102,0.000149,2.9e-05,0.000361,0.000246,8.7e-05,0.000314,0.000196,0.000287,0.000137,0.000123,0.000139,0.000375,4.4e-05,0.000193,8e-05,9.6e-05,0.000273,9.5e-05,0.000207,6.9e-05,7.9e-05,5.7e-05,0.000101,0.000325,0.000276,0.000372,0.000332,0.000358,0.00055,0.000517,0.000892,0.000816,0.000769,0.000697,0.001375,0.001456,0.000849,0.000244,0.000509,0.000372,0.000574,0.001098,0.001018,0.000883,0.000307,0.000536,0.000631,0.000918,0.000682
0.000235,0.000198,0.000298,0.000125,0.000115,9.5e-05,1.1e-05,1.5e-05,1.7e-05,0.000188,0.000173,0.000172,7.2e-05,7.2e-05,5.4e-05,0.000118,8.1e-05,9.6e-05,5.9e-05,5.9e-05,0.000141,0.000179,9.3e-05,0.000172,0.000217,0.000124,7.2e-05,0.000248,0.000184,0.000135,0.000135,0.000221,0.00012,0.000131,0.000141,0.000212,6e-05,7.8e-05,7.5e-05,0.000105,0.000129,7.1e-05,0.000185,7.1e-05,6.8e-05,6.2e-05,0.000168,0.00014,0.00011,7e-05,1.3e-05,5.9e-05,0.000112,5e-05,0.000115,0.000106,0.000104,0.000112,6.9e-05,0.000153,0.000114,0.000101,0.000392,6.6e-05,0.000287,0.000221,0.000167,0.000302,0.000173,0.00011,0.000189,0.000194,8.5e-05,0.000166,0.000207,9.3e-05,7.8e-05,0.000176,0.000166,0.000117,8.1e-05,7.8e-05,7.9e-05,0.000209,2.4e-05,0.000199,0.00012,0.000114,0.000187,2.6e-05,0.000226,8.1e-05,0.000223,0.000309,0.000224,0.000422,0.000577,0.000775,0.001004,0.001222,0.00175,0.002471,0.003047,0.003389,0.003548,0.003796,0.004002,0.003573,0.00252,0.002251,0.002788,0.002603,0.002913,0.003442,0.003255,0.002462,0.001377,0.000596,0.000526,0.00163,0.002163
0.000118,0.000184,8e-05,5.3e-05,0.000119,7.5e-05,0.000101,6.8e-05,5.3e-05,0.000124,0.000112,3.5e-05,4.2e-05,6.4e-05,4.1e-05,9.5e-05,7.7e-05,9.1e-05,9.5e-05,0.000123,3.5e-05,5.9e-05,8.1e-05,0.000172,0.000373,0.000247,2e-05,0.000178,4.7e-05,5.7e-05,7.2e-05,7e-05,0.000155,0.000139,0.000105,0.000132,0.000103,1.1e-05,1e-04,7e-05,2e-05,8.7e-05,2.9e-05,8.7e-05,6.2e-05,4.9e-05,0.000113,9.3e-05,5.9e-05,0.000107,8.3e-05,6e-05,0.00014,7.1e-05,4e-05,5.2e-05,0.000114,7.7e-05,3.4e-05,0.00011,0.000186,0.000301,0.000363,5e-05,7.9e-05,4.9e-05,0.000324,0.000339,5e-05,5.3e-05,7.5e-05,2.1e-05,0.000132,6.4e-05,9.8e-05,0.000237,7.5e-05,5.8e-05,0.000128,0.000123,0.00014,0.000123,0.000233,0.000221,8.7e-05,0.000205,0.000178,0.000185,0.000309,0.000313,0.000244,0.000161,0.000179,0.000119,2.1e-05,0.000384,0.000216,0.000342,0.000643,0.000697,0.000964,0.001338,0.001367,0.001379,0.001457,0.001614,0.001078,0.000706,0.000981,0.001431,0.001399,0.001076,0.001601,0.001179,0.000893,0.000248,0.000404,0.000431,0.000525,0.000989,0.000921
5.6e-05,0.000108,0.000107,1e-05,5.7e-05,0.000105,3.5e-05,8.8e-05,1.6e-05,3.5e-05,8e-06,1e-05,5.2e-05,7.9e-05,1.2e-05,9e-05,2.2e-05,4.3e-05,1.8e-05,4.6e-05,6.8e-05,6.1e-05,9.5e-05,9.7e-05,0.000445,0.000259,0.000191,0.000172,0.00019,6.1e-05,0.000128,0.000132,0.000212,0.000115,0.000111,6.3e-05,4.7e-05,4.9e-05,4.7e-05,0.000118,5.4e-05,0.000111,0.000118,6.1e-05,7.8e-05,6.4e-05,0.000139,6.2e-05,5.6e-05,3.1e-05,7.9e-05,3.5e-05,0.000105,1e-04,2.1e-05,4e-05,3.9e-05,7e-05,5.5e-05,8.7e-05,0.000141,0.000438,0.000229,0.000156,0.000111,0.000155,0.000197,0.000212,7.7e-05,5.2e-05,1.5e-05,4.8e-05,0.000104,6.5e-05,0.000164,0.000189,6.9e-05,8.8e-05,7.2e-05,3.8e-05,2.4e-05,0.000157,0.000208,0.000343,0.000125,0.000215,6.5e-05,8.9e-05,6.8e-05,0.000243,0.000305,0.000289,0.000273,0.000204,0.000113,0.00034,0.00045,0.000476,0.000848,0.001,0.000952,0.001208,0.000983,0.001156,0.001139,0.000879,0.000625,0.000329,6.4e-05,0.000724,0.000562,0.000545,0.000771,0.000967,0.00056,0.000251,0.000263,0.000261,0.00035,0.000489,0.000497
2e-05,3.2e-05,1e-05,3.3e-05,2.7e-05,5.7e-05,4.3e-05,2.6e-05,1.9e-05,2.6e-05,2.5e-05,2.1e-05,4.5e-05,5.4e-05,3.4e-05,1.8e-05,4.4e-05,5.5e-05,3.6e-05,5e-06,4.4e-05,4.1e-05,4.7e-05,8.6e-05,0.000186,0.000119,0.000105,3.2e-05,8.6e-05,8.6e-05,7.9e-05,1.6e-05,0.00013,7.7e-05,4.5e-05,3.4e-05,3.5e-05,1.7e-05,2.2e-05,2.8e-05,3.2e-05,2.7e-05,2e-05,5.8e-05,1.9e-05,3e-05,4.6e-05,6.1e-05,4.6e-05,3e-05,4.8e-05,2.8e-05,4.9e-05,9.4e-05,6.8e-05,1.9e-05,1.9e-05,1.2e-05,3.7e-05,6.4e-05,1.4e-05,0.000164,2.6e-05,5.4e-05,6.8e-05,6.3e-05,1.3e-05,0.000141,7.9e-05,3.4e-05,1.4e-05,4.1e-05,4e-05,1.7e-05,8.6e-05,9.8e-05,3.2e-05,6.9e-05,1.1e-05,1e-05,5.5e-05,0.000106,0.000126,0.000138,3.1e-05,0.000109,4.1e-05,2.5e-05,9.5e-05,7.2e-05,8.6e-05,5.8e-05,7.7e-05,8.8e-05,8.7e-05,0.000135,0.000223,0.000268,0.000288,0.000307,0.000319,0.000274,0.000384,0.000384,0.000251,0.000216,0.000391,0.000171,0.000267,0.000965,0.001086,0.001025,0.001034,0.000756,0.000304,0.000413,0.000523,0.000373,0.000393,0.000474,0.000532
2.5e-05,2.3e-05,2.6e-05,2.3e-05,1.2e-05,2.5e-05,6e-06,2.1e-05,2.4e-05,3e-05,2.6e-05,4.6e-05,9e-06,1.4e-05,2.7e-05,3.8e-05,8.5e-05,7.4e-05,4.2e-05,2.4e-05,7e-06,4.3e-05,7.4e-05,7.9e-05,8.5e-05,9.1e-05,6.7e-05,4.2e-05,8e-05,1.7e-05,5.1e-05,3.6e-05,8.9e-05,6.1e-05,7.6e-05,5.3e-05,3.9e-05,3.3e-05,3.1e-05,2.8e-05,4e-05,4.5e-05,4.1e-05,4.6e-05,8e-06,1.3e-05,2.4e-05,2.9e-05,2.2e-05,3.1e-05,2.5e-05,7e-06,3e-05,6e-05,4.9e-05,1.7e-05,2.7e-05,3.9e-05,4e-05,1.8e-05,9.8e-05,0.000315,9.6e-05,8.4e-05,0.000177,0.000171,2.6e-05,6.8e-05,7e-06,4.5e-05,3e-05,2.4e-05,8.8e-05,2.2e-05,6.9e-05,5.7e-05,9.2e-05,5.1e-05,1.5e-05,2.8e-05,4.5e-05,0.000117,9.7e-05,0.000117,3.7e-05,8.1e-05,9.6e-05,8.9e-05,0.000102,0.000117,0.000187,0.000163,0.000123,0.000164,0.000139,7.1e-05,0.000147,0.000141,0.000143,5.3e-05,0.000103,0.000116,0.000196,5.6e-05,0.000138,0.00022,0.000316,0.000147,0.000338,0.000671,0.000428,0.000444,0.000388,0.000233,0.000213,0.000246,0.000202,2.7e-05,0.000142,0.000119,0.000228
2.4e-05,1.5e-05,2.1e-05,2.3e-05,2.6e-05,1.5e-05,1.8e-05,3.1e-05,1.9e-05,2.5e-05,1.7e-05,5.1e-05,3.3e-05,4.6e-05,2.3e-05,4.6e-05,3.6e-05,4e-05,3.2e-05,1.6e-05,3.7e-05,4.7e-05,4.6e-05,7.5e-05,8.9e-05,5.7e-05,1.1e-05,3.8e-05,4.4e-05,3.1e-05,4.9e-05,4.9e-05,8.1e-05,7.6e-05,4.6e-05,2.1e-05,1.8e-05,9e-06,8e-06,3.3e-05,3.4e-05,1.7e-05,1.5e-05,2.2e-05,3.7e-05,4.3e-05,4e-06,3.5e-05,2.4e-05,2.4e-05,1.7e-05,2.5e-05,1.8e-05,3.2e-05,7e-06,2.2e-05,3.6e-05,5e-06,2.3e-05,2.2e-05,0.000171,0.000369,0.000263,0.000113,0.000184,0.000166,0.000169,3.7e-05,0.000161,0.000122,5.9e-05,2.8e-05,4.1e-05,4.5e-05,6.8e-05,5.1e-05,7.5e-05,0.000102,3.1e-05,3e-05,9.7e-05,9.4e-05,0.000109,1e-04,5.1e-05,1e-04,2.1e-05,9.1e-05,5.4e-05,7.5e-05,0.00014,0.000178,0.000289,0.00036,0.00039,0.000308,0.000256,0.000307,0.000348,0.000334,0.000297,0.000219,0.000218,0.000116,6.8e-05,0.000166,0.000217,0.000212,0.000267,0.000539,0.000411,0.000312,0.000304,0.000172,0.000188,0.000257,0.000204,0.000154,7.5e-05,3.6e-05,0.000133
1.9e-05,8e-06,2.3e-05,3.2e-05,1.3e-05,1.2e-05,1.2e-05,2.5e-05,3.8e-05,2.4e-05,1.3e-05,4.5e-05,3.5e-05,3e-06,2.2e-05,3.7e-05,2.1e-05,2e-05,2.2e-05,1.5e-05,4.1e-05,5.7e-05,3.9e-05,1.7e-05,7.6e-05,0.000104,0.000102,4.1e-05,5.7e-05,4.2e-05,5.4e-05,2.7e-05,8.6e-05,0.000108,5.9e-05,2e-05,1.7e-05,1.4e-05,2.8e-05,3.6e-05,2e-06,2.3e-05,1.5e-05,2.1e-05,2.6e-05,7e-06,2.7e-05,3e-05,2.4e-05,1.3e-05,1.7e-05,3.1e-05,2.7e-05,5e-06,9e-06,1.8e-05,1.9e-05,4.2e-05,2.6e-05,1e-05,0.000138,0.000166,0.000129,0.000132,0.000235,0.000256,0.000212,0.000239,0.00022,9.6e-05,5.2e-05,0.000112,4.6e-05,7.9e-05,9.7e-05,8e-05,6.9e-05,6.9e-05,0.000128,0.000103,0.000109,0.000184,0.00024,6.8e-05,0.000167,0.00012,0.000227,0.000243,0.000302,0.000255,1.2e-05,0.000152,6.9e-05,0.000137,9.4e-05,9.7e-05,6.1e-05,0.000128,0.000135,0.00016,0.000175,3e-05,5.6e-05,5e-05,0.000188,0.000378,0.000319,0.000113,0.000205,0.000544,0.000317,0.000273,7.2e-05,0.000302,0.000353,0.000191,3e-05,0.000178,0.000157,0.000222,0.00021
1.7e-05,2.2e-05,1.2e-05,1.5e-05,1.9e-05,1.2e-05,2.9e-05,1.7e-05,5e-06,2.6e-05,1.9e-05,5.6e-05,6e-06,2.1e-05,2.6e-05,3.4e-05,1.2e-05,2.6e-05,2.4e-05,2.3e-05,8e-06,5.5e-05,5.9e-05,4e-06,5.8e-05,4.6e-05,6.5e-05,3.5e-05,2.4e-05,1.2e-05,4.1e-05,1.9e-05,2.8e-05,3.6e-05,5.2e-05,3.5e-05,2.1e-05,1.4e-05,1.2e-05,2e-05,1.5e-05,2.6e-05,1.5e-05,2.2e-05,1.1e-05,1.1e-05,1.5e-05,2e-05,6e-06,1e-05,4e-06,1.1e-05,2.4e-05,9e-06,1.3e-05,1.4e-05,1.4e-05,3.7e-05,2.3e-05,2.9e-05,5e-05,0.000178,0.000114,7.6e-05,0.000208,0.00027,7.7e-05,0.00023,0.000328,0.000226,0.000139,4.5e-05,0.000158,0.000119,0.000182,6.9e-05,0.000132,0.000122,5.3e-05,5.5e-05,5.2e-05,1e-04,4.5e-05,0.000149,0.000112,0.00013,0.000204,0.000153,0.000184,0.000133,0.000211,0.000266,0.000159,0.000109,4.2e-05,6.3e-05,0.000137,6e-05,0.000104,9.7e-05,4.1e-05,0.000138,8.7e-05,0.000155,0.000108,0.00026,0.000278,0.000122,0.000178,0.000395,0.000241,0.00017,0.000137,0.000195,0.000369,0.000146,5.5e-05,0.000145,7.9e-05,0.000206,0.000136
4e-05,6e-06,8e-06,7e-06,1.9e-05,1.2e-05,2.4e-05,3.7e-05,9e-06,1.4e-05,1e-06,4.6e-05,3.9e-05,1.8e-05,1.7e-05,1.3e-05,4.5e-05,2.1e-05,1.8e-05,1.3e-05,3.5e-05,5.3e-05,2.1e-05,8e-06,5e-06,2.8e-05,4e-05,4.7e-05,1.6e-05,3e-06,5.4e-05,3.5e-05,4e-05,4.2e-05,5e-05,2.9e-05,1.2e-05,1.2e-05,1.4e-05,3.3e-05,1.5e-05,1.6e-05,1.5e-05,2.1e-05,6e-06,2.1e-05,1.5e-05,1.8e-05,1.1e-05,1.5e-05,9e-06,2.5e-05,1.1e-05,2.7e-05,1.7e-05,9e-06,1.4e-05,4.1e-05,2e-05,3.9e-05,2.4e-05,0.000267,0.000264,0.000113,0.000336,0.000215,0.000145,0.000281,0.000189,3.4e-05,5.7e-05,6.5e-05,0.000219,0.000122,0.000269,0.000169,3.1e-05,5.4e-05,5.4e-05,8.6e-05,1.6e-05,8.1e-05,0.000134,0.000124,0.00012,0.000234,0.000264,0.000136,0.000183,3.1e-05,0.000139,0.000138,0.000132,8.8e-05,0.000144,0.000231,0.000374,0.00033,0.000385,0.000437,0.000357,0.000303,0.000302,0.000276,0.000147,0.000242,0.000472,0.000285,1e-04,0.000431,0.000297,0.000143,0.000102,0.000328,0.000384,0.000178,0.000184,0.000181,0.000158,0.000222,0.000225
3.3e-05,1.4e-05,1e-05,7e-06,1.1e-05,1.9e-05,1.5e-05,1.9e-05,1.5e-05,8e-06,6e-06,1.9e-05,2.2e-05,2.4e-05,1.7e-05,1.4e-05,3.6e-05,3.7e-05,2e-05,1.8e-05,3.6e-05,5.8e-05,4.8e-05,2e-05,6.3e-05,2.8e-05,4.4e-05,4.6e-05,3e-05,8e-06,2.7e-05,2.2e-05,4.9e-05,5.2e-05,4.4e-05,1.7e-05,1.1e-05,2.1e-05,9e-06,2e-05,1.8e-05,1.2e-05,1.3e-05,2.3e-05,1.3e-05,2.1e-05,2.5e-05,6e-06,4e-06,2.2e-05,0,2.4e-05,1.1e-05,4e-06,6e-06,1.4e-05,1.1e-05,1.1e-05,1.5e-05,4.9e-05,8.2e-05,0.000177,0.00014,8.6e-05,0.000252,0.000126,3.3e-05,0.000128,0.000159,0.000114,9.6e-05,5.1e-05,0.000215,0.000237,8.2e-05,7.9e-05,4.8e-05,4.1e-05,9.8e-05,1.8e-05,6.2e-05,8.5e-05,8.5e-05,7.6e-05,3.4e-05,8.2e-05,5.6e-05,0.000135,0.000124,2e-04,0.000127,9.9e-05,6.9e-05,9.1e-05,0.000132,0.000168,0.000173,0.000123,0.000214,0.000218,0.000158,0.000139,0.000245,0.000197,0.000304,0.000447,0.000245,0.000196,0.000378,0.000295,0.000107,4.6e-05,0.000315,0.000285,1e-04,0.000121,0.00024,0.000182,0.000172,0.000214,0.000192
2.6e-05,1.3e-05,1.4e-05,1.6e-05,1.3e-05,1.6e-05,1.5e-05,1.7e-05,1.3e-05,3e-06,1.7e-05,3.3e-05,1e-05,6e-06,3.1e-05,2.5e-05,1.1e-05,2e-05,1.2e-05,1e-05,2.4e-05,3.3e-05,5.2e-05,5e-06,8.8e-05,0.000129,0.00012,3.2e-05,1.7e-05,2.5e-05,7e-06,3.5e-05,6.2e-05,3.6e-05,4.5e-05,2.5e-05,3e-06,1.9e-05,2.1e-05,1.5e-05,1.2e-05,4e-06,2.5e-05,1.9e-05,2.3e-05,1.5e-05,3.2e-05,2.4e-05,1.2e-05,2e-05,2.6e-05,2.7e-05,1.5e-05,1.5e-05,1.6e-05,2e-05,9e-06,9e-06,1e-05,5.8e-05,6.4e-05,8.8e-05,9e-05,0.00017,0.000156,8.6e-05,9e-06,5.9e-05,0.00029,0.000246,0.000269,0.000155,7.5e-05,6e-05,6.3e-05,8.2e-05,7.4e-05,7.1e-05,0.000111,7.9e-05,2.5e-05,7.3e-05,5.3e-05,0.000106,7.9e-05,3.4e-05,5e-05,4.5e-05,6.2e-05,8.2e-05,4.8e-05,0.000173,0.000187,0.000237,0.000256,0.000246,0.000208,0.000107,0.00015,0.000267,0.000184,0.000188,0.000175,0.000213,0.000287,0.000259,0.000127,0.000231,0.000237,0.000184,0.000185,0.000124,2e-04,0.000129,0.000143,7.7e-05,0.000144,0.000158,9.8e-05,0.000124,0.000135
2.4e-05,1.7e-05,2e-05,2.2e-05,2.5e-05,1.4e-05,1.8e-05,3e-05,1.2e-05,4e-06,2.2e-05,3.8e-05,2.4e-05,2.5e-05,6e-06,8e-06,1.5e-05,1.6e-05,1.6e-05,1.4e-05,2.8e-05,4.2e-05,5.2e-05,1.8e-05,6.5e-05,9.2e-05,2.8e-05,2.1e-05,2.5e-05,1e-06,4e-05,2.2e-05,5.9e-05,4.9e-05,3.4e-05,1.5e-05,1.9e-05,1e-06,2e-05,3e-05,1.3e-05,4e-06,2.2e-05,3.7e-05,2.7e-05,2.5e-05,8e-06,1.1e-05,1e-05,1.1e-05,3.1e-05,2.1e-05,4e-06,1.3e-05,1.2e-05,1.5e-05,7e-06,1e-05,1.3e-05,4.3e-05,2.2e-05,0.000127,0.000237,2.4e-05,7.8e-05,7.8e-05,7.7e-05,3.8e-05,0.000274,6e-05,0.000124,3e-05,2.2e-05,1.4e-05,0.000112,6e-05,7.1e-05,3.9e-05,0.000103,4.6e-05,3.5e-05,5.1e-05,8.3e-05,3.8e-05,6.5e-05,0.000135,9.9e-05,7e-05,0.000116,8.1e-05,6.6e-05,0.000112,2e-05,0.000128,0.000192,0.000185,0.000169,0.000155,0.000158,0.000169,0.000322,0.000435,0.00041,0.000448,0.000463,0.000257,6.3e-05,0.000178,9e-05,0.000568,0.000517,0.000323,8.1e-05,0.000407,0.000441,0.000188,0.000439,0.000406,4e-04,0.000358,0.000397
2.9e-05,1.4e-05,8e-06,1.4e-05,1e-05,9e-06,6e-06,1.5e-05,9e-06,1e-05,1.7e-05,2.4e-05,1.4e-05,2.1e-05,2.1e-05,8e-06,2.5e-05,1.1e-05,2.3e-05,1.2e-05,1.6e-05,3.8e-05,6.1e-05,6e-06,5.6e-05,3.2e-05,1.7e-05,1.9e-05,2.4e-05,2.4e-05,4.1e-05,3.2e-05,4.5e-05,3.6e-05,4e-05,2.2e-05,7e-06,3e-06,1.7e-05,2e-06,1.8e-05,1.3e-05,4e-06,1.8e-05,1.7e-05,1.8e-05,8e-06,9e-06,7e-06,8e-06,2.1e-05,2.1e-05,1.8e-05,8e-06,1.8e-05,6e-06,1e-05,1.7e-05,1.9e-05,2.3e-05,2e-05,0.000117,0.00012,3.4e-05,0.000149,5.9e-05,4.3e-05,6.6e-05,0.000129,0.00012,1.9e-05,6.6e-05,2.5e-05,3.8e-05,9.8e-05,4e-05,6.7e-05,4.2e-05,2.3e-05,8.1e-05,2.3e-05,8.5e-05,1.3e-05,3.6e-05,2.7e-05,3.5e-05,2.9e-05,4.6e-05,6.4e-05,7e-06,1.5e-05,5.5e-05,5.3e-05,7.7e-05,4.5e-05,7e-05,7e-05,2.6e-05,6e-05,6.5e-05,0.000119,0.000144,5.1e-05,0.000103,0.000154,0.000154,0.000189,6e-05,3e-04,0.000438,0.000134,0.000118,0.000309,0.000318,0.000161,0.000287,0.000323,0.000195,0.000165,0.000181,0.000145
3.3e-05,7e-06,9e-06,2.1e-05,8e-06,1e-05,1.9e-05,3e-06,9e-06,2.8e-05,2e-05,5.1e-05,2.9e-05,1e-05,4.2e-05,2.3e-05,1.7e-05,4e-06,2.8e-05,1e-05,2.5e-05,4e-05,4.1e-05,2.1e-05,6.2e-05,2.6e-05,5.8e-05,9e-06,7e-06,7e-06,4.8e-05,1.6e-05,4.2e-05,5.6e-05,2.9e-05,4e-05,6e-06,1.4e-05,6e-06,5e-06,5e-06,1.5e-05,1.8e-05,1.4e-05,1.4e-05,2.2e-05,1.2e-05,1.4e-05,3e-06,3e-06,2.5e-05,1.2e-05,1.9e-05,9e-06,1.4e-05,3e-06,1.3e-05,3.1e-05,4e-06,2.9e-05,3.5e-05,6.8e-05,0.000195,4.5e-05,0.000108,7e-05,3.2e-05,6.2e-05,0.000126,0.000134,1e-04,5.6e-05,6.7e-05,2e-05,6e-05,9.2e-05,1.5e-05,2.1e-05,1.8e-05,9.7e-05,5.8e-05,7e-05,3.1e-05,3.8e-05,3.2e-05,7.8e-05,4.3e-05,6.8e-05,5.2e-05,3.1e-05,2.8e-05,1.7e-05,3.6e-05,7.9e-05,6.9e-05,0.000106,7.1e-05,6e-05,3e-05,7.4e-05,0.000139,0.000119,7.4e-05,4.6e-05,0.000184,0.000142,0.000173,0.000125,0.000211,0.000337,0.000105,1.4e-05,0.000253,0.000339,0.000102,0.000192,0.000241,5.7e-05,0.000108,5.1e-05,8.7e-05
2.6e-05,1.6e-05,1.4e-05,2.1e-05,5e-06,9e-06,3.3e-05,2.9e-05,1.6e-05,2.5e-05,9e-06,4.9e-05,7.2e-05,4.2e-05,5.4e-05,2e-05,3e-06,1.2e-05,3.8e-05,1.5e-05,2.2e-05,4.1e-05,2.4e-05,1.5e-05,7e-05,4.9e-05,1.7e-05,3.2e-05,1.8e-05,1e-05,2.3e-05,1.8e-05,5.8e-05,6.6e-05,4.8e-05,1.8e-05,1.1e-05,4e-06,1.2e-05,1.8e-05,2.2e-05,2.3e-05,2.4e-05,4.1e-05,2.1e-05,1.8e-05,1.8e-05,1.2e-05,6e-06,1.3e-05,9e-06,9e-06,9e-06,2.7e-05,1.6e-05,9e-06,1.6e-05,7e-06,1.4e-05,3e-05,3.4e-05,6.4e-05,0.000145,8.7e-05,0.000154,0.000139,3.4e-05,7.8e-05,0.000115,2.9e-05,6e-06,2.4e-05,4.5e-05,2.8e-05,0.000142,7.3e-05,3.1e-05,3.6e-05,3.7e-05,5.5e-05,4.6e-05,7.7e-05,5e-05,7.5e-05,2.5e-05,5.1e-05,8e-05,6.6e-05,0.000148,8.7e-05,3.3e-05,5.9e-05,5.9e-05,8e-05,3.6e-05,3.4e-05,4.6e-05,1e-04,0.000133,0.000154,0.000163,0.000102,6.1e-05,0.00012,8.8e-05,0.000268,0.000311,0.000115,0.000352,0.000433,8e-05,6e-05,0.000364,0.000413,0.000163,0.000429,0.000335,0.000207,0.000171,0.000132,7.2e-05
1.2e-05,2.3e-05,2.1e-05,2.7e-05,2e-05,2.8e-05,3.8e-05,5.2e-05,9e-06,2.2e-05,2.6e-05,1.1e-05,4.1e-05,4.1e-05,5.7e-05,4.4e-05,8e-06,1.3e-05,3.7e-05,1.8e-05,1.7e-05,5.5e-05,3.5e-05,2.9e-05,8.7e-05,0.000159,8.8e-05,1.7e-05,2.7e-05,1.4e-05,4.1e-05,1e-05,5.7e-05,4.2e-05,3.7e-05,2.8e-05,1.1e-05,9e-06,1.5e-05,1.8e-05,7e-06,1.5e-05,1.2e-05,2.4e-05,1e-05,1.2e-05,6e-06,1.6e-05,1.2e-05,1.7e-05,1e-06,2.2e-05,1.6e-05,2.7e-05,3.4e-05,9e-06,1.6e-05,9e-06,1e-05,2.4e-05,1.2e-05,2.3e-05,0.000158,6.9e-05,0.00016,9e-05,6.9e-05,0.000138,9.6e-05,4.3e-05,1.2e-05,2.5e-05,2.5e-05,3.7e-05,8.7e-05,8.4e-05,2.1e-05,7.3e-05,1.5e-05,3.5e-05,5.9e-05,4.5e-05,3.2e-05,3.8e-05,4.4e-05,7.8e-05,2.6e-05,6.3e-05,7.3e-05,6.2e-05,0.000132,0.000161,0.000202,0.000119,6.9e-05,3.7e-05,9e-05,8.3e-05,0.00011,0.00011,0.000174,5.7e-05,5.7e-05,9.8e-05,3.9e-05,0.000241,0.000128,0.000137,0.000239,0.000267,1e-04,2.9e-05,0.000279,0.000292,0.00013,0.000183,8.8e-05,6.4e-05,1.2e-05,4.2e-05,2.3e-05
5e-06,2.9e-05,1.3e-05,1.6e-05,7e-06,2e-05,2.6e-05,9e-05,6.9e-05,7.4e-05,3.6e-05,5.1e-05,5.9e-05,4.8e-05,4.8e-05,2.8e-05,3.7e-05,2.7e-05,3.9e-05,4.4e-05,2e-05,8.5e-05,4.6e-05,4.7e-05,5.9e-05,0.000123,7.5e-05,3.1e-05,2.7e-05,2.5e-05,3e-05,2.9e-05,3.5e-05,6e-05,3.8e-05,3e-05,8e-06,9e-06,1.4e-05,3.5e-05,1.2e-05,3.1e-05,1.9e-05,6e-06,1.3e-05,8e-06,1.4e-05,1.3e-05,6e-06,9e-06,1.3e-05,1.8e-05,9e-06,1.5e-05,1.6e-05,1.8e-05,4e-06,1.5e-05,1.6e-05,1.3e-05,1.5e-05,3.8e-05,0.000137,9e-05,0.000108,0.00013,1e-04,4.2e-05,0.000122,9e-05,7.3e-05,7e-05,6.9e-05,5.4e-05,8e-05,6e-05,2.9e-05,4.8e-05,4.2e-05,2.8e-05,2.7e-05,2.5e-05,4.2e-05,9.8e-05,7.9e-05,8.8e-05,8.7e-05,0.000106,0.000133,0.000106,9.8e-05,7.7e-05,0.000145,0.000142,0.000179,0.000123,0.000199,0.000251,0.000273,0.000233,0.000223,0.000237,0.000273,0.000256,0.000294,0.000256,0.000146,0.000276,0.000252,0.000273,7.6e-05,1.9e-05,0.000241,0.000295,6.2e-05,0.000126,5.1e-05,5.3e-05,2.4e-05,5.4e-05,4.8e-05
2.5e-05,2.2e-05,3e-06,1e-05,5e-06,1.2e-05,3.8e-05,3.9e-05,3.9e-05,2.5e-05,1.9e-05,3.1e-05,1.6e-05,1.3e-05,1.3e-05,3.5e-05,3.4e-05,1.6e-05,4e-06,2e-05,1.9e-05,5e-05,6e-05,9e-06,5.7e-05,1.3e-05,3.8e-05,3.9e-05,1.3e-05,1.2e-05,2e-05,2.9e-05,2.6e-05,3.9e-05,4.3e-05,2.6e-05,8e-06,4e-06,7e-06,1.5e-05,2.7e-05,1.6e-05,2.8e-05,2.7e-05,3e-06,1.3e-05,1.1e-05,1.3e-05,3e-06,5e-06,1e-06,1.1e-05,8e-06,1.7e-05,2.5e-05,1.7e-05,1.5e-05,1.8e-05,5e-06,2.9e-05,4.8e-05,4.5e-05,8.6e-05,9.4e-05,0.000129,0.00013,2.8e-05,5.3e-05,0.000102,1.4e-05,3.6e-05,4.8e-05,4.8e-05,7.4e-05,8.6e-05,4.8e-05,1.8e-05,1.3e-05,6e-05,4.3e-05,4.8e-05,5.3e-05,5.4e-05,0.000117,3.7e-05,8.6e-05,4.2e-05,4.4e-05,0.000168,0.000152,0.000146,0.00013,9.7e-05,1.9e-05,9.4e-05,9e-05,0.000108,0.000119,9.1e-05,2.7e-05,9.4e-05,0.000227,0.000194,0.000243,0.000178,0.000106,3e-04,0.000175,0.000318,0.000363,7.2e-05,0.000114,0.000372,0.000165,0.000187,0.000226,6e-05,7.1e-05,6.5e-05,9.7e-05,0.000139
1.7e-05,1.8e-05,1.1e-05,1.3e-05,2e-05,6e-06,2.4e-05,4.5e-05,1.3e-05,2.6e-05,1.4e-05,1.6e-05,2.1e-05,2.4e-05,1.9e-05,6e-06,1.4e-05,1.8e-05,2.1e-05,3e-06,2e-05,3.3e-05,4.5e-05,6e-06,2.6e-05,1.9e-05,5.6e-05,2.5e-05,2e-06,7e-06,3.6e-05,3.7e-05,2.8e-05,5.4e-05,3.5e-05,1.7e-05,2e-06,2e-06,3e-06,6e-06,1.9e-05,1.5e-05,1e-06,1.7e-05,1.8e-05,1.1e-05,1.6e-05,7e-06,1.1e-05,3e-06,1.3e-05,1.2e-05,5e-06,1.8e-05,1.7e-05,1.5e-05,1.3e-05,2.8e-05,1.4e-05,3.3e-05,4.9e-05,2.4e-05,0.000112,4.6e-05,0.000134,0.000117,8.6e-05,7.2e-05,4.6e-05,3e-06,3.1e-05,1.4e-05,2.2e-05,6.5e-05,7e-05,6.6e-05,1.9e-05,2.5e-05,1.9e-05,2.6e-05,3.7e-05,2.2e-05,1e-05,8.1e-05,3.6e-05,3.3e-05,3.1e-05,6e-05,0.000101,1.5e-05,5.1e-05,0.000126,0.000189,0.000176,0.000134,9.2e-05,0.000116,0.000133,0.000148,8.1e-05,0.000117,0.000172,0.000118,0.000102,0.000124,0.000184,0.000177,3.9e-05,0.000277,0.000224,0.000108,7.1e-05,0.000211,0.000197,0.000193,0.00021,0.000109,3.1e-05,4e-05,3.2e-05,4.1e-05
2e-05,1.3e-05,6e-06,1.3e-05,1.6e-05,1e-05,9e-06,2.4e-05,2.5e-05,1.1e-05,8e-06,1.1e-05,2.3e-05,9e-06,1.8e-05,5e-06,1e-05,9e-06,1.4e-05,2e-05,1.1e-05,3.3e-05,4.8e-05,1e-06,5e-06,4.4e-05,3.2e-05,2.9e-05,7e-06,3e-06,3.8e-05,2.7e-05,3.9e-05,4.2e-05,4.4e-05,1.1e-05,6e-06,3e-06,3e-06,7e-06,8e-06,3e-06,5e-06,1.3e-05,1.5e-05,1.3e-05,1.1e-05,2e-06,5e-06,9e-06,1.2e-05,1.8e-05,3e-06,9e-06,4e-06,1e-05,6e-06,1.7e-05,2e-06,2.9e-05,4e-05,2.9e-05,7.9e-05,2.2e-05,0.000148,7.1e-05,4.9e-05,8.6e-05,6.5e-05,3.6e-05,3.2e-05,4.7e-05,4.6e-05,5.3e-05,8.3e-05,8.1e-05,1.9e-05,1.8e-05,3e-06,2.2e-05,1.4e-05,1.9e-05,1.4e-05,6.7e-05,2e-05,3.5e-05,3.8e-05,3.2e-05,0.000102,4.7e-05,1e-05,4.6e-05,6.3e-05,8.1e-05,0.000119,0.000205,0.000206,0.000197,0.000204,0.000193,0.000339,0.000373,0.000291,0.000262,0.00016,0.000174,0.000279,0.000128,0.000263,0.000203,0.000166,0.000101,0.000206,0.000129,0.00016,0.000254,0.000118,6.3e-05,7.2e-05,6.1e-05,7e-05
2.2e-05,1.6e-05,4e-06,1.1e-05,6e-06,5e-06,1e-05,1.6e-05,1.5e-05,3e-06,6e-06,8e-06,1.6e-05,1.6e-05,1.7e-05,4e-06,6e-06,7e-06,6e-06,1.1e-05,1.9e-05,3.2e-05,4.4e-05,1.1e-05,1.6e-05,3.2e-05,3.5e-05,3.2e-05,1e-06,4e-06,3.3e-05,2.7e-05,4.3e-05,4.3e-05,4.5e-05,2e-05,2e-06,5e-06,3e-06,5e-06,9e-06,6e-06,8e-06,1.9e-05,1.2e-05,1e-05,1.2e-05,3e-06,1e-06,1e-05,6e-06,1.5e-05,9e-06,7e-06,1e-06,7e-06,0,1.2e-05,2e-06,3.1e-05,3.2e-05,5e-05,8.1e-05,1.2e-05,0.000114,7e-05,3.4e-05,6.8e-05,7.2e-05,2e-05,2.9e-05,3.1e-05,3.8e-05,5.7e-05,8.3e-05,5.4e-05,6e-06,1.6e-05,2.2e-05,1.3e-05,2.2e-05,1.3e-05,3.2e-05,7.4e-05,8e-06,3.6e-05,2.8e-05,1.4e-05,5e-05,2.1e-05,4.1e-05,5.8e-05,1.2e-05,6.2e-05,4.1e-05,0.00011,4.7e-05,5.3e-05,4.2e-05,0.00011,0.000162,9.3e-05,4.7e-05,5.8e-05,6.2e-05,0.000263,0.000167,0.00011,0.000191,0.000303,7.3e-05,4.5e-05,0.000205,0.000149,0.000187,0.000139,5.7e-05,5.1e-05,2e-05,2.4e-05,5.4e-05
2.1e-05,1.4e-05,6e-06,5e-06,6e-06,4e-06,8e-06,1e-05,1.5e-05,5e-06,4e-06,7e-06,1.8e-05,1.5e-05,1.5e-05,2e-06,6e-06,2e-06,4e-06,1.1e-05,1.9e-05,3.1e-05,4.2e-05,1e-05,7e-06,3.1e-05,3.5e-05,2.6e-05,1e-06,8e-06,3.3e-05,2.6e-05,4e-05,4e-05,4.4e-05,1.9e-05,1e-06,2e-06,1e-06,7e-06,8e-06,5e-06,8e-06,1.9e-05,1e-05,9e-06,1.2e-05,1e-06,1e-06,1.1e-05,5e-06,1.5e-05,8e-06,2e-06,3e-06,5e-06,1e-06,1.2e-05,1e-06,2.7e-05,2.5e-05,4.3e-05,7.2e-05,1.9e-05,0.000107,7.4e-05,4e-05,6.4e-05,6.8e-05,1.7e-05,2.1e-05,3.5e-05,3.4e-05,5.8e-05,8.3e-05,5.6e-05,8e-06,1.5e-05,1.4e-05,1.8e-05,2.2e-05,5e-06,2.7e-05,7.6e-05,9e-06,3.2e-05,2.2e-05,1.2e-05,5.2e-05,1.7e-05,2.6e-05,3.2e-05,7e-06,3.2e-05,4e-05,6.7e-05,3.9e-05,2e-05,2.8e-05,0.000105,0.000111,7e-05,2.9e-05,3.3e-05,6.8e-05,0.000217,0.000199,0.000106,0.000245,0.000286,0.000112,4.8e-05,0.000197,0.000149,0.000171,0.000147,7.3e-05,2.1e-05,3e-06,2.1e-05,7e-06
2.1e-05,1.3e-05,3e-06,5e-06,6e-06,4e-06,7e-06,1e-05,1.3e-05,3e-06,3e-06,4e-06,1.6e-05,1.6e-05,1.6e-05,2e-06,7e-06,2e-06,1e-06,1.1e-05,1.7e-05,3.2e-05,3.9e-05,8e-06,1e-05,3.3e-05,3.3e-05,2.7e-05,3e-06,7e-06,3.1e-05,2.5e-05,4e-05,4e-05,4.2e-05,2e-05,2e-06,3e-06,1e-06,7e-06,6e-06,6e-06,8e-06,1.8e-05,1e-05,1.1e-05,1.3e-05,2e-06,1e-06,1.1e-05,5e-06,1.4e-05,7e-06,1e-06,2e-06,5e-06,0,1.2e-05,3e-06,2.8e-05,2.3e-05,4e-05,7.2e-05,1.3e-05,0.00011,7e-05,3.8e-05,6.2e-05,6.2e-05,1.2e-05,2.7e-05,3.5e-05,3.3e-05,5.1e-05,7.5e-05,5.6e-05,4e-06,2.1e-05,1.5e-05,2.2e-05,2.6e-05,1e-06,2.4e-05,7.5e-05,8e-06,3.6e-05,1.9e-05,1e-05,4.8e-05,9e-06,2.5e-05,2.3e-05,7e-06,1.4e-05,2.4e-05,5.2e-05,4e-05,1e-05,1.8e-05,8.1e-05,7e-05,7.1e-05,1.5e-05,2.4e-05,8.4e-05,0.000191,0.000181,0.000108,0.000233,0.000261,0.000108,6.4e-05,0.000196,0.000153,0.000168,0.000135,9.2e-05,3.6e-05,5e-06,1.6e-05,1.6e-05
