0.025713,0.029043,0.035482,0.043679,0.05004,0.047014,0.103139,0.355842,0.410763,0.184711,0.075831,0.117961,0.147799,0.085356,0.06862,0.135672,0.139806,0.081079,0.065681,0.103512,0.164176,0.115662,0.133619,0.32271,0.289645,0.149067,0.18981,0.149739
0.032105,0.037292,0.045994,0.055927,0.06214,0.057243,0.120185,0.406846,0.474387,0.221762,0.093587,0.139093,0.175847,0.105952,0.08568,0.158671,0.160959,0.094439,0.077955,0.129663,0.207395,0.144246,0.154867,0.369288,0.334726,0.180626,0.227813,0.175775
0.043753,0.052651,0.065079,0.076878,0.081544,0.073805,0.144495,0.465506,0.551282,0.275885,0.122039,0.170865,0.218538,0.139609,0.113593,0.189175,0.186855,0.112491,0.096412,0.172071,0.275712,0.189077,0.18443,0.4283,0.395526,0.229313,0.281983,0.209967
0.055398,0.066676,0.080496,0.091275,0.092729,0.084341,0.151317,0.445529,0.535004,0.29068,0.138007,0.183174,0.233363,0.157644,0.13188,0.200469,0.192006,0.117629,0.107043,0.199916,0.311819,0.21155,0.193043,0.431967,0.407441,0.250455,0.293798,0.212067
0.062431,0.072388,0.08458,0.091897,0.090693,0.086385,0.148602,0.385373,0.454299,0.261366,0.13934,0.188127,0.229008,0.154246,0.135207,0.203459,0.191022,0.115827,0.12012,0.222193,0.314402,0.20739,0.195776,0.421257,0.395362,0.241632,0.269898,0.193481
0.061284,0.069027,0.078353,0.082612,0.083302,0.090436,0.168687,0.411162,0.447376,0.237045,0.141619,0.209813,0.238959,0.148033,0.128989,0.193632,0.181108,0.120554,0.160662,0.28593,0.349579,0.215691,0.243557,0.533185,0.477532,0.253388,0.27257,0.200242
0.060978,0.071222,0.076963,0.079451,0.09044,0.123011,0.244433,0.584004,0.599621,0.279344,0.170948,0.264222,0.291202,0.172028,0.141574,0.186716,0.169342,0.133733,0.230193,0.43709,0.50604,0.289335,0.353048,0.793204,0.681493,0.319877,0.341589,0.256133
0.082816,0.096534,0.095416,0.093221,0.116028,0.186711,0.365851,0.850988,0.862829,0.383441,0.233571,0.373428,0.410165,0.238613,0.188535,0.2175,0.189427,0.160952,0.319243,0.651946,0.74858,0.410453,0.501277,1.141164,0.971385,0.446477,0.482728,0.357876
0.116495,0.133026,0.128848,0.121382,0.155602,0.270676,0.527583,1.240602,1.241161,0.511113,0.302286,0.504677,0.551495,0.308799,0.238609,0.266906,0.231732,0.193417,0.404076,0.866494,0.983442,0.51831,0.635712,1.474737,1.259859,0.586729,0.651609,0.477686
0.139803,0.157387,0.156966,0.149667,0.195408,0.343638,0.682992,1.684792,1.658478,0.615602,0.350015,0.598362,0.638594,0.331945,0.249667,0.286853,0.256783,0.215228,0.466914,1.023689,1.126665,0.563342,0.738413,1.757775,1.485188,0.670109,0.760799,0.556813
0.135741,0.151772,0.160573,0.160341,0.209891,0.357873,0.743273,1.9615,1.919268,0.659882,0.361268,0.621975,0.639919,0.293422,0.212842,0.270498,0.258716,0.223048,0.491317,1.073622,1.130011,0.533114,0.762218,1.835573,1.52716,0.673588,0.784406,0.570158
0.113673,0.127372,0.137121,0.14294,0.188957,0.30532,0.659103,1.830155,1.800777,0.615148,0.335283,0.624823,0.642715,0.247908,0.159808,0.2511,0.26055,0.219015,0.464225,0.988348,0.996677,0.451828,0.665285,1.581763,1.312029,0.620962,0.806819,0.594218
0.091389,0.103946,0.104075,0.107543,0.149757,0.232838,0.480225,1.317352,1.331266,0.506843,0.286238,0.618271,0.660204,0.223698,0.124196,0.240712,0.259368,0.200101,0.382885,0.793109,0.797447,0.364171,0.493799,1.150828,0.965811,0.516876,0.790505,0.606656
0.062849,0.073381,0.074394,0.080749,0.115284,0.17082,0.307295,0.790047,0.843363,0.384735,0.232649,0.560987,0.615188,0.203233,0.11508,0.242147,0.250491,0.175036,0.29678,0.57277,0.590269,0.282924,0.346705,0.819295,0.705513,0.413327,0.70082,0.55424
0.038124,0.047616,0.056477,0.067508,0.08573,0.117907,0.213313,0.529516,0.590899,0.297841,0.18464,0.485137,0.545117,0.195013,0.128306,0.254361,0.245855,0.160984,0.253589,0.444904,0.4622,0.234474,0.289247,0.715739,0.663143,0.401388,0.628754,0.497389
0.033064,0.044819,0.057207,0.066765,0.071935,0.095862,0.224541,0.625044,0.706649,0.33723,0.174892,0.444357,0.519244,0.209818,0.151444,0.300575,0.298017,0.174602,0.224905,0.375109,0.389746,0.222817,0.380887,0.940689,0.896493,0.485064,0.628197,0.506727
0.038234,0.053277,0.065358,0.068862,0.074221,0.107324,0.313103,0.989405,1.113235,0.493542,0.212899,0.46724,0.568578,0.249114,0.188078,0.42096,0.444698,0.237248,0.225478,0.32521,0.322868,0.226334,0.569818,1.404658,1.321447,0.628138,0.716339,0.597321
0.045387,0.062448,0.072687,0.071667,0.081027,0.123354,0.427522,1.472093,1.623826,0.669058,0.271524,0.543016,0.663849,0.293251,0.23692,0.634581,0.69465,0.332101,0.253691,0.307592,0.283162,0.240297,0.768902,1.930368,1.783033,0.78997,0.884571,0.7369
0.050533,0.06703,0.074646,0.074436,0.087659,0.130029,0.538364,1.958403,2.083493,0.786593,0.317978,0.572147,0.690739,0.312395,0.276539,0.872927,0.979794,0.417148,0.266096,0.30191,0.284923,0.259354,0.910193,2.404665,2.184041,0.878222,0.941311,0.771248
0.050515,0.065556,0.070498,0.071073,0.08697,0.123762,0.609739,2.283318,2.344231,0.820992,0.347905,0.601506,0.702842,0.313218,0.28885,1.037415,1.190055,0.455687,0.235756,0.293732,0.320941,0.269405,0.958247,2.682856,2.394226,0.852518,0.842517,0.682113
0.046139,0.057906,0.062022,0.061313,0.078004,0.10529,0.597718,2.319419,2.397603,0.862487,0.377482,0.695435,0.803804,0.324648,0.260149,1.025557,1.206166,0.438211,0.185899,0.271508,0.342599,0.260367,0.8843,2.599696,2.364662,0.834165,0.793222,0.644306
0.044501,0.052305,0.056844,0.056156,0.068472,0.082895,0.502871,1.998757,2.171065,0.888163,0.393527,0.783007,0.903818,0.326312,0.199799,0.819344,0.974578,0.351099,0.144321,0.236067,0.330751,0.250876,0.711359,2.134247,2.047775,0.821748,0.836975,0.67945
0.047234,0.052804,0.059101,0.058809,0.062724,0.063578,0.35885,1.405956,1.650161,0.809779,0.370917,0.800346,0.917084,0.299979,0.147808,0.574925,0.659126,0.233585,0.10584,0.188028,0.285226,0.219247,0.512312,1.510754,1.53132,0.753681,0.893184,0.718389
0.049562,0.052991,0.060581,0.063068,0.060201,0.053741,0.234606,0.826771,1.058004,0.629157,0.312003,0.76587,0.880265,0.274245,0.122175,0.415537,0.438955,0.152682,0.089651,0.164035,0.247786,0.192685,0.404574,1.117456,1.118102,0.612216,0.857233,0.691823
0.04834,0.049091,0.055913,0.060917,0.058255,0.051356,0.159712,0.474372,0.633851,0.41775,0.229848,0.662708,0.764497,0.241511,0.11521,0.349528,0.354198,0.125181,0.085232,0.159058,0.234811,0.192987,0.357062,0.918841,0.907992,0.504742,0.731092,0.592518
0.050344,0.048611,0.051377,0.05668,0.056291,0.04788,0.128503,0.371034,0.46982,0.277226,0.156786,0.500758,0.574624,0.189946,0.111906,0.291276,0.280057,0.10901,0.089827,0.160488,0.236806,0.203045,0.319172,0.742691,0.716038,0.40028,0.549469,0.440009
0.051485,0.049681,0.050039,0.056932,0.058292,0.045664,0.104925,0.300082,0.377469,0.214769,0.118242,0.336751,0.375363,0.135351,0.108084,0.251681,0.227933,0.102764,0.111901,0.168086,0.241937,0.218314,0.279569,0.572263,0.537423,0.293915,0.350244,0.27914
0.046317,0.045971,0.048572,0.058099,0.056269,0.041755,0.091187,0.247467,0.313567,0.183987,0.100296,0.229365,0.246524,0.102266,0.106536,0.278695,0.266531,0.126813,0.140617,0.192674,0.264237,0.23954,0.235576,0.415358,0.411345,0.220536,0.193928,0.168109
0.047105,0.045293,0.049123,0.059403,0.054057,0.039668,0.078197,0.203099,0.273663,0.182272,0.098854,0.186587,0.199176,0.090085,0.112659,0.340287,0.349449,0.165235,0.164801,0.228914,0.296786,0.255973,0.199463,0.30752,0.326999,0.167389,0.120376,0.132491
0.059285,0.053144,0.054169,0.062503,0.056194,0.041024,0.066053,0.165536,0.238517,0.175367,0.094687,0.162821,0.181214,0.088736,0.116171,0.394048,0.432027,0.199301,0.183359,0.270651,0.310336,0.240694,0.181953,0.261016,0.281458,0.147852,0.127397,0.157829
0.071553,0.069801,0.069095,0.070606,0.062825,0.045448,0.063833,0.172923,0.247515,0.172059,0.08929,0.140856,0.162545,0.084126,0.106196,0.401653,0.463214,0.215311,0.216422,0.316309,0.317771,0.246073,0.201461,0.278092,0.28018,0.139723,0.150283,0.189666
0.078467,0.080031,0.080326,0.078054,0.06874,0.05059,0.074416,0.211527,0.287839,0.182081,0.088153,0.13603,0.156576,0.077335,0.089653,0.355311,0.414603,0.204985,0.257847,0.353038,0.346668,0.317773,0.29097,0.367798,0.31178,0.134865,0.169763,0.212025
0.071916,0.072528,0.076072,0.073793,0.064162,0.048463,0.081975,0.233361,0.296383,0.177384,0.086681,0.139674,0.149453,0.063289,0.076086,0.289028,0.314618,0.160398,0.273487,0.389648,0.404088,0.430006,0.435885,0.465864,0.330168,0.131641,0.168606,0.206544
0.050807,0.049289,0.056599,0.056051,0.048522,0.040005,0.077891,0.217234,0.256267,0.152325,0.078373,0.130826,0.133592,0.048671,0.071178,0.237686,0.223529,0.106208,0.264801,0.443216,0.513594,0.585468,0.59745,0.513536,0.310392,0.126398,0.140993,0.170873
0.028304,0.02658,0.039126,0.041049,0.037193,0.032659,0.064028,0.180352,0.209011,0.120514,0.068115,0.120673,0.135027,0.053994,0.068385,0.196663,0.17581,0.079706,0.256161,0.503557,0.612239,0.716743,0.704658,0.49261,0.269092,0.113803,0.118536,0.148148
0.020342,0.017642,0.030537,0.036994,0.034715,0.030752,0.053651,0.155225,0.176482,0.093855,0.055842,0.115453,0.138416,0.063297,0.065666,0.156681,0.142097,0.081827,0.247681,0.51434,0.614379,0.735566,0.689957,0.44016,0.26527,0.102581,0.10971,0.145448
0.018153,0.01585,0.024364,0.030818,0.029908,0.027825,0.051054,0.13904,0.148913,0.076924,0.045404,0.106695,0.130821,0.064009,0.06057,0.11536,0.108932,0.091901,0.222418,0.441061,0.505603,0.633756,0.569513,0.348451,0.258681,0.093266,0.097915,0.131144
0.01674,0.016681,0.019956,0.02175,0.024835,0.023099,0.044685,0.123412,0.139152,0.072559,0.036329,0.090027,0.112618,0.054135,0.047681,0.077786,0.085921,0.099899,0.206897,0.34956,0.386974,0.533417,0.493443,0.345369,0.291246,0.099692,0.083458,0.107934
0.017397,0.019567,0.015657,0.015002,0.023844,0.021131,0.034364,0.100565,0.118896,0.061265,0.031209,0.082492,0.105475,0.048215,0.032942,0.052759,0.080411,0.104865,0.232936,0.327884,0.340208,0.525044,0.496029,0.437208,0.356751,0.124363,0.086328,0.100746
0.019744,0.022012,0.013924,0.014911,0.023939,0.022175,0.026934,0.077313,0.085608,0.042995,0.029571,0.086042,0.107721,0.051018,0.028339,0.048044,0.077942,0.117984,0.276432,0.32865,0.351996,0.578367,0.553959,0.535215,0.397512,0.142207,0.095797,0.096937
