2.4e-05,1.5e-05,0.000149,1.7e-05,5.7e-05,3e-05,1.7e-05,0.000107,6.2e-05,8.3e-05,3.5e-05,4.1e-05,2.3e-05,9.7e-05,0.000144,0.000136,8.5e-05,4.3e-05,0.000192,4.1e-05,0.000189,3.5e-05,2.9e-05,6.2e-05,2.1e-05,0.000131,8e-06,1e-06,4.3e-05,0.000106,0.000125,8.3e-05,1.2e-05,2.1e-05,1e-04,4e-05,6.1e-05,3.7e-05,2.8e-05,2.9e-05,2.9e-05,8.6e-05,0.000115,0.000154,0.00015,5.3e-05,7.8e-05,3.8e-05,3e-05,4e-06,3e-06,7.6e-05,8.9e-05,9.4e-05,7.9e-05,6.1e-05,1.3e-05,1.9e-05,4.8e-05,2e-05,3.1e-05,0.000106,4.2e-05,3.1e-05,3.3e-05,4.7e-05,2.6e-05,6.4e-05,8.4e-05,6e-06,5e-06,7.7e-05,6.9e-05,2.7e-05,2.2e-05,1.6e-05,1.6e-05,0,0,1e-06,4.3e-05,6.8e-05,6.2e-05,4.1e-05,6e-06,3.6e-05,3.7e-05,6.3e-05,5.3e-05,8e-05,5e-06,1.6e-05,7e-05,0.000109,3.8e-05,8.6e-05,2.1e-05,0.000127,1.5e-05,0.000139,5.9e-05,9e-05,1.1e-05,6.2e-05,4.2e-05,7.1e-05,2.5e-05,0.000106,4.8e-05,2.4e-05,0.000122,6e-06,6.8e-05,0.000118,3.6e-05,1.7e-05,5.9e-05,0.000118,6e-05,3.1e-05,4e-06
8.6e-05,0.000104,0.000257,0.000119,0.000102,0.000144,9.2e-05,0.000222,0.000216,0.000237,7.9e-05,0.000137,0.000143,0.000215,0.000257,0.000345,0.000204,0.000138,0.000419,0.000116,0.000331,0.000128,0.000137,7.8e-05,9.4e-05,0.000195,0.000127,5.1e-05,0.000152,0.000193,0.00027,0.000164,3.6e-05,2e-05,0.000144,8.1e-05,5.7e-05,0.000128,0.000101,8.2e-05,8e-06,0.000254,0.000236,0.000352,0.000267,9e-05,0.000165,0.000173,0.000141,8.5e-05,2.4e-05,0.000139,0.00017,0.000241,0.000195,8.6e-05,1e-04,5.9e-05,0.000144,8.3e-05,5e-05,0.000229,0.000154,0.000125,8.1e-05,8.3e-05,9.3e-05,0.000143,0.000151,8e-06,6.7e-05,0.000208,0.000168,7.7e-05,8.7e-05,2.9e-05,0.000111,2.8e-05,6.3e-05,5.4e-05,6.5e-05,0.000167,0.000124,1e-04,2.7e-05,9.3e-05,5.3e-05,0.000119,0.000159,0.000201,6.1e-05,2.4e-05,0.000148,0.000199,5.6e-05,0.000181,5.4e-05,0.000221,0.000111,0.000215,5.8e-05,0.000134,4.1e-05,0.000116,0.000105,0.000256,0.000148,0.00017,0.000105,3.2e-05,0.000278,6.5e-05,9.1e-05,0.00026,4.4e-05,2.2e-05,0.000155,0.000254,0.000151,9.5e-05,0.000103
0.000156,6.3e-05,0.000297,0.000238,0.000154,0.000239,5e-05,0.000354,0.000218,0.000301,0.000145,0.000202,0.00013,0.000256,0.000311,0.000315,0.000191,0.000199,0.00058,0.000107,0.000409,0.000289,0.000289,0.000182,7.1e-05,0.000388,0.000165,3.7e-05,0.000169,0.000278,0.000352,0.000276,0.000109,0.000113,0.000284,0.000118,6.9e-05,0.000176,0.000169,0.000163,5.3e-05,2e-04,0.000198,0.000411,0.00044,5.2e-05,0.000178,0.000116,0.000221,4.2e-05,9.5e-05,0.000237,0.000255,0.000419,0.00023,1e-04,8.3e-05,0.000134,7.5e-05,7.5e-05,0.000103,0.000128,2e-05,0.00012,7.8e-05,9.9e-05,0.000133,0.000163,2e-04,4.3e-05,9e-05,0.000356,0.000193,0.000139,5.3e-05,9e-05,0.000121,9.4e-05,0.000193,9.1e-05,3.8e-05,0.000195,6e-05,7.5e-05,0.000183,0.000211,0.000196,0.000183,0.000166,0.000221,0.00022,0.000204,3.8e-05,0.000435,0.000254,0.00036,0.00019,0.000257,0.000249,0.00054,0.000264,0.000193,0.000148,5.8e-05,0.000181,0.000308,0.000126,0.000271,0.000196,4.1e-05,0.000487,9.1e-05,0.000171,0.000232,0.000179,0.000115,0.000264,0.000302,0.000211,6.7e-05,0.000254
0.000205,0.00032,0.00042,0.000417,0.000128,0.000439,9.3e-05,0.000429,0.000379,0.000953,0.000328,0.000133,0.000251,0.000451,0.000367,0.00029,0.000622,0.000267,0.000531,0.000893,0.000543,0.000477,0.000245,0.000125,0.000122,0.000488,0.000158,0.000271,0.000179,0.000445,0.000401,0.00038,0.000129,0.000344,0.00032,0.000382,8.6e-05,0.000231,0.000257,1.4e-05,0.00011,0.00044,0.000267,0.000531,0.000465,0.000276,0.000456,0.000342,0.000385,0.000335,0.000281,0.000671,0.000424,0.00055,0.000611,0.000328,0.000432,0.000222,0.000258,5.5e-05,0.000276,0.000467,0.000279,0.000174,6.5e-05,0.00029,0.000337,0.000226,0.000394,0.00017,9.8e-05,0.000468,0.000305,4.7e-05,0.000132,8.2e-05,0.000133,0.000127,0.000364,0.000276,0.000208,0.00017,0.000214,0.000104,0.000339,0.000188,0.000241,0.000252,0.000177,0.000291,0.000301,0.000114,0.000139,0.000867,0.000264,0.000605,0.000245,0.000447,0.000305,0.000411,0.00053,0.000613,7.4e-05,0.000174,0.000429,0.000604,0.00043,0.000441,0.00038,0.000343,0.00071,0.000308,0.000391,0.000538,0.000315,0.000337,5.3e-05,0.000507,0.000387,0.000344,0.000398
0.000364,0.000361,0.000776,0.000538,0.000292,0.000377,0.000321,6.4e-05,0.000297,0.001247,0.00123,0.000598,0.000475,0.000775,0.000983,0.000968,0.000932,0.000649,0.000648,0.001335,0.001343,0.001076,0.000848,0.000404,2.7e-05,0.000763,0.000524,0.000421,0.00024,0.000836,0.00034,0.000561,0.000222,0.00047,0.000626,0.000688,0.001021,0.00088,0.000907,0.000778,0.000414,0.000985,0.001092,0.000814,0.00154,0.001097,0.000555,0.000368,0.000599,0.000836,0.000463,0.000836,0.00073,0.000151,0.000624,0.000181,0.000331,0.000653,0.000325,0.000358,0.000675,0.000504,0.000617,0.000104,0.000158,0.00027,0.000204,0.000437,0.000508,0.000386,0.000216,0.000598,0.00076,0.000629,0.000408,0.000341,0.000257,0.000426,0.000594,0.000759,0.000912,0.000798,0.000366,0.000375,0.000627,0.000736,0.000599,0.000594,0.000619,0.000617,0.000465,0.000132,0.000483,0.001369,0.001176,0.000128,0.000351,0.000856,0.000881,0.00091,0.000814,0.00139,0.000974,0.000228,0.000653,0.001017,0.000859,0.000505,0.000275,0.000334,0.000969,0.000977,0.000844,0.000149,0.000207,0.000345,0.000608,0.000921,0.000673,0.000207,0.000554
0.000553,0.00044,0.000681,0.000315,0.000154,0.000152,0.000179,0.000525,0.000363,0.001139,0.000764,0.00039,0.000525,0.00026,0.000357,0.000496,0.000148,0.000526,0.000256,0.000643,0.000267,0.000323,0.000461,0.000273,0.000477,0.000658,0.000385,0.000692,0.000536,0.000736,0.000816,0.000299,0.000354,0.000435,0.000373,0.000245,0.001029,0.000184,0.000664,0.000869,0.000622,0.000786,0.000903,0.001075,0.000895,0.000565,0.000474,0.000358,0.000327,0.000603,0.000345,0.000512,0.000393,2.6e-05,0.000312,0.00065,0.00046,0.000651,0.000429,0.000494,0.000579,0.000481,0.000324,0.000768,0.00066,0.000628,0.000424,0.000254,0.000281,0.000322,0.000609,0.000305,0.000407,0.000216,8.3e-05,0.000401,0.000175,0.000436,0.000323,0.000584,0.000282,0.000821,0.000185,0.000141,0.000345,0.000491,0.000447,0.000162,0.000225,0.000243,0.000555,0.000695,0.000274,0.000911,0.000549,0.000191,0.000568,0.00077,0.000617,0.000157,0.000241,0.000887,0.000308,0.000445,0.00113,0.000643,0.000348,0.000466,0.000439,0.000363,0.000609,0.000917,0.00021,0.000955,0.000704,0.000277,0.000949,0.000451,0.000214,0.000263,0.000244
2e-04,0.000654,0.000708,0.000615,0.000403,0.000625,8.3e-05,0.001277,0.000755,0.001452,0.001038,0.000404,0.000652,0.000147,0.000552,0.00042,0.000403,0.000439,0.000795,0.000508,0.000177,0.000681,0.000337,0.000761,0.000563,0.000413,0.000535,0.001008,9.5e-05,0.000242,0.000382,0.000271,0.000167,0.000323,0.000133,0.000518,0.000496,0.000322,0.000882,0.000565,0.000638,0.000585,0.000147,0.000905,0.000862,0.000447,0.00058,0.000443,0.000781,0.000244,0.000402,0.000418,0.000771,0.00028,0.000372,0.000824,0.000443,0.000294,0.000225,0.000513,0.001034,0.000861,0.000491,0.000556,0.000461,0.000596,0.000638,0.000674,0.000797,0.000748,4.9e-05,0.00013,0.000165,0.000206,7.6e-05,0.000551,0.000401,0.000654,0.000814,0.000175,0.000217,0.000528,0.001058,0.000305,0.000488,0.000253,0.000349,0.000107,0.000116,0.000602,0.000437,0.000613,0.000528,0.000756,0.000457,0.000528,0.000463,0.000735,0.000414,0.000692,0.000808,0.00016,0.000341,0.000289,0.000743,0.000714,0.000629,0.000176,0.000466,0.000185,0.000402,0.000412,0.000309,0.000992,0.000606,0.000281,0.00082,0.000691,0.00035,0.000388,0.000289
0.000441,0.001395,0.002187,0.000682,0.000985,0.001355,0.001489,0.001704,0.002518,0.00081,0.00095,0.001038,2.6e-05,0.000356,0.000389,0.000596,0.000126,0.000631,0.001116,0.000535,0.001,0.000724,0.000233,0.00101,0.001373,0.000833,7e-04,0.000493,0.000909,0.00095,0.000814,0.000424,0.000745,0.000565,0.00029,0.00055,0.00013,0.000121,0.001347,0.001572,0.000464,0.000506,0.000696,0.001254,0.00066,0.000833,0.000971,0.000801,0.000314,0.000437,0.000507,0.000123,0.000541,0.00092,0.000805,0.001005,0.001814,0.001251,0.000552,6e-04,0.000439,0.000526,0.000306,0.000395,0.000934,0.000243,0.000508,0.000116,0.000597,0.000505,0.000337,0.000415,0.00091,0.000582,0.000108,0.000677,0.000874,0.00068,0.000278,0.000696,0.000408,0.00037,0.001163,0.00101,0.000897,0.001318,0.000726,0.000244,0.000568,0.001037,0.000764,0.001094,0.000897,0.001428,0.000785,0.000849,0.000573,0.00099,0.000924,0.000371,0.001139,0.000822,0.000773,0.000495,0.00069,0.0012,0.000486,0.000675,0.000615,0.000475,0.000307,0.000479,0.000268,0.000577,0.000777,0.000711,0.000745,0.001347,0.000741,0.000462,0.000945
5e-05,0.001405,0.001639,0.001669,0.001604,0.001119,0.002112,0.001762,0.001835,0.001117,0.000101,0.000813,0.000683,0.000375,0.000582,0.001129,0.000726,0.00154,0.001254,0.000785,0.001617,0.001415,0.00158,0.001506,0.00158,0.001239,0.001072,0.001152,0.001233,0.000768,0.001604,0.001331,0.000701,0.000742,0.000691,0.000945,0.00163,0.000459,0.001305,0.001209,0.001048,0.000619,0.00063,0.000357,0.001263,0.001838,0.001368,0.000619,0.000396,0.000389,0.00069,0.000882,0.000441,0.001298,0.000586,4.2e-05,0.001485,0.001173,0.000308,0.000379,0.000391,0.000926,0.000493,0.000434,0.000836,0.00108,0.000835,0.000934,0.000748,0.000918,0.000565,0.000691,0.001034,0.000883,0.000758,0.001034,0.001241,0.000849,0.000372,0.000506,0.000378,0.000556,0.000506,0.000652,0.000123,0.001191,0.001319,0.000738,0.000173,0.001403,0.001187,0.000125,0.000213,0.00111,0.000898,0.001664,0.000765,0.001165,0.001049,0.000605,0.000752,4e-04,0.000578,0.000136,0.000812,0.000577,0.001123,0.001372,0.000369,0.000454,0.000716,0.000542,0.00083,0.001267,0.00117,0.001147,0.000802,0.001498,0.001253,0.000592,0.000411
0.000497,0.001237,0.001279,0.002155,0.000622,0.000232,0.002017,0.000781,0.001639,0.001209,3e-04,0.000596,0.000284,0.001113,0.000374,0.001689,0.000537,0.002054,0.001398,0.001203,0.000832,0.00078,0.001156,0.000333,0.000751,0.000421,0.000341,0.000782,0.000262,0.000506,0.001368,0.000737,0.001013,0.000479,0.000876,0.000955,0.001242,0.000939,0.000777,0.000217,0.000756,0.000978,0.000948,0.001128,0.000832,0.000688,0.000816,0.000752,0.000791,0.000395,0.000845,0.000863,0.000634,0.000905,0.000997,0.000614,0.001114,0.000352,0.000443,0.000355,0.000441,0.00046,0.000369,0.000732,0.000571,0.000614,0.000434,0.000681,0.001053,0.000287,0.001056,0.000211,0.001558,0.000515,0.00054,0.000947,0.000808,0.000365,0.00033,0.000235,0.000125,0.000423,0.00012,0.00038,1.1e-05,0.001174,0.000533,0.000542,0.00028,0.001103,0.000463,3.7e-05,0.000117,0.001141,0.000581,0.001077,0.000786,0.00148,0.000783,0.000434,0.000278,0.000549,8.8e-05,0.000645,0.00043,0.00023,0.000879,0.00024,0.000513,0.000449,0.000697,0.000311,0.000534,0.000812,0.000516,0.001247,0.001194,0.001259,0.000511,0.00033,0.000195
0.000707,0.000576,0.001518,0.001697,0.001077,0.000715,0.000929,0.000795,0.001606,0.001643,0.001256,0.000448,0.000296,0.001389,0.001774,0.00237,0.001949,0.002625,0.002423,0.001934,0.002052,0.001098,0.001056,0.000915,0.000916,0.000225,0.000794,0.000445,0.000279,0.000753,0.001718,0.001662,0.001779,0.001011,0.001117,0.000976,0.001726,0.001506,0.000465,0.00026,0.000865,0.001725,0.002055,0.000601,0.000374,0.000653,0.00074,0.000896,0.001645,0.001257,0.00147,0.001133,0.000687,0.000585,0.000516,0.000978,0.001448,0.001268,0.001182,0.000388,0.000308,0.000346,0.000312,0.00036,0.000266,0.000505,0.000586,0.000501,0.001296,0.001404,0.001295,0.00143,0.001248,0.001173,0.000641,0.000869,0.000573,0.000669,0.000449,0.000412,0.000368,0.000469,0.00066,0.000829,0.000907,0.000255,0.001057,0.00072,0.000554,0.000403,0.000221,0.000311,0.000287,0.000768,0.000402,0.000168,0.000416,0.001536,0.001556,0.00136,0.000797,0.000238,0.000255,0.000395,0.00046,0.000499,0.000442,0.000435,0.000725,0.00053,0.00075,0.000637,0.000415,0.001126,0.000732,0.001619,0.002066,0.001407,0.00039,0.000515,0.000829
0.000187,0.00028,0.001158,0.000352,0.000403,0.000428,0.000618,0.000464,0.000653,0.000666,0.00025,0.000208,0.000357,0.000807,0.000643,0.000734,0.000789,0.000538,0.000595,0.000578,0.000334,0.000305,0.000367,0.000359,0.000671,0.000612,0.000682,0.000505,0.000511,0.000464,0.000764,0.000544,0.000498,0.000299,0.000879,0.000475,0.000546,0.000641,0.000504,0.000393,0.000885,0.000814,0.000346,0.000564,0.000759,0.000299,0.000553,0.000397,0.000852,0.000315,0.00034,0.000104,0.00041,0.000217,0.000618,0.000482,0.000426,0.000641,0.000307,0.000175,0.000177,0.000217,0.000248,0.000349,0.000351,0.000358,5e-04,0.000265,0.000709,0.000266,0.000368,0.000504,0.000139,0.000417,0.000536,0.000365,0.000582,9.5e-05,0.000164,0.000354,0.000118,0.000525,0.000589,0.000224,0.00037,0.000389,0.000553,0.000408,0.000476,0.000225,0.000254,5e-05,0.000231,0.000169,0.000324,0.000223,0.000298,0.000552,0.000517,0.00077,0.000353,0.000408,0.000162,0.000299,0.00027,0.000271,0.000689,0.000493,0.000379,0.000429,7.6e-05,0.000426,0.000599,0.000952,0.000134,0.000791,0.000627,0.000469,0.000479,0.00037,0.000278
0.000155,0.000238,0.000659,4.6e-05,0.000254,0.000263,0.00013,9.9e-05,0.000396,0.000305,0.000198,0.000145,0.000242,0.000357,0.000454,0.00029,0.000277,0.000407,0.000338,0.000377,0.000355,0.000186,8.2e-05,0.000275,2e-04,0.000242,0.000301,0.000289,0.00022,0.000119,0.000292,0.000337,0.000101,0.000247,0.000345,0.000106,0.000208,0.000232,0.000247,0.000139,0.000293,0.000262,0.000176,0.000263,0.000379,0.000171,0.000337,0.000168,0.000382,0.000216,0.000159,0.000114,0.000263,0.000171,0.000387,0.000168,0.000372,0.000229,0.000118,0.000129,0.000269,9.9e-05,0.000267,0.000323,8.9e-05,0.000272,0.000151,0.000139,0.00025,0.000191,0.000157,0.000336,8.9e-05,0.000123,0.000211,0.00024,0.000201,4.9e-05,0.000134,0.000167,0.000169,0.000268,0.000159,0.000172,0.000251,0.000189,5.4e-05,0.000227,0.000124,0.000185,0.000285,0.000226,0.000139,3.3e-05,0.000172,0.00014,8.8e-05,0.00019,0.000409,0.000189,7.9e-05,0.000139,9.5e-05,9.6e-05,0.000215,5.3e-05,0.000352,0.000183,0.00021,0.000263,0.000156,0.000174,0.000301,0.000366,0.000216,0.000344,0.000478,0.000158,0.000222,0.000264,0.000265
6.8e-05,0.00021,0.000417,0.000173,0.000215,0.00027,0.000133,6.4e-05,0.000359,0.000231,0.00023,5.6e-05,0.000256,0.000183,0.000306,0.000139,9.5e-05,0.000265,0.000122,0.000245,0.000215,0.000212,0.000176,0.000156,8.5e-05,0.000182,0.000343,2e-04,0.000178,0.000198,6.7e-05,0.000133,0.000155,9.9e-05,0.000174,0.000188,6.4e-05,0.000282,0.000306,9.5e-05,8.2e-05,0.000221,0.000219,0.000173,0.000292,0.000114,0.000306,0.000239,0.000282,0.000147,0.000166,6.7e-05,0.000286,0.000114,0.000315,0.000212,0.000237,0.000157,0.000102,0.000149,0.000218,8.9e-05,0.000246,0.000146,5.4e-05,0.000138,0.000112,0.000158,0.000238,0.000129,6.6e-05,0.000166,8.9e-05,9.3e-05,6e-05,0.000277,0.00017,3e-05,0.000212,6.7e-05,0.000273,0.000347,0.000257,0.000234,0.000295,7.7e-05,5.2e-05,0.000254,0.000219,4.7e-05,0.000185,8.6e-05,0.000151,9.4e-05,0.000374,0.000226,0.000154,0.000155,0.000221,0.000129,8.8e-05,0.000133,0.000152,0.000264,0.000368,2.8e-05,0.000204,0.000164,0.00017,0.000103,9.9e-05,0.000145,0.000362,0.000384,0.000123,0.000375,0.000331,0.000206,0.000146,0.000221,0.000187
4.1e-05,0.000251,0.000456,0.000295,0.000163,0.000224,0.000377,0.000224,1.4e-05,0.000432,0.000271,0.000133,0.000187,0.00016,0.000399,0.00012,0.000179,0.00015,0.000147,0.000299,0.000269,0.000238,0.000178,0.000274,0.00013,0.000167,0.000182,0.000318,0.000128,0.000174,0.000168,0.000132,0.000288,0.000318,0.000252,0.000291,0.000234,0.000481,0.00017,4.6e-05,0.000268,0.000209,0.000272,0.000259,0.000331,0.000264,0.000181,0.000234,0.000217,7.4e-05,0.00016,0.000157,0.000175,0.00016,0.000273,0.000352,0.000296,0.000147,5.2e-05,8.7e-05,0.000122,9.5e-05,0.000268,0.000259,0.00016,0.000345,0.000214,0.000104,0.000346,0.000141,8.6e-05,0.000328,0.000189,0.000173,0.000141,0.000319,0.00029,0.000146,2e-04,8.2e-05,0.000199,0.000321,0.000219,0.000195,0.000358,0.000318,0.00028,0.00029,0.000406,7.6e-05,0.000301,0.000282,0.000131,0.000175,0.000529,0.00014,0.000339,0.000163,0.000197,0.000198,0.000207,0.00016,9.6e-05,0.000104,0.000418,0.000264,0.000438,0.000182,6.8e-05,0.000301,0.00013,0.000327,0.000708,0.00053,0.000159,0.000411,0.000103,0.000333,0.000164,0.00023,4e-05
0.000436,0.000514,0.000555,0.000384,0.000115,0.000282,0.000476,0.000969,0.000502,0.000979,0.000711,0.000312,6e-04,0.000276,0.000592,0.000192,0.000182,0.000257,0.000285,0.000262,0.000429,3e-04,0.000415,0.000107,0.000167,0.000159,0.000123,0.000312,0.000482,0.000343,0.000276,0.000268,0.000308,0.000427,0.000456,6.4e-05,0.000147,0.00036,0.000648,0.000465,0.000299,0.000336,0.00025,0.000184,0.000357,0.000263,0.000338,0.000354,0.00028,0.000161,0.000562,0.000357,0.000366,0.000603,0.000427,0.000728,0.000125,0.000109,0.000137,9.3e-05,0.000353,0.000197,0.000399,0.000104,0.00025,0.00064,0.000209,0.000198,0.000462,0.000376,0.000163,0.00022,0.000426,0.000377,0.000376,0.000756,0.000257,0.000313,3e-05,5.9e-05,0.000194,0.00031,0.000456,0.000576,0.000403,0.001,0.00071,0.000771,0.000425,0.000713,0.000138,0.000401,0.000502,4e-04,0.000771,0.000757,0.000664,0.000578,0.000244,0.000187,0.000679,0.000397,0.000335,8.2e-05,0.00048,0.000133,0.000473,0.000381,8.7e-05,0.000431,0.000498,1.2e-05,0.001257,0.000699,0.000453,0.000593,0.000631,0.000357,0.000256,0.000168,0.000361
0.000807,0.000477,0.000473,0.000311,0.000252,0.000489,0.000547,0.000549,0.000482,0.000952,0.001606,0.00126,0.000196,0.000346,0.000742,0.000857,0.001134,0.000754,0.000132,0.000183,0.000255,0.000101,0.000682,0.000561,0.000395,0.000325,0.000183,0.000182,0.000987,0.001374,0.001058,0.001042,0.00098,0.000284,0.000465,9.3e-05,0.000375,0.000378,0.000422,0.000342,0.000548,0.000621,0.000666,0.00074,0.00068,0.000271,0.000218,0.000593,0.000503,0.000348,0.00098,0.000603,0.000515,0.000272,0.000255,0.000796,0.001182,0.000772,7.7e-05,0.000118,0.000577,0.000949,0.001054,0.00087,0.000401,0.000969,0.001038,0.000787,0.000756,0.000484,0.000193,0.000134,0.000507,0.000498,0.000247,0.000672,0.000821,0.000447,0.000407,0.000264,0.00056,0.000443,0.000521,0.000413,0.000634,0.00142,0.000863,0.001105,0.000836,0.000604,0.001023,0.001067,0.001172,0.000595,0.00092,0.001314,0.001598,0.001024,0.000512,0.000484,0.001018,0.000672,0.000557,0.000644,0.000734,0.000714,0.00039,0.00067,0.000684,0.000423,0.000322,0.000401,0.001562,0.001887,0.002083,0.001999,0.001207,0.001061,0.000347,0.000296,0.000216
0.000445,0.000718,0.000738,0.000245,0.000256,0.000449,6.4e-05,0.000654,0.00057,0.001206,0.000287,0.000179,0.000536,0.000578,0.00033,0.000643,0.00047,0.000399,0.000184,0.000256,0.000102,0.000406,0.000831,0.000272,0.00026,0.000374,0.000257,0.000155,0.000897,0.000711,0.000509,0.000621,0.000292,0.000621,0.000299,0.000592,0.000857,0.000367,0.000148,0.000139,0.000653,0.000202,0.000307,0.000356,0.000222,0.000487,0.000242,0.000489,0.000447,0.000748,0.000182,0.000467,0.000386,0.000397,0.000615,0.000592,0.000743,0.000251,0.000356,0.000292,0.000542,0.000955,0.00054,0.000272,0.00053,0.000459,0.000538,0.000448,5.8e-05,0.000224,0.000202,8.4e-05,0.000405,0.000209,0.000394,0.000499,0.000385,0.000507,0.000377,0.000492,0.000366,0.000274,0.000344,0.000571,0.000305,0.00058,0.000827,0.000518,0.000374,0.000628,0.000581,0.000947,0.000219,0.000438,0.000236,0.000587,0.000485,0.000157,0.000173,0.000515,0.000404,0.000597,0.000345,0.000284,0.000241,0.00056,0.00047,0.000664,0.000642,0.000506,0.000298,0.000409,0.000958,0.000454,0.000872,0.00032,3.9e-05,0.000447,0.000584,0.000321,0.000158
0.00014,0.000565,0.000146,8.6e-05,6.3e-05,0.000146,0.000157,0.000433,3.7e-05,0.000504,0.00041,0.000155,0.000331,0.00022,0.000514,0.000373,0.000363,0.000394,0.000132,0.000191,0.000148,0.000235,0.000241,0.000399,0.000119,0.000296,0.000415,0.000257,0.000228,0.00017,0.000579,0.000169,0.00031,0.000306,0.000137,0.000492,0.000422,0.000254,6.2e-05,0.000185,0.000276,0.000208,8.9e-05,0.000157,0.000104,0.000156,0.000245,8.5e-05,0.000168,0.000299,9.2e-05,0.000371,0.000169,0.000194,0.00021,0.000163,0.000276,0.000279,0.000275,0.000231,0.000384,0.000247,0.000145,0.000108,0.000285,0.000178,0.00042,7.8e-05,0.000132,0.000397,0.000304,0.000296,0.00026,0.000114,0.000388,0.000266,0.000157,6.8e-05,0.000144,0.000168,0.000448,0.000275,0.000235,0.000288,0.000166,0.000189,0.000604,0.000213,0.000301,0.000158,0.000354,0.00028,0.000432,0.000292,0.000268,0.000168,0.000187,0.000148,3.7e-05,0.000311,0.00033,0.000125,0.00025,0.00046,0.000376,0.000152,0.000328,0.000332,0.000455,0.000293,0.000146,0.000239,0.000515,0.000651,9.8e-05,9.4e-05,0.000195,0.000405,0.000628,0.000244,0.000218
0.000253,0.000258,0.000332,0.000194,1.7e-05,0.000189,0.000181,0.000189,0.000199,0.000123,0.000214,0.000155,4.9e-05,0.000134,0.000259,0.00023,0.00038,2.9e-05,0.000127,0.000319,0.000362,0.000346,0.000197,0.00016,0.000143,0.000124,1.8e-05,0.000201,0.000274,0.000227,0.000486,0.000123,0.00023,7.5e-05,0.000125,0.000361,0.000118,0.000123,4.6e-05,0.000221,0.000456,0.00021,8.1e-05,0.000102,7.1e-05,1.7e-05,0.000184,0.000204,0.000144,0.00037,0.000166,0.000212,8.2e-05,0.000146,0.000152,0.000238,0.00018,0.000205,6.1e-05,0.000109,1e-04,0.000193,0.000161,0.00018,0.000189,0.000125,0.000248,0.000199,0.000153,0.000241,0.000128,0.000202,0.00017,9.6e-05,0.000357,0.000326,0.000349,0.00041,0.000222,0.000209,0.000128,0.000165,0.000194,0.000159,4.3e-05,1.4e-05,0.000389,0.000154,7.9e-05,4.3e-05,0.000239,0.000385,0.000397,0.000288,0.000515,0.000454,0.000118,0.000183,0.000113,8.7e-05,6.1e-05,0.000108,0.000188,0.000383,0.000414,0.000126,0.000361,0.000179,0.000122,0.000254,0.00023,0.000121,0.000388,0.000639,0.000727,0.000204,5.4e-05,0.000217,0.00045,0.000482,0.000299
0.000107,0.000172,0.000316,0.000182,0.000154,0.000372,0.000241,0.000206,2.9e-05,0.000199,0.000136,6.6e-05,3.2e-05,8.7e-05,6.5e-05,0.000168,0.000358,0.000143,0.000232,0.000191,0.000276,0.000151,0.000119,0.000115,0.000143,0.000127,0.000145,4.8e-05,0.000337,0.000119,0.000124,0.000233,0.000206,8.4e-05,0.000167,0.000169,8.7e-05,8.6e-05,9.2e-05,0.000145,0.000268,2.3e-05,3.6e-05,0.000152,0.000121,0.000126,6.5e-05,0.000138,0.000194,0.000195,0.000301,0.000148,0.000203,7.5e-05,0.000235,0.00022,2.5e-05,0.000103,5.9e-05,6.6e-05,0.00012,0.000178,7.6e-05,0.000142,7.6e-05,0.000108,8.5e-05,0.000109,7.7e-05,0.000193,7.4e-05,0.000259,0.000247,0.000137,0.000194,0.000106,0.000193,0.000213,0.00011,0.000116,0.000162,0.000216,0.000131,5.6e-05,0.000275,0.000124,9.1e-05,8.3e-05,9.4e-05,0.000184,0.000242,0.000181,0.000118,0.000288,0.000215,0.00022,0.000133,0.000297,0.000271,0.000314,0.000125,8.3e-05,7.1e-05,8.7e-05,1e-04,0.000319,0.000123,3.6e-05,3.1e-05,0.000132,3.9e-05,0.000155,0.000173,0.000473,0.000311,0.000191,0.000294,0.000163,0.000288,0.000286,0.000442
4.3e-05,0.000202,0.000122,0.000116,4.5e-05,0.000315,0.000166,0.000114,9.7e-05,0.000183,0.000196,4.8e-05,0.000168,0.000256,0.000184,0.000216,0.000176,0.000147,0.000257,0.000288,3.4e-05,7.4e-05,0.000176,0.000133,0.000138,0.000162,3e-05,3.3e-05,0.000245,0.000103,0.00011,0.000122,3.5e-05,9.8e-05,7.3e-05,0.000138,3.1e-05,4.5e-05,9.3e-05,0.000108,0.000223,4.2e-05,4e-05,0.000102,0.000156,0.000138,0.000155,8.9e-05,0.000109,0.000194,1.1e-05,0.000153,0.000134,5.5e-05,0.000185,6.3e-05,9.1e-05,8.9e-05,9.2e-05,6.4e-05,9.8e-05,3.6e-05,1.4e-05,0.000114,8.1e-05,3.8e-05,6e-05,0.00015,9e-05,0.000122,9.4e-05,0.000148,2.1e-05,0.000189,0.000157,0.000143,0.000256,0.000293,3e-05,9.5e-05,0.000123,0.000143,0.000253,0.000192,0.000207,5.8e-05,0.000222,0.000113,0.000151,0.000289,8.8e-05,0.00015,0.000149,0.000141,0.000328,0.000256,0.000297,0.000148,0.000225,0.000116,6.4e-05,7.8e-05,6.3e-05,6.1e-05,3.2e-05,0.000231,0.000139,6.4e-05,9.5e-05,0.000234,0.000138,0.000114,0.00016,0.000314,0.000254,8.7e-05,0.000323,0.000277,0.000217,0.000133,0.000114
4e-05,0.000135,8.2e-05,2.5e-05,4.7e-05,7.5e-05,4.1e-05,3.3e-05,4.1e-05,0.000114,1.8e-05,6.4e-05,5.1e-05,6.9e-05,5.4e-05,6.2e-05,0.000127,9e-05,4.4e-05,7e-05,7.6e-05,5.2e-05,6.6e-05,6.7e-05,9.5e-05,3.8e-05,4.9e-05,5.4e-05,0.000122,3.6e-05,7e-05,3.8e-05,1.9e-05,6.4e-05,5.6e-05,6.5e-05,5.8e-05,6.4e-05,1.9e-05,3.5e-05,5.9e-05,3.3e-05,2.7e-05,7.6e-05,5.7e-05,7e-05,1.2e-05,4.2e-05,1.3e-05,9e-06,7e-05,4.8e-05,5.5e-05,3.5e-05,9.2e-05,3.4e-05,5.9e-05,4e-06,1.7e-05,9e-06,5.2e-05,9.1e-05,8.3e-05,8.2e-05,2.5e-05,6.3e-05,3.7e-05,7.7e-05,1.6e-05,4.7e-05,3.1e-05,5.5e-05,2.4e-05,9.3e-05,6.7e-05,5.7e-05,9.3e-05,0.000109,6.1e-05,2.3e-05,5.8e-05,8.6e-05,9e-05,3.1e-05,7.6e-05,6.6e-05,5.6e-05,2.3e-05,2.7e-05,8.1e-05,8e-05,6.4e-05,2.6e-05,2.2e-05,0.00013,8.3e-05,0.000124,0.000141,6.5e-05,4.4e-05,1.7e-05,2e-06,2.2e-05,4.2e-05,2.5e-05,3.3e-05,5.9e-05,4e-05,2.1e-05,6.7e-05,3.8e-05,6.2e-05,7.5e-05,0.000101,8.7e-05,0.000116,7.9e-05,3.9e-05,8.3e-05,7.6e-05,8.5e-05
1.8e-05,8e-05,3.1e-05,6e-06,6.6e-05,0.000115,1.4e-05,4.1e-05,4.4e-05,6.1e-05,9.7e-05,1e-05,4.2e-05,3.8e-05,7e-05,0.00013,8.7e-05,9.8e-05,8.7e-05,3.9e-05,8.1e-05,1.5e-05,2.4e-05,1.9e-05,5.4e-05,2.8e-05,5.6e-05,4.1e-05,7.5e-05,4.2e-05,5.4e-05,2.9e-05,3.8e-05,2e-05,1.6e-05,8.1e-05,6e-05,3.1e-05,4e-05,1.3e-05,0.000124,5.4e-05,8e-06,3.3e-05,4.9e-05,1.2e-05,3.6e-05,4.1e-05,2.2e-05,4.1e-05,6.5e-05,4.8e-05,5.3e-05,2.7e-05,4e-05,3.4e-05,3.4e-05,3e-06,2e-06,8e-06,2.9e-05,8.4e-05,3.2e-05,4.2e-05,1.2e-05,6.5e-05,7e-05,3e-06,1.8e-05,5.3e-05,1.8e-05,4.2e-05,2.5e-05,6.1e-05,4.2e-05,1.8e-05,4e-05,3e-05,1.3e-05,4.8e-05,5.7e-05,5.4e-05,2e-05,2.3e-05,6.2e-05,6.4e-05,7.1e-05,2.4e-05,1.8e-05,5.5e-05,3.9e-05,9e-06,3.9e-05,5.9e-05,5.8e-05,8.9e-05,5.1e-05,2.6e-05,8e-06,7.1e-05,2.9e-05,4e-05,2.2e-05,1.3e-05,2.4e-05,2e-05,1e-05,2.5e-05,7e-06,3e-05,1.8e-05,2.5e-05,6e-05,8.3e-05,8.3e-05,4.6e-05,7.1e-05,9e-05,3.4e-05,3e-06,7.9e-05
7e-06,6.8e-05,4e-05,1.2e-05,4.4e-05,9.6e-05,2.3e-05,4e-05,1.3e-05,6.1e-05,5.7e-05,2.9e-05,1.1e-05,3.8e-05,6.1e-05,7.7e-05,8.8e-05,5e-05,1.8e-05,3.5e-05,3.6e-05,1.9e-05,1e-05,1.9e-05,4.7e-05,3.4e-05,2.2e-05,3.8e-05,5.3e-05,1.4e-05,2.1e-05,1.3e-05,3.2e-05,1.6e-05,2.7e-05,6.1e-05,5.1e-05,3.1e-05,1.1e-05,1.5e-05,7.6e-05,3.3e-05,2.7e-05,5.4e-05,4e-05,2.3e-05,2.9e-05,2.4e-05,2.7e-05,2.6e-05,2.9e-05,3.9e-05,4.5e-05,1.4e-05,4e-05,3.2e-05,5.7e-05,1.8e-05,4e-06,4e-06,3.7e-05,4.7e-05,2e-05,2.9e-05,1.1e-05,5.7e-05,4e-05,1.3e-05,9e-06,3.3e-05,1.9e-05,4.1e-05,7e-06,4.2e-05,2.5e-05,1.8e-05,3.1e-05,4.2e-05,1.5e-05,3.5e-05,4.1e-05,3.2e-05,2.4e-05,2.2e-05,5e-05,4.2e-05,5.6e-05,1.3e-05,2.9e-05,3.5e-05,2.5e-05,1.8e-05,3.7e-05,2.7e-05,8.2e-05,8.5e-05,3.1e-05,2.1e-05,1.2e-05,3.6e-05,3.3e-05,3.8e-05,8e-06,9e-06,2.4e-05,4.3e-05,2.2e-05,5e-06,2e-05,3.5e-05,9e-06,8e-06,5.1e-05,7.4e-05,7.7e-05,3.1e-05,4.4e-05,8.1e-05,4.2e-05,2.9e-05,7.2e-05
2.5e-05,7.8e-05,5.5e-05,1.7e-05,4.7e-05,7.4e-05,1.2e-05,2.7e-05,3e-05,3.6e-05,5.4e-05,2.1e-05,2.3e-05,4e-05,4.3e-05,6.4e-05,5.5e-05,4.1e-05,2.1e-05,5.6e-05,4.8e-05,8e-06,1.8e-05,5e-06,3.6e-05,4.3e-05,7.1e-05,3.4e-05,5.1e-05,3e-05,6e-06,2.5e-05,1.8e-05,2.9e-05,3e-05,4.1e-05,1.4e-05,1.1e-05,2.7e-05,8e-06,6.8e-05,1.4e-05,5e-06,4.3e-05,3.4e-05,1e-05,4.7e-05,3.7e-05,3.8e-05,1.9e-05,3.8e-05,3e-05,3.1e-05,1.7e-05,4.9e-05,2.7e-05,5.4e-05,3e-06,1.4e-05,1.1e-05,2.9e-05,4.5e-05,2.6e-05,2.5e-05,9e-06,2.8e-05,4.5e-05,1.2e-05,3e-06,3.2e-05,1.7e-05,5.1e-05,1.8e-05,3.3e-05,1.3e-05,1.1e-05,1.1e-05,4.3e-05,2.5e-05,3.6e-05,3.6e-05,2.1e-05,2.4e-05,2.2e-05,4.4e-05,1.7e-05,4.9e-05,5e-06,2.5e-05,1.5e-05,1.4e-05,2.8e-05,5.5e-05,3e-05,7.5e-05,7.3e-05,3.4e-05,2.2e-05,1e-05,4.6e-05,2.8e-05,1.9e-05,4e-06,1.6e-05,2e-05,5.4e-05,4e-06,1.6e-05,2.3e-05,1.4e-05,5e-06,1.1e-05,3.7e-05,7.1e-05,8.4e-05,3.3e-05,2.3e-05,7e-05,1.7e-05,1.1e-05,4.7e-05
3e-05,8.7e-05,3.5e-05,1.9e-05,2.7e-05,6.8e-05,3e-05,2.6e-05,1.6e-05,1.8e-05,3.7e-05,2.2e-05,2.8e-05,1.7e-05,4.4e-05,6.5e-05,5.6e-05,4.2e-05,2.7e-05,3.3e-05,3.3e-05,1e-05,1.3e-05,1.5e-05,3.5e-05,3e-05,4.9e-05,4.6e-05,5e-05,2.6e-05,3.8e-05,1.1e-05,3.6e-05,1.7e-05,3e-05,3.9e-05,3.3e-05,7e-06,2.5e-05,1.2e-05,6.1e-05,1.5e-05,9e-06,3.6e-05,2.5e-05,2.1e-05,4.6e-05,2.7e-05,1.4e-05,3e-05,3.5e-05,1.4e-05,4.9e-05,1.6e-05,3.7e-05,2.6e-05,3.7e-05,6e-06,2.3e-05,5e-06,2e-05,5.4e-05,1.3e-05,3.5e-05,1e-05,2.1e-05,3.5e-05,1.1e-05,1.8e-05,2e-05,2e-05,2.1e-05,1.7e-05,2.6e-05,2.5e-05,1.7e-05,1.4e-05,4.6e-05,2.5e-05,2.3e-05,2.4e-05,2.2e-05,1.2e-05,3.2e-05,5.8e-05,2.3e-05,4.9e-05,3e-06,2.1e-05,4e-05,2.2e-05,1.6e-05,4.7e-05,4.2e-05,5.3e-05,6.8e-05,3e-05,1.6e-05,1.8e-05,4.8e-05,1.2e-05,2.3e-05,6e-06,1.9e-05,2.1e-05,4.1e-05,1.8e-05,5e-06,2.3e-05,2.7e-05,2.6e-05,2e-06,2.6e-05,5.4e-05,7.7e-05,4.4e-05,2.9e-05,4e-05,1.6e-05,8e-06,5e-05
2.2e-05,6.8e-05,3.9e-05,1.4e-05,2.7e-05,7e-05,2.1e-05,1.5e-05,1e-05,2.1e-05,5.7e-05,2.9e-05,1.2e-05,1.4e-05,4.3e-05,5.8e-05,5.9e-05,3.6e-05,1.7e-05,3.3e-05,3.6e-05,1.5e-05,1.9e-05,4e-06,3.3e-05,2.7e-05,3.9e-05,2.7e-05,5e-05,3.3e-05,3.1e-05,1.8e-05,2.4e-05,9e-06,2.9e-05,3.2e-05,3.1e-05,2.2e-05,1.7e-05,7e-06,5.7e-05,2.3e-05,1e-05,2.1e-05,2.4e-05,1.4e-05,2.8e-05,2.7e-05,2.4e-05,2.4e-05,2.5e-05,1.6e-05,3.9e-05,1.8e-05,3.3e-05,2.3e-05,3.9e-05,7e-06,2.1e-05,8e-06,3.2e-05,6.2e-05,2.5e-05,2.2e-05,1.3e-05,3.2e-05,2.5e-05,5e-06,2.1e-05,3.6e-05,5e-06,3.4e-05,1e-05,3.7e-05,2.1e-05,2e-05,1.3e-05,2.8e-05,2.9e-05,3.4e-05,2.4e-05,1.7e-05,2.9e-05,2.6e-05,3.8e-05,3.3e-05,4.2e-05,2e-06,1.6e-05,2.9e-05,5e-06,1e-05,2.7e-05,3.3e-05,6.3e-05,6.8e-05,2.6e-05,2.2e-05,1.7e-05,5.6e-05,2.3e-05,3.4e-05,2.8e-05,6e-06,3.7e-05,4e-05,7e-06,1.4e-05,1.5e-05,3.4e-05,1.9e-05,1.4e-05,4.4e-05,6.5e-05,8.3e-05,3.3e-05,2.9e-05,3e-05,1.9e-05,1.5e-05,6.3e-05
1.8e-05,7.5e-05,4.6e-05,1e-05,3.7e-05,5.4e-05,1.8e-05,1.2e-05,8e-06,3.9e-05,4.4e-05,8e-06,2.5e-05,2e-05,4.7e-05,6.8e-05,5.9e-05,4.2e-05,2.3e-05,3.5e-05,5e-05,1.3e-05,1.8e-05,1.5e-05,2.2e-05,2.8e-05,3.1e-05,1.8e-05,5.7e-05,2.1e-05,4.8e-05,9e-06,3.2e-05,8e-06,2.4e-05,2.9e-05,1.2e-05,2.1e-05,2.2e-05,1.2e-05,7.5e-05,1.2e-05,1e-05,3.3e-05,3.4e-05,1.2e-05,3.6e-05,2.1e-05,3.4e-05,1.9e-05,2.7e-05,1.7e-05,4.3e-05,1.2e-05,3.2e-05,2.7e-05,4.1e-05,1.7e-05,1.2e-05,1.2e-05,2.8e-05,4.6e-05,2.2e-05,2.6e-05,1.1e-05,1.9e-05,2.8e-05,4e-06,2.4e-05,3.9e-05,1.2e-05,3.4e-05,1.5e-05,4e-05,2.1e-05,1.1e-05,1.3e-05,2.6e-05,2e-05,2.8e-05,2e-05,2.1e-05,1e-05,2.8e-05,4.6e-05,3.4e-05,5.3e-05,2.2e-05,1.2e-05,3.6e-05,2.1e-05,1.9e-05,3.5e-05,1.7e-05,6.8e-05,6.4e-05,1e-05,5e-06,2.4e-05,6.2e-05,2.5e-05,3.4e-05,1.9e-05,1.9e-05,3.5e-05,2.2e-05,2e-05,1e-05,2.6e-05,3.9e-05,2.5e-05,1.5e-05,3.4e-05,6.9e-05,5.7e-05,4.2e-05,4.6e-05,6.3e-05,1.9e-05,2.1e-05,6.2e-05
2e-05,7.6e-05,7e-05,3.2e-05,3.9e-05,5.9e-05,2.6e-05,1.7e-05,1.3e-05,3.2e-05,3.6e-05,4e-06,3.3e-05,2e-05,3e-05,5.6e-05,7.8e-05,2.6e-05,2.4e-05,2.9e-05,5.6e-05,1.3e-05,6e-06,1.7e-05,5e-06,4.4e-05,3.5e-05,3.1e-05,3.5e-05,6e-06,5.2e-05,1.4e-05,3.4e-05,2.6e-05,2.6e-05,3.8e-05,1.2e-05,1e-05,1.4e-05,3.2e-05,6.1e-05,3.6e-05,1.1e-05,2.8e-05,2.6e-05,1.9e-05,2.9e-05,3.2e-05,5.2e-05,2.1e-05,3.3e-05,9e-06,3e-05,1.9e-05,4.4e-05,2e-06,4e-05,1.9e-05,2e-05,1.9e-05,2.1e-05,6.3e-05,3.3e-05,4.5e-05,2.3e-05,2.3e-05,3.3e-05,4.6e-05,2e-05,4.3e-05,1.1e-05,3.7e-05,2.6e-05,3.8e-05,1.7e-05,4.2e-05,2.8e-05,2.8e-05,4.5e-05,6.1e-05,2.1e-05,1.5e-05,2.6e-05,4e-05,2.9e-05,3e-05,5e-05,3.7e-05,4.2e-05,3.6e-05,4.2e-05,2.1e-05,2.2e-05,2.2e-05,4.2e-05,4.7e-05,3.2e-05,2.7e-05,3.7e-05,9.2e-05,2.8e-05,4.6e-05,2.4e-05,1.8e-05,4.9e-05,7.4e-05,4.3e-05,1.6e-05,2.1e-05,4.9e-05,3.5e-05,3.1e-05,3.6e-05,3.9e-05,3.5e-05,2.8e-05,2.3e-05,5.8e-05,4.9e-05,6.6e-05,6.2e-05
2.1e-05,5.5e-05,6.5e-05,2.3e-05,2.2e-05,7.8e-05,2.5e-05,3.3e-05,4e-05,2.2e-05,5.6e-05,2.2e-05,3e-05,4.9e-05,4.9e-05,6e-05,8.5e-05,4.8e-05,2.9e-05,5.7e-05,7e-05,3.3e-05,5.1e-05,4.2e-05,4.7e-05,5.3e-05,7.3e-05,5.4e-05,5.2e-05,4.6e-05,7.7e-05,3.7e-05,1.6e-05,2e-05,4.1e-05,5e-05,3e-05,3.9e-05,2.3e-05,6e-05,4.5e-05,3.2e-05,4e-05,3.8e-05,2.1e-05,2e-05,6.9e-05,8.6e-05,7.3e-05,3.2e-05,3.3e-05,5.6e-05,6.6e-05,2.4e-05,5e-05,4e-06,5.2e-05,3.3e-05,4.2e-05,3.8e-05,5.2e-05,9.3e-05,4.9e-05,2.2e-05,1.8e-05,5.6e-05,6.2e-05,0.000117,0.000116,8.2e-05,2.8e-05,2.3e-05,4.5e-05,8.5e-05,7.1e-05,8.3e-05,8.6e-05,3.2e-05,4.5e-05,4.8e-05,3.7e-05,5.2e-05,8.3e-05,5.6e-05,2.8e-05,3e-05,5.6e-05,3.7e-05,5.6e-05,4.5e-05,2e-05,1.1e-05,4.8e-05,4.4e-05,3.3e-05,2.7e-05,2.4e-05,2.5e-05,3.7e-05,5.6e-05,5.5e-05,5.9e-05,3.4e-05,1.5e-05,5.2e-05,6.7e-05,3.2e-05,3e-05,3.9e-05,4.1e-05,3.7e-05,4e-05,3.6e-05,5.4e-05,1e-04,5.6e-05,4.5e-05,4.2e-05,4.9e-05,9.1e-05,0.000155
3.5e-05,7.2e-05,5.5e-05,5.8e-05,3.3e-05,3.7e-05,5.3e-05,4.1e-05,3.6e-05,9e-05,0.000108,6.1e-05,2.4e-05,6.7e-05,1.9e-05,8e-05,2.6e-05,1.7e-05,6e-05,4.5e-05,2.2e-05,7.5e-05,3e-06,5.7e-05,4e-05,5.2e-05,2.4e-05,3.8e-05,8.7e-05,2.5e-05,0.000109,8.7e-05,4.2e-05,5.6e-05,2e-05,6.5e-05,2.1e-05,3.5e-05,4e-05,3e-05,8.3e-05,5.4e-05,4.3e-05,2.1e-05,3.6e-05,4.1e-05,6.8e-05,6.2e-05,8e-05,8e-05,8.3e-05,8.3e-05,2.1e-05,3.5e-05,3.2e-05,3.6e-05,1.7e-05,1.8e-05,8e-06,4e-06,4.7e-05,4.7e-05,1.7e-05,5e-06,6e-06,5.9e-05,3.2e-05,4.4e-05,2.9e-05,2e-05,1.5e-05,3.2e-05,3.9e-05,2.2e-05,2.2e-05,3.5e-05,1.6e-05,4.6e-05,4e-05,3.4e-05,2.6e-05,6.2e-05,1.6e-05,3.8e-05,4.4e-05,3.4e-05,3.8e-05,4.6e-05,2.5e-05,1.7e-05,9e-06,1.8e-05,5.5e-05,5e-06,3.9e-05,5.3e-05,1.8e-05,1.6e-05,2.1e-05,1.6e-05,2e-06,1.3e-05,2e-05,5e-06,2.5e-05,7e-06,6e-06,1.8e-05,1.9e-05,4.9e-05,1.9e-05,1.9e-05,5.3e-05,5.5e-05,7.9e-05,3e-06,3.2e-05,3.6e-05,3.5e-05,3e-05,7e-05
4.3e-05,2.8e-05,3.4e-05,3.2e-05,3.5e-05,5e-05,4.8e-05,4.1e-05,3.2e-05,4.8e-05,3.8e-05,4.6e-05,1.2e-05,6.9e-05,8.1e-05,6.2e-05,4.4e-05,4e-05,5.7e-05,1.8e-05,5.6e-05,8e-05,8.3e-05,5e-05,1.6e-05,5.1e-05,0.000101,6.7e-05,6.1e-05,3.7e-05,4.1e-05,3.9e-05,2.1e-05,4.6e-05,3.3e-05,3.6e-05,1.1e-05,3.8e-05,2.1e-05,1.4e-05,7.8e-05,1.3e-05,2.4e-05,2.6e-05,4.7e-05,3.1e-05,6.3e-05,2.3e-05,2.3e-05,2.4e-05,5.5e-05,3.2e-05,3.8e-05,1e-05,1.4e-05,2.1e-05,3e-05,2.4e-05,1.1e-05,9e-06,3.1e-05,3.4e-05,1.3e-05,2e-05,1.1e-05,1.9e-05,3.2e-05,1.7e-05,1.6e-05,3e-05,1.2e-05,2.4e-05,1.7e-05,1.8e-05,2.8e-05,3e-06,1.9e-05,2.7e-05,1.2e-05,3e-05,1.4e-05,2.5e-05,2e-06,2.5e-05,3.8e-05,1.3e-05,3.6e-05,2.3e-05,1e-05,2.2e-05,1.6e-05,5e-06,2.5e-05,2.4e-05,3.6e-05,3e-05,6e-06,1.3e-05,9e-06,3.4e-05,3e-06,1e-05,1.2e-05,1.1e-05,1.9e-05,2.6e-05,2e-06,9e-06,2e-06,2.1e-05,1.3e-05,5e-06,4.5e-05,8.2e-05,7.1e-05,7e-06,3.7e-05,1.7e-05,2.6e-05,1.5e-05,4.7e-05
2.6e-05,7.1e-05,4.1e-05,3.2e-05,2.9e-05,6e-05,2.2e-05,3.9e-05,3.7e-05,6e-06,1e-05,2.3e-05,2.6e-05,2.9e-05,4.4e-05,5.7e-05,4.7e-05,3.5e-05,4e-05,1.3e-05,2.9e-05,9e-06,2.7e-05,2e-05,3.8e-05,5.7e-05,3.4e-05,3.4e-05,7.5e-05,3e-06,1.2e-05,3e-05,3.2e-05,4.8e-05,1.6e-05,4.9e-05,1.8e-05,6e-06,8e-06,1e-05,7.1e-05,5e-06,8e-06,1.3e-05,3.3e-05,3e-06,3.4e-05,1.7e-05,2.9e-05,2.5e-05,2.2e-05,2.4e-05,4.4e-05,1.6e-05,1.3e-05,1.5e-05,4.4e-05,4e-06,1.5e-05,1.2e-05,2.1e-05,2.9e-05,1e-06,2.3e-05,8e-06,3.1e-05,2.8e-05,2.5e-05,1.8e-05,2.2e-05,8e-06,3.4e-05,2e-05,1.9e-05,2.2e-05,3e-06,1.7e-05,3.1e-05,7e-06,3.2e-05,2.7e-05,3.6e-05,1e-05,2.8e-05,3.1e-05,2.2e-05,4.3e-05,1.8e-05,1.4e-05,2.5e-05,1.6e-05,1.5e-05,3.2e-05,2.8e-05,3.4e-05,4.4e-05,1.6e-05,1.8e-05,1.3e-05,3.4e-05,1e-05,1.5e-05,6e-06,2e-06,1.3e-05,2.3e-05,1.3e-05,1.2e-05,1.2e-05,2.2e-05,7e-06,7e-06,3.5e-05,6.5e-05,5e-05,5e-06,2.9e-05,3.6e-05,7e-06,9e-06,4.8e-05
1.1e-05,5.8e-05,2.2e-05,3e-05,1.6e-05,4.4e-05,1.3e-05,2.6e-05,3.5e-05,2.4e-05,3.6e-05,1.7e-05,2.4e-05,4.1e-05,3e-05,4.3e-05,3.9e-05,2.7e-05,3.3e-05,2.5e-05,1.6e-05,1.3e-05,1.4e-05,1.6e-05,4.3e-05,2.1e-05,4.1e-05,3.1e-05,5.5e-05,1.4e-05,1.1e-05,2.6e-05,1.8e-05,1.7e-05,3.3e-05,4.1e-05,1e-05,5e-06,1.5e-05,6e-06,6.4e-05,4e-06,3e-06,1.7e-05,3.5e-05,6e-06,4.3e-05,6e-06,1.4e-05,3.1e-05,3e-05,7e-06,3.8e-05,1.4e-05,2.3e-05,1.3e-05,3.6e-05,1.3e-05,2.4e-05,1.2e-05,1.4e-05,3.8e-05,1e-05,1.1e-05,3e-06,3.9e-05,3.3e-05,2.2e-05,9e-06,3e-05,3e-06,3.1e-05,1.4e-05,2.8e-05,1.4e-05,1.1e-05,1.4e-05,1.5e-05,1e-05,1.9e-05,2.1e-05,3.4e-05,1e-05,3.1e-05,3.1e-05,1.8e-05,3.4e-05,1.1e-05,9e-06,2.1e-05,1e-05,2.2e-05,3.1e-05,2.3e-05,4.5e-05,4.3e-05,2.1e-05,1.2e-05,6e-06,2.4e-05,3e-06,4e-06,8e-06,5e-06,5e-06,1.3e-05,1.3e-05,1.2e-05,1e-05,3.1e-05,2.1e-05,7e-06,3.2e-05,7.3e-05,5.6e-05,1.7e-05,1.3e-05,3.6e-05,7e-06,1.7e-05,3.8e-05
1.1e-05,5.1e-05,1.7e-05,1.3e-05,1.7e-05,4.4e-05,8e-06,3.1e-05,1.4e-05,3.2e-05,1.6e-05,8e-06,1.2e-05,3.1e-05,3.6e-05,5e-05,5.2e-05,2.6e-05,2.5e-05,1e-05,2.7e-05,1.1e-05,1.6e-05,6e-06,2.4e-05,1.4e-05,3.7e-05,3.7e-05,6.1e-05,1.3e-05,1.5e-05,1.8e-05,2.8e-05,2.1e-05,2.5e-05,3.2e-05,1.8e-05,7e-06,1.5e-05,9e-06,5.5e-05,6e-06,2e-06,2e-05,3.2e-05,8e-06,4.3e-05,1.4e-05,1.8e-05,1.7e-05,2.5e-05,3.3e-05,4.1e-05,1.5e-05,2.6e-05,1e-05,3.4e-05,2e-05,7e-06,1.1e-05,1.1e-05,2.9e-05,5e-06,1e-05,3e-06,3.7e-05,3.2e-05,1.9e-05,1.3e-05,3.2e-05,6e-06,3e-05,1.3e-05,2.4e-05,1.4e-05,8e-06,3e-06,2.4e-05,2e-06,2.7e-05,2.2e-05,3e-05,6e-06,2.6e-05,3.1e-05,8e-06,4.8e-05,6e-06,1.3e-05,2.6e-05,3e-06,8e-06,2.9e-05,1.4e-05,2.3e-05,3.6e-05,1.6e-05,9e-06,8e-06,3e-05,5e-06,4e-06,5e-06,5e-06,1.1e-05,1.6e-05,1.5e-05,1.8e-05,1.5e-05,3.4e-05,9e-06,8e-06,3.5e-05,7.3e-05,5.7e-05,1.5e-05,2.2e-05,3.5e-05,6e-06,4e-06,3.3e-05
8e-06,4.3e-05,3.2e-05,6e-06,1.8e-05,3.2e-05,1.1e-05,3.6e-05,1.7e-05,2.9e-05,3.8e-05,8e-06,1.7e-05,3.9e-05,3.8e-05,5.7e-05,5.1e-05,3.5e-05,2.3e-05,1.5e-05,8e-06,2e-05,1.9e-05,1.1e-05,3e-05,1e-05,4.5e-05,2.2e-05,4.5e-05,9e-06,1.6e-05,1.3e-05,6e-06,2.2e-05,1.9e-05,3.1e-05,2.1e-05,1.3e-05,7e-06,1e-05,4.5e-05,8e-06,1e-05,2.8e-05,1.7e-05,1.2e-05,3.4e-05,4e-06,4e-06,2.5e-05,7e-06,1.2e-05,4.6e-05,6e-06,1.6e-05,1.9e-05,4e-05,6e-06,8e-06,1.3e-05,2.2e-05,2.6e-05,9e-06,1.3e-05,3e-06,2.8e-05,2.6e-05,1.4e-05,1.1e-05,2.8e-05,3e-06,2.5e-05,1.8e-05,2e-05,7e-06,9e-06,4e-06,2.9e-05,9e-06,2e-05,1.4e-05,3e-05,7e-06,2.6e-05,3.5e-05,1.4e-05,3.1e-05,8e-06,9e-06,2.8e-05,1.7e-05,1.1e-05,2e-05,1.4e-05,4.1e-05,4.5e-05,8e-06,1.4e-05,1.5e-05,2.6e-05,3e-06,1e-05,1.2e-05,1.7e-05,1.5e-05,1.7e-05,1e-05,1.2e-05,9e-06,3e-05,1.4e-05,4e-06,2.6e-05,5.6e-05,6.2e-05,1.3e-05,1.7e-05,2.8e-05,1.1e-05,6e-06,3.8e-05
9e-06,4.7e-05,2.9e-05,2.2e-05,2e-05,3.9e-05,1e-06,3.7e-05,6e-06,2.1e-05,1.2e-05,2.6e-05,2.2e-05,2e-05,4.3e-05,3.8e-05,3.5e-05,3.7e-05,3.8e-05,2.6e-05,2e-05,1.4e-05,2e-05,2.2e-05,4.3e-05,1e-06,3.8e-05,3.1e-05,5.4e-05,1.4e-05,4e-06,1.2e-05,2.3e-05,6e-06,2.2e-05,3.4e-05,1.5e-05,8e-06,1.9e-05,6e-06,5.2e-05,3e-06,7e-06,2.8e-05,2.1e-05,1.2e-05,4.1e-05,3e-06,2.7e-05,2.4e-05,2.9e-05,1.6e-05,3.4e-05,1.3e-05,1.7e-05,6e-06,4.1e-05,9e-06,1.4e-05,8e-06,1.7e-05,3.1e-05,1.4e-05,1.9e-05,5e-06,1.6e-05,3e-05,2.4e-05,1e-05,2.2e-05,4e-06,3.5e-05,5e-06,1.7e-05,1.7e-05,8e-06,1e-05,2.4e-05,6e-06,1.5e-05,2e-05,2.3e-05,7e-06,2.7e-05,3e-05,1.4e-05,2.9e-05,4e-06,1e-05,2.6e-05,1.7e-05,1.5e-05,1.3e-05,1.1e-05,3.7e-05,4.3e-05,1.9e-05,1.5e-05,2.1e-05,1.8e-05,1.5e-05,4e-06,1.2e-05,4e-06,1.1e-05,1.9e-05,6e-06,6e-06,1.8e-05,2.5e-05,1.1e-05,4e-06,2.4e-05,4.2e-05,5.8e-05,1.1e-05,2.3e-05,2.7e-05,9e-06,6e-06,4.1e-05
1e-06,5.8e-05,4.1e-05,2.5e-05,1.5e-05,4.7e-05,1.5e-05,2.8e-05,1.2e-05,1.4e-05,2.3e-05,1.2e-05,1.3e-05,2.4e-05,2.3e-05,6.1e-05,5e-05,4.9e-05,8e-06,1.1e-05,3.2e-05,1.7e-05,1.6e-05,1e-05,2.3e-05,6e-06,4.1e-05,3e-05,5.7e-05,1.2e-05,1.6e-05,1e-05,1.7e-05,1.8e-05,2.5e-05,3.1e-05,1e-06,7e-06,1.4e-05,1.1e-05,6.3e-05,1.1e-05,1e-06,2.1e-05,2.2e-05,1.1e-05,3e-05,3e-06,2.4e-05,2.5e-05,2.5e-05,2.6e-05,3.4e-05,1.9e-05,3e-05,1.4e-05,3.8e-05,8e-06,1e-05,2e-06,1.5e-05,1.8e-05,5e-06,1.3e-05,7e-06,2.7e-05,2e-05,1.3e-05,8e-06,3.1e-05,6e-06,3.7e-05,1.2e-05,5e-06,1.6e-05,5e-06,1.2e-05,2.7e-05,7e-06,1.6e-05,1.9e-05,2.7e-05,5e-06,2.4e-05,3.9e-05,6e-06,3.1e-05,9e-06,5e-06,2.8e-05,1.4e-05,1e-05,2.5e-05,1.4e-05,4.2e-05,4.8e-05,8e-06,5e-06,1.2e-05,1.9e-05,1e-05,9e-06,3e-06,7e-06,1.6e-05,2.8e-05,9e-06,3e-06,1.5e-05,2.7e-05,1e-06,6e-06,2.4e-05,3.8e-05,4e-05,1.8e-05,1.5e-05,2.9e-05,5e-06,5e-06,3.6e-05
2e-06,5.6e-05,2.8e-05,1e-05,1.9e-05,4.4e-05,1.2e-05,3e-05,1.7e-05,3e-06,1.6e-05,5e-06,5e-06,1.9e-05,2.8e-05,5.4e-05,4.1e-05,3.5e-05,1.4e-05,1.3e-05,1.6e-05,1.5e-05,1.6e-05,3e-06,2.1e-05,3e-06,3.7e-05,2.3e-05,5.2e-05,2e-05,1.2e-05,3e-06,1.5e-05,1.9e-05,1.7e-05,4.2e-05,5e-06,9e-06,2e-05,6e-06,5.3e-05,7e-06,4e-06,2.1e-05,2.1e-05,1e-05,4.1e-05,3e-06,1.6e-05,2.6e-05,2.2e-05,2.2e-05,3.2e-05,2e-05,2.1e-05,1.1e-05,4.1e-05,8e-06,1.3e-05,6e-06,1.2e-05,2.8e-05,7e-06,2.1e-05,9e-06,2.6e-05,2.4e-05,1.1e-05,1.2e-05,2.6e-05,4e-06,3.5e-05,5e-06,1.5e-05,1.3e-05,3e-06,6e-06,2.8e-05,2e-06,2.2e-05,2.1e-05,2.6e-05,4e-06,1.8e-05,2.9e-05,6e-06,3.2e-05,1.1e-05,6e-06,2.5e-05,7e-06,1.7e-05,2.3e-05,1.4e-05,4.5e-05,3.4e-05,1.6e-05,1e-05,2e-06,2.3e-05,1e-06,3e-06,8e-06,7e-06,1.5e-05,1.9e-05,1e-05,2e-06,1.8e-05,2.5e-05,6e-06,7e-06,2.8e-05,3.3e-05,6.6e-05,5e-06,1.4e-05,2.3e-05,8e-06,5e-06,3.4e-05
5e-06,5.6e-05,2.7e-05,8e-06,1.6e-05,4.3e-05,6e-06,3.1e-05,8e-06,8e-06,2.1e-05,1e-05,7e-06,2e-05,2.6e-05,5.3e-05,3.5e-05,3.6e-05,2.2e-05,1.1e-05,2e-05,1.1e-05,1.4e-05,3e-06,2.1e-05,2e-06,3.5e-05,2.5e-05,4.9e-05,1.7e-05,2e-06,5e-06,1.3e-05,1.2e-05,1.7e-05,3.3e-05,4e-06,8e-06,1.7e-05,6e-06,5.3e-05,6e-06,3e-06,2.2e-05,2.4e-05,3e-06,3.3e-05,4e-06,2.3e-05,2.6e-05,1.6e-05,2.4e-05,3.6e-05,1.7e-05,2.5e-05,8e-06,3.3e-05,5e-06,9e-06,4e-06,9e-06,2.5e-05,3e-06,1.6e-05,4e-06,2.8e-05,1.9e-05,1.1e-05,9e-06,2.5e-05,4e-06,3e-05,6e-06,1.6e-05,1.1e-05,1e-06,4e-06,2.6e-05,1e-06,2.1e-05,1.7e-05,2.5e-05,8e-06,2.1e-05,2.8e-05,1.4e-05,3.9e-05,2e-06,1e-05,2.1e-05,1e-05,1.4e-05,2e-05,1.3e-05,3.9e-05,2.9e-05,1e-05,1e-05,5e-06,2.7e-05,2e-06,7e-06,3e-06,4e-06,1.4e-05,2.3e-05,1.2e-05,7e-06,1.1e-05,2.4e-05,8e-06,1e-06,2.9e-05,3.4e-05,4.9e-05,3e-06,1.9e-05,2.6e-05,1e-06,6e-06,3.7e-05
4e-06,5.3e-05,2.8e-05,1.6e-05,2e-05,4.1e-05,7e-06,2.5e-05,1.1e-05,5e-06,2.2e-05,1e-05,2e-06,2e-05,2.8e-05,5.1e-05,3.8e-05,3.9e-05,1.8e-05,1.4e-05,1.9e-05,8e-06,1e-05,2e-06,2.6e-05,3e-06,3.3e-05,2.3e-05,4.9e-05,1.3e-05,2e-06,2e-06,1.3e-05,1.2e-05,1.9e-05,3.1e-05,2e-06,4e-06,1.8e-05,4e-06,5.3e-05,6e-06,1e-06,2.2e-05,2.4e-05,2e-06,3.4e-05,7e-06,1.9e-05,2.2e-05,1.7e-05,2.4e-05,3.3e-05,1.4e-05,2.3e-05,9e-06,3.4e-05,6e-06,7e-06,3e-06,1.1e-05,2.6e-05,5e-06,1.1e-05,4e-06,2.6e-05,1.6e-05,1.1e-05,1.1e-05,2.6e-05,3e-06,3.2e-05,7e-06,1.6e-05,1e-05,2e-06,2e-06,2.5e-05,1e-06,2.2e-05,1.9e-05,2.7e-05,7e-06,1.8e-05,3e-05,1.2e-05,3.7e-05,3e-06,1e-05,2.2e-05,1e-05,1.2e-05,2.1e-05,1.4e-05,4e-05,3.3e-05,1e-05,5e-06,4e-06,2.8e-05,5e-06,5e-06,2e-06,5e-06,1.6e-05,2.2e-05,8e-06,5e-06,1e-05,2.5e-05,8e-06,0,2.5e-05,3.6e-05,5.5e-05,0,1.7e-05,2.9e-05,3e-06,2e-06,3.3e-05
