0.000163,0.000324,0.000475,0.000383,0.000272,0.000247,0.000416,0.000539,0.000496,3e-04,-0.001641,-0.004291,-0.002455,-0.00156,-0.000642,-0.014338,-0.012097,-0.008265,-0.003955,-0.000789,0,0.000163,0.000291,2.9e-05,5.7e-05,0.000413,-4.5e-05,0.000277,0.000254,0.000311,-0.010096,-0.017349,-0.009316,-0.005145,-0.007743,-0.012453,-0.007319,-0.002048,-0.000573,-0.000387,0.000636,0.000689,-0.012241,-0.009809,-0.003047,0.007475,-0.003972,-0.006076,-0.008867,-0.008105,-0.020353,-0.017251,-0.015595,-0.016582,-0.010924,-0.005187,-0.007272,-0.01407,-0.007933,-0.010181,-0.015997,-0.018203,-0.018142,-0.011119,-0.015774,-0.007676,-0.008797,-0.005981,-0.00732,-0.016273,-0.00951,-0.007171,-0.007518,-0.004514,-0.004493,-0.002416,-0.002422,-0.001156,0.000121,-0.003889,-0.001923,-0.001999,-0.002352,-0.001863,-0.001998,-0.001961,-0.001743,-0.000305,-0.002315,-0.000815,-9.6e-05,-0.000626,-0.000588,-0.001251,-0.003971,-0.005984,-0.003486,-0.003256,-0.007384,-0.002933,-0.003192,-0.002671,0.000642,0.001144,0.000366,-0.003029,-0.001979,-0.000984,-0.000624,-0.000361,-0.000987,-0.00042,0.000537,0.000271,0.000635,0.000249,0.000136,-0.001898,-0.000942,-0.000208,0.000143
4.3e-05,0.000149,0.000251,0.000186,3.4e-05,-3.7e-05,0.000213,0.000433,0.000214,5e-06,0.000207,0.003991,0.002389,0.001367,0.000763,0.002272,0.003224,0.004079,0.002506,0.000655,4.1e-05,-2.3e-05,0.000253,9.4e-05,2e-05,0.000361,0.000113,0.000216,0.000181,0.000269,0.00513,0.01078,0.007413,0.002901,-8.9e-05,0.00397,0.00349,0.001836,0.000263,0.000575,0.000436,-0.000414,0.003067,0.008722,0.00457,0.000363,-0.009786,-0.003302,-0.005523,-0.003115,0.002524,0.00618,0.006088,-0.001132,-0.000819,-0.001293,-0.004887,-0.000964,-0.000865,-0.000759,-0.002523,-0.001939,0.000404,-0.003464,0.000669,-0.00273,-0.002897,-0.002495,-0.004707,0.000479,3e-05,1e-06,0.000785,0.000705,-0.002109,-0.000827,-0.001523,-0.003099,-0.000101,-0.000677,-0.00052,-0.001267,-0.000592,-0.001001,-0.001298,-0.001348,-0.001995,-0.000707,0.001735,0.001232,0.000576,-0.000438,0.000103,-0.002551,0.000316,-0.001091,0.00126,-0.002726,-0.001412,0.000876,0.001973,0.002038,-0.003277,-0.001484,-0.000499,0.001504,0.001888,0.000714,9.5e-05,-0.000197,0.000189,0.000213,0.000265,0.000247,0.000639,0.000458,0.000675,0.000493,0.000186,-0.000153,0.000394
-4e-05,-2.2e-05,0.00033,2.7e-05,6.9e-05,7.2e-05,-6.5e-05,0.000217,0.000104,-0.000141,-0.000909,-0.002648,-0.001458,-0.000955,-0.000447,-0.00037,-0.003609,-0.002358,-0.001741,-0.000457,-0.000124,-7.5e-05,0.000171,0.000198,0,2.4e-05,6.9e-05,0.000334,0.000207,5.7e-05,-0.001113,-0.007398,-0.003739,-0.00223,1.6e-05,0.000895,-0.001794,-0.001432,-0.000795,3.2e-05,-0.000185,0.000561,-0.004959,-0.005138,-0.00373,-0.000456,0.007063,0.004851,0.003363,0.001877,-0.003071,-0.007984,-0.006983,-0.00284,-0.00407,-0.002287,-0.000431,-0.000567,-0.001205,-0.003279,-0.00204,0.000137,-0.007305,-0.003718,-0.001386,-0.003579,-0.002329,0.001451,-0.002634,-0.003465,-0.003912,-0.002019,-0.001367,-0.000372,0.001237,0.001495,0.000174,-1.8e-05,-0.000908,-0.000292,-0.001071,-0.001109,-0.002228,-0.000179,-4.7e-05,0.000159,0.000629,-0.000195,-0.000621,7.3e-05,-1.2e-05,0.00047,0.000466,-0.000474,1.2e-05,-0.002965,-0.001175,6.6e-05,0.002976,0.000969,-0.000124,-0.000287,0.000822,-0.000377,-0.000226,-0.00055,0.000399,0.000513,8e-05,0.000306,-0.000107,-3.3e-05,0.000352,0.000212,4.2e-05,0.000184,0.00013,0.000213,4.7e-05,-3.8e-05,-2.7e-05
0.000138,2.9e-05,0.000189,-6.8e-05,0.000214,3.7e-05,-8.6e-05,0.000236,3.5e-05,8.2e-05,-0.000304,-0.000224,-0.000207,0.000269,0.000222,0.000315,0.004101,0.000693,0.000476,0.00053,0.000168,0.000123,0.000149,-3.8e-05,3.4e-05,0.000134,2.1e-05,0.000154,3.7e-05,-1.3e-05,-0.000138,0.000428,0.000264,0.000377,-2.6e-05,-0.005772,-0.001595,0.000256,0.000692,0.000336,-5.4e-05,0.00017,0.000145,0.004672,0.001891,0.000947,-0.001009,0.001302,0.00104,0.006688,0.001974,0.001255,-0.001709,-0.000697,9.2e-05,0.002901,0.001156,-0.00062,-0.002396,-0.000303,0.000643,-0.003074,0.003271,0.002119,0.001652,0.005007,0.003216,6.5e-05,0.000682,0.000183,0.002852,-0.000193,0.001014,0.001163,-8.2e-05,0.000175,-0.000228,9.9e-05,-1.2e-05,0.000532,0.001527,-1.4e-05,0.000312,-0.000543,0.000215,0.00042,0.000124,0.000224,4.4e-05,0.000466,0.000378,0.00013,0.000263,0.000977,0.000538,-9.4e-05,0.000692,0.000938,-0.002347,-0.000729,-8.6e-05,-0.000822,-0.001579,-0.004044,-0.002038,-0.00015,0.000195,0.000127,0.000148,-0.000142,8.8e-05,0.000149,-9.3e-05,-6e-05,6e-05,1.9e-05,0.000269,-0.000413,-0.000127,9.8e-05,0.000291
0.000127,7.2e-05,0.000207,-1e-06,0.00016,0.000206,-3e-05,8.3e-05,-0.000103,0.000179,0.000186,-0.000293,0.000808,8.2e-05,0.00026,0.000182,-0.001829,0.001308,0.000996,0.000354,0.00048,-4.8e-05,4.3e-05,4.4e-05,0.000104,0.000136,-5.5e-05,8.2e-05,0.000133,-2.8e-05,0.000384,0.000116,0.001177,0.000334,-8.8e-05,0.005222,0.002441,0.001969,0.000646,0.000352,0.000214,7.7e-05,-0.000112,-0.003732,-0.003735,-0.000112,-0.007354,-0.002359,-0.000693,0.001748,6e-05,-0.002571,-0.004224,0.003526,0.001159,0.001437,-0.001058,0.000511,-0.004202,0.000561,0.001205,0.003051,0.000126,0.002231,-0.000441,-0.003852,-0.001103,0.000472,0.001723,-0.001691,-0.006117,-0.000291,-0.000862,0.000293,0.000214,-0.000645,-0.000107,0.000804,-0.000463,-0.000204,-2e-05,5.1e-05,1.8e-05,0.001047,0.000521,0.000269,0.000417,0.000722,-0.000616,-0.000463,8e-05,1.7e-05,3.5e-05,-0.000147,-0.00204,0.000573,-0.001487,0.000182,0.002617,0.000788,0.000365,0.000306,0.000358,0.000606,6.7e-05,-0.000612,-0.000702,-0.000607,-0.000177,-2.2e-05,-1.7e-05,9.5e-05,-2.6e-05,-3.1e-05,-1e-04,4.9e-05,7.1e-05,9e-05,-2e-06,2.8e-05,0.000145
8.8e-05,-3.6e-05,4.4e-05,-0.000175,-5e-06,0.000187,4.7e-05,7e-05,-0.000104,0.000271,0.000404,-0.000187,-0.000654,3.6e-05,4.2e-05,0.000358,-0.001273,-0.002029,-0.000666,-0.000349,5e-06,-4.6e-05,-1.2e-05,3.4e-05,0.000172,0.000138,9e-06,-1.6e-05,0.000126,1.6e-05,-0.000173,0.00216,-0.00085,0.000117,0.00027,-0.001684,-0.001274,-3e-06,-0.000265,-0.000326,0.00028,-0.000707,0.001145,0.002464,0.001329,0.000704,-0.0016,-0.001686,0.001703,-0.003394,-0.002886,0.001648,-0.00147,-0.004662,-0.000525,0.001746,0.003445,-0.001032,-0.000389,0.00011,0.001342,-7.2e-05,-0.000906,0.002672,0.001354,0.000782,0.000411,-0.000985,-0.000828,0.000276,0.003682,-8.1e-05,-0.000692,-0.000911,-0.000699,-0.001108,-0.001459,-9.4e-05,0.000312,0.000183,0.000946,-0.000142,0.00073,0.000278,-0.000189,-0.000156,-3.9e-05,-0.000112,-0.000277,-3.5e-05,-0.00018,1.6e-05,-0.000176,0.000207,0.000746,0.000581,-0.000843,8.3e-05,-0.000739,-0.000318,-0.001072,-0.000622,-0.000237,0.000107,0.001453,0.000311,0.000535,0.00055,0.000134,0.000177,-5.8e-05,-0.000215,-0.000145,0.000221,8.6e-05,-0.000153,3.7e-05,-5.4e-05,5.1e-05,-0.000187,9.6e-05
3.2e-05,-0.000104,7.3e-05,-7.5e-05,-0.000105,-5e-06,-6e-06,-5.9e-05,-0.000167,7.4e-05,-7.6e-05,0.000508,0.000369,-0.000305,-0.000197,0.000187,0.000629,0.001388,-0.000151,-0.000407,-0.000204,-0.000142,-5.1e-05,-5.9e-05,-0.000167,-0.000107,-7.6e-05,-0.000107,-6.7e-05,-0.000129,-0.000195,-0.001197,0.000166,-0.000784,-0.00187,-0.000927,-0.000812,-0.001147,-0.000383,-0.00037,9.9e-05,-0.000552,-0.000133,-0.002604,-0.001528,0.001085,0.001198,-0.000457,-0.000823,0.00036,-0.001383,0.002659,0.004932,0.001649,0.000261,-0.00041,0.000224,0.000212,0.001472,0.002076,0.000659,0.004186,0.003027,-0.000544,-0.000621,-0.001451,3.8e-05,0.000751,0.000433,0.000564,7.6e-05,0.000105,-0.000957,0.001051,0.000906,0.002409,0.00141,0.000144,0.000437,-0.000616,-0.00083,9.1e-05,-0.000306,0.000416,8e-05,-0.000131,-0.000542,-0.000317,-0.000346,-0.000344,-0.000456,0.00027,6.7e-05,-0.000275,-0.000149,-0.000667,-0.000406,-0.000527,-0.000335,-0.000292,0.00034,0.00022,0.00066,3.3e-05,9.7e-05,-0.000512,-0.000867,-0.000419,-0.000217,0.000122,-1.6e-05,-3.7e-05,-8.5e-05,3.7e-05,-2.6e-05,-0.000135,-0.000164,-0.00024,-0.000164,-9.4e-05,-5.6e-05
-1.7e-05,-4.4e-05,-3e-06,-6.5e-05,-5.4e-05,-1.3e-05,-0.000174,-8.4e-05,-0.000171,7.8e-05,9e-06,9e-05,-0.000257,6.8e-05,-2.2e-05,0.00015,0.000429,-0.001657,-0.000227,0.00027,3.9e-05,3.5e-05,4.2e-05,-7e-05,8.7e-05,3.4e-05,-3.8e-05,-3e-05,-4.6e-05,-0.000118,-0.000158,0.000309,-0.00047,0.000921,0.002333,0.000665,-0.000693,0.000391,0.000387,2.3e-05,0.000152,-8e-05,0.000427,-0.000646,-0.000694,0.000912,0.001656,-0.003965,-0.000631,0.001069,0.001361,-0.003359,-0.003012,0.000688,2.6e-05,0.000458,-0.00048,0.000593,-0.001226,-3e-05,-0.000396,-0.001502,-0.000919,-0.002329,-0.001195,-0.000334,0.002043,0.000289,-0.000286,0.001397,0.001351,-0.000171,-0.000812,-0.001094,0.000756,-0.001127,-0.000258,0.000383,-0.000141,0.00012,-0.000121,-0.000799,0.00049,0.000106,-5.7e-05,-0.00053,-9.8e-05,-0.000294,-6.1e-05,-0.000313,-0.000278,3.2e-05,-7.3e-05,-1.7e-05,0.000917,0.000214,0.000698,0.00054,-0.000158,-0.000414,-0.000797,-0.000274,-0.000957,-0.000507,-0.000217,0.000371,0.000202,-0.000339,-0.000116,-6e-06,-8.5e-05,-2.8e-05,-0.000139,-0.00011,-0.000157,-0.000128,-0.000114,-2e-05,-0.000166,-0.000116,-0.000175
2.1e-05,-4e-06,-0.000113,-0.000121,-2.5e-05,8.5e-05,-8.1e-05,-2e-06,-0.000126,2.3e-05,-3.8e-05,-7.7e-05,7.1e-05,0.000306,5.9e-05,0.000129,-0.000539,0.001555,-0.00021,-3.1e-05,0.000386,1.9e-05,-0.00014,-7.3e-05,-9.1e-05,4.4e-05,3.8e-05,-4.5e-05,-4e-06,-3.4e-05,-9.5e-05,5.9e-05,0.000343,-0.000133,-0.000915,0.000116,-0.000213,-7.7e-05,-8.4e-05,-4.1e-05,0.000129,8.8e-05,0.000312,0.000417,-0.000942,-0.000397,-0.001459,0.002485,-0.00035,-0.001076,-0.000615,-0.001028,0.000948,-0.001578,-0.001154,-0.001748,-0.000521,-0.001405,-0.000216,0.00017,0.001006,-0.001512,-0.00017,0.002241,0.001657,0.000255,-0.001465,-0.000421,0.000449,0.000302,0.000263,0.000406,0.001465,0.001123,0.001,0.000591,0.000231,-5.2e-05,7.3e-05,-0.000437,-6.1e-05,-0.000247,-0.000419,-0.000116,0.000137,-3.2e-05,6.3e-05,-5.3e-05,-0.000144,-0.000149,-0.000338,-0.000281,-0.000184,-0.00019,-0.000213,-3.1e-05,-0.000594,-0.001074,0.000439,3.8e-05,-0.000501,-0.000121,9.3e-05,0.000365,0.000317,4.5e-05,-0.00026,-0.000311,-0.000143,3.4e-05,-1.7e-05,-3.3e-05,6.3e-05,0.000109,-0.000132,-2e-06,-0.000156,-0.000138,-7.1e-05,-7.7e-05,-8.4e-05
9.2e-05,-1.3e-05,1.5e-05,-4.4e-05,4.1e-05,3.6e-05,-3.3e-05,-1.9e-05,-4.6e-05,-2.2e-05,3.1e-05,-8.7e-05,-6.7e-05,-0.000764,-0.000249,-0.00022,0.000636,-0.000662,0.000272,-0.000154,-0.000116,-6.2e-05,-1.4e-05,-4.9e-05,-7.4e-05,7e-06,-2.4e-05,-9.7e-05,-1.2e-05,-5.3e-05,-5.2e-05,0.000196,-0.000793,-0.000508,0.00035,-0.000606,0.000277,0.000454,0.000121,-6.2e-05,0.000278,1.1e-05,0.000384,0.000456,0.001082,-0.000936,-0.001127,-0.003326,0.001831,-0.000231,-4.2e-05,0.000575,-0.000806,0.004303,0.001002,6.3e-05,0.000777,0.000715,8.4e-05,-0.000246,-0.000604,-0.000972,-0.001717,-0.001176,-0.001525,0.001212,7.5e-05,-0.000272,-0.000603,-0.001146,-0.000486,-0.001472,-0.00109,-0.000804,-0.00094,-0.000918,-0.000179,0.000122,-0.000349,0.000141,-0.000111,-0.000572,-9.4e-05,-0.000345,-0.000542,0.000193,-3e-06,9.2e-05,0.000103,-9.3e-05,-8.7e-05,-0.000143,-0.000165,3.8e-05,-0.00028,-0.000172,0.00061,0.000641,-4.7e-05,0.000599,-0.000334,-0.000111,8.7e-05,-0.000346,-0.000751,0.000272,-0.000188,-0.000138,-3.1e-05,-5e-05,8.5e-05,2.9e-05,4.8e-05,-3.2e-05,-0.000158,6.2e-05,-4.6e-05,-4.5e-05,0.00017,0.000113,7e-05
3.5e-05,-1.4e-05,-4e-06,-4e-05,-7.7e-05,2.4e-05,-2.4e-05,-1.2e-05,-6.2e-05,-6.3e-05,3e-06,-7.7e-05,-2.8e-05,0.000312,8.6e-05,0.000101,-0.00024,5.8e-05,5.6e-05,-0.00025,0.000149,-5.7e-05,1.8e-05,-3e-05,-5e-06,3.6e-05,-2.2e-05,-5.7e-05,-2.1e-05,-5.8e-05,-9e-06,-0.000144,0.000113,0.001886,-0.000255,8.6e-05,-0.000404,-0.000463,-0.000349,-0.000305,-0.000111,5e-05,0.00021,0.000653,-7e-06,0.000163,-0.00045,0.00077,0.002091,-1.4e-05,-0.002166,0.001061,0.000731,-0.001151,-0.001276,-0.002232,0.000608,8.5e-05,-0.000295,-0.002541,-0.000176,0.000734,0.000651,0.000405,0.000965,-0.001689,0.000765,0.000269,0.001159,4e-06,0.00027,0.002248,0.000907,-0.000218,0.000218,0.000175,6.1e-05,-0.000293,-1.8e-05,-1e-05,8.1e-05,0.000449,0.000105,-0.000164,0.00034,1.3e-05,0.000248,8e-06,1.5e-05,0.000277,-9e-06,9.5e-05,-0.00012,-0.000332,-7e-06,5e-06,-0.000213,-0.001332,8.3e-05,-0.000736,-0.000487,-0.000311,-0.00016,0.000226,-8e-06,-0.000381,0.000192,-0.000184,-0.000132,-3.9e-05,-1.7e-05,9.9e-05,-8.7e-05,2e-05,-6.9e-05,-5e-05,-9.9e-05,-6.1e-05,7.2e-05,-0.000104,-5.1e-05
-3.6e-05,-4.7e-05,4e-06,-2.2e-05,-4e-06,-3.3e-05,-2e-06,5e-06,-7.1e-05,-6.2e-05,3.8e-05,-7.8e-05,5.2e-05,-0.000438,-5.7e-05,4.3e-05,-0.000176,-0.00016,-5.7e-05,-8.3e-05,-6.9e-05,-2.3e-05,1.5e-05,-3.4e-05,-5.9e-05,9e-06,1.2e-05,-3.9e-05,-8e-06,-4e-05,-6e-06,-3.9e-05,0.000368,-0.001118,-5.5e-05,9.8e-05,5.7e-05,-0.000365,-0.000298,0.000115,7e-05,-0.000274,-0.000269,-0.000188,5.4e-05,-0.000711,0.000528,0.001748,-0.00294,-0.001086,0.000311,-6.2e-05,-0.000673,0.001849,-0.000138,0.001702,0.001076,-0.00035,0.000227,0.000619,9.3e-05,-0.000797,0.000658,-0.000146,-0.000777,0.000578,-0.000683,-0.000652,7.4e-05,0.000347,-0.000387,-0.001395,-0.000213,-0.000101,-0.000215,-0.000138,-0.00021,0.00024,0.000131,0.000105,2.1e-05,6.2e-05,-0.000329,-8.4e-05,-0.000136,-0.000178,7.5e-05,2.5e-05,-2.5e-05,-2.3e-05,-0.000196,0.000122,-7.3e-05,-4.6e-05,5.1e-05,0.00039,-0.000634,0.000285,-5.7e-05,0.000274,0.000874,0.000265,6e-04,1.4e-05,0.000158,2e-06,-2.1e-05,0.000283,7e-05,4.8e-05,-4.5e-05,-9e-06,-2.7e-05,-4.2e-05,-3.6e-05,-1.3e-05,-0.000121,1.1e-05,6.3e-05,8e-05,-1e-06
-1.9e-05,-3.7e-05,-4.1e-05,-3.2e-05,-2.5e-05,3e-06,-3.3e-05,-3.6e-05,-3.5e-05,-8.6e-05,2.5e-05,6.5e-05,3.3e-05,0.000195,-1.1e-05,5.6e-05,0.000164,0.000459,8e-05,0.000126,8.6e-05,-1.4e-05,-2.8e-05,2.6e-05,-3e-05,-4.3e-05,-2.4e-05,-8e-06,-1.3e-05,-1.7e-05,-1.3e-05,0.000283,-8.5e-05,0.000765,-0.000148,0.00026,4.8e-05,-0.00034,0.000183,1.7e-05,-5.6e-05,-2.1e-05,-4.5e-05,1.8e-05,-0.000255,6.9e-05,0.000308,0.000887,0.000985,-0.000608,0.000147,-0.00049,0.000493,-0.002468,-0.000141,-0.00026,-0.000284,1.7e-05,1.1e-05,-0.001064,-0.000483,7.4e-05,-0.000729,0.000299,0.000494,3.9e-05,0.000967,-0.000509,-0.001263,0.000276,-0.00021,0.000443,1.5e-05,0.000204,0.00012,-0.000213,0.000238,-0.000582,-0.000304,1.4e-05,-2.7e-05,0.000204,0.000389,0.000121,0.000172,-5e-05,6.2e-05,5.2e-05,-0.000157,2.2e-05,0.000111,-0.00011,-1.7e-05,7.4e-05,0.000243,-0.000385,0.000316,-9.8e-05,-8.6e-05,-1.5e-05,-7.1e-05,7.7e-05,0.000238,0,-9.4e-05,-0.0012,-7.1e-05,-0.000213,-1.7e-05,-6.7e-05,-7.2e-05,1.6e-05,4.1e-05,-1.3e-05,1e-06,-4.6e-05,-1.3e-05,-1.8e-05,2.8e-05,-4e-06,2.8e-05
-1.2e-05,-6e-06,0,-1.4e-05,-2.9e-05,-1.6e-05,-3.5e-05,-1.2e-05,-1.2e-05,-8.3e-05,3.7e-05,-2.6e-05,-7.8e-05,0.000111,2.9e-05,-5.3e-05,-6.4e-05,-0.000421,4e-05,-0.000117,-3.8e-05,-6.6e-05,-1.5e-05,-1.4e-05,-4.2e-05,3e-06,1.4e-05,2.6e-05,8e-06,-3e-05,2.8e-05,-0.000182,-4.6e-05,-0.000733,2.6e-05,-0.000193,-0.000183,-0.000143,-0.000245,-9.3e-05,-6e-06,-0.000106,-0.000125,-0.000117,8.3e-05,-0.000695,8.4e-05,-0.000987,6.8e-05,-0.000718,0.000379,0.000732,-0.00021,0.00101,-0.00034,0.001247,0.000139,-0.000102,-0.000394,1e-06,-0.000175,-4.2e-05,0.000429,-0.000118,-0.000621,0.00031,0.000212,-0.000103,0.000486,-0.000448,4.4e-05,-0.000164,-0.000344,0.000197,-9.2e-05,-0.000334,7.2e-05,-9.6e-05,6e-06,-0.000111,2.8e-05,-0.000196,-0.000201,-0.000243,-1.2e-05,7.9e-05,-1.7e-05,2.6e-05,-1.5e-05,4e-06,-8.3e-05,-4e-06,-7.1e-05,-2.7e-05,-7.8e-05,7.2e-05,6.4e-05,0.000948,-0.000283,9e-06,-0.000246,-0.000105,-1.5e-05,-4.8e-05,-0.000142,0.000463,-1.2e-05,0.000138,-7e-06,-4.3e-05,3.2e-05,1.1e-05,8.9e-05,1.5e-05,-3.6e-05,-2.3e-05,9e-06,-2e-06,1.7e-05,2.1e-05,2e-06
-3.9e-05,-1.3e-05,2e-06,-1.4e-05,-3e-06,-2e-06,-9e-06,-8e-06,-7e-06,-3.5e-05,2.3e-05,-6.3e-05,3.2e-05,3.9e-05,-7.4e-05,-3.1e-05,-7.6e-05,0.000174,-2.5e-05,2e-04,-0.000105,-3.7e-05,-2.2e-05,-1.3e-05,9e-06,-2.6e-05,-1.5e-05,-8e-06,-2e-06,-2e-06,3.2e-05,1.3e-05,-3.5e-05,3e-06,-0.000156,-1.4e-05,-0.000143,0.000146,6.7e-05,-0.00011,-0.000112,-4.3e-05,-7.1e-05,-9.3e-05,-4.5e-05,0.00083,-0.000362,-0.000156,-0.001587,-0.000241,-0.000337,0.00057,0.000292,-0.00156,-0.000195,-0.001455,-0.000518,-0.000286,-0.00017,0.000548,4.5e-05,4e-05,5e-05,-0.000698,0.000248,-2.6e-05,-0.001022,0.000356,0.000162,0.000102,0.000198,0.000278,0.000233,-0.000352,8e-05,0.000235,-0.000116,3.5e-05,-6.6e-05,7.5e-05,-7.7e-05,9.5e-05,-1.6e-05,-0.000133,-2.7e-05,5.2e-05,7.7e-05,-3e-06,7.3e-05,-2.5e-05,4.7e-05,-9.6e-05,1.1e-05,4.7e-05,-7.2e-05,0.000132,-6.5e-05,-0.000357,-0.000136,-0.000244,-0.000149,3.2e-05,7.8e-05,-2.8e-05,1.3e-05,-0.000185,-0.000124,-3.1e-05,-7.7e-05,1e-06,1.4e-05,-4e-06,-6.8e-05,-2.3e-05,2e-05,1.5e-05,2.3e-05,4e-06,4e-06,1.6e-05,-1.8e-05
-1.2e-05,-6e-06,1.8e-05,-1.2e-05,-1e-06,-1.1e-05,-2.1e-05,2e-06,-1.1e-05,-1.7e-05,1.6e-05,-1.3e-05,-1.6e-05,2.3e-05,-4e-06,-3.8e-05,9.8e-05,-8.7e-05,-0.000128,-0.000118,-6.1e-05,-2.5e-05,1.9e-05,1.6e-05,-2.1e-05,-1e-06,5e-06,-1.3e-05,6e-06,-1.4e-05,9e-06,1.5e-05,5e-06,3.8e-05,-0.000186,0.000102,4.3e-05,8.7e-05,-1e-06,-4.5e-05,-7.8e-05,8e-06,-6.7e-05,0.000135,-0.000219,-0.000939,-4.4e-05,-0.000641,0.000184,-0.000227,0.000234,-0.000545,-0.000237,0.000499,-2.1e-05,-0.000103,-0.000323,-4.3e-05,0.000134,-0.000178,-0.000112,0.000348,-0.000314,-2.5e-05,0.000117,-0.000326,0.000146,3e-05,-0.000586,-0.000122,-0.000204,-0.000285,-0.000238,0.000176,-6.4e-05,-5.6e-05,0.00013,1e-06,5.8e-05,-6.7e-05,1.1e-05,-9.3e-05,-6.2e-05,7.8e-05,-6.7e-05,-1.8e-05,-1.6e-05,5e-06,-5.9e-05,-9e-06,2.3e-05,3.2e-05,2.2e-05,5.4e-05,0.00014,-0.000107,8.6e-05,2.4e-05,2.1e-05,0.000182,7.4e-05,-4.4e-05,4.1e-05,-4.3e-05,0.000153,0.000394,-7.9e-05,-5.1e-05,5e-06,-1.2e-05,-1.2e-05,6e-06,1.8e-05,1.7e-05,2.5e-05,4.4e-05,-5e-06,-1e-05,5e-06,-1e-05,0
0,-1.4e-05,-1.2e-05,-1.5e-05,1e-05,-5e-06,-1.7e-05,1.1e-05,-3.8e-05,-2e-06,8e-06,-9e-06,-4e-06,-6.4e-05,-1.5e-05,0,-9.3e-05,0.000157,4.2e-05,-0.000114,-3.7e-05,-5e-06,0,1.7e-05,0,-4e-06,-4e-06,-1e-05,3e-06,2e-06,1.3e-05,6.9e-05,1e-06,-0.000242,0.000127,-0.000213,-3.7e-05,5.3e-05,6.9e-05,-6e-06,-4.3e-05,-1.3e-05,-7.7e-05,-3e-05,0.000105,0.000749,0.000194,0.000513,0.000134,0.000329,-0.000196,-0.000132,0.000336,-2.6e-05,0.000102,0.000952,-4.7e-05,-0.000272,0.000137,-8.5e-05,-0.000219,-8.9e-05,0.000502,0.000473,-0.000132,-2.3e-05,-3.2e-05,-0.000185,0.000192,-0.000151,-0.000115,0.000109,0.000397,-0.000183,-0.000135,6.5e-05,4e-06,-0.000111,4e-05,4.5e-05,5.5e-05,0.000114,1.9e-05,-5e-06,-2e-05,-4.2e-05,-2.3e-05,-2e-06,-2.7e-05,-3.9e-05,-3.9e-05,-3e-05,-3.1e-05,1.1e-05,1.3e-05,-2e-05,-2e-05,7.6e-05,-1e-05,-4.5e-05,-6.3e-05,5.2e-05,-2.5e-05,-2e-05,-4.8e-05,2.5e-05,-8e-06,3.5e-05,-5e-06,1.2e-05,-1e-06,1.2e-05,-1.2e-05,-1.1e-05,-1.7e-05,-5e-06,-9e-06,-7e-06,2.5e-05,-2.3e-05,2e-06
1.1e-05,-1.2e-05,-8e-06,-1.1e-05,-1e-06,-1e-06,-1e-05,-1e-06,-1.3e-05,7e-06,1e-06,-3e-05,7e-06,-2.5e-05,4e-06,-5e-06,-5.5e-05,-0.000211,2.6e-05,9.6e-05,-2e-05,-1.4e-05,-6e-06,-1.5e-05,1.2e-05,-2e-06,0,-4e-06,-1e-06,-6e-06,6e-06,-5.4e-05,-2.1e-05,0.000317,-0.000218,0.000145,-3.2e-05,9.9e-05,8e-06,-1e-06,3.4e-05,-2e-05,-3.6e-05,0.000121,-7e-05,-0.00013,0.000163,0.000266,0.000351,0.000671,-0.000102,0.000237,-0.000171,0.000246,-0.000316,-0.000511,-0.000179,-0.000264,0.000156,0.000554,-0.000119,-0.000277,-0.000124,4.3e-05,-4e-06,-5.5e-05,2.4e-05,5.8e-05,3e-06,0.000339,4.3e-05,-2e-04,-0.000194,5e-05,-9.1e-05,-3.2e-05,-0.000186,4.7e-05,-6.7e-05,1.6e-05,-1.3e-05,-1.1e-05,3.8e-05,7e-05,4.8e-05,3.3e-05,1.7e-05,3e-06,-1.3e-05,3e-06,-2.2e-05,3.3e-05,3.6e-05,1.8e-05,5.1e-05,8.5e-05,-5e-06,-0.000195,0.000168,-1.8e-05,-0.000126,-9.1e-05,9.5e-05,-3e-05,-6.4e-05,-0.000223,0.000133,-0.000105,-4.2e-05,2.4e-05,0,1e-06,1.6e-05,1e-05,-1.7e-05,4e-06,-1.2e-05,0,2.3e-05,-1e-05,6e-06
9e-06,-6e-06,1e-06,-9e-06,-3e-06,0,-7e-06,3e-06,-1.8e-05,1.9e-05,-4e-06,3e-06,7e-06,5.3e-05,9e-06,-4e-06,5.8e-05,0.000112,3e-05,-6e-05,3e-05,-3e-06,-2e-06,-1.5e-05,-2e-06,3e-06,0,-3e-06,-7e-06,-8e-06,2e-06,-3.5e-05,-3e-06,-0.00017,0.00016,-2.8e-05,-2.6e-05,-7.7e-05,-7e-06,7.7e-05,-1.9e-05,3e-06,-2.3e-05,-3.4e-05,0.000114,5.1e-05,-7.7e-05,0.000253,-1e-06,0.000317,-0.000217,8.5e-05,8.2e-05,-4.7e-05,-0.000193,-0.000313,-8.7e-05,7e-06,-0.000287,-6.5e-05,0.000154,0.000225,-0.000174,0.000169,-1e-06,6.4e-05,-0.000178,0.000199,8.5e-05,6e-06,-2e-06,1.9e-05,4.1e-05,-0.000102,3.5e-05,-8.5e-05,0.000204,-1.3e-05,4.7e-05,4.6e-05,5.6e-05,1.1e-05,-7.3e-05,-2e-05,5.5e-05,-1.2e-05,1.2e-05,1e-06,4.1e-05,6.3e-05,-4.8e-05,-4.9e-05,-1.7e-05,1.6e-05,-0.000114,-3.2e-05,-5.6e-05,-4.9e-05,2e-06,-6e-05,-1.7e-05,4.1e-05,-9.7e-05,1e-06,7e-05,4.2e-05,-7.5e-05,7e-06,-1e-05,6e-06,-1e-05,-1e-06,-1.6e-05,-2e-06,-3e-06,-1.7e-05,-2.6e-05,-1e-05,1.1e-05,-7e-06,-8e-06
1e-06,-2e-06,5e-06,-8e-06,-5e-06,-2e-06,-1e-06,-5e-06,-1.3e-05,1.7e-05,-5e-06,2e-06,-1.6e-05,-8.2e-05,-1.1e-05,-4e-06,-4.5e-05,-3.4e-05,-1.7e-05,6.2e-05,1.1e-05,-1.1e-05,7e-06,-2e-06,-2e-06,-3e-06,-1e-06,1e-06,1e-06,-7e-06,2e-06,7.9e-05,-4.1e-05,-9.1e-05,-5.4e-05,2e-06,-1e-05,-5.8e-05,0.000123,-1.8e-05,1.3e-05,-3.6e-05,-3e-06,-3.2e-05,-4.3e-05,-1.2e-05,-0.000139,-0.000279,-4.2e-05,9.9e-05,1.2e-05,-0.000207,-6.2e-05,-0.000369,-1.4e-05,-0.000432,-2e-05,5.9e-05,-0.000272,0.000127,9.6e-05,7e-06,4.3e-05,0.000109,-0.000151,6.9e-05,-8.6e-05,7.9e-05,-1.3e-05,-0.000174,6.7e-05,9.7e-05,-6.2e-05,0.000107,2.1e-05,9.2e-05,-8.9e-05,1.5e-05,-3.4e-05,2.9e-05,-3.8e-05,-5.5e-05,4.8e-05,1.6e-05,-5e-06,-5.2e-05,-6e-06,3e-06,2.9e-05,-1.6e-05,6e-06,5e-06,-2.8e-05,-1.4e-05,-2e-06,-2.6e-05,5.7e-05,-3.9e-05,8.7e-05,0.000103,8.5e-05,1.8e-05,-6e-06,-2.4e-05,-2e-06,3e-06,-1.2e-05,-5e-06,-1.2e-05,-1.1e-05,-2e-06,4e-06,4e-06,-5e-06,-2e-06,-9e-06,-4e-06,0,6e-06,-1.1e-05,-6e-06
3e-06,0,-3e-06,-8e-06,-4e-06,6e-06,-6e-06,-6e-06,-1.2e-05,1e-05,-5e-06,-1e-05,1e-05,4e-05,1.5e-05,0,-1.4e-05,4.9e-05,3.1e-05,-1.6e-05,3e-06,-1.1e-05,-6e-06,2e-06,-7e-06,3e-06,1e-06,0,1e-06,-8e-06,0,-3.7e-05,3.1e-05,0.000189,3.5e-05,-9e-05,-3.2e-05,-1.9e-05,-0.000103,-4.9e-05,2.1e-05,1.2e-05,7e-06,-4.2e-05,-0.000127,4.1e-05,-2.8e-05,0.000139,-0.000192,-0.000241,0.000238,-0.000203,4e-05,4.2e-05,-0.000139,0.000246,-5.3e-05,-0.000103,0.000208,-0.000214,1.6e-05,-9.2e-05,-3.1e-05,-0.000102,0.000147,0.000172,-9.1e-05,-7e-05,6.1e-05,-1.5e-05,-2.5e-05,4.7e-05,-7.4e-05,-0.000121,3.5e-05,-5.5e-05,4.6e-05,1.2e-05,1.8e-05,-1.6e-05,1.7e-05,-4e-06,8e-06,2.8e-05,-1.5e-05,-1e-05,4e-06,6e-06,-3.9e-05,-2.1e-05,-5e-06,2.3e-05,-9e-06,6e-06,3.8e-05,2.1e-05,5.1e-05,2.6e-05,-9.3e-05,-4e-05,3.6e-05,-4.3e-05,8.4e-05,-1.7e-05,-2.3e-05,7.2e-05,0,2.1e-05,9e-06,1.4e-05,-1e-06,0,1.1e-05,6e-06,-6e-06,0,-6e-06,-7e-06,0,2.5e-05,1.2e-05
8e-06,-1e-06,0,-7e-06,-6e-06,4e-06,-9e-06,1e-06,-8e-06,5e-06,-4e-06,-1e-06,-1e-06,-5.3e-05,-1e-06,7e-06,2.7e-05,-9.6e-05,-4e-06,-1.7e-05,6e-06,-6e-06,4e-06,-2e-06,-3e-06,0,-3e-06,-4e-06,-1e-06,-1e-06,1e-06,-5e-06,5.5e-05,-0.000264,-1.7e-05,0.00013,-4.2e-05,3e-05,2.4e-05,-2.9e-05,1.2e-05,-9e-06,1.1e-05,-3.6e-05,4.3e-05,-6.8e-05,8.8e-05,-0.000178,4e-05,-0.00026,-0.000147,0.000119,1.9e-05,-0.000291,-5.1e-05,0.000289,4.8e-05,-2e-05,0.000136,-0.00028,0.000118,-7.9e-05,7e-06,-9.9e-05,-0.000103,-0.000234,0.000161,-4.8e-05,2e-05,4.2e-05,-2.9e-05,-0.000123,3.4e-05,-2.6e-05,2.2e-05,4.6e-05,-8e-06,7.7e-05,2.7e-05,-2e-05,-6e-06,-5e-06,1.3e-05,3.7e-05,-3.8e-05,1.9e-05,3e-06,2e-06,-4.6e-05,-1.3e-05,1.8e-05,2e-06,-1.1e-05,-5e-06,2.2e-05,1.2e-05,-5.9e-05,-4.1e-05,5.4e-05,-3.9e-05,-7.8e-05,2.9e-05,-5.7e-05,2e-06,-1.2e-05,1.3e-05,-3.4e-05,1.6e-05,-1.3e-05,5e-06,4e-06,-3e-06,-9e-06,0,-6e-06,1.1e-05,5e-06,0,-5e-06,-4e-06,0
-2e-06,-1e-06,-3e-06,-6e-06,5e-06,2e-06,-1e-06,-1e-06,-9e-06,-1e-06,-2e-06,-5e-06,-2e-06,3e-06,-1.5e-05,7e-06,-3.5e-05,9.5e-05,-4e-05,-1.5e-05,-2e-06,-5e-06,-5e-06,-1e-06,-1.4e-05,-3e-06,3e-06,-2e-06,1e-06,-1e-06,1e-06,1e-06,-7.7e-05,0.000147,-1.8e-05,-5.1e-05,-1.5e-05,-6e-06,-3.7e-05,6e-06,-6e-06,-4e-06,1.2e-05,5e-05,1.9e-05,2.8e-05,6.8e-05,0.000287,0.000283,-0.00023,5.6e-05,0.000191,0.000145,0.00033,6e-06,-6e-05,-7e-05,2.2e-05,-4.4e-05,9.6e-05,6.1e-05,-8.9e-05,-1.2e-05,-7.5e-05,0.000125,6.6e-05,0.000156,-1e-05,-0.000116,5.1e-05,-3.1e-05,0.000161,-2e-06,2.8e-05,-7e-06,0,-4.3e-05,-8e-06,-4.6e-05,-2.6e-05,-2e-05,5.4e-05,0,-1.7e-05,-2.4e-05,2.6e-05,0,4e-06,-1.5e-05,1.4e-05,-2e-06,3e-06,0,-1.2e-05,3.3e-05,-1.9e-05,3e-05,4.9e-05,-6.6e-05,2.5e-05,-6.9e-05,-8e-06,-1.6e-05,-7e-06,1.9e-05,1.4e-05,0,2.5e-05,-9e-06,-1.1e-05,-4e-06,2e-06,-5e-06,-2e-06,1e-06,4e-06,2e-06,-3e-06,-6e-06,-1e-05,-4e-06
3e-06,-3e-06,6e-06,-6e-06,0,2e-06,-3e-06,3e-06,-1e-05,-6e-06,-4e-06,-7e-06,-1e-06,2.5e-05,-1e-06,7e-06,-2e-06,-5.2e-05,2e-06,-1.3e-05,2.2e-05,-5e-06,-1e-06,3e-06,-3e-06,6e-06,-3e-06,1e-06,0,-5e-06,1e-06,2.9e-05,1.2e-05,-6.5e-05,4.6e-05,-3.2e-05,-8e-06,-1.9e-05,7e-06,1e-06,1.4e-05,4e-06,1e-05,3e-06,-3.1e-05,-5.2e-05,-3.1e-05,-0.000232,-0.000428,-0.000128,-0.000188,-0.000107,-0.000165,-5.1e-05,-4.3e-05,-8.1e-05,6e-06,2.7e-05,-5.2e-05,-0.000184,4.6e-05,6.7e-05,3.5e-05,1.5e-05,-8.1e-05,-0.000181,-0.000175,-2.5e-05,0.000118,3.1e-05,2.1e-05,-6.5e-05,1e-06,1e-06,-2.8e-05,-2.9e-05,4.1e-05,1.9e-05,1.9e-05,1.9e-05,2e-06,-2.8e-05,-6e-06,-5.1e-05,2e-06,-2e-06,-7e-06,0,9e-06,0,-1.5e-05,-2.5e-05,-4e-06,4e-06,-7.4e-05,1e-05,-2.5e-05,4.4e-05,5.9e-05,2.8e-05,-1.7e-05,3e-06,3.4e-05,-1.2e-05,-1.6e-05,-6.5e-05,8e-06,-1.2e-05,-1e-05,1e-06,-2e-06,1e-06,1e-06,0,1e-06,3e-06,-1e-06,-4e-06,-2e-06,-4e-06,0
5e-06,-3e-06,-2e-06,-5e-06,2e-06,0,-6e-06,1e-06,-1.1e-05,-8e-06,-3e-06,7e-06,-1e-06,1.7e-05,-5e-06,2e-06,2.1e-05,1.9e-05,8e-06,2.5e-05,-5e-06,-1e-05,3e-06,3e-06,-4e-06,-2e-06,3e-06,1e-06,3e-06,0,0,-2.6e-05,2.3e-05,8.8e-05,-5e-05,2.3e-05,-1.7e-05,-1.9e-05,-2.5e-05,-3e-06,7e-06,-1.3e-05,1e-05,2.5e-05,-1.8e-05,4.1e-05,-6.8e-05,-1.4e-05,0.000454,2.7e-05,8.4e-05,-0.000188,9e-05,0.000265,2.7e-05,2e-05,6.5e-05,-1.6e-05,-0.000124,-4.6e-05,4e-06,5e-06,-1.3e-05,-1.9e-05,4e-06,0.000168,0.000103,-2.5e-05,2e-06,-2e-06,5.3e-05,-5.2e-05,5.5e-05,-3e-06,1.5e-05,-9e-06,1.2e-05,3e-06,-1.4e-05,1e-05,-1.2e-05,2e-06,2.8e-05,-1.2e-05,2.3e-05,-2.5e-05,5e-06,2e-06,1.4e-05,-2e-06,6e-06,1e-05,-6e-06,5e-06,1.2e-05,3e-06,-1.5e-05,8.9e-05,-4.2e-05,-2.8e-05,1e-06,-8e-06,-3.3e-05,-1e-06,-1.4e-05,-7.5e-05,1.1e-05,-1.7e-05,0,-6e-06,-3e-06,-1e-06,9e-06,-1e-06,4e-06,-7e-06,0,0,4e-06,-2e-06,-2e-06
-1e-06,-1e-06,1e-06,-5e-06,-1e-06,-1e-06,-2e-06,-1e-06,-7e-06,-8e-06,-1e-06,3e-06,1e-06,2.6e-05,-1e-06,0,-2.2e-05,-2.2e-05,1.2e-05,8e-06,2.5e-05,-4e-06,4e-06,-2e-06,-1e-06,1e-06,-3e-06,-1e-06,0,-2e-06,0,-1.2e-05,-4e-06,5.3e-05,4.5e-05,2.5e-05,-1.4e-05,-3.6e-05,1.5e-05,1.5e-05,-7e-06,1e-06,7e-06,-1.2e-05,8e-06,-6.9e-05,-1.3e-05,2.3e-05,2e-06,0.000123,-0.000165,3.3e-05,-1.6e-05,-0.000171,2.3e-05,0.000112,6.4e-05,-2.8e-05,-6e-06,0.000117,-1.9e-05,-1e-04,-8e-05,-9.6e-05,-2e-06,2.5e-05,0.000106,-4e-05,-7.3e-05,-5.2e-05,-3.5e-05,-7e-05,-5.4e-05,-2.4e-05,3.3e-05,3.8e-05,-4.1e-05,-2.4e-05,1.1e-05,1.8e-05,1.1e-05,-2.2e-05,-5e-06,1e-06,2.8e-05,3e-06,-1.3e-05,1e-06,-1.4e-05,-5e-06,-1e-05,-4e-06,1.2e-05,1e-06,-3e-06,-1.7e-05,1.4e-05,-3e-06,4.8e-05,-2.2e-05,-2.2e-05,-6e-06,-3e-06,1e-06,2.6e-05,-8.5e-05,-2.7e-05,-2.9e-05,-1.1e-05,-5e-06,-3e-06,0,-2e-06,4e-06,-1e-06,-2e-06,-2e-06,-5e-06,2e-06,-2e-06,2e-06
-4e-06,-1e-06,-4e-06,-5e-06,-2e-06,-1e-06,-2e-06,0,-8e-06,-7e-06,-1e-06,-7e-06,2e-06,-3e-05,-1e-06,-1e-06,2e-06,3.8e-05,-8e-06,-8e-06,5e-06,-7e-06,-4e-06,-2e-06,0,0,2e-06,-2e-06,-2e-06,-3e-06,0,3.2e-05,-1.6e-05,-8.9e-05,-3.2e-05,-3.6e-05,-9e-06,-3e-06,-4e-06,-1e-05,2e-06,-2e-06,4e-06,-2.6e-05,3.1e-05,8.4e-05,5.1e-05,0.00018,-0.00032,0.000138,0.000153,0.000116,1.1e-05,-3.6e-05,-4.5e-05,0.000114,3.7e-05,-3.5e-05,0.000138,5e-06,-2.4e-05,-2.3e-05,8.8e-05,0.000133,-1e-06,-3.9e-05,-3.6e-05,-1.7e-05,5.4e-05,1.1e-05,-1.6e-05,7.9e-05,2e-05,-3e-06,1.2e-05,-5.1e-05,3.5e-05,-2.2e-05,1e-06,-6e-06,-6e-06,1.8e-05,1.3e-05,-4e-06,-1e-05,1.9e-05,1e-06,-2e-06,-1e-05,1.3e-05,-1.7e-05,1.4e-05,-4e-06,1e-05,2.7e-05,1.6e-05,-2e-06,-2.4e-05,-4.3e-05,4e-05,6e-06,1e-05,5e-06,-6e-06,-4e-06,0.000114,1.8e-05,-1.9e-05,-9e-06,8e-06,1e-06,-1e-06,-6e-06,-4e-06,-3e-06,-3e-06,0,-1e-06,-2e-06,5e-06,-2e-06
-5e-06,-1e-06,4e-06,-4e-06,-2e-06,-2e-06,-2e-06,-3e-06,-7e-06,-4e-06,-3e-06,0,0,-2.1e-05,1e-06,0,1.2e-05,-3.9e-05,1.1e-05,-1.8e-05,-8e-06,-6e-06,-3e-06,0,4e-06,-2e-06,-1e-06,-2e-06,2e-06,-1e-06,0,-9e-06,6e-06,0.000126,1e-05,2e-06,-1.7e-05,3.8e-05,-6e-06,-1e-05,-4e-06,-3e-06,2e-06,-4e-06,-3.7e-05,-0.000107,3.1e-05,-3.4e-05,0.000186,3.2e-05,-9.1e-05,2.9e-05,0,-6.2e-05,1e-06,-0.000223,5.9e-05,-2e-06,-5e-06,7.7e-05,-5.2e-05,9.6e-05,-2e-06,2.5e-05,2.4e-05,1.3e-05,0.000106,2.6e-05,1e-06,5.2e-05,1.3e-05,-2.6e-05,-3.6e-05,-2.3e-05,2e-06,5.5e-05,-1.3e-05,-2.4e-05,-2.6e-05,-3e-06,-2e-05,0,-1.3e-05,-3.3e-05,-6e-06,-1.2e-05,-1.3e-05,2e-06,5e-06,4e-06,1.1e-05,-9e-06,-2e-06,5e-06,5e-06,6e-06,8e-06,-4.5e-05,1.3e-05,-8e-06,-1.9e-05,-6e-06,-2.7e-05,-6e-06,-1.2e-05,-6e-06,1e-06,2.9e-05,-3e-06,0,2e-06,-3e-06,1e-06,1e-06,0,2e-06,-6e-06,-2e-06,-6e-06,-1e-06,0
-6e-06,-1e-06,-1e-06,-4e-06,-1e-06,0,-1e-06,1e-06,-8e-06,-1e-06,-1e-06,-3e-06,2e-06,6e-06,5e-06,0,-1.4e-05,2.4e-05,-1e-06,1e-05,-7e-06,-5e-06,4e-06,-1e-06,0,1e-06,-1e-06,0,-1e-06,-1e-06,0,-6e-06,1.5e-05,-7.9e-05,-9e-06,3e-05,-1.3e-05,2.7e-05,2.1e-05,-3e-06,2e-06,3e-06,0,-7e-06,-2.5e-05,0.000118,-1.9e-05,7.6e-05,-7.2e-05,4e-06,8.1e-05,-9.5e-05,2e-06,-8e-06,-5.4e-05,-4.7e-05,4e-05,-6e-06,-5.2e-05,7.1e-05,-5.8e-05,8e-06,-6.3e-05,-7.2e-05,2e-06,-5.7e-05,-6.7e-05,2.7e-05,-5.2e-05,2.5e-05,-1e-05,6.1e-05,9e-06,1.7e-05,-8e-06,-4.6e-05,-2e-05,5e-06,2e-05,-1.3e-05,2e-05,9e-06,8e-06,3e-06,-1.4e-05,3e-06,1e-06,1e-06,1e-06,-5e-06,-8e-06,-1e-06,-1e-06,-2e-06,-3.7e-05,-2e-05,-3.1e-05,-2.4e-05,-3.9e-05,-1.9e-05,-1e-06,-2e-06,2.2e-05,4e-06,1e-05,6.6e-05,-2.4e-05,-9e-06,-2e-06,-9e-06,0,0,2e-06,1e-06,1e-06,4e-06,0,-2e-06,-6e-06,-4e-06,4e-06
-1e-06,-1e-06,1e-06,-4e-06,1e-06,-2e-06,-3e-06,1e-06,-6e-06,2e-06,1e-06,-3e-06,-4e-06,-1.6e-05,-4e-06,-1e-06,0,-1e-05,-1.2e-05,-1.5e-05,2e-06,-4e-06,-2e-06,-2e-06,-1e-06,-1e-06,2e-06,1e-06,-1e-06,-3e-06,0,-4e-06,-1.2e-05,-1.1e-05,0,-2.5e-05,-1.1e-05,0,-1e-06,2e-06,-3e-06,-5e-06,-2e-06,2.4e-05,2.2e-05,-7.8e-05,-3.6e-05,-0.000225,8e-06,-2.7e-05,-0.000118,-5e-06,-1.4e-05,0.000137,-0.000164,-9.1e-05,0,-2.4e-05,-3.2e-05,-9.7e-05,-3e-05,-6e-06,6e-05,6e-05,-4e-06,-3e-06,-8.1e-05,-6e-06,6e-06,-1.9e-05,-5e-06,7e-06,7e-06,-2.8e-05,-1.1e-05,2e-05,1.4e-05,-3.3e-05,-7e-06,-4e-06,-2e-06,-9e-06,1e-06,3e-06,-2e-06,1.1e-05,-1.2e-05,-3e-06,-5e-06,-6e-06,8e-06,-3e-06,-6e-06,4e-06,2.3e-05,5e-06,2.6e-05,-5e-05,1e-05,-1e-06,1.4e-05,9e-06,3e-06,-1e-06,1.1e-05,-7.3e-05,1.4e-05,1.1e-05,-4e-06,7e-06,-1e-06,1e-06,2e-06,0,-1e-06,2e-06,-1e-06,-2e-06,-4e-06,4e-06,-2e-06
-1e-06,-1e-06,-1e-06,-4e-06,1e-06,0,-1e-06,0,-7e-06,3e-06,0,3e-06,0,7e-06,-1e-06,-2e-06,8e-06,9e-06,-4e-06,1.9e-05,-2.2e-05,-5e-06,2e-06,0,2e-06,1e-06,-2e-06,0,1e-06,0,0,1.8e-05,-2e-06,7.5e-05,2e-06,1e-06,-1.2e-05,3e-06,-2e-06,-1.1e-05,-1e-06,1e-06,-3e-06,0,-1.1e-05,5.4e-05,-3e-06,5.8e-05,7e-06,-0.000106,9e-06,5.7e-05,5.1e-05,8e-06,-8.9e-05,0.000185,1.3e-05,-1.7e-05,-5.5e-05,0.000126,-2.2e-05,-3.6e-05,-9e-06,-1.4e-05,1.2e-05,1e-06,5e-05,-7e-06,-8e-06,-1.8e-05,2.3e-05,-4e-05,-3.2e-05,3.9e-05,-1.2e-05,-2e-06,1e-05,1e-06,-2e-06,5e-06,-3e-06,-3e-06,-1.4e-05,1.9e-05,3e-06,7e-06,2e-06,2e-06,-1.4e-05,3e-06,-1e-06,6e-06,2e-06,-2e-06,-9e-06,1.4e-05,-1.2e-05,-9e-06,0,3.1e-05,-2.4e-05,-7e-06,-2.8e-05,-6e-06,-7e-06,-2.4e-05,-2e-06,1e-05,-9e-06,0,-1e-06,-1e-06,-4e-06,1e-06,-3e-06,-2e-06,-1e-06,-2e-06,-1e-06,-6e-06,-2e-06
0,-1e-06,0,-3e-06,1e-06,0,0,1e-06,-6e-06,4e-06,-1e-06,1e-06,2e-06,4e-06,-1e-06,-2e-06,-1.3e-05,-1.1e-05,7e-06,6e-06,0,-4e-06,-2e-06,1e-06,-3e-06,-1e-06,2e-06,0,-1e-06,-1e-06,0,-1.2e-05,1.7e-05,-8.6e-05,-8e-06,1e-05,-1.3e-05,-5e-06,2e-05,-3e-06,-4e-06,-1e-06,-3e-06,7e-06,1.4e-05,-3.7e-05,2.6e-05,1e-06,1.7e-05,-1.6e-05,-5.7e-05,2.6e-05,-4.9e-05,6.8e-05,-6.2e-05,1.1e-05,-2.8e-05,1e-06,5.7e-05,-8e-05,-2e-05,6.1e-05,-2.6e-05,4e-06,-2.6e-05,4.9e-05,-3.1e-05,4.6e-05,-2.1e-05,7e-06,-5e-06,9e-06,1.4e-05,-4.1e-05,5e-06,-1.5e-05,-1.5e-05,-6e-06,9e-06,5e-06,4e-06,-3e-06,-4e-06,3e-06,1.5e-05,0,-6e-06,0,-1.1e-05,-3e-06,-1e-06,2e-06,-4e-06,-3e-06,2.3e-05,-8e-06,-1e-05,4.1e-05,1.8e-05,-2.5e-05,-4.9e-05,-3e-06,1.9e-05,2e-06,-7e-06,-4e-06,-1e-06,4e-06,-2e-06,1e-06,0,1e-06,3e-06,-2e-06,-1e-06,-2e-06,1e-06,-2e-06,0,-1e-06,3e-06
4e-06,0,1e-06,-3e-06,-1e-06,0,-3e-06,-1e-06,-6e-06,3e-06,1e-06,-2e-06,0,-1e-06,-1e-06,-1e-06,3e-06,9e-06,4e-06,-1.8e-05,-6e-06,-3e-06,1e-06,0,-2e-06,0,-2e-06,0,0,0,0,-7e-06,-1.8e-05,7.4e-05,1e-05,3e-06,-1e-05,-2.9e-05,-2.7e-05,1.2e-05,0,-4e-06,-3e-06,-3e-06,-1.8e-05,2.5e-05,1.6e-05,0.000111,-4.1e-05,4.5e-05,3.1e-05,-3.1e-05,1.2e-05,-0.000132,-9.1e-05,-4.7e-05,2e-06,-4e-06,8.1e-05,-4.6e-05,1e-05,2.4e-05,2.3e-05,1.4e-05,2.7e-05,-1.9e-05,-4.7e-05,2.6e-05,1.6e-05,1.2e-05,-2.6e-05,-8e-06,-1.7e-05,1.8e-05,1.1e-05,1.1e-05,1.4e-05,9e-06,-1.6e-05,9e-06,1e-06,8e-06,4e-06,2e-06,-1e-06,-1.6e-05,0,-1e-06,2e-06,-3e-06,-6e-06,-7e-06,-1e-06,2e-06,-2e-05,-5e-06,3.4e-05,4.3e-05,1.4e-05,-3e-06,-2.3e-05,7e-06,3e-06,2e-06,1.2e-05,2.4e-05,5e-06,8e-06,-2e-06,4e-06,-1e-06,0,0,3e-06,2e-06,-1e-06,0,-2e-06,0,3e-06,-1e-06
2e-06,0,-1e-06,-3e-06,0,1e-06,-1e-06,0,-6e-06,2e-06,2e-06,-1e-06,-1e-06,1e-05,0,0,3e-06,-7e-06,-6e-06,8e-06,6e-06,-4e-06,0,0,-3e-06,1e-06,2e-06,-1e-06,0,-1e-06,0,1.6e-05,9e-06,-6e-05,-1.2e-05,-1.9e-05,-1e-05,-6e-06,2e-05,1e-06,-5e-06,3e-06,-3e-06,-1.2e-05,-1.2e-05,-2.1e-05,-9e-06,-4.2e-05,6.6e-05,7e-06,7e-06,2.9e-05,8e-06,-5e-06,-1.6e-05,6e-06,-2.3e-05,-7e-06,-6e-05,7e-06,2.8e-05,-2.9e-05,-2e-06,-1.8e-05,-8e-06,3e-05,2e-06,-3.4e-05,-6e-06,1.7e-05,1.4e-05,-3.6e-05,-4e-06,-5e-06,-3e-06,5e-06,-1.4e-05,7e-06,1.1e-05,-1e-06,1.1e-05,2e-06,-8e-06,3e-06,1e-06,2e-06,-4e-06,-1e-06,4e-06,-1e-06,1e-06,0,0,-1e-06,-1.5e-05,6e-06,-2.3e-05,5e-06,-4e-06,1.1e-05,2.2e-05,-1e-05,-1.3e-05,-4e-06,-3e-06,4.1e-05,6e-06,-2.1e-05,-6e-06,-5e-06,0,-1e-06,0,0,0,0,2e-06,-1e-06,-1e-06,-4e-06,-1e-06
0,0,0,-3e-06,-2e-06,0,0,-1e-06,-5e-06,0,0,-2e-06,1e-06,-2e-06,-1e-06,0,-7e-06,7e-06,4e-06,-1.5e-05,-4e-06,-4e-06,1e-06,1e-06,1e-06,-1e-06,-1e-06,0,0,-2e-06,0,-4e-06,5e-06,3.1e-05,1e-05,1.8e-05,-1.2e-05,1.5e-05,-2.4e-05,-3e-06,3e-06,-3e-06,-2e-06,-1e-06,2.2e-05,2.5e-05,-1.9e-05,2.5e-05,-2.3e-05,5.4e-05,-1.9e-05,1.6e-05,-1.1e-05,-7.1e-05,8e-06,1.4e-05,-2.7e-05,-8e-06,-6e-05,-7.6e-05,3e-05,-6.2e-05,-1.6e-05,3.8e-05,9e-06,-9.4e-05,-1.5e-05,-2.9e-05,7e-06,8e-06,1.2e-05,1.4e-05,2.4e-05,1.2e-05,-7e-06,-1.6e-05,0,1.6e-05,-4e-06,-4e-06,-1e-05,-4e-06,-9e-06,4e-06,-1e-05,1.6e-05,2e-06,0,3e-06,1e-05,-5e-06,-1e-06,2e-06,-1e-06,2.1e-05,0,4e-06,2.8e-05,6e-06,1e-05,2.3e-05,1e-05,9e-06,-2e-06,-6e-06,-1e-06,-1.2e-05,-2.7e-05,-6e-06,1e-06,0,0,-3e-06,-1e-06,-1e-06,3e-06,-2e-06,-1e-06,-2e-06,0,1e-06
2e-06,0,-1e-06,-3e-06,1e-06,0,-2e-06,0,-6e-06,-1e-06,0,-1e-06,-1e-06,1e-05,1e-06,0,-3e-06,-6e-06,6e-06,1.1e-05,6e-06,-3e-06,-1e-06,0,-2e-06,0,1e-06,0,1e-06,-1e-06,0,-5e-06,-9e-06,-8e-06,-7e-06,-3e-06,-1.2e-05,1e-06,1.9e-05,-5e-06,3e-06,0,-1e-06,-1e-06,-1.4e-05,-2.9e-05,-2e-06,-0.000108,-0.000126,2.6e-05,-9e-06,-1.1e-05,7e-06,5.9e-05,8e-06,5.4e-05,-1.1e-05,-9e-06,7e-06,6e-05,2.8e-05,2.3e-05,4e-06,-5e-05,-1e-06,4.4e-05,-4e-05,1.1e-05,-6e-06,-2e-05,-1.3e-05,3.4e-05,-2e-06,-8e-06,-1e-06,1.1e-05,1.5e-05,1.1e-05,1e-06,-7e-06,-1e-06,-3e-06,5e-06,-1e-06,1e-06,-3e-06,-2e-06,1e-06,3e-06,0,-1e-06,6e-06,0,3e-06,-3e-06,-2e-06,1e-05,5e-06,-2.3e-05,-2.5e-05,-2.9e-05,-7e-06,-4e-06,1e-06,3e-06,-2.6e-05,-9e-06,4e-06,-2e-06,3e-06,-1e-06,0,3e-06,1e-06,0,0,0,-1e-06,-2e-06,2e-06,-1e-06
1e-06,0,2e-06,-3e-06,0,1e-06,-1e-06,1e-06,-6e-06,-2e-06,1e-06,3e-06,1e-06,-5e-06,1e-06,0,7e-06,0,-5e-06,4e-06,6e-06,-3e-06,-1e-06,-1e-06,0,0,-1e-06,0,-1e-06,-1e-06,0,-3e-06,2e-06,-7.2e-05,5e-06,-6e-06,-1e-05,-2e-06,-2.3e-05,-5e-06,0,1e-06,0,1e-05,-1.4e-05,2.2e-05,1.2e-05,9.4e-05,0.000179,-4.3e-05,-5.3e-05,-3e-05,1e-05,3.7e-05,2.1e-05,4.5e-05,-1.4e-05,-5e-06,7e-06,9e-06,3e-05,1.4e-05,2e-05,-2.4e-05,-4e-06,-2e-06,4.9e-05,1.1e-05,8e-06,-3e-06,-6e-06,4e-06,-1e-06,0,-4e-06,-6e-06,-1.3e-05,7e-06,1e-05,-2e-06,1e-05,3e-06,-1e-05,-7e-06,-5e-06,-7e-06,0,-1e-06,-5e-06,-5e-06,5e-06,-2e-06,-2e-06,0,2.1e-05,1e-06,-1e-05,-2.7e-05,1.1e-05,9e-06,-2.5e-05,-3e-06,0,0,4e-06,-3.4e-05,1.3e-05,8e-06,-2e-06,-3e-06,-1e-06,-1e-06,-1e-06,0,1e-06,0,-1e-06,-1e-06,-1e-06,-2e-06,2e-06
1e-06,0,-1e-06,-3e-06,0,0,-1e-06,-1e-06,-5e-06,-2e-06,1e-06,0,2e-06,-1.6e-05,-1e-06,0,-7e-06,6e-06,-5e-06,-2e-06,-9e-06,-4e-06,1e-06,-1e-06,1e-06,0,0,0,0,-1e-06,0,1.1e-05,3e-06,9.4e-05,-3e-06,1e-06,-9e-06,5e-06,1.7e-05,-8e-06,-1e-06,-2e-06,0,-1e-06,5e-06,-2.2e-05,1e-05,-2.9e-05,-4.6e-05,-3.7e-05,2.4e-05,4.4e-05,-2.1e-05,2e-05,1.3e-05,-0.000131,-2.1e-05,-3e-06,5.2e-05,-3.3e-05,2.1e-05,-1.8e-05,-1.2e-05,3.4e-05,-2e-06,7e-06,1e-06,-2.8e-05,4e-06,1.7e-05,1.4e-05,-5e-06,-5e-06,9e-06,-2e-06,0,-5e-06,8e-06,-1.8e-05,1e-06,-6e-06,-1e-06,6e-06,-5e-06,5e-06,1e-06,0,1e-06,-8e-06,-4e-06,-1e-06,0,1e-06,1e-06,-2.9e-05,-1e-06,7e-06,-2.4e-05,-2e-05,1.2e-05,1.4e-05,9e-06,7e-06,-2e-06,-6e-06,-2e-05,-1.2e-05,7e-06,-4e-06,-3e-06,0,1e-06,1e-06,2e-06,-1e-06,-2e-06,0,-1e-06,0,1e-06,0
1e-06,0,1e-06,-3e-06,0,1e-06,-2e-06,1e-06,-5e-06,-1e-06,-1e-06,-1e-06,-1e-06,1e-06,-1e-06,0,1e-06,-1e-06,1e-06,3e-06,5e-06,-3e-06,0,0,-1e-06,1e-06,0,0,1e-06,0,0,-6e-06,-1e-06,-6.1e-05,0,6e-06,-1e-05,-3e-06,-1.3e-05,7e-06,3e-06,2e-06,1e-06,0,7e-06,3e-05,-3e-06,4.6e-05,-9.4e-05,-4e-05,-5.6e-05,3e-05,3.3e-05,0,9e-06,-9.8e-05,7e-06,-1e-05,1.2e-05,6e-05,9e-06,-5.8e-05,-1.2e-05,-3.9e-05,2e-06,1.3e-05,-3.8e-05,-1.9e-05,-1.5e-05,4e-06,-2e-06,-8e-06,-2e-05,-6e-06,6e-06,1.1e-05,2e-05,3e-06,1.5e-05,5e-06,0,3e-06,-1e-06,-8e-06,0,3e-06,2e-06,0,-6e-06,6e-06,-5e-06,-4e-06,0,2e-06,0,1e-06,-2e-06,-3.4e-05,2.6e-05,-7e-06,-7e-06,-9e-06,-8e-06,0,1e-06,8e-06,3e-06,1.3e-05,-5e-06,2e-06,-1e-06,0,-2e-06,-2e-06,0,0,0,-1e-06,2e-06,0,-2e-06
-1e-06,0,-1e-06,-3e-06,0,0,0,0,-5e-06,-1e-06,0,-1e-06,-1e-06,-5e-06,-1e-06,1e-06,2e-06,-9e-06,2e-06,-1.1e-05,4e-06,-3e-06,0,0,1e-06,0,-1e-06,0,0,0,0,-6e-06,-1e-05,9e-06,3e-06,-6e-06,-9e-06,-1e-05,9e-06,1.1e-05,0,-2e-06,1e-06,-2e-06,-2e-06,-3.1e-05,-1e-05,-6.4e-05,0.000112,-3.6e-05,6.2e-05,-2.1e-05,-2.8e-05,-6.7e-05,-3e-06,8.2e-05,-8e-06,-8e-06,-7.8e-05,-1.3e-05,-1e-05,2.3e-05,2.6e-05,2.3e-05,-1e-06,-4.5e-05,4.7e-05,1.1e-05,1.4e-05,-1e-05,-1.6e-05,-1.9e-05,-1.4e-05,9e-06,5e-06,-1.6e-05,-2.2e-05,-1e-05,-2e-06,4e-06,-6e-06,0,-1e-06,5e-06,5e-06,-1e-06,1e-06,0,-4e-06,2e-06,6e-06,2e-06,0,-1e-06,9e-06,3e-06,0,-9e-06,-1.7e-05,-1.3e-05,-2.6e-05,4e-06,2e-06,2e-06,4e-06,4.6e-05,9e-06,-2e-06,-3e-06,-3e-06,0,0,2e-06,0,0,0,-1e-06,-1e-06,2e-06,-3e-06,1e-06
0,0,1e-06,-3e-06,0,0,-1e-06,0,-5e-06,0,1e-06,-1e-06,0,-2e-06,0,0,-2e-06,8e-06,-5e-06,1e-06,-5e-06,-4e-06,0,0,-1e-06,0,1e-06,0,0,-1e-06,0,1.1e-05,8e-06,4.3e-05,-5e-06,0,-8e-06,8e-06,-3e-06,-2e-06,0,0,1e-06,-6e-06,-9e-06,3e-05,-4e-06,3.1e-05,-6.2e-05,1.5e-05,-6e-05,-6e-05,-1e-06,2.3e-05,-5.8e-05,5.7e-05,1.4e-05,2e-06,-1.6e-05,-1.5e-05,-1.6e-05,3.8e-05,-1.8e-05,1.5e-05,4e-06,2.4e-05,-1e-05,1.5e-05,-1.1e-05,1e-06,1.1e-05,7e-06,-3e-06,-3e-06,-2e-06,9e-06,4e-06,2e-06,-6e-06,0,5e-06,-4e-06,8e-06,0,-4e-06,-1.2e-05,2e-06,0,0,-1e-06,-2e-06,2e-06,-1e-06,0,2e-06,-4e-06,-1e-06,-3e-06,2.5e-05,1.7e-05,-2.1e-05,1e-06,6e-06,-3e-06,-4e-06,3e-06,-9e-06,4e-06,-1e-06,2e-06,0,-1e-06,0,1e-06,0,1e-06,1e-06,-1e-06,1e-06,1e-06,0
-2e-06,0,0,-3e-06,0,0,-2e-06,1e-06,-5e-06,1e-06,0,0,0,9e-06,1e-06,0,-4e-06,3e-06,2e-06,2e-06,1e-06,-3e-06,-1e-06,0,1e-06,0,-2e-06,0,0,0,0,-2e-06,7e-06,-5.7e-05,6e-06,3e-06,-8e-06,6e-06,3e-06,-5e-06,-2e-06,2e-06,1e-06,5e-06,-2e-06,-3.4e-05,4e-06,-5.1e-05,8e-06,4e-05,4.8e-05,1.7e-05,1.8e-05,-2.8e-05,-8.6e-05,7.4e-05,1.9e-05,-2e-06,3.3e-05,5e-05,-2.7e-05,1.6e-05,-1.5e-05,-1.9e-05,-6e-06,-1e-05,-2.5e-05,6e-06,-1.1e-05,3e-06,5e-06,1.6e-05,1.3e-05,2e-05,-3e-06,-3e-06,1.2e-05,-1.6e-05,1.2e-05,-2e-06,5e-06,2e-06,3e-06,5e-06,2e-06,-2e-06,2e-06,0,1e-06,-3e-06,0,-1e-06,-1e-06,0,1.3e-05,-1e-06,-5e-06,3e-05,-2.8e-05,1e-06,1e-06,-5e-06,-3e-06,-1e-06,-2e-06,1.1e-05,1e-06,-5e-06,-4e-06,3e-06,0,0,1e-06,-1e-06,0,-1e-06,-1e-06,-1e-06,0,0,-1e-06
