7e-06,3.6e-05,6.4e-05,3.5e-05,8.3e-05,6.1e-05,5.8e-05,6.5e-05,2.9e-05,0.000106,4e-06,7.5e-05,7.6e-05,9.9e-05,0.000263,0.000259,0.000164,4e-05,9.8e-05,8.9e-05,7.7e-05,1.9e-05,2e-05,1.5e-05,8.1e-05,5.4e-05,3.7e-05,6.4e-05,1.9e-05,6.4e-05,4.9e-05,1.3e-05,3.4e-05,5.9e-05,0.000301,0.000441,0.000447,0.000204,0.000257,0.000291,0.000378,0.000953,0.000263,0.000321,2.3e-05,0.00011,4e-05,0.000102,3.3e-05,0.000183,2.7e-05,1.1e-05,2.2e-05,2.4e-05,0,5.8e-05,2e-06,3.6e-05,4.2e-05,7e-06,5e-05,2.5e-05,1e-06,6e-06,2.2e-05,1e-06,4.2e-05,3e-06,3.4e-05,2.9e-05,2e-05,2.7e-05,2.7e-05,2e-05,3.2e-05,8e-06,9e-06,2.1e-05,2.3e-05,1.6e-05,2.1e-05,1.3e-05,1e-05,2.5e-05,0.000462,0.000291,3.2e-05,0.000288,0.000209,0.000681,3e-06,2.5e-05,0.000361,0.000244,6e-05,0.000193,5.8e-05,6.6e-05,9.2e-05,0.000209,1.6e-05,4e-06,6e-06,3e-06,5e-05,1e-05,3.2e-05,9.8e-05,2.3e-05,3e-06,3.5e-05,1.5e-05,7e-06,2.2e-05,3.2e-05,8e-06,2.2e-05,1.5e-05,3.2e-05,2.1e-05,2.5e-05
9.4e-05,0.000119,9e-05,0.000187,9.7e-05,0.00019,0.000283,0.000239,0.000245,0.000115,0.000136,0.000343,0.000173,0.00024,0.000668,0.00073,0.000244,0.000324,0.000277,0.000369,0.000219,0.000176,0.000146,0.000139,0.000174,0.000236,0.000171,0.000172,0.000203,0.000128,0.000197,0.000149,8.8e-05,0.000151,0.000681,0.000463,0.000889,0.000991,0.000371,0.000328,0.001118,0.002193,0.001848,0.002263,0.00104,0.000241,0.000192,0.000196,0.000206,0.000136,0.000243,0.000159,0.000117,0.000141,0.000147,0.000111,0.000129,0.000114,0.000153,0.000138,9.4e-05,0.000124,0.000112,8.7e-05,8e-05,9.1e-05,0.000105,8.4e-05,5.5e-05,0.000115,0.00014,7.5e-05,9.1e-05,5.7e-05,8.5e-05,8.3e-05,2.7e-05,5.7e-05,8.4e-05,4.6e-05,4.3e-05,8e-05,7e-05,8.1e-05,0.000875,0.000902,0.000677,0.000599,0.000196,9e-04,0.001824,0.001049,0.000376,0.000265,0.000443,0.000186,0.000171,8e-05,9.5e-05,0.000381,0.000144,0.000109,7.3e-05,0.000102,9.7e-05,0.000145,6.3e-05,0.000269,8.1e-05,0.000186,9.1e-05,3.2e-05,6.9e-05,3.2e-05,5.1e-05,7e-05,4.3e-05,4.9e-05,0.000109,5.9e-05,6.6e-05
5.5e-05,9.3e-05,5.6e-05,0.000136,8.9e-05,5.5e-05,0.000217,0.000158,2.7e-05,4.5e-05,0.000121,0.000414,0.000375,0.000265,0.00059,0.001046,0.000561,0.000265,0.000114,0.000142,4.8e-05,6.3e-05,4e-05,8.5e-05,4e-05,5.4e-05,6.6e-05,5.1e-05,7.1e-05,1.2e-05,6.6e-05,4.2e-05,2.8e-05,5.1e-05,0.000579,0.000305,0.000522,0.000248,0.000117,0.000499,0.001218,0.000568,0.001791,0.002014,0.000794,0.000527,0.000118,0.000136,7.2e-05,0.000309,0.000283,0.00012,0.000125,6.5e-05,6.9e-05,0.000101,0.000117,5e-06,5.5e-05,3.6e-05,1.9e-05,4.4e-05,5.5e-05,5.1e-05,1.6e-05,7e-05,2.6e-05,7e-06,3e-06,6.4e-05,0.000103,5.5e-05,3.3e-05,2.6e-05,4.4e-05,2.6e-05,2.5e-05,6.2e-05,1.6e-05,1.3e-05,1.1e-05,5.6e-05,3.4e-05,1.3e-05,0.001012,0.001102,0.000285,0.00038,0.000178,0.000533,0.002247,0.001066,0.000532,0.000222,0.000181,0.000234,0.00013,0.00014,0.000184,0.000348,0.000228,0.000137,0.000108,0.000114,0.000116,0.00015,9.1e-05,0.000227,0.000352,0.000131,0.000169,7.8e-05,0.000146,0.000135,3.2e-05,3.7e-05,3.3e-05,3.6e-05,1e-04,4.9e-05,1.8e-05
7.8e-05,1.3e-05,3.2e-05,7.2e-05,4.2e-05,2.9e-05,0.000313,0.000225,0.000152,0.000178,0.000201,0.000609,0.00039,0.000498,0.000782,0.000709,0.000727,0.000493,0.000322,0.000213,0.000106,6e-05,6.1e-05,0.000103,5.5e-05,2.7e-05,7.1e-05,6.4e-05,7.1e-05,1.3e-05,2.7e-05,0.000106,8e-05,0.000134,0.00053,0.001231,5e-04,0.000426,8.8e-05,0.000955,0.000982,0.001209,0.001457,0.003612,0.002106,0.00163,0.001011,0.000554,0.000441,0.000506,0.000408,0.000269,0.000178,0.000112,8.9e-05,0.000104,2.1e-05,5.3e-05,4.9e-05,1.4e-05,5.8e-05,4.1e-05,6e-05,7.4e-05,2.8e-05,6.6e-05,2.5e-05,3.5e-05,4.9e-05,4e-06,0.000128,7.5e-05,4.5e-05,6.6e-05,6.9e-05,3.2e-05,3.8e-05,6e-05,4e-05,1.9e-05,4.6e-05,1e-05,4.9e-05,5.2e-05,0.001054,0.000876,0.000914,0.000528,9.8e-05,0.001172,0.002373,0.002021,0.002206,0.00148,0.000697,0.00046,0.000219,0.000106,0.000336,0.00056,0.000341,0.00019,0.000157,3.5e-05,8e-05,8.6e-05,3.1e-05,0.000138,0.000703,0.000539,0.000415,0.000129,0.000108,5.9e-05,8.4e-05,0.000101,4.4e-05,6.4e-05,4.7e-05,2.9e-05,6.7e-05
5.7e-05,3.5e-05,8.8e-05,0.00012,0.000133,6.7e-05,0.000388,0.000664,0.000213,0.000113,1.1e-05,0.000377,0.001114,0.001065,0.000669,0.000924,0.000764,0.000217,0.000276,0.000133,8.9e-05,3.9e-05,2.3e-05,7e-05,5.4e-05,3.9e-05,2.7e-05,1.2e-05,3.1e-05,2.6e-05,8.2e-05,4.8e-05,6.1e-05,6.5e-05,0.000551,0.002217,0.000791,0.00016,0.00015,0.001197,0.001273,0.000427,0.001677,0.00436,0.00309,0.000598,0.000109,0.000285,0.000118,0.000904,0.000355,8e-05,0.000208,0.000125,9.2e-05,4.9e-05,2.4e-05,1.7e-05,3.9e-05,6e-05,2.5e-05,1.6e-05,2.5e-05,2.4e-05,3.2e-05,4.1e-05,1.6e-05,4.9e-05,1.8e-05,3.9e-05,7.4e-05,9e-06,2.7e-05,4.1e-05,2.2e-05,3.3e-05,2.4e-05,1.8e-05,1.5e-05,2.4e-05,5.2e-05,6.3e-05,6.5e-05,9.6e-05,0.001148,0.000978,0.000444,0.000194,0.000246,0.000568,0.003421,0.001262,0.000428,0.000519,0.000302,1.6e-05,4.3e-05,7.5e-05,0.000394,0.000512,0.000163,0.000258,3.8e-05,7.2e-05,8.2e-05,8e-05,5.3e-05,4.4e-05,0.000965,0.00055,0.000222,7.5e-05,1.6e-05,9.9e-05,4.9e-05,7.1e-05,4.3e-05,2.4e-05,3e-05,2.6e-05,7.4e-05
2.4e-05,2e-05,0.000242,0.000118,0.000121,8.3e-05,0.000574,0.000899,0.000594,0.000218,0.000192,0.000254,0.001876,0.000653,0.000973,0.002819,0.001378,0.000792,0.000354,0.000168,0.000174,8.4e-05,3.8e-05,5.4e-05,8.2e-05,7.1e-05,8e-05,3.6e-05,1.5e-05,3.4e-05,4.7e-05,5.4e-05,4.4e-05,0.000102,0.000545,0.001993,0.000292,0.000266,0.000176,0.000988,0.001446,0.001695,0.002979,0.002168,0.001589,0.001476,0.000755,0.00018,0.000151,0.001197,0.001159,0.000293,0.000247,0.000171,0.000117,7e-05,5.5e-05,4.2e-05,1.2e-05,6.6e-05,6.6e-05,8.6e-05,0.000107,5.1e-05,3.1e-05,1.7e-05,6e-05,9.1e-05,7e-05,8.2e-05,6.7e-05,3e-05,6.6e-05,3.5e-05,1.4e-05,2.5e-05,2.8e-05,3.6e-05,1.2e-05,2e-05,4.5e-05,5e-05,9.3e-05,7.2e-05,0.001185,0.001412,0.000157,0.000305,0.000337,0.002198,0.002468,0.000976,0.000805,0.00024,0.000257,0.000201,0.000161,0.000194,0.000253,0.00217,0.000827,0.000477,0.000281,0.000159,6.1e-05,8.2e-05,1.5e-05,7.1e-05,0.001194,0.000392,3.7e-05,0.000214,6.6e-05,0.000156,2.8e-05,3.7e-05,4e-05,2.3e-05,3.8e-05,3.8e-05,6.4e-05
4.5e-05,3.9e-05,0.000391,0.000303,7.3e-05,0.000215,0.000594,0.000665,0.000374,0.000108,0.000183,0.000173,0.001685,0.001036,0.000829,0.002865,0.001368,0.000612,0.00067,0.00053,0.000199,6e-05,4.2e-05,7.5e-05,9.3e-05,9.4e-05,9.1e-05,5.2e-05,3.7e-05,5e-05,5.9e-05,3.3e-05,6.5e-05,0.000179,0.000573,0.001718,0.001324,0.000822,0.000335,0.00127,0.001882,0.001415,0.00485,0.005831,0.001331,0.000685,0.00025,0.000178,0.000119,0.001411,0.002549,0.001621,0.000553,0.000213,0.000139,5.2e-05,1.3e-05,6.1e-05,7.3e-05,8e-06,6.5e-05,0.000157,3.3e-05,7.7e-05,4.4e-05,3.8e-05,4.3e-05,6.9e-05,4.9e-05,9.8e-05,0.000134,9e-05,1.2e-05,2.9e-05,2.8e-05,2.3e-05,2e-05,3.7e-05,6e-05,3.6e-05,6e-05,5.1e-05,0.000189,0.000219,0.001372,0.000942,0.001023,0.000536,0.000402,0.004569,0.004482,0.002593,0.000487,0.000893,0.000336,0.000118,4.2e-05,0.000108,0.000355,0.00314,0.002486,0.000915,0.00027,3.3e-05,7.9e-05,6.1e-05,4.1e-05,2.6e-05,0.001275,0.000824,0.000436,0.000137,0.000223,0.00012,0.000341,0.000229,0.000102,2.4e-05,7.1e-05,8.1e-05,0.000107
4.6e-05,5.4e-05,0.000431,0.000409,0.000363,0.000402,0.000719,0.000235,0.000117,8e-05,3.4e-05,0.000112,0.000846,0.001797,0.000407,0.000701,0.001012,0.000299,0.000112,5.3e-05,0.000139,9.7e-05,8e-05,4.8e-05,1.8e-05,9.8e-05,2.9e-05,5e-06,7.8e-05,5.2e-05,7.6e-05,6.8e-05,0.00014,0.000341,0.000726,0.004653,0.003234,0.002208,0.000779,0.001871,0.002632,0.003087,0.005368,0.004763,0.001861,0.002101,0.00104,0.000313,0.000125,0.001176,0.001902,0.001045,0.000438,0.000213,6.2e-05,9.8e-05,1e-05,7.7e-05,6.2e-05,7e-05,0.000126,0.000115,9.9e-05,0.00017,0.00012,8.9e-05,9e-06,8.1e-05,4.7e-05,0.000143,0.000199,1e-04,7.8e-05,4.1e-05,2.4e-05,2.2e-05,2.7e-05,2.2e-05,3.7e-05,4.1e-05,6.2e-05,9.5e-05,0.000287,0.000259,0.001048,0.002175,0.00125,0.000491,0.000551,0.00599,0.002531,0.000959,0.002147,0.001272,0.000639,0.000303,0.000157,0.000169,0.000655,0.002858,0.001583,0.000628,0.000195,7.8e-05,3.4e-05,7.2e-05,4.6e-05,0.000116,0.001086,0.000515,0.000187,0.000271,0.000182,0.000341,0.00066,0.000339,9e-05,5.2e-05,7.9e-05,5.8e-05,4.4e-05
6.3e-05,1.3e-05,0.000403,8.4e-05,0.000173,0.000174,0.000719,0.000389,0.000145,0.000105,8.4e-05,0.000475,0.000691,0.002564,0.001809,0.001886,0.001262,0.001082,0.000474,0.000171,0.000123,8.2e-05,0.00014,1.7e-05,4.1e-05,9.9e-05,2.9e-05,1.7e-05,7e-05,7.6e-05,9.5e-05,0.000136,0.000112,0.000254,0.000334,0.005963,0.003477,0.001152,0.000879,0.003166,0.004322,0.004818,0.001141,0.004314,0.005844,0.002082,0.000731,0.000115,0.000143,0.000632,0.000658,0.000234,5.6e-05,4e-05,9.8e-05,5.3e-05,8.5e-05,3e-06,5.3e-05,3.6e-05,1e-04,0.000224,0.000186,0.000102,5.3e-05,8.8e-05,0.000123,8e-05,6e-05,0.00018,0.000185,0.000153,8.4e-05,0.000119,6.5e-05,5.5e-05,2.6e-05,4e-05,5.1e-05,0.000155,5.5e-05,0.00011,0.000204,0.000205,0.001014,0.003105,0.001105,0.000526,0.001107,0.007205,0.005478,0.00355,0.00181,0.000616,0.000208,3.9e-05,8.8e-05,0.00012,0.000838,0.001967,0.000568,0.000246,7.9e-05,0.000102,0.000157,3.4e-05,3.2e-05,0.000139,0.001606,0.000664,0.000121,0.000327,0.000102,0.000337,0.000445,0.000216,5.8e-05,2e-05,2.2e-05,4.4e-05,8.6e-05
3.1e-05,2.2e-05,0.000311,0.000295,0.00032,0.000102,0.000771,0.001061,0.000711,0.000303,0.000281,0.001165,0.00131,0.002182,0.001655,0.002905,0.002565,0.001213,0.000518,0.00043,0.000226,8.3e-05,0.000118,0.000145,0.000127,1.5e-05,4.6e-05,4.4e-05,3.6e-05,4.7e-05,0.000123,0.000153,0.000282,0.000364,0.000717,0.004713,0.004802,0.002738,0.000917,0.003948,0.008786,0.002396,0.001273,0.002128,0.005188,0.003626,0.001242,0.000131,0.000203,0.001328,0.001849,0.001183,0.000482,8.8e-05,8.3e-05,6.7e-05,8.2e-05,7.6e-05,7.7e-05,4.6e-05,4.9e-05,0.000199,0.000251,0.000269,9.5e-05,4.1e-05,0.000124,8.5e-05,4e-05,0.00013,0.000356,0.000439,0.000271,0.000227,0.000148,4.4e-05,2.4e-05,3.4e-05,3.3e-05,0.000189,0.000129,0.000104,6.3e-05,0.00015,0.000878,0.002371,0.002599,0.001265,0.00125,0.006101,0.003039,0.00118,0.00171,0.000456,0.000247,0.000313,0.000113,0.000141,0.00112,0.002112,0.001526,0.000646,0.000247,0.00011,0.000107,9.5e-05,6.5e-05,0.000152,0.002369,0.002701,0.001613,0.000548,0.00013,0.000344,0.000555,0.000386,0.000142,0.000129,3.5e-05,3.6e-05,2.1e-05
5.5e-05,4.2e-05,0.000173,3.8e-05,0.000182,0.000144,0.000745,0.000875,0.000423,0.000187,5.7e-05,0.001724,0.001819,0.002491,0.002417,0.001918,0.000648,0.000345,0.000205,0.000153,5.6e-05,3e-06,5.5e-05,2.9e-05,2.8e-05,2.8e-05,4e-05,4.8e-05,4.4e-05,3.9e-05,5.6e-05,7.2e-05,0.000126,0.000223,0.00038,0.002446,0.002749,0.001226,0.001026,0.00148,0.004801,0.005183,0.004514,0.00445,0.002949,0.001382,0.000668,0.000179,0.000166,0.001842,0.001714,0.000673,0.000177,0.000101,0.000106,5.1e-05,2.5e-05,3.7e-05,3.5e-05,2.2e-05,4.4e-05,9.3e-05,0.000148,9.6e-05,0.000111,2.8e-05,7e-05,6.6e-05,6.4e-05,0.000181,0.00023,0.000225,0.000125,2.2e-05,3.3e-05,9e-06,1.8e-05,1e-05,6e-05,0.000118,8.9e-05,3.5e-05,9.7e-05,0.000141,0.000651,0.001094,0.000679,0.000536,0.000885,0.005186,0.003709,0.002668,0.001295,0.001123,0.000863,0.000399,0.000173,0.000119,0.001108,0.002098,0.001243,0.000432,3.5e-05,8.4e-05,4.6e-05,2.4e-05,5.1e-05,0.000192,0.002599,0.002462,0.001068,0.000255,0.000194,0.00036,0.00041,0.000184,0.000149,7.6e-05,8.3e-05,2.4e-05,1.2e-05
4.5e-05,3e-05,3e-05,9e-05,0.000146,9.1e-05,0.000712,8.7e-05,4.8e-05,0.000121,0.000172,0.002033,0.001939,0.000659,0.001806,0.00113,0.000399,0.000308,8e-06,3.3e-05,2e-05,6e-05,1.8e-05,3.7e-05,2.4e-05,1.3e-05,3.5e-05,1.8e-05,8e-06,4e-05,5.7e-05,3.7e-05,8.6e-05,0.000112,0.000278,0.001742,0.000317,0.000337,0.000343,0.001318,0.001508,0.001559,0.001091,0.001161,0.000295,0.000927,0.000303,8.2e-05,7.7e-05,0.001857,0.000329,0.000156,5.4e-05,3.3e-05,1.7e-05,2.2e-05,5e-06,2.5e-05,2.1e-05,9e-06,1.8e-05,7.2e-05,8e-05,4.5e-05,9.4e-05,3.4e-05,7.6e-05,5.5e-05,7e-06,0.000136,0.000194,2.8e-05,5.7e-05,2.5e-05,2.3e-05,7e-06,1.1e-05,8e-06,4.5e-05,3.1e-05,3.6e-05,2.3e-05,0.000106,5.9e-05,0.000536,0.000287,0.000257,0.000379,0.001263,0.005047,0.002306,0.001034,0.000533,0.00048,0.000148,0.000127,6.1e-05,3.1e-05,0.001016,0.000661,0.000318,7.8e-05,0.000115,2.4e-05,2.4e-05,5.6e-05,2.4e-05,0.000156,0.00179,0.000151,0.00026,0.000103,9.3e-05,0.000275,4.3e-05,7.3e-05,3.6e-05,1.9e-05,5.4e-05,3.6e-05,2.9e-05
2.5e-05,1.7e-05,8.6e-05,5.3e-05,0.000157,0.000204,0.000469,0.00042,0.000216,4.8e-05,0.000162,0.001971,0.000538,0.000219,0.001551,0.00106,0.000356,0.000213,0.000204,9.4e-05,7e-06,3.4e-05,5e-06,4.4e-05,3.3e-05,3.3e-05,1.6e-05,1.1e-05,7e-06,2.2e-05,5e-05,4.8e-05,5.8e-05,0.000134,0.000333,0.001078,0.001,0.000548,0.000354,0.001222,0.002207,0.000303,0.00042,0.000549,0.001399,0.000502,0.000257,8.8e-05,6.1e-05,0.000917,0.000395,0.000108,7e-06,9e-06,3.6e-05,3e-05,1.2e-05,1.5e-05,3.9e-05,1.5e-05,1.6e-05,6.6e-05,5.3e-05,4.9e-05,5.4e-05,7.6e-05,6.3e-05,7.5e-05,3.9e-05,0.000139,8.2e-05,5.5e-05,3.6e-05,2.5e-05,3.1e-05,2.6e-05,1.9e-05,8e-06,3.4e-05,2.1e-05,2.5e-05,1.7e-05,8.1e-05,5.3e-05,0.000399,0.000367,0.000335,0.000532,0.001066,0.003873,0.001139,0.001134,0.000677,0.000188,0.000228,6.8e-05,8.2e-05,0.000119,0.000812,0.000492,0.000198,2.5e-05,4.9e-05,1e-06,1.5e-05,4.3e-05,4.2e-05,0.000164,0.000617,0.000391,0.000216,7.8e-05,0.000115,0.000197,8.7e-05,8.6e-05,3.2e-05,1.8e-05,1.7e-05,2.1e-05,3.2e-05
1.5e-05,1.3e-05,8.1e-05,1e-05,0.000109,0.000227,0.000407,0.000156,6.1e-05,3.5e-05,0.000163,0.001408,0.000321,0.000394,0.0012,0.000531,0.000299,0.000206,2.4e-05,3.8e-05,3.8e-05,1.9e-05,5.3e-05,3e-05,1.5e-05,1.4e-05,9e-06,7e-06,7e-06,1.1e-05,2.7e-05,1.3e-05,8.7e-05,5.8e-05,0.000368,0.000516,0.000691,0.000393,0.000329,0.001086,0.001721,0.001048,0.00086,0.001096,0.003055,0.001181,0.000477,0.000113,9.1e-05,9e-05,0.000567,1e-04,1.4e-05,2.2e-05,1.2e-05,9e-06,2.1e-05,1.5e-05,1.6e-05,1.1e-05,1.5e-05,6e-05,2.5e-05,8.4e-05,1.5e-05,1.6e-05,3.4e-05,6.1e-05,4.2e-05,9.9e-05,0.000258,0.000133,0.00012,1.5e-05,7e-06,7e-06,1.6e-05,1.2e-05,3.3e-05,2.6e-05,1.4e-05,3.5e-05,6.2e-05,2.8e-05,0.000199,0.001187,0.000441,0.000745,0.00105,0.003563,0.002374,0.002226,0.000655,0.000297,0.000133,5.3e-05,7.4e-05,6e-05,0.00056,0.000255,0.000177,2.4e-05,3e-06,6.6e-05,3.2e-05,1.4e-05,1.9e-05,0.000144,0.00033,0.000382,0.000123,3e-06,0.000102,0.000152,0.000138,3.8e-05,5.8e-05,2.2e-05,3.6e-05,7e-06,2.9e-05
1.5e-05,2e-05,6.3e-05,7.4e-05,7.1e-05,0.000171,2.8e-05,6.9e-05,0.000104,7.8e-05,0.000115,0.000954,0.000367,5.1e-05,0.001115,0.001509,0.000545,0.000174,4.7e-05,6.6e-05,3e-05,5.3e-05,5.2e-05,3e-05,2.3e-05,3e-05,1.7e-05,1.1e-05,1.1e-05,1.9e-05,1.4e-05,1.9e-05,7.3e-05,6.1e-05,0.000301,0.000852,7e-04,0.000435,0.00029,0.000913,0.002967,0.003908,0.001698,0.001534,0.002058,0.00149,0.000494,0.000155,0.000143,0.000525,0.000237,0.000194,9.3e-05,4.7e-05,5e-05,3.3e-05,2.4e-05,1.1e-05,2.7e-05,2.4e-05,3.1e-05,6.7e-05,1.2e-05,5.5e-05,8.3e-05,3e-06,1.7e-05,6e-05,3.8e-05,7e-05,0.000174,3.3e-05,3.8e-05,5.3e-05,2.5e-05,1.5e-05,1.8e-05,3.5e-05,7.3e-05,4e-05,1.1e-05,4.2e-05,3.2e-05,8.8e-05,2.6e-05,0.001459,0.000989,0.000211,0.000945,0.003489,0.002385,0.001939,0.001739,0.00092,0.000258,7.9e-05,5.6e-05,0.000119,0.000239,0.000606,0.000274,6.5e-05,6.5e-05,4.1e-05,5.1e-05,4e-05,5.3e-05,0.000153,0.000484,0.000168,0.000167,5.9e-05,5e-05,0.000128,0.000102,9.8e-05,3.1e-05,6.4e-05,5.5e-05,1.4e-05,4e-05
3.4e-05,2.1e-05,8.6e-05,8.3e-05,0.000142,5.6e-05,0.000148,0.000175,9e-05,5.6e-05,0.000111,0.00081,0.000853,0.000728,0.001422,0.001538,0.000922,0.000604,0.000166,0.000181,0.00011,0.000116,6.4e-05,5.2e-05,1e-05,1.7e-05,2.1e-05,2.4e-05,2.5e-05,4e-05,1.3e-05,6.2e-05,1e-04,7e-05,0.000347,0.000532,0.000879,0.000473,0.000703,0.001449,0.003246,0.003942,0.00411,0.002537,0.002482,0.000776,0.000239,0.000292,0.000134,0.000148,0.00033,0.000225,0.000157,8.7e-05,1.6e-05,1.6e-05,7e-06,1.8e-05,3e-05,2.1e-05,2.7e-05,3.8e-05,5.5e-05,7.3e-05,6.2e-05,9.9e-05,8.8e-05,0.000102,0.000126,5.8e-05,0.000104,9.8e-05,9.9e-05,6.7e-05,3.6e-05,2.3e-05,1.8e-05,5.5e-05,3e-05,7e-06,6e-06,5.1e-05,7.1e-05,9.7e-05,0.000224,0.000716,0.000424,0.00011,0.000947,0.001068,0.001899,0.002275,0.001457,0.000722,0.000553,0.000175,4.9e-05,0.000187,0.000304,0.000942,0.000579,0.000291,0.000143,6.2e-05,4.2e-05,0.000105,8.5e-05,0.00012,0.000848,0.00094,0.00046,0.000166,4.3e-05,4.1e-05,0.000143,0.000152,0.000111,1.2e-05,1.2e-05,3.5e-05,2e-06
6.1e-05,3e-05,0.000108,5e-05,0.000109,6.7e-05,0.000466,0.000188,0.000111,8.4e-05,0.000108,0.001124,0.000976,0.000119,0.001194,0.000453,0.00035,0.000426,0.00025,0.000182,2.2e-05,4.3e-05,7.3e-05,2.5e-05,2.4e-05,3.7e-05,8e-06,9e-06,6e-06,6.6e-05,4.7e-05,0.000101,4e-06,8.3e-05,0.000242,0.000954,0.000996,0.000508,0.000345,0.001683,0.000652,0.004345,0.004829,0.001474,0.002351,0.001016,0.000298,0.00011,0.000181,0.000939,0.000176,8.1e-05,0.000102,1.1e-05,1.3e-05,5e-06,2.6e-05,2.6e-05,3e-06,1.7e-05,4.2e-05,4.5e-05,1e-04,7.4e-05,8.5e-05,8.7e-05,0.000196,0.000136,0.000116,0.000101,0.000101,7.3e-05,0.000103,7.3e-05,5.1e-05,5.7e-05,4.9e-05,6.8e-05,8.3e-05,1.2e-05,2.2e-05,4.6e-05,3.6e-05,1.8e-05,0.000314,0.001153,0.000649,0.000539,0.00114,0.002758,0.002943,0.00342,0.002018,0.000299,9e-05,0.000103,1.2e-05,0.00019,0.000901,0.000294,0.000159,0.000364,0.000144,8.4e-05,2.6e-05,9e-05,5.6e-05,2e-04,6e-04,0.000772,0.000318,7e-05,0.000177,0.00013,0.000114,1.1e-05,2.3e-05,5.7e-05,3.6e-05,3.9e-05,2.6e-05
3.9e-05,8.5e-05,7.9e-05,1.6e-05,6.3e-05,4e-05,0.000706,0.000455,0.000171,0.000141,0.000199,0.0012,0.000717,0.000493,0.001135,0.001429,0.000637,0.000631,0.00029,0.000164,0.000107,0.000171,0.000188,0.000104,9.5e-05,2.3e-05,4.2e-05,7e-06,2.4e-05,4.1e-05,3.8e-05,0.000102,7.1e-05,5.1e-05,0.000271,0.001808,0.000528,0.000427,0.000845,0.001757,0.002329,0.005349,0.003647,0.003635,0.003973,0.001829,0.000489,5.1e-05,0.000156,0.001422,0.000782,0.000223,6.2e-05,9.8e-05,4.4e-05,2.7e-05,2.4e-05,2.3e-05,4.2e-05,7e-06,1.8e-05,1.2e-05,0.000112,7.2e-05,1.8e-05,0.000112,0.000168,0.000136,9.6e-05,0.000146,9.8e-05,0.000131,7.5e-05,0.000102,7.2e-05,3.3e-05,3.9e-05,3.4e-05,7.5e-05,2.7e-05,4.8e-05,0.000106,5.2e-05,6.6e-05,0.000444,0.003213,0.00132,0.000727,0.001591,0.00454,0.001172,0.002638,0.001568,0.000937,2e-04,5.8e-05,7.5e-05,0.000199,0.001144,0.001086,0.000481,0.000226,0.000205,0.000143,5.5e-05,0.000102,6.4e-05,0.000133,0.00109,0.000757,0.000313,0.000102,0.000128,0.000244,2e-04,7.6e-05,5.6e-05,5.7e-05,3.3e-05,2.7e-05,3.6e-05
9.3e-05,0.000105,8.8e-05,3.4e-05,7e-05,0.000143,0.001018,0.000588,0.000386,0.000197,0.000151,0.001057,0.001331,0.000895,0.000246,0.001435,0.001222,0.000397,0.000137,0.000173,0.000186,0.000316,0.000151,0.00013,0.000129,0.000104,0.000112,6.5e-05,2e-05,1.7e-05,0.000108,0.000152,7e-05,2.4e-05,0.000223,0.003015,0.003321,0.001372,0.001446,0.002295,0.002262,0.006817,0.003591,0.001679,0.002987,0.002104,0.000825,0.000186,0.000251,0.00116,0.00068,0.000399,9.5e-05,3.1e-05,4.8e-05,8.3e-05,8.3e-05,2.8e-05,5.4e-05,5.1e-05,3.2e-05,3e-05,9.5e-05,0.000142,0.000118,0.000232,0.00026,0.000144,8.4e-05,0.000262,0.00015,0.000299,0.000161,2e-05,3.5e-05,2.5e-05,1.4e-05,9.7e-05,6.5e-05,2.1e-05,4.4e-05,9.5e-05,3.1e-05,3.4e-05,0.000506,0.004959,0.002987,0.002048,0.001526,0.002026,0.003316,0.002701,0.001153,0.00072,0.00026,0.000102,0.000108,0.000168,0.001436,0.001017,0.000466,0.000194,8.5e-05,7.9e-05,3.6e-05,0.000118,0.000131,0.000158,0.001927,0.001519,0.000656,0.000217,0.000312,0.000451,0.000203,8.4e-05,9.7e-05,4.6e-05,4.8e-05,7.4e-05,5.4e-05
9.6e-05,0.00012,6.2e-05,9.9e-05,1e-05,0.000182,0.00096,0.000399,0.00012,3.2e-05,0.000131,0.001289,0.002134,0.00176,0.001925,0.000888,0.000866,0.000296,0.000127,0.000289,0.000193,0.000175,0.000137,1e-04,0.000274,9.6e-05,6.4e-05,4.8e-05,2.6e-05,4e-05,0.000117,0.000249,0.000389,0.000226,0.000103,0.003426,0.003357,0.001869,0.000383,0.000867,0.002667,0.001925,0.002941,0.00314,0.00112,0.000595,0.00028,0.000109,0.000318,0.001111,0.000641,0.00021,5.9e-05,3.6e-05,3.8e-05,5.9e-05,6e-05,7.9e-05,3.5e-05,6.3e-05,3.7e-05,4e-05,9.6e-05,0.000116,4e-05,0.000207,0.000193,0.000148,7.4e-05,0.000299,0.000401,0.000547,0.000418,5.5e-05,9.1e-05,0.000136,6.4e-05,0.000132,0.000218,0.00011,6.3e-05,9.5e-05,0.00017,6.6e-05,0.000455,0.004657,0.002665,0.000939,0.002541,0.001381,0.002485,0.002579,0.002262,0.0014,0.000558,0.000258,0.00013,0.000218,0.00208,0.00081,0.000198,0.000259,0.000223,0.00011,5.9e-05,0.000221,0.000174,7e-05,0.001959,0.000244,0.000296,0.000209,0.00051,0.000493,0.000205,0.000171,0.000129,5.6e-05,3.7e-05,9.1e-05,0.000139
5.3e-05,2.6e-05,0.000161,7.7e-05,0.000121,0.000172,0.001024,0.000718,0.000316,0.00013,0.000221,0.001658,0.002054,0.001304,0.000761,0.001538,0.001275,0.000728,0.00013,0.000299,0.000249,0.000124,7.5e-05,8.7e-05,0.000243,0.000163,5.8e-05,3.8e-05,5.1e-05,7.5e-05,3.6e-05,0.00016,0.00025,0.000147,0.000188,0.002739,0.000524,0.000508,0.000817,0.00059,0.000586,0.001409,0.005278,0.001661,0.001452,0.001214,0.000666,0.000248,0.00028,0.001942,0.001062,0.00042,3.1e-05,0.000105,0.000134,0.000141,7.6e-05,4.5e-05,5.6e-05,4.6e-05,1.6e-05,5.3e-05,0.000122,0.000228,8.3e-05,0.000181,5e-05,6.9e-05,0.000166,0.000159,0.000324,0.000204,0.000517,0.000441,0.000235,2.2e-05,4.4e-05,0.000166,0.000123,0.000169,0.000163,9.8e-05,0.00014,0.000166,0.000571,0.002799,0.002302,0.001357,0.000997,0.001205,0.003505,0.003484,0.002629,0.000842,0.000242,0.00011,7e-06,0.000211,0.002226,0.001226,0.000671,0.000386,0.00025,0.000101,5.5e-05,0.000151,0.000185,0.000148,0.001751,0.001312,0.000859,0.000214,0.000469,0.000288,0.00016,0.000141,5.8e-05,1.7e-05,4.8e-05,3e-05,6.5e-05
5.3e-05,7.3e-05,0.000153,0.00013,0.000166,0.000256,0.00078,0.000518,0.000235,9.1e-05,0.000201,0.002149,0.003292,0.001314,0.000391,0.001308,0.000298,0.000238,0.000198,0.000282,0.000222,5.2e-05,0.000104,0.000141,0.000161,0.000109,2.8e-05,6e-05,4.7e-05,6.2e-05,9.1e-05,6.5e-05,2e-04,0.000318,4.1e-05,0.001282,0.000321,0.000501,0.00104,0.000772,0.001284,0.004043,0.004524,0.004215,0.001794,0.001968,0.000965,0.000249,0.000281,0.002505,0.001077,0.000505,0.000125,0.000111,4.2e-05,3.4e-05,6.8e-05,4.5e-05,5.9e-05,1.8e-05,3.6e-05,8.6e-05,6.7e-05,0.000151,0.000197,0.00015,0.000158,5.5e-05,0.000108,2e-04,0.000312,0.000115,0.000353,0.000136,0.000105,2.4e-05,4e-05,0.000207,0.000196,0.00021,4.1e-05,4.5e-05,0.000161,8.1e-05,0.000623,0.001534,0.001099,0.000798,0.000501,0.002198,0.006477,0.002636,0.002559,0.00113,4e-04,0.000103,6.9e-05,0.000144,0.002073,0.001224,0.000404,0.000264,4.8e-05,1e-05,3e-05,9.8e-05,0.000135,0.000102,0.001922,0.001246,0.000577,0.000311,0.000277,0.000243,0.000232,8e-06,7e-05,6.9e-05,2.2e-05,3e-05,5.5e-05
1.6e-05,2.2e-05,5.7e-05,1.9e-05,3.7e-05,3.4e-05,0.000283,0.000155,0.000126,3.9e-05,9.7e-05,0.001014,0.001929,0.00116,0.000475,0.000346,0.000137,4.2e-05,7.3e-05,0.000102,6.2e-05,7.8e-05,6.3e-05,3e-05,2.8e-05,4.8e-05,6.2e-05,1.4e-05,3.4e-05,1.8e-05,4.4e-05,4.5e-05,7.8e-05,9.1e-05,0.000153,0.000277,0.000248,0.000227,0.000281,0.000161,0.000532,0.001362,0.001949,0.000277,0.001439,0.001147,0.00049,0.000128,0.000102,0.00101,0.000699,0.000259,4.4e-05,1.5e-05,2.9e-05,3.1e-05,1.6e-05,4e-06,1.8e-05,1.1e-05,1.2e-05,3.3e-05,1e-05,4.9e-05,5.6e-05,1.2e-05,8.2e-05,8.8e-05,3e-05,6e-05,9.1e-05,0.000134,5.1e-05,4.2e-05,3.4e-05,2e-05,5e-06,8e-05,0.000111,1.9e-05,1.2e-05,3.3e-05,4.7e-05,2.3e-05,0.000285,0.000553,0.00013,6.1e-05,0.000364,0.001023,0.002431,0.003342,0.001788,0.000841,0.000381,3.4e-05,1.9e-05,7.8e-05,0.000963,0.000739,0.000341,0.000138,5.3e-05,3.7e-05,2.3e-05,1.4e-05,8.2e-05,6.4e-05,0.000984,0.000577,0.000184,8.2e-05,0.000136,8.8e-05,0.000118,0.000123,3.8e-05,1.6e-05,1.5e-05,1.9e-05,1.3e-05
3e-05,1.1e-05,2.5e-05,2.1e-05,2.1e-05,6.6e-05,0.000291,0.000234,8.8e-05,2.9e-05,8e-05,0.000881,0.000853,0.000346,0.000361,0.000604,0.000513,0.000226,0.000117,3e-05,3.2e-05,4.1e-05,3.1e-05,6.3e-05,6.5e-05,5.5e-05,3e-05,2.3e-05,1.6e-05,6e-06,2e-05,2.5e-05,1.4e-05,7.4e-05,5e-05,0.000325,0.000251,0.000133,7.9e-05,0.000176,0.000116,0.000498,0.000798,0.001379,0.001474,0.000326,7.8e-05,4.3e-05,4.2e-05,0.000716,0.00037,0.000162,1.8e-05,2.8e-05,1.7e-05,1.6e-05,7e-06,5e-06,1.5e-05,9e-06,7e-06,5.6e-05,1.4e-05,8.5e-05,7.2e-05,7.9e-05,0.000115,0.000119,5.7e-05,7.2e-05,2.8e-05,8.7e-05,2.9e-05,2.8e-05,2.4e-05,1.4e-05,1.2e-05,6.1e-05,1.9e-05,1.7e-05,1.5e-05,3.1e-05,5.9e-05,1.3e-05,0.000257,4.1e-05,6.4e-05,0.000128,0.000291,0.00029,0.000899,0.001367,0.002294,0.001237,0.000405,1e-05,4.1e-05,3.8e-05,0.000758,0.000736,0.000348,0.000121,1.6e-05,4e-06,3e-05,3.4e-05,6.4e-05,3.5e-05,0.000678,0.000164,6e-06,5.9e-05,6.5e-05,0.00013,4.2e-05,6.5e-05,3.6e-05,3.2e-05,1.1e-05,7e-06,1.2e-05
2.3e-05,1e-05,1.6e-05,2.7e-05,1.6e-05,5.1e-05,0.000158,2.1e-05,2.5e-05,2.8e-05,1.8e-05,0.000678,7.5e-05,6.3e-05,0.000229,0.000417,7e-06,4.9e-05,8e-06,3.9e-05,2.4e-05,5e-06,3.3e-05,5.3e-05,8e-06,2.5e-05,1e-05,5e-06,4e-06,7e-06,1.2e-05,2.9e-05,3.5e-05,3.6e-05,9.8e-05,0.000468,4.6e-05,0.000149,3.3e-05,0.000133,0.000506,0.000288,0.000726,0.002001,0.000801,0.000199,2.6e-05,3e-05,1.7e-05,0.000383,0.000245,2.9e-05,4.1e-05,2.3e-05,1e-05,8e-06,8e-06,1.2e-05,6e-06,9e-06,1e-05,5.9e-05,5.4e-05,0.000128,2.5e-05,3.7e-05,7.2e-05,6.3e-05,5.1e-05,0.000116,4.9e-05,2.3e-05,3.1e-05,1.4e-05,1.6e-05,1.3e-05,5e-06,2.3e-05,8e-06,1.1e-05,1e-05,7e-06,2.5e-05,2.1e-05,0.000254,0.000442,0.000242,0.000276,0.000188,0.000146,0.000672,0.001601,0.001161,0.000457,8.3e-05,4.2e-05,2.5e-05,2.7e-05,0.000622,0.000412,0.000196,8.5e-05,3.1e-05,1.3e-05,4.6e-05,3.7e-05,1.6e-05,5.6e-05,0.000251,0.000106,6.6e-05,3.3e-05,3.2e-05,5.5e-05,4.4e-05,1e-05,1.2e-05,2.6e-05,1.4e-05,5e-06,9e-06
2.4e-05,3e-06,9e-06,2.3e-05,2.1e-05,2.4e-05,6.5e-05,8.1e-05,3.8e-05,3.8e-05,4e-05,0.000442,0.000134,1e-04,0.000131,0.000187,0.000133,4.2e-05,1.2e-05,1.9e-05,1.2e-05,9e-06,1.2e-05,3.4e-05,2.5e-05,1.4e-05,9e-06,1e-06,3e-06,5e-06,2.2e-05,3.7e-05,2.2e-05,4.6e-05,6e-05,0.000549,8.2e-05,0.000174,0.000206,0.000262,0.00035,0.00021,0.000345,0.001363,0.000854,0.000393,0.000108,3.3e-05,4.6e-05,0.000209,0.000113,4.4e-05,2e-05,2.3e-05,9e-06,1.4e-05,7e-06,9e-06,6e-06,3e-06,2e-05,3.7e-05,6.1e-05,6.6e-05,8.7e-05,3.9e-05,3.9e-05,2.3e-05,1.5e-05,9.8e-05,3.4e-05,3.2e-05,3.7e-05,4.8e-05,2.7e-05,9e-06,5e-06,6e-06,1.3e-05,6e-06,7e-06,1.4e-05,2e-06,1.6e-05,0.000213,0.000282,0.000119,0.000103,0.000231,0.000537,0.000652,0.000637,0.000319,0.000204,6.4e-05,2.2e-05,8e-06,6e-06,0.000458,0.000215,9.6e-05,4e-05,3e-05,1.6e-05,3.9e-05,7e-06,1.5e-05,5.6e-05,0.000151,0.000118,4.3e-05,5e-06,2.1e-05,2.4e-05,5.9e-05,3e-06,1.5e-05,4e-06,0,8e-06,5e-06
2.1e-05,7e-06,1.3e-05,8e-06,1.1e-05,1e-05,8e-06,6.2e-05,2.8e-05,3.8e-05,1e-05,0.00026,0.000175,8e-05,0.000165,9.1e-05,0.000122,3.3e-05,1.3e-05,1.5e-05,1.7e-05,1.8e-05,1.8e-05,2e-05,1.2e-05,2.4e-05,1.1e-05,1e-05,4e-06,5e-06,2e-05,2.9e-05,3.1e-05,5.7e-05,0.000115,0.000386,0.000181,0.000144,0.000231,0.000267,0.000218,0.000137,0.00077,0.000538,0.000389,5.6e-05,6.8e-05,1.3e-05,2.3e-05,0.000153,0.000106,6.5e-05,3.8e-05,1.9e-05,1.1e-05,2e-05,1.4e-05,3e-06,1e-06,5e-06,2.2e-05,6.4e-05,1.7e-05,5.3e-05,5.8e-05,1.7e-05,2.8e-05,2.8e-05,2.5e-05,6.8e-05,4.9e-05,2.9e-05,1.5e-05,3.1e-05,4.4e-05,3.2e-05,1.6e-05,8e-06,9e-06,9e-06,1e-06,1.1e-05,3e-06,3.2e-05,0.000179,0.000101,7e-05,0.000105,0.000183,0.000552,0.000311,0.000269,0.000213,0.000124,8.3e-05,1.2e-05,1.3e-05,2.5e-05,0.00033,0.000218,8.5e-05,4.1e-05,4e-06,6e-06,1.8e-05,1.9e-05,2.6e-05,3.7e-05,0.000211,8.8e-05,5.3e-05,8e-06,3.3e-05,2.5e-05,3.6e-05,3.9e-05,1.3e-05,7e-06,7e-06,1e-05,7e-06
8e-06,1.5e-05,2.5e-05,3e-05,3e-06,9e-06,3e-05,4.9e-05,2.9e-05,2.5e-05,2.7e-05,0.000165,0.000107,4.2e-05,0.000109,0.000165,4.1e-05,4e-06,1.1e-05,1.5e-05,1.3e-05,1e-05,2.2e-05,1.6e-05,4e-06,1e-05,5e-06,0,2e-06,0,1.3e-05,7e-06,2.9e-05,3.8e-05,5e-05,0.000208,0.00024,8.8e-05,0.000183,0.000252,7.9e-05,0.000379,0.000698,0.000437,0.000255,0.000116,5.6e-05,2e-05,2e-06,9.4e-05,3.7e-05,2.9e-05,1.7e-05,1.7e-05,2.4e-05,1.2e-05,1e-05,5e-06,1e-05,7e-06,2.1e-05,5.8e-05,5.4e-05,4.9e-05,1.9e-05,1.1e-05,9e-06,1e-06,1.5e-05,3.4e-05,3.6e-05,2.7e-05,1.2e-05,2.4e-05,2.8e-05,1.3e-05,8e-06,5e-06,7e-06,9e-06,7e-06,3e-06,5e-06,3.2e-05,0.000157,0.000174,5.7e-05,9.8e-05,6.7e-05,0.000483,0.000292,0.000204,5.7e-05,4.3e-05,3.6e-05,1.2e-05,7e-06,1.4e-05,0.000221,0.000118,6.8e-05,1.9e-05,2.8e-05,1.9e-05,1.7e-05,9e-06,1.7e-05,1.4e-05,0.000243,9e-06,1.4e-05,3.1e-05,4.4e-05,1.5e-05,2.8e-05,4e-05,2.4e-05,1.7e-05,1.7e-05,5e-06,9e-06
1.3e-05,9e-06,1.5e-05,1.7e-05,1.1e-05,2.1e-05,2.3e-05,3.1e-05,2.3e-05,1.8e-05,1.2e-05,2e-04,0.000115,0.000204,0.000133,0.000159,9.9e-05,2.7e-05,6e-06,2e-05,2e-06,4e-06,1.2e-05,4e-06,1.1e-05,1.5e-05,8e-06,4e-06,2e-06,7e-06,1.2e-05,6e-06,2.8e-05,7e-06,5.1e-05,0.00014,0.000194,5.5e-05,6.9e-05,0.000108,0.00024,0.00018,0.000306,0.000761,0.000304,0.000155,3.1e-05,4.7e-05,1.7e-05,0.000122,0.000102,1.4e-05,2.6e-05,1e-06,1e-05,8e-06,9e-06,1e-05,1.3e-05,7e-06,2e-05,3.6e-05,1.5e-05,2.5e-05,3.2e-05,2.2e-05,2.6e-05,4e-06,1.6e-05,2.4e-05,4.8e-05,1.8e-05,1.9e-05,1.6e-05,2.1e-05,1.1e-05,4e-06,4e-06,8e-06,7e-06,5e-06,4e-06,5e-06,2.1e-05,0.000128,3.8e-05,6.3e-05,5.9e-05,0.000162,0.000313,0.000361,0.000443,0.000325,0.000125,6.1e-05,1.3e-05,1.1e-05,3e-05,0.000222,0.000151,8.5e-05,1.4e-05,2.1e-05,9e-06,2.1e-05,7e-06,7e-06,2.3e-05,0.000308,9.3e-05,5.2e-05,2.8e-05,8e-06,1.4e-05,4.1e-05,7e-06,5e-06,1.1e-05,1.1e-05,5e-06,8e-06
1.4e-05,9e-06,1e-05,1.3e-05,4e-06,2.1e-05,5.6e-05,5.9e-05,3.1e-05,3.5e-05,2.5e-05,0.000205,0.000161,0.000251,0.000161,0.000163,5.1e-05,3.4e-05,1.4e-05,3.1e-05,9e-06,2e-06,1.9e-05,7e-06,1.1e-05,1.4e-05,1e-05,7e-06,3e-06,6e-06,1.6e-05,1e-05,2.2e-05,1.7e-05,6.6e-05,6.5e-05,0.000142,0.000128,7.1e-05,2.1e-05,0.000194,0.000228,0.000235,0.000503,0.000441,0.000152,4.2e-05,2.5e-05,2.3e-05,0.000153,4.8e-05,5.3e-05,1.8e-05,1.6e-05,1.7e-05,9e-06,6e-06,8e-06,7e-06,8e-06,9e-06,3e-05,5.5e-05,1.9e-05,1.3e-05,9e-06,3.7e-05,1.2e-05,1.2e-05,5.2e-05,3.3e-05,1.8e-05,9e-06,1.8e-05,1.7e-05,1.2e-05,6e-06,6e-06,3e-06,5e-06,8e-06,1.3e-05,1e-05,2.5e-05,0.000133,0.000176,1e-04,1e-04,0.000187,0.000147,8.8e-05,0.000175,8e-05,1.2e-05,2.1e-05,1.8e-05,1e-05,2e-05,0.000245,0.000138,4.9e-05,1.5e-05,1.2e-05,9e-06,1.3e-05,6e-06,1e-05,1.8e-05,0.000262,0.00012,4.9e-05,1.3e-05,1.2e-05,3.2e-05,3.2e-05,3.6e-05,1.9e-05,9e-06,5e-06,3e-06,5e-06
1.2e-05,5e-06,1.1e-05,1.1e-05,1.8e-05,2e-05,3.9e-05,1.2e-05,2e-05,1.8e-05,2.7e-05,0.000186,0.00013,0.000505,0.000302,0.000127,6.7e-05,1.4e-05,1.9e-05,2.6e-05,1.4e-05,1.1e-05,1.6e-05,4e-06,2e-06,1.2e-05,9e-06,3e-06,2e-06,4e-06,1.3e-05,1e-05,1.3e-05,1.8e-05,4.9e-05,0.000119,2.6e-05,6.1e-05,5.5e-05,0.00012,0.000111,0.000304,0.000258,0.000216,0.00025,0.000105,2.4e-05,1.1e-05,9e-06,0.000122,6.8e-05,3.6e-05,3.7e-05,2.7e-05,1.4e-05,9e-06,1.5e-05,5e-06,4e-06,2e-06,8e-06,1.4e-05,1.4e-05,1.9e-05,3e-06,8e-06,2.2e-05,3.9e-05,2e-05,7.3e-05,6.3e-05,4.8e-05,3.4e-05,3e-06,8e-06,2e-06,2e-06,4e-06,6e-06,6e-06,7e-06,1.7e-05,2.1e-05,1.3e-05,0.000104,0.000163,6.1e-05,7e-06,0.000159,0.000129,0.000376,0.000178,0.000118,1.9e-05,2.5e-05,1.2e-05,1.1e-05,1.9e-05,0.000265,8.3e-05,4.2e-05,2.3e-05,1.2e-05,1.5e-05,1.6e-05,9e-06,2.7e-05,2.3e-05,8.6e-05,8.4e-05,1.4e-05,4.3e-05,5.1e-05,6.5e-05,5.8e-05,2.5e-05,1.8e-05,1.6e-05,6e-06,5e-06,1e-06
1.1e-05,1.3e-05,8e-06,6e-06,1.7e-05,2.6e-05,3.2e-05,3.3e-05,9e-06,2e-05,1.4e-05,0.000121,5.7e-05,0.000374,0.000134,3.1e-05,8.9e-05,1.8e-05,1.9e-05,1.2e-05,8e-06,3e-06,8e-06,1.3e-05,9e-06,2e-06,1.2e-05,4e-06,2e-06,6e-06,1.1e-05,8e-06,1.7e-05,1.7e-05,5.8e-05,0.000281,8.4e-05,7.7e-05,8.4e-05,0.000124,0.000172,0.00034,0.000134,4.1e-05,7e-05,0.000138,3e-05,1.7e-05,1.7e-05,5.3e-05,2.2e-05,3.5e-05,1.9e-05,6e-06,1.6e-05,6e-06,1.3e-05,7e-06,5e-06,6e-06,6e-06,1.2e-05,1.9e-05,2.8e-05,3.4e-05,2.1e-05,4e-05,2.2e-05,1.3e-05,9.2e-05,2.5e-05,3e-05,1.9e-05,4e-06,4e-06,7e-06,4e-06,6e-06,3e-06,6e-06,7e-06,1.3e-05,1e-05,1.7e-05,9.9e-05,2.9e-05,1.8e-05,6.2e-05,1e-04,5.2e-05,0.000556,0.000366,0.000206,6.6e-05,5e-05,1.7e-05,1.1e-05,1.4e-05,0.000251,0.000112,2.5e-05,6e-06,1.1e-05,1.7e-05,1.2e-05,2.1e-05,1e-05,5e-06,9.7e-05,6e-05,4.5e-05,5e-05,5.4e-05,5e-06,1e-05,1.5e-05,1.6e-05,7e-06,6e-06,5e-06,5e-06
5e-06,5e-06,9e-06,1e-05,1.4e-05,2.3e-05,3.8e-05,3.7e-05,3.4e-05,1.4e-05,2.7e-05,5.2e-05,0.000105,0.000127,9.3e-05,0.000148,2.1e-05,1.9e-05,7e-06,7e-06,1.1e-05,7e-06,6e-06,1.2e-05,5e-06,1.6e-05,3e-06,4e-06,3e-06,6e-06,8e-06,3e-06,6e-06,2e-05,4.5e-05,0.000322,0.000104,7.2e-05,7.9e-05,0.000169,0.000177,0.000435,0.000328,0.000451,0.000372,0.000158,4.6e-05,2.7e-05,3.5e-05,6.1e-05,5.4e-05,2.5e-05,2.2e-05,1.6e-05,2e-05,1e-05,1.1e-05,8e-06,5e-06,6e-06,1.9e-05,2.3e-05,4.8e-05,7e-06,3.5e-05,2e-05,4.1e-05,1.7e-05,8e-06,9.5e-05,4e-05,2.9e-05,1.1e-05,9e-06,7e-06,5e-06,6e-06,2e-06,4e-06,4e-06,4e-06,1e-05,5e-06,8e-06,6.8e-05,8.5e-05,7e-06,4.9e-05,7.9e-05,0.000101,0.000463,0.000307,0.000198,2e-05,2.6e-05,3.3e-05,2.9e-05,1.2e-05,0.000225,7.7e-05,3.9e-05,2.1e-05,6e-06,1.9e-05,1.2e-05,1.5e-05,9e-06,1.6e-05,0.000179,2e-05,2.1e-05,7e-05,1.7e-05,4.4e-05,2.5e-05,2.6e-05,7e-06,8e-06,5e-06,8e-06,4e-06
3e-06,2e-06,1e-05,1.5e-05,1.9e-05,6e-06,3.7e-05,8e-06,1.5e-05,1.8e-05,1.4e-05,4.3e-05,0.000105,0.000111,3.3e-05,3.8e-05,5.7e-05,2.1e-05,3.1e-05,1.3e-05,3e-06,5e-06,5e-06,1.5e-05,4e-06,1.4e-05,5e-06,4e-06,7e-06,4e-06,1.1e-05,3e-06,1.6e-05,1.8e-05,5.5e-05,0.000187,7.8e-05,1e-04,5.1e-05,0.000149,0.000144,0.000368,0.000594,0.000182,0.000279,9.7e-05,5e-05,2.2e-05,1.9e-05,0.000107,7.3e-05,4.8e-05,2.7e-05,1.2e-05,2e-05,1.2e-05,7e-06,4e-06,3e-06,2e-06,2.1e-05,4.4e-05,3.1e-05,2.7e-05,1.3e-05,1e-05,7e-06,6e-06,1.6e-05,7.5e-05,1.2e-05,3e-06,8e-06,1.3e-05,8e-06,6e-06,2e-06,7e-06,6e-06,6e-06,1e-06,6e-06,1.7e-05,1.3e-05,6.8e-05,0.000114,8.9e-05,2.9e-05,8.9e-05,0.000108,0.000208,0.000287,0.00014,7.7e-05,3.5e-05,2.1e-05,1.1e-05,5e-05,0.00015,0.000107,8.1e-05,3e-05,1.8e-05,2e-06,1e-05,8e-06,8e-06,2.9e-05,9.4e-05,4.6e-05,3.6e-05,4.6e-05,4.1e-05,4.6e-05,3.3e-05,9e-06,1.1e-05,7e-06,4e-06,2e-06,2e-06
8e-06,1e-05,1.5e-05,1.1e-05,1.7e-05,1e-05,3.7e-05,6.4e-05,3.7e-05,2.7e-05,1.7e-05,7.7e-05,9.6e-05,8.1e-05,8.6e-05,0.00019,0.000144,3.9e-05,2e-05,1.4e-05,1.3e-05,5e-06,5e-06,1.4e-05,1e-05,1.3e-05,6e-06,4e-06,8e-06,5e-06,7e-06,8e-06,1.4e-05,2.1e-05,2.8e-05,3.5e-05,0.000127,0.000143,6.7e-05,9e-05,0.00016,0.000338,0.000327,0.000664,0.000236,0.000129,4.5e-05,4.4e-05,2.6e-05,9.8e-05,4.4e-05,1.8e-05,5e-06,6e-06,6e-06,8e-06,1e-05,5e-06,6e-06,2e-06,2.1e-05,2.1e-05,3.6e-05,6e-06,3.4e-05,3e-06,3e-05,2.2e-05,9e-06,3.6e-05,4.4e-05,3.7e-05,2e-05,1.6e-05,7e-06,8e-06,1e-05,6e-06,2e-06,7e-06,2e-06,6e-06,2.7e-05,1.6e-05,5.8e-05,0.000111,8.9e-05,1.7e-05,7.7e-05,6.5e-05,0.00012,0.000231,0.000118,4e-05,3.2e-05,1.1e-05,1.3e-05,5.6e-05,0.000132,3.1e-05,3.2e-05,2e-05,6e-06,1.8e-05,1.9e-05,8e-06,6e-06,4.2e-05,0.000147,8.7e-05,5.5e-05,3.6e-05,3.7e-05,0.000101,5.4e-05,3.2e-05,1.2e-05,4e-06,3e-06,2e-06,3e-06
4e-06,1.7e-05,3.3e-05,1.5e-05,4e-06,8e-06,2.7e-05,4.5e-05,2.9e-05,1.8e-05,5e-06,9.4e-05,0.000115,0.000142,3.4e-05,0.000301,0.000132,3.7e-05,2.4e-05,2.3e-05,4.6e-05,2.5e-05,1.6e-05,9e-06,1.4e-05,1.8e-05,1.1e-05,1.2e-05,5e-06,3e-06,5e-06,2e-06,1e-06,8e-06,4.3e-05,0.000161,8.4e-05,1.6e-05,9.2e-05,0.000155,0.000273,0.000138,0.00043,0.000652,0.000657,0.000224,3.7e-05,2.6e-05,6.1e-05,8e-05,5.1e-05,4.5e-05,3.4e-05,2e-05,1.2e-05,1.4e-05,6e-06,4e-06,6e-06,9e-06,2.6e-05,1.9e-05,2.1e-05,2.4e-05,3.2e-05,3.5e-05,2.1e-05,2.8e-05,2.4e-05,3.6e-05,6.2e-05,1.7e-05,2.8e-05,8e-06,2e-06,5e-06,1e-06,5e-06,3e-06,1.2e-05,5e-06,8e-06,2.3e-05,1.9e-05,4.3e-05,0.000132,4.7e-05,2.1e-05,7.2e-05,1.7e-05,0.000116,9.5e-05,0.000152,4.7e-05,3.2e-05,2.5e-05,1.5e-05,4.4e-05,1.2e-05,6.4e-05,7.3e-05,3.5e-05,2.8e-05,1.6e-05,2e-05,2.6e-05,5e-06,4.4e-05,0.00023,0.000118,6.2e-05,2.2e-05,2.7e-05,8.3e-05,8.5e-05,3.3e-05,1.4e-05,3e-06,6e-06,1e-06,8e-06
9e-06,1.6e-05,1.2e-05,1.3e-05,1.9e-05,1.4e-05,4e-06,0,1.1e-05,2e-05,3.6e-05,8.9e-05,0.000173,9.9e-05,0.000212,0.000199,0.000164,8.7e-05,4.3e-05,1e-05,2.6e-05,1.4e-05,1.7e-05,8e-06,1.4e-05,1.6e-05,1e-05,6e-06,3e-06,7e-06,7e-06,4e-06,6e-06,1.1e-05,5.6e-05,0.000185,0.000164,0.000134,0.000119,0.000151,0.000231,0.000229,0.000236,0.000463,0.000293,0.000226,6.6e-05,1.7e-05,4.4e-05,0.000134,0.000119,4e-05,1.4e-05,2.6e-05,1.5e-05,3e-06,9e-06,5e-06,1.1e-05,1.1e-05,1.7e-05,1.3e-05,3e-05,1.3e-05,2.1e-05,2.3e-05,3e-05,1e-05,6e-06,1.2e-05,5.5e-05,4e-05,2.4e-05,8e-06,1.1e-05,6e-06,2e-06,1e-06,5e-06,4e-06,7e-06,5e-06,1.8e-05,2.6e-05,3.8e-05,0.000102,5.9e-05,2.7e-05,8e-05,4e-05,0.000168,0.000125,7.1e-05,5.1e-05,3.8e-05,1.9e-05,1.6e-05,3.3e-05,1.7e-05,0.000122,5.8e-05,2.6e-05,1e-06,9e-06,2.9e-05,3.5e-05,4.2e-05,3.7e-05,0.000248,1.7e-05,2.4e-05,1.8e-05,3.5e-05,5.1e-05,7.6e-05,4.1e-05,1.7e-05,8e-06,5e-06,5e-06,8e-06
8e-06,1.6e-05,2.3e-05,1.1e-05,1.5e-05,1.6e-05,8e-06,3.2e-05,2e-05,2e-05,1.1e-05,5.6e-05,0.000125,0.000184,0.000269,0.00026,5.3e-05,3.2e-05,1.4e-05,2.9e-05,2.1e-05,9e-06,2e-05,5e-06,8e-06,1e-05,3e-06,1e-06,5e-06,5e-06,6e-06,7e-06,6e-06,4e-06,4.2e-05,0.000174,0.000138,5.6e-05,8.6e-05,0.000108,0.000372,0.000264,0.000131,0.000226,0.000196,5.2e-05,1.4e-05,1.3e-05,3e-05,0.000129,0.000109,3.2e-05,1.7e-05,1.7e-05,1.2e-05,1e-05,6e-06,1.3e-05,1.2e-05,4e-06,1.4e-05,1.7e-05,2.8e-05,4e-06,8e-06,2.7e-05,3e-06,1.5e-05,1.3e-05,1.6e-05,4.6e-05,3.1e-05,2.1e-05,7e-06,6e-06,7e-06,6e-06,3e-06,5e-06,5e-06,7e-06,7e-06,1.7e-05,1.4e-05,4.2e-05,4.9e-05,5.5e-05,3.1e-05,0.000121,5.3e-05,0.000193,3.8e-05,0.00012,8.6e-05,3.5e-05,2e-05,1.5e-05,5e-06,6e-05,0.000208,7.4e-05,2.2e-05,9e-06,1.1e-05,2.3e-05,1e-05,2.2e-05,2.3e-05,9.1e-05,0.000113,4.5e-05,2.5e-05,3e-05,5.6e-05,5e-05,3.2e-05,1.2e-05,1e-05,8e-06,4e-06,6e-06
1.1e-05,6e-06,1.1e-05,3e-06,1.5e-05,5e-06,2.3e-05,5.2e-05,1.9e-05,8e-06,1.6e-05,2.8e-05,8.6e-05,5.3e-05,4.3e-05,8e-05,4e-05,2.7e-05,1e-05,1.4e-05,1.2e-05,1.4e-05,3e-06,5e-06,4e-06,1.4e-05,8e-06,4e-06,7e-06,7e-06,9e-06,4e-06,9e-06,3e-06,3.1e-05,0.000103,9.8e-05,9.2e-05,9.8e-05,4.9e-05,0.000241,0.000237,0.000291,0.000243,0.000131,3.4e-05,2.4e-05,2.4e-05,1.4e-05,0.00013,1.9e-05,3.1e-05,1.7e-05,4e-06,9e-06,6e-06,6e-06,8e-06,4e-06,1e-06,1.1e-05,2.3e-05,9e-06,1.4e-05,1.4e-05,2.2e-05,2.7e-05,1.2e-05,3e-06,2.1e-05,4e-05,2.3e-05,2.1e-05,5e-06,3e-06,6e-06,5e-06,2e-06,0,5e-06,4e-06,4e-06,1.3e-05,2.5e-05,1.4e-05,0.000116,0.00012,6.6e-05,0.000158,0.000164,4.9e-05,4.8e-05,0.000146,5.1e-05,1.2e-05,1.9e-05,6e-06,0,9.1e-05,0.000143,0.000112,3.9e-05,3e-06,2e-06,1e-05,6e-06,8e-06,6e-06,4.9e-05,4.5e-05,1e-05,1.2e-05,2.6e-05,7e-06,4.1e-05,1.6e-05,1.5e-05,1.1e-05,6e-06,2e-06,5e-06
7e-06,1e-06,1.1e-05,0,1.2e-05,3e-06,2.5e-05,8e-06,2e-06,8e-06,9e-06,3.1e-05,8.3e-05,7.8e-05,7.1e-05,8.3e-05,3.4e-05,9e-06,1.3e-05,1.3e-05,5e-06,9e-06,6e-06,2e-06,1e-06,6e-06,4e-06,2e-06,2e-06,3e-06,8e-06,8e-06,5e-06,1e-05,3.9e-05,0.000162,5.5e-05,4.9e-05,9.5e-05,3.7e-05,0.000132,0.000182,0.000142,0.000192,6.8e-05,3.1e-05,1.5e-05,2e-05,1.6e-05,8e-05,3.5e-05,1.4e-05,9e-06,8e-06,7e-06,9e-06,9e-06,7e-06,3e-06,1e-06,7e-06,1.3e-05,1.4e-05,1.7e-05,8e-06,1.3e-05,2e-06,4e-06,4e-06,2.3e-05,1.9e-05,1.1e-05,1.7e-05,9e-06,3e-06,1e-06,3e-06,2e-06,1e-06,0,4e-06,6e-06,1e-05,6e-06,2.3e-05,0.000125,9.4e-05,3.1e-05,0.000117,0.000115,7.6e-05,3e-05,6.6e-05,4.7e-05,7e-06,1.3e-05,1e-05,3e-06,0.000104,4.6e-05,2.6e-05,3e-06,2e-06,5e-06,1e-05,2e-06,5e-06,9e-06,0.000111,3e-05,7e-06,1.1e-05,1.2e-05,3.7e-05,1.1e-05,8e-06,1.1e-05,2e-06,1e-06,2e-06,5e-06
5e-06,1e-06,1.1e-05,1e-06,1e-05,3e-06,2.3e-05,2.3e-05,6e-06,1.2e-05,1.4e-05,3.5e-05,5.1e-05,2.9e-05,5.8e-05,9.7e-05,2.7e-05,6e-06,1.1e-05,9e-06,3e-06,6e-06,7e-06,4e-06,2e-06,5e-06,0,2e-06,2e-06,3e-06,8e-06,6e-06,7e-06,9e-06,3e-05,0.000195,1.7e-05,3.8e-05,9.1e-05,3.5e-05,0.000162,6.5e-05,0.000189,6.8e-05,8e-05,1.6e-05,1.2e-05,1.3e-05,9e-06,9.2e-05,3.3e-05,1.9e-05,7e-06,5e-06,6e-06,8e-06,1e-06,5e-06,1e-06,1e-06,4e-06,9e-06,4e-06,4e-06,3e-06,3e-06,1.3e-05,3e-06,3e-06,2.4e-05,0,5e-06,1.6e-05,5e-06,2e-06,2e-06,5e-06,0,2e-06,3e-06,1e-06,4e-06,6e-06,2e-06,2.1e-05,5.3e-05,7e-06,4e-06,9.4e-05,6.6e-05,5.8e-05,2.3e-05,6.9e-05,3.5e-05,1e-05,8e-06,9e-06,1e-05,9.2e-05,2.8e-05,2.3e-05,1.2e-05,9e-06,5e-06,1.1e-05,3e-06,6e-06,8e-06,0.000112,2.2e-05,2.3e-05,1.8e-05,6e-06,3.3e-05,7e-06,1e-06,7e-06,2e-06,2e-06,1e-06,5e-06
4e-06,1e-06,9e-06,2e-06,1e-05,2e-06,1.8e-05,1.5e-05,9e-06,1.1e-05,1.3e-05,3.1e-05,6.7e-05,3e-06,5.7e-05,8.8e-05,3.9e-05,3e-06,1e-05,1.2e-05,3e-06,5e-06,7e-06,2e-06,1e-06,6e-06,1e-06,2e-06,1e-06,3e-06,8e-06,4e-06,5e-06,7e-06,2.6e-05,0.000137,2.8e-05,5.3e-05,7.9e-05,2.6e-05,0.000122,0.000107,0.000159,7.5e-05,0.000126,1.6e-05,1.1e-05,3e-06,1.2e-05,9.7e-05,3.2e-05,9e-06,3e-06,4e-06,4e-06,6e-06,3e-06,2e-06,2e-06,0,4e-06,8e-06,6e-06,3e-06,6e-06,2e-06,1e-05,3e-06,4e-06,2.4e-05,5e-06,6e-06,1.3e-05,4e-06,1e-06,2e-06,3e-06,0,1e-06,3e-06,1e-06,3e-06,6e-06,3e-06,2.3e-05,2.2e-05,1.7e-05,9e-06,8.8e-05,9.5e-05,7.3e-05,4.4e-05,3.3e-05,4e-06,1.4e-05,6e-06,4e-06,2e-06,8.6e-05,1.6e-05,2.1e-05,7e-06,1e-05,1e-06,7e-06,1e-06,2e-06,5e-06,0.000124,1.5e-05,1.9e-05,7e-06,4e-06,2.7e-05,6e-06,0,6e-06,1e-06,0,1e-06,5e-06
