0.00012,0.000136,7.9e-05,9.9e-05,9.2e-05,5.8e-05,0.000112,0.000117,0.000118,8.3e-05,0.000162,0.000115,0.000106,7.9e-05,1e-04,0.00016,0.00013,7.7e-05,8.4e-05,8e-05,5e-05,7.1e-05,0.000111,6.6e-05,0.000225,0.000125,7.4e-05,5e-05,0.000112,0.000149,0.000114,0.000175,0.000115,0.000173,9.6e-05,0.000108,7.3e-05,5.1e-05,6.6e-05,5.1e-05,0.000184,8.6e-05,5.2e-05,5.8e-05,7.4e-05,7e-05,8.2e-05,1e-04,0.000183,0.000112,7.2e-05,0.000114,0.000106,7.5e-05,0.000134,0.000107,4.8e-05,0.000117,0.00011,9.3e-05,0.000114,0.000129,8.4e-05,0.000182,0.000138,6.6e-05,0.000109,0.000164,8.8e-05,4.4e-05,5.3e-05,4.8e-05,0.000136,8.9e-05,6.3e-05,4.3e-05,9.5e-05,0.000121,0.000142,0.000127,9.4e-05,0.000105,0.00012,7.4e-05,0.000134,7.3e-05,9.2e-05,8.5e-05,8e-05,7.8e-05,0.000107,0.00015,7.9e-05,6.5e-05,9.3e-05,3.5e-05,0.000104,0.000119,0.000103,6e-05,4e-05,7.3e-05,4.8e-05,4e-05,0.000156,8.5e-05,0.000154,0.000106,6.4e-05,6.7e-05,6.6e-05,5.4e-05,7.9e-05,0.000151,8.8e-05,0.000131,5.4e-05,5.4e-05,0.00013,7.2e-05,0.00014
-2.7e-05,-3.3e-05,-5e-05,-6.6e-05,-6.8e-05,-4e-05,-3.1e-05,-2.5e-05,-4e-05,-2.4e-05,-3.9e-05,-6.5e-05,-4.6e-05,-5.6e-05,-5.7e-05,-7.7e-05,-3.2e-05,-0.000109,-9e-05,-7.7e-05,-3.1e-05,-1.6e-05,-5.2e-05,-5e-06,5e-05,-9e-06,-5.7e-05,-4e-05,-0.000108,-9.5e-05,-6.8e-05,-4.1e-05,-7.3e-05,-4.7e-05,-6.4e-05,-5.1e-05,-3.2e-05,-2.8e-05,-2.9e-05,-3.3e-05,-1.6e-05,-8e-05,-0.00011,-8.6e-05,-5.5e-05,-7.1e-05,-8.2e-05,-0.00011,-9.4e-05,-5.1e-05,-5.5e-05,-4.4e-05,-1.7e-05,-2.8e-05,-2.4e-05,-8.9e-05,-8.5e-05,-0.000108,-7.9e-05,-2.6e-05,-9.7e-05,-6.4e-05,-3.3e-05,-2.3e-05,-8.4e-05,-5e-05,-1.9e-05,8e-06,1e-05,-5.8e-05,-4.4e-05,-5.8e-05,-9e-06,-5e-05,-4.3e-05,-7.9e-05,-6.4e-05,-6.1e-05,-7e-05,-4.7e-05,-4.5e-05,-2.2e-05,-1.1e-05,-1.8e-05,-4.7e-05,-7.9e-05,-7.8e-05,-8.3e-05,-8.4e-05,-4.6e-05,-1.2e-05,-8.5e-05,-9.1e-05,-7.4e-05,-4.7e-05,-7.1e-05,-1e-06,-6e-06,-6e-05,-1.4e-05,-5.5e-05,-3.9e-05,-5.5e-05,-6.5e-05,-7.5e-05,-7.9e-05,-4.7e-05,-0.000104,-6.7e-05,-8.2e-05,-3.5e-05,-2.2e-05,-4e-06,-7.3e-05,-0.000107,-6.4e-05,-4.8e-05,-6.3e-05,-6.9e-05,-8e-05,-7.3e-05
-7.6e-05,-4.1e-05,-3.4e-05,-5.7e-05,-6.5e-05,-6.3e-05,-7.4e-05,-5e-05,-1e-04,-7.4e-05,-6.3e-05,-2.2e-05,-6e-05,-2.9e-05,-5.7e-05,-7.7e-05,-5.3e-05,-5.7e-05,-6.2e-05,-6.2e-05,-4.4e-05,-8.2e-05,2e-05,-1e-05,5e-06,-2.7e-05,-4.4e-05,-4e-06,-4.3e-05,-6.8e-05,-6.6e-05,-8.1e-05,-1.6e-05,-8e-05,-6.2e-05,-4.8e-05,-4.6e-05,-5.3e-05,-2.7e-05,-3.6e-05,-5.8e-05,-7.4e-05,-3.6e-05,-4.9e-05,-4.8e-05,-1.9e-05,-2.9e-05,-5.7e-05,-0.000106,-8.2e-05,-8.6e-05,-7e-05,-4.8e-05,-5.6e-05,-6.8e-05,-7e-05,-7.6e-05,-5e-05,-5.4e-05,-4.3e-05,-6.7e-05,-9.7e-05,-4.2e-05,-8e-05,-4e-05,-8.6e-05,-9.8e-05,-2.1e-05,-3e-05,-5.4e-05,-3.1e-05,1.1e-05,-4.6e-05,-3e-05,-6.2e-05,-2.4e-05,8e-06,-6e-06,-5e-05,-8.3e-05,-7.1e-05,-9.4e-05,-5.5e-05,-4.5e-05,-6.3e-05,-4.6e-05,-4.4e-05,-8.1e-05,-5.7e-05,-8.6e-05,-2.6e-05,-4e-05,-4.8e-05,-9e-06,-1e-04,-5.4e-05,-3.1e-05,-3.3e-05,-6e-05,-3.2e-05,-8.7e-05,-3.8e-05,-4e-06,-5.6e-05,-8.5e-05,-7.8e-05,-3.9e-05,-7.9e-05,-8.2e-05,-7.3e-05,-4.6e-05,-7e-05,-5.3e-05,-8.2e-05,-4e-05,-3.5e-05,-2.1e-05,5e-06,-3.6e-05,-6.9e-05,-5.3e-05
-3e-06,4.2e-05,5e-06,-1.4e-05,2e-06,-2.3e-05,-3.6e-05,-7e-06,-3.1e-05,-2.3e-05,-1.5e-05,2.3e-05,-1.7e-05,-1.2e-05,-3.7e-05,-3.6e-05,1.5e-05,4.5e-05,-2.8e-05,-1.7e-05,1.4e-05,-1.2e-05,-3.9e-05,8e-06,-7.1e-05,-2e-06,-1e-05,-7e-06,2.2e-05,-2e-05,-3e-05,-3.9e-05,6e-06,-3.9e-05,1.6e-05,1.5e-05,-1.3e-05,-4.3e-05,-1e-06,-1.8e-05,-4.4e-05,-2.5e-05,-1.6e-05,-2.6e-05,1.6e-05,3.3e-05,-2.3e-05,2.4e-05,-9e-06,1.4e-05,1.8e-05,1.2e-05,-3.5e-05,-6.3e-05,-4.7e-05,-4e-06,6e-06,-2e-05,-1.5e-05,7e-06,-2.2e-05,1e-06,5.5e-05,-4.8e-05,1e-05,-2.2e-05,-5.8e-05,5e-06,-9e-06,-8e-06,1.6e-05,-1.2e-05,-1.4e-05,0,-8e-06,1.4e-05,1.5e-05,3.2e-05,-3e-06,-2.9e-05,9e-06,-3.7e-05,-1.5e-05,-1.6e-05,-1.5e-05,-8e-06,1.4e-05,-1.9e-05,-2.3e-05,-3e-05,1.4e-05,-5e-06,-3.9e-05,2.7e-05,-2.4e-05,-1.5e-05,-7.4e-05,-1.9e-05,-2.1e-05,1.3e-05,1.4e-05,2.5e-05,-5.2e-05,-2.9e-05,-2.4e-05,-1.7e-05,1.1e-05,-2e-06,3e-06,3e-05,1.5e-05,-6e-05,-5.2e-05,-5.9e-05,1.2e-05,-1e-05,-1.5e-05,2.2e-05,7e-06,-2.2e-05,-2.4e-05
3.5e-05,7e-05,4.8e-05,1.3e-05,8e-05,6.6e-05,6.6e-05,7.7e-05,6.1e-05,6.6e-05,8.6e-05,6.2e-05,7.4e-05,5.7e-05,3.2e-05,4.3e-05,7.6e-05,7e-05,3.2e-05,6.5e-05,8e-05,7e-05,-3e-05,8.4e-05,-1.8e-05,4.9e-05,6.2e-05,4.1e-05,6.6e-05,7.7e-05,5.6e-05,3e-05,5.8e-05,4.1e-05,7.9e-05,9.4e-05,9.3e-05,5.4e-05,3.1e-05,5.2e-05,5.6e-05,7.1e-05,6.6e-05,5.1e-05,6.8e-05,7.4e-05,2.9e-05,5.5e-05,5.4e-05,8.4e-05,4.9e-05,0.000102,8.8e-05,3.4e-05,4e-05,7.3e-05,8.2e-05,4.6e-05,7.2e-05,0.000108,4.3e-05,6.5e-05,2.4e-05,-8e-06,6.2e-05,9.3e-05,7e-05,9e-05,7.3e-05,6.1e-05,9.7e-05,2.2e-05,4.7e-05,6.1e-05,4.8e-05,7.3e-05,7.6e-05,4.6e-05,5.7e-05,4.8e-05,7.1e-05,6.3e-05,9.2e-05,7.1e-05,6.6e-05,6.1e-05,8.4e-05,6.8e-05,6.9e-05,6.1e-05,7.9e-05,7.6e-05,6e-05,6.9e-05,4.9e-05,7.9e-05,4.2e-05,4.4e-05,8e-05,7.3e-05,5e-05,8.1e-05,4.7e-05,4.4e-05,2.4e-05,6.2e-05,5.7e-05,6.4e-05,7.7e-05,7.8e-05,0.000103,7.8e-05,4.8e-05,4.4e-05,8.7e-05,7.6e-05,5.3e-05,5.3e-05,5.4e-05,6.8e-05,5.7e-05
3.2e-05,2.6e-05,2.5e-05,1.8e-05,1.9e-05,-4e-06,7e-06,6e-06,2.9e-05,3.2e-05,4e-06,2e-06,1.3e-05,6e-06,1.9e-05,2.5e-05,5e-05,7e-06,3.8e-05,1e-05,1e-05,1.1e-05,-3.1e-05,4e-06,-4.3e-05,-1e-06,6e-06,2e-05,3e-05,3.3e-05,1.9e-05,-5e-06,1.5e-05,4.1e-05,1.6e-05,3e-06,5.4e-05,3.2e-05,1.6e-05,2e-06,2.3e-05,2.2e-05,-4e-06,3.5e-05,4.2e-05,9e-06,2.3e-05,3.2e-05,3.2e-05,4.8e-05,5e-06,1.8e-05,4.5e-05,2.1e-05,-1.5e-05,1.8e-05,2.1e-05,1.5e-05,1.5e-05,2.9e-05,3.4e-05,2.6e-05,-1.2e-05,3e-06,1.3e-05,1.7e-05,1.2e-05,6e-06,2.9e-05,-3e-05,-5e-06,2.8e-05,-9e-06,9e-06,4.8e-05,3.1e-05,-1e-06,-3e-06,7e-06,4.1e-05,1.4e-05,1e-05,2.6e-05,4.9e-05,2e-06,1.9e-05,3.7e-05,1.3e-05,2.6e-05,4.6e-05,-2e-06,3.7e-05,3.4e-05,2.8e-05,8e-06,-4e-06,3.5e-05,-3.1e-05,2.1e-05,1.2e-05,8e-06,2.7e-05,1.7e-05,2e-06,4e-06,4.5e-05,1.3e-05,4.7e-05,2.4e-05,1.6e-05,3.1e-05,4e-06,8e-06,1.9e-05,7e-06,7e-06,1.5e-05,1.9e-05,3.2e-05,3.1e-05,7e-06
-2.3e-05,-2.1e-05,-3.5e-05,-2.7e-05,-2e-06,-4.9e-05,-2.6e-05,-3e-05,-9e-06,-1.2e-05,-1.7e-05,-6.2e-05,-5e-05,-3.5e-05,-1.7e-05,-5e-05,-3.7e-05,-1.8e-05,-3.2e-05,-2.6e-05,-3.2e-05,-4e-06,2.4e-05,-4e-06,-4.1e-05,-1.6e-05,-2.8e-05,-3.5e-05,3e-06,-3.4e-05,-3.6e-05,-4.9e-05,-7.2e-05,-1.9e-05,-4.1e-05,-1.1e-05,5e-06,-1.6e-05,-2.9e-05,-1.1e-05,-2.9e-05,-1.6e-05,-3.5e-05,-4.4e-05,-2e-06,-2.2e-05,-4.7e-05,-5.5e-05,-4.5e-05,-1.2e-05,-1.2e-05,-1e-05,-1.8e-05,-1.5e-05,-4.6e-05,-2.5e-05,-5.2e-05,-6e-06,-7.1e-05,-2.4e-05,-7e-06,-4.8e-05,-4.6e-05,-4.3e-05,-5.9e-05,-2e-05,-1.7e-05,-3.7e-05,-1.7e-05,-2.6e-05,-2.4e-05,8e-06,-3.2e-05,-4.9e-05,-2.2e-05,-2.4e-05,-3.7e-05,-6.2e-05,-4.7e-05,-1.2e-05,-3.1e-05,-3.3e-05,-1.5e-05,5e-06,-1.2e-05,-2.9e-05,-3.8e-05,-3.9e-05,-4.1e-05,-2.4e-05,-2.6e-05,-1.1e-05,-2.7e-05,-3.6e-05,-2.6e-05,-2.6e-05,-1.6e-05,-3.1e-05,-1e-06,-2.7e-05,-2e-06,-2.2e-05,-3e-05,2.1e-05,-4.1e-05,-1.8e-05,-3.8e-05,-1.6e-05,-3.6e-05,-3.4e-05,-2.3e-05,-1e-06,-3.2e-05,2e-06,-2.4e-05,-4.9e-05,-4.2e-05,-1.8e-05,-3.5e-05,-1.4e-05,-3.5e-05
-3.4e-05,-1.4e-05,-1.6e-05,-2.7e-05,-3e-06,-2.5e-05,-2e-05,-5.6e-05,-5e-06,-3.2e-05,-1.7e-05,-4.3e-05,-1.7e-05,-2.6e-05,-1.1e-05,-3e-05,-3.6e-05,-2.3e-05,-3.1e-05,-2.1e-05,-4e-05,-4e-06,2.5e-05,2e-05,2.5e-05,-1.8e-05,-3.3e-05,-1.4e-05,5e-06,-1.5e-05,-3e-06,-3.8e-05,-4.1e-05,0,-2.8e-05,-5.5e-05,-1.2e-05,-1.6e-05,-2e-05,-2.2e-05,-2.2e-05,-2e-05,-1.5e-05,-9e-06,-2.1e-05,1e-06,-1.6e-05,-7e-06,-2.6e-05,-1.4e-05,-5.6e-05,-3.7e-05,-1.8e-05,-1.7e-05,-3.3e-05,-3.9e-05,-1.1e-05,-3e-05,-2.9e-05,-2.3e-05,-1.1e-05,-1.8e-05,-2.1e-05,-2.7e-05,-5.3e-05,-3.6e-05,-2.9e-05,-6e-05,-1.3e-05,-1.5e-05,3e-06,-6e-06,-2e-06,-5.5e-05,-2e-05,-8e-06,-2e-06,-2.3e-05,-2.1e-05,-4.1e-05,-3.2e-05,-2.8e-05,-3.5e-05,-1.4e-05,-7e-06,-3e-05,-1e-05,-2.9e-05,-4.3e-05,-2e-05,-5.1e-05,8e-06,-5e-06,-2e-05,-1.5e-05,-3.8e-05,-1.8e-05,-6.3e-05,-2e-06,-1.5e-05,-8e-06,-2.7e-05,-9e-06,-4e-06,-2.6e-05,-2.3e-05,-2.9e-05,-1e-06,-2.5e-05,-3.5e-05,-7e-06,-2.5e-05,-3.4e-05,-1.9e-05,-2.8e-05,1.2e-05,-1.6e-05,-1.4e-05,1.4e-05,2e-06,-3.1e-05
3e-06,-1.3e-05,0,-1.9e-05,-6e-06,-4e-06,-1.1e-05,-2.4e-05,5e-06,-1.8e-05,-2e-06,-1.7e-05,8e-06,-3e-06,-4e-06,-2.6e-05,-2.7e-05,1e-05,1.1e-05,-1.6e-05,-1.7e-05,4e-06,-9e-06,-2.8e-05,-7e-06,-1.9e-05,-7e-06,2e-06,-9e-06,1.5e-05,-1e-05,-1.4e-05,-1.8e-05,6e-06,-1.4e-05,-3e-06,-9e-06,-2e-05,-5e-06,-2e-06,-8e-06,-1.8e-05,1.4e-05,-4e-06,-3.1e-05,2e-06,7e-06,-5e-06,-6e-06,-1.5e-05,-1.9e-05,7e-06,6e-06,-1.5e-05,-2e-05,-2.7e-05,-2e-06,-1.3e-05,-1.3e-05,-1e-05,-2e-06,-3e-06,1.7e-05,-1.3e-05,-2.2e-05,2e-06,-1e-05,-3.8e-05,-1.2e-05,-1e-06,1e-06,-3.7e-05,-1.7e-05,-2.2e-05,0,-1.4e-05,2.5e-05,2e-06,-5e-06,-1.9e-05,-1.7e-05,-3e-06,-2.7e-05,-1.2e-05,2e-06,-1.2e-05,-2e-06,-1.4e-05,-1.7e-05,5e-06,-2.3e-05,1.3e-05,-7e-06,7e-06,-4e-06,-6e-06,-1e-05,-3.3e-05,-3e-06,2e-06,4e-06,-6e-06,2.7e-05,-1.1e-05,-5e-06,-1.1e-05,4e-06,1e-05,8e-06,0,-8e-06,-1.7e-05,-2.5e-05,-3e-05,-2.9e-05,2.8e-05,-1.1e-05,-1.9e-05,1.1e-05,8e-06,-1.3e-05
1.8e-05,1.1e-05,1e-05,1e-05,7e-06,2.8e-05,1.3e-05,1.1e-05,2e-05,2.3e-05,1.8e-05,2.8e-05,2.1e-05,4e-05,2e-05,3e-06,0,1.8e-05,1.6e-05,1e-05,2.5e-05,3.1e-05,-2.4e-05,-2.9e-05,-2.8e-05,3e-06,1.8e-05,2.9e-05,1.5e-05,2.2e-05,1.2e-05,2.5e-05,5e-06,3e-05,2.2e-05,1.5e-05,2.5e-05,1.3e-05,6e-06,1.7e-05,5e-06,9e-06,3.8e-05,1.4e-05,1e-05,1.9e-05,6e-06,4e-06,4e-06,6e-06,2.9e-05,-1e-06,3.6e-05,6e-06,2.1e-05,5e-06,6e-06,3.9e-05,1.1e-05,8e-06,3.2e-05,7e-06,2.5e-05,1.7e-05,0,8e-06,3.2e-05,1.6e-05,1.6e-05,3e-05,1.5e-05,1.8e-05,-6e-06,1.1e-05,7e-06,1.6e-05,2.1e-05,-1e-06,1.2e-05,-4e-06,1.6e-05,1.5e-05,3e-06,3.1e-05,2.3e-05,2.7e-05,2.5e-05,1e-05,1.7e-05,1.2e-05,1.3e-05,2.1e-05,3e-06,8e-06,1.7e-05,1.2e-05,2.3e-05,2.9e-05,1.5e-05,3e-05,2.2e-05,1.3e-05,3.9e-05,1.8e-05,1.4e-05,-4e-06,2.2e-05,1.7e-05,1.8e-05,1.9e-05,2.1e-05,2.2e-05,2.1e-05,-2e-06,6e-06,2.3e-05,2.1e-05,1.3e-05,2e-05,1e-05,1.8e-05
9e-06,5e-06,-5e-06,1.1e-05,3e-06,-3e-06,-4e-06,-1e-05,8e-06,9e-06,1e-05,0,1.2e-05,2e-05,2e-06,3e-06,-3e-06,2e-06,1e-06,1.4e-05,2e-06,5e-06,-1.3e-05,-8e-06,-2.7e-05,-1.8e-05,-1e-06,1.2e-05,4e-06,8e-06,0,1.1e-05,-1e-06,2e-05,1.4e-05,-1.5e-05,-4e-06,7e-06,4e-06,-9e-06,-5e-06,3e-06,7e-06,-7e-06,5e-06,9e-06,2e-06,1.3e-05,0,-7e-06,9e-06,-6e-06,6e-06,2e-06,1.3e-05,-1.4e-05,3e-06,9e-06,-1e-06,-4e-06,2.6e-05,1.2e-05,0,7e-06,1.1e-05,-1.1e-05,8e-06,1.1e-05,2e-06,-5e-06,-2e-06,1.6e-05,1.2e-05,-3e-06,-2e-06,6e-06,-2e-06,8e-06,1.1e-05,-7e-06,6e-06,-8e-06,1e-06,7e-06,1.6e-05,-6e-06,8e-06,3e-06,2e-06,1.2e-05,1.4e-05,3e-06,0,8e-06,-3e-06,6e-06,1e-05,5e-06,-9e-06,7e-06,-3e-06,-5e-06,4e-06,1e-05,7e-06,-8e-06,1.3e-05,3e-06,1.5e-05,4e-06,-9e-06,1.1e-05,-4e-06,4e-06,-3e-06,-4e-06,3e-06,1e-06,1e-05,8e-06,6e-06
-1.2e-05,-7e-06,0,-3e-06,-5e-06,-3e-06,-1.4e-05,-2e-06,-8e-06,-1e-06,-6e-06,-5e-06,-4e-06,-1e-06,-6e-06,-3e-06,-5e-06,-1.4e-05,-3e-06,-7e-06,-1e-06,-9e-06,1e-05,9e-06,-1.1e-05,-3e-06,0,-8e-06,-1.3e-05,7e-06,-1.1e-05,-1.1e-05,-1e-06,-5e-06,7e-06,-1.4e-05,-2e-06,6e-06,-3e-06,-8e-06,-3e-06,-8e-06,-9e-06,-1e-05,-5e-06,-1e-06,-1.6e-05,-7e-06,-1.5e-05,-9e-06,-1.2e-05,1e-06,0,-8e-06,-1e-05,-1.3e-05,-9e-06,-1.6e-05,3e-06,-1.6e-05,-5e-06,5e-06,-1.5e-05,-6e-06,0,-1.2e-05,5e-06,3e-06,0,-8e-06,-3e-06,1e-06,-6e-06,-6e-06,-1.6e-05,-3e-06,-6e-06,-2.2e-05,-7e-06,-1.7e-05,2e-06,-1.5e-05,-1e-05,-4e-06,0,-9e-06,-1.1e-05,-1.4e-05,-7e-06,-1.2e-05,-5e-06,-1e-05,-8e-06,-1.7e-05,-5e-06,7e-06,-2e-06,2e-06,-1.5e-05,3e-06,-1.1e-05,-4e-06,-2e-06,-1.3e-05,-2e-06,-1.3e-05,-1.2e-05,-1.1e-05,5e-06,-8e-06,-7e-06,-7e-06,1e-06,-1.4e-05,8e-06,-9e-06,-2e-05,-1.2e-05,-4e-06,-1e-05,-5e-06
-1e-05,-2e-06,1e-06,-8e-06,-3e-06,-4e-06,-5e-06,-1e-06,-1.1e-05,6e-06,-9e-06,-1e-06,-8e-06,1.1e-05,-9e-06,-2e-06,-5e-06,-6e-06,6e-06,-1e-06,3e-06,-8e-06,8e-06,2e-06,4e-06,1.3e-05,-3e-06,-8e-06,-8e-06,5e-06,0,-2e-06,1e-06,-1.3e-05,2e-06,-1.4e-05,-1.3e-05,-3e-06,-5e-06,-1e-06,-1.2e-05,-1e-06,-1.4e-05,-2e-06,-7e-06,-8e-06,2e-06,-2e-06,-9e-06,-1e-06,-2.6e-05,-1.4e-05,-9e-06,-7e-06,-2e-06,0,-7e-06,-1e-06,-1e-05,-8e-06,6e-06,-2e-06,4e-06,-7e-06,6e-06,-1.3e-05,-9e-06,-3e-06,-5e-06,-2e-06,-5e-06,-7e-06,-9e-06,1.1e-05,-2.3e-05,0,-7e-06,5e-06,2e-06,-9e-06,-1e-05,-1.1e-05,-5e-06,-8e-06,-1e-06,4e-06,-8e-06,0,-3e-06,-5e-06,-4e-06,-1.8e-05,0,-9e-06,-9e-06,9e-06,-6e-06,-2e-06,-1.7e-05,3e-06,-6e-06,2e-06,0,-3e-06,3e-06,-4e-06,-1.2e-05,-1.1e-05,4e-06,-7e-06,-3e-06,0,-1e-06,-1.5e-05,-4e-06,-1.3e-05,5e-06,-1.1e-05,0,2e-06,1e-06
-8e-06,3e-06,-1e-06,2e-06,-3e-06,-6e-06,2e-06,-4e-06,-8e-06,3e-06,-3e-06,-4e-06,-8e-06,8e-06,-6e-06,-3e-06,1e-06,-6e-06,3e-06,1e-06,0,-8e-06,-1.1e-05,9e-06,0,-1e-06,-1.1e-05,-6e-06,-3e-06,-1e-06,-1e-06,-6e-06,0,-5e-06,0,-2e-06,-8e-06,1e-06,-3e-06,-1e-06,-1e-06,3e-06,-1.2e-05,2e-06,5e-06,-8e-06,-3e-06,4e-06,0,-2e-06,-1e-05,-9e-06,3e-06,-3e-06,-5e-06,-2e-06,-7e-06,0,-6e-06,4e-06,-3e-06,5e-06,1e-06,-3e-06,-2e-06,-8e-06,2e-06,-3e-06,-5e-06,-1e-06,-3e-06,-1e-06,-5e-06,1e-06,-1.3e-05,-1e-06,-2e-06,-2e-06,0,-2e-06,-5e-06,-8e-06,2e-06,-1e-05,2e-06,-4e-06,-6e-06,-1e-06,-1e-06,-6e-06,-3e-06,-6e-06,-1e-06,-3e-06,1e-06,2e-06,-1e-06,-1.6e-05,-1.3e-05,-6e-06,-2e-06,-3e-06,0,0,-1e-05,-1e-06,-9e-06,-2e-06,3e-06,3e-06,-4e-06,3e-06,-4e-06,-9e-06,-3e-06,-8e-06,8e-06,-7e-06,-5e-06,0,-3e-06
-6e-06,1e-06,-1e-06,1e-06,0,-3e-06,5e-06,-2e-06,-6e-06,2e-06,4e-06,-4e-06,2e-06,2e-06,2e-06,0,0,-1e-06,1e-06,3e-06,-1e-06,2e-06,-1e-05,2e-06,-1e-06,-6e-06,-3e-06,-2e-06,4e-06,0,-3e-06,0,-2e-06,-5e-06,-4e-06,6e-06,1e-06,3e-06,0,0,0,1e-06,-3e-06,4e-06,3e-06,-3e-06,-1e-06,1e-06,-4e-06,0,2e-06,9e-06,-5e-06,-1e-06,-3e-06,7e-06,2e-06,3e-06,4e-06,-3e-06,4e-06,6e-06,-1e-06,1e-06,0,1e-06,3e-06,-3e-06,-3e-06,1e-06,-1e-06,5e-06,4e-06,-7e-06,-3e-06,-1e-06,4e-06,-2e-06,-2e-06,-1e-06,-1e-06,3e-06,-1e-06,-4e-06,4e-06,-3e-06,1e-06,1e-06,0,1e-06,-6e-06,-5e-06,0,-2e-06,4e-06,6e-06,-3e-06,0,-3e-06,-9e-06,5e-06,-1e-06,2e-06,0,-1e-06,4e-06,-5e-06,-2e-06,-2e-06,1e-06,3e-06,1e-06,-2e-06,1e-06,0,4e-06,-6e-06,4e-06,3e-06,-1e-06,-1e-06
-4e-06,0,0,-1e-06,-1e-06,1e-06,-1e-06,-2e-06,-5e-06,-3e-06,0,-3e-06,-2e-06,0,-1e-06,-3e-06,0,1e-06,3e-06,-2e-06,0,-1e-06,-2e-06,-2e-06,0,2e-06,-3e-06,-7e-06,3e-06,2e-06,-4e-06,0,-4e-06,-7e-06,-6e-06,2e-06,-6e-06,1e-06,-2e-06,4e-06,-2e-06,-1e-06,0,0,0,0,0,-3e-06,2e-06,2e-06,-5e-06,1e-06,-6e-06,-4e-06,2e-06,2e-06,-1e-06,-2e-06,-1e-06,3e-06,-3e-06,1e-06,4e-06,-2e-06,-7e-06,6e-06,-4e-06,-3e-06,0,0,-5e-06,0,-2e-06,-2e-06,-2e-06,-3e-06,5e-06,-5e-06,-1e-06,-1e-06,-4e-06,-2e-06,-3e-06,-4e-06,0,0,0,0,1e-06,-3e-06,-3e-06,1e-06,-1e-06,2e-06,-1e-06,-1e-06,-3e-06,1e-06,1e-06,-4e-06,-1e-06,-2e-06,3e-06,1e-06,2e-06,2e-06,-1e-06,-1e-06,-2e-06,0,1e-06,-2e-06,4e-06,-1e-06,-5e-06,1e-06,-7e-06,4e-06,-1e-06,0,-1e-06
-1e-06,0,1e-06,-1e-06,1e-06,3e-06,2e-06,-4e-06,-2e-06,0,2e-06,1e-06,0,1e-06,-1e-06,-3e-06,0,3e-06,4e-06,1e-06,0,-2e-06,5e-06,0,-2e-06,-2e-06,-2e-06,-2e-06,2e-06,-1e-06,3e-06,1e-06,-3e-06,-3e-06,-2e-06,6e-06,-2e-06,-1e-06,3e-06,-2e-06,-3e-06,1e-06,1e-06,1e-06,-1e-06,1e-06,1e-06,1e-06,-1e-06,1e-06,1e-06,-3e-06,2e-06,0,1e-06,-2e-06,2e-06,0,-4e-06,5e-06,-3e-06,1e-06,0,0,-4e-06,4e-06,-3e-06,-3e-06,0,0,-2e-06,-4e-06,1e-06,-1e-06,0,-3e-06,0,1e-06,1e-06,1e-06,1e-06,2e-06,-1e-06,-3e-06,2e-06,-3e-06,-1e-06,0,0,0,-3e-06,-1e-06,1e-06,4e-06,3e-06,2e-06,1e-06,-6e-06,2e-06,1e-06,-2e-06,-3e-06,1e-06,0,-1e-06,4e-06,3e-06,0,-1e-06,0,3e-06,1e-06,0,0,-4e-06,2e-06,3e-06,1e-06,-2e-06,1e-06,0
2e-06,-1e-06,-1e-06,1e-06,0,1e-06,0,2e-06,-1e-06,0,2e-06,0,3e-06,1e-06,1e-06,-1e-06,0,3e-06,2e-06,1e-06,1e-06,1e-06,3e-06,-1e-06,-2e-06,-1e-06,4e-06,-1e-06,1e-06,-1e-06,-3e-06,1e-06,-2e-06,-1e-06,0,2e-06,1e-06,2e-06,1e-06,2e-06,2e-06,0,1e-06,-2e-06,0,3e-06,0,0,1e-06,1e-06,3e-06,2e-06,0,-1e-06,0,-1e-06,5e-06,2e-06,0,2e-06,-2e-06,4e-06,-1e-06,1e-06,-1e-06,6e-06,4e-06,0,1e-06,0,0,-2e-06,1e-06,-2e-06,5e-06,-2e-06,1e-06,0,0,0,5e-06,0,-1e-06,1e-06,0,0,4e-06,-1e-06,2e-06,3e-06,3e-06,2e-06,0,4e-06,0,0,2e-06,2e-06,5e-06,-1e-06,3e-06,2e-06,-1e-06,-1e-06,1e-06,2e-06,2e-06,2e-06,0,0,0,2e-06,-1e-06,-1e-06,-1e-06,-1e-06,0,4e-06,-3e-06,-1e-06,1e-06
0,0,1e-06,1e-06,1e-06,0,-1e-06,-1e-06,0,0,0,2e-06,1e-06,-1e-06,1e-06,-1e-06,-1e-06,2e-06,-1e-06,0,0,1e-06,-3e-06,-6e-06,1e-06,1e-06,2e-06,-2e-06,2e-06,0,0,0,1e-06,-1e-06,3e-06,-3e-06,3e-06,1e-06,1e-06,-1e-06,0,1e-06,-1e-06,-2e-06,1e-06,2e-06,-1e-06,-1e-06,-2e-06,0,0,0,-2e-06,-1e-06,2e-06,-3e-06,2e-06,0,1e-06,-3e-06,-2e-06,0,-3e-06,-1e-06,1e-06,2e-06,-1e-06,2e-06,2e-06,-1e-06,-1e-06,4e-06,-2e-06,0,3e-06,0,-3e-06,-3e-06,0,-2e-06,1e-06,-2e-06,-2e-06,3e-06,-1e-06,-1e-06,2e-06,0,0,0,1e-06,1e-06,0,-1e-06,-1e-06,3e-06,-1e-06,3e-06,4e-06,2e-06,-1e-06,0,-5e-06,3e-06,1e-06,-1e-06,1e-06,1e-06,0,-3e-06,1e-06,0,2e-06,1e-06,1e-06,0,-3e-06,2e-06,-1e-06,0,0
-1e-06,-1e-06,0,-1e-06,0,-1e-06,-2e-06,-1e-06,0,-2e-06,-1e-06,-1e-06,-3e-06,-2e-06,-1e-06,-1e-06,-1e-06,0,1e-06,0,0,-3e-06,-3e-06,-3e-06,-1e-06,-1e-06,-1e-06,-4e-06,-1e-06,-1e-06,0,-2e-06,0,-1e-06,3e-06,-4e-06,0,0,-1e-06,-1e-06,-2e-06,-1e-06,-4e-06,-4e-06,-2e-06,0,-1e-06,0,0,0,-3e-06,-4e-06,-1e-06,-2e-06,-1e-06,-4e-06,-1e-06,-2e-06,-3e-06,0,-3e-06,-1e-06,-1e-06,-2e-06,2e-06,-1e-06,-3e-06,0,0,-2e-06,1e-06,1e-06,0,2e-06,0,0,-2e-06,3e-06,0,-2e-06,1e-06,-2e-06,-1e-06,0,-1e-06,-1e-06,-2e-06,-2e-06,-1e-06,0,0,1e-06,0,-3e-06,-1e-06,2e-06,-1e-06,-4e-06,2e-06,2e-06,-1e-06,0,-3e-06,-1e-06,0,-2e-06,-2e-06,1e-06,0,-2e-06,-1e-06,-1e-06,-1e-06,-1e-06,0,-3e-06,0,-3e-06,-1e-06,0,0
0,0,0,0,0,-1e-06,0,0,1e-06,1e-06,0,0,0,-1e-06,0,-1e-06,-1e-06,0,1e-06,-1e-06,0,1e-06,0,2e-06,-3e-06,2e-06,0,0,-1e-06,-1e-06,0,-1e-06,2e-06,0,1e-06,-2e-06,2e-06,-1e-06,-1e-06,1e-06,0,0,-2e-06,-1e-06,-1e-06,-1e-06,0,0,-1e-06,-1e-06,-5e-06,-1e-06,2e-06,-1e-06,-2e-06,-2e-06,0,-1e-06,-1e-06,-2e-06,-4e-06,1e-06,0,-1e-06,2e-06,-2e-06,1e-06,-1e-06,0,1e-06,2e-06,-1e-06,0,2e-06,0,1e-06,0,-2e-06,-1e-06,-2e-06,-1e-06,0,-1e-06,0,0,1e-06,0,-1e-06,-1e-06,-1e-06,-1e-06,1e-06,0,-2e-06,0,3e-06,0,0,2e-06,-1e-06,2e-06,2e-06,-2e-06,-1e-06,-1e-06,-2e-06,-2e-06,1e-06,0,-1e-06,-1e-06,0,-1e-06,-2e-06,1e-06,1e-06,2e-06,-3e-06,-1e-06,0,0
0,0,0,0,0,-1e-06,0,-1e-06,1e-06,1e-06,-1e-06,-1e-06,1e-06,0,0,-1e-06,-1e-06,-1e-06,0,0,0,2e-06,3e-06,0,0,0,-2e-06,0,0,0,-1e-06,0,0,1e-06,0,-3e-06,2e-06,1e-06,-1e-06,0,1e-06,1e-06,1e-06,-1e-06,0,-1e-06,0,0,-1e-06,0,-1e-06,0,-1e-06,-1e-06,1e-06,-1e-06,-1e-06,2e-06,0,-2e-06,0,0,1e-06,0,1e-06,-2e-06,0,0,-1e-06,0,1e-06,-2e-06,-1e-06,0,0,1e-06,1e-06,1e-06,0,-1e-06,-1e-06,-1e-06,0,2e-06,-1e-06,-1e-06,0,0,0,1e-06,-1e-06,1e-06,0,-2e-06,0,1e-06,0,-2e-06,0,-2e-06,0,0,-2e-06,2e-06,0,-2e-06,0,1e-06,-1e-06,0,-1e-06,1e-06,0,-1e-06,0,2e-06,1e-06,-2e-06,1e-06,0,0
0,0,0,0,0,0,0,-1e-06,1e-06,-1e-06,0,-1e-06,-1e-06,-3e-06,0,-1e-06,0,0,0,1e-06,-1e-06,0,1e-06,2e-06,0,-1e-06,-2e-06,1e-06,-1e-06,0,0,0,-1e-06,1e-06,-2e-06,2e-06,1e-06,0,0,0,-1e-06,0,2e-06,0,1e-06,0,0,0,0,-1e-06,0,-1e-06,0,-1e-06,0,0,-2e-06,0,-1e-06,-1e-06,-2e-06,0,1e-06,0,-1e-06,-2e-06,-1e-06,-1e-06,0,0,0,2e-06,-1e-06,-2e-06,-1e-06,1e-06,1e-06,-1e-06,0,-2e-06,-1e-06,-1e-06,0,1e-06,0,-1e-06,0,0,0,-1e-06,-1e-06,1e-06,0,0,0,1e-06,-1e-06,-2e-06,-1e-06,-1e-06,0,0,0,0,-1e-06,-2e-06,0,1e-06,-1e-06,1e-06,-1e-06,-1e-06,1e-06,-1e-06,0,1e-06,-2e-06,-1e-06,0,0,0
0,0,0,0,0,1e-06,0,0,1e-06,0,0,0,1e-06,-2e-06,0,-1e-06,0,0,1e-06,-1e-06,0,1e-06,-2e-06,3e-06,0,2e-06,0,1e-06,-1e-06,0,0,0,-2e-06,1e-06,-2e-06,-1e-06,-1e-06,0,0,0,-1e-06,0,3e-06,0,0,1e-06,0,1e-06,0,0,-2e-06,0,1e-06,-1e-06,0,1e-06,0,0,-1e-06,0,0,0,0,0,-2e-06,-1e-06,0,-1e-06,-1e-06,0,1e-06,1e-06,1e-06,-1e-06,-2e-06,0,0,0,0,-1e-06,0,0,0,0,0,0,0,0,0,0,-1e-06,0,0,1e-06,0,-1e-06,0,2e-06,-2e-06,1e-06,1e-06,0,0,-1e-06,0,-1e-06,1e-06,0,-1e-06,0,0,-1e-06,0,-1e-06,-1e-06,0,-1e-06,0,0,0,0
0,0,0,0,0,0,0,0,1e-06,0,0,1e-06,2e-06,-1e-06,0,0,0,0,0,0,0,1e-06,-2e-06,1e-06,0,-1e-06,0,1e-06,-1e-06,0,-1e-06,0,-1e-06,1e-06,-1e-06,2e-06,-1e-06,0,1e-06,0,0,0,1e-06,0,0,1e-06,0,0,0,0,0,1e-06,1e-06,-1e-06,1e-06,0,0,0,0,1e-06,0,1e-06,0,0,-1e-06,-1e-06,1e-06,0,0,0,0,-1e-06,-1e-06,-1e-06,-2e-06,0,-1e-06,1e-06,0,0,1e-06,-1e-06,0,0,0,0,0,0,0,0,1e-06,0,0,1e-06,0,0,1e-06,-1e-06,-2e-06,1e-06,-1e-06,-1e-06,0,0,0,0,1e-06,0,0,1e-06,0,0,0,-1e-06,-1e-06,0,1e-06,1e-06,0,0,0
0,0,0,0,0,0,0,-1e-06,0,0,0,0,0,-1e-06,0,-1e-06,0,0,-1e-06,0,0,-1e-06,1e-06,-1e-06,0,-1e-06,1e-06,1e-06,0,0,1e-06,0,0,1e-06,1e-06,1e-06,0,0,0,-1e-06,0,0,0,0,0,0,0,0,0,0,-1e-06,0,0,-1e-06,0,0,0,0,0,1e-06,0,-1e-06,-1e-06,0,0,0,0,0,0,0,-1e-06,-2e-06,0,-1e-06,-2e-06,-1e-06,-1e-06,-1e-06,0,0,0,-1e-06,0,0,0,0,0,0,0,0,0,-1e-06,0,1e-06,0,-1e-06,0,0,-2e-06,1e-06,0,0,-1e-06,-1e-06,0,1e-06,0,-1e-06,0,0,0,1e-06,0,-1e-06,-1e-06,-1e-06,0,1e-06,1e-06,0,0
0,0,0,0,0,0,0,0,0,0,0,0,-1e-06,-1e-06,0,0,0,0,0,0,0,0,2e-06,0,-1e-06,1e-06,0,-1e-06,0,0,-1e-06,0,0,0,1e-06,0,-1e-06,0,0,1e-06,0,0,-1e-06,-1e-06,0,0,0,0,-1e-06,0,-1e-06,-1e-06,0,-1e-06,-1e-06,0,0,0,-1e-06,1e-06,1e-06,0,0,0,1e-06,0,0,1e-06,0,0,0,1e-06,1e-06,0,-1e-06,0,0,1e-06,0,-1e-06,1e-06,-1e-06,-1e-06,0,0,0,0,0,0,0,1e-06,0,0,0,0,0,0,1e-06,-1e-06,1e-06,0,0,0,0,0,1e-06,-1e-06,-1e-06,0,-1e-06,0,-1e-06,1e-06,0,0,-1e-06,-2e-06,1e-06,0,0,0
0,0,0,0,0,-1e-06,0,-1e-06,0,0,0,0,1e-06,0,0,-1e-06,0,0,0,0,0,0,0,-2e-06,0,-1e-06,0,0,0,0,0,0,1e-06,0,1e-06,0,-1e-06,0,0,-1e-06,0,0,-1e-06,0,0,-1e-06,0,0,0,0,-1e-06,1e-06,0,-1e-06,0,-1e-06,0,-1e-06,0,0,0,0,0,0,1e-06,1e-06,0,1e-06,0,0,0,1e-06,0,1e-06,-1e-06,0,0,-1e-06,0,0,0,0,-1e-06,-1e-06,0,0,0,0,0,0,0,-1e-06,0,-1e-06,0,0,0,-2e-06,0,0,-1e-06,0,1e-06,0,0,1e-06,-1e-06,-1e-06,0,-1e-06,0,0,0,0,0,0,1e-06,0,0,0,0
0,0,0,0,0,0,0,0,-1e-06,0,0,0,0,0,0,-1e-06,0,0,0,0,0,-1e-06,-1e-06,-2e-06,0,0,0,0,0,0,0,0,0,0,1e-06,0,0,0,0,1e-06,0,0,0,-1e-06,-1e-06,-1e-06,0,0,0,0,-2e-06,0,0,-1e-06,0,-1e-06,0,0,0,1e-06,1e-06,-1e-06,0,0,1e-06,1e-06,0,0,0,0,-1e-06,0,0,0,0,0,1e-06,1e-06,0,0,0,0,0,-1e-06,0,0,0,0,0,0,0,0,0,0,0,1e-06,0,-1e-06,0,-1e-06,0,0,1e-06,-1e-06,0,1e-06,0,-1e-06,0,0,0,0,0,-1e-06,0,0,1e-06,0,0,0,0
0,0,0,0,0,0,0,0,-1e-06,0,0,0,-1e-06,0,0,0,0,0,-1e-06,0,0,0,-1e-06,0,0,1e-06,0,0,0,0,0,0,0,0,-1e-06,-1e-06,0,0,0,0,0,0,1e-06,0,0,0,0,0,0,0,0,-1e-06,0,-1e-06,0,-1e-06,0,0,0,-1e-06,1e-06,0,0,0,0,1e-06,0,0,0,0,0,-1e-06,0,0,1e-06,0,0,-1e-06,0,-1e-06,0,0,0,0,0,0,0,0,0,0,-1e-06,-1e-06,0,0,0,0,0,0,1e-06,-1e-06,0,0,1e-06,0,0,0,0,0,0,0,0,0,0,0,0,0,-1e-06,0,0,0,0
0,0,0,0,0,0,0,0,0,0,0,0,1e-06,0,0,0,0,1e-06,0,0,0,0,1e-06,0,0,0,0,0,0,0,0,0,-1e-06,0,-1e-06,0,0,0,0,0,0,0,0,-1e-06,0,0,0,0,0,0,0,0,0,-1e-06,1e-06,-1e-06,1e-06,0,0,0,1e-06,0,0,0,-1e-06,0,0,0,0,0,0,0,0,0,1e-06,0,0,0,0,-1e-06,0,0,0,0,0,0,0,0,0,0,0,0,0,0,0,0,0,-1e-06,1e-06,0,0,0,1e-06,0,0,-1e-06,0,0,0,0,0,0,0,-1e-06,0,0,-1e-06,0,0,0,0
0,0,0,0,0,0,0,0,0,0,0,0,0,0,0,0,0,0,0,0,0,-1e-06,1e-06,0,0,0,0,0,0,0,0,0,-1e-06,0,-1e-06,-1e-06,0,0,0,0,0,0,0,0,0,1e-06,0,0,0,0,-1e-06,1e-06,0,-1e-06,0,0,0,0,0,-1e-06,1e-06,0,0,0,-1e-06,0,0,0,0,0,0,1e-06,-1e-06,-1e-06,1e-06,0,0,0,0,-1e-06,0,0,0,0,0,0,0,0,0,0,0,0,0,0,0,-1e-06,0,0,1e-06,0,0,0,1e-06,0,0,-1e-06,0,0,0,0,0,0,0,0,0,0,1e-06,-1e-06,0,0,0
0,0,0,0,0,0,0,0,0,0,0,0,-1e-06,1e-06,0,0,0,0,0,0,0,0,0,2e-06,0,0,0,0,0,0,0,0,-1e-06,0,0,-1e-06,1e-06,0,0,0,0,0,-1e-06,0,0,1e-06,0,0,0,0,-1e-06,-1e-06,0,0,0,0,0,0,0,0,1e-06,0,0,0,-1e-06,0,0,0,0,0,0,0,1e-06,-1e-06,0,0,0,0,0,0,0,0,0,0,0,0,0,0,0,0,0,0,0,0,0,-1e-06,0,0,1e-06,0,0,0,1e-06,0,0,-1e-06,0,0,0,0,0,0,0,0,0,0,0,-1e-06,0,0,0
0,0,0,0,0,0,0,0,0,0,0,0,0,0,0,0,0,0,0,0,0,0,-1e-06,1e-06,0,0,0,0,0,0,0,0,0,0,1e-06,0,0,0,0,0,0,0,-1e-06,0,0,0,0,0,0,0,-1e-06,0,0,0,0,0,0,0,0,-1e-06,1e-06,1e-06,0,0,0,-1e-06,0,0,0,0,0,-1e-06,0,0,0,0,0,1e-06,0,0,0,0,0,0,0,0,0,0,0,0,0,0,0,0,0,-1e-06,0,-1e-06,0,1e-06,0,0,0,0,0,-1e-06,0,0,0,0,0,0,0,-1e-06,0,0,0,-1e-06,0,0,0
0,0,0,0,0,0,0,0,0,0,0,0,0,0,0,0,0,0,0,0,0,0,0,0,0,0,0,0,0,0,0,0,0,0,1e-06,0,0,0,0,0,0,0,0,0,0,0,0,0,0,0,-1e-06,0,0,0,0,0,0,0,0,0,0,0,0,0,0,0,0,0,0,0,0,0,0,0,0,0,0,-1e-06,0,-1e-06,0,0,0,0,0,0,0,0,0,0,0,0,0,0,0,0,0,0,0,0,0,0,1e-06,0,0,0,0,0,0,0,0,0,0,0,0,0,0,0,0,0,0
0,0,0,0,0,0,0,0,0,0,0,0,0,0,0,0,0,0,0,0,0,1e-06,0,0,0,0,0,0,0,0,0,0,0,0,1e-06,1e-06,0,0,0,0,0,0,0,0,0,0,0,0,0,0,-1e-06,0,0,-1e-06,0,0,0,0,0,0,0,0,0,0,1e-06,0,0,0,0,0,0,1e-06,0,0,-1e-06,0,0,1e-06,0,0,0,0,0,0,0,0,0,0,0,0,0,0,0,0,0,0,0,0,-1e-06,-1e-06,0,0,0,0,0,0,0,0,0,0,0,0,0,0,0,0,0,0,0,0,0
0,0,0,0,0,0,0,0,0,0,0,0,0,0,0,0,0,0,0,0,0,0,0,0,0,0,0,0,0,0,0,0,0,0,0,0,0,0,0,0,0,0,0,0,0,0,0,0,0,0,-1e-06,0,0,0,0,0,0,0,0,0,0,0,0,0,0,0,0,0,0,0,0,0,0,0,-1e-06,0,0,-1e-06,0,0,0,0,0,0,0,0,0,0,0,0,0,0,0,0,0,0,0,-1e-06,-1e-06,0,0,0,0,0,0,1e-06,0,0,0,0,0,0,0,-1e-06,0,0,0,1e-06,0,0,0
0,0,0,0,0,0,0,0,0,0,0,0,1e-06,0,0,0,0,0,0,0,0,0,0,-2e-06,0,0,0,0,0,0,0,0,0,0,-1e-06,0,0,0,0,0,0,0,0,0,0,0,0,0,0,0,0,1e-06,0,0,0,0,0,0,0,1e-06,0,0,0,0,0,0,0,0,0,0,0,0,0,0,-1e-06,0,0,0,0,0,0,0,0,0,0,0,0,0,0,0,0,0,0,1e-06,0,0,0,0,-1e-06,0,0,0,0,0,0,1e-06,0,0,0,0,0,0,0,0,0,0,0,1e-06,0,0,0
0,0,0,0,0,0,0,0,0,0,0,0,0,0,0,0,0,0,0,0,0,0,0,-1e-06,0,0,0,0,0,0,0,0,0,0,-1e-06,0,0,0,0,0,0,0,0,0,0,0,0,0,0,0,0,0,0,0,0,0,0,0,0,0,0,0,0,0,0,0,0,0,0,0,0,-1e-06,0,0,-1e-06,0,0,0,0,0,0,0,0,0,0,0,0,0,0,0,0,0,0,1e-06,0,0,0,0,-1e-06,0,0,0,0,0,0,1e-06,0,0,0,0,0,0,0,0,0,0,0,1e-06,0,0,0
0,0,0,0,0,0,0,0,0,0,0,0,0,0,0,0,0,0,0,0,0,0,0,0,0,0,0,0,0,0,0,0,-1e-06,0,-1e-06,0,0,0,0,0,0,0,0,0,0,0,0,0,0,0,-1e-06,0,0,0,0,0,0,0,0,0,0,0,0,0,0,0,0,0,0,0,0,0,0,0,0,0,0,0,0,0,0,0,0,0,0,0,0,0,0,0,0,0,0,0,0,0,0,0,0,0,0,0,0,0,0,0,0,0,0,0,0,0,0,0,0,0,0,0,0,0,0
0,0,0,0,0,0,0,0,0,0,0,0,0,0,0,0,0,0,0,0,0,0,0,0,0,0,0,0,0,0,0,0,0,0,0,0,0,0,0,0,0,0,0,0,0,0,0,0,0,0,-1e-06,0,0,0,0,0,0,0,0,0,0,0,0,0,0,0,0,0,0,0,0,0,0,0,0,0,0,1e-06,0,0,0,0,0,0,0,0,0,0,0,0,0,0,0,0,0,0,0,0,0,0,0,0,-1e-06,0,0,0,0,0,0,0,0,0,0,0,0,0,0,0,0,0,0
0,0,0,0,0,0,0,0,0,0,0,0,0,0,0,0,0,0,0,0,0,0,0,0,0,0,0,0,0,0,0,0,0,0,1e-06,0,0,0,0,0,0,0,0,0,0,0,0,0,0,0,-1e-06,0,0,0,0,0,0,0,0,0,-1e-06,0,0,0,0,0,0,0,0,0,0,0,0,0,1e-06,0,0,-1e-06,0,0,0,0,0,0,0,0,0,0,0,0,0,0,0,0,0,0,0,0,1e-06,0,0,0,0,0,0,-1e-06,0,0,0,0,0,0,0,0,0,0,0,-1e-06,0,0,0
