-3.2e-05,-5.3e-05,-9e-05,-0.000189,-0.00041,-0.001232,-0.00155,-0.001307,-0.002044,-0.00233,-0.001923,-0.001752,-0.003063,-0.002943,-0.002582,-0.002358,-0.003394,-0.005884,-0.005877,-0.00519,-0.005918,-0.006533,-0.005472,-0.005474,-0.006282,-0.008311,-0.008758,-0.006933
-9e-06,-2e-05,-0.000121,-0.000236,-0.000467,-0.001332,-0.001679,-0.001477,-0.001957,-0.00244,-0.002588,-0.002016,-0.003072,-0.003351,-0.003533,-0.002941,-0.003794,-0.007303,-0.007437,-0.005144,-0.005815,-0.006969,-0.003898,-0.005224,-0.006847,-0.009375,-0.00725,-0.005166
1e-05,-1.7e-05,-4.6e-05,-5.7e-05,-0.000192,-0.000321,-0.000506,-0.000423,-0.000363,-0.000585,-0.001345,-0.001124,-0.000712,-0.001545,-0.003866,-0.002499,-0.000898,-0.001744,-0.002767,-0.00229,-0.002476,-0.002176,-0.00113,-0.001281,-0.002538,-0.00261,-0.002107,-0.00072
0,1.6e-05,7e-05,0.000148,0.000208,0.000827,0.000947,0.000866,0.001591,0.001767,0.000902,0.000593,0.002087,0.00095,-0.001462,-0.00038,0.00215,0.00447,0.003658,0.002386,0.003001,0.003072,0.001467,0.003215,0.003246,0.005004,0.004384,0.004104
1.7e-05,3.2e-05,9.5e-05,0.000158,0.000355,0.000995,0.001275,0.00105,0.00179,0.002193,0.002058,0.001737,0.002671,0.001835,0.00222,0.001857,0.002195,0.004335,0.005222,0.004781,0.005899,0.004139,0.002563,0.004169,0.005,0.005705,0.007182,0.005428
-1.4e-05,-1.2e-05,-5e-06,-6e-05,-8.2e-05,-0.000334,-0.000459,-0.00043,-0.000945,-0.00074,0.000145,5.2e-05,-0.00083,-0.000663,0.001252,0.000487,-0.001427,-0.002495,-0.000791,-0.000719,-0.000542,-0.001431,-0.001778,-0.001619,-0.001706,-0.003071,-0.002608,-0.002918
-2.3e-05,-4.1e-05,-7.8e-05,-0.000173,-0.000352,-0.001007,-0.001326,-0.001067,-0.002098,-0.002304,-0.001413,-0.001213,-0.0027,-0.001107,0.000779,-2.8e-05,-0.002595,-0.004981,-0.003994,-0.003761,-0.004798,-0.003141,-0.001832,-0.004235,-0.005076,-0.006272,-0.007931,-0.006942
8e-06,0,-4.5e-05,-2.6e-05,3e-05,4e-05,0.000135,0.000142,5.6e-05,-0.000203,-0.000237,0.000145,-0.000112,0.001697,0.002825,0.001737,0.000546,0.00037,-0.000203,0.000513,-0.000456,0.001678,0.003483,0.000134,0.000614,0.00172,0.000917,0.000562
2.6e-05,3.7e-05,3e-05,0.000115,0.00033,0.000796,0.001112,0.000927,0.001455,0.001447,0.00088,0.000864,0.001653,0.001892,0.000876,0.000731,0.002201,0.004358,0.002434,0.001983,0.00178,0.002367,0.001631,0.002184,0.00424,0.006429,0.005293,0.004282
-3e-06,-4e-06,4.6e-05,8.4e-05,0.000176,0.000458,0.000618,0.000555,0.001108,0.00121,0.000857,0.000343,0.001116,-6.3e-05,-0.001901,-0.000974,0.001128,0.003174,0.002159,0.000751,0.001277,-0.000207,-0.002643,0.001436,0.002897,0.0032,0.001977,0.00161
-2.8e-05,-1.9e-05,8e-06,-2.5e-05,-9.2e-05,-0.000185,-0.000262,-0.000221,2.2e-05,0.000127,0.000278,-3.3e-05,0.000126,-0.001198,-0.001603,-0.000736,-0.000228,-0.000663,0.000712,0.00065,0.00145,-0.000632,-0.001031,0.001099,0.000285,-0.002004,6e-06,-5e-06
1.7e-05,7e-06,-2.5e-05,-0.000106,-0.000344,-0.00087,-0.001226,-0.001001,-0.001595,-0.00161,-0.001244,-0.001043,-0.001643,-0.002233,-0.002214,-0.00142,-0.001659,-0.004461,-0.002806,-0.001932,-0.001764,-0.001953,-0.000292,-0.00145,-0.004312,-0.006793,-0.004185,-0.003127
2e-06,-6e-06,-3.1e-05,-6.8e-05,-0.000313,-0.000763,-0.001046,-0.000728,-0.001313,-0.001581,-0.001794,-0.001357,-0.001872,-0.001419,-0.001659,-0.001504,-0.001553,-0.003391,-0.003834,-0.002997,-0.003413,-0.002266,-0.000724,-0.002923,-0.005422,-0.005477,-0.005431,-0.003851
-5e-06,6e-06,1e-05,7.9e-05,0.000191,0.000498,0.000653,0.00053,0.000979,0.000846,-9e-06,0.000414,0.000871,0.001529,0.001915,0.000665,0.000661,0.001963,-0.000164,0.000943,0.00112,0.001461,0.001474,-0.00011,0.000587,0.002968,0.002858,0.002493
4e-06,1.7e-05,3.9e-05,0.00011,0.000449,0.001137,0.001404,0.000865,0.001447,0.001714,0.00139,0.001426,0.002131,0.002186,0.002681,0.001578,0.001534,0.004038,0.002408,0.002365,0.003123,0.003183,0.001028,0.001371,0.004435,0.006956,0.006728,0.004754
1e-06,-8e-06,5e-06,-5e-06,0.000123,0.000421,0.000482,0.000152,0.000108,0.000356,0.001183,0.000646,0.000499,0.000615,0.001287,0.001457,0.000506,0.001575,0.0027,0.000933,0.000927,0.001496,-0.000489,0.000632,0.002576,0.003082,0.001234,4e-06
-9e-06,-2.3e-05,-3.7e-05,-8e-05,-0.000182,-0.000414,-0.000419,-0.000342,-0.000701,-0.000671,0.000518,-3.6e-05,-0.000915,-0.00041,0.000882,0.001379,-0.000423,-0.001374,0.001923,0.000609,-0.000492,-0.000341,0.000917,0.000656,0.000231,-0.001432,-0.002251,-0.001848
1e-05,9e-06,-2.7e-05,-6.1e-05,-0.000238,-0.000799,-0.000792,-0.000427,-0.000993,-0.001091,-0.000623,-0.000684,-0.001407,-0.001171,-0.001169,-0.000773,-0.00128,-0.003106,-0.001373,-0.001452,-0.002515,-0.002892,-0.000211,-0.000294,-0.001841,-0.003853,-0.003274,-0.001448
0,8e-06,4e-06,2e-06,-0.000152,-0.000557,-0.000514,-6.1e-05,-0.00023,-0.000526,-0.001277,-0.000977,-0.000667,-0.000835,-0.002745,-0.002449,-0.000959,-0.001619,-0.003297,-0.002645,-0.00262,-0.00305,-0.002398,-0.001127,-0.002113,-0.002429,-0.002991,-0.001285
