-0.002787,-0.001959,-0.003718,-0.002088,-0.002391,-0.002136,-0.00341,-0.002652,-0.002712,-0.003675,-0.003345,-0.002816,-0.004273,-0.00359,-0.002306,-0.007107,-0.004976,-0.002824,-0.00265,-0.004289,-0.002329,-0.005433,-0.005274,-0.002755,-0.003121,-0.003539,-0.003125,-0.005533,-0.003481,-0.003206,-0.003581,-0.003063,-0.005862,-0.004922,-0.004746,-0.004765,-0.002321,-0.001996,-0.003361,-0.003566,-0.003144,-0.0043,-0.003619,-0.002252,-0.004196,-0.004169,-0.006695,-0.005382,-0.00408,-0.002222,-0.003843,-0.002746,-0.003067,-0.001865,-0.001839,-0.003056,-0.00307,-0.002304,-0.003238,-0.003395,-0.004368,-0.005139,-0.003356,-0.001679,-0.000493,-0.001264,-0.000899,-0.001682,-0.002329,-0.003128,-0.002603,-0.002023,-0.002507,-0.001331,-0.001659,-0.003053,-0.002143,-0.000816,-0.001905,-0.003505,-0.003004,-0.001843,-0.003168,-0.003865,-0.001676,-0.003007,-0.005618,-0.003451,-0.003843,-0.003401,-0.001828,-0.003738,-0.003278,-0.001997,-0.002156,-0.001724,-0.002804,-0.002322,-0.002346,-0.001325,-0.001923,-0.003171,-0.002946,-0.001462,-0.001943,-0.002179,-0.002602,-0.003094,-0.00146,-0.000358,-0.002582,-0.002755,-0.002023,-0.001849,-0.002571,-0.001716,-0.000564,-0.004355,-0.002427,-0.000321,-0.001253
-0.000565,6.4e-05,-0.004095,-0.003081,-0.00154,0.000123,-0.000474,-0.000777,-0.001146,-0.001425,-0.000887,-0.000599,0.000602,0.001499,0.000917,0.001275,0.001239,-0.000987,-0.001206,0.001407,0.00033,0.000974,0.002191,0.001992,-0.000626,-0.000302,0.001107,0.001982,0.001771,0.000676,-0.000798,-0.001082,0.00175,0.002323,0.001446,0.000536,-8e-06,0.00118,0.001389,0.000178,-0.000956,-0.000377,0.000239,-0.000369,0.001391,-0.000833,0.000691,0.000884,0.001299,0.000322,0.001566,0.000246,0.000358,-0.001293,-0.000701,-2.9e-05,0.000361,-5.9e-05,0.001964,3e-06,-0.000605,0.000489,0.000322,-0.00048,-0.001908,-0.000963,0.000373,-0.00028,-0.002287,-0.000643,-8e-04,-0.001176,-0.001168,-0.00126,-0.000356,3e-04,-0.000342,-0.001603,-0.000505,0.000425,-0.000582,0.00044,-0.00044,0.000826,0.000584,0.000273,0.000901,-0.000473,-3.7e-05,0.000954,-0.001191,-5.6e-05,0.001074,-0.000196,0.001345,-0.000552,0.00035,-0.000465,0.000731,0.000892,-1.3e-05,0.000828,0.000417,-0.001453,-0.001466,-0.001093,-0.000622,-0.000252,-0.000868,-0.002324,0.000963,-0.000155,-0.000492,0.000616,0.001154,-0.000361,-0.001183,-0.000229,-0.000326,-0.000941,-0.002232
0.000249,-0.00096,0.002211,4e-06,0.000816,-8.7e-05,-0.001635,-0.000781,3.4e-05,0.000691,0.001203,0.000332,-0.00088,-0.002095,-0.002115,-0.001203,-0.000278,0.000624,0.000461,-0.002152,-0.000142,-0.000588,-0.001956,-0.002394,-0.002007,0.000782,-0.000165,-0.000175,-0.000879,-0.000671,0.000568,0.001335,-0.001443,-0.000191,-0.000691,-0.00052,0.000333,-0.00191,-0.001951,0.000353,0.001359,-5.9e-05,-0.001742,-0.000207,-0.001802,0.000447,-0.001048,-0.001764,-0.001136,-0.000609,-0.001306,2.3e-05,-0.000604,0.000199,-0.000931,-0.000583,0.000399,-0.000773,-0.001859,-0.000373,0.000555,0.000868,0.000374,-0.000409,-0.000323,-0.000847,-0.000946,-0.001479,0.000156,6e-06,0.00114,0.000614,0.000838,0.000133,-1e-04,-0.000512,0.000342,0.000183,-0.000591,-0.002293,-0.000206,-0.000365,-0.000233,-0.000526,-0.000568,-0.000433,-0.000775,0.000177,0.001334,-0.000388,0.000269,-4.3e-05,-0.000734,-0.000547,-0.000822,-0.000937,0.00046,0.000459,-0.000823,-0.000523,-0.000742,-0.000941,-0.000682,0.000607,-0.000229,0.000719,0.001059,-0.000371,0.000415,0.000261,-3.5e-05,-4e-06,0.000175,-0.000639,-0.000738,0.000649,6.6e-05,-5.8e-05,-0.001199,-0.000841,0.000391
0.001211,0.000581,0.001809,0.001718,0.000854,3.8e-05,0.002201,0.002028,0.002306,-0.000488,-0.000251,-0.000582,0.00029,0.001294,0.000841,0.001113,-0.000151,-0.001306,-7.1e-05,0.001339,-0.00013,0.001336,0.001029,0.002585,0.002303,-0.00054,-0.000836,-0.000358,0.000633,0.000727,-0.000338,0.001416,-2e-06,-0.000819,-0.001104,-4.6e-05,5.8e-05,0.000343,0.000897,-0.000155,-0.000629,-0.00017,0.001465,0.000884,0.000833,-0.000154,6.8e-05,0.002282,0.001222,0.000298,0.000819,-6.2e-05,-0.000421,0.000287,0.000758,0.000128,0.000778,0.000561,0.001083,0.001293,-0.000739,-0.001293,-0.001382,0.000631,0.000912,0.000966,0.001501,0.00208,0.001074,-0.000241,-0.002513,0.000373,0.000944,-6.5e-05,-0.000408,0.000298,-0.000289,0.000675,0.000918,0.002507,0.001154,0.000224,-3.9e-05,0.000189,0.000288,-0.000544,0.000194,-0.000756,-0.001199,0.000131,0.00065,0.000565,0.000638,0.001441,4e-04,0.00159,-0.000682,-0.000511,0.000708,0.000747,0.000978,0.001694,0.00102,0.001354,0.001333,-0.000129,-0.000813,-0.000867,0.00018,0.000999,-0.000129,0.000219,0.000579,9.7e-05,0.000322,0.000432,0.000428,0.000308,0.001748,0.001392,0.001267
-0.001556,0.000163,-0.002839,-0.000549,-0.001044,-0.000352,-0.000567,-0.001847,-0.002029,-0.000268,-0.000873,0.000466,0.000491,-0.001132,-0.000194,0.000339,-0.00017,-6.1e-05,0.000166,0.000197,-3.6e-05,-0.001083,-0.000161,-0.001684,-0.000929,-0.000826,0.000301,-0.000959,-0.00109,-0.000203,-0.000503,-0.001865,0.000535,0.000238,0.001541,0.000237,-0.001178,-4.2e-05,-0.000419,-0.000289,7.3e-05,-0.000404,-0.000252,-0.000959,8.6e-05,-8.6e-05,0.000214,-0.001761,-0.00123,-0.001053,-0.000252,0.000569,0.000988,-9.3e-05,0.000922,9.6e-05,-0.001372,-0.000512,-0.001126,-0.00122,-2.1e-05,0.000877,0.000146,-0.000302,-0.000283,-9e-06,-0.001568,-0.001301,-0.000761,-0.000204,0.000868,1.5e-05,-0.001076,-0.000532,0.000711,-4.2e-05,8.7e-05,-0.000888,-0.001709,-0.001962,-0.000832,-0.000424,0.000708,-0.000663,-0.000522,0.001009,-0.000306,-0.000329,0.000157,-0.000426,-0.000781,-9.6e-05,-0.000909,-0.001317,-0.000111,-0.000335,0.000504,0.000512,-0.000134,-0.000842,-0.00012,-0.001307,-0.000305,-0.001257,-0.000825,-7.6e-05,0.00015,0.001328,-0.00011,-0.000224,-0.000116,-0.000145,-0.000705,0.000932,5e-05,-0.000969,-0.000646,0.000268,-0.000988,-0.001416,-0.000538
0.000901,-0.001105,0.001079,-0.00105,0.000318,0.000568,-0.000615,0.001173,0.0011,0.000795,0.000804,0.000662,-0.000599,0.000641,0.000839,-0.000751,0.000954,0.000195,-0.001298,-0.000352,-0.000473,0.000768,0.000234,0.000914,0.00079,0.000296,-0.000757,0.000753,0.001065,0.000286,0.001135,0.000348,-0.000294,-0.000456,-8e-04,-2.7e-05,0.000159,0.000499,0.000787,0.000571,2.5e-05,0.000589,0.000833,0.000385,-0.000114,0.000972,0.000522,0.000699,0.000801,0.000817,1.5e-05,-0.001155,-0.001218,-0.000596,-0.000862,-0.000388,0.000573,0.000966,0.000485,0.000269,8e-05,-3e-05,0.00072,-0.000402,-0.000396,-0.000902,8.4e-05,0.000663,-0.000209,0.000613,0.000768,-0.000192,0.000201,0.000927,0.000771,-0.000306,-0.000148,-0.000153,0.000425,0.000811,-0.000484,0.000199,-0.000257,0.00054,0.00063,-0.000457,8.2e-05,0.001437,0.000414,-0.000262,-0.000212,-0.000543,0.000527,0.001082,0.000291,-0.000365,-0.000348,2.7e-05,-0.000499,0.001153,0.000147,0.000274,-0.000102,-0.000491,-5.1e-05,-0.000176,-0.00022,-0.000771,-0.000453,-0.000213,-0.000257,0.000283,0.000136,-0.000481,-0.000184,0.000249,0.000583,-0.000749,-6e-06,0.000231,-0.000325
-0.000148,0.000636,-0.001035,0.001175,0.000478,-0.00037,0.000891,2e-05,-0.000211,-0.000405,-0.000675,-0.000981,0.000524,-0.000699,-0.000416,0.000273,-0.000953,0.000464,0.001236,-0.000538,0.000307,-6.5e-05,-0.000752,-0.000302,-0.000329,0.00081,0.000247,-0.000251,0.000406,-0.000291,-0.00073,0.000535,-3.2e-05,-0.000144,0.000369,0.000231,0.001051,-0.000201,-0.000393,-0.00044,0.000191,4e-06,-0.000526,0.000357,0.000131,-0.000994,0.000478,0.000438,-0.000272,-0.000271,8e-06,0.000758,0.000284,-1.3e-05,0.000251,9.8e-05,-0.000327,-0.000802,-0.000318,-0.000352,0.000818,-0.000352,-0.000579,0.000238,7.8e-05,-0.000394,0.000352,-0.000282,0.001087,0.00117,0.000127,-0.000209,1.2e-05,-0.000934,-0.001107,0.00024,9.7e-05,0.000589,0.000862,0.000137,0.001133,8.3e-05,-0.000298,-0.000119,-0.000326,0.000173,5.8e-05,-0.00058,-0.000593,0.000544,0.000662,0.000668,0.000691,-0.000431,-0.000529,0.000195,0.000306,-0.000114,0.000359,-0.000341,-0.000441,0.000278,0.00021,0.000743,0.001137,0.000865,0.000648,0.000331,0.000307,0.00024,0.000113,-0.000349,0.000363,-7.7e-05,-0.00018,-0.000408,-7e-06,0.000134,-0.000218,0.000342,0.000444
-0.000149,0.000111,0.001151,3e-04,-0.00041,-0.000242,-0.000524,0.000259,0.000335,0.000186,0.001155,0.000444,-9e-06,3.1e-05,-0.000428,-5.5e-05,0.000283,-0.000737,-0.000116,0.000546,0.000492,-0.000428,0.000233,-0.000403,0.00018,0.000263,0.000888,0.00041,-0.001135,-6.5e-05,0.000319,-0.000237,0.00052,0.00058,9.5e-05,0.000249,-0.00055,0.000121,-0.000481,0.000514,-0.000382,-0.00044,-0.00012,-0.000368,-0.000221,0.000664,-0.001414,-0.000718,-0.000221,-5.2e-05,3.2e-05,-0.000413,0.000581,0.000147,-0.000142,0.001042,5.2e-05,5.9e-05,2.5e-05,0.000416,-0.00056,0.000136,6e-04,-3.3e-05,0.000117,0.000883,0.000627,-0.000125,-0.000691,-0.001095,-0.00065,0.000532,1e-05,-0.000316,8.2e-05,-0.000268,0.000107,-0.000284,-0.000279,-0.000144,-0.000286,-0.000395,-0.000139,0.000288,0.000374,-0.000258,-0.00022,0.000163,0.000638,-8e-05,-0.000575,-0.000174,-0.000881,-2.2e-05,-0.000237,-0.000769,-0.000474,0.000134,-0.00017,-0.000512,0.00021,0.000138,8e-06,-0.000564,-0.000821,-0.00063,-0.000308,-8e-06,0.000367,-2.5e-05,0.000602,0.000133,-0.000471,4.4e-05,4e-05,0.000326,-9.5e-05,0.00038,0.000773,0.00045,-8.4e-05
-0.000353,-0.000403,-0.000716,-0.001134,-0.000237,0.000328,0.000295,-0.000784,-0.000431,3.9e-05,-0.000249,0.000168,0.000244,0.000358,0.000183,0.000368,-0.000315,0.000916,-0.000121,7.2e-05,-0.000323,0.000178,0.000434,0.000369,-0.000278,-0.000836,-0.000216,-0.000262,0.000586,-7.9e-05,-0.000443,-2.7e-05,-0.000379,-0.000306,8.9e-05,-0.000219,0.000299,0.000561,0.000377,-0.000518,2e-04,0.000598,0.000218,0.000116,0.000596,-0.000374,0.000766,0.000121,-0.000249,-9.5e-05,0.000213,0.000315,-0.000196,0.000442,7e-05,-0.000467,-9.2e-05,0.000314,-0.000371,-0.000394,-0.000122,0.000489,-0.000181,9e-05,-0.000253,-0.000133,-0.000492,-0.000157,0.000261,9e-06,0.000288,-4.5e-05,5e-06,0.000902,0.000292,0.00053,-0.000491,0.000105,-0.000243,4.9e-05,0.000228,0.000469,0.000107,-0.000192,-0.000495,-4.7e-05,0.000642,-7.8e-05,-5.3e-05,-8.2e-05,0.000441,-6.1e-05,0.000175,6.7e-05,0.000417,0.000422,0.000637,-4.2e-05,0.000354,0.000591,-1.5e-05,-0.000622,-0.000284,0.000473,-0.000311,0.000146,4.7e-05,0.000137,4e-05,-0.00042,-0.000297,-0.000262,0.000178,-4.1e-05,0.000209,-0.000223,-0.000183,4.1e-05,-0.000483,-0.000682,-0.000172
0.00043,-0.000173,0.000426,0.000301,-0.000133,-0.000151,-8.3e-05,0.00016,8.1e-05,-0.000485,-3e-04,-0.000285,-3.6e-05,-6e-05,0,-0.000216,0.000262,-0.000686,0.000461,-0.000178,-0.000306,-7.3e-05,-5e-05,-0.000162,0.000146,0.00038,-0.000103,-0.00017,-0.000278,0.000412,0.000445,6e-06,-0.000278,-5.5e-05,-0.000396,-2.4e-05,-0.000467,-0.000469,-0.000247,5.4e-05,-0.000136,-0.000274,-4e-06,-0.000256,-0.000485,0.000168,-7.9e-05,0.00064,0.000768,0.000216,-0.00014,-0.000224,0.000205,-0.000134,-0.000142,-0.000226,-0.000113,-0.000104,0.000326,0.000584,8.8e-05,-0.000492,0.000216,0.000451,6.7e-05,-0.000317,-1.1e-05,0.000436,-0.000118,0.000433,-0.000152,0.000463,-0.000218,0.000363,-0.00022,-0.000339,0.000258,2.7e-05,0.000415,0.000489,-0.000139,-0.000369,0.000222,-6.9e-05,0.000147,0.000174,-0.000426,0.000223,-0.000349,9.1e-05,-0.000401,6.2e-05,-1.8e-05,-8e-06,1e-05,8e-06,-0.000396,-0.000315,-0.00026,0,-1e-04,0.00062,0.000331,-0.000439,0.000389,0.000271,4.8e-05,-0.000107,-0.000192,0.000197,-0.000556,0.000128,-1.6e-05,-0.000205,-0.000327,0.000217,8e-05,-0.000167,-1.1e-05,0.000228,5.3e-05
2e-05,0.000593,0.000358,0.000212,0.000507,-0.000203,-0.000122,0.000392,-4.9e-05,0.000212,-7.3e-05,-0.000128,-0.000764,0.00022,0.000235,0.000161,-1.6e-05,0.000258,-0.00055,7.5e-05,0.000228,-0.000289,-0.000241,0.000335,-7.8e-05,-0.000323,7.7e-05,6.4e-05,-0.000356,-0.000577,-7.5e-05,-0.000288,0.000402,4.9e-05,0.000205,9.6e-05,0.000255,-0.00018,4.9e-05,-4.3e-05,6.7e-05,0.000105,-0.000317,0.000491,-6.7e-05,3e-06,9.7e-05,-0.000646,-0.000383,-6.8e-05,-0.000216,0.000174,-0.000232,-9.5e-05,4.1e-05,-0.000296,0.000345,-0.000253,0.00017,-0.000367,0.000183,0.000389,-0.000277,-0.000509,-6.7e-05,4.2e-05,0.000156,9.5e-05,0.000133,-0.000613,-0.000226,-0.000311,-1.3e-05,-0.000582,-7e-05,0.000199,3.4e-05,-9.4e-05,-5.1e-05,-3e-05,8.8e-05,-2.8e-05,-0.000563,-3.9e-05,8.1e-05,-0.000112,3.4e-05,-0.000309,0.000281,-2e-04,0.000452,-3.1e-05,0.000258,0.000192,-4.8e-05,-1e-04,-6.7e-05,0.000264,-0.000203,-0.000197,-0.000235,-1e-05,-0.000181,0.000507,-0.000146,-0.000226,-2.3e-05,-6.7e-05,-0.000251,0.00019,0.000384,0.000333,-0.000155,0.000249,-3.4e-05,-0.000151,5.6e-05,2.9e-05,0.000154,0.000187,0.000361
-0.000212,-0.000514,-0.000544,-0.00027,-0.000517,0.000186,6.4e-05,-0.000235,-0.000248,-2e-05,0.000398,0.000144,0.000126,-8.6e-05,-0.000259,-0.000399,-0.000245,6.5e-05,4.5e-05,0.000224,0.00021,0.000363,0.000293,-6.3e-05,-9.2e-05,0.000184,-0.000104,-0.000191,0.000467,3e-04,5.4e-05,0.000286,-0.000236,-8.1e-05,0.000198,-8e-05,0.000138,0.000529,0.000389,0.000242,-3.1e-05,-0.000122,0.000158,-0.00016,0.000294,-0.000105,0.000121,0.000142,-0.000259,6.1e-05,0.000134,-0.000291,0.000121,0.000199,-5.1e-05,0.00036,-3.9e-05,0.000279,-0.000147,9.4e-05,-0.000225,-0.000295,0.000144,0.000368,0.000151,0.000186,0.000163,-0.000176,-0.000103,0.000131,0.000208,-0.000619,9e-05,0.000104,8.6e-05,-9.7e-05,-8e-06,0.000143,-0.000127,-0.000309,-0.000196,0.000234,0.000488,7.1e-05,-0.000197,0.000132,2.9e-05,0.000122,0.000381,-9e-06,-0.000174,-1e-04,-0.000112,-0.000275,-0.000173,5.3e-05,0.000259,6.6e-05,3.8e-05,2.7e-05,5.1e-05,-0.000134,4.9e-05,-0.000216,0.000185,2.2e-05,-0.000144,0.000183,0.000293,3.8e-05,9.2e-05,-0.000196,0.00031,7e-06,0.000162,0.000174,0.000116,-0.000106,-1.4e-05,0.000102,-0.00022
0.00022,0.000293,0.000297,0.000451,0.000422,3e-04,0.00012,3.6e-05,-9e-06,7.6e-05,-0.000255,7.2e-05,0.000358,0.000212,-1.6e-05,0.000179,0.000196,0.000284,7.9e-05,-0.00015,-8.7e-05,-0.000362,-0.000167,4.9e-05,8.9e-05,-1.4e-05,-0.000114,8.2e-05,-7.1e-05,8e-05,-0.000198,-0.000139,-9.2e-05,9e-06,-0.000352,9.9e-05,-0.000213,-0.000341,-6.9e-05,1.1e-05,3e-05,0.000128,1.4e-05,-9.1e-05,-3.5e-05,0.000194,-0.000303,5.8e-05,0.000324,1.1e-05,4e-06,0.00014,-0.000117,-0.000188,-4.8e-05,-0.000302,-8.6e-05,1.1e-05,-0.000118,-3.6e-05,-0.000203,-2.9e-05,-3.5e-05,-0.000407,1.4e-05,-0.000168,-0.000166,-5.6e-05,0.000228,-0.000151,-1.3e-05,0.000517,-7.7e-05,0.000187,2.2e-05,9.1e-05,6.6e-05,-0.00013,-8.1e-05,5.3e-05,0.00021,-7e-05,-4e-06,0.000161,2.3e-05,-0.000122,-3e-06,-0.00012,-0.000632,-4.4e-05,-0.000125,0.000181,-0.000245,0.000233,0.000114,0.000112,3.4e-05,-0.000214,6e-05,-7e-05,0.000155,5.5e-05,8e-06,2.8e-05,-7e-06,6.2e-05,-7.9e-05,-0.000158,-0.000114,1.2e-05,-2.9e-05,-0.000121,-0.000228,-0.000224,-3.2e-05,-3e-06,-6.5e-05,5.7e-05,6.2e-05,-0.000285,-2e-05
-0.000258,-3.4e-05,-0.000193,-0.00037,-0.00019,-5.3e-05,-0.000168,-8e-05,0.000185,-0.000103,-0.000289,-0.000108,-0.000201,-9.4e-05,0.000216,6.3e-05,-6.7e-05,-0.000332,3.4e-05,-0.000109,-8.8e-05,0.000267,0.000119,-0.000387,-0.000129,-7.9e-05,8.7e-05,8.8e-05,-2.3e-05,-0.000201,0.000111,0.000203,0.00027,-2e-05,0.000348,-7e-05,-4e-06,5.7e-05,-1e-05,-0.000221,0.000111,1.3e-05,-1.1e-05,-8.9e-05,-0.00019,-0.000214,0.000105,-0.000167,-0.000176,-0.000168,-0.000123,-2.1e-05,0.000108,1.7e-05,0.000258,0.000182,-2.7e-05,3.3e-05,0.000131,-7.1e-05,0.000147,2.8e-05,0.000125,0.000311,0.000127,0.000155,-0.000213,7.5e-05,-0.000195,0.000215,-5.8e-05,-0.000188,0.000161,8.4e-05,0.000113,-5.4e-05,-0.000224,0.000138,5.3e-05,-4e-06,-0.000154,7.2e-05,-8.3e-05,-7.2e-05,0.000303,0.000116,6.1e-05,0.000151,0.000166,-4.6e-05,0.00017,-1.7e-05,0.000219,-0.000115,1.7e-05,-0.000103,4.6e-05,-1e-06,2.4e-05,0.000276,-8.9e-05,-0.000179,8.8e-05,-4e-06,-1.5e-05,-5.5e-05,0.000376,7.6e-05,0.000117,-0.000177,1e-05,8.1e-05,-7.9e-05,0.00011,-8.6e-05,-0.000206,0.000162,6.5e-05,-0.000123,0.000135,-4.2e-05
0.000181,-2.3e-05,0.000143,0.000138,-1.5e-05,-0.00025,0.000104,1.4e-05,3e-06,6.1e-05,0.000415,-5.2e-05,0.000112,-0.00014,-0.000159,9.4e-05,0.000155,0.000117,-0.000154,4.9e-05,-5.3e-05,6.3e-05,-7e-05,0.000307,9.5e-05,-1e-05,0.000144,-0.00012,-2.4e-05,4.9e-05,-0.000107,-0.000108,-0.000138,0.000183,-0.000255,0.000147,4.6e-05,-0.000162,-2.6e-05,8e-06,-4.9e-05,-2.1e-05,0.000142,1.9e-05,7.2e-05,0.000109,-1.5e-05,0.00021,-1e-05,-1e-05,1e-04,-4.5e-05,-5.6e-05,-3.4e-05,-0.00015,-0.000117,-0.000115,-1e-06,-5.7e-05,2.6e-05,-0.000234,7.8e-05,-0.000224,-0.000176,-0.000118,1.4e-05,0.000218,-1e-04,1.7e-05,-9.7e-05,5.3e-05,0.000109,-0.000103,-0.000186,1.4e-05,-1.7e-05,0.000195,7e-06,-6.3e-05,4.6e-05,-1.1e-05,3.2e-05,0.000104,-3e-06,-0.000318,-0.000189,-9.6e-05,-9.3e-05,-2.1e-05,8.5e-05,-0.000138,-4.5e-05,-3.7e-05,1e-06,-0.000113,6.2e-05,-4.8e-05,0.000118,-3.6e-05,-0.00033,-2e-06,-4.3e-05,2.7e-05,1.4e-05,8.3e-05,-4e-06,-0.000273,4.2e-05,-0.000101,2.8e-05,-0.000101,2.2e-05,9.3e-05,0.000137,8.4e-05,0.00021,-9.4e-05,-3.3e-05,-1.6e-05,-2.8e-05,6.7e-05
9e-06,-0.000114,-0.000112,0.000149,7.8e-05,9.1e-05,1.4e-05,6.4e-05,1.7e-05,-2.9e-05,-0.000237,5.4e-05,8.2e-05,7.5e-05,8.3e-05,-5.4e-05,-7e-05,-5e-06,0.000256,-0.000176,7.2e-05,-7.2e-05,0.000196,-8.8e-05,-1e-05,3.6e-05,-2.9e-05,6.1e-05,-5e-06,-4e-06,8e-05,-0.00014,-8.2e-05,-0.000155,0.000121,-0.000104,9e-06,0.000179,-9e-05,-2.7e-05,6.6e-05,-1.1e-05,-0.000194,1e-05,4e-05,-2.4e-05,-6.3e-05,-3.1e-05,0.000128,0.000215,-4e-06,-3e-06,6.9e-05,2.6e-05,1.2e-05,2.4e-05,6.8e-05,-3e-06,-7.8e-05,-3.4e-05,0.000311,-8.5e-05,0.000151,-8e-06,-3.7e-05,-5.5e-05,-4e-05,1.3e-05,-0.000113,-0.000116,9.4e-05,4.2e-05,-4.8e-05,7e-05,-2.2e-05,3.5e-05,-3e-06,-5.9e-05,0.000136,-7.8e-05,-9.5e-05,-9.7e-05,-0.000134,-1.7e-05,0.000115,0.000172,5.9e-05,1.5e-05,0.000141,9.4e-05,7.6e-05,1.5e-05,4e-06,6e-06,7.1e-05,-0.000111,3.1e-05,-5.1e-05,3.3e-05,6.9e-05,1.4e-05,9.2e-05,-5.7e-05,6.4e-05,-6e-05,-9e-06,-4.3e-05,-5.6e-05,-4.5e-05,1.7e-05,-3.6e-05,-4e-05,-8.3e-05,-0.000151,3e-06,-7e-05,2.7e-05,1.4e-05,6.4e-05,8e-05,-9.4e-05
-6.8e-05,0.000107,0.000155,-0.000146,-6.3e-05,7.5e-05,-0.000106,1.5e-05,-7.6e-05,1e-05,6.6e-05,-1.9e-05,-8e-05,-0.000131,-1.3e-05,1.6e-05,3.4e-05,8.8e-05,-0.000274,8.9e-05,-1.3e-05,2.2e-05,-0.000123,-3.5e-05,-4.5e-05,2e-06,-6e-05,4e-06,-3.6e-05,7e-05,-0.000125,0.000113,0.000162,-8.7e-05,-0.000106,-6e-06,1.9e-05,-8.3e-05,1e-06,0.000109,-0.000148,1.8e-05,0.000124,4.3e-05,-2.9e-05,2.4e-05,9.6e-05,-5.1e-05,-0.000116,-0.000109,-5.9e-05,5.5e-05,-5.2e-05,-8e-06,-3.5e-05,-9e-06,-9.6e-05,1.7e-05,5.1e-05,-2.5e-05,-0.000207,-2e-06,2.3e-05,0.000111,2.6e-05,9e-06,2.3e-05,-3.6e-05,0.000116,0.000117,-2.5e-05,-1.6e-05,0.000128,4.4e-05,1.4e-05,-5.7e-05,-8e-06,3.2e-05,-9.3e-05,2.9e-05,2.1e-05,8.9e-05,0.000128,1e-05,-5.7e-05,-0.000102,-6e-05,-2e-06,-0.000147,-0.000115,4.3e-05,-6.3e-05,-5.8e-05,-3e-05,4.4e-05,1.8e-05,0,-3.9e-05,-0.000107,2e-05,-5.6e-05,-5.3e-05,-1.4e-05,-1.6e-05,-4.6e-05,-3e-06,8e-05,4e-06,3.3e-05,-4.2e-05,9.8e-05,2e-05,0.000124,3.3e-05,-7.1e-05,8.7e-05,-2.5e-05,5e-06,4e-05,-3e-05,2.5e-05
7.6e-05,-7.3e-05,-0.000112,2.9e-05,6.6e-05,-4.3e-05,5.3e-05,-8.6e-05,4.8e-05,8e-06,9.7e-05,4e-06,9e-05,7.4e-05,2.5e-05,-3.8e-05,-2e-06,-9.8e-05,7.8e-05,3e-05,1.9e-05,1.5e-05,-1.7e-05,3.7e-05,5.7e-05,4.1e-05,-1.7e-05,2e-06,-1.4e-05,-2.5e-05,-2.3e-05,2.1e-05,-4.3e-05,0.000245,5.1e-05,2e-05,-2.3e-05,-2.4e-05,1.6e-05,-1.1e-05,8.3e-05,-1.9e-05,-1.3e-05,-5.4e-05,-1.2e-05,1.6e-05,-1.9e-05,2.3e-05,5.8e-05,-5.3e-05,3.9e-05,-3e-06,-6e-06,1.4e-05,-3.4e-05,0.000136,0.000148,-7.8e-05,3.7e-05,9e-06,0.000181,3.8e-05,-8.8e-05,-0.000129,-4.3e-05,2.3e-05,-2e-05,5.8e-05,-3.2e-05,3.9e-05,-9.2e-05,-0.000128,-0.000119,-4e-05,1.1e-05,9e-06,-6.2e-05,-2.6e-05,-1.5e-05,5.3e-05,1e-06,-4.7e-05,-8.9e-05,3.3e-05,7e-05,7.4e-05,-1.5e-05,-1.3e-05,8.3e-05,-8e-06,-4.7e-05,3.2e-05,-3.3e-05,4.3e-05,-6e-05,1.6e-05,7e-06,4.3e-05,7.7e-05,-2.9e-05,-1e-06,-4.1e-05,-2.3e-05,-3.4e-05,-3.8e-05,3e-05,-5.7e-05,3.2e-05,3.2e-05,2.9e-05,5e-05,2.2e-05,-6.6e-05,2.7e-05,2.2e-05,-4.5e-05,-2.9e-05,-6e-05,-7.7e-05,-7.8e-05,-1.1e-05
-9.9e-05,2.4e-05,5.4e-05,5.1e-05,-2.7e-05,-4.5e-05,-3.5e-05,5.7e-05,1.3e-05,-1e-06,-0.000103,-6e-06,-1.8e-05,3.5e-05,3e-06,2e-06,-6.3e-05,7.4e-05,3.3e-05,-4.2e-05,-6.5e-05,-2.9e-05,-4.2e-05,-4.7e-05,-5.6e-05,-7.5e-05,4.4e-05,2.5e-05,-6.3e-05,6e-06,9.8e-05,4.4e-05,-5.3e-05,-0.000176,-2.4e-05,-8e-05,-0.000109,9.4e-05,-1.3e-05,-4.7e-05,-4.7e-05,1.4e-05,-6.9e-05,2.4e-05,2e-05,-3.6e-05,7e-06,1.5e-05,-2.1e-05,5.6e-05,1.2e-05,-5.5e-05,-9e-06,-4e-06,2e-06,-4.5e-05,-1.4e-05,5.8e-05,-1.7e-05,-4e-06,-7.7e-05,-2.5e-05,8e-06,6.5e-05,1.9e-05,-2.3e-05,-0.000123,1.7e-05,3.3e-05,-3e-06,5.5e-05,-1e-06,8.5e-05,-4e-05,-3.9e-05,1.8e-05,3e-06,4e-05,6.2e-05,-5.4e-05,2.4e-05,0,4.8e-05,-3e-05,-4.6e-05,-1.2e-05,4.7e-05,1.5e-05,-3.7e-05,1.4e-05,1.7e-05,-3e-06,7e-05,-5e-05,-3.9e-05,1.8e-05,-2.1e-05,1e-06,6e-06,2.7e-05,1.4e-05,5.1e-05,2.1e-05,6.9e-05,3.4e-05,-1e-06,5.1e-05,-2.6e-05,-1.4e-05,-1.2e-05,-0.000109,1.4e-05,-5.8e-05,-2.1e-05,2.7e-05,-7e-06,1.6e-05,-6e-06,6.6e-05,5.3e-05,1e-05
4e-05,3.3e-05,9e-06,-0.000117,4.5e-05,6.7e-05,-2.4e-05,8e-06,3e-06,1.1e-05,-4.3e-05,2.7e-05,-8.1e-05,-4.7e-05,-3e-05,2.1e-05,3.9e-05,-0.000112,-7e-06,4e-05,3.1e-05,3.8e-05,6.2e-05,7.3e-05,2.8e-05,9.1e-05,4.9e-05,-3.8e-05,6.6e-05,-1e-05,-7.9e-05,-2.7e-05,7.6e-05,0.000153,7.8e-05,4.6e-05,0.000124,-5.6e-05,3.8e-05,2.7e-05,8e-05,-2e-05,2.2e-05,3.1e-05,2.7e-05,3e-06,2.9e-05,-7.8e-05,-1.2e-05,7e-06,6.3e-05,4.2e-05,2.2e-05,-1e-05,-7e-06,-3.6e-05,-4e-06,-1.6e-05,1.8e-05,2.2e-05,4.6e-05,-1.4e-05,4e-05,7e-06,2.7e-05,4e-06,0.000106,-3.2e-05,-7.3e-05,-4e-05,5e-05,8.7e-05,-4.4e-05,2.6e-05,-3.5e-05,-4e-05,2e-05,-2e-05,-1.4e-05,4e-05,-3.1e-05,3.6e-05,-2.7e-05,-6e-06,8e-06,9e-06,-1.6e-05,-1.1e-05,7.6e-05,8e-06,-1.4e-05,-3e-06,4.4e-05,3.4e-05,5.1e-05,4e-06,2.9e-05,-2.1e-05,-2.5e-05,-4.4e-05,-1.1e-05,1.8e-05,-3e-05,-6.1e-05,-2.3e-05,1.5e-05,-6e-06,1.7e-05,3.6e-05,3.5e-05,-2e-05,3e-06,0.000105,-2e-05,-2.7e-05,-1e-05,1.5e-05,2.9e-05,-5.8e-05,4e-06,-2e-06
-2.2e-05,-2.6e-05,-4.6e-05,0.000121,-7.3e-05,-1.1e-05,4.2e-05,-2.7e-05,1.5e-05,-5e-06,9.2e-05,-3.6e-05,2.4e-05,2e-06,1.6e-05,8e-06,-4.6e-05,7.3e-05,2.7e-05,2.3e-05,1.4e-05,-7.1e-05,-5.3e-05,-4.2e-05,4e-06,-7.1e-05,-3.3e-05,-1e-06,-7e-06,8e-06,3.1e-05,-6.3e-05,-3.7e-05,-0.00013,-8.6e-05,6e-06,-2.5e-05,3e-06,-1.6e-05,-6e-06,-4.1e-05,1.1e-05,5.2e-05,-2.4e-05,-5.9e-05,-2.1e-05,-8e-05,8.6e-05,4.5e-05,7e-06,-5.1e-05,-4.7e-05,-1.7e-05,-1.1e-05,2e-06,1.6e-05,-1e-06,-5e-05,-2e-05,1.6e-05,-3.1e-05,3.2e-05,-2.6e-05,-5.1e-05,-2.6e-05,2.8e-05,2e-05,2e-05,5.5e-05,2.7e-05,-5.1e-05,-6e-05,-1.6e-05,-2e-05,5.5e-05,2.8e-05,1.4e-05,1.1e-05,-2.7e-05,-2e-05,1.4e-05,-4.5e-05,2e-05,-1.2e-05,-7e-06,-1.2e-05,8e-06,2.8e-05,-7.5e-05,1.3e-05,1.3e-05,6e-06,-1e-04,-8e-06,8e-06,3.6e-05,-3.7e-05,1.7e-05,7e-06,4.5e-05,1.4e-05,-4.1e-05,1.7e-05,4.1e-05,3.6e-05,-5e-06,-5.9e-05,2e-06,-9.7e-05,-1e-05,9.6e-05,-3.1e-05,-6.9e-05,2.2e-05,-3e-06,-2e-06,-2.1e-05,-1.3e-05,5e-06,9e-06,1.2e-05
2.2e-05,-1.4e-05,5e-05,-4e-06,5.4e-05,-4.9e-05,-2.3e-05,1.8e-05,-4e-05,8e-06,2e-05,8e-06,-4.5e-05,-4e-06,1.4e-05,5e-06,5.3e-05,-9e-06,6e-06,-5.5e-05,1.4e-05,-1.6e-05,3.9e-05,-6e-06,-2.6e-05,7.2e-05,-5.4e-05,4e-06,2.5e-05,-1.3e-05,-2.5e-05,4.3e-05,-4.2e-05,1.4e-05,6.1e-05,-1.2e-05,-1.2e-05,1.5e-05,-1e-06,5.1e-05,0,-1.6e-05,-4e-05,-5.6e-05,1.4e-05,0,6.3e-05,-1.4e-05,-1e-05,-4.9e-05,3e-06,5.5e-05,2.5e-05,1.6e-05,2.6e-05,-2.5e-05,-7.7e-05,4.2e-05,-3e-06,-2.7e-05,2.6e-05,-3e-06,-4.1e-05,6.2e-05,2.6e-05,-4.3e-05,-1.7e-05,-3.1e-05,-2.3e-05,4e-05,-3.6e-05,0.000116,3.3e-05,-1.6e-05,1.8e-05,2e-06,1e-05,-1.1e-05,1.5e-05,8e-06,-1.6e-05,2.1e-05,-2e-05,1.3e-05,2.3e-05,1e-05,-1.8e-05,-2.8e-05,1.2e-05,-1e-06,3e-06,8e-06,4.1e-05,1.2e-05,-4.2e-05,-5.8e-05,1.5e-05,-1e-06,-1.4e-05,8e-06,-2e-06,-9e-06,2e-06,-2.1e-05,1e-06,-6e-06,7.1e-05,5e-06,7.1e-05,1.4e-05,-4e-06,-1e-05,1e-06,-1.7e-05,2.2e-05,4.5e-05,4.1e-05,-3e-06,5.8e-05,-1.3e-05,-2.2e-05
-1.1e-05,4.5e-05,-5.1e-05,-5.6e-05,-2.9e-05,3.3e-05,1.9e-05,-3e-05,3.5e-05,-1.3e-05,-8.6e-05,1.6e-05,-5e-06,-8e-06,-3.1e-05,-1.7e-05,-2.3e-05,2.5e-05,-7.1e-05,7e-06,-7e-06,6.1e-05,-5e-06,2.3e-05,2.2e-05,-8.3e-05,3.9e-05,-5e-06,-3.7e-05,-5.3e-05,3.1e-05,4e-06,7.3e-05,2.1e-05,-3.2e-05,-5e-06,-9e-06,2.1e-05,2e-05,-4.1e-05,-1.4e-05,5e-06,3e-05,2.3e-05,4.1e-05,1.2e-05,-2.5e-05,-2.4e-05,3e-06,3e-05,9e-06,-2.8e-05,-1.3e-05,-3e-06,1e-06,2.9e-05,3.1e-05,1.4e-05,2.5e-05,6e-06,-5e-06,-7e-06,6.1e-05,-3.6e-05,-1.1e-05,1.3e-05,-3.2e-05,2e-05,3.6e-05,-1.9e-05,4.3e-05,-9.3e-05,-4.1e-05,2.6e-05,-4.2e-05,-2.2e-05,-1.9e-05,4e-06,-6e-06,1.2e-05,3.4e-05,3e-06,0,6e-06,-7e-06,2e-06,2e-06,2e-05,-1.6e-05,-2.2e-05,8e-06,-1.5e-05,-4e-06,-1.9e-05,9e-06,2.7e-05,-9e-06,-1.8e-05,1e-05,-6e-05,-1.6e-05,2.4e-05,7e-06,4e-06,1.4e-05,-3e-06,-6e-06,-2e-06,-1.9e-05,-2.6e-05,-2.1e-05,1.6e-05,-7e-06,8e-06,-1.3e-05,-4e-05,-3.8e-05,1e-06,-6.5e-05,-8e-06,1.5e-05
-1.9e-05,-4e-05,5.3e-05,5.6e-05,1.6e-05,3.7e-05,2.3e-05,2e-05,-2.9e-05,8e-06,9e-05,-2e-06,6.2e-05,-2e-05,1.8e-05,0,1e-05,-6.4e-05,5.3e-05,2.3e-05,-2.8e-05,-5.4e-05,-1.3e-05,-5e-06,-2.2e-05,6e-05,1.4e-05,-1.2e-05,7.2e-05,7.8e-05,2.1e-05,1e-06,-2.6e-05,1.5e-05,2.3e-05,-1.7e-05,-2.8e-05,-4.3e-05,-2e-05,-1.3e-05,1.3e-05,0,-5e-06,3.4e-05,-4.2e-05,-1.3e-05,4e-06,3.5e-05,-1.4e-05,8e-06,0,2.2e-05,-4e-06,2e-06,-6e-06,-2.2e-05,-4e-06,1e-06,-6e-06,-1.1e-05,-1.5e-05,6e-06,-2.7e-05,-2e-06,3e-06,1.2e-05,2e-06,-7e-06,-4.5e-05,-3.1e-05,2.2e-05,-1.4e-05,4.5e-05,-7e-06,2.3e-05,2.4e-05,2.2e-05,3e-06,6e-06,-2e-05,7e-06,-7e-06,1.1e-05,-1e-05,-1e-05,-2.5e-05,5e-06,-1.4e-05,3.4e-05,1.9e-05,5e-06,2e-06,2.7e-05,-3e-06,4.5e-05,-2.2e-05,1.4e-05,1.4e-05,2.4e-05,3.1e-05,2.3e-05,2e-06,-8e-06,1.4e-05,-1e-06,-6e-06,-3.8e-05,1.2e-05,2.5e-05,1.3e-05,0,1e-06,6e-06,9e-06,-1.8e-05,4.1e-05,1.8e-05,-3e-06,2.4e-05,2e-06,-4e-06
2.2e-05,1.5e-05,-5.7e-05,-2.6e-05,0,-2.8e-05,-2.4e-05,1.5e-05,2.9e-05,-5e-06,-5.4e-05,-1.8e-05,-3e-05,2.5e-05,-5e-06,-5e-06,1.3e-05,2.6e-05,-1e-05,-1.5e-05,1.9e-05,2.2e-05,-1.8e-05,-1.1e-05,4e-06,-3e-05,-1.9e-05,-1.2e-05,-8.1e-05,-4.6e-05,-5e-05,2e-05,-5.2e-05,-4.3e-05,-8e-06,1e-05,4.7e-05,-4e-06,-1.3e-05,-1e-06,9e-06,3e-06,-2.1e-05,1e-05,-1e-05,1.7e-05,1.1e-05,-3.6e-05,2e-05,-1.1e-05,-1.6e-05,-4.1e-05,-2e-05,-2e-06,-3e-06,6e-06,2e-05,-7e-06,-2.2e-05,4e-06,-5e-06,-3e-06,-1.7e-05,3.4e-05,-3e-06,-8e-06,3.2e-05,-4e-06,3.2e-05,2.2e-05,-3.9e-05,3.6e-05,-2.4e-05,-2.8e-05,2.7e-05,-9e-06,-9e-06,1e-06,1.2e-05,2.3e-05,1e-05,-8e-06,-2.5e-05,-2e-06,0,1e-05,-9e-06,2.3e-05,1.7e-05,3e-06,-2.8e-05,-4e-06,-1.3e-05,1.9e-05,-3.8e-05,-3e-06,-1.2e-05,6e-06,-2.6e-05,2.2e-05,-2.2e-05,1.5e-05,0,-3.9e-05,-2e-05,3e-06,4.3e-05,-1.2e-05,-1.1e-05,-5e-06,-3.4e-05,-2e-06,-2e-06,-5e-06,1.9e-05,-4.6e-05,-1.1e-05,4e-06,9e-06,2.9e-05,-1e-06
-2.3e-05,7e-06,6.3e-05,3e-06,-1.8e-05,-3.4e-05,2.3e-05,-1.4e-05,-2.4e-05,6e-06,-1.4e-05,1.5e-05,2.3e-05,1.6e-05,6e-06,1.6e-05,-1.6e-05,-1.9e-05,3e-06,1.3e-05,-3e-06,2.5e-05,1.3e-05,-3e-06,5e-06,3e-05,1e-06,4e-06,3e-05,4.1e-05,2.7e-05,-3.9e-05,6e-05,4.5e-05,-2.6e-05,1.7e-05,1.6e-05,4.7e-05,1e-06,1.9e-05,6e-06,-4e-06,5.2e-05,-1.5e-05,4.4e-05,-1e-05,-1.7e-05,5e-06,-1.5e-05,2.1e-05,3e-06,3.9e-05,2.5e-05,-2e-06,-2.3e-05,-4.4e-05,2.3e-05,5e-06,1.3e-05,1.9e-05,-2.4e-05,-8e-06,6e-06,-3.8e-05,-7e-06,1e-06,1.6e-05,2.1e-05,-2.2e-05,8e-06,-3e-06,-1.6e-05,3e-06,-5e-06,-2.9e-05,4e-06,2e-06,-3e-06,-1.8e-05,-1.6e-05,-8e-06,2.4e-05,2.6e-05,-5e-06,1.9e-05,-1e-05,1.3e-05,-2.3e-05,-2.3e-05,-8e-06,3.4e-05,-2e-06,-2.7e-05,-1.4e-05,-1.4e-05,9e-06,-4e-06,-1.4e-05,-1e-06,-3.4e-05,9e-06,0,3e-06,5e-05,-1.4e-05,6e-06,-1e-05,9e-06,-2.8e-05,-1e-06,2.1e-05,8e-06,1.7e-05,-1.2e-05,6e-06,2.5e-05,-2e-06,3e-06,-2.2e-05,-3.2e-05,1e-06
2.8e-05,-1e-05,-4e-05,2.2e-05,1.6e-05,3.5e-05,-1.3e-05,4e-06,1.6e-05,-9e-06,3.5e-05,3e-06,2.2e-05,-1.8e-05,-1e-06,2e-06,2.6e-05,4.3e-05,2.5e-05,4e-06,2.2e-05,-1.4e-05,1.1e-05,1e-06,-9e-06,-3.2e-05,4e-06,-2e-06,7e-06,-1.9e-05,5e-06,0,-3e-06,-4.9e-05,2.7e-05,-3e-06,-5.4e-05,-3.3e-05,-1e-06,2.1e-05,-1e-05,-3e-06,-5.8e-05,-1.6e-05,-2.2e-05,1e-05,1.5e-05,1.9e-05,-8e-06,-2.7e-05,-1e-06,-2.4e-05,-1.9e-05,-1e-06,1.5e-05,5e-05,-1.6e-05,3e-06,1.6e-05,4e-06,5.3e-05,-2e-06,1.8e-05,2.5e-05,7e-06,1.1e-05,-2.4e-05,-1.4e-05,2.8e-05,-1.7e-05,3e-05,1.6e-05,1e-05,3.8e-05,-1.1e-05,-5e-06,-8e-06,1e-06,-4e-06,0,9e-06,-3.8e-05,-2.8e-05,8e-06,-1.6e-05,1.6e-05,-9e-06,9e-06,-1e-06,1e-05,-2.6e-05,6e-06,1.1e-05,1.2e-05,2.5e-05,1e-05,-7e-06,1e-06,1.1e-05,2.1e-05,7e-06,-1.9e-05,-5e-06,-4.2e-05,-9e-06,-3e-06,-2.3e-05,-9e-06,9e-06,6e-06,5.1e-05,2e-06,-4.7e-05,1.9e-05,-1.9e-05,-7e-06,-3e-06,-4e-06,2e-05,1.6e-05,1.3e-05
-2.1e-05,-4e-06,1.3e-05,-3.5e-05,-1e-06,7e-06,-1.7e-05,0,-2.2e-05,3e-06,-2e-05,-1.2e-05,-2.4e-05,2e-06,-6e-06,2e-06,-2.1e-05,-4.8e-05,-2.8e-05,-3e-06,-2.4e-05,2.5e-05,-1.3e-05,-6e-06,1e-05,7e-06,-1.5e-05,6e-06,-2.8e-05,-2e-06,-1.7e-05,2.4e-05,-4.5e-05,8.2e-05,5e-06,-6e-06,2e-05,-1.6e-05,1e-05,-3.3e-05,-1.1e-05,-1e-06,5e-06,8e-06,-1.3e-05,4e-06,-1e-06,2e-06,1.9e-05,9e-06,-6e-06,2.2e-05,1.7e-05,3e-06,-1.2e-05,-1.6e-05,1e-05,-2.5e-05,-1.8e-05,-6e-06,-5.7e-05,1e-05,-2e-05,1e-06,-9e-06,-1.4e-05,-2.1e-05,6e-06,-2e-05,-5e-06,-4e-06,2e-06,-1.8e-05,-1.6e-05,2.4e-05,1.1e-05,-5e-06,-2e-06,1.5e-05,5e-06,-3e-06,4.3e-05,2.4e-05,1e-06,-9e-06,-2e-05,-2e-06,-6e-06,-9e-06,5e-06,1.7e-05,-4e-06,3.1e-05,-1.8e-05,1.1e-05,-1e-06,1.1e-05,1.1e-05,-1.9e-05,-2.5e-05,-1.3e-05,3e-06,-3e-06,2.4e-05,8e-06,0,1.4e-05,1.1e-05,2.3e-05,-1e-05,-3.3e-05,-6e-06,4.4e-05,-4e-06,3e-06,-2e-06,8e-06,3e-06,5e-06,-1.4e-05,-2e-06
-5e-06,1.5e-05,7e-06,7e-06,-2e-06,-2.7e-05,2.2e-05,-3e-06,9e-06,-4e-06,9e-06,2e-06,1.1e-05,5e-06,1.1e-05,-6e-06,1.6e-05,1.3e-05,-1.8e-05,-8e-06,2e-06,-1.3e-05,1.4e-05,1.9e-05,-5e-06,-1e-06,4e-06,-1e-06,1.2e-05,2.1e-05,2e-06,-4e-06,4.1e-05,-6.5e-05,-2e-05,-4e-06,-3e-06,3.5e-05,6e-06,1e-06,4e-06,1e-06,2.9e-05,9e-06,1.1e-05,-1.1e-05,-1.6e-05,-2.2e-05,-1.2e-05,3e-06,0,-1.2e-05,-5e-06,0,-4e-06,2.5e-05,-2.8e-05,5e-06,-4e-06,-1e-06,5.4e-05,-7e-06,1.4e-05,-2.1e-05,2e-06,0,2.2e-05,-7e-06,1.4e-05,-3e-06,-2.5e-05,1.1e-05,1.5e-05,-2.4e-05,-1e-05,-8e-06,5e-06,1e-06,-4e-06,-6e-06,8e-06,-3.3e-05,-1.5e-05,-3e-06,2.9e-05,2.8e-05,2e-06,9e-06,8e-06,-1.1e-05,-2e-06,2e-06,-2.4e-05,2.3e-05,-3.3e-05,1.4e-05,-7e-06,-7e-06,1.3e-05,3.6e-05,9e-06,9e-06,-2e-06,-1.2e-05,3e-06,-4e-06,-6e-06,-1e-05,-1.3e-05,1e-05,-4.1e-05,-6e-06,-2.5e-05,-7e-06,8e-06,1.5e-05,-1e-05,-2e-06,-3.4e-05,1.4e-05,5e-06
1.7e-05,-1.1e-05,-2.7e-05,1.9e-05,6e-06,5e-06,-1.2e-05,3e-06,-1e-05,6e-06,-1.4e-05,9e-06,-5e-06,-5e-06,-8e-06,-4e-06,-9e-06,-5e-06,2.4e-05,1e-06,-2e-06,-9e-06,-6e-06,-1.6e-05,3e-06,1.8e-05,1e-05,-1e-06,1.7e-05,-3.9e-05,-1.7e-05,5e-06,1e-06,4e-05,1.2e-05,-5e-06,1.5e-05,-8e-06,-4e-06,-5e-06,-3e-06,0,-1.4e-05,-1.4e-05,6e-06,7e-06,1.8e-05,2.7e-05,6e-06,4e-06,7e-06,1.2e-05,5e-06,-1e-06,1.5e-05,-2.3e-05,2e-06,7e-06,1.2e-05,-4e-06,-5.7e-05,5e-06,-1.4e-05,2.5e-05,1.1e-05,1.2e-05,2e-06,-2e-06,-1.7e-05,1.8e-05,1.3e-05,-5.4e-05,-3e-06,1.5e-05,-2.2e-05,3e-06,-3e-06,4e-06,-1.1e-05,8e-06,-9e-06,1.6e-05,6e-06,-3e-06,-2.3e-05,-1.5e-05,-1e-06,-9e-06,-2e-06,6e-06,-1.3e-05,5e-06,-2e-06,-8e-06,9e-06,-2.3e-05,1e-06,-3e-06,8e-06,-2.2e-05,1e-06,-1.2e-05,4e-06,2e-06,1.7e-05,-3e-06,1.2e-05,7e-06,1.4e-05,-3e-06,2.5e-05,-5e-06,-3e-06,0,-1e-05,-1.5e-05,1.6e-05,-2e-06,2.9e-05,1e-06,-6e-06
-1.2e-05,2e-06,2.7e-05,-3.1e-05,-8e-06,2.2e-05,-5e-06,-4e-06,9e-06,-2e-06,2.3e-05,-8e-06,-2.6e-05,-6e-06,0,0,-7e-06,1.3e-05,-7e-06,-3e-06,1.1e-05,1.9e-05,-3e-06,1.1e-05,2e-06,-1.2e-05,-2e-06,3e-06,-3e-05,2.4e-05,1.4e-05,-1.3e-05,-3.6e-05,-6.7e-05,-1e-05,1.2e-05,6e-06,-1.4e-05,-1e-06,2.2e-05,2.4e-05,1e-06,-7e-06,-6e-06,-7e-06,-1.2e-05,-1.2e-05,-2.2e-05,5e-06,1e-06,1.5e-05,-1.6e-05,-1.1e-05,-1e-06,7e-06,1.5e-05,-4e-06,-1.3e-05,-4e-06,-2e-06,6.8e-05,-4e-06,1.4e-05,-1.8e-05,-1.3e-05,-8e-06,1.7e-05,7e-06,1.8e-05,-1.8e-05,1.2e-05,4.2e-05,-1e-05,2.7e-05,1.2e-05,3e-06,4e-06,-8e-06,1e-05,-8e-06,-1e-06,-2e-06,2e-06,-1e-06,1e-05,8e-06,4e-06,1e-06,0,-4e-06,1.5e-05,-2e-06,-7e-06,-1e-05,2e-05,5e-06,-3e-06,6e-06,-1.2e-05,-4e-06,-4e-06,-8e-06,-2e-06,8e-06,3e-06,7e-06,-2e-06,-7e-06,-2.8e-05,0,2.2e-05,5e-06,2e-05,5e-06,1e-06,1.4e-05,-1.1e-05,2e-06,-3e-06,-1.3e-05,1e-06
9e-06,5e-06,-2.6e-05,1e-05,8e-06,-1.1e-05,1.5e-05,-3e-06,-6e-06,1e-06,-7e-06,-2e-06,1.4e-05,6e-06,2e-06,3e-06,5e-06,-4e-06,8e-06,-6e-06,0,-2.9e-05,-9e-06,-1e-06,-3e-06,-2e-06,-6e-06,-4e-06,4.7e-05,-1.3e-05,-7e-06,-8e-06,3.7e-05,5.5e-05,1.4e-05,-3e-06,-3.1e-05,-3e-06,-4e-06,0,-2.1e-05,-2e-06,1.5e-05,1.8e-05,-9e-06,1e-05,5e-06,0,-8e-06,-2.4e-05,-1.1e-05,6e-06,1.1e-05,0,-5e-06,-1.4e-05,8e-06,1.3e-05,-5e-06,9e-06,-4.4e-05,-5e-06,-5e-06,6e-06,5e-06,-1e-06,-4.1e-05,-1e-05,-1.8e-05,-3e-06,-1.5e-05,-1e-05,1.6e-05,-2.2e-05,1.7e-05,-5e-06,-1e-06,1e-05,0,1e-06,-7e-06,-2e-06,-1e-05,4e-06,-7e-06,-1e-06,-4e-06,2e-06,2e-06,-5e-06,-1e-05,0,1.9e-05,1e-05,-1.3e-05,-4e-06,6e-06,-1e-06,9e-06,1.3e-05,7e-06,2e-05,2e-06,-1.3e-05,3e-06,-3e-06,-1.1e-05,4e-06,7e-06,0,-7e-06,8e-06,-2.9e-05,-4e-06,9e-06,-1.8e-05,2e-06,3e-06,-1.6e-05,1.1e-05,-7e-06
-1.1e-05,-6e-06,3.1e-05,1.2e-05,-1.3e-05,-1.6e-05,-8e-06,8e-06,3e-06,-5e-06,-1e-05,8e-06,-1.1e-05,1.7e-05,-1e-06,4e-06,-1.4e-05,-7e-06,2e-06,1.1e-05,-9e-06,-2e-06,2.2e-05,-1e-05,4e-06,-9e-06,3e-06,-5e-06,-4.3e-05,1e-05,-1.7e-05,1.6e-05,2e-06,-4.4e-05,-3e-06,-8e-06,7e-06,2.8e-05,2e-06,-1.5e-05,7e-06,0,-7e-06,8e-06,1.6e-05,-1e-06,3e-06,1.8e-05,2e-06,2.6e-05,2e-06,1e-06,-4e-06,1e-06,-2e-06,1.8e-05,1.8e-05,9e-06,4e-06,-7e-06,3.2e-05,5e-06,-7e-06,8e-06,3e-06,5e-06,0,1.1e-05,1.5e-05,1.3e-05,-3e-06,-7e-06,-1.4e-05,-1.7e-05,-1.5e-05,2e-06,3e-06,-9e-06,-2e-06,3e-06,1e-06,-1e-06,1.5e-05,-1e-06,6e-06,1e-06,2e-06,-2e-06,9e-06,1e-05,5e-06,0,1e-06,-9e-06,-1.3e-05,-1e-06,-4e-06,-3e-06,-9e-06,0,-1e-06,-4e-06,-4e-06,9e-06,-3e-06,3e-06,2e-06,-5e-06,1.8e-05,-1e-06,-5e-06,-1e-06,2.1e-05,3e-06,-7e-06,1.3e-05,8e-06,-2e-06,2.4e-05,-7e-06,-2e-06
0,-1e-06,-2.7e-05,-1.4e-05,1.7e-05,1.9e-05,4e-06,-2e-06,0,3e-06,5e-06,-2e-06,-2e-06,-1.3e-05,0,-1e-06,1.2e-05,-4e-06,-1.4e-05,2e-06,0,1.2e-05,-1e-05,9e-06,-4e-06,1.5e-05,-1e-06,-5e-06,1.2e-05,-2e-06,1.8e-05,-1e-06,-3.8e-05,6.6e-05,-1.7e-05,1e-06,2.1e-05,-2e-05,2e-06,1e-06,-1.6e-05,-1e-06,6e-06,-7e-06,-1e-06,0,-1e-05,-1.6e-05,-3e-06,0,7e-06,3e-06,3e-06,0,-2e-06,-7e-06,-8e-06,-4e-06,0,-1e-06,-3.1e-05,2e-06,1.1e-05,-1.9e-05,-1.1e-05,-4e-06,3.5e-05,-5e-06,-1.3e-05,-2e-06,1.5e-05,3.2e-05,8e-06,2e-05,2e-06,2e-06,-2e-06,4e-06,5e-06,-1e-06,-2e-06,6e-06,-1.5e-05,-1e-06,-2e-06,-8e-06,0,2e-06,-6e-06,-4e-06,2e-06,-2e-06,-1.3e-05,1.3e-05,1.9e-05,2e-06,1e-06,3e-06,-5e-06,-9e-06,-6e-06,-9e-06,2e-06,3e-06,-1.4e-05,0,1e-05,5e-06,-1.3e-05,3e-06,-1.4e-05,-1e-06,-1.3e-05,-1e-06,-6e-06,-1e-05,-1.3e-05,-1e-06,-2.1e-05,7e-06,1e-06
6e-06,6e-06,2.3e-05,1.1e-05,-1.4e-05,7e-06,7e-06,0,1e-06,-1e-06,-1e-06,-6e-06,2.1e-05,-7e-06,0,-1e-06,-6e-06,6e-06,0,-8e-06,0,-1.7e-05,2e-06,-1.1e-05,1e-06,-2e-06,-1e-06,-3e-06,1.2e-05,-5e-06,-9e-06,0,3.2e-05,-4.7e-05,2.1e-05,-1e-06,-6e-06,-1.7e-05,-4e-06,-1e-06,1.7e-05,1e-06,-1e-06,-1.3e-05,-2e-05,3e-06,1.2e-05,6e-06,1e-06,-1.3e-05,-3e-06,4e-06,0,1e-06,-2e-06,-9e-06,4e-06,-3e-06,-2e-06,-2e-06,1.8e-05,0,2e-06,2.1e-05,1.1e-05,-4e-06,-1.9e-05,0,9e-06,0,-4e-06,-3.3e-05,2e-06,1.4e-05,1.2e-05,-5e-06,1e-06,1e-06,-7e-06,1e-06,1e-06,-1e-05,1.2e-05,-3e-06,1e-06,2e-06,-1e-06,-2e-06,-1e-05,-9e-06,-1.2e-05,2e-06,-1e-06,-1.6e-05,4e-06,7e-06,-1e-06,0,1.5e-05,4e-06,6e-06,4e-06,-1e-06,-1.5e-05,-6e-06,0,-4e-06,-5e-06,1.1e-05,-5e-06,-7e-06,1e-06,8e-06,-2e-06,8e-06,1.1e-05,1.2e-05,0,2e-06,-3e-06,3e-06
-2e-06,-7e-06,-1.7e-05,-3e-06,1.2e-05,-1.7e-05,-6e-06,1e-06,5e-06,5e-06,5e-06,4e-06,-1e-05,1.2e-05,-1e-06,-2e-06,6e-06,6e-06,4e-06,6e-06,8e-06,1.4e-05,-2e-06,5e-06,0,-1e-06,3e-06,-2e-06,-2.4e-05,1.3e-05,-1e-06,-3e-06,8e-06,3e-05,-8e-06,8e-06,-8e-06,3.4e-05,1e-06,1.8e-05,1e-06,0,-2.4e-05,1e-06,1.8e-05,-8e-06,-7e-06,7e-06,2e-06,3e-06,-5e-06,-9e-06,-2e-06,0,-1e-06,-3e-06,-1.7e-05,3e-06,4e-06,-3e-06,-3e-06,-1e-06,-1.3e-05,-1.7e-05,-5e-06,7e-06,1e-05,5e-06,-9e-06,-6e-06,-1.5e-05,5e-06,-1.1e-05,-1.6e-05,-9e-06,4e-06,-1e-06,-3e-06,-2e-06,-2e-06,-4e-06,7e-06,-9e-06,1e-06,-6e-06,1e-06,3e-06,3e-06,-2e-06,7e-06,1.2e-05,0,7e-06,7e-06,-1.7e-05,-2e-06,3e-06,-3e-06,-1.2e-05,3e-06,-7e-06,-3e-06,0,2.3e-05,-4e-06,-1e-06,-4e-06,4e-06,-1.8e-05,5e-06,3.1e-05,-4e-06,-6e-06,4e-06,1e-06,-2e-06,-7e-06,0,1.6e-05,-4e-06,2e-06
4e-06,4e-06,5e-06,-1e-05,-9e-06,-1e-06,3e-06,-3e-06,-3e-06,-4e-06,-1e-06,3e-06,4e-06,-1.1e-05,3e-06,0,3e-06,3e-06,0,0,-4e-06,4e-06,6e-06,-1e-06,-3e-06,-7e-06,-1e-06,1e-06,1.4e-05,-1.2e-05,7e-06,-6e-06,-3.8e-05,-3.3e-05,-4e-06,2e-06,-3e-06,-1.2e-05,2e-06,-8e-06,-3e-06,0,2.8e-05,8e-06,4e-06,7e-06,-2e-06,-1.2e-05,3e-06,-2e-06,-1e-06,5e-06,0,-1e-06,-1e-06,-1e-06,-3e-06,2e-06,0,4e-06,-8e-06,1e-06,3e-06,6e-06,-2e-06,-2e-06,-1.7e-05,-8e-06,1e-05,9e-06,1.1e-05,6e-06,1.6e-05,-9e-06,-7e-06,-4e-06,-2e-06,3e-06,1e-05,2e-06,2e-06,1e-06,7e-06,1e-06,9e-06,-5e-06,-2e-06,-5e-06,1.6e-05,-2e-06,-8e-06,0,6e-06,4e-06,3e-06,7e-06,-5e-06,2e-06,5e-06,0,3e-06,-1e-06,0,-2.6e-05,3e-06,0,3e-06,-3e-06,3e-06,-5e-06,1.1e-05,-5e-06,0,2e-06,-6e-06,-4e-06,0,0,-1.3e-05,6e-06,3e-06
-9e-06,0,2e-06,9e-06,1e-06,1.3e-05,-4e-06,1e-06,6e-06,1e-06,8e-06,-6e-06,8e-06,-3e-06,-3e-06,1e-06,-2e-06,-1.3e-05,9e-06,-7e-06,-3e-06,-4e-06,-1.2e-05,2e-06,5e-06,1e-06,2e-06,1e-06,7e-06,7e-06,-9e-06,8e-06,2.5e-05,1.6e-05,4e-06,-5e-06,-4e-06,-1.1e-05,0,-6e-06,-4e-06,-1e-06,-2e-06,2e-06,-1.9e-05,-3e-06,6e-06,0,-1e-06,1e-05,1e-06,-1e-05,-2e-06,1e-06,3e-06,1.1e-05,5e-06,-1.3e-05,-3e-06,2e-06,1.1e-05,0,1.5e-05,8e-06,7e-06,-3e-06,3e-06,8e-06,-1e-05,4e-06,1.1e-05,5e-06,-1.6e-05,1.3e-05,1.3e-05,1e-06,-1e-06,-2e-06,-5e-06,0,-2e-06,-1e-05,-4e-06,0,-6e-06,8e-06,1e-06,4e-06,-5e-06,-2e-06,6e-06,1e-06,-1e-06,-3e-06,1.4e-05,-8e-06,2e-06,1e-06,6e-06,-3e-06,3e-06,7e-06,0,2.5e-05,8e-06,0,2e-06,3e-06,1.4e-05,3e-06,-3.5e-05,3e-06,-9e-06,-5e-06,2e-06,2e-06,8e-06,0,-2e-06,-6e-06,-6e-06
6e-06,-2e-06,-6e-06,-7e-06,3e-06,-7e-06,-6e-06,0,-6e-06,-4e-06,-1.8e-05,2e-06,-1e-05,6e-06,2e-06,1e-06,4e-06,6e-06,-3e-06,6e-06,-3e-06,1.6e-05,8e-06,0,-4e-06,8e-06,-6e-06,2e-06,-1.9e-05,-6e-06,1.1e-05,1e-06,1.4e-05,-1.3e-05,-3e-06,1e-06,2.8e-05,5e-06,2e-06,-6e-06,-4e-06,0,-2e-05,-9e-06,1.2e-05,2e-06,-6e-06,1.3e-05,-5e-06,-1.1e-05,-4e-06,1.6e-05,4e-06,0,4e-06,-8e-06,4e-06,2e-06,4e-06,-3e-06,-2.6e-05,-5e-06,-9e-06,-1.7e-05,-8e-06,3e-06,2.1e-05,-5e-06,1.1e-05,-9e-06,-1.5e-05,-1.4e-05,1.1e-05,4e-06,-6e-06,-1e-06,-2e-06,1e-06,-5e-06,1e-06,4e-06,1.4e-05,1e-06,-1e-06,2e-06,-3e-06,-1e-06,-2e-06,1e-06,5e-06,0,0,-1.6e-05,0,-1e-05,-4e-06,1e-06,-1e-06,-1.5e-05,-3e-06,-6e-06,-2e-06,2e-06,-2e-05,1e-05,0,-8e-06,-4e-06,-4e-06,-1e-06,-9e-06,4e-06,1.5e-05,1e-06,0,-6e-06,-9e-06,0,1e-05,5e-06,0
-1e-06,1e-06,1.1e-05,2e-06,-5e-06,-8e-06,8e-06,-2e-06,6e-06,5e-06,7e-06,3e-06,8e-06,1.1e-05,-1e-06,1e-06,-4e-06,1e-06,-1e-05,1e-06,4e-06,-1e-05,3e-06,0,2e-06,-5e-06,0,0,1.9e-05,3e-06,-9e-06,-2e-06,-3.6e-05,3.2e-05,3e-06,1e-06,-1.9e-05,1.5e-05,-1e-06,6e-06,8e-06,0,1.5e-05,5e-06,4e-06,-1e-06,4e-06,-1.4e-05,4e-06,6e-06,-3e-06,-1.5e-05,0,0,5e-06,1e-05,1.1e-05,6e-06,2e-06,-1e-06,3.4e-05,4e-06,-6e-06,1.5e-05,3e-06,0,-1.1e-05,2e-06,-1.1e-05,1e-06,-8e-06,1.7e-05,-2e-06,-7e-06,-8e-06,0,2e-06,0,7e-06,-1e-06,-1e-06,-1.3e-05,3e-06,-1e-06,-3e-06,3e-06,0,3e-06,-1e-05,-4e-06,-5e-06,-1e-06,1.1e-05,-5e-06,-8e-06,-2e-06,3e-06,0,8e-06,1e-05,5e-06,-5e-06,0,9e-06,3e-06,0,6e-06,4e-06,-5e-06,-2e-06,2.5e-05,2e-06,-7e-06,3e-06,-4e-06,7e-06,5e-06,0,-1.1e-05,-2e-06,-4e-06
1e-06,1e-06,-1.5e-05,5e-06,9e-06,1.3e-05,-3e-06,1e-06,-7e-06,-1e-06,6e-06,-3e-06,-4e-06,-6e-06,0,-2e-06,2e-06,3e-06,2e-06,-2e-06,3e-06,0,-2e-06,3e-06,1e-06,3e-06,6e-06,-3e-06,-4e-06,2e-06,-2e-06,-2e-06,2e-05,-5e-05,3e-06,3e-06,-1.2e-05,-1.3e-05,-2e-06,1.3e-05,-1e-06,1e-06,4e-06,6e-06,-9e-06,-5e-06,0,6e-06,-2e-06,2e-06,7e-06,1.5e-05,2e-06,0,-5e-06,-1.8e-05,-1e-06,-5e-06,-6e-06,0,-3.5e-05,2e-06,7e-06,-4e-06,2e-06,-2e-06,-8e-06,3e-06,1e-05,4e-06,1.8e-05,-2e-06,-7e-06,-5e-06,7e-06,1e-06,1e-06,1e-06,-1e-06,-1e-06,2e-06,7e-06,-7e-06,-1e-06,4e-06,-4e-06,1e-06,-4e-06,1.6e-05,1e-06,4e-06,0,7e-06,9e-06,1.2e-05,3e-06,-5e-06,2e-06,0,-1.1e-05,-3e-06,7e-06,0,2e-06,0,-1e-06,2e-06,-5e-06,4e-06,3e-06,9e-06,1e-06,-1.1e-05,-2e-06,3e-06,-4e-06,2e-06,-1e-06,5e-06,-5e-06,0
5e-06,-1e-06,1.9e-05,-4e-06,-1e-05,3e-06,-3e-06,1e-06,6e-06,2e-06,-1.2e-05,-2e-06,-9e-06,-1.1e-05,0,1e-06,-2e-06,1e-06,3e-06,1e-06,-1e-06,6e-06,-6e-06,-4e-06,-4e-06,-7e-06,2e-06,-2e-06,-7e-06,-7e-06,8e-06,-1e-06,1.7e-05,6e-05,-1.6e-05,1e-06,1.2e-05,-1.3e-05,1e-06,-9e-06,2e-06,0,-7e-06,-1e-06,1e-06,6e-06,-6e-06,7e-06,-2e-06,-1.1e-05,4e-06,-1.5e-05,-5e-06,-1e-06,-3e-06,1.6e-05,-5e-06,1e-06,-1e-06,-1e-06,4.2e-05,-3e-06,9e-06,-8e-06,-5e-06,0,-2e-06,-7e-06,-8e-06,-1e-06,3e-06,-2.1e-05,1.3e-05,3e-06,5e-06,-1e-06,1e-06,-1e-06,-3e-06,1e-06,0,-1e-06,1.1e-05,0,0,6e-06,-1e-06,3e-06,-1.3e-05,4e-06,-4e-06,0,-7e-06,-3e-06,4e-06,-2e-06,2e-06,-1e-06,-7e-06,5e-06,-3e-06,3e-06,-1e-06,-1e-05,-5e-06,2e-06,-4e-06,4e-06,-1.7e-05,-5e-06,-9e-06,-2e-06,1.2e-05,-1e-06,1e-06,4e-06,-8e-06,0,1e-05,9e-06,3e-06
