2.6e-05,0,1e-05,1.9e-05,4.5e-05,1.4e-05,2.3e-05,6.8e-05,2.8e-05,4.3e-05,4.6e-05,4e-05,1.4e-05,1e-05,5.8e-05,2e-05,2e-05,3.9e-05,2.2e-05,2e-05,1.1e-05,1.2e-05,3.1e-05,1e-05,2.3e-05,2.7e-05,8e-06,1e-06,3e-06,1e-06,1.5e-05,9e-06,2.8e-05,1.3e-05,9e-06,2.3e-05,6e-06,3e-05,6.4e-05,7.5e-05,8.4e-05,7.5e-05,3.1e-05,3.6e-05,1.7e-05,3.7e-05,3.7e-05,1e-06,1.2e-05,4e-06,0,5e-06,1e-06,9e-06,8e-06,1.8e-05,9e-06,2.2e-05,1.8e-05,2.1e-05,9e-06,3.2e-05,6.2e-05,2.3e-05,4.9e-05,2.8e-05,1.2e-05,6.6e-05,6.4e-05,4.2e-05,0.000106,0.00016,2.3e-05,8.6e-05,0.000112,2.7e-05,9.8e-05,0.000113,1e-06,0.000134,6.9e-05,7.7e-05,7.3e-05,7.6e-05,6.9e-05,7.7e-05,4.7e-05,2.4e-05,1.2e-05,7.3e-05,3.5e-05,2e-06,3.4e-05,1e-06,3.3e-05,2.5e-05,2.7e-05,8e-06,4.9e-05,3.9e-05,3.8e-05,6e-06,6.8e-05,2e-06,4.1e-05,2.3e-05,2.2e-05,6e-06,4.4e-05,1.3e-05,4e-06,2e-06,1.1e-05,5e-06,8e-06,8e-06,1.8e-05,8e-06,1e-05,8e-06,2.4e-05
5.3e-05,2.5e-05,4.8e-05,3e-05,7.7e-05,7.2e-05,8.3e-05,0.000165,0.000105,9.6e-05,0.000118,0.000106,5.5e-05,3.6e-05,0.000117,4.8e-05,5.5e-05,0.000102,7.1e-05,5.1e-05,2.3e-05,1.3e-05,4.8e-05,3.4e-05,5.9e-05,9.2e-05,5.9e-05,1.9e-05,4.7e-05,4.7e-05,2.6e-05,3.4e-05,5.3e-05,4.8e-05,5.7e-05,7.5e-05,4.7e-05,9e-05,0.000172,0.000211,0.000207,0.000155,7.2e-05,6.2e-05,4.7e-05,7e-05,5.8e-05,3.5e-05,3.1e-05,3.4e-05,2.3e-05,2.9e-05,1.9e-05,3.3e-05,4.6e-05,4.7e-05,5.9e-05,6.9e-05,3e-05,4.1e-05,6.2e-05,9.7e-05,0.000134,6.8e-05,8.2e-05,6.9e-05,5.5e-05,0.000159,0.000145,0.000128,0.000221,0.000324,9.3e-05,0.000117,0.000202,4.8e-05,0.000226,0.000247,4.9e-05,0.000273,0.000175,0.000145,0.000146,0.000159,0.000142,0.000157,7.2e-05,5.8e-05,7.4e-05,0.000132,7.2e-05,3e-05,0.000105,7.4e-05,9.2e-05,7.5e-05,6e-05,4e-05,0.000109,8.3e-05,6.4e-05,4.2e-05,9.9e-05,4.8e-05,0.000109,7.1e-05,6.8e-05,3e-05,9.2e-05,6e-05,4.1e-05,1.7e-05,1.2e-05,3e-06,2.9e-05,3.3e-05,4.8e-05,3.4e-05,5.3e-05,2e-05,1.4e-05
7.2e-05,8.9e-05,4.7e-05,1e-05,0.000151,0.000109,0.000103,0.00021,0.000101,9.7e-05,9.3e-05,0.000112,0.000109,3.6e-05,0.000188,9.7e-05,7.6e-05,8.5e-05,6.2e-05,5.6e-05,5.6e-05,3.9e-05,8.5e-05,8.2e-05,3.4e-05,7.1e-05,7.7e-05,2e-05,6.5e-05,5.9e-05,8.3e-05,4.6e-05,5.9e-05,3e-06,2.6e-05,0.00011,9.7e-05,3.1e-05,0.00016,0.000216,0.000181,0.000108,0.00014,2.3e-05,9.4e-05,1.5e-05,0.000118,5.5e-05,4.6e-05,7.9e-05,2.9e-05,2.3e-05,5.6e-05,1.1e-05,4.7e-05,2.5e-05,9.4e-05,4.3e-05,3.7e-05,3.8e-05,0.000147,3.8e-05,0.000161,0.000117,0.000128,0.000166,3.9e-05,0.000215,0.000244,0.000117,0.000245,0.000326,3.3e-05,0.000198,0.000248,0.000168,0.000224,0.000204,8.4e-05,0.000279,0.000199,0.000142,0.000191,0.000164,0.000168,0.000191,9.8e-05,0.000129,9.9e-05,0.000163,0.000113,2.2e-05,0.000158,4.2e-05,7.7e-05,7.8e-05,0.000114,3.8e-05,0.000136,6.7e-05,2.5e-05,5.9e-05,0.000147,7.5e-05,6.3e-05,3.1e-05,1e-05,3.1e-05,0.000168,4.6e-05,5.9e-05,2.6e-05,2.1e-05,5.6e-05,3.7e-05,2.8e-05,5.4e-05,4.9e-05,0.00012,7.5e-05,6.4e-05
0.000212,0.000157,0.000179,0.000169,0.000286,0.000273,0.000296,0.000303,0.000279,0.000292,0.00031,0.000241,0.000345,0.000254,0.000353,0.000205,0.000217,0.000192,0.000155,0.000279,0.000165,0.000112,0.00024,0.000215,0.000107,0.000127,0.000219,0.000139,6.3e-05,0.000112,4.6e-05,5.6e-05,0.00013,9.9e-05,7.3e-05,0.000172,0.000194,9.2e-05,0.000205,0.000289,0.00024,0.000148,5.7e-05,0.000189,0.000105,0.000132,0.000154,0.000137,8.7e-05,5.5e-05,8.3e-05,2.5e-05,4e-05,0.000102,5.7e-05,1.4e-05,1.6e-05,0.000117,6.9e-05,2.5e-05,0.000113,0.00013,0.000198,5.8e-05,0.000121,0.000249,0.000192,0.000221,0.000221,0.000239,0.000365,0.000293,0.000157,0.000271,0.000256,0.000252,0.000323,0.000301,0.000127,0.000301,0.000292,0.000232,0.000252,0.000249,0.000202,0.000225,0.000191,0.00014,0.000173,0.000226,7.3e-05,6.3e-05,0.000154,0.00013,0.000134,4.3e-05,7.8e-05,8.3e-05,0.000245,8.9e-05,2.1e-05,7.5e-05,0.00022,7e-05,8.2e-05,5.5e-05,4.8e-05,3.2e-05,0.000125,0.000105,1.5e-05,7.6e-05,5e-05,0.000131,4.1e-05,5.2e-05,4.5e-05,5.8e-05,7.1e-05,4.6e-05,0.000141
0.000331,0.00031,0.000255,0.00038,0.000373,0.000352,0.000388,0.000423,0.000494,0.000416,0.000331,0.000405,0.000526,0.000493,0.000435,0.000526,0.000222,0.000215,0.000393,0.000324,0.000291,0.00029,0.000299,0.000272,0.000199,0.000115,0.000294,0.000264,0.000216,0.000255,0.000263,0.00016,0.000247,0.000452,0.000429,0.000396,0.000379,0.000231,0.000304,0.000474,0.000534,0.000341,0.000338,0.000367,0.00015,0.000149,0.000242,0.000149,9.8e-05,3.5e-05,0.000151,0.000145,8e-06,0.000205,0.000184,6.5e-05,5.2e-05,0.00015,7.4e-05,0.000101,0.000123,0.000194,0.000276,3.8e-05,0.000267,0.000481,0.000404,0.000204,4.2e-05,0.000385,0.000526,0.000405,4e-05,0.000478,0.00065,0.000475,0.000222,0.000374,0.000415,0.000628,0.000471,0.000169,0.000459,0.000501,0.000221,0.000237,4e-05,0.000201,0.000196,0.000347,0.000113,6.7e-05,0.00011,0.000312,0.000352,0.000201,8.3e-05,0.000176,0.000303,0.000156,0.000162,0.000209,0.000105,0.000148,0.000166,0.000112,0.000169,0.000253,0.000157,8.2e-05,9.8e-05,0.000135,0.000168,0.000101,5.4e-05,0.000131,0.000183,0.000161,9.2e-05,6e-06,4.6e-05
0.00029,8.4e-05,0.000116,0.000453,0.000191,0.00011,0.000274,0.00018,9.6e-05,0.00023,0.000189,0.000136,0.000235,0.000161,0.000107,0.000154,0.000197,0.000176,0.000181,0.000228,0.000233,0.000234,0.000196,6.9e-05,0.000131,0.000144,8.1e-05,6.1e-05,0.000102,0.000167,7.7e-05,0.000146,0.000194,0.000428,0.00022,0.000159,0.000354,0.000387,0.000389,0.000142,6.7e-05,0.000365,0.000314,9.5e-05,0.000272,0.000127,3.6e-05,0.000148,4.8e-05,9.6e-05,9.1e-05,6.6e-05,0.000182,0.000206,6.7e-05,0.000134,8.4e-05,7.5e-05,0.00017,0.000153,0.000214,0.000213,0.000276,0.000287,0.000426,0.000474,0.000217,0.00039,0.000575,0.000526,0.000442,0.000599,0.000564,0.000795,0.000695,0.000463,0.000689,0.000754,0.000755,0.000749,0.000644,0.000775,0.000834,0.000675,0.000566,0.000469,0.000262,0.000138,0.00023,0.000502,0.00012,0.000156,0.000367,0.000534,0.000479,0.000432,0.000242,0.00025,0.000346,7.4e-05,0.00032,0.000118,0.000419,0.00033,2.5e-05,0.00023,0.000329,0.000271,0.000337,0.000217,5.1e-05,0.000129,0.000123,4.7e-05,0.000191,0.000152,0.000241,7.8e-05,0.000133,1.9e-05,8e-05
0.000234,0.000172,0.000271,0.000289,0.000295,0.000211,0.000153,7.2e-05,0.000122,0.000203,0.000127,4.6e-05,5.6e-05,0.000167,0.000114,9.7e-05,0.000233,4.3e-05,0.000124,0.000262,7.7e-05,0.000117,0.000263,0.00031,9.9e-05,6.7e-05,9e-05,7.2e-05,0.000142,0.000221,0.000243,0.000258,0.000253,0.000505,0.000458,0.000288,0.000524,0.000615,0.000728,0.000693,0.000535,0.000768,0.000819,0.000671,0.000687,0.000626,0.000423,0.000353,0.000265,0.000162,0.000175,0.00024,0.000371,0.000478,0.000428,0.000409,0.000304,0.000152,0.00025,4e-04,0.000562,0.000702,0.000879,0.000975,0.001165,0.0014,0.001374,0.001387,0.001699,0.001794,0.001847,0.002033,0.002103,0.002398,0.002509,0.002342,0.002294,0.002576,0.002631,0.002595,0.002612,0.002632,0.002829,0.002637,0.002662,0.002019,0.001546,0.000737,0.000406,0.000603,0.000921,0.000254,0.000369,0.001157,0.001674,0.001555,0.001439,0.00083,0.001195,0.000856,0.000483,0.000243,0.00061,0.000904,0.000753,0.000645,0.000636,0.000805,0.000898,0.000953,0.000519,0.000295,0.000284,3e-04,0.000356,0.000361,0.000548,0.000471,3e-04,0.000262,2.7e-05
0.000448,0.000283,5e-04,0.000349,0.000212,0.00028,0.000241,0.000266,0.000234,0.000289,0.000211,9.7e-05,0.00028,0.000256,0.000266,0.000262,0.000273,0.000284,0.000187,0.000164,0.000149,7.7e-05,0.000107,9.1e-05,8.3e-05,0.000175,0.000317,0.000257,0.000187,7.5e-05,1e-04,0.000149,0.000172,0.000277,0.000464,0.00059,0.000531,0.000556,0.00067,0.000548,0.000591,0.000627,0.000447,0.000154,0.000256,0.000306,3e-04,9.1e-05,3.9e-05,0.000154,0.000111,0.000121,0.00026,0.000138,0.000246,0.000125,5.1e-05,0.00012,0.000194,0.00021,0.000165,0.000317,0.000493,0.000456,0.000398,0.000529,0.000716,0.000588,0.000863,9e-04,0.000755,0.000909,0.001222,0.001088,0.001071,0.001096,0.001261,0.001015,0.000972,0.000762,0.001015,0.000807,0.000957,0.000797,0.001022,0.000376,0.000399,0.000132,0.000959,0.000537,0.001079,0.001096,0.000856,0.001326,0.000966,5.1e-05,0.000749,0.000658,0.001327,0.000857,0.00032,0.000231,0.000479,0.000728,0.000237,0.000226,0.000342,0.000651,0.000181,0.000601,0.000337,0.000225,0.000281,0.000508,0.000285,0.000136,0.000347,0.000304,0.000219,0.000249,0.000212
0.000205,0.00025,0.000239,0.000172,0.000139,9.9e-05,0.000251,0.00026,0.000268,7.2e-05,5.8e-05,0.00013,0.000347,9.8e-05,0.000185,0.000239,6.2e-05,0.000115,0.000216,8.3e-05,4.3e-05,6.1e-05,0.000101,0.000116,8.4e-05,9.8e-05,0.000182,8.9e-05,2.9e-05,2.3e-05,6.3e-05,8.8e-05,6.6e-05,0.000216,9e-05,0.000312,0.000117,0.000198,9.1e-05,0.000263,0.000165,0.000134,0.000144,9.1e-05,0.000151,0.000213,6.2e-05,3.1e-05,1e-05,0.000174,0.000121,9.3e-05,9.8e-05,0.000211,2.1e-05,9.6e-05,3.8e-05,0.000123,3.8e-05,0.000144,7.7e-05,2e-04,0.000114,0.000259,0.000217,0.000346,0.00025,0.000245,0.000364,0.000385,0.000317,0.000351,0.000501,0.000516,0.00049,0.000379,0.000582,0.000763,0.000696,0.000264,0.000469,0.000626,0.000735,0.000112,0.000749,0.000398,0.000546,0.000788,0.000777,0.000768,0.000736,7.8e-05,0.000468,0.000522,0.00043,0.000408,0.000455,0.000718,0.000669,0.00036,5.6e-05,0.000151,0.000379,0.000175,0.00039,0.000178,0.000212,0.00021,0.000545,6e-05,3.4e-05,0.000104,9.2e-05,0.000245,4.1e-05,5.4e-05,0.000142,0.000109,0.000129,3.5e-05,2.9e-05
9.3e-05,0.000222,0.000385,0.000195,0.000124,0.000134,0.000138,6.4e-05,0.000316,0.000279,0.000216,0.000231,0.000244,0.000223,0.000167,0.000161,7.2e-05,9e-06,0.000141,8.4e-05,7.4e-05,8.9e-05,2.7e-05,0.000101,4.5e-05,6.5e-05,0.000145,5e-05,9e-05,5.4e-05,0.000115,2.1e-05,6.5e-05,0.000118,0.000141,0.000191,0.000162,0.000119,0.000137,0.000115,0.000176,0.000119,2.9e-05,5.7e-05,6.9e-05,0.000185,8.9e-05,7.5e-05,7.1e-05,0.000175,5e-05,9.1e-05,3.4e-05,0.000107,0.000111,0.000119,8.8e-05,6.7e-05,6.5e-05,9.3e-05,2.5e-05,0.000116,3.2e-05,0.000137,0.000106,0.000247,0.000267,0.000179,0.000199,0.000209,0.000211,0.000161,0.000322,0.000215,0.000393,0.000424,0.000229,0.000201,0.000594,0.000433,0.000323,0.000165,0.000627,0.000195,0.00069,0.00051,0.000785,0.001067,0.001009,0.000261,0.000176,0.000347,0.000701,0.000332,0.000359,0.000495,0.000445,0.000816,0.000623,0.000209,0.000463,0.000143,0.00015,0.000346,6e-06,0.000255,0.000158,6.8e-05,0.000403,0.000293,3.4e-05,0.000123,0.000141,3.4e-05,9.4e-05,6.8e-05,8.6e-05,0.000149,8.3e-05,2.6e-05,0.000117
0.000109,0.000268,6.9e-05,8.6e-05,0.000186,4.7e-05,6.4e-05,7e-05,0.000254,0.000143,5.8e-05,9.1e-05,0.000151,0.000143,0.00011,1e-04,0.000106,9.3e-05,0.000105,0.00013,9e-06,5e-05,8.6e-05,2.3e-05,5.6e-05,8.7e-05,0.000109,9.6e-05,0.000109,0.000116,0.000147,7.7e-05,1.9e-05,0.000178,0.000105,0.000163,7.3e-05,4.8e-05,0.000192,1e-04,0.000102,0.000137,9.4e-05,0.00016,0.000121,8.7e-05,6.1e-05,0.000166,8.6e-05,0.000119,7e-05,8.8e-05,2.4e-05,9.9e-05,1.4e-05,7.4e-05,6.4e-05,7.4e-05,4.8e-05,0.000127,0.000152,0.000189,0.000132,0.000177,7.7e-05,8.6e-05,0.000271,8.1e-05,0.000226,7.9e-05,0.000233,0.000155,0.000424,8.5e-05,0.000329,0.000411,0.000351,0.000344,0.000428,0.000715,0.000501,0.000862,0.000823,0.001121,0.001218,0.001045,0.001362,0.001543,0.001455,0.001111,0.000705,0.000733,0.001082,0.000743,0.000998,0.000413,0.000268,0.000685,0.000689,0.000611,0.000631,0.000441,0.000272,0.000302,0.000251,0.000233,0.000253,0.000182,0.000219,0.000127,0.000148,6.4e-05,4.6e-05,7.5e-05,8.7e-05,8.8e-05,4.9e-05,9.1e-05,0.000122,0.000172,0.000187
0.000154,0.000255,0.000314,0.000247,0.000385,0.000257,0.000274,0.000251,0.000275,0.000101,3e-05,6.1e-05,0.000102,4.2e-05,4.1e-05,0.000109,5.4e-05,5.5e-05,8.6e-05,2.5e-05,3.7e-05,2.6e-05,2.5e-05,4.9e-05,3e-05,3.1e-05,2.8e-05,1.4e-05,7.5e-05,8e-05,4.2e-05,1.7e-05,3e-05,0.000124,0.000112,9.7e-05,0.000109,2.3e-05,0.000119,0.000106,3.5e-05,0.000152,9.8e-05,3.3e-05,7.8e-05,4.3e-05,2.4e-05,7.3e-05,3e-05,3.6e-05,2.6e-05,3e-05,2.1e-05,4.4e-05,5.4e-05,4.6e-05,1.6e-05,2.2e-05,8.3e-05,6.6e-05,0.000122,2.6e-05,8.4e-05,4.8e-05,0.00011,0.000121,0.000185,0.000114,7e-05,0.000188,5.7e-05,0.000212,0.000158,0.000256,1.5e-05,0.000449,8.4e-05,0.000293,0.000122,0.00045,0.000249,0.000453,0.00013,0.000521,0.000227,0.000396,0.000393,0.000362,0.000383,0.000207,0.000373,0.000316,0.000254,0.000171,0.000452,0.000293,0.000278,0.000247,0.000138,0.000203,0.000138,7.4e-05,0.000138,8.7e-05,2.8e-05,8.2e-05,0.000141,0.000132,1.9e-05,2.8e-05,4.6e-05,6e-06,4.9e-05,7.4e-05,8.1e-05,4.4e-05,5.8e-05,2.6e-05,9.5e-05,9.8e-05,1.7e-05
7.3e-05,9.7e-05,7e-05,0.000121,0.000156,0.000105,0.000171,8.2e-05,0.000104,8.1e-05,9.7e-05,2.3e-05,5.9e-05,1.8e-05,4.2e-05,4.8e-05,3.2e-05,3.1e-05,2.9e-05,4.6e-05,2.6e-05,2.4e-05,1.8e-05,3.1e-05,3.7e-05,4.9e-05,2.6e-05,1.4e-05,1.4e-05,3.5e-05,4.4e-05,3.4e-05,3.3e-05,6.1e-05,9.7e-05,8e-05,6.9e-05,4.4e-05,5.6e-05,6.3e-05,5.7e-05,0.000101,1.4e-05,3.8e-05,2.7e-05,3.6e-05,2.2e-05,3e-05,2.1e-05,2.5e-05,2.6e-05,2.9e-05,1.1e-05,2.2e-05,3.3e-05,3.6e-05,1.3e-05,3e-06,8.6e-05,4.5e-05,3.9e-05,3.6e-05,5.5e-05,5.2e-05,5.9e-05,9.5e-05,0.000117,7.4e-05,8.6e-05,0.00015,4.7e-05,0.000158,0.000172,0.000122,8.5e-05,0.000321,7.2e-05,0.000141,0.000175,0.000319,0.000174,0.000352,6.1e-05,0.00043,0.000232,0.000218,0.000241,0.00029,0.000211,0.000254,0.000298,0.000166,0.000158,0.000146,0.000238,0.000183,9.8e-05,0.000266,8.2e-05,9.7e-05,8e-05,5.8e-05,7.6e-05,9.6e-05,8.3e-05,5e-05,0.000116,0.000128,2.3e-05,7.5e-05,3.9e-05,2.5e-05,4.4e-05,3.5e-05,4.8e-05,3.5e-05,2.8e-05,5.4e-05,7.5e-05,1.7e-05,2.4e-05
2e-05,5.7e-05,7.1e-05,3.3e-05,7.2e-05,9.3e-05,5.6e-05,7.5e-05,0.000174,0.000141,0.000236,0.000145,0.000119,3.3e-05,6.2e-05,7.6e-05,4.5e-05,5e-06,8e-06,4.5e-05,7e-06,2.6e-05,1.4e-05,3.3e-05,3.7e-05,4.1e-05,1.4e-05,9e-06,1.4e-05,2.9e-05,5e-05,3.1e-05,2.6e-05,7.2e-05,7.9e-05,8.8e-05,4.8e-05,1.5e-05,8.2e-05,3e-05,8.6e-05,4.1e-05,4.1e-05,2.3e-05,2.3e-05,4.3e-05,3.5e-05,1.9e-05,2.2e-05,4.5e-05,2.5e-05,2.1e-05,1.8e-05,3.7e-05,1.6e-05,1.2e-05,2.2e-05,1.4e-05,6.7e-05,1.9e-05,4.8e-05,6e-05,2.4e-05,6.8e-05,4.4e-05,5.3e-05,0.000106,6.6e-05,5.9e-05,0.000127,6e-05,7.1e-05,0.000156,0.000137,9e-05,0.000217,1.7e-05,0.000177,6.5e-05,0.000222,0.000123,0.000356,8.9e-05,0.000333,0.000212,0.00028,0.000126,0.000425,0.000251,0.000221,0.00017,0.000131,0.000232,0.00019,0.000342,0.000227,0.00036,1.2e-05,7.5e-05,0.000114,6.3e-05,4.2e-05,0.000164,3.4e-05,7.5e-05,6.3e-05,0.000105,6.5e-05,1.6e-05,7.3e-05,1.3e-05,3.7e-05,6.2e-05,1.1e-05,4.8e-05,4.2e-05,1.7e-05,5.4e-05,8.6e-05,1.7e-05,2.5e-05
1.5e-05,3.8e-05,1.4e-05,5.6e-05,4.5e-05,7.3e-05,3.6e-05,2.1e-05,7.3e-05,0.000108,4.3e-05,5.7e-05,7.9e-05,1.8e-05,4.3e-05,2.3e-05,2.5e-05,2.8e-05,1.6e-05,3.5e-05,1.3e-05,1.1e-05,1e-05,2.7e-05,1.5e-05,4e-06,1.5e-05,2.4e-05,2e-05,4e-05,5.2e-05,5e-05,1.7e-05,2.2e-05,9.8e-05,8.6e-05,3.2e-05,1.8e-05,4.3e-05,4.8e-05,4.7e-05,3.9e-05,1.2e-05,4.3e-05,2.2e-05,8e-06,1.4e-05,5.7e-05,1.5e-05,3.5e-05,4e-06,3.4e-05,1.7e-05,4.3e-05,6.2e-05,3.2e-05,4.6e-05,6.4e-05,0.000103,2.6e-05,6.2e-05,0.00011,4.8e-05,9.1e-05,6.1e-05,5.6e-05,7.3e-05,4.6e-05,5e-05,0.000124,8.3e-05,7.9e-05,0.000137,0.000148,5.9e-05,0.000178,7.9e-05,6.7e-05,8.5e-05,0.000135,0.00028,0.000137,0.000276,0.000126,0.00036,0.000302,0.000233,0.000264,9.2e-05,8.4e-05,0.000207,5.4e-05,0.000307,9e-05,0.000201,0.000359,0.000296,0.000202,0.000137,0.000151,2.5e-05,7.6e-05,8.2e-05,0.00014,4.3e-05,6.4e-05,0.000103,0.000153,6.8e-05,4.7e-05,3e-05,3.3e-05,6e-06,4.8e-05,6.2e-05,6.1e-05,6.1e-05,6.7e-05,6.7e-05,6.3e-05,5.3e-05
3.8e-05,2.4e-05,2.7e-05,6.2e-05,1.6e-05,3e-05,7.3e-05,2.8e-05,3.7e-05,8.4e-05,4.8e-05,7.1e-05,1.5e-05,2.1e-05,1.7e-05,3.2e-05,4.4e-05,2.6e-05,1.1e-05,4.9e-05,1.6e-05,1.3e-05,1.7e-05,1.1e-05,3.8e-05,3.8e-05,4.3e-05,1.5e-05,2e-06,3.7e-05,4.5e-05,7.6e-05,3.1e-05,2.9e-05,7.9e-05,8.2e-05,2.5e-05,4.8e-05,3.2e-05,4.3e-05,3.1e-05,7.1e-05,3e-05,6.1e-05,2.7e-05,3.2e-05,5e-06,4.6e-05,2.3e-05,2.6e-05,2.8e-05,3.8e-05,4.8e-05,3.5e-05,4.6e-05,2.8e-05,2e-05,2.8e-05,5.8e-05,3.9e-05,1.9e-05,4.2e-05,5.7e-05,4.6e-05,3.2e-05,7.2e-05,0.000106,7.8e-05,4.5e-05,0.000103,4.5e-05,4e-06,6.5e-05,7.7e-05,3.6e-05,0.00026,4.8e-05,0.000165,8.4e-05,0.000261,0.000283,0.000276,6.9e-05,0.000144,0.000117,6e-05,0.000207,0.000315,0.000115,0.000178,0.000191,0.000113,0.000172,0.000295,5.2e-05,0.000211,0.000147,8.3e-05,5.7e-05,6.3e-05,8.2e-05,5.1e-05,0.000137,0.000118,0.000118,1.9e-05,6.4e-05,7.6e-05,9.9e-05,6.8e-05,2.5e-05,4.6e-05,2.9e-05,6.9e-05,3.3e-05,8.7e-05,5.8e-05,2.4e-05,2.5e-05,5.5e-05,2.7e-05
8e-06,1.2e-05,3e-05,2.1e-05,2.9e-05,3.9e-05,4.5e-05,2.8e-05,5.5e-05,2.8e-05,1.2e-05,5.4e-05,5.6e-05,3.7e-05,3.2e-05,2.7e-05,4.4e-05,3.2e-05,2.2e-05,3.5e-05,3.9e-05,6e-06,1.5e-05,1e-05,4.1e-05,2.2e-05,3.8e-05,2.4e-05,7e-06,2.1e-05,1.4e-05,3.7e-05,3e-06,3e-05,4.4e-05,8.1e-05,2.7e-05,3.8e-05,3.5e-05,5.3e-05,6.1e-05,6.8e-05,2e-05,1.9e-05,1.7e-05,4.3e-05,3.5e-05,3.1e-05,2.2e-05,4.8e-05,4e-05,5e-05,5.5e-05,6.4e-05,6.6e-05,1.6e-05,1.8e-05,1.6e-05,6.3e-05,3.3e-05,2e-05,2.6e-05,5.4e-05,1.8e-05,2.7e-05,4.8e-05,9e-05,4.7e-05,5.8e-05,7.8e-05,2.5e-05,6.4e-05,0.000105,0.000107,5.5e-05,0.000298,9.5e-05,0.000134,7.6e-05,0.000425,0.000353,0.000303,0.000223,0.00026,0.000264,0.000101,0.000286,0.000349,0.00017,0.000395,0.000358,0.000167,9e-06,0.000209,0.000162,0.000372,0.000237,7.5e-05,9.6e-05,5.1e-05,0.000114,0.000146,0.000211,9.9e-05,9.6e-05,4.8e-05,0.000111,5e-06,5.4e-05,7.6e-05,4.7e-05,8.8e-05,1.5e-05,7.7e-05,4e-05,9e-05,7.4e-05,4.7e-05,4.7e-05,5.5e-05,1.2e-05
3.9e-05,1.3e-05,3.3e-05,5e-05,3.3e-05,5.6e-05,9e-05,1.7e-05,6e-05,5.4e-05,5e-05,4.1e-05,2e-06,8.9e-05,5e-05,7.2e-05,1.4e-05,6.5e-05,2.9e-05,3.2e-05,3.7e-05,4.3e-05,2e-05,1.9e-05,5.2e-05,3.9e-05,3.7e-05,2e-05,1.9e-05,4e-05,1.2e-05,5.8e-05,3.3e-05,9.1e-05,8.5e-05,8e-05,6.2e-05,3.4e-05,7.8e-05,0.000102,0.000137,0.000144,4.8e-05,8.9e-05,2e-05,1.5e-05,2e-05,2.2e-05,4.4e-05,2.9e-05,8e-06,2.6e-05,3.9e-05,1.7e-05,4.3e-05,4.6e-05,2.1e-05,2.8e-05,8e-05,1.9e-05,9.3e-05,9.2e-05,7e-05,8.6e-05,4.1e-05,8.2e-05,9.3e-05,2.9e-05,9e-06,0.000122,8.2e-05,8.7e-05,9.1e-05,6.7e-05,0.000171,0.000292,6.7e-05,0.000328,0.000277,0.000555,0.000542,0.000739,0.00053,0.000637,0.00078,0.000649,0.000552,0.000634,0.000752,0.000136,0.000369,0.000325,0.000217,0.000215,0.000217,0.000244,0.000283,3.7e-05,0.000182,0.000176,6.1e-05,0.000144,0.000159,0.000198,0.000148,0.00016,0.00011,0.000126,5.1e-05,5.4e-05,7.6e-05,6.2e-05,0.000106,2.8e-05,1.6e-05,7.1e-05,3.8e-05,5.4e-05,0.000108,2.6e-05,6e-05
3.1e-05,3.9e-05,2e-05,3.8e-05,5.4e-05,1.1e-05,9.8e-05,9.4e-05,0.000114,7.6e-05,0.000108,8e-05,4.2e-05,8.1e-05,5.9e-05,3.7e-05,4.1e-05,6.4e-05,3.8e-05,3.6e-05,2.1e-05,1.1e-05,1.9e-05,6e-06,5.5e-05,5.1e-05,1.4e-05,3.5e-05,1.8e-05,4.7e-05,6.2e-05,2.8e-05,3.4e-05,9.3e-05,6.3e-05,8.9e-05,2.1e-05,2.5e-05,0.000108,4.1e-05,7.9e-05,0.000133,4.5e-05,0.000132,9.1e-05,5.4e-05,1.5e-05,3.2e-05,7.2e-05,7.6e-05,6e-05,2.6e-05,6.6e-05,5.8e-05,9.6e-05,7.9e-05,4.9e-05,7e-06,4.2e-05,0.00013,0.000234,0.000253,0.000155,9.7e-05,6e-05,7.6e-05,0.000119,2.9e-05,5.1e-05,0.000181,0.000155,0.00015,0.00021,0.000248,0.000381,0.000617,0.000429,0.000784,0.001014,0.001321,0.001804,0.001974,0.001731,0.001341,0.001065,0.000946,0.000437,0.000262,0.000466,0.000576,0.000377,0.000209,0.000194,8.4e-05,0.000273,0.000262,0.000426,0.000402,0.000253,0.00017,0.000112,0.000117,0.000224,0.000244,0.000344,0.000259,0.000288,8.8e-05,9.7e-05,2.5e-05,2.9e-05,0.000107,1e-04,6.7e-05,6.5e-05,8e-05,0.000135,1.6e-05,7.2e-05,5.7e-05,7.9e-05
1.5e-05,3.2e-05,2.7e-05,3.2e-05,2e-05,3.1e-05,3.1e-05,7.2e-05,6.6e-05,6.1e-05,7.2e-05,5.4e-05,4.7e-05,6.8e-05,5e-05,6.8e-05,2.5e-05,2.2e-05,1.5e-05,5.5e-05,2.6e-05,2.2e-05,3.1e-05,3.2e-05,5.4e-05,4.7e-05,4.1e-05,5.1e-05,1.3e-05,3.8e-05,0.000103,9.2e-05,4.6e-05,9.6e-05,0.000111,0.000142,0.000143,7.3e-05,0.000152,0.000162,0.000188,0.000252,0.000223,0.000124,9.9e-05,4.8e-05,6e-06,5.1e-05,5e-06,3.4e-05,1.8e-05,4.7e-05,6.1e-05,3.7e-05,3.2e-05,4.9e-05,4.8e-05,4.9e-05,4.2e-05,0.000153,0.000379,0.000263,0.000115,8.9e-05,9.5e-05,0.000108,2.2e-05,7.7e-05,0.000132,0.000108,0.00027,0.000257,0.000186,0.000436,0.000526,0.000498,0.000659,0.000533,0.000537,0.000496,0.000821,0.000565,0.00021,0.000374,0.000328,0.000432,0.000389,0.000433,0.000284,0.000281,0.000277,0.000362,0.00051,0.000268,0.000166,0.000212,0.000218,0.000133,0.000183,9.1e-05,9.4e-05,0.000127,0.000226,4e-05,0.000166,0.000115,0.000168,0.000157,8.6e-05,8.3e-05,2.7e-05,5e-05,2.4e-05,7.7e-05,0.000105,9.1e-05,2.9e-05,6.4e-05,6.6e-05,0.000103,5e-05
3.1e-05,3.7e-05,8e-06,4.4e-05,3e-06,3.8e-05,1.3e-05,5.1e-05,2.3e-05,5.3e-05,2.3e-05,5.6e-05,6.8e-05,5e-05,2.8e-05,5.2e-05,4e-05,3.4e-05,2e-05,2.2e-05,9e-06,1.6e-05,1.2e-05,2.7e-05,2.3e-05,2e-05,3.1e-05,8e-06,1.6e-05,2.3e-05,9.4e-05,1.7e-05,3.3e-05,1.4e-05,6.2e-05,0.000171,7.4e-05,8.8e-05,0.000152,0.000132,0.000101,5.3e-05,0.000178,0.000112,2.8e-05,1.7e-05,4.3e-05,6.3e-05,5.1e-05,2.2e-05,1.7e-05,6.8e-05,4.7e-05,5e-05,1.2e-05,3.2e-05,4.7e-05,4.5e-05,5.4e-05,0.00013,0.00016,0.000116,1.7e-05,4e-05,7.1e-05,0.000101,9.7e-05,2.7e-05,1e-04,3.1e-05,0.000139,7.5e-05,0.000139,0.000227,0.000366,0.000167,0.000361,0.00042,0.000503,0.000169,0.000317,0.000273,0.00039,0.00034,0.000126,0.000289,0.000171,0.000164,0.000116,0.000242,0.000271,8e-05,0.000172,0.000165,9.2e-05,0.000196,7.3e-05,9.2e-05,3.3e-05,2.9e-05,8.5e-05,5.7e-05,0.000134,5.9e-05,5.2e-05,5.4e-05,6.7e-05,3.1e-05,5.7e-05,4.4e-05,4.8e-05,1.8e-05,4.1e-05,4.5e-05,3.9e-05,1.9e-05,2.1e-05,2.8e-05,6.7e-05,3.2e-05,2.7e-05
2.1e-05,5.7e-05,2e-05,2.2e-05,6e-06,4.6e-05,5e-06,4e-05,1.2e-05,4.9e-05,3e-05,3.4e-05,5.2e-05,3.4e-05,5.1e-05,2.9e-05,2.1e-05,2.8e-05,1.7e-05,2.8e-05,3e-05,2.3e-05,3.1e-05,2e-05,1.1e-05,1.5e-05,1.9e-05,3.5e-05,1.9e-05,4.5e-05,0.000118,9e-05,7.2e-05,0.000114,0.000126,0.000222,0.000142,8.6e-05,0.000154,0.000199,0.000206,0.000291,0.000228,0.000106,3.9e-05,4.3e-05,3.3e-05,9.5e-05,4.5e-05,3.2e-05,4.7e-05,7.2e-05,8.7e-05,8e-05,5.6e-05,2.9e-05,4.4e-05,5.7e-05,5.5e-05,2.3e-05,7.3e-05,0.000151,0.000199,5.6e-05,0.000115,7.6e-05,0.000134,2.3e-05,6.9e-05,4.4e-05,0.000181,0.000189,9.8e-05,6.6e-05,0.000421,0.000321,7.8e-05,0.000163,0.000358,0.000253,0.000253,1.7e-05,0.000188,0.000219,0.000144,0.000151,0.000183,0.000265,9.8e-05,0.000124,8.8e-05,6.5e-05,1.2e-05,0.000104,6.7e-05,0.000157,1e-05,4.3e-05,1.1e-05,6e-05,4e-05,1.7e-05,4.9e-05,2.7e-05,2.1e-05,3.5e-05,1.9e-05,4.9e-05,6e-06,3.2e-05,6e-05,2.8e-05,1.5e-05,3.2e-05,2.8e-05,2.2e-05,1.9e-05,3.3e-05,1.4e-05,2.3e-05,1.4e-05
1.3e-05,2.1e-05,9e-06,1.9e-05,1.6e-05,1.8e-05,1.6e-05,2.2e-05,1.4e-05,3.5e-05,2.9e-05,1.1e-05,2.6e-05,2.2e-05,4.3e-05,3.5e-05,2.8e-05,9e-06,2.4e-05,2.2e-05,2.2e-05,2.1e-05,1.4e-05,8e-06,1.9e-05,1.5e-05,1.3e-05,2.7e-05,1.2e-05,1.9e-05,4.5e-05,1.3e-05,3.8e-05,6.8e-05,0.000105,7.6e-05,4.2e-05,5.5e-05,6.9e-05,8.3e-05,1e-04,7.6e-05,5.3e-05,5.3e-05,2.6e-05,1.1e-05,2.3e-05,2e-06,2.1e-05,1.7e-05,1.2e-05,3.6e-05,2.7e-05,2.5e-05,1.4e-05,1.8e-05,1.4e-05,2e-05,3.6e-05,3.6e-05,2.4e-05,8.8e-05,2.2e-05,9.6e-05,4.6e-05,8e-05,7.8e-05,7.4e-05,3.4e-05,7.2e-05,0.000109,0.000113,7.8e-05,8.8e-05,0.000165,8.1e-05,5.2e-05,3.4e-05,4.3e-05,0.000154,0.000107,2e-05,3e-05,0.000117,7.7e-05,0.000115,7.5e-05,4.4e-05,1.5e-05,5.3e-05,4e-05,5e-06,4.9e-05,2.8e-05,1.4e-05,7.4e-05,3.5e-05,2.5e-05,2.7e-05,3.5e-05,9e-06,1e-05,5.2e-05,4.3e-05,3.6e-05,8e-06,8e-06,4.3e-05,1.8e-05,1.6e-05,2.8e-05,3.7e-05,2.5e-05,3e-05,1.3e-05,1.7e-05,7e-06,1.8e-05,1e-05,3e-06,3e-06
3.4e-05,4e-05,3.5e-05,3.4e-05,2.5e-05,3.3e-05,2.6e-05,3.4e-05,1.8e-05,4.3e-05,3.9e-05,3.9e-05,3.4e-05,3.6e-05,5e-05,1.8e-05,4.3e-05,3.8e-05,5.1e-05,5.8e-05,6.2e-05,3.3e-05,9e-06,2.3e-05,1.9e-05,1.3e-05,1.1e-05,3.4e-05,3.6e-05,4.5e-05,5.3e-05,7.2e-05,8.5e-05,9.9e-05,0.00013,0.000107,7.1e-05,8.5e-05,8.5e-05,8.7e-05,8e-05,9.4e-05,4.5e-05,9.6e-05,4.7e-05,9e-06,4.6e-05,2.1e-05,3.1e-05,1.8e-05,2.2e-05,1.5e-05,1.7e-05,3.3e-05,3e-05,4e-06,1.8e-05,9e-06,1.9e-05,1.6e-05,4.6e-05,4.7e-05,7.6e-05,0.000108,0.000171,0.000206,0.000175,0.000138,0.000139,0.000124,0.000101,0.000151,0.00019,0.000195,4.9e-05,7e-05,6.7e-05,8.5e-05,0.000103,4.7e-05,0.000186,7.8e-05,9.4e-05,0.000105,1.6e-05,0.000123,9.7e-05,0.000114,6.4e-05,2.7e-05,7.6e-05,6.9e-05,4.4e-05,6.2e-05,9.1e-05,9e-05,7.3e-05,3.7e-05,5.7e-05,4.2e-05,2.4e-05,4e-06,5.3e-05,1.9e-05,3e-05,5.8e-05,4.3e-05,6.9e-05,4e-05,1.4e-05,3.7e-05,3.5e-05,1.1e-05,3.8e-05,3.5e-05,1.9e-05,8e-06,1.8e-05,1.5e-05,1.1e-05,1.3e-05
2.4e-05,1.8e-05,3.3e-05,5.4e-05,4.3e-05,2.1e-05,4.2e-05,3.8e-05,5.8e-05,6.3e-05,0.000107,0.000145,0.00013,0.000123,0.000122,0.000115,7.1e-05,4.5e-05,5.5e-05,2.2e-05,2.2e-05,3.5e-05,2.3e-05,3e-06,6e-06,2e-05,1.1e-05,2.3e-05,5e-05,3e-05,5e-06,3.9e-05,6.9e-05,0.000112,0.00018,0.000177,0.000162,0.000128,0.000175,0.000119,0.000111,5.2e-05,4.4e-05,5.8e-05,6.1e-05,3.8e-05,5.1e-05,4.8e-05,5.6e-05,6.3e-05,6.7e-05,5.5e-05,6.8e-05,8.1e-05,7.9e-05,5.9e-05,5.3e-05,5.3e-05,3.3e-05,4.8e-05,6.7e-05,1.1e-05,7e-06,5.9e-05,7.2e-05,8.3e-05,1.5e-05,5.2e-05,9.9e-05,7.2e-05,5e-05,4e-05,0.000102,7.2e-05,3.4e-05,3.9e-05,7.1e-05,9.1e-05,0.000113,7.8e-05,9.8e-05,2.5e-05,0.000122,7.8e-05,5.1e-05,1.1e-05,9e-06,2.8e-05,1.7e-05,4.5e-05,4.2e-05,4.3e-05,5.7e-05,4.5e-05,6.7e-05,8e-06,3.6e-05,6.4e-05,2.6e-05,4.8e-05,3.8e-05,3.2e-05,1.5e-05,2.3e-05,3.7e-05,4.9e-05,1.6e-05,4e-05,3.6e-05,2.4e-05,3.2e-05,1.3e-05,2.8e-05,2.1e-05,4.1e-05,1.1e-05,2e-06,2.4e-05,6e-06,1.5e-05,1e-06
2.5e-05,1.9e-05,3.2e-05,2.4e-05,1.1e-05,2.8e-05,2.9e-05,9e-06,3.3e-05,3.4e-05,4e-05,6.8e-05,4.4e-05,2.1e-05,8.1e-05,4.2e-05,4.5e-05,1.7e-05,5.1e-05,1.9e-05,1.4e-05,2e-05,2.5e-05,1.1e-05,4e-06,1e-05,8e-06,1.8e-05,4.1e-05,5.6e-05,5.4e-05,1.7e-05,2.8e-05,7.8e-05,9.9e-05,4.4e-05,1.1e-05,7.3e-05,6.8e-05,3.8e-05,5.2e-05,6.4e-05,5.6e-05,3.8e-05,2.6e-05,2.8e-05,4.1e-05,5.1e-05,3.2e-05,4.6e-05,2.4e-05,3.6e-05,2.5e-05,2e-05,2.9e-05,2.7e-05,1.1e-05,2.8e-05,9e-06,4.8e-05,7.1e-05,5.6e-05,7.1e-05,6.7e-05,9.4e-05,0.000168,0.000173,0.000127,0.000168,0.000201,0.00014,0.000138,7.8e-05,0.000106,0.000129,9.2e-05,4.6e-05,3.8e-05,0.000114,5e-06,7.9e-05,4.4e-05,7.1e-05,7.6e-05,7.7e-05,2.9e-05,1.7e-05,4.2e-05,4e-06,3.5e-05,5.4e-05,4e-06,4e-06,5.7e-05,4.6e-05,1.3e-05,2.4e-05,2.7e-05,2.2e-05,3.2e-05,3.1e-05,6e-06,2e-05,1e-05,4.3e-05,1.4e-05,7e-06,3.7e-05,1.8e-05,6e-06,3.3e-05,1.6e-05,2.2e-05,4.2e-05,3.4e-05,3.4e-05,1.5e-05,1.1e-05,1.5e-05,8e-06,9e-06
1.9e-05,1.1e-05,7e-06,1.9e-05,3.5e-05,3.1e-05,2.7e-05,3.3e-05,1.7e-05,3e-05,4.5e-05,3.3e-05,1.9e-05,3.2e-05,3.7e-05,8.3e-05,9.3e-05,7.1e-05,7e-06,1.6e-05,1.3e-05,2.3e-05,2e-05,2.2e-05,6e-06,1.1e-05,2.8e-05,4.2e-05,2.2e-05,3.4e-05,1.5e-05,3.7e-05,5.4e-05,5e-05,8.3e-05,0.00013,0.000129,7.5e-05,9e-05,0.000113,0.000122,9.5e-05,5.7e-05,4.4e-05,4.3e-05,3.5e-05,3.7e-05,2.6e-05,4.2e-05,1.7e-05,2.5e-05,7e-06,2.1e-05,2.9e-05,1.5e-05,1.9e-05,1.4e-05,1.1e-05,2.1e-05,2.8e-05,4e-05,3.2e-05,5.2e-05,2e-06,2.9e-05,8.7e-05,9.2e-05,2.3e-05,4.7e-05,9.6e-05,4.1e-05,6.8e-05,4.4e-05,6.5e-05,9.2e-05,2.4e-05,6.3e-05,6.9e-05,6.3e-05,3.8e-05,2.6e-05,1e-05,2.8e-05,3.4e-05,4.5e-05,5.1e-05,1.7e-05,4e-05,1.1e-05,3e-06,4.4e-05,1.9e-05,2e-05,4.7e-05,4.2e-05,9e-06,1.3e-05,2.8e-05,1.9e-05,1.2e-05,8e-06,6e-06,1.7e-05,3e-06,4.5e-05,2.4e-05,5e-06,3e-05,5e-06,1e-05,2.1e-05,1.3e-05,2e-05,3.3e-05,1.5e-05,1.9e-05,5e-06,8e-06,5e-06,5e-06,4e-06
1.2e-05,1.2e-05,1.2e-05,0,2.7e-05,1.9e-05,1.4e-05,1.5e-05,1e-05,1.6e-05,2.1e-05,2.9e-05,1.4e-05,2.6e-05,3e-06,3.8e-05,3.3e-05,1.4e-05,3.4e-05,3e-05,1.8e-05,8e-06,1.2e-05,1.5e-05,7e-06,8e-06,2.2e-05,1.3e-05,1.3e-05,1.8e-05,2.7e-05,6e-06,3.7e-05,2e-05,2.1e-05,5.7e-05,4.7e-05,4.2e-05,3e-05,7.8e-05,5.4e-05,5e-05,4.7e-05,5.5e-05,1.8e-05,1.3e-05,1.1e-05,6e-06,2.2e-05,3e-06,1.7e-05,1e-05,9e-06,2.3e-05,2.2e-05,1.1e-05,1e-06,2e-06,1e-05,1.7e-05,3.5e-05,1.2e-05,6e-05,5.3e-05,4.9e-05,3.6e-05,0.000127,8.4e-05,6.4e-05,6.9e-05,9.2e-05,0.000133,5.5e-05,0.000112,0.000142,0.000117,0.000104,9.3e-05,9.5e-05,4.8e-05,4.4e-05,2.7e-05,2.8e-05,6.1e-05,2.4e-05,1e-05,4.3e-05,2.1e-05,2.9e-05,3e-06,3.7e-05,1.3e-05,1.9e-05,3.9e-05,1.7e-05,5e-06,2.6e-05,4.1e-05,2.1e-05,1.6e-05,1.5e-05,1.2e-05,1.4e-05,1.7e-05,3.3e-05,1.8e-05,1.1e-05,2.8e-05,1.9e-05,2e-05,2.1e-05,1.7e-05,1.2e-05,3.8e-05,1.9e-05,1e-05,7e-06,1.1e-05,1.7e-05,1.1e-05,1.2e-05
1e-05,8e-06,5e-06,1e-05,1.5e-05,2.3e-05,5e-06,1.3e-05,4e-06,3e-06,2e-05,1.7e-05,7e-06,1.7e-05,8e-06,2.2e-05,6e-06,1.6e-05,1e-05,9e-06,6e-06,1e-06,1.3e-05,1.1e-05,4e-06,4e-06,2.2e-05,1.1e-05,1.7e-05,5e-06,1.1e-05,1.5e-05,1.1e-05,4.2e-05,4.3e-05,8e-05,0.000101,8e-05,9.2e-05,0.000109,0.000131,0.000142,9.9e-05,3.9e-05,5e-06,9e-06,1.9e-05,9e-06,9e-06,1.8e-05,2.5e-05,8e-06,2.3e-05,1e-05,2e-05,1e-05,1e-05,7e-06,4e-06,2.4e-05,3.5e-05,1.4e-05,2.9e-05,2.1e-05,2.9e-05,3.7e-05,7.3e-05,6.8e-05,2.5e-05,7e-06,1.8e-05,9.4e-05,4.3e-05,4.1e-05,5.4e-05,4.7e-05,1.2e-05,2.1e-05,7.2e-05,1.1e-05,5.8e-05,1.1e-05,4.5e-05,6.1e-05,3.1e-05,4.4e-05,1.2e-05,2.1e-05,8e-06,2.5e-05,2.6e-05,1.4e-05,1.8e-05,4.6e-05,3.2e-05,1.3e-05,2.2e-05,2e-05,2.2e-05,1.4e-05,1.3e-05,8e-06,1e-06,5e-06,3.6e-05,2.6e-05,1.8e-05,1.9e-05,1.1e-05,1e-05,5e-06,9e-06,1.3e-05,2.1e-05,4e-06,9e-06,1.1e-05,2e-06,1.2e-05,3e-06,7e-06
6e-06,3e-06,2e-06,8e-06,1.3e-05,1.6e-05,2e-06,9e-06,3e-06,5e-06,1.2e-05,1.8e-05,8e-06,1e-05,5e-06,1.4e-05,6e-06,1e-05,6e-06,7e-06,1e-06,3e-06,3e-06,1e-05,5e-06,3e-06,1.8e-05,3e-06,8e-06,6e-06,1.3e-05,8e-06,2e-05,2.7e-05,2.5e-05,3.9e-05,5.7e-05,3.5e-05,3.5e-05,3e-05,3.6e-05,3.7e-05,3.3e-05,1.1e-05,1.2e-05,1.6e-05,7e-06,1.5e-05,6e-06,1.5e-05,4e-06,1.2e-05,8e-06,9e-06,1.8e-05,3e-06,4e-06,5e-06,5e-06,2.1e-05,2.4e-05,7e-06,1.9e-05,1e-05,2.6e-05,2.4e-05,5.8e-05,1.7e-05,3.6e-05,2.5e-05,3.5e-05,5.5e-05,2.5e-05,5e-06,3.1e-05,5.2e-05,2.8e-05,2.5e-05,4.4e-05,1.3e-05,3.9e-05,3.1e-05,4.4e-05,6.9e-05,2.8e-05,4e-05,1.7e-05,2e-05,8e-06,1.6e-05,1.9e-05,8e-06,4e-06,3.9e-05,3.5e-05,7e-06,1.3e-05,2.7e-05,5e-06,8e-06,9e-06,1.1e-05,1.2e-05,1.2e-05,2.5e-05,4e-06,9e-06,3e-06,8e-06,1e-05,4e-06,8e-06,1e-05,1.5e-05,5e-06,1.1e-05,7e-06,6e-06,1.3e-05,3e-06,4e-06
5e-06,3e-06,5e-06,4e-06,9e-06,1.5e-05,4e-06,6e-06,7e-06,8e-06,1.2e-05,1.6e-05,9e-06,1e-05,6e-06,1.1e-05,4e-06,1e-05,4e-06,8e-06,1.4e-05,4e-06,9e-06,1e-05,8e-06,4e-06,1.2e-05,8e-06,1.4e-05,7e-06,1.7e-05,2.2e-05,1.7e-05,9e-06,3.6e-05,4.6e-05,3.2e-05,1.7e-05,1.9e-05,1e-05,2.7e-05,4.2e-05,9e-06,1.4e-05,4e-06,1.4e-05,2e-06,1.3e-05,1e-05,5e-06,7e-06,1.1e-05,1.1e-05,1.2e-05,1.7e-05,1.5e-05,1e-05,9e-06,9e-06,1.4e-05,2.5e-05,4e-06,1.7e-05,1.4e-05,1.5e-05,3.8e-05,4.3e-05,1.6e-05,2.2e-05,2.8e-05,2.3e-05,5.5e-05,1.6e-05,2.1e-05,1.9e-05,4.8e-05,7e-06,2.3e-05,4.4e-05,1.7e-05,5.4e-05,2e-05,3.4e-05,5e-05,2.3e-05,3.3e-05,1e-05,1.2e-05,1.1e-05,1.2e-05,1.9e-05,1.7e-05,1.1e-05,3.8e-05,2e-05,7e-06,6e-06,1.4e-05,8e-06,1.3e-05,9e-06,7e-06,8e-06,8e-06,1.6e-05,1.4e-05,4e-06,1.3e-05,9e-06,4e-06,7e-06,4e-06,9e-06,1.2e-05,5e-06,4e-06,4e-06,3e-06,1.2e-05,1e-06,1e-06
6e-06,3e-06,6e-06,1.1e-05,1.3e-05,2e-05,1e-05,1e-05,8e-06,9e-06,1.5e-05,1.4e-05,9e-06,1e-05,1.2e-05,1.6e-05,3e-06,7e-06,7e-06,1e-05,1.3e-05,1.5e-05,2.3e-05,6e-06,1.2e-05,1.5e-05,7e-06,8e-06,2.1e-05,1.2e-05,2.5e-05,1.2e-05,1.8e-05,9e-06,1.6e-05,2.2e-05,3.7e-05,1.7e-05,2.7e-05,8e-06,6e-06,3.4e-05,8e-06,9e-06,1.7e-05,1.2e-05,5e-06,6e-06,1e-05,1e-06,3e-06,1e-05,1e-05,1e-06,7e-06,3e-06,6e-06,4e-06,8e-06,1.4e-05,2.7e-05,3e-06,1.7e-05,1.4e-05,1.3e-05,3.4e-05,4.3e-05,9e-06,3.2e-05,2.8e-05,2.1e-05,5.4e-05,3.1e-05,2.6e-05,3.1e-05,4.7e-05,2.3e-05,9e-06,5.2e-05,1.5e-05,6.6e-05,1.8e-05,4e-05,5.9e-05,3.1e-05,5.4e-05,2.3e-05,1.1e-05,1.7e-05,1.3e-05,1.7e-05,7e-06,2.2e-05,4.8e-05,3.6e-05,4e-06,1.2e-05,2.1e-05,1.1e-05,1.9e-05,3e-06,3e-06,7e-06,8e-06,1.1e-05,8e-06,4e-06,1.2e-05,6e-06,2e-06,2e-06,6e-06,1.2e-05,1.1e-05,1e-06,5e-06,3e-06,3e-06,5e-06,6e-06,3e-06
4e-06,3e-06,4e-06,8e-06,1.1e-05,1.2e-05,6e-06,6e-06,7e-06,6e-06,9e-06,1.5e-05,6e-06,2e-06,6e-06,1.1e-05,1e-06,9e-06,7e-06,8e-06,2.1e-05,1e-05,7e-06,1.5e-05,1.1e-05,7e-06,2e-06,1.3e-05,1.4e-05,7e-06,1.5e-05,2.3e-05,3.6e-05,4.7e-05,2.3e-05,3.2e-05,4.5e-05,1.3e-05,1.1e-05,1.9e-05,7e-06,3.8e-05,1.1e-05,9e-06,2.5e-05,4e-06,4e-06,9e-06,8e-06,7e-06,7e-06,1.2e-05,7e-06,8e-06,9e-06,3e-06,8e-06,1e-05,9e-06,1.7e-05,2.1e-05,6e-06,1.6e-05,2e-05,1.3e-05,2.1e-05,3.3e-05,2.4e-05,1.9e-05,2.5e-05,1.6e-05,4.8e-05,2.2e-05,2e-06,2.3e-05,3e-05,3e-06,6e-06,5.3e-05,7e-06,4.6e-05,1.3e-05,3.6e-05,6.6e-05,8e-06,2.8e-05,9e-06,1.1e-05,1.7e-05,1.5e-05,2e-05,1.9e-05,8e-06,3.4e-05,2.8e-05,8e-06,1.3e-05,1.6e-05,1.2e-05,9e-06,5e-06,4e-06,2e-06,2e-06,7e-06,7e-06,3e-06,1.1e-05,5e-06,7e-06,3e-06,4e-06,1e-05,1.1e-05,7e-06,5e-06,5e-06,4e-06,9e-06,3e-06,4e-06
5e-06,5e-06,5e-06,1e-06,1.6e-05,1.6e-05,5e-06,3e-06,3e-06,4e-06,9e-06,1.4e-05,3e-06,6e-06,3e-06,7e-06,5e-06,1.4e-05,6e-06,4e-06,1.4e-05,7e-06,2e-06,8e-06,1.3e-05,2.1e-05,1.6e-05,2e-06,1e-05,1.3e-05,1e-05,2.1e-05,1.5e-05,1.4e-05,6e-06,4e-06,4.3e-05,1.8e-05,9e-06,1.1e-05,1.4e-05,2.5e-05,1.5e-05,1.2e-05,5e-06,1e-05,5e-06,4e-06,1.2e-05,0,9e-06,1.3e-05,1.6e-05,2e-06,8e-06,9e-06,4e-06,3e-06,7e-06,1.5e-05,2.3e-05,9e-06,2e-05,1.4e-05,1.6e-05,2.7e-05,2.6e-05,2.1e-05,1.5e-05,2.6e-05,1.7e-05,4.7e-05,1.9e-05,1.3e-05,3.6e-05,4e-05,1e-05,1.3e-05,4.8e-05,1.6e-05,4e-05,1.7e-05,5.7e-05,4.4e-05,1.4e-05,5.3e-05,1.6e-05,2e-05,1e-06,1.8e-05,7e-06,1.6e-05,1.4e-05,4.4e-05,2.7e-05,1.1e-05,6e-06,8e-06,9e-06,8e-06,3e-06,5e-06,6e-06,6e-06,4e-06,1.1e-05,7e-06,1.2e-05,3e-06,4e-06,2e-06,7e-06,9e-06,1.3e-05,8e-06,1e-05,3e-06,5e-06,1e-05,1e-06,2e-06
7e-06,1e-06,8e-06,5e-06,1.1e-05,1.3e-05,9e-06,4e-06,9e-06,9e-06,6e-06,1.1e-05,7e-06,4e-06,6e-06,9e-06,9e-06,7e-06,4e-06,1e-05,1.6e-05,7e-06,7e-06,1.1e-05,5e-06,1.2e-05,1e-05,3e-06,7e-06,1.1e-05,1e-05,1.6e-05,8e-06,3e-06,1.3e-05,2.2e-05,6.1e-05,1.6e-05,1.4e-05,1.2e-05,1.4e-05,2.1e-05,7e-06,1.3e-05,1.8e-05,1.3e-05,8e-06,7e-06,7e-06,1.3e-05,9e-06,1.9e-05,7e-06,1.3e-05,1.4e-05,1.2e-05,6e-06,6e-06,6e-06,1.4e-05,1.9e-05,7e-06,1e-05,1.8e-05,1e-05,2.2e-05,2.2e-05,2.3e-05,2.2e-05,3.3e-05,1.6e-05,4.6e-05,1.6e-05,1.6e-05,1.8e-05,3.2e-05,6e-06,3e-06,5.8e-05,7e-06,3.8e-05,1.7e-05,2.8e-05,5e-05,3.6e-05,3.5e-05,4e-06,1.4e-05,5e-06,9e-06,1e-05,8e-06,4e-06,4.3e-05,2.4e-05,1.3e-05,6e-06,1e-05,1e-05,7e-06,4e-06,7e-06,6e-06,7e-06,5e-06,1e-05,2e-06,1e-05,5e-06,6e-06,2e-06,8e-06,9e-06,1.5e-05,4e-06,9e-06,4e-06,6e-06,4e-06,4e-06,4e-06
2e-06,4e-06,1.5e-05,7e-06,1.5e-05,1e-05,1.2e-05,2e-06,1.5e-05,1e-05,1.4e-05,1.2e-05,9e-06,8e-06,3e-06,8e-06,1.4e-05,4e-06,8e-06,4e-06,1.8e-05,1.1e-05,4e-06,1.3e-05,1.4e-05,1e-06,7e-06,2e-06,7e-06,2.1e-05,2.3e-05,1.1e-05,1e-05,2.1e-05,1.8e-05,2.6e-05,2.6e-05,1.9e-05,1.7e-05,4e-06,1.9e-05,7e-06,1.2e-05,1.4e-05,1.1e-05,9e-06,5e-06,1e-05,2e-06,7e-06,2e-06,1.2e-05,3e-06,5e-06,9e-06,9e-06,2e-06,4e-06,8e-06,1.8e-05,2.2e-05,6e-06,9e-06,1.4e-05,1.2e-05,3.2e-05,2e-05,1.7e-05,2e-05,1.7e-05,1.6e-05,3.5e-05,2.3e-05,1.9e-05,2.3e-05,2.9e-05,1.1e-05,1.9e-05,5.4e-05,1.9e-05,5.5e-05,1.9e-05,3.6e-05,4.1e-05,3.6e-05,3.2e-05,2e-05,1.2e-05,1.8e-05,3e-06,9e-06,4e-06,6e-06,3.5e-05,3e-05,1.4e-05,1.7e-05,1.1e-05,5e-06,6e-06,6e-06,6e-06,6e-06,7e-06,8e-06,8e-06,1.3e-05,1.4e-05,6e-06,7e-06,2e-06,6e-06,9e-06,1.3e-05,1e-06,9e-06,2e-06,6e-06,1.2e-05,3e-06,3e-06
1e-05,5e-06,1.4e-05,2.3e-05,3.5e-05,2e-05,2.9e-05,2.2e-05,2e-05,2.1e-05,1.6e-05,7e-06,7e-06,9e-06,8e-06,8e-06,1.9e-05,2.8e-05,2.2e-05,2.4e-05,2e-05,2.8e-05,2.9e-05,1.5e-05,2.6e-05,2.8e-05,3.2e-05,2.5e-05,2.5e-05,1.5e-05,1.7e-05,3.2e-05,2.2e-05,3.2e-05,3e-05,8e-06,4e-05,3.7e-05,2.6e-05,1.6e-05,2.3e-05,2.6e-05,2.5e-05,3e-05,1.8e-05,5e-06,1.4e-05,1.1e-05,9e-06,5e-06,2e-06,1.7e-05,2e-06,6e-06,8e-06,6e-06,2e-06,3e-06,8e-06,1.6e-05,1.3e-05,8e-06,7e-06,1e-05,5e-06,3e-05,1.8e-05,1e-05,3.5e-05,2.4e-05,2e-05,4.5e-05,2.4e-05,2.9e-05,2e-05,3.1e-05,1.1e-05,2.5e-05,3.9e-05,2.5e-05,4.4e-05,3.4e-05,8.2e-05,6.3e-05,8e-06,3.4e-05,1.3e-05,1.9e-05,1.6e-05,2.2e-05,2.7e-05,2.5e-05,1.7e-05,3.7e-05,4e-05,8e-06,3.8e-05,1e-05,3.1e-05,2.7e-05,8e-06,8e-06,9e-06,3e-06,1.7e-05,1e-05,9e-06,5e-06,1e-06,2e-06,3e-06,8e-06,1.4e-05,1.5e-05,6e-06,9e-06,7e-06,5e-06,8e-06,5e-06,7e-06
8e-06,1e-05,6e-06,1.8e-05,2.2e-05,2.6e-05,2.7e-05,2.1e-05,2.3e-05,2.5e-05,1.4e-05,1.9e-05,2.3e-05,1e-06,9e-06,1.1e-05,3.4e-05,4.5e-05,2.6e-05,1.2e-05,2.8e-05,2.1e-05,1e-05,1e-05,1.4e-05,1.8e-05,1.9e-05,7e-06,2.9e-05,4e-05,2.6e-05,3.6e-05,1.2e-05,1.7e-05,2.3e-05,4.1e-05,6.1e-05,3.4e-05,2.9e-05,2.6e-05,2.8e-05,1.4e-05,7e-06,8e-06,1e-06,1.2e-05,6e-06,3e-06,7e-06,1.5e-05,1e-05,1e-05,6e-06,3e-06,8e-06,4e-06,3e-06,4e-06,5e-06,1.3e-05,1.1e-05,7e-06,1.5e-05,1.6e-05,4e-06,1.9e-05,3e-05,3.3e-05,4.2e-05,1.6e-05,3.7e-05,6.6e-05,2e-05,5e-05,5.4e-05,5e-05,4.2e-05,5.2e-05,9.3e-05,1.8e-05,3.2e-05,2.8e-05,3.9e-05,5.1e-05,1.5e-05,8e-06,1.5e-05,1.3e-05,2.6e-05,4.2e-05,2.4e-05,1.9e-05,2.2e-05,5.8e-05,3e-05,3.6e-05,5.1e-05,5.9e-05,2.7e-05,5e-06,4e-06,8e-06,8e-06,2e-06,1.4e-05,1e-05,7e-06,1.7e-05,1e-05,9e-06,5e-06,5e-06,1.1e-05,1.2e-05,1.1e-05,5e-06,4e-06,1e-05,9e-06,6e-06,4e-06
1.7e-05,1.1e-05,8e-06,1.1e-05,7e-06,1.7e-05,3e-06,8e-06,1.3e-05,3e-06,1.3e-05,2.3e-05,2e-06,9e-06,8e-06,7e-06,1.9e-05,1.2e-05,4e-06,1.5e-05,6e-06,2e-06,1.2e-05,1.6e-05,1.1e-05,1.3e-05,1.1e-05,6e-06,2.7e-05,3.2e-05,1.6e-05,2.5e-05,1.7e-05,3e-06,1.3e-05,2.6e-05,3.9e-05,1.1e-05,5e-06,7e-06,2e-06,9e-06,9e-06,1.3e-05,1e-05,9e-06,5e-06,1e-06,3e-06,7e-06,5e-06,7e-06,3e-06,3e-06,5e-06,6e-06,6e-06,3e-06,6e-06,1.5e-05,2.1e-05,2e-06,1e-05,1.1e-05,6e-06,1.3e-05,2.8e-05,9e-06,1.4e-05,3.9e-05,8e-06,3.8e-05,2.1e-05,2.5e-05,3.1e-05,6e-06,2.4e-05,2e-05,5e-05,1.5e-05,4.9e-05,7e-06,4e-05,4.3e-05,2.1e-05,2.8e-05,5e-06,3e-06,2.3e-05,1.5e-05,1.7e-05,1.4e-05,2.3e-05,2.1e-05,4.5e-05,2.4e-05,2e-05,1.7e-05,2e-05,1.4e-05,5e-06,4e-06,9e-06,9e-06,1e-06,3e-06,2e-06,1.2e-05,3e-06,3e-06,7e-06,9e-06,1.3e-05,8e-06,4e-06,1.1e-05,2e-06,8e-06,8e-06,4e-06,2e-06
1.1e-05,5e-06,2e-06,1.1e-05,3e-06,1.7e-05,3e-06,5e-06,1.3e-05,8e-06,1.3e-05,1.7e-05,6e-06,5e-06,5e-06,4e-06,1.1e-05,5e-06,2e-06,6e-06,5e-06,1e-06,5e-06,8e-06,5e-06,1.1e-05,1.1e-05,8e-06,1.6e-05,6e-06,9e-06,9e-06,9e-06,7e-06,2e-06,1.4e-05,2.6e-05,4e-06,1.1e-05,1.2e-05,1.1e-05,9e-06,4e-06,9e-06,1e-05,9e-06,6e-06,2e-06,1e-06,3e-06,1e-06,1e-05,2e-06,1e-06,6e-06,4e-06,3e-06,6e-06,5e-06,1.7e-05,1.6e-05,4e-06,4e-06,1.3e-05,7e-06,1.8e-05,2.9e-05,1.1e-05,9e-06,3.1e-05,1.2e-05,3.4e-05,2.1e-05,1.5e-05,3.3e-05,1.1e-05,8e-06,1.4e-05,5.1e-05,2e-06,4.8e-05,1.1e-05,4.6e-05,4.8e-05,2.4e-05,2.9e-05,5e-06,1.3e-05,1.2e-05,1.5e-05,1.9e-05,2e-06,1.3e-05,3e-05,2.8e-05,1.6e-05,4e-06,1.4e-05,8e-06,1e-05,2e-06,2e-06,7e-06,2e-06,2e-06,1e-06,2e-06,8e-06,4e-06,3e-06,3e-06,5e-06,1.2e-05,9e-06,3e-06,1e-05,3e-06,4e-06,7e-06,3e-06,2e-06
1e-05,5e-06,0,8e-06,2e-06,1.6e-05,1e-06,2e-06,9e-06,6e-06,1.1e-05,1.4e-05,6e-06,1e-06,2e-06,3e-06,5e-06,4e-06,1e-06,8e-06,2e-06,2e-06,3e-06,6e-06,5e-06,9e-06,1.1e-05,7e-06,1e-05,7e-06,5e-06,7e-06,6e-06,2e-06,8e-06,2e-05,3.2e-05,4e-06,6e-06,4e-06,5e-06,5e-06,2e-06,8e-06,8e-06,7e-06,4e-06,2e-06,2e-06,2e-06,2e-06,8e-06,1e-06,0,7e-06,3e-06,1e-06,3e-06,3e-06,1.6e-05,1.9e-05,3e-06,6e-06,1.2e-05,7e-06,1.8e-05,2.9e-05,1.2e-05,1.5e-05,3e-05,7e-06,3.2e-05,2.1e-05,1.7e-05,3e-05,1.4e-05,1.7e-05,1.1e-05,4.7e-05,8e-06,4.8e-05,1.1e-05,4.6e-05,4.2e-05,2.8e-05,3.2e-05,6e-06,1.3e-05,5e-06,1.3e-05,1.6e-05,3e-06,8e-06,2.9e-05,2.3e-05,1.4e-05,7e-06,1.7e-05,1.2e-05,8e-06,3e-06,1e-06,4e-06,4e-06,4e-06,2e-06,3e-06,9e-06,5e-06,4e-06,3e-06,4e-06,1e-05,9e-06,4e-06,7e-06,3e-06,3e-06,7e-06,4e-06,3e-06
1e-05,4e-06,0,8e-06,4e-06,1.5e-05,1e-06,4e-06,7e-06,5e-06,1e-05,1.5e-05,6e-06,1e-06,3e-06,3e-06,4e-06,4e-06,2e-06,6e-06,1e-06,1e-06,2e-06,6e-06,4e-06,8e-06,1.1e-05,8e-06,9e-06,5e-06,2e-06,7e-06,5e-06,1e-06,9e-06,2.2e-05,3.1e-05,3e-06,4e-06,2e-06,4e-06,3e-06,1e-06,7e-06,8e-06,8e-06,4e-06,3e-06,1e-06,2e-06,3e-06,9e-06,3e-06,1e-06,6e-06,3e-06,2e-06,3e-06,2e-06,1.5e-05,1.9e-05,3e-06,6e-06,1.2e-05,9e-06,1.9e-05,2.9e-05,1.4e-05,1.5e-05,2.6e-05,9e-06,3.3e-05,1.9e-05,1.9e-05,2.7e-05,1.7e-05,1.5e-05,7e-06,4.6e-05,5e-06,5.2e-05,1.1e-05,4.4e-05,4.7e-05,2e-05,2.7e-05,7e-06,1e-05,4e-06,1.2e-05,1.4e-05,4e-06,5e-06,2.9e-05,2.3e-05,1.5e-05,3e-06,1.8e-05,1e-05,6e-06,1e-06,0,1e-06,3e-06,2e-06,1e-06,2e-06,1e-05,5e-06,2e-06,3e-06,4e-06,1e-05,8e-06,3e-06,7e-06,2e-06,3e-06,7e-06,3e-06,2e-06
