2.5e-05,1e-05,1e-06,1.1e-05,1.6e-05,1e-05,1.4e-05,3e-06,9e-06,5.4e-05,2.7e-05,7e-06,1e-06,1.3e-05,2.1e-05,5e-06,9e-06,2.3e-05,2e-06,9e-06,2e-05,1.1e-05,3e-06,4e-06,7e-06,1.2e-05,2.9e-05,4e-06,1.8e-05,1.6e-05,0,1.8e-05,4e-06,5e-06,9e-06,1.4e-05,3.7e-05,1.7e-05,8e-06,7e-06,1.2e-05,3.3e-05,2.4e-05,7e-06,1.2e-05,2.1e-05,1.6e-05,1e-05,1.2e-05,4e-06,1e-05,9e-06,1.3e-05,1.3e-05,9e-06,1.9e-05,4e-06,1.4e-05,1e-06,1.3e-05,1.7e-05,3.8e-05,1.2e-05,1.7e-05,3e-06,2.2e-05,1.6e-05,4e-06,4e-06,1.3e-05,1.5e-05,2.4e-05,9e-06,3e-05,3e-05,4.1e-05,4e-06,8e-06,1.6e-05,3e-06,1.8e-05,4e-06,2e-06,6e-06,3.1e-05,0,1.1e-05,2e-06,2.2e-05,4.2e-05,8e-06,1.6e-05,6e-06,2e-06,3.6e-05,5e-06,5e-05,2.8e-05,2.7e-05,1e-06,1.4e-05,1.1e-05,4e-06,2.8e-05,2e-06,7e-06,1.4e-05,3.5e-05,1e-06,2e-05,1.8e-05,1.9e-05,1.1e-05,2e-05,2.5e-05,3e-06,4e-06,2.1e-05,2.4e-05,1.9e-05,0
4.2e-05,1.7e-05,2.6e-05,1.8e-05,2.9e-05,6.4e-05,8.3e-05,3.8e-05,3.7e-05,7.9e-05,9.1e-05,4.6e-05,4.3e-05,3.5e-05,3.3e-05,2.4e-05,1.2e-05,7.2e-05,5.3e-05,5.1e-05,4.9e-05,3e-05,2e-05,1.5e-05,4e-05,3.1e-05,7.5e-05,5e-05,5.3e-05,3.1e-05,4.1e-05,3e-05,1.4e-05,7e-05,1.2e-05,5.1e-05,0.000118,7.7e-05,2.1e-05,1.4e-05,2.2e-05,6.9e-05,5.5e-05,1.9e-05,4.3e-05,6.7e-05,1.9e-05,2.8e-05,3.4e-05,1.6e-05,7.6e-05,4.2e-05,3.5e-05,1.3e-05,3.7e-05,4.7e-05,1.3e-05,2.5e-05,2.9e-05,6.3e-05,7e-05,4.5e-05,5.8e-05,2.5e-05,4.1e-05,2.8e-05,7.7e-05,4.8e-05,3.7e-05,3.6e-05,3.3e-05,8.3e-05,6.5e-05,0.000101,0.000106,0.000134,4.9e-05,4.6e-05,4.7e-05,2.6e-05,5.7e-05,2e-05,2.3e-05,5.2e-05,7.1e-05,2.6e-05,2.8e-05,6.8e-05,5.6e-05,7e-05,4.5e-05,2.4e-05,3.3e-05,1.7e-05,9.6e-05,3.6e-05,0.000114,2.2e-05,4.5e-05,6.3e-05,5.7e-05,2.2e-05,4.9e-05,3.8e-05,3.7e-05,3.5e-05,7.8e-05,3.9e-05,3.2e-05,1.7e-05,4e-05,2.4e-05,4e-05,2.3e-05,4.9e-05,2.3e-05,1.5e-05,6.1e-05,8.5e-05,9.7e-05,6.5e-05
0.000104,5.2e-05,5.3e-05,6.9e-05,8.9e-05,7.1e-05,4.5e-05,6.3e-05,4.8e-05,9.8e-05,0.000101,3.2e-05,6.9e-05,8.9e-05,6.4e-05,3e-05,6.1e-05,3.4e-05,1e-05,6.2e-05,5.5e-05,3.6e-05,6e-05,2.8e-05,1.6e-05,4.2e-05,5.4e-05,3.2e-05,0.000118,2.1e-05,4.8e-05,3.6e-05,4.5e-05,0.000152,0.00016,0.000101,3.7e-05,5.3e-05,0.000101,5.2e-05,6.4e-05,0.000147,0.000131,6.1e-05,0.000108,7.6e-05,0.000136,6.9e-05,3.4e-05,3.2e-05,8e-05,7.9e-05,7.6e-05,7.6e-05,1.8e-05,8.3e-05,2.4e-05,4.4e-05,9.1e-05,0.000111,4e-05,4.1e-05,3.3e-05,3.3e-05,5.4e-05,7.7e-05,7e-05,4.7e-05,5.2e-05,7.8e-05,5.9e-05,9.7e-05,8.8e-05,1.1e-05,8.5e-05,9.9e-05,4.5e-05,4e-05,3.3e-05,5.9e-05,3.6e-05,7.3e-05,8.7e-05,0.000103,6.9e-05,4.4e-05,2.1e-05,5.1e-05,3.2e-05,9.1e-05,7e-05,0.000108,7.6e-05,5.5e-05,3.9e-05,3.5e-05,8.8e-05,8.8e-05,2.7e-05,0.000123,9.3e-05,0.000101,4.6e-05,7.8e-05,1.8e-05,2.5e-05,9.7e-05,0.000117,7.2e-05,0.000112,7.2e-05,6.4e-05,6.1e-05,7.5e-05,1.7e-05,1.2e-05,2.4e-05,0.000102,6.8e-05,6.4e-05,2.6e-05
4.2e-05,8.7e-05,3.7e-05,7e-05,3.2e-05,6.7e-05,3.3e-05,3.8e-05,6.1e-05,0.000142,7.1e-05,0.000104,2.5e-05,3.2e-05,3.8e-05,3.4e-05,9.9e-05,9.9e-05,2.4e-05,8.9e-05,6.5e-05,5.9e-05,0.000133,0.00012,4.4e-05,9.8e-05,7.3e-05,6e-05,0.000151,0.000158,0.000168,8.5e-05,6.1e-05,0.000217,0.000158,0.000101,8.6e-05,6e-05,1e-04,8.4e-05,6.6e-05,0.000204,6.9e-05,6.9e-05,7.6e-05,0.000158,0.000241,0.000164,0.000118,8.5e-05,8.6e-05,0.000139,0.000123,5.5e-05,8e-05,5.2e-05,3.1e-05,4.7e-05,0.000179,0.000211,0.000148,5.6e-05,5.5e-05,4.2e-05,2.5e-05,8.5e-05,0.000125,0.000161,0.00017,0.000118,5.2e-05,6.5e-05,5e-05,1.1e-05,0.000121,9.5e-05,1.9e-05,9.4e-05,7.8e-05,3e-05,6.9e-05,0.000136,9.7e-05,0.000128,9.7e-05,0.000155,9.7e-05,2.6e-05,3.2e-05,6e-05,3.4e-05,7.2e-05,4.1e-05,0.000138,0.000143,7.7e-05,1.4e-05,4.8e-05,8e-05,0.000127,7.2e-05,6e-05,6.7e-05,0.000124,6.6e-05,5.5e-05,6e-05,7.4e-05,8.5e-05,0.000105,7.5e-05,8.1e-05,2.5e-05,4e-05,0.000127,7.1e-05,5.7e-05,0.00013,8.3e-05,8e-05,0.000157
6e-05,0.000189,0.000105,4.1e-05,2.2e-05,0.000129,6.4e-05,0.00012,0.000128,3.4e-05,0.000131,2.2e-05,2.3e-05,0.000122,6.3e-05,9.5e-05,0.000213,3.3e-05,8.4e-05,7.2e-05,4.9e-05,9.1e-05,0.000157,8.8e-05,0.000193,1.1e-05,2.1e-05,0.000101,3.9e-05,0.000243,0.000293,0.000101,2.4e-05,0.000125,0.000104,8.9e-05,3.8e-05,0.000137,4.9e-05,2.6e-05,6.8e-05,0.000287,3.1e-05,2.2e-05,5.6e-05,0.000146,0.000113,1.8e-05,7.4e-05,2.6e-05,0.000142,0.000218,9.9e-05,6.2e-05,0.000134,8.5e-05,8.2e-05,7.3e-05,0.000125,0.000161,3.4e-05,0.00012,1e-04,4.3e-05,7.6e-05,9.2e-05,0.000124,0.000198,0.000163,0.000122,1.5e-05,5e-05,0.000136,0.000121,8.7e-05,0.000156,7.9e-05,0.000148,3.2e-05,0.000157,0.000118,1.4e-05,0.000106,0.000212,6e-05,0.000129,4.9e-05,4.9e-05,7.8e-05,8.3e-05,3.4e-05,4.1e-05,6.5e-05,0.000164,6.3e-05,0.000135,0.000221,3e-05,0.000105,0.000113,0.000131,0.000119,5.3e-05,2.2e-05,7.9e-05,8.3e-05,3.5e-05,5.6e-05,0.000168,9.1e-05,6e-05,6.5e-05,0.000155,6.7e-05,0.00017,9.9e-05,5.6e-05,0.000132,0.00015,9.4e-05,0.00022
5.2e-05,0.000188,0.000233,2e-04,7.5e-05,0.00016,0.000117,0.000123,9.3e-05,0.000121,0.000244,9.9e-05,0.000121,0.000234,0.000183,0.000151,0.000338,0.00035,0.000258,0.000164,8e-05,0.00014,0.000139,7.9e-05,0.00019,0.00013,0.000132,0.000137,0.000111,0.000195,0.00026,0.000234,0.000133,9.6e-05,0.000171,0.00016,0.000149,0.00018,0.000185,0.00015,2.8e-05,0.000371,0.000277,0.000134,5.1e-05,0.000142,0.000226,0.000152,4.3e-05,0.000101,0.000125,0.000157,0.000196,0.000163,0.000167,0.000164,3.2e-05,8.3e-05,6.7e-05,0.000197,0.000225,0.000237,0.000166,0.000154,0.000125,6.2e-05,0.000111,7.2e-05,4.8e-05,0.000131,7.7e-05,2.6e-05,0.000177,0.000155,0.000119,0.000232,0.000237,0.000179,0.000167,0.000231,0.000192,0.000163,0.000111,0.000225,0.000188,0.000208,0.00011,8e-05,0.000158,0.000253,0.000126,8.3e-05,3.9e-05,0.000213,0.000199,0.00021,0.000152,0.000319,0.000287,8.8e-05,0.000228,0.000194,0.000181,0.00021,1e-04,2.7e-05,0.000131,0.000164,0.000245,6.6e-05,6.6e-05,4.3e-05,0.000156,0.000112,0.000115,0.000218,0.000182,0.000141,0.000118,0.000152,0.000295
0.000153,1e-04,6.9e-05,6.9e-05,0.00015,3.4e-05,7.3e-05,8.9e-05,0.000152,0.00028,0.000259,0.000176,0.000101,0.000177,2.2e-05,0.000138,0.000181,0.000142,5.1e-05,0.000166,6.2e-05,9e-05,9e-05,3.8e-05,8.6e-05,4.9e-05,0.000138,0.000284,0.000265,0.000179,0.000375,0.000271,3e-04,0.000257,8.4e-05,8.5e-05,9e-05,9.1e-05,1e-04,7.5e-05,0.000151,3e-04,0.000363,0.00015,0.000135,1e-04,0.000125,0.000146,0.000138,0.000112,0.000212,0.000106,0.000196,9e-05,0.000157,0.000225,0.000227,9.7e-05,1.8e-05,0.000199,0.000194,0.000171,6.9e-05,0.000112,6.3e-05,0.000137,0.000235,0.000215,0.00012,6.8e-05,9.8e-05,4.8e-05,0.000188,0.000227,0.000235,0.000243,0.000199,0.000192,0.000214,0.00029,0.000162,0.000288,0.000218,6.3e-05,9e-05,0.000232,0.000133,9.5e-05,0.000132,0.000208,0.000115,0.000102,9.9e-05,0.000208,0.000124,0.000109,0.000297,0.000463,0.00033,0.000238,0.000268,0.000362,0.000319,0.000162,0.00025,0.000177,0.00019,6e-05,0.000131,0.000177,0.00019,8.6e-05,0.000174,9.9e-05,0.000155,4.6e-05,0.000138,0.000244,0.000165,0.000314,0.00021
2.8e-05,6e-05,9.6e-05,0.000118,0.000173,5.9e-05,5e-05,8.1e-05,0.000166,6.2e-05,7.5e-05,3.6e-05,5.2e-05,1.6e-05,8.4e-05,1.4e-05,0.000163,0.000116,5.2e-05,0.000209,7.7e-05,2.4e-05,4.1e-05,0.000119,0.000158,0.000162,5.3e-05,0.000245,4.4e-05,6.1e-05,0.000106,2.9e-05,0.000119,3.7e-05,0.000114,4.4e-05,5.2e-05,0.00013,3.7e-05,4.2e-05,0.000149,0.000111,0.000107,0.000122,0.000179,0.000116,5.2e-05,3.9e-05,5.3e-05,6.1e-05,0.000101,0.000191,5.3e-05,2.9e-05,0.000147,2.2e-05,6.5e-05,2.2e-05,8.7e-05,0.000157,1.9e-05,9.9e-05,2.3e-05,7.8e-05,0.00012,0.000136,0.000106,4.6e-05,0.000101,9.3e-05,3.6e-05,3.6e-05,0.000108,2.7e-05,5.5e-05,0.000177,5e-05,5.2e-05,0.000121,0.000125,1.9e-05,0.000167,5.5e-05,7.1e-05,0.000128,0.000324,0.000146,7.5e-05,7.7e-05,3.4e-05,6.8e-05,3.2e-05,0.00011,6.5e-05,0.000153,0.000179,9.2e-05,0.000114,0.000127,7.5e-05,0.000103,0.000128,5e-05,9.3e-05,0.000124,4.4e-05,4.4e-05,0.000142,0.000134,1.2e-05,0.000101,7.2e-05,0.000104,2.7e-05,4.3e-05,3.3e-05,0.000108,6.8e-05,4.2e-05,0.000211,0.000138
5.2e-05,3.1e-05,5.1e-05,3.8e-05,7.4e-05,0.000128,1e-04,0.000141,8.4e-05,0.000138,6.3e-05,0.000152,5.8e-05,1.9e-05,6.6e-05,0.000107,9.6e-05,1e-04,0.000111,0.000233,0.000222,7.4e-05,8.2e-05,0.000142,8.4e-05,0.00018,0.000165,0.000129,0.000148,8.2e-05,7.5e-05,4.6e-05,6e-05,8.9e-05,0.000167,8.1e-05,3.1e-05,0.00014,0.00014,7.9e-05,7.5e-05,1.9e-05,0.000145,8.9e-05,0.000158,0.000171,7.8e-05,9.9e-05,8.7e-05,5.3e-05,0.00019,0.000153,0.000116,0.000146,0.000107,0.000115,6.6e-05,0.000151,0.000163,0.000123,0.000156,0.000176,0.000127,5.2e-05,5.6e-05,7.4e-05,5.9e-05,6.5e-05,7.7e-05,0.000151,9.3e-05,0.000115,9.9e-05,1e-04,8.8e-05,9.3e-05,7.5e-05,0.000115,7.8e-05,9.3e-05,1.3e-05,0.000103,6.8e-05,0.000148,0.000128,0.000206,0.000141,2.4e-05,8.8e-05,5.1e-05,0.000133,0.00014,0.000139,0.000101,7.2e-05,0.000143,0.000157,7.1e-05,0.000216,0.000201,0.00013,6.7e-05,5.7e-05,0.00017,8.7e-05,5.1e-05,0.00012,0.000185,1e-04,2.9e-05,9.3e-05,7.6e-05,3.8e-05,5.3e-05,9.4e-05,2.6e-05,5.8e-05,3.6e-05,0.000123,7.6e-05,0.000117
5.7e-05,2.7e-05,3.4e-05,6.8e-05,6.6e-05,0.000154,0.000189,4.9e-05,0.000105,0.000246,0.000108,0.000141,0.000213,9.1e-05,1.3e-05,0.000143,4.9e-05,0.000141,0.000135,0.000248,0.000134,0.000172,0.000206,0.000219,0.000218,6.4e-05,7.7e-05,9.8e-05,6.3e-05,3.5e-05,0.000185,0.000164,6.4e-05,0.000158,0.000136,0.000116,9.9e-05,0.000103,6e-06,9e-05,3.5e-05,9.4e-05,0.000253,0.000217,8.4e-05,0.000217,0.000184,0.000102,9e-05,8e-05,0.000161,8.8e-05,9.8e-05,0.000206,0.000155,0.000213,7.7e-05,0.000184,0.000173,0.000304,0.000202,4.2e-05,0.00018,0.000158,9.1e-05,6.1e-05,9e-05,0.000122,0.000201,0.000251,0.00015,0.00013,7e-05,5.4e-05,0.000179,0.00016,8.1e-05,0.000185,0.000175,0.000164,0.000117,0.000115,0.000163,0.000261,0.000272,0.000201,0.000174,0.000142,2.8e-05,0.000119,0.000192,0.000167,8e-05,5.1e-05,8.2e-05,0.000133,6.2e-05,0.000236,0.000314,0.000257,0.000268,0.000124,2.8e-05,0.000157,0.000143,4e-05,0.00023,0.000182,0.000195,0.000259,0.000146,9.3e-05,0.00012,0.000104,0.000169,9.3e-05,0.000178,0.000104,0.000201,0.000241,0.000218
0.000141,4.9e-05,3.8e-05,6.6e-05,7e-05,0.000109,0.000118,7.8e-05,0.000197,0.000128,0.000196,0.000181,0.000186,2e-04,0.000138,0.000151,0.000104,0.000138,3.9e-05,8.5e-05,7e-05,7.1e-05,0.000122,7.4e-05,9.2e-05,0.000171,0.000122,0.000102,0.000136,7e-05,9e-05,7.1e-05,0.000126,9.8e-05,0.000143,0.000101,9e-05,0.000101,5.6e-05,0.000147,7.2e-05,0.000105,0.000145,6.3e-05,7.1e-05,0.000124,5.2e-05,0.000104,8.9e-05,2.3e-05,0.000125,5e-05,7.9e-05,0.000147,0.000115,0.00021,0.000146,0.000102,8.9e-05,0.000157,2.7e-05,7.2e-05,0.000149,2.9e-05,5.3e-05,4.1e-05,6.8e-05,0.000115,6.6e-05,0.000124,7.9e-05,2e-05,3.1e-05,7e-05,0.000127,0.000131,9.8e-05,1e-04,0.000169,9.3e-05,9e-05,0.000133,0.000114,4e-05,7.6e-05,6.3e-05,8.6e-05,0.000115,6e-05,0.000123,3.6e-05,7.8e-05,8e-05,4.5e-05,6.9e-05,5.8e-05,6.3e-05,0.000242,0.000157,0.00015,0.000101,0.000184,0.000131,0.000133,6.2e-05,3.8e-05,0.000206,7.1e-05,0.000101,0.000241,0.000131,0.000129,5.3e-05,8.2e-05,0.000279,0.000132,0.000281,0.000176,0.000314,0.000219,0.000119
5.1e-05,7.7e-05,8.9e-05,6.9e-05,7.3e-05,6.5e-05,0.000138,3.7e-05,0.00024,9e-06,0.000151,0.00017,0.000138,0.000145,3.6e-05,6.4e-05,1.5e-05,8.1e-05,0.000172,8.5e-05,8.7e-05,8.4e-05,0.000112,9.9e-05,0.000126,0.000232,0.000119,0.000119,0.000103,0.000113,0.00011,5.3e-05,0.000122,6e-05,5.2e-05,0.00021,4.2e-05,5.4e-05,3.6e-05,0.000186,0.000123,0.000131,8.4e-05,0.000109,9.7e-05,2.4e-05,3e-05,3.8e-05,0.00015,7.6e-05,0.000135,5.2e-05,0.00013,0.000158,0.000142,0.000145,8.7e-05,9.7e-05,6.8e-05,0.000126,0.000103,9.2e-05,4e-05,0.000119,0.00014,1.1e-05,7.8e-05,2.6e-05,3.7e-05,0.000104,5e-06,4.1e-05,0.000122,6.6e-05,7.2e-05,8.5e-05,5e-05,0.000139,0.000105,9.5e-05,4.1e-05,4e-05,5.4e-05,0.000114,6.5e-05,4e-05,5e-05,0.000207,0.000211,8.1e-05,8.5e-05,5.3e-05,5.9e-05,6.4e-05,0.000143,5.4e-05,0.000188,9.5e-05,0.000135,9.6e-05,4e-05,0.000161,0.000118,0.000178,0.000147,7.7e-05,0.000108,8.1e-05,7.8e-05,0.000141,9.6e-05,0.000119,0.000215,1.5e-05,0.000159,0.000166,0.000172,7.7e-05,0.000178,0.000116,4.8e-05
0.000181,6.6e-05,0.00012,0.000211,0.000258,0.000104,0.00018,0.000139,0.000189,0.000288,0.000232,0.000197,0.000279,0.000314,0.000295,0.000159,0.00016,7e-06,0.000212,0.000165,0.000171,0.000196,0.000304,0.000131,0.000167,0.00022,0.000204,0.000207,8.9e-05,0.000168,0.000157,0.000145,0.000213,0.000121,0.000175,0.000259,0.000243,0.000216,0.000167,0.000191,0.000294,0.00031,0.000241,0.000254,0.000139,8.4e-05,0.00012,7.3e-05,0.000201,0.000184,0.00013,9.3e-05,0.000211,0.000213,0.000115,0.000197,0.00014,0.000195,0.000115,9.5e-05,4e-05,0.00023,0.000211,0.000128,9.5e-05,0.000245,0.000145,1e-04,4.4e-05,6.4e-05,7.4e-05,0.000123,8.8e-05,0.000135,0.000224,8.8e-05,0.00011,0.000159,0.00019,0.000114,7.1e-05,0.000204,0.000256,0.000307,0.000108,0.000117,0.00015,0.000325,0.000135,0.000169,0.000132,3.4e-05,5.3e-05,0.000129,0.000201,0.000297,0.000221,0.000343,6.6e-05,0.000247,0.00019,0.000238,0.00017,0.000241,0.000144,8.9e-05,9.8e-05,0.000105,2e-04,7.3e-05,9e-05,0.000167,0.00013,0.000248,0.000106,0.000195,0.000113,0.000206,0.000231,0.000283,0.000174
0.000117,0.000178,0.000169,0.000249,0.000129,0.00013,0.000228,0.000173,0.000114,0.000357,0.00029,0.000315,0.000253,0.000229,0.00029,0.000271,0.000256,0.00027,0.000257,5.8e-05,6.3e-05,0.000145,0.000186,0.000301,9.4e-05,9e-05,9.9e-05,0.000182,0.000132,0.000197,0.000195,9.8e-05,0.000192,1e-04,0.000179,0.000188,0.000282,0.000103,0.000101,0.000328,0.000192,0.000202,8.7e-05,0.000209,6.8e-05,8.2e-05,0.000249,0.000219,0.000209,0.00022,2.2e-05,4.4e-05,0.00022,0.000149,0.000321,0.000164,6.7e-05,0.000235,0.000216,8.7e-05,0.000159,0.000178,8.7e-05,0.000181,9.9e-05,0.000272,0.000103,0.000109,0.000206,0.000172,7.7e-05,0.000117,0.000163,0.000188,0.000156,0.000147,0.000178,0.000277,0.00018,0.000135,0.000164,0.000329,0.000349,7.1e-05,0.000117,7e-05,6.3e-05,0.000231,0.000206,0.000263,0.000153,0.00019,0.000195,0.000139,0.00041,0.000351,0.000434,0.000264,0.000351,4e-05,0.00011,7.3e-05,0.00016,0.000293,0.000189,8.5e-05,0.000133,1.2e-05,0.000258,0.000298,0.000131,0.000151,0.00021,0.000274,6.8e-05,0.000149,0.000249,0.000256,0.000217,0.000202,0.000231
4.2e-05,0.000125,8.1e-05,0.00011,9.8e-05,7.8e-05,8.8e-05,2.5e-05,9.7e-05,0.000209,6.6e-05,6.4e-05,5.9e-05,0.000107,0.000171,0.000215,0.000207,4.5e-05,8.7e-05,0.000164,0.00016,1e-04,0.000277,9.6e-05,7.1e-05,8e-05,0.00012,0.000112,8.7e-05,0.000127,6e-05,0.000136,7.2e-05,6.2e-05,0.000145,7e-05,0.000212,9.5e-05,6.2e-05,0.000121,8.9e-05,0.000102,0.000106,7.5e-05,6.3e-05,0.000105,0.000272,0.000149,3.3e-05,0.000102,0.000188,0.000113,2e-04,7.7e-05,0.000253,0.000148,5.6e-05,0.000143,4.3e-05,0.000135,9.1e-05,9.2e-05,1.3e-05,0.000123,0.000115,0.000234,0.000198,0.00014,0.000147,2.2e-05,4.1e-05,9.8e-05,5.7e-05,1e-05,0.000125,0.000201,0.000199,0.000149,6.5e-05,8.9e-05,2e-06,0.000185,8.1e-05,7.1e-05,0.000104,0.000101,6e-05,0.000113,6.4e-05,0.000112,6.9e-05,0.00013,0.000105,0.00011,0.000278,7.5e-05,0.000194,0.000181,0.000139,0.000114,9.6e-05,0.000186,6e-05,0.000109,8e-05,0.000151,5.6e-05,7.2e-05,0.000154,8.8e-05,9.9e-05,2.1e-05,5.6e-05,0.000116,0.000145,6.2e-05,0.00012,0.000115,6.6e-05,9.7e-05,0.000163
7.9e-05,7.1e-05,5.6e-05,5.5e-05,3.4e-05,7.9e-05,4.5e-05,1.3e-05,8.3e-05,0.00016,8.8e-05,5.8e-05,4.1e-05,6.8e-05,0.000169,5.8e-05,6.8e-05,0.000105,8.8e-05,4.9e-05,4.6e-05,5e-05,1e-04,7.9e-05,7e-05,7.5e-05,0.000147,7.2e-05,7.5e-05,0.00011,4.4e-05,8.8e-05,0.000121,5.5e-05,0.00012,0.000116,7.2e-05,8.9e-05,9e-05,9.8e-05,0.000106,0.000121,6.8e-05,6.3e-05,2.5e-05,6.3e-05,0.00011,2.7e-05,1.3e-05,9.4e-05,0.000107,4.9e-05,5.4e-05,6.8e-05,9.5e-05,2e-06,0.00012,9.1e-05,9.7e-05,4.3e-05,7.9e-05,6.1e-05,2.5e-05,8e-05,8e-05,4.8e-05,5.1e-05,8.6e-05,0.000108,0.000129,4.8e-05,9.5e-05,0.000102,0.000126,0.000132,0.000165,0.000191,8.7e-05,2.1e-05,8e-05,0.00012,6e-05,9.7e-05,3.2e-05,7.9e-05,4.3e-05,4.2e-05,4.7e-05,9.3e-05,5.1e-05,4.7e-05,6.2e-05,6.6e-05,8.7e-05,0.000161,0.000177,4.6e-05,4e-05,7.1e-05,9.7e-05,4.2e-05,8e-05,0.00011,4.2e-05,0.000117,7.3e-05,1.5e-05,2.4e-05,6.2e-05,8.2e-05,4.1e-05,2.1e-05,5.1e-05,3.8e-05,3.9e-05,9.4e-05,4e-05,4.5e-05,6.6e-05,0.00013,6.8e-05
7.2e-05,4e-05,2.4e-05,2.7e-05,3.1e-05,5.1e-05,8.1e-05,3.8e-05,8.1e-05,2.2e-05,3.5e-05,2.2e-05,4.9e-05,2.2e-05,4.7e-05,6.7e-05,3.7e-05,3.1e-05,0.000104,0.000113,5.3e-05,1.1e-05,2.4e-05,8.7e-05,3.9e-05,6.9e-05,1e-05,7.7e-05,2.2e-05,2.9e-05,5.5e-05,5.5e-05,0.000104,5.6e-05,4.1e-05,5.7e-05,4.2e-05,5.6e-05,9.3e-05,5.6e-05,3.8e-05,6.1e-05,2.7e-05,2.8e-05,3.1e-05,5.7e-05,3.4e-05,3.4e-05,6.9e-05,7.7e-05,9e-05,6.2e-05,8.5e-05,4.8e-05,3.8e-05,8.6e-05,8e-05,3.6e-05,4e-05,3.6e-05,3e-05,0.000109,2.3e-05,5.9e-05,5.8e-05,4.7e-05,2.9e-05,9.1e-05,6.2e-05,2.7e-05,4e-05,6e-05,6.9e-05,9.3e-05,7e-05,5.4e-05,6.4e-05,1.8e-05,2.6e-05,4.6e-05,0.000106,0.000111,6.1e-05,6e-05,5.9e-05,1.3e-05,5.8e-05,3e-05,1.5e-05,4.9e-05,4e-05,1.9e-05,4.8e-05,4.8e-05,7e-05,7.6e-05,1.6e-05,2.7e-05,8.2e-05,9e-05,6.7e-05,6.8e-05,6.5e-05,2.3e-05,3.3e-05,5.4e-05,4.5e-05,1.3e-05,2.3e-05,1.3e-05,5.7e-05,4.4e-05,6.1e-05,4.5e-05,3.5e-05,9.2e-05,1e-05,8.6e-05,5.6e-05,8.6e-05,3.9e-05
8e-05,4.7e-05,1.8e-05,3.7e-05,5.1e-05,2.4e-05,4.9e-05,8.5e-05,1.9e-05,5.2e-05,3.7e-05,7.4e-05,8e-05,6.2e-05,6.4e-05,7.7e-05,2e-05,3.7e-05,7.1e-05,7.8e-05,5.9e-05,5.8e-05,4.4e-05,9.1e-05,9.5e-05,6e-05,2.9e-05,8.8e-05,5.6e-05,5.8e-05,4.9e-05,5.7e-05,8.9e-05,6.3e-05,3.5e-05,4.3e-05,6.2e-05,4.5e-05,8.8e-05,0.00012,4.9e-05,3.2e-05,6.9e-05,1.3e-05,3.8e-05,3.9e-05,6.3e-05,2.6e-05,7.3e-05,2.2e-05,5.1e-05,9.9e-05,3e-05,4.2e-05,1.5e-05,7.9e-05,0.000109,1.3e-05,5.7e-05,5.2e-05,4.2e-05,6.6e-05,6.2e-05,6.9e-05,8.5e-05,9.2e-05,7.2e-05,7.6e-05,6e-05,3.4e-05,1.5e-05,2.3e-05,3.4e-05,8.7e-05,4e-05,1.7e-05,3.8e-05,1e-05,9e-06,3.1e-05,4.2e-05,3.2e-05,8e-05,5.2e-05,4.3e-05,4.4e-05,5.8e-05,5.1e-05,8.7e-05,4e-05,4.3e-05,8.5e-05,3.4e-05,0.000109,7.2e-05,4.3e-05,1.3e-05,1.4e-05,7.3e-05,9.8e-05,4.6e-05,6.4e-05,6.2e-05,3e-05,8.1e-05,5.1e-05,3.9e-05,5.6e-05,3.2e-05,4.3e-05,8e-06,1.7e-05,6.1e-05,2.2e-05,4.1e-05,8.2e-05,0.00011,6.5e-05,3.1e-05,4.9e-05,2.2e-05
1e-05,1.4e-05,2.2e-05,2.9e-05,4.9e-05,6.7e-05,5.5e-05,5.2e-05,7.9e-05,3.6e-05,6.4e-05,0.000115,7.2e-05,2e-05,5.2e-05,5.7e-05,7e-05,6.5e-05,6e-05,2e-06,6.8e-05,3.1e-05,3.3e-05,5.9e-05,1e-05,2.1e-05,2.9e-05,4.6e-05,8.4e-05,5.2e-05,6.7e-05,2.4e-05,3.5e-05,1.9e-05,7.9e-05,1.4e-05,5.9e-05,1e-05,7.7e-05,8e-06,2.4e-05,7e-06,9.8e-05,4.6e-05,5.5e-05,5.1e-05,3.9e-05,4.3e-05,5.8e-05,3.2e-05,5e-05,4.4e-05,7.8e-05,7.2e-05,5.9e-05,8.1e-05,5.5e-05,4.3e-05,6.7e-05,3.6e-05,5.4e-05,6.1e-05,7.2e-05,2e-05,8.7e-05,3.3e-05,4.4e-05,5.2e-05,6.2e-05,3.5e-05,1.4e-05,4e-05,4.5e-05,4.8e-05,8e-06,3.4e-05,5.5e-05,2.4e-05,5.2e-05,4.1e-05,4.6e-05,2.3e-05,2.7e-05,2.9e-05,4.5e-05,1.4e-05,5e-05,9e-05,4.5e-05,0.000102,5.8e-05,8.4e-05,5e-05,0.000115,9e-05,0.000103,9.4e-05,4e-05,6.3e-05,5.7e-05,1.9e-05,8.9e-05,6e-05,4.5e-05,7e-05,5e-05,4.8e-05,2.1e-05,3.9e-05,4.6e-05,5.6e-05,2.2e-05,3.3e-05,2.3e-05,7.2e-05,1.1e-05,4.9e-05,8e-05,1.7e-05,5.5e-05,1.8e-05
3.7e-05,1.5e-05,2.1e-05,1.8e-05,2.4e-05,6.3e-05,8e-06,6.9e-05,4.6e-05,4.9e-05,5.4e-05,4.9e-05,4e-06,6e-06,4.4e-05,3.2e-05,6.7e-05,5.2e-05,5.3e-05,9e-06,4e-05,2.4e-05,5e-06,9e-06,2.8e-05,2.7e-05,2.8e-05,2.5e-05,4.6e-05,0.00011,5.8e-05,3.9e-05,4.9e-05,3.7e-05,3.5e-05,4e-05,2.3e-05,5e-05,7e-05,0.000114,7.6e-05,8.8e-05,4.8e-05,2.6e-05,3.3e-05,1.8e-05,3.8e-05,4.9e-05,1.4e-05,1.5e-05,4.6e-05,5.9e-05,6.9e-05,2e-05,1.4e-05,2.2e-05,4.1e-05,1.7e-05,4.9e-05,5.4e-05,5.1e-05,1.8e-05,2.1e-05,4.7e-05,4.6e-05,2.2e-05,2.2e-05,5.9e-05,4.1e-05,2.4e-05,1.4e-05,4e-05,5.8e-05,5.9e-05,2.6e-05,2.5e-05,2.8e-05,3.2e-05,4.6e-05,7.5e-05,4e-05,7e-06,6.4e-05,5e-05,4.6e-05,3.3e-05,6.7e-05,5.3e-05,5.6e-05,5.8e-05,5e-06,4.7e-05,7.2e-05,6.5e-05,4.6e-05,8.1e-05,3e-05,6.2e-05,6.1e-05,4.4e-05,2.6e-05,6.1e-05,3e-06,3.2e-05,2.2e-05,2.4e-05,4.3e-05,1.8e-05,9e-06,5.3e-05,4e-06,1.8e-05,6.6e-05,4.7e-05,7.8e-05,5.4e-05,5.9e-05,7e-06,7.4e-05,7.3e-05,4.4e-05
3.1e-05,1.6e-05,8e-06,1.6e-05,5e-06,2.9e-05,1.4e-05,5.1e-05,9e-05,4.8e-05,3.4e-05,3.1e-05,2.2e-05,1.7e-05,3.3e-05,4.1e-05,5.1e-05,4.1e-05,2.7e-05,1.3e-05,2.8e-05,2.7e-05,4e-05,9e-06,3.5e-05,3.6e-05,1.7e-05,1.5e-05,1.6e-05,0.000102,9e-05,6.2e-05,1.9e-05,3.3e-05,2.1e-05,6e-06,2.1e-05,7.5e-05,2.9e-05,8.2e-05,4.8e-05,2e-05,3.2e-05,2.1e-05,1.1e-05,3.9e-05,5.1e-05,4.6e-05,7.2e-05,4.3e-05,4.1e-05,6.2e-05,3.3e-05,3.3e-05,2.7e-05,8e-06,4.1e-05,3.7e-05,5.5e-05,2.5e-05,2e-06,4.4e-05,7.1e-05,4.3e-05,2.8e-05,5.4e-05,6.6e-05,4.7e-05,4.4e-05,2.1e-05,1.5e-05,1.6e-05,4.9e-05,2.4e-05,5.4e-05,3.8e-05,5e-05,3.2e-05,6.9e-05,1.1e-05,5.7e-05,4.6e-05,3.8e-05,4.1e-05,1.7e-05,2.6e-05,1.6e-05,5e-05,4.3e-05,3.7e-05,3.5e-05,3.2e-05,4.4e-05,2.7e-05,5.1e-05,2.8e-05,4.5e-05,8.9e-05,3.2e-05,7.8e-05,5.9e-05,5.7e-05,3.6e-05,2.8e-05,3.7e-05,1.5e-05,3.1e-05,6.5e-05,5.9e-05,1.3e-05,2.9e-05,2.8e-05,3.6e-05,1.8e-05,1.4e-05,2.8e-05,3.1e-05,2.9e-05,3.3e-05,5.8e-05,2.9e-05
2.3e-05,4e-06,7e-06,2.6e-05,7e-06,1.9e-05,1.4e-05,3.2e-05,9e-06,2.9e-05,6e-06,3.2e-05,4.9e-05,3.8e-05,2.1e-05,5.6e-05,2.9e-05,4.2e-05,1.3e-05,4e-06,4.7e-05,2.4e-05,5.5e-05,3.4e-05,2.6e-05,1.5e-05,7e-06,6e-06,3.1e-05,5.9e-05,2.2e-05,1.3e-05,4.5e-05,4.9e-05,4.4e-05,1e-05,3.2e-05,4.9e-05,6.2e-05,1.6e-05,2.5e-05,0,5.9e-05,4.9e-05,4.1e-05,3.6e-05,1.8e-05,4.1e-05,1.8e-05,1.9e-05,3.1e-05,4.2e-05,6.6e-05,3.1e-05,1.4e-05,3.5e-05,5e-05,3.6e-05,2e-05,1.4e-05,1e-05,5e-05,4.1e-05,1.8e-05,3e-05,6.1e-05,5.8e-05,6.5e-05,1.4e-05,5e-06,1.2e-05,3.7e-05,2.2e-05,2.6e-05,5.7e-05,1.3e-05,1.8e-05,2e-05,3.1e-05,2.8e-05,2.9e-05,2.3e-05,2.4e-05,1.2e-05,1.3e-05,3.1e-05,4.9e-05,4.9e-05,3e-06,4.4e-05,1.2e-05,5.1e-05,1.6e-05,4.5e-05,7e-06,3.7e-05,3.4e-05,4.7e-05,1.4e-05,0.000106,8e-05,4e-05,4e-05,1.8e-05,2.9e-05,3.4e-05,3e-05,5.2e-05,1.4e-05,1.7e-05,3.2e-05,2.3e-05,3e-05,1.6e-05,3.9e-05,1.7e-05,2.1e-05,2.7e-05,3.1e-05,3.9e-05,1.7e-05
1e-05,4e-06,1e-05,1e-05,1.1e-05,2.5e-05,6e-06,1.8e-05,1.7e-05,2.5e-05,1.7e-05,8e-06,1.1e-05,1.7e-05,1.1e-05,1.8e-05,2.2e-05,1.4e-05,4e-06,1.3e-05,1.9e-05,9e-06,1.9e-05,1.3e-05,1e-06,1.3e-05,6e-06,1e-05,2e-05,2.1e-05,5e-06,1.3e-05,2.4e-05,2.1e-05,1.7e-05,2.3e-05,1.5e-05,1.1e-05,1.6e-05,1e-05,2.7e-05,4e-06,1.5e-05,5e-06,1.4e-05,3.1e-05,2.4e-05,1.6e-05,1e-05,1.2e-05,1.8e-05,5e-06,4e-06,1.6e-05,4e-06,1.7e-05,1.4e-05,7e-06,1.5e-05,6e-06,1.5e-05,2.5e-05,3.9e-05,2.4e-05,1.2e-05,1.9e-05,1e-05,1.2e-05,2.1e-05,1.3e-05,6e-06,1.8e-05,2.1e-05,2.8e-05,1.4e-05,1.6e-05,1e-05,1.1e-05,1.4e-05,1.8e-05,2.9e-05,1.1e-05,1.5e-05,4e-06,7e-06,7e-06,1.6e-05,6e-06,1e-05,2.7e-05,1.8e-05,1.5e-05,1.8e-05,8e-06,1.7e-05,2.6e-05,1.7e-05,5e-06,2.1e-05,3.7e-05,8e-06,1.5e-05,1.9e-05,4e-06,3e-06,1.5e-05,8e-06,2e-06,1.9e-05,1.4e-05,2e-06,2e-06,1.9e-05,9e-06,1.5e-05,1.8e-05,1.9e-05,5e-06,9e-06,1.9e-05,1.4e-05
1.8e-05,5e-06,1.2e-05,1.3e-05,1.3e-05,1.5e-05,4e-06,1.5e-05,1e-05,1.8e-05,8e-06,1.2e-05,1.2e-05,1.2e-05,1.4e-05,3.1e-05,1.2e-05,9e-06,1.5e-05,9e-06,8e-06,5e-06,1.1e-05,1.8e-05,4e-06,9e-06,2.8e-05,1.1e-05,9e-06,2.3e-05,7e-06,1e-05,1.9e-05,1e-05,2.7e-05,1.9e-05,1.8e-05,3.7e-05,2.4e-05,1e-05,2.9e-05,1.8e-05,1.1e-05,1.7e-05,1e-06,2.4e-05,1.7e-05,1.9e-05,9e-06,1.9e-05,2.1e-05,1.3e-05,5e-06,1.5e-05,2.1e-05,2e-06,1.8e-05,1e-06,7e-06,1.6e-05,1.4e-05,3.7e-05,7e-06,6e-06,9e-06,2e-05,2e-06,1.8e-05,1.9e-05,7e-06,1.4e-05,1.5e-05,1.8e-05,2.2e-05,2.5e-05,1e-05,1.4e-05,1.1e-05,1.4e-05,1.6e-05,2e-05,2.3e-05,1.6e-05,3e-06,1.3e-05,1.4e-05,7e-06,3e-06,2.5e-05,1.2e-05,8e-06,2.3e-05,1.7e-05,1.7e-05,7e-06,2.8e-05,3.5e-05,2.9e-05,2.4e-05,7e-06,1.1e-05,2e-06,3.1e-05,1.2e-05,1.9e-05,7e-06,5e-06,6e-06,2.1e-05,2e-05,1.1e-05,7e-06,2.5e-05,5e-06,8e-06,2.3e-05,4e-06,1.3e-05,8e-06,1.6e-05,1.2e-05
4e-06,1.5e-05,2.2e-05,2e-05,1.2e-05,2.1e-05,2.8e-05,2.4e-05,2.2e-05,7e-06,1.7e-05,5e-06,1.9e-05,9e-06,6e-06,1.2e-05,1.2e-05,6e-06,1.1e-05,1.8e-05,2.4e-05,7e-06,1.3e-05,2.3e-05,1.9e-05,2e-05,1.9e-05,1.3e-05,5e-06,3.3e-05,2.2e-05,3.3e-05,3.1e-05,1.2e-05,1.7e-05,1.4e-05,1e-05,2.7e-05,1.3e-05,9e-06,3.5e-05,2.2e-05,2.3e-05,2.1e-05,1.9e-05,8e-06,3e-05,2.6e-05,2.4e-05,2.1e-05,4.8e-05,1.6e-05,2e-05,1.9e-05,6e-06,1.5e-05,3.5e-05,2.2e-05,1.9e-05,1.5e-05,1.8e-05,2.8e-05,4e-05,2.5e-05,9e-06,2.1e-05,3e-06,9e-06,1.5e-05,1.3e-05,1.7e-05,1.4e-05,1.2e-05,2.2e-05,2.4e-05,2.8e-05,2.5e-05,4e-05,1.6e-05,1.3e-05,2.3e-05,1e-05,8e-06,1.4e-05,6e-06,1.2e-05,1.4e-05,1.1e-05,2.8e-05,1.2e-05,5e-06,3.2e-05,3.5e-05,2.9e-05,2.6e-05,5.3e-05,2.5e-05,2.5e-05,2.6e-05,1.3e-05,1.4e-05,1e-05,1.1e-05,2e-05,3e-06,1e-05,9e-06,2e-06,2.9e-05,9e-06,8e-06,1.4e-05,1.7e-05,2.6e-05,1.6e-05,1.8e-05,1e-05,1.4e-05,1.8e-05,9e-06,2.2e-05
3.3e-05,1.4e-05,1.8e-05,1.1e-05,5e-06,1.2e-05,3.1e-05,1.5e-05,1.5e-05,1.1e-05,2.3e-05,1.8e-05,1.7e-05,2.6e-05,9e-06,9e-06,1.6e-05,2.9e-05,1.9e-05,2.4e-05,3e-05,2.5e-05,2.1e-05,3.8e-05,2.4e-05,1.6e-05,2.6e-05,3.5e-05,2.7e-05,3.6e-05,2.4e-05,3.7e-05,1.6e-05,3.9e-05,4.1e-05,1.2e-05,1.3e-05,7e-06,8e-06,1.9e-05,9e-06,2.4e-05,3.3e-05,9e-06,6e-06,2.6e-05,3.6e-05,4.2e-05,9e-06,1.1e-05,1.8e-05,3.1e-05,8e-06,6e-06,2.9e-05,1.4e-05,2.1e-05,1.7e-05,1.5e-05,9e-06,1.5e-05,5e-06,1.4e-05,2.9e-05,1.7e-05,2.6e-05,2.2e-05,9e-06,1.5e-05,1.2e-05,6e-06,1.7e-05,2.1e-05,1.6e-05,2.2e-05,6e-06,2.3e-05,1.5e-05,2.3e-05,1.4e-05,1.3e-05,1e-05,2e-05,2.5e-05,2.1e-05,2e-05,2.6e-05,9e-06,1.5e-05,2.2e-05,1e-05,4e-05,3.3e-05,2.2e-05,4e-05,4.9e-05,3.3e-05,3.4e-05,1.9e-05,6e-06,1.3e-05,1.1e-05,1.7e-05,1.4e-05,8e-06,5e-06,1e-05,1.4e-05,2.4e-05,2.9e-05,1e-05,2.1e-05,2.7e-05,2.2e-05,2.3e-05,1.7e-05,1.3e-05,3.2e-05,2e-06,1.4e-05,1.4e-05
4.8e-05,5.4e-05,1.6e-05,1.2e-05,1.2e-05,1.7e-05,3.7e-05,2.4e-05,2.2e-05,2.4e-05,7e-06,1.9e-05,3.3e-05,3.1e-05,2.7e-05,7e-06,1.6e-05,2.3e-05,3.4e-05,1.9e-05,2.4e-05,1.1e-05,1.8e-05,1.6e-05,2.3e-05,1.8e-05,1.8e-05,3.6e-05,5e-06,4.2e-05,3e-05,1.2e-05,3.1e-05,5.1e-05,1.3e-05,1.8e-05,6e-06,1.5e-05,1.5e-05,3.2e-05,2.8e-05,2.8e-05,1.6e-05,2.7e-05,1.4e-05,3.5e-05,1.9e-05,2.1e-05,4.1e-05,1.4e-05,1.7e-05,1.9e-05,1e-05,1.3e-05,2.7e-05,2.5e-05,2.5e-05,7e-06,9e-06,2.6e-05,1.6e-05,6e-06,1.1e-05,1.6e-05,1.8e-05,2.3e-05,2.1e-05,2e-05,8e-06,1.8e-05,1.7e-05,5e-06,2.8e-05,3.6e-05,2.3e-05,3e-05,1.3e-05,2.4e-05,1.4e-05,1.6e-05,2.6e-05,1.4e-05,1e-05,2.5e-05,3e-05,1.9e-05,2.3e-05,5e-06,3e-05,3e-05,2.1e-05,4.5e-05,2.3e-05,2.6e-05,2.5e-05,3e-05,2.8e-05,1.4e-05,4.6e-05,3.3e-05,1.8e-05,3.1e-05,3.8e-05,1.3e-05,3.1e-05,1.6e-05,4e-06,2.1e-05,2.3e-05,3.1e-05,3.9e-05,1.2e-05,2.7e-05,2.1e-05,1.4e-05,1.4e-05,1.2e-05,2.9e-05,1.6e-05,1.6e-05,1.2e-05
2.3e-05,3.6e-05,3.3e-05,9e-06,1.5e-05,2.5e-05,4e-06,6e-06,5e-06,2.1e-05,3.3e-05,1.4e-05,1.7e-05,1.2e-05,2.6e-05,2.2e-05,1.7e-05,2.7e-05,3.1e-05,2e-05,4e-05,3.2e-05,1.7e-05,2.6e-05,4e-06,7e-06,2e-05,2.1e-05,3e-05,5.1e-05,1.3e-05,1e-05,1.6e-05,9e-06,1.1e-05,1.7e-05,2.6e-05,1.9e-05,2.4e-05,2.9e-05,7e-06,9e-06,2.7e-05,3.3e-05,2.3e-05,2.8e-05,9e-06,2.1e-05,4.1e-05,3.6e-05,4.8e-05,1.4e-05,1.7e-05,1e-05,1.2e-05,2.1e-05,2.3e-05,3.8e-05,2e-05,1.5e-05,1.7e-05,2.1e-05,2.5e-05,1.2e-05,2.4e-05,2.8e-05,2.9e-05,1.3e-05,4e-06,1.8e-05,7e-06,1.2e-05,1.7e-05,9e-06,4.3e-05,1.3e-05,2.3e-05,1.8e-05,3e-05,3.8e-05,2.1e-05,2.6e-05,2.7e-05,6e-06,1.3e-05,2e-06,4e-06,7e-06,3.7e-05,2.6e-05,8e-06,1.8e-05,1.8e-05,4.1e-05,6.3e-05,5.3e-05,4.4e-05,2.8e-05,4.2e-05,2.4e-05,2.2e-05,3e-06,9e-06,2.1e-05,3.2e-05,1.9e-05,1e-05,2.2e-05,1.2e-05,8e-06,2.1e-05,2e-05,1.1e-05,2e-05,1.4e-05,1e-05,5e-06,1.6e-05,1.3e-05,3e-06,3.1e-05
1.8e-05,1.7e-05,1.7e-05,3.3e-05,3.2e-05,6e-06,1.8e-05,1.2e-05,1.4e-05,2.1e-05,2e-05,1.3e-05,1.1e-05,2e-05,1.7e-05,8e-06,1.3e-05,2.6e-05,3e-05,3.4e-05,1.9e-05,1.6e-05,1.3e-05,2.1e-05,1.2e-05,8e-06,9e-06,2.2e-05,2e-05,2.8e-05,2.6e-05,6e-06,6e-06,2e-06,4e-06,2.1e-05,3e-06,9e-06,2.2e-05,7e-06,1.6e-05,1e-06,1.5e-05,8e-06,1.5e-05,1.8e-05,2.2e-05,1.3e-05,1.2e-05,1.4e-05,1.7e-05,2.4e-05,3.4e-05,2.8e-05,2.6e-05,1.5e-05,8e-06,3.8e-05,3.2e-05,1.4e-05,1.1e-05,9e-06,1.6e-05,1.4e-05,3.1e-05,3.3e-05,2e-06,1.3e-05,1.2e-05,6e-06,1.5e-05,2.2e-05,1.8e-05,2e-05,3.6e-05,3e-05,2.5e-05,4e-06,2.3e-05,2.2e-05,3.3e-05,3.9e-05,3e-06,3e-06,1.2e-05,1.6e-05,2.5e-05,2.4e-05,1.7e-05,1.9e-05,8e-06,3e-06,1e-05,1.6e-05,9e-06,1.6e-05,2.1e-05,1.3e-05,2.8e-05,1.6e-05,1.5e-05,8e-06,1.8e-05,1.9e-05,1.3e-05,7e-06,1.8e-05,2.4e-05,1.4e-05,8e-06,1.2e-05,1e-06,9e-06,1e-05,1.2e-05,9e-06,1.2e-05,1.1e-05,1.4e-05,2.1e-05,2.3e-05
1.3e-05,1.4e-05,1.6e-05,3.5e-05,6e-06,1.1e-05,1.3e-05,1.4e-05,1.9e-05,3e-06,1.6e-05,4e-06,9e-06,1.1e-05,4e-06,1.7e-05,4e-06,1.3e-05,3.2e-05,6e-06,1.3e-05,1.9e-05,1.5e-05,1.6e-05,1e-06,1e-05,1.4e-05,1.8e-05,1.4e-05,2.2e-05,1.1e-05,1.6e-05,1.1e-05,6e-06,8e-06,1.7e-05,1.1e-05,6e-06,4e-06,7e-06,5e-06,9e-06,1.6e-05,1.1e-05,1.4e-05,4e-06,1.3e-05,2.1e-05,1.5e-05,1e-05,1e-05,2.3e-05,1.2e-05,1.6e-05,1.1e-05,2.7e-05,3.1e-05,1.4e-05,1.8e-05,2.6e-05,2.1e-05,2.1e-05,9e-06,8e-06,3.3e-05,1.2e-05,1.4e-05,2e-06,1.1e-05,1.1e-05,1.3e-05,1.8e-05,8e-06,1.6e-05,7e-06,7e-06,5e-06,1.2e-05,3.2e-05,1.6e-05,9e-06,1.9e-05,1.3e-05,4e-06,8e-06,1.3e-05,2e-05,1.8e-05,1.7e-05,1e-05,1.5e-05,1.6e-05,6e-06,3e-06,2.3e-05,7e-06,1.2e-05,1.1e-05,1e-06,1.4e-05,1.1e-05,7e-06,2e-05,1e-05,2.1e-05,1.3e-05,2.2e-05,3e-06,4e-06,5e-06,8e-06,5e-06,7e-06,4e-06,6e-06,9e-06,1.2e-05,2.1e-05,4e-06,1.3e-05,1.7e-05
7e-06,6e-06,2e-05,1.6e-05,1.9e-05,7e-06,8e-06,7e-06,2.4e-05,1.7e-05,1.3e-05,8e-06,3e-06,1e-05,1e-05,1.7e-05,7e-06,4e-06,2.3e-05,1.6e-05,1.3e-05,2.1e-05,1.1e-05,1e-05,1.9e-05,2.2e-05,7e-06,7e-06,1.8e-05,5e-06,7e-06,4e-06,6e-06,8e-06,1.1e-05,8e-06,1.2e-05,1.8e-05,2.4e-05,1.2e-05,9e-06,8e-06,1.8e-05,8e-06,8e-06,1.3e-05,3e-06,2.1e-05,6e-06,9e-06,1e-06,1.5e-05,2.1e-05,2.4e-05,1.9e-05,2e-05,4e-06,1.9e-05,6e-06,2.4e-05,1.2e-05,2.7e-05,1.6e-05,1.1e-05,2.6e-05,2.4e-05,1.1e-05,8e-06,1.1e-05,1.3e-05,7e-06,1.2e-05,9e-06,4e-06,8e-06,1.7e-05,1.2e-05,1e-05,2.3e-05,1e-05,1.2e-05,1.3e-05,8e-06,3e-06,9e-06,5e-06,2.1e-05,1.7e-05,6e-06,9e-06,1.2e-05,7e-06,1.1e-05,1.2e-05,3.2e-05,1.7e-05,1.4e-05,1.4e-05,1.8e-05,2.3e-05,2.6e-05,7e-06,7e-06,1.1e-05,1.3e-05,1.4e-05,5e-06,6e-06,8e-06,7e-06,1.1e-05,3e-06,1.3e-05,3e-06,5e-06,1.8e-05,1.3e-05,1.7e-05,1.7e-05,7e-06,1e-05
1.5e-05,5e-06,1.1e-05,2.5e-05,8e-06,1.3e-05,1.6e-05,1.7e-05,2.9e-05,1.3e-05,8e-06,5e-06,8e-06,1.5e-05,1.8e-05,4e-06,5e-06,2e-06,9e-06,1e-05,2e-06,2.2e-05,5e-06,1.4e-05,2.7e-05,2.8e-05,1.5e-05,1e-05,2.1e-05,1.4e-05,1.5e-05,5e-06,1.2e-05,1e-06,9e-06,3e-06,1.5e-05,1e-05,2.7e-05,1.8e-05,1.2e-05,1.2e-05,1e-06,3e-06,7e-06,1.1e-05,1.2e-05,1e-05,2.1e-05,1.1e-05,8e-06,6e-06,1.9e-05,3e-05,1.1e-05,1.4e-05,6e-06,1.1e-05,1e-06,2.5e-05,1.8e-05,2.6e-05,8e-06,1.4e-05,1.3e-05,9e-06,1.5e-05,0,1.1e-05,1e-05,1.3e-05,4e-06,7e-06,6e-06,1.5e-05,9e-06,1e-05,1e-06,1.4e-05,1.6e-05,4e-06,7e-06,1.7e-05,7e-06,4e-06,6e-06,6e-06,1.2e-05,1.4e-05,7e-06,9e-06,1.3e-05,2.9e-05,1.6e-05,1.5e-05,8e-06,2.5e-05,3.1e-05,1.5e-05,2.6e-05,1.7e-05,2.4e-05,1.4e-05,2e-06,9e-06,1.2e-05,9e-06,9e-06,1.7e-05,1.2e-05,2e-06,1e-05,1.4e-05,6e-06,3e-06,1.3e-05,1.1e-05,9e-06,1.1e-05,1.1e-05,9e-06
8e-06,4e-06,5e-06,1.2e-05,1.4e-05,2.4e-05,8e-06,1.3e-05,1.3e-05,1.9e-05,8e-06,5e-06,1.7e-05,2.5e-05,5e-06,6e-06,3e-06,8e-06,2.3e-05,1.8e-05,2.2e-05,1.2e-05,1.8e-05,1e-06,1.8e-05,2e-06,2e-06,1.2e-05,2.3e-05,1.4e-05,7e-06,2e-06,1e-05,1.1e-05,8e-06,1.3e-05,1.6e-05,1.4e-05,5e-06,1e-06,8e-06,1.4e-05,9e-06,5e-06,9e-06,1.2e-05,1.2e-05,1e-05,1.8e-05,1.9e-05,5e-06,7e-06,1.4e-05,1.8e-05,1.8e-05,6e-06,5e-06,7e-06,6e-06,1.6e-05,1.5e-05,6e-06,7e-06,1e-05,2.3e-05,1.4e-05,1.7e-05,2.3e-05,1.4e-05,1.7e-05,3e-06,9e-06,1.4e-05,9e-06,2.2e-05,1.6e-05,5e-06,4e-06,5e-06,6e-06,6e-06,1.7e-05,1e-05,3e-06,4e-06,1e-05,1.9e-05,7e-06,7e-06,5e-06,4e-06,1.6e-05,9e-06,3e-06,5e-06,9e-06,1.9e-05,1.4e-05,7e-06,3.2e-05,1.9e-05,2.9e-05,2.4e-05,1.6e-05,1e-05,1.2e-05,1.3e-05,4e-06,1.3e-05,7e-06,1e-06,7e-06,9e-06,2e-06,9e-06,8e-06,1.9e-05,1e-05,8e-06,1.2e-05,9e-06
1.9e-05,9e-06,6e-06,5e-06,6e-06,2.7e-05,2.5e-05,8e-06,1.8e-05,1.4e-05,1.8e-05,1e-05,1.8e-05,9e-06,5e-06,1.2e-05,5e-06,1.5e-05,7e-06,7e-06,1.9e-05,8e-06,1.7e-05,1.9e-05,2e-06,6e-06,5e-06,1.5e-05,1.3e-05,1.5e-05,2.1e-05,1.4e-05,1.4e-05,6e-06,3e-06,1.1e-05,4e-06,8e-06,6e-06,3e-06,9e-06,1.8e-05,1.3e-05,5e-06,6e-06,2.2e-05,3e-05,2e-05,5e-06,8e-06,9e-06,1e-05,4e-06,1e-05,4e-06,1.2e-05,8e-06,3e-06,7e-06,8e-06,7e-06,1.6e-05,1.2e-05,1.4e-05,1.3e-05,7e-06,6e-06,1.5e-05,7e-06,1.1e-05,1.1e-05,7e-06,2e-06,1e-05,1.7e-05,1.4e-05,1e-05,6e-06,5e-06,3e-06,2.1e-05,6e-06,1.6e-05,5e-06,9e-06,4e-06,1.7e-05,1e-05,4e-06,4e-06,3e-06,1.4e-05,1.4e-05,8e-06,1.2e-05,1.2e-05,1.2e-05,7e-06,1.7e-05,1.4e-05,1.7e-05,3e-06,1.8e-05,8e-06,9e-06,8e-06,3e-06,4e-06,1.2e-05,1e-05,1.2e-05,1e-05,1.1e-05,1.2e-05,1.4e-05,2e-06,8e-06,1.3e-05,8e-06,2.8e-05,9e-06
2.1e-05,1.1e-05,1e-05,9e-06,4e-06,2e-05,6e-06,1.5e-05,4e-06,2e-06,1.1e-05,1.7e-05,1.7e-05,1.5e-05,5e-06,1e-05,6e-06,1.6e-05,1.8e-05,1.1e-05,1.2e-05,3e-06,1.4e-05,4e-06,1.1e-05,1.4e-05,4e-06,1.2e-05,5e-06,4e-06,1.5e-05,8e-06,1.2e-05,4e-06,4e-06,4e-06,7e-06,1.3e-05,6e-06,6e-06,9e-06,8e-06,9e-06,8e-06,1e-06,1.7e-05,9e-06,2e-06,7e-06,1.1e-05,6e-06,9e-06,3e-06,8e-06,7e-06,9e-06,1e-05,7e-06,3e-06,3e-06,1.2e-05,1.7e-05,1.3e-05,1.1e-05,1e-05,5e-06,7e-06,1.1e-05,1e-06,7e-06,1e-05,1e-05,6e-06,1.4e-05,1.2e-05,2.2e-05,1e-05,1.5e-05,1.6e-05,1.2e-05,1.1e-05,1.2e-05,2.2e-05,6e-06,1e-05,1e-05,6e-06,6e-06,1e-05,5e-06,1.1e-05,1.4e-05,8e-06,3e-06,1.4e-05,3e-06,1.5e-05,1.6e-05,2.2e-05,2.3e-05,4e-06,1.4e-05,2e-05,1.6e-05,1e-05,5e-06,1e-06,6e-06,4e-06,6e-06,1e-05,4e-06,1.1e-05,1.6e-05,4e-06,8e-06,1e-05,1.6e-05,3e-06,1.9e-05,1.2e-05
5e-06,7e-06,7e-06,9e-06,1.3e-05,6e-06,1.1e-05,9e-06,2.5e-05,1.6e-05,1e-05,6e-06,4e-06,1.2e-05,1.4e-05,7e-06,2e-06,6e-06,2.8e-05,1.7e-05,1.3e-05,4e-06,1e-05,9e-06,6e-06,1.1e-05,7e-06,9e-06,1.2e-05,7e-06,1.7e-05,4e-06,9e-06,9e-06,8e-06,7e-06,3e-06,1e-05,6e-06,1.1e-05,1.4e-05,1e-05,1.4e-05,7e-06,6e-06,1e-05,1.2e-05,5e-06,7e-06,2e-06,1.7e-05,8e-06,6e-06,3e-06,3e-06,5e-06,8e-06,6e-06,1e-05,9e-06,1.7e-05,8e-06,8e-06,8e-06,1.2e-05,1.5e-05,1.9e-05,1.7e-05,6e-06,1e-05,1.1e-05,1.4e-05,9e-06,1e-05,9e-06,1e-05,3e-06,1.6e-05,1.7e-05,8e-06,6e-06,3e-06,4e-06,1.2e-05,1.4e-05,1e-05,5e-06,8e-06,1.2e-05,1.2e-05,1e-05,1e-06,1e-05,1.2e-05,1.8e-05,8e-06,1.2e-05,1.5e-05,2.1e-05,8e-06,8e-06,1.5e-05,8e-06,9e-06,3e-06,2e-06,5e-06,4e-06,1e-06,3e-06,6e-06,7e-06,5e-06,1.2e-05,1e-05,5e-06,3e-06,8e-06,3e-06,1e-06,7e-06
8e-06,5e-06,1.1e-05,6e-06,5e-06,4e-06,9e-06,1e-05,2.3e-05,1.1e-05,6e-06,1e-05,1.2e-05,1.5e-05,2e-05,1.3e-05,1.3e-05,8e-06,1.5e-05,5e-06,1.1e-05,1.1e-05,2e-06,1.5e-05,9e-06,1.2e-05,7e-06,9e-06,1.4e-05,1.1e-05,1e-05,1.1e-05,1.4e-05,1.1e-05,7e-06,1.1e-05,1.1e-05,8e-06,4e-06,7e-06,1.7e-05,1e-05,1.3e-05,8e-06,7e-06,6e-06,7e-06,5e-06,2e-06,4e-06,1.6e-05,2.2e-05,1.5e-05,1.2e-05,8e-06,1.5e-05,9e-06,7e-06,4e-06,6e-06,1.1e-05,1.2e-05,2e-05,7e-06,1.1e-05,1.6e-05,3e-06,1e-05,7e-06,8e-06,2e-06,9e-06,1.1e-05,3e-06,2e-06,1e-06,5e-06,1.1e-05,8e-06,1.2e-05,9e-06,7e-06,1.5e-05,2e-06,1e-05,7e-06,1.2e-05,1.2e-05,5e-06,1.6e-05,1.6e-05,6e-06,7e-06,7e-06,1.4e-05,2e-06,1.3e-05,1.8e-05,4e-06,9e-06,9e-06,9e-06,1.7e-05,7e-06,9e-06,9e-06,1.2e-05,7e-06,5e-06,9e-06,4e-06,3e-06,1.3e-05,1e-06,1e-06,3e-06,1e-06,1.2e-05,6e-06,1.5e-05,1.1e-05
4e-06,3e-06,6e-06,4e-06,1e-06,3e-06,4e-06,1.2e-05,2e-06,1e-06,1e-06,1.4e-05,4e-06,1.1e-05,1.2e-05,4e-06,1.1e-05,9e-06,6e-06,3e-06,1.9e-05,6e-06,3e-06,9e-06,4e-06,5e-06,4e-06,4e-06,9e-06,1.2e-05,1.2e-05,1.1e-05,7e-06,1.3e-05,4e-06,3e-06,6e-06,5e-06,1e-06,7e-06,9e-06,7e-06,6e-06,2e-06,7e-06,9e-06,7e-06,3e-06,4e-06,6e-06,7e-06,1.2e-05,1.3e-05,3e-06,3e-06,1.6e-05,1.7e-05,8e-06,2e-06,5e-06,8e-06,2e-06,7e-06,3e-06,8e-06,1.1e-05,1.8e-05,6e-06,4e-06,5e-06,3e-06,2e-06,1e-06,4e-06,4e-06,5e-06,1e-06,1e-06,2e-06,8e-06,8e-06,7e-06,7e-06,6e-06,1.3e-05,2e-06,6e-06,5e-06,4e-06,1.7e-05,1.7e-05,1e-05,1.1e-05,5e-06,1.2e-05,9e-06,2e-05,1.2e-05,1.3e-05,7e-06,2e-06,4e-06,9e-06,5e-06,4e-06,6e-06,6e-06,6e-06,8e-06,9e-06,5e-06,4e-06,1e-05,8e-06,1.1e-05,1.3e-05,1.5e-05,1.9e-05,1.3e-05,1.6e-05,5e-06
3e-06,3e-06,4e-06,3e-06,7e-06,6e-06,3e-06,5e-06,4e-06,3e-06,3e-06,1.1e-05,6e-06,1.1e-05,4e-06,5e-06,4e-06,1e-06,1.5e-05,6e-06,1.2e-05,9e-06,8e-06,7e-06,5e-06,1e-06,5e-06,7e-06,7e-06,3e-06,5e-06,3e-06,1e-05,1e-05,2e-06,3e-06,9e-06,5e-06,5e-06,5e-06,2e-06,5e-06,3e-06,6e-06,5e-06,1e-05,5e-06,3e-06,9e-06,7e-06,9e-06,7e-06,6e-06,9e-06,4e-06,5e-06,4e-06,2e-06,4e-06,6e-06,7e-06,3e-06,2e-06,3e-06,8e-06,4e-06,8e-06,2e-06,7e-06,3e-06,6e-06,1e-05,8e-06,6e-06,2e-06,8e-06,3e-06,5e-06,6e-06,4e-06,2e-06,6e-06,9e-06,4e-06,6e-06,6e-06,7e-06,4e-06,3e-06,1e-05,2e-06,5e-06,1e-06,5e-06,1.1e-05,1.2e-05,1.2e-05,1e-05,9e-06,8e-06,4e-06,3e-06,1e-05,1e-06,5e-06,2e-06,1e-06,6e-06,3e-06,5e-06,3e-06,2e-06,5e-06,6e-06,8e-06,8e-06,7e-06,6e-06,5e-06,1.3e-05,5e-06
4e-06,0,3e-06,1e-06,6e-06,5e-06,1e-06,2e-06,3e-06,4e-06,3e-06,7e-06,2e-06,1.3e-05,2e-06,6e-06,3e-06,3e-06,1.1e-05,2e-06,1e-05,6e-06,7e-06,1e-06,4e-06,3e-06,3e-06,5e-06,3e-06,3e-06,8e-06,1e-06,8e-06,8e-06,1e-06,3e-06,9e-06,7e-06,2e-06,4e-06,0,2e-06,3e-06,4e-06,2e-06,5e-06,2e-06,2e-06,6e-06,1e-06,6e-06,6e-06,2e-06,7e-06,2e-06,3e-06,1e-06,2e-06,2e-06,4e-06,5e-06,1e-06,7e-06,1e-06,8e-06,1e-06,2e-06,5e-06,6e-06,2e-06,4e-06,8e-06,3e-06,3e-06,3e-06,4e-06,2e-06,5e-06,4e-06,7e-06,2e-06,4e-06,8e-06,2e-06,2e-06,2e-06,7e-06,3e-06,1e-06,7e-06,7e-06,2e-06,2e-06,2e-06,1.1e-05,7e-06,1e-05,1e-05,5e-06,6e-06,2e-06,3e-06,9e-06,1e-06,6e-06,1e-06,1e-06,3e-06,6e-06,4e-06,4e-06,3e-06,7e-06,2e-06,6e-06,6e-06,2e-06,8e-06,1e-06,1.2e-05,4e-06
2e-06,1e-06,4e-06,2e-06,5e-06,6e-06,1e-06,1e-06,1e-06,3e-06,1e-06,5e-06,0,1e-05,1e-06,4e-06,2e-06,4e-06,9e-06,2e-06,1e-05,7e-06,4e-06,5e-06,5e-06,1e-06,3e-06,3e-06,2e-06,3e-06,7e-06,1e-06,7e-06,7e-06,1e-06,3e-06,7e-06,6e-06,3e-06,3e-06,2e-06,5e-06,1e-06,1e-06,0,2e-06,2e-06,3e-06,4e-06,1e-06,5e-06,5e-06,2e-06,6e-06,1e-06,2e-06,1e-06,2e-06,2e-06,4e-06,4e-06,2e-06,6e-06,1e-06,8e-06,1e-06,4e-06,6e-06,4e-06,1e-06,4e-06,8e-06,5e-06,4e-06,3e-06,4e-06,2e-06,4e-06,4e-06,7e-06,3e-06,4e-06,8e-06,2e-06,3e-06,2e-06,7e-06,4e-06,1e-06,7e-06,4e-06,2e-06,1e-06,3e-06,1e-05,5e-06,1.1e-05,8e-06,6e-06,5e-06,3e-06,3e-06,8e-06,1e-06,4e-06,0,1e-06,3e-06,5e-06,4e-06,3e-06,1e-06,6e-06,1e-06,5e-06,4e-06,0,7e-06,0,1.2e-05,6e-06
2e-06,2e-06,3e-06,1e-06,5e-06,6e-06,1e-06,2e-06,2e-06,1e-06,1e-06,4e-06,0,9e-06,1e-06,4e-06,2e-06,5e-06,1e-05,2e-06,1.1e-05,5e-06,3e-06,5e-06,3e-06,2e-06,4e-06,1e-06,3e-06,1e-06,6e-06,0,8e-06,8e-06,1e-06,3e-06,8e-06,5e-06,3e-06,3e-06,1e-06,3e-06,1e-06,1e-06,0,2e-06,2e-06,2e-06,4e-06,1e-06,6e-06,4e-06,2e-06,5e-06,1e-06,1e-06,1e-06,1e-06,2e-06,4e-06,4e-06,1e-06,5e-06,1e-06,8e-06,1e-06,3e-06,5e-06,4e-06,1e-06,3e-06,7e-06,3e-06,3e-06,1e-06,5e-06,3e-06,4e-06,4e-06,7e-06,2e-06,5e-06,6e-06,1e-06,2e-06,2e-06,7e-06,3e-06,1e-06,6e-06,3e-06,1e-06,1e-06,3e-06,1e-05,6e-06,1.1e-05,7e-06,6e-06,4e-06,2e-06,3e-06,9e-06,1e-06,4e-06,1e-06,0,3e-06,5e-06,4e-06,3e-06,0,5e-06,1e-06,4e-06,4e-06,1e-06,6e-06,1e-06,1.2e-05,5e-06
