-2.9e-05,-0.000155,-0.000333,-0.000114,-8.4e-05,0.000582,-0.000117,7.1e-05,-0.000185,-0.000358,-0.000497,-0.000107,-0.001236,-0.000835,-0.000198,-0.00063,-0.002035,-0.000908,-0.001561,-0.003884,-0.003615,-0.003645,-0.003701,-0.004707,-0.003895,-0.004344,-0.005888,-0.00441,-0.007035,-0.003694,-0.004477,-0.00764,-0.009347,-0.006641,-0.009637,-0.007471,-0.013309,-0.008627,-0.011429,-0.018634,-0.014328,-0.012288,-0.003173,-0.008413,-0.0109,-0.007855,-0.02463,-0.017914,-0.014539,-0.014271,-0.016638,-0.011543,-0.019583,-0.015402,-0.025047,-0.016655,-0.021302,-0.015239,-0.01529,-0.009348,-0.013046,-0.012885,-0.017776,-0.021323,-0.020303,-0.021557,-0.019871,-0.00921,-0.014524,-0.027139,-0.022398,-0.015605,-0.016037,-0.017063,-0.021541,-0.016602,-0.022666,-0.027698,-0.024627,-0.019077,-0.011498,-0.023292,-0.018178,-0.013968,-0.016029,-0.015572,-0.013934,-0.009457,-0.012469,-0.01234,-0.015067,-0.017645,-0.016357,-0.012961,-0.017539,-0.014928,-0.009293,-0.009625,-0.016932,-0.012956,-0.010011,-0.009024,-0.015407,-0.016974,-0.015105,-0.011693,-0.015841,-0.013618,-0.022879,-0.016325,-0.020544,-0.015663,-0.028473,-0.018077,-0.01429,-0.024423,-0.015235,-0.02404,-0.016251,-0.019428,-0.008649
-0.000408,-0.000162,3.4e-05,-7.2e-05,-0.000131,0.000134,0.000194,0.000145,0.000141,0.00035,0.000395,-0.00019,-0.000163,0.000373,-0.000668,0.000367,0.000985,-0.000314,-0.00038,0.000556,0.001314,0.000486,0.000902,0.000332,0.000848,0.001937,0.003019,0.001662,0.002105,-0.000103,-0.002992,-0.003048,-0.000257,0.002182,0.000287,-0.00031,0.006381,0.000944,0.006186,0.002448,0.008122,0.004231,0.002175,-0.007112,-0.003403,0.002895,0.013334,0.008389,0.004246,0.007394,0.009547,-0.002829,0.004722,0.009122,0.010174,0.002543,0.002338,0.001331,0.006837,0.001901,0.001603,0.004395,0.001991,0.008802,0.014066,0.009302,0.01034,0.006683,0.005257,0.007619,0.012228,0.008183,0.008988,0.004085,0.004565,0.004112,0.005778,0.016736,0.011318,0.001743,-0.003467,0.012346,0.009781,0.00438,0.007163,0.008428,0.00197,0.003997,0.001648,0.006094,0.007868,0.009171,0.000354,0.002727,0.008368,0.007486,0.003131,0.003043,0.005681,0.003935,0.002826,0.002295,0.005421,0.009281,0.006588,0.002929,0.003336,0.005252,0.009919,0.008566,0.013386,0.011307,0.014937,0.003704,0.001998,0.01181,0.009364,0.017129,0.006068,0.004258,0.004921
-6.2e-05,-0.000188,-0.000177,-7.1e-05,-0.000424,-0.000138,0.000213,0.000314,3.1e-05,-7.4e-05,-0.000228,0.000622,0.000599,-0.000186,0.000174,-0.000257,-0.000934,8.4e-05,0.000951,0.000223,7e-05,0.000764,0.000397,0.000412,-0.000978,-0.001102,-0.002642,-0.000461,-0.000616,-0.000933,0.002763,0.005146,0.000511,-0.000636,0.001461,0.001911,-0.002121,-0.000473,-0.00325,0.002284,-0.003396,-0.001525,-0.002173,0.00612,0.008798,0.003591,-0.005736,-0.003028,-1.8e-05,-0.005867,-0.002939,0.002516,0.0019,0.000168,-0.003949,0.000482,0.001178,0.005369,-0.000589,0.000755,0.00509,0.000463,-0.000117,-0.001472,-0.008478,-0.001622,-0.003906,-0.006764,-0.004068,-0.000314,-0.006211,-0.00506,-0.000461,0.0029,0.00041,0.002129,-0.000226,-0.006056,-0.004382,0.005793,0.004998,-0.004948,-0.000777,0.001351,-0.003296,-0.004593,0.000481,-0.000319,0.004017,-0.003399,-0.003971,-0.004284,9.4e-05,-0.001232,0.001287,-3.7e-05,0.000377,-0.001482,-0.001177,0.00198,0.00035,-0.001354,-0.005221,-0.002911,-0.002185,-0.001153,0.005338,0.002685,-0.003088,-0.004564,-0.008624,-0.004558,-0.00404,0.003335,0.004354,-0.007096,-0.003841,-0.008855,-0.001075,0.00132,-0.002061
0.000378,0.000264,0.000141,0.000307,0.000283,0.000347,-4.2e-05,0.000172,0.000242,0.000639,0.00081,-0.000183,-0.000863,-0.000414,-0.000138,0.000606,0.001072,0.000192,-0.000176,-0.000192,0.001181,-0.001169,-0.00036,0.000513,5.5e-05,0.000578,0.00212,-0.000912,-0.000767,-0.002111,-0.00343,0.00088,-0.000216,0.000291,-0.001239,0.000378,0.000698,0.00066,0.003889,-0.003228,0.002385,0.003216,0.001256,-0.001626,-0.006645,-0.004384,0.002035,-0.000174,0.000125,0.005234,0.00086,-0.002396,-0.004823,-0.002052,0.000307,-0.004264,-0.002258,-0.00613,-0.004522,-0.001549,-0.00286,0.00065,0.001236,-0.004659,0.005239,0.000591,-0.000478,0.00739,0.001049,-0.001655,0.003042,0.002012,-0.003092,7.2e-05,-0.000629,-0.000573,-0.000537,0.002335,0.004299,-0.003176,-0.003847,-0.00024,-0.000895,-0.000208,-0.000561,-0.000148,-0.000881,0.003536,-0.002978,-0.000919,0.003192,0.002347,0.002652,0.002632,-0.002342,-0.000344,-0.002939,0.001085,0.002629,-0.003895,0.002198,0.003957,0.006715,0.001186,-0.001063,0.000271,-0.004241,-0.005018,0.001222,0.001929,0.00267,-0.00082,0.002061,0.000718,-0.003128,0.004116,0.004458,0.005126,0.00055,0.001031,-0.000393
-2.7e-05,-3.4e-05,-0.000111,-1.2e-05,-7.3e-05,0.000103,6.4e-05,-1.8e-05,-0.000332,-0.000342,-0.000849,0.000146,0.00093,5e-04,0.000226,-0.000963,-0.000647,-0.001099,-0.000845,-0.001241,-0.002427,0.000962,-0.000827,-0.001977,-0.000777,-0.001171,-0.000886,0.000675,0.002396,0.002433,0.000498,-0.003449,-0.000536,7.6e-05,0.000212,-0.002432,0.000217,-0.000511,-0.00477,0.002301,-0.002881,-0.004065,0.000162,-0.001088,0.000286,0.00359,3.2e-05,-0.002159,-0.002471,-0.001623,-0.003976,-0.003894,0.001751,-0.001599,-0.001172,0.002075,0.000724,0.003836,0.005777,-0.000383,-0.001657,-0.004498,-7.3e-05,0.005008,-0.003556,-0.001779,0.000998,-0.004353,-0.000248,-0.003661,-0.000303,-0.002539,0.002412,-0.004223,-0.004085,-0.003223,-0.001604,-0.003027,-0.007391,-0.001244,0.002717,0.003256,-0.002209,0.000171,0.001762,0.002128,-9e-05,-0.005817,0.000455,0.001185,-0.001626,-0.002023,-0.002692,-0.001262,-0.000953,0.001071,0.00094,0.000146,-0.00516,0.00259,-0.005773,-0.006073,-0.006907,-0.000251,0.001199,-0.001794,0.001428,0.001828,-0.001875,-0.000514,-0.000347,0.002664,-0.00187,-0.002881,0.002145,-0.001055,-0.008239,-0.002011,-0.001493,-0.00237,0.002165
-7.1e-05,-4.9e-05,0.000137,4.2e-05,3e-06,-2e-04,-0.000383,-0.000104,7.5e-05,6e-05,0.000192,0.000153,-0.000402,-0.000637,0.000269,0.000443,-0.000114,0.000243,0.000718,0.001292,0.002186,0.000631,0.000696,0.001156,0.001203,0.001624,0.002007,-0.000767,-0.001892,-0.00182,-0.000338,0.001266,0.000331,-0.002472,-0.000363,0.0012,-0.001927,0.000927,0.001937,-0.001478,0.002445,0.002331,-0.001275,0.000553,0.001891,-0.001907,0.000669,0.001449,0.003167,0.001038,0.004042,0.005694,-0.001579,0.002525,0.003793,-0.00012,-0.000274,-0.00201,-0.006909,-0.00378,0.002244,0.004653,-0.001186,-0.006391,-5e-06,0.004999,-0.00186,-0.000267,-0.00057,0.003688,-0.000405,0.004072,-0.000992,0.005111,0.00554,0.003753,0.002006,0.002668,0.008991,0.0011,-0.003678,-0.001495,0.001557,-0.001656,-0.002265,-0.00286,-0.001972,0.002987,-0.000758,-0.001112,-0.002196,0.001322,0.001066,-0.001429,0.002353,-0.000774,0.000411,0.000775,0.003916,0.000428,0.004614,0.004851,0.005661,0.00047,-0.001112,0.000219,-0.000325,-0.002646,0.001224,0.000194,-1.6e-05,-0.001357,-7.9e-05,0.002803,-0.000892,0.001215,0.006988,0.00129,0.001402,0.00255,-0.002427
-9e-06,-9.4e-05,-4e-05,-6.3e-05,0.000101,-1.8e-05,-0.000409,0.000179,0.00017,3.8e-05,-7.6e-05,-0.000163,-8.4e-05,0.000182,0.000106,0.00047,-0.00022,-0.000189,0.00049,-0.000749,-0.001027,-0.000649,0.000272,3e-06,-0.001124,-0.000187,-0.001317,-0.000398,3e-04,0.001375,0.00056,0.001139,-0.001191,0.001431,-0.000201,0.000576,0.001255,-0.001892,0.00126,0.002236,-9.8e-05,-0.001272,-0.000949,0.001901,-0.002099,0.000317,-1.9e-05,-0.001761,-0.002126,-0.001885,-0.002429,-0.003247,0.000698,-0.001231,-0.003999,-0.001144,-0.002143,8.1e-05,0.003847,0.003677,-0.00035,-0.001982,0.000832,0.00467,0.004117,-0.004401,0.002117,0.001071,-0.000746,-0.002511,0.000734,-0.001922,0.001717,-0.004522,-0.004335,-0.002847,-0.001945,-0.000305,-0.005094,-0.000153,0.000918,-0.001362,6.6e-05,-0.000479,0.000268,0.000712,0.002018,-0.001065,0.000496,0.002882,0.003065,0.000466,-0.000226,-0.001411,-0.000915,-0.001123,-0.000909,-0.000468,-0.001086,-0.000961,-0.001149,-0.001713,-0.000887,-0.002263,0.001597,0.002305,0.000892,0.001393,0.000489,0.000259,0.001925,0.001692,0.000866,-0.003371,-0.000412,-0.001559,-0.005135,-0.00256,-0.002441,-0.002155,0.002085
-4.3e-05,5.5e-05,-9e-06,-2.8e-05,9e-06,-3.8e-05,-2.7e-05,-3e-04,-0.00018,-0.000116,-0.000203,-9.5e-05,0.000116,-1e-05,-0.000175,-0.000457,0.000107,0.000284,-0.000234,0.000482,0.000267,-6.5e-05,-0.000663,-0.000314,0.000851,-0.000606,0.000822,0.000411,0.000373,-0.000759,0.000696,-0.000717,0.001828,0.000103,-0.000258,-0.001051,0.000583,0.00278,-0.000662,-0.002575,-0.00195,0.000372,0.001058,-0.00059,0.00015,0.001441,-0.001678,0.000635,0.002244,0.000419,-0.00046,0.000908,0.002694,0.000999,0.002146,0.001387,0.002121,-0.000832,-0.00203,-0.002549,-0.000996,-0.000219,0.000177,-0.002262,-0.003252,0.004066,-0.000337,-0.000555,0.001726,-0.000461,-0.002084,0.001012,-0.002246,0.001865,0.000247,0.001315,0.002303,-0.000514,0.002152,5.2e-05,0.002747,0.000701,-0.00064,0.000636,0.001214,0.00019,7e-06,-0.000466,0.000453,-0.001917,-0.001291,-0.000703,0.001061,0.004887,0.000191,0.001102,0.000463,0.000134,-0.00036,-0.000835,-0.000736,0.000759,-0.000703,0.003723,-0.002306,-0.002536,-0.00072,0.001176,-0.001568,-0.000725,-0.004168,-0.00283,-0.000603,0.001883,-0.001452,0.001814,0.001647,0.002594,0.002865,0.001424,-0.002675
-2.3e-05,3e-06,-0.000106,7.1e-05,-0.00012,0.000111,6.4e-05,-7.3e-05,1.5e-05,-7e-05,-0.000221,0.000178,-0.000231,0.000106,-2.8e-05,-1.7e-05,-0.000234,-0.00058,-0.000257,-0.00015,0.000452,-2.7e-05,0.000853,0.000339,9.7e-05,8.5e-05,-0.000756,5.6e-05,0,0.000594,-0.000953,0.000892,-0.000499,0.000436,0.000531,0.000885,-0.000716,-0.001725,-0.000266,0.002949,0.003063,0.001157,0.000961,7.2e-05,0.000658,-0.003864,0.001554,0.000601,-0.002829,-0.00158,0.001424,0.00182,-0.000818,0.000274,-0.001671,-0.001136,-0.00127,0.001353,0.001279,0.002663,-0.000258,0.001225,0.001823,0.00112,0.0011,-0.004264,-0.001261,0.000134,-0.002936,0.002429,0.002709,-0.000393,0.003522,0.000509,0.001711,0.001064,-0.004241,0.000294,-0.000281,-0.001239,-0.004164,-5.5e-05,0.000818,0.000457,-0.001004,-0.000973,-0.00034,0.001478,-0.002635,-0.000337,0.002207,0.00082,-0.00134,-0.002926,-0.00056,-0.001124,-0.000285,0.000347,-0.000217,0.001325,0.001728,-0.000483,0.000875,-0.004039,0.001067,0.001789,0.001621,-0.000811,0.002675,0.001127,0.003044,0.0014,0.000866,-0.001299,0.002034,-0.001291,-0.001246,-0.000868,-0.002708,-0.00161,0.003457
1.1e-05,1.8e-05,5.5e-05,-7.1e-05,-5.6e-05,-9.7e-05,-1.5e-05,-0.000109,-0.000142,0.00014,5e-05,-0.000332,4.8e-05,5.2e-05,-0.000141,4.5e-05,0.000258,0.000222,0.000172,8e-05,-0.000382,-0.000118,-0.000586,-3.1e-05,-0.000329,-0.000295,5.3e-05,0.000426,-0.000523,-0.000582,0.000332,-0.001552,-0.000162,0.000834,-0.000495,-0.00047,-0.000987,0.000252,0.000578,-0.002797,-0.002661,-0.001812,-0.002366,-0.000165,0.001034,0.001717,-0.001137,0.000153,0.00169,0.00151,0.000719,-0.001845,0.000998,-0.001183,-0.000381,-0.000205,0.000988,0.000649,-0.001491,-0.001663,-4.2e-05,-0.000476,-0.003096,-0.000267,9e-06,0.003405,0.000962,0.000531,0.002687,-0.001582,-0.000226,-0.000959,-0.003093,-0.001207,0.000497,-0.001106,0.005036,-0.000128,7.1e-05,0.000586,0.002077,-0.000408,-0.000651,-0.0017,0.000495,0.000347,0.000806,-0.002061,0.000773,0.000515,-0.002041,-0.000903,0.00115,0.000511,0.000191,0.000227,-0.000599,-0.001263,-0.000928,-0.001213,-0.002131,-0.000315,-0.001154,0.00215,0.000118,-0.001069,-0.001411,-3.3e-05,-0.002408,-0.00164,-0.000731,-0.000528,-0.000785,0.000527,-0.002326,-0.001332,0.001075,-9.5e-05,5.5e-05,0.001799,-0.003421
-3e-06,2.3e-05,3.7e-05,7.4e-05,8e-06,4.9e-05,-7.1e-05,6e-05,-5.4e-05,-0.000203,2e-05,-5.4e-05,-0.000144,-0.00017,-0.00015,0.000221,8.3e-05,0.000144,-0.000349,-0.000158,-6e-06,-0.000113,-0.000291,-0.00028,-2e-04,3.2e-05,0.000137,-0.000121,0.000987,-0.000154,-0.000143,-0.000112,-0.000603,-0.001421,0.000378,0.000381,0.001341,-8.4e-05,-0.000804,0.001855,0.001229,0.000737,0.001523,0.000155,-0.000895,0.001647,-7.7e-05,0.000521,-0.001577,0.000487,-0.001086,0.001262,-3e-04,0.001588,0.001309,0.000611,0.001008,-0.001242,0.001113,0.000621,-0.001161,0.000252,0.002424,0.000177,-0.000921,-0.002039,0.000227,0.000175,-0.001508,-0.000447,-0.002653,0.001094,0.002102,0.00126,-0.00185,-0.000162,-0.003284,-0.000104,0.000278,0.000231,0.000286,-0.000616,-0.001366,0.001778,-0.000807,0.001281,-0.001079,0.001348,0.00111,-0.000611,0.001132,0.00016,-0.000488,-1e-05,-0.000636,-0.000239,0.001103,-4e-04,0.000798,0.00081,0.00146,-0.000406,0.000963,-3e-04,-0.000706,4e-04,0.00107,-0.000132,0.000343,0.001449,-0.000507,-2.9e-05,3e-04,-4.2e-05,0.002051,0.002532,0.00056,-0.00082,0.001573,-0.001084,0.002497
-2.3e-05,-2.6e-05,-3.5e-05,-2.9e-05,-1.2e-05,-2.4e-05,-4.2e-05,7.7e-05,-0.000143,3e-05,-3.2e-05,-1.3e-05,-5e-06,0.000134,4e-05,0.000114,-0.000279,-2.7e-05,0.000137,0.000222,-3e-06,0.000216,0.000119,0.000165,0.000519,0.000272,0.000226,6.5e-05,-0.000652,0.000388,1.5e-05,0.000234,0.001253,0.000587,-0.000202,0.000172,-0.000792,-0.000477,0.001129,-0.001133,-0.000439,-0.000232,0.000334,-0.000626,0.000302,-0.002484,6e-04,-0.000387,0.000978,-0.001561,-0.000337,-0.001052,-0.000183,-0.000832,7.8e-05,0.000852,-0.002278,0.001332,-0.00094,0.000444,0.003365,-0.000308,-0.000895,-0.000637,-0.000253,-0.000158,-0.000589,-0.001152,0.001258,0.001723,0.00256,-0.000918,-0.001832,-0.001443,0.001459,0.00101,0.00135,0.000203,-0.000852,-0.000597,-0.001348,0.000859,0.002728,0.000364,0.000582,-0.001188,0.000657,-0.001315,-0.000573,0.000923,-0.001424,-0.000179,-0.000162,0.000402,0.001773,0.000544,-0.000764,0.00151,0.000547,-0.000668,-0.00053,0.000843,-0.000521,-0.001367,0.000366,-0.00035,-0.001802,0.001226,0.000235,-0.000738,0.000452,0.000427,-0.000308,7.4e-05,-0.001385,-0.002166,-0.000165,9.4e-05,-0.001072,0.000582,-0.000822
1.9e-05,2e-06,-2.9e-05,-2.1e-05,4e-06,-3e-05,1.7e-05,-1e-05,3.9e-05,-2.8e-05,-1.7e-05,-8.4e-05,-3.5e-05,-6.6e-05,-0.000103,-0.000121,8.2e-05,3e-06,-0.000298,0.000182,-0.000156,-0.000203,6.4e-05,5.9e-05,-0.00049,-0.00036,-0.000125,-7.7e-05,0.00052,-4.3e-05,-2.3e-05,-0.00013,-0.000353,0.000404,0.000194,-0.000301,0.000125,0.000619,-0.000702,0.000977,0.000192,0.00026,-0.000756,0.000196,-0.000103,0.001305,-0.000723,-0.000146,-0.000433,0.001093,0.000293,0.00104,-0.000824,-0.001192,-0.000255,-0.00091,0.001763,0.000228,0.000652,-0.000397,-0.001336,-0.000527,-0.000569,0.001044,0.000431,0.001602,0.001149,0.001508,-0.000329,-0.000405,-0.001701,0.001147,0.001183,0.001186,-0.000408,-0.000567,-0.000136,-0.000891,0.000809,0.000937,0.000975,0.000307,-0.001331,-0.001249,-0.000649,0.001522,-0.000177,0.00029,6.8e-05,-0.001025,0.001126,0.00016,-0.000288,-0.000473,-0.001348,-0.000676,0.000441,-0.001209,-0.000475,-0.000304,0.000102,-0.000491,0.00012,0.001124,-0.000134,0.000765,0.000905,-0.000829,-0.000788,0.00022,0.000747,-0.000486,0.000246,0.000477,0.001204,0.000897,-0.000495,-0.000213,2.3e-05,-0.000732,-7.5e-05
-5e-06,-5e-06,2.2e-05,7e-06,-4.2e-05,-7e-06,-5.8e-05,-1.2e-05,-4.1e-05,-4.6e-05,-2.9e-05,-0.000122,9.7e-05,-3.3e-05,6.1e-05,-5e-06,-2.9e-05,-5.8e-05,0.000252,-8.2e-05,0.00018,0.000242,5.6e-05,-0.000168,0.000186,0.000291,-0.000213,3.1e-05,-0.000169,-0.00034,1.5e-05,0.000696,0.000186,-0.000586,9.6e-05,0.000114,0.000316,-0.000429,0.00017,-0.000592,-8.1e-05,7.3e-05,0.000115,-0.000249,0.000238,0.000387,0.001167,1.2e-05,0.000207,-0.000274,-0.000127,-0.001058,0.000984,0.000862,-0.000389,0.000262,-0.000979,-0.000854,-0.000112,9.3e-05,0.000619,-3.8e-05,0.001048,-0.000344,-0.000137,-0.002095,-0.000507,-0.00134,-0.000812,-0.000192,-0.00023,-0.001466,-0.000811,-0.000736,0.000341,-0.000323,-0.000613,0.000891,-0.000774,-0.000678,-0.000545,-0.000593,0.000612,0.000629,0.000417,-0.001154,0.00049,0.000958,0.000424,0.000853,-0.000465,0.000245,0.000623,-9.4e-05,9.3e-05,0.000279,5.6e-05,0.000883,0.000286,0.000685,0.000117,0.000921,0.000257,-0.000245,-0.000137,-0.000658,0.000138,0.000552,0.000694,0.000487,-0.001639,4.4e-05,-0.000174,-0.000676,-0.000335,0.000668,0.000579,0.000381,0.000693,8.6e-05,6.6e-05
0,2e-06,2.6e-05,2.7e-05,2.5e-05,2e-05,8e-06,-4.6e-05,-5e-05,-3.7e-05,-3.5e-05,6.2e-05,-0.000109,5.6e-05,7.5e-05,-9.6e-05,-8e-06,-1e-05,-0.000142,2.5e-05,-0.000158,-0.000174,-9.7e-05,0.000195,1.8e-05,9e-05,0.000169,-3e-06,-0.000109,0.000317,0.000242,-0.000328,-0.000306,0.000107,-5e-05,-0.000179,-0.00025,0.000365,0.000142,0.000344,3.4e-05,-0.000282,0.000589,8.5e-05,-0.000267,-0.00028,-0.000225,7.7e-05,-0.000114,-0.000611,0.000223,0.000581,-0.001231,-0.000499,0.000348,-0.000256,0.000279,0.000607,0.00039,0.000159,-0.000837,-5.3e-05,-0.000181,-0.000516,0.000103,0.001957,0.000142,0.000853,0.000801,-5e-05,0.001242,0.000289,0.000572,0.000489,2.5e-05,0.000172,0.000173,-0.000566,0.000585,0.000144,1.7e-05,0.000315,-0.000587,-0.000367,-0.000543,0.000186,-0.000962,-0.000492,-0.000681,0.000426,0.000406,0.000117,-0.000607,0.000766,0.000272,0.000102,-7.2e-05,0.000208,-0.000124,-0.000528,-0.000452,-0.001206,-0.000164,0.000291,0.000202,-0.000232,-0.000173,-0.000175,-0.000161,-0.000834,0.001304,0.000305,-0.00012,0.000355,-0.000137,-0.00012,-0.000739,-1.2e-05,-0.001107,0.000337,0.000592
1e-06,8e-06,7e-06,-2.4e-05,4e-06,-2e-06,8e-06,2.3e-05,-2.5e-05,6e-06,3.7e-05,7e-06,0.000101,-5.4e-05,-3.3e-05,7.1e-05,8.3e-05,3e-06,4.7e-05,1.8e-05,1e-04,9.2e-05,7.7e-05,-1e-05,4.1e-05,-4.8e-05,-0.00023,0.000166,-0.000184,-0.000123,-0.000188,-2.1e-05,0.000232,0.00035,-0.000184,0.000216,7.5e-05,-0.000361,-0.000329,-0.000702,-0.000109,0.000362,-0.000589,-2.4e-05,7e-05,-0.000404,-0.00065,2.6e-05,0.000301,0.00116,-0.000115,0.000234,0.000762,0.000167,-3e-06,0.000487,0.000325,-0.000308,-0.000643,2.4e-05,0.000292,0.000298,-0.000398,0.000585,-0.00015,-0.001492,0.000148,-0.000313,-0.000678,0.000616,-0.000812,0.001063,4.9e-05,-0.00024,-0.000356,5.4e-05,0.00038,0.000201,-0.00063,0.00013,0.000195,0.000415,0.000591,0.00044,0.000373,0.000166,0.00068,0.000383,0.000281,-0.000836,-0.000113,-8e-06,0.000624,-0.00079,0.000249,-2.9e-05,7.1e-05,-0.000578,-2.3e-05,0.000335,0.000366,0.00101,0.000106,-0.000274,-0.000126,0.000721,0.00029,0.000304,5e-06,0.000398,-0.000413,-0.000315,0.000202,-0.000422,-0.000118,8.2e-05,0.000339,0.000137,0.001178,-9e-04,-0.000739
-8e-06,-4e-06,-1.7e-05,8e-06,-1.1e-05,4e-06,-7e-06,-1.4e-05,3.2e-05,-5e-06,-1.8e-05,-8e-06,1.3e-05,-4e-06,4.6e-05,-2.8e-05,-8.9e-05,6.5e-05,9.6e-05,-1.8e-05,-8.9e-05,-4e-05,-6e-06,-4.7e-05,-0.000127,-0.000115,9.3e-05,-3.1e-05,0.000113,-7.5e-05,8.7e-05,4.5e-05,-0.000347,-0.000425,-1.7e-05,-0.000111,9e-05,0.000372,0.000291,0.00093,0.000132,-0.000276,1.8e-05,5.3e-05,7.8e-05,0.000628,0.000642,-1.2e-05,-0.000122,-0.00064,-6.3e-05,-0.000304,-0.000429,0.000164,-0.000669,-0.00044,-0.000533,-0.000131,0.000546,-0.000173,6e-05,-9.3e-05,0.000378,-0.000389,-6.8e-05,0.001102,-0.000145,-8.5e-05,0.000706,-0.000502,0.000221,-0.00106,-0.000424,2.3e-05,0.00053,3.4e-05,-0.000187,0.000317,0.000285,-0.000178,0.000251,-0.000403,-0.000448,-0.000242,5.2e-05,-5.1e-05,-0.000634,-0.000252,0.000279,0.000322,-0.000237,-7e-05,-0.000418,0.000172,-0.00029,-0.000308,-0.000201,0.000507,-7.4e-05,2.3e-05,-0.000156,-0.00029,-0.000372,0.000273,8.7e-05,-0.000634,-0.000319,-0.000959,0.000322,-0.000242,-9.5e-05,2.9e-05,7.6e-05,0.000257,0.000176,-0.000137,0.000342,-0.000129,-0.000819,0.00083,0.00057
2e-06,-4e-06,8e-06,-3e-06,0,-5e-06,-2.2e-05,-1.4e-05,3.6e-05,-2e-06,-8e-06,-5e-06,-1.8e-05,2.2e-05,-2.3e-05,-9.3e-05,-2.4e-05,-4.4e-05,-5e-06,-2.9e-05,-1.4e-05,-2.8e-05,-3.1e-05,3.3e-05,6e-05,1.4e-05,6e-06,-4.3e-05,-2.3e-05,7e-05,-0.000126,-4.7e-05,0.000154,7.7e-05,0.000102,-0.000188,1.5e-05,-0.000189,-0.000223,-0.000591,-9.8e-05,3.6e-05,0.000537,8.1e-05,-1e-05,-0.000656,-0.000307,-2.8e-05,0.000177,0.000246,-0.000152,0.000269,-0.000234,-0.000141,0.000285,0.000274,0.000333,9.5e-05,-0.000201,0.000272,-0.000337,8.3e-05,-6.7e-05,0.000125,0.000193,-0.000673,0.000141,-1.4e-05,-0.00041,-0.000203,-6.4e-05,0.000809,0.000444,0.000177,-0.000347,-0.000216,-0.000362,-0.000376,0.000118,-5.3e-05,-0.000362,1.2e-05,0.000505,0.000146,-0.000309,0.000136,0.000545,-3.1e-05,-0.000505,1.5e-05,0.000183,-5.7e-05,0.000194,0.000273,-9.4e-05,0.000317,0.000319,-0.000194,-0.000131,3.2e-05,0.000118,-0.000143,0.000371,-0.000321,4e-05,0.000475,-8.3e-05,0.000807,-0.000403,0,0.000249,0.000188,-0.00015,-9.3e-05,-0.00017,-0.000135,-0.00054,0.000106,0.000602,-0.000444,-0.000747
0,0,6e-06,-4e-06,-2e-06,-4e-06,-5e-06,5e-06,-5e-06,-4e-06,0,1.8e-05,1.1e-05,-2.7e-05,-8e-06,7.3e-05,4.1e-05,-8e-06,2.3e-05,1e-05,9.1e-05,3.7e-05,8.4e-05,-1.9e-05,7e-05,7e-06,4e-06,-1.6e-05,3.1e-05,-8.7e-05,0.000173,0.000156,5.7e-05,-6.2e-05,8.2e-05,0.00017,-0.000141,-8.9e-05,3.1e-05,0.000291,0.000119,0.000134,-0.000664,6e-06,-5e-05,0.000342,-0.000126,-6.2e-05,-0.000249,9.2e-05,-5.6e-05,-0.000273,0.000375,9.9e-05,0.000152,-0.00016,-0.000122,-0.000115,2.2e-05,-9.1e-05,8.2e-05,7.5e-05,-8.2e-05,0.000147,-2.2e-05,0.000144,-0.000194,7.5e-05,0.00012,0.00046,2.6e-05,-0.000398,-0.000375,-0.000244,-1.4e-05,8.7e-05,0.000831,0.000207,-0.000243,0.000152,3.3e-05,0.000189,-0.000724,7.5e-05,0.000273,-0.000173,-0.000351,0.000207,0.00047,-7.4e-05,3.5e-05,0.000122,-5.1e-05,-0.000227,0.000161,-3.4e-05,-0.000289,-0.000123,7.1e-05,-0.000193,-0.000187,0.000244,-0.000172,-3.6e-05,-0.000206,-0.000354,0.000175,-0.000303,0.000375,0.000169,-0.000323,-7.3e-05,-5.6e-05,5.1e-05,0.000175,-2e-06,0.000447,-5e-05,-0.000162,0.000175,0.001003
-3e-06,1e-06,-4e-06,-1e-06,-9e-06,-2e-06,0,2.5e-05,-2.1e-05,0,-3e-06,-1.8e-05,1e-05,1.5e-05,-1.6e-05,-1.1e-05,-6.2e-05,1.3e-05,-3.9e-05,2e-06,-7.3e-05,-6.3e-05,-2.6e-05,4.6e-05,-0.000103,-4.5e-05,4.9e-05,-1.9e-05,-1e-05,-2.1e-05,-0.000129,-0.000147,-8.8e-05,5.1e-05,-7.2e-05,-6.7e-05,0.000115,0.000178,7.3e-05,-0.000302,-8.6e-05,-0.000163,0.000458,-1.5e-05,-9e-05,4.4e-05,0.000193,2.6e-05,3.7e-05,-0.000227,0.000125,0.000328,1.8e-05,1.7e-05,6.6e-05,0.000167,2.3e-05,0.000156,-7e-05,-9.6e-05,0.000145,-2.4e-05,-5e-05,-9.5e-05,-7.9e-05,0.000302,0.000311,-3.5e-05,5.2e-05,-0.000159,0.000177,0.000244,0.000437,0.000142,0.000138,6.2e-05,-0.001,-2.1e-05,0.00029,-5.9e-05,0.000176,-4.2e-05,0.000634,-0.00028,-1e-06,0.000312,0.000265,-0.000296,-0.000108,5e-06,-0.00017,2.3e-05,-5e-05,0.000131,8.9e-05,-6.9e-05,0.000206,2e-05,2.8e-05,0.000193,0.000138,-0.00019,-3.2e-05,0.000424,0.000313,0.00016,-0.000239,0.000155,-1.3e-05,-0.000162,2e-04,2.3e-05,5.2e-05,0.000106,-0.000213,7.7e-05,-0.000338,-7e-05,-0.000156,0.000193,-0.00089
5e-06,-1e-06,-8e-06,3e-06,-2e-06,3e-06,-1e-05,2e-06,-8e-06,0,4e-06,-1.7e-05,-2.7e-05,0,-2.6e-05,-1e-06,1.6e-05,2e-06,-8e-06,-3.3e-05,6.4e-05,6.7e-05,-5.5e-05,-2.8e-05,2.8e-05,-6.8e-05,1.5e-05,2e-06,6.6e-05,3.2e-05,0.000135,-7e-05,-5.8e-05,3.6e-05,5.4e-05,5.1e-05,-3.7e-05,-0.000153,-8.6e-05,0.000329,5e-05,0.000165,-0.000269,-6e-06,5.2e-05,-0.000299,-7e-05,-1.2e-05,-9e-05,-3.8e-05,0.00011,-6.8e-05,-0.000204,8.8e-05,-0.000107,-0.00017,9.3e-05,-5.7e-05,0.000173,0.000108,2.1e-05,2.8e-05,0.000205,-0.000112,7.6e-05,-0.000644,-0.000378,-0.000132,-0.000199,-0.000127,-0.000313,-1.7e-05,-0.000422,-0.000113,-6.4e-05,-9e-05,0.000749,-6.4e-05,-0.000283,-8.3e-05,-0.000171,-4.4e-05,-0.000513,5.9e-05,-1.1e-05,-0.000393,-0.000322,0.00017,-7.1e-05,-0.000135,0.000212,-6e-05,8e-06,-7.7e-05,-0.000317,-1.9e-05,-0.000123,7.1e-05,7.9e-05,-0.000196,-5.2e-05,2.2e-05,0.000124,-0.000552,-0.000336,0.000139,0.000294,-0.000356,-0.000287,0.000107,0.000189,-2.5e-05,-0.000111,-0.000144,0.000321,-0.000329,0.000137,3.5e-05,0.000225,-0.000439,0.000446
-2e-06,0,0,1e-06,-3e-06,3e-06,1e-06,-6e-06,-9e-06,-1.1e-05,-1.5e-05,-2e-06,-2e-06,-1.8e-05,1e-06,-1e-06,4.7e-05,1e-05,1.7e-05,-4e-06,-5.4e-05,-4.4e-05,2.4e-05,6e-06,3.2e-05,0.000109,-2e-06,3.8e-05,-0.000129,-3.4e-05,-0.000164,4.2e-05,6e-05,-7.6e-05,-0.000118,1e-06,-8e-06,0.000175,5.9e-05,-2e-04,-3.4e-05,-0.000125,0.000245,4.7e-05,2.7e-05,0.000258,5e-05,2e-06,1.1e-05,0.000255,-4.4e-05,-0.000145,0.00028,-0.000137,6.1e-05,0.000148,-0.000247,-5.5e-05,-0.000141,-8.7e-05,1e-06,-2.7e-05,-0.000233,0.000225,-5e-06,0.000814,0.000376,0.00022,0.000268,0.000138,0.000231,-0.000209,0.000469,0.00012,-2e-06,6.6e-05,-0.000407,7.5e-05,0.000346,0.000178,-2.3e-05,1.5e-05,0.00038,0.000117,-0.000164,0.00037,0.000256,-5.2e-05,2.5e-05,0.000117,-0.000175,-7.6e-05,8.6e-05,7.5e-05,0.000164,0.000109,-1.2e-05,-7.4e-05,-1.4e-05,0.000195,-3.6e-05,-1e-06,-0.000118,0.000286,0.000195,-0.000173,-0.000215,0.00041,0.00023,-7.3e-05,-0.000405,-4e-06,0.000158,1e-04,-8.1e-05,0.000207,1e-05,2.8e-05,-7.8e-05,0.00046,-6.4e-05
1e-06,0,8e-06,5e-06,-6e-06,-5e-06,1e-06,-1.7e-05,1e-06,9e-06,-1e-06,1e-06,1.2e-05,2.2e-05,0,-3.1e-05,-4.1e-05,-3e-05,-1.8e-05,4e-06,1.5e-05,5.4e-05,1e-06,-1.7e-05,1e-06,1.8e-05,-3.7e-05,7e-06,7.5e-05,2.2e-05,0.000122,-8e-06,4.9e-05,1.8e-05,3.6e-05,-0.00011,4.7e-05,-0.000191,3e-06,0.000114,6e-05,1.6e-05,-0.000274,-3.5e-05,2e-06,2.6e-05,-4.8e-05,5.5e-05,8.2e-05,-0.000209,-3.4e-05,0.000211,-6.4e-05,9.2e-05,6.7e-05,-0.000118,0.000295,6.8e-05,0.000105,4.4e-05,4e-05,3.4e-05,1.6e-05,-0.000202,-3.7e-05,-0.000861,-0.000298,-0.000253,-0.000285,8.4e-05,2.4e-05,0.000356,-0.000507,-0.000127,-2.7e-05,1e-06,0.000166,-4.6e-05,-0.000232,-0.000125,0.000234,7.2e-05,-0.000179,-0.000127,0.000191,-0.000226,-0.000192,-3e-05,3e-06,6.1e-05,0.000134,-2e-06,-0.00014,-7.4e-05,5.4e-05,-8.5e-05,7.1e-05,9.4e-05,-6.2e-05,-0.000128,9.3e-05,5.1e-05,9.9e-05,0,2.3e-05,4.2e-05,1.9e-05,-0.000254,-0.000252,-9e-06,0.000242,4e-06,-7.5e-05,-0.000129,-0.00015,0.000234,-7.7e-05,-2.9e-05,-0.00016,-0.000408,-7e-06
0,1e-06,1e-06,-4e-06,2e-06,6e-06,-3e-06,-2e-06,-1.4e-05,-9e-06,3e-06,-2e-05,-1.1e-05,-1.4e-05,-6e-06,2.6e-05,6e-06,2.2e-05,-2.9e-05,-3e-06,2.1e-05,-3.2e-05,1e-05,1.4e-05,-5.7e-05,6e-06,2.4e-05,-3.4e-05,-3.8e-05,-5.4e-05,-9.7e-05,9.8e-05,-0.000145,4.3e-05,3e-06,0.000109,-5.5e-05,0.000154,-4.1e-05,-0.000165,-9e-05,5.3e-05,0.000259,-1.3e-05,-4.4e-05,-0.000329,1.8e-05,-3e-06,-6.3e-05,6e-05,-6e-05,-0.000209,-9e-05,7.5e-05,-7.3e-05,2.6e-05,-0.000255,-1.6e-05,-1.7e-05,4.5e-05,-0.000247,1.7e-05,0.000149,9.1e-05,9e-06,0.000656,0.000247,0.000211,0.00027,-0.000104,-0.000296,-0.000402,0.000399,0.000111,1.2e-05,-6.7e-05,-4e-06,-3e-05,0.000113,-5.1e-05,-0.000289,-1.9e-05,0.000109,2.4e-05,-9e-05,-1e-05,0.000225,0.000126,-2e-05,-0.000157,-7.8e-05,6.6e-05,0.000164,-1e-06,-4e-06,-3.9e-05,1e-06,-1.4e-05,5.3e-05,6.5e-05,-9.4e-05,-7.9e-05,-8.8e-05,-0.00011,-0.000153,-2.6e-05,2.4e-05,9.6e-05,4e-05,8e-05,0.000124,-3.2e-05,1.6e-05,8.1e-05,7.3e-05,-0.000322,7.6e-05,-6.6e-05,0.000335,0.000296,-0.000191
-2e-06,1e-06,-3e-06,-1e-06,-2e-06,-5e-06,-6e-06,6e-06,-8e-06,2e-06,-5e-06,4e-06,8e-06,-2e-06,2.1e-05,3e-06,2e-06,-4e-06,2.2e-05,-2.3e-05,-3.3e-05,1.4e-05,-5e-06,1.5e-05,5.2e-05,-3.6e-05,-1.8e-05,-9e-06,4e-06,1.8e-05,8.9e-05,-3.8e-05,0.000119,-0.000114,4e-06,-2.9e-05,-1.3e-05,-8.3e-05,4.4e-05,0.000186,7.3e-05,-7.7e-05,-0.000197,-3e-06,3.5e-05,0.000243,4.1e-05,-1.9e-05,0.000129,0.00015,2.6e-05,0.000167,0.000168,-0.000215,-3.9e-05,5e-06,0.000106,-5e-05,2.5e-05,-9.6e-05,0.000119,-3.3e-05,-0.000121,1.1e-05,-7e-06,-0.000372,-0.000264,-4.7e-05,-0.00021,-3.2e-05,0.000303,0.000332,-0.000321,-4.7e-05,-6e-06,4e-05,-1.4e-05,1e-06,-9e-06,0.000128,0.000228,-4e-05,-0.00017,5.3e-05,-1.7e-05,0.000156,-0.000183,-0.000106,1.6e-05,0.00011,-1.7e-05,2.5e-05,-0.000173,9.7e-05,-5.6e-05,5.1e-05,7e-06,-9e-06,-4.6e-05,-1.5e-05,6.8e-05,5.8e-05,4.6e-05,0.000103,0.000158,1.2e-05,-7.2e-05,-6e-05,0.000129,-0.000116,-0.000319,5.5e-05,-5e-06,-2.4e-05,-6.3e-05,0.00027,3e-06,3.6e-05,-0.000345,-9.9e-05,0.000354
1e-06,-1e-06,2e-06,-2e-06,-1e-06,0,-3e-06,1e-06,0,-1e-06,5e-06,6e-06,1.4e-05,1.4e-05,0,-2e-06,-3.2e-05,5e-06,-9e-06,-5e-06,4.3e-05,-9e-06,-9e-06,-2.4e-05,-7e-06,7e-06,-2e-06,1e-06,3.8e-05,2.9e-05,-6.4e-05,-2.8e-05,-6.8e-05,9.8e-05,4e-05,-3e-06,4.9e-05,-1.4e-05,-3.4e-05,-0.000107,-1e-05,8.9e-05,0.000109,-3e-06,-1.3e-05,4.2e-05,-7.2e-05,-1.6e-05,-0.000101,-0.000225,3.7e-05,-0.000163,-3.4e-05,0.00014,2e-06,2.7e-05,5.5e-05,1.9e-05,-6e-05,0.000104,-6e-05,-3.3e-05,8e-06,-2e-05,7e-06,8.6e-05,0.000281,-9.2e-05,8.6e-05,8.9e-05,-0.000127,-0.000231,0.000319,4.1e-05,-3.7e-05,2.4e-05,-4.9e-05,0,-7e-05,-7.6e-05,-0.000113,9e-06,0.000202,5.4e-05,-3e-06,-9.5e-05,0.000118,6.1e-05,4.7e-05,3e-06,9e-05,-6.1e-05,0.000109,-8.2e-05,-1.9e-05,2.8e-05,-1.8e-05,2.5e-05,-2.3e-05,1.3e-05,-2.7e-05,-3.2e-05,1.2e-05,-4.1e-05,-8.8e-05,7e-05,0.00013,0.000186,-0.000109,0.000116,0.000238,-3e-06,1e-05,1.6e-05,9e-05,-4e-06,3.5e-05,6.6e-05,0.000258,-2.1e-05,-0.000318
-2e-06,-1e-06,6e-06,1e-06,1e-06,2e-06,2e-06,1e-06,0,-3e-06,-5e-06,-6e-06,-5e-06,-1.6e-05,7e-06,-4e-06,2.7e-05,-4e-06,2.5e-05,0,-4.1e-05,-4e-06,7e-06,2.3e-05,-2.1e-05,1.7e-05,0,4e-06,-1e-05,-4.5e-05,5.1e-05,1.5e-05,4.3e-05,4e-05,-4.7e-05,2.5e-05,-1.9e-05,6.2e-05,1.3e-05,4.9e-05,-4.5e-05,-4.4e-05,-2.6e-05,-2e-06,6e-06,-0.000211,4.1e-05,-7e-06,9.9e-05,8.3e-05,4.1e-05,1.4e-05,-0.000121,-1.2e-05,5.1e-05,-3.4e-05,-0.000127,1.3e-05,3.7e-05,-4.8e-05,7.5e-05,-7e-06,7.9e-05,-9e-06,2.1e-05,0.000156,-0.000267,0.000153,7.9e-05,2e-06,-9.7e-05,8.9e-05,-0.000336,-3.7e-05,-1.1e-05,-4e-06,3.6e-05,3.3e-05,0.000113,-8e-06,-2.9e-05,3.9e-05,-0.000166,-0.000122,1e-05,3.2e-05,-9.6e-05,1.4e-05,-7.5e-05,-3.3e-05,-5.2e-05,-1.3e-05,-4e-05,8e-06,3.6e-05,-4.9e-05,-1.2e-05,-4.7e-05,9e-06,-8e-06,-3.3e-05,3.4e-05,-5e-05,5e-05,-2.2e-05,-9.7e-05,-2.5e-05,-0.00022,0.000149,-5.9e-05,-2.5e-05,-5.5e-05,-2.6e-05,2.9e-05,-8.5e-05,-0.000199,-4.2e-05,9e-06,-0.000152,9.5e-05,0.000184
1e-06,0,0,2e-06,-6e-06,1e-06,-2e-06,-3e-06,4e-06,-2e-06,-2e-06,-1e-06,9e-06,8e-06,3e-06,-1e-06,4e-06,-6e-06,-5e-06,-1e-06,1.5e-05,2e-06,3e-06,-2e-05,5e-06,-2.9e-05,5e-06,0,-5e-06,6e-06,-4e-05,-1.1e-05,-7.2e-05,-8e-05,0,-5.7e-05,-1e-05,-6e-05,1.7e-05,-6.2e-05,6.4e-05,2e-06,-4e-05,1e-06,-2.5e-05,0.000149,-8e-06,2.1e-05,-8.9e-05,9.4e-05,-2.4e-05,3.2e-05,0.000158,-7.7e-05,-1.8e-05,-1.9e-05,0.000181,-9e-06,-2.1e-05,-7.6e-05,-3.3e-05,2.2e-05,-5.7e-05,4e-05,-1.1e-05,-0.000335,0.000236,-0.000168,-0.000158,-0.00013,0.000197,7.7e-05,0.000329,-8e-06,3.8e-05,-3.3e-05,5e-05,-2e-06,-0.000168,3.6e-05,0.000117,-2.1e-05,0.000107,4.3e-05,-1e-05,-3.3e-05,0.000128,-3.3e-05,6.1e-05,4.4e-05,-6.9e-05,1.3e-05,-1.8e-05,-1e-05,2.9e-05,6e-06,8.5e-05,2.6e-05,0,-3.2e-05,7.4e-05,-4.9e-05,7.6e-05,-8.6e-05,9.1e-05,2.4e-05,-3.8e-05,5.4e-05,-5.9e-05,3.5e-05,-0.000135,2.8e-05,3.4e-05,-3.7e-05,2.4e-05,0.000131,1.9e-05,-3.7e-05,4.7e-05,-0.000199,-0.000179
0,1e-06,-3e-06,0,3e-06,-2e-06,0,1.4e-05,-2e-06,2e-06,2e-06,6e-06,-1e-06,1e-06,-8e-06,1.7e-05,-1.8e-05,6e-06,-6e-06,-3e-06,1e-06,-1.7e-05,3e-06,2e-06,2.3e-05,-3.1e-05,2e-06,6e-06,2.5e-05,1.1e-05,1.6e-05,3.5e-05,0.000127,2.7e-05,2e-05,6.8e-05,1.7e-05,8.1e-05,-3.3e-05,5.4e-05,-5.8e-05,6e-06,5.8e-05,3e-06,2.4e-05,4.2e-05,-3.2e-05,2e-06,3.8e-05,-0.000202,-5.4e-05,-9.4e-05,-0.000125,9.9e-05,2.1e-05,4.4e-05,-0.00016,1.4e-05,1.4e-05,0.000122,2.4e-05,4e-06,-1.7e-05,-6.7e-05,-1.5e-05,0.000442,-0.000242,0.000146,0.000149,8.5e-05,-0.000145,-0.000203,-0.000282,3.9e-05,-8e-06,-6e-06,-0.000144,1.5e-05,0.000152,3e-06,-0.000119,-2.4e-05,-5.1e-05,5.4e-05,-2.1e-05,3.7e-05,-9.7e-05,4.8e-05,5e-06,-5.7e-05,0.000132,4e-06,6.9e-05,5.8e-05,2.3e-05,2.8e-05,-0.000146,-1.4e-05,5.3e-05,4.2e-05,-8.2e-05,8.7e-05,-7.4e-05,0.000116,-9.9e-05,-3.9e-05,5e-05,5.3e-05,-1.4e-05,-3e-06,0.000159,1.3e-05,-1.9e-05,2.7e-05,7.8e-05,-5.2e-05,-3.5e-05,-2e-05,5.3e-05,0.000194,0.000331
0,0,-1e-06,1e-06,-1e-06,3e-06,-1e-06,-6e-06,-2e-06,-1e-06,-3e-06,-2e-06,-2e-06,-9e-06,0,-1.5e-05,2e-05,-2e-06,2.1e-05,-3e-06,-1.6e-05,2.4e-05,-3e-06,1.9e-05,-1.7e-05,2e-05,0,-7e-06,-3e-05,-2.6e-05,-5e-06,-1.8e-05,-0.000105,2e-06,-1.5e-05,-2.8e-05,-2.3e-05,-1e-04,3.2e-05,4e-06,3.7e-05,-3.9e-05,-5.5e-05,5e-06,4e-06,-0.000166,4e-05,3e-06,-5.2e-05,0.000188,-3.1e-05,6.1e-05,2e-06,-5.4e-05,-5e-06,-2.5e-05,6.2e-05,0,2e-06,-4.6e-05,2.6e-05,-4e-06,4.8e-05,5.3e-05,1.4e-05,-0.000439,0.000253,-6.3e-05,-0.000161,5.9e-05,7.6e-05,0.00027,0.000205,-8.1e-05,-1.4e-05,6e-05,0.000225,-2e-05,-0.000118,-1.9e-05,0.000111,3.5e-05,-3.9e-05,-6.3e-05,2.9e-05,-5e-05,5.6e-05,-5.3e-05,-5.1e-05,6.5e-05,-7.9e-05,8e-06,-6.8e-05,-3.5e-05,-4.9e-05,-2.6e-05,0.000153,-1e-06,-1.4e-05,-1.3e-05,6.7e-05,-9.2e-05,6.9e-05,-9.6e-05,4.9e-05,0.000111,-8.4e-05,-2.2e-05,0.000127,-1.7e-05,-9.9e-05,-4e-06,-1e-06,-3.2e-05,-7e-06,-9.5e-05,2.3e-05,9e-06,-0.000107,-0.000209,-0.000422
1e-06,0,2e-06,0,-5e-06,-2e-06,-1e-06,-5e-06,-1e-06,0,0,-3e-06,-4e-06,1.1e-05,-6e-06,0,-1.4e-05,7e-06,-1.5e-05,1e-06,2.9e-05,-1.5e-05,3e-06,-1.7e-05,-8e-06,2.4e-05,0,-1.3e-05,3e-06,1.7e-05,-2e-06,-2.4e-05,4.6e-05,-1.2e-05,2.3e-05,-1.5e-05,4e-06,8.7e-05,-1.9e-05,-3.5e-05,0,4.8e-05,6.9e-05,-1e-06,6e-06,0.000208,-2e-05,5e-06,1.6e-05,-4.4e-05,3.8e-05,-9.2e-05,4.9e-05,-1e-06,-4e-06,2e-06,1.7e-05,2e-05,1e-06,-3.9e-05,-7e-06,4e-06,-5e-06,-1.1e-05,2e-06,0.000377,-0.000257,5e-06,0.000159,-0.000113,-2.4e-05,-0.000277,-0.000156,8.5e-05,6e-06,-3.8e-05,-0.000243,-1e-06,6.7e-05,3.7e-05,-0.000135,3e-06,8.2e-05,-1e-05,-3.6e-05,4.8e-05,-3.9e-05,1e-06,1.5e-05,-1.7e-05,-3.6e-05,-3e-06,4.3e-05,-3.1e-05,-5.6e-05,7e-06,-0.000147,1.1e-05,-1e-06,2e-06,-3.4e-05,6.3e-05,-4.1e-05,-1.1e-05,1.8e-05,-6.8e-05,8.4e-05,-6.9e-05,-0.000123,2e-05,-2.4e-05,8e-06,2e-06,7e-06,-0.000102,7.7e-05,-4.3e-05,2.5e-05,9.1e-05,0.000167,0.000292
-1e-06,-1e-06,0,-3e-06,2e-06,1e-06,-2e-06,-8e-06,-2e-06,1e-06,-1e-06,-1e-06,3e-06,-7e-06,-4e-06,5e-06,-1.5e-05,-1.1e-05,3e-06,2e-06,-2.8e-05,2.1e-05,-7e-06,-3e-06,1.7e-05,2e-06,-8e-06,7e-06,-2e-06,1e-06,2.4e-05,7e-06,-1.2e-05,3.1e-05,-3.3e-05,3e-05,3.9e-05,-4.5e-05,2e-06,1e-05,-5.1e-05,-2.7e-05,-0.000102,3e-06,-3e-05,-8e-05,7e-06,-1.3e-05,-5e-06,-8.7e-05,3.6e-05,4.5e-05,-4.1e-05,2.8e-05,-4e-06,-2.1e-05,-9e-05,-9e-06,-7e-06,7e-05,-4.3e-05,1.1e-05,-4e-05,-1e-05,-7e-06,-0.000227,0.000244,-1.9e-05,-9.5e-05,3.6e-05,-1e-05,0.000195,0.000143,-4.4e-05,-6e-06,-1.3e-05,0.000183,9e-06,-3e-05,-3.7e-05,0.000151,-2e-05,-9.4e-05,4.5e-05,2.5e-05,-5e-06,2.4e-05,1.4e-05,4e-06,-3.3e-05,8.9e-05,-2e-06,-4e-06,5.8e-05,5.3e-05,1.4e-05,0.000132,-5e-06,-4e-06,-2.1e-05,3e-06,-3.8e-05,1.5e-05,9.4e-05,-6.3e-05,-3.1e-05,-7e-06,6.6e-05,2.7e-05,-4.2e-05,0.000153,-2e-05,-5e-06,-1e-06,5.4e-05,4.9e-05,5e-05,-1.7e-05,-3.3e-05,-8.8e-05,-8.2e-05
0,0,-3e-06,0,-3e-06,-1e-06,-1e-06,4e-06,2e-06,-2e-06,1e-06,1e-06,-7e-06,-1e-06,2e-06,-8e-06,2.3e-05,3e-06,-2e-06,5e-06,2e-05,-1.9e-05,-2e-06,8e-06,-4e-06,-2.2e-05,4e-06,1.1e-05,6e-06,-1.8e-05,-3e-05,0,3.4e-05,-1.6e-05,-2e-06,-4.1e-05,-3.3e-05,-5e-06,1.2e-05,4e-06,9.6e-05,2.1e-05,0.00011,2e-06,1.6e-05,-0.000124,1e-05,-3e-06,2e-05,0.000119,1e-05,-1.1e-05,-4.6e-05,-6e-06,-8e-06,4.4e-05,0.000128,-2.3e-05,2e-06,-3.4e-05,-1.7e-05,4e-06,3.3e-05,7e-06,8e-06,4.9e-05,-0.000237,1.6e-05,1.2e-05,6.4e-05,9.6e-05,-4.9e-05,-9.9e-05,2.5e-05,6e-06,2.7e-05,-0.000116,-8e-06,-1.5e-05,-2.6e-05,-0.000156,2e-06,8.6e-05,-3e-06,-3.2e-05,-6.7e-05,-6e-06,-4.2e-05,-1e-06,5e-05,-6.6e-05,-2e-06,-3.8e-05,-4.1e-05,6.4e-05,8e-06,-0.000103,-4e-06,-1.9e-05,3.3e-05,1.6e-05,6e-06,1.9e-05,-0.000104,7.2e-05,2.3e-05,-8e-06,6.3e-05,-7e-06,2.7e-05,-0.000176,1e-05,-3e-06,0,-4.9e-05,-8e-05,-3.3e-05,-1.4e-05,-3.5e-05,2.2e-05,-1e-05
0,1e-06,0,1e-06,-1e-06,2e-06,1e-06,3e-06,-4e-06,0,0,-4e-06,5e-06,8e-06,-2e-06,1.3e-05,-9e-06,5e-06,-1.3e-05,1e-06,-8e-06,1.3e-05,1.2e-05,-4e-06,-9e-06,7e-06,3e-06,-4e-06,-1.3e-05,0,2.9e-05,2.2e-05,-5.1e-05,-2e-06,1.7e-05,4.8e-05,-2.3e-05,3.6e-05,-1.8e-05,2.7e-05,-9.3e-05,-8e-06,-6.4e-05,0,1e-06,0.000172,-2.4e-05,-7e-06,0,-6.2e-05,-2.6e-05,-3e-05,7.5e-05,-1.3e-05,-1e-06,-4.4e-05,-0.000111,1.2e-05,-3e-06,-2.3e-05,1.4e-05,-6e-06,1.4e-05,8e-06,-1e-06,0.000116,0.000232,-6e-06,6.1e-05,-4.7e-05,-0.000141,-6.5e-05,2.4e-05,-2e-06,4e-06,-2.5e-05,7.2e-05,1.6e-05,6.2e-05,5.1e-05,0.000133,5e-06,-7.5e-05,-3.1e-05,2.6e-05,0.00011,-2.2e-05,3.3e-05,-2e-06,-3.3e-05,6e-06,0,4.6e-05,7e-06,-7e-05,-3.2e-05,7e-05,1.6e-05,1.4e-05,-3.2e-05,-3.4e-05,6e-06,-3.5e-05,5.8e-05,-5.3e-05,-1.3e-05,2.6e-05,-0.000119,-7.7e-05,0,5.7e-05,1.7e-05,8e-06,1.1e-05,9.8e-05,0.000103,2.3e-05,8e-06,8.4e-05,8.2e-05,-9.1e-05
-1e-06,0,3e-06,1e-06,1e-06,-2e-06,-1e-06,4e-06,-4e-06,1e-06,-1e-06,-2e-06,1e-06,-1e-05,4e-06,-9e-06,-5e-06,-2e-06,1.1e-05,-1e-06,-6e-06,-8e-06,-5e-06,-3e-06,4e-06,2.3e-05,0,-3e-06,2.3e-05,5e-06,-4.4e-05,-5e-06,3.9e-05,7e-06,9e-06,-2.5e-05,4e-05,-4.1e-05,1.6e-05,-5.4e-05,4.2e-05,-1.7e-05,7e-06,-4e-06,5e-06,-3.5e-05,1.2e-05,6e-06,9e-06,-4.1e-05,-2.1e-05,4.9e-05,-4.5e-05,0,-7e-06,2.9e-05,5.7e-05,-5e-06,-5e-06,3.7e-05,1.6e-05,-2e-06,-4.8e-05,-2.6e-05,-1e-05,-0.000242,-0.000236,-1.5e-05,-0.000116,-3.2e-05,9e-05,0.000128,4.7e-05,-1.8e-05,1e-06,1.8e-05,-4.9e-05,-7e-06,-7.7e-05,-2e-05,-7e-05,3e-06,7.6e-05,6e-06,1e-06,-8.6e-05,3.7e-05,-9e-06,2.9e-05,9e-06,3.9e-05,1.7e-05,-2.5e-05,1.7e-05,-4.1e-05,2e-05,-4.8e-05,-2e-05,-1.4e-05,2.5e-05,4.4e-05,5e-06,4.5e-05,-1.4e-05,1.7e-05,8.4e-05,-4.7e-05,6.3e-05,7.5e-05,-2.7e-05,9.5e-05,-1.6e-05,2.2e-05,0,-0.000111,1.2e-05,-2e-06,1.6e-05,-8.2e-05,-0.000157,0.000232
0,0,1e-06,1e-06,-2e-06,1e-06,-1e-06,-1e-06,-1e-06,1e-06,-1e-06,3e-06,0,5e-06,2e-06,-3e-06,1.7e-05,-1e-06,-5e-06,1e-06,1.8e-05,1e-06,-7e-06,1e-05,9e-06,-9e-06,-2e-06,3e-06,-3e-06,1e-06,4.5e-05,-1.3e-05,2e-06,-3.5e-05,1.4e-05,-1.5e-05,-5e-06,4.8e-05,-7e-06,4.7e-05,2.3e-05,2.3e-05,-5e-06,2e-06,-9e-06,-0.000144,0,1.3e-05,-5e-06,1e-04,-8e-06,-3.8e-05,-1.7e-05,3e-05,1.8e-05,-2e-05,2.3e-05,-7e-06,1.2e-05,-2.4e-05,2.6e-05,-1e-06,3.1e-05,2.7e-05,3e-06,0.000304,0.000242,6.7e-05,0.000125,4.9e-05,1.2e-05,-0.000183,-9.2e-05,2.7e-05,7e-06,2e-06,4.1e-05,-1.1e-05,8.7e-05,-7e-06,5e-06,-1.3e-05,-9.7e-05,3.2e-05,-1.7e-05,2.5e-05,-5.6e-05,6e-06,-4.6e-05,6e-06,-6.3e-05,0,-7e-06,0,4.8e-05,-2e-06,4e-05,3e-06,-1e-06,-2.7e-05,-3.9e-05,-1.1e-05,-4.3e-05,-4e-06,1e-06,-0.000109,2.8e-05,-1.7e-05,-2.7e-05,4e-05,-0.000148,-7e-06,-2.3e-05,1e-06,6.5e-05,-0.000108,-5e-06,-9e-06,4e-05,0.00018,-0.000245
0,0,-2e-06,-1e-06,1e-06,0,0,-1e-06,0,-2e-06,-1e-06,0,4e-06,1e-06,0,1e-05,-1.8e-05,-2e-06,-1e-06,4e-06,-2.3e-05,-3e-06,7e-06,-1.2e-05,-1e-05,-2.3e-05,3e-06,-2e-06,-2.2e-05,-9e-06,-3.9e-05,4e-06,-3.4e-05,3.4e-05,-2.8e-05,3.3e-05,-1.8e-05,-5.9e-05,-5e-06,-4.4e-05,-7e-05,-1.8e-05,5.2e-05,-2e-06,4e-06,0.000169,-5e-06,-1e-06,6e-06,-6.2e-05,2.2e-05,4.3e-05,6.7e-05,-3.9e-05,2e-06,2.7e-05,-8.1e-05,8e-06,0,2e-05,-1.7e-05,3e-06,1.4e-05,-1.3e-05,0,-0.000298,-0.000232,-9.1e-05,-0.000118,7e-06,-8.7e-05,0.000203,0.000103,-5e-05,-5e-06,-1.7e-05,-2.8e-05,-9e-06,-6.8e-05,1.2e-05,3e-05,-2e-06,0.000142,-3e-05,-3e-06,5e-06,5.6e-05,2.5e-05,3.6e-05,-2e-05,5.6e-05,-9e-06,4.5e-05,-2.1e-05,3.7e-05,2e-06,-1.5e-05,9e-06,1.4e-05,2.1e-05,3e-05,3e-06,3.2e-05,1.8e-05,-1.7e-05,1.9e-05,8e-06,6.9e-05,1.1e-05,-3.1e-05,8e-05,4e-06,8e-06,-6e-06,1.5e-05,0.000108,1.1e-05,-1.3e-05,8e-06,-0.000178,0.000155
1e-06,0,0,-1e-06,-2e-06,-1e-06,0,1e-06,2e-06,1e-06,0,-2e-06,2e-06,-6e-06,4e-06,-8e-06,-2e-06,4e-06,1.2e-05,2e-06,2.1e-05,-2e-06,0,3e-06,1e-06,1e-06,-1e-06,-5e-06,1.9e-05,-2e-06,4.7e-05,-2e-06,3.6e-05,1e-05,-1.3e-05,-3.7e-05,1.7e-05,4.9e-05,1.3e-05,6.9e-05,8.6e-05,1.9e-05,-7.8e-05,-1e-06,2e-06,-5e-05,9e-06,2e-06,-2e-06,-2.4e-05,2.2e-05,-2.5e-05,-3.4e-05,1.1e-05,-4e-06,-3.6e-05,9.1e-05,6e-06,-6e-06,-6e-06,-2e-06,-3e-06,-2.9e-05,-2e-06,2e-06,0.000217,0.000219,6.3e-05,9.8e-05,-5.9e-05,8.5e-05,-0.000155,-0.000115,5e-05,-5e-06,1.1e-05,-6e-06,-6e-06,5.2e-05,5e-06,-2.3e-05,1.7e-05,-0.000182,-9e-06,2.5e-05,-5e-06,-7.8e-05,-2.8e-05,-1.3e-05,2.2e-05,-1.9e-05,0,-6.8e-05,1e-06,-3e-05,-1.7e-05,1.5e-05,-1.5e-05,-4e-06,-3e-06,-2.1e-05,1e-05,-1.8e-05,-1.1e-05,3.3e-05,1.6e-05,-1.5e-05,-0.000149,5.5e-05,2.9e-05,3.8e-05,4e-06,-1.7e-05,5e-06,1.5e-05,-6.8e-05,-1.2e-05,1.1e-05,-4.3e-05,0.000135,-1e-04
0,1e-06,1e-06,1e-06,-1e-06,0,0,-1e-06,-1e-06,1e-06,0,2e-06,0,8e-06,-2e-06,3e-06,1.5e-05,0,-1e-05,-1e-06,-1.3e-05,1e-05,-2e-06,1.1e-05,3e-06,1.7e-05,0,4e-06,-1e-06,2e-06,-4.8e-05,9e-06,-2e-05,-2.9e-05,9e-06,3.8e-05,-8e-06,-2.3e-05,-1.2e-05,-8.7e-05,-7.3e-05,-3e-06,3.6e-05,1e-06,-2e-06,-9.7e-05,-6e-06,-1.2e-05,-1.5e-05,8.8e-05,2e-06,2.1e-05,-1e-05,2.1e-05,-2e-06,3.4e-05,-7.2e-05,3e-06,-6e-06,-2.8e-05,-1.2e-05,-1.2e-05,3e-06,1.2e-05,3e-06,-0.00011,-0.000212,-2.2e-05,-5.5e-05,1.4e-05,-4.6e-05,7.8e-05,0.000153,-2.1e-05,1.2e-05,-8e-06,5.1e-05,1e-05,-2.2e-05,-2.4e-05,-2.1e-05,-7e-06,0.000194,2.8e-05,-4e-06,-7e-06,0.000103,2.5e-05,-1.2e-05,-1.6e-05,-4.3e-05,0,6.3e-05,2.4e-05,-1.6e-05,1.9e-05,-4.8e-05,1.2e-05,1.2e-05,-5e-06,9e-06,-2.2e-05,1e-06,2e-06,-3.9e-05,2.2e-05,2.5e-05,0.000123,-5.2e-05,-1.8e-05,-0.000128,-4e-06,-1e-06,-1e-05,-7.5e-05,-6.9e-05,6e-06,1.7e-05,6.2e-05,-4.6e-05,0.000154
0,0,0,-1e-06,1e-06,1e-06,-1e-06,-3e-06,-2e-06,-2e-06,-1e-06,0,1e-06,-5e-06,0,0,-1.4e-05,1e-06,7e-06,0,3e-06,-7e-06,2e-06,-1.3e-05,0,-4e-06,-1e-06,4e-06,-2.1e-05,-7e-06,4.1e-05,-5e-06,1.3e-05,1.3e-05,1.2e-05,-1.9e-05,-1.7e-05,-8e-06,5e-06,7.2e-05,3.8e-05,-1.2e-05,2.6e-05,0,1e-06,0.000146,2e-06,-6e-06,4e-06,-9.1e-05,-3.2e-05,1.5e-05,4.3e-05,-3.5e-05,2e-06,-2.3e-05,2.3e-05,-1e-06,6e-06,4.6e-05,4e-06,4e-06,2.5e-05,-1.3e-05,-5e-06,-2.1e-05,0.00021,-1.3e-05,-1.6e-05,5e-05,1e-05,9e-06,-0.000199,0,-8e-06,1.6e-05,-8.5e-05,6e-06,-1.4e-05,3.3e-05,5.2e-05,-1.3e-05,-0.000188,8e-06,-3.2e-05,7e-06,-0.000103,-6e-06,2.1e-05,2e-06,7.3e-05,4e-06,-3.5e-05,-2e-05,1.6e-05,-1e-05,8e-05,-1e-06,-7e-06,-1e-06,5e-06,3.1e-05,8e-06,-7e-06,2.6e-05,-9e-06,-3.4e-05,-6.2e-05,5.2e-05,8e-06,0.000119,-8e-06,2e-05,3e-06,2.4e-05,9.7e-05,-1.3e-05,-9e-06,-5.2e-05,-2.4e-05,-0.000236
0,0,-2e-06,0,-2e-06,-1e-06,1e-06,-4e-06,-1e-06,1e-06,-1e-06,-2e-06,0,0,0,-1e-06,6e-06,-4e-06,2e-06,1e-06,1e-05,8e-06,-1e-06,5e-06,-4e-06,-1.9e-05,-3e-06,-6e-06,2.1e-05,4e-06,-4.7e-05,-7e-06,-3.2e-05,-3e-06,1.4e-05,-1.5e-05,2.8e-05,3.4e-05,2e-06,-5.6e-05,1.9e-05,8e-06,-3.1e-05,0,-4e-06,-5.7e-05,0,2e-06,-2.2e-05,1.9e-05,-2e-05,-1.5e-05,-1.8e-05,2e-05,1e-06,2.2e-05,2.6e-05,3e-06,-1.4e-05,-2.6e-05,0,8e-06,-2.3e-05,5e-06,-1e-06,0.000149,-0.000213,5.1e-05,7.5e-05,-4.7e-05,1.6e-05,-9.9e-05,0.000213,2.3e-05,0,-9e-06,9.6e-05,6e-06,4e-05,-3.1e-05,-3.8e-05,1.4e-05,0.00017,-1.9e-05,2.5e-05,1.9e-05,9.3e-05,-8e-06,-1.1e-05,7e-06,-3.9e-05,-1e-06,-8e-06,6e-06,-1e-06,3e-06,-9.8e-05,-4e-06,-9e-06,5e-06,-1.8e-05,-2.5e-05,-2.2e-05,1.6e-05,-2e-06,-4.7e-05,-7e-06,5.1e-05,-5e-06,6e-06,-2.5e-05,1.3e-05,0,4e-06,-8e-06,-4.9e-05,8e-06,-2.1e-05,1.9e-05,1e-04,0.000211
0,0,0,1e-06,-1e-06,0,-1e-06,5e-06,-1e-06,0,0,-1e-06,-3e-06,6e-06,-2e-06,4e-06,8e-06,1e-06,-1e-05,0,-1.9e-05,-1.1e-05,-1e-06,4e-06,2e-06,4e-06,2e-06,-1e-06,4e-06,3e-06,4.7e-05,6e-06,5.2e-05,-1.6e-05,-9e-06,3.5e-05,8e-06,-4.3e-05,-9e-06,6.8e-05,-7.7e-05,-1.2e-05,-2.1e-05,-1e-06,7e-06,-7.9e-05,-4e-06,1e-06,3.2e-05,7.2e-05,1e-05,2.9e-05,-3.5e-05,1.2e-05,-5e-06,-3.3e-05,-5.8e-05,-2e-06,7e-06,-3.2e-05,5e-06,0,-4e-06,1e-06,3e-06,-0.00023,0.000213,-5e-05,-0.000106,-2.4e-05,-4e-05,0.000163,-0.000204,-2.9e-05,2e-06,-1.7e-05,-9.5e-05,1e-06,-6.2e-05,6e-06,9e-06,5e-06,-0.00015,-7e-06,-3e-06,-6.2e-05,-0.000107,1.4e-05,2e-06,-1.4e-05,-4e-05,-5e-06,4.2e-05,1e-05,-9e-06,-8e-06,0.000109,5e-06,5e-06,0,3e-05,1.7e-05,2.8e-05,-9e-06,-3e-05,1.4e-05,1.6e-05,-0.000117,-5.7e-05,-2e-05,-7.3e-05,6e-06,-3e-06,-5e-06,7.2e-05,-2.1e-05,-8e-06,4e-06,1.4e-05,-0.000161,-9.2e-05
