-0.000184,-0.001448,-0.002469,-0.001547,-0.001556,-0.001327,-0.000333,-0.001132,-0.001938,-0.002299,-0.001362,-0.001216,-0.001123,-0.001113,-0.001938,-0.003116,-0.002325,-0.001887,-0.000997,-0.003343,-0.001465,-0.000955,-0.001618,-0.001414,-0.002939,-0.003024,-0.002262,-0.001357,-0.001146,-0.000585,-0.001438,-0.000609,-0.001408,-0.001564,-0.001382,-0.000744,-0.001191,-0.002527,-0.002177,-0.002399,-0.0015,-0.001278,-0.000554,-0.001082,-0.000636,-0.001701,-0.000528,-0.000673,-0.001043,-0.000866,-0.000918,-0.000711,-0.00127,0.000235,-0.000913,-0.000238,1.6e-05,-0.000363,-0.000706,-0.000651,-0.000712,-0.000698,-0.001345,-0.001027,-0.000867,-0.000847,-0.001189,-0.000661,-0.000291,-0.001276,-0.000668,-0.000944,-0.000594,0.000484,-0.000539,0.000642,-0.000665,-0.000221,-0.000592,-0.000491,6e-06,-0.000253,0.000479,0.000149,-0.000337,0.000131,0.000473,-0.000638,-0.000587,3.1e-05,-0.000732,-0.000565,7e-06,0.000554,-0.00034,-0.002537,-0.00145,-0.000487,-0.000345,-0.000761,-0.000638,-0.000629,8.9e-05,7.8e-05,1e-04,-0.000725,-0.000315,-0.000605,-0.000208,-9.8e-05,-0.000982,-0.000818,-0.000581,-0.00049,-0.000493,-0.000252,-0.000336,-0.001153,-0.001363,-0.001023,-0.000897
-0.001375,-0.00111,0.001599,0.000456,-7.6e-05,-0.000765,5.9e-05,0.000367,0.000464,0.000119,-0.001101,-0.000572,0.000243,-0.001212,-0.001194,-0.000571,2.6e-05,-7.6e-05,0.000315,0.001555,-0.000826,-0.000713,-0.000408,0.000678,0.000239,-0.000904,-0.000803,-0.00154,-0.001183,-0.000512,-0.000868,-0.001176,0.000383,0.000609,0.000422,0.000598,-0.000892,0.000866,-0.001019,0.000138,-6.8e-05,-0.001123,-0.001436,-0.000762,0.000481,-0.000525,-0.000525,-0.001092,-0.000541,-0.000254,-0.001094,-0.001569,-0.00191,-0.00133,-0.001858,-0.002377,-0.001141,-0.000415,-0.001082,-0.002278,-0.000968,-0.000453,0.000331,0.00054,0.000438,-0.000269,8.9e-05,-0.000186,8.5e-05,0.000185,0.000114,0.00054,2.8e-05,-0.000549,-0.000288,-0.000916,-0.000263,-0.000371,0.000364,0.000226,-0.000804,-0.00074,0.000107,-0.000235,-0.000552,-0.000755,-0.001618,-6.7e-05,0.000123,0.000516,0.001045,0.000955,6.5e-05,-7.9e-05,-0.000121,0.001079,0.000838,-0.000504,-0.000286,0.000865,0.001041,0.000132,-3e-04,-0.000132,0.000152,0.000421,2e-04,6.8e-05,-0.000491,-0.000498,-0.00048,0.000334,-0.000957,-6e-04,-0.001318,-0.001056,-0.000948,1.9e-05,-0.000211,0.000272,-0.000134
-0.000394,0.000807,-0.000306,-0.000725,-0.000711,-0.001071,-0.001118,-0.001035,2.2e-05,-0.000369,-4.5e-05,0.000393,-0.001252,-0.000438,-4.5e-05,-0.001115,1.6e-05,4e-06,-0.000798,-5.2e-05,0.000131,-6e-06,-0.000134,-0.000659,-0.000824,0.00044,0.00073,-3.9e-05,-0.000378,-0.001229,0.000406,0.000815,-0.000834,-8e-05,-0.000146,-0.000349,-0.000541,-0.00157,-0.000424,-0.000891,-0.000605,0.00107,0.000719,0.000577,-0.000375,-8e-05,-0.00019,-7.4e-05,-0.000522,0.00047,0.000144,-1.7e-05,0.000674,-0.000491,0.001651,1.9e-05,0.000451,0.000137,4.8e-05,-0.000271,0.000146,-0.000197,-8.2e-05,-0.000104,6.5e-05,0.000227,-0.000533,-0.00028,0.000266,-0.000929,-0.00113,-0.000512,-0.00066,-0.000436,-0.000461,-0.000979,-0.000932,8.1e-05,0.000442,1e-05,-0.001403,-0.001022,-0.000589,-0.00015,0.000339,-0.000248,-0.000168,-0.00034,-0.00017,-0.000736,-0.000682,-0.000467,-5e-06,-0.000641,-0.000339,-0.000849,0.000129,0.000143,0.000109,-0.000509,-0.00079,-0.000282,1e-05,6.8e-05,-0.00034,-0.000928,-0.000603,-4e-04,-0.000683,-2.7e-05,-8e-06,-0.000269,0.000129,7.7e-05,0.000595,-0.000177,0.000127,-0.000153,0.000223,-0.000427,4e-04
0.000261,-0.000404,0.000888,-0.000629,-5.5e-05,0.000448,0.000897,0.000786,-0.000241,0.00085,0.000504,0.000149,0.00053,0.000612,0.000672,0.001153,0.000372,0.000214,-0.000717,-0.000271,0.000377,0.000339,0.000275,0.001204,-0.000186,0.000839,-9.9e-05,0.000103,0.000636,0.000587,-0.000698,-0.000447,0.000545,-0.000194,-0.000663,-4.7e-05,0.000171,0.000615,0.000904,0.000645,0.000725,0.000281,0.000794,7.8e-05,-0.000281,0.000532,0.000687,0.000803,1.6e-05,-0.000221,0.000652,-0.000171,0.00048,0.000296,-0.000356,0.000814,0.000434,0.000165,0.000507,0.00114,0.000393,0.000588,-0.000108,0.000292,0.00037,0.000286,0.001048,0.000752,-0.000462,0.000729,0.000375,0.000347,-2.2e-05,0.000158,-0.000175,0.000238,0.000368,1.4e-05,-5.4e-05,-0.000407,0.000285,0.001023,-0.000291,-4e-05,-0.000159,-0.000668,0.000386,0.000609,-4e-05,-0.000382,0.000501,0.000366,0.000294,-0.000583,6.8e-05,0.000107,0.00036,-0.000506,-0.000492,-9e-06,0.000203,1.3e-05,-8.4e-05,0.000121,-0.000193,0.00017,0.000204,-0.000317,6.9e-05,-8.4e-05,-0.000481,0.000308,0.000395,0.000731,0.00037,0.000114,0.000184,2.9e-05,0.000376,1.2e-05,-0.000217
-7.6e-05,-5e-05,-0.000725,-0.000415,-0.001056,-0.000297,0.000387,-0.000309,-0.001179,-0.000972,-0.000443,-0.001168,-0.001122,-0.001011,-0.00093,-0.001801,-0.00104,-0.000562,0.000151,-2.4e-05,0.000148,-0.000805,-0.001364,-0.000949,-0.000531,-0.001293,-0.000905,-0.00025,-0.000854,-0.000837,3.4e-05,-0.000655,-0.000607,-0.000269,-0.000185,0.000201,0.000513,-0.000247,-0.000219,-0.000181,-0.000208,-0.000543,-0.001435,-0.000368,-5.9e-05,-0.000299,-0.000481,0.000142,0.000184,2.7e-05,-0.000594,0.000782,-9.1e-05,-3e-06,-0.000326,-0.000123,-0.000632,-0.000224,-0.00031,-0.000305,0.000231,-0.000279,0.000149,-0.000309,-0.000947,-0.00061,-0.000202,-0.000799,-0.00075,-0.000837,-0.001138,-0.000644,-7.9e-05,3.7e-05,0.000525,6.3e-05,1.5e-05,-0.000293,-0.000326,-0.000161,-0.000219,-0.000512,-9.3e-05,-0.000299,-0.000712,1e-05,-0.000456,-0.001065,-0.000555,-0.000371,-0.000787,-0.000789,-0.000371,-0.000349,-0.000474,-0.000112,-0.000799,-0.000589,-0.000569,-0.000495,-0.000467,-0.001064,-0.000919,-0.000951,-0.000193,-0.000467,-0.000418,-0.000245,-0.000177,-0.000176,0.000302,-0.000892,-0.000594,-0.001079,-0.000103,0.000518,-5.5e-05,-0.000134,-0.000726,-0.00047,5.7e-05
-0.000594,1e-04,-0.000374,-6.4e-05,0.000406,0.000174,-0.000356,-0.000709,0.000232,0.000408,-0.000376,0.000274,0.000266,0.000264,-0.000276,0.000847,-0.000289,-0.000113,8.5e-05,-4.4e-05,0.000438,0.000317,0.000793,-0.000541,3.6e-05,4e-05,0.000667,0.000216,-0.000372,5.1e-05,0.000662,0.000777,8.7e-05,5.4e-05,-0.000115,0.000264,3e-04,0.000963,0.000524,0.000833,-0.000276,-0.000182,0.000401,0.000233,-4.1e-05,-0.000127,-0.000278,-0.000211,0.000194,0.000535,0.000307,-0.000565,-0.000384,-0.000287,7.2e-05,-0.000524,-0.000274,-2.2e-05,0.000186,-9.6e-05,-0.000422,-5.7e-05,0.000166,0.000465,0.000384,0.000451,-0.000574,7.4e-05,0.000144,0.000354,0.000964,0.000552,0.000126,-9.4e-05,0.000255,0.000171,-0.000112,-0.000163,-0.000182,-0.000177,-0.000239,-0.000444,-7.8e-05,7.7e-05,3.2e-05,2e-05,-0.000795,-1.6e-05,0.000128,-0.000217,-7.7e-05,9.1e-05,-0.000345,0.000202,-0.000479,-0.000417,0.000304,0.000369,-7.8e-05,-6e-06,-2.7e-05,0.000483,1.1e-05,-0.000236,-0.000136,-0.000229,9.8e-05,0.000162,-5.2e-05,-0.000212,-0.000335,0.000146,0.000464,0.000742,-0.000424,-0.000593,-0.000401,1e-05,0.000506,0.000684,1e-04
0.000367,-0.000709,-0.000121,0.000421,0.00039,-0.001192,-0.00098,0.000668,0.000669,-0.000149,0.000171,0.000373,-0.000355,-0.000443,0.00132,0.000592,0.00039,-0.000155,5.2e-05,-0.000931,-0.001396,-3e-04,3.2e-05,5e-06,7e-05,-7e-06,-8.4e-05,-0.00035,0.000753,0.000727,0.000387,-0.000615,-0.000378,-0.000323,0.000254,6.5e-05,-0.000399,-0.000636,-0.000538,-0.001212,3e-06,5.1e-05,3e-05,0.000232,-6.9e-05,4e-05,0.000533,0.000126,4.1e-05,-0.000356,-0.00018,-2.9e-05,0.000115,0.000748,0.000761,0.000924,0.000245,-7.6e-05,-5.2e-05,0.000129,-5e-06,7.2e-05,4.4e-05,-0.000456,-0.000101,-0.00034,7.5e-05,-3.4e-05,0.000175,-0.000438,-0.00025,-0.000322,-0.000245,-0.000546,-0.000592,-0.000371,-0.000218,-0.000239,-2.2e-05,0.000217,-4.2e-05,-0.000284,-6e-06,-0.000169,6.8e-05,-0.000347,0.000335,2.2e-05,6.6e-05,3.4e-05,-0.000317,-0.000175,9.5e-05,-1.1e-05,0.000205,-0.000212,-0.000647,-6.9e-05,0.000237,-0.000258,-0.000196,-0.000446,2e-06,0.000215,3.9e-05,0.000282,-0.000486,7.4e-05,-0.000237,-0.000203,-0.000367,-3.5e-05,-0.000334,-0.000138,0.000254,0.000233,8.9e-05,0.000334,-0.00016,-0.00031,0.000258
6.2e-05,6.5e-05,-0.000142,-6.8e-05,0.000198,0.000717,0.000326,-0.00037,-2.6e-05,7.7e-05,0.000105,-0.000233,4e-04,0.000559,-0.000102,-0.000811,-0.000232,0.000551,-0.000311,5.4e-05,0.000336,0.000157,-0.000331,0.000509,-0.000327,-0.000137,-3e-04,5.3e-05,6.7e-05,-0.000122,-0.000557,-0.000181,0.000473,0.000134,-0.000255,-0.000579,0.00027,-0.000272,-4.3e-05,0.00036,-0.000117,0.000351,-0.000353,-0.000506,-0.000154,-0.000219,-0.00024,-0.000147,-0.000702,-0.000143,-0.000276,0.000506,0.00012,-0.000192,-0.000332,-0.000512,5.5e-05,-0.000201,2.2e-05,0.000131,-5.1e-05,0.000296,5.1e-05,0.000307,0.000191,-9.8e-05,9.5e-05,0.000458,7.2e-05,0.000434,0.000197,0.000112,-5.8e-05,0.000133,-3.7e-05,-5.2e-05,0.000154,0.000367,-0.000291,-0.000389,0.000448,0.000651,-0.00012,7e-06,3e-05,0.000376,4.7e-05,2.6e-05,-0.00017,0.000449,0.000158,-9.7e-05,-0.00015,-0.000174,3e-06,0.000393,0.000421,9.4e-05,-0.000229,0.000133,0.000205,0.000337,0.000174,0.000122,0.000241,0.000236,0.000311,-1.4e-05,0.000103,0.000393,0.000468,-3.9e-05,2.1e-05,7.5e-05,4.6e-05,0.000228,0.000233,-7.2e-05,5.1e-05,-5.1e-05,-0.000542
0.000335,0.000352,8.9e-05,0.000615,0.000171,0.000282,9.6e-05,0.000311,-0.000121,-0.000497,0.000227,0.000264,6.2e-05,0.000179,-0.000108,0.000536,0.000318,-0.000223,0.000309,0.000303,0.000198,0.000181,1.2e-05,-0.000405,0.000595,0.000826,0.000329,0.00044,-0.000345,-1e-04,-0.000142,0.000415,0.000252,5.1e-05,0.000564,2.2e-05,1.4e-05,-9.9e-05,-4.1e-05,0.000218,0.000551,-0.000467,4.4e-05,0.000337,9.6e-05,0.000448,-7.6e-05,-0.000202,0.00041,-0.000117,0.000233,-7e-06,0.000268,-0.000583,-0.000556,-0.000246,4.2e-05,0.000183,-0.000156,-0.00016,0.000189,-0.000103,-0.000223,-0.000128,-0.000102,-0.000133,-0.000258,-0.000306,-2.3e-05,0.000383,-6.1e-05,-0.000174,0.000324,0.000184,0.000173,0.000206,0.000307,0.000166,0.00018,0.00035,-1.1e-05,-0.000134,0.000109,0.000142,0.000131,0.000198,0.000302,6.9e-05,0.000313,3.4e-05,0.000483,0.000174,0.000111,0.000415,0.000246,6.4e-05,-0.000419,-4.5e-05,0.000473,0.000193,7.4e-05,0.000162,-8.2e-05,1.1e-05,6.6e-05,-0.000114,0.000362,0.000138,0.000262,-0.000119,8.7e-05,0.000581,0.000107,-0.000387,-0.000462,-0.000164,0.000152,1.3e-05,2.1e-05,7.5e-05,5.9e-05
-1.1e-05,0.000424,0.000266,-0.000567,-0.000552,9e-06,0.000168,-0.000196,-5e-06,0.000367,-0.000147,-0.000299,6.6e-05,2.9e-05,-7.1e-05,1.5e-05,0.000287,-0.000238,6.3e-05,0.000225,-0.000179,0.000215,0.000326,0.000383,4.4e-05,1e-06,6.1e-05,0.000229,0.000441,0.000441,0.000195,2.4e-05,-0.000299,9.9e-05,-0.00031,3.7e-05,0.000115,0.000221,0.000182,-0.000143,-0.00027,9.2e-05,9.8e-05,-5.1e-05,0.000185,-0.000103,-4.6e-05,0.00013,0.000223,-6e-05,0.000253,-0.000349,-0.000224,0.000234,0.000132,0.000576,0.000113,0.000224,-5.9e-05,1.7e-05,-8.6e-05,-0.000469,-2e-06,-0.000124,0.000157,0.000395,0.000327,-5e-05,0.000294,-0.000282,0.000151,0.000156,7.1e-05,8.6e-05,-5.6e-05,0.000151,-0.000188,7.6e-05,0.000315,8.7e-05,0.000239,0.000232,0.00017,-8.9e-05,0.000176,-0.000102,0.000147,0.000125,0.000209,0.000134,-1.9e-05,0.000211,0.00015,9.8e-05,0.000138,5.6e-05,0.00038,0.000171,-0.000119,0.000151,0.000102,9.6e-05,0.000345,0.000215,9.3e-05,2.9e-05,-5e-06,9.6e-05,0.000152,0.000128,-0.000106,-0.000157,0.000212,-0.000104,0.000222,-6e-05,-0.000134,3.3e-05,4e-05,0.000268,-1e-06
-0.000203,-0.000323,-0.000119,0.00055,0.000301,0.000205,-1.4e-05,0.00036,8.7e-05,0.000279,0.000252,0.000319,0.000146,-9.5e-05,9.4e-05,9.6e-05,-0.00019,0.000552,0.00017,7.5e-05,2.9e-05,-0.000341,-9.4e-05,3.4e-05,-9.8e-05,-0.000157,0.000159,-0.000683,-0.000261,0.000129,-0.000183,0.000346,5.9e-05,-7e-06,0.00021,0.000134,-0.000237,6.5e-05,0.000149,7.7e-05,-0.00016,2.2e-05,0.000149,-9.2e-05,5.8e-05,9.9e-05,0.000111,7.4e-05,-0.000118,7.4e-05,-0.000296,8.9e-05,8.8e-05,0.000373,2.9e-05,-0.000322,-6e-05,-0.000354,-2.1e-05,8.1e-05,9.1e-05,0.000318,6.7e-05,1e-04,-0.000148,-0.000116,-6e-06,0.000194,-0.000166,-5e-06,5e-06,-2.1e-05,-7.3e-05,3.2e-05,-6e-06,3e-06,2.9e-05,-0.000191,-3.9e-05,3.4e-05,-3e-05,1.4e-05,0.000182,0.00028,-7.8e-05,-9.4e-05,-0.000275,0.000118,-0.000237,-0.000214,-9.1e-05,7.9e-05,0.000122,-4.1e-05,-0.000116,4.1e-05,0.000157,6.9e-05,-0.000136,-4.1e-05,-5.3e-05,7.9e-05,-0.000225,-8.3e-05,-0.000113,2.7e-05,6e-05,-3.8e-05,-0.000158,-2.8e-05,-1.8e-05,8.7e-05,-0.000146,0.000133,5.3e-05,9.4e-05,-0.000243,0.000131,-7.4e-05,-0.000258,7.1e-05
-3e-06,1e-06,5e-05,-0.000393,-1.6e-05,5.1e-05,0.000225,-0.000225,5.6e-05,-0.000237,-0.000292,-5.3e-05,-0.00018,0.000175,-0.000154,-0.000396,-4.7e-05,-0.000266,-0.000207,-0.000108,0.000111,0.000436,-1e-04,-0.000104,-0.000291,-5.3e-05,-0.000162,0.000433,0.000113,-0.000391,1e-06,-0.000356,0.000131,-6e-06,-8.9e-05,-7.1e-05,-6e-05,-0.000162,-0.000114,-4.5e-05,-5.9e-05,-0.000185,-5.6e-05,2.7e-05,-0.000146,-4.5e-05,0.00013,4.7e-05,-8.6e-05,0.000148,0.000283,4.2e-05,-1.9e-05,-0.000129,0,7e-05,-0.000118,0.000109,7.2e-05,-0.000165,-4.9e-05,9.8e-05,1.1e-05,-0.00013,0.00013,5.8e-05,-9.4e-05,-6.5e-05,1e-04,4.2e-05,1.4e-05,8e-06,-2.8e-05,-9e-06,-0.000141,-5.8e-05,3.4e-05,-5.9e-05,-4.5e-05,-0.000143,-2.4e-05,-0.000189,-0.000155,-8.5e-05,1.2e-05,0.000181,0.000204,-0.000136,-7.8e-05,0.000172,5.3e-05,-6e-05,-0.00015,-4.8e-05,-4.6e-05,-0.000119,8.7e-05,-0.000228,0.000115,0.000136,4.1e-05,-0.000287,0.000188,3.2e-05,7.4e-05,-4e-06,-2.8e-05,-9.1e-05,1.6e-05,-3.5e-05,2.2e-05,-2e-06,-4.6e-05,0.000102,-0.000226,-6.4e-05,0.000301,-5.2e-05,-2.9e-05,-1.9e-05,4.2e-05
0.000147,7e-06,0.00011,-5.2e-05,2e-05,-0.000265,1.2e-05,0.00013,-0.000163,0.000166,7.4e-05,-9.7e-05,-7.2e-05,-0.00021,-4e-06,5.3e-05,-0.000102,0,-3.4e-05,-4.5e-05,0.000137,-0.000703,-9.1e-05,4.4e-05,0.000437,-1e-06,-0.00012,-9.2e-05,1.4e-05,4e-06,8.3e-05,0.000154,-0.000121,-7e-06,8.7e-05,0.000205,-3.9e-05,0.00027,-0.000235,-4e-06,0.000318,0.000147,-0.00013,-5.8e-05,8.9e-05,-0.000112,9.8e-05,-1.6e-05,0.000107,-6.1e-05,-0.000238,-0.000162,-0.000121,-0.000159,0.00015,-0.000118,7.7e-05,0.000224,0.000153,8.9e-05,-5e-06,-0.000112,-6.9e-05,6.1e-05,-5.6e-05,-7.3e-05,4e-05,5.4e-05,-0.000133,-0.00018,-0.000171,-4e-06,8e-06,-7e-05,0.000209,1.8e-05,-9.2e-05,1.6e-05,-0.000103,1.9e-05,-7.2e-05,0.000122,-4e-05,-6.1e-05,-0.000115,-8.7e-05,-6.7e-05,8.4e-05,0.000184,-0.00021,-0.000156,-8.8e-05,5.4e-05,-4.4e-05,3e-06,2.6e-05,-7.4e-05,7e-06,-0.000104,-3.9e-05,-4.9e-05,7.1e-05,-0.000126,4e-06,-2.2e-05,-6.6e-05,-8.3e-05,1.7e-05,-9.1e-05,4.6e-05,6e-06,-0.000158,3.5e-05,0.00012,0.000157,4e-06,-0.000169,-0.000247,-8.3e-05,0.000156,7e-05
-6.4e-05,-6.7e-05,2.7e-05,0.000152,-0.000134,-0.000127,-8.7e-05,-0.000142,5.5e-05,-0.000109,-7e-06,-1.8e-05,-4.7e-05,9.1e-05,-0.000246,7.9e-05,9.5e-05,-6e-06,0.000262,-4.5e-05,8.8e-05,0.000289,0.000117,8.4e-05,-0.000306,-1.9e-05,1.5e-05,4.3e-05,-6.6e-05,8.2e-05,8.2e-05,-0.000249,2.2e-05,-9.4e-05,-2.5e-05,5.1e-05,6.1e-05,-2.7e-05,0.000202,-9e-05,-0.000225,-0.000171,0.000161,4.1e-05,7.7e-05,7.6e-05,-7.9e-05,-2.3e-05,1.5e-05,-9.1e-05,8e-05,0.00018,4.6e-05,-4e-05,-1.9e-05,-1.5e-05,-2.5e-05,-0.000124,-3.4e-05,-6.4e-05,-1.2e-05,-3.8e-05,7.7e-05,0.000117,5.3e-05,-7e-06,1.7e-05,-1.7e-05,9.4e-05,1.5e-05,2.7e-05,2e-06,-8.2e-05,2.3e-05,-7.3e-05,-1.7e-05,4.9e-05,-2.1e-05,1.9e-05,4.2e-05,3e-05,-3.1e-05,-8.2e-05,-7e-06,-3.6e-05,-3.4e-05,-7.5e-05,-3.6e-05,-1.3e-05,4.3e-05,2.8e-05,-6.5e-05,1.2e-05,5e-05,2.3e-05,2.7e-05,-0.000108,-6.5e-05,5e-05,-0.000168,5.1e-05,1e-05,-7.1e-05,1.5e-05,-3.1e-05,2.2e-05,-4e-05,-9.1e-05,2.6e-05,-3.7e-05,-3.2e-05,9.5e-05,6e-06,-5.9e-05,0.000114,-3.2e-05,3.9e-05,-2.1e-05,5.9e-05,-4.7e-05,-0.000133
-6.9e-05,-5.4e-05,-0.000103,-0.000145,3e-05,0.000101,-1e-06,7e-06,-5.7e-05,-2.9e-05,-3e-06,5.1e-05,0.000166,2.6e-05,0.000135,-6e-05,-4e-06,7e-06,-0.000267,1.7e-05,-8e-06,1.2e-05,0,-0.000143,-8e-06,-4e-05,-2e-05,-0.000242,-5e-05,-0.000129,-4.4e-05,8.9e-05,2e-05,3.2e-05,-5e-06,-7e-06,-1.8e-05,-1.5e-05,-3.2e-05,8.6e-05,0.000136,0.000122,-3.8e-05,-4.3e-05,-0.000118,-3.1e-05,-7e-05,1e-05,-6.8e-05,8.1e-05,3.9e-05,-3.2e-05,2.7e-05,0.000129,-4.3e-05,7e-05,9e-06,-6.8e-05,5e-06,4.8e-05,-5e-06,8e-06,4.8e-05,-4.1e-05,-5.8e-05,-2e-05,-3.3e-05,-6e-05,-9.5e-05,6.1e-05,0.000112,7e-06,1.6e-05,1.3e-05,1.1e-05,-1.9e-05,7e-06,4.8e-05,3e-05,4e-06,-4.2e-05,-1.2e-05,4.5e-05,7e-05,8.5e-05,0,7.4e-05,1.1e-05,-6.6e-05,-2.5e-05,-1e-06,3.4e-05,-2.4e-05,-0.000152,-2.1e-05,1e-06,1.5e-05,1.8e-05,3.9e-05,8.2e-05,-6.9e-05,1.6e-05,1.5e-05,-2.6e-05,-7e-06,-3.4e-05,-2e-06,6.2e-05,-8e-06,0,4.8e-05,-4.3e-05,-4.1e-05,-3.5e-05,9e-06,3e-06,7.1e-05,0.000107,-1.2e-05,1.2e-05,0.000111
4.6e-05,4.4e-05,-6.4e-05,-3.6e-05,2.2e-05,-2e-06,-2.3e-05,3.4e-05,-2.1e-05,-4e-05,2.3e-05,-2.3e-05,-5.1e-05,-5.3e-05,-2e-06,-3.8e-05,1.1e-05,-7.5e-05,-7.4e-05,3e-05,-7e-05,-0.00012,-4.4e-05,8.8e-05,3e-06,3e-06,6.4e-05,0.000166,7e-05,0.000104,0.000144,-3.1e-05,-8.6e-05,6.6e-05,-8e-06,-4.3e-05,5.9e-05,9e-06,-3e-06,5e-06,-7.7e-05,2.4e-05,2.5e-05,-2e-06,-1.4e-05,-6e-06,2.4e-05,-5e-06,-4.2e-05,6e-05,-6.5e-05,-3.8e-05,6e-06,3.3e-05,1.3e-05,1.1e-05,1.7e-05,0,2.5e-05,6.8e-05,1.8e-05,1e-06,-6.5e-05,-6.5e-05,2e-06,1e-05,3.6e-05,4.2e-05,2.8e-05,2e-05,-5.3e-05,0,2.3e-05,-4.6e-05,2e-05,5e-06,-6.2e-05,1e-05,-2e-05,-2.3e-05,-2.1e-05,2.9e-05,1.3e-05,-3.6e-05,-3.4e-05,3.3e-05,-3.9e-05,2e-06,1.4e-05,-7e-06,4.8e-05,6.3e-05,-4e-06,9.1e-05,-7e-06,-1.7e-05,2.1e-05,-2e-06,-7.5e-05,2.2e-05,7e-06,2.6e-05,-5.8e-05,5e-06,9e-06,3e-06,6.8e-05,-1.2e-05,2e-06,6e-06,-1.2e-05,-3.7e-05,-3.4e-05,4e-06,4.7e-05,-3.6e-05,-6.6e-05,3.7e-05,-1.1e-05,2e-06,-1.4e-05
-3.9e-05,1e-04,-9e-06,0.000117,5.6e-05,5.4e-05,-3.5e-05,3.2e-05,6.6e-05,4e-06,1e-06,1.2e-05,-3.2e-05,-7e-06,8.9e-05,4e-05,-8.9e-05,0.000175,0.000167,3.6e-05,-7.8e-05,7.4e-05,-5.7e-05,-6.7e-05,0.000107,2.7e-05,-7.4e-05,-3.7e-05,4.7e-05,-0.000114,-5.8e-05,6.7e-05,2.6e-05,-2.6e-05,-1e-06,-5.1e-05,1.3e-05,-4.7e-05,3e-05,-7e-06,-1.9e-05,5.9e-05,-4e-06,4.7e-05,6.1e-05,4.4e-05,-3e-06,-3.5e-05,0.000137,-6.8e-05,6.4e-05,5.5e-05,3e-06,-9.8e-05,3.4e-05,-5.4e-05,-7.1e-05,4.9e-05,-2.5e-05,-3.5e-05,0,4.9e-05,-2.1e-05,1.5e-05,-9e-06,2e-06,-2.2e-05,-2.2e-05,2.6e-05,-9.5e-05,1.7e-05,-4e-06,-2.3e-05,2.3e-05,1.9e-05,1.3e-05,2.3e-05,-2.7e-05,3e-06,-5e-06,9e-06,-1.5e-05,-2.5e-05,-4.3e-05,2.5e-05,-3.9e-05,-1.3e-05,-4.4e-05,1.4e-05,8e-06,-3.3e-05,-2.1e-05,5e-06,-3e-05,1e-06,-6e-06,1.4e-05,-2.8e-05,2.1e-05,6e-06,0,-7.7e-05,8.5e-05,-2.3e-05,-2e-05,1.5e-05,-2.3e-05,-3e-05,3.5e-05,-8e-06,-3.1e-05,-2e-06,1e-05,-2.8e-05,-9.7e-05,2.1e-05,-2.2e-05,-7.7e-05,1.8e-05,6e-06,-7.1e-05
-1e-05,-5.7e-05,4.4e-05,-0.000136,-5.5e-05,2.5e-05,-1.3e-05,-0.000102,-3.3e-05,2.3e-05,-4.6e-05,-5.2e-05,2.3e-05,2e-06,-5.8e-05,7e-06,3.9e-05,-9.6e-05,-4.6e-05,2e-06,7e-06,-7.4e-05,9.9e-05,4.2e-05,-7.4e-05,-7.3e-05,1.4e-05,2.3e-05,-4e-05,6e-06,1.9e-05,1.7e-05,2.4e-05,-3.3e-05,9e-06,-1.7e-05,3.1e-05,3e-05,4.1e-05,-7e-06,-4.3e-05,-0.000104,-2e-05,-2.3e-05,-1.9e-05,-4.7e-05,8e-06,-1e-05,-1.9e-05,-2.5e-05,-2.9e-05,3e-05,-2e-05,4.6e-05,7e-06,0.000107,4e-06,-1e-05,-2.7e-05,3.9e-05,7e-06,9e-06,1.3e-05,1.5e-05,3e-06,1.2e-05,-1e-06,3.1e-05,-1.2e-05,3e-05,5e-06,7e-06,1.6e-05,1e-06,-4.3e-05,-1.5e-05,-9e-06,-1.6e-05,3.6e-05,1.3e-05,-1.4e-05,-4.7e-05,3e-06,2.8e-05,-4.4e-05,3.2e-05,3.7e-05,4.5e-05,-4e-05,2.2e-05,-2.8e-05,-2.7e-05,-2e-05,1e-06,-1.5e-05,-1.3e-05,-2.8e-05,2.1e-05,-1.4e-05,-3.6e-05,-1.2e-05,1.9e-05,-2.8e-05,1.7e-05,-3e-06,-1.7e-05,-4.1e-05,7e-06,-5.5e-05,-1.1e-05,5e-06,-2.8e-05,-4e-06,-8e-06,-1.4e-05,-1.3e-05,4.6e-05,-1e-05,-5e-06,-1e-05,-3e-06
2.5e-05,-5.1e-05,4e-05,7.4e-05,-2e-05,-7.6e-05,3.8e-05,9.1e-05,1.1e-05,5.3e-05,5e-06,4.5e-05,-4.3e-05,6e-06,4.7e-05,1.8e-05,-1.4e-05,-2.2e-05,-4.9e-05,-3.1e-05,1.7e-05,7.2e-05,-1.3e-05,3.8e-05,-1.4e-05,1.3e-05,1e-06,-4.1e-05,-2.3e-05,8.5e-05,-9.2e-05,-3.5e-05,2.3e-05,2e-06,-6e-06,1.9e-05,-1.9e-05,-2.5e-05,-3e-05,1.3e-05,9.4e-05,7e-06,4.9e-05,-5e-06,-2.3e-05,-2e-06,-2e-06,0,-6.2e-05,1.6e-05,-1.2e-05,-4.9e-05,6e-06,9e-06,-6.7e-05,-6.6e-05,1.7e-05,-2.4e-05,-4e-05,-2.5e-05,-3e-06,-4.7e-05,1.7e-05,-1.9e-05,2.6e-05,-6e-06,2.5e-05,-2.1e-05,-1e-05,1e-05,1.7e-05,-1e-06,-4.6e-05,-6e-06,-1.3e-05,-7e-06,1.6e-05,1.3e-05,-1.7e-05,-1.7e-05,6e-06,2.1e-05,-2e-06,-6e-06,-7e-06,-6e-06,-6.4e-05,-4.5e-05,-1.2e-05,-1e-06,2e-06,-1.3e-05,1.6e-05,-1.9e-05,2e-06,1e-06,3e-05,-1.4e-05,3.3e-05,-1e-06,-1.6e-05,-3.9e-05,-1e-05,9e-06,-3e-06,-1.2e-05,4e-06,-1.2e-05,2.1e-05,1.3e-05,5e-06,3.6e-05,4e-06,-5.9e-05,8e-06,9e-06,-9e-06,5.1e-05,2.9e-05,-3.5e-05,2.2e-05
-6e-06,-1e-06,3e-06,-2.4e-05,1.8e-05,-2.3e-05,-1.4e-05,-8e-05,-5e-06,-3.1e-05,2e-06,-1.8e-05,2.7e-05,-2.8e-05,1.3e-05,-2.5e-05,7.3e-05,-3e-06,1.7e-05,-3.5e-05,2.9e-05,-3.3e-05,-3.7e-05,-5.5e-05,1.7e-05,-1.8e-05,-1.1e-05,4e-05,3.7e-05,-8.2e-05,4.3e-05,-3e-06,-5.9e-05,1.8e-05,1.6e-05,-6e-06,-7e-06,0,4e-06,-1.7e-05,-2.5e-05,2.6e-05,-2.1e-05,6e-06,-4e-06,-3e-06,-2.6e-05,7e-06,3.2e-05,4.4e-05,3.8e-05,4.1e-05,6e-06,-6e-06,-3.1e-05,1.3e-05,-2e-06,4.5e-05,4e-06,-1.3e-05,-5e-06,4e-06,-7e-06,2.6e-05,-3.6e-05,-9e-06,-2.7e-05,-7e-06,-2.4e-05,-7e-06,3e-06,-5e-06,3e-05,-6e-06,2.7e-05,-2e-06,-8e-06,1.5e-05,-2.5e-05,3e-06,-7e-06,2e-06,-2.6e-05,-1.4e-05,1e-05,-1e-06,3.7e-05,1.7e-05,3.4e-05,-1.7e-05,1.4e-05,-2e-05,-1.7e-05,1.3e-05,1.6e-05,1e-05,-6e-05,1e-05,1e-06,3e-06,1.5e-05,3.7e-05,-1.4e-05,-2.1e-05,-1.1e-05,1.2e-05,-3.2e-05,1e-05,-3e-06,-9e-06,1e-06,-2.2e-05,-1.2e-05,3.4e-05,-1e-06,6e-06,4e-06,2.7e-05,-4e-06,2.4e-05,2.9e-05
2e-06,3.8e-05,-3.5e-05,2.9e-05,1.1e-05,3.2e-05,3e-06,4e-05,1.5e-05,0,1.8e-05,-8e-06,-6e-06,1.5e-05,7.6e-05,3e-05,-1.1e-05,4.8e-05,2.7e-05,-2e-06,2.1e-05,-1e-06,4e-06,-2.3e-05,3.5e-05,4e-05,1.8e-05,8e-06,-2e-06,4.9e-05,-3.8e-05,-1.7e-05,2.3e-05,-2.6e-05,-3.8e-05,2.8e-05,-2e-06,2.7e-05,-1.6e-05,-1e-05,3e-06,-6e-06,-2e-06,-2e-06,5e-06,1.2e-05,1.3e-05,1e-06,2.8e-05,-2.5e-05,-4.5e-05,-3e-05,5e-06,7e-06,2.9e-05,2.1e-05,2.3e-05,-2e-06,1.2e-05,1.9e-05,-4e-06,2.6e-05,-9e-06,-2.2e-05,1.8e-05,-1e-06,5e-06,1.1e-05,4.1e-05,1.7e-05,-1.8e-05,0,-1.8e-05,5e-06,-7e-06,-4e-06,7e-06,0,-2e-06,-4e-06,6e-06,-3.2e-05,6e-06,0,1e-05,-1.3e-05,-9e-06,-6e-06,-1.1e-05,2.1e-05,3e-06,1.4e-05,-2e-06,1.9e-05,-9e-06,-7e-06,4.6e-05,-1.1e-05,-1.3e-05,-2.1e-05,-7e-06,3e-06,1e-06,7e-06,1.6e-05,0,2e-05,-8e-06,0,2e-06,-3e-06,-1e-06,1.5e-05,3.8e-05,1.3e-05,0,-1e-06,-1.8e-05,1e-06,1.9e-05,-2e-05
-4e-06,-3e-06,-3.3e-05,-1.8e-05,1.3e-05,-2e-06,-4e-06,-6e-06,0,-1.3e-05,-1.1e-05,2.2e-05,-2e-06,-1e-05,-3.7e-05,8e-06,6e-06,-2.9e-05,-2.2e-05,1.3e-05,4e-06,4.8e-05,2e-05,3.4e-05,-5.1e-05,1.3e-05,-7e-06,-3.6e-05,-1.1e-05,1.2e-05,1.3e-05,2.6e-05,1.3e-05,6e-06,3.5e-05,1.4e-05,-1.6e-05,3.4e-05,-1e-06,1.8e-05,-3.7e-05,3.9e-05,8e-06,1.3e-05,9e-06,1.8e-05,1.5e-05,1e-06,-3e-06,-1.8e-05,2e-05,2e-06,2.1e-05,-1.8e-05,3.6e-05,-3e-05,-6e-06,-5.3e-05,1.4e-05,-3e-05,7e-06,2e-06,4e-06,-4e-06,-1.7e-05,-4e-06,1.1e-05,-7e-06,-3e-06,1.4e-05,1.7e-05,-4e-06,1.4e-05,-2e-06,-9e-06,3e-06,1.3e-05,-2e-06,1.6e-05,1.8e-05,-3e-06,4e-05,1e-05,2e-06,3e-06,2.4e-05,-1.4e-05,-8e-06,-1.8e-05,7e-06,1.4e-05,2.1e-05,6e-06,-1.2e-05,-6e-06,0,-6e-05,1e-05,-6e-06,1.8e-05,-1.3e-05,1e-05,1.2e-05,-1e-05,-1.5e-05,-6e-06,2.9e-05,1.1e-05,1.6e-05,1e-06,6e-06,1.2e-05,-7e-06,1.6e-05,1.2e-05,2e-06,-1.3e-05,-1.8e-05,2e-06,-3.4e-05,7e-06
-7e-06,1.3e-05,6e-06,2.1e-05,-2.2e-05,0,-2.4e-05,1e-06,8e-06,-9e-06,0,-1.7e-05,1.4e-05,0,1.9e-05,-5e-06,-3.3e-05,1.8e-05,-2.6e-05,2.5e-05,-2e-05,-4e-06,9e-06,-2.7e-05,-4e-06,-1e-05,1.4e-05,4.2e-05,3e-05,-2.5e-05,-4.2e-05,9e-06,-3.3e-05,2.1e-05,-4.3e-05,-1.6e-05,-1.2e-05,-1.8e-05,8e-06,-8e-06,1.5e-05,-4.4e-05,0,-1.7e-05,-1.3e-05,-8e-06,-1.8e-05,3e-06,-4.4e-05,1.8e-05,2e-06,-6e-06,-3.2e-05,0,-3e-06,2.6e-05,-2.9e-05,2.7e-05,1e-05,1e-05,-6e-06,-9e-06,1.7e-05,9e-06,1.2e-05,6e-06,-1.3e-05,1.5e-05,4e-06,-5e-06,1e-06,3e-06,-7e-06,-1e-06,6e-06,-5e-06,-2e-05,-1.1e-05,2e-05,-1.4e-05,8e-06,-2.9e-05,-6e-06,0,-2e-06,-1.2e-05,3e-05,9e-06,-2e-06,2e-06,-4e-06,3e-06,0,4e-06,5e-06,-1e-06,2.3e-05,-1e-06,3e-06,1.2e-05,1.8e-05,-2e-05,5e-06,5e-06,4e-06,4e-06,-1.4e-05,-6e-06,-2.5e-05,-4e-06,-1.2e-05,-9e-06,-2e-06,-4e-06,-1.2e-05,-1e-06,9e-06,1.8e-05,-6e-06,-4e-06,-5e-06
1e-05,7e-06,2.3e-05,-7e-06,-7e-06,1.4e-05,6e-06,-1.1e-05,-1.2e-05,1.3e-05,-2e-06,-5e-06,-6e-06,-4e-06,-4.2e-05,-1e-06,1.5e-05,2e-06,3.6e-05,3e-06,-2.4e-05,-5.1e-05,-2.3e-05,2.2e-05,3.8e-05,4e-06,6e-06,-2.7e-05,-1.8e-05,3.7e-05,6.1e-05,0,3.3e-05,-1.4e-05,3.7e-05,0,-1.3e-05,0,3e-06,7e-06,-6e-06,6e-06,9e-06,4e-06,-1.3e-05,2e-06,-5e-06,-4e-06,2.7e-05,8e-06,-2.8e-05,2e-05,1.9e-05,1.6e-05,-1.6e-05,4e-06,1.4e-05,2e-05,5e-06,-9e-06,1.1e-05,-9e-06,-4e-06,1.5e-05,1e-05,-1e-06,7e-06,-1.9e-05,-3e-05,-2.4e-05,-6e-06,0,1.1e-05,0,1.1e-05,7e-06,1.9e-05,3e-06,-1.1e-05,3e-06,1e-06,-9e-06,1.4e-05,1e-06,-4e-06,2e-06,-2.9e-05,-1.1e-05,1.7e-05,-7e-06,-1.5e-05,1e-06,-6e-06,1e-05,-4e-06,-6e-06,2.2e-05,1e-06,8e-06,-1.4e-05,-1.4e-05,-6e-06,2e-06,8e-06,4e-06,-1e-06,-2e-06,7e-06,2.7e-05,5e-06,2e-06,1.2e-05,1e-06,-3.1e-05,1e-06,4e-06,-1.4e-05,1.1e-05,-7e-06,1.7e-05,1.4e-05
3e-06,-1.5e-05,1.4e-05,6e-06,1.2e-05,3e-06,5e-06,1.8e-05,1.4e-05,0,2e-06,1.9e-05,-2e-06,8e-06,2.5e-05,4e-06,-2e-06,-4.6e-05,1e-06,-6e-06,-1e-06,6.8e-05,-2e-06,2.9e-05,-6e-06,-1e-05,-1e-05,3e-05,-9e-06,-2.5e-05,-1.8e-05,1.1e-05,-3e-06,-7e-06,-3.4e-05,-6e-06,-3e-06,1.7e-05,-4e-06,-9e-06,2.4e-05,7e-06,-1.2e-05,5e-06,2.3e-05,-9e-06,2e-06,-4e-06,3.3e-05,0,3.2e-05,-2.7e-05,-2.2e-05,-4e-06,-6e-06,-3.3e-05,-5e-06,-1.4e-05,-3e-06,-9e-06,-1e-05,-5e-06,-5e-06,-9e-06,-1e-05,3e-06,2e-06,4e-06,2.2e-05,2.1e-05,4e-06,2e-06,-1.7e-05,4e-06,-8e-06,0,0,2e-06,-5e-06,-9e-06,1e-06,1.4e-05,-2.2e-05,0,-4e-06,3e-06,6e-06,9e-06,-1e-06,1.5e-05,2e-06,-1.3e-05,3e-06,-7e-06,2e-06,4e-06,2e-06,-3e-06,7e-06,-7e-06,7e-06,5e-06,-1.3e-05,-9e-06,-2e-06,-2e-06,-6e-06,-4e-06,-1.7e-05,1e-06,3e-06,-5e-06,1e-06,5e-06,7e-06,-5e-06,3.3e-05,-1.8e-05,3e-06,1e-06,-2.1e-05
-3e-06,-2.1e-05,-5e-06,-2e-06,3e-06,-2.6e-05,0,-1.9e-05,-6e-06,1.4e-05,-2e-06,-5e-06,-9e-06,-1.1e-05,-2.2e-05,4e-06,1.6e-05,4.4e-05,-1.7e-05,-1.6e-05,-1e-06,-4.8e-05,1.7e-05,-4.9e-05,-3.4e-05,1.4e-05,4e-06,-3.4e-05,2.7e-05,3e-06,2.1e-05,-3e-05,-1.7e-05,0,2.4e-05,-2e-05,7e-06,-2.8e-05,4e-06,9e-06,-1.3e-05,-4e-06,3e-06,-5e-06,-1e-06,0,0,0,-3.6e-05,-1.2e-05,-2.8e-05,1.6e-05,1.5e-05,-6e-06,1.8e-05,2.4e-05,1.9e-05,-8e-06,-1e-05,1.4e-05,6e-06,8e-06,0,-2e-06,-2e-06,-1e-06,-1e-05,3e-06,-1e-06,6e-06,-8e-06,-1e-06,1.9e-05,-5e-06,-2e-06,-5e-06,-9e-06,5e-06,-4e-06,1e-05,3e-06,-4e-06,1.6e-05,-3e-06,6e-06,7e-06,1.4e-05,-8e-06,-1.1e-05,-1.5e-05,4e-06,-1.8e-05,-3e-06,1e-06,7e-06,5e-06,1.2e-05,1e-06,-8e-06,1.2e-05,-3e-06,1.1e-05,1.4e-05,1e-06,0,5e-06,1e-06,6e-06,2e-06,-1e-06,7e-06,1e-05,3e-06,-6e-06,-1.4e-05,5e-06,-2.4e-05,-1.4e-05,-7e-06,-1.5e-05,6e-06
1e-06,7e-06,-1.2e-05,1.1e-05,5e-06,7e-06,8e-06,1.3e-05,3e-06,-1.2e-05,1e-06,-3e-06,9e-06,1.1e-05,0,-3e-06,-1.3e-05,2e-06,3e-06,-9e-06,6e-06,1.4e-05,-2e-06,1e-05,1.8e-05,5e-06,-3e-06,3.4e-05,-1.7e-05,2.4e-05,-3e-05,2.6e-05,6e-06,4e-06,-2.3e-05,5e-06,4e-06,4e-06,1e-06,-9e-06,1e-05,1.3e-05,5e-06,3e-06,-2.1e-05,8e-06,9e-06,1e-06,-1.5e-05,-6e-06,1.5e-05,-3e-06,-1e-06,1e-06,5e-06,-8e-06,3e-06,6e-06,-4e-06,-1.3e-05,-7e-06,2e-05,-2e-06,3e-06,0,-3e-06,7e-06,-2e-06,7e-06,-1e-05,8e-06,0,-1.8e-05,2e-06,6e-06,4e-06,1.3e-05,1e-06,-1e-06,-5e-06,0,-4e-06,-1e-06,1e-06,1e-06,-8e-06,-2e-05,8e-06,6e-06,9e-06,8e-06,9e-06,2e-06,-3e-06,-4e-06,-2e-06,-4.5e-05,-1e-06,-3e-06,-3e-06,6e-06,1.4e-05,-1.2e-05,-1e-06,3e-06,-1e-06,5e-06,-7e-06,9e-06,-2e-06,-8e-06,-2e-06,-3e-06,-2e-06,5e-06,-5e-06,4e-06,8e-06,7e-06,0,-1.2e-05
-7e-06,2.3e-05,-4e-06,-2.7e-05,-1.5e-05,8e-06,-3e-06,-1.2e-05,-5e-06,9e-06,7e-06,-6e-06,-1e-06,-4e-06,-2.8e-05,-3e-06,-4e-06,-2.7e-05,2e-06,3e-06,1e-05,8e-06,-1.2e-05,-1e-06,1.7e-05,-3e-06,7e-06,-2.6e-05,2e-06,-2.2e-05,2.8e-05,-3.1e-05,5e-06,4e-06,1.7e-05,1e-05,6e-06,0,-4e-06,1e-06,-3.1e-05,-2.1e-05,-4e-06,-2e-06,1.2e-05,0,0,-1e-06,3.4e-05,1.4e-05,-6e-06,-3e-06,1e-06,6e-06,-1.6e-05,-1.2e-05,-1.4e-05,8e-06,-7e-06,1.2e-05,5e-06,-1.8e-05,1e-06,-2.8e-05,2e-06,0,0,8e-06,-1.2e-05,4e-06,1e-06,0,1.6e-05,1e-06,-1e-06,1e-06,-9e-06,-7e-06,1e-06,3e-06,2e-06,1e-05,-4e-06,6e-06,4e-06,4e-06,1.6e-05,-4e-06,4e-06,-5e-06,0,1.9e-05,0,8e-06,-3e-06,-3e-06,1e-05,-1e-06,0,-7e-06,-1e-05,-1.4e-05,1.2e-05,1e-06,-1e-06,-4e-06,5e-06,1e-05,-1.1e-05,2e-06,1e-06,-5e-06,0,-3e-06,-2e-06,1e-06,-6e-06,1.3e-05,-3e-06,1.4e-05,2e-05
3e-06,0,4e-06,2.8e-05,0,-4e-06,-2e-06,1.8e-05,2e-06,-1.3e-05,-4e-06,9e-06,-1e-06,0,1.8e-05,3e-06,-2e-06,2e-05,1.5e-05,1e-05,5e-06,-1.5e-05,2e-06,-1e-06,-1e-05,4e-06,2e-06,2.9e-05,1.2e-05,8e-06,-2e-05,3.2e-05,3e-06,-6e-06,-1.6e-05,0,8e-06,-6e-06,1e-06,4e-06,1.8e-05,1.8e-05,1e-06,-1e-06,9e-06,3e-06,-7e-06,3e-06,-6e-06,1e-06,-4e-06,2e-06,2e-06,6e-06,-1.8e-05,2.5e-05,-4e-06,-9e-06,-1e-06,-2e-06,-4e-06,-1.2e-05,-6e-06,2.9e-05,6e-06,-1e-06,-6e-06,-8e-06,-1e-06,-2e-06,-9e-06,-1e-06,-1.1e-05,-2e-06,-6e-06,-1e-06,4e-06,0,2e-06,-3e-06,-1e-06,-3e-06,3e-06,-5e-06,0,1e-06,-2e-06,0,-3e-06,6e-06,-5e-06,4e-06,-1e-06,-2e-06,5e-06,2e-06,-2e-06,-4e-06,8e-06,8e-06,1.1e-05,2e-06,-4e-06,4e-06,3e-06,2e-06,1.2e-05,-1e-05,1e-05,-2e-06,-2e-06,7e-06,2e-06,0,-5e-06,-1e-06,1e-05,-5e-06,-1e-06,-7e-06,-6e-06
4e-06,-8e-06,4e-06,-1.5e-05,9e-06,1.2e-05,0,-2.2e-05,4e-06,4e-06,-3e-06,7e-06,4e-06,3e-06,-1e-05,0,5e-06,-5e-06,-1.7e-05,9e-06,3e-06,1.9e-05,7e-06,2.2e-05,-1.1e-05,-9e-06,-7e-06,-2.3e-05,-1.3e-05,2e-06,1.1e-05,-1.9e-05,-1.1e-05,2e-06,1.4e-05,6e-06,2e-06,1.1e-05,1e-06,0,-1e-06,-1.6e-05,-1e-06,5e-06,-1.1e-05,-2e-06,3e-06,1e-06,-1.1e-05,-2e-06,2e-06,4e-06,-7e-06,-8e-06,8e-06,-1.9e-05,-4e-06,-4e-06,3e-06,0,6e-06,1.5e-05,0,-1e-06,-4e-06,1e-06,5e-06,1e-06,8e-06,-3e-06,8e-06,0,1e-05,3e-06,4e-06,1e-06,-1e-06,-1e-06,8e-06,4e-06,1e-06,-1.3e-05,1e-06,0,-5e-06,-2e-06,-1.1e-05,3e-06,-4e-06,-1.1e-05,-2e-06,-6e-06,0,-5e-06,-1e-06,0,2.2e-05,-1e-06,0,5e-06,-9e-06,-1.1e-05,-3e-06,-3e-06,0,1e-06,-1.2e-05,1e-05,-7e-06,3e-06,3e-06,-5e-06,-2e-06,1.9e-05,3e-06,0,-9e-06,-1.3e-05,6e-06,-6e-06,2e-06
-3e-06,-4e-06,0,3e-06,2e-06,-2e-06,-1e-06,2e-05,-5e-06,-1e-06,-2e-06,-1.6e-05,-3e-06,0,2e-05,0,8e-06,-8e-06,-8e-06,0,-1e-05,-2.6e-05,1e-06,-1e-06,1.4e-05,-1e-06,3e-06,1.9e-05,1e-06,-9e-06,-2.2e-05,1.2e-05,1e-05,5e-06,-1.3e-05,0,2e-06,-1e-06,1e-06,-1e-06,1.6e-05,1.4e-05,2e-06,-8e-06,-1e-06,-5e-06,2e-06,0,-1.4e-05,-9e-06,-2e-06,-5e-06,1e-06,-3e-06,1.4e-05,8e-06,8e-06,1.2e-05,6e-06,7e-06,-5e-06,0,3e-06,-9e-06,-3e-06,1e-06,0,4e-06,-3e-06,-4e-06,-5e-06,-1e-06,-1e-05,-1e-06,2e-06,-3e-06,-2e-06,4e-06,-2e-06,-2e-06,-1e-06,1.8e-05,1e-06,1e-06,2e-06,0,1.8e-05,-5e-06,7e-06,9e-06,-2e-06,-1.3e-05,1e-06,9e-06,-2e-06,-1e-06,-5e-06,-1e-06,-3e-06,-7e-06,6e-06,1e-05,7e-06,-1e-06,-4e-06,-2e-06,-7e-06,-1.1e-05,2e-06,-2e-06,-1e-06,3e-06,-1e-06,3e-06,8e-06,0,1.4e-05,0,-2e-06,3e-06,-8e-06
1e-06,0,-3e-06,-2e-06,-4e-06,-9e-06,-1e-06,-1.1e-05,-2e-06,-1e-06,7e-06,5e-06,1e-06,2e-06,-1.4e-05,-1e-06,-3e-06,1.2e-05,2.5e-05,-6e-06,-6e-06,1.7e-05,-9e-06,-2.8e-05,9e-06,-1e-06,-3e-06,-2e-05,4e-06,5e-06,1.5e-05,-4e-06,0,-1e-05,1e-05,-2e-06,-5e-06,-1e-06,-2e-06,-1e-06,-2.4e-05,-8e-06,1e-06,8e-06,6e-06,0,-2e-06,-2e-06,3e-05,5e-06,-7e-06,-1e-06,1e-06,1.2e-05,9e-06,6e-06,9e-06,-2e-06,5e-06,-9e-06,4e-06,1e-06,3e-06,4e-06,0,-1e-06,-3e-06,-4e-06,3e-06,7e-06,2e-06,2e-06,7e-06,0,-3e-06,2e-06,5e-06,2e-06,-6e-06,-1e-06,0,-9e-06,0,1e-06,-2e-06,2e-06,-1.5e-05,6e-06,1e-06,-4e-06,3e-06,-6e-06,-3e-06,-7e-06,4e-06,2e-06,-1e-06,-1e-06,1e-06,-3e-06,-2e-06,5e-06,-9e-06,0,6e-06,1e-06,7e-06,8e-06,4e-06,-1e-06,3e-06,-1e-06,1e-06,-1e-06,1e-06,0,-1.2e-05,9e-06,5e-06,1.1e-05,8e-06
-3e-06,-4e-06,-1e-06,2e-06,-5e-06,0,4e-06,1e-06,0,8e-06,-4e-06,8e-06,-2e-06,-1e-06,1.7e-05,2e-06,0,1e-06,-6e-06,-8e-06,-4e-06,7e-06,1e-06,1.8e-05,-1.2e-05,2e-06,2e-06,1.6e-05,1e-06,-5e-06,-1.2e-05,-1e-05,-1.1e-05,-1e-06,-5e-06,1e-06,-1e-06,4e-06,1e-06,2e-06,1.2e-05,-2e-06,-5e-06,-7e-06,-1e-06,0,1e-06,0,-9e-06,9e-06,1e-05,6e-06,3e-06,-6e-06,-1e-05,-1.1e-05,-4e-06,-1.2e-05,0,8e-06,-5e-06,0,-1e-06,-6e-06,3e-06,1e-06,3e-06,6e-06,-7e-06,2e-06,0,1e-06,-8e-06,0,-2e-06,0,-8e-06,-1e-06,-4e-06,1e-06,-1e-06,-1e-06,-6e-06,-3e-06,4e-06,-1e-06,4e-06,-6e-06,-6e-06,2e-06,5e-06,1e-05,2e-06,4e-06,-2e-06,1e-06,-6e-06,-1e-06,-4e-06,7e-06,0,-2e-06,8e-06,1e-06,-4e-06,1e-06,-3e-06,-9e-06,-8e-06,1e-06,-4e-06,-3e-06,-1e-06,-1.1e-05,0,0,0,4e-06,0,-7e-06,-4e-06
0,5e-06,2e-06,-6e-06,4e-06,4e-06,0,5e-06,6e-06,-5e-06,2e-06,-8e-06,0,1e-06,-6e-06,1e-06,-1e-05,-2e-05,-1.5e-05,-2e-06,-1e-06,-1.9e-05,6e-06,-1.1e-05,-4e-06,4e-06,0,-3e-06,-5e-06,-1e-06,1.4e-05,1.3e-05,1.3e-05,1e-05,2e-06,-6e-06,-4e-06,-1e-06,-2e-06,-3e-06,-1.3e-05,1.3e-05,3e-06,6e-06,0,4e-06,-1e-06,0,-1.9e-05,-8e-06,-1.1e-05,-8e-06,3e-06,-5e-06,-7e-06,4e-06,-6e-06,9e-06,-1e-06,-7e-06,3e-06,-1e-05,1e-06,4e-06,3e-06,-1e-06,-2e-06,-6e-06,6e-06,-7e-06,-6e-06,0,1e-05,0,7e-06,-3e-06,7e-06,-1e-06,2e-06,0,0,9e-06,4e-06,1e-06,-1e-06,-3e-06,8e-06,4e-06,2e-06,-3e-06,-2e-06,8e-06,1e-06,-5e-06,-4e-06,-2e-06,3e-06,0,4e-06,-2e-06,0,3e-06,-5e-06,1e-06,0,-1e-06,4e-06,8e-06,8e-06,0,1e-06,4e-06,1e-06,-6e-06,-4e-06,0,0,-5e-06,-2e-06,-5e-06,0
2e-06,7e-06,2e-06,1.3e-05,4e-06,-2e-06,0,-1e-06,-1e-06,3e-06,-3e-06,3e-06,0,-1e-06,1.5e-05,-1e-06,3e-06,1.6e-05,8e-06,3e-06,6e-06,1.4e-05,0,4e-06,1e-05,-5e-06,-2e-06,-4e-06,-1e-06,0,-7e-06,-1.6e-05,-4e-06,-4e-06,4e-06,-3e-06,-2e-06,-8e-06,0,2e-06,1.2e-05,-1.2e-05,1e-06,-5e-06,-3e-06,2e-06,-1e-06,0,7e-06,-6e-06,8e-06,5e-06,-2e-06,4e-06,2e-06,5e-06,-5e-06,5e-06,-3e-06,1e-06,-2e-06,4e-06,2e-06,-1e-06,-4e-06,0,0,1e-06,-3e-06,1e-06,6e-06,0,-1e-05,0,-4e-06,3e-06,-2e-06,-2e-06,4e-06,0,0,-7e-06,0,1e-06,0,2e-06,-1.3e-05,-1e-06,2e-06,5e-06,-2e-06,0,-1e-06,2e-06,3e-06,0,-5e-06,-1e-06,2e-06,-3e-06,2e-06,-1.5e-05,2e-06,0,2e-06,1e-06,3e-06,-8e-06,-4e-06,1e-06,-1e-06,-5e-06,-1e-06,2e-06,-4e-06,0,4e-06,-2e-06,1e-06,6e-06,-5e-06
-1e-06,-1e-06,0,-1e-05,-1e-06,1e-06,0,-7e-06,-4e-06,-3e-06,6e-06,1e-06,2e-06,1e-06,-1.3e-05,1e-06,-5e-06,5e-06,1.1e-05,7e-06,3e-06,2e-06,-5e-06,2.1e-05,1e-06,-1e-06,2e-06,1e-06,3e-06,2e-06,1e-05,1.7e-05,-5e-06,-4e-06,-8e-06,6e-06,-2e-06,2e-06,0,-1e-06,-3e-06,1e-05,-1e-06,5e-06,1e-06,-2e-06,3e-06,-1e-06,2e-05,3e-06,-1e-06,-3e-06,-2e-06,0,1.1e-05,-1.1e-05,1e-06,-9e-06,-2e-06,3e-06,2e-06,8e-06,-1e-06,1.1e-05,-1e-06,0,3e-06,3e-06,4e-06,2e-06,-4e-06,-1e-06,8e-06,0,-1e-06,-2e-06,-3e-06,1e-06,1e-06,-2e-06,0,-2e-06,-1e-06,-1e-06,-2e-06,-1e-06,1e-05,-2e-06,1e-06,-3e-06,-2e-06,-1e-06,1e-06,1e-06,1e-06,2e-06,3e-06,0,-2e-06,5e-06,-2e-06,1e-05,-1e-06,-2e-06,-2e-06,1e-06,-4e-06,8e-06,-2e-06,-1e-06,3e-06,4e-06,1e-06,-2e-06,-1e-06,0,1e-06,7e-06,-3e-06,4e-06,5e-06
0,-8e-06,-3e-06,5e-06,-3e-06,5e-06,-3e-06,1.3e-05,-3e-06,0,-7e-06,-2e-06,1e-06,-1e-06,8e-06,0,1e-05,-8e-06,-9e-06,4e-06,6e-06,-1.2e-05,0,-2e-05,-1.1e-05,0,-2e-06,-1e-06,-4e-06,-1e-06,-9e-06,-1.1e-05,5e-06,3e-06,1.2e-05,-1e-06,0,-2e-06,1e-06,1e-06,8e-06,-1.1e-05,-1e-06,-5e-06,5e-06,-2e-06,0,2e-06,-2.1e-05,7e-06,-5e-06,3e-06,2e-06,-2e-06,-3e-06,1e-05,7e-06,1e-06,-2e-06,-8e-06,-1e-06,-2e-06,-2e-06,-1.6e-05,-2e-06,0,-2e-06,-3e-06,-3e-06,0,-1e-06,1e-06,-7e-06,-1e-06,0,0,7e-06,1e-06,-1e-06,3e-06,0,6e-06,2e-06,0,0,1e-06,-2e-06,4e-06,-2e-06,-2e-06,1e-06,-6e-06,-1e-06,-4e-06,-3e-06,0,2e-06,-2e-06,1e-06,0,-1e-06,-3e-06,1e-06,0,0,-1e-06,-3e-06,-8e-06,5e-06,0,-2e-06,0,0,3e-06,-1e-06,0,-5e-06,4e-06,-1e-06,-6e-06,3e-06
1e-06,-3e-06,-2e-06,-3e-06,1e-06,-5e-06,2e-06,-1.3e-05,6e-06,-1e-06,4e-06,1e-06,-2e-06,0,-1.3e-05,1e-06,-3e-06,-3e-06,-1e-05,-1e-06,-1e-06,1.2e-05,3e-06,-7e-06,1e-06,1e-06,0,1e-05,0,-2e-06,8e-06,6e-06,-1e-06,1e-06,-1.4e-05,2e-06,2e-06,-4e-06,0,-1e-06,-1.6e-05,7e-06,-1e-06,6e-06,-4e-06,-2e-06,-2e-06,0,-1e-06,-2e-06,9e-06,-5e-06,-3e-06,1e-06,-8e-06,-4e-06,3e-06,3e-06,0,8e-06,1e-06,-5e-06,-2e-06,3e-06,5e-06,0,0,4e-06,1e-06,-1e-06,2e-06,0,6e-06,1e-06,6e-06,1e-06,-7e-06,1e-06,0,-2e-06,0,-2e-06,-3e-06,1e-06,0,-1e-06,-8e-06,-4e-06,1e-06,5e-06,3e-06,-6e-06,-1e-06,4e-06,3e-06,-1e-06,6e-06,0,-4e-06,-5e-06,3e-06,9e-06,1e-06,2e-06,1e-06,0,-3e-06,8e-06,-7e-06,0,1e-06,-3e-06,-1e-06,0,4e-06,1e-06,5e-06,-5e-06,2e-06,-3e-06,-2e-06
-1e-06,4e-06,1e-06,5e-06,0,-3e-06,0,9e-06,3e-06,3e-06,-2e-06,-1e-06,2e-06,0,1.2e-05,-1e-06,8e-06,8e-06,1.5e-05,-5e-06,-4e-06,-1e-05,0,1.3e-05,6e-06,1e-06,-1e-06,-1.6e-05,4e-06,8e-06,-5e-06,0,2e-06,-2e-06,1.6e-05,3e-06,1e-06,3e-06,1e-06,0,9e-06,-1e-06,3e-06,-7e-06,-2e-06,2e-06,0,0,4e-06,-8e-06,-1e-05,7e-06,5e-06,-2e-06,-6e-06,-4e-06,-2e-06,-1e-06,2e-06,-7e-06,-1e-06,-2e-06,1e-06,5e-06,1e-06,0,2e-06,-5e-06,-1e-06,2e-06,-2e-06,0,-6e-06,-1e-06,-7e-06,-1e-06,4e-06,-1e-06,-1e-06,2e-06,0,-5e-06,2e-06,0,1e-06,2e-06,1.2e-05,3e-06,0,-6e-06,0,2e-06,2e-06,-1e-06,1e-06,1e-06,-1e-06,-1e-06,2e-06,1e-06,-4e-06,-2e-06,-1e-06,0,-2e-06,1e-06,5e-06,-8e-06,6e-06,1e-06,-1e-06,3e-06,1e-06,5e-06,1e-06,-1e-06,-8e-06,-7e-06,-3e-06,7e-06,-2e-06
2e-06,3e-06,3e-06,-7e-06,0,3e-06,-1e-06,-4e-06,-2e-06,1e-06,5e-06,5e-06,-2e-06,0,-1.3e-05,0,-9e-06,-1e-05,2e-06,-5e-06,-3e-06,8e-06,-1e-06,-9e-06,-1e-06,0,0,1.3e-05,-9e-06,-6e-06,3e-06,-9e-06,-3e-06,-2e-06,-1.6e-05,-4e-06,1e-06,-2e-06,0,1e-06,-7e-06,-2e-06,-1e-06,8e-06,5e-06,3e-06,0,-1e-06,1.6e-05,3e-06,8e-06,-7e-06,-4e-06,1e-06,9e-06,5e-06,-5e-06,-2e-06,2e-06,3e-06,0,3e-06,0,-6e-06,-2e-06,0,-2e-06,3e-06,0,0,2e-06,0,5e-06,1e-06,1e-06,2e-06,-1e-06,-1e-06,-1e-06,-2e-06,0,7e-06,-1e-06,0,0,-3e-06,-9e-06,-1e-06,-1e-06,5e-06,-1e-06,8e-06,-1e-06,1e-06,-4e-06,1e-06,-1.2e-05,0,1e-06,4e-06,3e-06,-8e-06,1e-06,0,2e-06,-1e-06,1e-06,8e-06,-2e-06,-1e-06,1e-06,-1e-06,0,4e-06,-2e-06,1e-06,1e-05,2e-06,1e-06,0,0
0,1e-06,2e-06,6e-06,0,-2e-06,0,2e-06,-6e-06,-1e-06,-7e-06,-5e-06,-1e-06,0,9e-06,1e-06,5e-06,1e-05,-1.2e-05,-1e-06,-1e-06,-1e-06,-1e-06,7e-06,-4e-06,1e-06,2e-06,-1e-05,2e-06,0,-9e-06,1.2e-05,1e-06,4e-06,1.7e-05,3e-06,0,0,0,-1e-06,1.2e-05,5e-06,-2e-06,-8e-06,-1e-06,1e-06,1e-06,1e-06,-2.3e-05,6e-06,-3e-06,5e-06,3e-06,1e-06,7e-06,-1e-06,-3e-06,2e-06,1e-06,3e-06,-1e-06,4e-06,-1e-06,1.1e-05,-1e-06,0,1e-06,1e-06,3e-06,-3e-06,-1e-06,0,-5e-06,0,2e-06,-1e-06,-2e-06,0,0,2e-06,0,-4e-06,1e-06,0,0,2e-06,0,-1e-06,2e-06,-6e-06,-1e-06,7e-06,0,1e-06,2e-06,-1e-06,1e-06,-1e-06,0,-4e-06,-3e-06,4e-06,-2e-06,-1e-06,0,0,1e-06,-8e-06,-3e-06,0,-1e-06,0,0,-1e-06,1e-06,-1e-06,-6e-06,6e-06,0,-5e-06,4e-06
0,-2e-06,-2e-06,-5e-06,-1e-06,-1e-06,0,-3e-06,1e-06,1e-06,4e-06,-4e-06,2e-06,0,-1e-05,0,-7e-06,9e-06,2e-06,3e-06,3e-06,-1.1e-05,2e-06,1.1e-05,2e-06,0,-1e-06,1.7e-05,7e-06,6e-06,6e-06,-1.6e-05,3e-06,1e-06,-1.6e-05,2e-06,0,1e-06,0,1e-06,-9e-06,-1.1e-05,1e-06,8e-06,-3e-06,0,0,-1e-06,2e-06,-1e-06,0,-5e-06,-3e-06,1e-06,0,-3e-06,3e-06,2e-06,-1e-06,-7e-06,1e-06,-1e-06,1e-06,-4e-06,-1e-06,0,1e-06,-3e-06,-3e-06,1e-06,-2e-06,0,6e-06,0,3e-06,-1e-06,5e-06,0,1e-06,-3e-06,0,-4e-06,1e-06,0,0,-1e-06,9e-06,2e-06,-1e-06,9e-06,0,-4e-06,1e-06,-3e-06,1e-06,0,-5e-06,-1e-06,1e-06,-2e-06,4e-06,-7e-06,4e-06,0,-3e-06,1e-06,1e-06,8e-06,6e-06,0,1e-06,2e-06,0,-2e-06,1e-06,0,8e-06,0,-1e-06,-2e-06,-2e-06
