-2e-06,-5e-06,-7e-06,-1e-06,-8.7e-05,-0.002262,-0.009299,-0.019223,-0.010197,-0.076481,-0.203707,-0.199679,-0.182451,-0.164026,-0.159485,-0.147049,-0.086605,-0.033183,-0.015991,-0.006336,-0.001402,-0.007016,-0.002762,-0.000207,-0.000475,-0.000115,-5e-06,2e-06
-1e-06,-7e-06,-1.8e-05,-2.2e-05,9.2e-05,0.001892,-0.007083,-0.02114,-0.0046,0.002405,0.004699,0.068727,0.106993,0.143263,0.118752,0.093422,0.070657,0.029214,0.015714,0.006446,-0.000515,-0.009821,-0.004477,7.3e-05,0.000478,8.4e-05,0,1.6e-05
-4e-06,-8e-06,-2.1e-05,-2.6e-05,-2.3e-05,-0.000295,8.4e-05,0.001153,-0.003069,-0.027453,-0.012793,-0.003984,-0.005674,-0.009502,-0.015857,-0.009296,-0.011136,-0.002352,0.000961,-0.00011,-0.000362,-0.002459,-0.001291,-0.000213,-0.000559,-0.000104,-1e-06,8e-06
-1e-06,-1e-06,-3e-06,0,-8.4e-05,-0.001346,0.006611,0.019434,-0.000668,-0.048352,-0.063518,-0.101745,-0.135257,-0.157828,-0.134578,-0.118802,-0.090313,-0.039164,-0.017601,-0.006811,4.8e-05,0.00491,0.001878,0.000175,0.000446,9.8e-05,1.3e-05,3e-06
8e-06,1.4e-05,2.3e-05,3.5e-05,0.000147,0.0024,0.006948,0.012767,0.005718,0.053541,0.145767,0.167922,0.150484,0.135116,0.137644,0.126233,0.074464,0.024306,0.012606,0.005515,0.000928,0.004327,0.001585,0.00011,0.00031,0.000137,4e-05,2.2e-05
5e-06,8e-06,2e-05,3.4e-05,1.9e-05,-0.000303,-0.003384,-0.008356,9.2e-05,0.035773,0.09818,0.107872,0.092771,0.079978,0.073727,0.074591,0.046789,0.022151,0.009609,0.003126,-0.000521,-0.003335,-0.001674,-0.000181,-0.000563,-0.000101,2.6e-05,1.3e-05
-5e-06,-4e-06,4e-06,1.4e-05,-1e-04,-0.002499,-0.007981,-0.01599,-0.006803,-0.046374,-0.147329,-0.187957,-0.186987,-0.162197,-0.1535,-0.1584,-0.091145,-0.031356,-0.017203,-0.007208,-0.001674,-0.006526,-0.002982,2.1e-05,0.00012,-2.9e-05,-3e-06,-6e-06
-4e-06,-3e-06,-5e-06,-8e-06,5.8e-05,0.001516,0.000168,-0.002867,-0.000225,-0.003909,-0.078147,-0.050816,-0.006511,0.028711,0.015963,0.004283,0.018278,0.003218,0.001289,0.001206,-0.000622,-0.001134,-0.000576,3.3e-05,0.000283,7.2e-05,-3e-06,8e-06
-3e-06,-5e-06,-1.7e-05,-2.5e-05,1.1e-05,0.000993,0.004535,0.010589,0.00508,0.021914,0.067088,0.101814,0.115626,0.096449,0.079563,0.099324,0.056087,0.021986,0.01181,0.004341,0.000438,0.004215,0.00204,-7.3e-05,-0.00028,-2.2e-05,-2e-06,9e-06
-3e-06,-6e-06,-1.8e-05,-2.1e-05,-7.5e-05,-0.001328,0.001827,0.008766,0.001769,-0.018103,0.014958,-0.034901,-0.076937,-0.103822,-0.080026,-0.072186,-0.058742,-0.017276,-0.009594,-0.004482,-6e-06,0.001933,0.001226,5.5e-05,4e-06,8e-06,-9e-06,-1.2e-05
4e-06,3e-06,-2e-06,3e-06,3.4e-05,0.000551,-0.000388,-0.002701,-0.001821,0.002932,0.009495,0.010243,-0.004434,0.000942,0.021258,0.006625,0.001533,-0.005402,-0.002541,-0.000487,-0.000967,-0.003145,-0.001078,3.1e-05,0.00015,5e-05,-1e-06,-7e-06
6e-06,9e-06,1.1e-05,1.9e-05,5.2e-05,0.000297,-0.002423,-0.008241,-0.001426,0.020308,0.036785,0.097395,0.108534,0.107093,0.090508,0.097466,0.063053,0.019752,0.01118,0.004745,-0.000923,-0.002979,-0.001193,-1.2e-05,-7.3e-05,-2.9e-05,1.7e-05,1.2e-05
1e-06,6e-06,1.3e-05,1.7e-05,-4.5e-05,-0.001333,-0.002154,-0.003166,-0.000148,-0.017507,-0.048561,-0.075284,-0.076438,-0.075575,-0.08072,-0.079927,-0.037174,-0.00595,-0.004866,-0.00288,-0.000209,0.00229,0.001054,2.4e-05,4.9e-05,-1.2e-05,1e-05,5e-06
-3e-06,0,6e-06,5e-06,3.8e-05,0.000985,0.002155,0.003669,-0.000324,-0.016419,-0.056966,-0.093116,-0.076499,-0.051586,-0.052513,-0.065514,-0.027626,-0.01257,-0.007044,-0.002605,0.000498,0.005972,0.002694,-4.2e-05,-7.7e-05,-2e-06,0,0
-3e-06,-7e-06,-7e-06,-1.3e-05,-1e-06,0.00075,0.002169,0.005243,0.000324,0.000878,0.036704,0.090335,0.105005,0.101495,0.077938,0.090747,0.045837,0.010672,0.008452,0.004099,0.000564,0.003515,0.00161,3.5e-05,8e-05,2.6e-05,-7e-06,2e-06
-3e-06,-8e-06,-1.4e-05,-1.8e-05,-5.4e-05,-0.001049,-0.000852,0.001156,5.4e-05,-0.014774,0.027085,0.037559,0.010746,-0.015451,-0.009307,-0.003728,-0.020944,0.001067,0.000556,-0.000356,-0.000339,-0.003405,-0.001382,2.5e-05,-4e-06,-8e-06,-2.2e-05,-1.3e-05
0,-3e-06,-1.1e-05,-1.2e-05,-1.2e-05,-0.000141,-0.00114,-0.003793,-0.002114,0.000334,-0.00935,-0.060126,-0.07655,-0.074172,-0.036657,-0.05806,-0.036422,-0.009016,-0.006604,-0.003028,-0.000792,-0.00658,-0.00287,-8e-06,4.8e-05,6e-06,-2.3e-05,-1.7e-05
2e-06,3e-06,-5e-06,-3e-06,3.4e-05,0.000568,-0.000294,-0.003572,-6.2e-05,0.035408,0.021147,0.035955,0.052216,0.064127,0.058193,0.059742,0.040508,0.004502,0.004646,0.002834,0.000211,-0.001534,-0.000925,-4.5e-05,-8.9e-05,-1.9e-05,-3e-06,0
1e-06,4e-06,3e-06,5e-06,-1e-05,-0.000386,-0.000163,0.000815,0.003712,0.015288,-0.011183,0.003473,0.018042,0.016636,-0.009255,0.0055,0.012043,0.005359,0.002013,0.000825,0.000519,0.003483,0.001335,-2e-06,-0.000129,-5.1e-05,6e-06,3e-06
