2.7e-05,2.2e-05,3.2e-05,1.2e-05,3.8e-05,1e-05,1.6e-05,2.8e-05,1e-06,3.2e-05,8e-06,2.7e-05,4e-06,1.5e-05,2.1e-05,1.2e-05,1.5e-05,1e-06,2.6e-05,2e-05,2.4e-05,1.4e-05,7e-06,3.2e-05,8e-06,3e-05,1.1e-05,1.9e-05,1.9e-05,3e-06,1.1e-05,1.1e-05,5e-06,1.9e-05,1.8e-05,1.3e-05,3e-05,1.6e-05,1.5e-05,0,2.1e-05,1.7e-05,1.1e-05,1.4e-05,3e-05,3e-05,1.2e-05,1.4e-05,1e-06,1e-06,1e-05,2.3e-05,1.8e-05,3.6e-05,2e-05,2.7e-05,2.1e-05,7e-06,3.2e-05,7e-06,1.9e-05,2e-06,1.4e-05,0,1.1e-05,4e-06,3.4e-05,4e-06,2.1e-05,4e-06,2.9e-05,2e-06,4.3e-05,2e-06,2.6e-05,7e-06,7e-06,2e-06,9e-06,3e-05,9e-06,5.7e-05,1.1e-05,3.6e-05,3.9e-05,9e-06,2.5e-05,7e-06,5.8e-05,6e-06,1.9e-05,4e-06,8e-06,1.5e-05,3e-05,1.1e-05,8e-06,1e-05,1.9e-05,1.5e-05,2.9e-05,1.5e-05,9e-06,4e-06,1.1e-05,8e-06,3e-06,8e-06,0,5e-06,1.4e-05,1.2e-05,3e-06,2.9e-05,7e-06,3.9e-05,8e-06,1.8e-05,1.3e-05,6e-06,1.8e-05
4.7e-05,5.2e-05,2.2e-05,5.6e-05,0.000102,7.4e-05,5.3e-05,5e-05,8.9e-05,8.7e-05,4.6e-05,3.5e-05,6e-05,6.9e-05,7.5e-05,3.1e-05,5e-05,4.2e-05,3.6e-05,7.7e-05,3.1e-05,9.4e-05,7.2e-05,3.9e-05,7.8e-05,4.3e-05,4.7e-05,4.1e-05,6.3e-05,6.6e-05,5.8e-05,2.8e-05,3.1e-05,3e-05,5.2e-05,6.9e-05,8.4e-05,8.3e-05,6.2e-05,4.1e-05,4.8e-05,7.2e-05,5.6e-05,4.4e-05,9.3e-05,0.00011,7e-05,6.9e-05,6.6e-05,7.1e-05,4.4e-05,4.2e-05,7.2e-05,4.8e-05,8.1e-05,3.8e-05,7.7e-05,8.3e-05,3.4e-05,4.4e-05,8.4e-05,6.8e-05,1.3e-05,3.7e-05,4.3e-05,5.5e-05,5.9e-05,3.6e-05,5.7e-05,7.7e-05,2.7e-05,5e-05,7.3e-05,5.7e-05,1.9e-05,4.1e-05,2.2e-05,4.6e-05,4.3e-05,3.3e-05,3.5e-05,0.000107,0.000127,9.9e-05,3e-05,6e-05,5e-05,6.3e-05,6.9e-05,1e-04,9.5e-05,5.1e-05,2e-05,5.6e-05,3.9e-05,6e-05,5.1e-05,1.9e-05,1.4e-05,5e-06,8.2e-05,7e-05,5.1e-05,3.6e-05,3.5e-05,5.1e-05,3.1e-05,2.3e-05,3.1e-05,3.4e-05,4.9e-05,4.8e-05,5.4e-05,5.4e-05,0.000102,9.8e-05,7.2e-05,5.2e-05,5.1e-05,2.7e-05,2.8e-05
3.9e-05,2.2e-05,2e-05,5.4e-05,4.6e-05,1.3e-05,2.5e-05,5e-05,8.2e-05,4.6e-05,5.6e-05,2.9e-05,5e-05,2.9e-05,3e-05,7.6e-05,5.5e-05,3e-05,3.7e-05,5.5e-05,5.8e-05,7.7e-05,2e-05,6.4e-05,3.6e-05,1.7e-05,6.5e-05,2.8e-05,3.7e-05,6.2e-05,2e-05,4e-05,5.7e-05,5.5e-05,3.8e-05,7.2e-05,7.8e-05,5.5e-05,3.3e-05,2.7e-05,6.6e-05,1.3e-05,1.3e-05,1.5e-05,4.9e-05,1.9e-05,6.4e-05,5.4e-05,2.7e-05,5.5e-05,5.3e-05,2.2e-05,3.8e-05,4.8e-05,5e-05,2e-05,5.3e-05,2.3e-05,0.000105,6e-05,5.7e-05,2.9e-05,3.7e-05,5e-05,1.7e-05,4.4e-05,2.1e-05,5.4e-05,0.000119,4e-05,2.7e-05,3.6e-05,7e-06,4.2e-05,2.3e-05,7.2e-05,5.8e-05,8.4e-05,6e-06,5.4e-05,3.1e-05,7.4e-05,7.1e-05,2.9e-05,6.1e-05,0.000121,6.8e-05,4.2e-05,8.2e-05,3.5e-05,5.8e-05,3.5e-05,2.7e-05,3.2e-05,6.2e-05,8.9e-05,4.2e-05,5.6e-05,3.6e-05,5e-06,7.1e-05,4.4e-05,1.7e-05,5e-05,3e-06,4.1e-05,6e-05,3.4e-05,5.2e-05,3.4e-05,2e-05,3e-05,4.5e-05,2.5e-05,0.000104,4.1e-05,5.5e-05,4e-05,7.2e-05,7.7e-05,2.3e-05
1.6e-05,2.1e-05,2.4e-05,6.1e-05,2.3e-05,4.1e-05,4.6e-05,7.8e-05,0.000125,0.000169,0.000129,7.7e-05,5.1e-05,7.7e-05,2.2e-05,0.000109,7.8e-05,3.9e-05,2.4e-05,1.2e-05,6.8e-05,8.9e-05,8e-05,0.00012,5.4e-05,1.1e-05,6.2e-05,7.8e-05,4.5e-05,8.6e-05,6.4e-05,4.8e-05,6.5e-05,5.2e-05,9.3e-05,3.6e-05,4.5e-05,6e-05,7.7e-05,5.7e-05,7.2e-05,5.5e-05,3.6e-05,1.2e-05,1.4e-05,8.9e-05,8.9e-05,0.00011,9.5e-05,4.4e-05,1.1e-05,3e-05,2.7e-05,6.8e-05,4.9e-05,4.2e-05,3.1e-05,5e-05,7.6e-05,4.4e-05,8.1e-05,4.6e-05,5e-05,4.7e-05,7.1e-05,3.6e-05,3.8e-05,0.000102,0.000135,0.000185,0.000109,7.2e-05,3e-05,8.2e-05,8.2e-05,8.7e-05,5.6e-05,1.8e-05,6.1e-05,2.7e-05,7.6e-05,0.000106,4.7e-05,3e-05,7.2e-05,7.7e-05,0.000107,8.2e-05,6.1e-05,7.5e-05,7.2e-05,8e-05,8.2e-05,8.5e-05,0.000137,0.000126,8.4e-05,4.9e-05,6.8e-05,6e-05,5.7e-05,1.1e-05,2.9e-05,2.1e-05,3.8e-05,7.3e-05,7.3e-05,7.5e-05,8e-06,6e-06,1.6e-05,1.5e-05,7.1e-05,7.1e-05,0.000155,9.6e-05,7.5e-05,3.7e-05,4.6e-05,5.2e-05,5.9e-05
1.5e-05,1.7e-05,4.3e-05,2.5e-05,2.7e-05,7.6e-05,6.2e-05,5.7e-05,7e-05,9.5e-05,8e-06,4.3e-05,4e-05,2e-05,8e-06,0.000127,8.3e-05,1.9e-05,2.7e-05,1.4e-05,5.9e-05,1.9e-05,1.5e-05,7.4e-05,6e-05,2.1e-05,2.9e-05,3e-05,2.3e-05,5.5e-05,8.2e-05,7.8e-05,4.4e-05,1e-05,6.4e-05,5.1e-05,2.4e-05,5.9e-05,3.3e-05,8.4e-05,3.2e-05,2.1e-05,3.2e-05,8e-06,9e-06,6.7e-05,4.9e-05,3.1e-05,2.1e-05,4.1e-05,2.9e-05,4.7e-05,1.6e-05,4.6e-05,2.5e-05,3.2e-05,3.4e-05,4.7e-05,9.6e-05,4.1e-05,2.9e-05,3.2e-05,3.9e-05,3.2e-05,6.2e-05,6.7e-05,2.9e-05,6.7e-05,0.000119,9.6e-05,1.4e-05,1e-05,6.1e-05,5.6e-05,7e-06,3.5e-05,2.8e-05,2.1e-05,6.4e-05,4e-05,6.9e-05,3.3e-05,5.7e-05,2.1e-05,2e-05,5.8e-05,4.1e-05,2.8e-05,4.2e-05,9e-05,1.7e-05,5.5e-05,2e-06,4.7e-05,0.000117,9e-06,3.3e-05,7.1e-05,2.9e-05,2.6e-05,8e-06,1.4e-05,3.7e-05,3.7e-05,3.5e-05,3.5e-05,2.3e-05,2.1e-05,2.4e-05,2.1e-05,6.1e-05,2.1e-05,7.7e-05,4e-05,6e-05,5.5e-05,2.8e-05,2e-05,2.7e-05,3.9e-05,3.3e-05
5.4e-05,7.6e-05,4.1e-05,2.9e-05,2.5e-05,5.4e-05,7.5e-05,9.3e-05,6.7e-05,4.8e-05,1.3e-05,6.2e-05,1.4e-05,5.3e-05,1.3e-05,8.8e-05,3.2e-05,3.1e-05,4.3e-05,4e-05,4.4e-05,9.2e-05,4.6e-05,5.2e-05,4.7e-05,4.4e-05,6e-05,5.4e-05,4.6e-05,3.3e-05,4.6e-05,7.4e-05,9.7e-05,6.4e-05,1.3e-05,4.1e-05,4.9e-05,4.8e-05,7.8e-05,3.5e-05,3.1e-05,1.5e-05,6.7e-05,5.2e-05,4.8e-05,8e-05,7.4e-05,4.5e-05,2.6e-05,4.8e-05,1.2e-05,4.3e-05,4e-05,4.3e-05,4.9e-05,1.7e-05,4.8e-05,4.9e-05,2.5e-05,6.2e-05,3.7e-05,2e-05,4.4e-05,3.9e-05,2.2e-05,6.6e-05,1.3e-05,3.6e-05,7.3e-05,4.6e-05,3.4e-05,2.3e-05,6.1e-05,8.9e-05,5.9e-05,2.2e-05,2.3e-05,3.1e-05,8.1e-05,4.7e-05,5.7e-05,5.2e-05,5.8e-05,4.4e-05,5.5e-05,4.7e-05,1.2e-05,3e-06,5.3e-05,6.8e-05,4.6e-05,2.2e-05,2.8e-05,3.8e-05,7.6e-05,6.6e-05,3.3e-05,3.7e-05,3.5e-05,3.6e-05,4.7e-05,4.3e-05,5e-05,3.1e-05,2.3e-05,1.3e-05,4.8e-05,3.3e-05,5.8e-05,2.8e-05,7.5e-05,6.9e-05,5.6e-05,2e-05,2.7e-05,2.7e-05,6e-05,3.8e-05,7.3e-05,3.8e-05,5.6e-05
6.1e-05,0.000119,7.6e-05,5e-05,2.7e-05,5e-05,3.7e-05,6.8e-05,6.7e-05,3.1e-05,2.1e-05,8.8e-05,8.3e-05,5.6e-05,6.6e-05,3.2e-05,4.2e-05,5.4e-05,2.8e-05,7.6e-05,8.1e-05,0.000108,9.1e-05,7.3e-05,9e-06,8.6e-05,0.000122,3.6e-05,0.00011,7e-05,4.8e-05,2.5e-05,4.6e-05,3.8e-05,3.5e-05,7.1e-05,2.8e-05,1.9e-05,5.4e-05,4.2e-05,5.3e-05,5.3e-05,3.4e-05,6e-06,7.6e-05,6.1e-05,9.5e-05,4.9e-05,3.2e-05,4.7e-05,6.7e-05,4.1e-05,7.6e-05,8.3e-05,5.6e-05,7.6e-05,1.3e-05,2e-05,1.3e-05,7.4e-05,2.3e-05,2.7e-05,3.1e-05,1.9e-05,2.7e-05,7.4e-05,5.3e-05,2.6e-05,8.8e-05,6.4e-05,9.2e-05,5.4e-05,3.6e-05,6.2e-05,2.1e-05,0.000107,9.1e-05,5.4e-05,6.8e-05,2.7e-05,4.7e-05,3.1e-05,2.9e-05,1.1e-05,7.3e-05,4e-05,1.9e-05,5e-06,6.6e-05,0.000119,5.1e-05,3.2e-05,2.5e-05,2.5e-05,7.8e-05,5e-05,1.1e-05,2.3e-05,2.3e-05,3.7e-05,1.5e-05,5.1e-05,0.00012,8e-05,6.1e-05,3.8e-05,5.6e-05,4e-05,6e-05,4.6e-05,6.6e-05,9.1e-05,4.3e-05,4e-05,7.7e-05,0.000103,6.6e-05,1.8e-05,6e-05,5.5e-05,1.8e-05
3.3e-05,4.6e-05,5e-05,5e-05,5e-06,7.5e-05,9.2e-05,9.2e-05,3.4e-05,3.4e-05,4.5e-05,6.2e-05,4.7e-05,9.8e-05,0.000107,9.6e-05,8.2e-05,3.5e-05,0.000109,0.000164,7.8e-05,5e-05,2.3e-05,2.8e-05,1.3e-05,0.000105,4e-05,7e-05,9.6e-05,0.00011,0.000126,7.1e-05,7.6e-05,7e-05,3.8e-05,9.3e-05,9.8e-05,5.5e-05,0.000121,8.7e-05,1.8e-05,6.4e-05,7e-05,4.9e-05,8.5e-05,0.000149,8.1e-05,2.6e-05,2.1e-05,2.7e-05,3.3e-05,3.2e-05,6.1e-05,6e-05,5e-05,7.4e-05,5.9e-05,2.7e-05,2.9e-05,6e-05,5e-05,2.4e-05,2.9e-05,6.1e-05,6.6e-05,4.4e-05,6.1e-05,4.8e-05,8.5e-05,3e-05,5e-05,2.1e-05,3.2e-05,8.8e-05,0.000123,0.000153,6.5e-05,5.9e-05,6.8e-05,5.5e-05,5.8e-05,6.8e-05,6.7e-05,3.6e-05,8.4e-05,8.2e-05,5.7e-05,1.8e-05,5.7e-05,4.1e-05,4.6e-05,3.2e-05,2.7e-05,3.7e-05,4.5e-05,3.4e-05,7.1e-05,7.3e-05,6.5e-05,1.8e-05,4.8e-05,3.8e-05,7.2e-05,7e-06,7.2e-05,8e-05,2e-05,5.6e-05,5.7e-05,5e-05,6.2e-05,2.5e-05,3.7e-05,5.5e-05,9.4e-05,9.4e-05,6.6e-05,4.2e-05,2.3e-05,7.5e-05,1.6e-05
3.6e-05,3.1e-05,9e-05,2.5e-05,3.3e-05,7.9e-05,8.5e-05,3.6e-05,6.4e-05,6.4e-05,8.4e-05,0.000119,6.6e-05,4.9e-05,8e-06,5.9e-05,1.9e-05,3.5e-05,0.000156,5.1e-05,3.1e-05,3.9e-05,3.5e-05,3.9e-05,3.8e-05,6.9e-05,8.2e-05,9.8e-05,9.2e-05,3e-05,3.6e-05,2.4e-05,6.8e-05,3.8e-05,2.5e-05,8.5e-05,4e-05,6.4e-05,8.1e-05,2.6e-05,5.1e-05,4e-05,2.9e-05,8.5e-05,7.5e-05,9.7e-05,6.3e-05,6e-06,3.3e-05,4.2e-05,7.6e-05,3.2e-05,2.8e-05,6.4e-05,4.9e-05,3.6e-05,2.7e-05,1.7e-05,4e-05,2.1e-05,2.8e-05,6.5e-05,5.7e-05,3.5e-05,1.9e-05,4.7e-05,6.9e-05,4.5e-05,5.1e-05,7.5e-05,5.7e-05,7.5e-05,1.9e-05,5.1e-05,0.000118,4.5e-05,1.2e-05,9.1e-05,4.8e-05,6.2e-05,3.4e-05,7.3e-05,4.8e-05,2.1e-05,4.5e-05,9.1e-05,3.7e-05,6.6e-05,7e-06,3.9e-05,5.2e-05,5.3e-05,2.3e-05,4.9e-05,6.6e-05,3.1e-05,7.7e-05,6e-05,2.4e-05,4.8e-05,6e-05,4e-05,4.7e-05,9.7e-05,5.3e-05,8.5e-05,5.7e-05,0.000128,6.3e-05,3.7e-05,2.4e-05,2.2e-05,5e-05,8.1e-05,4.4e-05,7.9e-05,1.7e-05,4e-06,2.9e-05,6.1e-05,0.000118
5.8e-05,4.9e-05,8.7e-05,5e-05,6.3e-05,3.5e-05,0.000121,9.5e-05,0.000123,9e-05,0.000115,8.7e-05,3.4e-05,7.3e-05,4.1e-05,3.8e-05,7e-06,4.4e-05,9.8e-05,7.3e-05,1.5e-05,4.7e-05,3.4e-05,3.8e-05,3.4e-05,5.6e-05,7.4e-05,3.7e-05,3.5e-05,5.2e-05,3.5e-05,4.4e-05,6.6e-05,3.7e-05,1.1e-05,5.6e-05,5.2e-05,4.5e-05,0.000104,9.2e-05,9.4e-05,9.5e-05,9.5e-05,7.5e-05,3e-05,1.9e-05,4e-05,3.2e-05,3.3e-05,2.4e-05,6.9e-05,9.6e-05,5.7e-05,5.2e-05,1.6e-05,5.9e-05,4.3e-05,2.2e-05,4.1e-05,3.4e-05,4.1e-05,9.8e-05,4.6e-05,5.9e-05,4.5e-05,9.4e-05,9.5e-05,6.4e-05,8.1e-05,5.7e-05,4.2e-05,9.3e-05,5.3e-05,4.9e-05,4.2e-05,0.000105,7.9e-05,8.8e-05,6.8e-05,4e-06,2.7e-05,4.4e-05,6.8e-05,7e-05,4.2e-05,4.1e-05,2.1e-05,6.3e-05,4.1e-05,7.9e-05,8.1e-05,1.7e-05,5.6e-05,8.3e-05,1.3e-05,5.6e-05,0.00012,6.5e-05,5.6e-05,6.6e-05,4.2e-05,1.5e-05,1.9e-05,6.4e-05,3.6e-05,5.8e-05,6.2e-05,0.000143,0.000133,0.000103,9.6e-05,6.7e-05,4.8e-05,2.6e-05,1.4e-05,5e-05,4.8e-05,4.2e-05,4.4e-05,1.5e-05,0.000113
9.3e-05,4e-05,3.9e-05,2e-05,6.7e-05,5e-05,6.8e-05,1.3e-05,6.9e-05,5e-05,4e-05,7.7e-05,2e-05,6.3e-05,5.8e-05,5.2e-05,3.6e-05,3.3e-05,5.3e-05,2.2e-05,8.9e-05,5.3e-05,3.1e-05,3.8e-05,8.7e-05,4.3e-05,4.7e-05,3.9e-05,8e-05,8.7e-05,6.9e-05,6.8e-05,6.6e-05,3.6e-05,6e-05,1.3e-05,4.3e-05,7.6e-05,1.7e-05,1.1e-05,3.4e-05,7.1e-05,7e-06,4.9e-05,6.8e-05,6e-05,7e-05,3.8e-05,1.9e-05,2.9e-05,7.9e-05,3.8e-05,2.7e-05,5.2e-05,7.2e-05,7.5e-05,3.9e-05,2.5e-05,7.2e-05,5.3e-05,2.2e-05,0.000104,5.9e-05,5.6e-05,1.7e-05,5.6e-05,3.3e-05,4.8e-05,1.7e-05,3.5e-05,6.2e-05,9.6e-05,7.3e-05,4.4e-05,5.1e-05,8.5e-05,5.9e-05,3.4e-05,2.6e-05,5.1e-05,6.1e-05,4.5e-05,8e-06,5.2e-05,4e-05,2.6e-05,4.1e-05,3.9e-05,2.8e-05,7.4e-05,2.7e-05,5.2e-05,6.3e-05,9e-06,5.3e-05,3e-05,6.8e-05,3.2e-05,4e-05,4.9e-05,3.5e-05,2.3e-05,2.6e-05,6.9e-05,4.8e-05,6.5e-05,8.6e-05,3.9e-05,4.1e-05,5.1e-05,6.4e-05,2.3e-05,6.8e-05,4.7e-05,2.7e-05,1.3e-05,2.7e-05,1.5e-05,6.5e-05,9.2e-05,6.9e-05
4.4e-05,3.4e-05,2.4e-05,5e-05,9.4e-05,6.6e-05,2.1e-05,2.3e-05,5.9e-05,5.1e-05,2.2e-05,6.9e-05,7.4e-05,5.2e-05,3.6e-05,4.2e-05,6.6e-05,6.9e-05,3.8e-05,5.1e-05,9.2e-05,6.5e-05,7.3e-05,2.5e-05,6.8e-05,4.1e-05,1e-06,2.3e-05,4.3e-05,4.8e-05,4.1e-05,0.000107,0.000112,4.6e-05,6.4e-05,1.1e-05,6.2e-05,3.6e-05,1.1e-05,4.1e-05,3.9e-05,4.4e-05,5.2e-05,5e-05,3.9e-05,5e-06,6.1e-05,7.7e-05,7.5e-05,4e-05,3.4e-05,4.7e-05,5.4e-05,8.1e-05,2.4e-05,3.7e-05,4e-06,1.7e-05,8.9e-05,7.8e-05,4.3e-05,2.5e-05,5.4e-05,7.1e-05,1.2e-05,4.5e-05,1e-05,2.7e-05,3.6e-05,7e-06,7e-05,9.8e-05,7.6e-05,2.4e-05,4.2e-05,4.8e-05,5.4e-05,7e-05,6.1e-05,2.9e-05,5.9e-05,1.6e-05,2.1e-05,5.3e-05,4.7e-05,3.7e-05,5.8e-05,4.3e-05,1.9e-05,5.9e-05,2.3e-05,6.4e-05,2.5e-05,9e-06,3.4e-05,3.1e-05,5.8e-05,2.3e-05,5e-05,3.6e-05,1.8e-05,3.6e-05,2.8e-05,3.5e-05,1.1e-05,8e-06,5.1e-05,3.2e-05,2.4e-05,3.4e-05,1.8e-05,4.3e-05,1.2e-05,3e-06,1e-05,5e-06,2.2e-05,4.1e-05,1.1e-05,6.9e-05,8.3e-05
2.7e-05,2.7e-05,2.8e-05,6.8e-05,6.3e-05,4.2e-05,5.6e-05,2.1e-05,5.1e-05,6e-05,1.5e-05,5.3e-05,1.4e-05,1.3e-05,2.1e-05,1.1e-05,4e-05,1e-05,7.9e-05,0.000104,8.2e-05,1.8e-05,6.3e-05,6.8e-05,3.6e-05,4.2e-05,3.2e-05,2.1e-05,3.6e-05,5.9e-05,1.4e-05,4.8e-05,6.1e-05,7.3e-05,2.4e-05,3.4e-05,7.2e-05,5.1e-05,5.6e-05,8.7e-05,4e-05,4.9e-05,3.1e-05,2.1e-05,3e-05,1.4e-05,4.6e-05,3.4e-05,2.5e-05,3.6e-05,2.7e-05,2.7e-05,2.4e-05,1.6e-05,3.1e-05,2.4e-05,1e-05,2.6e-05,4.7e-05,1.4e-05,1.1e-05,1.7e-05,5.7e-05,6.4e-05,6.1e-05,7e-06,1.8e-05,2e-05,2.4e-05,3e-05,3.7e-05,6.5e-05,7e-05,4.4e-05,3.2e-05,2.7e-05,4.1e-05,3.9e-05,4.5e-05,4.8e-05,3.9e-05,5.6e-05,6.1e-05,4e-05,2.9e-05,1e-05,4.4e-05,4.6e-05,1.4e-05,5e-05,4.1e-05,4.9e-05,9e-06,1.8e-05,4.5e-05,3.5e-05,5.9e-05,2.6e-05,5.1e-05,4.3e-05,4.9e-05,2.8e-05,1.1e-05,4e-05,2.6e-05,2.7e-05,5.6e-05,2.3e-05,2.7e-05,2.9e-05,4.3e-05,1.1e-05,1.6e-05,4e-06,3e-05,3.4e-05,3.3e-05,4.3e-05,6.4e-05,7e-06,4.8e-05
3e-05,8e-06,1.1e-05,6.7e-05,8.3e-05,1.7e-05,3.7e-05,5.9e-05,5.5e-05,3.2e-05,7.7e-05,1.9e-05,5.1e-05,4.8e-05,3.4e-05,2.1e-05,2.6e-05,2.7e-05,8.8e-05,6.4e-05,5.5e-05,5.5e-05,3.8e-05,4.3e-05,3.3e-05,4.4e-05,7e-06,4.4e-05,5.8e-05,4.4e-05,1.9e-05,2.4e-05,5.6e-05,3.1e-05,4.6e-05,6.2e-05,5.9e-05,2.5e-05,1.6e-05,4.8e-05,5.7e-05,7.6e-05,1.8e-05,3.3e-05,1.8e-05,5.6e-05,2.1e-05,4.3e-05,5.5e-05,4.7e-05,3.5e-05,2.5e-05,1.5e-05,8e-06,1.8e-05,2e-06,3.6e-05,1.6e-05,2.8e-05,5.9e-05,1.1e-05,4.8e-05,4.2e-05,2.5e-05,2.6e-05,3.3e-05,4.6e-05,4.3e-05,6e-05,2.8e-05,4.7e-05,6.4e-05,1.5e-05,8e-06,3.5e-05,5.1e-05,3.6e-05,2e-05,3.3e-05,5e-05,2.7e-05,5.4e-05,2.4e-05,3.5e-05,3.3e-05,3e-05,2e-06,3.4e-05,3e-05,1.5e-05,2.3e-05,7.5e-05,6.8e-05,7e-06,5.2e-05,2e-05,2.9e-05,1.4e-05,4.6e-05,5.1e-05,2.4e-05,2.6e-05,2.8e-05,5.1e-05,3.2e-05,2.4e-05,7.1e-05,7.1e-05,2.2e-05,3.7e-05,1.9e-05,3.4e-05,9e-06,1.2e-05,4e-05,4.3e-05,4.6e-05,2.3e-05,5.3e-05,2.6e-05,2.6e-05
1.1e-05,2.7e-05,4.8e-05,4.5e-05,4.8e-05,5.8e-05,2.4e-05,6.2e-05,7.6e-05,7.5e-05,3.2e-05,7.6e-05,7.2e-05,1.4e-05,4.5e-05,3.9e-05,7.8e-05,6.8e-05,1.8e-05,3.6e-05,5.5e-05,5.8e-05,8.8e-05,4.8e-05,4e-05,4.4e-05,5e-05,3.4e-05,2.4e-05,2.6e-05,6e-05,5.3e-05,4.6e-05,4.4e-05,7.2e-05,6.1e-05,3.1e-05,4.3e-05,3.1e-05,4e-05,3.8e-05,1.4e-05,3.6e-05,5.3e-05,3e-05,8.4e-05,5.9e-05,5e-06,4.2e-05,2e-05,1e-06,7e-06,4.7e-05,4.3e-05,9e-06,1.9e-05,5.4e-05,2.9e-05,3e-05,3.8e-05,9e-05,7.4e-05,9.6e-05,2.6e-05,8.4e-05,5.4e-05,2.7e-05,4.7e-05,6.9e-05,6.1e-05,6.4e-05,4.7e-05,5.1e-05,5.5e-05,8.4e-05,5.5e-05,6.1e-05,6.8e-05,6e-05,2.1e-05,2e-05,4.7e-05,4.9e-05,3.9e-05,4.1e-05,2.7e-05,1.8e-05,3.4e-05,3.4e-05,1.2e-05,1.2e-05,3.9e-05,3.2e-05,4.6e-05,7.6e-05,5.2e-05,6.6e-05,2.9e-05,4.5e-05,4.5e-05,4.1e-05,1.9e-05,2.7e-05,5e-05,3.6e-05,4e-06,4.7e-05,3.8e-05,2.6e-05,4.3e-05,2.3e-05,2.5e-05,3e-05,2.8e-05,5.6e-05,5.2e-05,1.4e-05,4.3e-05,6.1e-05,1.8e-05,4.5e-05
2.9e-05,1.3e-05,3.2e-05,4.7e-05,4.3e-05,2.9e-05,3.9e-05,4.2e-05,4.9e-05,4.9e-05,7.7e-05,9e-05,2.4e-05,4.4e-05,7e-05,6.6e-05,6.5e-05,5.3e-05,2.8e-05,2e-05,6.5e-05,9e-06,6.3e-05,2e-05,4.9e-05,3.9e-05,4.7e-05,8.9e-05,6.6e-05,5.3e-05,6.2e-05,1.4e-05,3.2e-05,5.3e-05,8.8e-05,2.7e-05,6e-05,4.1e-05,2.9e-05,2e-05,3e-06,4.2e-05,8e-06,4.6e-05,4e-05,6.5e-05,0.000102,5.4e-05,5.8e-05,4.7e-05,2.2e-05,3.3e-05,5.1e-05,4e-05,2.7e-05,3.4e-05,3e-05,1.9e-05,3.2e-05,4.7e-05,0.000121,8.4e-05,8.3e-05,9.6e-05,8.5e-05,4.6e-05,5.6e-05,2.1e-05,7.4e-05,6.3e-05,7.4e-05,7.7e-05,5.7e-05,6.8e-05,2.3e-05,5.8e-05,1.5e-05,4.7e-05,3.1e-05,5.4e-05,3.1e-05,5.3e-05,5.2e-05,1.3e-05,2.8e-05,3.7e-05,2.3e-05,2e-06,7e-06,4.1e-05,1.3e-05,1e-05,4.7e-05,1.3e-05,3.1e-05,1.8e-05,6.7e-05,3.8e-05,2.9e-05,3.2e-05,4e-05,4.3e-05,3.7e-05,4e-05,3.2e-05,1.8e-05,4e-06,3.2e-05,1.8e-05,2.5e-05,3.3e-05,9e-06,2.4e-05,5.5e-05,3.6e-05,5.5e-05,6.7e-05,2e-05,3.1e-05,1e-05,3.5e-05
7.1e-05,6.6e-05,4.6e-05,3.2e-05,2.4e-05,3.5e-05,2.2e-05,7.7e-05,9.4e-05,6.2e-05,9.9e-05,3.8e-05,4.9e-05,2.6e-05,6.8e-05,2.9e-05,5.2e-05,1.9e-05,8.7e-05,1.7e-05,4.9e-05,2.9e-05,8.7e-05,8.6e-05,8.2e-05,1.1e-05,6.3e-05,1.6e-05,6.3e-05,3.9e-05,4.3e-05,5.5e-05,2.9e-05,7.9e-05,4.4e-05,2.5e-05,6.7e-05,4.2e-05,1.9e-05,3.5e-05,2.3e-05,9.3e-05,4.2e-05,2.6e-05,5.1e-05,3.4e-05,4.2e-05,5.8e-05,4.8e-05,6.6e-05,4.2e-05,4.3e-05,4.3e-05,6.3e-05,3.6e-05,2.7e-05,3.7e-05,3.8e-05,2.8e-05,2.7e-05,8.9e-05,3.5e-05,3.3e-05,3.3e-05,0.00015,9.6e-05,6.2e-05,3.7e-05,5.7e-05,3.2e-05,7.5e-05,4.5e-05,4.2e-05,2.7e-05,6e-05,2.1e-05,6.3e-05,4.4e-05,5.8e-05,3.5e-05,4.2e-05,2.6e-05,3.2e-05,2.1e-05,5.6e-05,9.9e-05,3.5e-05,2.2e-05,2.8e-05,3.9e-05,5.8e-05,3.6e-05,5.9e-05,7.4e-05,3.7e-05,5.2e-05,4.3e-05,3.6e-05,1.9e-05,4.4e-05,2.9e-05,2.8e-05,4.5e-05,7.6e-05,2.1e-05,2.7e-05,3.3e-05,5.8e-05,2.1e-05,1.1e-05,1.6e-05,4.2e-05,7e-06,5.3e-05,7.1e-05,3.8e-05,2.6e-05,7.4e-05,6.3e-05,4.3e-05,4.6e-05
7.2e-05,6.5e-05,6.3e-05,2.8e-05,8e-06,4.7e-05,7.1e-05,0.000156,0.000126,0.000106,2.2e-05,6.6e-05,8e-05,8.8e-05,8.5e-05,0.000111,4.9e-05,1.2e-05,0.000124,0.000103,7.6e-05,2.1e-05,7.6e-05,0.000123,0.000113,7.2e-05,5.3e-05,5.9e-05,0.000104,7.3e-05,6.1e-05,6.2e-05,4.8e-05,0.000116,0.000108,5.3e-05,1e-04,0.00011,7.8e-05,6.7e-05,4.5e-05,0.000122,8e-05,7e-06,6.5e-05,9.1e-05,3.9e-05,4.6e-05,2.9e-05,4.2e-05,3.2e-05,1.1e-05,3.6e-05,8.4e-05,9e-05,6.6e-05,4.1e-05,1.7e-05,8e-06,7.2e-05,7.1e-05,6.8e-05,4.3e-05,5.1e-05,9.4e-05,0.000137,7e-05,2.4e-05,6.3e-05,0.00011,0.000133,8.9e-05,5.9e-05,6.9e-05,8.7e-05,0.000114,0.000117,0.000133,7.9e-05,0.000112,0.00011,4.4e-05,3.2e-05,7.3e-05,0.000131,8.8e-05,7.1e-05,3.5e-05,7.3e-05,4.7e-05,3.4e-05,0.000107,9.8e-05,3.9e-05,4.3e-05,6.9e-05,7.6e-05,8.5e-05,4e-05,5.3e-05,2.7e-05,3.8e-05,1.3e-05,4.5e-05,4.3e-05,5.4e-05,3.7e-05,2e-05,1.4e-05,4.1e-05,4.3e-05,8e-05,4.6e-05,7e-05,6.5e-05,6.4e-05,0.000102,1.3e-05,4.8e-05,9.9e-05,2e-05
5.1e-05,4.5e-05,3.7e-05,4e-05,4.9e-05,5.8e-05,2.8e-05,0.000117,4.8e-05,7.6e-05,7.5e-05,9e-05,5e-05,1.3e-05,1.4e-05,8.4e-05,8e-05,4.8e-05,6.7e-05,8.3e-05,2.9e-05,4e-06,7.1e-05,5.2e-05,4e-05,2.6e-05,3.5e-05,2.8e-05,8e-05,2.5e-05,3.3e-05,3e-05,5.6e-05,9e-05,5.1e-05,3.6e-05,5.2e-05,5.1e-05,1.3e-05,3e-05,6.8e-05,5.9e-05,4.9e-05,4.3e-05,4e-06,7.4e-05,9e-05,6.4e-05,3.5e-05,3.9e-05,4.5e-05,1.9e-05,1.4e-05,2e-05,3.8e-05,5.9e-05,8.9e-05,6.9e-05,5.7e-05,9.8e-05,7.5e-05,8.6e-05,5.8e-05,1.6e-05,3.4e-05,4.9e-05,4.3e-05,1.7e-05,5e-05,8e-05,5.5e-05,5.2e-05,6.1e-05,3.2e-05,7e-06,6.1e-05,6.8e-05,7.4e-05,5.3e-05,0.000104,7.6e-05,4.5e-05,4.7e-05,6.1e-05,7.6e-05,5.3e-05,6.9e-05,0.000102,4.7e-05,4.6e-05,3.7e-05,9.3e-05,6.6e-05,8.4e-05,2e-05,3.9e-05,7e-06,6.2e-05,7.9e-05,3.1e-05,3.9e-05,4.4e-05,1.8e-05,2.6e-05,7e-06,1.5e-05,4e-05,2.8e-05,3.2e-05,5e-05,7.5e-05,2.1e-05,4.7e-05,4.7e-05,2.4e-05,6.3e-05,9.7e-05,9.3e-05,4.7e-05,7.1e-05,7.2e-05
3.7e-05,1.3e-05,3.6e-05,2e-06,2.6e-05,3.6e-05,2.8e-05,5.7e-05,8.9e-05,1.6e-05,5.9e-05,5e-05,4e-05,2.3e-05,5.3e-05,6e-05,9e-06,1.7e-05,3.3e-05,1.6e-05,3e-05,3e-06,5.1e-05,3.3e-05,4.1e-05,5.8e-05,4e-06,2.6e-05,2.3e-05,5.9e-05,1.5e-05,1.6e-05,3.9e-05,5.3e-05,4.6e-05,5.1e-05,7.4e-05,4.2e-05,4e-05,2e-05,4.9e-05,4.7e-05,1.2e-05,1.5e-05,3.4e-05,3.8e-05,5.6e-05,3.7e-05,1.7e-05,3.8e-05,6.5e-05,4.8e-05,3.8e-05,2.9e-05,2.8e-05,3.3e-05,5.6e-05,3.1e-05,3e-05,3.5e-05,4.6e-05,4.9e-05,1.9e-05,1.2e-05,4e-06,2.3e-05,2e-05,1.7e-05,2.1e-05,2.9e-05,1.3e-05,3.7e-05,2.3e-05,5.7e-05,4.6e-05,2.1e-05,7.8e-05,1.7e-05,2.2e-05,5.2e-05,9e-06,2.3e-05,1.9e-05,5e-05,5e-06,2.6e-05,2e-05,4.2e-05,2.7e-05,3.8e-05,3.6e-05,5.5e-05,4e-06,3.2e-05,2.9e-05,1.5e-05,3e-05,4e-05,2.2e-05,2.9e-05,4.4e-05,3.8e-05,2.8e-05,1e-05,4e-06,1.3e-05,4.5e-05,3.9e-05,1.7e-05,4.2e-05,2.5e-05,4.1e-05,3.1e-05,6.3e-05,3e-05,4.8e-05,3.6e-05,2.1e-05,1.6e-05,3.6e-05,3.2e-05
4e-06,1.1e-05,1.6e-05,2.8e-05,2.1e-05,1.3e-05,2.1e-05,2.5e-05,4.7e-05,3.3e-05,5.9e-05,2.3e-05,9e-06,1.1e-05,3.4e-05,2.2e-05,1.3e-05,1.7e-05,9e-06,2e-05,4.4e-05,5.1e-05,4.2e-05,4.6e-05,1.1e-05,2.8e-05,3.4e-05,3.9e-05,3e-05,3.5e-05,8e-06,2.3e-05,5.7e-05,1.4e-05,4.6e-05,1.9e-05,2.8e-05,4.2e-05,2.4e-05,4.5e-05,1.9e-05,2e-05,1.1e-05,1.4e-05,5.4e-05,4.8e-05,1.7e-05,2.5e-05,2.3e-05,1.4e-05,6.1e-05,4.4e-05,1.4e-05,4e-05,5.1e-05,2.2e-05,1.9e-05,1.4e-05,8e-06,1.6e-05,2.9e-05,3.1e-05,1.9e-05,1.3e-05,2.1e-05,4.3e-05,1.7e-05,1.2e-05,3.1e-05,3.3e-05,4.8e-05,2.9e-05,2.9e-05,3.2e-05,2.3e-05,1.5e-05,2.9e-05,1.6e-05,1.3e-05,3.6e-05,1.1e-05,2.7e-05,1.4e-05,2.6e-05,2.3e-05,2.8e-05,2.2e-05,1.8e-05,9e-06,1.2e-05,3.2e-05,1.8e-05,6e-06,2.1e-05,1.8e-05,1.2e-05,3.3e-05,2.9e-05,2.6e-05,2.1e-05,2.5e-05,2.3e-05,1.4e-05,1.3e-05,1.6e-05,7e-06,3e-05,1.5e-05,1.9e-05,2.2e-05,1.3e-05,1.2e-05,1.5e-05,2.4e-05,1.3e-05,2.9e-05,2.3e-05,8e-06,2.3e-05,1.5e-05,1.3e-05
2.2e-05,9e-06,8e-06,1.6e-05,3.4e-05,1.4e-05,3.9e-05,3.5e-05,4.5e-05,2.6e-05,2.2e-05,3.1e-05,2e-05,2e-05,7e-06,3e-06,8e-06,1e-05,2.1e-05,2.2e-05,2.1e-05,5.4e-05,2.8e-05,7e-06,4.7e-05,2.3e-05,2.2e-05,2.6e-05,1.8e-05,1.6e-05,1.2e-05,2.5e-05,2.7e-05,2.8e-05,5.3e-05,2.7e-05,3.2e-05,2.9e-05,1.7e-05,3.2e-05,4.8e-05,1.7e-05,6e-06,2.2e-05,4e-05,8e-06,6e-06,3e-05,2.2e-05,2.3e-05,4e-05,1.1e-05,2.2e-05,9e-06,2.4e-05,1.5e-05,8e-06,1.6e-05,2.5e-05,1.5e-05,7e-06,3e-05,6e-06,9e-06,2.5e-05,2.9e-05,1.3e-05,2.8e-05,3.3e-05,2.8e-05,2.4e-05,1.8e-05,2e-05,4.1e-05,2e-05,1.3e-05,3.5e-05,2.2e-05,2e-05,3e-05,2.1e-05,4.3e-05,1.6e-05,1.1e-05,3.6e-05,1.4e-05,1.2e-05,7e-06,1.9e-05,3e-05,2.1e-05,5e-06,1.1e-05,2e-05,3.6e-05,1.9e-05,2.6e-05,2.7e-05,2.3e-05,5e-06,8e-06,1.1e-05,1.6e-05,3.3e-05,6e-06,2.6e-05,6e-06,2e-05,2.1e-05,4.9e-05,1e-05,2.1e-05,2.1e-05,2.4e-05,1.4e-05,3.7e-05,1.9e-05,1.1e-05,2.7e-05,3.6e-05,2.5e-05
3e-06,5e-06,9e-06,1.5e-05,6e-06,1.4e-05,2.1e-05,9e-06,1.6e-05,8e-06,1.1e-05,1.1e-05,4e-06,2e-06,8e-06,4e-06,7e-06,7e-06,7e-06,1.3e-05,1.2e-05,1e-05,5e-06,2e-06,1.8e-05,1.3e-05,7e-06,1.1e-05,7e-06,1.2e-05,1e-06,9e-06,8e-06,1.2e-05,3e-06,5e-06,9e-06,6e-06,5e-06,1.3e-05,1e-05,9e-06,3e-06,7e-06,3e-06,1.2e-05,5e-06,6e-06,1.1e-05,4e-06,1.8e-05,7e-06,7e-06,1.1e-05,7e-06,1e-06,1e-05,1e-06,1e-05,1.6e-05,7e-06,1.2e-05,7e-06,5e-06,4e-06,1.5e-05,7e-06,1.1e-05,8e-06,5e-06,6e-06,6e-06,6e-06,1.6e-05,9e-06,6e-06,1.2e-05,6e-06,1e-06,4e-06,6e-06,1.1e-05,8e-06,6e-06,9e-06,6e-06,3e-06,2e-06,6e-06,1.2e-05,9e-06,5e-06,8e-06,1e-06,1.3e-05,1.3e-05,2e-06,1.2e-05,9e-06,7e-06,1e-06,2e-06,3e-06,8e-06,1.2e-05,2.3e-05,1.3e-05,1.2e-05,9e-06,1.3e-05,9e-06,9e-06,6e-06,3e-06,2e-06,1.4e-05,1.2e-05,6e-06,1.6e-05,9e-06,6e-06
7e-06,1.2e-05,1.1e-05,5e-06,2e-06,0,9e-06,3e-06,1.1e-05,7e-06,1.5e-05,3e-06,1.1e-05,1e-05,4e-06,5e-06,6e-06,8e-06,8e-06,8e-06,1.1e-05,9e-06,4e-06,4e-06,6e-06,6e-06,5e-06,3e-06,5e-06,7e-06,3e-06,1e-05,1.5e-05,7e-06,7e-06,8e-06,1e-05,8e-06,5e-06,8e-06,1.3e-05,9e-06,7e-06,3e-06,7e-06,9e-06,1.5e-05,7e-06,1e-05,9e-06,1.1e-05,3e-06,8e-06,8e-06,4e-06,2e-06,9e-06,4e-06,5e-06,1.1e-05,9e-06,5e-06,2e-06,6e-06,2e-06,4e-06,1e-06,9e-06,4e-06,8e-06,7e-06,9e-06,6e-06,1.5e-05,5e-06,8e-06,1.4e-05,4e-06,7e-06,5e-06,6e-06,8e-06,2e-06,5e-06,2e-06,5e-06,2e-06,3e-06,8e-06,6e-06,6e-06,1e-05,1.2e-05,1e-06,4e-06,3e-06,6e-06,1.2e-05,1.5e-05,7e-06,3e-06,5e-06,4e-06,7e-06,1.3e-05,7e-06,2e-06,7e-06,7e-06,1e-05,4e-06,1e-05,1.1e-05,7e-06,5e-06,6e-06,1e-05,5e-06,8e-06,5e-06,5e-06
2e-06,1.5e-05,8e-06,7e-06,1e-05,3e-06,1e-05,7e-06,8e-06,6e-06,1.3e-05,3e-06,1.6e-05,1.3e-05,1.1e-05,8e-06,6e-06,4e-06,7e-06,7e-06,1.3e-05,1.1e-05,5e-06,5e-06,9e-06,1.3e-05,5e-06,5e-06,6e-06,1.2e-05,4e-06,7e-06,1.6e-05,1.2e-05,5e-06,3e-06,1.2e-05,2e-06,5e-06,5e-06,6e-06,1e-05,5e-06,1.2e-05,2e-06,6e-06,1.1e-05,6e-06,1e-05,7e-06,7e-06,5e-06,3e-06,8e-06,5e-06,4e-06,1e-06,1.1e-05,9e-06,1e-05,3e-06,5e-06,9e-06,1e-06,6e-06,5e-06,1e-06,1e-05,1.3e-05,7e-06,7e-06,1e-05,6e-06,1.8e-05,8e-06,2e-06,1.8e-05,2e-06,7e-06,1e-05,7e-06,6e-06,3e-06,2e-06,2e-06,5e-06,7e-06,8e-06,1.2e-05,4e-06,2e-06,9e-06,6e-06,6e-06,7e-06,5e-06,7e-06,7e-06,1.5e-05,7e-06,5e-06,3e-06,5e-06,1.2e-05,7e-06,8e-06,4e-06,4e-06,7e-06,3e-06,1.4e-05,1e-05,2e-06,1e-05,2e-06,9e-06,5e-06,6e-06,5e-06,2e-06,6e-06
7e-06,1.2e-05,1e-05,8e-06,7e-06,1.7e-05,2.4e-05,2.4e-05,1.1e-05,1e-05,2.3e-05,9e-06,2.2e-05,1.1e-05,1.4e-05,1e-05,1.1e-05,6e-06,9e-06,1.9e-05,2.7e-05,1.4e-05,5e-06,2e-06,5e-06,1.6e-05,2e-05,8e-06,8e-06,2e-05,1.3e-05,1.1e-05,1.7e-05,1.3e-05,5e-06,9e-06,7e-06,1.5e-05,7e-06,8e-06,1.5e-05,2.6e-05,2.1e-05,1.4e-05,1.3e-05,6e-06,9e-06,6e-06,1.6e-05,1.9e-05,1.1e-05,4e-06,2e-06,2.7e-05,1.9e-05,7e-06,6e-06,1.2e-05,1e-05,5e-06,7e-06,6e-06,8e-06,7e-06,8e-06,1.5e-05,1e-05,1.3e-05,2.1e-05,1.4e-05,3e-06,1.3e-05,1.7e-05,1.1e-05,1.6e-05,1.9e-05,1.1e-05,4e-06,7e-06,2e-06,8e-06,7e-06,7e-06,5e-06,1.5e-05,1e-05,8e-06,2e-05,3e-06,1.4e-05,1.1e-05,2e-06,1.5e-05,1.2e-05,3e-06,4e-06,7e-06,5e-06,1.8e-05,1.7e-05,2e-06,4e-06,7e-06,2.1e-05,2.6e-05,7e-06,9e-06,1.4e-05,5e-06,3e-06,1.3e-05,8e-06,1.3e-05,2.1e-05,1.6e-05,8e-06,7e-06,1e-06,2e-05,1.8e-05,1.1e-05
0,1.3e-05,1e-05,7e-06,1e-05,1.5e-05,2.4e-05,1.6e-05,9e-06,1e-05,1.9e-05,1.9e-05,1.9e-05,9e-06,1e-05,1.7e-05,2.5e-05,1.4e-05,1e-05,1.3e-05,1.8e-05,1.9e-05,2.6e-05,2.5e-05,1.4e-05,2.1e-05,2.6e-05,1.6e-05,9e-06,1.3e-05,1.3e-05,1.5e-05,7e-06,1e-05,6e-06,1e-05,1.1e-05,2e-05,2.8e-05,1.3e-05,7e-06,3e-05,2.3e-05,1.8e-05,1.5e-05,2.4e-05,2.2e-05,2.2e-05,3.8e-05,2.6e-05,1.8e-05,1e-05,7e-06,3.7e-05,2.9e-05,2.5e-05,2.8e-05,7e-06,1.9e-05,9e-06,6e-06,1.4e-05,1.5e-05,8e-06,3e-06,1.3e-05,8e-06,8e-06,1.5e-05,1.7e-05,2.3e-05,2.7e-05,3.4e-05,3.3e-05,1.5e-05,2.1e-05,1.9e-05,6e-06,1.2e-05,1.8e-05,1.1e-05,5e-06,1e-05,6e-06,2.5e-05,2.3e-05,1.1e-05,2.1e-05,2.3e-05,2.1e-05,5e-06,4e-06,1.3e-05,7e-06,7e-06,1.6e-05,1.3e-05,1.8e-05,7e-06,2.7e-05,2.4e-05,1.3e-05,1.2e-05,9e-06,2.1e-05,3.7e-05,3.7e-05,2.9e-05,2.8e-05,9e-06,1.8e-05,6e-06,1.4e-05,2.5e-05,1.6e-05,1.8e-05,1.3e-05,3e-06,2e-05,2.7e-05,1.2e-05
6e-06,7e-06,1e-05,9e-06,5e-06,1.7e-05,2.7e-05,1.9e-05,1.2e-05,1.5e-05,7e-06,8e-06,1.8e-05,8e-06,2e-05,9e-06,2e-05,1.4e-05,1.5e-05,9e-06,5e-06,2e-06,1.5e-05,1.6e-05,1.3e-05,1e-05,1.1e-05,1e-05,9e-06,1.6e-05,1.4e-05,6e-06,1.5e-05,1.6e-05,2.2e-05,1.9e-05,1.5e-05,7e-06,1.6e-05,1e-05,1.4e-05,2.3e-05,1.3e-05,1.4e-05,1e-05,1.7e-05,1.5e-05,6e-06,2.3e-05,1.4e-05,1.4e-05,8e-06,4e-06,2.2e-05,1.5e-05,2.1e-05,2.1e-05,1.8e-05,2.2e-05,2.1e-05,1.4e-05,1.3e-05,1.3e-05,1.2e-05,1.1e-05,3e-06,3e-06,1.2e-05,3e-06,1.1e-05,1.4e-05,6e-06,1.8e-05,2.2e-05,1.8e-05,1.8e-05,1.2e-05,1.7e-05,9e-06,6e-06,1.4e-05,1.3e-05,1.5e-05,7e-06,1.7e-05,5e-06,1.1e-05,5e-06,1.5e-05,5e-06,3e-06,4e-06,6e-06,2e-06,4e-06,1.4e-05,6e-06,9e-06,1e-05,2e-05,1.8e-05,1e-05,8e-06,1.1e-05,8e-06,1.9e-05,1.5e-05,7e-06,2.1e-05,1.5e-05,1.6e-05,1.1e-05,1.1e-05,1e-05,1e-05,1.9e-05,1e-05,1.3e-05,4e-06,1e-05,7e-06
1e-05,1e-06,5e-06,1.1e-05,5e-06,7e-06,5e-06,1.3e-05,4e-06,7e-06,8e-06,7e-06,5e-06,4e-06,1.5e-05,1.2e-05,3e-06,1e-06,1.2e-05,9e-06,9e-06,7e-06,5e-06,9e-06,5e-06,1.1e-05,4e-06,8e-06,8e-06,8e-06,8e-06,1.1e-05,1.2e-05,1.2e-05,1e-05,9e-06,8e-06,6e-06,3e-06,2e-06,1.4e-05,6e-06,9e-06,7e-06,1.2e-05,1.9e-05,7e-06,7e-06,7e-06,1.2e-05,1.5e-05,1.6e-05,1.9e-05,7e-06,9e-06,1.8e-05,5e-06,1.1e-05,4e-06,1.1e-05,6e-06,6e-06,1.1e-05,6e-06,6e-06,7e-06,6e-06,1.6e-05,1.1e-05,6e-06,1.2e-05,3e-06,1.2e-05,1.2e-05,7e-06,2e-06,9e-06,7e-06,5e-06,0,5e-06,4e-06,6e-06,8e-06,3e-06,7e-06,9e-06,1e-05,6e-06,6e-06,2e-06,5e-06,8e-06,4e-06,3e-06,8e-06,6e-06,1e-06,9e-06,7e-06,3e-06,7e-06,5e-06,7e-06,9e-06,1.1e-05,4e-06,4e-06,8e-06,7e-06,1.1e-05,7e-06,5e-06,6e-06,1.4e-05,1.3e-05,1.1e-05,8e-06,1.5e-05,6e-06,4e-06
8e-06,4e-06,4e-06,4e-06,6e-06,3e-06,7e-06,3e-06,8e-06,5e-06,6e-06,3e-06,5e-06,2e-06,4e-06,4e-06,3e-06,2e-06,1e-05,6e-06,9e-06,3e-06,3e-06,5e-06,1e-06,8e-06,5e-06,3e-06,4e-06,3e-06,3e-06,3e-06,4e-06,4e-06,8e-06,2e-06,9e-06,8e-06,0,7e-06,7e-06,1.3e-05,4e-06,5e-06,2e-06,9e-06,7e-06,3e-06,7e-06,7e-06,5e-06,6e-06,9e-06,5e-06,2e-06,1.3e-05,4e-06,4e-06,6e-06,8e-06,9e-06,1e-06,7e-06,2e-06,1e-06,3e-06,2e-06,7e-06,2e-06,6e-06,1.3e-05,3e-06,2e-06,6e-06,6e-06,6e-06,9e-06,1e-06,8e-06,8e-06,4e-06,7e-06,9e-06,1.4e-05,1.4e-05,7e-06,4e-06,7e-06,6e-06,2e-06,3e-06,2e-06,5e-06,7e-06,3e-06,7e-06,8e-06,1e-06,8e-06,1.1e-05,1.1e-05,7e-06,2e-06,6e-06,5e-06,1e-05,1.3e-05,4e-06,7e-06,2e-06,1.2e-05,2e-06,3e-06,3e-06,1.4e-05,4e-06,4e-06,5e-06,1.5e-05,7e-06,1e-06
5e-06,4e-06,5e-06,5e-06,8e-06,6e-06,1e-06,6e-06,6e-06,3e-06,4e-06,3e-06,8e-06,4e-06,1e-05,5e-06,7e-06,6e-06,5e-06,1.1e-05,3e-06,5e-06,3e-06,5e-06,2e-06,6e-06,7e-06,3e-06,6e-06,2e-06,2e-06,3e-06,4e-06,4e-06,7e-06,5e-06,6e-06,5e-06,7e-06,2e-06,3e-06,6e-06,9e-06,1e-05,4e-06,6e-06,4e-06,2e-06,8e-06,3e-06,6e-06,3e-06,6e-06,8e-06,8e-06,9e-06,3e-06,8e-06,5e-06,5e-06,1e-06,4e-06,9e-06,4e-06,4e-06,4e-06,1e-06,3e-06,5e-06,8e-06,6e-06,1e-05,2e-06,1e-06,4e-06,6e-06,1.2e-05,5e-06,4e-06,4e-06,2e-06,6e-06,3e-06,1e-05,8e-06,6e-06,2e-06,8e-06,8e-06,1e-05,1e-05,7e-06,4e-06,1e-06,6e-06,3e-06,3e-06,4e-06,6e-06,2e-06,5e-06,4e-06,6e-06,2e-06,2e-06,7e-06,4e-06,8e-06,9e-06,6e-06,7e-06,6e-06,5e-06,2e-06,1e-05,3e-06,5e-06,7e-06,8e-06,1e-06,3e-06
8e-06,4e-06,5e-06,6e-06,3e-06,5e-06,2e-06,5e-06,5e-06,7e-06,1.1e-05,8e-06,6e-06,4e-06,1.1e-05,2e-06,5e-06,6e-06,3e-06,4e-06,4e-06,9e-06,1.1e-05,4e-06,3e-06,3e-06,3e-06,4e-06,7e-06,5e-06,2e-06,3e-06,2e-06,6e-06,3e-06,4e-06,7e-06,9e-06,1e-05,4e-06,5e-06,5e-06,1e-05,5e-06,7e-06,9e-06,6e-06,4e-06,5e-06,9e-06,7e-06,5e-06,9e-06,1e-05,1e-06,5e-06,5e-06,7e-06,6e-06,7e-06,2e-06,6e-06,7e-06,3e-06,4e-06,1.1e-05,1.1e-05,1e-05,1e-05,1.2e-05,8e-06,7e-06,7e-06,4e-06,2e-06,4e-06,6e-06,1.3e-05,1e-05,4e-06,1e-06,4e-06,3e-06,9e-06,4e-06,7e-06,4e-06,4e-06,5e-06,5e-06,7e-06,6e-06,5e-06,6e-06,6e-06,5e-06,5e-06,3e-06,3e-06,3e-06,4e-06,2e-06,5e-06,4e-06,4e-06,7e-06,3e-06,7e-06,1e-06,7e-06,6e-06,2e-06,4e-06,5e-06,1.1e-05,6e-06,6e-06,7e-06,8e-06,6e-06,4e-06
7e-06,4e-06,2e-06,5e-06,2e-06,9e-06,5e-06,5e-06,8e-06,6e-06,4e-06,4e-06,5e-06,3e-06,3e-06,7e-06,5e-06,3e-06,3e-06,3e-06,5e-06,5e-06,4e-06,8e-06,9e-06,2e-06,1e-06,2e-06,3e-06,4e-06,3e-06,2e-06,4e-06,6e-06,7e-06,5e-06,5e-06,5e-06,8e-06,4e-06,5e-06,3e-06,4e-06,2e-06,4e-06,6e-06,1e-06,7e-06,3e-06,9e-06,8e-06,7e-06,9e-06,6e-06,4e-06,3e-06,2e-06,7e-06,5e-06,5e-06,4e-06,6e-06,4e-06,4e-06,7e-06,5e-06,7e-06,3e-06,2e-06,1.2e-05,2e-06,4e-06,4e-06,2e-06,4e-06,5e-06,5e-06,5e-06,4e-06,2e-06,4e-06,3e-06,3e-06,7e-06,4e-06,4e-06,1e-06,5e-06,2e-06,4e-06,8e-06,3e-06,3e-06,4e-06,3e-06,2e-06,2e-06,5e-06,1e-06,2e-06,3e-06,4e-06,4e-06,3e-06,1e-06,5e-06,2e-06,3e-06,2e-06,1e-05,3e-06,4e-06,2e-06,4e-06,7e-06,8e-06,3e-06,1e-06,2e-06,4e-06,2e-06
4e-06,3e-06,3e-06,2e-06,2e-06,4e-06,3e-06,3e-06,6e-06,3e-06,7e-06,2e-06,7e-06,3e-06,3e-06,4e-06,4e-06,5e-06,2e-06,5e-06,2e-06,2e-06,4e-06,5e-06,4e-06,6e-06,1e-06,2e-06,2e-06,2e-06,3e-06,2e-06,4e-06,7e-06,7e-06,1e-06,2e-06,5e-06,3e-06,2e-06,4e-06,4e-06,6e-06,2e-06,3e-06,1e-06,7e-06,6e-06,5e-06,3e-06,6e-06,5e-06,5e-06,4e-06,2e-06,3e-06,2e-06,4e-06,0,4e-06,7e-06,2e-06,2e-06,3e-06,5e-06,8e-06,2e-06,2e-06,0,9e-06,7e-06,4e-06,4e-06,2e-06,7e-06,1e-06,2e-06,3e-06,3e-06,3e-06,3e-06,3e-06,3e-06,7e-06,6e-06,2e-06,1e-06,5e-06,4e-06,3e-06,3e-06,3e-06,3e-06,1e-06,2e-06,0,1e-06,3e-06,2e-06,2e-06,3e-06,3e-06,1e-06,3e-06,2e-06,4e-06,4e-06,4e-06,4e-06,8e-06,7e-06,4e-06,2e-06,2e-06,6e-06,4e-06,4e-06,3e-06,4e-06,5e-06,2e-06
7e-06,1e-06,2e-06,6e-06,6e-06,2e-06,9e-06,4e-06,1.1e-05,3e-06,6e-06,1e-06,6e-06,2e-06,4e-06,6e-06,3e-06,5e-06,1e-06,4e-06,4e-06,2e-06,4e-06,4e-06,3e-06,5e-06,3e-06,3e-06,3e-06,1e-06,1e-06,2e-06,3e-06,4e-06,4e-06,4e-06,4e-06,3e-06,3e-06,2e-06,4e-06,5e-06,3e-06,1e-06,1e-06,2e-06,3e-06,3e-06,4e-06,4e-06,8e-06,2e-06,4e-06,4e-06,2e-06,2e-06,4e-06,4e-06,5e-06,5e-06,8e-06,3e-06,4e-06,3e-06,1e-06,8e-06,8e-06,2e-06,2e-06,6e-06,3e-06,1e-06,4e-06,5e-06,6e-06,2e-06,8e-06,5e-06,3e-06,3e-06,6e-06,6e-06,2e-06,8e-06,4e-06,2e-06,3e-06,6e-06,3e-06,1e-06,4e-06,2e-06,2e-06,1e-06,2e-06,1e-06,2e-06,4e-06,2e-06,1e-06,4e-06,3e-06,2e-06,2e-06,2e-06,4e-06,3e-06,5e-06,2e-06,4e-06,4e-06,1e-06,3e-06,2e-06,7e-06,4e-06,1e-06,5e-06,4e-06,7e-06,4e-06
6e-06,5e-06,5e-06,8e-06,3e-06,6e-06,7e-06,4e-06,1e-05,6e-06,4e-06,7e-06,7e-06,1e-06,5e-06,8e-06,6e-06,7e-06,5e-06,5e-06,1e-06,4e-06,3e-06,1e-06,1e-06,6e-06,5e-06,2e-06,1e-06,6e-06,5e-06,7e-06,5e-06,3e-06,4e-06,4e-06,2e-06,5e-06,4e-06,4e-06,3e-06,3e-06,6e-06,1e-06,5e-06,4e-06,7e-06,1e-06,5e-06,4e-06,4e-06,4e-06,5e-06,3e-06,1e-06,2e-06,4e-06,1.1e-05,5e-06,5e-06,5e-06,9e-06,6e-06,2e-06,5e-06,3e-06,3e-06,4e-06,4e-06,2e-06,6e-06,7e-06,4e-06,4e-06,3e-06,5e-06,8e-06,4e-06,3e-06,4e-06,2e-06,3e-06,4e-06,4e-06,6e-06,7e-06,6e-06,5e-06,6e-06,4e-06,3e-06,4e-06,1e-06,1e-06,3e-06,0,1e-06,6e-06,7e-06,3e-06,4e-06,3e-06,4e-06,1e-06,2e-06,2e-06,5e-06,3e-06,6e-06,4e-06,6e-06,4e-06,5e-06,2e-06,5e-06,5e-06,9e-06,2e-06,4e-06,4e-06,6e-06
5e-06,3e-06,5e-06,2e-06,5e-06,8e-06,8e-06,7e-06,5e-06,7e-06,4e-06,7e-06,7e-06,6e-06,9e-06,6e-06,6e-06,6e-06,6e-06,5e-06,7e-06,5e-06,7e-06,8e-06,4e-06,7e-06,5e-06,6e-06,5e-06,1e-05,9e-06,1e-05,6e-06,4e-06,4e-06,1e-06,2e-06,4e-06,4e-06,3e-06,4e-06,5e-06,1e-06,2e-06,7e-06,4e-06,9e-06,8e-06,8e-06,5e-06,7e-06,6e-06,4e-06,1e-06,3e-06,5e-06,2e-06,6e-06,1e-06,4e-06,5e-06,9e-06,4e-06,2e-06,4e-06,4e-06,4e-06,4e-06,2e-06,3e-06,3e-06,8e-06,1e-05,4e-06,6e-06,5e-06,6e-06,8e-06,3e-06,3e-06,3e-06,5e-06,6e-06,1e-06,5e-06,5e-06,3e-06,5e-06,5e-06,4e-06,5e-06,2e-06,5e-06,3e-06,2e-06,2e-06,3e-06,4e-06,4e-06,3e-06,3e-06,2e-06,3e-06,3e-06,3e-06,1e-06,6e-06,3e-06,4e-06,8e-06,8e-06,6e-06,6e-06,9e-06,9e-06,4e-06,2e-06,5e-06,6e-06,1e-06,5e-06
5e-06,2e-06,2e-06,5e-06,8e-06,6e-06,3e-06,8e-06,2e-06,5e-06,6e-06,4e-06,2e-06,3e-06,4e-06,4e-06,3e-06,2e-06,3e-06,2e-06,4e-06,5e-06,7e-06,8e-06,5e-06,9e-06,1e-06,3e-06,8e-06,7e-06,0,5e-06,3e-06,6e-06,8e-06,1e-06,1e-06,3e-06,3e-06,4e-06,1e-06,4e-06,5e-06,0,5e-06,1e-06,6e-06,3e-06,3e-06,2e-06,5e-06,1e-06,5e-06,3e-06,5e-06,6e-06,3e-06,0,6e-06,6e-06,4e-06,5e-06,2e-06,1e-06,1e-06,2e-06,2e-06,2e-06,3e-06,6e-06,1e-06,3e-06,6e-06,3e-06,5e-06,2e-06,6e-06,6e-06,3e-06,2e-06,1e-06,5e-06,1e-06,7e-06,5e-06,5e-06,2e-06,5e-06,2e-06,2e-06,5e-06,1e-06,6e-06,1e-06,1e-06,1e-06,3e-06,0,0,2e-06,2e-06,2e-06,1e-06,1e-06,2e-06,1e-06,4e-06,4e-06,7e-06,3e-06,5e-06,4e-06,1e-06,3e-06,4e-06,4e-06,3e-06,3e-06,3e-06,4e-06,4e-06
5e-06,2e-06,1e-06,6e-06,5e-06,2e-06,2e-06,4e-06,4e-06,2e-06,4e-06,1e-06,3e-06,2e-06,4e-06,1e-06,3e-06,1e-06,1e-06,2e-06,2e-06,3e-06,3e-06,6e-06,4e-06,3e-06,2e-06,1e-06,5e-06,2e-06,1e-06,4e-06,4e-06,1e-06,3e-06,2e-06,2e-06,4e-06,3e-06,1e-06,2e-06,3e-06,4e-06,1e-06,4e-06,2e-06,6e-06,2e-06,1e-06,1e-06,5e-06,2e-06,5e-06,2e-06,4e-06,3e-06,2e-06,4e-06,4e-06,6e-06,4e-06,4e-06,3e-06,3e-06,3e-06,3e-06,1e-06,1e-06,1e-06,3e-06,3e-06,1e-06,4e-06,3e-06,3e-06,2e-06,5e-06,3e-06,1e-06,1e-06,4e-06,1e-06,4e-06,9e-06,0,1e-06,0,4e-06,2e-06,1e-06,2e-06,1e-06,3e-06,2e-06,2e-06,1e-06,4e-06,1e-06,1e-06,1e-06,4e-06,0,1e-06,1e-06,1e-06,0,3e-06,3e-06,2e-06,3e-06,3e-06,3e-06,1e-06,1e-06,4e-06,1e-06,3e-06,1e-06,4e-06,1e-06,2e-06
6e-06,0,1e-06,5e-06,5e-06,3e-06,2e-06,2e-06,4e-06,2e-06,3e-06,2e-06,2e-06,2e-06,2e-06,2e-06,2e-06,1e-06,1e-06,1e-06,1e-06,4e-06,1e-06,5e-06,1e-06,4e-06,2e-06,2e-06,4e-06,3e-06,2e-06,4e-06,2e-06,2e-06,5e-06,1e-06,2e-06,1e-06,2e-06,2e-06,2e-06,2e-06,5e-06,1e-06,4e-06,3e-06,4e-06,2e-06,2e-06,1e-06,4e-06,1e-06,5e-06,3e-06,3e-06,3e-06,2e-06,3e-06,2e-06,5e-06,2e-06,3e-06,3e-06,2e-06,1e-06,1e-06,1e-06,1e-06,1e-06,3e-06,1e-06,2e-06,3e-06,3e-06,3e-06,2e-06,4e-06,3e-06,1e-06,0,3e-06,2e-06,4e-06,6e-06,0,0,2e-06,2e-06,1e-06,1e-06,2e-06,1e-06,1e-06,0,1e-06,1e-06,3e-06,2e-06,1e-06,1e-06,3e-06,0,1e-06,1e-06,1e-06,1e-06,3e-06,1e-06,1e-06,3e-06,3e-06,1e-06,0,1e-06,2e-06,2e-06,2e-06,0,4e-06,0,1e-06
5e-06,1e-06,1e-06,4e-06,4e-06,3e-06,1e-06,2e-06,5e-06,1e-06,3e-06,1e-06,4e-06,1e-06,3e-06,2e-06,3e-06,1e-06,1e-06,1e-06,1e-06,1e-06,1e-06,5e-06,2e-06,4e-06,1e-06,1e-06,2e-06,2e-06,1e-06,3e-06,2e-06,2e-06,5e-06,0,1e-06,1e-06,3e-06,2e-06,1e-06,2e-06,4e-06,1e-06,4e-06,2e-06,4e-06,2e-06,2e-06,1e-06,4e-06,1e-06,5e-06,2e-06,4e-06,2e-06,1e-06,3e-06,1e-06,5e-06,2e-06,3e-06,2e-06,2e-06,1e-06,1e-06,1e-06,1e-06,1e-06,4e-06,1e-06,1e-06,3e-06,3e-06,3e-06,1e-06,5e-06,4e-06,1e-06,0,1e-06,1e-06,3e-06,6e-06,1e-06,1e-06,1e-06,2e-06,2e-06,0,2e-06,1e-06,1e-06,1e-06,0,1e-06,2e-06,0,2e-06,0,3e-06,0,1e-06,2e-06,1e-06,0,3e-06,1e-06,2e-06,3e-06,4e-06,0,0,1e-06,3e-06,2e-06,2e-06,0,3e-06,1e-06,1e-06
4e-06,1e-06,0,4e-06,4e-06,3e-06,1e-06,3e-06,5e-06,2e-06,3e-06,1e-06,4e-06,1e-06,3e-06,2e-06,2e-06,2e-06,1e-06,1e-06,1e-06,2e-06,1e-06,4e-06,2e-06,4e-06,1e-06,0,2e-06,3e-06,0,3e-06,2e-06,2e-06,4e-06,0,1e-06,1e-06,3e-06,1e-06,1e-06,0,2e-06,1e-06,4e-06,3e-06,5e-06,1e-06,2e-06,0,4e-06,1e-06,5e-06,2e-06,3e-06,3e-06,1e-06,2e-06,2e-06,5e-06,3e-06,3e-06,2e-06,2e-06,0,1e-06,1e-06,0,1e-06,3e-06,1e-06,1e-06,2e-06,3e-06,3e-06,2e-06,5e-06,3e-06,1e-06,0,1e-06,1e-06,3e-06,6e-06,1e-06,1e-06,1e-06,2e-06,1e-06,1e-06,2e-06,1e-06,2e-06,0,1e-06,1e-06,2e-06,1e-06,2e-06,1e-06,3e-06,1e-06,0,1e-06,1e-06,0,3e-06,2e-06,2e-06,3e-06,4e-06,1e-06,0,2e-06,3e-06,2e-06,2e-06,0,3e-06,1e-06,0
