-0.008195,-0.005266,-0.002132,-0.000481,-0.000284,-3.7e-05,-4.6e-05,-0.000143,-0.00029,-0.000356,-0.00044,-0.000409,-0.000416,-0.000731,-0.001281,-0.000776,-0.000348,-0.000612,-9.3e-05,-0.001026,-0.003605,-0.004294,-0.00215,-0.000776,-0.000153,-0.000109,-0.000397,-0.000298,-0.000182,-0.000218,-3e-06,-0.00463,-0.002813,-0.016156,-0.010828,-0.004557,-0.000837,-2.3e-05,-0.001007,0.004707,0.002609,-0.00865,0.00178,-0.005086,-0.011101,-0.009147,-0.012021,-0.010287,-0.012457,-0.009334,-0.01042,-0.013598,-0.006155,-0.017463,-0.01399,-0.017422,-0.014428,-0.019002,-0.024857,-0.015007,-0.009663,-0.012742,-0.006592,-0.004238,-0.009684,-0.009604,-0.005976,-0.014561,-0.00995,-0.009288,-0.007394,-0.002938,-0.009047,-0.007156,-0.00514,-0.005174,-0.002676,-0.002778,-0.002329,-0.001326,-0.001068,-0.001521,-0.001266,-0.002051,-0.002438,-0.00224,-0.001048,-0.000738,-0.000649,-0.00033,-0.000444,-0.000537,-0.000432,-0.000373,-0.001257,-0.001438,-0.000696,-0.00064,-0.000382,-0.001521,-0.001128,-0.000607,-0.000644,-0.000484,-0.000497,-0.000628,-0.000629,-1e-04,-0.001999,-0.001537,-0.001028,-0.003162,-0.002102,-0.013542,-0.012201,-0.006772,-0.00281,-0.001132,-0.000591,-0.0014,-0.002543
0.000304,0.000826,0.000438,-0.000159,-0.000245,-0.000257,-0.00025,-0.000159,-6.8e-05,-0.000116,-9.6e-05,-7.7e-05,-0.00027,2.7e-05,-0.000224,-0.000434,-0.000112,-0.000269,-0.000249,-0.000229,2.5e-05,-0.000969,-0.000325,-5.3e-05,8.8e-05,-9.5e-05,5.5e-05,8.2e-05,4.5e-05,-2.7e-05,5.1e-05,-0.000397,-0.003298,0.010039,0.009476,0.005851,0.002115,0.000143,0.000624,-0.00088,-0.008281,-0.005847,-0.011739,-0.009975,-0.000701,-0.00066,0.000163,0.0018,-0.001308,-0.002967,-0.003334,0.003573,0.002502,0.005168,-0.003591,0.006385,0.000898,0.00242,0.005998,0.002244,-0.002676,0.003294,-0.001446,-0.005617,-0.00061,-0.00493,-0.006804,0.000613,0.003847,-0.002085,-0.002447,-0.003232,-1.2e-05,-0.00037,-0.000838,-0.000356,-0.001025,-0.000222,-0.000988,-0.000122,-0.000863,-0.00087,-0.000628,-0.000747,-0.000849,-0.00099,-0.000511,-0.000495,-0.00015,-0.000228,-0.000175,-0.000652,-0.000192,-0.000217,-7e-05,-0.000664,-0.00041,-0.000223,-0.000647,0.000346,2.6e-05,-0.000938,-0.000986,-0.000581,-0.000241,-8.1e-05,-0.000144,-0.000677,0.000636,0.000753,0.000429,3.1e-05,0.000711,0.00184,0.006054,0.003631,0.001121,-0.000104,-0.000546,0.000462,0.000487
0.001511,0.000527,0.000775,-7.5e-05,-8.6e-05,-0.000121,2e-06,0.000203,-6.1e-05,5.2e-05,0.000272,0.000233,0.000684,0.000254,9.5e-05,0.000154,0.000328,0.000307,0.000221,0.000421,-0.000123,-0.000708,-4.8e-05,0.000262,0,-4.4e-05,9.2e-05,0.000102,1e-04,7.5e-05,-5.2e-05,-4.9e-05,-0.002681,-0.006452,-0.007571,-0.003933,-0.001198,4e-05,-0.000316,0.00082,-0.011299,-0.004981,-0.003601,-0.003397,-0.001593,-0.005104,-0.009339,-0.006749,-0.003224,-0.001238,-0.001247,-0.002725,0.000409,-0.004686,0.000163,-0.005783,-0.001388,-0.003662,-0.005749,-0.003727,-0.003118,-0.0027,0.00174,-0.002742,-0.001484,0.003194,-0.00039,-0.005827,-0.00699,-0.001065,0.000801,-0.000401,-0.003147,-0.000405,-0.000121,-0.001551,-0.001127,-0.000661,-0.00016,0.00029,-0.00084,-0.000275,-0.000215,0.00101,0.000772,-0.000774,-0.001003,-0.000354,0.000142,-0.000316,-0.000611,-0.000151,-0.000319,-7.1e-05,-0.000155,0.000237,-9.6e-05,-0.000198,-0.000143,-0.000143,-0.000135,0.000162,-0.000179,2.8e-05,0.00012,1.2e-05,-2.3e-05,-1.5e-05,-0.001748,-0.001252,-0.000478,-0.000217,-0.001792,-0.002199,-0.006097,-0.003543,-0.001098,6e-06,0.000318,-0.000203,0.000342
-0.002647,-0.001137,-0.000452,-0.000338,-3e-06,-3.2e-05,7.6e-05,1.9e-05,-8.1e-05,-4.7e-05,-0.000121,-0.000372,-0.000488,-0.000269,-0.000231,-0.000474,-0.000336,-0.000385,-0.000278,-0.000212,-0.000167,0.000655,0.000233,-0.000274,-1.7e-05,7.2e-05,-1.3e-05,-8.5e-05,-0.000216,0.00011,-3e-06,0.000132,-0.000294,0.007723,0.006192,0.003058,0.00051,-0.000129,0.000232,9.2e-05,-0.002945,-0.001759,0.003548,0.004798,0.002104,-0.00416,0.000642,-0.001979,0.001997,0.001933,0.003015,-0.001352,0.000286,-0.001693,-0.000679,0.002969,0.004853,-0.001556,0.007517,0.003281,0.000862,-0.002589,-4.9e-05,0.000473,0.004634,0.005255,-0.001326,0.004735,0.00262,0.003381,0.001378,-0.001245,0.002157,8.9e-05,3.7e-05,0.001379,0.001912,0.000745,5.4e-05,-0.00041,-0.000233,7.3e-05,0.000396,0.000131,0.000484,0.000684,0.000384,9.6e-05,0.000131,-0.000169,0.000195,0.000133,0.000146,-0.000575,-0.000191,0.000194,0.000314,-2.3e-05,0.000169,0.000111,0.000338,0.000188,1e-05,-0.000235,-0.000145,4e-05,-3.2e-05,7.4e-05,-0.000439,0.000464,0.000349,0.000156,0.000545,0.000102,0.002747,0.001723,0.000742,-7.6e-05,-0.000239,4.8e-05,-0.000195
0.000465,-0.000699,-0.00052,2.5e-05,-0.00013,-1e-06,-0.00015,-9.6e-05,-8.2e-05,7.6e-05,-6.2e-05,0.00014,0.000179,0.000177,0.000184,0.000783,0.00013,0.000105,-0.00018,-0.00015,-0.000207,-0.000866,-0.000525,-1.1e-05,-4.8e-05,4.6e-05,4.7e-05,-3e-06,6.6e-05,-3.1e-05,0.000101,2.1e-05,0.0015,-0.001892,-0.004742,-0.002978,-0.00105,-0.000293,-0.000392,0.000217,0.003426,0.002728,0.002066,-0.000254,-0.003751,-0.000218,0.000508,-0.004513,-0.005858,0.001091,0.001103,-0.002149,-0.005015,0.000436,0.003532,-0.00334,0.000217,-0.003726,-0.006622,-0.000338,0.001656,0.000525,-0.000336,-0.000621,0.002469,-0.003998,0.000445,-0.000571,-0.00226,-0.002957,-0.000221,0.002149,0.000906,0.000276,-0.00046,-0.001202,-0.001319,-0.000129,0.000249,2.8e-05,-0.000424,0.000195,0.000163,-0.000433,-0.000205,0.000514,0.000128,0.000137,-2.9e-05,-2.5e-05,0.000132,-0.000324,5.8e-05,-5e-06,2e-06,0.000208,0.000222,-6.6e-05,-1e-05,0.000206,-0.000146,2.7e-05,0.000423,0.000477,0.000341,0.000252,7.7e-05,5.9e-05,0.000373,-0.000261,-0.000158,-0.000201,-0.000938,9.6e-05,-0.002169,-0.001102,-0.000331,0.000313,0.000169,0.000231,-0.000218
-0.000161,0.001247,0.001044,9.4e-05,-0.000108,0.000232,-3.3e-05,7e-05,6.7e-05,-8.3e-05,-7.3e-05,-0.000127,0.000119,1.7e-05,-0.000172,-3.5e-05,0.000231,0.000149,0.000185,0.000226,-0.00016,0.000471,0.000311,-8.7e-05,0.000149,0.000118,-8e-05,2e-06,2.5e-05,3.2e-05,-1.8e-05,0.000297,-0.000712,-0.002853,0.000667,0.00022,-0.00021,-0.000225,-8.2e-05,-0.000305,-0.001453,-0.00216,0.003775,0.001808,0.00292,0.001286,0.004216,0.002203,0.000652,-0.002735,0.000359,-0.002444,-0.003706,-0.00208,-0.002917,-0.001891,0.001027,0.002961,0.002459,0.001851,0.000973,-0.002328,0.00199,0.00055,-0.001945,0.001064,0.001852,0.001664,0.001704,0.003009,0.001297,-0.001666,-0.001826,5.1e-05,0.000409,0.000417,-0.000294,6.1e-05,-0.000524,0.000953,0.000335,0.000101,-0.000445,-1.7e-05,3.7e-05,0.000563,0.000518,-2.1e-05,-6.4e-05,3.1e-05,-1.7e-05,-0.00031,-0.000168,0.00027,0.000138,-0.000482,8.3e-05,0.000114,0.000185,-3.9e-05,-0.000213,0.000119,-9.5e-05,0.000252,0.000107,-0.00014,0.000108,0.000108,6.5e-05,-0.000234,-0.000123,0.000232,0.001327,-0.000689,3e-05,0.001269,0.000587,5e-05,-0.00016,0.000161,1e-05
0.00027,-0.000252,-0.000531,-0.000141,0.000121,-9.4e-05,-6.8e-05,-4.3e-05,2.4e-05,-4.1e-05,5.9e-05,-2.8e-05,-2e-05,-8.4e-05,0.000136,-0.000195,-0.000102,-0.000109,-0.000196,-0.000107,9.2e-05,0.000235,0.000129,1.4e-05,-0.000129,-2e-05,-2e-05,1e-05,4e-06,3e-05,4e-05,7.2e-05,0.001363,0.001777,-0.00173,-0.001461,-0.000793,-9.1e-05,-0.00018,0.000104,-0.000743,-0.002479,0.001644,-0.002074,-0.000602,-0.00267,-0.003102,-0.002544,-0.002068,-0.005316,-0.004843,-0.000174,0.000421,0.00474,0.006432,5.8e-05,-0.000766,-0.000163,-0.000756,-0.001429,0.000235,0.001791,-0.003202,0.000856,-0.002518,0.000299,-0.00174,-0.000744,-0.000544,-0.002753,-0.000262,0.002043,0.001014,0.001533,0.001033,0.000507,-0.000272,-0.000205,0.000118,-0.000376,-0.000344,-0.00019,0.00021,2.7e-05,-0.000373,-0.00049,-0.000958,0.000385,0.000111,7.3e-05,-0.000121,0.000395,-0.000236,-2e-05,0.000283,0.000266,0.000116,0.00027,0.000174,-0.000216,0.000119,-0.000136,-0.000237,-0.000113,-4.4e-05,5.8e-05,-0.000131,-9.6e-05,-0.000186,-5e-06,0.000176,-0.000241,-0.000746,0.001102,0.000367,-0.001321,-0.000877,-0.000136,6.3e-05,-3.6e-05,-0.000168
-2e-06,-0.001033,-0.000307,7.2e-05,0.000139,-7.2e-05,1.5e-05,-6.6e-05,-3.2e-05,-2.5e-05,-8.9e-05,5.9e-05,1.2e-05,0.000216,5.6e-05,0.000175,-4.5e-05,-3.2e-05,4.6e-05,2.7e-05,4e-06,-0.000161,-2.4e-05,7.7e-05,-2.5e-05,-8.4e-05,6e-06,-4.1e-05,-3.4e-05,-3.4e-05,-0.000103,-6.1e-05,0.000462,0.000183,-8.9e-05,-0.000722,-0.00022,0.000218,-2.8e-05,-0.000175,0.001156,-0.002694,-0.003992,-0.00261,-6.3e-05,0.001336,-0.001065,0.001855,0.000366,-7.9e-05,-0.001059,0.000358,0.000853,0.001675,-0.00413,-0.002471,0.000735,-0.002753,-0.001792,0.001773,-0.003063,-0.00059,-0.001197,-0.000844,0.000101,-0.00128,0.001042,-0.001251,0.000175,1e-04,-0.001797,-0.000347,0.000432,-0.001097,-0.000275,0.000117,0.000501,-0.000132,0.000608,2.8e-05,0.000372,-0.000275,-0.000189,-4.1e-05,0.00025,-0.00017,0.000494,-0.000292,-0.000132,-7.1e-05,-0.000103,4.9e-05,0.000132,7.3e-05,-0.000334,-9.6e-05,-0.000409,-0.000234,5.8e-05,-0.000131,-0.000228,0.000129,0.000144,-2.6e-05,-0.000119,6e-06,1.1e-05,9.3e-05,1.2e-05,-0.000261,-0.000203,3.7e-05,4e-05,-0.00023,-8.3e-05,1.5e-05,-2.1e-05,-0.000329,3.6e-05,-0.000364,0.00012
-0.000243,0.000756,0.00026,-5e-05,4.4e-05,6.8e-05,6.3e-05,-3e-06,5.2e-05,4.7e-05,4.9e-05,-0.000131,-0.000115,-0.000152,-0.00016,-4.8e-05,-0.000118,7.6e-05,-6.6e-05,-6e-06,-7.9e-05,0.000214,-5.3e-05,-0.000135,-3.8e-05,5.4e-05,3e-05,0,-8.1e-05,-4.3e-05,-4.5e-05,8e-06,-0.000236,-0.000772,-0.000133,-0.000293,-0.000358,0.000111,1.9e-05,-5.3e-05,-0.000473,0.004116,4e-05,0.000667,0.001508,-0.001903,-0.000582,-0.002107,-0.001226,-0.000898,-1.1e-05,-0.000414,0.000138,-0.001868,0.002556,0.003308,-0.001672,-0.001385,0.000535,-0.001625,0.001539,0.001285,0.001552,-0.000434,-0.001373,-0.001594,0.003537,-0.001049,-0.001169,-0.000363,-7.7e-05,0.000108,0.000766,-0.00042,-0.000479,-0.000598,-0.000192,1.8e-05,-0.00019,0.000189,-0.000104,0.000281,1.9e-05,0.000258,0.00025,-0.00011,-0.000402,-0.000725,7.3e-05,-0.000214,-0.000129,-5.9e-05,-3.8e-05,-3e-05,1.8e-05,9.5e-05,-0.000211,-4.3e-05,-0.00021,7.2e-05,9e-05,4.9e-05,-5e-05,-9.4e-05,-0.000158,-8e-05,8e-06,-0.000104,0.000133,0.000346,0.000476,4.3e-05,0.000311,0.000509,9.8e-05,0.000655,0.000125,-0.000164,-5.5e-05,0.000159,2.5e-05
0.000299,-1.2e-05,-0.000229,7.9e-05,-0.000161,-4.3e-05,-3.2e-05,4e-05,-1.7e-05,-9e-06,-1.4e-05,-7.8e-05,-1.3e-05,3.1e-05,0.000131,-4e-06,0.00016,1.5e-05,-8.5e-05,-0.000114,2.8e-05,-8e-05,0.000112,-6e-06,-7.3e-05,-4.8e-05,-3.5e-05,9e-06,2.9e-05,1.2e-05,6.2e-05,-3.8e-05,0.000408,-0.000108,0.001514,0.000366,0.000276,0.000203,-7e-06,-3.7e-05,-0.000278,0.000338,-0.000668,-0.000105,0.002526,0.000925,5e-05,-0.001033,0.000858,-0.001198,0.000583,0.000704,0.002416,-0.00073,-0.002471,-0.001455,-0.001075,0.001214,0.001426,0.001423,-0.002272,-0.000465,-0.000475,-0.00042,-0.000756,-0.001822,-0.000127,-0.000976,5.8e-05,0.001481,0.001546,0.000315,-0.000679,0.000129,0.000514,-0.000129,0.000329,-0.000204,-0.000118,-0.000473,0.000157,-7.4e-05,0.000341,-2.3e-05,-0.00033,5e-05,0.000151,4e-05,8.7e-05,0.000308,3.1e-05,-5.2e-05,-0.000187,6e-06,3e-06,-5.5e-05,1.3e-05,3.4e-05,-5.1e-05,-9.8e-05,6.9e-05,-0.000155,-9.2e-05,8e-06,4.9e-05,0.000104,-8e-06,2e-05,-0.000172,0.000158,-0.000284,4.7e-05,-0.000137,-0.000838,-0.000501,-0.000366,-0.000111,-3.6e-05,-0.000174,-1e-05,-4.4e-05
1.9e-05,-0.000201,-3.8e-05,-0.000124,1.4e-05,-6.8e-05,-5.9e-05,-9.5e-05,3.3e-05,-5e-06,1e-05,1.9e-05,1e-05,-2.9e-05,-5.7e-05,-8.1e-05,0.000209,6.8e-05,5.1e-05,5e-06,-1.2e-05,8.4e-05,-0.000202,0.000139,8.6e-05,1.5e-05,-3.7e-05,2.3e-05,-4.4e-05,-1.1e-05,-6e-05,6.4e-05,-0.000204,-0.000405,-0.001332,1.9e-05,0.000156,7.1e-05,8.7e-05,-0.000116,0.000883,-0.000792,0.000729,0.000603,-0.000934,5e-05,0.00074,-0.001505,-0.000479,0.000551,0.002041,-0.001388,-0.000843,-0.000407,5.4e-05,0.000429,-0.000774,0.001171,-0.000493,0.000506,0.001457,-9.2e-05,-0.000336,0.000571,0.000706,-3e-06,-0.000427,0.000434,0.00033,-0.000369,-0.001251,-0.000253,0.000121,0.000335,-0.000486,7.7e-05,-0.000146,-0.000156,5.9e-05,-2.4e-05,0.000121,0.00019,0.000266,-7.3e-05,-0.00017,0.000123,0.000177,0.000134,-0.000102,-0.000151,0.000171,3.5e-05,0.000219,0.000155,-9.9e-05,8.6e-05,0.000119,0.000212,0.00011,6.6e-05,-5.9e-05,2.7e-05,3.2e-05,4.5e-05,-4.1e-05,6.6e-05,3e-06,-1.5e-05,1.5e-05,-0.000289,0.000136,-2.1e-05,-1.8e-05,-0.000262,6.8e-05,0.00013,-0.00051,0.000121,-4.1e-05,-0.000135,-8e-05
-9e-05,0.000462,-8.2e-05,6e-06,-4e-06,2e-05,-1.2e-05,-3e-06,4.9e-05,3.2e-05,3.6e-05,3.2e-05,-2.8e-05,2.4e-05,-5e-05,8e-06,-6.3e-05,-4.5e-05,3.7e-05,9e-06,-6.6e-05,-1e-06,0.000238,4.5e-05,-7.6e-05,-1.3e-05,-4.5e-05,-3.5e-05,-6e-06,-5e-06,-3.6e-05,-5e-05,-0.000257,0.000258,-0.000537,-0.000162,5.7e-05,6.2e-05,8.4e-05,3e-06,-0.000512,0.000793,-0.002553,0.000286,-0.001665,-0.000224,0.000442,0.002379,1.7e-05,0.00075,-0.000896,-0.000552,-0.00054,-0.000155,0.000604,0.000461,-0.000303,0.000326,-0.000139,-0.000249,-0.000197,-0.000975,-0.000346,0.000145,0.000312,0.000335,0.000289,0.000349,0.000469,0.000199,0.000687,-0.000958,-0.00084,-3e-05,0.000572,-0.000129,-0.000137,0.000575,0.000204,-0.000208,-4.4e-05,-0.000222,6.4e-05,-0.000102,0.000173,-5.5e-05,-0.000117,0.000191,-0.000171,-8.6e-05,6.8e-05,0.000131,8.1e-05,-0.000116,-2.2e-05,-0.000114,-7.3e-05,-2.7e-05,3.7e-05,7.6e-05,-4.2e-05,-0.000114,8e-06,-8.8e-05,6e-06,-1e-05,-6e-06,-2e-05,0,-1.9e-05,-3e-04,-0.000119,2.8e-05,0.000327,2.6e-05,-7e-06,-0.000158,-2.4e-05,4.6e-05,0.000112,7.8e-05
0.000186,-0.000351,0.000165,-3.8e-05,-1.6e-05,1e-04,2.8e-05,3.8e-05,1.6e-05,-3.7e-05,-8e-06,-3.9e-05,-1.4e-05,2e-06,4.4e-05,2.7e-05,-5.6e-05,-2.8e-05,-3.5e-05,-2.8e-05,1.8e-05,-2.6e-05,-4.3e-05,-7e-06,3.4e-05,-1.4e-05,2.9e-05,-3e-06,-3e-06,1.1e-05,5e-06,1.6e-05,6.2e-05,-8e-05,0.000432,5.8e-05,-7.7e-05,5.4e-05,3e-05,-1.9e-05,0,-0.00012,-0.00147,0.000297,0.001812,4.1e-05,-0.000254,0.001175,-0.001353,8.8e-05,0.000789,0.000184,-0.000459,-0.00069,0.001115,-0.000577,0.000636,-0.00147,0.000353,-0.000803,-0.001227,0.000629,0.000888,8.1e-05,-0.000818,-0.000393,-0.000335,-0.000569,-0.000564,-0.000391,-0.000978,0.000434,1.8e-05,-0.000248,-0.000424,0.000285,0.000199,-0.000146,-0.000249,1.7e-05,0.000118,5.5e-05,-0.000218,0.000106,-7.3e-05,-4.2e-05,3.7e-05,-0.000151,-4e-05,4.1e-05,-1.5e-05,-2e-06,-4.5e-05,-5.5e-05,4.2e-05,-5.4e-05,-1e-06,-4.7e-05,-2.2e-05,2.3e-05,8.8e-05,0.000137,-2.5e-05,2.9e-05,-2.3e-05,-2.5e-05,9.1e-05,1.1e-05,2e-06,6.8e-05,0.000111,-1.5e-05,2.5e-05,2.1e-05,2.3e-05,-7.2e-05,-5.5e-05,-0.000174,5.2e-05,7.8e-05,4.2e-05
-0.000133,0.000156,1.2e-05,0.000127,2.7e-05,9e-06,-2.5e-05,2.7e-05,-2e-06,-2.5e-05,-2.8e-05,2e-06,-1.4e-05,-4e-06,-8.4e-05,-7e-05,0,-1e-05,-2.6e-05,2e-05,2.8e-05,7.5e-05,-2.1e-05,-6.3e-05,2.7e-05,6e-06,-4e-06,2e-06,-3e-06,0,-2.4e-05,-2.9e-05,-0.000123,9e-06,-0.000149,6.6e-05,6.3e-05,-3e-05,-5.7e-05,-5e-06,0.000257,-0.000823,0.001057,0.000268,0.000284,0.001019,-0.000109,-0.000574,0.000209,-0.000176,0.000529,-0.000337,0.000933,-0.000367,-0.00012,-0.000382,0.000267,0.001185,-4.2e-05,-0.00045,0.000349,0.000884,0.000342,-0.000955,0.000268,0.000727,1.5e-05,0.001074,0.000242,5.8e-05,0.000416,0.000537,0.000412,-9.7e-05,0.000218,1.9e-05,-5.5e-05,-3.1e-05,-6.9e-05,3.1e-05,3.2e-05,-4.3e-05,-0.000161,-6.6e-05,6e-05,7.9e-05,-4e-06,-6.2e-05,1.7e-05,-3.2e-05,-4e-06,-5.1e-05,-8.7e-05,8.2e-05,-1.2e-05,3.9e-05,4.5e-05,-3.8e-05,1e-05,-6.2e-05,1.4e-05,-0.000115,5.2e-05,-6e-06,-2.4e-05,-1.6e-05,-3.3e-05,2e-06,-1e-06,-4.7e-05,5e-05,-5.1e-05,-8.9e-05,-0.00015,4.5e-05,-0.000101,0.000236,0.000128,7.3e-05,-7.1e-05,-8.1e-05
9.5e-05,-6.9e-05,0.000192,-6.4e-05,-3.1e-05,-3.3e-05,9e-06,1.4e-05,2.5e-05,2.7e-05,0,-2.3e-05,5e-06,-1.7e-05,1.6e-05,6e-05,1e-05,4.6e-05,2.6e-05,-5.5e-05,1.2e-05,-6e-05,-1.9e-05,4.4e-05,-3.1e-05,-7e-06,7e-06,4e-06,4e-06,-1.1e-05,1.1e-05,-2.1e-05,-0.000122,0.000143,0.000307,-1.4e-05,-8.4e-05,5.6e-05,-3.4e-05,2.4e-05,-0.000187,0.000237,0.0012,-0.00025,9.2e-05,-0.000481,-0.000124,-0.000989,0.000948,0.000267,0.000337,-0.000268,3.8e-05,-0.000281,0.000311,-7.2e-05,0.000298,-0.000258,0.000148,-0.000961,0.00054,-6.6e-05,-0.000713,0.000619,-1e-06,7e-06,-0.000297,0.000885,0.000615,3.1e-05,-9.6e-05,2.4e-05,-0.00019,-4.8e-05,-0.000427,-0.000163,5.5e-05,-0.000173,-2e-05,7e-06,-3.5e-05,7.7e-05,4.3e-05,3.3e-05,-0.000117,3.4e-05,3.2e-05,0.000151,-7e-06,5.1e-05,-7e-06,-5.2e-05,5.2e-05,-1.6e-05,7.9e-05,4.9e-05,2.8e-05,-3.9e-05,-5e-06,-1.4e-05,1.1e-05,0.000102,-5.4e-05,-3.3e-05,5e-06,-4.2e-05,-1.5e-05,-9e-06,4.8e-05,2e-05,-5.5e-05,2.8e-05,3.8e-05,1e-04,-6.7e-05,-6.8e-05,0.000223,2e-06,-5.1e-05,-1.3e-05,5.9e-05
-4e-05,-3.9e-05,-1.8e-05,7e-06,-4e-06,-7e-06,-1e-06,-2.7e-05,5e-06,-1.1e-05,-4e-06,2.1e-05,4e-06,-4e-06,1.5e-05,1e-05,-4.8e-05,1.6e-05,-7e-06,3.3e-05,1.8e-05,3.3e-05,1.5e-05,-5.4e-05,2.3e-05,6e-06,-2e-06,-1e-06,0,-3e-06,6e-06,3.3e-05,-5e-06,-0.000167,-0.000286,-0.000289,0.000185,-0.00018,-4.2e-05,7e-06,-7e-05,0.000342,0.001125,5.3e-05,-0.001049,-0.000315,0.000265,-0.000467,-0.000323,-0.000589,-0.000404,-0.000494,0.000311,-1.8e-05,-0.000486,4e-05,-1.6e-05,5e-05,0.000269,-0.000111,-0.000139,0.000499,3.9e-05,-6.4e-05,0.000107,0.000107,-0.000356,-3.5e-05,-0.000171,-0.000181,0.000422,-8.6e-05,-6e-06,4.1e-05,0.000423,0.000154,7e-06,0.00012,3.6e-05,9.7e-05,-6e-06,-2.2e-05,-7.3e-05,-5.5e-05,2.7e-05,-2.3e-05,-0.000105,-6e-06,4.3e-05,-5.4e-05,-2e-05,-1.5e-05,-4.2e-05,-5.2e-05,-4.5e-05,-2.2e-05,-2.2e-05,4.3e-05,-1.9e-05,6e-06,-1.6e-05,1e-05,4.4e-05,-4e-06,-1.4e-05,-2.1e-05,2e-06,0,-1e-06,1e-06,-3.5e-05,-4.1e-05,1e-06,7e-06,7e-05,0.000167,8.2e-05,-7.6e-05,-5e-06,-3.9e-05,-5.1e-05
-6e-06,0.000121,-5.8e-05,-8e-06,4.5e-05,1.3e-05,-1.4e-05,-5e-06,3e-06,-1.9e-05,8e-06,-5e-06,2e-06,9e-06,-3e-05,-2e-06,0,-2.9e-05,1.2e-05,-1e-05,-3e-06,-1.9e-05,1.8e-05,5.3e-05,9e-06,6e-06,-1.4e-05,0,-2e-06,1e-06,-5e-06,-2.9e-05,-7.1e-05,6.5e-05,0.000285,2.9e-05,-0.000119,5.3e-05,-7e-06,2.3e-05,0.00016,0.00011,4.7e-05,-7.2e-05,-0.000601,0.000753,0.000111,0.000613,-0.000102,-0.000102,0.000709,0.000406,0.000234,0.000698,-0.000131,0.000408,0.000136,-4.2e-05,-0.000432,-3.2e-05,-0.000122,-0.000769,-9.9e-05,-4.5e-05,5.2e-05,-0.000147,-0.000244,7e-05,-4.4e-05,0.000206,0.000171,1.6e-05,4.2e-05,0.000222,-0.000125,-0.000118,-5.8e-05,-7.6e-05,1.6e-05,2e-06,8.4e-05,3.7e-05,-1.5e-05,-1.8e-05,-6e-06,-6.7e-05,0.000107,-4.5e-05,1.5e-05,-1e-06,7e-06,1.9e-05,1.8e-05,-1e-05,4e-06,4e-05,-5.4e-05,-5.4e-05,3.3e-05,-2e-06,-2.9e-05,-1.9e-05,-3.7e-05,5e-05,7e-06,5e-06,3.9e-05,-8e-06,-4.8e-05,-2e-05,7.5e-05,2.9e-05,-2.6e-05,-7e-06,-6.6e-05,-0.000112,-0.00012,5.9e-05,2e-05,3.3e-05,9e-06
4.5e-05,-9e-05,-1.1e-05,1.5e-05,2e-06,-1.9e-05,5e-06,-8e-06,-1.2e-05,1.1e-05,0,-9e-06,-4e-06,-6e-06,-8e-06,0,2e-05,3.5e-05,-1.9e-05,1.4e-05,-1e-06,-1.3e-05,-6.2e-05,3e-06,1.5e-05,4e-06,-5e-06,2e-06,1e-06,-4e-06,8e-06,5e-06,-6.2e-05,0.000102,-0.000161,0.000161,4.9e-05,-5.7e-05,1.9e-05,-1.2e-05,-8.3e-05,-0.000193,0.00038,-0.00027,0.000314,-0.000176,-0.000217,-8.9e-05,-0.000242,9.3e-05,0.000513,0.000593,-0.000155,0.000284,-2.7e-05,8.8e-05,-9e-05,-0.000222,-0.000153,4.6e-05,-0.000107,-2.7e-05,-7.9e-05,8.9e-05,0.000182,-0.00019,-0.000504,-0.000157,4.7e-05,-2e-05,5.6e-05,-1e-05,-0.000114,0.000113,-8e-06,3.3e-05,-3.5e-05,5.9e-05,2.3e-05,8e-06,-1.1e-05,8e-06,6.7e-05,1e-06,1.7e-05,4.2e-05,-5.5e-05,-4.3e-05,-1.2e-05,1.1e-05,1.8e-05,2e-06,3.1e-05,3.4e-05,2.9e-05,-3.7e-05,0,-2e-06,-1.1e-05,-9e-06,1.2e-05,3.7e-05,3.3e-05,-2.5e-05,2.1e-05,3e-06,-1e-06,2.2e-05,9e-06,3.3e-05,-6.2e-05,2e-05,7e-06,6.2e-05,1.7e-05,-8e-06,-4.3e-05,-6.2e-05,2.4e-05,2.6e-05,5e-06
-3.5e-05,-7e-06,-4.9e-05,1e-06,1.9e-05,-8e-06,-3e-06,-9e-06,-5e-06,-1e-05,-2e-06,-6e-06,-1e-06,4e-06,1.4e-05,9e-06,2.4e-05,-1.1e-05,-1.1e-05,-1e-05,6e-06,1.7e-05,3.6e-05,-4.9e-05,-2e-05,2e-06,5e-06,0,-1e-06,5e-06,-4e-06,-4e-06,4.9e-05,-0.000176,-0.000207,-1.2e-05,2.9e-05,5e-06,-1.1e-05,1e-06,-3.6e-05,0.000128,-7.3e-05,0.000168,-0.000372,-6.7e-05,-1.6e-05,-0.000117,6e-06,0.000148,-0.000255,-0.000123,0.000162,0.000179,-0.000802,-5.2e-05,-0.000213,0.000341,6.2e-05,-7.3e-05,0.000374,0.00021,0.000272,-0.000221,-0.000143,0.000195,5e-06,-5.6e-05,2.6e-05,0.000141,7.9e-05,-0.000118,4.2e-05,-3.8e-05,-2e-05,3e-05,0,-3.8e-05,-3.3e-05,1.6e-05,-1.5e-05,1.1e-05,9e-06,-5e-06,2.8e-05,3.4e-05,-2e-06,-6.4e-05,-1e-05,9e-06,2e-06,-2.4e-05,1e-05,-2.4e-05,-2.8e-05,-1.4e-05,1.5e-05,-3e-05,-1e-05,7e-06,1.7e-05,-3.2e-05,-2.8e-05,-2.8e-05,1e-06,2e-06,0,-4e-06,8e-06,-2.9e-05,4.2e-05,7e-06,-2.7e-05,-6.6e-05,1e-06,5e-06,-0.000133,3.4e-05,-1.3e-05,-6e-06,2e-06
2.6e-05,0.000102,6e-06,6e-06,2e-06,7e-06,5e-06,8e-06,1e-06,-1.2e-05,3e-06,5e-06,1e-06,-6e-06,-1.7e-05,-2e-05,-1e-05,6e-06,9e-06,-1e-05,-4e-06,-3.3e-05,-2e-06,2.9e-05,9e-06,1e-06,-3e-06,-3e-06,-7e-06,2e-06,-7e-06,3e-06,0,2.8e-05,0.000112,3.8e-05,2.9e-05,-2.4e-05,-9e-06,-4e-06,0.000122,2.3e-05,-0.000364,0.000196,0.000205,0.00022,0.00014,-0.000429,4.7e-05,9.7e-05,0.000421,-0.000254,-7.5e-05,-4.5e-05,0.000418,-8.9e-05,0.000102,3.2e-05,-1.3e-05,0.000382,-0.000106,0.000161,-5.4e-05,0.00016,-0.000103,0.000223,-0.000335,-5.1e-05,-1.8e-05,-7.4e-05,-0.000192,1.1e-05,0.000111,-0.000145,3.1e-05,-0.000121,1.7e-05,8.4e-05,-9e-06,1e-05,9e-06,-1.3e-05,-6e-06,3.8e-05,-6e-06,-2.6e-05,5.2e-05,6.9e-05,5e-06,-4.4e-05,1.2e-05,-5e-06,-3.6e-05,-1.1e-05,-9e-06,1.7e-05,7e-06,1.5e-05,-1e-06,1e-05,-6e-06,1.7e-05,2e-05,1.4e-05,-1.3e-05,8e-06,-7e-06,2e-06,-2.1e-05,-1.1e-05,-9e-06,-1.2e-05,3.5e-05,2.4e-05,-2.4e-05,7e-06,2e-05,1.7e-05,-2.2e-05,2.5e-05,1e-05
4e-06,-0.000109,-1.9e-05,-5e-06,-1.1e-05,5e-06,-7e-06,7e-06,-8e-06,6e-06,-5e-06,-6e-06,0,3e-06,5e-06,-1.1e-05,-2.8e-05,1e-06,5e-06,0,4e-06,1.7e-05,-2.1e-05,-5e-06,-2e-06,0,6e-06,-2e-06,1e-06,-4e-06,3e-06,4e-06,2.7e-05,3e-05,0.000224,-0.000109,-2.8e-05,-4.7e-05,-1.3e-05,5e-06,-7.6e-05,-0.000279,-0.000201,-2.1e-05,2.3e-05,-1.3e-05,0.00012,0.000106,-1.3e-05,8.8e-05,0.000179,1e-06,0.000136,0.000109,-0.000287,-7.2e-05,-0.000111,-4.3e-05,0.000135,4.6e-05,-0.00015,-6.7e-05,7.9e-05,8e-05,-3.7e-05,1.7e-05,3.2e-05,-0.000204,-3.6e-05,4e-05,5.6e-05,0.000129,-6.3e-05,1.3e-05,-6.4e-05,4.3e-05,2.4e-05,-7.7e-05,1.8e-05,-5.1e-05,-3e-05,3.3e-05,-1.5e-05,7e-06,0,-5e-06,-5.1e-05,1.6e-05,2.3e-05,1.9e-05,8e-06,0,1.3e-05,5e-06,-7e-06,8e-06,3e-06,3e-06,3e-06,-9e-06,7e-06,-2.5e-05,-1.1e-05,1.8e-05,-6e-06,2e-06,-4e-06,4e-06,1.1e-05,1.9e-05,1.3e-05,-4e-06,-3.3e-05,-2.9e-05,3.1e-05,1.9e-05,-1.3e-05,-2.3e-05,7e-06,2e-06,-1.7e-05
2e-06,4.5e-05,3.6e-05,-1e-06,7e-06,-4e-06,-2e-06,5e-06,-6e-06,0,1e-06,-6e-06,-3e-06,5e-06,4e-06,-4e-06,7e-06,-5e-06,-4e-06,-2e-06,-2e-06,-1.5e-05,1.7e-05,1e-06,-1.5e-05,-3e-06,-6e-06,3e-06,-1e-06,2e-06,-3e-06,-8e-06,5.4e-05,-6.8e-05,-5.3e-05,-2e-05,1e-06,1e-06,-1.3e-05,-6e-06,-1.5e-05,0.000107,-0.000275,3.1e-05,-0.000144,-0.000253,-8.3e-05,0.000276,2.7e-05,3.1e-05,0.000129,-6.5e-05,-1.6e-05,1.4e-05,0.000119,8.3e-05,2.6e-05,-0.000126,1.7e-05,0,0.000191,-8.5e-05,-8.2e-05,5.1e-05,-0.000143,-4.2e-05,9.6e-05,-0.000115,-4.1e-05,-0.000117,-0.000184,8.6e-05,-5.7e-05,0.000105,0.000111,-1.7e-05,1.9e-05,9e-05,7e-06,-3e-06,0,-2e-05,-2.6e-05,1.9e-05,-1.3e-05,2e-05,1.2e-05,-3.7e-05,7e-06,9e-06,-4e-06,7e-06,-5e-06,2e-06,-1e-05,-5e-06,0,-2.1e-05,-2e-06,-6e-06,-7e-06,1.5e-05,1e-05,-1.4e-05,-7e-06,5e-06,1.5e-05,-2e-06,1.1e-05,-1.2e-05,-2.4e-05,-8e-06,-8e-06,1.4e-05,-3.6e-05,-3.2e-05,3.6e-05,1.9e-05,3e-06,-2.2e-05,7e-06
-7e-06,1e-05,4e-06,6e-06,4e-06,0,-3e-06,-4e-06,-4e-06,-7e-06,1e-06,2e-06,-3e-06,6e-06,-9e-06,-2e-06,8e-06,8e-06,-1e-05,-3e-06,1e-06,-6e-06,-6e-06,-2.8e-05,1.7e-05,-1e-06,-5e-06,1e-06,0,2e-06,-2e-06,7e-06,5e-06,0.000106,-0.000163,7e-06,1.8e-05,-3e-05,-3e-06,3e-06,6.8e-05,0.000208,0.000144,1e-05,-0.000218,0.000253,3e-06,5e-05,3.4e-05,-0.000301,-0.000384,-0.000116,9.8e-05,9.6e-05,2.2e-05,-1.9e-05,8.3e-05,4.5e-05,-4.6e-05,0.000116,-0.000291,-7.2e-05,-8.2e-05,-0.000125,1.4e-05,-0.000187,7.3e-05,0.000214,8.3e-05,3.5e-05,0.000109,-7.5e-05,3.5e-05,3.9e-05,-0.000108,-3e-05,-3.6e-05,-7.6e-05,-1.9e-05,1.7e-05,-8e-06,2e-05,0,-1.8e-05,1.2e-05,6e-06,8e-06,2.2e-05,-1.7e-05,-1.6e-05,-5e-06,-6e-06,-7e-06,-3e-06,7e-06,9e-06,9e-06,1.4e-05,-1e-06,5e-06,-1.1e-05,-1.5e-05,-8e-06,-7e-06,1e-06,0,-7e-06,2e-06,-1.7e-05,2e-06,-6e-06,6e-06,2.9e-05,3e-06,1.4e-05,4e-05,-7.9e-05,4e-06,8e-06,9e-06,-9e-06
-3e-06,-3.5e-05,1.6e-05,-7e-06,-2e-06,1e-05,-1e-06,0,-6e-06,5e-06,-4e-06,-1e-06,2e-06,-6e-06,5e-06,-1e-06,-1e-06,-6e-06,7e-06,-4e-06,-2e-06,7e-06,4e-06,2.3e-05,-7e-06,-2e-06,-3e-06,-1e-06,0,-2e-06,4e-06,-3e-06,2.7e-05,-1.7e-05,8.1e-05,-2.4e-05,4e-06,2.5e-05,-2e-06,-2e-06,-6.1e-05,-0.000127,-0.000181,4.9e-05,0.000231,9.8e-05,-5.5e-05,-0.000103,-0.000126,1.6e-05,0.000262,-2.8e-05,2e-05,-0.000162,0.000279,7.4e-05,-5e-06,6.3e-05,1.9e-05,-2.7e-05,0.000261,4.3e-05,0.000118,-1.4e-05,6.7e-05,-1.8e-05,-0.000153,0.000255,-3e-06,1.1e-05,-6.1e-05,-1.6e-05,-9e-06,-6.3e-05,0.000107,5.5e-05,-1e-06,4.2e-05,6e-06,-3.3e-05,-7e-06,-1e-05,1.4e-05,7e-06,2e-06,0,7e-06,1.4e-05,-1.7e-05,0,-6e-06,-1.1e-05,5e-06,-1.1e-05,-2e-06,-1.3e-05,-2e-06,2e-06,6e-06,1e-06,4e-06,1.3e-05,8e-06,8e-06,1e-06,5e-06,-1e-06,1e-06,-9e-06,4e-06,5e-06,-3e-06,-2.9e-05,-5e-06,-2e-06,-4.5e-05,1.1e-05,-1.3e-05,6e-06,5e-06,5e-06
-9e-06,4.2e-05,1.6e-05,1.8e-05,-9e-06,-2e-06,2e-06,1e-06,-1e-06,-2e-06,4e-06,-5e-06,1e-06,-2e-06,0,5e-06,-1e-05,-2e-06,2e-06,-5e-06,2e-06,-1.5e-05,-1.2e-05,-1.5e-05,4e-06,-1e-06,2e-06,-2e-06,-1e-06,0,-4e-06,2e-06,1.9e-05,-2.8e-05,-3e-05,5.8e-05,1.1e-05,-2e-06,-1e-06,3e-06,-5e-06,-3.5e-05,8.7e-05,-7.2e-05,0.000261,-0.000114,7.2e-05,-0.000269,8.1e-05,-0.000114,-0.000153,-2.1e-05,-7.3e-05,-0.000239,-0.000222,-1e-06,0,-2e-06,-6.6e-05,8e-06,-2.7e-05,8.3e-05,-0.000159,1.2e-05,-2.6e-05,4.7e-05,0.000189,-6e-05,-7e-06,-1e-05,0.000143,-7.2e-05,-2e-05,-5.7e-05,-7.9e-05,-3.1e-05,9e-06,-7.2e-05,1e-05,1.1e-05,-1.3e-05,-3e-06,8e-06,-1.6e-05,-1e-06,-2.6e-05,-3.2e-05,5e-06,-1e-06,-1e-05,1e-06,-6e-06,1.4e-05,8e-06,0,-3e-06,-1.1e-05,8e-06,-9e-06,0,6e-06,-4e-06,-7e-06,4e-06,-4e-06,0,-5e-06,-3e-06,9e-06,-1.2e-05,1.1e-05,-4e-06,2e-06,-6e-06,-6e-06,0,4.9e-05,-9e-06,2e-06,-1e-05,-2e-06
-8e-06,-4.7e-05,4e-06,-7e-06,1e-06,-1.1e-05,-2e-06,-3e-06,-3e-06,-3e-06,0,2e-06,1e-06,3e-06,-5e-06,7e-06,1e-05,-3e-06,0,2e-06,-2e-06,1e-05,6e-06,2e-05,-5e-06,2e-06,2e-06,2e-06,0,0,1e-06,-2e-06,-3e-06,3.2e-05,2e-05,-1.7e-05,-1e-06,7e-06,3e-06,-2e-06,5.1e-05,0.000101,0.000124,-0.000147,-4.7e-05,0.000104,3.5e-05,9e-05,-0.000127,-2.9e-05,3.3e-05,0.000119,4e-05,-0.000175,0.000195,2.5e-05,-2.7e-05,-5.6e-05,-3e-06,-1.2e-05,-0.000118,0.000105,-2.5e-05,6.4e-05,-1.5e-05,3.7e-05,0.000253,4.5e-05,-3.9e-05,3.2e-05,-9.6e-05,-1.7e-05,4.7e-05,6e-06,7.3e-05,-4e-06,-6e-06,7.7e-05,-2e-06,9e-06,1e-06,-1e-06,1.3e-05,4e-06,-7e-06,7e-06,3.6e-05,-1.3e-05,7e-06,1.6e-05,6e-06,6e-06,-8e-06,9e-06,8e-06,5e-06,-9e-06,1e-06,7e-06,2e-06,8e-06,7e-06,3e-06,-1e-06,6e-06,-1e-06,-2e-06,2e-06,-4e-06,9e-06,-6e-06,-3e-06,8e-06,8e-06,1.6e-05,1.8e-05,4.7e-05,4e-06,-5e-06,1e-06,2e-06
9e-06,2.9e-05,-7e-06,1e-06,5e-06,4e-06,0,-5e-06,-2e-06,1e-06,0,0,-3e-06,0,3e-06,4e-06,1.2e-05,1e-06,-8e-06,-1e-06,1e-06,-7e-06,4e-06,1e-06,4e-06,0,1e-06,0,1e-06,-1e-06,1e-06,-1e-06,5e-06,-5.1e-05,-6e-05,-2e-05,-7e-06,-8e-06,0,1e-06,-3.6e-05,-4.1e-05,8.9e-05,0.000105,-2.3e-05,-4.1e-05,-2.4e-05,0.000153,4.5e-05,9.3e-05,-0.000177,1.1e-05,-5.2e-05,4.9e-05,-0.000297,2e-06,-3e-06,2.7e-05,6.4e-05,-5.8e-05,4.1e-05,-2.1e-05,9.7e-05,-5.1e-05,2.4e-05,5.4e-05,-7.2e-05,0.000148,-2.9e-05,-2.8e-05,1.5e-05,7.6e-05,-3.4e-05,3.6e-05,-5.4e-05,3.3e-05,2.2e-05,-2.3e-05,0,1.9e-05,-8e-06,2e-06,4e-06,1e-06,3e-06,1.4e-05,-1.3e-05,-2.2e-05,7e-06,-9e-06,4e-06,6e-06,-3e-06,2e-06,3e-06,3e-06,6e-06,-2e-06,-5e-06,3e-06,4e-06,-1e-06,-2e-06,0,5e-06,-3e-06,7e-06,-2e-06,-4e-06,0,7e-06,-1e-06,-5e-06,-6e-06,-1.8e-05,-1e-05,-5e-06,1.3e-05,-3e-06,6e-06,-2e-06
-1.1e-05,7e-06,-3.5e-05,-1e-06,4e-06,1e-06,-5e-06,-1e-06,1e-06,1e-06,0,-4e-06,1e-06,-1e-06,-1e-06,1e-06,-8e-06,-6e-06,-3e-06,1e-06,0,1e-06,-7e-06,-6e-06,5e-06,2e-06,-1e-06,-1e-06,-1e-06,1e-06,-1e-06,3e-06,1e-06,2e-05,9.9e-05,1e-06,1.6e-05,1.2e-05,-3e-06,-1e-06,-1.1e-05,-8.3e-05,0.000176,1.4e-05,-8.4e-05,-7.1e-05,-1.6e-05,7.8e-05,7.7e-05,7.4e-05,-3.1e-05,-1.6e-05,2.3e-05,7.5e-05,0.000246,-3.8e-05,-3.1e-05,3.2e-05,-2e-05,-8.3e-05,1.3e-05,-2.5e-05,3.5e-05,-5.5e-05,-1.6e-05,-4.3e-05,0.000113,-2.5e-05,6.1e-05,5.4e-05,2.8e-05,3.8e-05,-3.1e-05,-1.4e-05,6.3e-05,-2.8e-05,-1.2e-05,1.8e-05,-5e-06,-1.2e-05,-1.5e-05,-1.6e-05,1e-05,-4e-06,-4e-06,-6e-06,-1.2e-05,-1e-05,1e-06,-1.4e-05,0,0,5e-06,-7e-06,-2e-06,2e-06,0,7e-06,4e-06,-4e-06,-1.2e-05,3e-06,2e-06,7e-06,-2e-06,3e-06,-2e-06,2e-06,1.1e-05,-1.4e-05,-1.2e-05,2e-06,-3e-06,4e-06,1e-05,1.3e-05,-3.1e-05,-1.2e-05,8e-06,1e-06,-1e-06
7e-06,-3.9e-05,3e-06,5e-06,4e-06,-2e-06,0,2e-06,0,-1e-06,-2e-06,-1e-06,0,-1e-06,-3e-06,1e-06,-9e-06,2e-06,3e-06,-3e-06,0,4e-06,-1e-06,-4e-06,-8e-06,0,-3e-06,-1e-06,-1e-06,1e-06,1e-06,-3e-06,-2.3e-05,2.1e-05,4e-06,-9e-06,7e-06,6e-06,-2e-06,1e-06,4.5e-05,5e-05,-8.1e-05,-5e-05,0.000243,7.7e-05,-2.4e-05,-0.000109,-0.000113,4.8e-05,0.000114,-1.2e-05,-1.4e-05,6.2e-05,-0.000188,-3e-05,-8e-06,-1e-06,-5.2e-05,1.7e-05,5.9e-05,-1.7e-05,3.5e-05,2.1e-05,-9e-06,-4.9e-05,4e-05,-0.000126,-1.9e-05,-3.3e-05,2e-06,-8e-06,3.9e-05,-4.8e-05,-3.9e-05,1.2e-05,-1.6e-05,-2.3e-05,-6e-06,-9e-06,-2e-06,3e-06,2e-06,0,2e-06,-4e-06,1.9e-05,2.1e-05,-2e-06,9e-06,-4e-06,-6e-06,-4e-06,4e-06,-1e-06,0,5e-06,-1e-06,-3e-06,-5e-06,-6e-06,-2e-06,-1e-06,-7e-06,-2e-06,-6e-06,-5e-06,0,-3e-06,4e-06,-1e-06,-3e-06,1e-06,0,-7e-06,-1.8e-05,-7.2e-05,-4e-06,1e-06,-2e-06,1e-06
4e-06,3.3e-05,-1.3e-05,-4e-06,-2e-06,-1e-06,0,2e-06,1e-06,1e-06,2e-06,2e-06,1e-06,-1e-06,2e-06,-2e-06,0,1e-06,0,-3e-06,1e-06,-5e-06,7e-06,-1e-06,3e-06,1e-06,0,1e-06,1e-06,-1e-06,1e-06,2e-06,-1e-06,-2.9e-05,-0.000138,-1.5e-05,-1.2e-05,9e-06,-3e-06,-1e-06,-2.8e-05,7.4e-05,5.6e-05,2.4e-05,-5.2e-05,9e-06,5.1e-05,-6.3e-05,4.5e-05,-8e-06,-0.000225,-5.5e-05,-4e-06,-2.4e-05,9.5e-05,4e-06,2.4e-05,3e-06,1.9e-05,-8.7e-05,-3.3e-05,-8e-06,-8.4e-05,1.5e-05,9e-05,-1e-06,5.8e-05,-6.8e-05,-3.4e-05,-3e-06,5.7e-05,-2e-05,-7e-06,-1.2e-05,5e-06,4e-06,7e-06,1e-05,1e-06,2.7e-05,-1.5e-05,-6e-06,-2.1e-05,-8e-06,-2e-06,-2e-06,-9e-06,-1.8e-05,-6e-06,3e-06,-2e-06,-1e-06,-6e-06,8e-06,-4e-06,-4e-06,-2e-06,-3e-06,1e-06,-1e-06,3e-06,-4e-06,1e-06,-4e-06,-3e-06,0,2e-06,-1e-06,-1.1e-05,2e-06,6e-06,0,1e-06,-3e-06,-1e-06,2e-05,-2.5e-05,2e-05,-3e-06,-1e-06,-3e-06
-2e-06,-4e-06,8e-06,7e-06,-3e-06,4e-06,-2e-06,2e-06,3e-06,0,-1e-06,-1e-06,-2e-06,-1e-06,-2e-06,-4e-06,9e-06,-4e-06,-1e-06,0,0,8e-06,-4e-06,-4e-06,-5e-06,0,0,0,-1e-06,0,-1e-06,-2e-06,-1.2e-05,4.1e-05,3.3e-05,-7e-06,9e-06,6e-06,0,0,-1.3e-05,-6e-05,-0.000123,2.5e-05,-6.5e-05,-0.000116,1.9e-05,3.1e-05,-4.6e-05,2.9e-05,-8e-06,-9.3e-05,0,3.4e-05,-3.7e-05,4.9e-05,-3e-06,-5.7e-05,-1e-06,-9e-06,-9.6e-05,6e-06,-4e-06,2.7e-05,1.5e-05,1.1e-05,-4e-05,-5e-06,2.3e-05,-3.2e-05,-9.3e-05,-2.7e-05,-7e-06,2.6e-05,8e-06,-2.4e-05,-2e-06,-1.6e-05,6e-06,-1.6e-05,0,1e-06,1e-06,-1e-06,3e-06,9e-06,-4e-06,8e-06,-2e-06,-1.1e-05,0,4e-06,6e-06,-4e-06,-1e-06,-2e-06,3e-06,1e-06,1e-06,2e-06,4e-06,0,0,4e-06,-2e-06,-1e-06,-1e-06,2e-06,2e-06,-1e-06,-1e-06,0,-2e-06,3e-06,9e-06,-7e-06,4e-06,-1.8e-05,-6e-06,3e-06,2e-06
6e-06,-1.9e-05,6e-06,-5e-06,4e-06,1e-06,0,2e-06,1e-06,0,1e-06,-4e-06,0,2e-06,-1e-06,-4e-06,-2e-06,2e-06,-4e-06,-1e-06,0,-3e-06,1e-06,7e-06,7e-06,0,2e-06,-1e-06,0,0,1e-06,1e-06,-1.5e-05,-1.8e-05,6.5e-05,1e-05,5e-06,5e-06,3e-06,0,3e-05,-2.6e-05,-6.4e-05,5e-06,6.9e-05,9.7e-05,-1.5e-05,7.9e-05,-5e-06,-8.4e-05,-6.2e-05,-1.3e-05,-9e-06,9.5e-05,0.000103,-7e-06,3e-05,2.9e-05,3e-06,9e-06,0.000134,-4e-06,3.3e-05,-1.5e-05,-2.8e-05,6.1e-05,-8.5e-05,1e-06,8e-06,3.5e-05,4.5e-05,-3.2e-05,1.7e-05,2.7e-05,1e-06,1.1e-05,8e-06,9e-06,-2e-06,-6e-06,-2e-06,1e-06,0,1e-06,-3e-06,3e-06,4e-06,9e-06,4e-06,-2e-06,-1e-06,3e-06,2e-06,-3e-06,-2e-06,3e-06,-2e-06,-5e-06,-2e-06,1e-06,5e-06,-3e-06,-1e-06,7e-06,2e-06,0,0,-2e-06,4e-06,1e-06,3e-06,2e-06,-1e-06,-2e-06,-7e-06,-9e-06,5e-05,1.1e-05,4e-06,-1e-06,-3e-06
-6e-06,1.9e-05,8e-06,4e-06,3e-06,-2e-06,-1e-06,-1e-06,3e-06,-2e-06,0,0,0,0,2e-06,-2e-06,-4e-06,-5e-06,3e-06,-1e-06,-1e-06,4e-06,-2e-06,2e-06,0,-1e-06,0,0,0,0,-1e-06,1e-06,2e-06,-1.7e-05,1.3e-05,1.1e-05,3e-06,-5e-06,1e-06,0,-1.4e-05,6.2e-05,-4.7e-05,-2.9e-05,-0.000104,4.9e-05,-1.4e-05,3.8e-05,3.2e-05,-2.1e-05,7e-06,4.1e-05,-3e-06,0.00012,-7e-06,1.5e-05,6e-06,2.6e-05,2.7e-05,2.2e-05,-8.5e-05,-3.1e-05,-6.6e-05,0,1.5e-05,2.7e-05,8.9e-05,-2.5e-05,-3.3e-05,-8e-06,-5.5e-05,3.4e-05,-1.1e-05,8e-06,-2.4e-05,-9e-06,8e-06,-9e-06,-1e-06,-5e-06,-3e-06,-2e-06,-5e-06,3e-06,1e-06,-1.3e-05,8e-06,2e-06,6e-06,5e-06,-1e-06,-2e-06,0,2e-06,-2e-06,0,1e-06,6e-06,2e-06,2e-06,-1e-06,1e-06,1e-06,-6e-06,1e-06,-2e-06,3e-06,1e-06,-6e-06,-4e-06,0,-1e-06,-1e-06,1e-06,7e-06,5e-06,1.6e-05,-4e-06,3e-06,-4e-06,2e-06
-2e-06,-1.5e-05,1.6e-05,-1e-06,2e-06,0,-1e-06,-3e-06,2e-06,-1e-06,-1e-06,2e-06,1e-06,-2e-06,-2e-06,-1e-06,2e-06,2e-06,2e-06,-3e-06,1e-06,2e-06,4e-06,-2e-06,-5e-06,0,-1e-06,0,0,1e-06,0,-1e-06,-1e-06,2.6e-05,-6.7e-05,-8e-06,-4e-06,1e-05,0,0,-1.1e-05,-2.7e-05,-5.9e-05,-1.6e-05,-1.2e-05,-0.000102,-1.5e-05,-5.8e-05,-6.6e-05,-6e-06,-0.000102,4e-05,-4e-05,7e-06,-3.7e-05,3e-06,1.3e-05,4e-06,-1e-06,-1.3e-05,5.9e-05,-2.4e-05,4.6e-05,-3.7e-05,-1.3e-05,-2.1e-05,-0.000136,1.3e-05,2.2e-05,5e-06,2.2e-05,2.6e-05,-1.1e-05,-5e-06,2e-05,-6e-06,-9e-06,5e-06,3e-06,4e-06,1e-06,1e-06,3e-06,4e-06,2e-06,3e-06,-1.9e-05,-3e-06,0,-2e-06,-1e-06,-3e-06,-1e-06,1e-06,0,3e-06,-5e-06,-8e-06,-3e-06,3e-06,-5e-06,0,-1e-06,-4e-06,1e-06,2e-06,-4e-06,-1e-06,2e-06,0,-1e-05,-2e-06,4e-06,0,-7e-06,-1.1e-05,-9e-06,-1.2e-05,4e-06,3e-06,-1e-06
-1e-06,1.1e-05,-9e-06,1e-06,-5e-06,1e-06,-2e-06,-2e-06,1e-06,0,1e-06,-2e-06,-1e-06,0,0,1e-06,4e-06,0,1e-06,-2e-06,-1e-06,-2e-06,-3e-06,3e-06,4e-06,0,-2e-06,0,0,1e-06,1e-06,1e-06,-6e-06,-2.9e-05,3.7e-05,-1e-05,6e-06,-4e-06,-1e-06,0,1.6e-05,-4.8e-05,7.3e-05,2.8e-05,-2e-05,3.8e-05,2.4e-05,-5.4e-05,6.3e-05,-1.5e-05,2e-05,5e-06,-4e-06,-8.6e-05,5.5e-05,-2.2e-05,-5e-06,-2.2e-05,0,6e-05,-4.3e-05,2.8e-05,7e-06,4.3e-05,-7.3e-05,-2e-05,-5.7e-05,6.3e-05,2e-06,-4e-06,-7.4e-05,1.4e-05,1.1e-05,-1.2e-05,-1.3e-05,7e-06,-8e-06,-3e-06,-1e-06,3e-06,-3e-06,8e-06,1e-06,3e-06,-1e-06,4e-06,1.6e-05,-8e-06,-4e-06,-2e-06,1e-06,0,0,-6e-06,1e-06,-2e-06,0,0,2e-06,-1e-06,-2e-06,0,2e-06,4e-06,1e-06,-3e-06,1e-06,0,5e-06,2e-06,4e-06,-1e-06,-6e-06,-1e-06,0,7e-06,-8e-06,1.5e-05,-5e-06,3e-06,0
-1e-06,-7e-06,8e-06,0,-4e-06,0,1e-06,0,2e-06,-2e-06,0,-2e-06,0,1e-06,1e-06,1e-06,-1e-06,-1e-06,-4e-06,-1e-06,1e-06,5e-06,-1e-06,-2e-06,-3e-06,0,0,0,0,0,-1e-06,-1e-06,1e-05,1.6e-05,2.7e-05,1e-06,-2e-06,1.1e-05,-2e-06,0,-2e-06,5.2e-05,-8e-06,-1.6e-05,5.1e-05,1.5e-05,1.9e-05,1.1e-05,-4.4e-05,1.1e-05,-2.5e-05,-1.5e-05,1.8e-05,-1e-04,-4.6e-05,-1.7e-05,-2.1e-05,-1.1e-05,-3e-06,1.7e-05,-1.5e-05,3.3e-05,1.6e-05,1e-05,1.5e-05,-1.9e-05,-6e-06,1.3e-05,-1.7e-05,-1e-06,6e-05,-1.5e-05,3e-06,-8e-06,-1.9e-05,-6e-06,4e-06,9e-06,-1e-06,-5e-06,4e-06,-1e-06,5e-06,0,1e-06,0,-2e-06,2e-06,-3e-06,-7e-06,2e-06,3e-06,-3e-06,-4e-06,1e-06,0,1e-06,1e-06,-2e-06,-3e-06,0,3e-06,-3e-06,5e-06,-2e-06,3e-06,-1e-06,0,-6e-06,-6e-06,4e-06,0,2e-06,1e-06,4e-06,-5e-06,-9e-06,-1e-06,-2e-06,-4e-06,0
1e-06,-9e-06,-1.6e-05,0,1e-06,-2e-06,-2e-06,1e-06,0,-1e-06,0,1e-06,0,0,-1e-06,4e-06,-7e-06,0,-2e-06,0,0,-4e-06,3e-06,-3e-06,5e-06,0,0,0,0,-1e-06,0,1e-06,0,1.2e-05,-3.2e-05,-1.8e-05,2e-06,-1.5e-05,0,0,-9e-06,1.6e-05,6.3e-05,-1.2e-05,-4.9e-05,-6.8e-05,-1.8e-05,6e-05,-2.4e-05,1.7e-05,-2.2e-05,6e-06,1.8e-05,-3.3e-05,2.6e-05,7e-06,-4e-06,2.4e-05,-2.5e-05,1e-06,5.6e-05,1e-05,1.4e-05,-2e-06,3e-05,1.9e-05,-6e-05,-5e-06,6e-06,1.9e-05,3.5e-05,-2.3e-05,-6e-06,1.4e-05,2.9e-05,3e-06,0,3e-06,0,1e-06,-4e-06,4e-06,-2e-06,-1e-06,-1e-06,-1e-06,-1.2e-05,-3e-06,1e-06,5e-06,-1e-06,0,1e-06,3e-06,1e-06,-2e-06,1e-06,0,1e-06,-1e-06,2e-06,-2e-06,4e-06,-4e-06,-1e-06,1e-06,1e-06,-1e-06,-5e-06,0,-6e-06,0,4e-06,0,-4e-06,5e-06,7e-06,-1e-05,2e-06,0,-1e-06
0,2.1e-05,-2e-06,1e-06,1e-06,1e-06,-1e-06,1e-06,0,0,0,1e-06,1e-06,-1e-06,0,3e-06,1e-06,1e-06,1e-06,-1e-06,0,3e-06,-3e-06,-2e-06,-5e-06,1e-06,1e-06,0,0,0,0,-1e-06,1e-06,-2e-05,-3.5e-05,7e-06,5e-06,1.1e-05,0,0,8e-06,-4.5e-05,3.8e-05,2.5e-05,-5.8e-05,4.1e-05,-1.9e-05,-2e-06,4e-05,2e-06,3.8e-05,-2.2e-05,-9e-06,8e-06,-0.000114,1.3e-05,-1.6e-05,2e-06,6e-06,2.3e-05,-4.1e-05,1.1e-05,-5.2e-05,-2.4e-05,-4e-05,2.1e-05,6e-06,-2.2e-05,2.5e-05,-1.8e-05,1.4e-05,-1.4e-05,2e-06,2.7e-05,-3e-05,2e-06,4e-06,-1.1e-05,0,3e-06,5e-06,0,-3e-06,1e-06,2e-06,-6e-06,1.1e-05,1e-06,2e-06,1e-06,-2e-06,-3e-06,1e-06,1e-06,0,2e-06,2e-06,1e-06,-1e-06,0,4e-06,2e-06,-4e-06,-3e-06,1e-06,2e-06,2e-06,1e-06,5e-06,2e-06,5e-06,-1e-06,-7e-06,-1e-06,6e-06,-1e-06,-5e-06,1.1e-05,3e-06,3e-06,1e-06
2e-06,-1.9e-05,-9e-06,-2e-06,-1e-06,2e-06,0,2e-06,0,-1e-06,0,-2e-06,0,0,1e-06,2e-06,5e-06,1e-06,0,-1e-06,0,-1e-06,0,6e-06,0,0,-1e-06,0,0,0,-1e-06,0,6e-06,1.9e-05,5.7e-05,-4e-06,-6e-06,-1.4e-05,0,0,0,1.1e-05,2.8e-05,-6e-06,-2.3e-05,3.5e-05,5e-06,-5.6e-05,-5e-05,-1.4e-05,-5e-06,-5.6e-05,-1.7e-05,-1.4e-05,0.000119,5e-06,1e-06,-3e-06,1.2e-05,3e-06,2e-05,1e-06,1.8e-05,4e-06,-8e-06,-3e-06,-2.4e-05,-9e-06,-1.6e-05,-5e-06,-5e-06,9e-06,0,5e-06,2.2e-05,-1e-06,6e-06,2e-06,0,5e-06,2e-06,-1e-06,-5e-06,0,-1e-06,9e-06,0,-5e-06,0,-9e-06,-2e-06,-2e-06,1e-06,-4e-06,0,-1e-06,-1e-06,-4e-06,1e-06,0,0,0,3e-06,2e-06,0,0,-3e-06,0,0,0,-4e-06,-1e-06,3e-06,1e-06,-5e-06,-1e-06,-2.2e-05,-2e-06,-2e-06,-2e-06,-1e-06
2e-06,1e-06,-2e-06,3e-06,-4e-06,-1e-06,-1e-06,1e-06,-1e-06,-1e-06,0,-2e-06,0,0,-1e-06,0,1e-06,1e-06,-1e-06,-2e-06,0,-1e-06,0,-2e-06,1e-06,1e-06,-1e-06,0,-1e-06,0,1e-06,0,1e-06,-1.6e-05,2.9e-05,3e-06,1e-06,8e-06,1e-06,0,-4e-06,2.9e-05,1.4e-05,8e-06,7.5e-05,-7e-05,1.2e-05,-2.4e-05,1.9e-05,1e-05,3.2e-05,-2.7e-05,-5e-06,-4.7e-05,-0.00011,1.2e-05,-3e-06,-9e-06,-1.5e-05,-1.2e-05,-1.1e-05,1e-05,-1.6e-05,1.3e-05,3.8e-05,-1e-05,2.8e-05,-5e-06,-3.5e-05,-4e-06,-3.8e-05,2.9e-05,-8e-06,-2.8e-05,-1.8e-05,1e-06,-1.1e-05,-7e-06,1e-06,2e-06,3e-06,2e-06,-5e-06,1e-06,1e-06,-2e-06,-7e-06,0,0,1e-06,1e-06,0,0,-1e-06,-1e-06,3e-06,1e-06,3e-06,-1e-06,0,-4e-06,-3e-06,-3e-06,2e-06,0,3e-06,1e-06,0,-3e-06,0,4e-06,0,0,-1e-06,0,6e-06,-3.4e-05,-3e-06,-3e-06,-1e-06,1e-06
0,9e-06,6e-06,-3e-06,-1e-06,0,-1e-06,0,-1e-06,1e-06,0,1e-06,0,1e-06,0,0,-5e-06,1e-06,-3e-06,-1e-06,0,1e-06,-1e-06,6e-06,-1e-06,0,-1e-06,0,1e-06,0,0,-1e-06,-1e-06,-5e-06,-7.6e-05,8e-06,3e-06,-8e-06,0,0,2e-06,-3.4e-05,-3.4e-05,-1e-06,5.6e-05,3.9e-05,9e-06,2.1e-05,8e-06,-1.1e-05,4e-06,4e-06,8e-06,-1.9e-05,0.000106,7e-06,7e-06,2e-06,1.1e-05,-1.7e-05,-1.1e-05,1.2e-05,-1e-05,9e-06,-3.2e-05,-1e-05,3.2e-05,-2.3e-05,3.9e-05,1.7e-05,5.7e-05,2e-06,8e-06,-2.6e-05,3.1e-05,-2e-06,-1e-06,1e-05,1e-06,-9e-06,7e-06,-1e-06,4e-06,0,-1e-06,-4e-06,2e-06,8e-06,0,2e-06,2e-06,1e-06,1e-06,4e-06,-1e-06,-2e-06,-1e-06,2e-06,-1e-06,1e-06,-3e-06,5e-06,3e-06,-3e-06,-1e-06,-3e-06,1e-06,1e-06,4e-06,-2e-06,-3e-06,0,-3e-06,0,1e-06,-1e-06,-2e-06,3e-06,2e-06,1e-06,-1e-06
-1e-06,-9e-06,-1e-06,4e-06,2e-06,0,-1e-06,-1e-06,-1e-06,0,0,0,0,0,0,-2e-06,-1e-06,-1e-06,1e-06,-1e-06,0,-3e-06,1e-06,-6e-06,4e-06,0,0,0,0,0,0,1e-06,3e-06,1.8e-05,6e-06,-8e-06,4e-06,3e-06,-1e-06,0,-1e-06,-1e-05,-2.2e-05,-1.1e-05,-5.8e-05,3.3e-05,-7e-06,2e-06,-3.8e-05,2e-06,3.7e-05,1.7e-05,9e-06,6.4e-05,-0.000132,-9e-06,1.2e-05,2e-06,7e-06,-2e-06,4.4e-05,-1.4e-05,3.2e-05,-7e-06,0,-4e-06,3e-06,3e-06,1.1e-05,-9e-06,-5.4e-05,-4e-06,4e-06,4e-06,-3.8e-05,-2e-06,6e-06,-8e-06,-1e-06,0,1e-06,-4e-06,4e-06,-3e-06,1e-06,2e-06,1.1e-05,4e-06,0,-3e-06,0,-2e-06,-1e-06,3e-06,0,1e-06,1e-06,-1e-06,2e-06,0,1e-06,-7e-06,-4e-06,-1e-06,-1e-06,-1e-06,-1e-06,-1e-06,0,-2e-06,0,0,2e-06,0,-3e-06,3e-06,1.3e-05,-3e-06,0,0,0
