0.18053,0.182042,0.196482,0.20229,0.189933,0.195972,0.195525,0.18153,0.176183,0.190184,0.204213,0.184989,0.144039,0.111837,0.108265,0.132594,0.165283,0.180681,0.185348,0.171684,0.157238,0.149922,0.143474,0.134066,0.120897,0.141342,0.15736,0.150884
0.22497,0.228815,0.250842,0.25679,0.241598,0.251539,0.246261,0.224821,0.214471,0.234726,0.259761,0.231416,0.17783,0.140969,0.136643,0.169615,0.212058,0.233313,0.241644,0.225878,0.207374,0.195555,0.186675,0.175071,0.159362,0.187961,0.209613,0.20044
0.294256,0.302522,0.33866,0.344438,0.324708,0.342268,0.325859,0.288433,0.270044,0.302987,0.348642,0.302846,0.229398,0.189515,0.185042,0.232575,0.28919,0.318257,0.33342,0.317538,0.294557,0.272993,0.25907,0.245349,0.227549,0.270347,0.300438,0.287455
0.325205,0.334654,0.381793,0.384963,0.361683,0.385706,0.358866,0.310164,0.288547,0.3309,0.390031,0.330282,0.250158,0.219259,0.217683,0.272058,0.329795,0.35966,0.380312,0.371101,0.352085,0.321526,0.300746,0.289737,0.27593,0.324375,0.358589,0.345824
0.301558,0.305124,0.350373,0.344966,0.317167,0.343232,0.319605,0.273958,0.256737,0.296627,0.351331,0.29844,0.232369,0.215141,0.219135,0.266323,0.30674,0.324823,0.343066,0.346339,0.343713,0.312045,0.28433,0.282806,0.280637,0.314749,0.34082,0.333373
0.252933,0.258091,0.300227,0.281619,0.244482,0.264774,0.258234,0.234856,0.224298,0.237817,0.267459,0.246384,0.211589,0.205638,0.212147,0.241583,0.257915,0.253257,0.26493,0.281435,0.29572,0.271126,0.240824,0.252398,0.26833,0.274187,0.274849,0.275524
0.265753,0.28652,0.340513,0.323421,0.282889,0.291423,0.295514,0.290011,0.276612,0.255555,0.251708,0.251631,0.24175,0.250457,0.253541,0.258827,0.262226,0.253827,0.269672,0.284761,0.30291,0.282556,0.24705,0.262088,0.291357,0.286237,0.266934,0.266785
0.396388,0.410632,0.463456,0.469791,0.441633,0.434305,0.438196,0.454433,0.448452,0.399346,0.353468,0.347908,0.341032,0.35605,0.346683,0.317431,0.326723,0.356339,0.385916,0.383232,0.390781,0.378722,0.347429,0.345245,0.364277,0.363267,0.346273,0.346086
0.634601,0.627502,0.648577,0.699484,0.722968,0.71158,0.703843,0.741528,0.760296,0.670335,0.555291,0.531928,0.521028,0.541165,0.508755,0.427603,0.458268,0.550422,0.594019,0.574826,0.584909,0.596652,0.569798,0.534154,0.526214,0.533607,0.544047,0.551244
1.002083,0.973951,0.934707,1.042252,1.138517,1.142644,1.113411,1.169911,1.252659,1.11451,0.89437,0.83521,0.801031,0.827591,0.779086,0.641772,0.709343,0.862855,0.902566,0.875906,0.945738,1.009297,0.955217,0.870038,0.842993,0.868194,0.918072,0.930239
1.468236,1.410639,1.290161,1.463713,1.637135,1.664171,1.592146,1.676347,1.892524,1.709018,1.339873,1.226467,1.154668,1.192983,1.142551,0.955565,1.071217,1.268162,1.276333,1.23556,1.42648,1.5966,1.482369,1.322755,1.290166,1.353664,1.453724,1.455401
1.880465,1.763364,1.571647,1.789885,2.047212,2.106179,1.937648,2.03135,2.429734,2.262149,1.76859,1.579845,1.461622,1.51281,1.478342,1.287189,1.454097,1.639846,1.585926,1.529521,1.870085,2.183318,1.983967,1.723242,1.696394,1.829891,1.989058,1.961183
1.959823,1.778808,1.576309,1.780747,2.067285,2.151471,1.888437,1.958184,2.484347,2.418678,1.928008,1.688549,1.559516,1.604358,1.581861,1.467783,1.665041,1.775278,1.66206,1.601179,2.021749,2.410949,2.140597,1.812496,1.801378,2.012575,2.227492,2.165427
1.565669,1.386664,1.250312,1.391133,1.606692,1.674167,1.420831,1.452304,1.913884,1.972993,1.661809,1.442034,1.348618,1.367138,1.342505,1.338465,1.511406,1.530367,1.412906,1.373584,1.718155,2.028815,1.794684,1.524002,1.506494,1.722313,1.943947,1.87907
1.102522,1.006931,0.886425,0.922761,1.029105,1.065517,0.974333,0.974071,1.153263,1.241013,1.205461,1.107489,1.047356,1.049321,1.015419,1.03618,1.175747,1.208748,1.145721,1.101082,1.237818,1.342617,1.238571,1.165667,1.096855,1.176983,1.36503,1.392494
1.155844,1.114588,0.926772,0.936572,1.055069,1.039212,1.044337,0.975393,0.891404,0.993849,1.206918,1.260691,1.1816,1.172017,1.093593,1.060926,1.240518,1.381536,1.333049,1.218381,1.280726,1.253123,1.153923,1.170172,1.013001,0.932724,1.150032,1.403881
1.586332,1.552807,1.305861,1.311789,1.508881,1.459648,1.450582,1.311989,1.167153,1.370979,1.666672,1.742069,1.683214,1.672693,1.489227,1.433234,1.688728,1.884805,1.818605,1.651277,1.758,1.768082,1.62148,1.533712,1.265225,1.086796,1.355276,1.844972
1.989472,1.985239,1.695506,1.676884,2.003012,1.919391,1.832467,1.670081,1.544615,1.848723,2.130484,2.154009,2.11659,2.111997,1.876061,1.81475,2.047004,2.235741,2.181775,2.00514,2.117422,2.221089,2.13491,1.920412,1.566542,1.365629,1.615747,2.202428
2.05822,2.189292,2.022456,2.013229,2.47163,2.28143,2.029803,1.958721,1.874163,2.149091,2.369918,2.357357,2.257356,2.217076,2.100916,2.038552,2.121785,2.281904,2.267816,2.088423,2.112175,2.304717,2.379448,2.109881,1.772757,1.661156,1.775654,2.202585
1.783568,2.181323,2.322694,2.39212,2.987401,2.665654,2.122639,2.105063,2.023087,2.154442,2.366319,2.373654,2.091266,1.932476,2.075072,2.118551,2.060014,2.180776,2.186685,1.982846,1.877349,2.069589,2.238725,2.02515,1.788493,1.833905,1.887638,2.033431
1.508039,2.118914,2.43277,2.506327,3.248924,2.984284,2.157737,2.077822,1.956007,2.002793,2.281431,2.254708,1.841286,1.589187,1.901621,2.079131,1.956949,2.068741,2.101538,1.890651,1.717845,1.905899,2.068429,1.83088,1.620953,1.748878,1.870957,1.889539
1.378883,1.84981,2.075127,2.160236,2.980437,2.90877,2.00262,1.81029,1.661936,1.788029,2.160744,2.01489,1.589572,1.400125,1.685411,1.848995,1.728308,1.791462,1.863548,1.68747,1.417911,1.605418,1.898705,1.613614,1.30183,1.421456,1.617334,1.669741
1.193544,1.425275,1.490035,1.557881,2.183864,2.29057,1.692386,1.437667,1.229262,1.383592,1.757071,1.585906,1.238728,1.124654,1.302809,1.394938,1.300181,1.334391,1.403106,1.310029,1.064168,1.209319,1.561524,1.26819,0.952391,1.039853,1.167217,1.241739
1.058356,1.086716,1.03915,1.050767,1.304709,1.453666,1.32498,1.146965,0.887139,0.980296,1.330803,1.277727,1.042975,0.942521,0.946679,0.986262,1.03101,1.017963,0.917114,0.883047,0.809318,0.919385,1.161077,0.911421,0.719335,0.845607,0.86315,0.909429
1.007613,0.932624,0.81505,0.809339,0.88607,0.957738,1.084827,1.095276,0.857386,0.918166,1.295897,1.338539,1.127743,1.051515,0.989304,0.928654,0.973414,0.967303,0.834082,0.739884,0.719474,0.852215,0.976488,0.757675,0.659894,0.824231,0.826604,0.835968
0.960873,0.854171,0.750178,0.770949,0.804981,0.73551,0.883508,1.074578,0.95197,1.064682,1.444728,1.513323,1.322535,1.213126,1.191948,1.07574,1.017536,1.046461,0.98883,0.872508,0.793134,0.843202,0.928736,0.753323,0.649941,0.86813,0.922164,0.90714
1.036999,0.904943,0.842499,0.842929,0.809214,0.630665,0.720818,1.029062,1.00717,1.145073,1.590512,1.685106,1.438033,1.251651,1.309162,1.261821,1.144016,1.123801,1.079952,1.033847,0.946071,0.884576,0.940129,0.784157,0.655573,0.887994,0.988049,1.078454
1.213312,0.994838,0.918038,0.916815,0.804665,0.574953,0.60659,0.922624,0.950432,1.086673,1.606251,1.680147,1.332091,1.173695,1.26117,1.281461,1.204726,1.123744,1.047473,1.090026,1.014808,0.934269,1.012512,0.818757,0.660477,0.862287,0.971217,1.19931
1.221693,0.935391,0.846122,0.930665,0.755749,0.535932,0.639804,0.881886,0.847233,0.906483,1.324502,1.339821,1.020603,0.975223,1.052278,1.100089,1.079378,0.994217,0.900715,0.954874,0.879978,0.849836,1.022369,0.808085,0.592038,0.776716,0.925303,1.224746
0.955418,0.711512,0.655927,0.810843,0.662201,0.493393,0.62787,0.795926,0.774106,0.752386,0.901517,0.85195,0.710321,0.765006,0.860717,0.973462,0.934162,0.788477,0.737088,0.76453,0.672973,0.707464,0.938928,0.714961,0.431914,0.61057,0.788355,1.050691
0.584309,0.517812,0.562818,0.675866,0.612803,0.525711,0.585711,0.689651,0.733161,0.733181,0.724868,0.5532,0.532164,0.67693,0.785966,0.898793,0.760481,0.570982,0.596301,0.642711,0.597934,0.605145,0.767817,0.614491,0.348338,0.527075,0.718128,0.812591
0.468623,0.524459,0.601889,0.637294,0.588321,0.592109,0.600871,0.584777,0.661013,0.753103,0.723687,0.511544,0.488926,0.620048,0.771235,0.806583,0.568524,0.436512,0.511342,0.577054,0.563651,0.498786,0.55321,0.53101,0.406543,0.541296,0.652961,0.564581
0.54093,0.626349,0.708452,0.758214,0.636252,0.601129,0.617263,0.482501,0.550647,0.698593,0.628683,0.470814,0.500651,0.576228,0.720103,0.729487,0.523534,0.499436,0.520771,0.466009,0.475127,0.467037,0.429185,0.437357,0.471296,0.53285,0.515893,0.381357
0.587323,0.699641,0.785954,0.834228,0.650145,0.541703,0.571209,0.40737,0.497822,0.61649,0.467037,0.410261,0.507185,0.53784,0.637252,0.689055,0.571158,0.565792,0.492733,0.334995,0.37149,0.465175,0.410552,0.389409,0.481006,0.466701,0.377408,0.304214
0.528048,0.640354,0.716944,0.738237,0.574768,0.438191,0.456407,0.335801,0.430147,0.555254,0.380875,0.35067,0.438154,0.471821,0.543999,0.574565,0.548546,0.522586,0.416415,0.305173,0.352612,0.426217,0.377002,0.35968,0.433034,0.392912,0.302836,0.269556
0.431498,0.460152,0.50749,0.496849,0.405746,0.315745,0.312442,0.265181,0.351546,0.472948,0.35482,0.283136,0.309657,0.353135,0.393205,0.382464,0.420886,0.389559,0.304345,0.281693,0.311464,0.321543,0.28351,0.330156,0.406239,0.318515,0.223951,0.237556
0.400868,0.321406,0.328482,0.265194,0.241419,0.220584,0.191779,0.191539,0.252547,0.343636,0.295672,0.223187,0.277653,0.319649,0.269724,0.253522,0.321841,0.330915,0.286762,0.262986,0.252705,0.245804,0.206521,0.307015,0.429757,0.295609,0.159288,0.186688
0.429749,0.316712,0.29508,0.210436,0.175218,0.166153,0.133501,0.160306,0.170573,0.208795,0.233161,0.238105,0.339493,0.341534,0.215282,0.231341,0.336479,0.367807,0.344124,0.278023,0.238166,0.25092,0.206914,0.301012,0.403534,0.268934,0.147055,0.147136
0.428005,0.322132,0.292182,0.235521,0.197747,0.158532,0.116417,0.16568,0.150546,0.132293,0.200037,0.263405,0.373294,0.355696,0.205139,0.20583,0.323498,0.360405,0.363214,0.289478,0.240633,0.242813,0.199816,0.268001,0.30969,0.206178,0.137672,0.127311
0.356126,0.278577,0.249078,0.227901,0.207958,0.142025,0.112981,0.181811,0.172583,0.148783,0.189232,0.241728,0.338694,0.317789,0.176495,0.163475,0.254173,0.280869,0.316768,0.264279,0.212576,0.195912,0.154624,0.194828,0.19042,0.129697,0.113055,0.110663
