7e-06,1.1e-05,4e-06,1e-06,1.3e-05,2e-05,2e-05,3e-06,3e-06,1.5e-05,7e-06,2.5e-05,7e-06,2e-06,1.7e-05,1.7e-05,2.3e-05,6e-06,1e-06,5e-06,1.7e-05,1e-05,6e-06,1.6e-05,1.2e-05,0,2e-05,7.2e-05,4.2e-05,5.1e-05,2.6e-05,1.6e-05,2.1e-05,5e-06,3e-06,1e-05,5.2e-05,3.6e-05,7.6e-05,3.5e-05,3.7e-05,6.1e-05,4.9e-05,3.4e-05,3.7e-05,1.3e-05,6e-06,1.3e-05,6.2e-05,7e-06,7.1e-05,2.1e-05,6e-06,2.4e-05,2e-05,1.6e-05,0.000324,4.5e-05,7.8e-05,9.4e-05,3.9e-05,0.000116,2e-05,2.5e-05,3.7e-05,4e-05,0.000103,0.000139,8.2e-05,0.000102,2.3e-05,3.4e-05,4.2e-05,3.4e-05,2.1e-05,4e-06,6.9e-05,5.4e-05,3.4e-05,7.8e-05,3.1e-05,0.000105,1.8e-05,5.7e-05,1.8e-05,1.3e-05,2e-06,3e-05,1.4e-05,0.000179,0.000124,6.9e-05,0,0.000144,9.7e-05,0.000138,5.2e-05,0.000297,8.2e-05,0.000283,0.000117,0.000118,9.1e-05,0.000268,0.000106,3.4e-05,2.2e-05,8.5e-05,4.4e-05,9.6e-05,4.4e-05,9.4e-05,2.1e-05,6.9e-05,1.2e-05,3.9e-05,3.1e-05,0.000145,0.000172,0.000113,6e-06
3.9e-05,4e-05,4.1e-05,5.4e-05,6e-05,6.9e-05,8.6e-05,5.5e-05,4e-05,4.6e-05,4.3e-05,0.000138,6.5e-05,4e-05,4e-05,6.6e-05,9.4e-05,5.7e-05,6.4e-05,5.7e-05,6.7e-05,7.2e-05,5.6e-05,2.3e-05,4.5e-05,3.3e-05,5.1e-05,0.000157,0.000213,7.4e-05,0.000125,0.000153,0.000103,0.000103,7.1e-05,6e-05,0.000115,0.000142,0.000232,0.000114,0.000107,6e-05,0.000151,5.6e-05,5.8e-05,4.7e-05,2.3e-05,3.4e-05,9.3e-05,7.2e-05,0.000109,0.000197,0.000135,7.8e-05,0.000124,0.000127,0.000631,0.00043,0.000322,0.000183,0.000106,0.000197,0.00026,0.000217,0.000166,0.000107,0.000102,0.000401,0.000365,0.000337,0.00024,0.000124,0.000125,4.9e-05,2.3e-05,0.000105,0.000213,9.6e-05,7.4e-05,4.2e-05,8.2e-05,0.000199,0.000207,0.000151,0.000162,0.000147,8.4e-05,0.000111,0.000146,0.000318,0.000109,0.000162,0.000297,0.000287,0.000445,0.000521,2e-04,0.000463,0.000682,0.000525,0.000628,0.000437,0.000357,0.000462,0.000629,0.000519,0.000437,0.000267,0.000268,0.000124,0.000228,0.000111,0.000109,0.000112,9.5e-05,8.9e-05,0.000152,0.000252,0.000467,7.6e-05,0.000149
3.2e-05,1.6e-05,3.5e-05,3.2e-05,3.1e-05,1e-05,3.3e-05,3.8e-05,6e-06,3.1e-05,3.5e-05,0.000138,6.1e-05,1.5e-05,7e-06,6.9e-05,1.1e-05,4.4e-05,3.1e-05,3.3e-05,2.1e-05,4.2e-05,3.4e-05,4.3e-05,4.1e-05,1.7e-05,8.6e-05,3.8e-05,6.7e-05,5.8e-05,0.000134,6.2e-05,8.4e-05,5.1e-05,6.6e-05,8.9e-05,9.8e-05,0.000112,0.000104,7.8e-05,0.000126,0.000132,6.7e-05,5.9e-05,5.8e-05,3e-05,4e-05,3.6e-05,4e-05,4.5e-05,0.000112,0.000118,3.2e-05,5.5e-05,0.000142,2.6e-05,0.000788,0.000615,0.000156,0.000101,5.9e-05,0.000222,5.2e-05,0.00015,0.000128,5.3e-05,4.8e-05,0.000231,0.000133,2.7e-05,9.7e-05,8.2e-05,8.2e-05,7.5e-05,4.5e-05,0.000122,0.000138,6.5e-05,8.2e-05,6.3e-05,6.3e-05,7.3e-05,7.3e-05,2.8e-05,7.4e-05,6.2e-05,3.2e-05,8.1e-05,9.6e-05,0.000144,0.000196,0.000171,0.000275,9.1e-05,0.000251,0.000243,0.000338,7.2e-05,0.000262,0.00016,0.000175,0.000194,0.000263,0.000341,0.000601,0.000209,0.000346,0.000146,0.000149,6.9e-05,0.000177,0.000129,9.6e-05,0.000178,0.000165,8.3e-05,8.9e-05,0.000442,0.000483,0.000353,0.000199
3.3e-05,2.3e-05,3.8e-05,6e-05,7.6e-05,5.7e-05,5e-06,2e-05,3e-05,5.8e-05,2.2e-05,9.2e-05,8.3e-05,2.4e-05,1.9e-05,6.4e-05,7.3e-05,6.2e-05,6.7e-05,9.6e-05,4.4e-05,4.1e-05,1.4e-05,2.5e-05,3.9e-05,4.3e-05,7.4e-05,4.8e-05,8e-06,2e-06,7.2e-05,8.1e-05,6.4e-05,7.4e-05,5.5e-05,5.8e-05,3.8e-05,7.4e-05,5.2e-05,4e-05,0.000121,7.1e-05,1.9e-05,4.6e-05,3e-05,5.1e-05,3.3e-05,6.6e-05,3e-05,4.3e-05,2.9e-05,5.2e-05,4.2e-05,6.4e-05,6.2e-05,7.8e-05,0.000612,0.000503,0.00043,0.00027,4e-05,7.7e-05,0.000141,0.000108,9.1e-05,4.8e-05,1.2e-05,0.000114,5.8e-05,2.3e-05,8.1e-05,1.6e-05,7.1e-05,9.7e-05,7.5e-05,0.000152,9.2e-05,2.7e-05,4.9e-05,4.5e-05,5e-05,2.6e-05,5.8e-05,2.8e-05,6.1e-05,8.2e-05,6.9e-05,3.7e-05,8.6e-05,0.000178,0.00016,0.000246,0.000202,9.7e-05,0.000156,0.000204,0.000352,0.000517,0.000223,0.000333,0.000199,0.000147,7.7e-05,0.000144,0.00043,0.000243,0.000356,0.000337,0.000223,0.000116,0.000151,0.000188,0.000105,8.8e-05,4.8e-05,3.9e-05,8.3e-05,0.000428,0.000636,0.000469,0.000196
2.1e-05,1.9e-05,3.8e-05,2.1e-05,3.1e-05,2.3e-05,2.5e-05,2.3e-05,2.5e-05,4e-05,0.000106,0.000213,6e-05,2e-05,5.5e-05,1.9e-05,2.7e-05,1.7e-05,9e-06,5.1e-05,2.5e-05,5e-06,1.5e-05,2.5e-05,3.7e-05,1.6e-05,3.1e-05,2.7e-05,2.1e-05,3e-05,4e-06,3.7e-05,1.1e-05,1.9e-05,5.2e-05,1e-05,4.4e-05,6.8e-05,4e-05,3.6e-05,6.3e-05,5.1e-05,1.1e-05,2.9e-05,2.1e-05,5.3e-05,5.6e-05,5.9e-05,3.2e-05,3.4e-05,3.9e-05,3.3e-05,3e-06,6.3e-05,4.4e-05,3.2e-05,0.000474,0.000517,0.000301,2.3e-05,0.000129,0.000118,0.000114,1.2e-05,3.1e-05,3.3e-05,5.8e-05,7.3e-05,4.8e-05,1.5e-05,3.1e-05,2.3e-05,4.9e-05,6.5e-05,8e-06,6.3e-05,9.1e-05,3.9e-05,3.4e-05,3.3e-05,2.7e-05,3.6e-05,3e-05,4e-05,2.1e-05,5.1e-05,3.6e-05,5.9e-05,3.1e-05,0.000202,0.000123,0.000251,0.00014,5.9e-05,6e-06,0.000275,0.000212,0.000351,0.000395,0.000205,0.000112,3.5e-05,5e-05,0.000263,0.000323,0.000266,0.000348,0.000205,0.000104,8.2e-05,0.00014,5.1e-05,4.2e-05,8.5e-05,3.8e-05,6.6e-05,2.8e-05,0.000564,0.000948,0.000734,0.000472
1e-05,2e-05,1.9e-05,2e-05,1.8e-05,2e-06,1.6e-05,2.2e-05,3.1e-05,3.8e-05,9.6e-05,0.000196,0.000118,5.4e-05,1.3e-05,2.8e-05,3e-06,1.1e-05,1.9e-05,2e-05,5.5e-05,4e-05,2.1e-05,2.1e-05,3.2e-05,4.2e-05,1.8e-05,3.9e-05,9e-06,1.8e-05,3.9e-05,4.3e-05,3.3e-05,4.9e-05,4.4e-05,2.3e-05,2.4e-05,5.8e-05,3.1e-05,6.1e-05,2.5e-05,8e-06,3.6e-05,2.6e-05,1.6e-05,8e-06,4.4e-05,4.6e-05,2.1e-05,3.2e-05,0.000114,2.9e-05,6.9e-05,3.8e-05,0.000155,7.5e-05,0.001049,0.000843,0.000328,0.000105,6.8e-05,4.7e-05,9.8e-05,8e-06,6.2e-05,2.2e-05,4e-05,4.6e-05,2.2e-05,9e-06,2.1e-05,5e-06,3.9e-05,3.9e-05,2.4e-05,3.8e-05,4.6e-05,3.7e-05,1.4e-05,7e-06,2.4e-05,2.9e-05,2.7e-05,1.5e-05,1.5e-05,1.6e-05,5.5e-05,5.8e-05,5.6e-05,0.000303,0.000296,4.9e-05,8.1e-05,8.1e-05,0.000101,0.000279,0.000183,0.000266,0.000122,0.000306,0.000116,2.6e-05,9.9e-05,0.00018,0.000112,0.000117,4.2e-05,8e-05,3.8e-05,5.7e-05,1.6e-05,6.6e-05,3.9e-05,9e-06,2.2e-05,6.9e-05,1.3e-05,0.000665,0.001093,0.000248,0.000143
2.8e-05,2.1e-05,1.8e-05,1.1e-05,3.8e-05,3.3e-05,1.5e-05,3.2e-05,5.5e-05,3.6e-05,0.000137,0.000156,0.000104,7.4e-05,2.9e-05,1.5e-05,1.1e-05,5.2e-05,2.3e-05,4.8e-05,5.2e-05,1.2e-05,9e-06,3.3e-05,2.1e-05,2.3e-05,2.1e-05,2.1e-05,3.5e-05,3.4e-05,6.7e-05,2.6e-05,2.6e-05,6.4e-05,2.4e-05,3.4e-05,3.2e-05,4.8e-05,2e-05,4.4e-05,1.3e-05,2.2e-05,5.6e-05,5.8e-05,4.6e-05,4e-05,4.6e-05,6.3e-05,4.5e-05,1.3e-05,0.000139,3.8e-05,8.3e-05,7.3e-05,0.000367,0.000209,0.00178,0.00106,0.000356,0.000126,3.8e-05,7.1e-05,8.9e-05,4.3e-05,5.2e-05,6.6e-05,3.9e-05,4e-05,4.6e-05,1.9e-05,6e-06,2e-05,4.1e-05,4e-05,2.1e-05,6.3e-05,0.000109,4.8e-05,5e-05,1.9e-05,2.4e-05,2.8e-05,2.6e-05,3.4e-05,4.3e-05,0.000107,5.8e-05,7.6e-05,0.000142,0.000483,0.000418,0.000123,8.2e-05,5.5e-05,5.9e-05,0.000143,8.4e-05,0.000108,9.1e-05,0.000473,4.6e-05,4.8e-05,6.1e-05,0.000186,9e-06,0.000158,0.00011,6.7e-05,7.2e-05,5.8e-05,7.4e-05,5.8e-05,1.9e-05,1.3e-05,5e-06,4.2e-05,2.5e-05,0.000713,0.000391,0.000259,6.3e-05
3.5e-05,1.2e-05,1.5e-05,1.8e-05,3.3e-05,2e-05,1.6e-05,2.4e-05,2.5e-05,3.6e-05,0.00013,0.000228,5.6e-05,4.5e-05,2.5e-05,2.2e-05,9e-06,8e-05,7.4e-05,8.8e-05,1.9e-05,4.1e-05,3.6e-05,4.3e-05,5.9e-05,3.6e-05,1.3e-05,3.6e-05,4.9e-05,6.8e-05,4.9e-05,3.6e-05,5.1e-05,8.4e-05,6.6e-05,4.3e-05,5e-05,5.4e-05,1.8e-05,4e-05,2.5e-05,3.5e-05,1.9e-05,3e-05,4.3e-05,0.000107,8.1e-05,9.1e-05,9.5e-05,4.8e-05,0.000161,0.000206,0.000162,0.000104,0.000406,0.000311,0.002555,0.001783,0.001344,0.000504,0.000131,5.8e-05,0.00015,3.2e-05,5e-06,2.6e-05,3.2e-05,8.3e-05,7.8e-05,8.9e-05,5e-06,2.3e-05,3.3e-05,4.7e-05,3.2e-05,8.9e-05,0.000252,9.9e-05,2.8e-05,1.4e-05,4.8e-05,4.6e-05,5.7e-05,3.1e-05,0.000126,0.000284,0.000106,7.9e-05,9e-05,0.000566,0.000655,0.000389,0.000174,0.000135,5.2e-05,0.000492,0.000352,9.8e-05,0.000144,0.000457,0.000332,0.000112,2.2e-05,0.000245,8.7e-05,8e-05,8.1e-05,5.9e-05,5.6e-05,2.8e-05,0.000112,1e-05,5e-05,3e-05,3.3e-05,1.4e-05,5.1e-05,0.000731,0.001144,0.000465,0.000184
1.3e-05,2.3e-05,2.5e-05,1.8e-05,2.6e-05,1e-05,8e-06,3.3e-05,6e-05,8.6e-05,5.5e-05,0.000373,0.000239,7.3e-05,5.4e-05,1.6e-05,6e-06,8.3e-05,0.000125,3.7e-05,6.7e-05,9.4e-05,3.6e-05,3.3e-05,6.8e-05,0.000125,8.9e-05,8.1e-05,6.8e-05,0.000129,0.000101,2.2e-05,3.3e-05,4.1e-05,3.2e-05,2.3e-05,3.4e-05,8.6e-05,3.2e-05,7.7e-05,3.4e-05,7.5e-05,1e-05,9.2e-05,5.7e-05,8.1e-05,1.1e-05,2.3e-05,4.8e-05,5.9e-05,0.000144,0.000292,0.00013,5.1e-05,0.000411,0.000273,0.002824,0.002343,0.00035,0.000182,0.000116,9.4e-05,0.000143,0.000164,0.000114,5.2e-05,7.5e-05,5.4e-05,4.3e-05,0.000111,0.000151,0.000101,0.000126,5.7e-05,0.000113,0.000163,0.000278,0.000236,0.000165,0.000119,9.3e-05,6.1e-05,1.9e-05,4.8e-05,0.000129,0.000268,0.000295,0.000136,1.7e-05,0.000721,0.000544,0.000883,0.000382,0.000154,0.000126,0.000761,0.000358,0.000135,6.8e-05,0.000346,0.000658,0.000387,7.5e-05,0.000205,0.00012,8.3e-05,7.3e-05,4.7e-05,2.9e-05,4.2e-05,8.9e-05,9.1e-05,9.6e-05,3.1e-05,3.5e-05,3.6e-05,0.000104,0.000727,0.002242,0.001284,0.000606
1.7e-05,3.2e-05,1.9e-05,1.1e-05,7e-06,1.9e-05,1.9e-05,2.6e-05,2.6e-05,3.9e-05,1e-04,0.000395,0.000279,0.000139,4.7e-05,6.2e-05,2.9e-05,7.1e-05,4.1e-05,8.9e-05,6.2e-05,8.3e-05,6.2e-05,5.5e-05,3.2e-05,8.4e-05,8.8e-05,6.2e-05,3.7e-05,0.000112,0.000104,7.9e-05,5.2e-05,4.5e-05,3.9e-05,4.6e-05,3.7e-05,0.000144,8e-05,6.3e-05,8.2e-05,9.8e-05,0.00012,0.000167,0.000116,6.8e-05,6.3e-05,1.5e-05,4e-05,2.1e-05,8.1e-05,0.000199,0.000104,7.1e-05,0.00026,0.00019,0.002462,0.00347,0.00242,0.001039,0.000246,3.7e-05,0.000119,0.000128,7.2e-05,2.5e-05,0.000128,0.000138,0.000117,5.1e-05,0.000137,4.3e-05,0.000153,0.000147,0.000149,0.000227,0.000438,0.00035,0.00025,9.5e-05,0.000101,0.000157,0.000117,6.2e-05,0.000165,0.000338,0.000326,0.00016,5.9e-05,0.000715,0.001279,0.00122,0.000698,0.000309,0.000237,0.000829,0.00065,0.000248,4.4e-05,0.000517,0.000882,0.00045,7.8e-05,0.000133,0.000124,0.000124,6.4e-05,3.8e-05,6.4e-05,3.9e-05,5.5e-05,3.8e-05,3.3e-05,6.6e-05,3.6e-05,8.2e-05,9.2e-05,0.000742,0.002256,0.001467,0.000583
1.3e-05,1.4e-05,1.1e-05,1.4e-05,1.1e-05,9e-06,1.7e-05,1.3e-05,2.3e-05,9e-06,4.8e-05,0.000183,6.1e-05,7e-05,4.2e-05,1.1e-05,1.4e-05,2.7e-05,2.6e-05,9.6e-05,4e-05,5.4e-05,2.4e-05,5.1e-05,6.2e-05,2.7e-05,4.8e-05,8.3e-05,6.5e-05,8.2e-05,0.000159,0.000214,0.000205,0.000152,0.000142,0.000139,6.2e-05,0.000114,0.000164,0.000149,0.00011,2.8e-05,8.8e-05,3.1e-05,5.6e-05,7.9e-05,3.1e-05,9e-06,1.6e-05,2.4e-05,0.000118,5.8e-05,4.5e-05,6.8e-05,6.7e-05,0.000119,0.002154,0.001896,0.000452,0.000142,4.6e-05,4.1e-05,3.9e-05,5.3e-05,3.2e-05,0.000102,0.000128,8.3e-05,4.5e-05,6.5e-05,7.6e-05,0.000118,8.3e-05,6.6e-05,1.7e-05,0.000243,0.000355,0.000117,5.1e-05,4.3e-05,0.000113,4.4e-05,1.1e-05,3.4e-05,0.000174,0.000347,9.5e-05,3.3e-05,1.5e-05,0.000614,0.00125,0.001029,0.000361,6e-05,5.2e-05,0.000532,0.000216,0.000196,7.2e-05,0.000602,0.000485,0.000191,0.000118,6.1e-05,1.7e-05,4.6e-05,5.2e-05,2.3e-05,4.1e-05,1.7e-05,2.7e-05,3e-05,4.3e-05,3.7e-05,3.7e-05,7.1e-05,6.6e-05,0.000831,0.001342,0.000602,0.000156
6e-06,8e-06,5e-06,2.2e-05,8e-06,6e-06,1.6e-05,1.5e-05,1.2e-05,8e-06,2.2e-05,3.5e-05,1.4e-05,5.4e-05,4.7e-05,4e-05,2e-06,1.8e-05,1.9e-05,7e-05,2.3e-05,1.7e-05,4.6e-05,5e-06,4e-06,5e-06,6.5e-05,7.7e-05,4.1e-05,0.000122,2.4e-05,0.000108,1e-05,3.5e-05,8.1e-05,4.8e-05,4e-05,8.1e-05,8.3e-05,3.7e-05,8.9e-05,6.3e-05,6.4e-05,6.1e-05,2.2e-05,6.2e-05,2.4e-05,6e-06,2.4e-05,3.8e-05,0.000126,3.5e-05,2.1e-05,6.9e-05,1.7e-05,9.3e-05,0.001526,0.000261,0.000115,1e-05,2.2e-05,8e-06,1.9e-05,5.1e-05,3e-05,8.2e-05,4.7e-05,8.4e-05,0.000111,4.3e-05,7.7e-05,8.8e-05,6.9e-05,4.2e-05,7.1e-05,0.000163,6.6e-05,3.2e-05,3.9e-05,5.3e-05,2.9e-05,2.2e-05,7e-06,1.8e-05,0.000154,7.1e-05,6.7e-05,5.8e-05,8.8e-05,0.000399,0.000623,0.000113,0.000133,5.5e-05,2.8e-05,8.7e-05,0.000154,2.9e-05,0.000151,0.000545,0.000196,5.2e-05,3.7e-05,5.2e-05,1.6e-05,4.9e-05,3.1e-05,2.9e-05,1e-05,9e-06,3.4e-05,2.5e-05,3.5e-05,1.6e-05,3.2e-05,3.4e-05,4.5e-05,0.000829,0.000378,0.000142,4.9e-05
1.6e-05,9e-06,8e-06,1.8e-05,7e-06,7e-06,9e-06,4e-06,5e-06,8e-06,3.5e-05,3.3e-05,2.7e-05,3.7e-05,1.6e-05,3.2e-05,6e-06,1.3e-05,2.1e-05,4.4e-05,2.6e-05,4.3e-05,8.6e-05,3.3e-05,2.1e-05,1.9e-05,8.1e-05,6.1e-05,5.2e-05,9.4e-05,0.000121,5.2e-05,5.3e-05,2.3e-05,2.4e-05,2.8e-05,1.6e-05,2.5e-05,4.7e-05,3.1e-05,2e-05,2.9e-05,1e-05,2.2e-05,2e-05,4.8e-05,4.3e-05,2.2e-05,3.9e-05,1.8e-05,0.000111,1.9e-05,1e-05,1.2e-05,6.7e-05,7.7e-05,0.00087,0.000219,9.2e-05,2.1e-05,6.8e-05,3.2e-05,1.3e-05,3.1e-05,3e-05,0.000109,6.7e-05,2.7e-05,7.1e-05,6.1e-05,4e-05,2.4e-05,5.6e-05,7.8e-05,5.2e-05,0.000183,0.000162,7.3e-05,0.000118,3.1e-05,3.5e-05,3.9e-05,1.6e-05,9e-06,0.000123,0.000117,3.7e-05,4.2e-05,0.000115,0.000165,0.000558,0.000367,0.000171,9.5e-05,2.6e-05,0.00022,5.3e-05,3.7e-05,0.000132,0.000295,9.3e-05,3.1e-05,4.1e-05,2.6e-05,3e-05,5.6e-05,1.6e-05,2.1e-05,2.7e-05,6e-06,1.9e-05,1.2e-05,1.8e-05,8e-06,2.5e-05,2.6e-05,3.4e-05,0.000791,0.000285,0.000151,3.9e-05
4e-06,1.1e-05,1.8e-05,1.9e-05,1.5e-05,1.7e-05,8e-06,1.1e-05,5e-06,1.2e-05,6.6e-05,5.8e-05,2.6e-05,2.8e-05,3.9e-05,4.7e-05,2.7e-05,2.3e-05,1.6e-05,7.5e-05,7.4e-05,2.6e-05,0.000124,0.000135,0.000105,4.7e-05,0.000116,0.000138,6.5e-05,7e-05,3.6e-05,5.2e-05,4.8e-05,3.5e-05,2.1e-05,1.7e-05,2.8e-05,2.9e-05,6e-05,2.8e-05,3.2e-05,1.3e-05,4e-06,1.7e-05,1e-05,4.2e-05,2.3e-05,1.2e-05,3.7e-05,1.7e-05,0.000122,5.5e-05,5.2e-05,2.8e-05,7.3e-05,2.2e-05,0.000337,0.000295,3.2e-05,7.3e-05,2e-05,4.1e-05,4e-06,2.2e-05,7e-06,8.6e-05,1.9e-05,1.1e-05,2.4e-05,1.9e-05,1.5e-05,3.3e-05,4.9e-05,4.2e-05,2.7e-05,0.000135,8.2e-05,5.8e-05,0.00012,7.7e-05,3.8e-05,1.7e-05,1.3e-05,1.5e-05,9e-05,7.1e-05,1.4e-05,2.1e-05,0.000156,0.000133,0.000447,0.000103,0.000116,2.6e-05,1.9e-05,0.000206,0.000108,5e-05,8.3e-05,0.000178,0.000172,5.2e-05,6.2e-05,3.3e-05,2.6e-05,4.3e-05,4.1e-05,1.9e-05,9e-06,1.7e-05,3e-06,5e-06,2.6e-05,1.6e-05,1.4e-05,3e-05,4.9e-05,0.000738,0.000159,0.000186,0.000103
8e-06,1.7e-05,3.2e-05,4.1e-05,3.9e-05,1e-05,2.3e-05,2.7e-05,1.9e-05,1.2e-05,9.7e-05,6.1e-05,2.6e-05,6.3e-05,2.8e-05,5e-05,1.6e-05,3.2e-05,2.4e-05,8.7e-05,5.5e-05,7.3e-05,5e-05,5.3e-05,5.1e-05,2.6e-05,0.00011,0.000183,0.000105,6.3e-05,5.2e-05,5e-05,3.2e-05,7.1e-05,3.7e-05,3.2e-05,3.4e-05,8e-06,4.4e-05,3.4e-05,2.7e-05,1.8e-05,5e-06,1.6e-05,1.5e-05,4e-05,3.5e-05,3.7e-05,2.6e-05,3.9e-05,0.000152,4.8e-05,6.3e-05,2.3e-05,3.9e-05,7.9e-05,0.00056,0.000354,0.000221,7e-05,5.2e-05,3.3e-05,3.2e-05,4.8e-05,1.3e-05,6e-05,5.9e-05,3.1e-05,2.2e-05,3.1e-05,3.9e-05,4e-05,5.7e-05,2.8e-05,3.7e-05,0.000112,4.1e-05,3.6e-05,4.9e-05,3.6e-05,2.6e-05,1.6e-05,1.5e-05,8e-06,5.3e-05,4.6e-05,2.2e-05,4.8e-05,0.000141,0.000471,0.000611,0.000303,0.00013,0.000118,4.5e-05,0.000136,0.000112,6.7e-05,0.000134,0.000207,9.3e-05,4.5e-05,1.9e-05,5.2e-05,3.3e-05,5.8e-05,4e-06,1.5e-05,2.6e-05,2.8e-05,2.3e-05,9e-06,3.4e-05,8e-06,3e-05,2.3e-05,4.7e-05,0.000735,0.000452,0.000237,0.00017
1.5e-05,2.7e-05,3e-05,1.4e-05,1.8e-05,3.5e-05,9e-06,1.2e-05,1.7e-05,2.7e-05,0.000133,7.9e-05,5e-05,8e-05,2.9e-05,7.8e-05,5.8e-05,4.3e-05,2.7e-05,6.2e-05,3.2e-05,2.7e-05,6.3e-05,4e-05,9e-06,8e-06,8.7e-05,4.4e-05,6.3e-05,3.1e-05,1e-05,5.5e-05,5.1e-05,4.5e-05,3e-05,1.7e-05,1.7e-05,1.4e-05,8e-06,1.6e-05,2.1e-05,9e-06,1.3e-05,3.2e-05,3.7e-05,0.000106,6.2e-05,6.4e-05,6.2e-05,9.6e-05,0.000146,9e-05,2.6e-05,1.7e-05,1.7e-05,5e-05,0.001168,0.000239,0.000175,6e-05,4.7e-05,5e-05,9.6e-05,2.3e-05,3.4e-05,6.2e-05,6e-05,2.9e-05,4.9e-05,1.9e-05,3.1e-05,3.1e-05,4e-05,1.6e-05,3.4e-05,0.000111,5.3e-05,5e-05,3.2e-05,4.8e-05,6e-06,1.3e-05,9e-06,1e-05,4.3e-05,3.4e-05,1.8e-05,2.3e-05,0.00018,0.000657,0.000568,0.000268,7.1e-05,0.000177,0.000137,0.000406,0.000307,0.000185,0.000345,0.000113,6.3e-05,7.2e-05,4.1e-05,6.3e-05,3e-05,5e-06,2.5e-05,1.9e-05,3.7e-05,6.2e-05,7.4e-05,7.6e-05,1.3e-05,3e-05,3.1e-05,1.2e-05,7.6e-05,0.000697,0.000682,0.000302,0.000142
1.4e-05,9e-06,1.8e-05,1.8e-05,1e-05,1.9e-05,2.5e-05,9e-06,1.1e-05,2.7e-05,0.000142,0.00028,0.000141,0.000117,6.5e-05,5.5e-05,5.1e-05,2.7e-05,1.5e-05,5.8e-05,6.1e-05,2.5e-05,4.3e-05,6.4e-05,2.9e-05,1.2e-05,3.5e-05,5.3e-05,3.9e-05,2.9e-05,2.1e-05,4e-05,1.4e-05,6.4e-05,4.8e-05,6.4e-05,3.2e-05,2.4e-05,4.6e-05,1e-05,5e-06,2.2e-05,1.9e-05,2e-05,2.2e-05,0.000125,2e-05,3.6e-05,8.3e-05,8.2e-05,0.000207,7.2e-05,5.8e-05,0.00013,7.1e-05,1e-05,0.001612,0.00111,0.000365,0.000117,5.9e-05,3.2e-05,0.000109,4.2e-05,4.3e-05,7e-05,6.6e-05,2.7e-05,6.8e-05,8.2e-05,5.6e-05,7.3e-05,1.6e-05,5e-05,3.6e-05,7.6e-05,8.2e-05,2e-05,8e-06,2.6e-05,2.1e-05,6e-06,1.1e-05,2e-05,6.1e-05,4.3e-05,2.7e-05,5.9e-05,0.000256,0.001281,0.000608,0.000362,0.000166,0.000235,0.000218,0.00078,0.000496,0.000529,0.000337,0.000112,6.5e-05,5e-05,5.4e-05,4.4e-05,6.5e-05,1.8e-05,2.1e-05,2.2e-05,2.1e-05,4.4e-05,5.2e-05,5.6e-05,4.9e-05,3.7e-05,6.3e-05,9.2e-05,0.000153,0.000462,0.000254,0.000237,0.000227
1.1e-05,1.8e-05,4e-06,1.2e-05,2.4e-05,9e-06,1.9e-05,9e-06,2e-06,2.8e-05,0.000151,0.000521,0.000255,0.000194,6.1e-05,6.5e-05,4.6e-05,5e-05,4.1e-05,7.1e-05,2.9e-05,6e-05,4.8e-05,6.7e-05,5.2e-05,3e-05,3.2e-05,1.9e-05,3.9e-05,3e-05,2.1e-05,4.4e-05,4e-05,9.7e-05,3.8e-05,2e-05,1.3e-05,4.5e-05,0.000101,5.6e-05,5.7e-05,1.5e-05,1.3e-05,1e-05,2.3e-05,0.000124,0.000105,4.2e-05,9.7e-05,5e-05,0.000119,0.000198,0.000101,0.000172,9.9e-05,0.000163,0.001833,0.001516,0.000876,0.000276,0.000199,0.00011,0.000172,0.000145,0.000114,8.4e-05,0.000136,6.5e-05,0.000129,7e-05,0.000113,9.7e-05,4.4e-05,3.2e-05,2e-05,0.000113,0.000145,6.8e-05,3.4e-05,2.6e-05,5.3e-05,4.1e-05,4e-05,9e-06,0.000101,7.4e-05,2.1e-05,8.8e-05,0.000353,0.001442,0.000137,0.000136,0.000121,0.000149,0.000228,0.00071,0.000193,0.000361,8.8e-05,0.000224,0.000131,6.8e-05,2.7e-05,4.5e-05,3e-05,4.4e-05,3.7e-05,3.4e-05,1.5e-05,4.1e-05,8.8e-05,8e-06,5.7e-05,1.8e-05,4.2e-05,0.000124,0.000121,0.000613,0.000829,0.000535,0.000223
1.5e-05,9e-06,1.4e-05,2e-05,3.5e-05,2.2e-05,6e-06,1.5e-05,1.6e-05,2.3e-05,0.000152,0.000455,0.000273,0.000154,0.000279,9.3e-05,0.000119,3.9e-05,2.9e-05,0.000122,0.000152,0.000151,7.4e-05,0.000103,9.3e-05,5.1e-05,8.1e-05,7.2e-05,4.5e-05,3.5e-05,3.1e-05,2.3e-05,3.8e-05,0.000154,0.000102,4.7e-05,2.2e-05,5.6e-05,0.000138,0.000132,3.4e-05,1.1e-05,1e-05,2e-06,1.5e-05,0.000117,9.8e-05,3.4e-05,5.9e-05,6.4e-05,0.000102,0.000209,0.000153,0.00032,0.000356,0.000304,0.001597,0.001355,0.000458,0.000216,0.000192,0.000172,0.000164,0.000127,4.3e-05,4.7e-05,0.000167,0.000159,8.1e-05,0.000158,0.000149,0.000106,8e-05,3.9e-05,4.9e-05,0.000117,0.000292,0.00019,7e-05,2.2e-05,0.000104,6.6e-05,8e-06,2.5e-05,0.000112,0.000151,7.6e-05,0.000131,0.000297,0.001898,0.001327,0.000875,0.000324,5.6e-05,0.000165,0.000448,0.000459,0.000318,0.000187,0.000322,0.000132,5.5e-05,5.7e-05,8e-06,1.7e-05,2.3e-05,1.7e-05,4.6e-05,3e-05,3.4e-05,4.3e-05,6.4e-05,4.9e-05,9.1e-05,1.9e-05,7.1e-05,0.00019,0.000427,0.001546,0.000869,0.000462
3.6e-05,3.1e-05,3.5e-05,1.9e-05,1.8e-05,2e-06,9e-06,1.3e-05,1.7e-05,1.6e-05,0.000152,0.000129,7.8e-05,0.000108,0.000436,0.000351,0.000289,0.000156,4.3e-05,0.000136,0.000239,0.000128,0.000112,7.5e-05,1.9e-05,3.3e-05,6.2e-05,0.000195,0.000118,0.000109,5e-05,2e-06,2.9e-05,0.000168,0.000283,0.000184,7.3e-05,0.000103,9.8e-05,8.9e-05,4.6e-05,3.1e-05,1.8e-05,4e-06,2.7e-05,8.3e-05,5.6e-05,4e-05,8.7e-05,3.3e-05,0.000108,8.2e-05,5.5e-05,0.00034,0.000252,0.000346,0.001891,0.001731,0.000813,5.6e-05,0.000103,0.000123,7.2e-05,6e-05,5.4e-05,9.6e-05,0.000164,4.1e-05,0.000128,0.000213,0.000191,0.000208,0.000209,0.000127,5e-05,9e-05,0.000307,0.000141,6.5e-05,1.2e-05,9e-05,5.5e-05,2.5e-05,7e-06,0.000157,0.00022,0.000158,0.000125,0.000395,0.002287,0.002123,0.000802,0.00015,6e-05,0.00011,0.000279,0.000244,7.2e-05,0.00015,0.000717,0.000524,0.000244,3e-05,6e-05,3.3e-05,2.6e-05,3.7e-05,4.1e-05,5.1e-05,3.6e-05,1.2e-05,7e-05,0.000113,8.1e-05,9.5e-05,1.8e-05,7.9e-05,0.000474,0.001391,0.000699,0.000528
1.5e-05,1e-05,2.8e-05,2.1e-05,9e-06,8e-06,8e-06,4e-06,2.1e-05,1.9e-05,0.000152,0.000211,0.000143,0.000158,0.000346,0.000113,7.2e-05,4.1e-05,1.6e-05,0.000154,0.000109,5.7e-05,7e-05,3.5e-05,3.1e-05,4.8e-05,0.000105,0.000206,0.000114,8.6e-05,6.2e-05,3.7e-05,1.7e-05,0.000202,0.000289,9.9e-05,3.4e-05,9.8e-05,0.000132,4.2e-05,1.1e-05,2.8e-05,2.2e-05,1e-05,3e-05,8.9e-05,3.1e-05,1.1e-05,7.1e-05,5.3e-05,8.2e-05,6.6e-05,4.6e-05,0.000284,8.1e-05,0.000255,0.001521,0.001254,0.000616,0.000265,0.000147,0.000125,3.6e-05,5.4e-05,6.9e-05,6e-05,4.1e-05,4.7e-05,8.7e-05,0.000102,0.000256,0.000255,7.8e-05,1.9e-05,5.5e-05,4.7e-05,0.000172,8.9e-05,3.9e-05,3e-05,4.9e-05,3.7e-05,2.1e-05,2.3e-05,0.000148,0.000182,3.6e-05,4e-05,0.000381,0.001838,0.001247,0.000535,6.5e-05,7.7e-05,4.9e-05,0.00013,5.6e-05,0.000131,0.000188,0.000584,0.000412,0.000184,0.000226,0.000124,9.3e-05,7.8e-05,2.8e-05,2.2e-05,1.2e-05,3.5e-05,2.4e-05,4.1e-05,4.7e-05,3.4e-05,6.9e-05,7e-05,4.9e-05,0.000367,0.000569,0.000372,0.000232
2.4e-05,3.6e-05,9e-06,1.1e-05,1.2e-05,1.7e-05,1.9e-05,1.7e-05,1.1e-05,4e-06,0.000127,0.00019,0.000262,0.000337,0.000143,6.6e-05,5.7e-05,5.6e-05,4.8e-05,8e-05,5.7e-05,6.6e-05,4.4e-05,3e-06,3.9e-05,4.9e-05,0.000135,8.8e-05,2.2e-05,2.4e-05,2.1e-05,1.6e-05,3.2e-05,0.000194,0.00013,0.000102,3.4e-05,5e-05,2.9e-05,1.8e-05,1.3e-05,2.1e-05,1.1e-05,1.7e-05,2e-05,9.5e-05,6.5e-05,1.7e-05,3.7e-05,1.2e-05,1.9e-05,6.3e-05,2.4e-05,0.000171,0.000174,4.7e-05,0.001178,0.000564,0.000276,0.000186,0.000126,2.1e-05,6.7e-05,2.9e-05,7.3e-05,4.9e-05,3.1e-05,4.5e-05,0.000138,0.000174,0.000149,7e-06,6.1e-05,5.2e-05,3.3e-05,5.1e-05,7.4e-05,4.3e-05,1.3e-05,1.2e-05,3.2e-05,3.7e-05,2.8e-05,1.5e-05,8.5e-05,5.2e-05,5.5e-05,7.3e-05,0.000271,0.001952,0.001662,0.000782,0.000187,7.1e-05,8e-06,0.000222,0.000166,0.000179,3.2e-05,0.00051,0.000214,0.000133,0.000115,8.2e-05,7.3e-05,4.6e-05,2.1e-05,2e-05,8e-06,3.3e-05,2.3e-05,3.1e-05,2.4e-05,1.9e-05,5.2e-05,3e-05,5.3e-05,0.000296,0.000193,0.000276,0.00033
6e-06,1.8e-05,7e-06,6e-06,1.3e-05,5e-06,5e-06,4e-06,6e-06,5e-06,4.7e-05,4.7e-05,7.2e-05,8.6e-05,5e-05,3.4e-05,2.3e-05,2.2e-05,8e-06,2e-05,3.6e-05,1.4e-05,1.5e-05,5e-06,1.3e-05,5e-06,5e-05,3.1e-05,1.2e-05,1.1e-05,8e-06,1.4e-05,3e-06,6.8e-05,2.8e-05,4e-06,5e-06,4e-06,1.1e-05,7e-06,1.2e-05,2e-06,2e-06,1.3e-05,5e-06,4.5e-05,1.8e-05,5e-06,1.2e-05,1.4e-05,3e-05,2.1e-05,1.2e-05,2.4e-05,2.9e-05,3.2e-05,0.000394,0.000193,7.8e-05,7.6e-05,4e-05,7e-06,3e-05,1.7e-05,2.7e-05,2e-06,1.6e-05,1.9e-05,3.4e-05,5.2e-05,3.8e-05,7e-06,2.1e-05,1.1e-05,1.3e-05,2.3e-05,1.5e-05,7e-06,6e-06,2e-06,2.2e-05,4e-06,7e-06,7e-06,4.2e-05,1.8e-05,1.1e-05,2.7e-05,7.1e-05,0.000736,0.000467,0.000229,8.5e-05,7e-06,1.6e-05,7.5e-05,4.3e-05,2.6e-05,1.4e-05,0.000115,7.6e-05,3e-05,3.5e-05,1.2e-05,2.4e-05,2.6e-05,1.9e-05,1.2e-05,1e-05,9e-06,5e-06,1.2e-05,1.8e-05,6e-06,1.3e-05,1.1e-05,3.1e-05,0.000144,0.000159,1.6e-05,6.8e-05
1.2e-05,6e-06,4e-06,9e-06,4e-06,2e-06,5e-06,5e-06,4e-06,2e-06,4.2e-05,5.6e-05,1.1e-05,7.3e-05,1.2e-05,1.1e-05,2.8e-05,1.2e-05,3e-06,2e-05,2.4e-05,1.5e-05,1.8e-05,1.7e-05,4e-06,3e-06,2.8e-05,2.7e-05,2e-05,2.1e-05,8e-06,1.2e-05,9e-06,4e-05,1.7e-05,8e-06,6e-06,8e-06,1.3e-05,7e-06,1e-05,3e-06,4e-06,1e-05,5e-06,3.9e-05,2.3e-05,3e-06,3.4e-05,1.9e-05,2.7e-05,1.4e-05,4e-06,1.2e-05,2e-05,1.1e-05,0.000235,9.9e-05,3.6e-05,2.1e-05,2.2e-05,1.2e-05,2.6e-05,5e-06,1.2e-05,1.9e-05,9e-06,3e-06,2.4e-05,3.3e-05,2.1e-05,1.3e-05,7e-06,6e-06,3e-06,2.2e-05,8e-06,3e-06,4e-06,4e-06,9e-06,1.1e-05,2e-06,2e-06,3.5e-05,1.1e-05,1.4e-05,3e-05,6.8e-05,0.000706,0.000336,0.000123,6e-05,7e-06,1.5e-05,1.3e-05,4e-05,1e-05,1.2e-05,6e-06,3.2e-05,1.6e-05,1.3e-05,1.4e-05,4e-06,1.2e-05,1.8e-05,3e-06,5e-06,9e-06,4e-06,3e-06,1.5e-05,8e-06,5e-06,7e-06,2.2e-05,9.1e-05,5.4e-05,3.1e-05,5e-05
6e-06,7e-06,5e-06,6e-06,7e-06,4e-06,2e-06,2e-06,3e-06,3e-06,3.3e-05,4.2e-05,1.5e-05,4.8e-05,1.8e-05,2e-05,1.7e-05,2.3e-05,1.5e-05,1.1e-05,1e-05,4e-06,1e-05,4e-06,2e-06,1e-06,1.7e-05,1.6e-05,2e-06,5e-06,9e-06,1e-05,1e-06,2.1e-05,1.4e-05,6e-06,7e-06,6e-06,3e-06,7e-06,7e-06,4e-06,5e-06,9e-06,3e-06,3.2e-05,2.7e-05,1.5e-05,4e-05,2.5e-05,1.7e-05,3e-06,5e-06,1.7e-05,2e-05,1.7e-05,0.00013,2.2e-05,2.4e-05,1.2e-05,3e-05,1.5e-05,9e-06,1.2e-05,1.3e-05,1.4e-05,1.1e-05,4e-06,3.1e-05,2.8e-05,1.4e-05,6e-06,5e-06,0,4e-06,1.2e-05,8e-06,5e-06,2e-06,1e-06,6e-06,1e-06,6e-06,3e-06,1.9e-05,1.4e-05,4e-06,1.1e-05,6.3e-05,0.000516,0.000277,0.000109,5.6e-05,7e-06,7e-06,6.2e-05,2.2e-05,6e-06,1.7e-05,4.2e-05,2.8e-05,1.9e-05,1.6e-05,1.3e-05,9e-06,4e-06,7e-06,7e-06,5e-06,8e-06,1.5e-05,8e-06,1.1e-05,9e-06,4e-06,8e-06,4e-06,8.2e-05,0.00011,6.2e-05,4.8e-05
2e-06,2e-06,1e-06,3e-06,4e-06,4e-06,4e-06,2e-06,3e-06,1e-06,2.7e-05,2.3e-05,1.6e-05,2.7e-05,1.1e-05,2e-05,8e-06,4e-06,6e-06,7e-06,1.3e-05,3e-06,4e-06,2e-06,1e-06,3e-06,1.6e-05,4e-06,9e-06,6e-06,7e-06,1e-06,3e-06,1.9e-05,1.2e-05,4e-06,1e-06,4e-06,5e-06,7e-06,1e-05,1e-06,2e-06,4e-06,4e-06,3e-05,1.8e-05,1.2e-05,2.4e-05,1.4e-05,2.3e-05,1.2e-05,3e-06,3e-06,1.4e-05,1e-05,0.000128,8.6e-05,4.2e-05,1.1e-05,3.5e-05,1.8e-05,1e-05,1.3e-05,1e-06,1.1e-05,1.6e-05,1.1e-05,2e-05,5e-06,1.2e-05,7e-06,2e-06,1e-06,8e-06,7e-06,6e-06,7e-06,5e-06,4e-06,5e-06,4e-06,1e-06,4e-06,3e-06,1e-06,6e-06,4e-06,5.4e-05,0.000453,0.000228,0.000122,1.7e-05,1.9e-05,2e-05,6.2e-05,2e-05,8e-06,1e-05,2.8e-05,9e-06,1.5e-05,1.7e-05,1.6e-05,1.1e-05,1.6e-05,1.8e-05,5e-06,4e-06,1.1e-05,1.8e-05,1.2e-05,1.3e-05,1e-05,5e-06,7e-06,6e-06,8e-05,0.000133,9.3e-05,3.2e-05
2e-06,4e-06,1e-06,1e-06,2e-06,5e-06,3e-06,3e-06,4e-06,4e-06,2.3e-05,3.1e-05,1.2e-05,3.3e-05,8e-06,1.4e-05,9e-06,4e-06,5e-06,8e-06,1.4e-05,1.3e-05,1.1e-05,3e-06,3e-06,2e-06,1.8e-05,5e-06,8e-06,6e-06,2e-06,4e-06,3e-06,1.6e-05,8e-06,4e-06,2e-06,6e-06,3e-06,6e-06,9e-06,2e-06,4e-06,2e-06,3e-06,3.4e-05,2e-05,1.6e-05,5e-06,6e-06,1.5e-05,6e-06,6e-06,6e-06,1.3e-05,1.9e-05,0.00017,0.000135,6.2e-05,4.1e-05,2.6e-05,1.8e-05,7e-06,4e-06,5e-06,5e-06,2.1e-05,1.4e-05,1e-05,1.5e-05,1.8e-05,1e-06,3e-06,4e-06,9e-06,1.1e-05,1.1e-05,4e-06,5e-06,3e-06,9e-06,4e-06,2e-06,3e-06,7e-06,9e-06,1e-06,4e-06,3.8e-05,0.000335,0.000272,0.000107,4e-06,1.5e-05,1.5e-05,3e-05,2.6e-05,1.1e-05,9e-06,1.9e-05,2.9e-05,6e-06,7e-06,5e-06,1e-06,1.7e-05,1.2e-05,4e-06,8e-06,1.6e-05,1.2e-05,3e-06,1.6e-05,7e-06,9e-06,2e-06,6e-06,7.8e-05,0.000103,2.9e-05,1.2e-05
1e-06,4e-06,1e-06,2e-06,4e-06,6e-06,2e-06,3e-06,5e-06,4e-06,1.9e-05,3e-05,1.6e-05,1.7e-05,9e-06,1.1e-05,6e-06,1e-05,7e-06,6e-06,6e-06,1e-05,1.1e-05,1.5e-05,7e-06,4e-06,2.1e-05,4e-06,7e-06,1e-06,1e-06,2e-06,3e-06,1.5e-05,3e-06,5e-06,7e-06,8e-06,2e-06,3e-06,6e-06,3e-06,3e-06,3e-06,4e-06,3.7e-05,2.3e-05,9e-06,6e-06,3e-06,7e-06,6e-06,1.3e-05,1e-05,1.5e-05,1.8e-05,0.000197,0.000133,6e-05,3.6e-05,2e-05,1.1e-05,1e-05,7e-06,6e-06,7e-06,4e-06,1.8e-05,2e-06,1.2e-05,4e-06,6e-06,5e-06,5e-06,1.3e-05,8e-06,1.1e-05,4e-06,3e-06,3e-06,9e-06,5e-06,4e-06,2e-06,8e-06,3e-06,1.4e-05,7e-06,2.9e-05,0.000294,0.000152,9.4e-05,1.2e-05,1.4e-05,1.3e-05,5.6e-05,3e-05,6e-06,7e-06,4.1e-05,3.6e-05,2e-05,3e-06,8e-06,6e-06,1.3e-05,8e-06,1e-06,5e-06,1.1e-05,6e-06,5e-06,1.7e-05,6e-06,8e-06,4e-06,6e-06,6.9e-05,0.000107,6.8e-05,2.1e-05
4e-06,5e-06,0,2e-06,4e-06,4e-06,1e-06,1e-06,4e-06,2e-06,1.5e-05,4e-06,1e-05,1.6e-05,1e-05,4e-06,3e-06,2e-06,1e-05,6e-06,5e-06,9e-06,3e-06,4e-06,1e-06,5e-06,1.8e-05,3e-06,5e-06,1e-06,3e-06,2e-06,2e-06,1.3e-05,8e-06,9e-06,1e-06,0,4e-06,3e-06,5e-06,2e-06,7e-06,1e-05,6e-06,3.6e-05,1.8e-05,5e-06,3e-06,4e-06,6e-06,9e-06,1.4e-05,1e-05,1.5e-05,9e-06,0.000198,0.000154,7.5e-05,3.1e-05,2e-05,1.3e-05,8e-06,1.2e-05,4e-06,1e-05,4e-06,1.4e-05,1.7e-05,1.1e-05,7e-06,1e-05,9e-06,5e-06,1e-05,7e-06,9e-06,2e-06,3e-06,6e-06,3e-06,4e-06,2e-06,0,1.2e-05,9e-06,9e-06,7e-06,2.9e-05,0.000214,0.000118,5.3e-05,3.2e-05,3.1e-05,2.1e-05,5.2e-05,1.6e-05,9e-06,8e-06,3.7e-05,4e-06,1.4e-05,1.8e-05,1.3e-05,8e-06,9e-06,8e-06,9e-06,7e-06,6e-06,4e-06,1e-06,8e-06,8e-06,1e-05,1e-06,5e-06,6.8e-05,8.5e-05,5e-05,1.2e-05
3e-06,4e-06,1e-06,2e-06,5e-06,3e-06,4e-06,4e-06,3e-06,2e-06,1.6e-05,2.1e-05,5e-06,1.8e-05,1.1e-05,9e-06,7e-06,2e-06,3e-06,8e-06,4e-06,4e-06,1e-06,2e-06,6e-06,5e-06,1.7e-05,8e-06,5e-06,3e-06,2e-06,4e-06,4e-06,1e-05,1.3e-05,6e-06,6e-06,9e-06,1e-06,4e-06,1e-06,4e-06,6e-06,2e-06,3e-06,2.9e-05,1.7e-05,9e-06,6e-06,1e-06,7e-06,7e-06,1e-05,1.3e-05,1.1e-05,1.6e-05,0.000201,8.1e-05,5.2e-05,3.2e-05,1.1e-05,0,4e-06,1.4e-05,6e-06,2e-06,7e-06,1.1e-05,1.1e-05,2e-06,2.6e-05,1.6e-05,6e-06,5e-06,6e-06,2e-06,6e-06,1e-06,2e-06,3e-06,1e-05,3e-06,2e-06,2e-06,1e-05,2e-06,1e-06,5e-06,3.9e-05,0.000212,9.9e-05,3.9e-05,2.5e-05,2e-05,2.2e-05,3.6e-05,2e-05,8e-06,1.4e-05,3.1e-05,3.1e-05,6e-06,7e-06,9e-06,7e-06,8e-06,4e-06,7e-06,9e-06,4e-06,3e-06,1e-06,2e-06,2e-06,9e-06,9e-06,4e-06,5.5e-05,4.8e-05,1.8e-05,2e-06
6e-06,5e-06,2e-06,1e-06,6e-06,3e-06,2e-06,4e-06,3e-06,4e-06,2.4e-05,9e-06,6e-06,1.7e-05,6e-06,6e-06,3e-06,3e-06,3e-06,3e-06,5e-06,5e-06,2e-06,3e-06,4e-06,5e-06,1.4e-05,3e-06,6e-06,1e-06,1e-06,6e-06,2e-06,9e-06,1e-05,3e-06,4e-06,5e-06,3e-06,7e-06,5e-06,2e-06,4e-06,6e-06,1e-06,1.7e-05,1.6e-05,3e-06,4e-06,8e-06,5e-06,5e-06,1e-05,5e-06,3e-06,8e-06,0.000131,3.9e-05,2.5e-05,1e-05,1.3e-05,1.4e-05,9e-06,9e-06,3e-06,1.3e-05,1.8e-05,7e-06,2e-05,1.5e-05,1.9e-05,1.3e-05,1.3e-05,3e-06,1e-06,7e-06,8e-06,1e-06,9e-06,3e-06,9e-06,1e-06,4e-06,2e-06,1.1e-05,1.7e-05,1.1e-05,6e-06,2.8e-05,0.000227,6.7e-05,3.1e-05,2.7e-05,5e-06,1.6e-05,5.9e-05,3.8e-05,1.4e-05,4e-06,3.3e-05,2e-05,2e-06,1.2e-05,1.2e-05,9e-06,1.6e-05,4e-06,4e-06,5e-06,4e-06,5e-06,3e-06,4e-06,2e-06,1.1e-05,3e-06,6e-06,6e-05,3.3e-05,4.7e-05,1.9e-05
3e-06,1e-06,4e-06,4e-06,6e-06,1.1e-05,5e-06,3e-06,3e-06,5e-06,2.4e-05,1.2e-05,5e-06,1.3e-05,6e-06,4e-06,3e-06,4e-06,4e-06,5e-06,7e-06,8e-06,2e-06,2e-06,2e-06,5e-06,1.1e-05,1e-05,4e-06,2e-06,5e-06,1e-06,2e-06,6e-06,8e-06,4e-06,0,4e-06,5e-06,2e-06,7e-06,2e-06,6e-06,4e-06,2e-06,1.5e-05,1.6e-05,1.2e-05,6e-06,1e-05,9e-06,8e-06,6e-06,1.1e-05,6e-06,2e-06,6.1e-05,6.5e-05,2.2e-05,1e-05,1.9e-05,1.6e-05,9e-06,4e-06,4e-06,1.8e-05,8e-06,6e-06,2.9e-05,2.6e-05,2e-05,2e-05,9e-06,9e-06,2e-06,4e-06,3e-06,2e-06,1.4e-05,1.5e-05,1e-06,5e-06,2e-06,2e-06,1.7e-05,2.1e-05,9e-06,1.4e-05,1.7e-05,0.000219,0.000133,7.7e-05,4.2e-05,8e-06,1.5e-05,7.2e-05,2.7e-05,1.8e-05,8e-06,5e-05,1.4e-05,1.5e-05,1e-05,7e-06,8e-06,5e-06,2e-05,4e-06,9e-06,6e-06,2e-06,5e-06,2e-06,6e-06,1.1e-05,1.2e-05,1.1e-05,6.7e-05,5.9e-05,2e-05,2.4e-05
6e-06,4e-06,2e-06,4e-06,3e-06,8e-06,5e-06,4e-06,2e-06,3e-06,3e-05,4e-06,3e-06,1.4e-05,3e-06,5e-06,1e-06,2e-06,4e-06,2e-06,9e-06,8e-06,3e-06,6e-06,2e-06,4e-06,8e-06,5e-06,3e-06,2e-06,7e-06,8e-06,2e-06,8e-06,5e-06,2e-06,1e-06,5e-06,5e-06,5e-06,2e-06,4e-06,8e-06,5e-06,1e-06,3.2e-05,1.4e-05,9e-06,1.2e-05,1e-05,8e-06,2e-06,1.5e-05,5e-06,1.3e-05,7e-06,8.1e-05,5.4e-05,2.7e-05,2.2e-05,8e-06,7e-06,3e-06,1e-05,6e-06,2.4e-05,1.5e-05,5e-06,3.7e-05,3.5e-05,4.6e-05,2.8e-05,1e-05,5e-06,1e-05,1.1e-05,1.2e-05,4e-06,1.9e-05,8e-06,2.6e-05,1.3e-05,2e-06,2e-06,1.1e-05,8e-06,5e-06,2e-05,3e-05,0.000221,6.9e-05,4.8e-05,1.7e-05,1.1e-05,6e-06,5.4e-05,3.1e-05,2.5e-05,9e-06,6.5e-05,4.4e-05,8e-06,4e-06,5e-06,1e-06,1e-05,1.1e-05,7e-06,9e-06,2e-06,5e-06,1e-06,3e-06,8e-06,1e-05,6e-06,7e-06,8e-05,8.1e-05,4.4e-05,2.7e-05
2e-06,2e-06,2e-06,2e-06,4e-06,4e-06,6e-06,7e-06,7e-06,5e-06,2.9e-05,2.4e-05,1e-05,1.2e-05,3e-06,5e-06,2e-06,2e-06,7e-06,4e-06,1e-06,5e-06,7e-06,1.2e-05,1.2e-05,5e-06,1.1e-05,1.2e-05,8e-06,3e-06,6e-06,6e-06,7e-06,7e-06,2e-06,5e-06,5e-06,6e-06,4e-06,5e-06,1e-06,2e-06,1.2e-05,9e-06,4e-06,4.7e-05,1e-05,6e-06,9e-06,3e-06,9e-06,1.2e-05,1.7e-05,2.2e-05,5e-06,9e-06,0.000163,8.6e-05,6.2e-05,1.5e-05,6e-06,1.8e-05,7e-06,7e-06,7e-06,2.3e-05,2.2e-05,9e-06,3.5e-05,2.3e-05,3e-05,3.5e-05,2.3e-05,5e-06,1.2e-05,4e-06,1.2e-05,7e-06,2.3e-05,1.4e-05,3.3e-05,1.4e-05,8e-06,3e-06,5e-06,3e-06,5e-06,1.6e-05,5.2e-05,0.000155,7.8e-05,6e-05,2e-05,2.7e-05,1.1e-05,4.1e-05,2.5e-05,1.2e-05,8e-06,6e-05,3e-05,1.4e-05,1.6e-05,7e-06,9e-06,1.3e-05,1.8e-05,1.4e-05,1.5e-05,1.2e-05,1.4e-05,8e-06,8e-06,6e-06,1.4e-05,7e-06,1.7e-05,9e-05,0.00012,8e-05,4.2e-05
2e-06,4e-06,4e-06,7e-06,7e-06,5e-06,3e-06,0,5e-06,3e-06,2.9e-05,3.2e-05,1.2e-05,8e-06,3e-06,4e-06,4e-06,3e-06,5e-06,1.1e-05,9e-06,1.2e-05,1e-05,6e-06,2e-06,7e-06,4e-06,1.4e-05,1.1e-05,6e-06,7e-06,4e-06,4e-06,3e-06,5e-06,6e-06,6e-06,3e-06,7e-06,7e-06,2e-06,9e-06,1.8e-05,1e-05,6e-06,5.5e-05,3.6e-05,1.1e-05,6e-06,9e-06,3e-06,7e-06,1.6e-05,1.1e-05,4e-06,1.1e-05,0.000209,0.000166,9.4e-05,3.5e-05,4e-06,2.1e-05,1.1e-05,3e-06,0,2.2e-05,1.5e-05,2.7e-05,1.7e-05,2.1e-05,2.4e-05,1.5e-05,1.7e-05,1e-05,4e-06,4e-06,2e-06,9e-06,1.7e-05,1e-05,2.1e-05,1.3e-05,7e-06,4e-06,1e-05,7e-06,5e-06,8e-06,6.9e-05,0.000158,7.3e-05,1.2e-05,2.3e-05,2.6e-05,2.9e-05,1.3e-05,1e-05,5e-06,1.2e-05,4.7e-05,4.8e-05,2.2e-05,1.5e-05,2.6e-05,2e-05,2e-05,3e-06,9e-06,7e-06,1.2e-05,1.7e-05,1.4e-05,3e-06,1e-06,1.9e-05,1.4e-05,1.6e-05,6.1e-05,0.000153,5.3e-05,3e-05
5e-06,8e-06,2e-06,8e-06,3e-06,4e-06,2e-06,2e-06,4e-06,5e-06,2.6e-05,1.2e-05,9e-06,1.7e-05,9e-06,7e-06,3e-06,9e-06,4e-06,7e-06,7e-06,1.2e-05,1e-05,6e-06,5e-06,7e-06,1.5e-05,1.1e-05,1e-05,4e-06,6e-06,4e-06,7e-06,4e-06,2e-06,4e-06,4e-06,3e-06,3e-06,3e-06,1e-06,6e-06,9e-06,7e-06,6e-06,5.5e-05,4.3e-05,2.2e-05,6e-06,3e-06,7e-06,4e-06,1.1e-05,1.5e-05,1.1e-05,2.6e-05,0.000189,0.000178,6.4e-05,2e-05,1.4e-05,2.8e-05,2.2e-05,1.1e-05,5e-06,2.5e-05,2.2e-05,2.7e-05,2.8e-05,1.7e-05,2.3e-05,2.2e-05,5e-06,1e-05,9e-06,9e-06,7e-06,7e-06,6e-06,5e-06,8e-06,1.2e-05,1e-05,6e-06,7e-06,1.4e-05,9e-06,1.6e-05,8.5e-05,6e-05,0.000113,6.4e-05,6e-06,4.3e-05,1.3e-05,2.7e-05,8e-06,8e-06,6e-06,2.5e-05,5e-06,1.4e-05,5e-06,1.6e-05,8e-06,1.4e-05,5e-06,5e-06,6e-06,9e-06,8e-06,5e-06,5e-06,4e-06,2.2e-05,1.1e-05,6e-06,8e-05,0.000141,9.2e-05,2e-05
6e-06,0,0,6e-06,1e-06,2e-06,1e-06,4e-06,5e-06,2e-06,2.9e-05,1.5e-05,5e-06,1.8e-05,3e-06,5e-06,3e-06,9e-06,3e-06,5e-06,5e-06,5e-06,5e-06,6e-06,4e-06,2e-06,1e-05,8e-06,5e-06,3e-06,7e-06,5e-06,6e-06,6e-06,3e-06,2e-06,3e-06,3e-06,1e-06,4e-06,5e-06,3e-06,4e-06,4e-06,1e-06,4.9e-05,4.6e-05,2.5e-05,1.5e-05,1.1e-05,5e-06,9e-06,1.4e-05,1.6e-05,8e-06,2.1e-05,0.000189,5.3e-05,5.1e-05,2.5e-05,1.4e-05,2.1e-05,6e-06,7e-06,2e-06,2.4e-05,9e-06,1.3e-05,1.8e-05,2.5e-05,1.4e-05,1.1e-05,3e-06,1e-05,5e-06,3e-06,6e-06,2e-06,3e-06,6e-06,3e-06,5e-06,6e-06,2e-06,2e-06,4e-06,9e-06,1.7e-05,6.9e-05,0.000159,0.00014,8.4e-05,3.1e-05,2.2e-05,1.9e-05,3.1e-05,4e-05,1.4e-05,6e-06,5e-06,1.4e-05,3e-06,9e-06,2e-06,1.1e-05,6e-06,7e-06,1e-06,4e-06,3e-06,5e-06,4e-06,3e-06,6e-06,1.1e-05,1.6e-05,2e-05,8.3e-05,3.2e-05,3.5e-05,3e-06
5e-06,5e-06,0,2e-06,2e-06,1e-06,3e-06,3e-06,2e-06,3e-06,2.7e-05,1.5e-05,1.1e-05,2e-05,6e-06,3e-06,4e-06,7e-06,3e-06,9e-06,1.3e-05,7e-06,7e-06,3e-06,3e-06,5e-06,3e-06,9e-06,6e-06,1e-06,2e-06,8e-06,2e-06,3e-06,4e-06,4e-06,1e-06,3e-06,5e-06,3e-06,5e-06,5e-06,2e-06,4e-06,2e-06,4e-05,4.4e-05,2.5e-05,1.5e-05,4e-06,2e-06,1.2e-05,1.1e-05,2.8e-05,7e-06,1.5e-05,0.000125,0.000111,5.4e-05,3.4e-05,1.4e-05,1.6e-05,1.8e-05,3e-06,8e-06,6e-06,1.1e-05,1e-05,9e-06,1.2e-05,3e-06,9e-06,5e-06,9e-06,4e-06,3e-06,3e-06,4e-06,5e-06,2e-06,3e-06,4e-06,4e-06,2e-06,3e-06,5e-06,2e-06,8e-06,6.5e-05,7.4e-05,0.000312,0.000182,6.6e-05,1.2e-05,5e-06,4.2e-05,2.4e-05,5e-06,1.3e-05,2.5e-05,3.2e-05,1.2e-05,1.3e-05,1.1e-05,4e-06,1.4e-05,8e-06,5e-06,6e-06,1e-06,8e-06,7e-06,1e-05,8e-06,6e-06,1.1e-05,1.5e-05,6.7e-05,6e-05,6.5e-05,4e-05
3e-06,2e-06,0,3e-06,2e-06,2e-06,3e-06,0,2e-06,1e-06,2.5e-05,1.4e-05,1.1e-05,6e-06,2e-06,1e-06,3e-06,5e-06,5e-06,6e-06,1e-05,4e-06,0,1e-06,6e-06,5e-06,8e-06,9e-06,2e-06,2e-06,3e-06,4e-06,5e-06,3e-06,6e-06,3e-06,2e-06,1e-06,4e-06,4e-06,6e-06,3e-06,2e-06,4e-06,1e-06,2.7e-05,2e-05,7e-06,1e-05,1.1e-05,1e-05,2e-06,1.1e-05,7e-06,1.2e-05,9e-06,7e-05,8.5e-05,5e-05,7e-06,2.1e-05,1.2e-05,4e-06,3e-06,8e-06,1e-05,3e-06,1.4e-05,1.2e-05,1.5e-05,1e-05,7e-06,1e-05,5e-06,5e-06,4e-06,2e-06,1e-06,2e-06,5e-06,3e-06,4e-06,4e-06,2e-06,2e-06,6e-06,8e-06,2e-06,4.4e-05,6.1e-05,0.000272,0.000133,5.4e-05,1.3e-05,5e-06,2.9e-05,2.1e-05,1.1e-05,1.5e-05,3.2e-05,1.3e-05,6e-06,1.2e-05,1.1e-05,1e-06,1e-05,4e-06,8e-06,1e-06,2e-06,6e-06,1e-06,9e-06,9e-06,3e-06,5e-06,1.6e-05,7.4e-05,7.5e-05,5.5e-05,1.4e-05
0,4e-06,2e-06,2e-06,0,0,1e-06,1e-06,1e-06,1e-06,2.3e-05,1.2e-05,4e-06,1.3e-05,3e-06,2e-06,2e-06,4e-06,3e-06,4e-06,7e-06,2e-06,1e-06,1e-06,4e-06,0,9e-06,3e-06,7e-06,5e-06,1e-06,2e-06,3e-06,5e-06,6e-06,2e-06,2e-06,1e-06,3e-06,4e-06,5e-06,2e-06,2e-06,4e-06,1e-06,1.8e-05,2e-06,4e-06,3e-06,3e-06,7e-06,5e-06,6e-06,6e-06,5e-06,5e-06,1.9e-05,1.2e-05,1.3e-05,7e-06,1.2e-05,2e-06,5e-06,6e-06,6e-06,9e-06,5e-06,6e-06,8e-06,1.1e-05,1.4e-05,3e-06,4e-06,6e-06,3e-06,2e-06,3e-06,2e-06,3e-06,5e-06,4e-06,1e-06,3e-06,2e-06,3e-06,9e-06,6e-06,4e-06,1.9e-05,4.4e-05,0.000129,4.1e-05,9e-06,1.1e-05,4e-06,1.8e-05,1.1e-05,8e-06,1.2e-05,2.4e-05,2.3e-05,9e-06,9e-06,1.2e-05,2e-06,8e-06,2e-06,1e-06,1e-06,0,3e-06,1e-06,6e-06,4e-06,5e-06,3e-06,7e-06,6.3e-05,2.3e-05,1.4e-05,1.4e-05
1e-06,4e-06,1e-06,2e-06,1e-06,0,1e-06,1e-06,0,0,2.2e-05,8e-06,1e-06,1.2e-05,3e-06,2e-06,1e-06,6e-06,3e-06,4e-06,6e-06,2e-06,0,1e-06,4e-06,2e-06,8e-06,4e-06,5e-06,1e-06,1e-06,2e-06,3e-06,4e-06,6e-06,1e-06,3e-06,1e-06,2e-06,3e-06,4e-06,3e-06,1e-06,3e-06,1e-06,1e-05,2e-06,2e-06,5e-06,2e-06,3e-06,5e-06,5e-06,7e-06,3e-06,7e-06,1.2e-05,5e-06,7e-06,1.4e-05,1.1e-05,2e-06,5e-06,3e-06,5e-06,7e-06,5e-06,1e-05,3e-06,8e-06,1.3e-05,3e-06,4e-06,4e-06,2e-06,2e-06,3e-06,3e-06,3e-06,2e-06,4e-06,1e-06,2e-06,2e-06,3e-06,1e-05,2e-06,0,8e-06,5.7e-05,4.6e-05,1.3e-05,1.2e-05,8e-06,7e-06,2e-05,6e-06,6e-06,1e-05,1.3e-05,1.1e-05,5e-06,6e-06,8e-06,3e-06,9e-06,3e-06,1e-06,1e-06,1e-06,3e-06,0,3e-06,0,5e-06,4e-06,8e-06,5.4e-05,1e-05,1.5e-05,9e-06
1e-06,3e-06,1e-06,2e-06,1e-06,0,1e-06,1e-06,1e-06,1e-06,2.1e-05,9e-06,1e-06,1.3e-05,2e-06,2e-06,3e-06,6e-06,3e-06,4e-06,6e-06,3e-06,1e-06,1e-06,3e-06,1e-06,9e-06,4e-06,4e-06,1e-06,1e-06,2e-06,3e-06,4e-06,6e-06,1e-06,1e-06,2e-06,2e-06,3e-06,5e-06,3e-06,0,3e-06,1e-06,4e-06,1e-06,4e-06,3e-06,4e-06,3e-06,4e-06,5e-06,7e-06,4e-06,7e-06,2e-05,1.2e-05,1.8e-05,1.5e-05,1.1e-05,2e-06,2e-06,2e-06,4e-06,8e-06,2e-06,8e-06,2e-06,1e-05,1e-05,3e-06,3e-06,4e-06,3e-06,2e-06,3e-06,1e-06,3e-06,2e-06,3e-06,0,2e-06,1e-06,4e-06,9e-06,1e-06,1e-06,1e-05,6.1e-05,5.3e-05,3e-06,1.4e-05,5e-06,6e-06,1.4e-05,4e-06,7e-06,1.1e-05,9e-06,9e-06,5e-06,3e-06,8e-06,2e-06,9e-06,4e-06,1e-06,1e-06,0,3e-06,1e-06,1e-06,1e-06,5e-06,4e-06,7e-06,4.3e-05,4e-06,1.4e-05,5e-06
