6e-06,1.4e-05,6e-06,4e-06,1.2e-05,4e-06,5e-06,6e-06,8e-06,1.3e-05,1e-06,0,4e-06,1.6e-05,3.8e-05,0.000113,0,1.1e-05,1.1e-05,1.4e-05,4.4e-05,2e-05,3.8e-05,2e-06,1.1e-05,5e-06,1.2e-05,1e-06,1.7e-05,6e-06,8e-06,6e-06,8e-06,7e-06,6e-06,1e-06,2e-05,4e-06,3e-06,2e-06,2e-06,2e-06,7e-06,9e-06,1e-06,1.7e-05,1.4e-05,0,5e-06,4e-06,8e-06,1.4e-05,1e-05,1e-05,1.3e-05,6e-06,0,8e-06,7e-06,2e-06,1e-06,1e-06,9e-06,4e-06,5e-06,4e-06,4e-06,9e-06,8e-06,5e-06,1.7e-05,4e-06,0,1e-05,1.1e-05,7e-06,6e-06,1e-06,3e-06,2e-05,4e-06,8e-06,3e-06,1e-06,3e-06,2e-06,3e-06,8e-06,1.1e-05,1.1e-05,1e-06,2e-06,1.1e-05,1.5e-05,3e-06,3e-06,0,8e-06,9e-06,4e-06,5e-06,1.7e-05,1.4e-05,6e-06,1e-06,2e-06,3e-06,4e-06,5e-06,1e-05,5e-06,1.4e-05,0,2.1e-05,4e-06,3e-06,3e-06,1e-05,2e-06,7e-06,4e-06
2.6e-05,2.8e-05,3.9e-05,7e-06,5e-05,2.8e-05,3e-05,1.5e-05,3.4e-05,2.5e-05,4.1e-05,1.9e-05,7e-06,2e-05,5e-05,0.000251,9.1e-05,4.4e-05,5.7e-05,4.7e-05,0.000112,0.00013,3.4e-05,5.4e-05,7.8e-05,7.6e-05,6.5e-05,3e-05,2.5e-05,5.1e-05,3.4e-05,2e-05,2.4e-05,2.2e-05,3.1e-05,4.5e-05,2.3e-05,2.5e-05,1.1e-05,8e-06,1e-05,3.7e-05,4.6e-05,2.1e-05,2.5e-05,2.9e-05,3.8e-05,4.1e-05,3.8e-05,2.8e-05,1e-05,4.2e-05,1.3e-05,2.3e-05,1e-06,5e-06,6e-06,1.8e-05,1.6e-05,1.4e-05,4e-06,1e-05,1.6e-05,3.8e-05,2.4e-05,2.7e-05,1.9e-05,1.6e-05,2e-05,2.6e-05,2.5e-05,2.5e-05,3.6e-05,2.6e-05,3.6e-05,5e-06,2e-05,1.5e-05,1.3e-05,4.5e-05,1.4e-05,3e-05,2e-06,1e-05,4e-06,5e-06,7e-06,2.1e-05,4.6e-05,5.2e-05,2.5e-05,6e-06,3.2e-05,4.2e-05,4.3e-05,3e-05,1.4e-05,1.8e-05,3.4e-05,4.3e-05,9e-06,3.1e-05,5.7e-05,4.8e-05,2.2e-05,3.4e-05,1.9e-05,4e-06,1.4e-05,2.7e-05,2.2e-05,2e-05,2.3e-05,2.1e-05,3.7e-05,4.5e-05,1.8e-05,2.7e-05,5e-06,1.8e-05,1.9e-05
5.7e-05,4.7e-05,4.3e-05,2.4e-05,6.9e-05,5.7e-05,1.3e-05,1.2e-05,3.9e-05,2.4e-05,4.5e-05,3e-05,2e-05,3.1e-05,6.2e-05,0.000231,6.7e-05,3.7e-05,5.1e-05,2.6e-05,5.8e-05,1.4e-05,5.4e-05,3.7e-05,4.6e-05,3.4e-05,2.1e-05,3.1e-05,4e-05,2.6e-05,6.8e-05,3.4e-05,3.5e-05,9e-06,3.2e-05,4.1e-05,5.4e-05,1.3e-05,3.4e-05,2.5e-05,2e-05,3.8e-05,4.8e-05,4.4e-05,1.6e-05,4e-05,8e-06,3.5e-05,1.3e-05,6e-06,9e-06,3.8e-05,2.9e-05,1.5e-05,3e-05,3.3e-05,1.9e-05,2.7e-05,2.6e-05,2.9e-05,2.8e-05,1.5e-05,2.8e-05,5e-05,2.2e-05,2.6e-05,4.6e-05,5.4e-05,1.5e-05,9e-06,2.9e-05,4.9e-05,5.1e-05,2.2e-05,1.9e-05,1.1e-05,4.1e-05,1.8e-05,1.9e-05,7e-05,4.1e-05,2.7e-05,1.4e-05,9e-06,1.5e-05,2.3e-05,1e-05,2.6e-05,2.9e-05,2.2e-05,1.8e-05,3.3e-05,3.7e-05,1.3e-05,2.3e-05,2e-06,8e-06,4e-06,3e-05,2.6e-05,3.1e-05,2.5e-05,3.3e-05,1.9e-05,3.9e-05,1.9e-05,3.5e-05,3.2e-05,1e-05,2.2e-05,3e-06,1.8e-05,1.8e-05,1.4e-05,1.9e-05,3.9e-05,3.4e-05,2.5e-05,1.6e-05,1.1e-05,2.1e-05
0.000104,9.4e-05,4.2e-05,2.5e-05,7.1e-05,4.5e-05,6.7e-05,3.1e-05,1.4e-05,4.5e-05,1.3e-05,2.7e-05,3e-06,7.7e-05,0.000117,0.000239,3.4e-05,4.4e-05,3.3e-05,6.9e-05,2.5e-05,3.2e-05,4.5e-05,3.4e-05,2.4e-05,4e-05,1.5e-05,2.9e-05,4.6e-05,4.1e-05,8.3e-05,4.6e-05,6.4e-05,5.3e-05,4.8e-05,4.6e-05,3.9e-05,5.9e-05,6.1e-05,6.3e-05,4.9e-05,5.6e-05,9.7e-05,9.6e-05,7.5e-05,4e-05,4.8e-05,4.4e-05,5.2e-05,2.5e-05,2.2e-05,5.1e-05,5e-05,4.9e-05,5.3e-05,0.000101,4.6e-05,3e-05,4.4e-05,8.8e-05,8.2e-05,5.9e-05,4.2e-05,9.4e-05,5.5e-05,9e-06,3.6e-05,5.8e-05,5.7e-05,3.1e-05,5.2e-05,2.5e-05,2.5e-05,4.8e-05,5.4e-05,1.5e-05,5.3e-05,5.7e-05,4.8e-05,6.9e-05,5.1e-05,8e-06,2e-05,2.2e-05,1.9e-05,2.4e-05,3.5e-05,3.2e-05,5.1e-05,8e-05,3.6e-05,2.3e-05,7.9e-05,9.5e-05,5.2e-05,2.7e-05,3e-06,1.3e-05,2.6e-05,5.6e-05,7.2e-05,6.9e-05,6.4e-05,2.9e-05,4.3e-05,5.9e-05,1.4e-05,8e-06,2.3e-05,3.5e-05,2.9e-05,1.5e-05,7e-06,4.6e-05,2.5e-05,5.6e-05,1.3e-05,5.2e-05,4e-05,2.7e-05,5.9e-05
5.7e-05,1e-05,2.5e-05,6.6e-05,4e-06,2.5e-05,5.8e-05,3.9e-05,8e-06,3.6e-05,6.3e-05,2.4e-05,3.1e-05,7.4e-05,8e-05,0.000244,8.1e-05,6.2e-05,8.5e-05,1e-04,8e-05,1.3e-05,1.8e-05,3.7e-05,4.3e-05,5.6e-05,5.3e-05,2.1e-05,3.2e-05,4.4e-05,8.8e-05,6.5e-05,7.8e-05,4.9e-05,4.7e-05,2.1e-05,3.1e-05,7.2e-05,2.8e-05,3.1e-05,5.9e-05,1.4e-05,6.7e-05,2.9e-05,1.1e-05,3.4e-05,5.1e-05,2.2e-05,2.9e-05,3.1e-05,2.2e-05,2.3e-05,7e-06,1.9e-05,2e-05,9.9e-05,9.1e-05,4.5e-05,4.5e-05,4.3e-05,1.7e-05,2.3e-05,4e-05,6.5e-05,3.4e-05,1.7e-05,5.2e-05,2e-05,4e-05,2.4e-05,4.2e-05,3.1e-05,1.1e-05,5.3e-05,5.2e-05,5.1e-05,6.6e-05,5e-05,2.2e-05,4.4e-05,5.7e-05,3e-05,4.1e-05,3.6e-05,3.5e-05,2.9e-05,5.4e-05,4.8e-05,5.2e-05,7.6e-05,5.1e-05,2e-06,6.1e-05,6.7e-05,2.4e-05,1.1e-05,1.1e-05,2.6e-05,1.4e-05,2.3e-05,3.2e-05,1.4e-05,3.5e-05,6.9e-05,2.8e-05,4e-05,5.5e-05,4.8e-05,3.5e-05,6.4e-05,7.2e-05,4.5e-05,3e-06,4.4e-05,5.1e-05,4.5e-05,3.8e-05,5.1e-05,4.3e-05,4.7e-05,5.5e-05
4.1e-05,1e-05,2.7e-05,3.5e-05,3.3e-05,4.7e-05,3.6e-05,2.8e-05,3.4e-05,6e-06,3e-05,3.3e-05,2.4e-05,8.4e-05,0.000185,0.000291,0.000154,0.000103,5.3e-05,2.9e-05,4.5e-05,5.6e-05,5.9e-05,1.6e-05,2.7e-05,3.4e-05,3.2e-05,2.5e-05,2.9e-05,3.8e-05,5.1e-05,3.3e-05,2.4e-05,2.6e-05,3.9e-05,3.3e-05,2.6e-05,5.4e-05,2.7e-05,1.7e-05,2.7e-05,2.5e-05,1.7e-05,1.4e-05,1.2e-05,2.3e-05,8e-06,1.2e-05,1.3e-05,1.6e-05,2.2e-05,3.2e-05,1.7e-05,9e-06,1.7e-05,5.2e-05,1.9e-05,4e-05,4.4e-05,5.3e-05,3.2e-05,3.2e-05,5.1e-05,2.5e-05,1.7e-05,1.9e-05,4.9e-05,4.9e-05,2.7e-05,1.7e-05,2.7e-05,5e-06,3.8e-05,3.6e-05,3.4e-05,6e-05,1.9e-05,1.8e-05,5e-06,3.2e-05,4.3e-05,4.6e-05,5.9e-05,2.1e-05,3.2e-05,1.8e-05,5.1e-05,4.3e-05,1.6e-05,2.6e-05,1.5e-05,2.4e-05,2.8e-05,3.3e-05,2.5e-05,1.9e-05,1.2e-05,2e-05,2.3e-05,2.2e-05,3.4e-05,2.2e-05,1.9e-05,3.5e-05,3.3e-05,1.9e-05,3.4e-05,2.7e-05,6e-06,6.1e-05,3.1e-05,1.1e-05,2.8e-05,4.2e-05,3.9e-05,3.3e-05,7e-06,2.7e-05,2.6e-05,1.1e-05,1.9e-05
1.8e-05,4e-05,2.7e-05,3.1e-05,1.9e-05,2.1e-05,5.3e-05,1.7e-05,2.8e-05,1.2e-05,3.4e-05,5.2e-05,3.2e-05,4.5e-05,0.000145,0.000871,0.000309,9.4e-05,6.5e-05,3.8e-05,4.9e-05,2.5e-05,1.6e-05,3.1e-05,2.3e-05,3.3e-05,1.1e-05,2.7e-05,1e-05,4.6e-05,3.6e-05,3.2e-05,5e-06,2.4e-05,2.7e-05,2.7e-05,2e-05,2.7e-05,1.8e-05,2.1e-05,3.1e-05,1.2e-05,2.5e-05,1.6e-05,7e-06,1.8e-05,1.7e-05,2.1e-05,1.8e-05,7e-06,1.9e-05,3.9e-05,3.1e-05,3e-05,1.4e-05,1.7e-05,2.6e-05,3.8e-05,3e-06,1.4e-05,1.3e-05,1.9e-05,2.6e-05,3.6e-05,1.4e-05,2.6e-05,1.6e-05,4e-06,1e-05,1.5e-05,3.6e-05,1.8e-05,2.5e-05,4.2e-05,4.7e-05,2.9e-05,3.3e-05,1e-05,2.6e-05,2.8e-05,2.5e-05,2.2e-05,2.9e-05,4.3e-05,2.8e-05,2.4e-05,5.6e-05,1.6e-05,3.3e-05,2.7e-05,1.3e-05,1.4e-05,4e-06,2.1e-05,2.4e-05,2.1e-05,3.4e-05,3.7e-05,3e-05,1.7e-05,1e-05,2e-05,1.3e-05,3e-05,1.4e-05,1.5e-05,7e-06,1.4e-05,1.1e-05,4.7e-05,2.9e-05,1.9e-05,4.5e-05,6e-05,5.9e-05,2.8e-05,1.7e-05,3.5e-05,2.3e-05,8e-06,2.4e-05
3e-05,1.9e-05,1.4e-05,1.5e-05,2.2e-05,2.6e-05,2.5e-05,2.8e-05,4.8e-05,2.4e-05,7.4e-05,7.3e-05,9.3e-05,9.2e-05,0.00023,0.001134,0.001311,0.000855,0.000358,0.000118,3.9e-05,4.5e-05,2.8e-05,9e-06,1.7e-05,1.4e-05,2e-05,3.7e-05,3.4e-05,6.5e-05,5.3e-05,4.8e-05,5.6e-05,3.7e-05,3.1e-05,2.2e-05,4.1e-05,2.4e-05,9e-06,2.6e-05,6e-06,1.3e-05,3.6e-05,1.4e-05,1.4e-05,2.1e-05,3.4e-05,1.1e-05,4.1e-05,4.4e-05,2.1e-05,1e-05,1.3e-05,2.2e-05,4.1e-05,4e-05,2.5e-05,1.3e-05,1.7e-05,7e-06,8e-06,8e-06,1.6e-05,1.8e-05,2.1e-05,2e-05,3.3e-05,2e-05,3e-05,4.2e-05,2.1e-05,3.2e-05,1.5e-05,3e-05,2e-06,2.2e-05,7e-06,1.2e-05,3.8e-05,2e-05,7e-06,2.6e-05,1.4e-05,4.8e-05,2.6e-05,2.2e-05,5.2e-05,4.2e-05,2.3e-05,1.1e-05,1.1e-05,1.2e-05,4.1e-05,1.8e-05,1.1e-05,2.6e-05,2e-05,2.2e-05,1e-05,2.8e-05,1.9e-05,6e-06,2.4e-05,3.1e-05,3.9e-05,2.3e-05,2e-05,1.2e-05,1.6e-05,5.3e-05,3.9e-05,1.7e-05,2.8e-05,2.1e-05,2.1e-05,2.6e-05,2.6e-05,2.5e-05,2.4e-05,2.5e-05,2.5e-05
2.3e-05,3.2e-05,3.3e-05,3.9e-05,2e-05,2e-05,5e-06,2.9e-05,6.4e-05,4.2e-05,7.2e-05,0.000119,0.000117,5.1e-05,0.000164,0.000742,0.000666,0.000237,0.000153,7.3e-05,4.8e-05,1.7e-05,0.000112,8e-05,7.6e-05,4.7e-05,3.3e-05,3.9e-05,1.8e-05,2.8e-05,2.2e-05,2.1e-05,6.1e-05,3.3e-05,4.2e-05,4.7e-05,1.8e-05,2.9e-05,3.2e-05,1.8e-05,2.1e-05,2.7e-05,3.5e-05,1.3e-05,2.6e-05,7e-06,1.4e-05,2e-05,2.6e-05,3.4e-05,3.2e-05,1.6e-05,1.1e-05,3.1e-05,4.9e-05,6e-06,1e-05,2.3e-05,1.3e-05,1.7e-05,7e-06,9e-06,3.2e-05,3.7e-05,7e-06,1.2e-05,3.7e-05,7e-06,2.9e-05,1.4e-05,4.5e-05,3.4e-05,8e-06,2.3e-05,2.6e-05,3.7e-05,2.4e-05,3.5e-05,4.6e-05,1.8e-05,8e-06,2.3e-05,3.4e-05,3.9e-05,3.7e-05,2.3e-05,4.2e-05,4.3e-05,2.8e-05,3e-05,2.7e-05,1.4e-05,3.1e-05,1.6e-05,1.9e-05,3.7e-05,1.7e-05,2.2e-05,1.8e-05,3.1e-05,1e-05,1.3e-05,3e-05,2.4e-05,7e-06,2e-05,2.8e-05,6e-06,1.7e-05,2.1e-05,1.2e-05,2.8e-05,2.3e-05,1.6e-05,1.6e-05,1.1e-05,4e-05,3.2e-05,3.1e-05,2.2e-05,9e-06
2.7e-05,1.7e-05,1.7e-05,5e-06,5e-06,2.4e-05,3.4e-05,3.6e-05,8.8e-05,4.7e-05,5.2e-05,0.000156,7.7e-05,1.4e-05,0.000179,0.000283,0.000324,0.000207,0.000108,8.8e-05,5.3e-05,5.3e-05,0.000143,8.3e-05,8.1e-05,0.000102,6.5e-05,2.4e-05,1.7e-05,3.7e-05,1.4e-05,1.2e-05,5e-05,2.1e-05,4.1e-05,3e-05,2.1e-05,2.8e-05,3.9e-05,2.5e-05,2e-05,1.6e-05,1.9e-05,2.4e-05,4e-05,3.6e-05,1.9e-05,2.6e-05,3e-05,2.1e-05,2.6e-05,9e-06,6e-06,2.2e-05,8e-06,1.2e-05,9e-06,8e-06,1.1e-05,2e-05,8e-06,1.1e-05,3e-05,2.4e-05,1.5e-05,2.2e-05,3e-05,4.2e-05,1e-06,1.8e-05,2.1e-05,6e-06,1.8e-05,3.2e-05,2.2e-05,2.3e-05,1.5e-05,2.2e-05,4e-06,1e-05,2e-05,1.4e-05,3.7e-05,5.8e-05,9e-06,1.7e-05,2.8e-05,1.7e-05,2.6e-05,2.3e-05,1.7e-05,2.4e-05,1.3e-05,7e-06,2.7e-05,4.4e-05,1.7e-05,1.3e-05,1.1e-05,1.8e-05,1.9e-05,1.1e-05,2.5e-05,1.9e-05,3e-06,2.3e-05,2.4e-05,2.2e-05,1.3e-05,1.2e-05,9e-06,1.1e-05,2.1e-05,1.7e-05,1.6e-05,1.6e-05,1.9e-05,3.7e-05,3.7e-05,1.5e-05,2.5e-05
1.8e-05,1.4e-05,2.3e-05,1.8e-05,1.2e-05,1.7e-05,2.2e-05,8e-06,7.2e-05,5.6e-05,7e-05,0.000124,5.9e-05,2.9e-05,0.000199,0.000275,0.000224,6.2e-05,6.5e-05,0.000102,3.1e-05,2.7e-05,8.9e-05,4.8e-05,6.5e-05,5.3e-05,1.9e-05,1.4e-05,1.2e-05,1.3e-05,1.2e-05,3.4e-05,2.5e-05,2.4e-05,3.6e-05,2.5e-05,9e-06,2e-05,1e-05,8e-06,1.9e-05,1.6e-05,1.7e-05,8e-06,1.7e-05,1e-05,2e-06,2.2e-05,1.3e-05,2.3e-05,1e-05,1.4e-05,7e-06,8e-06,1.1e-05,1e-05,7e-06,1.2e-05,1.3e-05,1.1e-05,2e-06,7e-06,2.6e-05,6e-06,1e-05,1e-05,1.8e-05,2.3e-05,2.2e-05,2.1e-05,2.8e-05,1.4e-05,2.9e-05,2.9e-05,2.8e-05,1.1e-05,1.1e-05,1.2e-05,5e-06,6e-06,1.1e-05,2.2e-05,2.5e-05,3e-05,2.5e-05,2.5e-05,3.6e-05,1.8e-05,1.6e-05,5e-06,1.9e-05,2.3e-05,1.5e-05,4e-06,1.6e-05,9e-06,9e-06,3e-06,1.4e-05,6e-06,7e-06,1.5e-05,4e-06,1.5e-05,2e-05,1.4e-05,1.2e-05,7e-06,8e-06,2.3e-05,6e-06,1.7e-05,1e-05,2.2e-05,4e-06,3e-06,1.2e-05,1.5e-05,3e-06,1.7e-05,1.9e-05
7e-06,1.1e-05,8e-06,6e-06,9e-06,4e-06,1.3e-05,2e-06,4.5e-05,3.9e-05,8.4e-05,2.4e-05,3.9e-05,1.9e-05,0.000256,0.000174,0.000237,0.000101,3.8e-05,4.8e-05,4.1e-05,4.3e-05,2.3e-05,3.1e-05,3.3e-05,2.5e-05,1.5e-05,7e-06,4e-06,6e-06,8e-06,2.5e-05,7e-06,1.8e-05,7e-06,4e-06,8e-06,1.7e-05,7e-06,1.1e-05,5e-06,8e-06,9e-06,9e-06,7e-06,1.1e-05,9e-06,1.3e-05,9e-06,1.2e-05,2e-06,4e-06,2e-06,5e-06,1e-05,1.2e-05,3e-06,2e-06,3e-06,1.1e-05,6e-06,1e-06,7e-06,5e-06,1e-05,3e-06,7e-06,8e-06,6e-06,6e-06,1.4e-05,4e-06,1.9e-05,8e-06,9e-06,1.4e-05,4e-06,3e-06,5e-06,3e-06,7e-06,8e-06,2.3e-05,1.7e-05,6e-06,1e-05,1.1e-05,3e-06,1.1e-05,4e-06,1.3e-05,4e-06,8e-06,4e-06,9e-06,3e-06,3e-06,7e-06,3e-06,6e-06,5e-06,3e-06,7e-06,7e-06,1.1e-05,1.2e-05,1.2e-05,7e-06,1e-05,1.4e-05,7e-06,1.4e-05,1.6e-05,5e-06,5e-06,6e-06,6e-06,6e-06,1e-06,1.9e-05,7e-06
1e-05,2e-06,6e-06,7e-06,5e-06,5e-06,7e-06,7e-06,7e-06,4.2e-05,2.9e-05,4.6e-05,4.4e-05,4.5e-05,0.000295,0.000133,0.00011,0.000104,5.7e-05,1e-05,2e-06,2.8e-05,1.8e-05,1.9e-05,1.8e-05,1.5e-05,7e-06,2e-06,9e-06,1.3e-05,7e-06,1.4e-05,2e-06,1.1e-05,6e-06,2e-06,6e-06,1e-05,4e-06,8e-06,1e-06,8e-06,3e-06,6e-06,4e-06,1e-06,4e-06,2e-06,2e-06,1.1e-05,1e-06,6e-06,4e-06,5e-06,7e-06,9e-06,5e-06,5e-06,3e-06,1.1e-05,4e-06,3e-06,5e-06,2e-06,6e-06,5e-06,5e-06,7e-06,5e-06,2e-06,1e-05,1e-06,1.2e-05,3e-06,5e-06,7e-06,7e-06,3e-06,4e-06,1e-06,2e-06,6e-06,1.6e-05,6e-06,1e-05,1e-05,4e-06,6e-06,1e-05,8e-06,1e-05,6e-06,7e-06,5e-06,3e-06,5e-06,2e-06,7e-06,2e-06,6e-06,6e-06,3e-06,1e-05,9e-06,1e-06,2e-06,7e-06,3e-06,5e-06,1e-05,3e-06,1.2e-05,8e-06,1e-06,6e-06,6e-06,7e-06,2e-06,6e-06,1.6e-05,5e-06
3e-06,2e-06,6e-06,5e-06,2e-06,1.2e-05,1.7e-05,5e-06,2.7e-05,1.1e-05,3.7e-05,3.9e-05,2.2e-05,7e-06,0.000264,0.00012,8e-05,3.8e-05,3.8e-05,1.8e-05,2.3e-05,3.2e-05,1.3e-05,1.5e-05,1.2e-05,4e-06,1.3e-05,4e-06,1e-05,1e-06,2e-06,9e-06,2e-06,6e-06,7e-06,4e-06,5e-06,5e-06,3e-06,2e-06,9e-06,6e-06,8e-06,7e-06,9e-06,5e-06,7e-06,5e-06,3e-06,1e-05,4e-06,3e-06,3e-06,1e-06,6e-06,2e-06,5e-06,7e-06,5e-06,8e-06,4e-06,6e-06,3e-06,4e-06,4e-06,5e-06,3e-06,6e-06,7e-06,6e-06,9e-06,5e-06,5e-06,2e-06,5e-06,2e-06,7e-06,6e-06,7e-06,2e-06,4e-06,1.5e-05,8e-06,1.6e-05,8e-06,4e-06,7e-06,4e-06,1e-05,7e-06,5e-06,3e-06,6e-06,2e-06,4e-06,3e-06,3e-06,6e-06,2e-06,6e-06,2e-06,9e-06,6e-06,7e-06,5e-06,4e-06,5e-06,4e-06,1e-05,4e-06,6e-06,8e-06,2e-06,7e-06,3e-06,5e-06,9e-06,4e-06,2e-06,7e-06,5e-06
4e-06,6e-06,1e-06,1e-06,8e-06,1.2e-05,8e-06,1.2e-05,3.3e-05,2.1e-05,2.3e-05,2.5e-05,2.4e-05,3.7e-05,0.000244,0.000288,0.00011,5.4e-05,1.4e-05,1.8e-05,1.2e-05,2.5e-05,2.2e-05,1.8e-05,1.2e-05,6e-06,7e-06,1.4e-05,9e-06,1e-06,1.1e-05,1e-06,8e-06,5e-06,4e-06,7e-06,5e-06,9e-06,9e-06,5e-06,1.1e-05,6e-06,4e-06,7e-06,5e-06,3e-06,1e-06,9e-06,7e-06,9e-06,4e-06,0,4e-06,3e-06,9e-06,1e-05,2e-06,5e-06,7e-06,7e-06,1e-05,6e-06,5e-06,9e-06,1e-05,7e-06,6e-06,7e-06,7e-06,7e-06,1.1e-05,1.1e-05,1.1e-05,2e-06,6e-06,6e-06,8e-06,4e-06,1e-05,9e-06,9e-06,9e-06,2e-06,1.9e-05,7e-06,1.2e-05,1e-05,6e-06,1.2e-05,4e-06,9e-06,8e-06,7e-06,3e-06,9e-06,4e-06,8e-06,7e-06,9e-06,1.2e-05,6e-06,5e-06,1.2e-05,1.9e-05,6e-06,5e-06,2e-06,6e-06,9e-06,1.1e-05,1e-05,4e-06,5e-06,1.1e-05,1.2e-05,7e-06,7e-06,5e-06,6e-06,4e-06,3e-06
1.1e-05,5e-06,4e-06,9e-06,8e-06,1.3e-05,1.6e-05,1.4e-05,2.6e-05,5e-06,2.7e-05,3.6e-05,3.1e-05,7.3e-05,0.000313,0.000274,0.000202,0.000105,3.8e-05,2e-05,2.8e-05,1.5e-05,1.4e-05,1.2e-05,1.1e-05,9e-06,3e-06,8e-06,6e-06,6e-06,9e-06,7e-06,3e-06,8e-06,3e-06,1e-05,2e-06,1.7e-05,4e-06,8e-06,7e-06,9e-06,3e-06,6e-06,6e-06,6e-06,5e-06,1e-05,6e-06,0,2e-06,1e-06,6e-06,9e-06,4e-06,5e-06,4e-06,3e-06,7e-06,6e-06,4e-06,7e-06,2e-06,9e-06,4e-06,3e-06,6e-06,1e-06,1e-06,5e-06,1e-05,6e-06,6e-06,1e-06,5e-06,8e-06,1e-06,3e-06,7e-06,1.2e-05,4e-06,8e-06,8e-06,1.9e-05,1.6e-05,8e-06,8e-06,5e-06,9e-06,3e-06,9e-06,1.1e-05,3e-06,7e-06,1e-05,5e-06,1e-05,6e-06,3e-06,7e-06,2e-06,7e-06,1.7e-05,8e-06,3e-06,9e-06,3e-06,1.5e-05,7e-06,7e-06,1.1e-05,9e-06,6e-06,9e-06,6e-06,8e-06,5e-06,5e-06,1.2e-05,1e-05,3e-06
3e-06,2e-06,2e-06,1e-05,6e-06,2.5e-05,6e-06,1e-05,3.7e-05,1.3e-05,1.1e-05,6.9e-05,0.000115,1.5e-05,0.000282,0.000163,7.8e-05,4.6e-05,3.2e-05,2.7e-05,9e-06,1.8e-05,3e-06,9e-06,1.2e-05,7e-06,4e-06,9e-06,5e-06,3e-06,1.1e-05,1.1e-05,3e-06,9e-06,1.1e-05,2e-06,5e-06,1.1e-05,1.8e-05,3e-06,6e-06,2e-06,3e-06,2e-06,7e-06,1.1e-05,7e-06,5e-06,1e-06,8e-06,5e-06,6e-06,4e-06,4e-06,7e-06,9e-06,3e-06,6e-06,4e-06,6e-06,2e-06,5e-06,5e-06,5e-06,1.1e-05,2e-06,2e-06,6e-06,7e-06,2e-06,1e-06,1e-05,9e-06,8e-06,4e-06,7e-06,6e-06,6e-06,4e-06,4e-06,1e-06,3e-06,6e-06,8e-06,9e-06,1.1e-05,6e-06,8e-06,8e-06,3e-06,1.3e-05,6e-06,5e-06,8e-06,3e-06,4e-06,1.4e-05,7e-06,7e-06,1e-06,2e-06,1e-05,1.2e-05,1.3e-05,1.1e-05,1e-05,7e-06,1.6e-05,4e-06,1.3e-05,8e-06,2e-06,7e-06,1.2e-05,4e-06,5e-06,1.1e-05,3e-06,1e-05,1e-06,7e-06
1.6e-05,3e-06,4e-06,1e-05,5e-06,2.7e-05,3.3e-05,2.2e-05,3.1e-05,4.1e-05,1.5e-05,0.000128,0.000138,0.000126,0.000354,0.00011,0.000113,8.3e-05,5.3e-05,2.3e-05,4e-06,1e-05,5e-06,4e-06,9e-06,1.4e-05,6e-06,1e-05,1.4e-05,1.3e-05,2e-05,1.3e-05,1.5e-05,1.5e-05,2e-06,3e-06,7e-06,6e-06,1.4e-05,1.2e-05,1.2e-05,5e-06,2e-06,6e-06,9e-06,1.3e-05,5e-06,7e-06,8e-06,1e-05,7e-06,1.4e-05,1e-05,1.1e-05,5e-06,3e-06,5e-06,4e-06,6e-06,1.4e-05,7e-06,7e-06,1e-05,3e-06,1e-05,1.1e-05,5e-06,1.1e-05,9e-06,8e-06,3e-06,1e-05,1e-05,1.2e-05,1.7e-05,1.2e-05,9e-06,6e-06,8e-06,6e-06,9e-06,8e-06,1.9e-05,3.2e-05,7e-06,5e-06,1.1e-05,5e-06,1.3e-05,4e-06,1.1e-05,5e-06,7e-06,8e-06,4e-06,5e-06,5e-06,5e-06,2e-06,4e-06,6e-06,5e-06,8e-06,1.3e-05,1.1e-05,7e-06,6e-06,1.4e-05,1.2e-05,1.9e-05,7e-06,3e-06,1e-06,9e-06,9e-06,7e-06,1.4e-05,1.1e-05,1e-05,1.3e-05,1e-05
2e-06,4e-06,8e-06,1e-05,8e-06,2.6e-05,2.2e-05,1.9e-05,1.2e-05,3.4e-05,6.6e-05,0.000145,5.2e-05,3.9e-05,0.000335,0.000499,0.000235,5.5e-05,2.3e-05,1.6e-05,2.2e-05,6e-06,7e-06,5e-06,8e-06,2.2e-05,3e-06,9e-06,1.3e-05,8e-06,1.2e-05,1.2e-05,6e-06,1e-06,1e-06,7e-06,4e-06,8e-06,7e-06,7e-06,5e-06,4e-06,7e-06,9e-06,8e-06,3e-06,2e-06,5e-06,6e-06,4e-06,9e-06,6e-06,4e-06,9e-06,8e-06,4e-06,3e-06,5e-06,8e-06,5e-06,9e-06,7e-06,1.5e-05,6e-06,7e-06,1.2e-05,7e-06,1.1e-05,5e-06,5e-06,7e-06,3e-06,5e-06,8e-06,7e-06,1e-06,7e-06,6e-06,8e-06,2e-06,1.1e-05,5e-06,1.7e-05,3.3e-05,3.3e-05,1.7e-05,1.6e-05,1.2e-05,7e-06,1.6e-05,7e-06,6e-06,1.7e-05,1.2e-05,1.2e-05,8e-06,7e-06,6e-06,4e-06,4e-06,1.2e-05,7e-06,8e-06,2e-06,8e-06,9e-06,5e-06,4e-06,3e-06,9e-06,6e-06,6e-06,7e-06,9e-06,2e-06,4e-06,7e-06,6e-06,9e-06,1.2e-05,8e-06
8e-06,4e-06,1.2e-05,9e-06,6e-06,1.2e-05,4.1e-05,2.1e-05,3.8e-05,5.3e-05,7e-05,0.000168,9.7e-05,9e-05,0.000411,0.001023,0.000602,0.000224,3.4e-05,1.6e-05,1.8e-05,2.9e-05,2.8e-05,1.8e-05,1.4e-05,2e-05,2.4e-05,5e-06,1.2e-05,1e-05,1.4e-05,2e-06,3e-06,3e-06,5e-06,6e-06,5e-06,7e-06,1e-05,1.5e-05,1e-05,3e-06,6e-06,2e-06,8e-06,9e-06,2e-06,5e-06,6e-06,7e-06,4e-06,7e-06,6e-06,1e-05,9e-06,8e-06,1e-06,8e-06,5e-06,7e-06,5e-06,3e-06,8e-06,5e-06,5e-06,8e-06,9e-06,4e-06,5e-06,1e-05,1.1e-05,5e-06,7e-06,7e-06,5e-06,4e-06,1e-06,6e-06,6e-06,3e-06,8e-06,9e-06,1e-05,2.3e-05,1.5e-05,8e-06,1.5e-05,7e-06,9e-06,1.5e-05,1.3e-05,7e-06,8e-06,6e-06,3e-06,8e-06,6e-06,1.2e-05,7e-06,3e-06,1.3e-05,8e-06,8e-06,7e-06,8e-06,1.3e-05,4e-06,7e-06,2e-06,7e-06,1e-06,2e-06,4e-06,4e-06,6e-06,2e-06,5e-06,3e-06,7e-06,1e-06,2e-06
4e-06,8e-06,1.8e-05,1.8e-05,4e-06,1.1e-05,4.1e-05,2e-05,5.4e-05,3.4e-05,1.1e-05,0.000119,6.3e-05,0.000123,0.000495,0.001127,0.000517,0.000144,1e-05,1.1e-05,2.3e-05,7e-06,2.4e-05,1.2e-05,1.3e-05,8e-06,1.2e-05,9e-06,5e-06,6e-06,6e-06,8e-06,6e-06,3e-06,6e-06,5e-06,7e-06,3e-06,1.1e-05,1.1e-05,3e-06,2e-06,8e-06,6e-06,9e-06,2e-06,6e-06,8e-06,1e-05,4e-06,4e-06,1e-06,5e-06,5e-06,2e-06,4e-06,2e-06,7e-06,7e-06,6e-06,9e-06,8e-06,1e-05,8e-06,2e-06,8e-06,5e-06,6e-06,1e-06,9e-06,9e-06,9e-06,9e-06,7e-06,6e-06,9e-06,9e-06,8e-06,6e-06,3e-06,4e-06,8e-06,6e-06,1.7e-05,9e-06,4e-06,6e-06,5e-06,7e-06,1e-05,2e-06,1.3e-05,1.7e-05,8e-06,7e-06,8e-06,1.1e-05,6e-06,9e-06,5e-06,1e-05,9e-06,2e-06,8e-06,4e-06,4e-06,6e-06,1.1e-05,8e-06,3e-06,4e-06,3e-06,3e-06,7e-06,3e-06,2e-06,3e-06,4e-06,6e-06,7e-06,1e-05
1e-05,8e-06,1.9e-05,2.2e-05,2.1e-05,2.8e-05,3.8e-05,2.2e-05,4.1e-05,8.5e-05,6.4e-05,8.9e-05,4.9e-05,0.000136,0.000347,0.000669,0.000357,8.8e-05,1.5e-05,2.2e-05,1.4e-05,1.6e-05,1.4e-05,1.7e-05,4e-06,3e-06,7e-06,4e-06,2e-06,7e-06,1.2e-05,1.2e-05,6e-06,4e-06,3e-06,9e-06,4e-06,6e-06,9e-06,5e-06,5e-06,5e-06,6e-06,5e-06,4e-06,5e-06,9e-06,2e-06,4e-06,5e-06,4e-06,4e-06,3e-06,5e-06,7e-06,9e-06,5e-06,6e-06,4e-06,5e-06,1e-05,6e-06,7e-06,4e-06,3e-06,7e-06,3e-06,5e-06,6e-06,3e-06,3e-06,1e-06,8e-06,2e-06,7e-06,8e-06,4e-06,1e-06,2e-06,3e-06,6e-06,3e-06,0,6e-06,6e-06,5e-06,1.6e-05,9e-06,3e-06,1e-06,4e-06,1.8e-05,9e-06,4e-06,2e-06,4e-06,2e-06,2e-06,5e-06,6e-06,4e-06,3e-06,4e-06,9e-06,7e-06,4e-06,8e-06,9e-06,5e-06,3e-06,1e-06,1e-06,4e-06,5e-06,6e-06,7e-06,2e-06,2e-06,5e-06,6e-06,6e-06
3e-06,2e-06,8e-06,1e-06,7e-06,1.3e-05,4e-06,5e-06,1.8e-05,1.3e-05,4e-06,2.2e-05,3e-05,5.7e-05,9.9e-05,0.000224,0.000126,4.4e-05,1.1e-05,1.6e-05,1.3e-05,1e-05,1e-05,8e-06,4e-06,1e-06,2e-06,3e-06,2e-06,3e-06,5e-06,4e-06,3e-06,1e-06,1e-06,5e-06,4e-06,6e-06,2e-06,1e-06,3e-06,1e-06,5e-06,1e-06,1e-06,1e-06,4e-06,2e-06,1e-06,3e-06,1e-06,1e-06,2e-06,1e-06,3e-06,5e-06,1e-06,1e-06,2e-06,1e-06,3e-06,1e-06,3e-06,2e-06,2e-06,2e-06,2e-06,2e-06,2e-06,2e-06,2e-06,2e-06,4e-06,2e-06,1e-06,2e-06,1e-06,1e-06,1e-06,2e-06,4e-06,4e-06,2e-06,5e-06,4e-06,3e-06,5e-06,1e-06,2e-06,2e-06,1e-06,5e-06,7e-06,2e-06,1e-06,1e-06,3e-06,3e-06,1e-06,1e-06,3e-06,3e-06,1e-06,3e-06,3e-06,2e-06,5e-06,3e-06,0,1e-06,1e-06,1e-06,1e-06,1e-06,2e-06,2e-06,2e-06,0,2e-06,2e-06,3e-06
3e-06,1e-06,5e-06,2e-06,4e-06,6e-06,3e-06,2e-06,8e-06,1.2e-05,9e-06,9e-06,2.6e-05,5.6e-05,0.000118,0.000104,4.2e-05,2.3e-05,9e-06,4e-06,1e-05,3e-06,9e-06,4e-06,3e-06,3e-06,2e-06,2e-06,4e-06,3e-06,7e-06,6e-06,2e-06,2e-06,1e-06,4e-06,2e-06,2e-06,1e-06,2e-06,2e-06,3e-06,2e-06,0,1e-06,1e-06,3e-06,2e-06,2e-06,1e-06,1e-06,2e-06,1e-06,1e-06,3e-06,1e-06,1e-06,1e-06,1e-06,2e-06,2e-06,2e-06,2e-06,1e-06,1e-06,2e-06,2e-06,1e-06,2e-06,2e-06,3e-06,2e-06,3e-06,2e-06,1e-06,3e-06,2e-06,2e-06,2e-06,3e-06,3e-06,1e-06,3e-06,8e-06,6e-06,4e-06,5e-06,0,4e-06,3e-06,2e-06,1e-06,6e-06,2e-06,1e-06,1e-06,4e-06,3e-06,2e-06,4e-06,4e-06,0,1e-06,4e-06,3e-06,3e-06,2e-06,4e-06,2e-06,1e-06,1e-06,1e-06,3e-06,2e-06,3e-06,1e-06,3e-06,2e-06,2e-06,2e-06,1e-06
0,1e-06,2e-06,3e-06,1e-06,1e-06,5e-06,3e-06,2e-06,4e-06,5e-06,9e-06,1.7e-05,1.8e-05,0.000108,5.6e-05,3.3e-05,3.2e-05,1.8e-05,1.5e-05,1.5e-05,1.3e-05,3e-06,1e-06,1e-06,6e-06,3e-06,2e-06,3e-06,0,2e-06,2e-06,3e-06,4e-06,1e-06,2e-06,2e-06,4e-06,2e-06,2e-06,1e-06,2e-06,4e-06,3e-06,3e-06,2e-06,4e-06,2e-06,1e-06,1e-06,1e-06,2e-06,2e-06,1e-06,1e-06,3e-06,1e-06,1e-06,1e-06,0,2e-06,2e-06,2e-06,1e-06,0,2e-06,1e-06,1e-06,3e-06,1e-06,2e-06,2e-06,3e-06,2e-06,1e-06,4e-06,0,2e-06,2e-06,1e-06,2e-06,3e-06,5e-06,2e-06,4e-06,6e-06,7e-06,5e-06,7e-06,2e-06,1e-06,2e-06,5e-06,2e-06,2e-06,1e-06,4e-06,2e-06,1e-06,5e-06,1e-06,1e-06,1e-06,5e-06,3e-06,1e-06,3e-06,2e-06,3e-06,2e-06,2e-06,1e-06,3e-06,2e-06,2e-06,1e-06,3e-06,2e-06,0,1e-06,1e-06
1e-06,3e-06,2e-06,2e-06,1e-06,2e-06,2e-06,1e-06,3e-06,6e-06,5e-06,1.2e-05,1e-05,1.7e-05,0.000105,5.1e-05,2.1e-05,2.5e-05,9e-06,6e-06,7e-06,4e-06,4e-06,2e-06,3e-06,4e-06,4e-06,1e-06,2e-06,2e-06,4e-06,1e-06,2e-06,2e-06,2e-06,2e-06,0,3e-06,2e-06,1e-06,2e-06,2e-06,2e-06,3e-06,1e-06,2e-06,3e-06,1e-06,1e-06,2e-06,2e-06,1e-06,2e-06,2e-06,1e-06,2e-06,1e-06,0,2e-06,1e-06,2e-06,0,2e-06,1e-06,1e-06,2e-06,0,0,1e-06,2e-06,1e-06,3e-06,1e-06,2e-06,2e-06,3e-06,1e-06,1e-06,1e-06,3e-06,6e-06,1e-06,4e-06,4e-06,2e-06,2e-06,2e-06,0,4e-06,2e-06,3e-06,2e-06,3e-06,2e-06,2e-06,2e-06,2e-06,2e-06,4e-06,4e-06,3e-06,0,2e-06,3e-06,0,1e-06,2e-06,2e-06,4e-06,1e-06,2e-06,2e-06,1e-06,2e-06,4e-06,2e-06,2e-06,2e-06,2e-06,1e-06,2e-06
3e-06,0,1e-06,3e-06,2e-06,3e-06,3e-06,3e-06,1e-06,3e-06,4e-06,1.1e-05,4e-06,1.7e-05,8.1e-05,2.2e-05,2.1e-05,9e-06,4e-06,7e-06,9e-06,8e-06,2e-06,6e-06,4e-06,4e-06,3e-06,3e-06,2e-06,2e-06,4e-06,3e-06,1e-06,2e-06,2e-06,4e-06,3e-06,3e-06,1e-06,2e-06,3e-06,3e-06,3e-06,1e-06,1e-06,3e-06,1e-06,2e-06,1e-06,2e-06,2e-06,2e-06,3e-06,1e-06,2e-06,1e-06,0,1e-06,3e-06,2e-06,1e-06,2e-06,2e-06,1e-06,1e-06,1e-06,1e-06,0,1e-06,2e-06,1e-06,2e-06,2e-06,2e-06,2e-06,2e-06,3e-06,1e-06,2e-06,2e-06,4e-06,6e-06,2e-06,2e-06,2e-06,4e-06,2e-06,1e-06,2e-06,0,5e-06,6e-06,3e-06,2e-06,3e-06,1e-06,1e-06,2e-06,2e-06,2e-06,2e-06,3e-06,1e-06,2e-06,3e-06,2e-06,3e-06,1e-06,2e-06,3e-06,4e-06,2e-06,1e-06,2e-06,1e-06,2e-06,4e-06,2e-06,1e-06,2e-06,2e-06
2e-06,1e-06,1e-06,4e-06,1e-06,5e-06,1e-06,5e-06,7e-06,4e-06,1e-06,1e-06,2e-06,1.2e-05,6.9e-05,1.8e-05,2.2e-05,5e-06,3e-06,9e-06,4e-06,5e-06,5e-06,8e-06,1e-06,1e-06,2e-06,4e-06,3e-06,2e-06,3e-06,2e-06,1e-06,1e-06,1e-06,2e-06,1e-06,1e-06,1e-06,2e-06,1e-06,2e-06,3e-06,1e-06,2e-06,1e-06,2e-06,1e-06,1e-06,0,1e-06,1e-06,1e-06,1e-06,1e-06,2e-06,1e-06,1e-06,1e-06,1e-06,0,1e-06,1e-06,1e-06,0,1e-06,1e-06,2e-06,0,1e-06,1e-06,1e-06,3e-06,1e-06,1e-06,1e-06,1e-06,1e-06,1e-06,2e-06,2e-06,2e-06,4e-06,7e-06,2e-06,3e-06,2e-06,2e-06,1e-06,2e-06,6e-06,1e-06,2e-06,1e-06,1e-06,1e-06,1e-06,2e-06,3e-06,2e-06,1e-06,1e-06,1e-06,2e-06,2e-06,0,2e-06,2e-06,1e-06,2e-06,1e-06,0,2e-06,1e-06,2e-06,3e-06,1e-06,0,2e-06,3e-06,2e-06
1e-06,1e-06,1e-06,1e-06,2e-06,5e-06,4e-06,5e-06,7e-06,1.2e-05,9e-06,1e-05,8e-06,5e-06,4e-05,4e-05,2.4e-05,1.5e-05,9e-06,4e-06,3e-06,3e-06,1e-06,3e-06,4e-06,1e-06,3e-06,4e-06,2e-06,1e-06,1e-06,1e-06,2e-06,2e-06,1e-06,1e-06,3e-06,2e-06,1e-06,1e-06,1e-06,2e-06,4e-06,3e-06,1e-06,1e-06,1e-06,1e-06,2e-06,2e-06,1e-06,1e-06,1e-06,1e-06,1e-06,3e-06,1e-06,0,1e-06,0,1e-06,1e-06,2e-06,2e-06,1e-06,1e-06,2e-06,1e-06,1e-06,0,1e-06,1e-06,2e-06,2e-06,0,2e-06,1e-06,1e-06,1e-06,1e-06,2e-06,4e-06,5e-06,5e-06,4e-06,3e-06,2e-06,2e-06,1e-06,4e-06,2e-06,2e-06,2e-06,2e-06,1e-06,1e-06,3e-06,2e-06,1e-06,1e-06,1e-06,2e-06,1e-06,2e-06,0,1e-06,2e-06,1e-06,1e-06,1e-06,1e-06,0,1e-06,1e-06,1e-06,1e-06,2e-06,0,2e-06,2e-06,2e-06
2e-06,1e-06,1e-06,3e-06,3e-06,2e-06,4e-06,4e-06,8e-06,5e-06,7e-06,4e-06,9e-06,1.5e-05,5.5e-05,1.8e-05,1.1e-05,1.6e-05,1.2e-05,7e-06,2e-06,7e-06,2e-06,1e-06,2e-06,2e-06,2e-06,1e-06,2e-06,1e-06,2e-06,2e-06,0,2e-06,2e-06,2e-06,1e-06,2e-06,2e-06,2e-06,0,2e-06,2e-06,2e-06,1e-06,2e-06,2e-06,2e-06,1e-06,1e-06,2e-06,1e-06,0,1e-06,2e-06,1e-06,1e-06,0,2e-06,1e-06,0,2e-06,3e-06,2e-06,1e-06,0,1e-06,2e-06,3e-06,2e-06,0,0,2e-06,1e-06,1e-06,3e-06,3e-06,2e-06,0,1e-06,2e-06,1e-06,4e-06,1e-06,1e-06,3e-06,3e-06,2e-06,3e-06,3e-06,2e-06,1e-06,4e-06,3e-06,1e-06,2e-06,3e-06,3e-06,1e-06,1e-06,1e-06,2e-06,1e-06,2e-06,1e-06,1e-06,1e-06,1e-06,2e-06,2e-06,1e-06,0,2e-06,1e-06,0,1e-06,2e-06,1e-06,0,2e-06,3e-06
2e-06,2e-06,2e-06,2e-06,0,3e-06,3e-06,1e-06,2e-06,9e-06,4e-06,1.4e-05,7e-06,1.9e-05,4.2e-05,2.1e-05,8e-06,2.3e-05,1.7e-05,6e-06,9e-06,7e-06,5e-06,1e-06,3e-06,3e-06,3e-06,3e-06,1e-06,2e-06,3e-06,3e-06,3e-06,2e-06,1e-06,1e-06,0,1e-06,2e-06,3e-06,3e-06,2e-06,3e-06,3e-06,1e-06,3e-06,2e-06,1e-06,1e-06,1e-06,2e-06,2e-06,1e-06,1e-06,1e-06,2e-06,1e-06,1e-06,2e-06,2e-06,1e-06,2e-06,0,1e-06,2e-06,3e-06,2e-06,1e-06,2e-06,1e-06,1e-06,1e-06,2e-06,2e-06,1e-06,3e-06,1e-06,1e-06,1e-06,1e-06,2e-06,3e-06,5e-06,3e-06,1e-06,2e-06,3e-06,2e-06,3e-06,1e-06,4e-06,3e-06,2e-06,3e-06,5e-06,3e-06,1e-06,2e-06,1e-06,1e-06,1e-06,2e-06,1e-06,1e-06,1e-06,0,2e-06,2e-06,1e-06,1e-06,1e-06,0,1e-06,1e-06,1e-06,1e-06,2e-06,1e-06,2e-06,1e-06,2e-06
1e-06,3e-06,3e-06,3e-06,1e-06,4e-06,2e-06,1e-06,1e-06,8e-06,1.1e-05,1.1e-05,6e-06,1.1e-05,4.9e-05,4.2e-05,1.5e-05,2e-05,1.3e-05,9e-06,1.1e-05,9e-06,8e-06,6e-06,1e-06,4e-06,5e-06,4e-06,4e-06,0,1e-06,2e-06,2e-06,3e-06,1e-06,1e-06,1e-06,1e-06,2e-06,1e-06,1e-06,3e-06,1e-06,2e-06,2e-06,3e-06,2e-06,0,0,1e-06,1e-06,1e-06,1e-06,1e-06,1e-06,0,0,1e-06,1e-06,1e-06,0,2e-06,1e-06,2e-06,1e-06,1e-06,0,1e-06,1e-06,1e-06,2e-06,2e-06,3e-06,2e-06,1e-06,1e-06,3e-06,3e-06,2e-06,2e-06,2e-06,2e-06,4e-06,2e-06,1e-06,2e-06,3e-06,1e-06,4e-06,1e-06,3e-06,2e-06,4e-06,3e-06,3e-06,2e-06,0,0,1e-06,0,1e-06,1e-06,0,1e-06,0,0,2e-06,2e-06,2e-06,1e-06,2e-06,1e-06,1e-06,1e-06,1e-06,2e-06,3e-06,2e-06,2e-06,2e-06,2e-06
2e-06,3e-06,2e-06,2e-06,4e-06,0,1e-06,1e-06,2e-06,7e-06,1e-05,1.9e-05,7e-06,1e-05,4.5e-05,0.000105,7.2e-05,3.2e-05,1.4e-05,4e-06,6e-06,2e-06,6e-06,2e-06,4e-06,1e-06,5e-06,2e-06,5e-06,4e-06,4e-06,2e-06,2e-06,2e-06,3e-06,1e-06,1e-06,1e-06,2e-06,1e-06,1e-06,1e-06,3e-06,1e-06,1e-06,2e-06,3e-06,1e-06,0,0,1e-06,1e-06,0,0,0,2e-06,1e-06,1e-06,1e-06,1e-06,1e-06,1e-06,1e-06,1e-06,2e-06,1e-06,0,1e-06,1e-06,1e-06,1e-06,1e-06,1e-06,2e-06,0,0,1e-06,2e-06,1e-06,2e-06,0,2e-06,3e-06,2e-06,3e-06,5e-06,2e-06,1e-06,3e-06,3e-06,5e-06,5e-06,2e-06,3e-06,2e-06,2e-06,1e-06,1e-06,2e-06,1e-06,1e-06,1e-06,1e-06,2e-06,1e-06,1e-06,2e-06,1e-06,1e-06,1e-06,3e-06,2e-06,2e-06,3e-06,1e-06,2e-06,2e-06,1e-06,3e-06,2e-06,0
1e-06,2e-06,2e-06,2e-06,4e-06,2e-06,1e-06,4e-06,3e-06,3e-06,6e-06,1.8e-05,1.4e-05,1e-05,4.5e-05,0.000198,8.1e-05,3.2e-05,5e-06,8e-06,5e-06,1.2e-05,4e-06,4e-06,5e-06,3e-06,3e-06,3e-06,5e-06,3e-06,1e-06,2e-06,3e-06,2e-06,2e-06,1e-06,1e-06,2e-06,0,1e-06,1e-06,2e-06,2e-06,2e-06,1e-06,2e-06,1e-06,1e-06,0,1e-06,1e-06,1e-06,2e-06,1e-06,1e-06,2e-06,2e-06,1e-06,0,1e-06,0,1e-06,1e-06,1e-06,1e-06,0,1e-06,1e-06,1e-06,1e-06,1e-06,1e-06,2e-06,1e-06,2e-06,1e-06,1e-06,1e-06,3e-06,1e-06,2e-06,2e-06,2e-06,3e-06,4e-06,1e-06,4e-06,2e-06,2e-06,2e-06,2e-06,2e-06,5e-06,1e-06,2e-06,2e-06,3e-06,1e-06,3e-06,1e-06,2e-06,1e-06,1e-06,2e-06,1e-06,0,2e-06,1e-06,1e-06,1e-06,2e-06,1e-06,0,1e-06,1e-06,1e-06,1e-06,2e-06,2e-06,1e-06,0
2e-06,1e-06,1e-06,1e-06,4e-06,2e-06,0,3e-06,4e-06,2e-06,7e-06,3.7e-05,2e-05,1.3e-05,2.4e-05,0.000177,0.000117,3.6e-05,1.7e-05,1e-05,7e-06,8e-06,1.1e-05,1e-06,3e-06,4e-06,3e-06,3e-06,5e-06,4e-06,2e-06,4e-06,5e-06,5e-06,4e-06,3e-06,3e-06,4e-06,3e-06,4e-06,3e-06,4e-06,4e-06,4e-06,3e-06,3e-06,2e-06,2e-06,1e-06,2e-06,2e-06,3e-06,3e-06,3e-06,3e-06,2e-06,3e-06,2e-06,1e-06,2e-06,2e-06,1e-06,2e-06,2e-06,2e-06,1e-06,2e-06,2e-06,3e-06,2e-06,2e-06,2e-06,1e-06,3e-06,4e-06,4e-06,4e-06,1e-06,1e-06,1e-06,2e-06,1e-06,1e-06,3e-06,2e-06,2e-06,4e-06,3e-06,3e-06,1e-06,2e-06,3e-06,3e-06,4e-06,4e-06,2e-06,3e-06,3e-06,3e-06,2e-06,3e-06,3e-06,2e-06,4e-06,3e-06,2e-06,3e-06,3e-06,3e-06,4e-06,4e-06,2e-06,3e-06,2e-06,3e-06,2e-06,1e-06,1e-06,4e-06,4e-06,3e-06
3e-06,3e-06,2e-06,2e-06,4e-06,1e-06,3e-06,1e-06,6e-06,4e-06,6e-06,3.5e-05,1.4e-05,1.5e-05,1.9e-05,9.5e-05,3.7e-05,1.7e-05,2e-05,1.5e-05,6e-06,9e-06,4e-06,6e-06,5e-06,3e-06,1e-06,3e-06,3e-06,4e-06,4e-06,1e-06,2e-06,2e-06,3e-06,1e-06,1e-06,3e-06,3e-06,1e-06,1e-06,2e-06,1e-06,1e-06,1e-06,1e-06,1e-06,1e-06,1e-06,1e-06,1e-06,1e-06,2e-06,2e-06,2e-06,2e-06,1e-06,1e-06,1e-06,1e-06,2e-06,1e-06,2e-06,1e-06,1e-06,2e-06,2e-06,2e-06,1e-06,1e-06,1e-06,1e-06,1e-06,2e-06,3e-06,4e-06,1e-06,1e-06,1e-06,1e-06,1e-06,2e-06,0,1e-06,2e-06,1e-06,3e-06,2e-06,2e-06,0,2e-06,2e-06,2e-06,1e-06,3e-06,4e-06,1e-06,2e-06,1e-06,2e-06,1e-06,1e-06,1e-06,3e-06,2e-06,1e-06,1e-06,2e-06,2e-06,2e-06,4e-06,2e-06,2e-06,2e-06,1e-06,2e-06,1e-06,1e-06,3e-06,1e-06,0
3e-06,1e-06,2e-06,2e-06,3e-06,4e-06,6e-06,4e-06,8e-06,2e-06,5e-06,2.3e-05,1.8e-05,1.8e-05,2.1e-05,2.8e-05,1e-05,3.6e-05,2.4e-05,1.5e-05,6e-06,1e-05,8e-06,9e-06,3e-06,2e-06,2e-06,1e-06,3e-06,1e-06,2e-06,2e-06,1e-06,3e-06,0,2e-06,2e-06,4e-06,1e-06,0,0,1e-06,3e-06,1e-06,1e-06,2e-06,0,1e-06,0,1e-06,1e-06,2e-06,2e-06,2e-06,2e-06,3e-06,2e-06,1e-06,1e-06,2e-06,1e-06,1e-06,1e-06,2e-06,1e-06,2e-06,2e-06,1e-06,1e-06,1e-06,1e-06,1e-06,2e-06,1e-06,1e-06,2e-06,1e-06,1e-06,1e-06,1e-06,0,2e-06,2e-06,1e-06,1e-06,0,2e-06,1e-06,2e-06,1e-06,1e-06,3e-06,4e-06,1e-06,2e-06,1e-06,1e-06,1e-06,1e-06,1e-06,1e-06,1e-06,1e-06,0,2e-06,1e-06,1e-06,2e-06,1e-06,3e-06,2e-06,2e-06,1e-06,1e-06,1e-06,2e-06,1e-06,0,2e-06,2e-06,1e-06
2e-06,1e-06,2e-06,2e-06,2e-06,3e-06,2e-06,2e-06,5e-06,9e-06,6e-06,1.2e-05,1.6e-05,6e-06,9e-06,3.5e-05,2.3e-05,2.2e-05,1.5e-05,2e-06,1e-05,1.7e-05,7e-06,6e-06,3e-06,1e-06,1e-06,0,1e-06,1e-06,2e-06,1e-06,2e-06,3e-06,1e-06,2e-06,2e-06,3e-06,1e-06,2e-06,2e-06,1e-06,4e-06,1e-06,1e-06,2e-06,2e-06,1e-06,0,1e-06,1e-06,2e-06,1e-06,1e-06,1e-06,1e-06,1e-06,1e-06,1e-06,0,1e-06,2e-06,1e-06,2e-06,2e-06,2e-06,2e-06,2e-06,1e-06,0,1e-06,1e-06,2e-06,1e-06,2e-06,2e-06,1e-06,0,1e-06,1e-06,1e-06,2e-06,1e-06,3e-06,1e-06,1e-06,2e-06,2e-06,1e-06,2e-06,3e-06,3e-06,2e-06,1e-06,1e-06,1e-06,1e-06,1e-06,0,0,2e-06,2e-06,1e-06,2e-06,3e-06,2e-06,2e-06,0,1e-06,2e-06,0,1e-06,1e-06,0,1e-06,1e-06,1e-06,1e-06,1e-06,0,1e-06
1e-06,0,1e-06,2e-06,0,3e-06,0,1e-06,5e-06,6e-06,1e-06,5e-06,1.2e-05,1.5e-05,2.1e-05,3.5e-05,2.2e-05,1e-06,6e-06,3e-06,9e-06,1.2e-05,1e-05,6e-06,1e-06,3e-06,1e-06,1e-06,2e-06,1e-06,1e-06,2e-06,2e-06,1e-06,1e-06,1e-06,0,1e-06,1e-06,1e-06,1e-06,0,3e-06,1e-06,1e-06,0,1e-06,1e-06,0,1e-06,1e-06,1e-06,2e-06,1e-06,0,2e-06,1e-06,1e-06,0,1e-06,1e-06,1e-06,0,1e-06,2e-06,1e-06,1e-06,1e-06,1e-06,1e-06,0,0,2e-06,1e-06,1e-06,2e-06,0,0,0,1e-06,1e-06,2e-06,1e-06,2e-06,0,1e-06,1e-06,1e-06,1e-06,2e-06,1e-06,1e-06,3e-06,1e-06,1e-06,2e-06,1e-06,2e-06,1e-06,2e-06,1e-06,1e-06,2e-06,1e-06,1e-06,1e-06,2e-06,1e-06,0,2e-06,1e-06,0,2e-06,1e-06,1e-06,0,0,1e-06,0,1e-06,1e-06
0,1e-06,2e-06,1e-06,0,2e-06,0,2e-06,1e-06,5e-06,2e-06,5e-06,4e-06,2e-06,1e-05,1.1e-05,9e-06,1e-05,1.5e-05,9e-06,8e-06,5e-06,3e-06,1e-06,2e-06,2e-06,1e-06,1e-06,1e-06,1e-06,2e-06,1e-06,0,1e-06,1e-06,1e-06,1e-06,2e-06,1e-06,1e-06,0,0,2e-06,1e-06,1e-06,1e-06,1e-06,0,0,0,0,0,1e-06,1e-06,0,2e-06,0,0,0,1e-06,1e-06,0,0,0,1e-06,1e-06,1e-06,1e-06,0,1e-06,1e-06,0,2e-06,1e-06,1e-06,1e-06,0,0,0,1e-06,0,1e-06,0,2e-06,0,1e-06,1e-06,0,1e-06,2e-06,2e-06,1e-06,3e-06,1e-06,2e-06,1e-06,0,2e-06,1e-06,1e-06,1e-06,1e-06,1e-06,1e-06,1e-06,0,1e-06,1e-06,1e-06,2e-06,1e-06,1e-06,2e-06,0,1e-06,0,1e-06,1e-06,1e-06,0,1e-06
1e-06,1e-06,1e-06,1e-06,0,2e-06,0,1e-06,1e-06,5e-06,2e-06,2e-06,5e-06,2e-06,1.4e-05,2e-06,1.7e-05,9e-06,5e-06,4e-06,2e-06,2e-06,2e-06,1e-06,1e-06,2e-06,1e-06,0,1e-06,1e-06,1e-06,0,0,0,1e-06,0,1e-06,2e-06,1e-06,1e-06,0,0,2e-06,0,1e-06,1e-06,1e-06,0,0,0,0,0,1e-06,0,0,2e-06,0,0,0,1e-06,1e-06,0,0,0,1e-06,1e-06,1e-06,0,0,0,1e-06,0,2e-06,1e-06,1e-06,1e-06,0,0,0,0,0,1e-06,1e-06,2e-06,0,1e-06,1e-06,0,1e-06,1e-06,1e-06,1e-06,3e-06,0,1e-06,1e-06,0,1e-06,1e-06,1e-06,1e-06,0,2e-06,0,1e-06,1e-06,1e-06,0,0,2e-06,0,1e-06,1e-06,1e-06,0,0,0,0,0,1e-06,1e-06
1e-06,1e-06,1e-06,1e-06,0,1e-06,0,1e-06,0,5e-06,2e-06,3e-06,2e-06,3e-06,1.5e-05,3e-06,1.6e-05,4e-06,6e-06,1e-06,1e-06,2e-06,0,0,0,1e-06,1e-06,0,1e-06,1e-06,2e-06,0,0,0,0,1e-06,1e-06,2e-06,1e-06,1e-06,0,0,2e-06,1e-06,1e-06,1e-06,1e-06,0,0,0,0,0,1e-06,0,0,1e-06,0,0,0,0,1e-06,0,0,0,1e-06,1e-06,0,0,0,0,1e-06,0,2e-06,0,1e-06,1e-06,0,0,0,0,0,1e-06,1e-06,2e-06,0,1e-06,2e-06,1e-06,1e-06,1e-06,1e-06,0,2e-06,0,1e-06,1e-06,0,1e-06,1e-06,1e-06,1e-06,0,1e-06,0,1e-06,0,1e-06,0,0,2e-06,0,0,1e-06,0,0,0,0,0,0,1e-06,1e-06
