0.035286,0.032044,0.029086,0.112232,0.309255,0.475807,0.604777,0.647578,0.681236,0.750163,0.854477,1.089483,0.988716,0.495483,0.186919,0.143082,0.123255,0.139259,0.213261,0.214432,0.233775,0.391208,0.34314,0.139671,0.072708,0.044653,0.031073,0.027678
0.043437,0.039665,0.036316,0.129274,0.351734,0.537185,0.674934,0.719586,0.764241,0.864099,0.998692,1.266131,1.145352,0.5736,0.215945,0.166643,0.147965,0.166626,0.256386,0.257095,0.269506,0.445211,0.390703,0.162852,0.088189,0.054363,0.03806,0.033381
0.055265,0.051328,0.047756,0.152281,0.405489,0.605539,0.743429,0.806982,0.890948,1.068232,1.256055,1.516871,1.33053,0.662683,0.254809,0.199374,0.185511,0.209364,0.32824,0.326074,0.314017,0.508922,0.448075,0.194251,0.112007,0.069643,0.049034,0.042157
0.059609,0.057182,0.054399,0.164053,0.423288,0.589857,0.696296,0.845178,1.03009,1.299438,1.499552,1.611825,1.303821,0.637243,0.264776,0.211307,0.203597,0.231329,0.376422,0.367702,0.315428,0.507445,0.44925,0.199929,0.122677,0.078368,0.055243,0.046429
0.05853,0.05882,0.057464,0.183309,0.458568,0.561331,0.605855,0.890149,1.23601,1.575052,1.716347,1.604629,1.150074,0.540499,0.254532,0.202463,0.197484,0.232047,0.393438,0.375227,0.299447,0.483738,0.421763,0.184639,0.119264,0.081359,0.056601,0.046165
0.060886,0.062679,0.06237,0.209286,0.532624,0.62849,0.635545,1.049739,1.576151,1.942409,1.940271,1.582584,1.020424,0.482743,0.248636,0.183344,0.176348,0.224857,0.386302,0.364536,0.305983,0.483899,0.404296,0.169484,0.112499,0.084229,0.059208,0.048236
0.067614,0.070157,0.071909,0.241887,0.677033,0.850807,0.873018,1.536921,2.375962,2.710686,2.439596,1.839062,1.172916,0.604563,0.311905,0.189898,0.166764,0.233384,0.38607,0.365115,0.328417,0.481233,0.390267,0.172323,0.11806,0.089502,0.065582,0.055896
0.07823,0.078288,0.082241,0.284598,0.89215,1.182454,1.261885,2.468535,3.929779,4.300682,3.728053,2.839813,1.888479,1.034801,0.527581,0.263142,0.201235,0.297022,0.476769,0.445219,0.382286,0.503247,0.404093,0.197168,0.137933,0.100853,0.077248,0.068666
0.098407,0.092933,0.094144,0.3458,1.165215,1.563066,1.752754,3.906836,6.294527,6.750879,5.946854,4.637704,3.106075,1.75091,0.905827,0.414303,0.291384,0.409974,0.649365,0.601339,0.470965,0.577084,0.468327,0.244617,0.17204,0.123573,0.097016,0.088205
0.121582,0.109002,0.103485,0.39379,1.38854,1.857306,2.24983,5.843063,9.387762,9.771803,8.817003,6.973962,4.604245,2.663689,1.421229,0.634142,0.427397,0.548318,0.81611,0.741667,0.550347,0.646883,0.5292,0.296836,0.219711,0.157578,0.119898,0.107429
0.130864,0.114435,0.108654,0.421345,1.491558,1.984844,2.661423,7.979585,12.900548,12.895512,11.562115,9.203234,5.99364,3.528759,1.931856,0.864471,0.572382,0.680033,0.924111,0.828035,0.609891,0.694895,0.570037,0.346355,0.273207,0.192929,0.136827,0.114387
0.122945,0.107137,0.108722,0.414326,1.44133,1.981993,2.996817,9.495097,15.469246,14.829861,12.786916,10.262741,6.600752,3.84219,2.156303,0.993588,0.651466,0.751376,0.972286,0.90209,0.694373,0.735487,0.584902,0.374645,0.31261,0.215629,0.1398,0.10592
0.109077,0.094627,0.104803,0.393683,1.289614,1.793965,2.971483,9.214705,14.88135,13.647812,11.138892,9.089152,5.799761,3.238046,1.861872,0.906097,0.598303,0.704395,0.916666,0.89812,0.73086,0.719606,0.550717,0.36226,0.319217,0.220398,0.129906,0.089962
0.090222,0.079101,0.08813,0.375335,1.161634,1.555087,2.494061,6.888425,10.802016,9.630714,7.430596,6.098325,3.889787,2.076602,1.229596,0.645278,0.441737,0.554249,0.770314,0.787293,0.671699,0.670306,0.512855,0.333439,0.301935,0.200754,0.104789,0.072624
0.06891,0.059977,0.061896,0.381565,1.232209,1.591178,2.042934,4.301887,6.129218,5.457595,4.088047,3.114224,1.973535,1.058154,0.646211,0.39311,0.294408,0.412663,0.718557,0.738323,0.575726,0.644509,0.535661,0.362834,0.313313,0.172666,0.074707,0.054554
0.063506,0.054505,0.051686,0.474874,1.603805,2.025843,1.942455,2.899745,3.461159,3.12736,2.590457,1.730197,0.973132,0.543057,0.352447,0.305666,0.271295,0.379138,0.837938,0.843576,0.560046,0.713327,0.649911,0.497166,0.414394,0.184209,0.068042,0.051579
0.086714,0.075674,0.070278,0.683319,2.240162,2.72195,2.118425,2.48327,2.753461,2.766307,2.787659,1.874216,0.896994,0.505001,0.358831,0.367324,0.361138,0.475289,1.097455,1.084252,0.658085,0.843792,0.815497,0.740221,0.617973,0.247791,0.091555,0.068023
0.119904,0.102686,0.099457,0.919949,2.944016,3.546076,2.468651,2.448853,2.834792,3.260685,3.658486,2.568507,1.184463,0.680047,0.504768,0.531849,0.527641,0.654282,1.423534,1.37863,0.814966,1.006906,1.025239,1.075283,0.918584,0.359986,0.129469,0.096203
0.151267,0.129122,0.137149,1.057299,3.32421,4.172894,2.866135,2.48487,3.110888,4.029882,4.696208,3.375484,1.593132,0.955603,0.729768,0.74553,0.712526,0.833607,1.667543,1.560133,0.945786,1.212858,1.279096,1.41702,1.233592,0.492695,0.175764,0.131188
0.18378,0.163849,0.186195,1.018232,3.152026,4.316116,3.119101,2.498771,3.455168,4.715487,5.429207,4.217974,2.276976,1.34163,0.985165,0.941161,0.856011,0.946277,1.729041,1.566122,1.036929,1.392873,1.465637,1.631078,1.433186,0.590718,0.217266,0.163524
0.22186,0.201361,0.23205,0.842935,2.48189,3.785887,3.152618,2.810061,3.959993,5.12269,5.628324,4.898331,3.153778,1.746645,1.168618,1.036579,0.901333,0.974341,1.687987,1.5533,1.13317,1.477774,1.531145,1.653851,1.437317,0.617763,0.246411,0.185083
0.255647,0.230981,0.258466,0.64177,1.636145,2.760112,2.870016,3.241747,4.296138,4.979219,5.194713,5.024245,3.721461,1.909221,1.139904,0.952152,0.812599,0.905574,1.49931,1.458942,1.192005,1.395143,1.378937,1.455915,1.263448,0.587607,0.268337,0.201686
0.262393,0.2314,0.244683,0.465393,0.995336,1.886622,2.642823,3.658308,4.192888,4.254759,4.357393,4.45218,3.513727,1.658642,0.885059,0.720534,0.648222,0.751281,1.122577,1.19838,1.119539,1.120141,1.030694,1.128339,1.027346,0.545464,0.28178,0.211624
0.244591,0.201789,0.203742,0.333567,0.650865,1.364453,2.431874,3.621308,3.560132,3.36265,3.61873,3.57808,2.675065,1.146348,0.594924,0.511538,0.494848,0.576435,0.756361,0.894853,0.93136,0.820227,0.701471,0.77354,0.765832,0.479876,0.257109,0.194919
0.213882,0.16797,0.163929,0.24268,0.453528,1.005724,2.084011,3.057187,2.740384,2.622173,3.043561,2.896408,1.93209,0.715583,0.366234,0.353998,0.361746,0.472322,0.608515,0.742781,0.760446,0.613244,0.529105,0.53636,0.520842,0.362187,0.199156,0.159755
0.190292,0.156325,0.139835,0.22495,0.416552,0.82057,1.669396,2.36939,2.155318,2.027748,2.357288,2.37632,1.576329,0.562327,0.273711,0.280142,0.268078,0.374323,0.560906,0.730814,0.721563,0.554208,0.449189,0.402218,0.37404,0.265126,0.15517,0.141662
0.173021,0.157308,0.143291,0.240441,0.443559,0.727453,1.347269,2.171479,2.234949,1.798728,1.75091,1.866613,1.311056,0.500862,0.269384,0.256185,0.227978,0.305289,0.534947,0.731623,0.711548,0.569774,0.43815,0.352162,0.301974,0.19642,0.129582,0.13841
0.184765,0.166391,0.144645,0.248557,0.454781,0.665665,1.211433,2.292089,2.529656,1.757816,1.383332,1.48547,1.17207,0.546809,0.282305,0.225314,0.216412,0.278616,0.520888,0.725252,0.707723,0.5804,0.437553,0.354171,0.288349,0.182739,0.1389,0.149589
0.195754,0.167071,0.142059,0.247503,0.448946,0.608263,1.212344,2.446716,2.551427,1.483512,1.021723,1.123254,1.037857,0.628937,0.311028,0.224364,0.237386,0.296795,0.529208,0.708154,0.701876,0.629983,0.464324,0.371162,0.308974,0.200882,0.169909,0.17195
0.184805,0.156825,0.135997,0.244758,0.427505,0.501266,1.173792,2.489586,2.327218,1.121902,0.774141,0.828809,0.833784,0.612643,0.32773,0.25042,0.26557,0.326489,0.518416,0.653792,0.664928,0.645683,0.486534,0.39584,0.342762,0.228179,0.198924,0.193923
0.15581,0.141392,0.130437,0.21887,0.371614,0.399705,1.104457,2.573679,2.34052,1.0861,0.789075,0.718244,0.637659,0.474674,0.287906,0.236861,0.244935,0.318353,0.477756,0.595287,0.644254,0.658523,0.472697,0.37013,0.355497,0.239893,0.194659,0.181179
0.103923,0.109062,0.115199,0.170595,0.289239,0.336485,1.065401,2.467939,2.191732,1.105546,0.896621,0.721155,0.498006,0.349798,0.230853,0.183828,0.18826,0.28396,0.473233,0.590755,0.630744,0.664888,0.440512,0.322029,0.356927,0.232108,0.158974,0.138241
0.058381,0.079668,0.097607,0.140672,0.265878,0.328375,0.987308,2.071326,1.790634,1.120314,1.060865,0.844829,0.563551,0.39816,0.231489,0.142951,0.149453,0.239626,0.422422,0.519646,0.533588,0.61679,0.430628,0.290191,0.319257,0.199384,0.13036,0.108215
0.047751,0.060915,0.077417,0.139832,0.286146,0.355539,0.869911,1.680876,1.605655,1.233184,1.143649,0.941636,0.690178,0.502554,0.255307,0.116661,0.132958,0.231459,0.361425,0.396271,0.390568,0.514549,0.402286,0.250642,0.234373,0.134753,0.090968,0.086809
0.051593,0.055426,0.060926,0.133719,0.278793,0.351761,0.832173,1.632041,1.667521,1.243012,1.05238,0.897155,0.710376,0.534296,0.260383,0.099174,0.113196,0.204556,0.320009,0.335428,0.333644,0.441791,0.350342,0.213972,0.163833,0.072818,0.053927,0.068279
0.06719,0.059846,0.056697,0.127709,0.236951,0.337541,0.900372,1.84162,1.802364,1.157813,0.979266,0.805797,0.593803,0.452003,0.236688,0.096743,0.095767,0.153092,0.255024,0.27447,0.287096,0.368438,0.294566,0.18917,0.136988,0.055286,0.047365,0.067742
0.09061,0.063432,0.056008,0.130537,0.191044,0.308964,0.875311,1.868804,1.769088,1.042122,0.958304,0.705776,0.424814,0.305058,0.177925,0.090604,0.089359,0.122751,0.21677,0.258019,0.300793,0.378879,0.292759,0.179608,0.134592,0.069946,0.061564,0.084795
0.108483,0.065304,0.062577,0.130862,0.167615,0.287411,0.707856,1.578385,1.612684,0.984024,0.814714,0.540069,0.33963,0.227277,0.125606,0.087885,0.082524,0.122549,0.200451,0.264575,0.386725,0.47115,0.32353,0.176746,0.128996,0.081772,0.071572,0.097228
0.111972,0.066532,0.068871,0.116944,0.136399,0.244421,0.534632,1.141738,1.274738,0.841533,0.574585,0.366957,0.287097,0.225691,0.108309,0.081438,0.071029,0.129535,0.202232,0.285567,0.462671,0.542183,0.340204,0.164573,0.108661,0.081591,0.070609,0.096164
0.099118,0.066704,0.068718,0.094337,0.102221,0.194033,0.472852,0.785099,0.845577,0.596522,0.362393,0.288659,0.244712,0.218124,0.109287,0.080286,0.066717,0.1207,0.213295,0.321791,0.471632,0.546626,0.358691,0.168366,0.093839,0.071247,0.065791,0.084426
