-1.7e-05,8e-06,1.8e-05,-0.000139,-0.000365,-0.000292,-0.000288,-0.000283,-0.000177,-9.2e-05,-0.000102,-0.00016,-7.8e-05,-7e-05,-8e-05,-0.000141,-0.000154,-4e-05,-2.1e-05,-3.2e-05,-3.9e-05,-3.5e-05,-6.9e-05,-0.00011,-4.4e-05,-3.6e-05,-4.1e-05,-8.4e-05
4.1e-05,9e-06,3e-06,5.8e-05,0.000133,8.8e-05,9.2e-05,9.9e-05,6.7e-05,7.4e-05,7.4e-05,8e-05,1.7e-05,-7e-06,1.4e-05,5.2e-05,6.7e-05,1.9e-05,6e-06,1.5e-05,2.3e-05,2e-05,3.4e-05,4.8e-05,2e-06,0,2e-06,-4.3e-05
-3.1e-05,-7.1e-05,-5.2e-05,7.2e-05,0.00021,0.000155,0.000144,0.000156,8.7e-05,3.8e-05,4.7e-05,9.7e-05,1.1e-05,-2.8e-05,1.3e-05,9.3e-05,0.000105,8e-06,-3e-06,-3e-06,1.6e-05,-4e-06,1.7e-05,3.4e-05,-1.6e-05,-4e-06,-5e-06,0
-0.000266,-0.000239,-0.000153,-0.000162,-0.000304,-0.000252,-0.000269,-0.000287,-0.000239,-0.000274,-0.000277,-0.000185,-0.00012,-0.00016,-0.000135,-0.000128,-0.000161,-9.7e-05,-5.4e-05,-9.9e-05,-8.6e-05,-0.000123,-0.000161,-0.000185,-6e-05,-4.4e-05,-5.6e-05,-4e-06
-0.000229,-0.000205,-0.000132,-8.9e-05,-0.00014,-0.000129,-0.000129,-0.000185,-0.000175,-0.000227,-0.000237,-0.00011,-5.8e-05,-8.7e-05,-9.2e-05,-9.8e-05,-0.000124,-6.8e-05,-3.1e-05,-6.5e-05,-5.9e-05,-8.7e-05,-0.000126,-0.000136,-2.6e-05,-2.3e-05,-2.8e-05,1.7e-05
-5.3e-05,-6.7e-05,-4.5e-05,0.000112,0.000305,0.000234,0.000233,0.000208,0.000116,1.6e-05,2.7e-05,0.000136,5e-05,5e-05,5e-05,0.000114,0.000128,2.1e-05,9e-06,2.3e-05,3.1e-05,2.1e-05,3.8e-05,7.2e-05,2.2e-05,1e-05,-1e-06,8e-06
-0.000104,-6.8e-05,-4.2e-05,-2e-05,-3.6e-05,-2.1e-05,-3.3e-05,-9e-06,-1.2e-05,-9.6e-05,-6.3e-05,-9e-06,-4.6e-05,-1.6e-05,-6e-06,3.1e-05,2.9e-05,-2.4e-05,-2.4e-05,-1.7e-05,-1.6e-05,-2.4e-05,-7e-06,1.5e-05,2e-06,-1.7e-05,-4.4e-05,-5.6e-05
-0.000115,-3.4e-05,-3.1e-05,-0.000123,-0.000314,-0.000263,-0.000262,-0.00025,-0.000172,-0.000194,-0.000174,-0.000151,-8.1e-05,-4.2e-05,-5.9e-05,-0.000124,-0.000153,-6.1e-05,-3.2e-05,-4.4e-05,-6.5e-05,-6.2e-05,-7.1e-05,-0.000103,-3.8e-05,-4.4e-05,-4e-05,-3.7e-05
0.000123,0.000145,6.3e-05,8.6e-05,0.000164,0.000102,1e-04,0.000105,9e-05,9.3e-05,9.9e-05,7.8e-05,8e-05,0.000116,8.6e-05,2.7e-05,3.1e-05,3.5e-05,2.7e-05,4.8e-05,2.2e-05,4.5e-05,7.6e-05,7.1e-05,1.2e-05,6e-06,3.9e-05,6.7e-05
0.000222,0.000201,1e-04,0.000136,0.000297,0.000256,0.00023,0.000269,0.000235,0.000253,0.000258,0.000156,0.00011,0.000143,0.000142,0.000144,0.000176,7.7e-05,3.3e-05,7.5e-05,5.9e-05,8.2e-05,0.000147,0.00019,5.9e-05,3.8e-05,5.7e-05,7.2e-05
7.1e-05,8e-05,3.5e-05,-7.6e-05,-0.000208,-0.00012,-0.00011,-7.5e-05,-1.2e-05,5.7e-05,4.8e-05,-8.3e-05,-2.3e-05,-1e-05,0,-3.3e-05,-2.5e-05,6e-06,-1e-05,-7e-06,-2.2e-05,-5e-06,9e-06,-9e-06,-7e-06,-8e-06,-5e-06,-2.8e-05
5.5e-05,4.1e-05,1.2e-05,-6.4e-05,-0.000199,-0.000168,-0.000101,-0.000115,-8.6e-05,3.3e-05,3e-06,-8.1e-05,-1.8e-05,-3.8e-05,-4.4e-05,-9.8e-05,-0.000101,0,1e-06,-7e-06,-2.1e-05,3e-06,-2.6e-05,-7.7e-05,-2.8e-05,-1.9e-05,-1.8e-05,-6.1e-05
0.000147,6.3e-05,3.8e-05,9.8e-05,0.000223,0.000149,0.000179,0.000165,0.000104,2e-04,0.000174,0.000122,5.6e-05,2.1e-05,2.8e-05,6.6e-05,8.8e-05,4.9e-05,2.7e-05,4.6e-05,5.5e-05,7.6e-05,6.7e-05,8.4e-05,3.6e-05,3.1e-05,2e-05,1e-06
2.8e-05,-4.1e-05,0,7e-06,6.4e-05,7e-05,3.7e-05,5.8e-05,4.9e-05,8e-05,6.4e-05,3.4e-05,-1.2e-05,-4.4e-05,-2e-05,5e-05,6.6e-05,7e-06,-8e-06,-6e-06,2.3e-05,2.1e-05,4e-06,2e-05,2e-05,4e-05,2e-05,3.7e-05
-0.000131,-0.000138,-4.7e-05,-0.000116,-0.000235,-0.000176,-0.000189,-0.000191,-0.00015,-0.00015,-0.000177,-0.000134,-6.3e-05,-9.1e-05,-9.6e-05,-0.000111,-0.00013,-5.3e-05,-2.7e-05,-6.2e-05,-4.3e-05,-5.7e-05,-0.000117,-0.000164,-3.5e-05,1.4e-05,6e-06,2.4e-05
-6.9e-05,-8.2e-05,-1.4e-05,1.6e-05,4.9e-05,1.4e-05,2.1e-05,-3.3e-05,-7e-05,-7.9e-05,-9.5e-05,-4e-06,1.1e-05,-2e-06,-2.5e-05,-4e-05,-6.1e-05,-1.7e-05,9e-06,-6e-06,5e-06,-1.4e-05,-5.4e-05,-7.1e-05,-1.1e-05,1.2e-05,1.5e-05,0
-2e-05,-3.5e-05,1.4e-05,8.9e-05,0.000224,0.000193,0.000172,0.000127,6.9e-05,1.2e-05,4.2e-05,0.000104,1.4e-05,2.4e-05,3.7e-05,0.000105,0.000105,1.5e-05,1.2e-05,2.4e-05,4.2e-05,9e-06,3.1e-05,6.6e-05,8e-06,8e-06,-6e-06,-3.8e-05
-0.000121,-6.4e-05,-1.7e-05,-4.3e-05,-0.000105,-5e-05,-6.3e-05,-4.8e-05,-2.2e-05,-0.000135,-8.4e-05,-4.3e-05,-6.3e-05,-4e-05,-1.7e-05,1.5e-05,9e-06,-2.3e-05,-1.7e-05,-3.4e-05,-2.2e-05,-5.6e-05,-3.1e-05,-3.2e-05,-3.6e-05,-2.7e-05,-3.3e-05,-4.7e-05
-0.000104,-1.1e-05,-1.8e-05,-4.9e-05,-0.000149,-0.000155,-0.000141,-0.000122,-8.6e-05,-0.000169,-0.000145,-8.3e-05,-2.6e-05,-5e-06,-1.8e-05,-8.4e-05,-0.000102,-2.8e-05,-4e-06,-3.1e-05,-4.3e-05,-5e-05,-4.4e-05,-6.8e-05,-3.7e-05,-4.3e-05,-1.2e-05,6e-06
