0.004884,0.005026,0.005106,0.004901,0.004712,0.004772,0.004539,0.004445,0.005023,0.004868,0.004433,0.004863,0.005303,0.005183,0.004839,0.005025,0.005299,0.005345,0.005092,0.004496,0.004463,0.004931,0.005411,0.00475,0.004303,0.004729,0.004617,0.004158
0.005956,0.006181,0.006124,0.005835,0.005735,0.0058,0.005537,0.005431,0.006052,0.005902,0.005446,0.006,0.006532,0.006354,0.005959,0.006179,0.006502,0.006454,0.006126,0.005524,0.005506,0.005987,0.006506,0.00575,0.005259,0.005784,0.005664,0.00511
0.007702,0.008047,0.007742,0.007262,0.007339,0.007412,0.00707,0.006982,0.007655,0.00759,0.007169,0.007867,0.008494,0.008217,0.007754,0.007974,0.008379,0.00815,0.007722,0.00726,0.007291,0.007719,0.008186,0.007307,0.006789,0.007395,0.007305,0.006681
0.008875,0.00932,0.008936,0.008209,0.008339,0.008363,0.007896,0.007905,0.008648,0.008792,0.008435,0.009051,0.009625,0.00919,0.008682,0.008833,0.009305,0.008997,0.008612,0.008479,0.008582,0.008876,0.009039,0.008189,0.007731,0.008122,0.008132,0.007637
0.009293,0.009789,0.009681,0.008762,0.008809,0.008817,0.008127,0.008261,0.009192,0.00951,0.009179,0.009448,0.00968,0.009046,0.00862,0.00868,0.009149,0.009005,0.008722,0.008693,0.008795,0.009077,0.008938,0.008201,0.007672,0.007688,0.007973,0.007793
0.009404,0.009999,0.010225,0.009414,0.009461,0.00959,0.008503,0.00845,0.009504,0.009795,0.009507,0.009349,0.009131,0.008664,0.00856,0.008714,0.009272,0.009051,0.008633,0.008462,0.008347,0.00882,0.008833,0.008167,0.007288,0.007115,0.007915,0.008065
0.009692,0.010134,0.010392,0.0102,0.010388,0.01074,0.009468,0.008511,0.0093,0.009899,0.009852,0.009212,0.008771,0.008901,0.009254,0.009712,0.010504,0.010071,0.009482,0.009075,0.008444,0.009191,0.009737,0.009084,0.007803,0.007415,0.008522,0.008952
0.01092,0.010728,0.010498,0.011027,0.011539,0.012482,0.01157,0.009373,0.009415,0.010404,0.010774,0.009895,0.009646,0.010378,0.010972,0.01171,0.012467,0.011757,0.011262,0.010892,0.009757,0.01076,0.011783,0.011004,0.009605,0.008843,0.009718,0.01017
0.01262,0.01185,0.011386,0.012408,0.013188,0.014577,0.014281,0.011548,0.010747,0.011552,0.012193,0.011513,0.011617,0.012407,0.012689,0.013579,0.014072,0.013394,0.013394,0.012982,0.011654,0.013064,0.014326,0.013432,0.012327,0.01112,0.011214,0.011394
0.014167,0.013053,0.012728,0.0142,0.015245,0.016444,0.016301,0.013861,0.012723,0.012839,0.01335,0.013262,0.013819,0.014244,0.013773,0.014726,0.015016,0.014525,0.015218,0.014916,0.013439,0.014682,0.0157,0.014986,0.01479,0.013563,0.012897,0.012926
0.015088,0.014046,0.013987,0.015605,0.016692,0.016855,0.016279,0.015027,0.014168,0.01316,0.013496,0.014562,0.015521,0.015588,0.014622,0.015094,0.014829,0.014843,0.016397,0.0167,0.014961,0.014505,0.014664,0.014703,0.015808,0.014986,0.013673,0.013677
0.014779,0.014158,0.014257,0.015493,0.016525,0.01587,0.014939,0.015028,0.014807,0.012979,0.013195,0.015039,0.015986,0.016186,0.015439,0.014833,0.013735,0.01435,0.016243,0.017735,0.016504,0.013787,0.012857,0.01351,0.015577,0.01569,0.013692,0.013403
0.013913,0.013722,0.014216,0.014803,0.015643,0.015061,0.01435,0.015196,0.015275,0.013509,0.01366,0.015117,0.015562,0.016236,0.016068,0.014379,0.012724,0.013768,0.015721,0.018355,0.017631,0.013731,0.0123,0.012579,0.014522,0.015518,0.013167,0.012388
0.01363,0.013217,0.013661,0.013947,0.01422,0.013736,0.014246,0.015955,0.015774,0.014386,0.014412,0.015088,0.015302,0.0161,0.016099,0.014114,0.012583,0.013295,0.015061,0.017962,0.016892,0.013032,0.011662,0.011458,0.0133,0.014771,0.012499,0.01158
0.013854,0.013466,0.013809,0.013572,0.013032,0.013218,0.015042,0.016817,0.01581,0.014692,0.014454,0.014525,0.014745,0.015063,0.015246,0.014141,0.013369,0.01409,0.015229,0.016402,0.014891,0.012406,0.011556,0.011207,0.013,0.014477,0.012667,0.011858
0.016149,0.016194,0.016406,0.01474,0.013751,0.014385,0.016184,0.017923,0.01734,0.015846,0.01481,0.015925,0.017429,0.016469,0.015299,0.014997,0.015718,0.016499,0.016633,0.016985,0.015738,0.01364,0.012873,0.012905,0.014807,0.015789,0.014337,0.013781
0.02045,0.021626,0.022116,0.018283,0.016539,0.017065,0.018117,0.019625,0.020629,0.019375,0.01705,0.019541,0.022865,0.020609,0.017662,0.017356,0.019546,0.020276,0.018943,0.020399,0.020545,0.017222,0.015643,0.01616,0.019129,0.019959,0.018067,0.018291
0.026716,0.028998,0.030236,0.02388,0.019904,0.020924,0.022577,0.023091,0.024988,0.025484,0.022559,0.024454,0.027876,0.024835,0.021451,0.020791,0.023432,0.025057,0.023548,0.026241,0.027111,0.021994,0.019392,0.020055,0.023902,0.02469,0.021947,0.02379
0.033986,0.036967,0.040102,0.0313,0.022589,0.024091,0.027621,0.027319,0.029727,0.033016,0.029785,0.027998,0.029931,0.027475,0.025192,0.02457,0.025486,0.026954,0.027448,0.03258,0.033619,0.026665,0.022883,0.023348,0.027119,0.02833,0.024979,0.028849
0.038211,0.041768,0.0476,0.037919,0.025373,0.027123,0.031393,0.03067,0.035046,0.041197,0.036562,0.029533,0.030859,0.030966,0.028801,0.029098,0.028225,0.02641,0.028735,0.037121,0.038011,0.029374,0.025066,0.025745,0.028245,0.029744,0.02619,0.032017
0.036908,0.040792,0.04794,0.040116,0.028541,0.030716,0.033815,0.034319,0.041384,0.047221,0.040508,0.031679,0.032999,0.034453,0.031916,0.033847,0.033345,0.028401,0.03029,0.038711,0.039456,0.031012,0.027052,0.026934,0.027178,0.029212,0.026915,0.033442
0.033675,0.03545,0.039191,0.035634,0.030804,0.033256,0.034369,0.036787,0.043952,0.047029,0.041273,0.035145,0.035208,0.035631,0.034026,0.036859,0.037381,0.031882,0.030974,0.035357,0.037257,0.03305,0.030482,0.028355,0.027273,0.029441,0.027618,0.032735
0.034691,0.031722,0.028958,0.02931,0.033854,0.036168,0.032616,0.034608,0.040927,0.041897,0.040414,0.0402,0.037794,0.034054,0.034394,0.037623,0.037401,0.035061,0.033314,0.031356,0.033816,0.035151,0.033483,0.03186,0.031905,0.030981,0.028149,0.032225
0.036655,0.031988,0.026172,0.02815,0.036801,0.038473,0.030064,0.02911,0.035214,0.036158,0.037982,0.043399,0.040791,0.032474,0.033577,0.036144,0.032701,0.035134,0.037143,0.031874,0.033001,0.03726,0.035419,0.034213,0.03537,0.032375,0.030198,0.034774
0.033965,0.031981,0.026843,0.027843,0.03525,0.036116,0.027732,0.026363,0.031539,0.032275,0.037306,0.044316,0.040788,0.031767,0.032205,0.033132,0.028976,0.032807,0.036188,0.031573,0.03093,0.034347,0.033243,0.03187,0.032444,0.029915,0.030183,0.034596
0.026836,0.028669,0.025862,0.027195,0.031937,0.031296,0.026354,0.028096,0.032972,0.031226,0.037982,0.045759,0.040331,0.032486,0.032601,0.033341,0.02999,0.030844,0.032313,0.0292,0.028121,0.02872,0.02864,0.027279,0.024664,0.024494,0.029548,0.031968
0.022465,0.026298,0.026168,0.02941,0.031242,0.029735,0.027684,0.032142,0.038979,0.034578,0.038717,0.046767,0.040555,0.034226,0.034404,0.034926,0.031964,0.030437,0.029086,0.027818,0.031097,0.029213,0.028477,0.027369,0.019846,0.021944,0.030467,0.031256
0.021873,0.025918,0.0277,0.030972,0.031558,0.032344,0.031472,0.033699,0.040562,0.037006,0.037445,0.044399,0.039749,0.034883,0.034966,0.03418,0.029887,0.026461,0.025004,0.027313,0.034008,0.031359,0.03059,0.030746,0.020856,0.022068,0.030172,0.030249
0.026266,0.029118,0.032288,0.033287,0.032279,0.03702,0.036162,0.032154,0.037109,0.038016,0.038633,0.047208,0.043252,0.036011,0.035799,0.032737,0.026812,0.024634,0.024835,0.029372,0.036099,0.032282,0.032052,0.035584,0.027211,0.026591,0.031876,0.028971
0.040511,0.04176,0.042833,0.039232,0.036675,0.045873,0.045184,0.037187,0.040675,0.044748,0.045581,0.056015,0.05401,0.042201,0.038934,0.038526,0.033827,0.028609,0.027968,0.0352,0.042204,0.038867,0.037468,0.04095,0.035587,0.033134,0.037555,0.03279
0.058244,0.059158,0.056561,0.048002,0.043357,0.056307,0.057414,0.049065,0.050638,0.053363,0.055898,0.066032,0.064552,0.048586,0.042562,0.048718,0.046054,0.037057,0.035188,0.042927,0.048255,0.047484,0.046279,0.046825,0.044196,0.040206,0.045528,0.041804
0.069644,0.071423,0.064416,0.052081,0.04594,0.061727,0.066558,0.057081,0.054495,0.057076,0.063797,0.07452,0.070239,0.050907,0.045662,0.056058,0.053719,0.043729,0.040934,0.04848,0.05347,0.052796,0.052138,0.053126,0.051346,0.046942,0.052399,0.047567
0.065757,0.06862,0.058622,0.045399,0.039886,0.054956,0.063144,0.053845,0.047291,0.051668,0.060794,0.069977,0.062782,0.044151,0.042001,0.052496,0.049539,0.041996,0.038967,0.045707,0.051265,0.048212,0.047277,0.0505,0.049532,0.04613,0.049676,0.043226
0.048138,0.049546,0.040428,0.030139,0.02756,0.038752,0.046773,0.040334,0.034819,0.03928,0.044738,0.050242,0.04383,0.030043,0.030033,0.03766,0.034825,0.031614,0.030489,0.035286,0.039094,0.033989,0.034482,0.039511,0.040506,0.03962,0.03768,0.030705
0.029312,0.026116,0.021527,0.015886,0.019045,0.027039,0.03084,0.029786,0.028029,0.02815,0.025614,0.027044,0.026401,0.019699,0.017384,0.022146,0.021441,0.020744,0.023199,0.026723,0.026108,0.019818,0.024944,0.032095,0.033281,0.031459,0.025031,0.0203
0.017873,0.014171,0.014184,0.013099,0.017901,0.024951,0.028964,0.026917,0.022461,0.023078,0.01992,0.016949,0.017692,0.01639,0.015537,0.021798,0.02125,0.016659,0.019239,0.022779,0.019856,0.014302,0.019583,0.02555,0.024859,0.02199,0.018014,0.01525
0.016474,0.015053,0.014303,0.014592,0.020095,0.025294,0.029228,0.025349,0.02157,0.024245,0.021695,0.018771,0.017521,0.014928,0.017546,0.027374,0.026941,0.018473,0.017947,0.019042,0.018277,0.016021,0.020283,0.023375,0.01663,0.013705,0.013335,0.012546
0.019696,0.017128,0.01479,0.016165,0.023883,0.028846,0.029625,0.023786,0.025007,0.028962,0.025622,0.023462,0.019527,0.014899,0.017751,0.030007,0.032353,0.021991,0.017653,0.017064,0.019501,0.021006,0.024473,0.023036,0.012817,0.012509,0.013408,0.011463
0.023298,0.019026,0.018035,0.019688,0.026433,0.030145,0.028842,0.025206,0.029556,0.03138,0.029422,0.02872,0.020897,0.016961,0.017964,0.027802,0.034308,0.025915,0.018641,0.017284,0.019977,0.024823,0.027006,0.022674,0.014717,0.016578,0.016002,0.01354
0.028919,0.023333,0.023262,0.028195,0.029034,0.028049,0.02955,0.029742,0.03268,0.034075,0.034358,0.032735,0.026505,0.021768,0.021165,0.026937,0.035168,0.028695,0.02117,0.020463,0.02021,0.02723,0.029347,0.023536,0.019991,0.024384,0.021355,0.021373
