2.6e-05,0.000263,-3.2e-05,0.000248,0.000298,-0.000731,-0.000843,3.8e-05,0.000207,0.000309,0.000129,5e-05,0.000158,0.000194,-0.003149,-0.002587,-0.000864,-0.000151,-0.000318,2e-06,3.8e-05,7.5e-05,5e-05,-4.8e-05,-0.001389,-0.001132,0.000174,-0.000582,-0.001092,-0.000848,-0.001403,-2.3e-05,-0.004504,-0.001749,-0.000943,3e-04,0.008081,-0.002187,-0.011793,-0.011289,-0.011061,-0.009566,-0.012429,-0.017457,-0.012289,-0.013801,-0.015849,-0.014876,-0.013877,-0.019979,-0.018317,-0.018288,-0.008239,-0.019954,-0.021591,-0.012775,-0.013194,-0.007609,-0.013854,-0.022477,-0.022063,-0.0169,-0.014764,-0.010962,-0.011432,-0.013697,-0.007807,-0.006661,-0.006221,-0.008641,-0.011397,-0.007115,-0.00252,-0.001926,-0.001417,-0.003146,-0.00213,-0.001689,-0.000617,-4.5e-05,-0.000359,-0.002206,-0.000891,-0.000647,-0.00068,-0.000363,-0.000403,0.000627,-0.002579,-0.000873,-0.00212,-0.002919,-0.001786,-0.001131,-0.000377,1.4e-05,-0.001078,-0.000484,-0.001558,-0.001472,-0.00147,-0.001497,-0.000943,-0.000528,0.000191,-9.8e-05,-0.003332,-0.002359,-0.000857,-0.000199,-0.000175,-5.6e-05,9.2e-05,8e-05,1e-06,2.8e-05,3.6e-05,5.1e-05,2.2e-05,0.000105,7.2e-05
-5.4e-05,0.000155,9.1e-05,0.000284,0.000205,-5e-04,0.000147,0.000464,0.000195,0.000339,0.000257,0.00015,-9.8e-05,0.000213,0.001672,0.001773,0.000797,0.000346,0.000271,0.000233,2e-06,0.000143,0.00012,8e-05,-0.000274,0.000337,-0.000205,8e-06,0.000397,-0.000694,0.001392,-0.001113,0.001694,0.001922,0.000583,0.000392,-0.019304,-0.015135,-0.005294,-0.00455,-0.003136,0.004549,-0.001988,0.002434,-0.002213,-0.006193,0.000808,0.003333,-0.000315,-0.001559,0.00111,0.004857,-0.002553,0.003922,0.005459,-0.003805,-0.003564,-0.002376,-0.008833,0.007688,0.011602,-0.002707,-0.003347,-0.002922,0.002259,-0.001324,-0.002382,-0.005403,-0.001342,-0.002165,-0.003441,-0.002234,-0.001223,-0.001145,-0.001805,-0.000571,-0.00065,8.1e-05,-0.000982,-0.001361,-0.001959,-0.001338,-0.001436,-0.000386,1.3e-05,0.000195,3.8e-05,-0.004127,0.000684,0.000739,0.000326,0.001267,-0.000378,-0.000385,-0.000243,-0.000167,0.00136,0.000671,-4.8e-05,0.000615,0.000116,9e-04,0.000435,0.000449,0.00029,0.000269,0.001543,0.001846,0.000865,-7.6e-05,-3.9e-05,0.000105,0.000195,6.2e-05,2.8e-05,0.000155,0.000191,-2.6e-05,-3.5e-05,-9.3e-05,-0.000123
-0.000142,8.1e-05,7e-05,-4.3e-05,-4.1e-05,3.8e-05,-0.000172,0.000161,5.9e-05,4.4e-05,7.2e-05,9.2e-05,-0.000117,6.5e-05,-0.00045,-0.001207,-0.000698,-0.000182,-0.00011,5.9e-05,2.4e-05,-0.000105,-3e-06,-5.7e-05,-0.000132,-0.000536,-0.000737,-0.000202,-0.000262,0.000312,-0.000531,-0.001589,-0.001351,-0.000614,-0.000409,-9.7e-05,2e-05,-0.006654,-0.006772,-0.006235,-0.002437,-0.00422,-0.001207,0.003215,0.009419,0.001168,0.001371,-0.00395,-0.00075,-0.007771,-0.001485,-0.003878,-0.002924,-0.000254,-0.000892,0.001223,-0.00217,-0.002218,0.000667,-0.010565,-0.008919,-0.004893,-0.002257,-0.001451,-0.0055,-0.002572,-0.000866,0.003731,-0.000514,-0.001462,0.000912,0.000903,-0.000846,-0.002227,-0.000926,-0.001123,-0.000425,-0.000332,-0.000836,-0.00143,0.000762,0.000179,-0.000596,-0.000468,-0.00038,-0.00025,-0.000401,-0.002319,-0.002726,-0.001385,0.000107,-0.001966,-0.002443,-0.000375,-0.000267,4.3e-05,-0.000351,-0.000377,-0.000359,0.000216,7.6e-05,-0.000589,-0.000538,-0.000325,-6.2e-05,-0.000291,-0.001072,-0.000945,-0.000452,-2e-04,-9.5e-05,-0.000279,-1.4e-05,-2.9e-05,0.000104,-0.00014,-5.2e-05,-0.000112,-5.1e-05,4e-05,8e-06
-0.00012,-5.1e-05,-4.6e-05,3.8e-05,8e-06,0.000211,0.000218,0.00018,7.3e-05,7e-05,-2.5e-05,2.1e-05,4.5e-05,-0.000176,9.4e-05,0.000697,0.000323,0.000176,-2.6e-05,-0.000168,-6.4e-05,-7.4e-05,-1.2e-05,-0.000116,5e-06,9.5e-05,4.9e-05,-0.000206,-7e-06,2e-06,-0.000799,-0.00036,0.000547,0.00092,0.00037,0.000643,-0.001323,0.00544,0.010204,0.009266,0.00052,-0.001682,0.001731,-0.008178,-0.005582,-0.007978,-0.00498,-0.000558,0.002677,0.003315,0.005186,0.003336,0.002331,1.9e-05,0.004118,-0.000402,-0.000559,-0.001826,0.002478,0.003846,0.003004,0.006881,0.003865,-0.000201,0.00011,-0.002716,-0.004865,-0.001128,5.3e-05,0.003275,7.7e-05,-0.001041,-4e-04,0.000938,0.001027,0.000587,-0.000139,-8.6e-05,0.000516,0.000366,0,0.000698,0.000296,-0.000166,-8.6e-05,-0.00015,0.000331,0.000371,0.000447,-0.000555,3e-04,0.000391,-0.000205,-0.000624,-0.001371,-0.000754,0.00034,8.2e-05,-9e-06,-0.000963,-0.000262,0.000123,0.000244,-0.000104,-0.000104,-0.000163,0.000177,0.000743,0.000217,0.000115,4.4e-05,2e-06,8.6e-05,3.8e-05,-6.5e-05,-0.000153,5.6e-05,-3.2e-05,-0.000133,4.8e-05,-0.000103
0.000145,-2.9e-05,-3.9e-05,-9.9e-05,-2.2e-05,-8.4e-05,6.6e-05,0.000194,-6.5e-05,9e-05,3.8e-05,0.000123,2.7e-05,8.5e-05,-0.000396,-0.000448,-0.000374,-7.1e-05,-1.2e-05,1.1e-05,1e-04,4.9e-05,8.4e-05,-2.2e-05,-7e-06,9.9e-05,-3.5e-05,0.000107,-0.000188,0.000303,0.000536,-0.000668,-0.000414,-0.000989,-0.000284,0.000437,0.000223,-0.0048,-0.006912,-0.000999,-0.000999,-0.008119,-0.004015,0.005346,0.002533,0.007193,0.001295,-0.001857,0.001729,-0.000695,-0.001338,-0.007365,0.000481,0.001388,-0.000185,0.001729,0.002166,0.004196,-4.1e-05,-0.000203,-0.005217,-0.004063,0.000732,0.000543,0.001232,-0.000683,0.002909,0.000902,-7.2e-05,-0.002761,0.000487,-0.000886,-0.000751,-0.001416,-0.001145,0.000593,0.000317,0.000176,-0.000659,0.000328,0.000326,-0.00056,0.000382,-1.5e-05,-0.00011,-0.00021,-0.000287,-0.000402,0.001237,-1.8e-05,0.000144,-0.000928,-0.002117,0.000712,0.001262,0.00079,2.9e-05,0.000134,-8e-05,0.000295,0.000122,6.7e-05,-3.1e-05,0.000228,0.000198,-7.4e-05,-2.7e-05,-0.000806,-0.000158,-9.2e-05,8.6e-05,8.2e-05,9e-06,-0.000138,-7.6e-05,-6.2e-05,-8.8e-05,6.4e-05,4.3e-05,4.7e-05,9.2e-05
0.000188,6e-06,-1.4e-05,8.6e-05,7e-05,-0.000137,3.9e-05,-0.000113,-0.000214,1.7e-05,-3.2e-05,5.8e-05,3.2e-05,-0.000168,-2.2e-05,0.000137,0.000267,5.3e-05,2.2e-05,9e-06,-4.5e-05,5.3e-05,-7.6e-05,-2.3e-05,-9.2e-05,-0.000188,-9.2e-05,-0.00016,3e-04,-0.000545,-7.9e-05,0.000204,-0.001237,-4.4e-05,-0.000513,-0.000595,-0.000668,-0.001697,0.000788,0.000814,0.001787,0.002624,-0.003172,0.001325,-0.007423,-0.00507,-0.002976,0.001088,0.001418,0.001709,-0.000149,0.003361,0.002624,-0.002423,0.003659,-0.00464,-0.003889,-0.001307,-0.002221,-0.002312,0.002623,0.002348,-0.000878,0.001579,0.000702,0.002306,0.000869,-0.000935,0.000569,0.001564,0.000126,0.000862,-0.000157,0.000725,-0.000335,-0.000677,0.000361,0.000696,0.000247,-7.7e-05,-1.1e-05,0.000381,0.000146,3.9e-05,-0.000101,-0.000249,0.000317,2e-05,0.000596,-0.000566,-0.00058,-5.9e-05,0.000339,-0.002082,-0.00142,-0.000481,-7e-06,-0.000249,0.000211,-9.6e-05,1.6e-05,5.6e-05,1e-05,-0.000207,0.00012,5.8e-05,-0.000202,0.000454,0.000251,4e-05,7e-06,-7.1e-05,9.2e-05,4.2e-05,-8.7e-05,8.7e-05,3.5e-05,3.9e-05,4.8e-05,0,-7.9e-05
-1e-04,-1.4e-05,-0.000142,2.5e-05,-0.000146,-0.000155,-0.000221,-4.1e-05,-0.000171,-7.7e-05,-0.000104,0,-1.2e-05,-4.1e-05,0.000183,2.5e-05,-0.000295,-0.000211,-1.8e-05,-4e-05,2.8e-05,-1.7e-05,7.1e-05,1.2e-05,4.4e-05,0.000421,0.000129,-3e-05,-0.000267,0.000441,2.6e-05,7e-06,-6.6e-05,-0.000764,-0.000413,1e-06,-0.000456,-0.000759,0.00592,0.000914,0.000598,0.000812,-0.004853,-0.00036,0.005987,0.000104,0.002097,0.00138,6.3e-05,-0.001975,0.002232,-0.002849,-0.001571,0.00142,-0.000933,0.000649,0.000465,0.001381,-0.001847,8.9e-05,-0.003616,-0.003976,-0.000417,0.001098,-0.000406,-0.001738,-0.001422,0.000396,-0.000922,0.000877,0.000192,0.001092,0.000156,0.000339,0.000367,-0.000624,-0.00025,-0.000272,-7.7e-05,-0.000617,0.000302,0.000111,-1.1e-05,0.000281,1e-06,9.4e-05,-0.000112,-8.1e-05,-0.000555,-0.000482,-0.000241,-2.3e-05,0.001743,0.000947,5.9e-05,-0.000157,-0.000275,-9.4e-05,3.9e-05,-4.8e-05,-0.000351,-0.000222,-5e-06,-7.6e-05,1.9e-05,2.9e-05,-0.000135,-0.00061,2.8e-05,7.9e-05,-0.00012,5.9e-05,-0.000134,-0.000116,-7.3e-05,8e-06,-0.000126,-3.7e-05,-1.6e-05,3.6e-05,-3.7e-05
-1.4e-05,-1.5e-05,-2.7e-05,-5.4e-05,-0.000181,-0.000207,4e-06,-5.5e-05,-9.1e-05,-1.1e-05,-0.000141,-1e-06,-4.8e-05,9e-06,4.6e-05,0.000142,1.9e-05,3e-06,4.6e-05,2e-05,3.7e-05,-1.6e-05,-0.000204,-1.9e-05,1.7e-05,2.9e-05,-0.000294,-1.1e-05,0.00012,-0.000138,-0.000167,0.000776,0.000503,-0.000471,-0.000124,0,-0.000176,0.000569,0.001196,0.003753,-0.002966,-0.001817,0.003926,0.000497,-0.004919,-0.002652,-0.005618,-0.002072,0.001145,0.001051,0.002565,0.000171,-8.3e-05,-0.000305,-0.00155,-0.001581,0.00177,-0.000251,0.001333,-0.000201,0.004164,0.000569,0.002481,-0.001802,-0.001585,0.00289,0.00126,0.001638,-0.000275,0.000509,-0.001894,0.000412,-3.2e-05,0.000151,0.001081,0.000641,-0.000157,0.000406,-1.5e-05,-0.000571,-0.000764,-0.000649,-0.00032,-0.000317,8.4e-05,-1.3e-05,-0.000121,0.000101,0.000783,0.000618,0.000174,0.000131,-0.00037,8.7e-05,0.000755,-0.000272,0.000105,8e-05,-5e-06,-0.000104,0.000296,0.000144,-7.9e-05,-7e-06,-0.000183,-5.1e-05,-0.000177,0.00014,0.000136,-6.3e-05,8.5e-05,-8.3e-05,-0.000119,-9.4e-05,-1e-06,-2.9e-05,2.7e-05,-1.5e-05,-2.8e-05,4e-06,3.9e-05
-8.3e-05,6e-06,4.3e-05,4e-06,-0.000129,-4e-05,1.8e-05,-6.1e-05,-0.00014,-0.000134,-0.00011,1.1e-05,-3.7e-05,2e-06,0.000165,-0.000111,-7e-05,-5.2e-05,0.000109,4.4e-05,2.4e-05,-4.6e-05,-1.2e-05,-6.4e-05,8.1e-05,-1.5e-05,6.2e-05,0.000145,0.000131,0.000106,2.7e-05,-0.000215,-0.000215,0.000885,-0.000742,-0.000304,-7.7e-05,0.00015,-0.004199,0.000395,0.00112,-0.001108,-0.005783,-0.002542,0.001735,0.001912,0.002452,-0.000202,0.001134,-0.002277,-0.003908,-0.001801,-0.000842,-0.000289,-0.000711,0.001071,0.002748,-0.000385,0.00145,0.000339,-0.00467,0.000268,-0.001667,-0.001332,-4.8e-05,-0.000572,-0.001385,-0.003123,-0.002076,-0.001285,0.001086,-0.000497,-0.000616,9.3e-05,-0.000258,-0.000313,-0.000175,-0.000577,9.3e-05,0.000362,-0.000103,0.000521,8.5e-05,1.6e-05,-0.000261,-0.000147,-0.000116,0.000133,-0.000494,7.2e-05,0.000204,0.000142,-0.000151,0.000793,0.000276,-0.000184,-0.000125,-5.9e-05,-0.000127,0.000101,-0.000101,-8.9e-05,3.1e-05,7e-06,-1.3e-05,-2.3e-05,-0.00024,-5.6e-05,-9.1e-05,-5.1e-05,-2.7e-05,4.7e-05,-7.1e-05,-4.1e-05,-5.2e-05,-2.3e-05,-3.3e-05,6e-06,-7e-06,-2e-05,-5.1e-05
-8.1e-05,-1e-06,-2e-06,-5.9e-05,-5.4e-05,3.6e-05,-5.3e-05,6.2e-05,9e-06,-5.6e-05,-9.7e-05,-4.6e-05,6e-05,-4.1e-05,7.8e-05,3.3e-05,2.6e-05,7e-05,3.9e-05,-1.4e-05,7.9e-05,-1.9e-05,3.6e-05,2.3e-05,4.9e-05,8.2e-05,-0.000182,-0.000167,5.6e-05,5.5e-05,9.3e-05,0.000308,0.000513,-0.000178,0.000106,-0.000109,-0.000251,-0.000416,-0.002193,-0.001072,0.001038,-0.001095,0.003333,-0.001448,-0.000444,-0.001799,-0.000684,-0.002263,-0.002657,0.001236,0.00082,0.003331,-0.000358,-0.001666,-0.000874,-0.002181,-0.000595,-0.000209,0.000984,8.5e-05,0.002331,0.001677,-0.000133,-0.000568,0.000497,0.000648,-0.000675,0.000856,0.000153,0.000399,-0.000525,-0.000794,0.001032,-2.6e-05,0.000317,-0.000185,0.000253,0.000133,2.5e-05,9.4e-05,-0.000181,-0.000232,1.8e-05,-0.000119,0.00013,-1e-05,-3.3e-05,-7.4e-05,-0.000462,-0.000484,0.000354,-5.4e-05,-0.000157,0.00034,-1.9e-05,-0.000294,-0.000151,-2.5e-05,0.000112,-3.6e-05,4.7e-05,-2.5e-05,0.00011,6.5e-05,-4.9e-05,-1.7e-05,-6.7e-05,-9.9e-05,6.4e-05,-3.2e-05,9e-06,-5e-06,6.9e-05,-3.5e-05,5e-06,-5.7e-05,2.3e-05,-2.6e-05,-4e-06,3.6e-05,-8.2e-05
-2.5e-05,-8.6e-05,-2.1e-05,-4.7e-05,1.3e-05,-5.7e-05,-7.3e-05,1.4e-05,-6e-05,-1.5e-05,3e-06,-1.3e-05,-3.2e-05,-2.4e-05,0.000141,-2.6e-05,2.4e-05,-4.8e-05,7.9e-05,-2.7e-05,-1.7e-05,-4.2e-05,1.3e-05,-1.3e-05,-5.2e-05,-4e-06,0.000129,3.7e-05,-8.4e-05,-6.3e-05,-1e-05,-0.000178,-0.000158,-0.00015,-0.000418,-0.000171,-0.00029,0.000604,0.003261,-0.000909,0.00069,-0.000288,-0.000334,-0.002991,-0.000449,0.000771,0.000524,8e-04,0.000206,-0.0021,-0.001515,-0.00298,-0.001177,-0.000328,0.000529,0.002077,0.000532,-0.000806,-0.001689,-0.000357,0.000922,9.2e-05,0.000914,0.001803,-2.7e-05,-0.001265,0.000251,-0.001476,2e-06,-0.000273,0.000953,0.000576,-0.000565,0.000283,-9.3e-05,0.000207,-0.000153,-6.9e-05,2.6e-05,-2.3e-05,6.4e-05,-0.000102,-9.2e-05,0.000252,-4.7e-05,8.2e-05,-4.6e-05,-8.9e-05,-0.000177,-0.000408,-0.000547,0.000267,0.00033,0.000617,-0.000167,0.000386,4.9e-05,-1e-05,-0.000149,-1e-05,0.000128,3.3e-05,-0.000137,-0.000107,2.9e-05,2e-05,8.8e-05,4.1e-05,-4.5e-05,-5.1e-05,-1.9e-05,-3e-06,1.8e-05,2.7e-05,5e-06,-4.5e-05,1e-06,-6.4e-05,-1.1e-05,-5e-06,-2.7e-05
-3.8e-05,-1e-06,-3.6e-05,2e-06,-3e-06,-6.7e-05,-6.5e-05,-7.5e-05,1.7e-05,-1.9e-05,-1.9e-05,-5.3e-05,-1.3e-05,2e-06,2.2e-05,-3.4e-05,-2.3e-05,2.6e-05,-1.8e-05,-4.1e-05,-3.9e-05,-5.2e-05,6e-06,2.4e-05,3e-06,3e-06,-0.000106,7.6e-05,-0.000143,-8.4e-05,-0.000149,9.3e-05,9.7e-05,0.000271,0.000627,-5.9e-05,-9.7e-05,-0.000482,-0.002398,-0.00179,-0.000785,-0.000295,-0.000564,0.000336,-0.001965,0.001376,-0.000123,-0.000871,-0.000112,-0.000143,0.00081,0.001434,-0.000471,-0.00061,-7.1e-05,-0.000986,-0.001112,-6e-05,-0.000513,9.6e-05,0.000449,-8.7e-05,-0.001122,-0.000592,0.000548,0.000952,-0.000322,0.000883,0.000439,-0.000222,-0.000693,5.5e-05,0.000263,-0.000635,-0.000206,0.000357,-2e-05,0.000175,1.3e-05,0.000148,-4.4e-05,-0.000351,-1.8e-05,-1e-05,5.9e-05,3.6e-05,-6.3e-05,-1.9e-05,-9.9e-05,-4.9e-05,0.000616,0.000321,-0.000135,-0.000879,-0.000291,2.5e-05,-0.000354,2.4e-05,1.3e-05,-3.3e-05,0.000149,-5.2e-05,5.4e-05,8.3e-05,-5e-06,-3.6e-05,3.9e-05,-0.000113,-9e-05,5.4e-05,-5e-06,-7.3e-05,1.4e-05,3e-06,-2.5e-05,-2.3e-05,-4.6e-05,-5.1e-05,-5e-06,-7e-06,1.1e-05
-1.1e-05,-2.9e-05,-6e-06,-4.8e-05,-2.2e-05,3e-06,-2.4e-05,-2.8e-05,-6.1e-05,-6e-06,-1.6e-05,-4.1e-05,-1.7e-05,-2.6e-05,-6.9e-05,-2.5e-05,-2.7e-05,-5.8e-05,3.4e-05,6e-06,1e-06,-1e-05,-6e-06,5e-06,-2.1e-05,-1.4e-05,9.7e-05,-7.9e-05,-7e-06,5.6e-05,7.2e-05,0.000235,-0.000156,-5.1e-05,0.00012,-1.8e-05,4.5e-05,0.000315,-0.001396,-0.000427,0.000732,5.5e-05,0.000113,0.000861,0.001523,-0.000954,-0.002092,0.000423,-0.000979,-0.000624,0.000574,0.000728,0.000109,0.000839,0.000108,0.000597,0.00042,0.000273,0.001108,0.000631,-0.000304,-0.000245,-0.000952,-0.001495,6.3e-05,0.000867,0.000578,-0.000242,7.2e-05,0.000546,0.000939,0.000199,-0.000119,-0.000312,-8e-05,5e-05,0.000113,-0.000195,-0.000109,4.2e-05,3.6e-05,0.000227,4.3e-05,-4.5e-05,4.1e-05,5.3e-05,-3e-06,5.5e-05,-3.5e-05,0.000186,-0.000436,0.000241,-0.000318,-0.000129,-2e-05,-0.000107,1.6e-05,-3.5e-05,-8.8e-05,9e-06,-6e-05,2.4e-05,-2.2e-05,-6e-05,-8.2e-05,4.5e-05,3.9e-05,-7.9e-05,-8.1e-05,-9e-05,-4e-06,8e-06,-1.1e-05,2.1e-05,4e-06,-3e-05,1.9e-05,-1.2e-05,-5e-06,-1.3e-05,-7e-06
1e-06,8e-06,-1.4e-05,1.4e-05,-1.5e-05,-1.3e-05,-2.7e-05,1.6e-05,0,6e-06,-4e-05,-2.6e-05,-2.2e-05,5e-06,-4e-06,-3.9e-05,3.4e-05,4.9e-05,-5.9e-05,-1.8e-05,-1.9e-05,-1.1e-05,-3.8e-05,-2.3e-05,-1.3e-05,-4.8e-05,-2e-05,2.2e-05,6.3e-05,6e-06,-1.4e-05,-0.000252,1.6e-05,-1.5e-05,-0.000168,-1e-06,-0.000112,-0.000159,0.000388,0.000751,0.00241,-0.000475,-0.000835,0.000436,-0.000886,-8.2e-05,0.002714,0.000182,0.001262,0.000795,-0.001286,-0.000522,0.000588,-0.001033,0.000202,0.000314,-0.000425,0.000297,-0.000181,-0.000382,-6e-05,-9.5e-05,0.000722,0.000882,-0.000266,-0.000834,-9.9e-05,0.000678,0.000207,-0.000714,-0.00039,-0.000417,-0.000172,-0.000161,0.000109,-1.9e-05,-2.9e-05,2e-06,6.3e-05,-4.8e-05,-4.5e-05,0.000438,3.3e-05,-3.8e-05,4.1e-05,-7.1e-05,-2.3e-05,6.5e-05,3e-06,9.5e-05,-0.000303,2.3e-05,6e-06,6.9e-05,-1.8e-05,0.000144,-0.00012,1.5e-05,-7.3e-05,-2.3e-05,-0.000113,1e-06,2e-06,1.6e-05,5.6e-05,-5.8e-05,1.9e-05,8.2e-05,-9.6e-05,5.7e-05,-3e-05,2.7e-05,7e-06,2e-06,4e-06,-3.2e-05,-3.8e-05,-1.3e-05,7e-06,-1e-05,6e-06
4.6e-05,1.4e-05,2.6e-05,6e-06,-1.8e-05,2.6e-05,2.7e-05,-3e-05,-4.6e-05,1.3e-05,-1.6e-05,-5e-06,-2e-06,5e-06,2.5e-05,-2e-06,-4e-05,-2.8e-05,2.5e-05,-1.6e-05,2e-05,1e-05,1.7e-05,3e-06,3e-06,0,4e-05,-1.3e-05,0,-2.9e-05,1.1e-05,0.000156,1.5e-05,-4.1e-05,-0.000222,6.9e-05,2.2e-05,3e-06,-0.000501,0.000773,-0.000754,0.000295,0.000663,0.000975,0.001566,-0.000598,-0.000748,-0.001113,-0.000762,-7.5e-05,4.9e-05,0.000569,0.000978,0.000872,0.000145,-0.000391,0.000326,0.000226,0.000188,-0.000423,0.000589,0.00011,0.000437,0.000312,2.1e-05,8.3e-05,-0.000235,-0.00073,0.000288,-0.000389,0.000324,-0.000114,0.000406,5.9e-05,5.1e-05,-5.4e-05,-0.000167,-6.5e-05,-4e-06,-3.5e-05,0.000111,-0.00015,-0.000145,5.3e-05,-0.000108,1.2e-05,2.9e-05,-9e-06,6.1e-05,-7.2e-05,4.2e-05,-5.2e-05,8.1e-05,0.000174,0.000116,2.6e-05,7e-05,-3e-05,2e-05,2e-06,2.8e-05,1.3e-05,-1.7e-05,-3e-06,-3e-06,2.1e-05,-2.5e-05,-2.3e-05,8.8e-05,-1.3e-05,2.1e-05,1.2e-05,-1e-06,-2.7e-05,9e-06,-2e-06,6e-06,2.3e-05,2e-06,5e-06,-6e-06
6e-06,-1e-06,1e-06,-2e-06,-1.6e-05,1.6e-05,-5e-06,2e-06,-2e-06,-1e-06,6e-06,2e-06,-1.1e-05,-1.4e-05,1e-06,-1.6e-05,-1.4e-05,6e-06,-3e-05,-9e-06,-6e-06,-4e-06,-1.9e-05,0,-7e-06,1.1e-05,-2.9e-05,4e-05,-3.5e-05,3.7e-05,-3.6e-05,-7.6e-05,3e-05,5.3e-05,0.00016,9e-06,8e-06,8.4e-05,0.001371,-0.000135,-0.000602,6.7e-05,-0.000174,0.000379,-0.000254,0.000328,-3e-06,0.000716,-5.9e-05,-0.000137,2.2e-05,-7.7e-05,-0.000942,-0.000148,1.7e-05,4.6e-05,-0.000176,0.000361,-0.000599,3.9e-05,-0.000282,0.00022,-1.5e-05,-0.000549,2.2e-05,8.8e-05,-0.000414,0.000427,-0.000367,-0.000113,-9.7e-05,8e-05,4.7e-05,9e-06,-1.7e-05,-0.000135,5e-06,6.6e-05,4.2e-05,0,5.8e-05,-1.7e-05,-2.3e-05,2e-05,-8e-06,-1e-05,-3.2e-05,1.2e-05,4e-06,-8.7e-05,9.2e-05,2.9e-05,5.9e-05,8.1e-05,-7.1e-05,-0.000113,8.5e-05,2.2e-05,-3.5e-05,1.2e-05,5.1e-05,1.8e-05,1.5e-05,6e-06,1.7e-05,1.9e-05,-2.5e-05,1.9e-05,-4.4e-05,2.2e-05,-1.2e-05,-1.3e-05,-2.1e-05,2e-06,-2e-06,1.9e-05,9e-06,1.6e-05,-3e-06,2e-06,-2.8e-05
-3.4e-05,-5e-06,-4e-06,1e-05,-1.2e-05,7e-06,0,-6e-06,-5e-06,0,-1.7e-05,1.5e-05,0,-4e-06,-2e-05,1.5e-05,-2e-06,2.6e-05,-1.1e-05,2e-06,6e-06,9e-06,4e-06,2e-06,-6e-06,-2.5e-05,1.7e-05,-3.2e-05,1.5e-05,2e-06,2e-05,3e-06,7e-05,-3.4e-05,-0.000102,4.3e-05,2.4e-05,-6.7e-05,-0.000416,-0.000551,7e-05,-0.000674,0.001021,-0.000192,0.000517,-0.000136,0.00015,-0.000128,0.000239,0.000135,0.000579,0.000724,0.000773,0.000325,1.5e-05,-0.000542,-0.000102,-0.000184,3.6e-05,0.000184,4e-05,-8.8e-05,-1.4e-05,0.000478,0.000146,1.6e-05,0.000133,-0.000258,2.3e-05,-3.6e-05,0.000116,0.000142,-0.000101,-5e-06,7.4e-05,-3.6e-05,8.9e-05,-0.000107,3e-06,-7.9e-05,-3e-05,-1.4e-05,2.8e-05,-3.9e-05,9.2e-05,1e-06,9e-06,0,7.8e-05,1.3e-05,0.000121,-4.2e-05,-6.6e-05,5.8e-05,-2.5e-05,-9.5e-05,6.2e-05,-1.2e-05,7e-06,-1.3e-05,-4.9e-05,2.6e-05,-2e-06,-1.7e-05,-2.3e-05,-1e-05,5e-06,1.8e-05,0,-1.8e-05,5e-06,1.7e-05,1.3e-05,-1.8e-05,0,0,-3e-06,1e-06,-1e-06,-7e-06,-1.1e-05
1.5e-05,-3e-06,-1.1e-05,-4e-06,-3e-06,-1.6e-05,-8e-06,7e-06,0,-6e-06,-1.7e-05,8e-06,-1e-06,1.1e-05,-3.3e-05,-1.1e-05,-5e-06,-2.1e-05,-7e-06,5e-06,-1.5e-05,-2e-06,1.6e-05,-6e-06,-9e-06,5e-06,-4e-06,2.8e-05,-1.7e-05,3.5e-05,5e-06,3.3e-05,-6.1e-05,-8.1e-05,1e-05,-3e-05,-1.2e-05,0.000172,0.000143,-0.000289,0.000498,2.5e-05,-0.001271,-0.000208,-0.000141,0.000121,-0.000643,-0.000307,5.7e-05,-0.000262,0.000148,-0.000268,0.000455,-5.8e-05,-0.000332,0.000293,-0.000604,0.000176,-0.000305,9e-06,-0.000342,9.6e-05,0.000241,-0.000283,0.000162,-0.000261,4e-06,0.000195,-0.000159,0.00038,-0.00012,-4.9e-05,0.000117,0.000149,-8e-05,5.3e-05,-1.1e-05,3.4e-05,-1e-05,3.1e-05,-3.1e-05,2.9e-05,9e-06,-3.4e-05,-6.3e-05,1.8e-05,-1.5e-05,1.7e-05,-1.6e-05,3.6e-05,-3e-06,8e-06,-4.9e-05,-0.000214,-5.9e-05,3.9e-05,-2.5e-05,3.3e-05,-2.1e-05,9e-06,6.2e-05,-8e-06,2.4e-05,-7e-06,1e-06,-4e-06,-3e-06,-5.2e-05,-2e-06,9e-06,-1e-06,-6e-06,-3e-06,8e-06,-7e-06,-9e-06,4e-06,2e-06,2e-06,7e-06,1e-06
-1.2e-05,4e-06,-7e-06,-2e-06,0,-1.4e-05,-2e-06,-3e-06,-2e-05,-1.3e-05,-3e-06,4e-06,5e-06,-1.2e-05,-1.5e-05,-2e-06,5e-06,3e-06,-1.6e-05,-6e-06,9e-06,-4e-06,5e-06,1e-06,0,-5e-06,-1e-06,-1.5e-05,-1e-06,-2.1e-05,-1.2e-05,-7.8e-05,-2.2e-05,0.000119,-3.2e-05,-3.9e-05,1.6e-05,-7.7e-05,0.000353,2.3e-05,-0.000314,0.000467,0.000885,-0.000229,-0.000131,0.000373,0.000395,0.000356,0.000394,-0.000155,-3e-04,0.000149,-0.000178,0.000193,9e-06,5.6e-05,1.4e-05,-3.5e-05,0.000262,-7.2e-05,0.000403,-0.000135,-0.000115,9.6e-05,-0.000201,-1.8e-05,-0.000227,-5e-05,0.000251,-0.000298,0.000144,-0.00012,-0.000146,1e-05,7.9e-05,-2.2e-05,-4.4e-05,4e-06,1.7e-05,-1.2e-05,-3.4e-05,7e-06,-1.2e-05,2.9e-05,-2e-06,-1.9e-05,-1e-05,-1e-05,-1.8e-05,1.6e-05,-5.9e-05,-1.2e-05,0.000132,-6e-06,1.4e-05,9e-06,-5.2e-05,-2.2e-05,1.6e-05,-1.1e-05,0,-6e-06,-2e-05,1.4e-05,6e-06,2e-06,-7e-06,-1e-05,2.9e-05,-1e-05,-8e-06,-4e-06,1.7e-05,1e-06,-2e-06,2e-06,-1.1e-05,0,-1e-06,-3e-06,-8e-06
-1.5e-05,3e-06,3e-06,2e-06,-1e-06,1e-06,-9e-06,1e-06,-1.1e-05,2e-06,-3e-06,0,-1e-06,4e-06,-4e-06,8e-06,-6e-06,1e-06,-8e-06,4e-06,-8e-06,-2e-06,0,0,2e-06,0,-1e-05,-6e-06,1.3e-05,1.6e-05,-3e-06,2.5e-05,-1e-06,-2.3e-05,6.6e-05,-1.5e-05,-4e-06,0.000121,0.000114,0.000244,7e-05,4.9e-05,-7.1e-05,-0.000294,-0.000207,-0.00045,-0.000387,-0.000336,-0.000459,-6.9e-05,-0.000142,5.2e-05,-0.000211,-6.7e-05,5.5e-05,0.000207,-0.000157,1.8e-05,0.000195,-0.000128,-4.9e-05,-0.000148,7.9e-05,0.000214,-3.9e-05,0.000221,1.8e-05,-4.7e-05,-0.000136,5.2e-05,-0.00012,-5e-05,3.6e-05,5.9e-05,6.1e-05,2.3e-05,1.4e-05,4.2e-05,-2e-05,5.2e-05,-1e-06,-3.1e-05,-3e-06,-8e-06,1e-05,-7e-06,0,9e-06,-4e-06,-2.3e-05,-8.6e-05,-2.6e-05,5.7e-05,-4.4e-05,1.7e-05,1e-06,8e-06,6e-06,-5e-06,1.6e-05,-3e-05,6e-06,6e-06,-1.6e-05,-3e-06,-7e-06,2e-05,1.1e-05,1.7e-05,7e-06,4e-06,-1e-06,-6e-06,-1e-06,4e-06,5e-06,5e-06,-3e-06,-2e-06,2e-06,-7e-06
-3e-06,-1e-06,-1e-06,-8e-06,-4e-06,-3e-06,-8e-06,-1e-05,-8e-06,0,-1.2e-05,-2e-06,2e-06,1e-06,-7e-06,6e-06,1e-06,-6e-06,-6e-06,-1e-06,4e-06,-2e-06,-4e-06,1e-06,2e-06,2e-05,1.3e-05,-2e-06,2.8e-05,-2.2e-05,5e-06,-2.1e-05,7e-06,-5.6e-05,-0.000107,-2e-06,3e-06,-8.8e-05,-0.000293,0.000448,-0.00012,-0.000174,-0.000207,-0.000249,0.000576,0.000305,6.8e-05,0.000156,0.000429,1.6e-05,-0.000172,8.9e-05,-7.1e-05,1.4e-05,-3.6e-05,-0.000223,7.5e-05,-6.5e-05,0.000183,0.000128,0.000238,-7.9e-05,5e-06,-0.000176,-8.9e-05,-2e-04,9.6e-05,-0.000125,6.7e-05,0.00013,0.000115,7.7e-05,5.4e-05,-3.6e-05,2.5e-05,6.7e-05,1.6e-05,-2.3e-05,1.6e-05,-3.2e-05,-7e-06,2.7e-05,1e-05,1e-05,-7e-06,-2e-06,-1.9e-05,2e-06,-1.5e-05,-3e-05,-4.5e-05,-2e-06,-7.5e-05,1e-04,4.3e-05,5.5e-05,-3.2e-05,-1.6e-05,-9e-06,-1.3e-05,1.2e-05,-4e-06,9e-06,1.5e-05,-8e-06,5e-06,8e-06,-1.1e-05,-5e-06,-1.1e-05,-3e-06,4e-06,-1e-06,5e-06,0,-9e-06,-7e-06,-8e-06,-1e-06,1e-06,-3e-06
-4e-06,-6e-06,8e-06,3e-06,-2e-06,0,-1e-06,1e-05,-1.4e-05,0,-1.3e-05,-5e-06,0,-4e-06,-7e-06,4e-06,-1.4e-05,3e-06,0,-1e-06,6e-06,-3e-06,-1e-05,-1e-06,1e-06,-5e-06,-1.1e-05,9e-06,0,1.2e-05,1e-06,-1.7e-05,1.7e-05,4.4e-05,0.000157,-2e-06,1e-06,4.5e-05,-0.000316,-0.000136,0.000392,-0.000166,0.000421,5.7e-05,-0.000166,-0.000115,0.000735,9.3e-05,-0.000234,-0.000104,0.000366,-0.000104,-1.7e-05,2.4e-05,8.9e-05,-1e-06,5.4e-05,0.000104,-0.000252,-2.8e-05,-0.000481,-6.2e-05,-8.7e-05,0.00012,3.1e-05,6.5e-05,-3.8e-05,1e-05,1.7e-05,-1.6e-05,-0.000149,8.7e-05,-1.9e-05,-1.5e-05,1.5e-05,-1.5e-05,-1.8e-05,-1.1e-05,2e-06,1.9e-05,-4e-06,-1.9e-05,5e-06,-2.1e-05,1.6e-05,1.3e-05,5e-06,3e-06,-2.9e-05,-1.3e-05,7.3e-05,-1.1e-05,-1.3e-05,5.3e-05,0,-2.7e-05,6e-06,1.6e-05,1e-05,1e-05,-3.9e-05,-7e-06,-6e-06,-1e-05,7e-06,-2e-06,-3e-06,1.3e-05,8e-06,3e-06,4e-06,-1e-06,-2e-06,-7e-06,0,-8e-06,4e-06,-5e-06,1e-06,-1e-06,-4e-06
-2e-06,1e-06,-3e-06,-1e-06,-4e-06,7e-06,-9e-06,5e-06,-3e-06,2e-06,-4e-06,-5e-06,-1e-06,0,-2e-06,-3e-06,3e-06,7e-06,3e-06,-2e-06,-1e-06,-2e-06,5e-06,-3e-06,0,0,1.2e-05,-1.2e-05,-1.7e-05,-9e-06,-2e-06,3e-06,1.8e-05,-1.2e-05,-0.000187,1.2e-05,-6e-06,-2e-06,3.6e-05,-0.000443,-0.00032,5.4e-05,-0.000176,0.000202,0.000159,-0.000156,-0.000715,-0.000218,-7e-05,-3.2e-05,-0.000177,0.000192,-0.000146,0.000116,-9.7e-05,-6e-05,0.000193,-8.7e-05,-0.000234,-6.6e-05,0.00015,0.000107,-0.000182,-4.7e-05,5e-05,7.4e-05,-5.5e-05,7.4e-05,5.8e-05,0.000161,0.000128,-5e-06,-2.4e-05,2e-05,-4.2e-05,-2.8e-05,-2.3e-05,1e-05,-8e-06,-4e-06,2e-05,-2.3e-05,-2e-05,1.1e-05,-3.2e-05,-6e-06,-7e-06,-2e-06,-3e-06,8e-06,2.4e-05,-1.1e-05,2.3e-05,3.9e-05,-4.3e-05,-1.6e-05,-9e-06,-1.2e-05,-1.7e-05,-8e-06,2.7e-05,3e-06,8e-06,3e-06,-8e-06,-3e-06,5e-06,-2e-06,-1.8e-05,-3e-06,-5e-06,0,2e-06,-2e-06,-1e-06,-2e-06,-1e-06,-6e-06,0,0,-2e-06
-1e-06,0,-3e-06,-3e-06,-4e-06,-2e-06,-5e-06,-1e-05,-9e-06,3e-06,-6e-06,-5e-06,-1e-06,1e-06,2e-06,0,2e-06,-1.2e-05,3e-06,1e-06,-2e-06,0,-2e-06,3e-06,0,1.4e-05,-1.7e-05,1e-06,-3e-06,8e-06,-4e-06,-4e-06,-2.1e-05,-7e-06,9.4e-05,5e-06,5e-06,-2.3e-05,-1.7e-05,-0.000136,-0.000216,0.000186,0.00032,0.000247,-0.000196,-9.9e-05,0.00044,0.00012,-7.3e-05,-8.2e-05,-9.5e-05,0.000144,3.7e-05,-3.6e-05,0.00011,0.000212,-0.000122,5.4e-05,9.1e-05,3e-05,7.8e-05,0.000124,2e-05,2.4e-05,-3.9e-05,-3.2e-05,2.3e-05,-0.000123,-2e-06,-3.7e-05,-9.2e-05,-6.1e-05,3.2e-05,-3.7e-05,-1.2e-05,7e-06,2e-06,-3e-06,1.5e-05,-7e-06,3.2e-05,4.6e-05,-1e-06,1.4e-05,1.1e-05,1e-06,4e-06,4e-06,1.1e-05,1.5e-05,3.5e-05,-1.4e-05,4.6e-05,-0.000108,1.1e-05,-5e-06,0,1e-05,-4e-06,7e-06,-3.3e-05,6e-06,2e-06,-3e-06,1.2e-05,7e-06,-1e-06,-1.4e-05,2.2e-05,0,3e-06,-5e-06,-5e-06,-1e-06,-1e-06,-2e-06,-2e-06,-2e-06,-1e-06,2e-06,-2e-06
5e-06,1e-06,-6e-06,4e-06,-4e-06,-4e-06,-1e-06,5e-06,-6e-06,-2e-06,-3e-06,-2e-06,-1e-06,-2e-06,0,-5e-06,-8e-06,1e-05,5e-06,1e-06,1e-06,-2e-06,1e-06,-2e-06,0,-3e-06,1.3e-05,8e-06,5e-06,-1e-05,5e-06,-1.9e-05,-1.7e-05,-2.1e-05,-0.000101,6e-06,-1e-06,3.9e-05,0.00015,0.000267,0.000154,-5.8e-05,-0.000314,0.000138,1.2e-05,0.000174,-0.00044,-4.3e-05,-7.3e-05,6.5e-05,-8.7e-05,-0.000176,4.3e-05,-1.9e-05,3.1e-05,-8.5e-05,0.000143,4e-06,5.7e-05,-2.4e-05,-3.2e-05,-0.000105,0.000191,-0.000159,-1e-05,-0.000111,1.9e-05,0.000148,-6.7e-05,-4.3e-05,6.1e-05,-1.3e-05,-1.8e-05,3.1e-05,1.3e-05,-3.8e-05,1.1e-05,2e-05,-1.5e-05,-2.1e-05,3e-06,4.8e-05,-4e-06,0,-2e-06,-3e-06,2e-06,-2e-06,-4e-06,1e-06,-5e-05,-1.2e-05,-1e-05,-3.1e-05,-9e-06,3e-06,-1.2e-05,-7e-06,-9e-06,-8e-06,2.2e-05,0,-6e-06,-3e-06,-1.1e-05,-2e-06,-6e-06,-6e-06,-3.4e-05,0,-2e-06,3e-06,1e-06,-5e-06,-1e-06,-5e-06,3e-06,-1e-06,-1e-06,-3e-06,-5e-06
2e-06,0,0,-2e-06,-1e-06,0,0,-1e-06,-7e-06,-1e-06,-4e-06,-2e-06,0,-1e-06,-2e-06,-1e-06,-6e-06,-3e-06,5e-06,-4e-06,-1e-06,0,8e-06,1e-06,1e-06,2e-06,-4e-06,-2e-06,3e-06,4e-06,-2e-06,1.5e-05,-1e-06,3.5e-05,1.8e-05,-4e-06,0,9e-06,-0.00025,0.00023,2.3e-05,-6.9e-05,0.000351,9.4e-05,5.5e-05,-2.2e-05,9.7e-05,-4.7e-05,0.000181,-8.3e-05,7.9e-05,7.1e-05,9.2e-05,-7e-05,-0.000103,6.5e-05,4.1e-05,4e-06,0.000117,-1.8e-05,3.3e-05,-3e-05,-8.9e-05,3.8e-05,4.7e-05,5e-05,-8.2e-05,-0.000145,1e-06,2.3e-05,-6.3e-05,4.1e-05,-3.4e-05,-3.1e-05,1.8e-05,-2.5e-05,-1.5e-05,-3.1e-05,7e-06,1e-06,-3e-06,1.6e-05,-4e-06,2e-06,2e-06,1e-06,-6e-06,2e-06,7e-06,-1.3e-05,1.6e-05,-5e-06,-5.1e-05,-1.6e-05,1.5e-05,-3.7e-05,6e-06,6e-06,-9e-06,6e-06,1.8e-05,3e-06,5e-06,2e-06,5e-06,-2e-06,4e-06,1e-06,1e-06,0,-3e-06,2e-06,4e-06,5e-06,0,-1e-06,-6e-06,3e-06,1e-06,1e-06,-5e-06
0,-1e-06,4e-06,0,0,-1e-06,-1e-06,-2e-06,-5e-06,1e-06,-7e-06,0,-1e-06,3e-06,3e-06,-4e-06,5e-06,-5e-06,4e-06,0,0,1e-06,-2e-06,-2e-06,0,2e-06,1e-06,-3e-06,-4e-06,-2e-06,0,-2e-06,1e-06,1.5e-05,3.4e-05,3e-06,-1e-06,6e-06,-0.000157,6.9e-05,-0.000132,2.7e-05,-0.000333,-2.3e-05,6e-05,8.6e-05,0.000131,4.9e-05,-0.000259,5.5e-05,2e-04,6.1e-05,7.6e-05,3.8e-05,3.8e-05,-0.000186,6e-05,-1.2e-05,-4.3e-05,-2.3e-05,-0.000119,-3.4e-05,7.5e-05,0.000148,-1e-05,8.8e-05,2e-05,9.8e-05,-8e-06,-6e-06,5.1e-05,4.3e-05,8.3e-05,-3.6e-05,-2.2e-05,2.4e-05,-1e-06,1.1e-05,1e-06,6e-06,-1.8e-05,-5.7e-05,-7e-06,-1.2e-05,-8e-06,-3e-06,1e-06,-2e-06,7e-06,-1.3e-05,-4e-05,-1e-06,8e-06,5.8e-05,3e-06,3.4e-05,1e-05,-9e-06,-4e-06,-5e-06,-3.5e-05,6e-06,1e-06,1e-06,0,2e-06,3e-06,8e-06,-8e-06,4e-06,2e-06,-2e-06,-2e-06,-4e-06,1e-06,-1e-06,3e-06,2e-06,0,0,-3e-06
1e-06,1e-06,1e-06,3e-06,-1e-06,-2e-06,-1e-06,-2e-06,-7e-06,-2e-06,-4e-06,3e-06,1e-06,-4e-06,6e-06,-5e-06,1e-06,6e-06,4e-06,1e-06,2e-06,0,0,1e-06,0,-1e-05,-1e-06,3e-06,0,-1e-06,1e-06,-9e-06,1.4e-05,-5.9e-05,-2e-06,-8e-06,0,5e-06,0.000408,-0.000129,-0.00016,-2.8e-05,0.000327,-0.000183,-1.6e-05,-6e-05,-0.000179,-3.5e-05,0.000194,-6.2e-05,-0.000136,0.000124,7e-05,-8e-06,-6.9e-05,5.9e-05,0.000114,2e-06,-1.4e-05,1.1e-05,0.000109,1.3e-05,8.3e-05,-0.000124,-8e-06,-3.7e-05,1e-06,-6.5e-05,4.5e-05,-8e-06,-4e-05,-2.1e-05,-3.4e-05,3e-06,-2.4e-05,1.7e-05,1.9e-05,-6e-06,-8e-06,0,-6e-06,-1.9e-05,-1e-06,7e-06,7e-06,2e-06,-6e-06,1e-06,6e-06,2e-06,-6e-06,1e-06,3.9e-05,4.6e-05,8e-06,1.2e-05,5e-06,7e-06,-7e-06,3e-06,9e-06,3e-06,-3e-06,1e-06,-1e-06,-2e-06,-1e-06,-5e-06,1e-06,-8e-06,-2e-06,-1e-06,2e-06,3e-06,0,-2e-06,-2e-06,3e-06,0,0,-3e-06
-3e-06,0,2e-06,-2e-06,-1e-06,1e-06,0,2e-06,-3e-06,-1e-06,-3e-06,3e-06,-1e-06,1e-06,4e-06,-3e-06,-7e-06,-2e-06,3e-06,1e-06,1e-06,0,-4e-06,0,0,4e-06,-1e-06,-3e-06,-7e-06,3e-06,0,1.9e-05,7e-06,3.9e-05,-1.5e-05,0,1e-06,5e-06,-4e-06,-0.000217,0.000147,5e-06,-5.5e-05,-0.000183,6.3e-05,5.2e-05,0.000216,1.3e-05,-2e-06,-3.5e-05,2.5e-05,-9e-05,-5.8e-05,1.6e-05,7.2e-05,1.1e-05,8.3e-05,-4.1e-05,-8.7e-05,-2e-06,-6.2e-05,5.6e-05,-2.3e-05,-5.6e-05,-2e-06,-5.7e-05,-1.7e-05,7.8e-05,-2.2e-05,-3.7e-05,2.7e-05,-3.2e-05,3.3e-05,-3e-05,-2.2e-05,-1e-06,0,2.5e-05,1e-05,4e-06,1e-06,2.5e-05,1e-06,3e-06,1e-06,-2e-06,0,0,-1e-06,1.1e-05,9e-06,-1e-06,-3e-06,9e-06,-1.5e-05,-1.1e-05,6e-06,-3e-06,-3e-06,-3e-06,-7e-06,-4e-06,1e-05,-3e-06,-2e-06,-1e-06,5e-06,2e-06,3e-06,1.1e-05,1e-06,3e-06,-4e-06,-1e-06,0,0,2e-06,0,0,0,-3e-06
-5e-06,0,-4e-06,1e-06,-1e-06,0,-4e-06,-4e-06,-7e-06,1e-06,-4e-06,2e-06,0,0,0,0,-1e-06,0,2e-06,-2e-06,-3e-06,0,-3e-06,0,0,-1e-06,4e-06,-4e-06,-6e-06,-2e-06,0,-1.2e-05,-7e-06,4e-06,-1.7e-05,-4e-06,-1e-06,-1e-06,-2.4e-05,-1.4e-05,6.6e-05,4.5e-05,-9.3e-05,-0.00012,-8.4e-05,-0.000115,5.4e-05,-2.1e-05,9.3e-05,-1.3e-05,-0.000104,3e-06,2.1e-05,-6.1e-05,1.8e-05,8.3e-05,-5.6e-05,1.3e-05,1.6e-05,-3.2e-05,5.9e-05,-2.3e-05,-0.000104,5.5e-05,1e-06,3e-05,-5e-06,-7.4e-05,1.9e-05,-5.9e-05,-3.4e-05,-1.3e-05,-3e-05,7e-06,-3e-06,1.6e-05,-1.6e-05,-2.2e-05,-8e-06,3e-06,-7e-06,4e-06,-3e-06,-6e-06,-1.5e-05,-2e-06,-5e-06,0,-2e-06,2e-06,4.2e-05,1e-06,-3e-05,-5.1e-05,-8e-06,0,-8e-06,1e-06,-6e-06,2e-06,-1e-05,1e-06,-7e-06,3e-06,3e-06,3e-06,3e-06,-8e-06,-4e-06,-1.2e-05,-2e-06,-2e-06,1e-06,-2e-06,-1e-06,0,1e-06,1e-06,0,0,-2e-06
-4e-06,0,-1e-06,0,-1e-06,-2e-06,-2e-06,6e-06,-5e-06,0,-7e-06,1e-06,1e-06,2e-06,-1e-06,1e-06,0,3e-06,-1e-06,0,3e-06,0,3e-06,0,0,-8e-06,-3e-06,4e-06,1e-06,1e-06,-1e-06,1e-05,-7e-06,-2.7e-05,2e-06,0,0,-1.7e-05,-1e-05,0.000107,-9.8e-05,-3e-06,0.000212,-1.5e-05,-9e-06,-3.9e-05,-0.000355,2.1e-05,-9.5e-05,-2.9e-05,0.000154,6.4e-05,5.8e-05,-3.6e-05,-5e-05,-1.9e-05,-4.6e-05,-4.4e-05,6.2e-05,-1.9e-05,-0.000101,5.4e-05,0.000121,2.7e-05,1.1e-05,1.2e-05,-1.5e-05,1.8e-05,1.1e-05,-1.9e-05,2.7e-05,2.7e-05,2e-06,-1.9e-05,2.9e-05,2e-06,-1e-06,9e-06,3e-06,6e-06,2e-06,-5e-06,-6e-06,0,1e-05,2e-06,1e-06,0,-3e-06,-1.1e-05,8e-06,1e-06,-1.1e-05,-3.1e-05,4e-06,6e-06,-6e-06,-2e-06,3e-06,-1e-06,1.4e-05,1e-06,1e-06,-4e-06,-3e-06,-1e-06,-2e-06,-8e-06,1.3e-05,1e-05,1e-06,-1e-06,-1e-06,0,0,-2e-06,-2e-06,-3e-06,0,0,-2e-06
-1e-06,1e-06,-1e-06,-1e-06,-1e-06,0,-2e-06,-1e-06,-5e-06,1e-06,-3e-06,0,-1e-06,-3e-06,2e-06,0,-2e-06,-3e-06,0,1e-06,-4e-06,-1e-06,2e-06,-2e-06,0,3e-06,2e-06,1e-06,9e-06,-2e-06,2e-06,8e-06,-1e-06,2.1e-05,-3.5e-05,-2e-06,0,2.2e-05,-2.7e-05,0.000133,-8e-05,1.2e-05,-0.00021,6.3e-05,-3e-06,0.000114,0.000354,-1e-06,-2.7e-05,-3e-05,5e-05,-4.9e-05,-0.00018,1.1e-05,6.5e-05,-6.4e-05,-2.8e-05,1.6e-05,8.5e-05,-4e-06,9e-05,6e-06,-9.9e-05,3.5e-05,-1.4e-05,0,-8e-06,-2.2e-05,1.4e-05,2e-05,-2.7e-05,1.8e-05,1.3e-05,4.9e-05,5e-06,-1.6e-05,8e-06,-5e-06,1e-06,-7e-06,9e-06,-1.3e-05,2e-06,-3e-06,-2e-06,3e-06,-3e-06,1e-06,-1e-06,-6e-06,-1.7e-05,2e-06,3.3e-05,-1.1e-05,0,-1.5e-05,-1e-05,3e-06,-7e-06,1e-06,-1.1e-05,-5e-06,3e-06,4e-06,4e-06,-1e-06,1e-06,5e-06,0,-8e-06,0,0,1e-06,-3e-06,0,-2e-06,1e-06,-1e-06,0,0,-3e-06
1e-06,-1e-06,2e-06,1e-06,-1e-06,0,-2e-06,-4e-06,-4e-06,1e-06,0,-1e-06,0,2e-06,2e-06,2e-06,-1e-06,0,-3e-06,-1e-06,1e-06,0,-1e-06,1e-06,0,-2e-06,-2e-06,-3e-06,3e-06,3e-06,0,-9e-06,0,-2e-06,-3e-06,2e-06,0,-1e-05,-1.5e-05,1.2e-05,0.00014,-1.1e-05,0.000187,0.000124,2.8e-05,-0.000119,-0.000438,-2.7e-05,0.000131,-1.3e-05,-0.000109,-5.9e-05,-2e-05,5.4e-05,-4.5e-05,-2.1e-05,-8e-05,-2e-06,-4.9e-05,2.5e-05,-1.7e-05,-4.4e-05,4.5e-05,-6.7e-05,4e-06,-3.5e-05,-2.2e-05,1.8e-05,-1.7e-05,-1.5e-05,2.1e-05,-1e-05,2e-06,6e-06,-1e-06,-6e-06,-3e-06,1.1e-05,-5e-06,-1e-06,6e-06,1.3e-05,3e-06,9e-06,-5e-06,3e-06,1e-06,0,-2e-06,4e-06,-1.7e-05,2e-06,1.3e-05,3e-05,1e-05,-3e-06,1e-06,-1e-06,2e-06,0,1.5e-05,-2e-06,-2e-06,-1e-06,-4e-06,2e-06,1e-06,4e-06,9e-06,6e-06,-1e-06,1e-06,-1e-06,1e-06,0,0,-2e-06,-3e-06,0,0,-2e-06
1e-06,0,2e-06,-1e-06,-1e-06,-1e-06,-2e-06,4e-06,-6e-06,0,-4e-06,-1e-06,0,0,0,1e-06,-1e-06,2e-06,-2e-06,-1e-06,0,0,4e-06,-1e-06,0,-1e-06,3e-06,0,-5e-06,-4e-06,-1e-06,1.3e-05,5e-06,3e-06,1.4e-05,1e-06,0,7e-06,-8e-06,-0.000134,-2e-05,-6.1e-05,-0.000133,0.000119,3.6e-05,0.000115,0.000502,4.7e-05,-0.00017,6e-06,-2.1e-05,3.8e-05,-3.7e-05,1.3e-05,3.2e-05,6e-06,-5.3e-05,-4e-06,-9.8e-05,-3.9e-05,-4e-06,-4.3e-05,-5.3e-05,-3.5e-05,5e-06,4.1e-05,-5e-06,0,-1.2e-05,2.1e-05,-2.3e-05,-1.7e-05,-2.4e-05,7e-06,-8e-06,0,-1e-05,-1.3e-05,6e-06,-8e-06,1e-06,3e-06,1e-06,-1e-06,0,-5e-06,0,0,-3e-06,4e-06,-2.7e-05,1e-06,-2.4e-05,4.2e-05,-8e-06,2e-06,6e-06,-1e-06,-4e-06,0,-4e-06,1e-06,0,0,3e-06,-1e-06,0,-5e-06,-9e-06,-5e-06,1e-06,0,3e-06,-1e-06,0,-1e-06,2e-06,-1e-06,0,0,-2e-06
2e-06,0,0,0,-1e-06,0,-1e-06,-1e-06,-5e-06,0,-5e-06,-1e-06,0,-1e-06,-1e-06,1e-06,-2e-06,-3e-06,-3e-06,0,1e-06,-1e-06,-4e-06,1e-06,0,5e-06,-3e-06,2e-06,-1e-06,3e-06,0,-4e-06,4e-06,-2e-05,-3.1e-05,2e-06,0,9e-06,4e-06,-0.000157,-3.2e-05,1.6e-05,0.000206,6.5e-05,-3e-06,-1.6e-05,-0.000251,-4.8e-05,3.2e-05,-2.3e-05,-6.5e-05,-2.4e-05,9.1e-05,-1.1e-05,-2.2e-05,6.8e-05,-1e-06,5e-06,-4e-06,-1.7e-05,-3e-05,2.5e-05,5.9e-05,7.9e-05,-3e-06,-2.6e-05,-2.3e-05,-3e-06,1e-06,6e-06,1.8e-05,-3e-06,7e-06,-3e-06,-2e-06,-1.1e-05,2e-06,2e-06,-4e-06,1e-06,-4e-06,7e-06,-4e-06,-6e-06,1e-06,1e-06,-3e-06,0,3e-06,-2e-06,1.2e-05,2e-06,-1.5e-05,9e-06,0,3e-06,-1e-06,1e-06,-3e-06,0,-1e-05,2e-06,3e-06,-1e-06,-2e-06,-1e-06,2e-06,4e-06,8e-06,3e-06,-1e-06,-1e-06,-1e-06,0,0,-3e-06,-1e-06,-2e-06,0,0,-3e-06
-1e-06,0,-1e-06,1e-06,0,0,-1e-06,-3e-06,-5e-06,0,-3e-06,-1e-06,0,0,0,0,-2e-06,3e-06,-2e-06,1e-06,-2e-06,0,0,-1e-06,0,-3e-06,0,-2e-06,3e-06,-2e-06,1e-06,0,-2e-06,1.4e-05,3.9e-05,1e-06,0,-3e-06,-6.7e-05,2e-05,-4.8e-05,5.1e-05,-0.000186,-2e-06,-2.4e-05,-1.1e-05,4.7e-05,1.9e-05,-1.8e-05,-9e-06,0.000138,-8.3e-05,-3.4e-05,-1.7e-05,-4.8e-05,-1.5e-05,-7.2e-05,2.3e-05,3.5e-05,7e-06,1.3e-05,2.8e-05,-6.1e-05,2.6e-05,-1.4e-05,-1.2e-05,-2e-06,1.9e-05,-1.1e-05,-3e-06,-1.8e-05,1.7e-05,8e-06,-1.9e-05,9e-06,5e-06,8e-06,0,1e-06,-3e-06,-3e-06,1.3e-05,0,5e-06,3e-06,-3e-06,2e-06,0,2e-06,-3e-06,2.3e-05,1e-06,1.6e-05,-2.8e-05,-2e-06,-6e-06,0,0,-3e-06,-1e-06,1.1e-05,-2e-06,-6e-06,0,2e-06,2e-06,2e-06,-5e-06,-9e-06,-2e-06,2e-06,0,-1e-06,1e-06,0,-2e-06,1e-06,2e-06,0,-1e-06,-2e-06
-1e-06,0,-3e-06,-1e-06,0,-1e-06,-1e-06,2e-06,-4e-06,0,-2e-06,0,0,1e-06,0,-1e-06,1e-06,0,-2e-06,-1e-06,2e-06,0,-3e-06,0,0,2e-06,0,-1e-06,3e-06,1e-06,0,6e-06,-3e-06,1.7e-05,-2.5e-05,0,0,5e-06,5.9e-05,0.00018,8.4e-05,-1.6e-05,0.000154,-6.6e-05,-6e-06,-2.7e-05,-1.4e-05,2.3e-05,2.6e-05,-1e-06,-4.4e-05,1.7e-05,-1.4e-05,2.3e-05,5.3e-05,-2.2e-05,-5.3e-05,-1.7e-05,5e-05,-1.4e-05,2.4e-05,4.5e-05,3.2e-05,-4.1e-05,6e-06,1.9e-05,4e-06,-4.2e-05,1.8e-05,5.1e-05,1.4e-05,4e-06,-1.5e-05,8e-06,1.4e-05,1.2e-05,-4e-06,3e-06,2e-06,5e-06,2e-06,-1.1e-05,2e-06,-4e-06,-4e-06,2e-06,-5e-06,0,0,-1e-06,1.9e-05,1e-06,2.1e-05,-3.4e-05,0,1.4e-05,-5e-06,0,-3e-06,1e-06,-1.2e-05,2e-06,3e-06,0,-2e-06,-2e-06,0,-6e-06,0,1e-06,-1e-06,0,0,-2e-06,0,0,0,0,0,1e-06,-2e-06
0,0,0,0,-1e-06,0,0,1e-06,-4e-06,-1e-06,-4e-06,0,0,0,-1e-06,-1e-06,-3e-06,-1e-06,-1e-06,0,-1e-06,-1e-06,0,0,0,4e-06,2e-06,2e-06,0,-1e-06,-1e-06,-7e-06,-2e-06,-3.7e-05,-2e-06,-2e-06,0,-9e-06,-1.1e-05,0.000131,5e-05,-1.8e-05,-3.4e-05,-0.000103,-8e-06,-2.3e-05,-9.7e-05,-5.4e-05,-4.1e-05,-2.5e-05,-3.1e-05,4e-06,9.1e-05,3.9e-05,-2.8e-05,-7.2e-05,4e-06,8e-06,1.6e-05,0,-1e-05,-6e-06,5.7e-05,-3.1e-05,4e-06,-1e-06,-1.8e-05,5.1e-05,-4e-06,1e-06,-1.3e-05,-1e-05,-4e-06,-2.5e-05,4e-06,-2e-06,-5e-06,0,-4e-06,1e-06,-5e-06,-1.3e-05,0,6e-06,-5e-06,0,1e-06,0,0,0,1e-06,0,-1.1e-05,-1.1e-05,-1e-06,-9e-06,2e-06,-1e-06,-5e-06,-1e-06,1e-05,3e-06,1e-06,-1e-06,0,0,2e-06,3e-06,-3e-06,1e-06,1e-06,-1e-06,-1e-06,1e-06,0,-1e-06,0,2e-06,0,0,-2e-06
-2e-06,0,1e-06,1e-06,-1e-06,0,0,-2e-06,-4e-06,0,-4e-06,0,0,-1e-06,-1e-06,-1e-06,-3e-06,1e-06,0,1e-06,0,0,2e-06,0,0,-3e-06,-3e-06,0,1e-06,1e-06,1e-06,3e-06,1e-06,2.4e-05,8e-06,-1e-06,0,1e-05,-2.9e-05,-5.7e-05,-1e-04,-3e-06,-5.5e-05,-0.000105,6e-06,3.2e-05,3.8e-05,5.8e-05,1.3e-05,-1.8e-05,-4.9e-05,-5.3e-05,4.5e-05,1.5e-05,4.2e-05,4e-05,-4e-06,1.3e-05,-7e-06,-1.9e-05,9e-06,-4.2e-05,-2.9e-05,2.8e-05,1.5e-05,-1.1e-05,6e-06,-2.2e-05,2e-06,2e-06,9e-06,-1e-05,8e-06,1.5e-05,-8e-06,4e-06,7e-06,-7e-06,3e-06,4e-06,-2e-06,-1.8e-05,-3e-06,-6e-06,2e-06,1e-06,-3e-06,0,3e-06,0,-2.4e-05,0,-2.5e-05,1.9e-05,4e-06,-3e-06,3e-06,2e-06,-1e-06,1e-06,0,-2e-06,-5e-06,2e-06,1e-06,2e-06,2e-06,-1e-06,-5e-06,-4e-06,0,0,1e-06,-1e-06,0,-2e-06,0,0,0,0,-2e-06
0,0,2e-06,-1e-06,-1e-06,-1e-06,-1e-06,3e-06,-5e-06,0,-2e-06,0,0,2e-06,0,-1e-06,1e-06,-2e-06,1e-06,0,1e-06,0,2e-06,0,0,3e-06,4e-06,-1e-06,-2e-06,-1e-06,0,-2e-06,4e-06,6e-06,-4.5e-05,0,0,-1.4e-05,3.5e-05,-0.000155,1.6e-05,-6e-06,0.000146,-5.6e-05,2.1e-05,-4.7e-05,0.000161,-3.7e-05,4.9e-05,5e-06,3.8e-05,-5.1e-05,-3e-06,-3.6e-05,-7e-06,1.5e-05,-1e-06,-1.9e-05,-4.5e-05,-8e-06,-3.9e-05,-1.4e-05,9e-06,1.5e-05,-9e-06,-9e-06,1.2e-05,1.3e-05,3e-06,3e-06,-1e-05,2e-06,5e-06,0,-7e-06,6e-06,1e-06,7e-06,-2e-06,0,1e-06,9e-06,-2e-06,2e-06,5e-06,1e-06,-2e-06,0,0,1e-06,-1.2e-05,0,1.1e-05,3.9e-05,2e-06,0,6e-06,-2e-06,-6e-06,-2e-06,5e-06,-1e-06,4e-06,-1e-06,-1e-06,-2e-06,0,-1e-06,5e-06,5e-06,0,0,-1e-06,0,0,-1e-06,-1e-06,1e-06,0,0,-2e-06
0,0,1e-06,0,-1e-06,0,-1e-06,-1e-06,-5e-06,0,-3e-06,0,0,-2e-06,1e-06,-1e-06,-1e-06,1e-06,1e-06,-1e-06,0,0,-2e-06,-1e-06,0,-1e-06,-4e-06,2e-06,-5e-06,1e-06,-1e-06,-3e-06,2e-06,-2.2e-05,3.1e-05,0,1e-06,1.4e-05,3.6e-05,-6.3e-05,6.8e-05,3e-05,-0.000138,1.5e-05,4e-06,4.6e-05,-0.000207,-1.7e-05,-6.2e-05,-2.7e-05,0.00011,3.3e-05,-5.7e-05,-2.9e-05,-1.8e-05,7.1e-05,7.8e-05,3e-06,-4.7e-05,0,3.9e-05,-6e-06,-3e-05,-6e-06,-8e-06,2.2e-05,-1e-06,-2.5e-05,5e-06,-2e-05,8e-06,1e-05,-8e-06,-1.1e-05,-7e-06,-5e-06,-8e-06,-2e-06,0,0,3e-06,1.8e-05,0,2e-06,-7e-06,-2e-06,1e-06,0,-2e-06,0,-9e-06,0,2.3e-05,1.1e-05,-5e-06,0,2e-06,2e-06,-1e-06,2e-06,2e-06,1e-06,-2e-06,0,-2e-06,1e-06,1e-06,1e-06,-5e-06,-7e-06,0,0,1e-06,0,0,0,1e-06,-2e-06,0,0,-2e-06
-1e-06,0,-1e-06,0,0,0,-1e-06,-2e-06,-4e-06,0,-3e-06,1e-06,0,1e-06,0,0,0,1e-06,2e-06,0,-1e-06,0,2e-06,1e-06,0,-3e-06,6e-06,0,0,0,0,2e-06,-2e-06,1.1e-05,-3.7e-05,1e-06,0,-8e-06,9e-06,6.3e-05,8e-06,5e-06,0.000157,8.3e-05,-9e-06,-5e-06,0.000339,3.9e-05,3.5e-05,-3e-06,-7.7e-05,-9e-06,-1.5e-05,0,3.2e-05,-6e-05,5.1e-05,1.6e-05,1.9e-05,-1.4e-05,-2.7e-05,1.6e-05,4.3e-05,-9e-06,2e-06,4e-06,1e-06,2.5e-05,1e-06,-7e-06,-9e-06,-3e-06,4e-06,1.8e-05,4e-06,-7e-06,-1e-06,8e-06,2e-06,-3e-06,-1e-06,-5e-06,-1e-06,-3e-06,-3e-06,0,-3e-06,0,-1e-06,-1e-06,9e-06,0,-4e-06,-1.7e-05,3e-06,-2e-06,-6e-06,-2e-06,-3e-06,-2e-06,-6e-06,-1e-06,-3e-06,-1e-06,3e-06,1e-06,1e-06,-1e-06,7e-06,7e-06,-1e-06,0,-1e-06,-1e-06,0,-1e-06,0,0,0,-1e-06,-2e-06
