0.076718,0.076309,0.069457,0.070086,0.074973,0.076162,0.066249,0.050428,0.0482,0.056748,0.056849,0.061269,0.070858,0.068018,0.063661,0.061032,0.052226,0.048382,0.052873,0.053554,0.051581,0.047028,0.044171,0.043362,0.044422,0.053641,0.056186,0.049864
0.107214,0.105097,0.092473,0.095012,0.106618,0.109628,0.093449,0.067131,0.061695,0.073494,0.075076,0.084149,0.099086,0.094659,0.087552,0.082722,0.069112,0.063916,0.070294,0.070123,0.065392,0.058783,0.057986,0.057568,0.058269,0.072316,0.076232,0.068621
0.168951,0.164007,0.139409,0.143888,0.168167,0.175348,0.147182,0.100091,0.087379,0.105196,0.111107,0.130583,0.155615,0.147592,0.134363,0.124536,0.101818,0.093525,0.103703,0.102925,0.093254,0.082139,0.084937,0.084928,0.084558,0.108115,0.116004,0.106852
0.230382,0.223587,0.186817,0.190663,0.226887,0.239799,0.199881,0.132492,0.112475,0.134481,0.145734,0.176782,0.210156,0.198385,0.179345,0.164043,0.13338,0.122204,0.135244,0.135609,0.12289,0.106806,0.11217,0.112249,0.110256,0.142569,0.15593,0.146816
0.257447,0.25149,0.208783,0.208116,0.247886,0.265473,0.222303,0.150761,0.131853,0.151423,0.162959,0.198268,0.230479,0.216968,0.196555,0.179161,0.148846,0.138989,0.152115,0.154684,0.143132,0.124235,0.128586,0.128953,0.124876,0.156724,0.173495,0.167265
0.238997,0.235795,0.200891,0.191998,0.218321,0.236312,0.206718,0.157172,0.150847,0.161559,0.166209,0.191352,0.208228,0.196041,0.181457,0.16549,0.142371,0.14063,0.152973,0.157843,0.149886,0.13208,0.133297,0.136343,0.130992,0.146722,0.161696,0.160783
0.241141,0.236603,0.220444,0.202137,0.201164,0.215017,0.205899,0.18582,0.198268,0.203269,0.193212,0.201444,0.203031,0.196435,0.187074,0.164432,0.146168,0.156471,0.172805,0.179343,0.170551,0.155742,0.158844,0.164034,0.154972,0.150733,0.161147,0.164312
0.353744,0.352668,0.33674,0.294943,0.273806,0.293227,0.287306,0.273322,0.302938,0.305736,0.28112,0.28505,0.277661,0.268129,0.256926,0.221437,0.197435,0.20812,0.237176,0.263218,0.256561,0.23332,0.245633,0.253269,0.223878,0.204282,0.208438,0.216447
0.561272,0.582257,0.556156,0.471992,0.42643,0.460967,0.459665,0.443344,0.486569,0.488312,0.457896,0.460543,0.440029,0.423028,0.402209,0.348005,0.304161,0.298125,0.359638,0.445761,0.443012,0.384827,0.404652,0.414722,0.349136,0.315022,0.311537,0.324712
0.844567,0.915108,0.865097,0.713515,0.642788,0.712471,0.724158,0.702337,0.772866,0.77559,0.733743,0.735343,0.7052,0.66894,0.624788,0.549627,0.471471,0.445902,0.565414,0.739657,0.732448,0.612113,0.632919,0.646259,0.546166,0.49239,0.475875,0.499453
1.143977,1.30178,1.218535,0.974372,0.876581,1.0115,1.046864,1.012086,1.118069,1.114346,1.045604,1.054623,1.028569,0.962113,0.895485,0.806646,0.677751,0.627219,0.820548,1.0958,1.082212,0.881834,0.880012,0.891858,0.777555,0.709421,0.683632,0.731191
1.353666,1.5943,1.470453,1.141862,1.034193,1.240663,1.299152,1.25476,1.372202,1.339082,1.240312,1.266958,1.269019,1.182574,1.109875,1.023504,0.854215,0.783921,1.025273,1.367747,1.360859,1.09595,1.029601,1.031475,0.949975,0.897081,0.863062,0.935155
1.338564,1.579225,1.448116,1.105381,1.006235,1.227345,1.291628,1.26394,1.346589,1.270803,1.178608,1.225702,1.260555,1.183035,1.122651,1.056926,0.889757,0.821155,1.042543,1.360289,1.384336,1.130682,0.979295,0.961609,0.95302,0.936667,0.901137,0.987094
1.02151,1.190174,1.123736,0.872001,0.787084,0.936556,0.978274,0.979235,1.004497,0.931796,0.905493,0.960582,0.986788,0.916438,0.874278,0.848711,0.737593,0.697559,0.844072,1.046337,1.102777,0.953687,0.765651,0.714984,0.76166,0.778211,0.75591,0.841579
0.679316,0.775459,0.776192,0.623539,0.561883,0.647381,0.667539,0.643981,0.624003,0.649338,0.732517,0.798537,0.766275,0.636986,0.598959,0.626893,0.57192,0.572189,0.660483,0.710407,0.793548,0.829055,0.697394,0.581988,0.588921,0.595566,0.585872,0.656323
0.713702,0.769545,0.747073,0.606798,0.595898,0.72148,0.745856,0.661205,0.588842,0.703499,0.923509,1.048253,0.935292,0.668873,0.652378,0.748126,0.639001,0.673455,0.842708,0.807775,0.907313,1.07208,0.945606,0.73963,0.692103,0.643121,0.628427,0.724046
0.963482,1.041439,0.966582,0.763854,0.80608,1.007489,0.999729,0.889608,0.820271,0.954946,1.216329,1.363204,1.18476,0.840225,0.877103,1.031138,0.871711,0.910086,1.164393,1.140346,1.269773,1.484525,1.304109,0.991967,0.904571,0.807641,0.786717,0.91829
1.14162,1.246427,1.119802,0.889745,0.991299,1.249624,1.22341,1.155284,1.144996,1.230756,1.422332,1.527767,1.297417,0.949212,1.063183,1.272667,1.091992,1.101608,1.402148,1.478668,1.612369,1.768703,1.537489,1.17331,1.062876,0.945284,0.9235,1.00467
1.225632,1.335191,1.147199,0.946895,1.08584,1.353767,1.351204,1.374686,1.459569,1.458109,1.571668,1.634612,1.323289,0.980471,1.14938,1.385317,1.262718,1.257609,1.522937,1.720508,1.751749,1.727966,1.541363,1.24213,1.087291,0.988269,1.022986,0.980004
1.270872,1.396495,1.193204,0.984061,1.062891,1.29279,1.359686,1.438548,1.590088,1.572232,1.725887,1.821649,1.340751,0.952158,1.139687,1.348829,1.372044,1.439306,1.6351,1.867071,1.718977,1.492275,1.45945,1.304407,1.056161,0.995051,1.158563,1.024256
1.270829,1.426971,1.266939,1.041488,0.96372,1.089974,1.241229,1.308292,1.439485,1.518806,1.75848,1.868097,1.283856,0.867174,1.032296,1.204939,1.364726,1.465147,1.541046,1.8461,1.674772,1.273994,1.378162,1.373898,1.037821,0.991833,1.222911,1.055096
1.181707,1.332975,1.23906,1.041055,0.830317,0.796637,0.977525,1.05203,1.106723,1.263411,1.521965,1.578466,1.099715,0.769645,0.864789,0.967269,1.130604,1.202466,1.191615,1.595272,1.565779,1.10279,1.226813,1.301604,0.94369,0.875219,1.057568,0.922694
0.94597,1.051262,1.054872,0.910592,0.69593,0.658118,0.80739,0.857668,0.853778,0.97717,1.107525,1.08316,0.826777,0.63242,0.66044,0.717688,0.791259,0.807236,0.793169,1.17168,1.251629,0.874809,0.968738,1.040377,0.74251,0.64477,0.706658,0.654822
0.740003,0.736047,0.762549,0.689601,0.541424,0.569116,0.708397,0.707752,0.652181,0.712885,0.767242,0.728222,0.588181,0.461347,0.469558,0.553652,0.5748,0.522601,0.515415,0.733177,0.842384,0.690248,0.72781,0.728286,0.554177,0.475728,0.484583,0.487316
0.691689,0.645395,0.639358,0.552508,0.462557,0.545351,0.7201,0.67505,0.606799,0.618753,0.647233,0.655687,0.50304,0.382586,0.44908,0.604165,0.560278,0.421892,0.437315,0.561885,0.701518,0.691777,0.614296,0.570914,0.511984,0.448706,0.464083,0.482798
0.783721,0.774595,0.720485,0.586347,0.515203,0.599101,0.841496,0.830786,0.744637,0.681626,0.688363,0.777891,0.595325,0.411662,0.526296,0.74936,0.653899,0.485737,0.537484,0.697531,0.864726,0.835857,0.670561,0.593464,0.570098,0.529136,0.548981,0.551786
0.890133,0.867279,0.789806,0.669413,0.607424,0.654673,0.916163,0.976607,0.950063,0.842813,0.76548,0.878824,0.710259,0.478316,0.609061,0.836021,0.723883,0.602169,0.698911,0.922923,1.049515,0.94292,0.797837,0.747293,0.72869,0.670737,0.642677,0.624996
0.842128,0.78464,0.780908,0.726023,0.624761,0.610021,0.86111,1.024927,1.135823,1.013491,0.760883,0.812445,0.715011,0.527225,0.663745,0.811779,0.694316,0.649954,0.811927,1.103711,1.104368,0.883507,0.834941,0.872889,0.871915,0.794538,0.730809,0.674095
0.625654,0.546678,0.660858,0.72182,0.593406,0.529525,0.782428,0.989658,1.173282,1.121557,0.758982,0.684953,0.618935,0.520835,0.699973,0.793431,0.648875,0.607823,0.815093,1.116815,1.002912,0.747805,0.785731,0.87877,0.872724,0.801172,0.765436,0.695729
0.434645,0.357429,0.503594,0.659414,0.579092,0.504823,0.723529,0.874829,1.021951,1.061875,0.767933,0.59688,0.486254,0.465776,0.670449,0.744316,0.641219,0.563671,0.687685,0.898409,0.824377,0.706026,0.736719,0.769954,0.735766,0.724623,0.779165,0.675633
0.386782,0.286751,0.365616,0.503711,0.492527,0.442545,0.573635,0.663858,0.775079,0.836923,0.694276,0.502206,0.362749,0.401361,0.553313,0.575833,0.559944,0.512936,0.492482,0.555707,0.564776,0.578395,0.613719,0.640558,0.599345,0.618303,0.715304,0.566708
0.383293,0.24049,0.256107,0.343849,0.386688,0.379721,0.402831,0.435281,0.573529,0.617828,0.554614,0.384098,0.272363,0.359441,0.412169,0.367382,0.421853,0.398837,0.293163,0.301737,0.361414,0.409205,0.475152,0.514415,0.486788,0.524583,0.606412,0.478164
0.351098,0.212368,0.191791,0.241286,0.291268,0.296716,0.288736,0.291676,0.396813,0.428369,0.412462,0.291758,0.202358,0.277343,0.303203,0.279988,0.316661,0.290476,0.212868,0.211136,0.24732,0.298318,0.367865,0.389242,0.366711,0.401341,0.470562,0.417784
0.28398,0.18709,0.155924,0.196263,0.220438,0.21747,0.230354,0.230572,0.284486,0.308278,0.291187,0.228053,0.15002,0.179799,0.223409,0.238789,0.221559,0.200707,0.188774,0.187062,0.20321,0.234553,0.260014,0.253484,0.248833,0.296793,0.362838,0.329965
0.195898,0.164415,0.133241,0.154468,0.165563,0.14804,0.161455,0.166323,0.192669,0.241195,0.208961,0.148132,0.10547,0.137358,0.192071,0.195367,0.145545,0.136106,0.156601,0.164395,0.192007,0.191359,0.176826,0.16152,0.179073,0.256233,0.304151,0.237325
0.125092,0.151962,0.148984,0.151522,0.154818,0.118899,0.121232,0.126329,0.126152,0.179938,0.157284,0.10114,0.093983,0.137573,0.197089,0.196989,0.140525,0.120229,0.138499,0.170032,0.196502,0.169986,0.18538,0.208884,0.210276,0.237113,0.246414,0.179586
0.082771,0.133501,0.163206,0.161679,0.175498,0.144344,0.13329,0.126019,0.119658,0.148648,0.135123,0.097927,0.086186,0.124298,0.184955,0.190553,0.140947,0.108104,0.12483,0.203204,0.24888,0.201327,0.234618,0.293563,0.295539,0.27882,0.215127,0.139894
0.075684,0.109704,0.147307,0.144895,0.176678,0.175052,0.160555,0.132031,0.137094,0.159479,0.127093,0.091093,0.074349,0.114961,0.152484,0.150836,0.117189,0.090988,0.122587,0.232084,0.296993,0.248316,0.280369,0.352376,0.367519,0.328608,0.220669,0.126007
0.078966,0.082686,0.106271,0.102441,0.146117,0.178278,0.176336,0.141336,0.147159,0.17586,0.132356,0.085405,0.070953,0.10957,0.124976,0.108254,0.087486,0.074655,0.110452,0.225721,0.296382,0.258942,0.280132,0.344858,0.375632,0.332862,0.225629,0.113843
0.081407,0.062164,0.067137,0.067878,0.099167,0.145879,0.163162,0.131382,0.1311,0.166971,0.120592,0.074183,0.066433,0.09512,0.112009,0.092827,0.086759,0.076795,0.085486,0.179076,0.239323,0.215699,0.224255,0.266606,0.305305,0.269714,0.193101,0.088432
