-0.00698,-0.00679,-0.005735,-0.002324,-0.004078,-0.001604,-0.005904,-0.008539,-0.004376,-0.003446,-0.003965,-0.004452,-0.00859,-0.007072,-0.004292,-8.3e-05,-0.002869,-0.002226,-0.00557,-0.002863,-0.003179,-0.002135,-0.003162,-0.000516,-0.007195,-0.009559,-0.004966,-0.000831,-0.003625,-0.004457,-0.005393,-0.002876,0.001112,0.00124,-0.00438,-0.004115,-0.005236,-0.005678,-0.007838,-0.003378,-0.004794,-0.005017,-0.001049,0.003221,-0.006725,-0.004137,-0.006475,-0.003371,-0.004176,-0.003137,-0.004129,-0.005602,-0.000546,-0.001193,-0.006316,-0.006312,-0.005581,-0.010213,-0.006787,-0.006702,-0.00371,-0.003699,-0.002939,4.6e-05,-0.001803,-0.005418,-0.00045,-0.002193,-0.002615,0.001796,-0.007152,-0.004498,-0.003895,-0.004242,-0.001662,-0.002317,-0.00127,-0.000335,7e-04,0.000379,0.000808,-0.006414,-0.007235,-0.002948,-0.002964,-0.006577,-0.003674,-0.000931,-0.007907,-0.005839,-0.003398,-0.000848,-0.003222,-0.005998,-0.002438,-0.003851,-0.004993,-0.005434,-0.001537,-0.001872,-0.001987,-0.000182,-0.003821,-0.004484,-0.001912,-0.002244,-0.003759,-0.002586,-0.001297,-0.001912,-0.004102,-0.004564,-0.001214,-0.005805,-0.006254,-0.00317,-0.005192,-0.003935,-0.007685,-0.004486,-0.003314
0.000622,0.002776,-0.000984,-0.002822,-0.001544,0.001161,0.004453,0.005662,0.000951,-0.001117,-0.000206,0.001101,0.001239,0.004345,0.00338,-0.003981,0.002354,0.00037,0.00223,-0.000692,-0.000955,-0.001613,0.000865,0.001138,0.002026,0.00198,0.00166,0.003138,0.001684,0.001786,-0.000658,-0.001544,0.001018,-0.003265,-0.008748,-0.002222,-0.001185,-0.000368,0.002551,0.002076,-0.000928,-0.000893,0.001532,-0.001362,-0.001196,-0.002029,3.2e-05,-0.003856,-0.000937,-0.000122,-0.002102,0.001325,-0.001034,-0.003443,-0.001352,0.003856,-0.001854,0.003223,0.002567,0.000347,-0.004959,-0.00278,-0.002065,3.9e-05,-0.007006,-0.00162,-0.002268,-0.00418,-0.001029,-0.005532,0.000659,0.001573,0.001606,0.003425,-0.000421,-0.00347,-0.003403,0.000495,-0.001714,-0.002438,-0.001522,0.002993,0.001057,-0.001478,-0.000583,0.003535,0.000983,0.001774,0.003123,0.003683,-0.000199,-0.000845,0.000912,0.001191,-0.001279,-0.000684,0.00044,0.001953,-0.001637,-0.00647,-0.007674,-0.003212,0.001664,-0.000297,0.000949,0.001325,0.000661,-0.000232,-0.003741,-0.00255,-0.000584,-0.001363,-0.001209,0.001532,0.000928,-0.000916,-0.000836,-0.001103,0.00227,0.00128,0.000164
-0.001161,-0.002985,0.001346,0.00087,-0.000595,-0.000422,-0.000995,-0.004995,-0.002382,-0.000176,-0.002541,-0.001609,-0.001177,-0.004128,-0.003187,-0.002668,-0.002331,-0.001518,-0.003415,-0.000628,-0.001867,-0.001716,-0.001054,-0.001303,-0.001503,-0.001712,-0.002095,-0.004602,-0.003778,-0.002914,-0.002189,-0.003859,-0.001738,-0.000839,0.001135,-0.002484,-0.003508,-0.003085,-0.004258,-0.006286,-0.000897,-0.00114,-0.005738,-0.00264,-0.005517,-0.002503,-0.003338,0.001233,-0.00342,-0.009763,-0.004683,-0.004196,-0.002886,-0.001342,-0.008854,-0.005858,0.00121,-0.004538,-0.007299,-0.006371,-0.003938,-0.00293,-0.001078,-0.001543,-0.000832,-0.003187,-0.000547,-0.001309,-0.005235,0.000219,-0.005441,-0.00274,-0.002251,-0.003718,-0.00495,-7e-04,-0.005474,-0.004227,-0.006255,-0.002036,-0.001069,-0.00482,-0.0034,-0.003998,-0.002314,-0.007265,-0.005404,-0.002551,-0.003581,-0.005542,-0.001766,-0.001034,-0.002298,-0.003951,-0.002204,-0.001114,-0.001316,-0.002669,-0.00104,-0.000683,-0.000687,-0.003094,-0.002841,-0.001954,-0.001638,-0.000596,-0.000135,-0.002318,-0.001406,-0.00196,-0.000958,-0.000173,-0.000371,-0.001645,-0.0013,-0.004598,-0.001696,6.5e-05,-0.001632,-0.00185,-0.001677
0.002706,0.000684,-0.003097,-0.000674,0.000762,-0.001421,-0.000308,0.004194,0.003277,0.002875,-0.000619,0.000575,0.001984,0.004163,0.00269,0.000182,-0.000176,0.003127,0.001057,0.000971,0.003748,-0.000114,-0.000315,0.001637,0.001541,0.000874,0.000734,0.000784,0.002175,-0.0022,0.003367,0.003156,0.001483,0.001858,0.005746,0.002491,0.002389,0.003252,0.002384,0.001579,-0.000562,0.004057,0.000162,0.003993,0.001325,-0.00056,-0.00231,0.001614,0.003267,0.001127,0.005349,0.004228,0.002014,0.001898,0.006372,0.005382,0.002508,0.003608,0.00757,0.004717,0.001708,0.00282,0.001679,0.002522,0.006106,0.00302,0.002009,0.005873,0.002057,0.002962,0.001979,6.7e-05,-0.000943,-0.000786,-0.001121,-0.003946,0.001711,0.002194,0.002048,0.000402,0.000159,-0.000511,-0.001203,0.000932,0.002023,0.002038,0.002273,0.000252,0.000318,0.001961,-0.000864,-0.002161,-0.000968,0.000947,0.000261,0.001763,0.000545,-0.000822,-0.000594,0.000909,0.001147,-0.000386,0.003269,-0.000143,0.000205,-0.001716,-0.002566,-0.000524,0.001195,0.001913,0.002944,0.003597,-0.001153,0.00188,0.004016,0.003651,0.002851,0.000774,0.00084,0.000634,0.000454
-0.003784,-0.00136,0.001954,-0.001773,-0.002009,-0.000316,-0.000884,-0.002928,-0.003439,-0.00273,-0.000564,-0.000884,-0.001634,-0.003615,-0.002641,-0.001468,0.000696,-0.001,-0.002018,-0.002474,-0.002093,0.000531,-0.002421,-0.003031,-0.003668,-0.003429,-0.002545,-0.001817,-0.0012,0.000693,-0.002813,0.000804,-0.001083,0.000835,-0.002064,0.001453,-0.000929,-0.00286,-0.005332,-0.003899,-0.000273,-0.002662,0.000525,9e-06,0.001442,0.001306,0.002366,-0.001948,0.001166,0.000984,-0.004792,-0.003581,-0.002442,-0.001897,3.4e-05,-0.001868,-0.000481,0.001936,-0.004695,0.001469,0.002673,0.001458,0.001706,-0.004021,-0.00377,-0.000744,-0.001613,-0.002637,-5.8e-05,-0.001999,-0.003445,-0.003964,-0.003549,-0.001228,0.001484,0.001598,-0.001561,-0.00461,-0.002045,-0.002394,-0.003651,-0.000882,0.001019,-0.001286,-0.004713,-0.001822,-0.003479,-0.002463,-0.002437,-0.002009,-0.001227,-0.002728,-0.000624,-0.002726,-0.003913,-0.002734,-0.00222,-0.001127,-0.001438,-0.002383,0.000541,0.002034,-0.002315,-0.000683,-0.002288,-0.000309,-0.000462,-0.000444,-0.002246,-0.003364,-0.003243,-0.00406,0.000531,-0.001602,-0.003033,-0.00032,-0.002034,-0.000748,0.000154,-0.000462,-0.001446
6.8e-05,0.002348,0.000153,0.00113,0.002347,0.000374,-0.000141,0.001544,0.002815,0.000385,0.000814,0.001625,0.001419,0.001257,0.001419,0.002094,2e-04,-0.002125,-0.000369,0.000602,-0.001827,-0.001178,0.001436,-0.001287,-0.000809,0.002292,0.001008,-0.000453,-0.000255,9.8e-05,7e-06,0.000237,0.00047,-4.7e-05,-0.000969,-0.001807,0.00315,0.002287,0.00262,0.00291,-0.00131,1.5e-05,0.000536,-0.000601,-0.002023,-0.000867,0.004225,0.001206,0.00092,0.000631,0.00119,0.001083,0.001068,-0.002063,0.001573,-0.002899,-0.001152,-0.001737,0.001978,-0.000966,-0.002063,-0.000145,-0.000346,0.000952,0.000157,-0.0023,0.000441,-0.000558,0.000445,-0.001262,0.000634,0.003312,0.003473,-0.000339,-0.001181,0.001467,-0.001892,-0.001408,0.000814,-0.000233,0.000291,-7.2e-05,-0.001935,-0.000705,0.000422,0.000115,0.001327,-0.001411,-0.00031,-0.000491,0.000567,0.001202,0.001082,0.001321,0.00245,-0.000393,0.000671,0.001319,-2e-04,-0.001324,0.000159,-0.002072,-0.002088,0.000539,0.000594,3e-04,-0.000796,0.000766,0.000962,0.001253,-0.00017,0.00067,0.001358,0.000115,0.000762,0.00102,0.001956,0.001395,0.000489,0.001418,0.001254
-0.00155,-0.001423,0.001125,-0.001816,-0.001102,-0.000581,-0.001676,-0.001036,-0.001846,-0.000448,-0.001026,-0.000186,-0.00017,0.000513,-0.002526,-0.001521,-0.00237,-0.000995,0.002022,-0.000946,0.000707,-0.000603,0.000549,-0.000463,0.001844,-0.001555,-0.000166,0.000313,-0.001416,-0.000383,-0.00168,-0.000869,-0.00124,-0.001832,-0.00092,-0.001881,-6.7e-05,-0.002438,-0.002272,-0.000958,-0.001253,0.000417,-0.002733,-0.002333,-0.000563,-0.003018,-0.000433,-0.002234,-0.001821,-0.001956,-0.002433,-0.001569,-0.000792,0.000103,-0.000932,0.000103,-0.002292,-0.001552,-0.001315,-5e-04,-0.000622,-0.0041,-0.000358,0.001123,0.000671,0.001251,-0.000961,0.000266,-0.002544,-0.001481,0.002531,-0.002999,-0.000894,0.00179,0.000719,0.001279,0.003108,0.00087,-0.000332,0.001139,0.00249,0.001136,0.002676,0.000606,0.000336,0.001315,0.000316,0.002118,0.002291,0.000323,0.000609,0.001807,0.000923,0.000401,0.001092,0.001679,0.001455,-0.000673,0.001579,0.001393,-0.000405,3.1e-05,0.00191,0.000257,0.001699,2e-04,0.001465,0.001535,0.001281,0.002072,0.001068,3.3e-05,-0.001307,-0.001578,-0.000638,-0.000562,0.000749,-0.001495,-1.5e-05,-0.000791,0.000289
0.002315,0.000913,-0.000987,0.000847,-0.000893,0.000268,0.000147,0.001723,0.000765,-0.000297,-0.000653,-0.003267,-0.000663,-0.001462,0.001499,0.001139,-0.001133,0.000469,-0.000729,0.001132,0.000536,0.000718,-0.000799,0.000774,-0.000604,0.000614,-9.2e-05,-0.001346,0.000679,-0.000283,-0.000234,-5.2e-05,0.000131,-0.001531,-0.000188,0.001838,-0.001999,0.000309,0.00302,0.001059,-0.000282,-0.000873,0.002229,-0.002544,0.000327,0.000575,-0.001432,-0.001042,-0.001322,0.000644,0.00434,0.002106,-0.000537,0.001928,-0.000125,0.000913,0.000367,0.00052,-0.000685,0.000147,0.000767,0.000995,-0.000672,-0.001477,-0.001761,0.000536,-0.001477,-0.00115,0.00308,0.003087,-0.000865,0.002915,0.000257,0.000327,0.002069,-0.000401,9.7e-05,0.002884,0.002475,0.002399,0.000761,0.00076,-6.3e-05,0.001416,0.003155,-4.7e-05,0.002329,0.001534,0.001264,0.000818,0.000416,-0.000224,-0.000604,0.001016,0.001101,0.000323,-0.001153,0.00099,-7e-05,0.000858,0.001383,0.00171,0.000531,-0.000963,-0.000335,7.6e-05,0.000751,-0.000584,0.000195,-0.000141,0.001006,0.000228,1.6e-05,0.00021,0.000246,0.001273,0.000768,0.000112,-0.001006,-0.001276,-0.000469
-0.000823,0.000259,0.00018,0.000326,0.000848,0.000199,0.000879,-0.00073,-0.000508,0.000666,0.001304,0.001761,0.00116,0.000865,-0.00055,-0.000555,0.00229,0.00103,0.000305,-0.000476,-0.000447,0.001601,0.000804,0.001145,0.001292,0.000354,0.000239,0.001481,0.000377,0.001068,0.001636,0.000616,0.00011,-0.000461,0.000419,0.00034,0.000101,0.000697,-0.000192,0.000267,0.002309,0.001357,-0.000382,0.001631,0.001325,0.002379,0.000867,0.001999,0.002123,0.000452,-8e-04,-0.000379,-0.000329,-0.000154,0.000945,0.001369,0.002641,0.000675,0.001592,-1.7e-05,0.000208,0.001724,0.001553,-0.000541,0.000247,0.000967,0.002695,0.001467,0.00048,-0.000287,-0.000181,0.000697,0.000851,0.00053,-0.001252,-0.000965,2.1e-05,2.3e-05,-0.000248,-0.000137,-0.000793,-0.000513,0.000236,9e-04,-0.001237,0.000559,-0.000674,-0.000388,-0.001258,0.000914,0.000203,0.000286,0.000945,0.000313,-0.000733,0.000404,0.000741,0.00056,0.000372,0.000377,-0.000897,0.00084,0.001452,0.002152,0.000357,0.000191,-0.000109,0.001484,-6.2e-05,8.1e-05,-0.00032,-0.000495,0.001001,0.001251,-0.000207,-0.002154,-0.002533,0.000123,0.000279,0.000912,-0.000165
-5e-06,0.000367,-0.001135,-0.000688,0.000227,-6.7e-05,0.000398,-2e-04,0.000255,-0.000113,0.000292,-0.000304,-0.001107,-0.00031,0.000473,0.001016,0.001826,0.000264,0.001448,0.001248,0.000928,-0.00052,-0.000271,-0.000289,-0.000391,0.001139,0.000539,0.000141,0.000168,-2.3e-05,0.00038,-0.001208,0.000292,0.00201,0.00021,-0.000326,-0.00074,0.001027,-0.001314,0.001141,-0.000883,-0.001195,0.000877,0.001926,0.000295,0.000565,-0.000494,0.000674,-0.000541,0.000858,-0.001033,0.000898,0.001292,0.000355,-0.001,0.00103,-0.001868,-0.001414,0.001425,-0.000353,4.7e-05,-0.000593,-0.001248,0.000996,0.000928,-0.000451,0.000225,-0.000365,-0.001583,0.000508,0.000805,0.00032,0.000403,-0.000714,0.000177,0.000655,0.000378,-0.001,-0.00011,-0.000902,7.6e-05,-3.8e-05,-0.000728,-0.000748,-0.000706,1.1e-05,-0.000458,-0.000909,4.1e-05,-0.000154,-0.000205,-8.3e-05,-0.000247,-0.00103,-9.9e-05,-7.6e-05,0.000117,-0.000372,-9.5e-05,-0.000219,2.1e-05,-0.000439,-0.001458,-0.000546,-0.000223,0.000349,2.9e-05,-0.001697,-0.000522,-0.000163,-2.9e-05,0.00019,-9.8e-05,-0.000309,0.000365,0.000406,0.000284,-0.000256,-0.000188,0.000125,-9e-05
8.6e-05,-0.00129,0.000808,0.001071,-0.000236,-0.000255,-0.000463,0.000436,0.00018,-0.000139,-0.000182,0.00031,3.4e-05,-6.7e-05,-0.000353,-0.000759,-0.001155,-0.000245,-0.000704,-0.000317,-0.000128,-0.000715,0.000119,0.000699,7.2e-05,-0.000176,-0.000242,0.000723,0.00056,-0.000557,-0.000617,-0.000383,0.000513,-0.000814,-0.000423,0.000125,0.001745,0.00041,-0.000117,-0.000234,0.001407,2e-06,6.9e-05,7.2e-05,0.000238,-0.001245,-0.000179,0.000204,-0.000203,0.000235,0.000873,-0.001012,1e-05,-0.000304,-0.000732,-0.001496,0.00073,0.00094,-0.000261,-0.000119,-0.000635,0.000348,-0.000783,0.001277,0.000131,-0.000121,-0.001289,-0.000171,0.000277,-0.001475,-0.000975,-0.002025,-0.001248,0.000197,-0.000562,0.000118,-0.00146,0.000555,-0.000787,-0.000568,-0.000316,9.6e-05,-4.5e-05,-0.00033,0.000745,-0.000835,-0.000333,0.000418,-0.000481,-0.000925,0.000156,-1.1e-05,-0.000767,-0.000152,-0.000192,0.000342,-0.000268,-0.00057,-0.000702,0.00014,-0.000387,-0.00135,-0.00072,-0.000664,-0.000699,-0.00112,-7.4e-05,0.000432,-0.000148,-1e-05,-0.000397,0.000279,-0.001498,-0.000402,0.000356,0.000517,0.000612,0.000414,0.000473,-0.000261,0.000533
-0.000552,0.000404,-0.000237,-0.001555,0.000417,-0.000486,-4.4e-05,-0.000835,-0.000313,-0.000152,-0.000651,0.000117,0.000611,0.000113,0.000279,0.000365,0.000178,-0.000102,-0.000117,-0.000937,-0.000348,0.000111,0.000281,-0.000357,0.000513,-0.001035,-0.000182,-0.001257,-0.00023,-0.00019,-0.000146,3.1e-05,-0.000532,0.000444,6.3e-05,0.000259,-0.00146,-0.000439,0.00148,-0.000583,-0.001353,1.7e-05,-0.000169,-0.000252,-0.001173,0.000173,-0.000525,0.000392,0.000528,-0.000667,-0.000885,0.000205,-0.000541,-0.000158,4.4e-05,2.4e-05,0.000391,-0.000151,-0.000781,-0.000261,0.001007,-0.000632,-1.1e-05,-0.00083,9.3e-05,-0.000594,0.000302,0.000505,0.000463,0.001086,0.000517,-0.000224,0.000676,-0.000776,-2.3e-05,-0.000811,0.000212,-9e-04,0.000481,2e-05,-5e-05,-0.000907,2.2e-05,0.000196,-0.000897,0.00011,-0.000429,-0.000308,0.000162,0.000227,-0.000275,-0.000206,0.000668,-0.000295,0.000306,-0.001505,-0.000419,9.3e-05,0.00078,-0.000981,0.000323,0.000482,0.000677,-0.000406,0.000515,0.000523,-0.000219,-0.000557,-0.000131,-0.000246,-0.000666,-9.3e-05,0.000742,0.000156,0.000443,-0.000357,0.000154,0.000724,-0.000621,0.000158,-0.000274
0.000508,-0.000354,0.000229,0.000799,-0.000143,-0.000431,0.000157,-0.000118,-0.000247,0.000162,0.000559,9.3e-05,-0.000125,-0.000122,0.000394,-0.000284,-0.000407,4e-04,-0.000228,0.000622,0.000354,-1.2e-05,-0.000774,-0.000407,-0.000672,0.00052,5.4e-05,0.000475,0.000168,-0.000667,-0.000413,-0.000144,-0.000223,-2.8e-05,0.000439,-0.000304,-0.000317,-0.000293,-0.000505,-0.000575,-7.4e-05,0.000218,0.000509,2.3e-05,0.000378,0.000155,-0.001068,-0.001088,-6.5e-05,3e-05,0.000955,-0.000456,3.4e-05,0.00021,0.000545,-0.000501,-0.000285,9.3e-05,-0.000368,0.000573,-0.001192,0.000242,0.000449,7e-06,-0.00047,0.000273,0.000629,-2.7e-05,-0.000583,-0.000479,-0.000574,0.001983,-0.000687,0.000387,-6.5e-05,0.000136,-6.7e-05,0.00027,-0.000137,0.000104,-0.000286,0.000454,0.000211,-0.000573,0.000803,0.000298,0.000463,5e-06,-0.000153,0.000111,-0.000167,-4e-05,0.00021,0.000243,-0.000589,0.000183,-2e-06,0.000112,-0.000722,0.000375,-0.000196,-6.4e-05,-0.000106,0.000499,-0.000174,0.000232,-6.7e-05,6.6e-05,-8.1e-05,-0.000161,0.000185,-0.000336,2.6e-05,-0.000178,-0.00029,0.000149,-0.000347,-0.000246,0.000334,-0.000127,0.000315
4.9e-05,0.000331,-0.00014,-0.000189,0.00039,0.000637,-0.000128,4.1e-05,0.000227,-5e-05,-2.8e-05,8.3e-05,-0.000142,-7.7e-05,-0.000742,3.6e-05,-0.000199,-6.8e-05,1.2e-05,-0.000428,-0.000347,-0.000272,0.000308,-7.4e-05,0.000105,-0.000437,-0.00015,0.000131,-0.000136,0.000366,0.000235,0.000796,0.000157,0.000367,0.000425,0.000324,0.000762,-0.000538,-0.000501,0.000864,-0.000605,4.4e-05,-0.000478,-0.000356,-2.1e-05,-0.000246,0.000844,0.000203,0.000138,0.000406,0.000135,0.00066,0.000221,0.000377,8.5e-05,0.000359,-0.000377,0.000462,0.00013,0.000621,0.000731,-0.000378,0.000158,-4.8e-05,0.000661,-2.1e-05,-0.000613,3e-05,6.1e-05,-8.3e-05,0.000169,-0.001137,0.000325,-0.000214,0.000204,0.000342,0.000553,0.000743,-0.000199,-7.1e-05,-2.9e-05,0.000313,-0.000326,0.000119,-0.000695,1.3e-05,-0.000536,-0.000275,-1e-05,-0.000159,-7.2e-05,-0.000199,-0.000401,-5e-05,0.00017,6.9e-05,0.000131,-5.6e-05,0.000322,-0.000159,0.000179,0.00024,-6.4e-05,0.000293,-0.000255,-0.000439,3.8e-05,0.000209,0.000357,0.000211,5.6e-05,-0.000101,-0.000314,6.4e-05,-0.000278,0.000302,0.000255,-0.000155,-4.4e-05,-1.1e-05,-0.000371
-0.000398,-0.000217,0.000616,0.000312,-0.000367,2.9e-05,-1.7e-05,-9.9e-05,-0.000381,6.4e-05,-1.6e-05,0.000143,-0.000301,-1.7e-05,0.000656,3.2e-05,-0.000246,-0.000365,0.000245,2.7e-05,5.4e-05,0.000112,4.9e-05,0.000274,0.000168,0.00019,2.3e-05,-0.000343,0.000237,-0.000305,2.6e-05,9.8e-05,-0.000109,-0.000413,-0.000143,-0.000107,0.000359,0.00036,0.00012,-0.000273,0.000699,0.000348,4e-06,-0.000429,7e-05,-0.000277,0.000247,-0.000288,-1.8e-05,-2e-05,-0.000339,-0.000468,-0.000304,3.4e-05,0.000129,0.000145,-0.000138,-0.000302,2.6e-05,-0.000333,-0.000531,8e-05,0.000306,0.000426,-0.000583,2.7e-05,-0.000432,-0.000197,0.000279,0.000125,0.000244,-0.000102,0.000165,1e-04,0.000211,-5.9e-05,-0.000219,-0.000759,0.000286,-3.7e-05,0.000361,-0.000422,0.000206,0.00012,-0.000164,-0.000297,0.000129,0.000316,-0.000194,-5e-06,0.000194,0.000468,-0.000188,4.3e-05,3.8e-05,0.000464,6e-05,-0.000226,-8.3e-05,0.000115,-7.9e-05,0.000164,-0.000101,-0.000438,-8e-06,0.000274,-4e-05,5.5e-05,-0.000346,3.6e-05,0.000178,1.4e-05,-3.1e-05,7.2e-05,-6.5e-05,-0.000161,-0.000185,-0.000212,-0.000126,-0.000143,9e-06
0.000175,-8e-06,-0.000239,-0.000191,4.9e-05,-0.000128,0.000346,5.9e-05,0.00027,1.4e-05,-8.2e-05,-0.000229,-0.000217,1.2e-05,-0.000161,-0.000179,0.000364,-0.000133,-0.000201,-8.1e-05,8.9e-05,0.000158,9.4e-05,0.000169,-0.000184,-0.000117,-2.3e-05,2.2e-05,-0.000136,0.000221,0.000137,8.4e-05,-0.000114,-0.000287,3.7e-05,-9.3e-05,-0.000322,1.5e-05,-0.000408,-0.000471,-0.000231,-0.000429,-0.000294,-7.4e-05,0.000207,0.000364,0.000263,0.000219,-0.000239,-0.000216,-0.000257,-0.000157,-9.3e-05,-0.000507,0.000296,2.7e-05,-0.000185,-4e-05,-0.000312,0.000143,0.000346,0.00044,-5.4e-05,-0.00036,0.000185,-0.000153,0.00031,-0.000177,-0.000305,-0.000158,-0.000111,9.4e-05,3.7e-05,-0.000144,-0.00039,-9.9e-05,-0.000205,0.000269,-0.000413,0.00016,4.4e-05,6.5e-05,-4.2e-05,-0.000105,0.000395,8.3e-05,8.2e-05,9.6e-05,0.000124,0.000276,6.3e-05,-0.000363,0.000249,0.000203,0.000119,-0.000206,-7.7e-05,0.000263,5.5e-05,0.000117,7.8e-05,-3e-05,-7.4e-05,-6.3e-05,0.000226,-0.000162,-4.6e-05,-0.000147,0.000312,-9.5e-05,3.3e-05,0.000223,0.000331,0.000147,9.5e-05,0.000112,0.000262,0.000234,5.7e-05,0.00011,0.000279
-5e-05,0.000229,-6.1e-05,0.000105,0.000312,9.9e-05,-0.000106,8.5e-05,3.4e-05,-0.000127,0.000136,-4.6e-05,0.000223,0.000117,-0.000232,0.000233,0.000303,-6e-06,-0.000246,2.3e-05,-0.00013,-0.000303,-0.000239,-4.6e-05,0.000166,-7e-05,-3.4e-05,0.000357,7.8e-05,-0.000159,3.4e-05,-4.7e-05,6.7e-05,0.000125,-0.000291,-8.9e-05,-4.8e-05,1.4e-05,0.000325,0.00015,5.4e-05,7.5e-05,0.000101,0.000474,-7.6e-05,-0.00021,-2e-04,0.000132,-7.3e-05,0.00013,5.3e-05,-3.9e-05,5.8e-05,-5.1e-05,-5.7e-05,-0.000286,0.000401,-6.9e-05,0.000287,1.5e-05,-0.000265,-0.000368,-0.000132,-0.000246,-9.3e-05,3.7e-05,0.000265,0.000185,2e-05,0.000157,-9.7e-05,9.4e-05,-0.000408,0.000239,0.000279,-8.1e-05,0.000147,-1.8e-05,6.8e-05,3.1e-05,-0.00016,0.000252,-2.9e-05,0.000326,-0.000137,0.000196,-0.000154,-8.5e-05,0.000113,-0.000297,-7.3e-05,0.000203,-4.2e-05,-0.000122,-2.7e-05,-3e-05,9.9e-05,2.8e-05,2.2e-05,-0.000177,3.1e-05,-0.000233,0.000194,0.000162,8.2e-05,0.000161,5e-05,0.00021,-0.000154,-2e-05,-0.000163,9e-05,2.6e-05,-0.000139,0.000172,-0.000114,3.8e-05,7.4e-05,0.000126,-8.5e-05,-0.000143
2.4e-05,-0.000255,-8.3e-05,9e-05,-0.000203,6e-06,2.3e-05,5e-06,9.2e-05,0.000148,-1.5e-05,1.2e-05,-1.2e-05,-3.5e-05,0.00034,-0.000297,-0.000174,0.000213,8.4e-05,0.000132,0.000125,4.9e-05,3.4e-05,-0.000176,-0.000131,0.000165,3.8e-05,-0.000239,0.000123,0.000183,-0.000137,-1e-06,-1.5e-05,0.000116,6.9e-05,0.000196,7.1e-05,-1.8e-05,0.000349,-1e-05,-0.000187,-9.1e-05,4.1e-05,0.000115,-0.000157,-0.000266,0.000543,-8.5e-05,-0.000186,0.000142,0.000183,-0.000236,7e-05,0.00022,-0.000153,7.8e-05,-5.6e-05,-5e-06,5e-06,-0.000357,0.000128,0.000171,-7.2e-05,-2.7e-05,-2.1e-05,-0.000233,-0.000134,-0.000103,0.000277,-3.4e-05,0.000163,6e-06,0.000238,-0.000191,-3.5e-05,0.000179,1.4e-05,-0.000122,0.000127,0.000213,-2.4e-05,-0.000145,3.7e-05,-0.00032,0.000194,-0.000287,0.000306,7e-05,-0.000124,0.000141,1.5e-05,-9e-06,-5.3e-05,0.000192,-0.000196,-0.000253,-6e-06,-0.000155,-0.000108,-6.7e-05,-4.6e-05,0.000182,0.000134,-2.8e-05,-1.8e-05,-0.000121,-1.1e-05,-2.8e-05,0.000128,-3.3e-05,2e-06,-5.8e-05,-0.000278,-4.3e-05,1.3e-05,-0.000208,-0.000257,-3.7e-05,3.1e-05,2.4e-05,-3.1e-05
0.000206,0.000218,9.2e-05,-0.000208,0.000112,-5.3e-05,2e-05,-2.7e-05,7.6e-05,-0.000132,-9.5e-05,5e-05,0.000215,4.4e-05,-0.000234,0.000212,-0.000344,6.6e-05,4.4e-05,-0.000168,-4.8e-05,2.9e-05,1e-05,-6e-05,-6.8e-05,-0.000246,-4.4e-05,2.6e-05,-0.000128,-0.000195,-9.6e-05,-0.000232,-3.3e-05,0.000103,2.5e-05,-0.000188,5.1e-05,-0.000137,-0.00031,-3.6e-05,0.000155,5.3e-05,-6.2e-05,-3.3e-05,-1e-06,8.8e-05,-0.000143,-3.5e-05,2.4e-05,-8.4e-05,-8e-05,0.000236,1e-05,-3.1e-05,-6e-06,-0.000112,0.000386,-4.9e-05,-0.000333,2.4e-05,2.1e-05,-0.000116,7.5e-05,0.000302,3.7e-05,0.000255,-9e-05,0.000113,-7e-05,5.8e-05,-0.000105,-0.000192,-9.8e-05,0.000299,4.7e-05,-2.5e-05,7e-06,0.000391,-3.5e-05,-5.2e-05,6.1e-05,3e-05,3.8e-05,0.000111,-0.000244,0.000155,-0.000137,-2.4e-05,0.000119,9.6e-05,7e-06,-2.1e-05,-3.9e-05,-2.7e-05,0.000163,0.000208,2e-05,0.000116,4.5e-05,0.000139,7.7e-05,0.000123,-2.4e-05,-5.4e-05,-0.000158,5.7e-05,1e-05,0.00016,-2.8e-05,4.1e-05,0.000146,-5e-05,0.000135,3.4e-05,-9e-06,3.7e-05,-2e-05,4.6e-05,-8e-05,-8.2e-05,2.2e-05
-0.00025,-2.7e-05,-0.000129,0.00019,-7.9e-05,9.8e-05,-7.7e-05,0.00021,-9.5e-05,0.000129,5e-06,-2.4e-05,-0.000149,-2.5e-05,7.2e-05,-0.000106,0.00011,-8e-06,3.5e-05,8.6e-05,8e-06,4.5e-05,0.000125,6.6e-05,9.2e-05,4.8e-05,-3e-06,-5.3e-05,5.1e-05,0.000148,-2.2e-05,6e-05,7.1e-05,-9.1e-05,6e-05,0.000108,-0.000108,1.2e-05,-0.000228,3.6e-05,-0.00027,0.000109,8.9e-05,-0.000153,8.5e-05,0.00013,-7.5e-05,-8e-05,0.000106,-3.2e-05,0.000139,-8.9e-05,-7e-05,0.000238,-9.2e-05,0.000302,-0.000448,8.6e-05,0.000107,6.1e-05,-0.000127,-3.6e-05,-8.3e-05,-6.6e-05,2.6e-05,2.1e-05,0.00024,-5e-06,-0.000179,-8.4e-05,0.000111,0.000489,0.000202,-0.00017,-1.5e-05,-4.1e-05,0.000139,-0.000211,-1e-05,5e-05,0.000187,7e-05,-7.2e-05,0.000104,0.000143,0.000166,0.000107,3.3e-05,-4e-05,3.2e-05,3.1e-05,0.000129,0.000113,0,-2.2e-05,9.8e-05,2.2e-05,-1e-06,5.8e-05,-1.6e-05,-2.7e-05,-9.4e-05,-8.4e-05,6.7e-05,8.9e-05,3.3e-05,-8e-06,-7e-05,-1e-05,8e-06,5.3e-05,-3.7e-05,4.9e-05,9.7e-05,-5.4e-05,1.6e-05,3.3e-05,1.6e-05,2e-05,9e-05,1.2e-05
1.1e-05,6.2e-05,-6.3e-05,-3.4e-05,0.000137,2.7e-05,6e-06,-4.6e-05,5.9e-05,-4.3e-05,0.000115,0.000126,1.5e-05,-5e-05,-2e-06,4.9e-05,4.1e-05,-8.8e-05,-6.8e-05,-5.1e-05,-3.6e-05,-7.9e-05,-6.7e-05,6.1e-05,-8.5e-05,3e-05,2.1e-05,9.5e-05,-1e-05,-1.5e-05,0.000116,-0.000138,-5.7e-05,0.00014,0.000112,-4e-05,-0.000178,-1.7e-05,0.000132,-2.1e-05,0.000186,-7.4e-05,-0.000122,-0.000167,-8.5e-05,-0.000139,-5.9e-05,-1.3e-05,-4e-06,9.5e-05,-0.000339,3.7e-05,2.8e-05,-0.000283,-8.2e-05,4.9e-05,-2.5e-05,-3e-05,0.000165,-6.7e-05,0.00018,5e-05,1e-05,-0.000155,-0.000137,7e-05,-0.000112,-0.00012,0.000223,1.2e-05,3.5e-05,-0.00028,-0.000192,6.2e-05,7e-06,-1.9e-05,-0.000159,-1.9e-05,7e-05,-7.5e-05,-7e-06,-0.000112,5.3e-05,-3.2e-05,7e-06,-0.000259,1.4e-05,3.2e-05,1.8e-05,-0.000112,3e-06,-7.8e-05,1e-05,1.1e-05,3.5e-05,0.000167,-5e-06,-4e-06,-5.5e-05,3.8e-05,3e-06,-6.7e-05,-7.1e-05,0.000127,6.1e-05,-4.9e-05,-3e-06,-2.3e-05,1.5e-05,-6.2e-05,-2.8e-05,2.6e-05,-8.1e-05,-2e-05,-3.1e-05,-6.7e-05,0.000159,-8.7e-05,-5.1e-05,-6.4e-05,6.7e-05
-9e-06,-8e-05,-2.2e-05,3.8e-05,-4.8e-05,-8.3e-05,9.7e-05,-4e-06,-8.2e-05,7e-06,-3.8e-05,-6.9e-05,0.000116,9e-05,0,-1.6e-05,-5.2e-05,-0.000179,3.2e-05,9.4e-05,6e-05,0.000125,-6.5e-05,2.5e-05,6.8e-05,6.2e-05,9e-06,-2.8e-05,-2.3e-05,3.1e-05,6.5e-05,5.8e-05,-2.3e-05,-0.000192,-5.9e-05,-2.5e-05,4.1e-05,2.4e-05,0.000157,4.2e-05,2.9e-05,-5.5e-05,2.7e-05,-1.2e-05,0.000128,-2.8e-05,-0.000104,1e-04,8.2e-05,1.2e-05,0.000114,-5.9e-05,4.3e-05,-5e-05,-8.9e-05,-7.1e-05,3.9e-05,-7e-06,-1.1e-05,2.6e-05,-0.000172,-2.7e-05,-7.9e-05,5.1e-05,0.000117,-7.9e-05,-0.000141,5e-05,-6e-05,4e-05,-0.000113,-0.000222,6.6e-05,1.6e-05,-7e-06,4e-05,-3e-06,2e-05,-6.4e-05,7.1e-05,-0.000182,5.4e-05,-3.5e-05,-8e-06,3.4e-05,0.000105,-7e-05,-3e-06,-1.3e-05,7.7e-05,4e-06,-1.8e-05,-0.000133,-6.2e-05,-0.000102,-0.000117,2.3e-05,-7.6e-05,4.9e-05,-1.7e-05,-3.2e-05,6.1e-05,8.4e-05,-0.000138,2.7e-05,4e-06,-8e-06,-4.6e-05,-7e-05,2e-05,-6.8e-05,4.8e-05,-4.4e-05,-1.4e-05,-7e-06,6.9e-05,-0.00014,-3e-06,2.9e-05,-3.6e-05,-5.1e-05
3.7e-05,1e-06,7.2e-05,-6.3e-05,-9e-05,1.5e-05,3.2e-05,1e-05,8.3e-05,-2.9e-05,-6.1e-05,3.8e-05,-6e-06,-4.6e-05,7.6e-05,-4.9e-05,0.000149,5.2e-05,6.3e-05,-1.4e-05,-5.8e-05,-6.8e-05,5.1e-05,-1e-05,-2.1e-05,9e-06,-1e-06,-3e-06,2e-06,-5.9e-05,7e-06,-2e-06,4.1e-05,4.7e-05,-1.6e-05,-2.2e-05,0.000202,9.2e-05,-3.8e-05,4.7e-05,9.5e-05,5.3e-05,4e-06,-2.4e-05,-5.4e-05,0.000112,-1.6e-05,4e-06,-2.7e-05,-6.2e-05,3.1e-05,-2.2e-05,-2.4e-05,-3.7e-05,4.6e-05,-5.3e-05,5e-06,-1e-05,-3.5e-05,4.6e-05,0.000143,0.000151,-8e-06,5.7e-05,-6.7e-05,-2.6e-05,0.00016,-1.3e-05,-7.2e-05,4e-06,0.000109,0.000183,7.2e-05,1.5e-05,-7.6e-05,1.9e-05,3.7e-05,-3.2e-05,3.1e-05,-4.9e-05,3.2e-05,5.3e-05,1.1e-05,5.7e-05,3.4e-05,4.5e-05,9.5e-05,-3.3e-05,-3e-06,8e-06,-3.1e-05,7.4e-05,0.000116,7.1e-05,1.1e-05,-0.000118,-3e-06,0.000117,-2.1e-05,-4.2e-05,2.3e-05,-2.5e-05,7.2e-05,-6.8e-05,-0.000142,8e-06,2e-06,1e-05,3.9e-05,-6e-06,-5.8e-05,1.7e-05,0.000101,2.6e-05,4e-06,5.7e-05,1e-06,-4.6e-05,-4.5e-05,4.6e-05,-2.4e-05
8.5e-05,4.9e-05,9.4e-05,6.2e-05,0.000104,-9e-06,-2.8e-05,-0.00011,-5.4e-05,3.9e-05,1.5e-05,-3.8e-05,-6.5e-05,-1.2e-05,-0.000145,7.6e-05,5.3e-05,0.000129,-1e-05,-3.8e-05,3.2e-05,-1e-05,4.5e-05,-2.9e-05,-5.9e-05,-5.9e-05,-3e-06,1.5e-05,1.8e-05,-1e-06,-5.2e-05,0.000111,4e-06,-3.9e-05,-3.4e-05,6.5e-05,-0.000113,-2.5e-05,-5.5e-05,-8.8e-05,-0.000123,-4.4e-05,-5.6e-05,0.000148,-6.5e-05,-5.1e-05,-0.00022,1.1e-05,-4.8e-05,8e-06,-3e-06,3.1e-05,-4.3e-05,0.000169,5.3e-05,-0.000152,8.4e-05,5.5e-05,1.4e-05,3.7e-05,-0.000131,-0.000122,8.2e-05,2.9e-05,0,2.7e-05,4.6e-05,3.5e-05,8.5e-05,-4e-06,-4.9e-05,0.000203,-7.9e-05,-5.7e-05,0.000129,-5.2e-05,-2.5e-05,0.000142,6.2e-05,6e-06,5e-05,-0.000103,-2e-06,-8.8e-05,-0.000121,-7.1e-05,-9.6e-05,-2.7e-05,-1.4e-05,-5.7e-05,1.9e-05,-3.5e-05,4.8e-05,-7.2e-05,1.2e-05,-3.9e-05,-3.6e-05,-4.2e-05,-2e-05,4e-06,-5.4e-05,-8.8e-05,-4e-05,0.000112,8.2e-05,5.8e-05,7e-06,-6.6e-05,-2.9e-05,8e-06,3e-05,-1e-06,-4.9e-05,-1.9e-05,2.4e-05,-8.1e-05,5.8e-05,1.3e-05,5e-06,-2.9e-05,1e-05
-8.2e-05,-4e-05,-1e-05,-2.2e-05,-3.8e-05,2e-06,-5.5e-05,3.5e-05,5.3e-05,-5e-05,5.2e-05,-4.2e-05,-3.9e-05,4e-05,0.000121,-7.4e-05,-6.7e-05,5.2e-05,6e-06,6.6e-05,1.6e-05,1.5e-05,-2.7e-05,-2.9e-05,7e-05,4.4e-05,-1e-06,-1e-06,-3.3e-05,1.3e-05,-8e-05,2.7e-05,-2.1e-05,1.8e-05,-2.2e-05,-5.8e-05,-4.5e-05,-7e-06,-3.6e-05,3.2e-05,1.2e-05,7.7e-05,3.1e-05,0.000109,4.8e-05,-6e-05,0.000109,-1.3e-05,1.9e-05,7.9e-05,8.5e-05,8.1e-05,5.6e-05,3.1e-05,1.2e-05,9.6e-05,0.00011,-6.8e-05,5e-05,6.2e-05,0.000109,-3e-06,4.4e-05,-8.1e-05,2.6e-05,4.9e-05,-7.2e-05,2.9e-05,1e-06,-6e-06,-1.5e-05,-0.000132,-1.6e-05,6.5e-05,-0.000105,-2e-06,3.1e-05,-8.7e-05,-4.5e-05,-6.4e-05,4.2e-05,3.5e-05,7e-06,6.6e-05,8e-05,6.2e-05,3.8e-05,5.1e-05,-1.5e-05,4.9e-05,-3e-06,2.2e-05,-9.5e-05,2e-05,3.6e-05,4.3e-05,2.3e-05,-4.2e-05,6.7e-05,3e-05,2.6e-05,9.1e-05,-6.8e-05,4.3e-05,-6.8e-05,-9.4e-05,7e-06,-1e-05,1.7e-05,7e-06,3.8e-05,-1.6e-05,-7.3e-05,-4e-06,3e-05,7e-05,4.8e-05,5.5e-05,4.5e-05,-1e-06,4.3e-05
1e-06,5e-06,-3.4e-05,-2.5e-05,-2.8e-05,3e-05,-1.1e-05,-2.9e-05,-3.4e-05,8.1e-05,-2.9e-05,2.2e-05,-4e-06,-4.8e-05,-1.5e-05,8.2e-05,-0.000141,-4.1e-05,2.8e-05,-7.8e-05,-1.6e-05,3.8e-05,-4.4e-05,-1e-06,-3.2e-05,-1.6e-05,2e-06,-2.8e-05,-2.3e-05,-7.7e-05,-1e-05,6.5e-05,1.2e-05,7.6e-05,1.4e-05,2e-05,6.2e-05,-2.6e-05,-4e-05,8.3e-05,-3.9e-05,-1.2e-05,3.5e-05,-5.4e-05,-1e-05,6.4e-05,2e-05,-7.8e-05,-4e-05,-3.8e-05,-0.000136,-4.3e-05,-1e-05,-3.2e-05,6.5e-05,0.000126,-0.000133,-1.2e-05,-5.9e-05,-4.8e-05,-8.6e-05,3.8e-05,2e-05,-2e-06,-1e-05,5e-06,-1.8e-05,-4.7e-05,-9.1e-05,-2e-05,7.3e-05,-0.00018,6.4e-05,-7.6e-05,3.1e-05,2.8e-05,-2.8e-05,-1.3e-05,3e-06,1.8e-05,-3e-05,4.7e-05,-9e-06,-6.9e-05,-1.7e-05,-3.2e-05,-1e-05,1e-06,9e-06,1.2e-05,2e-06,-3e-05,8e-06,-1.2e-05,-6.7e-05,0.000106,-6e-06,-5e-06,-7.3e-05,-3e-05,-5e-05,6e-06,-3.7e-05,-7.7e-05,8.9e-05,4.7e-05,-1e-06,-2.3e-05,-2.9e-05,-1.3e-05,3e-06,-1.9e-05,8.3e-05,1.3e-05,2e-06,-5e-06,2.4e-05,3.4e-05,-1e-05,-1.3e-05,-5e-06
-4e-05,-4.9e-05,-7e-06,9.3e-05,1.4e-05,2e-06,5e-05,-3.4e-05,0,-7.7e-05,-3.7e-05,-3e-06,5.5e-05,4e-05,-9.2e-05,-8.2e-05,3.6e-05,-6e-05,1.9e-05,5.5e-05,8e-06,-6.1e-05,-1.9e-05,4e-05,9e-06,1.8e-05,1e-06,3.6e-05,2.1e-05,5.1e-05,4.7e-05,-5.2e-05,4e-06,-5.7e-05,1.4e-05,1e-05,8.1e-05,-1e-05,8.7e-05,-1.6e-05,1.8e-05,-4.9e-05,1.4e-05,-4e-05,-2.4e-05,5.2e-05,5e-05,2.1e-05,1.1e-05,-5.4e-05,6.1e-05,6.8e-05,-1.7e-05,-0.000122,9e-06,3.7e-05,2.6e-05,2.7e-05,-2.8e-05,-4e-05,3.2e-05,-9.6e-05,2e-06,6.2e-05,9e-06,-2.7e-05,2.9e-05,4e-05,4.9e-05,3.4e-05,-6.6e-05,0.000173,-1.2e-05,4e-05,0,-6e-06,-4e-06,-4.3e-05,3e-06,-9e-06,-7.4e-05,-6.5e-05,1.3e-05,2e-06,2.1e-05,1.4e-05,-3.7e-05,-4.5e-05,-3.3e-05,-2.6e-05,-1.6e-05,1.2e-05,5.9e-05,-1e-05,7e-06,6e-06,-4e-06,6.1e-05,5.5e-05,2e-05,3.6e-05,-5.7e-05,2.1e-05,-4.9e-05,-2.3e-05,1.6e-05,-8e-06,2e-06,3e-05,1.7e-05,-2e-05,-1e-06,1.4e-05,1.9e-05,-3.2e-05,-6.4e-05,-9.3e-05,-2e-06,-7e-06,-6e-06,-4.8e-05
3.9e-05,5.2e-05,3.3e-05,-8.5e-05,-1.6e-05,-2.6e-05,-2e-06,-1.4e-05,-7e-06,6.1e-05,3e-05,-1.2e-05,1.7e-05,-6e-06,0.000107,5.9e-05,9.7e-05,-2.3e-05,1.1e-05,-2e-05,1.2e-05,1.9e-05,7.7e-05,1.9e-05,1.8e-05,1e-06,-3e-06,-4.4e-05,-4.1e-05,-4.8e-05,6e-05,-2e-06,-3e-06,4.4e-05,-1e-05,-1.3e-05,-3.3e-05,2.8e-05,7.5e-05,-6.8e-05,4.7e-05,1.1e-05,-1.7e-05,-6.8e-05,5.7e-05,-7.4e-05,4.2e-05,-1.1e-05,2.4e-05,5.1e-05,-4.9e-05,-0.000133,1.6e-05,-1.7e-05,1e-06,-6.5e-05,-0.000112,-6e-06,8.6e-05,1.1e-05,-6e-06,9.5e-05,-6.1e-05,1.3e-05,-1.1e-05,-8e-06,1.5e-05,-2e-05,5.3e-05,-4.3e-05,1.5e-05,9e-06,-2.3e-05,1e-06,-1.4e-05,-1.6e-05,2e-06,8e-06,2e-06,3e-05,2.5e-05,2.6e-05,-8e-06,7.6e-05,-2.6e-05,-6e-06,3e-05,1.8e-05,2.2e-05,-2.9e-05,1.2e-05,-3e-06,-1.6e-05,4.2e-05,5e-06,-9e-05,8e-06,-4.6e-05,-3.8e-05,-8e-06,-3.7e-05,6e-06,7.1e-05,7.3e-05,-5.2e-05,-1.1e-05,-4e-06,4.9e-05,-2.1e-05,6e-06,-2.6e-05,8e-06,-5.1e-05,-1.3e-05,-3.3e-05,4.9e-05,1e-06,-4.6e-05,2e-05,1.2e-05,3.3e-05
1.4e-05,-2.3e-05,-6.9e-05,5.4e-05,3e-05,1.1e-05,2.8e-05,4.2e-05,1e-06,-4.7e-05,2.8e-05,4.6e-05,-2.7e-05,-2.8e-05,-4.3e-05,-2.8e-05,-2.3e-05,3e-06,-2.5e-05,-6e-06,-1.9e-05,1.3e-05,1.2e-05,-9e-06,-3.3e-05,3e-06,0,3.7e-05,-2e-06,4.9e-05,1.5e-05,-8.2e-05,1.2e-05,-2.7e-05,1.2e-05,-5e-06,-8.6e-05,-7e-06,-0.000117,6.2e-05,1.7e-05,-6e-06,1.9e-05,-4.6e-05,-2.5e-05,-3e-06,2.8e-05,5.1e-05,4e-06,1.2e-05,8.9e-05,7.2e-05,-1.7e-05,5.3e-05,-2.6e-05,-8e-05,5.9e-05,-1e-06,-2.1e-05,-3.9e-05,-3.5e-05,-1.5e-05,3e-06,-4.2e-05,1.8e-05,-2.8e-05,-4.6e-05,-1.3e-05,-8e-05,6.3e-05,2.1e-05,-8.7e-05,1.3e-05,-8e-06,2e-05,-3e-06,-7e-06,0.000107,-1.6e-05,-2.4e-05,6.5e-05,2.7e-05,1.2e-05,-8.4e-05,-1.5e-05,-3e-05,-3.3e-05,7e-06,-2.4e-05,4.4e-05,-6e-06,1e-05,-3.9e-05,-3.1e-05,1.5e-05,-4.7e-05,-1.1e-05,-8e-06,4e-06,-3.1e-05,3e-05,2.3e-05,1.1e-05,1.3e-05,2.6e-05,-1.6e-05,-4e-06,-1.6e-05,3.8e-05,-3e-06,2e-06,2e-05,-8e-06,-1.6e-05,-7e-06,-2.1e-05,-1.5e-05,-3.4e-05,-3e-06,-2.3e-05,-7e-06
-2.9e-05,6e-06,-2.3e-05,-4.4e-05,-6.8e-05,1.6e-05,1.7e-05,4e-06,2.6e-05,3e-05,-4.1e-05,-1.5e-05,-3.2e-05,3.7e-05,-2.4e-05,1.9e-05,-4e-06,5.9e-05,-1.2e-05,2.7e-05,7e-06,-3.2e-05,-6.8e-05,-1.7e-05,3.3e-05,6e-06,0,-4e-06,1e-06,-7.7e-05,-4.3e-05,-1.5e-05,-6e-06,-3e-06,-3e-06,2.4e-05,1.7e-05,2.4e-05,-6e-05,1.6e-05,-2.4e-05,9e-06,-9e-06,5.1e-05,-2.8e-05,4.2e-05,7e-05,2.6e-05,1.9e-05,-4.2e-05,-2.9e-05,-7e-06,9e-06,0.000111,-2.6e-05,-8.2e-05,7e-06,1.6e-05,-4.3e-05,-4e-05,4.9e-05,1.6e-05,-1.3e-05,-2.4e-05,-3.9e-05,1.9e-05,6e-06,9e-06,2.4e-05,-7.1e-05,-4.4e-05,3.7e-05,-4e-05,-5e-06,-1.7e-05,2.1e-05,3.3e-05,-9.9e-05,2.9e-05,1.3e-05,-3.4e-05,-4.3e-05,-6e-06,2.1e-05,9e-06,5.9e-05,2.8e-05,5e-06,2e-05,-2e-06,9e-06,-1.5e-05,1e-05,3.5e-05,6e-06,-1e-05,7e-06,2.9e-05,1.8e-05,2.9e-05,-1.5e-05,-3.1e-05,-6.1e-05,-6.2e-05,5e-06,8e-06,-1e-06,2.4e-05,-3.5e-05,8e-06,2.9e-05,6e-06,6.3e-05,4e-06,2.4e-05,-3.1e-05,4.8e-05,7e-06,3e-06,-1.6e-05,8e-06
1.9e-05,1.6e-05,-1e-05,5e-05,8e-06,-1.7e-05,-7e-05,-3e-06,-2.2e-05,-1.5e-05,-1.1e-05,2e-06,-2.1e-05,-1.8e-05,2.8e-05,5e-06,4.2e-05,2.2e-05,3.5e-05,-5.2e-05,0,-8e-06,4e-06,-1.2e-05,-1e-05,-3.3e-05,-1e-06,-2.7e-05,-1.2e-05,6.2e-05,-5.1e-05,-1.4e-05,-1.6e-05,-2.4e-05,-7e-06,-1.1e-05,4.3e-05,-1.2e-05,8.3e-05,-5.6e-05,-5.2e-05,3.3e-05,-2.6e-05,5e-05,2.9e-05,-1.5e-05,-4.6e-05,-3e-06,-1.2e-05,6e-06,-3.5e-05,-1.3e-05,0,-3.8e-05,-9e-06,0.000131,1.3e-05,-7e-06,2.5e-05,4.7e-05,-7.4e-05,-8e-06,-3e-06,4.1e-05,3.2e-05,2e-06,6.2e-05,-2e-05,2.6e-05,5.9e-05,5.4e-05,7.2e-05,7.2e-05,3.3e-05,3.4e-05,-4e-06,-2.3e-05,2.8e-05,-3.4e-05,-5e-06,-4e-06,2.6e-05,3e-06,9e-06,2.6e-05,-4.4e-05,-7e-06,-6e-06,-9e-06,-2e-05,-8e-06,6e-06,4e-05,-2.3e-05,-4.1e-05,9.1e-05,4e-06,-3e-06,-2.6e-05,-1.5e-05,2.3e-05,3.5e-05,-3.2e-05,2.3e-05,3.1e-05,3.4e-05,6e-06,1.4e-05,2.9e-05,-7e-06,1.7e-05,-6e-06,-3.3e-05,1.1e-05,2.1e-05,5.8e-05,-2.2e-05,-7e-06,-1.3e-05,2.3e-05,1.3e-05
-3e-05,-1.7e-05,5.4e-05,-3.5e-05,4.7e-05,9e-06,-2.8e-05,5.9e-05,2.4e-05,1.8e-05,3.5e-05,-1.4e-05,4.1e-05,5e-06,7e-06,-3.1e-05,-4.8e-05,-3.7e-05,-2.3e-05,4.5e-05,1e-06,2.3e-05,2.1e-05,2e-06,-4e-06,6e-06,0,2.1e-05,-1e-05,-4.7e-05,-1.6e-05,1.2e-05,1.8e-05,2.2e-05,7e-06,-1.1e-05,-2e-05,-1.6e-05,1.5e-05,2e-05,2.5e-05,-3.4e-05,1.5e-05,3.4e-05,-8e-06,-3.8e-05,-3.9e-05,-1.1e-05,0,2.6e-05,3.4e-05,4.1e-05,-1.6e-05,-4.8e-05,-2.5e-05,1.8e-05,4e-05,-1.1e-05,-1.7e-05,2.5e-05,8e-05,-5.1e-05,2e-06,5e-06,-1.4e-05,1.2e-05,-4.9e-05,2.8e-05,-3.3e-05,-4.3e-05,-2.2e-05,-7.5e-05,-5.2e-05,-3.9e-05,-4.2e-05,-1.3e-05,-7e-06,-1.2e-05,7e-06,1.6e-05,-1.9e-05,1e-05,-2e-06,-1.4e-05,-1e-06,1e-05,4e-06,0,4e-06,6e-06,4e-06,5e-06,-2.8e-05,1.5e-05,3.8e-05,2.2e-05,-6e-06,-1.7e-05,1.9e-05,5e-06,-9e-06,2e-05,3.1e-05,4.3e-05,-4.6e-05,-4.6e-05,5e-06,6e-06,-2.2e-05,5e-06,-1e-05,-1.3e-05,-3.7e-05,4e-06,4e-06,-1e-05,-5e-05,1.1e-05,8e-06,-3e-05,-4.1e-05
2.1e-05,1.8e-05,-5e-06,-3e-06,-5.9e-05,1e-05,4.7e-05,-1.7e-05,-2.5e-05,-1.8e-05,4e-06,1e-06,4e-06,5e-06,-1.8e-05,4e-05,-4.6e-05,-3.1e-05,-1.3e-05,-2.5e-05,-1e-05,0,4.2e-05,1.2e-05,1.7e-05,0,-1e-06,1.6e-05,3e-06,2.8e-05,3.2e-05,3.3e-05,1e-06,-1e-05,-1.3e-05,2.1e-05,-4.2e-05,3e-06,-2.1e-05,-2e-06,-9e-06,-2e-06,-1.8e-05,-1e-05,-1.7e-05,3.4e-05,-2.9e-05,-2.5e-05,-3e-06,-2e-05,-4.9e-05,-0.000109,2.4e-05,-8.7e-05,9e-06,3.4e-05,-2.1e-05,8e-06,-3e-06,-1e-05,-9.1e-05,5.7e-05,8e-06,-1.7e-05,1e-05,-1.6e-05,-1.9e-05,1e-06,5e-06,2.3e-05,-2.1e-05,-6.2e-05,1.4e-05,3.9e-05,2.9e-05,6e-06,2.1e-05,-4.8e-05,3e-06,-5e-06,1.8e-05,-3.6e-05,0,1.8e-05,-3.1e-05,2e-05,8e-06,-1e-06,-8e-06,1.7e-05,-3e-06,-8e-06,-3.6e-05,9e-06,-1.1e-05,1.1e-05,8e-06,-3e-06,-3e-06,8e-06,1.1e-05,-6.1e-05,5.1e-05,-2.4e-05,3e-05,1.7e-05,1e-06,1.5e-05,2e-05,-2e-06,-1.8e-05,-6e-06,4.2e-05,2e-06,-1.2e-05,-2.8e-05,4.9e-05,2.4e-05,-8e-06,6e-06,1.4e-05
1.8e-05,-4e-06,3.4e-05,5.9e-05,1.6e-05,-1.6e-05,1.3e-05,1.2e-05,1.4e-05,2e-05,-3.3e-05,-5e-06,-3e-06,-1.9e-05,-4e-06,-3.9e-05,2.5e-05,9e-06,-4e-06,1.1e-05,1.4e-05,-3e-05,-4.6e-05,1e-05,-2.3e-05,4e-06,0,-2.6e-05,-3e-06,-2.7e-05,4.8e-05,3.9e-05,-1.7e-05,2.4e-05,-6e-06,-1.1e-05,1.4e-05,-7e-06,-4e-06,-1.6e-05,3.3e-05,8e-06,1e-05,-3.3e-05,3.8e-05,6e-06,-1.6e-05,-1.5e-05,-2.2e-05,-1.7e-05,6.1e-05,5.9e-05,0,6.1e-05,8e-06,-5.6e-05,-4.6e-05,-2e-06,1.6e-05,1.8e-05,8.1e-05,-4.1e-05,8e-06,-1.6e-05,-4e-06,-4e-06,4.3e-05,-1e-05,4e-05,2e-06,3.4e-05,9.7e-05,-2e-06,-1.3e-05,-9e-06,7e-06,-2.3e-05,0.000119,-8e-06,3e-06,2.7e-05,2.9e-05,-5e-06,3e-06,1e-05,-4.8e-05,-1.4e-05,-3e-06,7e-06,-1.7e-05,6e-06,1e-05,4.9e-05,-1.9e-05,1.8e-05,-7.7e-05,-1e-06,2.7e-05,-6e-06,-1.7e-05,1e-06,-3e-06,1.3e-05,-4.4e-05,-5e-05,1.2e-05,-1e-06,-2e-05,-1.9e-05,-8e-06,-8e-06,8e-06,9e-06,-2e-06,-1.3e-05,3.6e-05,3.8e-05,-2e-06,-2e-06,-1e-06,2.7e-05
-3.3e-05,1e-05,-5e-06,-9.2e-05,-1.3e-05,-1e-06,6e-06,-4e-06,-1e-05,-2.5e-05,7e-06,0,-2e-06,2.1e-05,2.8e-05,3.9e-05,4.3e-05,2.9e-05,-5e-06,8e-06,-6e-06,2.1e-05,-3.2e-05,-1e-06,1.7e-05,-2e-06,0,1.1e-05,-1.4e-05,1.9e-05,1.5e-05,1.2e-05,2e-06,-5e-06,6e-06,4e-06,5.7e-05,1.4e-05,-3.4e-05,1.1e-05,-2e-05,-1e-05,2.7e-05,-2.7e-05,-2.1e-05,-3.4e-05,-3e-06,9e-06,5e-06,2.1e-05,-2.2e-05,-3.4e-05,-2.1e-05,6.5e-05,1.3e-05,-7.6e-05,3.5e-05,-1e-05,-4e-06,1.4e-05,-7.2e-05,2.6e-05,1.1e-05,1.9e-05,1.3e-05,-2e-06,-1.4e-05,9e-06,-4.1e-05,-2.1e-05,-2.9e-05,4e-05,5e-06,-2e-06,-4e-06,0,1.1e-05,-6.7e-05,1.3e-05,-9e-06,-3.2e-05,2e-06,4e-06,-2.3e-05,-2e-06,5e-05,1.8e-05,1e-05,4e-06,-5e-06,-5e-06,-1.2e-05,5e-06,1.4e-05,-2.1e-05,-1.1e-05,-6e-06,-2.2e-05,1.4e-05,6e-06,-4e-06,6.4e-05,-4.5e-05,3.5e-05,7.4e-05,-2e-06,-2e-06,-2.1e-05,9e-06,1e-06,1.1e-05,8e-06,-2.9e-05,-8e-06,-2e-06,-1.6e-05,1.3e-05,-5e-06,-4e-06,-1.4e-05,-1.7e-05
2e-06,-1.3e-05,3e-05,8.4e-05,2.1e-05,9e-06,1.1e-05,-3e-05,8e-06,2.5e-05,2.7e-05,-2e-06,5e-06,-9e-06,-2.2e-05,-3.8e-05,1e-06,4e-06,7e-06,-2.7e-05,-4e-06,1e-06,3e-05,-9e-06,-1e-06,-1.1e-05,-1e-06,5e-06,1.1e-05,-1.4e-05,-2.7e-05,9e-06,6e-06,-8e-06,-2e-06,1e-06,-7e-06,-2e-06,8e-06,-1.3e-05,3.7e-05,2.2e-05,-9e-06,-3e-06,-1.2e-05,1e-06,-3.5e-05,6e-06,3e-06,1e-06,1.5e-05,1.1e-05,1.5e-05,3.2e-05,1.5e-05,2.6e-05,-3.5e-05,6e-06,8e-06,-5e-06,4.8e-05,1.9e-05,4e-06,1.2e-05,-2.4e-05,1.6e-05,-1.4e-05,-8e-06,-7e-06,3.2e-05,1.9e-05,-0.000102,-3e-06,5e-06,1.2e-05,-8e-06,5e-06,-1.7e-05,-1.8e-05,-2e-06,-3e-06,-3e-05,-5e-06,3e-05,3.7e-05,-2.2e-05,-1.2e-05,-3e-06,-7e-06,1.9e-05,2e-06,2e-06,-4.6e-05,-2.8e-05,8e-06,7e-06,4e-06,0,-1e-05,0,4e-06,-1.9e-05,-3.8e-05,4.1e-05,-4.8e-05,-2e-05,-4e-06,1.5e-05,-6e-06,-5e-06,1.1e-05,3e-06,-8e-06,-3e-06,7e-06,-2.1e-05,-4.3e-05,-2.2e-05,5e-06,4e-06,-9e-06
-7e-06,-4e-06,-3.4e-05,-5.5e-05,-2e-06,-7e-06,-4.6e-05,-1e-06,-2e-06,-2e-05,-1.3e-05,1.3e-05,1.2e-05,-3e-06,-3e-06,1.7e-05,-2.5e-05,-1e-05,-1.2e-05,3.5e-05,8e-06,-4e-06,3.8e-05,-8e-06,-1.1e-05,5e-06,1e-06,-1e-06,1e-06,-1e-05,-4.4e-05,-1.6e-05,0,9e-06,8e-06,5e-06,-4.2e-05,0,4.1e-05,-5e-06,-6e-05,-5e-06,-3e-06,7e-06,2.2e-05,1.9e-05,5e-05,1.1e-05,-1e-06,-1.5e-05,-2.2e-05,1.9e-05,-1e-06,-5.4e-05,-1e-06,6.3e-05,4.1e-05,1.1e-05,-1.2e-05,-1.4e-05,-2.9e-05,-4.3e-05,0,-1.8e-05,2.2e-05,5e-06,9e-06,6e-06,3.4e-05,-3.9e-05,7e-06,5e-06,6e-06,5e-06,-1.8e-05,3e-06,-1.3e-05,4.1e-05,1.7e-05,2e-06,9e-06,2.8e-05,2e-06,-2.6e-05,-2.8e-05,-1.8e-05,5e-06,-9e-06,2e-06,0,-2e-06,1.4e-05,1.8e-05,1.9e-05,6e-06,5.2e-05,-1e-06,6e-06,0,-1e-06,-1.1e-05,-4.7e-05,2e-05,-4.4e-05,9e-06,9e-06,-1e-06,-2.9e-05,-5e-06,-3e-06,-3e-06,-4e-06,3.2e-05,6e-06,1e-05,3.3e-05,-1e-05,-7e-06,7e-06,-5e-06,2e-06
5e-06,4e-06,-1.3e-05,3.4e-05,-3.8e-05,5e-06,-2.6e-05,-1.2e-05,-3e-06,1.8e-05,-2.1e-05,3e-06,0,1.1e-05,9e-06,-5e-06,9e-06,-2.1e-05,-5e-06,-3e-05,-5e-06,-1.3e-05,-2e-05,2e-06,1.5e-05,-6e-06,0,-1e-05,1e-06,1e-05,-1.9e-05,-3.7e-05,1e-06,-2.8e-05,5e-06,-1.4e-05,2e-06,3e-06,-1.6e-05,2.3e-05,2.4e-05,-2e-05,-3e-06,1.6e-05,-1.3e-05,-1.2e-05,1.8e-05,3e-06,8e-06,7e-06,1.7e-05,-5.2e-05,-2e-06,-7.1e-05,8e-06,3.2e-05,1.2e-05,-1.2e-05,-7e-06,-2.5e-05,-1e-06,3.3e-05,-1.3e-05,-5e-06,-1.5e-05,0,8e-06,-5e-06,-1.6e-05,3.7e-05,-3.2e-05,7.1e-05,-2.6e-05,-1.9e-05,1.3e-05,5e-06,1e-05,-6e-05,-7e-06,1e-06,-1e-06,-2e-06,-1e-06,2e-06,-1e-06,4.9e-05,-2e-06,6e-06,-6e-06,-2.4e-05,3e-06,-1.8e-05,3e-05,-9e-06,1e-06,1.4e-05,-2e-06,9e-06,7e-06,3e-06,1.1e-05,3.9e-05,4.3e-05,-2.6e-05,1e-06,2.1e-05,2e-06,1.2e-05,1.3e-05,1e-06,-1e-05,-6e-06,-1.1e-05,5e-06,5e-06,-1.7e-05,5e-06,1.4e-05,-4e-06,-1.3e-05,7e-06
2.2e-05,4e-06,-4.5e-05,-1.9e-05,4.7e-05,5e-06,3.2e-05,-1.2e-05,3e-06,-1.4e-05,2.1e-05,-9e-06,-9e-06,-1.5e-05,1.2e-05,-1e-06,-2e-06,-5e-06,1.4e-05,2.1e-05,0,1.9e-05,-3.9e-05,6e-06,-1.4e-05,2e-06,-1e-06,9e-06,5e-06,-2.3e-05,2.6e-05,-1.5e-05,-5e-06,2.4e-05,-8e-06,1.3e-05,4.1e-05,-9e-06,-2.8e-05,-1.2e-05,-3e-05,1.7e-05,-4e-06,2.1e-05,-8e-06,-8e-06,2.1e-05,-7e-06,0,5e-06,-3e-06,3.3e-05,9e-06,4e-06,-7e-06,1e-06,-7e-06,-1e-06,1.6e-05,-2e-06,2.1e-05,-3.2e-05,-7e-06,1e-05,5e-06,-4e-06,0,-8e-06,-7e-06,-2.9e-05,2.8e-05,-4e-05,3.7e-05,2.4e-05,-1e-05,-2e-06,-6e-06,6.3e-05,-1e-06,-2e-06,9e-06,-2.2e-05,1e-06,2.8e-05,-1.2e-05,-4.8e-05,-7e-06,4e-06,6e-06,1.2e-05,-3e-06,1e-05,-2.7e-05,3e-06,-5e-06,-2.1e-05,3e-06,-1.5e-05,-1.3e-05,-3e-06,-1.7e-05,1.2e-05,1.2e-05,4e-05,-7e-06,-2.3e-05,4e-06,-3e-05,-1.6e-05,-4e-06,-5e-06,-1e-06,-1.5e-05,-3e-06,-2e-06,-2.1e-05,8e-06,1.3e-05,7e-06,9e-06,-2e-06
-2e-05,-4e-06,1.7e-05,0,-7e-06,-1.1e-05,2.6e-05,-6e-06,-3e-06,9e-06,1.3e-05,0,-1.3e-05,1.2e-05,-2.9e-05,1.1e-05,-1.6e-05,2.3e-05,-2e-06,-5e-06,4e-06,-1.1e-05,1.1e-05,5e-06,7e-06,3e-06,1e-06,3e-06,4e-06,2.3e-05,4.1e-05,-2.3e-05,-1e-06,-8e-06,0,-8e-06,-1e-05,2e-06,5e-06,-1.8e-05,6.3e-05,-9e-06,-1.4e-05,-4e-06,2.3e-05,1e-05,7e-06,1e-06,4e-06,-8e-06,-4e-06,-1e-05,-1.4e-05,7e-05,-4e-06,-8.4e-05,-1.5e-05,9e-06,-6e-06,1.2e-05,-4.9e-05,1.7e-05,-1.1e-05,5e-06,-2e-06,-2e-06,-2.1e-05,8e-06,1.8e-05,2e-05,-1.3e-05,-3.5e-05,-1.8e-05,-2.4e-05,5e-06,-2e-06,3e-06,-1.8e-05,1e-05,-4e-06,-1.1e-05,2.6e-05,-1e-06,-2.6e-05,1.1e-05,1.6e-05,6e-06,-3e-06,-5e-06,1.6e-05,1e-06,-2e-06,-1.5e-05,1e-06,-6e-06,-2.9e-05,-4e-06,2e-06,9e-06,-2e-06,1.5e-05,-3.4e-05,-3.9e-05,1.8e-05,2.6e-05,-5e-06,2e-06,1.7e-05,1.8e-05,4e-06,6e-06,2e-06,1e-05,-6e-06,-6e-06,3.7e-05,-8e-06,1.8e-05,1e-06,-1.6e-05,8e-06
-7e-06,-8e-06,-3e-06,3e-05,-1.8e-05,3e-06,1.1e-05,1.2e-05,5e-06,-9e-06,-2.4e-05,7e-06,-3e-06,-1e-06,1.2e-05,-2.4e-05,9e-06,1.7e-05,-5e-06,-1.4e-05,-1e-06,0,4.8e-05,2e-06,3e-06,2e-06,0,-7e-06,2e-06,-3.4e-05,1.9e-05,1.3e-05,1e-05,5e-06,-3e-06,7e-06,-4.2e-05,2e-06,1.3e-05,2.3e-05,-3.7e-05,6e-06,-1e-06,-1.4e-05,-1e-05,-5e-06,-1.6e-05,-5e-06,-3e-06,3e-06,2e-05,-7e-06,4e-06,4.5e-05,-1e-06,-5.1e-05,0,-4e-06,4e-06,-1.6e-05,6.2e-05,1.3e-05,5e-06,-1.2e-05,4e-06,-3e-06,1.6e-05,4e-06,-1.5e-05,-1.2e-05,-1e-06,5.3e-05,-6e-06,9e-06,3e-06,2e-06,2e-06,-2.7e-05,-8e-06,4e-06,-9e-06,-9e-06,3e-06,0,3.1e-05,1.4e-05,-3e-06,-3e-06,2e-06,-1.8e-05,-2e-06,-3e-06,2.8e-05,-1.4e-05,1.2e-05,-2.7e-05,2e-06,7e-06,-4e-06,-1e-06,-1.5e-05,1.6e-05,-3.6e-05,-4e-05,-3.5e-05,1.5e-05,1e-06,8e-06,-1.9e-05,2e-06,7e-06,2e-06,4e-06,-1e-06,-5e-06,-1.2e-05,-3.5e-05,3e-06,-4e-06,-2e-06,-1.6e-05
8e-06,9e-06,3.2e-05,-6.8e-05,1.7e-05,5e-06,-1.1e-05,1.3e-05,-6e-06,7e-06,-5e-06,-8e-06,5e-06,-1.1e-05,3e-05,2.6e-05,8e-06,-8e-06,9e-06,2.7e-05,-4e-06,-9e-06,-1.1e-05,-4e-06,-1.1e-05,2e-06,-1e-06,-5e-06,4e-06,3.1e-05,-2.1e-05,1.6e-05,1e-06,6e-06,-1e-06,-1.1e-05,6e-06,0,-2e-06,9e-06,3.2e-05,1e-05,1.4e-05,0,-1.3e-05,-4e-06,9e-06,3e-06,-6e-06,4e-06,-4.1e-05,3.7e-05,8e-06,-1.9e-05,-6e-06,6.2e-05,-1.4e-05,-4e-06,6e-06,4e-06,-7.7e-05,-3.1e-05,7e-06,0,-9e-06,2e-06,1.4e-05,-1e-06,-1.5e-05,6e-06,1.9e-05,1.7e-05,6e-06,-1e-06,-5e-06,1e-06,-6e-06,4e-05,-1e-06,0,1.8e-05,-1.5e-05,-1e-06,5e-06,-3.3e-05,-2.8e-05,2e-06,1e-06,-5e-06,-5e-06,2e-06,6e-06,4e-06,1.9e-05,-1.1e-05,2.6e-05,4e-06,1e-06,-2e-06,3e-06,1.8e-05,1.5e-05,1.6e-05,-9e-06,3.1e-05,6e-06,-2e-06,1e-05,2e-05,1e-06,-2e-06,0,0,3e-06,1e-06,-1.9e-05,1.8e-05,-1.7e-05,-2e-06,8e-06,-8e-06
