8e-06,1.8e-05,1.5e-05,1e-06,1e-06,1.4e-05,1e-06,9e-06,1e-06,7e-06,1.5e-05,1.1e-05,1.5e-05,3.1e-05,9e-06,2.7e-05,2.9e-05,1e-05,6e-06,1.2e-05,2.4e-05,3.3e-05,5e-06,3.2e-05,1.7e-05,5e-06,1.1e-05,7e-06,1.1e-05,2e-06,7e-06,2e-05,2.9e-05,3e-06,1.9e-05,2e-06,7e-06,8e-06,1.5e-05,3e-06,1.3e-05,5e-06,1e-05,1.4e-05,7e-06,5e-06,2e-06,4e-06,2.4e-05,1e-06,8e-06,3e-06,9e-06,3e-06,3e-06,1.9e-05,1.1e-05,5e-06,1.2e-05,2.5e-05,1.8e-05,4e-06,2.7e-05,1.4e-05,6e-06,9e-06,1.1e-05,1.3e-05,9e-06,3e-06,1.3e-05,1.2e-05,1.4e-05,2e-06,1.4e-05,1e-06,1.3e-05,1e-06,2e-06,2.1e-05,9e-06,9e-06,0,1e-06,1.3e-05,1.2e-05,2e-06,1.6e-05,2.3e-05,1.2e-05,4e-06,1e-06,4e-06,1e-05,2.3e-05,1.9e-05,1.5e-05,9e-06,1.5e-05,1.6e-05,7e-06,7e-06,1.9e-05,4e-06,1e-06,0,1e-05,3e-06,2e-06,2e-06,2.3e-05,8e-06,1e-05,7e-06,8e-06,0,1.3e-05,1e-06,1.8e-05,2.1e-05,1.3e-05
1.9e-05,2.8e-05,1.8e-05,4.1e-05,3.1e-05,4.7e-05,3.1e-05,3.4e-05,2e-05,6e-06,3.3e-05,4e-05,5.1e-05,4.9e-05,3.1e-05,4.9e-05,6.2e-05,1.3e-05,4.3e-05,1.5e-05,7.7e-05,1.7e-05,2.9e-05,3.4e-05,7e-06,4e-05,8e-06,2.7e-05,2e-05,3.5e-05,1e-05,2.1e-05,7.3e-05,2.3e-05,5.9e-05,3.3e-05,2.3e-05,4.1e-05,2.2e-05,1.3e-05,2.4e-05,2.9e-05,1e-05,2.1e-05,1.7e-05,5e-06,1.1e-05,6e-06,3.2e-05,1.5e-05,2.6e-05,2.8e-05,2.3e-05,3.1e-05,2.6e-05,2.7e-05,4e-05,2.3e-05,4.2e-05,5.9e-05,4.2e-05,5e-06,6.2e-05,2.2e-05,2e-05,1.2e-05,1.6e-05,1.8e-05,3e-05,2.9e-05,2.7e-05,2.8e-05,1.3e-05,1.2e-05,2.4e-05,3.1e-05,1.7e-05,9e-06,9e-06,3.3e-05,1.2e-05,1.4e-05,2.6e-05,2.8e-05,3.9e-05,3.2e-05,1.6e-05,3.4e-05,3.7e-05,2.6e-05,1.8e-05,7e-06,1.5e-05,4.8e-05,3.1e-05,2.2e-05,3.8e-05,4.8e-05,4.4e-05,3.1e-05,1.4e-05,2.4e-05,5e-05,3.7e-05,2.9e-05,2.6e-05,1.3e-05,1.2e-05,1e-05,1.3e-05,6e-05,1.9e-05,2.1e-05,2.2e-05,2.5e-05,1.2e-05,2.5e-05,2.3e-05,2.1e-05,3.1e-05,2.1e-05
5.9e-05,8.6e-05,2.1e-05,6.1e-05,4.3e-05,4.8e-05,4e-06,3.9e-05,1e-05,5.2e-05,4.6e-05,2.9e-05,8.8e-05,0.000127,5.4e-05,5.1e-05,8.1e-05,9.4e-05,0.000106,5.4e-05,7.9e-05,9.7e-05,4.9e-05,5.5e-05,2e-05,2.6e-05,5.2e-05,3.8e-05,4.9e-05,4.9e-05,7.1e-05,7.4e-05,7.7e-05,3.5e-05,8.6e-05,4.4e-05,1.3e-05,5.4e-05,9.9e-05,6.1e-05,7e-05,3.6e-05,4.7e-05,1.5e-05,1.7e-05,6e-06,2.2e-05,2.8e-05,6.2e-05,1.3e-05,4.4e-05,9e-06,1.5e-05,2.4e-05,2.9e-05,2.8e-05,2.6e-05,1.4e-05,5.1e-05,5.9e-05,6.1e-05,3.7e-05,6.6e-05,6e-05,2.5e-05,5.4e-05,2.7e-05,2.2e-05,3.5e-05,2.3e-05,6.2e-05,7.6e-05,6.6e-05,3.1e-05,5.9e-05,1.1e-05,3.7e-05,4.7e-05,3.1e-05,6.2e-05,6.1e-05,1.6e-05,2.9e-05,3e-05,3.3e-05,4.8e-05,9e-06,3.9e-05,8.7e-05,4.5e-05,2.8e-05,2.2e-05,9e-06,7.2e-05,9.1e-05,4.6e-05,4.4e-05,9.6e-05,5.2e-05,8.8e-05,1.9e-05,8e-06,8.1e-05,4.3e-05,2.5e-05,3.4e-05,3.4e-05,6e-06,4e-06,2.2e-05,5.8e-05,5.5e-05,3.7e-05,4.2e-05,9e-06,2.4e-05,3.5e-05,1.9e-05,8e-06,5.1e-05,1.6e-05
9e-05,0.000124,0.000122,0.000128,3.6e-05,7.3e-05,3.7e-05,4e-05,3e-05,7.3e-05,5.4e-05,3.7e-05,3.9e-05,0.000105,7.2e-05,8.4e-05,5.7e-05,5.4e-05,0.000118,8.2e-05,0.000103,2.9e-05,2.7e-05,0.000114,5.4e-05,4.4e-05,1.4e-05,4.9e-05,7.8e-05,5e-05,5.6e-05,7.6e-05,2.4e-05,1.4e-05,5.1e-05,3.3e-05,3.6e-05,7.7e-05,4.2e-05,1.1e-05,5.8e-05,3.9e-05,7.5e-05,2e-05,5.6e-05,4.6e-05,4.8e-05,6.7e-05,4.6e-05,3.5e-05,3.9e-05,3.2e-05,4.5e-05,5.7e-05,7.9e-05,4.1e-05,3.5e-05,1.9e-05,2.4e-05,3.6e-05,0.000115,6.8e-05,1.9e-05,1.4e-05,7.7e-05,4.5e-05,5e-05,3.7e-05,3.2e-05,3e-05,6.3e-05,0.000111,2.9e-05,6.7e-05,7.6e-05,6.1e-05,6.2e-05,5.1e-05,3.8e-05,7.3e-05,5.2e-05,6.3e-05,4.1e-05,5.4e-05,6.8e-05,3.8e-05,5.3e-05,6e-05,5.6e-05,8.8e-05,8.2e-05,5.8e-05,4.3e-05,8e-05,3.4e-05,3.6e-05,7.3e-05,1.5e-05,5.7e-05,8.3e-05,4.6e-05,4.6e-05,8.1e-05,6.7e-05,2.3e-05,2.6e-05,7.2e-05,5.8e-05,2.3e-05,7e-06,5e-05,0.000118,0.000103,2.8e-05,1.5e-05,2.4e-05,1.7e-05,1.1e-05,2e-05,2.3e-05,6.8e-05
3.7e-05,0.000105,9.8e-05,2.8e-05,2.9e-05,0.000121,4.6e-05,5.3e-05,2.6e-05,1.4e-05,7.3e-05,5.2e-05,4e-05,2.5e-05,3.5e-05,7e-05,1.8e-05,0.000111,4.4e-05,7.5e-05,5.8e-05,7.9e-05,5e-05,0.000181,0.000135,7.8e-05,7.2e-05,4.5e-05,5.4e-05,7.4e-05,4.8e-05,8.7e-05,9.1e-05,5.1e-05,6.2e-05,7.3e-05,6.2e-05,6.6e-05,0.000109,6e-06,0.000102,0.000117,7e-06,7.5e-05,4.9e-05,6e-05,2.5e-05,6e-05,7.9e-05,7.2e-05,6e-05,5.3e-05,8.1e-05,0.000104,5.1e-05,2.5e-05,1.4e-05,6.8e-05,6.2e-05,5.4e-05,4.8e-05,6.7e-05,9.2e-05,1.3e-05,7.2e-05,5.6e-05,1.1e-05,5.7e-05,1.8e-05,5e-05,1.7e-05,9.5e-05,4e-05,7.7e-05,4e-05,4.1e-05,8.1e-05,9.3e-05,6.1e-05,6.1e-05,4.3e-05,4.6e-05,6.2e-05,1.9e-05,3.5e-05,6.9e-05,7.9e-05,5.3e-05,3.9e-05,4.6e-05,3.6e-05,2.2e-05,2.6e-05,3.5e-05,6.8e-05,1e-06,4.6e-05,8.2e-05,7.3e-05,1.6e-05,3.5e-05,7.3e-05,4.3e-05,3.1e-05,5e-05,5.7e-05,5.6e-05,1.1e-05,3.1e-05,1.3e-05,1.9e-05,6.1e-05,4.4e-05,5.1e-05,4.5e-05,1e-05,1.7e-05,2.2e-05,7e-06,3.7e-05,6e-05
4e-05,0.000148,0.000113,0.00014,9.5e-05,0.000138,0.000169,0.00012,7.5e-05,7.2e-05,7.1e-05,8.1e-05,0.000106,0.000136,8.8e-05,0.000109,7.6e-05,0.000111,0.000153,4.6e-05,8.3e-05,4.8e-05,2.8e-05,0.000141,0.000192,0.000142,0.000157,0.000143,9.3e-05,5.1e-05,8.2e-05,5.9e-05,0.000105,3.9e-05,0.000138,0.000187,0.000114,8.7e-05,9.6e-05,0.000106,0.00011,3.6e-05,6.1e-05,0.000132,8.5e-05,4e-05,9.2e-05,5.9e-05,3e-05,7e-05,4.8e-05,4.8e-05,0.000116,0.000166,0.000124,8e-05,8.8e-05,0.000138,2.2e-05,0.000123,1.4e-05,2.5e-05,1e-04,9.6e-05,0.000107,6e-05,6.1e-05,7.8e-05,7.8e-05,7.7e-05,9.8e-05,7.4e-05,9.6e-05,7.2e-05,8.1e-05,0.000118,3.9e-05,9.9e-05,8.1e-05,5.6e-05,9e-06,6e-05,5.6e-05,0.000103,8.4e-05,0.000122,1.4e-05,7.9e-05,6.7e-05,6e-06,5.7e-05,4e-05,6.5e-05,5.2e-05,7.8e-05,7e-05,3.9e-05,8.3e-05,3e-05,8.6e-05,4.3e-05,9.3e-05,4.2e-05,2e-05,6.8e-05,4.9e-05,2.8e-05,5.8e-05,1.5e-05,7.3e-05,3e-05,5.6e-05,3.1e-05,3.5e-05,4.2e-05,1.9e-05,1.2e-05,5.1e-05,5.5e-05,6.7e-05,6.2e-05
0.00022,0.000186,0.000232,0.00018,0.000113,5.3e-05,0.000102,7.2e-05,8e-05,0.000221,0.000208,4.3e-05,6.4e-05,0.000123,0.000233,0.000325,0.000201,0.00024,0.00013,0.00015,0.000248,0.000221,8.5e-05,3.3e-05,0.000113,4.9e-05,0.000141,6.8e-05,2.7e-05,0.000144,0.000232,0.000163,0.000142,8.7e-05,0.000142,0.000212,9.9e-05,0.00011,0.000177,2e-04,0.000161,0.000187,8.2e-05,0.000119,0.000134,0.00016,0.000129,0.000129,0.000128,6.4e-05,8.1e-05,4.8e-05,0.000118,0.000233,0.000209,0.00011,5.6e-05,7e-05,0.000137,0.000242,0.000268,0.000136,5.9e-05,0.000106,3.5e-05,5.3e-05,0.000115,7e-05,4.9e-05,0.000147,5.3e-05,8.4e-05,7.2e-05,4.9e-05,2.7e-05,6.1e-05,0.000131,5.6e-05,6.8e-05,8.7e-05,7.2e-05,7.3e-05,0.000146,0.000225,0.000177,7.7e-05,0.00012,8.4e-05,0.000116,0.000147,0.000136,0.000127,7e-05,4e-05,2.1e-05,3.9e-05,0.000104,0.000113,0.000121,0.000104,0.000153,0.000149,8.1e-05,5.7e-05,9.1e-05,8.3e-05,5.6e-05,5.9e-05,7.7e-05,0.000134,0.000152,0.000168,0.000135,2.9e-05,1.6e-05,4.4e-05,5.5e-05,7.1e-05,6.1e-05,7.5e-05,7.1e-05
0.000155,9.4e-05,0.000132,1.4e-05,0.000107,0.000121,9.5e-05,0.000112,1.2e-05,0.000207,0.000116,0.000197,0.000186,6.4e-05,0.000195,7.1e-05,0.000128,0.000184,0.000144,0.000146,0.000161,9.3e-05,0.00016,0.000278,0.000138,0.000121,9.1e-05,0.000195,0.000191,0.000264,0.000212,8.2e-05,0.000181,0.000266,0.000262,0.000153,0.00011,0.00012,0.000148,4.3e-05,0.000107,8.3e-05,0.000146,3.5e-05,5.2e-05,0.000137,0.000125,8.3e-05,4.9e-05,6.8e-05,9.1e-05,1.5e-05,6.6e-05,8.1e-05,2.9e-05,3.6e-05,8.7e-05,0.000121,0.000126,0.00013,0.000222,0.000123,8.9e-05,0.000113,5.7e-05,9.9e-05,7.7e-05,6.8e-05,8.4e-05,9.3e-05,0.000115,9.3e-05,7.5e-05,8.1e-05,3.6e-05,7.8e-05,0.000108,8.6e-05,8.3e-05,2.7e-05,4.2e-05,2.8e-05,7.7e-05,0.00014,0.000112,7.5e-05,0.000123,0.000196,6.9e-05,0.000121,4.4e-05,0.000103,7.9e-05,3.9e-05,1.8e-05,6e-05,0.000109,6e-06,9.3e-05,0.000101,0.000151,5.7e-05,3.7e-05,3.2e-05,0.000168,0.000166,0.000103,7.8e-05,2.9e-05,8.4e-05,6.9e-05,2.9e-05,6.1e-05,8e-05,5.7e-05,8.1e-05,9.2e-05,4.9e-05,6.7e-05,2.9e-05,9.1e-05
6.7e-05,4.7e-05,5e-05,5.4e-05,0.000156,0.000289,0.000196,0.000154,0.000127,0.000137,9.5e-05,0.000174,4.2e-05,0.000111,1e-04,0.000124,0.000123,0.000207,0.000109,0.000114,0.000192,0.000234,0.000201,0.000177,2e-04,0.000296,0.000305,0.000213,0.000126,9.1e-05,3.4e-05,4.5e-05,8e-05,0.000162,1.2e-05,2.4e-05,2.4e-05,4.4e-05,8.7e-05,7e-05,8.6e-05,0.000164,0.000217,0.000164,4.2e-05,0.000146,0.000229,0.000117,2.2e-05,9.3e-05,9.9e-05,5e-05,1.5e-05,6.6e-05,6.7e-05,8.7e-05,3.2e-05,7.1e-05,3.8e-05,0.000116,0.000159,0.000106,0.000141,0.000137,8e-05,8.6e-05,8.5e-05,6e-05,4.6e-05,7.8e-05,0.000103,0.000153,8.2e-05,6.8e-05,2.4e-05,8.9e-05,7.6e-05,9e-05,1.7e-05,2.6e-05,3.1e-05,1.5e-05,4.6e-05,5.1e-05,9.2e-05,7.2e-05,1.8e-05,0.000122,0.000155,9.8e-05,5.2e-05,9.8e-05,8.6e-05,0.000122,0.000103,0.000128,0.000199,0.000188,0.000119,2.4e-05,8.9e-05,4.6e-05,2.3e-05,3.1e-05,0.000133,3.7e-05,4.8e-05,6.8e-05,0.000102,0.000115,5.4e-05,4e-05,3.8e-05,6.8e-05,4.6e-05,7.1e-05,4.9e-05,3.7e-05,1.5e-05,2.9e-05,8.3e-05
3.2e-05,6e-05,4.5e-05,2.9e-05,0.000121,0.000151,9.3e-05,1.2e-05,5e-05,5.3e-05,1.7e-05,7.7e-05,8.9e-05,6.8e-05,5.3e-05,5.2e-05,0.000101,2.6e-05,3.3e-05,4.5e-05,9e-05,8.1e-05,9e-06,0.000206,0.000109,0.000106,0.000103,1.8e-05,0.000103,0.000168,8.5e-05,4.5e-05,4.9e-05,9e-05,9e-05,4.9e-05,1.7e-05,2.9e-05,2.5e-05,7.2e-05,6.3e-05,6.4e-05,6.4e-05,3.9e-05,6.3e-05,0.000109,4.2e-05,3.6e-05,2.9e-05,8.3e-05,9.9e-05,0.000105,5.7e-05,4.3e-05,3.9e-05,1.6e-05,2.1e-05,4.7e-05,3.8e-05,2.8e-05,0.000107,5.3e-05,8.6e-05,5.7e-05,3.9e-05,9.1e-05,4.8e-05,5.6e-05,5.4e-05,5e-06,4.8e-05,8.4e-05,4.1e-05,1.9e-05,2.2e-05,8.3e-05,3.4e-05,6.4e-05,4.2e-05,1.5e-05,1.4e-05,1.9e-05,5.1e-05,6e-06,3.3e-05,3.7e-05,5.7e-05,5.1e-05,4.2e-05,6.9e-05,3.4e-05,2.6e-05,7e-06,7.2e-05,2.7e-05,5.7e-05,8.1e-05,2.9e-05,6e-05,6.7e-05,4.5e-05,5.1e-05,3.4e-05,3.3e-05,9.3e-05,7.4e-05,3.5e-05,9e-06,5.6e-05,6.2e-05,1.5e-05,3.8e-05,1.9e-05,5.6e-05,7.7e-05,4e-05,6.1e-05,1.9e-05,1.2e-05,4e-05,3e-05
5.6e-05,3.3e-05,1.5e-05,2.7e-05,4.6e-05,8.2e-05,1.4e-05,2.2e-05,4.8e-05,3.9e-05,5.4e-05,4.4e-05,5.7e-05,4.5e-05,7.4e-05,1.8e-05,5e-05,4.2e-05,1e-05,2.4e-05,4.9e-05,2e-05,3.2e-05,0.000124,2.4e-05,5.2e-05,2.8e-05,4.5e-05,1.3e-05,8.2e-05,3.4e-05,4.3e-05,6.2e-05,2.8e-05,6.8e-05,5.7e-05,7.5e-05,3.6e-05,2.4e-05,3.9e-05,6.7e-05,5.7e-05,1.5e-05,7.2e-05,6.5e-05,3.9e-05,1.6e-05,2.5e-05,1.1e-05,6.4e-05,2.7e-05,5.3e-05,2.4e-05,3.5e-05,5e-05,3.7e-05,9e-06,2.6e-05,3.8e-05,2.9e-05,4e-06,3e-06,2.8e-05,2.9e-05,1.6e-05,3e-05,5e-05,7.1e-05,8e-06,2.3e-05,4.2e-05,3.2e-05,1.4e-05,3e-06,1.3e-05,3.7e-05,2.1e-05,4e-05,3.2e-05,9e-06,2.4e-05,2.6e-05,4.6e-05,2.4e-05,3.1e-05,3.8e-05,3.4e-05,1e-05,2.8e-05,1e-05,3.8e-05,2e-05,1.8e-05,4.2e-05,3.7e-05,2.6e-05,1.6e-05,3.9e-05,3.8e-05,1.9e-05,4.4e-05,2.2e-05,4.1e-05,5e-05,2e-05,3.3e-05,3.1e-05,1.7e-05,2.8e-05,2.8e-05,3.8e-05,1.6e-05,5e-06,4.4e-05,6e-06,1.9e-05,2.3e-05,3.7e-05,3.1e-05,6.2e-05,4.5e-05
1e-05,1.3e-05,2.1e-05,3.2e-05,3.7e-05,4.7e-05,2.5e-05,8e-06,3.6e-05,1.9e-05,1.9e-05,4e-05,1.7e-05,3e-05,1.3e-05,3.5e-05,3.6e-05,3.1e-05,2.5e-05,1e-05,2.7e-05,3.1e-05,8e-06,7.8e-05,2.9e-05,6.4e-05,4.1e-05,3.6e-05,2.6e-05,6.9e-05,1.1e-05,2.5e-05,1e-05,3.1e-05,4.6e-05,1.9e-05,3.6e-05,1.4e-05,1.9e-05,1e-05,3.2e-05,3.5e-05,6e-06,2.7e-05,1.4e-05,3.9e-05,3.3e-05,4e-06,1.2e-05,3e-05,3.3e-05,5e-06,3e-06,1.3e-05,2.4e-05,2.3e-05,3e-05,4.4e-05,1.8e-05,2.1e-05,3e-06,9e-06,3.4e-05,2e-05,2.1e-05,2.4e-05,2.6e-05,1.5e-05,9e-06,6e-06,2.6e-05,3.5e-05,2.5e-05,2.1e-05,2e-05,2.4e-05,6e-06,4e-05,2.1e-05,8e-06,3e-05,5e-06,3.9e-05,6e-06,2.4e-05,2.4e-05,2.9e-05,2e-05,1.7e-05,1.5e-05,1.6e-05,5e-06,1.9e-05,1.9e-05,6e-06,2.3e-05,1.9e-05,2.4e-05,2e-05,1.8e-05,1.3e-05,8e-06,2.8e-05,1.2e-05,1.4e-05,1.9e-05,2.4e-05,1e-06,1.6e-05,1.7e-05,2.3e-05,3.8e-05,1.7e-05,2.4e-05,9e-06,1e-05,2.1e-05,3.5e-05,8e-06,2.7e-05,2.1e-05
2e-05,4.1e-05,4.9e-05,3.2e-05,2.3e-05,4.7e-05,3.2e-05,6e-06,6.5e-05,1e-05,2.4e-05,5.9e-05,2.9e-05,3.6e-05,1.9e-05,2.1e-05,2.9e-05,1.1e-05,1.1e-05,3e-06,2.5e-05,5e-06,2e-05,5.5e-05,4.3e-05,3.8e-05,2.1e-05,9e-06,3e-06,4e-05,1.1e-05,1.7e-05,1.5e-05,1.7e-05,4.8e-05,1.2e-05,3.2e-05,1e-05,3.3e-05,3e-06,1.9e-05,2.5e-05,2e-05,2.7e-05,2.1e-05,3.3e-05,1e-05,1.2e-05,2e-05,1.6e-05,2.4e-05,1.6e-05,1.2e-05,2.4e-05,1.7e-05,3.1e-05,3.2e-05,2e-05,2.4e-05,1.3e-05,9e-06,4e-06,2.8e-05,1.3e-05,3.2e-05,6e-06,1.8e-05,1.8e-05,1.4e-05,1.2e-05,3.3e-05,2.4e-05,1.8e-05,9e-06,1e-06,1.1e-05,2.3e-05,3e-05,9e-06,1.2e-05,2.9e-05,1.6e-05,4.4e-05,1.7e-05,9e-06,1.4e-05,2.1e-05,1e-05,2e-06,3e-05,1e-05,1.5e-05,1e-05,1.5e-05,2e-05,1.6e-05,1e-05,7e-06,1.5e-05,1.3e-05,5e-06,1.5e-05,1.1e-05,1.4e-05,1.6e-05,1.4e-05,6e-06,9e-06,2e-05,5e-06,1.2e-05,4.2e-05,1.8e-05,1.9e-05,9e-06,1.1e-05,1.8e-05,3e-05,1.3e-05,2.3e-05,2e-06
3.9e-05,6.6e-05,2.6e-05,3.4e-05,3e-05,3.5e-05,5.3e-05,4.1e-05,8.3e-05,7e-05,3.6e-05,4e-05,2e-05,2.2e-05,4.1e-05,1.5e-05,1.5e-05,3.6e-05,4.2e-05,2.9e-05,1.2e-05,5e-06,5e-05,7.1e-05,5.1e-05,4.1e-05,2.3e-05,2.1e-05,3.2e-05,4.2e-05,1.8e-05,2e-05,1.9e-05,3.6e-05,3.1e-05,1.3e-05,3.2e-05,3.3e-05,3.5e-05,3.2e-05,2.3e-05,2.4e-05,1.9e-05,2.3e-05,2.3e-05,1.5e-05,1.7e-05,3.6e-05,2.3e-05,1.9e-05,3e-05,9e-06,7e-06,1.4e-05,4.1e-05,5e-05,6.6e-05,4.7e-05,3.9e-05,2.7e-05,2.2e-05,2.6e-05,1e-05,2.8e-05,3.8e-05,3.7e-05,3e-05,1.5e-05,7e-06,2.9e-05,4.4e-05,3.8e-05,4.3e-05,2.7e-05,2.3e-05,1.1e-05,1.9e-05,2.7e-05,3e-05,2.7e-05,2.2e-05,1.7e-05,2.8e-05,1.7e-05,1e-06,9e-06,3.8e-05,3.3e-05,3.1e-05,4.9e-05,4.1e-05,4.9e-05,4.2e-05,1.1e-05,1.2e-05,1.2e-05,1.2e-05,1.9e-05,2.1e-05,1.5e-05,1.6e-05,2.7e-05,9e-06,1.8e-05,1e-05,1.8e-05,3.1e-05,1.7e-05,3.8e-05,7e-06,1.4e-05,3.3e-05,1.8e-05,3e-05,2.1e-05,8e-06,3.5e-05,4.7e-05,4e-05,1.9e-05,1.3e-05
4e-05,4.8e-05,2.9e-05,3.2e-05,2.4e-05,9e-06,3e-05,3.1e-05,2.6e-05,6.1e-05,2.9e-05,1.5e-05,1.7e-05,1.2e-05,2.5e-05,2.2e-05,3.2e-05,3.7e-05,4.6e-05,2.4e-05,2.5e-05,1e-05,6.5e-05,3.7e-05,4.7e-05,2.8e-05,5.9e-05,1.6e-05,4.8e-05,4.4e-05,2.8e-05,2.9e-05,2.2e-05,5.1e-05,2.8e-05,1e-05,3.2e-05,4.9e-05,3.7e-05,3.6e-05,2e-06,8e-06,2.3e-05,1.4e-05,2.9e-05,4.3e-05,3.2e-05,2.8e-05,6.1e-05,3.5e-05,2.1e-05,1.8e-05,8e-06,2.5e-05,1.5e-05,1.4e-05,2e-05,0,4.6e-05,3.8e-05,2.6e-05,3.9e-05,1.5e-05,3.6e-05,1.3e-05,2.1e-05,2.6e-05,3.2e-05,2.5e-05,5.5e-05,3.5e-05,4.5e-05,1.4e-05,1.1e-05,2.6e-05,2.2e-05,1.3e-05,2.2e-05,9e-06,5e-05,2.2e-05,7e-06,1.9e-05,2.8e-05,2.3e-05,1.7e-05,2.3e-05,1.5e-05,2.5e-05,6e-05,6.3e-05,1e-06,1.8e-05,4e-05,2.7e-05,1.8e-05,1e-05,3.9e-05,4.1e-05,3.2e-05,1.7e-05,3.5e-05,4.8e-05,2.4e-05,2.2e-05,1.7e-05,4.2e-05,2.4e-05,3.8e-05,3.6e-05,1.5e-05,2.5e-05,3e-05,1.7e-05,2.3e-05,7e-06,5.6e-05,2.9e-05,2.7e-05,2.2e-05,2.3e-05
5.6e-05,3.6e-05,1.1e-05,3.6e-05,1.9e-05,1.5e-05,6.4e-05,2.6e-05,2.4e-05,2.5e-05,2.9e-05,3.1e-05,4.2e-05,2.6e-05,3.3e-05,2e-05,5.7e-05,7.4e-05,1.7e-05,6e-06,9e-06,2.9e-05,3e-05,3.6e-05,5.4e-05,3.7e-05,4.6e-05,1.9e-05,2.4e-05,4.9e-05,1.2e-05,2.7e-05,5e-06,4.7e-05,4.4e-05,4.9e-05,3.7e-05,9e-06,2.1e-05,2.4e-05,1.3e-05,1.9e-05,2.3e-05,1.3e-05,6.4e-05,9e-06,2.1e-05,4.3e-05,2.2e-05,3.8e-05,2.8e-05,3.5e-05,3.5e-05,1.2e-05,2.1e-05,3.2e-05,3.5e-05,2.5e-05,2.6e-05,3.1e-05,2.5e-05,2.7e-05,2.3e-05,3.4e-05,4.2e-05,2.9e-05,3.8e-05,4.5e-05,7e-06,4.4e-05,2.6e-05,4.9e-05,2.2e-05,9e-06,1.9e-05,2.9e-05,3e-05,1.5e-05,1.4e-05,3.7e-05,3.7e-05,3.1e-05,1.5e-05,3.2e-05,4.1e-05,2e-05,1.5e-05,9e-06,3.4e-05,2.5e-05,1e-05,1.7e-05,1.2e-05,3.6e-05,1.8e-05,7e-06,4e-06,3.5e-05,2.5e-05,4e-06,4e-06,2.3e-05,2.9e-05,1.2e-05,1.3e-05,5e-06,2.7e-05,2.2e-05,8e-06,2.2e-05,3.8e-05,1.7e-05,2.2e-05,2.4e-05,2.7e-05,1.3e-05,5.6e-05,6e-05,2.6e-05,2e-06,2.4e-05
6.5e-05,2.4e-05,1.6e-05,3.1e-05,5.4e-05,6.2e-05,6.4e-05,4.4e-05,4.7e-05,2.8e-05,5.6e-05,7.1e-05,4.3e-05,5.9e-05,2e-05,3.6e-05,5.8e-05,2.8e-05,1.6e-05,2.3e-05,2.1e-05,3.6e-05,4.1e-05,2.9e-05,4e-05,2e-05,2.4e-05,2e-05,2.4e-05,7.8e-05,3.6e-05,5.3e-05,4.9e-05,2.9e-05,3.2e-05,3.3e-05,2.3e-05,3.7e-05,1e-05,3e-05,3.7e-05,4.4e-05,4.5e-05,4e-05,4.5e-05,4.8e-05,3.8e-05,4e-05,2.8e-05,1.3e-05,6e-06,1.9e-05,4.5e-05,4.2e-05,2.4e-05,3.9e-05,6.3e-05,5.7e-05,4e-05,1.5e-05,4.4e-05,3.4e-05,2.6e-05,3.1e-05,6e-06,2.3e-05,4.4e-05,2e-05,2.1e-05,2.1e-05,2e-06,2.2e-05,2.6e-05,2.4e-05,2.5e-05,8e-06,2.6e-05,4.7e-05,3.8e-05,3.6e-05,1.5e-05,2e-05,4.2e-05,3.6e-05,1.7e-05,1.7e-05,2.4e-05,1.1e-05,3.8e-05,4.8e-05,4.6e-05,1.9e-05,2e-05,1.9e-05,2.8e-05,2.7e-05,3.1e-05,2.1e-05,3.9e-05,3e-05,2.1e-05,1e-05,6e-06,3.5e-05,2.7e-05,1.1e-05,1.3e-05,6e-06,2e-06,2.5e-05,1.4e-05,3.3e-05,8e-06,1.7e-05,2e-05,3.1e-05,3.4e-05,4.5e-05,3e-05,1.3e-05,1.9e-05
3.4e-05,2.8e-05,1.7e-05,3.4e-05,3.2e-05,3.6e-05,3.1e-05,1.5e-05,5.2e-05,5.5e-05,4.9e-05,1.8e-05,1.4e-05,5.6e-05,3.8e-05,1e-05,2.7e-05,1.5e-05,1.7e-05,4.4e-05,4e-06,2.4e-05,1.9e-05,2.4e-05,1.9e-05,2.5e-05,1.8e-05,2.3e-05,2.1e-05,4.5e-05,2e-06,4.4e-05,9e-06,1e-05,5.3e-05,3.1e-05,7e-06,4.2e-05,2.4e-05,2.7e-05,2.4e-05,8e-06,2e-05,1.6e-05,2e-05,1.7e-05,2.1e-05,1.4e-05,1.7e-05,3e-05,1.4e-05,2.2e-05,2e-05,1.2e-05,2.1e-05,4e-05,1.3e-05,2.8e-05,1e-05,1.8e-05,4.7e-05,7e-06,1.4e-05,1.1e-05,3.5e-05,2.5e-05,1.5e-05,3.8e-05,5e-05,1.9e-05,5e-06,2.5e-05,2.3e-05,8e-06,1.5e-05,4e-06,1.9e-05,3.1e-05,9e-06,1.5e-05,3.2e-05,1.3e-05,3e-05,6e-06,1.6e-05,1.3e-05,1.1e-05,2.2e-05,2e-05,1.4e-05,2.1e-05,1.7e-05,2.3e-05,5e-06,2.8e-05,3.9e-05,4e-06,1.9e-05,8e-06,7e-06,2e-05,1.5e-05,1.3e-05,1.2e-05,1e-05,2.8e-05,9e-06,8e-06,9e-06,1.9e-05,1.9e-05,1.8e-05,4e-06,1.1e-05,2e-06,2.7e-05,1.5e-05,1.2e-05,1.5e-05,2.6e-05,4e-06
3.1e-05,2.5e-05,5.4e-05,2.8e-05,2.5e-05,4.4e-05,1.2e-05,1.9e-05,7.1e-05,3.8e-05,3.2e-05,1.7e-05,3.3e-05,4e-05,3e-05,3.2e-05,2.1e-05,2.6e-05,3.8e-05,5.6e-05,3.7e-05,4.4e-05,3.5e-05,5.6e-05,1.4e-05,2e-05,3.4e-05,1.8e-05,2.9e-05,4.1e-05,4.2e-05,2.3e-05,2.9e-05,2.2e-05,3.7e-05,2.3e-05,2.4e-05,3.8e-05,3.2e-05,2e-05,1.4e-05,7e-06,3.4e-05,3.5e-05,9e-06,3.7e-05,1.9e-05,2e-06,3.9e-05,4.4e-05,2.3e-05,3.1e-05,2.3e-05,1.8e-05,2.6e-05,5.8e-05,6.3e-05,2.9e-05,1.4e-05,2.1e-05,3.1e-05,3e-05,3.3e-05,1.6e-05,4.9e-05,4.1e-05,2e-05,4.8e-05,2.6e-05,1.9e-05,6e-06,2.1e-05,3.1e-05,2.2e-05,1e-05,1e-05,1.4e-05,8e-06,2.7e-05,1.9e-05,4.1e-05,3e-06,7e-06,1.9e-05,2.9e-05,1.3e-05,1.8e-05,1.6e-05,8e-06,2.1e-05,2.7e-05,2e-05,1.6e-05,1.2e-05,2.6e-05,1.7e-05,1.2e-05,2.9e-05,3e-06,1.2e-05,1.7e-05,1e-05,1.5e-05,9e-06,6e-06,2.7e-05,3.3e-05,2.6e-05,2.6e-05,1.5e-05,1.1e-05,2.1e-05,1.7e-05,3.3e-05,2.2e-05,2.6e-05,2.7e-05,3.1e-05,8e-06,3.5e-05,3.3e-05
3.6e-05,1e-05,4.1e-05,1.3e-05,1.9e-05,6.4e-05,1.6e-05,2.5e-05,3.3e-05,5.3e-05,5.4e-05,3.1e-05,1.7e-05,5.6e-05,7.4e-05,1.9e-05,2.7e-05,2.9e-05,4.3e-05,2e-05,6e-06,2.4e-05,1.5e-05,4.8e-05,2.7e-05,3.4e-05,2.5e-05,7e-06,1.5e-05,2.9e-05,5.3e-05,5.8e-05,1.6e-05,4.5e-05,1.5e-05,4.5e-05,3.5e-05,2.5e-05,4.1e-05,2.3e-05,2.8e-05,2.7e-05,3.6e-05,2.1e-05,2e-05,3.8e-05,1.1e-05,2.9e-05,4.9e-05,2.5e-05,3.4e-05,3.3e-05,1.8e-05,1.2e-05,2e-05,3.9e-05,3.7e-05,4e-05,2.5e-05,3e-05,1.1e-05,2.2e-05,1.5e-05,2e-05,2.8e-05,1.7e-05,1.8e-05,4.4e-05,2.2e-05,2.3e-05,1.5e-05,1.7e-05,3.9e-05,3.9e-05,2.8e-05,3.4e-05,4.3e-05,3.2e-05,2.6e-05,1.4e-05,1.7e-05,3.7e-05,3.4e-05,4.3e-05,2e-05,1.3e-05,2e-05,1.1e-05,1.6e-05,1.2e-05,1.1e-05,4.5e-05,4e-05,3.9e-05,1.4e-05,1.3e-05,9e-06,4.1e-05,3.8e-05,1.2e-05,2.1e-05,1e-05,2.3e-05,1.5e-05,5e-06,1.1e-05,3.6e-05,2.8e-05,1.4e-05,2.4e-05,1.8e-05,2.9e-05,3.9e-05,1.7e-05,1e-05,2.8e-05,2.7e-05,1.5e-05,1.7e-05,1.7e-05,1.3e-05
3.4e-05,3e-05,3e-05,5.5e-05,2.8e-05,4.5e-05,4.4e-05,1.1e-05,5.6e-05,7.2e-05,1.8e-05,4.1e-05,2.5e-05,4.9e-05,8e-06,4.7e-05,7.5e-05,5.6e-05,3.1e-05,4.4e-05,4.3e-05,1.8e-05,3.1e-05,5.4e-05,1.4e-05,6.4e-05,2.3e-05,6e-06,2.1e-05,3.9e-05,5.1e-05,1.5e-05,3.8e-05,5e-05,8.5e-05,5.5e-05,3.7e-05,3.4e-05,3.1e-05,4.1e-05,1.5e-05,1.8e-05,4.2e-05,5.8e-05,5.2e-05,4.3e-05,2.3e-05,3.6e-05,5.9e-05,2.9e-05,3.4e-05,5e-05,2.3e-05,2.6e-05,6e-06,1.9e-05,3.7e-05,1.9e-05,2.8e-05,2.8e-05,3.5e-05,2.6e-05,3.2e-05,1e-05,2.6e-05,4.1e-05,5.6e-05,6.5e-05,2.2e-05,2.3e-05,1.9e-05,3e-05,4e-05,2.7e-05,7e-06,3.2e-05,2.8e-05,7e-06,1.7e-05,1.7e-05,2.4e-05,4.5e-05,1.4e-05,5.2e-05,3.3e-05,1.4e-05,4e-06,2.8e-05,1.1e-05,5e-06,2.1e-05,3.9e-05,5e-06,2.2e-05,4.8e-05,3.1e-05,1.5e-05,4.7e-05,1.2e-05,2.7e-05,1.2e-05,1.6e-05,3.7e-05,3.7e-05,2.8e-05,1.9e-05,3.1e-05,2.1e-05,1.9e-05,1.4e-05,7e-06,2.6e-05,6e-06,2.5e-05,2.9e-05,2.8e-05,3.4e-05,1e-05,3.3e-05,3e-06,6e-06
6e-05,1.5e-05,1.7e-05,7.3e-05,5.1e-05,2.4e-05,5.1e-05,4.3e-05,5.6e-05,5.9e-05,1.9e-05,4.4e-05,2e-05,2.5e-05,4.6e-05,5.8e-05,2.3e-05,2.4e-05,6.1e-05,4.7e-05,1.7e-05,3.9e-05,4.7e-05,1.6e-05,2.8e-05,5.8e-05,2.8e-05,2.4e-05,2.8e-05,1.9e-05,1.7e-05,5.1e-05,4.7e-05,2.7e-05,4.4e-05,8.4e-05,5.6e-05,4.5e-05,4e-05,5.1e-05,2.9e-05,2.9e-05,4e-06,3.4e-05,2.3e-05,2.6e-05,2.8e-05,4.7e-05,2.7e-05,4.1e-05,2.8e-05,1.3e-05,1.7e-05,2.3e-05,2.8e-05,3e-06,4e-06,2.2e-05,4.1e-05,2.7e-05,1.4e-05,4.3e-05,4.7e-05,2.1e-05,7e-06,1.9e-05,2.9e-05,3.3e-05,3e-05,3.5e-05,1.7e-05,5.1e-05,5e-06,3.4e-05,4.2e-05,1.8e-05,1.1e-05,7e-06,1.1e-05,4.2e-05,5.9e-05,6.9e-05,2.7e-05,3e-05,2.4e-05,6e-06,2e-05,3.2e-05,3.3e-05,2.8e-05,4.7e-05,5.4e-05,5.1e-05,1e-05,4.1e-05,2.3e-05,2e-05,4.8e-05,5.3e-05,4.1e-05,3.5e-05,3.1e-05,6.2e-05,1.1e-05,1.8e-05,2.8e-05,2.2e-05,3.1e-05,2.5e-05,1.3e-05,7e-06,2.1e-05,1.3e-05,1.6e-05,4.2e-05,2e-05,3.1e-05,4e-05,5.7e-05,6.3e-05,2.4e-05
1.3e-05,1.5e-05,1.6e-05,5.1e-05,3.2e-05,1e-05,3.3e-05,2.2e-05,1.4e-05,1.6e-05,2.3e-05,3.1e-05,2.1e-05,8e-06,1.1e-05,1.7e-05,2e-05,2.2e-05,2.1e-05,1.5e-05,1.4e-05,2.5e-05,2.7e-05,2.2e-05,1.7e-05,1e-06,8e-06,1.4e-05,3e-06,1.5e-05,7e-06,1.6e-05,5e-06,6e-06,1.7e-05,2.1e-05,5e-06,1.1e-05,2.4e-05,1.4e-05,1.6e-05,3.1e-05,1.8e-05,1.1e-05,1.2e-05,2.9e-05,5e-06,1.9e-05,2.7e-05,1.7e-05,1.5e-05,1.2e-05,4e-06,8e-06,5e-06,7e-06,9e-06,9e-06,1e-05,1.4e-05,1.7e-05,2.5e-05,2.4e-05,1.6e-05,1.7e-05,1.9e-05,2.2e-05,3.3e-05,3.3e-05,2.2e-05,6e-06,1.5e-05,1.6e-05,7e-06,1.1e-05,1.7e-05,2.6e-05,1.1e-05,6e-06,2.4e-05,1.2e-05,1.3e-05,1.7e-05,9e-06,1.5e-05,1.8e-05,2e-05,9e-06,2e-06,4e-06,1.3e-05,6e-06,1.7e-05,8e-06,1e-05,7e-06,9e-06,1.6e-05,2.3e-05,1.1e-05,2.1e-05,2.4e-05,6e-06,2.1e-05,2.7e-05,1.3e-05,6e-06,8e-06,1.1e-05,5e-06,0,9e-06,1e-06,1e-05,1.5e-05,1.2e-05,1.7e-05,2e-06,1.7e-05,2.1e-05,2e-05
4e-06,6e-06,1.5e-05,2.5e-05,1.6e-05,2.1e-05,2.1e-05,1e-05,6e-06,1.7e-05,7e-06,1.3e-05,2e-05,1.4e-05,3e-06,2e-06,2e-06,1e-05,1.2e-05,1.4e-05,1.6e-05,1.5e-05,3e-06,5e-06,8e-06,1.1e-05,1.7e-05,1e-05,6e-06,1.4e-05,8e-06,6e-06,5e-06,8e-06,1.8e-05,6e-06,1.2e-05,1e-05,1.5e-05,5e-06,1.7e-05,1.2e-05,2e-06,1e-05,2e-05,1.5e-05,1.5e-05,9e-06,6e-06,8e-06,1.6e-05,1.2e-05,7e-06,3e-06,2e-06,6e-06,4e-06,5e-06,3e-06,6e-06,5e-06,1.1e-05,2e-06,6e-06,1.1e-05,1.3e-05,2e-06,1.5e-05,1.1e-05,6e-06,1e-05,1e-06,9e-06,9e-06,2e-06,1.7e-05,1.3e-05,8e-06,7e-06,1.8e-05,1.3e-05,8e-06,6e-06,5e-06,1.2e-05,1.3e-05,7e-06,8e-06,6e-06,5e-06,1e-05,5e-06,1.1e-05,9e-06,2e-06,6e-06,9e-06,1.8e-05,6e-06,1.2e-05,1.2e-05,5e-06,1e-05,1.3e-05,1.3e-05,7e-06,7e-06,6e-06,3e-06,4e-06,5e-06,5e-06,2e-06,7e-06,3e-06,1.2e-05,4e-06,5e-06,8e-06,6e-06,1.1e-05
6e-06,8e-06,1.4e-05,1.1e-05,1.2e-05,6e-06,9e-06,4e-06,8e-06,6e-06,8e-06,8e-06,4e-06,2e-06,6e-06,5e-06,3e-06,3e-06,1e-05,3e-06,9e-06,7e-06,2e-06,6e-06,6e-06,2e-06,1.1e-05,4e-06,5e-06,6e-06,3e-06,5e-06,4e-06,3e-06,1.7e-05,7e-06,3e-06,7e-06,8e-06,2e-06,1.1e-05,5e-06,4e-06,6e-06,1.1e-05,5e-06,7e-06,6e-06,9e-06,9e-06,1.1e-05,3e-06,1e-06,2e-06,3e-06,5e-06,4e-06,9e-06,7e-06,3e-06,3e-06,7e-06,4e-06,4e-06,5e-06,2e-06,2e-06,1.1e-05,1.1e-05,0,3e-06,3e-06,6e-06,2e-06,4e-06,1.4e-05,4e-06,2e-06,2e-06,7e-06,7e-06,3e-06,7e-06,6e-06,5e-06,6e-06,6e-06,1e-06,3e-06,5e-06,2e-06,8e-06,3e-06,6e-06,3e-06,9e-06,8e-06,7e-06,3e-06,6e-06,6e-06,4e-06,1e-06,8e-06,5e-06,3e-06,1e-06,2e-06,0,2e-06,4e-06,8e-06,1e-06,3e-06,0,7e-06,1e-06,3e-06,8e-06,3e-06,4e-06
6e-06,7e-06,9e-06,1e-05,7e-06,1.1e-05,4e-06,2e-06,6e-06,9e-06,2e-06,1e-06,2e-06,1e-06,1e-06,1e-06,4e-06,4e-06,9e-06,5e-06,3e-06,6e-06,3e-06,8e-06,2e-06,7e-06,1.3e-05,8e-06,3e-06,6e-06,2e-06,1e-06,3e-06,3e-06,6e-06,4e-06,2e-06,7e-06,7e-06,5e-06,8e-06,6e-06,6e-06,7e-06,8e-06,2e-06,8e-06,6e-06,6e-06,4e-06,1e-05,6e-06,2e-06,5e-06,4e-06,5e-06,2e-06,4e-06,4e-06,4e-06,5e-06,1e-05,2e-06,4e-06,6e-06,5e-06,2e-06,8e-06,8e-06,4e-06,3e-06,1e-06,4e-06,5e-06,2e-06,9e-06,2e-06,4e-06,2e-06,2e-06,7e-06,3e-06,8e-06,6e-06,7e-06,7e-06,3e-06,4e-06,6e-06,5e-06,4e-06,7e-06,3e-06,2e-06,5e-06,3e-06,3e-06,8e-06,7e-06,7e-06,4e-06,3e-06,5e-06,1e-06,4e-06,6e-06,5e-06,1e-06,2e-06,1e-06,1e-06,3e-06,1e-06,5e-06,2e-06,1e-06,6e-06,4e-06,6e-06,2e-06,4e-06
4e-06,3e-06,9e-06,3e-06,8e-06,1e-05,4e-06,4e-06,6e-06,6e-06,8e-06,2e-06,3e-06,3e-06,5e-06,3e-06,7e-06,2e-06,1e-05,3e-06,1e-06,6e-06,4e-06,1.2e-05,5e-06,9e-06,9e-06,4e-06,5e-06,1e-05,3e-06,2e-06,3e-06,3e-06,9e-06,5e-06,3e-06,1e-06,4e-06,3e-06,1e-05,2e-06,2e-06,5e-06,7e-06,4e-06,1e-06,1e-06,5e-06,4e-06,7e-06,1e-06,1e-06,2e-06,4e-06,3e-06,1e-06,5e-06,1e-06,2e-06,4e-06,6e-06,6e-06,5e-06,2e-06,2e-06,5e-06,3e-06,7e-06,3e-06,4e-06,4e-06,4e-06,4e-06,2e-06,9e-06,4e-06,2e-06,3e-06,6e-06,5e-06,2e-06,7e-06,3e-06,3e-06,6e-06,3e-06,3e-06,4e-06,5e-06,2e-06,1e-06,2e-06,6e-06,0,1e-06,4e-06,9e-06,7e-06,5e-06,3e-06,5e-06,6e-06,4e-06,3e-06,0,3e-06,1e-06,1e-06,4e-06,3e-06,6e-06,2e-06,4e-06,1e-06,2e-06,4e-06,2e-06,5e-06,2e-06,5e-06
2e-06,2e-06,6e-06,6e-06,1e-05,1e-05,1e-06,1e-06,6e-06,4e-06,6e-06,3e-06,2e-06,3e-06,6e-06,4e-06,3e-06,3e-06,2e-06,5e-06,4e-06,5e-06,2e-06,9e-06,4e-06,6e-06,8e-06,2e-06,4e-06,8e-06,4e-06,1e-06,3e-06,4e-06,7e-06,3e-06,3e-06,5e-06,3e-06,1e-06,9e-06,2e-06,2e-06,4e-06,6e-06,5e-06,4e-06,1e-06,6e-06,4e-06,4e-06,4e-06,5e-06,5e-06,3e-06,4e-06,2e-06,3e-06,3e-06,2e-06,4e-06,4e-06,3e-06,1e-06,4e-06,4e-06,4e-06,3e-06,6e-06,1e-06,2e-06,5e-06,3e-06,2e-06,4e-06,1.1e-05,6e-06,2e-06,3e-06,1e-06,5e-06,3e-06,9e-06,5e-06,5e-06,3e-06,3e-06,1e-06,2e-06,2e-06,3e-06,2e-06,3e-06,4e-06,3e-06,2e-06,3e-06,5e-06,2e-06,2e-06,2e-06,2e-06,6e-06,3e-06,2e-06,3e-06,2e-06,1e-06,2e-06,3e-06,1e-06,4e-06,4e-06,1e-06,2e-06,2e-06,2e-06,1e-06,2e-06,1e-06,6e-06
6e-06,4e-06,5e-06,6e-06,7e-06,6e-06,2e-06,1e-06,3e-06,2e-06,4e-06,4e-06,1e-06,5e-06,7e-06,3e-06,5e-06,4e-06,2e-06,3e-06,2e-06,3e-06,5e-06,1e-05,3e-06,6e-06,5e-06,3e-06,4e-06,7e-06,4e-06,3e-06,0,3e-06,7e-06,3e-06,2e-06,3e-06,1e-06,1e-06,6e-06,3e-06,4e-06,4e-06,6e-06,5e-06,1e-06,1e-06,5e-06,4e-06,4e-06,5e-06,1e-06,5e-06,1e-06,3e-06,1e-06,4e-06,4e-06,3e-06,5e-06,2e-06,5e-06,1e-06,0,5e-06,4e-06,7e-06,5e-06,3e-06,2e-06,4e-06,4e-06,1e-06,2e-06,6e-06,4e-06,1e-06,1e-06,1e-06,3e-06,2e-06,8e-06,2e-06,6e-06,7e-06,0,2e-06,1e-06,1e-06,2e-06,5e-06,3e-06,3e-06,1e-06,2e-06,1e-06,3e-06,1e-06,4e-06,3e-06,3e-06,4e-06,2e-06,1e-06,3e-06,2e-06,2e-06,0,4e-06,1e-06,4e-06,2e-06,1e-06,3e-06,1e-06,1e-06,2e-06,4e-06,3e-06,4e-06
3e-06,3e-06,4e-06,4e-06,8e-06,6e-06,2e-06,4e-06,8e-06,2e-06,2e-06,4e-06,1e-06,6e-06,7e-06,4e-06,3e-06,2e-06,3e-06,2e-06,3e-06,3e-06,4e-06,6e-06,1e-06,3e-06,4e-06,3e-06,5e-06,6e-06,3e-06,1e-06,2e-06,6e-06,6e-06,5e-06,1e-06,2e-06,2e-06,2e-06,7e-06,4e-06,3e-06,2e-06,5e-06,5e-06,3e-06,3e-06,3e-06,5e-06,3e-06,4e-06,4e-06,5e-06,2e-06,0,2e-06,3e-06,6e-06,1e-06,3e-06,2e-06,2e-06,2e-06,1e-06,4e-06,1e-06,5e-06,5e-06,4e-06,5e-06,2e-06,2e-06,1e-06,2e-06,8e-06,5e-06,2e-06,3e-06,1e-06,1e-06,3e-06,7e-06,5e-06,4e-06,5e-06,1e-06,1e-06,3e-06,4e-06,2e-06,1e-06,1e-06,0,2e-06,2e-06,1e-06,5e-06,2e-06,2e-06,4e-06,0,2e-06,4e-06,1e-06,2e-06,2e-06,2e-06,1e-06,2e-06,2e-06,4e-06,4e-06,1e-06,3e-06,1e-06,2e-06,2e-06,3e-06,1e-06,4e-06
4e-06,3e-06,3e-06,5e-06,1e-05,9e-06,8e-06,7e-06,4e-06,6e-06,4e-06,4e-06,5e-06,7e-06,9e-06,5e-06,6e-06,4e-06,5e-06,2e-06,2e-06,3e-06,3e-06,7e-06,2e-06,5e-06,6e-06,6e-06,6e-06,7e-06,2e-06,3e-06,3e-06,3e-06,5e-06,3e-06,4e-06,2e-06,2e-06,2e-06,9e-06,4e-06,2e-06,4e-06,4e-06,1e-06,8e-06,3e-06,5e-06,5e-06,4e-06,4e-06,2e-06,5e-06,1e-06,2e-06,1e-06,2e-06,8e-06,7e-06,3e-06,5e-06,3e-06,5e-06,4e-06,3e-06,2e-06,8e-06,8e-06,7e-06,1e-06,4e-06,2e-06,3e-06,5e-06,6e-06,4e-06,3e-06,0,1e-06,2e-06,1e-06,6e-06,4e-06,4e-06,4e-06,3e-06,2e-06,1e-06,2e-06,2e-06,1e-06,2e-06,2e-06,4e-06,6e-06,5e-06,7e-06,4e-06,1e-06,3e-06,2e-06,2e-06,3e-06,0,1e-06,0,2e-06,1e-06,3e-06,1e-06,4e-06,5e-06,4e-06,2e-06,4e-06,2e-06,3e-06,3e-06,0,2e-06
4e-06,3e-06,1e-05,3e-06,2e-06,1.5e-05,9e-06,7e-06,3e-06,4e-06,2e-06,7e-06,5e-06,1.1e-05,1.5e-05,4e-06,3e-06,1e-06,3e-06,1e-06,3e-06,5e-06,2e-06,1e-05,3e-06,8e-06,8e-06,8e-06,7e-06,5e-06,4e-06,5e-06,2e-06,1e-06,6e-06,1e-06,5e-06,5e-06,4e-06,4e-06,7e-06,4e-06,2e-06,3e-06,4e-06,7e-06,5e-06,4e-06,2e-06,1e-05,8e-06,1e-06,3e-06,4e-06,4e-06,4e-06,6e-06,1e-05,9e-06,8e-06,7e-06,4e-06,3e-06,4e-06,3e-06,2e-06,3e-06,9e-06,5e-06,4e-06,4e-06,4e-06,6e-06,2e-06,6e-06,6e-06,9e-06,3e-06,3e-06,5e-06,5e-06,2e-06,5e-06,2e-06,1e-06,3e-06,5e-06,5e-06,3e-06,1e-06,2e-06,2e-06,1e-06,2e-06,3e-06,5e-06,2e-06,0,6e-06,6e-06,4e-06,3e-06,2e-06,3e-06,3e-06,2e-06,3e-06,2e-06,1e-06,5e-06,4e-06,2e-06,2e-06,5e-06,5e-06,7e-06,3e-06,1e-06,1e-06,1e-06,3e-06
5e-06,3e-06,1e-05,1.2e-05,1.2e-05,8e-06,3e-06,3e-06,2e-06,8e-06,9e-06,4e-06,4e-06,8e-06,3e-06,7e-06,6e-06,5e-06,2e-06,3e-06,3e-06,4e-06,2e-06,1.2e-05,0,3e-06,7e-06,7e-06,7e-06,1e-05,5e-06,0,1e-06,4e-06,7e-06,3e-06,4e-06,7e-06,3e-06,3e-06,5e-06,2e-06,1e-06,3e-06,2e-06,6e-06,1e-06,0,3e-06,6e-06,2e-06,4e-06,3e-06,4e-06,1e-06,3e-06,3e-06,5e-06,1e-06,2e-06,1e-06,4e-06,2e-06,4e-06,3e-06,2e-06,3e-06,3e-06,6e-06,3e-06,1e-06,3e-06,3e-06,2e-06,2e-06,6e-06,8e-06,6e-06,1e-06,4e-06,2e-06,2e-06,5e-06,2e-06,4e-06,4e-06,4e-06,2e-06,1e-06,2e-06,3e-06,4e-06,3e-06,1e-06,2e-06,2e-06,3e-06,5e-06,6e-06,5e-06,4e-06,3e-06,5e-06,5e-06,1e-06,1e-06,1e-06,1e-06,0,3e-06,2e-06,2e-06,2e-06,4e-06,3e-06,2e-06,1e-06,2e-06,2e-06,2e-06,6e-06
6e-06,5e-06,7e-06,5e-06,8e-06,5e-06,2e-06,5e-06,1e-06,3e-06,6e-06,3e-06,1e-06,3e-06,3e-06,2e-06,4e-06,2e-06,3e-06,5e-06,4e-06,6e-06,4e-06,6e-06,3e-06,4e-06,7e-06,7e-06,5e-06,5e-06,0,1e-06,1e-06,3e-06,6e-06,2e-06,4e-06,4e-06,3e-06,5e-06,7e-06,1e-06,2e-06,3e-06,3e-06,5e-06,3e-06,3e-06,4e-06,2e-06,3e-06,3e-06,3e-06,4e-06,3e-06,2e-06,1e-06,6e-06,4e-06,3e-06,3e-06,3e-06,4e-06,2e-06,3e-06,4e-06,3e-06,4e-06,5e-06,2e-06,1e-06,4e-06,1e-06,2e-06,3e-06,7e-06,5e-06,4e-06,3e-06,3e-06,2e-06,1e-06,6e-06,3e-06,5e-06,1e-06,0,2e-06,1e-06,2e-06,1e-06,4e-06,2e-06,2e-06,2e-06,2e-06,1e-06,5e-06,5e-06,5e-06,5e-06,2e-06,5e-06,6e-06,3e-06,2e-06,1e-06,0,0,2e-06,2e-06,2e-06,2e-06,3e-06,1e-06,2e-06,2e-06,2e-06,3e-06,1e-06,5e-06
3e-06,1e-06,6e-06,6e-06,4e-06,7e-06,2e-06,1e-06,2e-06,4e-06,5e-06,2e-06,2e-06,5e-06,6e-06,2e-06,4e-06,2e-06,3e-06,3e-06,3e-06,3e-06,2e-06,6e-06,0,5e-06,6e-06,5e-06,3e-06,2e-06,3e-06,1e-06,1e-06,1e-06,5e-06,1e-06,4e-06,2e-06,2e-06,3e-06,5e-06,3e-06,2e-06,2e-06,1e-06,4e-06,4e-06,2e-06,1e-06,3e-06,3e-06,2e-06,4e-06,3e-06,1e-06,4e-06,3e-06,6e-06,4e-06,3e-06,3e-06,1e-06,3e-06,3e-06,1e-06,2e-06,2e-06,3e-06,4e-06,3e-06,1e-06,2e-06,4e-06,3e-06,2e-06,6e-06,7e-06,1e-06,1e-06,0,1e-06,3e-06,6e-06,2e-06,5e-06,2e-06,1e-06,1e-06,2e-06,1e-06,1e-06,3e-06,3e-06,2e-06,2e-06,1e-06,2e-06,3e-06,4e-06,2e-06,3e-06,0,4e-06,4e-06,3e-06,2e-06,3e-06,2e-06,2e-06,4e-06,3e-06,5e-06,0,2e-06,3e-06,1e-06,2e-06,2e-06,4e-06,1e-06,3e-06
1e-06,0,6e-06,6e-06,5e-06,4e-06,2e-06,2e-06,2e-06,4e-06,7e-06,3e-06,1e-06,4e-06,2e-06,3e-06,5e-06,2e-06,1e-06,1e-06,3e-06,3e-06,3e-06,7e-06,3e-06,5e-06,6e-06,3e-06,3e-06,4e-06,2e-06,2e-06,2e-06,2e-06,7e-06,4e-06,1e-06,2e-06,3e-06,1e-06,2e-06,1e-06,1e-06,1e-06,4e-06,3e-06,2e-06,2e-06,3e-06,3e-06,4e-06,2e-06,5e-06,3e-06,2e-06,4e-06,1e-06,5e-06,4e-06,1e-06,1e-06,2e-06,2e-06,1e-06,2e-06,2e-06,1e-06,2e-06,4e-06,1e-06,1e-06,1e-06,3e-06,0,1e-06,3e-06,3e-06,1e-06,2e-06,2e-06,2e-06,1e-06,6e-06,2e-06,4e-06,1e-06,1e-06,1e-06,2e-06,1e-06,3e-06,3e-06,2e-06,2e-06,2e-06,1e-06,1e-06,1e-06,3e-06,1e-06,3e-06,1e-06,5e-06,1e-06,1e-06,1e-06,2e-06,2e-06,1e-06,4e-06,0,3e-06,2e-06,2e-06,2e-06,2e-06,0,3e-06,3e-06,1e-06,1e-06
1e-06,0,4e-06,4e-06,6e-06,8e-06,2e-06,1e-06,2e-06,3e-06,5e-06,2e-06,1e-06,3e-06,3e-06,2e-06,3e-06,3e-06,2e-06,2e-06,3e-06,0,1e-06,8e-06,1e-06,4e-06,6e-06,3e-06,3e-06,5e-06,1e-06,1e-06,1e-06,2e-06,8e-06,1e-06,3e-06,2e-06,3e-06,2e-06,4e-06,1e-06,1e-06,0,1e-06,4e-06,2e-06,1e-06,3e-06,1e-06,3e-06,2e-06,3e-06,3e-06,3e-06,2e-06,1e-06,4e-06,2e-06,2e-06,3e-06,3e-06,1e-06,1e-06,2e-06,2e-06,1e-06,3e-06,3e-06,2e-06,1e-06,2e-06,2e-06,0,1e-06,4e-06,4e-06,2e-06,2e-06,2e-06,3e-06,3e-06,5e-06,1e-06,2e-06,2e-06,1e-06,1e-06,2e-06,1e-06,1e-06,2e-06,1e-06,1e-06,2e-06,1e-06,0,1e-06,2e-06,2e-06,4e-06,2e-06,2e-06,2e-06,1e-06,2e-06,2e-06,0,1e-06,2e-06,1e-06,3e-06,2e-06,2e-06,1e-06,1e-06,1e-06,4e-06,4e-06,2e-06,1e-06
3e-06,1e-06,5e-06,5e-06,5e-06,7e-06,1e-06,1e-06,2e-06,3e-06,3e-06,3e-06,2e-06,4e-06,2e-06,3e-06,3e-06,3e-06,3e-06,3e-06,2e-06,3e-06,2e-06,9e-06,3e-06,4e-06,5e-06,3e-06,3e-06,6e-06,2e-06,2e-06,2e-06,1e-06,7e-06,3e-06,2e-06,3e-06,1e-06,2e-06,4e-06,1e-06,1e-06,1e-06,2e-06,2e-06,2e-06,2e-06,1e-06,2e-06,1e-06,4e-06,2e-06,3e-06,1e-06,3e-06,1e-06,5e-06,1e-06,1e-06,4e-06,3e-06,2e-06,1e-06,1e-06,2e-06,1e-06,4e-06,2e-06,2e-06,2e-06,2e-06,3e-06,0,1e-06,4e-06,6e-06,3e-06,2e-06,1e-06,4e-06,3e-06,8e-06,4e-06,4e-06,2e-06,1e-06,1e-06,1e-06,1e-06,2e-06,3e-06,2e-06,2e-06,1e-06,0,1e-06,1e-06,3e-06,1e-06,3e-06,2e-06,3e-06,4e-06,2e-06,2e-06,1e-06,2e-06,2e-06,3e-06,2e-06,4e-06,2e-06,1e-06,2e-06,3e-06,1e-06,2e-06,2e-06,1e-06,2e-06
2e-06,1e-06,5e-06,5e-06,6e-06,5e-06,1e-06,2e-06,2e-06,4e-06,4e-06,2e-06,1e-06,2e-06,2e-06,2e-06,3e-06,4e-06,3e-06,1e-06,2e-06,3e-06,2e-06,8e-06,1e-06,4e-06,5e-06,4e-06,3e-06,5e-06,1e-06,2e-06,0,2e-06,6e-06,3e-06,1e-06,2e-06,1e-06,2e-06,4e-06,1e-06,0,2e-06,2e-06,4e-06,2e-06,2e-06,1e-06,2e-06,2e-06,4e-06,1e-06,1e-06,1e-06,2e-06,1e-06,3e-06,1e-06,0,4e-06,3e-06,2e-06,1e-06,1e-06,1e-06,1e-06,3e-06,2e-06,1e-06,1e-06,0,3e-06,1e-06,1e-06,3e-06,4e-06,1e-06,1e-06,2e-06,3e-06,2e-06,5e-06,2e-06,3e-06,3e-06,1e-06,1e-06,0,1e-06,1e-06,2e-06,2e-06,1e-06,1e-06,1e-06,0,1e-06,3e-06,2e-06,3e-06,2e-06,3e-06,3e-06,1e-06,1e-06,1e-06,1e-06,1e-06,3e-06,1e-06,3e-06,2e-06,0,1e-06,1e-06,1e-06,0,2e-06,0,2e-06
1e-06,0,4e-06,5e-06,5e-06,5e-06,1e-06,2e-06,2e-06,3e-06,3e-06,3e-06,1e-06,2e-06,3e-06,1e-06,3e-06,3e-06,1e-06,1e-06,2e-06,1e-06,2e-06,9e-06,1e-06,3e-06,6e-06,3e-06,3e-06,6e-06,0,1e-06,1e-06,1e-06,6e-06,2e-06,1e-06,1e-06,2e-06,3e-06,4e-06,1e-06,1e-06,1e-06,2e-06,4e-06,1e-06,1e-06,1e-06,1e-06,2e-06,1e-06,3e-06,2e-06,2e-06,3e-06,1e-06,4e-06,2e-06,1e-06,3e-06,2e-06,1e-06,0,1e-06,1e-06,1e-06,3e-06,3e-06,1e-06,2e-06,1e-06,3e-06,1e-06,1e-06,3e-06,4e-06,3e-06,1e-06,1e-06,3e-06,2e-06,6e-06,1e-06,2e-06,3e-06,1e-06,1e-06,1e-06,1e-06,1e-06,3e-06,1e-06,1e-06,1e-06,1e-06,1e-06,1e-06,2e-06,0,2e-06,1e-06,3e-06,2e-06,1e-06,2e-06,0,1e-06,1e-06,3e-06,0,3e-06,2e-06,0,0,1e-06,1e-06,1e-06,2e-06,0,1e-06
0,0,4e-06,5e-06,6e-06,6e-06,1e-06,2e-06,2e-06,3e-06,4e-06,3e-06,1e-06,2e-06,3e-06,1e-06,3e-06,3e-06,2e-06,0,1e-06,2e-06,2e-06,8e-06,2e-06,5e-06,6e-06,2e-06,3e-06,5e-06,0,0,1e-06,1e-06,7e-06,3e-06,1e-06,2e-06,1e-06,1e-06,4e-06,1e-06,0,2e-06,2e-06,3e-06,2e-06,1e-06,1e-06,2e-06,2e-06,1e-06,2e-06,2e-06,1e-06,2e-06,2e-06,3e-06,2e-06,0,3e-06,2e-06,0,1e-06,1e-06,1e-06,1e-06,3e-06,3e-06,1e-06,0,2e-06,2e-06,1e-06,0,4e-06,4e-06,2e-06,0,1e-06,2e-06,0,5e-06,2e-06,3e-06,3e-06,0,0,0,1e-06,1e-06,2e-06,2e-06,0,1e-06,1e-06,1e-06,2e-06,1e-06,0,2e-06,1e-06,4e-06,2e-06,1e-06,1e-06,1e-06,0,0,2e-06,0,3e-06,2e-06,0,1e-06,1e-06,1e-06,0,2e-06,0,2e-06
0,0,4e-06,5e-06,6e-06,5e-06,1e-06,1e-06,2e-06,3e-06,4e-06,3e-06,1e-06,2e-06,2e-06,1e-06,3e-06,3e-06,1e-06,1e-06,1e-06,1e-06,2e-06,8e-06,2e-06,4e-06,5e-06,3e-06,3e-06,5e-06,0,1e-06,1e-06,1e-06,5e-06,3e-06,0,2e-06,1e-06,1e-06,4e-06,1e-06,0,2e-06,2e-06,3e-06,2e-06,1e-06,1e-06,1e-06,2e-06,1e-06,2e-06,2e-06,1e-06,3e-06,1e-06,3e-06,1e-06,0,3e-06,2e-06,1e-06,1e-06,1e-06,1e-06,1e-06,3e-06,3e-06,0,1e-06,3e-06,2e-06,1e-06,1e-06,4e-06,4e-06,2e-06,0,1e-06,2e-06,0,5e-06,2e-06,2e-06,3e-06,1e-06,0,0,1e-06,1e-06,2e-06,1e-06,0,1e-06,1e-06,0,1e-06,2e-06,0,2e-06,1e-06,3e-06,2e-06,1e-06,1e-06,0,0,0,3e-06,0,3e-06,1e-06,0,0,1e-06,1e-06,1e-06,2e-06,0,2e-06
