0.000122,9.5e-05,8.8e-05,2.8e-05,6.9e-05,0.000209,1.5e-05,8e-05,9.1e-05,1.4e-05,9.5e-05,7.2e-05,7.5e-05,3.9e-05,7e-06,0.000258,0.000376,1.9e-05,1e-04,0.00031,0.000178,7.8e-05,3.8e-05,8.9e-05,3.2e-05,8.5e-05,0.000165,5.6e-05,6e-06,2.9e-05,0.000148,0.000186,5.4e-05,0.000279,0.000139,0.000329,0.00013,2e-05,0.000303,0.000101,0.000242,0.000317,0.000178,0.000122,8.8e-05,6.7e-05,0.000326,5e-05,0.000208,0.000185,0.000254,0.000148,0.00013,1.4e-05,0.000116,0.000188,0.000219,0.000123,0.000265,0.000133,6.4e-05,1.2e-05,1.1e-05,8e-05,0.000157,0.000195,9e-05,0.00017,0.000228,0.000376,0.00022,0.000197,0.000167,0.00013,0.000139,5.9e-05,2.3e-05,2.3e-05,6.7e-05,1.3e-05,0.000145,5.2e-05,0.000189,1.3e-05,3.4e-05,3.5e-05,0.000153,0.000264,0.000132,5.4e-05,0.000161,3.3e-05,8e-06,0.000122,6.4e-05,5e-06,7.2e-05,1.4e-05,0.000146,0.000154,5.2e-05,9.2e-05,1.9e-05,7.5e-05,2.3e-05,0.000137,0.000104,0.000241,2.5e-05,0.000237,3.8e-05,3.1e-05,0.000178,7e-05,0.000303,0.00013,2.6e-05,4.2e-05,0.000134,7.3e-05,5.1e-05
0.000468,0.000629,0.000411,0.000415,0.000439,0.000492,0.000431,0.000716,0.000357,0.000181,0.000196,0.000497,0.000446,0.000268,0.000252,0.000546,0.001109,0.001066,0.001541,0.001288,0.000866,9.7e-05,0.000221,0.000311,0.000131,0.000299,0.00023,0.000346,0.000325,0.000355,0.000446,0.000564,0.000145,0.00051,0.000752,0.001101,0.001141,0.000978,0.000629,0.000371,0.000658,0.001207,0.000538,0.000669,0.000276,0.000305,0.000972,0.000872,0.000801,0.000856,0.000997,0.000572,0.000504,0.000356,0.000339,0.000724,0.000908,0.000466,0.000666,8e-04,0.000366,0.000233,0.000164,0.000177,0.000325,0.000567,0.000721,0.000933,0.001029,0.001689,0.000516,0.000574,0.000394,0.000263,0.000569,0.000128,3.6e-05,0.000106,9.5e-05,0.000298,0.000493,0.000222,0.000459,0.000442,0.000128,0.000453,0.000591,0.000964,0.000892,0.000311,0.000473,0.000331,0.000582,0.000665,0.000559,0.000523,0.000369,6.2e-05,0.000192,0.000475,0.000409,0.000416,0.000392,0.000244,0.000498,0.000457,0.000489,0.000593,0.000858,0.000462,0.000486,0.000243,0.000624,0.000443,0.00082,0.000834,0.000865,5e-04,0.000172,0.000261,0.000478
0.000184,0.000368,0.000461,0.000265,0.000317,0.000705,0.000353,0.00058,0.00056,0.000718,0.000471,0.000703,9.7e-05,0.000109,0.000341,0.000407,0.000266,0.000437,0.001311,0.001523,0.001165,0.001159,0.000942,0.000434,0.000101,0.00028,0.000504,0.000737,0.000159,0.000367,0.00043,0.001414,0.001099,0.000303,0.000702,0.000166,0.000393,0.000555,0.001002,0.00099,0.000826,0.001081,0.001671,0.001528,0.000957,0.000852,0.001183,0.001119,0.00014,0.00032,0.00044,0.000936,0.000613,0.000441,0.000239,0.000715,0.000435,0.000343,0.000562,0.000282,0.000333,0.000433,0.000718,0.00056,0.000102,0.000252,0.000411,0.000601,0.001003,0.001126,0.00128,0.000576,0.000898,0.000808,0.000158,0.000598,0.000411,0.000281,0.000125,0.000462,0.000475,0.000251,0.000351,0.000664,0.00042,0.000725,0.000379,0.000562,0.000268,0.000539,0.000908,0.000332,0.00072,0.000452,6.1e-05,0.000614,0.000616,0.000527,9.4e-05,0.000502,0.000806,0.000331,0.00038,0.00062,0.000635,0.000255,0.000516,0.000773,0.000679,0.000629,0.000432,0.000458,0.000963,0.000244,0.000474,0.000324,0.000688,0.000341,0.000121,0.000152,0.00043
0.00056,0.000664,0.000564,0.000597,0.000754,0.001008,0.00063,0.000337,0.000171,0.000297,0.000297,0.00036,0.000593,0.000312,0.000631,0.000588,0.000706,0.000852,0.001032,0.000292,0.000306,0.000511,0.00033,0.000301,0.000433,0.000227,0.000384,0.000547,0.000555,0.000444,0.000331,0.001237,0.000962,0.000976,0.000544,0.000338,0.000116,0.000516,0.000581,0.000964,0.000862,0.000198,0.001157,0.001152,0.000436,0.000319,0.001087,0.00035,0.000687,0.00043,0.000428,0.000993,0.000207,0.000427,5.2e-05,0.000682,0.00038,0.000235,0.000322,0.00052,0.000239,0.000475,0.000815,0.000574,0.000492,0.000562,0.000418,0.000591,0.000626,0.000999,0.000838,0.001002,0.00102,0.000734,0.000687,0.000973,0.000595,0.000386,9.2e-05,0.000407,0.000788,0.000793,0.00049,0.000367,0.000239,0.000362,0.000378,0.000813,0.000852,0.000882,0.000475,0.000748,0.000208,0.000366,0.00031,0.000686,0.000601,3.7e-05,0.00042,0.000577,0.000357,0.000262,0.00013,0.000767,0.001507,0.001002,0.000471,0.000155,0.000455,0.000708,3.7e-05,0.000829,0.000165,0.00046,0.000134,0.00084,0.000426,0.00023,0.000146,0.000313,0.000461
0.000252,0.000514,0.000429,0.000181,0.000348,0.00017,0.000417,0.00041,0.000275,0.000123,0.000233,0.000434,0.000718,0.000551,0.000899,0.000928,0.000381,0.000304,0.000671,0.000894,0.00055,0.000351,0.000291,0.000416,0.00041,0.000578,0.000121,5.3e-05,0.000218,0.000679,6e-04,0.001123,0.000778,0.001177,0.001033,0.000378,0.00016,0.00029,0.000828,0.000637,0.000609,0.000135,0.000844,0.000394,0.000124,0.000165,0.000913,0.000554,0.00068,0.000431,0.000359,0.000641,0.000568,0.000571,0.000508,0.000742,0.000435,0.000199,0.000257,0.000394,0.000311,0.000573,0.000941,0.000265,0.000155,0.000531,0.000348,0.000387,0.000962,0.000858,0.000596,0.000921,0.000601,0.000137,0.000608,0.00033,0.000147,2.6e-05,0.00022,0.000166,0.000638,0.000467,0.000428,0.000504,0.000377,0.000283,0.000316,0.000407,0.000471,0.000194,0.000251,0.000355,0.000698,0.000671,0.000259,0.000471,0.000233,0.000252,0.000324,9.2e-05,0.000438,0.000189,0.000147,0.000507,0.000613,0.000314,0.000447,0.000248,0.000479,0.000176,0.000672,0.00091,0.000399,0.000662,0.00055,0.000566,0.000732,0.000587,0.00044,0.000525,0.000461
0.000331,0.000669,0.000348,0.000246,0.000399,0.000607,0.000472,0.000374,0.000342,0.000479,0.00065,0.000442,0.000128,0.000166,0.000202,0.000314,0.001028,0.00055,0.000687,0.000537,0.000425,0.000528,0.000197,0.000553,0.001059,0.000259,0.000252,0.000409,0.000184,0.00056,0.000242,0.000774,0.000459,0.000313,0.000804,0.000616,0.000304,0.000315,0.000724,0.000429,0.000367,0.000437,0.000492,0.000192,0.000119,8.7e-05,0.000573,0.000395,0.000339,0.00024,0.000276,0.000397,0.00038,3.9e-05,0.000288,0.000363,0.000203,0.000157,0.000511,0.000581,0.000233,0.00023,0.000912,0.000727,0.000714,0.000325,0.000184,0.000236,0.000468,0.000324,0.000356,0.000282,0.000471,0.000129,0.000349,0.000225,0.00024,0.000118,0.000337,0.000195,0.000697,0.00081,0.000709,0.000685,5e-04,0.000519,0.00061,0.000132,0.000193,0.000305,0.000121,0.000105,0.000359,0.000164,0.000316,0.000223,0.000199,0.000219,0.000434,3e-04,0.000545,0.000394,0.000322,0.000422,0.00041,0.000125,0.000195,0.000259,0.000394,0.000308,0.000619,9.3e-05,0.000443,0.000589,0.000214,0.00062,0.000314,0.000353,0.000212,0.000351,0.000397
0.00057,0.000396,0.000245,0.000272,0.000545,0.000733,0.000284,0.000394,8.3e-05,0.000327,0.000283,0.000312,0.000349,0.000141,0.000357,0.000284,0.000707,0.000811,0.000342,0.000614,2e-06,0.000659,0.000637,0.000646,0.000702,0.000777,0.000511,0.000177,0.00025,0.000352,0.000258,0.000495,0.000773,0.000388,0.000322,0.000381,0.000422,0.000291,7.4e-05,0.000472,0.000654,0.000758,0.00042,0.000492,0.000231,0.000114,0.000442,0.000159,0.000318,0.000267,0.000131,0.000145,0.000156,0.000183,0.000369,1e-04,5.7e-05,0.000174,0.000823,0.000584,0.000463,0.000106,0.000703,0.000371,0.000661,0.000305,0.000457,0.000477,0.000637,0.000262,0.000206,0.000232,0.000526,0.000279,0.000411,0.000336,4.2e-05,0.000133,0.000366,0.000152,0.000451,9.5e-05,0.000365,0.000295,0.000573,0.00035,0.000161,0.000212,0.000194,0.000247,0.000376,0.000357,0.000282,0.000158,8.9e-05,0.000467,0.000204,8.3e-05,0.000591,0.000337,0.000407,0.000193,0.000517,0.00044,0.000592,0.000263,0.00023,0.000358,0.000137,0.000349,0.000314,0.000173,0.000434,6.8e-05,0.000136,0.000317,0.000365,3.2e-05,0.000139,9.6e-05,0.000395
0.000104,0.000305,0.000363,0.000367,0.000222,0.000116,0.000136,0.000225,0.000483,0.000167,0.000329,0.000503,0.000321,0.000248,0.000686,0.000931,0.000545,6.7e-05,0.000268,0.000715,0.000829,0.000575,0.00067,0.000172,0.000329,0.000441,0.000329,0.000443,0.000436,0.000165,0.00059,0.000705,0.000397,0.000149,0.000291,0.000376,9.1e-05,0.000285,0.000674,0.000407,0.000323,3.4e-05,0.000651,0.000758,0.00047,0.000137,0.000313,0.000466,0.000448,0.000619,0.000376,0.000202,0.000143,0.000203,0.000414,0.000248,0.000232,0.000317,0.000818,0.000387,0.000356,0.000227,0.000713,0.000361,0.000607,0.000372,0.000814,0.000284,0.000356,0.000259,0.00014,0.00042,0.000358,0.000379,0.000325,9.9e-05,8.3e-05,0.000135,0.000392,4e-04,0.000351,0.000235,0.000177,0.000432,0.000167,0.000549,0.000609,0.000576,0.000572,0.000289,0.000136,0.000119,0.00025,0.000477,0.000318,0.00032,0.000627,0.00056,0.000518,0.000465,0.00028,0.000255,0.000384,0.000514,0.000404,0.000459,0.000525,0.000293,0.000431,0.000142,0.000532,0.000398,0.00055,0.000527,0.000458,0.000549,0.00029,0.000196,0.000143,0.000382,0.000619
0.000318,0.00032,0.000318,0.000163,0.000164,0.000204,0.000224,0.000256,0.000371,0.000137,0.000187,0.000304,0.000601,0.000518,0.001096,5e-04,0.000319,0.000249,0.000136,0.000361,0.000398,0.00017,0.000395,0.00046,0.000257,0.000253,0.000124,0.000127,0.000217,0.000155,0.000673,0.000542,0.000296,0.000217,0.000633,0.000472,0.000357,0.000198,0.000813,0.000491,0.00018,0.000481,0.001136,0.000534,0.00027,0.000265,0.00027,0.000623,0.000437,0.000339,0.000138,0.000316,0.000204,0.000143,0.000185,0.000232,0.000309,0.000138,0.000336,0.000356,0.000388,0.000246,0.000316,0.000258,0.000326,0.000195,0.00068,0.00056,9e-05,0.000158,0.000175,0.000419,0.00025,0.000297,0.000591,0.000473,0.000249,0.000189,0.000271,3.8e-05,0.00014,0.000151,0.000223,0.000366,0.000202,0.000237,0.000255,0.000401,0.000184,0.000104,1e-04,7.4e-05,0.000183,0.000385,0.000202,0.000328,0.00067,0.000148,0.000243,0.000284,0.000231,0.000284,0.000112,0.000561,0.001068,0.000996,0.000194,0.000702,0.00032,0.00035,0.000401,0.000102,0.000691,0.000618,7.1e-05,0.000316,0.000159,0.000183,0.000202,0.000345,0.000564
7e-06,0.000372,0.000131,0.000118,0.000172,0.000198,3.2e-05,6.8e-05,0.000298,0.000289,0.000307,0.000148,0.000241,0.000327,0.00064,0.000254,0.000238,0.000266,0.000338,0.000163,0.000385,0.000141,0.000242,0.000304,0.00029,2e-05,0.000212,5.6e-05,0.000313,0.000214,0.000381,0.000372,0.000298,0.000585,0.00012,1.7e-05,0.000124,0.000312,0.000223,0.000355,0.000275,0.000521,0.000543,0.000318,8.6e-05,0.000119,0.000253,0.000507,0.000292,0.000365,0.000122,6.3e-05,0.00011,1.9e-05,0.000119,0.00028,7.6e-05,0.000267,0.000172,0.000224,3.1e-05,2.8e-05,0.000197,9.6e-05,0.000167,0.000122,0.000311,4.7e-05,0.000168,0.000201,6e-05,0.000363,0.000228,0.000112,0.000182,6e-05,4.3e-05,8.6e-05,0.000193,0.000169,0.000153,0.000197,0.000448,9.5e-05,0.00019,8.4e-05,0.000102,0.000144,0.000257,0.000172,0.000212,5.9e-05,6.9e-05,0.000365,0.000157,7.4e-05,0.000423,0.000354,0.00014,0.000324,0.000259,0.000133,0.00015,0.000463,0.000606,0.000184,0.000176,0.000704,5e-04,0.000455,0.000318,0.000125,0.000521,0.000367,0.000351,0.000472,0.000598,2e-04,0.000195,0.00021,0.000163
0.000295,0.000531,0.000254,0.000163,0.000357,0.000127,4e-05,0.000105,0.000117,0.000219,0.000207,0.000159,0.000289,0.00025,0.000525,0.000216,6.8e-05,0.000294,0.000418,0.000313,0.000343,0.000129,0.000184,0.000204,2.7e-05,9.9e-05,0.000231,0.000289,0.000401,0.000277,8.4e-05,0.000342,0.000171,0.000571,0.000621,0.00037,0.000145,0.000171,7.8e-05,0.00035,0.000124,0.000195,0.000325,0.00016,1.8e-05,0.000117,0.000373,0.000217,0.000102,0.000186,0.000309,0.00024,9.7e-05,0.000168,0.000219,0.000195,0.000226,0.000263,0.00011,0.000339,0.000331,0.000196,0.000144,7.4e-05,7.3e-05,0.000181,9.5e-05,0.000129,0.000271,0.000139,4.8e-05,0.000107,8e-05,4e-05,7.7e-05,0.000118,0.000148,5.8e-05,0.000115,9.8e-05,0.000237,0.000257,0.000253,4.1e-05,0.000242,0.000209,0.000152,0.000113,0.000201,0.000139,0.000261,0.000287,0.000353,0.000425,0.000296,8.5e-05,0.000387,0.00033,0.00044,0.000328,0.000192,0.000168,4.9e-05,8.6e-05,0.000446,0.000319,0.000297,0.000359,0.000204,0.000154,0.000241,0.000149,6.4e-05,0.000209,8.4e-05,0.000418,0.000505,0.000258,0.000249,0.000241,0.000333
0.000153,0.000205,7.5e-05,8.3e-05,0.000159,9.3e-05,2.7e-05,7.6e-05,6e-05,0.000119,0.000156,0.000195,9.9e-05,5.1e-05,0.000321,0.000135,7.9e-05,0.00019,0.000189,3.6e-05,3.4e-05,8.1e-05,9.8e-05,6e-05,9.9e-05,9.1e-05,0.000146,0.00012,0.000145,0.000116,0.000291,7.8e-05,0.000195,0.000321,0.000228,8.4e-05,0.000104,0.000116,0.000156,0.00017,0.000157,0.000295,8.5e-05,5.6e-05,9.5e-05,8.9e-05,0.000294,7.9e-05,7e-06,0.000118,0.000145,3e-05,6.6e-05,0.000136,5.6e-05,3e-05,9.9e-05,8e-05,0.000129,0.000144,9.2e-05,5.5e-05,4.3e-05,3e-05,0.000154,3.6e-05,4.6e-05,3.8e-05,0.00015,0.000131,8.3e-05,8.5e-05,4.9e-05,5.3e-05,2.5e-05,7.7e-05,4.8e-05,4.8e-05,0.000112,9.3e-05,0.000102,5.9e-05,0.000179,0.000103,0.000274,9.5e-05,0.000104,0.00019,7e-05,6.9e-05,0.000174,0.000203,0.000141,8.1e-05,0.000173,0.000168,0.000176,7.5e-05,0.000259,0.000357,0.000123,3.9e-05,0.00011,0.000231,0.000151,0.000197,0.000116,0.000264,0.000131,9.5e-05,0.000149,0.000108,0.000223,0.000108,8.2e-05,0.000327,2.9e-05,0.000233,9e-05,0.000146,0.000263
8.7e-05,0.000195,8.5e-05,8.1e-05,0.000162,6.9e-05,4.5e-05,4.8e-05,8.6e-05,3.8e-05,8.3e-05,5.9e-05,0.00012,3.4e-05,0.000268,6e-05,4.4e-05,0.000133,0.000136,8e-05,0.00016,5e-05,8.1e-05,2e-05,0.000114,0.000103,8.8e-05,7.2e-05,9.5e-05,7.8e-05,0.000209,9.4e-05,9.4e-05,0.000117,0.000175,0.000103,4.5e-05,3.9e-05,0.000155,0.000169,4.9e-05,0.000268,8.6e-05,7.6e-05,5.2e-05,9.7e-05,0.000243,3e-05,9.1e-05,4.2e-05,6.9e-05,4.7e-05,0.000115,9.1e-05,0.000126,0.000104,2.9e-05,0.000134,2.6e-05,9.1e-05,0.000108,7e-05,9.9e-05,8e-06,0.000133,7.2e-05,7e-05,7e-05,0.000116,2.9e-05,1.2e-05,4.7e-05,2.8e-05,0.000113,6.9e-05,5.1e-05,5.5e-05,1.2e-05,8.5e-05,2.6e-05,0.000101,9.2e-05,0.000193,6.1e-05,0.000148,8e-05,4.4e-05,0.000105,3.5e-05,1.3e-05,7e-05,0.000177,0.000111,2e-06,7.4e-05,6.8e-05,7.1e-05,3.1e-05,0.000172,8e-05,3.1e-05,5.8e-05,0.000156,0.000249,0.000153,0.000105,0.000108,0.000247,0.00016,6.5e-05,0.000143,7e-05,0.000241,8.1e-05,4.5e-05,0.000164,5.1e-05,0.000173,1.9e-05,7.6e-05,0.000202
4.2e-05,0.000129,0.000102,0.000149,0.000118,0.000178,0.000207,0.000177,8.5e-05,4.3e-05,9.7e-05,5.4e-05,0.000131,6.9e-05,0.000288,7.1e-05,6.4e-05,8e-05,7.6e-05,5.9e-05,0.000168,0.000119,0.000152,1.9e-05,1.3e-05,0.000125,1e-04,7.3e-05,0.000191,0.000105,0.000246,4.5e-05,1e-05,0.000358,0.000385,0.000256,9.5e-05,1e-04,0.000174,0.000112,0.000136,0.00012,0.000119,6.4e-05,2.6e-05,3.2e-05,0.000105,8.3e-05,0.000168,0.000162,9.4e-05,5.4e-05,6.7e-05,4.6e-05,0.000117,7.8e-05,4.8e-05,0.000157,4.7e-05,4.9e-05,6e-05,4.7e-05,0.000132,8.4e-05,0.000176,6.4e-05,0.00015,0.000156,0.000115,6.7e-05,0.000105,4.6e-05,1.5e-05,0.00011,2.4e-05,5.3e-05,2e-05,4.3e-05,3.7e-05,7.7e-05,0.000104,0.00013,0.000206,8.9e-05,6e-05,6.8e-05,9.8e-05,2e-05,0.000102,0.000113,0.000107,0.000122,2.8e-05,0.000113,3.9e-05,6.1e-05,0.000138,5.6e-05,0.000125,0.000118,5.4e-05,0.000141,0.000146,0.000214,0.000112,0.000177,0.000193,0.00043,3.7e-05,6.2e-05,0.000131,0.000109,0.000266,9.6e-05,4.1e-05,7.1e-05,0.00011,0.000122,0.000108,0.000106,0.000156
0.000122,0.00014,7e-05,0.000151,0.000102,0.000133,0.000135,6.7e-05,4.7e-05,8.6e-05,2.4e-05,3.4e-05,4.2e-05,7.1e-05,0.000174,0.000205,0.000158,9.5e-05,4.6e-05,0.000107,6.6e-05,0.000157,7.5e-05,7e-05,0.000144,0.000112,9.4e-05,0.000138,1e-04,3.8e-05,0.000149,0.000165,0.000113,0.000338,0.000108,4.7e-05,6.9e-05,0.000174,0.000157,0.000192,0.000192,9.9e-05,0.000253,0.000103,7e-05,9.1e-05,7e-05,3.4e-05,0.000195,3.8e-05,6.2e-05,9.5e-05,9.8e-05,9.3e-05,0.000166,6.2e-05,0.000158,2.5e-05,0.00011,7.6e-05,6e-05,0.000104,9.5e-05,3.1e-05,0.000115,8e-05,7.7e-05,4.4e-05,8.7e-05,4.2e-05,0.000116,0.000172,6.7e-05,2.3e-05,9.5e-05,5.1e-05,2.1e-05,3.3e-05,7.7e-05,4.3e-05,0.000109,3.6e-05,0.000172,0.000237,0.000149,2e-04,5.3e-05,7.4e-05,5.1e-05,7e-05,7.2e-05,0.000144,0.000106,0.000145,4.4e-05,6.6e-05,7.5e-05,0.000217,0.000194,0.000145,0.000142,0.000114,0.000144,0.000225,0.000221,0.000114,2.5e-05,0.000302,0.000333,0.000156,0.000188,6.6e-05,0.000268,0.000153,0.000163,0.000185,0.000165,0.000181,5.8e-05,0.000118,2.1e-05
5e-05,0.000109,8.8e-05,0.000178,0.000149,0.000187,2.7e-05,0.000121,0.00012,0.000105,0.000135,0.000128,0.000205,0.000275,0.000324,0.000232,0.00018,0.000185,6e-05,0.000238,0.000168,0.000202,0.000152,0.000131,8.4e-05,0.000147,0.000143,0.000219,0.000158,0.000124,3e-05,0.00024,8.4e-05,0.000214,1e-04,9.6e-05,4.8e-05,0.000153,0.000215,0.000145,0.000178,0.000374,2.5e-05,0.000101,1.8e-05,0.000179,0.000144,0.00012,0.000146,0.000198,0.000187,0.000226,0.000134,8.3e-05,0.000257,0.000153,0.000181,7.6e-05,8.3e-05,8.3e-05,2.7e-05,9.2e-05,0.000144,0.000173,4.8e-05,4.7e-05,0.000138,2.8e-05,6.6e-05,2.7e-05,6.5e-05,8e-05,7.6e-05,0.000129,0.00012,0.000156,0.000168,6.7e-05,0.000106,0.000193,0.000165,0.000181,9.7e-05,9.9e-05,0.000132,0.000236,0.000177,0.000148,5.8e-05,9.3e-05,0.000156,0.000293,0.000218,0.000137,0.00016,0.000185,0.00013,0.000281,0.000268,3.6e-05,0.000332,0.000162,0.000105,0.000451,0.000309,0.000255,0.000163,0.00047,0.000559,0.000447,0.000322,0.000157,0.000328,0.000174,0.000162,0.000242,0.000286,0.000393,0.000267,0.000101,0.000278
6.4e-05,0.000108,5.3e-05,7.3e-05,5.2e-05,7.5e-05,6.3e-05,0.00015,0.000131,0.000105,0.000141,0.000167,0.000122,0.000137,9.1e-05,0.000137,4.8e-05,0.000127,0.000141,0.000437,0.000303,0.000149,2.1e-05,8.1e-05,0.000134,0.000102,0.000174,5.5e-05,7e-05,0.000142,0.000116,0.000247,0.000177,0.000188,6.7e-05,4.9e-05,4.6e-05,0.00014,0.000213,2.1e-05,6e-05,0.00017,5.8e-05,0.000101,7.1e-05,0.00015,0.000101,7.9e-05,1.6e-05,0.000202,0.000114,0.000117,0.000108,8.8e-05,0.000297,0.000362,0.00023,6.9e-05,8.4e-05,0.000129,0.000115,8.2e-05,7.5e-05,0.000209,4.7e-05,8.2e-05,0.000212,0.00018,0.000127,4.4e-05,0.000132,7.2e-05,0.000144,0.000159,0.000202,0.000147,0.000153,0.000184,0.000282,0.00025,0.000244,0.000176,1e-04,0.000133,0.000281,0.000323,0.000127,0.000119,0.000108,9e-05,0.000211,0.000196,0.000102,0.000248,4e-04,0.00026,0.000462,0.000389,0.000189,0.00031,0.000525,0.000329,0.000267,0.000314,0.000362,0.000395,0.000222,0.000715,0.000432,0.000175,0.000383,0.000254,0.000479,0.000605,0.000399,0.00021,0.000129,0.000295,0.000428,0.00032,0.000352
0.000169,0.000121,0.000101,6.7e-05,8.9e-05,6.4e-05,6.2e-05,7.3e-05,0.000115,8.4e-05,4e-05,3.1e-05,0.000109,6.6e-05,0.000107,9e-05,5.4e-05,0.000112,0.000223,0.000339,0.000202,0.000101,8.7e-05,3.9e-05,0.000127,0.000151,8.9e-05,9.6e-05,0.000123,0.000179,0.000276,0.000174,3.7e-05,0.000221,7.4e-05,8.9e-05,8.6e-05,0.000144,4e-06,8e-05,8.2e-05,8.9e-05,0.000212,6.9e-05,9.2e-05,0.000117,0.000139,8.6e-05,0.000132,0.000198,0.000179,0.000163,6.8e-05,7.9e-05,0.000169,0.000115,2.7e-05,0.000155,0.000103,2e-05,4.3e-05,3.4e-05,8.8e-05,0.000112,0.000159,3.8e-05,0.000186,0.000187,0.000135,8e-05,0.000163,0.00015,0.000173,0.00011,5.9e-05,6e-05,0.000174,5.8e-05,0.000154,0.000144,7.5e-05,0.000148,0.000174,9.6e-05,0.000291,7.7e-05,6.3e-05,0.000135,3.9e-05,0.000156,4.6e-05,3e-05,5.8e-05,0.000373,0.000394,0.000275,0.000369,0.000101,0.00013,0.000248,0.000296,0.000107,0.000111,9.9e-05,0.000192,0.000115,0.000117,0.00046,0.000266,0.000139,0.000165,0.000104,0.000322,0.000481,0.000307,0.000188,0.000229,0.000428,0.000167,0.000107,0.000374
0.000175,0.000123,0.000165,9.7e-05,6.7e-05,0.000144,0.000148,4.6e-05,7.6e-05,6.6e-05,2e-05,4.6e-05,0.000147,2.3e-05,6.5e-05,0.000113,0.000123,7.9e-05,0.000352,0.000174,0.000134,0.000124,7.2e-05,3.2e-05,0.00015,2.3e-05,6.3e-05,0.000126,4.4e-05,0.000113,1.6e-05,0.000179,0.000224,0.000295,9.3e-05,0.000141,8.8e-05,0.000142,0.000146,0.000152,0.000292,2.7e-05,0.000244,0.000207,2.4e-05,9.5e-05,0.000205,0.000239,0.000116,0.000252,0.000172,6.3e-05,8.2e-05,5.4e-05,8.5e-05,7.4e-05,7.2e-05,0.000108,7.7e-05,4.4e-05,8.3e-05,7.5e-05,0.000142,0.000119,9.3e-05,4.1e-05,8.1e-05,0.000117,0.000222,0.000128,0.000114,6.4e-05,0.000102,0.000108,0.000176,0.000142,0.000117,0.000104,2.6e-05,0.000186,0.000206,0.000197,0.000168,0.000107,0.000104,0.00012,5.4e-05,0.00012,0.000144,0.000199,0.000239,0.000137,0.000126,0.000312,0.000131,0.000173,0.000118,6e-06,4.1e-05,0.000119,0.000169,0.000119,6.1e-05,0.000197,0.000219,0.000301,0.000276,0.000264,0.000181,0.000248,0.000219,0.000204,7.1e-05,0.000109,0.000202,0.000128,0.000398,7.9e-05,5.4e-05,4.4e-05,0.000364
0.00012,9e-05,4.6e-05,7.4e-05,5.2e-05,5.6e-05,9e-05,2.5e-05,5.3e-05,5.4e-05,2.4e-05,6.1e-05,0.00015,0.000129,0.000143,8.6e-05,7.6e-05,7.9e-05,0.000319,0.000222,7.4e-05,6.1e-05,9.6e-05,3.1e-05,0.000122,0.000189,0.000178,0.000234,0.000125,0.000103,0.00018,0.000113,0.000273,2.7e-05,0.000181,0.00023,0.000159,0.000139,1.7e-05,0.00013,0.000172,0.000229,7.3e-05,0.000117,0.000141,0.000132,0.000158,0.000149,0.000118,0.000191,8.4e-05,0.000166,0.000132,0.000119,5.3e-05,0.000118,0.000135,0.000155,6.9e-05,0.000109,6e-05,0.000151,0.000134,3.7e-05,9.7e-05,1e-05,0.000145,0.000207,5.9e-05,0.000106,0.000155,0.000161,0.000171,7.8e-05,0.000145,7.8e-05,3.3e-05,7.7e-05,7.2e-05,0.000185,0.000102,3.8e-05,8.8e-05,0.00024,0.000193,0.000125,0.000102,0.000171,4.8e-05,0.000118,0.000117,8.3e-05,6.1e-05,0.000295,0.000209,0.000265,0.000153,0.000117,0.000105,0.000207,0.000111,0.00011,1.3e-05,0.000186,0.000309,0.000237,5.1e-05,0.000125,0.000107,0.000189,0.000107,0.000114,0.000189,0.000283,0.000145,3.3e-05,0.000245,0.000296,8.1e-05,1e-04,0.000272
5.7e-05,4e-05,5.2e-05,3.9e-05,2.1e-05,5.2e-05,7.4e-05,1.2e-05,6.8e-05,1.8e-05,5.3e-05,4.5e-05,0.000117,8e-05,0.000183,0.000114,9.2e-05,3.3e-05,0.000171,0.000114,0.000147,4.9e-05,9.4e-05,6.2e-05,9.6e-05,8.3e-05,9.6e-05,4.1e-05,0.000101,9.4e-05,0.000195,0.000178,0.00014,0.00013,0.000238,0.000196,0.000157,3.5e-05,0.000155,0.000134,7e-05,3.4e-05,0.000152,5.4e-05,2.2e-05,8.6e-05,0.000171,6e-05,7.6e-05,6.5e-05,5.5e-05,0.000234,0.000132,3.8e-05,5e-06,0.000131,7.5e-05,7.1e-05,3.2e-05,8.6e-05,6.5e-05,0.00014,3.9e-05,0.000123,0.00014,5.7e-05,0.000127,7.7e-05,0.000151,0.000114,4.3e-05,6.9e-05,7.6e-05,0.000172,8.7e-05,7.3e-05,4.4e-05,4e-05,1.8e-05,0.000162,0.000154,0.000101,7.2e-05,0.00017,0.000149,7.8e-05,6.2e-05,8.5e-05,3.7e-05,6.3e-05,0.000211,0.000116,0.000108,0.000189,0.000106,5.1e-05,1e-04,6.1e-05,5.5e-05,0.000228,0.000237,9.2e-05,4.7e-05,0.000107,0.000137,0.000318,0.000205,0.000261,0.000105,0.000107,7.9e-05,0.000134,0.000132,0.000166,0.000164,0.000219,0.000161,0.000163,0.000184,0.000111,5.4e-05
5e-06,4.3e-05,4.6e-05,3.2e-05,9e-06,2.2e-05,6.6e-05,6.3e-05,5.6e-05,9.5e-05,3.5e-05,5.5e-05,7.1e-05,7.3e-05,0.000142,9.3e-05,7.5e-05,5.6e-05,0.00017,0.00016,0.000141,6e-05,8.3e-05,1e-05,6e-05,5.6e-05,0.000128,0.000144,8.4e-05,4.4e-05,7.7e-05,0.000122,2.5e-05,5.1e-05,0.000133,5.5e-05,7.3e-05,8.6e-05,0.000212,0.000178,0.000154,0.000201,3.3e-05,6.2e-05,3.2e-05,9.4e-05,4.5e-05,5.4e-05,6.8e-05,4.8e-05,3e-05,0.000193,9e-05,1.8e-05,3e-05,5.4e-05,3.3e-05,0.000143,3.7e-05,7.7e-05,3.9e-05,7.8e-05,3.3e-05,5.8e-05,6.4e-05,5.5e-05,0.000119,5.3e-05,9.3e-05,0.000187,0.000138,8.4e-05,7.7e-05,0.000105,9.1e-05,9.5e-05,9.9e-05,3.9e-05,6.2e-05,3.4e-05,0.00011,5.1e-05,9e-05,8.7e-05,1.9e-05,3.7e-05,2.5e-05,4.5e-05,6.8e-05,3.6e-05,0.000157,4.5e-05,2.9e-05,0.000111,0.000179,0.000131,6.1e-05,5.1e-05,0.000157,3.8e-05,0.000112,0.000117,8.1e-05,7e-05,0.000171,7e-05,9.9e-05,0.000226,0.000112,9.5e-05,0.000129,9e-05,0.000146,7.2e-05,6.3e-05,0.000149,0.000235,0.000271,0.000184,6.6e-05,0.000102
8e-06,2.6e-05,7e-06,1.4e-05,3.5e-05,2.5e-05,1.1e-05,2e-05,1e-06,3.6e-05,4e-06,1.8e-05,4.3e-05,9e-06,8.5e-05,1.7e-05,2.9e-05,4.8e-05,5.7e-05,6e-05,1.8e-05,8e-06,1.9e-05,2.2e-05,2.9e-05,2.5e-05,4.4e-05,2e-05,2.8e-05,3.1e-05,4.2e-05,5.1e-05,1.6e-05,3.8e-05,5.8e-05,7.2e-05,1.6e-05,6e-05,4e-05,7e-05,3e-05,9.6e-05,1.9e-05,2e-05,1.4e-05,3.2e-05,3.3e-05,4.3e-05,3.5e-05,3.2e-05,3.3e-05,4.9e-05,3.6e-05,2.7e-05,3e-06,1.2e-05,4e-05,3.7e-05,2.9e-05,2.7e-05,5e-06,2.4e-05,2e-05,2.2e-05,5.5e-05,1.9e-05,5.5e-05,1.9e-05,1.9e-05,3.4e-05,2.7e-05,2.2e-05,1.2e-05,8e-06,5.9e-05,4.3e-05,1.1e-05,3.1e-05,5e-05,4.2e-05,2e-05,3.7e-05,2.3e-05,2.2e-05,2.8e-05,4e-05,4.3e-05,2.3e-05,1.5e-05,1e-06,6.1e-05,3.4e-05,4.7e-05,2.8e-05,5e-06,5.4e-05,7e-06,1.6e-05,8e-05,6.5e-05,4.7e-05,4.4e-05,5.6e-05,6.9e-05,8.7e-05,3.3e-05,4.4e-05,0.000121,0.000101,4.4e-05,6.3e-05,4.9e-05,7.8e-05,3.1e-05,3.8e-05,7.7e-05,9.4e-05,3.8e-05,5.7e-05,1.3e-05,7.8e-05
1.2e-05,3.5e-05,1.8e-05,2e-06,4.2e-05,1e-05,2e-05,1.2e-05,8e-06,1.3e-05,2.5e-05,6e-06,1.9e-05,1.4e-05,8e-05,2.1e-05,2.5e-05,3.1e-05,5.7e-05,3.6e-05,2e-05,4e-06,2.5e-05,3.1e-05,1.2e-05,3.4e-05,2.5e-05,1.4e-05,1.9e-05,1.7e-05,4.6e-05,4.2e-05,2.5e-05,2.7e-05,2.2e-05,1.9e-05,1.8e-05,4e-05,6.1e-05,2.6e-05,3.3e-05,5.9e-05,2.1e-05,1.5e-05,1.1e-05,2e-06,4.5e-05,3e-05,2.4e-05,1.3e-05,9e-06,2.1e-05,1.2e-05,8e-06,1.1e-05,2e-05,2.5e-05,5.9e-05,2.6e-05,7e-06,1.7e-05,2.1e-05,2e-05,2.5e-05,3.2e-05,1.1e-05,3.5e-05,7e-06,3.5e-05,2.5e-05,2.3e-05,1.8e-05,8e-06,1.1e-05,4.3e-05,1e-05,1.4e-05,2.8e-05,1.8e-05,2.3e-05,8e-06,6e-06,9e-06,2.6e-05,4e-06,2.7e-05,1.1e-05,1.7e-05,1e-05,8e-06,4.5e-05,2.1e-05,1.5e-05,2e-05,2.3e-05,3.9e-05,3.4e-05,3.2e-05,7.9e-05,1.5e-05,4.5e-05,3.2e-05,6e-06,3.7e-05,3.7e-05,5.7e-05,4.5e-05,7.5e-05,2.6e-05,2.6e-05,4.1e-05,3.1e-05,4.7e-05,3.9e-05,3.8e-05,8.7e-05,5e-06,4.8e-05,1.8e-05,2.1e-05,6e-05
1e-05,2.5e-05,1.6e-05,1.6e-05,2.3e-05,1.1e-05,7e-06,8e-06,7e-06,1.4e-05,1.3e-05,2e-05,3.2e-05,8e-06,5.6e-05,1.3e-05,9e-06,2.5e-05,4.9e-05,2.5e-05,2.7e-05,4e-06,2.8e-05,7e-06,1.7e-05,2.5e-05,1e-05,2.1e-05,2.5e-05,8e-06,4.3e-05,3.5e-05,2.7e-05,7e-06,3.9e-05,3.7e-05,1.5e-05,1.6e-05,7.8e-05,2.5e-05,1.5e-05,6.8e-05,2.3e-05,5e-06,2.4e-05,4e-06,2.5e-05,1.4e-05,3e-06,8e-06,1.5e-05,1.6e-05,1.1e-05,1.2e-05,5e-06,1.4e-05,2.1e-05,3.7e-05,8e-06,9e-06,4e-06,1.3e-05,2.4e-05,9e-06,3.2e-05,1.4e-05,1.5e-05,1.2e-05,2.9e-05,1.5e-05,7e-06,2.3e-05,4e-06,8e-06,3.8e-05,7e-06,1.6e-05,2.5e-05,1.2e-05,1e-05,1e-05,5e-06,2.4e-05,1.5e-05,1.4e-05,1.8e-05,1.9e-05,1.2e-05,9e-06,6e-06,1.7e-05,7e-06,7e-06,1.2e-05,2.2e-05,2.1e-05,2e-05,8e-06,5.2e-05,3e-05,3.3e-05,8e-06,7e-06,2.5e-05,2.7e-05,3e-05,2.9e-05,1.4e-05,1.5e-05,2.2e-05,4.3e-05,3.4e-05,8e-06,1.5e-05,8e-06,5.8e-05,1.9e-05,3.7e-05,1.7e-05,9e-06,4.7e-05
3e-06,1.6e-05,7e-06,1.6e-05,1.8e-05,9e-06,1.1e-05,1.2e-05,8e-06,1.4e-05,1.3e-05,1.8e-05,2.7e-05,9e-06,5.7e-05,1.7e-05,1.5e-05,2.5e-05,4e-05,1.3e-05,2.7e-05,9e-06,1.8e-05,1.9e-05,1.9e-05,2.3e-05,1.2e-05,1.8e-05,2.1e-05,8e-06,3.3e-05,3.2e-05,2.6e-05,1.2e-05,2.1e-05,2.5e-05,2.2e-05,2.5e-05,5.3e-05,3e-06,1.8e-05,4.8e-05,2.4e-05,8e-06,6e-06,1.6e-05,2e-05,1.7e-05,1e-06,8e-06,2e-05,3e-06,5e-06,1.9e-05,2e-06,2e-05,1.5e-05,4.3e-05,1.8e-05,2e-06,4e-06,1.7e-05,1e-05,1e-05,3.4e-05,2.3e-05,1.8e-05,8e-06,2.1e-05,1.9e-05,1.2e-05,1.5e-05,6e-06,6e-06,3.8e-05,5e-06,1e-05,2.5e-05,1.8e-05,1.6e-05,7e-06,5e-06,2e-05,6e-06,1.1e-05,1.5e-05,1.4e-05,8e-06,7e-06,2e-06,1.8e-05,5e-06,4e-06,1.3e-05,2.5e-05,1.7e-05,1.6e-05,7e-06,4.2e-05,2.7e-05,2.2e-05,2e-06,9e-06,2.7e-05,3.6e-05,3e-05,3.2e-05,1.8e-05,2.4e-05,3e-05,3.7e-05,2.7e-05,1.1e-05,1.2e-05,2e-06,4.9e-05,8e-06,2.5e-05,1.2e-05,4e-06,3e-05
1e-06,2.3e-05,8e-06,9e-06,1.4e-05,1.2e-05,5e-06,1.5e-05,7e-06,1.8e-05,2e-06,1.9e-05,4.2e-05,1.9e-05,5.2e-05,1.4e-05,7e-06,2.8e-05,4.1e-05,9e-06,1.8e-05,4e-06,1.2e-05,1.8e-05,1.6e-05,2.2e-05,1.5e-05,1.5e-05,2.2e-05,8e-06,2.9e-05,2.8e-05,2.4e-05,1.3e-05,2e-05,1.3e-05,2.2e-05,2.9e-05,5.2e-05,6e-06,9e-06,4.7e-05,1.3e-05,8e-06,5e-06,4e-06,2.6e-05,1.4e-05,1.3e-05,8e-06,1.4e-05,1.4e-05,1e-05,1.6e-05,8e-06,2.1e-05,7e-06,4.4e-05,1.5e-05,1e-06,6e-06,1.8e-05,1.2e-05,2e-06,3.2e-05,1.4e-05,1.6e-05,0,1.3e-05,1.6e-05,1.1e-05,1.3e-05,8e-06,5e-06,3.5e-05,1e-05,1.2e-05,2e-05,1.6e-05,1.4e-05,2e-06,1.4e-05,2.6e-05,7e-06,1.4e-05,8e-06,1.7e-05,1e-05,9e-06,9e-06,1.5e-05,1.4e-05,1.3e-05,1.6e-05,2.6e-05,3.2e-05,1.4e-05,9e-06,3.8e-05,3.5e-05,2.8e-05,5e-06,1e-05,2.3e-05,3.2e-05,4e-05,2.8e-05,2.1e-05,1.8e-05,2e-05,3.3e-05,1.2e-05,1.9e-05,1.7e-05,6e-06,4.2e-05,9e-06,1e-05,7e-06,2e-06,2.3e-05
2e-06,2.8e-05,1.1e-05,7e-06,1.5e-05,7e-06,8e-06,1.1e-05,8e-06,9e-06,2e-06,2.7e-05,1.9e-05,1e-05,4.9e-05,2.2e-05,1.8e-05,2.8e-05,4e-05,4e-06,2.5e-05,8e-06,1.2e-05,1.5e-05,1.7e-05,1e-05,1.2e-05,5e-06,2.6e-05,9e-06,2.9e-05,3.5e-05,2.3e-05,1.5e-05,2.5e-05,2.3e-05,1.3e-05,2.4e-05,4.7e-05,5e-06,1.4e-05,6.4e-05,2.4e-05,5e-06,8e-06,3e-06,2.3e-05,2e-06,4e-06,6e-06,1.1e-05,1.2e-05,1.2e-05,6e-06,6e-06,2.3e-05,1.4e-05,3.3e-05,1.3e-05,8e-06,4e-06,2.1e-05,4e-06,8e-06,3.1e-05,8e-06,1.1e-05,5e-06,1e-05,1.7e-05,1e-05,1.5e-05,8e-06,9e-06,3.1e-05,1.1e-05,8e-06,1.4e-05,9e-06,7e-06,6e-06,8e-06,1.3e-05,1.2e-05,3e-06,7e-06,1.7e-05,9e-06,7e-06,4e-06,1.2e-05,1.1e-05,8e-06,1e-05,1.8e-05,2.8e-05,1e-05,8e-06,2.8e-05,2e-05,1.5e-05,8e-06,1.1e-05,2.5e-05,2.9e-05,3.5e-05,2.5e-05,2.9e-05,2e-05,3e-05,2.7e-05,1.5e-05,1.2e-05,6e-06,5e-06,4.6e-05,5e-06,1.8e-05,1.5e-05,2e-06,1.7e-05
6e-06,2.7e-05,3e-06,1.2e-05,1.3e-05,1.2e-05,1.2e-05,1.1e-05,1.4e-05,1.7e-05,2e-06,1.6e-05,2.4e-05,1.2e-05,5.6e-05,1.6e-05,4e-06,1.8e-05,3.6e-05,7e-06,1.8e-05,6e-06,1.2e-05,1.2e-05,1.5e-05,1.3e-05,1.1e-05,1.6e-05,1.4e-05,1.2e-05,3.1e-05,2.3e-05,2.3e-05,1.3e-05,2e-05,1.5e-05,1.3e-05,1.9e-05,4.7e-05,1e-06,1.3e-05,5.4e-05,1.7e-05,6e-06,4e-06,2e-06,2.9e-05,4e-06,5e-06,7e-06,1.1e-05,4e-06,6e-06,1.3e-05,3e-06,1.1e-05,4e-06,2.5e-05,5e-06,4e-06,2e-06,1.9e-05,9e-06,8e-06,2.4e-05,1e-05,1.5e-05,7e-06,8e-06,1e-05,1.4e-05,1.3e-05,5e-06,4e-06,2.6e-05,9e-06,1.1e-05,1e-05,1.7e-05,8e-06,8e-06,1.1e-05,1.5e-05,6e-06,4e-06,9e-06,1.2e-05,1.5e-05,7e-06,8e-06,1.9e-05,1e-05,9e-06,9e-06,1.5e-05,2.7e-05,1.6e-05,9e-06,2.9e-05,1.6e-05,2.8e-05,1.2e-05,1e-06,2.9e-05,2.8e-05,2.9e-05,2.8e-05,3e-05,2e-05,1.3e-05,2.6e-05,2.2e-05,8e-06,1.4e-05,1.1e-05,4.3e-05,7e-06,1.5e-05,1e-05,5e-06,1.9e-05
2e-06,2.7e-05,8e-06,7e-06,1.3e-05,1.4e-05,1.3e-05,1e-05,1.3e-05,1e-05,6e-06,1.6e-05,3.4e-05,8e-06,5.1e-05,2e-06,6e-06,2.1e-05,4e-05,1.1e-05,2e-05,7e-06,1.7e-05,1.2e-05,1.3e-05,1.4e-05,1e-05,1.2e-05,1.6e-05,2e-06,3.4e-05,2.3e-05,2.5e-05,1.5e-05,2.9e-05,2.7e-05,1.5e-05,2e-05,4.8e-05,5e-06,1e-05,5.3e-05,1.6e-05,1e-05,1.2e-05,8e-06,2.5e-05,1e-06,9e-06,1e-05,1.3e-05,1.5e-05,6e-06,9e-06,6e-06,1.2e-05,1.1e-05,3.7e-05,6e-06,5e-06,1e-06,1.6e-05,3e-06,9e-06,2.9e-05,1.7e-05,1.2e-05,3e-06,9e-06,1.8e-05,1.4e-05,1.1e-05,1e-06,8e-06,2.7e-05,4e-06,1e-05,1.2e-05,8e-06,8e-06,1.8e-05,5e-06,1.9e-05,1.2e-05,4e-06,5e-06,1e-05,1.1e-05,1e-05,9e-06,1.5e-05,9e-06,1e-06,4e-06,1.6e-05,1.7e-05,8e-06,8e-06,3.3e-05,1.8e-05,2.3e-05,1e-05,1e-05,1.8e-05,2.5e-05,2.5e-05,1.3e-05,1.8e-05,9e-06,1.4e-05,3.2e-05,1.9e-05,8e-06,3e-05,1.8e-05,3.6e-05,9e-06,3e-06,3e-06,5e-06,2e-05
2e-06,2.2e-05,7e-06,1e-05,1.3e-05,1.3e-05,1.1e-05,8e-06,7e-06,1.2e-05,4e-06,1.9e-05,2.7e-05,1.3e-05,4.5e-05,1.2e-05,5e-06,2.1e-05,3.7e-05,1.5e-05,1.2e-05,5e-06,1.2e-05,2e-05,1.1e-05,1.5e-05,9e-06,1.1e-05,2.3e-05,5e-06,2.8e-05,2.6e-05,1.9e-05,1.6e-05,2.1e-05,1e-05,1.1e-05,2.6e-05,3.6e-05,1.2e-05,1.1e-05,4.9e-05,1.4e-05,5e-06,1.8e-05,9e-06,2.7e-05,1.1e-05,7e-06,3e-06,1.2e-05,1.2e-05,3e-06,1.6e-05,9e-06,1.6e-05,9e-06,3e-05,7e-06,6e-06,6e-06,1.8e-05,8e-06,1e-06,2.9e-05,1.6e-05,1.4e-05,6e-06,5e-06,1.6e-05,4e-06,2e-05,8e-06,3e-06,2.3e-05,7e-06,8e-06,1.5e-05,1.4e-05,7e-06,1.5e-05,1.6e-05,1.9e-05,1e-05,8e-06,6e-06,1.2e-05,9e-06,6e-06,2e-06,1.5e-05,3e-06,6e-06,7e-06,2e-05,1.7e-05,7e-06,6e-06,3.1e-05,1.6e-05,5e-06,1.1e-05,9e-06,1.5e-05,1.4e-05,3.5e-05,2.3e-05,2.5e-05,1.5e-05,7e-06,3.2e-05,1.4e-05,4e-06,3.6e-05,2.4e-05,3.8e-05,7e-06,1e-05,1.5e-05,4e-06,2e-05
3e-06,2.6e-05,5e-06,6e-06,8e-06,1.3e-05,9e-06,7e-06,1e-05,1e-05,5e-06,9e-06,7e-06,8e-06,4.5e-05,9e-06,5e-06,2.5e-05,4.2e-05,8e-06,1.3e-05,1e-06,7e-06,1.1e-05,1.9e-05,1.7e-05,5e-06,8e-06,1.9e-05,5e-06,2.7e-05,1.7e-05,1.9e-05,1.4e-05,7e-06,2.1e-05,1.6e-05,2.3e-05,4.4e-05,4e-06,1.3e-05,4e-05,1.9e-05,7e-06,1.1e-05,1e-05,2.7e-05,7e-06,5e-06,6e-06,9e-06,8e-06,6e-06,1.2e-05,1.1e-05,4e-06,1.4e-05,2.8e-05,5e-06,2e-06,2e-06,1.3e-05,5e-06,4e-06,2.5e-05,1.2e-05,9e-06,7e-06,1e-05,7e-06,1.1e-05,1.6e-05,6e-06,7e-06,2.5e-05,4e-06,5e-06,1.8e-05,6e-06,1.5e-05,7e-06,1.4e-05,2.4e-05,4e-06,2e-06,1.1e-05,6e-06,2.1e-05,1.1e-05,9e-06,1.3e-05,1.2e-05,8e-06,5e-06,1.9e-05,1.9e-05,7e-06,7e-06,2.3e-05,1.9e-05,1.4e-05,9e-06,7e-06,1.4e-05,3.1e-05,3.8e-05,2e-05,1.8e-05,1.8e-05,2.1e-05,2.8e-05,2e-05,1.1e-05,1.9e-05,4e-06,4.2e-05,1.5e-05,1.4e-05,5e-06,3e-06,1.9e-05
4e-06,2.1e-05,6e-06,9e-06,1.3e-05,1.2e-05,1.4e-05,1e-05,6e-06,1.3e-05,1.1e-05,1e-05,2e-05,9e-06,3.9e-05,1.5e-05,1.3e-05,1.8e-05,3.5e-05,8e-06,5e-06,9e-06,7e-06,4e-06,6e-06,1.6e-05,5e-06,1.1e-05,1.4e-05,4e-06,2.6e-05,2.1e-05,1.5e-05,2.6e-05,1.4e-05,1.9e-05,1.3e-05,1.4e-05,4.7e-05,8e-06,9e-06,5.4e-05,2.2e-05,6e-06,1.3e-05,6e-06,2.4e-05,9e-06,5e-06,1.2e-05,7e-06,2e-06,9e-06,1.1e-05,8e-06,1.8e-05,1.6e-05,2.2e-05,1.1e-05,8e-06,2e-06,1e-05,7e-06,3e-06,2.5e-05,1e-05,2e-06,1.1e-05,1.4e-05,1e-05,7e-06,8e-06,8e-06,2e-06,2.7e-05,8e-06,8e-06,1.7e-05,1.3e-05,1.9e-05,9e-06,1e-05,1.6e-05,6e-06,2e-06,8e-06,6e-06,1.5e-05,6e-06,7e-06,1.3e-05,1.8e-05,4e-06,5e-06,8e-06,1.3e-05,9e-06,1.1e-05,2.1e-05,1e-05,1.5e-05,5e-06,1.4e-05,2.3e-05,2.3e-05,2.9e-05,1.8e-05,7e-06,1.2e-05,2.1e-05,2.5e-05,2.1e-05,6e-06,4e-06,3e-06,3e-05,4e-06,8e-06,5e-06,6e-06,1.8e-05
1.3e-05,2.6e-05,8e-06,1e-05,1.6e-05,8e-06,1.3e-05,1.7e-05,1e-06,1.3e-05,9e-06,1.8e-05,1.5e-05,6e-06,4.3e-05,8e-06,4e-06,2.4e-05,3.3e-05,9e-06,1.2e-05,3e-06,7e-06,9e-06,1e-05,9e-06,8e-06,1.4e-05,1.9e-05,7e-06,3.2e-05,2e-05,2.1e-05,2.3e-05,7e-06,1.9e-05,1.4e-05,1.8e-05,4.1e-05,9e-06,1.6e-05,5e-05,1.6e-05,4e-06,8e-06,1.1e-05,1.7e-05,1.4e-05,5e-06,8e-06,1.4e-05,7e-06,7e-06,1.1e-05,5e-06,2.1e-05,1.2e-05,2.9e-05,6e-06,1e-05,8e-06,1.2e-05,9e-06,8e-06,3e-05,1.3e-05,1e-05,7e-06,8e-06,7e-06,5e-06,1e-05,8e-06,7e-06,2.3e-05,8e-06,1e-05,1.7e-05,1.4e-05,1.4e-05,8e-06,1e-05,1.7e-05,5e-06,1e-06,5e-06,7e-06,7e-06,1e-06,5e-06,1.8e-05,1.3e-05,1.3e-05,1.1e-05,1.6e-05,2.2e-05,6e-06,3e-06,2e-05,2.1e-05,1.7e-05,1e-05,1e-05,1.7e-05,1.2e-05,3e-05,1.5e-05,6e-06,2e-05,2e-05,2.8e-05,2e-05,1.6e-05,2e-05,1.2e-05,2.9e-05,9e-06,9e-06,1.3e-05,0,2.2e-05
8e-06,2e-05,8e-06,5e-06,1e-05,6e-06,9e-06,4e-06,7e-06,1.5e-05,2e-06,8e-06,2.3e-05,2.6e-05,5e-05,5e-06,8e-06,3.3e-05,3.9e-05,5e-06,1.6e-05,9e-06,1.5e-05,1.1e-05,1.3e-05,1.6e-05,4e-06,1.3e-05,1.5e-05,5e-06,3.9e-05,2.3e-05,2.5e-05,2.7e-05,1.7e-05,1.6e-05,1.6e-05,1.8e-05,4.2e-05,6e-06,1.6e-05,4.4e-05,1.6e-05,1.2e-05,8e-06,7e-06,3.1e-05,1.5e-05,1e-05,4e-06,6e-06,1e-05,7e-06,7e-06,7e-06,1.1e-05,1.1e-05,2.7e-05,7e-06,5e-06,5e-06,1.5e-05,8e-06,6e-06,3.1e-05,1.3e-05,1.4e-05,7e-06,1.4e-05,9e-06,9e-06,1.7e-05,1e-06,4e-06,2.2e-05,1.1e-05,8e-06,1.8e-05,1.6e-05,1.3e-05,4e-06,1e-05,1.7e-05,5e-06,7e-06,4e-06,7e-06,1.1e-05,1.2e-05,2e-06,1.7e-05,1.2e-05,8e-06,1.8e-05,1.7e-05,1.6e-05,4e-06,9e-06,2.3e-05,1.5e-05,3e-06,8e-06,5e-06,1.6e-05,1.1e-05,3.4e-05,1.2e-05,7e-06,1.4e-05,7e-06,1.8e-05,2.1e-05,1.5e-05,7e-06,6e-06,2e-05,1.8e-05,7e-06,1.3e-05,3e-06,1.8e-05
8e-06,2.7e-05,7e-06,4e-06,1.4e-05,7e-06,6e-06,1e-05,8e-06,1.2e-05,4e-06,1.6e-05,2.4e-05,1.2e-05,4.1e-05,9e-06,1.2e-05,2.4e-05,4.3e-05,9e-06,1.1e-05,6e-06,1.3e-05,3e-06,1.4e-05,1.5e-05,8e-06,7e-06,1.5e-05,8e-06,3.1e-05,1.8e-05,2.4e-05,2.5e-05,9e-06,1.2e-05,1.1e-05,1.1e-05,4.2e-05,5e-06,1.7e-05,5e-05,1.5e-05,6e-06,4e-06,8e-06,2.6e-05,7e-06,5e-06,3e-06,1.1e-05,3e-06,4e-06,1.1e-05,8e-06,9e-06,6e-06,2.8e-05,5e-06,6e-06,5e-06,1.1e-05,8e-06,2e-06,2.4e-05,1.5e-05,1.3e-05,0,1.3e-05,8e-06,1.4e-05,7e-06,5e-06,6e-06,1.9e-05,5e-06,9e-06,1.4e-05,1e-05,1.5e-05,4e-06,1e-05,1.8e-05,7e-06,5e-06,1.1e-05,1e-05,1.7e-05,5e-06,4e-06,1.4e-05,1.1e-05,1e-06,1.1e-05,1.6e-05,1.1e-05,6e-06,9e-06,2.4e-05,1.9e-05,9e-06,7e-06,1.2e-05,2.3e-05,2e-05,2.6e-05,9e-06,8e-06,6e-06,1.2e-05,2.7e-05,2.2e-05,1.8e-05,3e-06,1.2e-05,3.1e-05,1.3e-05,1.4e-05,7e-06,7e-06,1.4e-05
3e-06,2e-05,5e-06,2e-06,7e-06,1.2e-05,1e-05,9e-06,1e-05,1.3e-05,1e-06,1.3e-05,1.7e-05,3e-06,4.2e-05,9e-06,4e-06,1.6e-05,4.2e-05,1.3e-05,2.2e-05,9e-06,8e-06,3e-06,2.2e-05,2.3e-05,8e-06,1.1e-05,2.1e-05,5e-06,3.1e-05,1.9e-05,2.4e-05,3e-05,1e-05,2.3e-05,1.9e-05,1.3e-05,3.8e-05,1e-05,1.8e-05,4.4e-05,1.3e-05,5e-06,2e-06,4e-06,3.2e-05,8e-06,6e-06,3e-06,5e-06,1e-05,4e-06,1e-05,7e-06,9e-06,1.1e-05,2.8e-05,8e-06,5e-06,4e-06,1.6e-05,1.2e-05,6e-06,2.1e-05,1e-05,1.1e-05,7e-06,1.2e-05,1e-05,1.1e-05,1.3e-05,4e-06,5e-06,1.7e-05,7e-06,9e-06,1.3e-05,1.1e-05,1.1e-05,3e-06,7e-06,2.1e-05,5e-06,3e-06,1e-05,8e-06,1.7e-05,8e-06,6e-06,1.3e-05,9e-06,3e-06,9e-06,1.6e-05,1.3e-05,1e-05,1e-06,2.6e-05,1.9e-05,1.1e-05,4e-06,1.3e-05,2e-05,1.7e-05,1.9e-05,1.9e-05,1.2e-05,6e-06,1e-05,2.6e-05,1.3e-05,1.3e-05,1.2e-05,1.2e-05,2.6e-05,1.4e-05,9e-06,6e-06,3e-06,2e-05
3e-06,2.3e-05,7e-06,3e-06,1.4e-05,9e-06,3e-06,7e-06,5e-06,8e-06,3e-06,1.3e-05,2.2e-05,1.6e-05,4.3e-05,3e-06,3e-06,2.3e-05,3.7e-05,2e-05,2.1e-05,9e-06,1.1e-05,6e-06,9e-06,1.4e-05,1.1e-05,5e-06,1.9e-05,9e-06,3.1e-05,1.5e-05,1.4e-05,2.4e-05,2e-06,1.5e-05,1.9e-05,2.6e-05,4.2e-05,1e-05,8e-06,4.2e-05,1.6e-05,7e-06,9e-06,5e-06,3.4e-05,4e-06,1.3e-05,8e-06,6e-06,1e-06,3e-06,3e-06,7e-06,1.3e-05,8e-06,2.8e-05,8e-06,3e-06,8e-06,1.2e-05,8e-06,3e-06,1.6e-05,1.3e-05,1.2e-05,9e-06,1.2e-05,7e-06,4e-06,1.6e-05,9e-06,5e-06,1.7e-05,2e-06,8e-06,1.4e-05,1.5e-05,1.3e-05,5e-06,1.3e-05,1.2e-05,5e-06,4e-06,5e-06,5e-06,1.2e-05,4e-06,2e-06,1.1e-05,1.3e-05,2e-06,5e-06,1.9e-05,1.9e-05,3e-06,8e-06,2.5e-05,1.6e-05,1.3e-05,4e-06,5e-06,2.2e-05,1.8e-05,2.9e-05,9e-06,8e-06,2.3e-05,1.9e-05,1.6e-05,9e-06,5e-06,6e-06,6e-06,2.7e-05,6e-06,1.5e-05,1.7e-05,6e-06,2.2e-05
3e-06,2.6e-05,9e-06,1e-06,1.1e-05,1.1e-05,7e-06,1.1e-05,9e-06,9e-06,2e-06,1.2e-05,2.6e-05,1e-05,4.1e-05,9e-06,6e-06,1.8e-05,2.9e-05,1.1e-05,6e-06,1e-05,1.1e-05,1.1e-05,1.6e-05,1e-05,7e-06,1.1e-05,1.3e-05,5e-06,2.5e-05,2.1e-05,2.2e-05,1.6e-05,8e-06,1.6e-05,1.4e-05,1.8e-05,4.1e-05,4e-06,5e-06,4.7e-05,1.4e-05,2e-06,1.2e-05,4e-06,2.9e-05,6e-06,9e-06,5e-06,4e-06,5e-06,4e-06,7e-06,0,1.1e-05,5e-06,2.9e-05,6e-06,1e-06,6e-06,8e-06,4e-06,0,2.2e-05,7e-06,1.1e-05,3e-06,1.1e-05,1.3e-05,9e-06,1e-05,6e-06,5e-06,2.1e-05,6e-06,6e-06,1.2e-05,1.4e-05,1.2e-05,1.2e-05,3e-06,1.8e-05,4e-06,5e-06,8e-06,1.2e-05,9e-06,5e-06,4e-06,1.1e-05,1.1e-05,5e-06,1e-05,1.7e-05,9e-06,5e-06,9e-06,2.5e-05,1.6e-05,1e-05,5e-06,9e-06,2.2e-05,2e-05,3.3e-05,9e-06,1e-06,2.6e-05,1e-05,2.2e-05,1.8e-05,4e-06,8e-06,8e-06,2.8e-05,2e-06,4e-06,4e-06,2e-06,1.9e-05
2e-06,2.3e-05,4e-06,5e-06,1.1e-05,1.2e-05,4e-06,1e-05,6e-06,7e-06,4e-06,1.3e-05,2.2e-05,7e-06,3.8e-05,3e-06,1e-05,2.3e-05,3.4e-05,9e-06,1.5e-05,3e-06,5e-06,1e-05,1.3e-05,1.1e-05,8e-06,1.1e-05,1.8e-05,2e-06,2.6e-05,2e-05,2.2e-05,2.1e-05,8e-06,1.8e-05,9e-06,1.9e-05,3.7e-05,5e-06,9e-06,4.5e-05,1.1e-05,3e-06,7e-06,3e-06,2.6e-05,5e-06,4e-06,3e-06,6e-06,4e-06,4e-06,6e-06,2e-06,1.1e-05,6e-06,2.8e-05,8e-06,2e-06,2e-06,1.4e-05,3e-06,5e-06,2.4e-05,9e-06,1.2e-05,4e-06,8e-06,1.1e-05,9e-06,1.2e-05,4e-06,2e-06,2.1e-05,7e-06,8e-06,1.3e-05,1.2e-05,9e-06,8e-06,9e-06,2.1e-05,2e-06,3e-06,9e-06,5e-06,9e-06,4e-06,4e-06,8e-06,1e-05,6e-06,8e-06,1.1e-05,1.5e-05,4e-06,7e-06,2.2e-05,1.6e-05,1.1e-05,4e-06,1e-05,2.2e-05,1.8e-05,2.3e-05,1.1e-05,7e-06,1.9e-05,1.2e-05,2.6e-05,1.8e-05,8e-06,1.1e-05,2e-06,2.4e-05,3e-06,1e-06,6e-06,2e-06,1.9e-05
3e-06,2.3e-05,5e-06,6e-06,1e-05,1e-05,5e-06,9e-06,6e-06,8e-06,4e-06,1.3e-05,2.2e-05,7e-06,4.1e-05,3e-06,8e-06,2.3e-05,3.1e-05,1e-05,1.4e-05,4e-06,7e-06,1e-05,1.2e-05,1.4e-05,4e-06,1e-05,1.5e-05,3e-06,2.7e-05,2.1e-05,2.2e-05,1.9e-05,8e-06,1.5e-05,1.3e-05,1.7e-05,3.7e-05,3e-06,7e-06,4.5e-05,1.5e-05,7e-06,4e-06,3e-06,2.7e-05,5e-06,2e-06,2e-06,5e-06,3e-06,2e-06,1e-05,4e-06,1.2e-05,9e-06,2.7e-05,7e-06,1e-06,2e-06,1e-05,5e-06,4e-06,2.6e-05,1e-05,1.2e-05,4e-06,9e-06,1e-05,1.1e-05,1.1e-05,3e-06,3e-06,2.1e-05,6e-06,6e-06,1.2e-05,1e-05,1e-05,9e-06,6e-06,1.8e-05,2e-06,4e-06,6e-06,6e-06,1e-05,5e-06,3e-06,1e-05,8e-06,6e-06,8e-06,1.4e-05,1.6e-05,2e-06,4e-06,2.2e-05,1.5e-05,9e-06,7e-06,6e-06,2e-05,1.8e-05,2.6e-05,7e-06,7e-06,1.4e-05,1.1e-05,2.2e-05,1.5e-05,6e-06,7e-06,2e-06,2.5e-05,2e-06,3e-06,8e-06,2e-06,1.6e-05
1e-06,2.2e-05,5e-06,6e-06,1.1e-05,1.2e-05,7e-06,9e-06,6e-06,8e-06,4e-06,1.3e-05,2.1e-05,7e-06,4e-05,6e-06,8e-06,2.1e-05,3e-05,8e-06,1.3e-05,4e-06,6e-06,9e-06,1.2e-05,1.3e-05,4e-06,1e-05,1.6e-05,3e-06,2.7e-05,2.1e-05,2e-05,2e-05,9e-06,1.5e-05,1.3e-05,1.6e-05,3.8e-05,3e-06,6e-06,4.5e-05,1.3e-05,3e-06,7e-06,2e-06,2.5e-05,2e-06,2e-06,3e-06,6e-06,5e-06,1e-06,8e-06,4e-06,1.1e-05,9e-06,2.7e-05,7e-06,1e-06,2e-06,1.1e-05,4e-06,4e-06,2.5e-05,1.1e-05,1.1e-05,5e-06,1e-05,1e-05,1e-05,1.2e-05,2e-06,4e-06,1.9e-05,7e-06,5e-06,1.3e-05,1e-05,9e-06,8e-06,6e-06,1.9e-05,2e-06,2e-06,6e-06,7e-06,1.1e-05,2e-06,3e-06,1.2e-05,1e-05,5e-06,7e-06,1.1e-05,1.5e-05,0,7e-06,2.2e-05,1.4e-05,1.1e-05,7e-06,8e-06,2e-05,1.9e-05,2.9e-05,8e-06,3e-06,1.3e-05,1e-05,2.4e-05,1.4e-05,6e-06,7e-06,2e-06,2.6e-05,4e-06,4e-06,9e-06,2e-06,1.5e-05
