-0.002558,-0.001858,-0.001993,-0.002485,-0.003004,-0.000763,-0.000601,-0.002742,-0.001931,-0.001798,0.000749,7.7e-05,-0.002607,-0.001991,-0.001241,-0.005742,-0.008683,-0.007033,-0.008541,-0.004904,-0.004128,-0.002127,-0.006247,-0.01165,-0.00908,-0.00691,-0.00822,-0.011348,-0.011321,-0.008304,-0.009176,-0.005157,-0.008434,-0.006085,-0.003892,-0.007324,-0.005184,-0.001671,-0.008006,-0.006984,-0.005184,-0.003821,-0.005369,-0.009634,-0.008753,-0.004758,-0.006607,-0.005218,-0.004838,-0.004934,-0.00286,-0.009034,-0.007523,-0.00758,-0.006396,-0.008024,-0.009556,-0.006791,-0.007061,-0.009896,-0.007985,-0.006899,-0.008309,-0.007296,-0.006358,-0.001394,-0.001636,-0.00675,-0.007539,-0.004924,-0.002278,-0.004373,-0.005135,-0.005071,-0.005437,-0.006861,-0.002487,-0.003051,-0.003528,-0.001512,-0.006508,-0.004982,-0.004775,-0.005012,-0.001973,-0.003624,-0.004501,-0.002964,-0.003301,-0.002509,-0.001052,-0.001385,-0.005164,-0.00583,-0.005463,-0.003875,-0.00668,-0.004314,-0.006082,-0.007301,-0.004769,-0.003438,-0.008784,-0.007238,-0.009882,-0.007813,-0.013211,-0.009338,-0.010861,-0.0068,-0.002856,-0.002298,-0.002512,-0.007359,-0.003439,-0.001942,-0.005556,-0.002437,-0.009545,-0.000633,-0.000204
0.001889,-4.9e-05,7.7e-05,0.000591,0.000514,-0.00156,-0.000624,-0.000593,0.000724,0.001359,0.001083,-0.001763,-0.000153,0.000348,-0.000772,0.002452,0.002332,-0.00013,0.002208,0.003249,0.002528,0.002034,0.003532,0.007331,0.00491,0.00416,0.003929,0.003096,0.004848,0.002081,0.001661,0.001086,0.001195,-0.001044,-0.002864,0.000103,-0.000941,-0.000714,0.002654,2e-04,-0.001603,-0.002578,-0.000404,0.00183,0.002483,-0.001119,0.002303,0.002616,0.001706,4.8e-05,-0.001541,0.001537,0.000918,0.000256,-0.000984,0.001434,0.003505,0.000803,-0.002491,-0.002109,0.001333,-0.001271,0.000454,0.00245,0.002789,-0.003649,-0.004568,0.000521,0.001612,0.001539,-0.001024,-0.004612,-0.003088,-0.00054,0.001951,7.6e-05,-0.00264,-0.002403,0.000199,-0.002389,0.002255,0.003058,0.00206,-0.000269,0.000884,-0.000276,-0.004417,-0.003179,-0.001632,-0.00479,-0.007106,-0.004598,-0.000247,-0.000699,-0.002476,-0.003827,0.000176,-0.000912,0.000121,-1.2e-05,0.000332,-0.002176,-0.002688,-0.000959,0.002042,0.00075,0.00121,0.000951,0.001102,-0.005585,-0.009071,-0.002151,-0.003484,-0.001401,-0.003408,-0.004071,-0.002758,-0.00897,-0.001711,-0.009114,-0.010575
-0.00189,-0.000306,-0.001253,-0.002674,-0.000962,-0.001803,-0.001693,0.000313,-0.002431,-0.002076,0.000814,0.000164,-0.000149,0.000552,0.001698,-0.00258,-0.003383,-0.001786,-0.00403,-0.002758,-0.00241,0.001177,-0.001096,-0.007097,-0.004123,-0.0014,-0.000548,-0.002845,-0.002011,-0.001002,-0.001574,0.000518,-0.001549,-0.001129,0.000942,-0.002416,-0.001616,0.000295,-0.001632,-0.000896,5.5e-05,0.001595,-0.000709,-0.000189,-0.001966,-0.003073,-0.002684,-0.000205,-0.001803,-0.002414,0.00111,-0.001402,-0.001479,-0.001335,-0.003147,-0.001345,-0.003542,-0.005095,-0.000884,-0.00182,-0.004001,-6e-06,-0.003392,-0.005134,-0.003116,-0.001915,-0.000308,0.000259,-0.003576,-0.006985,-0.003936,0.002512,-0.000327,0.001071,-0.004158,-0.002201,-0.001609,-0.001875,-0.002771,-0.000182,-0.005847,-0.004485,-0.001622,0.000966,-0.002912,-0.002011,0.000199,-0.001018,-0.001065,0.002656,-8e-06,-0.000122,-0.003855,-0.002054,0.00082,0.003065,-0.001201,-0.001481,-0.000807,-0.002235,-5.9e-05,-0.002162,-0.000233,-0.000499,-0.000482,-0.000606,-0.002179,-0.005012,-0.003195,-0.003521,0.000289,-0.003706,-0.000425,-0.006031,-0.003596,-0.002191,-0.003751,-9.6e-05,-0.004574,-0.0011,0.000267
0.000735,0.000226,0.000527,0.001919,0.002102,0.002198,0.000552,-0.00034,0.00028,0.000813,0.000434,-0.002206,0.000539,0.001092,-0.001378,0.002323,0.003752,0.00268,0.004767,0.004742,0.001466,-0.000146,0.000612,0.005344,0.003118,0.002813,-0.000405,0.002745,0.002406,-0.000519,0.001751,0.00067,0.003085,0.002818,-0.00074,0.002278,0.003517,0.001345,0.002263,0.00311,0.001135,-0.000757,0.002479,0.000788,0.003457,0.003098,0.001189,0.000365,0.00075,0.003125,0.000968,0.003204,0.002724,0.001506,0.002254,0.000964,0.003098,0.005187,0.00372,0.001943,0.002918,0.000393,0.003013,0.001986,0.001492,0.000951,0.004028,0.0013,0.003064,0.005206,0.00502,-0.002502,0.00057,-0.001452,-0.000231,-0.000469,0.000247,0.005096,0.002429,0.002468,0.000788,0.003568,0.000687,-0.000507,0.00122,0.000839,0.002106,0.00222,0.002455,0.000841,0.002208,-0.000754,0.003158,0.003165,0.001894,0.000209,0.001229,-0.001002,0.000832,0.001209,0.000519,0.000415,0.003337,0.003123,0.000952,0.002368,0.002682,0.004911,0.004901,0.001782,0.009347,0.004124,0.001228,0.006352,0.003928,0.004427,0.003808,0.003695,0.004334,0.005204,0.005505
-0.000123,6.9e-05,0.000214,-0.001827,-0.002204,0.000126,0.000343,0.000253,-0.000856,-0.001612,-0.000261,-0.002935,-0.003046,-0.00151,-0.000391,0.000365,-0.000538,-0.000572,-0.001565,-0.003859,-0.004608,-0.00182,-0.000581,-0.000934,0.00024,-0.000824,-0.001558,-0.001475,-9e-06,-3.2e-05,-0.001187,-0.001063,-0.001982,-0.00204,0.002071,-0.002275,-0.002115,-0.002712,-0.00253,-0.002646,-0.003466,-0.001275,-0.001633,-0.001278,-0.00386,-0.001631,-0.000785,0.000402,-0.001272,-0.000574,-0.001072,-0.000397,-0.001417,-0.000377,0.001284,-0.000523,-0.003621,-0.003376,-0.003392,3e-04,-0.000696,1.3e-05,-0.000695,-5.5e-05,-0.001164,-0.001276,-0.002295,-0.000957,-0.00188,-0.001469,-0.002193,0.002688,-0.002797,0.000898,0.001283,-0.001047,-0.001689,-0.000502,-0.001926,-0.001868,0.000252,-0.00192,1.4e-05,-0.000747,-0.001316,-0.001569,-0.001744,-0.000677,-0.001913,-0.002322,-0.00201,6.3e-05,-0.001684,-0.002882,-0.00376,-0.00093,-0.002564,0.001561,-0.001159,-0.001932,-0.002098,0.001344,-0.002564,-0.00677,-0.004643,-0.003741,-0.003269,-0.005672,-0.00611,-0.00247,-0.007617,-0.004364,-0.00086,-0.002442,-0.000562,-0.00064,0.000425,-0.001999,-0.000772,-0.002278,-0.004291
0.000864,9.4e-05,0.000688,0.001349,0.001456,-0.000176,0.000808,-7.4e-05,0.001468,0.00127,-4.5e-05,0.000487,0.001118,0.001229,-0.000733,-0.000655,-0.000149,0.000314,-0.001373,0.001579,0.001565,-0.001377,-0.002102,-0.001641,-0.001419,-0.000168,0.000926,-0.000177,-0.000436,0.001579,0.001073,-0.000181,6.6e-05,0.002407,0.000874,0.002143,8.9e-05,0.000958,0.000846,0.001676,0.002334,0.001536,-0.000498,0.001123,0.001718,0.001674,0.001476,0.000749,0.000917,-4e-04,-0.00039,-0.001059,0.000284,-0.000361,0.000422,0.001377,0.001053,0.001805,0.00075,-0.00096,0.002529,-0.000288,0.000898,0.002068,0.001232,0.000452,-0.001766,-0.000102,0.00141,0.001566,0.000409,0.001844,0.003947,0.001468,0.000662,0.002182,0.002021,-0.002098,-0.00037,-0.000187,0.000733,-0.000717,0.000577,0.000922,0.000347,0.001571,0.000246,-0.000144,0.000134,-0.000393,5e-04,0.00215,-0.00135,-2.4e-05,0.0029,0.001879,0.00168,-0.001179,0.001496,0.000463,0.000405,0.000895,-0.000388,0.003567,0.004053,0.002238,0.001457,0.004938,0.002824,0.001983,0.001381,0.002086,0.000553,0.000819,0.002588,-0.002167,0.000741,0.000346,0.000831,0.000767,-0.00126
-0.000658,0.000205,-0.000449,0.00045,-5.4e-05,7.7e-05,-0.001186,0.000169,-0.000855,0.000326,0.000894,0.001565,0.001812,-0.000954,-0.00051,-0.000832,-0.000802,0.000539,0.000317,0.00109,-0.000746,0.000119,0.001273,0.000248,0.001287,-0.000578,0.000333,0.001885,0.000788,-0.001904,-0.001159,0.000809,0.000721,-0.000935,-0.001659,-4e-05,0.000767,0.00072,0.000827,-0.000438,0.000571,6.3e-05,0.001296,0.001625,0.000206,-0.000703,-0.000256,-0.002046,-0.000544,-0.00067,0.000994,1.9e-05,-0.000259,-0.00025,-0.000615,-0.001883,-0.000582,-0.001537,-0.001482,0.001465,-0.001837,-0.000361,-0.000399,-0.000768,-0.000947,-0.000345,0.000585,0.000423,-0.001848,-0.001561,-0.001753,-0.001259,-0.002657,-0.00056,-4.1e-05,0.000568,-0.001004,0.000521,0.00058,0.00056,-0.00055,-0.00015,-0.000377,0.000838,0.001912,-0.000379,-0.000693,-0.000267,0.000794,0.000151,0.001008,-0.000877,-0.000739,0.000218,-0.000197,-0.00171,0.001656,-3.3e-05,-0.000725,-0.000236,-0.000346,-0.001497,0.001552,0.000292,-0.000884,-0.000634,0.001413,-1.5e-05,-0.001342,-0.000752,-0.002138,-0.001184,-0.002328,-0.00022,-0.003369,0.000832,-0.002648,-0.000556,-0.00186,-0.000563,0.002776
-0.00016,-6e-06,-0.000266,-0.000485,0.000211,0.000115,-8e-05,3.9e-05,-0.000129,0.000332,-0.001407,-0.001028,-0.001769,3e-04,0.000352,0.000302,0.000336,-0.000471,-0.001301,-0.003055,-0.001733,-0.001728,-0.002447,-0.000749,-0.00124,-0.000502,0.000539,-0.000685,-0.001042,0.002672,0.000255,-0.000917,-0.001244,-0.000197,-0.000908,0.000932,2.4e-05,-0.00095,-0.000861,0.000285,-0.000724,-0.000243,-0.000241,-0.001798,-0.00068,0.000653,0.000294,0.000933,0.000399,0.000809,-0.000124,-0.000126,0.000696,0.000612,-8.3e-05,-0.00105,-0.000174,0.000311,0.001783,-0.000465,0.000934,0.00123,0.001712,1.8e-05,0.000855,0.000307,0.000293,-1.9e-05,0.001864,0.001678,0.002027,-0.001175,-0.000385,-0.002495,-0.000834,0.000832,0.00069,0.000622,0.001022,9.6e-05,0.000497,0.001132,-0.000143,-0.000303,-0.000166,-0.000801,0.000334,-0.000225,0.001235,0.000314,-0.001055,-0.000119,0.000183,0.000678,-0.000526,-0.000466,-0.003208,-0.000434,-0.001052,0.002442,-0.000185,-0.001365,-0.000917,-0.00111,6.9e-05,-0.001107,-0.001531,-0.00056,0.000708,0.001206,0.002306,0.000788,0.003126,0.001127,-0.000112,-0.000805,0.000382,0.001581,0.001202,-0.000108,0.000458
-0.000231,-0.000226,0.000474,2.8e-05,-0.000386,-0.000402,0.000678,0.000213,0.000816,-0.000689,-4.6e-05,0.000559,0.000819,-0.000356,-0.000472,0.000532,0.000128,-0.000155,0.001239,0.001973,0.000889,0.002017,-0.000201,-8.2e-05,0.000881,0.001895,0.000412,0.000368,0.000828,-0.002074,2.4e-05,0.001548,0.000964,-0.000364,0.001881,-0.000846,-0.000612,0.000296,0.000726,-0.000272,-0.000975,0.000592,-0.000334,0.000151,2.8e-05,-0.00148,-0.000456,-0.000217,0.001375,0.000419,-0.000193,-0.000771,-4.5e-05,0.00074,-7e-06,0.001727,0.001633,-0.000498,-0.000603,-0.000564,4.3e-05,-2.5e-05,-0.001307,-0.000731,-0.000668,-0.000725,0.001122,-0.000209,-0.001651,-0.00055,-0.000164,0.000781,0.001337,0.001135,-0.000513,-0.000723,0.00061,6.9e-05,-0.000442,-0.000249,0.000485,-0.000283,-0.001704,0.00045,-0.00034,0.000333,0.002024,0.000608,-0.001496,-6.7e-05,-0.000254,0.000129,0.000418,0.000126,-0.000547,0.000787,0.002018,0.000587,0.001293,-0.000199,0.000609,0.001856,0.001061,-0.000405,-0.000695,0.000205,0.001074,1.3e-05,-0.001316,0.000441,0.000473,0.001955,-4e-05,-0.00121,0.002386,0.001875,0.00199,-0.000241,0.000122,0.002472,-0.000374
-1.6e-05,-7e-05,-0.00044,3.6e-05,8.3e-05,-0.000546,-0.000132,-0.000579,-0.000677,-0.000259,-0.001212,1.3e-05,-0.000456,-0.000778,-0.000549,-0.000772,0.000547,-0.000145,-0.000434,-0.000227,-0.000784,-0.001179,3.4e-05,-0.000832,-0.000392,-0.001788,0.000121,-0.001088,-0.000269,-0.000128,-3.7e-05,-0.00091,-0.000765,0.000415,-0.002088,-0.000774,0.001185,-0.000305,7.4e-05,2.6e-05,0.000484,0.00061,-0.00034,0.00055,-0.000311,0.000758,-0.000235,-0.000806,-0.000497,-0.00014,6.5e-05,0.00078,0.000108,-0.000984,0.000257,-0.000157,-0.00147,-1.6e-05,-0.000237,-0.001505,-0.001712,0.000947,-0.000592,0.00066,-0.000147,0.000175,-0.000408,-6.1e-05,0.001048,-0.000306,-6.7e-05,-0.000244,-0.000185,-0.000238,0.001592,-0.000835,6.1e-05,-0.000198,-0.000905,-0.001202,-0.000623,-3.6e-05,0.001538,0.000268,-2.9e-05,0.000166,-0.001754,-0.001125,-0.000353,5.9e-05,0.000418,0.000231,0.001469,0.000339,0.000234,7e-06,0.000579,-0.000823,-0.000968,-0.001117,-0.000741,-0.001239,-0.001072,0.001089,0.002043,0.001488,-0.001098,-0.000377,0.001597,-0.000455,0.000591,-0.000175,-0.000607,0.000291,-0.001035,-0.001188,-0.001651,8.8e-05,0.000295,-0.001308,6.8e-05
9.1e-05,0.000282,0.000285,-0.000102,-0.000256,0.000695,0.000208,0.000253,-0.000184,-3.3e-05,0.00024,0.00049,7.1e-05,-0.000267,0.000584,0.000416,-0.000149,0.000516,0.000448,-0.000538,-0.000138,0.000132,0.00019,-0.000649,-0.000367,0.001239,1e-05,0.000761,-0.000188,0.00069,-0.000565,-0.000822,0.000704,-0.000257,0.001167,0.001944,-0.000727,0.00071,-0.000605,0.000134,0.000483,-0.001256,-0.000571,-0.000205,0.00044,0.000782,0.000337,0.000813,0.000226,-9.5e-05,9.6e-05,0.000319,0.000158,0.00038,-0.000618,0.000216,0.000158,0.000562,0.000533,0.001335,0.001018,-0.001107,7e-04,-0.000826,0.000212,0.000263,0.000115,0.001198,0.000426,-0.000158,-0.000218,-0.00033,0.00075,0.000368,-0.000664,0.000158,0.000319,0.00074,0.000316,0.000994,-8.1e-05,-5.9e-05,-0.001238,-0.000238,0.000196,0.000166,-0.000317,0.000502,0.001251,-9.2e-05,0.000658,-0.000328,-0.000446,-9.5e-05,0.000628,-0.000244,-0.000257,0.000966,0.000479,-5.2e-05,0.001636,0.000306,-0.000521,0.000505,-0.001364,-0.002002,0.000428,0.000508,-0.000782,-0.000341,-0.000561,-0.001847,-0.000246,-4.5e-05,-0.000874,0.000357,-0.000535,-0.001385,-0.000686,-0.001306,-0.001298
9.2e-05,4.7e-05,1e-05,0.00039,1.1e-05,-0.000456,-0.00016,0.000334,0.000268,0.000299,-9.6e-05,0.00051,0.000122,0.000511,-0.000527,3e-06,8.4e-05,-0.000193,-0.000605,-0.000372,0.000187,0.000301,0.000787,0.000171,0.000181,-0.000579,-0.000262,-0.000605,8.8e-05,-0.000774,0.000864,0.000232,-0.000389,4.6e-05,-0.000506,-0.000504,0.000268,-0.000399,-8e-05,-9.1e-05,-0.000146,0.000651,0.000509,-0.000363,-0.000273,-0.000539,-0.000159,0.000489,-5e-06,0.000184,-9.4e-05,-0.000462,-0.000487,-0.000309,0.000122,-0.000329,0.000479,0.000337,-0.000519,-0.000189,9.2e-05,7.8e-05,-0.000612,0.000278,-0.00031,0.000124,-0.000127,-0.000224,-0.001545,-4.9e-05,-7.5e-05,-0.001015,-0.000615,-0.000675,0.000161,0.000367,-0.001019,-0.001082,-0.000155,-0.000434,0.000258,-0.000117,0.000116,-0.000206,9.9e-05,-4.2e-05,0.000293,0.000344,-0.000462,-0.000253,-0.000101,0.000188,-0.001292,0.000162,-0.000521,0.000397,0.000912,-0.000183,-0.000438,0.001108,-0.000164,0.000249,0.000648,-0.001188,0.000188,0.001234,-0.00027,-0.000665,0.000322,0.000187,-0.00102,3.7e-05,0.001133,0.000298,0.000757,-0.000931,0.001147,0.000815,0.00092,0.000728,0.002001
-2.4e-05,-4.6e-05,-8e-06,-0.000203,9.7e-05,0.000193,0.000311,-0.000309,7.7e-05,-3.3e-05,0.000609,-6.4e-05,0.000109,0.000376,0.000174,-0.000237,9.4e-05,0.000132,-0.000106,-7.8e-05,-0.000333,2.1e-05,-6.6e-05,-2.8e-05,-0.000142,5.2e-05,0.000421,0.000564,-3.1e-05,0.000335,-0.00062,0.000342,0.000329,5.9e-05,0.000389,2.2e-05,-0.000567,-0.000147,0.000694,0.000115,-0.00034,-0.00014,0.000251,9.5e-05,0.000366,0.000137,-2.9e-05,-0.000674,-0.000204,-0.000243,5.8e-05,0.000268,2.2e-05,0.000317,0.000212,0.000468,1.3e-05,-0.000238,0.000172,2.6e-05,-0.00025,0.000459,0.000252,-2e-04,-0.000291,0.000292,0.000103,-0.000527,0.000917,-0.000311,-0.000138,0.001642,0.000599,0.000635,-0.000294,4.6e-05,-0.000175,0.000492,0.000321,-6.2e-05,0.000291,0.000181,-0.000118,-0.000337,-3.2e-05,0.000225,0.000441,4.6e-05,-5e-06,-0.00029,0.000111,0.000151,0.000286,-0.000183,-7.8e-05,7.9e-05,-0.000879,-0.000785,-0.000135,-0.000693,-8.5e-05,0.000223,0.00067,0.000477,6.4e-05,-0.000354,0.00041,0.00056,0.000519,0.000361,0.000161,0.000947,-0.00052,8.1e-05,8.3e-05,0.001129,0.000158,0.00012,-0.000194,0.000421,-0.001087
4.3e-05,-0.000161,8e-06,4e-06,-9e-06,-9.9e-05,-0.000266,2.5e-05,-6.1e-05,-0.000185,-9e-06,0.000296,0,9e-05,-3.1e-05,-9e-05,0.00078,-0.00049,-0.000142,0.000393,-0.000146,-0.000494,-6.2e-05,-0.000335,-0.00022,-0.000296,9e-06,-5.6e-05,-7.4e-05,-0.000667,8e-05,-0.00025,-0.000425,9.1e-05,-0.000653,-0.000558,-6e-05,-0.000142,-0.000541,0.000105,0.000137,0.000435,-4e-06,-7.2e-05,-1.8e-05,0.000258,0.000121,-0.000378,-2e-04,-0.000161,4e-06,-0.000497,-3.6e-05,-0.000209,-2.2e-05,-0.000535,-8.8e-05,2e-06,0.000574,-0.000167,-0.000177,0.000276,-5.6e-05,0.000363,0.000332,3.8e-05,0.00026,-0.000119,7.4e-05,0.000389,0.000149,-0.000416,-0.00043,0.000132,-0.000182,-3e-04,0.000157,-0.000311,0.000171,-3.5e-05,-0.000467,-2.1e-05,0.001179,-9.3e-05,-1.2e-05,-7.3e-05,-0.000286,-0.000108,2.4e-05,0.00043,-0.000108,-3e-04,0.000721,0.000178,0.00051,-0.000224,-0.000256,0.000795,3.7e-05,8.6e-05,-0.000435,7.3e-05,-0.000211,0.000369,-1.1e-05,-0.000136,-1.8e-05,0.000113,-0.00053,-0.000676,6e-05,0.000232,-0.000952,-0.000247,-0.000568,-0.000348,-0.000527,-0.000403,-9.5e-05,-0.000375,-0.000299
5e-06,-8.5e-05,-3.8e-05,0.000107,3.3e-05,6.7e-05,-0.000172,-0.000154,-0.000103,5.3e-05,0.000293,-0.000137,0.000127,0.000407,0.000281,-3.6e-05,-0.000414,0.000123,0.000315,-9.6e-05,-0.00017,0.000302,-0.00024,0.000283,3.4e-05,0.000196,-0.00043,0.000177,3e-05,0.000221,0.000263,0.000153,0.00019,-0.000142,0.000554,0.000156,0.000298,4.6e-05,0.000116,-0.000135,3e-05,-0.000592,0.000123,0.000291,-9.4e-05,-0.000329,-0.000308,0.000103,0.000222,-0.000127,2.7e-05,0.000393,-5.8e-05,-3.1e-05,-6e-06,0.00014,-0.000361,-0.000155,-0.000248,7.4e-05,0.000291,-5e-06,-0.000121,-0.000119,5.7e-05,-7.4e-05,-3.7e-05,7.4e-05,-0.000184,-0.000225,-3.8e-05,0.00012,8.8e-05,-3e-06,-4.1e-05,-0.000341,0.000295,8e-06,-0.000289,0.000468,5.8e-05,0.000115,-0.000224,-0.000264,0.000174,-0.000176,0.000144,-0.000132,-0.000221,0.000146,9.7e-05,6e-06,-0.000591,-0.000208,7.6e-05,-0.000281,0.00035,-1.7e-05,-4e-06,-0.000371,0.000124,5e-06,-3e-06,0.00029,4.6e-05,0.000273,-9.9e-05,-0.000136,0.000215,3.4e-05,0.000429,-0.000482,0.000463,-2e-05,8.4e-05,0.000158,0.000393,0.000228,-3.7e-05,2.6e-05,-0.000146
-8.5e-05,4.1e-05,2.6e-05,-1e-04,-7.9e-05,-0.00019,0.00016,0.000159,5.8e-05,4.9e-05,-0.000257,5.1e-05,-8.8e-05,-0.000343,-0.000188,9.5e-05,0.000339,2.5e-05,-4.9e-05,-0.000143,4.9e-05,-0.000164,4.8e-05,6.4e-05,-0.000255,-0.000296,0.000307,5.1e-05,5.2e-05,-3.2e-05,-0.000315,-4.6e-05,6.5e-05,-6.8e-05,-0.000104,8.1e-05,-0.000195,6.3e-05,-0.000185,-7.3e-05,0.000126,0.000144,-0.000113,-0.000262,-2.1e-05,0.000216,0.000149,0.000279,-0.000158,2e-06,0.000228,-4.6e-05,0.000207,0.00016,8.1e-05,-4.6e-05,0.000138,0.000188,0.000171,2.6e-05,-6.1e-05,-8.9e-05,7.3e-05,-0.000133,8.1e-05,-0.000118,-5.6e-05,7e-06,-6.6e-05,0.000309,-5.1e-05,-0.000206,2.5e-05,-4.6e-05,0.000288,0.000418,7.2e-05,0.000124,-5e-06,-0.000194,-1.3e-05,-0.000123,-0.000303,-5.5e-05,3.9e-05,0.000121,-0.000164,-0.000122,0.000106,-0.000162,-9.1e-05,2.2e-05,0.000434,-8e-06,-3.7e-05,0.000399,-0.000315,-0.00016,-3.3e-05,8.2e-05,-3e-05,0.000211,-0.000216,-0.000583,-0.000464,0.000249,-0.000185,4.5e-05,-0.000376,-6.7e-05,0.000234,-3.8e-05,0.000237,9.3e-05,0.000355,-0.000397,-8.6e-05,-0.000274,-0.000121,-4.1e-05,0.000199
-1.6e-05,1e-05,7e-06,8e-05,7.6e-05,0.000215,3.1e-05,-6.6e-05,3.5e-05,4.8e-05,4.1e-05,-7.7e-05,7.6e-05,-0.000145,8e-06,-0.000123,-0.00017,3.8e-05,-0.000119,5.3e-05,0.000157,6.2e-05,-0.000228,0.000185,7.8e-05,0.000324,-0.000188,4.8e-05,4.1e-05,0,0.000257,-7.4e-05,-9.8e-05,0.00013,-1.8e-05,-0.000164,2.5e-05,0.000103,0.000103,0.00011,-0.000163,5.9e-05,3.5e-05,-0.00014,-1e-05,-2.1e-05,5.6e-05,-0.000177,2.9e-05,3e-06,-0.000143,-0.000241,-0.000103,-0.00023,-0.000118,0.00014,0.000199,1.5e-05,-0.000222,6.5e-05,-0.000211,1.2e-05,-4.4e-05,0.000244,-0.000285,0.000103,-4e-05,5.1e-05,0.000304,-3e-04,-3.4e-05,0.000317,-9.7e-05,7.3e-05,-0.000433,1.3e-05,-0.000188,6.4e-05,0.000124,1.1e-05,-8.4e-05,5e-06,-0.000151,0.000118,3.9e-05,5.8e-05,-0.000116,7.2e-05,0.000164,-0.000176,3.7e-05,5e-05,-3.7e-05,9.8e-05,-0.000234,-8.5e-05,0.000198,0.00025,5e-05,-5.6e-05,0.000306,-0.000324,-1.3e-05,-0.000179,0.000586,-0.000277,0.000283,-0.00011,0.000168,8.5e-05,-0.000413,-6.7e-05,7.1e-05,-0.000193,-0.000103,2e-04,-0.000333,0.000267,-3.6e-05,-0.000134,0.00015
5e-06,-4.3e-05,-1e-05,-6.3e-05,3e-06,-8.9e-05,-8.9e-05,2.6e-05,-6.9e-05,-6.6e-05,-0.000154,9e-06,3.3e-05,6e-06,1.5e-05,7.7e-05,-0.000154,-0.000247,-6.6e-05,-6e-06,-0.00035,-3.4e-05,0.000272,0.000188,5e-05,-0.000259,7.4e-05,1.4e-05,8e-06,0.000109,-0.000105,-7.9e-05,-4.1e-05,-1e-04,-8e-05,-4.4e-05,-6.7e-05,-0.000194,0.000164,-0.000111,-5.7e-05,-7.5e-05,3.6e-05,0.000183,9.9e-05,-0.000153,-5.4e-05,0.000163,-5.6e-05,-1e-05,2e-06,2e-04,-4.6e-05,5.8e-05,-6.4e-05,-8.1e-05,-6.8e-05,-1e-04,5.1e-05,-6.8e-05,0.000132,-0.00025,0.000107,-0.000229,0.000206,0.000127,-0.000251,-0.000143,-6.9e-05,0.000149,5.1e-05,-0.000301,0.000244,2.4e-05,0.00015,1.9e-05,2.1e-05,4.9e-05,2.4e-05,-0.000138,-8.3e-05,-3.4e-05,-0.000159,-5.9e-05,-0.000132,4.4e-05,0,3.1e-05,-0.000274,5.8e-05,-2e-06,-0.000107,-0.000383,-6.2e-05,7.5e-05,-5.1e-05,-2.9e-05,-2.5e-05,-7e-06,0.000319,-6.8e-05,-6.1e-05,0.000202,0.000248,-0.000309,7.9e-05,-0.000107,2.6e-05,0.000146,-8.9e-05,6.7e-05,-5e-06,-2.7e-05,3.6e-05,-0.000169,-0.00022,4.5e-05,-0.000126,3e-05,-3e-05,3.2e-05
7e-06,1e-05,7e-06,1.6e-05,1e-06,3.1e-05,7.3e-05,-3.6e-05,3.6e-05,-6e-06,5e-05,-5e-05,-6e-06,-4e-06,3.3e-05,4.4e-05,-7.7e-05,8e-05,-3.3e-05,-6.7e-05,3.9e-05,8.6e-05,-5.5e-05,-0.00018,-4.8e-05,0.000194,-0.00011,-2.4e-05,-8.4e-05,-0.000297,-0.000103,0.000206,2e-05,2.8e-05,0.000252,-0.000263,-3.5e-05,0.000221,-0.00018,4.1e-05,0.000158,2.1e-05,-3.6e-05,6.2e-05,2.9e-05,5.5e-05,8e-06,-8.1e-05,-7.7e-05,4.3e-05,-2.7e-05,1.2e-05,4.7e-05,0.000161,5.7e-05,-2.6e-05,9.2e-05,0.000135,-1.7e-05,-8e-05,8.4e-05,0.000222,-0.000186,9.6e-05,-1e-05,-4.2e-05,0.000132,-7.6e-05,-5.7e-05,3.3e-05,-3.1e-05,-0.000239,-0.000235,-0.000199,0.000188,-7e-05,-2e-06,9.9e-05,8.1e-05,1.3e-05,7.2e-05,3.6e-05,0.000233,1.4e-05,5.2e-05,-1e-05,1e-04,2.4e-05,-3.2e-05,3e-05,3.8e-05,5.6e-05,0.00012,-5.4e-05,8.3e-05,1.2e-05,-0.000136,-0.00014,-6.1e-05,-0.000387,-5.4e-05,5.1e-05,-9.5e-05,0.000245,5.1e-05,-8.6e-05,-1e-06,-1.8e-05,-0.000123,8.2e-05,-0.000329,0.000106,-7.5e-05,-5.6e-05,0.000267,0.000199,0.000318,0.000123,0.000101,0.000184,-0.000219
-6e-06,3.2e-05,4e-06,5e-05,-3.6e-05,1e-05,-6.3e-05,1e-05,2.3e-05,9e-06,-0.000113,2.2e-05,1.6e-05,-3.8e-05,-2.4e-05,-9.2e-05,3.5e-05,1.9e-05,1.3e-05,-2.4e-05,-3.4e-05,2.9e-05,0.000143,-4.8e-05,9.6e-05,-0.000121,4.3e-05,0,-2.2e-05,0.00042,0.000245,-5.8e-05,-9.4e-05,8e-06,-0.000251,0.000187,4.6e-05,-4e-06,9e-06,2.4e-05,3.5e-05,-0.000107,6e-06,-3.1e-05,-7.5e-05,6.6e-05,-1e-05,5.6e-05,5.6e-05,-8e-06,2.1e-05,-5.4e-05,-5e-05,-0.000198,-2.9e-05,3.5e-05,-0.000206,-0.000107,0.00018,1e-05,-0.000103,-4.8e-05,0.00025,4e-06,-2.5e-05,6.2e-05,-2.5e-05,7e-06,8.9e-05,-0.000162,1.6e-05,0.000173,0.000165,-4e-06,-0.000243,-5e-06,-8e-06,-0.000196,-1e-04,3.7e-05,2.3e-05,4.4e-05,-0.000253,7e-05,-5.6e-05,-2.3e-05,-3.6e-05,-2.1e-05,0.000165,0.000124,-7e-06,3.4e-05,4.3e-05,-2.7e-05,-0.00013,5.9e-05,0.000183,7.3e-05,5.4e-05,-0.000176,-1.1e-05,-8e-05,-7.5e-05,-9.6e-05,-1.1e-05,8.9e-05,4e-06,-0.000101,0.000117,4.6e-05,0.000374,0.000191,-9.5e-05,-8e-06,1.7e-05,4.9e-05,-0.000123,1e-06,-2.2e-05,9e-06,4.4e-05
3.9e-05,2.7e-05,-2.2e-05,-4.1e-05,-7e-06,-1e-05,-1.2e-05,2.4e-05,-4.9e-05,1e-06,9.4e-05,-8.3e-05,3e-06,5e-06,-2e-05,3.8e-05,-2.6e-05,7e-06,3.7e-05,0.000114,-2.2e-05,-8.7e-05,8.7e-05,-2e-06,-3.3e-05,-4.6e-05,2.1e-05,-2.9e-05,-4e-06,-0.000193,-0.000182,-9.1e-05,7.3e-05,2.7e-05,6.1e-05,1.3e-05,5.8e-05,-4.4e-05,2.6e-05,-6.2e-05,-4.3e-05,0.000138,-4.2e-05,-5e-05,-2.2e-05,-0.000104,2e-05,-5.4e-05,-3.9e-05,-3.1e-05,-5.1e-05,9e-06,6.3e-05,0.000101,1.1e-05,-3e-06,-7.6e-05,6.2e-05,-7.8e-05,2.2e-05,-1.6e-05,6.9e-05,-0.000169,-2.6e-05,-1.3e-05,-2.6e-05,8.9e-05,2.5e-05,-0.000148,0.000128,2e-06,0.000125,-0.000115,0.000102,7.7e-05,7.7e-05,6.1e-05,4.9e-05,-0.000109,6.7e-05,-3.5e-05,-4.8e-05,0.000256,3.3e-05,6e-06,2.8e-05,-3.3e-05,1e-06,-5.2e-05,-1e-04,-1e-05,-4e-05,9.9e-05,9e-06,1.1e-05,-2.6e-05,-0.000257,4.7e-05,-4.7e-05,0.000297,-2.6e-05,-1e-06,-8e-05,-0.000266,-7.3e-05,-2.2e-05,-2.3e-05,6.8e-05,-3.9e-05,-7.9e-05,-2.9e-05,-0.000282,-4.5e-05,8.5e-05,-0.000261,-4e-05,-0.00013,-0.000125,-2.9e-05,-0.00013,0.000114
1.8e-05,3e-06,1.9e-05,2.3e-05,8e-06,-1.7e-05,-3.1e-05,5e-06,1.3e-05,7e-06,-1.2e-05,4e-06,-1.9e-05,0.000106,1.7e-05,-5e-06,5.3e-05,-3.5e-05,-5e-06,-2.9e-05,-6.1e-05,-6e-06,-6.9e-05,-2.8e-05,1.5e-05,0.000154,2e-06,-2e-05,3.9e-05,-8.9e-05,8e-06,7e-06,-3e-05,-6e-05,1.8e-05,-0.000136,-5.4e-05,-6.6e-05,-6.7e-05,5.3e-05,-2.4e-05,-0.000102,3.6e-05,7e-06,4.2e-05,8e-06,4.8e-05,-3e-06,2.9e-05,3.8e-05,6e-05,-2.8e-05,4.9e-05,-5e-06,-5e-05,-1e-06,0.000149,-4.3e-05,-1.2e-05,3.2e-05,0.000125,-7e-05,8.1e-05,-5.6e-05,4.9e-05,-1e-06,-0.000121,0,0.000174,-3e-05,1.5e-05,-0.000168,-5.9e-05,-1.1e-05,6.7e-05,4e-06,1.1e-05,5.4e-05,8.1e-05,-4.9e-05,-7e-06,5e-06,-5.4e-05,5.1e-05,1.9e-05,1e-05,-7.2e-05,-1.5e-05,1.3e-05,6.5e-05,-2.3e-05,4e-06,6.5e-05,1.9e-05,4.2e-05,-6.2e-05,6.7e-05,-0.000109,6.3e-05,-5e-06,-3.2e-05,3.1e-05,5.5e-05,0.00022,0.000231,-1e-05,4.2e-05,-2.7e-05,3.2e-05,6.6e-05,6.5e-05,-6.5e-05,0.000275,-3.8e-05,0.000215,-8.1e-05,0.000178,0.000119,-9e-06,1.7e-05,-0.000102
-2.8e-05,-1.1e-05,-1.2e-05,-2e-05,2e-06,3e-06,3.8e-05,-1.9e-05,2.2e-05,3e-06,0.000112,-8.7e-05,2.7e-05,2.1e-05,2.6e-05,-4.8e-05,-7.7e-05,1.9e-05,3.1e-05,-5.1e-05,-6.3e-05,-5e-06,-0.000107,2.3e-05,1.5e-05,-0.000178,-2.3e-05,2.2e-05,-3e-06,8.6e-05,1e-04,2.3e-05,4.3e-05,3.4e-05,4.3e-05,3.2e-05,0.000146,-1e-05,1e-04,2e-06,3.1e-05,6.3e-05,1.2e-05,7.9e-05,-1.8e-05,8.2e-05,-7.9e-05,-0.000108,2.7e-05,3.9e-05,-5.6e-05,5e-05,-1.8e-05,-1.1e-05,8.8e-05,2.2e-05,7.2e-05,-1.5e-05,-6.5e-05,-6.8e-05,-7.9e-05,-0.000138,-4e-06,5.9e-05,-1.4e-05,-2.2e-05,-3.5e-05,2.6e-05,-3.1e-05,-4.7e-05,1.2e-05,0.000146,0.000116,-2.3e-05,-4.5e-05,-2.9e-05,7e-06,-5.5e-05,5.9e-05,-5e-06,2.7e-05,-3.4e-05,0.000133,-4e-06,-6e-05,-4.9e-05,6e-05,0,2e-06,-6.8e-05,-1.1e-05,1.7e-05,-8.9e-05,5e-06,4.4e-05,2.8e-05,8.5e-05,7.1e-05,-4.5e-05,-4.8e-05,2.6e-05,0.000109,8.8e-05,9.3e-05,-0.000256,-1.6e-05,3.5e-05,1.9e-05,-2.6e-05,2.9e-05,-9e-06,5.5e-05,-0.000147,2.6e-05,-8e-06,8e-05,-2e-06,-8.1e-05,-3.6e-05,6.2e-05,0.000171
-1.1e-05,3e-06,-1e-06,-1e-05,-3e-06,-2.4e-05,1.5e-05,-1.1e-05,-5e-06,-1.4e-05,-3.9e-05,1e-06,-8e-06,3.2e-05,-2.6e-05,2.1e-05,-4.3e-05,1.7e-05,-8.8e-05,-1.1e-05,4e-06,-3e-06,-1.8e-05,1e-05,-5.3e-05,7.8e-05,2e-06,-1.8e-05,1e-06,-0.000139,-9.9e-05,-1.1e-05,-5.8e-05,4e-06,-0.000103,-8e-06,-9.1e-05,7.6e-05,-2.1e-05,-4.2e-05,3.5e-05,-6.6e-05,2.2e-05,-2.9e-05,7e-06,-0.000137,1.3e-05,8.6e-05,-3e-05,1.5e-05,2.4e-05,-1.7e-05,-9e-06,-2.3e-05,-4.4e-05,2e-05,-8.8e-05,6e-06,0,3e-05,-5.1e-05,5.1e-05,-4.8e-05,-2e-05,-2.4e-05,4.8e-05,-5.1e-05,3e-05,-0.000102,2.4e-05,-2.4e-05,4e-06,-0.000147,5e-05,-3.5e-05,-5.3e-05,-3.7e-05,3.3e-05,-9e-06,-1e-05,-9e-06,3.2e-05,-0.000139,2.7e-05,2e-05,1.3e-05,2.9e-05,-3e-05,-8.2e-05,9e-06,-2e-06,-2e-06,-0.000148,-2.7e-05,4.6e-05,-2.1e-05,-8.8e-05,7.8e-05,2.2e-05,2.4e-05,-8e-06,-8.5e-05,1.3e-05,-7.7e-05,0.000156,3e-05,-4.6e-05,3.4e-05,-3.4e-05,-1.4e-05,-0.000202,9.9e-05,-4.5e-05,-1.3e-05,-5.9e-05,-3.6e-05,-0.000163,9.5e-05,-2e-06,2e-06,-0.000209
0,1.6e-05,2e-06,4.4e-05,-7e-06,-2e-06,-5.2e-05,2.8e-05,-2.1e-05,0,1.6e-05,-5.4e-05,-2e-06,-6e-06,1e-06,2.7e-05,1.7e-05,-7e-06,-2.8e-05,1.6e-05,-4.7e-05,-4.2e-05,-1.4e-05,2.7e-05,-1.5e-05,8.5e-05,1.7e-05,1.3e-05,1e-05,0.000145,5e-05,2.8e-05,2.3e-05,2e-06,8.9e-05,0.000159,2.5e-05,1.4e-05,-3.3e-05,4.1e-05,1.5e-05,8.3e-05,1e-06,-7.3e-05,-1.3e-05,9.7e-05,3.5e-05,5e-05,3e-05,2.2e-05,-6e-06,-3.4e-05,-1.7e-05,2.2e-05,-3e-06,-1.1e-05,-4.8e-05,-1.1e-05,-1.4e-05,-2.9e-05,6.5e-05,-2.4e-05,5.9e-05,2.6e-05,-1.7e-05,-3.5e-05,7.1e-05,6e-06,8.2e-05,2e-06,1e-06,0.000122,0.000141,5.4e-05,6.4e-05,7e-06,-3.4e-05,6.4e-05,-1.5e-05,6.4e-05,8e-06,2e-06,-7e-06,-3.6e-05,2.7e-05,3.3e-05,2.4e-05,1e-05,7.5e-05,-1.2e-05,-4e-06,-2.3e-05,6.6e-05,-7e-06,-0.000116,3.3e-05,8.8e-05,-0.000118,5e-06,-2.8e-05,4.3e-05,3e-06,-7.8e-05,-0.000149,-3e-06,1.6e-05,1.3e-05,-2.4e-05,1.7e-05,-4e-05,6.3e-05,-4.5e-05,7.1e-05,2.7e-05,-1.2e-05,-1.6e-05,3.8e-05,-7.8e-05,2.4e-05,-1.5e-05,8.4e-05
-1.1e-05,4e-06,1e-06,-4.4e-05,1.8e-05,1.4e-05,3.9e-05,-4e-06,1e-05,1.6e-05,-5.5e-05,-6e-06,-1e-06,-7.5e-05,1e-05,-6e-06,-3.2e-05,3e-06,-6e-06,5.7e-05,-2.7e-05,8.3e-05,0.000108,2.6e-05,-3.2e-05,-0.000131,-8e-06,9e-06,-1.2e-05,-0.000175,1.1e-05,-9e-06,-1.4e-05,-1.6e-05,8e-06,-4.9e-05,-1.6e-05,-0.000115,1.1e-05,-1.8e-05,-5e-05,-4.2e-05,-1e-05,1.4e-05,-2.3e-05,4.2e-05,-1e-05,3.5e-05,-1e-06,-1.6e-05,8e-06,3.4e-05,-3.4e-05,2.6e-05,-1.2e-05,-3.6e-05,4.3e-05,7e-06,0.000107,3.1e-05,-1e-05,7.8e-05,-6.6e-05,-3e-05,3.4e-05,1.6e-05,-7e-06,-2.7e-05,8e-06,-3.2e-05,-1e-06,-0.000221,-0.000107,-4.3e-05,-3.1e-05,3.2e-05,2.2e-05,-0.000146,-6.2e-05,-5.1e-05,5e-06,1e-05,2.2e-05,2e-05,-3e-05,2e-06,-3e-06,1.4e-05,7e-05,5.9e-05,1e-06,2.1e-05,1.7e-05,0,1.9e-05,-6e-06,-2.4e-05,4.7e-05,-8e-06,-3.4e-05,-8e-06,5e-06,-7e-06,0.000104,-3.5e-05,-6.1e-05,-7e-06,1.7e-05,6e-06,5e-05,-2.3e-05,3.2e-05,-1.7e-05,-1.6e-05,4.5e-05,6.2e-05,9.9e-05,2.4e-05,1.4e-05,1.1e-05,8e-06
-7e-06,-1.7e-05,0,1.6e-05,-6e-06,8e-06,1e-05,2e-06,1.7e-05,-9e-06,1.2e-05,-2.6e-05,-5e-06,-5.4e-05,3e-06,-1.4e-05,1.3e-05,-1.1e-05,2.8e-05,-4.7e-05,-4.3e-05,-2.2e-05,3e-06,-1e-05,-4.7e-05,0.000109,1.6e-05,-8e-06,-1e-05,3.6e-05,-6.9e-05,-1e-06,-9e-06,1e-06,-5.3e-05,2.1e-05,-3.7e-05,7.5e-05,-3.9e-05,-1.7e-05,1.2e-05,-5e-06,-1.8e-05,4.9e-05,3.2e-05,-0.000129,-1.6e-05,-5.8e-05,-3e-06,-1e-06,-2.8e-05,6e-06,2e-05,-7.3e-05,5e-05,1.5e-05,1.1e-05,4e-06,-6.3e-05,-4.1e-05,-2.3e-05,-4e-05,7.2e-05,1e-06,-7e-06,0,6e-05,-2.6e-05,-5.2e-05,4.4e-05,1.5e-05,6.4e-05,3.5e-05,-6.9e-05,3e-06,-1e-05,6e-06,5.2e-05,1.7e-05,2.7e-05,1e-06,-1.2e-05,-8.4e-05,-3.6e-05,1.3e-05,-1.1e-05,-1.3e-05,-1e-06,-8.9e-05,-5e-06,-2e-06,-4e-06,-1.4e-05,8e-06,4.4e-05,5.4e-05,-2e-06,5.5e-05,9e-06,0.000216,-2e-06,-4.3e-05,1e-06,0.000125,6.1e-05,0.000102,2e-05,-1.3e-05,4.8e-05,-2e-05,0.00012,-4.8e-05,-1.9e-05,-6e-06,1.1e-05,-6.3e-05,-0.000102,1.5e-05,4e-06,-1.6e-05,2.7e-05
1.9e-05,-1e-05,1e-06,8e-06,1.4e-05,-1.6e-05,-3.5e-05,-1.6e-05,-1.6e-05,-3e-06,-3.3e-05,0,-3e-06,1.6e-05,-2e-06,2.6e-05,1e-05,-2e-06,3e-05,-2.8e-05,-1e-05,2.5e-05,-2.4e-05,4.1e-05,1.8e-05,-6.6e-05,-3e-06,0,-1e-06,-2e-05,9.5e-05,-3.8e-05,1.3e-05,2.1e-05,9e-06,9e-06,4.7e-05,3.6e-05,5.9e-05,3.7e-05,3.8e-05,2.5e-05,1e-05,-1.4e-05,-6e-06,8.7e-05,-1.1e-05,8e-06,2.4e-05,-3e-05,3.1e-05,-2.7e-05,2.4e-05,6e-05,-4.9e-05,-1.1e-05,-6e-06,-1.7e-05,-2.6e-05,1.3e-05,-1.1e-05,1e-05,-9.8e-05,3.4e-05,-1.2e-05,1.1e-05,-6.1e-05,-2e-06,2.5e-05,-1e-06,-9e-06,1.3e-05,1.1e-05,6.6e-05,-1.8e-05,-1.9e-05,1.8e-05,2.6e-05,7.8e-05,-2.2e-05,-9e-06,-1.1e-05,3.6e-05,0,1.7e-05,-1.6e-05,-1.3e-05,8e-06,-1e-05,-1.7e-05,4e-06,-7e-06,0.000142,1.3e-05,-5.4e-05,-4.6e-05,3.8e-05,-8.1e-05,-1e-06,-7.8e-05,-2.8e-05,2.7e-05,3e-05,-0.000106,-0.000121,-6.8e-05,-1.1e-05,4e-06,-1.9e-05,-1.6e-05,2.1e-05,-2.9e-05,-2.1e-05,2e-05,-9.9e-05,-2e-06,-2.3e-05,-4.8e-05,1e-06,-1.1e-05,-4e-06
9e-06,-7e-06,-4e-06,-2.5e-05,-1.1e-05,3.6e-05,2.7e-05,1.1e-05,-4e-06,6e-06,2.4e-05,-1.2e-05,5e-06,2.3e-05,-1e-05,-2.6e-05,-2e-06,-3e-06,-1.8e-05,5.2e-05,-4.5e-05,-3.3e-05,4.7e-05,1e-05,-2.1e-05,-2.9e-05,1.7e-05,-5e-06,1.2e-05,-3e-06,-5.2e-05,1.7e-05,7e-06,-4e-06,3.4e-05,2e-05,-3e-05,-1e-06,1.5e-05,-2.7e-05,-8e-06,-2.9e-05,-6e-06,-3.1e-05,-4e-06,1.4e-05,3e-05,-5.3e-05,-1.2e-05,-1.2e-05,-2.2e-05,1.4e-05,-2.5e-05,3.3e-05,-5e-06,1.2e-05,-3e-06,1e-05,9e-06,-3e-05,4.7e-05,-6.1e-05,8.8e-05,-4.8e-05,4e-06,-2.2e-05,8e-06,1.9e-05,4e-05,-1.8e-05,0,-5.7e-05,-6.3e-05,-9e-06,3e-05,-9e-06,-5e-06,-4.6e-05,-3e-06,1.1e-05,-8e-06,1.1e-05,-4.2e-05,-3.4e-05,-4.1e-05,1e-05,2.8e-05,0,5.2e-05,-2.8e-05,-1e-06,6e-06,-7.4e-05,1.4e-05,-7e-06,6e-06,-8.1e-05,3.5e-05,-1e-06,-9e-05,-4e-06,-2e-05,9e-06,-6.2e-05,0.000129,1.9e-05,-6e-06,6e-06,9e-06,5e-06,-7.9e-05,2.6e-05,7.8e-05,-2.3e-05,5.4e-05,1.8e-05,0.000115,6.5e-05,1e-06,1.5e-05,-3e-05
-5e-06,-1e-06,5e-06,3.2e-05,-2e-06,-2.4e-05,-4e-06,-2e-06,1.3e-05,-1e-06,-9e-06,6e-06,-3e-06,9e-06,1.1e-05,-2.5e-05,-1.4e-05,2e-06,-2.7e-05,-2.5e-05,-1.7e-05,2.7e-05,-1.9e-05,-2.4e-05,1.1e-05,6.7e-05,-3.1e-05,-2e-06,7e-06,8.2e-05,-2.9e-05,5.8e-05,-1.6e-05,-9e-06,-1.3e-05,8.2e-05,-4e-06,-4.2e-05,-6.3e-05,6e-06,-2e-05,5.3e-05,1e-06,0,7e-06,-7.7e-05,-4e-06,2.1e-05,0,5e-06,5e-06,1e-06,1.4e-05,-7.7e-05,2.3e-05,-2e-06,-3.9e-05,5e-06,-5.3e-05,2.3e-05,-1.4e-05,1.5e-05,-4.6e-05,2.8e-05,-1.6e-05,1.2e-05,-2.3e-05,1e-05,-5.5e-05,1e-05,0,-5e-06,8.6e-05,-2.2e-05,-4e-06,2.1e-05,-2.7e-05,6.5e-05,-3.8e-05,-4e-06,7e-06,-8e-06,0.000106,1.7e-05,3.5e-05,1e-06,-4e-06,-8e-06,-2e-05,2.1e-05,1e-06,-6e-06,-9.4e-05,-7e-06,-8e-06,-4.5e-05,6.6e-05,2.7e-05,3e-06,2.5e-05,-4e-06,3.1e-05,-2.9e-05,2.5e-05,-6.5e-05,-7e-06,3e-06,-2.3e-05,-1.3e-05,8e-06,-1.3e-05,3.8e-05,-6.3e-05,3.6e-05,4.2e-05,3.4e-05,-1.6e-05,-6.4e-05,-4e-06,9e-06,5e-06
2e-06,-5e-06,-3e-06,-2.5e-05,0,1.2e-05,7e-06,6e-06,-4e-06,-4e-06,2.5e-05,-3e-06,-2e-06,2.6e-05,0,3e-05,2.8e-05,-9e-06,-3.1e-05,-2e-06,-2.4e-05,-5.1e-05,-4.5e-05,1.5e-05,1.8e-05,-7e-05,2.3e-05,-1e-05,-7e-06,-0.000154,8.2e-05,-5e-05,2.1e-05,-3e-06,-4.1e-05,-9.1e-05,-1.5e-05,-4e-05,2.5e-05,1.7e-05,4e-06,-6.3e-05,1e-06,3.6e-05,-1.1e-05,8e-05,-1.8e-05,1.1e-05,5e-06,-6e-06,0,-1.1e-05,-1.6e-05,4.3e-05,9e-06,1.4e-05,6e-06,-8e-06,7.1e-05,-1.7e-05,-3.3e-05,2.6e-05,-1e-05,-2.5e-05,2e-05,-6e-06,5.1e-05,-1.3e-05,3.4e-05,0,0,3e-05,-8e-05,-2.6e-05,-3.1e-05,1.8e-05,3e-06,4e-06,-2.2e-05,1e-05,4e-06,1.8e-05,-4.4e-05,-2.1e-05,-2e-06,-1.3e-05,-6e-06,-5e-06,1.6e-05,-5e-06,-4e-06,8e-06,5.4e-05,-1e-05,5.1e-05,2.9e-05,1e-05,-4.4e-05,-2e-06,7.3e-05,2.4e-05,-1.5e-05,-1.1e-05,0.000132,-1.4e-05,1.5e-05,6e-06,1.4e-05,-2e-05,-1.9e-05,-5.8e-05,-4e-06,1.8e-05,-2.2e-05,-8.3e-05,-5.4e-05,-7.4e-05,4.5e-05,2e-06,-1.5e-05,9e-06
0,-5e-06,0,5e-06,-2e-06,-1.5e-05,-8e-06,-7e-06,-8e-06,2e-06,-2e-06,5e-06,4e-06,1.2e-05,1e-06,1e-06,0,0,8e-06,5e-06,-3.4e-05,2.2e-05,-2e-05,-9e-06,-2e-06,5.8e-05,-2e-05,7e-06,-4e-06,0.00012,-7.2e-05,-2.5e-05,-1.8e-05,2.6e-05,6.8e-05,6e-06,-1e-05,5.3e-05,-1.5e-05,-2.3e-05,1.2e-05,4e-05,2e-06,7e-06,7e-06,-2.5e-05,6e-06,1.2e-05,-1.4e-05,-7e-06,0,1.5e-05,-2.1e-05,1.5e-05,-3.1e-05,-3e-06,3.4e-05,1.4e-05,4e-06,9e-06,3.3e-05,1.2e-05,3.3e-05,1.6e-05,-9e-06,-9e-06,2e-05,-1.5e-05,-1.8e-05,-1.5e-05,-3e-06,6e-05,6.7e-05,6e-05,3.4e-05,-1.3e-05,1e-06,-5.2e-05,5e-06,-1.1e-05,-2e-06,-1.4e-05,3.3e-05,1.6e-05,-2.3e-05,1e-06,-1.5e-05,4e-06,-1.1e-05,2.2e-05,1e-06,-7e-06,-1.6e-05,1e-06,1.3e-05,-1.2e-05,-2.1e-05,1.1e-05,-2e-06,-4.4e-05,-1e-06,2.4e-05,1.4e-05,-6.4e-05,3.8e-05,-4.9e-05,5e-06,2e-06,2e-05,9e-06,8.5e-05,-2.2e-05,2.4e-05,7e-06,3.3e-05,6.4e-05,4.3e-05,-2.9e-05,2e-06,-4e-06,1.6e-05
-1.1e-05,2e-06,0,1.9e-05,2e-06,7e-06,-3e-06,-1e-06,6e-06,2e-06,1.1e-05,2e-06,-5e-06,-8e-06,-1.1e-05,-5e-06,1.5e-05,0,1.4e-05,-6e-06,-2.2e-05,-2.4e-05,-2.3e-05,-2e-06,2.1e-05,-2e-06,1.7e-05,-7e-06,-3e-06,-4.6e-05,2.2e-05,5.2e-05,2e-06,-1.6e-05,-4.8e-05,-1.9e-05,-5e-06,2.4e-05,1.8e-05,1.4e-05,2e-06,-2.8e-05,4e-06,-3.6e-05,4e-06,-5.4e-05,4e-06,6e-06,3e-06,-1e-06,-1.2e-05,-9e-06,3.5e-05,-3.5e-05,5e-06,-6e-06,7e-06,-1.2e-05,-1.6e-05,-1.9e-05,1e-06,3.4e-05,-3.9e-05,-1.2e-05,1e-06,1e-06,0,-3e-06,-1.4e-05,3.7e-05,-5e-06,-2.7e-05,-3.5e-05,-1.8e-05,-8e-06,-7e-06,1.5e-05,3.4e-05,3.9e-05,1.7e-05,-2e-06,1e-06,-2.9e-05,-5e-06,3.6e-05,1.6e-05,-2.2e-05,-1e-06,-4e-05,-1.2e-05,1e-06,2e-06,1.4e-05,8e-06,-5.9e-05,3.7e-05,1.3e-05,2.4e-05,1e-06,8e-06,1e-05,1e-05,8e-06,-9.9e-05,-3.7e-05,5.9e-05,7e-06,-2e-06,-1.3e-05,5e-06,2.1e-05,-2.2e-05,-3.8e-05,-3e-06,3.4e-05,-5.2e-05,2.8e-05,7e-06,0,8e-06,-4.6e-05
-4e-06,1.1e-05,0,-2.8e-05,-5e-06,-1.3e-05,2.3e-05,2e-06,4e-06,-2e-06,-1.3e-05,7e-06,0,-1.4e-05,1.1e-05,1.4e-05,-3e-06,1e-06,4e-06,2.2e-05,-2.2e-05,3.7e-05,5.4e-05,1.8e-05,0,-4.8e-05,-1.2e-05,2e-06,1e-06,-1.3e-05,3e-05,-3.1e-05,-2e-06,-1.2e-05,2.4e-05,1.1e-05,3.1e-05,-5.7e-05,2.8e-05,2e-06,-5e-06,3.3e-05,-1e-06,3e-06,-2e-06,7.5e-05,1.4e-05,1.7e-05,2e-06,0,2e-05,-2e-06,-1e-06,1.3e-05,2.8e-05,-2e-06,-2.2e-05,1.2e-05,-1.5e-05,7e-06,-2e-05,-6.2e-05,4.6e-05,1e-06,-5e-06,5e-06,-2.8e-05,5e-06,4e-05,-2.8e-05,8e-06,-3.2e-05,1e-06,-2.8e-05,-1.9e-05,1e-06,-1e-06,-2.6e-05,2.3e-05,-2e-05,-3e-06,-2e-06,5e-06,1.5e-05,-1.8e-05,1e-06,8e-06,2e-06,3.4e-05,1e-06,3e-06,2e-06,3.9e-05,7e-06,2.8e-05,3e-06,-5e-05,-2.6e-05,-1e-06,-5.3e-05,-9e-06,-3.8e-05,8e-06,4e-05,4.9e-05,-4.4e-05,-7e-06,-2e-06,1.8e-05,-5e-06,-1.3e-05,6e-06,1.3e-05,-5e-06,-3.4e-05,1.5e-05,-6.2e-05,1.6e-05,-1e-06,-1e-06,4.5e-05
7e-06,6e-06,1e-06,2e-05,5e-06,9e-06,-2.6e-05,3e-06,-6e-06,0,-3e-06,1e-05,6e-06,-5e-06,2e-06,-1e-06,1e-06,0,-3e-06,-2.4e-05,-2.1e-05,-1.6e-05,3.8e-05,-9e-06,-1.5e-05,6e-05,1.2e-05,1e-06,1e-06,3.9e-05,-5.8e-05,-1.3e-05,-1e-06,1.3e-05,-3.4e-05,-9e-06,-1.4e-05,2.3e-05,-4.7e-05,-1.5e-05,-1e-05,-3.2e-05,2e-06,2.8e-05,-1e-06,-1.3e-05,-2e-05,-1e-05,-1e-05,3e-06,-1.1e-05,8e-06,3e-06,1.5e-05,-1.5e-05,0,-2.2e-05,-8e-06,-1e-05,-8e-06,-5e-06,3e-05,-4.3e-05,1.5e-05,1.1e-05,-1.3e-05,-1.5e-05,6e-06,-2.1e-05,1e-06,4e-06,6.5e-05,3.5e-05,1.2e-05,2.1e-05,1.2e-05,-9e-06,-7e-06,-3.9e-05,6e-06,0,-1e-06,-2.9e-05,-8e-06,-1.4e-05,-1.3e-05,1.5e-05,1e-06,2.2e-05,-1.4e-05,-1e-06,-2e-06,-3.1e-05,-4e-06,4e-06,-6e-06,3.4e-05,-2e-06,0,-2.8e-05,-1e-05,1.5e-05,-1.2e-05,9.8e-05,-5.3e-05,1.2e-05,3e-06,-1e-06,3e-06,-3e-06,-7e-06,3.6e-05,0,1.2e-05,1e-06,-2.2e-05,-1e-06,-3.1e-05,1e-06,-2e-06,-3.4e-05
-1e-06,1e-06,0,-7e-06,-2e-06,-5e-06,-2e-06,-1e-06,-1e-06,1e-06,-1.1e-05,1e-06,-6e-06,-2.6e-05,-7e-06,-2e-05,-1e-06,1e-06,-1.2e-05,-5e-06,-2.8e-05,2.6e-05,-2.3e-05,1.3e-05,-3e-06,-3.8e-05,-1.1e-05,2e-06,4e-06,-9.6e-05,5.5e-05,4.6e-05,2e-06,1.1e-05,6e-05,-7.2e-05,2.7e-05,1.1e-05,7e-06,1.5e-05,8e-06,1.2e-05,-3e-06,-4e-06,-3e-06,-5.5e-05,-6e-06,-3.9e-05,6e-06,6e-06,-1e-06,-8e-06,1.1e-05,-1.5e-05,-1.7e-05,-1e-06,3e-06,0,-1.3e-05,0,2.3e-05,-2.4e-05,4.3e-05,-1.5e-05,-3e-06,1e-06,0,3e-06,-2e-05,1.3e-05,-2e-06,-5.8e-05,-5.7e-05,3.6e-05,1e-06,0,3e-06,4.4e-05,-3e-05,-1.1e-05,1e-06,7e-06,-2.1e-05,1.9e-05,3e-05,-5e-06,-8e-06,4e-06,-4.2e-05,5e-06,1e-06,1e-06,-2e-05,-6e-06,-9e-06,-2.1e-05,6e-06,2.7e-05,-1e-06,5.8e-05,-4e-06,-1.2e-05,-1.1e-05,-1.5e-05,1.4e-05,1.8e-05,2e-06,9e-06,-7e-06,9e-06,-4.5e-05,0,2.4e-05,-1.8e-05,1.9e-05,5.2e-05,5.4e-05,4e-05,0,2e-06,3.4e-05
1e-06,3e-06,0,-7e-06,4e-06,4e-06,1.6e-05,-4e-06,4e-06,-1e-06,4e-06,9e-06,2e-06,-3e-06,-2e-06,-5e-06,5e-06,0,-1e-05,2.4e-05,-2.1e-05,-1.4e-05,-8e-06,1.5e-05,-2.4e-05,-2.1e-05,1e-06,-1e-06,2e-06,7.7e-05,-1.8e-05,-1.6e-05,0,-1.6e-05,-6.8e-05,2.4e-05,-8e-06,2e-05,9e-06,-6e-06,1.2e-05,1e-06,-3e-06,-1.9e-05,0,5.7e-05,2.6e-05,-2e-06,-3e-06,1.1e-05,7e-06,5e-06,-2.6e-05,-2.1e-05,9e-06,0,4e-06,1e-06,5.2e-05,-1e-05,-5e-06,3.6e-05,-4.1e-05,-2e-06,-5e-06,4e-06,2.1e-05,1e-06,2.8e-05,-2.1e-05,-7e-06,1.4e-05,6.6e-05,-2.8e-05,-2.2e-05,-9e-06,-5e-06,-2.7e-05,2.1e-05,1.2e-05,2e-06,-4e-06,2.7e-05,-6e-06,-2.2e-05,6e-06,1e-06,-4e-06,2e-06,8e-06,-1e-06,-1e-06,2.7e-05,-1e-06,-7e-06,-1.6e-05,-2.2e-05,-2.2e-05,0,1.7e-05,3e-06,1.6e-05,5e-06,-0.000113,2e-05,-1.7e-05,-3e-06,-8e-06,6e-06,-3e-06,3.4e-05,-2.4e-05,-3.1e-05,1.2e-05,5e-06,-7.1e-05,-1.4e-05,-4.3e-05,-2e-06,-1e-06,-1.2e-05
5e-06,3e-06,1e-06,2e-05,0,7e-06,-1.8e-05,3e-06,0,1e-06,2e-06,1e-06,1e-06,2.2e-05,1.3e-05,1.2e-05,-1e-06,3e-06,-1.4e-05,-9e-06,-2.4e-05,9e-06,-3e-06,-1e-06,-1e-05,7.5e-05,-7e-06,1e-06,-2e-06,-7.8e-05,-3.1e-05,-3.4e-05,1e-06,-6e-06,5.6e-05,-2.3e-05,-8e-06,-1.2e-05,-6e-06,-5e-06,-9e-06,-2e-06,1e-06,-7e-06,4e-06,-7e-06,-1.1e-05,7e-06,-5e-06,6e-06,-4e-06,-1e-06,-1e-06,2.6e-05,2.3e-05,2e-06,1e-05,-6e-06,-1.6e-05,0,-1.9e-05,7e-06,2.7e-05,1.9e-05,-2e-06,-7e-06,8e-06,2e-06,-5e-06,2.4e-05,1e-06,-3.9e-05,-5.6e-05,-2.2e-05,2.3e-05,-5e-06,3e-06,-2e-06,3e-05,4e-06,2e-06,2e-06,6e-06,9e-06,-1e-06,2e-06,-1e-06,-2e-06,1.5e-05,1e-06,2e-06,2e-06,-1.3e-05,-1e-06,-2e-05,1.2e-05,2.5e-05,-3e-06,-1e-06,-6.1e-05,1e-06,-1.4e-05,8e-06,3.1e-05,-2.4e-05,5e-06,-2e-06,-1e-06,-1.1e-05,-1e-06,-7e-06,-6e-06,1.7e-05,-6e-06,-1.4e-05,6.5e-05,-3.6e-05,3.7e-05,-1e-06,-1e-06,-8e-06
-1e-06,2e-06,0,-2.2e-05,1e-06,-1e-06,1.3e-05,0,-3e-06,1e-06,5e-06,9e-06,-6e-06,1.4e-05,-9e-06,0,2e-06,0,6e-06,-6e-06,-1.6e-05,-3.1e-05,-1.1e-05,7e-06,-7e-06,-8.4e-05,6e-06,1e-06,-4e-06,4.1e-05,5.9e-05,1.9e-05,-5e-06,1.6e-05,-4.6e-05,3.5e-05,1.8e-05,-4.7e-05,3.2e-05,1.1e-05,-1.1e-05,5e-06,0,2.3e-05,-1e-06,-4.6e-05,-6e-06,2.5e-05,9e-06,0,-2e-06,-4e-06,1.3e-05,1e-06,-2.7e-05,1e-06,4e-06,4e-06,1.4e-05,-4e-06,1.4e-05,-1.1e-05,5e-06,-1.9e-05,1.3e-05,-1e-06,-6e-06,-1e-06,-2.3e-05,-6e-06,6e-06,4.3e-05,3.5e-05,2.6e-05,-4e-06,1e-06,-3e-06,3.1e-05,1.1e-05,1e-06,-2e-06,-4e-06,2.3e-05,-1e-05,2.6e-05,-6e-06,-4e-06,-1e-06,-3e-06,0,-1e-06,-3e-06,-1.6e-05,-2e-06,5e-05,-1e-06,-3.4e-05,1.9e-05,0,-3.1e-05,8e-06,5e-06,4e-06,9e-05,2.2e-05,8e-06,-2e-06,4e-06,2e-06,0,1.8e-05,1.1e-05,0,7e-06,-6e-06,-3.6e-05,3e-05,-1.6e-05,-3e-06,2e-06,4e-06
-5e-06,-1e-06,0,1.1e-05,0,-1e-06,-8e-06,1e-06,1e-06,-1e-06,3e-06,-3e-06,5e-06,7e-06,-4e-06,4e-06,0,0,1.5e-05,0,-2.7e-05,1.2e-05,-2e-06,-2e-06,-8e-06,5.7e-05,3e-06,-1e-06,-3e-06,-2.2e-05,-4.6e-05,2.2e-05,3e-06,-1e-06,5e-05,-5e-06,-1.2e-05,1.9e-05,-3.2e-05,-9e-06,1e-05,-2.1e-05,-2e-06,1e-06,-1e-06,6.7e-05,-2e-06,0,-6e-06,-2e-06,8e-06,1e-05,-4e-06,-3e-05,-3e-06,-2e-06,-1.5e-05,-3e-06,-3.4e-05,-2e-06,1.3e-05,-7e-06,-2.6e-05,-3e-06,-4e-06,9e-06,-1.9e-05,-4e-06,2.7e-05,-9e-06,1e-06,-4e-06,-1e-06,1.9e-05,-1.5e-05,4e-06,2e-06,-5.6e-05,-2.1e-05,-7e-06,-2e-06,2e-06,-8e-06,9e-06,-3.1e-05,2e-06,1.1e-05,3e-06,1.1e-05,-6e-06,1e-06,2e-06,3.8e-05,2e-06,-6e-06,3.2e-05,1.8e-05,-2e-05,-1e-06,6.2e-05,0,1.3e-05,-5e-06,-1e-05,-1.7e-05,-1e-05,-1e-06,0,-1e-06,2e-06,-5e-06,-5e-06,-1.7e-05,-1e-06,3.4e-05,2.2e-05,2.3e-05,-6e-06,-2e-06,2e-06,-1.5e-05
3e-06,-5e-06,0,4e-06,-1e-06,2e-06,-2e-06,-3e-06,1e-06,-1e-06,0,4e-06,-1e-06,0,5e-06,9e-06,-6e-06,0,2e-06,6e-06,-2.1e-05,-1.6e-05,-1.9e-05,3e-06,2e-06,-2e-06,1e-06,0,0,-4e-05,3e-06,-1.7e-05,-4e-06,-1.1e-05,-6e-05,-2.7e-05,9e-06,2.7e-05,-1.3e-05,1e-06,5e-06,3.5e-05,1e-06,-2.1e-05,-2e-06,-3.2e-05,1e-05,1.9e-05,2e-06,-4e-06,-4e-06,-6e-06,9e-06,2.5e-05,1.7e-05,2e-06,-5e-06,3e-06,2e-06,-3e-06,-1.8e-05,-3.2e-05,3e-05,1.7e-05,-8e-06,-4e-06,-1.4e-05,-1e-06,-3e-06,2e-06,-3e-06,-2.1e-05,-2.9e-05,-3.5e-05,1.3e-05,1e-06,5e-06,2e-05,-3e-05,9e-06,-1e-06,0,2.5e-05,-1.4e-05,7e-06,9e-06,5e-06,-2e-06,-1.8e-05,-4e-06,-1e-06,0,-1.7e-05,2e-06,-2.7e-05,-1.1e-05,1.1e-05,5e-06,1e-06,1.3e-05,1e-06,-1e-05,-7e-06,-8.8e-05,1e-05,0,3e-06,-4e-06,-1e-06,-5e-06,-1.1e-05,2.1e-05,2.3e-05,-6e-06,-2.7e-05,-3e-05,-4e-05,2.4e-05,0,-2e-06,2.3e-05
1e-06,-4e-06,0,-1.6e-05,1e-06,-1e-06,1.4e-05,2e-06,-1e-06,1e-06,-2e-06,-5e-06,-5e-06,-5e-06,7e-06,-6e-06,-2e-06,2e-06,-7e-06,3e-06,-1.7e-05,1.9e-05,7e-06,8e-06,1.3e-05,-4.7e-05,-1e-06,2e-06,2e-06,7.8e-05,3.8e-05,-8e-06,1e-06,-2e-06,6.4e-05,4.8e-05,-8e-06,-1.9e-05,2.7e-05,7e-06,-5e-06,-3.2e-05,0,3e-06,0,-4.1e-05,8e-06,-2.6e-05,7e-06,-2e-06,-4e-06,-5e-06,1e-06,1.1e-05,1e-05,-1e-06,6e-06,0,0,-4e-06,-8e-06,3.2e-05,-3.6e-05,-1.9e-05,-1e-06,-1e-06,1.3e-05,5e-06,-2.1e-05,2e-06,-1e-06,2.2e-05,5.2e-05,-1e-06,4e-06,-1e-06,-5e-06,3.1e-05,9e-06,-1.1e-05,1e-06,0,-2.3e-05,6e-06,2.1e-05,-1e-06,-7e-06,2e-06,-5e-06,3e-06,1e-06,0,-2.1e-05,-2e-06,1.5e-05,1.1e-05,-2.5e-05,1e-05,-1e-06,3e-06,-2e-06,9e-06,2e-06,-2e-06,7e-06,2.6e-05,1e-06,-2e-06,5e-06,3e-06,1.6e-05,-6e-06,-1.1e-05,9e-06,-1.8e-05,5.6e-05,-8e-06,-3.4e-05,1e-06,-1e-06,-1.6e-05
