-2.4e-05,-8.6e-05,-0.002156,-0.011955,-0.00953,-0.052825,-0.175637,-0.16359,-0.177064,-0.171052,-0.148493,-0.150412,-0.137435,-0.069882,-0.024856,-0.005722,-0.006577,-0.00987,-0.011989,-0.015557,-0.004427,-0.000863,-0.000344,-0.000223,-0.000186,-0.000139,-0.000117,-0.000136
-1.6e-05,-4e-05,-0.001621,-0.009997,-0.004878,0.001704,-0.027927,0.041564,0.083206,0.139195,0.166463,0.165923,0.101488,0.066891,0.027583,0.005171,0.004965,0.00462,0.006042,0.01528,0.005454,0.000749,-0.000173,-7.9e-05,-0.000109,-0.000116,-0.000119,-0.000149
9e-06,5.4e-05,0.000825,0.003533,0.002545,0.001327,0.021286,-0.026405,-0.030859,-0.012753,-0.021561,-0.016319,-0.010731,-0.01643,-0.003326,-0.000962,-0.000932,-0.000679,-0.001934,-0.007149,-0.003212,-0.000753,3e-05,5.8e-05,3.7e-05,1.4e-05,-1e-05,-1e-05
2.5e-05,7.1e-05,0.001852,0.011224,0.007123,0.004894,0.059481,-0.011002,-0.080273,-0.122448,-0.137758,-0.145584,-0.082895,-0.047485,-0.026679,-0.005301,-0.001767,0.001238,0.002489,-0.000911,-0.000347,0.000233,0.000211,0.000151,0.000139,0.000113,9e-05,0.000111
1.1e-05,1.3e-05,0.000368,0.003598,0.002844,0.017562,0.060884,0.116655,0.148337,0.142801,0.143726,0.145728,0.121712,0.074349,0.024369,0.005354,0.004544,0.005308,0.007006,0.01164,0.004379,0.00102,0.000186,7e-05,8e-05,7.8e-05,9.4e-05,9.9e-05
-1.6e-05,-6e-05,-0.001535,-0.008794,-0.00728,-0.037389,-0.120713,-0.058075,0.017716,0.032682,0.021605,0.036535,0.023655,-0.000693,0.009048,0.001867,-0.002451,-0.006842,-0.010139,-0.015165,-0.005066,-0.000936,-0.000118,-0.000136,-0.000105,-6.2e-05,-1.4e-05,-2.8e-05
-1.4e-05,-3.2e-05,-0.001056,-0.007338,-0.005267,-0.037367,-0.10855,-0.093928,-0.140827,-0.158079,-0.152094,-0.167826,-0.138856,-0.070479,-0.027514,-0.005528,-0.003077,-0.002796,-0.002861,-0.001225,-0.000174,-0.000117,-0.000179,-6.3e-05,-0.000106,-9.7e-05,-8.2e-05,-9.4e-05
1e-05,5.4e-05,0.000759,0.003478,0.00376,0.026191,0.087579,0.083922,0.049108,0.053771,0.083495,0.082524,0.033953,0.035031,0.011082,0.002398,0.003211,0.005859,0.007976,0.014062,0.004757,0.000653,9e-06,1e-04,5.9e-05,7e-06,-2.9e-05,-2.8e-05
1.5e-05,5.1e-05,0.001251,0.007919,0.004879,0.019377,0.053682,-0.005861,0.039702,0.071889,0.060222,0.087045,0.081612,0.026683,0.015431,0.003005,0.001003,0.000458,-0.000902,-0.007497,-0.00344,-0.000758,5.4e-05,2.7e-05,7.9e-05,6.3e-05,3.2e-05,4.5e-05
4e-06,-1.6e-05,0.000171,0.00241,0.000116,-0.020303,-0.058075,-0.070137,-0.078921,-0.089182,-0.111739,-0.136422,-0.059944,-0.034966,-0.020836,-0.004196,-0.001446,-0.001079,-0.000605,-0.001551,-0.000144,0.000313,8.9e-05,-1.9e-05,1.5e-05,3e-05,3.3e-05,4e-05
-5e-06,-3.9e-05,-0.001012,-0.005834,-0.004796,-0.019135,-0.046626,0.018948,0.03832,0.025494,0.051727,0.031701,-0.004106,0.014348,0.000514,-0.000329,-0.001026,-0.002224,-0.001443,0.003943,0.00221,0.000618,3.3e-05,-3e-05,-4e-05,-2.8e-05,0,-9e-06
1e-06,1.6e-05,-0.00073,-0.005638,-0.002464,0.012706,0.008016,0.002796,0.052995,0.061061,0.05564,0.097908,0.057898,0.017237,0.017998,0.003471,0.000961,-0.000773,-0.003436,-0.006594,-0.002855,-0.00079,-9e-05,6e-06,-4e-05,-4.6e-05,-2.8e-05,-3.5e-05
4e-06,3.3e-05,0.000339,0.001449,0.003583,0.024655,0.052601,0.002926,-0.063158,-0.078758,-0.106825,-0.109172,-0.053346,-0.032906,-0.012814,-0.001975,0.000902,0.003731,0.005151,0.007103,0.002209,0.000241,-6.9e-05,7.4e-05,2.8e-05,-5e-06,-2.3e-05,-1e-05
0,0,0.001036,0.00643,0.002621,-0.005267,0.018739,0.029452,-0.017768,-0.008455,0.032549,-0.005505,-0.039322,-0.001265,-0.006611,-0.001134,-0.001442,-0.00075,0.001079,0.002933,0.001159,0.00023,3e-05,-1.9e-05,3.5e-05,3.7e-05,6e-06,2.5e-05
-1e-06,-2.3e-05,0.000326,0.002663,-0.001216,-0.01662,-0.044632,-0.03168,0.035649,0.067427,0.07625,0.103742,0.077317,0.032021,0.016916,0.00311,0.000622,-0.001838,-0.004589,-0.011132,-0.003832,-0.000546,4.3e-05,-9.6e-05,-8e-06,1.8e-05,1.4e-05,2e-05
0,-2e-06,-0.000774,-0.004165,-0.001395,0.004972,-0.007277,-0.009004,-0.016432,-0.043103,-0.091925,-0.076948,0.005237,-0.008061,-0.00476,-0.001028,0.000774,0.001059,0.00141,0.005084,0.002194,0.000493,1.3e-05,-4e-06,-2.8e-05,-2.7e-05,-8e-06,-1.3e-05
-2e-06,4e-06,-0.000862,-0.005411,-0.001128,0.009612,0.037617,0.038056,0.004534,-0.0188,-0.001164,-0.037299,-0.06722,-0.02022,-0.012447,-0.002478,-0.001848,-0.001367,-0.000562,0.003116,0.001164,0.000159,-2.9e-05,1.3e-05,-3.9e-05,-3.7e-05,-2.4e-05,-3.1e-05
-2e-06,8e-06,0.000219,0.000651,0.00102,0.012655,0.023664,-0.008863,0.028611,0.059692,0.080692,0.099682,0.034744,0.015781,0.011851,0.002216,0.001275,0.001304,-0.000391,-0.005887,-0.002612,-0.000585,-3.1e-05,5e-06,2e-06,1e-06,-8e-06,-4e-06
-7e-06,-1e-05,0.000834,0.004884,0.002258,0.002066,-0.007719,-0.011884,-0.031359,-0.029599,-0.067093,-0.041247,0.023746,-0.000731,0.002651,0.000799,0.000794,0.001497,0.003298,0.004992,0.001691,0.000237,-1.4e-05,-5e-06,3.2e-05,2.8e-05,1.4e-05,2.8e-05
