0.098507,0.087649,0.079269,0.084414,0.085228,0.078969,0.076798,0.075466,0.081824,0.096605,0.094795,0.081688,0.08028,0.086549,0.084148,0.083757,0.081389,0.079808,0.090138,0.092387,0.083042,0.075077,0.069949,0.066932,0.071949,0.074843,0.066936,0.066345
0.120934,0.109074,0.099069,0.1031,0.104261,0.098429,0.094585,0.09159,0.099997,0.117252,0.114096,0.099797,0.098406,0.103274,0.099809,0.101399,0.10098,0.098631,0.108845,0.110161,0.097998,0.089749,0.085306,0.081955,0.08596,0.088507,0.080728,0.079771
0.157752,0.146479,0.13531,0.135202,0.13476,0.130711,0.126711,0.120804,0.129978,0.149016,0.145202,0.132067,0.129083,0.129631,0.125928,0.130451,0.133577,0.130958,0.13939,0.13863,0.121724,0.112622,0.109928,0.106741,0.107745,0.108992,0.104121,0.10309
0.180234,0.176431,0.170286,0.162897,0.155952,0.153792,0.155649,0.149263,0.152415,0.165318,0.164625,0.160083,0.152272,0.146229,0.148138,0.155553,0.159592,0.157511,0.162995,0.161101,0.140662,0.12923,0.128323,0.126785,0.12433,0.123945,0.126856,0.12795
0.192477,0.199712,0.201042,0.185556,0.171741,0.17372,0.183506,0.175387,0.170199,0.174553,0.177885,0.183628,0.169299,0.160122,0.174941,0.183492,0.181376,0.177176,0.179994,0.180597,0.160695,0.144878,0.145592,0.1479,0.144693,0.1457,0.15515,0.156514
0.21656,0.229936,0.237532,0.215386,0.197826,0.210657,0.230877,0.213953,0.198536,0.196809,0.198088,0.208473,0.194721,0.191876,0.217143,0.218162,0.200366,0.195684,0.202958,0.207809,0.190728,0.172044,0.175408,0.17929,0.177372,0.187624,0.201245,0.197009
0.258378,0.276115,0.290953,0.255736,0.234538,0.260076,0.287107,0.260656,0.23732,0.23254,0.230015,0.244409,0.240442,0.244585,0.268716,0.256742,0.22269,0.226731,0.243758,0.244895,0.2295,0.215435,0.224314,0.226381,0.22403,0.242831,0.258739,0.247627
0.316613,0.331585,0.341183,0.295999,0.271476,0.295406,0.324689,0.303343,0.282317,0.282575,0.282093,0.291628,0.295761,0.307888,0.320695,0.293304,0.255527,0.274336,0.286931,0.27139,0.265262,0.264007,0.277426,0.27843,0.274922,0.297109,0.317979,0.300848
0.374388,0.368836,0.366093,0.330467,0.302227,0.312447,0.338808,0.333955,0.321651,0.329091,0.34484,0.348279,0.350971,0.362215,0.358039,0.32778,0.303062,0.330705,0.321555,0.28491,0.298325,0.308784,0.31654,0.322828,0.327531,0.353515,0.376851,0.347696
0.426779,0.380528,0.3718,0.369854,0.336953,0.335991,0.35649,0.358848,0.358405,0.363222,0.392453,0.405155,0.40111,0.39543,0.370436,0.344921,0.3399,0.375307,0.352397,0.299361,0.319973,0.335182,0.337206,0.357896,0.378271,0.400701,0.424724,0.393915
0.439598,0.381684,0.383831,0.400405,0.356121,0.351077,0.364948,0.364322,0.374015,0.369458,0.393763,0.422724,0.421333,0.396442,0.361228,0.339569,0.341062,0.386246,0.368257,0.310338,0.317115,0.326681,0.336253,0.366617,0.389981,0.404682,0.428855,0.409143
0.385595,0.350327,0.370143,0.384109,0.345926,0.354145,0.354683,0.348157,0.360532,0.340407,0.350534,0.387699,0.385659,0.348397,0.32618,0.311151,0.3088,0.365495,0.36014,0.309408,0.294452,0.292595,0.320813,0.342949,0.338595,0.338092,0.363674,0.36146
0.305581,0.300499,0.323977,0.317223,0.30155,0.335737,0.338523,0.339128,0.336263,0.299546,0.294691,0.317554,0.309624,0.282226,0.289583,0.285468,0.28355,0.344185,0.340227,0.290185,0.265991,0.268893,0.29797,0.290588,0.26564,0.26697,0.291116,0.299805
0.251726,0.25812,0.271359,0.251432,0.255863,0.292209,0.301218,0.311887,0.29016,0.250095,0.241015,0.250121,0.252668,0.255708,0.271506,0.265893,0.265364,0.316166,0.311189,0.263759,0.25199,0.268606,0.276894,0.247492,0.222884,0.232976,0.252105,0.261364
0.229341,0.23189,0.232396,0.217347,0.22352,0.246438,0.267093,0.279323,0.253877,0.220297,0.226799,0.246906,0.251072,0.255703,0.247097,0.230066,0.243016,0.289161,0.282874,0.244846,0.24695,0.259324,0.25366,0.237401,0.209688,0.201492,0.218909,0.238627
0.277079,0.271099,0.260727,0.241192,0.252638,0.294235,0.321959,0.325137,0.309551,0.273363,0.296125,0.335129,0.309034,0.275892,0.247938,0.239816,0.283627,0.342656,0.326839,0.275398,0.27787,0.283658,0.277984,0.288921,0.257632,0.220462,0.227072,0.254517
0.372702,0.381063,0.384229,0.348181,0.368104,0.438796,0.462672,0.472101,0.468327,0.407893,0.447291,0.509945,0.449581,0.361952,0.307076,0.332443,0.419103,0.480981,0.45483,0.386546,0.381302,0.388569,0.385885,0.409518,0.370958,0.321654,0.326407,0.356651
0.471672,0.518217,0.55581,0.490209,0.508357,0.614551,0.628736,0.658122,0.663634,0.555496,0.617342,0.702223,0.60337,0.469626,0.40419,0.482509,0.601199,0.631682,0.597912,0.554962,0.55281,0.55005,0.533766,0.550509,0.511325,0.469244,0.471414,0.492879
0.555081,0.647741,0.713959,0.610591,0.608502,0.737757,0.742811,0.803784,0.816805,0.652545,0.721686,0.802237,0.672425,0.543275,0.499593,0.624281,0.753335,0.732002,0.694935,0.71831,0.744946,0.725517,0.680437,0.67355,0.636284,0.610377,0.6014,0.608106
0.675841,0.756995,0.78504,0.659117,0.63545,0.749677,0.759425,0.849943,0.857299,0.660441,0.697877,0.73304,0.627529,0.569075,0.555972,0.686884,0.804383,0.750502,0.720866,0.812937,0.863171,0.814948,0.742922,0.720592,0.689038,0.675525,0.656894,0.662271
0.800734,0.786548,0.705029,0.615732,0.602979,0.652791,0.673135,0.765015,0.763363,0.579007,0.548926,0.562849,0.575186,0.609171,0.60469,0.678183,0.771775,0.706826,0.657053,0.797299,0.849469,0.765691,0.675541,0.651037,0.636036,0.619422,0.602069,0.634056
0.900862,0.750061,0.563229,0.534944,0.576644,0.585389,0.58054,0.615605,0.618546,0.488015,0.399769,0.429875,0.554049,0.644179,0.646881,0.647373,0.693302,0.631926,0.562768,0.681565,0.697635,0.620727,0.561927,0.551228,0.545038,0.487676,0.459662,0.567743
0.881059,0.644892,0.441439,0.466359,0.566181,0.604783,0.529021,0.454658,0.48608,0.4472,0.390753,0.420617,0.514014,0.597231,0.611469,0.603389,0.599894,0.530444,0.462514,0.503281,0.501092,0.501454,0.513801,0.530161,0.527295,0.431156,0.375308,0.53064
0.751389,0.531491,0.364413,0.406794,0.517743,0.577547,0.485775,0.394086,0.446344,0.451259,0.434047,0.431059,0.424513,0.47509,0.52116,0.558837,0.520989,0.426213,0.378279,0.367778,0.360886,0.4248,0.504003,0.518837,0.492704,0.40745,0.365516,0.522467
0.596647,0.45572,0.331275,0.327529,0.432101,0.509595,0.456283,0.448904,0.482149,0.444158,0.434763,0.383821,0.31845,0.370339,0.459308,0.51119,0.463701,0.368946,0.335874,0.338788,0.314846,0.366355,0.486667,0.521532,0.464076,0.36365,0.346054,0.486169
0.434346,0.392493,0.338295,0.309659,0.388959,0.46472,0.454056,0.504856,0.50306,0.422379,0.380925,0.293208,0.260055,0.365479,0.460949,0.451041,0.398708,0.320762,0.300647,0.354843,0.34074,0.350533,0.454833,0.512589,0.438199,0.323299,0.332712,0.435783
0.339387,0.350705,0.348259,0.333958,0.381386,0.438853,0.438171,0.489755,0.471073,0.375814,0.304955,0.226199,0.248724,0.367355,0.421334,0.35765,0.324289,0.296494,0.27555,0.339563,0.353238,0.334818,0.406883,0.509539,0.447752,0.328102,0.338987,0.387697
0.32706,0.322275,0.331612,0.353283,0.382382,0.42956,0.437458,0.435191,0.400532,0.336143,0.276077,0.242028,0.286982,0.362487,0.364686,0.296706,0.307961,0.35555,0.327874,0.343781,0.368423,0.366798,0.414119,0.530558,0.47515,0.34193,0.337514,0.331998
0.394243,0.325988,0.303961,0.391285,0.450966,0.469803,0.451924,0.400372,0.368275,0.373024,0.352803,0.316275,0.340295,0.37931,0.390323,0.353453,0.381747,0.449124,0.397214,0.368875,0.400367,0.447403,0.49018,0.551175,0.461767,0.356022,0.378747,0.355431
0.449829,0.350319,0.291155,0.415563,0.509631,0.493366,0.435412,0.367879,0.368454,0.437757,0.458219,0.395588,0.38382,0.406321,0.431591,0.424259,0.458987,0.496935,0.428963,0.399789,0.436168,0.509534,0.525456,0.518892,0.415689,0.353562,0.426241,0.416008
0.445623,0.359885,0.304992,0.413571,0.481335,0.425664,0.373465,0.330799,0.34659,0.446422,0.517542,0.469732,0.428651,0.429371,0.426713,0.436569,0.478373,0.460687,0.39146,0.379859,0.406678,0.478185,0.485979,0.465309,0.396335,0.346662,0.410299,0.40834
0.387229,0.335349,0.3182,0.386732,0.398427,0.328409,0.31216,0.312354,0.310848,0.369432,0.47857,0.491797,0.445689,0.424614,0.383911,0.409758,0.460311,0.396068,0.353744,0.332906,0.319806,0.378181,0.395667,0.405511,0.42555,0.379973,0.347887,0.3454
0.317277,0.32284,0.336037,0.401736,0.41455,0.338924,0.309857,0.315159,0.276498,0.275915,0.372416,0.43074,0.410071,0.387007,0.364742,0.419184,0.450324,0.352186,0.34273,0.314309,0.277573,0.35383,0.364348,0.402656,0.488163,0.419171,0.297556,0.317016
0.270472,0.303296,0.323633,0.416746,0.447273,0.372008,0.312417,0.308631,0.255449,0.218979,0.28184,0.336492,0.336796,0.310111,0.342308,0.416899,0.441811,0.358778,0.353326,0.305219,0.259535,0.350219,0.364626,0.405459,0.499778,0.44158,0.301818,0.321036
0.226153,0.235644,0.271553,0.381108,0.415578,0.375167,0.33656,0.345982,0.282114,0.193994,0.242904,0.289913,0.27408,0.23116,0.289315,0.351622,0.380168,0.370668,0.367315,0.296418,0.254036,0.358807,0.386415,0.40687,0.462662,0.408195,0.296338,0.28603
0.170955,0.15775,0.226038,0.332996,0.374856,0.333413,0.312654,0.35863,0.304587,0.179632,0.225309,0.263208,0.242218,0.22533,0.239312,0.276129,0.306751,0.337449,0.35624,0.292726,0.225713,0.322797,0.372649,0.415645,0.415779,0.315449,0.252285,0.212644
0.170696,0.168639,0.210689,0.279864,0.329408,0.253143,0.229475,0.31299,0.294864,0.189161,0.2229,0.243324,0.250524,0.270477,0.213241,0.208857,0.228869,0.252299,0.293626,0.263167,0.176181,0.249593,0.354106,0.424555,0.344548,0.221342,0.200601,0.148214
0.222297,0.246793,0.244734,0.293938,0.325607,0.206005,0.15726,0.250898,0.285872,0.22572,0.233593,0.214441,0.24327,0.311608,0.227611,0.160698,0.174908,0.188317,0.241489,0.258077,0.189491,0.205344,0.325185,0.400748,0.309311,0.228338,0.203296,0.124905
0.315185,0.336516,0.31339,0.311808,0.327999,0.211189,0.152181,0.248785,0.289822,0.268666,0.250667,0.185392,0.226393,0.312499,0.234348,0.127792,0.163858,0.201605,0.235608,0.266586,0.242968,0.211311,0.278191,0.329949,0.265784,0.239102,0.20355,0.117771
0.427032,0.395167,0.353437,0.284038,0.302568,0.24585,0.168991,0.240665,0.259238,0.279734,0.253453,0.168893,0.217533,0.279083,0.231438,0.123675,0.169514,0.234089,0.242209,0.274029,0.289225,0.202836,0.220746,0.285051,0.246753,0.21481,0.187676,0.123296
