0.048724,0.048802,0.046798,0.047537,0.051957,0.054806,0.050076,0.044182,0.046414,0.046404,0.041202,0.040866,0.044051,0.04877,0.053558,0.055205,0.051204,0.045332,0.046338,0.047564,0.047515,0.049367,0.048651,0.049544,0.048046,0.044686,0.045463,0.047036
0.060121,0.059577,0.056171,0.056948,0.062253,0.065847,0.060249,0.053732,0.056794,0.056369,0.050441,0.050798,0.054558,0.059801,0.065455,0.066698,0.061012,0.053986,0.055875,0.058312,0.058538,0.061648,0.061448,0.060634,0.058357,0.053967,0.054203,0.058049
0.078595,0.076992,0.071222,0.071675,0.077954,0.083154,0.077156,0.07011,0.073971,0.072039,0.065617,0.068473,0.073412,0.078661,0.084253,0.08386,0.075142,0.066958,0.071048,0.075137,0.075575,0.081201,0.082631,0.078188,0.074076,0.068121,0.067269,0.07519
0.09131,0.089009,0.082675,0.082659,0.08753,0.094369,0.091029,0.08441,0.086758,0.082018,0.077136,0.084366,0.090992,0.095137,0.097459,0.094069,0.083266,0.076184,0.082979,0.086189,0.085898,0.093337,0.097389,0.090237,0.082526,0.07539,0.074621,0.085248
0.101874,0.10453,0.099862,0.095557,0.094497,0.102781,0.104337,0.096987,0.096707,0.092384,0.089825,0.098633,0.107202,0.109038,0.106041,0.101756,0.093736,0.091453,0.098886,0.096008,0.093066,0.099833,0.105492,0.100852,0.089214,0.080626,0.085755,0.095816
0.123695,0.134983,0.129187,0.116305,0.110084,0.118392,0.123408,0.116116,0.11226,0.109999,0.111114,0.121027,0.131084,0.12882,0.119081,0.115592,0.115599,0.120096,0.125207,0.116991,0.112793,0.114923,0.117432,0.118406,0.105134,0.094833,0.109773,0.117024
0.15576,0.175073,0.167345,0.15124,0.145269,0.15003,0.150999,0.140278,0.13226,0.133097,0.142465,0.155801,0.166282,0.160797,0.142509,0.138374,0.148303,0.15708,0.158513,0.149014,0.142731,0.137207,0.13683,0.147124,0.136207,0.122526,0.143008,0.14848
0.191478,0.215388,0.205256,0.19355,0.191876,0.194202,0.18966,0.172388,0.157654,0.159233,0.179515,0.19637,0.206687,0.204406,0.178899,0.169209,0.187485,0.197027,0.196976,0.191,0.175389,0.157562,0.157362,0.1788,0.173224,0.157784,0.178007,0.183309
0.229844,0.249655,0.232201,0.229988,0.237581,0.242608,0.232047,0.207396,0.186646,0.183905,0.210154,0.229323,0.247466,0.259007,0.229285,0.208403,0.230478,0.239803,0.241582,0.246121,0.213695,0.180795,0.182367,0.204837,0.203499,0.190599,0.20596,0.212493
0.257002,0.272948,0.250704,0.253318,0.267109,0.273612,0.257291,0.229261,0.202858,0.199096,0.232937,0.24993,0.274237,0.297292,0.266651,0.239753,0.261237,0.268182,0.272095,0.29125,0.24717,0.20261,0.208303,0.225424,0.222718,0.213505,0.221906,0.226473
0.243631,0.264807,0.254759,0.25601,0.265679,0.269671,0.247785,0.224244,0.202051,0.199618,0.232567,0.242838,0.262597,0.284918,0.26275,0.240798,0.257539,0.261256,0.261678,0.286698,0.249079,0.212842,0.226396,0.235896,0.229233,0.219114,0.217803,0.217161
0.204252,0.222377,0.228047,0.23236,0.234856,0.229727,0.20611,0.191319,0.180219,0.176574,0.196936,0.200761,0.211972,0.228683,0.221922,0.213822,0.220756,0.21474,0.208874,0.23301,0.218721,0.209415,0.234696,0.238803,0.22887,0.214821,0.193136,0.17875
0.175598,0.179502,0.193401,0.202807,0.198619,0.189382,0.172409,0.164204,0.164237,0.160188,0.164125,0.1567,0.155232,0.172985,0.179928,0.180916,0.180807,0.165034,0.168083,0.198167,0.196577,0.207997,0.237506,0.227506,0.213196,0.204505,0.171585,0.152967
0.172261,0.163184,0.179104,0.186557,0.174853,0.17455,0.16978,0.16098,0.162889,0.159456,0.152017,0.132919,0.122449,0.140317,0.152645,0.156349,0.156444,0.140441,0.157364,0.194644,0.186748,0.202878,0.234016,0.213435,0.195133,0.186544,0.154302,0.146406
0.178106,0.176719,0.189374,0.185983,0.161247,0.157898,0.163148,0.15891,0.161973,0.164224,0.155085,0.136057,0.129601,0.136254,0.14422,0.150811,0.148366,0.13446,0.14498,0.171046,0.16256,0.176876,0.205159,0.190499,0.174346,0.161014,0.142166,0.156011
0.203398,0.227177,0.23937,0.218049,0.182296,0.159184,0.163113,0.169161,0.171735,0.192747,0.199144,0.174247,0.170803,0.169861,0.177839,0.19246,0.179092,0.155793,0.139776,0.150218,0.160363,0.173369,0.198268,0.19492,0.175524,0.156121,0.162959,0.207918
0.287782,0.332254,0.334244,0.298443,0.257879,0.21266,0.207725,0.220025,0.220485,0.271177,0.299121,0.251755,0.241873,0.242678,0.26174,0.286166,0.25935,0.22369,0.186685,0.193498,0.228731,0.24708,0.266637,0.262658,0.238221,0.213754,0.238755,0.307897
0.394865,0.439486,0.421924,0.381541,0.345832,0.297121,0.2893,0.304152,0.29901,0.374683,0.418781,0.342359,0.315296,0.32154,0.360219,0.388422,0.350592,0.311122,0.265233,0.272948,0.336539,0.368684,0.372159,0.349655,0.321154,0.30354,0.346449,0.418359
0.455083,0.482548,0.463984,0.434075,0.403137,0.370479,0.376506,0.400544,0.385156,0.468579,0.519594,0.416137,0.358153,0.370329,0.423941,0.439378,0.408953,0.390982,0.353764,0.366744,0.453735,0.499679,0.480209,0.43046,0.405169,0.411354,0.45719,0.490054
0.418004,0.443356,0.472056,0.459964,0.42935,0.413836,0.440186,0.482703,0.465261,0.543281,0.581122,0.457442,0.372028,0.397746,0.444266,0.416104,0.411501,0.448217,0.445574,0.467515,0.558382,0.611029,0.583956,0.517829,0.509091,0.535679,0.535654,0.496707
0.317559,0.343902,0.439628,0.458135,0.418391,0.404105,0.453395,0.502953,0.494934,0.561597,0.567885,0.454433,0.375097,0.429959,0.457585,0.371544,0.390109,0.478863,0.514974,0.543573,0.609522,0.647744,0.650576,0.593344,0.588933,0.622135,0.566266,0.470595
0.238715,0.258961,0.376728,0.412105,0.351388,0.342591,0.417094,0.462382,0.467004,0.513179,0.496085,0.422832,0.373867,0.448933,0.464854,0.35829,0.38593,0.46395,0.50171,0.54267,0.591028,0.631151,0.654226,0.581527,0.574635,0.60988,0.54541,0.456912
0.224101,0.245508,0.32975,0.353643,0.269903,0.259904,0.334271,0.388534,0.424385,0.448278,0.419419,0.386883,0.374752,0.442132,0.440053,0.354346,0.388313,0.413574,0.415342,0.460665,0.501968,0.573304,0.591283,0.474678,0.466851,0.501547,0.4532,0.407862
0.243136,0.269975,0.309399,0.304818,0.218204,0.221395,0.286642,0.337922,0.398441,0.391942,0.344725,0.338838,0.354278,0.413081,0.402182,0.34168,0.357868,0.336668,0.315238,0.363843,0.39573,0.467565,0.477437,0.359052,0.376308,0.421963,0.367617,0.345777
0.274314,0.27595,0.258173,0.23947,0.186501,0.219692,0.291935,0.337076,0.398664,0.356807,0.281287,0.29183,0.316079,0.360626,0.360819,0.308396,0.293522,0.270424,0.256027,0.305433,0.319896,0.350473,0.370342,0.316464,0.332789,0.363576,0.342414,0.335475
0.288904,0.270606,0.218154,0.196755,0.158045,0.202192,0.29702,0.348191,0.382699,0.323685,0.262723,0.305251,0.313002,0.283867,0.285367,0.275025,0.271265,0.255758,0.231123,0.25951,0.246903,0.238111,0.268202,0.282549,0.292331,0.284265,0.30446,0.336684
0.271894,0.275885,0.226252,0.213449,0.168422,0.175402,0.254626,0.314785,0.336746,0.282601,0.260156,0.332452,0.328554,0.241141,0.236765,0.264832,0.263284,0.244367,0.221901,0.234819,0.213209,0.215614,0.251996,0.261316,0.24885,0.21773,0.253853,0.331505
0.244021,0.289374,0.26737,0.254291,0.210144,0.163234,0.199665,0.258419,0.267833,0.228756,0.239601,0.311509,0.321991,0.245171,0.2485,0.277113,0.245334,0.224656,0.220243,0.225196,0.199784,0.242113,0.287888,0.24569,0.207678,0.204039,0.261856,0.350673
0.240116,0.303155,0.325912,0.31274,0.264039,0.192528,0.197285,0.229682,0.212558,0.192434,0.217345,0.269419,0.30055,0.248445,0.264646,0.276261,0.235946,0.226511,0.216548,0.233775,0.209222,0.25238,0.324371,0.278323,0.224126,0.248984,0.324713,0.39331
0.245103,0.322489,0.382904,0.370338,0.307252,0.225747,0.213358,0.215654,0.184447,0.172213,0.200012,0.278431,0.330089,0.259916,0.267914,0.258851,0.225488,0.23941,0.2159,0.243763,0.227975,0.245999,0.353919,0.341545,0.265555,0.293667,0.363844,0.417588
0.222205,0.300032,0.382367,0.383928,0.321597,0.237049,0.222031,0.230042,0.196976,0.166607,0.200047,0.31224,0.348888,0.247677,0.252563,0.254028,0.214257,0.240035,0.208108,0.2235,0.239107,0.254826,0.386206,0.399744,0.294788,0.305544,0.353817,0.382552
0.174294,0.23527,0.311073,0.32128,0.280979,0.211915,0.199502,0.236019,0.220654,0.174991,0.201517,0.31328,0.312771,0.197863,0.203576,0.228201,0.18685,0.206143,0.179135,0.180738,0.2228,0.255993,0.377626,0.393568,0.283807,0.28246,0.317397,0.314667
0.155575,0.2202,0.26295,0.229763,0.193895,0.162877,0.164363,0.228773,0.250994,0.187325,0.175118,0.268141,0.251787,0.143869,0.150622,0.18504,0.165837,0.168482,0.147623,0.153429,0.196335,0.223115,0.297692,0.305059,0.218824,0.215748,0.257247,0.267385
0.148183,0.220491,0.260138,0.196591,0.129462,0.115497,0.130764,0.215069,0.262762,0.178802,0.125104,0.215613,0.227902,0.139722,0.130799,0.146657,0.145919,0.142843,0.144441,0.181428,0.222448,0.196956,0.198423,0.196654,0.150885,0.157274,0.22739,0.273634
0.151436,0.194647,0.242757,0.206378,0.137241,0.111535,0.117794,0.196394,0.234274,0.145938,0.101626,0.184132,0.194358,0.135288,0.127883,0.137581,0.13568,0.130711,0.165701,0.23654,0.266044,0.18527,0.137519,0.143561,0.132193,0.142619,0.205853,0.246791
0.144807,0.168622,0.21281,0.193734,0.152397,0.116843,0.103309,0.150648,0.165967,0.108592,0.100854,0.154243,0.147272,0.117028,0.125552,0.1343,0.124701,0.119396,0.179288,0.265161,0.27106,0.161119,0.098029,0.119883,0.135726,0.133082,0.154801,0.173278
0.130994,0.158831,0.188201,0.160309,0.146656,0.121441,0.101586,0.109096,0.093083,0.071086,0.089321,0.116756,0.130254,0.125782,0.119571,0.11156,0.096277,0.093972,0.166434,0.247923,0.228847,0.133412,0.083117,0.094699,0.132343,0.130589,0.10615,0.111202
0.140785,0.165015,0.180108,0.142705,0.122439,0.114298,0.102098,0.091316,0.062934,0.059016,0.073644,0.081824,0.129282,0.169135,0.14732,0.099178,0.075118,0.087438,0.156812,0.226512,0.190548,0.118375,0.092916,0.081604,0.132904,0.156764,0.108178,0.111768
0.153863,0.157768,0.160987,0.146061,0.125549,0.111211,0.104718,0.107398,0.07763,0.074395,0.078372,0.070979,0.131972,0.217138,0.183334,0.107382,0.08244,0.106505,0.166206,0.243803,0.216318,0.136065,0.10202,0.071645,0.148412,0.197146,0.143719,0.163546
0.145242,0.13176,0.136038,0.180417,0.177752,0.142093,0.11973,0.141816,0.111146,0.090679,0.089912,0.079989,0.160242,0.26559,0.200076,0.120334,0.101672,0.126528,0.155846,0.243679,0.251022,0.166839,0.102502,0.054951,0.149334,0.236861,0.207513,0.253738
