-6e-05,-4.2e-05,-7.1e-05,-6e-05,-0.004904,-0.041983,-0.027184,-0.008618,-0.011681,-0.091218,-0.183766,-0.213285,-0.181797,-0.165605,-0.169487,-0.121006,-0.070563,-0.058218,-0.037667,-0.02005,-0.011191,-0.001404,-0.000547,-0.000512,-0.000697,-0.000338,-8e-06,-1.4e-05
0,3e-06,2.5e-05,-1.9e-05,-0.000715,-0.005894,-0.004393,0.004993,0.002302,0.026688,0.051244,0.024158,0.100202,0.139448,0.142252,0.099387,0.061317,0.048994,0.034721,0.020798,0.011196,0.000902,-0.000458,-0.00055,0.001169,0.000668,1e-06,-6e-06
-1.5e-05,-9e-06,-2.4e-05,-2.2e-05,0.000302,0.006053,0.00334,-0.004068,-0.00746,-0.034775,-0.029526,-0.024529,-0.016233,-0.006143,0.004376,-0.018939,-0.013054,-0.001881,0.000545,-0.00138,-0.000369,-0.000435,-0.000291,-0.000343,-0.000777,-0.000361,-7e-06,-3e-06
1.3e-05,1.2e-05,-7e-06,1.1e-05,0.001433,0.01349,0.008729,-0.003869,-0.014388,-0.111575,-0.134575,-0.09122,-0.140104,-0.164256,-0.166508,-0.106201,-0.063708,-0.055294,-0.040346,-0.022942,-0.012885,-0.001614,-0.000143,0.000142,-0.00024,-0.000251,-5e-06,3e-06
6.3e-05,4.7e-05,8.6e-05,5.8e-05,0.002674,0.017461,0.011733,0.00935,0.007116,0.052132,0.143712,0.189937,0.15444,0.134371,0.125046,0.121551,0.073206,0.049787,0.031251,0.019486,0.010273,0.001188,8.1e-05,0.000364,0.001516,0.000895,1.3e-05,8e-06
-3.1e-05,-1.8e-05,-1.6e-05,-9e-06,-0.001676,-0.016834,-0.010981,-0.000649,0.006235,0.083485,0.138647,0.135401,0.103669,0.098611,0.106969,0.048846,0.022867,0.028668,0.023754,0.010951,0.00678,0.000791,-0.00022,-0.000395,-0.001552,-0.000857,-8e-06,-8e-06
-6.3e-05,-4.5e-05,-7.2e-05,-4.9e-05,-0.003105,-0.02033,-0.012128,-0.005555,-0.009324,-0.068243,-0.163573,-0.198909,-0.173911,-0.169158,-0.162233,-0.131777,-0.075217,-0.063018,-0.042764,-0.024292,-0.013219,-0.001576,-0.000379,-0.000496,-9e-05,-6.8e-05,-4e-06,-7e-06
2.7e-05,1.3e-05,2.8e-05,8e-06,0.001042,0.007181,0.003585,0.003216,0.001304,-0.007019,-0.054814,-0.094457,-9.2e-05,0.018862,0.003045,0.024475,0.020931,0.007035,0.004628,0.007108,0.002743,0.000179,9.2e-05,-2.6e-05,0.001221,0.000723,8e-06,7e-06
2.3e-05,1.9e-05,2.3e-05,1.9e-05,0.002063,0.015004,0.009234,-0.000662,0.00871,0.073639,0.102491,0.095785,0.105552,0.111227,0.109621,0.061442,0.02927,0.040227,0.03155,0.015536,0.008837,0.001011,0.000474,0.000225,-0.000771,-4e-04,-6e-06,-1e-06
1e-06,6e-06,-1e-05,-4e-06,5.1e-05,0.004546,0.004111,-0.003489,-0.004786,-0.062184,-0.071255,-0.019563,-0.091963,-0.116667,-0.098308,-0.072094,-0.03995,-0.028932,-0.025354,-0.018817,-0.009934,-0.000827,0.000218,0.000268,-0.000192,-0.000185,-6e-06,-4e-06
1.1e-05,9e-06,2.5e-05,4e-06,-0.000956,-0.008846,-0.006317,0.002165,-0.004236,-0.047481,-0.017723,0.005395,-0.009869,-0.014643,-0.019612,0.024943,0.022209,-0.002927,-0.009418,-0.000989,-0.00151,-1e-04,-0.000224,-3.8e-05,0.000655,0.00041,5e-06,1e-06
-2.6e-05,-1e-05,3e-06,0,-0.000891,-0.011356,-0.007592,0.001794,0.005729,0.087486,0.148978,0.102816,0.104017,0.130939,0.128975,0.073734,0.0275,0.032468,0.030753,0.018268,0.010584,0.001058,-0.000161,-0.000199,-0.000672,-0.000389,0,6e-06
-2.9e-05,-2.4e-05,-4.1e-05,-1.4e-05,-0.000224,-0.000647,0.000437,-0.000482,-0.001517,0.00023,-0.040347,-0.06579,-0.076976,-0.07098,-0.051246,-0.069562,-0.043476,-0.023936,-0.013168,-0.012312,-0.005575,-0.000526,1.6e-05,-5.1e-05,0.000238,0.000115,3e-06,7e-06
3.7e-05,1.1e-05,1.2e-05,1.6e-05,0.0015,0.015186,0.009638,0.001216,-0.004746,-0.069098,-0.142129,-0.128515,-0.059685,-0.071501,-0.087759,-0.040555,-0.003873,-0.020928,-0.022086,-0.008641,-0.005567,-0.00076,-0.00018,-8.3e-05,0.000469,0.000322,5e-06,5e-06
2.4e-05,2.5e-05,3.4e-05,2.1e-05,0.001055,0.006825,0.003312,-0.000869,0.006225,0.052054,0.06106,0.047444,0.101851,0.108988,0.081188,0.058888,0.027985,0.030753,0.027301,0.017328,0.008967,0.000647,-0.000204,-0.000154,-0.000677,-0.000377,-4e-06,-5e-06
-1.9e-05,-6e-06,-1.8e-05,-1.9e-05,-0.001455,-0.011608,-0.006294,-0.002038,0.00509,0.034392,0.052577,0.072668,-0.001847,-0.0161,0.005276,-0.007377,-0.01303,0.003106,0.004425,-0.004025,-0.001348,-2.9e-05,5.2e-05,6.8e-05,5.7e-05,0,-6e-06,-9e-06
-1.2e-05,-1.6e-05,-1.2e-05,-2.1e-05,-0.001523,-0.010928,-0.006307,0.00042,-0.005749,-0.073858,-0.071014,-0.017148,-0.073801,-0.095516,-0.081757,-0.028544,0.002706,-0.021454,-0.026592,-0.012517,-0.007456,-0.000673,-1.8e-05,2.2e-05,0.000263,0.000163,-8e-06,-6e-06
-1.7e-05,-1.2e-05,3e-06,4e-06,0.001342,0.008027,0.003654,0.001497,-0.001442,0.01579,0.053185,0.005535,0.04686,0.080158,0.065313,0.044084,0.01545,0.010487,0.012518,0.012467,0.006474,0.000534,-7e-06,-1.7e-05,-5e-05,-1.8e-05,-2e-06,1e-06
-6e-06,-8e-06,-2e-05,3e-06,0.00101,0.007453,0.003956,-0.000642,0.001615,0.057717,0.060771,0.003144,0.014926,0.038039,0.05189,0.000908,-0.02239,0.004894,0.014227,0.002501,0.002278,0.000212,-2e-06,-7.1e-05,-0.000136,-9.3e-05,0,3e-06
