0.04401,0.046711,0.043097,0.042258,0.042454,0.039272,0.039021,0.045402,0.048599,0.050598,0.054717,0.050542,0.041493,0.035242,0.035169,0.041502,0.04149,0.037733,0.040424,0.042728,0.043504,0.043149,0.04199,0.043187,0.043348,0.037927,0.031544,0.030562
0.057923,0.062281,0.056588,0.053995,0.054266,0.051164,0.050854,0.059585,0.064193,0.066313,0.07073,0.064943,0.054112,0.046137,0.045293,0.054184,0.054796,0.049151,0.052028,0.054755,0.05613,0.055508,0.053957,0.056401,0.056513,0.049169,0.040849,0.039109
0.082815,0.090103,0.08085,0.074874,0.075369,0.072974,0.072559,0.084576,0.091003,0.092979,0.09764,0.090023,0.077027,0.06567,0.063068,0.076439,0.078145,0.06964,0.072673,0.075018,0.077479,0.076876,0.075358,0.080918,0.080929,0.070392,0.058632,0.054521
0.104332,0.111703,0.101935,0.093993,0.094237,0.094374,0.094483,0.105768,0.111513,0.113713,0.117578,0.10974,0.099119,0.085376,0.079571,0.094858,0.097571,0.088745,0.090476,0.089741,0.092829,0.094082,0.094605,0.103232,0.103459,0.092785,0.079169,0.071113
0.124623,0.124829,0.121811,0.115742,0.11498,0.121142,0.123111,0.126704,0.127972,0.133985,0.137696,0.129569,0.128476,0.116501,0.106043,0.116794,0.11754,0.111621,0.108307,0.10064,0.104284,0.111674,0.11694,0.124204,0.12467,0.120672,0.109054,0.095975
0.165596,0.157966,0.16445,0.15985,0.156585,0.169959,0.174089,0.16644,0.160806,0.176944,0.186439,0.176541,0.186915,0.177493,0.161243,0.164203,0.157623,0.153213,0.140559,0.125829,0.135749,0.15345,0.162788,0.16212,0.162863,0.170425,0.160547,0.140182
0.234696,0.22562,0.236203,0.228111,0.221536,0.24252,0.249628,0.236582,0.223706,0.246409,0.263157,0.249416,0.269059,0.263634,0.242125,0.239599,0.222097,0.213206,0.193366,0.173303,0.191888,0.222679,0.234958,0.222289,0.222186,0.241072,0.228504,0.200184
0.307415,0.306902,0.317561,0.302513,0.289323,0.311576,0.328957,0.326082,0.300406,0.3141,0.331016,0.31407,0.343882,0.342411,0.318502,0.31799,0.290078,0.268665,0.249875,0.23209,0.252328,0.294321,0.309676,0.280353,0.279107,0.307044,0.290195,0.262291
0.350399,0.371542,0.383762,0.368115,0.348503,0.355893,0.387774,0.40754,0.361758,0.347261,0.35612,0.346105,0.385606,0.37886,0.355717,0.364214,0.32908,0.294259,0.294353,0.289893,0.296213,0.345889,0.367717,0.320082,0.316028,0.343138,0.322544,0.31244
0.3421,0.398265,0.422018,0.409981,0.389164,0.378644,0.417948,0.447239,0.382362,0.345711,0.350511,0.359134,0.40248,0.375322,0.351671,0.372176,0.337113,0.296289,0.321653,0.331446,0.315107,0.3665,0.398687,0.343088,0.330307,0.34084,0.321686,0.347503
0.305732,0.38506,0.423843,0.410413,0.388049,0.382522,0.422055,0.426852,0.356503,0.326122,0.33146,0.349666,0.383644,0.346906,0.330134,0.352731,0.323166,0.285712,0.321735,0.336649,0.308103,0.352625,0.395603,0.353992,0.32895,0.317394,0.308479,0.359217
0.265338,0.331606,0.380051,0.369437,0.341652,0.350942,0.386962,0.364609,0.30673,0.299937,0.309701,0.317893,0.327486,0.295385,0.288663,0.312106,0.300966,0.279141,0.303803,0.309017,0.294263,0.325708,0.351429,0.331941,0.306719,0.28111,0.278946,0.330673
0.237763,0.26841,0.308068,0.313625,0.28731,0.293177,0.325257,0.309406,0.265075,0.26082,0.27078,0.276513,0.275141,0.251431,0.245478,0.263275,0.263918,0.259386,0.279733,0.273942,0.273077,0.300819,0.29417,0.275323,0.274064,0.263996,0.25323,0.277145
0.236153,0.244589,0.250184,0.261887,0.248587,0.240683,0.267118,0.27107,0.228678,0.213642,0.225031,0.232208,0.237072,0.225636,0.21928,0.22882,0.227089,0.239192,0.266794,0.252827,0.241523,0.263072,0.247505,0.218825,0.235785,0.253351,0.240303,0.23961
0.249248,0.25041,0.225457,0.250195,0.261931,0.244104,0.252947,0.253359,0.212948,0.208225,0.227271,0.230356,0.233572,0.230526,0.221686,0.217768,0.221968,0.256283,0.285802,0.267786,0.236591,0.239962,0.250944,0.224476,0.223189,0.246469,0.241429,0.239513
0.315861,0.320467,0.280865,0.338261,0.374507,0.326038,0.298917,0.297313,0.272634,0.289628,0.306761,0.304232,0.299725,0.299321,0.293298,0.278363,0.296318,0.358464,0.389605,0.353608,0.303613,0.299339,0.342679,0.322387,0.29353,0.31324,0.3103,0.324842
0.435202,0.447416,0.401777,0.492915,0.539065,0.451597,0.41154,0.41826,0.394955,0.424292,0.439263,0.444921,0.455849,0.464707,0.443065,0.404377,0.450753,0.547386,0.570928,0.508378,0.440935,0.445789,0.50222,0.474405,0.434451,0.465563,0.462557,0.466576
0.544325,0.572243,0.560557,0.672923,0.684631,0.55638,0.541944,0.559818,0.525182,0.555944,0.566562,0.599241,0.657986,0.696946,0.637048,0.563474,0.66435,0.790666,0.765683,0.661613,0.599198,0.639809,0.672215,0.61678,0.587626,0.647886,0.647482,0.595527
0.612964,0.648991,0.716975,0.832671,0.759994,0.589101,0.629747,0.66128,0.614601,0.639194,0.640272,0.696904,0.819003,0.925537,0.840245,0.745366,0.891285,1.012208,0.906954,0.748356,0.718734,0.835632,0.815217,0.69323,0.684194,0.793566,0.791498,0.639147
0.657983,0.68125,0.796697,0.916331,0.795423,0.591071,0.652904,0.681908,0.62455,0.648333,0.657881,0.714359,0.862064,1.044954,0.98047,0.883628,1.014038,1.089022,0.946515,0.773867,0.763259,0.952467,0.905418,0.691064,0.687005,0.835557,0.822094,0.597974
0.690918,0.696666,0.747437,0.840394,0.760533,0.562004,0.584679,0.597497,0.539744,0.577848,0.646779,0.715163,0.802094,0.968587,0.957953,0.874554,0.923083,0.958079,0.880301,0.765681,0.73354,0.90394,0.870168,0.614105,0.602517,0.732393,0.705734,0.522901
0.672014,0.682791,0.63815,0.657135,0.638956,0.48347,0.449183,0.453976,0.429702,0.499593,0.602974,0.646069,0.641539,0.765827,0.814163,0.728646,0.688634,0.704043,0.709636,0.666554,0.619724,0.70765,0.705739,0.519192,0.510489,0.57145,0.53151,0.439732
0.603297,0.608868,0.562318,0.517742,0.487251,0.396343,0.346182,0.369755,0.405919,0.515815,0.591848,0.530706,0.457477,0.552778,0.620382,0.549811,0.487495,0.491679,0.537106,0.559718,0.504227,0.475173,0.50891,0.454192,0.443019,0.473159,0.42931,0.378545
0.537199,0.506625,0.476613,0.440455,0.4023,0.351756,0.307102,0.33373,0.388051,0.525769,0.578765,0.432629,0.330107,0.374894,0.417747,0.407685,0.391405,0.387834,0.436851,0.496793,0.422546,0.32505,0.366291,0.380845,0.383765,0.43733,0.394318,0.324749
0.432245,0.383905,0.377508,0.373957,0.328343,0.290117,0.267045,0.281586,0.306777,0.426982,0.483281,0.354067,0.264817,0.262365,0.270107,0.288523,0.312388,0.321533,0.355002,0.405028,0.334847,0.249911,0.285932,0.294419,0.297354,0.382731,0.359878,0.261111
0.284056,0.260306,0.307487,0.319828,0.25759,0.235925,0.250441,0.252405,0.221464,0.280673,0.322083,0.256638,0.230115,0.231215,0.222822,0.241511,0.264073,0.258699,0.269315,0.294569,0.239759,0.191793,0.226365,0.232993,0.220004,0.284114,0.279397,0.192596
0.173976,0.179415,0.248892,0.26362,0.206207,0.197338,0.23128,0.231297,0.196893,0.217214,0.209281,0.179759,0.203406,0.215838,0.199227,0.20755,0.229528,0.20407,0.179477,0.188501,0.179667,0.175268,0.187441,0.18454,0.176281,0.203732,0.207676,0.166903
0.11706,0.143301,0.194635,0.196792,0.158542,0.151556,0.179616,0.183825,0.177011,0.187525,0.153965,0.139907,0.184891,0.192283,0.161711,0.154364,0.181902,0.164791,0.148178,0.165256,0.166789,0.16863,0.164969,0.150206,0.145878,0.158419,0.16181,0.151371
0.104511,0.128072,0.157927,0.152141,0.124685,0.114872,0.141613,0.165058,0.161609,0.153446,0.127694,0.118385,0.153806,0.150778,0.121433,0.108806,0.133074,0.143418,0.152097,0.167536,0.159645,0.157198,0.148735,0.130392,0.128624,0.140334,0.129771,0.120497
0.098528,0.103084,0.116148,0.116966,0.115327,0.12027,0.139537,0.160436,0.143018,0.121212,0.111043,0.105803,0.125828,0.120118,0.097505,0.085465,0.097688,0.117636,0.150411,0.169562,0.144479,0.132313,0.131001,0.120371,0.123101,0.126225,0.105938,0.096968
0.093781,0.083866,0.1,0.130912,0.145623,0.149332,0.139433,0.133046,0.120643,0.106122,0.104843,0.101785,0.1119,0.106016,0.082306,0.079593,0.086707,0.098864,0.132654,0.152007,0.123575,0.102281,0.114149,0.114996,0.119103,0.117262,0.105824,0.090179
0.08841,0.07503,0.094372,0.149987,0.181296,0.172615,0.129891,0.104267,0.108944,0.108892,0.109531,0.109518,0.118497,0.105716,0.07054,0.070739,0.077108,0.090311,0.117768,0.121089,0.101573,0.087564,0.109294,0.121559,0.117186,0.105393,0.110291,0.094269
0.078518,0.067076,0.083467,0.143237,0.187554,0.169708,0.119486,0.098338,0.106572,0.105502,0.103857,0.105373,0.110503,0.093135,0.05584,0.053621,0.064614,0.087262,0.114268,0.099662,0.07917,0.080664,0.105801,0.115484,0.102502,0.090055,0.108188,0.097789
0.059671,0.055171,0.065211,0.11068,0.15068,0.13119,0.096495,0.08783,0.09547,0.094176,0.089225,0.087025,0.081186,0.066409,0.044982,0.043454,0.054796,0.077928,0.097288,0.078973,0.063809,0.070126,0.087353,0.09053,0.076351,0.065754,0.090033,0.090644
0.046566,0.050832,0.053462,0.076416,0.093583,0.076959,0.064892,0.066778,0.074755,0.077786,0.073468,0.068476,0.053563,0.039694,0.033127,0.039049,0.056709,0.067129,0.06924,0.059096,0.055082,0.063023,0.066904,0.065858,0.060449,0.049681,0.065613,0.074222
0.041672,0.050391,0.04934,0.059998,0.060038,0.042338,0.043968,0.05039,0.0542,0.054308,0.049552,0.047263,0.039173,0.03267,0.028896,0.039129,0.063343,0.059238,0.053932,0.056464,0.052504,0.057609,0.052114,0.043881,0.047721,0.046961,0.048731,0.055665
0.040078,0.044231,0.045227,0.050958,0.052363,0.039634,0.038739,0.042205,0.044584,0.041864,0.03059,0.028444,0.035788,0.036634,0.028206,0.037689,0.064275,0.056981,0.048613,0.059092,0.058793,0.0513,0.036269,0.025507,0.033167,0.046517,0.040552,0.041499
0.034815,0.033678,0.039097,0.039373,0.041561,0.035811,0.0322,0.038085,0.04221,0.045772,0.033692,0.027195,0.040254,0.038206,0.025564,0.033544,0.05527,0.049088,0.039363,0.053415,0.061664,0.047809,0.032221,0.020074,0.023141,0.045762,0.045883,0.039105
0.028027,0.027738,0.031669,0.027048,0.026286,0.026172,0.027188,0.037316,0.048497,0.058943,0.046524,0.034989,0.043834,0.037728,0.02461,0.02837,0.039198,0.037968,0.029275,0.039407,0.059656,0.054865,0.035475,0.020281,0.021807,0.043319,0.050945,0.036948
0.023473,0.023599,0.026162,0.021871,0.014108,0.016384,0.025153,0.03467,0.0505,0.068197,0.05737,0.04086,0.040168,0.036158,0.025299,0.020797,0.022819,0.028832,0.026195,0.027313,0.050709,0.058491,0.035048,0.019319,0.024146,0.037704,0.049746,0.032774
