1.1e-05,4e-06,2e-05,1e-06,1.1e-05,3e-06,4.5e-05,1.9e-05,5.3e-05,5e-06,9e-06,4.7e-05,4.6e-05,8.6e-05,8.2e-05,1.7e-05,2e-06,7.7e-05,4.6e-05,1e-06,3.9e-05,4.5e-05,4e-06,0.000109,0.000154,0.000264,0.000126,0.000125,0.000163,6.2e-05,4e-05,9e-06,0.000251,8.2e-05,0.000126,8.6e-05,0.000206,0.000112,0.000129,2.1e-05,9.6e-05,8.4e-05,1.5e-05,2.7e-05,9.6e-05,0.000158,6.6e-05,0.000105,9e-06,4.4e-05,1.9e-05,7.4e-05,1.7e-05,6.2e-05,2.4e-05,4.5e-05,3.8e-05,5.4e-05,3.8e-05,2.9e-05,4.5e-05,0.000105,5.2e-05,6.9e-05,7.1e-05,1.5e-05,3.7e-05,1.9e-05,1e-06,4e-06,5e-06,1e-06,2.2e-05,6e-06,9e-06,3.1e-05,8.6e-05,0.000116,2.1e-05,0.000121,2e-05,3.3e-05,6.9e-05,3e-06,3e-05,6.5e-05,3.6e-05,3.1e-05,1.3e-05,4e-06,5e-06,1e-05,6e-05,3e-05,8e-06,4.4e-05,4.4e-05,3e-05,2e-06,1.2e-05,4.8e-05,7e-06,5e-06,0,4.4e-05,5e-06,2.4e-05,1e-05,2.5e-05,1.9e-05,1.6e-05,1.2e-05,1.6e-05,1.2e-05,1.2e-05,8e-06,4e-06,4.3e-05,3.9e-05,1.3e-05,1.4e-05
4.1e-05,3e-05,3.7e-05,2.2e-05,1.1e-05,2.8e-05,6.2e-05,0.000115,6e-05,7.1e-05,7.9e-05,7e-05,0.000191,0.000155,0.000237,0.000214,0.000126,0.000123,0.000191,0.000212,0.000127,0.000124,6.2e-05,0.000399,0.000452,0.000768,0.000533,0.000382,0.000158,0.000238,0.000259,0.000314,0.000694,0.000861,0.000257,0.000276,0.000329,0.000519,0.000328,0.000222,0.000112,3e-05,6.7e-05,5.3e-05,0.000183,0.000402,0.000451,0.000419,0.000349,0.000167,9.8e-05,0.000119,0.000121,0.000129,0.000128,5.6e-05,0.000164,8.2e-05,4.7e-05,0.000149,0.000136,0.000217,0.000132,0.000186,6.6e-05,0.000126,6.8e-05,6.8e-05,9.1e-05,1.6e-05,1.5e-05,1e-05,3.5e-05,7.9e-05,6.6e-05,9.9e-05,0.000231,0.000378,0.000268,0.000187,0.000192,0.000118,7.6e-05,0.000105,6.3e-05,4.5e-05,0.000104,5.6e-05,8.2e-05,4.2e-05,4.4e-05,6e-05,6.6e-05,4.8e-05,5.3e-05,0.000123,0.000139,7.5e-05,3e-05,4.3e-05,6.5e-05,7.1e-05,5.7e-05,5e-05,0.000156,3.5e-05,1.4e-05,4.3e-05,1.7e-05,6.8e-05,2e-05,1.5e-05,3.7e-05,1.5e-05,6.5e-05,8e-05,4.1e-05,0.000128,9.7e-05,2.9e-05,5.7e-05
4.4e-05,4.2e-05,3.9e-05,1.4e-05,4e-05,1.8e-05,4.2e-05,3.7e-05,3.9e-05,1.5e-05,6.1e-05,7.4e-05,0.000149,0.000138,0.000141,0.000156,7e-05,4.8e-05,9.2e-05,0.000149,9.7e-05,9.5e-05,0.000231,0.00061,0.000279,0.000346,0.000231,0.00013,0.00018,0.000213,0.000144,0.000236,0.00038,0.001126,0.000964,0.000262,7.3e-05,0.000231,0.000114,9.9e-05,9e-05,8.6e-05,2e-05,7e-05,0.000235,4.5e-05,0.000495,0.00034,9.7e-05,2.1e-05,1e-04,8.1e-05,0.000137,9.8e-05,0.000179,0.000135,9e-05,4.9e-05,4.2e-05,0.000126,9.5e-05,4e-05,1.8e-05,8.7e-05,5.9e-05,0.000143,6.6e-05,5.8e-05,6.2e-05,4.9e-05,3.1e-05,2.3e-05,4.4e-05,9.6e-05,1.6e-05,0.000121,0.000186,7.4e-05,3.5e-05,9.1e-05,8.8e-05,9.1e-05,1.8e-05,5e-05,0.000102,5.1e-05,5.5e-05,8.3e-05,0.000134,5.7e-05,8.6e-05,3.1e-05,0.000119,9.3e-05,8.5e-05,0.00017,0.000158,1.4e-05,5.7e-05,4.8e-05,0.000106,0.000132,4.1e-05,1.9e-05,0.000184,0.000131,6.7e-05,3.7e-05,2.3e-05,2e-05,5.8e-05,4e-05,2.1e-05,6.1e-05,7.1e-05,6.3e-05,3.7e-05,0.000173,0.000133,5.3e-05,5.2e-05
5.3e-05,3.2e-05,6.1e-05,9.5e-05,9.2e-05,7.5e-05,9.7e-05,3.3e-05,2.9e-05,8.7e-05,9.7e-05,2.6e-05,0.000108,0.000108,4.3e-05,8e-05,0.000132,0.000158,3.6e-05,0.000111,4e-05,7.6e-05,0.000123,0.000226,8.2e-05,0.00021,2.4e-05,4.3e-05,0.000218,0.000128,0.000168,6.4e-05,0.000411,0.00055,0.000134,0.000253,0.000182,1.2e-05,0.00019,0.00012,7.8e-05,6.1e-05,0.000124,8.2e-05,8.7e-05,0.000202,0.000542,0.000302,0.00014,0.000227,0.000137,4.9e-05,0.000103,0.000151,3.1e-05,0.000109,0.000161,0.000149,0.000103,6.1e-05,0.000109,8e-05,5.1e-05,7.8e-05,1.9e-05,9.6e-05,0.000168,0.000107,0.000112,8e-05,2.8e-05,7.1e-05,2.7e-05,8.2e-05,0.000112,6.2e-05,0.000159,9.3e-05,7.8e-05,0.000159,0.000132,5.3e-05,2.4e-05,5e-05,4.4e-05,7.8e-05,5.1e-05,0.000102,9.3e-05,3.3e-05,0.000103,0.000141,4.7e-05,0.000151,6.5e-05,0.000159,4.5e-05,0.000137,2.4e-05,4e-05,0.000101,0.000101,0.000187,0.000141,0.000133,0.000121,0.000116,0.000117,0.000111,7.3e-05,0.000122,0.000153,0.000157,3.9e-05,6.5e-05,0.000105,7e-05,9.6e-05,4.5e-05,9.6e-05,7.9e-05
3.1e-05,3.2e-05,4.9e-05,9.5e-05,4.8e-05,7.4e-05,8.7e-05,0.000145,4.7e-05,8e-05,3.7e-05,3.9e-05,7.1e-05,6.4e-05,7.8e-05,5.3e-05,5.9e-05,8e-05,7.6e-05,8e-06,6.1e-05,6.5e-05,8.6e-05,0.000184,0.000114,0.000194,3e-05,3.4e-05,0.000192,9.3e-05,9.4e-05,6.3e-05,0.000365,0.000107,0.000143,4.4e-05,0.000135,0.000151,0.000141,6.7e-05,2.5e-05,0.000119,0.000189,0.000116,0.000102,0.000187,0.000216,5.3e-05,0.000102,2e-04,0.000231,0.000204,0.000225,0.000132,8.1e-05,0.000167,0.000157,0.000123,0.000102,6.8e-05,9.2e-05,7.2e-05,2e-05,0.00011,0.00014,9.3e-05,8.4e-05,4.5e-05,0.000122,0.000173,0.00016,0.000117,8.4e-05,5.9e-05,8.9e-05,1.3e-05,0.00016,0.00011,8.7e-05,8.4e-05,4.9e-05,0.000105,0.000169,0.000156,0.000101,3.9e-05,3.1e-05,0.000128,5.6e-05,6.8e-05,0.000125,6.6e-05,0.000154,0.000165,0.000162,0.00018,0.000111,0.000174,0.000214,0.000107,9.3e-05,0.000106,0.000144,0.000113,0.000125,5.1e-05,0.000126,7.5e-05,4.7e-05,7.2e-05,9.6e-05,0.000179,0.000133,7.4e-05,5.8e-05,1.2e-05,6.3e-05,5.9e-05,1.7e-05,9.8e-05,0.000112
6e-05,6.9e-05,7e-05,5e-05,0.00012,5.5e-05,9.8e-05,0.000147,7.4e-05,3.2e-05,7.1e-05,7.9e-05,4.1e-05,0.000107,8.6e-05,7e-05,5.5e-05,9.2e-05,7.7e-05,3.9e-05,9.1e-05,1.4e-05,0.000167,0.000323,1e-04,0.000126,0.000143,6.6e-05,0.000275,0.000144,6.1e-05,4.8e-05,0.000209,9.2e-05,4.2e-05,0.000192,7.8e-05,7.7e-05,0.000154,6.7e-05,4.4e-05,2.9e-05,9.7e-05,2.7e-05,0.000122,0.000118,3.5e-05,0.000176,7.3e-05,5.2e-05,0.000111,9.8e-05,0.000169,7.2e-05,0.000184,0.000125,0.000175,6.3e-05,6.3e-05,0.00018,5.9e-05,5.1e-05,6.6e-05,4.5e-05,0.000123,8.2e-05,2.6e-05,4.4e-05,8.9e-05,0.000116,5.5e-05,5.3e-05,4.5e-05,8.8e-05,0.000103,0.00014,2.5e-05,9e-06,8.7e-05,0.000113,4.4e-05,6.5e-05,0.000182,1.3e-05,5e-05,8.2e-05,0.000143,0.000149,4.5e-05,0.000141,9.2e-05,0.000117,0.000186,0.000101,5.2e-05,0.000134,8.6e-05,8.3e-05,0.00023,0.000127,0.000234,4.9e-05,0.000101,7.8e-05,0.000106,0.000101,0.000246,0.000151,4.2e-05,2.7e-05,0.00013,0.000155,4.7e-05,3.1e-05,2.7e-05,0.000163,5.5e-05,0.000221,0.000128,9.2e-05,0.000187
6.5e-05,4.6e-05,5.9e-05,5.7e-05,0.000127,0.000173,0.000194,0.000146,0.000126,8.5e-05,4e-05,5.1e-05,5.7e-05,0.000133,0.000177,0.000163,9.8e-05,0.000118,7.8e-05,9e-05,9.3e-05,5.1e-05,0.000103,0.000264,0.000222,0.000182,0.000225,0.000135,0.000312,0.00015,6.2e-05,0.000119,6.6e-05,0.000206,9.9e-05,0.000255,0.000158,3.1e-05,0.00033,0.000358,0.000181,0.000126,9.7e-05,8.7e-05,8.6e-05,8.3e-05,5.5e-05,0.000172,0.000101,0.000122,7.8e-05,9.4e-05,0.00013,7.8e-05,2e-04,0.000204,0.000181,0.000145,0.000109,0.000179,0.000124,0.000124,7.2e-05,0.000243,0.000179,0.000189,0.000237,4.5e-05,8e-05,7.2e-05,0.000117,9.8e-05,9.1e-05,4.8e-05,0.000226,0.000191,0.000115,7.6e-05,7.4e-05,9.9e-05,0.000177,9.4e-05,0.00014,0.000134,0.000157,0.000264,6e-05,0.000154,8.5e-05,0.000149,9.3e-05,8.1e-05,0.000266,0.000262,0.000194,0.000103,0.000318,6.4e-05,0.000184,0.000238,0.000153,0.000198,0.000241,0.000212,0.000124,5.1e-05,0.000262,0.00012,6.2e-05,4.2e-05,0.000131,0.000188,5.1e-05,9.2e-05,0.000147,0.000363,3e-04,0.000423,0.000367,0.000207,0.000164
3.7e-05,9.4e-05,0.000124,7.6e-05,0.000117,3.8e-05,5.6e-05,0.00012,0.000159,9e-05,7.2e-05,4.6e-05,7.9e-05,0.000146,0.000176,8.1e-05,3.6e-05,0.000116,0.000135,7.3e-05,6.4e-05,6.6e-05,9.8e-05,0.000166,0.000103,0.000118,0.00017,9e-05,0.000326,0.000351,0.000172,0.000205,0.000252,0.000148,0.000234,0.000106,0.000135,0.000163,0.000403,0.000315,0.000191,0.000141,9e-05,9e-05,0.000148,0.000179,4.1e-05,0.000271,0.000332,0.000261,8.9e-05,0.000104,0.000179,0.000111,0.000235,7.4e-05,0.000274,0.000305,0.000206,3.4e-05,0.000212,0.000188,5.9e-05,0.000344,0.000404,0.000208,0.000198,0.000143,1e-04,0.000135,0.000103,0.000142,0.000176,0.000133,0.000254,9e-05,0.000114,0.000132,0.000108,7.1e-05,0.000152,5e-05,0.00018,0.00018,0.000115,0.000282,0.000176,0.000195,0.000124,9.7e-05,3.5e-05,0.000122,0.000288,0.000252,0.000313,0.000141,0.000298,0.000308,0.000318,0.000291,0.000327,0.000201,0.000141,0.000146,1e-04,0.000124,0.000287,0.000251,3e-05,4.6e-05,0.000215,0.000202,0.000243,0.000221,7.8e-05,0.000219,0.000195,0.000172,0.000305,3.5e-05,0.000158
0.000156,0.000126,0.00014,7e-05,1.9e-05,0.000135,2.3e-05,1.8e-05,3.7e-05,9e-05,2.4e-05,8e-05,1.8e-05,0.000109,0.000163,2.9e-05,6.8e-05,0.000256,9.5e-05,1.8e-05,8.5e-05,5.1e-05,0.000269,0.000241,0.000139,2e-04,0.000117,0.000161,0.000359,0.000106,0.000291,0.000152,0.000177,0.000158,0.00011,0.000121,0.000274,0.000114,0.000201,0.000146,9.3e-05,5.6e-05,0.00011,0.000218,0.000263,0.000223,0.00019,0.000139,0.000339,0.000302,0.000191,7.6e-05,0.000202,0.000252,0.000171,0.000303,0.000312,7.8e-05,0.00017,8.3e-05,0.000184,8.9e-05,0.000176,0.00028,7e-05,0.000109,0.000224,0.000201,0.000248,0.000124,0.000167,0.000188,7.6e-05,0.000194,0.000303,0.000272,0.000168,0.000148,6.3e-05,0.000207,0.000125,0.00021,0.00015,4.7e-05,0.000215,0.000338,0.000197,0.000363,0.000186,0.000125,4.9e-05,0.00018,0.000203,0.000166,0.000225,0.000312,0.000255,0.000245,0.000137,6.5e-05,9.9e-05,5.6e-05,0.000131,0.000121,0.000194,0.00021,4e-05,0.000146,0.000186,0.000115,0.000302,0.000225,0.00012,0.000189,0.000226,0.00024,0.000117,0.000207,0.000251,0.000179,0.000222
0.00019,2.9e-05,0.000131,3e-05,6.3e-05,0.000185,0.000128,3.9e-05,5.3e-05,0.000112,0.000127,0.000107,7.6e-05,0.00013,0.000258,0.000199,0.000141,0.000277,0.000421,0.000252,0.000169,8.8e-05,0.000379,0.000154,0.000133,0.000393,0.00038,0.000363,0.000603,0.000537,0.000436,0.000112,0.000198,0.000168,7.7e-05,7.1e-05,0.000278,0.000332,0.000204,0.000178,0.000204,0.000282,0.000256,0.000119,0.000205,0.000348,9.8e-05,7.9e-05,0.000279,0.000345,0.000144,0.000149,0.000243,0.000172,0.000233,0.000388,0.000287,0.000302,9.2e-05,0.000159,0.000188,0.00011,0.000215,0.00018,2e-04,0.000135,0.000277,0.000145,0.000134,8.6e-05,0.000278,0.000156,0.000302,0.000384,0.000331,0.000154,0.000124,1.4e-05,7.9e-05,0.000322,0.000182,0.000305,0.000248,0.000252,0.000353,0.000131,0.00017,0.000222,0.00018,0.000291,0.000336,0.000234,0.000522,0.000604,0.000266,0.000418,0.000403,0.00024,0.000269,7.8e-05,5e-05,0.000146,0.000202,0.000194,2e-04,0.000224,8.3e-05,0.000151,0.000348,0.000275,0.000136,0.000173,9.7e-05,0.00012,0.000115,0.000117,9.3e-05,0.000294,0.000507,0.000314,0.000153
0.000183,0.000169,0.000172,0.000138,0.000134,0.000237,0.000177,0.000205,2e-04,0.000204,3.5e-05,3.5e-05,6.4e-05,0.000205,0.000108,3.2e-05,0.000111,0.000279,0.00046,0.000298,7.7e-05,0.000176,0.000303,0.000255,0.000291,0.000356,0.000341,2.3e-05,0.000242,0.000385,0.000272,0.000324,0.000387,0.000173,0.000131,3.4e-05,0.000192,0.000217,0.000223,0.000281,0.000106,0.000333,0.000207,8.9e-05,5.5e-05,0.000224,0.000238,1.6e-05,0.000239,5.3e-05,0.000143,0.000192,0.000137,0.000257,0.000288,0.000229,4.1e-05,0.000274,0.000267,0.000252,0.000247,0.000182,0.000307,0.000326,0.000134,0.000225,0.000165,0.000109,5.3e-05,8.5e-05,0.000223,0.000176,0.00033,0.000251,0.000101,3.4e-05,0.000113,7.8e-05,9.9e-05,0.000402,0.000168,0.000259,0.000181,0.000224,0.000336,0.000222,4e-04,0.00032,3.9e-05,0.000162,0.000291,0.00022,0.000539,0.000404,0.000174,0.000371,0.000408,0.000364,0.000115,1.8e-05,2.5e-05,0.000181,0.000216,3e-05,0.000139,0.000181,0.000263,2e-04,0.000248,7.4e-05,2e-05,5.1e-05,6e-05,6.8e-05,0.000163,0.000128,0.00011,0.000223,0.000341,0.000328,0.000119
9.1e-05,8.3e-05,7.4e-05,5.2e-05,3.1e-05,0.000138,1.2e-05,0.000125,1.4e-05,9.9e-05,0.000172,0.000113,0.000123,6.9e-05,2.7e-05,6.5e-05,0.000141,0.000214,0.000115,4.2e-05,0.000167,0.000167,8e-06,2.8e-05,0.000144,0.000127,6e-05,0.000232,0.000209,0.000183,0.000103,0.000204,0.000188,0.000179,0.000179,0.000117,0.000105,6.2e-05,0.000155,0.000195,0.000123,0.000283,0.000143,0.000122,9.4e-05,0.000182,4.8e-05,0.000189,8.5e-05,0.000131,0.00016,0.000119,0.000244,0.000418,0.000161,0.000227,0.000177,6.9e-05,2.9e-05,0.000126,9e-05,0.000177,0.000187,0.00031,0.000172,0.000166,0.000173,9.8e-05,8.8e-05,8.3e-05,0.000245,0.000228,0.000208,0.000102,0.000119,0.000169,0.000122,5.1e-05,0.00013,0.000196,0.000195,0.000146,0.000161,9.9e-05,0.000146,0.000228,0.000311,0.00013,5.8e-05,0.000101,0.000113,0.000102,0.000247,7.9e-05,0.000134,0.000402,5.5e-05,0.000142,3.4e-05,3e-05,7.7e-05,8.3e-05,4e-05,6.9e-05,4.6e-05,0.000163,0.000159,0.000266,0.000104,9.6e-05,0.000135,5.3e-05,0.000109,0.000133,0.000218,0.00017,8e-05,7.2e-05,0.000119,0.000148,0.000121
6.6e-05,4.5e-05,1.5e-05,9.4e-05,6.4e-05,5.2e-05,5.4e-05,5.6e-05,6.1e-05,0.000125,3.6e-05,2e-05,4e-05,8.4e-05,0.000129,0.000128,3.6e-05,0.000118,5.9e-05,7.5e-05,5.9e-05,0.000113,9.4e-05,7.3e-05,8.2e-05,0.000146,0.000111,0.000258,0.000203,0.000134,0.000129,0.000163,0.000193,0.000159,1.4e-05,1.8e-05,9.7e-05,0.000158,7.6e-05,0.000113,8.6e-05,9.4e-05,5.7e-05,0.000148,0.000157,6.6e-05,8.9e-05,0.000117,0.000102,1.9e-05,4e-05,7.6e-05,4.3e-05,0.000119,0.000114,9.8e-05,7e-05,9.2e-05,5.9e-05,4.8e-05,5e-05,0.000203,0.000329,6.9e-05,9.5e-05,0.000104,8.9e-05,5.9e-05,5.6e-05,6.4e-05,0.000118,4.1e-05,0.000122,9.3e-05,8.2e-05,0.000117,8.6e-05,8.4e-05,8.4e-05,4.5e-05,0.00015,2.9e-05,0.000148,5.4e-05,0.000103,0.000314,7e-05,8.6e-05,5.7e-05,5.1e-05,2e-05,6.8e-05,0.000136,4.9e-05,9.8e-05,0.000216,0.000183,0.000194,0.000126,4e-06,0.000149,1e-04,5.6e-05,1.8e-05,0.00012,4e-05,0.000144,0.000199,8e-05,2e-06,8.3e-05,8.8e-05,0.00011,0.000191,2.6e-05,8.1e-05,3.1e-05,0.000187,0.00022,5.8e-05,6.3e-05
3e-05,2.9e-05,3.1e-05,9.5e-05,6e-06,3.1e-05,4.2e-05,7.1e-05,8.9e-05,2.4e-05,5e-05,5.9e-05,5e-05,0.000108,6.2e-05,0.000103,4.4e-05,0.000132,9.1e-05,1e-04,5.4e-05,0.000202,0.000108,4.7e-05,0.000155,0.000116,3e-05,8.3e-05,9.1e-05,5.4e-05,8e-06,4.7e-05,8.2e-05,3.6e-05,9e-06,4e-05,5.9e-05,0.000152,8.7e-05,0.000224,0.000101,0.000112,0.000117,0.000163,2.5e-05,9.1e-05,4.5e-05,0.000147,7.6e-05,8.4e-05,8.7e-05,6.6e-05,3e-05,3.7e-05,7.4e-05,7e-05,3.7e-05,0.000208,0.00017,3.9e-05,9.8e-05,0.000192,0.000127,3.4e-05,2.2e-05,9.2e-05,5.3e-05,7.5e-05,2.9e-05,0.000141,1.8e-05,5.2e-05,0.000111,0.000165,2.1e-05,6.1e-05,0.000107,6.1e-05,7.4e-05,0.000153,8.9e-05,3.5e-05,5.6e-05,6e-06,8.5e-05,0.000179,0.000109,8.1e-05,0.000102,6.5e-05,0.000125,3.1e-05,5.9e-05,0.000159,1.8e-05,0.00012,0.000103,0.000103,0.000144,3.7e-05,0.000147,7.2e-05,4.5e-05,3.3e-05,0.000177,0.000139,7.5e-05,0.000157,6.4e-05,6.8e-05,8e-05,8.8e-05,4.5e-05,0.00012,0.000154,0.00011,8.4e-05,0.000183,0.000108,0.000146,3.3e-05
7.8e-05,1.3e-05,2.7e-05,3.9e-05,9e-05,2.7e-05,4.1e-05,6.8e-05,8.7e-05,3.3e-05,2.3e-05,3.1e-05,7.1e-05,5e-05,1e-05,3.2e-05,5.1e-05,9.4e-05,0.000101,4.9e-05,6.1e-05,0.000187,5.2e-05,0.000112,0.000185,0.000158,8e-05,0.000147,0.000158,0.000107,0.00014,0.000166,6e-05,8.1e-05,2.3e-05,6.5e-05,5.6e-05,7.2e-05,0.000178,0.000207,0.000171,6.9e-05,0.000156,0.000115,8.6e-05,3.3e-05,7.8e-05,0.000194,6e-05,4.7e-05,7.9e-05,6.5e-05,0.000111,0.000178,8.2e-05,8.7e-05,3.1e-05,0.000175,3e-06,8.6e-05,0.000162,6e-06,0.00014,0.000133,6.3e-05,0.000134,0.000118,0.000118,4.9e-05,0.000214,0.000179,0.000118,0.000122,3.5e-05,0.000159,9.5e-05,6.8e-05,8.5e-05,0.000164,7.5e-05,0.000154,0.000125,0.000182,8.5e-05,7.4e-05,0.000124,6.9e-05,4.4e-05,0.000119,0.000171,7.4e-05,6.7e-05,8.6e-05,5.5e-05,7.7e-05,0.000151,2.4e-05,0.000114,9.9e-05,0.000121,0.000177,0.000167,0.000121,4.7e-05,9.9e-05,7.3e-05,8.2e-05,7.3e-05,0.000182,0.000157,0.000159,7.8e-05,2.1e-05,4.1e-05,5.5e-05,5.7e-05,0.000157,6.3e-05,0.000173,0.000157,0.000103
4.2e-05,5e-05,6.4e-05,6.1e-05,7.6e-05,5.6e-05,1e-04,4.1e-05,9.9e-05,0.000109,6.1e-05,7.6e-05,8.8e-05,2.6e-05,1.9e-05,5.6e-05,9.1e-05,0.000154,0.000203,0.000214,8.6e-05,6.5e-05,9.6e-05,0.000101,2.5e-05,5.3e-05,6.4e-05,0.000254,0.000126,0.000142,0.000195,0.000186,7.2e-05,0.000116,0.000133,0.00013,4.3e-05,1.4e-05,0.000205,0.000274,0.000284,0.000239,2e-04,0.000162,1.7e-05,2.6e-05,4.8e-05,0.000204,0.000177,9.8e-05,0.000106,9.2e-05,4.2e-05,0.000106,5.1e-05,5.3e-05,0.00013,9.8e-05,7.7e-05,9.4e-05,8.6e-05,7.3e-05,0.000125,9.4e-05,0.000113,0.000244,0.000115,5.7e-05,4.8e-05,0.000256,0.000206,9.5e-05,7e-05,0.000108,0.000127,8.6e-05,2.3e-05,0.000133,8.2e-05,7.8e-05,0.000102,2.5e-05,0.000191,0.000167,7.9e-05,5.3e-05,0.000172,8.6e-05,0.000121,0.000101,9.1e-05,0.000137,0.000259,0.000256,0.000109,0.000192,8.2e-05,5.9e-05,5.1e-05,8e-06,1.1e-05,2.7e-05,5.6e-05,9.1e-05,3.7e-05,6.3e-05,0.000108,0.000102,0.00016,4.7e-05,0.000159,0.000198,0.000144,8.4e-05,6.3e-05,0.000128,0.000109,6e-05,0.000206,0.000124,4.5e-05
4.7e-05,3.2e-05,4.7e-05,2.7e-05,0.000121,3.3e-05,0.000104,0.000132,5.6e-05,8.5e-05,5.4e-05,1e-04,0.000118,8.8e-05,0.000114,3.7e-05,7.1e-05,7.7e-05,0.000157,0.000108,2.6e-05,7.7e-05,0.000108,8e-05,8.2e-05,4.3e-05,0.000166,0.000201,0.00012,0.000151,0.000117,4.7e-05,8.8e-05,8.8e-05,0.00012,0.000152,9.3e-05,6.1e-05,0.000169,0.00014,0.000142,9.5e-05,7.5e-05,0.000133,6.2e-05,9.2e-05,3.3e-05,7.5e-05,0.000141,8.1e-05,0.000119,4.1e-05,0.000235,8.3e-05,2.2e-05,4e-06,0.000116,0.000176,0.000212,0.00018,5.3e-05,9.7e-05,5.3e-05,9.7e-05,0.000141,0.000123,5.1e-05,2.9e-05,4.5e-05,0.000187,2.2e-05,2.4e-05,2.8e-05,9e-05,9e-05,0.000136,3.4e-05,1e-04,9.1e-05,8.5e-05,0.000148,0.000119,0.000161,5e-05,0.000153,0.000131,0.000188,0.000159,5.9e-05,4.3e-05,7e-05,0.000111,0.00017,9e-05,0.000102,8.4e-05,9.6e-05,3.7e-05,0.000158,8.3e-05,0.000114,6.3e-05,1.3e-05,0.000111,0.000171,7.6e-05,6.7e-05,8.4e-05,8e-05,0.00017,0.00019,0.000147,8e-05,3.3e-05,7.5e-05,8.3e-05,0.000234,0.000145,0.000107,3.4e-05,3.3e-05
8.2e-05,7.8e-05,7e-05,6.2e-05,0.000138,0.000151,0.000105,5.2e-05,0.00011,0.000106,9.8e-05,0.000133,9.9e-05,0.000146,0.000181,0.000197,5.8e-05,0.000106,8.6e-05,0.000239,0.000233,0.000219,2e-05,9.2e-05,0.000206,0.000154,0.000252,0.000302,0.000196,0.000334,0.000325,0.000154,9.1e-05,0.000102,0.000251,0.000126,2e-06,7.3e-05,0.000136,0.00032,0.000291,9.5e-05,3e-05,7.9e-05,7.7e-05,0.000123,0.000203,0.000206,0.000205,0.000103,0.000129,0.000141,0.000363,0.000457,0.000251,5.5e-05,0.000144,0.000326,0.000265,0.000293,0.000261,2.7e-05,0.000139,0.000106,0.000226,0.000259,0.000159,0.000122,6e-05,7.3e-05,8.2e-05,5e-05,5.6e-05,1e-04,3e-05,0.000118,0.000235,0.000174,6.7e-05,0.00012,0.000106,8.2e-05,0.000237,0.000194,0.000164,0.000216,0.000373,0.000261,0.000209,9.5e-05,0.00014,0.000155,4.5e-05,0.000156,0.000185,0.000318,0.000352,0.000279,0.000262,0.000262,0.000322,0.000284,0.000189,6.5e-05,6e-06,0.00013,0.00013,0.000132,3.8e-05,0.000251,0.000337,0.000452,0.00029,0.000174,5.1e-05,0.000101,0.000181,0.00021,0.000189,0.000134,9.9e-05
2.6e-05,5.7e-05,7.9e-05,9e-05,7.9e-05,7.7e-05,6.6e-05,4.9e-05,2.5e-05,0.000111,5.9e-05,0.000124,0.000123,6e-05,7.5e-05,5.6e-05,2.9e-05,0.000129,3.8e-05,0.000164,3.1e-05,5.2e-05,9.2e-05,0.000126,0.000215,0.000143,0.000144,7.1e-05,2.1e-05,0.000285,0.000359,0.000188,0.000149,6.2e-05,0.000119,8.2e-05,0.000139,0.000104,9.4e-05,0.000261,0.000286,0.000266,0.000176,6.9e-05,0.000192,0.000166,0.000101,0.000278,9.3e-05,0.000111,9.4e-05,9.3e-05,0.000255,0.000128,8.8e-05,0.000107,0.000162,0.000169,0.000104,0.000206,9.5e-05,0.000173,0.000183,0.000222,3.1e-05,0.000123,1.5e-05,5.3e-05,0.000127,0.000188,0.000176,0.000125,8.2e-05,5e-05,6.2e-05,0.00014,0.000259,8.7e-05,2.4e-05,0.000104,9.5e-05,6.5e-05,0.00012,2.2e-05,9.7e-05,0.000183,0.000101,3.9e-05,0.000101,0.00015,9.9e-05,0.000114,8.7e-05,0.000122,0.000109,0.000198,0.000183,0.000152,0.000128,0.000157,0.000133,0.00012,2.8e-05,0.000149,0.000168,0.00022,0.000108,6e-05,5.2e-05,0.000254,0.000125,0.000172,0.000163,5.9e-05,5.7e-05,0.000114,0.000104,7.2e-05,0.000184,0.000138,0.000122
5.3e-05,1.7e-05,8.5e-05,1.8e-05,3.4e-05,4.9e-05,2.6e-05,3.6e-05,8.4e-05,7.2e-05,7.9e-05,1.8e-05,6.1e-05,0.000142,5e-05,4.3e-05,4.6e-05,8.8e-05,6e-05,4.2e-05,0.000122,6.3e-05,6e-06,9.3e-05,7.5e-05,3.7e-05,9.6e-05,4.2e-05,4.9e-05,0.000266,0.000182,9.1e-05,0.000121,0.000123,2.8e-05,0.000137,8e-05,4.6e-05,9e-05,0.00015,4.2e-05,6.3e-05,4.3e-05,8.6e-05,0.000118,3e-06,0.000127,0.000135,0.000134,3.8e-05,6e-05,8e-05,0.000102,0.000121,6.8e-05,6.3e-05,0.00013,4.3e-05,8.3e-05,8.5e-05,4.8e-05,0.000109,2.4e-05,1e-04,0.000107,5.9e-05,0.00011,8.7e-05,7.9e-05,7.9e-05,0.000121,5.5e-05,5.6e-05,4.3e-05,4e-06,7.4e-05,6.7e-05,6e-05,4.5e-05,5.5e-05,5e-05,0.00012,5.2e-05,6.2e-05,0.00015,1.1e-05,6.7e-05,3.6e-05,2.6e-05,0.000121,6.5e-05,8e-05,0.000153,5.8e-05,3.8e-05,0.000101,7.6e-05,0.000114,0.000133,9.2e-05,4.9e-05,2.3e-05,0.000107,6.2e-05,8.2e-05,1e-04,6.5e-05,9.8e-05,4.2e-05,0.000151,0.00017,8.2e-05,6e-05,3.6e-05,5.7e-05,3.9e-05,7.9e-05,9.3e-05,0.000198,9.6e-05,3.8e-05
1.9e-05,3.1e-05,3.9e-05,4e-05,2.5e-05,3.1e-05,2.7e-05,1e-05,7.2e-05,2.5e-05,2.9e-05,2.8e-05,2.5e-05,0.000108,3.2e-05,3e-05,1.5e-05,3e-05,3.5e-05,4.7e-05,0.000102,3.1e-05,2.5e-05,7.7e-05,7.1e-05,1e-05,1.9e-05,7.7e-05,2.8e-05,0.00013,4.1e-05,2.1e-05,2e-05,6.5e-05,5.1e-05,6.8e-05,4.5e-05,6.5e-05,2.5e-05,8.4e-05,6.5e-05,2.6e-05,6e-05,9.7e-05,6.9e-05,1.3e-05,3.7e-05,8.3e-05,9.5e-05,6.3e-05,2.1e-05,4.8e-05,2.3e-05,1e-05,1.9e-05,2.7e-05,9.4e-05,3.4e-05,7.9e-05,3.2e-05,4.5e-05,7e-06,3.1e-05,9.1e-05,1.2e-05,4.8e-05,5.1e-05,6.8e-05,6.2e-05,5e-05,2.5e-05,9e-06,1.3e-05,6.4e-05,3.8e-05,2.9e-05,3.5e-05,4.2e-05,2.1e-05,3.5e-05,1.9e-05,7.8e-05,5.9e-05,9.3e-05,3.8e-05,2.2e-05,4.4e-05,1.8e-05,3.4e-05,9.5e-05,3.2e-05,5.4e-05,7.2e-05,7.5e-05,6.4e-05,0.000107,0.000112,1.5e-05,5.9e-05,6.4e-05,7.8e-05,1.7e-05,6.3e-05,8.6e-05,5.1e-05,5.5e-05,5.6e-05,6.1e-05,7.4e-05,6.3e-05,0.000101,7.2e-05,3.5e-05,5e-06,5.7e-05,4.5e-05,7.4e-05,0.000121,8.1e-05,2.6e-05,3.7e-05
1e-05,1.2e-05,2.6e-05,2e-05,4e-06,2.5e-05,1.4e-05,1.6e-05,4.5e-05,2.3e-05,1.7e-05,3e-05,3.5e-05,2.7e-05,3.9e-05,5.1e-05,2.4e-05,1.2e-05,4.3e-05,1.3e-05,4.6e-05,4e-05,9e-06,8.8e-05,7.2e-05,2.2e-05,1.5e-05,1.5e-05,4.3e-05,7.9e-05,3.4e-05,5.7e-05,5.6e-05,8.3e-05,9.2e-05,5.6e-05,2.5e-05,4.7e-05,5.4e-05,5.6e-05,3e-05,3.2e-05,4.9e-05,1e-05,4.4e-05,1.5e-05,5.2e-05,1.6e-05,6.5e-05,3e-05,6.9e-05,2.1e-05,3.1e-05,4.4e-05,2.3e-05,3.3e-05,9.5e-05,2e-05,4.9e-05,4.4e-05,4.5e-05,5.8e-05,3.3e-05,7.8e-05,7.3e-05,4.2e-05,4e-05,4.8e-05,2.7e-05,1.3e-05,4.3e-05,2.9e-05,1.4e-05,5.4e-05,1.7e-05,5.9e-05,7.4e-05,4.4e-05,4.3e-05,7.2e-05,4.1e-05,8.2e-05,3.5e-05,6.6e-05,6.1e-05,3.3e-05,4.2e-05,4.3e-05,4e-05,9e-05,3.5e-05,4.7e-05,5e-06,5.5e-05,4.3e-05,7.7e-05,9.9e-05,4.7e-05,4.8e-05,4.8e-05,4.2e-05,4.7e-05,2.2e-05,6.4e-05,3.8e-05,1.6e-05,5.3e-05,8.7e-05,5e-05,3.6e-05,8.2e-05,1.3e-05,2.3e-05,1.1e-05,1.2e-05,3.3e-05,9.3e-05,9e-06,6.9e-05,6.1e-05,3.6e-05
1.3e-05,1.6e-05,1.3e-05,1.6e-05,1.2e-05,2e-05,2.3e-05,5e-06,1.2e-05,1.1e-05,1e-05,1.2e-05,2e-06,2.6e-05,8e-06,1.2e-05,1.1e-05,2.2e-05,4e-06,7e-06,7e-06,3.1e-05,4e-06,3.6e-05,1.9e-05,1.3e-05,9e-06,2.9e-05,2.3e-05,2.7e-05,2e-05,3.7e-05,3.2e-05,2e-05,3.6e-05,1.7e-05,3e-06,2.4e-05,1.7e-05,1.9e-05,7e-06,6e-06,2e-05,2.4e-05,1.9e-05,2.2e-05,1.7e-05,3.6e-05,1.7e-05,4.4e-05,1.6e-05,5e-06,1.4e-05,2.2e-05,1.9e-05,2.7e-05,2.2e-05,8e-06,3.2e-05,9e-06,2.3e-05,1.3e-05,9e-06,3.4e-05,2.2e-05,9e-06,4e-06,2.7e-05,1.8e-05,1.7e-05,2.3e-05,1.2e-05,7e-06,2.4e-05,2e-05,3.5e-05,1e-05,2.9e-05,9e-06,2.2e-05,1.4e-05,3.2e-05,2.8e-05,2.7e-05,1.1e-05,2.3e-05,2.7e-05,1.9e-05,9e-06,2.9e-05,1.5e-05,3e-05,5e-06,1.7e-05,4.4e-05,6.1e-05,4.8e-05,1.6e-05,1.5e-05,1.5e-05,1.6e-05,3.9e-05,3.4e-05,2.6e-05,2.5e-05,1.8e-05,1.4e-05,3.4e-05,3.2e-05,3.1e-05,3.6e-05,3.6e-05,1.5e-05,4e-06,1.8e-05,1.8e-05,1.5e-05,2.5e-05,2.9e-05,2.3e-05,5e-06
1.8e-05,5e-06,1.5e-05,8e-06,1e-05,1e-05,1.1e-05,5e-06,2.3e-05,1.6e-05,1.1e-05,8e-06,1.6e-05,3.5e-05,1.6e-05,2.7e-05,1.2e-05,1.6e-05,8e-06,2e-05,2.6e-05,2.1e-05,2.3e-05,5.6e-05,4.5e-05,2.2e-05,4.1e-05,1.9e-05,2.8e-05,3.5e-05,1.6e-05,2.9e-05,6.2e-05,4.8e-05,1.4e-05,3.4e-05,2e-05,6e-06,1.7e-05,2.3e-05,2e-05,2.4e-05,2e-05,1.1e-05,3.2e-05,1.7e-05,1.2e-05,2.3e-05,2.3e-05,3.1e-05,3.2e-05,3.2e-05,3.3e-05,3.7e-05,2.2e-05,2.4e-05,2.7e-05,3e-05,2.8e-05,1.7e-05,9e-06,3e-05,1.2e-05,3e-05,4.1e-05,2.8e-05,2.4e-05,1.8e-05,2.1e-05,2e-05,8e-06,2.7e-05,1.8e-05,3.5e-05,2.9e-05,5e-05,1.8e-05,1.8e-05,1.1e-05,2.4e-05,4.1e-05,4.5e-05,1.6e-05,3e-05,3e-05,2.3e-05,4.3e-05,2.3e-05,2.6e-05,4e-06,1.2e-05,2.3e-05,2.5e-05,7e-06,2.5e-05,2.9e-05,4.9e-05,1.5e-05,9e-06,1.4e-05,3.4e-05,2.4e-05,2.7e-05,3.8e-05,2.4e-05,2.6e-05,1.8e-05,9e-06,2.2e-05,1.3e-05,2e-05,1.8e-05,3.6e-05,1.9e-05,1.2e-05,2.3e-05,4.9e-05,4.9e-05,3.8e-05,2.8e-05,2.5e-05
1.5e-05,1.1e-05,9e-06,1.9e-05,1e-05,1.3e-05,1.2e-05,1e-05,3.6e-05,9e-06,8e-06,1.1e-05,1.1e-05,7e-06,9e-06,3.7e-05,1.8e-05,3e-06,1.9e-05,2.3e-05,4.5e-05,2.6e-05,1.7e-05,6.1e-05,1.5e-05,1.9e-05,3.6e-05,2.3e-05,2.4e-05,2.3e-05,2.7e-05,3.5e-05,4e-05,2.5e-05,3.2e-05,4.9e-05,3.3e-05,2.5e-05,2.6e-05,3.2e-05,2.7e-05,2.8e-05,2.9e-05,1.9e-05,3.1e-05,1.6e-05,8e-06,2.5e-05,2.4e-05,4.6e-05,1.5e-05,1.2e-05,2.2e-05,5.1e-05,3.2e-05,4.4e-05,3.4e-05,1.8e-05,4.8e-05,1.5e-05,1.7e-05,4.1e-05,2.2e-05,3.4e-05,7e-06,1.7e-05,8e-06,2e-05,2.9e-05,2.4e-05,1.8e-05,3.6e-05,1.8e-05,2.6e-05,1e-05,2.6e-05,6.8e-05,3.4e-05,7e-06,3.9e-05,5.1e-05,2.1e-05,1.9e-05,2.9e-05,3.3e-05,3.5e-05,6.3e-05,5.3e-05,1.9e-05,3.2e-05,1.1e-05,4e-06,2.4e-05,2.5e-05,5e-06,3.4e-05,3.8e-05,1.3e-05,5e-06,1.5e-05,6e-06,9e-06,1.5e-05,2e-05,2.8e-05,3.5e-05,3.7e-05,2.5e-05,1.7e-05,4.4e-05,1.6e-05,2.3e-05,2.5e-05,1.6e-05,6e-06,2e-05,3.5e-05,2.8e-05,3.6e-05,3.6e-05,1.2e-05
1.8e-05,8e-06,5e-06,1.5e-05,6e-06,7e-06,8e-06,1.8e-05,1.1e-05,7e-06,2.6e-05,2.5e-05,1.8e-05,2e-05,1.4e-05,1.9e-05,2.3e-05,9e-06,2.7e-05,2.9e-05,3.2e-05,4e-05,2.9e-05,5.9e-05,5.4e-05,3.2e-05,3.8e-05,1e-05,1.5e-05,6.9e-05,3.1e-05,6.1e-05,2.6e-05,4e-05,1.2e-05,5.4e-05,2.1e-05,3.3e-05,3.9e-05,6.5e-05,3.7e-05,1.6e-05,6e-06,2.2e-05,1e-05,1.2e-05,3.3e-05,1.8e-05,3.4e-05,2e-05,2.2e-05,2.7e-05,2.7e-05,1.1e-05,2e-05,5.1e-05,3.2e-05,1.5e-05,4.5e-05,1.6e-05,1.5e-05,2.7e-05,1.9e-05,2.6e-05,7e-06,1.2e-05,1.4e-05,1.6e-05,6.1e-05,3.4e-05,1.8e-05,3.2e-05,2.9e-05,7e-06,2.5e-05,1.5e-05,4.3e-05,9e-06,2.5e-05,1.8e-05,3e-06,3.8e-05,1.5e-05,7e-06,3.8e-05,3.4e-05,1.8e-05,2.1e-05,2.7e-05,4.4e-05,1.9e-05,1e-06,3e-05,1.1e-05,1e-05,3.4e-05,1e-05,1.5e-05,1.6e-05,2.4e-05,2.2e-05,3.3e-05,1.1e-05,1.4e-05,1.6e-05,1.1e-05,2e-05,1e-05,1.7e-05,2.1e-05,1.9e-05,1.7e-05,2.9e-05,8e-06,1.4e-05,1.7e-05,2.9e-05,3.5e-05,6e-06,1.1e-05,5e-06
2e-05,2.5e-05,2.7e-05,1.3e-05,8e-06,1.1e-05,1.5e-05,1.8e-05,1.2e-05,1.5e-05,1.5e-05,4e-06,1.8e-05,2.1e-05,3.1e-05,2.4e-05,1.2e-05,3.2e-05,3.5e-05,2e-05,2.4e-05,3.9e-05,1.2e-05,5.2e-05,5.6e-05,2e-05,2e-06,1.1e-05,5e-06,5.6e-05,2.1e-05,3.7e-05,1.7e-05,2.9e-05,2.4e-05,2.9e-05,2.1e-05,1.3e-05,7e-06,2.5e-05,1.6e-05,7e-06,7e-06,3.2e-05,1.3e-05,3.2e-05,2.8e-05,5.4e-05,5.4e-05,3.9e-05,2e-05,3.8e-05,2.1e-05,2.7e-05,2e-06,2.6e-05,1.6e-05,2.7e-05,3.6e-05,3.1e-05,1.9e-05,3e-05,2.9e-05,1e-05,2e-05,1.4e-05,1.1e-05,3e-06,4.8e-05,3.9e-05,3e-05,3.1e-05,7e-06,7e-06,1.7e-05,1.1e-05,2.4e-05,3.3e-05,9e-06,1.4e-05,2.3e-05,1.8e-05,3.8e-05,4.2e-05,2.9e-05,1e-05,5e-06,2.1e-05,1.2e-05,2.5e-05,2.6e-05,4e-06,2.1e-05,2.5e-05,1.2e-05,1.7e-05,1.7e-05,1.2e-05,3.4e-05,2.5e-05,2.1e-05,2.5e-05,3.4e-05,4e-06,8e-06,8e-06,7e-06,6e-06,1.6e-05,1.8e-05,7e-06,3e-05,1.6e-05,2e-05,1.8e-05,1.5e-05,3.2e-05,2.5e-05,2.2e-05,1.1e-05,7e-06
1.1e-05,1e-05,1e-05,1.4e-05,5e-06,6e-06,7e-06,1.3e-05,9e-06,2.8e-05,2.7e-05,2.1e-05,7e-06,1.1e-05,1.2e-05,1.1e-05,2.3e-05,2.3e-05,4e-06,9e-06,2e-05,1.3e-05,9e-06,5.1e-05,9e-06,1.5e-05,2.9e-05,2e-05,5e-06,2.6e-05,2.5e-05,3.3e-05,1.6e-05,2e-05,9e-06,2.5e-05,1.2e-05,1.5e-05,1.9e-05,1.5e-05,2e-05,2e-06,8e-06,9e-06,3.3e-05,9e-06,3.5e-05,4e-05,6e-06,3.4e-05,2.7e-05,6e-06,1.8e-05,1e-05,1e-05,1.1e-05,1e-05,1.8e-05,3.6e-05,1.2e-05,8e-06,1e-05,1.6e-05,6e-06,9e-06,1.4e-05,2.3e-05,1.7e-05,1.9e-05,3e-05,1.4e-05,2.8e-05,1.4e-05,8e-06,1.2e-05,6e-06,1.9e-05,7e-06,2.1e-05,3.8e-05,1.1e-05,1.6e-05,1.8e-05,2.1e-05,2.4e-05,9e-06,1.6e-05,9e-06,2.4e-05,4e-06,1.1e-05,1.8e-05,9e-06,1e-05,1.7e-05,3.8e-05,1.3e-05,2e-06,2e-05,8e-06,1.4e-05,1.2e-05,3.1e-05,2.7e-05,7e-06,1.2e-05,4e-06,1.2e-05,1.3e-05,1e-05,2.9e-05,3e-06,2.6e-05,2e-06,8e-06,7e-06,3.4e-05,3.1e-05,3.6e-05,2.7e-05,1.4e-05
8e-06,5e-06,7e-06,7e-06,5e-06,8e-06,5e-06,1e-05,1.9e-05,8e-06,8e-06,6e-06,8e-06,3e-06,1.9e-05,1.7e-05,1.4e-05,8e-06,6e-06,2e-06,1e-05,1.6e-05,6e-06,4.1e-05,2.2e-05,1.2e-05,2.4e-05,1e-05,6e-06,1.6e-05,1.6e-05,1.7e-05,1.9e-05,1.7e-05,1e-05,1.5e-05,6e-06,7e-06,5e-06,2.6e-05,1.8e-05,1.3e-05,1e-05,2e-05,2.1e-05,1.1e-05,3.1e-05,2.3e-05,6e-06,2e-05,1e-06,1.7e-05,9e-06,1.2e-05,7e-06,2.6e-05,2.5e-05,5e-06,1.8e-05,7e-06,1.9e-05,7e-06,9e-06,2.2e-05,1.8e-05,5e-06,1.1e-05,5e-06,6e-06,2.3e-05,1.7e-05,4e-06,5e-06,6e-06,2e-06,4e-06,1.2e-05,9e-06,2.4e-05,1.6e-05,2.1e-05,1.4e-05,7e-06,2.2e-05,1.4e-05,6e-06,2e-06,7e-06,1e-05,9e-06,8e-06,1.7e-05,7e-06,1.8e-05,9e-06,4.4e-05,2.9e-05,4e-06,9e-06,1.4e-05,1.7e-05,2.1e-05,1.1e-05,2e-06,5e-06,1.5e-05,2e-06,1.8e-05,2.4e-05,1.9e-05,3.4e-05,1.3e-05,1.8e-05,1.6e-05,5e-06,6e-06,2.9e-05,1.8e-05,3.3e-05,9e-06,1.4e-05
1.1e-05,7e-06,7e-06,9e-06,7e-06,7e-06,1e-05,1.2e-05,2e-05,3e-06,1.2e-05,1.2e-05,8e-06,1.2e-05,1.4e-05,3e-06,1.5e-05,2e-05,2e-06,1e-05,1.5e-05,9e-06,4e-06,2.4e-05,1.2e-05,3e-06,1.8e-05,7e-06,1e-05,9e-06,2.9e-05,3.7e-05,7e-06,3e-05,1e-05,2e-05,8e-06,5e-06,5e-06,2.2e-05,4e-06,6e-06,5e-06,2.2e-05,1.3e-05,1.3e-05,2.1e-05,1.8e-05,1.8e-05,2.2e-05,2e-06,2.8e-05,1.4e-05,9e-06,2e-05,3.3e-05,1.3e-05,4e-06,1.3e-05,1.9e-05,9e-06,1.5e-05,2.2e-05,1.8e-05,4e-06,1.3e-05,4e-06,1e-05,5e-06,2e-05,1.5e-05,7e-06,9e-06,4e-06,4e-06,1e-05,9e-06,5e-06,1.8e-05,1e-05,1.6e-05,4e-06,1e-06,1.3e-05,4e-06,6e-06,1.9e-05,1.3e-05,1.5e-05,1.5e-05,1e-05,1e-05,5e-06,9e-06,1.3e-05,2.6e-05,9e-06,8e-06,2.1e-05,1.2e-05,2e-05,1.9e-05,1e-05,1.2e-05,4e-06,9e-06,1e-06,9e-06,8e-06,6e-06,1.8e-05,1.1e-05,1.5e-05,7e-06,6e-06,9e-06,1.5e-05,8e-06,2e-05,1.5e-05,1.4e-05
1.1e-05,6e-06,1.1e-05,8e-06,8e-06,9e-06,4e-06,1.3e-05,1.6e-05,2e-06,1.5e-05,4e-06,6e-06,5e-06,6e-06,5e-06,1.3e-05,5e-06,1.5e-05,2.7e-05,5e-06,1.5e-05,6e-06,1.8e-05,2.7e-05,1.6e-05,1.5e-05,2.7e-05,2.3e-05,2.4e-05,2.9e-05,1e-05,1.1e-05,2.7e-05,1.5e-05,1e-05,3e-06,7e-06,5e-06,1.6e-05,1.8e-05,1e-06,1.1e-05,1.6e-05,1.3e-05,2.1e-05,4.3e-05,1.5e-05,2e-05,2.4e-05,7e-06,2.7e-05,1.1e-05,1.3e-05,6e-06,2.3e-05,3.6e-05,7e-06,1.1e-05,2.9e-05,2.7e-05,2.5e-05,1.7e-05,4e-06,1.2e-05,2e-05,1.9e-05,3.2e-05,1.8e-05,2.8e-05,3.2e-05,1.4e-05,1.6e-05,1.7e-05,8e-06,3e-06,2.3e-05,9e-06,1.9e-05,4e-06,2.6e-05,1.9e-05,1.8e-05,2.1e-05,1.6e-05,1.6e-05,9e-06,6e-06,1e-05,1.1e-05,1.9e-05,2.1e-05,1e-05,5e-06,1.1e-05,1.2e-05,8e-06,1e-05,2.2e-05,1.1e-05,1.1e-05,2.5e-05,1.3e-05,2e-05,1.3e-05,2.2e-05,9e-06,1.9e-05,1.3e-05,4e-06,9e-06,1.1e-05,7e-06,2e-05,1.2e-05,8e-06,1.7e-05,1.1e-05,1.1e-05,1.4e-05,1.2e-05
6e-06,2e-06,5e-06,7e-06,3e-06,3e-06,6e-06,1.1e-05,2.2e-05,7e-06,1.4e-05,1.5e-05,1e-05,5e-06,1.9e-05,8e-06,8e-06,1.6e-05,1.2e-05,2.6e-05,2.4e-05,2.2e-05,1.8e-05,1.6e-05,2.2e-05,9e-06,4e-06,3.5e-05,2.4e-05,3e-06,2.9e-05,3.4e-05,1.1e-05,1.4e-05,7e-06,4e-06,9e-06,4e-06,6e-06,1.3e-05,1.9e-05,1.3e-05,2.9e-05,4e-05,2.3e-05,1e-05,1.8e-05,2.2e-05,2.3e-05,2.4e-05,1.2e-05,2.4e-05,3.2e-05,3e-05,1.7e-05,1e-06,1.5e-05,2.4e-05,1.9e-05,2.1e-05,6e-06,1.4e-05,2.9e-05,3.9e-05,1.6e-05,2.9e-05,1.3e-05,3.8e-05,2.5e-05,2.7e-05,1.1e-05,9e-06,2.1e-05,2.2e-05,8e-06,1e-05,1.6e-05,1.1e-05,3.2e-05,2.6e-05,1.7e-05,1.7e-05,1.6e-05,5e-06,3e-05,4.6e-05,4.4e-05,2.4e-05,1e-05,2.3e-05,1e-05,1.2e-05,1.7e-05,2.7e-05,5e-06,3.1e-05,1e-05,4e-06,9e-06,1.1e-05,2.4e-05,1.1e-05,3.5e-05,1.1e-05,3e-06,1.5e-05,3.2e-05,2.2e-05,2.1e-05,3.4e-05,2.3e-05,1.9e-05,6e-06,2.5e-05,3.2e-05,1.3e-05,1.8e-05,1.9e-05,1.6e-05,1e-05,2.5e-05
3e-06,2e-06,1e-06,5e-06,5e-06,2e-06,4e-06,8e-06,2.3e-05,2.2e-05,1.4e-05,1.1e-05,7e-06,1.7e-05,1e-05,1.3e-05,1.4e-05,1.7e-05,2.1e-05,1.4e-05,1.1e-05,2.6e-05,2.2e-05,4.8e-05,8e-06,1.7e-05,1.7e-05,2.6e-05,3.4e-05,4.9e-05,1.5e-05,5e-06,2.5e-05,2e-06,1.9e-05,1.7e-05,1.1e-05,1.9e-05,9e-06,8e-06,6e-06,1.2e-05,1.9e-05,1.4e-05,2.1e-05,4e-06,9e-06,2e-05,1.4e-05,2.4e-05,3e-05,2.3e-05,3.8e-05,1.1e-05,1.4e-05,5e-06,1.4e-05,7e-06,8e-06,7e-06,1.7e-05,2e-06,1.5e-05,2e-05,3e-05,3.2e-05,2.9e-05,1.3e-05,6e-06,1.9e-05,2.1e-05,1.5e-05,2.1e-05,1e-05,5e-06,1.1e-05,1.4e-05,1.8e-05,1.7e-05,2.8e-05,4e-05,1.3e-05,3e-05,3.5e-05,4.6e-05,1.3e-05,3.7e-05,1.6e-05,3.6e-05,2.3e-05,3.1e-05,2.9e-05,3.4e-05,2.2e-05,1.8e-05,2e-05,1.2e-05,2.1e-05,1.8e-05,7e-06,3e-05,2.3e-05,2.5e-05,2.3e-05,1.6e-05,2.7e-05,1.4e-05,3.8e-05,1.6e-05,3.5e-05,2.3e-05,2.3e-05,1.9e-05,1.3e-05,3e-05,1.2e-05,7e-06,2.8e-05,1.8e-05,7e-06,2e-05
5e-06,5e-06,7e-06,3e-06,5e-06,4e-06,2e-06,4e-06,2e-05,2e-05,5e-06,7e-06,5e-06,2e-05,1.4e-05,8e-06,7e-06,1e-06,1.3e-05,1.3e-05,1.6e-05,2e-05,7e-06,3.6e-05,3.8e-05,3e-05,2e-05,1.3e-05,2.2e-05,2.5e-05,8e-06,2.6e-05,3e-05,2.6e-05,1.6e-05,1.6e-05,3.4e-05,2.7e-05,2.8e-05,2.3e-05,1.8e-05,1.8e-05,1.8e-05,2.2e-05,2.5e-05,4e-06,1e-05,2.5e-05,3.6e-05,2.8e-05,1.9e-05,3.8e-05,1.6e-05,9e-06,8e-06,2.1e-05,2.7e-05,1e-05,1.4e-05,5e-06,1e-05,1e-05,1.5e-05,1.7e-05,2.2e-05,5e-06,1.5e-05,1.3e-05,1.6e-05,1.2e-05,8e-06,1.3e-05,2e-05,1.7e-05,1.3e-05,7e-06,2.6e-05,3.2e-05,1.7e-05,3.2e-05,7e-06,1.8e-05,3.4e-05,1.9e-05,1.3e-05,2.8e-05,2.7e-05,2e-05,3.3e-05,6e-06,1.9e-05,1.9e-05,1.1e-05,2e-06,1.1e-05,2.3e-05,2.2e-05,3e-05,2.7e-05,2.5e-05,3.9e-05,1.9e-05,1.2e-05,8e-06,1.4e-05,2.1e-05,2.4e-05,1.4e-05,2.3e-05,7e-06,2.9e-05,8e-06,1.5e-05,2.3e-05,2.3e-05,2.8e-05,1e-05,1.2e-05,1.7e-05,1e-05,9e-06
3e-06,8e-06,7e-06,5e-06,4e-06,8e-06,1.3e-05,9e-06,5e-06,1.1e-05,9e-06,5e-06,6e-06,1.7e-05,1.5e-05,2.7e-05,2.1e-05,1.3e-05,1.8e-05,1.3e-05,2.1e-05,3e-05,3e-05,2.5e-05,1.8e-05,7e-06,2.8e-05,1e-06,2.1e-05,2.4e-05,1.2e-05,2.8e-05,1.4e-05,8e-06,1.9e-05,1.5e-05,3.6e-05,1.3e-05,4e-06,1.6e-05,1.4e-05,1e-05,1.3e-05,7e-06,1.4e-05,2.4e-05,2.6e-05,2e-06,1.9e-05,1.3e-05,1.7e-05,2.9e-05,7e-06,1.5e-05,8e-06,1.1e-05,3.2e-05,2.7e-05,2.8e-05,3e-06,5e-06,5e-06,6e-06,1e-05,3e-05,7e-06,1e-05,1.6e-05,2.7e-05,0,7e-06,1.2e-05,1.2e-05,2.2e-05,9e-06,1.6e-05,3.9e-05,1.9e-05,2.4e-05,6e-06,2.1e-05,1.9e-05,1.1e-05,1.6e-05,2e-06,2.2e-05,3.1e-05,1.8e-05,3e-06,7e-06,1.6e-05,3.8e-05,2.6e-05,8e-06,9e-06,2.4e-05,3.3e-05,1.4e-05,2.9e-05,2.2e-05,2e-05,3.3e-05,2.2e-05,2.4e-05,1.9e-05,5e-06,2e-06,2.2e-05,1.8e-05,1.9e-05,2.6e-05,0,1.6e-05,1.2e-05,1.7e-05,1e-05,1e-05,1.1e-05,1.9e-05,1.1e-05,2e-06
5e-06,1.4e-05,7e-06,6e-06,6e-06,1.1e-05,6e-06,7e-06,1e-06,2e-05,1.2e-05,1.1e-05,9e-06,8e-06,1e-05,1.3e-05,1.3e-05,1.7e-05,1.7e-05,7e-06,1.5e-05,1.7e-05,2.7e-05,2.6e-05,2.1e-05,2.5e-05,2.7e-05,3.2e-05,1.9e-05,3e-05,2e-05,2.8e-05,2.8e-05,1.7e-05,1.1e-05,2e-05,2e-05,2.8e-05,2.3e-05,2.6e-05,1.9e-05,1.8e-05,2e-05,2.9e-05,4e-05,1.7e-05,1.3e-05,1.1e-05,1.3e-05,2e-05,2.1e-05,3.6e-05,3.9e-05,1.5e-05,1.8e-05,2.3e-05,4.3e-05,1.9e-05,8e-06,2.6e-05,2.3e-05,1.1e-05,1.5e-05,5e-06,1.6e-05,3.2e-05,2.6e-05,2.3e-05,2e-06,2e-05,1.3e-05,1e-05,1.5e-05,3.8e-05,2.4e-05,2.3e-05,1.2e-05,2e-05,3.3e-05,2.4e-05,2.5e-05,9e-06,1e-05,2.2e-05,3.4e-05,1.3e-05,1.2e-05,2.2e-05,2.5e-05,2.2e-05,1.1e-05,3.6e-05,6e-06,1e-05,8e-06,1.9e-05,3.8e-05,1.4e-05,2e-05,1.8e-05,1.5e-05,1.6e-05,6e-06,1.5e-05,1.9e-05,1.6e-05,1.4e-05,2.1e-05,2.6e-05,1.8e-05,3.3e-05,2.3e-05,3e-06,2.7e-05,1.8e-05,1.8e-05,3.2e-05,6e-06,2.3e-05,2.2e-05,2.2e-05
1.3e-05,1.3e-05,7e-06,2e-06,1.6e-05,1.9e-05,1.6e-05,4e-06,7e-06,2.1e-05,2.8e-05,1e-05,2.4e-05,2.5e-05,1.4e-05,1.2e-05,1.8e-05,1.6e-05,3.2e-05,3e-05,2.4e-05,2.2e-05,2.5e-05,2.4e-05,1.5e-05,2e-05,2.3e-05,6.3e-05,4.1e-05,4.7e-05,2e-05,1.4e-05,1.5e-05,1.6e-05,2.8e-05,8e-06,1.4e-05,2.1e-05,2e-05,3.7e-05,2.4e-05,4.4e-05,5.3e-05,7e-06,3.5e-05,2.9e-05,1.6e-05,2.7e-05,3.1e-05,1.3e-05,1.7e-05,1e-05,3.4e-05,2.8e-05,2e-06,3.4e-05,3.1e-05,3.5e-05,3.7e-05,2.9e-05,3.3e-05,1.2e-05,3.2e-05,2.8e-05,2e-06,3.1e-05,1.2e-05,2.4e-05,2e-05,2.9e-05,1.8e-05,1.1e-05,1.3e-05,3.4e-05,3.1e-05,1.8e-05,2.6e-05,1.3e-05,3.4e-05,1.1e-05,1.6e-05,2.6e-05,3.3e-05,2.7e-05,1.1e-05,9e-06,2.8e-05,5.6e-05,6.2e-05,2.2e-05,7e-06,3.5e-05,3.5e-05,3e-05,1.9e-05,1.9e-05,3.6e-05,2.8e-05,1.3e-05,1.9e-05,2.8e-05,3.9e-05,1.5e-05,7e-06,2.8e-05,6e-06,2.1e-05,1.5e-05,3.7e-05,3.4e-05,1.4e-05,4e-06,2.3e-05,4.5e-05,5.6e-05,4.5e-05,6e-05,4.4e-05,4.3e-05,2.8e-05,4.1e-05
1.2e-05,7e-06,4e-06,8e-06,2.1e-05,1.8e-05,9e-06,5e-06,8e-06,1.4e-05,1.6e-05,1.5e-05,2.8e-05,7e-06,1.3e-05,1.1e-05,5e-06,2.6e-05,2.4e-05,3e-06,1.1e-05,2.6e-05,1e-05,1.6e-05,1.5e-05,1.5e-05,2.1e-05,4e-05,9e-06,3e-05,4.1e-05,3.7e-05,3e-05,3e-05,7e-06,9e-06,3e-06,9e-06,1.9e-05,2.1e-05,6e-06,3.1e-05,2.9e-05,2.5e-05,6e-06,1.9e-05,2.8e-05,2.8e-05,1e-05,1.5e-05,1.5e-05,2e-05,1.7e-05,1.7e-05,2e-05,4.5e-05,4e-06,2.1e-05,1.3e-05,2.8e-05,1.1e-05,1.1e-05,2.5e-05,2.8e-05,2.8e-05,1.4e-05,8e-06,1.3e-05,6e-06,2e-05,3.2e-05,3.6e-05,2.4e-05,3.2e-05,1.5e-05,2.7e-05,3.1e-05,3.7e-05,6e-05,3.7e-05,3e-06,1.9e-05,1.6e-05,1.1e-05,8e-06,8e-06,2.6e-05,3.6e-05,4e-06,1.7e-05,1.4e-05,2.7e-05,2.2e-05,1.3e-05,1.9e-05,3.3e-05,2.4e-05,1.7e-05,1.4e-05,1.3e-05,2.1e-05,2.7e-05,1.6e-05,1.7e-05,1.6e-05,1.8e-05,9e-06,3e-06,3.4e-05,2e-05,4e-06,2.2e-05,2e-05,2.6e-05,4.3e-05,4.6e-05,2.9e-05,1e-05,6e-06,2.6e-05,1.8e-05
3e-06,3e-06,3e-06,9e-06,8e-06,2e-06,1e-06,6e-06,6e-06,9e-06,3e-06,6e-06,8e-06,1.2e-05,1.3e-05,7e-06,3e-06,1.7e-05,4e-06,1.1e-05,1.5e-05,7e-06,2e-06,1.6e-05,7e-06,7e-06,9e-06,1.2e-05,6e-06,1.2e-05,1.4e-05,7e-06,1.9e-05,1.6e-05,1.3e-05,1.1e-05,8e-06,6e-06,1.5e-05,1.4e-05,1.1e-05,1.1e-05,1.2e-05,6e-06,1e-05,8e-06,2e-05,6e-06,1.2e-05,1.1e-05,5e-06,6e-06,1e-05,7e-06,7e-06,1.9e-05,1.2e-05,1.2e-05,1e-05,9e-06,4e-06,3e-06,1.4e-05,6e-06,1.1e-05,1e-05,8e-06,4e-06,5e-06,7e-06,1.7e-05,1.4e-05,1.2e-05,6e-06,5e-06,1.5e-05,9e-06,1.6e-05,1.8e-05,7e-06,8e-06,7e-06,1.2e-05,1.2e-05,1.2e-05,1.2e-05,1.6e-05,1.3e-05,1.1e-05,1.3e-05,1e-05,4e-06,1.2e-05,1.6e-05,5e-06,2.9e-05,2.1e-05,1.2e-05,3e-06,9e-06,3e-06,1.8e-05,3e-06,1.3e-05,1.1e-05,7e-06,8e-06,7e-06,1.7e-05,5e-06,1.5e-05,7e-06,1.6e-05,5e-06,1.8e-05,1.5e-05,1.3e-05,7e-06,1e-05,1e-05,5e-06
2e-06,2e-06,1e-06,7e-06,6e-06,1e-06,2e-06,7e-06,8e-06,7e-06,1e-06,3e-06,4e-06,8e-06,8e-06,7e-06,4e-06,1.2e-05,2e-06,4e-06,5e-06,1.2e-05,3e-06,1.3e-05,5e-06,4e-06,9e-06,1.6e-05,4e-06,1.2e-05,4e-06,6e-06,1.5e-05,1.7e-05,9e-06,1.1e-05,1e-06,4e-06,1.2e-05,1.5e-05,1.2e-05,1.2e-05,5e-06,7e-06,1.1e-05,5e-06,1.6e-05,3e-06,3e-06,8e-06,4e-06,5e-06,2e-06,9e-06,1e-06,1.8e-05,1.3e-05,5e-06,4e-06,8e-06,3e-06,2e-06,4e-06,5e-06,1e-05,6e-06,1.1e-05,1e-06,4e-06,5e-06,1e-05,4e-06,7e-06,4e-06,4e-06,1e-05,8e-06,8e-06,1.2e-05,7e-06,6e-06,6e-06,9e-06,9e-06,1e-06,8e-06,1e-05,1.1e-05,9e-06,6e-06,5e-06,7e-06,8e-06,1e-05,3e-06,2.6e-05,2.1e-05,3e-06,1e-06,3e-06,2e-06,9e-06,4e-06,5e-06,8e-06,1e-05,7e-06,7e-06,1.3e-05,5e-06,1.7e-05,8e-06,8e-06,4e-06,1.2e-05,1e-05,1.2e-05,5e-06,8e-06,1e-05,4e-06
2e-06,2e-06,0,6e-06,5e-06,0,3e-06,6e-06,7e-06,6e-06,0,1e-06,3e-06,7e-06,6e-06,7e-06,3e-06,1.2e-05,2e-06,2e-06,2e-06,1.2e-05,5e-06,1.2e-05,2e-06,4e-06,5e-06,1.3e-05,2e-06,1.2e-05,2e-06,3e-06,1.3e-05,1.6e-05,7e-06,9e-06,1e-06,6e-06,1.1e-05,1.2e-05,1.1e-05,1.2e-05,2e-06,5e-06,1.3e-05,5e-06,1.6e-05,4e-06,2e-06,9e-06,3e-06,6e-06,2e-06,6e-06,2e-06,1.6e-05,1.1e-05,4e-06,8e-06,8e-06,3e-06,1e-06,4e-06,4e-06,8e-06,5e-06,1e-05,3e-06,3e-06,5e-06,1e-05,4e-06,5e-06,2e-06,3e-06,8e-06,6e-06,6e-06,1.2e-05,7e-06,7e-06,6e-06,9e-06,3e-06,4e-06,1.1e-05,7e-06,9e-06,9e-06,8e-06,5e-06,7e-06,7e-06,8e-06,1e-06,2.2e-05,2e-05,4e-06,1e-06,0,1e-06,8e-06,2e-06,5e-06,1e-05,8e-06,2e-06,1.1e-05,1.2e-05,5e-06,1.6e-05,7e-06,5e-06,3e-06,1.1e-05,1e-05,1.2e-05,4e-06,1e-05,9e-06,3e-06
1e-06,1e-06,0,6e-06,4e-06,1e-06,2e-06,6e-06,7e-06,6e-06,1e-06,1e-06,3e-06,7e-06,5e-06,6e-06,2e-06,1.1e-05,2e-06,2e-06,1e-06,1.1e-05,5e-06,1.2e-05,1e-06,2e-06,3e-06,1.3e-05,3e-06,1.5e-05,4e-06,3e-06,1.2e-05,1.5e-05,7e-06,8e-06,0,6e-06,1.1e-05,1.1e-05,1e-05,9e-06,4e-06,5e-06,1.2e-05,3e-06,1.5e-05,3e-06,3e-06,7e-06,3e-06,5e-06,1e-06,7e-06,3e-06,1.6e-05,1.1e-05,4e-06,8e-06,7e-06,4e-06,1e-06,2e-06,4e-06,7e-06,5e-06,1e-05,1e-06,1e-06,5e-06,9e-06,3e-06,4e-06,2e-06,2e-06,7e-06,7e-06,5e-06,1.1e-05,5e-06,5e-06,6e-06,8e-06,2e-06,6e-06,1e-05,6e-06,8e-06,8e-06,7e-06,5e-06,8e-06,9e-06,8e-06,1e-06,2e-05,1.9e-05,3e-06,1e-06,1e-06,0,8e-06,2e-06,3e-06,9e-06,6e-06,2e-06,9e-06,1.2e-05,5e-06,1.7e-05,6e-06,6e-06,1e-06,1e-05,9e-06,1.2e-05,4e-06,1e-05,7e-06,4e-06
