0,3e-06,7e-06,4e-06,5e-06,1.4e-05,2.6e-05,1.2e-05,3.5e-05,1.1e-05,2.8e-05,1.7e-05,9e-06,1.5e-05,1.6e-05,1.5e-05,5e-06,3e-06,1.4e-05,0.000345,5.5e-05,5.3e-05,0.00011,0.000124,8.3e-05,1.6e-05,4.2e-05,0.000119,2.1e-05,7.8e-05,7.1e-05,5.8e-05,4.4e-05,4.7e-05,0.000728,0.000287,0.000175,0.00041,0.000815,0.000375,0.000456,0.000348,0.001077,0.000282,0.001353,0.000422,0.000634,0.000336,3e-06,0.000327,0.000289,0.000581,0.000116,0.000186,0.000316,0.00031,0.000117,0.000104,0.000192,0.000165,4e-05,3.9e-05,0.000117,0.000178,2e-05,7.9e-05,0.000209,8.7e-05,0.000314,5.9e-05,1.7e-05,4.1e-05,6.2e-05,3.8e-05,2.2e-05,2.2e-05,5.2e-05,2e-05,4.9e-05,4.7e-05,9.3e-05,5.2e-05,4.5e-05,6.3e-05,0.000275,4.4e-05,8e-06,4e-06,1.4e-05,1e-06,1.3e-05,4e-05,1.3e-05,3.3e-05,3.9e-05,7e-06,3.4e-05,4e-06,1.5e-05,9e-06,5e-06,4e-06,0,3e-06,1.7e-05,1e-06,1.8e-05,1.6e-05,1e-05,6e-06,6e-06,2e-06,1.5e-05,3e-06,3e-06,4e-06,3.5e-05,1.8e-05,2.2e-05,8e-06,4e-05
2.5e-05,7e-06,8e-06,1.7e-05,1.5e-05,3.8e-05,8.1e-05,5.5e-05,6.7e-05,6.5e-05,6.9e-05,5.9e-05,5.6e-05,2.9e-05,2.9e-05,3.9e-05,1.6e-05,2.8e-05,3e-05,0.000793,5.4e-05,0.000114,0.000311,0.000143,6.1e-05,0.000244,0.00017,0.000146,0.000139,0.000178,0.000371,0.00038,0.000349,0.000142,0.002159,0.001525,0.000944,0.000856,0.001324,0.001289,0.000258,0.001301,0.002859,0.001399,0.003242,0.00119,0.001056,0.000466,0.000806,0.000846,0.000981,0.000745,0.001028,0.001114,0.000302,0.000542,0.000329,0.000333,0.00065,0.000568,0.000447,0.000415,0.000691,0.000136,0.000249,0.000301,0.00059,0.000226,0.000561,0.00046,0.00041,0.000204,0.000291,0.000145,0.000167,0.000124,0.000199,9.9e-05,0.000343,0.000403,0.000455,0.00036,0.000141,0.000302,0.000658,0.000517,0.000388,0.000188,9.4e-05,6.3e-05,5.8e-05,1e-04,0.000122,0.000103,0.000131,0.000102,6.4e-05,6.6e-05,3.7e-05,5e-05,3.2e-05,1.8e-05,1.6e-05,7e-06,2.8e-05,3.7e-05,6.8e-05,8.2e-05,5.3e-05,2.4e-05,2.9e-05,3.1e-05,4.2e-05,1.1e-05,1.2e-05,1.7e-05,8.3e-05,5e-05,7.8e-05,9e-05,8.9e-05
5e-06,2.3e-05,1.2e-05,2e-05,2.5e-05,3.3e-05,5.1e-05,1.7e-05,6e-06,4.9e-05,3e-05,2.4e-05,3.3e-05,2.1e-05,1.8e-05,0.000102,2.7e-05,2.6e-05,2.7e-05,0.00098,0.000301,0.000228,0.000177,0.000226,0.000239,0.000364,5.8e-05,0.00015,0.000165,0.000326,0.000287,6.6e-05,0.00012,0.000356,0.003257,0.003495,0.00186,0.002139,0.000218,0.000469,0.000525,0.001641,0.00353,0.001807,0.003697,0.00217,0.00071,5.1e-05,0.000613,0.001053,0.001138,0.00237,0.002161,0.000806,0.001285,0.000147,0.000445,0.000267,0.000388,0.000408,0.000581,0.00046,0.000715,0.001157,0.000665,0.000299,0.000462,0.000654,0.000475,5.9e-05,0.000765,0.000463,0.000468,0.000252,0.000176,0.000128,0.000238,0.000278,0.000514,0.000628,0.000286,7.6e-05,1.2e-05,0.000329,0.000291,0.000571,0.000142,7.5e-05,9e-06,4.7e-05,8.8e-05,2.4e-05,6.8e-05,3.7e-05,3.7e-05,3e-05,5.4e-05,5.5e-05,1.8e-05,4.6e-05,5.3e-05,3e-05,2.7e-05,2.8e-05,8e-06,2.7e-05,7.8e-05,4.7e-05,2.3e-05,3.4e-05,3.4e-05,1e-05,3.6e-05,2.8e-05,1.1e-05,4.3e-05,0.000103,6e-05,1.8e-05,7.2e-05,2.2e-05
3.1e-05,5.1e-05,1.7e-05,2.1e-05,2.5e-05,3.6e-05,4e-05,2e-05,5e-05,4.3e-05,4.9e-05,4.7e-05,2.2e-05,5e-05,2.2e-05,0.000147,0.000142,8.9e-05,7.3e-05,0.001216,0.000613,0.000181,0.000202,0.000213,0.000924,0.000614,0.00042,0.000162,0.000409,0.000292,0.000403,0.000199,6.9e-05,0.000666,0.0045,0.001872,0.002248,0.002084,0.001311,0.00065,0.00133,0.00184,0.001363,0.001861,0.001817,0.002801,0.002663,0.001086,0.001086,0.001012,0.000605,0.00159,0.000803,0.002266,0.000671,0.000142,0.000304,0.000527,2e-04,0.000448,0.000451,0.001257,0.001336,0.001367,0.001054,0.000131,0.00026,0.000965,0.001119,0.00072,0.000416,0.000799,0.000275,0.000116,7.9e-05,0.000206,0.000256,4.6e-05,0.000833,0.000424,0.000252,0.000125,0.000125,0.000341,0.000537,0.000485,0.000286,0.000157,5.7e-05,2.4e-05,0.000134,7e-05,5e-05,6.6e-05,4.6e-05,7.2e-05,7.7e-05,3.7e-05,5.4e-05,6.3e-05,5.5e-05,2.5e-05,2.4e-05,2.9e-05,4.3e-05,3.9e-05,6.7e-05,7.8e-05,4.9e-05,3.5e-05,1.5e-05,2.8e-05,4.6e-05,6.8e-05,5.4e-05,7.8e-05,0.000197,7.2e-05,9e-06,6.9e-05,4e-05
1.4e-05,4.3e-05,2.3e-05,2.3e-05,9e-06,1.7e-05,9e-06,1.9e-05,6e-05,2e-05,1.3e-05,1.9e-05,2.3e-05,2.6e-05,4.2e-05,0.000141,5.1e-05,1e-05,4.9e-05,0.001428,0.000841,0.000543,0.000139,0.000257,0.001926,0.001906,0.001115,0.000466,0.000593,0.000886,0.000431,0.000162,0.000157,0.000767,0.004628,0.004155,0.004059,0.004321,0.000654,0.000503,0.001871,0.000551,0.000738,0.00156,0.003839,0.001022,0.002131,0.001543,0.001106,0.000945,0.000837,0.000381,0.001178,0.001944,0.001342,0.00089,0.000768,0.000474,0.000443,0.000797,0.000865,0.001384,0.001055,0.000666,0.00084,0.001399,0.000597,0.00017,0.001796,0.000643,0.000208,0.000623,0.000488,0.000275,0.000203,0.000434,8.7e-05,9.9e-05,0.00128,0.000583,0.000312,0.00011,0.000118,0.000192,0.000119,7.7e-05,0.000136,7.9e-05,3.7e-05,5.3e-05,0.000129,6.1e-05,5.4e-05,5.3e-05,4.5e-05,2.6e-05,2.3e-05,2.3e-05,4.1e-05,1.6e-05,3.2e-05,4.4e-05,3e-05,1.7e-05,1.8e-05,5e-05,3.9e-05,1.6e-05,9e-06,1.2e-05,1.6e-05,1.4e-05,3e-05,3.6e-05,1.6e-05,5.4e-05,0.000155,5.1e-05,5.3e-05,6.6e-05,3.7e-05
9e-06,1.5e-05,3.7e-05,2.3e-05,5e-06,8e-06,2.3e-05,7e-06,4.8e-05,4.2e-05,4.1e-05,1.9e-05,3.7e-05,7e-06,6.7e-05,0.000131,6.6e-05,3.2e-05,2.9e-05,0.00154,0.00102,0.000393,0.000515,0.000329,0.002879,0.001612,0.000736,0.000144,0.000358,0.000923,0.000751,0.000155,0.000152,0.001109,0.003248,0.00115,0.000794,0.002582,0.003706,0.002587,0.000672,0.001669,0.001567,0.003349,0.003902,0.001956,0.002245,0.000968,0.001553,0.003406,0.002386,0.00426,0.003242,0.002079,0.001694,0.001251,0.00161,0.001599,0.000916,0.000617,0.002377,0.002127,0.00196,0.001688,0.001303,0.000699,0.001222,0.001087,0.000619,0.00033,0.000696,0.00058,0.000887,0.000683,0.000467,0.000336,0.000113,5.9e-05,0.001274,0.000841,0.000343,0.000181,8.5e-05,0.000262,0.000178,9e-05,3.7e-05,1.6e-05,4e-05,7.5e-05,5.8e-05,2.7e-05,3.8e-05,2.2e-05,1e-05,1.8e-05,2e-05,1.3e-05,5.2e-05,2.4e-05,1.7e-05,3.3e-05,1.4e-05,7e-06,2.1e-05,2.9e-05,2.9e-05,4.1e-05,1.1e-05,2.6e-05,3e-06,6e-06,3.4e-05,4.5e-05,4.4e-05,2.5e-05,0.000201,3.3e-05,5.2e-05,3.9e-05,2.1e-05
4.6e-05,2.2e-05,3.6e-05,5e-06,1.5e-05,7e-06,2.1e-05,3.1e-05,1.4e-05,2.5e-05,4.8e-05,2.6e-05,2.2e-05,6.3e-05,4.2e-05,0.00013,8e-05,5.7e-05,3.1e-05,0.001537,0.000363,2.4e-05,0.00063,0.000408,0.003761,0.001343,0.000422,0.000141,0.000165,0.000297,0.000217,0.000456,0.00019,0.001331,0.003077,0.002568,0.000334,0.00385,0.002689,0.004041,0.002755,0.001614,0.004305,0.001836,0.006489,0.003722,0.002385,0.003044,0.004212,0.007833,0.003529,0.00632,0.001727,0.001012,0.00025,0.002347,0.002657,0.001782,0.000275,0.000557,0.001817,0.0023,0.003219,0.001329,0.001033,0.000786,0.000679,0.001039,0.00149,0.000599,0.001195,0.00062,0.001196,0.00055,0.000427,0.00033,0.000416,0.000147,0.000995,0.000543,0.000217,0.000156,9.6e-05,0.000321,0.000267,0.000161,0.000147,1.6e-05,7.4e-05,1.9e-05,1.9e-05,4.2e-05,8.3e-05,4.9e-05,2.8e-05,1.2e-05,2.1e-05,2.6e-05,4.1e-05,6.6e-05,8.1e-05,1.1e-05,1.7e-05,2.7e-05,3.9e-05,2.9e-05,3.4e-05,3.9e-05,2.6e-05,1.6e-05,1.5e-05,1.2e-05,4.3e-05,1.9e-05,1.2e-05,3.4e-05,0.000274,0.000129,5.5e-05,4.5e-05,6.1e-05
3.1e-05,3.9e-05,3.7e-05,4.3e-05,3e-05,2.4e-05,3.5e-05,2.7e-05,4e-05,2.9e-05,2.1e-05,3.7e-05,1.2e-05,4.9e-05,0.000117,0.000126,1e-04,3.7e-05,2.5e-05,0.001437,0.002182,0.001282,0.001393,0.001086,0.004358,0.001858,0.000978,0.000427,0.000268,0.000527,0.000214,0.000625,0.000267,0.001446,0.003191,0.002426,0.003121,0.003202,0.003763,0.004746,0.002468,0.000185,0.003609,0.005145,0.008515,0.005028,0.002515,0.004183,0.001327,0.005794,0.00345,0.004395,0.005775,0.006397,0.002372,0.001743,0.002109,0.002124,0.001155,0.000826,0.00049,0.002621,0.002412,0.000273,0.000417,0.000402,0.000205,0.000188,0.003428,0.002117,0.002442,0.001967,0.000862,0.000346,9.5e-05,0.000136,0.000347,0.000286,0.000903,0.000868,0.000345,0.000165,4.6e-05,0.000235,0.000581,0.000543,6.4e-05,6.3e-05,4.3e-05,0.000117,9.2e-05,8e-05,0.00013,8.7e-05,3.9e-05,5.2e-05,5.1e-05,1.7e-05,5.5e-05,7.9e-05,3e-05,4.4e-05,1.5e-05,1.8e-05,3.9e-05,4.8e-05,3.2e-05,1.6e-05,1.9e-05,1.2e-05,2.2e-05,1.1e-05,4.4e-05,2.9e-05,6.5e-05,1.9e-05,0.000283,0.000246,0.000104,5.4e-05,5.2e-05
1.5e-05,2.6e-05,7e-06,3.2e-05,5e-06,1e-05,1.2e-05,1.6e-05,2.2e-05,7e-06,2.8e-05,5.7e-05,3.9e-05,2.2e-05,0.000108,6.4e-05,0.000118,7.9e-05,3.1e-05,0.001291,0.003729,0.001494,0.001441,0.001614,0.006324,0.004904,0.001992,0.000548,0.000227,0.000979,0.001075,0.001048,0.000785,0.001587,0.002035,0.001824,0.001691,0.003049,0.003112,0.003407,0.001776,0.002075,0.003489,0.003074,0.002433,0.000253,0.001166,0.002091,0.003884,0.003195,0.001456,0.001099,0.0021,0.003902,0.004663,0.001692,0.000597,0.00044,0.002013,0.001935,0.002416,0.001783,0.001124,0.001534,0.000599,0.00055,0.000873,0.001619,0.002702,0.002151,0.003247,0.001372,0.000381,0.000315,0.00031,0.000338,0.000395,0.000138,0.000832,0.001116,0.000663,0.000211,3.1e-05,0.000192,0.000274,0.000167,0.000226,0.000166,5.9e-05,0.000103,0.000212,0.000169,4e-06,5.4e-05,0.000102,4.3e-05,2.3e-05,3.6e-05,8.7e-05,2.8e-05,2.2e-05,4e-05,5.5e-05,3.5e-05,4e-05,3.7e-05,2.7e-05,3.3e-05,2.7e-05,3.8e-05,1.4e-05,2.9e-05,4.4e-05,6.5e-05,9.2e-05,8.7e-05,0.000321,0.000511,0.000252,9.1e-05,5.8e-05
5e-06,3.3e-05,3.2e-05,8e-06,2.6e-05,2.6e-05,1.1e-05,1.1e-05,6e-06,1.1e-05,2.2e-05,2e-05,2.3e-05,3.8e-05,0.000159,0.000111,0.000105,5.9e-05,3.5e-05,0.001035,0.003359,0.002974,0.001931,0.000635,0.005135,0.005254,0.002605,0.000743,0.000464,0.001043,0.000416,0.000623,0.000244,0.000968,0.001418,0.003656,0.002265,0.000859,0.003677,0.000519,0.000871,0.001057,0.001871,0.003125,0.001015,0.002138,0.000501,0.002784,0.004502,0.001085,0.001735,0.000792,0.000782,0.001464,0.002579,0.00247,0.000372,0.000247,0.001531,0.000893,0.001767,0.000611,0.000691,0.001455,0.000738,0.000871,0.001092,0.000737,0.001171,0.000154,0.003252,0.001604,0.000419,0.000334,0.000113,4.3e-05,0.000179,8.9e-05,0.000784,0.001088,0.000445,0.00011,8e-05,0.000311,0.000237,0.000153,0.000227,7.2e-05,4.7e-05,9.9e-05,0.00037,0.000386,0.000258,0.000105,5.4e-05,8.5e-05,6.5e-05,3.2e-05,5.3e-05,5.5e-05,5.7e-05,3.3e-05,2.4e-05,4.7e-05,4.3e-05,5e-05,3.7e-05,5.1e-05,4e-05,1e-05,3.7e-05,4.7e-05,3.4e-05,5.5e-05,0.000116,6.2e-05,0.000328,0.000588,0.000316,8.4e-05,5.1e-05
9e-06,2.4e-05,1.8e-05,2.4e-05,2.1e-05,2.2e-05,2.1e-05,1.5e-05,1.3e-05,1.2e-05,2.2e-05,1.6e-05,2e-05,2.4e-05,0.000161,0.000169,0.00017,7.2e-05,3.1e-05,0.000784,0.001917,0.000915,0.000537,0.000533,0.00335,0.002017,0.000985,0.000529,0.000331,0.000531,0.000815,0.000535,0.000488,0.00102,0.000487,0.00156,0.000311,0.000224,0.001832,0.001758,0.000597,0.000498,0.001528,0.001368,0.002445,0.00077,0.000603,0.002138,0.002983,0.00062,0.002655,0.001348,0.00134,0.001206,0.001687,0.000713,0.000496,0.000454,0.000588,0.000776,0.000894,0.000259,0.000316,0.000173,0.000403,0.000634,0.000246,0.000532,0.001276,0.000242,0.00227,0.001357,0.00034,0.00034,0.000178,9.9e-05,5.8e-05,9.5e-05,0.000617,0.000716,0.000414,2e-04,4.7e-05,0.000468,0.000285,0.000325,0.000292,0.000142,3e-05,0.000103,0.00027,9.7e-05,4e-05,6.5e-05,5e-05,0.000108,0.000102,5.7e-05,2.7e-05,3.5e-05,6.7e-05,3.3e-05,1.1e-05,2.9e-05,3.6e-05,1.1e-05,3.2e-05,2.4e-05,1.4e-05,1e-06,2.5e-05,2e-06,1.4e-05,7e-05,8e-06,1.3e-05,0.00033,0.000264,0.000147,9.6e-05,9.9e-05
8e-06,1.3e-05,5e-06,4e-06,1.8e-05,8e-06,1e-05,6e-06,6e-06,4e-06,2e-06,1.3e-05,1e-05,4e-06,0.000176,0.000151,6e-05,2.2e-05,1e-05,0.000583,0.000764,0.000234,0.000446,0.000816,0.002103,0.000404,0.000283,0.000191,0.000489,0.000151,0.000301,0.00036,4.3e-05,0.000676,0.000169,0.001299,0.000656,0.001286,0.001538,0.002372,0.001921,0.000125,0.00113,0.001562,0.001131,0.000787,0.000275,0.001479,0.003863,0.002474,0.001076,0.001092,0.000828,9e-04,0.000915,0.00064,0.000675,0.000927,0.00022,0.000999,0.000429,0.000246,0.000184,0.000668,0.000391,0.000395,0.000518,0.000339,0.00116,0.000115,0.00077,0.000496,0.000107,0.000142,7.8e-05,2e-05,0.000103,9.5e-05,0.000315,0.00038,0.000207,0.000105,6.9e-05,0.000381,0.000225,0.000199,0.000185,9.8e-05,5.8e-05,1.6e-05,0.000233,0.000142,6.6e-05,2.5e-05,1.7e-05,7.4e-05,1e-05,1.9e-05,1.4e-05,2.8e-05,4.6e-05,3.6e-05,1.7e-05,2.9e-05,5.5e-05,1.8e-05,2.5e-05,1e-06,1.3e-05,1.1e-05,1.5e-05,1.3e-05,3.3e-05,2.6e-05,3.1e-05,2.4e-05,0.000252,7.3e-05,1.4e-05,2.7e-05,7.3e-05
3e-06,7e-06,1e-06,4e-06,1e-05,8e-06,8e-06,5e-06,5e-06,2e-06,5e-06,4e-06,1.1e-05,5e-06,0.000181,6.6e-05,5.2e-05,1.3e-05,9e-06,0.000408,0.000231,0.00015,0.000748,0.000709,0.001604,0.000503,0.000419,0.000224,0.000605,0.000117,0.000216,0.000217,0.000121,0.000639,0.001013,0.000614,0.000391,0.002088,0.002274,0.001658,0.000716,0.001147,0.000833,0.000967,0.00155,0.000884,0.00054,0.002062,0.002213,0.001079,0.000572,0.00089,0.000926,0.001047,0.000812,0.000862,0.001181,0.001365,8e-04,0.001028,0.000714,0.000141,0.000737,7.9e-05,0.000239,0.000476,0.000393,0.000965,0.000693,0.00044,0.00052,0.000411,0.000162,0.000162,0.000107,0.000147,0.000143,8.5e-05,6.9e-05,0.000245,9e-05,7.3e-05,4.1e-05,0.000194,8.8e-05,0.000163,2.2e-05,5.5e-05,8e-06,2.9e-05,0.000203,0.000156,7.5e-05,9e-06,2.4e-05,2.2e-05,1.2e-05,1.1e-05,2e-05,2.8e-05,2.1e-05,8e-06,1.2e-05,2.8e-05,4.4e-05,5e-06,2.2e-05,3e-06,1.7e-05,2.1e-05,1.8e-05,2.4e-05,2.4e-05,1.5e-05,6.5e-05,1.6e-05,0.000218,9.4e-05,5.3e-05,2.9e-05,6.2e-05
7e-06,1e-05,1e-06,1.5e-05,1.5e-05,4e-06,5e-06,4e-06,2e-06,6e-06,7e-06,7e-06,1e-05,3e-06,0.000167,0.000157,4.3e-05,8e-06,6e-06,0.00028,0.000363,0.000184,0.00086,0.000628,0.001297,0.000422,0.000275,9.7e-05,0.000615,0.000358,0.00041,1.9e-05,4.2e-05,0.000657,0.002883,0.004489,0.001189,0.002405,0.003943,0.004877,0.003081,0.001066,0.002048,0.002658,0.003548,0.002001,0.000631,0.001761,0.003943,0.001534,0.003974,0.003062,0.00186,0.002727,0.002332,0.002294,0.001277,0.000568,0.001042,0.000759,0.000485,0.000769,0.001346,0.002331,0.000524,0.001051,0.001386,0.001035,0.001419,0.000569,0.000495,0.00041,0.000666,0.000338,0.000151,0.000108,0.000217,0.000161,0.00032,0.000295,0.000103,3.8e-05,5.4e-05,0.000238,0.000146,0.000108,7.3e-05,7.4e-05,2.2e-05,4.4e-05,0.000277,0.000147,7e-05,8.9e-05,4.2e-05,4.3e-05,2.8e-05,1.1e-05,2e-05,6.4e-05,1.3e-05,2.8e-05,1.2e-05,2.3e-05,4.9e-05,1.4e-05,1.5e-05,2e-05,6e-06,4e-06,8e-06,1.1e-05,3.6e-05,9e-06,6.8e-05,3.3e-05,0.000189,0.000144,7e-05,4.2e-05,4.8e-05
9e-06,6e-06,7e-06,2.2e-05,2.1e-05,6e-06,1e-05,1.5e-05,7e-06,5e-06,2.2e-05,1.7e-05,2.1e-05,2e-05,0.000148,0.000119,7.2e-05,2.4e-05,6e-06,0.000245,0.000316,0.00026,0.001133,0.00056,0.000783,0.000859,0.000459,0.000193,0.000664,0.001128,0.000711,0.00015,1e-04,0.000708,0.004547,0.003879,0.003855,0.003221,0.003118,0.002858,0.001559,0.003049,0.004879,0.002715,0.002418,0.003378,0.002005,0.002598,0.007963,0.003081,0.005706,0.002177,0.001486,0.001779,0.001616,0.002886,0.001322,0.001328,0.003255,0.001685,0.001924,0.001119,0.000512,0.001686,0.00151,0.001405,0.001078,0.002722,0.002439,0.000853,0.000503,0.001022,0.000943,0.000248,0.000115,0.00019,0.000431,0.000157,0.000463,0.000394,0.000191,9e-05,6.2e-05,0.000402,0.000287,0.000142,5.5e-05,5.5e-05,4.1e-05,3e-05,0.000281,0.000126,1.9e-05,6.7e-05,8.3e-05,3.2e-05,2.5e-05,3.5e-05,1.3e-05,8e-05,3.7e-05,2.5e-05,2.1e-05,5.3e-05,6.1e-05,1.2e-05,1.4e-05,9e-06,8e-06,2.1e-05,1.6e-05,1.6e-05,3e-05,3.1e-05,6.6e-05,3.9e-05,0.000138,0.000145,4.7e-05,3.5e-05,3e-06
1e-05,1.5e-05,1.3e-05,8e-06,8e-06,8e-06,1.2e-05,6e-06,1e-05,1e-05,2.5e-05,1.2e-05,1.5e-05,1.6e-05,0.000141,5.2e-05,2.6e-05,2.3e-05,2.2e-05,0.000269,0.000476,0.000161,0.001524,0.00079,0.000931,0.000862,0.000732,0.000347,0.000604,0.001093,7e-04,0.00038,9.6e-05,0.000633,0.004712,0.008456,0.001927,0.005067,0.005518,0.004895,0.006193,0.006472,0.004511,0.002954,0.003837,0.00481,0.004536,0.003547,0.009662,0.007668,0.007007,0.009047,0.00476,0.00353,0.001435,0.00364,0.003877,0.001756,0.005976,0.002736,0.002045,0.001681,0.002038,0.001804,0.001676,0.003078,0.001848,0.003172,0.001856,0.001972,0.002903,0.001169,0.001297,0.001668,0.00097,0.000445,0.000673,0.00058,0.000537,0.000304,0.000127,0.000106,9.2e-05,0.000487,0.000286,0.000193,6e-05,3.4e-05,2.2e-05,1.3e-05,0.000213,2.3e-05,5.5e-05,5.4e-05,3.6e-05,0.000102,2.7e-05,5.7e-05,6.2e-05,9.2e-05,2.4e-05,3e-05,6e-05,3.1e-05,6.7e-05,4.5e-05,1.5e-05,3.1e-05,2.3e-05,3e-05,1.7e-05,5e-06,3.3e-05,5.5e-05,2.5e-05,3.2e-05,0.000104,5.9e-05,5.6e-05,3.4e-05,2.4e-05
1e-05,1.2e-05,4e-06,3e-06,1.8e-05,6e-06,5e-06,1.2e-05,9e-06,2e-06,2e-05,1.1e-05,5e-06,3e-06,0.000116,0.000157,7.2e-05,3.2e-05,3e-06,0.000287,0.000347,0.000715,0.001816,0.001289,0.002438,0.002184,0.001066,0.000276,0.000602,0.000239,2.7e-05,0.000203,0.000103,0.000574,0.004477,0.008642,0.01129,0.008238,0.008213,0.010378,0.013077,0.012806,0.010257,0.008265,0.00731,0.007006,0.011476,0.012822,0.005815,0.004503,0.003732,0.008618,0.007221,0.005017,0.006453,0.00599,0.00472,0.004763,0.002648,0.002718,0.003169,0.003103,0.00365,0.006072,0.001956,0.001716,0.000485,0.00207,0.005276,0.005385,0.001049,0.003829,0.003424,0.002835,0.001077,0.000175,0.00017,0.000514,0.000655,0.000133,0.000129,0.000253,0.000138,0.000283,0.000223,0.000223,7.1e-05,7e-05,2e-05,2.8e-05,0.000324,0.000104,6.1e-05,1.7e-05,1.6e-05,0.000165,0.000136,1.7e-05,7.2e-05,4.2e-05,4.8e-05,4.1e-05,6.5e-05,7.6e-05,0.000153,0.00012,8.4e-05,1.9e-05,4.1e-05,6.1e-05,4.3e-05,1.6e-05,2.8e-05,5.9e-05,6.8e-05,6.8e-05,8.3e-05,6e-05,3.3e-05,1.5e-05,1e-05
2.2e-05,1.6e-05,1e-06,1.5e-05,3.1e-05,2.5e-05,1.7e-05,7e-06,2.4e-05,1.8e-05,8e-06,4e-06,9e-06,7e-06,9.8e-05,0.000117,0.000105,5.8e-05,1.8e-05,0.000284,4.4e-05,0.000376,0.001423,0.001039,0.00379,0.00235,0.000908,0.000173,0.000575,0.000362,0.000213,0.000191,9.1e-05,0.000476,0.00436,0.001687,0.007135,0.005729,0.007075,0.007205,0.003821,0.003173,0.001942,0.008295,0.007008,0.008999,0.006349,0.005769,0.003515,0.00335,0.005834,0.001564,0.006292,0.010891,0.002095,0.002393,0.004707,0.003691,0.002409,0.004797,0.002056,0.005883,0.001902,0.006917,0.004594,0.000895,0.002133,0.004177,0.005989,0.003938,0.003714,0.00328,0.002153,0.002412,0.001385,0.000762,0.000321,0.000221,0.000119,0.000122,0.00016,0.000121,0.000143,9.9e-05,0.000193,7.8e-05,0.000227,0.000103,0.000103,5.1e-05,0.000633,0.000363,0.000198,4.3e-05,5e-05,0.000104,0.000138,0.000106,4.2e-05,4.3e-05,8.3e-05,4.2e-05,3.3e-05,8e-06,9.9e-05,4.7e-05,3.4e-05,2.8e-05,5.1e-05,3.7e-05,4.1e-05,2.6e-05,4e-05,2.1e-05,2.4e-05,4.1e-05,0.000119,4.8e-05,2e-05,2.4e-05,4.4e-05
6e-06,4e-06,1e-06,2.5e-05,3.1e-05,9e-06,1.3e-05,1.7e-05,2.1e-05,1.2e-05,9e-06,9e-06,1.2e-05,4e-06,7.7e-05,1.9e-05,3.5e-05,1.4e-05,1.7e-05,0.000277,0.000102,0.000306,0.001583,0.001282,0.0036,0.002339,0.000853,0.000183,0.00056,0.000213,2e-04,0.00019,5.4e-05,0.000264,0.003365,0.003467,0.004031,0.004765,0.000858,0.000506,0.003584,0.003983,0.005579,0.005876,0.00434,0.003647,0.003495,0.001161,0.001195,0.002431,0.00463,0.003479,0.006251,0.001839,0.005527,0.004022,0.001738,0.003342,0.004177,0.007473,0.008609,0.006593,0.002681,0.004557,0.003776,0.002958,0.003715,0.001812,0.001347,4.6e-05,0.001436,0.002459,0.000887,0.00071,0.000282,0.000266,0.000183,0.000368,0.000445,0.00012,4e-05,8.7e-05,1.6e-05,0.000267,0.000307,0.000403,0.000431,0.00024,0.000134,4.9e-05,0.000883,0.000586,0.000177,3.5e-05,2.4e-05,4.2e-05,9.5e-05,6.7e-05,5.7e-05,0.000106,0.00014,5.5e-05,1.3e-05,5.9e-05,1.3e-05,5.8e-05,2.7e-05,4.2e-05,3.8e-05,2.8e-05,3.1e-05,1.7e-05,2.1e-05,1.9e-05,1.3e-05,5e-05,8.6e-05,6.6e-05,4e-05,7e-06,4.1e-05
2.1e-05,1.4e-05,2e-06,2.7e-05,1.2e-05,4e-06,1.2e-05,2.6e-05,2.4e-05,1.3e-05,5e-06,1.3e-05,1.5e-05,1.4e-05,6.5e-05,0.000103,5.7e-05,2.6e-05,1.1e-05,0.000264,2.1e-05,0.000465,0.001386,0.000688,0.00312,0.002104,0.001033,0.000301,0.000566,0.000812,0.000588,0.000206,0.000136,0.000282,0.001843,0.002265,0.002546,0.003615,0.00392,0.001277,0.001317,0.001865,0.003733,0.00231,0.003671,0.002579,0.002543,0.001388,0.001087,0.002594,0.002331,0.002404,0.004164,0.003465,0.003604,0.002127,0.002522,0.001492,0.002588,0.004509,0.002557,0.001539,0.001921,0.001335,0.000742,0.001344,0.002277,0.003791,0.002783,0.001301,0.001859,0.001039,0.001339,0.000549,0.000243,5e-05,0.000262,0.000289,0.000359,0.000398,0.000213,5.2e-05,6.7e-05,0.000442,0.00014,0.000309,0.000324,0.000148,8.6e-05,9.1e-05,0.000999,0.000908,0.000479,0.000132,6.2e-05,0.000136,6.5e-05,8.3e-05,0.000139,0.000184,0.000354,0.000278,0.000148,0.000129,7.3e-05,7.1e-05,4.3e-05,3.2e-05,5.8e-05,1.2e-05,1.2e-05,1e-05,1.1e-05,3.4e-05,2e-05,3.9e-05,0.000106,5.6e-05,1.7e-05,2.2e-05,4e-05
2e-05,1.9e-05,7e-06,2e-05,1.8e-05,1.8e-05,1.4e-05,2.1e-05,1.5e-05,1e-05,1.4e-05,1.9e-05,4e-06,6e-06,7.5e-05,0.000125,5.6e-05,2.8e-05,1.9e-05,0.000274,9.3e-05,0.00046,0.000445,0.000193,0.001927,0.000582,0.000102,0.000173,0.000501,0.00048,6.8e-05,0.00023,2.5e-05,0.000178,0.000827,0.001127,0.001319,0.003051,0.001515,0.002723,0.001084,0.001729,0.000946,6.2e-05,0.002149,0.001419,0.001393,0.000422,0.001337,0.004099,0.003589,0.000824,0.001381,0.000125,0.002409,0.002298,0.003443,0.003298,0.002333,0.001527,0.001318,0.000981,0.001463,0.000543,0.000818,0.000958,0.001176,0.000799,0.000861,0.000457,0.001113,0.000697,0.000631,0.000272,0.000286,0.000156,3.5e-05,0.000134,0.000395,0.000396,0.000226,0.000125,0.000135,0.000354,0.000211,0.00025,0.000148,2.6e-05,2.2e-05,5.2e-05,0.001082,0.000712,0.000284,6.4e-05,0.000106,0.000221,2e-04,0.000154,0.000167,2.6e-05,0.000267,0.000147,6e-05,8.1e-05,5.9e-05,4.1e-05,2.6e-05,1.8e-05,2.7e-05,4.5e-05,4.2e-05,3.8e-05,3e-06,2.6e-05,2.4e-05,9e-06,6.2e-05,7.1e-05,5e-05,1.5e-05,5.2e-05
6e-06,6e-06,1e-05,2.4e-05,1e-06,6e-06,1.2e-05,4e-06,5e-06,1.1e-05,1.2e-05,1.7e-05,1e-05,2e-06,7.5e-05,7.9e-05,6e-05,3.4e-05,7e-06,0.000241,4.9e-05,0.000342,0.000566,0.00042,0.000722,0.000418,0.000273,0.000103,0.000305,0.000303,0.000148,0.000183,0.000194,0.000339,0.001737,0.001256,0.000964,0.002307,0.001019,0.001006,0.000706,0.001082,0.001441,0.001128,0.000852,0.001828,0.001527,0.000546,0.00164,0.001873,0.000544,0.000859,0.001572,0.000859,0.002052,0.001281,0.001105,0.00109,0.001828,0.001427,0.000925,0.000803,0.000257,0.000969,0.000607,0.000413,0.000677,0.000997,0.000985,0.000532,0.00087,0.00039,0.000554,0.000211,0.000295,0.000123,0.000101,0.000199,0.000326,0.000155,8e-06,3.2e-05,3.9e-05,0.000232,0.000106,0.000142,3e-05,7.9e-05,3.8e-05,3.1e-05,0.000996,0.000406,0.000166,5.8e-05,7.3e-05,0.000202,7.3e-05,8.6e-05,0.000113,0.000103,0.000138,5.1e-05,2.7e-05,4.4e-05,6.4e-05,2.5e-05,1.9e-05,2.2e-05,2.3e-05,1.5e-05,9e-06,6e-06,1.9e-05,1.1e-05,2.3e-05,3.1e-05,8.6e-05,7.3e-05,3.1e-05,1.7e-05,5.9e-05
2e-06,2e-06,2e-06,4e-06,4e-06,2e-06,4e-06,1e-06,3e-06,5e-06,1e-06,3e-06,3e-06,3e-06,3.1e-05,2.2e-05,5e-06,5e-06,5e-06,0.000114,3.5e-05,0.000128,0.000158,0.000174,0.000271,0.000199,9e-05,6.5e-05,0.000127,0.000186,7.8e-05,8.6e-05,3.6e-05,0.000249,0.000681,0.000408,0.000681,0.00088,5e-04,0.000914,0.000502,0.000346,0.000872,0.000359,0.000356,0.000246,0.000511,0.000187,0.000495,0.000692,0.000412,0.000659,0.000843,0.000344,0.00052,0.000926,0.000608,0.000347,0.000251,0.000492,0.000209,0.000156,0.000338,0.000362,5.3e-05,4.8e-05,2.1e-05,0.000264,0.000332,8.3e-05,0.000103,0.000162,0.000127,0.000121,4.4e-05,2.6e-05,4e-05,7.3e-05,0.000185,5.9e-05,2.6e-05,1.7e-05,4e-06,8.4e-05,5.2e-05,4.3e-05,1.4e-05,2.7e-05,1.4e-05,7e-06,0.000427,0.000234,0.000111,4.2e-05,3e-05,2.9e-05,4e-05,1.7e-05,3.6e-05,5e-06,9e-06,2.3e-05,1.8e-05,5e-06,1.5e-05,7e-06,8e-06,5e-06,7e-06,8e-06,6e-06,6e-06,1e-05,1.1e-05,8e-06,7e-06,2.7e-05,2.5e-05,1.2e-05,5e-06,8e-06
3e-06,1e-06,2e-06,2e-06,2e-06,3e-06,6e-06,3e-06,1e-06,3e-06,1e-06,3e-06,1e-06,4e-06,3.2e-05,1.1e-05,1e-05,4e-06,3e-06,0.000101,5e-05,0.000112,0.000236,7.1e-05,0.000329,8.7e-05,1.9e-05,6.8e-05,8.3e-05,6.2e-05,8.4e-05,6.1e-05,1.2e-05,0.000283,0.00047,0.000448,0.000377,0.000379,0.000844,0.000455,0.000505,0.000458,0.000253,0.000195,0.000505,0.000461,0.000384,0.000166,0.000478,0.000453,0.000534,0.000326,0.000419,0.000344,4.3e-05,0.000245,0.000187,0.000361,0.000465,0.000311,0.000183,0.000167,0.000321,0.000324,0.000135,1e-04,3.6e-05,0.000294,0.000175,7.2e-05,0.000271,9.5e-05,9.4e-05,1e-04,5.8e-05,2.3e-05,1.7e-05,4.9e-05,0.000138,3.5e-05,2.5e-05,1.5e-05,1.4e-05,6.1e-05,4.5e-05,1.6e-05,1e-05,6e-06,1.3e-05,1.5e-05,0.000301,0.000111,2.6e-05,2.4e-05,3.1e-05,2.9e-05,1.7e-05,5e-06,9e-06,2.3e-05,2.7e-05,1.3e-05,1.2e-05,3e-06,8e-06,9e-06,2e-06,5e-06,1e-06,4e-06,3e-06,8e-06,4e-06,6e-06,8e-06,6e-06,2.3e-05,1.9e-05,1.5e-05,5e-06,9e-06
2e-06,5e-06,0,4e-06,2e-06,5e-06,2e-06,1e-06,1e-06,3e-06,3e-06,3e-06,2e-06,3e-06,2.7e-05,6e-06,7e-06,1e-06,2e-06,9.7e-05,3.5e-05,7.1e-05,0.000143,0.000168,0.00022,0.000126,3.3e-05,3e-05,1e-05,6.2e-05,4.9e-05,2.7e-05,2.9e-05,0.000325,0.000194,0.000121,0.000303,0.000277,0.000289,0.000394,0.000633,0.000739,0.000251,8.8e-05,0.000489,0.000445,0.000516,0.000475,0.000407,0.000547,0.000383,0.000146,0.000649,0.000343,0.000336,0.00024,0.00034,0.000304,0.000416,0.000404,0.000138,0.000131,0.000209,0.000145,0.000101,0.000114,1e-05,0.000246,0.000308,0.000103,0.000201,0.000214,9.8e-05,8.8e-05,3.3e-05,1.9e-05,1.9e-05,4.2e-05,9.3e-05,1e-05,1e-05,2e-05,1e-05,3.8e-05,1e-05,1.5e-05,1.3e-05,5e-06,1.7e-05,2e-06,0.00018,0.000133,4.3e-05,1.3e-05,3.8e-05,4.5e-05,4.5e-05,1.5e-05,1.1e-05,2.5e-05,1.3e-05,2e-05,1.4e-05,4e-06,3e-06,4e-06,3e-06,1e-05,5e-06,8e-06,4e-06,8e-06,1e-05,8e-06,8e-06,6e-06,1.6e-05,1e-05,6e-06,3e-06,8e-06
3e-06,4e-06,3e-06,5e-06,2e-06,3e-06,3e-06,5e-06,1e-06,1e-06,3e-06,2e-06,3e-06,3e-06,2.1e-05,5e-06,9e-06,4e-06,2e-06,9.5e-05,3.5e-05,5.1e-05,7.5e-05,9.4e-05,0.000134,0.000142,7.8e-05,4.4e-05,2.1e-05,7.9e-05,0.000101,5e-06,2.5e-05,0.000275,0.000227,0.000332,0.000299,0.000227,0.000217,0.000478,0.000245,0.000425,0.000554,0.000305,0.000413,0.000266,0.000513,0.000448,0.000118,0.000432,0.000268,0.000291,0.00023,0.000331,0.000515,0.000254,0.000354,0.000154,0.000367,0.000186,0.000164,7.2e-05,0.000285,0.000104,0.00015,2.7e-05,5.7e-05,0.000149,0.000132,0.000109,9.1e-05,8.7e-05,8.6e-05,6.6e-05,4.6e-05,2.1e-05,1e-06,4.9e-05,7.1e-05,3e-06,1.8e-05,2.1e-05,2.3e-05,1.2e-05,1e-05,2.6e-05,8e-06,1.1e-05,1.7e-05,2.1e-05,9e-05,7.1e-05,3.4e-05,1.3e-05,2.8e-05,2.3e-05,2e-05,3e-06,1.3e-05,1.6e-05,2e-05,9e-06,5e-06,6e-06,6e-06,2e-06,8e-06,5e-06,5e-06,6e-06,6e-06,1e-06,2e-06,3e-06,3e-06,4e-06,1e-05,1e-06,3e-06,5e-06,2e-06
1e-06,2e-06,3e-06,4e-06,2e-06,3e-06,1e-06,3e-06,5e-06,3e-06,2e-06,3e-06,1e-06,3e-06,1.6e-05,3e-06,9e-06,6e-06,3e-06,9.1e-05,3.6e-05,6.9e-05,2.4e-05,0.000108,0.000246,0.000159,6.7e-05,2.1e-05,3.8e-05,0.000111,3e-05,5e-05,2.4e-05,0.00022,0.000223,0.000409,8.8e-05,0.000162,9.9e-05,0.000142,0.000498,0.000499,0.000582,0.000369,0.000364,0.00066,0.000278,0.00067,0.000195,0.000204,0.000381,0.000454,0.000453,0.000416,3.8e-05,0.000204,7.1e-05,0.000163,0.000293,0.000233,0.000168,9.7e-05,0.000237,0.000113,7.5e-05,0.000104,6.1e-05,4.3e-05,0.000178,0.000127,5.2e-05,0.000123,9.4e-05,4.4e-05,3.9e-05,1.1e-05,2.4e-05,4.4e-05,0.000101,2.5e-05,1.4e-05,1.6e-05,4e-06,2e-05,1e-05,3.9e-05,1.2e-05,9e-06,8e-06,1.4e-05,0.000114,6.5e-05,3.6e-05,9e-06,1.8e-05,9e-06,1.7e-05,7e-06,1.2e-05,2.4e-05,1.7e-05,7e-06,8e-06,7e-06,1e-06,5e-06,3e-06,4e-06,9e-06,6e-06,5e-06,3e-06,3e-06,2e-06,3e-06,4e-06,1.8e-05,1e-05,2e-06,5e-06,7e-06
1e-06,2e-06,2e-06,2e-06,1e-06,2e-06,2e-06,3e-06,2e-06,1e-06,0,3e-06,1e-06,2e-06,1.2e-05,5e-06,4e-06,1e-06,2e-06,8.5e-05,2.2e-05,9.2e-05,0.000136,7.7e-05,0.000338,0.000195,8.4e-05,1.7e-05,6.4e-05,0.000196,0.000128,5.7e-05,2.9e-05,0.000169,0.000257,0.000251,0.000181,0.000522,0.000612,0.000746,0.00058,0.000459,0.000409,0.000724,0.000402,0.000302,0.000313,0.000493,0.00036,0.000218,0.000385,0.000224,0.000551,0.000521,0.000429,2.2e-05,0.000302,0.000179,0.000548,0.000333,7.6e-05,0.000198,0.000188,9.9e-05,0.000112,6.5e-05,4.3e-05,1e-04,9.8e-05,5.6e-05,6.9e-05,4.5e-05,0.000131,5.6e-05,0.000101,5.5e-05,3.7e-05,8.7e-05,9.7e-05,4.2e-05,3.2e-05,1.4e-05,4e-06,9e-06,8e-06,3.7e-05,9e-06,9e-06,5e-06,1.5e-05,0.000168,7.9e-05,2.5e-05,2.3e-05,2e-05,1.6e-05,1.6e-05,5e-06,4e-06,9e-06,4e-06,4e-06,1.3e-05,9e-06,9e-06,5e-06,5e-06,3e-06,7e-06,4e-06,8e-06,2e-06,2e-06,3e-06,1e-05,5e-06,1.2e-05,8e-06,1e-05,3e-06,1.4e-05
2e-06,1e-06,0,2e-06,1e-06,2e-06,0,1e-06,2e-06,4e-06,3e-06,2e-06,1e-06,2e-06,9e-06,4e-06,3e-06,4e-06,2e-06,7.9e-05,1.7e-05,8.5e-05,9.2e-05,0.000126,0.000286,0.000108,3.8e-05,1.4e-05,7.5e-05,0.000102,6.4e-05,5.3e-05,2.7e-05,0.000171,0.000237,0.000171,0.000377,0.000617,0.000116,0.000586,5.3e-05,0.000523,0.000278,0.00053,0.00034,0.000386,0.000325,3e-04,0.000247,0.000399,0.000252,0.000458,0.00035,0.000261,0.000156,0.000129,0.000181,0.000149,0.000569,0.000302,5.6e-05,0.000285,0.000139,0.000134,0.000131,0.000252,0.000218,0.00027,3.2e-05,8.7e-05,3.5e-05,0.000113,6.6e-05,5.8e-05,4.8e-05,2e-05,3.4e-05,7.2e-05,0.000138,8.3e-05,4.1e-05,2.1e-05,2.1e-05,3.6e-05,3.4e-05,7e-06,1.3e-05,2e-05,1.9e-05,1.5e-05,0.000205,5.7e-05,4e-05,3.1e-05,2.7e-05,1.8e-05,2.2e-05,6e-06,4e-06,1e-05,6e-06,1e-06,1.3e-05,8e-06,1e-05,1e-05,6e-06,4e-06,9e-06,7e-06,7e-06,3e-06,3e-06,4e-06,1.1e-05,1.1e-05,1.1e-05,7e-06,4e-06,5e-06,1.9e-05
1e-06,1e-06,1e-06,2e-06,1e-06,1e-06,1e-06,1e-06,3e-06,5e-06,3e-06,1e-06,2e-06,2e-06,5e-06,6e-06,6e-06,3e-06,4e-06,7.1e-05,1.5e-05,0.000123,7.2e-05,0.000122,0.000356,0.000192,9.2e-05,1.9e-05,6.6e-05,4.1e-05,4e-05,1.6e-05,5e-06,0.000139,9e-05,0.000345,0.000123,0.000481,0.000632,0.000196,0.000141,0.000384,0.000393,0.000335,0.000205,0.000353,0.000259,0.000289,0.000112,0.000268,0.000273,0.000429,9.7e-05,0.000345,0.000357,0.000322,0.000234,0.000183,0.000335,0.000331,7.5e-05,0.000163,0.000321,0.000287,0.000266,0.000399,0.000169,0.000334,0.000309,0.000208,0.000174,0.000229,0.000127,0.000111,9e-05,5.7e-05,5.1e-05,4.8e-05,8.6e-05,4.3e-05,1.4e-05,3.1e-05,8e-06,3.3e-05,3.2e-05,1.6e-05,1.1e-05,4e-06,1.8e-05,4e-06,0.000205,0.000142,6.1e-05,5.4e-05,2.8e-05,1.6e-05,1.1e-05,8e-06,6e-06,1.5e-05,6e-06,1e-06,4e-06,6e-06,7e-06,4e-06,1.2e-05,7e-06,4e-06,2e-06,1e-06,5e-06,6e-06,2e-06,9e-06,7e-06,1.8e-05,9e-06,1e-05,9e-06,1.9e-05
1e-06,2e-06,2e-06,1e-06,1e-06,1e-06,2e-06,2e-06,1e-06,1e-06,1e-06,2e-06,2e-06,3e-06,1e-05,3e-06,2e-06,3e-06,4e-06,7.8e-05,2e-05,0.000146,8.6e-05,0.000148,0.000359,0.000196,6.3e-05,7e-06,8e-05,8.6e-05,6.8e-05,4e-06,6e-06,0.000123,0.000192,0.000421,0.00017,0.000566,0.000442,0.000367,0.000136,0.000345,0.000227,0.000205,0.000535,0.000361,0.000234,0.000195,0.000122,8.6e-05,0.000404,0.000162,8.4e-05,0.000137,0.000326,0.000251,0.000272,0.000266,0.000131,0.00034,0.000225,0.000115,0.000372,0.000264,0.000125,0.000112,0.000139,0.000252,0.000461,0.00034,0.000234,0.00013,4.8e-05,2.9e-05,9.5e-05,8.7e-05,3.4e-05,6.1e-05,9.2e-05,1.9e-05,2.7e-05,4.4e-05,4.4e-05,9e-06,1.7e-05,2.9e-05,1.5e-05,2.3e-05,9e-06,1.3e-05,0.000182,0.000167,9.9e-05,2.3e-05,2.5e-05,2.6e-05,2.1e-05,1.7e-05,1e-05,2.4e-05,1.7e-05,1.6e-05,1.2e-05,7e-06,8e-06,1.2e-05,1.4e-05,1.1e-05,1e-05,1e-05,4e-06,1e-06,7e-06,8e-06,8e-06,1e-05,2.2e-05,1.1e-05,6e-06,4e-06,1.7e-05
1e-06,2e-06,0,2e-06,1e-06,1e-06,2e-06,1e-06,1e-06,1e-06,1e-06,1e-06,1e-06,1e-06,9e-06,4e-06,2e-06,1e-06,4e-06,7.6e-05,3.2e-05,0.000153,0.000103,4.7e-05,0.000113,6.4e-05,1.6e-05,5e-06,8.4e-05,0.000133,2.6e-05,4.4e-05,2.7e-05,0.000121,0.000217,0.000197,0.000325,0.000338,0.000617,9.7e-05,0.00028,0.000322,9.3e-05,0.00026,0.000334,0.000186,0.000151,0.000148,0.000136,0.000195,0.000288,0.000427,0.000233,0.000242,0.000131,0.000404,0.000124,0.000303,0.00025,0.000201,0.000199,0.000117,0.000376,0.000538,0.000416,0.000226,0.000217,0.00026,0.000302,0.000137,0.000194,0.000124,5.3e-05,4.7e-05,4.5e-05,2.2e-05,2.7e-05,1.8e-05,7.2e-05,1e-05,1.7e-05,2.8e-05,9e-06,1.4e-05,5e-06,2.4e-05,1.4e-05,2.3e-05,1.6e-05,1.2e-05,0.000145,6e-05,2e-05,3e-06,6e-06,1.8e-05,2.1e-05,5e-06,9e-06,1.1e-05,6e-06,7e-06,9e-06,7e-06,3e-06,7e-06,2e-06,5e-06,3e-06,4e-06,5e-06,4e-06,8e-06,7e-06,1e-05,2e-06,1.6e-05,7e-06,9e-06,1e-05,1.3e-05
1e-06,1e-06,1e-06,2e-06,0,1e-06,2e-06,1e-06,1e-06,3e-06,1e-06,1e-06,1e-06,2e-06,6e-06,8e-06,5e-06,8e-06,6e-06,7.5e-05,2.2e-05,0.000125,7.9e-05,0.000104,0.000118,5.8e-05,1.5e-05,2e-05,7.4e-05,0.000151,6.8e-05,3.5e-05,6e-06,9.6e-05,0.000138,0.000147,0.000102,0.000264,0.000332,0.000247,0.000174,0.000247,0.000153,0.000219,0.000279,0.000365,0.000185,7.4e-05,0.000244,2.2e-05,5.2e-05,0.000456,0.000233,0.000148,0.000107,0.000231,0.000288,0.000339,0.000244,0.000215,0.000165,0.000295,6.7e-05,0.000229,0.00017,0.000237,8.2e-05,0.000133,0.000111,7.2e-05,8.1e-05,0.000108,1.9e-05,5.9e-05,6.9e-05,4.8e-05,9e-06,2.9e-05,7.6e-05,1.4e-05,6e-06,3e-05,2e-05,9e-06,1.3e-05,2.9e-05,1.8e-05,2e-06,4e-06,7e-06,0.000114,1.8e-05,3.1e-05,3.5e-05,2.2e-05,7e-06,5e-06,1e-06,8e-06,1.4e-05,8e-06,1.1e-05,6e-06,8e-06,5e-06,8e-06,6e-06,4e-06,4e-06,3e-06,4e-06,4e-06,7e-06,8e-06,7e-06,5e-06,1e-05,1.4e-05,1.4e-05,1.9e-05,2.2e-05
1e-06,2e-06,1e-06,1e-06,0,2e-06,3e-06,1e-06,2e-06,2e-06,1e-06,1e-06,0,0,6e-06,6e-06,4e-06,8e-06,2e-06,7.8e-05,2.8e-05,0.000125,0.000141,0.000128,0.000184,5.2e-05,2.1e-05,1.7e-05,6e-05,3.3e-05,6.6e-05,6.2e-05,2.3e-05,0.000119,7e-05,0.000293,0.000221,0.000107,0.000315,0.000195,0.000179,0.000311,0.000144,0.000235,0.000332,0.000145,0.000219,0.000166,0.000152,0.000205,0.000211,0.000154,0.000296,0.000164,5.4e-05,0.000193,0.000125,0.000151,0.000355,5.4e-05,0.000167,0.000256,5.4e-05,0.000184,7.9e-05,0.000185,0.000141,0.000244,6.7e-05,0.000221,0.000153,0.000119,0.000104,9e-05,6.4e-05,2.9e-05,4e-05,7.1e-05,9.6e-05,2e-05,8e-06,1.9e-05,1.4e-05,2.7e-05,6e-06,2.4e-05,1.7e-05,1.4e-05,4e-06,9e-06,9.4e-05,3.7e-05,3.5e-05,3.1e-05,1e-05,1.4e-05,1.4e-05,1.4e-05,5e-06,8e-06,1.2e-05,9e-06,1.4e-05,7e-06,5e-06,9e-06,2e-06,3e-06,4e-06,3e-06,5e-06,6e-06,3e-06,5e-06,8e-06,9e-06,3e-06,1e-05,6e-06,1e-05,3e-06
3e-06,3e-06,4e-06,4e-06,2e-06,1e-06,2e-06,3e-06,3e-06,4e-06,3e-06,3e-06,2e-06,2e-06,7e-06,2e-06,5e-06,1e-05,9e-06,7.7e-05,1.7e-05,0.000121,0.000278,0.000209,0.000249,0.000135,6.9e-05,1e-05,6e-05,9.1e-05,4.9e-05,2.2e-05,2.7e-05,0.000112,0.000258,0.000261,0.000113,2.9e-05,0.000319,0.000255,0.000194,0.00024,0.000172,3.9e-05,0.000313,0.000417,0.000152,0.000191,0.000361,0.000305,0.00017,0.000242,0.000282,0.000166,5.2e-05,0.000131,0.000212,7.7e-05,9.7e-05,0.000145,7.2e-05,0.000271,0.000324,4.2e-05,6.6e-05,0.000114,4.3e-05,0.000117,5.8e-05,0.000218,0.000157,0.000152,0.000133,5.6e-05,4.4e-05,4e-06,6.1e-05,8e-06,8.1e-05,3.4e-05,1.3e-05,8e-06,1.2e-05,2.9e-05,4.3e-05,3.4e-05,2.6e-05,5e-06,7e-06,5e-06,8.1e-05,8.1e-05,3.3e-05,2.8e-05,2.2e-05,9e-06,7e-06,1e-05,1e-05,8e-06,8e-06,1.3e-05,1.3e-05,7e-06,6e-06,3e-06,2e-06,4e-06,4e-06,2e-06,1e-06,1e-06,3e-06,1e-06,5e-06,8e-06,5e-06,1.4e-05,8e-06,7e-06,9e-06
2e-06,0,2e-06,2e-06,1e-06,2e-06,1e-06,3e-06,1e-06,1e-06,2e-06,1e-06,3e-06,2e-06,4e-06,6e-06,2e-06,6e-06,7e-06,6.5e-05,2.6e-05,0.000106,0.000137,5.9e-05,0.000408,0.000263,0.000109,5e-06,2.6e-05,0.000264,0.000101,2.9e-05,1.7e-05,0.000111,0.000287,0.000211,0.000209,0.000149,0.000109,0.000238,0.000219,0.000183,6.7e-05,6.3e-05,0.000397,0.000197,7.1e-05,0.00019,0.000359,0.000462,0.000247,0.000389,0.000376,0.000209,0.000566,0.000491,0.000241,4.2e-05,0.000215,0.000304,0.000203,0.000218,0.000353,0.000195,0.000252,0.000129,6.2e-05,0.000258,0.000169,0.000187,0.000135,3.2e-05,8.9e-05,0.000157,5.3e-05,1.1e-05,3e-05,4.2e-05,7.9e-05,2.8e-05,2e-05,1.1e-05,1.4e-05,2.5e-05,4.2e-05,2e-05,2.3e-05,3e-05,2.1e-05,5e-06,9e-05,0.000143,6.7e-05,3.5e-05,9e-06,6e-06,7e-06,4e-06,1e-06,7e-06,2e-06,4e-06,4e-06,4e-06,1e-06,2e-06,3e-06,3e-06,6e-06,5e-06,2e-06,3e-06,4e-06,4e-06,5e-06,7e-06,3e-06,1.2e-05,6e-06,7e-06,4e-06
1e-06,1e-06,1e-06,2e-06,1e-06,1e-06,1e-06,1e-06,2e-06,2e-06,1e-06,1e-06,2e-06,2e-06,5e-06,7e-06,3e-06,5e-06,3e-06,6.1e-05,3e-05,9.8e-05,0.000109,5.5e-05,0.000382,0.000432,0.000193,4.1e-05,3.2e-05,0.000445,0.000308,0.00018,6.5e-05,0.000112,0.000184,0.000131,0.000206,0.000226,0.000283,0.000162,0.000207,0.000172,0.000172,0.000252,2e-04,0.000168,0.000188,0.000239,0.000298,0.000572,0.000412,0.000612,0.000383,0.000102,0.000543,0.000208,0.000219,0.000473,0.000421,0.000333,0.000459,0.000252,0.000446,0.000124,0.000271,0.000349,0.000321,0.000215,2.9e-05,0.000192,4.1e-05,0.000105,7.2e-05,0.000168,0.000102,3.5e-05,6e-05,3.8e-05,8.8e-05,2.3e-05,5e-06,3.6e-05,3.1e-05,2.4e-05,8.3e-05,6.1e-05,1.8e-05,2.2e-05,1.8e-05,2.1e-05,9.6e-05,0.000254,0.000131,5.1e-05,8e-06,1.5e-05,2.1e-05,9e-06,4e-06,1e-05,8e-06,1e-06,5e-06,7e-06,6e-06,6e-06,5e-06,7e-06,6e-06,3e-06,4e-06,6e-06,1e-06,5e-06,4e-06,6e-06,9e-06,1.2e-05,7e-06,5e-06,3e-06
1e-06,0,1e-06,1e-06,1e-06,1e-06,1e-06,1e-06,3e-06,1e-06,1e-06,2e-06,2e-06,1e-06,4e-06,3e-06,3e-06,4e-06,2e-06,6.1e-05,2.8e-05,8.1e-05,0.000199,0.000209,0.000147,0.00038,0.000224,7.1e-05,3.7e-05,0.000447,0.000391,0.000145,4.4e-05,0.000106,8.1e-05,0.000141,7.7e-05,0.000171,0.000356,0.000301,0.000279,9.8e-05,0.000126,0.000198,0.000192,0.000266,0.000164,9.4e-05,0.000199,0.000281,0.000238,0.000219,0.000449,0.00014,0.000493,0.000727,0.000541,0.000575,0.000322,9.6e-05,0.000283,0.000231,0.000477,0.000406,0.000268,0.000193,3.4e-05,0.000255,0.000182,9.6e-05,0.000129,0.000207,0.000104,3.1e-05,4.1e-05,1.8e-05,7.3e-05,7.4e-05,6.3e-05,4.2e-05,3.9e-05,3e-05,1.9e-05,4.8e-05,6e-05,4e-05,2e-05,8e-06,5e-06,7e-06,9.4e-05,0.000289,0.000159,5.7e-05,3e-06,1.4e-05,1.5e-05,3e-06,4e-06,1.3e-05,8e-06,6e-06,9e-06,9e-06,4e-06,2e-06,5e-06,7e-06,4e-06,3e-06,6e-06,3e-06,5e-06,4e-06,4e-06,6e-06,7e-06,8e-06,1.1e-05,1.2e-05,6e-06
0,1e-06,1e-06,2e-06,0,1e-06,1e-06,1e-06,2e-06,1e-06,1e-06,1e-06,1e-06,1e-06,4e-06,1e-06,1e-06,1e-06,1e-06,6.3e-05,1.3e-05,5.8e-05,0.000129,2.5e-05,0.000134,0.000267,0.000153,5e-05,2.3e-05,0.000284,0.000146,7.8e-05,1.7e-05,9.6e-05,4.2e-05,0.00022,0.00026,0.000242,0.000114,0.00036,0.000387,0.000209,0.000156,0.000134,0.000175,0.000127,0.000186,6.4e-05,0.000295,0.000219,0.000238,0.000268,0.00019,8.7e-05,0.000287,0.000243,0.000277,0.000315,0.000205,0.000202,4.9e-05,5.4e-05,0.000172,2.5e-05,0.000104,8.8e-05,0.000112,4.9e-05,0.000124,0.000205,0.000115,0.000104,0.000103,7e-05,1.9e-05,5.2e-05,4e-06,2.7e-05,0.000125,4.7e-05,1.3e-05,2.9e-05,2e-05,3.6e-05,2.1e-05,1.7e-05,1e-06,5e-06,2e-06,3e-06,7.4e-05,0.00017,7.7e-05,2e-05,1.2e-05,2.3e-05,8e-06,8e-06,3e-06,6e-06,9e-06,5e-06,3e-06,2e-06,1e-06,2e-06,2e-06,4e-06,4e-06,6e-06,2e-06,2e-06,2e-06,2e-06,2e-06,3e-06,8e-06,4e-06,4e-06,3e-06,2e-06
0,0,1e-06,2e-06,0,1e-06,0,1e-06,0,1e-06,1e-06,2e-06,1e-06,1e-06,4e-06,1e-06,2e-06,2e-06,1e-06,6.3e-05,1.1e-05,6.1e-05,2.2e-05,5.9e-05,0.000126,0.000107,3.5e-05,1.7e-05,2.6e-05,0.000167,8.8e-05,3.4e-05,8e-06,0.000114,9.9e-05,0.000149,0.000151,0.000135,0.000228,0.000361,0.000235,0.000113,0.000218,0.000161,0.000278,0.000248,0.000207,0.000175,7.7e-05,8.8e-05,0.000203,0.00023,0.000295,5e-05,0.000304,0.000385,0.000147,0.000202,0.000202,0.000178,0.000115,7.8e-05,8e-05,9.3e-05,7.7e-05,2.8e-05,1.9e-05,0.000115,7.2e-05,7.8e-05,2.7e-05,4.2e-05,5.7e-05,2.5e-05,1.4e-05,2.4e-05,1.1e-05,1.4e-05,7.6e-05,2e-06,1e-05,1.3e-05,7e-06,2.3e-05,1e-05,1.5e-05,3e-06,6e-06,6e-06,1e-06,6e-05,3.2e-05,2.3e-05,1.2e-05,3e-06,1.1e-05,7e-06,3e-06,1e-06,1e-06,3e-06,4e-06,1e-06,2e-06,1e-06,2e-06,2e-06,1e-06,2e-06,3e-06,2e-06,2e-06,3e-06,2e-06,1e-06,4e-06,8e-06,1e-06,5e-06,4e-06,2e-06
1e-06,1e-06,0,2e-06,1e-06,0,0,1e-06,1e-06,1e-06,1e-06,1e-06,1e-06,1e-06,3e-06,0,2e-06,2e-06,2e-06,6.4e-05,1.4e-05,5e-05,3e-06,3e-05,0.00012,3e-05,1.8e-05,4e-06,1.5e-05,0.000106,3.4e-05,6e-06,4e-06,0.000116,0.000141,0.00019,0.000124,6.1e-05,0.000149,0.000232,0.000272,0.000151,7.8e-05,1e-04,0.000138,0.000256,0.000227,0.000314,0.000101,7.1e-05,5.2e-05,0.000132,0.000325,6.7e-05,1e-04,0.000127,8.9e-05,9.7e-05,0.000208,0.000219,8.6e-05,3.9e-05,8.3e-05,7e-05,5e-05,8e-06,1.8e-05,7.7e-05,2.2e-05,5.3e-05,3.4e-05,1.6e-05,1.1e-05,1.5e-05,1.5e-05,1e-05,3.1e-05,1.1e-05,7.8e-05,1e-05,6e-06,1e-05,8e-06,1.7e-05,5e-06,1.4e-05,8e-06,2e-06,5e-06,4e-06,4.2e-05,2.5e-05,8e-06,4e-06,6e-06,7e-06,8e-06,3e-06,2e-06,2e-06,6e-06,4e-06,2e-06,1e-06,1e-06,4e-06,1e-06,1e-06,1e-06,1e-06,1e-06,1e-06,3e-06,2e-06,1e-06,3e-06,8e-06,1e-06,2e-06,2e-06,1e-06
0,0,0,2e-06,0,0,0,1e-06,1e-06,1e-06,1e-06,1e-06,1e-06,0,3e-06,1e-06,1e-06,1e-06,1e-06,6.4e-05,1e-05,4.1e-05,1e-05,3.8e-05,0.000125,6.3e-05,9e-06,2e-06,1.7e-05,6.9e-05,4e-05,2e-06,1e-06,0.000118,0.000138,0.000171,0.000149,8.9e-05,0.00017,0.000161,0.000284,0.000174,6.4e-05,9.1e-05,2.2e-05,0.000181,0.000125,0.000257,3.6e-05,3.3e-05,0.000108,0.000205,0.000264,0.000149,0.000144,0.000145,9e-05,5.3e-05,0.000173,0.000158,0.000116,4e-06,9.6e-05,6.6e-05,1.7e-05,2.1e-05,1.8e-05,6.6e-05,1.9e-05,6.1e-05,1.9e-05,2e-05,5e-06,1.6e-05,4e-06,1.3e-05,2.4e-05,1e-05,7.5e-05,6e-06,4e-06,5e-06,7e-06,1.7e-05,2e-06,1.2e-05,4e-06,3e-06,1e-06,4e-06,2.8e-05,1.4e-05,2e-06,1e-06,1e-06,6e-06,7e-06,1e-06,0,1e-06,5e-06,3e-06,1e-06,0,0,3e-06,1e-06,1e-06,1e-06,1e-06,1e-06,1e-06,3e-06,2e-06,1e-06,3e-06,7e-06,1e-06,1e-06,2e-06,1e-06
