-0.004317,-0.002978,-0.002885,-0.004855,-0.005682,-0.00397,-0.002106,-0.002928,-0.003232,-0.00352,-0.003177,-0.002448,-0.00253,-0.00192,-0.001912,-0.002479,-0.001761,-0.001934,-0.002196,-0.002445,-0.001957,-0.003099,-0.002486,-0.002164,-0.001938,-0.001671,-0.001949,-0.001749
-0.00238,-0.001176,-0.000591,-0.002357,-0.001997,-0.000625,-0.001213,-0.001745,-0.001903,-0.000708,-0.000688,7.5e-05,4.5e-05,-0.000212,-0.000307,-0.0012,-0.001105,-0.001554,-0.001363,-0.000118,-0.001099,-0.002214,-0.001046,0.00013,0.000171,0.000117,-0.00031,-0.000232
-0.000412,-0.000216,-0.001558,-0.000339,0.00046,9.3e-05,-0.000259,-8.1e-05,-0.000444,9e-05,0.000155,0.000156,-2.6e-05,1.3e-05,8.3e-05,-4.9e-05,-0.000125,-0.00085,-0.001401,-0.000537,-0.000912,-0.001071,-0.000288,7.1e-05,-0.000437,-0.000338,-0.000108,-0.000555
-0.000128,-0.000674,-0.003795,-7.5e-05,0.000611,-0.001313,4.4e-05,0.000594,7e-06,-0.000851,-0.000294,-0.000941,-0.001422,-0.000972,-0.000629,0.000422,0.000336,-0.000296,-0.001534,-0.001932,-0.001153,-0.000151,-0.000259,-0.001303,-0.001886,-0.001481,-0.000856,-0.001228
0.001979,0.001184,2.3e-05,0.002487,0.003332,0.001304,0.00096,0.001589,0.001619,0.00152,0.001884,0.00136,0.001073,0.000366,0.000571,0.0017,0.001127,0.001294,0.001051,0.000943,0.00066,0.00227,0.001595,0.000608,0.000491,0.000549,0.000684,0.00099
0.000755,0.000724,0.001619,0.000313,0.000304,0.000764,-7.2e-05,-0.000117,9.8e-05,0.000531,0.000579,0.000878,0.00107,0.000417,3e-04,0.000145,0.000194,0.000677,0.000746,0.001005,0.000375,0.00076,0.000709,0.000763,0.000831,0.000583,0.000438,0.000866
-0.00259,-0.002044,-0.00073,-0.004116,-0.005318,-0.002302,-0.001477,-0.002362,-0.002701,-0.003069,-0.002952,-0.002254,-0.001948,-0.00105,-0.001233,-0.002443,-0.001532,-0.001483,-0.001829,-0.002143,-0.001561,-0.00291,-0.002167,-0.001314,-0.001033,-0.001336,-0.001562,-0.00145
4.5e-05,-0.000355,0.001821,-2.3e-05,-0.000844,0.000686,0.000239,3.8e-05,-0.000145,-0.000109,-3e-04,-0.000353,-0.000305,0.000352,0.000338,-0.000578,-0.000565,-0.00046,0.000252,-7.9e-05,0.000148,-0.000899,-0.000612,0.000322,0.000969,0.000414,-0.000154,-0.000143
0.003427,0.002342,0.003854,0.004881,0.004877,0.002683,0.001514,0.002504,0.002876,0.003435,0.002895,0.001954,0.001752,0.001354,0.001612,0.001822,0.000955,0.001305,0.002737,0.002629,0.002234,0.002558,0.001851,0.001794,0.002191,0.001873,0.001639,0.00141
0.000514,0.000596,-0.000508,0.001423,0.001449,-0.00122,0.000207,0.000668,0.000934,0.000354,0.00024,-0.000402,-0.000559,-0.000613,-0.000312,0.000765,0.000524,0.000645,0.00082,0.000198,0.000834,0.001491,0.00039,-0.000765,-0.000836,-0.000371,0.00015,-5.2e-05
-0.002107,-0.000697,-0.002025,-0.001997,-0.001536,-0.000961,-0.000363,-0.001211,-0.000921,-0.001567,-0.001449,-0.000896,-0.000671,-0.000736,-0.000796,-6.3e-05,5.9e-05,1e-05,-0.000415,-0.000576,-0.000108,0.000261,-0.000497,-0.001163,-0.001378,-0.000802,-0.000379,1.6e-05
-0.000982,0.000303,0.000437,-0.001135,-0.000409,0.002316,0.000181,-7e-04,-0.000463,0.000265,4.1e-05,0.001054,0.001374,0.00085,0.000488,-1.9e-05,0.000182,0.000199,1.7e-05,0.001118,0.000128,7.9e-05,0.000441,0.001089,0.000519,0.000628,0.000786,0.001049
-0.001329,-0.001111,-0.001775,-0.002163,-0.002303,-0.000881,-0.000632,-0.000784,-0.001232,-0.000776,-0.000772,-0.000581,-0.000686,-0.000313,-0.00057,-0.001447,-7e-04,-0.001058,-0.001739,-0.000901,-0.001511,-0.002234,-0.000714,1.8e-05,-0.000594,-0.000497,-0.000316,-0.000911
-0.000777,-0.001909,-0.003324,-0.001345,-0.001959,-0.003398,-0.000844,-0.000264,-0.000876,-0.001297,-0.000731,-0.001372,-0.001805,-0.001177,-0.001152,-0.000993,-0.000801,-0.001315,-0.001874,-0.002116,-0.0019,-0.002457,-0.001252,-0.001322,-0.001187,-0.000967,-0.00131,-0.00181
0.002855,0.001004,0.000991,0.003186,0.003339,0.00058,0.000472,0.001427,0.001656,0.001793,0.002068,0.001622,0.001516,0.000699,0.000766,0.001661,0.00067,0.000657,0.001068,0.000805,0.000525,0.00104,0.000836,0.000518,0.000959,0.000873,0.000316,0.000448
0.002677,0.001832,0.002692,0.002582,0.003044,0.00202,0.000626,0.000892,0.001445,0.001575,0.001232,0.001382,0.001827,0.001078,0.000919,0.001347,0.000886,0.001102,0.00112,0.001026,0.00117,0.001671,0.000767,8e-04,0.000855,0.000507,0.000735,0.000817
-0.001758,-0.00067,0.00015,-0.002252,-0.002256,-0.000224,-0.000426,-0.00111,-0.001151,-0.001773,-0.002007,-0.001425,-0.000927,-0.000305,-5e-04,-0.000915,-0.000248,-0.000139,-0.000711,-0.001034,2.3e-05,-0.00034,-0.000955,-0.000623,-0.000612,-0.000911,-0.000477,-0.000264
-0.00244,-0.000921,0.000437,-0.001837,-0.002217,0.000232,-0.000319,-0.000753,-0.001316,-0.001053,-0.001013,-0.000558,-0.000597,-0.000247,2.7e-05,-0.000921,-0.000478,-0.000204,0.000171,0.000136,0.000316,9.1e-05,-3.5e-05,0.000211,0.000257,8e-05,5e-06,0.000543
8.8e-05,0.000333,0.001133,0.001114,0.000456,8.8e-05,0.000249,0.000428,-1.2e-05,0.001067,0.000985,0.000554,8.5e-05,-4.9e-05,0.000503,-0.000185,-8.8e-05,7.5e-05,0.000847,0.000993,0.000523,0.000678,0.000895,0.000659,0.000456,0.00052,0.00062,0.000523
