0.304716,0.267434,0.063604,0.042681,0.070453,0.113331,0.447502,0.816316,1.218509,1.548538,1.310123,0.870695,0.651599,0.675202,0.786946,0.73527,0.529513,0.433673,0.353328,0.218534,0.141693,0.149755,0.258702,0.388095,0.313301,0.13611,0.064958,0.062134
0.35583,0.311618,0.07501,0.05088,0.083675,0.135726,0.539625,0.975737,1.394512,1.722869,1.451912,0.967918,0.723437,0.765292,0.913039,0.858537,0.622145,0.50427,0.400936,0.248624,0.164855,0.172631,0.290031,0.433948,0.353105,0.155703,0.076816,0.07441
0.415379,0.363777,0.091192,0.062772,0.102238,0.168077,0.671525,1.20705,1.626277,1.921918,1.609476,1.082488,0.831242,0.91315,1.08917,1.026521,0.764868,0.599212,0.446938,0.281164,0.198287,0.202787,0.317469,0.475443,0.39544,0.179601,0.093386,0.092006
0.401313,0.352687,0.095725,0.066352,0.105729,0.175399,0.699619,1.289182,1.687616,1.930936,1.626633,1.114387,0.924084,1.047535,1.157001,1.077185,0.861802,0.634711,0.414392,0.267884,0.211966,0.209667,0.288965,0.436422,0.376825,0.177288,0.098002,0.098561
0.325982,0.289739,0.089293,0.064876,0.099609,0.158999,0.641026,1.26853,1.693266,1.971982,1.743159,1.260647,1.118834,1.215125,1.18386,1.054948,0.903606,0.633567,0.360225,0.237875,0.212685,0.208586,0.261233,0.389213,0.329767,0.153971,0.092996,0.097162
0.25697,0.23632,0.083476,0.072562,0.112919,0.155873,0.664921,1.426053,1.921454,2.233374,2.07692,1.674219,1.539802,1.505044,1.30969,1.135567,0.983718,0.642725,0.349201,0.236327,0.220298,0.219324,0.287162,0.418375,0.325239,0.14219,0.092565,0.103071
0.256078,0.244608,0.088234,0.092824,0.15291,0.193137,0.860363,1.92374,2.519518,2.786935,2.719271,2.512337,2.408777,2.178208,1.771759,1.637925,1.48263,0.885348,0.450082,0.300252,0.263516,0.261257,0.375585,0.549774,0.397665,0.155268,0.100495,0.12227
0.352574,0.343958,0.113886,0.128748,0.217568,0.267967,1.193568,2.847967,3.729856,3.942821,4.062747,4.156791,4.159794,3.725949,2.944118,2.882648,2.762574,1.613582,0.773007,0.497368,0.408082,0.391977,0.553446,0.777314,0.535521,0.194428,0.128957,0.172014
0.521978,0.517091,0.156519,0.17406,0.296556,0.354141,1.58324,4.311517,5.983261,6.196201,6.471215,6.847304,7.096114,6.580974,5.183351,5.073955,4.950061,2.852196,1.293492,0.822349,0.662742,0.619861,0.800793,1.043166,0.703528,0.259559,0.178648,0.246135
0.727231,0.729022,0.207328,0.213648,0.365225,0.42547,1.90812,6.133292,9.231545,9.583275,9.862489,10.392529,11.071327,10.722816,8.51828,8.119075,7.889413,4.504029,1.938316,1.216534,0.966818,0.877026,1.042466,1.261994,0.854702,0.330085,0.228461,0.322923
0.899539,0.903464,0.249865,0.236906,0.400699,0.45429,2.047697,7.820542,12.655102,13.223371,13.412104,14.014439,15.129298,15.171803,12.237291,11.200836,10.712902,6.126588,2.535651,1.557721,1.206347,1.060219,1.189531,1.358451,0.948061,0.389987,0.265797,0.382794
0.92775,0.922344,0.252638,0.232657,0.389539,0.446834,2.055638,8.738878,14.678185,15.435814,15.837484,16.627486,17.52747,17.667868,14.513275,12.628162,11.749242,6.827747,2.828721,1.707434,1.249795,1.050782,1.168488,1.330525,0.981517,0.427286,0.285255,0.412839
0.773703,0.750176,0.207513,0.204931,0.345835,0.429668,1.954157,8.153184,13.600523,14.495282,15.250669,15.927204,16.012323,15.975774,13.39371,10.93736,9.735469,5.795452,2.486829,1.501194,1.05424,0.856175,1.019691,1.255805,0.977712,0.438049,0.278379,0.399339
0.566502,0.523801,0.149444,0.162812,0.273295,0.374198,1.694775,6.115835,9.678755,10.515032,11.242026,11.356404,10.887644,10.837608,9.229305,6.933093,5.722821,3.474123,1.611681,1.017639,0.754123,0.625524,0.783523,1.119429,0.970986,0.456228,0.252233,0.335025
0.423388,0.374008,0.113014,0.139488,0.227547,0.309567,1.425751,4.042215,5.594545,6.027275,6.285145,5.830578,5.527547,5.603085,4.807993,3.479407,2.513178,1.443586,0.786321,0.550528,0.46175,0.430785,0.610703,1.052978,1.04289,0.518807,0.231463,0.257253
0.363206,0.325399,0.107911,0.165092,0.274658,0.316628,1.341966,3.040033,3.394309,3.284394,3.329565,2.845958,2.670314,2.671965,2.324035,1.874281,1.25118,0.644776,0.416699,0.314761,0.276028,0.311981,0.616073,1.169039,1.189463,0.606711,0.253138,0.246236
0.324644,0.306225,0.120268,0.217982,0.371294,0.415235,1.556741,3.122983,3.220404,2.736194,2.37464,1.950138,1.783273,1.732861,1.662502,1.430061,0.897987,0.47446,0.324006,0.239329,0.217073,0.310786,0.687356,1.228352,1.222939,0.65944,0.308353,0.300249
0.308083,0.320296,0.145921,0.262031,0.458141,0.564057,2.009867,3.849478,4.07255,3.490808,2.69607,1.926738,1.699564,1.757817,1.946383,1.785768,1.059009,0.566349,0.388884,0.278651,0.253076,0.371609,0.799033,1.299482,1.205006,0.674755,0.361861,0.363476
0.338702,0.380592,0.178432,0.289098,0.518547,0.716718,2.535998,4.725126,5.358477,4.999543,3.742554,2.428353,2.102996,2.356797,2.761577,2.564336,1.494518,0.760674,0.486441,0.346848,0.317773,0.437929,0.924154,1.467461,1.279333,0.715028,0.414542,0.411788
0.376078,0.432248,0.200518,0.336065,0.609927,0.826617,2.790247,5.135532,6.499288,6.866721,5.155062,3.122967,2.762565,3.243333,3.661298,3.296791,1.937286,0.98734,0.603883,0.418969,0.386696,0.503719,1.045107,1.731911,1.538861,0.853614,0.47312,0.447997
0.359878,0.416908,0.195905,0.377425,0.688642,0.848392,2.717027,5.040318,7.167494,8.44863,6.345561,3.561897,3.329989,4.025979,4.095904,3.533226,2.240984,1.241924,0.725537,0.459372,0.435845,0.547379,1.114789,1.910356,1.771726,1.013556,0.511883,0.452979
0.290704,0.327785,0.158412,0.371146,0.704053,0.826113,2.470963,4.516031,7.172865,9.176924,6.647505,3.4579,3.609462,4.397691,3.882591,3.230751,2.337843,1.433999,0.819192,0.451806,0.434575,0.528682,1.063614,1.881597,1.804717,1.058312,0.4941,0.414956
0.211143,0.221809,0.113427,0.314457,0.616764,0.75603,2.179642,3.786781,6.440117,8.613727,5.930292,2.870917,3.26041,4.075878,3.522015,2.970658,2.326916,1.480385,0.787161,0.383152,0.363086,0.438013,0.923443,1.677473,1.621523,0.934844,0.399263,0.327216
0.155843,0.166693,0.097561,0.236901,0.454824,0.653031,1.853224,2.951151,4.850355,6.780331,4.977086,2.406158,2.434769,3.145735,3.13061,2.91263,2.279572,1.363872,0.625667,0.298981,0.267548,0.318952,0.753349,1.376615,1.311108,0.729976,0.28044,0.215118
0.120178,0.135112,0.090966,0.17059,0.292543,0.523937,1.499738,2.273912,3.153279,4.480012,3.976898,2.239218,1.892743,2.365356,2.54746,2.51616,1.96358,1.078464,0.461046,0.242513,0.189668,0.225968,0.589055,1.04139,0.96103,0.535034,0.209434,0.156274
0.094795,0.104367,0.075462,0.141178,0.221966,0.439118,1.274372,2.097821,2.514988,2.978931,2.945651,2.04958,1.587247,1.811212,1.854471,1.805508,1.480564,0.813962,0.395086,0.219044,0.145426,0.178625,0.454275,0.803363,0.721479,0.385385,0.170279,0.152158
0.081452,0.08762,0.066735,0.149777,0.242163,0.391343,1.204753,2.272271,2.77554,3.000702,2.718797,1.938506,1.509126,1.395264,1.259877,1.165394,1.042264,0.679675,0.390105,0.215688,0.128053,0.165631,0.383729,0.701092,0.650846,0.326463,0.138701,0.15127
0.072387,0.07845,0.067434,0.183997,0.307415,0.359812,1.135076,2.469653,3.153396,3.37502,2.842415,1.901005,1.508565,1.193923,0.980765,0.908147,0.809915,0.57628,0.379967,0.216042,0.120145,0.154023,0.372809,0.699285,0.661739,0.329009,0.122191,0.132938
0.072072,0.075831,0.064743,0.226244,0.398914,0.373198,1.203256,2.811222,3.690051,3.703446,2.744883,1.719599,1.356826,1.089574,1.008852,1.010105,0.865358,0.579881,0.378036,0.211173,0.118996,0.133112,0.388834,0.801699,0.770816,0.376016,0.130524,0.113952
0.068702,0.066596,0.05493,0.254021,0.482381,0.421637,1.231852,2.87495,3.841503,3.6695,2.421622,1.49429,1.230979,1.098423,1.187635,1.20835,1.011394,0.633159,0.356434,0.199875,0.134222,0.124648,0.418156,0.931784,0.876656,0.406972,0.144037,0.100153
0.066564,0.067103,0.059092,0.27508,0.533205,0.443693,1.047589,2.539418,3.486865,3.298217,2.159515,1.339654,1.195021,1.161969,1.248747,1.258932,1.031871,0.615386,0.314231,0.196106,0.16764,0.135457,0.438977,0.969889,0.895495,0.419044,0.151731,0.092795
0.068293,0.071116,0.066125,0.294524,0.541411,0.414317,0.799269,2.142267,2.896005,2.467586,1.6795,1.124712,1.039798,1.131141,1.209334,1.190154,0.983376,0.594819,0.282808,0.197189,0.196635,0.147627,0.403272,0.848847,0.813061,0.417544,0.150298,0.082266
0.064234,0.066219,0.062253,0.298487,0.51335,0.358715,0.789406,2.035189,2.43615,1.69324,1.135605,0.866494,0.787516,0.986403,1.071021,0.98291,0.840573,0.555026,0.256762,0.182866,0.201063,0.156193,0.333593,0.648398,0.648843,0.375463,0.137056,0.06996
0.05459,0.05374,0.049487,0.28202,0.4859,0.309047,0.750011,1.787035,1.984112,1.437626,1.03208,0.795218,0.626056,0.722456,0.801678,0.724817,0.621694,0.444158,0.220918,0.158717,0.176314,0.158352,0.32163,0.614772,0.605055,0.345678,0.120286,0.055706
0.053542,0.05481,0.0506,0.254207,0.441287,0.267205,0.646791,1.400837,1.491601,1.308475,1.055806,0.753741,0.569954,0.472967,0.52471,0.574058,0.484469,0.332334,0.188516,0.146461,0.161035,0.155102,0.32788,0.590227,0.56046,0.307464,0.097518,0.049447
0.057905,0.0648,0.057746,0.232579,0.400188,0.250425,0.614713,1.366816,1.53519,1.328259,0.997088,0.679078,0.55078,0.365364,0.375283,0.453685,0.421689,0.276436,0.150193,0.145462,0.171764,0.152237,0.288973,0.4766,0.446449,0.251094,0.074033,0.054673
0.060322,0.068772,0.0564,0.235428,0.40089,0.25344,0.632317,1.555014,1.854561,1.410263,0.89464,0.655511,0.547847,0.41895,0.380421,0.381701,0.415994,0.30322,0.149655,0.135422,0.164216,0.14919,0.22232,0.346583,0.399618,0.273356,0.08144,0.075511
0.057585,0.061076,0.043609,0.227805,0.416049,0.26768,0.588273,1.561995,1.937677,1.436683,0.849464,0.596731,0.527101,0.519475,0.451739,0.395426,0.415448,0.326043,0.16581,0.120212,0.13009,0.126033,0.176189,0.30565,0.4546,0.357299,0.112777,0.098132
0.057311,0.046658,0.029755,0.209689,0.426059,0.291927,0.507135,1.343886,1.674262,1.356579,0.839156,0.48454,0.450393,0.601522,0.599829,0.497792,0.438129,0.301709,0.173365,0.122946,0.091697,0.086181,0.161894,0.337437,0.540364,0.435682,0.141296,0.109099
0.057923,0.036989,0.029504,0.207271,0.41953,0.308497,0.415701,1.091849,1.421583,1.164022,0.729603,0.436648,0.365917,0.625054,0.745934,0.634944,0.490115,0.248054,0.157055,0.1352,0.076965,0.05057,0.140297,0.332787,0.563007,0.470027,0.150713,0.102129
