7e-06,7e-06,3e-06,9e-06,1e-05,8e-06,6e-06,5e-06,6e-06,6e-06,6e-06,7e-06,4e-06,-0.002441,-0.011228,-0.004725,-0.000829,-0.000413,-0.000272,-0.000136,-6.3e-05,-1.8e-05,-2e-06,1e-06,4e-06,5e-06,5e-06,1e-06
4e-06,7e-06,2e-06,6e-06,8e-06,5e-06,4e-06,4e-06,5e-06,5e-06,6e-06,7e-06,5e-06,-0.000364,-0.002107,-0.001608,-0.000733,-0.000112,-0.000144,-0.000151,-7e-05,-2.4e-05,-1.4e-05,-9e-06,-2e-06,4e-06,5e-06,4e-06
1e-06,1e-06,0,2e-06,6e-06,4e-06,2e-06,3e-06,4e-06,4e-06,3e-06,3e-06,2e-06,0.000293,0.00032,-0.001042,-0.000725,-0.000185,-3.3e-05,-2.9e-05,-1.6e-05,-2e-06,-2e-06,-5e-06,-7e-06,3e-06,4e-06,4e-06
5e-06,7e-06,5e-06,3e-06,8e-06,5e-06,4e-06,5e-06,5e-06,4e-06,5e-06,5e-06,2e-06,0.001261,0.00557,0.002263,0.000146,3e-05,0.000119,9.5e-05,6.8e-05,3.9e-05,2.7e-05,1.1e-05,-1e-06,4e-06,3e-06,4e-06
6e-06,9e-06,7e-06,3e-06,8e-06,7e-06,4e-06,5e-06,4e-06,4e-06,6e-06,6e-06,1e-06,0.000745,0.004791,0.003349,0.000889,0.000384,0.000118,4.3e-05,5.9e-05,3e-05,2.2e-05,1.2e-05,4e-06,1e-06,2e-06,1e-06
3e-06,2e-06,1e-06,3e-06,6e-06,5e-06,1e-06,2e-06,2e-06,1e-06,3e-06,4e-06,-3e-06,-0.001534,-0.00648,-0.00207,0.00011,-0.000116,-0.000184,-9.5e-05,-6.4e-05,-3.8e-05,-1.3e-05,-5e-06,-3e-06,-4e-06,0,-4e-06
6e-06,4e-06,3e-06,5e-06,6e-06,5e-06,1e-06,1e-06,1e-06,0,3e-06,4e-06,-1e-06,-0.000633,-0.004172,-0.002782,-0.00053,-0.00048,-0.000207,-6.1e-05,-0.000101,-6.3e-05,-2.9e-05,-9e-06,0,-3e-06,0,-2e-06
8e-06,7e-06,6e-06,7e-06,6e-06,6e-06,3e-06,3e-06,3e-06,3e-06,4e-06,5e-06,4e-06,0.00099,0.003456,0.000174,-0.000297,-0.000105,5.1e-05,5e-05,-3.1e-05,-2.9e-05,-1.6e-05,1e-06,7e-06,3e-06,3e-06,4e-06
5e-06,4e-06,6e-06,9e-06,6e-06,6e-06,5e-06,4e-06,5e-06,4e-06,3e-06,4e-06,5e-06,0.00014,0.001295,0.000494,-0.000257,6.1e-05,6.3e-05,1.3e-05,8e-06,1.2e-05,1.2e-05,8e-06,6e-06,5e-06,4e-06,4e-06
4e-06,2e-06,6e-06,9e-06,6e-06,6e-06,6e-06,5e-06,5e-06,4e-06,4e-06,4e-06,5e-06,-0.000316,-0.000319,0.000698,-0.000166,-5.9e-05,-0.00011,-0.00011,3e-06,3.2e-05,2.9e-05,7e-06,2e-06,3e-06,2e-06,0
4e-06,1e-06,3e-06,7e-06,5e-06,6e-06,5e-06,4e-06,4e-06,5e-06,4e-06,5e-06,5e-06,0.000171,0.000562,0.000421,1.8e-05,-8.2e-05,-0.000144,-0.000106,-1.3e-05,1.9e-05,2.3e-05,1e-06,-1e-06,2e-06,1e-06,-1e-06
4e-06,-1e-06,0,5e-06,4e-06,5e-06,3e-06,3e-06,3e-06,4e-06,4e-06,4e-06,6e-06,4.5e-05,-0.000794,-0.001061,-0.000195,-0.000156,-3.2e-05,2.5e-05,-2e-05,0,7e-06,-3e-06,-2e-06,3e-06,1e-06,3e-06
6e-06,3e-06,2e-06,3e-06,4e-06,4e-06,3e-06,2e-06,3e-06,5e-06,4e-06,4e-06,6e-06,-0.000108,-0.00128,-0.000958,-9e-06,-0.000109,7.8e-05,0.000116,-4e-06,2e-06,1e-06,1e-06,5e-06,4e-06,1e-06,4e-06
3e-06,5e-06,3e-06,2e-06,4e-06,3e-06,4e-06,3e-06,3e-06,4e-06,3e-06,2e-06,2e-06,-0.000329,-0.001415,-0.000232,0.000271,0.000101,6.1e-05,5.8e-05,1.5e-05,7e-06,5e-06,1.2e-05,8e-06,3e-06,-1e-06,1e-06
0,2e-06,2e-06,1e-06,3e-06,1e-06,3e-06,2e-06,1e-06,1e-06,0,0,-1e-06,-0.00031,-0.000428,0.000363,0.000186,0.000246,-9e-06,-5.2e-05,3.3e-05,1.6e-05,1.1e-05,1e-05,3e-06,-1e-06,-2e-06,-2e-06
3e-06,2e-06,1e-06,0,2e-06,1e-06,1e-06,1e-06,0,-1e-06,0,-1e-06,-2e-06,0.000751,0.003505,0.001433,0.000258,0.000233,5e-06,-5e-05,5.1e-05,2.7e-05,1.2e-05,4e-06,0,-2e-06,-2e-06,0
4e-06,0,1e-06,1e-06,1e-06,0,0,0,-1e-06,0,1e-06,0,-2e-06,0.000572,0.001882,0.000363,6.2e-05,2.6e-05,5.4e-05,3.9e-05,3.6e-05,1.2e-05,1e-06,-3e-06,-3e-06,-2e-06,-2e-06,2e-06
3e-06,0,1e-06,0,0,0,-1e-06,-1e-06,-2e-06,0,1e-06,1e-06,-2e-06,-0.00086,-0.003731,-0.00148,-0.000195,-9.3e-05,2.6e-05,6.9e-05,7e-06,-7e-06,-9e-06,-4e-06,-5e-06,-2e-06,-2e-06,1e-06
1e-06,1e-06,1e-06,1e-06,0,1e-06,1e-06,0,-1e-06,0,2e-06,1e-06,-2e-06,-0.000507,-0.001932,-0.000369,2.9e-05,2e-05,-3.2e-05,7e-06,-1.3e-05,-7e-06,-6e-06,4e-06,1e-06,-1e-06,-1e-06,-1e-06
