0.059317,0.04914,0.051148,0.058531,0.054969,0.046125,0.047541,0.049027,0.040794,0.036934,0.04151,0.042219,0.042323,0.043337,0.038052,0.036302,0.042049,0.042672,0.040656,0.038953,0.036878,0.037049,0.037422,0.036387,0.031837,0.029871,0.031693,0.031195
0.07728,0.065135,0.066791,0.077611,0.074724,0.061716,0.062272,0.064641,0.053384,0.04877,0.056237,0.056259,0.055632,0.057312,0.049802,0.048256,0.057556,0.057221,0.053471,0.052895,0.051035,0.051463,0.05154,0.047315,0.03911,0.036738,0.039776,0.039059
0.109601,0.09387,0.094457,0.111436,0.109619,0.08909,0.088205,0.092606,0.077264,0.071601,0.083504,0.08186,0.079628,0.082367,0.071402,0.071141,0.087772,0.085179,0.0779,0.081033,0.080652,0.081717,0.081112,0.06996,0.054346,0.051493,0.056735,0.055442
0.131838,0.115232,0.115703,0.136561,0.134665,0.108534,0.105865,0.113163,0.097959,0.091458,0.104705,0.101382,0.097919,0.101282,0.088481,0.091132,0.115456,0.110599,0.100899,0.11026,0.113657,0.115479,0.113831,0.09565,0.072423,0.069696,0.077993,0.076208
0.128507,0.116027,0.119274,0.137072,0.132094,0.106387,0.102376,0.111896,0.103083,0.09718,0.105986,0.101556,0.098123,0.101308,0.089959,0.095273,0.123154,0.119128,0.111411,0.126148,0.133942,0.135795,0.133392,0.11456,0.088792,0.086059,0.097045,0.095353
0.106147,0.102934,0.108744,0.116129,0.108837,0.09019,0.084683,0.093169,0.09313,0.088945,0.089337,0.084978,0.082916,0.084576,0.077148,0.082469,0.105222,0.104774,0.103223,0.1181,0.127232,0.127862,0.126116,0.11903,0.104414,0.102621,0.110785,0.106748
0.107012,0.10889,0.110741,0.108688,0.105589,0.094792,0.087906,0.091368,0.092138,0.087696,0.082876,0.081673,0.083644,0.082066,0.075585,0.076478,0.087027,0.091257,0.095355,0.103681,0.110896,0.110839,0.11161,0.126535,0.135914,0.133185,0.130038,0.121677
0.15832,0.162589,0.162052,0.160338,0.162887,0.14799,0.128842,0.124329,0.124038,0.121528,0.11648,0.115902,0.12144,0.121341,0.113977,0.110361,0.115793,0.125549,0.125973,0.123828,0.137603,0.140011,0.13774,0.169854,0.198691,0.197077,0.188467,0.173917
0.255507,0.273357,0.276382,0.272489,0.284556,0.259359,0.20866,0.191406,0.194228,0.193063,0.184761,0.18114,0.188614,0.196976,0.19169,0.18507,0.191809,0.208252,0.203561,0.190715,0.217953,0.224486,0.215,0.264267,0.302729,0.297413,0.288703,0.267073
0.398463,0.4453,0.456613,0.443604,0.472607,0.435729,0.336972,0.30036,0.30336,0.293945,0.278068,0.27405,0.281879,0.30389,0.305685,0.298176,0.307909,0.335755,0.334687,0.308319,0.348209,0.360724,0.342153,0.411617,0.446559,0.423483,0.420515,0.399301
0.567206,0.655125,0.676388,0.652191,0.706307,0.655563,0.502206,0.44006,0.429333,0.399031,0.374822,0.378785,0.385937,0.421751,0.436165,0.435372,0.445042,0.4868,0.505677,0.464361,0.518608,0.542338,0.509706,0.605118,0.626519,0.565878,0.578512,0.577495
0.704943,0.816407,0.843773,0.821514,0.904298,0.837968,0.645048,0.567148,0.529118,0.464119,0.430049,0.452296,0.467834,0.514882,0.540232,0.549946,0.551525,0.613169,0.675861,0.619387,0.677109,0.711732,0.662019,0.776294,0.776423,0.680977,0.720728,0.746465
0.738045,0.8275,0.849194,0.848097,0.941367,0.858864,0.671489,0.601609,0.53517,0.443059,0.4018,0.443571,0.483769,0.537189,0.564835,0.580954,0.570375,0.650692,0.754583,0.690318,0.732181,0.764383,0.702586,0.809384,0.803472,0.72106,0.785511,0.812017
0.62412,0.672546,0.67761,0.683743,0.751322,0.674944,0.549445,0.503274,0.435468,0.36546,0.328618,0.360998,0.417476,0.462951,0.474979,0.489488,0.486802,0.571002,0.661806,0.595985,0.616964,0.638434,0.581735,0.653399,0.678044,0.676499,0.727968,0.703765
0.456856,0.508387,0.530335,0.49795,0.485458,0.448175,0.41102,0.376225,0.346677,0.354688,0.333728,0.300764,0.335961,0.386835,0.367772,0.357161,0.388749,0.441222,0.445721,0.396058,0.423402,0.450321,0.420002,0.446292,0.514389,0.578361,0.57736,0.511353
0.495013,0.599448,0.659244,0.540209,0.41596,0.426983,0.481326,0.444664,0.442982,0.511026,0.488848,0.376626,0.371445,0.43975,0.402998,0.379644,0.466797,0.470109,0.364407,0.341259,0.386418,0.44271,0.450654,0.432032,0.515731,0.556467,0.528861,0.51096
0.691382,0.827639,0.925648,0.73452,0.542387,0.564679,0.634838,0.590154,0.618394,0.733521,0.707695,0.548759,0.518966,0.597062,0.553187,0.532879,0.684045,0.681218,0.511261,0.481386,0.523846,0.609021,0.648963,0.592632,0.659944,0.69015,0.657642,0.669435
0.888546,1.015445,1.150996,0.916446,0.699806,0.718166,0.74584,0.690977,0.761305,0.911658,0.877,0.692539,0.645401,0.732972,0.70978,0.695416,0.899505,0.926548,0.728358,0.65471,0.675124,0.80463,0.873249,0.759751,0.784524,0.838839,0.814007,0.833893
1.00311,1.053548,1.209331,1.012947,0.873376,0.885154,0.801829,0.742398,0.833482,0.942166,0.894339,0.733847,0.677871,0.775882,0.829283,0.825791,1.00621,1.067374,0.915446,0.83698,0.818537,0.937691,1.020149,0.881973,0.870008,0.964588,0.946795,0.920788
1.090265,0.976899,1.074356,0.984551,1.012242,1.036822,0.830501,0.764701,0.85334,0.849741,0.790219,0.709588,0.659473,0.770794,0.923559,0.91254,0.972828,1.078006,1.05231,1.044788,0.988522,0.960509,0.998577,0.922299,0.967349,1.10098,1.065627,0.94303
1.131068,0.891795,0.923081,0.90217,1.054647,1.131046,0.8677,0.787085,0.842134,0.743532,0.715142,0.730113,0.687266,0.773983,0.95279,0.910477,0.8601,1.022174,1.113547,1.173304,1.083493,0.871522,0.877663,0.938555,1.071007,1.22406,1.158823,0.928483
0.996474,0.768904,0.781083,0.780785,0.936397,1.016597,0.800363,0.76087,0.780721,0.645543,0.647956,0.713905,0.703839,0.751977,0.857079,0.797161,0.741139,0.912855,1.028186,1.100733,0.993582,0.724806,0.745934,0.923499,1.07008,1.188996,1.138933,0.879281
0.697609,0.57709,0.569153,0.593106,0.717906,0.738333,0.605887,0.621011,0.630127,0.515926,0.518674,0.604315,0.636737,0.635763,0.660186,0.655633,0.668727,0.74709,0.786455,0.823832,0.729074,0.542567,0.592592,0.814218,0.948349,1.047065,1.035155,0.783856
0.463255,0.477001,0.442027,0.449841,0.531028,0.542091,0.4909,0.489254,0.52645,0.472955,0.445893,0.495816,0.518062,0.535379,0.574116,0.582351,0.567873,0.54943,0.551873,0.554238,0.48244,0.415398,0.487951,0.689945,0.805729,0.888322,0.902646,0.715753
0.457842,0.548638,0.495076,0.459767,0.479346,0.521121,0.504553,0.46759,0.616945,0.618386,0.527073,0.573394,0.531267,0.55767,0.672353,0.63504,0.524533,0.467596,0.48976,0.520152,0.513883,0.464483,0.480191,0.646231,0.736228,0.872494,0.959359,0.776816
0.54053,0.646454,0.591134,0.541575,0.578095,0.599363,0.540573,0.549238,0.863636,0.888962,0.691439,0.747657,0.660297,0.62797,0.773261,0.764286,0.681155,0.594512,0.549506,0.611272,0.664806,0.578614,0.548756,0.727384,0.758534,0.907411,1.120651,0.929795
0.60758,0.764862,0.717034,0.623011,0.729873,0.689609,0.554086,0.639515,1.093727,1.126652,0.811466,0.864487,0.776178,0.68283,0.826183,0.885184,0.87197,0.77749,0.671746,0.713334,0.778209,0.725613,0.743112,0.950631,0.868376,0.961653,1.323592,1.106795
0.624268,0.839904,0.807145,0.652212,0.804768,0.735272,0.559137,0.697657,1.166998,1.168217,0.788429,0.814704,0.771903,0.673172,0.847074,0.996099,0.976024,0.872752,0.739737,0.731758,0.840355,0.86883,0.914308,1.112012,0.9589,1.067795,1.565253,1.292901
0.599361,0.825235,0.765287,0.553626,0.700048,0.656358,0.537999,0.683117,0.994521,0.949122,0.612397,0.601552,0.620246,0.598696,0.846392,1.027544,0.894992,0.772217,0.650625,0.620218,0.830253,0.921095,0.911927,1.090631,1.013311,1.180162,1.639986,1.324736
0.504433,0.648153,0.56354,0.357981,0.467665,0.482706,0.443867,0.543244,0.669279,0.646745,0.444976,0.423661,0.470775,0.513181,0.765407,0.872211,0.652727,0.530257,0.440081,0.42584,0.686432,0.7843,0.697228,0.872889,1.028386,1.206215,1.381265,1.064274
0.438435,0.437857,0.343808,0.226099,0.288301,0.343651,0.352624,0.379783,0.400402,0.424629,0.347414,0.361972,0.406491,0.413715,0.554694,0.572956,0.436306,0.34534,0.281151,0.34174,0.529322,0.550629,0.456565,0.631754,0.984919,1.099801,0.919327,0.657447
0.422684,0.351307,0.249163,0.196723,0.225647,0.257557,0.29061,0.312211,0.268974,0.253846,0.232688,0.286024,0.346972,0.330417,0.356497,0.313454,0.291474,0.276356,0.227188,0.309535,0.428833,0.422681,0.3925,0.538481,0.923835,0.971759,0.622821,0.419167
0.405012,0.374661,0.272557,0.205738,0.189182,0.193269,0.243681,0.253498,0.170257,0.134077,0.15669,0.213553,0.286807,0.305312,0.295848,0.225445,0.229631,0.285173,0.225766,0.254904,0.338131,0.397251,0.41852,0.488871,0.816636,0.854686,0.52957,0.324834
0.328159,0.365127,0.294922,0.20197,0.148729,0.133227,0.179373,0.187661,0.117533,0.090169,0.113248,0.149427,0.206153,0.252634,0.270553,0.229119,0.244204,0.316834,0.239215,0.19019,0.225062,0.35944,0.406276,0.372618,0.609969,0.718601,0.470398,0.274239
0.231803,0.314228,0.294487,0.189752,0.140636,0.114852,0.137172,0.150724,0.101034,0.088124,0.112642,0.134083,0.142594,0.184694,0.268304,0.26852,0.280104,0.31816,0.22661,0.142807,0.176223,0.335701,0.388428,0.30954,0.436891,0.592729,0.462023,0.289754
0.17708,0.292374,0.3127,0.193043,0.144364,0.125838,0.134077,0.13209,0.088546,0.087973,0.129538,0.143831,0.102213,0.127579,0.241292,0.281606,0.276555,0.257088,0.179876,0.122195,0.162671,0.292842,0.363822,0.328984,0.360213,0.459153,0.408916,0.271382
0.165038,0.266836,0.30543,0.201221,0.14681,0.139813,0.14424,0.123094,0.094466,0.107028,0.149237,0.151083,0.095839,0.115098,0.191398,0.241171,0.219723,0.161608,0.118017,0.104782,0.148882,0.235833,0.309548,0.309497,0.29368,0.383322,0.35644,0.220317
0.140979,0.205426,0.247274,0.195637,0.141272,0.129864,0.142573,0.123246,0.110995,0.138223,0.171054,0.146394,0.101928,0.108913,0.129215,0.165794,0.139148,0.087876,0.076394,0.109389,0.149946,0.207517,0.272423,0.270796,0.249625,0.354742,0.370445,0.21503
0.097168,0.137,0.167497,0.161844,0.113792,0.094296,0.118033,0.115761,0.119288,0.15709,0.180782,0.152678,0.116421,0.096428,0.092372,0.108861,0.092399,0.069313,0.075869,0.134552,0.158746,0.167023,0.251836,0.261262,0.250778,0.328654,0.385464,0.239832
0.065592,0.118077,0.135296,0.120677,0.075524,0.053295,0.084619,0.095312,0.107626,0.147919,0.166134,0.151361,0.122052,0.079786,0.06975,0.092377,0.089778,0.070097,0.082676,0.164211,0.183373,0.144842,0.228482,0.233408,0.232436,0.305255,0.394142,0.258733
