0.136883,0.131776,0.135683,0.132582,0.117887,0.095768,0.10873,0.127198,0.120787,0.126836,0.117285,0.112186,0.138876,0.141475,0.113932,0.100765,0.112921,0.117592,0.119028,0.121188,0.11318,0.101774,0.097642,0.098113,0.099506,0.088505,0.080483,0.08545
0.175374,0.166385,0.169908,0.166979,0.14812,0.118223,0.136293,0.163792,0.156938,0.162207,0.150441,0.147372,0.181964,0.181468,0.142833,0.12404,0.138428,0.149226,0.15757,0.158047,0.142237,0.129202,0.129096,0.131016,0.130225,0.113551,0.102298,0.107943
0.239466,0.222601,0.226134,0.225478,0.199405,0.156019,0.18199,0.225044,0.219405,0.221625,0.205263,0.207372,0.254983,0.24838,0.190858,0.163647,0.18043,0.201132,0.224349,0.221261,0.190522,0.175587,0.183985,0.188633,0.183684,0.15716,0.140699,0.148568
0.275849,0.255556,0.259255,0.261294,0.231591,0.181882,0.213904,0.26626,0.261917,0.260712,0.240932,0.246728,0.300185,0.287763,0.21928,0.191329,0.208155,0.233434,0.270106,0.263642,0.222038,0.208162,0.223281,0.228433,0.219187,0.187246,0.168728,0.179736
0.266525,0.248747,0.250089,0.252745,0.233254,0.195344,0.224169,0.268126,0.263913,0.259455,0.237233,0.244228,0.292882,0.281555,0.220237,0.201731,0.215921,0.235121,0.269382,0.259347,0.22379,0.217332,0.229144,0.227386,0.216786,0.192977,0.177513,0.186249
0.264789,0.250696,0.237157,0.232106,0.243001,0.233456,0.249071,0.268124,0.26729,0.265381,0.233701,0.234044,0.278576,0.27873,0.231078,0.226979,0.240742,0.246097,0.252704,0.23388,0.226753,0.230424,0.222943,0.209568,0.203373,0.199483,0.188612,0.183781
0.367619,0.341327,0.301021,0.286703,0.341384,0.356404,0.35104,0.345962,0.355943,0.367959,0.325157,0.32014,0.385891,0.393737,0.322512,0.326695,0.357643,0.349189,0.318623,0.289997,0.315744,0.321035,0.278456,0.254219,0.260111,0.273661,0.26174,0.237932
0.606241,0.538738,0.469548,0.462729,0.573615,0.606864,0.563206,0.528705,0.560237,0.58988,0.537975,0.549646,0.668258,0.671418,0.534313,0.542465,0.607707,0.578159,0.498693,0.47104,0.538201,0.537712,0.444669,0.390581,0.412387,0.451591,0.428305,0.378248
0.972155,0.842851,0.754554,0.759823,0.940989,1.01855,0.927881,0.84624,0.919271,0.964037,0.896758,0.9578,1.153561,1.124109,0.882602,0.897245,1.011406,0.967802,0.815817,0.776254,0.895601,0.888055,0.726053,0.609691,0.663421,0.761273,0.706561,0.622009
1.406025,1.210794,1.14057,1.168038,1.429157,1.577434,1.418612,1.266749,1.401108,1.454693,1.385961,1.546051,1.830407,1.731094,1.363084,1.397328,1.564321,1.522052,1.274757,1.193198,1.378153,1.37009,1.120117,0.89892,1.003098,1.205461,1.09271,0.968782
1.737436,1.522092,1.529085,1.580128,1.906193,2.121666,1.861423,1.629215,1.831279,1.891875,1.876084,2.16052,2.504588,2.339849,1.859863,1.902347,2.120839,2.107419,1.754309,1.609534,1.86107,1.861522,1.5245,1.176601,1.346065,1.673459,1.488577,1.333985
1.77501,1.620499,1.731806,1.780597,2.095959,2.327451,1.998003,1.7264,1.951846,2.005602,2.09202,2.454636,2.76121,2.568409,2.071267,2.112055,2.358967,2.399128,1.986648,1.801674,2.072832,2.071796,1.707084,1.284719,1.502621,1.907756,1.677169,1.521387
1.445212,1.376297,1.556119,1.578454,1.782458,1.966701,1.697575,1.475571,1.649529,1.676831,1.822548,2.130001,2.297141,2.135339,1.759935,1.808074,2.041431,2.12131,1.757191,1.589585,1.804186,1.805443,1.513724,1.136213,1.338032,1.695273,1.48557,1.352496
1.05212,0.968451,1.105636,1.126726,1.193185,1.280651,1.186077,1.102772,1.179361,1.155646,1.246552,1.401126,1.429027,1.322629,1.131021,1.181785,1.343854,1.432797,1.240469,1.136335,1.243938,1.27825,1.142927,0.915003,1.025414,1.195893,1.041017,0.920687
1.154051,0.908892,0.97498,1.100698,1.062543,0.996032,1.052147,1.111652,1.054454,0.985503,1.034166,1.083465,1.052005,0.98163,0.908328,0.972265,1.032437,1.012059,0.943166,0.934657,1.006891,1.092366,1.071693,1.027549,1.087857,1.0642,0.886114,0.662968
1.729508,1.37446,1.44231,1.628896,1.511039,1.348246,1.469102,1.549329,1.385057,1.289674,1.386789,1.444248,1.366174,1.278335,1.202622,1.265513,1.298518,1.224151,1.134316,1.141779,1.264671,1.43487,1.435958,1.451769,1.559262,1.470729,1.189357,0.810084
2.434285,2.000396,2.041758,2.227358,2.050809,1.821581,1.979418,2.06113,1.823994,1.652195,1.750837,1.874275,1.810159,1.713138,1.607654,1.622406,1.636815,1.59775,1.490867,1.438282,1.596168,1.864959,1.831753,1.860898,2.046986,1.930245,1.560567,1.095569
3.051788,2.704346,2.642278,2.639774,2.430096,2.168557,2.293108,2.395542,2.198434,1.937907,1.900154,2.07827,2.086394,2.019296,1.965647,1.883303,1.781903,1.803784,1.816007,1.716274,1.788104,2.100646,2.019133,1.99942,2.241531,2.184486,1.827732,1.367106
3.471841,3.418111,3.289727,3.026052,2.74034,2.359817,2.2733,2.494315,2.599637,2.269964,1.891834,2.075946,2.213123,2.156569,2.241787,2.053323,1.741085,1.75086,1.995573,1.970168,1.882516,2.063449,1.865743,1.73787,2.019383,2.147832,1.939007,1.608371
3.669882,3.818573,3.711285,3.373152,3.030565,2.405655,2.042161,2.526653,3.028057,2.626841,1.966682,2.023576,2.28426,2.305231,2.480877,2.193716,1.689665,1.59695,2.025049,2.196747,1.99511,1.837523,1.436143,1.258777,1.585341,1.956367,1.953558,1.767797
3.406139,3.57037,3.463753,3.215531,2.877037,2.135113,1.755549,2.45978,3.135799,2.709291,2.004954,1.942464,2.267419,2.293404,2.364701,2.071752,1.563682,1.385543,1.828059,2.149457,1.935677,1.568696,1.111956,0.958483,1.250732,1.649473,1.712647,1.628047
2.60925,2.637582,2.469535,2.42179,2.201366,1.537286,1.341962,2.045918,2.556208,2.236858,1.768454,1.655997,1.88209,1.830279,1.745357,1.537267,1.212741,1.018328,1.303371,1.631687,1.503052,1.181234,0.886386,0.795274,0.947299,1.189879,1.208972,1.187556
1.585246,1.533946,1.371411,1.452213,1.337229,0.931053,0.895541,1.315864,1.543406,1.456534,1.270999,1.108404,1.203958,1.184592,1.061186,0.938207,0.77116,0.61543,0.751828,0.981804,0.948676,0.790246,0.678964,0.614954,0.635079,0.727111,0.752095,0.749778
0.994797,0.860197,0.706019,0.741428,0.692375,0.650771,0.713207,0.792576,0.859542,0.942188,0.942858,0.772487,0.745899,0.805639,0.747364,0.66273,0.565448,0.465131,0.472003,0.561969,0.665793,0.675453,0.596324,0.504974,0.453953,0.477742,0.535183,0.514978
0.954678,0.647024,0.548589,0.565362,0.543186,0.691933,0.810109,0.75446,0.740338,0.816746,0.922435,0.836047,0.691529,0.667571,0.689064,0.687616,0.612238,0.506954,0.404696,0.429335,0.613734,0.693771,0.619522,0.566971,0.519201,0.463409,0.476946,0.502794
1.196766,0.769105,0.635736,0.712411,0.680334,0.780026,0.907239,0.839734,0.78834,0.790205,0.995797,1.045052,0.76478,0.595323,0.625601,0.730664,0.720115,0.574028,0.404955,0.440931,0.602541,0.694806,0.670577,0.640797,0.621801,0.516481,0.483635,0.551282
1.360479,0.947174,0.766972,0.881675,0.821009,0.796558,0.939122,0.924318,0.81119,0.767005,1.092055,1.26169,0.92459,0.668894,0.619143,0.768471,0.840458,0.626698,0.435091,0.532188,0.646378,0.73814,0.745253,0.705451,0.704243,0.586131,0.517974,0.5892
1.259135,1.038179,0.893909,0.97364,0.900502,0.833904,0.938005,0.925982,0.78349,0.733737,1.084577,1.304489,1.003417,0.729165,0.627991,0.811154,0.956505,0.700242,0.498375,0.602821,0.700788,0.844825,0.875295,0.780598,0.728919,0.607825,0.561402,0.674497
0.966905,0.958786,0.913126,0.890768,0.89052,0.890932,0.849373,0.795138,0.73413,0.775678,1.020498,1.164303,0.96332,0.712701,0.601875,0.815922,1.063404,0.798248,0.531594,0.570363,0.681569,0.931662,0.941344,0.74195,0.635209,0.551839,0.564482,0.723437
0.660091,0.735976,0.763474,0.682994,0.799958,0.867386,0.746548,0.71571,0.734846,0.851704,0.934484,0.890982,0.798714,0.629142,0.517649,0.721954,1.009458,0.779802,0.479294,0.489434,0.637263,0.906289,0.839041,0.59615,0.493467,0.473172,0.536158,0.664126
0.492869,0.5252,0.551301,0.53148,0.696517,0.733711,0.660608,0.741143,0.759975,0.853512,0.855493,0.651881,0.590611,0.529093,0.410034,0.562792,0.78659,0.633605,0.402968,0.407634,0.567404,0.746109,0.629584,0.461518,0.418298,0.455102,0.508757,0.515792
0.400474,0.387721,0.411443,0.471139,0.581303,0.561834,0.537911,0.661918,0.673181,0.70399,0.725838,0.549211,0.495213,0.503337,0.415354,0.504537,0.588473,0.46701,0.346524,0.333738,0.425343,0.50158,0.440378,0.375676,0.35611,0.405862,0.440623,0.364546
0.344777,0.375908,0.441042,0.485568,0.524628,0.493158,0.449767,0.511329,0.493684,0.513584,0.586041,0.539497,0.545973,0.507069,0.416923,0.45154,0.483727,0.393683,0.308987,0.271235,0.301795,0.319006,0.330224,0.368446,0.326203,0.308366,0.32502,0.261147
0.380807,0.434269,0.51502,0.572309,0.569724,0.468669,0.399084,0.427183,0.364983,0.395295,0.519132,0.573056,0.580826,0.438912,0.362028,0.396674,0.441847,0.428567,0.329273,0.242385,0.275534,0.298314,0.314544,0.345262,0.275531,0.196908,0.212132,0.22012
0.390104,0.431979,0.499064,0.585699,0.551454,0.385902,0.35793,0.374976,0.259231,0.267478,0.422255,0.546431,0.521785,0.334438,0.30859,0.395437,0.441528,0.464476,0.383847,0.263837,0.281796,0.340491,0.345252,0.303269,0.205428,0.126376,0.180106,0.211838
0.315955,0.336633,0.373361,0.469342,0.431845,0.259366,0.264634,0.300842,0.192396,0.170816,0.292554,0.409513,0.389009,0.254324,0.259399,0.345307,0.367003,0.41125,0.383578,0.265669,0.249282,0.338019,0.343419,0.257962,0.167839,0.115116,0.197206,0.212207
0.198372,0.203524,0.215523,0.280859,0.273749,0.168781,0.158392,0.20121,0.162268,0.153971,0.187458,0.240082,0.256944,0.211207,0.2124,0.244457,0.232701,0.278535,0.301748,0.21349,0.173846,0.2716,0.282093,0.185369,0.129877,0.119471,0.203507,0.195257
0.134608,0.127841,0.121038,0.128659,0.137938,0.099691,0.081709,0.110204,0.135338,0.146995,0.132062,0.173161,0.197267,0.187645,0.188217,0.156241,0.128754,0.146671,0.182114,0.131937,0.098923,0.175844,0.182127,0.111993,0.090241,0.119085,0.185008,0.1594
0.103421,0.095199,0.080987,0.076491,0.067479,0.056588,0.045139,0.068581,0.130452,0.136619,0.096729,0.156511,0.203018,0.183995,0.149562,0.100549,0.106671,0.102736,0.093927,0.073642,0.063681,0.100666,0.097689,0.077993,0.076761,0.111706,0.148698,0.11857
0.078007,0.070788,0.075106,0.080027,0.068812,0.049243,0.033326,0.066086,0.128069,0.120302,0.068534,0.130538,0.19465,0.161733,0.099846,0.060624,0.100547,0.107335,0.06065,0.052547,0.052179,0.058667,0.066261,0.070981,0.079521,0.104595,0.113761,0.103742
