9e-06,3.6e-05,2.2e-05,2.2e-05,4e-05,2.6e-05,2.1e-05,1.1e-05,5e-06,6e-06,9.4e-05,7.5e-05,2.8e-05,5.7e-05,5e-06,1.9e-05,2e-06,6.4e-05,4.6e-05,2.6e-05,3e-06,5.1e-05,5e-05,6.2e-05,4.2e-05,7.7e-05,2.6e-05,7.5e-05,4e-05,7e-05,2.6e-05,8.4e-05,1.6e-05,2.2e-05,6e-05,0.00014,1.5e-05,0.00015,5.9e-05,0.000104,0.000126,0.00015,0.000126,7.8e-05,0.000237,0.000522,8e-04,3e-04,0.000518,0.000139,0.000218,0.000204,0.000484,1e-05,0.000329,7.2e-05,0.000201,0.000259,0.00044,0.000261,0.000214,2e-06,8.5e-05,6e-05,4e-05,8.3e-05,4.6e-05,2.2e-05,3e-06,0.00019,0.000143,0.000147,0.00015,2.5e-05,3e-06,5.6e-05,0.000144,2.5e-05,0.000169,0.000158,0.000149,0.000201,0.000242,0.000138,0.000176,0.000171,5.1e-05,0.000182,3e-05,0.000184,1.2e-05,6.8e-05,1.2e-05,1.1e-05,6.3e-05,7e-06,9e-05,6.6e-05,9.4e-05,7.8e-05,6.4e-05,5.4e-05,7e-06,1.6e-05,0.000151,0.000171,0.000749,0.000171,0.000149,0.000186,1e-05,3.5e-05,9.3e-05,0.00014,0.000398,0.000185,0.000293,4.4e-05,4e-05,0.000163,3.1e-05
5.2e-05,7.9e-05,7.6e-05,8.8e-05,2.6e-05,9.2e-05,5.2e-05,1.7e-05,3.7e-05,2.6e-05,0.000149,0.000239,0.000124,0.000166,0.000144,0.000127,5.5e-05,0.000107,0.00018,0.000146,0.000129,0.000153,0.000202,0.000231,0.000159,0.000199,0.000165,0.000159,0.000156,0.000142,7.9e-05,0.000155,0.000196,9.9e-05,0.000249,0.000266,0.000366,0.000347,0.000538,0.00074,0.000524,0.000303,0.000429,0.000179,0.000985,0.001782,0.000487,0.001305,0.001214,0.001043,0.000551,5.5e-05,0.000963,0.001189,0.000558,0.000543,0.00057,0.000454,0.001722,0.001847,0.001391,0.000709,0.000256,0.000229,0.000311,0.000265,0.000404,0.000505,0.000281,0.000512,0.000637,0.000295,0.000408,0.000455,0.000287,0.000585,0.00064,0.000361,0.000146,0.000203,0.000449,0.000227,0.000685,0.000616,0.000537,0.000231,0.000285,9.9e-05,0.00027,0.000388,0.000407,0.000259,0.000169,8.8e-05,0.000111,0.000105,0.000138,0.000103,0.000235,0.000376,0.00016,0.000237,0.000143,7.8e-05,0.000306,0.000514,0.001704,0.000894,0.000782,0.00031,0.000504,0.000351,0.000167,0.000153,0.001074,0.000519,0.000861,0.00072,0.000432,0.000391,0.000321
8.9e-05,0.000107,4.4e-05,2e-06,3.5e-05,3.4e-05,4.9e-05,2.3e-05,4.1e-05,4.4e-05,8e-05,0.00045,9.7e-05,8.9e-05,7.7e-05,0.000128,8.9e-05,6.4e-05,8.4e-05,6.8e-05,8.5e-05,7.2e-05,0.000119,2e-05,7.6e-05,0.00011,6.4e-05,0.000108,2.4e-05,1.8e-05,2e-06,0.000111,0.000103,2.9e-05,0.000367,0.000416,0.000449,0.000297,0.000681,0.000574,0.000722,0.00091,0.000464,0.000327,0.001245,0.00087,0.002041,0.001449,0.00013,0.000247,0.000445,0.000323,0.000541,0.000526,0.000645,0.00072,5.3e-05,0.000548,0.002099,0.001404,0.000389,0.000392,0.000156,0.000442,0.000691,0.000397,0.000636,0.000618,3e-04,0.000293,0.000379,0.000151,0.000256,0.000169,3e-05,0.000667,0.000663,0.000321,3.2e-05,7.8e-05,0.00017,0.000111,0.00038,0.000324,0.000193,0.000106,0.000101,0.000196,0.000123,1e-04,0.000143,7.5e-05,7.2e-05,3.1e-05,7.7e-05,5.3e-05,8.2e-05,0.000112,3.4e-05,0.000199,0.000136,0.000129,0.00018,6.4e-05,0.000229,0.000184,0.001062,0.001611,0.000882,0.001346,0.001305,0.000396,0.000232,0.000149,0.000899,0.000737,0.000519,0.000437,0.000129,7.2e-05,8.2e-05
0.000172,8.5e-05,1e-05,3.4e-05,6.2e-05,6.5e-05,8.2e-05,5e-05,1e-05,3.1e-05,0.000126,0.000438,0.000464,0.000253,9e-05,0.000132,6.8e-05,6.3e-05,4.4e-05,9e-05,7.7e-05,0.000125,5.4e-05,4.2e-05,4.8e-05,9.6e-05,0.000107,5.7e-05,0.000147,0.000115,6.5e-05,7.7e-05,0.000118,0.00014,0.000462,0.000752,0.000278,0.000333,0.000403,0.000424,0.000322,0.000312,0.000566,0.000814,0.00066,0.001691,0.002174,0.00135,0.000574,0.000572,0.000471,0.000577,0.000428,0.000388,0.00075,0.000786,6e-04,0.000568,0.001004,0.000478,0.00012,0.000455,6.6e-05,0.000263,0.000632,0.000342,0.000311,0.000156,0.000201,0.000173,0.000112,0.000164,0.000238,0.000198,0.000106,0.000443,0.000144,5.9e-05,5.6e-05,2e-05,7.9e-05,0.00016,0.000324,3.3e-05,7.3e-05,4.5e-05,0.000117,5.2e-05,0.000152,0.000123,9.3e-05,5.1e-05,5e-05,4e-05,4.5e-05,0.000153,0.000176,4.1e-05,5.8e-05,0.00017,0.000131,0.000127,7.2e-05,0.000242,0.000364,0.000468,0.000486,0.000745,0.000297,0.001554,0.000387,0.00056,0.000419,0.000265,0.000582,0.00072,0.000676,0.000148,0.000207,4.8e-05,9.2e-05
0.000122,6e-05,3.9e-05,5e-05,3.7e-05,5.6e-05,3.1e-05,5.3e-05,4e-05,1.1e-05,0.000149,0.000201,0.000229,0.00012,9.5e-05,0.000115,4.2e-05,6e-05,4e-05,7.6e-05,2.8e-05,6.8e-05,1.8e-05,6.3e-05,3.7e-05,3.3e-05,7.6e-05,2.9e-05,0.000151,9.6e-05,2.3e-05,1.4e-05,5.2e-05,6.9e-05,0.000415,0.000265,0.000206,0.000183,0.000422,4e-04,0.000226,0.00013,0.000426,0.000569,0.000547,0.001271,6e-04,0.000854,0.000213,0.000524,0.000239,0.000273,0.000212,0.000218,0.000609,0.000401,0.000105,0.000357,0.000278,0.000172,8.1e-05,0.000505,0.000291,6.8e-05,0.000174,0.000331,0.000317,0.000184,0.000206,0.000235,3.3e-05,8.5e-05,0.000127,8.7e-05,0.000137,0.000358,9.7e-05,0.000142,0.000141,2.6e-05,6e-05,5.2e-05,0.000177,9.3e-05,5.4e-05,2.7e-05,8.5e-05,1e-04,0.000121,6.7e-05,5.7e-05,8e-06,4.1e-05,4.8e-05,4.6e-05,8.1e-05,8.1e-05,0.000156,6.4e-05,7.1e-05,2.5e-05,4.9e-05,0.000129,9.4e-05,0.000159,0.00048,0.001004,0.00161,0.001164,0.001638,0.001399,0.000785,0.000386,0.000137,0.000343,0.000487,0.000178,0.000227,0.000171,0.000234,9.4e-05
2.4e-05,4.9e-05,1.7e-05,3.8e-05,5.1e-05,1.9e-05,4.2e-05,2.9e-05,2.1e-05,2.1e-05,0.000152,0.000144,2e-04,8.3e-05,2.6e-05,5.7e-05,8e-06,2.8e-05,6.9e-05,3.9e-05,3.3e-05,3.2e-05,4.3e-05,5.4e-05,4e-06,3.5e-05,6.3e-05,3.4e-05,8.9e-05,3.2e-05,2.5e-05,3.1e-05,1.9e-05,2.5e-05,0.000305,0.000167,8.8e-05,0.000198,0.000169,0.000103,0.000265,5.2e-05,0.00049,0.000568,0.000342,0.000526,0.00095,0.000696,0.000863,0.000271,9.6e-05,7e-06,0.000247,0.000102,0.000321,0.000116,9.2e-05,0.000367,0.000402,9.3e-05,0.000101,0.000442,0.000122,0.000201,0.00012,0.000181,0.000136,0.000174,0.000128,0.000208,4.7e-05,5.9e-05,9.7e-05,8.5e-05,0.000121,0.000191,6.7e-05,0.000125,4.4e-05,6.5e-05,7.9e-05,8.8e-05,0.000156,2.6e-05,2.7e-05,5.5e-05,4.9e-05,5.4e-05,0.000116,3.6e-05,1.6e-05,3.2e-05,2.8e-05,1.1e-05,4.7e-05,4.5e-05,0.000175,0.00029,0.000116,1.9e-05,7.5e-05,0.000114,4e-05,6.5e-05,0.000202,0.00017,0.003273,0.000848,0.000883,0.000285,0.000571,0.000345,0.000409,0.000236,0.000455,0.000223,0.000225,0.000174,0.000114,0.000184,7e-06
2.6e-05,6.5e-05,4.4e-05,1.6e-05,2.5e-05,5e-05,2e-05,4.4e-05,4.3e-05,7e-06,0.000141,0.000292,3.5e-05,3.4e-05,6.7e-05,3.8e-05,3.2e-05,2.3e-05,2.9e-05,1.2e-05,2.3e-05,6.5e-05,7e-05,7e-05,4.2e-05,2.1e-05,5.4e-05,7.4e-05,7.5e-05,4e-06,3.5e-05,3.1e-05,4.5e-05,0.000126,0.000198,0.000163,0.000128,4.1e-05,1.8e-05,0.000118,0.000378,0.000461,0.000369,9.5e-05,0.000325,0.000622,0.000387,0.000517,0.000198,0.000251,9.4e-05,0.000184,0.000124,0.000183,0.00025,0.000129,8.7e-05,0.000356,0.000262,7.4e-05,1.6e-05,0.000402,0.000597,0.000396,0.000188,0.000105,0.000393,0.000146,0.000165,4.8e-05,0.000156,3e-05,3.9e-05,4.2e-05,0.000123,0.000236,1.6e-05,0.000182,0.000164,0.000139,0.000185,0.000157,0.000114,4.8e-05,8.4e-05,7.4e-05,6.7e-05,2e-05,9.7e-05,6.4e-05,8.9e-05,3.5e-05,3e-05,3.8e-05,7e-05,9e-05,0.000179,0.000186,6.3e-05,0.000128,0.00012,2.8e-05,9.1e-05,0.00017,2e-04,0.000126,0.005341,0.001876,0.000642,5.4e-05,0.000461,0.000267,0.000115,0.000215,0.000422,0.000405,0.000111,0.000236,0.000121,0.000286,0.000126
8.4e-05,4.6e-05,3.9e-05,4.5e-05,4.9e-05,5.9e-05,5.1e-05,5.4e-05,3.1e-05,2.2e-05,0.000105,0.000664,0.00045,0.000148,4.1e-05,7.3e-05,1.2e-05,3.4e-05,1.8e-05,7e-06,1.4e-05,4.1e-05,9.7e-05,8.7e-05,1.3e-05,5.7e-05,0.000136,6.8e-05,2.5e-05,0.000108,0.000109,2.6e-05,7.5e-05,0.000213,0.000236,8.2e-05,0.000167,0.000145,0.000156,0.000255,0.000116,0.000329,0.000348,0.000579,0.000556,0.000576,0.000577,0.000396,0.000183,0.000166,0.000282,0.000213,0.000205,0.000108,0.000125,0.000191,0.000252,0.000382,0.000239,7.9e-05,8.5e-05,0.000347,0.001198,0.000592,0.000379,0.000333,4e-04,0.00039,0.00018,0.000232,0.00015,0.000252,8.2e-05,0.000129,7.5e-05,0.000179,5.1e-05,0.000189,6.5e-05,0.000148,0.000169,6.8e-05,9.2e-05,0.000106,8.2e-05,5e-05,6.5e-05,4.6e-05,9.7e-05,4.5e-05,5.5e-05,3.7e-05,3.9e-05,6e-05,2e-05,0.000152,8.9e-05,0.000336,0.000387,0.00017,0.000148,9.1e-05,0.00013,0.000303,0.000165,3.3e-05,0.006549,0.003321,0.001083,0.000226,9e-06,0.000116,0.000144,0.000305,0.000192,9.9e-05,0.000245,6.8e-05,9.8e-05,0.000203,0.00019
2.9e-05,9.6e-05,6.9e-05,8.8e-05,4e-05,9e-05,3.6e-05,2.3e-05,4.4e-05,6.1e-05,0.000172,0.000899,0.000691,0.000372,0.000114,0.000107,0.000116,7.9e-05,9.6e-05,1.2e-05,3e-05,3.5e-05,0.000148,0.000233,0.000173,6.9e-05,0.000188,0.000279,0.000176,0.000236,0.000105,0.000194,0.000106,0.000155,0.000407,0.000254,4.5e-05,5.6e-05,0.000124,0.000221,0.000138,9.1e-05,0.000242,0.000318,0.000172,2.5e-05,0.000349,0.000296,0.000188,0.000184,0.000337,0.000389,0.000201,0.000343,0.000255,4.3e-05,0.000106,6.4e-05,0.000231,0.000121,5.1e-05,0.000361,0.001307,0.00079,0.00084,0.00085,0.000206,0.000223,0.000358,0.000148,0.000179,0.000237,0.000194,0.000231,0.000205,0.000395,9.9e-05,0.000149,0.000108,0.00014,3.1e-05,2.1e-05,0.000181,3.4e-05,8e-05,5.5e-05,3.6e-05,1.8e-05,0.000115,6.9e-05,5.8e-05,7.8e-05,8.1e-05,8e-06,4.3e-05,0.000217,0.000278,0.000381,0.000646,0.000343,0.000332,0.000294,0.000113,0.00019,0.000224,0.000176,0.006377,0.00668,0.003142,0.000708,0.000198,0.000216,0.000161,0.000287,0.000205,0.000101,0.000101,0.000187,0.00021,0.000342,0.000343
0.00024,3.7e-05,0.000109,8e-06,0.000117,0.000143,8.9e-05,5.1e-05,2.8e-05,1e-05,0.000148,0.000678,3e-04,5.7e-05,2.2e-05,0.00011,0.000215,0.000105,8.2e-05,0.000132,0.000128,4.2e-05,0.000164,0.00027,0.000241,0.000207,7.3e-05,0.000119,8.1e-05,0.000123,0.000137,0.000207,0.000178,0.000141,0.000271,0.00021,0.00014,0.000106,9.7e-05,0.000238,0.000121,0.00019,0.000155,0.000281,0.000385,0.000276,0.000237,0.000237,0.000327,5.5e-05,0.000304,0.000563,0.00041,0.00024,9.9e-05,4.8e-05,3.1e-05,0.000114,0.000108,4.8e-05,6.2e-05,0.000433,0.000786,0.000562,0.000769,0.000166,0.000447,0.000474,0.000362,0.000124,0.000145,0.000344,0.000219,0.000102,0.000236,8.5e-05,0.000132,0.000129,9.3e-05,0.000124,8.3e-05,8e-05,0.000177,0.000143,9.7e-05,7.2e-05,9.8e-05,8e-05,0.000113,4.4e-05,6.4e-05,6.6e-05,6.5e-05,0.000154,0.000131,0.000311,0.000377,9.2e-05,0.00044,0.000318,0.00024,0.00022,9.8e-05,5.2e-05,8.8e-05,0.000283,0.004459,0.004077,0.002044,0.000513,3.2e-05,2.5e-05,0.000197,0.000142,0.000378,0.00028,0.000158,0.000142,5.6e-05,0.000406,0.000548
7.8e-05,0.000103,7e-05,3.6e-05,0.000119,0.000116,5.8e-05,2.6e-05,1.1e-05,5e-06,8.6e-05,0.00027,0.000113,4.6e-05,2.8e-05,9.9e-05,0.000156,0.000104,9.7e-05,3e-05,7.5e-05,8.2e-05,0.000108,3.7e-05,0.000109,1.4e-05,5e-05,9.5e-05,1.9e-05,0.000122,0.000142,3.6e-05,8.1e-05,0.000177,0.000111,7.7e-05,0.000103,3e-05,3e-05,0.000116,5.9e-05,0.000132,5.2e-05,5.2e-05,0.000143,0.000173,0.000167,0.000101,2.2e-05,0.000154,0.000339,0.000214,6e-05,0.000101,0.000163,0.000171,0.000103,0.000181,0.000191,0.000112,3.8e-05,0.00037,0.000176,0.000251,0.000277,0.000384,0.000373,6.6e-05,9e-05,0.00016,0.000113,0.000106,6.8e-05,0.000102,0.000121,0.000118,0.000118,0.000151,0.000106,6.8e-05,2.3e-05,6.8e-05,0.000115,4.8e-05,6.1e-05,1.5e-05,6.6e-05,3e-05,2.2e-05,2.3e-05,1e-05,2.2e-05,3.4e-05,0.000166,7.5e-05,0.000137,9.6e-05,0.000158,0.000231,9.4e-05,0.000162,6e-06,5.5e-05,6.3e-05,2.9e-05,0.000393,0.001935,0.00077,0.000324,3.7e-05,0.000114,5.4e-05,1e-04,0.000202,4.3e-05,4.6e-05,4.4e-05,0.000113,7.6e-05,0.000339,0.000195
2.2e-05,4.3e-05,2.6e-05,5.1e-05,5.4e-05,2.9e-05,1.6e-05,1.1e-05,1.5e-05,2.6e-05,0.000112,6.1e-05,4e-05,2.1e-05,4.5e-05,9.1e-05,1.1e-05,9e-06,6.5e-05,7.8e-05,2e-05,3.3e-05,9e-05,7e-05,8.9e-05,5.1e-05,2.3e-05,2.2e-05,7.1e-05,0.000126,0.000108,7.4e-05,7.9e-05,0.000312,0.000309,0.000151,7.3e-05,4.4e-05,3.2e-05,7.4e-05,8.3e-05,7.7e-05,0.000122,7.2e-05,0.00011,0.000181,0.000169,7.2e-05,0.000112,0.000126,0.000247,0.000126,2.6e-05,8.2e-05,0.000147,0.000107,1.4e-05,0.000147,0.000147,0.000132,2.2e-05,0.00026,0.00013,0.00024,0.000174,0.000253,7e-05,7.3e-05,8.8e-05,8.8e-05,0.00011,9.6e-05,5.6e-05,7.6e-05,3.5e-05,5.4e-05,3.1e-05,6.3e-05,4.6e-05,4.1e-05,6.3e-05,2e-05,6.2e-05,6.9e-05,6.5e-05,3.6e-05,3e-05,1.2e-05,9e-06,1.3e-05,4.4e-05,2.4e-05,4.3e-05,0.000122,4.6e-05,1e-04,6.4e-05,0.000175,7.2e-05,5.6e-05,5.1e-05,5.6e-05,4.1e-05,3.1e-05,9e-05,0.000469,0.000889,0.000335,0.000198,0.000133,5.5e-05,2.3e-05,0.000112,3.2e-05,3e-06,4.8e-05,2.3e-05,6.5e-05,0.000168,6e-06,6e-05
5.2e-05,3.8e-05,5.3e-05,2e-05,3.3e-05,1.3e-05,7e-06,9e-06,1.4e-05,2e-05,0.000165,8.5e-05,0.000142,6.1e-05,3.2e-05,9.8e-05,6.8e-05,4.6e-05,2.8e-05,2.6e-05,1.7e-05,3.8e-05,2e-05,4.7e-05,5.7e-05,3.1e-05,4e-05,2.3e-05,6.8e-05,2.2e-05,0.000138,1.8e-05,4.4e-05,0.000427,0.000116,0.000109,2.4e-05,2.9e-05,2.7e-05,0.000156,0.000149,7.7e-05,0.000152,0.00012,7.9e-05,2.2e-05,0.000189,6e-06,7.7e-05,0.000105,0.000142,8.7e-05,6.5e-05,8.6e-05,0.000134,7.9e-05,1.3e-05,0.000105,1e-04,7.9e-05,3.7e-05,0.000228,9.4e-05,0.000162,0.000166,0.000203,0.000208,9.8e-05,8.9e-05,9.4e-05,3.1e-05,4e-05,2.3e-05,2.6e-05,6.8e-05,2.6e-05,1.3e-05,4.1e-05,3.8e-05,4.5e-05,6.8e-05,5.1e-05,2.6e-05,1.8e-05,4.4e-05,1.1e-05,2.2e-05,1.2e-05,1.8e-05,1.3e-05,6e-05,3.5e-05,3e-05,0.000102,7.7e-05,0.000171,0.000145,0.000117,0.000121,5.8e-05,4.7e-05,4.4e-05,5.4e-05,4.8e-05,0.000113,0.000512,0.000528,0.000276,0.000123,0.000115,1.8e-05,5.5e-05,9.1e-05,1.4e-05,4.5e-05,4.7e-05,1.5e-05,3.5e-05,0.000138,0.00022,0.000115
8e-06,3.5e-05,4.4e-05,1.2e-05,3.5e-05,1e-06,2e-05,1e-05,1.8e-05,9e-06,0.000153,0.000329,0.000135,5.4e-05,6.4e-05,5.1e-05,1.9e-05,2.8e-05,1.3e-05,2.6e-05,2.5e-05,3.8e-05,5.5e-05,9e-06,4e-06,2.9e-05,4.6e-05,5.8e-05,6.2e-05,4.2e-05,0.000139,5.8e-05,2.8e-05,0.000538,0.000479,0.000163,3.1e-05,3.1e-05,3.5e-05,0.000139,7.3e-05,0.000121,0.000122,4.4e-05,6.1e-05,0.000167,0.000146,9.5e-05,0.000114,7.4e-05,0.000114,9.3e-05,2.4e-05,8.4e-05,0.000105,2.5e-05,7.3e-05,0.000114,9.4e-05,9.2e-05,3.1e-05,0.000213,4.7e-05,7.6e-05,8.1e-05,0.000239,8.7e-05,0.000124,0.000231,1e-04,8.9e-05,2.9e-05,4.3e-05,8.5e-05,4.7e-05,2.7e-05,4.1e-05,3e-05,5.1e-05,3.7e-05,3.3e-05,1.1e-05,2.1e-05,3.3e-05,4.8e-05,1.5e-05,1.2e-05,2.9e-05,2.5e-05,1.8e-05,3.1e-05,3e-05,7e-05,0.000137,0.000151,0.000185,5e-05,0.000102,7.5e-05,3.4e-05,2.7e-05,1.2e-05,5.3e-05,9.1e-05,2e-04,0.000803,0.000969,0.000456,0.000298,0.00017,0.000116,0.000134,4.8e-05,3.8e-05,4e-05,1.6e-05,2.9e-05,4.5e-05,0.000183,0.00013,3.8e-05
4.2e-05,4.7e-05,9.8e-05,4.2e-05,1e-05,2.5e-05,2.8e-05,3e-05,3e-05,5e-06,0.00012,0.000322,0.000138,2.3e-05,2.8e-05,8.2e-05,3e-05,2.7e-05,1.7e-05,2.2e-05,3.2e-05,5e-05,5.7e-05,3.2e-05,1.4e-05,7.3e-05,6.2e-05,4.2e-05,4.5e-05,0.000112,9.9e-05,7.1e-05,4.4e-05,0.000746,0.000263,6.1e-05,6.1e-05,5.4e-05,2.2e-05,9.5e-05,3.2e-05,3.2e-05,3.9e-05,5.1e-05,5e-05,8.8e-05,1e-04,2.8e-05,0.000123,4.4e-05,0.000103,9.9e-05,5.8e-05,6.9e-05,7e-05,4.7e-05,8.5e-05,0.000126,9.6e-05,7e-05,2.8e-05,0.000361,0.000131,2.3e-05,9.3e-05,0.000113,5.2e-05,8.6e-05,0.000139,4.7e-05,8.6e-05,8.8e-05,4e-05,7.1e-05,9.9e-05,0.000111,4e-05,8.4e-05,0.000114,3.9e-05,1.8e-05,2.3e-05,2.3e-05,1.5e-05,4.2e-05,1.2e-05,5e-06,1.6e-05,2.6e-05,1.2e-05,3.3e-05,4.1e-05,0.000107,3.7e-05,5.6e-05,4.5e-05,3.3e-05,0.000141,0.00012,5e-05,9.1e-05,1.5e-05,8.5e-05,8.8e-05,0.000184,0.000695,0.000822,0.001084,0.000694,0.000251,0.000126,8.6e-05,6.5e-05,3.5e-05,1.9e-05,5.4e-05,1.1e-05,5.1e-05,0.000184,8e-05,3.8e-05
9.1e-05,7.5e-05,0.000109,0.000117,9.1e-05,2.8e-05,4.5e-05,2.9e-05,5.3e-05,2.5e-05,0.000143,0.000166,0.000137,3.6e-05,4.5e-05,8.3e-05,3.9e-05,1.4e-05,4.3e-05,6.3e-05,4.6e-05,7.8e-05,9.4e-05,6.5e-05,6.4e-05,6.7e-05,5e-05,4.3e-05,9.3e-05,0.000167,0.000132,0.000112,0.000121,0.001001,0.000476,0.000245,9.7e-05,1.5e-05,2.4e-05,0.000154,5.4e-05,7.7e-05,2.4e-05,2.9e-05,5.8e-05,7.6e-05,5e-05,0.000102,0.000106,7.7e-05,0.000128,0.000103,3.1e-05,6.5e-05,4.4e-05,7.3e-05,2.5e-05,9.5e-05,8.8e-05,0.000114,4.5e-05,0.000457,0.000117,2.4e-05,0.000129,0.000179,0.000101,8.9e-05,0.000108,1.4e-05,5e-05,0.000114,0.000106,9.6e-05,4.9e-05,0.000117,3.2e-05,6.8e-05,6e-05,2.9e-05,3.4e-05,1e-05,4.5e-05,3e-05,3.1e-05,3.5e-05,3.2e-05,2e-05,1.2e-05,1.6e-05,3.1e-05,1.8e-05,5e-05,7.3e-05,1.5e-05,0.000253,7.3e-05,0.000186,4.2e-05,0.000155,0.000149,0.000118,0.000151,0.000207,0.000341,0.000888,0.001124,0.001115,0.000364,3.1e-05,3.3e-05,0.000132,2.1e-05,2.4e-05,2.9e-05,9.1e-05,3.3e-05,3.9e-05,0.000177,9.6e-05,2.3e-05
0.000167,0.000107,6.4e-05,4.5e-05,8.3e-05,8.6e-05,2.9e-05,1.3e-05,7.7e-05,7.9e-05,0.000114,0.000308,0.000105,7.3e-05,3.9e-05,8.2e-05,7e-05,4.6e-05,1.9e-05,1.5e-05,3.5e-05,4.6e-05,4.2e-05,3.3e-05,4.2e-05,2.5e-05,0.000102,4.9e-05,6e-05,0.000169,0.000237,0.00012,8.8e-05,0.001285,0.000796,4.5e-05,0.000199,0.000106,0.000104,0.000183,9.6e-05,5.8e-05,2.5e-05,5.4e-05,6.9e-05,4.1e-05,5e-06,2.2e-05,8.3e-05,5.2e-05,0.000213,0.000101,1.6e-05,6.6e-05,9.9e-05,6.3e-05,1.2e-05,7.1e-05,0.000115,0.000111,1.5e-05,0.000538,0.000523,0.000275,0.000281,0.000173,8.6e-05,0.000151,0.000133,0.000152,4.6e-05,8.3e-05,2.9e-05,0.000102,2.2e-05,9.6e-05,5.9e-05,1e-05,6.1e-05,4.7e-05,3.5e-05,3.5e-05,3.3e-05,6e-06,1e-05,2e-05,9e-06,8e-06,1.6e-05,3.5e-05,5.2e-05,3.5e-05,1.7e-05,3.2e-05,7e-06,0.000581,0.000297,0.000217,0.000142,0.000281,7.9e-05,3e-05,8.9e-05,0.000167,0.000203,0.001047,0.002594,0.001247,0.000864,0.000426,9.1e-05,0.000124,6.5e-05,5.6e-05,2.1e-05,5.9e-05,1.8e-05,2.5e-05,9.7e-05,6.1e-05,6.4e-05
0.000115,0.000141,7.2e-05,6.5e-05,9.6e-05,7e-05,6.9e-05,7.5e-05,6.1e-05,4.1e-05,0.000128,7e-04,4e-04,0.000185,0.000104,5.1e-05,6.2e-05,2.3e-05,2.2e-05,1.3e-05,5.6e-05,4.3e-05,7.2e-05,7.2e-05,5.6e-05,9.2e-05,9.2e-05,7.2e-05,1e-05,0.000106,0.00024,9e-05,1e-05,0.001227,0.00074,0.000371,0.00025,0.000154,0.000106,4e-06,6.2e-05,6.7e-05,7.6e-05,6.3e-05,1.3e-05,8.3e-05,1.8e-05,7.7e-05,1.8e-05,9.4e-05,0.000244,0.000216,0.000118,7e-05,7.6e-05,6.4e-05,2.8e-05,8e-05,8.3e-05,7.8e-05,7.9e-05,0.000547,0.000722,0.000305,0.000252,0.000188,0.00011,5.3e-05,4.3e-05,6.5e-05,0.000125,0.000101,0.000112,6.2e-05,5.9e-05,3.2e-05,2.8e-05,2.4e-05,8.1e-05,9.2e-05,4.5e-05,3.9e-05,5.4e-05,2.4e-05,4.2e-05,1.2e-05,1.1e-05,1.8e-05,3.2e-05,1.2e-05,3.4e-05,8.6e-05,9.9e-05,6.4e-05,3.6e-05,0.00087,0.000512,0.000298,0.000195,0.000273,0.000266,0.000166,0.000117,0.000108,0.000157,0.000827,0.004827,0.004456,0.00189,0.000383,7e-06,0.000139,5e-05,2.8e-05,5.5e-05,4.3e-05,2.2e-05,1.7e-05,0.000102,2.6e-05,6e-05
0.000246,0.000157,3.8e-05,9.1e-05,1.8e-05,9e-06,4e-05,3.4e-05,5.6e-05,5.3e-05,0.000125,0.00081,0.000423,0.000167,9.7e-05,0.000149,5.6e-05,2.7e-05,1.9e-05,3.5e-05,7.3e-05,7.2e-05,0.000143,6.3e-05,0.000101,6.2e-05,0.000171,0.000184,2.9e-05,6.1e-05,0.00021,0.000196,0.00015,0.001056,0.000941,0.000425,0.000187,3.5e-05,3.4e-05,7.3e-05,3.6e-05,7.7e-05,0.000101,4.6e-05,4.3e-05,6.4e-05,7.4e-05,8.9e-05,1.7e-05,8e-05,0.000199,6.9e-05,7.7e-05,0.000125,4.5e-05,3.3e-05,4e-05,0.000107,0.000103,0.000106,0.000148,0.00068,0.000679,0.000469,0.00032,0.000329,0.000269,2e-04,0.000126,6.8e-05,9.7e-05,5.4e-05,0.000101,7.9e-05,7e-05,3.8e-05,2.5e-05,3e-05,0.000105,7.7e-05,2.9e-05,7e-06,6.5e-05,3.2e-05,4.8e-05,3.8e-05,1.1e-05,9e-06,3.4e-05,1.8e-05,6.2e-05,0.000105,9e-06,8e-05,5.8e-05,0.001,0.000691,0.000202,5.4e-05,0.000122,9.9e-05,0.000143,6.4e-05,5.3e-05,0.000157,0.000829,0.004901,0.003792,0.00169,0.000333,5.1e-05,9.3e-05,0.000139,7.4e-05,0.000116,0.000118,7.5e-05,3.8e-05,1e-04,0.000124,8.3e-05
0.000116,9.1e-05,9.6e-05,0.000106,0.000185,0.000108,5.4e-05,3e-06,4e-05,3.4e-05,0.000123,0.000482,0.000317,0.000105,7.5e-05,4.6e-05,2.8e-05,2.9e-05,2.4e-05,3e-05,7.6e-05,5.1e-05,0.000114,5.4e-05,8e-05,7.9e-05,0.000255,0.000337,0.000282,0.000128,0.000191,9.7e-05,0.000142,0.000889,0.00053,0.000625,0.000255,0.000132,4e-05,7.7e-05,3.4e-05,5.2e-05,3.8e-05,0.000102,7e-06,2.7e-05,1.6e-05,4.9e-05,5.2e-05,5.8e-05,8.5e-05,5.6e-05,0.000109,3.6e-05,7.9e-05,1.6e-05,5.9e-05,5.3e-05,0.000132,5.7e-05,0.000162,0.000633,0.000305,0.000123,0.000261,0.000111,8e-05,0.00016,0.000145,0.000102,7.2e-05,4.7e-05,9e-06,1.1e-05,0.000104,0.000109,6.2e-05,2.6e-05,8e-05,5.6e-05,3.2e-05,6e-06,7.1e-05,5.2e-05,1.7e-05,3.9e-05,3.7e-05,2.2e-05,2.3e-05,2.8e-05,7.3e-05,9e-05,5.2e-05,3.2e-05,8.2e-05,0.00091,0.000374,0.000196,0.000224,0.000165,1.5e-05,0.000164,0.000119,6.5e-05,0.000139,0.000656,0.002418,0.000468,0.000461,0.000275,8e-05,2.5e-05,9.9e-05,4.1e-05,7.1e-05,3e-05,4.3e-05,5.2e-05,5.9e-05,0.000142,5.8e-05
6e-05,8.4e-05,5e-05,4.7e-05,0.000162,7.6e-05,1.5e-05,2.6e-05,5.2e-05,1.6e-05,0.00012,0.000139,0.000126,0.000101,8.6e-05,7e-05,4.6e-05,7e-06,2.2e-05,2.6e-05,0.000125,0.000163,5.4e-05,4.6e-05,8.8e-05,5.5e-05,0.000253,0.000258,1.3e-05,8.6e-05,0.000127,3.4e-05,0.000118,0.000802,0.000338,0.000718,0.000676,0.000279,7.9e-05,3.2e-05,3.6e-05,6.9e-05,1.9e-05,9.5e-05,5.2e-05,6.1e-05,1.9e-05,5.8e-05,6.6e-05,7.5e-05,5.5e-05,4e-05,3.5e-05,6.8e-05,7e-05,2.5e-05,6e-05,0.000105,0.00015,8.6e-05,0.000119,0.00055,0.000335,6.3e-05,9.3e-05,4.7e-05,0.000113,0.000121,3.9e-05,3.8e-05,6.4e-05,3e-05,7.2e-05,4.2e-05,0.000121,6.1e-05,0.000112,6.2e-05,5.5e-05,1.2e-05,3e-05,1.2e-05,4.2e-05,6.1e-05,3.8e-05,7e-06,5e-06,1.3e-05,2.1e-05,2.1e-05,7.1e-05,7e-05,4.8e-05,4.4e-05,0.000151,0.000654,0.000366,0.000346,0.000136,0.000122,0.000107,0.000134,0.000211,9.5e-05,0.000162,0.000758,0.000707,0.000705,0.000105,5e-05,6.7e-05,5.1e-05,4.8e-05,0.000101,5.2e-05,5.7e-05,4.9e-05,2.7e-05,5.9e-05,7.6e-05,2.8e-05
0.000143,4.1e-05,4.5e-05,0.000104,9.9e-05,7.8e-05,4.5e-05,2.7e-05,3.1e-05,2.4e-05,0.000107,8.6e-05,4.3e-05,2.9e-05,4.1e-05,4.3e-05,4.2e-05,4.7e-05,3.9e-05,1.2e-05,1e-04,5.5e-05,3.5e-05,7.9e-05,9.3e-05,0.000154,0.000244,0.000174,0.000109,6.8e-05,0.00012,0.000119,0.000178,0.000468,0.000282,0.000497,0.000514,0.000255,0.000154,4.3e-05,5.5e-05,1.7e-05,2e-05,5.1e-05,3e-05,0.000105,8.2e-05,7.7e-05,6.7e-05,7.4e-05,1e-04,5.2e-05,3.9e-05,4.5e-05,6.1e-05,1.3e-05,3.9e-05,4.1e-05,0.00011,2.7e-05,4.4e-05,0.000402,0.000208,0.000137,0.000123,8.4e-05,2.3e-05,2.8e-05,6.6e-05,7e-05,4.2e-05,4e-05,7.7e-05,6.9e-05,0.000156,8e-05,8.9e-05,9.7e-05,7e-05,3.9e-05,2.5e-05,1.8e-05,2e-05,5.3e-05,3.3e-05,7e-06,8e-06,1.4e-05,3.5e-05,1.6e-05,4.4e-05,5.5e-05,4.6e-05,0.000107,0.000104,0.000181,0.000138,0.000191,0.000233,9.6e-05,5.7e-05,9.4e-05,6.3e-05,0.000103,0.000154,0.000538,0.002036,0.000757,0.000179,6.4e-05,1.6e-05,1.8e-05,4.4e-05,6.4e-05,6.2e-05,2e-05,2.8e-05,1.8e-05,3.4e-05,2.9e-05,3.4e-05
3.4e-05,4.1e-05,3.8e-05,2.7e-05,5e-06,2.7e-05,1.5e-05,1.5e-05,1.9e-05,7e-06,4.7e-05,2.8e-05,3.8e-05,1.5e-05,3.4e-05,2.8e-05,1.3e-05,4e-06,1.2e-05,1.9e-05,1.6e-05,2.1e-05,7e-06,2.5e-05,1.9e-05,7e-05,3.1e-05,8.8e-05,5.4e-05,3.3e-05,7.5e-05,4.1e-05,4.3e-05,0.000147,0.000183,0.000187,9.4e-05,7.4e-05,1.7e-05,4.5e-05,3.1e-05,2e-06,2.8e-05,8e-06,2.2e-05,1.8e-05,2.4e-05,5.7e-05,5e-05,4.5e-05,4.1e-05,1e-05,1.2e-05,2.6e-05,3.5e-05,1e-05,1.5e-05,3.8e-05,3.7e-05,3e-05,1.1e-05,0.000159,6.6e-05,6.8e-05,3.9e-05,2.8e-05,3.6e-05,3.3e-05,1.2e-05,1.3e-05,1.3e-05,3e-06,3.3e-05,2e-05,2.8e-05,3.3e-05,2.2e-05,8e-06,3.1e-05,2.3e-05,1.2e-05,8e-06,2e-05,4e-06,7e-06,9e-06,9e-06,4e-06,1.5e-05,4e-06,2.3e-05,1.9e-05,1.3e-05,3.8e-05,4.1e-05,5.7e-05,5e-06,7e-05,9.5e-05,3e-05,1.1e-05,7e-06,3.2e-05,8.5e-05,3.3e-05,0.000303,0.00074,0.000307,0.000171,4.6e-05,2.9e-05,1.5e-05,1.3e-05,3.6e-05,2.2e-05,1.6e-05,1.1e-05,1.6e-05,2.7e-05,2.6e-05,9e-06
2.8e-05,7e-06,1e-06,1.6e-05,1e-05,1.8e-05,3e-06,9e-06,5e-06,1e-05,3.1e-05,6.8e-05,2e-05,1.9e-05,1.8e-05,1.5e-05,1e-05,8e-06,8e-06,1.4e-05,6e-06,1.8e-05,1.7e-05,6e-06,2.7e-05,3.6e-05,5e-05,4.6e-05,9e-06,1.7e-05,6e-05,4.5e-05,2.9e-05,0.000171,0.000107,0.000209,7e-05,4.1e-05,4.7e-05,4e-05,4.1e-05,3.8e-05,2.3e-05,2e-05,1.3e-05,6e-06,2.7e-05,2.8e-05,4.3e-05,3e-06,1.2e-05,1.8e-05,1.7e-05,2.2e-05,3.1e-05,8e-06,9e-06,2.5e-05,3.8e-05,2.3e-05,1.5e-05,9.5e-05,8.6e-05,5.9e-05,2.2e-05,2.8e-05,2.1e-05,1.4e-05,1.4e-05,8e-06,6e-06,5e-06,1.1e-05,1.9e-05,2.9e-05,4.7e-05,1.7e-05,3e-06,2.2e-05,1.8e-05,1.2e-05,8e-06,1.6e-05,1.4e-05,6e-06,7e-06,1e-05,7e-06,8e-06,7e-06,2.7e-05,2.3e-05,1.9e-05,1.8e-05,2.6e-05,6e-05,5.3e-05,9.3e-05,1.2e-05,3.2e-05,2e-05,1e-06,2.7e-05,6.4e-05,5.9e-05,0.000253,0.000181,4.7e-05,2.4e-05,1.2e-05,1.2e-05,2.4e-05,2.5e-05,9e-06,1.4e-05,1.7e-05,3e-06,7e-06,2.3e-05,7e-06,7e-06
1.1e-05,3e-06,1e-05,1.4e-05,5e-06,2e-06,4e-06,4e-06,7e-06,4e-06,3.5e-05,6.6e-05,4.4e-05,3.7e-05,2.3e-05,1.6e-05,5e-06,1.1e-05,1e-05,9e-06,9e-06,1.4e-05,1e-05,1e-05,2.2e-05,4e-06,2.5e-05,2.5e-05,2.6e-05,2.3e-05,5.5e-05,9e-06,1.7e-05,0.000141,0.000103,5.2e-05,6e-06,2e-05,4.5e-05,7.4e-05,4.2e-05,2.5e-05,1.6e-05,1.4e-05,1.7e-05,1.9e-05,1.8e-05,6e-06,6.2e-05,4.3e-05,2.7e-05,6e-06,9e-06,2.7e-05,2.9e-05,4e-06,4e-06,2.2e-05,4.5e-05,1e-05,6e-06,5.3e-05,7e-06,4e-05,2e-05,3e-06,7e-06,1e-05,6e-06,2e-06,6e-06,1.2e-05,1.6e-05,2.6e-05,1.1e-05,3.9e-05,2.5e-05,1.6e-05,7e-06,1.2e-05,9e-06,9e-06,1.6e-05,1.2e-05,1e-05,1.1e-05,2e-06,6e-06,1.6e-05,3e-06,2.5e-05,3.5e-05,2.2e-05,1.3e-05,1.7e-05,3.7e-05,1.9e-05,4.8e-05,3.6e-05,3.7e-05,1.7e-05,8e-06,2.2e-05,2.9e-05,3.6e-05,0.00022,0.000277,0.000118,5.6e-05,2.8e-05,2.9e-05,9e-06,2.3e-05,1.2e-05,1.4e-05,8e-06,1e-05,7e-06,2.1e-05,1.6e-05,6e-06
7e-06,2.2e-05,1.5e-05,2.4e-05,1.3e-05,7e-06,8e-06,4e-06,3e-06,1e-05,3.8e-05,4e-05,1.4e-05,1.1e-05,6e-06,1.1e-05,1.4e-05,1.3e-05,1e-05,1.5e-05,1e-05,9e-06,6e-06,1.5e-05,1e-05,8e-06,1.3e-05,1.3e-05,2.3e-05,8e-06,4.2e-05,3.9e-05,1.8e-05,7e-05,4.1e-05,9.3e-05,2.3e-05,4e-05,2.3e-05,2.9e-05,1.8e-05,9e-06,2.8e-05,2e-05,1.9e-05,2.8e-05,1.2e-05,3.5e-05,3e-05,1.6e-05,2.8e-05,1.7e-05,1.3e-05,2.9e-05,2.9e-05,1e-05,2e-06,3.2e-05,2.7e-05,1.3e-05,4e-06,2.5e-05,3.9e-05,3.7e-05,2.3e-05,9e-06,1e-05,7e-06,7e-06,1e-06,1e-06,1.6e-05,7e-06,2.4e-05,2.6e-05,2.4e-05,3.5e-05,1.9e-05,3e-06,7e-06,5e-06,3e-06,1.9e-05,4e-06,5e-06,8e-06,7e-06,4e-06,1.2e-05,1e-06,2.5e-05,3.7e-05,1.7e-05,1.3e-05,8e-06,4.3e-05,1.3e-05,2.8e-05,6e-06,1.1e-05,1.2e-05,3e-06,4e-06,9e-06,3e-05,0.000196,0.00047,0.000141,9.3e-05,9.2e-05,1.4e-05,7e-06,2.1e-05,1.7e-05,9e-06,1.1e-05,7e-06,1.3e-05,2.3e-05,1.2e-05,1.1e-05
8e-06,1.9e-05,1.2e-05,1.6e-05,5e-06,1e-05,3e-06,4e-06,6e-06,1.1e-05,2.6e-05,2.4e-05,2.1e-05,1.8e-05,4e-06,6e-06,1.7e-05,7e-06,9e-06,7e-06,4e-06,4e-06,8e-06,8e-06,1.4e-05,5e-06,2e-05,1.8e-05,1.9e-05,1.5e-05,3.8e-05,8e-06,8e-06,2.4e-05,2.6e-05,7e-05,1.1e-05,1.7e-05,7e-06,2.4e-05,1.4e-05,1.8e-05,1.9e-05,8e-06,1e-05,2.1e-05,1.3e-05,2.1e-05,2.7e-05,1.5e-05,2.4e-05,1e-06,8e-06,2.4e-05,3.4e-05,1.1e-05,5e-06,3.8e-05,4e-05,1e-05,1e-06,1.9e-05,1.7e-05,2.3e-05,3.9e-05,2.1e-05,1.1e-05,1.4e-05,1.5e-05,7e-06,2e-06,1.6e-05,5e-06,5e-06,1e-05,3.7e-05,4.3e-05,1.5e-05,1.2e-05,6e-06,1.1e-05,7e-06,1.6e-05,7e-06,4e-06,6e-06,4e-06,2e-06,1.1e-05,3e-06,2.4e-05,2.5e-05,1.3e-05,8e-06,8e-06,5.3e-05,1.7e-05,1.3e-05,1.5e-05,2.1e-05,8e-06,6e-06,1.1e-05,8e-06,1.1e-05,0.000178,0.000557,0.000268,8.2e-05,5.4e-05,2.8e-05,4e-06,1.6e-05,1.6e-05,1.8e-05,1.4e-05,5e-06,6e-06,2.2e-05,5e-06,0
1.8e-05,9e-06,1e-05,9e-06,1e-05,4e-06,8e-06,4e-06,3e-06,6e-06,2.1e-05,1e-05,9e-06,1.7e-05,1.2e-05,1.2e-05,7e-06,5e-06,9e-06,6e-06,6e-06,3e-06,1.7e-05,6e-06,3e-06,1.1e-05,1.8e-05,8e-06,2e-05,4e-06,4.4e-05,2.8e-05,2.2e-05,8.1e-05,3.6e-05,5e-05,2.2e-05,1.4e-05,1e-05,2.6e-05,7e-06,2.6e-05,2.5e-05,4e-06,2e-05,7e-06,1.9e-05,3.1e-05,2.5e-05,1.6e-05,1.3e-05,4e-06,9e-06,2.1e-05,2.7e-05,1.2e-05,2e-06,3.9e-05,3.6e-05,1e-05,1e-05,2.2e-05,3.7e-05,1.2e-05,6e-06,8e-06,6e-06,1.9e-05,8e-06,1.1e-05,1e-05,2.2e-05,1.8e-05,4e-06,2.1e-05,4.1e-05,5e-06,9e-06,1.1e-05,1.7e-05,4e-06,4e-06,1.2e-05,8e-06,3e-06,2e-06,4e-06,2e-06,8e-06,3e-06,1.7e-05,1.3e-05,2e-05,1.2e-05,6e-06,3.1e-05,5.2e-05,1.5e-05,8e-06,1.2e-05,1.7e-05,8e-06,4e-06,4e-06,1.4e-05,0.00016,0.000444,0.000257,1e-04,2.2e-05,7e-06,8e-06,1.5e-05,1.5e-05,6e-06,1.3e-05,5e-06,3e-06,1.4e-05,4e-06,4e-06
2e-05,3.1e-05,1.1e-05,8e-06,6e-06,9e-06,8e-06,4e-06,1e-06,6e-06,1.8e-05,3.7e-05,2e-05,7e-06,5e-06,1e-05,0,2e-06,7e-06,0,7e-06,7e-06,9e-06,1.4e-05,5e-06,4e-06,1.6e-05,1.6e-05,1.7e-05,1.5e-05,3.8e-05,2e-05,1.2e-05,6.3e-05,2.4e-05,5.2e-05,2.3e-05,1.6e-05,2.8e-05,4.3e-05,1.3e-05,1.7e-05,2.9e-05,2.2e-05,3.8e-05,3.4e-05,1.3e-05,3.4e-05,3.1e-05,8e-06,1.6e-05,6e-06,4e-06,1.7e-05,3e-05,1.3e-05,5e-06,3.1e-05,3.4e-05,1.8e-05,2e-06,2.9e-05,3e-06,2.8e-05,1.7e-05,2e-05,2.2e-05,1.2e-05,1.2e-05,6e-06,2e-06,1.6e-05,1.7e-05,1.3e-05,2.7e-05,5.2e-05,2.5e-05,1.8e-05,1.5e-05,1.6e-05,6e-06,5e-06,1.7e-05,5e-06,7e-06,2e-06,3e-06,2e-06,9e-06,5e-06,1.3e-05,1.5e-05,1.4e-05,3.5e-05,1.8e-05,2.9e-05,8e-06,1.2e-05,2.1e-05,6e-06,9e-06,6e-06,1.1e-05,1.9e-05,2.3e-05,0.000138,0.000179,0.000175,7.7e-05,2.8e-05,2.3e-05,7e-06,1.9e-05,2.4e-05,2.4e-05,1.8e-05,6e-06,8e-06,1.6e-05,1.2e-05,1.3e-05
2.6e-05,1.9e-05,1.2e-05,7e-06,9e-06,1e-05,4e-06,5e-06,5e-06,8e-06,1.5e-05,8.5e-05,6.3e-05,2.4e-05,1.6e-05,1.9e-05,2.2e-05,1.4e-05,5e-06,1.8e-05,1.7e-05,1e-05,4e-06,1.2e-05,1.3e-05,1.2e-05,2.4e-05,9e-06,6e-06,9e-06,2.8e-05,2.1e-05,1.8e-05,5e-05,3.1e-05,5.8e-05,1.4e-05,3e-05,1.2e-05,3.4e-05,1.4e-05,2.9e-05,5e-06,1.7e-05,3.9e-05,1.6e-05,8e-06,1.7e-05,2.2e-05,1.4e-05,1.2e-05,9e-06,1.6e-05,2e-05,3.2e-05,8e-06,1e-06,2.5e-05,3.3e-05,1.8e-05,8e-06,2.6e-05,2.5e-05,3.5e-05,3.4e-05,2.6e-05,9e-06,2.5e-05,3.8e-05,2e-05,1.5e-05,5e-06,2.1e-05,1.2e-05,1.7e-05,3e-05,1.3e-05,4e-06,1.2e-05,6e-06,9e-06,6e-06,1.8e-05,3e-06,3e-06,5e-06,8e-06,7e-06,1.3e-05,4e-06,1.5e-05,1.5e-05,2.5e-05,4.2e-05,4.3e-05,3.7e-05,9e-06,6e-06,8e-06,1.2e-05,1e-05,1.2e-05,2.6e-05,2e-05,3.2e-05,0.00015,9.1e-05,7.7e-05,4.9e-05,4.5e-05,3.5e-05,3e-05,1.3e-05,1e-05,1.5e-05,1.3e-05,3e-06,8e-06,1.3e-05,2.1e-05,5e-06
5e-06,1.4e-05,3e-06,7e-06,9e-06,8e-06,3e-06,4e-06,8e-06,6e-06,2e-05,9.2e-05,6e-05,2.9e-05,1.7e-05,2e-06,9e-06,1e-06,8e-06,2.9e-05,7e-06,5e-06,9e-06,2.4e-05,1.4e-05,2.2e-05,1.2e-05,3e-06,2e-05,1.4e-05,3.4e-05,1.1e-05,2.1e-05,9.1e-05,7e-05,4.8e-05,9e-06,1.4e-05,1.7e-05,2.3e-05,1.7e-05,3.1e-05,1.7e-05,2.4e-05,1.4e-05,3.9e-05,2e-06,2.3e-05,1.6e-05,1.5e-05,1.1e-05,8e-06,7e-06,1.6e-05,2.8e-05,1.1e-05,5e-06,1.7e-05,3.4e-05,1.3e-05,7e-06,1.7e-05,1.2e-05,3.3e-05,1.6e-05,4.4e-05,2.4e-05,3.1e-05,6e-06,1.1e-05,6e-06,9e-06,1.9e-05,1.5e-05,7e-06,3.2e-05,1.8e-05,4e-06,6e-06,5e-06,5e-06,5e-06,1.5e-05,8e-06,4e-06,5e-06,1e-05,6e-06,1e-05,4e-06,2.1e-05,1.1e-05,1.3e-05,2.2e-05,3.7e-05,3.8e-05,4e-05,2e-05,1.7e-05,1.2e-05,1.8e-05,1e-05,2e-05,9e-06,7e-06,0.000129,0.000175,4.8e-05,4.1e-05,1.5e-05,2.2e-05,7e-06,7e-06,6e-06,1.7e-05,1.6e-05,1.1e-05,3e-06,3e-06,7e-06,8e-06
1.5e-05,5e-06,1.3e-05,2.8e-05,1e-05,1.6e-05,1.2e-05,6e-06,5e-06,1.2e-05,1e-05,4.5e-05,1.8e-05,2.2e-05,1.6e-05,5e-06,2e-06,3e-06,1.3e-05,2.2e-05,1.6e-05,1e-05,1.2e-05,1.5e-05,1.3e-05,1.4e-05,1.9e-05,1e-05,2e-05,5e-06,3.1e-05,2.2e-05,1.9e-05,0.000115,4.6e-05,3.5e-05,1.2e-05,7e-06,8e-06,1.6e-05,4e-06,2.6e-05,3e-06,2.1e-05,2.5e-05,2.9e-05,2.9e-05,1.8e-05,1.6e-05,1.7e-05,1.7e-05,6e-06,5e-06,1.7e-05,2.2e-05,3e-06,7e-06,2.2e-05,3.3e-05,1.3e-05,1.1e-05,8e-06,1.6e-05,3e-05,4.9e-05,3.7e-05,1.4e-05,2.2e-05,2.3e-05,1.9e-05,1.5e-05,4e-06,1.6e-05,4e-06,1.4e-05,2.6e-05,5e-06,1.3e-05,4e-06,8e-06,4e-06,3e-06,1.1e-05,3e-06,7e-06,3e-06,8e-06,3e-06,7e-06,5e-06,1.6e-05,1.3e-05,5e-06,9e-06,1.5e-05,2.6e-05,7e-06,1.3e-05,1.4e-05,1.2e-05,1.6e-05,6e-06,1.1e-05,5e-06,1.4e-05,0.000112,0.000213,0.000151,8.8e-05,2.1e-05,1e-05,1.5e-05,9e-06,4e-06,9e-06,7e-06,1.4e-05,6e-06,8e-06,3e-06,6e-06
2.2e-05,3.2e-05,1.9e-05,4.6e-05,2.5e-05,1.3e-05,8e-06,5e-06,1e-06,1.1e-05,1.5e-05,4.6e-05,3.1e-05,3.3e-05,8e-06,9e-06,1.4e-05,1.2e-05,5e-06,1.6e-05,7e-06,2.4e-05,3e-06,1.4e-05,1.8e-05,2.3e-05,3e-06,5e-06,8e-06,9e-06,2.7e-05,8e-06,1.2e-05,8.3e-05,3.9e-05,4.5e-05,8e-06,1e-05,4e-06,2.9e-05,3e-06,1.9e-05,1.1e-05,2.5e-05,2.2e-05,1.5e-05,2.1e-05,2.1e-05,2.2e-05,2e-05,3.3e-05,9e-06,8e-06,1.8e-05,1.8e-05,9e-06,4e-06,2.1e-05,4.4e-05,4e-06,1.3e-05,2.6e-05,3.8e-05,1.9e-05,4.3e-05,4.9e-05,4.7e-05,2.2e-05,1e-05,3e-06,3e-06,4e-06,1e-05,1.1e-05,7e-06,3.3e-05,1.5e-05,2.1e-05,1.3e-05,8e-06,5e-06,2e-06,1.3e-05,7e-06,5e-06,2e-06,7e-06,2e-06,1.1e-05,3e-06,1.2e-05,2e-05,1.2e-05,7e-06,3e-06,3.2e-05,1.1e-05,1.7e-05,8e-06,5e-06,3e-06,1e-06,8e-06,1.8e-05,1.8e-05,0.000107,0.000306,0.000212,6.2e-05,1.4e-05,1.6e-05,1.5e-05,1.1e-05,3e-06,1.1e-05,2.1e-05,6e-06,7e-06,6e-06,3e-06,1.2e-05
4.7e-05,5.5e-05,4.9e-05,1.7e-05,1.4e-05,4e-06,8e-06,8e-06,8e-06,9e-06,2.7e-05,6.5e-05,3.1e-05,2.1e-05,3.4e-05,2.3e-05,9e-06,7e-06,1.2e-05,2.3e-05,1.3e-05,2.3e-05,1.4e-05,2.8e-05,1e-06,8e-06,1.8e-05,2.5e-05,1.8e-05,7e-06,4.6e-05,3.8e-05,2.6e-05,3.7e-05,1.5e-05,5.9e-05,3.1e-05,1.2e-05,9e-06,1.9e-05,1.1e-05,1.4e-05,9e-06,2.2e-05,2.8e-05,5e-05,1.2e-05,3.2e-05,2.3e-05,1.7e-05,2.5e-05,6e-06,7e-06,2e-05,2e-05,4e-06,7e-06,2.7e-05,2.7e-05,1e-05,5e-06,2.5e-05,2.5e-05,2.5e-05,1.5e-05,1.6e-05,4e-05,3.2e-05,2.4e-05,1.1e-05,9e-06,6e-06,1.2e-05,2.8e-05,2.4e-05,3.1e-05,1.6e-05,1e-05,1e-06,1.3e-05,1.5e-05,1.1e-05,4e-06,5e-06,5e-06,1e-06,2e-06,5e-06,1.2e-05,1e-06,1.6e-05,2.4e-05,1.6e-05,9e-06,4e-06,3.2e-05,1.5e-05,2e-05,1.8e-05,6e-06,1.1e-05,6e-06,1.9e-05,1.6e-05,1.6e-05,9.7e-05,0.000325,0.000168,4.8e-05,1.4e-05,2e-06,1.8e-05,1e-05,6e-06,4e-06,1.4e-05,1.6e-05,6e-06,1.1e-05,2e-06,6e-06
4.1e-05,4.9e-05,3.2e-05,4.8e-05,2.5e-05,7e-06,5e-06,5e-06,3e-06,1.1e-05,2.2e-05,3.1e-05,2.5e-05,9e-06,3.8e-05,1.9e-05,1e-05,3e-06,8e-06,1.1e-05,1.7e-05,1.6e-05,1.2e-05,3.5e-05,2.5e-05,1.1e-05,1.5e-05,2.7e-05,1.4e-05,1.8e-05,7.4e-05,2.3e-05,1.2e-05,3.9e-05,1.8e-05,4.6e-05,9e-06,1e-05,2.2e-05,1.6e-05,9e-06,2.2e-05,9e-06,1.6e-05,1.4e-05,3.5e-05,4.4e-05,2.4e-05,1.4e-05,9e-06,2e-05,8e-06,6e-06,1.8e-05,2.4e-05,9e-06,1.3e-05,3.6e-05,2.2e-05,3.1e-05,2.4e-05,2.4e-05,2.4e-05,3e-05,9e-06,1.6e-05,2.6e-05,1.3e-05,1.1e-05,8e-06,5e-06,6e-06,1.5e-05,4.5e-05,5.1e-05,3.3e-05,3e-05,2.4e-05,1.7e-05,2e-06,5e-06,2e-06,8e-06,9e-06,9e-06,5e-06,5e-06,1e-06,1.2e-05,2e-06,1.2e-05,2.4e-05,1.1e-05,9e-06,1e-06,5.4e-05,2.4e-05,2.1e-05,7e-06,7e-06,2.8e-05,2.4e-05,2.4e-05,1.9e-05,2.1e-05,9.4e-05,0.000201,4.5e-05,5.8e-05,5.5e-05,1.8e-05,1.1e-05,6e-06,1.5e-05,2.1e-05,2e-05,1.2e-05,6e-06,1e-05,1.1e-05,7e-06
1.1e-05,3.4e-05,1.2e-05,2.4e-05,1.1e-05,4e-06,4e-06,1e-05,7e-06,8e-06,1.9e-05,1.3e-05,1.6e-05,1.3e-05,4.5e-05,2.9e-05,4e-06,5e-06,5e-06,4e-06,6e-06,7e-06,8e-06,7e-06,1.7e-05,1.1e-05,1.5e-05,1.4e-05,1.3e-05,1.7e-05,0.000116,6.5e-05,2.4e-05,1.4e-05,1.4e-05,3.8e-05,1.3e-05,6e-06,2.4e-05,2.6e-05,2e-06,2.5e-05,1e-05,9e-06,1.1e-05,2e-05,4e-06,1.8e-05,1.6e-05,2.2e-05,2.1e-05,3e-06,1.1e-05,1.6e-05,2.3e-05,8e-06,1.1e-05,2.4e-05,2.5e-05,3.4e-05,1e-05,2.8e-05,9e-06,4e-05,5.3e-05,5.2e-05,1.3e-05,5e-06,6e-06,1.1e-05,9e-06,7e-06,1.4e-05,3.6e-05,1.3e-05,2.7e-05,1.5e-05,7e-06,6e-06,8e-06,1e-06,5e-06,8e-06,1.1e-05,3e-06,5e-06,8e-06,4e-06,7e-06,2e-06,1.4e-05,3.6e-05,1.6e-05,1.2e-05,1.7e-05,9.4e-05,4.1e-05,3e-05,1.5e-05,5e-06,1.7e-05,1.6e-05,1.5e-05,1.5e-05,1.8e-05,9.9e-05,8.5e-05,5.4e-05,2.7e-05,4.3e-05,2.4e-05,1.7e-05,2e-05,2.5e-05,8e-06,1.6e-05,4e-06,4e-06,4e-06,2e-06,4e-06
1.9e-05,1.9e-05,1.7e-05,2e-06,6e-06,1.3e-05,1.2e-05,6e-06,4e-06,5e-06,9e-06,2.4e-05,2.2e-05,2.3e-05,1.5e-05,7e-06,1.4e-05,8e-06,3e-06,5e-06,5e-06,0,1e-05,9e-06,1.8e-05,7e-06,2.5e-05,1e-05,9e-06,2.6e-05,9.8e-05,7.4e-05,2.8e-05,3.2e-05,4.3e-05,4e-05,1.4e-05,1.2e-05,1.7e-05,1.4e-05,7e-06,1.1e-05,2e-05,2e-05,9e-06,1.6e-05,3.5e-05,1.6e-05,2.2e-05,1.9e-05,1e-05,1.3e-05,1.2e-05,1.9e-05,2.1e-05,3e-06,4e-06,2.5e-05,2.4e-05,1.9e-05,4e-06,2.9e-05,5.2e-05,2.9e-05,6.4e-05,3.3e-05,2.1e-05,1.2e-05,2.9e-05,6e-06,5e-06,3e-06,1.4e-05,9e-06,1.4e-05,9e-06,1.6e-05,2.4e-05,1.7e-05,2e-06,5e-06,7e-06,1.6e-05,1e-05,2e-06,4e-06,6e-06,2e-06,5e-06,2e-06,1.4e-05,4e-05,2.9e-05,9e-06,1.7e-05,8.8e-05,6.7e-05,3.9e-05,1.4e-05,2e-05,1.3e-05,1.8e-05,1.3e-05,1e-06,4e-06,0.000114,0.000134,1.1e-05,1.5e-05,1.7e-05,9e-06,2.7e-05,1.5e-05,1.1e-05,1.5e-05,1.9e-05,6e-06,5e-06,4e-06,1e-05,4e-06
1.9e-05,5e-06,2e-05,1.6e-05,7e-06,5e-06,2e-06,1.2e-05,1e-05,6e-06,5e-06,4.2e-05,2.9e-05,2.4e-05,7e-06,1.1e-05,5e-06,3e-06,3e-06,2e-06,2e-06,6e-06,9e-06,2e-06,1.2e-05,1.2e-05,2.2e-05,9e-06,8e-06,1.7e-05,9.3e-05,6.6e-05,3.4e-05,4.5e-05,5.5e-05,6.2e-05,9e-06,5e-06,1.9e-05,3.8e-05,1.6e-05,2e-05,2.3e-05,1e-05,1.4e-05,1.9e-05,8e-06,2.1e-05,1.5e-05,1.7e-05,9e-06,8e-06,5e-06,2.1e-05,1.9e-05,1e-05,9e-06,2e-05,2.6e-05,2.3e-05,3e-06,2.2e-05,6.5e-05,3.1e-05,3.6e-05,2.3e-05,2.2e-05,1e-05,3.8e-05,1.9e-05,7e-06,6e-06,1.8e-05,1e-05,5e-06,1.2e-05,2.2e-05,3.2e-05,2.6e-05,2.2e-05,1.1e-05,4e-06,1.5e-05,5e-06,7e-06,5e-06,3e-06,2e-06,1.1e-05,5e-06,9e-06,3.5e-05,2.3e-05,2.1e-05,1.5e-05,8.9e-05,5.7e-05,2.7e-05,1.9e-05,1.1e-05,2.4e-05,6e-06,1.3e-05,1e-05,1.2e-05,0.000115,0.000228,9.2e-05,5.9e-05,3.7e-05,7e-06,1.8e-05,6e-06,9e-06,4e-06,1.7e-05,3e-06,2e-06,3e-06,1e-05,1.1e-05
1.2e-05,1.5e-05,1.3e-05,2e-06,1e-06,5e-06,6e-06,1.4e-05,7e-06,8e-06,2e-06,4.2e-05,2e-05,1.2e-05,9e-06,5e-06,5e-06,4e-06,3e-06,2e-06,1e-06,8e-06,5e-06,3e-06,9e-06,6e-06,3e-06,1.1e-05,1.2e-05,5e-06,4.8e-05,6e-06,5e-06,6.5e-05,3.8e-05,4.1e-05,4e-06,1e-05,1.6e-05,1.4e-05,5e-06,1.6e-05,1.2e-05,2.3e-05,9e-06,2.3e-05,2.1e-05,1.5e-05,1.5e-05,3.1e-05,2.1e-05,9e-06,1.1e-05,1.7e-05,2e-05,8e-06,9e-06,2.2e-05,2.8e-05,2.1e-05,3e-06,1.5e-05,3.8e-05,3.3e-05,6e-06,1.3e-05,1.4e-05,1e-05,2.7e-05,1.9e-05,1.3e-05,1.1e-05,5e-06,1e-05,2e-06,1.7e-05,1.4e-05,6e-06,8e-06,1e-06,5e-06,4e-06,1e-05,5e-06,6e-06,6e-06,4e-06,1e-06,1e-05,4e-06,1.3e-05,1.7e-05,6e-06,1.2e-05,9e-06,5.5e-05,4e-05,1.9e-05,2.7e-05,1.4e-05,1.3e-05,3e-06,1.1e-05,1.5e-05,2.5e-05,0.000105,0.000206,0.000252,0.000142,4.9e-05,2e-05,1.8e-05,7e-06,5e-06,8e-06,1.5e-05,7e-06,7e-06,7e-06,3e-06,7e-06
9e-06,1.3e-05,4e-06,2e-06,2e-06,2e-06,3e-06,7e-06,2e-06,8e-06,2e-06,3.5e-05,7e-06,4e-06,8e-06,5e-06,3e-06,2e-06,3e-06,2e-06,2e-06,6e-06,7e-06,4e-06,2e-06,6e-06,1.3e-05,4e-06,1e-06,2e-06,1.7e-05,1.6e-05,4e-06,7.1e-05,3.4e-05,1.8e-05,5e-06,9e-06,1.4e-05,1.7e-05,5e-06,1.7e-05,6e-06,1.5e-05,7e-06,1.4e-05,1.3e-05,2.3e-05,2.6e-05,2.2e-05,1.1e-05,3e-06,7e-06,1.9e-05,2.2e-05,8e-06,6e-06,2.3e-05,2.8e-05,1.7e-05,2e-06,9e-06,2.2e-05,1.5e-05,1.1e-05,3e-06,5e-06,3e-06,1.2e-05,5e-06,6e-06,9e-06,9e-06,1.2e-05,1e-06,1.7e-05,2e-06,4e-06,6e-06,6e-06,1e-06,2e-06,1e-05,2e-06,2e-06,1e-06,3e-06,1e-06,9e-06,3e-06,1.3e-05,5e-06,4e-06,4e-06,7e-06,2.3e-05,4e-06,9e-06,1.1e-05,1e-05,1.1e-05,4e-06,2e-06,6e-06,5e-06,0.000107,0.000145,0.00016,5.7e-05,2.5e-05,5e-06,7e-06,1e-05,1e-05,9e-06,1.2e-05,4e-06,5e-06,7e-06,2e-06,5e-06
1.1e-05,8e-06,2e-06,1e-06,1e-06,1e-06,2e-06,5e-06,2e-06,6e-06,1e-06,2.5e-05,5e-06,6e-06,5e-06,1e-06,5e-06,3e-06,2e-06,1e-06,2e-06,5e-06,6e-06,3e-06,2e-06,4e-06,1.2e-05,3e-06,3e-06,2e-06,1.1e-05,9e-06,3e-06,5.8e-05,4e-06,3e-05,1.1e-05,1.3e-05,8e-06,1.8e-05,3e-06,1.2e-05,8e-06,1.7e-05,5e-06,1.1e-05,1.4e-05,2e-05,2.4e-05,1.9e-05,1.4e-05,1e-06,1e-05,1.7e-05,2.3e-05,7e-06,4e-06,2.3e-05,2.8e-05,1.4e-05,1e-06,5e-06,1.1e-05,3e-06,5e-06,1e-06,3e-06,4e-06,8e-06,1e-06,5e-06,5e-06,6e-06,9e-06,3e-06,1.4e-05,3e-06,4e-06,4e-06,6e-06,2e-06,1e-06,1.1e-05,4e-06,2e-06,1e-06,4e-06,1e-06,9e-06,2e-06,1.3e-05,3e-06,3e-06,4e-06,5e-06,2e-06,1e-05,1.3e-05,7e-06,8e-06,1.2e-05,6e-06,4e-06,4e-06,5e-06,9.9e-05,8.5e-05,2.9e-05,5e-06,1e-05,5e-06,1e-05,7e-06,8e-06,6e-06,1.1e-05,5e-06,6e-06,7e-06,2e-06,4e-06
7e-06,9e-06,1e-06,1e-06,1e-06,1e-06,1e-06,3e-06,1e-06,6e-06,2e-06,2.1e-05,3e-06,5e-06,6e-06,1e-06,3e-06,2e-06,3e-06,2e-06,1e-06,5e-06,5e-06,2e-06,2e-06,3e-06,1.3e-05,1e-06,0,1e-06,1.1e-05,3e-06,1e-06,4.7e-05,9e-06,3.6e-05,8e-06,8e-06,1.3e-05,1.6e-05,1e-06,1.1e-05,7e-06,1.6e-05,4e-06,1e-05,1.4e-05,2.1e-05,2.2e-05,1.9e-05,1.4e-05,1e-06,9e-06,1.7e-05,2.2e-05,8e-06,4e-06,2.2e-05,2.7e-05,1.6e-05,0,3e-06,1.2e-05,3e-06,4e-06,2e-06,2e-06,5e-06,9e-06,1e-06,6e-06,6e-06,6e-06,9e-06,2e-06,1.6e-05,1e-06,3e-06,3e-06,5e-06,2e-06,2e-06,1.1e-05,4e-06,2e-06,0,4e-06,1e-06,9e-06,1e-06,1.2e-05,4e-06,2e-06,0,4e-06,4e-06,3e-06,1.3e-05,9e-06,6e-06,1.2e-05,5e-06,4e-06,2e-06,5e-06,0.000101,3.5e-05,4.5e-05,2e-06,1.7e-05,8e-06,1.3e-05,9e-06,8e-06,8e-06,1e-05,4e-06,4e-06,6e-06,2e-06,3e-06
