0.033931,0.051296,0.076741,0.10917,0.12106,0.113308,0.140801,0.143064,0.095244,0.073758,0.061932,0.045449,0.031554,0.023553,0.022447,0.017537,0.012579,0.011745,0.012378,0.014803,0.014272,0.011271,0.009002,0.008359,0.009164,0.009168,0.007775,0.007847
0.040599,0.059758,0.087158,0.121964,0.134581,0.12686,0.157142,0.160638,0.110002,0.085622,0.070604,0.051158,0.035773,0.027201,0.025834,0.02057,0.014935,0.013735,0.014706,0.017468,0.016714,0.013227,0.010546,0.009994,0.010967,0.010846,0.009334,0.009447
0.051932,0.074242,0.101738,0.135961,0.147222,0.140978,0.173318,0.178415,0.129633,0.10315,0.082254,0.057585,0.040502,0.031771,0.030086,0.025252,0.019134,0.017028,0.01843,0.021525,0.02049,0.016397,0.012974,0.01249,0.013701,0.013431,0.011895,0.012111
0.062514,0.089731,0.111735,0.139834,0.144599,0.141003,0.172117,0.177318,0.14199,0.118886,0.089823,0.058352,0.040344,0.032542,0.031038,0.028529,0.023672,0.020356,0.021406,0.024857,0.024136,0.01942,0.015004,0.014146,0.015526,0.015378,0.014152,0.014489
0.073547,0.111513,0.134553,0.162002,0.154155,0.150993,0.189428,0.192548,0.165713,0.146749,0.106417,0.063124,0.04133,0.034169,0.032689,0.031623,0.028355,0.024522,0.025449,0.030092,0.030298,0.024324,0.01805,0.016022,0.01764,0.018018,0.016842,0.017034
0.084662,0.135476,0.172674,0.204125,0.178767,0.171933,0.217262,0.215605,0.188117,0.171826,0.124852,0.072781,0.047836,0.040062,0.03757,0.035886,0.033461,0.030711,0.033068,0.039698,0.040813,0.033215,0.023702,0.019516,0.021621,0.022842,0.021299,0.021373
0.098466,0.162099,0.217275,0.246037,0.204458,0.188945,0.223526,0.20948,0.177349,0.164622,0.123384,0.075569,0.054466,0.047878,0.044972,0.042903,0.041059,0.039595,0.043506,0.052844,0.055047,0.044488,0.030707,0.024542,0.026963,0.029179,0.027545,0.027379
0.12253,0.20836,0.28663,0.308483,0.253415,0.232754,0.245423,0.197383,0.147884,0.137524,0.11093,0.076828,0.060798,0.054658,0.054499,0.056297,0.054504,0.052442,0.056386,0.068632,0.073308,0.057723,0.038777,0.031507,0.033343,0.036069,0.034375,0.034321
0.161481,0.289935,0.418934,0.45546,0.373715,0.331066,0.318297,0.227617,0.15234,0.13286,0.118202,0.094584,0.073614,0.065083,0.069925,0.077547,0.074527,0.070163,0.073219,0.087984,0.096608,0.075001,0.04915,0.039894,0.039898,0.043885,0.043219,0.043047
0.201654,0.390665,0.596904,0.655086,0.534493,0.464351,0.42858,0.300998,0.202788,0.170788,0.153006,0.125564,0.09432,0.081773,0.088314,0.096899,0.091251,0.084893,0.087597,0.104641,0.116655,0.091028,0.060279,0.04777,0.044091,0.048972,0.050648,0.050353
0.218574,0.462145,0.740361,0.811982,0.655576,0.557963,0.495409,0.351851,0.253206,0.215692,0.18829,0.153278,0.112572,0.096536,0.099096,0.099725,0.089896,0.083416,0.086204,0.102035,0.114555,0.09262,0.065222,0.051959,0.045617,0.049532,0.052537,0.051414
0.193264,0.447433,0.747503,0.812675,0.649384,0.556673,0.493107,0.363923,0.283509,0.245572,0.20382,0.16308,0.117916,0.100667,0.095959,0.083214,0.068999,0.065488,0.068304,0.077511,0.086464,0.075316,0.059093,0.049932,0.046472,0.048264,0.049262,0.047727
0.140307,0.340107,0.578311,0.62242,0.508052,0.488532,0.478602,0.366808,0.289921,0.252875,0.197416,0.152426,0.110452,0.095565,0.08643,0.066253,0.051932,0.051058,0.05235,0.055643,0.061079,0.057916,0.048776,0.043753,0.046186,0.046549,0.044069,0.044988
0.091286,0.200875,0.33787,0.390637,0.374926,0.448318,0.493093,0.381886,0.310537,0.287973,0.2091,0.140117,0.099187,0.08326,0.076825,0.066746,0.055161,0.048031,0.044172,0.04655,0.053836,0.053104,0.044516,0.040018,0.043071,0.043959,0.041348,0.045183
0.092707,0.160414,0.249834,0.368493,0.431825,0.534165,0.571282,0.449759,0.433014,0.444109,0.309705,0.17855,0.121414,0.086331,0.08279,0.093681,0.077871,0.054895,0.044567,0.044689,0.051212,0.054373,0.049077,0.042006,0.041378,0.046441,0.049364,0.052066
0.137096,0.232804,0.369148,0.577039,0.660723,0.791431,0.830572,0.660895,0.689417,0.729555,0.508136,0.288188,0.190385,0.119355,0.116217,0.148597,0.12153,0.074143,0.055208,0.051802,0.054729,0.063735,0.06461,0.052775,0.047822,0.060853,0.072433,0.071916
0.193476,0.332269,0.537381,0.832748,0.916997,1.092537,1.159606,0.923317,0.974055,1.045104,0.742127,0.436783,0.29126,0.176044,0.171015,0.218311,0.177526,0.106552,0.077293,0.070003,0.069347,0.08196,0.087957,0.071728,0.063545,0.083991,0.102724,0.099748
0.240229,0.417817,0.69086,1.043397,1.111743,1.297788,1.36896,1.092435,1.142094,1.225978,0.908237,0.583374,0.397398,0.238697,0.231708,0.275935,0.227062,0.149873,0.107336,0.090821,0.085875,0.096454,0.107498,0.090956,0.079224,0.102158,0.125684,0.123437
0.271476,0.479901,0.864574,1.270892,1.288036,1.391382,1.411926,1.161005,1.166141,1.193619,0.947518,0.692328,0.482631,0.304152,0.29059,0.297265,0.252126,0.199136,0.145348,0.113132,0.103349,0.105775,0.11921,0.106511,0.088702,0.10652,0.132574,0.13668
0.335581,0.614762,1.17519,1.685283,1.636391,1.626592,1.547345,1.290845,1.249749,1.167571,0.957575,0.746005,0.525131,0.38102,0.355761,0.305168,0.264441,0.242167,0.192876,0.145352,0.124005,0.123049,0.137806,0.121008,0.093137,0.103167,0.13023,0.144086
0.468608,0.865354,1.556629,2.098078,2.108868,2.224449,2.028465,1.616712,1.54747,1.365287,1.026994,0.733569,0.547344,0.485391,0.427088,0.316702,0.27471,0.269963,0.244305,0.194898,0.156398,0.15675,0.167702,0.133877,0.098616,0.109363,0.13707,0.150061
0.61862,1.125764,1.816321,2.280791,2.483803,2.923887,2.655623,1.968602,1.815823,1.625098,1.148052,0.743246,0.63525,0.618682,0.476279,0.315832,0.28614,0.28975,0.287551,0.243187,0.187181,0.183312,0.18225,0.137496,0.105647,0.122061,0.152799,0.15291
0.708474,1.265836,1.829543,2.120701,2.548212,3.301436,2.974501,2.039912,1.803416,1.709942,1.24214,0.778115,0.699976,0.70138,0.491922,0.306827,0.296753,0.297293,0.300555,0.265922,0.206096,0.189612,0.17287,0.138829,0.116795,0.131144,0.162521,0.146204
0.645269,1.148959,1.609798,1.736404,2.15152,2.933966,2.625178,1.686327,1.447567,1.47977,1.133318,0.711623,0.630162,0.632698,0.425525,0.263274,0.269592,0.270294,0.268036,0.242281,0.191129,0.167003,0.155443,0.145927,0.1271,0.129938,0.154139,0.133355
0.442839,0.789724,1.129003,1.190473,1.425843,1.91248,1.726575,1.083908,0.89215,0.960979,0.788388,0.524202,0.439627,0.41917,0.284551,0.197881,0.203648,0.195362,0.187698,0.178477,0.146898,0.128229,0.142789,0.149751,0.123002,0.114451,0.126225,0.114416
0.238797,0.423786,0.593776,0.595725,0.676269,0.878379,0.857204,0.579903,0.438137,0.462463,0.407101,0.308797,0.25797,0.219907,0.156976,0.144742,0.153673,0.139667,0.126748,0.12176,0.108658,0.113225,0.145068,0.144573,0.121056,0.122602,0.13361,0.127987
0.129311,0.206449,0.257567,0.240784,0.267265,0.318261,0.321736,0.265161,0.218248,0.216888,0.20972,0.186717,0.191793,0.181932,0.129965,0.137323,0.158928,0.13951,0.125112,0.111756,0.096285,0.128643,0.176898,0.153389,0.131488,0.158894,0.174538,0.167836
0.103315,0.145096,0.166718,0.159786,0.157774,0.133325,0.116483,0.138556,0.15762,0.169052,0.174323,0.164596,0.188274,0.202955,0.14811,0.139194,0.161824,0.146863,0.139497,0.129717,0.116105,0.148303,0.20033,0.172523,0.147642,0.180947,0.194556,0.185957
0.101416,0.124123,0.134927,0.14043,0.144833,0.108862,0.093946,0.114202,0.133948,0.155935,0.145393,0.13648,0.170074,0.200436,0.159756,0.128169,0.139618,0.138078,0.145283,0.148836,0.142793,0.150585,0.185093,0.167808,0.141912,0.163269,0.168183,0.158302
0.101566,0.104599,0.101736,0.111742,0.124045,0.105732,0.102078,0.106064,0.112879,0.134346,0.11205,0.10472,0.132323,0.16561,0.151615,0.107816,0.111031,0.124171,0.137354,0.149547,0.149935,0.130933,0.133614,0.130774,0.113129,0.118833,0.11379,0.10037
0.085972,0.091111,0.098448,0.099888,0.09372,0.090013,0.0975,0.090793,0.087699,0.100243,0.086548,0.08608,0.096617,0.119639,0.125721,0.09359,0.103294,0.119755,0.114104,0.118822,0.128457,0.111998,0.095656,0.102333,0.095091,0.090229,0.085502,0.064202
0.066591,0.085589,0.107312,0.102046,0.076198,0.065444,0.073812,0.07203,0.068024,0.064844,0.065417,0.07195,0.068847,0.076175,0.089574,0.076536,0.09484,0.118299,0.0928,0.074815,0.089615,0.098405,0.097856,0.105965,0.087488,0.071358,0.075732,0.061359
0.057027,0.076313,0.096228,0.092947,0.066675,0.043788,0.046953,0.056272,0.062045,0.058822,0.062833,0.065598,0.056887,0.053156,0.05987,0.059235,0.079019,0.104148,0.078846,0.050459,0.059267,0.077688,0.090033,0.099481,0.078509,0.05967,0.067609,0.058162
0.051591,0.055527,0.065683,0.06816,0.056428,0.033786,0.029171,0.040215,0.055729,0.061405,0.063872,0.060302,0.050189,0.046403,0.043787,0.044792,0.063725,0.077888,0.057139,0.036524,0.046794,0.056962,0.065331,0.073866,0.058313,0.047108,0.054588,0.048648
0.052776,0.03613,0.036571,0.049535,0.052739,0.033052,0.022225,0.032246,0.047808,0.056749,0.067099,0.065938,0.056462,0.050705,0.040205,0.036965,0.046893,0.052515,0.040532,0.028192,0.039431,0.045184,0.049732,0.050914,0.041,0.042226,0.048463,0.046662
0.059347,0.031447,0.024649,0.040789,0.049419,0.03382,0.022496,0.031953,0.041814,0.051346,0.067048,0.068586,0.060339,0.055496,0.045216,0.035136,0.030746,0.035359,0.03583,0.028318,0.041814,0.050143,0.053826,0.048143,0.034248,0.043231,0.053119,0.055269
0.060216,0.03519,0.022278,0.030924,0.041494,0.034661,0.026082,0.036325,0.042455,0.047611,0.059064,0.059574,0.053291,0.050956,0.046311,0.03424,0.022084,0.027362,0.035165,0.030934,0.046439,0.056768,0.058678,0.051256,0.034422,0.043913,0.05242,0.058854
0.053472,0.044245,0.029732,0.029939,0.04085,0.037475,0.032089,0.044778,0.047036,0.044625,0.055076,0.048031,0.040132,0.042564,0.041201,0.03036,0.019411,0.024581,0.035409,0.034091,0.046861,0.054996,0.053367,0.054736,0.042334,0.043017,0.043655,0.052233
0.045181,0.053668,0.043166,0.039539,0.048388,0.039734,0.041153,0.05719,0.049361,0.046568,0.06545,0.049436,0.035829,0.044072,0.037258,0.025883,0.022689,0.026167,0.033225,0.038426,0.04711,0.048335,0.043503,0.053935,0.055428,0.046904,0.036132,0.047073
0.040521,0.059091,0.055858,0.050896,0.055449,0.044204,0.0514,0.067433,0.049806,0.049547,0.073513,0.055045,0.043363,0.054503,0.04259,0.026983,0.02812,0.032626,0.0339,0.040508,0.045033,0.042254,0.039761,0.051616,0.065797,0.050911,0.039548,0.05537
