-0.000138,-0.000679,0.000183,-0.000442,-0.000794,-0.001702,-0.000609,-0.000412,0.000644,0.000555,-2.4e-05,-0.000489,-0.000284,0.00043,0.000501,0.001924,-0.000135,-0.000195,-0.000536,-0.000159,-0.000825,-0.001484,-0.001218,-0.000923,0.000102,0.000428,-0.000202,-0.000193,9.9e-05,7.1e-05,-0.000242,0.000948,-0.000577,-0.000246,-0.000297,-0.000532,-0.000399,-0.000208,-0.000153,-0.000456,0.000237,-3.9e-05,-0.001088,-0.000444,-0.000381,0.000394,0.000107,0.000473,-5.9e-05,0.000315,-0.000389,0.000263,-0.000539,-0.001346,-0.00108,-0.001581,-0.000624,-0.000632,0.000139,0.000232,-0.001074,-0.000819,-0.000841,-0.000456,-0.001174,-0.000541,0.000276,-0.000735,-0.000646,-1.6e-05,-3e-06,0.000413,0.000446,-7e-06,-0.00032,-0.001422,-8.6e-05,-0.000787,-0.001062,-0.000595,0.000232,0.000702,0.000491,0.000349,0.000131,0.000109,0.00012,0.000266,0.000443,-0.000433,0.001123,0.000666,-0.000637,-0.001089,4.6e-05,-0.000346,0.000193,0.000694,0.000772,0.00076,5e-04,-0.001545,-0.001318,-0.000428,2.2e-05,0.00013,-0.000587,-0.000356,0.00036,-5.5e-05,-0.000193,-8.2e-05,-0.000617,-0.000167,-0.000659,-0.000411,-0.000195,-0.000336,0.000557,0.000329,0.000345
0.000339,6e-05,-9.7e-05,-0.00058,0.000316,0.001034,0.000288,0.000756,0.000991,0.001072,0.000433,-0.000835,0.000449,0.000757,-0.000738,-0.000275,0.000452,-0.000255,-8.3e-05,0.00027,0.00128,0.001308,0.000617,0.000607,0.000276,0.000595,0.001283,0.000383,0.001087,0.000124,0.000271,-0.000192,1.5e-05,-5e-05,-9e-05,0.000543,-0.000242,0.000895,0.000546,-2.3e-05,-0.000187,-0.000471,0.000176,0.000375,0.000653,0.000856,0.000633,0.000411,0.000296,-0.000346,0.000123,-0.001471,-0.000332,-0.00048,-0.00019,0.000554,-0.000597,0.000396,0.000346,-0.000456,0.000839,4.1e-05,-0.000123,0.000117,0.000635,0.000351,0.000134,-0.001014,-0.000262,-0.001145,-0.00051,-0.000454,-0.000647,-0.000145,0.000173,0.000139,0.000117,0.00038,2e-05,0.000491,0.000139,0.000261,-0.000972,-3.6e-05,0.000508,0.000494,-0.000724,-0.000125,-0.000156,-0.000149,-0.000635,-0.000979,-5.2e-05,0.000973,8e-06,-3.1e-05,-0.000142,0.000137,0.00076,0.001023,0.000765,0.00104,0.000408,-2.7e-05,-0.000258,0.000101,-0.000278,-0.000561,-0.000691,-9.7e-05,-5.4e-05,0.000277,0.000443,-0.000599,0.000283,-0.000276,-0.001065,-0.000105,-1e-04,-0.00025,-0.000374
-0.000138,-0.000155,-4e-04,-5.7e-05,-0.000248,-0.00077,-0.000222,-0.000103,0.000423,-0.000228,0.001035,0.000419,-0.000411,-0.000223,0.000222,-0.000698,-0.000497,0.000462,-0.000927,-0.000413,-0.001221,-0.000262,-0.000968,-9e-05,3e-05,0.000221,0.000463,-0.00014,-0.000487,0.000556,0.00057,-2.5e-05,-0.000769,-0.000184,-0.000418,-0.001075,-0.000753,-0.000559,-0.000126,-2.5e-05,0.000461,-0.000892,-9.3e-05,-0.000391,0.000356,0.000487,-4e-05,-9.8e-05,-0.000597,-0.000526,-0.000803,-0.000307,-0.001054,0.000407,0.000174,-0.000532,-0.000704,-0.000917,-0.00075,-0.000512,-0.00109,0.000577,0.000439,-0.000195,-0.000694,-0.001146,-0.000445,0.00071,-0.0011,-1.5e-05,-0.00057,-0.000529,-0.00111,-0.000326,-0.00043,-0.000613,-0.000533,-0.001765,-0.000663,-0.00019,-0.000146,-0.001128,5.9e-05,0.000519,-0.000835,-0.000197,-0.000251,-0.000362,-0.00015,-0.000385,-0.000982,-0.000235,-0.000871,-0.001266,-0.000739,-0.000177,-0.000286,-9.3e-05,-0.000218,0.000438,-0.001177,-0.000813,-0.000642,-0.000361,-0.000276,-0.000109,-0.000719,6.4e-05,-9.7e-05,-0.00031,-8e-06,0.000115,0.000541,0.000438,-0.000522,-0.000351,-0.000294,-0.000428,-0.000579,-0.000176,-0.000583
-0.00066,0.000142,3e-05,0.000278,-0.000464,0.000509,-0.000437,-0.000333,5.1e-05,-9e-05,-0.000647,-0.00065,-0.000249,-5.3e-05,-0.000173,-0.000718,-0.000367,-0.000986,0.000146,0.000456,0.000104,-0.000156,0.000713,0.000287,-0.000467,-0.000307,-0.000237,-0.000576,-1e-06,-0.000634,-0.000722,-0.00071,0.000949,-0.000293,0.00011,0.000189,0.000634,-0.000743,-0.00073,-0.000442,-4.9e-05,0.000107,0.000377,-0.000481,-1.3e-05,-0.000177,-4.4e-05,-0.000679,-0.000224,0.000134,0.00057,0.000857,0.000445,-7.2e-05,0.000279,0.000384,0.000569,0.000616,0.000479,-0.001003,-0.000227,-0.000488,-8.5e-05,0,0.000556,0.000526,9.8e-05,-0.000413,0.000974,0.000312,0.001041,0.000172,0.000123,0.000369,-0.000582,0.000812,0.000178,9.4e-05,0.000769,0.000538,-0.000564,-0.000626,0.000294,0.000352,-9.4e-05,3.3e-05,-0.000406,-0.000625,-0.000173,0.000115,0.000275,-0.000914,0.000662,0.000881,0.00028,-0.000645,-0.000403,0.00045,-7.4e-05,8.9e-05,-0.000275,0.000216,0.000583,-0.000119,-0.000491,-0.000542,-0.000318,-0.000159,0.000317,0.000453,-0.000335,-0.000288,-0.000668,-1.7e-05,-0.000129,0.000637,6.8e-05,-0.000562,-0.000134,-6e-06,-0.000673
5e-05,0.000283,-0.000656,-0.000304,-0.000533,-0.001027,7e-06,-0.000149,8.1e-05,0.000107,-8.5e-05,0.000111,0.000451,-7.9e-05,-0.000136,-0.000789,-0.000416,0.000193,0.000431,0.000133,-0.000484,-0.000828,-0.00038,-0.000421,-0.000451,-0.00036,-0.000312,-4.4e-05,-0.000286,-0.000227,-0.000101,-0.000107,-0.000344,-0.000247,-0.000342,-0.000322,0.000221,-0.000387,-0.00067,0.000143,5.4e-05,1e-06,-0.000718,-0.00086,-0.000211,-0.000625,-0.000377,-7.6e-05,-0.00039,-0.000385,-0.000323,3.9e-05,0.000873,2.5e-05,-0.000945,-0.000509,-0.000232,0.000107,-0.000706,-0.00025,0.000108,-0.000223,-0.00027,-0.000296,-0.000618,-0.000579,-0.000655,-0.000563,-0.000522,-0.000106,-0.001223,-6.4e-05,0.000579,-0.000124,-4e-05,-0.00053,0.000397,0.000217,-0.000954,-0.000503,-0.000384,-0.000639,-0.000607,-0.000238,-0.000323,-0.000366,-0.000121,0.000561,9e-06,0.000492,-0.000289,-0.000656,-0.000776,-0.000821,-0.000508,-0.000125,-0.000362,-1e-06,-0.000355,-1.2e-05,-0.000513,-0.000365,-0.000414,-0.000344,-0.000104,8e-06,8.5e-05,0.000181,0.000292,0.000228,0.00025,-0.00029,-0.000371,1.6e-05,-0.000131,-0.000134,0.000152,0.000201,-0.000568,-0.000614,4e-06
-0.000437,-0.000666,8.9e-05,2e-06,0.000123,0.000709,0.000284,-0.000334,-0.000713,-0.000983,-0.000509,-0.000888,-0.000731,-0.000661,-0.000315,4.9e-05,-0.000911,-0.000369,-0.000576,-0.000444,-0.000197,0.000254,-5.7e-05,0.000734,0.000406,-0.000172,-0.000156,-0.000397,0.000162,-0.000206,0.000189,-0.000274,-0.000511,9.3e-05,-7.8e-05,0.000443,0,-0.000235,4.1e-05,-5e-05,-0.000311,-0.000279,0.000809,0.000595,-0.000283,-0.00012,-0.000435,-0.000609,-0.000593,5.3e-05,-0.000426,-0.000336,-1.3e-05,0.00037,0.000345,0.000567,0.00081,5.4e-05,-4.7e-05,0.000145,-0.000123,0.000333,-0.000374,0.00015,-0.000272,-5.3e-05,-3.3e-05,0.000149,0.000148,-3e-06,-8.8e-05,0.00084,0.000377,0.000135,0.00021,-7.9e-05,-0.000693,0.000659,0.000808,0.000339,0.000488,8.5e-05,-0.000479,-0.000475,-0.000121,-4e-06,8.7e-05,-0.000118,-0.000336,-0.000178,0.000131,0.000331,9.7e-05,0.001005,0.000762,0.000447,-0.000207,-0.000321,0.000101,-0.000928,-0.000344,-0.00029,0.000165,-7.3e-05,-0.000258,-0.000584,-4.8e-05,-0.000114,-0.000295,-0.000476,-0.00041,0.000205,-5.9e-05,0.000142,-2.1e-05,-8.5e-05,0.000338,0.000382,3.5e-05,-0.000521,0.000355
-9.2e-05,-0.000263,-0.000327,-0.000167,-0.000632,-0.000425,-0.000265,-0.000362,-4.2e-05,-0.00035,-0.000346,0.000464,-0.000183,-0.000648,-0.000885,5.8e-05,-0.000527,-0.00024,-0.000247,-0.000766,0.000141,-0.000721,-0.000268,-0.000207,-8.9e-05,-0.000418,-0.000527,-9.2e-05,-0.000241,-0.000262,-0.000642,-0.000566,0.000108,-0.000208,0.000148,-0.000148,-0.000224,0.000341,0.000178,-0.000261,-4.1e-05,0.000124,-9e-05,-0.000151,2e-06,-0.000233,-0.000226,7.9e-05,0.000162,-0.00023,-0.000373,-0.000177,-0.000595,-0.000465,-0.000401,-0.000159,-0.000536,-0.000449,-0.000629,0.000347,0.000201,-0.000102,0.000394,-6.3e-05,-0.000259,7.4e-05,0.000586,0.000237,-0.000174,0.000786,0.00047,-0.000407,-0.000104,-8.2e-05,-0.000225,-0.000151,4e-06,0.000138,-0.000345,-0.000549,-0.000345,0.000107,-0.000444,-0.000353,-0.000137,-0.000432,-0.000228,-2e-06,-0.000238,-0.000415,-0.000128,0.000509,0.00057,-0.000388,-0.000606,-0.000412,-5e-05,-0.000176,-0.000503,-0.000262,-0.000343,-0.000373,-0.000277,0.000567,-9.8e-05,5.7e-05,0.000349,-0.000607,-0.000551,-0.000265,0.00029,7e-05,0.000142,6e-06,-7e-05,-0.000136,-0.000242,0.000201,-0.000597,-0.000537,-0.000442
0.000153,0.000169,0.000217,-0.000853,-4.5e-05,-7.9e-05,-0.000226,0.000158,-0.000377,-8.8e-05,-0.000719,-0.000407,-7e-05,0.000336,9.9e-05,-0.000834,0.000104,-0.000231,-9.6e-05,0.000577,-6e-05,0.000194,-0.000104,9.4e-05,-0.000154,3.8e-05,-0.000287,-0.000127,-0.000427,-2e-06,-0.000263,0.000357,-0.000184,-0.00049,3.4e-05,-0.000346,-0.000432,-0.000255,-0.000224,-0.000163,0.00021,0.000275,-4.2e-05,-0.000365,-0.000618,-0.000506,-0.000447,-0.000349,-0.000132,-0.000422,0.000364,-6e-06,0.000251,0.000478,-4.8e-05,-0.000148,-0.000339,1e-04,0.000682,-0.00025,-6.2e-05,0.000136,-0.000258,-0.000436,-0.000106,-0.000355,8.5e-05,6.6e-05,8.6e-05,-0.000141,-1e-05,-0.000143,-0.000103,0.000123,0.000509,0.000578,0.000372,-0.000192,-1e-04,0.000364,-0.000142,1.7e-05,9.2e-05,-0.000108,-0.000146,-0.000205,0.000239,-1.7e-05,0.000301,1.2e-05,0.000197,-0.000439,0.000207,-0.000269,3.3e-05,0.000515,-8.1e-05,-0.000393,-0.000384,-0.000308,-1.2e-05,0.000461,-0.000125,-0.000672,-8.1e-05,9.5e-05,0.00013,0.000197,0.000227,-0.000231,0.000122,-5.4e-05,-0.000147,-0.000411,-0.000178,-0.000234,-0.000205,-0.000656,-0.000195,-3.7e-05,9.4e-05
0.000133,-2.4e-05,-0.000176,0.000451,0.00034,3e-04,-8.2e-05,0.000373,3.4e-05,-1.4e-05,0.000281,0.000165,-2.3e-05,0.000466,-2e-06,-0.000182,8.6e-05,6.1e-05,-0.000184,-0.000257,-0.000191,-3.4e-05,-7.7e-05,-0.000294,-0.00012,0.00029,0.000157,1e-05,-0.000261,-6.9e-05,-7.5e-05,-0.000238,6.9e-05,0.000227,6.1e-05,-0.000131,1.6e-05,-0.000127,0.000307,-0.000127,0.000126,-0.000174,-0.000494,-0.000171,0.00022,6.2e-05,-0.000356,-0.000159,5.1e-05,5.7e-05,-4.8e-05,2.4e-05,-5.2e-05,-0.000188,0.000455,-0.000208,-0.000125,-7.1e-05,-0.000259,9.9e-05,-5.6e-05,-0.000429,-8.1e-05,-3.3e-05,8.6e-05,-0.000193,0.000104,0.000152,-0.000347,-0.000529,-0.000161,0.00018,0.000151,-3e-05,1.1e-05,-0.000317,-0.000332,0.000318,-0.000224,-7.8e-05,0.000347,0.000316,0.000152,-4.4e-05,8.3e-05,0.000184,1.8e-05,-0.000405,0.000147,0.000204,-0.000204,-3.3e-05,0.000225,0.00018,0.00017,-0.000285,0.000378,-3.8e-05,0.000306,2.8e-05,0.000104,5.4e-05,-4.9e-05,0.000339,9.5e-05,0.000437,0.00012,0.000184,-0.000106,0.000286,0.00021,0.00013,0.000137,0.00031,0.000345,0.000271,-0.000137,0.000271,0.000157,0.000446,0.000363
-5e-06,0.000291,0.000148,0.000116,-0.000201,-0.000206,-4e-05,-0.000167,-0.000153,3.3e-05,-0.000166,-9.6e-05,-2e-06,-0.000223,0.00018,0.00012,0.000177,0.000341,0.000218,0.000135,4.6e-05,0.000214,-2.4e-05,0.000124,8.8e-05,-0.000135,-3.4e-05,0.000181,0.000274,8.9e-05,0.000129,-1.7e-05,5.8e-05,2.5e-05,-7.9e-05,6.6e-05,-0.000174,-0.000259,-0.000252,0.000123,2e-05,-2.5e-05,-1.4e-05,0.000358,5.3e-05,-0.000137,0.000272,-0.000243,1e-05,0.000215,0.000108,-0.000232,-0.000185,-7.5e-05,-0.000238,5.3e-05,7e-05,0.00029,-0.000175,0.000167,-1.9e-05,0.000249,0.000229,7.7e-05,-3.8e-05,8.1e-05,-1.8e-05,-0.00015,8.3e-05,-0.00013,-3.5e-05,-0.000156,-1.6e-05,-0.000412,3.7e-05,-5.3e-05,-6.5e-05,9.8e-05,-0.000137,-0.000265,-0.000246,-0.000243,0.000341,1.1e-05,0.000293,0.000227,0.00013,-8e-06,0.000147,-0.000139,-0.000582,1.2e-05,5e-06,-0.000107,1.1e-05,0.000104,5.6e-05,1.8e-05,7e-05,-0.000165,3.4e-05,0.000197,8.6e-05,-0.000214,0.000241,-0.000204,-0.000261,0.000124,-7e-06,-0.00015,0.000129,-0.000166,-0.000112,-0.000323,-1.5e-05,-0.00014,0.000211,-4.2e-05,0.000296,-2.9e-05,5.7e-05
-3e-05,7.5e-05,0.000126,9.9e-05,-0.000332,-0.000163,0.000144,3.2e-05,8.4e-05,1.9e-05,0.000215,5.7e-05,0.000319,-3e-05,-0.000201,0.000209,0.000285,3.4e-05,0.000193,2.5e-05,0.000175,1.6e-05,-0.000104,7.4e-05,-9.8e-05,-6.9e-05,0.000232,-2.9e-05,-1.2e-05,1e-05,0.000298,0.000101,-0.000124,-3e-05,-8.2e-05,3.9e-05,0.000301,0.000123,5.3e-05,0.000123,7e-06,-2.7e-05,0.000188,-6.9e-05,0.000126,-4.8e-05,-2.4e-05,0.000117,-2e-05,0.000264,7.9e-05,3.2e-05,2e-05,7.7e-05,-0.000194,-0.000201,-0.00011,-0.000106,-4.5e-05,8e-05,0.000119,-0.000123,-0.000239,5.5e-05,0.000154,0.000191,3.3e-05,-5.2e-05,0.000116,0.000114,-0.00013,-0.000352,0.00012,8e-05,-3.6e-05,-0.000366,7.6e-05,-7.5e-05,0.000163,0.000153,0.000222,5.6e-05,2.6e-05,-3e-05,-0.000153,-6.7e-05,0.00023,4.2e-05,-0.000194,5.7e-05,0.000316,0.000115,-0.000506,-4e-05,-8e-06,-0.000102,-5.3e-05,6.9e-05,-8.8e-05,0.000336,2e-06,-0.000159,-7.6e-05,0.000153,-0.000116,0.000121,-0.000199,-9.5e-05,-2.1e-05,-1e-06,4.3e-05,2.9e-05,-1.3e-05,-0.00019,0.000165,-7.1e-05,-0.000215,1.2e-05,-1e-05,-3.5e-05,-1.1e-05
0.000144,2.6e-05,-0.000132,-3.7e-05,0.000195,9.6e-05,6.5e-05,-6.2e-05,0.000224,8.6e-05,0.000138,7.7e-05,3.4e-05,0.000131,0.00013,0.000151,-0.00031,-0.000167,-8.9e-05,-0.000138,0.000138,-3.3e-05,0.000237,-0.000132,4.5e-05,2.4e-05,-3.3e-05,6.7e-05,0.00016,0.000199,-2.5e-05,-2.2e-05,0.000154,0.000125,-3.1e-05,-3e-05,-9.1e-05,7.7e-05,2.6e-05,0.000286,-1.8e-05,-4.7e-05,-4.1e-05,0.000197,-0.000179,0.000225,0.000191,0.000107,0.000151,8.4e-05,-6.3e-05,0.00012,-7.6e-05,-1.7e-05,0.000134,0.000268,0.000157,-9.1e-05,0.000135,-0.000265,-0.000175,0.000184,0.000218,-4.4e-05,-0.000136,3.9e-05,2.2e-05,-0.000161,-1.2e-05,-0.000153,-0.000175,0.000159,-9.5e-05,2.9e-05,1.8e-05,4.7e-05,6.3e-05,-0.000115,5.4e-05,7.4e-05,-0.000162,9.6e-05,-7.5e-05,8.6e-05,2.2e-05,6.1e-05,-1.8e-05,-3.2e-05,-0.000129,9.8e-05,0.00023,-7e-05,-0.000135,0.000141,1.1e-05,0.000221,-0.000129,7.5e-05,6.1e-05,-5.8e-05,6.6e-05,-1.5e-05,-1.3e-05,-9e-06,8.4e-05,5.1e-05,0.00019,9.6e-05,3e-06,4.7e-05,-0.000171,-0.000178,2.6e-05,0.000116,0,0.000234,3.8e-05,-4e-06,-0.000105,-3e-06,-0.000144
0.000191,5.6e-05,9.5e-05,-3.9e-05,0.000139,8e-05,2e-05,5.1e-05,3.4e-05,2.6e-05,7.1e-05,6.7e-05,6.6e-05,6e-06,1.9e-05,-5.4e-05,-2e-05,3.6e-05,0.000113,0.000136,-0.000231,2.3e-05,1e-06,-6.2e-05,-5.7e-05,-1e-06,1e-06,2.4e-05,9.6e-05,-8.5e-05,8.2e-05,0.000151,-9.3e-05,1.3e-05,0.000149,0.000163,-5.7e-05,3.9e-05,9e-06,-3e-06,3.9e-05,7e-05,-1.8e-05,-4.2e-05,8.1e-05,7e-05,-4.3e-05,7.8e-05,-2.5e-05,3.4e-05,8.1e-05,8.8e-05,4.7e-05,-9e-05,-7.2e-05,-0.000205,-3.2e-05,-9.9e-05,6.8e-05,0.000106,1.7e-05,8.2e-05,-0.00012,0.000124,-9.1e-05,-4.9e-05,1.6e-05,9.2e-05,0.000106,-3.5e-05,3.8e-05,0.000159,5.1e-05,4.6e-05,0.000147,5.8e-05,-5.6e-05,-8.3e-05,0.000214,-3.5e-05,0.000122,-2.4e-05,-6.5e-05,0.000175,0.000149,2e-06,-6.9e-05,5.5e-05,0.000217,3.2e-05,-8.2e-05,-5.1e-05,1.4e-05,0.000203,-5.8e-05,-0.000224,-0.000112,0.000112,9e-05,0.000326,0.000153,8e-06,6.8e-05,4.6e-05,-0.000127,-1.9e-05,-0.000122,-0.000163,3.8e-05,-1.9e-05,-8.3e-05,6.4e-05,-5.2e-05,-6.4e-05,1.2e-05,-0.000157,-0.000124,-3.6e-05,-5.2e-05,-3e-05,-2.6e-05
-7.1e-05,-0.000158,-0.000117,3.6e-05,0.000104,-0.000164,1.1e-05,4.1e-05,1e-06,-3e-05,4.1e-05,-1e-04,9.2e-05,6.1e-05,4.5e-05,8.8e-05,0.000272,-1.5e-05,-7e-06,-5.9e-05,4.1e-05,-4e-05,0.000116,-6e-05,5.6e-05,2.4e-05,2.2e-05,-4e-06,8e-06,7.6e-05,-9.6e-05,0.000117,2e-06,9e-06,-2.8e-05,0.000103,3.4e-05,-5.4e-05,2.5e-05,3.4e-05,3.8e-05,-1.9e-05,5.4e-05,-1.4e-05,2.5e-05,-7.4e-05,-4e-05,0.000179,6.6e-05,-7e-06,0.000122,-1.8e-05,-1.9e-05,-2.6e-05,0.000134,0.000108,4.7e-05,-1.6e-05,-5.3e-05,3e-06,3.1e-05,5e-05,3.9e-05,3e-06,0.000191,5e-06,1.6e-05,-5.4e-05,-7.9e-05,-1.8e-05,0.000122,-0.00016,-1.7e-05,-2.8e-05,6e-05,2.6e-05,-3.7e-05,0.000156,-2.6e-05,-0.000183,1e-06,-3.9e-05,-0.000121,4.3e-05,-6e-05,-1.6e-05,-2.2e-05,0.000128,1.1e-05,-4e-06,5.1e-05,9.2e-05,9.5e-05,0.000123,-2.8e-05,0.000105,0.000157,2e-06,2e-05,-0.000175,-0.000118,-3.4e-05,0.000137,-1.3e-05,8.8e-05,-2e-05,-3.2e-05,-0.000102,0.000139,1.4e-05,3.4e-05,-4e-06,2.7e-05,0.000129,-5.2e-05,0.000129,0.000106,5.1e-05,-3.8e-05,7e-05,-2e-05
8.4e-05,-1.7e-05,1.9e-05,-9.6e-05,-3.9e-05,4.4e-05,3.3e-05,9.3e-05,-8.9e-05,7.2e-05,-0.000144,-2.3e-05,-9.6e-05,4.4e-05,-9.2e-05,1.9e-05,3e-05,-6e-06,7e-06,0.000139,4.9e-05,5e-05,-0.000128,1.7e-05,-3.3e-05,2.8e-05,-2e-06,-1.1e-05,2.7e-05,-1.1e-05,-2.4e-05,-4.9e-05,2.2e-05,-4.9e-05,-4.5e-05,-8.2e-05,1.5e-05,-6e-06,-2.7e-05,-4.8e-05,-2.7e-05,-3.1e-05,7.2e-05,-2e-05,-5.6e-05,3.3e-05,-2.1e-05,8.4e-05,3e-05,-5e-05,-2e-06,5.4e-05,6.8e-05,2.2e-05,-0.000112,-3e-06,-6.7e-05,-7e-06,-4.2e-05,0.000124,9e-06,-3.2e-05,-6e-06,-7.5e-05,-5.3e-05,6.1e-05,-0.000131,6.3e-05,1.5e-05,-3e-05,5.3e-05,1e-05,-7.2e-05,3.7e-05,1.1e-05,4.9e-05,-1e-04,-0.000227,9e-06,-5.3e-05,-7e-06,1e-05,7.1e-05,2.9e-05,3.6e-05,2e-06,-1.5e-05,-3.1e-05,8.8e-05,-6.4e-05,-8e-06,5e-05,-8.9e-05,-7.4e-05,2e-06,-3.6e-05,4.6e-05,-2.7e-05,-7e-05,-0.000116,-8e-06,8e-06,9.3e-05,8.2e-05,1.2e-05,7.4e-05,-7e-06,1.3e-05,-7.6e-05,3.5e-05,-2.6e-05,-4.4e-05,-1e-05,7.9e-05,-6.1e-05,-2.2e-05,1e-05,-3.3e-05,9.3e-05,5.8e-05,2.4e-05
-2.8e-05,4.8e-05,-9e-06,-1.3e-05,-1.7e-05,8.4e-05,-7e-06,-5.3e-05,-4.9e-05,-2.7e-05,2.3e-05,8e-06,4.3e-05,-4.9e-05,-2.6e-05,5e-06,2.7e-05,3.8e-05,-3.6e-05,-6.6e-05,1e-05,3.1e-05,5e-06,-4e-05,1e-05,4e-05,-3.7e-05,3.6e-05,-5.8e-05,3.7e-05,-1.6e-05,-2.7e-05,-2e-05,-2.3e-05,-4e-06,-1e-06,-2.9e-05,3.5e-05,1e-06,-3.5e-05,-8.6e-05,1e-06,-1.4e-05,-7.6e-05,8.6e-05,2.3e-05,8.2e-05,-0.000161,1e-06,-3e-05,-7.2e-05,-8.2e-05,4e-06,0,5e-05,2.1e-05,6.3e-05,3.6e-05,-5.3e-05,-0.000152,-3.7e-05,-4.8e-05,-2.6e-05,-3.9e-05,5e-05,-8.2e-05,-4.7e-05,-8.9e-05,-5.8e-05,0.000124,-6.9e-05,6.5e-05,-3.3e-05,-9.5e-05,-5.9e-05,-1.2e-05,-2.5e-05,-3e-05,6.6e-05,8.4e-05,-0.000105,-2e-06,8.9e-05,-8.4e-05,-4.8e-05,4.5e-05,1.7e-05,8.6e-05,-3.9e-05,-5e-06,-1.3e-05,-8.2e-05,-9.3e-05,-5.1e-05,2.3e-05,1.2e-05,-5.4e-05,-5e-05,4.1e-05,-1.8e-05,2.4e-05,2.5e-05,-1e-05,-5.9e-05,3e-06,-8.1e-05,-3.9e-05,8.4e-05,-4e-05,-1.9e-05,-4e-05,5.1e-05,3e-06,4.6e-05,-1.1e-05,6e-06,-3.8e-05,-1.9e-05,-3.2e-05,-3.7e-05,9e-06
-2.3e-05,4e-06,-4e-06,4.9e-05,-5.4e-05,-8.1e-05,-2.1e-05,-4.6e-05,1.9e-05,-7e-06,5.6e-05,5e-06,5e-06,-6e-05,2.7e-05,-7.4e-05,2e-05,2.4e-05,-7e-06,2.4e-05,1.4e-05,1e-06,-6.6e-05,-2.6e-05,-2e-05,-5.8e-05,8e-06,-8e-06,-2.6e-05,-4.8e-05,2.1e-05,1.4e-05,4e-05,4.1e-05,3e-05,-3.1e-05,1.2e-05,1.1e-05,-4e-06,-1.2e-05,-4.5e-05,3e-06,-7.5e-05,6.9e-05,-7.6e-05,-7.5e-05,-3.8e-05,6.3e-05,2e-05,1.6e-05,7e-06,2.7e-05,2.4e-05,-9e-06,3.5e-05,-1.7e-05,9e-06,4.8e-05,3.2e-05,7e-06,1.5e-05,-2.7e-05,3.1e-05,-1.3e-05,-6.7e-05,2.1e-05,-3.3e-05,1.2e-05,1.2e-05,-3e-06,1.2e-05,-4.1e-05,-2e-05,5.4e-05,-1.9e-05,1.2e-05,7.8e-05,3.5e-05,-1e-04,5.8e-05,0.000131,2.9e-05,3.1e-05,-4.6e-05,5.9e-05,-1.3e-05,-1.7e-05,-2e-05,-1.4e-05,-2.3e-05,-1e-05,-4.5e-05,3.2e-05,-6.4e-05,2.4e-05,-2.2e-05,-2.6e-05,-3.5e-05,5.4e-05,9.5e-05,1e-06,-6.2e-05,-1.5e-05,6.4e-05,-6e-06,1.6e-05,7.9e-05,2e-05,-1.3e-05,2.7e-05,-5.2e-05,1.2e-05,-2e-05,-1.6e-05,-3.2e-05,-2.7e-05,3.1e-05,4.2e-05,6.6e-05,-6.1e-05,-3.7e-05
-6e-06,3.4e-05,2e-06,4.5e-05,-1e-06,2.2e-05,7e-06,-1.1e-05,4.2e-05,1.9e-05,5.1e-05,2.9e-05,-1e-05,-1.9e-05,-1.4e-05,1.2e-05,-7.8e-05,4e-06,8e-06,-2.3e-05,-5.4e-05,-1.9e-05,8e-06,6.4e-05,3.3e-05,-1.2e-05,5.1e-05,2.2e-05,4.2e-05,2.5e-05,7.6e-05,-3.7e-05,-4.4e-05,-1.2e-05,1.3e-05,-1.4e-05,2.4e-05,-1.4e-05,1e-05,3.9e-05,-1.6e-05,2e-06,-1.6e-05,-6e-06,9.2e-05,3.3e-05,4.8e-05,2e-05,1.6e-05,4e-05,-6.1e-05,-2.9e-05,3.8e-05,2.5e-05,-3.6e-05,-2.7e-05,-3.3e-05,-2e-05,5.4e-05,4.4e-05,1e-06,-5.6e-05,-6e-06,5.2e-05,2.3e-05,1.5e-05,2.1e-05,2.3e-05,7e-06,1e-05,1.1e-05,-6.3e-05,4e-06,0,1e-06,1.3e-05,-8e-06,6e-06,1.1e-05,1e-04,-4.7e-05,-4.6e-05,-2.4e-05,1.9e-05,-1e-05,2.5e-05,-1e-06,-7e-06,-4.2e-05,1.8e-05,-1.6e-05,5.5e-05,6.2e-05,-6.4e-05,1.5e-05,4.8e-05,-3e-06,2.3e-05,-6e-05,4e-05,-1e-06,-2.9e-05,-3.2e-05,-6.8e-05,0,2.4e-05,-2.4e-05,9e-06,-1.4e-05,-9e-06,-4e-05,7e-06,1.5e-05,-5.3e-05,-1e-06,1.1e-05,2e-06,-2.1e-05,-2.9e-05,1.7e-05,2.6e-05
3.8e-05,-3.5e-05,-1.3e-05,-2e-06,4.2e-05,1.3e-05,8e-06,3.3e-05,9e-06,2e-06,2e-06,-1.4e-05,2.3e-05,5.8e-05,4e-06,7.3e-05,-1.2e-05,-1.5e-05,2.5e-05,-2.7e-05,1.7e-05,-2e-05,1.2e-05,8e-06,-2.3e-05,2.5e-05,2.8e-05,6e-06,1.7e-05,0,2e-06,4.5e-05,1.6e-05,-1e-05,-1e-06,1.1e-05,9e-06,-2e-05,-1e-06,4.5e-05,1.9e-05,7e-06,2.4e-05,-8e-06,-6.1e-05,3.2e-05,8e-06,-2.1e-05,7e-06,1.4e-05,2.9e-05,2.4e-05,-2.9e-05,-4e-06,2.6e-05,0,5.4e-05,-2.1e-05,-7e-06,2.5e-05,-8e-06,1.8e-05,-3.2e-05,-1.7e-05,-3.6e-05,-9e-06,-2e-05,1e-06,-1e-06,1.1e-05,3.3e-05,1e-05,-2.3e-05,-9e-06,-7e-06,3.3e-05,-1.7e-05,-4.6e-05,-2.6e-05,-6.2e-05,2.9e-05,3e-05,-4.8e-05,3.7e-05,-2e-05,-3.3e-05,-1.7e-05,-1.2e-05,2.9e-05,1.4e-05,-1.4e-05,2.9e-05,5.7e-05,-1.6e-05,8e-06,-4.3e-05,1.7e-05,4e-06,1.7e-05,6.8e-05,3.6e-05,7e-06,-1e-05,3.5e-05,-1.1e-05,-6e-06,3e-05,-1.6e-05,9e-06,6e-06,9e-06,-1.7e-05,2e-06,1e-05,-8e-06,-1.4e-05,-7e-06,4e-06,-2.6e-05,5e-06,-3.1e-05
-3.1e-05,-4.2e-05,1.4e-05,-1.6e-05,1.6e-05,1e-06,6e-06,2.1e-05,1.4e-05,-1.1e-05,3e-05,-6e-06,6e-06,-7e-06,-2e-06,-1.4e-05,8.2e-05,-2.5e-05,1.2e-05,5.2e-05,4.3e-05,1.6e-05,5.1e-05,2.8e-05,2.1e-05,2.6e-05,-3.4e-05,-1.2e-05,-1.2e-05,1.3e-05,-1e-06,6e-06,2e-05,2.9e-05,1.1e-05,-1.2e-05,-1.4e-05,2.1e-05,-2e-06,3.7e-05,2e-05,-7e-06,1.5e-05,1.8e-05,1e-05,-6e-06,1.6e-05,3.8e-05,1.2e-05,-1e-06,4.2e-05,-9e-06,-1.1e-05,2e-05,-1.4e-05,4e-06,-2.3e-05,-1.4e-05,-1.1e-05,-7.1e-05,3e-06,-8e-06,3e-06,-1.5e-05,2.9e-05,1.5e-05,-2.3e-05,1.6e-05,2.6e-05,1.9e-05,2e-05,5.2e-05,1.5e-05,-6e-06,-1.4e-05,-3.7e-05,1.5e-05,4.1e-05,1.5e-05,-3.3e-05,-5.8e-05,-8e-06,-3e-05,4.3e-05,1.6e-05,6e-06,-1.9e-05,1.6e-05,2.2e-05,2e-06,-2.1e-05,-4.1e-05,4.5e-05,2.2e-05,-5e-06,2e-05,-1.3e-05,3.5e-05,1.8e-05,-6.2e-05,-4e-06,1.6e-05,9e-06,-1.2e-05,0,-3.3e-05,2e-06,-4.2e-05,1.6e-05,-9e-06,1.5e-05,-6e-06,0,-3e-05,-1.5e-05,2.9e-05,-2.3e-05,-3e-06,-1e-05,3e-05,1.6e-05
-4e-06,-2.2e-05,-2.8e-05,-2.4e-05,-7e-06,-8e-06,1.2e-05,1e-06,-2.2e-05,1.5e-05,-1.2e-05,3e-06,-2.2e-05,-9e-06,1e-06,-2.2e-05,2.5e-05,1.7e-05,-6e-06,-1.7e-05,-2.2e-05,1.1e-05,-1.7e-05,-2e-05,-3.3e-05,-1.8e-05,-1.3e-05,1.9e-05,3.4e-05,3e-06,-2e-05,-2.1e-05,-4e-05,1e-06,-3.1e-05,3.5e-05,2e-05,1.5e-05,-3e-06,9e-06,-1.2e-05,-6e-06,-1.5e-05,-1.7e-05,-6e-06,9e-06,-4e-06,2.6e-05,1.5e-05,-2.2e-05,-4e-05,1.2e-05,-4e-06,4e-06,2.7e-05,-7e-06,1.6e-05,-3e-06,-1.5e-05,2.5e-05,-2e-06,1.3e-05,6e-06,2.7e-05,8e-06,-1.6e-05,-1e-06,-1.9e-05,-2.1e-05,-4.1e-05,-4.2e-05,-4.2e-05,1.4e-05,-1.4e-05,-2.9e-05,-2.8e-05,-2e-06,3.4e-05,7.6e-05,-5e-06,6.6e-05,-1.1e-05,1e-05,-3e-06,1.7e-05,-4e-06,-6e-06,-2.4e-05,1e-06,-2e-06,4.7e-05,-2.3e-05,1e-06,2.4e-05,0,-9e-06,2.1e-05,-7e-06,6e-06,-2.9e-05,-2.7e-05,7e-06,2.3e-05,5e-06,5e-06,2.9e-05,-8e-06,-1.3e-05,2e-05,1.2e-05,1e-05,2.9e-05,-7e-06,-1e-06,-1.2e-05,-2.7e-05,4e-06,-7e-06,6e-06,6e-06,-7e-06
-5e-06,-1e-06,1.6e-05,8e-06,-2.4e-05,-7e-06,2e-06,-1.1e-05,4e-06,8e-06,-2.4e-05,0,6e-06,-1e-06,-3.1e-05,2.8e-05,5e-06,2e-05,6e-06,3.6e-05,-1.4e-05,3e-06,2.7e-05,-3e-06,3.8e-05,-3e-06,-1e-06,-9e-06,-2e-06,-1.5e-05,-2.7e-05,1.2e-05,3.1e-05,-1.7e-05,3.1e-05,8e-06,-2.4e-05,3e-06,1e-06,-1.5e-05,-2.3e-05,3e-06,-5e-06,1.4e-05,2.5e-05,2e-06,-1.3e-05,0,4e-06,-1.8e-05,4e-06,1.4e-05,-1.1e-05,-8e-06,-3.8e-05,0,-1.9e-05,1e-05,8e-06,7e-06,-2e-06,-3e-06,-1e-05,5e-06,-7e-06,1.2e-05,1.2e-05,-3e-06,1.9e-05,-6e-06,-3e-06,-2.3e-05,4e-06,2.3e-05,-1.1e-05,-3.7e-05,-1.9e-05,-2e-06,-7e-06,3.1e-05,-3e-05,1.7e-05,3.5e-05,-2.3e-05,-1.7e-05,8e-06,-1.5e-05,2.4e-05,-8e-06,-5e-06,-1.1e-05,2.1e-05,-3.1e-05,4e-06,4e-06,1.6e-05,1.2e-05,4e-06,-1.9e-05,-2e-05,1.6e-05,-1.2e-05,2.2e-05,-7e-06,-5e-06,-2.2e-05,2.5e-05,2.1e-05,-1.9e-05,-4e-06,2.1e-05,-2.6e-05,-2e-06,5e-06,-4e-06,4.4e-05,0,2.5e-05,2.1e-05,-7e-06,2e-06
2e-06,1.9e-05,-8e-06,-4e-05,1.4e-05,2.1e-05,-4e-06,-2.4e-05,-1.6e-05,-1.9e-05,-1.4e-05,0,-5e-06,-3.5e-05,1.2e-05,-8e-06,1.8e-05,-1e-06,-6e-06,-3.9e-05,8e-06,-2e-06,-3.3e-05,1.4e-05,-3e-05,3e-06,1e-05,6e-06,-1.7e-05,1e-05,0,0,-7e-06,-2e-06,-1.5e-05,-1e-05,1e-06,-1.6e-05,8e-06,-3.4e-05,-3e-06,-1e-06,2.1e-05,-1.9e-05,-1.8e-05,-1.2e-05,-5e-06,1.9e-05,6e-06,-1.3e-05,-1.6e-05,-4e-06,-7e-06,0,2.8e-05,1.1e-05,1.4e-05,1.3e-05,1.2e-05,1.9e-05,6e-06,1.2e-05,1.9e-05,-2e-05,4e-06,-9e-06,1.4e-05,1.1e-05,-2e-05,-3.9e-05,3e-06,5.7e-05,1.2e-05,-1.4e-05,-2e-06,1.4e-05,2e-05,2.2e-05,3.5e-05,-2e-06,-1e-06,-1.5e-05,2.4e-05,-1.9e-05,-1e-05,-2e-06,2e-06,1.2e-05,-3e-05,-6e-06,-1.4e-05,2.5e-05,3e-06,5e-06,1e-06,-2.1e-05,-2.4e-05,-1.1e-05,-5e-06,2.4e-05,6e-06,-9e-06,1.1e-05,8e-06,4e-06,-1e-06,-2.1e-05,3.6e-05,7e-06,-3e-06,1e-06,2e-06,8e-06,1.6e-05,-5e-06,-3.7e-05,-6e-06,-2.6e-05,-2e-05,-2.9e-05,1.6e-05
-1.7e-05,1.8e-05,3e-06,4.4e-05,2e-05,-9e-06,0,4e-06,1e-06,1.5e-05,1.3e-05,0,-1.3e-05,1.2e-05,-1.4e-05,1.6e-05,-3.6e-05,-4e-06,-8e-06,1.4e-05,6e-06,-3e-06,-2e-06,-2.2e-05,2e-05,-5e-06,3e-06,2e-06,-6e-06,-1.1e-05,-1e-06,-2e-06,-1.5e-05,7e-06,2.3e-05,5e-06,6e-06,1e-06,-4e-06,-9e-06,1.4e-05,7e-06,1.6e-05,-2e-06,1.5e-05,1.1e-05,2.3e-05,1.3e-05,5e-06,-8e-06,-2.3e-05,1e-06,1e-05,-3e-06,7e-06,-5e-06,1.2e-05,0,4e-06,-4e-05,-6e-06,-1.7e-05,-2.5e-05,-1.9e-05,-6e-06,-6e-06,4e-06,-1.1e-05,4e-06,2e-06,1.3e-05,-1e-05,1.1e-05,1.1e-05,-5e-06,1.5e-05,-8e-06,4e-06,-1.5e-05,-2.3e-05,-7e-06,8e-06,-3e-06,-5e-06,2.2e-05,8e-06,2e-06,-6e-06,1.4e-05,-1e-06,1.5e-05,-1e-05,5e-06,6e-06,3e-06,1.3e-05,-1.1e-05,-1.3e-05,3.3e-05,3e-06,-4e-06,-1.5e-05,3e-06,-1.2e-05,-5e-06,6e-06,4e-06,-1e-06,-1.2e-05,1e-05,0,-2e-06,5e-06,1e-05,6e-06,1.9e-05,8e-06,1.1e-05,1.8e-05,-4e-06,-1.6e-05
5e-06,5e-06,0,-4e-06,3e-06,-8e-06,-2e-06,1.7e-05,4e-06,-2e-06,2.4e-05,-6e-06,3e-06,1.8e-05,1.8e-05,-2.5e-05,-1.2e-05,3e-06,4e-06,-1.2e-05,9e-06,-2e-06,-1.8e-05,-1e-06,-1.8e-05,1e-06,9e-06,-1e-06,-9e-06,1.2e-05,2.9e-05,-6e-06,2.9e-05,0,-2e-05,-6e-06,-3e-06,7e-06,-8e-06,-1.6e-05,1.5e-05,-6e-06,-1.1e-05,1.4e-05,-1.4e-05,-6e-06,9e-06,-1.6e-05,4e-06,1.1e-05,1e-05,-1.1e-05,7e-06,-3e-06,-1.6e-05,7e-06,-3.2e-05,-8e-06,-1e-05,1e-05,0,-2e-06,1.1e-05,1e-05,-1.9e-05,1.5e-05,-4e-06,1.4e-05,-1e-06,1.3e-05,0,-3e-05,5e-06,-6e-06,2e-06,1.3e-05,-1.3e-05,1.7e-05,-2e-05,1.4e-05,2.8e-05,-3e-06,-2.4e-05,1.1e-05,-1.5e-05,-2e-06,-3e-06,1.5e-05,0,1e-06,-1.4e-05,-3.4e-05,-4e-06,-1.8e-05,-4e-06,2e-06,1e-05,5e-06,-2.8e-05,2.1e-05,-1e-06,1e-05,0,1.8e-05,3e-06,4e-06,-1e-05,0,1e-06,-5e-06,1.3e-05,5e-06,-8e-06,7e-06,6e-06,-1.1e-05,-3e-06,2e-06,-1.4e-05,1.7e-05,1.5e-05
-6e-06,-1.7e-05,-2e-06,2.6e-05,-8e-06,9e-06,-1e-06,7e-06,6e-06,-8e-06,6e-06,7e-06,7e-06,0,-1.8e-05,4e-06,4.7e-05,-4e-06,2e-06,1e-06,-8e-06,1e-06,-1e-06,-1.1e-05,1.6e-05,1.2e-05,4e-06,-1e-06,8e-06,-1.4e-05,1.4e-05,7e-06,-2.8e-05,-4e-06,6e-06,-7e-06,6e-06,8e-06,8e-06,1.7e-05,2e-06,0,-1.9e-05,-6e-06,1.6e-05,-4e-06,-2e-06,-4e-06,3e-06,2e-06,1.6e-05,1e-06,-1e-06,-1.1e-05,2.3e-05,-9e-06,3.8e-05,-5e-06,-5e-06,7e-06,-3e-06,-1e-05,1e-06,1.7e-05,2.6e-05,-1.2e-05,5e-06,-1.3e-05,-4e-06,3e-06,6e-06,1.4e-05,3e-06,-6e-06,-4e-06,3e-06,1.5e-05,-8e-06,-5e-06,5e-06,-2.6e-05,-4e-06,-1.9e-05,5e-06,7e-06,-1.2e-05,1e-06,-1e-06,1.4e-05,1e-06,9e-06,1.8e-05,-2.9e-05,-2.3e-05,0,-1.3e-05,1.2e-05,-1e-06,-3e-06,-3e-06,9e-06,1.7e-05,-4e-06,-2e-05,-5e-06,-9e-06,-7e-06,-2.2e-05,-2e-06,2e-06,1.4e-05,0,0,8e-06,3e-06,0,6e-06,-6e-06,1e-06,1.3e-05,-1.2e-05
-7e-06,-1.6e-05,4e-06,-1.9e-05,-6e-06,6e-06,1e-06,-7e-06,3e-06,7e-06,4e-06,-2e-06,-1.2e-05,-7e-06,1e-05,1.7e-05,8e-06,-4e-06,2e-06,2.2e-05,-9e-06,0,1.6e-05,9e-06,-6e-06,1e-06,-7e-06,2e-06,1e-05,1.5e-05,-7e-06,-6e-06,1e-05,2e-06,-4e-06,-5e-06,4e-06,-6e-06,-4e-06,4e-06,-1e-05,0,2e-06,3e-06,-1.3e-05,1.4e-05,6e-06,1.3e-05,1e-06,1e-06,-1.5e-05,-5e-06,1.2e-05,1e-06,-2.9e-05,6e-06,-1.9e-05,-8e-06,6e-06,1.3e-05,0,3e-06,-8e-06,-1.3e-05,-1.8e-05,3e-06,8e-06,-6e-06,1.2e-05,3e-06,-7e-06,1.4e-05,-4e-06,1e-05,-1e-06,-8e-06,2e-06,-1.8e-05,-3.2e-05,1.1e-05,1.1e-05,1e-05,0,3e-06,-1.4e-05,7e-06,-1e-06,-9e-06,-7e-06,1e-06,-4e-06,2.5e-05,-2.7e-05,-3e-06,2e-06,1.5e-05,-1e-06,2e-06,1.7e-05,6e-06,-1e-06,4e-06,-6e-06,1.1e-05,2e-06,1e-06,3e-06,-1.1e-05,1e-06,1e-06,1e-06,-9e-06,1e-06,-5e-06,4e-06,1e-06,-4e-06,7e-06,-4e-06,2e-06,4e-06
-2e-06,-5e-06,-6e-06,-1e-05,1e-06,-1.2e-05,0,-9e-06,6e-06,0,-7e-06,1e-06,1e-05,-8e-06,-1.1e-05,-6e-06,-1e-05,1e-06,2e-06,-1.9e-05,1.1e-05,6e-06,2e-06,2e-06,1e-06,-1.2e-05,-1.1e-05,-2e-06,-7e-06,-1.1e-05,-8e-06,-1e-06,1.1e-05,8e-06,9e-06,3e-06,2e-06,-3e-06,4e-06,1.2e-05,-6e-06,0,1.1e-05,-4e-06,-1e-06,-6e-06,-8e-06,7e-06,2e-06,-6e-06,-1e-06,3e-06,3e-06,2e-06,3.2e-05,-5e-06,6e-06,5e-06,5e-06,-3.3e-05,2e-06,5e-06,9e-06,-5e-06,2e-05,9e-06,6e-06,1e-06,-1e-05,2e-05,0,-1.3e-05,0,-7e-06,4e-06,9e-06,-1e-05,6e-06,1.9e-05,-1.3e-05,-1.3e-05,-1.2e-05,1.5e-05,-2e-06,1.7e-05,-4e-06,4e-06,2e-06,-6e-06,3e-06,-3e-06,-1.6e-05,-6e-06,7e-06,-1e-06,-1.5e-05,-1.1e-05,9e-06,-3e-06,-2e-06,-1e-06,-9e-06,-7e-06,-8e-06,-1e-06,5e-06,-7e-06,-6e-06,5e-06,-6e-06,-2e-06,1.1e-05,5e-06,-8e-06,3e-06,0,5e-06,-6e-06,9e-06,-1.1e-05,4e-06
6e-06,6e-06,8e-06,-6e-06,9e-06,-1e-06,1e-06,-5e-06,-1.1e-05,-3e-06,-9e-06,-1e-06,-4e-06,3e-06,0,0,8e-06,9e-06,0,1.6e-05,4e-06,-3e-06,1.3e-05,-1.1e-05,-6e-06,-3e-06,0,1e-06,2e-06,9e-06,-2e-05,6e-06,-2.3e-05,-4e-06,0,7e-06,-4e-06,3e-06,-3e-06,-7e-06,5e-06,0,-1e-06,3e-06,7e-06,-5e-06,5e-06,-1.3e-05,0,-1.1e-05,2e-06,2e-06,-7e-06,0,-1.3e-05,-1e-06,3e-06,5e-06,0,1.7e-05,-2e-06,3e-06,-9e-06,1.4e-05,-1.5e-05,-1e-05,-2e-06,0,1.1e-05,6e-06,5e-06,-1.8e-05,-8e-06,5e-06,5e-06,5e-06,2e-06,-9e-06,-1e-06,-1.7e-05,2.7e-05,8e-06,1.5e-05,1e-06,-6e-06,6e-06,4e-06,3e-06,-4e-06,-1e-06,1e-06,-1.8e-05,9e-06,5e-06,1e-06,1.5e-05,5e-06,-4e-06,-5e-06,-2.7e-05,1e-06,-1.2e-05,-5e-06,4e-06,1e-06,-5e-06,2e-06,2.2e-05,-1e-06,8e-06,-1e-05,-4e-06,-1e-06,-1e-05,1e-06,1e-06,-3e-06,5e-06,-1e-06,-1.1e-05,-8e-06
-4e-06,2e-05,-5e-06,-5e-06,3e-06,1.4e-05,1e-06,7e-06,-2e-06,-1e-06,-1.8e-05,-1e-06,-7e-06,-1e-06,-2e-06,-6e-06,-1.8e-05,3e-06,-1e-06,-1.9e-05,-5e-06,-2e-06,-3e-06,1e-05,8e-06,9e-06,6e-06,2e-06,1e-05,-1e-05,0,-5e-06,1.9e-05,-6e-06,-6e-06,1e-06,-2e-06,6e-06,-1e-06,-1.5e-05,1e-05,2e-06,-9e-06,1e-06,-3e-06,1.2e-05,-3e-06,2.6e-05,0,-1e-06,-1.5e-05,2e-06,0,1e-06,-7e-06,-1e-06,-7e-06,4e-06,-3e-06,1e-06,0,4e-06,3e-06,4e-06,0,1e-06,-6e-06,3e-06,-9e-06,0,3e-06,2.2e-05,-3e-06,-5e-06,6e-06,8e-06,3e-06,-2.2e-05,1.9e-05,3e-06,-2.9e-05,-1e-06,2e-06,3e-06,-9e-06,-3e-06,3e-06,-1.4e-05,1e-06,-3e-06,-2e-06,1e-05,1.9e-05,9e-06,-2e-06,-1.6e-05,-3e-06,-3e-06,-8e-06,-3e-06,2e-06,-1e-06,3e-06,-1e-06,0,0,1e-06,9e-06,2e-06,-3e-06,-6e-06,-4e-06,-4e-06,-2e-06,2e-06,5e-06,-1e-06,-1e-06,-4e-06,-4e-06,1e-05
-2e-06,5e-06,3e-06,6e-06,3e-06,-1.1e-05,-1e-06,4e-06,-3e-06,6e-06,1.3e-05,0,5e-06,8e-06,-2e-06,1e-05,-9e-06,-6e-06,-1e-06,7e-06,-5e-06,-2e-06,-9e-06,0,-4e-06,-1e-06,6e-06,-4e-06,-1.5e-05,7e-06,2e-06,4e-06,-6e-06,5e-06,5e-06,1e-06,4e-06,-2e-06,5e-06,-1.9e-05,2e-06,-1e-06,1e-06,-4e-06,5e-06,-9e-06,2e-06,-9e-06,0,-4e-06,1.4e-05,5e-06,-3e-06,5e-06,2.4e-05,3e-06,1.2e-05,0,-2e-06,6e-06,1e-06,1e-06,2e-06,-1.5e-05,1e-06,1e-06,-1e-06,-4e-06,3e-06,-1e-06,0,5e-06,-3e-06,2e-06,2e-06,-1.5e-05,-1e-05,1e-06,1.7e-05,1.9e-05,1.6e-05,-5e-06,-1.1e-05,-3e-06,9e-06,4e-06,5e-06,1.3e-05,9e-06,0,1e-05,1.5e-05,7e-06,1.1e-05,0,1.8e-05,-1e-06,3e-06,1.7e-05,1e-06,-1e-06,8e-06,4e-06,-2e-06,-1e-06,6e-06,3e-06,5e-06,-1e-06,-2e-06,-2e-06,4e-06,-3e-06,-3e-06,1e-06,-8e-06,0,-7e-06,4e-06,1.2e-05,-1.2e-05
2e-06,-2e-06,-1e-06,1.2e-05,-2e-06,-3e-06,0,5e-06,4e-06,-4e-06,6e-06,1e-06,0,4e-06,4e-06,2e-06,2.5e-05,-4e-06,-1e-06,0,4e-06,1e-06,-6e-06,6e-06,4e-06,-1e-06,-2e-06,3e-06,-3e-06,-5e-06,1.3e-05,-3e-06,-4e-06,1e-06,-6e-06,1e-06,-7e-06,-3e-06,-3e-06,-1.3e-05,-7e-06,-3e-06,1.1e-05,0,-1.1e-05,-4e-06,3e-06,-3e-06,0,5e-06,4e-06,-4e-06,-6e-06,4e-06,-2.5e-05,0,-1.6e-05,-3e-06,0,-1.7e-05,-1e-06,1e-06,-2e-06,-6e-06,-3e-06,0,1e-06,-2e-06,-1e-06,-1.7e-05,-5e-06,-2.2e-05,-3e-06,1e-06,4e-06,-1.1e-05,1e-05,0,-1.5e-05,1.3e-05,-1.1e-05,8e-06,-1.2e-05,-3e-06,-3e-06,-6e-06,2e-06,-3e-06,-4e-06,1e-06,-8e-06,-3e-06,0,2e-06,2e-06,-1.6e-05,6e-06,-9e-06,-6e-06,2e-05,-2e-06,9e-06,5e-06,0,1e-06,-2e-06,3e-06,-1e-05,2e-06,4e-06,-2e-06,-3e-06,4e-06,6e-06,0,8e-06,-3e-06,8e-06,-9e-06,8e-06,1e-05
1e-06,-1.1e-05,-2e-06,5e-06,-5e-06,1e-05,-2e-06,-9e-06,3e-06,-1e-06,1.3e-05,-1e-06,-5e-06,-1.2e-05,-5e-06,-1.4e-05,4e-06,5e-06,-1e-06,1e-06,4e-06,2e-06,-6e-06,-4e-06,-5e-06,1e-06,-2e-06,-3e-06,6e-06,3e-06,1.2e-05,-2e-06,7e-06,-4e-06,8e-06,-2e-06,6e-06,0,1e-06,-1e-06,-8e-06,2e-06,2e-06,2e-06,1.1e-05,1e-05,8e-06,3e-06,-2e-06,3e-06,-8e-06,0,0,0,1.7e-05,0,1.5e-05,-5e-06,5e-06,9e-06,-3e-06,-3e-06,-1e-06,1.1e-05,6e-06,0,1e-06,-2e-06,-3e-06,-5e-06,1e-06,9e-06,-1e-06,-2e-06,2e-06,-1.1e-05,0,-3e-06,9e-06,-1.6e-05,1.8e-05,-7e-06,-2e-06,-6e-06,0,3e-06,3e-06,-3e-06,3e-06,0,3e-06,-1.9e-05,3e-06,-7e-06,-1e-06,9e-06,1e-06,5e-06,-1.1e-05,1e-05,3e-06,1e-06,1e-06,3e-06,-1e-06,-4e-06,1e-06,-1e-05,-4e-06,-4e-06,-3e-06,5e-06,0,4e-06,1e-06,-6e-06,2e-06,-3e-06,8e-06,-2e-06,-4e-06
-1e-06,-1.2e-05,2e-06,1e-06,3e-06,-5e-06,0,-2e-06,0,3e-06,-4e-06,-1e-06,7e-06,0,2e-06,1e-05,-1.1e-05,1e-06,2e-06,5e-06,-2e-06,0,-1e-06,-1e-06,0,-1e-06,-2e-06,1e-06,-1e-06,-2e-06,-3e-06,4e-06,-9e-06,1e-06,-5e-06,-3e-06,0,4e-06,0,4e-06,1e-06,0,-9e-06,1e-06,-7e-06,-7e-06,-4e-06,5e-06,-1e-06,1e-06,4e-06,-4e-06,3e-06,-1e-06,-2e-06,-1e-06,-8e-06,0,0,2e-06,1e-06,-1e-06,2e-06,7e-06,-4e-06,-3e-06,-4e-06,2e-06,6e-06,-3e-06,-2e-06,9e-06,0,3e-06,3e-06,6e-06,-6e-06,3e-06,-2.5e-05,-1e-05,-2.3e-05,4e-06,7e-06,2e-06,-5e-06,-3e-06,2e-06,6e-06,-9e-06,0,1e-06,4e-06,8e-06,-6e-06,0,-5e-06,-3e-06,2e-06,1.3e-05,1e-05,1e-06,-1e-05,-4e-06,-4e-06,1e-06,8e-06,0,-8e-06,0,1e-06,-3e-06,-7e-06,-2e-06,5e-06,-2e-06,-1e-06,-3e-06,0,-4e-06,-9e-06,-3e-06
2e-06,3e-06,-3e-06,-1e-05,5e-06,-4e-06,2e-06,-2e-06,1e-06,-3e-06,-4e-06,0,-3e-06,5e-06,-4e-06,-1e-06,4e-06,-2e-06,-1e-06,-1e-05,-3e-06,0,1e-05,5e-06,5e-06,-3e-06,-2e-06,1e-06,0,1e-06,-7e-06,-1e-06,1e-05,2e-06,3e-06,-2e-06,-1e-06,2e-06,-1e-06,1e-05,6e-06,0,-5e-06,-1e-06,4e-06,-1e-06,0,-1.4e-05,-1e-06,1e-06,-2e-06,3e-06,-2e-06,1e-06,-6e-06,0,1e-06,2e-06,-2e-06,4e-06,0,-3e-06,-3e-06,-1.1e-05,0,8e-06,-3e-06,1e-06,-7e-06,-3e-06,6e-06,-6e-06,1e-06,-4e-06,3e-06,7e-06,3e-06,7e-06,-1e-05,2e-06,1.7e-05,-1e-06,8e-06,5e-06,8e-06,3e-06,1e-06,1e-06,5e-06,0,-5e-06,1.8e-05,5e-06,-3e-06,-1e-06,4e-06,-5e-06,-3e-06,-3e-06,-2.9e-05,-2e-06,-8e-06,-6e-06,3e-06,0,-6e-06,1e-06,4e-06,1e-06,0,-3e-06,3e-06,-1e-06,2e-06,-2e-06,5e-06,3e-06,0,6e-06,-6e-06,6e-06
1e-06,9e-06,2e-06,-8e-06,4e-06,5e-06,-1e-06,6e-06,-3e-06,0,-7e-06,-1e-06,-2e-06,0,2e-06,-1e-06,-7e-06,0,0,9e-06,0,-2e-06,0,-5e-06,-5e-06,1e-06,-1e-06,-1e-06,3e-06,3e-06,-1.3e-05,-2e-06,-7e-06,0,-5e-06,2e-06,3e-06,-3e-06,2e-06,3e-06,4e-06,1e-06,5e-06,0,-4e-06,9e-06,-4e-06,1.1e-05,-1e-06,-5e-06,-4e-06,-3e-06,2e-06,-2e-06,1.6e-05,1e-06,7e-06,3e-06,-2e-06,-1.3e-05,-2e-06,2e-06,4e-06,-2e-06,0,-4e-06,0,-1e-06,8e-06,0,1e-06,-8e-06,1e-06,2e-06,0,4e-06,3e-06,1e-05,0,9e-06,-1.1e-05,-2e-06,2e-06,3e-06,-4e-06,1e-06,1e-06,-8e-06,-1e-06,1e-06,5e-06,-5e-06,-1e-06,-3e-06,0,-3e-06,3e-06,7e-06,-5e-06,-5e-06,0,2e-06,-5e-06,-3e-06,0,1e-06,-1e-06,1.3e-05,-2e-06,-1e-06,0,2e-06,-1e-06,-1e-06,0,-7e-06,-2e-06,-2e-06,-5e-06,1e-06,-8e-06
0,1e-05,-3e-06,1e-06,-3e-06,1e-06,0,0,-1e-06,2e-06,-9e-06,1e-06,4e-06,1e-06,-3e-06,3e-06,-9e-06,3e-06,0,-1.2e-05,2e-06,-1e-06,9e-06,0,4e-06,4e-06,3e-06,0,-1e-06,-3e-06,-4e-06,1e-06,-2e-06,-2e-06,3e-06,0,-2e-06,-2e-06,-2e-06,0,-4e-06,-1e-06,5e-06,0,5e-06,-8e-06,2e-06,-3e-06,-2e-06,1e-06,9e-06,1e-06,4e-06,-3e-06,-1.9e-05,-1e-06,-1e-05,1e-06,1e-06,1.1e-05,2e-06,-1e-06,-1e-06,1.2e-05,-4e-06,-5e-06,0,0,-7e-06,1.1e-05,-2e-06,5e-06,2e-06,-1e-06,0,-1e-06,-5e-06,4e-06,-1e-05,3e-06,1.3e-05,5e-06,-5e-06,0,1e-06,-2e-06,0,7e-06,3e-06,-1e-06,-3e-06,-1.6e-05,-1.1e-05,0,1e-06,2e-06,3e-06,-2e-06,1e-06,-1.2e-05,3e-06,9e-06,-2e-06,1e-06,0,-1e-06,-2e-06,7e-06,2e-06,3e-06,4e-06,-5e-06,3e-06,-1e-06,-1e-06,8e-06,2e-06,4e-06,1e-06,7e-06,1e-05
0,2e-06,2e-06,-3e-06,-4e-06,-5e-06,0,2e-06,2e-06,0,3e-06,-1e-06,-1e-06,1e-06,1e-06,-1e-05,1.2e-05,-1e-06,0,9e-06,1e-06,0,-8e-06,-4e-06,-5e-06,-1e-06,2e-06,1e-06,2e-06,3e-06,4e-06,2e-06,1.2e-05,-1e-06,-1e-06,0,1e-06,1e-06,1e-06,-6e-06,-6e-06,-2e-06,-4e-06,1e-06,-3e-06,1e-06,1e-06,1e-06,-1e-06,-1e-06,2e-06,2e-06,-1e-06,-3e-06,1.5e-05,0,1e-05,-2e-06,2e-06,-2e-06,-1e-06,2e-06,-1e-06,0,5e-06,8e-06,2e-06,-5e-06,4e-06,4e-06,-1e-06,9e-06,4e-06,1e-06,-1e-06,-2e-06,2e-06,1e-06,2.4e-05,-7e-06,-1.9e-05,-7e-06,-5e-06,-5e-06,-2e-06,0,-1e-06,-3e-06,-1e-06,0,3e-06,4e-06,-1.2e-05,6e-06,0,0,-1e-06,-3e-06,5e-06,2.3e-05,-2e-06,6e-06,1e-06,2e-06,0,4e-06,0,0,1e-06,-1e-06,3e-06,3e-06,-1e-06,-6e-06,-1e-06,-5e-06,-1e-06,-3e-06,-1e-06,7e-06,-9e-06
2e-06,-8e-06,-1e-06,1.4e-05,4e-06,3e-06,-1e-06,-4e-06,0,-2e-06,7e-06,1e-06,-3e-06,-2e-06,-2e-06,1.1e-05,2e-06,-3e-06,0,-1e-06,-4e-06,2e-06,-1e-06,3e-06,8e-06,-2e-06,-1e-06,-2e-06,-2e-06,-6e-06,7e-06,-3e-06,-1.5e-05,2e-06,0,2e-06,-3e-06,3e-06,0,-7e-06,-1e-06,1e-06,-5e-06,-1e-06,1e-06,6e-06,1e-06,-6e-06,-2e-06,3e-06,-7e-06,1e-06,0,0,-5e-06,-1e-06,-7e-06,-2e-06,0,1e-06,-1e-06,1e-06,3e-06,-1.2e-05,-3e-06,-6e-06,-2e-06,3e-06,-2e-06,7e-06,-1e-06,-1.2e-05,1e-06,0,-1e-06,5e-06,3e-06,5e-06,3e-06,-4e-06,1.7e-05,5e-06,-1e-06,-3e-06,2e-06,1e-06,-1e-06,-6e-06,-2e-06,0,-1e-06,1.4e-05,-3e-06,5e-06,1e-06,-1e-06,1e-06,4e-06,-1e-06,-2e-06,-1e-06,-3e-06,1e-06,-3e-06,0,-7e-06,-2e-06,-1e-05,0,-1e-06,1e-06,-1e-06,-1e-06,-2e-06,0,4e-06,-1e-06,2e-06,-1e-06,-4e-06,4e-06
0,-1e-05,0,0,3e-06,1e-06,1e-06,0,0,2e-06,1e-05,-1e-06,5e-06,-3e-06,2e-06,-3e-06,-1.4e-05,0,0,-4e-06,1e-06,1e-06,-9e-06,1e-06,-6e-06,0,-2e-06,1e-06,-7e-06,5e-06,9e-06,0,1.1e-05,0,0,0,2e-06,-1e-06,0,-4e-06,4e-06,1e-06,3e-06,0,-3e-06,-8e-06,1e-06,1.1e-05,-2e-06,3e-06,5e-06,2e-06,2e-06,1e-06,-1e-06,1e-06,1e-06,-1e-06,-1e-06,-7e-06,0,0,-3e-06,-3e-06,0,-1e-06,1e-06,-1e-06,-3e-06,3e-06,2e-06,-1e-06,0,-1e-06,-1e-06,4e-06,-6e-06,1e-06,9e-06,3e-06,-1.1e-05,-1e-06,4e-06,0,1e-06,-1e-06,-2e-06,8e-06,1e-06,0,0,-1e-06,5e-06,2e-06,-1e-06,1e-06,-1e-06,-5e-06,-7e-06,1.5e-05,4e-06,-9e-06,0,2e-06,0,7e-06,0,-7e-06,-2e-06,0,0,1e-06,0,-2e-06,-1e-06,-3e-06,1e-06,0,4e-06,-8e-06,1e-06
0,-4e-06,2e-06,6e-06,0,-2e-06,0,-3e-06,2e-06,-1e-06,-4e-06,1e-06,-2e-06,3e-06,-3e-06,-5e-06,3e-06,4e-06,0,6e-06,2e-06,0,1e-06,-3e-06,2e-06,0,0,0,6e-06,-6e-06,2e-06,2e-06,1e-06,-2e-06,-2e-06,-1e-06,1e-06,-2e-06,1e-06,2e-06,4e-06,1e-06,6e-06,2e-06,3e-06,3e-06,1e-06,-1.1e-05,-2e-06,0,-5e-06,-3e-06,-3e-06,-2e-06,7e-06,0,3e-06,1e-06,-2e-06,8e-06,-1e-06,0,2e-06,1.1e-05,2e-06,4e-06,0,-1e-06,5e-06,-3e-06,0,1e-05,0,1e-06,-2e-06,4e-06,4e-06,-7e-06,3e-06,9e-06,9e-06,-3e-06,3e-06,1e-06,-5e-06,-1e-06,-1e-06,-5e-06,-3e-06,0,1e-06,-1.5e-05,5e-06,-1e-06,-1e-06,-1e-06,-3e-06,0,6e-06,-1.4e-05,-2e-06,-6e-06,0,0,0,-5e-06,0,-6e-06,1e-06,0,-1e-06,0,1e-06,1e-06,1e-06,3e-06,0,-2e-06,-4e-06,-4e-06,-5e-06
0,6e-06,-2e-06,-9e-06,0,2e-06,-1e-06,4e-06,-2e-06,-2e-06,-1e-06,-1e-06,-1e-06,2e-06,2e-06,4e-06,4e-06,0,0,-7e-06,0,-1e-06,3e-06,3e-06,-6e-06,0,1e-06,-2e-06,2e-06,7e-06,-6e-06,-1e-06,-1.3e-05,0,2e-06,-1e-06,-3e-06,0,-1e-06,9e-06,-1e-06,-2e-06,-1e-06,-1e-06,-1e-06,5e-06,-2e-06,2e-06,-1e-06,1e-06,-3e-06,2e-06,-2e-06,3e-06,-8e-06,0,-5e-06,1e-06,1e-06,-4e-06,0,-1e-06,0,1e-06,-5e-06,-2e-06,1e-06,2e-06,-6e-06,-7e-06,1e-06,-2e-06,-2e-06,-1e-06,-2e-06,-9e-06,1e-06,-5e-06,-1.9e-05,-2e-06,-1.3e-05,5e-06,-1e-06,2e-06,5e-06,1e-06,-2e-06,-2e-06,5e-06,0,-3e-06,0,1e-06,-4e-06,1e-06,0,2e-06,5e-06,3e-06,9e-06,-1e-06,4e-06,-2e-06,0,0,2e-06,0,9e-06,0,0,1e-06,-3e-06,0,4e-06,0,-4e-06,1e-06,2e-06,4e-06,5e-06,8e-06
