0.000135,0.000123,0.00068,1.1e-05,8e-06,0.00012,3.6e-05,0.000102,4.5e-05,0.000431,0.000398,0.000224,0.000379,8e-06,0.000102,0.000181,6.2e-05,0.000236,0.000131,3e-05,0.000176,0.00014,0.000109,0.000285,2e-06,7e-05,0.000271,0.000446,0.000215,0.000221,0.000118,4.9e-05,0.000118,5.6e-05,0.000196,9.8e-05,9.1e-05,0.000347,0.000453,9.9e-05,0.000218,0.000331,0.000546,1e-05,5e-06,0.000112,2.4e-05,1.2e-05,1.3e-05,0.000348,0.000245,3.7e-05,0.000662,0.000193,0.000335,0.000114,0.000158,0.000397,0.000531,8.8e-05,0.000695,6.4e-05,0.000129,0.000612,0.000316,0.000191,0.000514,4e-06,0.000125,0.000261,1.1e-05,0.000208,0.000257,0.000178,0.000469,4.9e-05,0.000363,9.9e-05,0.000322,9.8e-05,0.000105,2.2e-05,2.1e-05,0.000241,0.000133,2.8e-05,0.000302,0.000141,0.000444,3.5e-05,0.000307,0.000183,0.00026,3.6e-05,5.9e-05,0.00013,0.000255,9e-06,0.000153,0.000143,0.000236,9.1e-05,8.6e-05,0.000459,0.00011,0.000308,0.000153,0.000214,0.000116,0.000412,0.000185,2e-05,0.000228,6.7e-05,0.000206,0.000242,1.5e-05,2.5e-05,0.000292,3.4e-05,0.000547
0.000549,0.000182,0.001356,0.000221,0.00035,0.000197,0.000197,0.000173,0.000482,0.001028,0.000765,0.000118,0.000585,0.000207,0.000403,0.000437,0.00012,0.000579,0.000249,0.000381,0.000232,0.000562,0.000178,0.000228,0.000313,0.000219,0.000594,0.00089,0.000338,0.000189,0.000212,0.000178,0.000228,0.000288,0.000575,1e-04,0.000153,0.000761,0.000743,0.000151,0.000416,0.00083,0.000955,0.000186,9.8e-05,0.000292,0.000169,0.00019,0.000247,0.000641,0.000639,0.000495,0.00088,0.000538,0.000983,0.000283,0.000538,0.00083,0.000701,0.000759,0.000648,0.000496,0.000474,9e-04,0.00133,0.000418,0.001368,0.000554,0.000273,0.000484,0.000207,0.000372,0.000706,0.000394,0.001308,0.000349,0.001071,0.00038,0.000702,0.000408,0.000308,0.000121,0.00026,0.000294,0.000552,0.000478,0.000344,0.00018,0.001238,0.000336,0.00088,0.000552,0.000517,9.4e-05,0.000199,0.000286,0.000553,0.000149,0.000222,0.000324,0.000539,0.000184,0.000193,0.00106,0.000453,0.000555,9.2e-05,0.000596,0.000435,0.000614,0.000399,0.000151,0.000604,0.000228,0.00047,0.000388,0.000277,0.000295,0.000636,0.000278,0.001454
0.000384,0.000587,0.001181,0.000621,0.000224,0.000399,0.000561,8e-05,0.000307,0.00109,0.000557,0.000723,0.001109,0.000196,0.000124,0.00019,0.000254,0.000558,8.6e-05,0.000285,9.5e-05,0.000673,0.000537,0.000705,0.000217,0.000132,0.000893,0.001049,0.000391,0.000527,0.000536,0.000365,0.000586,0.000826,0.000501,0.000145,9.7e-05,0.000914,0.001343,0.000733,0.000692,0.000639,0.001289,3.8e-05,0.000111,0.000406,0.000645,0.000344,0.000418,0.000616,0.000408,0.000151,0.000949,0.000296,0.001236,0.000968,0.000275,0.001341,0.000649,0.000474,0.000974,0.000169,0.000936,0.001105,0.001499,0.000809,0.001166,0.000356,0.000666,0.000656,0.000671,0.000478,0.000787,0.000122,0.001909,0.000638,0.001532,0.000526,0.000633,0.000471,0.000238,0.000402,0.000879,0.000423,0.000637,0.000228,0.000794,0.000422,0.001023,0.00038,0.000809,0.000435,0.000615,0.000311,0.000293,0.000367,0.000508,0.000281,6e-04,0.00012,0.000593,0.000676,0.000743,0.000947,0.000849,0.000982,0.000279,0.000639,0.000411,0.000945,0.000511,0.000456,0.000549,0.000158,0.000335,0.000598,8.7e-05,0.000174,0.00047,0.000398,0.001491
0.000584,0.000552,0.001773,0.000833,0.00045,0.000613,0.000476,0.001237,0.000263,0.00129,0.000933,0.001162,0.000812,0.001094,0.000235,0.000407,4.9e-05,0.000533,0.000425,0.001115,0.000543,0.00107,0.00026,0.000799,0.000185,0.000499,0.000857,0.001267,0.000596,0.000793,0.000492,0.000159,0.000896,0.000596,0.000575,0.000186,0.000654,0.001076,0.001578,0.000547,0.001032,0.001064,0.00174,0.000462,0.00026,0.000728,0.000337,0.000825,0.001265,0.001697,0.000199,0.000269,0.001372,0.000961,0.000782,0.000735,0.000943,0.000959,0.00057,0.000789,0.001,0.000848,0.002008,0.000225,0.000931,0.000564,0.00092,0.000384,0.001478,0.001337,0.001005,0.000494,0.000257,0.000388,0.002361,0.000676,0.001606,0.000223,0.000978,0.000261,0.000405,0.000115,0.000836,0.000912,0.001326,0.000551,0.001143,0.000938,0.001275,0.000739,0.001234,0.000835,0.000901,0.000835,0.000275,0.001,0.000848,0.000249,0.000545,5e-05,0.000869,0.000758,0.000492,0.000881,0.001564,0.000678,0.000391,0.000641,0.000254,0.001094,0.000972,0.000758,0.000503,0.000437,0.000585,0.000918,0.000273,0.000507,0.000838,0.00032,0.001955
0.000905,0.000277,0.001732,0.000417,0.00141,0.001601,0.00094,0.001739,0.002523,0.001651,0.002775,0.000733,0.001116,0.000733,0.000968,0.001356,0.000339,0.000938,0.000652,0.001069,0.002291,0.000955,0.001121,0.001217,0.00055,0.00098,0.000644,0.001188,0.000421,0.001081,0.000148,0.000608,0.000914,0.00118,0.001396,0.000441,0.001139,0.002497,0.001168,0.001046,0.001826,0.000762,0.001748,0.001692,0.001537,0.000903,0.000963,0.001203,0.001231,0.000791,0.000617,0.000434,0.001211,0.000957,0.00117,0.000598,0.000642,0.00137,0.001733,0.000726,0.000541,0.001413,0.002056,0.002457,0.002489,0.001779,0.001846,0.001985,0.00143,0.001023,0.002713,0.002532,0.000546,0.00079,0.003104,0.001865,0.001918,0.000814,0.002044,0.001959,0.000387,0.000748,0.001292,0.002079,0.000844,0.001709,0.002195,0.00243,0.003638,0.001641,0.000811,0.000606,0.000517,0.001127,0.001045,0.000894,0.00089,0.000473,0.00069,0.000318,0.000627,0.002044,0.001312,0.000603,0.000698,0.001046,0.000253,0.001022,0.001043,0.001083,0.001742,0.003214,0.003874,0.002094,0.000769,0.001176,0.001568,0.000244,0.001106,0.000341,0.002882
0.002873,0.002536,0.002419,0.000214,0.001958,0.000663,0.000764,0.002302,0.002242,0.002123,0.003797,0.001843,0.001411,0.002267,0.000781,0.001068,0.000699,0.002473,0.002258,0.00166,0.002256,0.000309,0.003021,0.002894,0.0016,0.000311,0.001723,0.001699,0.001952,0.001238,0.001272,0.001394,0.001094,0.000907,0.001568,0.001985,0.000271,0.002335,0.002873,0.001892,0.002092,0.00283,0.00256,0.001564,0.002215,0.000729,0.001601,0.001888,0.002438,0.003516,0.00192,0.002329,0.000877,0.000681,0.003139,0.003308,0.001921,0.00116,0.000343,0.00135,0.000679,0.001008,0.002643,0.001,0.004453,0.002935,0.002562,0.002195,0.002496,0.004467,0.005478,0.001788,0.00175,0.000985,0.003399,0.003788,0.002905,0.002248,0.003717,0.002175,0.001587,0.002565,0.002105,0.000756,0.001994,0.002881,0.001747,0.000339,0.004132,0.002656,0.002549,0.002965,0.002007,0.000659,0.000391,0.000935,0.001802,0.000646,0.002766,0.001446,0.000989,0.001076,0.001725,0.001974,0.002241,0.000832,0.001867,0.001226,0.002374,0.00182,0.00054,0.003537,0.003625,0.002277,0.002676,0.000738,0.001073,0.001064,0.00229,0.001175,0.00369
0.002482,0.002609,0.004953,0.00285,0.003494,0.002278,0.000956,0.001712,0.004976,0.004873,0.004751,0.003139,0.002724,0.004313,0.003893,0.00228,0.002757,0.003953,0.002296,0.001521,0.000457,0.00262,0.004055,0.005974,0.004191,0.003775,0.004914,0.004992,0.005242,0.004264,0.004939,0.002926,0.002802,0.001487,0.00164,0.002969,0.001966,0.00411,0.00068,0.003543,0.001956,0.001646,0.001336,0.002431,0.004972,0.002744,0.002837,0.002291,0.004803,0.005408,0.003762,0.004649,0.004116,0.003975,0.003963,0.00378,0.001062,0.002195,0.005049,0.003329,0.005289,0.000808,0.000602,0.004321,0.004404,0.00391,0.001972,0.002622,0.002466,0.005713,0.000961,0.003461,0.00251,0.001393,0.001594,0.001074,0.002608,0.002968,0.00227,0.002287,0.001848,0.002837,0.001417,0.001006,0.003148,0.002947,0.001141,0.000255,0.003736,0.00199,0.001519,0.002749,0.000535,0.001946,0.001528,0.003433,0.003782,0.003908,0.004261,0.001585,0.002945,0.001266,0.001429,0.000945,0.003549,0.006002,0.003488,0.001469,0.002796,0.002179,0.001045,0.003812,0.003808,0.000564,0.001132,0.00127,0.001438,0.001401,0.001568,0.001084,0.002879
0.007533,0.005027,0.003254,0.005304,0.001954,0.000556,0.001601,0.002035,0.008161,0.002371,0.003062,0.005196,0.005307,0.001354,0.005072,0.00306,0.004078,0.005125,0.002947,0.001293,0.003221,0.003992,0.002434,0.002605,0.001768,0.00359,0.002573,0.005829,0.009616,0.004771,0.004506,0.006756,0.004497,0.005063,0.005292,0.004279,0.002596,0.005346,0.00624,0.00685,0.006298,0.00204,0.001328,0.004242,0.003552,0.003702,0.001971,0.000865,0.004414,0.006681,0.008876,0.002467,0.001179,0.004293,0.00519,0.002609,0.004179,0.005234,0.004978,0.00281,0.007664,0.008578,0.003429,0.007993,0.000759,0.007707,0.009181,0.009393,0.009486,0.005411,0.004225,0.007218,0.003936,0.000638,0.00041,0.001052,0.003013,0.003434,0.004783,0.004463,0.004569,0.007152,0.002115,0.001731,0.003469,0.006419,0.006333,0.003639,0.001962,0.003976,0.002101,0.00154,0.00281,0.002953,0.001507,0.002898,0.003046,0.003493,0.002784,0.002709,0.003704,0.004666,0.001029,0.001342,0.003705,0.006618,0.007641,0.005823,0.003525,0.003097,0.003525,0.003674,0.005623,0.005437,0.002988,0.000887,0.002708,0.001277,0.001888,0.003238,0.002278
0.004327,0.002321,0.005243,0.00657,0.006686,0.00438,0.003873,0.004345,0.006909,0.006137,0.006049,0.006,0.003833,0.005983,0.005598,0.002882,0.004185,0.005,0.00238,0.002327,0.00348,0.002027,0.003572,0.002389,0.002311,0.002477,0.003956,0.001733,0.003541,0.006055,0.005238,0.001709,0.004538,0.004744,0.002751,0.001416,0.002251,0.004155,0.006798,0.007063,0.001069,0.001559,0.003912,0.005637,0.007449,0.002988,0.000515,0.00359,0.00351,0.004618,0.005719,0.007219,0.004555,0.003918,0.001124,0.002178,0.00678,0.004934,0.007597,0.008733,0.006088,0.001573,0.008924,0.013767,0.01456,0.01358,0.002655,0.003522,0.003351,0.002156,0.006087,0.005118,0.003796,0.003673,0.003589,0.004168,0.004458,0.001478,0.002026,0.000507,0.002797,0.005127,0.005512,0.003564,0.001353,0.003286,0.003665,0.002726,0.001709,0.001125,0.000966,0.003295,0.004578,0.002599,0.002467,0.002066,0.000275,0.004507,0.002325,0.002319,0.001644,0.003819,0.004049,0.000438,0.001149,0.005232,0.001949,0.003055,0.002947,0.002398,0.002368,0.003513,0.000294,0.001542,0.002112,0.00303,0.003177,0.002028,0.002192,0.003764,0.004589
0.001824,0.000548,0.002966,0.002403,0.002651,0.000665,0.001903,0.002329,0.001796,0.002032,0.003127,0.000343,0.002,0.003252,0.000922,0.000488,0.002576,0.001051,0.000402,0.000614,0.002643,0.002003,0.002387,0.001574,0.001362,0.001594,0.00188,0.002674,0.00119,0.004739,0.001599,0.0025,0.000575,0.003371,0.001588,0.002347,0.002691,0.003771,0.002138,0.000968,0.000799,0.000635,0.001797,0.001642,0.001886,0.001721,0.000564,0.002589,0.000675,0.001765,0.001778,0.002338,0.001017,0.001937,0.000267,0.002516,0.005818,0.001744,0.003756,0.002801,0.002081,0.003413,0.006734,0.0026,0.00789,0.001344,0.001573,0.001318,0.00315,0.001867,0.003501,0.000718,0.003071,0.001145,0.002965,0.00265,0.000977,0.000181,0.000559,0.003129,0.001666,0.006298,0.005224,0.002863,0.001649,0.002213,0.000224,0.001036,0.000626,0.000896,0.00065,0.0036,0.003135,0.00358,0.002522,0.001383,0.001355,0.002053,0.001185,0.000842,0.001393,0.002289,0.003166,0.002948,0.002426,0.001506,0.001249,0.001667,0.001778,0.001614,0.001477,0.001126,0.001002,0.000906,0.001385,0.002987,0.001654,0.000507,0.001272,0.002526,0.001491
0.003165,0.002594,0.002312,0.002406,0.00147,0.001969,0.000681,0.003289,0.002639,0.00167,0.000389,0.000651,0.000924,0.002226,0.000558,0.001407,0.002028,0.001628,0.001385,0.002902,0.001505,0.001809,0.001625,0.002326,0.002373,0.00186,0.001317,0.001587,0.002787,0.001057,0.001445,0.001667,0.000759,0.002003,0.000842,0.001936,0.000302,0.001302,0.000656,0.000995,0.001667,0.001819,0.001489,0.001367,0.0015,0.000941,0.001704,0.001089,0.000559,0.00154,0.001616,0.002033,0.002992,0.001339,0.00116,0.001862,0.000767,0.000957,0.000584,0.002018,0.002944,0.001976,0.00185,0.001608,0.004252,0.004523,0.003753,0.001986,0.001764,0.002166,0.002416,0.001936,0.003818,0.003035,0.003652,0.001981,0.001345,0.000896,0.001051,0.003934,0.002814,0.00552,0.00209,0.001426,0.001206,0.000455,0.000586,0.001558,0.001488,0.002988,0.002733,0.004071,0.001691,0.001636,0.000706,0.002289,0.001438,0.000958,0.000579,0.001075,0.000501,0.001292,0.001017,0.000809,0.001298,0.000246,0.000943,0.001702,0.002553,0.001167,0.000741,0.000649,0.000926,0.002082,0.000823,0.002439,0.001745,0.001552,0.00109,0.00212,0.002034
0.001836,0.002013,0.001477,0.000862,0.001039,0.000736,0.001173,0.001258,0.000888,0.001576,0.001578,0.000246,0.000336,0.000598,0.001255,0.001007,0.000716,0.000715,0.000865,0.00188,0.000608,0.000981,0.001975,0.001904,0.000683,0.000543,0.000853,0.000972,0.002674,0.002703,0.000598,0.000149,0.000654,0.000837,0.001012,0.00108,0.00102,0.002339,0.00182,0.000438,0.001813,0.001712,0.001434,0.000825,0.001632,0.000323,0.001767,0.001275,9e-04,0.002124,0.002967,0.003043,0.001592,0.000623,0.000924,0.00219,0.001968,0.001018,0.002544,0.002332,0.001625,0.002586,0.002304,0.001836,0.000421,0.000666,0.003022,0.001945,0.000644,0.001085,6e-04,0.001777,0.001229,0.00049,0.000818,0.001517,0.000162,0.000181,0.001449,0.001277,0.001148,0.001519,0.001212,0.000673,0.001327,0.000196,0.001049,0.001532,0.001334,0.001582,0.001351,0.000341,0.000162,0.000811,0.000256,0.002461,0.001133,0.00074,0.000513,0.000915,0.00023,0.001252,0.000876,0.000687,0.000249,0.001171,0.001093,0.001137,0.000402,0.001621,0.00044,0.000517,0.00063,0.001754,0.001159,0.001502,0.000625,0.000378,0.000257,0.00103,0.001451
0.00069,0.000872,0.00058,0.001278,0.000413,0.000335,3.9e-05,0.000428,0.000453,0.000956,0.000779,0.000244,0.000714,0.000957,0.000592,0.000254,0.000569,0.000196,0.001053,0.000704,0.000318,0.000323,0.000844,0.001293,0.000241,0.000595,0.000295,0.001759,0.001221,0.00165,0.000316,0.000532,0.000887,0.000423,0.001004,0.000505,2e-04,0.001502,0.000695,0.000616,0.00088,0.000473,0.000517,0.00022,0.000805,0.000436,0.00113,0.000329,0.000717,0.002121,0.001339,0.001925,0.000774,0.000376,0.000526,0.001747,0.00135,0.001736,0.001735,0.001407,0.000722,0.001746,0.00196,0.001828,0.000937,0.000695,0.00139,0.000913,0.002176,0.000842,0.001356,0.001938,0.000638,0.000428,0.000521,0.001261,0.000444,0.000701,0.000944,0.000625,0.000741,0.000345,0.00077,3.7e-05,0.001174,0.000559,0.001146,0.000964,0.000453,0.001051,0.000684,0.000177,0.000447,0.001229,0.000194,0.00089,0.000896,0.000951,0.000181,0.000467,0.000916,0.000409,0.000343,0.000206,0.000804,0.001137,0.000715,0.000889,0.000768,0.000299,0.000433,0.000697,0.000518,0.000701,4.1e-05,0.000895,0.00036,0.000213,0.000431,0.000361,0.00094
0.000556,0.000886,0.001878,0.000795,0.000618,0.00073,0.00021,0.001378,0.000737,0.000331,0.000735,0.000717,0.00092,0.000924,0.000902,0.000227,0.001269,0.000542,0.000849,0.000218,7e-04,0.001299,0.001498,0.000878,0.000569,0.000917,0.000779,0.001857,0.001244,0.001016,0.000359,0.000287,0.000548,0.000819,0.000939,0.001069,0.000568,0.000858,0.000222,0.000685,0.000797,8.7e-05,0.000752,0.000472,0.000548,0.00053,0.000771,0.000851,0.00178,0.001904,0.000603,0.001317,0.000854,0.00078,0.000303,0.001833,0.001718,0.001005,0.0018,0.001849,0.000692,0.001913,0.002783,0.002211,0.00171,0.000483,0.000816,0.000501,0.002119,0.001196,0.001183,0.001627,0.001355,0.002289,0.002176,0.002189,0.000726,0.001261,0.001645,0.002293,0.000667,0.001519,0.001959,0.000892,0.001248,0.000763,0.000604,0.001129,0.00146,0.0013,0.000347,0.000488,0.000186,0.001319,0.001493,0.000884,0.001133,0.000891,0.001055,0.001017,0.001123,0.001096,0.000716,0.000863,0.001363,0.001102,0.000493,0.000556,0.001342,0.000173,0.000309,0.001086,0.000429,0.000727,0.000184,0.001309,0.000582,5.7e-05,0.000105,0.000352,0.000267
0.000919,0.000362,0.00166,0.003258,0.002243,0.000873,0.000442,0.001269,0.000739,0.00011,0.000208,0.001308,0.000885,0.000625,0.000526,0.000734,0.00135,0.00098,0.000597,0.00142,0.001334,0.000704,0.001908,0.000732,0.000709,0.001736,0.001969,0.000911,0.000811,0.00156,0.000559,0.000226,0.000506,0.001012,0.001032,0.001678,0.001102,0.000666,0.000582,0.000393,0.001046,0.000766,0.001564,0.000329,0.001235,0.000969,0.000968,0.001321,0.001531,0.001585,0.002643,0.001873,0.00206,0.000767,0.000715,0.001645,0.000712,0.001136,0.000809,0.001257,0.003206,0.003306,0.000858,0.000758,0.000919,0.00167,0.000663,0.001135,0.002735,0.00169,0.001625,0.002424,0.001234,0.002091,0.000576,0.002359,0.002072,0.002616,0.000369,0.001098,0.000777,0.001976,0.000285,0.000978,0.002715,0.003045,0.002487,0.001011,0.001546,0.003047,0.001445,0.001591,0.001583,0.000493,0.001461,0.002567,0.001404,0.002305,0.002049,0.000932,0.000177,0.000679,0.001391,0.002258,0.001065,0.00206,0.001364,0.000417,0.001308,0.0018,0.001606,0.001252,0.0019,0.000105,0.000543,0.001175,0.001063,0.000477,0.000312,0.001366,0.001036
0.000886,0.001344,0.001775,0.002918,0.001898,0.000423,0.000298,0.000946,0.001817,0.001115,0.000283,0.00087,0.000892,0.00023,0.000634,0.000178,0.001326,0.000552,0.000239,0.001556,0.000386,0.000924,0.000543,0.001353,0.00089,0.00093,0.00079,0.002091,0.001776,0.003092,0.002248,0.001214,0.000835,0.000954,0.002408,0.000627,0.000773,0.000498,0.00142,0.001612,0.000346,0.000794,0.000849,0.000602,0.000677,0.00058,0.001546,0.00054,0.001277,0.002234,0.000714,0.000252,0.002192,0.001563,0.001117,0.000417,0.002095,0.000301,0.001766,0.000532,0.001927,0.00108,0.001397,0.00122,0.002058,0.00129,0.002229,0.001618,0.000827,0.001724,0.001854,0.001983,0.001318,0.001629,0.002388,0.001324,0.00106,0.000837,0.001122,0.000599,0.000577,0.001622,0.001599,0.000831,0.001222,0.001257,0.002243,0.001802,0.000551,0.001577,0.001331,0.000695,0.001665,0.00039,0.000686,0.000654,0.00112,0.000843,0.001886,0.000796,0.000513,0.000494,0.001165,0.001649,0.001377,0.001637,0.001186,0.000834,0.001891,0.002099,9e-04,0.001985,0.001051,0.000903,0.001683,0.001142,0.001017,0.00072,0.000618,0.000828,0.001162
0.000773,0.002103,0.001613,0.00307,0.001684,0.000512,4.6e-05,8.5e-05,0.001727,0.001624,0.000179,0.00058,0.000607,0.000615,0.001299,0.001173,0.002073,0.001318,0.000221,0.001877,0.001303,0.001183,0.000411,0.000548,0.001013,0.000926,0.001504,0.001396,0.001788,0.000754,0.000482,0.000578,0.00134,0.000108,0.001992,0.001594,0.000201,0.001582,0.001878,0.00061,0.000358,0.000254,0.000504,0.000914,0.000913,0.001548,0.001812,0.001395,0.000812,0.001729,0.001588,0.00059,0.00143,0.001778,0.000755,0.00149,0.001505,0.001885,0.001356,0.00141,0.001218,0.000453,0.000877,0.000603,0.001913,0.001787,0.00162,0.002484,0.000606,0.001911,0.000384,0.001686,0.00139,0.000756,0.001653,0.00251,0.001647,0.001041,0.00048,0.000631,0.001814,0.001019,0.00049,0.001451,0.000633,0.001139,0.002116,0.000723,0.001405,0.00056,0.000398,0.001234,0.000806,0.001462,0.000168,0.001456,0.000916,0.000768,0.001591,0.000561,0.000499,0.000607,0.000111,0.002037,0.000865,0.00059,0.000995,0.000774,0.001736,0.000779,0.001047,0.001084,0.000929,0.000377,0.001769,0.001228,0.000974,0.00087,0.000449,0.000255,0.000807
0.002151,0.000741,0.000911,0.000514,0.000354,0.000312,0.00063,0.000431,0.00142,0.000931,0.001617,0.001957,0.001638,0.001505,0.001055,0.000466,0.001644,0.000725,0.00019,0.001724,0.000551,0.001202,0.001248,0.00152,0.00036,0.001051,0.000751,0.001866,0.001029,0.00265,0.001342,0.001214,0.000471,0.000451,0.000687,0.000935,0.001213,0.002369,0.001702,0.001788,0.001211,0.000703,0.001335,0.001628,0.001866,0.001889,0.001069,0.001112,0.003303,0.003635,0.002252,0.001588,0.000513,0.001315,0.001502,0.00089,0.00177,0.001922,0.002237,0.000329,0.001619,0.001155,0.001568,9e-04,0.001314,0.001968,0.001049,0.002945,0.002091,0.001721,0.00214,0.000815,0.000716,0.001805,0.002003,0.001874,0.001905,0.001259,0.000643,0.001024,0.002482,0.002681,0.001224,0.001973,0.000874,0.001469,0.000954,0.00109,0.00073,0.000936,0.000508,0.001569,0.00092,0.00094,0.002044,0.001942,0.001838,0.002356,0.001318,0.002313,0.001014,0.000801,0.001354,0.001885,0.001108,0.00026,0.001708,0.000693,0.001979,7e-05,0.000219,0.000994,0.000653,0.001405,0.000528,0.000493,0.001526,0.001293,0.000835,0.001854,0.001182
0.001216,0.00121,0.000836,0.000408,0.000745,0.000834,0.000773,0.000591,0.00039,0.001588,9.7e-05,0.001444,0.001634,0.000446,0.001547,0.000613,0.001347,0.001023,0.000484,0.000441,0.001109,0.001831,0.000953,0.001241,0.00146,0.001287,0.001685,0.002911,0.001924,0.002887,0.002006,0.000177,0.001311,0.001321,0.001744,0.001202,0.000309,0.001317,0.000144,0.000885,0.001518,0.00217,0.001015,0.001201,0.000131,0.001419,0.002508,0.001219,0.002985,0.002246,0.000997,0.002552,0.002466,0.001337,4e-04,0.000603,0.001906,0.001354,0.000405,0.001217,0.001464,3e-04,0.00064,0.001444,0.002199,0.001459,0.000621,0.002674,0.002542,0.00096,0.002109,0.001195,0.001507,0.002284,0.001381,0.002911,0.000916,0.001197,0.000367,0.00116,0.001506,0.000976,0.001356,0.002398,0.00201,0.002369,0.001605,0.000921,0.00054,0.000369,0.000359,0.001648,0.001416,0.001252,0.002156,0.001101,0.001218,0.001317,0.001805,0.001746,0.000835,0.000943,0.001803,0.00069,0.000988,0.000587,0.001273,0.0015,0.001873,0.002212,0.001676,0.001573,0.000419,0.000801,0.001476,0.001579,0.001423,0.000584,0.000143,0.001993,0.000731
0.003163,0.001172,0.000731,0.000925,0.001146,8.8e-05,0.001004,0.00064,0.000583,0.001107,0.001451,0.000817,0.000923,0.001116,0.001165,0.001055,0.000796,0.000454,0.000237,0.001093,0.001092,0.000916,0.000375,0.00146,0.00104,0.000672,0.000781,0.001332,0.001722,0.000582,0.000453,0.001511,0.000624,0.001433,0.000988,0.000113,0.000689,0.000506,0.000261,0.001302,0.000733,0.001311,0.001258,0.001086,6e-04,0.000745,0.001613,0.001487,0.001924,0.00242,0.001574,0.003548,0.002166,0.001238,0.000533,0.000186,0.000632,0.000714,0.001185,0.001372,0.001163,0.000243,0.000746,0.001735,0.001614,0.002284,0.000679,0.002317,0.001208,0.002263,0.001292,0.001453,0.001265,0.002652,0.00062,0.001526,0.000471,0.001475,0.0013,0.001384,0.000487,0.000439,0.001901,0.002138,0.000719,0.001312,0.000889,0.000547,0.00133,0.000485,0.000652,0.001114,0.000777,0.000876,0.00125,0.00123,0.002003,0.000461,0.00161,0.001663,0.000814,0.001087,0.000865,0.000919,0.000493,0.000857,0.001023,0.000804,0.001045,0.001422,0.000246,0.000619,0.000489,0.000755,0.001714,0.001068,0.001885,0.001184,0.000709,0.001757,0.00226
0.001614,0.000424,0.000181,0.000373,0.001428,0.001361,0.001139,0.001062,0.001294,0.001321,0.000381,0.000322,0.000947,0.000375,0.000731,0.001027,0.001122,0.000211,0.000453,0.001012,0.000204,0.000785,0.000671,0.001225,0.000476,0.000874,0.001326,0.000467,0.000835,0.000482,0.000177,0.001067,0.001564,0.00056,0.001013,0.000535,0.000946,0.000599,0.000547,0.000791,0.001239,0.001925,0.000776,0.000887,0.000517,0.00038,0.001444,4.1e-05,0.000408,0.00124,0.000376,0.001895,0.001233,0.000398,0.000135,0.000771,0.001104,0.001032,0.000823,0.001369,0.000799,0.001116,0.000773,0.001255,0.00057,0.001682,0.001675,0.002299,0.000335,0.001039,0.000371,0.000996,0.001422,0.001186,0.000506,0.000733,0.001018,0.001029,0.000647,0.001244,0.002222,0.001232,0.001481,0.000447,0.001398,0.00125,0.000931,0.000632,0.001164,0.001085,0.000945,4e-04,0.000666,0.000751,0.000806,0.000347,0.0011,0.000489,0.001436,0.000977,0.000635,0.000716,0.000203,0.000613,0.001023,0.000484,0.001046,0.000203,0.000421,0.000387,0.000403,0.000622,0.000867,0.000768,0.00115,0.000426,0.000846,0.00036,0.00037,0.000642,0.001335
0.000504,0.001101,0.00039,0.000455,0.000745,0.000204,0.000534,0.000576,0.000766,0.000389,0.000609,0.00044,0.00055,0.001114,0.000659,0.000802,0.000477,0.000516,0.000519,0.000932,0.000757,0.000481,0.000127,0.00042,9e-05,0.000631,0.001094,0.000468,0.000532,0.000495,0.00022,0.000692,0.00027,0.000409,0.000651,0.00045,0.00081,0.000841,0.000956,0.000463,0.000325,0.000833,0.001105,0.001121,0.000433,0.000312,0.000358,0.000557,0.000962,0.001311,0.000797,0.000517,0.00034,0.000332,0.000522,0.000443,0.000871,0.000297,0.000544,0.000528,0.000482,0.000734,0.000445,0.000623,0.000246,0.000989,0.000739,0.000301,0.001124,0.001099,0.000256,0.000609,4.5e-05,0.000914,0.00079,0.001253,0.000436,0.000686,0.001177,0.000782,0.001079,0.000453,0.001033,0.000747,0.000667,0.000177,0.000756,0.000445,0.001244,0.000849,0.000812,0.000257,0.000108,0.000703,0.000456,0.000286,0.000504,0.000788,0.000258,0.000508,4.3e-05,0.000567,0.00046,6e-04,0.000312,0.000609,0.001017,0.000487,0.000326,0.000396,0.000229,0.00071,0.000611,0.000241,0.000725,0.000438,0.000265,0.000657,0.00044,0.000175,0.000775
7.7e-05,0.000394,0.000145,8.2e-05,8.9e-05,9.5e-05,0.000144,0.00015,6.4e-05,0.000125,0.00015,0.000183,0.000174,0.000418,0.000221,0.000237,9e-05,0.000155,0.000122,0.000167,7.7e-05,8.1e-05,0.000109,0.000234,0.000229,0.000162,0.000322,9e-06,0.000218,8.3e-05,0.000124,0.000188,0.000222,0.000119,0.000281,0.000162,0.000251,0.00032,0.000191,8e-05,4.9e-05,0.000241,0.000331,0.000141,0.000105,0.000228,0.000191,0.000189,0.000584,0.000443,0.00027,0.000293,5.7e-05,0.00025,0.000131,0.000129,0.000246,0.000348,0.000124,0.000177,0.000143,6.8e-05,0.000323,0.000418,0.000201,8.1e-05,0.000133,0.000127,0.000199,0.000338,0.000213,9.4e-05,7.1e-05,0.000271,0.00026,0.000212,0.000147,0.000141,0.000328,0.000254,0.000386,0.000307,0.00024,0.000107,0.000318,0.000323,0.000198,0.000121,0.000211,0.000135,0.000213,0.000104,0.000164,0.000155,0.000145,0.000184,0.000129,8.3e-05,0.000131,0.000102,0.000121,0.000287,0.00026,0.000256,0.000243,0.000262,0.000222,0.000103,0.000169,0.00013,9.4e-05,0.000283,5.6e-05,0.000183,0.000159,0.000135,0.000262,0.000277,0.000115,0.000134,0.000169
0.000278,0.000269,0.000166,0.000154,0.000111,0.000131,0.000232,0.000233,0.000298,9.9e-05,0.000104,0.000175,4.3e-05,0.000214,0.000178,0.000265,0.000121,7.6e-05,0.000106,0.000137,0.000112,1.8e-05,7.4e-05,0.000317,0.00012,2e-04,0.000462,0.000215,0.000154,9.6e-05,0.000131,0.00011,0.000149,0.000113,0.00014,7.7e-05,0.000175,2e-04,0.000167,0.000191,8.3e-05,0.00019,2.2e-05,0.000233,5.5e-05,0.000172,0.000159,0.000261,0.000419,0.000372,0.000193,0.000182,0.000127,0.000123,0.000274,3.9e-05,0.000183,0.000302,0.00021,7.7e-05,0.000362,0.000173,0.000379,0.00038,0.000276,0.000201,0.000121,0.000209,0.000146,0.000246,7.6e-05,0.000167,7.2e-05,9.5e-05,8.2e-05,0.000157,0.00021,0.000132,0.000227,0.000176,0.000324,0.000289,0.000211,2.2e-05,0.00013,0.000204,5e-06,0.00017,0.000172,0.000133,0.000146,0.000119,0.000232,0.000252,0.000111,0.000169,3e-05,0.000114,0.000126,4.4e-05,7.8e-05,0.000123,0.000226,0.000149,0.000185,3.1e-05,0.000191,0.000114,5.1e-05,6.5e-05,7.9e-05,0.000174,0.000123,0.00011,0.00022,7.6e-05,0.000176,0.000103,0.000138,3.3e-05,5.6e-05
0.000137,0.000385,0.000258,0.000193,5.8e-05,0.000142,0.000171,0.00017,0.000329,0.000188,0.000114,0.000184,0.000202,0.000302,4.7e-05,5.4e-05,0.000263,0.000115,2.9e-05,9.3e-05,4e-05,4e-06,4.7e-05,0.000241,8.9e-05,0.000246,0.000324,0.000141,0.000348,0.000242,8.9e-05,0.000135,0.000143,0.000115,0.000342,7.5e-05,0.000136,0.000358,0.000432,0.000146,5.4e-05,0.000149,0.00014,0.000255,0.000166,6.5e-05,0.000227,8.6e-05,0.000174,0.000415,0.000212,0.000159,0.000179,0.00017,7.6e-05,0.000106,0.000215,0.000122,0.000149,0.000196,0.00026,3e-04,0.000157,0.000329,0.000206,0.000207,5.4e-05,0.000113,0.000253,0.000161,0.000119,0.00011,0.000186,0.000114,0.000187,0.000224,0.000269,0.000108,0.000326,0.000136,0.000158,0.000479,0.000337,9.2e-05,0.000166,6.4e-05,0.000182,2.1e-05,0.000123,0.000178,0.000318,0.000301,5.6e-05,0.000138,0.000127,8.2e-05,6.9e-05,9e-05,3.5e-05,0.000128,4.8e-05,0.000174,0.000246,0.000213,0.000212,0.000187,0.000197,0.000112,4.6e-05,0.000253,0.000191,0.00017,8.6e-05,0.000103,0.000127,0.00012,5.8e-05,6.1e-05,3.4e-05,7.5e-05,1.7e-05
0.000212,0.000254,0.000132,0.000154,5.7e-05,2.3e-05,0.000188,0.00016,0.00017,0.000131,0.000196,0.000106,0.000149,0.000207,4e-06,4.2e-05,0.000165,0.000146,6e-05,2.7e-05,0.00012,3.3e-05,8.3e-05,0.000224,6.7e-05,0.000243,0.000307,0.000136,0.000129,9.1e-05,0.000138,0.000166,0.000139,0.00012,0.000311,0.00018,0.000318,0.000443,9.7e-05,7.5e-05,0.000174,5.9e-05,4e-05,0.000115,8.4e-05,4.9e-05,0.000238,9.1e-05,0.000337,0.000299,9.5e-05,0.000136,0.000164,0.000137,0.000235,3.1e-05,0.000163,0.00014,1.9e-05,7e-05,0.000205,0.000449,0.000283,0.000297,0.000221,0.000133,0.000119,0.00029,0.00013,0.000208,0.000129,8e-05,0.000183,9.9e-05,7.8e-05,0.000129,8.9e-05,5.8e-05,0.000326,0.000196,8.2e-05,0.000234,0.000115,4.2e-05,0.000247,0.000239,0.000101,5e-05,0.000155,0.000175,0.000155,0.000215,7.4e-05,0.000123,9.9e-05,9e-05,0.000212,0.000134,7.9e-05,0.000141,5.7e-05,0.000252,5.7e-05,8.5e-05,9.2e-05,0.000176,0.000133,4e-05,6.5e-05,0.000128,8.2e-05,9.5e-05,6e-05,0.000231,0.000147,0.000134,0.000125,0.00012,0.000147,8.4e-05,1.1e-05
0.000108,0.000222,0.00015,0.00019,0.00013,0.000181,4.3e-05,4.8e-05,5.9e-05,0.000125,0.000137,6.6e-05,0.000199,0.000296,7e-05,0.000123,0.000165,0.000248,9.5e-05,8.2e-05,2.5e-05,5.7e-05,2.9e-05,0.000175,8e-05,0.000158,0.000226,2.4e-05,5.3e-05,0.000127,0.000187,8e-05,0.000192,3.5e-05,0.000208,8.5e-05,0.000263,0.000266,0.000154,0.000204,0.000147,0.000241,0.000215,0.000187,0.000171,0.000146,0.000378,0.000211,0.000325,0.000394,0.000169,5.2e-05,0.000143,2.4e-05,0.000183,0.000271,0.00028,0.000133,9.6e-05,0.000124,0.000152,0.000358,0.000329,0.000287,0.000388,0.000271,0.00014,0.000292,0.000155,0.000261,0.000145,9.2e-05,9.1e-05,4.5e-05,0.000108,7.8e-05,0.000163,9.9e-05,8.8e-05,0.000184,7.3e-05,5.2e-05,0.000285,5.8e-05,0.000165,0.00012,0.000124,7.9e-05,0.000179,8.3e-05,7.6e-05,0.000171,0.000126,5e-05,5.7e-05,0.000125,0.000154,8.1e-05,8.3e-05,0.000124,9e-05,0.000201,0.000122,0.000206,8.5e-05,9.9e-05,8.2e-05,2.2e-05,0.00014,0.000143,7.5e-05,6.2e-05,3.2e-05,0.000204,0.000207,0.000146,8.7e-05,0.000149,8.1e-05,0.000106,7.8e-05
8.3e-05,0.000174,1e-04,0.000197,5.9e-05,6.6e-05,2.9e-05,0.000106,0.000247,0.000136,7.8e-05,0.000125,0.00015,0.000332,1.3e-05,0.000108,0.000105,0.000145,0.000132,7.5e-05,9.4e-05,0.000146,0.000198,0.000327,8.5e-05,5.3e-05,0.000353,0.000139,4.3e-05,0.000213,0.000167,8.9e-05,4.9e-05,0.000131,0.000218,0.00015,0.000135,0.000232,0.000208,7.7e-05,0.000106,0.000195,0.000314,7.6e-05,0.000212,0.000144,0.000409,0.00029,0.000588,0.000319,0.000231,0.000297,6.3e-05,9e-06,0.000184,0.000151,8.4e-05,0.000195,6.6e-05,0.000242,0.000189,0.000247,0.000349,0.000497,0.000418,0.000146,8.6e-05,0.000347,0.000166,0.000123,0.000136,6.9e-05,0.000154,0.000121,7.8e-05,0.000147,0.000133,0.000211,0.000341,6.9e-05,0.000145,0.000109,9.1e-05,2.2e-05,5.7e-05,0.000105,0.00016,8.1e-05,0.000187,6.7e-05,0.000105,9.6e-05,0.000117,7.4e-05,0.000109,0.000151,0.000227,0.000111,0.000132,0.000192,0.000156,0.000254,0.000138,0.000207,0.000205,3.7e-05,0.000179,0.000107,0.000203,0.000166,9.4e-05,0.000151,8.1e-05,1e-04,0.000162,0.000161,0.000163,5.6e-05,3.8e-05,8.2e-05,2.6e-05
0.000183,0.000195,0.000106,0.000238,0.000267,0.000255,0.000153,0.000322,0.000142,0.000168,9.3e-05,7.9e-05,0.000238,0.000212,6.2e-05,0.000151,0.000119,0.000138,3.9e-05,0.000152,7.7e-05,0.00025,0.000118,0.000407,0.000156,0.000116,0.00017,0.000128,0.000131,0.000117,0.000286,0.000154,0.000121,0.000165,0.000179,0.000172,0.000258,0.000129,0.00021,6.9e-05,8.2e-05,0.000187,0.000162,6.8e-05,0.000259,9.4e-05,0.000536,0.000147,0.000517,0.000629,0.000294,0.000224,0.000193,0.000111,0.000113,0.000106,0.000156,8.6e-05,7.3e-05,0.00021,0.00039,0.000469,3.5e-05,0.000515,8.4e-05,0.000116,0.000104,8.4e-05,0.000153,0.000127,2e-04,0.000189,0.000189,0.000297,0.000126,9.8e-05,0.000127,0.00018,0.000178,0.000137,0.000252,0.000146,0.000267,6.6e-05,7.8e-05,0.000193,0.000135,6.8e-05,0.000123,0.000128,0.000172,0.000189,2.7e-05,0.00016,0.000149,6.8e-05,0.00023,0.000136,0.000124,0.00015,0.000138,0.000209,8.8e-05,0.000275,9.1e-05,7.8e-05,0.000218,3.8e-05,0.000109,0.000187,0.000105,0.000152,0.000103,0.000183,0.000164,0.000132,9.7e-05,0.000129,0.000128,9.8e-05,0.000159
0.000354,0.000444,0.000263,0.00026,0.000167,0.000132,0.000124,0.000452,0.000316,0.000489,0.000336,0.000291,0.000397,0.00017,0.000386,0.000483,0.000398,0.00028,0.000268,0.000309,0.000443,0.000175,0.000491,0.000354,0.000209,2.8e-05,0.000261,0.000323,3.9e-05,0.00025,0.000502,0.000165,0.000125,0.000308,0.000464,9.2e-05,0.000113,0.000297,1.3e-05,0.000521,0.000363,0.000288,0.000332,0.000446,0.000137,0.000236,0.000522,0.000334,0.000771,0.00036,0.000222,0.000122,9.1e-05,3.8e-05,0.000424,0.000519,0.000403,0.000269,0.000199,4.9e-05,0.000239,0.000197,0.000464,0.000399,0.000308,0.000297,0.000188,0.000223,0.000245,0.000243,0.000195,0.000105,0.000192,7e-05,0.000142,0.000182,0.000125,0.000419,0.000501,0.000222,0.000312,0.000357,0.000282,0.000186,0.000147,0.000194,0.000129,0.000214,0.000203,0.000313,0.000408,0.00015,0.000197,0.000314,0.000199,0.000253,0.000131,0.000126,0.000197,0.000229,0.000118,0.000323,0.000156,0.000298,0.000308,0.000203,0.000362,0.000238,0.000147,4.9e-05,0.000258,0.000397,0.000223,0.000106,0.000223,0.000241,0.000384,0.000166,0.000291,0.000148,0.000118
0.000479,0.000419,0.000366,0.000332,0.000391,0.000152,0.000245,0.000291,0.000208,0.000344,0.000349,0.000268,0.000455,0.000773,0.000645,0.00056,0.00048,6.1e-05,0.000124,0.000246,0.000462,0.000519,0.000752,0.000865,0.000287,0.000226,0.000436,0.000546,0.000354,0.000592,0.000616,0.000573,0.00036,0.000711,0.000358,0.000313,0.000198,0.000263,0.000132,0.000518,0.000566,0.000429,0.000653,0.000385,0.000659,0.000492,0.000891,0.000502,0.00026,0.00027,0.000197,0.000117,0.000177,0.000103,0.000605,0.000531,0.000394,0.000161,0.000324,0.000297,0.00021,0.000269,0.000436,0.000511,0.000324,0.000356,0.000169,0.000407,8.5e-05,0.000141,0.000173,0.00022,0.000377,9.7e-05,0.000281,0.000113,2e-05,0.000533,0.000676,0.000478,0.000152,0.000409,0.000574,0.000188,0.000132,0.000208,0.000454,0.00046,0.000157,0.000282,0.000372,4.4e-05,9.4e-05,0.000217,0.000161,0.000179,0.000162,0.000113,0.000126,0.000169,0.000344,0.000385,0.000213,0.000178,0.000255,0.000313,0.000252,0.000123,1e-04,0.000219,0.000267,0.000166,0.000445,0.000547,0.000403,0.000255,0.000102,0.000149,0.000398,0.00037,0.000216
0.000358,0.000403,0.000142,0.000146,0.000341,0.000297,0.000292,0.000311,0.000241,0.000393,0.00054,0.000196,0.000378,0.000735,0.000442,0.000336,7.6e-05,0.000274,0.000128,0.000134,0.000199,0.000452,0.000261,0.000617,0.000687,0.000563,1.9e-05,0.000163,0.000288,0.000462,0.000185,1.6e-05,3e-05,0.000496,0.000534,5.5e-05,0.000629,0.00012,0.000256,0.000419,0.000144,0.000547,0.000636,0.000627,0.000694,0.000278,0.00077,0.000682,0.000496,0.000274,0.000515,0.000258,0.000257,0.000233,0.000517,0.000184,0.000561,0.000231,0.000629,0.000616,0.000517,0.000102,0.000172,0.000528,0.000357,0.000297,0.000279,0.000506,0.000438,0.000197,0.000113,0.000228,0.000178,3e-04,0.000279,0.000231,0.000199,0.000448,0.000307,0.000306,0.000341,0.000161,0.000376,0.00047,4.3e-05,0.000214,0.000186,0.000259,0.000284,0.000189,0.000146,0.000315,0.000124,0.000275,0.000147,0.000101,0.000189,0.000133,0.000166,4.3e-05,0.000221,7e-05,0.000215,0.000111,0.000183,0.000297,2.9e-05,0.000297,0.000181,0.000151,0.000231,0.000427,0.000369,0.000103,0.000148,0.00012,0.000361,0.000283,0.00037,2.7e-05,0.000301
8.6e-05,0.000409,0.000412,0.000362,0.000351,9.7e-05,0.000248,0.000228,0.000311,0.000189,0.000191,0.000205,0.000204,0.000232,0.000219,0.000445,0.000413,0.000446,0.000348,0.000362,0.000302,0.000518,0.000296,0.000457,0.000452,0.000475,0.000199,0.000197,0.000306,0.000109,0.000194,0.000323,0.000288,0.000146,0.000393,0.000424,0.000882,0.000704,9.7e-05,0.000397,0.000271,0.000645,0.000758,0.00028,0.000681,0.000593,0.000648,0.000779,0.000381,0.000342,0.00034,0.000125,0.000267,0.000194,0.000398,3e-04,0.000381,0.000233,0.000663,0.000152,0.000246,0.000542,0.000729,0.000409,0.00038,0.000272,6.1e-05,0.000536,0.000139,0.000106,7.3e-05,0.000185,0.000279,0.000241,0.000201,0.000108,3.8e-05,0.000222,1.9e-05,0.00034,0.000317,0.000383,0.000241,0.000149,0.000294,0.000132,8.5e-05,0.000167,0.000397,0.000156,0.000259,0.000285,0.00024,0.000224,9.3e-05,0.000102,5.3e-05,8.1e-05,0.000154,0.000232,0.000131,2.2e-05,0.000227,0.000155,0.000189,0.000108,0.000248,0.000152,0.000134,6.4e-05,5.9e-05,0.000275,0.000182,0.000107,4.7e-05,0.000165,0.00057,0.000108,0.000247,0.000109,0.000271
0.000221,0.000367,0.000178,0.000282,0.000448,0.000429,0.000308,4.4e-05,0.000292,0.000533,0.000626,0.000418,0.000325,0.000251,0.000289,0.000274,0.000118,0.000145,0.000273,0.000232,0.000422,0.000336,0.000156,0.000402,0.000293,0.000326,0.000418,0.00011,0.000245,0.000163,0.000148,0.000597,0.000638,0.000358,0.000242,0.000269,0.000407,0.000115,0.000397,0.00051,0.000545,0.000876,0.000541,0.000309,0.000728,0.000291,0.000461,0.000383,0.000185,6.1e-05,0.000149,0.000229,0.000275,0.000132,0.000252,0.000259,0.00038,0.000376,0.000167,0.000215,0.000126,0.000307,0.000598,0.000483,0.000213,0.000199,0.00014,0.000324,0.000321,0.000186,0.000388,0.000254,0.00019,8.6e-05,6.4e-05,0.000252,0.000355,0.000142,0.000389,0.000347,0.000144,0.000191,7.5e-05,0.000128,0.000181,0.000237,0.000162,0.000262,0.000321,0.00026,0.000544,1e-04,2e-05,0.000301,0.000339,0.000247,0.000289,0.000157,0.000263,0.000279,4.5e-05,0.000141,0.000165,9.3e-05,0.000291,0.000141,0.000164,0.000259,0.000154,0.000108,0.000128,0.000219,0.000245,0.000254,0.000111,0.000199,0.000307,0.000373,0.000238,0.000208,0.00015
3.5e-05,0.000223,6.4e-05,0.000258,0.000106,8.5e-05,7.1e-05,0.000163,0.000206,0.000391,0.000228,0.000199,0.000287,0.000226,0.000144,4e-05,0.000255,0.000101,0.000205,0.000527,0.000151,0.000191,0.000296,0.000144,0.000139,0.00034,0.000241,0.000206,0.000257,0.000133,0.000147,0.000307,0.000208,0.000144,0.000119,2e-04,0.000176,0.000133,0.000278,0.00045,0.000128,0.000322,0.000338,0.000296,0.000269,0.000157,0.000123,0.000184,0.000346,0.000281,0.000248,0.000222,0.00022,0.000358,0.000158,0.000163,0.000158,0.000226,0.000122,4.3e-05,0.000188,0.000363,0.000352,2.9e-05,4.8e-05,0.000203,0.000183,9.3e-05,0.000151,8.9e-05,0.000394,0.000193,0.000107,0.000244,0.000209,0.000286,8e-05,0.00016,0.000206,9.8e-05,5.3e-05,7.8e-05,0.000114,0.000214,0.000118,0.000135,0.000129,0.000245,0.000372,0.000301,0.000302,0.000283,0.000169,0.000184,0.000116,0.000126,0.000108,0.000228,0.00029,8.7e-05,8.4e-05,0.000257,0.000132,0.00025,0.000102,0.000142,0.000119,4.1e-05,0.000111,7.7e-05,8.6e-05,5.7e-05,0.000226,6.8e-05,0.000183,7.3e-05,8.4e-05,0.000142,0.000202,0.000199,0.00027
5.9e-05,0.000109,9.3e-05,7.1e-05,4.9e-05,0.000127,5.5e-05,0.000177,0.000269,0.00021,0.000127,0.000173,7.8e-05,0.000279,9.9e-05,4.9e-05,0.000144,3.2e-05,4.8e-05,0.000351,0.000132,0.00016,0.000104,9.2e-05,0.000134,0.000212,0.00015,0.00024,6.1e-05,0.000122,6.3e-05,0.000179,0.00015,0.000101,0.000118,0.000185,8e-05,7.1e-05,9.7e-05,0.000251,0.000214,0.000326,0.000176,0.000155,0.000112,6.3e-05,0.000107,0.000123,0.000194,0.000142,0.000151,3.5e-05,0.000228,7.6e-05,0.000167,0.000134,0.000141,0.00015,0.000258,0.000118,0.000128,0.000192,0.000224,7.3e-05,4.8e-05,9.7e-05,7e-05,0.000184,0.000152,0.000155,0.000325,0.000176,8.6e-05,0.000167,7.8e-05,0.000124,0.000165,9.4e-05,9.1e-05,0.000217,0.000103,6.9e-05,0.000131,7.8e-05,0.000109,0.000169,0.000175,8e-05,0.000209,0.000183,0.000106,0.000111,6e-05,9.2e-05,7.7e-05,0.000179,5.6e-05,0.000101,0.000145,0.000133,8.3e-05,0.000192,1e-04,0.000101,5.9e-05,5e-05,1e-04,6.2e-05,4.7e-05,6.1e-05,9.6e-05,5.2e-05,0.000112,5e-05,4.2e-05,7.1e-05,8.6e-05,6.2e-05,8.6e-05,6.1e-05,0.000183
6.2e-05,0.000164,0.000151,0.000192,3.7e-05,7.5e-05,6.5e-05,0.000238,0.00015,0.000147,8.4e-05,0.000119,5.5e-05,0.000392,1e-04,0.000142,0.000105,0.000146,0.000187,0.000279,2e-04,0.000225,7.4e-05,6e-05,0.000226,0.000217,0.00015,5.6e-05,0.000123,0.000159,5.8e-05,0.000246,0.000238,0.00022,0.000196,0.00024,0.00019,0.000227,0.000112,0.000133,0.000204,0.00012,6e-05,0.000265,0.000283,3.8e-05,0.000128,7.6e-05,0.000234,8.8e-05,6.3e-05,5e-05,0.00022,5.5e-05,0.000234,0.000142,0.000154,0.000177,3.4e-05,0.000268,0.000112,0.00021,0.000258,1.7e-05,0.000131,1e-04,0.000135,0.000155,0.000148,4.7e-05,0.000284,0.000149,0.000111,0.000179,0.000206,0.00025,0.000119,0.000202,9.6e-05,6.2e-05,0.000155,0.000148,0.000181,0.000126,0.000172,0.000321,4.5e-05,0.000108,0.000198,0.000241,9.1e-05,6.6e-05,1e-04,0.000126,9.3e-05,0.000165,5.3e-05,4.6e-05,0.00016,8e-05,7.9e-05,7.1e-05,0.000135,0.000107,0.00011,2.5e-05,0.000164,0.000188,0.000179,3.8e-05,4.5e-05,2.4e-05,0.000111,8.2e-05,0.000122,0.00014,6.8e-05,5.1e-05,0.000109,0.000105,0.000141
0.000137,0.000108,0.000134,4e-04,0.000354,0.000267,0.000101,0.000168,0.000352,0.000224,0.000168,0.000157,0.000104,0.000345,0.000377,0.000261,0.000112,0.000295,0.000228,0.000297,0.000265,1.8e-05,8.6e-05,0.000141,0.000253,0.000257,0.000225,0.000169,0.000144,0.000127,0.00027,2.9e-05,0.000109,0.000271,0.000237,0.000139,0.000259,7e-05,0.000201,0.000175,0.000309,0.000438,0.00014,0.000163,0.000447,0.000302,0.000177,7.8e-05,0.000267,0.000127,0.000333,0.000224,0.000268,0.000282,0.000172,0.000186,0.000259,0.000201,0.000246,0.000221,0.000155,0.000215,0.00029,7e-05,0.000196,0.000293,0.000187,0.000327,0.000119,4.3e-05,0.000184,0.000141,0.000105,0.000168,0.000164,0.000222,0.000478,0.000426,0.000268,0.000213,0.000113,0.000162,5e-05,0.000148,0.000215,0.000162,0.000178,7.6e-05,6.9e-05,0.000195,0.00023,8.9e-05,0.000161,0.000276,0.000305,0.000261,0.000127,0.00011,0.000174,0.000228,0.000187,1.7e-05,4.7e-05,1e-04,0.000113,7.7e-05,0.000183,0.000112,0.000198,0.000306,0.00028,0.000226,0.000127,0.000214,0.000126,0.000129,4.6e-05,0.000109,0.000146,2.1e-05,4.4e-05
0.000181,0.000304,0.000237,0.000149,0.00018,3.4e-05,9.4e-05,0.000124,0.000228,0.000321,0.00014,0.000107,3.5e-05,0.000244,0.000176,0.000237,0.000378,0.000135,0.000128,0.000295,0.000158,0.000206,0.000102,9.9e-05,0.000195,8.1e-05,0.000142,0.000233,0.000405,0.000348,2.1e-05,0.000105,0.000108,0.000106,0.000217,0.000126,0.000231,0.000353,0.000205,0.000192,0.000263,0.00017,3.8e-05,8.3e-05,0.000179,0.00013,6.1e-05,8.7e-05,0.000284,0.000423,6.3e-05,5e-05,0.000128,0.000237,0.000169,0.000269,0.000221,7.5e-05,0.000248,0.000179,0.000132,0.000177,0.000234,6.5e-05,0.000334,0.00014,0.000163,0.000297,0.000221,0.000172,0.000182,0.000268,0.000194,0.000122,1e-04,0.00028,0.000234,8.4e-05,0.000172,0.000161,0.00026,0.000293,0.000338,0.000162,0.000316,0.000281,0.00018,9.3e-05,0.000133,0.000154,0.000164,0.000223,0.000146,0.000161,0.000252,0.000219,0.000141,6.5e-05,1e-04,0.000105,0.000116,0.00019,6.1e-05,0.000136,0.000132,0.000133,0.000137,0.000264,0.000177,0.000138,0.000129,0.000104,7e-05,0.000175,5.9e-05,9.3e-05,0.000108,9.6e-05,2.7e-05,2e-05,0.000133
0.000118,0.000181,6.8e-05,0.000145,7.6e-05,5.2e-05,7.2e-05,0.000155,1.4e-05,0.000143,3.8e-05,6.3e-05,5.9e-05,0.000167,7.6e-05,8e-05,0.000112,0.000188,0.000161,0.000215,5.9e-05,6.2e-05,6.8e-05,0.000172,5.6e-05,0.000152,5.4e-05,0.000129,0.000355,0.000136,3.9e-05,0.000147,7.5e-05,7.9e-05,8.4e-05,8.1e-05,9.1e-05,0.000172,0.00015,0.000221,5.8e-05,0.000308,0.000106,9.9e-05,0.000158,0.000153,0.000137,6.1e-05,0.000167,0.00031,0.000157,0.000103,0.000166,0.000114,0.000122,6.2e-05,0.000156,1e-04,4.3e-05,5.5e-05,7.4e-05,0.000229,0.000166,0.000146,0.000172,7.9e-05,0.000118,0.000161,0.000136,2e-05,0.000108,0.000115,5.3e-05,9.7e-05,0.00013,7.9e-05,0.000123,0.000132,0.000183,0.000254,0.000136,0.000137,0.000127,0.000182,0.000147,0.00018,9.2e-05,4.6e-05,0.000136,7.9e-05,1.9e-05,0.000105,3.5e-05,6.2e-05,0.000106,7.5e-05,5.3e-05,4.9e-05,3.5e-05,5.1e-05,3e-05,7.6e-05,3.8e-05,8.4e-05,6.8e-05,4.6e-05,2.7e-05,8.5e-05,5.8e-05,0.000127,9e-05,0.000133,0.000122,3.1e-05,0.000193,7.1e-05,4.5e-05,5.3e-05,8.3e-05,3.4e-05,0.000171
9.5e-05,0.000117,5.9e-05,0.000103,0.000111,4.6e-05,9.1e-05,0.000132,9e-06,0.000106,6.8e-05,7.8e-05,5.3e-05,0.00016,4.7e-05,3e-05,7.8e-05,0.000137,4.7e-05,0.000177,9.6e-05,5.1e-05,1.2e-05,0.000121,6.9e-05,0.000129,2.1e-05,0.000103,0.000228,0.000155,6e-05,5.5e-05,7.6e-05,0.000161,8.4e-05,1.5e-05,8.8e-05,0.000161,8.5e-05,0.000167,1.8e-05,0.000236,6.5e-05,7.3e-05,5.4e-05,3e-05,4.2e-05,2.1e-05,8e-05,0.000304,6.5e-05,1e-04,8.5e-05,0.000114,7e-05,4.9e-05,8.6e-05,3e-05,7.1e-05,1.4e-05,7.9e-05,0.000192,0.000206,0.000161,0.000184,4.2e-05,8.4e-05,0.000133,0.000114,6e-05,0.000114,7e-05,3.3e-05,3.8e-05,5.1e-05,4.4e-05,5.5e-05,9.3e-05,0.000148,0.000224,8.5e-05,6.3e-05,0.000164,0.000146,7.7e-05,0.000112,2.2e-05,2e-05,9.3e-05,7.6e-05,4.6e-05,6.5e-05,1.6e-05,4.2e-05,9.5e-05,7.1e-05,3.1e-05,3.7e-05,2.8e-05,3.6e-05,1.7e-05,9.7e-05,1.4e-05,1.3e-05,8.3e-05,4.4e-05,6.1e-05,5.5e-05,1e-05,0.000109,2.4e-05,5.2e-05,9.3e-05,9.2e-05,0.000132,3.7e-05,7e-05,4.3e-05,7.8e-05,2.3e-05,0.000137
8.8e-05,0.000117,5.1e-05,7.9e-05,8.9e-05,5.5e-05,9.8e-05,9.1e-05,1.2e-05,1e-04,5.6e-05,8.5e-05,3.2e-05,0.000165,4.7e-05,4e-06,4.6e-05,0.000112,2.7e-05,0.000177,7e-05,8.8e-05,3.7e-05,0.00011,5.2e-05,0.000119,3.5e-05,8e-05,0.000233,0.000162,6.4e-05,7e-05,4.5e-05,0.000131,7.7e-05,2.9e-05,8.3e-05,0.00017,6.6e-05,0.000164,4e-05,0.00022,4.8e-05,9.9e-05,1.7e-05,2.5e-05,1.8e-05,1.7e-05,0.000119,0.000239,6.3e-05,8.9e-05,9e-05,0.000101,7.6e-05,5.9e-05,9.5e-05,4.8e-05,0.000118,2.3e-05,8.5e-05,0.000184,0.00017,0.000136,0.000137,6.6e-05,6.8e-05,0.000154,9.3e-05,5.4e-05,0.00012,7.6e-05,3.3e-05,1.4e-05,3.3e-05,1.3e-05,7.3e-05,0.000118,0.000148,0.000199,4.2e-05,4.9e-05,0.000148,0.000113,6e-05,0.00011,2.5e-05,1.6e-05,9.3e-05,6.7e-05,5.7e-05,6.1e-05,1.6e-05,2.7e-05,8.3e-05,5.9e-05,3.3e-05,3.8e-05,2.6e-05,1.5e-05,5e-06,9.9e-05,1.6e-05,2e-06,7.9e-05,5e-05,5.9e-05,2.6e-05,3e-05,0.000105,1.6e-05,4.9e-05,8.3e-05,9.4e-05,0.000115,4.3e-05,6e-05,4.8e-05,6.4e-05,3e-05,0.000112
