2.9e-05,8e-06,1.3e-05,1.3e-05,2e-06,2.5e-05,2.4e-05,8e-06,2.4e-05,4e-06,2.2e-05,3e-06,1e-05,9e-06,1.5e-05,8e-06,3e-06,1.4e-05,1.4e-05,1e-05,6e-06,5e-06,1.8e-05,2.1e-05,2e-05,1.3e-05,4e-06,1.6e-05,3e-05,1.3e-05,2.5e-05,4e-06,5e-06,1e-06,1.3e-05,1.2e-05,2.9e-05,2e-06,2.6e-05,1.8e-05,9e-06,1.4e-05,1e-05,1.6e-05,3e-06,3.8e-05,1e-06,2.1e-05,1.4e-05,3.6e-05,1.1e-05,9e-06,5e-06,3.4e-05,2e-06,2.9e-05,1.6e-05,8e-06,1.2e-05,1.8e-05,3.7e-05,4.4e-05,9e-06,1e-05,1.9e-05,5e-06,0,6e-06,1.4e-05,5e-06,2.6e-05,5e-06,1.2e-05,1.6e-05,5e-06,2e-06,9e-06,1.5e-05,1e-05,2.5e-05,3e-05,3e-05,2e-06,2.4e-05,1.1e-05,1.3e-05,1.2e-05,5e-06,4e-06,4e-06,5e-06,1.9e-05,1.5e-05,1.2e-05,2.5e-05,1.6e-05,1e-06,9e-06,1.4e-05,2.7e-05,1.9e-05,2.7e-05,1e-06,6e-06,6e-06,1.2e-05,7e-06,2.3e-05,4e-06,2.7e-05,2.2e-05,1e-06,8e-06,2e-05,3e-06,1.8e-05,2.7e-05,3.1e-05,3.1e-05,2.4e-05,2.4e-05
3.3e-05,3.6e-05,1.6e-05,3.8e-05,6e-06,5.5e-05,4.4e-05,5.7e-05,1.2e-05,4e-06,1.8e-05,2.9e-05,1.5e-05,5.1e-05,5.9e-05,4.7e-05,1.2e-05,3e-05,2.1e-05,2.8e-05,3.4e-05,3.3e-05,5.8e-05,8e-05,0.000102,6.3e-05,2.6e-05,6.8e-05,5.2e-05,5.6e-05,7e-05,2.4e-05,3.1e-05,7e-05,5.7e-05,1.9e-05,8e-05,5.5e-05,4e-05,5.2e-05,2.4e-05,5.7e-05,4.5e-05,4.3e-05,5.2e-05,4.9e-05,6.5e-05,2.3e-05,2.4e-05,7.7e-05,3.2e-05,2.6e-05,6.3e-05,9.1e-05,6.1e-05,3.7e-05,1.8e-05,2.5e-05,3.4e-05,2e-05,6.8e-05,9.7e-05,7.5e-05,6.2e-05,3.8e-05,2.2e-05,6.6e-05,3.9e-05,1.6e-05,1.3e-05,3.6e-05,1.3e-05,5.3e-05,6.3e-05,3.5e-05,1.8e-05,4.8e-05,2.4e-05,2.5e-05,2.8e-05,5.6e-05,4.5e-05,2.1e-05,3.5e-05,6.7e-05,9.1e-05,4.9e-05,2.2e-05,7.8e-05,2.5e-05,3.5e-05,3.9e-05,5e-05,1.2e-05,4.3e-05,1.9e-05,1.6e-05,2.4e-05,7.5e-05,0.000104,6.2e-05,9.7e-05,7.8e-05,0.000115,7.6e-05,6.8e-05,0.000117,0.000103,6.4e-05,8.4e-05,8.5e-05,6.7e-05,5e-05,7.7e-05,6.3e-05,4.8e-05,0.000101,9.4e-05,8.2e-05,0.00011,0.000156
0.00011,5.1e-05,5.5e-05,3.4e-05,3.5e-05,0.000137,5.5e-05,0.000109,5.6e-05,5.4e-05,0.000114,7e-05,5.1e-05,8.6e-05,4.1e-05,4e-05,4.4e-05,3e-05,5.2e-05,0.000107,9.4e-05,3.3e-05,6.5e-05,7.8e-05,3e-05,3.5e-05,7e-05,8e-05,7.5e-05,3.9e-05,5.8e-05,1.2e-05,2.3e-05,8.7e-05,1.1e-05,3.4e-05,7.4e-05,6.3e-05,4.1e-05,2.5e-05,3e-06,9e-05,2.5e-05,4.2e-05,6.2e-05,6.5e-05,6.3e-05,5.3e-05,1.1e-05,6.1e-05,4.2e-05,5.2e-05,0.000124,0.00012,9e-05,0.000122,6.8e-05,4.2e-05,5.6e-05,6.9e-05,5.6e-05,9.3e-05,7.3e-05,8.2e-05,7.5e-05,2.5e-05,0.000131,7.2e-05,5.3e-05,4.7e-05,4.6e-05,0.000101,0.000101,1.4e-05,7.6e-05,4.5e-05,3e-05,4.8e-05,4.7e-05,8.8e-05,7.7e-05,7.3e-05,3.5e-05,2.4e-05,3.5e-05,8.7e-05,0.000123,1.8e-05,0.000102,6.3e-05,1e-04,1.6e-05,5.3e-05,6.6e-05,6.1e-05,2.2e-05,4.9e-05,3.1e-05,7.6e-05,9.7e-05,5.3e-05,3.9e-05,8.4e-05,8.7e-05,3.3e-05,3.2e-05,0.00012,7.6e-05,6.6e-05,2.7e-05,7.5e-05,4.1e-05,3.3e-05,5.5e-05,1.2e-05,6.6e-05,6.2e-05,7e-06,3.8e-05,5.2e-05,0.000132
5.6e-05,5.6e-05,5.2e-05,8.3e-05,6.8e-05,0.000155,0.000121,0.000141,0.000125,8.3e-05,0.000154,9.1e-05,2.5e-05,6.4e-05,8.2e-05,0.00015,0.000105,9e-06,4.2e-05,0.000131,0.000139,5.8e-05,8.9e-05,3e-05,0.000119,6.9e-05,7.3e-05,3.5e-05,8.4e-05,8.7e-05,5.8e-05,6.3e-05,6.5e-05,0.000146,0.000153,1.4e-05,6.4e-05,4.5e-05,9.4e-05,8e-06,4.3e-05,7.8e-05,8e-05,3.6e-05,2.1e-05,0.000104,0.000128,8.7e-05,2.9e-05,0.000123,2.8e-05,5.7e-05,7.2e-05,3.1e-05,7.1e-05,0.000104,8.8e-05,0.000125,2.2e-05,0.000183,2.1e-05,0.000164,0.000106,7.6e-05,3.7e-05,0.000107,0.000122,5.1e-05,8.8e-05,6.5e-05,0.000118,0.000225,8.8e-05,9.8e-05,0.000104,0.000101,4.6e-05,6e-05,0.000118,0.000206,7.5e-05,4.3e-05,3.8e-05,2.1e-05,8.5e-05,5e-05,0.000125,0.000152,0.000113,2.1e-05,0.000128,0.000152,4.6e-05,2.8e-05,0.000141,6.9e-05,0.000126,1.9e-05,6.7e-05,0.000176,9.8e-05,2.1e-05,4.9e-05,9.9e-05,3.9e-05,5.3e-05,0.000108,4.5e-05,6e-05,8.7e-05,3.3e-05,9.7e-05,8.2e-05,5.9e-05,7.5e-05,0.000183,0.000132,8.4e-05,0.000128,3.6e-05,0.000124
0.000234,0.000175,9.8e-05,8.1e-05,1e-04,0.000227,0.000189,8.1e-05,0.000175,0.000171,7.1e-05,0.000123,7.3e-05,7.6e-05,0.000125,8.9e-05,5.1e-05,5.8e-05,4.7e-05,0.000104,7.2e-05,0.000102,0.000162,0.000178,0.000133,4.6e-05,0.00013,0.000164,5.8e-05,8.7e-05,0.000166,0.000134,4.8e-05,8.2e-05,6.5e-05,6.9e-05,0.000153,0.000103,0.000123,0.000146,0.000126,6.7e-05,8.4e-05,4.8e-05,5.5e-05,0.000144,4.8e-05,5.7e-05,0.000101,8.1e-05,0.000102,6.9e-05,3.5e-05,9.5e-05,4.6e-05,0.000126,0.000151,0.000149,0.000114,0.000247,0.000258,0.000271,0.000158,3.5e-05,7.8e-05,0.000138,5.5e-05,7.6e-05,0.000148,4.2e-05,1e-04,0.000129,0.000171,0.000109,0.000189,5.2e-05,6.3e-05,1.8e-05,7.1e-05,0.000212,0.000263,0.000207,9.1e-05,4.6e-05,0.000149,0.000146,7e-06,8e-05,0.000132,0.000176,6.1e-05,0.000152,0.000138,3.7e-05,0.000122,0.000168,3.2e-05,8.6e-05,6e-06,0.000193,0.000184,0.000115,8.3e-05,3.2e-05,5.9e-05,0.000122,7.2e-05,8.2e-05,0.000124,0.000181,0.000172,2.7e-05,0.000157,2e-04,0.000122,0.00014,0.000116,0.000194,0.00025,0.00025,0.000153
1.9e-05,3.4e-05,8.2e-05,9.9e-05,0.000136,0.000101,3.2e-05,5.8e-05,0.000125,0.000178,0.000171,6.1e-05,4.5e-05,6e-05,9e-05,0.000124,8.8e-05,0.00012,4.4e-05,8.3e-05,0.000122,0.000119,9.1e-05,0.000118,9.5e-05,0.000116,7.2e-05,0.000124,0.000128,0.00013,3.5e-05,5.2e-05,6e-05,9.4e-05,0.000148,8.8e-05,7.2e-05,5.1e-05,3.2e-05,9.9e-05,0.000181,6.3e-05,5.8e-05,2.9e-05,0.000111,2.6e-05,6.2e-05,3.9e-05,1e-05,9.2e-05,2.4e-05,3e-05,4.4e-05,9.2e-05,8.1e-05,7e-05,0.000133,0.000157,7e-05,1e-04,0.000138,5.5e-05,7.4e-05,0.000138,6.9e-05,8.5e-05,3.7e-05,6.5e-05,0.000106,8.9e-05,2.9e-05,8.5e-05,5.8e-05,4.9e-05,0.000149,8.1e-05,4.4e-05,7.5e-05,1.9e-05,0.000107,7.4e-05,0.000121,2.1e-05,2.2e-05,0.000134,6e-05,0.000108,4.7e-05,9.5e-05,9.3e-05,0.000157,9.6e-05,1.5e-05,4.2e-05,3.2e-05,0.000116,0.00014,0.000102,8.5e-05,0.000153,1.6e-05,1.7e-05,0.000124,3.7e-05,0.000121,0.000137,0.000108,0.000133,5.8e-05,5.6e-05,6.3e-05,7.2e-05,0.000141,9.6e-05,3.5e-05,0.000159,9.1e-05,0.000127,9.8e-05,0.000116,6.8e-05
1.8e-05,0.000149,5.2e-05,0.000116,9.4e-05,0.000109,5.6e-05,3.8e-05,5.9e-05,8.7e-05,2.5e-05,3.1e-05,4e-05,7.3e-05,8.9e-05,9.7e-05,8.4e-05,2.8e-05,5.6e-05,5.1e-05,0.000126,5.1e-05,7.3e-05,9.3e-05,7.6e-05,8.8e-05,0.000103,4.3e-05,1e-04,5e-05,1.7e-05,6e-05,6.9e-05,9e-05,0.00017,4.7e-05,3.1e-05,2e-05,2e-05,8.9e-05,6.5e-05,7.4e-05,0.000105,6.5e-05,9.6e-05,5.4e-05,4e-05,1.8e-05,4.4e-05,0.000167,3.9e-05,3.5e-05,6.4e-05,7.3e-05,7.2e-05,2.9e-05,0.000157,0.000106,7.9e-05,5.1e-05,8.9e-05,0.000104,3.5e-05,0.000105,6.6e-05,7.5e-05,3.8e-05,7.7e-05,6.8e-05,5.4e-05,6.1e-05,8.5e-05,7.8e-05,6.3e-05,0.00013,0.000101,4.7e-05,6.8e-05,7.2e-05,9.8e-05,5.2e-05,0.00014,0.00014,3.6e-05,5.3e-05,0.000105,0.000167,0.000171,5e-06,0.000111,0.000113,1e-04,0.000105,6.8e-05,5.1e-05,0.000111,6.6e-05,2.1e-05,4.4e-05,6.4e-05,9.2e-05,3.9e-05,0.00017,0.000129,0.000112,0.000121,7.9e-05,3.3e-05,7.4e-05,6.1e-05,5.3e-05,8.1e-05,5.9e-05,2.7e-05,6.5e-05,9.5e-05,0.000152,9.8e-05,9.6e-05,3.5e-05,2.4e-05
4.2e-05,0.00024,0.000203,0.00016,8.7e-05,9.8e-05,4.5e-05,2.3e-05,0.000168,0.000123,8.2e-05,5.4e-05,6.1e-05,0.000113,4.6e-05,6.1e-05,1e-04,8.6e-05,6e-05,0.000136,0.000223,0.000145,0.000132,0.000185,0.000187,0.00019,0.000141,4.5e-05,0.000152,0.000198,0.000108,1e-04,0.000138,4.5e-05,0.000209,0.000221,3.1e-05,2.4e-05,4.4e-05,2.9e-05,3.5e-05,5e-05,9.4e-05,2.6e-05,0.000123,0.00014,0.000106,7.2e-05,0.000128,0.000201,0.000178,7.3e-05,8.6e-05,9.9e-05,4.3e-05,5.4e-05,0.000143,0.000113,3.6e-05,7.5e-05,4.9e-05,0.000125,0.000166,0.000147,0.00014,0.000134,0.000129,8.6e-05,5.2e-05,1.8e-05,0.000173,1.4e-05,1e-04,5.1e-05,8.2e-05,0.000139,0.000224,0.00012,9.9e-05,0.000149,7.8e-05,0.000156,0.00019,0.000148,8.7e-05,0.000141,0.000158,4.3e-05,8.2e-05,3.5e-05,7.5e-05,0.000112,0.000176,0.000112,0.000115,3.7e-05,3.5e-05,7.5e-05,9e-06,3.7e-05,2.3e-05,7.1e-05,0.000128,0.000134,0.000175,0.000211,0.000225,0.00019,0.000156,0.000117,4.2e-05,0.000107,0.000113,3.4e-05,0.000102,0.000161,0.00013,3.1e-05,5e-05,7e-05,0.00015
0.000156,0.00024,0.000109,0.000143,0.000124,0.000133,0.000106,0.000125,0.000247,0.000145,0.000133,7.7e-05,4.5e-05,7.2e-05,0.00014,0.000152,0.00012,3.5e-05,0.000101,6.3e-05,0.000117,7.1e-05,0.000112,9.8e-05,0.000102,0.000114,0.000202,0.000103,2e-04,0.00015,0.000135,3.1e-05,0.000127,0.000123,0.000273,0.000287,0.000281,0.000159,0.000106,5.6e-05,4.7e-05,7.7e-05,0.000147,9.2e-05,0.000125,0.000117,3.8e-05,7.5e-05,0.000162,0.000246,0.000258,0.000172,8.1e-05,9.9e-05,0.000106,5.5e-05,9.9e-05,0.000131,7.6e-05,0.000114,8.9e-05,0.000172,0.000256,0.000101,0.000112,5.1e-05,3.2e-05,5.5e-05,7.7e-05,6.9e-05,0.000153,0.000205,7.6e-05,3.8e-05,0.000109,5.9e-05,0.00012,0.000108,4.3e-05,0.000121,0.000111,0.000184,5.9e-05,7.8e-05,4.8e-05,9.4e-05,9.3e-05,3.1e-05,7.7e-05,0.000107,0.000124,0.000118,0.000163,0.000118,0.000103,5.9e-05,1.5e-05,7.7e-05,0.000105,2.3e-05,1.4e-05,7.3e-05,7.7e-05,6.4e-05,7.2e-05,0.000121,2.3e-05,0.000107,8.2e-05,0.000156,6.2e-05,0.00011,0.000106,0.000148,0.000203,0.000192,8.3e-05,0.000103,0.00012,8.4e-05,0.000121
7.2e-05,4.5e-05,2.3e-05,6e-05,4.2e-05,7.1e-05,2.8e-05,9.8e-05,0.000118,3.1e-05,7.4e-05,8e-05,1.2e-05,9.7e-05,0.000179,4e-05,1.6e-05,2.4e-05,0.000114,0.000108,2.1e-05,3.2e-05,4.3e-05,7.4e-05,8.6e-05,0.000175,0.000104,6.3e-05,0.000152,4.8e-05,5.3e-05,4.2e-05,0.000104,2.2e-05,0.000132,6.4e-05,7.3e-05,1.3e-05,4.3e-05,3.3e-05,8.5e-05,9.6e-05,2.9e-05,4.4e-05,6.2e-05,1.9e-05,1.1e-05,8.4e-05,8.7e-05,4e-05,8.8e-05,1e-05,3.5e-05,4.6e-05,0.000123,7.3e-05,8.6e-05,3.4e-05,1.2e-05,3.4e-05,3.1e-05,9.8e-05,0.000101,8.1e-05,5.2e-05,7.7e-05,7e-05,6.6e-05,9.1e-05,9e-05,6.1e-05,7.2e-05,4e-05,2.7e-05,0.000129,9.5e-05,4.1e-05,3.2e-05,5.6e-05,6.6e-05,0.000119,7.7e-05,6.5e-05,9.2e-05,0.000123,0.000142,4e-05,9.4e-05,8.7e-05,8.4e-05,8.3e-05,4.7e-05,0.000116,5.8e-05,7e-05,4.8e-05,1.6e-05,7.5e-05,6.9e-05,5.6e-05,6.4e-05,4.8e-05,7.7e-05,6.8e-05,2e-05,4.1e-05,6.1e-05,7.9e-05,9e-06,8.6e-05,8.9e-05,6.5e-05,2.6e-05,7.2e-05,6.9e-05,7e-06,2.6e-05,8.4e-05,9.7e-05,3.7e-05,0.000127
4.6e-05,2.2e-05,3.3e-05,3.3e-05,2.4e-05,6.4e-05,5e-05,4.8e-05,9.9e-05,5.7e-05,3.5e-05,2.9e-05,4.7e-05,8.3e-05,4.2e-05,9.2e-05,9.4e-05,7.2e-05,0.00011,7.9e-05,6.3e-05,4.8e-05,2.1e-05,5e-05,0.000102,6.6e-05,6.9e-05,3.1e-05,4.6e-05,5.1e-05,3.1e-05,2.9e-05,7.1e-05,7.6e-05,1.2e-05,3.9e-05,5.3e-05,2.9e-05,1.6e-05,3.4e-05,4.5e-05,3.9e-05,5.1e-05,3.5e-05,1.9e-05,2.1e-05,7e-06,7.4e-05,0.000134,0.000122,3.2e-05,3.1e-05,4.2e-05,3e-05,0.000115,9.6e-05,9.4e-05,0.000101,8.5e-05,6.8e-05,6.1e-05,0.000101,4.7e-05,7.2e-05,0.00013,0.000122,7.2e-05,2.4e-05,7e-05,7.7e-05,7.2e-05,5.8e-05,4e-05,2.8e-05,8.1e-05,2.8e-05,2.5e-05,4.2e-05,3.4e-05,6.1e-05,3.2e-05,2e-05,7.2e-05,4.1e-05,2.8e-05,2.7e-05,7.7e-05,6.7e-05,3.2e-05,5.1e-05,2.8e-05,7.6e-05,3.1e-05,5e-05,6.4e-05,3.8e-05,6e-06,6.8e-05,2.7e-05,4.7e-05,7.7e-05,7.4e-05,2e-06,4.2e-05,7.5e-05,4.2e-05,3.7e-05,5.8e-05,5.3e-05,3e-05,5.1e-05,9.8e-05,7.8e-05,3.3e-05,5.7e-05,4.5e-05,2.4e-05,3.1e-05,2.9e-05,9e-06,7.2e-05
2.8e-05,6.4e-05,5e-06,3.3e-05,7e-06,2.6e-05,2.3e-05,1.6e-05,3.8e-05,2.4e-05,1.7e-05,1.9e-05,2.3e-05,1.1e-05,2.8e-05,7.5e-05,2.2e-05,3.2e-05,2e-05,4.4e-05,2.9e-05,2.4e-05,1.3e-05,2.3e-05,4.1e-05,3.4e-05,2e-05,1.4e-05,1.3e-05,1.6e-05,6e-06,1.8e-05,1.3e-05,2.8e-05,2.1e-05,6e-06,1.6e-05,4e-06,6e-06,1.6e-05,2.4e-05,1.2e-05,2e-05,3.2e-05,2.8e-05,2.2e-05,2.4e-05,3e-05,5.1e-05,5.2e-05,1.8e-05,2.9e-05,5.5e-05,4.3e-05,5.1e-05,3e-05,1.7e-05,2.6e-05,4.5e-05,1.5e-05,2.5e-05,3.7e-05,4.1e-05,3.4e-05,6.7e-05,9e-06,2.5e-05,1.1e-05,3e-05,1.8e-05,3.4e-05,5.2e-05,8e-06,2.9e-05,2e-05,3.6e-05,2e-06,2.9e-05,1.5e-05,2.6e-05,5.1e-05,1.8e-05,4.8e-05,3.9e-05,1.9e-05,6e-06,1.5e-05,3.5e-05,1e-05,5.3e-05,3.8e-05,3.8e-05,1.3e-05,3.1e-05,2e-05,1.2e-05,2.9e-05,2.7e-05,1.7e-05,2e-05,3.6e-05,2e-05,2.5e-05,6e-06,5.4e-05,1.5e-05,2e-05,2e-05,3.8e-05,2.8e-05,1.1e-05,6.1e-05,3e-05,3.7e-05,5.4e-05,3e-05,2.6e-05,1.3e-05,3.3e-05,2e-06,1e-05
3.8e-05,4e-05,1.1e-05,3.4e-05,9e-06,1.2e-05,3.4e-05,2.4e-05,1.8e-05,7e-06,3.3e-05,2.1e-05,5e-06,2.2e-05,2.6e-05,3.3e-05,1.6e-05,1.6e-05,1.3e-05,2.7e-05,2e-06,1.7e-05,1.5e-05,1.5e-05,2.5e-05,4e-05,1.7e-05,9e-06,2.9e-05,1.3e-05,1.5e-05,6e-06,4e-06,1.5e-05,3.1e-05,7e-06,1.3e-05,5e-06,8e-06,3e-06,3.1e-05,7e-06,1.5e-05,1.1e-05,2.6e-05,1.7e-05,6e-06,2.3e-05,5.1e-05,4e-05,1.1e-05,2.4e-05,3.7e-05,1.6e-05,2.4e-05,4.1e-05,2.2e-05,1.5e-05,1.9e-05,1.8e-05,1.6e-05,4.3e-05,3.5e-05,1.6e-05,3.4e-05,2e-05,1.4e-05,7e-06,7e-06,1.3e-05,3.5e-05,3.3e-05,5e-06,2.3e-05,4e-06,3e-05,2.5e-05,3e-05,1.7e-05,1.3e-05,3.4e-05,1.6e-05,2.1e-05,1.7e-05,1e-05,2.3e-05,9e-06,1.2e-05,2e-05,4.5e-05,3.5e-05,2.2e-05,3.6e-05,8e-06,4e-06,2.6e-05,8e-06,9e-06,1e-05,7e-06,1.4e-05,3.2e-05,3.1e-05,1.8e-05,3.2e-05,1.6e-05,1.7e-05,3.9e-05,1.9e-05,1.7e-05,1.3e-05,3.9e-05,5e-06,3e-05,3.6e-05,2.8e-05,1.5e-05,2.4e-05,2.6e-05,1.2e-05,2e-05
2.1e-05,1.6e-05,1.1e-05,2.5e-05,1.3e-05,1e-05,1.4e-05,2e-05,1.3e-05,1.9e-05,4.1e-05,9e-06,2.2e-05,1.7e-05,3.2e-05,2.2e-05,3.3e-05,1.5e-05,1.7e-05,2.8e-05,1.3e-05,1.6e-05,2.8e-05,3.2e-05,3e-05,1.8e-05,3.6e-05,8e-06,1.8e-05,1e-06,1.4e-05,2.4e-05,1.5e-05,2.3e-05,2.2e-05,1.7e-05,1e-05,8e-06,1.8e-05,2e-05,8e-06,1.4e-05,1.6e-05,8e-06,1.4e-05,1e-05,1.1e-05,1.4e-05,1.7e-05,2.9e-05,1.3e-05,2.4e-05,2.3e-05,1.4e-05,7e-06,2.5e-05,8e-06,3e-06,3e-05,3.8e-05,3.8e-05,2.1e-05,2e-05,1.9e-05,2.2e-05,2.1e-05,2.4e-05,2.1e-05,2e-05,9e-06,3.4e-05,4.9e-05,1.4e-05,4.5e-05,1.7e-05,4.1e-05,9e-06,4e-05,8e-06,3e-06,3.7e-05,2.8e-05,1.4e-05,2.5e-05,3e-06,2.2e-05,2.3e-05,1.9e-05,2.7e-05,4.7e-05,4.2e-05,6e-06,1.5e-05,2.6e-05,2e-05,3.4e-05,1.2e-05,7e-06,1.3e-05,2.4e-05,3.4e-05,2e-06,3.2e-05,7e-06,4e-06,1.8e-05,1.8e-05,5e-06,1.5e-05,1.8e-05,2.1e-05,5.6e-05,1.5e-05,1.9e-05,4.8e-05,3.1e-05,1.9e-05,2.7e-05,3.4e-05,1e-05,8e-06
4.4e-05,2.5e-05,1.9e-05,9e-06,3e-05,3.1e-05,2.9e-05,1.6e-05,2.2e-05,2.5e-05,1.5e-05,2.8e-05,6e-06,3.7e-05,6.5e-05,3.2e-05,3.5e-05,1.9e-05,5e-06,2.2e-05,1e-06,5e-06,1.5e-05,1.4e-05,1.7e-05,1.5e-05,3e-05,4.1e-05,5.5e-05,3.3e-05,3.4e-05,4.5e-05,2.7e-05,1e-05,1.3e-05,9e-06,2.9e-05,2e-05,3.6e-05,1.6e-05,5e-06,1e-05,2.1e-05,1.4e-05,9e-06,5e-06,5e-06,1.6e-05,3.6e-05,1.5e-05,1.7e-05,5e-06,1.8e-05,2.4e-05,3.3e-05,9e-06,1.1e-05,1.6e-05,2.1e-05,5e-05,9e-06,3.7e-05,1.1e-05,3.6e-05,1.1e-05,2.5e-05,1.1e-05,2.8e-05,3.7e-05,2.8e-05,5.4e-05,2.3e-05,1.6e-05,3.1e-05,2.1e-05,3.4e-05,4.3e-05,3.8e-05,3.3e-05,1.3e-05,3.1e-05,3.7e-05,3.6e-05,5.4e-05,4e-05,2.4e-05,4e-06,2e-05,6e-06,1.5e-05,2.5e-05,8e-06,1.5e-05,1.2e-05,3.7e-05,4.5e-05,2.7e-05,1.3e-05,2.3e-05,5.8e-05,2.4e-05,2.6e-05,2.5e-05,2.2e-05,2.8e-05,2e-05,3.3e-05,9e-06,2.3e-05,2.5e-05,3.3e-05,4.4e-05,2.1e-05,4e-06,3.5e-05,9e-06,1.5e-05,2.3e-05,2.8e-05,1.4e-05,6e-06
3.5e-05,4.4e-05,1.3e-05,1.4e-05,3e-05,2.1e-05,3.3e-05,2.2e-05,3e-05,1e-05,2.5e-05,1.4e-05,1.7e-05,4.2e-05,2.1e-05,2.6e-05,1.3e-05,2.1e-05,3.5e-05,1.9e-05,2.2e-05,1.9e-05,1.4e-05,1.2e-05,3.5e-05,2.4e-05,2.2e-05,2.6e-05,2.3e-05,1.4e-05,6e-06,5.1e-05,2e-05,1.5e-05,1.4e-05,2.5e-05,1.7e-05,2.2e-05,5.3e-05,4.7e-05,1.1e-05,1.9e-05,1.3e-05,9e-06,1.7e-05,2.2e-05,2.1e-05,2.7e-05,3.8e-05,4.8e-05,2.6e-05,3e-05,1.5e-05,2e-05,2.1e-05,3.4e-05,2.8e-05,1.3e-05,3.2e-05,3e-06,8e-06,3.8e-05,2.4e-05,8e-06,2.8e-05,3e-06,9e-06,3.1e-05,3.7e-05,3.7e-05,1.2e-05,5.2e-05,2.2e-05,1.5e-05,1.8e-05,1.5e-05,1e-05,4.6e-05,4.6e-05,5.4e-05,5.2e-05,2.3e-05,1.7e-05,4e-05,3.1e-05,2.2e-05,7e-06,1.2e-05,1.9e-05,1.8e-05,4.6e-05,3.4e-05,3.3e-05,6e-06,4.4e-05,1e-05,1.8e-05,1.7e-05,3.3e-05,3.2e-05,1.2e-05,3e-05,3.3e-05,2.3e-05,5.7e-05,5.6e-05,2.2e-05,3.3e-05,2.6e-05,2.7e-05,3.2e-05,3.2e-05,3.2e-05,1.5e-05,2e-05,1.1e-05,1.8e-05,1.1e-05,3.2e-05,2.3e-05,1.4e-05
1.4e-05,1.4e-05,2.4e-05,2.5e-05,1.4e-05,3.8e-05,4.8e-05,6.3e-05,8e-06,4e-06,3.9e-05,3.2e-05,2.6e-05,2.2e-05,5.3e-05,5.2e-05,2.1e-05,4.2e-05,3.6e-05,4.2e-05,1.5e-05,3.4e-05,3.3e-05,1.1e-05,3.4e-05,1.8e-05,3.7e-05,2.7e-05,8e-06,1.9e-05,3.4e-05,5.5e-05,8.7e-05,3.9e-05,3.5e-05,5.3e-05,6.8e-05,3.7e-05,1.3e-05,2.5e-05,2.3e-05,1.7e-05,1.1e-05,1.1e-05,1.1e-05,4.7e-05,5.3e-05,3e-06,4e-06,3e-05,2.7e-05,1.7e-05,3.2e-05,2.5e-05,3.5e-05,2e-05,2.3e-05,1e-05,3.7e-05,5.2e-05,4e-06,3.7e-05,7e-06,7e-06,2.8e-05,5.3e-05,1.7e-05,2.2e-05,3.1e-05,1.1e-05,1e-05,4.4e-05,1.7e-05,2.7e-05,1.1e-05,5e-06,3.3e-05,4.5e-05,5.4e-05,2.2e-05,3.4e-05,8e-06,2.1e-05,4.1e-05,2.6e-05,1.8e-05,1.4e-05,2.1e-05,5e-06,3.1e-05,5.1e-05,1.4e-05,3.3e-05,2.5e-05,4.4e-05,1.5e-05,2.5e-05,3e-05,2.4e-05,3.2e-05,2.8e-05,3.3e-05,1.5e-05,2.8e-05,1e-05,4.9e-05,4.5e-05,6e-06,3.3e-05,1.4e-05,5e-06,3.3e-05,2.9e-05,1e-05,1.9e-05,1.1e-05,1e-05,3.2e-05,1.6e-05,1.9e-05,2.2e-05
1.1e-05,2.6e-05,3.9e-05,5.9e-05,3e-05,2.6e-05,1.7e-05,4.7e-05,4e-05,2.2e-05,5.5e-05,3.3e-05,2.4e-05,4e-06,5.2e-05,1.1e-05,2.3e-05,3.6e-05,2.2e-05,3.1e-05,5.5e-05,3.8e-05,1.5e-05,1.7e-05,2.8e-05,3e-05,6.5e-05,6.1e-05,7e-06,1.2e-05,3.6e-05,1.7e-05,7.4e-05,4.9e-05,4.8e-05,3e-05,6.2e-05,3.9e-05,4.2e-05,3e-05,1.2e-05,2.2e-05,6e-06,1.9e-05,1e-05,4.1e-05,1.1e-05,2.6e-05,3.3e-05,1.3e-05,4e-05,6.5e-05,2.7e-05,4.4e-05,1.4e-05,4.2e-05,6.7e-05,3.2e-05,3.8e-05,3.3e-05,4.7e-05,4e-05,4.9e-05,2e-05,3.2e-05,2.5e-05,1.7e-05,1e-05,1.2e-05,1.1e-05,1.5e-05,1e-05,4.1e-05,5.9e-05,2.7e-05,2.6e-05,6.9e-05,4.5e-05,3e-05,2.3e-05,2.7e-05,4.7e-05,5e-06,3.8e-05,5e-05,4.2e-05,2.6e-05,4e-05,3e-05,2e-05,3.9e-05,3.4e-05,5.3e-05,1.8e-05,6e-06,3e-05,6.2e-05,6e-06,3.2e-05,2.1e-05,2.3e-05,5.3e-05,6e-05,2.3e-05,1.6e-05,3.8e-05,5.7e-05,2.6e-05,2.3e-05,3.9e-05,3e-05,2.5e-05,4.6e-05,3.7e-05,2.4e-05,9e-06,1.6e-05,3.9e-05,4e-05,2.1e-05,1.9e-05
3.6e-05,3.9e-05,2e-05,3.5e-05,3e-06,2.9e-05,3.4e-05,2.4e-05,2e-05,1.1e-05,3.5e-05,2.6e-05,1.2e-05,1.4e-05,5.5e-05,6.8e-05,3.9e-05,4.4e-05,1.5e-05,6.4e-05,3e-06,2.5e-05,2.8e-05,3.8e-05,5e-05,2e-05,3.7e-05,2.3e-05,4.4e-05,2.4e-05,4.3e-05,3.7e-05,2.6e-05,2.4e-05,6e-06,5e-05,2.8e-05,2.8e-05,2.6e-05,3.9e-05,3.6e-05,2.2e-05,2.9e-05,2.2e-05,4.1e-05,4.4e-05,4.5e-05,2.4e-05,1.9e-05,2.8e-05,1e-05,3.8e-05,3.1e-05,4e-05,2.9e-05,1.3e-05,6.8e-05,3.5e-05,2.5e-05,2.6e-05,1.6e-05,6e-06,3e-05,1.5e-05,3.9e-05,6.8e-05,5.3e-05,1.6e-05,2.1e-05,2.2e-05,4.2e-05,3.9e-05,3.7e-05,2e-05,2.5e-05,2.9e-05,5.5e-05,5.9e-05,6.5e-05,8e-06,1.7e-05,4.5e-05,4.8e-05,4.9e-05,1.6e-05,1.2e-05,2.7e-05,3.8e-05,4.1e-05,2.2e-05,4.3e-05,6.9e-05,1.1e-05,2.1e-05,2.8e-05,2.1e-05,5.1e-05,7.2e-05,1.4e-05,2.4e-05,8e-06,1.8e-05,3.8e-05,2.8e-05,5.5e-05,2e-05,3.8e-05,2.8e-05,1.2e-05,1.6e-05,1.2e-05,4.8e-05,4.5e-05,3.1e-05,2.9e-05,1.2e-05,3e-05,4.7e-05,2.9e-05,4.4e-05,6e-05
3.4e-05,1.7e-05,5e-05,4.1e-05,5.9e-05,3.2e-05,5.6e-05,2.4e-05,1.2e-05,1e-05,3.5e-05,1.4e-05,9e-06,1.4e-05,5.6e-05,5.4e-05,3.8e-05,2.7e-05,1.4e-05,8.2e-05,7.9e-05,5.9e-05,2.4e-05,3.7e-05,1.2e-05,2.3e-05,3.7e-05,4.6e-05,4.8e-05,4.1e-05,7e-06,1.4e-05,2.8e-05,2.1e-05,8e-06,5e-05,4.7e-05,1.2e-05,2e-05,2.2e-05,8e-06,4e-06,2e-05,2.7e-05,1.7e-05,3.8e-05,2.8e-05,2.8e-05,4e-05,5.1e-05,2e-05,2e-05,1.3e-05,2.9e-05,1.1e-05,3.7e-05,4.5e-05,6.5e-05,7.1e-05,2.1e-05,1.3e-05,4e-06,3.8e-05,1.7e-05,3.3e-05,6.9e-05,0.000113,8e-05,1.8e-05,5.9e-05,7.4e-05,8.5e-05,7.8e-05,7.3e-05,7.8e-05,3.8e-05,5.6e-05,8.8e-05,5.4e-05,6.2e-05,4.2e-05,7.6e-05,3.3e-05,1.4e-05,3.5e-05,3.9e-05,2.5e-05,4.3e-05,9e-06,1.9e-05,5.6e-05,2.2e-05,1.2e-05,3.1e-05,5.2e-05,4.9e-05,6.6e-05,1.9e-05,3.5e-05,4.1e-05,3e-05,3.1e-05,3.2e-05,4.8e-05,3.1e-05,5.5e-05,6.5e-05,3.8e-05,3.9e-05,2.6e-05,3.2e-05,4.7e-05,2.8e-05,2.5e-05,2.2e-05,1.5e-05,2.1e-05,2.3e-05,2.2e-05,6.1e-05,7.3e-05
1.2e-05,2e-05,1.9e-05,1.8e-05,3.9e-05,2.1e-05,4.6e-05,8e-06,2.7e-05,2.7e-05,3.6e-05,1.2e-05,1.7e-05,2.3e-05,2e-05,1e-05,2.1e-05,3.8e-05,4.1e-05,3.5e-05,4.3e-05,2.2e-05,2.3e-05,2.4e-05,2.8e-05,2.6e-05,1.4e-05,2e-05,2.5e-05,1.7e-05,9e-06,1.3e-05,2.9e-05,3.4e-05,4e-05,2.4e-05,2.2e-05,6e-06,1.8e-05,2.8e-05,2.2e-05,2.3e-05,2.5e-05,1.9e-05,3.5e-05,3.8e-05,1.4e-05,1.1e-05,1.8e-05,3.6e-05,2.4e-05,4e-06,1.8e-05,3.4e-05,2.6e-05,3.1e-05,1.2e-05,4.9e-05,1.7e-05,2e-05,1.3e-05,1.4e-05,4.8e-05,2.2e-05,9e-06,5e-05,4.9e-05,1.5e-05,1e-05,5e-05,8e-06,4.2e-05,1e-05,4.1e-05,2.8e-05,2.5e-05,6.2e-05,2e-05,1.2e-05,2.8e-05,3.3e-05,2.7e-05,2.6e-05,3.4e-05,1.4e-05,3.1e-05,2e-06,1e-05,1.6e-05,2.3e-05,3.2e-05,7e-06,2e-05,1.7e-05,3.5e-05,3.7e-05,1e-05,1.4e-05,2.5e-05,7e-06,4e-06,3.3e-05,2e-06,1.3e-05,1.4e-05,3.3e-05,1.3e-05,1e-05,1.5e-05,3e-06,6e-06,1.7e-05,2.7e-05,4.9e-05,1.7e-05,2.4e-05,8e-06,2.5e-05,2.6e-05,2.8e-05,2.8e-05
1.5e-05,1.7e-05,1.2e-05,3.2e-05,8e-06,1.5e-05,2.7e-05,1.8e-05,2.2e-05,2.1e-05,2.2e-05,5e-06,1.8e-05,2.3e-05,2.2e-05,1.3e-05,1.6e-05,4.7e-05,7e-06,3.5e-05,1.6e-05,6e-06,1.8e-05,1.2e-05,1.5e-05,1.3e-05,3e-05,4.4e-05,1.3e-05,1.9e-05,1.5e-05,3e-06,2.8e-05,2.2e-05,1.4e-05,9e-06,3.2e-05,1.9e-05,1.1e-05,3.2e-05,3.6e-05,3.5e-05,9e-06,1.3e-05,2.1e-05,1.3e-05,2.1e-05,2.7e-05,9e-06,2.3e-05,1.2e-05,1.5e-05,1.1e-05,9e-06,1.1e-05,2.2e-05,1.7e-05,2.3e-05,1.5e-05,1.1e-05,2e-06,2.6e-05,9e-06,7e-06,1.8e-05,1.6e-05,4.2e-05,2.1e-05,1.4e-05,2.3e-05,1.2e-05,2.2e-05,1.5e-05,2.2e-05,1.7e-05,2.5e-05,2.2e-05,2.8e-05,2.7e-05,1.7e-05,1.3e-05,1.3e-05,1.3e-05,2.4e-05,1.7e-05,1.7e-05,8e-06,1.6e-05,7e-06,2.5e-05,4.8e-05,1.3e-05,2.4e-05,1.8e-05,1.3e-05,5e-06,6e-06,1e-05,1.2e-05,1.1e-05,6e-06,2.7e-05,1.6e-05,2.2e-05,1.8e-05,1.2e-05,1.1e-05,8e-06,5e-06,1e-05,1.6e-05,2.8e-05,2.5e-05,9e-06,1.9e-05,2.3e-05,1.1e-05,1.5e-05,2.1e-05,1.1e-05,2.1e-05
1.2e-05,6e-06,2e-06,2e-05,1.1e-05,9e-06,1.1e-05,8e-06,5e-06,1e-06,7e-06,4e-06,1.3e-05,4e-06,4e-06,1e-05,6e-06,9e-06,1.1e-05,1.6e-05,7e-06,6e-06,1e-05,3e-06,0,1e-05,1.6e-05,5e-06,1e-06,8e-06,4e-06,4e-06,1e-05,1.1e-05,7e-06,2e-06,1.1e-05,9e-06,5e-06,1.1e-05,1e-05,5e-06,1e-06,6e-06,1.5e-05,1e-05,5e-06,1.3e-05,3e-06,5e-06,1e-05,9e-06,7e-06,1.1e-05,6e-06,1.5e-05,7e-06,5e-06,5e-06,4e-06,8e-06,1.3e-05,1.1e-05,3e-06,1e-05,2e-06,1e-05,6e-06,6e-06,1.2e-05,6e-06,8e-06,4e-06,8e-06,5e-06,5e-06,5e-06,1.3e-05,1.2e-05,7e-06,1.4e-05,1.5e-05,6e-06,8e-06,4e-06,4e-06,3e-06,9e-06,5e-06,5e-06,1.3e-05,4e-06,8e-06,6e-06,1.1e-05,1e-05,3e-06,5e-06,8e-06,5e-06,1e-06,9e-06,9e-06,5e-06,7e-06,5e-06,7e-06,8e-06,3e-06,3e-06,7e-06,9e-06,6e-06,1e-05,1.1e-05,1.5e-05,3e-06,3e-06,9e-06,6e-06,7e-06
4e-06,5e-06,1e-06,1.6e-05,6e-06,5e-06,1.9e-05,1e-05,1e-06,3e-06,6e-06,3e-06,1.2e-05,5e-06,4e-06,4e-06,7e-06,3e-06,1e-06,1.5e-05,6e-06,9e-06,5e-06,4e-06,1e-06,7e-06,1.2e-05,3e-06,5e-06,1e-06,7e-06,4e-06,5e-06,1.1e-05,1e-05,3e-06,6e-06,1.2e-05,8e-06,1.1e-05,4e-06,5e-06,8e-06,7e-06,8e-06,5e-06,2e-06,8e-06,5e-06,5e-06,5e-06,9e-06,6e-06,9e-06,7e-06,1.5e-05,5e-06,5e-06,1e-05,5e-06,3e-06,5e-06,8e-06,5e-06,6e-06,6e-06,3e-06,1.1e-05,7e-06,1.5e-05,1e-05,1.8e-05,1.2e-05,6e-06,8e-06,6e-06,1e-05,5e-06,6e-06,2e-06,1.4e-05,1e-06,5e-06,8e-06,9e-06,1.3e-05,0,5e-06,4e-06,2e-06,1.4e-05,8e-06,2e-06,1e-05,1e-05,1.2e-05,9e-06,9e-06,4e-06,6e-06,2e-06,1.5e-05,8e-06,9e-06,7e-06,8e-06,2e-06,1e-06,5e-06,5e-06,5e-06,6e-06,8e-06,7e-06,7e-06,1.4e-05,1e-05,6e-06,8e-06,9e-06,5e-06
5e-06,7e-06,4e-06,8e-06,8e-06,2e-06,8e-06,7e-06,5e-06,6e-06,7e-06,5e-06,8e-06,7e-06,4e-06,2e-06,3e-06,8e-06,4e-06,1.3e-05,2e-06,8e-06,4e-06,8e-06,3e-06,3e-06,1e-05,3e-06,7e-06,4e-06,4e-06,1e-06,1e-06,4e-06,5e-06,4e-06,4e-06,7e-06,5e-06,6e-06,4e-06,2e-06,8e-06,1e-06,9e-06,9e-06,8e-06,5e-06,3e-06,9e-06,5e-06,1e-05,7e-06,0,2e-06,9e-06,5e-06,1e-06,4e-06,3e-06,2e-06,6e-06,6e-06,9e-06,3e-06,6e-06,4e-06,6e-06,5e-06,1.5e-05,1.1e-05,6e-06,2e-06,1e-05,1.1e-05,5e-06,1.3e-05,1.1e-05,3e-06,8e-06,5e-06,9e-06,4e-06,1.3e-05,1.1e-05,7e-06,6e-06,4e-06,7e-06,7e-06,1.5e-05,3e-06,3e-06,1e-06,7e-06,9e-06,2e-06,1e-05,5e-06,8e-06,8e-06,1.6e-05,1e-05,6e-06,2e-06,9e-06,2e-06,8e-06,1e-06,9e-06,5e-06,7e-06,3e-06,4e-06,7e-06,3e-06,8e-06,2e-06,9e-06,6e-06,3e-06
8e-06,1.1e-05,4e-06,1.5e-05,9e-06,9e-06,7e-06,2e-06,1e-06,8e-06,1.2e-05,3e-06,3e-06,5e-06,4e-06,1e-06,2e-06,8e-06,2e-06,1.7e-05,1e-05,1.3e-05,3e-06,5e-06,9e-06,5e-06,6e-06,3e-06,2e-06,5e-06,4e-06,4e-06,1e-06,1e-06,0,6e-06,2e-06,8e-06,9e-06,5e-06,9e-06,3e-06,7e-06,6e-06,6e-06,5e-06,3e-06,6e-06,4e-06,7e-06,1e-06,4e-06,6e-06,4e-06,4e-06,8e-06,7e-06,3e-06,7e-06,3e-06,5e-06,8e-06,6e-06,9e-06,7e-06,1.5e-05,1.2e-05,6e-06,1.3e-05,2e-05,1.3e-05,1.2e-05,1e-05,1.2e-05,2.3e-05,1.5e-05,9e-06,1.3e-05,1.6e-05,1.8e-05,1.8e-05,1.3e-05,1.2e-05,1.6e-05,2.1e-05,2.1e-05,1.3e-05,9e-06,1.2e-05,1e-05,1.1e-05,3e-06,3e-06,7e-06,3e-06,1.1e-05,1.3e-05,1.6e-05,1.4e-05,1.5e-05,1.5e-05,1.3e-05,1.4e-05,1e-05,4e-06,1.1e-05,8e-06,1.4e-05,1.4e-05,5e-06,5e-06,9e-06,7e-06,9e-06,2e-06,3e-06,8e-06,6e-06,4e-06,5e-06,7e-06
4e-06,4e-06,3e-06,1.1e-05,2e-06,4e-06,4e-06,6e-06,2e-06,6e-06,6e-06,2e-06,3e-06,6e-06,3e-06,3e-06,3e-06,2e-06,6e-06,7e-06,2e-06,8e-06,4e-06,1e-06,7e-06,3e-06,6e-06,6e-06,4e-06,6e-06,2e-06,1e-06,4e-06,2e-06,4e-06,5e-06,4e-06,4e-06,4e-06,6e-06,6e-06,1e-06,7e-06,7e-06,3e-06,2e-06,4e-06,1e-06,6e-06,6e-06,1e-06,2e-06,4e-06,4e-06,2e-06,9e-06,4e-06,1e-06,8e-06,4e-06,2e-06,5e-06,5e-06,3e-06,7e-06,8e-06,3e-06,5e-06,4e-06,6e-06,1.4e-05,1e-05,6e-06,7e-06,1e-05,8e-06,1e-05,4e-06,1e-06,9e-06,5e-06,3e-06,9e-06,3e-06,4e-06,3e-06,5e-06,7e-06,7e-06,6e-06,1.5e-05,4e-06,2e-06,4e-06,5e-06,6e-06,4e-06,3e-06,1e-05,7e-06,2e-06,1e-05,8e-06,3e-06,6e-06,5e-06,9e-06,4e-06,9e-06,6e-06,3e-06,4e-06,7e-06,5e-06,9e-06,3e-06,3e-06,3e-06,8e-06,3e-06,9e-06
3e-06,3e-06,5e-06,9e-06,2e-06,3e-06,2e-06,6e-06,5e-06,7e-06,9e-06,3e-06,6e-06,1e-06,6e-06,3e-06,7e-06,6e-06,7e-06,9e-06,4e-06,2e-06,3e-06,4e-06,1e-06,0,8e-06,5e-06,3e-06,5e-06,2e-06,3e-06,2e-06,1e-06,3e-06,4e-06,1e-06,3e-06,3e-06,2e-06,3e-06,3e-06,2e-06,1e-06,1e-06,2e-06,1e-06,3e-06,7e-06,8e-06,2e-06,6e-06,1e-06,2e-06,4e-06,8e-06,2e-06,2e-06,6e-06,3e-06,3e-06,5e-06,8e-06,3e-06,7e-06,7e-06,7e-06,4e-06,3e-06,9e-06,8e-06,8e-06,6e-06,4e-06,8e-06,4e-06,1e-05,4e-06,6e-06,3e-06,6e-06,2e-06,6e-06,2e-06,2e-06,4e-06,5e-06,2e-06,2e-06,3e-06,1.3e-05,5e-06,2e-06,1e-06,4e-06,2e-06,3e-06,1e-06,5e-06,4e-06,3e-06,9e-06,2e-06,6e-06,3e-06,3e-06,2e-06,5e-06,3e-06,6e-06,1e-06,7e-06,7e-06,8e-06,9e-06,5e-06,6e-06,5e-06,9e-06,7e-06,3e-06
5e-06,5e-06,1e-06,9e-06,2e-06,1e-06,6e-06,7e-06,2e-06,4e-06,1e-06,3e-06,9e-06,4e-06,7e-06,2e-06,3e-06,4e-06,5e-06,7e-06,4e-06,7e-06,2e-06,5e-06,5e-06,2e-06,8e-06,7e-06,6e-06,6e-06,1e-06,2e-06,2e-06,2e-06,3e-06,4e-06,6e-06,3e-06,2e-06,2e-06,7e-06,3e-06,3e-06,4e-06,3e-06,2e-06,4e-06,6e-06,2e-06,8e-06,4e-06,7e-06,5e-06,6e-06,4e-06,9e-06,3e-06,7e-06,2e-06,2e-06,6e-06,5e-06,8e-06,4e-06,9e-06,3e-06,2e-06,7e-06,1e-06,5e-06,6e-06,6e-06,6e-06,5e-06,8e-06,4e-06,1e-06,6e-06,3e-06,3e-06,2e-06,6e-06,8e-06,7e-06,5e-06,3e-06,6e-06,6e-06,3e-06,5e-06,8e-06,2e-06,1e-06,4e-06,3e-06,2e-06,2e-06,4e-06,1e-06,0,1e-06,6e-06,4e-06,3e-06,5e-06,1e-06,4e-06,5e-06,2e-06,3e-06,1e-06,6e-06,3e-06,2e-06,7e-06,4e-06,3e-06,1e-06,3e-06,4e-06,2e-06
6e-06,6e-06,2e-06,7e-06,3e-06,2e-06,6e-06,4e-06,4e-06,4e-06,7e-06,1e-06,4e-06,3e-06,4e-06,5e-06,2e-06,3e-06,1e-06,4e-06,3e-06,3e-06,3e-06,2e-06,1e-06,3e-06,8e-06,5e-06,3e-06,4e-06,1e-06,2e-06,5e-06,5e-06,6e-06,0,5e-06,2e-06,3e-06,5e-06,6e-06,5e-06,3e-06,3e-06,1e-06,2e-06,5e-06,4e-06,4e-06,7e-06,4e-06,1e-06,1e-06,6e-06,3e-06,1e-05,3e-06,2e-06,5e-06,4e-06,3e-06,8e-06,4e-06,4e-06,6e-06,4e-06,4e-06,7e-06,6e-06,4e-06,4e-06,6e-06,3e-06,4e-06,7e-06,4e-06,3e-06,2e-06,1e-06,2e-06,4e-06,5e-06,1e-06,2e-06,4e-06,5e-06,2e-06,4e-06,2e-06,3e-06,9e-06,4e-06,3e-06,3e-06,4e-06,2e-06,3e-06,2e-06,4e-06,1e-06,4e-06,6e-06,6e-06,2e-06,4e-06,1e-06,4e-06,7e-06,3e-06,7e-06,1e-06,2e-06,1e-06,4e-06,4e-06,7e-06,3e-06,3e-06,4e-06,7e-06,2e-06
8e-06,5e-06,5e-06,8e-06,2e-06,1e-06,4e-06,1e-06,4e-06,3e-06,7e-06,5e-06,3e-06,5e-06,4e-06,1e-06,1e-06,6e-06,4e-06,1e-05,2e-06,4e-06,3e-06,2e-06,2e-06,2e-06,6e-06,3e-06,5e-06,4e-06,1e-06,2e-06,2e-06,3e-06,2e-06,2e-06,2e-06,1e-06,3e-06,2e-06,3e-06,2e-06,5e-06,3e-06,3e-06,1e-06,2e-06,3e-06,2e-06,3e-06,2e-06,3e-06,2e-06,4e-06,3e-06,8e-06,3e-06,4e-06,9e-06,3e-06,2e-06,3e-06,3e-06,4e-06,2e-06,2e-06,1e-06,3e-06,3e-06,4e-06,4e-06,8e-06,3e-06,3e-06,7e-06,4e-06,1e-06,3e-06,3e-06,0,5e-06,3e-06,2e-06,3e-06,4e-06,2e-06,2e-06,4e-06,5e-06,3e-06,8e-06,2e-06,3e-06,3e-06,3e-06,2e-06,3e-06,3e-06,6e-06,2e-06,3e-06,6e-06,4e-06,3e-06,5e-06,1e-06,1e-06,4e-06,6e-06,2e-06,3e-06,5e-06,2e-06,1e-06,4e-06,4e-06,1e-06,2e-06,7e-06,4e-06,2e-06
8e-06,5e-06,2e-06,8e-06,2e-06,1e-06,6e-06,3e-06,1e-06,2e-06,4e-06,3e-06,3e-06,4e-06,3e-06,3e-06,2e-06,4e-06,4e-06,6e-06,2e-06,5e-06,1e-06,1e-06,4e-06,2e-06,8e-06,5e-06,3e-06,2e-06,2e-06,1e-06,3e-06,3e-06,5e-06,2e-06,2e-06,1e-06,5e-06,5e-06,2e-06,3e-06,3e-06,2e-06,2e-06,4e-06,3e-06,2e-06,3e-06,5e-06,1e-06,3e-06,2e-06,5e-06,4e-06,1e-05,3e-06,4e-06,5e-06,3e-06,4e-06,5e-06,3e-06,1e-06,4e-06,0,3e-06,1e-06,1e-06,5e-06,7e-06,9e-06,2e-06,2e-06,6e-06,5e-06,6e-06,0,4e-06,3e-06,3e-06,4e-06,2e-06,2e-06,2e-06,5e-06,1e-06,3e-06,3e-06,3e-06,8e-06,3e-06,0,4e-06,5e-06,1e-06,2e-06,3e-06,2e-06,3e-06,2e-06,5e-06,4e-06,4e-06,4e-06,1e-06,2e-06,3e-06,4e-06,3e-06,3e-06,3e-06,2e-06,4e-06,4e-06,3e-06,4e-06,3e-06,2e-06,3e-06,1e-06
3e-06,4e-06,2e-06,7e-06,3e-06,1e-06,6e-06,4e-06,1e-06,1e-06,2e-06,0,1e-06,3e-06,2e-06,4e-06,1e-06,2e-06,3e-06,3e-06,5e-06,2e-06,3e-06,1e-06,3e-06,2e-06,6e-06,3e-06,4e-06,5e-06,4e-06,5e-06,4e-06,3e-06,1e-06,0,4e-06,2e-06,4e-06,1e-06,2e-06,2e-06,3e-06,1e-06,2e-06,3e-06,6e-06,4e-06,1e-06,3e-06,0,4e-06,3e-06,4e-06,1e-06,1e-05,4e-06,3e-06,5e-06,2e-06,2e-06,5e-06,4e-06,4e-06,5e-06,3e-06,5e-06,5e-06,2e-06,4e-06,7e-06,2e-06,6e-06,2e-06,5e-06,5e-06,4e-06,3e-06,3e-06,1e-06,2e-06,1e-06,1e-06,2e-06,0,6e-06,4e-06,2e-06,2e-06,2e-06,7e-06,6e-06,3e-06,1e-06,4e-06,3e-06,0,5e-06,2e-06,1e-06,2e-06,6e-06,4e-06,1e-06,6e-06,2e-06,1e-06,3e-06,4e-06,1e-06,3e-06,4e-06,1e-06,3e-06,5e-06,1e-06,2e-06,5e-06,6e-06,5e-06,1e-06
3e-06,4e-06,2e-06,5e-06,4e-06,1e-06,5e-06,3e-06,2e-06,1e-06,6e-06,5e-06,2e-06,2e-06,1e-06,4e-06,5e-06,2e-06,2e-06,6e-06,1e-06,4e-06,3e-06,2e-06,2e-06,2e-06,3e-06,2e-06,0,5e-06,3e-06,3e-06,3e-06,1e-06,2e-06,1e-06,2e-06,5e-06,3e-06,2e-06,3e-06,1e-06,1e-06,2e-06,2e-06,2e-06,4e-06,1e-06,3e-06,5e-06,2e-06,5e-06,1e-06,3e-06,1e-06,9e-06,2e-06,3e-06,6e-06,2e-06,2e-06,4e-06,4e-06,4e-06,1e-06,1e-06,3e-06,4e-06,1e-06,1e-06,4e-06,3e-06,5e-06,3e-06,8e-06,6e-06,4e-06,3e-06,4e-06,3e-06,3e-06,2e-06,0,1e-06,2e-06,5e-06,1e-06,2e-06,1e-06,2e-06,1e-05,5e-06,3e-06,3e-06,2e-06,2e-06,2e-06,4e-06,3e-06,2e-06,2e-06,5e-06,3e-06,3e-06,7e-06,3e-06,1e-06,3e-06,4e-06,5e-06,2e-06,5e-06,2e-06,4e-06,4e-06,2e-06,3e-06,2e-06,6e-06,3e-06,3e-06
6e-06,4e-06,1e-06,3e-06,6e-06,4e-06,2e-06,7e-06,3e-06,1e-06,7e-06,5e-06,5e-06,5e-06,2e-06,2e-06,3e-06,6e-06,5e-06,8e-06,1e-06,5e-06,2e-06,2e-06,2e-06,2e-06,5e-06,4e-06,1e-06,1e-06,4e-06,2e-06,1e-06,0,3e-06,2e-06,2e-06,3e-06,1e-06,2e-06,2e-06,1e-06,2e-06,2e-06,2e-06,2e-06,2e-06,2e-06,4e-06,4e-06,4e-06,2e-06,2e-06,3e-06,2e-06,4e-06,2e-06,1e-06,6e-06,1e-06,1e-06,6e-06,4e-06,3e-06,4e-06,1e-06,5e-06,2e-06,4e-06,5e-06,2e-06,4e-06,5e-06,2e-06,6e-06,5e-06,5e-06,4e-06,7e-06,4e-06,5e-06,3e-06,5e-06,4e-06,5e-06,7e-06,6e-06,3e-06,0,2e-06,6e-06,2e-06,4e-06,3e-06,3e-06,3e-06,2e-06,2e-06,5e-06,1e-06,3e-06,5e-06,6e-06,4e-06,3e-06,2e-06,3e-06,2e-06,4e-06,2e-06,1e-06,2e-06,1e-06,3e-06,6e-06,3e-06,1e-06,3e-06,9e-06,8e-06,2e-06
1e-06,5e-06,2e-06,3e-06,2e-06,2e-06,2e-06,1e-06,2e-06,2e-06,5e-06,1e-06,3e-06,2e-06,2e-06,2e-06,2e-06,4e-06,1e-06,3e-06,4e-06,4e-06,2e-06,4e-06,2e-06,2e-06,8e-06,2e-06,3e-06,1e-06,3e-06,2e-06,2e-06,1e-06,1e-06,2e-06,2e-06,1e-06,3e-06,1e-06,1e-06,2e-06,3e-06,2e-06,3e-06,3e-06,1e-06,2e-06,3e-06,4e-06,0,2e-06,3e-06,1e-06,4e-06,9e-06,5e-06,4e-06,6e-06,1e-06,2e-06,4e-06,5e-06,1e-06,1e-06,5e-06,1e-06,1e-06,2e-06,2e-06,4e-06,3e-06,3e-06,3e-06,8e-06,4e-06,6e-06,9e-06,1e-06,3e-06,7e-06,2e-06,4e-06,2e-06,3e-06,5e-06,5e-06,4e-06,2e-06,4e-06,8e-06,4e-06,3e-06,3e-06,4e-06,1e-06,2e-06,2e-06,4e-06,2e-06,4e-06,2e-06,6e-06,2e-06,3e-06,3e-06,2e-06,5e-06,1e-06,3e-06,0,4e-06,4e-06,5e-06,6e-06,3e-06,3e-06,2e-06,9e-06,4e-06,2e-06
4e-06,4e-06,1e-06,5e-06,4e-06,1e-06,5e-06,2e-06,1e-06,2e-06,3e-06,0,4e-06,2e-06,1e-06,3e-06,2e-06,4e-06,2e-06,4e-06,0,5e-06,2e-06,1e-06,2e-06,4e-06,6e-06,4e-06,3e-06,4e-06,3e-06,1e-06,3e-06,1e-06,2e-06,4e-06,5e-06,1e-06,1e-06,3e-06,2e-06,2e-06,1e-06,1e-06,4e-06,2e-06,3e-06,2e-06,4e-06,0,4e-06,2e-06,2e-06,2e-06,2e-06,7e-06,5e-06,2e-06,7e-06,1e-06,3e-06,1e-06,6e-06,2e-06,2e-06,8e-06,3e-06,4e-06,1e-06,2e-06,5e-06,7e-06,4e-06,3e-06,1e-05,8e-06,8e-06,5e-06,2e-06,3e-06,3e-06,3e-06,5e-06,6e-06,2e-06,3e-06,1e-06,2e-06,2e-06,3e-06,6e-06,3e-06,4e-06,1e-06,4e-06,1e-06,3e-06,5e-06,1e-06,2e-06,1e-06,3e-06,3e-06,2e-06,4e-06,2e-06,3e-06,2e-06,2e-06,1e-06,1e-06,5e-06,4e-06,1e-06,7e-06,6e-06,3e-06,2e-06,9e-06,4e-06,3e-06
2e-06,4e-06,2e-06,4e-06,1e-06,0,3e-06,4e-06,2e-06,1e-06,4e-06,1e-06,2e-06,2e-06,2e-06,0,2e-06,3e-06,2e-06,5e-06,2e-06,3e-06,3e-06,1e-06,1e-06,1e-06,8e-06,4e-06,3e-06,7e-06,2e-06,1e-06,2e-06,3e-06,2e-06,2e-06,4e-06,3e-06,3e-06,4e-06,4e-06,2e-06,2e-06,1e-06,3e-06,1e-06,4e-06,3e-06,3e-06,3e-06,3e-06,4e-06,2e-06,4e-06,6e-06,7e-06,3e-06,2e-06,4e-06,3e-06,1e-06,6e-06,2e-06,6e-06,1e-05,1.4e-05,9e-06,3e-06,6e-06,5e-06,2e-06,3e-06,2e-06,1e-06,5e-06,3e-06,8e-06,6e-06,2e-06,1e-06,6e-06,5e-06,2e-06,2e-06,5e-06,4e-06,1e-06,1e-06,1e-06,1e-06,3e-06,7e-06,4e-06,2e-06,3e-06,2e-06,4e-06,4e-06,5e-06,2e-06,4e-06,5e-06,7e-06,2e-06,5e-06,1e-06,3e-06,3e-06,4e-06,4e-06,4e-06,5e-06,5e-06,5e-06,7e-06,2e-06,3e-06,2e-06,8e-06,3e-06,4e-06
3e-06,5e-06,2e-06,6e-06,3e-06,1e-06,1e-06,4e-06,3e-06,1e-06,3e-06,1e-06,2e-06,2e-06,1e-06,2e-06,1e-06,4e-06,1e-06,6e-06,0,2e-06,1e-06,1e-06,1e-06,2e-06,7e-06,1e-06,3e-06,3e-06,1e-06,1e-06,1e-06,2e-06,4e-06,2e-06,4e-06,3e-06,2e-06,3e-06,4e-06,2e-06,1e-06,1e-06,1e-06,0,3e-06,2e-06,2e-06,1e-06,1e-06,3e-06,2e-06,4e-06,1e-06,6e-06,3e-06,1e-06,3e-06,2e-06,2e-06,7e-06,6e-06,5e-06,9e-06,1.1e-05,1.1e-05,7e-06,7e-06,4e-06,4e-06,0,4e-06,4e-06,5e-06,2e-06,9e-06,7e-06,9e-06,4e-06,6e-06,5e-06,5e-06,3e-06,2e-06,3e-06,2e-06,2e-06,1e-06,4e-06,1e-05,2e-06,1e-06,3e-06,2e-06,1e-06,2e-06,4e-06,3e-06,4e-06,6e-06,6e-06,5e-06,6e-06,1e-06,3e-06,5e-06,5e-06,1e-06,6e-06,1e-06,1e-06,2e-06,2e-06,4e-06,3e-06,3e-06,2e-06,7e-06,1e-06,1e-06
2e-06,4e-06,2e-06,5e-06,2e-06,1e-06,3e-06,3e-06,1e-06,0,4e-06,1e-06,3e-06,1e-06,1e-06,1e-06,1e-06,4e-06,2e-06,6e-06,2e-06,3e-06,1e-06,1e-06,2e-06,2e-06,5e-06,1e-06,1e-06,2e-06,2e-06,0,1e-06,0,2e-06,1e-06,3e-06,1e-06,2e-06,3e-06,4e-06,1e-06,1e-06,2e-06,1e-06,0,2e-06,1e-06,0,2e-06,1e-06,3e-06,1e-06,1e-06,1e-06,8e-06,1e-06,2e-06,4e-06,2e-06,2e-06,5e-06,4e-06,3e-06,4e-06,4e-06,1e-06,0,3e-06,4e-06,2e-06,3e-06,2e-06,3e-06,6e-06,2e-06,5e-06,1e-06,4e-06,1e-06,2e-06,1e-06,3e-06,2e-06,3e-06,5e-06,1e-06,1e-06,2e-06,4e-06,8e-06,3e-06,2e-06,1e-06,3e-06,0,1e-06,2e-06,2e-06,2e-06,3e-06,6e-06,2e-06,3e-06,3e-06,1e-06,4e-06,2e-06,1e-06,4e-06,1e-06,3e-06,0,3e-06,4e-06,3e-06,2e-06,1e-06,7e-06,2e-06,2e-06
3e-06,4e-06,1e-06,6e-06,2e-06,1e-06,3e-06,4e-06,1e-06,0,4e-06,1e-06,3e-06,1e-06,1e-06,1e-06,1e-06,3e-06,2e-06,6e-06,2e-06,2e-06,1e-06,0,1e-06,1e-06,6e-06,1e-06,3e-06,3e-06,2e-06,0,0,1e-06,2e-06,1e-06,3e-06,2e-06,2e-06,3e-06,3e-06,2e-06,1e-06,1e-06,2e-06,2e-06,2e-06,2e-06,1e-06,2e-06,1e-06,3e-06,1e-06,2e-06,2e-06,7e-06,2e-06,2e-06,5e-06,1e-06,1e-06,5e-06,4e-06,3e-06,3e-06,1e-06,1e-06,0,1e-06,3e-06,3e-06,2e-06,2e-06,3e-06,5e-06,3e-06,4e-06,2e-06,3e-06,1e-06,3e-06,1e-06,2e-06,2e-06,3e-06,3e-06,1e-06,2e-06,2e-06,3e-06,8e-06,3e-06,2e-06,2e-06,2e-06,0,1e-06,2e-06,2e-06,0,2e-06,5e-06,2e-06,2e-06,4e-06,1e-06,3e-06,3e-06,2e-06,3e-06,0,3e-06,0,3e-06,5e-06,2e-06,2e-06,1e-06,7e-06,2e-06,1e-06
2e-06,4e-06,1e-06,6e-06,2e-06,1e-06,3e-06,4e-06,1e-06,0,4e-06,1e-06,3e-06,1e-06,1e-06,1e-06,2e-06,3e-06,2e-06,6e-06,1e-06,3e-06,1e-06,0,2e-06,1e-06,5e-06,0,3e-06,2e-06,1e-06,0,0,0,1e-06,1e-06,3e-06,2e-06,2e-06,3e-06,4e-06,2e-06,0,1e-06,1e-06,2e-06,2e-06,2e-06,1e-06,2e-06,1e-06,2e-06,0,2e-06,2e-06,7e-06,1e-06,2e-06,5e-06,1e-06,1e-06,5e-06,4e-06,2e-06,3e-06,1e-06,1e-06,1e-06,1e-06,3e-06,3e-06,3e-06,2e-06,3e-06,5e-06,3e-06,4e-06,2e-06,3e-06,1e-06,2e-06,1e-06,2e-06,2e-06,2e-06,3e-06,0,2e-06,1e-06,3e-06,8e-06,3e-06,1e-06,2e-06,2e-06,1e-06,0,2e-06,2e-06,0,2e-06,6e-06,3e-06,1e-06,4e-06,1e-06,2e-06,3e-06,2e-06,3e-06,0,3e-06,0,2e-06,4e-06,2e-06,1e-06,1e-06,6e-06,3e-06,1e-06
