-0.001486,-0.001207,-0.001211,-0.002436,-0.002374,-0.001805,-0.001496,-0.001487,-0.001441,-0.001664,-0.002303,-0.001273,-0.001092,-0.001273,-0.001272,-0.001581,-0.002852,-0.002053,-0.001488,-0.001758,-0.001453,-0.001213,-0.001014,-0.000727,-0.001445,-0.002068,-0.001011,-0.000729
-0.000686,-0.000783,-0.000567,-0.001516,-0.001224,-0.000687,-0.000708,-0.000647,-0.000551,-0.000852,-0.001234,-0.000559,-0.000358,-0.000152,-0.000398,-0.000729,-0.001819,-0.001095,-0.000651,-0.001147,-0.001083,-0.000718,-0.000563,-0.000353,-0.000939,-0.001382,-0.000699,-0.000477
-1.6e-05,-0.000194,6.6e-05,0.000515,0.000672,0.000556,0.000381,0.000302,3.8e-05,-3.7e-05,0.000682,0.000313,4e-05,3.4e-05,-8.1e-05,2.2e-05,0.000466,0.000379,0.000325,0.000362,0.000323,0.000203,4.2e-05,1.5e-05,0.000468,0.000837,0.00012,-4.5e-05
0.001079,0.001006,0.000916,0.001999,0.001621,0.001066,0.001022,0.000779,0.000657,0.000984,0.001689,0.000828,0.000618,0.000582,0.000712,0.000886,0.002478,0.001586,0.001171,0.001553,0.00134,0.000974,0.000815,0.000446,0.001206,0.00191,0.000915,0.000601
0.00083,0.000972,0.000564,0.000957,0.000725,0.000426,0.000442,0.000535,0.000897,0.001184,0.000607,0.000338,0.000556,0.000593,0.000722,0.000899,0.001312,0.000888,0.000344,0.000614,0.000631,0.000571,0.000551,0.000442,0.000381,0.000324,0.00046,0.000518
-0.000698,-0.000497,-0.000712,-0.001535,-0.001279,-0.000995,-0.000866,-0.000524,-0.00032,-0.000534,-0.001502,-0.000672,-0.000482,-0.000644,-0.000521,-0.000506,-0.001928,-0.001285,-0.001115,-0.001211,-0.000995,-0.000768,-0.000586,-0.000258,-0.00099,-0.00178,-0.000674,-0.00036
-0.000944,-0.000945,-0.000626,-0.001594,-0.001429,-0.000912,-0.00078,-0.000799,-0.001013,-0.001288,-0.001198,-0.00059,-0.000595,-0.000583,-0.000588,-0.000901,-0.001988,-0.001451,-0.000603,-0.001009,-0.001087,-0.000893,-0.000711,-0.000531,-0.00087,-0.001107,-0.000606,-0.000566
-0.000174,-0.000373,0.000114,0.00051,0.000487,0.000531,0.000371,0.000155,-0.000182,-0.00012,9e-04,0.000265,8e-05,0.000315,-8e-06,-1.6e-05,0.00053,0.000344,0.000553,0.000421,0.00029,0.000226,4.3e-05,-5.2e-05,0.000483,0.001123,0.000163,-0.000106
0.000811,0.000502,0.000537,0.001661,0.001551,0.001011,0.000761,0.000632,0.000623,0.000747,0.001314,0.000637,0.000399,0.000407,0.000338,0.00051,0.001973,0.001528,0.000847,0.001085,0.001067,0.000864,0.000682,0.000375,0.001005,0.001492,0.000537,0.000391
0.000558,0.00073,0.000244,0.000277,0.000182,-3.5e-05,2.3e-05,-6.5e-05,0.00036,0.000376,-0.000337,7e-06,8.9e-05,-0.000133,0.000234,0.000106,0.000533,0.000455,-0.000128,0.000113,0.000302,0.000213,0.000268,0.000155,-4.5e-05,-0.000358,0.000165,0.00039
-0.000457,6e-05,-0.000437,-0.001363,-0.001306,-0.000865,-0.000543,-0.000382,-0.000195,-0.00013,-0.001182,-0.000582,-0.000178,-0.000235,-0.000302,-0.000246,-0.00148,-0.0012,-0.000964,-0.000868,-0.000703,-0.000571,-0.000471,-0.000101,-0.000845,-0.001479,-0.000395,-0.000137
-0.00024,-0.00033,-0.000165,-0.000598,-0.000513,-0.00026,-9.9e-05,0.000245,-0.000131,-0.000144,-4.8e-05,-5.6e-05,8.9e-05,0.000245,-2.1e-05,0.000172,-0.000752,-0.00066,4.9e-05,-0.000209,-0.000552,-0.000356,-0.000221,-1.6e-05,-0.000204,-0.000255,-0.000184,-0.000337
-8.4e-05,-0.000523,0.000232,0.000748,0.00084,6e-04,0.000262,0.000286,-5.2e-05,-0.000236,0.000917,0.000448,5e-06,6.1e-05,0.000309,0.000212,0.000552,0.000445,0.000689,0.00038,0.00019,0.00013,5.3e-05,-0.000162,0.000498,0.001111,0.000206,-0.000151
-8.7e-05,-0.000222,4.4e-05,0.000796,0.000685,0.000371,-1.4e-05,-0.000323,-0.000122,-9.8e-05,0.000439,0.000106,-0.000203,-0.000219,-0.000102,-0.000222,0.000719,0.000564,0.000102,0.000223,0.000558,0.00039,0.000185,-0.000123,0.000352,0.000724,0.00017,0.000162
0.000342,0.000555,-5e-05,-0.000106,-0.000374,-0.000382,-8.9e-05,-0.000297,0.000111,0.000245,-0.00062,-0.000315,-3.6e-05,-9.2e-05,-0.000268,-0.000303,0.00027,0.00031,-0.000273,2.1e-05,0.000207,0.000204,0.000291,0.000248,-0.000147,-0.000568,-5.5e-05,0.000329
6.3e-05,0.000428,-0.000165,-0.00098,-0.00078,-0.000372,8.4e-05,0.000101,0.000117,9e-06,-0.000841,-0.000258,4.6e-05,-5.8e-05,-0.000155,-0.000174,-0.000879,-0.000504,-0.000452,-0.000297,-0.000409,-0.000392,-0.000272,0.000137,-0.000428,-0.001025,-0.000254,-2.7e-05
-7.7e-05,-8.4e-05,3.9e-05,-0.000305,4e-05,0.000249,0.000106,0.000303,-5.2e-05,-1.3e-05,0.000295,0.000201,0.000264,0.000369,0.000222,0.000336,-0.000466,-0.000576,8.9e-05,-6.6e-05,-0.000344,-0.00027,-0.000296,-8.6e-05,-5.3e-05,6e-05,1e-05,-0.00025
4.2e-05,-0.000333,0.000294,0.000859,0.000696,0.000315,-2.1e-05,0.000278,8.6e-05,0.000258,0.001009,0.000391,0.000184,0.000264,0.00044,0.000582,0.000894,0.000377,0.000608,0.000255,0.000127,0.000236,0.000212,-7e-05,0.000407,0.001057,0.000306,-9e-05
-0.000258,-0.000454,-6.1e-05,0.000584,0.000239,-0.000157,-0.000239,-0.000261,-4.3e-05,-0.000162,0.000117,-4e-05,-0.000385,-0.000514,-9.5e-05,-0.000135,0.00031,0.00045,-2.9e-05,-7e-05,0.00028,0.000175,0.000125,-0.000157,0.000103,0.000305,1e-06,-5e-06
