0.099717,0.092703,0.085884,0.096036,0.114583,0.141859,0.163532,0.137088,0.116628,0.127352,0.114214,0.098319,0.099557,0.100533,0.095216,0.090237,0.101542,0.10841,0.099337,0.099163,0.100291,0.09569,0.0928,0.079854,0.06532,0.066608,0.073043,0.076591
0.119341,0.113952,0.106352,0.118363,0.141972,0.167538,0.185299,0.160064,0.142037,0.15623,0.140342,0.118356,0.118426,0.118714,0.114419,0.110648,0.125116,0.134437,0.124222,0.125353,0.126289,0.122568,0.122579,0.104464,0.084688,0.08652,0.092785,0.09595
0.148458,0.14866,0.141557,0.155009,0.185607,0.204949,0.214615,0.193891,0.179729,0.198742,0.179154,0.147039,0.145445,0.145169,0.143543,0.14177,0.160933,0.174599,0.164051,0.16951,0.169274,0.167489,0.175165,0.149097,0.120958,0.12353,0.128739,0.132338
0.159941,0.169036,0.165303,0.174568,0.204305,0.21462,0.21684,0.202671,0.191487,0.210686,0.191284,0.156424,0.15612,0.15666,0.155953,0.153588,0.172023,0.188026,0.183584,0.196119,0.192959,0.193597,0.211374,0.181604,0.150514,0.155529,0.159581,0.16441
0.151424,0.16443,0.166897,0.170762,0.188499,0.196433,0.200704,0.184116,0.167875,0.182113,0.17212,0.149893,0.153255,0.155467,0.152242,0.144768,0.153979,0.168295,0.171806,0.185971,0.180424,0.182631,0.206042,0.18126,0.15752,0.166525,0.169607,0.173453
0.147773,0.151802,0.169377,0.178554,0.176025,0.191742,0.210986,0.176653,0.140784,0.149427,0.161513,0.157269,0.154751,0.157678,0.155732,0.142667,0.144264,0.159897,0.159402,0.160747,0.153405,0.154064,0.172394,0.160347,0.151923,0.158399,0.157733,0.158562
0.190866,0.18529,0.218092,0.237886,0.22725,0.252486,0.274581,0.220239,0.172571,0.182337,0.206559,0.203482,0.19247,0.198008,0.197826,0.175513,0.179264,0.21194,0.201484,0.180538,0.167075,0.161415,0.170568,0.172681,0.181005,0.177537,0.170668,0.171511
0.292282,0.286569,0.324833,0.348979,0.344485,0.381389,0.401794,0.327568,0.273545,0.297115,0.319403,0.308522,0.302097,0.315672,0.310158,0.260709,0.261163,0.320099,0.299315,0.255094,0.241898,0.231639,0.233683,0.245072,0.258179,0.245898,0.240166,0.245113
0.466491,0.476987,0.529673,0.555082,0.544483,0.591873,0.612411,0.507506,0.459363,0.526231,0.539951,0.511367,0.519407,0.554475,0.545074,0.431298,0.409965,0.509801,0.463961,0.380084,0.374668,0.351296,0.341983,0.377563,0.394159,0.371381,0.364593,0.363462
0.732169,0.775748,0.873225,0.892961,0.854071,0.931384,0.956534,0.789787,0.759364,0.904543,0.902379,0.834572,0.864833,0.953813,0.946909,0.714515,0.642625,0.813245,0.719184,0.552353,0.566293,0.529234,0.506646,0.592846,0.624144,0.588537,0.569887,0.538873
1.05403,1.148722,1.332389,1.32671,1.222612,1.354901,1.410416,1.159405,1.150096,1.389402,1.353697,1.232374,1.306459,1.483397,1.479564,1.083786,0.942405,1.217239,1.054008,0.743473,0.776571,0.746214,0.723908,0.877148,0.928035,0.885948,0.8472,0.760407
1.289491,1.451681,1.723649,1.666428,1.478062,1.663893,1.780441,1.468171,1.485745,1.809913,1.737923,1.581549,1.705385,1.9529,1.941347,1.394678,1.189536,1.56359,1.343425,0.881405,0.931889,0.94444,0.93312,1.128479,1.190099,1.157014,1.088365,0.929945
1.266996,1.486623,1.772228,1.647735,1.405886,1.603319,1.785364,1.49549,1.538606,1.884269,1.789755,1.640662,1.787922,2.033146,2.010515,1.436322,1.207448,1.604317,1.397584,0.892578,0.947233,1.001503,0.993442,1.168266,1.217671,1.216454,1.137249,0.944906
0.972483,1.176664,1.370081,1.225381,1.019978,1.171064,1.374094,1.179728,1.205181,1.475477,1.396674,1.297238,1.4098,1.565207,1.547389,1.137638,0.961849,1.268818,1.160411,0.793792,0.807809,0.841842,0.822319,0.914822,0.945549,0.987104,0.93833,0.786132
0.713072,0.836067,0.915294,0.838436,0.712157,0.793192,0.946463,0.845405,0.788896,0.907167,0.906576,0.89992,0.916823,0.915607,0.893832,0.731227,0.740515,0.982733,0.930221,0.715389,0.669577,0.646518,0.577878,0.570594,0.629287,0.687606,0.680538,0.613018
0.929193,1.052323,1.086016,1.061832,0.973769,1.030621,1.072743,0.940048,0.846329,0.881948,0.934283,1.018925,0.977212,0.789216,0.684202,0.646406,0.87901,1.234253,1.181368,0.963993,0.851719,0.783941,0.672881,0.59902,0.686153,0.736239,0.746016,0.718601
1.45531,1.590699,1.645661,1.649765,1.513684,1.574332,1.578341,1.36987,1.235964,1.236069,1.311756,1.504924,1.446213,1.094259,0.92964,0.894165,1.232347,1.797821,1.766098,1.475366,1.314585,1.177247,1.046656,0.97698,1.046499,1.06459,1.09863,1.087176
2.011441,2.094791,2.186769,2.223317,2.032501,2.10314,2.115134,1.841698,1.627723,1.573551,1.676015,2.008455,2.009925,1.546215,1.309824,1.20187,1.519948,2.272248,2.318696,2.013303,1.853058,1.606278,1.477359,1.484672,1.480405,1.395574,1.454339,1.513347
2.370008,2.33448,2.494756,2.542633,2.331012,2.368019,2.419769,2.188207,1.889564,1.739133,1.833282,2.303186,2.476181,2.011919,1.691525,1.464478,1.655851,2.511438,2.694923,2.416204,2.285018,1.929958,1.815033,1.99245,1.915254,1.64443,1.672986,1.874105
2.488433,2.339597,2.579428,2.566036,2.390789,2.377086,2.484677,2.371928,2.039526,1.887154,1.914347,2.31361,2.679749,2.367416,1.988366,1.672079,1.748749,2.5647,2.845999,2.626057,2.465626,2.002158,1.901166,2.365794,2.355768,1.851923,1.741828,2.075145
2.406923,2.254583,2.503761,2.423451,2.330473,2.300649,2.389028,2.347087,2.099365,2.10829,2.03623,2.13171,2.623759,2.520936,2.090112,1.776577,1.78226,2.322435,2.629804,2.569544,2.311969,1.816087,1.749945,2.521927,2.717598,2.05524,1.838861,2.172305
2.100662,1.965349,2.066437,2.015018,2.029791,1.963872,2.012542,2.053201,1.91442,2.062151,1.962637,1.796259,2.278173,2.275583,1.882066,1.723759,1.724163,1.81892,1.953428,2.036688,1.781433,1.515273,1.61486,2.411467,2.679755,2.039931,1.827167,2.090704
1.622517,1.459515,1.339901,1.367565,1.541016,1.521185,1.573562,1.679662,1.568679,1.714303,1.63516,1.371245,1.742288,1.828955,1.677014,1.625032,1.526814,1.298396,1.15369,1.250606,1.223998,1.289726,1.444074,1.908545,2.101899,1.70208,1.554424,1.782658
1.299348,1.151967,0.929662,0.947712,1.108472,1.224864,1.278404,1.275405,1.255128,1.353886,1.224526,1.038277,1.261163,1.405076,1.489361,1.42672,1.23347,0.956129,0.703659,0.723132,0.864121,1.108871,1.182598,1.245483,1.314011,1.180369,1.089278,1.27469
1.342421,1.24484,0.990697,0.945302,1.008945,1.230471,1.230287,1.021925,1.024419,1.041204,0.894145,0.846483,0.982776,1.112331,1.33045,1.299807,1.040964,0.802583,0.668778,0.673581,0.784713,0.967706,0.936719,0.883096,0.861429,0.785689,0.755331,0.892987
1.489313,1.404336,1.152166,1.114044,1.096859,1.27296,1.246298,1.041664,1.038549,0.974198,0.857052,0.91826,1.076709,1.171748,1.414989,1.445284,1.148672,0.895954,0.82681,0.832756,0.866312,0.971741,0.892121,0.816257,0.711155,0.598052,0.685166,0.855333
1.70287,1.486221,1.211834,1.196803,1.147049,1.252255,1.206406,1.182951,1.186253,0.973125,0.96671,1.140328,1.239248,1.360711,1.629581,1.644273,1.318272,1.033972,0.952868,0.890966,0.883351,1.012764,0.961598,0.888136,0.726574,0.589346,0.827946,1.090769
1.72044,1.445678,1.234787,1.274837,1.235037,1.290316,1.241674,1.352753,1.311416,1.02732,1.161966,1.364833,1.329307,1.455027,1.788426,1.82314,1.493783,1.206426,1.005198,0.764924,0.746744,0.902983,0.904515,0.960439,0.861081,0.727065,1.081086,1.439904
1.513922,1.325292,1.145289,1.231477,1.205639,1.244562,1.378983,1.562382,1.353773,1.045452,1.256668,1.518989,1.389448,1.358303,1.699158,1.815891,1.559682,1.315828,0.977908,0.575786,0.539301,0.690505,0.787611,1.069512,1.091548,0.894779,1.237415,1.658442
1.244365,1.135944,0.905867,1.104452,1.160304,1.090378,1.393112,1.655828,1.31196,1.020103,1.211988,1.485783,1.365298,1.139622,1.348221,1.565045,1.42453,1.236543,0.922201,0.51372,0.493812,0.713263,0.805437,1.098311,1.225799,0.981953,1.17542,1.555949
0.997717,0.903561,0.662991,0.907347,1.060607,0.957772,1.25434,1.476569,1.108368,0.908882,1.142489,1.372951,1.218363,0.946506,1.071748,1.343931,1.300243,1.148149,0.866429,0.513284,0.565339,0.864517,0.87517,0.995689,1.134189,0.950656,1.026696,1.265486
0.7508,0.61541,0.463836,0.683821,0.856805,0.841389,0.996954,1.080216,0.81296,0.683424,0.922337,1.074545,0.885025,0.775314,1.020098,1.151347,1.037479,0.984402,0.793272,0.529901,0.604362,0.896267,0.854312,0.800961,0.838678,0.79473,0.966256,1.119197
0.559343,0.403766,0.335282,0.525993,0.648316,0.692052,0.735239,0.776013,0.623229,0.495714,0.621749,0.667696,0.549321,0.614738,0.933477,0.921107,0.737939,0.770194,0.666536,0.503796,0.562619,0.757253,0.705439,0.613299,0.569065,0.565119,0.773245,0.893474
0.462728,0.32551,0.283309,0.401931,0.498767,0.573374,0.625591,0.726627,0.684334,0.560388,0.540487,0.466158,0.47379,0.554424,0.771005,0.755801,0.605123,0.669574,0.5998,0.47616,0.511343,0.550297,0.560686,0.642711,0.604563,0.464649,0.530787,0.656842
0.420559,0.283975,0.268936,0.306631,0.37134,0.437562,0.477966,0.615665,0.678408,0.639838,0.608863,0.495714,0.522762,0.536892,0.582298,0.594909,0.526533,0.575019,0.54074,0.473861,0.450198,0.406407,0.537048,0.68458,0.652444,0.518936,0.503089,0.546861
0.455638,0.294945,0.317481,0.322148,0.317298,0.362989,0.378609,0.441414,0.537876,0.62279,0.633838,0.531725,0.535728,0.534756,0.506856,0.468079,0.421352,0.442029,0.520237,0.513591,0.376931,0.361377,0.564854,0.615789,0.605969,0.618338,0.565672,0.518872
0.555059,0.367404,0.394977,0.421053,0.358763,0.380703,0.423822,0.379696,0.37663,0.545105,0.685115,0.578213,0.479067,0.483657,0.535998,0.474734,0.371501,0.395432,0.562736,0.559689,0.359308,0.372256,0.544738,0.487217,0.482726,0.63226,0.625215,0.587763
0.609886,0.423445,0.422968,0.515223,0.444901,0.443343,0.497994,0.411858,0.36417,0.533763,0.739368,0.617769,0.446876,0.469186,0.586184,0.502394,0.405203,0.452489,0.587351,0.55004,0.35875,0.363875,0.461685,0.386974,0.36445,0.529656,0.574432,0.577555
0.564137,0.422957,0.401862,0.577077,0.50729,0.475615,0.513363,0.434278,0.392149,0.511932,0.690962,0.591402,0.446094,0.475598,0.586908,0.459857,0.435948,0.512841,0.527907,0.438453,0.29567,0.289949,0.320634,0.288983,0.290065,0.374678,0.42056,0.447823
0.418805,0.352688,0.413586,0.61956,0.558577,0.525236,0.496051,0.415754,0.357161,0.408278,0.520152,0.458907,0.383817,0.410815,0.513733,0.365488,0.410889,0.512241,0.395458,0.274208,0.19146,0.18118,0.17592,0.201136,0.247944,0.297925,0.269561,0.271168
