-0.024658,-0.02007,-0.026211,-0.032084,-0.025526,-0.022842,-0.024975,-0.016017,-0.020208,-0.022954,-0.023937,-0.021447,-0.015329,-0.008911,-0.014506,-0.014054,-0.007701,-0.008671,-0.012971,-0.010593,-0.00829,-0.00935,-0.010808,-0.017849,-0.015466,-0.012904,-0.015065,-0.017438
-0.020203,-0.01335,-0.020979,-0.019992,-0.02006,-0.016036,-0.010412,-0.006779,-0.01053,-0.019817,-0.020302,-0.012141,-0.00375,-0.000148,-0.001273,-0.005504,-0.003417,-0.007429,-0.011411,-0.006286,-0.004662,-0.005851,-0.004961,-0.009132,-0.008991,-0.011009,-0.013524,-0.01762
8.3e-05,0.003223,0.008069,0.008342,0.00615,0.005436,0.002027,0.003184,0.005545,0.004973,0.004125,0.002958,0.005315,0.004485,0.007682,0.003017,0.000391,0.000226,0.002947,0.00432,0.003565,0.003593,0.004087,0.007458,0.007161,0.004828,0.003627,0.003389
0.011414,0.008773,0.020868,0.017528,0.015868,0.013487,0.00412,0.0047,0.010445,0.01941,0.019034,0.00909,0.002995,-0.001904,-0.001501,-0.000449,-0.003078,0.000801,0.006422,0.003871,0.00312,0.003553,0.0025,0.006658,0.006123,0.00926,0.010583,0.015553
0.012565,0.006037,0.009308,0.011044,0.005506,0.011079,0.016449,0.009679,0.010097,0.011843,0.01442,0.013502,0.00601,-0.00046,-0.001606,0.001918,-0.00151,-0.00052,0.000294,-0.000193,0.00056,0.000243,0.002384,0.001366,-0.002665,0.000999,0.003848,0.009895
-0.005099,-0.008743,-0.017879,-0.016705,-0.016499,-0.009207,0.001521,-0.001793,-0.007859,-0.011863,-0.010739,-0.004187,-0.003317,-0.001958,-0.001287,-0.000167,-0.000668,-0.002838,-0.00625,-0.002694,-0.001493,-0.001585,0.001321,-0.00375,-0.007599,-0.008107,-0.00654,-0.006322
-0.019236,-0.015815,-0.027077,-0.029607,-0.018235,-0.021277,-0.025048,-0.016777,-0.020725,-0.0216,-0.02533,-0.024213,-0.015989,-0.008199,-0.008809,-0.010091,-0.004258,-0.004563,-0.006188,-0.003347,-0.002896,-0.002663,-0.005876,-0.009236,-0.007503,-0.007236,-0.008907,-0.017473
-0.002769,0.001932,-0.000981,0.00494,0.010486,0.003131,-0.004611,-0.001473,0.001257,-0.000678,-0.003393,-0.005319,-0.000149,0.000119,-0.001975,-0.002723,0.000474,0.001123,0.001997,0.000595,-0.000481,-0.00095,-0.005501,-0.002433,0.000201,0.002112,0.000373,-0.007672
0.015068,0.01371,0.018342,0.027204,0.021287,0.019936,0.021592,0.014249,0.018284,0.018662,0.020207,0.018666,0.015091,0.008951,0.009463,0.012739,0.008129,0.008999,0.009951,0.004841,0.002535,0.002312,0.004876,0.011063,0.007837,0.007331,0.009114,0.011585
0.009234,0.003264,0.004615,0.000711,-0.003594,-0.000212,0.005549,0.001588,0.001783,0.010853,0.01208,0.008323,-0.000575,-0.002119,-0.000997,0.005887,0.003272,0.005423,0.00582,0.001742,0.000445,0.001441,0.005495,0.006387,0.003284,0.0025,0.004994,0.012472
0.001352,-0.002223,-0.010865,-0.018146,-0.018468,-0.012891,-0.004964,-0.006148,-0.009574,-0.005786,-0.006794,-0.005371,-0.010432,-0.009373,-0.010246,-0.007019,-0.004095,-0.004026,-0.004238,-0.002741,-0.001568,-0.00063,-0.002728,-0.007519,-0.003585,-0.001695,-0.003911,-0.004269
-0.004081,-0.000852,-0.011238,-0.009206,-0.008506,-0.003898,0.002405,0.000472,-0.003587,-0.012738,-0.014182,-0.004972,0.000276,-0.000547,0.000443,-0.003536,-0.00296,-0.006785,-0.007509,-0.002303,-0.000269,-0.000204,-0.003345,-0.005523,-0.000847,-0.000953,-0.005277,-0.013008
-0.015056,-0.007163,-0.009408,-0.005909,0.000131,-0.003081,-0.009314,-0.003037,-0.002718,-0.008914,-0.011117,-0.008126,0.00108,0.001049,0.002607,-0.001175,-0.002251,-0.004466,-0.004391,-0.00218,-0.000619,-0.000393,0.000626,0.00338,0.001667,-0.001227,-0.000553,-0.005879
-0.009208,-0.006028,-0.001545,-0.001764,0.003826,-0.001866,-0.010568,-0.003741,0.001967,0.005483,0.002654,-0.004059,-0.002792,-0.004604,-0.006864,-0.005114,-0.00385,-0.002383,-0.001513,-0.003639,-0.002602,-0.002449,-0.001202,0.001248,-0.00226,-0.002948,0.001887,0.003028
0.013388,0.006107,0.012182,0.010024,0.005755,0.008874,0.014612,0.00783,0.010845,0.015606,0.014841,0.010108,0.003584,0.00047,0.000364,0.002217,0.000408,0.001498,0.001768,-0.00049,-0.000377,-0.000491,-0.000723,-0.000901,-0.000377,-0.000738,0.002037,0.007345
0.015855,0.007405,0.010262,0.004004,-0.000888,0.004103,0.01214,0.005375,0.001058,0.003596,0.004426,0.005163,0.000802,0.004633,0.010868,0.009062,0.004477,0.004484,0.004741,0.004132,0.002853,0.003394,0.004127,0.003562,0.00602,0.002057,0.000959,0.005965
-0.003184,-0.001678,-0.005146,-0.007543,-0.005237,-0.009226,-0.011331,-0.005743,-0.010105,-0.014228,-0.014348,-0.010549,-0.007481,-0.001078,0.000988,-0.001365,0.000988,0.001817,0.002077,0.002003,0.001036,0.001597,0.001712,0.000685,0.00157,0.000324,-0.001614,-0.003115
-0.012425,-0.004789,-0.008925,0.001093,0.001295,-0.005801,-0.00519,-0.00074,0.000571,-0.01159,-0.01225,-0.006035,0.001019,-0.000144,-0.005743,-0.007024,-0.000873,-0.000799,-0.002604,-0.002965,-0.002259,-0.002352,-0.003974,-0.005835,-0.006417,-0.001996,-0.003071,-0.010124
-0.006025,-0.002248,0.000979,0.007833,0.003775,-0.000826,0.005353,0.00475,0.008376,0.004501,0.00475,0.005305,0.008075,0.006457,0.004701,0.003624,0.003083,0.001908,-0.001101,-0.002353,-0.001565,-0.000974,-8e-04,-0.000899,-0.001873,-0.000563,9.4e-05,-0.002523
