-0.015051,-0.016568,-0.011004,-0.011268,-0.016686,-0.013242,-0.012401,-0.01305,-0.013645,-0.009956,-0.007652,-0.011077,-0.012236,-0.007669,-0.011292,-0.01611,-0.015175,-0.013341,-0.012232,-0.010431,-0.010318,-0.011338,-0.008457,-0.008704,-0.010806,-0.012028,-0.009414,-0.007507
-0.013094,-0.01366,-0.007802,-0.006404,-0.009956,-0.007552,-0.007282,-0.00796,-0.008626,-0.005425,-0.005971,-0.010172,-0.009936,-0.004116,-0.005107,-0.008981,-0.007187,-0.003456,-0.002589,-0.001885,-0.006243,-0.005431,-0.004133,-0.004655,-0.005263,-0.006562,-0.003847,-0.003461
0.003696,0.004844,0.00298,0.00405,0.007532,0.005743,0.003697,0.004535,0.00555,0.003561,0.000938,0.001277,0.003234,0.00267,0.004303,0.00689,0.005992,0.0052,0.00547,0.004139,0.003663,0.004603,0.002764,0.003748,0.005194,0.005655,0.00422,0.002536
0.010509,0.012353,0.006506,0.005899,0.010932,0.007511,0.006177,0.007802,0.008809,0.004454,0.003802,0.007612,0.007967,0.002696,0.003691,0.008794,0.005596,-0.000535,-0.001064,-0.00079,0.004859,0.004235,0.00207,0.003233,0.003984,0.005781,0.002017,0.001468
0.001411,0.002834,0.002254,0.001404,0.000582,-0.000197,0.002507,0.002471,0.001122,0.000135,0.00182,0.004408,0.001516,-0.000762,-0.00028,0.000305,0.000503,-0.001741,-0.003516,-0.000345,0.000673,0.000586,0.000316,-0.001138,-0.001633,-0.000891,-0.001759,-0.000279
-0.008933,-0.009574,-0.004744,-0.005343,-0.01036,-0.007601,-0.004988,-0.006072,-0.007561,-0.004616,-0.003474,-0.004451,-0.006486,-0.003446,-0.003787,-0.007538,-0.004169,0.000202,0.000265,0.001835,-0.002842,-0.002292,-0.000852,-0.002234,-0.002717,-0.0043,-0.001882,-0.000778
-0.005199,-0.008223,-0.005849,-0.006151,-0.007229,-0.004525,-0.006751,-0.006884,-0.006178,-0.003595,-0.004907,-0.008609,-0.006265,-0.002376,-0.0035,-0.006061,-0.006726,-0.004337,-0.000683,-0.003383,-0.003749,-0.004736,-0.003426,-0.001627,-0.001659,-0.003409,-0.00116,-0.001588
0.006998,0.005152,0.002009,0.003171,0.007539,0.006765,0.003407,0.003887,0.00491,0.003819,0.001982,-0.000575,0.002539,0.002695,0.00332,0.00555,0.001883,0.000278,0.001779,-0.001999,0.000973,0.000474,0.000307,0.001969,0.001457,0.002081,0.002173,0.000671
0.008616,0.010382,0.006608,0.007748,0.009936,0.007535,0.008476,0.008421,0.008038,0.005094,0.006367,0.008358,0.007403,0.003773,0.004746,0.007827,0.008927,0.008984,0.005714,0.006033,0.004981,0.006555,0.005009,0.003241,0.003587,0.005601,0.00416,0.003225
-0.001423,0.001039,0.000971,-0.000597,-0.004079,-0.003813,-0.000217,-0.001402,-0.001475,-0.001118,0.002264,0.006231,0.002778,-0.00077,-0.002242,-0.002828,0.001665,0.003481,0.001194,0.003558,0.001669,0.002103,0.001473,-0.000153,0.000707,0.000653,-0.000812,0.00028
-0.006324,-0.006258,-0.003969,-0.00587,-0.008783,-0.00732,-0.006379,-0.00732,-0.006842,-0.003571,-0.003112,-0.002648,-0.003126,-0.002436,-0.003661,-0.007258,-0.007408,-0.007745,-0.006313,-0.005556,-0.003804,-0.005899,-0.004498,-0.003458,-0.003386,-0.00539,-0.004987,-0.003326
-0.00157,-0.002784,-0.000753,0.000452,0.002264,0.001532,-0.001169,-1e-04,-1.2e-05,0.000391,-0.002934,-0.006126,-0.00273,0.000965,0.002464,0.001827,-0.001611,-0.002882,-0.002319,-0.003298,-0.002362,-0.003042,-0.001767,-0.000593,-0.001304,-0.001972,-0.000299,-0.000898
0.00096,0.000482,0.001295,0.003426,0.006321,0.004904,0.002217,0.00434,0.003867,0.001436,-0.000535,-0.003244,-0.001076,0.001052,0.002318,0.005847,0.004931,0.004471,0.00357,0.00314,0.001348,0.003037,0.002246,0.002459,0.002252,0.003714,0.003904,0.00244
-0.001373,-0.000602,-0.001152,-0.001102,-0.001213,-0.000656,0.000179,0.000197,-0.00046,-0.001203,0.000828,0.001602,-0.000966,-0.002069,-0.002878,-0.001331,-0.00034,-0.001426,-0.001179,9.1e-05,0.000294,0.001329,-9e-06,-0.00041,-0.000111,0.001141,-0.000442,0.000482
-0.000501,0.000651,-0.000697,-0.002011,-0.004159,-0.003295,-0.000337,-0.001873,-0.001954,-0.001291,0.000795,0.004662,0.001247,-0.000623,-0.001066,-0.003893,-0.003192,-0.004099,-0.003338,-0.002115,-0.000489,-0.000672,-0.000427,-0.001867,-0.001864,-0.002039,-0.00297,-0.001536
0.003797,0.002808,0.002039,0.001038,0.000511,0.000196,0.000745,-8.2e-05,0.001146,0.001104,-0.00039,0.002071,0.002945,0.002435,0.003143,0.000757,0.001195,0.002076,0.003283,0.002728,0.001573,0.000898,0.001532,0.000504,0.001087,0.000547,0.001405,0.000253
0.004023,0.000791,0.000841,0.001212,0.003441,0.003023,0.000437,0.00088,0.001825,0.001607,-0.000967,-0.003185,0.000476,0.00059,0.000688,0.002761,0.002083,0.00319,0.004867,0.002506,0.001274,0.000308,0.000165,0.001843,0.002127,0.001431,0.002754,0.001103
-0.001343,-0.002298,-0.001849,7.9e-05,0.001108,0.001099,8.7e-05,0.000976,-0.00042,-0.000429,-0.000121,-0.003903,-0.002903,-0.002197,-0.003269,-0.000683,-0.001987,-0.002019,-0.003318,-0.003741,-0.002141,-0.002289,-0.002611,-0.00096,-0.00142,-0.002135,-0.001572,-0.000937
-0.005276,-0.001945,-0.001527,-0.000419,-0.003562,-0.003101,-0.000611,-0.000554,-0.001901,-0.000964,0.001676,0.001214,-0.001758,-0.000404,-0.000954,-0.001743,-0.000261,0.001191,-0.003133,-0.001523,-0.001423,-8.3e-05,5.4e-05,-0.001189,-0.001365,-0.001182,-0.002116,-0.000737
