4e-06,7.1e-05,7e-05,9e-06,2.4e-05,9e-06,8.6e-05,3.8e-05,0.000143,4.9e-05,8.1e-05,8e-06,0.00015,0.000131,5.5e-05,3e-06,0.000111,1.8e-05,3.7e-05,1.3e-05,8.8e-05,0.000115,1.1e-05,8e-06,8.3e-05,0.000116,9.1e-05,0.000126,0.000124,4.3e-05,3.7e-05,4.5e-05,2.7e-05,4.2e-05,6.5e-05,0.00013,8e-05,1.5e-05,0.00012,0.000136,0.000262,3e-05,0.000121,9.3e-05,0.000225,7e-05,0.000251,9.7e-05,3.7e-05,5e-06,5.2e-05,0.000106,4.7e-05,1.2e-05,0.000128,2e-06,0.000178,5.2e-05,0.000135,3.6e-05,0.000116,8.7e-05,4.5e-05,0.000118,6.5e-05,3.6e-05,3.9e-05,0.000251,9e-06,6e-06,0.00011,3.2e-05,3.2e-05,1.3e-05,7.7e-05,3.1e-05,2.2e-05,0.000124,0.000173,4.2e-05,4.4e-05,0.000149,0.000129,2.8e-05,4.9e-05,6.6e-05,5.5e-05,7.4e-05,0.000115,2.5e-05,0.000106,2.8e-05,0.000149,0.000107,5.1e-05,0.000114,5.2e-05,2.3e-05,8.2e-05,4.4e-05,0.000121,2.3e-05,3.8e-05,5.6e-05,4e-06,7.6e-05,3.9e-05,7.5e-05,8e-06,0.000119,0.000129,0.000129,0.000121,8.3e-05,0.000123,2e-05,1.1e-05,0.000195,3.8e-05,6.1e-05,6.7e-05
3.3e-05,0.000191,2e-04,9.5e-05,6.2e-05,1.8e-05,0.000246,0.000119,0.000249,0.000126,0.000173,1.7e-05,0.00036,0.000306,0.000149,2.1e-05,0.000235,1.9e-05,0.000102,4.7e-05,0.000233,0.000215,9.6e-05,0.000112,0.000213,0.000313,0.000151,0.000252,0.000262,0.000124,0.000108,8.3e-05,7.2e-05,0.000159,0.00021,0.000264,0.000197,5.3e-05,0.000291,0.000239,0.000607,0.000215,0.000319,0.000234,0.000526,0.000153,0.000512,0.000253,9.4e-05,5.7e-05,8.4e-05,0.000203,0.000107,0.00012,0.000339,3.6e-05,0.000296,0.000139,0.000387,4.4e-05,0.000325,0.000153,9e-05,0.00024,0.00015,8.3e-05,3.3e-05,0.000581,6.9e-05,6.6e-05,0.000234,5.4e-05,0.000168,3.6e-05,0.000181,8.1e-05,6.8e-05,0.000264,0.000406,2.6e-05,0.000104,0.000356,0.00026,7.7e-05,0.000161,7.1e-05,0.000159,0.00024,0.000173,5.7e-05,0.000227,6.1e-05,0.000314,0.000281,0.000144,0.000206,0.00019,9.8e-05,0.000206,0.000107,0.000259,7.3e-05,9.9e-05,0.000123,6.1e-05,0.00012,0.000105,0.000201,1.8e-05,0.000258,0.000255,0.000231,0.000255,0.000229,0.000252,6.3e-05,9.1e-05,0.000383,0.000103,8.5e-05,0.000151
7.8e-05,0.000181,0.000296,0.000142,0.000173,5e-05,0.000241,0.000114,0.000223,6.2e-05,0.000167,2.6e-05,0.000437,0.000318,0.000175,4.1e-05,0.000175,0.000131,7.6e-05,0.000204,0.00023,0.000325,0.000166,0.000273,0.000199,0.000181,0.000212,9.1e-05,0.000398,0.000134,9.3e-05,6.5e-05,0.000109,0.00011,0.000151,0.000388,0.000398,0.000101,0.000197,0.000366,0.000562,0.000221,0.000262,0.000221,0.000684,0.000135,0.000403,0.000258,0.000207,0.00012,3.1e-05,0.000232,0.000134,4.2e-05,0.00029,0.000189,0.000328,0.000313,0.000439,5.4e-05,0.000331,0.000176,3.7e-05,0.000316,0.000186,0.000126,0.000186,0.000579,0.00021,5.2e-05,0.00028,0.000244,0.000341,0.000257,0.000173,0.000242,0.000156,0.000364,0.000427,0.000144,7e-05,0.000431,0.000167,8.5e-05,0.000213,0.000265,0.000309,0.000222,0.000369,0.000211,0.000247,0.000265,0.000195,0.000235,6.8e-05,0.000115,0.000264,7.7e-05,0.000394,3.7e-05,0.000329,8.1e-05,4.3e-05,0.000191,7e-05,0.000333,0.000211,0.000114,9.5e-05,0.00047,0.000543,0.000258,0.000268,0.000257,0.000263,0.000147,5.4e-05,0.000506,0.000173,7.8e-05,3.6e-05
0.000584,0.000302,0.000391,0.000165,0.00045,0.000252,0.000209,0.000393,0.000466,0.000222,0.000369,0.000207,0.00072,0.000586,0.00019,0.000376,0.000359,7.2e-05,6e-05,0.000301,0.000584,0.000624,0.000145,0.000483,0.000501,0.00039,0.000125,0.000143,0.00046,0.000205,0.000475,0.000323,0.000388,0.000358,0.000149,0.000785,0.000783,0.000563,0.00031,0.000258,0.001181,0.000689,0.000406,0.000269,0.001212,0.000685,0.000547,0.00033,0.000439,0.000262,0.000189,0.000268,0.000387,0.000312,0.00042,0.000545,0.000542,0.000355,0.000532,0.000519,0.000589,0.000469,0.000263,0.000484,5.6e-05,0.000342,0.000276,0.000766,0.000585,0.000376,0.000113,0.000177,0.000325,0.000694,0.000573,0.000264,0.00033,6.7e-05,0.000744,3.2e-05,0.000197,0.000102,0.000718,0.000154,0.000112,0.000181,0.000222,0.000475,0.000693,0.00053,0.000135,0.000716,0.000565,0.00045,0.000363,5.3e-05,5.9e-05,7.4e-05,0.000634,0.000785,0.000628,0.000216,0.000304,0.000414,0.000248,0.000602,0.000269,0.000365,0.000119,0.000501,0.000632,0.000182,0.000356,0.000397,0.00028,0.000474,0.000191,0.000705,0.000523,0.000379,0.000177
0.000632,0.000929,0.000564,0.000346,0.000909,0.000712,0.000662,0.000293,0.000148,0.000803,0.000476,0.000295,0.000806,0.001393,0.000899,0.00038,0.00028,0.000328,0.000582,0.000464,0.001155,0.000545,0.000552,0.000375,0.000985,0.001194,0.001267,0.00108,0.000882,0.001035,0.000925,0.000371,5e-05,0.000276,0.000277,0.000862,0.00123,0.001403,0.00076,0.000762,0.001677,0.001646,0.001549,0.001259,0.001527,0.001502,0.001648,0.001101,0.000693,0.000364,6.5e-05,0.000242,0.000482,0.000281,0.000188,0.000944,0.000257,0.000291,0.000403,0.001002,0.000899,0.00057,0.000854,8.1e-05,6.4e-05,0.000434,0.000779,7.3e-05,0.000237,9.5e-05,0.000298,6e-05,0.000103,0.000821,0.000539,0.00059,0.000402,0.000357,0.000756,0.00075,0.000371,0.000485,0.000785,0.00055,0.000191,0.000284,0.000267,0.000555,0.000874,0.001317,0.001376,0.001677,0.000998,0.000478,0.000539,0.000328,0.000221,0.000332,0.000877,0.001082,0.000408,0.000337,0.000641,0.001191,0.000968,0.000723,0.001275,0.001116,0.00075,0.000416,0.000753,0.000663,0.000734,0.000884,0.000712,0.000646,0.000438,0.000983,0.000993,0.000765,0.000953
0.000965,0.000779,0.000241,0.000415,0.000823,0.000569,0.000578,0.000702,0.000947,0.000356,0.000254,0.000553,0.000186,0.000625,0.000523,0.000615,0.000298,0.000338,0.000606,0.000181,0.000766,0.000249,0.000388,0.000876,0.001351,0.00023,0.000307,0.000832,0.000274,0.00097,0.000353,0.000484,0.000443,0.000123,0.000191,0.000488,0.000522,0.000464,0.000824,0.000569,0.000329,0.000616,0.000169,0.000615,0.00014,0.00043,0.000734,0.000704,0.000549,0.000274,0.000325,0.000194,0.000136,0.000293,0.00054,0.000101,0.000723,0.000746,0.000264,5e-04,0.000656,0.000392,0.000581,0.000766,0.000187,0.000347,0.000522,0.000719,0.00016,0.000291,2e-04,0.000529,0.000565,0.000632,0.000449,0.000212,8e-05,0.000456,0.000436,0.000925,0.00053,0.000277,0.000377,0.000392,0.000465,0.000641,0.000542,0.00054,0.000777,0.001017,0.000243,0.000946,0.000943,0.000588,0.000131,0.000253,0.000234,0.00062,0.000536,0.000283,0.000541,0.00065,0.000512,0.000606,0.000327,0.00117,0.001628,0.000279,0.000701,0.000775,0.000644,0.000863,0.000396,0.000856,0.000579,0.000491,0.000131,0.000941,0.000465,0.000192,0.000933
0.000497,0.000529,0.000176,0.000876,0.000575,0.000346,0.000905,0.000761,0.001318,0.00048,0.000505,0.000332,0.000472,0.000207,0.000608,0.000682,0.000914,0.000505,0.001113,0.000199,0.000299,0.000819,0.000371,0.001512,0.000653,0.000878,0.001232,0.00078,0.000533,0.001135,0.001143,0.000927,0.000501,0.00043,0.00032,0.000552,0.000809,0.000788,0.001053,0.000819,0.000673,5e-04,0.000347,0.000593,0.000653,4e-04,0.000745,0.000328,0.000455,0.000415,0.000673,0.000741,0.000345,0.00072,0.000538,0.000597,0.000736,0.001002,0.000295,0.001009,0.000619,0.000266,0.00054,0.000728,0.000619,0.000136,0.000484,0.000899,0.000512,0.00053,0.000419,0.001148,0.000272,0.000802,0.000405,0.000227,0.000257,0.000398,0.000611,0.000755,0.001226,0.000231,0.00093,0.000168,0.00023,0.000263,0.000679,6e-04,0.000675,0.000681,0.000923,0.000882,0.000915,0.000549,0.000138,0.00061,0.00038,0.000468,0.000367,0.000125,0.000254,0.000464,0.001129,0.000145,0.000529,0.000751,0.00082,0.000773,0.000637,0.000662,0.000381,0.000541,0.000989,0.000737,0.000835,0.000612,0.000899,0.001106,0.000962,0.00078,0.000413
0.000963,0.000173,0.000302,0.000685,0.000834,0.001328,0.000451,0.001299,0.002386,0.001098,0.000509,0.000656,0.001575,0.001598,0.001495,0.001179,0.000676,0.000754,0.000775,0.001544,0.001861,0.002079,0.000623,0.001692,0.001796,0.001841,0.001502,0.001876,0.001842,0.002065,0.001478,0.000834,0.000952,0.000788,0.00093,0.000926,0.000894,0.001492,0.001994,0.002125,0.001589,9.3e-05,0.001437,0.000954,0.000412,0.00089,0.001558,0.001383,0.000353,0.000126,0.000955,0.000872,0.001195,0.000804,0.000917,0.001582,0.000468,0.000319,0.001353,0.002055,0.002587,0.001196,0.000769,0.001594,0.00113,0.000703,0.001155,0.001509,0.001245,0.000221,0.000813,0.000936,0.000933,0.00038,0.001122,0.000853,0.001043,0.000961,0.001356,0.00109,0.000769,0.001301,0.001021,0.00124,0.000986,0.000647,0.00094,0.000238,0.001565,0.001073,0.000957,0.001223,0.002058,0.000842,0.000683,0.000731,0.001496,0.001021,0.000279,4.8e-05,0.000363,0.000731,0.001044,0.00133,0.000992,0.001439,0.000988,0.000995,0.001055,0.000698,0.000841,0.001972,0.002049,0.002206,0.002553,0.001994,0.000438,0.000574,0.001644,0.000858,0.000914
0.001076,0.001168,0.000241,0.000447,0.000837,0.001301,0.000816,0.000786,0.003168,0.002186,0.001372,0.00031,0.001502,0.002067,0.002403,0.002236,0.001463,0.001327,0.001318,0.00251,0.000812,0.001779,0.001745,0.001994,0.002333,0.000897,0.00217,0.00096,0.000527,0.000876,0.000396,0.000143,0.000488,0.001407,0.001902,0.001203,0.00046,0.001125,0.001857,0.001719,0.002229,0.00253,0.002624,0.001527,0.001198,0.000673,0.000915,0.00177,0.001684,0.000977,0.001444,0.000653,0.001115,0.001323,0.000741,0.001813,0.002159,0.001567,0.002245,0.001659,0.001585,0.001771,0.00188,0.001759,0.001217,0.000147,0.001538,0.001619,0.001276,0.000905,0.000915,0.00204,0.001722,0.001113,0.001084,0.000546,0.000966,0.000305,0.001039,0.00058,0.000969,0.002447,0.000856,0.000893,0.001611,0.000656,0.001081,0.001442,0.002163,0.000933,0.000449,0.000556,0.000993,0.001242,0.001263,0.000192,0.001058,0.001002,0.001216,0.00065,0.000809,0.001461,0.000231,0.000911,0.000175,0.000912,0.001603,0.000916,0.001621,0.00101,0.001715,0.001732,0.001374,0.001471,0.000974,0.000794,0.001211,0.001648,0.002096,0.002066,0.000262
0.000375,0.000611,0.000758,0.000321,0.001381,0.002468,0.001777,0.00175,0.001619,0.00168,0.001118,0.000688,0.001218,0.000896,0.001767,0.000247,0.000387,0.001138,0.000903,0.001462,0.001602,0.000803,0.000658,0.000623,0.000909,0.001053,0.000993,0.001092,0.000636,0.000474,0.000992,0.000775,0.000541,0.001086,0.000753,0.000257,0.000455,0.000778,0.001175,0.000478,0.00084,0.001148,0.000377,0.000235,0.000702,0.000763,0.000927,0.0015,0.000839,0.00028,0.000901,0.000874,0.000912,0.00031,0.001187,0.000625,0.001291,0.00122,0.001302,0.001263,0.000654,0.000462,0.000766,0.000685,0.001025,0.001386,0.00177,0.000935,0.001051,0.000328,0.000771,0.00137,0.000233,0.00109,0.000534,0.000911,0.001347,0.000899,0.001023,0.000464,0.000753,0.001768,0.001841,0.000911,0.000821,0.000482,6e-04,0.00117,0.000245,0.000204,0.000306,0.000239,0.000515,0.001203,0.000456,0.000411,0.000436,0.001093,0.000483,0.000484,0.000555,0.001917,0.001401,0.000121,0.000527,0.000992,0.001288,0.000531,0.001643,0.000825,0.001238,0.001545,0.000712,0.000502,0.001598,0.001062,0.001025,0.000405,0.00064,0.000528,0.001602
0.000279,0.000645,0.001083,0.00081,0.001286,0.001578,0.000929,0.000897,0.001889,0.001359,0.000749,0.00081,0.001647,0.000655,0.000748,0.00098,0.000437,0.000695,0.000243,0.001595,0.000794,0.001673,0.001351,0.000688,0.000305,0.000774,0.000788,0.001233,0.001248,0.00108,0.001026,0.000858,0.001788,0.001255,0.001434,0.001226,0.000287,0.000267,0.000472,0.001138,0.000797,0.000738,0.000492,0.000295,0.001068,0.001703,0.000815,0.001252,0.001267,0.000863,0.000499,0.000504,0.000392,0.000805,0.000916,0.001242,0.001266,0.001096,0.000618,0.001183,0.001257,0.000515,0.000179,0.000546,0.000544,0.000424,0.000546,0.000555,0.000835,0.000364,0.000603,0.000294,0.000756,0.001524,0.001689,0.001103,0.000868,0.000925,0.000238,0.000485,0.000336,0.000942,0.00086,0.000852,0.00091,0.000823,0.000261,0.001093,0.00061,0.000705,0.000376,0.000208,0.000309,0.000751,0.001134,0.000716,0.000383,0.000766,0.000957,0.000529,0.000187,0.001348,0.000951,0.000489,0.000475,0.000829,0.000641,0.000402,0.001319,0.001627,0.000706,0.000361,0.001089,0.000631,0.00111,0.001655,0.001365,0.001231,0.000586,0.000168,0.001185
0.00065,0.000589,0.000626,0.000444,0.000248,0.000735,0.000622,0.000176,0.00092,0.000145,0.000625,0.000893,0.000187,0.000606,0.000617,0.000564,0.000614,0.000415,0.00054,0.000723,0.000789,0.00154,0.001435,0.001314,0.000573,0.000609,0.00056,0.000666,0.000232,0.000618,0.000188,0.000376,0.001125,0.000528,0.000255,0.000355,0.000638,0.000195,0.000299,0.000867,0.000393,0.000434,0.000131,0.000213,0.000787,0.001027,0.000959,0.00022,0.000107,0.000246,0.000221,0.000527,0.000273,0.000466,0.000551,0.000958,0.00023,0.000502,0.000527,0.001341,0.000582,0.000519,0.000705,0.000649,0.000255,0.000138,0.000482,0.001054,0.000405,0.00034,0.000212,5.3e-05,0.000261,0.000712,0.000126,8.3e-05,0.000522,0.000245,0.000286,0.000211,0.000543,0.00059,0.00031,0.000266,0.000292,0.000204,0.000543,0.000897,0.001362,0.000358,0.00013,0.000249,0.000623,0.000405,0.000545,0.000306,9.4e-05,0.000517,0.00024,0.000551,0.000523,0.000576,0.000224,1e-04,0.000107,0.000789,0.000437,0.000186,0.000854,0.00056,5.8e-05,0.000162,0.00039,0.00015,0.000752,0.00076,0.000622,0.000742,0.00031,0.000296,0.000378
0.000261,0.000381,0.000425,7.6e-05,0.000158,0.000349,0.000196,0.000159,0.000616,3e-04,0.000318,0.000128,0.000598,0.000372,0.000285,0.00029,0.000314,0.000315,0.000367,0.000285,0.000353,0.000604,0.000459,0.000407,0.000293,0.000426,0.000546,0.000325,0.000319,0.00043,0.000235,0.000368,0.00032,0.000283,0.000107,0.000181,0.000361,0.000211,0.00025,0.000464,0.00024,0.000375,0.000299,6.8e-05,0.000447,0.000258,0.000245,0.000105,8.8e-05,0.000121,0.000315,0.00037,0.000183,0.000251,0.000395,0.000485,6.7e-05,0.000499,0.000369,0.000768,0.000483,0.000396,0.000363,0.000389,0.000172,0.000391,0.000218,0.000265,0.000134,0.000166,0.000378,2.2e-05,0.000153,0.000189,0.000127,0.000173,0.000307,0.000455,0.00014,0.000168,0.000147,0.00036,0.000353,3.9e-05,0.000256,0.000254,0.000226,0.000395,0.000572,0.00042,0.000177,0.000228,0.000227,0.000285,7e-05,0.000391,0.000296,0.000141,0.000204,0.000251,0.000188,0.000325,0.000248,6e-05,9.3e-05,0.000613,0.000252,0.000284,0.000277,0.000342,0.000143,0.000173,7.4e-05,0.000233,0.000456,6.6e-05,0.000256,0.000573,0.000212,0.000147,9.9e-05
0.000151,0.000156,0.000368,0.000358,7.8e-05,0.000104,0.00017,0.000318,0.000617,0.00017,0.000322,0.000275,0.00073,0.000262,0.000277,0.00014,0.000374,0.000254,0.000336,0.000232,0.000299,0.000595,0.000355,0.000329,0.000249,0.000443,0.000307,0.000465,0.00057,0.000563,0.000272,0.00024,0.00017,0.000226,0.000136,0.000262,0.000134,0.000302,0.000156,0.000308,8.1e-05,0.000473,0.000368,6.8e-05,0.000392,0.000229,0.000177,7e-05,0.000216,6.9e-05,0.000359,0.000158,0.000214,0.000426,0.000238,0.000276,0.000174,0.000487,0.000116,0.000561,0.000242,0.000455,0.000326,0.00026,0.00027,0.000273,0.000337,0.000421,0.000186,0.000224,0.00031,0.000146,5e-05,8.9e-05,9.1e-05,0.000178,0.000115,0.000473,0.000118,0.000253,0.000286,0.000436,0.000342,0.000126,0.000173,0.000126,0.000196,0.000318,0.00038,0.000231,0.000221,0.000485,0.000369,0.00016,4e-05,0.000448,0.000101,0.000204,0.000218,0.000104,0.000134,0.000559,0.000153,0.000127,0.00012,0.000432,0.000368,0.000255,0.000241,0.000478,0.000173,0.000347,0.000264,0.000314,5.9e-05,3.6e-05,0.000192,0.000426,0.000183,0.000197,0.000464
0.000172,7.9e-05,0.000741,0.000566,0.000352,0.000465,0.000452,0.000408,0.000498,0.000169,0.000773,0.000187,0.000526,0.000532,0.000555,0.000404,0.000445,0.00026,0.000554,0.000289,0.000289,0.000788,0.000618,0.00036,0.000231,0.000707,0.000528,0.000708,0.000844,0.001017,0.000735,0.000287,5e-04,0.000298,0.000118,0.000455,0.000306,0.000458,0.000424,0.000244,0.000302,0.00081,0.000332,0.000712,0.000261,7.2e-05,0.000379,0.000526,0.000592,0.000217,0.000553,0.00035,0.000211,0.000103,0.000582,0.000272,0.000327,0.000895,0.000258,0.000605,0.000886,0.000603,0.000428,0.000217,0.000263,0.000452,0.000586,0.000281,0.000143,0.00077,0.00032,0.000272,0.00019,0.000354,0.000509,0.000422,0.000644,0.000939,0.000216,0.000328,0.000247,0.000905,0.000585,0.000179,0.000223,0.00038,0.000183,0.000751,0.000176,0.000527,0.00034,0.000873,0.000588,0.000282,0.000301,0.000867,0.000287,0.000525,0.00046,0.000339,0.00057,0.000425,0.000708,0.000139,0.000214,0.000662,0.000685,0.000497,2e-04,0.000986,0.000503,0.00055,0.000324,0.000464,0.000528,6.8e-05,0.000475,0.000654,9e-05,0.000578,0.00029
0.00023,0.000415,0.001069,0.001206,0.001257,0.000757,0.000667,0.000742,0.001395,0.001006,0.001509,0.001487,0.000463,0.000766,0.000156,0.00073,0.001014,0.00112,0.001019,0.001165,0.000433,0.00111,0.00138,0.001576,0.000428,0.001068,0.001598,0.000199,0.001016,0.00191,0.001871,0.001402,0.000651,0.000351,0.000346,0.000619,0.000265,0.000675,0.000239,0.000791,0.000594,0.000665,0.001047,0.001213,0.000938,0.000337,0.000522,0.000787,0.001346,0.001068,0.000655,0.000472,0.000908,0.000881,0.000442,0.000273,0.000314,0.000695,0.001233,0.000443,0.000895,0.001169,0.001818,0.001227,0.000352,0.000638,0.001046,0.001263,0.000933,0.00107,0.001625,0.001035,0.000549,0.000569,0.000721,0.00106,0.000675,0.002232,0.00185,0.000773,0.000616,0.001114,0.002354,0.001366,0.000957,0.00091,0.000892,0.000503,0.001105,0.001408,0.001072,0.000373,0.001286,0.000832,0.000602,0.000745,0.001471,0.001055,0.001335,0.001424,0.000439,0.000484,0.000908,0.000885,0.000428,0.001047,0.001081,0.000985,0.000479,0.001254,0.001462,0.001571,0.000925,0.000348,0.000359,0.000764,0.000283,0.001228,0.001216,0.001114,0.001306
0.001703,0.001336,0.001651,0.002274,0.001312,0.00049,0.000287,0.000246,0.001035,0.000659,0.000884,0.001273,0.001267,0.001358,0.000974,0.000747,0.000271,0.000983,0.000894,0.000518,0.000917,0.001365,0.001693,0.001466,0.001452,0.001861,0.001146,0.001318,0.002045,0.002195,0.000456,0.000527,0.00035,3.6e-05,0.00084,0.001306,0.001471,0.000879,0.00038,0.001038,0.000911,0.000886,0.001181,0.00078,0.000842,0.000682,0.000754,0.00048,0.000668,0.000422,0.000375,0.000234,0.000568,0.001429,0.001221,0.00101,0.000364,0.000492,0.000685,0.000482,0.000505,0.000487,0.00128,0.001126,0.000817,0.000955,0.001053,0.00072,0.00021,0.000711,0.001343,0.001527,0.000786,0.000156,0.001278,0.000466,0.000679,0.002016,0.001657,0.000862,0.000991,0.00208,0.002812,0.002034,0.000851,0.000642,0.000228,0.000649,0.000597,0.000987,0.000991,0.001353,0.001264,0.000708,0.000215,0.00111,0.001823,0.001942,0.000832,0.000245,0.000863,0.001246,0.000436,0.000628,0.000557,0.000962,0.000634,5.7e-05,0.000459,0.000854,0.000632,0.000251,0.000791,0.000975,0.000602,0.001039,0.001031,0.001353,0.001183,0.001018,0.000733
0.001043,0.000312,0.000578,0.000797,0.000547,0.000357,0.000261,0.000545,0.000524,0.000251,0.000847,0.000171,0.000508,0.000404,0.000139,0.000518,0.000342,0.000409,0.000324,0.000314,0.000632,0.000492,0.000433,0.000539,0.000658,0.00053,0.000151,0.000807,0.001312,0.000272,0.000405,0.000106,0.000328,0.000214,0.000716,0.000602,0.000675,0.000683,0.000496,0.000503,0.000168,0.000174,0.000685,0.000691,0.000325,0.000374,0.000386,0.000819,4e-04,0.000108,0.000166,0.000105,0.000134,0.000969,0.000462,0.000901,0.000661,0.00011,0.000404,0.000362,0.000681,0.000231,0.000882,0.000274,0.000265,0.000494,0.000108,0.000502,0.000461,0.000514,0.000356,0.000532,0.000171,0.000169,0.00072,0.00039,0.000477,0.000937,0.000583,0.000823,0.000387,0.001032,0.000584,0.000284,0.000383,0.000346,0.000117,0.000263,0.00021,0.00069,0.000445,0.000908,0.00017,0.000202,0.000214,0.000488,0.000888,0.000508,0.000361,5.1e-05,0.000535,0.000654,0.000506,0.000737,0.000225,0.00052,0.000223,0.000304,0.000582,0.00035,0.000395,0.000245,0.000595,0.000615,0.000133,0.000763,0.000237,0.000628,0.000245,0.000154,0.000632
0.000331,0.000294,0.000182,0.000408,6.6e-05,0.00046,0.000485,0.000873,0.000639,0.000522,0.000383,0.000338,0.00019,0.000183,0.000284,0.000144,0.000269,0.000306,0.000294,0.000324,0.00026,0.000425,0.000835,0.000741,0.000214,0.000528,0.00025,0.000509,0.000199,0.000263,0.000302,0.000304,0.00043,0.000176,0.000582,0.000164,0.000654,0.000177,0.000317,0.00044,0.000349,0.000335,0.000251,9.8e-05,0.000164,0.000159,6.1e-05,0.000217,0.000179,7.7e-05,0.000145,0.000234,0.000267,0.000344,0.000201,0.000654,0.000213,0.000467,0.000179,0.00034,0.000253,0.000215,0.000421,0.000441,0.000246,0.000393,0.000256,0.000316,0.000469,0.00084,0.00041,0.000236,0.000211,0.000217,0.000162,0.00017,0.000224,0.000236,0.000707,0.000305,0.000705,0.000439,8.3e-05,0.00028,0.000117,0.000187,0.000136,0.000291,0.000389,0.000149,0.000302,0.00056,0.000358,0.000406,0.000459,0.00037,0.000644,0.000525,1e-04,0.000154,0.000177,0.000375,0.00047,0.000344,0.000227,0.000666,0.000124,0.000123,0.000502,0.000365,0.000238,0.000349,3e-04,0.000154,0.000234,0.000466,0.000327,3e-04,0.000241,0.000248,0.000307
0.000111,0.000149,0.000475,0.000165,0.000459,0.000189,0.000421,0.000374,0.000499,4.5e-05,0.000258,0.000363,0.000137,0.000159,0.000278,0.000188,0.000273,0.000272,0.000189,0.000264,0.000143,0.000104,0.000448,0.000219,6.3e-05,0.000201,0.000183,0.000131,0.000161,0.000153,0.000303,2e-04,2e-04,0.000151,0.00036,0.000131,0.00012,6.1e-05,0.000169,0.000209,0.00016,0.000234,0.000131,0.000148,5.6e-05,5.3e-05,0.00025,0.000204,0.000155,0.00023,0.000227,7.9e-05,0.000574,0.000402,0.000198,0.000455,0.000304,0.000476,0.000474,1e-04,0.000232,0.000314,0.000244,0.000143,0.000119,2e-04,0.000342,0.000321,0.00012,0.000355,2e-04,0.000175,0.000149,0.000335,0.000404,0.000147,0.000257,0.000153,0.000398,0.000271,0.000326,0.000579,0.000314,9.1e-05,0.000231,0.000382,0.00015,0.000206,0.000157,0.000142,0.00017,0.000255,4.5e-05,0.00044,0.000373,0.000118,0.000407,0.000183,0.000494,8e-05,0.000246,0.000131,0.000553,0.000171,9.1e-05,0.000633,0.000261,0.000205,0.000177,0.000428,0.000284,0.000451,0.000171,1e-04,0.000127,0.000148,0.000215,3.6e-05,8e-05,0.000346,0.000204
0.000174,0.000254,0.00018,5.4e-05,0.000329,0.000246,0.000262,0.000372,0.000214,0.000314,0.000129,0.000215,0.000257,0.000106,0.000273,7.2e-05,0.000221,0.000438,0.000571,0.000151,0.000243,0.000158,0.000157,0.000175,0.000121,0.00016,0.000148,0.000283,0.000161,0.000162,0.00023,0.00026,0.000197,0.000414,0.00033,0.000296,0.00031,6.9e-05,0.000188,0.000245,0.000128,0.000158,0.000105,0.000117,0.000244,0.000122,0.000264,0.000369,0.00034,0.000232,0.000187,0.000249,0.000346,0.000246,7.7e-05,0.000381,0.000252,0.000291,0.000134,0.000201,0.000126,0.000166,0.00024,0.000228,0.000338,0.000448,0.000196,0.00016,0.000218,0.000158,0.000279,8.5e-05,0.000387,0.000309,0.000233,0.000396,0.000257,0.000119,0.000212,0.000121,0.000397,0.000524,0.000188,0.000129,0.000178,0.000221,0.000195,0.000151,0.000298,0.00019,9.3e-05,0.000431,0.00028,0.000184,7.5e-05,0.000349,0.000125,0.000157,0.000423,0.000323,0.000222,0.000199,0.000122,8e-05,5e-05,0.000524,0.000229,8.3e-05,0.000142,0.000336,0.000199,0.000192,0.000156,0.000101,0.000145,4.9e-05,0.000372,0.000345,0.000248,0.000351,0.000274
0.000331,0.000315,0.00018,0.000199,0.000194,0.000281,0.00026,0.000182,0.000402,0.000179,0.000291,0.000389,0.000458,0.000253,0.000118,0.000204,0.000302,0.000126,0.000319,0.000137,0.000245,0.000198,0.000344,0.000159,0.000239,0.000296,4.9e-05,0.000331,0.000246,9.8e-05,0.000136,0.000148,0.00029,0.000408,0.00023,9.4e-05,0.000131,7.5e-05,0.000152,0.000387,0.000366,0.00013,0.000175,8e-05,7.2e-05,0.000273,0.000358,0.000268,4.1e-05,0.000188,0.000149,0.00028,0.000202,0.000249,9.3e-05,0.000354,0.000252,0.000241,0.000329,0.000326,0.000212,0.00013,0.000149,0.000146,0.000336,7.2e-05,0.000163,0.000183,0.000247,6.6e-05,6.4e-05,0.000114,0.000231,0.000306,0.000217,0.000269,0.000344,0.000223,0.000113,0.000259,0.000512,0.00044,0.000126,0.000331,0.000285,0.000186,0.000259,0.00014,0.000404,0.000246,0.00019,0.000386,0.000321,0.000133,0.000187,0.000228,0.000332,0.000227,0.000211,0.000125,0.000257,0.000227,8.7e-05,0.000256,8.9e-05,0.00045,0.000304,0.000211,0.000276,6.9e-05,0.000116,0.000163,0.000161,0.000247,0.000288,0.000363,0.000506,0.000253,0.000418,0.000269,8.1e-05
4.5e-05,2.8e-05,0.000125,0.000101,0.000118,2.4e-05,4.1e-05,9e-06,0.000124,0.000122,0.000246,0.000192,8.9e-05,5.4e-05,9.6e-05,3.4e-05,9.8e-05,0.000103,8.6e-05,0.000156,2.9e-05,8.4e-05,0.000114,0.000113,0.000147,4.1e-05,5.9e-05,0.000208,0.000103,1.3e-05,7.2e-05,2.4e-05,0.000124,0.000118,8.3e-05,0.000103,0.000114,2e-05,5.4e-05,0.000133,0.00012,5.7e-05,1.2e-05,2.1e-05,5.2e-05,6e-05,9e-06,8.8e-05,6.1e-05,5.8e-05,2.8e-05,0.00011,5.7e-05,7e-05,0.000117,0.00019,0.000139,0.000219,0.000101,8.3e-05,5.6e-05,8.2e-05,2.3e-05,0.00011,5.8e-05,0.000114,0.000113,1.5e-05,4e-05,6.6e-05,4.2e-05,2.3e-05,2.9e-05,0.000121,2.7e-05,0.000134,0.000153,8.8e-05,0.000118,7e-05,0.000122,0.000102,6.5e-05,0.000162,0.000116,6.1e-05,1.7e-05,9.6e-05,0.000136,7.8e-05,1.2e-05,0.000129,3e-05,5.5e-05,0.000101,0.000129,9e-06,5.9e-05,2.7e-05,3.9e-05,7e-05,8.9e-05,0.000166,0.000145,0.000129,0.000141,0.000147,9.4e-05,2.6e-05,8.9e-05,2.9e-05,8.3e-05,8e-05,6.9e-05,4.9e-05,0.00016,0.000149,0.000173,8.5e-05,3.6e-05,7.8e-05
5.5e-05,3.7e-05,9.2e-05,5e-05,9.2e-05,3.6e-05,2.4e-05,2.8e-05,3.5e-05,5.9e-05,0.000139,0.000106,2.9e-05,4.8e-05,7.7e-05,4.3e-05,2.5e-05,5.8e-05,4.1e-05,9.1e-05,3.5e-05,4.5e-05,9.3e-05,9.1e-05,1.8e-05,1.5e-05,2.5e-05,0.000103,5.4e-05,1.5e-05,7.2e-05,5.4e-05,4.6e-05,2.3e-05,6.2e-05,3.7e-05,7.8e-05,2.6e-05,5.3e-05,0.000132,5.9e-05,1.7e-05,3.5e-05,1.4e-05,7.2e-05,2.4e-05,2.9e-05,3.7e-05,3.1e-05,6.3e-05,2.6e-05,8.1e-05,2.8e-05,6.8e-05,3.2e-05,7.1e-05,2.6e-05,8.7e-05,9.7e-05,2.7e-05,5.3e-05,4.1e-05,1.7e-05,7.1e-05,4.9e-05,9.9e-05,5.2e-05,3.7e-05,3.6e-05,2.6e-05,2.8e-05,2e-05,3.7e-05,5.7e-05,1.6e-05,4.5e-05,0.000113,6e-06,3.9e-05,1.7e-05,0.000118,0.000108,2.7e-05,9.9e-05,5.8e-05,5.9e-05,3.8e-05,3.9e-05,9.9e-05,4.1e-05,2.5e-05,5.5e-05,5.6e-05,7.9e-05,1.5e-05,5.2e-05,5.9e-05,5.7e-05,7.2e-05,5.6e-05,7.4e-05,4.4e-05,5.9e-05,4.3e-05,4.4e-05,5e-05,4.8e-05,1.8e-05,6e-06,5.4e-05,1.6e-05,7.1e-05,4.7e-05,1e-05,6.5e-05,5.7e-05,2.4e-05,8.6e-05,0.000103,1.2e-05,5.6e-05
2.9e-05,8e-06,6.7e-05,5.2e-05,4.1e-05,2.5e-05,1.5e-05,3.6e-05,5e-06,5.4e-05,0.000105,6.7e-05,2.3e-05,3.7e-05,3.8e-05,3.4e-05,5.3e-05,3.9e-05,3.8e-05,8.9e-05,2.1e-05,1.6e-05,6.6e-05,6.4e-05,3.9e-05,1.3e-05,2.4e-05,7.2e-05,2e-05,6e-06,6e-05,4.2e-05,4e-05,3.8e-05,3.9e-05,3.4e-05,7.2e-05,1.7e-05,2.8e-05,0.000101,6.7e-05,2.1e-05,2.4e-05,1.4e-05,4.3e-05,9e-06,3e-05,3.3e-05,2.3e-05,3.7e-05,7e-06,8.5e-05,1.6e-05,5.1e-05,3.9e-05,4.2e-05,8e-06,4.9e-05,5.5e-05,5.3e-05,3e-05,5.5e-05,3.1e-05,6.3e-05,2.7e-05,8.8e-05,6.2e-05,3.5e-05,2.4e-05,2.1e-05,4.7e-05,1.5e-05,2.9e-05,4e-05,5.7e-05,5.2e-05,8.6e-05,4e-06,4e-05,1.7e-05,0.000111,0.000116,3.1e-05,5.4e-05,3.9e-05,4.1e-05,3.4e-05,5.4e-05,9.4e-05,4.9e-05,1.6e-05,4.9e-05,1.7e-05,5.7e-05,7e-06,2.5e-05,4.7e-05,2.8e-05,4.6e-05,4.2e-05,2.9e-05,3.9e-05,7.5e-05,4.3e-05,2.3e-05,6e-05,3.7e-05,2.5e-05,1.8e-05,3.6e-05,5e-06,4.9e-05,4.5e-05,1.5e-05,3.5e-05,4e-05,2.6e-05,6e-05,6.3e-05,1.8e-05,5.3e-05
2.2e-05,1.5e-05,6e-05,5.8e-05,5.1e-05,2.6e-05,1e-06,3.1e-05,1.5e-05,5.1e-05,9e-05,6.6e-05,2.6e-05,1.8e-05,3e-05,2.9e-05,3.3e-05,2.5e-05,3.4e-05,5.7e-05,1.8e-05,2.7e-05,6.2e-05,4.2e-05,1.9e-05,9e-06,2.7e-05,3.6e-05,3.8e-05,7e-06,5.1e-05,3.8e-05,3e-06,4.4e-05,3.8e-05,3.5e-05,7.3e-05,1.9e-05,3.2e-05,7e-05,5.1e-05,6e-06,1.5e-05,4e-06,4.5e-05,2.1e-05,2.7e-05,3.1e-05,1.5e-05,4.1e-05,1.5e-05,6.8e-05,1.1e-05,2.7e-05,2.6e-05,5.5e-05,1.4e-05,5.4e-05,3.4e-05,3.2e-05,5.2e-05,5.4e-05,1.6e-05,5.7e-05,2.7e-05,7.1e-05,6.3e-05,2.2e-05,2.5e-05,3.6e-05,3.9e-05,1e-05,3.9e-05,4.8e-05,4.7e-05,1.8e-05,6.8e-05,1.2e-05,2.8e-05,2.4e-05,8.7e-05,7.4e-05,3.9e-05,5.8e-05,4.4e-05,1.9e-05,4.5e-05,4.1e-05,8.3e-05,4.6e-05,1.2e-05,3.2e-05,3.8e-05,3.7e-05,1e-05,2.8e-05,5.1e-05,2.9e-05,3e-05,5e-05,4.1e-05,2.2e-05,5.1e-05,1.7e-05,1.6e-05,4.8e-05,2e-05,2.1e-05,2.5e-05,4e-05,2.7e-05,2.4e-05,2.5e-05,1.6e-05,2.6e-05,2.9e-05,1.3e-05,5.1e-05,6.8e-05,5e-06,1.7e-05
2.7e-05,2.9e-05,4.7e-05,6e-05,2.8e-05,1.1e-05,2.8e-05,3.6e-05,1.1e-05,6e-05,8.4e-05,5.1e-05,2.7e-05,1.7e-05,4.3e-05,3.1e-05,2.9e-05,2.8e-05,2.8e-05,7.5e-05,2.2e-05,2.9e-05,5.2e-05,3.2e-05,1.1e-05,1e-05,2.5e-05,5.5e-05,3.4e-05,1.3e-05,5.4e-05,3.2e-05,2.7e-05,2.7e-05,1.9e-05,2.9e-05,7.2e-05,2.1e-05,1.9e-05,6.7e-05,4.5e-05,1e-05,1.5e-05,2e-06,2.7e-05,1e-05,1.1e-05,1.1e-05,1.7e-05,3.7e-05,1.9e-05,7.3e-05,1.2e-05,3.1e-05,2e-05,5.2e-05,1.5e-05,4.9e-05,4.5e-05,7.2e-05,2.7e-05,5.5e-05,1.9e-05,4.4e-05,3.4e-05,5.5e-05,4.8e-05,1.5e-05,2.2e-05,2.5e-05,3.9e-05,2.1e-05,3.1e-05,5.2e-05,6.1e-05,5.4e-05,7.3e-05,1.4e-05,3.5e-05,2.2e-05,9.8e-05,7.1e-05,3.6e-05,5.5e-05,4.1e-05,2.4e-05,4.9e-05,4.9e-05,8.5e-05,4e-05,1.4e-05,3.7e-05,3.4e-05,4.4e-05,7e-06,7e-06,4.2e-05,1.3e-05,2.8e-05,6.3e-05,1.5e-05,6e-06,4.3e-05,2.7e-05,1e-05,6.8e-05,2.5e-05,1.4e-05,1.3e-05,2.5e-05,2.2e-05,3.5e-05,2.9e-05,2e-06,2.6e-05,3.6e-05,1.9e-05,4.8e-05,6.5e-05,5e-06,2.5e-05
1.7e-05,1.9e-05,4.4e-05,4.5e-05,3.2e-05,1.4e-05,2.3e-05,1.2e-05,2.7e-05,6.5e-05,7.7e-05,3.6e-05,3.3e-05,1.9e-05,2.8e-05,2.4e-05,1.6e-05,9e-06,1.5e-05,5.2e-05,2e-05,2.3e-05,4.9e-05,2.9e-05,3e-05,1.9e-05,1.7e-05,2.8e-05,3.1e-05,3.1e-05,3.2e-05,4.2e-05,1.4e-05,1.8e-05,2.1e-05,3.4e-05,7.6e-05,5e-06,2.7e-05,5.4e-05,3.7e-05,1.6e-05,1.4e-05,1.1e-05,3.3e-05,1.2e-05,1.9e-05,2.9e-05,1.1e-05,4.5e-05,1e-05,6e-05,2.7e-05,4e-05,3.4e-05,5.6e-05,9e-06,5.1e-05,4.6e-05,5e-05,2.1e-05,3.8e-05,3.2e-05,5.5e-05,2.3e-05,8.3e-05,4.8e-05,1.6e-05,6e-06,2.5e-05,4.4e-05,1.3e-05,2.5e-05,4.9e-05,5.8e-05,4.4e-05,6.6e-05,1.9e-05,9e-06,2e-05,8.9e-05,8e-05,2.9e-05,5.1e-05,2.8e-05,3.3e-05,3.6e-05,4.4e-05,6.5e-05,3.5e-05,2.3e-05,3.3e-05,2.5e-05,2.8e-05,3e-06,2.5e-05,5.3e-05,3.5e-05,3.1e-05,5e-05,2e-05,3e-06,2e-05,1.9e-05,2.2e-05,6.1e-05,2.3e-05,1.6e-05,2.2e-05,1.4e-05,5e-06,2.4e-05,2.1e-05,1.1e-05,2.2e-05,3.6e-05,7e-06,4.7e-05,4.6e-05,1.7e-05,5e-05
7e-06,1.3e-05,3.6e-05,4e-05,4.6e-05,1.3e-05,1e-05,9e-06,3.5e-05,3.2e-05,7.5e-05,3.3e-05,1.6e-05,1.2e-05,2.6e-05,5e-06,1.5e-05,3.5e-05,7e-06,7.4e-05,3.2e-05,1.6e-05,5.3e-05,2.5e-05,4.4e-05,1.8e-05,1.4e-05,1.8e-05,2.9e-05,2.5e-05,4.5e-05,1.2e-05,5e-06,2.9e-05,3.2e-05,1.6e-05,7.1e-05,8e-06,2.9e-05,6.3e-05,4.3e-05,2.9e-05,1.1e-05,2.1e-05,2.1e-05,6e-06,2.2e-05,3.2e-05,1.2e-05,3.7e-05,2.7e-05,4.7e-05,1.9e-05,3.8e-05,3.5e-05,5.6e-05,1.6e-05,3.6e-05,6.2e-05,6.3e-05,2.4e-05,5.2e-05,4.6e-05,8.1e-05,4.6e-05,0.000106,3.9e-05,1.6e-05,1.9e-05,3.1e-05,5.7e-05,1.3e-05,3.1e-05,3.4e-05,6.2e-05,4.1e-05,7e-05,1.1e-05,6.2e-05,1.9e-05,7.9e-05,7.8e-05,2.2e-05,5.2e-05,1.9e-05,2.6e-05,4.6e-05,4.8e-05,7.8e-05,5e-05,3.2e-05,3.3e-05,2.8e-05,2.2e-05,2e-05,3.5e-05,4.7e-05,3.4e-05,3e-05,3.1e-05,2.8e-05,2.1e-05,2.6e-05,2.4e-05,4e-05,6.4e-05,1.6e-05,1.7e-05,2.9e-05,2.7e-05,3.6e-05,3.8e-05,3.8e-05,1.5e-05,3.3e-05,2e-05,1.7e-05,4.5e-05,6.3e-05,1.6e-05,3.5e-05
1.8e-05,1.8e-05,2.6e-05,7.5e-05,3.3e-05,4e-05,4.1e-05,2.2e-05,3.7e-05,5.2e-05,7.4e-05,6.8e-05,4.7e-05,2.7e-05,1.6e-05,1.1e-05,1e-05,4.5e-05,5.2e-05,6.9e-05,6.8e-05,4.7e-05,6.1e-05,4.2e-05,3.4e-05,3.1e-05,5e-06,1.1e-05,3.8e-05,1.9e-05,6.6e-05,2.8e-05,6.1e-05,3.7e-05,4.9e-05,6.7e-05,3.8e-05,2.3e-05,3.3e-05,6.7e-05,1.2e-05,2e-05,1.8e-05,2.6e-05,5.2e-05,3.5e-05,3.3e-05,2.1e-05,2.1e-05,5e-05,4.1e-05,1.9e-05,3.4e-05,4e-05,6e-05,9.8e-05,3.4e-05,5.8e-05,5.7e-05,7.3e-05,5e-05,5.4e-05,4.6e-05,5.3e-05,9e-06,9.2e-05,8.1e-05,3.5e-05,3.5e-05,4.6e-05,9.6e-05,3.4e-05,2.4e-05,2.2e-05,8.1e-05,9e-06,6.7e-05,2.7e-05,0.000109,3.5e-05,8.2e-05,7.3e-05,4.3e-05,0.000108,9e-06,4e-05,4.2e-05,3.6e-05,7.9e-05,3.5e-05,2.8e-05,3.4e-05,2.2e-05,5.4e-05,1.5e-05,1.4e-05,4.7e-05,3.9e-05,2e-06,4.4e-05,1e-05,2.4e-05,9e-06,1.8e-05,3e-05,0.000107,2.5e-05,2.5e-05,5.9e-05,4.2e-05,4.7e-05,6.3e-05,8e-05,5.1e-05,5.5e-05,5e-05,6e-06,5e-05,5.4e-05,5.7e-05,5.5e-05
4e-05,4.8e-05,4.7e-05,9.4e-05,7.9e-05,9.3e-05,2.8e-05,2.7e-05,9e-06,2.6e-05,6.9e-05,9.9e-05,2e-05,5e-05,6.7e-05,5.2e-05,3.5e-05,4e-05,4e-05,9.2e-05,0.000122,2.7e-05,4.4e-05,8e-05,8.5e-05,2.1e-05,4.7e-05,7e-06,6.1e-05,3.9e-05,9.3e-05,1e-04,6.8e-05,5.3e-05,5.6e-05,8.8e-05,4e-05,4.2e-05,7.6e-05,0.000171,4.5e-05,1.2e-05,2.5e-05,2.8e-05,7.3e-05,2e-05,6.5e-05,2.9e-05,4.9e-05,8e-05,7.7e-05,3.2e-05,4.1e-05,2.9e-05,2.9e-05,6.5e-05,3.8e-05,1.5e-05,6.4e-05,2.3e-05,3.5e-05,2.5e-05,2.7e-05,1e-05,4.7e-05,8.6e-05,4.9e-05,0.000129,9.6e-05,9.7e-05,7.3e-05,0.000144,0.000123,8e-05,0.000122,9.3e-05,3.5e-05,5.6e-05,0.000137,0.000101,0.000106,6.5e-05,2.3e-05,0.000127,0.000131,2.4e-05,5.6e-05,3e-05,9.4e-05,5e-05,6.8e-05,0.000103,5.5e-05,0.00011,6.9e-05,3.4e-05,7e-05,6.3e-05,7.6e-05,5e-06,2.4e-05,3.8e-05,1.5e-05,2.8e-05,7.3e-05,0.000121,0.000135,0.000107,0.000101,8.2e-05,6e-05,5e-06,3.6e-05,7.4e-05,5.3e-05,3.3e-05,4.8e-05,7.5e-05,7e-05,7.3e-05,3.7e-05
5.1e-05,2.2e-05,2.8e-05,8.1e-05,1.7e-05,1.4e-05,1.9e-05,5.2e-05,5.6e-05,3.8e-05,9e-05,3.1e-05,4e-05,2.8e-05,3.3e-05,1.5e-05,2e-05,2.4e-05,4.5e-05,2.9e-05,5.5e-05,9.3e-05,8.7e-05,9.6e-05,5.1e-05,5.2e-05,8.5e-05,9e-05,1e-05,3e-05,6.2e-05,3.6e-05,2.5e-05,2e-05,6.8e-05,3.8e-05,8.9e-05,2.7e-05,5.1e-05,7.8e-05,6.9e-05,1.3e-05,3.4e-05,2.3e-05,6.3e-05,7.6e-05,5.8e-05,4.9e-05,1.8e-05,6.4e-05,6.2e-05,8.5e-05,3.7e-05,3.2e-05,1.3e-05,6e-05,5.5e-05,7.5e-05,8.2e-05,7e-05,3.6e-05,3.8e-05,6e-06,3.9e-05,1.5e-05,2.7e-05,3.1e-05,5.1e-05,1.7e-05,1.4e-05,6.8e-05,8.3e-05,1e-04,7.7e-05,1.1e-05,5.1e-05,6.3e-05,5.4e-05,4.1e-05,3.9e-05,9.1e-05,8.9e-05,7.2e-05,6.6e-05,4.9e-05,4.7e-05,1.3e-05,1.2e-05,5.8e-05,2.9e-05,3.1e-05,6e-05,1.8e-05,5.3e-05,5e-05,3.9e-05,8.6e-05,4.8e-05,8.1e-05,5.6e-05,3.5e-05,3e-05,2.3e-05,3.5e-05,7.1e-05,2.2e-05,3.9e-05,2.3e-05,5.7e-05,7.9e-05,3.7e-05,1.1e-05,4.3e-05,6.1e-05,7e-06,2e-05,5.9e-05,5e-06,7.2e-05,3.8e-05,1.2e-05
2.5e-05,3.6e-05,4.2e-05,5.4e-05,1.9e-05,4.1e-05,2.8e-05,4.5e-05,2.5e-05,3.4e-05,0.000107,6.1e-05,2e-05,8e-06,4.1e-05,1.2e-05,2.1e-05,9e-06,4.8e-05,4.3e-05,2.6e-05,6.1e-05,1.4e-05,4.7e-05,2.4e-05,1.4e-05,3.5e-05,4.1e-05,9e-06,3.4e-05,1.2e-05,1.5e-05,3.9e-05,3.6e-05,6.8e-05,2.2e-05,8.1e-05,2.2e-05,4.2e-05,4.5e-05,2.4e-05,5e-06,9e-06,1.5e-05,9e-06,3e-05,2.8e-05,3.2e-05,1.2e-05,1.3e-05,2.8e-05,6.8e-05,7e-06,1e-05,9e-06,3.7e-05,2.6e-05,2.8e-05,7.7e-05,4.2e-05,1e-05,2.9e-05,1.4e-05,4.9e-05,1.7e-05,4.6e-05,3.5e-05,1.7e-05,1.5e-05,3.7e-05,3.4e-05,1.8e-05,7.4e-05,5.5e-05,2.9e-05,3.8e-05,2.2e-05,2.5e-05,8e-06,1.2e-05,7.6e-05,9.4e-05,5.2e-05,2e-05,1.1e-05,1.8e-05,3.5e-05,1.4e-05,5.7e-05,1.6e-05,1.4e-05,3.2e-05,5e-06,2.9e-05,1.4e-05,1e-05,5.2e-05,4.5e-05,2.3e-05,3.2e-05,2.7e-05,1.4e-05,2.4e-05,3.8e-05,2.1e-05,3.7e-05,1.7e-05,1.6e-05,5.9e-05,2.1e-05,1.7e-05,2.8e-05,1.9e-05,1.8e-05,3.1e-05,7e-06,2.8e-05,1.5e-05,5.2e-05,1.8e-05,1.1e-05
7e-06,2e-06,3.7e-05,4.1e-05,1.7e-05,4.9e-05,1.7e-05,3.3e-05,1e-05,3.1e-05,7.4e-05,5.1e-05,2.7e-05,2e-05,4.3e-05,1.4e-05,8e-06,7e-06,4.4e-05,4.9e-05,2.3e-05,2.9e-05,3e-05,2.8e-05,3.3e-05,2.2e-05,2.9e-05,2.1e-05,1.8e-05,9e-06,1.8e-05,1.6e-05,1.9e-05,3.1e-05,5.3e-05,1.2e-05,6.5e-05,1.2e-05,2.7e-05,4.7e-05,3.6e-05,6e-06,1.6e-05,1.9e-05,2.6e-05,2.4e-05,1.7e-05,2e-06,1.3e-05,1.1e-05,1.6e-05,5.3e-05,1.4e-05,6e-06,2e-05,4.1e-05,2.3e-05,3.6e-05,5.5e-05,5.2e-05,1.7e-05,4.2e-05,1.1e-05,2.8e-05,5e-06,3.4e-05,3.8e-05,1.2e-05,1.4e-05,3e-05,2.9e-05,3.4e-05,4.7e-05,2.3e-05,5.3e-05,3.1e-05,3.3e-05,1.9e-05,2e-05,1.8e-05,6.1e-05,7.8e-05,4.3e-05,2.4e-05,2.3e-05,1.4e-05,3.3e-05,2e-05,5.4e-05,1.4e-05,1.3e-05,3.7e-05,6e-06,3.7e-05,1.4e-05,1.2e-05,5.3e-05,2e-05,2.4e-05,3e-05,2.8e-05,8e-06,1.6e-05,2.5e-05,2.2e-05,3.4e-05,1.6e-05,9e-06,3.1e-05,1.9e-05,1.2e-05,1.8e-05,2.3e-05,6e-06,1.4e-05,1e-05,1.1e-05,1.8e-05,4e-05,1e-05,1.8e-05
1.7e-05,2.4e-05,2.2e-05,5e-05,1e-05,2.4e-05,3e-06,3.3e-05,2.4e-05,1.5e-05,8.1e-05,2.7e-05,2.4e-05,3.2e-05,1.7e-05,1.3e-05,6e-06,8e-06,4.3e-05,3.1e-05,7e-06,1.9e-05,3.4e-05,5.1e-05,1.4e-05,1.7e-05,3.2e-05,3.4e-05,1.4e-05,6e-06,1.7e-05,3.9e-05,4.4e-05,2.5e-05,3.5e-05,1.6e-05,4.8e-05,1.9e-05,1.2e-05,4.7e-05,3.3e-05,7e-06,1.8e-05,2.4e-05,2.1e-05,1.8e-05,1.1e-05,1.5e-05,9e-06,6e-06,1.9e-05,5.4e-05,2.6e-05,1.4e-05,5e-06,5.9e-05,5e-06,3e-05,4.6e-05,6.5e-05,1.1e-05,3.7e-05,2.6e-05,4.3e-05,1.4e-05,4e-05,2.9e-05,1.8e-05,1.7e-05,3e-05,1.7e-05,3.9e-05,4.7e-05,3e-05,4.7e-05,2e-05,3.1e-05,1.1e-05,1.7e-05,1.5e-05,5.7e-05,7.2e-05,3.6e-05,2.1e-05,1.2e-05,7e-06,3.8e-05,3.6e-05,8e-05,2.4e-05,1.8e-05,3.2e-05,9e-06,2.9e-05,2e-05,7e-06,4.6e-05,6e-06,3.1e-05,3.8e-05,2.8e-05,1.1e-05,1.7e-05,2.7e-05,2.2e-05,3.8e-05,1.2e-05,7e-06,2.9e-05,1.9e-05,8e-06,1e-05,2.6e-05,6e-06,2.6e-05,6e-06,3e-06,2.2e-05,3.8e-05,2.5e-05,1.6e-05
1.3e-05,2.2e-05,1.6e-05,2.9e-05,1e-05,4e-05,1.7e-05,3.1e-05,2.7e-05,1e-05,8.7e-05,5e-05,2.4e-05,2.9e-05,2.7e-05,1.2e-05,5e-06,1.2e-05,1.9e-05,2.6e-05,6e-06,2.1e-05,4.4e-05,2.9e-05,4e-06,1.1e-05,7e-06,1.6e-05,2.7e-05,2.2e-05,3.4e-05,2.9e-05,1.5e-05,2.2e-05,3.1e-05,1.1e-05,5.6e-05,1.2e-05,2.7e-05,4.9e-05,3.8e-05,1.4e-05,1.7e-05,9e-06,1.9e-05,1.1e-05,1.4e-05,2.4e-05,7e-06,1.1e-05,1.6e-05,5.5e-05,1.9e-05,1.8e-05,1.7e-05,6e-05,8e-06,3e-05,7.2e-05,4.5e-05,1.8e-05,4e-05,1.9e-05,3.5e-05,2e-06,5e-05,3.6e-05,9e-06,1.1e-05,1.4e-05,3e-05,2.4e-05,2.8e-05,2.3e-05,3.9e-05,1.8e-05,4e-05,1e-05,8e-06,1.8e-05,6.2e-05,7.6e-05,3.2e-05,2e-05,1.2e-05,1.3e-05,3.1e-05,3.6e-05,5.2e-05,6e-06,1.2e-05,3.3e-05,1.3e-05,3e-05,1.5e-05,3e-06,5.5e-05,2e-05,2.2e-05,3.8e-05,2.4e-05,1.2e-05,2e-05,1.5e-05,2.7e-05,3.4e-05,6e-06,1.5e-05,2.9e-05,1.1e-05,1.1e-05,2.6e-05,5e-06,1.2e-05,1.1e-05,7e-06,5e-06,2.8e-05,5.9e-05,6e-06,1.4e-05
3e-06,1.2e-05,2.2e-05,4.7e-05,9e-06,1.8e-05,1.1e-05,2.8e-05,1.8e-05,3.5e-05,7.9e-05,2.8e-05,1.7e-05,1.4e-05,4.4e-05,1.7e-05,2.2e-05,2.3e-05,3.2e-05,4.5e-05,1.8e-05,3e-05,3.4e-05,1.9e-05,1.6e-05,4e-06,1.7e-05,1.4e-05,2.4e-05,1.7e-05,9e-06,2.6e-05,2.7e-05,2.5e-05,2.3e-05,2.4e-05,4.5e-05,3e-06,1.7e-05,5.5e-05,3.8e-05,8e-06,1.1e-05,2e-06,3.5e-05,9e-06,2.6e-05,7e-06,1.3e-05,5e-06,1.7e-05,5.1e-05,1.9e-05,9e-06,1.6e-05,4.6e-05,1.4e-05,3.9e-05,7.2e-05,5.9e-05,1.9e-05,2.2e-05,1.6e-05,3.3e-05,8e-06,4.2e-05,4e-05,1.5e-05,3e-06,2e-05,2.3e-05,1.2e-05,3.5e-05,1.4e-05,4.4e-05,3.9e-05,4.9e-05,1e-05,1.7e-05,2.3e-05,6e-05,8.4e-05,4.6e-05,2e-05,1.9e-05,1.9e-05,2.7e-05,1.7e-05,4.3e-05,1.5e-05,6e-06,3.9e-05,6e-06,3.3e-05,1.3e-05,1.1e-05,4.5e-05,2.5e-05,2.2e-05,2.2e-05,2.7e-05,7e-06,1.7e-05,1.5e-05,1.1e-05,3.3e-05,3e-06,7e-06,1.7e-05,1.1e-05,7e-06,1.6e-05,1e-05,1.3e-05,2.1e-05,1.6e-05,1.5e-05,2.8e-05,4.4e-05,1.8e-05,5e-06
1.3e-05,8e-06,1.4e-05,3.8e-05,1.5e-05,1.7e-05,2e-05,2.6e-05,4e-06,1.9e-05,7.4e-05,3.9e-05,2.2e-05,2.4e-05,1.9e-05,1.8e-05,9e-06,1.2e-05,2.2e-05,3.6e-05,1.9e-05,6e-06,2.5e-05,4.7e-05,1.4e-05,6e-06,2.2e-05,2.4e-05,5e-06,2e-05,1.8e-05,2.3e-05,3.5e-05,3.3e-05,3e-05,1.7e-05,6.1e-05,5e-06,1.6e-05,5.1e-05,2.8e-05,1.8e-05,1.6e-05,1.6e-05,2.4e-05,6e-06,1.7e-05,1.5e-05,9e-06,8e-06,2.2e-05,5.1e-05,1.7e-05,1.3e-05,1.9e-05,5.3e-05,2e-06,4.1e-05,5.6e-05,4.7e-05,1.1e-05,2.5e-05,1e-05,1.5e-05,1.9e-05,4.4e-05,4.1e-05,2.4e-05,9e-06,2.4e-05,1.8e-05,2.8e-05,3.4e-05,1.8e-05,4e-05,2.8e-05,3.2e-05,1.5e-05,9e-06,8e-06,4.5e-05,7.2e-05,3.4e-05,3.3e-05,9e-06,2.1e-05,2.3e-05,3.5e-05,5.3e-05,6e-06,9e-06,3.4e-05,4e-06,2.3e-05,8e-06,5e-06,4e-05,1.4e-05,2.8e-05,2.7e-05,2.2e-05,1.1e-05,9e-06,1.6e-05,1.4e-05,4.5e-05,1e-05,3e-06,6e-06,1.4e-05,9e-06,1.3e-05,1.3e-05,2.1e-05,1.3e-05,1e-05,8e-06,2.8e-05,3.3e-05,6e-06,2e-06
1.6e-05,2.3e-05,2e-06,2.8e-05,7e-06,2.4e-05,1.7e-05,2.8e-05,1.3e-05,8e-06,5.5e-05,3.2e-05,3.2e-05,1.6e-05,2.6e-05,1.1e-05,1.9e-05,2.4e-05,3.5e-05,2.9e-05,3e-05,1.1e-05,3.2e-05,4e-05,9e-06,8e-06,1.3e-05,5e-06,2.2e-05,2.2e-05,1.9e-05,1.8e-05,3.8e-05,3.1e-05,3.3e-05,1.4e-05,5.8e-05,7e-06,1.7e-05,5.4e-05,3.3e-05,2.4e-05,1.7e-05,1.5e-05,2.8e-05,6e-06,1e-05,2e-05,6e-06,9e-06,2e-05,5e-05,8e-06,1e-05,1.6e-05,4.5e-05,1.4e-05,3.3e-05,4.4e-05,6.5e-05,2.2e-05,3e-05,1.4e-05,3e-05,8e-06,5.1e-05,2.7e-05,1.2e-05,1.4e-05,1.9e-05,1.7e-05,2.1e-05,3.5e-05,2e-05,3.2e-05,2e-05,3.8e-05,1.3e-05,8e-06,5e-06,6e-05,7.8e-05,2.3e-05,4e-06,1.8e-05,1.6e-05,3.2e-05,3.2e-05,4.6e-05,1.4e-05,1.2e-05,3.9e-05,5e-06,2e-05,1.2e-05,9e-06,4.6e-05,1.8e-05,2.5e-05,2.6e-05,2.1e-05,7e-06,1.6e-05,2.2e-05,6e-06,4.3e-05,0,6e-06,9e-06,4e-06,1.3e-05,1e-05,8e-06,2e-05,2.4e-05,3e-06,8e-06,3.5e-05,3.9e-05,1e-05,1.5e-05
1.2e-05,5e-06,8e-06,3.8e-05,1.4e-05,1.8e-05,1e-05,2.8e-05,2.1e-05,2.1e-05,6.3e-05,3e-05,2.6e-05,6e-06,3.2e-05,2e-06,5e-06,9e-06,3e-05,3e-05,2e-05,1.4e-05,2.9e-05,3.3e-05,7e-06,6e-06,1e-06,1.1e-05,1.3e-05,7e-06,1.5e-05,1.8e-05,2.6e-05,3.1e-05,2.8e-05,1.5e-05,5.3e-05,5e-06,1.8e-05,5.9e-05,3.6e-05,8e-06,1.8e-05,1.3e-05,2.6e-05,0,1.5e-05,1.8e-05,1.2e-05,1e-05,1.5e-05,5.4e-05,1e-05,1.6e-05,4e-06,5.4e-05,1e-05,3.5e-05,5.3e-05,6e-05,1.1e-05,3.9e-05,5e-06,2.1e-05,7e-06,4.1e-05,3.1e-05,1e-06,1.3e-05,2.8e-05,1.8e-05,2.1e-05,2.7e-05,2.2e-05,3.9e-05,2.5e-05,3.6e-05,2e-06,1.8e-05,1.4e-05,5.9e-05,7.2e-05,1.9e-05,2e-05,2e-05,1.7e-05,3.5e-05,3.1e-05,5.3e-05,1.6e-05,4e-06,3.2e-05,2e-06,2e-05,8e-06,8e-06,3.8e-05,3.1e-05,3.6e-05,2.5e-05,3.1e-05,6e-06,7e-06,1.8e-05,1.3e-05,4.5e-05,1e-05,2e-06,1.6e-05,1.3e-05,6e-06,5e-06,8e-06,8e-06,1.1e-05,4e-06,1.7e-05,2.6e-05,4e-05,1.6e-05,9e-06
4e-06,3e-06,1.3e-05,3.2e-05,1e-05,2e-05,1.4e-05,2.5e-05,1.7e-05,1e-05,6.1e-05,3.3e-05,2.1e-05,1e-05,2.7e-05,5e-06,5e-06,5e-06,2.5e-05,3.2e-05,1.5e-05,2.2e-05,2.8e-05,3.5e-05,1.4e-05,3e-06,9e-06,1.2e-05,3e-06,1.4e-05,1.8e-05,1.2e-05,2.6e-05,2.5e-05,2.6e-05,1.2e-05,5.6e-05,3e-06,1.5e-05,5.8e-05,4.3e-05,1.6e-05,7e-06,1.4e-05,2.7e-05,6e-06,1.3e-05,2.2e-05,5e-06,7e-06,1.7e-05,5.1e-05,7e-06,1.1e-05,1.2e-05,5.7e-05,9e-06,3e-05,5.1e-05,4.8e-05,1.1e-05,3.2e-05,7e-06,2.9e-05,9e-06,4.1e-05,3.8e-05,8e-06,6e-06,2.1e-05,1.4e-05,2.2e-05,2.7e-05,1.7e-05,3.7e-05,2.2e-05,3.9e-05,5e-06,1.4e-05,8e-06,6.1e-05,7.2e-05,1.8e-05,1.6e-05,2e-05,1e-05,3.5e-05,2.1e-05,5.9e-05,2.1e-05,3e-06,2.9e-05,3e-06,2.4e-05,8e-06,9e-06,4.1e-05,2.1e-05,2.1e-05,2.3e-05,2.1e-05,6e-06,1e-06,1.8e-05,2e-05,4.7e-05,6e-06,5e-06,1.6e-05,8e-06,3e-06,1.2e-05,9e-06,1e-05,1.2e-05,7e-06,1.6e-05,3.3e-05,3.8e-05,8e-06,9e-06
3e-06,7e-06,1.2e-05,3.2e-05,8e-06,2.5e-05,1.4e-05,2.4e-05,1e-05,1.6e-05,6.4e-05,3.2e-05,1.9e-05,1.4e-05,3.1e-05,5e-06,4e-06,5e-06,2.9e-05,3.1e-05,1.7e-05,2e-05,2.9e-05,3e-05,9e-06,0,6e-06,1.1e-05,9e-06,7e-06,1.8e-05,1.7e-05,2.6e-05,2.9e-05,2.7e-05,1.2e-05,5.4e-05,1e-06,1.3e-05,5.3e-05,3.4e-05,1.2e-05,1.2e-05,1.1e-05,2.4e-05,3e-06,1.6e-05,2.5e-05,7e-06,8e-06,1.7e-05,5.1e-05,9e-06,1e-05,1.1e-05,5.2e-05,8e-06,3.2e-05,4.9e-05,5.4e-05,1.9e-05,3.3e-05,6e-06,3e-05,1e-05,4.3e-05,3.2e-05,3e-06,8e-06,2e-05,1.6e-05,2.1e-05,2.7e-05,2.1e-05,3.7e-05,2.1e-05,3.7e-05,6e-06,9e-06,6e-06,5.9e-05,7.2e-05,2.4e-05,2.2e-05,1.7e-05,7e-06,2.9e-05,2.4e-05,5.2e-05,1.1e-05,3e-06,3.2e-05,3e-06,2.2e-05,7e-06,4e-06,4.2e-05,2e-05,2e-05,2.5e-05,2.6e-05,2e-06,3e-06,1.8e-05,1.9e-05,4.6e-05,2e-06,2e-06,1.3e-05,8e-06,2e-06,1e-05,1e-05,6e-06,1.7e-05,1e-06,8e-06,2.9e-05,2.9e-05,1e-05,9e-06
