1.5e-05,3.4e-05,3e-06,1.5e-05,1.9e-05,1.5e-05,5e-06,1.1e-05,1.8e-05,8e-06,2.8e-05,5.2e-05,2.6e-05,1.2e-05,8e-06,9e-06,2.6e-05,5e-06,1.4e-05,2.5e-05,2.2e-05,7e-06,1.6e-05,7e-06,3e-06,2.2e-05,1.9e-05,1e-05,5e-06,1.6e-05,3.2e-05,1.4e-05,1e-05,5e-06,1.7e-05,3e-06,3.9e-05,3.6e-05,4.6e-05,2.8e-05,3.9e-05,5e-06,4e-06,6e-06,7e-06,4e-05,1.1e-05,0.000118,0.000154,0.000161,0.000127,0.001405,0.000354,0.000244,0.00065,0.000633,0.000218,0.000658,0.000208,0.000511,0.001616,0.000594,0.000232,0.000436,0.000285,0.000467,0.000314,0.000321,0.000103,0.000106,0.000175,0.000124,9e-06,0.000213,0.000349,0.000206,0.000202,0.000317,0.000214,0.000174,0.00028,0.000127,1.7e-05,0.000217,0.000266,2.6e-05,0.000212,2.4e-05,0.000101,8.3e-05,1e-04,3.9e-05,2.2e-05,1.7e-05,1.3e-05,3e-06,3.7e-05,5.1e-05,9e-06,3e-06,7e-06,3.9e-05,3.6e-05,7.4e-05,0.000218,6.2e-05,0.000275,2e-06,0.000391,9.1e-05,0.000225,8.9e-05,0.00014,1.9e-05,7.1e-05,6e-06,7e-06,2.7e-05,2.7e-05,5e-05,1.5e-05
2.2e-05,4.9e-05,4.4e-05,3.3e-05,7.1e-05,2.3e-05,7.5e-05,3.9e-05,5.8e-05,4.2e-05,5.2e-05,0.000141,8.1e-05,9e-05,3.8e-05,3.5e-05,3.7e-05,2.9e-05,2.9e-05,1.3e-05,6.8e-05,7.5e-05,5e-05,3.1e-05,3.3e-05,6e-05,8.4e-05,6.3e-05,5.1e-05,8.3e-05,0.000108,3.8e-05,3.7e-05,6.8e-05,4.7e-05,4.5e-05,5.1e-05,3.1e-05,0.000114,6.2e-05,6.8e-05,9.9e-05,2e-05,3.8e-05,1e-05,6.9e-05,4.5e-05,0.000201,0.000412,0.000584,0.000787,0.00241,0.001601,0.001743,0.001889,0.00183,0.001959,0.00184,0.001572,0.001478,0.00136,0.002205,0.002165,0.001175,0.000634,0.000457,0.000311,0.001408,0.001232,0.000492,0.000819,0.001128,0.000594,0.00047,0.000706,0.000978,0.000832,0.000738,0.000831,0.000426,0.001129,0.000345,0.000179,0.000431,0.00069,0.000299,0.000344,0.00024,0.000438,0.000154,0.000331,5.2e-05,0.000114,3.6e-05,7.5e-05,5.2e-05,8.3e-05,0.000171,8.8e-05,4.3e-05,9.7e-05,5e-06,9.6e-05,0.000218,0.000546,0.000718,0.000579,0.000529,0.000442,0.00081,0.000602,0.000573,0.000276,0.000257,8.3e-05,8.5e-05,5.1e-05,8e-05,0.000103,0.00014,0.000107
4.2e-05,2.4e-05,2.4e-05,4.6e-05,4.9e-05,9.8e-05,0.000108,4.6e-05,7e-05,2.6e-05,7.6e-05,3.7e-05,8.1e-05,3e-05,3.5e-05,4.1e-05,1.1e-05,9e-06,4e-06,8e-06,4.1e-05,4.3e-05,5e-06,1e-06,3.4e-05,3.3e-05,2e-05,2.8e-05,1.7e-05,9.8e-05,6.9e-05,3.7e-05,2.9e-05,6.3e-05,3.4e-05,4.5e-05,5.2e-05,2.8e-05,4.8e-05,5e-06,5.3e-05,9.4e-05,9.2e-05,2.2e-05,4.4e-05,2.4e-05,1.1e-05,0.000165,0.000218,0.000631,0.000213,0.003971,0.00274,0.000816,0.001804,0.002762,0.001076,0.000923,0.001309,0.000612,0.000648,0.001658,0.000828,0.000841,0.001623,0.001178,0.00084,0.001676,0.001015,0.001684,0.001703,0.001193,0.001367,0.000433,0.00072,0.000401,0.000448,0.000715,0.000572,0.000515,0.00112,0.000759,0.000339,0.000474,0.000649,0.000248,0.000254,0.000124,0.000419,0.000235,0.000233,0.00035,0.000164,0.000123,0.000143,0.000151,0.000126,0.000335,0.000304,0.00023,0.000106,3.6e-05,2.5e-05,0.000177,0.00028,0.000371,7.6e-05,0.000231,0.000167,0.000408,4.4e-05,0.000233,3.7e-05,9.8e-05,5.3e-05,3.3e-05,3.3e-05,5.8e-05,7.1e-05,3e-05,4.2e-05
8.5e-05,7e-05,3.4e-05,5.4e-05,2.6e-05,0.000193,0.000201,0.00017,0.000104,5.5e-05,0.000104,0.000144,1e-04,9.9e-05,5.7e-05,6.7e-05,3.9e-05,3e-05,2.8e-05,4.5e-05,6.5e-05,5e-05,4.2e-05,3.5e-05,1.9e-05,3.8e-05,4e-05,1.4e-05,2.7e-05,4.5e-05,8.5e-05,2.6e-05,4.1e-05,7.1e-05,8.6e-05,6.8e-05,8.8e-05,3.2e-05,6.8e-05,7.9e-05,3.8e-05,0.000107,1.7e-05,4.6e-05,9.1e-05,7.6e-05,8.6e-05,0.000241,0.000144,0.000476,0.000542,0.004949,0.003721,0.001837,0.001132,0.001768,0.003568,0.002128,0.002388,0.002534,0.00304,0.000383,0.000908,0.001032,0.000887,0.001081,0.001335,5e-05,0.00064,0.001637,0.000905,0.001315,0.001234,0.001138,0.000586,0.000494,0.001095,0.000389,0.001001,0.001213,0.001555,0.000701,0.000227,0.000731,0.000595,0.00032,0.00058,0.000124,0.000335,0.000375,0.000106,0.000179,9.3e-05,3.9e-05,6e-05,0.000125,0.000376,0.000439,8.6e-05,5.3e-05,0.000106,5.2e-05,8.3e-05,0.000159,7.7e-05,0.000235,0.000127,0.000189,5.5e-05,0.00018,0.000151,0.000186,0.000105,3.8e-05,0.000101,4.8e-05,4.9e-05,3e-05,5.2e-05,5e-05,2.8e-05
3.8e-05,3.6e-05,2.5e-05,4.7e-05,1.1e-05,0.000323,8e-05,6.9e-05,1e-04,8.1e-05,5.1e-05,4.6e-05,1.5e-05,3.8e-05,3.6e-05,2.9e-05,2.7e-05,6e-06,6e-05,6.2e-05,2.9e-05,3.1e-05,3.3e-05,1.5e-05,3.1e-05,5.6e-05,5.3e-05,5.8e-05,1.8e-05,7.1e-05,0.000103,2.6e-05,8.6e-05,8.4e-05,5.8e-05,7.6e-05,4.7e-05,2.7e-05,9e-05,6e-05,3.3e-05,0.000135,0.000172,4.6e-05,6.2e-05,1.5e-05,5.9e-05,0.000183,0.000251,0.000618,0.00084,0.004251,0.003098,0.004722,0.003085,0.000539,0.002069,0.001766,0.001202,0.001518,0.00143,0.002026,0.001922,0.002401,0.001606,0.00133,0.000589,1e-04,0.001179,0.002182,0.000813,0.000633,0.001028,0.00094,0.001405,0.000898,0.00091,0.001469,0.001549,0.001592,0.00046,0.000318,5.8e-05,0.000447,0.000554,0.000373,0.000543,0.00076,0.000425,0.000549,0.000579,0.000143,0.000138,0.00016,7.1e-05,8.6e-05,0.000326,6e-05,7.6e-05,9.6e-05,9.9e-05,0.000154,6e-05,6.8e-05,0.000171,0.000128,6.7e-05,0.000204,0.000296,0.000143,7.4e-05,0.00012,5.7e-05,4e-05,4.1e-05,2.9e-05,2.4e-05,7.6e-05,2.3e-05,4.8e-05,5.5e-05
8.2e-05,6.5e-05,4.5e-05,2.7e-05,6e-05,0.000434,0.000255,4.8e-05,0.000109,3.5e-05,9e-05,0.000115,9.1e-05,7.5e-05,7.3e-05,2.2e-05,3e-05,3.4e-05,6.9e-05,4.5e-05,4.7e-05,8e-06,3.6e-05,2.4e-05,1.6e-05,6.4e-05,3.1e-05,7.1e-05,6.9e-05,0.000108,1.1e-05,8.6e-05,1e-04,0.000121,0.000165,5.3e-05,5.4e-05,8.6e-05,6.6e-05,0.000138,4.2e-05,0.000179,0.000108,0.00019,7.6e-05,6.4e-05,6.3e-05,0.000133,7.3e-05,0.000929,0.000466,0.003658,0.002079,0.003183,0.00257,0.002422,0.001217,0.00387,0.00385,0.000818,0.002283,0.002662,0.002029,0.002485,0.002454,0.001503,0.001368,0.000621,0.001163,0.000517,0.002481,0.001401,0.000976,0.001749,0.001789,0.000886,0.001225,0.002378,4e-04,0.001468,0.001092,0.000741,0.000373,0.000246,0.000354,0.000258,0.000411,0.000722,0.000593,0.000602,0.00025,0.000245,0.000137,0.00023,0.000199,8.4e-05,0.00036,0.000212,5.3e-05,6.3e-05,0.000109,0.000124,0.000148,0.000153,2.2e-05,0.00017,1.7e-05,0.00012,0.000139,4e-05,0.000123,0.000113,4.5e-05,3.5e-05,6.8e-05,2.8e-05,2.7e-05,8.9e-05,7.9e-05,3.9e-05,5.7e-05
7.9e-05,9.8e-05,2.4e-05,1.5e-05,6.1e-05,0.000355,0.000396,0.000207,9e-05,0.000118,0.000137,9.8e-05,3.2e-05,3.7e-05,6.2e-05,7e-05,6.4e-05,4.6e-05,0.000101,9.5e-05,6.7e-05,6.5e-05,6.7e-05,5.4e-05,3.3e-05,2.5e-05,5.9e-05,4.7e-05,5.3e-05,0.000128,0.000173,8.4e-05,0.000126,5.8e-05,7.4e-05,0.000113,7.8e-05,9.1e-05,0.000131,3.5e-05,8.3e-05,0.000254,0.000184,0.000175,5.6e-05,6.9e-05,2.8e-05,0.000113,0.000302,0.000794,0.000813,0.001882,0.001936,0.003062,0.002308,0.002812,0.00681,0.007471,0.001681,0.003247,0.001701,0.001044,0.002187,0.003344,0.001084,0.001314,0.00213,0.001504,0.001167,0.001613,0.001501,0.002361,0.000545,0.002532,0.001489,0.00182,0.001669,0.000986,0.002687,0.001969,0.001021,0.000683,0.000211,0.000285,0.000563,0.000664,0.000367,0.000431,0.000243,6.5e-05,0.000438,0.000416,0.00024,0.000224,0.000168,0.000218,0.000301,0.000134,0.000105,0.000126,0.000231,4.3e-05,2.6e-05,0.000196,0.000112,0.000138,0.000162,0.000192,0.000192,8.6e-05,6.7e-05,0.000139,0.000129,4e-05,0.00017,0.000163,7.5e-05,1.3e-05,0.000164,0.000139,1.7e-05
6.6e-05,3.4e-05,4.5e-05,3.7e-05,1.6e-05,0.000303,0.00023,0.000145,1e-05,5.3e-05,8e-05,6.1e-05,3.5e-05,3e-05,4.4e-05,1.6e-05,2.6e-05,2e-05,7.7e-05,4.2e-05,3.1e-05,5.4e-05,3.2e-05,5.4e-05,1e-05,3.2e-05,3.9e-05,6.3e-05,2.3e-05,0.000111,0.000164,4e-05,8.6e-05,0.000186,0.000107,4.5e-05,1.8e-05,0.00022,6e-05,5.6e-05,9e-05,0.000266,4.6e-05,1.8e-05,7.7e-05,8.7e-05,9.3e-05,0.000179,0.000342,0.000375,0.000413,0.001007,0.001474,0.001266,0.002091,0.006524,0.006411,0.003159,0.004646,0.004702,0.00357,0.002543,0.002047,0.003304,0.001628,0.002735,0.001646,0.000732,0.001763,0.001316,0.002573,0.003552,0.00358,0.003694,0.003136,0.000488,0.000763,0.001895,0.003076,0.00289,0.002056,0.001111,0.00059,0.000434,0.000232,0.00056,0.001214,0.001198,0.000881,0.00042,0.000379,0.000139,3.8e-05,0.000309,8.6e-05,7.5e-05,0.000284,0.000305,4.8e-05,0.000103,0.000297,0.000179,6.9e-05,0.000121,0.000221,8.8e-05,0.000166,4.8e-05,0.000217,0.000264,0.000139,5.9e-05,3.8e-05,0.000114,4.4e-05,0.000151,0.00014,6.5e-05,0.000168,5.5e-05,8.1e-05
4.7e-05,5.2e-05,7e-05,4.4e-05,5.4e-05,4e-04,0.000228,0.000129,6e-05,7e-06,5.9e-05,6.7e-05,8e-05,3.4e-05,6.6e-05,5.1e-05,4.1e-05,3.2e-05,7.5e-05,0.000131,7.5e-05,4.8e-05,3.3e-05,5.7e-05,5e-05,3.3e-05,2.5e-05,4.3e-05,3.3e-05,0.000211,0.000352,0.000209,0.000139,0.000436,0.000167,2.5e-05,2.5e-05,0.00037,0.000211,0.00013,6.8e-05,0.000316,0.000183,0.000211,7.5e-05,0.000115,8.4e-05,0.000286,0.000139,0.000212,0.000727,0.000939,0.001177,0.002166,0.004692,0.009829,0.0115,0.013116,0.01164,0.003016,0.004568,0.005663,0.005269,0.001971,0.003441,0.002394,0.002956,0.003482,0.004254,0.002522,0.003041,0.005515,0.003888,0.002347,0.004264,0.002943,0.001835,0.002481,0.000927,0.001657,0.001414,0.001062,0.000957,0.00041,0.00064,0.000538,0.000615,0.001186,0.000398,0.000272,0.000593,0.000503,2e-04,0.000192,0.000224,0.000256,0.000189,0.000511,0.000435,0.000252,0.000322,0.00017,0.000133,8.2e-05,0.000181,0.000134,0.000168,0.000215,0.000199,0.000133,0.000133,0.000164,0.00016,0.000117,0.000121,9.3e-05,4.6e-05,4.3e-05,0.000134,6.6e-05,9e-05
7.1e-05,5.1e-05,6.1e-05,1.9e-05,5e-05,0.000733,0.000814,0.000383,0.000146,1.2e-05,1.2e-05,6e-06,3e-05,5e-05,5.5e-05,2.6e-05,2.3e-05,3.1e-05,7.8e-05,0.000197,0.000143,5.8e-05,1.8e-05,1.5e-05,2.6e-05,7.1e-05,5.9e-05,1.4e-05,1.9e-05,0.000256,0.000477,0.000471,0.000121,0.000516,0.000419,0.000207,0.000119,0.000464,0.000307,2.8e-05,7.5e-05,0.000312,0.000273,0.00014,0.000225,5e-05,4.8e-05,0.000465,0.000655,0.000706,0.000428,0.002259,0.002186,0.002625,0.003104,0.003928,0.009718,0.012357,0.00549,0.003682,0.005863,0.003961,0.000956,0.003669,0.003638,0.000644,0.002048,0.001727,0.002575,0.003027,0.005192,0.005279,0.000545,0.002733,0.002496,0.001239,0.001475,0.001837,0.002157,0.003571,0.002246,0.000628,0.00057,0.000372,0.000703,0.000709,0.000934,0.000206,0.000509,0.000592,0.00041,0.000186,0.000312,8.3e-05,9.7e-05,0.000266,0.000412,0.000266,8e-05,0.000106,0.000451,0.000264,0.000244,0.000121,4e-05,7.6e-05,0.000264,0.000255,0.000369,0.000276,0.000192,0.000204,0.000292,0.000124,0.00029,0.000259,0.000172,9.4e-05,0.000116,0.000148,8.3e-05
6.2e-05,2.2e-05,3.4e-05,4.4e-05,3.4e-05,0.000999,0.000993,0.000518,0.000155,1.5e-05,7e-06,2e-05,3e-05,2.8e-05,2.8e-05,2.5e-05,1.4e-05,1.3e-05,7.1e-05,0.000117,6.1e-05,7.3e-05,5.1e-05,3.4e-05,3.5e-05,4.3e-05,1.4e-05,4.3e-05,5.4e-05,0.000212,0.000263,0.000239,0.000211,0.000444,0.000223,5.3e-05,0.000108,0.000446,0.000238,0.000118,8.9e-05,0.000276,0.000293,0.000366,0.00018,0.000212,0.000121,0.00059,0.000922,0.00114,0.001062,0.001306,0.001719,0.002119,0.004256,0.003719,0.005383,0.003401,0.000686,0.001558,0.000728,0.000726,0.003335,0.004695,0.001807,0.001114,0.001223,0.002836,0.000495,0.003057,0.003266,0.002002,0.00228,0.00134,0.000822,0.001161,0.001302,0.000978,0.000162,0.002143,0.000426,0.00031,0.000884,0.000621,0.000512,0.000344,0.000324,0.000242,0.000485,0.000423,0.000928,0.000484,0.000471,0.000236,0.000193,0.000172,0.000267,0.000332,0.000137,0.00013,0.000463,0.000377,0.000285,0.000112,0.000322,0.000282,0.000312,0.000558,0.000663,0.000371,3.3e-05,0.000122,0.000198,0.000184,0.000355,0.000404,0.000206,5.3e-05,0.000141,0.000181,0.000126
1.6e-05,1.3e-05,3e-06,2.3e-05,4.3e-05,0.00097,0.000358,0.000143,2e-05,2.8e-05,3.2e-05,3.6e-05,1e-05,3e-06,8e-06,1.5e-05,1.9e-05,2.4e-05,2.9e-05,3.8e-05,3.1e-05,2.5e-05,1.4e-05,2e-05,2.7e-05,7e-06,1.1e-05,3e-05,1.7e-05,0.000138,0.000312,1e-04,0.000185,0.000126,5.4e-05,1.7e-05,9e-05,0.000208,8e-05,4.7e-05,3.6e-05,7.5e-05,0.000123,0.000115,0.000102,0.000126,9.5e-05,0.000539,0.00035,0.000457,4.6e-05,0.001156,0.001368,0.002982,0.00074,0.001808,0.002825,0.003169,0.003034,0.002793,0.004332,0.00267,0.003691,0.001185,0.000591,0.000374,0.000965,0.001298,0.001037,0.002599,0.00169,0.001473,0.001353,0.001315,0.000561,0.001736,0.000969,0.000806,0.00086,0.001003,0.001112,0.000456,0.000769,0.000345,0.00028,0.00063,0.000571,0.000497,0.000675,0.000329,0.000321,0.000115,0.000215,9.1e-05,0.000198,9.4e-05,0.000329,0.000363,0.000202,0.000158,0.000258,0.000137,0.000268,0.000279,0.000507,0.000225,0.000143,0.000285,0.000133,3.6e-05,0.000109,0.000154,4.8e-05,1e-04,0.000291,0.000132,0.000132,6.5e-05,5.2e-05,3.5e-05,4.5e-05
4.1e-05,1.1e-05,1.7e-05,9e-06,9e-06,0.000703,0.000265,9.7e-05,7e-06,6e-06,3e-05,2.1e-05,1.8e-05,1.1e-05,6e-06,9e-06,1e-06,1.5e-05,2.2e-05,4e-05,9e-06,7e-06,2.2e-05,2e-06,1.3e-05,2.1e-05,4e-06,1.2e-05,1.4e-05,7.1e-05,8.6e-05,8e-06,0.000152,6.8e-05,9e-06,7e-06,7.6e-05,3e-05,9e-06,4.3e-05,4.7e-05,3.7e-05,7.9e-05,0.000138,6.5e-05,2.6e-05,0.000103,0.000528,0.000266,0.000394,0.000306,0.001217,0.003174,0.001849,0.001558,0.00347,0.00192,0.001008,0.001117,0.001503,0.004039,0.002069,0.00045,0.000474,0.000385,0.002066,0.001486,0.001334,0.000964,0.002278,0.001957,0.001539,0.001237,0.000509,0.000911,0.002051,0.000999,0.00102,0.000311,0.00228,0.0015,0.00108,0.000467,0.000494,0.000518,0.000224,0.000442,0.000239,0.000597,0.000257,0.000207,9.9e-05,9.7e-05,9.8e-05,0.000172,1.4e-05,0.000245,7.5e-05,3.4e-05,9.2e-05,0.000216,8.8e-05,0.000169,4.7e-05,0.000253,0.000111,0.000132,9e-05,0.000148,5.4e-05,5e-05,4.4e-05,6.3e-05,1.5e-05,0.00021,3.8e-05,6.5e-05,2.9e-05,3.6e-05,2.8e-05,2.2e-05
1.7e-05,1.9e-05,1.1e-05,1.1e-05,1.8e-05,0.000284,3.2e-05,8.8e-05,6.1e-05,2.5e-05,2e-05,2.7e-05,3e-06,1.8e-05,4e-06,3e-06,1.1e-05,3e-06,2.7e-05,3.1e-05,8e-06,1.2e-05,9e-06,1e-05,1e-06,1.3e-05,1.8e-05,1.2e-05,7e-06,2.3e-05,5.1e-05,4.3e-05,0.000154,5.8e-05,2.1e-05,1.2e-05,0.000111,9.8e-05,6e-05,5.4e-05,4.9e-05,9.3e-05,8.3e-05,0.000135,7.3e-05,5.9e-05,4.4e-05,0.000392,0.000165,0.000323,0.00012,0.001276,0.002918,0.003817,0.00141,0.003646,0.001929,0.002002,0.00094,0.002924,0.002091,0.002149,0.000445,0.001824,0.002995,0.001324,0.000178,0.004026,0.000728,0.003656,0.00257,0.001703,0.000726,0.002865,0.002519,0.001636,0.00072,0.001323,0.001335,0.002487,0.00066,0.00038,0.00061,0.001069,0.000611,0.000339,0.000483,0.000328,0.000617,0.000351,0.000335,6.3e-05,0.000221,4e-05,0.000125,3.2e-05,0.000185,0.000205,0.000188,0.00011,7.6e-05,8.6e-05,0.000116,8.6e-05,8.9e-05,2.5e-05,4.4e-05,6.3e-05,4.4e-05,2.2e-05,5.8e-05,6e-05,0.000111,7.5e-05,0.000222,4.4e-05,5e-06,3.8e-05,3.6e-05,5.1e-05,2.8e-05
1.1e-05,2.5e-05,1.9e-05,2.4e-05,9e-06,0.000433,2.6e-05,8.9e-05,4.1e-05,2.9e-05,2.7e-05,2.9e-05,2.9e-05,1.8e-05,1.9e-05,1.7e-05,3e-05,1.9e-05,3.1e-05,3.5e-05,2.1e-05,1.4e-05,1.3e-05,1.1e-05,1.9e-05,1.2e-05,1.1e-05,8e-06,1.2e-05,1.8e-05,5.3e-05,3.7e-05,0.00014,8.4e-05,5e-06,1.2e-05,0.000112,3.3e-05,4.2e-05,5.9e-05,7.4e-05,9.5e-05,9.9e-05,0.000103,6.4e-05,0.000133,7.6e-05,0.000364,0.000379,0.000485,0.000109,0.001187,0.003079,0.003265,0.003728,0.00253,0.003688,0.001538,0.000155,0.003008,0.000439,0.00075,0.001108,0.005067,0.002799,0.001011,0.001843,0.007051,0.003414,0.006201,0.002837,0.00257,0.001835,0.001705,0.001014,0.002004,0.002764,0.002276,0.002643,0.001982,0.001098,0.000992,0.001884,0.000875,0.001354,0.000278,0.001175,0.00046,0.000515,0.00053,0.000306,0.000144,0.000163,0.000378,0.000267,0.000108,2e-04,9.5e-05,0.000158,0.000136,9.2e-05,0.000218,2.2e-05,0.000111,2.6e-05,3.7e-05,0.000145,0.000191,2.1e-05,1e-05,4.1e-05,9.2e-05,7.2e-05,5.1e-05,0.000174,0.000147,6.4e-05,7.1e-05,2.3e-05,5.2e-05,2.2e-05
6.6e-05,7.9e-05,4.1e-05,2.3e-05,1.9e-05,0.00075,0.000417,0.000257,0.00011,4.1e-05,4.4e-05,6e-06,3.4e-05,1.9e-05,1.1e-05,1.9e-05,2.6e-05,4.2e-05,6.3e-05,8.1e-05,3.2e-05,2e-05,2e-05,1.5e-05,3.2e-05,3.9e-05,5e-06,1.6e-05,9e-06,1.8e-05,8.9e-05,2.2e-05,0.00015,5.9e-05,6.6e-05,5.1e-05,9.6e-05,0.000136,7e-05,3e-05,6.2e-05,0.000183,8.4e-05,7.5e-05,0.000112,7.3e-05,0.000104,0.000304,0.000385,0.000132,0.000349,0.000899,0.006526,0.003945,0.003243,0.006481,0.002497,0.001439,0.004887,0.004616,0.006372,0.00364,0.001924,0.005155,0.007245,0.006403,0.003172,0.006319,0.007453,0.001011,0.005435,0.001105,0.006123,0.00471,0.006104,0.001491,0.003581,0.001616,0.00276,0.006274,0.003005,0.000648,0.002398,0.003747,0.001153,0.001958,0.001757,0.001088,0.000542,0.001799,0.000748,0.000618,0.000555,0.000751,0.00029,0.000384,0.000456,0.000439,8.3e-05,0.000323,7e-05,0.000285,0.000321,8.1e-05,0.000142,1e-04,0.00023,0.000559,0.000483,0.000261,0.00012,0.000119,0.000163,0.000216,0.00017,0.000109,0.000107,7.8e-05,0.000101,0.000109,5.8e-05
6.4e-05,8.7e-05,5.8e-05,2.7e-05,1.2e-05,0.000808,0.00053,0.000234,5.6e-05,4.7e-05,5.6e-05,4.4e-05,2.5e-05,2.8e-05,6.2e-05,1.4e-05,2.5e-05,2.3e-05,3.8e-05,1.6e-05,2e-05,3.1e-05,4.8e-05,3.3e-05,3.5e-05,3.4e-05,2.4e-05,2.8e-05,8e-06,1.7e-05,4.2e-05,4.4e-05,0.00016,7.2e-05,5.1e-05,8.4e-05,0.000129,0.00012,5.6e-05,7e-05,9.8e-05,4.1e-05,5.6e-05,0.000124,9.9e-05,0.000152,0.000184,4e-04,0.000275,0.000312,0.000296,0.001171,0.007843,0.011066,0.009878,0.008075,0.006279,0.000733,0.007054,0.003653,0.008008,0.011114,0.00994,0.009811,0.005916,0.009502,0.006549,0.005964,0.003201,0.001718,0.00433,0.006332,0.010875,0.009905,0.004842,0.002229,0.003625,0.004738,0.006085,0.005996,0.009856,0.006282,0.001963,0.002448,0.003802,0.003047,0.004284,0.004092,0.002959,0.003799,0.002802,0.001519,0.000448,0.000777,0.000499,0.000626,8.9e-05,0.000505,0.000583,0.000663,0.000409,0.00021,0.000355,0.000428,0.000418,0.000243,0.000274,0.000497,9.7e-05,4.1e-05,0.000199,0.000288,0.000245,8.8e-05,0.000378,0.000212,1e-04,0.000207,2.9e-05,1e-04,8.3e-05
6.5e-05,2.2e-05,3.1e-05,1.7e-05,2.4e-05,0.000727,0.000485,0.000264,6.8e-05,4e-05,8.6e-05,4.5e-05,5.3e-05,4.5e-05,5.2e-05,5.7e-05,4.5e-05,2.5e-05,4.1e-05,4.2e-05,3.5e-05,5.5e-05,2.4e-05,9e-06,1.4e-05,5.5e-05,5.1e-05,3.6e-05,3.2e-05,2e-05,2.4e-05,3.5e-05,0.000148,0.000123,4.2e-05,4.4e-05,6.6e-05,1.8e-05,3e-05,5.7e-05,2.3e-05,9.3e-05,0.000109,3.4e-05,7.5e-05,0.000199,3.3e-05,0.00039,0.000336,0.000759,0.000561,0.001232,0.005502,0.003497,0.004912,0.002294,0.00343,0.0051,0.007208,0.009674,0.00527,0.004659,0.004052,0.001813,0.004361,0.008036,0.008364,0.005222,0.001144,0.004149,0.006395,0.002739,0.005814,0.00312,0.00759,0.006952,0.007955,0.008194,0.006922,0.005177,0.004777,0.006245,0.002896,0.003965,0.005313,0.004267,0.002387,0.00209,0.000684,0.002014,0.003095,0.001781,0.000471,0.000139,3.9e-05,0.000252,0.000683,0.000103,0.000527,0.000109,0.000322,0.000324,0.000239,0.000175,0.000165,8.6e-05,0.000124,0.000433,0.000504,0.000235,0.000155,0.000213,0.00015,0.000112,0.00023,0.000434,0.000222,8.2e-05,0.00015,7.3e-05,3.4e-05
3.1e-05,2.7e-05,3.2e-05,1.6e-05,3.5e-05,0.000813,0.00054,0.000185,2.6e-05,5.6e-05,1.4e-05,5.7e-05,9.2e-05,8.3e-05,4.6e-05,2e-05,1e-05,1.6e-05,4.5e-05,4.5e-05,7.9e-05,8.6e-05,6.9e-05,2.6e-05,2e-06,5.4e-05,3e-05,1.6e-05,7e-06,4.1e-05,8.2e-05,4.6e-05,0.000164,3e-05,4.2e-05,2e-05,6.9e-05,0.000125,6e-05,1e-05,1.6e-05,0.000182,0.00013,0.000118,9.5e-05,0.000154,0.000208,0.00048,0.000218,6e-04,6e-04,0.001388,0.001814,0.001631,0.001314,0.001324,0.002873,0.001849,0.002896,0.005165,0.004179,0.00422,0.002372,0.001098,0.005289,0.002219,0.005786,0.000711,0.001032,0.005938,0.004085,0.004461,0.003914,0.003053,0.002168,0.002878,0.003254,0.003118,0.005468,0.003104,0.004866,0.002079,0.002504,0.002891,0.002623,0.002209,0.001769,0.002282,0.001302,0.00015,0.001439,0.000364,0.000501,0.000566,0.000362,0.000175,0.000636,0.000756,0.000407,0.000213,7.5e-05,0.000129,0.000122,0.000306,9e-05,4.9e-05,0.000134,0.000345,0.000422,0.000209,0.000108,0.000118,0.000169,0.000175,0.000116,0.000372,0.000203,6.4e-05,9.5e-05,6.7e-05,1.4e-05
1.1e-05,2.1e-05,5.3e-05,5.1e-05,6e-06,0.000945,0.000717,0.000382,8.1e-05,1.7e-05,9e-06,2.5e-05,4.9e-05,3.5e-05,2.1e-05,2.8e-05,3.2e-05,5e-05,2.8e-05,2.4e-05,7.3e-05,1e-05,2.2e-05,2.6e-05,2.4e-05,4.1e-05,5.6e-05,1.3e-05,2.4e-05,5.1e-05,4.5e-05,7e-05,0.000174,0.000213,0.000125,2.7e-05,5e-05,0.00018,0.000111,6.6e-05,2.9e-05,0.000206,9.5e-05,2.1e-05,3e-05,0.000181,0.000184,0.000804,0.00056,0.000611,3e-04,0.000872,0.000681,0.001898,0.003081,0.000778,0.002248,0.002057,0.002476,0.000698,0.002376,0.00198,0.003264,0.003511,0.004164,0.002545,0.004695,0.004097,0.000435,0.00439,0.002683,0.000182,0.002394,0.004018,0.003751,0.003254,0.003813,0.003727,0.005227,0.000754,0.000928,0.002292,0.00339,0.001458,0.002178,0.000172,0.000559,0.000944,0.00099,0.001589,0.000882,0.000525,0.000427,0.000638,0.000308,0.000113,0.000204,0.000312,0.000204,9.9e-05,0.000133,0.000287,0.000118,0.000353,0.000291,7.4e-05,0.000192,0.000217,0.000259,0.000173,0.00015,9.6e-05,0.000157,8.5e-05,0.00018,0.000201,0.000122,3.3e-05,5.1e-05,5.5e-05,4.2e-05
1.8e-05,1.4e-05,3.8e-05,3.1e-05,4e-05,0.001058,0.000833,0.000372,7.7e-05,3.5e-05,4.8e-05,2.8e-05,1.2e-05,7e-06,3.3e-05,2.6e-05,1.3e-05,3.1e-05,5.5e-05,6e-05,8e-05,6e-05,3.2e-05,2.4e-05,1.7e-05,1.8e-05,4.6e-05,4.2e-05,4.9e-05,8e-05,4.4e-05,4.6e-05,0.000122,0.000214,0.00012,4.4e-05,7.1e-05,0.000205,0.000103,4.3e-05,5.6e-05,0.000195,0.000161,0.000166,0.000129,0.000206,9.9e-05,0.000706,0.000614,0.000238,0.000223,0.000277,0.001657,0.001835,0.002927,0.001722,0.002088,0.00204,0.003195,0.000868,0.002218,0.003002,0.002895,0.00414,0.003135,0.001379,0.002369,0.002517,0.003566,0.000334,0.001302,0.003467,0.000461,0.001474,0.001663,0.002228,0.001272,0.002974,0.002061,0.002579,0.002729,0.002191,0.002164,0.001117,0.001731,0.000887,0.000999,0.001257,0.001711,0.000559,0.000386,0.000298,0.00034,0.000342,0.000198,3.6e-05,0.000103,0.000504,0.000484,0.000418,0.000485,0.000539,0.000412,0.000295,0.000128,8.2e-05,0.000151,0.000144,0.000241,9e-05,5.3e-05,7.3e-05,5.1e-05,5.5e-05,0.00013,6e-05,3.2e-05,8.9e-05,0.000117,0.000109,6.9e-05
9e-06,2.1e-05,5.2e-05,2.2e-05,3.7e-05,0.001032,0.000571,0.000266,5.7e-05,2.1e-05,4.2e-05,2.4e-05,1.5e-05,1.9e-05,1.3e-05,1.1e-05,2.5e-05,1.6e-05,3.8e-05,5.6e-05,3.2e-05,1.9e-05,1.6e-05,7e-06,1.6e-05,2.5e-05,2e-06,1.9e-05,2.9e-05,3.4e-05,6.1e-05,3.1e-05,8.7e-05,8.4e-05,5.6e-05,6.5e-05,0.000131,0.000145,7e-05,2.8e-05,3e-05,0.000134,0.000108,0.000153,8.8e-05,7.2e-05,0.000118,0.000626,0.000559,0.000508,0.000581,0.000542,0.000936,0.00115,0.001455,0.002794,0.000941,0.001595,0.000838,0.001483,0.001833,0.001153,0.003791,0.001426,0.001155,0.00031,0.001167,0.002545,0.003957,0.003361,0.000615,0.003108,0.003097,0.001019,0.001359,0.0018,0.001261,0.000991,0.002319,0.002085,0.000214,0.00076,0.001319,0.001258,0.001574,0.000962,0.001406,0.000941,0.000187,0.000332,0.000383,0.000201,0.000171,0.000106,0.000139,9e-05,0.000211,0.00061,0.00033,0.000116,0.000365,0.000127,5.1e-05,0.000168,0.000127,0.000145,0.000218,0.000232,0.000306,0.000229,0.000129,8.5e-05,6.8e-05,4.9e-05,8.9e-05,0.000101,0.000123,0.000121,6e-05,2.7e-05,3.7e-05
1e-05,5e-06,1.6e-05,8e-06,8e-06,0.000405,0.000199,6.8e-05,1.3e-05,1.5e-05,5e-06,8e-06,1.8e-05,2e-06,3e-06,5e-06,7e-06,1.1e-05,0,3.2e-05,2e-05,1.6e-05,2e-05,1.8e-05,1.6e-05,1.6e-05,1.3e-05,7e-06,1e-05,7e-06,1.6e-05,3e-06,4.2e-05,2.2e-05,2.4e-05,1.1e-05,4.6e-05,2e-05,2.5e-05,8e-06,2.1e-05,4.7e-05,4.8e-05,1.6e-05,1.4e-05,4.4e-05,2.8e-05,0.000191,1.9e-05,0.000337,8.1e-05,0.000161,0.000448,0.000535,0.000892,0.000857,0.00034,0.000897,0.000392,0.000505,7.2e-05,0.000441,0.001099,0.000117,0.000613,0.000529,0.000612,0.001173,0.001816,0.000588,0.000961,0.000211,0.000271,0.000335,0.000274,0.000883,0.000784,0.000311,0.000436,0.000445,0.000267,0.000199,0.000316,0.000128,0.000839,0.00038,0.000481,0.000171,0.000163,0.000265,0.000217,0.000126,3.3e-05,5.9e-05,2.5e-05,5.5e-05,7.3e-05,0.000168,0.000101,7.3e-05,7.8e-05,0.000113,0.000106,2.4e-05,2.3e-05,4.7e-05,3.4e-05,2.2e-05,5.4e-05,4e-06,9e-06,4.1e-05,3.1e-05,2.8e-05,4e-05,4.2e-05,2.3e-05,2.4e-05,1.9e-05,1.4e-05,6e-06
6e-06,7e-06,4e-06,1e-05,1.2e-05,0.000247,1e-04,3.6e-05,1e-05,1.7e-05,8e-06,9e-06,5e-06,1e-05,3e-06,4e-06,3e-06,7e-06,4e-06,1.5e-05,1.3e-05,3e-06,8e-06,6e-06,1e-05,2e-06,7e-06,5e-06,1e-05,4e-06,1.3e-05,5e-06,2.5e-05,2e-05,7e-06,8e-06,4.5e-05,3.3e-05,9e-06,1.4e-05,1.1e-05,1.5e-05,3e-05,3.8e-05,2.6e-05,4e-05,3.5e-05,9.1e-05,0.000107,0.000295,0.000234,0.000137,0.000555,0.000253,0.000986,0.000907,6e-05,0.000908,0.000653,0.000916,0.000751,0.000871,0.000604,0.000424,0.000674,0.000177,0.000473,0.000468,0.000709,0.000554,0.000825,0.00046,0.000441,0.000139,0.000532,0.000199,0.000167,0.000614,4e-04,0.000568,0.000157,0.000374,0.000262,0.000139,0.00027,0.000238,0.000267,0.000205,0.000151,0.000234,0.000173,6.2e-05,6.8e-05,2.3e-05,4.7e-05,2.2e-05,3.2e-05,3.4e-05,1.3e-05,5.1e-05,1.8e-05,3e-05,6.3e-05,3.8e-05,2.8e-05,9e-06,1.7e-05,4.5e-05,3.5e-05,1.1e-05,1.1e-05,4.9e-05,2.5e-05,3.5e-05,1.6e-05,2.7e-05,2.8e-05,2.4e-05,2.1e-05,1.6e-05,1e-05
2e-06,4e-06,6e-06,1.2e-05,9e-06,0.000106,4.5e-05,1.7e-05,7e-06,1e-05,2e-06,6e-06,2e-06,5e-06,4e-06,3e-06,4e-06,2e-06,8e-06,9e-06,1e-06,6e-06,3e-06,5e-06,6e-06,6e-06,3e-06,4e-06,7e-06,2e-06,1e-05,6e-06,1.5e-05,1e-05,6e-06,1e-05,4.4e-05,1.2e-05,6e-06,1e-05,7e-06,3e-05,1.1e-05,1.9e-05,1e-05,1.6e-05,2e-05,7.8e-05,0.000106,0.000129,5.4e-05,0.000251,0.000333,0.000759,0.000639,0.000602,0.00058,0.000418,0.000908,0.000375,0.000482,0.000331,0.000551,0.000477,0.000204,0.000251,4.7e-05,0.000588,0.000188,0.000231,0.000368,0.000197,0.000578,0.000492,0.000284,0.000135,0.000183,0.000429,0.000321,0.000147,0.000272,0.000443,0.000166,0.000138,0.000182,4.7e-05,0.000157,5.4e-05,0.000139,0.000216,8.8e-05,4.3e-05,2e-05,1.6e-05,3.3e-05,4.3e-05,4.4e-05,1.8e-05,2.9e-05,4.6e-05,4.2e-05,4.2e-05,6.1e-05,7.2e-05,4.7e-05,5e-06,4e-06,4.1e-05,3.9e-05,1.4e-05,4e-06,4.1e-05,5.3e-05,1.9e-05,2.5e-05,1.9e-05,1.8e-05,1e-05,2e-06,7e-06,2e-06
2e-06,5e-06,8e-06,4e-06,9e-06,1.1e-05,3.2e-05,1.6e-05,1.2e-05,2e-06,2e-06,2e-06,7e-06,7e-06,4e-06,5e-06,3e-06,3e-06,6e-06,4e-06,4e-06,6e-06,4e-06,7e-06,2e-06,5e-06,4e-06,2e-06,7e-06,2e-06,8e-06,5e-06,1.5e-05,1.6e-05,4e-06,1.5e-05,2.6e-05,1e-06,1e-05,3e-06,5e-06,4.1e-05,1.2e-05,1.6e-05,7e-06,1.6e-05,3.4e-05,5.9e-05,5.7e-05,8.3e-05,8e-05,0.000296,0.000529,0.000629,0.000311,0.000212,0.000245,0.000927,0.000733,0.00062,0.000483,0.000141,0.000156,0.000327,0.00015,0.00014,0.000442,0.000571,0.000237,0.000261,0.000136,0.000337,3e-04,0.000234,0.000418,0.000261,0.000192,0.000238,0.000135,0.000202,0.000258,0.000194,5.6e-05,8.2e-05,0.000193,4.1e-05,0.000141,4.1e-05,0.000106,0.000181,2.6e-05,1e-06,2.3e-05,1e-05,9e-06,4.5e-05,1.4e-05,1.7e-05,8e-06,3.3e-05,6.8e-05,6.7e-05,5.2e-05,2.9e-05,1e-06,4e-06,9e-06,8e-06,2.3e-05,8e-06,5e-06,3.5e-05,3.6e-05,3.2e-05,1.9e-05,1.4e-05,9e-06,3e-06,6e-06,3e-06,2e-06
1e-06,6e-06,3e-06,5e-06,7e-06,6.8e-05,3.6e-05,1e-05,9e-06,6e-06,4e-06,4e-06,1.2e-05,2e-06,5e-06,7e-06,5e-06,3e-06,5e-06,2e-06,5e-06,7e-06,1e-06,6e-06,1e-06,3e-06,3e-06,4e-06,3e-06,3e-06,1.1e-05,4e-06,1.4e-05,1.3e-05,1.1e-05,8e-06,3.5e-05,6e-06,6e-06,6e-06,1e-06,3.6e-05,2.8e-05,1.8e-05,1.9e-05,2.8e-05,1.3e-05,9.2e-05,2.7e-05,7e-06,5.6e-05,0.000262,0.000264,0.000513,0.000494,7.4e-05,0.000335,0.000896,0.000444,0.000194,0.000215,0.000351,0.000201,0.000361,0.000169,0.000227,0.000369,0.000437,0.000499,0.000216,0.00019,0.000544,0.000478,0.00022,0.000415,0.00028,0.000158,0.000516,0.000218,0.000135,0.000287,2e-04,5.6e-05,3.8e-05,0.00022,8.5e-05,0.00012,8.5e-05,0.000116,0.000123,6.8e-05,6e-06,4.3e-05,1.5e-05,1.4e-05,2.7e-05,2.9e-05,7e-06,1.4e-05,2.6e-05,2.7e-05,9e-06,2.8e-05,2.2e-05,1.1e-05,1.7e-05,1.2e-05,5.5e-05,4.7e-05,1.4e-05,1.1e-05,3.3e-05,2.5e-05,2.3e-05,2.3e-05,2.8e-05,1.2e-05,4e-06,9e-06,5e-06,6e-06
4e-06,6e-06,5e-06,3e-06,7e-06,8.8e-05,4e-05,2.5e-05,8e-06,1.1e-05,3e-06,4e-06,8e-06,4e-06,4e-06,4e-06,1e-06,7e-06,1e-06,6e-06,7e-06,6e-06,2e-06,4e-06,6e-06,1.1e-05,7e-06,6e-06,9e-06,7e-06,7e-06,1e-06,9e-06,5e-06,5e-06,4e-06,2.1e-05,9e-06,1.1e-05,8e-06,2e-06,4.2e-05,8e-06,1e-05,1.4e-05,2.2e-05,3.9e-05,6.8e-05,1.7e-05,3.3e-05,9e-05,0.000223,0.000243,0.000569,0.00088,0.000543,0.000623,0.000359,0.000192,0.000388,0.00015,0.000436,0.000449,0.000328,0.000242,0.00028,0.000275,0.000599,0.00021,0.000316,0.000186,0.000567,0.000244,9.4e-05,0.000222,0.000204,4.8e-05,0.00041,7.3e-05,0.000226,0.000102,0.000261,3.5e-05,8.4e-05,0.000181,2.4e-05,7.4e-05,1.9e-05,6.6e-05,9.5e-05,7e-06,2.1e-05,3.5e-05,1.2e-05,3.9e-05,3.6e-05,3e-05,7.3e-05,3.8e-05,1.6e-05,3e-05,4.3e-05,3.3e-05,2.3e-05,1.8e-05,2.1e-05,3.5e-05,5.9e-05,1.3e-05,2.5e-05,3.7e-05,2.1e-05,3.5e-05,9e-06,2.9e-05,4.9e-05,2.1e-05,8e-06,4e-06,5e-06,1e-05
5e-06,2e-06,8e-06,8e-06,1.1e-05,9.7e-05,8e-05,4.6e-05,8e-06,1.1e-05,1.4e-05,9e-06,2e-06,8e-06,5e-06,5e-06,2e-06,9e-06,3e-06,3e-06,9e-06,7e-06,6e-06,5e-06,8e-06,8e-06,2e-06,2e-06,4e-06,7e-06,1.1e-05,3e-06,6e-06,5e-06,9e-06,1.1e-05,1.3e-05,4e-06,1.8e-05,1e-05,2e-06,3.9e-05,3.3e-05,1.7e-05,2e-05,3.6e-05,2.5e-05,8.3e-05,3.1e-05,2.5e-05,8.1e-05,6.7e-05,0.000243,0.000465,0.000346,0.000315,0.000234,0.000354,0.000105,0.000294,0.000244,0.000233,0.00048,0.000419,0.000289,0.000312,8e-05,0.000615,0.000119,0.000149,0.000307,5.3e-05,0.000129,0.000123,0.000412,0.00025,0.000219,0.000236,0.000281,0.000156,0.00015,0.000225,0.000156,0.000185,0.000185,0.000132,0.000163,5.4e-05,7.3e-05,0.000185,5.3e-05,2.5e-05,4.3e-05,2.2e-05,5.1e-05,8.8e-05,3.8e-05,9.3e-05,8.4e-05,7e-05,8.7e-05,7.6e-05,4e-06,1.6e-05,4.6e-05,3.3e-05,3.7e-05,7.3e-05,5.4e-05,2.6e-05,3.7e-05,6.2e-05,3.1e-05,4e-05,2.5e-05,3.3e-05,2.3e-05,5e-06,6e-06,8e-06,4e-06
1e-06,1.2e-05,9e-06,8e-06,6e-06,8e-05,5.7e-05,2.3e-05,1e-05,5e-06,7e-06,2e-06,1e-05,5e-06,8e-06,5e-06,4e-06,1.1e-05,1.5e-05,1e-05,1.3e-05,2.1e-05,1.5e-05,8e-06,5e-06,8e-06,1.2e-05,5e-06,3e-06,7e-06,3e-06,6e-06,3e-06,1e-05,6e-06,7e-06,2.4e-05,6e-06,1.2e-05,1e-05,1e-05,3.4e-05,2.9e-05,1.2e-05,1.6e-05,1.7e-05,2.1e-05,6.7e-05,5.3e-05,2.4e-05,1e-05,0.000119,0.000246,0.000162,0.000146,0.000542,0.000156,0.000508,0.000388,0.000618,0.00028,0.000267,0.000314,4.2e-05,0.000242,0.000251,0.000249,9.4e-05,0.000381,0.00039,0.000521,1.7e-05,0.000263,0.000189,0.000457,0.00018,0.000216,0.000235,0.000249,0.000316,0.000261,0.000252,0.000291,6e-05,0.00016,0.000117,0.000157,6.7e-05,9.8e-05,0.000222,7e-05,1.6e-05,5.6e-05,1.6e-05,4.4e-05,1.9e-05,4e-05,0.000125,0.000101,3.3e-05,7.6e-05,8.6e-05,8.1e-05,4.2e-05,4.4e-05,2e-05,4.2e-05,5.9e-05,5.1e-05,2.9e-05,5.5e-05,3.1e-05,1.5e-05,1.9e-05,3.4e-05,4.9e-05,2.4e-05,1.9e-05,5e-06,1.4e-05,1.1e-05
4e-06,1.4e-05,8e-06,0,9e-06,6.5e-05,3.7e-05,2.2e-05,1.4e-05,6e-06,1e-06,7e-06,1.5e-05,1e-05,4e-06,5e-06,8e-06,1.8e-05,7e-06,5e-06,1e-05,1e-05,4e-06,3e-06,5e-06,6e-06,1.3e-05,1.1e-05,5e-06,8e-06,1e-06,5e-06,1.7e-05,6e-06,8e-06,1e-05,1.1e-05,7e-06,9e-06,1.8e-05,5e-06,2e-05,2.5e-05,1.8e-05,1.9e-05,1.4e-05,2e-05,3.2e-05,1e-06,3e-06,5.9e-05,0.000151,0.000171,0.000184,0.000257,0.000399,0.00013,0.000386,0.000228,0.000232,0.000307,0.00042,0.000408,0.000156,0.000318,0.000193,0.00019,0.000282,0.000361,0.000581,0.000334,0.000268,0.000223,0.000197,0.000275,0.000186,0.000228,0.000259,0.000362,0.000372,0.000134,0.000426,0.000279,0.00025,0.000177,4.2e-05,0.000174,0.000173,0.000144,0.000233,0.000103,7.1e-05,3.5e-05,4.5e-05,1.5e-05,5e-05,4.8e-05,7.7e-05,1.6e-05,2.1e-05,7.4e-05,3.3e-05,1.3e-05,1.4e-05,3.7e-05,2.8e-05,5.6e-05,7.1e-05,3.9e-05,1.8e-05,4.4e-05,3.7e-05,1.6e-05,1.1e-05,5.1e-05,2.8e-05,9e-06,8e-06,1.8e-05,8e-06,2e-06
5e-06,5e-06,4e-06,6e-06,9e-06,4.6e-05,2.7e-05,1.6e-05,8e-06,9e-06,6e-06,5e-06,4e-06,4e-06,4e-06,2e-06,7e-06,7e-06,1.5e-05,1.1e-05,6e-06,8e-06,8e-06,7e-06,2e-06,2e-06,6e-06,7e-06,7e-06,9e-06,9e-06,4e-06,1.5e-05,1.3e-05,1.5e-05,1e-06,9e-06,1e-05,3e-06,9e-06,7e-06,1.3e-05,2.2e-05,1.3e-05,1.1e-05,7e-06,1.5e-05,9e-06,2.8e-05,1.1e-05,5.9e-05,3.4e-05,0.000271,0.000179,0.000369,0.000404,0.000366,0.000313,0.000591,0.000263,0.000219,0.000168,0.000146,0.000107,0.000209,0.000226,0.000203,0.000139,0.000272,0.000302,0.000327,0.000262,0.00024,0.000241,0.000139,0.000265,0.000208,0.000156,0.000275,0.000147,0.000246,0.000277,6.9e-05,0.000196,0.000285,0.000103,5e-05,0.000108,3.2e-05,0.000155,0.000136,4.8e-05,3.8e-05,5.9e-05,6.5e-05,8.4e-05,3.1e-05,7.5e-05,6.8e-05,4.9e-05,3.7e-05,3.8e-05,2.1e-05,2.6e-05,3.2e-05,2.8e-05,2.9e-05,9.4e-05,3.3e-05,1.6e-05,5e-05,2.7e-05,1.3e-05,2.9e-05,3.8e-05,1.1e-05,2e-06,1.1e-05,1.8e-05,8e-06,3e-06
8e-06,2e-06,4e-06,4e-06,4e-06,1.2e-05,3e-05,5e-06,7e-06,9e-06,7e-06,3e-06,1e-06,4e-06,6e-06,1e-06,3e-06,3e-06,1e-05,9e-06,6e-06,3e-06,6e-06,4e-06,2e-06,2e-06,6e-06,4e-06,4e-06,1.1e-05,4e-06,1e-05,7e-06,2e-06,3e-06,8e-06,1.2e-05,9e-06,6e-06,3e-06,5e-06,7e-06,5e-06,1.5e-05,1.2e-05,1.8e-05,8e-06,1.6e-05,2.4e-05,4.2e-05,1.8e-05,4.9e-05,0.000247,0.000282,0.000322,7.3e-05,0.000294,0.000264,0.000347,0.000252,0.000301,0.000338,0.000174,7.1e-05,0.000296,0.000264,0.000235,0.000415,0.000389,0.000485,0.000199,0.000286,0.000302,0.000167,0.000478,0.000151,4.9e-05,0.000263,0.000219,0.000343,5e-05,0.000136,0.000212,4.1e-05,0.000103,9.9e-05,9.8e-05,0.000157,0.000148,6.2e-05,7.3e-05,3.8e-05,4.7e-05,7.4e-05,8.1e-05,4.3e-05,1.2e-05,6.2e-05,8.2e-05,1.1e-05,2e-05,4e-05,2.7e-05,3.2e-05,1.4e-05,1e-06,2.8e-05,3.7e-05,4.3e-05,1.3e-05,3.9e-05,4.8e-05,2.7e-05,4.8e-05,3.9e-05,1.2e-05,6e-06,1.2e-05,5e-06,8e-06,6e-06
6e-06,3e-06,2e-06,1e-06,5e-06,4.9e-05,4.3e-05,1.1e-05,1.1e-05,1e-05,3e-06,4e-06,8e-06,7e-06,6e-06,2e-06,3e-06,1.1e-05,5e-06,1e-05,2e-06,4e-06,9e-06,9e-06,7e-06,3e-06,7e-06,2e-06,4e-06,7e-06,5e-06,7e-06,7e-06,1.4e-05,7e-06,4e-06,1.9e-05,1.7e-05,1.1e-05,8e-06,1e-06,7e-06,1.5e-05,2.9e-05,3e-05,2.3e-05,6e-06,1.5e-05,3.1e-05,5.2e-05,2.8e-05,0.000119,0.000161,0.000147,7e-05,9.3e-05,0.000311,0.000261,0.000382,0.000304,0.00026,0.000431,0.000192,0.00025,0.000286,0.000149,0.000164,0.000386,0.00021,0.000282,0.000179,0.000452,0.000202,0.000145,0.000487,0.000318,6.8e-05,0.000285,0.000287,0.000201,0.000207,0.000124,0.000156,0.000145,0.00025,9.4e-05,8.5e-05,6.6e-05,3.9e-05,0.000162,9.5e-05,3.9e-05,4e-05,6e-05,2.4e-05,3.8e-05,3.5e-05,7.4e-05,4.5e-05,3.6e-05,1.7e-05,7.4e-05,8.5e-05,2.1e-05,3.3e-05,3.6e-05,4.3e-05,6.8e-05,6.7e-05,4.9e-05,4.4e-05,6.2e-05,2.8e-05,3.3e-05,3.5e-05,9e-06,8e-06,1e-05,7e-06,7e-06,1.2e-05
2e-06,3e-06,3e-06,3e-06,4e-06,7.6e-05,7.6e-05,4.8e-05,2.5e-05,7e-06,1.4e-05,7e-06,4e-06,2e-06,5e-06,2e-06,2e-06,1.2e-05,5e-06,8e-06,8e-06,9e-06,3e-06,1e-06,4e-06,2e-06,6e-06,0,2e-06,1.1e-05,6e-06,0,7e-06,2.4e-05,1.4e-05,1e-06,1.6e-05,2.8e-05,1.4e-05,5e-06,5e-06,1e-05,2.4e-05,1.7e-05,3.2e-05,3e-06,2e-06,3.2e-05,3.1e-05,6.8e-05,7.1e-05,0.000106,0.000234,0.000149,0.00014,0.00015,0.000281,0.000568,0.000393,0.000124,0.000136,7.5e-05,0.000315,0.000332,0.000325,0.000186,0.000104,0.000212,0.000427,8.4e-05,8.5e-05,0.000263,0.000184,7.2e-05,0.000222,6.5e-05,0.000122,0.000308,7.8e-05,0.000334,3.6e-05,7.5e-05,4.2e-05,2e-05,0.000277,0.000122,5.3e-05,8.5e-05,0.000109,0.000206,5.9e-05,2.8e-05,2.6e-05,5.5e-05,2.8e-05,4.5e-05,5.3e-05,0.000126,0.000106,3.6e-05,3.9e-05,4.3e-05,2.6e-05,3.3e-05,4e-05,5.4e-05,2.3e-05,7.4e-05,9.2e-05,5.5e-05,3.5e-05,2.2e-05,1.9e-05,4.6e-05,5.8e-05,2.2e-05,6e-06,1.5e-05,3e-06,9e-06,1e-05
5e-06,3e-06,3e-06,3e-06,4e-06,8.1e-05,4.2e-05,1.4e-05,5e-06,1.1e-05,9e-06,1e-05,8e-06,5e-06,3e-06,4e-06,4e-06,7e-06,8e-06,5e-06,3e-06,3e-06,3e-06,5e-06,2e-06,3e-06,4e-06,3e-06,1e-06,1.1e-05,1.5e-05,8e-06,7e-06,2.2e-05,9e-06,8e-06,1.9e-05,1.7e-05,1.2e-05,9e-06,2e-06,1.4e-05,1.7e-05,2.5e-05,2.8e-05,2.3e-05,1.4e-05,3.1e-05,5e-06,8e-05,4.7e-05,3.8e-05,0.000242,0.000321,0.000252,0.00036,0.000254,0.000235,0.000101,0.000212,0.000115,0.000195,0.000322,0.000194,0.000229,0.000157,7.5e-05,0.000126,0.000214,0.000351,3.3e-05,0.000115,0.000288,0.000118,0.000138,4.1e-05,1.8e-05,0.000327,0.000226,0.000243,0.000258,4.5e-05,4.6e-05,5.8e-05,0.000198,0.000114,6.5e-05,6.9e-05,6.1e-05,0.000146,6.2e-05,4.6e-05,4.8e-05,4.2e-05,1.9e-05,4.2e-05,1.8e-05,9.2e-05,8.2e-05,7.8e-05,2.3e-05,3.9e-05,4e-05,2.7e-05,1.5e-05,3e-05,4e-05,4.1e-05,5.5e-05,1.9e-05,3e-05,4.7e-05,1.9e-05,2.2e-05,4.3e-05,5e-05,3.1e-05,1.5e-05,1.3e-05,1.4e-05,1.5e-05
3e-06,1e-06,1e-06,3e-06,2e-06,7.9e-05,5.2e-05,3.3e-05,4e-06,1.1e-05,1e-05,3e-06,3e-06,2e-06,1e-06,1e-06,4e-06,2e-06,4e-06,0,2e-06,2e-06,1e-06,3e-06,1e-06,2e-06,3e-06,4e-06,2e-06,6e-06,5e-06,5e-06,4e-06,1.3e-05,1e-05,8e-06,2.2e-05,3e-06,1.4e-05,8e-06,1e-06,1.7e-05,3.1e-05,2e-05,8e-06,1e-05,1.3e-05,1.4e-05,4e-05,6.9e-05,8e-05,6.9e-05,0.000214,0.000338,0.000169,0.000214,0.000335,0.000247,0.00049,0.000315,0.000146,0.00017,0.000321,2e-04,0.000103,9.7e-05,0.000138,0.000108,0.000147,0.000165,0.000167,0.000155,7.1e-05,2.6e-05,0.000172,9.8e-05,4.2e-05,0.000218,0.000113,0.000143,0.000171,0.000121,6.8e-05,4.5e-05,8.9e-05,4.1e-05,6e-05,7.3e-05,4.6e-05,0.000121,2.9e-05,3.4e-05,2.2e-05,3.9e-05,2e-06,1.3e-05,2.1e-05,6.9e-05,1.4e-05,2.2e-05,4.2e-05,1.5e-05,1.8e-05,7e-06,1.5e-05,1.7e-05,1.9e-05,2.9e-05,1e-05,1.1e-05,1.4e-05,3.5e-05,3.1e-05,9e-06,1.5e-05,2.4e-05,7e-06,6e-06,8e-06,1.4e-05,1.2e-05
1e-06,2e-06,2e-06,1e-06,2e-06,7.1e-05,6.1e-05,3.2e-05,1.2e-05,5e-06,7e-06,2e-06,2e-06,1e-06,2e-06,2e-06,3e-06,2e-06,5e-06,2e-06,2e-06,5e-06,3e-06,2e-06,2e-06,3e-06,2e-06,1e-06,3e-06,4e-06,8e-06,2e-06,5e-06,8e-06,5e-06,1e-06,1.9e-05,1.1e-05,6e-06,8e-06,1e-05,1e-05,1.3e-05,1.6e-05,5e-06,1.1e-05,6e-06,3.8e-05,2.8e-05,7.5e-05,0.000101,8.2e-05,0.000302,0.000338,0.000379,0.000227,0.000122,0.000259,0.00027,0.000171,0.000144,0.000127,0.000168,0.000181,7.7e-05,0.000129,0.000117,0.000141,0.000189,0.000352,6.9e-05,4.1e-05,0.00011,5.1e-05,0.000251,0.000103,8.8e-05,0.000229,7.3e-05,0.000116,8.7e-05,0.000139,1.5e-05,5.9e-05,6.7e-05,4.8e-05,6.4e-05,7e-06,6.3e-05,0.000104,2.3e-05,1.8e-05,4.3e-05,4.3e-05,2.1e-05,3.2e-05,2.6e-05,2.5e-05,3.4e-05,2.2e-05,2.3e-05,5.3e-05,2.6e-05,1.8e-05,2.1e-05,1.3e-05,1.6e-05,1.7e-05,2.7e-05,3.6e-05,1.6e-05,4e-05,4.1e-05,3.1e-05,2.6e-05,1.6e-05,5e-06,5e-06,2e-06,5e-06,7e-06
2e-06,1e-06,0,2e-06,2e-06,6.6e-05,4.2e-05,2.1e-05,1e-06,6e-06,1e-06,1e-05,6e-06,1e-06,1e-06,1e-06,2e-06,2e-06,5e-06,1e-06,2e-06,2e-06,2e-06,3e-06,2e-06,3e-06,4e-06,1e-06,3e-06,2e-06,4e-06,5e-06,4e-06,4e-06,7e-06,7e-06,1.5e-05,1.3e-05,6e-06,2e-06,1e-05,1e-05,2e-06,1.3e-05,5e-06,3e-06,2e-06,3.9e-05,4e-05,6.3e-05,7.3e-05,0.000127,0.000205,9.6e-05,1e-04,0.000131,0.000141,0.000229,0.000266,0.000217,4.6e-05,0.000177,7.2e-05,0.000163,6e-05,0.00014,0.000139,0.000261,0.000221,6.4e-05,0.000151,2.7e-05,0.000164,3.2e-05,0.000167,0.000105,4.7e-05,0.000237,0.000124,4.7e-05,9e-05,0.00011,3.7e-05,1.1e-05,0.000117,2.6e-05,5.2e-05,2.8e-05,7.4e-05,9.8e-05,4.2e-05,4.7e-05,2.7e-05,2.4e-05,1.3e-05,2e-05,8e-06,2.5e-05,6.1e-05,4.3e-05,2.3e-05,3.2e-05,3.4e-05,5e-06,1.9e-05,1.5e-05,5e-06,1.7e-05,2.8e-05,2e-05,3.4e-05,2.2e-05,2e-05,1e-05,4e-06,1.3e-05,1.5e-05,1.2e-05,9e-06,4e-06,5e-06
1e-06,1e-06,1e-06,1e-06,1e-06,6.5e-05,1.6e-05,1.4e-05,1.1e-05,6e-06,6e-06,1e-05,6e-06,4e-06,2e-06,1e-06,2e-06,2e-06,5e-06,2e-06,1e-06,0,1e-06,2e-06,1e-06,1e-06,2e-06,1e-06,2e-06,2e-06,4e-06,2e-06,5e-06,5e-06,3e-06,3e-06,2e-05,1e-05,3e-06,6e-06,4e-06,1.2e-05,2e-06,1.2e-05,3e-06,3e-06,4e-06,2.6e-05,1e-05,1.9e-05,9.1e-05,6.7e-05,0.000167,0.000215,0.000138,0.000195,4e-05,0.000165,1.5e-05,0.000118,6.2e-05,0.000124,9.3e-05,0.000141,0.000196,9.2e-05,7.3e-05,3e-04,2.7e-05,4e-05,2.9e-05,7.7e-05,0.000237,8.4e-05,0.000173,6.5e-05,2.5e-05,0.000106,2e-05,3.2e-05,0.000136,9.3e-05,1.2e-05,2.5e-05,0.000102,1.6e-05,3.6e-05,2.3e-05,7e-05,6.6e-05,1.7e-05,1.4e-05,1.1e-05,2.1e-05,2e-06,9e-06,1.1e-05,3.6e-05,2.6e-05,5e-06,5e-06,1.6e-05,9e-06,1.4e-05,5e-06,7e-06,8e-06,8e-06,2.3e-05,1.1e-05,1.6e-05,1.1e-05,6e-06,8e-06,5e-06,1.5e-05,4e-06,2e-06,2e-06,3e-06,2e-06
1e-06,1e-06,1e-06,0,1e-06,6.5e-05,5e-06,1e-06,5e-06,2e-06,5e-06,6e-06,2e-06,2e-06,1e-06,1e-06,3e-06,2e-06,6e-06,1e-06,1e-06,2e-06,0,2e-06,1e-06,0,2e-06,0,2e-06,0,4e-06,2e-06,6e-06,5e-06,3e-06,2e-06,1.8e-05,7e-06,3e-06,4e-06,3e-06,1.1e-05,4e-06,1.1e-05,5e-06,2e-06,3e-06,2.7e-05,9e-06,7e-06,5.7e-05,9e-05,0.00012,0.000216,0.000351,6.6e-05,2.2e-05,0.000171,0.00026,0.000199,0.000122,0.000241,0.000183,0.000179,0.000158,0.000222,0.000141,0.00026,8.4e-05,5.2e-05,9.4e-05,0.000116,0.000198,4.4e-05,0.000182,5.7e-05,3.7e-05,8.6e-05,3.7e-05,8.3e-05,0.00012,8.8e-05,1.3e-05,1.3e-05,0.000106,1.4e-05,4.5e-05,2e-06,4.9e-05,7.2e-05,1e-05,1.1e-05,1.4e-05,1.8e-05,4e-06,1.2e-05,6e-06,3.7e-05,1.1e-05,3e-06,5e-06,9e-06,1.4e-05,1.2e-05,5e-06,8e-06,5e-06,5e-06,1.6e-05,5e-06,8e-06,2e-06,5e-06,5e-06,3e-06,6e-06,2e-06,3e-06,3e-06,3e-06,2e-06
1e-06,1e-06,1e-06,0,1e-06,6.6e-05,1e-06,2e-06,3e-06,2e-06,4e-06,3e-06,0,1e-06,1e-06,1e-06,3e-06,3e-06,6e-06,2e-06,1e-06,2e-06,0,2e-06,1e-06,0,2e-06,0,2e-06,0,4e-06,2e-06,5e-06,2e-06,2e-06,1e-06,1.8e-05,1e-05,2e-06,4e-06,3e-06,9e-06,3e-06,1e-05,3e-06,3e-06,3e-06,2.4e-05,3e-06,1e-05,5.8e-05,9.2e-05,8.7e-05,0.000165,0.000285,0.00014,7.6e-05,0.000218,0.000286,0.000116,9e-05,0.000189,0.000123,0.000107,7.3e-05,0.000161,9.1e-05,0.000236,4.6e-05,5.4e-05,9.5e-05,6.8e-05,0.000136,5.9e-05,0.00019,4.3e-05,4.3e-05,9.5e-05,1.3e-05,7.4e-05,8e-05,8.7e-05,1e-05,2.9e-05,0.000102,4e-06,4.5e-05,1.5e-05,5.4e-05,8e-05,8e-06,4e-06,2e-05,1.4e-05,4e-06,1.1e-05,8e-06,3.6e-05,1.4e-05,3e-06,2e-06,7e-06,1.1e-05,1e-05,3e-06,7e-06,8e-06,3e-06,1.5e-05,2e-06,3e-06,2e-06,3e-06,1e-06,3e-06,6e-06,3e-06,1e-06,2e-06,3e-06,1e-06
