-0.000323,-0.000248,-0.00014,0.00018,0.000852,-0.000186,-0.000751,-0.000809,-0.000328,0.000447,0.000185,-0.001241,-2e-05,-0.000182,0.000688,0.000703,0.000888,4.4e-05,0.000841,0.000508,0.000125,-0.000409,-0.000531,-0.00049,-0.000559,7.9e-05,0.000253,-0.000248,-0.000809,0.000374,-0.000494,-0.000503,0.000473,0.000284,0.000357,0.000477,-4.1e-05,0.00017,-0.000557,-0.000716,-0.000386,-0.000381,-0.000819,-0.000596,-0.000786,-0.000495,-0.00074,0.000407,-0.000105,-0.000349,-0.000418,-0.000202,-0.000968,3e-05,-0.000324,-0.000228,8e-06,0.000143,-9.2e-05,-0.00028,-0.000247,-0.000631,0.000129,-0.000221,-0.000711,-0.00061,-0.000493,0.000118,0.00051,-0.000514,-0.000739,0.000295,-0.000105,-0.000994,0.000183,4.1e-05,-0.000585,-0.000352,-0.000438,-0.000522,-0.000231,-0.000337,-0.000625,-0.000855,-0.000368,0.000377,-0.000902,-0.000769,-0.001349,-0.001042,-0.000904,-0.000555,0.000978,-0.000945,-0.001239,-0.000825,-0.00137,-0.000931,-0.00028,-0.000354,-0.000758,-0.001827,-0.001187,-0.001209,-0.001067,-0.000968,-0.000932,-0.001046,-0.000586,3e-06,-0.000843,-0.000489,-0.000251,-5.2e-05,-3e-04,-0.001261,-0.000502,-0.000248,0.000164,0.00086,0.000359
-0.000679,-8.5e-05,0.000206,0.000219,-0.000821,-0.000251,1e-06,-3.9e-05,-0.000424,-6.3e-05,0.000283,0.000534,-4.6e-05,0.000239,0.00082,-0.000484,0.000287,0.000442,-0.001007,-0.001135,-0.000305,-0.000273,0.000905,0.000467,0.000361,0.000117,-5.1e-05,0.000759,-4.6e-05,0.000519,8.3e-05,-0.000429,-0.000906,-0.000187,-1.1e-05,5e-06,-0.000511,-0.000148,0.00078,-9.8e-05,-0.000117,-0.000408,0.000275,0.000321,-0.000154,-0.000154,-3.6e-05,-0.000235,-0.001126,-0.000378,-0.000373,0.000337,0.000353,-0.00063,-0.000756,-0.000207,0.000327,0.000825,-0.000531,-4.3e-05,-0.001313,-0.000809,-0.000232,0.000238,-8.9e-05,-0.000146,0.000144,-0.000988,-0.000459,-0.000112,0.000161,-0.000975,2.6e-05,0.000227,-0.000402,7e-06,-0.000137,0.000299,-9.1e-05,-0.001006,1.1e-05,-0.000444,-0.00022,0.000101,-0.000211,-0.000401,-0.000361,0.000313,0.000946,0.001429,-8.3e-05,-0.000154,0.000421,0.000623,0.000441,0.000129,0.000592,0.000527,0.000677,0.00102,0.00167,0.000996,0.000388,0.000146,0.00079,7.6e-05,0.001046,0.00113,0.000269,-0.000243,0.000179,-0.000166,0.000847,0.000297,-0.000446,0.000227,0.000814,0.000804,0.000723,-3.4e-05,0.000623
-0.000124,-0.000762,0.000603,0.000506,-0.00023,-0.001384,-0.001109,-0.000478,-0.000576,-0.000823,-0.000563,-0.000671,-0.000641,-0.00019,-0.00024,-0.000336,-0.000389,-0.000836,-0.000566,3.8e-05,0.000558,-0.000272,-0.000326,-0.001111,-0.000857,-0.000328,3.2e-05,0.000158,0.000179,-0.000682,-0.001116,-0.000404,-0.000693,-0.000223,-0.000469,-0.000111,-0.000306,-0.000202,-0.000154,-0.000229,0.000339,0.00058,-5e-06,-0.000263,0.000488,-0.000152,-1.8e-05,-0.00024,0.000178,0.000483,-0.000422,-0.001528,-0.000859,-0.000662,0.000744,-0.00034,-0.000788,-0.000136,0.000567,0.000298,-0.00026,0.000333,0.000244,-0.000478,-0.000674,0.000118,-0.000166,0.000485,0.000324,-0.000437,-0.000322,-0.001278,-0.000101,-0.000514,-0.000463,-9.1e-05,-6.4e-05,-0.000881,0.00014,0.000805,-0.000138,-0.000137,-0.000928,-0.000726,0.000247,-0.000989,-0.000254,0.000373,-0.000218,-0.000854,-0.000487,-0.000542,-0.000255,-0.000484,-0.000296,7.8e-05,-0.000394,-0.000477,-0.000231,0.000267,-0.000706,0.000317,0.000144,-3.5e-05,-7.8e-05,0.000623,-0.000678,-0.001474,-0.001026,0.000276,2.4e-05,-6.8e-05,-5.5e-05,0.00061,-0.000222,-0.000745,-0.000242,-0.000456,0.000719,9e-04,-0.000678
-7.1e-05,-0.000372,-0.000442,-6.8e-05,0.000622,0.000338,0.000143,3.2e-05,-8.2e-05,-0.00022,-0.000238,-5e-06,-0.000488,-0.000357,-0.000329,0.000419,-6e-05,-0.000349,-0.000302,-0.000242,3.8e-05,-0.000119,0.000175,-0.000172,-0.000505,-1.6e-05,-0.000565,-0.000628,-0.000111,4e-06,0.000178,0.000585,6.1e-05,0.000537,-0.000422,-7.7e-05,-0.000734,-0.000528,0.000256,0.00105,0.000568,-0.000263,-0.000732,-0.000771,-0.000389,0.000348,0.000175,8e-06,0.00034,0.000175,-9e-06,0.00073,0.000668,-0.000345,-0.000176,-0.000552,-0.000927,-0.000191,-0.000897,-0.000576,0.000351,0.000149,-0.000535,-0.000822,3.1e-05,-0.000388,-0.000903,-0.000518,-0.000858,4.1e-05,-1.4e-05,0.000405,-0.000641,0.000179,0.000485,-3.1e-05,-0.000431,-0.000209,-0.000444,0.00032,-8e-05,0.000204,-4e-04,-0.000297,-0.000703,1.6e-05,7.7e-05,-0.000429,-0.000448,-0.000107,4.7e-05,-0.000274,-0.000594,-0.000631,-0.00026,-0.000158,6.3e-05,-0.000591,-0.000169,8.6e-05,0.000681,-0.001056,-0.000755,-0.000564,-0.000725,-0.000415,0.000189,-0.000256,0.000525,-0.000757,-0.000212,-0.000566,-0.000226,-0.000635,-0.000584,0.000507,-0.000661,-0.000959,-0.000903,-0.000992,3.2e-05
-0.000163,-0.000823,6.9e-05,-0.000173,-0.000179,-0.000704,-0.000537,-0.000355,-0.000308,7.1e-05,-0.000692,-0.000391,0.000184,0.000725,-0.000316,-0.000305,-0.000837,-0.000843,0.000145,-0.00018,-0.000276,-0.000424,-0.000327,-0.000477,-0.000347,9.7e-05,0.000197,0.000688,-0.000338,-0.000545,-0.000344,-0.000313,8.2e-05,0.000275,-0.000642,-3.8e-05,3e-06,-1.2e-05,0.00014,-0.001,-0.00055,0.00038,0.000775,0.000595,0.000253,-0.000158,0.000205,-0.000364,2.5e-05,-0.000115,-0.000238,4e-06,-0.000222,0.000117,2.9e-05,0.000162,0.000105,0.000332,-0.000802,-0.000857,-0.000138,-0.000728,0.000201,5e-05,-0.000251,-0.000167,-6.4e-05,8.2e-05,-0.000306,-0.000311,-0.00014,-0.00011,-0.000247,-0.000382,-0.000474,-0.000451,0.000476,-0.000323,0.000173,-0.000532,0.000446,-0.000173,0.000268,0.000571,-0.000304,9.4e-05,-0.000255,-0.000254,-0.00013,-0.000195,0.000384,0.000801,-3e-05,-3.8e-05,-1.6e-05,0.000191,-0.000125,3.5e-05,-0.000168,-0.000167,-0.000396,0.000323,0.000522,0.000549,0.000915,-0.000234,0.000126,0.000305,0.000207,-0.000285,0,-1.5e-05,-6.2e-05,-0.000848,-0.000691,-0.000163,6.5e-05,-0.000258,0.000339,-0.000489,-0.000552
-0.000374,5.3e-05,5.7e-05,-0.000446,-0.000664,0.000855,0.001356,0.00054,0.000782,-8.4e-05,0.000214,0.000127,0.000129,-5.3e-05,-0.000104,-0.000319,-0.000367,-0.000101,-0.00029,-0.001264,0.000672,0.000326,4.1e-05,0.000284,0.000506,0.000103,-0.000479,-0.000195,-0.000234,-0.000435,0.000499,7.9e-05,-0.000492,-7.7e-05,3.9e-05,0.000478,0.000327,-0.000456,0.000226,0.00032,-0.000569,-0.001064,-0.000396,-0.000329,-0.000191,0.000248,-0.000384,3.7e-05,-0.000376,-0.000362,-0.000357,0.000959,0.000201,0.000103,-0.000473,-0.000184,-0.00106,-7.7e-05,-0.000402,-0.000194,-0.000352,0.000289,-0.000283,-2.2e-05,0.000221,-0.000105,-3.4e-05,-0.000389,-3.4e-05,7.5e-05,9.8e-05,5.8e-05,-4.4e-05,0.00015,0.000109,-0.000419,-0.000214,0.000243,-0.000685,-0.000298,0.000477,-0.000247,-0.000379,0.000339,-0.000173,-0.000265,-0.000364,0.000403,-7.5e-05,0.000105,-0.000294,6e-06,6.7e-05,6.9e-05,-4e-05,-0.000233,-8e-06,-0.000446,-0.000671,-0.000443,-0.000274,-2.2e-05,-0.000592,-0.000806,-0.000503,-0.000211,-0.000642,-1.2e-05,-0.000466,-0.000521,-0.000103,-0.000137,0.000658,0.000386,1.4e-05,0.000177,9.3e-05,-0.000342,-0.000436,-8.6e-05,7.8e-05
0.000227,0.000434,-0.000226,-3.1e-05,0.000238,0.00014,-0.000273,-0.000126,-0.000339,-0.00064,-0.000355,-0.000619,-0.000239,0.000121,0,-0.000341,0.000161,-8.1e-05,-0.000349,-0.000191,-0.000317,-0.000269,-0.000523,-0.000373,-0.000223,0.000224,-6.5e-05,-0.000126,6.3e-05,0.000411,-0.000402,-0.000367,-9.1e-05,-0.000168,-0.000169,-0.000237,-0.000156,-6.3e-05,-0.000193,-0.000643,-0.000143,0.000334,0.000335,0.000217,2.4e-05,0.000215,0.000205,5e-06,-0.000144,0.00021,-0.00018,-8.3e-05,-0.000414,-0.000358,-9.8e-05,-0.000371,2.4e-05,-0.000569,-0.000247,-0.000116,-0.000247,4.3e-05,-0.000124,-3.9e-05,0.000434,0.000399,8.2e-05,-0.000441,-0.000646,0.000107,-0.000198,0.00022,0.000227,0.000167,-7.9e-05,8.6e-05,-0.000285,-0.000187,-0.000228,-0.000296,-0.000517,0.000232,-0.000202,-0.000417,-4.5e-05,-0.000561,-0.00017,-0.000104,-5.2e-05,-0.000747,-0.000474,-0.000642,-0.00063,-0.000162,0.000204,0.00022,-0.00014,0.000452,-1e-05,-0.00031,-0.000435,-0.000132,0.000412,0.00021,0.000624,0.000319,0.000128,-0.000845,-0.000585,5.7e-05,-0.000253,-0.000136,-0.000399,-0.000234,0.000283,1e-06,-0.000161,0.000135,-0.000323,-0.000165,-0.000517
4.4e-05,-0.000117,-0.00056,-0.000367,-0.000631,-0.000426,4.4e-05,0.000665,-1e-05,-4.4e-05,0.000269,0.000518,8e-06,-0.000234,-2.5e-05,-0.000427,-0.000235,0.000236,-0.000253,0.00039,-0.00033,-0.000404,0.000386,0.000424,0.000317,0.00018,6.3e-05,-0.000326,-0.000259,-0.000693,-0.000314,-0.000115,0.000221,-9.3e-05,9.1e-05,-0.000192,-0.000209,-3.9e-05,-0.000121,-0.000117,0.000185,-8.2e-05,-0.000265,-0.000195,-4.5e-05,-0.000365,-9.5e-05,6e-05,-5.5e-05,0.000183,0.000522,-0.000361,6.2e-05,0.000187,0.000122,-0.000244,3e-04,0.000311,0.000186,-0.000138,-7.3e-05,-1.9e-05,0.000242,-2.5e-05,-0.000317,-0.000259,0.000129,-9.7e-05,0.000351,8.5e-05,2e-05,-0.000156,0.000177,0.000326,-6.2e-05,6.8e-05,-0.000425,-0.000368,-0.000412,-0.000131,-0.000255,-0.000552,0.000466,-0.000561,5.3e-05,-0.000205,0.000236,-7.8e-05,0.00014,0.000337,6.3e-05,0.000147,0.000165,-0.000106,3.6e-05,4.1e-05,0.000128,-0.000349,-0.000267,-0.00035,-0.000342,-0.000327,-0.000227,0.000194,-4e-05,-0.000117,-1.2e-05,5.6e-05,2e-05,6.1e-05,-0.000239,-7.3e-05,0.000186,0.000102,-0.000104,-0.000238,4.9e-05,9.6e-05,-0.000287,-2.7e-05,-0.000101
0.000333,-2.5e-05,-7e-06,0.00018,0.000137,0.000225,-4e-06,-0.00016,8.4e-05,0.000165,8.8e-05,-6.7e-05,-0.000364,-0.000602,-0.000226,2.6e-05,-5.9e-05,0.000195,-0.000413,9e-06,-0.000208,0.000155,-0.00032,-2.4e-05,0.000112,-0.000349,0.000196,-0.000355,-4e-05,0.000186,0.000114,3.4e-05,3.2e-05,-0.00016,-0.000127,-0.000353,8.7e-05,0.000449,-0.00029,0.000123,-0.000482,-0.000166,-0.000453,-0.000116,9.3e-05,0.000116,1.7e-05,-0.000226,-9.6e-05,-0.000514,-0.000448,-8.5e-05,-0.000171,-0.000334,-1e-05,0.000419,4.5e-05,-0.000397,-0.000181,0.000404,-0.000177,-0.000331,0,5.1e-05,0.000169,4.9e-05,-0.000167,0.000122,0.000138,0.000213,-0.000166,0.000115,0.000251,-5.5e-05,5.5e-05,0.000155,0.000167,-6.9e-05,0.000119,0.000189,0.000426,0.000216,0.000211,0.000226,0.000183,0.000282,-0.000129,-7e-05,-0.000159,-0.000431,-0.00012,0.000148,0.000215,0.000318,-0.00023,-0.000254,-0.000343,6.2e-05,0.000443,0.00015,-5.6e-05,-0.000401,-0.000293,-0.000114,-0.000154,-0.000436,-0.000121,-0.000135,9.6e-05,3.4e-05,-0.000183,-0.000182,-0.000267,1.8e-05,0.000251,-7.6e-05,-0.000244,0.000183,0.000107,-5.6e-05,0.000196
-8.5e-05,7.6e-05,0.000106,1.7e-05,-0.000116,0.000306,-0.000133,-0.000181,-9.9e-05,0.000167,3.3e-05,-4.9e-05,7.8e-05,0.000291,-0.000286,8.8e-05,3.3e-05,-0.000194,0.000209,5.1e-05,2.5e-05,4.3e-05,-0.000422,-0.000124,-0.000254,2.8e-05,-0.000108,2.6e-05,-0.000217,-5.5e-05,0.000147,0.000341,-0.000204,-0.000133,-5.2e-05,-0.000145,3.6e-05,9.5e-05,7e-05,-8e-05,3.6e-05,-2e-05,-3e-05,-2.5e-05,3.4e-05,-0.000127,-6.9e-05,-2.8e-05,7.3e-05,0.000104,0.000104,-0.000214,-2.6e-05,0.000627,0.000162,-0.000404,-9.2e-05,0.000303,0.000224,-0.000107,0.000182,7.9e-05,-0.000104,8e-05,-0.000292,-0.000262,0.000256,0.000179,-0.000289,-0.000319,-0.000125,-0.000185,-0.000356,-0.00021,1.7e-05,-0.000239,9e-06,-9.1e-05,5.1e-05,-0.000168,-0.000447,6.3e-05,2.1e-05,-0.000193,-0.000394,-0.00037,0.000156,5.7e-05,1.5e-05,0.000367,8e-05,3.9e-05,0.000277,-7.1e-05,-0.000161,-0.000108,0.000272,0.000138,-1.2e-05,-4.1e-05,8.6e-05,0.000147,4e-06,-2.7e-05,-9e-05,0.000292,-2.7e-05,0.000299,5.4e-05,-0.000196,0.000272,0.000319,-0.000278,-0.000239,4.8e-05,0.000471,0.000314,-9.9e-05,4.2e-05,7e-06,-0.000262
0.000114,0.000109,9.9e-05,-0.000235,6.8e-05,1e-05,6.9e-05,-0.000182,-0.000203,-5.3e-05,-1.3e-05,-0.00011,-4.9e-05,-0.000282,-0.00013,4.9e-05,0.000236,1.3e-05,4.4e-05,-0.000182,-0.000457,-0.000182,3e-04,0.000105,0.000154,-0.000247,-0.000115,-5.3e-05,-3.4e-05,0.000111,-2.2e-05,-2.7e-05,6.1e-05,7.6e-05,-0.000257,-6.3e-05,0.000147,-2e-04,-9.6e-05,0.000136,0.000105,0.000259,0.000245,5e-06,-0.000134,-6.4e-05,1.7e-05,0.000228,0.000156,-4.6e-05,0.000151,-0.00013,-7e-06,-0.000517,-0.000116,-0.000127,7.7e-05,-0.000238,0.000156,4.1e-05,0.000385,9.8e-05,0.000339,-1.6e-05,-6.7e-05,-4.5e-05,-0.000168,0.000113,0.000203,-0.000102,0.000257,0.000175,3.2e-05,0.000122,0.000181,0.000139,-0.000165,0.000218,0.000366,0.000133,-0.000221,-0.000274,-0.000133,-2.2e-05,-0.000159,0.000299,-0.000184,-0.000367,3e-06,5e-05,-6.7e-05,-8.5e-05,-5.2e-05,9.2e-05,-0.000112,-2.8e-05,-2.7e-05,4.3e-05,-0.000118,0.000204,-0.000106,-0.000238,-7.9e-05,0.000172,1e-06,-0.000288,-7.1e-05,-0.000178,-3e-06,0.000184,-9.1e-05,-5.7e-05,-3.7e-05,-3.6e-05,-0.000142,0.000201,-4.7e-05,-0.000185,0.000257,0.000244,0.000161
-0.000114,-0.00011,0.000144,0.000177,0.000164,-0.000237,0.000126,2.5e-05,4.3e-05,8.4e-05,0.00012,0.000131,7.2e-05,0.000175,0.000228,0.000111,9e-05,6.7e-05,0.000158,-2.3e-05,-0.000105,8.9e-05,0.000278,0.00018,4.4e-05,2.3e-05,2.6e-05,7.4e-05,0.000175,0.000137,-9.8e-05,4.7e-05,2e-06,3e-05,0.000231,2.1e-05,6.7e-05,-0.000106,-4.8e-05,-3.9e-05,-2e-06,1.8e-05,-3.1e-05,0.000115,-1e-06,1.1e-05,-0.000184,-0.000188,-6.1e-05,5.1e-05,-2.9e-05,-7.5e-05,-2.9e-05,5.7e-05,-0.000102,0.000306,-7e-06,0.000115,8.7e-05,-1.7e-05,-8.9e-05,6.9e-05,-2.2e-05,-7.3e-05,0.000166,1e-04,1.8e-05,-5.6e-05,0.000139,0.000131,0.00011,4.2e-05,5e-06,-0.000315,-1.4e-05,-5.1e-05,0.000131,2.1e-05,-0.000188,-5.2e-05,-4.3e-05,0.000197,7.9e-05,1e-05,0.000291,0.00014,0.00014,-0.000144,-1.8e-05,-6e-06,0.000146,-2.3e-05,-1.3e-05,-0.000101,0.000167,3.9e-05,-3.1e-05,-0.000113,6.9e-05,-0.000272,4.1e-05,0.00021,0.000113,-0.000181,-0.000144,0.000292,4.1e-05,0.000186,-0.000107,6.8e-05,2.6e-05,4.1e-05,8.5e-05,0.000173,0.000149,1.2e-05,2.3e-05,4.4e-05,0.000161,3.3e-05,6.6e-05
-0.000107,-6.4e-05,6.1e-05,0.000118,4.4e-05,0.000136,-6e-05,2e-05,2e-06,-0.000138,7.7e-05,-1e-06,4.9e-05,-5.4e-05,9.8e-05,3e-05,9.9e-05,6.9e-05,5.2e-05,0.000109,0.000342,5.4e-05,2.3e-05,-5e-05,-2.2e-05,0.000128,-6.6e-05,7.9e-05,3.6e-05,-9.1e-05,0.000291,4.3e-05,7.8e-05,3.2e-05,0.000209,9.7e-05,3e-05,6.5e-05,0.000108,1e-06,0.000137,1e-05,2.5e-05,1.2e-05,-0.000129,-0.000103,2.1e-05,4.6e-05,-3.4e-05,4.2e-05,-8.6e-05,1.9e-05,0.000125,-7e-06,6.3e-05,4.9e-05,0.000125,9.6e-05,-8.3e-05,8.6e-05,0.000229,-3.2e-05,-0.000407,2.9e-05,-0.000118,6e-06,-8.2e-05,-1.4e-05,-6e-05,-9.7e-05,1.4e-05,-5.9e-05,6.2e-05,-7e-06,-8.2e-05,6.5e-05,0.000204,9.4e-05,-4e-05,0.000113,0.000123,9.3e-05,5.8e-05,0.000122,-3e-05,-0.000111,4.5e-05,0.000172,-1.3e-05,6.7e-05,-9.6e-05,-5.1e-05,2.6e-05,5.2e-05,8.6e-05,-3.4e-05,-7e-05,0.000123,-7.4e-05,0.000272,0.000108,-4.7e-05,0.000125,-4.9e-05,-9.6e-05,-1.6e-05,-6e-06,-4e-06,6.5e-05,0.00018,0.000211,7.8e-05,9.7e-05,-8e-05,-6.4e-05,-0.000141,-0.000138,0.000228,-7.4e-05,0.000156,-2.4e-05
5.7e-05,-4.5e-05,-4.6e-05,7.2e-05,-6e-06,-9.3e-05,-6.8e-05,3.3e-05,9.7e-05,-5.4e-05,-6.1e-05,9.3e-05,0.000103,6.8e-05,2.8e-05,-0.000107,-6.3e-05,1.6e-05,0.000137,0.000177,6.9e-05,2.2e-05,6.7e-05,1e-06,-5.2e-05,-0.000115,-3.7e-05,0.00011,2.6e-05,8.2e-05,-0.000146,-6.4e-05,1.5e-05,5.5e-05,-8.4e-05,0.000134,-1e-06,2e-05,0,5.9e-05,-1.6e-05,-2.8e-05,0.000166,-3.9e-05,0.000171,8e-06,0.000108,-1.7e-05,-1.8e-05,1.4e-05,3e-05,0.000276,1.2e-05,0.000222,-3e-05,-2e-05,2.2e-05,1e-05,-7.1e-05,3.4e-05,4.8e-05,-3.7e-05,0.000206,1.9e-05,3e-05,0.000133,0.00022,-9.5e-05,-1e-05,6.3e-05,0.000105,-0.000129,0,1e-04,-3.7e-05,-4.9e-05,-8.2e-05,-4.9e-05,-7.5e-05,2.3e-05,-2.5e-05,-0.000103,1.2e-05,0.000188,2.8e-05,-4.1e-05,-8.7e-05,0.000229,5.4e-05,-4e-05,4.4e-05,-3.3e-05,4.8e-05,-8.4e-05,-6.9e-05,6.1e-05,1.9e-05,-0.000135,-1e-06,-6.2e-05,-5.7e-05,0.000123,-0.000114,0.00014,6e-05,4.9e-05,6.4e-05,5e-06,4e-05,-5.1e-05,-4.9e-05,-4.3e-05,-8e-05,9.5e-05,4.9e-05,-4.2e-05,-4.3e-05,-0.000112,-6e-06,-0.000163,5.1e-05
-2.8e-05,6.6e-05,-9.1e-05,3e-06,-3.3e-05,-6.6e-05,7e-05,-6.2e-05,-4.9e-05,9e-05,-1.8e-05,-9.7e-05,4e-06,-3.6e-05,-9.1e-05,-4.2e-05,2e-06,-9.3e-05,-0.000209,5e-06,8.9e-05,-5e-05,-0.000116,-2.5e-05,2.7e-05,-3e-06,0.000124,-1e-06,-7.4e-05,1.4e-05,2.1e-05,-2.2e-05,-2.1e-05,1.1e-05,-7.8e-05,4.7e-05,-4.2e-05,6.6e-05,0.000219,-8.7e-05,0,7.4e-05,8.4e-05,2.5e-05,-6.9e-05,2.8e-05,-3.5e-05,6.7e-05,-5e-06,-8.3e-05,0.000112,-7.7e-05,-9e-06,-0.000108,5.8e-05,-2.9e-05,-9.2e-05,1.8e-05,3.3e-05,-6.1e-05,-0.00015,-2.2e-05,-5e-05,-8.8e-05,1.8e-05,-6.1e-05,-7.3e-05,1.3e-05,1e-06,-2.6e-05,-1.8e-05,6.1e-05,-2.5e-05,9.1e-05,-2.9e-05,7.2e-05,-9.4e-05,3e-06,9.3e-05,-2.3e-05,1.3e-05,8.1e-05,2.6e-05,-0.000114,-3.4e-05,-3.9e-05,9.4e-05,-1.2e-05,4.2e-05,-5.3e-05,-4e-06,1.3e-05,2.2e-05,1.9e-05,3.5e-05,-9e-06,1.3e-05,5.6e-05,4e-05,-8.3e-05,6.6e-05,-4e-06,8.1e-05,-2.1e-05,4e-06,-0.00011,-5e-05,-5.7e-05,-2.8e-05,1e-06,-0.000104,1.5e-05,9.1e-05,-5e-06,9e-06,-0.000238,-2.6e-05,-7.1e-05,-6.5e-05,8e-06,-3.2e-05
5e-06,0,-1.6e-05,-5.9e-05,3e-05,-9.4e-05,6.1e-05,-1.5e-05,2e-05,7e-06,3.6e-05,-2.4e-05,-4.2e-05,7.2e-05,7.6e-05,6.6e-05,1.2e-05,2e-06,-1.2e-05,-5.6e-05,-7.6e-05,-7e-06,-2.4e-05,-8e-06,3.5e-05,9.7e-05,-4.1e-05,-5.4e-05,-1e-05,6e-06,8.7e-05,-1.2e-05,-8.1e-05,-5.4e-05,-1.3e-05,-3.1e-05,-8e-06,-2.7e-05,-6.6e-05,5.8e-05,3.5e-05,-2.2e-05,-7.3e-05,0,3.8e-05,6.8e-05,8.2e-05,-1.9e-05,-1e-06,4.8e-05,-5.9e-05,7.8e-05,8e-06,7.2e-05,-3.2e-05,1e-06,8.2e-05,-3.1e-05,1.6e-05,4.6e-05,-3.7e-05,3e-05,9e-06,2.5e-05,4e-06,4.8e-05,-8e-06,-2.4e-05,-1.6e-05,-3.2e-05,-7.2e-05,-2.9e-05,-8e-06,-8.6e-05,-2.5e-05,-8.2e-05,3.6e-05,5.3e-05,3.3e-05,-5.7e-05,0.000142,-6e-06,-8.4e-05,4e-06,-1.3e-05,1e-05,-9.2e-05,-6e-05,-1.5e-05,5.2e-05,-1.7e-05,3.6e-05,-6.6e-05,-2.7e-05,-2.8e-05,7e-06,1.9e-05,-5.1e-05,2.5e-05,2.8e-05,-8e-06,4.1e-05,-2.1e-05,-4e-05,6.6e-05,8.1e-05,4e-06,3e-06,4.1e-05,-1.8e-05,3.1e-05,-2.4e-05,4e-05,-2.1e-05,-1.5e-05,-3.4e-05,-8e-06,4.2e-05,-4.8e-05,1e-06,1.7e-05
-6e-06,-4.2e-05,-1e-06,-4.5e-05,1.3e-05,2.5e-05,-6.6e-05,-1.8e-05,1.4e-05,1.3e-05,-4e-06,-5e-06,-2e-05,-7.8e-05,1.2e-05,2.8e-05,2.2e-05,2.4e-05,-2.8e-05,-5.9e-05,5.3e-05,2.6e-05,0.000125,7e-06,-5.1e-05,-1.6e-05,-1.6e-05,-2.9e-05,2.3e-05,4e-05,-2.6e-05,6.2e-05,1.4e-05,-2e-05,8.8e-05,-1.7e-05,-1.7e-05,-4.8e-05,-7.8e-05,-1.8e-05,2.1e-05,4.8e-05,-8e-05,-1.7e-05,-1.7e-05,4.3e-05,-2.3e-05,2.4e-05,1.5e-05,-1.2e-05,7e-06,0.000108,-1.7e-05,-4.8e-05,5e-06,0,-1e-06,4.8e-05,1.8e-05,-7e-05,6e-06,-1.8e-05,-5.1e-05,4.8e-05,3.5e-05,-2.1e-05,-4.5e-05,7.1e-05,-2e-06,5e-05,-1.1e-05,-4e-06,1.2e-05,-1.4e-05,3.6e-05,1.4e-05,-1e-06,-0.000103,6.1e-05,-4.3e-05,1.3e-05,-2.4e-05,-2.1e-05,-9e-06,3.1e-05,1.4e-05,4.7e-05,1.9e-05,4e-06,2.6e-05,-4e-06,-8e-06,-6e-06,1.5e-05,4.1e-05,3.2e-05,-2e-06,-3e-06,-5e-06,-1.9e-05,-2.3e-05,-2.3e-05,-2.8e-05,1.8e-05,3.2e-05,-1.7e-05,1.5e-05,2.5e-05,-5.9e-05,7.6e-05,-2.8e-05,1.7e-05,1e-05,5e-06,2.4e-05,-1.7e-05,3e-05,2e-06,4.7e-05,1.4e-05,-2.4e-05
-2.7e-05,1.8e-05,-1e-06,3e-06,-1e-05,1.5e-05,-3.5e-05,5.7e-05,-1.5e-05,4e-05,-2e-06,1.8e-05,-1.5e-05,3.4e-05,-8e-06,7.5e-05,0,1e-05,1.8e-05,3e-06,-2.4e-05,-3.1e-05,3.4e-05,-1e-05,1.5e-05,4.5e-05,3e-06,-3e-05,-9e-06,6e-06,1.8e-05,-5e-06,5e-06,-1.5e-05,-3.3e-05,-1.3e-05,-1.2e-05,-4.8e-05,-3.4e-05,6e-06,-7e-06,1e-06,-2e-06,-1.3e-05,-1.4e-05,-8e-06,0,-1e-06,2.9e-05,8e-06,-5e-06,-9.9e-05,-1e-05,-6e-06,-2.6e-05,-5.7e-05,-3.5e-05,-6.9e-05,-1.9e-05,8.1e-05,3.3e-05,1.4e-05,3.1e-05,-1.6e-05,-3.5e-05,-8e-06,4.3e-05,2e-06,3.4e-05,-4e-06,-1.5e-05,2.2e-05,1.3e-05,4e-05,1.1e-05,1.1e-05,-3.1e-05,4.8e-05,-1.8e-05,4.3e-05,-4e-05,3.3e-05,-7e-06,-5.3e-05,3.7e-05,2.6e-05,-2.3e-05,7.2e-05,1.5e-05,-4.2e-05,5e-06,1.4e-05,-1.7e-05,-2.1e-05,3e-06,-4.2e-05,-2.9e-05,-2.4e-05,-5.4e-05,2.5e-05,2e-05,-2.8e-05,-3e-06,-3e-06,3.5e-05,-1.5e-05,-2e-06,3e-06,2.7e-05,2e-05,5e-05,-1.1e-05,-3.1e-05,6e-06,-9e-06,7.4e-05,-9e-06,3.3e-05,0.000103,1e-06,3.7e-05
0,1e-06,3.5e-05,1.3e-05,1.2e-05,-5e-05,3.8e-05,7e-06,1.1e-05,-1.3e-05,1.7e-05,-1e-06,4e-06,-2.9e-05,-2.7e-05,-2.1e-05,3e-06,1e-05,6e-06,3.9e-05,-5.4e-05,2e-06,-8.5e-05,7e-06,4e-06,-4.9e-05,-3e-06,-1.2e-05,-9e-06,-1.7e-05,-2.5e-05,1.1e-05,-1.2e-05,-1e-05,-6e-06,-2.7e-05,-1.1e-05,1.4e-05,-1.5e-05,2.2e-05,4e-06,-2.1e-05,-1.2e-05,1.6e-05,-2e-05,1.2e-05,4e-06,-1.1e-05,-6e-06,-1e-06,-5e-06,0,-1.5e-05,-1e-05,-3e-06,8.6e-05,3.2e-05,5.5e-05,-7e-06,-3.1e-05,4.5e-05,-3.1e-05,-6.8e-05,-3e-05,1.5e-05,-7e-06,-8e-06,5e-06,6e-06,1.1e-05,-3e-06,-4e-05,1.3e-05,3.5e-05,-9e-06,-8e-06,1.4e-05,-4e-06,-2.9e-05,3.3e-05,2.3e-05,-1.7e-05,-1e-05,-2e-05,-3.5e-05,1.8e-05,1.9e-05,-1.7e-05,-4e-06,5.2e-05,4e-06,9e-06,-1.4e-05,-3e-06,-5.5e-05,1.3e-05,2.2e-05,1.9e-05,3.1e-05,3e-05,3.7e-05,2.1e-05,-2.5e-05,-3.6e-05,-9e-06,7e-06,-6e-06,-4e-05,-2.2e-05,1.4e-05,1e-06,9e-06,-1e-05,1.8e-05,8e-06,4.7e-05,2.4e-05,-4e-05,7e-06,-1.5e-05,-1.5e-05
1.1e-05,1.3e-05,3.7e-05,5.4e-05,-5e-06,1.6e-05,-2e-05,-8e-06,-3.5e-05,-2e-05,-1e-05,-1.4e-05,-8e-06,1.1e-05,-7e-06,4e-06,2e-06,-3.4e-05,1.4e-05,4.4e-05,-1.6e-05,-1e-06,-1e-05,-7e-06,-1.4e-05,1e-05,-1e-06,9e-06,-2e-05,3.1e-05,6.2e-05,-1.5e-05,4e-06,1.5e-05,1e-06,-1.6e-05,-9e-06,3.7e-05,-9e-06,-2.6e-05,-1.3e-05,1.6e-05,1.4e-05,-7e-06,3.3e-05,-2.5e-05,-9e-06,1.9e-05,-1e-05,-1.1e-05,7e-06,-4.7e-05,1.7e-05,1e-06,1.9e-05,-2.4e-05,-8e-06,-1.8e-05,1e-06,2.6e-05,3.1e-05,3.2e-05,4.6e-05,1.4e-05,7e-06,-2.4e-05,-2.2e-05,-4.7e-05,-2.9e-05,-4e-06,4.1e-05,4.5e-05,-2.5e-05,7.1e-05,6e-06,7e-06,4.3e-05,3.7e-05,-3.8e-05,2.6e-05,9e-06,1.1e-05,-1.4e-05,1.4e-05,-8e-06,-3.4e-05,-3e-06,-3.4e-05,-4e-06,-2.8e-05,9e-06,-1.6e-05,-2e-06,4e-06,-2e-06,-1.7e-05,-2.1e-05,-1.7e-05,0,-3.9e-05,-4.2e-05,-1.7e-05,2e-05,4.3e-05,3.2e-05,-1.9e-05,1.9e-05,6.2e-05,1.1e-05,-3.6e-05,-1.2e-05,-5e-06,-1e-06,-1.1e-05,-4e-06,-5.3e-05,-2e-05,3e-05,-4e-05,3e-06,-1.4e-05
9e-06,-2e-06,-4e-06,-1.6e-05,1e-05,0,-3.5e-05,-1.9e-05,1.7e-05,1.1e-05,-1.4e-05,-1.1e-05,1.4e-05,-1.5e-05,1.8e-05,-1.3e-05,9e-06,-2e-06,9e-06,-9e-06,1.7e-05,1.8e-05,6.9e-05,-1e-06,3e-06,-2.9e-05,1e-05,3.6e-05,5e-06,-1.2e-05,-2e-06,-2.8e-05,-1.3e-05,2e-05,-1e-05,2.7e-05,-1.1e-05,1.3e-05,9e-06,2.1e-05,1.3e-05,9e-06,0,4e-06,3e-06,-1.3e-05,-6e-06,-1.8e-05,-1.4e-05,2e-06,1.7e-05,-2e-05,8e-06,1.6e-05,2e-06,-3.5e-05,-2.5e-05,4e-06,1e-06,-1.7e-05,-2.8e-05,-5e-06,1.1e-05,1.4e-05,-1.9e-05,-9e-06,3e-06,-6e-06,-1e-06,-1.2e-05,1.7e-05,-2.5e-05,0,-5.7e-05,-1.3e-05,-9e-06,7e-06,-1.6e-05,3e-06,-1.8e-05,-5.8e-05,1.1e-05,-1.2e-05,5.1e-05,-1.7e-05,1.8e-05,-2e-06,0,8e-06,7e-06,-1e-06,-3e-06,1.5e-05,-1e-06,8e-06,-3e-06,1.1e-05,-1e-06,-7e-06,2.5e-05,2.2e-05,4.5e-05,4e-06,-3e-06,-3.9e-05,2.4e-05,-1.3e-05,-3.2e-05,1e-05,2.8e-05,4.4e-05,-9e-06,-2.6e-05,-1.5e-05,-1e-06,-2.6e-05,9e-06,-2.4e-05,-2.2e-05,-7e-06,2.3e-05
-7e-06,-2.1e-05,-3.1e-05,-1.3e-05,1.1e-05,3.7e-05,4e-06,-1e-06,-1.5e-05,8e-06,6e-06,-1.4e-05,5e-06,4.4e-05,2.8e-05,-2.4e-05,-5e-06,5e-06,-1.1e-05,-2.8e-05,2.1e-05,-1.3e-05,2.2e-05,2e-06,5e-06,2.6e-05,5e-06,3.1e-05,2.5e-05,6e-06,-2.8e-05,-1e-05,-1.2e-05,1.8e-05,2e-06,2.9e-05,-2.1e-05,-2.7e-05,2.6e-05,-1.4e-05,2.1e-05,2e-06,9e-06,3e-06,7e-06,-1.3e-05,3e-06,1e-05,-4e-06,2.9e-05,-2.1e-05,1.7e-05,1e-06,6e-06,8e-06,4.4e-05,2.2e-05,-1e-06,-8e-06,-9e-06,-1.4e-05,2e-06,-3.3e-05,-9e-06,1.3e-05,1.8e-05,1.3e-05,-7e-06,2.7e-05,1.9e-05,-1.6e-05,1.5e-05,6e-06,-3.3e-05,2e-06,-7e-06,-3.1e-05,-1.9e-05,2e-06,-2.6e-05,-1.6e-05,-9e-06,-1e-05,1e-06,2.1e-05,-2.4e-05,1e-06,8e-06,1e-06,-1e-05,-8e-06,1e-05,-1.1e-05,-7e-06,1.5e-05,-4e-06,-1.9e-05,0,1.5e-05,-4.1e-05,1.6e-05,-1.6e-05,8e-06,-1.6e-05,-1.7e-05,1.3e-05,-1e-06,-3.1e-05,0,1.1e-05,-2.1e-05,1e-06,3.4e-05,1e-05,-6e-06,-2e-05,-8e-06,-1.5e-05,-8e-06,1.3e-05,-2.2e-05
1.3e-05,2e-05,-1.8e-05,-3e-06,-2.2e-05,-1.5e-05,3e-06,1.6e-05,-1e-06,1.1e-05,8e-06,9e-06,3e-06,-3.8e-05,-1e-06,2.4e-05,-6e-06,1e-05,-2.1e-05,-1.4e-05,-2.5e-05,-4e-06,-1.5e-05,-6e-06,0,-3.3e-05,-1.5e-05,5e-06,-1e-06,1.2e-05,3.1e-05,-1e-05,2e-06,-2e-06,2.1e-05,1.7e-05,-1.3e-05,-1.1e-05,2.4e-05,1e-06,-9e-06,-1.5e-05,5.6e-05,-5e-06,-2.6e-05,-2.2e-05,-5e-06,-2e-06,-1e-06,-1.2e-05,3e-06,-3.6e-05,7e-06,-1.8e-05,-1.9e-05,-6e-06,0,1.1e-05,-5e-06,6e-06,-3.4e-05,-2e-06,7e-06,-1.3e-05,-2e-05,1.2e-05,-1.1e-05,2.4e-05,-2.9e-05,-5e-06,-2e-06,1e-06,1.2e-05,-5e-06,-1e-06,1.3e-05,7e-06,4.6e-05,4.5e-05,-1.1e-05,3e-05,9e-06,-1.5e-05,-6e-06,2.4e-05,-4e-06,-6e-06,-1e-05,-3e-06,1.6e-05,5e-06,6e-06,-1.7e-05,1.2e-05,1.2e-05,9e-06,2.1e-05,-6e-06,-1.1e-05,1.9e-05,-1.9e-05,3.8e-05,-1e-05,7e-06,-1e-05,2e-06,1.2e-05,4.1e-05,-6e-06,2.4e-05,-2.4e-05,-1.8e-05,-9e-06,1e-05,9e-06,0,7e-06,4.5e-05,-1.7e-05,-1.9e-05,1.7e-05
-1.4e-05,3e-06,-3e-06,4e-06,1.9e-05,2e-06,-6e-06,-4e-06,9e-06,0,-7e-06,-1e-06,1e-06,4.1e-05,-1.5e-05,5e-06,-4e-06,8e-06,-1.4e-05,1.2e-05,5.4e-05,5e-06,-2.6e-05,-1e-06,-1.4e-05,2.3e-05,1e-06,-1.2e-05,-1.2e-05,-5e-06,1.5e-05,1.8e-05,2e-06,-3e-06,8e-06,6e-06,-1.1e-05,-1.5e-05,6e-06,5e-06,2e-06,1.3e-05,-8e-06,4e-06,1.2e-05,1.7e-05,-4e-06,1e-06,1e-05,-7e-06,1.1e-05,5.8e-05,-1e-06,-2e-06,-2e-06,-1.8e-05,-1.8e-05,-5e-06,3e-06,9e-06,-3.2e-05,-1e-05,3e-05,1e-05,1e-05,-2e-06,-1.5e-05,7e-06,1.3e-05,1e-06,-1.3e-05,-8e-06,-3e-06,8e-06,7e-06,-1e-05,7e-06,-3.7e-05,6e-06,1.1e-05,7e-06,2e-06,1.2e-05,3.2e-05,-7e-06,7e-06,9e-06,0,3e-06,-1.6e-05,-1.1e-05,-1.7e-05,7e-06,-8e-06,-1.7e-05,7e-06,-5e-06,-1e-06,-1e-06,-1e-06,5e-06,-1.3e-05,2.6e-05,-2e-06,-5e-06,-4.6e-05,-6e-06,-3.1e-05,0,-2.4e-05,-2e-06,9e-06,1e-06,4e-06,-1e-05,3.6e-05,1e-06,-1e-05,1.1e-05,0,-1.2e-05
4e-06,-8e-06,0,3e-06,-1.4e-05,3.6e-05,2e-06,-1e-05,-9e-06,4e-06,-9e-06,-6e-06,-6e-06,-2.5e-05,-9e-06,2.4e-05,4e-06,-2.4e-05,-5e-06,2.6e-05,5e-06,-3e-06,-2.8e-05,-2e-06,1.1e-05,-2.4e-05,0,-1.6e-05,-1.1e-05,5e-06,-2.1e-05,0,-1.1e-05,-9e-06,-3.5e-05,0,-7e-06,8e-06,-1.5e-05,-5e-06,-2e-06,-1.8e-05,-3.7e-05,-4e-06,-1.5e-05,-6e-06,1.6e-05,2e-06,1.2e-05,-2e-06,-9e-06,1.2e-05,2e-06,2.5e-05,-4e-06,3e-06,8e-06,-9e-06,6e-06,8e-06,1e-06,1.5e-05,-2.6e-05,1.1e-05,4e-06,7e-06,2.2e-05,6e-06,5e-06,0,-2.8e-05,1.3e-05,-5e-06,-1e-06,5e-06,6e-06,-1.8e-05,1.7e-05,-8e-06,1.2e-05,-1.6e-05,-3e-06,0,-2.3e-05,-2e-05,1e-06,-1.1e-05,3.2e-05,7e-06,1.4e-05,1e-05,1.1e-05,1e-06,6e-06,-4e-06,-3e-06,-5e-06,2e-06,-3e-06,1.5e-05,1.2e-05,1.1e-05,-3.9e-05,-2e-06,-8e-06,4.3e-05,-3e-06,3e-05,-8e-06,0,1.8e-05,-7e-06,1e-05,-7e-06,3e-06,4.5e-05,-1e-06,-2.3e-05,3e-05,7e-06,5e-06
1e-05,0,1e-05,2e-06,5e-06,-5e-06,1.2e-05,-1.2e-05,1.7e-05,-3e-06,8e-06,-1.2e-05,0,1.4e-05,1.4e-05,1e-06,2e-06,-3e-06,-3e-06,1e-06,-2e-06,-6e-06,3.1e-05,2e-06,2e-06,2.5e-05,7e-06,-9e-06,3e-06,-5e-06,0,5e-06,-1e-06,-1.6e-05,0,-6e-06,-8e-06,2e-05,-3e-06,8e-06,1e-06,1.5e-05,-7e-06,0,1.5e-05,1.4e-05,3e-06,-3e-06,-3e-06,-3e-06,0,-6e-06,-6e-06,-2.3e-05,1.1e-05,7e-06,-2e-06,1.4e-05,-5e-06,-1.7e-05,5e-06,-4e-06,-1.2e-05,-1.3e-05,-4e-06,-1.5e-05,-2e-06,-1.4e-05,-1.5e-05,-6e-06,-5e-06,-3e-06,-3e-06,-1.2e-05,-3e-06,-4e-06,-2e-06,-1.2e-05,-2.3e-05,9e-06,2.9e-05,1e-06,-2e-06,-2.5e-05,3e-06,2e-06,1.4e-05,7e-06,-2e-06,-2e-06,-6e-06,2e-06,0,-1e-06,1.6e-05,9e-06,-4e-06,-3e-06,0,-9e-06,-7e-06,-9e-06,2e-05,7e-06,9e-06,-2.3e-05,1e-05,-3.3e-05,9e-06,-2e-06,-1.7e-05,-2e-06,1.7e-05,-1.2e-05,-3e-06,3.2e-05,4e-06,0,1.8e-05,-1e-06,1e-06
-7e-06,-3e-06,1.5e-05,-1.3e-05,6e-06,4e-06,3e-06,-5e-06,-1.5e-05,-5e-06,-2e-06,-2e-06,-5e-06,-1.7e-05,1.4e-05,-1e-06,1e-06,9e-06,2e-06,-1e-05,-2.3e-05,0,3.4e-05,2e-06,-7e-06,9e-06,-6e-06,-1.6e-05,1.1e-05,3e-06,1.9e-05,-9e-06,-3e-06,-2e-06,2.1e-05,-1.6e-05,-4e-06,8e-06,-1.4e-05,-4e-06,5e-06,-7e-06,3e-06,0,5e-06,1.5e-05,5e-06,3e-06,-3e-06,1.2e-05,2e-06,2.7e-05,-4e-06,2.1e-05,3e-06,1e-06,-9e-06,-1.4e-05,-8e-06,4e-06,2e-06,1e-06,3.2e-05,-6e-06,9e-06,1.3e-05,-1e-05,-8e-06,8e-06,5e-06,4e-06,-4e-06,9e-06,-7e-06,1e-06,0,1.9e-05,9e-06,-9e-06,-5e-06,1.5e-05,1e-06,3e-06,-5e-06,3e-06,-6e-06,-1.2e-05,-2e-05,-1e-06,-1.1e-05,3e-06,-9e-06,1e-06,0,-3e-06,-9e-06,-5e-06,-3e-06,1.4e-05,-4e-06,-2e-06,2e-06,-7e-06,0,7e-06,1.8e-05,-6e-06,3.5e-05,-5e-06,1.8e-05,1.2e-05,1e-06,-9e-06,1.1e-05,-6e-06,3e-06,-7e-06,1.6e-05,-1.5e-05,3e-06,-7e-06
6e-06,9e-06,5e-06,3e-06,-1.1e-05,-9e-06,-1e-06,1e-05,8e-06,8e-06,-4e-06,-2e-06,0,1.1e-05,-9e-06,-1e-05,-5e-06,4e-06,5e-06,-1.6e-05,1e-06,2e-06,-2.2e-05,-2e-06,4e-06,-1.6e-05,6e-06,2e-06,0,2e-06,-1e-06,-8e-06,-2e-06,4e-06,7e-06,-1e-05,0,-1.6e-05,-8e-06,3e-06,2e-06,2e-06,-1.2e-05,0,-1e-06,-4e-06,2e-06,-2e-06,-6e-06,-2e-06,1e-06,-2.6e-05,0,-2.5e-05,1e-06,-1.9e-05,8e-06,5e-06,3e-06,-8e-06,-4e-06,-3e-06,-2.2e-05,1.2e-05,-9e-06,-1e-05,-6e-06,-7e-06,2e-06,-1e-06,-2e-06,5e-06,-2e-06,-2e-05,-5e-06,2e-06,4e-06,1e-05,0,-3e-06,-1.1e-05,1e-06,1e-06,3e-06,1.9e-05,2e-06,7e-06,-1.3e-05,4e-06,1.5e-05,2e-06,-4e-06,7e-06,0,-1e-06,5e-06,1e-05,5e-06,-1.2e-05,2e-06,9e-06,5e-06,-6e-06,-4e-06,9e-06,-1.5e-05,-3e-06,-1.9e-05,8e-06,-5e-06,8e-06,-7e-06,-2.4e-05,5e-06,7e-06,-3e-05,4e-06,6e-06,-2.2e-05,-6e-06,1.1e-05
-2e-06,-2e-06,-7e-06,0,1.1e-05,1.2e-05,1.2e-05,3e-06,-3e-06,2e-06,4e-06,3e-06,1e-06,-1.4e-05,-1.6e-05,-6e-06,0,2e-06,-4e-06,4e-06,1e-06,-1e-06,-2.8e-05,0,0,1e-05,-6e-06,1.3e-05,-6e-06,-1e-06,-1.3e-05,-7e-06,-3e-06,6e-06,-1.9e-05,6e-06,-2e-06,-1.6e-05,-1e-06,-2e-06,-4e-06,-1e-05,-4e-06,1e-06,-7e-06,1.6e-05,-5e-06,2e-06,-5e-06,-8e-06,-4e-06,1e-06,2e-06,2.9e-05,-8e-06,2.2e-05,-6e-06,0,0,1.3e-05,-9e-06,-2e-06,9e-06,2e-06,4e-06,1e-06,1.6e-05,7e-06,1e-06,0,1.3e-05,-9e-06,2e-06,2.7e-05,1e-06,-2e-06,-9e-06,-1.6e-05,1.7e-05,-8e-06,-1.3e-05,-5e-06,3e-06,1.1e-05,-7e-06,-6e-06,-2e-06,1.9e-05,-1e-06,-1.5e-05,-5e-06,1.3e-05,-3e-06,1e-06,-1e-05,-9e-06,-8e-06,-3e-06,1e-06,-3e-06,-9e-06,-2e-06,9e-06,-4e-06,1.3e-05,9e-06,7e-06,0,-5e-06,-3e-06,-1e-06,6e-06,1.7e-05,-3e-06,-1.1e-05,-2.7e-05,-5e-06,-1.7e-05,-8e-06,1e-06,-1.2e-05
-7e-06,-5e-06,-1e-05,9e-06,-3e-06,-7e-06,3e-06,-3e-06,-4e-06,-5e-06,-3e-06,-3e-06,3e-06,1.2e-05,5e-06,4e-06,1e-06,-1.1e-05,-6e-06,1e-05,-1.5e-05,-4e-06,8e-06,0,0,0,2e-06,1.5e-05,-6e-06,0,4e-06,-1e-06,1e-06,1e-05,0,5e-06,-1e-06,-2e-06,5e-06,1e-06,-1e-06,1.4e-05,1.5e-05,1e-06,-1e-06,-9e-06,-8e-06,-2e-06,-1e-06,-1e-06,3e-06,-1.6e-05,3e-06,-3.2e-05,-2e-06,3e-06,-6e-06,2e-06,0,-5e-06,-1.9e-05,7e-06,-2e-06,-1.2e-05,3e-06,-7e-06,-4e-06,6e-06,-9e-06,-1e-06,6e-06,6e-06,-5e-06,1.8e-05,-1e-06,4e-06,3e-06,1.9e-05,1.3e-05,2e-06,1.5e-05,6e-06,3e-06,-5e-06,-1.6e-05,-5e-06,-2e-06,9e-06,-2e-06,1.2e-05,3e-06,0,-3e-06,-2e-06,-5e-06,0,7e-06,0,3e-06,-3e-06,3e-06,1.2e-05,-5e-06,8e-06,-2e-06,-1.7e-05,-4e-06,-5e-06,1e-06,-1.2e-05,-7e-06,-7e-06,-3e-06,-6e-06,6e-06,-1.1e-05,3e-06,4e-06,-2e-06,-1e-06,7e-06
6e-06,2e-06,-5e-06,3e-06,-7e-06,-1.1e-05,-7e-06,1e-06,7e-06,7e-06,-2e-06,-7e-06,0,-2e-06,1.5e-05,4e-06,1e-06,-1e-06,-6e-06,8e-06,8e-06,1e-06,2.2e-05,1e-06,-1e-06,-1.3e-05,-3e-06,5e-06,2e-06,-1e-06,1e-05,9e-06,-8e-06,4e-06,9e-06,7e-06,0,1.4e-05,1.2e-05,-1e-06,2e-06,-8e-06,1.3e-05,-1e-06,-1e-06,-8e-06,5e-06,0,6e-06,6e-06,-2e-06,-1.4e-05,2e-06,2.8e-05,0,-2.1e-05,6e-06,-4e-06,1e-06,4e-06,-1.7e-05,-5e-06,4e-06,1e-06,-7e-06,0,-5e-06,5e-06,7e-06,-1e-06,-1.2e-05,-2e-06,0,1e-05,3e-06,-4e-06,3e-06,-2.1e-05,-1e-06,2e-06,-1.2e-05,-1e-06,5e-06,1.9e-05,5e-06,7e-06,4e-06,-1.7e-05,2e-06,-7e-06,-2e-06,-9e-06,1e-06,0,1.5e-05,1e-06,-1e-05,0,-6e-06,8e-06,3e-06,-6e-06,9e-06,-6e-06,-2e-06,2.9e-05,-3e-06,1.6e-05,-2e-06,8e-06,-6e-06,4e-06,-6e-06,-1e-06,-5e-06,6e-06,-1e-06,3e-06,7e-06,3e-06,-3e-06
-3e-06,0,0,-7e-06,1.1e-05,0,3e-06,1e-06,-1.3e-05,0,1e-06,-4e-06,0,-3e-06,3e-06,9e-06,0,4e-06,-7e-06,-2e-06,3e-06,1e-06,4e-06,0,3e-06,1.4e-05,7e-06,3e-06,6e-06,-2e-06,-1.1e-05,3e-06,2e-06,3e-06,-4e-06,8e-06,2e-06,8e-06,6e-06,0,-1e-06,2e-06,9e-06,0,8e-06,-1e-06,-7e-06,2e-06,6e-06,1e-06,0,1.6e-05,3e-06,-2.2e-05,6e-06,1.3e-05,-4e-06,3e-06,-3e-06,-9e-06,-7e-06,2e-06,-1.6e-05,1e-05,8e-06,4e-06,-2e-06,-4e-06,1e-06,4e-06,-4e-06,-2e-06,1e-06,-1e-06,1e-06,2e-06,-8e-06,1.8e-05,-8e-06,3e-06,-9e-06,-5e-06,0,8e-06,9e-06,-8e-06,-5e-06,-8e-06,2e-06,8e-06,2e-06,6e-06,3e-06,0,0,-1e-06,8e-06,-2e-06,6e-06,-5e-06,-3e-06,1.2e-05,-4e-06,5e-06,-3e-06,-1.7e-05,6e-06,-1.9e-05,0,0,3e-06,-5e-06,-1e-06,6e-06,1e-06,1.6e-05,1e-06,-2e-06,1e-05,0,1e-06
0,3e-06,2e-06,-6e-06,-1e-05,-3e-06,4e-06,8e-06,1e-05,-6e-06,3e-06,1e-06,1e-06,9e-06,-9e-06,1e-06,-2e-06,1e-06,-2e-06,-1e-05,1.3e-05,-3e-06,-1.4e-05,0,-1e-06,-1.3e-05,-7e-06,-6e-06,-3e-06,2e-06,-8e-06,5e-06,-4e-06,-9e-06,1e-06,4e-06,1e-06,0,0,2e-06,1e-06,0,-1e-05,2e-06,-3e-06,-1.5e-05,4e-06,-2e-06,-1e-06,0,1e-06,-1.1e-05,-1e-06,1.9e-05,0,3e-06,-4e-06,-1e-06,-1e-06,7e-06,2e-06,1e-06,1.9e-05,-4e-06,-7e-06,3e-06,9e-06,-5e-06,-3e-06,0,-3e-06,2e-06,2e-06,-1.4e-05,-1e-06,0,-5e-06,-7e-06,-1.3e-05,0,-1e-06,7e-06,2e-06,-1.3e-05,2e-06,4e-06,5e-06,9e-06,-2e-06,-1.1e-05,-1e-06,4e-06,-1e-06,-2e-06,-4e-06,4e-06,-8e-06,-2e-06,-2e-06,6e-06,0,-8e-06,0,-2e-06,-5e-06,-4e-06,-2e-06,9e-06,1e-06,2e-06,3e-06,1e-06,9e-06,1e-06,1e-06,1.5e-05,0,0,1.3e-05,-4e-06,2e-06
2e-06,-4e-06,6e-06,2e-06,6e-06,2e-06,-8e-06,1e-06,-5e-06,4e-06,-2e-06,-1e-06,-2e-06,-1e-05,-8e-06,-1e-06,0,3e-06,-3e-06,0,-1e-05,-1e-06,-1.8e-05,0,-3e-06,0,4e-06,-1.1e-05,-6e-06,-1e-06,1.1e-05,-2e-06,0,-5e-06,4e-06,-3e-06,0,-1e-05,-4e-06,-2e-06,-1e-06,-2e-06,-1.4e-05,-2e-06,3e-06,3e-06,1e-06,1e-06,-1e-06,-6e-06,0,1.6e-05,-3e-06,-1.2e-05,0,-6e-06,5e-06,-3e-06,2e-06,-6e-06,4e-06,0,-9e-06,-8e-06,1e-06,-1e-06,-3e-06,-5e-06,-3e-06,1e-06,-7e-06,-3e-06,-1e-06,4e-06,1e-06,-1e-06,8e-06,-7e-06,-5e-06,-2e-06,1.3e-05,-3e-06,3e-06,-5e-06,0,-1e-06,-5e-06,8e-06,0,1.1e-05,-1e-06,-5e-06,-1e-06,-1e-06,-3e-06,-1e-06,3e-06,3e-06,1e-06,-9e-06,3e-06,5e-06,-4e-06,-1e-06,-1e-05,6e-06,-3e-06,0,-1e-06,-1.1e-05,-5e-06,0,-1e-06,-3e-06,-3e-06,-3e-06,0,5e-06,0,6e-06,-4e-06
-3e-06,0,5e-06,2e-06,-1e-06,-1.2e-05,-3e-06,-3e-06,1e-06,-1e-06,-2e-06,-3e-06,1e-06,8e-06,5e-06,-5e-06,1e-06,-7e-06,3e-06,1e-06,8e-06,0,4e-06,0,4e-06,6e-06,-3e-06,-9e-06,-1e-06,-1e-06,-1e-06,-3e-06,-5e-06,-5e-06,-2e-06,-7e-06,2e-06,-1e-05,-4e-06,3e-06,0,1e-06,4e-06,0,-7e-06,-2e-06,-1e-06,-1e-06,-3e-06,0,-1e-06,6e-06,-1e-06,2e-06,-5e-06,-4e-06,-3e-06,3e-06,0,9e-06,4e-06,4e-06,-4e-06,5e-06,1e-06,-1e-06,-4e-06,2e-06,9e-06,0,4e-06,1e-06,0,3e-06,-3e-06,1e-06,3e-06,1.5e-05,5e-06,1e-06,-8e-06,-4e-06,0,-6e-06,-8e-06,-2e-06,4e-06,-8e-06,2e-06,-9e-06,2e-06,-4e-06,1e-06,1e-06,-3e-06,6e-06,-4e-06,-3e-06,-1e-06,2e-06,-2e-06,-5e-06,8e-06,0,1e-06,-2e-06,4e-06,1e-06,1e-06,1e-06,3e-06,-5e-06,-5e-06,-1e-06,3e-06,-1.9e-05,0,0,-1.4e-05,-4e-06,5e-06
1e-06,3e-06,-1e-06,5e-06,-5e-06,4e-06,3e-06,-4e-06,3e-06,1e-06,3e-06,-2e-06,-1e-06,-9e-06,8e-06,-4e-06,0,-2e-06,-4e-06,8e-06,-2e-06,0,2.6e-05,0,-1e-06,-2e-06,3e-06,-2e-06,4e-06,0,-1.2e-05,-4e-06,2e-06,-3e-06,-9e-06,-4e-06,0,1e-06,-5e-06,-2e-06,2e-06,1e-06,-3e-06,2e-06,-1e-06,2e-06,2e-06,1e-06,-3e-06,5e-06,0,-3e-06,0,5e-06,-1e-06,7e-06,-3e-06,0,-2e-06,-3e-06,5e-06,-4e-06,6e-06,6e-06,-4e-06,1e-06,1e-06,3e-06,-8e-06,-2e-06,6e-06,2e-06,-2e-06,7e-06,2e-06,-2e-06,-5e-06,-1.5e-05,1.2e-05,1e-06,2e-06,8e-06,1e-06,-1e-06,1e-06,-2e-06,-3e-06,-2e-06,-1e-06,2e-06,-1e-06,7e-06,1e-06,-2e-06,8e-06,-5e-06,2e-06,0,-3e-06,2e-06,0,3e-06,-1.1e-05,2e-06,-1e-06,1e-06,-1e-06,-3e-06,0,0,1e-05,4e-06,1.1e-05,1e-06,-2e-06,-2.2e-05,-1e-06,-1.1e-05,-1.3e-05,3e-06,-6e-06
1e-06,-1e-06,-4e-06,-3e-06,7e-06,-1e-06,-2e-06,-4e-06,-6e-06,0,0,-3e-06,0,9e-06,1e-06,0,0,3e-06,1e-06,-2e-06,-3e-06,-2e-06,4e-06,0,-1e-06,0,-3e-06,4e-06,2e-06,0,1e-06,-1e-06,-5e-06,4e-06,6e-06,-1e-06,-1e-06,1.1e-05,-1e-06,0,0,-2e-06,-1e-05,-2e-06,5e-06,1.2e-05,1e-06,-1e-06,0,2e-06,1e-06,9e-06,0,-8e-06,2e-06,4e-06,4e-06,0,0,-2e-06,0,3e-06,1e-06,-6e-06,6e-06,-2e-06,2e-06,3e-06,0,1e-06,0,-2e-06,3e-06,-2.3e-05,-1e-06,1e-06,2e-06,1.5e-05,5e-06,-1e-06,4e-06,-6e-06,-1e-06,-2e-06,4e-06,-3e-06,2e-06,9e-06,-1e-06,3e-06,0,-1e-06,-1e-06,0,0,2e-06,-1e-06,1e-06,4e-06,-1e-06,1e-06,-1e-06,5e-06,-3e-06,3e-06,2e-06,-3e-06,-4e-06,-1e-06,4e-06,-8e-06,-6e-06,-7e-06,1e-06,1e-06,-1.2e-05,1e-06,7e-06,2e-06,-3e-06,4e-06
-2e-06,1e-06,-2e-06,-3e-06,-5e-06,2e-06,-5e-06,2e-06,8e-06,0,0,-2e-06,0,-1.3e-05,-7e-06,2e-06,-1e-06,1e-06,-7e-06,-3e-06,-6e-06,-1e-06,-2.4e-05,0,1e-06,5e-06,4e-06,9e-06,-3e-06,1e-06,8e-06,4e-06,1e-06,5e-06,7e-06,0,-2e-06,7e-06,2e-06,1e-06,0,-3e-06,8e-06,1e-06,-1e-06,0,0,0,3e-06,-4e-06,-1e-06,-1.6e-05,0,9e-06,2e-06,-1.3e-05,-2e-06,1e-06,1e-06,-1e-06,-4e-06,-2e-06,-4e-06,-5e-06,-1e-06,2e-06,-2e-06,0,7e-06,-2e-06,4e-06,1e-06,0,-1.3e-05,1e-06,0,4e-06,-1.3e-05,2e-06,-2e-06,6e-06,0,-1e-06,3e-06,2e-06,2e-06,-1e-06,-1e-06,1e-06,-4e-06,0,-5e-06,-1e-06,0,-8e-06,-3e-06,-3e-06,0,-2e-06,2e-06,-1e-06,2e-06,2e-06,3e-06,4e-06,1e-06,3e-06,1.4e-05,1e-06,-6e-06,-3e-06,4e-06,-6e-06,0,-1e-06,9e-06,0,6e-06,6e-06,1e-06,-2e-06
2e-06,-2e-06,-1e-06,-1e-06,1e-06,-1e-06,1e-06,0,-6e-06,1e-06,0,-1e-06,0,1.6e-05,-5e-06,4e-06,0,2e-06,-1e-06,-2e-06,-2e-06,1e-06,-1.1e-05,0,0,-3e-06,-3e-06,7e-06,-3e-06,-1e-06,-8e-06,3e-06,-4e-06,6e-06,-6e-06,4e-06,-1e-06,-3e-06,4e-06,-2e-06,0,7e-06,1.6e-05,0,3e-06,8e-06,-2e-06,0,2e-06,-1e-06,0,3e-06,2e-06,-1e-05,1e-06,7e-06,-3e-06,1e-06,0,-2e-06,1e-06,1e-06,-2e-06,7e-06,0,-5e-06,-1e-06,-2e-06,-6e-06,0,2e-06,0,1e-06,-2e-06,1e-06,0,-5e-06,8e-06,-1e-05,0,-9e-06,6e-06,-2e-06,1.3e-05,2e-06,-3e-06,0,-9e-06,0,3e-06,0,2e-06,1e-06,1e-06,1e-06,-1e-06,1e-06,-1e-06,1e-06,0,1e-06,4e-06,-4e-06,-2e-06,3e-06,-1.6e-05,0,-1.4e-05,-1e-06,-1e-06,2e-06,-2e-06,3e-06,0,0,1.9e-05,0,-5e-06,4e-06,0,0
-1e-06,1e-06,-1e-06,2e-06,0,0,4e-06,-2e-06,2e-06,-4e-06,0,-1e-06,0,-1.4e-05,5e-06,2e-06,1e-06,-4e-06,-6e-06,1e-06,6e-06,-1e-06,1.5e-05,0,-1e-06,-1e-06,2e-06,4e-06,0,1e-06,-8e-06,4e-06,1e-06,2e-06,-5e-06,1e-06,-2e-06,-1.1e-05,3e-06,1e-06,-1e-06,-8e-06,1e-06,0,-3e-06,0,1e-06,0,1e-06,0,0,-3e-06,0,1.2e-05,-3e-06,5e-06,4e-06,-3e-06,-2e-06,7e-06,4e-06,0,9e-06,3e-06,0,2e-06,1e-06,-3e-06,2e-06,-1e-06,-5e-06,0,-1e-06,7e-06,0,0,-4e-06,1e-06,-7e-06,3e-06,3e-06,-6e-06,-1e-06,2e-06,-4e-06,0,1e-06,1e-06,-1e-06,-3e-06,0,3e-06,-1e-06,-1e-06,0,0,-5e-06,3e-06,0,0,-1e-06,-2e-06,5e-06,1e-06,1e-06,2.4e-05,-3e-06,7e-06,0,-2e-06,1e-06,-1e-06,4e-06,-1e-06,0,1.9e-05,0,-6e-06,7e-06,0,2e-06
0,2e-06,1e-06,2e-06,-2e-06,7e-06,-3e-06,-1e-06,2e-06,2e-06,0,-3e-06,-1e-06,1.3e-05,8e-06,-1e-06,1e-06,-3e-06,0,5e-06,-7e-06,-1e-06,1.7e-05,0,1e-06,7e-06,-2e-06,0,1e-06,-1e-06,9e-06,0,-4e-06,0,5e-06,2e-06,-4e-06,-5e-06,0,-1e-06,1e-06,6e-06,-5e-06,-1e-06,-3e-06,-4e-06,-3e-06,1e-06,1e-06,3e-06,0,-5e-06,-1e-06,-1.4e-05,0,-8e-06,-2e-06,2e-06,0,-6e-06,4e-06,-2e-06,-1e-05,-8e-06,-3e-06,-2e-06,-1e-06,-1e-06,-1e-06,0,2e-06,2e-06,0,1.6e-05,1e-06,-1e-06,5e-06,-1e-05,-5e-06,3e-06,-1e-06,1e-06,-1e-06,-4e-06,-4e-06,0,-3e-06,1e-05,0,5e-06,0,-3e-06,-1e-06,1e-06,5e-06,-2e-06,5e-06,-2e-06,-2e-06,2e-06,0,5e-06,-2e-06,-1e-06,1e-06,-1.7e-05,2e-06,-7e-06,0,4e-06,-5e-06,3e-06,-6e-06,-1e-06,0,6e-06,0,5e-06,6e-06,1e-06,-2e-06
1e-06,-1e-06,1e-06,0,2e-06,-2e-06,0,2e-06,-5e-06,2e-06,-1e-06,-2e-06,1e-06,-1.2e-05,-2e-06,-1e-06,-1e-06,2e-06,-4e-06,-3e-06,5e-06,-1e-06,-5e-06,0,1e-06,-1.2e-05,2e-06,-5e-06,-1e-06,-1e-06,-1e-06,-2e-06,2e-06,-3e-06,3e-06,0,-3e-06,5e-06,-2e-06,0,0,-3e-06,-3e-06,1e-06,3e-06,-1e-06,1e-06,-1e-06,-1e-06,0,-1e-06,1e-05,-1e-06,1.4e-05,-1e-06,0,-2e-06,0,0,7e-06,8e-06,3e-06,6e-06,-1e-06,2e-06,2e-06,1e-06,1e-06,3e-06,1e-06,3e-06,-3e-06,-1e-06,-3e-06,-2e-06,1e-06,2e-06,1.6e-05,8e-06,-2e-06,5e-06,5e-06,-2e-06,-3e-06,3e-06,-3e-06,3e-06,0,0,-8e-06,0,-2e-06,0,1e-06,1e-06,5e-06,-7e-06,0,2e-06,-2e-06,0,-6e-06,0,3e-06,-2e-06,9e-06,1e-06,1.4e-05,-1e-06,-3e-06,3e-06,-5e-06,-3e-06,1e-06,1e-06,-1.1e-05,0,3e-06,-5e-06,-3e-06,3e-06
