-0.000457,-0.000464,-0.000346,-0.000499,-0.000354,-0.000292,-0.000363,-0.000213,-0.000126,-0.000187,-0.000248,-0.000319,-0.000535,-0.000348,-0.000288,-0.000132,-0.000156,-0.00018,-0.000216,-0.000345,-0.000453,-0.000283,-0.000224,-0.000223,-0.000698,-0.000485,-0.00053,-0.000476,-0.000441,-0.000193,-0.000177,-0.000432,-0.000519,-0.000538,-0.00035,-0.000383,-0.000536,-0.000323,2e-05,-0.00032,-0.000148,-0.000411,-0.000141,-0.000311,-0.00054,-0.000264,-0.000208,-0.000105,-0.000238,-7.5e-05,-0.000149,-0.000111,-2e-05,-0.000405,-0.00038,-0.000378,-0.000109,-0.000313,-0.000184,-0.000405,-0.000221,-0.000238,-0.000255,-0.000249,-0.00025,-0.000117,-0.000153,-0.000109,-0.000347,-0.000118,-0.000206,-0.000207,-4e-04,-0.00026,-0.000249,-0.000224,-0.000172,-0.000218,-0.000469,-0.00049,-0.000394,-0.000403,-0.000574,-0.000266,-0.000305,-0.000249,-0.00022,-0.000343,-0.000282,-0.000258,-0.000251,-0.000222,-0.000319,-0.000303,-0.000373,-0.000262,-0.000151,-0.000131,-0.000211,-0.000217,-0.000105,-0.000445,-0.000235,-0.000247,-0.000272,-0.000231,-0.00028,-0.000137,-0.000206,-0.000225,-0.000284,-0.000201,-0.00026,-0.000334,-0.000317,-0.000342,-0.000133,-0.000222,-0.000212,-0.000474,-0.000307
0.000135,2.3e-05,0.000219,0.000244,0.000148,0.00017,-0.000125,-0.000102,-0.00029,-0.000249,-9.5e-05,1.3e-05,8.9e-05,-0.000209,-0.000105,-0.000222,-0.000188,-0.000421,-0.000193,-0.000122,-1e-05,-0.000162,0.000114,0.000139,0.000177,0.000104,-2.9e-05,9.6e-05,0.000131,2.9e-05,3.9e-05,0.000308,0.000325,0.000402,7e-05,8.1e-05,-0.00011,-1.8e-05,-9.3e-05,-0.000173,-0.000268,-0.000112,-2.5e-05,8e-06,0.000261,0.000103,-2.6e-05,1.5e-05,-9e-06,-0.000227,-0.000338,-0.000225,-0.000162,0.000106,4e-05,4.1e-05,7.9e-05,-0.000266,-0.000246,4.4e-05,-0.000244,-0.000171,-0.000121,-0.000232,-7e-05,-8.1e-05,2e-05,-4.8e-05,4e-06,-4.5e-05,-4.7e-05,-0.000208,4.9e-05,-5.5e-05,-1.9e-05,-0.000154,-0.000203,-0.00018,-3.5e-05,0.000199,-3.6e-05,-8.5e-05,0.00019,-0.000131,-5.4e-05,-3.7e-05,-3e-04,-0.000165,-0.00011,4e-05,-6.6e-05,-6.2e-05,0.000211,-5e-06,9e-06,8.5e-05,-7.6e-05,-4.4e-05,1.8e-05,6.7e-05,7.7e-05,0.000107,-0.000167,-5e-05,-8.9e-05,-6.5e-05,-6e-05,-0.000113,-7.4e-05,-5.4e-05,5.9e-05,-1.5e-05,-0.000166,-7.5e-05,-0.000262,-0.000155,-0.000162,-0.000155,-2.2e-05,-0.000103,-8.7e-05
-0.000168,5e-06,3.8e-05,-0.000217,-0.000106,-0.000162,0.000164,1.2e-05,0.000165,0.000259,0.00017,-0.000131,-0.000198,7.2e-05,0.000245,-4.8e-05,9.5e-05,0.000204,8.7e-05,0.000153,0.000121,0.000198,6.5e-05,1.7e-05,-3.2e-05,6.6e-05,7.8e-05,0.000112,2.3e-05,5.8e-05,-0.000172,-9.5e-05,-0.00024,-0.000155,8e-06,-1.1e-05,0.000224,3e-06,1.1e-05,0.000376,0.000137,0.000171,9.1e-05,0.000206,-9.5e-05,-0.000142,-7.1e-05,-0.000153,8.6e-05,0.000202,0.000163,4.9e-05,-4.4e-05,-0.00013,9.8e-05,-2.9e-05,-9e-06,0.000116,7.7e-05,-3.3e-05,0.00027,0.00027,9.3e-05,0.00024,0.00012,0.000151,-1.3e-05,-6.4e-05,-5.3e-05,-4.4e-05,-2.1e-05,0.000253,0.000106,-4e-05,2.2e-05,9.2e-05,0.000271,0.000286,2.8e-05,-1.7e-05,5.3e-05,1.7e-05,-3.3e-05,0.000102,2e-05,6.4e-05,0.000158,0.000263,7.1e-05,-0.00012,0.000143,-3.9e-05,-0.00025,3.8e-05,0.000129,-7e-06,-8.3e-05,-0.000181,-0.000106,-1.5e-05,5.5e-05,-5.5e-05,3.9e-05,-0.000116,-2.9e-05,0.000178,0.000129,0.000256,0.000179,0.000194,1.1e-05,-2.8e-05,0.000167,2e-05,0.000124,0.000168,8.5e-05,8.4e-05,5.2e-05,0.000102,7.7e-05
0.000109,-2.4e-05,-4.6e-05,0.000163,-2.3e-05,5.8e-05,-0.000175,4.7e-05,-4.7e-05,-0.000256,-8e-06,-4.1e-05,6.3e-05,-0.000161,-0.000207,-8e-06,-0.000188,-0.000277,-0.000248,-7e-05,-0.000301,-0.000181,-8e-05,6.2e-05,-2.1e-05,-7.5e-05,-2.8e-05,-0.000157,-0.000256,-0.000278,-7.1e-05,-9.6e-05,-3.9e-05,4.9e-05,-4.7e-05,-7.4e-05,-4.9e-05,-0.000164,-1.8e-05,-0.000216,-0.00014,-1.1e-05,-5.5e-05,-0.000125,-9.5e-05,-6e-06,-1e-05,0.000116,-1e-05,-1.2e-05,-0.000131,-8.4e-05,7e-06,-0.00012,-0.000241,-8e-05,-0.000165,-0.000219,-0.00018,-4.7e-05,-7e-05,-0.000117,-6.1e-05,-0.000171,8e-06,-0.000119,-3.3e-05,-0.000214,-0.000161,-8.3e-05,-5e-05,-8.5e-05,-0.000129,-0.000109,-0.00013,3.8e-05,-2e-06,-0.000336,-0.000115,-3.8e-05,-1.2e-05,8.9e-05,-5e-06,-0.000194,-0.000178,-0.000104,-5.8e-05,-7.4e-05,-1.5e-05,3e-06,-4.5e-05,-0.000189,8.6e-05,-5.6e-05,-0.000146,-9e-05,-5.1e-05,5.4e-05,5.2e-05,-0.000159,-0.000148,-0.000112,8.1e-05,0.000112,-0.000171,-7.6e-05,-6e-05,-0.00035,-0.000336,-0.000162,6e-06,2.9e-05,-0.000226,-0.000141,-1.5e-05,-0.00015,-8.4e-05,-0.000122,-0.000107,7e-06,-0.00016
-0.000121,8.6e-05,0.000145,6.7e-05,3.5e-05,-1e-06,0.000116,-1e-06,4.4e-05,0.000126,-7e-06,8.2e-05,0.000153,0.000242,2.4e-05,4.5e-05,0.000253,0.000219,2e-05,-1.1e-05,0.000173,0.000115,0.000168,7e-06,0.000178,8.7e-05,9.9e-05,-4.7e-05,0.000116,0.000161,8.7e-05,8.3e-05,5e-05,-4.7e-05,3.5e-05,8.6e-05,8.2e-05,0.00011,5.7e-05,0.000125,-1.8e-05,-1.7e-05,-3e-05,1.7e-05,-3.1e-05,3.8e-05,3e-05,-5.6e-05,-7.8e-05,-3.1e-05,9e-06,2e-06,1.7e-05,5.6e-05,0.000187,0.00014,4e-05,0.000103,0.00029,0.000154,-3.2e-05,-0.000102,-1.4e-05,1.3e-05,-3.3e-05,-3e-05,-1.2e-05,9.6e-05,0.000224,8.1e-05,2.6e-05,4e-06,0.00012,6.6e-05,0.000137,-2.1e-05,-4.1e-05,2e-05,-4.6e-05,1.3e-05,4.5e-05,-8e-06,6.3e-05,0.000117,0.000227,4.1e-05,-1.9e-05,-4.3e-05,-7.1e-05,-4.4e-05,9.6e-05,6.1e-05,-2.8e-05,4.6e-05,0.000131,3e-05,2e-05,0.000106,0.000102,0.000202,4.6e-05,0.00019,-3.4e-05,-3e-05,5.6e-05,5.3e-05,3e-06,-2.5e-05,0.000181,3e-05,-2e-05,5.3e-05,7.5e-05,0.000146,-1e-06,-2e-06,-8.1e-05,9e-05,3.5e-05,6.3e-05,0.000241
4.8e-05,-2.3e-05,-7.4e-05,-0.000238,-0.000157,-2.4e-05,6.3e-05,-9.6e-05,4.6e-05,-3.5e-05,-3.2e-05,-9e-05,-0.000157,-0.000154,5.9e-05,-5.2e-05,-0.00018,-2.1e-05,0.00012,-0.000109,-7e-06,-8.6e-05,-4.3e-05,-6.3e-05,-0.000216,-0.000138,-0.000107,9e-05,-8.5e-05,3.5e-05,5.2e-05,-4.2e-05,-0.000183,8.3e-05,3.3e-05,-8.8e-05,-0.000149,-2.5e-05,3.3e-05,7e-06,4.6e-05,-2.1e-05,-7e-06,8.4e-05,0.000136,-4.6e-05,-8.2e-05,-6.4e-05,2.2e-05,1.8e-05,9.3e-05,0.000191,7.8e-05,6e-05,-0.000136,-1.4e-05,5.3e-05,8e-05,-0.000123,-5.9e-05,-2.2e-05,0.000112,0.000143,1.8e-05,5.7e-05,-5e-06,8.1e-05,6.9e-05,-1.8e-05,2.5e-05,2.3e-05,-1.4e-05,-9.7e-05,0.000113,-8.3e-05,-3.6e-05,6.3e-05,3.2e-05,0.000203,-1.4e-05,1.2e-05,-5.9e-05,-5.7e-05,-0.000166,-0.000151,-2.5e-05,-7.3e-05,1e-06,8.3e-05,6e-05,-5.7e-05,4.2e-05,-8e-06,3.5e-05,1.1e-05,-8.1e-05,0,6.2e-05,-5.6e-05,-1.9e-05,-3.3e-05,-7.1e-05,-0.000145,-8.1e-05,2.1e-05,-0.000107,7.9e-05,9.4e-05,-3e-06,5e-05,-1.1e-05,-2.9e-05,-3.5e-05,9e-06,3.6e-05,0.000105,0.000199,0.000143,9e-06,-2.9e-05,-0.000114
2.6e-05,-0.000109,-3.6e-05,-8e-06,6.1e-05,6.8e-05,-1.1e-05,9e-06,-5e-06,-9e-06,-0.000179,7.2e-05,5.1e-05,9e-05,9e-06,-8e-05,-6e-05,-1.7e-05,1e-05,0.000104,3.1e-05,-2.5e-05,1.7e-05,-1.6e-05,-6e-06,7.3e-05,6e-06,-0.000146,-0.000108,-8e-06,3.8e-05,9.7e-05,0.000142,3.4e-05,-0.000105,0.000119,3.2e-05,4.1e-05,-8.2e-05,-4.5e-05,-0.000102,-2e-06,-1.2e-05,-4.3e-05,-0.000158,-5.8e-05,0.000126,9.2e-05,-1.4e-05,-0.000132,-0.000118,-0.000124,-6e-05,0,4.4e-05,-5.4e-05,-3.7e-05,1.6e-05,-6.7e-05,-7.4e-05,-0.000145,-0.000139,-0.000144,-5.3e-05,1.5e-05,2.8e-05,9.9e-05,-2e-05,-3e-05,-5.5e-05,2e-06,-9e-06,5.4e-05,-7.3e-05,-2.1e-05,7.3e-05,-5.3e-05,-0.000104,-0.000166,-1e-04,-7.1e-05,5.4e-05,6.4e-05,7.9e-05,5.6e-05,7.4e-05,9.4e-05,4.7e-05,-6.4e-05,-7.7e-05,-2e-06,-4.7e-05,0.000101,-1.6e-05,-0.000116,4.3e-05,4.3e-05,-4.9e-05,-3.6e-05,-4e-06,2.3e-05,9.2e-05,5e-06,1e-06,0,-2.2e-05,-3.1e-05,-4.3e-05,-2.1e-05,-8.9e-05,-1e-05,4.5e-05,5e-05,0,-0.000104,1.3e-05,-6.7e-05,-0.000123,-7.1e-05,-1.6e-05,-2.1e-05
-0.000107,-4.4e-05,6e-05,3.2e-05,1.6e-05,-2.5e-05,-5e-06,2.4e-05,-5.2e-05,6.1e-05,0.000143,-0.00013,-4.1e-05,-0.000144,-2.3e-05,1.7e-05,0.000142,2.8e-05,5e-06,-8.3e-05,2e-05,0.000178,3e-06,-1.6e-05,-6.4e-05,-5.9e-05,1.1e-05,0.000134,7.8e-05,-1.6e-05,-6e-06,-5.4e-05,-0.000106,-0.000107,4.7e-05,-6.9e-05,1e-06,-2.7e-05,-8.8e-05,-7e-05,3.7e-05,7.9e-05,1.5e-05,-2.7e-05,9e-05,1.8e-05,9e-06,-2.6e-05,0,6e-06,1.9e-05,-2.7e-05,-5e-05,-5e-06,-7.2e-05,4.8e-05,-5e-05,-6e-06,3.1e-05,2.4e-05,0.000107,1.9e-05,-1.9e-05,-1.4e-05,-8e-06,-8.2e-05,-3.3e-05,-2e-05,2.3e-05,-1.4e-05,-5.7e-05,2.7e-05,1.5e-05,1.5e-05,2.2e-05,-0.000101,-1.2e-05,5.8e-05,1e-04,3.9e-05,3.9e-05,-3.4e-05,-2.9e-05,-3.9e-05,1.5e-05,-0.000134,-0.000148,-8.3e-05,-1.8e-05,-1.4e-05,-3.6e-05,1.7e-05,-7.5e-05,-5.7e-05,2.4e-05,-6.7e-05,-0.00011,3.1e-05,-2.8e-05,2.1e-05,-1.4e-05,-8.4e-05,-3.1e-05,2.5e-05,2.1e-05,-4e-05,3.3e-05,6.3e-05,0.000104,7e-05,-2e-05,-0.000113,-3.5e-05,9e-06,-2.3e-05,-6.7e-05,-7.4e-05,-4.6e-05,4.2e-05,-8.9e-05,2.7e-05
3.2e-05,2e-04,-1e-05,-6.3e-05,4e-06,-4.7e-05,-2.4e-05,-4.5e-05,-6e-05,4e-05,-1.8e-05,-1.2e-05,-3.8e-05,3.2e-05,-3.5e-05,-3e-06,6e-05,-7.5e-05,-1.8e-05,5.1e-05,-4.9e-05,-9.8e-05,-7.4e-05,-8e-05,-2.3e-05,-7.6e-05,-1.1e-05,-8.5e-05,-7.1e-05,-8.6e-05,-5e-06,-3e-05,0.000126,-3e-06,-0.000107,-2.6e-05,-2.6e-05,-5.2e-05,2e-06,8e-06,-1.8e-05,-1.8e-05,-1.3e-05,-5.5e-05,-6.8e-05,-8e-06,-2e-06,-1.3e-05,-7.8e-05,2e-06,1.4e-05,5.2e-05,5.6e-05,-5.2e-05,-4.5e-05,-5.3e-05,-1e-06,-3.3e-05,-5.5e-05,-3e-05,-8.5e-05,-3.8e-05,0.000124,6.2e-05,0.000119,6.7e-05,1.2e-05,5e-06,-0.000107,-1.2e-05,1.8e-05,-2e-05,-6.2e-05,-4.2e-05,-6e-05,-9e-06,-5.9e-05,7.8e-05,8.3e-05,2.4e-05,-5.4e-05,-3.6e-05,-3.5e-05,1.9e-05,-5.1e-05,2e-05,4.8e-05,2.2e-05,-1.8e-05,-2.1e-05,-3.9e-05,-5e-06,-0.000147,1e-05,-7e-06,8e-05,1.8e-05,-7.5e-05,2e-05,-0.000126,-2.6e-05,-3e-05,8.6e-05,-5.7e-05,-1.7e-05,-1.7e-05,1.7e-05,-1.3e-05,-7.2e-05,-0.000111,-6e-06,6.2e-05,4.2e-05,-4.5e-05,5.7e-05,-3.8e-05,7.6e-05,4.4e-05,-1.8e-05,4.2e-05,3.1e-05
-2.2e-05,-5.1e-05,2.5e-05,5.1e-05,6.1e-05,3.6e-05,8e-06,5.2e-05,0.000117,-5e-06,5.8e-05,0.00011,0.000116,4e-06,-3.3e-05,-4.8e-05,-1.5e-05,7.6e-05,-1.6e-05,7.4e-05,3.2e-05,3.5e-05,7.7e-05,-2.6e-05,-1.4e-05,3.5e-05,5.1e-05,5e-06,8e-05,1.7e-05,-6.4e-05,-4.2e-05,-4.2e-05,-5.1e-05,1e-05,-4.1e-05,4.6e-05,5.9e-05,2.3e-05,1.9e-05,1.4e-05,-3.7e-05,2.2e-05,-3.7e-05,3.3e-05,-3e-06,-1.2e-05,-3e-06,8.3e-05,2e-06,2.2e-05,-2.9e-05,3e-06,3.1e-05,3.1e-05,2.5e-05,1.2e-05,0,5.5e-05,9.2e-05,3.8e-05,5.4e-05,-0.000168,-4.4e-05,-0.000124,-4.8e-05,-2.1e-05,-1.9e-05,4.5e-05,3.5e-05,7e-06,-2.6e-05,3.7e-05,1.2e-05,-3.6e-05,2.8e-05,2.2e-05,-1e-05,-0.000127,-7e-06,2e-06,-1.1e-05,7.1e-05,-5e-06,3.8e-05,1.9e-05,-1.1e-05,4e-06,8.1e-05,2.5e-05,1e-05,4.9e-05,6.5e-05,1.1e-05,1.2e-05,-1.4e-05,1.7e-05,2.3e-05,-1.4e-05,-2.4e-05,5.6e-05,3.3e-05,-0.000102,-2.6e-05,-3e-06,3.8e-05,-2.2e-05,-3.5e-05,-3e-05,5.9e-05,-7e-06,-4.1e-05,-2.3e-05,-8e-06,4.7e-05,9.9e-05,-8.1e-05,-1.6e-05,-3.7e-05,2.9e-05,-1.5e-05
4.2e-05,9.3e-05,2e-06,-2.4e-05,-6e-06,-7.2e-05,-1e-05,-6e-05,-6.9e-05,7e-06,1.4e-05,-6.5e-05,-1.5e-05,5e-06,7e-05,0.000113,1.5e-05,-4.8e-05,9e-06,-6.5e-05,-9e-06,-6.1e-05,-3.3e-05,-1.7e-05,-1.3e-05,-2.3e-05,-1.7e-05,7e-06,-7e-06,-1e-05,2.3e-05,-5e-06,-1.9e-05,-1e-05,-9e-06,5e-06,-6.3e-05,-3.5e-05,-5.2e-05,1e-06,6e-06,9.6e-05,1.5e-05,7.7e-05,1.4e-05,2.4e-05,-4.3e-05,-2e-05,-5.9e-05,-1e-05,1.2e-05,0,2e-06,4.6e-05,1.7e-05,0,0.000124,1.1e-05,4.5e-05,-9.4e-05,-4.1e-05,3e-05,5.2e-05,1.9e-05,-4.2e-05,-1.3e-05,-4.1e-05,9e-06,1.8e-05,5.3e-05,-2.8e-05,2e-06,2.2e-05,-1.2e-05,4.2e-05,1.1e-05,-3.9e-05,9e-06,7e-05,2.4e-05,2.5e-05,6.1e-05,-1.2e-05,5e-06,-3.4e-05,-3.9e-05,5.9e-05,1.5e-05,-3e-05,-8e-06,6e-06,1e-05,-7e-06,-1.7e-05,1.1e-05,-2.1e-05,-1e-06,-2.1e-05,-5e-06,6.1e-05,7e-06,-2.6e-05,4.8e-05,8.3e-05,-1.8e-05,3.2e-05,-6e-06,4.5e-05,2.5e-05,7e-06,-1.5e-05,-2e-05,2e-06,-1e-06,-3.9e-05,-6e-06,6.2e-05,-6e-06,5.5e-05,7e-06,3.7e-05
3e-06,-1.2e-05,-3.8e-05,-2.2e-05,-2.3e-05,9e-05,2.5e-05,0,2.7e-05,2.1e-05,-6.6e-05,-2.7e-05,1.4e-05,-2.7e-05,-2.1e-05,-6.5e-05,-1.6e-05,-4.2e-05,2.5e-05,2.9e-05,4e-06,2e-05,-4.8e-05,4.9e-05,3.3e-05,4e-05,-1.6e-05,-3.3e-05,-2.4e-05,-1.8e-05,4e-05,-1.4e-05,5e-06,2.3e-05,2e-05,-3.3e-05,2.5e-05,-7e-06,0.000117,-3.3e-05,-1e-05,-3.3e-05,-2.7e-05,-5.7e-05,1.9e-05,-1.3e-05,5.9e-05,-4e-06,2.7e-05,1.1e-05,-1.5e-05,-6e-06,2.9e-05,-2e-05,3.3e-05,-2.7e-05,-8.3e-05,-9e-06,-1.2e-05,4.4e-05,-9e-06,-4.4e-05,-1.9e-05,5e-06,4e-05,-3.6e-05,-1e-06,5.3e-05,-5e-06,-1.7e-05,2.2e-05,1.7e-05,-3.4e-05,-1.4e-05,-1.6e-05,5e-06,3.2e-05,-1.1e-05,-4.8e-05,-8e-06,-2.9e-05,-5.7e-05,-1.5e-05,1e-06,3.1e-05,2.4e-05,-2.5e-05,-1.1e-05,-4.3e-05,4e-06,-3e-06,4e-06,1.2e-05,3.3e-05,-2.4e-05,5.9e-05,9e-06,1.7e-05,-1.2e-05,7e-06,-2.9e-05,-1e-06,-1.5e-05,-9e-06,1e-06,-9e-06,-3.1e-05,1.5e-05,-1e-06,-6e-06,4.4e-05,-2e-05,-4e-06,1.1e-05,-2.9e-05,-2.1e-05,-1.4e-05,3.7e-05,6e-06,-2.8e-05,7e-06
-5.3e-05,2e-06,-6.2e-05,2e-05,-2e-06,-5e-05,-1.1e-05,1e-05,-1.7e-05,-1.4e-05,-2.6e-05,1.5e-05,-5.3e-05,2.1e-05,-9e-06,3e-06,3e-06,2.4e-05,-2.9e-05,-3.9e-05,-5e-05,1.1e-05,2.7e-05,1.9e-05,-1.1e-05,1.8e-05,9e-06,4.3e-05,-2.1e-05,-2.9e-05,-4.8e-05,-5e-06,-3.8e-05,-3.5e-05,-3.6e-05,4.7e-05,-1.9e-05,-7e-06,-9.2e-05,-2e-06,-1.9e-05,-1.3e-05,-2.9e-05,2.4e-05,-1e-06,2e-05,-4.9e-05,3e-06,-1.7e-05,-1e-05,6e-06,5e-06,-3.7e-05,-3.4e-05,-2.5e-05,-9e-06,3e-06,-8e-06,-2.9e-05,-4e-06,1.6e-05,1e-06,-2e-05,-2.2e-05,-1.2e-05,-2.5e-05,-1.1e-05,2.1e-05,-2e-06,-1.1e-05,-1.1e-05,5e-06,6e-06,-2e-06,1e-06,-2.5e-05,-5e-06,1.7e-05,-3.7e-05,-1.7e-05,4e-06,4.7e-05,6e-06,-1e-05,-2.6e-05,-1.5e-05,-2.1e-05,-1.8e-05,5.1e-05,1.2e-05,-8e-06,2.7e-05,4.3e-05,-9e-06,5e-06,-4.3e-05,1.6e-05,-3.6e-05,2.4e-05,1.1e-05,-7e-06,8e-06,-5e-06,-1.2e-05,9e-06,-2.4e-05,-2e-05,-1.5e-05,-6e-06,1.8e-05,-3.7e-05,3.6e-05,-3e-06,-3e-06,2e-06,-5e-06,-6e-06,-2.9e-05,-2.1e-05,1e-06,-4.6e-05
1.2e-05,-6e-06,2.8e-05,-1.6e-05,1e-06,1.4e-05,6e-06,5e-06,-6e-06,-6e-06,1.4e-05,-2.6e-05,3.5e-05,-1e-05,-1.5e-05,4e-06,-1e-06,3.2e-05,1.3e-05,-5e-06,2e-05,-6e-06,1.9e-05,-2.2e-05,-1e-05,4.1e-05,-1.6e-05,-3.3e-05,3.4e-05,1e-05,1.4e-05,1.8e-05,3.1e-05,3.8e-05,9e-06,-2.2e-05,1e-05,8e-06,3.2e-05,1.7e-05,7e-06,2.4e-05,0,1.1e-05,-2e-06,-1e-05,-1.9e-05,-3e-06,-1e-06,-5e-06,-1e-06,1.3e-05,1.1e-05,3.8e-05,-1.8e-05,0,2.5e-05,-2.1e-05,1e-05,-8e-06,-9e-06,-1.6e-05,-4e-06,1.4e-05,-5e-06,2.3e-05,-8e-06,-1.9e-05,1.4e-05,-6e-06,-1e-05,-3e-06,2e-06,-1.3e-05,1.2e-05,-6e-06,-8e-06,-1e-06,1.9e-05,-8e-06,9e-06,-3.7e-05,-7e-06,-1e-05,1.5e-05,1.1e-05,1e-06,3e-06,-2.8e-05,8e-06,1.1e-05,-2.3e-05,-2.1e-05,-4.4e-05,1e-06,3.3e-05,-1.6e-05,1.4e-05,-1e-05,-1.8e-05,-8e-06,6e-06,4.1e-05,1e-06,-1.2e-05,-2.1e-05,3e-06,9e-06,-1e-06,-1e-06,1.3e-05,-2.7e-05,5e-06,2e-06,-1.7e-05,-4e-06,2e-06,6e-06,-1.2e-05,2.6e-05,9e-06
2.6e-05,1.2e-05,-1e-05,-8e-06,1e-06,4.1e-05,-2.6e-05,3e-06,8e-06,9e-06,1e-06,3.3e-05,-3e-05,1.6e-05,1.9e-05,-2.3e-05,-5e-06,7e-06,1e-06,2.8e-05,1e-05,-1.8e-05,-2e-06,1.4e-05,1.1e-05,-1.8e-05,8e-06,7e-06,-8e-06,4e-05,6e-06,-8e-06,7e-06,3e-06,7e-06,1.5e-05,-1.5e-05,1.2e-05,-4e-06,1.5e-05,1.2e-05,-2.7e-05,1.6e-05,-4e-06,-1.1e-05,1.5e-05,1e-06,1.4e-05,1.4e-05,2.3e-05,-2e-06,4e-06,-1.4e-05,-1.1e-05,-1e-06,7e-06,-8e-06,6e-06,-2.4e-05,1e-06,1.9e-05,1.9e-05,2.7e-05,-2e-05,-4e-06,1.7e-05,4e-06,2.6e-05,-4e-06,-1.6e-05,5e-06,-1e-05,-1.4e-05,2.3e-05,1.2e-05,1.9e-05,1.2e-05,1.9e-05,1.1e-05,2e-06,5e-06,4e-05,-7e-06,2.7e-05,-3e-06,1.1e-05,-1.7e-05,4e-06,1.6e-05,-2e-05,-1.4e-05,1.1e-05,8e-06,-3e-06,-6e-06,-1e-05,9e-06,1.5e-05,6e-06,1.1e-05,-6e-06,3e-06,-3.6e-05,-1e-06,-2.4e-05,1e-05,-1e-06,6e-06,-3e-06,-1.3e-05,2e-06,3e-05,7e-06,2e-06,3.3e-05,1.2e-05,-1e-05,-1e-06,7e-06,-2.1e-05,1.1e-05
-2.4e-05,9e-06,6e-06,1.2e-05,6e-06,0,7e-06,-1e-06,-7e-06,-3e-06,6e-06,-1.9e-05,-1.1e-05,-6e-06,9e-06,1.6e-05,-1.2e-05,7e-06,7e-06,-1.2e-05,-1.4e-05,-2e-06,-1.9e-05,-1.2e-05,-7e-06,1.2e-05,-1.5e-05,4e-06,1.4e-05,-2.1e-05,-1.6e-05,-7e-06,1.6e-05,-9e-06,-3e-06,1.5e-05,1e-06,-1.5e-05,-2e-05,-1.2e-05,-9e-06,-2e-06,3e-06,3e-06,5e-06,-7e-06,1.4e-05,-9e-06,-1e-05,3e-06,-6e-06,8e-06,6e-06,-4e-06,1.6e-05,-4e-06,-7e-06,2.3e-05,-1e-06,1.5e-05,-1.2e-05,-1e-06,6e-06,6e-06,1e-05,-1.1e-05,-1.1e-05,-4e-06,-1e-06,6e-06,5e-06,-1.1e-05,1.1e-05,-7e-06,-9e-06,-8e-06,-1.1e-05,-5e-06,1.2e-05,-5e-06,1.2e-05,-2.9e-05,9e-06,-4e-06,0,-1.3e-05,3.5e-05,0,-9e-06,1.5e-05,9e-06,-1e-05,2.5e-05,1.7e-05,1.7e-05,-2e-06,2e-06,-7e-06,1e-06,2e-06,1.1e-05,2e-06,2.3e-05,2.1e-05,1.3e-05,2e-06,3e-06,1.8e-05,2e-06,-1e-06,2e-06,1.2e-05,-8e-06,5e-06,6e-06,6e-06,2.3e-05,-2e-06,4e-06,1e-06,-1.4e-05
1e-06,-7e-06,-9e-06,-1.1e-05,-3e-06,-1e-06,-1e-06,-1.1e-05,-4e-06,-9e-06,4e-06,-7e-06,1.8e-05,1.5e-05,-1.4e-05,-1e-06,-2.6e-05,4e-06,1e-06,5e-06,3e-06,1.5e-05,2e-06,-2e-06,-4e-06,-1.1e-05,6e-06,-6e-06,-1.4e-05,6e-06,1.1e-05,1.1e-05,-2.1e-05,-1e-06,4e-06,-1.9e-05,-1.4e-05,5e-06,1.1e-05,6e-06,2e-06,-3e-06,-1.2e-05,-4e-06,7e-06,7e-06,-1.2e-05,8e-06,2e-06,-9e-06,2e-06,4e-06,5e-06,1.2e-05,-1e-05,5e-06,2e-06,-1.1e-05,1.4e-05,-1.8e-05,-2.3e-05,3e-06,-8e-06,-8e-06,1e-05,-4e-06,1.4e-05,-5e-06,1e-05,-2e-06,1e-06,1e-05,3e-06,-3e-06,-5e-06,-7e-06,1.6e-05,-8e-06,-3e-06,9e-06,-1.3e-05,1.8e-05,-1.3e-05,-3e-06,-4e-06,4e-06,1e-06,6e-06,4e-06,-4e-06,-5e-06,6e-06,-1.4e-05,-5e-06,-1e-05,7e-06,-1.5e-05,1.5e-05,3e-06,8e-06,2e-06,-4e-06,-1.8e-05,-8e-06,7e-06,2e-06,9e-06,-1e-05,1e-05,0,5e-06,-1.6e-05,-8e-06,-2e-06,-2e-06,-7e-06,-8e-06,0,-2e-06,4e-06,-6e-06
9e-06,3e-06,2.7e-05,-4e-06,-1.1e-05,-5e-06,0,-7e-06,4e-06,3e-06,-7e-06,1.3e-05,-1.5e-05,-1.2e-05,-3e-06,8e-06,-2e-06,7e-06,-1e-05,3e-06,1.4e-05,-1e-06,1.1e-05,-2e-06,1.1e-05,1e-05,-1.5e-05,1e-06,-5e-06,0,-8e-06,3e-06,-6e-06,-1e-06,-9e-06,8e-06,1.2e-05,3e-06,4e-06,-1e-06,-3e-06,-4e-06,4e-06,-2e-06,-1e-05,-4e-06,1.6e-05,3e-06,-4e-06,-7e-06,-3e-06,-5e-06,-4e-06,-2e-06,5e-06,5e-06,-1e-05,2e-06,5e-06,3e-06,2.2e-05,-1e-06,7e-06,1e-06,2e-06,-6e-06,3e-06,-2e-06,-7e-06,1.1e-05,3e-06,2e-06,-6e-06,1e-05,2e-06,1.2e-05,-1.1e-05,-4e-06,1.7e-05,-1e-06,-2e-06,-2e-06,9e-06,2e-06,7e-06,3e-06,-5e-06,-3e-06,2e-06,-1.1e-05,9e-06,-7e-06,-6e-06,0,8e-06,-4e-06,1.1e-05,-2e-06,-7e-06,-9e-06,-2e-06,-2e-06,2e-06,-9e-06,-3e-06,8e-06,7e-06,-4e-06,-1e-06,-5e-06,-1.2e-05,1.3e-05,-3e-06,-1e-06,-7e-06,-2e-06,-7e-06,5e-06,-2e-06,1e-06,1e-05
-3e-06,-2.2e-05,-2.2e-05,1e-05,-4e-06,-6e-06,2e-06,1.1e-05,3e-06,0,-9e-06,-1e-05,7e-06,1e-06,6e-06,-1.2e-05,4e-06,2e-06,1e-06,-1.5e-05,-5e-06,5e-06,-6e-06,-4e-06,-3e-06,-7e-06,1.1e-05,-9e-06,1.4e-05,3e-06,-1e-06,-6e-06,1.4e-05,-5e-06,5e-06,-2e-06,-3e-06,-2e-06,-4e-06,-6e-06,1e-06,-1.1e-05,2e-06,-1.2e-05,1.1e-05,1e-06,-1.2e-05,-5e-06,9e-06,-2e-06,-4e-06,-7e-06,1.2e-05,-1e-06,2e-06,1e-06,1.8e-05,8e-06,-2e-06,9e-06,-3e-06,-1e-06,-7e-06,-5e-06,1.4e-05,9e-06,-3e-06,1e-06,2e-06,-4e-06,-1e-06,-2e-06,3e-06,-4e-06,-1e-06,-2e-06,8e-06,4e-06,4e-06,-4e-06,-8e-06,-3e-06,2e-06,1e-06,-2e-06,-9e-06,-2e-06,0,-7e-06,9e-06,-4e-06,-4e-06,-1e-06,6e-06,-9e-06,3e-06,0,9e-06,0,-1.2e-05,0,-2e-06,1e-05,1e-05,-3e-06,0,-2e-06,-8e-06,-3e-06,9e-06,6e-06,-6e-06,3e-06,-1e-06,1e-06,9e-06,8e-06,-3e-06,1e-06,-1e-06,-5e-06
-4e-06,-2e-06,2e-06,-4e-06,0,5e-06,2e-06,-4e-06,-6e-06,-3e-06,-1e-06,-8e-06,-2e-06,-3e-06,2e-06,7e-06,-5e-06,-3e-06,4e-06,5e-06,-5e-06,-8e-06,-6e-06,4e-06,-6e-06,1.4e-05,-1e-05,5e-06,-9e-06,-1e-06,8e-06,-2e-06,-3e-06,-4e-06,0,-1e-05,5e-06,-1e-06,1.4e-05,-7e-06,-2e-06,4e-06,-2e-06,5e-06,-5e-06,2e-06,1.3e-05,1e-06,-6e-06,2e-06,-3e-06,0,-6e-06,5e-06,3e-06,-2e-06,-9e-06,3e-06,1e-06,-7e-06,-2e-06,-6e-06,-7e-06,1e-06,-2.2e-05,-7e-06,1e-05,3e-06,3e-06,-2e-06,-2e-06,-2e-06,0,-3e-06,1e-06,3e-06,-6e-06,2e-06,-5e-06,0,1e-05,5e-06,-4e-06,-3e-06,-3e-06,6e-06,-7e-06,-2e-06,4e-06,-2e-06,3e-06,0,4e-06,2e-06,4e-06,4e-06,-3e-06,-1.1e-05,3e-06,1.7e-05,1e-06,-4e-06,-5e-06,-2e-06,7e-06,-9e-06,3e-06,4e-06,5e-06,1e-06,1e-06,1e-06,-3e-06,1e-06,-8e-06,-6e-06,-1e-06,0,2e-06,0,-6e-06
1e-06,-1.5e-05,1e-06,-4e-06,0,-9e-06,2e-06,4e-06,3e-06,-1e-06,9e-06,9e-06,-1e-05,1e-06,1e-06,-1e-06,3e-06,-1e-06,-4e-06,0,5e-06,0,4e-06,5e-06,7e-06,-4e-06,1e-05,-1e-06,3e-06,-1.3e-05,-6e-06,1e-06,-4e-06,-2e-06,3e-06,2e-06,-3e-06,-2e-06,-1.7e-05,3e-06,-2e-06,0,-3e-06,2e-06,5e-06,-1e-06,-1e-06,1e-06,2e-06,5e-06,0,-4e-06,1e-06,-7e-06,-6e-06,-2e-06,-1e-05,-2e-06,-4e-06,3e-06,4e-06,-2e-06,0,-3e-06,0,2e-06,-5e-06,-7e-06,-1e-06,-1e-06,2e-06,-1e-06,-4e-06,-3e-06,3e-06,-4e-06,5e-06,-5e-06,4e-06,-5e-06,-8e-06,0,-3e-06,2e-06,5e-06,-2e-06,0,-1e-06,2e-06,2e-06,-3e-06,-6e-06,6e-06,-2e-06,-3e-06,-1e-05,3e-06,4e-06,-1e-06,-1e-06,-1e-06,1e-06,4e-06,6e-06,0,-2e-06,0,2e-06,4e-06,4e-06,-3e-06,-1e-06,2e-06,-3e-06,8e-06,-7e-06,1e-06,0,0,3e-06,7e-06
-1e-06,1e-05,8e-06,3e-06,0,8e-06,-1e-06,-1e-06,-1e-06,3e-06,3e-06,-8e-06,7e-06,-2e-06,-1e-05,-7e-06,5e-06,2e-06,1e-06,1e-06,1e-06,1e-06,2e-06,-1e-06,-2e-06,1.1e-05,-5e-06,0,1e-06,5e-06,0,-1e-06,8e-06,4e-06,-6e-06,1e-06,-1e-06,5e-06,1.1e-05,4e-06,3e-06,-4e-06,2e-06,3e-06,-9e-06,2e-06,2e-06,-2e-06,-5e-06,5e-06,-1e-06,-1e-06,-1e-06,0,-1e-06,-1e-06,8e-06,-1e-06,-1e-05,-2e-06,-6e-06,5e-06,-3e-06,1e-06,4e-06,-1e-06,-1e-06,4e-06,-1e-06,-2e-06,-1e-06,0,3e-06,1e-06,1e-06,-5e-06,-3e-06,-3e-06,-3e-06,4e-06,5e-06,0,0,2e-06,-2e-06,-1e-06,4e-06,0,3e-06,-2e-06,2e-06,-1e-06,-3e-06,-3e-06,2e-06,1e-05,-5e-06,-6e-06,1e-06,-3e-06,1e-06,3e-06,-5e-06,1e-06,-2e-06,-4e-06,-2e-06,-2e-06,-4e-06,-4e-06,2e-06,-2e-06,0,2e-06,-2e-06,6e-06,-6e-06,2e-06,-1e-06,-1e-06,-1e-06
3e-06,-9e-06,-5e-06,1e-06,1e-06,-6e-06,0,-5e-06,2e-06,-1e-06,0,3e-06,1e-06,2e-06,6e-06,8e-06,-4e-06,-2e-06,-4e-06,6e-06,-4e-06,3e-06,2e-06,1e-06,-4e-06,-5e-06,4e-06,2e-06,3e-06,2e-06,4e-06,-3e-06,-9e-06,5e-06,3e-06,-1e-06,-4e-06,-4e-06,-6e-06,2e-06,-1e-06,4e-06,3e-06,1e-06,5e-06,-2e-06,-1e-06,2e-06,4e-06,0,-2e-06,3e-06,-1e-06,6e-06,0,-2e-06,3e-06,-2e-06,5e-06,1e-06,3e-06,2e-06,1e-06,-1e-06,-5e-06,0,-1e-06,-4e-06,2e-06,3e-06,-1e-06,2e-06,1e-06,2e-06,-1e-06,3e-06,-1e-06,-3e-06,-5e-06,0,2e-06,2e-06,1e-06,-2e-06,-1e-06,4e-06,2e-06,1e-06,-5e-06,1e-06,-1e-06,-4e-06,0,1e-06,1e-06,-6e-06,2e-06,-2e-06,1e-06,-6e-06,0,0,3e-06,-1.2e-05,-3e-06,5e-06,-4e-06,-3e-06,-4e-06,-1e-06,-2e-06,1e-06,2e-06,-4e-06,3e-06,3e-06,6e-06,-4e-06,-1e-06,-1e-06,-4e-06
-3e-06,0,-1e-06,-2e-06,-2e-06,2e-06,1e-06,1e-06,-1e-06,0,-3e-06,-1e-06,-4e-06,1e-06,3e-06,-6e-06,1e-06,-1e-06,0,-6e-06,0,0,-6e-06,-3e-06,6e-06,6e-06,-1e-06,-5e-06,-2e-06,-1e-06,-4e-06,0,1e-06,-2e-06,0,5e-06,3e-06,1e-06,-3e-06,0,0,3e-06,0,-1e-06,-3e-06,2e-06,0,-2e-06,-1e-06,-4e-06,0,0,3e-06,-5e-06,2e-06,0,-6e-06,1e-06,3e-06,-1e-06,-3e-06,2e-06,-4e-06,0,2e-06,-3e-06,-5e-06,1e-06,-1e-06,-2e-06,2e-06,0,-3e-06,-4e-06,0,0,1e-06,-1e-06,-1e-06,0,-3e-06,-2e-06,1e-06,0,0,-4e-06,3e-06,2e-06,4e-06,0,0,0,5e-06,0,1e-06,1e-06,0,0,0,1e-05,1e-06,1e-06,4e-06,1e-05,6e-06,1.1e-05,-3e-06,1e-06,3e-06,-4e-06,2e-06,1e-06,-3e-06,4e-06,3e-06,-4e-06,-3e-06,3e-06,0,0,7e-06
1e-06,-4e-06,1e-06,0,-2e-06,5e-06,-1e-06,3e-06,1e-06,2e-06,-5e-06,-6e-06,6e-06,1e-06,-1e-06,4e-06,1.1e-05,1e-06,2e-06,0,0,-1e-06,1e-06,-2e-06,0,-8e-06,3e-06,4e-06,2e-06,-4e-06,3e-06,2e-06,2e-06,-1e-06,0,0,0,0,6e-06,-2e-06,-1e-06,2e-06,-4e-06,0,-1e-06,-3e-06,-2e-06,1e-06,0,-4e-06,-1e-06,1e-06,-2e-06,-5e-06,1e-06,-1e-06,-1e-06,-2e-06,1e-06,0,2e-06,-5e-06,8e-06,0,-7e-06,0,2e-06,-4e-06,1e-06,5e-06,-2e-06,-2e-06,2e-06,1e-06,1e-06,-1e-06,-2e-06,-1e-06,0,2e-06,3e-06,2e-06,-1e-06,1e-06,1e-06,2e-06,-3e-06,-1e-06,0,-1e-06,2e-06,-2e-06,0,0,-2e-06,4e-06,-2e-06,2e-06,-2e-06,-4e-06,0,2e-06,-8e-06,5e-06,-2e-06,-4e-06,-1e-06,2e-06,0,2e-06,1e-06,-3e-06,0,-2e-06,-8e-06,-1e-06,1e-06,-2e-06,1e-06,-1e-06,1e-06
0,-2e-06,-2e-06,0,1e-06,-3e-06,0,0,1e-06,0,-1e-06,6e-06,1e-06,0,-1e-06,0,2e-06,3e-06,-2e-06,0,-1e-06,-1e-06,3e-06,3e-06,-5e-06,2e-06,1e-06,0,-5e-06,4e-06,-1e-06,1e-06,2e-06,1e-06,-1e-06,4e-06,1e-06,1e-06,-3e-06,0,1e-06,2e-06,0,0,1e-06,2e-06,2e-06,1e-06,-2e-06,0,0,-1e-06,1e-06,6e-06,0,1e-06,1e-06,-1e-06,4e-06,-1e-06,5e-06,1e-06,0,0,5e-06,1e-06,-4e-06,3e-06,1e-06,-1e-06,1e-06,1e-06,0,-1e-06,-3e-06,3e-06,3e-06,2e-06,-4e-06,-4e-06,-5e-06,-3e-06,2e-06,-1e-06,-2e-06,1e-06,-1e-06,0,-3e-06,1e-06,-1e-06,-1e-06,-2e-06,1e-06,1e-06,-6e-06,2e-06,2e-06,1e-06,2e-06,-2e-06,-1e-06,9e-06,-7e-06,-2e-06,-6e-06,-1e-06,-2e-06,-1e-06,0,-1e-06,2e-06,-1e-06,3e-06,2e-06,1e-06,-1e-06,2e-06,0,1e-06,-4e-06
-1e-06,-3e-06,-3e-06,0,2e-06,0,-1e-06,0,1e-06,-1e-06,3e-06,-3e-06,-4e-06,-1e-06,-4e-06,-2e-06,-1e-06,0,0,-2e-06,1e-06,-1e-06,-1e-06,-1e-06,3e-06,-4e-06,-1e-06,-2e-06,3e-06,3e-06,-1e-06,0,0,0,0,-7e-06,-2e-06,1e-06,1e-06,-1e-06,-2e-06,3e-06,2e-06,-3e-06,0,0,-2e-06,-2e-06,2e-06,2e-06,0,0,1e-06,-1e-06,1e-06,0,5e-06,-1e-06,0,5e-06,-7e-06,-3e-06,-3e-06,0,3e-06,2e-06,-1e-06,-3e-06,-2e-06,0,0,0,-1e-06,3e-06,0,-1e-06,-3e-06,-1e-06,0,0,4e-06,5e-06,2e-06,0,1e-06,-3e-06,-1e-06,-1e-06,2e-06,-2e-06,1e-06,1e-06,-2e-06,0,-4e-06,4e-06,0,-1e-06,1e-06,-4e-06,1e-06,-1e-06,-6e-06,1e-06,-1e-06,1e-06,0,-4e-06,0,1e-06,1e-06,1e-06,3e-06,-3e-06,-1e-06,0,0,-2e-06,0,1e-06,1e-06
1e-06,5e-06,1e-06,0,2e-06,1e-06,0,0,-2e-06,1e-06,4e-06,-5e-06,5e-06,1e-06,5e-06,1e-06,4e-06,0,0,6e-06,-1e-06,2e-06,-4e-06,1e-06,1e-06,4e-06,4e-06,0,3e-06,-3e-06,1e-06,0,-2e-06,-2e-06,0,3e-06,-1e-06,-2e-06,1e-06,1e-06,0,2e-06,0,-2e-06,3e-06,0,-2e-06,1e-06,0,3e-06,0,1e-06,-2e-06,-5e-06,-1e-06,1e-06,-4e-06,0,-6e-06,-4e-06,3e-06,3e-06,3e-06,0,2e-06,-3e-06,3e-06,0,0,-1e-06,-1e-06,0,2e-06,-2e-06,2e-06,1e-06,3e-06,-2e-06,2e-06,1e-06,-6e-06,-2e-06,-2e-06,2e-06,1e-06,1e-06,0,-1e-06,-2e-06,2e-06,0,-1e-06,-1e-06,-2e-06,4e-06,-2e-06,-1e-06,7e-06,0,-2e-06,1e-06,0,3e-06,-1e-06,2e-06,-1e-06,1e-06,0,1e-06,2e-06,-1e-06,-1e-06,-1e-06,2e-06,1e-06,1e-06,2e-06,0,-1e-06,-1e-06,4e-06
1e-06,4e-06,0,-2e-06,1e-06,-1e-06,0,-3e-06,1e-06,1e-06,0,4e-06,-2e-06,-2e-06,-1e-06,0,1e-06,0,-1e-06,-1e-06,-1e-06,1e-06,2e-06,1e-06,-3e-06,-2e-06,-4e-06,0,-3e-06,-1e-06,-1e-06,0,2e-06,-2e-06,-1e-06,-4e-06,-2e-06,2e-06,-3e-06,-1e-06,-1e-06,1e-06,-2e-06,2e-06,-5e-06,0,2e-06,-1e-06,0,1e-06,0,-3e-06,1e-06,3e-06,0,0,-1e-06,1e-06,-2e-06,1e-06,-1e-06,-2e-06,-1e-06,0,4e-06,0,-1e-06,0,1e-06,-1e-06,0,0,0,1e-06,0,-2e-06,-2e-06,-1e-06,1e-06,-1e-06,5e-06,1e-06,-2e-06,-1e-06,-1e-06,1e-06,1e-06,0,1e-06,-1e-06,1e-06,2e-06,3e-06,0,-2e-06,-1e-06,2e-06,-3e-06,-1e-06,5e-06,-1e-06,-2e-06,0,3e-06,-1e-06,-1e-06,2e-06,3e-06,0,0,1e-06,0,0,-2e-06,4e-06,-2e-06,-3e-06,2e-06,1e-06,0,-4e-06
-3e-06,5e-06,4e-06,2e-06,-1e-06,1e-06,0,1e-06,1e-06,-1e-06,-2e-06,-3e-06,-1e-06,1e-06,-2e-06,2e-06,-4e-06,0,0,-1e-06,2e-06,-4e-06,3e-06,-1e-06,2e-06,3e-06,3e-06,2e-06,0,0,2e-06,0,-3e-06,0,1e-06,-3e-06,1e-06,-1e-06,2e-06,4e-06,0,0,-1e-06,1e-06,3e-06,0,-1e-06,-1e-06,0,-2e-06,0,-1e-06,0,1e-06,-1e-06,1e-06,0,0,1e-06,2e-06,1e-06,3e-06,-3e-06,-1e-06,-4e-06,-1e-06,3e-06,0,-1e-06,2e-06,0,0,-2e-06,0,-1e-06,-2e-06,2e-06,2e-06,1e-06,2e-06,-3e-06,-1e-06,1e-06,0,0,-1e-06,2e-06,1e-06,0,0,-2e-06,0,0,1e-06,3e-06,3e-06,-1e-06,1e-06,0,1e-06,-1e-06,0,-1e-06,2e-06,0,4e-06,0,3e-06,1e-06,0,1e-06,1e-06,-1e-06,1e-06,-3e-06,0,3e-06,-2e-06,1e-06,0,1e-06
3e-06,0,-5e-06,0,-2e-06,0,0,2e-06,-1e-06,0,-2e-06,-1e-06,2e-06,-1e-06,1e-06,-4e-06,2e-06,-2e-06,1e-06,1e-06,1e-06,1e-06,-2e-06,1e-06,2e-06,-2e-06,-5e-06,-2e-06,0,2e-06,-1e-06,-2e-06,1e-06,1e-06,-1e-06,2e-06,1e-06,1e-06,0,-2e-06,0,-1e-06,1e-06,1e-06,-2e-06,0,2e-06,1e-06,-1e-06,-2e-06,0,1e-06,0,-3e-06,0,0,4e-06,0,-1e-06,-2e-06,0,-1e-06,-1e-06,0,-1e-06,2e-06,1e-06,0,0,-1e-06,-1e-06,0,2e-06,-1e-06,1e-06,1e-06,-1e-06,2e-06,2e-06,0,2e-06,0,1e-06,1e-06,0,1e-06,1e-06,0,-2e-06,1e-06,1e-06,3e-06,-2e-06,-1e-06,-1e-06,-3e-06,0,-2e-06,0,-2e-06,1e-06,0,5e-06,-5e-06,2e-06,0,1e-06,-2e-06,0,-2e-06,-1e-06,-1e-06,1e-06,-1e-06,0,2e-06,-2e-06,2e-06,-1e-06,-1e-06,1e-06
0,4e-06,2e-06,-2e-06,1e-06,-2e-06,0,0,0,0,-1e-06,1e-06,-1e-06,1e-06,-1e-06,2e-06,1e-06,-1e-06,0,-3e-06,-2e-06,0,-1e-06,0,-4e-06,1e-06,3e-06,0,1e-06,-2e-06,-1e-06,-1e-06,2e-06,0,1e-06,0,0,-1e-06,-2e-06,0,-2e-06,-1e-06,1e-06,1e-06,3e-06,0,-1e-06,-1e-06,2e-06,-1e-06,0,-1e-06,1e-06,2e-06,0,-1e-06,0,1e-06,5e-06,-1e-06,-2e-06,0,2e-06,-1e-06,0,-1e-06,0,0,0,1e-06,1e-06,0,0,2e-06,1e-06,0,0,0,2e-06,-1e-06,0,0,0,0,0,-1e-06,-1e-06,0,2e-06,-1e-06,-1e-06,1e-06,2e-06,0,0,2e-06,1e-06,1e-06,0,-3e-06,0,0,-6e-06,0,0,0,1e-06,-2e-06,-2e-06,0,0,1e-06,-1e-06,1e-06,0,-1e-06,0,0,-1e-06,-1e-06,-1e-06
-1e-06,0,-2e-06,1e-06,1e-06,4e-06,0,0,0,0,1e-06,-3e-06,-1e-06,-2e-06,3e-06,0,-5e-06,-1e-06,0,2e-06,1e-06,4e-06,1e-06,-1e-06,1e-06,-1e-06,-4e-06,-1e-06,0,-1e-06,2e-06,1e-06,-2e-06,0,0,0,0,0,3e-06,0,2e-06,-2e-06,-1e-06,0,-3e-06,1e-06,1e-06,0,-2e-06,1e-06,0,1e-06,-2e-06,0,1e-06,0,-5e-06,0,2e-06,2e-06,3e-06,-2e-06,-2e-06,0,0,0,2e-06,1e-06,-1e-06,0,0,0,-1e-06,-5e-06,-1e-06,0,0,0,-2e-06,0,0,0,0,-1e-06,-1e-06,0,0,0,-1e-06,0,1e-06,1e-06,0,1e-06,-1e-06,0,-1e-06,-4e-06,0,5e-06,-1e-06,1e-06,4e-06,2e-06,0,0,0,0,1e-06,0,0,0,0,-1e-06,-1e-06,-2e-06,2e-06,-1e-06,1e-06,1e-06,-2e-06
0,2e-06,3e-06,0,0,-4e-06,0,-1e-06,0,0,3e-06,1e-06,1e-06,2e-06,-2e-06,-1e-06,-2e-06,0,-1e-06,2e-06,2e-06,-3e-06,1e-06,1e-06,2e-06,-2e-06,2e-06,0,0,1e-06,-1e-06,0,0,1e-06,0,4e-06,0,1e-06,-3e-06,1e-06,-2e-06,-2e-06,0,-1e-06,2e-06,0,0,1e-06,1e-06,2e-06,0,1e-06,2e-06,-2e-06,-1e-06,-1e-06,2e-06,0,-1e-06,-1e-06,-3e-06,1e-06,0,0,-1e-06,-1e-06,-2e-06,-1e-06,0,0,-1e-06,0,1e-06,2e-06,0,1e-06,-1e-06,0,0,-1e-06,1e-06,1e-06,0,1e-06,0,1e-06,-1e-06,0,0,0,-1e-06,2e-06,0,0,0,-2e-06,0,0,0,-1e-06,0,0,-2e-06,0,0,-5e-06,-1e-06,2e-06,1e-06,1e-06,1e-06,0,0,1e-06,2e-06,1e-06,-2e-06,0,0,1e-06,2e-06
1e-06,3e-06,-2e-06,-1e-06,0,3e-06,0,-1e-06,0,0,1e-06,0,0,-2e-06,-1e-06,1e-06,1e-06,-1e-06,0,-1e-06,-1e-06,1e-06,-1e-06,-1e-06,-2e-06,0,-3e-06,2e-06,-2e-06,1e-06,-1e-06,-1e-06,0,0,-1e-06,0,0,-1e-06,2e-06,-1e-06,1e-06,-1e-06,2e-06,-1e-06,-1e-06,0,1e-06,-1e-06,-1e-06,1e-06,0,0,-1e-06,2e-06,0,0,3e-06,0,-2e-06,-1e-06,1e-06,1e-06,1e-06,0,-3e-06,1e-06,0,1e-06,0,0,0,0,0,-1e-06,1e-06,-1e-06,1e-06,1e-06,-1e-06,0,-2e-06,-1e-06,0,-1e-06,0,-1e-06,0,0,0,0,1e-06,1e-06,0,0,-1e-06,3e-06,1e-06,1e-06,0,0,1e-06,0,0,-1e-06,1e-06,-1e-06,-1e-06,0,-1e-06,1e-06,0,0,1e-06,-1e-06,-1e-06,2e-06,2e-06,0,0,-1e-06,-2e-06
-1e-06,2e-06,0,0,0,-2e-06,0,0,0,0,-1e-06,-3e-06,-2e-06,2e-06,2e-06,-2e-06,-3e-06,0,1e-06,1e-06,-1e-06,-1e-06,-1e-06,1e-06,0,0,1e-06,-2e-06,3e-06,1e-06,2e-06,0,-1e-06,-1e-06,0,0,0,1e-06,-1e-06,0,-1e-06,-2e-06,0,-1e-06,0,0,-1e-06,1e-06,2e-06,-1e-06,0,0,0,0,-1e-06,0,-3e-06,0,-1e-06,1e-06,1e-06,1e-06,-1e-06,0,2e-06,-1e-06,-1e-06,0,0,-1e-06,0,0,-1e-06,1e-06,-1e-06,0,-1e-06,0,-2e-06,0,1e-06,1e-06,-1e-06,0,0,0,2e-06,0,0,0,-1e-06,1e-06,-2e-06,0,1e-06,-1e-06,-1e-06,0,0,-1e-06,0,0,2e-06,0,0,6e-06,0,-1e-06,-1e-06,0,-1e-06,-1e-06,-1e-06,1e-06,0,-1e-06,-2e-06,0,0,0,0
1e-06,1e-06,1e-06,0,-1e-06,-1e-06,0,1e-06,0,0,-2e-06,1e-06,2e-06,-1e-06,-1e-06,2e-06,-2e-06,1e-06,0,-2e-06,1e-06,1e-06,1e-06,0,2e-06,1e-06,-1e-06,0,0,-3e-06,-2e-06,1e-06,1e-06,-1e-06,0,0,0,-1e-06,0,1e-06,0,-1e-06,-1e-06,0,0,0,1e-06,0,-1e-06,-2e-06,0,0,1e-06,-2e-06,0,0,0,0,-2e-06,-1e-06,-3e-06,0,0,0,1e-06,0,-2e-06,1e-06,0,1e-06,0,0,1e-06,-1e-06,0,-1e-06,1e-06,0,-1e-06,0,-2e-06,-1e-06,-1e-06,0,0,0,1e-06,0,0,0,0,0,1e-06,0,-1e-06,0,0,1e-06,0,0,-1e-06,0,-3e-06,-1e-06,0,-1e-06,-1e-06,0,0,0,1e-06,0,0,-1e-06,1e-06,0,1e-06,0,0,0,0
0,-2e-06,0,0,0,2e-06,0,0,0,0,-1e-06,0,0,1e-06,1e-06,-1e-06,3e-06,0,0,-1e-06,0,0,1e-06,-1e-06,-2e-06,-1e-06,0,0,-1e-06,1e-06,0,0,0,0,0,-2e-06,0,1e-06,0,0,0,0,0,1e-06,0,0,-1e-06,-1e-06,0,-1e-06,0,0,-1e-06,2e-06,0,0,0,0,1e-06,0,3e-06,0,0,0,2e-06,-1e-06,0,-1e-06,0,0,0,0,0,1e-06,1e-06,0,-1e-06,0,-1e-06,0,2e-06,0,1e-06,0,1e-06,0,0,0,-1e-06,0,1e-06,0,1e-06,0,1e-06,1e-06,0,2e-06,0,1e-06,0,-1e-06,4e-06,1e-06,0,1e-06,0,2e-06,0,-1e-06,0,0,-1e-06,1e-06,-1e-06,0,0,1e-06,0,0,1e-06
1e-06,-1e-06,-1e-06,0,0,-1e-06,0,0,0,0,1e-06,-2e-06,-1e-06,-2e-06,-2e-06,0,0,0,0,2e-06,-1e-06,1e-06,-1e-06,1e-06,0,2e-06,1e-06,1e-06,0,1e-06,2e-06,-1e-06,0,0,0,-2e-06,0,-1e-06,1e-06,0,0,0,1e-06,1e-06,1e-06,-1e-06,0,1e-06,0,1e-06,0,0,1e-06,1e-06,0,0,1e-06,0,3e-06,0,-2e-06,0,0,0,2e-06,1e-06,-1e-06,1e-06,0,0,0,0,-1e-06,1e-06,0,1e-06,0,0,0,-1e-06,-1e-06,0,1e-06,0,0,1e-06,0,0,0,0,0,-1e-06,-1e-06,0,-1e-06,-2e-06,-1e-06,1e-06,0,1e-06,1e-06,0,-3e-06,2e-06,1e-06,-1e-06,0,1e-06,0,-1e-06,0,0,1e-06,-1e-06,1e-06,1e-06,-1e-06,-1e-06,0,0,-2e-06
-1e-06,-4e-06,-2e-06,-1e-06,1e-06,0,0,0,0,0,2e-06,1e-06,2e-06,2e-06,0,0,-2e-06,0,0,0,0,1e-06,0,-1e-06,2e-06,-2e-06,-1e-06,-1e-06,0,0,-2e-06,0,-1e-06,0,0,1e-06,0,0,-1e-06,0,0,1e-06,0,0,-2e-06,0,0,-1e-06,0,2e-06,0,-1e-06,-1e-06,-2e-06,0,0,1e-06,0,0,0,1e-06,-1e-06,-1e-06,0,-1e-06,-1e-06,0,0,0,0,0,0,1e-06,-1e-06,-1e-06,0,0,0,0,-1e-06,0,0,0,1e-06,0,-1e-06,-2e-06,0,0,0,1e-06,-1e-06,1e-06,0,0,2e-06,1e-06,-1e-06,0,-1e-06,0,0,0,-2e-06,0,-3e-06,0,-2e-06,0,-1e-06,0,0,0,1e-06,0,1e-06,1e-06,0,0,0,1e-06
1e-06,0,3e-06,0,1e-06,1e-06,0,-1e-06,0,0,1e-06,-1e-06,-1e-06,-2e-06,2e-06,0,3e-06,0,1e-06,1e-06,0,-3e-06,1e-06,0,0,2e-06,2e-06,-1e-06,1e-06,-1e-06,1e-06,1e-06,0,-1e-06,0,0,0,1e-06,1e-06,0,-1e-06,1e-06,-1e-06,1e-06,2e-06,0,0,0,1e-06,1e-06,0,0,0,1e-06,0,0,-3e-06,0,1e-06,0,1e-06,0,0,0,-1e-06,0,1e-06,0,0,0,0,0,0,1e-06,0,0,0,0,1e-06,0,0,0,0,0,0,0,0,0,0,0,0,-1e-06,0,0,-1e-06,0,0,1e-06,0,-1e-06,-1e-06,0,3e-06,-1e-06,0,0,0,-2e-06,-1e-06,0,0,0,0,-1e-06,0,-1e-06,0,1e-06,0,0,-1e-06
0,-3e-06,0,0,0,-2e-06,0,0,0,0,-1e-06,-1e-06,-1e-06,2e-06,-2e-06,2e-06,2e-06,0,0,1e-06,0,2e-06,0,1e-06,-1e-06,-2e-06,-2e-06,1e-06,0,-1e-06,1e-06,0,1e-06,0,0,-1e-06,0,-1e-06,-2e-06,1e-06,1e-06,1e-06,0,-1e-06,-2e-06,1e-06,0,0,-1e-06,-1e-06,0,1e-06,0,1e-06,0,0,-1e-06,0,-1e-06,0,-3e-06,0,0,0,0,-1e-06,0,0,0,1e-06,0,0,-1e-06,-2e-06,0,0,1e-06,0,2e-06,0,0,0,0,0,0,1e-06,1e-06,0,0,0,1e-06,-2e-06,-1e-06,0,0,-1e-06,-1e-06,-1e-06,0,1e-06,0,1e-06,-4e-06,1e-06,0,3e-06,0,1e-06,0,0,0,0,-1e-06,1e-06,1e-06,0,0,-1e-06,0,0,1e-06
