1.3e-05,5.3e-05,3.4e-05,0.000627,0.000729,0.000477,0.000142,0.000374,4.9e-05,2e-05,4.6e-05,6.5e-05,2.4e-05,8.3e-05,5.9e-05,3e-05,6.2e-05,3.3e-05,0.000132,2.2e-05,0.000114,0.00034,4.4e-05,2.5e-05,3.4e-05,1e-05,8e-06,4.2e-05,2.6e-05,3.9e-05,2.9e-05,0.000323,0.000429,2.8e-05,5.8e-05,3.7e-05,9.6e-05,1.9e-05,2.5e-05,0.000113,6.1e-05,5.4e-05,7e-06,1.5e-05,1.4e-05,1.4e-05,2.2e-05,1.3e-05,3e-05,4e-06,2e-06,3.7e-05,0.000247,0.000115,0.000136,8.6e-05,5.5e-05,0.000128,0.000365,5.9e-05,7.6e-05,1.4e-05,7.6e-05,7.2e-05,3.1e-05,4.6e-05,5.5e-05,2.2e-05,5e-06,4.2e-05,3.4e-05,2.7e-05,1.5e-05,1.4e-05,1.8e-05,2.7e-05,2.4e-05,5.1e-05,3.1e-05,0.000157,0.000286,7.9e-05,0.000372,0.000766,0.000603,0.000402,0.000718,0.000434,0.000347,0.000137,0.000349,9.4e-05,0.000156,5.2e-05,4e-06,1.7e-05,3.8e-05,2.5e-05,5.4e-05,8e-06,3.7e-05,3.9e-05,1e-05,3.9e-05,1.9e-05,5e-06,4.9e-05,1.4e-05,0.000434,0.000282,0.00022,0.000141,5.7e-05,3.6e-05,0.000238,9.5e-05,7.2e-05,6.5e-05,8.6e-05,7.7e-05,4.3e-05
6.7e-05,0.000117,0.000163,0.001294,0.002255,0.000929,0.000981,0.000187,0.000463,0.000195,0.000176,8.4e-05,0.000157,0.000119,0.000222,0.000182,0.00019,0.00033,0.000354,9.9e-05,0.000311,0.000561,0.000204,0.000166,0.00014,0.000145,7.9e-05,6.4e-05,5e-05,0.000152,0.000144,0.000762,0.00079,0.000365,0.000306,0.000263,0.000351,0.000334,0.000312,8e-05,0.000206,0.000109,0.000128,7.6e-05,6e-05,8.1e-05,4.1e-05,6.8e-05,0.00012,8.1e-05,5e-06,1e-04,0.000655,0.000339,0.000107,0.000203,0.000204,0.000209,0.000575,0.000584,0.000412,0.000211,0.000298,0.000264,4.9e-05,0.000118,0.000195,0.000129,8e-05,0.000101,0.000138,0.000145,0.000101,5.3e-05,5.7e-05,9.7e-05,0.000107,0.000135,9.1e-05,0.000366,0.000887,0.000747,0.000721,0.001768,0.001366,0.001168,0.000432,0.001114,0.000706,0.000649,0.000317,0.000309,0.000276,0.000223,0.000191,0.000163,0.000171,0.000166,0.000157,0.000187,0.000124,0.000152,0.000107,0.000108,0.000136,0.000122,0.000102,0.000106,0.000967,0.000884,0.00089,8.7e-05,0.000113,0.000154,0.000463,0.000126,0.000175,0.000277,0.00011,0.000239,0.000278
8.4e-05,5e-05,1.5e-05,0.000965,0.002839,0.001472,0.00085,0.000237,0.000468,0.000396,6.6e-05,0.000217,0.000122,2.1e-05,9e-05,6.9e-05,2.2e-05,0.000481,0.000926,0.000788,0.000263,0.000453,0.000372,0.000139,0.00013,6.3e-05,4e-05,4.2e-05,9e-05,0.000107,6.2e-05,0.000966,0.000227,0.000262,0.00023,0.000128,0.000134,0.000178,0.000122,0.000248,0.000194,7.4e-05,0.000116,6.9e-05,4.8e-05,4e-05,3.4e-05,6.8e-05,6.6e-05,7.7e-05,0.000116,7.1e-05,0.000947,0.000345,0.000335,0.000152,0.000257,8.1e-05,0.000451,0.000546,0.000112,5.1e-05,0.000376,0.000482,0.000261,4.2e-05,6.3e-05,2.5e-05,2.4e-05,3e-05,2.9e-05,9e-05,5.5e-05,4.7e-05,2.8e-05,4.2e-05,6.4e-05,3.1e-05,4.3e-05,0.000417,0.00094,0.000194,0.000391,0.000567,0.002503,0.002507,0.001735,0.001056,0.000368,0.000217,0.000161,7.9e-05,0.000187,5.7e-05,0.000152,0.000134,7.9e-05,0.000112,2.9e-05,0.000131,2.6e-05,6.3e-05,6.8e-05,7.1e-05,7.9e-05,8e-05,3.5e-05,5.7e-05,0.001018,0.001201,0.000475,0.00047,0.000199,0.000126,0.000222,0.000322,0.000244,9.9e-05,0.000212,0.000113,6.2e-05
4.1e-05,2.4e-05,4.4e-05,0.00045,0.002553,0.001845,0.001391,0.000188,0.000352,5e-05,0.000222,0.000292,0.00017,8.1e-05,9.8e-05,5.7e-05,4.6e-05,0.00075,0.000345,0.000785,0.001257,0.000848,0.00083,0.000263,0.000261,0.000232,0.00016,2.8e-05,9.6e-05,8.7e-05,0.000181,0.001338,0.001,0.000959,0.000268,0.000188,0.000258,0.000322,0.000198,0.000207,7.8e-05,0.00014,0.000203,0.000144,5.8e-05,3.6e-05,3.5e-05,2.5e-05,2.6e-05,5.1e-05,7e-05,8.2e-05,0.001409,0.001104,0.000709,0.00058,0.00052,0.000519,0.000596,0.000506,0.00044,0.000238,0.000429,0.000776,0.000661,0.00049,0.000221,0.000111,3e-05,1.9e-05,1.3e-05,6.3e-05,6.8e-05,6.4e-05,3.6e-05,1.9e-05,4.4e-05,5.3e-05,6.5e-05,0.000522,0.00092,0.001188,0.000561,0.000172,0.003884,0.001098,0.001272,0.000342,0.000145,0.000191,0.000179,0.000176,0.000153,0.000135,0.000107,7.2e-05,0.000151,8.6e-05,3.9e-05,7.4e-05,6.1e-05,2.9e-05,5.7e-05,9.1e-05,8.7e-05,0.000127,4.9e-05,6.2e-05,0.000936,0.001283,0.002152,0.001765,0.00127,0.000763,0.000397,0.000295,0.000199,0.000204,0.000336,0.000312,0.000168
2.6e-05,2.5e-05,6.3e-05,0.001534,0.003862,0.002025,0.001655,0.001668,0.000908,0.000344,0.000112,0.000371,0.000193,8.3e-05,4.5e-05,7.6e-05,6.8e-05,0.000964,0.001283,0.000119,0.001178,0.002461,0.000667,0.000222,0.000376,0.000108,6.8e-05,5.7e-05,2.9e-05,5e-06,0.000149,0.001337,0.002862,0.000923,0.000334,0.000264,0.000139,0.000139,0.000323,0.000399,0.000192,0.000104,3.7e-05,8e-06,2.4e-05,7e-06,3e-06,3.6e-05,7.4e-05,4.6e-05,7.9e-05,8.5e-05,0.001324,0.000364,6.8e-05,8.6e-05,0.000258,7e-05,0.000324,0.000226,5.8e-05,7.3e-05,0.000206,0.000483,0.000235,5.8e-05,4e-05,2.9e-05,5.5e-05,4.3e-05,1.9e-05,6.8e-05,6e-05,6.5e-05,3.9e-05,5.2e-05,3.4e-05,1.7e-05,3.8e-05,0.000653,0.001861,0.000638,0.000128,0.002559,0.002569,0.001683,0.001137,0.00055,0.000456,0.000195,0.000147,3.7e-05,8e-05,6.9e-05,0.000163,0.000122,8.6e-05,7e-05,4.9e-05,3e-05,1.9e-05,3e-05,2.1e-05,2e-05,4.3e-05,3.4e-05,0.000139,7.8e-05,0.000569,0.002317,0.001859,0.000909,0.000142,0.000198,0.000209,0.00025,0.000272,0.000324,0.000111,9.8e-05,8.2e-05
4.9e-05,1e-05,4.3e-05,0.004564,0.003923,0.001396,0.001372,0.000495,0.000481,0.000114,8.1e-05,0.000786,0.000283,0.000121,3e-05,7.2e-05,6.4e-05,0.001152,0.000682,0.000925,0.000523,0.001167,0.002205,0.0012,0.000435,0.000131,6e-05,6e-05,8.2e-05,3.8e-05,0.000105,0.001684,0.003168,0.001767,0.00063,0.000138,6e-05,4.1e-05,0.000692,0.000487,0.000231,0.000156,8.3e-05,4e-05,5.1e-05,5e-05,2.9e-05,4.6e-05,0.000118,3.9e-05,2.1e-05,0.000124,0.000512,0.000795,0.000162,0.000182,0.000201,0.000214,0.000679,0.000112,3.5e-05,7e-06,0.000454,0.000145,0.000158,8.9e-05,4.9e-05,5.6e-05,9.2e-05,2.1e-05,4.2e-05,5.4e-05,0.000178,5e-05,3.8e-05,2.8e-05,5.7e-05,4.9e-05,2.8e-05,0.000738,0.00195,0.000335,0.000498,0.004817,0.004027,0.004605,0.004206,0.001372,0.000593,0.000131,0.000156,0.000133,5.9e-05,6.2e-05,0.000187,2.9e-05,0.000112,4.1e-05,4e-05,3.4e-05,5.5e-05,8e-06,3e-06,6e-06,2.3e-05,3.5e-05,9.2e-05,2.9e-05,0.000895,0.002138,0.001054,0.000747,0.000609,0.000871,0.000556,1e-04,0.000328,0.000102,7.8e-05,9.2e-05,4e-06
3.6e-05,3.5e-05,4.8e-05,0.007614,0.00823,0.003634,0.002018,0.000945,0.000775,0.000444,0.00016,0.001209,0.000831,0.000241,0.000129,3.6e-05,7.4e-05,0.001345,0.001887,0.001552,0.001497,0.001811,0.002422,0.001232,0.000235,0.000271,0.000241,0.000225,0.000219,0.000106,0.00014,0.001811,0.000471,0.001009,0.000702,0.000403,0.000138,5.3e-05,0.000769,0.001453,0.000852,0.000344,0.000157,5.4e-05,1.6e-05,3.1e-05,2.5e-05,1.6e-05,6.9e-05,9e-06,4.7e-05,9.7e-05,0.001521,0.001011,0.000973,0.000536,0.00022,0.000259,0.001095,0.000728,0.000209,0.000103,0.000878,0.00073,0.000437,0.000135,2.2e-05,5.2e-05,6.6e-05,9.8e-05,5.3e-05,7.6e-05,0.000288,0.00022,0.000119,2e-05,0.000147,6.9e-05,7e-05,0.000765,0.000548,0.001754,0.000526,0.005756,0.00833,0.009262,0.00142,0.000737,0.00033,0.000139,4.7e-05,3.1e-05,6.5e-05,5.8e-05,0.000109,0.000225,0.000173,8.9e-05,4e-05,3.4e-05,2.5e-05,2.9e-05,1.1e-05,3.5e-05,5e-05,4.8e-05,9.6e-05,8.6e-05,0.002225,0.002546,0.001245,0.000646,0.000336,0.001013,0.000569,0.000156,0.000338,0.000257,0.00012,6e-05,2.9e-05
0.000103,7.9e-05,5e-05,0.008949,0.00417,0.002421,0.001235,0.001572,0.00078,0.000338,0.000433,0.001246,0.000859,0.000492,0.000132,4.7e-05,3.1e-05,0.001601,0.000482,0.000197,0.001018,0.003041,0.002028,0.000994,0.000437,0.000327,0.000198,0.000356,0.000215,0.000122,0.000256,0.002186,0.003067,0.001751,0.000693,0.000306,0.000167,5.1e-05,0.000678,0.00067,0.000607,0.000257,9.2e-05,2.6e-05,1e-05,1e-05,1.7e-05,8.5e-05,0.000129,5.3e-05,9.5e-05,7.1e-05,0.002573,0.001697,0.00044,0.000779,0.000865,0.000838,0.000807,0.000543,0.000345,0.000175,0.001133,0.000929,0.000432,0.000191,9.2e-05,8.1e-05,9.8e-05,9.8e-05,3.7e-05,9.3e-05,0.000283,0.000275,0.000154,4.8e-05,0.000189,0.000184,0.00017,0.000799,0.001758,0.001842,0.002582,0.006799,0.010239,0.00663,0.006941,0.003277,0.001398,0.000438,0.000155,4.5e-05,5.7e-05,5.3e-05,0.000105,0.000282,0.000148,3.1e-05,3.8e-05,4.6e-05,5.5e-05,1.5e-05,2.6e-05,3.5e-05,2.4e-05,3.6e-05,0.000314,0.000234,0.003372,0.002092,0.001094,0.001216,0.00046,0.000948,0.000771,0.000343,0.000328,7.7e-05,5e-05,4.1e-05,3.8e-05
0.000326,0.000139,8.2e-05,0.008225,0.014158,0.012737,0.004969,0.002665,0.001099,0.00064,0.000639,0.000671,0.000118,0.000167,2.6e-05,7.9e-05,2.5e-05,0.001551,0.001786,0.001126,0.001604,0.003184,0.001642,0.001039,0.000267,0.00033,0.000716,0.000571,0.000139,0.000243,0.000561,0.002008,0.003774,0.002251,0.000705,0.000156,0.000119,0.000234,0.000618,0.00104,0.000418,0.000165,3.7e-05,2e-06,3.1e-05,3.6e-05,4.8e-05,0.000171,0.000113,0.000167,9e-05,6.8e-05,0.002721,0.002839,0.001418,0.000301,0.000418,0.000189,0.000799,0.000442,0.000106,0.000278,0.001227,0.000617,0.000311,3.5e-05,4.8e-05,6.6e-05,5.8e-05,6.7e-05,1e-05,0.000112,0.00025,0.000133,0.000193,0.000166,0.000275,5.8e-05,3.5e-05,0.000818,0.001799,0.002506,0.000517,0.003591,0.003392,0.002303,0.00312,0.002602,0.001172,0.000322,6.7e-05,2.1e-05,9.5e-05,7.5e-05,3e-05,0.000258,1e-04,3.2e-05,7.2e-05,1.9e-05,2.6e-05,2.1e-05,2.6e-05,6.2e-05,0.000118,3.1e-05,0.000412,0.000277,0.003685,0.006369,0.002446,0.000921,0.000347,0.001109,0.000752,0.000193,0.000108,0.00021,0.000127,8.3e-05,3.7e-05
0.00036,0.00029,6.9e-05,0.00681,0.011619,0.004618,0.005279,0.002267,0.002495,0.001337,0.000468,0.000572,0.000368,0.000108,8.9e-05,0.000176,0.000118,0.001042,0.000567,4.8e-05,0.001401,0.003892,0.003128,0.001339,0.000374,0.000438,0.000617,0.000953,0.000798,0.000557,0.000499,0.002834,0.003024,0.001139,0.000157,7e-05,0.000195,0.000293,0.000519,0.000241,0.000263,0.000128,2.2e-05,2.1e-05,5.6e-05,7e-06,3.8e-05,0.000145,0.000164,0.000161,5.1e-05,0.000115,0.002203,0.002201,0.001619,0.000988,0.000545,0.000296,0.001416,0.000854,0.000244,0.000258,0.001152,0.00053,0.000152,2.7e-05,6.2e-05,2.8e-05,0.000112,0.00014,0.000127,0.000106,0.000197,0.000125,0.00014,9.9e-05,0.000104,0.000167,0.000108,0.000798,0.000807,0.001487,0.001274,0.003044,0.006791,0.008892,0.005897,0.002846,0.001316,0.000352,0.000298,0.000234,0.000149,5.4e-05,0.00011,0.000351,0.000221,4.8e-05,5.9e-05,7.4e-05,5.5e-05,6.6e-05,8.1e-05,7.9e-05,0.000115,0.000108,0.000315,0.000204,0.00318,0.007017,0.005596,0.002484,0.000863,0.00111,0.000952,0.000603,0.000263,0.000227,0.000341,0.000193,0.000109
0.00019,6.4e-05,0.000112,0.005929,0.004608,0.008107,0.004866,0.002448,0.002465,0.001616,0.000585,0.000311,0.000101,4.5e-05,8.8e-05,0.000158,0.000128,0.000339,0.000224,0.000121,0.001468,0.001615,0.000167,0.00043,2e-04,0.000194,0.000753,0.000174,0.000446,0.00029,0.000738,0.002553,0.001394,0.00058,5.8e-05,0.000148,0.000153,4.1e-05,0.000277,0.000412,0.000117,5.7e-05,1.1e-05,1.5e-05,4.1e-05,3.4e-05,7e-06,9.2e-05,0.00013,7.2e-05,6.4e-05,9e-05,0.001615,0.00029,0.000873,0.00092,0.000453,0.000502,9e-04,0.000573,0.000291,8e-05,0.00071,0.000449,0.000205,8.5e-05,6.5e-05,6.4e-05,0.000106,2e-05,8.1e-05,6.6e-05,4.8e-05,2e-05,0.000147,0.000134,9.6e-05,2.2e-05,3e-05,0.000635,0.00119,0.001472,0.000995,0.001526,0.004075,0.005256,0.004859,0.00353,0.001674,0.000544,0.000121,0.000199,0.00014,0.000128,0.000193,0.000325,0.000177,7e-05,5.3e-05,2.4e-05,1.7e-05,3.9e-05,4e-05,7e-06,0.000147,0.000128,0.000292,0.000285,0.00195,0.003727,0.00062,0.000413,0.000468,0.001126,0.000309,0.00026,0.000145,0.000253,0.000215,9.6e-05,1.7e-05
7.8e-05,2.2e-05,9.4e-05,0.004143,0.001616,0.002132,0.000609,0.001244,0.000654,6.1e-05,0.000157,0.000142,6.8e-05,2.4e-05,6.2e-05,3.8e-05,5.1e-05,0.000231,2.5e-05,0.000106,0.001519,0.001301,0.000674,0.000259,6.1e-05,0.000144,0.000616,0.000606,0.000101,5.3e-05,0.000486,0.001485,0.000388,0.000856,0.000475,7.7e-05,0.000136,6.3e-05,0.000187,5.8e-05,3.2e-05,9e-06,1e-05,9e-06,2e-05,1.2e-05,1.7e-05,2.8e-05,9.4e-05,7.2e-05,5.3e-05,0.000119,0.000928,0.000945,6.9e-05,0.000643,5.4e-05,0.00012,0.000295,0.00024,0.000194,6.4e-05,0.000361,0.000194,5.9e-05,4.9e-05,6e-06,4.6e-05,1.1e-05,4e-05,5.3e-05,9e-05,0.000128,5.5e-05,8.3e-05,0.000108,9.6e-05,3.3e-05,3.9e-05,0.000488,0.001226,0.000529,0.001018,0.000933,0.002026,0.00247,0.001975,9.3e-05,0.000179,0.000133,0.000103,4.8e-05,3.9e-05,4.9e-05,7.1e-05,0.000181,6.8e-05,2.9e-05,2.1e-05,1.4e-05,2.6e-05,3.9e-05,3.1e-05,1.5e-05,8.2e-05,3.8e-05,8.7e-05,8.3e-05,0.000872,0.001363,0.001381,0.000831,0.000261,0.000596,0.00043,0.00017,0.000134,0.000238,8e-06,3e-06,2.7e-05
2.3e-05,7e-06,5.5e-05,0.001446,0.002853,0.00181,0.000326,0.000587,0.00059,0.00027,3.3e-05,9e-05,8.9e-05,2.4e-05,3.3e-05,3.5e-05,3.3e-05,0.000193,0.000176,0.000113,0.001486,0.000767,0.000209,0.000127,3.1e-05,0.000144,0.000374,5.7e-05,0.000141,2.5e-05,0.000283,0.001094,0.000853,0.000743,0.000224,3.8e-05,4.1e-05,4.6e-05,8.3e-05,9.5e-05,8e-05,4e-05,3.1e-05,2e-05,8e-06,1e-05,2.6e-05,2.9e-05,6.2e-05,3e-05,2.2e-05,5.8e-05,0.000459,0.000411,0.000412,0.000522,0.00028,0.000314,0.000222,0.000245,0.000106,3.9e-05,9.2e-05,6.5e-05,5.1e-05,5.5e-05,4e-05,2.8e-05,3e-05,4.9e-05,7e-06,6.2e-05,0.000154,0.000113,7e-06,0.000113,8.9e-05,3.4e-05,4e-05,0.00046,0.000687,0.000718,0.001058,0.000411,0.001297,0.001202,0.000299,0.000359,0.000165,4.7e-05,5.7e-05,2.6e-05,9e-06,2e-05,4.8e-05,7e-05,2.5e-05,1.6e-05,2e-06,6e-06,3.8e-05,1.4e-05,1.3e-05,1.7e-05,1.8e-05,5.6e-05,5.8e-05,7.8e-05,0.001111,0.001002,0.000747,0.000114,0.000199,0.000372,0.000667,0.000202,0.000109,0.000131,7.1e-05,5.6e-05,2.3e-05
3.3e-05,1.2e-05,3.7e-05,0.001639,0.001635,0.001666,0.000925,0.00038,0.00048,0.000318,0.000128,0.000138,2.1e-05,3.1e-05,3.1e-05,2.7e-05,2.5e-05,0.000255,0.000152,0.000101,0.00103,0.000656,0.000436,0.000168,3.9e-05,0.000177,0.000383,0.000245,0.000149,2.9e-05,0.000147,0.000548,0.002027,0.001038,0.000408,0.000117,0.000103,5e-05,0.000462,0.000344,0.000135,8.8e-05,2.5e-05,9e-06,9e-06,7e-06,4e-06,6.9e-05,6.1e-05,4.9e-05,2.3e-05,4.4e-05,0.000203,0.000495,5.5e-05,0.000229,0.000437,0.000312,0.000305,0.000505,0.000222,7.3e-05,0.000351,0.000186,4.2e-05,5.7e-05,2e-05,1e-05,1.3e-05,2e-05,1.8e-05,4.2e-05,0.000123,0.000103,8e-05,4.5e-05,6.8e-05,6.4e-05,3.2e-05,0.000426,0.000814,0.000595,0.001348,0.001629,0.002848,0.001556,0.001306,0.000683,1e-04,0.000146,3.4e-05,2.5e-05,1.2e-05,1.9e-05,2.5e-05,4.8e-05,5e-05,1.8e-05,1.6e-05,3e-06,3.5e-05,2.5e-05,1.7e-05,3.1e-05,2.3e-05,1.4e-05,1.6e-05,3.2e-05,0.001134,0.001245,0.000833,4e-04,9.2e-05,9e-06,0.000727,0.000228,0.000195,0.000141,0.000115,8.1e-05,3.8e-05
5.3e-05,5.2e-05,2.5e-05,0.002961,0.002108,0.003645,0.000829,0.000385,0.001035,0.000456,0.00026,4e-05,3.5e-05,3.9e-05,1.8e-05,1.4e-05,3.6e-05,0.000684,0.000777,0.000664,0.000654,0.000784,0.000391,0.000258,0.000129,0.00018,0.000208,0.000292,9.4e-05,6.6e-05,0.000234,0.000101,0.002556,0.000858,0.000248,7.4e-05,0.000122,1.5e-05,0.000712,0.000443,0.000201,6.3e-05,2e-05,1.1e-05,1.6e-05,8e-06,2.4e-05,9.3e-05,2.2e-05,4.5e-05,3.5e-05,5e-05,0.000325,0.000395,0.00013,0.000109,0.000311,0.000131,0.000167,0.000595,0.000315,0.000111,0.00046,0.000205,9.9e-05,4.1e-05,3.1e-05,1.1e-05,1.2e-05,1.8e-05,3.4e-05,7e-05,6.3e-05,8e-06,3.3e-05,2.3e-05,5.7e-05,8.3e-05,3e-05,5e-04,0.001123,0.000626,0.002053,0.000609,0.00331,0.002346,0.001139,0.00057,0.000317,6.4e-05,7.5e-05,5.1e-05,1.4e-05,4e-06,3e-06,7.5e-05,6.1e-05,2.5e-05,1.4e-05,1.5e-05,3.7e-05,9e-06,2e-05,5e-05,2.6e-05,3.5e-05,9e-06,7e-05,0.000626,0.002157,0.000837,0.000306,0.000167,0.00025,0.001299,0.000677,0.000299,0.000158,0.000167,0.000129,5.9e-05
3.9e-05,3.9e-05,5.4e-05,0.002875,0.002498,0.002657,0.001631,0.000123,0.001638,0.00114,0.000551,0.000101,5.3e-05,2.9e-05,4.7e-05,5.6e-05,7.2e-05,0.000662,0.000412,0.000871,0.001161,0.001523,0.000873,0.000514,0.000173,0.000128,0.000155,0.000363,0.000336,0.000159,0.000344,0.000139,0.002484,0.001856,0.000769,0.000261,9.9e-05,0.000173,0.000528,0.000387,0.00014,6.2e-05,4.2e-05,1.9e-05,5e-06,2.7e-05,3.5e-05,7.8e-05,0.000111,6.9e-05,6.3e-05,0.000102,0.000834,0.001642,0.000922,0.000197,0.000167,0.000191,0.000226,0.000763,0.000426,0.000162,0.00043,0.00027,0.000166,6.8e-05,2.4e-05,3.3e-05,3.5e-05,4e-05,3.8e-05,3e-05,9e-06,1.3e-05,1.9e-05,3.8e-05,4e-05,7.8e-05,0.000136,0.000591,0.000533,0.000719,0.00209,0.002813,0.004466,0.005778,0.003734,0.001495,0.000517,0.000147,5.7e-05,6e-05,3.4e-05,1.3e-05,1.4e-05,5.3e-05,4.2e-05,3.9e-05,1.8e-05,1.4e-05,5.9e-05,7.1e-05,4.8e-05,2.6e-05,4.9e-05,2.5e-05,4.3e-05,9.5e-05,0.000237,0.001636,0.002014,0.001895,0.000865,0.00057,0.001791,0.000935,0.000435,1e-04,0.000101,9.4e-05,4.3e-05
2.9e-05,5e-06,9e-06,0.001736,0.003461,0.003563,0.001959,0.000586,0.001531,0.000608,0.000318,0.000184,0.000131,8.2e-05,2.9e-05,4.8e-05,8.5e-05,0.000291,0.000892,0.000564,0.001252,0.001794,0.000908,0.000243,0.000105,0.000333,0.000602,0.000265,8.9e-05,9.6e-05,0.000386,0.000546,0.000941,0.001323,0.000753,0.000342,8.4e-05,0.000115,0.000245,0.000299,0.00021,8.6e-05,3.5e-05,1.7e-05,1.2e-05,3.8e-05,2e-05,3.3e-05,9.6e-05,2.7e-05,4e-05,0.00014,0.000883,0.001481,0.000712,0.000187,7.1e-05,0.000151,0.000384,0.000825,0.000256,3.6e-05,0.000478,0.000202,7.2e-05,4.3e-05,4.4e-05,6e-06,1.5e-05,2e-05,3.7e-05,2.6e-05,4.7e-05,1.9e-05,1.4e-05,5e-05,9.3e-05,3.5e-05,5.3e-05,0.00074,0.001547,0.000534,0.002517,0.002741,0.002781,0.00207,0.001112,0.000222,0.000121,6.6e-05,2.7e-05,3.7e-05,5e-05,7.5e-05,3.4e-05,7.5e-05,8e-05,4.1e-05,3.9e-05,1.8e-05,6e-05,6e-05,2.3e-05,3.6e-05,6.3e-05,3.1e-05,4.5e-05,5.7e-05,0.000414,0.001308,0.001051,0.000177,0.000216,0.000404,0.001157,0.001027,0.000422,0.000151,7.9e-05,5.8e-05,3.9e-05
6.1e-05,3.4e-05,3.5e-05,0.000303,0.001963,0.002865,0.000715,0.000389,0.001643,0.000932,0.000203,4.1e-05,2e-05,9.1e-05,4.9e-05,4e-05,6.8e-05,0.000617,0.00127,0.000719,0.002258,0.001631,0.00086,0.000346,2.9e-05,0.000323,0.000664,0.00033,0.000151,0.000145,0.000288,0.000364,0.002305,0.0011,0.000503,9.3e-05,0.000116,3.5e-05,0.000532,0.000415,0.000137,0.000117,8.7e-05,4.1e-05,2.3e-05,4.9e-05,4.3e-05,2.2e-05,0.000117,6.7e-05,7.7e-05,0.000248,0.000761,0.000867,0.000496,0.000418,0.000374,3.5e-05,0.00021,0.000597,0.000518,0.000189,0.000553,0.000253,0.00011,6.5e-05,5.5e-05,5.1e-05,2.3e-05,4.7e-05,5.5e-05,9.8e-05,9e-05,3.8e-05,7e-06,9.4e-05,7.9e-05,9e-05,7.8e-05,0.000927,0.003806,0.002158,0.002265,0.004903,0.002242,0.00152,0.001359,0.000556,0.000274,4.7e-05,5.9e-05,2.8e-05,7.6e-05,9.1e-05,0.000115,0.000144,1.6e-05,5e-05,3.4e-05,4.9e-05,4e-06,1.5e-05,3.3e-05,4.6e-05,2.2e-05,9.6e-05,5.7e-05,7.5e-05,0.00059,0.001611,0.000515,0.001297,0.000603,0.000477,0.001143,0.000634,0.000379,0.00015,6.9e-05,5.9e-05,6.5e-05
0.000184,7.7e-05,5.2e-05,0.001186,0.000887,0.001968,0.000592,0.00037,0.001892,0.001044,0.000466,0.000105,6.9e-05,2.5e-05,5.8e-05,6.8e-05,3.5e-05,0.001228,0.001418,0.001064,0.002509,0.003177,0.002116,0.001129,0.000384,0.000373,0.000731,0.000294,4.1e-05,0.000122,0.000213,0.000844,0.004492,0.003439,0.001482,0.000327,0.000124,0.000106,0.000816,0.000721,0.000332,6.6e-05,4.5e-05,3.6e-05,3.6e-05,3.5e-05,3.5e-05,3.8e-05,0.000151,0.00015,4.8e-05,0.000332,0.001033,0.000896,0.000377,0.000334,0.00073,0.000435,0.000305,0.000599,8.9e-05,0.000191,0.000421,0.000629,0.000327,0.000116,3.7e-05,3.7e-05,3.6e-05,9.8e-05,0.000143,8.4e-05,3.6e-05,2.9e-05,1.9e-05,8.8e-05,0.000104,0.00011,0.000152,0.000993,0.005105,0.00219,0.002796,0.007443,0.006379,0.00311,0.002768,0.0012,0.000476,0.00012,8.9e-05,8.8e-05,7.3e-05,0.000102,7.3e-05,8.6e-05,7.5e-05,0.000111,7.2e-05,5.8e-05,4.4e-05,6.2e-05,4.6e-05,4.7e-05,6e-05,0.000131,6.7e-05,9.2e-05,0.001142,0.003526,0.00332,0.002895,0.001288,0.000354,0.001686,0.001407,0.00044,0.000132,0.00021,8.7e-05,4e-05
0.000114,9.5e-05,1e-04,0.001496,0.001832,0.003375,0.002279,0.001219,0.001909,0.000894,0.000374,0.000101,4.8e-05,6.9e-05,7.9e-05,6.9e-05,7.6e-05,0.001271,0.000564,0.000251,0.003175,0.000276,0.000407,0.00034,0.000122,0.000332,0.000892,0.000861,0.000582,0.000224,0.000345,0.001499,0.003928,0.003693,0.001827,0.000498,0.000214,0.000122,0.000494,0.000269,0.000325,0.000202,8.7e-05,2.1e-05,2.3e-05,6e-05,2.3e-05,1.4e-05,0.000147,0.000159,7.7e-05,0.000242,0.002034,0.001142,0.000527,0.000517,0.000731,0.000441,0.000453,0.000556,0.00038,0.000477,0.000649,0.000871,0.000411,0.000164,6e-05,3.2e-05,2.4e-05,0.000113,6.7e-05,7.2e-05,0.000143,3.9e-05,4.4e-05,7.8e-05,0.000134,5.3e-05,0.000161,0.001008,0.00407,0.00323,0.003624,0.004397,0.001639,0.002781,0.004775,0.002467,0.000829,0.000122,0.00017,0.000109,7.2e-05,0.000204,0.000224,0.000225,0.000109,7.4e-05,2.1e-05,9e-06,3.9e-05,2.2e-05,9.1e-05,3.2e-05,0.000106,0.000188,0.000162,0.00026,0.001537,0.002975,0.000477,0.001218,0.000685,0.000655,0.001936,0.001478,0.001022,0.00025,0.000265,0.000163,1.5e-05
0.000209,0.000147,3.8e-05,0.000825,0.00099,0.002733,0.003056,0.00144,0.001185,0.000597,0.000355,0.000347,0.000168,0.000116,0.000172,9.6e-05,5.3e-05,0.000943,0.001221,0.000805,0.003274,0.004742,0.002848,0.001472,0.000488,0.000466,0.000641,0.00023,0.000143,0.00017,0.000389,0.00231,0.003115,0.001801,0.000683,0.000241,8.7e-05,0.00019,0.000377,0.000134,0.000239,0.00023,0.000117,4.3e-05,2.3e-05,5.5e-05,4.7e-05,1e-05,1e-04,0.000122,6.1e-05,1e-04,0.002696,0.00274,0.001478,0.000803,0.000184,7.1e-05,0.000715,0.001184,0.000656,0.000526,0.000197,0.000605,0.000321,9.6e-05,3.5e-05,7.7e-05,7.6e-05,5e-05,4.4e-05,5.4e-05,0.000134,0.000147,2.9e-05,5.9e-05,0.000174,0.00016,8.4e-05,0.000943,0.002051,0.001002,0.002214,0.001821,0.004342,0.004881,0.003255,0.002099,0.00099,0.000242,0.000155,4.1e-05,0.000111,0.00017,4.5e-05,0.00013,0.000129,0.000109,8.2e-05,5.6e-05,3.6e-05,1.8e-05,5.4e-05,4.7e-05,0.000102,6e-05,9.1e-05,0.000194,0.001539,0.000625,0.00201,0.001558,0.000984,0.001164,0.000695,3e-05,0.000315,0.000293,0.000241,0.000184,0.000132
0.000152,8.2e-05,9.2e-05,0.000679,0.001442,0.002695,0.001701,0.000594,0.000362,0.000333,5e-05,0.000156,8.7e-05,5.6e-05,8.8e-05,8e-06,8e-06,0.000402,0.00049,5.7e-05,0.002427,0.003869,0.00226,0.000662,0.000173,0.00057,0.000324,0.000219,0.000142,0.000145,0.000519,0.00165,0.002641,0.000736,3.4e-05,0.000141,3.4e-05,0.000141,0.000567,0.000499,0.000205,0.000141,5.8e-05,1.7e-05,1.3e-05,2.4e-05,3.1e-05,3.2e-05,8.5e-05,6.7e-05,4e-05,4.9e-05,0.002768,0.001072,0.000196,0.000307,0.000118,0.000114,0.000752,0.001367,5e-04,0.000247,0.000403,0.000362,0.000172,3.4e-05,2.3e-05,4.9e-05,1.3e-05,4.3e-05,2.1e-05,9e-06,6.2e-05,0.000151,0.000123,7.5e-05,0.000176,5.6e-05,4.4e-05,0.000858,0.001335,0.000843,0.0021,0.001864,0.002292,0.001474,0.001794,0.000764,0.00028,5.8e-05,9.3e-05,8.1e-05,0.000116,2.7e-05,0.000181,0.000147,3.4e-05,5.4e-05,1.5e-05,2.8e-05,8.2e-05,6.5e-05,3.1e-05,7.4e-05,0.000106,6.8e-05,0.000174,0.000261,0.00132,0.000404,0.002045,0.001618,0.00067,0.000545,0.00088,0.000539,0.000271,0.00013,0.000118,4.8e-05,3.2e-05
9.6e-05,3.5e-05,3.9e-05,0.000558,0.000478,0.000435,0.000128,0.000106,3.2e-05,1.5e-05,1.7e-05,6.1e-05,6.9e-05,3.4e-05,2.2e-05,3.4e-05,2.1e-05,0.000226,0.000215,0.000166,0.001004,0.000243,0.000375,0.000206,0.000117,0.000247,0.000223,8.8e-05,4.8e-05,5.9e-05,0.000122,0.000801,0.000701,0.000587,0.000163,3.7e-05,6.8e-05,6.4e-05,0.000378,0.000202,8.6e-05,2.7e-05,1.2e-05,8e-06,1e-05,7e-06,5e-06,1.1e-05,3.9e-05,1.3e-05,1.2e-05,4.6e-05,0.00119,0.000842,0.000333,0.000111,0.00012,0.000129,0.000238,0.000396,0.000262,6.1e-05,0.000157,0.000163,9.5e-05,3.6e-05,1.3e-05,2e-06,1.4e-05,2.9e-05,1.9e-05,8e-06,1.2e-05,6.1e-05,1.6e-05,2e-05,6.7e-05,5.6e-05,5e-06,0.000415,0.000709,0.000182,0.000668,0.000299,0.000582,0.001075,0.000608,0.000179,1.7e-05,2.4e-05,4.1e-05,7e-06,3.1e-05,4.6e-05,0.000102,0.000151,0.000118,7.8e-05,3.5e-05,6e-06,2.7e-05,5.1e-05,4.5e-05,4.8e-05,4.3e-05,4.2e-05,6.2e-05,1.3e-05,0.000482,8.4e-05,0.00066,0.000334,3.6e-05,0.000304,4e-04,3.3e-05,6.4e-05,0.000105,9.7e-05,4.4e-05,7e-06
7.9e-05,5.2e-05,3e-05,0.000378,5.7e-05,0.000181,9.6e-05,0.000191,0.000248,0.00013,3.5e-05,4.6e-05,2.9e-05,4.6e-05,6e-06,9e-06,1e-05,0.000356,0.00023,6.6e-05,0.00073,0.000936,0.000466,0.000169,3.1e-05,0.000201,4.6e-05,5.6e-05,4.2e-05,1.9e-05,4.8e-05,0.00063,0.001177,0.000478,0.00019,3e-05,2.8e-05,1.6e-05,0.000215,0.000122,5.4e-05,1.9e-05,9e-06,1.5e-05,1.7e-05,7e-06,3e-06,2.3e-05,3.6e-05,8e-06,1.2e-05,1.2e-05,0.000854,0.000328,0.000144,7.2e-05,1.7e-05,6.1e-05,0.000183,0.000186,7.5e-05,2.2e-05,0.000264,0.00023,9.5e-05,2.8e-05,7e-06,1.4e-05,2.6e-05,1.6e-05,1.8e-05,2.3e-05,1.6e-05,2.3e-05,2.2e-05,2.4e-05,3e-05,1e-05,2.9e-05,0.000338,0.000657,0.000618,0.000739,0.000357,0.000488,0.000447,0.00064,0.000221,3.6e-05,4.6e-05,2.2e-05,5.7e-05,6e-05,6.5e-05,0.00011,0.00013,5.7e-05,1.6e-05,9e-06,2e-06,1.6e-05,2e-05,1.6e-05,1.6e-05,3.1e-05,2.4e-05,6.5e-05,4.1e-05,0.000528,0.00047,0.000834,0.000563,0.000274,0.000253,0.000166,0.000245,6.5e-05,6.6e-05,4.4e-05,2.1e-05,1.3e-05
3.4e-05,2e-06,6e-06,0.000254,0.000287,0.000395,0.00018,0.000233,0.000282,0.000135,6.6e-05,1.7e-05,2.9e-05,1.6e-05,3e-05,2.3e-05,8e-06,0.000347,0.000205,0.000135,0.000482,0.000674,0.000187,8.5e-05,3e-05,7.9e-05,0.00014,1e-04,8.9e-05,1.7e-05,6.4e-05,0.000446,0.000778,0.000297,0.000121,4.7e-05,3.8e-05,1.2e-05,5.5e-05,3.9e-05,3.9e-05,2.7e-05,9e-06,1.1e-05,8e-06,6e-06,4e-06,2.5e-05,1.6e-05,1.2e-05,1.4e-05,2.3e-05,0.000438,0.000254,0.000129,9.4e-05,3.9e-05,6.9e-05,9.2e-05,0.00011,6.4e-05,9e-06,0.000214,9.8e-05,3.9e-05,6e-06,1.4e-05,1.6e-05,1.6e-05,1e-05,3e-06,1.1e-05,1.9e-05,1.8e-05,2.2e-05,6e-06,1.7e-05,1.9e-05,1.3e-05,0.000285,0.00034,0.000392,0.000331,0.000272,0.000991,0.000901,0.000436,0.000212,3.4e-05,1.2e-05,1.5e-05,5.2e-05,1.9e-05,3.5e-05,9.7e-05,1.8e-05,2.9e-05,2.4e-05,8e-06,6e-06,8e-06,4e-06,4e-06,9e-06,3.6e-05,2.2e-05,4e-06,2.7e-05,0.000542,0.000531,0.000759,0.000338,0.000147,0.000333,0.00011,2.6e-05,7.4e-05,3.9e-05,1.3e-05,4e-06,7e-06
1.5e-05,1.5e-05,1e-06,0.000382,0.000208,0.000149,7e-05,0.000256,7.1e-05,4.1e-05,3.7e-05,1.1e-05,6e-06,1.7e-05,1.2e-05,1.7e-05,1.6e-05,0.000239,0.000124,4.8e-05,0.000332,0.000252,6e-05,3.5e-05,3.2e-05,2.5e-05,8.1e-05,7.3e-05,5.9e-05,4.4e-05,9.2e-05,0.000495,6.1e-05,7.9e-05,3.1e-05,3e-05,1e-05,5e-06,4.7e-05,3.8e-05,2e-05,2e-06,4e-06,1e-05,6e-06,9e-06,8e-06,1.4e-05,1.7e-05,1.2e-05,1.5e-05,3.2e-05,0.000128,9.2e-05,6.7e-05,3.8e-05,1.5e-05,7.5e-05,0.000157,3.4e-05,5e-06,1.1e-05,0.000163,4.1e-05,3.5e-05,2e-06,8e-06,1.9e-05,7e-06,8e-06,5e-06,7e-06,9e-06,1.8e-05,1.4e-05,1.5e-05,1.7e-05,9e-06,8e-06,0.000237,0.000297,0.000289,0.000348,0.000112,0.000827,0.000905,0.000449,0.000137,5.4e-05,1.6e-05,2e-05,2.3e-05,1.2e-05,1.3e-05,9.5e-05,2.7e-05,1.6e-05,8e-06,9e-06,1.3e-05,1.1e-05,1e-05,6e-06,1.2e-05,2.6e-05,1.6e-05,3.6e-05,2.1e-05,0.000469,0.00066,0.000243,7e-05,2e-05,0.000246,0.00019,6.1e-05,5.7e-05,2.1e-05,1.6e-05,1e-06,2e-06
1.5e-05,8e-06,8e-06,0.000341,0.000342,0.000436,0.000121,0.000221,8.6e-05,4e-05,1.4e-05,1.6e-05,2.7e-05,3e-06,8e-06,1.2e-05,1.2e-05,0.000127,7.2e-05,5.2e-05,0.000297,0.00031,6.3e-05,5.1e-05,2.2e-05,3.1e-05,7.5e-05,3.9e-05,6.3e-05,7.8e-05,0.00014,0.000582,0.000571,0.00022,5.6e-05,4.5e-05,5.3e-05,2.7e-05,6.5e-05,2.9e-05,1.6e-05,1.5e-05,6e-06,8e-06,5e-06,8e-06,1e-06,1e-05,1.2e-05,1.2e-05,7e-06,4.6e-05,0.000143,9.6e-05,1.9e-05,4.8e-05,4.7e-05,3.9e-05,0.000191,5e-05,1.2e-05,4e-06,0.000148,4e-05,2e-05,1.1e-05,1e-05,8e-06,1.7e-05,6e-06,2e-06,7e-06,2.2e-05,7e-06,8e-06,7e-06,9e-06,1.7e-05,2.2e-05,0.000164,0.000343,9.2e-05,0.000438,9.7e-05,0.000764,0.00031,0.00028,0.000228,8e-05,2.6e-05,3.4e-05,2.7e-05,7e-06,1.3e-05,9.4e-05,1.7e-05,8e-06,4e-06,3e-06,6e-06,2.8e-05,8e-06,5e-06,1.4e-05,1.8e-05,1.8e-05,1.9e-05,1.1e-05,0.000326,0.000473,0.000406,0.000142,5.3e-05,0.000119,0.000169,0.000141,4.4e-05,3.4e-05,1e-05,1.2e-05,8e-06
1.4e-05,8e-06,6e-06,0.000248,0.000618,0.000465,0.000292,0.00011,0.000115,6.3e-05,4e-05,1.9e-05,1.9e-05,1e-05,1e-05,4e-06,5e-06,6.5e-05,2.5e-05,5.3e-05,0.000264,0.000233,0.000134,5.8e-05,2.8e-05,4.1e-05,5.1e-05,4e-05,1.5e-05,1.1e-05,9.5e-05,0.000484,0.000313,0.000118,2.9e-05,4.3e-05,2e-05,7e-06,6.6e-05,4.3e-05,2.3e-05,1.6e-05,1.1e-05,7e-06,2e-06,6e-06,8e-06,1.6e-05,2e-06,9e-06,2.2e-05,6.1e-05,0.000263,0.000105,5.5e-05,2.8e-05,3.3e-05,7e-05,0.000101,3.4e-05,2.8e-05,1.2e-05,0.000124,1.5e-05,1e-05,1e-06,9e-06,9e-06,2.6e-05,1.5e-05,8e-06,9e-06,2.2e-05,1e-05,3e-06,3e-06,9e-06,5e-06,1e-05,0.00012,0.00013,6.8e-05,0.000456,0.000277,0.000627,0.000734,0.000412,0.00014,4.8e-05,3e-05,1.3e-05,1.7e-05,2.2e-05,1.5e-05,5.8e-05,3.8e-05,1.4e-05,1.4e-05,1.2e-05,6e-06,3.6e-05,3e-05,1.6e-05,9e-06,1.8e-05,1.2e-05,6e-06,6e-06,0.000293,3.3e-05,0.000268,0.000108,5.3e-05,9.9e-05,0.000245,0.000113,2.2e-05,2.3e-05,8e-06,8e-06,7e-06
2.8e-05,1.4e-05,2e-06,0.000241,0.000644,0.000228,0.000119,1.2e-05,4.2e-05,3.9e-05,5.1e-05,9e-06,5e-06,1.4e-05,2.1e-05,1.2e-05,2e-06,4.3e-05,0.000113,3.5e-05,0.000356,0.000242,5.7e-05,3.1e-05,1.9e-05,1.3e-05,3.6e-05,1.2e-05,1.1e-05,2.4e-05,6.8e-05,0.000396,0.00035,0.000342,0.000136,3.2e-05,2.3e-05,1.8e-05,7.1e-05,1.1e-05,1.4e-05,1.3e-05,1.3e-05,5e-06,4e-06,3e-06,6e-06,2.5e-05,2.2e-05,5e-06,2.5e-05,3.3e-05,0.00025,0.000153,9.7e-05,9e-06,9e-06,3.9e-05,0.000126,1.7e-05,2.6e-05,1.2e-05,8.1e-05,2.5e-05,2e-05,8e-06,9e-06,8e-06,1.2e-05,7e-06,1e-06,6e-06,1.4e-05,9e-06,7e-06,6e-06,1.2e-05,1e-05,3e-06,9e-05,0.000171,0.000112,0.000319,0.00039,0.00031,0.000434,0.000235,0.00011,4.1e-05,1.7e-05,5e-06,5e-06,9e-06,2.3e-05,5.7e-05,2.3e-05,9e-06,7e-06,6e-06,3e-06,3.4e-05,1.5e-05,4e-06,9e-06,1.4e-05,1.1e-05,1.7e-05,1.4e-05,0.000307,0.000266,0.000318,0.000116,3.2e-05,0.000169,0.000159,7.9e-05,4.6e-05,3e-05,7e-06,1.4e-05,5e-06
7e-06,3e-06,5e-06,0.00028,0.000293,0.000429,0.000219,0.000236,0.000143,5.4e-05,2.7e-05,9e-06,2.6e-05,8e-06,1.4e-05,3e-06,6e-06,4.8e-05,7.2e-05,5.4e-05,0.000388,0.000389,0.000153,4.3e-05,1.4e-05,4e-06,4.9e-05,3.2e-05,3.7e-05,2.7e-05,5.5e-05,0.000313,0.000665,0.00029,8.3e-05,3e-05,1.1e-05,1.1e-05,6.3e-05,3.8e-05,2.8e-05,9e-06,1e-05,6e-06,7e-06,9e-06,5e-06,2.9e-05,1.3e-05,1.1e-05,2.3e-05,4.3e-05,0.000271,0.000123,5.8e-05,1.1e-05,2.4e-05,1.6e-05,0.000103,9e-05,7.1e-05,4.1e-05,6.7e-05,4e-05,1.5e-05,8e-06,7e-06,2e-06,7e-06,1e-05,6e-06,9e-06,1.1e-05,1.1e-05,1.9e-05,1.1e-05,1.5e-05,4e-06,6e-06,7e-05,0.000206,5e-05,0.000273,0.000495,0.00042,0.00041,0.000282,0.000142,2.8e-05,1.3e-05,7e-06,3e-06,2e-05,7e-06,4.5e-05,2.5e-05,2.5e-05,1.1e-05,3e-06,2e-06,2.1e-05,1.3e-05,9e-06,1.7e-05,9e-06,2.1e-05,1.2e-05,1.2e-05,0.000346,0.00031,0.000253,5.3e-05,1.8e-05,0.000175,0.00017,8.9e-05,3.9e-05,4.2e-05,1.8e-05,1.4e-05,1.1e-05
1.1e-05,7e-06,1.4e-05,0.000432,0.000204,0.00037,0.000184,0.000204,0.000121,4.1e-05,4.6e-05,1.2e-05,1.9e-05,9e-06,1.1e-05,1e-06,6e-06,6e-05,5.3e-05,5.8e-05,0.000441,0.000132,0.000169,6.9e-05,1e-05,1.8e-05,3.5e-05,6.6e-05,1.7e-05,1.6e-05,0.000124,0.00032,0.00058,0.000203,6.6e-05,1.3e-05,1.6e-05,1.4e-05,4.3e-05,1.5e-05,9e-06,6e-06,1.2e-05,3e-06,6e-06,4e-06,8e-06,1.9e-05,1.4e-05,4e-06,1.7e-05,1.5e-05,0.000251,9.7e-05,4.1e-05,3.2e-05,2.4e-05,4.1e-05,8.8e-05,8.6e-05,4.7e-05,3.7e-05,5.1e-05,5.8e-05,4.2e-05,1.4e-05,6e-06,1.2e-05,4e-06,1.3e-05,7e-06,1e-05,1e-05,9e-06,2.3e-05,1.2e-05,1.1e-05,1.4e-05,1e-06,8.3e-05,7.9e-05,0.000161,0.000202,0.00055,0.000617,0.000787,0.000424,0.000144,2.9e-05,4.1e-05,2.1e-05,1.2e-05,2.7e-05,3e-06,2.8e-05,2.1e-05,3e-06,7e-06,3e-06,4e-06,1.2e-05,7e-06,4e-06,1e-05,1e-05,3e-05,1.5e-05,2.3e-05,0.000314,3.3e-05,0.000208,1.3e-05,1.8e-05,0.000104,0.000146,9.2e-05,3.7e-05,3.4e-05,1.9e-05,2.4e-05,7e-06
1.1e-05,4e-06,1.1e-05,0.000525,4.4e-05,0.000175,7.5e-05,0.000139,0.000171,0.000133,9.8e-05,6.2e-05,2.4e-05,1e-06,1.5e-05,7e-06,6e-06,8e-05,6.6e-05,3.4e-05,0.000391,0.00018,4.4e-05,2.9e-05,8e-06,3.8e-05,5.5e-05,7.1e-05,4e-05,4e-06,0.000131,0.00042,0.000342,0.000237,5.7e-05,5e-06,2.6e-05,5e-06,2.1e-05,3.5e-05,1.5e-05,1.8e-05,8e-06,6e-06,9e-06,6e-06,3e-06,1.3e-05,1e-05,4e-06,3e-06,2.8e-05,0.000198,0.000115,3.5e-05,1.9e-05,1.6e-05,4.8e-05,8.9e-05,4.8e-05,1.2e-05,5.3e-05,7.9e-05,5.9e-05,2.9e-05,1.3e-05,8e-06,1.8e-05,1.4e-05,1.3e-05,1.3e-05,4e-06,7e-06,9e-06,1.1e-05,2e-06,2e-06,7e-06,7e-06,9.8e-05,0.000137,5.4e-05,0.000147,0.000333,0.000289,0.000467,6.9e-05,4.3e-05,5e-05,1.7e-05,7e-06,2e-05,1.1e-05,1.3e-05,2.8e-05,5e-06,5e-06,4e-06,3e-06,2e-06,7e-06,3e-06,7e-06,1.1e-05,2e-05,1.3e-05,1.4e-05,1.2e-05,0.000252,0.00026,0.000403,0.000162,6.4e-05,0.000112,8.8e-05,3.1e-05,8e-06,3e-05,1.9e-05,1.2e-05,1.1e-05
9e-06,0,1.4e-05,0.000421,0.000342,0.000159,5.5e-05,0.000116,8.2e-05,5.4e-05,1.6e-05,2.3e-05,2.1e-05,1.3e-05,9e-06,4e-06,4e-06,6.9e-05,3.4e-05,3.2e-05,0.000319,9e-05,6.6e-05,4e-05,3e-05,5.3e-05,3e-05,3.2e-05,1e-05,1.7e-05,0.000129,0.000189,0.00026,0.00013,4.2e-05,3.5e-05,5e-06,1.1e-05,5.1e-05,8e-06,1.1e-05,1e-05,1.6e-05,7e-06,8e-06,2e-06,6e-06,5e-06,7e-06,6e-06,1.2e-05,3.9e-05,0.000147,7.7e-05,6e-06,1.2e-05,2.7e-05,1.1e-05,6e-05,2.2e-05,2.8e-05,6.4e-05,7.7e-05,5.4e-05,1.4e-05,3e-06,8e-06,1.3e-05,4e-06,1e-05,4e-06,9e-06,2.1e-05,2.1e-05,4e-06,6e-06,9e-06,5e-06,3e-06,0.000104,0.000229,0.000221,0.000228,0.000144,0.000305,0.000254,0.000264,0.00014,5.5e-05,2.8e-05,2.4e-05,9e-06,4e-06,5e-06,1.4e-05,1e-05,9e-06,6e-06,3e-06,2e-06,4e-06,2e-06,7e-06,2e-06,1.6e-05,1.4e-05,2.4e-05,4e-06,0.000135,0.000159,0.000161,2.4e-05,2.9e-05,0.000107,0.000141,9e-05,5.1e-05,9e-06,1.4e-05,4e-06,2e-06
2.1e-05,8e-06,1.2e-05,0.000236,0.000197,0.000136,0.000123,8.9e-05,4.4e-05,3.4e-05,1.2e-05,1e-05,2.3e-05,2.4e-05,2e-05,8e-06,6e-06,7.4e-05,1e-05,3.5e-05,0.000262,0.00012,4.5e-05,1.3e-05,1.2e-05,3.4e-05,1e-05,2.2e-05,2.5e-05,1e-05,7.1e-05,0.000201,0.000121,5.9e-05,6.8e-05,2.7e-05,1.6e-05,4e-06,6.6e-05,3.5e-05,1e-05,4e-06,7e-06,6e-06,4e-06,7e-06,7e-06,7e-06,1e-05,8e-06,2.6e-05,3.7e-05,0.00016,0.000158,6.7e-05,2.5e-05,1.9e-05,4.2e-05,3.1e-05,5.3e-05,3.7e-05,5.5e-05,6.6e-05,1.2e-05,3.1e-05,5e-06,1.2e-05,1.8e-05,1.1e-05,1e-05,7e-06,1.1e-05,1.2e-05,9e-06,3e-06,3e-06,1.2e-05,5e-06,1e-06,0.000118,0.000133,0.000234,0.00025,0.00019,0.00047,0.00029,0.000257,0.000102,2.4e-05,2.2e-05,1.9e-05,4e-06,9e-06,1e-06,1e-05,5e-06,4e-06,4e-06,5e-06,8e-06,4e-06,8e-06,7e-06,5e-06,8e-06,2e-05,2e-06,1.3e-05,1.6e-05,0.000102,0.000247,3.9e-05,2e-05,6.5e-05,0.000102,7.8e-05,4e-05,4e-05,7e-06,1.2e-05,1.1e-05
9e-06,1e-05,3e-06,0.000238,0.000246,0.00021,4.5e-05,0.000108,8.6e-05,6e-05,4.5e-05,3.9e-05,3.1e-05,2e-06,1e-05,3e-06,5e-06,0.000112,9.2e-05,6.2e-05,0.000157,0.000161,5.5e-05,2.9e-05,2e-05,3.4e-05,2.8e-05,4.3e-05,2.8e-05,1.4e-05,2e-05,0.000186,0.000301,0.00012,9e-06,1.4e-05,1.7e-05,1.1e-05,5.8e-05,2.5e-05,8e-06,1e-05,1.2e-05,6e-06,2e-06,2e-06,7e-06,9e-06,2e-06,3e-06,2.3e-05,4.4e-05,0.000251,0.000143,7.2e-05,1.3e-05,3.6e-05,1.5e-05,9.5e-05,0.000115,5.5e-05,5e-05,8.5e-05,3.9e-05,4e-06,2.3e-05,2.6e-05,8e-06,7e-06,1.3e-05,6e-06,3e-06,7e-06,1.4e-05,1.2e-05,8e-06,1.7e-05,1.7e-05,1.1e-05,0.000129,0.000198,0.000189,0.000117,0.000238,0.000208,0.000271,8.6e-05,4.7e-05,1.5e-05,1.8e-05,2.3e-05,2.4e-05,9e-06,9e-06,2e-05,1.2e-05,9e-06,2e-06,6e-06,1.2e-05,2e-05,6e-06,4e-06,7e-06,2e-06,1.7e-05,1.6e-05,1e-06,0.000107,0.000261,0.000291,7.9e-05,4.2e-05,5.8e-05,0.000125,6e-05,9e-06,3.3e-05,3.1e-05,2.1e-05,1.1e-05
6e-06,8e-06,6e-06,0.000281,0.000275,0.000118,6.7e-05,0.000227,0.000113,4.2e-05,3.3e-05,2.8e-05,3.7e-05,2.5e-05,2.9e-05,1.1e-05,9e-06,0.000146,9.7e-05,2.1e-05,0.000206,0.000217,0.000149,6.1e-05,1.9e-05,1.3e-05,2.1e-05,1.9e-05,1.3e-05,2e-05,2.1e-05,0.000148,0.000617,0.000263,0.000112,3.7e-05,7e-06,2e-06,3.6e-05,3.7e-05,1.4e-05,7e-06,3e-06,2e-06,3e-06,5e-06,8e-06,5e-06,1e-06,7e-06,1.6e-05,1.4e-05,0.000293,8e-05,2.9e-05,3e-06,2.3e-05,3.4e-05,0.000178,0.000123,5.2e-05,2.1e-05,0.000114,4.1e-05,2.1e-05,2.7e-05,2.4e-05,1.1e-05,1.5e-05,5e-06,1.1e-05,1e-06,1e-05,1.2e-05,1.3e-05,5e-06,2e-05,9e-06,8e-06,0.000138,0.000282,0.000221,0.000261,0.000107,0.000434,0.000346,0.000118,7.6e-05,3.2e-05,4e-06,3.5e-05,3e-06,2.1e-05,1.5e-05,1.7e-05,1.2e-05,1.1e-05,6e-06,1.1e-05,7e-06,1.8e-05,1.7e-05,2e-05,5e-06,1e-06,1.3e-05,4e-06,1.4e-05,0.000168,0.000255,0.000517,0.000331,0.000149,0.000131,2.7e-05,4.5e-05,2.7e-05,2.5e-05,2.4e-05,1.9e-05,1.2e-05
1.8e-05,6e-06,1.5e-05,0.000187,8e-05,3.6e-05,0.000103,0.000173,0.000181,0.000127,6.7e-05,1.8e-05,2.9e-05,1.5e-05,1.7e-05,4e-06,4e-06,0.000123,0.00012,7.7e-05,0.000178,0.000316,0.000149,7.8e-05,3e-05,1e-05,9e-06,8e-06,6e-06,3.1e-05,6.5e-05,3.8e-05,0.000368,0.000213,0.000107,2.8e-05,1.1e-05,9e-06,2.6e-05,2.7e-05,1.5e-05,1.5e-05,8e-06,6e-06,8e-06,9e-06,6e-06,2e-06,9e-06,1.3e-05,3e-06,2.1e-05,0.00024,0.000198,0.00013,4.2e-05,1.2e-05,1.9e-05,0.000219,0.000239,9.4e-05,3.1e-05,6.6e-05,2.4e-05,2.2e-05,1.6e-05,1e-05,1.7e-05,2.4e-05,1.4e-05,1.6e-05,1.2e-05,1.1e-05,8e-06,1.1e-05,8e-06,1.1e-05,7e-06,3e-06,0.000133,0.000167,8.4e-05,0.000216,9.9e-05,0.000334,0.000313,0.000186,0.000128,6e-05,2.8e-05,2.9e-05,2.4e-05,4.1e-05,1.6e-05,1e-05,6e-06,1e-05,4e-06,1.1e-05,7e-06,2.3e-05,6e-06,1.1e-05,1.4e-05,6e-06,9e-06,8e-06,1.2e-05,0.000199,0.000248,0.00026,9.5e-05,6.2e-05,0.000163,0.000199,6.6e-05,3.1e-05,2.5e-05,9e-06,8e-06,3e-06
1.2e-05,9e-06,1e-05,3.3e-05,0.000218,1e-04,3.6e-05,0.000193,0.000125,6.9e-05,6.4e-05,4.2e-05,4.3e-05,2.2e-05,1e-05,6e-06,1e-06,7.3e-05,3.4e-05,1.5e-05,0.000215,0.000319,5.3e-05,2.5e-05,2.4e-05,2e-05,2.3e-05,1.6e-05,1.1e-05,2.2e-05,4.7e-05,4.1e-05,0.000151,0.000134,5.2e-05,2.2e-05,1.3e-05,3e-06,2.1e-05,2e-05,2e-05,1.5e-05,5e-06,5e-06,7e-06,2e-06,8e-06,4e-06,8e-06,8e-06,1.4e-05,6e-06,0.000137,0.000118,5.2e-05,2.8e-05,2.1e-05,1.3e-05,0.000224,0.000163,0.000103,5e-05,4.2e-05,3.7e-05,4e-06,1.1e-05,6e-06,1.7e-05,1.4e-05,9e-06,9e-06,8e-06,8e-06,1.5e-05,2e-06,6e-06,0,9e-06,7e-06,0.000134,6.1e-05,0.000108,9.8e-05,3e-05,0.00014,0.000236,0.000111,3.8e-05,2.7e-05,2.7e-05,1.7e-05,3e-06,1.9e-05,1.4e-05,1.6e-05,1.1e-05,6e-06,1.3e-05,5e-06,3e-06,1.3e-05,1.2e-05,2e-06,6e-06,9e-06,1.2e-05,1.4e-05,1.2e-05,0.000176,0.000139,0.000214,0.000127,7.4e-05,0.000166,0.000239,0.000216,0.000104,2.1e-05,1.8e-05,1.2e-05,6e-06
6e-06,7e-06,9e-06,0.000153,0.000239,0.000169,4.8e-05,0.000177,3.7e-05,9.6e-05,3.6e-05,2.1e-05,1.1e-05,8e-06,5e-06,6e-06,5e-06,3.5e-05,2.2e-05,1.3e-05,0.000229,9.1e-05,0.000143,6e-05,5e-06,1e-05,1.6e-05,1.6e-05,1e-05,3e-06,4.8e-05,9.4e-05,0.000107,3.5e-05,4e-05,1.8e-05,1.1e-05,1e-05,2.2e-05,8e-06,1e-05,3e-06,2e-06,5e-06,2e-06,1e-06,6e-06,2e-06,5e-06,1.1e-05,1e-05,1.3e-05,5.5e-05,3.1e-05,1.5e-05,1.7e-05,1.6e-05,1.8e-05,0.000166,3.7e-05,1.7e-05,1.9e-05,5.4e-05,1.6e-05,8e-06,8e-06,4e-06,1.3e-05,1.2e-05,3e-06,9e-06,7e-06,6e-06,5e-06,3e-06,2e-06,6e-06,4e-06,0,0.00012,0.000136,2.6e-05,0.000149,9.5e-05,2.4e-05,0.000167,5.1e-05,3.4e-05,3.4e-05,9e-06,1.6e-05,1.4e-05,7e-06,5e-06,1.8e-05,7e-06,1.3e-05,1e-05,9e-06,7e-06,1.3e-05,1e-05,7e-06,2e-06,5e-06,1.1e-05,9e-06,4e-06,0.00013,0.000171,0.000106,2.7e-05,4e-06,0.000148,0.000101,4.6e-05,2.1e-05,2.1e-05,8e-06,9e-06,6e-06
2e-06,4e-06,1e-05,0.000239,0.000275,0.000132,5.7e-05,0.000166,6.3e-05,2.9e-05,2.1e-05,1.7e-05,4e-06,1.1e-05,1.7e-05,6e-06,3e-06,4.4e-05,2.4e-05,9e-06,0.00022,9.3e-05,5.4e-05,3.6e-05,9e-06,3e-06,1.3e-05,1.1e-05,5e-06,9e-06,4.6e-05,0.000131,9.4e-05,5.3e-05,1e-05,4e-06,7e-06,2e-06,1.4e-05,1e-05,3e-06,4e-06,2e-06,4e-06,2e-06,1e-06,5e-06,1e-06,3e-06,4e-06,5e-06,9e-06,5.1e-05,1.9e-05,2.4e-05,1.7e-05,4e-06,3e-06,0.000111,2.3e-05,1.5e-05,1.9e-05,5.3e-05,1.1e-05,9e-06,3e-06,3e-06,9e-06,7e-06,5e-06,4e-06,8e-06,4e-06,7e-06,1e-06,2e-06,6e-06,2e-06,3e-06,0.000109,0.000115,9e-05,5.8e-05,0.000141,0.000256,0.000267,5.8e-05,1.7e-05,2.1e-05,3e-06,2e-06,9e-06,0,3e-06,2.3e-05,1e-06,4e-06,5e-06,4e-06,1e-06,7e-06,1e-06,1e-06,3e-06,4e-06,4e-06,2e-06,4e-06,7.3e-05,0.000196,0.000145,2.9e-05,5e-06,0.000118,3.8e-05,1e-05,3e-06,2e-05,1e-05,1e-06,3e-06
4e-06,4e-06,1.2e-05,0.000226,4.3e-05,0.000148,5e-05,0.000147,3.1e-05,8e-06,3e-06,1.4e-05,1.1e-05,7e-06,6e-06,4e-06,1e-06,3.9e-05,6e-06,1e-05,0.000211,0.00016,7e-06,9e-06,1e-06,6e-06,6e-06,1e-05,5e-06,7e-06,3.8e-05,0.00015,0.000155,3.7e-05,1.1e-05,7e-06,5e-06,9e-06,7e-06,2e-06,2e-06,1e-06,1e-06,3e-06,3e-06,1e-06,4e-06,1e-06,1e-06,3e-06,4e-06,8e-06,3.9e-05,8e-06,8e-06,8e-06,2e-06,4e-06,9.7e-05,1.6e-05,1.5e-05,1.5e-05,5.9e-05,1.2e-05,4e-06,4e-06,3e-06,3e-06,5e-06,2e-06,5e-06,6e-06,2e-06,7e-06,2e-06,2e-06,2e-06,4e-06,1e-06,9.6e-05,6.1e-05,2.3e-05,0.000101,0.000197,0.000199,0.000212,7.5e-05,1.7e-05,1.8e-05,9e-06,8e-06,3e-06,5e-06,3e-06,2.2e-05,2e-06,5e-06,6e-06,3e-06,2e-06,4e-06,2e-06,1e-06,2e-06,2e-06,4e-06,1e-06,3e-06,0.000108,0.00013,9.3e-05,2.8e-05,1.8e-05,9.9e-05,2.2e-05,3e-06,8e-06,1.5e-05,5e-06,8e-06,1e-06
4e-06,2e-06,1.1e-05,0.000161,7.2e-05,7.7e-05,4.5e-05,0.000122,3.1e-05,1.3e-05,6e-06,1.8e-05,1e-05,3e-06,7e-06,3e-06,2e-06,2.6e-05,7e-06,1e-05,0.000194,0.000147,1.1e-05,1.1e-05,3e-06,1e-05,5e-06,8e-06,8e-06,7e-06,4.1e-05,0.000164,0.000115,1.9e-05,1.1e-05,3e-06,6e-06,2e-06,1.3e-05,3e-06,3e-06,2e-06,1e-06,3e-06,3e-06,1e-06,5e-06,1e-06,1e-06,4e-06,4e-06,8e-06,5e-05,1.9e-05,1.6e-05,4e-06,4e-06,3e-06,9.1e-05,2.2e-05,8e-06,7e-06,5.6e-05,1e-05,1e-06,6e-06,3e-06,4e-06,5e-06,3e-06,2e-06,5e-06,0,7e-06,2e-06,1e-06,3e-06,3e-06,1e-06,8.6e-05,2.7e-05,7e-06,0.000117,0.000135,0.000329,0.000278,4.5e-05,2.8e-05,1.8e-05,1.5e-05,1e-05,3e-06,3e-06,2e-06,2e-05,1e-06,6e-06,5e-06,2e-06,1e-06,3e-06,1e-06,1e-06,2e-06,1e-06,5e-06,0,4e-06,0.000148,0.000106,0.000132,1.6e-05,1.8e-05,9.4e-05,2.2e-05,2e-06,6e-06,1.7e-05,3e-06,4e-06,4e-06
