0.045519,0.044455,0.038247,0.032022,0.037716,0.043738,0.043358,0.039882,0.041487,0.042084,0.036156,0.032319,0.031002,0.031353,0.027328,0.022861,0.022369,0.021347,0.021641,0.022003,0.019911,0.018007,0.019367,0.020534,0.019452,0.019787,0.019549,0.019108
0.059178,0.057535,0.04928,0.041459,0.049199,0.056701,0.055939,0.051192,0.052885,0.054016,0.046897,0.042102,0.040705,0.04118,0.035355,0.029156,0.028365,0.027204,0.027735,0.028306,0.025933,0.02327,0.024291,0.02593,0.025375,0.025722,0.025174,0.024953
0.082743,0.079511,0.068162,0.05888,0.070441,0.079869,0.077706,0.070768,0.071992,0.073778,0.065536,0.059257,0.058075,0.058904,0.049662,0.040489,0.039066,0.03781,0.038936,0.039566,0.03668,0.032903,0.033072,0.035438,0.03618,0.036726,0.035816,0.036089
0.099185,0.093644,0.082659,0.075658,0.08901,0.098207,0.094594,0.086344,0.084762,0.085924,0.079686,0.074131,0.073165,0.072805,0.06113,0.050953,0.048445,0.047045,0.048889,0.048731,0.045725,0.042202,0.040964,0.042698,0.044932,0.046662,0.045998,0.046257
0.105104,0.098486,0.094856,0.096258,0.106281,0.111007,0.108563,0.101045,0.092116,0.089541,0.088539,0.088132,0.086191,0.081577,0.070511,0.062301,0.058119,0.05513,0.056115,0.054172,0.052919,0.053672,0.05075,0.047877,0.049995,0.053816,0.053556,0.052054
0.114776,0.109304,0.113859,0.125612,0.131815,0.131446,0.132796,0.127354,0.110593,0.100612,0.102175,0.107507,0.102895,0.095476,0.087513,0.080157,0.074727,0.068959,0.066604,0.06305,0.0653,0.071898,0.066826,0.057259,0.058041,0.063382,0.0618,0.056806
0.132778,0.128537,0.135871,0.153968,0.162074,0.160132,0.164864,0.161965,0.14092,0.122616,0.119247,0.124592,0.11943,0.114922,0.108278,0.099872,0.09636,0.089083,0.084427,0.080026,0.0822,0.091913,0.085437,0.070804,0.070721,0.076713,0.074728,0.067084
0.155117,0.151698,0.15679,0.174787,0.187613,0.187237,0.190976,0.190886,0.174246,0.152363,0.136034,0.130044,0.123741,0.12527,0.121419,0.114554,0.115041,0.108715,0.104849,0.099368,0.095547,0.104359,0.09966,0.084526,0.082394,0.087685,0.088859,0.080085
0.20347,0.20368,0.208779,0.217756,0.228409,0.228082,0.221581,0.22428,0.220058,0.198324,0.165006,0.139364,0.128872,0.134582,0.138742,0.137741,0.138026,0.135195,0.132332,0.118797,0.106885,0.114453,0.113343,0.101335,0.096536,0.101687,0.108043,0.099293
0.295621,0.295065,0.303202,0.296146,0.29515,0.284264,0.262037,0.276276,0.288194,0.268474,0.224629,0.180065,0.163356,0.168641,0.176416,0.178015,0.174711,0.177796,0.177733,0.149051,0.126158,0.131677,0.129845,0.119106,0.115754,0.127893,0.140268,0.131671
0.400059,0.393464,0.415739,0.397997,0.3856,0.355089,0.317298,0.345784,0.367994,0.352857,0.311883,0.256018,0.225713,0.216467,0.220578,0.231707,0.227444,0.227384,0.233954,0.195765,0.156401,0.155869,0.149478,0.137268,0.139641,0.160063,0.178785,0.174836
0.473774,0.460862,0.507721,0.488151,0.463538,0.418831,0.386146,0.428269,0.445284,0.425678,0.398634,0.348492,0.296061,0.255726,0.254521,0.285386,0.280851,0.264601,0.274396,0.237214,0.183568,0.176841,0.170483,0.157734,0.164272,0.188572,0.21018,0.212963
0.484561,0.470852,0.521302,0.504982,0.473725,0.433098,0.429203,0.470392,0.478485,0.455261,0.445379,0.416796,0.34281,0.272443,0.276366,0.328236,0.31597,0.276454,0.272762,0.241871,0.19645,0.190648,0.188193,0.179097,0.181907,0.201002,0.220236,0.228743
0.41785,0.417153,0.451265,0.440697,0.417708,0.399712,0.416986,0.427912,0.429945,0.426753,0.434679,0.417625,0.341175,0.272344,0.288975,0.340992,0.314074,0.260879,0.235318,0.214067,0.198301,0.189261,0.187769,0.194306,0.189948,0.19652,0.209799,0.21953
0.33955,0.351148,0.371918,0.376886,0.365022,0.349834,0.358589,0.352597,0.363757,0.388221,0.397668,0.370103,0.306186,0.259298,0.282657,0.323446,0.298312,0.246995,0.207363,0.189206,0.187451,0.175006,0.182104,0.207038,0.204653,0.200753,0.205178,0.217148
0.346279,0.354621,0.357725,0.369323,0.367889,0.357137,0.36468,0.384297,0.408831,0.408784,0.398241,0.378429,0.335353,0.299593,0.301343,0.34152,0.35824,0.301392,0.238428,0.20468,0.188527,0.189356,0.219123,0.239962,0.240836,0.245335,0.245438,0.243379
0.463191,0.480225,0.474149,0.472043,0.488209,0.503979,0.502763,0.522308,0.542529,0.518704,0.484582,0.469631,0.452475,0.434302,0.421255,0.449672,0.502247,0.435144,0.334138,0.273851,0.241127,0.258048,0.314709,0.320871,0.322246,0.343115,0.324329,0.294722
0.686664,0.704109,0.693585,0.661018,0.705221,0.757208,0.733643,0.717282,0.731444,0.729895,0.672585,0.640214,0.626619,0.629121,0.624305,0.619015,0.669527,0.588353,0.465956,0.398685,0.355303,0.368599,0.451739,0.445384,0.448902,0.493322,0.442981,0.382733
0.974469,0.957406,0.948681,0.859845,0.961365,1.079525,1.000273,0.920894,0.943652,1.00805,0.922096,0.847089,0.823196,0.837232,0.837382,0.768106,0.791521,0.715557,0.607838,0.574023,0.515688,0.488215,0.587162,0.572793,0.596945,0.685748,0.596961,0.482448
1.230421,1.127971,1.122624,1.005028,1.199879,1.382561,1.205468,1.081775,1.147872,1.261249,1.113668,0.979651,0.970836,0.986678,0.965264,0.849009,0.857764,0.800388,0.719289,0.754162,0.686165,0.574213,0.650732,0.648625,0.743371,0.906268,0.771708,0.578343
1.361435,1.133882,1.088729,1.007582,1.282444,1.469616,1.215176,1.115962,1.225072,1.328266,1.125333,0.952841,0.975215,0.971261,0.913761,0.845643,0.879089,0.840558,0.781047,0.861317,0.786633,0.58365,0.595969,0.606742,0.791426,1.030712,0.855164,0.605464
1.239463,0.97371,0.861039,0.817968,1.09826,1.245215,0.997025,0.956688,1.058301,1.114199,0.960689,0.841379,0.882113,0.840905,0.741392,0.760266,0.846111,0.865819,0.829562,0.848821,0.732361,0.498249,0.474294,0.490445,0.686954,0.934027,0.766434,0.537672
0.879897,0.799914,0.710335,0.612764,0.773913,0.855327,0.694989,0.678717,0.718636,0.782403,0.776042,0.715177,0.735821,0.660481,0.519836,0.592661,0.715366,0.792856,0.803055,0.735609,0.58826,0.402548,0.376825,0.400653,0.518861,0.679302,0.601878,0.466468
0.485832,0.614669,0.616815,0.450911,0.457229,0.51418,0.471998,0.44383,0.447238,0.525758,0.608672,0.578955,0.565995,0.481303,0.358158,0.436307,0.521777,0.606906,0.662871,0.580086,0.446599,0.325288,0.313981,0.352633,0.418661,0.491596,0.459802,0.381687
0.292058,0.432158,0.468088,0.310318,0.282541,0.36516,0.37615,0.335444,0.319448,0.349561,0.415477,0.433394,0.428985,0.355653,0.276667,0.32245,0.360543,0.424514,0.476599,0.422169,0.326516,0.24794,0.245455,0.280852,0.332871,0.351762,0.315111,0.269455
0.261004,0.307142,0.308578,0.232752,0.242354,0.297859,0.294655,0.265575,0.249787,0.239776,0.256014,0.284217,0.299698,0.269975,0.240661,0.28556,0.294181,0.275994,0.275319,0.253749,0.236397,0.200425,0.170926,0.191161,0.229894,0.226416,0.210937,0.210088
0.245506,0.233826,0.237056,0.218052,0.237451,0.253011,0.232724,0.204788,0.194136,0.180693,0.173585,0.180373,0.1849,0.202944,0.219765,0.279272,0.287884,0.21837,0.1834,0.187711,0.206886,0.177716,0.127319,0.15692,0.174035,0.145398,0.159415,0.187716
0.22419,0.202088,0.205046,0.194405,0.213622,0.24337,0.231084,0.187213,0.170989,0.164078,0.147677,0.136072,0.139866,0.181235,0.206063,0.253279,0.272879,0.20621,0.161422,0.174625,0.187816,0.153921,0.111341,0.14634,0.155443,0.109918,0.138711,0.177285
0.182341,0.16187,0.154333,0.143939,0.174179,0.221225,0.213944,0.178566,0.157508,0.141832,0.131359,0.123374,0.126742,0.170048,0.184313,0.205629,0.226021,0.179376,0.144631,0.152052,0.143386,0.117137,0.097653,0.129484,0.142604,0.102012,0.121443,0.15514
0.123528,0.111485,0.105557,0.112537,0.148308,0.178965,0.168357,0.153125,0.132916,0.112099,0.113568,0.107662,0.108223,0.145231,0.154444,0.163777,0.18164,0.168789,0.168558,0.150688,0.111448,0.089536,0.08462,0.111556,0.11964,0.089697,0.095604,0.126613
0.091638,0.093667,0.094679,0.102786,0.126218,0.137675,0.119756,0.115816,0.111352,0.102495,0.111077,0.098767,0.093199,0.114683,0.116291,0.138627,0.171374,0.174037,0.194797,0.159039,0.10293,0.08288,0.083169,0.103388,0.101228,0.076243,0.072864,0.103792
0.095869,0.095135,0.096476,0.099127,0.101362,0.094602,0.078816,0.084627,0.097513,0.100772,0.106541,0.086097,0.069393,0.077786,0.088381,0.130524,0.164865,0.172047,0.202832,0.166701,0.100319,0.077557,0.083919,0.106508,0.097123,0.064653,0.055562,0.095327
0.090512,0.090872,0.093563,0.09243,0.093152,0.079314,0.056268,0.06675,0.089367,0.084454,0.084417,0.068566,0.049105,0.053508,0.078326,0.130484,0.144971,0.142714,0.175226,0.151637,0.086411,0.060595,0.073826,0.098434,0.09051,0.060558,0.048624,0.084952
0.072125,0.078524,0.081052,0.085443,0.096517,0.079249,0.047712,0.05818,0.073835,0.058768,0.065394,0.063,0.046877,0.047616,0.077876,0.115268,0.105854,0.092338,0.116846,0.107229,0.060766,0.044263,0.060126,0.073419,0.068016,0.053191,0.042136,0.062562
0.05267,0.065388,0.069197,0.075257,0.087221,0.066936,0.03733,0.047964,0.053741,0.038888,0.050878,0.059195,0.054886,0.051348,0.070989,0.088834,0.072565,0.055119,0.06393,0.062162,0.042716,0.039878,0.046549,0.047516,0.044205,0.039385,0.032146,0.039815
0.038891,0.054221,0.06162,0.057286,0.061762,0.045155,0.02623,0.037162,0.039558,0.03227,0.040484,0.051803,0.062532,0.05579,0.061576,0.078502,0.066545,0.053582,0.055986,0.054393,0.050315,0.05129,0.042747,0.033892,0.029659,0.031083,0.030652,0.03348
0.033028,0.050218,0.052398,0.035901,0.038143,0.031172,0.024954,0.034331,0.034175,0.030041,0.033801,0.047958,0.062646,0.058337,0.06162,0.091667,0.093005,0.077849,0.076661,0.074863,0.070837,0.065834,0.045908,0.030059,0.024871,0.030375,0.033326,0.034269
0.037515,0.052189,0.044111,0.025901,0.031646,0.028992,0.028387,0.035929,0.029856,0.025447,0.028049,0.041773,0.053469,0.053997,0.073532,0.121975,0.13085,0.11541,0.11447,0.111118,0.095223,0.075045,0.052374,0.035185,0.028433,0.030644,0.034165,0.034992
0.048998,0.056922,0.036873,0.02454,0.037534,0.031326,0.031447,0.044044,0.034604,0.026776,0.028671,0.0361,0.042557,0.051527,0.086642,0.144021,0.160152,0.150589,0.152358,0.145352,0.118909,0.082547,0.061198,0.044096,0.033335,0.02929,0.037349,0.041371
0.059867,0.062837,0.036006,0.027935,0.04966,0.040565,0.035991,0.058671,0.050164,0.038325,0.03822,0.043845,0.046074,0.061995,0.099063,0.141973,0.164423,0.164213,0.171453,0.158377,0.132125,0.093098,0.065681,0.048017,0.035782,0.028626,0.041929,0.049251
