3.9e-05,5.6e-05,5.3e-05,4.8e-05,7.4e-05,5.2e-05,1e-06,6.9e-05,8.8e-05,6.2e-05,6.4e-05,2.9e-05,0.000112,5e-05,7.6e-05,5.9e-05,6.6e-05,4.5e-05,3.4e-05,0.000101,6.3e-05,2.3e-05,9.1e-05,1.8e-05,5.3e-05,7.9e-05,0.000128,2.3e-05,5.6e-05,9.2e-05,7.7e-05,0.00012,6e-06,2.8e-05,2.5e-05,1.3e-05,0.000115,1.8e-05,0.000121,4.3e-05,7.8e-05,6.2e-05,8.5e-05,2.7e-05,0.000211,1.9e-05,0.000168,4e-06,6.8e-05,0.000199,4.5e-05,5.5e-05,4.3e-05,0.000138,1.8e-05,6.2e-05,1e-04,4.2e-05,0.000105,1e-06,0.000126,0.000381,0.000101,5e-06,0.000146,0.000267,0.000253,4.2e-05,7.7e-05,6.3e-05,0.000158,9.2e-05,0.000158,9.1e-05,4.5e-05,0.000152,2.7e-05,0.000352,0.000192,4.7e-05,3.6e-05,9.2e-05,0.000158,4.3e-05,4.9e-05,0.000113,0.000219,1e-06,8.8e-05,1e-04,0.000239,1.7e-05,4.1e-05,6.5e-05,0.00012,0.000202,2.3e-05,7.4e-05,7.8e-05,4e-05,7.4e-05,7.7e-05,0.000263,0.000236,0.000154,0.000178,8.6e-05,5.6e-05,8e-06,1.3e-05,0.000307,0.000301,0.00025,6.9e-05,5.8e-05,8.2e-05,8.3e-05,0.000229,0.000443,8.2e-05,0.000213
0.000139,0.000109,0.000202,0.000108,9.1e-05,0.000152,0.000135,0.000239,0.00018,0.000124,0.000168,0.000125,2e-04,0.000152,0.000148,0.000102,0.000226,6.4e-05,0.000108,0.000341,9e-05,6.9e-05,0.000202,9.4e-05,0.000235,0.000201,0.000383,1.4e-05,0.000157,0.000259,0.000157,0.000297,5.4e-05,7.3e-05,2e-05,4.8e-05,0.000178,0.000108,0.000168,3.9e-05,0.000143,0.000154,0.000249,6e-05,0.000534,0.000146,0.000307,0.000218,6.9e-05,0.00039,3.3e-05,0.000173,0.000206,0.000276,0.000147,0.00024,0.000369,0.00015,0.000193,0.00011,0.000171,0.000751,0.000674,0.000295,0.000373,0.000449,0.000581,0.000226,0.000243,0.000158,0.000129,0.000304,0.000433,0.000496,0.000396,0.000461,0.000323,0.000779,0.00053,0.000336,0.000309,0.000161,0.000229,0.000233,0.000181,3.1e-05,0.000398,3e-04,0.000317,0.000312,0.000456,0.000114,7.6e-05,5.7e-05,0.000138,0.00058,0.000198,0.000409,0.00027,5.1e-05,5.1e-05,0.000414,0.000641,0.000542,0.000377,0.000441,0.000306,0.000166,5.7e-05,0.000106,0.001241,0.00155,0.000759,0.000311,0.000388,0.00051,0.000361,0.000739,0.000723,0.000337,0.000437
0.00022,8.2e-05,0.000247,0.000205,1.1e-05,0.000193,6.1e-05,0.000122,0.000118,0.000273,0.00011,0.000174,0.000222,0.000259,0.000162,0.000117,0.000232,0.00013,0.000185,0.000244,0.00014,6.5e-05,0.000134,9.8e-05,0.000175,0.000228,0.000316,0.000267,2.1e-05,0.000284,0.000222,0.000378,0.000108,0.000132,0.000173,0.000163,0.00012,0.000225,0.000182,0.000315,0.000289,9.9e-05,0.000276,0.000171,0.000477,5.8e-05,0.000235,0.000385,0.000565,0.000721,0.000215,0.000239,0.000442,0.000528,0.000345,0.000102,0.00068,0.000364,0.000307,0.000355,0.000308,0.000542,0.001444,0.001216,0.001411,0.000845,0.000261,0.000788,0.000792,0.00058,0.00098,0.000207,0.00045,0.000325,0.000403,0.000631,0.00017,0.000478,0.000383,0.000245,0.000507,0.000483,5.7e-05,0.000271,0.000447,0.000258,0.000393,0.000353,0.000259,0.000365,0.001082,0.000322,0.000263,0.000421,0.000445,0.000626,0.000405,0.000386,0.000343,4e-05,0.000352,0.000519,0.000425,0.000659,0.000447,0.000294,0.000476,0.000258,0.000116,0.000398,0.002583,0.003156,0.001593,0.001164,0.001863,0.002029,0.001347,0.001512,0.001421,0.001049,0.001054
9.3e-05,0.00021,0.000202,0.000238,0.000125,0.000321,5.8e-05,0.000318,0.000258,0.000494,0.000372,8e-05,4.6e-05,0.000258,0.00047,0.000226,0.00052,0.000358,0.000216,0.000473,0.00035,0.000246,3e-04,0.000185,0.000271,0.000403,0.000719,0.000721,0.000575,0.000404,0.00026,0.000261,0.000331,0.000177,0.000181,0.000588,0.000497,0.000233,0.000697,0.000269,0.000213,0.000614,0.000631,0.000453,0.000529,0.000502,0.000255,0.000171,0.000583,0.000573,0.000136,0.000457,0.000115,0.000641,0.000597,0.000732,0.000767,0.000191,0.000667,0.000294,0.000448,0.000799,0.001896,0.001277,0.001251,0.000133,0.001428,0.000604,0.000903,0.000362,0.001302,0.000309,0.000621,0.000684,0.000475,0.000759,0.00039,0.000513,0.000827,0.000241,0.000967,0.000338,0.000509,0.000289,0.000498,0.001228,0.000185,0.000256,0.000311,0.000517,0.001539,0.000974,0.000761,0.000548,0.000683,0.000528,0.00033,0.000916,0.000248,0.000443,0.000656,0.00081,0.001131,0.001129,0.000426,0.000596,0.000701,0.00051,0.000297,0.00065,0.00309,0.002192,0.001694,0.000811,0.001949,0.00268,0.001804,0.001477,0.001032,0.00194,0.000416
1e-04,0.000101,0.000273,2e-04,0.000257,0.00046,0.000246,0.000374,0.000126,0.000586,0.000354,0.00028,0.000241,0.000354,0.000381,0.000282,0.000574,0.000577,0.000545,0.000336,7.9e-05,0.000107,0.000599,0.000386,0.000417,0.000315,0.000775,0.000671,0.000749,0.00094,0.000908,0.000555,0.000394,0.000364,0.000184,0.000617,0.000259,0.000127,0.000953,0.000673,0.000358,0.000635,0.000262,0.000379,0.000741,0.00116,0.001388,0.000198,0.000783,0.000707,0.000356,0.000354,0.000477,0.001222,0.001619,0.000755,0.001545,0.001523,0.001133,0.000863,0.000959,0.001725,0.001684,0.000822,0.001702,0.001821,0.001928,0.001515,0.001705,0.001073,0.001118,0.001085,0.001071,0.000178,0.000717,0.001277,0.001307,0.002216,0.002232,0.001677,0.001602,0.001188,0.000609,0.000592,0.000407,0.000934,0.001525,0.000671,0.001029,0.00135,0.001099,0.002458,0.000872,0.001469,0.002048,0.002011,0.000413,0.001194,0.001214,0.001337,0.001651,0.000689,0.001707,0.00226,0.00206,0.001487,0.001842,0.001913,0.001375,0.001634,0.00463,0.003239,0.002918,0.001914,0.003068,0.001148,0.000758,0.000965,0.000955,0.001955,0.001687
0.000169,0.000216,0.000298,0.000347,9.4e-05,0.000558,0.000386,0.000272,0.000331,0.000278,0.00013,0.000133,0.000206,0.000423,0.000307,0.000537,0.000938,0.000769,0.000632,0.000399,0.000473,0.000192,0.000262,0.00028,7.1e-05,0.000236,0.000571,0.000408,0.000749,0.000788,0.000671,0.000661,0.000973,0.000706,0.000696,0.000651,0.000543,0.000426,0.000811,0.000365,0.000466,0.000484,0.000992,0.000656,0.001034,0.00104,0.000804,0.001296,0.00191,0.001604,0.001181,0.00043,0.000557,0.00073,0.001312,0.002342,0.00178,0.00136,0.001261,0.000742,0.001266,0.000883,0.000591,0.001032,0.001129,0.001348,0.001035,0.000308,0.000577,5.6e-05,0.001269,0.001315,0.000577,0.001168,0.001173,0.001597,0.000553,0.001436,0.002353,0.001421,0.000802,0.000145,0.000367,0.000365,3.8e-05,0.000533,0.000794,0.000751,0.000983,0.001417,0.002291,0.002054,0.002376,0.000943,0.001433,0.000624,0.000671,0.000629,0.000299,0.00046,0.000423,0.000865,0.000963,0.001348,0.000775,0.000733,0.000862,0.000999,0.00055,0.001418,0.003118,0.002258,0.000993,0.000964,0.001253,0.000851,0.000609,0.000652,0.000762,0.001374,0.000777
0.000455,0.000168,0.000326,0.000277,0.000181,0.000187,0.000226,0.000385,7.2e-05,0.000423,0.000139,0.000695,0.000332,0.000369,0.000596,0.000447,0.000502,0.000771,0.000418,0.000198,0.000338,5.1e-05,0.000227,0.000694,0.000284,0.000467,0.000322,0.000561,0.000137,0.000213,0.000651,0.000136,0.000709,0.000255,0.000177,0.000455,0.000117,0.000773,0.000676,0.001068,0.000732,0.000213,0.000488,0.00035,0.000465,0.000639,0.000522,0.001396,0.000606,0.000144,0.000813,0.000893,0.000827,0.000767,0.000573,0.0016,0.000141,0.000789,0.000684,0.001244,0.000281,0.001649,0.001317,0.000848,0.000709,0.000761,0.000257,5.4e-05,0.001344,0.001057,0.000307,0.000318,0.000239,0.001459,0.000508,0.001167,0.000696,0.000548,0.000669,0.000192,0.000782,0.000303,0.000642,0.000778,0.000348,0.000807,0.000351,0.000416,0.000837,0.000652,0.001417,7.5e-05,0.0011,0.001447,0.000263,0.001246,0.000414,0.000652,0.000822,0.000374,0.000411,0.000595,0.000882,0.000364,0.000628,0.000743,0.000898,0.000667,0.000832,0.002076,0.002715,0.000122,0.000809,0.000561,0.000744,0.000639,0.000336,0.000356,0.000873,0.000774,0.000481
0.000657,0.000865,0.000818,0.000326,0.000407,0.000194,0.00068,0.001245,0.000871,0.000702,0.000861,0.001148,0.001385,0.001337,0.001076,0.001006,0.000941,0.001716,0.001666,0.001023,0.000356,0.00078,0.000956,0.00065,0.000719,0.000917,0.000599,0.001042,0.000712,0.000214,0.001611,0.001814,0.001068,0.000958,0.000963,0.001271,0.001003,0.000757,0.000814,0.000914,0.000503,0.000454,0.001025,0.000982,0.001274,0.00156,0.000993,0.00104,0.001589,0.001674,0.001526,0.00072,0.001115,0.000102,0.000725,0.001655,0.001423,0.001146,0.001441,0.000278,0.00054,0.001707,0.001593,0.001165,0.00076,0.000828,0.001597,0.000169,0.001454,0.000661,0.000351,0.001296,0.000874,0.001548,0.001432,0.001445,0.000965,0.000215,0.000641,0.000372,0.001291,0.001624,0.000477,0.000372,4e-04,0.001673,0.001454,0.001481,0.001057,0.00153,0.001137,0.001043,0.000773,0.001185,0.00121,0.001674,0.001154,0.000387,0.001013,0.001319,0.000805,0.001088,0.000376,4e-04,0.000157,0.001062,0.001648,0.001816,0.000489,0.001333,0.000987,0.000948,0.000151,0.001557,0.001395,0.002154,0.001308,0.001501,0.000512,0.000971,0.000695
0.001217,0.000912,0.001139,0.001259,0.000682,0.000734,0.001107,0.000457,0.00112,0.000991,0.000163,0.001246,0.001235,0.000761,0.000326,0.000546,0.000282,0.001474,0.002162,0.002001,0.001666,0.001355,0.000921,0.001716,0.001042,0.000219,0.000514,0.000803,0.000647,0.000171,0.001979,0.002014,0.001732,0.001596,0.000478,0.001863,0.000466,0.000501,0.001147,0.0016,0.001827,0.001347,0.002489,0.002632,0.002805,0.002214,0.001414,0.001416,0.000686,0.001323,0.00047,0.000912,0.001905,0.002615,0.002289,0.002605,0.003142,0.001723,0.000671,0.000789,0.000988,0.00275,0.001022,0.000293,0.000416,0.000528,0.001364,0.002539,0.001692,0.000934,0.000503,0.00203,0.000616,0.001343,0.002558,0.001256,0.000372,0.001239,0.000255,0.000508,0.000649,0.001321,0.002388,0.002068,0.000483,0.00211,0.001089,0.001084,0.000935,0.001401,0.002452,0.002508,0.002141,0.001504,0.000429,0.002557,0.002196,0.001132,0.001413,0.000606,0.001069,0.002019,0.001815,0.001308,0.000554,0.000601,0.001656,0.000933,0.001666,0.001936,0.001889,0.001554,0.001588,0.002316,0.002475,0.002004,0.001937,0.001244,0.001097,0.00116,0.001601
0.000401,0.000191,0.00079,0.000309,0.000258,0.000555,0.000562,0.000852,0.000463,7e-05,0.000363,0.000469,3e-04,0.000689,0.000649,0.000427,0.000134,0.001231,0.000652,0.000674,0.000945,0.001455,0.00104,0.001596,0.000694,0.000351,0.000435,0.001042,0.000157,0.000645,0.001734,7e-04,0.001218,0.000707,0.001496,0.001009,0.001259,0.000832,0.001113,0.000293,0.001287,0.000587,0.002062,0.001526,0.001919,0.000845,0.000735,0.000435,0.001396,0.001223,0.001824,0.001436,0.000158,0.002046,0.000286,0.000877,0.001316,0.000768,3.5e-05,0.000637,0.001432,0.001428,0.001244,0.000861,0.000776,0.001365,0.000522,0.002096,0.002434,0.001921,0.000819,0.001129,0.001525,0.000886,0.002064,0.001191,0.000872,0.000539,0.001251,0.002109,0.001317,0.001158,0.001963,0.000321,0.001131,0.001273,0.000747,0.00113,0.001944,0.000818,0.001687,0.001301,0.002366,0.00086,0.000838,0.001362,0.001064,0.000484,0.000904,0.001568,0.001623,0.000983,0.001849,0.000393,0.00043,0.000344,0.000919,0.000633,0.001276,0.000407,0.001131,0.000272,0.001223,0.000388,0.000864,0.001148,0.000623,0.002077,0.002255,0.000905,0.00074
0.000315,0.000259,0.000277,0.000599,0.000461,0.00018,0.00015,0.000185,0.000153,0.000231,0.000171,0.000246,0.000466,8.2e-05,0.000466,0.000411,0.000424,0.000483,0.001023,0.00034,0.000921,0.000221,0.000366,0.000612,0.000708,0.000353,0.000618,0.000345,0.001083,0.000954,0.000739,0.000832,0.000144,0.000607,0.000755,0.0014,0.000446,0.000542,0.001222,0.000583,0.001145,0.001318,0.000844,0.000536,0.001107,0.00051,0.00096,0.001302,0.000735,0.001318,0.001375,0.001344,0.000575,0.001683,0.001866,0.001352,0.000155,0.000462,0.000413,0.001189,0.001588,0.002168,0.001366,0.000782,0.000318,0.001471,0.001701,0.001852,0.001209,0.001304,0.001419,0.000223,0.001215,0.001676,0.001464,0.002213,0.001529,0.000989,0.000611,0.001763,0.002169,0.001609,0.001649,0.002028,0.001928,0.001553,0.001086,0.000981,0.001401,0.00047,0.001568,0.001763,0.000711,0.000873,0.000958,0.00203,0.001789,0.000817,0.000904,0.000877,0.000225,0.001351,0.000426,0.000698,0.000952,0.000384,0.000425,0.000733,0.000574,0.000731,0.000378,0.00039,0.000877,0.00074,0.000496,0.000656,0.001292,0.002231,0.00147,0.000674,0.000795
0.000157,0.000184,0.000119,0.000116,0.000134,0.000287,0.000144,0.000171,0.000139,0.000218,0.000177,0.000286,0.000316,0.000344,0.000153,0.000117,0.000144,0.000205,0.000493,0.000234,0.000313,0.00013,0.000343,0.000137,0.000187,0.000263,0.000177,0.000189,0.000737,9.5e-05,0.000314,0.000169,5e-06,0.000243,0.000235,0.000414,0.000833,0.000374,0.000758,0.000649,9.1e-05,0.000719,0.00087,0.00017,0.000283,0.000621,0.000102,0.000618,0.000259,0.000828,0.000695,0.000933,0.000918,0.000354,0.000553,0.000573,0.000735,0.000445,0.000272,0.000812,0.000631,0.000444,0.000188,0.000496,0.000727,0.000573,0.000846,0.000503,0.001184,0.000448,0.001221,0.001444,0.001147,0.000223,0.000697,0.001118,0.00051,0.000185,0.000522,0.00113,0.000559,0.001037,6.1e-05,0.00084,0.000489,0.000408,0.001095,0.001801,0.000741,0.00072,0.000702,0.000655,0.000122,0.00031,0.000292,0.00144,0.001014,0.001131,0.000422,0.000429,0.000423,0.000687,0.000795,0.000785,0.00028,0.000322,0.00027,0.000487,0.00072,0.000622,0.001247,0.000777,0.000767,0.000436,0.000603,0.000366,0.000808,0.000417,0.000556,0.000726,0.0011
0.00015,0.000147,0.000104,0.00018,7.4e-05,0.000165,4.9e-05,0.000153,9.5e-05,9.1e-05,5.7e-05,0.000311,0.00022,1e-04,0.000186,8.4e-05,4.3e-05,0.000214,0.000372,0.000307,0.000366,9e-05,0.000179,1.9e-05,0.000161,0.000111,0.000128,0.000104,0.000361,0.000144,0.000369,0.000342,0.000123,0.000163,3e-04,0.00024,0.000561,0.000316,0.00028,5.3e-05,0.000232,0.00032,0.00057,7.4e-05,0.000326,0.000226,0.000127,0.000491,0.000131,0.00058,0.000541,0.000384,0.000475,0.000184,0.000223,0.000595,0.000447,9.8e-05,0.000133,0.000412,0.000165,0.000219,0.000191,0.000336,0.000237,0.000318,0.000547,0.000615,0.000481,0.000449,0.000354,0.000706,0.000283,0.000381,0.000549,0.00041,0.000451,0.000392,0.000481,0.000496,0.000513,0.000526,0.00022,0.000316,0.000212,0.000302,0.000667,0.000687,0.000367,0.00043,0.000644,0.00081,0.000255,0.000175,0.000299,0.000623,0.000264,0.000483,0.000334,0.000196,0.000299,7.2e-05,8.5e-05,8.5e-05,0.000402,0.000216,0.000373,0.000172,0.000274,0.000467,0.000986,0.000378,0.000351,0.000397,0.000586,0.000129,0.000233,0.000114,0.000428,0.000211,0.000336
8e-05,6e-05,2.8e-05,0.000138,2.5e-05,7.9e-05,4.4e-05,0.000156,0.000184,0.000112,9.7e-05,0.000222,9.9e-05,3.3e-05,0.000107,7.1e-05,0.00011,0.000152,0.000304,0.000179,0.000181,0.000176,0.000277,8.9e-05,0.00016,0.000143,0.000168,7.4e-05,0.000336,0.000232,8.3e-05,0.000155,0.000158,0.000101,0.000305,2e-05,0.000296,0.000111,2.7e-05,0.000271,0.000257,0.00033,0.000427,0.000217,0.000393,0.000105,0.000177,0.000375,0.000247,0.000507,0.000365,0.000269,0.000614,0.000175,0.000218,0.000307,0.000379,0.000101,7.6e-05,0.000533,0.000137,0.000272,0.000193,0.000178,0.000397,7.7e-05,0.000328,0.000407,0.000367,0.00032,0.000218,0.000462,0.000189,0.000521,0.000709,0.000419,0.000415,2e-04,0.00051,0.000327,0.000386,0.000523,0.000304,0.000249,0.000333,0.000333,0.000443,0.000743,0.000367,0.00021,0.000294,0.000523,0.000114,0.000274,0.000395,0.000549,9.2e-05,0.000303,0.000199,0.000154,0.000347,0.000276,0.000175,0.000161,0.000348,0.000503,0.000226,0.000272,0.000317,0.000442,0.000854,0.000276,0.000116,0.000441,0.000473,7.2e-05,0.000198,8.5e-05,0.000342,0.000201,0.000155
9.3e-05,9.8e-05,6.4e-05,6e-05,7e-05,0.000126,0.000137,7.6e-05,0.000143,0.000134,0.000113,2.2e-05,0.000192,2.1e-05,8.1e-05,3.4e-05,0.000162,0.000197,0.000235,0.000256,0.000178,0.000282,0.000241,0.000137,7.7e-05,0.000238,9.9e-05,8e-05,0.000398,0.000222,2.6e-05,0.000247,0.000371,0.000176,0.000234,0.00012,0.000234,0.000159,0.00022,0.000131,0.000115,0.000334,0.000395,0.000356,0.000194,0.000364,0.00034,0.000303,0.000203,0.000452,0.000412,8.6e-05,0.000394,0.000131,0.000233,0.000433,0.000318,0.000137,0.000377,0.000476,0.000253,0.000147,0.000184,6.4e-05,0.000327,0.000368,0.000367,0.000525,0.000366,0.000221,0.000518,0.000764,0.000161,0.00071,0.000185,9.6e-05,0.000286,0.000301,0.000446,0.000404,0.000329,0.000858,0.000238,0.000321,0.000182,0.000309,0.000323,0.000672,0.000616,0.000298,0.000321,0.000288,0.000362,0.000527,0.00025,0.000397,0.000213,0.000281,0.000263,0.000119,0.000466,0.000542,0.000628,0.000518,0.000306,0.000749,0.000302,0.00048,0.000106,0.000455,0.001045,0.000128,0.000261,0.000347,0.000366,0.000368,0.00013,0.000259,0.000381,0.00018,0.000236
8.7e-05,0.00011,8e-05,0.000163,4.5e-05,0.000166,0.000157,0.000212,5.9e-05,0.000177,6.1e-05,0.000168,8.5e-05,0.000141,6.8e-05,5.8e-05,0.000209,0.000109,0.000232,0.00014,5.2e-05,0.000319,0.000347,0.000111,8.7e-05,0.00028,9.5e-05,0.000224,0.000498,0.00015,0.000203,0.000341,0.000703,2.7e-05,0.000558,0.000155,0.000301,0.000191,0.000519,0.000203,0.000288,0.000293,0.000569,0.000318,0.000168,0.000295,0.000556,0.000197,7.5e-05,0.000597,0.000459,0.000334,0.000671,0.000295,0.000629,0.000534,6.4e-05,0.000338,0.000634,0.000431,0.000841,0.000413,0.000237,0.000373,0.000498,0.00015,0.000141,0.000564,0.000351,0.000433,0.000403,7e-04,0.000316,0.000696,0.000754,0.000702,0.000837,0.000578,0.00087,0.000509,0.00059,0.000789,0.000222,0.000294,0.000426,0.000161,0.000359,0.001096,0.000777,0.000302,0.00079,0.000488,0.000429,0.001133,0.000312,0.00085,0.000235,0.000315,0.000627,0.000598,0.000468,0.000148,0.000892,0.000813,0.000619,0.001234,0.000206,0.000805,0.001042,0.000357,0.001405,0.000259,0.000309,0.000664,0.000173,0.000364,0.000418,0.000692,2.8e-05,0.000343,0.000473
2.2e-05,7.5e-05,9.9e-05,0.000213,0.000223,0.000153,0.000248,0.000552,0.000327,0.000209,0.000162,0.000385,0.000352,0.000344,0.00019,0.000135,0.000244,0.000297,0.000138,0.00019,0.000135,0.000297,0.00066,0.000317,0.000146,0.000355,0.000123,0.000121,0.000918,0.000494,0.000638,0.000752,0.001531,0.001449,0.000562,0.000641,0.000498,0.00058,0.000727,0.001054,0.00108,0.000962,0.000663,0.000763,0.000723,0.000557,0.001065,0.000737,0.000599,0.000902,0.000287,0.000336,0.001529,0.001579,0.001792,0.001733,0.000683,0.000333,0.001205,0.000913,0.000778,0.000556,0.000475,0.000291,0.000447,0.001022,0.000947,0.000278,0.00047,0.000231,0.001463,0.001503,0.000953,0.000994,0.001071,0.001866,0.000286,0.000192,0.00233,0.001696,0.000426,0.000675,0.001351,0.000223,0.000621,0.000632,0.000393,0.001658,0.002102,0.00116,0.001208,0.001681,0.001322,0.00101,0.001516,0.001652,0.000992,0.000597,0.000841,0.000255,0.000604,0.001047,0.001426,0.002498,0.002422,0.003269,0.002268,0.00028,0.001227,0.001511,0.002616,0.00231,0.001407,0.000545,0.000432,0.000215,0.000932,0.000169,0.00109,0.00108,0.001193
8.9e-05,0.000173,0.000249,0.000265,0.000471,0.000501,0.000248,0.000586,0.000547,0.000615,0.000591,0.00059,0.000126,0.000216,0.000127,0.000128,0.000242,0.000342,0.000739,0.000653,0.000586,0.000121,0.000783,0.000531,0.000155,0.000455,0.000291,0.000207,0.000836,0.000903,0.000507,0.000251,0.001122,0.001366,0.001744,0.001344,0.000408,0.000492,0.000691,0.001306,0.000756,0.000437,0.000646,0.000263,0.001224,0.001232,0.001926,0.001833,0.001802,0.001847,0.001599,0.000734,0.001619,0.00148,0.000607,0.000804,0.001483,0.00131,0.000789,0.001281,3e-04,0.000529,0.000823,0.000694,0.000776,0.001959,0.001011,0.000458,0.000626,0.00118,0.002393,0.002163,0.001621,0.000682,0.000274,0.002367,0.00297,0.001866,0.00273,0.003178,0.002049,0.001147,0.001254,0.001634,0.001135,0.000247,0.000955,0.001037,0.003114,0.002575,0.001728,0.002101,0.00129,0.001964,0.001679,0.002194,0.001628,0.000494,0.000737,0.001292,0.000687,0.000732,0.00129,0.001285,0.000315,0.001906,0.001881,0.001256,0.00049,0.000353,0.001639,0.002658,0.001951,0.001293,9e-04,0.00044,0.000724,0.001534,0.00208,0.000958,0.000961
5.2e-05,0.000121,0.000173,0.000127,0.00021,0.000161,0.000134,0.000384,0.000227,0.000193,0.000321,0.000151,1.7e-05,0.000164,0.000229,2e-04,0.000116,0.000345,0.000727,0.000316,0.000205,0.000224,0.000475,0.000516,0.000551,0.000712,0.000408,0.000371,0.000439,0.000619,0.000577,0.000538,0.000335,0.000785,0.000546,0.000193,0.00034,0.000658,0.001187,0.000901,0.000854,0.000105,0.000383,0.000522,0.000921,0.000946,0.001277,0.000356,0.001101,0.000741,0.000736,0.000353,0.000725,0.000127,0.000592,0.000379,0.000906,0.000629,0.0012,0.000726,0.000771,0.000778,0.001216,0.001191,0.000372,0.001617,0.00061,0.000172,0.000942,0.001027,0.000671,0.00064,0.000425,0.000762,0.000871,0.001697,0.001197,0.001089,0.00178,0.001544,0.000249,0.000422,0.001441,0.000892,0.000233,0.000161,0.000733,0.001395,0.002009,0.000994,0.001355,0.000171,0.000825,0.000726,0.00045,0.000725,0.000634,0.000537,0.000355,0.000969,0.000924,0.000605,0.000141,0.001186,0.001047,0.000707,0.000365,0.000286,0.000418,0.00035,0.000965,0.00071,0.000268,0.000281,0.000613,0.000899,0.000316,0.001463,0.000583,0.000258,0.000509
9.8e-05,8.8e-05,0.00014,0.000111,1e-04,0.000104,0.000124,0.000211,6.6e-05,0.000134,8.8e-05,6.8e-05,7.4e-05,0.000136,0.00014,0.000128,7.8e-05,0.000452,0.000266,0.000246,0.000273,0.000262,0.000222,0.000205,0.000138,0.000251,9.4e-05,0.000214,0.000369,0.000241,0.000156,0.000248,0.000162,0.000412,0.000213,0.000198,0.000433,0.000372,0.000431,0.000114,0.000133,0.000286,0.00033,0.000523,0.000237,0.000294,0.000401,0.000315,0.000548,0.000196,0.000503,0.000454,0.000367,0.000198,0.000104,0.000403,0.000609,0.000187,0.000471,0.00025,0.000347,0.000203,0.000648,0.00042,0.000498,0.000433,0.000478,0.000274,0.000911,0.000262,0.000119,0.000443,0.000175,0.000355,0.000731,0.000597,0.000726,0.000311,0.001441,0.000144,0.000385,0.000427,0.000232,0.000356,8.6e-05,0.000279,5.4e-05,0.000754,0.00032,0.000248,0.00028,0.000356,0.000467,0.000881,0.000832,0.000415,0.000364,0.000183,0.000214,0.000371,0.000313,0.000142,0.000144,0.000236,0.000387,0.000556,0.000106,0.00021,0.000143,0.000163,0.000507,0.000645,0.000272,0.000157,0.000349,0.000834,0.000858,0.000527,0.000494,9.9e-05,3e-04
0.000118,2.6e-05,3e-05,5.6e-05,4.4e-05,3.7e-05,5.4e-05,7.2e-05,3.7e-05,7.3e-05,8.5e-05,0.000123,3.2e-05,0.00014,7.3e-05,0.000152,0.000158,0.000226,9e-05,2.2e-05,0.000178,0.00012,5.7e-05,0.000101,3.8e-05,0.000128,0.000144,6.6e-05,3.5e-05,0.000237,3e-05,0.000249,0.00022,0.000326,0.000115,5.4e-05,0.000183,0.000249,0.000165,0.000127,0.000103,0.000243,0.000163,0.000429,0.000203,0.000259,0.000132,5.6e-05,0.00019,0.000134,0.000194,0.000136,0.000408,0.000128,9.8e-05,9.9e-05,0.000176,0.000151,0.000249,0.000121,0.000277,0.000205,0.000431,6.9e-05,0.000323,0.000188,0.000247,0.000185,0.000411,0.000335,0.000249,0.000109,3.1e-05,0.00028,0.000355,0.000255,0.000504,0.000239,0.000991,0.000457,0.000522,0.000213,0.00036,0.000175,0.000263,0.000332,0.000187,0.000419,0.000264,0.000241,0.00032,0.000401,0.000215,0.000341,0.000426,0.000269,6.4e-05,0.000168,0.000357,0.000422,0.000232,0.000109,0.00024,9.9e-05,0.000306,0.000214,0.000114,0.000251,0.000152,0.000282,0.000671,0.000361,0.000222,0.000155,0.000458,0.000471,0.000288,0.000398,0.000211,0.000219,0.000165
8.3e-05,2.3e-05,1.9e-05,4.3e-05,3.2e-05,5.7e-05,1.1e-05,8.7e-05,5.6e-05,9.8e-05,8.6e-05,0.000143,3.2e-05,2.9e-05,5.1e-05,7.1e-05,2.9e-05,0.000109,9.6e-05,5.8e-05,0.000118,5.8e-05,6.3e-05,5e-05,1e-04,7.2e-05,6.4e-05,1e-05,4.8e-05,0.000108,0.000149,0.00016,0.000152,0.000201,2.7e-05,4.6e-05,5.6e-05,0.000177,0.000216,6.5e-05,0.000104,0.000233,0.000254,8.2e-05,0.000117,0.000184,0.000148,0.000118,0.000242,0.000117,0.00015,0.000203,0.000152,0.000103,9.5e-05,0.000111,0.000315,9.6e-05,0.000296,0.000159,0.000243,7.7e-05,0.000233,0.00011,0.000165,0.000259,0.000147,0.000244,0.000362,0.000368,0.000257,0.000147,3.1e-05,0.000151,0.000284,0.000225,0.000365,0.000132,0.000535,0.000341,0.000365,0.000288,0.000142,0.000109,8.3e-05,0.000227,0.000134,0.000391,0.000273,9.5e-05,0.000153,0.000374,6.7e-05,0.000361,0.000156,0.000201,0.00012,0.000127,0.000125,0.000208,0.000147,0.000116,0.000152,0.000117,0.000127,0.000171,3.5e-05,5.5e-05,7.3e-05,0.000252,0.000422,0.000475,0.000128,0.000102,0.000415,0.000449,0.000349,0.000315,8.1e-05,0.000166,0.000227
2.4e-05,7e-06,1.7e-05,1.5e-05,1.9e-05,2.7e-05,1.3e-05,1.6e-05,4.1e-05,4.6e-05,3.5e-05,5.3e-05,2.2e-05,1.3e-05,2.4e-05,1.9e-05,4.1e-05,6.3e-05,4.6e-05,2.5e-05,5e-05,5.3e-05,6e-06,5.3e-05,2.7e-05,2e-05,1.1e-05,2e-05,2.7e-05,3.1e-05,5.8e-05,5.9e-05,8.5e-05,9e-05,1e-05,2.2e-05,6.4e-05,7.5e-05,0.000102,5.6e-05,4.2e-05,8.5e-05,7.9e-05,2.1e-05,3.5e-05,8.8e-05,5.3e-05,8e-05,0.000118,2e-05,9.8e-05,0.000111,0.000118,5.3e-05,6e-05,3.4e-05,0.000119,0.00014,4.3e-05,6.7e-05,5.5e-05,5e-05,0.000102,3.8e-05,2.9e-05,5.9e-05,7.8e-05,0.000121,0.000126,0.000146,6.5e-05,7.1e-05,8.3e-05,7.8e-05,0.00014,0.000125,0.000155,3.6e-05,0.000168,1e-04,0.000128,6.5e-05,6.2e-05,4.8e-05,0.000128,0.000126,5.6e-05,0.000116,8.2e-05,4.3e-05,6.8e-05,0.000215,6.3e-05,0.000154,0.00014,9.1e-05,0.000111,8.1e-05,4.8e-05,9.2e-05,3.3e-05,2.1e-05,6.2e-05,0.000104,0.000196,9.2e-05,1.5e-05,3.4e-05,8.7e-05,0.000155,0.000232,0.000147,4.7e-05,3.2e-05,0.000126,0.000103,0.000105,0.00017,1.4e-05,2.1e-05,8.7e-05
1.4e-05,9e-06,7e-06,7e-06,2.4e-05,1.2e-05,5e-06,1.6e-05,1.9e-05,3.2e-05,2.5e-05,6.4e-05,4e-06,1.8e-05,2.9e-05,2.6e-05,4.3e-05,6.9e-05,3.4e-05,3.9e-05,5.3e-05,3.9e-05,2.8e-05,2.2e-05,1.3e-05,3.4e-05,1.1e-05,2.8e-05,3.2e-05,4.6e-05,5.5e-05,9.1e-05,5.7e-05,6.8e-05,9.1e-05,6.4e-05,3.9e-05,3.5e-05,9.1e-05,8e-05,9.7e-05,8e-05,8.7e-05,2.3e-05,9e-05,9e-05,7.6e-05,3.8e-05,7.1e-05,2.8e-05,9.1e-05,0.000105,0.000133,3.7e-05,4.4e-05,9.4e-05,4.4e-05,0.000136,0.00016,8.6e-05,6.9e-05,4.4e-05,9.2e-05,4e-05,8.3e-05,7.9e-05,4.1e-05,8.7e-05,0.000129,7.1e-05,7.6e-05,3.4e-05,4.4e-05,0.000113,6e-05,0.000105,0.000125,6.3e-05,0.000178,0.000186,0.000204,9.6e-05,5.2e-05,0.000114,0.000179,0.000111,0.000113,9.2e-05,4e-05,8.1e-05,0.000103,0.000142,5.5e-05,5.6e-05,2.5e-05,0.000234,8.7e-05,6.4e-05,3.2e-05,0.000111,0.000114,4.6e-05,5.6e-05,0.000192,0.000109,0.000191,6.6e-05,7.6e-05,4.4e-05,5.7e-05,4.5e-05,0.000195,2e-05,7.8e-05,0.000134,5.3e-05,0.000106,7.1e-05,0.000107,8.7e-05,7.4e-05
2.4e-05,7e-06,8e-06,9e-06,2.5e-05,2.5e-05,7e-06,4e-06,1.7e-05,1.5e-05,2.1e-05,5.5e-05,3e-06,1.1e-05,3.7e-05,3.5e-05,8e-06,4.9e-05,2.5e-05,7e-06,6.2e-05,3e-05,3.4e-05,3.8e-05,2.1e-05,3e-06,2e-05,3.4e-05,7e-06,3.5e-05,2.3e-05,6.3e-05,4.2e-05,2.1e-05,4e-05,6.6e-05,2.4e-05,1.2e-05,6.7e-05,6.5e-05,5.6e-05,5.7e-05,0.00011,4.3e-05,6.1e-05,6.4e-05,6.7e-05,4.6e-05,7.5e-05,3.3e-05,4.9e-05,7.9e-05,7.3e-05,4.9e-05,4.9e-05,6.8e-05,1e-04,6.8e-05,4.5e-05,2.2e-05,2.1e-05,4.4e-05,8.1e-05,2.8e-05,2.1e-05,0.000115,8e-05,0.000101,9.4e-05,1e-04,8.9e-05,1.2e-05,4.3e-05,6.7e-05,4.1e-05,0.000141,3.8e-05,5.1e-05,0.000217,0.000147,0.000106,8.8e-05,5e-05,0.00012,5.7e-05,4.6e-05,6.1e-05,0.000129,2.8e-05,5.6e-05,0.000104,0.000191,3.3e-05,4.8e-05,9.4e-05,0.000135,3.4e-05,5.4e-05,5.8e-05,0.000101,6.2e-05,3.2e-05,1e-05,0.000126,4.7e-05,7.1e-05,3.3e-05,4.8e-05,2.7e-05,1.7e-05,0.000122,0.00015,5.3e-05,1.8e-05,0.000118,0.000106,3.9e-05,8.3e-05,4.2e-05,3.9e-05,4.7e-05
1.8e-05,1.4e-05,3e-06,4e-06,1.7e-05,7e-06,1e-05,1.2e-05,1.6e-05,1.9e-05,1.7e-05,5.9e-05,1.7e-05,2.1e-05,1.3e-05,1.6e-05,2.7e-05,4.4e-05,1.4e-05,2.1e-05,5.3e-05,3.1e-05,2.3e-05,1.7e-05,2.3e-05,3.3e-05,2.3e-05,1.2e-05,1.6e-05,5e-05,2.9e-05,6.6e-05,3.9e-05,4.8e-05,4.9e-05,3.8e-05,2.7e-05,2e-05,5.8e-05,2.4e-05,7.1e-05,4.1e-05,0.000103,2.5e-05,4.1e-05,5.3e-05,5.7e-05,4.4e-05,4.4e-05,7.2e-05,3.6e-05,0.000111,6e-05,1.5e-05,6e-05,3.1e-05,8.3e-05,1.8e-05,5.6e-05,2.2e-05,3.5e-05,1.9e-05,6.6e-05,2.6e-05,6.8e-05,7e-05,4e-05,9.8e-05,9.1e-05,5.7e-05,0.00011,2.2e-05,2.8e-05,8.9e-05,9.5e-05,0.000123,9.5e-05,3.1e-05,0.000215,0.000137,8.1e-05,9.4e-05,5.1e-05,0.000115,3.4e-05,4.2e-05,5.1e-05,0.00012,0.000105,7.2e-05,0.000103,0.000153,4e-05,3.9e-05,5.9e-05,5.6e-05,2.2e-05,3.7e-05,6.6e-05,6.3e-05,6.1e-05,3.5e-05,3.5e-05,0.000119,4.6e-05,6.9e-05,2.4e-05,5.9e-05,2.9e-05,2.8e-05,9.8e-05,0.00011,3.6e-05,1.6e-05,0.000127,0.000103,5.2e-05,7.6e-05,2e-05,3.8e-05,4.2e-05
2.3e-05,1.2e-05,9e-06,9e-06,1.7e-05,7e-06,1.2e-05,1.7e-05,2.5e-05,1.2e-05,2e-05,5.3e-05,2.1e-05,1.8e-05,2e-05,1.4e-05,2.8e-05,4.2e-05,1.5e-05,3.1e-05,6.1e-05,2.9e-05,1.7e-05,3.2e-05,2.7e-05,2.2e-05,1.7e-05,2.1e-05,8e-06,3.7e-05,3.6e-05,3.8e-05,5.2e-05,5.1e-05,1.4e-05,1.8e-05,3.6e-05,1.3e-05,5.5e-05,3.2e-05,4.5e-05,3.4e-05,8.9e-05,2.9e-05,4.3e-05,4.5e-05,3.5e-05,3.1e-05,5.1e-05,3.6e-05,4.6e-05,9.8e-05,7e-06,3.9e-05,3.3e-05,5.2e-05,8.1e-05,1.5e-05,6.2e-05,1.7e-05,1e-05,2e-06,4.6e-05,1.6e-05,8e-05,6.1e-05,1.4e-05,0.000119,0.00011,8.8e-05,6.5e-05,1.3e-05,2.4e-05,4.8e-05,5.4e-05,6e-05,4e-05,3.5e-05,0.000207,0.00013,8e-05,7.3e-05,3.6e-05,9.7e-05,1.1e-05,4.8e-05,4.2e-05,0.000128,8.9e-05,1.9e-05,4.6e-05,0.000168,2.9e-05,2.8e-05,6.3e-05,6.3e-05,5e-06,1.9e-05,4e-05,5.2e-05,5.8e-05,8e-06,4.4e-05,8.1e-05,3.9e-05,6.4e-05,2.4e-05,6e-05,1.1e-05,2.1e-05,0.000113,0.000117,5.2e-05,1e-06,0.000129,8.2e-05,7.8e-05,9.5e-05,1.5e-05,1.7e-05,4.9e-05
2.4e-05,1.4e-05,1e-06,1.6e-05,1e-05,8e-06,7e-06,9e-06,2.6e-05,2.3e-05,3e-05,5.7e-05,9e-06,1.7e-05,1.7e-05,1.4e-05,1.2e-05,4.2e-05,2.1e-05,3.3e-05,5.4e-05,2.3e-05,1.2e-05,3.4e-05,6e-06,1.7e-05,2.3e-05,1.1e-05,1.6e-05,5e-05,4.1e-05,4.2e-05,3.7e-05,3.3e-05,1.2e-05,1.9e-05,2.5e-05,2e-05,5.9e-05,1.7e-05,4.4e-05,3.7e-05,1e-04,4.6e-05,4.4e-05,3e-05,7.5e-05,1.2e-05,3.2e-05,4e-05,1.3e-05,6.5e-05,1.9e-05,2.4e-05,2.9e-05,2.7e-05,9.2e-05,2.3e-05,6.5e-05,1.1e-05,2.7e-05,1.8e-05,4.2e-05,5e-06,2.3e-05,7.4e-05,3.3e-05,9e-05,0.000107,7.5e-05,6.7e-05,9e-06,2.3e-05,3.3e-05,2.4e-05,4.5e-05,6.2e-05,3.3e-05,0.000177,0.000136,7.6e-05,7.1e-05,5.9e-05,7.4e-05,1.5e-05,2.9e-05,4.8e-05,0.000117,3.9e-05,4e-05,4.7e-05,0.00014,1.6e-05,1.9e-05,5e-05,3.4e-05,2.8e-05,6e-06,3.6e-05,5.9e-05,5e-05,4.1e-05,4.6e-05,8.8e-05,5.2e-05,4.7e-05,2.3e-05,5e-05,6e-06,2.4e-05,0.000111,8.5e-05,2.4e-05,1.1e-05,0.000109,7.1e-05,4.9e-05,9e-05,4e-06,3.4e-05,7.5e-05
2.1e-05,1.3e-05,1.4e-05,1.7e-05,1.4e-05,1.5e-05,9e-06,1.1e-05,1.9e-05,1.8e-05,2.8e-05,4.1e-05,5e-06,2.1e-05,1.1e-05,2.2e-05,2.8e-05,4.6e-05,2e-05,2.9e-05,3.9e-05,2.7e-05,1.8e-05,3.9e-05,3.5e-05,2.4e-05,2e-05,5e-06,1.4e-05,4.6e-05,5.2e-05,4.9e-05,4.9e-05,4.9e-05,2.7e-05,3e-05,3.1e-05,2.7e-05,4.8e-05,2.4e-05,4.8e-05,6.3e-05,8.9e-05,1.9e-05,3.4e-05,1.5e-05,7e-05,1.8e-05,4.2e-05,2.3e-05,2.7e-05,7.5e-05,2.4e-05,4.6e-05,2.6e-05,4e-05,8.6e-05,1.7e-05,5.2e-05,2.1e-05,4.1e-05,1.9e-05,3.1e-05,1e-06,4e-05,6.7e-05,1.9e-05,7.6e-05,0.000116,7.4e-05,8.5e-05,2e-05,2.8e-05,6.4e-05,6.2e-05,1.7e-05,2.2e-05,2.2e-05,0.000146,7.8e-05,6.1e-05,7e-05,2.3e-05,7.6e-05,2.1e-05,6.5e-05,3.3e-05,9.6e-05,7.4e-05,5.2e-05,5e-05,0.000125,1.4e-05,3.6e-05,6.7e-05,3.4e-05,1.3e-05,5e-06,2.5e-05,4.7e-05,4.4e-05,2.7e-05,3.9e-05,9.6e-05,2.3e-05,5e-05,3.1e-05,5e-05,1e-05,1.3e-05,8.6e-05,0.00011,4.5e-05,1.4e-05,9.4e-05,5.4e-05,6.5e-05,8.3e-05,9e-06,2e-05,4.7e-05
1.9e-05,1.3e-05,1.4e-05,8e-06,3e-06,1.3e-05,2e-06,6e-06,2.1e-05,1.5e-05,7e-06,3.9e-05,2.1e-05,2.3e-05,1.1e-05,6e-06,3.5e-05,5.8e-05,1.6e-05,2.5e-05,5.4e-05,3.5e-05,1e-05,2.6e-05,1.3e-05,2.1e-05,2.4e-05,1.7e-05,1.7e-05,3.4e-05,6.2e-05,4.2e-05,3.9e-05,3.8e-05,2.4e-05,1.3e-05,5e-05,4e-05,6.2e-05,2e-05,5.1e-05,8.2e-05,0.00011,4.6e-05,4.3e-05,3.8e-05,6.2e-05,4.2e-05,5.5e-05,1.9e-05,6.1e-05,8e-05,2.2e-05,2.6e-05,4.2e-05,3.7e-05,7.5e-05,1.6e-05,6.7e-05,4.1e-05,2.3e-05,2.3e-05,3.6e-05,1e-06,3.6e-05,8.2e-05,2e-05,6.5e-05,0.000106,4.5e-05,5.8e-05,1.1e-05,1.1e-05,4.6e-05,5.8e-05,5.9e-05,7.3e-05,7e-06,0.000131,8.1e-05,9.8e-05,4.9e-05,2.4e-05,8e-05,4.3e-05,2.5e-05,2.7e-05,0.000109,6.2e-05,5.3e-05,5.9e-05,0.000133,2e-05,6.3e-05,7.3e-05,7.1e-05,6e-06,1.9e-05,4.9e-05,2.9e-05,5.2e-05,3.1e-05,5.5e-05,8.3e-05,4e-05,4.6e-05,3.5e-05,4.3e-05,3e-05,3.2e-05,6.7e-05,0.000119,7.2e-05,2.2e-05,0.000116,5.1e-05,4.8e-05,9.2e-05,1.9e-05,3.2e-05,4.4e-05
1.7e-05,9e-06,1e-05,2.7e-05,2.3e-05,1.8e-05,1.6e-05,7e-06,1.4e-05,7e-06,2e-05,3e-05,3.4e-05,1.6e-05,6e-06,1.5e-05,2e-05,4.8e-05,2.1e-05,6e-06,6e-05,3.1e-05,1.9e-05,1.3e-05,1.1e-05,2.7e-05,1e-05,2.5e-05,6e-06,6.4e-05,4.5e-05,1.7e-05,2.6e-05,2.6e-05,3.4e-05,2.3e-05,3.4e-05,1.7e-05,5.3e-05,3.2e-05,7.3e-05,4.8e-05,6.5e-05,6.1e-05,8.6e-05,4.5e-05,5.5e-05,3.5e-05,2.9e-05,2.5e-05,4.6e-05,7.4e-05,1.9e-05,1.5e-05,7e-06,7e-05,2.1e-05,4.8e-05,6.3e-05,1.4e-05,4e-05,8e-06,3.7e-05,1e-05,5.8e-05,5.5e-05,4.3e-05,7.7e-05,0.000103,8.6e-05,0.000101,2e-05,7e-06,5.7e-05,6.3e-05,8.3e-05,4.2e-05,3.5e-05,0.000137,0.000101,7.1e-05,6.6e-05,5.3e-05,5.4e-05,2.4e-05,6.2e-05,4.2e-05,0.00011,1.3e-05,2.3e-05,2.3e-05,8.7e-05,3.6e-05,6.8e-05,3.5e-05,5.1e-05,1.3e-05,4.2e-05,1.2e-05,4.3e-05,4.1e-05,4.9e-05,4.5e-05,4.2e-05,2.3e-05,2.7e-05,2.5e-05,3.7e-05,3.7e-05,1.2e-05,6.6e-05,9.6e-05,4.3e-05,1.3e-05,0.000106,5.8e-05,6.6e-05,7.6e-05,2.1e-05,4.3e-05,5e-05
3.1e-05,1.1e-05,6e-06,3.1e-05,3.4e-05,1.4e-05,5e-06,1.4e-05,1.1e-05,1.9e-05,6e-06,2.7e-05,2.2e-05,2e-05,2.9e-05,3.1e-05,2.7e-05,5.4e-05,4e-06,2e-05,4.1e-05,3.9e-05,7e-06,3.2e-05,2.3e-05,1.4e-05,4e-06,2.9e-05,3.5e-05,7.4e-05,7.4e-05,1.8e-05,4.9e-05,2.8e-05,6.5e-05,2.2e-05,2.8e-05,1.6e-05,5e-05,5.7e-05,3.2e-05,4.6e-05,0.000127,2.5e-05,4.3e-05,5.2e-05,6.5e-05,5.6e-05,6.3e-05,5.9e-05,6.3e-05,3.6e-05,2.4e-05,4.2e-05,1.4e-05,6.6e-05,0.000112,1.1e-05,8e-05,6.1e-05,3.4e-05,1.4e-05,4.4e-05,2.5e-05,5.7e-05,5.3e-05,5.1e-05,4.3e-05,8.1e-05,8.3e-05,7.7e-05,2.3e-05,4e-06,5.3e-05,6.1e-05,3.1e-05,1e-06,2.6e-05,9.8e-05,0.000108,0.000117,5.7e-05,7e-06,6.5e-05,1.8e-05,6e-05,3.4e-05,7.5e-05,3.6e-05,5.4e-05,3e-06,0.000113,2.4e-05,8.8e-05,8.2e-05,4.1e-05,4.1e-05,7.2e-05,2.2e-05,6.3e-05,3.2e-05,1.2e-05,1.7e-05,7.9e-05,8e-06,5.5e-05,3.1e-05,2.7e-05,5.3e-05,3.3e-05,0.000104,8.6e-05,4.8e-05,1e-05,9.9e-05,4.4e-05,5.1e-05,4.9e-05,4.3e-05,1.5e-05,3.1e-05
1.1e-05,7e-06,1e-05,2.6e-05,1.4e-05,2.2e-05,1.7e-05,2.2e-05,1.8e-05,2e-06,2.2e-05,6e-05,1.9e-05,2e-06,4.1e-05,3.4e-05,5.1e-05,9.1e-05,5.1e-05,1.7e-05,2.6e-05,1.7e-05,4.2e-05,2.1e-05,2.9e-05,2.5e-05,2.1e-05,4.5e-05,5.1e-05,2.5e-05,5.4e-05,4.3e-05,3.7e-05,1.9e-05,3.6e-05,4.4e-05,4.1e-05,1.4e-05,4.6e-05,4.8e-05,5.3e-05,1.1e-05,9.1e-05,4.2e-05,3.7e-05,4.2e-05,7.8e-05,5.6e-05,7.8e-05,9.2e-05,2.6e-05,6.8e-05,6.3e-05,1.9e-05,1e-05,4.5e-05,4.6e-05,2.2e-05,4.9e-05,3.2e-05,6.7e-05,4.6e-05,4.3e-05,1.4e-05,4.6e-05,5.4e-05,5.7e-05,9.1e-05,6.4e-05,4e-05,3.2e-05,1.3e-05,3.5e-05,1e-05,0.000101,6.4e-05,3.2e-05,2.6e-05,0.000143,0.000105,0.000102,9e-05,7.6e-05,4.9e-05,1.4e-05,4.6e-05,4.7e-05,5.7e-05,7.5e-05,3e-05,6.3e-05,0.000128,2.8e-05,5.3e-05,5.3e-05,9.3e-05,6.6e-05,3.2e-05,5.4e-05,8.5e-05,4.2e-05,4.6e-05,2e-05,4.8e-05,5.5e-05,1.4e-05,2.4e-05,3.3e-05,2.4e-05,2.8e-05,7.9e-05,9.1e-05,7.2e-05,4.8e-05,0.000114,3.4e-05,3.2e-05,8.1e-05,2.6e-05,3.5e-05,6.2e-05
1.2e-05,1.2e-05,6e-06,1.3e-05,5e-06,1.6e-05,1e-05,1.3e-05,2.1e-05,8e-06,3e-05,5.5e-05,8e-06,9e-06,1.9e-05,1.6e-05,2.3e-05,5.2e-05,5e-06,8e-06,2.8e-05,7e-06,2.5e-05,2.8e-05,3.1e-05,4.4e-05,1.4e-05,2.4e-05,2.6e-05,2.8e-05,4.5e-05,2.8e-05,2.6e-05,6e-06,3.7e-05,3.6e-05,5.6e-05,4.1e-05,3.1e-05,4.7e-05,6.9e-05,3.3e-05,1e-04,4.4e-05,4e-05,4.3e-05,8.9e-05,4e-05,6.2e-05,4.3e-05,8.7e-05,5e-05,5e-05,3.5e-05,1.4e-05,1.5e-05,9.4e-05,2.9e-05,4.9e-05,2.9e-05,6.5e-05,2.6e-05,3.8e-05,3.1e-05,4.2e-05,5e-05,5.9e-05,8e-05,0.000103,6.2e-05,0.000121,3.8e-05,6.6e-05,1.5e-05,5.6e-05,2.7e-05,5.3e-05,3e-05,0.000153,8.2e-05,8.7e-05,3e-05,7.3e-05,8.6e-05,2.3e-05,3.1e-05,4.3e-05,3.3e-05,6e-05,5.4e-05,4.3e-05,0.000111,2e-05,9e-05,8.7e-05,8.9e-05,2.7e-05,5.1e-05,8.4e-05,7.9e-05,4e-05,4.7e-05,7.8e-05,0.000113,3.7e-05,4.9e-05,1.3e-05,4.1e-05,7e-06,3.2e-05,2.7e-05,0.000126,6.4e-05,2.3e-05,0.000102,7.2e-05,8.9e-05,7.8e-05,4e-05,1.6e-05,5.3e-05
1.8e-05,8e-06,2e-06,7e-06,1.2e-05,1.3e-05,6e-06,1.2e-05,2e-05,1e-05,2.2e-05,5e-05,1.4e-05,1.7e-05,1.1e-05,7e-06,1.8e-05,4e-05,2.9e-05,2.6e-05,5.2e-05,2.7e-05,1.5e-05,1.9e-05,3.5e-05,2e-05,1.1e-05,1.9e-05,2.3e-05,2.9e-05,5.5e-05,4.7e-05,3.7e-05,1.5e-05,4.5e-05,3.8e-05,6e-06,2.9e-05,2.3e-05,1.8e-05,4.2e-05,3.2e-05,7e-05,4.6e-05,3.3e-05,3.3e-05,2.2e-05,5.6e-05,4.7e-05,1.1e-05,6.7e-05,8.2e-05,5e-06,3.8e-05,3.5e-05,1.8e-05,8e-05,1.1e-05,5.4e-05,4.4e-05,4.1e-05,5.3e-05,8.3e-05,2.5e-05,1.9e-05,5.9e-05,1.7e-05,6.4e-05,9.4e-05,0.000102,4.7e-05,1.8e-05,4.8e-05,6.3e-05,4.5e-05,2.2e-05,3.8e-05,2.8e-05,0.000109,7e-05,1e-04,3.7e-05,3.9e-05,6.1e-05,2.5e-05,6.1e-05,4.8e-05,3.7e-05,3.6e-05,4.7e-05,3.3e-05,0.000137,1.6e-05,7.7e-05,6.8e-05,2.3e-05,1.9e-05,5.1e-05,2.1e-05,7.1e-05,3e-05,4.7e-05,3.7e-05,8.5e-05,8e-05,1.2e-05,1.5e-05,4.5e-05,1e-05,3.4e-05,8.6e-05,9.2e-05,3.9e-05,1.2e-05,6.9e-05,0.000102,7.3e-05,8.8e-05,1.5e-05,1.1e-05,3.6e-05
2.1e-05,1.3e-05,7e-06,7e-06,9e-06,9e-06,4e-06,1e-06,1.6e-05,4e-06,1.8e-05,4.5e-05,1.6e-05,3e-06,2.4e-05,1.4e-05,2.4e-05,4.4e-05,3.3e-05,1.6e-05,3.7e-05,3.1e-05,1.4e-05,2.2e-05,1.3e-05,2.9e-05,9e-06,2.6e-05,2e-05,1.3e-05,2.8e-05,1.5e-05,2.7e-05,1e-05,1.6e-05,2.1e-05,1.6e-05,2.8e-05,9e-06,4e-06,5.1e-05,3.9e-05,8.6e-05,3.4e-05,3.9e-05,1.4e-05,4e-05,2.1e-05,4.9e-05,2.6e-05,5.7e-05,6.2e-05,2.6e-05,1.3e-05,2.4e-05,3e-05,5.8e-05,3.5e-05,3.7e-05,2.8e-05,4.8e-05,2.8e-05,3.9e-05,1.4e-05,2e-05,8.4e-05,5.7e-05,8.4e-05,9.7e-05,6.6e-05,6.4e-05,2.7e-05,1.4e-05,2.5e-05,3.4e-05,1.9e-05,3.9e-05,3.7e-05,0.000116,9.8e-05,8.5e-05,5.6e-05,4.4e-05,5.3e-05,9e-06,4.2e-05,2.6e-05,5e-05,3.4e-05,2e-05,3.6e-05,0.000103,1.9e-05,5.3e-05,7.5e-05,7e-05,3.9e-05,5e-06,3.4e-05,6e-05,5.9e-05,2e-05,4.4e-05,8.6e-05,5.4e-05,4.6e-05,3.9e-05,3.2e-05,1.4e-05,1.7e-05,6.2e-05,5.3e-05,1.8e-05,1.2e-05,5.3e-05,5.9e-05,6.3e-05,6.4e-05,1e-05,2.3e-05,4.3e-05
1.7e-05,9e-06,9e-06,1e-05,1e-05,5e-06,7e-06,1e-05,7e-06,7e-06,1.7e-05,4.7e-05,1.2e-05,1.4e-05,2.5e-05,1.9e-05,2.3e-05,4.5e-05,2e-05,1.9e-05,3.9e-05,2.7e-05,7e-06,1.5e-05,1.2e-05,2.2e-05,1e-05,1.8e-05,1.3e-05,1.2e-05,3.8e-05,3e-05,3.8e-05,1.4e-05,2.7e-05,2e-05,2.2e-05,8e-06,3e-06,1.3e-05,4.3e-05,4.4e-05,6.5e-05,3.9e-05,3e-05,1.5e-05,4.2e-05,1.8e-05,5.2e-05,3.7e-05,3.2e-05,6.1e-05,4e-05,3e-06,1.4e-05,2.3e-05,6.6e-05,3.1e-05,2.6e-05,1.8e-05,2.8e-05,1.6e-05,4.5e-05,5e-06,1.2e-05,8e-05,1.9e-05,6.9e-05,0.000118,7.6e-05,8.5e-05,2.2e-05,2.2e-05,3.2e-05,2.4e-05,2.2e-05,4e-06,3.1e-05,0.00011,9.5e-05,9.5e-05,3.7e-05,6.8e-05,6.3e-05,2.1e-05,2.4e-05,3.1e-05,6.2e-05,3.6e-05,4.2e-05,2.5e-05,0.000117,3.5e-05,5.1e-05,7.6e-05,6.1e-05,1.5e-05,1.9e-05,2.1e-05,3.3e-05,3.3e-05,3.4e-05,1.9e-05,7.2e-05,4.4e-05,4.7e-05,3.5e-05,5e-05,1.4e-05,2.5e-05,7.8e-05,5.6e-05,3.5e-05,2.7e-05,5.9e-05,7.3e-05,4.8e-05,6.8e-05,1.6e-05,2.4e-05,4e-05
1.5e-05,9e-06,8e-06,3e-06,8e-06,1.5e-05,5e-06,9e-06,1.1e-05,7e-06,1.9e-05,5e-05,4e-06,5e-06,1e-05,1.4e-05,1.1e-05,4.4e-05,3.4e-05,1.8e-05,3.2e-05,1.6e-05,5e-06,8e-06,8e-06,1.8e-05,1.8e-05,1.2e-05,5e-06,2.4e-05,3.4e-05,5.2e-05,4.1e-05,1.1e-05,2.1e-05,2.1e-05,9e-06,4e-06,1.5e-05,3.4e-05,3.8e-05,3.3e-05,8.1e-05,2.8e-05,3.7e-05,2.3e-05,1.4e-05,2.2e-05,4e-05,4.1e-05,2.1e-05,5.7e-05,3.9e-05,1.1e-05,1e-06,2.1e-05,7.7e-05,2.4e-05,2.3e-05,1.2e-05,1.4e-05,1.4e-05,3.2e-05,2.1e-05,2.2e-05,9.3e-05,3.8e-05,5.8e-05,0.000101,5.4e-05,7.3e-05,1.8e-05,2.3e-05,3.7e-05,3.3e-05,2.8e-05,2.9e-05,1.4e-05,0.000128,8.8e-05,6.9e-05,5.9e-05,3.2e-05,3.7e-05,2.8e-05,7e-06,2.2e-05,4.1e-05,4.4e-05,4.2e-05,2e-05,0.000111,1.6e-05,7.3e-05,4.4e-05,6e-05,2.9e-05,2.1e-05,5.7e-05,1.6e-05,2.2e-05,3e-05,4.4e-05,4.3e-05,4.7e-05,1.8e-05,2.6e-05,3.7e-05,6e-06,2.1e-05,7.2e-05,7e-05,1.1e-05,2e-05,9.9e-05,6.5e-05,5.1e-05,7.9e-05,3.1e-05,1.8e-05,3.2e-05
1.6e-05,1.4e-05,4e-06,2e-06,4e-06,1.3e-05,3e-06,4e-06,1.1e-05,1.4e-05,1.6e-05,5.1e-05,1e-05,1.6e-05,6e-06,9e-06,1.3e-05,3e-05,2.5e-05,1.4e-05,3.7e-05,2.4e-05,9e-06,6e-06,9e-06,2.5e-05,9e-06,1.5e-05,8e-06,1.8e-05,3e-05,3.8e-05,2.9e-05,2.3e-05,2.3e-05,2.3e-05,1.4e-05,5e-06,1.3e-05,2.1e-05,3.6e-05,3.1e-05,7.9e-05,2.2e-05,3.3e-05,1.3e-05,2.9e-05,1.5e-05,1.4e-05,3.6e-05,1.3e-05,5.5e-05,3.6e-05,6e-06,9e-06,2.8e-05,8.4e-05,2.1e-05,4.5e-05,8e-06,3e-05,1.2e-05,4e-05,1.8e-05,3.3e-05,4.9e-05,3.7e-05,7.3e-05,8.3e-05,6.9e-05,7.2e-05,2.1e-05,0,3.8e-05,2.2e-05,2.7e-05,2.9e-05,1.9e-05,0.000142,8.5e-05,6.1e-05,5.9e-05,3.7e-05,2.9e-05,8e-06,3.5e-05,3.9e-05,4.8e-05,3.7e-05,1.2e-05,2.6e-05,0.000123,2.2e-05,6.8e-05,5.8e-05,5e-05,1.1e-05,1.6e-05,3.1e-05,5e-05,1.8e-05,1.8e-05,2.5e-05,4.5e-05,4.5e-05,1.3e-05,2.9e-05,2.4e-05,9e-06,1.2e-05,7.8e-05,8.5e-05,1.6e-05,1.3e-05,9.3e-05,6.8e-05,4.5e-05,7.3e-05,1.1e-05,1.8e-05,4.5e-05
1.7e-05,1.1e-05,5e-06,1e-06,3e-06,1.1e-05,6e-06,2e-06,1.2e-05,1.1e-05,1.9e-05,4.8e-05,9e-06,8e-06,8e-06,1e-05,1.4e-05,3.2e-05,2.6e-05,1.8e-05,4e-05,2.2e-05,6e-06,1e-05,5e-06,2.3e-05,8e-06,1.6e-05,1.2e-05,2e-05,3.4e-05,2.4e-05,3.6e-05,2.4e-05,2.3e-05,2.1e-05,6e-06,9e-06,5e-06,1.2e-05,3.4e-05,3.1e-05,7.7e-05,2.6e-05,2.9e-05,9e-06,2.7e-05,1e-05,3.8e-05,2.7e-05,2.9e-05,5.4e-05,3e-05,3e-06,3e-06,2.2e-05,6.6e-05,3e-06,3e-05,1.2e-05,2.5e-05,1e-05,3.9e-05,1e-05,3.7e-05,7.1e-05,2.7e-05,6.6e-05,9.1e-05,7.2e-05,6e-05,1.1e-05,1.1e-05,4.2e-05,2.8e-05,3.2e-05,3.4e-05,6e-06,0.000131,9.5e-05,7.5e-05,5e-05,4e-05,3.8e-05,4e-06,3e-05,3.6e-05,4e-05,2e-05,1.4e-05,3.3e-05,0.000113,3.4e-05,3.2e-05,5e-05,4.4e-05,1.4e-05,1.6e-05,2.7e-05,4.4e-05,3e-05,5e-06,3.5e-05,4.8e-05,3.7e-05,2.4e-05,2.5e-05,2.8e-05,3e-06,5e-06,7.2e-05,7.7e-05,2.1e-05,1.5e-05,8.3e-05,5.3e-05,5.6e-05,5.6e-05,1.6e-05,1.5e-05,4.1e-05
1.5e-05,8e-06,5e-06,2e-06,3e-06,9e-06,6e-06,7e-06,1.5e-05,7e-06,1.4e-05,4.4e-05,5e-06,6e-06,1e-05,1.1e-05,1.5e-05,3.4e-05,2.5e-05,1.5e-05,4.1e-05,2.4e-05,3e-06,4e-06,1e-06,1.9e-05,1e-05,1.2e-05,1.2e-05,1.4e-05,2.9e-05,2.7e-05,2.8e-05,2e-05,2e-05,1.5e-05,1.3e-05,8e-06,8e-06,1.3e-05,3.3e-05,2.9e-05,7.6e-05,2.7e-05,3e-05,2e-06,3.9e-05,1.5e-05,3.4e-05,3.5e-05,2.5e-05,5.7e-05,3e-05,1e-06,2e-06,1.9e-05,7.5e-05,1.6e-05,3e-05,1.4e-05,1.5e-05,4e-06,4.1e-05,1.1e-05,3.1e-05,6.8e-05,3e-05,6.9e-05,7.7e-05,7.2e-05,6.6e-05,1e-06,6e-06,3.6e-05,3e-05,3.6e-05,2.9e-05,8e-06,0.00012,8.5e-05,7.1e-05,5.1e-05,3.2e-05,4e-05,2e-06,3e-05,3.4e-05,4.7e-05,3e-05,2e-05,2.2e-05,0.000112,2.3e-05,5e-05,5.5e-05,4.5e-05,1.7e-05,2.1e-05,1.2e-05,4.9e-05,2e-05,1.1e-05,3.2e-05,5.2e-05,3.9e-05,2.5e-05,2.9e-05,3.4e-05,4e-06,1e-05,8.7e-05,8.2e-05,2.2e-05,1.6e-05,8.6e-05,5.3e-05,5.1e-05,5.8e-05,1.2e-05,1.8e-05,4.5e-05
1.6e-05,9e-06,4e-06,1e-06,3e-06,9e-06,4e-06,5e-06,1.6e-05,5e-06,1.6e-05,4.3e-05,4e-06,6e-06,8e-06,1.1e-05,1.3e-05,3.7e-05,2.5e-05,1.3e-05,3.8e-05,2e-05,2e-06,1e-05,5e-06,2e-05,8e-06,1.5e-05,7e-06,1.8e-05,3.1e-05,2.9e-05,2.7e-05,1.9e-05,1.6e-05,1.8e-05,1.9e-05,8e-06,5e-06,8e-06,3.1e-05,2.8e-05,7.7e-05,2.5e-05,2.8e-05,6e-06,3.6e-05,1.1e-05,3.2e-05,3.3e-05,3e-05,5.6e-05,3.1e-05,1e-06,4e-06,1.7e-05,6.6e-05,9e-06,3.3e-05,1.2e-05,1.2e-05,5e-06,3.1e-05,1.6e-05,2.7e-05,6.1e-05,2.7e-05,6e-05,8.6e-05,6.4e-05,6.2e-05,4e-06,6e-06,4.1e-05,2.8e-05,3e-05,3e-05,1e-06,0.000116,8.3e-05,7.5e-05,5e-05,3.3e-05,3.8e-05,4e-06,3.4e-05,3.5e-05,5e-05,2.9e-05,2.5e-05,2.4e-05,0.000109,2e-05,4.7e-05,5.5e-05,3.9e-05,6e-06,6e-06,2.2e-05,3.9e-05,2.5e-05,1e-05,3.2e-05,5.3e-05,3.8e-05,1.9e-05,2.9e-05,3.8e-05,2e-06,7e-06,8.2e-05,7.1e-05,1.9e-05,7e-06,8.3e-05,5.5e-05,4.7e-05,6.4e-05,8e-06,1.6e-05,4.2e-05
