4e-06,1e-06,-4.4e-05,-0.000277,-0.001046,-0.004602,-0.005958,-0.005795,-0.015265,-0.015338,-0.009453,-0.011155,-0.010792,-0.00845,-0.005294,-0.003468,-0.002037,-0.001291,-0.000894,-0.000624,-0.000377,-0.000159,-7.1e-05,-4.2e-05,-2.4e-05,-1.4e-05,-4e-06,-2e-06
3e-06,3e-06,-1.3e-05,3.6e-05,0.000713,0.00422,0.005731,0.005513,0.010055,0.010221,0.007821,0.00625,0.007654,0.007309,0.003481,0.002057,0.001605,0.000877,0.000544,0.000243,0.000111,-1.7e-05,-2e-06,-1e-06,0,-6e-06,-7e-06,-3e-06
2e-06,2e-06,1.2e-05,1.7e-05,-7.7e-05,-0.000929,-0.001352,-0.001984,0.000691,-0.001379,-0.004632,-0.00059,-4e-06,-0.000861,-0.001552,-0.00165,-0.001178,-0.000368,-0.000111,-7.2e-05,-7.9e-05,1.1e-05,1e-06,-4e-06,-3e-06,-1e-06,-6e-06,-3e-06
2e-06,3e-06,2e-05,3.6e-05,-0.000241,-0.001666,-0.00283,-0.001886,-0.004655,-0.002371,0.000722,-0.000462,-0.003565,-0.004151,-0.000259,0.00047,1.8e-05,-9.2e-05,-0.000113,-3.7e-05,3e-05,4.3e-05,2.5e-05,1.4e-05,5e-06,6e-06,0,0
1e-06,3e-06,4e-06,0.000108,0.000626,0.003399,0.004455,0.004422,0.007259,0.008586,0.007942,0.005313,0.005181,0.005815,0.004103,0.003003,0.00203,0.000815,0.000499,0.000393,0.000282,7.5e-05,4.2e-05,2.7e-05,1.2e-05,7e-06,6e-06,2e-06
0,0,-2.3e-05,-0.000126,-0.00041,-0.002094,-0.001524,-0.002237,-0.003028,-0.006034,-0.00717,-0.004299,-0.000933,-0.000423,-0.002946,-0.002599,-0.001436,-0.000637,-0.000286,-0.000163,-0.000143,-3.5e-05,-2.6e-05,-1.7e-05,-9e-06,-5e-06,4e-06,0
0,-1e-06,4e-06,-5.7e-05,-0.000411,-0.00175,-0.002656,-0.001977,-0.006354,-0.005555,-0.003249,-0.004291,-0.005391,-0.00522,-0.002189,-0.001179,-0.00087,-0.000362,-0.000341,-0.000311,-0.000217,-9.4e-05,-4.6e-05,-2.1e-05,-4e-06,-2e-06,1e-06,0
1e-06,2e-06,3.2e-05,0.000179,0.000631,0.003162,0.00328,0.003173,0.005612,0.006767,0.006421,0.004941,0.002918,0.002537,0.002932,0.0022,0.001249,0.000768,0.000405,0.000229,0.000159,3e-05,1.3e-05,1.2e-05,1.1e-05,6e-06,1e-06,1e-06
1e-06,1e-06,-6e-06,-5e-06,6e-06,-0.000815,-0.000618,-0.001507,0.001583,7.6e-05,-0.003241,0.000218,0.002401,0.001363,-0.000619,-0.000746,-0.000371,-0.000105,1.7e-05,8.9e-05,6.4e-05,8.5e-05,3.7e-05,1.2e-05,-2e-06,0,-3e-06,-1e-06
1e-06,-1e-06,-3.4e-05,-0.000129,-0.000304,-0.00087,-0.000782,0.000215,-0.000928,-0.000291,0.001611,8.6e-05,-0.000881,-9.4e-05,0.000647,0.00063,0.000224,-0.000275,-6.5e-05,-6e-06,-1e-06,8e-06,8e-06,1e-06,-6e-06,-4e-06,-5e-06,-1e-06
0,-1e-06,-1.3e-05,-2.7e-05,8e-06,0.000984,0.000935,0.000792,-0.001724,-0.000542,0.002012,-0.000626,-0.001537,-0.000528,-8.6e-05,0.000306,0.000304,-9.2e-05,-6.5e-05,-5.9e-05,-3.2e-05,-8.7e-05,-3e-05,-1.1e-05,-2e-06,-5e-06,-2e-06,0
0,0,1.4e-05,3.1e-05,-8.1e-05,-0.001767,-0.002207,-0.002146,-0.002597,-0.003679,-0.006042,-0.002865,2e-05,-0.001274,-0.002576,-0.002644,-0.00114,-1.3e-05,-0.00018,-0.000194,-0.000148,-5e-05,-2.4e-05,-1e-05,3e-06,1e-06,2e-06,2e-06
-1e-06,0,2.1e-05,0.000107,0.000284,0.001116,0.001159,0.001171,0.004963,0.003935,0.002472,0.00282,0.001329,0.000841,0.001618,0.001113,0.00019,0.000207,0.000176,8.6e-05,5e-05,5.5e-05,9e-06,7e-06,1.2e-05,1e-05,7e-06,4e-06
-1e-06,-1e-06,-4e-06,3e-05,0.000148,0.001881,0.002433,0.001487,0.001369,0.001791,0.00356,0.001046,-0.001117,0.00048,0.001493,0.001838,0.000797,1.4e-05,9e-05,0.000121,0.000156,5.6e-05,2.3e-05,8e-06,1e-06,4e-06,6e-06,3e-06
-2e-06,-3e-06,-2.5e-05,-0.000133,-0.000471,-0.003068,-0.003248,-0.0023,-0.007013,-0.005533,-0.003481,-0.002391,0.000253,-0.000379,-0.001461,-0.001467,-0.000249,-7.7e-05,-0.000125,-5e-05,-5.8e-05,-4e-06,7e-06,2e-06,-8e-06,-6e-06,-2e-06,-1e-06
-3e-06,-2e-06,-3e-06,-1.4e-05,0.000133,0.000607,0.000505,0.000931,0.003571,0.003356,0.001149,0.001433,0.000979,0.001118,0.000954,0.000672,0.000167,5.1e-05,9.2e-05,0.000105,-1.3e-05,-3.1e-05,-1.6e-05,-2e-06,1e-06,-5e-06,-7e-06,-4e-06
-3e-06,-2e-06,8e-06,5.4e-05,0.000174,0.002395,0.002722,0.001622,0.0049,0.003512,0.000714,0.00059,-8.9e-05,-0.000736,-0.000338,0.000456,-3.3e-05,8.4e-05,4.4e-05,-4.1e-05,5e-06,-4.9e-05,-2.5e-05,-1.1e-05,-2e-06,-4e-06,-8e-06,-5e-06
-3e-06,-2e-06,-9e-06,-2.5e-05,-0.000272,-0.002643,-0.003141,-0.002483,-0.007017,-0.006824,-0.00354,-0.002649,-0.001423,-0.001861,-0.001928,-0.002271,-0.000815,-0.000171,-0.000305,-0.000273,-0.000156,-4.8e-05,-1.8e-05,-1.3e-05,-9e-06,-6e-06,-5e-06,-3e-06
-3e-06,-2e-06,-6e-06,2.2e-05,0.000262,0.000276,0.000265,0.000311,-0.000164,0.000216,0.002458,0.001056,-0.000696,0.000918,0.001408,0.000883,0.000353,-0.000115,3.3e-05,8.1e-05,4.8e-05,4.7e-05,1.4e-05,7e-06,1e-06,0,2e-06,1e-06
