2e-06,5e-06,5e-06,1.8e-05,6.5e-05,2.1e-05,5e-06,2e-06,4.2e-05,0.000105,4.3e-05,1.4e-05,3.9e-05,3.8e-05,0.000103,2.7e-05,3e-05,0.000312,0.00016,3.9e-05,7.2e-05,2.3e-05,4.1e-05,5.2e-05,0.000232,1e-04,3e-04,0.000347,9e-05,6.5e-05,9.7e-05,0.000151,0.000494,0.000471,0.00048,0.000273,0.000138,0.000203,0.000306,0.000177,0.000238,0.000122,6.1e-05,0.000234,0.000129,0.000205,4e-04,0.000201,6.5e-05,0.000336,6e-05,0.000766,0.000367,0.000586,0.000729,0.000258,3.8e-05,9e-05,0.000292,0.000304,0.000132,0.000291,0.000143,2.3e-05,0.000305,0.000236,0.000422,0.000468,0.000173,0.000714,0.000918,0.000498,7.3e-05,2.1e-05,0.000417,0.000203,3.1e-05,0.000166,8.9e-05,0.000665,0.000283,7.7e-05,0.000132,0.000426,0.000128,0.000794,0.000375,0.000634,0.000167,0.000227,0.000178,0.000491,0.000291,7e-05,0.000179,0.000798,0.000577,0.000104,0.000828,0.00063,0.000203,0.000299,0.000485,0.000681,0.000139,0.000461,0.000425,0.000463,1e-05,0.000648,0.000201,0.000843,0.000616,0.000958,0.000199,0.001082,0.000352,0.000402,0.000299,7.4e-05,0.000402
1.3e-05,1.3e-05,3e-05,5.4e-05,0.000126,7.9e-05,7.4e-05,3.4e-05,0.000121,0.000327,9.7e-05,0.000133,0.000104,8.7e-05,0.000343,0.000169,0.000254,0.000816,0.000282,0.000488,0.00057,0.000453,0.000276,7.7e-05,0.000737,5.1e-05,0.000207,0.000704,0.000564,0.000323,0.000344,0.000361,0.00143,0.000866,0.001365,0.000248,0.000498,0.000856,0.001174,0.000265,0.000597,0.000534,0.000835,0.000972,0.000307,0.000619,0.000743,0.001154,0.000728,0.001258,0.000622,0.001891,0.001627,0.002534,0.000922,0.000802,0.00026,0.000107,0.000629,0.00062,0.000583,0.000794,0.000646,0.000673,0.000339,0.000868,0.001501,0.001173,0.000793,0.002198,0.000995,0.00049,0.000536,0.000678,0.000756,0.000535,0.000382,0.000854,0.000748,0.001854,0.001277,0.000539,0.000377,0.000799,0.000579,0.001647,0.000306,0.00181,0.000816,0.000384,0.000121,0.000732,0.000496,0.000255,0.000296,0.001938,0.000912,0.000282,0.002166,0.001279,0.000551,0.001062,0.001443,0.001924,0.000893,0.00062,0.001165,0.001106,0.000354,0.001294,0.00018,0.001802,0.001254,0.002526,0.000912,0.001244,0.001819,0.001586,0.001061,0.00056,0.000529
1.5e-05,3.9e-05,3.9e-05,3.8e-05,8.6e-05,3.8e-05,0.000159,0.000189,0.00019,0.000319,0.000238,0.000166,0.000236,0.000147,0.000396,0.000587,0.000244,0.000897,0.000228,0.00033,0.00041,0.00039,0.000165,0.000311,0.000868,0.000583,0.000795,0.000488,0.000202,0.00035,0.000126,0.000566,0.001571,0.000755,0.000845,0.000444,0.00069,0.000971,0.000287,0.000261,0.000512,5.7e-05,0.000719,0.000764,0.001551,0.001711,0.000785,0.001908,0.00125,0.000737,0.000582,0.000946,0.000518,0.001546,0.002612,0.001376,0.000983,0.000363,0.000543,0.00046,0.00073,0.000577,0.00082,0.000319,0.001113,7e-04,0.000995,0.000666,0.001459,0.001155,0.002839,0.000534,8.4e-05,0.000626,0.001649,0.000454,0.000671,0.000468,0.001083,0.001259,0.001013,0.000826,0.000983,0.001115,0.001127,0.00185,0.000587,0.00214,0.000592,0.000495,0.000318,0.001718,0.000314,0.000633,0.000387,0.00236,0.000422,0.000372,0.002834,0.001006,0.001033,0.00172,0.002027,0.002026,0.001233,0.001085,0.001183,0.000955,0.000491,0.001576,0.000701,0.001232,0.00256,0.001456,0.000448,0.001547,7e-04,0.000743,0.001084,0.00041,0.001241
6.5e-05,0.000131,9.7e-05,8.5e-05,0.000293,4.9e-05,0.000291,0.00015,5e-05,9.7e-05,0.000177,2e-05,0.000398,0.000112,0.000402,0.000553,0.000621,0.000689,0.000343,0.000716,0.000416,0.000404,0.000104,0.000638,0.000404,0.000177,0.001357,0.000497,0.000266,0.000529,0.000393,0.001186,0.00097,0.00025,0.001951,0.00146,0.001528,0.000869,0.00148,0.000703,0.000565,0.00051,0.000319,0.001247,0.002129,0.000191,0.000842,0.000455,0.000415,0.000588,0.000985,0.000401,0.000372,0.00178,0.001952,0.000259,0.00111,0.000718,0.000624,0.001169,0.001171,0.000616,0.001066,0.000842,0.001625,0.000537,0.00099,0.002491,0.000604,0.001069,0.001561,0.001863,0.000698,0.000567,0.00158,0.001154,0.000207,0.001767,0.001106,0.001253,0.000297,0.000257,0.00087,0.001411,0.000524,0.002892,0.001107,0.00237,0.001842,0.000635,0.001466,0.002226,0.001688,0.000711,0.001293,0.003781,0.001186,0.001068,0.001942,0.001216,0.00037,0.001498,0.00168,0.000905,0.003004,0.00144,0.000304,0.001704,0.001351,0.003391,0.001968,0.002218,0.00195,0.00108,0.000552,0.002294,0.000558,0.000733,0.001107,0.000889,0.001063
0.000223,0.000164,5.1e-05,9.8e-05,0.000316,0.000196,0.000334,0.00048,0.000378,0.000249,0.000228,0.000259,0.000435,0.000813,0.000654,0.000399,0.000209,0.001412,0.001457,0.001231,0.001348,0.000801,0.000296,0.000813,0.001261,0.000861,0.00198,0.001008,0.000894,0.001741,0.001149,0.000831,0.002425,0.001343,0.002763,0.001084,0.001899,0.002376,0.001039,0.000773,0.000302,0.000717,0.000456,0.001474,0.002361,0.001941,0.002079,0.000563,0.000966,0.000592,0.000901,0.001081,0.000725,0.003019,0.003285,0.001055,0.001511,0.000317,0.001247,0.002642,0.002046,0.00113,0.00214,0.002379,0.001332,0.000877,0.000715,0.003357,0.002247,0.001163,0.003862,0.001824,0.002455,0.001939,0.00136,0.002823,0.000315,0.002646,0.00353,0.00148,0.001096,0.000924,0.001136,0.003023,0.001665,0.003811,0.002838,0.002228,0.002777,0.002219,0.002195,0.002262,0.000883,0.002226,0.001944,0.004941,0.001646,0.001224,0.003284,0.000824,0.002062,0.003409,0.002592,0.002953,0.001897,0.001887,0.001042,0.001662,0.001655,0.004058,0.000932,0.001482,0.002428,0.00315,0.001575,0.002849,0.000904,0.000966,0.001903,0.002444,0.001552
0.000118,0.000218,0.000157,4.8e-05,0.000374,0.000367,0.000582,0.000817,0.000221,0.000463,0.000467,0.000354,0.000166,0.000745,0.000863,0.000818,0.000481,0.000824,0.001369,0.000404,0.000783,0.00052,0.000982,0.000969,0.000599,0.000351,0.002587,0.00177,0.002537,0.00011,0.000731,0.000814,0.001006,0.001566,0.002535,0.002726,0.001935,0.002127,0.002656,0.001609,0.001094,0.002175,0.002899,0.000272,0.004127,0.002013,0.000418,0.001864,0.001703,0.003308,0.001471,0.003539,0.0026,0.003644,0.006866,0.003733,0.002875,0.001348,0.001638,0.001478,0.000869,0.002412,0.005364,0.006778,0.008425,0.004576,0.002403,0.003706,0.00062,0.000669,0.003778,0.00445,0.004578,0.002243,0.003073,0.005776,0.004036,0.002745,0.002835,0.002782,0.001636,0.001941,0.004116,0.004324,0.001134,0.003832,0.006695,0.007529,0.004052,0.001194,0.002761,0.001554,0.002575,0.002393,0.004239,0.009103,0.007665,0.004493,0.001177,0.006239,0.003719,0.004678,0.002992,0.003191,0.002307,0.000816,0.000519,0.002943,0.003245,0.005199,0.003537,0.001664,0.003157,0.003689,0.002976,0.005869,0.005898,0.003324,0.00398,0.002002,0.001486
0.000167,0.000129,0.00023,0.000163,0.000203,0.000117,0.000309,0.000437,0.000405,0.000645,0.000234,0.000425,0.000163,0.000688,0.000456,0.00028,0.000129,0.000776,0.00119,0.000233,0.001089,0.000335,0.001867,0.003144,0.001568,0.000453,0.002263,0.001816,0.002627,0.001705,0.002112,0.001372,0.002331,0.001951,0.002742,0.004319,0.004621,0.002103,0.001244,0.001457,0.004069,0.001622,0.002647,0.002286,0.004029,0.005074,0.002288,0.000279,0.001392,0.004621,0.003444,0.004603,0.000493,0.00293,0.002986,0.005133,0.002982,0.000936,0.001306,0.003497,0.001571,0.004509,0.002847,0.004294,0.006678,0.005031,0.005937,0.006148,0.004211,0.0017,0.004645,0.011659,0.004451,0.004684,0.006569,0.011766,0.01032,0.001994,0.003905,0.003309,0.002802,0.002569,0.0042,0.003177,0.003808,0.005191,0.004389,0.003754,0.003691,0.001005,0.002735,0.00402,0.005936,0.006354,0.001069,0.006902,0.003257,0.006752,0.005517,0.009944,0.013332,0.002935,0.003854,0.003831,0.0094,0.007949,0.001735,0.006226,0.005306,0.007271,0.005276,0.004308,0.004063,0.001393,0.002951,0.011916,0.005192,0.001761,0.003334,0.005753,0.006884
0.000183,0.00015,0.000159,0.000138,0.000222,0.000134,0.000291,0.000144,0.000135,0.000378,0.000335,0.00045,0.000633,0.000398,0.000522,0.001248,0.001045,0.00239,0.002016,0.001149,0.00141,0.001389,0.002299,0.001935,0.001799,0.000712,0.001129,0.000501,0.001426,0.000271,0.001318,0.001409,0.004096,0.0041,0.004678,0.003826,0.002612,0.002394,0.000576,0.001649,0.003961,0.001867,0.002845,0.001562,0.002357,0.003672,0.003928,0.001806,0.002316,0.003195,0.003624,0.005805,0.003856,0.003876,0.001361,0.004564,0.003666,0.003836,0.003457,0.005039,0.005535,0.004528,0.007652,0.002506,0.008819,0.005858,0.003792,0.010535,0.010607,0.009978,0.000664,0.00994,0.010618,0.007726,0.002329,0.005342,0.007762,0.007586,0.008201,0.003182,0.003613,0.001989,0.005348,0.009098,0.007573,0.001716,0.001515,0.007745,0.000813,0.006715,0.001749,0.006726,0.00454,0.002664,0.006555,0.006941,0.004172,0.008486,0.004109,0.007157,0.005212,0.007591,0.00223,0.001854,0.009066,0.006101,0.007177,0.007969,0.007725,0.004282,0.004931,0.002395,0.005156,0.00804,0.007666,0.012079,0.008617,0.002657,0.0037,0.005885,0.004673
9.7e-05,0.000166,0.000271,0.000248,0.000253,0.000212,0.000219,7.7e-05,0.000279,0.000444,0.000404,0.000676,0.000496,0.000291,0.000957,0.001436,0.001868,0.001887,0.003299,0.003615,0.003973,0.003037,0.004813,0.00389,0.004532,0.003904,0.002463,0.000929,0.002008,0.00247,0.001522,0.001241,0.003421,0.006852,0.002808,0.001286,0.004376,0.0026,0.002408,0.001247,0.003842,0.002727,0.002782,0.001071,0.000721,0.004473,0.004552,0.002275,0.001772,0.003355,0.001386,0.003856,0.005315,0.003195,0.001296,0.002729,0.001644,0.003472,0.003155,0.005815,0.002429,0.005533,0.006031,0.00609,0.009663,0.00492,0.001937,0.00586,0.004929,0.003175,0.008462,0.001421,0.009746,0.008387,0.00764,0.005615,0.007032,0.004008,0.003933,0.001399,0.004046,0.004463,0.003741,0.003913,0.003201,0.00154,0.002801,0.008183,0.008844,0.013187,0.013319,0.008907,0.005678,0.003576,0.006578,0.008363,0.008193,0.005029,0.006982,0.007102,0.008297,0.005875,0.004739,0.005372,0.003298,0.004403,0.006194,0.010937,0.005671,0.001545,0.004262,0.007275,0.011981,0.014441,0.012609,0.013593,0.01225,0.008316,0.006484,0.003366,0.00467
0.000131,5.5e-05,0.000132,0.000111,3e-04,0.000324,9.1e-05,0.000214,0.000248,0.000515,0.000195,0.000338,0.000176,0.000602,0.00023,0.000798,0.000691,0.001431,0.001086,0.00086,0.001052,0.000862,0.002557,0.003252,0.001459,0.000404,0.000441,0.001094,0.003368,0.00321,0.000759,0.001697,0.002154,0.002998,0.002377,0.003948,0.002621,0.002617,0.002344,0.001754,0.000779,0.00104,0.001352,0.000864,0.000862,0.003284,0.002116,0.002085,0.001012,0.000285,0.001263,0.00169,0.002402,0.001752,0.001637,0.00187,0.000843,0.001687,0.000642,0.001691,0.001672,0.003425,0.001154,0.001837,0.001096,0.00113,0.00189,0.002737,0.002582,0.004383,0.004539,0.005804,0.004679,0.000826,0.00163,0.003236,0.00311,0.003512,0.001613,0.000929,0.002878,0.000838,0.001833,0.001662,0.002444,0.003387,0.001616,0.003815,0.00485,0.005733,0.004283,0.001901,0.002715,0.00212,0.003358,0.001715,0.004119,0.00533,0.007547,0.004029,0.000559,0.003088,0.000988,0.002788,0.001576,0.002846,0.001943,0.004084,0.001378,0.002439,0.001464,0.004491,0.0042,0.003525,0.003968,0.002742,0.003725,0.002626,0.000985,0.002709,0.001497
6.8e-05,7.9e-05,0.000216,0.000113,0.000163,7.9e-05,7.3e-05,0.00029,0.000156,0.000317,0.000429,0.000314,0.000316,0.000613,0.000365,0.000495,0.000244,0.000804,0.000722,0.000693,0.000587,0.00106,0.002109,0.00051,0.001454,0.00133,0.001599,0.001702,0.001295,0.000813,0.001828,0.000973,0.000884,0.000862,0.002434,0.001949,0.000564,0.001841,0.000318,0.000931,0.00264,0.001187,0.002158,0.002331,0.001079,0.002471,0.000466,0.001746,0.002195,0.000714,0.001413,0.001404,0.001879,0.001847,0.002088,0.001271,0.001003,0.002472,0.003034,0.003709,0.003343,0.001511,0.00186,0.002137,0.002981,0.001716,0.003717,0.002682,0.003,0.002374,0.003427,9e-04,0.001671,0.002823,0.001825,0.003485,0.001218,0.00254,0.005367,0.003899,0.001239,2.8e-05,0.001574,0.00206,0.001366,0.001381,0.000884,0.002192,0.002595,0.002523,0.00185,0.002127,0.002662,0.001449,0.001099,0.002619,0.004601,0.001075,0.003356,0.00213,0.001983,0.002399,0.002147,0.001431,0.002403,0.001337,0.001995,0.001184,0.000712,0.004042,0.004887,0.003433,0.003558,0.002495,0.003036,0.00147,0.002978,0.004976,0.005664,0.003806,0.001795
6e-05,9.2e-05,0.000159,7.3e-05,8.5e-05,6.3e-05,4.2e-05,0.000146,0.000172,5.2e-05,0.000198,0.000289,3.2e-05,0.000245,7.2e-05,0.000342,0.000322,0.000565,0.000792,0.000768,7e-04,0.00013,0.00057,0.000642,0.000876,0.001129,0.001183,0.000115,0.000909,0.000578,0.000677,0.00095,0.001632,0.001581,0.00097,0.001459,0.000517,0.000781,0.000722,0.001587,0.002111,0.001832,0.0018,0.002179,0.001346,0.00142,0.000796,0.000238,0.000971,0.002291,0.001799,0.00211,0.000428,0.001119,0.001304,0.001124,0.00167,0.003283,0.003358,0.002755,0.001421,0.001619,0.001591,0.002035,0.001451,0.001193,0.001682,0.000162,0.003854,0.003417,0.001408,0.002304,0.001993,0.000536,0.00141,0.003276,0.002437,0.002691,0.001527,0.002179,0.002227,0.000216,0.0019,0.001523,0.000642,0.000254,0.001068,0.000475,0.001805,0.001948,0.00187,0.00069,0.000429,0.000605,0.001858,0.002438,0.000489,0.001538,0.000448,0.001114,0.001327,0.002235,0.00082,0.0019,0.001307,0.001275,0.000968,0.000819,0.001016,0.002389,0.002836,0.000342,0.001523,0.00155,0.000534,0.001526,0.001269,0.002154,0.001685,0.000131,0.000125
5.2e-05,1.9e-05,8.3e-05,3.2e-05,4.5e-05,4e-06,2.2e-05,7.2e-05,8.7e-05,3e-05,0.000163,9.1e-05,3.7e-05,0.000113,0.000136,0.000292,0.000232,0.000347,0.000468,0.000375,0.000442,4.7e-05,0.000536,0.000772,0.00028,0.000539,0.00055,0.000225,0.000579,0.000554,0.000324,0.000958,0.000675,0.000502,0.001101,0.0016,0.000314,0.000138,0.000135,0.001371,0.00108,0.001413,0.001134,0.000699,0.000445,0.001456,0.000358,6e-04,0.000448,0.001363,0.000523,0.001284,0.001058,0.00089,0.000891,0.000683,0.0011,0.001685,0.001731,0.000675,0.000685,0.001438,0.00109,0.000908,0.001216,0.001415,0.001035,0.000629,0.002518,0.001551,0.000427,0.00216,0.00083,0.000525,0.00121,0.002075,0.002001,0.001202,0.00092,0.001785,0.000962,0.0013,0.000767,0.001277,0.00093,0.000766,0.000844,0.000538,0.00272,0.000518,0.001702,0.001463,0.001316,0.001335,0.000855,0.002221,0.001594,0.001998,0.001237,0.001692,0.000828,0.00096,0.000614,0.001505,0.00076,0.000695,0.000859,0.000727,0.000874,0.001078,0.001041,0.000515,0.001729,0.000488,0.000944,0.00014,0.000845,0.000825,0.001239,0.000505,0.000281
3.3e-05,4.4e-05,7.1e-05,3.6e-05,4.8e-05,4.7e-05,7e-06,6.1e-05,7.1e-05,5e-06,7e-05,0.000128,4.6e-05,0.000111,0.000113,0.000232,0.000247,0.00023,0.00029,8.9e-05,0.000442,0.000229,0.000332,0.000488,0.000658,0.000669,0.000455,0.000725,0.000318,0.000424,0.000562,0.000692,0.000253,0.000851,0.000894,0.001363,0.000513,0.000637,0.000414,0.000736,0.0015,0.000689,0.001143,0.001085,0.000397,0.000147,0.000826,0.000867,0.000928,0.00132,0.001201,0.001061,3.2e-05,0.000677,0.001851,0.00099,0.001393,0.000695,0.001545,0.000381,0.0011,0.001642,0.000694,0.001545,0.001809,0.001478,0.000367,0.00117,0.001741,0.001521,0.000604,0.002058,0.000309,0.000468,0.000957,0.002067,0.002156,0.001178,0.001575,0.00179,0.000937,0.002014,0.001615,0.001836,0.000747,0.000353,0.001627,0.000126,0.001531,0.002018,0.001496,0.001293,0.000112,0.001317,0.001189,0.003107,0.000711,0.001985,0.001266,0.001792,0.001093,0.000873,0.00019,0.001034,0.001348,0.001018,0.000558,0.000703,0.001869,0.000347,0.000871,0.001067,0.000525,0.000299,0.001093,0.000148,0.001141,0.001091,0.000649,0.001108,0.000902
9e-06,3.4e-05,3.9e-05,8e-06,1e-05,1.4e-05,4.7e-05,2.1e-05,9.2e-05,1.3e-05,4.5e-05,8.1e-05,4.5e-05,7.3e-05,5.1e-05,0.000248,0.000166,0.000321,0.000327,0.00014,0.00083,5.3e-05,0.000541,0.00022,0.00012,0.00047,0.000351,0.000472,0.001243,0.001119,0.001169,0.00104,0.001098,0.002084,0.002236,0.001698,0.000946,0.001095,0.000675,0.000889,0.001252,0.001423,0.001175,0.000877,0.00159,0.000912,0.001213,0.000513,0.001227,0.00275,0.001167,0.000627,0.0019,0.000452,0.003625,0.002298,0.004321,0.002875,0.001998,0.000541,0.001585,0.00371,0.002802,0.002309,0.00044,0.00037,0.001266,0.001914,0.002693,0.001442,0.00071,0.003037,0.00189,0.001862,0.001045,0.001119,0.0018,0.003777,0.001258,0.001572,0.00169,0.004467,0.000257,0.002583,0.001176,0.000398,0.002702,0.003312,0.001161,0.001023,0.000752,0.000766,0.00219,0.000199,0.002676,0.00347,0.003381,0.002821,0.003128,0.003119,0.002203,0.001197,0.001029,0.002505,0.00224,0.002403,0.002137,0.00211,0.003606,0.003757,0.001325,0.001994,0.004098,0.00149,0.001986,0.00163,0.001677,0.001969,0.001679,0.000864,0.001546
1.3e-05,4.5e-05,5.8e-05,9e-06,9e-06,3.4e-05,4.3e-05,4.6e-05,0.000116,4.8e-05,7.1e-05,7.1e-05,3.2e-05,0.000102,4.7e-05,0.000225,0.000136,0.000272,8.8e-05,0.000167,0.000653,0.000696,0.000647,0.000428,0.000163,0.000462,0.000186,0.000631,0.001197,0.000254,0.000462,0.001014,0.000324,0.001289,0.001608,0.001581,0.001017,0.00093,0.000694,0.001578,0.001654,0.002317,0.001161,0.001923,0.003118,0.001443,0.003884,0.002616,0.001171,0.003067,0.002151,0.001583,0.00275,0.003367,0.004913,0.003062,0.003841,0.00313,0.00215,0.000354,0.001559,0.004343,0.004675,0.001344,0.000883,0.001051,0.00162,0.000994,0.004303,0.006128,0.00315,0.00166,0.003074,0.003209,0.002708,0.002947,0.001569,0.004425,0.00542,0.004728,0.00299,0.003144,0.005652,0.004053,0.004168,0.003127,0.00369,0.005867,0.005074,0.001621,0.00261,0.003611,0.004134,0.003413,0.002302,0.000518,0.002082,0.00012,0.002039,0.001457,0.003389,0.002117,0.001644,0.001653,0.003114,0.003401,0.000273,0.00202,0.002044,0.000917,0.001997,0.00123,0.004328,0.004179,0.003403,0.00061,0.00037,0.002085,0.004432,0.003141,0.001943
1.8e-05,7.1e-05,4.7e-05,3.6e-05,3.5e-05,1.5e-05,3.7e-05,4.6e-05,0.000133,9.7e-05,0.00018,0.000198,0.000175,0.000125,0.000134,0.000239,0.000301,0.000312,0.000169,0.000205,0.000357,0.000201,0.000462,0.001029,0.000807,0.000578,0.000734,0.00102,0.001541,0.001506,0.00091,0.001821,0.001219,0.000729,0.00136,0.000386,0.001852,0.001253,0.001594,0.002665,0.00088,0.002581,0.000888,0.001638,0.001986,0.001526,0.005456,0.00612,0.005401,0.005722,0.004482,0.002206,0.003223,0.001584,0.000763,0.002771,0.003663,0.003088,0.000659,0.001372,0.00296,0.001252,0.000913,0.000805,0.002258,0.001994,0.001879,0.003573,0.00366,0.003694,0.001981,0.00192,0.001687,0.002797,0.001114,0.003674,0.002447,0.005032,0.003266,0.005263,0.003887,0.003081,0.004861,0.004739,0.006629,0.002934,0.001261,0.003105,0.001348,0.001436,0.003268,0.001571,0.000687,0.001892,0.003162,0.002096,0.002588,0.002878,0.000896,0.001946,0.00165,0.000289,0.001368,0.000839,0.002169,0.001173,0.002675,0.001789,0.000945,0.000817,0.003014,0.001318,0.003894,0.001747,0.001891,0.002034,0.001852,0.001956,0.003642,0.000414,0.003519
2.8e-05,6.5e-05,2.2e-05,3.3e-05,5.6e-05,4.8e-05,7.8e-05,4.2e-05,4.5e-05,6.2e-05,0.00017,6.4e-05,0.000155,0.00015,0.000179,0.000185,0.000271,0.000262,0.000221,0.000146,0.000506,0.000375,0.00038,0.00119,0.000637,0.000234,0.000686,0.000338,0.001063,0.000501,0.001186,0.001149,0.000772,0.000167,0.000578,0.000632,0.001398,0.0018,0.001467,0.000871,0.001122,0.002195,0.002558,0.001864,0.001026,0.000933,0.003784,0.002944,0.000921,0.002371,0.001591,0.002029,0.002196,0.001915,0.002711,0.003792,0.002924,0.003588,0.003564,0.002699,0.00206,0.00104,0.000826,0.001332,0.00139,0.000559,0.001036,0.002065,0.001772,0.001085,0.001675,0.002875,0.001641,0.001813,0.000849,0.004118,0.001075,0.002276,0.001624,0.0045,0.001571,0.002322,0.003408,0.002511,0.003725,0.002825,0.001597,0.001231,0.00176,0.002349,0.004913,0.005164,0.004604,0.001706,0.003119,0.0012,0.002918,0.003325,0.003891,0.002983,0.002741,0.002217,0.001855,0.001547,0.001514,0.002325,0.002553,0.001912,0.001642,0.001046,0.003308,0.004027,0.002421,0.00124,0.000975,0.001315,0.00091,0.000368,0.002737,0.001886,0.003041
3.3e-05,4.6e-05,5e-05,3.1e-05,7.7e-05,1.3e-05,8e-05,9e-05,0.000137,0.00012,2.4e-05,0.000167,0.000182,0.00013,0.000118,0.000175,0.000309,0.000303,0.000317,0.000422,0.000638,6e-05,0.000315,0.000961,0.000265,0.000312,0.00047,0.000911,0.000411,0.001134,0.000256,0.000414,0.001049,0.000786,0.000485,0.000383,0.000689,0.001736,0.002254,0.000784,0.001809,0.002234,0.002405,0.001041,0.000496,0.00071,0.002016,0.000294,0.000491,0.002542,0.000813,0.000322,0.002704,0.00121,0.003071,0.001492,0.001738,0.001444,0.000869,0.00114,0.001167,0.000983,0.002119,0.001025,7.8e-05,0.001751,0.000529,0.00109,0.001816,0.003059,0.001711,0.002669,0.004069,7.2e-05,0.000957,0.002103,0.002302,0.003017,0.002623,0.000299,0.000442,0.003219,0.000819,0.002001,0.002709,0.001684,0.002218,0.001338,0.000883,0.000867,0.001818,0.002484,0.002556,0.001161,0.002219,0.00211,0.0021,0.002106,0.001056,0.001471,0.000529,0.000686,0.002244,0.002247,0.000653,6e-04,0.000288,0.00045,0.00072,0.001119,0.003478,0.003486,0.00412,0.001941,0.001264,0.000895,0.00133,0.001696,0.002275,0.001229,0.000263
4e-06,2.5e-05,8.2e-05,6.3e-05,4.5e-05,7.5e-05,9.1e-05,0.000101,0.000126,0.000219,0.000229,0.000307,0.000429,0.000277,0.000247,0.00024,7.9e-05,0.000531,0.000495,0.000362,0.000952,0.000733,0.00043,0.00089,0.000967,0.000685,0.000542,0.00066,0.00107,0.002123,0.001848,0.001262,0.001233,0.000208,0.001094,0.001199,0.001845,0.001952,0.000757,0.000887,0.001837,0.001682,0.001772,0.001092,0.001423,0.002409,0.003556,0.00166,0.000824,0.002772,0.001576,0.001774,0.000876,0.001002,0.002734,0.003222,0.002775,0.001826,0.001642,0.000784,0.001805,0.000993,0.001663,0.001774,0.002892,0.003262,0.003174,0.001191,0.002354,0.001731,0.002041,0.001825,0.002127,0.002272,0.001576,0.001225,0.0021,0.001353,0.001064,0.000984,0.000495,0.002226,0.001553,0.000796,0.002156,0.002828,0.00064,0.000943,0.001377,0.003007,0.00218,0.000667,0.003328,0.001405,0.000735,0.000979,0.001951,0.003688,0.002642,0.002893,0.001208,0.001489,0.001555,0.001987,0.002788,0.003119,0.002911,0.001081,0.001359,0.00103,0.002811,0.001128,0.001902,0.001591,0.001254,0.000249,0.001829,0.002499,0.001918,0.001621,0.000896
8e-06,2.8e-05,0.000103,8.2e-05,7.2e-05,5.5e-05,0.000137,0.000111,0.000181,0.000236,0.000262,0.00025,9.4e-05,6.7e-05,0.000163,0.000291,0.000144,0.000395,0.000167,0.000701,0.000698,0.000491,0.000507,0.000937,0.00022,0.000634,0.001006,0.000586,0.00094,0.001402,0.000574,0.000574,0.000532,0.000777,0.001222,0.001779,0.002467,0.001081,0.000218,0.000574,0.002253,0.002718,0.002321,0.001636,0.00274,0.002687,0.000565,0.001393,0.002143,0.000664,0.000761,0.000756,0.001013,0.000769,0.001768,0.00273,0.002648,0.001062,0.000272,0.000515,0.001839,0.002018,0.002103,0.002184,0.002232,0.00041,0.001807,0.001632,0.001049,0.001076,0.00222,0.002573,0.002161,0.001017,0.00147,0.000847,0.001031,0.001647,0.001544,0.00053,0.001061,0.000865,0.001546,0.001297,0.001874,0.002809,0.003392,0.002457,0.002559,0.002026,0.001802,0.000867,0.002112,0.002515,0.00097,0.001087,0.000851,0.002011,0.00047,0.001688,0.000805,0.001668,0.001279,0.000612,0.001697,0.001448,0.000975,0.001393,0.002518,0.001007,0.002763,0.003297,0.001363,0.00059,7e-04,0.001152,0.001359,0.002117,0.000802,0.000951,0.001994
1.1e-05,2.4e-05,6e-05,5.1e-05,4.6e-05,1.9e-05,7.3e-05,3.8e-05,9.9e-05,0.000161,0.000167,5e-06,3.2e-05,1.7e-05,0.000123,0.000127,0.000115,0.000118,0.000121,0.000343,2.5e-05,9.2e-05,0.00022,0.000309,0.000375,0.000387,0.000139,0.000272,0.000281,0.000807,0.000697,5.4e-05,0.000402,0.000177,0.000274,0.000603,0.000683,0.000836,0.000953,0.000901,0.000813,0.000841,0.001243,0.000584,0.001059,0.000828,0.000821,0.001138,0.000125,0.000562,0.000328,0.000769,0.000326,0.000476,0.000325,0.001448,0.001485,0.00129,0.001233,0.000727,0.001192,0.000407,0.000812,0.000909,0.001992,0.001237,0.00083,0.001951,0.001448,0.000413,0.001735,0.001215,0.001184,0.000871,0.000759,0.000929,0.000828,0.000922,0.000568,0.000283,0.000898,0.001318,0.000336,0.000826,0.000467,0.000829,0.001248,0.000714,0.001114,0.002641,0.001286,0.000725,0.000989,0.000263,0.001461,0.000426,0.001007,0.000285,0.001166,0.000736,0.000889,0.000619,0.001047,0.001414,0.001582,0.000772,0.000385,0.001257,9e-04,0.001152,0.001131,0.000885,0.000262,0.000234,0.000291,0.000698,0.000448,0.000511,0.000467,0.000218,8e-04
3e-06,5e-06,2.1e-05,1.4e-05,6e-06,1.3e-05,2.6e-05,2e-05,3.7e-05,3.2e-05,4.1e-05,1.5e-05,3.8e-05,3.8e-05,1.2e-05,2.2e-05,3.6e-05,3.9e-05,8.1e-05,0.000112,2.6e-05,2.4e-05,8e-06,6.4e-05,2e-05,0.000143,0.000133,3.6e-05,0.000216,9.5e-05,0.000221,0.00013,0.000119,9.1e-05,0.000122,9.9e-05,0.000263,0.000343,0.000241,0.000121,0.000346,0.000409,0.000249,1e-04,6.3e-05,0.000192,0.000266,0.000407,0.000236,0.000259,0.000192,0.000109,4.1e-05,0.000246,0.000312,0.000278,0.000536,0.000313,0.000276,0.000359,0.000287,0.000336,9.7e-05,0.000135,0.000263,0.000174,0.000185,0.000535,0.000201,0.000338,0.000497,0.000515,0.000287,0.000138,0.000321,0.000561,0.000154,0.000216,0.000188,0.000104,0.000275,0.00046,0.000392,0.00019,0.000191,0.000476,0.000209,0.000439,0.000311,0.000494,0.000455,0.000337,0.000368,0.000555,0.000393,0.000183,0.000457,0.00026,0.000377,0.000116,0.000194,0.000165,0.000235,0.000407,0.000444,0.000469,0.000322,0.000605,0.000386,0.000566,0.000381,0.000598,0.000143,0.000178,0.000152,0.000258,8.2e-05,0.000133,0.000264,0.000194,0.000282
1.3e-05,6e-06,1.4e-05,5e-06,1.1e-05,2e-06,1.8e-05,2.2e-05,3.7e-05,2.8e-05,4.2e-05,2.7e-05,3.8e-05,4.5e-05,3.4e-05,2.3e-05,3.9e-05,4.3e-05,0.00011,3.3e-05,1.3e-05,1e-05,7.3e-05,7.4e-05,3.4e-05,0.000139,8e-05,0.000103,0.000233,5.1e-05,0.000278,0.000198,8.4e-05,6.7e-05,5.2e-05,7.1e-05,0.000216,0.000405,0.000177,0.000175,0.000265,0.000322,0.000334,0.000188,0.000253,0.000261,0.000321,0.000421,9.4e-05,0.000425,0.000108,9.1e-05,0.000167,0.000205,0.000153,0.000217,0.00035,0.000243,0.000221,0.000428,0.000198,0.000308,0.000251,0.000202,1e-04,0.000373,0.000155,0.000294,0.000193,0.000297,0.000497,0.000312,0.000675,0.000137,0.000422,0.000235,0.000184,0.000269,0.000291,0.00015,0.000184,0.000446,0.000498,0.000517,0.000457,0.000132,0.000334,9.8e-05,0.000735,0.000358,0.00031,0.000138,0.000346,0.000288,0.00038,0.000409,0.000267,0.000111,1.2e-05,0.000317,0.000148,0.000382,0.000358,0.000171,0.00035,0.00058,0.000285,0.000234,8.5e-05,0.000496,0.000402,0.000518,0.000315,0.000427,0.000287,9.7e-05,0.000462,0.000365,0.000463,0.000406,0.000656
1.2e-05,7e-06,1e-05,6e-06,4e-06,6e-06,1.9e-05,1.8e-05,5.3e-05,4.4e-05,1.3e-05,1e-05,3.2e-05,5.6e-05,1.6e-05,3.8e-05,7.3e-05,6.6e-05,8.7e-05,0.000117,8.3e-05,8.2e-05,7.3e-05,0.000133,0.000173,0.000113,0.000109,0.000124,0.000298,0.000283,0.000261,0.000279,0.000215,0.000122,0.000126,0.00014,0.000317,0.000403,0.000166,0.000108,0.000347,0.000236,0.000116,0.000169,0.000213,0.000472,0.000551,0.000596,0.000457,0.000556,0.000257,0.000359,0.000191,0.000228,0.000105,0.000178,0.000489,0.000534,0.000135,0.00102,0.000436,0.000358,0.000319,0.000213,3.1e-05,0.000274,0.000463,0.000463,0.000424,6.6e-05,0.000235,0.000237,0.00026,0.000507,0.000279,0.00035,9.3e-05,0.000267,4e-04,0.000285,0.000219,0.00041,6e-04,0.000131,0.000362,0.000473,0.000284,0.000351,0.000685,0.000776,0.000333,0.000321,2.1e-05,0.000215,0.000388,0.000224,0.000214,0.00018,0.000176,0.000103,0.000183,0.000117,0.000235,0.000171,0.000341,0.000513,0.000668,0.000511,9.8e-05,0.000374,0.000752,3.6e-05,0.000575,0.000302,0.000137,0.000251,0.000241,0.000306,0.000733,0.000237,0.000268
1.3e-05,1.3e-05,2.2e-05,4e-06,9e-06,1.5e-05,2.6e-05,7e-06,2.6e-05,1.3e-05,1.3e-05,8e-06,3.3e-05,2.7e-05,2e-05,4.9e-05,6.6e-05,1.1e-05,9.1e-05,6.9e-05,6.2e-05,5.5e-05,1.8e-05,4.7e-05,0.000113,0.00011,0.000127,5.1e-05,0.000257,0.000265,0.000221,0.000166,4.1e-05,6.4e-05,5.2e-05,9.2e-05,0.000296,8.6e-05,0.00012,9.2e-05,0.000196,0.000293,0.000168,0.000239,0.000169,0.000307,0.00035,0.00047,0.00031,0.000114,5.1e-05,0.000319,0.000173,7.4e-05,0.000243,0.000244,0.000237,0.000251,4e-04,0.000568,0.000403,0.00042,0.000219,2.3e-05,0.000223,0.000152,0.000471,0.000449,0.000158,0.000288,0.00017,0.000258,0.00017,0.000235,0.000262,0.000422,0.00013,0.000158,0.000297,0.000205,0.000173,0.000202,8.3e-05,0.000387,0.000186,0.000362,0.00022,0.000317,4.2e-05,0.000501,0.000318,0.000357,0.000441,0.000115,0.000284,0.000142,0.000196,0.000118,0.000381,0.000533,0.000387,0.00046,0.000505,0.000583,0.000127,4.5e-05,0.00015,0.00021,0.000184,0.000263,0.000407,0.000579,0.00064,0.000309,0.000319,0.000366,0.000147,0.000764,0.000148,0.000124,0.000126
8e-06,3e-06,1e-05,8e-06,1.1e-05,4e-06,1.6e-05,5e-06,2.1e-05,1.3e-05,1.7e-05,5e-06,2.1e-05,2.7e-05,2e-05,5.3e-05,5.3e-05,3.2e-05,5.6e-05,7.5e-05,1.4e-05,2.7e-05,6e-06,7.8e-05,2.2e-05,5.9e-05,9.6e-05,0.000111,0.000133,2.8e-05,0.000255,0.000134,4e-05,1.9e-05,3.7e-05,6.4e-05,6.3e-05,0.000155,0.000132,8.9e-05,0.000105,0.000203,0.000113,0.000165,0.000245,0.000254,0.000236,0.000399,0.000209,9.3e-05,0.000147,0.00014,0.000251,4.7e-05,0.000117,0.000425,0.000303,0.000299,0.000358,0.000242,0.000369,0.000302,0.000177,2.5e-05,0.000279,0.000117,0.000477,9.7e-05,0.000269,0.000113,0.000192,0.000273,0.000501,0.000405,0.000599,0.000474,0.00018,0.000379,0.000511,0.000353,0.000312,8.4e-05,0.000458,0.00042,0.000108,0.00031,0.00041,0.000481,0.000426,0.000672,0.000366,0.000569,0.000493,0.000353,0.000153,0.000136,0.00013,0.000227,0.000332,0.00029,0.000188,0.000266,0.000297,0.000254,0.000168,0.000303,3.4e-05,6.9e-05,0.000178,0.000406,8.7e-05,0.000498,0.000222,0.000115,0.000238,0.000189,0.000292,0.000461,0.000177,2e-05,0.000163
1e-05,8e-06,1.4e-05,2e-06,5e-06,2e-06,1.8e-05,3e-06,2.5e-05,7e-06,1.7e-05,1.2e-05,1.5e-05,1.2e-05,3.2e-05,6.4e-05,4.8e-05,3.4e-05,3.9e-05,6.6e-05,4.2e-05,8.6e-05,4.6e-05,6.3e-05,4.5e-05,6.7e-05,0.000129,2e-05,0.000123,0.000137,0.000195,0.000121,4.8e-05,9e-05,6.7e-05,7e-06,7.2e-05,0.000243,4.8e-05,0.000101,0.00026,9.8e-05,0.000119,0.000201,9.8e-05,0.000297,0.00019,9e-05,0.000122,2e-04,0.000239,7.3e-05,0.000178,3e-04,9.5e-05,0.000373,8.2e-05,7.7e-05,0.000544,2.5e-05,0.000194,0.000133,0.000213,0.000174,0.000259,0.00022,0.000268,4.7e-05,0.000275,0.000188,0.000154,0.000305,0.000469,0.000339,0.000267,0.000263,0.000141,0.000545,0.00026,0.000254,0.000145,0.000245,0.000293,0.000377,8.3e-05,0.000124,0.000473,0.000236,0.000234,5e-04,0.000352,0.000333,0.00024,0.000241,0.000418,0.000279,0.000399,0.000147,0.000189,0.000315,0.000409,0.000161,0.000214,0.000438,0.000108,0.000231,0.000339,0.000259,0.000391,0.000632,0.000167,0.000568,0.000659,0.00029,0.000239,0.000342,0.000452,0.000416,0.00052,0.000217,0.000346
8e-06,9e-06,1e-05,3e-06,5e-06,1e-06,2e-05,8e-06,1.7e-05,7e-06,1.5e-05,8e-06,4e-06,3e-05,2.2e-05,3.1e-05,7e-05,4.1e-05,4.7e-05,5.5e-05,9.1e-05,7.9e-05,1.9e-05,8.6e-05,1.5e-05,4.9e-05,0.000126,9e-05,7.7e-05,1.7e-05,0.000326,0.000112,0.000138,0.000174,0.000187,7.9e-05,3.7e-05,0.000185,0.000257,0.000165,0.000213,4.6e-05,0.000219,0.000287,0.000264,0.000305,0.000151,0.000365,5.6e-05,8e-05,5.3e-05,0.000215,0.000283,0.000208,0.000133,0.000333,0.000499,0.000243,0.000641,0.000581,0.000285,0.000444,0.000271,0.000247,0.000287,0.000169,0.000485,8.6e-05,0.000246,0.000275,8.8e-05,0.000237,0.000438,0.000187,0.00038,0.00022,0.000265,0.000607,0.000213,0.000156,0.000336,0.000185,5e-05,0.000473,0.000411,0.000464,0.000527,0.000352,0.000162,0.000269,0.000325,0.000439,0.000346,0.000404,0.000642,0.000374,0.00026,0.000272,0.000358,0.000313,0.000292,0.00081,0.000697,0.000295,0.000145,0.000175,2e-05,0.000481,0.000408,0.000307,0.000511,0.000444,0.000607,0.000477,0.000328,0.000349,0.000225,0.000247,0.000555,0.000436,0.000328
5e-06,2e-06,1.4e-05,4e-06,0,1e-06,1.8e-05,1.1e-05,9e-06,1.1e-05,2.8e-05,1.2e-05,2.2e-05,1.3e-05,1.9e-05,3.5e-05,4.6e-05,4e-05,5.3e-05,8.8e-05,8.4e-05,0.00013,9.9e-05,8.8e-05,9.1e-05,8.2e-05,7.6e-05,6.8e-05,9e-05,0.000188,0.000392,0.000419,0.00013,6.1e-05,0.00011,0.000301,0.00032,0.000224,0.00012,3.2e-05,0.000277,0.000219,0.000295,0.000187,0.000218,0.000562,0.000305,0.000457,0.000212,0.000119,7.3e-05,0.000168,0.000214,0.000456,0.000187,4.9e-05,0.000308,0.000428,0.000431,4e-05,3.2e-05,0.000335,0.000241,0.000538,0.000315,0.000365,0.000582,0.000362,0.000104,0.000103,0.000343,0.000577,0.00037,0.000781,0.00101,0.000747,0.000303,0.000171,9e-05,0.000568,0.000589,0.000594,0.000159,0.000335,0.000343,0.000783,0.000322,0.000396,0.000391,0.00045,0.000152,0.000347,0.000672,0.000744,0.000271,0.000712,0.000719,0.000264,0.000557,0.000611,0.000153,0.00098,0.000216,0.00085,0.000604,0.000128,0.000668,0.000839,0.000897,0.000492,0.000137,0.000132,0.000309,0.000393,0.000609,0.00069,0.000382,0.000233,0.000633,0.000939,0.000758
6e-06,8e-06,1e-05,2e-06,2e-06,6e-06,1e-05,6e-06,1.1e-05,1.8e-05,1.6e-05,1.4e-05,2.9e-05,5e-06,1.8e-05,4.1e-05,2.9e-05,4.4e-05,4.2e-05,5.4e-05,3.7e-05,0.000106,7.9e-05,0.000111,2.5e-05,3.6e-05,9.7e-05,0.000133,7.9e-05,0.000131,0.00039,0.000236,0.000456,0.000402,0.000265,0.000405,0.000169,1.5e-05,0.000141,0.000212,0.00044,0.00041,3.1e-05,0.000145,0.000393,0.000131,0.00044,0.000557,0.000382,0.000469,0.000237,0.000248,0.000206,0.000272,0.00036,0.000325,0.000474,0.000288,0.000359,0.000261,1.8e-05,0.000269,0.000531,0.000662,0.000463,0.00027,0.000628,0.00057,0.000335,0.000176,0.000453,0.000342,0.000171,0.000589,0.000362,0.000282,0.000458,0.000473,0.000104,0.000744,0.00073,0.000101,0.000271,0.000357,0.000215,0.000657,0.000359,0.00072,0.000303,0.000586,0.000336,0.000567,0.001178,0.000391,0.000298,0.000326,0.000596,0.000371,0.000165,0.000425,0.000445,0.000882,0.000556,0.001063,0.001022,0.001119,0.001386,0.00046,0.000348,0.000466,0.000735,0.000114,0.000184,0.000808,0.000727,0.000358,0.000566,0.000224,0.000437,0.000751,0.000382
9e-06,5e-06,1.7e-05,3e-06,5e-06,4e-06,1.8e-05,5e-06,6e-06,1e-05,2.3e-05,8e-06,1.8e-05,3.3e-05,1.8e-05,3.8e-05,6.7e-05,2.9e-05,4e-05,2.3e-05,9.8e-05,3.9e-05,3.4e-05,6.8e-05,0.000113,5.1e-05,4e-05,6.3e-05,0.000133,0.000205,8.1e-05,0.000153,0.000258,0.000164,0.000235,6.8e-05,0.000312,0.000192,0.000152,0.000114,0.000327,0.000198,0.000255,0.000202,0.000392,0.000335,0.000166,0.000156,0.000217,0.000288,8.4e-05,0.000352,0.000289,0.000516,0.000549,0.000102,0.000662,0.000357,0.000518,0.000595,0.000502,0.000559,0.000838,0.000625,0.000272,0.000166,7e-05,0.000295,0.00031,0.000318,0.000185,0.000347,0.000772,0.001002,0.000442,0.000539,0.000667,0.000479,0.000251,0.000806,0.000294,0.000246,0.000691,0.000993,0.000741,0.000777,0.000621,0.000514,0.000377,0.00033,0.000649,0.000397,0.000345,0.000937,0.000794,0.000539,0.001141,0.000582,0.00047,0.000393,0.000312,0.000223,0.000513,0.000574,0.000269,0.000484,0.000884,0.0013,0.000947,0.000745,0.000208,0.000625,0.000537,0.000613,0.000136,0.000349,0.00029,0.000807,0.000244,0.000385,0.000731
8e-06,1.1e-05,1.6e-05,1.4e-05,1.3e-05,1.5e-05,2.1e-05,1e-06,8e-06,2e-05,5e-06,4e-06,1.3e-05,2.4e-05,6e-06,2.8e-05,4.6e-05,4.6e-05,8e-05,0.000107,0.00013,8.1e-05,7.2e-05,4.8e-05,0.000106,5.4e-05,4.8e-05,7.9e-05,0.000122,0.00011,5.3e-05,0.000125,0.00014,7.3e-05,0.000198,0.000166,0.000166,0.000248,0.000189,5.6e-05,0.000227,7.6e-05,8.2e-05,7.1e-05,0.000218,0.000241,9.8e-05,0.000163,0.000242,0.000447,0.000468,0.000536,0.000113,0.000526,0.000493,0.000462,0.000407,0.000395,0.000562,0.000304,0.000447,0.000337,0.000385,0.000233,0.000231,9.2e-05,0.000121,0.000358,0.000123,0.000203,0.000132,0.000426,0.000628,0.000582,0.000454,0.000146,0.000679,0.000441,0.000562,0.000353,0.000243,0.000166,0.000676,0.000395,0.000241,0.000452,0.000588,0.000118,0.00046,0.000409,0.000382,0.000849,0.000693,0.00078,0.000933,8.6e-05,0.000969,0.001033,0.000199,0.000356,0.000318,0.000224,0.000819,0.000645,0.000392,0.000111,0.000957,0.001379,0.001384,0.000483,0.000313,0.000392,6e-05,0.000653,0.000326,0.000172,0.000327,0.000991,0.000574,0.000306,0.000606
2.5e-05,7e-06,7e-06,9e-06,5e-06,2.1e-05,1.2e-05,1.9e-05,6e-06,8e-06,1.2e-05,5e-06,2.5e-05,3.8e-05,2.6e-05,3.8e-05,3.4e-05,3.8e-05,5.3e-05,7.1e-05,4.9e-05,4.8e-05,8.4e-05,8.4e-05,2.2e-05,3.4e-05,8.6e-05,3.4e-05,0.000129,7.6e-05,8.7e-05,0.000214,5e-05,8.8e-05,3.7e-05,6.1e-05,0.000154,0.000148,2.4e-05,6.5e-05,9.4e-05,0.000337,0.000344,0.000283,0.00025,0.000266,0.000204,0.00034,0.00021,7.6e-05,0.000338,9.5e-05,0.000269,0.000271,0.000191,0.000408,0.000602,0.000343,0.000325,0.000356,0.000516,0.000761,0.000675,0.000198,0.000406,0.000475,0.000402,0.00056,0.000402,0.00026,0.000513,0.000169,0.00045,0.000837,0.000617,0.000116,0.000779,0.000236,0.000535,0.00044,8e-05,0.000287,0.000229,0.000331,0.00042,9.2e-05,0.000605,0.000903,0.000329,0.000199,0.00045,0.000402,0.000466,0.000502,0.000426,0.000908,0.000185,0.000382,0.000708,0.000508,0.00049,0.000151,0.000451,0.000371,0.000548,0.000473,0.000796,0.000159,0.000795,0.000817,8.7e-05,0.000139,7.2e-05,0.000576,0.000225,0.000122,0.000287,0.000787,0.00097,0.000593,0.000557
5e-06,1.9e-05,2.5e-05,2.3e-05,1.5e-05,1.9e-05,2e-05,7e-06,1.4e-05,1.3e-05,2.3e-05,1.3e-05,2.2e-05,3.9e-05,2.5e-05,1.4e-05,4.2e-05,3.6e-05,5.9e-05,4.4e-05,2.1e-05,5.7e-05,3.3e-05,6.9e-05,0.000117,3.3e-05,4.3e-05,7.9e-05,5.3e-05,3.9e-05,4.3e-05,0.000173,0.000154,9.4e-05,6.6e-05,5e-05,0.00013,0.000199,0.000137,8.2e-05,6.4e-05,0.000328,8.5e-05,0.000113,0.000197,0.000162,0.000144,0.00018,6e-05,6.7e-05,0.000153,0.000205,0.000283,0.000198,0.000122,0.000175,0.00042,0.000113,0.000221,5.7e-05,0.000212,0.000329,5.3e-05,0.000223,0.000519,0.000741,0.000505,0.000323,0.000428,0.000246,0.000533,0.00016,0.000505,0.00061,0.000414,0.000773,9e-05,0.000394,0.000233,0.000165,0.000239,0.000242,0.000216,0.000637,0.000311,5e-05,0.000389,0.000331,2.9e-05,5.2e-05,0.000371,0.000122,0.00036,0.000572,0.000223,0.000627,0.000462,0.000642,0.000473,0.000452,0.000317,5.4e-05,0.000108,0.000477,0.000339,0.000176,0.000458,0.000663,4e-05,0.000271,0.000497,0.000296,7e-05,0.000639,0.000232,0.000196,0.000174,0.000483,0.000251,0.000227,0.000364
8e-06,1.4e-05,9e-06,1.6e-05,8e-06,7e-06,1.2e-05,1.2e-05,4e-06,1.7e-05,9e-06,1.9e-05,1.1e-05,4.7e-05,9e-06,1.8e-05,3.8e-05,4.2e-05,3.3e-05,4.1e-05,4.6e-05,7e-05,3.7e-05,6.4e-05,2.9e-05,4.4e-05,2.5e-05,9.1e-05,7.7e-05,1.7e-05,5.6e-05,0.000192,8.1e-05,3.4e-05,3.7e-05,9.1e-05,5e-05,3.5e-05,7.9e-05,7.4e-05,2e-05,0.000229,0.000137,0.000207,0.000245,0.000423,0.000156,9.5e-05,9.9e-05,0.000245,7.8e-05,0.000174,0.000156,3.8e-05,5e-05,4.5e-05,0.000265,0.000193,9.8e-05,0.000185,0.000212,9.3e-05,0.000117,0.000207,0.000216,0.000335,0.000129,0.000306,0.000336,0.00013,0.000326,0.000284,0.000544,0.000346,9.2e-05,0.000465,2.1e-05,0.000231,0.000229,0.000147,0.000111,9.5e-05,0.000397,0.000259,0.000138,0.00011,0.000301,0.000255,0.000269,0.000133,0.000174,0.000275,0.000223,0.000172,0.000239,0.000416,0.000229,0.000589,0.000368,0.000384,0.000444,6.5e-05,0.000239,0.000541,0.000399,0.000353,0.000311,0.000608,0.000135,1.9e-05,0.000315,5.7e-05,0.000167,0.000463,0.000151,6.1e-05,7.7e-05,0.000104,0.000246,1.2e-05,0.000183
9e-06,1e-05,1e-05,2.9e-05,3e-05,2.3e-05,2e-05,1e-05,1.1e-05,1.6e-05,1.7e-05,2.1e-05,2.8e-05,3.6e-05,1.9e-05,1.2e-05,4.6e-05,3.4e-05,5.5e-05,4.8e-05,7.4e-05,4.9e-05,2.7e-05,0.000103,7.9e-05,2.5e-05,6.9e-05,0.000125,1e-04,4.6e-05,7.7e-05,0.000191,0.000168,0.00018,0.000167,6.6e-05,0.000121,0.000138,8.4e-05,6.8e-05,9.3e-05,0.000249,0.000175,0.000125,0.00016,0.000195,6e-05,0.000315,0.000223,0.000285,0.00026,0.000218,9.5e-05,6.1e-05,0.000111,3.1e-05,3.5e-05,0.000225,0.000319,0.000454,0.00049,0.000379,2e-04,4.8e-05,0.000178,0.000253,0.000169,0.000318,0.00049,0.000545,0.000301,0.000267,0.000156,2e-04,0.000261,0.00045,0.00016,4.6e-05,0.000571,0.000595,0.000519,0.000279,0.000326,0.000207,0.000111,0.000289,0.000162,0.000264,0.000365,0.00046,0.000255,0.000438,0.000269,0.000117,0.000357,0.000139,0.000257,0.000311,0.000401,0.000175,0.000427,0.000505,0.000387,0.000543,0.000299,0.000235,0.00048,2.6e-05,0.000428,0.000487,0.000406,0.000507,0.000455,0.000637,0.000104,0.000131,6.6e-05,0.000105,5.8e-05,9e-06,0.000338
1.1e-05,9e-06,6e-06,1.5e-05,1.6e-05,1.5e-05,1.7e-05,2e-06,9e-06,1.3e-05,3.8e-05,2.1e-05,1e-05,3.2e-05,2.5e-05,1.6e-05,8e-06,1.3e-05,5.5e-05,4.7e-05,7.7e-05,9.1e-05,5.9e-05,7.7e-05,6.8e-05,2.3e-05,7.4e-05,5.3e-05,6.7e-05,7.3e-05,0.000158,0.000191,0.00026,5e-06,0.000174,0.000215,3e-06,0.000151,0.000132,0.000138,7.6e-05,0.000316,8.6e-05,9.9e-05,7e-05,0.000365,0.000309,0.000305,0.000124,0.000157,7.7e-05,0.000191,0.000227,0.000145,0.00013,0.000273,0.000228,0.000454,0.000465,0.00024,0.000318,7.5e-05,0.000167,0.00024,0.000196,0.000256,0.000591,0.000324,7.4e-05,0.000363,0.00055,0.000425,0.000204,0.000319,0.000497,0.000614,0.000421,0.000709,0.000185,0.000341,0.000212,0.000903,0.000685,0.000128,0.000271,0.000444,0.000228,0.00047,0.000456,0.000467,0.000478,0.000314,0.000409,0.00049,0.000363,0.000162,0.000223,0.000451,0.000394,0.000259,0.000221,0.000279,0.000343,0.000535,0.000437,0.000313,0.000635,0.000343,3e-04,0.000258,0.000717,0.000254,0.000398,0.000539,0.000241,0.000126,6.5e-05,5.6e-05,0.000288,0.00011,0.000369
8e-06,3e-06,5e-06,6e-06,2e-06,8e-06,9e-06,4e-06,1e-05,2e-05,1.6e-05,1e-05,7e-06,9e-06,2e-05,3.2e-05,5.2e-05,1.7e-05,2.7e-05,2.5e-05,3.4e-05,3.2e-05,1.6e-05,9.7e-05,8.4e-05,4.9e-05,7.6e-05,1.2e-05,6.9e-05,4.3e-05,0.000114,0.000179,0.000101,0.00014,9.6e-05,7.1e-05,0.000131,0.000155,0.000161,0.000181,0.000229,7e-05,0.000112,3.2e-05,9.4e-05,0.000245,0.000297,9.1e-05,0.000116,0.000108,2.4e-05,0.000287,0.00039,0.000435,0.000258,0.000304,0.00028,0.000508,0.000306,0.000333,0.000223,8.4e-05,0.000171,0.000234,0.000138,0.000124,0.000488,0.000206,0.00014,0.000379,0.000462,0.00013,0.000286,7.5e-05,0.000484,0.000249,0.000411,0.000664,0.000527,0.000178,0.000133,0.000683,0.000368,0.000155,0.000138,0.000519,0.00036,0.000352,9.1e-05,0.000234,0.000277,0.000497,0.00042,0.000252,0.00029,0.000376,0.000251,0.000262,0.000632,0.000406,0.000178,0.000357,4e-04,0.000256,0.000205,0.00046,5.3e-05,0.000148,0.000391,0.000386,0.000244,0.000287,0.000396,0.000428,0.000206,0.000144,9.7e-05,0.000171,0.000145,9.8e-05,0.00027
5e-06,4e-06,6e-06,5e-06,3e-06,9e-06,1.1e-05,4e-06,5e-06,2.1e-05,1.2e-05,8e-06,2e-06,2.3e-05,1.9e-05,2.8e-05,5.4e-05,8e-06,2.7e-05,2.7e-05,3.6e-05,1.6e-05,1.7e-05,4.6e-05,4.2e-05,3.7e-05,3.7e-05,4.4e-05,7.7e-05,3.7e-05,0.000102,1e-04,4.7e-05,4.4e-05,4.1e-05,3.3e-05,6.1e-05,0.000143,8e-05,5.7e-05,7.8e-05,8.8e-05,1.9e-05,5.7e-05,8.5e-05,0.000121,0.000377,8.4e-05,0.000105,4.6e-05,7.5e-05,0.000177,0.000111,7.8e-05,0.000107,0.00022,0.00041,0.000255,8e-05,0.000183,0.000223,0.000142,1e-04,0.000117,0.000107,7.4e-05,0.000287,3.3e-05,5e-05,0.000247,0.000164,0.000113,0.000356,0.000304,0.000222,0.000386,0.000197,0.000278,0.000223,0.000166,0.000105,0.000373,0.000378,0.000262,0.00024,0.000181,0.000139,0.000232,6.9e-05,0.000269,0.000157,0.000395,9.7e-05,0.000118,0.000219,0.000156,0.000257,0.000151,0.000188,0.000169,0.000146,0.000215,0.000112,0.000286,0.000288,0.000347,0.000212,0.000258,0.000259,4.9e-05,0.000227,0.000151,0.000103,0.000204,0.000369,0.000259,0.000165,0.000125,0.000131,1.9e-05,0.000233
5e-06,4e-06,6e-06,3e-06,1e-06,7e-06,1e-05,4e-06,2e-06,1.8e-05,5e-06,4e-06,4e-06,1.9e-05,1.5e-05,2.8e-05,4.5e-05,6e-06,3.2e-05,2.9e-05,2.9e-05,2.6e-05,5e-06,1.5e-05,4.2e-05,2.5e-05,7e-06,2.9e-05,6e-05,1.6e-05,7.7e-05,5.8e-05,1.8e-05,6e-05,8e-06,1.6e-05,3.8e-05,0.000106,6.5e-05,1.5e-05,2.5e-05,7.4e-05,4.6e-05,1.7e-05,2.5e-05,0.000203,0.000209,7e-06,5.1e-05,4.6e-05,5.1e-05,5.9e-05,3.6e-05,3.5e-05,7.2e-05,0.000164,0.000265,0.000183,6.4e-05,7.3e-05,0.000111,5.3e-05,8e-05,3.2e-05,4.3e-05,0.000115,0.000274,8.9e-05,2.8e-05,0.000115,0.000154,6.3e-05,0.00026,0.000278,0.000112,0.000277,0.000129,0.000322,6.2e-05,0.000116,3.7e-05,0.000239,0.000385,0.000139,0.000104,7.4e-05,0.000186,0.000144,3.6e-05,0.000233,0.000238,0.000205,0.000124,7.8e-05,0.000142,0.000164,0.000129,6.9e-05,0.000123,0.000109,0.000149,9.8e-05,0.000121,0.000113,0.000181,0.000287,8.9e-05,0.00027,0.000191,7.9e-05,0.000199,7.9e-05,8.9e-05,0.000215,0.000218,7.8e-05,3.6e-05,7.2e-05,3.6e-05,7.5e-05,0.000195
4e-06,4e-06,5e-06,1e-06,1e-06,7e-06,1e-05,3e-06,1e-06,1.5e-05,6e-06,2e-06,4e-06,1.9e-05,1.4e-05,3e-05,4.5e-05,8e-06,3.6e-05,3.4e-05,2.5e-05,2.7e-05,6e-06,1e-05,5e-05,2.5e-05,1.2e-05,3.7e-05,5.6e-05,6e-06,8.6e-05,5.2e-05,2.8e-05,3.9e-05,2e-06,9e-06,2.9e-05,0.000101,5.7e-05,1.8e-05,1.8e-05,7.7e-05,4.3e-05,4e-05,5.9e-05,0.000216,0.000187,2.3e-05,4.6e-05,3.7e-05,5e-06,2.3e-05,3e-05,3e-05,3.9e-05,0.000158,0.000265,0.000191,1e-04,5.7e-05,0.000131,5.6e-05,4.8e-05,9e-06,3.6e-05,9e-05,0.000243,0.000108,2.6e-05,5e-05,7.8e-05,0.00012,0.000261,0.00024,5.9e-05,0.000317,0.000174,0.000277,0.000111,5.8e-05,4.3e-05,0.000241,0.000289,0.000182,0.000109,0.000115,8.9e-05,0.00015,9e-05,0.000213,0.000183,0.000217,6.2e-05,6.6e-05,0.000161,0.000116,9e-06,5.6e-05,0.000135,0.000103,0.000116,7e-05,0.000128,0.000112,0.000129,0.000228,0.000108,0.000227,0.000102,1.8e-05,0.000185,7.3e-05,8.1e-05,0.000223,0.000205,7.8e-05,3.4e-05,8.5e-05,5.4e-05,5.2e-05,0.000165
