0.045948,0.0416,0.042392,0.046763,0.047809,0.045275,0.043783,0.042443,0.038205,0.036362,0.041203,0.048941,0.047989,0.049537,0.054542,0.054891,0.056936,0.05494,0.049918,0.041394,0.036742,0.04119,0.044543,0.043658,0.047142,0.057661,0.058015,0.051965
0.056328,0.050643,0.051467,0.057708,0.060345,0.056593,0.053727,0.051631,0.046723,0.045082,0.051047,0.061022,0.060209,0.05965,0.064408,0.066471,0.069505,0.066052,0.059762,0.051001,0.045832,0.050242,0.0546,0.054694,0.059544,0.070797,0.070007,0.063478
0.073343,0.065194,0.06601,0.07557,0.081368,0.075238,0.069738,0.066666,0.061394,0.060608,0.068579,0.081916,0.081154,0.075846,0.078635,0.08387,0.088954,0.082725,0.074947,0.067853,0.062589,0.065878,0.071496,0.073866,0.080478,0.090684,0.087505,0.081291
0.085513,0.075506,0.075699,0.087683,0.096617,0.08864,0.081859,0.07999,0.076265,0.076162,0.083962,0.097442,0.097277,0.087761,0.086082,0.094357,0.10162,0.092053,0.085279,0.083684,0.079421,0.08105,0.086406,0.090267,0.095397,0.09987,0.095578,0.09199
0.095505,0.085191,0.084574,0.094435,0.104794,0.099441,0.094411,0.096051,0.093501,0.093173,0.098897,0.107757,0.107764,0.097561,0.092506,0.10136,0.108668,0.098965,0.098314,0.101594,0.097323,0.098784,0.103716,0.106571,0.103453,0.099089,0.099999,0.10291
0.115133,0.107046,0.106629,0.108887,0.113747,0.111942,0.111132,0.116334,0.112861,0.113089,0.119706,0.121711,0.118405,0.111111,0.108243,0.114209,0.118116,0.1145,0.123844,0.126641,0.1188,0.121862,0.12817,0.128745,0.115723,0.105188,0.114501,0.124384
0.146068,0.141318,0.140347,0.137778,0.13432,0.129208,0.13268,0.139971,0.13411,0.135611,0.144687,0.140697,0.133109,0.129761,0.13293,0.138045,0.140909,0.144556,0.15834,0.15714,0.145239,0.149415,0.158653,0.157406,0.137006,0.122082,0.136738,0.151985
0.180015,0.180798,0.181425,0.183357,0.174378,0.153881,0.155401,0.164179,0.159655,0.16095,0.169059,0.170375,0.167372,0.160849,0.164324,0.176191,0.182101,0.182858,0.190894,0.18936,0.179813,0.184604,0.190852,0.185973,0.166257,0.147265,0.160231,0.173936
0.209409,0.22441,0.23258,0.249018,0.235991,0.189784,0.184224,0.191928,0.194465,0.196003,0.192813,0.211609,0.225302,0.202139,0.200311,0.227977,0.239582,0.227769,0.221704,0.220497,0.221111,0.230757,0.227925,0.217566,0.203062,0.178435,0.179848,0.187323
0.233959,0.260066,0.274999,0.311303,0.299039,0.230563,0.215864,0.221531,0.234348,0.236635,0.22063,0.252943,0.279494,0.23548,0.224703,0.273074,0.298018,0.273301,0.250258,0.240181,0.248549,0.268095,0.262018,0.25154,0.238373,0.210381,0.198697,0.201686
0.24189,0.258988,0.273971,0.327955,0.319502,0.24551,0.224099,0.22796,0.25035,0.248791,0.227175,0.265121,0.294005,0.239804,0.222136,0.283324,0.324117,0.296949,0.262024,0.237439,0.246753,0.273038,0.268924,0.259261,0.240907,0.219461,0.204007,0.208479
0.217375,0.213145,0.224185,0.280207,0.273734,0.216952,0.199413,0.202624,0.226959,0.22301,0.205032,0.235561,0.254001,0.208566,0.190442,0.245841,0.294105,0.27247,0.234102,0.207708,0.221843,0.246962,0.242428,0.235378,0.21274,0.199049,0.193888,0.204423
0.176416,0.159669,0.159937,0.192897,0.189839,0.170286,0.166213,0.167059,0.1842,0.188277,0.182066,0.191875,0.192947,0.167308,0.153611,0.192719,0.241679,0.229044,0.19299,0.174411,0.194234,0.219787,0.212515,0.202492,0.181565,0.171539,0.181899,0.196377
0.142617,0.139339,0.134085,0.141197,0.140019,0.142033,0.143979,0.144542,0.153478,0.162309,0.162037,0.158972,0.156317,0.146243,0.136861,0.162811,0.210519,0.205347,0.17107,0.156603,0.168388,0.188501,0.188348,0.175649,0.159529,0.155091,0.171927,0.176982
0.123923,0.145168,0.151741,0.141197,0.129637,0.125915,0.128333,0.136698,0.144315,0.152577,0.159725,0.164633,0.161889,0.148577,0.138512,0.157519,0.195778,0.194157,0.169892,0.154563,0.14944,0.162963,0.169591,0.152328,0.143596,0.149672,0.160677,0.153667
0.140179,0.186871,0.208736,0.192353,0.170999,0.149744,0.149873,0.171567,0.179783,0.172547,0.184653,0.204924,0.202264,0.19245,0.186583,0.196354,0.216262,0.205888,0.185735,0.172008,0.170459,0.180947,0.177424,0.164564,0.168469,0.172552,0.158088,0.14867
0.213107,0.279414,0.300594,0.277852,0.251449,0.214028,0.203825,0.234888,0.249998,0.228788,0.246973,0.279432,0.272536,0.272889,0.277414,0.294473,0.3155,0.281753,0.249358,0.237963,0.240824,0.248667,0.230892,0.221743,0.25004,0.256895,0.209845,0.189098
0.331519,0.389759,0.382305,0.352186,0.325907,0.279922,0.259655,0.291567,0.316763,0.298081,0.324753,0.369176,0.365409,0.367804,0.37605,0.4141,0.449633,0.39093,0.350006,0.335034,0.323851,0.334735,0.315289,0.305895,0.353448,0.369505,0.300986,0.263329
0.466936,0.469785,0.402701,0.373029,0.358297,0.314974,0.29101,0.317527,0.34257,0.335739,0.36399,0.414469,0.439333,0.440227,0.442016,0.509816,0.552839,0.476178,0.457214,0.447631,0.397762,0.398304,0.388957,0.391976,0.450124,0.470043,0.406802,0.373151
0.573434,0.490137,0.366864,0.35772,0.356703,0.323539,0.303098,0.319694,0.329999,0.337962,0.354705,0.396604,0.472041,0.474189,0.453984,0.553887,0.603358,0.522947,0.54972,0.563893,0.473686,0.446672,0.449099,0.468879,0.531246,0.543267,0.499704,0.500462
0.58967,0.454535,0.309464,0.337543,0.352631,0.321415,0.311644,0.318701,0.305894,0.332368,0.344174,0.355644,0.468856,0.505801,0.46119,0.541367,0.582516,0.518967,0.592459,0.630523,0.537169,0.489629,0.482422,0.509857,0.580372,0.584056,0.553206,0.587322
0.500122,0.395184,0.277878,0.321912,0.348236,0.323269,0.319881,0.316922,0.283589,0.311036,0.341262,0.345085,0.462657,0.549408,0.485197,0.467607,0.480672,0.45673,0.564051,0.615242,0.533848,0.478093,0.451297,0.473222,0.540737,0.538288,0.524946,0.569412
0.37537,0.33063,0.280481,0.314283,0.319557,0.316498,0.318107,0.299771,0.268239,0.281753,0.318483,0.321518,0.399275,0.523277,0.494387,0.407311,0.385543,0.375936,0.479874,0.540119,0.450452,0.379083,0.347216,0.367282,0.421798,0.430335,0.43041,0.447318
0.331269,0.293004,0.285673,0.298,0.283423,0.299773,0.307566,0.272612,0.235047,0.232027,0.267381,0.270603,0.303907,0.419822,0.454925,0.397497,0.333828,0.310406,0.392632,0.444537,0.364172,0.290947,0.25121,0.280315,0.345942,0.351923,0.345665,0.356181
0.331587,0.253187,0.25709,0.278103,0.274883,0.292104,0.299401,0.262137,0.213186,0.214062,0.266975,0.254501,0.239435,0.314052,0.396821,0.428197,0.353034,0.294767,0.3386,0.36424,0.323241,0.283965,0.237305,0.270001,0.351657,0.339803,0.328563,0.364026
0.319173,0.216795,0.221437,0.276595,0.287512,0.272775,0.2711,0.277336,0.256673,0.256881,0.310339,0.269932,0.216012,0.266518,0.363606,0.439391,0.399626,0.340669,0.356469,0.348105,0.320655,0.322532,0.263793,0.257514,0.326828,0.304704,0.306207,0.375042
0.279277,0.199484,0.209922,0.299008,0.307623,0.247712,0.227087,0.29137,0.321535,0.297203,0.32268,0.281284,0.234773,0.283874,0.338355,0.380374,0.399468,0.360598,0.35143,0.333669,0.323077,0.362598,0.292922,0.230528,0.256439,0.234247,0.266121,0.372098
0.228126,0.188807,0.216,0.326098,0.316716,0.210348,0.177296,0.284409,0.358037,0.319034,0.308569,0.287796,0.2978,0.343412,0.34365,0.3376,0.372778,0.349272,0.309006,0.290137,0.321293,0.391293,0.311178,0.206541,0.184698,0.175285,0.252834,0.379377
0.246574,0.201782,0.218686,0.319613,0.319806,0.220385,0.17481,0.266363,0.360538,0.350396,0.31381,0.315735,0.381493,0.387415,0.369121,0.408564,0.413637,0.357255,0.300442,0.284015,0.352478,0.42694,0.339623,0.230963,0.189168,0.182123,0.296608,0.422017
0.273767,0.217279,0.220895,0.303334,0.329091,0.273077,0.227265,0.269066,0.338986,0.385831,0.354351,0.347466,0.427897,0.382384,0.377368,0.486293,0.462243,0.368007,0.304971,0.285108,0.369517,0.442968,0.352517,0.247805,0.199789,0.193155,0.32235,0.464355
0.309065,0.240709,0.210078,0.267295,0.321827,0.308685,0.274756,0.283958,0.314179,0.3988,0.381787,0.33705,0.391139,0.328702,0.349719,0.479221,0.467623,0.372395,0.283943,0.260386,0.329936,0.387521,0.320674,0.229881,0.192165,0.183422,0.282469,0.439687
0.316272,0.234354,0.186805,0.23678,0.305406,0.304082,0.278649,0.298523,0.314524,0.373112,0.340555,0.266872,0.28967,0.244978,0.272779,0.369232,0.388714,0.334541,0.25178,0.231354,0.26528,0.293452,0.264314,0.203033,0.177649,0.157486,0.193879,0.326907
0.268497,0.192365,0.167488,0.215028,0.25997,0.259665,0.246093,0.265553,0.280389,0.30961,0.277988,0.210615,0.207665,0.176908,0.178112,0.247978,0.289834,0.271929,0.203283,0.182843,0.194188,0.199134,0.210644,0.188453,0.174317,0.159933,0.134009,0.19673
0.210531,0.1741,0.177951,0.202781,0.224388,0.224028,0.21457,0.210832,0.231752,0.278015,0.268753,0.190784,0.159214,0.141232,0.136896,0.187123,0.243871,0.228661,0.168782,0.156879,0.133519,0.142021,0.207477,0.193546,0.190905,0.19016,0.141024,0.143145
0.181786,0.188414,0.184762,0.175282,0.19833,0.196569,0.189183,0.169806,0.173158,0.232243,0.242436,0.180714,0.164002,0.144283,0.122704,0.155918,0.214415,0.196258,0.159196,0.17738,0.128936,0.140211,0.22609,0.197678,0.209036,0.218252,0.173028,0.150918
0.1755,0.191628,0.163859,0.129231,0.162866,0.17771,0.169101,0.14592,0.136591,0.184176,0.192279,0.169683,0.176053,0.142967,0.099024,0.111546,0.165312,0.168975,0.148126,0.191092,0.157227,0.170841,0.238054,0.19714,0.210379,0.220479,0.202242,0.16094
0.162209,0.164402,0.130635,0.117315,0.152165,0.157952,0.15593,0.148436,0.131376,0.156999,0.147552,0.142056,0.1654,0.13512,0.093737,0.09598,0.145739,0.165984,0.141116,0.188634,0.176032,0.188278,0.237798,0.206615,0.188773,0.183924,0.206147,0.178158
0.171848,0.153534,0.131319,0.139671,0.164449,0.17086,0.184241,0.184075,0.146892,0.144963,0.132528,0.1145,0.139307,0.113813,0.091478,0.115947,0.16495,0.180233,0.167078,0.200207,0.172956,0.175194,0.205122,0.200747,0.161015,0.127039,0.177605,0.200154
0.19372,0.183914,0.158923,0.154414,0.16362,0.193312,0.218437,0.234428,0.180446,0.128773,0.114734,0.110483,0.134525,0.093556,0.081498,0.136211,0.174594,0.18082,0.193803,0.207277,0.172819,0.145604,0.145184,0.175329,0.158961,0.095057,0.142788,0.211246
0.189513,0.203225,0.175174,0.143542,0.142801,0.205467,0.237994,0.279455,0.223455,0.122023,0.103457,0.122399,0.139878,0.10286,0.097189,0.156904,0.16908,0.155615,0.198073,0.19743,0.185526,0.126799,0.099637,0.150738,0.154948,0.099966,0.151518,0.220108
