0.00544,0.005061,0.004763,0.004262,0.003872,0.003723,0.003699,0.003982,0.004556,0.004938,0.00512,0.005255,0.005314,0.005279,0.004587,0.004221,0.00469,0.005014,0.006371,0.006749,0.005584,0.005391,0.005637,0.00517,0.004341,0.004323,0.004479,0.004691
0.006547,0.006074,0.005854,0.005319,0.004798,0.00457,0.004509,0.004827,0.005408,0.005797,0.006155,0.006344,0.006387,0.00633,0.005525,0.005192,0.005746,0.00608,0.007436,0.007835,0.006654,0.00645,0.006699,0.006235,0.005412,0.00537,0.005499,0.005779
0.008293,0.00768,0.007629,0.007176,0.006469,0.006048,0.005917,0.006275,0.006754,0.00705,0.007791,0.008065,0.007949,0.00787,0.006997,0.006819,0.007464,0.007838,0.009282,0.009658,0.008344,0.008042,0.008219,0.00789,0.007255,0.007102,0.007101,0.007522
0.00932,0.008562,0.008611,0.008606,0.007939,0.007257,0.007102,0.007451,0.007593,0.007604,0.008709,0.00899,0.00856,0.00854,0.007932,0.008007,0.008534,0.008959,0.01069,0.011095,0.009421,0.008758,0.008808,0.008777,0.008525,0.008214,0.007951,0.008498
0.00939,0.008508,0.008455,0.009207,0.008837,0.007947,0.007904,0.008196,0.007974,0.0078,0.008941,0.009102,0.008348,0.008283,0.008235,0.008591,0.008798,0.009253,0.011217,0.011763,0.009858,0.008638,0.008518,0.008742,0.008796,0.008409,0.007973,0.008639
0.009677,0.008584,0.008028,0.009119,0.009186,0.008463,0.008488,0.008632,0.008306,0.008191,0.009016,0.009091,0.008351,0.008166,0.008676,0.009169,0.008865,0.00939,0.011677,0.012273,0.010191,0.00845,0.008062,0.008471,0.008804,0.008374,0.007921,0.009039
0.01119,0.009641,0.008297,0.009127,0.009612,0.009593,0.009543,0.009435,0.009395,0.009147,0.009113,0.009196,0.008915,0.008659,0.009458,0.010025,0.009253,0.009984,0.012931,0.01343,0.010902,0.008915,0.008368,0.008834,0.009607,0.009355,0.008571,0.010026
0.013645,0.011225,0.009379,0.010378,0.011143,0.011801,0.011921,0.01152,0.011795,0.011206,0.009871,0.010132,0.010786,0.010222,0.010637,0.011447,0.010739,0.011294,0.014163,0.014609,0.012155,0.010176,0.009751,0.010214,0.0113,0.011579,0.010266,0.011695
0.015853,0.012373,0.011023,0.012701,0.013422,0.014637,0.015416,0.014819,0.015451,0.014615,0.011719,0.012169,0.013818,0.012612,0.012163,0.013041,0.012803,0.01328,0.015604,0.016006,0.014174,0.012076,0.011728,0.012578,0.014037,0.014967,0.012941,0.013429
0.01747,0.012898,0.013046,0.015502,0.015511,0.016859,0.018355,0.017658,0.018769,0.018067,0.014369,0.015073,0.017116,0.015208,0.013535,0.0143,0.014647,0.015302,0.018297,0.019284,0.017111,0.01387,0.013096,0.01449,0.016478,0.018012,0.015523,0.014532
0.017718,0.013085,0.014622,0.017263,0.016245,0.01737,0.019215,0.018365,0.019701,0.019651,0.016566,0.017318,0.019073,0.017249,0.014914,0.015495,0.015917,0.016314,0.020549,0.022548,0.019122,0.01439,0.013311,0.015242,0.017504,0.01915,0.01692,0.015084
0.01638,0.013102,0.015307,0.017682,0.016111,0.016677,0.017829,0.016642,0.017808,0.018794,0.017872,0.018387,0.019276,0.018442,0.016192,0.015968,0.016051,0.016198,0.020999,0.023381,0.018971,0.013966,0.013124,0.015149,0.017155,0.018393,0.016869,0.01585
0.014434,0.012382,0.015008,0.017442,0.015497,0.015225,0.015779,0.014283,0.014821,0.01666,0.017869,0.01822,0.017983,0.01773,0.016609,0.016047,0.015662,0.015511,0.019682,0.021462,0.017302,0.013984,0.013451,0.01472,0.015993,0.016267,0.015717,0.016996
0.012456,0.011574,0.014118,0.016756,0.015235,0.014549,0.014596,0.012685,0.012301,0.014148,0.016287,0.016954,0.016159,0.015564,0.015561,0.015644,0.015295,0.015107,0.018308,0.018717,0.015261,0.014112,0.013579,0.013654,0.014386,0.013919,0.014269,0.017141
0.0116,0.011872,0.01331,0.015402,0.014971,0.013584,0.012962,0.011786,0.011119,0.011909,0.013433,0.014688,0.014814,0.013921,0.013727,0.01454,0.014576,0.015292,0.018907,0.017867,0.014199,0.014148,0.014012,0.013533,0.013459,0.01301,0.013819,0.016096
0.014002,0.014338,0.014011,0.015223,0.01617,0.014439,0.013133,0.012591,0.011957,0.012062,0.012851,0.015404,0.017221,0.015444,0.013616,0.01445,0.015217,0.016826,0.020798,0.018908,0.015148,0.015285,0.015702,0.016091,0.015201,0.01409,0.01532,0.01669
0.019251,0.019214,0.01753,0.018279,0.020225,0.017749,0.015687,0.015812,0.016182,0.017019,0.016728,0.019718,0.022821,0.019918,0.016742,0.017223,0.017935,0.019409,0.02341,0.022197,0.018777,0.017996,0.018683,0.021221,0.020487,0.017301,0.018128,0.019511
0.024942,0.024774,0.022445,0.024024,0.025906,0.021181,0.018876,0.020382,0.022292,0.024272,0.022683,0.025845,0.030244,0.025348,0.021111,0.022202,0.022869,0.024439,0.028014,0.027208,0.024252,0.022037,0.022582,0.028301,0.028729,0.021952,0.022332,0.025321
0.029848,0.029433,0.027274,0.031458,0.03336,0.02528,0.022137,0.025065,0.028144,0.030783,0.028518,0.032048,0.036345,0.028578,0.024602,0.027692,0.02835,0.031174,0.035556,0.034868,0.031781,0.028059,0.027685,0.035827,0.03831,0.027961,0.027412,0.032287
0.032706,0.031984,0.029993,0.036312,0.039509,0.02974,0.025301,0.028397,0.031844,0.034832,0.032981,0.035892,0.038394,0.030003,0.028694,0.034517,0.035012,0.038325,0.043257,0.043083,0.039402,0.034149,0.032887,0.041758,0.045484,0.032614,0.030029,0.035814
0.033417,0.03318,0.030693,0.035718,0.03972,0.033475,0.030925,0.03087,0.032152,0.036689,0.037143,0.038211,0.037746,0.03162,0.033,0.039424,0.040805,0.044861,0.047707,0.046278,0.04245,0.037288,0.037652,0.045329,0.046905,0.033583,0.028179,0.032477
0.032555,0.034197,0.031671,0.032084,0.03512,0.036419,0.037544,0.03188,0.029779,0.035851,0.038479,0.037759,0.034957,0.031642,0.034239,0.039214,0.042154,0.047281,0.046471,0.041685,0.038334,0.036204,0.040832,0.046769,0.044565,0.033113,0.025265,0.025617
0.03338,0.035426,0.033532,0.031419,0.032,0.03806,0.040916,0.03144,0.028109,0.034317,0.037754,0.034499,0.028542,0.027327,0.032124,0.036909,0.03944,0.042749,0.040974,0.034699,0.031915,0.033062,0.039676,0.044168,0.042555,0.035815,0.027039,0.025115
0.03566,0.034938,0.03384,0.035234,0.034048,0.03734,0.039494,0.031331,0.029556,0.033889,0.036453,0.031408,0.02275,0.023166,0.030284,0.03617,0.03704,0.036894,0.037322,0.032639,0.030651,0.032082,0.036672,0.041334,0.04093,0.036855,0.029182,0.028083
0.032582,0.031573,0.033448,0.038157,0.0362,0.034467,0.034072,0.028754,0.028512,0.031679,0.034995,0.031631,0.02287,0.022143,0.027437,0.03356,0.034431,0.035376,0.042856,0.040485,0.035308,0.032061,0.033155,0.038324,0.037466,0.033591,0.028424,0.029752
0.026932,0.029214,0.032474,0.035738,0.034282,0.032143,0.033044,0.028784,0.025142,0.027327,0.034558,0.034081,0.024879,0.021143,0.023124,0.028485,0.030869,0.036114,0.049443,0.049263,0.039407,0.030767,0.029017,0.03264,0.030641,0.02733,0.02572,0.03073
0.024398,0.030337,0.034448,0.036212,0.037331,0.038046,0.040942,0.035112,0.024932,0.025787,0.036097,0.034836,0.024809,0.021387,0.021839,0.023364,0.025149,0.035038,0.050902,0.052062,0.03987,0.030216,0.028204,0.028416,0.026136,0.024716,0.026122,0.034578
0.028734,0.037834,0.045446,0.048422,0.05127,0.051296,0.050649,0.040504,0.027758,0.029876,0.039362,0.033501,0.025714,0.027226,0.026067,0.022884,0.022983,0.033985,0.050669,0.052068,0.039069,0.031689,0.031387,0.030194,0.03011,0.031694,0.033336,0.040479
0.040504,0.049708,0.056939,0.061282,0.065481,0.063781,0.058266,0.044574,0.032884,0.036976,0.044018,0.036535,0.034611,0.039816,0.035542,0.030705,0.028504,0.033914,0.051211,0.052592,0.038038,0.033934,0.03838,0.040044,0.040849,0.042012,0.042811,0.047499
0.055463,0.060321,0.059462,0.062616,0.068775,0.069825,0.064364,0.050103,0.042039,0.048615,0.05388,0.046666,0.048414,0.055637,0.04695,0.041892,0.039218,0.037158,0.052684,0.056717,0.042416,0.040875,0.052526,0.058852,0.055633,0.050528,0.049848,0.056916
0.070782,0.066686,0.052259,0.050229,0.056561,0.065803,0.066301,0.056234,0.053103,0.064171,0.069562,0.058397,0.058676,0.06879,0.056971,0.051662,0.050602,0.040087,0.049228,0.061284,0.053626,0.056194,0.07254,0.079811,0.072633,0.059246,0.058434,0.075263
0.079648,0.06763,0.04413,0.035889,0.037792,0.053684,0.061981,0.058656,0.059291,0.073107,0.080651,0.064299,0.059111,0.071667,0.063977,0.05702,0.055908,0.041257,0.042785,0.061819,0.062208,0.069081,0.086706,0.091025,0.083392,0.064471,0.064935,0.091955
0.074865,0.061976,0.038494,0.031661,0.031261,0.043746,0.05576,0.054451,0.05395,0.066036,0.07489,0.059131,0.049888,0.059284,0.05963,0.052161,0.050786,0.041241,0.036278,0.053813,0.058749,0.068494,0.083146,0.081745,0.076619,0.057352,0.05938,0.09215
0.056016,0.04876,0.034166,0.032741,0.034042,0.037024,0.041805,0.041386,0.039935,0.046123,0.052575,0.042434,0.033483,0.0371,0.043458,0.040224,0.0382,0.036139,0.030244,0.03989,0.043502,0.052438,0.06085,0.054842,0.052723,0.038852,0.041247,0.070949
0.032821,0.033491,0.032112,0.034914,0.036428,0.02943,0.023938,0.027407,0.029693,0.030222,0.029925,0.023825,0.01851,0.018995,0.025448,0.028402,0.025825,0.02598,0.027142,0.030269,0.028353,0.032221,0.0339,0.027846,0.026093,0.020292,0.021353,0.040385
0.021893,0.023749,0.027693,0.032779,0.034262,0.022786,0.014373,0.022193,0.025493,0.027264,0.026256,0.018873,0.015523,0.014317,0.014821,0.016983,0.017007,0.016602,0.025379,0.026857,0.02028,0.018637,0.018797,0.014526,0.010427,0.010162,0.010248,0.018007
0.021843,0.01992,0.022339,0.030732,0.031611,0.020595,0.014791,0.021558,0.021454,0.024479,0.027573,0.021164,0.0164,0.013925,0.010604,0.010022,0.011691,0.012481,0.026385,0.027632,0.016405,0.011793,0.012455,0.009784,0.006794,0.007279,0.007843,0.013142
0.019517,0.016273,0.019058,0.028245,0.027734,0.018131,0.014736,0.017723,0.017844,0.021675,0.02414,0.020432,0.014709,0.011711,0.00801,0.007492,0.009193,0.01143,0.02852,0.031338,0.015084,0.007289,0.008047,0.008052,0.007419,0.00718,0.007706,0.013169
0.013876,0.011174,0.014365,0.02231,0.020632,0.013498,0.012016,0.011536,0.012766,0.016643,0.016965,0.016508,0.012392,0.008747,0.007052,0.007876,0.008397,0.009886,0.027664,0.03185,0.013848,0.006159,0.006704,0.006664,0.007843,0.008554,0.009335,0.012307
0.007979,0.006229,0.009173,0.015182,0.01299,0.009374,0.008435,0.006077,0.007346,0.011471,0.011057,0.011924,0.011528,0.007653,0.007496,0.009931,0.00982,0.009954,0.024342,0.028993,0.014803,0.008567,0.009031,0.008204,0.00886,0.011114,0.011916,0.010886
