0.000167,8.6e-05,7.6e-05,4.4e-05,3e-05,2.6e-05,2.3e-05,8.7e-05,2.5e-05,6.5e-05,4.1e-05,7e-05,5.1e-05,0.000102,0.000106,0.000103,6.1e-05,0.00026,0.000132,7.9e-05,5.1e-05,0.000187,4.5e-05,2e-05,8.2e-05,0.000193,7.1e-05,0.000105,4.7e-05,3.6e-05,9.1e-05,8.1e-05,0.000143,7.7e-05,0.000223,9.3e-05,4.5e-05,0.000197,0.000329,4e-05,0.000153,2.5e-05,0.000242,7.3e-05,5.5e-05,4.5e-05,0.000154,0.000158,0.000209,0.000136,3.4e-05,0.000139,0.000229,0.000127,0.00013,0.000182,0.000146,0.000117,6e-05,7.1e-05,0.000228,0.000246,0.000193,8.8e-05,4.9e-05,7.3e-05,0.000147,3e-06,3e-06,0.00018,0.000191,0.000294,1.7e-05,8.9e-05,0.000128,7e-06,4.5e-05,4.8e-05,2.1e-05,9.3e-05,1.1e-05,9e-05,5e-06,1.8e-05,1.7e-05,9.1e-05,0,3.4e-05,6e-06,7.7e-05,1.3e-05,1.9e-05,2.7e-05,4.8e-05,6.1e-05,0.000148,1e-04,4.9e-05,8e-06,7.2e-05,5.9e-05,3.6e-05,9e-05,7.4e-05,8e-05,1.3e-05,0.000101,5.8e-05,2.2e-05,2.3e-05,0.000144,5.8e-05,2.5e-05,2.3e-05,5.6e-05,5.3e-05,6.7e-05,6.5e-05,9.5e-05,5e-05,6e-06
0.000363,0.000165,9.7e-05,0.00017,0.000108,0.000119,0.000107,0.000173,4.5e-05,0.00014,9.7e-05,0.000142,0.00025,0.000128,0.000261,0.000163,9.8e-05,0.000583,0.000285,0.000214,9.6e-05,0.000393,0.00013,0.000131,0.000222,0.000383,0.000167,0.000248,0.00011,0.000123,0.000128,0.000291,0.000324,0.000151,0.000511,0.000232,0.000145,0.000348,0.000699,3.3e-05,0.000348,7.4e-05,0.000483,0.000199,0.000163,0.000136,0.000355,0.000329,0.00038,0.000246,0.000126,0.000263,0.000437,0.00025,0.000337,0.000356,0.000253,0.000226,0.000144,0.00014,0.000479,0.000478,0.000439,0.00014,7.5e-05,0.000151,0.000329,7.3e-05,7.5e-05,0.000385,0.000389,0.000583,6.3e-05,0.000121,0.000179,6.3e-05,7e-05,9.1e-05,8.3e-05,0.000227,3.7e-05,0.000203,2e-05,3.2e-05,7e-06,0.000125,8.2e-05,8.4e-05,6.8e-05,0.000172,6.6e-05,2.4e-05,7.3e-05,3.4e-05,9.4e-05,0.000358,0.000151,0.000165,4.9e-05,0.000161,0.000116,7.4e-05,0.000195,0.000185,0.000211,1.1e-05,0.000225,0.000156,6.7e-05,8.7e-05,0.000325,0.000113,5.3e-05,8.5e-05,9.9e-05,8.4e-05,0.000152,0.000155,0.000177,0.000148,5e-06
0.000475,0.000209,0.000188,0.000124,9.7e-05,0.000139,9.3e-05,0.00016,2.3e-05,0.000204,0.000179,0.000319,9.8e-05,0.000125,0.000182,0.000336,0.000111,0.000657,0.00026,0.000182,0.000162,0.000423,0.000112,7.7e-05,0.000109,0.000404,0.000226,0.000146,0.000113,8e-05,0.000105,0.00029,0.000292,0.000288,0.00043,0.000128,0.000148,0.000431,0.000621,3.9e-05,0.000392,0.00019,0.000483,0.000308,5.2e-05,4.7e-05,0.000444,0.000402,0.000395,0.00045,0.000129,0.00032,0.000409,0.000471,0.000361,0.000307,0.000293,0.000238,0.000154,0.00014,0.000543,0.000459,0.000441,0.000346,0.000184,0.000201,0.000385,0.000175,9.1e-05,0.000396,0.000457,0.000562,7e-05,0.000268,0.000309,0.000145,4.7e-05,0.000175,6.4e-05,0.000134,0.000106,0.00021,6.3e-05,0.000117,0.000102,0.000118,5.5e-05,9.2e-05,5.3e-05,0.00014,9.8e-05,7.6e-05,1.4e-05,1.4e-05,0.000168,0.000399,0.000285,0.000156,0.000115,0.000113,0.000134,0.000128,0.000208,0.000187,0.000175,7.4e-05,0.000286,0.00011,9.9e-05,0.000151,0.000429,0.000177,0.00012,4.4e-05,0.000105,1e-04,0.000154,0.000157,0.000156,0.000234,0.000151
0.000391,0.000441,0.000251,2.5e-05,0.000227,0.000121,0.000247,0.000213,5.3e-05,0.000254,1e-04,0.00025,0.00035,0.000224,0.000369,0.000481,8.8e-05,0.000925,0.000303,0.000163,0.000168,0.000492,0.000322,3.8e-05,0.000275,0.000334,0.000297,0.000265,0.000219,6.9e-05,3.5e-05,0.000452,0.00033,0.000237,0.000528,0.000317,0.000211,0.000639,0.000666,0.000353,0.000615,0.000262,0.000671,0.000242,0.000409,0.000308,0.000565,0.00054,0.000749,0.000451,0.00015,0.00035,0.00051,0.00037,0.00037,0.000419,0.000378,0.000433,0.000269,0.000382,0.00062,0.000292,0.000193,0.000332,9.1e-05,0.000375,0.000387,0.000204,5.8e-05,0.000491,0.000419,0.000826,0.000121,0.000516,0.000743,8.1e-05,0.000152,6.9e-05,0.00036,0.000423,0.000174,0.000301,6.1e-05,0.000215,0.000207,0.000251,0.000134,0.000298,0.000205,0.00038,9e-05,0.000158,0.000111,0.000224,0.000265,0.000377,0.000383,0.000159,9.7e-05,0.000326,1.5e-05,0.000214,0.000327,6.5e-05,0.000434,7.2e-05,0.000256,0.000148,9.1e-05,6.6e-05,0.000414,0.000159,1.1e-05,0.00024,0.000288,0.000187,0.000164,0.000157,0.000204,0.000109,5.4e-05
0.000549,0.000796,0.000648,0.000594,0.000152,0.000292,0.000375,0.000485,0.00043,0.000248,0.000119,0.000447,0.00081,0.000581,0.000116,0.00048,0.000583,0.001025,0.000676,0.000732,0.000389,0.000271,0.000837,0.000663,0.000576,0.00064,0.000645,0.000231,0.000408,4e-04,0.000474,0.000313,0.000442,0.000144,0.00041,0.000221,0.000531,0.000389,0.00085,0.000691,0.001028,0.001017,0.000677,0.000454,0.00074,0.000622,0.000698,0.001159,0.000406,0.000587,0.000319,0.000685,0.00071,0.000299,0.000753,0.000745,0.000648,0.000541,0.000328,0.000374,0.000637,0.000657,0.00056,0.000535,0.000295,0.000526,0.000683,0.000151,0.000342,0.000958,0.000711,0.000995,0.000134,0.000688,0.000737,0.000585,0.000252,0.000196,0.000553,0.000109,0.00046,0.000719,0.00023,0.000247,9.7e-05,0.000217,0.000187,0.000369,0.000236,0.000431,0.000236,0.000177,0.000462,0.000145,0.000452,0.000517,0.000252,0.000142,0.000296,0.000308,0.000181,0.000589,0.000224,0.000211,0.00019,0.000404,0.000561,0.000158,0.000141,0.000202,0.000387,0.000514,0.000423,0.000225,0.000399,0.000114,0.000472,0.000432,0.000229,0.000411,4e-05
0.000318,0.001067,0.000404,0.000279,0.00026,0.000176,0.000499,0.000207,0.000598,0.000483,0.000777,0.000694,0.001443,0.000495,0.00061,0.000914,0.001151,0.001017,0.000774,0.00129,0.000403,0.000343,0.000567,0.000557,0.000377,0.000934,0.000998,0.000532,0.00027,0.000511,0.000715,0.00102,0.000979,0.000439,0.000352,0.000859,0.000864,0.000726,0.000601,0.00091,0.000454,0.000522,0.001477,0.001298,0.000626,0.000289,0.000351,0.001498,0.001664,0.000453,0.001096,0.001155,0.000529,0.000651,0.00063,0.000534,0.000975,0.001205,0.000451,0.000545,0.000829,0.001387,0.000877,0.000617,0.000462,0.000673,0.000952,0.000473,0.000528,0.00118,0.000496,0.001206,0.000385,0.000554,0.000776,0.000506,0.000145,0.000664,0.001003,0.000582,0.000411,0.000466,0.00054,0.000614,0.000711,0.001049,0.000471,0.000377,0.000744,0.000964,0.000501,0.000405,0.000864,0.00037,0.000491,0.000866,0.000621,0.000219,0.000422,0.000268,0.000146,0.000561,0.001051,0.000539,0.000594,0.000338,0.000354,0.000874,0.000576,0.000171,0.000614,0.000744,0.000255,0.000515,0.000633,0.000373,0.000417,0.000697,0.000305,0.00037,0.000488
0.001787,0.000544,0.001612,0.0013,0.000106,0.000557,0.001181,0.000725,0.001041,0.000823,0.001126,0.000721,0.000838,0.001163,0.000769,0.002055,0.001037,0.00106,0.000644,0.001594,0.001808,0.001775,0.000618,0.000191,0.000861,0.00137,0.000544,0.000708,0.000813,0.00064,0.000748,0.0018,0.001579,0.001042,0.001255,0.001746,0.000534,0.000343,0.001703,0.001626,0.000967,0.00134,0.001588,0.001545,0.002455,0.002134,0.001583,0.001845,0.001549,0.002085,0.001474,0.00067,0.000407,0.00076,0.000643,0.001511,0.000951,0.00122,0.001173,0.001206,0.000308,0.001104,0.000586,0.000441,0.001588,0.000651,0.002362,0.000764,0.000817,0.002473,0.002604,0.002685,0.001476,0.001005,0.001653,0.000769,0.000388,0.000707,0.001224,0.000808,9.9e-05,0.000457,0.000875,0.000236,0.000642,0.001019,0.000335,0.000376,0.000618,0.000488,0.000321,0.000503,0.000754,0.000877,0.000242,0.000986,0.001182,0.001314,0.000918,0.000412,0.00011,0.00027,0.000699,0.001429,0.000425,0.000158,0.000109,0.00145,0.000734,0.00048,0.001501,0.000785,0.000869,0.000174,0.000845,0.000813,0.000503,0.001065,0.000807,0.000172,0.000268
0.001552,0.001496,0.002291,0.002335,0.002279,0.000631,0.001415,0.001315,0.001804,0.003544,0.003313,0.001513,0.001132,0.000647,0.001393,0.001109,0.00099,0.001693,0.002473,0.002246,0.001075,0.000329,0.002542,0.001363,0.002001,0.001474,0.001936,0.001246,0.000759,0.001726,0.0018,0.003601,0.001815,0.000669,0.001096,0.0029,0.002807,0.002661,0.003332,0.004636,0.00169,0.002746,0.00319,0.0026,0.001924,0.000729,0.00152,0.001832,0.000416,0.002896,0.002429,0.000452,0.000829,0.001453,0.002337,0.003216,0.002945,0.001426,0.001857,0.002245,0.002381,0.000318,0.002862,0.001611,0.000974,0.001144,0.002429,0.003507,0.00318,0.002036,0.002889,0.002136,0.002935,0.00143,0.002378,0.002084,0.001709,0.001688,0.000731,0.000315,0.000457,0.000285,0.001248,0.001604,0.001651,0.002122,0.000846,0.000465,0.000525,0.001192,0.001144,0.000244,0.001106,0.000984,0.000851,0.00171,0.000529,0.001584,0.000945,0.00091,0.000506,0.000493,0.000507,0.000906,0.002081,0.001732,0.000868,0.002148,0.000683,0.00102,0.001756,0.001595,0.000814,0.000931,0.000578,0.000288,0.000486,0.001337,0.000369,0.000633,0.000263
0.002531,0.001843,0.000593,0.00178,0.002252,0.002116,0.000712,0.001342,0.002387,0.00283,0.002372,0.001409,0.000713,0.00147,0.001981,0.001174,0.000867,0.002444,0.003794,0.002085,0.001922,0.001474,0.003108,0.002432,0.001927,0.001018,0.002207,0.002697,0.002281,0.000975,0.000536,0.00292,0.002417,0.001592,0.00062,0.001911,3e-04,0.001195,0.001293,0.003758,0.003968,0.004817,0.005394,0.005092,0.002704,0.001696,0.000766,0.002479,0.003114,0.003453,0.001769,0.001099,0.000144,0.002583,0.003149,0.000419,0.000943,0.001065,0.002473,0.002991,0.001401,0.002859,0.00484,0.003192,0.002372,0.001662,0.002563,0.002532,0.001711,0.002372,0.000688,0.001923,0.002186,0.001231,0.001939,0.00122,0.000664,0.000634,0.001346,0.001562,0.000895,0.000787,0.000991,0.001007,0.000863,0.001461,0.001698,0.001297,0.000285,0.000795,0.000842,0.000508,0.001199,0.000281,0.000131,0.001047,0.001355,0.002013,0.001109,0.000782,0.001532,0.001169,0.00066,0.000291,0.001518,0.001044,0.001086,0.001832,0.001846,0.001686,0.000785,0.00181,0.001256,0.000257,0.000625,0.000341,0.000159,0.00075,0.00067,0.001281,0.001118
0.000301,0.000594,0.000563,0.001886,0.000538,0.000726,0.001445,0.001692,0.003039,0.003299,0.000993,0.000711,0.001411,0.000137,0.001385,0.001055,0.000972,0.000707,0.001486,0.001402,0.001149,0.000884,0.001916,0.002287,0.001255,0.002277,0.000457,0.001098,0.001265,0.002394,0.002755,0.000681,0.000945,0.001236,0.00152,0.000449,0.001216,0.00179,0.001703,0.001277,0.00194,0.001029,0.001783,0.002108,0.001567,0.000653,0.000992,0.000744,0.00127,0.000716,0.001033,0.000393,0.001071,0.00267,0.000425,0.000576,0.001128,0.001687,0.001055,0.001514,0.001662,0.002402,0.001418,0.001247,0.000522,0.000857,0.001326,0.000702,0.000956,0.001804,0.000982,0.001981,0.001315,0.000503,0.001852,0.001998,0.000917,0.000451,0.001456,0.000576,0.000681,0.000827,0.001277,0.001341,0.001168,0.000818,0.001102,0.000205,0.001142,0.001358,0.000369,0.000179,0.00084,0.000388,0.000575,0.000311,0.000831,0.000512,0.000284,0.000322,0.001141,0.00208,0.001008,0.00046,0.000631,0.000408,0.000603,0.000351,0.000807,0.001127,0.000582,0.000777,0.00081,0.000247,0.000954,0.001304,0.000524,0.000753,0.000551,0.000763,0.000133
0.000452,0.000662,0.000739,0.001115,0.001367,0.001373,0.001285,0.001574,0.000929,0.001749,0.001253,0.00023,0.00059,0.000512,0.000976,0.001243,0.001884,0.001496,0.000277,0.001136,0.001394,0.001464,0.002553,0.001472,0.001836,0.001277,0.001286,0.000275,0.00036,0.001301,0.002253,0.001786,0.001206,0.00105,0.000436,0.000671,0.001335,0.001392,0.002236,0.002045,0.001578,0.001545,0.001001,0.001294,0.001594,0.001451,0.001232,0.000943,0.000282,0.000482,0.001256,0.000804,0.000923,0.000415,0.000188,0.000985,0.000988,0.000542,0.00143,0.001931,0.002305,0.000732,0.000815,0.000347,0.000553,0.000734,0.000549,0.000862,0.001214,0.001211,0.001502,0.002467,0.001796,0.001707,0.000864,0.001039,0.00095,0.000627,0.000897,0.001084,0.001065,0.000713,0.000953,0.001209,0.001165,0.0014,0.000505,0.000459,0.001025,0.000701,0.000679,0.000777,0.000704,0.000751,0.000967,0.000593,0.000384,0.000615,0.000424,0.000573,0.001038,0.000708,0.000654,0.000337,0.000193,0.000615,0.000603,0.000276,0.000387,0.000502,0.000825,8.1e-05,0.000639,0.00087,0.001114,0.000835,0.000692,0.000807,0.000876,0.000627,0.000789
0.000415,0.000475,0.000356,0.000217,0.000225,0.000445,0.000121,0.000583,0.00038,0.000323,0.000498,0.000458,0.000234,0.000329,0.000539,0.000388,0.00096,0.00074,0.000331,0.000744,0.000618,0.000547,0.001339,0.000617,0.001005,0.000344,0.000637,0.000413,2.1e-05,0.000914,0.000641,0.000588,0.00094,0.000159,0.000133,0.000459,0.000442,0.001208,0.00075,0.000965,0.000141,0.000573,0.000928,0.000538,0.000631,0.000575,0.000278,0.000688,0.000587,4.5e-05,0.000372,0.000341,0.00094,0.00067,9.5e-05,0.000863,0.000238,0.000259,0.000396,0.000512,0.000912,0.000679,0.000626,0.000244,0.000328,0.000355,0.000605,0.000539,0.000524,0.000597,0.000889,0.000873,0.000754,0.000172,0.000601,0.000609,1.8e-05,1.4e-05,0.000539,0.000728,0.000106,0.00041,0.000239,0.000266,0.000296,0.000496,0.00034,0.00043,0.000303,0.000336,0.00039,0.000148,0.000221,0.00045,0.000302,0.000174,0.000105,0.000224,0.000406,0.000499,0.000295,0.000347,0.000201,0.000252,0.000554,0.000439,0.000427,0.000652,0.000591,0.000227,0.000321,0.000159,0.000592,0.000441,0.000298,0.000291,0.000406,0.000404,0.000395,0.000586,0.000704
0.000158,0.000286,0.000157,6.1e-05,0.000215,0.000127,8e-05,0.00017,5.2e-05,0.000415,0.000227,0.000348,9.5e-05,0.000347,0.000294,0.000274,0.00063,0.000294,2e-04,0.000403,0.000203,0.000354,0.000298,0.000114,0.000551,0.000243,0.000314,0.000124,7.4e-05,0.000514,0.000432,0.000707,0.000453,0.000189,0.000112,0.000314,8.3e-05,0.000643,0.000312,0.00071,0.000133,0.00053,0.000702,0.000323,0.000311,0.000264,0.00033,0.00024,0.00034,0.00021,1e-04,0.000247,0.000232,0.000355,0.000245,0.000429,0.00032,0.000182,0.00013,0.000459,0.000492,0.00023,0.000466,0.000123,0.000236,0.000265,0.00031,0.000334,0.000201,0.00049,0.000387,0.000703,0.000322,0.000167,0.000555,0.000213,2.2e-05,5.7e-05,0.000139,0.000175,0.000275,0.000249,0.000223,0.000102,0.000186,0.00024,6.7e-05,0.000132,0.000159,0.000233,0.000113,0.000185,5.4e-05,0.000364,9.5e-05,0.000146,0.000163,8.1e-05,0.000186,0.000267,0.000334,0.000181,8.6e-05,0.000184,0.000366,0.000149,0.000395,0.000301,0.00025,0.000179,0.000185,5.3e-05,0.000176,0.000304,0.000294,8.2e-05,9.3e-05,0.000271,0.00012,0.000426,0.000191
0.000262,0.000426,0.000139,0.000221,9.9e-05,0.000167,0.000241,0.00023,0.000124,0.000441,5e-05,0.000357,0.000281,0.000377,0.000163,4.8e-05,0.000515,0.000278,0.00013,0.000322,0.000356,0.000376,0.000473,0.000249,0.00049,0.000121,0.000293,0.000152,6e-05,0.000521,0.000352,0.000713,0.000533,0.00011,0.000229,0.000238,0.000105,0.000418,0.000382,0.000568,0.000104,4e-04,0.000292,0.00023,2.2e-05,0.000271,0.000192,0.000201,6.7e-05,0.000474,8.2e-05,0.000305,0.000475,0.000427,0.000208,0.000375,0.00031,0.000305,0.000118,0.000209,0.000193,0.000179,0.000176,0.000119,0.000303,0.000389,0.000286,0.000123,0.000175,0.000209,0.000156,0.000336,0.000116,0.00011,0.000468,0.00025,0.000229,0.000147,0.000216,0.000199,0.000369,0.000221,0.000251,6.5e-05,0.000337,0.000132,8.5e-05,0.000212,0.000239,0.000115,7.2e-05,0.000215,0.00015,0.000267,1e-04,0.000139,0.000177,0.000101,0.000146,0.000234,0.000203,0.000102,0.000225,2e-04,0.000204,8.7e-05,0.00039,0.000276,0.000252,8.6e-05,0.000146,4.7e-05,0.000291,0.000182,0.000205,0.000105,0.000227,8.9e-05,0.000217,0.000378,0.000321
0.000305,0.000277,3e-04,8.3e-05,0.000201,0.000653,0.000251,0.000245,0.000317,0.000256,0.000335,0.000229,0.00022,0.000141,0.000274,0.000206,0.000659,0.000357,0.000298,0.000138,0.000325,0.000516,0.001089,0.000715,0.000423,0.000407,0.000282,0.000146,0.000226,0.000262,0.000773,0.000706,0.000251,0.00029,0.000314,0.000291,0.000256,0.000403,0.000125,0.00048,0.000294,0.000313,0.000507,0.000448,0.000238,0.000141,0.000165,0.000598,0.000775,0.000463,0.000224,0.000562,0.000583,0.00022,0.000304,0.000366,0.000485,0.000403,0.000264,0.000218,0.000212,0.000156,0.000346,0.00015,0.000273,0.00031,0.000109,0.000337,7.4e-05,0.00011,0.000386,0.000136,0.000465,0.000189,0.000137,0.000432,0.000178,0.000102,0.000528,0.00043,0.000321,0.00011,0.000388,0.000248,0.000354,0.000424,0.000242,0.000204,0.000242,0.000119,9e-05,0.000167,0.000109,0.000254,0.000122,4.5e-05,0.000156,5.7e-05,8.2e-05,0.00026,0.000292,0.000301,0.000114,0.000104,0.000285,0.000189,0.000139,5.8e-05,7.7e-05,0.000261,9.3e-05,0.000159,0.000301,0.000234,9.2e-05,0.000116,0.000201,0.000291,0.00053,0.000357,0.000315
0.000161,0.000359,0.000242,0.000164,0.000176,0.000681,0.000138,0.000231,0.000404,0.000519,0.000593,0.00057,0.000303,0.000411,1.7e-05,0.000431,0.000356,0.00082,0.000444,0.000463,0.000248,0.000444,0.000402,0.00052,0.000866,0.000383,0.000548,0.000318,0.000131,0.000365,0.000159,0.000515,0.000638,0.000105,0.000583,0.000717,0.000603,0.000561,0.000131,0.000229,0.000451,0.000317,0.000634,0.000483,0.000266,0.000202,0.000136,0.000483,0.000423,0.000809,0.000359,0.000536,0.000275,0.000666,0.000726,0.000593,0.000369,0.000161,0.000239,0.000249,0.000104,0.000194,0.000685,6.5e-05,8.9e-05,0.000326,0.000442,7.9e-05,0.000239,0.000487,0.000286,0.000486,0.000432,0.000269,0.000384,0.000469,0.000345,0.000198,0.000507,0.000256,0.000255,0.000241,0.000213,0.000403,0.000199,0.000347,0.000266,8.9e-05,0.00017,0.00015,0.00017,0.000249,0.000202,0.000331,0.000218,8.4e-05,0.000182,0.000189,0.000154,0.000306,0.000183,0.000209,0.000182,0.000117,0.00033,0.000379,0.000206,0.000281,0.000199,0.000169,0.000192,0.000111,7e-05,0.00016,0.000161,7.3e-05,0.000212,0.000267,0.000387,0.000448,0.000423
0.000415,0.000114,0.000583,0.000544,0.000136,0.000593,0.00037,0.000152,0.000546,0.000622,0.000134,0.000374,0.000122,0.000436,0.000242,0.000565,0.000691,0.00062,0.000202,0.00025,0.000706,0.000262,0.000333,0.000165,0.000542,0.000301,0.000496,0.000456,0.000602,0.000582,0.000195,0.000483,0.000567,0.000437,0.00034,0.000499,0.000142,0.000192,0.000509,0.000632,0.000292,0.000225,0.000418,0.000299,0.000396,0.000701,0.000248,0.000266,0.000545,0.000748,0.000676,0.000353,0.00034,0.000174,0.000481,0.000252,0.000316,0.00041,0.000214,5.1e-05,0.000124,4.8e-05,0.000682,0.000517,0.00013,0.00027,0.000256,0.000251,7.6e-05,0.000475,0.000534,0.001085,0.000293,0.000101,0.000367,0.000434,9.3e-05,6.7e-05,0.000359,0.00027,0.000327,0.000218,0.000167,0.000383,0.000206,0.00037,0.000134,0.000202,0.000388,0.000311,0.000192,0.000278,0.000174,4.9e-05,4.2e-05,0.000245,0.000318,0.000256,0.000182,0.000297,0.000152,0.000336,0.00024,7.9e-05,6.7e-05,0.000445,0.000437,0.000423,0.000323,6.3e-05,0.000365,0.000112,0.000177,0.000246,0.000145,0.000162,0.000225,7.6e-05,4.2e-05,0.000306,0.000202
0.000594,0.00032,0.000418,0.001026,0.000555,0.000506,0.00045,0.000579,0.00049,0.000403,0.000376,0.000168,0.000213,0.000444,0.000203,0.000228,0.000226,0.000316,0.000183,0.000294,0.00024,0.000385,0.000374,4.7e-05,0.000299,0.000266,0.000378,0.000284,0.00063,0.000861,0.000492,0.00027,0.000193,0.000258,0.000539,0.000202,0.000273,0.000482,0.000521,0.000334,0.000208,0.000197,0.000438,0.000323,0.000445,0.00048,0.000318,0.00023,0.00039,0.000243,0.000387,0.00014,0.000355,0.000673,0.000308,0.000353,0.00034,0.000257,0.000193,0.000107,0.000273,0.00038,0.000806,0.000659,0.000583,0.000534,0.000209,0.000248,0.000139,0.000353,0.000186,0.000519,0.000439,0.000128,0.000331,0.000528,0.000346,0.000125,0.000555,0.000259,0.000523,0.000338,0.000171,9.5e-05,0.000198,0.000253,0.00048,0.000377,0.000376,0.00043,8.9e-05,0.000232,0.000261,6e-05,0.000113,0.00028,0.000362,0.000127,0.000203,0.000209,0.000111,0.000287,0.000404,0.00046,2.5e-05,0.000354,0.000296,7.5e-05,0.00033,0.000436,0.000428,0.00042,9.3e-05,7.8e-05,0.000189,0.000139,0.000195,0.000132,0.000265,0.000293,0.000205
0.000124,0.000317,0.000533,0.000393,0.00061,0.000419,0.000648,3e-04,0.000177,0.000638,0.00089,0.00051,0.000103,0.000591,0.000819,0.000682,0.000342,0.000216,6.5e-05,0.000296,0.000241,0.000288,0.000533,0.000421,0.000226,0.000228,0.000239,0.000516,0.000373,0.000376,0.000538,0.000142,0.000658,0.000283,2.7e-05,0.000163,0.000407,0.000591,0.000338,0.000719,0.000557,0.000465,0.000356,0.000384,0.000394,0.000722,0.000619,0.000151,0.000638,0.000451,0.000417,0.000562,0.000465,0.000204,0.00039,0.000438,6.4e-05,0.000158,0.000139,0.00031,0.000276,0.000221,0.00038,0.000209,0.000127,0.000658,0.000622,0.000528,0.000703,0.000523,0.000153,0.000536,0.000747,0.000284,0.000387,0.000537,4.7e-05,0.000118,0.000567,0.000242,0.000431,0.000466,0.000314,0.000198,0.000105,0.000306,0.00041,0.00021,0.000388,0.000507,0.000394,0.000321,0.000205,0.000411,0.000331,0.000204,0.000377,4.4e-05,0.000154,0.000374,0.000391,0.000504,0.000367,0.00015,0.000351,0.000332,0.000228,0.000158,0.00024,0.000263,0.000353,0.000209,0.000419,0.000224,0.000242,0.000263,0.000167,0.000111,0.000276,0.000521,0.00033
0.000368,0.000167,0.000138,0.000527,0.000608,0.000927,0.000921,0.000656,0.000531,9e-05,0.00052,0.000332,0.000294,0.00045,0.00021,0.000248,0.000155,0.000149,0.000475,0.000521,0.000289,0.000736,0.001082,0.000803,0.00062,0.000425,0.000395,0.000551,0.000608,0.000565,0.000555,0.000961,0.001066,0.000606,0.000418,0.000474,0.000138,0.000135,0.000303,0.000845,0.000428,0.000532,0.001042,0.00047,0.000333,0.000777,0.000626,0.000649,0.000692,0.000663,0.000626,0.000265,0.000327,0.000213,0.000653,0.000387,0.000493,0.000249,8.7e-05,0.000303,0.000288,0.000195,8.9e-05,0.000201,0.000529,0.000752,0.000438,0.00059,0.000825,0.000621,0.000457,0.000422,0.000381,0.000518,0.000193,4.2e-05,0.000357,0.000224,3.9e-05,0.000131,0.000341,0.000248,0.000159,0.00025,0.000146,0.000385,0.000373,0.000381,0.000392,0.000196,0.000153,6.7e-05,0.000325,0.000411,0.000359,0.00028,0.000213,0.000374,0.000137,0.000248,0.000523,2.4e-05,0.000148,0.00035,0.000351,0.000145,0.000508,0.000186,0.000189,0.000265,0.000344,0.000453,0.000167,0.000174,0.000284,0.00027,0.000341,0.000166,0.000146,0.000287,0.000359
8.9e-05,6.7e-05,0.000132,0.000589,5.7e-05,0.000525,0.000287,0.00025,4.7e-05,4.1e-05,0.000307,0.000217,0.00027,0.000216,0.000334,0.000183,0.000289,9.1e-05,0.000474,0.000546,0.000706,0.000893,0.000223,0.000475,0.000483,0.00025,0.000437,0.000137,8.2e-05,0.000306,0.000249,0.000657,4.6e-05,0.000222,0.000175,0.000267,0.000272,0.000181,0.000265,0.000344,7.8e-05,0.000469,0.000766,0.000357,0.000278,0.000657,0.000661,0.000412,0.000782,0.000347,0.00037,5e-04,0.000702,0.00061,0.000444,0.000186,0.000178,0.000244,0.000358,0.000128,0.000144,0.000213,0.000211,0.000429,0.000461,0.00016,0.000135,0.00043,0.000128,0.000296,0.000373,0.000431,0.000335,0.000406,0.000346,0.000127,0.000133,9.5e-05,0.000223,0.000228,4.8e-05,9.5e-05,0.000101,0.000145,0.000175,0.000338,0.000421,5.8e-05,0.000175,5.5e-05,6.9e-05,9.8e-05,0.000235,8.3e-05,4.7e-05,0.000129,0.000186,0.000203,0.000207,4.6e-05,0.000209,0.000296,0.000208,0.000304,0.000178,0.000219,0.000266,0.000184,0.000214,9.4e-05,0.000319,0.000222,0.000388,0.000506,0.000267,0.000323,0.000209,0.000282,0.000254,0.000232,0.000248
0.000117,0.000249,0.000286,0.000537,0.000572,0.000192,3.2e-05,0.000384,0.000256,0.000366,0.000152,0.000186,0.000104,0.000162,0.000205,0.000323,0.000229,0.000108,0.00033,0.000231,0.000276,0.000258,0.000444,0.000251,0.000167,0.000257,0.000163,9.2e-05,0.000345,0.000321,0.000316,0.000418,0.000336,0.000174,0.000159,0.000285,0.000197,0.000106,0.00017,0.000374,0.000202,0.000303,0.000483,0.000485,0.000332,0.000423,0.000301,0.000177,0.000246,0.00016,0.000227,0.000436,0.000275,0.000112,0.000162,0.000166,0.000238,0.00025,0.000131,5.6e-05,0.000182,7.8e-05,0.000119,0.000346,9.3e-05,0.000247,6.5e-05,0.000298,0.000308,0.000164,0.000156,4e-05,0.000248,0.000133,7.6e-05,0.000137,7.7e-05,7.8e-05,0.000237,0.000245,0.000263,7e-05,8.3e-05,0.000148,0.000139,9.5e-05,2e-04,0.000239,0.000244,0.000138,0.000106,0.000188,7.7e-05,0.000139,0.000114,0.000235,0.000137,0.000125,5.8e-05,0.000119,5.1e-05,9e-05,0.000106,0.000292,0.000289,0.000223,0.000215,9.2e-05,5.9e-05,0.000123,0.000159,0.000137,0.000279,0.000231,6.5e-05,0.000139,9.7e-05,0.000219,0.000127,0.000156,8.8e-05
2.3e-05,8.5e-05,7.5e-05,0.000112,7.7e-05,7.5e-05,5.6e-05,8.8e-05,0.00011,0.000139,0.000101,1.9e-05,4.2e-05,5.5e-05,0.000188,7.6e-05,2.1e-05,2.2e-05,0.000236,0.000123,7.6e-05,0.000128,9.8e-05,0.000158,8.7e-05,3.6e-05,2.1e-05,1.5e-05,0.000162,7.2e-05,2.7e-05,5.5e-05,3.1e-05,5.6e-05,8.6e-05,8.6e-05,0.000107,2.8e-05,0.000106,0.000169,9.5e-05,0.000104,0.000237,0.000181,8e-05,0.000189,3.2e-05,6.8e-05,0.000113,2.9e-05,0.000118,7.8e-05,0.000123,0.000122,2.9e-05,1.8e-05,9.5e-05,4.4e-05,3.3e-05,4.7e-05,9.8e-05,0.00013,4.3e-05,0.000152,8e-05,7.4e-05,5.6e-05,0.000116,0.000119,1.4e-05,5.6e-05,7.2e-05,7.9e-05,8.9e-05,8.9e-05,4.2e-05,3.9e-05,6.9e-05,6.1e-05,5.2e-05,5.3e-05,1.7e-05,1e-05,1.2e-05,1.5e-05,6.8e-05,6.9e-05,8.9e-05,1.1e-05,2.9e-05,7.6e-05,3.6e-05,6.5e-05,5e-05,7.6e-05,5e-05,5.4e-05,3.5e-05,3.3e-05,4.5e-05,4e-05,3.5e-05,5.3e-05,3e-05,5.1e-05,4.4e-05,7.9e-05,5.2e-05,6.1e-05,4.5e-05,5.5e-05,2.3e-05,6.2e-05,1.7e-05,5e-05,2.5e-05,2e-05,7.7e-05,5.5e-05,2.9e-05,1.2e-05
3.3e-05,4.2e-05,4.9e-05,5.8e-05,8.9e-05,7.1e-05,0.000127,8.7e-05,6.9e-05,0.000165,6e-06,6.7e-05,6.2e-05,3.2e-05,0.000117,0.000114,0.000118,2.6e-05,0.000207,4.6e-05,0.000123,0.000133,8.3e-05,8.5e-05,9.2e-05,2.2e-05,7.2e-05,1e-05,5.4e-05,7e-06,9.3e-05,6.2e-05,0.000122,4.7e-05,5.9e-05,3.3e-05,7.1e-05,0.000122,0.000109,0.000132,3e-05,0.000104,0.00029,4.9e-05,9.9e-05,5e-05,5e-06,5.8e-05,0.000126,6.7e-05,7.3e-05,5.6e-05,0.000112,6.1e-05,7.1e-05,3.8e-05,7.5e-05,5.5e-05,6e-05,7.7e-05,0.000154,7.1e-05,5.5e-05,0.000115,6.5e-05,3e-05,2.3e-05,0.000149,4.1e-05,7.2e-05,0.000117,4.9e-05,6.7e-05,2e-05,5.8e-05,2e-05,1.7e-05,0.000117,5.3e-05,6.3e-05,5.9e-05,1.2e-05,8e-06,1.2e-05,1.4e-05,8.7e-05,5.5e-05,1.8e-05,1.6e-05,2.3e-05,8.8e-05,8.1e-05,3.4e-05,4.7e-05,4.7e-05,5.2e-05,6.7e-05,6.3e-05,2.3e-05,4.8e-05,3e-05,4.5e-05,1.3e-05,3.2e-05,1.9e-05,6.8e-05,6.7e-05,2.8e-05,5.6e-05,8e-06,3.2e-05,1.4e-05,8e-05,4.1e-05,3.1e-05,8e-06,4.9e-05,3.4e-05,5.8e-05,3.5e-05,5.4e-05
3.6e-05,0.000111,6.4e-05,3.8e-05,1.6e-05,7.4e-05,2.2e-05,6.1e-05,6.3e-05,0.000127,3.8e-05,0.000112,5.6e-05,0.000103,9.8e-05,2.4e-05,4.3e-05,8.3e-05,0.000121,6.6e-05,8.7e-05,8.2e-05,0.000161,6.2e-05,4.7e-05,5.1e-05,8.2e-05,6.1e-05,0.000104,5.3e-05,8.3e-05,9.5e-05,5.6e-05,2.9e-05,4.5e-05,7e-06,3.1e-05,7.2e-05,6.9e-05,0.000136,2.8e-05,7.9e-05,0.000172,9.5e-05,9.8e-05,0.000118,2.5e-05,4.5e-05,7.8e-05,3.5e-05,5.9e-05,9.3e-05,0.00017,0.000149,7.1e-05,1.4e-05,2.8e-05,0.000104,6.3e-05,9.2e-05,0.000124,7.1e-05,4.1e-05,6.2e-05,6.1e-05,3.7e-05,1.2e-05,7.9e-05,3.1e-05,7.1e-05,6.8e-05,0.000177,7.8e-05,7.8e-05,9.9e-05,3.9e-05,5.3e-05,5.5e-05,8.1e-05,4.4e-05,2.6e-05,8e-06,1.1e-05,2.4e-05,5e-05,6.5e-05,5.5e-05,6.1e-05,4.6e-05,2.5e-05,5.7e-05,1.9e-05,3.1e-05,7e-06,6.1e-05,5.8e-05,3e-05,4e-05,3.2e-05,3.3e-05,3.6e-05,1.8e-05,1.7e-05,2.5e-05,4.2e-05,1.8e-05,6.2e-05,2.7e-05,6e-05,6.3e-05,5.1e-05,3.4e-05,4.5e-05,2.4e-05,4.5e-05,2e-05,3.9e-05,2e-05,2.8e-05,4.6e-05,4.5e-05
0.000138,6.9e-05,4.6e-05,1.2e-05,2.7e-05,7.7e-05,4.5e-05,5.8e-05,3.7e-05,1e-04,7.3e-05,2e-04,0.000104,5.2e-05,0.000107,4.9e-05,1.7e-05,6.6e-05,0.00011,3.1e-05,6.1e-05,3.5e-05,0.000239,0.000181,5e-05,2.6e-05,4.3e-05,3.8e-05,9e-05,6.2e-05,1.9e-05,6e-05,9.5e-05,6.8e-05,1.6e-05,4.9e-05,4e-05,4.6e-05,8.9e-05,5.8e-05,8.2e-05,0.000123,0.00014,2.5e-05,5.5e-05,3.9e-05,6.8e-05,5.5e-05,1.7e-05,6e-05,0.000115,6.9e-05,9.2e-05,9.3e-05,7.4e-05,4.1e-05,2.3e-05,9.7e-05,0.000107,0.000101,0.000127,1e-05,5.2e-05,5.1e-05,6.7e-05,2.4e-05,3.6e-05,7.1e-05,5.3e-05,7.7e-05,3.6e-05,7.4e-05,1.8e-05,5.2e-05,0.000122,9.5e-05,3.6e-05,1.6e-05,1.8e-05,3.3e-05,3.4e-05,6.1e-05,1.3e-05,6.3e-05,2.9e-05,6.3e-05,6.5e-05,4.3e-05,1.2e-05,8.1e-05,3.5e-05,7e-06,5.9e-05,5.2e-05,5.1e-05,2e-05,6.7e-05,1.1e-05,1.3e-05,1.8e-05,4.9e-05,2.4e-05,5e-05,1.8e-05,5.8e-05,3.4e-05,3.8e-05,9e-06,5.1e-05,5.2e-05,6e-06,2.8e-05,1.6e-05,2.9e-05,3.2e-05,6e-06,1.7e-05,2.8e-05,2.3e-05,4.2e-05,2.4e-05
3.7e-05,4.4e-05,4.5e-05,9.9e-05,2.8e-05,7.8e-05,5e-05,4.9e-05,3.3e-05,8.4e-05,5.9e-05,9e-05,5.6e-05,7.7e-05,0.000119,5.5e-05,5.1e-05,6.5e-05,7e-06,0.000176,9.8e-05,1.2e-05,0.000105,4.3e-05,3.6e-05,6.4e-05,3.5e-05,4.5e-05,5.6e-05,2.6e-05,8.5e-05,9.3e-05,2e-05,9.6e-05,5.7e-05,6.9e-05,2.5e-05,8.4e-05,8.5e-05,0.000172,4.6e-05,4.5e-05,7.7e-05,5.5e-05,7.7e-05,8.7e-05,6e-05,8.5e-05,7.6e-05,4.1e-05,6.4e-05,0.000103,6.7e-05,0.000114,9.4e-05,6.1e-05,5.1e-05,5.1e-05,3.1e-05,5.9e-05,7.4e-05,0.000134,2.7e-05,6.8e-05,9e-06,5.1e-05,3.6e-05,4.7e-05,7.6e-05,5.2e-05,5.1e-05,8.8e-05,3.6e-05,6.7e-05,0.000162,0.000118,5.9e-05,5.7e-05,2e-05,1e-05,4.4e-05,8.6e-05,0.000124,2.4e-05,2.2e-05,4.9e-05,3.4e-05,5.7e-05,4.5e-05,0.000121,2.9e-05,4.2e-05,8.4e-05,2.5e-05,4.9e-05,3.9e-05,8e-05,3.2e-05,7e-06,1.7e-05,3.6e-05,5.4e-05,2.8e-05,4.4e-05,4.3e-05,3.6e-05,5.6e-05,3.3e-05,4.6e-05,3.3e-05,4.3e-05,4.9e-05,2.6e-05,2.8e-05,1.4e-05,4.9e-05,3.3e-05,1.6e-05,4.2e-05,1.9e-05,2.9e-05
0.000124,0.00018,9e-06,7.9e-05,2.4e-05,4.4e-05,2.6e-05,9.7e-05,5e-05,5.8e-05,1.7e-05,6.4e-05,2.9e-05,0.000109,8.1e-05,0.000111,0.000117,0.000116,3.3e-05,0.000132,5.7e-05,3.6e-05,7.3e-05,0.00011,0.000102,6e-05,3.6e-05,7.6e-05,5.3e-05,1.6e-05,0.000103,7.5e-05,9.1e-05,6.5e-05,5.2e-05,9.1e-05,9.5e-05,0.000121,5.7e-05,0.000117,6.3e-05,7.6e-05,0.000166,7.8e-05,0.00014,7.1e-05,3.1e-05,0.000102,9e-05,8.4e-05,0.000119,0.00013,6.6e-05,8.1e-05,0.000134,1.6e-05,2.9e-05,0.000129,0.00013,3e-05,3e-06,2.1e-05,4.1e-05,9.1e-05,7.6e-05,5.7e-05,4.1e-05,3.7e-05,6.2e-05,8e-05,5.5e-05,0.000115,7.2e-05,3.8e-05,0.000169,5.3e-05,9e-06,3.5e-05,3.5e-05,8.4e-05,3.1e-05,5.9e-05,7.7e-05,0.000113,2.8e-05,5.5e-05,1.4e-05,7e-06,3.1e-05,7.1e-05,4.7e-05,5.4e-05,3.9e-05,6.9e-05,1e-04,4.1e-05,4e-05,5.9e-05,4.9e-05,4.3e-05,5.6e-05,5.8e-05,3.5e-05,5.3e-05,5.4e-05,1.8e-05,0.000105,3.1e-05,4.1e-05,6e-05,7.1e-05,3.7e-05,6e-06,1.8e-05,2.8e-05,3.1e-05,2.1e-05,1.7e-05,2e-05,1.4e-05,1.2e-05
5.6e-05,0.000242,0.000202,9.1e-05,6e-05,5e-05,6.9e-05,8.8e-05,7.3e-05,9.9e-05,4.5e-05,0.000106,0.000109,8.7e-05,7.7e-05,0.000109,0.000119,0.000105,0.000116,8e-05,0.000111,0.000101,0.000206,8.6e-05,0.00015,0.000156,0.000128,2.1e-05,3.8e-05,5.5e-05,8.9e-05,0.000127,0.000115,6.7e-05,0.000148,0.000193,0.000201,0.000139,0.000114,0.000154,8.5e-05,0.00011,0.000214,6.7e-05,0.000171,0.000196,0.000169,8.6e-05,0.00017,5.6e-05,0.000151,0.000141,0.000141,0.000204,0.000173,6e-05,0.000103,0.000273,0.000185,0.000157,6.7e-05,0.000139,0.000135,0.00012,5.7e-05,0.000103,7.4e-05,2.9e-05,5.3e-05,0.000125,6.8e-05,0.000177,8.1e-05,6.4e-05,0.000115,0.00011,7.4e-05,9e-05,9.1e-05,0.000162,0.000116,4.1e-05,1.5e-05,7.4e-05,1.1e-05,7.6e-05,3.9e-05,2.2e-05,5.1e-05,2.3e-05,9e-06,4e-05,8e-06,5.9e-05,5.8e-05,7.9e-05,1e-05,6.5e-05,4.3e-05,2.5e-05,5.7e-05,1.3e-05,1.5e-05,6.7e-05,3e-05,4e-05,0.000127,6.6e-05,8.3e-05,6.3e-05,3.2e-05,3.6e-05,7.5e-05,9.3e-05,2.5e-05,4.2e-05,2.8e-05,2e-05,4.6e-05,2.4e-05,2.2e-05
2e-05,0.000316,0.00021,0.000189,5.8e-05,0.000208,0.000129,0.000127,0.00027,8.5e-05,7.2e-05,8.5e-05,8.5e-05,0.000103,0.000137,0.000224,0.000243,0.000167,0.000321,0.000302,5.5e-05,1.2e-05,0.00028,9.7e-05,0.000152,8.3e-05,0.000231,0.000196,0.000219,0.000229,0.000173,2.6e-05,0.000177,4.9e-05,0.000106,0.000199,9.2e-05,0.000136,1e-05,0.000161,0.000125,0.000156,0.000228,0.000119,3.6e-05,5.7e-05,0.000148,0.000167,0.000291,0.000268,0.000292,0.000235,0.000142,0.000106,0.000257,0.000164,0.000123,0.000198,0.000209,0.000237,0.000163,0.000264,0.000101,2.6e-05,9.9e-05,8.6e-05,4.4e-05,0.000147,7.3e-05,0.000238,0.00022,0.000165,0.00012,3.9e-05,0.000133,7.1e-05,8.2e-05,0.000102,0.000255,0.000218,4.1e-05,5.3e-05,0.000116,0.000122,6e-06,0.000116,1e-05,4.7e-05,3.4e-05,0.000114,4.2e-05,0.000108,9.7e-05,2e-04,0.000109,6.2e-05,2.9e-05,0.000119,7.4e-05,8.9e-05,4.2e-05,6e-05,1.8e-05,0.000157,0.000104,1.7e-05,0.000125,5.8e-05,0.000128,8.9e-05,5e-05,5.6e-05,6.6e-05,8.4e-05,4.4e-05,8.7e-05,2.6e-05,6.2e-05,2.7e-05,4.1e-05,2.8e-05
5.2e-05,0.000302,0.000196,0.000178,0.000233,0.000196,0.00025,0.00039,8.9e-05,0.000324,0.000315,0.000172,0.000129,3e-04,7.4e-05,0.000163,5.6e-05,0.000128,0.000308,0.000273,0.000162,0.000125,0.000304,0.000232,0.000121,0.000243,0.000377,0.000279,0.00013,0.00018,0.000256,0.00029,0.00022,0.000204,0.000111,0.000173,3e-05,0.000224,0.000148,0.000243,0.000188,0.000133,0.000183,0.000115,0.000134,0.000102,0.000255,0.000405,0.000208,4.2e-05,0.000242,0.000171,0.000306,0.000151,0.000255,0.000363,0.000378,0.000375,0.000431,0.00015,8.9e-05,0.000164,0.000391,0.000264,8.4e-05,0.000201,0.00022,0.000313,0.000315,0.000179,0.000205,0.000379,0.000344,0.000336,0.000174,4.6e-05,0.000104,0.000168,0.000221,0.000318,0.000319,0.000217,0.000151,0.00033,0.000267,0.000264,0.000265,0.000198,0.000128,0.000171,9.4e-05,0.000172,8.3e-05,0.000235,0.000167,0.000161,0.000126,0.000134,0.000118,6e-05,8.5e-05,5.8e-05,7.3e-05,0.000255,0.000141,1.6e-05,7e-06,7.3e-05,0.000129,0.000187,0.000151,5.8e-05,5e-05,0.000111,5.4e-05,0.000104,0.000121,8.6e-05,5.2e-05,0.000102,5.6e-05
5.6e-05,0.000242,0.000176,0.000114,0.000101,0.000275,0.000117,0.000258,0.000344,0.000309,0.000191,0.000152,0.000164,0.00035,0.000338,0.000129,0.000109,8.6e-05,0.000194,0.000334,0.00043,0.000108,0.000139,9.4e-05,0.000147,0.000105,0.000168,8.5e-05,0.000221,0.000193,0.000281,0.000128,9.8e-05,0.000117,0.00022,0.000353,0.000304,0.000271,0.000187,0.000117,2e-05,0.000245,4e-04,8.8e-05,0.00016,8.4e-05,0.000352,0.000263,0.000304,0.000209,0.000254,0.000263,0.000239,0.00016,0.000279,0.000214,0.000201,0.000119,0.00024,0.000166,7.1e-05,8.7e-05,0.000366,0.000148,0.000103,0.000178,0.000278,0.000296,0.000131,0.000394,0.000129,0.000236,0.000151,0.000146,0.000255,0.000108,0.000122,0.000122,0.000155,0.000162,0.000118,0.000111,0.000213,0.000341,0.000376,0.00013,0.000323,0.000151,0.000173,0.00015,8.4e-05,0.000146,0.000133,0.000271,0.000143,0.000168,8.5e-05,4.2e-05,5e-06,0.000113,7.5e-05,3.3e-05,6.8e-05,0.00019,0.000126,7.6e-05,0.000119,0.00011,0.000122,6.4e-05,3.5e-05,2e-05,3.6e-05,2.1e-05,1e-06,0.000133,0.000166,6e-05,0.00016,3.5e-05,6.5e-05
6.8e-05,0.000115,6.7e-05,6.5e-05,1.9e-05,0.000183,0.000196,0.000176,0.000125,0.000176,0.000176,5.7e-05,9.3e-05,0.000182,8.8e-05,9.2e-05,0.00015,0.000206,0.000176,0.000387,0.000188,0.000357,0.000129,0.000142,9.9e-05,0.000128,0.000152,0.000263,0.000257,0.000351,0.000244,0.00014,0.00017,0.000124,9e-05,0.000371,0.000184,5.8e-05,0.00013,0.000109,0.000265,0.000321,0.000127,0.000152,0.000338,0.000362,0.00025,0.00024,0.000128,0.000251,0.000494,0.000209,2e-04,0.00022,0.000112,0.000116,0.000175,0.000207,0.00011,4.1e-05,4e-05,7e-06,0.000246,0.000247,0.000129,0.000215,3.5e-05,0.000325,0.000195,0.000347,0.000218,0.000199,0.000112,0.000152,0.000272,0.000169,0.00017,0.00018,0.000312,0.000236,3.1e-05,6.6e-05,0.000249,9e-05,0.000169,0.000169,0.00018,0.000135,0.000291,0.000226,0.000126,7.9e-05,0.000211,1e-04,0.000127,7.4e-05,0.000123,6.8e-05,7.7e-05,0.000125,6.2e-05,2.9e-05,9.6e-05,0.000178,0.000146,0.000101,0.000223,0.000212,0.000115,5.7e-05,9.4e-05,2.2e-05,5.7e-05,0.000102,4.6e-05,0.000117,3.1e-05,8e-05,0.000216,0.000131,0.000123
0.000112,2.4e-05,2.6e-05,0.000117,0.000133,1e-04,0.000223,0.000268,0.000214,0.000146,0.000175,0.000118,7.2e-05,0.000177,0.000106,0.000183,0.000272,0.000376,0.000182,7.3e-05,7.6e-05,0.000269,0.000252,6.8e-05,0.000184,0.000227,0.000339,0.000119,0.000183,1e-04,0.000133,0.000189,0.000287,0.000289,0.000275,0.000351,0.000224,6.2e-05,0.000137,6.6e-05,0.000257,0.000225,0.000173,0.000194,0.000404,4e-04,0.000461,0.000382,0.000233,0.00022,0.000243,0.000182,0.000286,7e-05,2.6e-05,0.000241,0.00015,0.000116,0.000162,0.000127,0.00012,0.000106,0.00015,0.000155,0.00019,0.000169,0.000118,0.000183,0.000128,0.00023,9.7e-05,0.000151,0.000152,0.000104,0.000164,0.000154,1.1e-05,0.000191,0.000121,9.8e-05,0.000205,0.000197,0.00017,0.000118,5.9e-05,5e-05,0.000114,3.9e-05,0.000242,0.00023,9.7e-05,0.000113,0.000121,0.000161,9.9e-05,2.5e-05,0.000107,4.9e-05,4.8e-05,3.3e-05,4.4e-05,1.9e-05,9.7e-05,0.000138,0.00012,0.000158,0.00031,0.000137,3e-05,3.4e-05,7.2e-05,8.2e-05,8e-05,0.000185,0.000145,0.000144,0.000109,1e-04,9e-05,4.9e-05,1.2e-05
6.1e-05,0.000102,0.000141,7.3e-05,4.4e-05,0.000274,0.000105,0.000108,0.000223,5.7e-05,7.5e-05,8.3e-05,0.000179,2.3e-05,2.9e-05,0.000225,0.000346,5.5e-05,0.000205,5.3e-05,9.6e-05,0.000118,0.000167,0.000134,0.000178,0.00028,6.6e-05,4.6e-05,5.7e-05,0.000171,0.000141,3.9e-05,0.000153,0.000124,0.000163,0.000227,0.00021,0.000143,4.9e-05,0.000119,0.000218,0.00017,9.9e-05,0.00012,0.000211,0.000161,0.000268,9.6e-05,0.000157,0.000193,0.000234,0.000148,8.1e-05,3.1e-05,7.2e-05,0.000197,0.000139,6.4e-05,0.000124,0.000154,0.000307,0.000237,0.000267,9.9e-05,0.000215,0.00012,0.000166,3.2e-05,0.000127,8.8e-05,7.4e-05,5.9e-05,6.9e-05,8.8e-05,4.1e-05,3.7e-05,2e-05,9.7e-05,0.000105,0.000115,8.4e-05,0.000105,0.000104,6.8e-05,4.4e-05,0.000112,0.000108,8.9e-05,7.1e-05,4e-05,4.4e-05,8.2e-05,0.000106,6.7e-05,6.6e-05,9.5e-05,9.7e-05,1.7e-05,5.6e-05,8.2e-05,3.7e-05,5.3e-05,7e-05,4.1e-05,0.000106,0.000131,9.5e-05,5.7e-05,5.4e-05,0.000125,3.9e-05,2.8e-05,5e-05,8e-05,3.2e-05,6.6e-05,2.1e-05,3.8e-05,7.3e-05,2.3e-05,1.6e-05
0.000118,5.9e-05,0.00014,8e-05,8.8e-05,0.000238,0.000172,0.000124,0.000174,0.00017,5.2e-05,9.9e-05,7.7e-05,6.6e-05,4.2e-05,0.000156,0.000186,0.000161,0.000183,0.000184,0.00019,1e-05,0.000159,0.000143,8.4e-05,0.000203,0.000151,0.000187,0.000166,0.000179,0.00012,6e-06,0.00013,7e-06,6.7e-05,0.000201,0.000154,0.000148,0.000123,0.000272,8.6e-05,0.000222,0.000242,0.000235,0.000132,0.000161,9.9e-05,0.000119,6.7e-05,0.000146,0.000196,7.4e-05,0.000206,0.000117,0.000118,0.000131,8.3e-05,0.000124,0.000165,0.000113,9.2e-05,6.3e-05,0.000129,0.000201,4e-05,6.4e-05,9.5e-05,0.000107,0.000195,6.1e-05,5.3e-05,4e-05,3.6e-05,0.000136,2.8e-05,4.8e-05,3.8e-05,4.1e-05,3.1e-05,0.000118,7.6e-05,0.000118,0.000104,3.8e-05,2.1e-05,4.6e-05,8.9e-05,0.000128,1.7e-05,4.1e-05,3.8e-05,5.1e-05,9.3e-05,6.5e-05,2.4e-05,6.8e-05,7.3e-05,8.6e-05,1.3e-05,7e-05,5.5e-05,4.7e-05,0.000105,1.4e-05,4.1e-05,6.6e-05,9.8e-05,3.6e-05,4.4e-05,7.9e-05,5.8e-05,6.7e-05,8.5e-05,9.1e-05,2.9e-05,5.1e-05,3.7e-05,2.3e-05,5.5e-05,5.2e-05,3e-06
0.000198,0.00016,0.000189,0.000112,0.000169,0.000153,0.00021,0.000168,0.000226,9.4e-05,0.00012,0.00017,0.000214,0.000218,0.000245,0.000213,0.000228,0.00015,0.000118,0.00017,0.000207,0.000182,0.000156,0.000168,0.000178,0.00015,0.000162,0.000167,4.3e-05,0.000136,0.000142,0.000118,0.000146,9.5e-05,0.000126,0.000261,5.3e-05,6.7e-05,0.000105,0.000237,0.000388,4.4e-05,0.000156,0.000217,1e-04,0.000101,9e-05,7.1e-05,4.3e-05,0.000127,9.6e-05,0.000125,0.000351,0.000102,5.2e-05,0.000127,0.000132,0.000119,0.00025,0.000264,7.1e-05,9.5e-05,3.9e-05,0.000113,0.000118,0.000156,0.00013,9.1e-05,0.000198,7.8e-05,2.5e-05,9.4e-05,9e-06,0.000102,0.000158,6.9e-05,6.4e-05,9e-05,0.00014,5.7e-05,8.2e-05,9.4e-05,0.000116,4.3e-05,4.5e-05,4e-05,8.6e-05,0.000113,0.000126,3.5e-05,8.8e-05,5.8e-05,0.000102,9.7e-05,1.5e-05,5.6e-05,3.2e-05,0.000136,0.000122,8.8e-05,5.1e-05,9.1e-05,0.00014,1e-04,1.7e-05,4.6e-05,0.000123,1e-04,9e-06,4.6e-05,0.000125,4.8e-05,5.7e-05,2.8e-05,6.7e-05,7.6e-05,4.5e-05,3.7e-05,6.2e-05,6.1e-05,5.7e-05
0.000143,0.00011,9.4e-05,9.4e-05,8.8e-05,0.000162,0.000201,9e-05,0.000174,0.000249,0.000247,0.000272,0.000178,2.9e-05,0.000158,0.000104,0.000126,0.00013,6.8e-05,0.000166,4.1e-05,2.2e-05,0.000154,0.000109,0.000176,0.000107,9.9e-05,5.5e-05,6.8e-05,7.9e-05,0.000297,0.00037,0.000234,0.000212,0.000179,5.8e-05,0.000208,0.000106,0.000137,5.8e-05,0.000246,0.000177,0.000116,0.000156,0.000139,0.000111,0.000104,0.000128,0.000132,7.7e-05,0.00018,0.000208,0.000163,0.000264,5.6e-05,0.000127,0.000132,0.000123,0.000136,0.000192,0.000308,0.000175,5.2e-05,6.1e-05,7e-05,5e-06,0.000137,0.000122,0.00027,0.00024,0.000189,0.000201,0.000141,0.000186,0.000207,0.000179,9.1e-05,8.5e-05,0.00012,0.000168,2.5e-05,0.00014,0.000188,0.000115,0.000126,0.000161,0.000128,0.000222,0.000137,7.1e-05,0.000124,8.3e-05,6.4e-05,5.9e-05,0.000161,0.000121,0.000112,0.000115,5.5e-05,5.8e-05,6.3e-05,7e-05,9.9e-05,4.8e-05,3.2e-05,9.1e-05,3.6e-05,6.1e-05,6.5e-05,7.3e-05,0.00015,0.000182,5.9e-05,5.5e-05,8.7e-05,6.5e-05,8.5e-05,0.000121,8.4e-05,4.2e-05,1.1e-05
8.3e-05,0.000107,9.8e-05,0.000111,7e-06,0.00017,0.000107,4.9e-05,0.000207,0.000306,2e-04,0.000234,0.000165,6e-05,8e-05,1.4e-05,5.7e-05,6.6e-05,0.000148,0.000103,0.000117,0.000101,0.000156,0.000135,5.5e-05,0.000145,0.000279,0.000159,2.9e-05,0.000106,0.000178,0.000113,2.6e-05,0.00017,3e-05,7.1e-05,0.000122,9.2e-05,0.000132,7.3e-05,0.000193,0.000263,4e-04,0.000158,6.3e-05,0.000137,8.7e-05,0.000102,0.000221,0.000229,0.000131,0.000119,0.000185,0.000175,0.000225,8.9e-05,2.4e-05,5.3e-05,5.9e-05,0.00016,0.00014,8.3e-05,4.6e-05,8.8e-05,9.3e-05,3.1e-05,0.000153,0.000112,0.00011,8.4e-05,4.1e-05,0.000144,0.000124,0.000103,0.00013,0.000185,0.000107,4.6e-05,8e-05,0.000175,0.000124,9.7e-05,9.1e-05,1.9e-05,8.2e-05,9.8e-05,4.5e-05,0.000136,0.000143,0.000154,2.6e-05,5.5e-05,8e-06,2.7e-05,0.000152,0.000149,6.3e-05,2.5e-05,1.5e-05,3.1e-05,3.9e-05,5.9e-05,2.7e-05,4.1e-05,3.9e-05,9.1e-05,9.7e-05,7.9e-05,9e-05,3.2e-05,7.5e-05,0.000144,0.000136,0.000126,8.1e-05,7.2e-05,4.5e-05,5.3e-05,6.1e-05,4.8e-05,5e-05
2.5e-05,8.1e-05,6.2e-05,9e-05,8.6e-05,0.000105,5.2e-05,5.6e-05,0.000109,0.000121,4.7e-05,7e-05,8.8e-05,9.4e-05,3.8e-05,3.1e-05,5e-06,7.9e-05,9.2e-05,0.000115,0.000109,0.000136,0.000141,1.8e-05,6.3e-05,0.000123,0.000136,2.5e-05,9.8e-05,5.5e-05,9.3e-05,7.1e-05,2.9e-05,8.4e-05,5.8e-05,9.2e-05,7.8e-05,4.5e-05,3e-05,3.7e-05,8.9e-05,0.000204,0.000165,5.8e-05,5.4e-05,3.6e-05,3.6e-05,4.7e-05,0.000115,4.6e-05,8.5e-05,8.7e-05,4.4e-05,8.7e-05,9e-05,7.6e-05,6e-06,2.2e-05,3.5e-05,0.000152,4.3e-05,4.3e-05,4.2e-05,8.9e-05,5.7e-05,0.000139,9.4e-05,4.8e-05,5.6e-05,3.6e-05,2.9e-05,4.8e-05,4.1e-05,0.000105,9e-06,9.6e-05,4.7e-05,3.7e-05,8.4e-05,7e-05,4.7e-05,2.4e-05,4e-05,6.4e-05,2.8e-05,1.3e-05,2.8e-05,3.8e-05,9.7e-05,2.4e-05,3e-06,7.4e-05,3.6e-05,4.6e-05,7.9e-05,1.2e-05,1.4e-05,1.5e-05,1.2e-05,1.2e-05,2.9e-05,2.8e-05,2.3e-05,2.1e-05,4.5e-05,5.2e-05,1.5e-05,4.6e-05,2.5e-05,3.5e-05,6.3e-05,5e-05,3.2e-05,9.5e-05,2e-05,1.8e-05,3.1e-05,4.2e-05,2.8e-05,2.7e-05,1.6e-05
2.1e-05,8.3e-05,1.6e-05,9.7e-05,4.1e-05,5.6e-05,3.1e-05,5.7e-05,8.6e-05,9.7e-05,1e-05,4.4e-05,3e-05,4.8e-05,3.2e-05,3.2e-05,1.9e-05,5.9e-05,3.3e-05,4e-05,5.2e-05,3.8e-05,0.000108,7e-06,5.8e-05,7.7e-05,0.000112,1.8e-05,5e-05,5.3e-05,4e-05,2e-05,1.6e-05,5.5e-05,3.8e-05,5.1e-05,2.7e-05,6.8e-05,3.3e-05,2.2e-05,3.9e-05,0.000185,0.000113,3.4e-05,9.1e-05,2.8e-05,3.7e-05,3e-05,6.5e-05,2.3e-05,7.4e-05,3.1e-05,2.1e-05,3.2e-05,2.3e-05,2.5e-05,2.1e-05,2.6e-05,2.6e-05,7.9e-05,3.1e-05,3.2e-05,2.8e-05,4.5e-05,1.7e-05,9.8e-05,4.1e-05,1.6e-05,2.7e-05,3.2e-05,2.2e-05,8e-06,3e-05,9.6e-05,1.3e-05,7e-05,2e-05,1e-06,4.5e-05,1.2e-05,4e-05,9e-06,4e-05,2.6e-05,2.8e-05,9e-06,5e-06,2.1e-05,6.8e-05,5.4e-05,1.2e-05,6.1e-05,5e-06,1.9e-05,2.3e-05,3.1e-05,6e-06,1e-05,7e-06,7e-06,1.2e-05,1.9e-05,1.2e-05,1.5e-05,4.3e-05,4e-06,2.3e-05,2e-05,5.1e-05,3.1e-05,2.6e-05,3.3e-05,1.4e-05,6.9e-05,8e-06,8e-06,2.6e-05,2e-05,3.2e-05,2e-05,1.2e-05
1.9e-05,7.9e-05,8e-06,8.8e-05,3.5e-05,5.8e-05,4.1e-05,3.9e-05,7.3e-05,1e-04,1.4e-05,3.3e-05,1.1e-05,5.3e-05,3.5e-05,1.8e-05,3e-06,6.8e-05,5.5e-05,2.4e-05,1.9e-05,1.1e-05,0.000103,1.4e-05,5.3e-05,6.1e-05,9.9e-05,2.3e-05,3.9e-05,5e-05,1.3e-05,3.7e-05,5e-06,4.4e-05,5e-05,5.4e-05,3.7e-05,4.6e-05,1.6e-05,9e-06,2.4e-05,0.000154,0.000106,2.2e-05,6.3e-05,4.5e-05,2.7e-05,1.3e-05,5.3e-05,1.4e-05,5.5e-05,1e-05,3.1e-05,1.9e-05,5e-06,1.9e-05,6e-06,1.1e-05,2.5e-05,7.7e-05,2.8e-05,1.2e-05,2.1e-05,3.2e-05,1.4e-05,9.1e-05,3.3e-05,3.1e-05,9e-06,1.3e-05,1.3e-05,1.6e-05,3e-05,8.4e-05,1.7e-05,6.6e-05,1.3e-05,6e-06,3.4e-05,2e-05,3.6e-05,1e-05,3.9e-05,2.2e-05,1.7e-05,1.7e-05,7e-06,1.4e-05,5.7e-05,3.9e-05,5e-06,5.2e-05,4e-06,6e-06,9e-06,2.1e-05,1.5e-05,7e-06,7e-06,5e-06,1.6e-05,1.4e-05,9e-06,1.6e-05,4.2e-05,1.2e-05,5e-06,1.4e-05,4.3e-05,3e-05,1e-05,2.2e-05,6e-06,6.1e-05,1.3e-05,7e-06,2.7e-05,1.6e-05,2.7e-05,8e-06,1.1e-05
