5.5e-05,1.2e-05,0,7e-06,4.7e-05,8.3e-05,0.000154,6.3e-05,4.1e-05,0.000107,0.000118,4.4e-05,4e-06,3.9e-05,7.3e-05,4.7e-05,3.1e-05,3.8e-05,1.4e-05,5.4e-05,3.7e-05,6.7e-05,0.000145,3.9e-05,1.4e-05,1.6e-05,1.5e-05,8e-06,0.000155,0.000191,0.000231,0.000167,5.5e-05,0.000181,0.001108,0.000809,0.000332,6.4e-05,0.000976,0.000452,4.3e-05,0.000126,0.000485,0.000794,0.000356,0.000601,9.6e-05,0.000365,0.000123,1.8e-05,0.000729,0.000229,7.8e-05,0.000216,0.000567,0.000744,8.9e-05,9.5e-05,4e-06,0.000217,3.5e-05,7.2e-05,9e-05,1.5e-05,8.1e-05,0.000171,0.000187,1.4e-05,0.000174,2.7e-05,4.9e-05,7.5e-05,0.000115,8.7e-05,2.7e-05,2e-06,3.8e-05,0.000559,8.4e-05,3e-05,0.000147,0.00011,0.000264,0.000111,5.6e-05,2.9e-05,1.2e-05,4.8e-05,0.000133,1.6e-05,5e-05,2.6e-05,7e-06,3.7e-05,3.8e-05,2.8e-05,5.8e-05,7.4e-05,3.9e-05,7.8e-05,2e-05,5.6e-05,4.6e-05,9e-06,3.8e-05,0.000517,9.7e-05,0.000333,0.000304,4.2e-05,7.1e-05,7.9e-05,2.5e-05,3.2e-05,2.6e-05,2.4e-05,5.4e-05,3e-05,3.9e-05,2.6e-05,2.4e-05
0.000133,7.4e-05,7.6e-05,5.6e-05,0.000127,0.00011,0.000298,6.6e-05,0.000152,0.000111,0.000222,0.000152,9.1e-05,0.00013,0.000148,0.00021,0.000131,0.000109,7e-05,0.000117,0.000104,0.000237,0.000311,8.9e-05,0.000141,0.00015,2.9e-05,1e-05,0.000245,0.000327,0.000662,0.00077,0.000489,0.000838,0.001584,0.002509,0.001331,0.001611,0.002574,0.000749,0.000267,0.000449,0.001008,0.001152,0.001709,0.000693,0.000809,0.000623,0.000421,0.000547,0.001018,0.00058,0.000332,0.000327,0.000665,0.00132,0.000867,0.000948,0.000361,0.000437,0.000379,0.000301,0.000166,0.000286,0.000398,0.000723,0.000798,0.000532,0.000465,0.00014,8.1e-05,0.000133,0.000246,0.000154,0.000114,0.00029,0.000195,0.001065,0.000404,0.000359,0.000217,0.000348,0.00049,0.000541,0.000402,0.000298,0.000143,0.000122,0.000333,0.000268,0.000117,3.3e-05,3.4e-05,5.8e-05,1e-05,7e-05,0.000125,0.000231,0.000173,0.000183,0.000148,8.8e-05,0.000173,0.00012,0.000108,0.001019,0.000232,0.000329,0.000634,0.000316,0.000174,9.3e-05,0.00012,8.3e-05,9.9e-05,0.000141,8.3e-05,0.000138,4.8e-05,7.8e-05,2.3e-05
3.8e-05,5.2e-05,8.9e-05,5.8e-05,0.000128,8.6e-05,0.000327,9e-06,3.2e-05,0.000118,0.000144,7.9e-05,5e-05,0.000261,0.000146,2.7e-05,3.4e-05,2.4e-05,2.3e-05,8.5e-05,0.000167,0.000305,0.000217,0.000277,0.000194,0.000115,0.000103,6.6e-05,0.000239,0.000121,0.000465,0.000104,0.000166,0.001407,0.003652,0.003172,0.002526,0.001036,0.001019,0.002299,0.001257,0.000614,0.000515,0.000954,0.001449,0.000628,0.000434,0.000463,0.001507,0.001232,0.002118,0.000212,0.000632,0.000546,0.001069,0.000866,0.000392,0.000463,0.000371,0.00132,0.001083,0.000818,0.000817,0.00054,0.000409,0.000606,0.000194,0.000306,0.000119,0.000587,0.000477,0.000324,0.000231,0.000231,0.000295,0.00043,0.000355,0.00064,0.001423,0.001199,0.000496,0.000493,0.000719,0.000526,0.000118,5.5e-05,4.9e-05,6.7e-05,0.000239,0.000112,8.3e-05,3.6e-05,2.5e-05,5.7e-05,7.4e-05,5.6e-05,8.4e-05,6.3e-05,4.9e-05,2.6e-05,3.5e-05,0.000219,0.000132,4.9e-05,6.1e-05,0.001338,0.000797,0.000601,0.000322,6.5e-05,8.9e-05,4.6e-05,2.4e-05,6.1e-05,2.2e-05,7.9e-05,1.8e-05,5.8e-05,6.7e-05,0.000105,9.2e-05
5.9e-05,4.9e-05,9.4e-05,3.6e-05,0.000149,0.00019,0.000425,8.1e-05,8.7e-05,0.000153,0.000215,7.3e-05,0.000157,0.000444,0.00028,0.000109,5e-05,4.2e-05,2.4e-05,8e-05,2.8e-05,0.000275,0.000283,0.000641,0.000339,0.00024,1e-04,2.7e-05,0.000303,0.000354,0.000605,0.00033,0.000406,0.001188,0.0034,0.000923,0.002563,0.002507,0.002282,0.002349,0.001293,0.001764,0.002327,0.000773,0.000693,0.000827,0.000214,0.001005,0.002413,0.000268,0.002941,0.001164,0.000109,0.000162,0.001383,0.000392,0.001306,0.001532,0.000449,0.001111,0.001176,0.000871,0.000595,0.000505,0.001348,0.001124,0.000757,0.000413,0.000272,0.000725,0.000103,0.000444,0.000539,0.000121,0.000505,0.000631,0.000229,0.000773,0.0023,0.000941,0.000358,0.000572,0.001158,0.000769,0.000376,9.1e-05,3.4e-05,0.000113,0.000152,0.000209,5e-05,8.6e-05,8.8e-05,9.1e-05,6.4e-05,0.000122,5.4e-05,2.3e-05,8e-05,7.7e-05,4.3e-05,0.000382,0.00028,0.000134,6.9e-05,0.001549,0.001097,0.000575,0.001318,0.000753,0.000303,0.00013,0.000111,6.5e-05,3.8e-05,6.2e-05,2.2e-05,1.8e-05,8.4e-05,8e-05,2.7e-05
3.4e-05,6e-06,6.6e-05,3.1e-05,0.000147,0.00019,0.000461,0.000126,7.1e-05,0.000208,0.00027,5.3e-05,0.000168,0.000331,0.000101,5.3e-05,7.2e-05,1e-05,3.8e-05,0.000111,0.000327,0.00027,0.000167,0.001106,0.000566,0.000222,0.000246,0.000143,0.000353,0.00051,0.000425,0.000235,0.000313,0.00074,0.004416,0.003215,0.00106,0.000554,0.002739,0.001275,0.001618,0.002841,0.000912,0.001454,0.001182,0.001933,0.000923,0.000917,0.001417,0.001469,0.003233,0.003151,0.002058,0.000778,0.001898,0.001993,0.001112,0.00159,0.000948,0.000239,0.001907,0.000126,0.000221,0.000859,0.003023,0.001593,0.000977,0.000724,0.000401,0.000909,0.001016,0.000249,0.000412,0.000203,0.000698,9.1e-05,0.000198,0.000622,0.001608,0.001383,0.000674,0.000206,0.000819,0.000451,0.000229,0.000146,0.000104,0.000144,0.000196,5.1e-05,1e-04,7.5e-05,3.6e-05,6.5e-05,0.00012,0.000171,0.000126,2.8e-05,3.5e-05,2.7e-05,4.2e-05,0.000313,0.000217,0.00012,0.000101,0.001646,0.001019,0.000904,0.000912,0.000552,0.000383,4.9e-05,7.2e-05,1.7e-05,1.9e-05,1.3e-05,2.9e-05,4.6e-05,3e-05,4.4e-05,2.8e-05
6.6e-05,2.5e-05,1.6e-05,8.3e-05,0.000164,0.000193,0.000565,0.000249,0.000143,0.000246,0.000309,5.4e-05,0.000197,0.000107,0.000101,7.1e-05,1.3e-05,3e-05,3.9e-05,0.000136,0.000451,0.000567,0.000367,0.001352,0.000748,3e-04,0.000483,0.000212,0.000479,0.000615,0.000245,3.4e-05,0.000365,0.000232,0.005328,0.000256,0.001112,0.002137,0.002664,0.000454,0.001209,0.003334,0.00415,0.001072,0.000856,0.00146,0.001184,0.000593,0.001001,0.000879,0.000886,0.001829,0.001108,0.000804,0.0022,0.001143,0.001262,0.001476,0.000542,0.001703,0.001467,0.001504,0.001887,0.000761,0.004754,0.002174,0.001542,0.001264,0.001534,0.001517,0.000171,0.000498,0.000832,0.00041,0.000316,0.000451,0.00011,0.00054,0.000438,0.000532,0.000381,0.000144,0.001102,0.00066,0.000311,6.8e-05,6.4e-05,0.000223,0.000466,0.000113,8.8e-05,7.8e-05,4.7e-05,9.7e-05,4.3e-05,0.000129,8.6e-05,8.9e-05,5e-06,5e-06,4.3e-05,0.00023,9.8e-05,6.8e-05,5.1e-05,0.001675,0.000625,0.00256,0.00245,0.000992,0.000223,0.000156,0.000136,5.7e-05,4.2e-05,4.4e-05,3.6e-05,4.7e-05,3.4e-05,3.8e-05,5.8e-05
0.000121,9.4e-05,2.3e-05,0.000123,0.000111,0.00015,0.000891,0.000349,0.000191,0.000384,0.000417,0.000116,0.000243,8.3e-05,4.1e-05,5.3e-05,3.7e-05,6e-05,3.6e-05,0.000109,0.000337,0.000244,0.00042,0.001142,0.000662,7.3e-05,0.000127,0.00014,0.000575,0.000124,0.00013,0.000274,0.000627,0.000264,0.005247,0.005113,0.001382,0.002257,0.001692,0.002952,0.001485,0.003299,0.001807,0.00303,0.002643,0.000545,0.00063,0.002371,0.001151,0.000947,0.002956,0.003379,0.001979,0.00045,0.002198,0.002471,0.001069,0.000817,0.000948,0.002326,0.000444,0.002418,0.000941,0.002128,0.007757,0.004096,0.001772,0.001107,0.001689,0.000922,0.000559,6e-04,0.000394,0.000569,0.000643,9.4e-05,0.00021,0.000262,0.001565,0.00052,0.00036,0.000211,0.001211,0.000631,0.00028,0.000102,8.3e-05,0.000185,0.000756,0.000877,0.000348,0.000162,3.1e-05,0.000148,0.000109,0.000187,9.1e-05,6.9e-05,7.1e-05,2.3e-05,3.1e-05,0.000389,0.000152,4.7e-05,8.5e-05,0.001906,0.002453,0.003584,0.000947,0.000764,0.000728,0.000165,5.5e-05,1.1e-05,2.8e-05,8e-06,2.8e-05,5.2e-05,9.8e-05,3.8e-05,7.3e-05
0.000116,3.4e-05,9.8e-05,6e-05,0.000312,0.000355,0.001356,0.000842,0.000573,0.000776,0.000519,0.000186,0.000471,0.000406,0.000277,0.00017,9.7e-05,0.00011,6.7e-05,8.9e-05,0.000379,0.000539,0.000807,0.00119,0.000538,7e-05,0.000313,0.000173,0.000491,0.001147,0.000785,0.000339,0.00065,0.000345,0.002953,0.002729,0.005841,0.005385,0.004005,0.00353,0.004297,0.002755,0.003412,0.003225,0.005152,0.005319,0.002808,0.001702,0.001885,0.001377,0.003168,0.004677,0.002966,0.00161,0.003147,0.003874,0.003004,0.002791,0.00138,0.001717,0.002458,0.003733,0.002681,0.003277,0.006155,0.007358,0.003897,0.001931,0.001671,0.002481,0.001677,0.000858,0.00037,0.000878,0.000113,0.000632,0.000246,0.000383,0.001319,0.001903,0.00122,0.000472,0.001067,0.000832,0.000414,0.000231,9.2e-05,8.6e-05,0.00051,0.000948,0.00072,0.000324,8.2e-05,0.000184,6.5e-05,0.000143,4.4e-05,5.4e-05,1.1e-05,2.1e-05,3.8e-05,0.000623,0.000402,0.000164,7.4e-05,0.00201,0.003523,0.003246,0.003406,0.002211,0.000576,0.000291,0.000169,3.8e-05,2.7e-05,2.1e-05,3.1e-05,3.1e-05,0.000114,0.000104,4.4e-05
0.000231,9.5e-05,0.000102,7.6e-05,0.000469,0.000781,0.001899,0.002749,0.001041,0.001001,0.001717,0.000373,0.000702,0.000495,0.000375,0.000252,8.9e-05,3.6e-05,4.8e-05,0.000143,0.000404,0.000294,0.001354,0.000551,0.000213,0.000233,0.000526,0.000341,0.000203,0.001852,0.000937,0.000364,0.000981,0.000722,0.002319,0.003391,0.006044,0.001583,0.001336,0.002562,0.004884,0.007718,0.003973,0.002295,0.006384,0.006255,0.003268,0.000756,0.003182,0.003957,0.005694,0.002498,0.000835,0.00133,0.002078,0.000687,0.001358,0.001819,0.002327,0.001155,0.002434,0.001596,0.000488,0.001612,0.007421,0.004369,0.002008,0.000542,0.001016,0.000911,0.000831,0.000313,0.000217,0.000307,0.000413,0.000813,0.000438,0.000367,0.000447,0.002099,0.000954,0.001026,0.000597,0.000732,0.000532,0.000488,0.000239,0.000181,0.000266,0.00098,0.000629,0.000222,0.000123,0.000171,0.000189,7e-05,0.000141,4.7e-05,2.2e-05,2.9e-05,3.6e-05,0.000733,0.000439,0.000351,0.00016,0.002336,0.005698,0.005957,0.003865,0.002128,0.001595,0.000745,0.000183,6.5e-05,3.8e-05,2.7e-05,4e-05,1.2e-05,7.7e-05,2.8e-05,2.4e-05
0.000286,0.000268,0.000116,0.00019,0.000506,0.000642,0.000476,0.00273,0.001876,0.000995,0.002294,0.002396,0.001114,0.000177,0.000421,0.000237,4.5e-05,5.6e-05,3.7e-05,0.000124,0.000183,0.000448,0.000925,0.000884,0.000419,0.00039,0.000289,0.00031,0.000217,0.002032,0.001269,0.000605,0.001079,0.000859,0.002923,0.005544,0.003469,0.003099,0.002149,0.002052,0.005622,0.005141,0.003191,0.003304,0.004796,0.00208,0.001027,0.001165,0.002484,0.002289,0.002348,0.002123,0.000914,0.001909,0.000583,0.000334,0.000608,0.001561,0.000597,0.000886,0.002018,0.001439,0.001219,0.000271,0.006213,0.003443,0.002215,0.000908,0.000731,0.000296,0.000811,0.000191,0.000279,0.000242,9.9e-05,0.000618,0.000404,0.000482,0.001539,0.002392,0.001463,0.001443,0.000848,0.000859,0.00023,0.000112,4.7e-05,0.000138,0.000407,0.000776,0.000294,5.2e-05,0.000116,0.000213,0.000109,0.000143,0.000169,0.000107,6.9e-05,8e-05,3.6e-05,0.000751,0.000506,0.000131,7.1e-05,0.002525,0.008534,0.000786,0.001048,0.002093,0.000645,4.1e-05,4.4e-05,1.9e-05,1.9e-05,1.3e-05,2e-05,2.5e-05,0.00012,4e-05,1.9e-05
0.000263,8.9e-05,3.7e-05,0.000238,0.000619,0.000363,0.000441,0.002209,0.001447,0.000532,0.001526,0.001411,0.001166,0.001077,5e-04,0.000223,6.6e-05,6.2e-05,6.2e-05,8.8e-05,0.000207,0.000673,0.000295,0.000426,0.000353,0.000188,0.000343,0.000242,0.000468,0.001434,0.000794,0.000202,0.000758,0.000395,0.003152,0.001718,0.002484,0.00191,0.001575,0.00321,0.000884,0.002677,0.000522,0.001424,0.003247,0.000869,0.001455,0.000486,0.001031,0.000676,0.001711,0.000352,0.000821,0.001192,0.001146,0.000773,0.000344,0.001065,0.000349,0.001041,0.000898,0.001022,0.001753,0.000535,0.005079,0.004567,0.002133,0.00065,0.001094,0.001085,0.000114,0.00034,0.000169,0.000142,0.000316,0.000206,0.000135,0.000492,0.001488,0.001503,0.000841,0.000955,0.000467,0.000319,6.2e-05,1.8e-05,3.8e-05,8.4e-05,0.000577,0.000317,0.000242,0.000138,0.000139,0.000163,0.000156,0.000115,0.000198,9.9e-05,5.5e-05,4.3e-05,5.3e-05,0.000724,0.00064,0.000387,0.000123,0.002486,0.007892,0.007714,0.004437,0.001421,0.000654,0.000248,0.000161,6.7e-05,2.3e-05,4e-05,4e-05,2.1e-05,0.000111,9.9e-05,6.2e-05
8.2e-05,1.7e-05,2.9e-05,0.000111,0.000274,0.000283,0.000978,0.000569,2.4e-05,0.000287,0.000364,0.000709,0.000208,0.000426,0.000298,0.000152,0.000103,2.8e-05,2.8e-05,7.5e-05,0.000264,0.000731,0.001058,9e-04,0.000341,0.000102,0.000175,1.6e-05,0.000401,0.000448,0.000181,0.000167,0.000328,0.000109,0.002557,0.001958,0.00258,0.001288,0.000224,0.002138,0.002249,0.000573,0.001501,0.002265,0.001481,0.001715,0.002647,0.000442,0.000542,0.000529,0.001067,0.002088,0.00173,0.001342,0.001132,0.000618,0.001054,0.001118,0.00056,0.001212,0.000755,0.00061,0.000581,0.000745,0.003958,0.001197,0.000334,0.000104,0.000794,0.000409,0.000329,0.000183,0.000136,0.000284,0.000231,0.000235,7.4e-05,0.000395,0.001551,0.001304,0.000292,9.7e-05,0.000308,0.000117,9.2e-05,0.000105,0.000106,0.000102,0.000622,0.000492,0.000197,6.4e-05,6e-05,5e-05,6.8e-05,0.000132,0.000157,7.9e-05,6e-05,5.3e-05,5.2e-05,0.000648,0.000371,0.00014,2.7e-05,0.002273,0.003961,0.000679,0.000845,0.000751,0.000297,4.9e-05,2.7e-05,4e-05,5e-05,5e-05,2.5e-05,2.4e-05,6.3e-05,3.5e-05,8e-06
6.3e-05,5e-05,4e-05,3.4e-05,0.00012,0.000223,0.000504,0.00036,0.000123,0.000315,0.000233,0.000128,0.00026,9.9e-05,1.4e-05,3e-06,4.5e-05,8e-06,1.4e-05,2.4e-05,0.000207,0.000989,0.000471,0.000446,0.00026,0.000113,7.8e-05,4.3e-05,0.000318,0.000241,3.2e-05,0.000101,0.000194,0.00018,0.001059,0.001823,0.001637,0.001883,0.000223,0.002554,0.002441,0.001174,0.001034,0.002575,0.00069,0.00112,0.001259,0.002381,0.001112,0.000393,0.001192,0.002198,0.001401,0.001681,0.001104,0.000827,0.000317,0.001812,0.000444,0.002013,0.000749,0.00074,0.0013,0.000702,0.002678,0.001566,0.000308,0.00022,0.000765,0.000463,0.000574,0.000455,0.000178,0.000326,4.4e-05,0.000165,0.000126,0.000347,0.001499,0.000791,0.000494,0.000505,0.000164,9.9e-05,4.6e-05,0.000113,4.1e-05,5.1e-05,0.000504,0.000397,0.000157,3.6e-05,3.3e-05,2.1e-05,1.4e-05,0.000113,0.000117,8.4e-05,6.9e-05,5.3e-05,3.1e-05,0.000492,0.000158,9.7e-05,1.2e-05,0.001762,0.001074,0.001851,0.001172,0.000481,0.000173,4.9e-05,4.2e-05,7e-06,1.8e-05,3.5e-05,5.1e-05,5.4e-05,6.6e-05,3.7e-05,1.4e-05
7e-05,3.1e-05,8.9e-05,7.2e-05,0.000109,0.000211,0.000397,0.000117,6.7e-05,0.000265,0.000107,0.00026,0.000289,0.000131,6.6e-05,3e-05,3.6e-05,3.2e-05,3e-06,6e-05,0.000209,0.000843,0.000801,0.000813,0.000449,0.000137,6e-06,0.000134,0.000368,0.000143,0.000295,0.00017,0.000223,0.000408,0.002775,0.002346,0.001117,0.002317,0.002199,0.003067,0.005163,0.004159,0.001863,0.002114,0.001129,0.000145,0.00284,0.001638,0.000941,0.001886,0.003181,0.002067,0.000654,0.00265,0.002818,0.001921,0.002464,0.003962,0.002479,0.003588,0.00271,0.001638,0.000598,0.000236,0.001925,0.001002,0.000524,0.000404,0.001799,0.000125,0.000538,0.000403,0.000483,0.000226,0.000469,0.000394,0.000153,0.000202,0.001228,0.000472,0.000578,0.000254,0.000204,5.5e-05,8.4e-05,8.9e-05,8.5e-05,9e-05,0.000452,0.00015,5.2e-05,2e-05,3e-05,5.2e-05,3.8e-05,0.000156,0.00011,4e-06,2.7e-05,3.2e-05,3.5e-05,0.000167,7.7e-05,2.1e-05,5.8e-05,0.001176,0.000375,0.001487,0.00026,0.000165,5.9e-05,3.7e-05,3.6e-05,2.7e-05,1.1e-05,3.7e-05,1.1e-05,4.3e-05,6.4e-05,5.8e-05,1.9e-05
7.2e-05,0.000131,0.000207,0.000184,0.000198,0.000252,0.000434,0.000359,0.000276,8.3e-05,0.000169,0.00028,0.000218,7.6e-05,1.2e-05,1.2e-05,2.5e-05,4.3e-05,4.8e-05,0.000119,0.00024,0.00097,0.000685,0.000286,0.000143,0.00017,1e-04,0.000152,0.000343,0.000547,6.2e-05,4.8e-05,0.000204,0.000803,0.0066,0.002472,0.003265,0.004546,0.003099,0.006013,0.003807,0.005315,0.002215,0.006341,0.001811,0.001584,0.005978,0.000565,0.001896,0.005556,0.00159,0.004765,0.003568,0.001843,0.001797,0.001448,0.002635,0.003663,0.001871,0.002658,0.000431,0.001184,0.001885,0.000626,0.001139,0.001137,0.000343,0.000409,0.001692,0.002062,0.001702,0.000455,0.001256,0.000767,0.000839,0.00037,0.000185,0.000246,0.000959,0.000625,0.000465,0.000166,0.000282,0.00031,0.000135,0.000111,7.7e-05,0.000103,0.000542,0.000341,0.00012,2.9e-05,3e-05,3.5e-05,5e-05,0.000227,0.000121,5.7e-05,5.5e-05,1.9e-05,3.7e-05,0.000285,0.000141,9.3e-05,4.5e-05,0.000877,0.000356,0.001479,0.001411,0.00038,7.4e-05,5.7e-05,5.9e-05,3.9e-05,2.7e-05,2.9e-05,7.5e-05,3.4e-05,0.000135,2.1e-05,2.6e-05
0.000136,0.000175,2.9e-05,9.8e-05,0.000297,0.000362,0.000808,0.000856,0.000384,0.000104,0.000128,0.000252,0.00024,0.000249,0.000111,6.5e-05,4e-06,1.7e-05,4.3e-05,0.000172,0.000102,0.000967,0.000577,0.000635,0.000414,3.6e-05,7.1e-05,0.000129,0.000334,0.000781,0.000487,0.000115,0.000206,0.001377,0.007692,0.01084,0.010595,0.007006,0.004225,0.003762,0.006888,0.001927,0.005199,0.00817,0.006811,0.004736,0.009444,0.011721,0.007168,0.004112,0.008352,0.008811,0.009186,0.001163,0.003836,0.003045,0.003101,0.003301,0.004198,0.002128,0.004109,0.004631,0.005514,0.002919,0.001105,0.00268,0.001088,0.000622,0.001354,0.000341,0.002399,0.001101,0.002061,0.002085,0.001279,0.001245,0.000613,0.000315,0.001256,0.001108,0.000286,5.9e-05,0.000258,0.000186,0.000127,0.000195,0.000299,0.000115,0.000777,0.000384,9.2e-05,5.9e-05,0.000134,5.1e-05,6.3e-05,0.000266,0.000178,9.8e-05,1.4e-05,3.9e-05,4.6e-05,0.000414,0.000194,0.000111,8.6e-05,0.00121,0.00135,0.00211,0.000794,0.000688,0.000222,0.000126,7e-05,6.8e-05,8.4e-05,8.5e-05,3.3e-05,6.4e-05,0.000147,0.000134,8e-05
0.000128,9.1e-05,7.9e-05,0.000179,0.000187,0.000157,0.000829,0.000328,0.000104,0.000192,0.000168,0.000274,0.000182,0.00016,0.000138,4.2e-05,4.6e-05,2.6e-05,1.6e-05,0.000162,0.000198,0.000653,0.000696,0.000256,8.8e-05,0.000106,0.000101,0.000117,0.000278,0.000718,0.000643,0.000276,0.000428,0.001484,0.004054,0.006265,0.004635,0.009969,0.01325,0.011445,0.0116,0.009812,0.011095,0.012108,0.009799,0.003729,0.007247,0.009017,0.004844,0.005056,0.00581,0.00675,0.011344,0.013296,0.011518,0.008913,0.003642,0.003728,0.003898,0.004728,0.008539,0.005799,0.001664,0.00262,0.002116,0.005344,0.003925,0.000793,0.001297,0.002682,0.004921,0.004751,0.002888,0.001685,0.002817,0.00118,0.000395,0.000152,0.001704,0.001271,0.000873,0.000562,0.000242,0.000114,0.000191,0.000328,0.000433,0.000454,0.00077,0.000445,0.000199,4e-06,0.000125,8.3e-05,2e-05,0.00026,0.00018,6.6e-05,1.6e-05,4.9e-05,8.2e-05,0.000345,0.000153,0.000128,0.000141,0.001472,0.00132,0.001216,0.001005,0.000447,0.000101,4.9e-05,6.5e-05,8e-06,2.5e-05,3.5e-05,2.6e-05,8.8e-05,0.000268,0.000254,0.000114
0.000131,2.9e-05,3.6e-05,9.6e-05,0.000149,0.00027,0.000867,0.000385,0.000203,0.000236,0.000368,0.000413,0.000636,0.000243,8.5e-05,8.8e-05,7.7e-05,2.5e-05,2.1e-05,0.000226,0.000207,0.000376,0.000537,0.000212,0.00017,0.000202,5e-05,8.1e-05,0.000296,0.00084,0.000529,0.000486,0.000617,0.000639,0.001512,0.004368,0.00578,0.004199,0.003894,0.006244,0.002937,0.004108,0.007124,0.001313,0.004098,0.006131,0.002034,0.004047,0.007466,0.007826,0.002004,0.006096,0.002938,0.006361,0.008188,0.007184,0.008733,0.004711,0.004436,0.002628,0.005109,0.002691,0.001912,0.003706,0.005132,0.005469,0.004156,0.003228,0.001317,0.003807,0.006136,0.005067,0.001921,0.001396,0.001679,0.000651,0.000184,0.000173,0.002146,6.8e-05,0.000142,0.00042,0.000346,0.000128,0.000143,1e-04,0.000168,0.000242,0.000838,0.000512,0.000204,4.6e-05,0.000121,0.000179,0.000116,0.000262,0.000155,0.000128,8e-05,6e-05,2.7e-05,0.000422,0.000342,2.1e-05,3.8e-05,0.001866,0.000357,0.001594,0.001383,0.00119,0.000336,0.000107,9.3e-05,5.1e-05,4.2e-05,3.5e-05,4.9e-05,0.000162,4e-04,0.000106,2.1e-05
0.000174,0.000127,0.000164,0.00012,0.000209,0.000296,0.000238,2e-04,0.00026,0.000278,0.000285,0.000466,0.000614,0.000451,0.00017,4.2e-05,2.4e-05,4e-05,4.1e-05,0.000211,0.000289,0.000298,0.000664,0.000595,0.000229,0.000167,0.000127,5.9e-05,0.00021,0.000779,0.000319,0.000509,9.6e-05,0.001007,0.00044,0.001724,0.004354,0.002617,0.000587,0.002714,0.000996,0.004803,0.002646,0.001862,0.001879,0.003883,0.004036,0.003523,0.005612,0.00302,0.001543,0.002664,0.002735,0.003129,0.002309,0.002585,0.005217,0.003625,0.000538,0.002753,0.000758,0.000914,0.002168,0.002791,0.000244,0.002367,0.0014,0.000897,0.000952,0.003633,0.001729,0.001649,0.001495,0.000393,0.000462,0.000867,0.000252,1e-04,0.001985,0.001526,0.000813,0.000343,7.8e-05,1.1e-05,4.1e-05,1.9e-05,8.7e-05,0.000111,0.000575,0.000483,0.000251,0.000105,9.3e-05,0.000138,0.000127,0.000178,1.7e-05,9.4e-05,4.8e-05,3.8e-05,4.3e-05,0.000641,0.000233,7e-05,0.000129,0.00188,0.001187,0.001333,0.001071,0.001259,0.000698,0.000169,4.7e-05,2.1e-05,5.8e-05,0.000108,0.000172,0.000249,0.000335,0.000348,0.000169
0.000121,7.5e-05,0.000188,0.000354,0.000457,0.000419,0.000636,0.000384,8.2e-05,0.000305,0.000228,0.000469,0.000165,2e-05,2e-05,4.9e-05,4.5e-05,4.5e-05,3.1e-05,0.000185,0.000279,0.000177,0.000735,0.000449,0.00024,0.000144,0.000117,3.8e-05,0.000192,0.000531,0.000602,0.000269,0.000226,0.001117,0.002675,0.002257,0.001074,0.001145,0.001985,0.001207,0.001963,0.001127,0.002428,0.000167,0.001193,0.00265,0.00079,0.001816,0.003361,0.003328,0.000695,0.002711,0.001891,0.002546,0.001644,0.001901,0.000999,0.002877,0.002528,0.000267,0.001998,0.00131,0.002547,0.000317,0.000201,0.000974,0.001691,0.001003,0.000382,0.00169,0.002487,0.000868,0.000476,0.00118,0.000553,0.000579,0.000461,0.00023,0.00142,0.001302,0.000671,0.000266,0.000129,0.000121,3e-05,2.7e-05,8.7e-05,3.3e-05,0.000314,2e-04,0.000118,8.8e-05,2.8e-05,0.000184,8e-05,0.000215,2e-04,5.6e-05,1e-05,5.2e-05,6.8e-05,0.00067,0.000422,0.00019,3.4e-05,0.001773,0.000894,0.000393,0.001515,8e-04,0.000313,0.000111,9.5e-05,5.8e-05,4.7e-05,8.5e-05,0.000102,0.000284,0.000649,0.00062,0.000307
0.000129,9.2e-05,8.1e-05,0.000256,0.000486,0.000396,0.000609,0.00064,0.000352,0.000432,0.000163,0.000396,0.000322,0.000146,4.9e-05,2.1e-05,7.5e-05,0.000104,6.9e-05,7.3e-05,0.000116,0.000337,0.000673,0.000428,2e-04,7.3e-05,0.000101,0.000126,2e-04,0.000334,0.000389,0.000409,0.00023,0.000664,0.002777,0.000132,0.000313,0.000892,0.001617,0.001117,0.000456,0.001115,0.002067,0.001158,0.001586,0.003565,0.00241,0.001486,0.000905,0.002548,0.002388,0.002104,0.001722,0.001053,0.000719,0.000948,0.000313,0.00162,0.001163,0.002517,0.001416,0.000833,0.001948,0.001327,0.000301,0.000261,0.000261,0.000623,0.001088,0.000612,0.001664,0.000415,0.000742,0.000512,0.00024,0.000625,0.000332,0.000153,0.00065,0.000537,5.1e-05,0.00015,0.000281,0.000128,8e-05,2e-05,0.000101,5.9e-05,0.000127,9.4e-05,9.5e-05,1.7e-05,1.5e-05,0.000164,0.000125,0.000232,0.000253,0.00015,5.1e-05,4.9e-05,2.9e-05,0.000492,0.000323,0.000179,7.6e-05,0.00158,0.000524,0.000261,0.000973,0.000189,2.9e-05,6.4e-05,8e-05,5.5e-05,3.6e-05,2.6e-05,8.8e-05,0.000155,0.000504,0.000115,2.8e-05
9.7e-05,0.000124,0.000165,0.000151,9.7e-05,0.000286,0.000199,0.000335,0.000158,0.000272,0.000357,0.000173,0.000249,0.000158,7.1e-05,5.7e-05,5.4e-05,2.1e-05,2.2e-05,2.1e-05,0.000127,0.00029,0.00065,0.000403,0.000158,4.1e-05,0.000108,2.4e-05,0.000136,0.000187,0.000202,0.000181,0.000475,0.000728,0.002062,0.001934,0.000217,0.000385,0.000828,0.001285,0.000765,0.001216,0.002087,0.000514,0.001604,0.00187,0.000515,0.001236,0.001292,0.001072,0.001492,0.001674,0.000705,0.000349,0.000874,0.000989,6e-04,0.001019,7.5e-05,0.001582,0.001854,0.001321,0.001775,0.000557,0.000592,0.000302,0.000244,0.000391,0.000607,0.000356,0.001216,0.000298,0.000236,0.000527,9.1e-05,0.000233,0.000172,0.000136,0.000169,0.000165,0.000301,5.5e-05,0.000237,6.3e-05,2.6e-05,3.9e-05,2.8e-05,3.9e-05,2e-04,5.6e-05,2.5e-05,7e-06,2.1e-05,0.000112,6.6e-05,0.000165,0.000109,5.7e-05,1e-05,4.3e-05,5e-05,0.000173,7.3e-05,5.6e-05,6.4e-05,0.001191,0.000255,0.000467,0.00017,0.000289,2e-04,8.3e-05,0.000108,4.3e-05,1.9e-05,4e-05,7.9e-05,7.9e-05,0.000471,0.000284,8.9e-05
3.8e-05,4.4e-05,2.1e-05,4e-05,4.6e-05,6.4e-05,6.5e-05,7.6e-05,8.2e-05,2.9e-05,6.9e-05,7e-05,9.7e-05,3.8e-05,2.2e-05,8e-06,7e-06,1.1e-05,2.3e-05,1.4e-05,5.4e-05,0.000128,0.000181,0.000156,9.9e-05,2.9e-05,4.1e-05,1.5e-05,9.1e-05,7.9e-05,0.000102,3.4e-05,0.000279,0.00038,0.000576,0.000615,0.000407,0.000411,0.000795,0.000408,0.000593,0.000395,0.000584,0.000502,0.000452,0.000312,0.000515,0.000388,0.000628,0.000387,0.000218,0.000623,0.000274,0.000373,0.000449,0.000208,0.000439,0.000368,0.000181,0.00046,0.000229,0.000325,0.00011,0.00027,0.000428,0.000165,0.000145,2.8e-05,0.000248,0.000143,0.00042,9.4e-05,0.000125,0.000215,6.9e-05,9.2e-05,2.2e-05,5e-05,4.1e-05,7.3e-05,3.7e-05,3e-05,5.9e-05,4.7e-05,2.6e-05,1.2e-05,1.9e-05,3.3e-05,0.000166,8.5e-05,5.1e-05,1.4e-05,1.7e-05,3e-05,1.8e-05,6.6e-05,2.2e-05,1.2e-05,1.2e-05,1.1e-05,1.7e-05,3.5e-05,2.7e-05,2.3e-05,1.5e-05,0.00041,0.000168,0.000394,0.000437,0.000186,3.7e-05,1.4e-05,3.5e-05,2.9e-05,4.2e-05,2.9e-05,3e-06,5.4e-05,0.000142,8.8e-05,4e-05
3.5e-05,2e-05,1.6e-05,2.7e-05,4.3e-05,7.2e-05,9.1e-05,7.1e-05,1.1e-05,3.4e-05,2.4e-05,2.2e-05,5.5e-05,1.5e-05,1.6e-05,1.6e-05,6e-06,8e-06,1.6e-05,3.5e-05,4.9e-05,5.5e-05,0.000308,0.000251,9.5e-05,3e-05,1e-05,7e-06,9.5e-05,0.000111,9.7e-05,9.7e-05,0.000256,0.000271,0.000322,0.00038,0.000306,0.000429,0.000434,4e-04,0.000632,0.000742,0.000252,0.000486,0.000317,0.000158,0.000214,0.000386,0.000602,0.000232,0.000444,8.2e-05,0.000431,0.000245,0.00047,0.000371,0.000372,0.000234,0.00011,0.000337,0.000335,1e-04,0.000142,0.000227,0.000165,0.000311,5.9e-05,3.4e-05,9.8e-05,0.000106,0.00032,7.9e-05,9e-05,0.000166,6.8e-05,1.5e-05,6e-06,0.000108,0.000132,9.2e-05,9.2e-05,1.8e-05,2.7e-05,2.4e-05,2.8e-05,2.5e-05,3e-05,4.1e-05,0.00018,8.6e-05,4.6e-05,3e-06,4e-06,1.7e-05,1.2e-05,5.1e-05,3.5e-05,2.3e-05,7e-06,1.2e-05,1.9e-05,5.1e-05,8e-06,1.6e-05,1e-05,0.000231,7.9e-05,0.00033,0.000132,5.4e-05,7.3e-05,3.4e-05,3.2e-05,2e-05,1.4e-05,1.8e-05,1.7e-05,3.7e-05,5.7e-05,3.2e-05,7e-06
5e-06,2.9e-05,3e-05,1.4e-05,1.7e-05,5.7e-05,0.000113,4.8e-05,5.5e-05,3.4e-05,5e-05,1.2e-05,3.1e-05,4.4e-05,5e-06,6e-06,8e-06,4e-06,1e-05,4.1e-05,4.3e-05,0.000103,0.000186,0.000203,0.000113,3.3e-05,3.2e-05,2.6e-05,6.8e-05,0.00013,6.7e-05,3.3e-05,0.000214,0.000248,0.00027,0.000335,0.000156,0.000517,0.000372,0.000366,0.000737,0.000337,0.000293,0.000149,0.000361,0.000339,0.000289,0.000401,0.000225,0.000265,0.000405,0.000381,0.000365,0.000208,0.000267,0.000249,0.000153,3.6e-05,0.000225,0.000244,0.00029,0.000231,0.000174,0.000144,0.000178,0.000197,6.4e-05,5.4e-05,0.00011,7.6e-05,0.000346,2.4e-05,0.000104,0.000182,7.2e-05,5.9e-05,1.7e-05,0.000111,1.1e-05,5.9e-05,5e-05,1.2e-05,4.3e-05,6e-06,2.7e-05,2.3e-05,2.6e-05,3.2e-05,0.000122,0.000107,3.6e-05,4e-06,6e-06,2e-06,8e-06,4.6e-05,2.4e-05,1.6e-05,1.2e-05,0,2e-06,3.1e-05,4e-06,1.8e-05,3e-06,9.6e-05,0.000237,0.000238,0.000226,4.7e-05,1.2e-05,2e-05,2.3e-05,9e-06,5e-06,2.2e-05,1.3e-05,1.1e-05,5.8e-05,3.8e-05,9e-06
2.3e-05,3e-05,4.7e-05,2.9e-05,3e-05,2.3e-05,7e-05,2.2e-05,2.4e-05,3e-05,2.1e-05,4.4e-05,5.6e-05,2.2e-05,1e-05,3e-06,2e-06,1.1e-05,4e-06,4e-05,3.8e-05,9.3e-05,0.000227,0.000125,6.9e-05,2.2e-05,3.3e-05,2.9e-05,4.9e-05,0.000332,0.000214,0.000112,0.000126,2e-04,4e-05,0.000219,0.000306,0.000716,0.000201,0.00013,0.000435,0.000274,0.000519,0.000312,0.000646,0.000295,0.000182,4.5e-05,0.000376,0.000449,0.000329,0.000288,0.000585,0.000164,0.000551,0.000432,0.00022,8.7e-05,0.000129,0.000178,0.000545,0.000164,0.000187,7e-06,0.000299,0.000134,0.000151,4.3e-05,1e-04,6.3e-05,0.000248,8.9e-05,0.000109,0.000111,3.8e-05,4e-05,4.2e-05,9.2e-05,0.000158,0.000105,5e-06,4e-05,3.2e-05,3.1e-05,1e-05,2.7e-05,2.5e-05,1.9e-05,1e-04,4.1e-05,2.2e-05,7e-06,1.7e-05,5e-06,6e-06,3.6e-05,1.8e-05,6e-06,8e-06,7e-06,1.5e-05,5.1e-05,2.3e-05,1e-05,1.1e-05,4.6e-05,3.9e-05,0.000183,0.000219,8.3e-05,1.3e-05,2.7e-05,2.3e-05,1.6e-05,9e-06,1.2e-05,1.2e-05,2.7e-05,2.5e-05,6e-06,1e-06
1.8e-05,2.9e-05,3.5e-05,2e-05,3.6e-05,5.3e-05,2.7e-05,9.7e-05,6.4e-05,1.4e-05,3.1e-05,2.7e-05,3.4e-05,1e-05,6e-06,9e-06,5e-06,1.2e-05,7e-06,3e-05,2.3e-05,0.000102,0.000153,0.000124,5.5e-05,4e-05,1.3e-05,4.2e-05,3.2e-05,0.000339,0.000211,0.000112,3.8e-05,0.000223,0.000127,3.1e-05,0.000548,0.000184,0.000446,0.000458,0.000332,8e-04,7.1e-05,2.5e-05,0.000503,0.000261,0.00022,0.000246,0.000274,0.000251,0.000276,0.000347,0.000242,0.000438,0.000581,0.000449,0.000283,0.000186,5e-05,0.000241,0.000476,0.000118,0.000168,6.2e-05,0.000326,0.000196,0.000131,5.3e-05,5.3e-05,2.6e-05,0.000276,8.6e-05,0.000113,0.000134,1.6e-05,4.1e-05,2.5e-05,0.000134,0.000226,5.4e-05,2.7e-05,3.9e-05,6.3e-05,2.3e-05,8e-06,2.3e-05,1.9e-05,1.6e-05,9.7e-05,5.6e-05,2e-05,4e-06,1.3e-05,9e-06,1.1e-05,2.4e-05,1.8e-05,1.1e-05,7e-06,4e-06,1e-05,7.3e-05,2.9e-05,1e-05,2e-06,0.00014,0.000273,2.9e-05,0.000161,2.3e-05,1.5e-05,1.4e-05,1.1e-05,1.4e-05,4e-06,4e-06,2e-06,1.8e-05,2e-05,2.4e-05,1.5e-05
3.2e-05,2.3e-05,3.7e-05,1.5e-05,2.4e-05,6.3e-05,2.7e-05,5.3e-05,3.8e-05,2.5e-05,4.5e-05,2.3e-05,1.5e-05,2.1e-05,1e-05,4e-06,1e-06,1.2e-05,7e-06,2.5e-05,1.8e-05,5.5e-05,0.000159,0.000119,6.1e-05,5.6e-05,1e-05,2.2e-05,1.4e-05,0.000249,0.000197,0.000113,6.3e-05,0.000219,0.000296,0.000244,0.00037,0.00031,0.00029,0.000368,0.000174,0.000555,0.000364,0.000213,9.4e-05,0.000107,0.000314,0.000148,0.000258,0.000141,0.000353,0.000233,0.000283,0.000438,0.00024,0.000124,0.000186,0.000215,8.8e-05,0.000213,0.000313,8e-06,0.000168,4.8e-05,0.000337,5e-05,7.6e-05,9.1e-05,0.000128,2.9e-05,0.000238,7.8e-05,3.5e-05,0.000111,8e-06,2.7e-05,3.7e-05,0.000109,0.00033,0.000197,8.6e-05,4.9e-05,7.5e-05,1.2e-05,1.3e-05,1.5e-05,1.1e-05,1e-05,8.8e-05,4.3e-05,2.1e-05,5e-06,9e-06,1.8e-05,1e-05,1.3e-05,1.5e-05,1.2e-05,8e-06,2e-06,5e-06,5.9e-05,1e-05,1.1e-05,1e-05,0.000223,0.000302,0.000233,0.000256,3.4e-05,2.7e-05,9e-06,2.5e-05,1.3e-05,1.7e-05,8e-06,2e-06,3e-06,1.7e-05,2e-05,4e-06
3.6e-05,1.1e-05,4.4e-05,6.2e-05,5.9e-05,3.6e-05,4.9e-05,7.3e-05,3.8e-05,4.3e-05,4e-05,4.3e-05,3.4e-05,1e-06,6e-06,1e-06,4e-06,5e-06,1e-06,2.2e-05,3e-06,5e-05,0.000111,0.000168,9e-05,5.7e-05,2.8e-05,1.8e-05,6e-06,0.000125,0.000119,3.5e-05,5.6e-05,0.000156,0.000206,0.000282,0.000111,0.000209,9.8e-05,8.7e-05,0.000197,0.000368,4.7e-05,2e-05,0.000388,9.6e-05,0.000123,0.000165,0.000354,0.000306,0.000203,0.000341,0.000306,0.000321,0.000125,0.000105,0.000307,0.000155,8e-05,0.000331,0.000302,3.9e-05,1.8e-05,1.7e-05,0.000249,0.00013,4.9e-05,0.000132,0.000186,0.000204,0.000344,5.4e-05,9.6e-05,0.000115,4.3e-05,3.9e-05,5.2e-05,5.9e-05,0.000232,0.000125,7.7e-05,7e-06,2.5e-05,5.5e-05,2.6e-05,2.2e-05,2.2e-05,1.6e-05,6.7e-05,5.4e-05,2.9e-05,9e-06,5e-06,2.4e-05,2e-05,1e-05,1.8e-05,1.1e-05,3e-06,3e-06,4e-06,5.8e-05,3.2e-05,2.3e-05,7e-06,3e-04,0.000297,8.8e-05,2.8e-05,0.000122,1.4e-05,7e-06,2.4e-05,1e-05,1.2e-05,2e-06,2e-06,1.6e-05,2e-05,5e-06,4e-06
6.9e-05,5.5e-05,3.4e-05,3.1e-05,7.5e-05,6.5e-05,8.9e-05,8.5e-05,4.9e-05,6e-05,1.7e-05,2.4e-05,1.4e-05,3e-06,6e-06,1e-05,2e-06,2e-06,3e-06,3.2e-05,9e-06,5.1e-05,0.000115,0.000171,0.000113,4.6e-05,1.8e-05,1.5e-05,3.9e-05,3.1e-05,5.8e-05,5.7e-05,7.2e-05,0.000109,0.000138,0.000311,0.000367,0.000145,4.5e-05,0.000138,0.000277,0.000534,0.000192,0.000187,0.000407,0.000281,0.000346,0.000183,0.000376,6.8e-05,7.9e-05,0.000368,0.000238,0.000287,5.4e-05,0.000254,0.000115,9e-05,2.1e-05,0.000144,0.000429,6.7e-05,0.000178,0.000111,0.000198,0.000118,0.000146,0.000154,0.000321,0.000201,0.000428,0.000127,5.6e-05,7.7e-05,4.7e-05,9.4e-05,2.8e-05,4.6e-05,8.2e-05,4.1e-05,4.7e-05,1.6e-05,3.8e-05,4.7e-05,1.6e-05,1.7e-05,1.1e-05,3e-06,6.2e-05,3e-05,1.6e-05,8e-06,5e-06,2e-05,1.3e-05,8e-06,2.3e-05,8e-06,4e-06,4e-06,3e-06,3.9e-05,2.5e-05,3e-05,1.2e-05,0.000367,0.000402,0.000222,0.000136,2.6e-05,3.5e-05,2e-05,1.2e-05,1.3e-05,7e-06,5e-06,3e-06,2.4e-05,3.3e-05,1.7e-05,5e-06
2.9e-05,4.5e-05,6e-05,5.2e-05,7.7e-05,4e-05,9.4e-05,3.3e-05,2.3e-05,7e-05,5.8e-05,3.7e-05,1.4e-05,2.1e-05,1.4e-05,1.5e-05,6e-06,3e-06,4e-06,3.2e-05,1.9e-05,5.9e-05,0.000115,0.000139,4.8e-05,2.1e-05,1.5e-05,2e-06,4.7e-05,7.2e-05,3.3e-05,2.4e-05,6.8e-05,0.000124,0.000167,0.000103,0.000149,0.000152,7.1e-05,0.000241,0.000149,0.000149,0.000218,0.000151,0.000312,0.000727,8.6e-05,0.000225,0.000353,0.000252,0.00023,0.000239,0.000199,0.000285,0.000108,0.000193,0.000104,0.000163,4.5e-05,0.000178,0.000344,0.000254,0.000161,0.000167,0.000293,0.000118,0.000233,6.9e-05,0.00025,0.000198,0.000184,0.000162,0.000124,3.6e-05,8.8e-05,6.6e-05,7.1e-05,7.9e-05,0.000131,7.5e-05,6.4e-05,2.9e-05,4.2e-05,1.1e-05,1.7e-05,2.5e-05,2.7e-05,9e-06,0.00011,7.2e-05,4e-05,1.5e-05,6e-06,1.4e-05,4e-06,1.1e-05,3.4e-05,2.9e-05,1.5e-05,9e-06,6e-06,2.1e-05,5e-06,2e-05,8e-06,0.000395,0.000214,7.7e-05,0.000196,7.6e-05,4.3e-05,2.2e-05,2.3e-05,2e-05,1.8e-05,5e-06,4e-06,2.2e-05,1.3e-05,1.5e-05,1e-05
6.1e-05,3.5e-05,2.3e-05,1.8e-05,2e-05,5.7e-05,9.3e-05,6.8e-05,7.3e-05,0.00011,9e-06,8e-06,4.7e-05,4.2e-05,2.4e-05,4e-06,6e-06,6e-06,5e-06,2.4e-05,2e-05,5.5e-05,6.9e-05,4e-05,3.6e-05,2.9e-05,2.3e-05,1.5e-05,3.6e-05,3.1e-05,1.4e-05,2.3e-05,8.5e-05,5.9e-05,0.000206,0.000342,0.000184,0.000313,0.000124,0.000296,0.000278,0.000192,0.000189,0.000117,0.000301,0.000551,0.000424,0.00029,0.00034,0.000194,0.000169,2e-04,0.000247,0.000221,4.7e-05,7.4e-05,9.5e-05,7e-06,9e-05,0.000283,0.000149,0.000378,0.000416,0.00013,0.000246,0.000245,0.000177,0.000281,0.000128,0.000198,0.000145,8.9e-05,6.4e-05,0.000102,5e-05,5.2e-05,2.7e-05,5.9e-05,0.000129,4.1e-05,2.4e-05,2.1e-05,1.7e-05,4.6e-05,2.7e-05,2.9e-05,6e-06,1.2e-05,0.000155,5.5e-05,2.3e-05,4e-06,7e-06,1.3e-05,1.1e-05,2.5e-05,3.2e-05,1.7e-05,3e-06,7e-06,8e-06,3.5e-05,9e-06,1.7e-05,6e-06,0.000413,0.000104,9.5e-05,0.000149,4e-06,9e-06,1.1e-05,3.3e-05,8e-06,1e-05,8e-06,1e-05,9e-06,3.6e-05,2.9e-05,6e-06
4.7e-05,3.5e-05,1.7e-05,9e-06,1.4e-05,2.2e-05,6.5e-05,4.1e-05,5.2e-05,4.1e-05,3.2e-05,4.6e-05,6.8e-05,3.2e-05,1e-05,1.2e-05,1.1e-05,7e-06,7e-06,3.7e-05,1.7e-05,4.5e-05,9.5e-05,9.3e-05,4.4e-05,3e-05,1.7e-05,1.8e-05,4e-05,1.8e-05,5.1e-05,4.7e-05,9.2e-05,0.000132,0.000181,0.000173,0.000411,0.000195,7.7e-05,0.000173,0.000122,0.00019,0.000194,0.000146,0.00026,8.5e-05,0.000139,0.00025,0.000432,0.000288,0.000448,0.000339,0.000231,0.000223,2.9e-05,9.5e-05,0.000216,0.00031,6.4e-05,0.000113,7e-05,0.000132,5.4e-05,0.000126,0.00054,0.000105,0.000131,0.00014,0.000164,0.000136,0.000471,0.000163,9.2e-05,4.6e-05,7.1e-05,8e-06,1.5e-05,7.3e-05,9.9e-05,5.5e-05,2.5e-05,1.9e-05,3e-05,4.4e-05,6e-06,1.7e-05,1.8e-05,1e-05,0.000169,0.000125,5.8e-05,1.9e-05,1.3e-05,1.6e-05,1.3e-05,2e-05,1.1e-05,8e-06,1.1e-05,6e-06,3e-06,4.2e-05,1.4e-05,1.1e-05,1.4e-05,0.00041,0.000152,0.000129,0.000245,9e-05,5.1e-05,1e-05,2.2e-05,2.2e-05,1.1e-05,2e-06,1e-05,5e-06,4.6e-05,2.7e-05,1.1e-05
1.8e-05,3.5e-05,2.6e-05,1.7e-05,1.7e-05,2.7e-05,7.9e-05,8.6e-05,4.6e-05,3.1e-05,2.9e-05,6.2e-05,6e-06,1.9e-05,1.9e-05,1.1e-05,8e-06,5e-06,3e-06,3.3e-05,2.1e-05,5.4e-05,9e-05,0.000141,6.8e-05,3.8e-05,5e-05,1.5e-05,3.6e-05,3.3e-05,5e-05,2.2e-05,5.7e-05,0.000176,0.000214,0.000199,0.000299,8.9e-05,5e-05,7e-05,0.000143,0.000223,0.000324,0.000131,0.000125,0.000321,0.000347,0.000167,0.000235,0.000228,0.000199,0.000266,0.000294,0.000189,2.4e-05,5.9e-05,0.000374,0.000125,0.000218,0.000373,0.000163,6.6e-05,0.000135,0.000211,0.000539,0.00035,0.000249,8.4e-05,0.000153,5.9e-05,0.000256,0.000173,7e-05,0.000156,3.4e-05,3.5e-05,2.9e-05,5.5e-05,0.000156,7.8e-05,6.8e-05,7e-06,1.8e-05,2.1e-05,3.3e-05,8e-06,6e-06,1.7e-05,0.000178,0.000124,5.3e-05,1.6e-05,1e-06,9e-06,1.4e-05,2.5e-05,7e-06,3e-06,3e-06,6e-06,2e-06,3.1e-05,2.3e-05,2.5e-05,2.3e-05,0.000408,0.00013,9.1e-05,0.000252,0.000105,4.8e-05,2.6e-05,7e-06,8e-06,1.8e-05,1e-05,6e-06,2e-06,5.3e-05,3.4e-05,1.5e-05
2.7e-05,5e-05,2.7e-05,2.9e-05,3.5e-05,4.2e-05,0.00011,0.000138,7.2e-05,5.7e-05,7.6e-05,9.6e-05,6.5e-05,1.7e-05,7e-06,5e-06,1.5e-05,1.1e-05,7e-06,1.8e-05,4e-05,7.1e-05,5.5e-05,9.6e-05,2.5e-05,3.2e-05,1.6e-05,1.5e-05,3.2e-05,8.6e-05,6.4e-05,6.1e-05,8.1e-05,0.000214,0.000248,4e-06,0.000336,0.000174,7.3e-05,0.000134,0.000214,0.000476,0.000328,0.000235,9.9e-05,0.000283,0.000358,0.000103,0.000178,0.000105,0.000328,0.000421,0.000265,0.000211,2.5e-05,0.000202,0.00028,0.000324,0.000164,0.000275,3.7e-05,5.4e-05,6e-05,0.000154,0.00053,0.000201,7e-05,7e-05,9.4e-05,0.000138,0.000201,0.000118,0.000138,6.1e-05,2.8e-05,2.5e-05,2.1e-05,3.4e-05,0.000156,0.000106,2.5e-05,3.5e-05,4.8e-05,2.2e-05,7e-06,2.9e-05,3.2e-05,1.5e-05,0.000166,0.000107,4e-05,1.8e-05,6e-06,1.2e-05,5e-06,1.1e-05,5e-06,1e-05,1.4e-05,1.2e-05,8e-06,4e-06,2e-06,2.1e-05,1.1e-05,0.000357,7.1e-05,0.000164,6.3e-05,0.000136,8.6e-05,5e-05,2.5e-05,1e-05,1.7e-05,1.1e-05,1.3e-05,1.7e-05,6.1e-05,2.8e-05,1.3e-05
6.4e-05,2.9e-05,2.9e-05,6.4e-05,6.2e-05,4.6e-05,0.000106,0.000138,3.7e-05,5.6e-05,6.7e-05,4.7e-05,2.5e-05,4.3e-05,2.7e-05,2e-05,1.6e-05,7e-06,3e-06,2.4e-05,4.2e-05,8.9e-05,9.8e-05,2.4e-05,5.7e-05,2.6e-05,4e-05,1.5e-05,1.9e-05,7.1e-05,5.2e-05,4.9e-05,0.000106,0.000195,0.000415,0.000396,0.000653,0.000383,0.000199,0.00017,0.000203,0.000374,0.000266,5.2e-05,0.00015,0.000168,5.6e-05,0.000217,0.000378,0.000306,6e-04,0.000159,0.000189,0.000211,2.9e-05,0.000243,0.00033,0.00028,0.000427,0.000324,4.8e-05,0.000169,6.3e-05,0.000151,0.000323,0.000153,0.000109,8.1e-05,8.8e-05,0.000214,0.000256,5.6e-05,2.7e-05,1.6e-05,1e-04,7.4e-05,8.6e-05,3.9e-05,0.000134,0.000121,6.5e-05,4e-06,4.1e-05,1.3e-05,8e-06,1.7e-05,1.3e-05,1.1e-05,0.000134,3.3e-05,1.5e-05,1.6e-05,1e-05,1e-05,1.1e-05,6e-06,1.3e-05,1.5e-05,9e-06,2.4e-05,1.6e-05,3.5e-05,2.5e-05,1.4e-05,2.1e-05,0.000352,0.000128,0.000185,6.4e-05,3.2e-05,3.3e-05,1e-05,1.8e-05,9e-06,9e-06,1.4e-05,1.7e-05,2e-05,3e-05,9e-06,1.1e-05
6.2e-05,4e-05,2.2e-05,5.7e-05,3.6e-05,6.4e-05,4.1e-05,6.7e-05,5e-05,6.2e-05,2.3e-05,1e-05,1e-05,3.7e-05,9e-06,1.2e-05,1e-05,0,3e-06,2.7e-05,1.7e-05,9.1e-05,4.9e-05,5.4e-05,2.2e-05,4.8e-05,1.7e-05,2.1e-05,1e-05,8.6e-05,5.3e-05,1.8e-05,0.00011,0.000117,0.000256,6.7e-05,0.000247,0.00017,7.6e-05,9.8e-05,0.000326,0.000168,0.000315,0.000211,0.000103,0.000163,0.000241,0.000237,0.000217,0.000201,0.000367,0.000319,0.000231,0.000149,0.000111,0.000169,0.000233,9.7e-05,0.00043,0.000182,0.000202,0.000189,0.000263,0.000202,0.000356,0.00015,7.5e-05,6.1e-05,3.2e-05,0.000139,0.000196,0.000292,0.000204,4.5e-05,0.000148,9.7e-05,4.8e-05,2.8e-05,0.000112,0.000165,8.2e-05,2.4e-05,2.5e-05,3.5e-05,6e-06,1.6e-05,1.2e-05,1.5e-05,8.4e-05,5.4e-05,3.1e-05,9e-06,9e-06,3e-06,1.3e-05,1.6e-05,1.8e-05,6e-06,1e-05,2e-05,2e-05,6.3e-05,2.5e-05,7e-06,3.8e-05,0.000318,0.00032,0.000243,0.000229,7.9e-05,2.6e-05,1.1e-05,2.3e-05,1.3e-05,1.1e-05,1.2e-05,3e-06,2e-05,2.7e-05,2e-05,1e-05
4.3e-05,3.2e-05,3.6e-05,8e-06,4.8e-05,2.5e-05,1.3e-05,6.5e-05,3.7e-05,3.8e-05,9e-06,5.6e-05,3.2e-05,6e-06,2e-05,9e-06,8e-06,9e-06,5e-06,2.3e-05,8e-06,6.4e-05,0.000145,0.000163,0.000126,4.3e-05,2.4e-05,1e-05,1.2e-05,0.000111,0.000202,0.000143,0.000148,0.000221,0.000171,0.000279,0.000269,0.000154,0.000224,0.000228,0.000518,0.000125,0.000164,9.8e-05,0.000269,0.000459,0.000268,0.000157,4.8e-05,0.000379,0.000136,0.000306,0.000209,0.000213,0.000146,0.000323,0.000108,0.000158,0.000293,0.000447,0.000457,0.000144,0.000293,7.2e-05,0.000199,0.000121,4e-05,8.5e-05,0.000137,0.000151,0.000114,0.000135,8.2e-05,8.6e-05,0.00016,0.000115,7e-05,5.2e-05,0.000202,0.000267,0.00016,5.2e-05,2.8e-05,4.1e-05,3.1e-05,2.8e-05,1.1e-05,1e-05,7.3e-05,5.4e-05,2.1e-05,5e-06,2e-06,1e-05,1e-05,1e-05,1.8e-05,9e-06,5e-06,9e-06,6e-06,5.1e-05,3.1e-05,1.4e-05,1.8e-05,0.000288,0.000321,0.000198,3.5e-05,8.2e-05,3.6e-05,6e-06,2.3e-05,9e-06,1.3e-05,8e-06,1.8e-05,2.6e-05,2.9e-05,2e-05,1.5e-05
3.1e-05,1.9e-05,2.1e-05,2e-05,2.3e-05,2.6e-05,6.4e-05,4.9e-05,1.1e-05,2.7e-05,4.1e-05,5.4e-05,5.1e-05,4e-05,3.4e-05,2.1e-05,4e-06,6e-06,5e-06,1.8e-05,1.2e-05,5e-05,0.000106,0.00012,0.000116,4.7e-05,1.5e-05,1.2e-05,1.2e-05,0.000114,0.000213,0.000125,1.9e-05,6.6e-05,0.000251,0.000414,0.000321,0.000378,0.000153,0.000114,0.000296,0.000382,0.00039,0.000122,0.000142,0.00014,7.1e-05,0.000199,0.000254,0.000378,0.000259,0.000188,0.000148,0.000222,0.000143,0.000254,5.5e-05,0.000127,0.000226,8.3e-05,0.000333,9e-05,0.000161,9.1e-05,0.000249,0.000155,7.6e-05,5.4e-05,6.5e-05,4.9e-05,8.6e-05,7.4e-05,3.6e-05,6.4e-05,0.000148,6.3e-05,3.1e-05,4e-05,0.000139,0.000147,4.3e-05,1.6e-05,1.7e-05,1.8e-05,1.6e-05,1.1e-05,1.3e-05,4e-06,5.8e-05,6.2e-05,2.6e-05,3e-06,5e-06,7e-06,1.1e-05,1.2e-05,8e-06,9e-06,1e-05,5e-06,7e-06,3.7e-05,9e-06,1.1e-05,2e-06,0.00027,0.000224,0.000208,8.4e-05,7e-05,3.6e-05,1e-05,8e-06,1.3e-05,5e-06,9e-06,1.4e-05,1.2e-05,9e-06,9e-06,1.2e-05
8e-06,1e-05,1.3e-05,1e-05,2.3e-05,2.8e-05,5.8e-05,3.6e-05,1.2e-05,1.8e-05,2.3e-05,1.2e-05,2.5e-05,1.2e-05,3e-06,3e-06,4e-06,1e-06,2e-06,1.5e-05,1.3e-05,3.7e-05,7.9e-05,9.3e-05,3e-05,2.5e-05,1.6e-05,7e-06,1.2e-05,8.4e-05,5.3e-05,1.9e-05,2.2e-05,0.000112,0.000207,4.5e-05,0.000252,0.000173,0.000188,5.8e-05,0.000292,0.000333,0.000225,0.000197,0.000218,0.000169,7.9e-05,0.000208,0.000159,0.000301,0.000173,0.000175,0.000235,0.000128,0.000156,0.000323,0.000212,6.8e-05,7.6e-05,0.000202,0.000212,6.8e-05,0.000134,6.5e-05,0.000244,0.00016,9e-06,1.4e-05,2.2e-05,1.8e-05,8.4e-05,8.3e-05,4.9e-05,8.1e-05,7.6e-05,2.2e-05,8e-06,3.8e-05,0.000116,3.1e-05,3.8e-05,1.6e-05,1.8e-05,1.7e-05,1e-05,1e-06,9e-06,2e-06,4.3e-05,2.8e-05,1.7e-05,6e-06,7e-06,6e-06,5e-06,7e-06,5e-06,6e-06,4e-06,3e-06,3e-06,2e-05,1.4e-05,1.1e-05,1e-05,0.000247,0.000128,0.000123,0.000113,1.2e-05,3.6e-05,8e-06,2e-06,4e-06,3e-06,3e-06,4e-06,7e-06,6e-06,1.6e-05,7e-06
2e-06,5e-06,7e-06,2e-06,2e-05,2.6e-05,6.4e-05,3.8e-05,9e-06,1.6e-05,7e-06,5e-06,1.9e-05,5e-06,4e-06,3e-06,2e-06,2e-06,0,1.4e-05,8e-06,4.1e-05,9.4e-05,3.3e-05,1.4e-05,1.6e-05,1.9e-05,4e-06,1.6e-05,6.2e-05,2.5e-05,6e-06,1e-05,9e-05,0.000131,0.000171,0.000116,3e-06,0.000113,0.000131,0.000238,0.000239,0.000303,0.000111,3.2e-05,7.8e-05,3.4e-05,0.000229,0.000167,0.000117,0.000202,0.000156,0.000165,0.000137,0.000159,9.5e-05,0.000135,5.4e-05,4.5e-05,0.000197,0.000198,5.4e-05,0.000102,8.4e-05,0.000225,8.7e-05,3.1e-05,2.2e-05,4.6e-05,1.3e-05,9.5e-05,4.4e-05,3.7e-05,7e-05,5.2e-05,1.7e-05,7e-06,4.1e-05,0.000106,2.6e-05,1.7e-05,1.8e-05,2e-06,8e-06,8e-06,1e-06,8e-06,2e-06,2.9e-05,1.1e-05,6e-06,4e-06,5e-06,3e-06,3e-06,4e-06,4e-06,2e-06,5e-06,0,2e-06,2e-05,4e-06,4e-06,1.3e-05,0.00024,6.7e-05,4.1e-05,0.000108,2e-05,1e-05,5e-06,4e-06,7e-06,4e-06,5e-06,3e-06,5e-06,2e-06,6e-06,6e-06
3e-06,2e-06,3e-06,1e-06,2.1e-05,2.7e-05,6.4e-05,4.3e-05,6e-06,1.4e-05,5e-06,4e-06,1.7e-05,2e-06,5e-06,4e-06,1e-06,0,1e-06,1.4e-05,4e-06,3.7e-05,9.1e-05,1.1e-05,1.2e-05,1e-05,1.4e-05,5e-06,1.6e-05,5.4e-05,2.4e-05,4e-06,1e-05,8.4e-05,0.000116,0.000158,7.3e-05,4.8e-05,7.9e-05,9.9e-05,0.000133,0.00023,0.000261,9.9e-05,2.6e-05,6.4e-05,7.5e-05,0.000179,0.000131,0.000145,0.000153,0.000204,0.00023,0.000158,6.9e-05,0.000114,0.000102,6.5e-05,3e-05,0.000195,0.00021,4e-05,9.3e-05,6.8e-05,0.000205,9.7e-05,1e-05,1.2e-05,4.6e-05,8e-06,9.5e-05,4.6e-05,3.6e-05,6.9e-05,5.6e-05,1.9e-05,2e-06,4.2e-05,8.5e-05,1.7e-05,1.8e-05,2e-05,1e-05,9e-06,4e-06,3e-06,8e-06,0,1.4e-05,5e-06,6e-06,3e-06,3e-06,2e-06,4e-06,6e-06,0,2e-06,4e-06,2e-06,3e-06,2.5e-05,8e-06,5e-06,9e-06,0.000241,4.6e-05,4.6e-05,0.000112,2.5e-05,1.7e-05,3e-06,1e-06,5e-06,2e-06,1e-06,3e-06,5e-06,3e-06,9e-06,2e-06
