0.101511,0.093557,0.09089,0.08666,0.072132,0.064225,0.065606,0.06281,0.059863,0.066965,0.069267,0.063056,0.054644,0.054917,0.06384,0.063191,0.065324,0.074885,0.078721,0.082943,0.085164,0.069474,0.059268,0.065468,0.068507,0.065948,0.060185,0.066404
0.118659,0.109768,0.10582,0.101865,0.087241,0.079479,0.082,0.079164,0.07482,0.08334,0.086889,0.079646,0.069051,0.066882,0.075942,0.076384,0.080666,0.092464,0.097179,0.104039,0.108354,0.087393,0.072505,0.079331,0.08235,0.079611,0.074304,0.083703
0.147111,0.137484,0.130874,0.127834,0.113896,0.106639,0.110436,0.106777,0.099716,0.110064,0.115837,0.1068,0.092978,0.08691,0.095266,0.097197,0.104885,0.119245,0.125282,0.136249,0.143954,0.116517,0.094914,0.101711,0.104091,0.101167,0.097681,0.111867
0.16672,0.157158,0.151605,0.149338,0.13501,0.130099,0.134266,0.126918,0.116383,0.125967,0.134715,0.125883,0.110053,0.102583,0.10852,0.108964,0.117141,0.130971,0.137155,0.149111,0.159407,0.135583,0.113435,0.118386,0.119401,0.114555,0.112788,0.12807
0.175451,0.164408,0.165388,0.161964,0.146368,0.14675,0.152096,0.141807,0.128408,0.13309,0.143419,0.133828,0.116079,0.112347,0.116016,0.112444,0.11825,0.127672,0.130883,0.137854,0.150189,0.147721,0.134711,0.13567,0.133431,0.119568,0.116135,0.128831
0.196122,0.182009,0.192826,0.187206,0.176055,0.186579,0.190852,0.179385,0.164953,0.160507,0.166031,0.149846,0.130094,0.13128,0.132448,0.128902,0.135044,0.137132,0.134391,0.135189,0.151121,0.175642,0.173056,0.168116,0.160399,0.130319,0.117845,0.127823
0.278196,0.270431,0.289576,0.273123,0.261563,0.284643,0.29515,0.280308,0.255128,0.240538,0.24266,0.218534,0.193879,0.196891,0.195507,0.194582,0.204456,0.202287,0.197558,0.193001,0.206609,0.235575,0.22561,0.212131,0.202851,0.167481,0.150023,0.158959
0.469011,0.473887,0.501022,0.456315,0.431979,0.474718,0.502243,0.471233,0.419264,0.392848,0.400219,0.372572,0.33721,0.337883,0.329364,0.330183,0.343983,0.337991,0.34314,0.333337,0.319574,0.322221,0.302854,0.281329,0.270932,0.246781,0.228292,0.231109
0.801697,0.820459,0.860363,0.768207,0.733099,0.802568,0.842716,0.779524,0.687994,0.640347,0.650271,0.621115,0.572947,0.570274,0.554114,0.560399,0.577112,0.560591,0.58026,0.565737,0.513557,0.478484,0.449161,0.413406,0.393706,0.382757,0.357598,0.346378
1.246513,1.272958,1.33649,1.192756,1.174971,1.270903,1.305394,1.19699,1.052443,0.963839,0.957494,0.930249,0.880978,0.884903,0.861531,0.874684,0.898375,0.858918,0.883148,0.860787,0.774376,0.707581,0.662798,0.613035,0.578501,0.570065,0.534148,0.501871
1.653229,1.683514,1.792009,1.611375,1.644648,1.754515,1.750634,1.588485,1.392382,1.262857,1.214878,1.187042,1.162869,1.189771,1.159441,1.173352,1.202692,1.127874,1.144213,1.11075,1.002946,0.920513,0.859833,0.817085,0.780482,0.761512,0.713176,0.657088
1.800694,1.820894,1.964587,1.78657,1.885066,1.989184,1.930833,1.727337,1.502427,1.378243,1.286656,1.243835,1.26206,1.321279,1.286345,1.283616,1.316459,1.215138,1.207712,1.157792,1.052411,0.984543,0.913873,0.901755,0.888571,0.855442,0.800301,0.73028
1.556302,1.539941,1.665802,1.548124,1.687182,1.765168,1.669713,1.466531,1.260071,1.20429,1.123806,1.069298,1.098234,1.161126,1.1234,1.087009,1.113741,1.024157,0.994685,0.933598,0.85738,0.831452,0.764538,0.778007,0.801419,0.770296,0.720619,0.661835
1.055661,0.992979,1.067398,1.046258,1.179391,1.201896,1.085715,0.942922,0.820384,0.833725,0.800445,0.761474,0.775079,0.799299,0.761148,0.706672,0.711886,0.668062,0.637489,0.600502,0.574356,0.575233,0.536402,0.548987,0.580294,0.562647,0.530816,0.511806
0.690571,0.639827,0.665243,0.717798,0.816996,0.767796,0.606265,0.533417,0.540551,0.565971,0.547505,0.536693,0.540855,0.534765,0.516002,0.466247,0.454887,0.483963,0.489234,0.512629,0.508122,0.45632,0.442183,0.473631,0.48582,0.466189,0.45356,0.481241
0.728664,0.761595,0.789407,0.821735,0.86093,0.771154,0.555098,0.502457,0.573747,0.586689,0.567121,0.571737,0.582678,0.587229,0.575806,0.516756,0.531194,0.598366,0.609158,0.700942,0.700786,0.576712,0.551647,0.637476,0.6852,0.645084,0.618257,0.6557
0.953567,1.082697,1.17592,1.109571,1.032614,0.949593,0.709588,0.631117,0.732255,0.785504,0.768563,0.738256,0.749794,0.817134,0.784648,0.66672,0.703324,0.769718,0.773231,0.929528,0.939073,0.782275,0.756482,0.901607,1.021797,0.946897,0.864009,0.893199
1.189331,1.413724,1.63703,1.448057,1.193179,1.143142,0.884028,0.750331,0.92426,1.046981,1.027019,0.936777,0.932626,1.078967,1.003747,0.846322,0.914732,0.942036,0.939655,1.107431,1.089131,0.981479,1.0311,1.220189,1.371561,1.213811,1.053146,1.110322
1.419504,1.704532,2.104335,1.851457,1.409082,1.349939,1.041895,0.849815,1.113247,1.307811,1.303366,1.164511,1.084941,1.296392,1.25534,1.126949,1.171565,1.065638,1.069214,1.205925,1.122478,1.155725,1.378344,1.5518,1.60665,1.333556,1.13138,1.282696
1.702445,1.965148,2.462397,2.181377,1.538198,1.410891,1.13362,0.928083,1.216129,1.484202,1.537788,1.368669,1.208363,1.430602,1.46021,1.434844,1.421957,1.126133,1.109172,1.225372,1.139146,1.333619,1.729064,1.815263,1.666528,1.297339,1.119963,1.396677
1.842266,2.024279,2.46947,2.180795,1.443697,1.227006,1.099702,0.93418,1.121665,1.497549,1.685022,1.463612,1.196619,1.338212,1.408334,1.523749,1.503144,1.100292,1.079958,1.198182,1.161723,1.449902,1.89733,1.845645,1.531096,1.200087,1.08139,1.366505
1.658581,1.745319,1.967717,1.778847,1.2296,0.958494,0.933644,0.814556,0.909844,1.34163,1.609278,1.42475,1.129981,1.119164,1.137101,1.291698,1.291811,0.942481,0.988306,1.162205,1.135135,1.343699,1.736761,1.636886,1.300277,1.045744,0.967306,1.165503
1.222002,1.286924,1.282748,1.187821,0.989178,0.8124,0.758074,0.666926,0.791842,1.126846,1.323112,1.22736,1.020826,0.962463,0.915112,0.948812,0.938082,0.728555,0.793818,0.995184,0.96237,1.039014,1.282508,1.184979,0.982251,0.825084,0.746671,0.88089
0.878484,0.918327,0.820742,0.784788,0.834998,0.75147,0.631657,0.569536,0.739339,0.955144,1.05816,1.003498,0.946917,0.950957,0.831221,0.703612,0.672385,0.628218,0.681545,0.872216,0.856305,0.781338,0.810878,0.822129,0.763239,0.652671,0.586406,0.66887
0.755217,0.75457,0.670247,0.652147,0.752256,0.71705,0.617423,0.573468,0.723106,0.934071,1.07686,1.013643,0.970777,0.975987,0.775915,0.605318,0.636342,0.688315,0.770461,0.951534,0.94757,0.778406,0.615016,0.698307,0.695776,0.614309,0.607028,0.597537
0.786795,0.754207,0.663454,0.635314,0.701021,0.693731,0.700051,0.669499,0.797339,1.065518,1.235905,1.130281,0.975825,0.908062,0.69651,0.574787,0.732617,0.825518,0.904131,1.060251,1.06177,0.93824,0.680993,0.717137,0.708863,0.631781,0.653625,0.598422
0.906267,0.799489,0.737956,0.719779,0.692761,0.653257,0.819577,0.863301,0.987607,1.266703,1.359353,1.183336,0.910485,0.766097,0.624704,0.610583,0.879618,0.985861,1.091514,1.202006,1.136236,1.041929,0.790073,0.815709,0.781752,0.653504,0.609373,0.560339
0.985321,0.758483,0.762363,0.803671,0.692645,0.588043,0.89968,1.027915,1.096481,1.352169,1.333898,1.138585,0.895166,0.712584,0.597444,0.647583,0.981949,1.123968,1.258615,1.321882,1.14603,1.022307,0.847392,0.877893,0.801951,0.63651,0.51748,0.487376
0.918501,0.608058,0.658686,0.753127,0.635577,0.560271,0.901689,1.02703,0.991654,1.161293,1.094179,0.963787,0.854556,0.705025,0.552996,0.592737,0.923215,1.099298,1.226537,1.224508,1.02559,0.946048,0.835509,0.816274,0.72483,0.580437,0.438474,0.40288
0.730707,0.473288,0.488836,0.567381,0.480888,0.45818,0.723798,0.840707,0.739915,0.765219,0.760585,0.736316,0.685882,0.586336,0.462979,0.468172,0.6893,0.853923,0.947805,0.900956,0.767318,0.764524,0.687748,0.620098,0.561858,0.468583,0.361772,0.338942
0.522395,0.461132,0.408269,0.402271,0.337146,0.313021,0.450186,0.569361,0.519096,0.463761,0.478808,0.493451,0.487814,0.436657,0.372266,0.346106,0.431385,0.554484,0.639115,0.60099,0.504804,0.507079,0.479357,0.402153,0.348197,0.309872,0.293747,0.313118
0.371217,0.41631,0.361341,0.294908,0.236955,0.247451,0.29324,0.365663,0.422866,0.388985,0.326866,0.324448,0.338768,0.298114,0.278279,0.266253,0.292307,0.357007,0.411556,0.401811,0.31683,0.312411,0.347169,0.330419,0.258033,0.217879,0.262131,0.293142
0.294856,0.33553,0.309831,0.241731,0.174742,0.219004,0.264007,0.27191,0.336741,0.334571,0.253749,0.282709,0.294437,0.215776,0.222258,0.237998,0.23411,0.253856,0.297677,0.33005,0.266695,0.214242,0.239864,0.281952,0.24669,0.194293,0.239427,0.279758
0.221091,0.242355,0.270353,0.237837,0.152413,0.189265,0.232918,0.199579,0.228306,0.250375,0.230455,0.266552,0.237753,0.159914,0.196846,0.225325,0.201283,0.20557,0.253091,0.289114,0.248291,0.185482,0.169582,0.206678,0.209196,0.159659,0.191548,0.235725
0.162642,0.149664,0.209155,0.210001,0.138452,0.192034,0.225451,0.168365,0.161072,0.186515,0.20639,0.209888,0.17841,0.160709,0.186337,0.201298,0.194529,0.181885,0.200665,0.221225,0.202091,0.161297,0.146732,0.163477,0.184085,0.15122,0.151507,0.173036
0.117241,0.089986,0.137976,0.158311,0.128283,0.205414,0.241548,0.181277,0.171369,0.18683,0.175596,0.136769,0.129755,0.168537,0.161319,0.16542,0.19373,0.175614,0.17409,0.190504,0.191397,0.136958,0.129281,0.16348,0.185842,0.166477,0.129013,0.119946
0.086179,0.065104,0.097638,0.121493,0.127842,0.201231,0.233796,0.200001,0.203353,0.200159,0.152503,0.108172,0.119295,0.168109,0.131012,0.134423,0.177562,0.167668,0.17956,0.205327,0.207269,0.139028,0.119008,0.172082,0.199579,0.178748,0.12658,0.093526
0.070358,0.059587,0.089446,0.124321,0.138669,0.174642,0.190346,0.18531,0.209198,0.201432,0.144656,0.113565,0.123257,0.146876,0.104437,0.108265,0.151784,0.162541,0.187953,0.21752,0.199778,0.14575,0.121148,0.179186,0.208713,0.173996,0.121801,0.082683
0.076175,0.068033,0.086633,0.133225,0.15729,0.170134,0.173203,0.14408,0.179084,0.174207,0.118991,0.116379,0.123123,0.118416,0.092744,0.082372,0.131558,0.152637,0.174628,0.204864,0.174898,0.13964,0.113507,0.173878,0.191612,0.155071,0.110625,0.075004
0.089234,0.070473,0.073363,0.121665,0.183182,0.218476,0.194839,0.115212,0.13748,0.142638,0.092201,0.112009,0.114598,0.091242,0.082465,0.070023,0.137422,0.164251,0.165242,0.177254,0.179157,0.132734,0.110797,0.183858,0.172489,0.15288,0.111018,0.066092
