-0.000174,-0.000113,-1e-06,-0.000213,-0.000361,-0.000327,-0.000178,-0.002361,-0.001437,-0.00855,-0.005162,-0.00234,-0.010507,-0.005173,-0.002928,-0.003855,-0.003213,-0.001188,-0.000863,0.003316,0.002073,-0.012646,-0.020051,-0.026441,-0.019861,-0.015486,-0.028841,-0.018067,-0.019559,-0.00432,-0.027196,-0.012143,-0.011827,-0.022864,-0.012904,-0.018856,-0.016663,-0.020625,-0.018503,-0.019615,-0.020815,-0.017139,-0.015506,-0.010805,-0.01516,-0.013068,-0.014561,-0.012911,-0.015311,-0.014983,-0.008944,-0.006411,-0.004343,-0.004526,-0.004253,-0.008233,-0.004532,0.000173,0.00232,0.002776,0.001602,-0.002979,-0.001215,-0.001161,-0.000425,-0.004108,-0.002832,0.000426,0.000456,6.2e-05,9.2e-05,-0.000629,-0.000737,-0.000794,-0.000268,-0.000834,-0.000899,-0.000297,-0.0011,-0.000113,0.000374,-4.8e-05,-0.000197,0.000237,6.3e-05,0.000129,2.9e-05,0.000151,0.000568,0.000323,3e-04,-0.001795,-0.003484,0.002584,0.003209,0.001551,-5e-05,-0.000102,2.4e-05,-5.8e-05,9.8e-05,-0.00042,-0.000304,-0.000166,8.7e-05,-1.8e-05,-0.000135,-0.000114,-0.00019,-0.000176,9.9e-05,0.000104,0.000334,0.000122,7e-05,4.4e-05,4.2e-05,-1.1e-05,-0.000142,5.2e-05,3.1e-05
0.000119,3.6e-05,4.4e-05,0.000466,0.000415,0.000418,0.000191,0.000504,0.000822,0.002309,0.002673,0.001216,0.005101,0.003306,0.000825,0.001651,0.000419,0.002096,0.000209,-0.000854,-0.010184,-0.003302,0.001867,0.002417,-0.002134,0.004933,0.010012,0.002644,0.005568,0.008102,0.014115,0.00935,0.00725,0.005325,0.002339,0.008111,0.003556,0.001852,0.000922,0.006544,0.00294,6.1e-05,-0.000329,-0.002329,0.000466,0.001051,0.004133,5.2e-05,0.000875,0.000629,0.001177,0.001609,0.000225,-0.000345,-1e-06,0.001879,0.001724,0.000822,0.002794,0.003034,0.001614,0.007343,0.004864,0.00285,0.00137,0.000624,0.003578,0.002689,0.001562,0.001081,-5.6e-05,-1.9e-05,0.000455,0.00059,0.000372,0.000695,0.000722,0.000376,0.000551,7e-04,0.000552,0.000286,0.000298,0.000104,4e-05,0.00015,0.000109,-2.2e-05,0.000275,0.000182,0.000299,0.000117,7.8e-05,-0.002939,-0.001675,-0.00058,1e-04,4.5e-05,-0.00021,-6.6e-05,0.000158,0.00029,0.000105,6.6e-05,-2.8e-05,0.000153,4.1e-05,0.000121,0.000125,4.9e-05,0.000247,9.8e-05,0.000151,4.8e-05,0.000211,3.1e-05,5.9e-05,-0.000115,7.3e-05,0.000138,0.000133
-0.000316,-0.000231,8.6e-05,-0.000159,9.8e-05,-9.6e-05,-0.000226,-6.8e-05,-0.001428,9.5e-05,-0.001066,-0.000646,-0.0029,-0.001497,-0.001155,0.000643,0.000653,0.00119,0.002069,-0.002031,-0.010423,-0.00739,-0.010415,-0.010204,-0.012293,-0.008837,-0.011121,-0.00717,-0.003864,-0.011267,-0.016986,-0.011557,-0.007799,-0.003466,-0.005945,-0.010156,-0.008267,-0.00501,-0.007803,-0.007303,-0.007076,-0.00351,-0.002047,-0.000544,-0.004061,-0.003378,-0.003544,0.001741,-0.001826,-0.001612,-0.003147,-0.000712,-0.000581,0.000557,-0.001275,-0.002889,-0.00164,-0.000417,0.000563,0.00137,0.000425,-0.001025,-0.000211,-0.000429,-5.7e-05,0.000358,-0.002211,-0.00049,0.000371,6.1e-05,-0.00014,1.9e-05,-0.000122,-0.000348,-0.00018,-0.000429,-0.000368,5.6e-05,-0.00069,-0.000324,9.8e-05,-5.4e-05,-9.5e-05,-0.000243,-9.9e-05,2.5e-05,-9.2e-05,7e-06,-0.00011,0.000149,-2.9e-05,-0.000211,0.001068,-0.00132,-0.001854,-0.000819,-8e-05,-0.00029,-0.00018,-6.4e-05,-6.4e-05,5.9e-05,-0.00021,-0.000189,-0.000314,-0.000232,-0.000247,-0.000107,-0.000215,-3e-05,0.000201,1.2e-05,2.4e-05,8.4e-05,8.3e-05,-0.000117,-0.000206,-9.1e-05,-4.1e-05,-5.3e-05,2.9e-05
3.6e-05,-6.2e-05,2.1e-05,0.000109,-0.000259,-0.000116,-2.6e-05,0.000285,0.000974,-0.000597,-0.000396,-6.7e-05,0.000539,-0.001472,-0.000628,-0.001628,-0.001049,0.00017,-0.00032,-0.002073,-0.001023,0.001748,-0.006937,0.006019,0.014153,-0.001436,0.006576,0.002574,-0.005754,-0.00661,0.001973,0.002673,-0.001074,-0.00269,-0.00362,0.001358,0.002197,0.000813,0.001186,-0.002103,0.001208,0.000158,0.007374,0.003251,0.001274,-0.000415,0.002088,-0.001381,0.001651,0.00086,0.001196,-0.001354,0.000154,-0.000114,-0.000214,0.000861,0.000887,-0.000423,-0.000152,-0.000562,-0.000615,0.000977,0.000139,-0.000494,0.000176,0.000236,-0.000697,0.000143,-0.000166,0.000234,-0.000113,6.3e-05,0.000196,7.7e-05,-0.000283,-5e-05,0.000161,6.6e-05,0.000149,-5.3e-05,-0.000227,4.4e-05,0.00015,4.7e-05,-0.000127,2.3e-05,3.5e-05,7.8e-05,-0.000187,-1.7e-05,0.000175,0.00024,-0.000684,-0.000446,-0.000662,-0.000444,-2.7e-05,1.4e-05,-6.7e-05,-4.8e-05,-5e-06,3e-05,-6.6e-05,6.4e-05,7.6e-05,9.4e-05,-6.2e-05,3.2e-05,4.7e-05,4.1e-05,2e-05,-0.000108,-1.1e-05,-6.4e-05,-2.8e-05,1.6e-05,-4.1e-05,-7.1e-05,-4e-06,-9.5e-05,-4.7e-05
0.000105,4.5e-05,1.6e-05,3.2e-05,-0.000103,0.000222,7.5e-05,0.000132,-0.000278,0.000786,0.000393,-3e-06,-0.000385,0.000408,0.000701,0.000297,0.000213,0.000526,-0.000338,-0.002136,0.001598,0.002006,-0.000166,-0.002229,-0.001396,0.002429,-0.005838,-0.003992,-0.000255,-0.000749,-0.008711,-0.002078,-0.001729,0.000285,-0.000135,-0.000824,0.000167,-0.001749,-0.002148,-0.002983,0.000496,0.004816,-0.000672,0.000699,0.002601,0.003574,0.001452,0.001696,-0.000863,0.001488,0.000458,0.000835,0.000459,4e-06,-0.000262,0.00059,0.000521,-0.000166,-0.000858,-0.001273,-0.000484,0.000706,-0.003379,-0.001744,-0.000349,6e-06,-0.000983,-0.000711,-0.000119,0.000397,-8.9e-05,-0.000129,-0.000134,0.000105,-1.6e-05,7.9e-05,-5.2e-05,0.000212,0.000104,0.000273,-2.3e-05,-0.00014,-4.5e-05,6e-05,-5.5e-05,8.2e-05,-2.1e-05,0.000127,-9.4e-05,2.9e-05,0.000161,0.000197,-4e-05,-0.000381,-0.000802,-0.000487,-0.000197,6.7e-05,6.6e-05,-4.3e-05,6e-06,3.7e-05,-5.3e-05,-3.3e-05,-7.6e-05,9.1e-05,0.000123,6.5e-05,-5.6e-05,-9e-05,2.7e-05,1.9e-05,9.3e-05,1e-04,2.1e-05,-3.4e-05,7.5e-05,0.000172,0.000194,2e-05,-3.5e-05
-4e-06,0.000109,-2e-06,-3.5e-05,-3.6e-05,-0.000214,3e-06,-8.7e-05,-5.9e-05,-0.000537,-0.000681,-0.00025,-0.000508,-0.000255,-0.000867,0.000729,0.000419,-0.001348,-0.001013,-0.000959,0.002167,0.003394,-0.000791,-0.009766,-0.007719,-0.004819,-0.000457,0.007985,0.004215,-0.005983,0.006294,-0.001206,-0.005159,0.000866,-0.001737,0.002182,-0.001562,-0.004103,-0.001392,-0.000463,-0.000472,-0.002305,-0.000594,-0.003172,-0.000666,-0.003441,-0.002944,-0.001087,-0.001316,0.001024,-0.000456,0.000531,-0.000367,0.001677,0.000738,0.001486,-0.000199,0.000432,-0.001013,-0.001879,-0.001002,-0.000154,0.000861,0.000172,-9.1e-05,4.6e-05,-0.000714,-0.000288,-0.000325,-0.000476,-0.000378,0.00023,3.9e-05,-3.9e-05,0.000121,1.5e-05,3e-06,-9.5e-05,3.9e-05,-6.6e-05,-3e-04,-5e-05,0.000142,2.2e-05,-4e-05,-4e-05,-4.6e-05,-5.1e-05,5e-06,-9.3e-05,-1e-04,0.000215,-0.000123,0.000331,0.000186,-0.00031,-0.000161,5e-06,0.00011,2.7e-05,-2.7e-05,-0.000101,5.5e-05,7.4e-05,6.9e-05,0.000111,-9.8e-05,-1.6e-05,8.3e-05,5.7e-05,-8.2e-05,-4.4e-05,2.3e-05,4.2e-05,-3.4e-05,-6.3e-05,1.7e-05,-1.4e-05,-8e-06,-8.7e-05,-2e-05
3e-06,-6e-05,-8.4e-05,-0.00018,-0.000158,-8.7e-05,-0.000183,-1e-05,0.000201,0.000153,0.00047,-0.000274,-0.000141,6.8e-05,-0.000381,-0.000288,-0.000338,9.4e-05,-0.000681,-0.000526,0.001255,-0.005487,-0.001522,-0.003433,-0.002789,-0.000799,-0.001975,0.001592,-0.000884,0.01024,0.002933,-0.002939,0.003007,-0.000353,0.006157,-0.001526,0.000225,-0.000273,-0.000941,0.003713,-0.000619,-0.00358,-0.00157,0.002051,0.001127,0.002833,-0.000921,-0.000932,0.001131,-0.001849,0.001234,0.000245,-0.000937,-0.002206,-0.000782,-0.001031,0.000327,-0.000241,-0.000594,-0.001631,-0.001151,0.000184,-0.002204,-0.001305,-0.00023,-8.8e-05,6.7e-05,-0.000669,-0.000971,-0.000385,-1e-04,3.2e-05,0.000104,0.000117,-7.3e-05,-0.000212,2.6e-05,4.5e-05,8e-05,-9e-06,-0.000369,-0.000189,-0.000128,-4e-05,7.3e-05,-1.5e-05,-0.000101,-6.3e-05,-4.2e-05,-0.000122,-0.000144,0.000227,0.000198,-0.00033,7.2e-05,-0.000263,-0.00018,-4.1e-05,1.8e-05,5.7e-05,-3.3e-05,-7.4e-05,-5.2e-05,-0.000161,-8.7e-05,-0.000112,-2e-06,2.2e-05,2.2e-05,1e-05,-5.9e-05,-5.4e-05,-5.1e-05,-0.000158,-4e-06,-1.4e-05,-2.3e-05,-0.000122,-0.000136,-9e-06,-4.2e-05
-6.6e-05,-1.2e-05,-3.9e-05,-3.7e-05,7.3e-05,-5.5e-05,7.3e-05,-0.000107,-0.000144,-0.000295,-0.000241,-9.2e-05,-3.9e-05,-9.9e-05,-0.001027,-0.000523,0.000625,0.000222,-0.00094,-0.00069,0.000878,0.004682,0,0.003224,0.004511,0.002768,0.00046,-0.003312,7.5e-05,-0.00037,0.000912,-0.000959,-0.004103,0.003417,-0.002988,-0.00223,-0.002919,0.000193,0.004574,-0.000765,0.000828,0.002489,-0.000654,-0.002327,-0.000749,-0.002493,-0.001939,0.001838,-0.001461,-0.000972,-0.000413,0.000333,0.00053,6.3e-05,0.001406,0.00095,0.000289,-0.000287,-0.000405,-0.000602,-0.001133,-0.000509,0.000107,-0.000753,-0.000252,-0.000386,0.000481,0.000538,-0.000293,-0.000152,-0.000167,-0.000127,-0.000236,4e-06,2.4e-05,-6e-06,7e-06,5e-05,2.7e-05,4.1e-05,3.5e-05,-0.000255,-0.000131,3.4e-05,-6.3e-05,-7.7e-05,-8.1e-05,-7e-05,-9.6e-05,-0.000176,-0.000147,-0.000106,3e-05,-0.000197,-0.000137,-3.1e-05,-5.7e-05,-3.7e-05,-6.7e-05,-4e-05,1.9e-05,-0.000114,-7.5e-05,1.1e-05,-6.7e-05,-4.9e-05,-0.00013,-9.9e-05,2.4e-05,7.7e-05,7e-06,-7.7e-05,-6.3e-05,-8e-05,-2e-05,3.6e-05,-4.1e-05,-1.8e-05,-6.5e-05,2.4e-05,6e-05
1.7e-05,-6.8e-05,2.4e-05,2.7e-05,-0.000139,-7.5e-05,-7.1e-05,8.2e-05,-7.2e-05,0.00032,0.000185,0.000176,6.9e-05,-6.5e-05,-0.000296,-0.000597,1.6e-05,-0.000135,-0.000295,-0.000706,-0.000705,-0.00171,-0.001556,0.003106,0.003583,-0.004873,-0.000385,-0.001509,0.000416,-0.000521,0.00075,0.003274,-0.000545,-0.001834,-0.000413,0.000601,0.001951,0.003594,-0.001281,0.000806,-0.00011,-0.001342,0.001646,-0.001102,-0.002471,0.001332,0.000161,-0.002507,0.001104,0.001129,-0.00026,-0.000955,-0.00024,-0.000459,0.000122,-0.001208,-0.000664,0.000338,0.000326,0.000836,-0.000437,-0.000801,-0.00061,-4.4e-05,-0.000536,-0.000455,-0.000478,-0.000228,-0.000964,-0.000408,-0.000147,7e-06,0.000249,8e-05,-5.7e-05,-0.000108,-1.4e-05,-6.9e-05,0,-8.3e-05,0,-3.2e-05,-6.1e-05,5.3e-05,1.9e-05,-0.000102,-1.3e-05,-8e-06,-4.4e-05,-3.1e-05,-0.00015,7.9e-05,0.000116,0.000682,0.000197,0.000142,0.000108,1.4e-05,-1.2e-05,4.3e-05,-1e-05,-2.1e-05,-3.3e-05,-2.8e-05,-6.4e-05,-2.7e-05,8.3e-05,-2.2e-05,2e-05,-2.2e-05,3e-06,-5.4e-05,-7.1e-05,-0.000124,-4.1e-05,7e-06,-5e-06,-4.8e-05,-2e-06,-7e-05,-4.6e-05
-2.2e-05,8.4e-05,7.2e-05,-1.5e-05,4e-06,-2.8e-05,3e-06,2.7e-05,0.000121,-6e-06,5.7e-05,-4.2e-05,9.3e-05,-4.6e-05,0.000246,-0.000104,-0.000659,-1.5e-05,-0.000653,-0.000616,-0.000466,-0.000835,-0.000689,-0.000693,0.000962,0.004971,0.003765,0.003188,-0.004368,0.001924,-0.002876,-0.000474,0.003068,0.001736,-0.001323,-0.002631,3e-04,-0.003404,0.000303,-0.000676,-0.000372,0.000299,-0.00018,0.001281,0.001499,-0.000439,-0.000282,0.001629,0.000206,0.000373,-5.8e-05,0.000636,0.000815,0.000871,-0.000152,0.000567,0.000148,-0.000327,4.7e-05,-0.000316,-0.000186,-0.000357,-0.000445,0.00016,-0.000305,-0.000262,-1.6e-05,-7.8e-05,-0.000293,4.7e-05,2.6e-05,-6.6e-05,-0.000322,-6.6e-05,3e-06,-0.000112,4e-06,1.4e-05,8.2e-05,-6.4e-05,6.4e-05,-6.3e-05,-4.2e-05,8.2e-05,1.9e-05,2.3e-05,1.9e-05,1.2e-05,-3e-05,3.2e-05,-7.2e-05,7.7e-05,-1.9e-05,-0.000705,-8.2e-05,0.000158,-2.3e-05,-2.7e-05,4.7e-05,-3.9e-05,2.8e-05,-2.8e-05,3e-06,4e-06,2.2e-05,-2.1e-05,4e-05,1.2e-05,-2.4e-05,-2.1e-05,8e-06,4.1e-05,1.2e-05,-3.1e-05,-5.5e-05,3.9e-05,-4.7e-05,6.7e-05,2.6e-05,-3.8e-05,9e-06
-1.5e-05,-8e-06,-9e-06,-4.1e-05,-4.8e-05,3e-05,2e-05,-2.8e-05,-3e-05,-0.000127,-0.000233,0.000266,-0.000184,9.6e-05,-4.9e-05,-0.000128,0.000572,4.7e-05,0.000172,-0.000116,-0.000256,-3.1e-05,0.002775,0.001762,-0.000295,-0.001339,-0.000579,-0.002653,0.003491,0.000375,0.002387,0.001541,-0.000219,-0.003688,0.000995,6.7e-05,0.000104,0.000501,0.000768,0.001274,0.001585,-0.000305,-0.002039,-0.001378,-0.00092,-0.001545,0.000886,-0.002124,-0.000815,-0.00057,0.000161,-0.000174,-0.000188,-0.000444,-0.000214,-0.000701,0.000158,0.000219,9e-05,-0.000149,0.00035,-0.000469,-0.000211,-0.00017,-0.000553,-0.000232,0.000126,5.2e-05,0.000113,3.5e-05,-0.000175,-4.9e-05,0.000144,4.2e-05,8e-06,0.000167,-7e-05,1.2e-05,-2.8e-05,-1e-05,-6.4e-05,7.9e-05,-2.4e-05,8.6e-05,-2.8e-05,2.1e-05,-1e-06,5e-05,4.4e-05,7.7e-05,-4.8e-05,2.2e-05,8.9e-05,0.000332,-3e-05,5.7e-05,2.9e-05,-4.9e-05,-2.2e-05,-4.7e-05,-2e-06,5e-06,3.7e-05,8.7e-05,-2e-06,-2e-06,4.6e-05,-1e-05,6.5e-05,3.1e-05,-7e-06,1.3e-05,-5.1e-05,-1e-06,-4.3e-05,-2.1e-05,-1.1e-05,1.5e-05,3e-06,-1.1e-05,9e-06
-5.2e-05,6e-06,-6e-06,2.8e-05,4.3e-05,2.1e-05,-2.3e-05,-8.3e-05,-4.5e-05,7.1e-05,9.6e-05,-0.000335,0.000145,-0.000118,0.001249,-0.000155,0.000114,-9.4e-05,0.00051,0.000315,-0.000759,0.000332,0.000414,-0.002074,-0.000755,0.002598,-0.000598,-0.000775,-0.000858,-0.000908,-0.003052,-0.000911,0.00024,-0.000789,-0.000263,0.001097,-0.000282,0.000691,8.6e-05,-0.000438,0.001399,0.000825,0.001131,1.4e-05,-0.000209,0.000304,-0.000535,0.001501,0.000702,-1.4e-05,-0.000205,-0.000299,-0.000224,-0.000358,0.000369,0.000131,-1.6e-05,-0.000219,-6e-05,0.000185,0.000325,-0.00038,-0.000175,5.2e-05,-0.000299,-7.3e-05,-7.4e-05,-4.2e-05,0.000207,-0.000117,0.000206,2.8e-05,7.4e-05,2e-06,-4.4e-05,-5.7e-05,-8.8e-05,-3.9e-05,4.3e-05,1.4e-05,-3.1e-05,-7e-06,-3e-06,-2.3e-05,2.3e-05,2.7e-05,-5e-05,1e-06,0,-9e-06,-5e-05,-6.6e-05,8.1e-05,-4.8e-05,1.6e-05,-0.000167,-7.5e-05,-3.9e-05,-1.2e-05,-1.3e-05,7e-06,1.3e-05,-1.4e-05,-5e-06,-3.1e-05,4e-06,-9e-06,4.8e-05,6e-06,-1e-05,5e-06,-1e-06,-2.4e-05,-1.6e-05,1.5e-05,3.5e-05,-8e-06,-2.3e-05,-1.4e-05,5.5e-05,-3.4e-05
-3.6e-05,-3e-06,-3.6e-05,3e-06,-3e-06,-7e-06,1.9e-05,7.2e-05,6.1e-05,-3.3e-05,5.9e-05,0.000297,0.000229,1.8e-05,-0.000859,-0.000198,0.000249,5.7e-05,-0.000268,-0.000178,-0.000584,-0.000302,-0.000195,-0.001351,-0.000286,-0.00398,0.001082,-0.001526,0.000247,0.001976,0.000805,-0.001037,0.000651,0.000942,0.002493,0.000317,-0.001114,0.000474,0.000699,-0.00015,-0.000612,-0.000414,-0.001115,-0.000121,-0.000313,3.4e-05,0.000876,-0.000731,-0.001058,4e-06,0.000813,0.000629,-0.000285,0.000662,-0.000191,0.000158,-0.000178,0.00017,-0.000111,-1.2e-05,0.000137,-0.000199,-0.000202,-0.000102,0.000159,-4.5e-05,-0.000214,1.8e-05,-0.00017,-3.5e-05,6.9e-05,-6.3e-05,-0.000103,-6.3e-05,4e-06,1e-05,-1e-05,3.5e-05,-6.6e-05,-6.6e-05,-8.9e-05,-2.9e-05,-8e-06,-3e-06,-3.6e-05,-2.5e-05,7e-06,4e-05,1e-06,-3.9e-05,-7e-06,-4.4e-05,3.7e-05,-3e-06,4.7e-05,4.4e-05,7.1e-05,9e-06,-2.1e-05,1.7e-05,-5.1e-05,1.2e-05,-1e-06,2.3e-05,-2.3e-05,-6e-06,1.5e-05,-1.9e-05,4e-06,1.4e-05,-1.4e-05,5e-06,6e-06,-2e-06,-9e-06,-1.6e-05,2.3e-05,-1.1e-05,1.8e-05,1.7e-05,8e-06
-2.5e-05,-2e-06,-2e-06,4e-06,0,-2.7e-05,-1.9e-05,2.2e-05,-2.7e-05,4.4e-05,-2.3e-05,-0.00011,-0.000227,6.7e-05,0.000369,-3.2e-05,-0.000104,3.2e-05,-2.1e-05,-7e-05,-0.00045,-0.000579,-0.000714,0.00064,0.000367,-1e-05,-0.000307,0.001883,-1.2e-05,-0.001594,-0.000379,-0.000884,-0.001031,-9.2e-05,-0.000583,-0.000709,-9.8e-05,-0.00035,-0.000805,-0.000199,-0.000919,0.000146,0.001041,-0.000309,0.00041,4.3e-05,-0.000325,-0.000211,0.000674,-3.1e-05,-0.000925,-0.000559,-0.000121,-0.000241,-5.7e-05,-0.00023,0.00025,-8.3e-05,-2e-05,-8e-06,-0.000283,3.1e-05,0.000226,0.000118,0.000297,4.6e-05,-7.1e-05,-6.3e-05,0.000415,2.4e-05,0.000184,3.1e-05,-7.1e-05,3.9e-05,-7e-06,-2.6e-05,-1.8e-05,-1.3e-05,7.7e-05,5.1e-05,1.8e-05,3.1e-05,-3e-06,1e-05,1.4e-05,2e-05,-7e-06,1.8e-05,3e-06,-1e-05,9e-06,-5.2e-05,-1.2e-05,-1.9e-05,-6.7e-05,-2.2e-05,0.000119,1.1e-05,2.4e-05,-1e-06,1e-06,-1.8e-05,-5e-06,-6e-06,6e-06,-1.3e-05,-1.5e-05,3.3e-05,-4.1e-05,9e-06,2e-05,-7e-06,-8e-06,-8e-06,1e-06,0,8e-06,-1.1e-05,-1.3e-05,-2.1e-05,1.2e-05
-4e-06,1.7e-05,1.5e-05,5e-06,-2.7e-05,1.1e-05,1.6e-05,6.5e-05,-2e-06,-3.1e-05,-3e-06,-8.4e-05,0.000132,-5.6e-05,-0.000305,4.5e-05,-0.000101,-6.5e-05,-0.000221,0.000429,-0.000249,0.000859,0.000244,0.001673,-0.001,0.00091,0.000158,-0.000501,0.00105,-0.000208,-0.000912,-0.000513,8.6e-05,0.000123,0.001363,0.000729,0.000472,0.000111,0.000234,-0.000255,0.00092,7.6e-05,-0.00131,0.000395,-0.000309,0.000332,-0.000471,0.000248,-0.000102,-0.000392,0.000178,0.000375,0.000229,3.8e-05,-4.7e-05,2e-04,7e-05,-8.6e-05,-7e-06,0.000112,-3e-06,9.2e-05,-4.9e-05,-8.1e-05,-6.7e-05,5.4e-05,-0.000107,1.3e-05,-4e-04,7.5e-05,5.5e-05,-1.7e-05,-4.1e-05,-9.3e-05,5e-06,-7e-06,9e-06,5e-06,-4.9e-05,-2.5e-05,3.5e-05,1.2e-05,-1.7e-05,9e-06,-1.2e-05,-1.5e-05,1.3e-05,1.6e-05,8e-06,5e-06,2.3e-05,-4.7e-05,1.8e-05,-3.4e-05,2.7e-05,2.6e-05,-9.3e-05,3.8e-05,-3e-06,3e-06,2.5e-05,-2e-06,1.3e-05,-1.7e-05,3.2e-05,1e-05,2e-06,3e-06,-1.5e-05,-1.6e-05,-1.9e-05,-2e-06,5e-06,0,-7e-06,1.8e-05,2.5e-05,7e-06,0,-1.1e-05,1e-05
7e-06,-2.6e-05,-2e-06,-1.3e-05,2e-06,-6e-06,-1.5e-05,3.4e-05,2.9e-05,1e-05,-3.4e-05,8.6e-05,-0.000169,-2e-05,8.6e-05,0.00014,0.000179,1.9e-05,-0.000263,-4e-06,-0.000266,-0.000675,0.000341,-9.4e-05,-0.000745,-0.00069,-0.000391,0.001068,-0.000404,0.000942,0.001114,0.001084,0.000678,-0.00058,-0.000224,-0.000501,0.000418,-0.00057,-0.000203,0.000464,-0.000889,-6.1e-05,0.000625,2.6e-05,-4.3e-05,-0.000415,5e-06,0.00045,-8e-05,0.000336,-0.000386,-0.000262,0.000108,0.000214,-0.000196,-4.5e-05,-1.7e-05,0.000138,9.4e-05,3.4e-05,-7.5e-05,8.8e-05,-7.6e-05,-7.5e-05,-6e-06,-0.000153,-7.8e-05,3e-06,1.7e-05,-1.4e-05,2.6e-05,-2e-06,-1.5e-05,3.7e-05,-1.5e-05,-1.2e-05,1.1e-05,-1.9e-05,9e-06,-5e-06,3e-06,-1.8e-05,-4e-06,-7e-06,-1.3e-05,-1.4e-05,1e-06,-4e-06,-7e-06,6e-06,3e-06,-2.7e-05,1.7e-05,3.5e-05,1e-05,1e-05,-0.000124,4.7e-05,-1e-06,-5e-06,-7e-06,-6e-06,-1e-06,1.1e-05,-5e-06,3e-06,4e-06,1.5e-05,0,2e-06,5e-06,-2e-06,4e-06,-1.5e-05,-3e-06,-2e-06,1e-05,-1.1e-05,1e-06,5e-06,-9e-06
1.2e-05,-1e-06,1.3e-05,-8e-06,2.1e-05,1e-06,7e-06,-3e-06,-1.3e-05,-1.6e-05,9e-06,5e-06,3e-05,6.6e-05,-0.000175,-7.1e-05,-5.5e-05,-4.6e-05,5.3e-05,-5.8e-05,1.8e-05,0.000214,-9.5e-05,-0.000107,-0.000191,0.000575,0.000205,-0.000412,-6e-06,-0.000631,-0.00063,-0.000253,-0.000826,0.000686,0.000701,0.000307,2.8e-05,-0.000192,4.1e-05,-0.000327,7e-06,9.4e-05,-0.000518,-0.000235,0.000407,-6e-06,-9.2e-05,8.5e-05,6.4e-05,0.000205,0.000677,0.000132,0.000137,-0.000179,2.3e-05,-6e-06,-1.9e-05,-1.6e-05,-1.2e-05,-4.6e-05,-5.5e-05,0.000119,0.000127,0.000115,-5.5e-05,0.000125,-5.6e-05,-3.4e-05,-0.000175,-3.3e-05,1e-05,1.2e-05,-1e-06,2e-05,4e-06,-1e-05,9e-06,-9e-06,-1.5e-05,1.9e-05,-6e-06,-1.9e-05,-6e-06,-1.5e-05,-5e-06,-7e-06,-2e-06,-4e-06,-7e-06,6e-06,-1.7e-05,-2.3e-05,1.4e-05,-3.5e-05,-2.1e-05,-1e-06,5.6e-05,3.1e-05,-4e-06,-2e-06,-3e-06,1e-06,5e-06,-6e-06,-1.4e-05,-1.3e-05,7e-06,-7e-06,-5e-06,-5e-06,-9e-06,-7e-06,-4e-06,-1e-05,-2e-06,-3e-06,7e-06,1.5e-05,1e-06,1.7e-05,-1e-05
1e-05,-3e-06,-5e-06,-1e-06,-1.4e-05,2e-06,6e-06,-1.1e-05,-1.5e-05,1e-05,3.7e-05,3.9e-05,3.1e-05,-1.2e-05,0.00021,0.00018,4.3e-05,1.9e-05,-1e-05,-2.5e-05,7e-05,6.7e-05,0.00021,-0.000636,-0.000255,-0.000793,0.00056,0.001046,-0.000372,-0.000181,0.000402,0.000423,0.000546,-4.5e-05,-0.000689,-0.000309,-0.000683,0.000335,2.8e-05,-0.000111,0.000301,-0.000112,0.000299,0.000444,-0.000189,0.000237,-7.1e-05,-0.000292,-4.4e-05,-0.000224,-0.000587,-1.8e-05,-6.1e-05,-0.000131,5.9e-05,9.2e-05,-6.8e-05,-1.9e-05,-4.3e-05,-8.8e-05,2.7e-05,-2.5e-05,-0.000125,0,-5.8e-05,-7e-06,-6.9e-05,2.5e-05,-3.4e-05,-2.8e-05,2.7e-05,-8e-06,-2.7e-05,-1.6e-05,8e-06,1.2e-05,-2e-06,-1e-06,-2e-06,-1.4e-05,-2.4e-05,-5e-06,-1.1e-05,-1.5e-05,5e-06,8e-06,-9e-06,3e-06,-3e-06,6e-06,-2.4e-05,3e-06,-1.4e-05,3e-06,2e-06,-2e-06,-1e-06,8e-06,3e-06,1.1e-05,5e-06,-4e-06,-4e-06,2.5e-05,9e-06,3e-06,7e-06,5e-06,-4e-06,7e-06,4e-06,0,-2e-06,-1e-06,0,2e-06,2e-06,2e-06,3e-06,-2e-06,-1e-06
6e-06,-6e-06,-8e-06,6e-06,-4e-06,-4e-06,-1.1e-05,-1.5e-05,1.5e-05,-1e-05,-1.8e-05,-3.3e-05,-6e-06,-1.4e-05,-6e-05,-9.4e-05,-8.1e-05,-3.1e-05,3.8e-05,4.5e-05,5.9e-05,4.9e-05,1.9e-05,-0.000306,-0.000621,0.000157,-0.000683,-8.7e-05,0.00061,0.000291,0.000231,-0.000434,0.000209,0.000239,0.000383,-7.6e-05,0.000107,0.000238,-0.000207,-4.8e-05,4.2e-05,8.1e-05,7.8e-05,-0.000485,-2.6e-05,-0.000245,0.000124,-0.000193,-8e-06,5e-06,0.000325,2.7e-05,-5.9e-05,-7.4e-05,-6e-06,7e-06,6e-05,-2.8e-05,4e-06,5.3e-05,9.9e-05,-4.5e-05,7.2e-05,-4.2e-05,-1.9e-05,7.8e-05,-4.7e-05,-1.7e-05,8.4e-05,-6e-06,2.6e-05,1.3e-05,4.1e-05,-1e-06,-1.1e-05,-7e-06,2e-06,6e-06,-2e-06,0,-8e-06,9e-06,-2e-06,-9e-06,-8e-06,4e-06,-1e-05,7e-06,4e-06,3e-06,-1.4e-05,1.1e-05,-1.8e-05,6.4e-05,1e-05,-1.7e-05,1.6e-05,1e-06,-3e-06,-4e-06,-2e-06,5e-06,2e-06,2e-06,-1e-05,4e-06,-1e-06,-1.1e-05,-1e-05,0,-1e-06,9e-06,0,-1e-06,-5e-06,-3e-06,3e-06,2e-06,-1e-06,-6e-06,5e-06
0,-3e-06,-8e-06,5e-06,-1.1e-05,1e-06,9e-06,-1e-05,-1.5e-05,2e-06,-1.1e-05,-4.9e-05,-2.3e-05,1.9e-05,8.5e-05,-7.2e-05,-1.1e-05,-9e-06,6.8e-05,5.8e-05,8e-05,-0.000241,0.00035,0.000294,1.5e-05,0.000269,0.000411,-0.000208,-0.000467,-0.000746,-0.00033,-0.000172,-0.000341,-0.000107,-0.000563,0.000381,5.7e-05,-0.000252,-0.000141,-0.000184,-0.000195,-0.000216,-6.1e-05,0.000167,-0.000139,-4.7e-05,-4.2e-05,-1.3e-05,-4.5e-05,0.000135,-0.000185,-4.5e-05,-2.4e-05,0.000115,-1.3e-05,-9.1e-05,-3.3e-05,4e-06,1.7e-05,5.5e-05,5.7e-05,-4.5e-05,-2.4e-05,-1.9e-05,-7e-05,-1.9e-05,-1.8e-05,1e-05,3e-06,-1.9e-05,2.2e-05,2e-06,-3.5e-05,4e-06,4e-06,-6e-06,2e-06,3e-06,-5e-06,3e-06,-1e-06,7e-06,3e-06,-6e-06,4e-06,6e-06,1e-06,2e-06,-1e-06,-6e-06,-1.2e-05,5e-06,-8e-06,-0.000104,-1.3e-05,1e-05,6e-06,5e-06,4e-06,2e-06,-4e-06,-1e-06,3e-06,-2e-06,-6e-06,-5e-06,-3e-06,5e-06,7e-06,-5e-06,5e-06,-5e-06,-5e-06,-4e-06,-4e-06,-2e-06,-1e-06,0,-3e-06,-7e-06,5e-06
-5e-06,-8e-06,-3e-06,-1e-06,1.2e-05,-4e-06,-7e-06,3e-06,-7e-06,1e-06,4e-06,3.3e-05,-3e-06,-1.1e-05,-2.4e-05,-4.2e-05,6e-05,3.8e-05,-6.4e-05,-4.6e-05,8.4e-05,2e-04,-7.1e-05,0.000746,-0.000279,-1e-06,-7.5e-05,-0.00019,0.000182,0.000338,0.000479,-0.000166,0.000148,2.2e-05,0.000173,-0.000304,4.1e-05,-9.3e-05,-0.000176,0.00018,-7e-06,0.000184,-1e-05,-7.8e-05,-3.2e-05,9.1e-05,8.2e-05,3e-06,-0.000136,-9.3e-05,0.000171,8e-06,-6.2e-05,1.5e-05,3e-06,0.000124,-8e-06,2.4e-05,5e-06,-3.5e-05,-2.8e-05,-5.6e-05,-5.3e-05,2.2e-05,-4.2e-05,-2.3e-05,-2.6e-05,-8e-06,9.7e-05,2.3e-05,3.7e-05,-1e-05,1.7e-05,1e-06,-2e-06,1e-05,-4e-06,-1e-06,1e-06,-2e-06,1.3e-05,0,1e-06,-6e-06,-5e-06,1e-06,-1e-06,8e-06,-2e-06,-1e-05,3e-06,1.2e-05,6e-06,4.2e-05,0,-4e-06,-1.3e-05,-6e-06,2e-06,-8e-06,4e-06,-2e-06,0,6e-06,-5e-06,0,-4e-06,-1e-06,2e-06,0,-2e-06,1e-06,-2e-06,1e-06,0,5e-06,0,-7e-06,2e-06,9e-06,-5e-06
-7e-06,6e-06,6e-06,3e-06,-4e-06,1e-06,2e-06,9e-06,2.1e-05,1e-06,-6e-06,-1.1e-05,-2e-06,-8e-06,-7.6e-05,-3.9e-05,-4.3e-05,-2.8e-05,-4e-06,1e-05,3e-05,9.2e-05,9.5e-05,-0.000163,0.000265,-0.000356,0.000156,8.3e-05,-2.8e-05,0.000129,-0.000345,0.000143,0.000203,1.1e-05,-0.000365,0.000135,0.000158,8e-05,-1.5e-05,-8.4e-05,3e-06,-7e-06,7e-06,-0.000134,0.00015,2.5e-05,-9e-05,1.3e-05,9.9e-05,-0.000267,-8e-05,5.3e-05,6.7e-05,0.000132,2.9e-05,-8.3e-05,1.4e-05,1.3e-05,-2e-05,2.5e-05,-4.4e-05,-2.7e-05,6.6e-05,2.8e-05,-3.3e-05,-2.7e-05,-4.3e-05,-9e-06,-6.5e-05,1.5e-05,4e-06,2e-06,1.1e-05,-1e-06,3e-06,-9e-06,-6e-06,1e-06,0,-5e-06,2e-06,2e-06,-3e-06,-1e-06,-2e-06,-3e-06,3e-06,0,0,1e-06,7e-06,8e-06,-2e-06,-1.5e-05,3e-06,1.3e-05,-1.5e-05,-1e-06,-1e-06,-1e-06,-1e-06,-3e-06,2e-06,-1.4e-05,2e-06,3e-06,1e-06,3e-06,2e-06,-1e-06,-3e-06,1e-06,2e-06,-3e-06,1e-06,-5e-06,2e-06,2e-06,-1e-06,6e-06,-2e-06
-7e-06,-3e-06,7e-06,-5e-06,1e-06,2e-06,1e-06,5e-06,-1e-05,0,1.3e-05,1.5e-05,-3e-06,1.6e-05,0.000119,1.1e-05,2e-06,1e-06,-0.000103,5.5e-05,-6e-06,-0.000312,-4.8e-05,-0.000345,-8.4e-05,4.7e-05,-0.000185,-0.000307,-3.7e-05,-0.000348,0.000175,0.000164,-0.000201,-0.000194,0.00037,0.000165,-0.00018,-0.000114,-1.4e-05,-5.9e-05,-0.000139,-3.5e-05,-8.9e-05,0.000207,0.000127,-0.000137,5.1e-05,-7.1e-05,3.6e-05,0.000142,0.000102,-7.1e-05,4.6e-05,-8.3e-05,1.7e-05,1.1e-05,-4.7e-05,-6.5e-05,0,-1.5e-05,-6.3e-05,-1e-06,-4e-05,-3.1e-05,3.1e-05,-3e-05,-2.2e-05,2.1e-05,-2.2e-05,7e-06,2.5e-05,-3e-06,-3.4e-05,6e-06,-4e-06,-7e-06,-9e-06,0,1e-06,6e-06,-1e-06,-2e-06,-2e-06,-1e-06,2e-06,-2e-06,-1e-06,-1e-06,3e-06,4e-06,3e-06,4e-06,-1.1e-05,1.6e-05,2e-06,-1e-05,-1.3e-05,3e-06,0,-1e-06,1e-06,-1e-06,-1e-06,5e-06,1e-06,-3e-06,-3e-06,3e-06,-2e-06,2e-06,-1e-06,-3e-06,-1e-06,-3e-06,1e-06,4e-06,4e-06,-3e-06,0,-2e-06,-1e-06
-6e-06,-3e-06,-1e-06,-4e-06,-6e-06,-3e-06,-3e-06,2e-06,-7e-06,-2e-06,0,1.4e-05,4e-06,-7e-06,-0.000139,-2.7e-05,-3.9e-05,3.7e-05,-5.5e-05,-6e-06,-1.6e-05,0.000241,0.000164,-0.000273,-0.000253,0.000534,-0.000154,-0.000221,0.000101,0.000228,-7.1e-05,0.000105,0.00014,0.00018,-0.000227,-9.2e-05,-8.1e-05,5.2e-05,-0.000154,0.000107,5.7e-05,2.8e-05,0.000194,6.3e-05,-0.000139,1.8e-05,-3.7e-05,-1.9e-05,-6.8e-05,0.000103,-9.8e-05,6.4e-05,5e-05,-3e-06,3e-06,2.8e-05,2e-06,7.5e-05,-3e-06,-2.5e-05,1e-06,1e-05,0,-1.8e-05,1.8e-05,1e-06,-2.4e-05,-1.9e-05,-5.1e-05,-2e-06,1e-06,1e-06,3e-06,-3e-06,-1e-06,-1e-06,-8e-06,0,2e-06,-4e-06,-1.1e-05,-8e-06,-3e-06,2e-06,-3e-06,-4e-06,-1e-06,-5e-06,-1e-06,3e-06,2e-06,3e-06,-1.2e-05,5e-06,-6e-06,3e-06,1.3e-05,3e-06,0,-1e-06,1e-06,-1e-06,1e-06,-1e-06,-5e-06,0,5e-06,2e-06,2e-06,2e-06,0,1e-06,0,-4e-06,-2e-06,-4e-06,2e-06,4e-06,1e-06,-5e-06,3e-06
-6e-06,0,-1e-06,6e-06,-1e-06,0,5e-06,1e-06,1.1e-05,2e-06,-5e-06,2.3e-05,-8e-06,-1e-05,0.000144,2e-05,6e-06,-2.8e-05,4e-06,-8e-06,-5e-05,-6e-05,5.7e-05,1.8e-05,0.000571,-0.000456,0.000204,4.7e-05,5.6e-05,6.6e-05,-2e-06,-0.000115,-7.6e-05,-0.000119,0.000207,-2.7e-05,0.000136,5.1e-05,-4.7e-05,-0.000175,0.000142,3e-06,-0.00011,-0.000111,-1e-06,-3.1e-05,-7.2e-05,1.1e-05,4.8e-05,-0.000128,6e-06,-2e-05,-8e-05,3e-06,-7e-06,-5.9e-05,4.4e-05,-4.5e-05,1.5e-05,8e-06,1.9e-05,1.3e-05,3.1e-05,3.5e-05,4e-05,4e-06,-2.1e-05,1e-05,-4.2e-05,-3.1e-05,1.7e-05,2e-06,1.2e-05,-1e-06,2e-06,-2e-06,-4e-06,0,2e-06,2e-06,-7e-06,1e-06,-4e-06,-2e-06,4e-06,-2e-06,-2e-06,-2e-06,-2e-06,0,-3e-06,-2e-06,-1e-06,-4e-06,9e-06,0,1.2e-05,3e-06,0,1e-06,0,1e-06,1e-06,3e-06,-1e-06,2e-06,-4e-06,-2e-06,8e-06,-3e-06,4e-06,0,1e-06,-4e-06,-1e-06,1e-06,3e-06,0,1e-06,-4e-06,1e-06
-4e-06,0,-4e-06,-1e-06,2e-06,2e-06,-4e-06,-1e-06,-6e-06,0,0,-3.7e-05,-1e-06,1.3e-05,-5.5e-05,7e-06,2.6e-05,-5e-06,1e-06,1.9e-05,-6.3e-05,-8e-06,8.4e-05,0.000364,-7.7e-05,0.000302,-9.9e-05,0.000154,-0.000104,-0.000187,-0.000101,-3.2e-05,-8.9e-05,-1.9e-05,-0.000311,5.8e-05,-6.4e-05,2.6e-05,-2.8e-05,0.000144,-6.8e-05,4e-06,0.000171,8.8e-05,5.3e-05,0.000117,1.5e-05,-8e-06,-6.2e-05,-3.7e-05,5.5e-05,-4.6e-05,-2.1e-05,-9.1e-05,8e-06,5.4e-05,-1.6e-05,2.2e-05,-5e-06,3.2e-05,3.3e-05,2.4e-05,-3.9e-05,0,-2.6e-05,2.6e-05,-1.7e-05,-7e-06,0,-8e-06,-5e-06,-8e-06,1e-06,3e-06,-1e-06,-2e-06,1e-06,-2e-06,0,-2e-06,5e-06,0,-4e-06,2e-06,-2e-06,2e-06,-4e-06,-2e-06,0,-1e-06,-8e-06,-2e-06,4e-06,1.4e-05,-7e-06,-3e-06,4e-06,8e-06,-1e-06,-1e-06,-3e-06,1e-06,1e-06,6e-06,0,-1e-06,2e-06,-1e-06,1e-06,1e-06,-2e-06,-3e-06,-1e-06,-1e-06,0,0,2e-06,0,0,9e-06,-1e-06
-2e-06,2e-06,-5e-06,-2e-06,2e-06,-3e-06,2e-06,0,-3e-06,0,-2e-06,-1e-05,3e-06,-2e-06,7.1e-05,-3e-06,-2.3e-05,2.3e-05,3.7e-05,1.2e-05,-4.7e-05,-9.2e-05,-1.5e-05,0.00019,-2e-05,-0.000345,0.000186,0.000138,-1.7e-05,0.00017,-9e-06,-0.000112,0.000129,-0.00014,0.000185,-6.3e-05,-4.3e-05,-7.8e-05,-2.9e-05,-7.8e-05,-5e-06,-7.1e-05,-0.000119,-9e-06,-6.3e-05,-0.000151,-5.1e-05,9.7e-05,3.4e-05,0.00011,-3.7e-05,8.3e-05,-3e-05,2.1e-05,-5e-06,-2.5e-05,3e-06,-3e-06,-3e-06,-2e-06,1.7e-05,-1e-06,2.8e-05,-2.3e-05,-5.7e-05,1.3e-05,-2.3e-05,4e-06,4.4e-05,1.1e-05,3e-06,5e-06,-4e-06,3e-06,0,2e-06,3e-06,0,3e-06,4e-06,5e-06,0,0,2e-06,-1e-06,4e-06,0,2e-06,2e-06,-2e-06,-3e-06,-3e-06,0,-2.9e-05,0,6e-06,-1.8e-05,8e-06,0,-1e-06,2e-06,1e-06,0,-5e-06,-2e-06,-2e-06,-3e-06,-1e-06,0,-1e-06,2e-06,3e-06,0,-1e-06,1e-06,-1e-06,1e-06,1e-06,-1e-06,2e-06,0
0,-4e-06,3e-06,1e-06,0,2e-06,0,-2e-06,1.1e-05,0,2e-06,1.5e-05,-5e-06,-8e-06,-5.7e-05,1e-05,-1e-06,-1.6e-05,3.2e-05,-1.1e-05,-3.9e-05,0.000169,9.6e-05,-6.6e-05,0.000368,0.000226,-0.000207,-5.8e-05,-2.3e-05,-0.000107,8.7e-05,6.5e-05,1.3e-05,8.3e-05,-0.000246,5.2e-05,8.1e-05,2.2e-05,3.6e-05,7.3e-05,9.2e-05,6.1e-05,2.7e-05,-0.000125,3e-05,1.5e-05,-2.8e-05,-0.000124,2e-06,-3.8e-05,2.8e-05,-6.8e-05,2.3e-05,6.2e-05,-4e-06,-2.7e-05,2e-06,-1e-05,-3e-06,-1.1e-05,-9e-06,1e-06,-3e-06,0,-1.7e-05,1.6e-05,-1.4e-05,3e-06,-2e-06,1.5e-05,-1e-06,2e-06,-1.2e-05,-6e-06,0,-1e-06,4e-06,1e-06,-1e-06,-4e-06,2e-06,2e-06,1e-06,3e-06,0,2e-06,0,1e-06,0,-1e-06,-3e-06,-4e-06,-5e-06,1.9e-05,5e-06,-4e-06,-1.1e-05,4e-06,0,2e-06,1e-06,-1e-06,0,3e-06,-4e-06,2e-06,0,-2e-06,-1e-06,1e-06,-4e-06,0,1e-06,1e-06,-1e-06,1e-06,0,-3e-06,-1e-06,-3e-06,-1e-06
2e-06,2e-06,2e-06,0,-7e-06,-1e-06,-2e-06,-5e-06,-8e-06,-1e-06,2e-06,2e-06,4e-06,1.2e-05,5.2e-05,-1.3e-05,-1e-05,-7e-06,-4.4e-05,2e-06,-3.5e-05,-0.00011,3e-06,-0.000314,-0.000167,-1.3e-05,8.4e-05,0.000232,0.000104,-1.6e-05,-0.000191,2.9e-05,-4.4e-05,8.4e-05,0.000195,-6.3e-05,4e-06,1.4e-05,-2e-05,1.6e-05,-2.2e-05,2.8e-05,3.3e-05,8.8e-05,-1.5e-05,2e-05,3e-06,6e-05,-3.6e-05,-8e-05,-6.2e-05,3.2e-05,1.3e-05,4e-06,1e-05,2.8e-05,-5e-06,8e-06,8e-06,-1e-05,-7e-06,-3e-06,-2.5e-05,1.3e-05,-8e-06,1e-06,-1.3e-05,-1.2e-05,4.1e-05,-8e-06,1e-06,-4e-06,1.1e-05,4e-06,1e-06,-5e-06,2e-06,1e-06,1e-06,1e-06,-5e-06,-3e-06,1e-06,1e-06,-1e-06,-1e-06,1e-06,2e-06,-1e-06,-1e-06,-1e-06,-3e-06,-2e-06,8e-06,-6e-06,5e-06,1.8e-05,2e-06,1e-06,-3e-06,-2e-06,-1e-06,1e-06,-7e-06,0,0,-3e-06,1e-06,1e-06,1e-06,2e-06,-2e-06,-1e-06,-1e-06,-1e-06,0,0,3e-06,0,-4e-06,0
2e-06,0,3e-06,0,2e-06,-1e-06,2e-06,-6e-06,-5e-06,0,-5e-06,1.2e-05,0,0,-9e-05,4e-06,1.1e-05,7e-06,-8e-06,1.7e-05,-1.6e-05,-3.2e-05,6e-05,-7.7e-05,0.000101,-3.3e-05,-0.000101,1.9e-05,-5e-05,0.000186,0.000204,6.7e-05,5.6e-05,-2e-06,-0.000272,1.5e-05,-1.3e-05,-3e-06,8.3e-05,-3.2e-05,-6.4e-05,-5.3e-05,-8.4e-05,-7.7e-05,-4.8e-05,1.1e-05,-2.1e-05,-4.7e-05,3.7e-05,6.7e-05,4.9e-05,-6e-06,4.2e-05,-4.4e-05,-1.3e-05,0,4e-06,-1.1e-05,0,1.3e-05,-1.4e-05,-1.2e-05,3.7e-05,6e-06,9e-06,-7e-06,-1.6e-05,1.4e-05,-3.1e-05,1.1e-05,6e-06,3e-06,-1.7e-05,-5e-06,1e-06,-1e-06,0,0,0,4e-06,-1e-06,4e-06,-1e-06,1e-06,0,0,-2e-06,-1e-06,0,2e-06,2e-06,-1e-06,3e-06,-1.4e-05,5e-06,-2e-06,2e-06,0,-1e-06,3e-06,0,-1e-06,1e-06,-2e-06,-2e-06,-3e-06,2e-06,-1e-06,1e-06,-2e-06,-1e-06,2e-06,0,-1e-06,0,-1e-06,-1e-06,-3e-06,0,1e-06,0
2e-06,1e-06,1e-06,-2e-06,2e-06,0,-2e-06,-3e-06,1e-05,0,0,-1e-06,-3e-06,-9e-06,9.7e-05,-3.2e-05,2e-05,-4e-06,-5e-05,3e-06,0,0.000114,-3.4e-05,9.2e-05,0.000206,3.9e-05,2.1e-05,-7e-06,1.7e-05,-0.000132,-0.000133,7e-06,-3.6e-05,1.5e-05,0.000132,9.9e-05,6e-06,7e-06,4.3e-05,3e-05,6.1e-05,1.2e-05,0.000105,6.7e-05,4e-06,-5.7e-05,3.5e-05,2.5e-05,-6e-06,7.8e-05,-2.8e-05,-1e-06,1e-06,5.1e-05,-7e-06,-4.3e-05,-6e-06,1.5e-05,0,-1.4e-05,-2.4e-05,-6e-06,-2.7e-05,-1.5e-05,-1.7e-05,-1.4e-05,-1.7e-05,-1.1e-05,-3e-05,-1.2e-05,-3e-06,-2e-06,4e-06,3e-06,-1e-06,0,0,0,-1e-06,-8e-06,-2e-06,-2e-06,-1e-06,0,1e-06,-2e-06,-1e-06,-1e-06,1e-06,2e-06,1e-06,-1e-06,5e-06,8e-06,0,2e-06,-1.2e-05,-3e-06,-1e-06,-2e-06,1e-06,0,0,2e-06,-2e-06,1e-06,-2e-06,2e-06,-3e-06,1e-06,3e-06,-1e-06,1e-06,-1e-06,0,1e-06,0,2e-06,0,4e-06,2e-06
0,0,-3e-06,1e-06,3e-06,0,1e-06,1e-06,-4e-06,1e-06,1e-06,1e-06,0,8e-06,-5.3e-05,-1.2e-05,-1.7e-05,3e-06,-2.1e-05,-9e-06,4e-06,-8.5e-05,6.2e-05,0.000133,-0.000352,-0.00018,0.000114,-0.000245,6e-06,-2.6e-05,9e-05,-5.9e-05,3.2e-05,-4.8e-05,-0.000153,-0.000115,-6.8e-05,4.4e-05,3.9e-05,-4e-05,1.9e-05,1.8e-05,-0.000119,-8e-06,2.2e-05,2.6e-05,6e-06,-7e-05,1e-06,-6.3e-05,2.9e-05,1e-06,-1.9e-05,-1.3e-05,3e-06,4.3e-05,9e-06,-1e-06,-5e-06,1.9e-05,6e-06,-8e-06,5e-06,-3e-06,-3e-06,-5e-06,-1.4e-05,5e-06,-2e-06,-5e-06,1e-06,0,8e-06,-2e-06,1e-06,-4e-06,-1e-06,0,0,7e-06,-1e-06,-2e-06,-2e-06,2e-06,-2e-06,-2e-06,-1e-06,-3e-06,0,0,0,0,1e-06,-1.9e-05,-5e-06,0,3e-06,-4e-06,0,-1e-06,-2e-06,0,0,-2e-06,0,2e-06,2e-06,0,-2e-06,0,-2e-06,-1e-06,0,-2e-06,0,0,0,0,1e-06,1e-06,0
-1e-06,-1e-06,-2e-06,1e-06,-6e-06,0,-1e-06,5e-06,-3e-06,0,1e-06,-3e-06,1e-06,1e-06,3.6e-05,-4e-06,7e-06,1e-06,8e-06,5e-06,9e-06,2.9e-05,-1.3e-05,0.000122,9.2e-05,0.000252,-9.8e-05,6.4e-05,-6.3e-05,0.000128,4e-06,2.3e-05,-2.2e-05,3.8e-05,0.000169,3.8e-05,-7e-06,-2.9e-05,8e-06,5.5e-05,-4.3e-05,-1.2e-05,2.8e-05,8e-06,0,-8e-06,-1.9e-05,-1.4e-05,0,-2.1e-05,-2.1e-05,4e-06,-3.3e-05,-3.4e-05,4e-06,-3e-05,-1e-05,-1.9e-05,0,5e-06,1.7e-05,-1e-06,1.4e-05,1.5e-05,-4e-06,-4e-06,-1.4e-05,-2e-06,-4.2e-05,-3e-06,-7e-06,3e-06,-1.4e-05,0,0,-1e-06,-2e-06,0,-1e-06,-3e-06,4e-06,0,-2e-06,0,0,0,-1e-06,-1e-06,-1e-06,-1e-06,1e-06,1e-06,-1e-06,1.5e-05,5e-06,-2e-06,-4e-06,-3e-06,2e-06,1e-06,0,0,1e-06,6e-06,-2e-06,-2e-06,-2e-06,0,-2e-06,0,1e-06,1e-06,0,-1e-06,0,-1e-06,0,0,1e-06,-3e-06,-1e-06
-3e-06,2e-06,0,-2e-06,-1e-06,1e-06,0,6e-06,8e-06,0,1e-06,-1.7e-05,0,-8e-06,1.1e-05,-1.1e-05,-7e-06,-1e-06,3e-06,1.1e-05,1.2e-05,-3e-05,5.1e-05,-0.000104,6.5e-05,-0.000194,6.4e-05,-7.6e-05,2.2e-05,-0.000114,-6.5e-05,-6.5e-05,3e-05,-3.3e-05,-0.00012,6.9e-05,0.000113,-5e-06,4.6e-05,5e-06,1.7e-05,-2.2e-05,-1.5e-05,2.5e-05,3.7e-05,1.6e-05,-2e-06,2.1e-05,-1.6e-05,5.4e-05,-1e-06,4e-06,-2e-06,2.9e-05,-3e-06,1.1e-05,-4e-06,1.8e-05,6e-06,-1.3e-05,1.2e-05,-1e-06,-2.5e-05,-2e-06,1.2e-05,7e-06,-1.5e-05,-1e-06,3.6e-05,8e-06,1e-06,-4e-06,8e-06,1e-06,1e-06,1e-06,-2e-06,-1e-06,0,-1e-06,2e-06,-1e-06,-1e-06,-1e-06,0,2e-06,1e-06,0,0,-1e-06,-2e-06,1e-06,0,-9e-06,-2e-06,3e-06,-2e-06,-1e-06,0,-2e-06,2e-06,0,0,-2e-06,-1e-06,0,1e-06,-1e-06,1e-06,1e-06,-1e-06,-1e-06,0,-1e-06,0,2e-06,0,1e-06,0,-4e-06,0
-3e-06,-2e-06,0,2e-06,1e-06,-3e-06,1e-06,3e-06,-6e-06,0,-2e-06,1e-05,0,4e-06,-1.3e-05,4e-06,9e-06,6e-06,2.3e-05,-4e-06,8e-06,8e-05,-1.5e-05,-7e-05,-0.000319,0.000142,-0.000138,-2.3e-05,6.4e-05,1.5e-05,0.000117,6.4e-05,-3.8e-05,3.5e-05,0.000142,-8.2e-05,-9e-06,-4e-06,9.8e-05,-5.3e-05,2.5e-05,2.4e-05,8e-06,-4.4e-05,-5e-06,1e-06,-3.5e-05,0,1.4e-05,-2.5e-05,5e-06,-1.6e-05,1.6e-05,-1.6e-05,0,2.2e-05,3e-06,1e-06,-1e-06,-1.7e-05,3e-06,7e-06,2.4e-05,-1.1e-05,5e-06,9e-06,-1.1e-05,6e-06,0,-1e-06,-8e-06,0,4e-06,1e-06,-1e-06,-2e-06,-2e-06,0,0,3e-06,-1e-06,2e-06,0,-1e-06,-1e-06,2e-06,-1e-06,1e-06,1e-06,0,-2e-06,1e-06,3e-06,8e-06,-2e-06,-3e-06,7e-06,-1e-06,0,1e-06,-1e-06,0,0,-1e-06,-1e-06,2e-06,-1e-06,0,-2e-06,-1e-06,0,-1e-06,0,0,0,-2e-06,0,-2e-06,0,3e-06,1e-06
-3e-06,1e-06,3e-06,0,3e-06,2e-06,-1e-06,-1e-06,-2e-06,0,-1e-06,1.3e-05,-1e-06,0,2.2e-05,-1.4e-05,1.2e-05,-5e-06,6e-06,-6e-06,4e-06,-0.000101,2.6e-05,-6.5e-05,0.000101,-0.000157,0.000114,-8.1e-05,-9e-06,6e-05,-0.000118,-2.6e-05,2.2e-05,-6e-06,-0.00015,3.3e-05,-7.3e-05,1.1e-05,-4e-06,8.8e-05,-3.4e-05,9e-06,-1.9e-05,9e-06,-3.2e-05,-4.5e-05,-2.7e-05,4e-05,1e-06,-6.5e-05,1.4e-05,2.4e-05,1.3e-05,3e-06,0,-3e-05,0,-1.4e-05,-4e-06,1.8e-05,-1.1e-05,2e-06,-1.1e-05,2e-06,-5e-06,8e-06,-1.3e-05,-1.1e-05,2.1e-05,4e-06,0,1e-06,-7e-06,-1e-06,0,-1e-06,-1e-06,0,-1e-06,-2e-06,-4e-06,0,0,0,1e-06,1e-06,0,1e-06,0,1e-06,-1e-06,1e-06,3e-06,2e-06,4e-06,4e-06,3e-06,0,-1e-06,-1e-06,0,0,0,-1e-06,-1e-06,-1e-06,0,-1e-06,-1e-06,0,0,2e-06,0,-1e-06,0,1e-06,0,2e-06,0,2e-06,1e-06
-3e-06,-1e-06,2e-06,0,-1e-06,-1e-06,1e-06,-4e-06,8e-06,0,0,2e-06,0,-6e-06,-2.4e-05,1.5e-05,-1.3e-05,-1e-06,-1.2e-05,9e-06,2e-06,6.1e-05,-1e-05,7.4e-05,-5.7e-05,0.000109,-3.1e-05,0.000159,-2.5e-05,-7.5e-05,8.3e-05,6.8e-05,-7e-06,-1.9e-05,0.00015,-4e-06,1.8e-05,1e-06,-1e-05,-0.000103,-1e-05,-2.9e-05,5e-06,3e-06,3.5e-05,5e-05,-2.4e-05,-3.6e-05,-7e-06,2e-05,-9e-06,-2.4e-05,2.1e-05,-2e-06,2e-06,3.2e-05,0,1.1e-05,-4e-06,0,-1.2e-05,4e-06,-8e-06,8e-06,-1.4e-05,4e-06,-1.2e-05,1e-05,1.1e-05,-6e-06,-6e-06,-1e-06,0,0,0,1e-06,0,0,0,1e-06,1e-06,-1e-06,0,0,-1e-06,0,-1e-06,1e-06,-1e-06,0,-2e-06,1e-06,0,-1e-05,-3e-06,-3e-06,-5e-06,1e-06,0,-1e-06,1e-06,0,0,-5e-06,-1e-06,-1e-06,0,0,-1e-06,0,0,-1e-06,1e-06,-1e-06,0,0,0,-2e-06,0,1e-06,0
-2e-06,0,-1e-06,2e-06,-3e-06,0,-1e-06,-4e-06,-4e-06,0,1e-06,-4e-06,1e-06,4e-06,1.8e-05,-4e-06,6e-06,3e-06,-1.3e-05,3e-06,-3e-06,0,1.8e-05,1.4e-05,-0.000123,-1.4e-05,3.1e-05,4.5e-05,-2.2e-05,3.6e-05,-5.8e-05,-5.3e-05,2.9e-05,-1.9e-05,-0.000129,-2e-06,-1.1e-05,1e-05,-1.8e-05,9.4e-05,2.6e-05,1.1e-05,-1.9e-05,-2.6e-05,3e-06,1.2e-05,1.9e-05,2.7e-05,7e-06,4.4e-05,-1e-05,1.4e-05,-8e-06,-4e-06,0,1e-05,1e-06,-1.2e-05,3e-06,4e-06,2e-06,1e-06,2e-05,0,-2.1e-05,-1e-06,-1e-05,-6e-06,-3e-05,-3e-06,-2e-06,1e-06,-3e-06,2e-06,0,-3e-06,1e-06,-1e-06,0,-1e-06,1e-06,1e-06,0,0,0,-1e-06,0,-1e-06,0,1e-06,0,0,-2e-06,9e-06,1e-06,2e-06,-6e-06,1e-06,0,1e-06,0,0,0,4e-06,-2e-06,1e-06,1e-06,0,1e-06,0,1e-06,0,0,-1e-06,0,-1e-06,-1e-06,1e-06,0,-4e-06,-1e-06
-2e-06,-1e-06,-1e-06,-2e-06,-1e-06,1e-06,1e-06,-2e-06,-3e-06,0,1e-06,2e-06,-1e-06,2e-06,-1.3e-05,-1e-06,-7e-06,-5e-06,-2.6e-05,-6e-06,-7e-06,-2.9e-05,-1.8e-05,2.4e-05,0.000155,-1.4e-05,-1.6e-05,2.4e-05,8e-06,3.8e-05,2.2e-05,3.3e-05,-2e-05,-4e-06,0.000151,1.6e-05,5e-06,-1e-05,3e-06,-7.9e-05,-1.5e-05,4e-06,1e-05,2.5e-05,-2.6e-05,-2.4e-05,5e-06,-7e-06,-8e-06,-3.8e-05,2.4e-05,0,-1.5e-05,6e-06,2e-06,-2.5e-05,4e-06,1.8e-05,4e-06,-6e-06,3e-06,-1e-06,-2e-05,-9e-06,-6e-06,-3e-06,-1.2e-05,2e-06,1e-06,3e-06,-3e-06,-1e-06,9e-06,-2e-06,0,-2e-06,1e-06,0,0,2e-06,0,-1e-06,0,-1e-06,0,-1e-06,-1e-06,-1e-06,1e-06,0,2e-06,0,-1e-06,-3e-06,0,0,0,0,0,-2e-06,0,0,0,-1e-06,-1e-06,0,0,0,1e-06,1e-06,-1e-06,1e-06,0,-1e-06,0,1e-06,0,-1e-06,0,-3e-06,0
-1e-06,-1e-06,-2e-06,0,0,0,0,0,6e-06,0,0,-6e-06,0,-5e-06,4.5e-05,-6e-06,9e-06,1e-06,-1.5e-05,-1e-06,-8e-06,2.8e-05,1.1e-05,1e-05,-0.00017,2.6e-05,-4e-05,-2.3e-05,1.7e-05,-8.8e-05,6e-06,-7e-05,2.8e-05,2.4e-05,-0.000131,-4e-05,5.3e-05,-1.2e-05,-2.2e-05,4.3e-05,-2.3e-05,1e-06,-7e-06,1.2e-05,-4e-06,-1.2e-05,-8e-06,3e-06,2e-06,-2.4e-05,-3.4e-05,-9e-06,-2.7e-05,2.3e-05,1e-06,1.8e-05,-3e-06,-1.1e-05,-1e-06,8e-06,5e-06,0,1.1e-05,0,2e-06,-3e-06,-1.2e-05,0,-3.1e-05,2e-06,-4e-06,0,-9e-06,0,0,0,1e-06,0,0,-2e-06,0,0,-1e-06,0,-1e-06,-1e-06,0,-1e-06,0,0,-1e-06,0,1e-06,4e-06,0,-1e-06,3e-06,-1e-06,0,0,1e-06,0,0,3e-06,0,-1e-06,0,0,0,-1e-06,1e-06,-1e-06,1e-06,-1e-06,0,-1e-06,-1e-06,0,0,4e-06,0
0,1e-06,-1e-06,1e-06,3e-06,-1e-06,-1e-06,2e-06,-4e-06,0,-1e-06,-7e-06,0,4e-06,-4.6e-05,-1e-05,0,1e-06,3e-06,7e-06,-8e-06,-3.4e-05,-1.5e-05,-5e-05,7.2e-05,-9.2e-05,5.9e-05,6.2e-05,2.4e-05,4.6e-05,-4.3e-05,4.1e-05,-2.1e-05,-9e-06,0.000127,2e-05,-4.2e-05,-1.1e-05,-3.2e-05,1e-06,2.4e-05,-5e-06,5.2e-05,-1.3e-05,-1.3e-05,5.4e-05,1e-05,1.1e-05,-2e-06,4.7e-05,3.6e-05,1e-05,7e-06,-9e-06,-4e-06,2e-06,-3e-06,-3e-06,-5e-06,-2e-05,-3e-06,-3e-06,2e-06,9e-06,1.1e-05,0,-1.1e-05,-3e-06,1e-06,2e-06,0,1e-06,2e-06,0,0,-2e-06,0,0,0,0,1e-06,-1e-06,-1e-06,0,0,0,0,0,-1e-06,-1e-06,0,-1e-06,1e-06,-2e-06,0,3e-06,5e-06,-2e-06,0,0,-1e-06,0,0,1e-06,-2e-06,1e-06,0,0,0,0,-1e-06,0,0,-1e-06,0,0,-1e-06,1e-06,0,2e-06,0
1e-06,-1e-06,2e-06,-1e-06,-2e-06,1e-06,1e-06,2e-06,-3e-06,0,1e-06,7e-06,0,3e-06,8.1e-05,0,-7e-06,-1e-06,-2e-06,2e-06,-9e-06,5.9e-05,1.6e-05,2.8e-05,0.00018,0.000147,-6.9e-05,-4.7e-05,3e-06,3.8e-05,6.9e-05,-4e-05,-1.4e-05,1.5e-05,-0.000109,4.5e-05,-3e-05,1.1e-05,-4.1e-05,-1.8e-05,8e-06,1e-06,-5.3e-05,9e-06,1e-06,-1.3e-05,-1.1e-05,-1.1e-05,-9e-06,1.3e-05,-1.9e-05,-1.5e-05,5e-06,-2.6e-05,-1e-06,-3e-05,1e-06,8e-06,3e-06,7e-06,-2e-06,2e-06,-1.5e-05,0,-4e-06,2e-06,-1.1e-05,8e-06,2e-05,-3e-06,-6e-06,0,6e-06,2e-06,0,-1e-06,-1e-06,0,0,2e-06,0,0,0,0,0,1e-06,-1e-06,0,0,0,0,-1e-06,-1e-06,0,-1e-06,-3e-06,0,-3e-06,0,-2e-06,0,0,0,-4e-06,-1e-06,1e-06,0,-1e-06,1e-06,0,2e-06,1e-06,0,0,0,0,0,-2e-06,0,0,0
