8.7e-05,0.000187,0.000214,0.000123,0.000165,0.00044,-0.000957,-0.000536,-0.000365,-0.000184,-5.6e-05,-4.6e-05,-6.3e-05,-0.000245,-0.000238,-0.000197,-0.000338,-0.000524,0.00017,-0.000986,0.00096,0.000719,0.00013,-0.002297,-0.000937,-0.001027,-0.003231,-0.003655,-0.008355,-0.005418,-0.002848,-0.001546,0.005096,-0.003115,-0.004594,-0.010499,-0.019828,-0.016044,-0.019524,-0.019021,-0.013075,-0.013631,-0.021713,-0.008288,-0.011489,-0.00908,-0.007691,-0.009616,-0.011946,-0.009622,-0.019623,-0.016655,-0.015874,-0.010122,-0.012681,-0.012585,-0.015889,-0.012903,-0.010902,-0.012855,-0.020636,-0.01061,-0.012439,-0.013558,-0.009906,-0.013622,-0.009721,-0.011157,-0.007145,-0.003532,-0.004484,-0.003446,-0.004206,-0.002629,-0.002389,-0.001124,-0.00189,-0.00027,-0.001472,0.00029,-0.002875,-0.002634,-0.000656,-0.000514,-0.000792,-0.002965,-0.002049,-0.001268,-0.000324,7.5e-05,-0.00036,1e-05,0.000364,0.000323,-1.4e-05,-0.00475,-0.003078,-0.001135,0.000356,0.000318,0.000615,0.000525,0.00077,0.000644,0.000382,-0.000294,-0.000333,-0.000174,-9.1e-05,0.000161,-0.018526,-0.012339,-0.005331,-0.000854,0.000418,0.00046,0.00038,2e-04,0.000415,0.000581,0.000432
0.000128,-4.2e-05,-7.2e-05,-8.4e-05,-0.000194,-5e-06,0.000803,0.000634,0.00043,0.000467,0.000311,0.000415,0.000163,0.000249,0.000232,0.000326,0.000293,0.00037,0.000627,0.000117,0.003119,0.001726,-0.000237,0.000719,0.000678,-1.4e-05,0.000576,0.000284,0.002283,0.00018,0.000185,0.002476,-0.010783,0.009879,0.001644,0.002223,0.00298,0.011809,0.008547,0.005664,0.004685,0.004669,0.006757,0.006179,-0.000937,-0.001537,-0.001812,-0.003799,-0.007139,-0.000851,0.002012,-0.001438,0.000676,-0.003157,0.001302,-0.001682,0.002038,0.004653,0.000723,-0.001429,0.00453,-0.000477,0.002045,0.00066,0.000352,0.001101,-0.002535,0.001349,0.000819,-0.000752,0.002573,-0.00093,-0.001113,-0.00081,-0.000351,-0.000927,-0.000349,-0.000555,0.000716,0.000731,0.001066,0.002017,0.000294,0.000523,0.00117,0.001582,0.001379,0.000617,5e-06,0.000445,0.000414,0.000525,0.00057,0.00035,-4.3e-05,0.002018,0.001694,0.001041,0.000328,0.000518,0.000692,0.000585,0.000981,0.000485,0.000561,0.000694,0.000496,0.000353,0.000221,-0.000208,0.010281,0.00713,0.003467,0.000794,0.000641,0.000261,0.00019,0.00027,0.000169,0.000242,7.9e-05
0.000147,-6.7e-05,-7.6e-05,-6.8e-05,-5.8e-05,9.9e-05,-0.000777,-0.00022,0.000109,0.000217,-2.6e-05,7e-05,-1.9e-05,0.000341,1.4e-05,-6.4e-05,-0.000208,2.1e-05,0.000166,0.00033,-0.002235,-0.001811,-0.000129,0.000542,0.00067,-4.7e-05,4.4e-05,0.000538,-0.002399,0.002396,0.000824,0.001495,-0.004544,-0.001249,-0.004899,-0.00926,-0.009792,-0.011996,-0.008315,0.006462,0.000269,-0.001978,-0.005215,-0.00607,0.001358,0.001272,-0.006878,0.000479,0.006073,-3.9e-05,-0.00281,0.000673,0.002968,-0.00066,-0.002446,0.003658,-0.004363,-0.008347,-0.004103,-0.003984,-0.005389,-0.002945,-0.001902,-0.000767,-0.001284,0.000572,-9.1e-05,-0.004049,-0.001623,0.000759,-0.00055,-0.002206,-0.000706,-0.002093,-4e-04,-0.000591,1.5e-05,0.00032,-0.000998,0.000862,0.00272,0.000568,0.001169,0.000928,0.000713,-0.000644,0.00036,0.000386,0.000395,0.000193,0.000109,0.000451,0.000283,1.4e-05,-0.000226,-0.001452,-0.000466,7.7e-05,-3.6e-05,0.000229,0.000329,5.9e-05,0.000283,8e-05,0.000264,-4e-06,0.000107,0.00015,-9.9e-05,-0.000233,-0.004148,-0.00484,-0.002774,-0.000608,0.000252,8.2e-05,9.1e-05,6.9e-05,0.000182,0.000153,-2.9e-05
3.6e-05,-2.6e-05,-0.000173,-0.000117,2.7e-05,0.000156,-2.2e-05,0.000308,-0.000242,2e-05,-0.000141,0.000172,-0.000112,8.1e-05,-0.000199,-5.6e-05,-9.1e-05,0.000119,-0.000344,-0.000196,-0.000371,-0.000675,0.000177,-0.00069,-0.000255,0.000195,-0.001346,-0.001045,0.0023,-0.000827,9.5e-05,-0.001833,-4e-05,0.005132,-0.003104,-0.00207,0.000871,-0.000807,0.004418,-0.00077,-0.002718,0.004952,0.000529,-0.001234,0.003211,-0.00128,0.001939,-0.000906,-0.00389,-0.003018,0.000913,0.003307,-0.003745,-8.7e-05,4e-06,-0.002079,0.004385,0.00259,0.004482,0.002749,0.005695,0.003592,-0.000814,0.000394,0.002747,0.000193,0.002401,0.001198,0.000867,0.000195,0.000311,0.000757,-0.000759,0.000393,0.000538,0.000127,-0.000247,-0.001138,-0.001168,-0.000615,-5e-04,0.000647,-0.000876,-0.000493,-0.000134,-8.8e-05,-5.8e-05,-0.000308,-0.000106,0.000107,-0.000303,-5.9e-05,7.4e-05,-1.7e-05,-0.000328,-4.9e-05,-0.000538,-0.000363,-0.000204,-3.5e-05,7e-05,-0.000214,0.000107,3e-06,0.000132,2e-05,-0.000185,-0.000108,-0.000132,9e-06,-0.001222,0.001115,0.000786,0.000162,0.000119,-0.000114,7.9e-05,2.5e-05,-7.3e-05,6.2e-05,4.8e-05
0.000103,-1.4e-05,9e-05,0.000172,1.5e-05,0.000237,0.000126,0.000238,0.000105,0.000124,5.9e-05,-4.7e-05,0.000144,5.5e-05,8.3e-05,7e-05,5.6e-05,0.000305,0.000153,-0.000179,-5e-06,-0.000691,0.000457,0.000482,0.000396,-0.000137,6.4e-05,-0.000503,-0.001269,-0.000793,0.000205,-0.00046,0.001304,-0.000134,-0.002329,-0.000543,-0.000415,0.008198,-0.005498,0.0028,-0.001458,-0.004151,0.000489,0.001159,-0.002232,0.000377,-0.006133,0.001108,-0.00011,-0.000288,-0.001369,-0.00699,-0.003426,0.001787,0.002154,-0.001569,-0.001084,-0.000318,0.001893,0.003324,-0.001779,-0.002116,-0.000515,0.002614,0.00031,-0.001205,0.001723,0.002155,-0.000171,-0.000264,0.000785,-0.000837,0.000879,0.001654,0.000252,0.000414,6.3e-05,0.000419,-0.000448,-0.000115,0.000204,0.00087,0.000392,0.000623,0.000334,0.000479,-0.000387,-0.000197,0.000295,0.00015,-7.9e-05,6.3e-05,-4.2e-05,-6.1e-05,-0.000399,-0.000582,6.7e-05,5.7e-05,-4.2e-05,8.9e-05,-6.2e-05,-1.5e-05,0.000155,-0.00011,-2.9e-05,-4.9e-05,2e-04,0.000126,7.6e-05,-3.3e-05,0.001073,0.00028,7.5e-05,0.000107,9.9e-05,-0.000209,0.000195,4.5e-05,3.3e-05,-5.7e-05,6e-06
7.2e-05,-2.1e-05,-9e-06,7.3e-05,-6.4e-05,0.000145,-8.4e-05,0.000204,1e-05,0.000166,-7e-06,-1.9e-05,2.9e-05,-2.5e-05,9.5e-05,0.000168,5e-05,-5e-06,3.3e-05,-0.000319,8.8e-05,-0.000219,7.3e-05,-0.000531,-0.000486,-7e-05,0.000274,0.000504,-0.000768,-0.001636,-0.002052,-0.000312,0.000645,-0.004871,-0.004631,-0.003154,-0.003608,-0.001524,-0.004641,-9e-05,-0.007263,0.002036,0.001248,0.000639,0.001304,0.002124,0.000961,0.000361,0.00266,0.002819,-0.001234,0.006848,0.000915,-0.001705,-0.000655,-0.001679,-0.000339,-0.000879,0.00075,-0.000174,-0.001707,-0.001562,-0.000218,-0.001142,-0.001324,0.00253,-0.000596,-0.001332,0.000104,-0.000157,-0.000712,-0.000333,0.000204,0.000337,-2.1e-05,-0.000113,0.00011,0.000288,-0.000344,-0.001215,-0.000831,-0.00086,-0.000299,-0.000263,0.000274,-7.2e-05,0.000816,0.000332,0.00025,-0.000303,-0.000175,-6.1e-05,-0.000208,-5.3e-05,-0.000201,0.00111,-9.9e-05,-0.000198,-6.8e-05,-0.000132,-8.1e-05,-9.4e-05,-4.5e-05,-0.000391,-8.7e-05,-0.000223,-5.5e-05,-7.8e-05,-7.9e-05,2.9e-05,0.000189,0.000743,0.000122,-0.000181,-4.4e-05,-9.5e-05,5.6e-05,-0.00013,3.5e-05,-6.7e-05,-9.7e-05
-3.4e-05,-2.2e-05,-0.00013,-2.6e-05,-8.7e-05,-0.000118,-0.00012,-0.000374,-0.000244,-9.9e-05,3.5e-05,-8.3e-05,1e-05,-8.1e-05,-0.000201,-0.000143,-0.000179,-9.8e-05,-0.000117,-0.000146,-0.000165,-0.000318,4.4e-05,1.5e-05,8.2e-05,-0.000305,-0.000364,0.000902,-0.000351,0.000425,0.000329,-0.000861,0.000548,-0.006559,0.001109,0.00275,0.002629,-0.005979,0.000156,-0.002935,0.001442,-0.005801,-0.001921,-0.001114,-0.004989,-0.001092,0.001242,-0.003782,-0.002155,0.001526,0.000908,-0.005193,-0.002902,0.000723,0.001386,-0.001843,-0.002448,-0.001202,0.000765,-0.002275,0.000232,0.002532,-0.000533,0.001153,0.001074,-0.00111,0.001203,0.00049,9.2e-05,-0.000309,0.00011,0.000188,-0.00043,-0.000583,0.000121,-0.000314,0.00076,-0.000116,0.000541,-0.000113,-0.000128,0.000174,-0.000388,-0.000324,-0.00037,0.000115,-0.000267,-9.1e-05,-0.000166,-8.1e-05,-0.000217,-0.000247,-0.000302,-0.000143,-0.000248,-0.000337,6.9e-05,-0.000117,-0.000192,-2.5e-05,-0.000177,-0.000199,-0.000102,-0.000304,-0.000105,-0.000144,5.9e-05,-0.000179,-0.000167,-9.7e-05,-0.000394,-0.000921,-0.000772,-0.000327,-0.000265,-0.000265,-2.4e-05,-0.000157,-5.4e-05,-0.000168,-0.000174
-5.5e-05,-7.6e-05,-0.000103,-2e-05,1e-05,-9.6e-05,-4.7e-05,0.000164,-7.7e-05,-1.4e-05,-7.5e-05,-5.3e-05,-9.7e-05,-3.9e-05,-9.7e-05,9.9e-05,4.3e-05,6.3e-05,-7.3e-05,-8.7e-05,0.000109,-0.000253,0.000376,0.000222,4e-05,3.1e-05,0.000269,-0.000571,4.8e-05,0.000384,-0.000452,0.000602,-0.000558,0.001125,-0.003099,-0.002618,-6.9e-05,-0.000388,0.000352,-0.005012,-0.003114,0.000982,0.000281,0.000555,0.001067,-0.001501,0.002798,0.001616,-0.003614,7.3e-05,0.001879,0.000116,0.00256,-0.001587,-0.000776,-0.000283,0.001111,-0.000229,-0.001814,0.000445,0.002154,-0.002387,-0.002142,-0.000827,-0.000558,-0.000485,-0.000264,-0.001317,-0.00116,-0.000159,5.9e-05,-0.000425,-0.000529,-0.000189,0.000276,9e-05,2e-05,7.4e-05,-0.00012,-0.000281,-0.000899,0.000125,-0.000227,-0.000463,-0.000227,2.3e-05,-0.000125,-0.000449,-0.000155,-3e-06,-6.7e-05,-6.2e-05,-0.000119,-0.000199,-0.000259,-9.2e-05,7.4e-05,-0.000223,-0.000214,-2.5e-05,-7.8e-05,-0.000166,-0.000239,-0.000265,-0.000105,-0.000127,-3.5e-05,5.9e-05,-7e-06,0.000125,0.000667,-6.6e-05,-0.000172,-0.000263,-0.000102,-0.000117,-6.4e-05,-8.8e-05,-6.6e-05,-0.000137,-0.000117
-2.6e-05,-6.4e-05,-2.2e-05,-4.7e-05,9e-06,-4.5e-05,-4.7e-05,-0.000114,-1.2e-05,-1.7e-05,-3.5e-05,-4.3e-05,1.2e-05,-2.8e-05,-2.7e-05,-8.9e-05,-0.00019,-8.4e-05,-0.000137,-5.9e-05,-7.1e-05,4.6e-05,0.000205,4.6e-05,-0.000327,-0.000297,-0.000136,-1.4e-05,0.000178,-0.000251,6.9e-05,-0.001263,0.000538,0.002336,0.000746,-0.000248,0.001299,-0.000138,0.002683,0.004639,0.000307,0.000937,-0.002062,0.001422,-0.00352,-0.002488,0.000381,-0.002096,0.001752,7e-06,-0.003356,-0.000111,-0.001839,0.002326,-7.2e-05,0.001998,-0.00147,-0.000246,-0.000917,-0.001745,-0.001262,0.001377,0.00073,-0.001254,-0.000821,-0.000247,-0.00069,0.001585,0.001103,0.000478,-0.000295,-0.000303,0.000327,-0.000462,3e-06,-0.000221,-7.8e-05,9e-06,-0.000387,0.000279,-0.000361,-0.000245,-0.000163,-0.000635,-0.000179,4.6e-05,-0.000253,0.000121,0.000175,8.5e-05,-9.8e-05,7e-05,-7.3e-05,-0.00015,7.8e-05,-1.4e-05,-3.4e-05,0.000103,-2.4e-05,-0.000132,-0.000145,-6.6e-05,-0.000178,-0.000133,-0.000147,-6.9e-05,-8.5e-05,-0.000161,3e-06,1.9e-05,0.000136,0.000751,0.000704,0.000334,-4.6e-05,-8.7e-05,-0.000112,-0.000102,-2.6e-05,-4.9e-05,-3.6e-05
-2.5e-05,2.8e-05,3.5e-05,5e-06,5.3e-05,1.6e-05,6e-05,-5.4e-05,-0.000173,-0.000143,-3.9e-05,-1.3e-05,-1.2e-05,-5.4e-05,-3.6e-05,-3.6e-05,4.7e-05,7.9e-05,-2.2e-05,-4.7e-05,-0.000189,1.9e-05,0.000353,-1e-04,0.000138,-8.2e-05,0.000132,0.000203,-0.000451,-0.000439,0.000115,-4e-04,-0.000768,0.001053,0.001863,-0.003828,-0.001859,-6.7e-05,-0.005019,-0.004157,-0.001095,-0.003352,0.00098,-0.000584,0.002789,-0.001347,-0.000358,0.001566,-0.000181,-0.000978,0.00075,0.001072,7.9e-05,-0.002159,0.000285,0.000459,-0.001129,-2.9e-05,-8.2e-05,0.00186,0.000246,-0.000581,0.001954,0.001066,9.3e-05,0.001578,-0.000394,-0.000777,-0.000195,-0.000357,1.8e-05,0.000369,3.3e-05,8e-05,-0.000612,-6.3e-05,-0.000312,-1.9e-05,0.000306,0.000311,-0.000336,-0.000152,-0.000501,-0.000158,-0.000321,-0.000127,-0.000386,-9.5e-05,-6.8e-05,-0.000253,-0.000133,-8.2e-05,-8.6e-05,-0.000104,1.9e-05,-0.000168,2.3e-05,-7.5e-05,-0.000124,6.1e-05,-0.000165,-9.3e-05,-5.6e-05,-3.4e-05,-9e-05,-9.6e-05,-4.1e-05,-1.6e-05,-4.9e-05,0.000185,-0.000478,-0.000389,-1.5e-05,-0.000103,6.4e-05,-7.9e-05,-0.000115,-5.1e-05,-3.4e-05,-3.4e-05,-7.7e-05
-4.3e-05,-3e-05,-2.7e-05,-6e-06,-3.3e-05,-1.4e-05,3e-06,-1.9e-05,-1.1e-05,-1.3e-05,-2.8e-05,-1.6e-05,-6.7e-05,-6.2e-05,-5.1e-05,-2.9e-05,3e-05,-4.2e-05,1.1e-05,4.8e-05,-5.4e-05,-0.000239,-0.000592,-0.000228,-8.7e-05,-3.4e-05,-1.6e-05,5.6e-05,0.000777,0.000218,-0.000526,0.00034,-9.4e-05,0.000682,0.000775,0.001486,-0.000879,-0.002175,-0.001826,0.000965,-0.002407,0.000989,-0.000227,-0.000949,-0.000429,0.001678,0.001124,-4.6e-05,-0.000148,0.000847,-0.001102,0.001231,-0.000266,-0.000784,-0.000178,6.8e-05,0.000592,-0.001282,-0.001545,-0.001493,-2e-06,-2.9e-05,-0.000571,-0.001175,-0.00077,-0.00029,4.2e-05,0.000688,0.000184,-3.1e-05,0.000157,-0.000295,-0.000369,6.9e-05,-0.000199,-0.000248,-2.7e-05,0.000118,-0.000143,-3e-06,-4.8e-05,-0.000176,0.00022,0.000213,-0.000201,1.2e-05,-2e-05,-4.9e-05,-0.000126,-7.2e-05,9.3e-05,-4.3e-05,-7.6e-05,8.1e-05,2e-06,-0.000107,-0.000119,7.3e-05,0,-6.4e-05,-0.000106,-5e-06,-9.6e-05,-0.000113,-4.2e-05,-4.1e-05,-8.3e-05,-4e-06,2.4e-05,-2.2e-05,0.00012,-7e-05,-4.3e-05,-0.000141,-9.6e-05,5e-06,-2.7e-05,-1.5e-05,-4.1e-05,-2.3e-05,-1.7e-05
-1.2e-05,-1.1e-05,1.8e-05,-3.2e-05,-6.9e-05,-1.8e-05,-2e-06,-6e-05,4.4e-05,1e-05,-4.8e-05,-3.2e-05,2.1e-05,-1.2e-05,-6.5e-05,1.7e-05,2.2e-05,-4.2e-05,-1.7e-05,-0.00012,-9.1e-05,-4.3e-05,-0.00041,-9.9e-05,3.7e-05,-3e-04,4e-05,6.9e-05,9.2e-05,0.000127,0.000726,0.000831,-2.7e-05,-0.00104,-0.002214,0.002126,-0.001849,0.002397,0.001094,-0.002281,0.001556,0.001473,-0.001088,0.000533,-0.000693,-0.000935,0.000599,0.001812,-0.000516,-0.000408,0.000848,-0.000145,0.001321,-1.1e-05,-0.000892,-0.00039,0.000186,0.000548,0.000103,-0.000749,0.000272,-6.6e-05,0.00056,0.000529,-0.000173,-0.000182,-0.000298,4.8e-05,-0.000303,-0.000416,-0.000203,0.000451,0.000279,9.6e-05,-0.000185,0.000115,0.000245,0.000147,-9.6e-05,-0.000219,2.9e-05,9.5e-05,-0.000289,7.2e-05,1.1e-05,-3.8e-05,-6.4e-05,-3e-05,-5.6e-05,2.4e-05,-1e-05,-1.5e-05,-1e-06,-4.3e-05,-3e-06,-0.000285,-8.9e-05,5.3e-05,5.9e-05,2e-06,-3.9e-05,-2.2e-05,-5e-05,-6.8e-05,2.6e-05,-3.3e-05,-2.8e-05,-3.9e-05,1.8e-05,-5.4e-05,0.00024,0.000161,6.4e-05,0.000132,-1.3e-05,-1e-06,-4.8e-05,-5.9e-05,-3.6e-05,-4.5e-05,-9e-06
-1.5e-05,3e-06,1.8e-05,-2e-05,-3.6e-05,9e-06,3e-06,2.8e-05,-0.000118,4e-06,-2e-06,9e-06,-3e-06,1.6e-05,1.3e-05,-2.4e-05,-1.1e-05,-6e-06,-6e-05,-2.5e-05,-4.6e-05,4.7e-05,-0.000615,-0.000119,-5.2e-05,0.00028,4.1e-05,-6.2e-05,-0.000574,-3.3e-05,-0.000268,0.000116,-0.000309,-0.001902,-1.5e-05,-0.000698,-0.001408,-0.001106,0.000627,0.002525,-0.000453,-0.000718,0.000277,-0.000859,0.001409,0.000485,0.001214,-0.001477,0.001153,-0.000565,-0.000795,-8.6e-05,-0.000591,-0.000318,0.000335,-0.000705,-7.4e-05,-0.000125,-0.000185,0.00028,-0.000217,-0.000247,-0.000925,-0.000381,0.000542,-0.000502,9.4e-05,0,-0.000353,6.2e-05,-0.000128,-0.000511,-0.000141,1.5e-05,0.000448,0.000101,-0.000104,5.3e-05,4.2e-05,-3.1e-05,1.6e-05,2.7e-05,-0.000161,8e-06,-5.7e-05,4.1e-05,-5e-05,-1.3e-05,-0.000104,-5.3e-05,-3.1e-05,-9e-06,-1.1e-05,-1.6e-05,2.1e-05,4.5e-05,4.2e-05,2.6e-05,-2.4e-05,-2e-06,6.5e-05,-1.9e-05,-1.2e-05,-5e-05,1.5e-05,8e-06,-3.1e-05,1.1e-05,-1e-05,8e-06,-0.000154,-8e-05,-0.000165,-6.7e-05,-4.5e-05,-6e-05,2e-06,-3.9e-05,-1.2e-05,-2e-06,3e-06
0,-1.7e-05,-1e-05,4e-06,-2.3e-05,7e-06,-9e-06,-7e-06,-1.8e-05,-1.9e-05,1.6e-05,-4e-05,1.6e-05,-1.2e-05,2.4e-05,-2.9e-05,1.9e-05,-1e-06,1.7e-05,2e-05,-7e-06,-5.2e-05,-5.9e-05,-0.000109,-3.1e-05,-0.000174,7.1e-05,-0.000207,3e-05,0.000288,6.5e-05,-0.000538,0.000117,-0.000103,0.000198,-0.001912,0.000796,0.000788,0.001478,0.001031,0.00024,-0.000693,0.000335,7.7e-05,-0.001262,-0.000207,-0.000165,0.000963,-0.000228,-0.00035,-8.3e-05,-0.000232,0.000219,-9.1e-05,2e-05,-0.000255,0.000358,-0.000224,0.001007,0.000457,8.1e-05,0.000507,0.000588,6.8e-05,0.00049,0.000282,-0.000186,-9.8e-05,0.000476,0.000268,-2.7e-05,0.000433,0.00011,5.3e-05,-1.7e-05,0.000151,-8e-05,-0.000134,-2.8e-05,-7.1e-05,0.000162,-5.7e-05,2.5e-05,5.1e-05,-0.000475,-4.9e-05,8e-06,6.8e-05,-6.2e-05,3.8e-05,-5.8e-05,1.4e-05,2.5e-05,5.5e-05,6.3e-05,-4.9e-05,-5.9e-05,-7.3e-05,8.7e-05,1.4e-05,2.3e-05,-1e-06,6e-06,-5e-06,-2.3e-05,-2.4e-05,1.9e-05,-5.4e-05,-3e-06,-3.5e-05,-2.8e-05,-1.4e-05,-0.000147,2.4e-05,5.8e-05,-4e-06,2.4e-05,-4.8e-05,4.2e-05,-1.6e-05,1.7e-05
3e-06,9e-06,4e-06,2e-06,1.9e-05,2.2e-05,4e-06,1.8e-05,-4.2e-05,-1.8e-05,7e-06,2e-06,1e-06,-1.9e-05,-2e-06,9e-06,-8e-06,-4e-06,-2.2e-05,2e-05,6e-06,-2.5e-05,0.000218,-5.8e-05,-8.4e-05,2.9e-05,-2e-05,0.00017,4.5e-05,-0.000234,0.000137,0.000389,-0.000123,0.000721,0.000253,0.001806,0.000374,-0.001761,-0.000242,-0.001504,-0.00026,0.00053,-0.000927,-4e-05,0.000402,0.000177,-0.000169,-0.000177,8.2e-05,9.7e-05,0.000387,-0.000599,9.4e-05,0.000613,-0.000496,0.000378,0.000159,0.000579,-0.000809,-0.000248,0.000173,-0.000509,-4e-06,7e-06,6.7e-05,-0.000228,-0.000119,5e-06,-8.1e-05,-0.000122,-5.4e-05,-2.6e-05,-0.000158,3e-06,-0.000116,-4.1e-05,-0.000141,4.8e-05,-4.2e-05,0.000103,7.9e-05,1.4e-05,-4.7e-05,-0.000109,0.000118,0.000128,3.6e-05,1.4e-05,-1.3e-05,3.6e-05,3.4e-05,2.3e-05,-2.4e-05,-7e-06,8.7e-05,-1e-05,2.6e-05,-7.5e-05,-1.6e-05,-2.2e-05,-8e-06,1.5e-05,-1.3e-05,0,-3e-05,-2e-06,8e-06,6e-06,1.8e-05,-2e-05,6.5e-05,-2.6e-05,7.8e-05,0.000134,2e-05,-1.4e-05,1e-05,-9e-06,-5e-06,-6e-06,1e-05
-1e-06,-9e-06,1.9e-05,-6e-06,9e-06,-8e-06,2e-06,0,3.8e-05,8e-06,-2e-06,-1.2e-05,1e-05,-9e-06,-9e-06,-1e-05,-1.5e-05,-5e-06,1.8e-05,-1.7e-05,-2.1e-05,-1.8e-05,-1.7e-05,-2.3e-05,1e-06,1.8e-05,4.4e-05,-6.1e-05,8e-06,2.9e-05,-0.000155,0.000123,-5.3e-05,0.000576,1e-06,0.000538,0.001213,0.001054,-0.000853,-0.00042,-0.000856,-0.000587,-0.000409,-0.000592,-0.001018,0.000429,3.8e-05,-0.000279,-0.000948,-0.000221,-0.000533,-0.000587,-0.000387,-0.000368,0.000209,0.000431,-0.000406,0.000273,0.000424,0.000142,0.000219,-4.9e-05,-0.000246,0.000528,2.3e-05,0.000113,0.000253,-0.000218,-8.9e-05,0.000202,0.00022,-4.5e-05,0.000137,-4.5e-05,9e-06,-6.6e-05,3.9e-05,4.1e-05,4e-06,3.9e-05,-0.000132,-2.3e-05,4.8e-05,-2.7e-05,0.000156,-0.000113,2e-05,-1.5e-05,5.5e-05,-6e-05,8e-06,-6e-06,3e-06,8e-06,1.5e-05,2.4e-05,-2.9e-05,3.5e-05,3.1e-05,8e-06,-9e-06,1.2e-05,0,-1.2e-05,3e-06,-1.5e-05,1.7e-05,-1.3e-05,2e-06,-2.5e-05,-6.6e-05,3.8e-05,0.000134,-7.3e-05,-3.5e-05,-4e-06,1.3e-05,5e-06,-7e-06,-2e-06,-8e-06
1e-06,-5e-06,-3e-06,9e-06,1e-06,-1.9e-05,1e-06,-5e-06,-1e-05,1e-06,-5e-06,5e-06,-3e-06,-1.4e-05,6e-06,1.4e-05,-8e-06,2e-06,-1.9e-05,-1.3e-05,4e-06,5e-06,9.6e-05,7e-05,2.4e-05,1.2e-05,-3e-06,-2.1e-05,3.2e-05,-9.6e-05,0.000115,-0.000125,0.000204,0.000536,0.000358,-0.000376,-0.000182,-0.001251,-0.000296,0.000191,0.000991,0.000475,0.000622,-0.000541,0.000987,-0.000516,-0.000388,0.00037,0.001049,-0.000192,-7.2e-05,0.000279,0.000197,0.00067,-0.000129,-6.3e-05,6.8e-05,-0.000471,0.000284,1.4e-05,0.000129,4e-06,9e-05,-0.000245,3.6e-05,-0.00035,-9e-06,8e-05,1.1e-05,-0.000292,-0.000145,1.7e-05,2.2e-05,-7.2e-05,-0.000122,-7e-05,2e-06,-4e-05,-2.6e-05,4.7e-05,-0.000106,-4.7e-05,-0.000106,-4e-06,1e-05,2.6e-05,-7.2e-05,-4e-06,3.2e-05,4.7e-05,-3e-06,-2.4e-05,-6e-06,-2.3e-05,1.7e-05,4e-05,2e-06,1.9e-05,-2.8e-05,1.1e-05,-2.4e-05,0,-3e-06,-1.9e-05,-7e-06,-1.5e-05,-2e-06,6e-06,3e-06,-1.4e-05,-9e-05,-2.1e-05,3e-06,-3.6e-05,5e-06,-2.3e-05,-5e-06,5e-06,-5e-06,-6e-06,-1e-05
-4e-06,-3e-06,-4e-06,8e-06,-7e-06,-8e-06,-3e-06,1e-06,-1.7e-05,-1e-06,4e-06,2e-06,-3e-06,3e-06,-1.7e-05,-1.6e-05,3e-06,-3e-06,3e-06,-1.9e-05,6e-06,-4.3e-05,4.1e-05,6.6e-05,1.3e-05,-4.3e-05,1.9e-05,-1.2e-05,7.6e-05,0.00011,3.6e-05,-8.5e-05,-0.000123,-0.000198,-0.000212,-0.000315,-0.000117,0.000728,0.000207,-4.3e-05,-0.000247,-0.000354,-7.9e-05,0.000627,-9.3e-05,-0.000156,2.2e-05,6.7e-05,-0.000142,6.6e-05,0.000243,0.000223,-0.000116,-0.000522,6e-06,-0.000125,-0.000274,0.00021,-1e-04,7.5e-05,0.000252,0.000116,0.000292,9.7e-05,-2.9e-05,0.000202,-0.000157,-0.000104,7.7e-05,-5.5e-05,1.8e-05,7.9e-05,-5.3e-05,2.3e-05,0.000113,3.8e-05,3.2e-05,-4e-06,-1.9e-05,-6e-05,-5.6e-05,1.7e-05,3.2e-05,-7e-05,-3.1e-05,-1.3e-05,-3e-05,-1.5e-05,-1.3e-05,-1.1e-05,1e-05,-1.1e-05,-7e-06,-2e-06,2.5e-05,5e-05,-7e-06,1.3e-05,-1e-05,-1.8e-05,7e-06,-1.1e-05,-1.1e-05,-3.2e-05,1e-06,-1e-05,5e-06,5e-06,-3e-06,-1e-06,0.000103,-2.9e-05,1e-06,-2.1e-05,-7e-06,-1.4e-05,-1.2e-05,-4e-06,8e-06,-1e-06,-2e-06
-4e-06,-4e-06,6e-06,-1e-06,-4e-06,-5e-06,2e-06,-1.8e-05,2e-06,-9e-06,4e-06,-4e-06,-4e-06,3e-06,-8e-06,4e-06,5e-06,2e-06,2e-06,-1.4e-05,-7e-06,-3.4e-05,7.4e-05,2.8e-05,-2e-06,-4.6e-05,9e-06,1.4e-05,2e-06,-1.3e-05,-3.4e-05,9e-06,0.000155,-0.000753,-0.00018,1.5e-05,0.00017,-0.000414,0.000584,0.000199,-0.000473,0.000425,-0.000148,-0.000394,-0.000282,-0.000163,-0.000264,3.1e-05,-0.000222,-5.6e-05,-0.000172,-1.2e-05,0.000183,-0.000298,2e-06,-0.000124,-1e-05,7.7e-05,-0.000136,2.5e-05,-0.000243,0.000109,0.000135,-9.4e-05,-0.000129,-1e-05,0.000188,3e-06,2e-05,6.2e-05,8.8e-05,-7.9e-05,-7e-06,-2.3e-05,6.3e-05,-5.6e-05,-2e-05,-1.6e-05,1e-06,-3.4e-05,4.4e-05,2.1e-05,-1.4e-05,6.7e-05,-2.8e-05,2.4e-05,1e-06,4e-06,-2e-06,2.7e-05,-1.5e-05,6e-06,-1e-06,3e-06,1.5e-05,-4.8e-05,8e-06,-8e-06,-6e-06,1e-05,-5e-06,-1e-06,-9e-06,-2.4e-05,-1.4e-05,-7e-06,-8e-06,-1.3e-05,1e-05,1e-06,5.8e-05,5.8e-05,-9.3e-05,-5.4e-05,-8e-06,6e-06,-1.7e-05,-1.8e-05,-7e-06,-7e-06,-3e-06
-4e-06,-3e-06,7e-06,-3e-06,-8e-06,3e-06,0,4e-06,-1.9e-05,-1.2e-05,-7e-06,-1e-06,1e-06,3e-06,-9e-06,0,-4e-06,-4e-06,-4e-06,5e-06,-2e-06,6e-06,4.7e-05,-1.6e-05,-2.6e-05,2.4e-05,9e-06,2.8e-05,-0.000101,5.8e-05,4.1e-05,0.00014,-8.7e-05,-0.000268,-8.2e-05,-7e-06,-6.5e-05,0.00078,4.5e-05,-6.8e-05,-0.000181,-2.4e-05,-8.9e-05,9.3e-05,0.000314,0.000234,-0.000256,0.000114,-7.3e-05,0.000178,-0.000174,0.000166,-0.000152,0.000511,9e-06,4e-06,0.000179,-4e-06,-0.000271,-0.000166,-0.000136,7e-06,-5.3e-05,-8e-05,-0.000137,0.000222,-5.2e-05,1.9e-05,-6.5e-05,-3.6e-05,-2.2e-05,0.000111,6.3e-05,-1e-06,-1.8e-05,-5e-06,-2.7e-05,-7e-06,-1.4e-05,-2.5e-05,-5e-06,-6e-06,-5.8e-05,2.2e-05,-1.5e-05,-2.5e-05,-3.5e-05,5e-06,5e-06,-1.1e-05,-7e-06,4e-06,3e-06,-5e-06,2.2e-05,4.2e-05,-3e-06,3e-06,2.6e-05,-8e-06,-4e-06,-2e-06,-4e-06,-1.3e-05,2e-06,-9e-06,-5e-06,1e-06,0,-1e-06,-0.000103,-2.6e-05,2.2e-05,8.7e-05,-5e-06,-1.9e-05,-6e-06,-1.1e-05,-5e-06,-4e-06,0
-2e-06,-2e-06,-2e-06,2e-06,2e-06,0,0,-6e-06,-1e-05,6e-06,-6e-06,-9e-06,-5e-06,-4e-06,-6e-06,-1e-06,6e-06,7e-06,-4e-06,4e-06,0,-1.8e-05,7.9e-05,-1.8e-05,-8e-06,-4.3e-05,8e-06,2.1e-05,2.1e-05,-8.4e-05,1.2e-05,-4.1e-05,9e-06,0.000206,0.000327,0.000236,-3.1e-05,-0.000456,-0.000483,0.000646,0.00023,-0.000544,4.4e-05,-7e-05,-0.00024,-7e-06,-0.000129,-0.000197,0.000178,8.5e-05,9.4e-05,-0.000147,0.000186,-0.00066,-0.000118,-7.5e-05,1.6e-05,9e-06,0.000138,-0.000142,0.000107,-0.000178,-0.00018,2.7e-05,-2.6e-05,-0.00013,8.1e-05,-1e-06,5.1e-05,9e-06,-1.1e-05,-7.9e-05,-4.1e-05,1.1e-05,-2.3e-05,1.4e-05,2.1e-05,8e-06,-1e-05,4.4e-05,8.6e-05,1e-06,4.2e-05,2.1e-05,-6.4e-05,-8e-06,0,-8e-06,-1.6e-05,-2.1e-05,2e-06,4e-06,2e-06,7e-06,2e-05,-8e-06,0,-1.5e-05,-1.4e-05,7e-06,-7e-06,-1e-06,-1e-06,-7e-06,2e-06,-7e-06,-9e-06,-1e-05,-3e-06,1e-06,2.9e-05,-2.5e-05,-1.4e-05,-3e-06,2.1e-05,-7e-06,-7e-06,-1.9e-05,2e-06,-1e-06,4e-06
-1e-06,-3e-06,-1e-06,-3e-06,5e-06,8e-06,0,1e-06,-1e-05,4e-06,1e-06,4e-06,2e-06,-3e-06,9e-06,0,1e-06,-3e-06,-4e-06,-1.3e-05,-4e-06,-1.5e-05,1.3e-05,0,1e-06,7e-06,5e-06,-5.9e-05,1.5e-05,3.6e-05,-5.7e-05,4.8e-05,0,0.000314,6.2e-05,0.000192,-0.000187,0.00041,-0.000146,-0.000379,1.2e-05,0.000571,-0.000119,0.000188,-6.8e-05,-0.000117,-3e-04,-0.000103,-0.000178,-1.8e-05,-0.00013,0.00031,-0.000141,0.000165,0.00012,1e-06,8.6e-05,-3.1e-05,-0.000268,0.000181,-1.6e-05,0.000161,0.000191,3.5e-05,4.6e-05,1.1e-05,-8e-06,3.4e-05,5.7e-05,-3.8e-05,-1.5e-05,7.1e-05,3e-06,3e-05,-1e-04,-1.4e-05,3.3e-05,3.1e-05,3e-06,3.1e-05,-3e-05,-5e-06,-6.1e-05,2e-05,3e-06,1.1e-05,-2.4e-05,4e-06,-9e-06,-7e-06,-4e-06,1e-06,-5e-06,-3e-06,1.8e-05,-1.5e-05,-2e-06,-8e-06,1.8e-05,-6e-06,-2e-06,3e-06,-1e-06,-9e-06,4e-06,-8e-06,-2e-06,2e-06,7e-06,4e-06,4.4e-05,2.7e-05,1.9e-05,-3.4e-05,3e-06,-8e-06,2e-06,-5e-06,4e-06,-1e-06,0
3e-06,-1e-06,6e-06,-3e-06,-3e-06,1e-06,-1e-06,7e-06,-8e-06,2e-06,2e-06,-4e-06,2e-06,-1e-06,-1.1e-05,-4e-06,-2e-06,3e-06,6e-06,-6e-06,-1e-06,-1.7e-05,-7.1e-05,6e-06,7e-06,-9e-06,2e-06,4.1e-05,-2.8e-05,-2.9e-05,5.5e-05,-5.8e-05,-6e-06,0.000287,-6.4e-05,-0.000263,-8.6e-05,-0.000302,-9.6e-05,-0.000493,0.000174,-0.000413,-8.3e-05,-0.000218,-0.000164,2e-05,-2.4e-05,0.000136,2.1e-05,-2.5e-05,1.9e-05,-0.000269,5e-06,-2.8e-05,-7.4e-05,0.00014,2.5e-05,7.8e-05,0.000121,-0.000124,-2.7e-05,-8.3e-05,-0.00017,-3.7e-05,5.2e-05,-2e-06,3.4e-05,-2e-05,-8.4e-05,-4.9e-05,-3.3e-05,-1.2e-05,-8e-06,-3e-06,7.4e-05,1.3e-05,-1.3e-05,-1.9e-05,-4e-06,6e-06,3e-06,3e-06,0,-4.6e-05,-6.7e-05,-1e-06,1.6e-05,1e-06,-1.6e-05,1.9e-05,1e-06,-4e-06,-1e-06,5e-06,1.7e-05,-2.1e-05,-7e-06,-3e-06,-6e-06,7e-06,1.1e-05,-1e-06,1e-06,-1.1e-05,-3e-06,-5e-06,-1e-06,-2e-06,0,-2e-06,-7e-05,-1e-06,3.3e-05,4.1e-05,-9e-06,-6e-06,6e-06,1e-06,-4e-06,-2e-06,-1e-06
0,-2e-06,3e-06,-1e-06,-2e-06,1e-06,0,0,-4e-06,-3e-06,-3e-06,2e-06,0,-1e-06,0,4e-06,-6e-06,-5e-06,-3e-06,-8e-06,-1e-06,2e-06,-7.1e-05,-8e-06,1e-06,-1e-06,0,-7e-06,2.9e-05,4.8e-05,-2.7e-05,7e-06,0,2.1e-05,-0.000133,-8.6e-05,-0.000138,7.2e-05,0.00041,0.000321,-0.000261,9.8e-05,-5.1e-05,0.000139,0.000243,8.4e-05,-6.6e-05,1.1e-05,1.6e-05,0.00016,-7.3e-05,-6e-06,-1.1e-05,-6.5e-05,3e-06,-1.6e-05,5.9e-05,-7.7e-05,-1.6e-05,4.1e-05,-8.4e-05,8.4e-05,0.000153,0.000119,0.000124,2.4e-05,-5.3e-05,-8e-06,8.5e-05,6.4e-05,2.8e-05,3e-06,4.2e-05,-9e-06,2e-05,5e-06,-1.9e-05,-2e-05,-7e-06,-2.1e-05,-2.2e-05,1e-06,1.9e-05,-1.3e-05,2.7e-05,-2e-06,2.6e-05,3e-06,3e-06,3e-06,4e-06,-8e-06,0,5e-06,1e-05,-6e-06,9e-06,1.4e-05,7e-06,-7e-06,3e-06,2e-06,-1e-06,-1.7e-05,-7e-06,-9e-06,2e-06,-2e-06,-2e-06,4e-06,1.8e-05,-8e-06,-2e-06,-3.5e-05,-1.1e-05,-6e-06,8e-06,-2e-06,-1e-06,-1e-06,0
2e-06,-4e-06,-3e-06,0,-6e-06,-2e-06,0,3e-06,-2e-06,-5e-06,0,1e-06,0,0,2e-06,-4e-06,1e-06,2e-06,-2e-06,-6e-06,0,-2e-05,-0.000125,-2.8e-05,-5e-06,-5e-06,3e-06,-1.1e-05,1.5e-05,-3.2e-05,-5e-06,-3e-06,8e-06,-0.00032,6.9e-05,0.000238,6.2e-05,-0.000192,0.000148,-3.5e-05,-0.000137,1.8e-05,2e-05,-0.000107,-2.2e-05,1.3e-05,-0.000119,-8.2e-05,0.00023,-0.000111,6e-05,7.6e-05,-2.4e-05,-5e-06,5e-06,-2e-06,-0.000202,9.8e-05,5.8e-05,-4.1e-05,2.3e-05,-4.2e-05,-0.000153,-1.7e-05,7.8e-05,4e-05,5e-06,5e-06,-6e-05,5e-06,1.8e-05,4.4e-05,-3.3e-05,-2e-06,-1e-05,6e-06,-7e-06,4e-06,-3e-06,-2e-05,-1.5e-05,-7e-06,-2.1e-05,-2.6e-05,1.4e-05,2e-06,-1.4e-05,4e-06,0,-4e-06,-2e-06,1e-06,-1e-06,-1.1e-05,1.1e-05,1.8e-05,-5e-06,8e-06,-1e-06,4e-06,-2e-06,-1e-06,-1e-06,-1.2e-05,-3e-06,-4e-06,2e-06,3e-06,4e-06,1e-06,5.9e-05,-3e-06,-8e-06,-4e-06,6e-06,-6e-06,1e-06,-3e-06,4e-06,-1e-06,-1e-06
0,0,1e-06,0,-5e-06,-3e-06,0,-1e-06,-3e-06,4e-06,2e-06,-3e-06,1e-06,-2e-06,-4e-06,3e-06,1e-06,-2e-06,-1e-06,-1e-06,-3e-06,-1.4e-05,2e-06,-2.6e-05,-3e-06,-1.5e-05,1e-06,0,-1.1e-05,2.4e-05,4.4e-05,4.3e-05,-2.1e-05,-0.000247,3e-05,0.00018,6e-05,0.000122,-0.000208,9.4e-05,5.4e-05,-7.5e-05,9e-06,0.000145,6.2e-05,-6.9e-05,3.3e-05,-8.3e-05,-0.000168,-7.5e-05,-4.5e-05,-0.000136,0.000131,5.8e-05,2.2e-05,5e-06,8.7e-05,5.7e-05,4.9e-05,6e-05,9.2e-05,-5e-05,0.000176,1.2e-05,-9e-06,-7.8e-05,-3e-05,3e-06,2e-06,4.6e-05,1.4e-05,-4.3e-05,0,-9e-06,2.6e-05,-2.2e-05,-1e-06,0,-1e-06,-7e-06,-2e-05,-4e-06,7e-06,1e-05,3.6e-05,2e-06,1e-06,-8e-06,-7e-06,-5e-06,-6e-06,6e-06,-1e-06,2e-06,1e-05,-3e-05,1e-06,7e-06,-8e-06,-1e-06,-8e-06,-1e-06,0,-1.1e-05,3e-06,-5e-06,3e-06,-4e-06,-1e-06,-1e-06,-3.4e-05,1.2e-05,-2.4e-05,1.9e-05,5e-06,-5e-06,3e-06,-9e-06,2e-06,-2e-06,-2e-06
0,-2e-06,3e-06,1e-06,1e-06,0,0,-1e-06,-6e-06,-1e-06,0,1e-06,0,0,-3e-06,-3e-06,-2e-06,1e-06,3e-06,-1e-06,3e-06,2e-06,-3e-05,-6e-06,0,5e-06,0,-1e-06,-1.4e-05,-4e-05,-5.3e-05,-4.9e-05,2.4e-05,5e-05,2.4e-05,-0.000247,1.6e-05,3e-05,-0.000185,-0.000207,-8.2e-05,0.000228,-8.5e-05,-0.000189,-0.000127,-4.9e-05,-6.1e-05,0.000156,-0.000144,1.7e-05,-2.8e-05,7e-06,-0.000104,3.6e-05,-1.3e-05,-3.3e-05,-0.000108,-0.00012,2.6e-05,-1.7e-05,-2.2e-05,4.8e-05,-5e-05,-8e-06,-3.7e-05,-6e-06,1.1e-05,-4e-05,7.4e-05,-7.5e-05,-2.4e-05,5e-05,1.9e-05,-1.1e-05,-6.3e-05,-4e-06,1e-06,-2e-06,-6e-06,1e-05,6e-06,-1e-06,-2.5e-05,1.5e-05,-4.2e-05,-1e-06,-1.4e-05,0,7e-06,7e-06,0,3e-06,0,-1e-06,8e-06,1.2e-05,1e-06,-1.8e-05,5e-06,-1e-06,-2e-06,-1e-06,-1e-06,-8e-06,3e-06,-4e-06,2e-06,2e-06,1e-06,2e-06,-3.9e-05,0,-1e-06,-1.4e-05,-3e-06,-5e-06,-4e-06,-5e-06,-3e-06,0,-1e-06
-1e-06,-3e-06,0,0,0,-2e-06,0,-4e-06,-8e-06,1e-06,0,-3e-06,0,-1e-06,-4e-06,2e-06,1e-06,0,0,-4e-06,-1e-06,-1.3e-05,3.9e-05,1.2e-05,2e-06,-1.6e-05,-1e-06,9e-06,-6e-06,3.3e-05,3.7e-05,-1.6e-05,-1.2e-05,0.000146,-2.8e-05,-0.000143,6.6e-05,3.2e-05,-9.8e-05,0.000195,0.000207,-0.000215,-3.6e-05,0.000107,0.000122,-1.5e-05,4.9e-05,-0.000222,8.1e-05,-2.5e-05,1.9e-05,-1.5e-05,6.7e-05,0.000129,4.8e-05,-2.4e-05,-3e-06,6.4e-05,8.8e-05,5.7e-05,-5.6e-05,-1.7e-05,6e-05,-2.6e-05,-5.4e-05,1.7e-05,-5e-05,6.3e-05,-6.8e-05,2.2e-05,-2.4e-05,-3e-06,-1e-05,-3e-06,7e-06,-1.8e-05,-1e-05,5e-06,0,1.9e-05,8e-06,0,9e-06,1.7e-05,-3.2e-05,-2e-06,1e-06,1e-06,2e-06,-9e-06,2e-06,-2e-06,-1e-06,2e-06,6e-06,7e-06,-2e-06,-1e-05,-2e-06,1e-06,3e-06,1e-06,-2e-06,-6e-06,0,-5e-06,0,-4e-06,0,0,3.7e-05,-1.4e-05,4e-06,1e-05,1e-06,-6e-06,-5e-06,-9e-06,-2e-06,-1e-06,0
-1e-06,0,-2e-06,1e-06,0,3e-06,0,-1e-06,-1e-06,-5e-06,-1e-06,1e-06,0,2e-06,0,-2e-06,2e-06,2e-06,-2e-06,-8e-06,0,-1.2e-05,3e-05,1.2e-05,-8e-06,2e-06,-1e-06,2e-05,1.5e-05,-1.9e-05,-1.7e-05,5.1e-05,-2e-06,0.000159,3.1e-05,0.000266,3.5e-05,5.8e-05,0.00019,0.000132,-0.000201,3.3e-05,2.9e-05,-6e-05,-5e-06,4.2e-05,5.6e-05,0.000171,0.000111,-7.5e-05,1e-05,1.1e-05,-0.000112,-0.000253,-4.9e-05,-5.5e-05,6.5e-05,5e-05,-5.2e-05,-9.2e-05,2.7e-05,2.3e-05,-8.3e-05,-1e-06,-6.3e-05,1.4e-05,-1e-05,-3.6e-05,1e-05,-3.4e-05,4e-06,-1.2e-05,3e-06,1.2e-05,2.9e-05,-4e-06,-5e-06,7e-06,-2e-06,5e-06,7e-06,8e-06,-6e-06,1.8e-05,3.5e-05,2e-06,-5e-06,-1e-06,4e-06,1.3e-05,-1e-06,-5e-06,-1e-06,-2e-06,4e-06,7e-06,4e-06,6e-06,2e-06,0,2e-06,-1e-06,1e-06,-1e-05,-5e-06,-4e-06,-1e-06,-1e-06,0,-1e-06,1.1e-05,8e-06,1.4e-05,-9e-06,0,-4e-06,-4e-06,1e-06,3e-06,0,0
-1e-06,-3e-06,3e-06,1e-06,1e-06,0,0,0,-3e-06,0,0,-2e-06,0,0,-3e-06,0,0,0,0,-5e-06,1e-06,-9e-06,2.4e-05,2e-06,-1e-06,-1.5e-05,-3e-06,-3.2e-05,-1.4e-05,2.8e-05,-8e-06,1e-05,2e-06,7.2e-05,-3e-05,-8e-06,0,-8.7e-05,0.000202,-8.3e-05,4e-06,1e-06,-1.6e-05,-1.3e-05,-0.000125,5.3e-05,3.4e-05,-0.000109,-0.000121,5.9e-05,-7.6e-05,9.9e-05,3.7e-05,0.000179,3.5e-05,3.5e-05,1.5e-05,-9.1e-05,-1.1e-05,5.4e-05,-7e-05,-1.2e-05,6.9e-05,-1.1e-05,-4.4e-05,-2e-05,1e-05,3.3e-05,3.2e-05,2.2e-05,2.4e-05,2.9e-05,-7e-06,6e-06,1.5e-05,-1e-06,1e-06,-2e-06,-2e-06,-6e-06,8e-06,3e-06,-8e-06,-1.3e-05,1.7e-05,-1e-06,-2.2e-05,2e-06,-1e-06,-3e-06,-1e-06,-1e-06,-1e-06,1e-06,4e-06,-6e-06,-3e-06,1.1e-05,2e-06,2e-06,-1e-06,0,0,-1e-05,1e-06,-4e-06,-2e-06,0,1e-06,0,-4.1e-05,2e-06,6e-06,-3e-06,1e-06,-5e-06,-2e-06,-2e-06,1e-06,-1e-06,0
0,-1e-06,1e-06,0,-4e-06,2e-06,0,-1e-06,-6e-06,5e-06,1e-06,2e-06,0,-1e-06,-1e-06,1e-06,-2e-06,0,1e-06,-2e-06,0,-2e-06,4.2e-05,-2e-06,2e-06,0,-2e-06,1e-05,1.5e-05,-2.8e-05,2.3e-05,-2.1e-05,-1e-06,-0.000131,1e-05,-6.7e-05,4e-06,9.6e-05,-6.8e-05,-0.000148,-9e-06,-6.9e-05,-5.8e-05,2e-06,6.6e-05,-4.7e-05,6.9e-05,0.000134,4.1e-05,1.8e-05,-3e-06,3.7e-05,3.5e-05,-0.000134,-1.4e-05,3.1e-05,-1.3e-05,6.8e-05,-8.5e-05,-2.5e-05,4.3e-05,-3.1e-05,-0.000104,-9e-06,6e-06,-4.2e-05,2e-06,-1.4e-05,-2e-05,3.2e-05,-6e-06,2e-06,2e-05,0,-1e-06,-4e-06,3e-06,-1e-06,-2e-06,-2.1e-05,3e-06,-4e-06,1.6e-05,-1.1e-05,-3e-05,0,1.1e-05,-3e-06,3e-06,-4e-06,-1e-06,3e-06,1e-06,2e-06,2e-06,-2e-06,2e-06,0,1e-06,-3e-06,-2e-06,-1e-06,-1e-06,-1e-05,3e-06,-4e-06,0,-1e-06,-1e-06,0,2.9e-05,-5e-06,0,1e-05,-6e-06,-6e-06,-1e-06,-2e-06,-2e-06,0,1e-06
0,0,-2e-06,-1e-06,-1e-06,0,0,3e-06,-2e-06,1e-06,0,0,0,-1e-06,-2e-06,-2e-06,0,0,0,-2e-06,-1e-06,-1.7e-05,2.9e-05,3e-06,4e-06,2e-06,-3e-06,1.1e-05,1.1e-05,2.3e-05,-1.4e-05,-4.6e-05,4e-06,-0.000152,6e-06,3e-05,-1.8e-05,-0.000162,-0.000128,9.1e-05,-3.8e-05,5.4e-05,-2e-05,7.4e-05,7.7e-05,-5.8e-05,3e-05,-6.3e-05,6e-06,-1.3e-05,9e-06,4e-06,3e-06,1.3e-05,8e-06,2e-05,2.9e-05,-1.7e-05,2.5e-05,-2.9e-05,7.2e-05,9e-06,7.8e-05,1.2e-05,2.4e-05,6e-06,-1.5e-05,1.9e-05,6e-06,3e-06,-1.1e-05,-1.8e-05,-1.3e-05,5e-06,-4e-05,-5e-06,3e-06,-4e-06,0,-5e-06,-1e-05,-4e-06,-1.6e-05,-1.5e-05,-2.5e-05,-2e-06,5e-06,2e-06,-3e-06,-3e-06,-2e-06,3e-06,0,0,2e-06,1.6e-05,-2e-06,-4e-06,-1e-06,2e-06,0,2e-06,1e-06,-8e-06,0,-4e-06,-2e-06,2e-06,1e-06,-1e-06,2.2e-05,3e-06,-5e-06,-3e-06,3e-06,-2e-06,3e-06,-2e-06,-1e-06,0,0
1e-06,-2e-06,0,0,-1e-06,-1e-06,0,1e-06,-5e-06,-1e-06,-1e-06,-1e-06,1e-06,-2e-06,-1e-06,2e-06,-1e-06,0,-2e-06,-2e-06,2e-06,-1e-05,3.6e-05,7e-06,2e-06,-1.3e-05,-2e-06,-8e-06,-1.7e-05,-2.7e-05,-1e-06,5e-05,-4e-06,-1.3e-05,5e-06,-1.8e-05,-3e-05,9.6e-05,-0.000133,-0.000115,4.3e-05,7.6e-05,5.1e-05,-0.000124,-5.5e-05,4.9e-05,6.2e-05,9.5e-05,2.4e-05,4.9e-05,-4.8e-05,2.4e-05,1.8e-05,-5.8e-05,-1.5e-05,3.3e-05,-1.1e-05,-9e-06,-4.1e-05,1.4e-05,-6.5e-05,5e-06,-8.1e-05,8e-06,4.9e-05,3.4e-05,2.4e-05,-2e-05,4e-06,-1.8e-05,1.2e-05,4.5e-05,0,0,1.3e-05,8e-06,3e-06,1e-06,-3e-06,8e-06,-3e-06,-2e-06,1e-05,-1e-05,1.7e-05,1e-06,4e-06,2e-06,-2e-06,4e-06,1e-06,0,0,-2e-06,0,-1.3e-05,2e-06,1e-06,2e-06,-2e-06,2e-06,-1e-06,0,-7e-06,-2e-06,-4e-06,0,-2e-06,0,0,-5.1e-05,2e-06,-1.4e-05,-5e-06,4e-06,-5e-06,3e-06,-7e-06,2e-06,-1e-06,0
1e-06,-1e-06,3e-06,0,-1e-06,0,0,0,-2e-06,-2e-06,0,1e-06,0,1e-06,0,-2e-06,0,-1e-06,0,-4e-06,-1e-06,2e-06,-1e-05,2e-06,-3e-06,4e-06,-2e-06,-5e-06,1e-06,2.8e-05,1.1e-05,-6e-06,3e-06,6.5e-05,-2.1e-05,1.3e-05,-3.3e-05,-0.000135,7.5e-05,8.5e-05,2.8e-05,-8.1e-05,-2.6e-05,5.6e-05,-8.2e-05,3.8e-05,3.8e-05,-0.000107,-5.3e-05,9e-06,-7e-06,-0.000128,-6.9e-05,3.4e-05,3e-05,-2.1e-05,-6e-05,4.1e-05,-1.1e-05,-7e-06,-1.9e-05,0,8.6e-05,-2e-06,6.6e-05,-2e-06,9e-06,1.7e-05,-4e-06,1.6e-05,7e-06,-4.1e-05,4e-06,-8e-06,3e-06,-8e-06,-1e-06,1e-06,0,1.6e-05,-7e-06,2e-06,-5e-06,9e-06,-9e-06,0,2e-06,-2e-06,-4e-06,1e-06,1e-06,-2e-06,-1e-06,1e-06,0,-3e-06,-3e-06,-2e-06,-4e-06,1e-06,2e-06,0,-1e-06,-7e-06,-3e-06,-3e-06,0,0,-1e-06,0,1e-05,0,-5e-06,5e-06,1e-06,-4e-06,2e-06,-3e-06,0,0,0
0,-1e-06,0,-1e-06,1e-06,-2e-06,0,1e-06,-4e-06,-1e-06,1e-06,-2e-06,0,1e-06,-3e-06,2e-06,0,1e-06,1e-06,-6e-06,-1e-06,-9e-06,-7e-06,-6e-06,-5e-06,-8e-06,-1e-06,-2e-06,-1e-06,-2e-05,-1.7e-05,1.6e-05,2e-06,7.9e-05,1.1e-05,1e-04,-2e-05,0.000202,0.000171,-6e-05,-0.000155,6.6e-05,-4.8e-05,5.9e-05,8.2e-05,-1e-05,2.2e-05,-9e-06,-4e-06,-2.8e-05,1.1e-05,-1.5e-05,2.7e-05,1e-05,-2.9e-05,-4.5e-05,3.1e-05,-4.9e-05,-1e-06,-1e-06,4.1e-05,1.3e-05,-4.7e-05,2.4e-05,2.6e-05,7e-06,1.4e-05,-2.4e-05,1.3e-05,-3e-05,-1.1e-05,3.3e-05,8e-06,-7e-06,4e-06,-2e-06,5e-06,3e-06,-2e-06,0,0,4e-06,-1.2e-05,1.1e-05,3e-06,0,-8e-06,0,-1e-06,2e-06,-2e-06,-2e-06,0,-2e-06,-1e-06,0,2e-06,-2e-06,2e-06,-1e-06,-2e-06,0,0,-7e-06,2e-06,-3e-06,2e-06,-1e-06,1e-06,0,3.7e-05,-2e-06,1.1e-05,-5e-06,-4e-06,-5e-06,2e-06,-4e-06,-2e-06,0,0
0,-1e-06,-2e-06,0,-2e-06,1e-06,0,-1e-06,-3e-06,3e-06,0,1e-06,0,0,0,-2e-06,1e-06,-1e-06,0,-3e-06,0,-1.3e-05,-5.7e-05,-1e-05,-1e-06,0,-2e-06,-2e-06,2e-06,2e-05,9e-06,-4.5e-05,-2e-06,4.6e-05,4e-06,-8.6e-05,6e-06,-0.00015,1.3e-05,0.000172,5.2e-05,-6.6e-05,8e-06,-6.9e-05,-5e-05,-6.3e-05,3.4e-05,4.1e-05,6.2e-05,-1e-06,-1.8e-05,-6.6e-05,-2.6e-05,-4e-06,2e-05,-4.2e-05,-3.1e-05,2.9e-05,3.8e-05,1.9e-05,-3.8e-05,-2.2e-05,4.8e-05,-2.1e-05,-1.2e-05,-9e-06,0,1.7e-05,-8e-06,3.1e-05,1e-06,-7e-06,-1.6e-05,3e-06,1.7e-05,-2e-06,2e-06,3e-06,0,-4e-06,3e-06,0,5e-06,1e-05,-3e-06,0,6e-06,-2e-06,-1e-06,-6e-06,-1e-06,0,0,2e-06,-2e-06,6e-06,-2e-06,2e-06,-2e-06,1e-06,-2e-06,1e-06,0,-8e-06,2e-06,-4e-06,0,-1e-06,0,1e-06,-2.6e-05,2e-06,1.2e-05,-4e-06,0,-3e-06,-1e-06,1e-06,0,0,0
-1e-06,-1e-06,1e-06,1e-06,-2e-06,-1e-06,0,-1e-06,-2e-06,0,-1e-06,-1e-06,0,0,-2e-06,1e-06,0,0,-1e-06,-2e-06,0,-5e-06,-3.8e-05,-5e-06,5e-06,-9e-06,-2e-06,2e-05,3e-06,-1.9e-05,7e-06,1.5e-05,0,-3.5e-05,1.3e-05,-3.8e-05,1.5e-05,0.000132,-9.5e-05,-3.8e-05,3.5e-05,-3.6e-05,2e-05,2e-06,3.6e-05,9e-06,-5e-06,-4.1e-05,-2.3e-05,2.6e-05,-2.4e-05,-4e-06,5.6e-05,-4e-06,-1e-05,1.6e-05,1.4e-05,5e-06,8e-06,-1e-06,8e-06,1.8e-05,-4.2e-05,4e-06,-3.3e-05,2.9e-05,2e-05,-1.7e-05,3e-06,-1.7e-05,-5e-06,-6e-06,1.2e-05,-1e-06,-2e-05,-1e-05,-6e-06,-4e-06,-2e-06,-1.2e-05,6e-06,-1e-06,-1.2e-05,9e-06,-4e-06,0,-1e-06,2e-06,-3e-06,5e-06,1e-06,2e-06,0,-2e-06,-2e-06,-6e-06,0,-2e-06,1e-06,0,-1e-06,-1e-06,-1e-06,-8e-06,1e-06,-3e-06,0,1e-06,0,0,-1.4e-05,1e-06,-1e-06,7e-06,2e-06,-4e-06,-2e-06,-3e-06,2e-06,0,0
-1e-06,-1e-06,1e-06,0,-1e-06,1e-06,0,-1e-06,-5e-06,-1e-06,0,1e-06,0,-1e-06,-1e-06,0,-1e-06,0,0,-2e-06,-1e-06,0,-3.4e-05,0,2e-06,0,-2e-06,-1e-05,-2e-06,1.4e-05,-1.6e-05,1.4e-05,0,-7.1e-05,-2.6e-05,6.3e-05,2.6e-05,-0.000161,-0.000128,-4.3e-05,-4.7e-05,9.9e-05,-2.3e-05,3.9e-05,-5.8e-05,9e-06,-2e-06,4.2e-05,-6.6e-05,-4.8e-05,2.5e-05,0.000134,-1.4e-05,6.5e-05,5e-06,3.9e-05,1.2e-05,-2.6e-05,1.5e-05,-1.1e-05,5e-06,2e-06,1.7e-05,-1.1e-05,-5.2e-05,-4e-06,-1e-06,7e-06,-7e-06,1.3e-05,-3e-06,1.7e-05,1e-06,0,-7e-06,-3e-06,-1e-06,1e-06,1e-06,-1e-06,-1e-06,-1e-06,1.1e-05,-1.1e-05,4e-06,0,-8e-06,1e-06,4e-06,-4e-06,0,2e-06,0,1e-06,-3e-06,-6e-06,0,5e-06,3e-06,0,1e-06,1e-06,0,-7e-06,-3e-06,-4e-06,0,-1e-06,1e-06,0,2.9e-05,-4e-06,-8e-06,0,0,-5e-06,-3e-06,0,0,0,0
-1e-06,-1e-06,-1e-06,0,-2e-06,0,0,0,0,-1e-06,0,-1e-06,0,0,-2e-06,0,0,0,1e-06,-3e-06,0,-1.3e-05,-1.8e-05,-1e-06,0,-6e-06,-2e-06,-1.1e-05,4e-06,-1.3e-05,1.7e-05,4e-06,-4e-06,-1.7e-05,-1.4e-05,2.1e-05,8e-06,0.000166,-1e-06,-6.7e-05,2e-05,-0.000107,-1.6e-05,-1.3e-05,6.4e-05,6e-05,-2e-05,-5.1e-05,6.2e-05,0,-5e-06,8e-06,-8e-06,-1.7e-05,-1.2e-05,7e-06,2.2e-05,4.3e-05,4.1e-05,2.9e-05,-2.7e-05,-1e-06,-4.8e-05,5e-06,-4.7e-05,-8e-06,0,2e-06,1e-05,-2.5e-05,1.8e-05,-9e-06,-1e-06,7e-06,-1e-06,-5e-06,2e-06,-2e-06,-2e-06,1e-06,1e-06,-1e-06,1e-06,-1e-05,1.8e-05,0,-4e-06,-1e-06,1e-06,6e-06,0,0,0,0,-3e-06,9e-06,-1e-06,1e-06,-2e-06,0,2e-06,0,0,-7e-06,-1e-06,-3e-06,1e-06,1e-06,-1e-06,0,-6e-06,3e-06,-2e-06,2e-06,-1e-06,-3e-06,-2e-06,-3e-06,-2e-06,0,0
0,-1e-06,-1e-06,1e-06,0,0,0,-1e-06,-5e-06,2e-06,0,0,0,0,-1e-06,1e-06,0,0,-1e-06,-4e-06,1e-06,-1.1e-05,1.8e-05,-4e-06,-3e-06,-4e-06,-2e-06,9e-06,-5e-06,1.3e-05,-1.1e-05,4e-06,5e-06,3.2e-05,1.9e-05,1e-06,-4e-06,-0.000171,0.000133,3.7e-05,-4.4e-05,8.5e-05,1.5e-05,-3.9e-05,7e-05,-3.7e-05,-1.9e-05,7.3e-05,7e-06,9e-06,-3.2e-05,7.3e-05,-8e-06,-3.3e-05,1.4e-05,1.2e-05,-1.4e-05,-3.8e-05,-2.4e-05,-2.7e-05,4.1e-05,2e-06,2.4e-05,-1.4e-05,-1.5e-05,-1e-05,-6e-06,-5e-06,2e-06,1.6e-05,-6e-06,3e-06,-4e-06,5e-06,1.8e-05,-4e-06,1e-06,-1e-06,1e-06,1.2e-05,-4e-06,1e-06,-1e-06,-1.1e-05,-2e-06,0,-3e-06,0,4e-06,-6e-06,0,-3e-06,0,1e-06,-3e-06,1e-06,1e-06,-4e-06,2e-06,-1e-06,-1e-06,1e-06,-1e-06,-6e-06,1e-06,-3e-06,-1e-06,0,0,0,-3e-05,2e-06,0,-6e-06,-1e-06,-4e-06,-1e-06,-6e-06,0,0,0
0,-1e-06,2e-06,0,0,1e-06,0,1e-06,-1e-06,2e-06,0,0,0,0,-1e-06,-1e-06,-1e-06,0,0,-4e-06,0,2e-06,1.1e-05,-2e-06,-3e-06,0,-1e-06,7e-06,0,-1e-05,-3e-06,-4.5e-05,-3e-06,1.8e-05,2.7e-05,-4.6e-05,-9e-06,0.000136,8.5e-05,-4.4e-05,-3.1e-05,2.2e-05,1e-06,4.5e-05,-0.000118,-3.1e-05,-1.8e-05,-5.9e-05,-2.5e-05,0,6e-06,6e-06,-3e-05,2.2e-05,-1.8e-05,8e-06,6e-06,-3e-06,-1e-06,1.4e-05,1.4e-05,-4e-06,-3.6e-05,1.7e-05,1.4e-05,2e-06,-3e-06,3e-06,-1.2e-05,-1.7e-05,-5e-06,1.1e-05,4e-06,-5e-06,4e-06,-3e-06,0,2e-06,-1e-06,4e-06,0,1e-06,5e-06,-1e-06,-3e-05,0,5e-06,0,-2e-06,3e-06,-1e-06,-2e-06,0,-2e-06,-3e-06,-5e-06,0,-3e-06,-1e-06,1e-06,-1e-06,-1e-06,0,-6e-06,3e-06,-3e-06,0,-1e-06,0,0,2.9e-05,-2e-06,-4e-06,0,3e-06,-3e-06,1e-06,-1e-06,1e-06,0,0
1e-06,-1e-06,0,0,-1e-06,-1e-06,0,1e-06,-4e-06,-2e-06,0,-1e-06,0,0,-2e-06,2e-06,0,-1e-06,-1e-06,-2e-06,-1e-06,-7e-06,3.7e-05,4e-06,1e-06,-1.1e-05,-1e-06,-8e-06,7e-06,1e-05,1.4e-05,3.6e-05,-1e-06,-4e-06,-1.4e-05,-2.1e-05,-7e-06,-0.000141,-4.7e-05,7.9e-05,7.6e-05,-9.3e-05,-8e-06,-2.7e-05,4e-05,-2e-05,-4.6e-05,7.1e-05,4e-06,-1.7e-05,1e-06,-7.7e-05,4.2e-05,2e-06,1.2e-05,-1.5e-05,4e-06,4e-05,-3.1e-05,2e-06,-2.5e-05,5e-06,4.9e-05,-1.2e-05,3.6e-05,3e-06,-8e-06,5e-06,8e-06,4e-06,2e-06,-1.7e-05,6e-06,-4e-06,-1.5e-05,0,1e-06,1e-06,0,-1e-06,-2e-06,-1e-06,-8e-06,9e-06,-2e-06,0,3e-06,0,-2e-06,1e-06,0,1e-06,0,1e-06,-4e-06,-2e-06,0,0,-1e-06,-1e-06,0,1e-06,0,-7e-06,-1e-06,-3e-06,0,1e-06,0,0,1.4e-05,0,2e-06,2e-06,-2e-06,-4e-06,1e-06,-3e-06,0,0,0
