-0.000666,-0.001768,-0.001241,-0.000929,-0.00105,-0.001073,-0.001222,-0.001346,-0.00097,-0.000746,-0.000688,-0.000691,-0.000789,-0.001429,-0.000907,-0.000999,-0.001303,-0.000978,-0.001491,-0.001297,-0.001879,-0.001544,-0.001199,-0.000856,-0.00112,-0.000934,-0.000838,-0.001384,-9e-04,-0.001603,-0.001198,-0.000926,-0.000826,-0.000956,-0.000633,-0.001044,-0.001157,-0.001434,-0.001135,-0.000663,-0.000776,-0.00065,-0.000925,-0.001113,-0.000755,-0.000993,-0.000832,-0.00075,-0.000665,-0.001107,-0.001112,-0.001538,-0.001054,-0.001403,-0.001356,-0.000861,-0.000823,-0.00094,-0.001337,-0.002672,-0.001439,-0.00105,-0.000827,-0.000903,-0.000889,-0.000562,-0.001128,-0.001112,-0.000881,-0.000949,-0.000907,-0.001263,-0.000914,-0.000403,-0.000555,-0.000517,-0.000821,-0.000759,-0.001309,-0.0012,-0.000923,-0.00073,-0.000744,-0.000796,-0.000689,-0.000734,-0.000422,-0.000845,-0.00091,-0.000907,-0.000874,-0.000663,-0.000478,-0.001037,-0.001531,-0.001294,-0.001018,-0.000602,-0.000944,-0.001739,-0.001091,-0.001077,-0.000603,-0.000724,-0.000549,-5e-04,-0.000424,-0.000635,-0.000782,-0.000691,-0.000514,-0.000949,-0.00124,-0.001011,-0.000869,-0.00123,-0.000708,-0.00075,-0.00092,-0.001184,-0.000987
8.6e-05,0.001016,0.000698,0.000379,0.000433,0.000482,0.000687,0.000705,0.000246,6e-05,0.000141,0.000201,0.000364,0.000419,5.7e-05,0.000302,0.00038,0.00025,0.000841,0.00039,0.00091,0.000702,0.00024,0.00023,0.00029,0.000543,-9.4e-05,0.000677,0.000173,0.000662,0.000491,0.00023,0.000155,0.000369,0.000126,0.00037,0.000712,0.000808,0.00053,0.000341,0.000561,6.3e-05,0.000339,0.000546,0.000291,0.000806,0.000371,0.000329,0.000109,0.000393,0.00071,0.001151,0.000489,0.000729,0.00101,0.000652,0.000319,0.000624,0.000793,0.00149,0.000928,0.000503,0.000315,0.000375,0.000378,0.000316,0.00053,0.000675,0.000307,0.000394,0.000537,0.000917,0.000482,0.000202,0.000207,0.00015,0.000312,0.000195,0.000654,0.000554,0.000468,0.000194,0.000172,0.000394,0.000392,0.000709,0.000287,0.000485,4e-04,0.00033,0.000486,0.000565,2e-04,0.000417,0.000794,0.00047,0.000465,0.000433,0.000517,0.000901,0.000479,0.000436,0.00038,0.000322,-6e-06,0.000215,0.000116,0.000164,0.000346,0.000337,8.5e-05,0.000489,0.000653,0.000412,0.000388,0.000653,0.000108,0.000278,0.000326,0.000798,0.000476
-7.5e-05,-0.000528,-0.000405,8.9e-05,0.000171,-6.3e-05,-0.000412,-0.000391,-0.000182,1.9e-05,0.000135,1.2e-05,-7.1e-05,0.000187,0.000205,0.000108,0.000448,3e-06,-0.000199,-2.3e-05,-4.5e-05,0.000122,0.000381,6.9e-05,-0.000114,-0.000241,0.000195,-0.000456,-0.000197,-9.5e-05,-0.000198,0.000186,0.00027,-0.000235,4e-05,9e-06,-0.000426,-0.000278,-0.000282,-0.000225,-0.000223,-5.6e-05,-0.00013,-0.000183,-0.000102,-0.000326,-6.8e-05,-3e-06,6.5e-05,-0.000175,-0.000468,-0.00041,0.000171,-4.5e-05,-0.000617,-0.000348,-0.000224,-0.000332,-0.000516,-0.000217,-0.000471,-0.00026,-8.7e-05,-6.2e-05,-0.000486,-0.000348,-0.000413,-0.000186,-2e-05,5.8e-05,-0.000147,-0.000378,-0.00014,9.7e-05,-0.000348,-0.000196,-1.5e-05,9.6e-05,-0.000435,-0.000607,-0.000409,-0.00018,-0.000187,-8.3e-05,-0.000358,-0.000474,-0.000385,-0.000327,0.000109,-0.000192,-0.000144,-0.000146,-0.00015,0.000127,0.000164,-7.2e-05,-0.000226,-0.000194,-0.000268,-0.000283,-0.000459,-0.000102,1.6e-05,-0.000383,2.3e-05,-0.000105,0.000171,-3.6e-05,-0.000354,-0.000332,-5e-06,-0.000177,-0.000468,-0.000256,-0.00015,-6.9e-05,9.7e-05,-0.000228,-6.3e-05,-0.000535,-0.000248
-7e-06,0.000105,0.000153,-0.000184,-0.00026,-0.000196,1e-05,-0.00018,-8.6e-05,-3.5e-05,-8.4e-05,-0.000218,-0.000245,-0.000263,-0.000166,-0.000361,-0.000699,2.6e-05,-7.7e-05,-2.7e-05,-0.000499,-0.000575,-0.000653,-0.000454,-0.000105,-0.000205,-0.000139,7.7e-05,0.000286,-0.000387,-0.000279,-9e-05,-0.000316,-7e-06,-7.2e-05,-0.000193,8.5e-05,-6.9e-05,0,6e-06,-9.8e-05,-0.000262,-3e-06,-0.000194,-0.000121,-9.9e-05,-0.000134,-0.000164,-8.8e-05,0.000295,0.000134,0.000136,-0.000382,-0.000263,-0.000214,-0.000149,-5.8e-05,-0.000231,-0.000187,-0.000627,-0.000148,-0.000127,-0.000403,-0.00019,-2e-06,0.000118,2.8e-05,-0.000362,-0.000383,-0.000374,-0.000393,0.000109,-0.000175,-0.000259,6.4e-05,-2.9e-05,-6e-06,-0.000241,5e-05,0.000234,4.9e-05,-3e-06,-0.000422,-0.000302,-0.00024,7.9e-05,6.3e-05,0.000185,-0.000281,0.000117,0.000205,9.4e-05,-0.000179,-0.000326,-0.000611,-9.6e-05,0.000219,-3e-06,1.8e-05,-3.1e-05,0.00032,7.9e-05,-0.000261,-0.000109,-0.00018,0.000143,-0.000186,0.000154,0.000158,0.00013,-0.000114,2.8e-05,0.000318,-0.000264,-0.000206,-0.00024,-0.000317,0.000144,3.8e-05,0.000378,-2e-05
-0.000107,-0.000117,-3.7e-05,2.1e-05,0.000126,0.000307,0.000265,0.000512,0.000319,-0.000122,-4.1e-05,0.000138,0.000103,-5.8e-05,0.000249,0.000374,0.000356,6.4e-05,8.2e-05,0.000332,0.000283,0.000353,0.000525,0.000334,0.000172,0.000301,0.00023,-6e-05,-0.000221,0.000476,0.000345,3.8e-05,0.000183,-0.000106,-0.000217,-2.4e-05,-3.3e-05,-5.3e-05,-3.2e-05,-2e-06,7.7e-05,6.1e-05,-2.9e-05,0.00016,-0.000119,5.4e-05,-0.000107,-0.000235,-2.5e-05,-4e-05,-3.4e-05,-0.000206,-6.3e-05,8.6e-05,0.000297,7.2e-05,-1.7e-05,-4.5e-05,3.5e-05,0.000305,-5.1e-05,0.000228,0.000288,0.000216,0.000149,5e-06,-2.9e-05,0.000191,0.000214,0.00024,0.000274,3.8e-05,2.1e-05,-1e-06,-2.8e-05,0.000126,8.3e-05,6.6e-05,0.000169,-0.000173,1e-06,0.000123,0.000319,0.000325,-5.4e-05,4.5e-05,0.000102,-0.000148,-9.5e-05,-0.000113,-0.000158,2e-05,4.7e-05,2e-04,0.00034,-1e-04,-0.000378,-0.000165,3.5e-05,6.8e-05,-9.1e-05,1.9e-05,0.000299,0.000268,0.000237,1.9e-05,2e-06,7.1e-05,-0.00019,-0.00016,4.6e-05,-0.000169,-0.000168,0.00029,0.00018,0.000487,8.2e-05,-6.8e-05,-5.4e-05,-4.9e-05,-7.9e-05
4.3e-05,2.8e-05,-2.5e-05,6.3e-05,7e-06,-0.000231,-0.00039,-0.000316,-8.2e-05,0.000172,1e-04,-4.5e-05,8.6e-05,0.000266,-0.000125,-0.000148,-0.000141,1.8e-05,7.8e-05,-0.000291,2.6e-05,2.9e-05,-6.1e-05,3.3e-05,-4.7e-05,-7.9e-05,-0.000137,0.000178,0.00053,-0.000231,-0.00024,0.000115,0.000101,5.6e-05,0.000118,9e-05,5.2e-05,-9.7e-05,-4e-06,0.000105,-4.1e-05,0.000131,-3.1e-05,-0.000214,-3.3e-05,-0.000187,0.000107,0.000137,0,-8e-05,0.000145,0.000262,0.000136,4.8e-05,-0.000121,8.9e-05,8.3e-05,0.000128,0.000216,-0.000104,0.000383,-6.7e-05,-0.000267,-4.7e-05,0.000113,-9.5e-05,-0.000135,-0.000305,-1.7e-05,-1.7e-05,-0.000103,7.6e-05,4.3e-05,8e-06,0.00022,9.3e-05,-7.3e-05,4.2e-05,1e-06,0.000305,0.000179,-0.00017,0.000122,-5.8e-05,0.000329,3.5e-05,3.1e-05,8.6e-05,0.000231,0.000115,0.000168,-7e-05,0.000177,-7.9e-05,-9.4e-05,0.00026,0.000154,0.000219,0.000133,9.1e-05,9.1e-05,1e-06,-0.000151,5.9e-05,-3.6e-05,0.000189,2.2e-05,-0.000137,0.000147,0.000297,4.3e-05,0.000118,-8.4e-05,-7.7e-05,0.000258,-0.000295,2.3e-05,1.7e-05,-6.9e-05,-5.3e-05,0.000359
4.3e-05,5.5e-05,-5.9e-05,0.000169,-7.3e-05,2e-06,0.000252,0.000138,2.2e-05,3.9e-05,9e-05,-4.6e-05,-4.7e-05,-0.000185,1.1e-05,0,-2.2e-05,-8.4e-05,-0.00014,3.1e-05,-3.1e-05,-0.000278,-0.000207,-4.4e-05,6e-05,4.1e-05,-0.000171,-0.000152,-0.000434,-8e-06,0.000147,-6.5e-05,-1e-04,7.5e-05,-6.8e-05,-0.000101,-9e-05,6.6e-05,-4.6e-05,-0.000307,-2.3e-05,-0.000114,0.000222,0.000127,0.000125,2.7e-05,-0.000346,-4.1e-05,0.000156,-8.8e-05,-0.000204,-0.000233,-0.000224,-9.6e-05,-7.3e-05,-3.8e-05,-0.000193,-6.4e-05,-0.000237,-8.8e-05,-0.000425,-0.000103,0.000283,-0.000145,-0.000248,-7.6e-05,0.000189,0.000228,-0.000181,-0.000197,-5.3e-05,-2.7e-05,-2.6e-05,-9.8e-05,2.1e-05,-7.7e-05,-3.4e-05,-0.000157,-4.9e-05,-0.000224,-4.9e-05,1e-04,-2.4e-05,-8.9e-05,-0.000234,-4.3e-05,0.000179,-0.00015,-2.4e-05,-4.9e-05,-8.1e-05,-0.000144,-0.000135,2e-06,0.00021,-0.000239,-8.4e-05,-0.000152,-3.1e-05,-0.000101,-0.000123,7.7e-05,-4e-06,-0.000121,-1.5e-05,-0.000113,5e-06,5.2e-05,-5.2e-05,-0.00023,-9.5e-05,-4.4e-05,0.000187,5.3e-05,-0.000312,-4.5e-05,-1.1e-05,-3.1e-05,0.000257,-5.5e-05,-0.000301
-0.000154,3.3e-05,9.5e-05,-0.000154,-1.2e-05,9.4e-05,-4.6e-05,-0.000111,2.2e-05,-0.000129,-0.000216,6e-06,5e-05,-1.4e-05,-2.6e-05,4.9e-05,9.3e-05,-7.2e-05,9e-05,9.5e-05,-3e-05,0.000253,0.000146,-8.5e-05,-0.000137,7.5e-05,0.000238,4e-05,0.000327,1.7e-05,1.3e-05,-5e-06,-1.8e-05,-0.000199,-8.2e-05,-6.3e-05,0.000124,-8.2e-05,-2e-05,0.000234,-0.000119,2e-06,1e-05,-0.000125,-0.000193,1.6e-05,0.000256,1.7e-05,-0.000243,-9.6e-05,-1.6e-05,0,4.9e-05,-9.4e-05,0.000118,0.000273,0.000158,0.000187,0.000172,0.000121,0.000137,-0.000146,-0.000141,-6e-05,0.000269,0.000132,-6.9e-05,1e-06,0.00014,0.000218,8.1e-05,6e-06,8.1e-05,-5e-06,1.8e-05,-7.1e-05,8.2e-05,4.2e-05,1.1e-05,-7.1e-05,-0.000152,-8.5e-05,5.4e-05,-9e-05,2.4e-05,-0.000101,-0.000112,1.1e-05,-1.8e-05,-1.5e-05,3.2e-05,6.3e-05,0.000151,-2.8e-05,-8.1e-05,0.000109,0.00011,0.000128,4.1e-05,3.7e-05,7.9e-05,-3.4e-05,2.3e-05,2.5e-05,-5e-06,-5.8e-05,3.1e-05,-2.6e-05,-5.9e-05,9.9e-05,6.8e-05,3.3e-05,-8.9e-05,-7.5e-05,-2.1e-05,-2.9e-05,-9.7e-05,-0.000172,-0.000258,-3.4e-05,0.000337
0.000102,-6.5e-05,-9.9e-05,0.000166,6e-06,-0.000224,-3.5e-05,5.8e-05,-8.7e-05,-2e-06,4.4e-05,3.9e-05,-4.9e-05,7e-06,2e-06,8.2e-05,-2.9e-05,4.6e-05,0.000141,-0.000159,-5.8e-05,-1.6e-05,1e-06,4.2e-05,0.000125,-4.8e-05,-0.000115,-3.1e-05,-0.000157,2.4e-05,-3e-06,0.000108,-2.4e-05,0.000222,5.3e-05,8.1e-05,8e-06,0.000198,9.2e-05,-5e-05,3.8e-05,3.2e-05,-7.7e-05,2.4e-05,0.000239,4.8e-05,-8.3e-05,9e-06,0.000103,0.000106,2.2e-05,9.3e-05,9e-05,0.000137,-7.4e-05,-0.00022,-0.000119,-0.000118,-4e-06,6.6e-05,0.000165,0.000347,-9.4e-05,4.8e-05,-0.000243,-1.3e-05,7.7e-05,8.5e-05,-0.000103,0.000106,-3.6e-05,-0.000234,-9.9e-05,-6e-06,3.1e-05,-1.8e-05,-0.000173,-2.3e-05,5e-06,1.9e-05,0.000173,7.4e-05,-3.4e-05,3.5e-05,8.7e-05,-6.9e-05,9.1e-05,0.000102,0.000119,2.4e-05,-7.7e-05,-3e-05,4.4e-05,8.2e-05,-2.3e-05,0.000106,-0.000129,-0.000123,-8.1e-05,-0.000171,-2.8e-05,0.000135,-8.6e-05,-3.5e-05,-5.6e-05,7e-05,2.9e-05,-1.2e-05,-3.2e-05,-0.000109,1.3e-05,-3.5e-05,4.2e-05,0.000115,6.9e-05,0.000118,-4.8e-05,0.000192,0.000144,4.7e-05,-0.000229
0.000116,0.000118,0.000106,-0.000131,2.8e-05,-1e-06,-2.8e-05,3e-06,2.1e-05,-7e-05,3.9e-05,-4.5e-05,-7.6e-05,4.2e-05,5e-06,-0.00013,5.8e-05,-1.4e-05,-0.00027,8.8e-05,-3.6e-05,-2.4e-05,-7.4e-05,-4.6e-05,1e-06,-9.5e-05,1.1e-05,6.7e-05,-0.000101,-5.9e-05,-9.6e-05,-0.000137,-1.2e-05,-3.8e-05,0.000108,8.7e-05,1.6e-05,-0.000197,-2.1e-05,-8e-06,-1.1e-05,-6.1e-05,4e-06,-6e-05,-6e-05,2.7e-05,-4.9e-05,2.7e-05,2.5e-05,4.6e-05,5.6e-05,-0.000101,-4e-05,-0.000126,-3.1e-05,1.5e-05,0.000131,7.4e-05,0.000127,-2.8e-05,-3.4e-05,-0.000218,-2e-05,2.3e-05,9.2e-05,5e-05,-7.6e-05,-0.000101,0.000121,-0.000112,-8e-06,0.000155,0.000127,9.6e-05,5.6e-05,5e-05,0.000213,9.8e-05,-0.000119,7e-06,-0.000248,-1.9e-05,7.7e-05,4e-05,-5e-05,-9.8e-05,-0.000114,-4.7e-05,-6.2e-05,2e-06,0.000119,4.8e-05,1.4e-05,-3.1e-05,0.000104,-0.000165,0.000181,3.8e-05,1e-05,7.4e-05,8.6e-05,-0.000161,-6e-06,-0.000112,-1.1e-05,-0.00013,4e-06,8.5e-05,-8e-06,5.9e-05,-4e-06,3.4e-05,9e-06,1.2e-05,-2.3e-05,-0.000101,7.3e-05,-0.000159,1.4e-05,-7.3e-05,0.00013
-4.9e-05,-0.000149,-2.8e-05,0.000112,-6.8e-05,1e-04,2.6e-05,-9.2e-05,1.6e-05,0.000144,-5e-06,7.6e-05,7.4e-05,6.4e-05,5.6e-05,-1.9e-05,-0.000142,9e-06,0.000142,-6.7e-05,9.4e-05,-4.3e-05,3.5e-05,7e-06,-4.2e-05,7.8e-05,3.6e-05,-1.4e-05,0.000171,0.000106,8.7e-05,5.7e-05,-7.9e-05,-1e-05,-0.000103,-0.00011,-2.9e-05,9.3e-05,4.2e-05,8.9e-05,7.2e-05,4.7e-05,-3.1e-05,6.5e-05,2.9e-05,-3.9e-05,0.000114,-4e-06,1.9e-05,-6.6e-05,-1.6e-05,7.4e-05,-2e-06,4.6e-05,5.5e-05,3.5e-05,2.7e-05,3e-05,-5.5e-05,-5.1e-05,7.5e-05,0.000188,9.3e-05,-2.5e-05,1.3e-05,-8.1e-05,0.000146,2.4e-05,9.9e-05,4.4e-05,5.6e-05,-3.7e-05,-1.4e-05,-6e-05,-1.8e-05,3.8e-05,-8.5e-05,-4.3e-05,0.000109,6e-05,0.000166,1e-04,3.1e-05,8.3e-05,8.8e-05,0.00014,3.7e-05,0.000112,1.2e-05,-1.4e-05,-4.4e-05,-3.6e-05,6.3e-05,-2.7e-05,-0.000133,3.6e-05,-0.000126,-8.6e-05,-4.1e-05,-4.5e-05,-3e-05,0.000168,1e-06,8.9e-05,9.6e-05,7e-05,0.000105,-3.8e-05,5.7e-05,-5.3e-05,-2.7e-05,-2.5e-05,-6e-06,-8.8e-05,9.6e-05,9.7e-05,-2e-06,9.9e-05,6.1e-05,8.4e-05,9.6e-05
-3.9e-05,4.3e-05,-9e-06,-1.5e-05,1.3e-05,-4.9e-05,-6.3e-05,3.3e-05,-1.2e-05,-0.000112,1.3e-05,-2.6e-05,-3.6e-05,-9.2e-05,-7.3e-05,0.000109,8.6e-05,7e-05,-2.3e-05,6.4e-05,-8.3e-05,7.2e-05,-1.6e-05,3.6e-05,1.5e-05,-2e-06,-7.5e-05,-7.4e-05,-5.7e-05,-0.000144,2.5e-05,-3.3e-05,1.3e-05,3.7e-05,-3e-06,7.4e-05,2e-05,-1.6e-05,-3.9e-05,-3.7e-05,-5.6e-05,5e-06,-1.5e-05,4.9e-05,2.8e-05,4.9e-05,-2e-05,0.000118,-8e-06,4.5e-05,6e-05,-1.2e-05,1.5e-05,3.9e-05,-3.5e-05,-5.7e-05,-2.1e-05,-4e-06,7.9e-05,5.3e-05,-8.1e-05,-0.000131,-3.9e-05,5e-06,-8.3e-05,1.8e-05,-0.00011,-1e-06,-9.4e-05,4e-06,1.7e-05,-3.5e-05,8e-06,7.8e-05,-8.7e-05,5e-05,2.8e-05,-2.5e-05,6e-06,-2.3e-05,-1.7e-05,-0.00012,-0.000123,-4.3e-05,-9.1e-05,-1.2e-05,2.5e-05,-4.5e-05,-2.1e-05,-2.7e-05,1.5e-05,0,-0.000101,-3.1e-05,2.3e-05,2e-06,5e-05,3.5e-05,3.5e-05,1.4e-05,-4e-06,-0.00014,3.7e-05,-0.000101,-6.3e-05,1e-05,-3.2e-05,-3.3e-05,-5.9e-05,1.8e-05,2e-06,2.8e-05,-3.3e-05,7.5e-05,-2.7e-05,-8e-05,1.5e-05,-2e-06,-3.8e-05,-3.5e-05,-8.9e-05
3.2e-05,4.4e-05,-2.2e-05,-0.000116,-4e-05,4e-06,2.9e-05,2.4e-05,-3.2e-05,4.9e-05,1.1e-05,-3e-05,-5e-06,2e-05,1.1e-05,-6.6e-05,-5.6e-05,-4e-05,-1.5e-05,-7.8e-05,3.9e-05,-1.7e-05,2.2e-05,-2.1e-05,-1.1e-05,-1e-06,-4.7e-05,8e-06,-8.1e-05,5.3e-05,-3.2e-05,-2.7e-05,-8e-06,-4e-06,5.7e-05,-4.5e-05,9e-06,-2e-05,-9e-06,2.1e-05,1e-06,-4.6e-05,4.9e-05,-1e-05,-5e-05,-3.9e-05,6e-06,-8.8e-05,3.1e-05,8e-06,-5.3e-05,-2e-06,-4.5e-05,4e-06,-3.7e-05,-2e-06,-2.5e-05,1e-05,-0.000161,-4.5e-05,1e-06,7.3e-05,2.2e-05,3.8e-05,-2e-05,-5e-05,1.7e-05,-3.9e-05,6.6e-05,-2.2e-05,-5.4e-05,8.5e-05,-1.9e-05,-0.000103,-4e-06,2.2e-05,-2.3e-05,-2.3e-05,-7.1e-05,-1e-06,-3.5e-05,1.3e-05,8.2e-05,1e-06,3e-05,-2.8e-05,-3.6e-05,-1.1e-05,5e-06,4e-06,2e-06,-2.5e-05,6.3e-05,2e-05,-9e-06,5.5e-05,-1.9e-05,2.8e-05,-2e-06,2e-06,-6e-06,-9e-06,-8.7e-05,2.9e-05,1.7e-05,-2.6e-05,-3.5e-05,3.8e-05,5e-05,-1e-05,-3.8e-05,-2e-06,2.1e-05,-2.9e-05,1.3e-05,2e-05,-5.6e-05,-5.2e-05,3e-05,-2e-06,-3.3e-05
-4.3e-05,-8.8e-05,-9e-06,6.2e-05,4.1e-05,1.4e-05,-1.3e-05,-1.1e-05,3e-06,-2.6e-05,1.8e-05,-2e-05,2.4e-05,3e-05,5e-06,-2.6e-05,1.1e-05,5e-06,6e-05,2.8e-05,0,3e-06,-2e-05,1e-05,-2.2e-05,-6.7e-05,2.7e-05,5.2e-05,6.2e-05,-1e-05,-4.8e-05,6.9e-05,1.8e-05,2e-06,-4e-05,1.2e-05,-1.1e-05,-2e-06,-2e-06,-3.3e-05,1.9e-05,6.9e-05,1e-05,-4.6e-05,5.1e-05,1.1e-05,-3.7e-05,2.1e-05,-3e-05,-9e-06,1.6e-05,1.8e-05,7e-06,2.5e-05,-9e-06,-3.4e-05,2e-06,-1.6e-05,6.6e-05,4.3e-05,4e-06,-4.4e-05,9e-06,-4.8e-05,3.6e-05,2.9e-05,-1.2e-05,5.1e-05,-7.9e-05,4.3e-05,-3e-05,-2.2e-05,4e-06,4.2e-05,-9e-06,1.6e-05,-1.2e-05,2.8e-05,9.7e-05,1.9e-05,9e-06,4.5e-05,-6.4e-05,9e-06,-3.8e-05,1.6e-05,-5.2e-05,2.1e-05,-2.4e-05,1e-06,-2.5e-05,2.4e-05,-3.3e-05,-6.2e-05,3.8e-05,4e-06,-5.1e-05,-3.9e-05,0,1.6e-05,-8e-06,5.1e-05,6.1e-05,1e-06,-1.9e-05,2.7e-05,3.6e-05,-5.3e-05,-3.7e-05,5e-06,1.3e-05,-1.4e-05,-1.6e-05,3.1e-05,-1.9e-05,3e-05,9e-06,3.6e-05,-3.6e-05,-2.1e-05,-1.8e-05
1.8e-05,-4e-06,-2e-06,-1.1e-05,-2e-06,-1.4e-05,1.1e-05,-1.9e-05,6e-06,1.1e-05,-3.2e-05,2.7e-05,-5e-06,-1.3e-05,2.1e-05,3.7e-05,4.1e-05,-1.5e-05,-3.8e-05,1.6e-05,8e-06,4e-06,1.3e-05,8e-06,1.7e-05,2.6e-05,4.8e-05,-2.4e-05,-1.8e-05,2e-06,4e-05,-2.5e-05,2.5e-05,2e-06,2e-05,-2.7e-05,-2.9e-05,6e-06,1.2e-05,3.4e-05,-1.2e-05,-5.3e-05,-1.5e-05,1e-05,0,-8e-06,2.1e-05,2.5e-05,7e-06,-1e-05,-2e-05,-2.7e-05,3e-05,2e-06,2.2e-05,1.4e-05,0,-5e-06,-4.4e-05,-4.3e-05,-1.8e-05,-1.8e-05,-4.6e-05,-1.2e-05,9e-06,9e-06,8e-06,-5.8e-05,5.9e-05,-3.7e-05,1.5e-05,0,4e-06,-1e-06,-7.5e-05,-7e-06,2e-05,-2.3e-05,6e-06,-3e-05,-8e-06,-4.6e-05,2.9e-05,-2.6e-05,5e-06,1.8e-05,-1e-06,-1.5e-05,-2.7e-05,-3e-06,3.7e-05,-1.3e-05,-2.3e-05,3.8e-05,-6e-06,-2.2e-05,7.5e-05,-1.2e-05,-1.2e-05,-4e-05,5e-06,1.5e-05,1e-06,0,-4e-06,-3.1e-05,8e-06,-2e-06,-8e-06,-1.2e-05,-7e-06,1e-05,-1.2e-05,-6.1e-05,-3e-06,-9e-06,1.4e-05,-2.3e-05,-1.5e-05,5e-06,2.7e-05
1.1e-05,2.2e-05,2.5e-05,-1.5e-05,-2e-06,-1.2e-05,0,2.6e-05,-1.6e-05,2.1e-05,2.1e-05,-1.1e-05,4e-06,2e-06,-7e-06,1e-06,-3.1e-05,8e-06,2.3e-05,-9e-06,-1e-05,6e-06,-4e-06,-5e-06,-3e-06,1.9e-05,-3.1e-05,3e-06,2.6e-05,9e-06,-2.3e-05,1.3e-05,-2.2e-05,-1.1e-05,-1.3e-05,3e-05,7e-06,-1.8e-05,1e-06,-6e-06,-5e-06,2.3e-05,2.7e-05,0,-7e-06,-2.6e-05,-2e-06,-3.2e-05,-1.3e-05,3e-06,5e-06,1.5e-05,-2e-06,2e-06,-2.4e-05,-1.9e-05,-3e-06,9e-06,9e-06,1e-05,2.3e-05,2e-06,3e-05,4.1e-05,6e-06,-1.5e-05,2.3e-05,1.5e-05,-2.9e-05,-2.3e-05,6e-06,1e-06,-1.3e-05,-1.8e-05,5.2e-05,-1e-06,-2.9e-05,2.3e-05,-9e-06,-2e-05,1e-05,3.6e-05,-5e-06,4e-06,6e-06,-5e-06,-1.6e-05,1.9e-05,3.4e-05,7e-06,-4e-06,-2e-06,-6e-06,-1.3e-05,-4e-06,2.1e-05,-2e-06,3.4e-05,5e-06,3.1e-05,-1.8e-05,-2.7e-05,-4e-06,2.3e-05,3e-06,1.8e-05,4e-06,6e-06,2.7e-05,9e-06,8e-06,-1e-06,1.6e-05,5.3e-05,3.1e-05,-3e-06,9e-06,1.4e-05,1.5e-05,-6e-06,-1.5e-05
1e-06,2.8e-05,-9e-06,3.4e-05,3e-06,1.3e-05,1.7e-05,3e-06,2e-06,-3.4e-05,-4e-06,7e-06,-7e-06,-1.1e-05,8e-06,-1.5e-05,2.7e-05,6e-06,-3.5e-05,6e-06,-1e-06,-6e-06,-1.1e-05,-7e-06,6e-06,-9e-06,1.1e-05,-8e-06,-2e-05,2.4e-05,1.7e-05,-4e-06,2.5e-05,9e-06,-1e-06,-9e-06,-1.2e-05,8e-06,3e-06,-2e-05,7e-06,-1.3e-05,1.4e-05,-1e-06,-2e-06,1.2e-05,-3.1e-05,3.6e-05,4e-06,3e-06,1.2e-05,-1.7e-05,-1.1e-05,-1e-05,2e-06,2.1e-05,2e-06,-7e-06,-3e-06,-1.7e-05,-2.6e-05,2e-06,1.8e-05,5e-06,1.6e-05,-9e-06,-5e-06,-2e-06,1.9e-05,-5e-06,-1.6e-05,8e-06,-1e-06,-9e-06,1e-06,-2.8e-05,5e-06,-1.4e-05,-3e-06,8e-06,3e-06,-1.3e-05,-1e-06,3e-06,9e-06,-3.3e-05,7e-06,1e-05,1.1e-05,-3e-06,-2.1e-05,7e-06,-1.2e-05,-9e-06,-2.5e-05,-2.1e-05,-2.5e-05,1e-06,0,-3.1e-05,2e-06,2.9e-05,-5e-06,-1.5e-05,-2.4e-05,1e-06,-1.1e-05,-1.2e-05,-3.2e-05,-1e-06,-2e-06,0,-1.3e-05,-2.9e-05,-5e-05,-3e-06,-1.9e-05,-5e-06,-3.1e-05,0,-2.7e-05
2e-06,2e-06,-1.2e-05,-2.9e-05,-9e-06,-2e-06,-2.6e-05,-2.2e-05,8e-06,1.2e-05,0,1e-06,1.8e-05,1.6e-05,-1.2e-05,1.6e-05,-2.9e-05,0,2e-05,5e-06,-5e-06,1e-06,1.1e-05,-6e-06,2e-06,-8e-06,-8e-06,3e-06,-4e-06,-4.4e-05,-2.5e-05,-1.3e-05,-1.5e-05,-8e-06,2e-06,1e-06,3e-06,-5e-06,-2e-06,2.9e-05,-2e-06,9e-06,-1e-06,0,-8e-06,-7e-06,3.8e-05,-1.9e-05,-1.8e-05,-1.6e-05,-1.5e-05,1.1e-05,-1e-05,-5e-06,8e-06,1.1e-05,9e-06,-3e-06,-2e-06,1e-06,1.9e-05,-1e-05,-3.5e-05,-1.5e-05,5e-06,-6e-06,-1.6e-05,9e-06,1.2e-05,0,1e-06,-2.4e-05,-5e-06,1.8e-05,6e-06,0,-6e-06,1.1e-05,-1e-06,3e-06,-2.8e-05,1.3e-05,2.1e-05,1.6e-05,-4e-06,1.6e-05,2e-06,-9e-06,4e-06,7e-06,1.2e-05,-9e-06,6e-06,2e-06,3.3e-05,1.1e-05,-1.1e-05,-2.4e-05,9e-06,7e-06,-6e-06,-3.3e-05,-4e-06,1.1e-05,1.7e-05,-1.4e-05,-8e-06,1.2e-05,1.7e-05,-2e-06,-4e-06,1e-06,-4e-06,8e-06,3.5e-05,-1.9e-05,3e-06,-1e-05,1.5e-05,2e-06,2.9e-05
-1.6e-05,-1.4e-05,1.4e-05,2e-05,5e-06,0,4e-06,5e-06,0,2e-06,3e-06,-3e-06,-1.3e-05,1.1e-05,-2e-06,-2e-06,1.4e-05,1.5e-05,-2e-06,-1.5e-05,1e-06,0,2e-06,1e-06,-5e-06,7e-06,-7e-06,-1.2e-05,2.2e-05,2.4e-05,8e-06,1.6e-05,1e-06,-1.1e-05,-1.5e-05,-4e-06,1e-06,4e-06,-4e-06,-2.1e-05,-5e-06,-7e-06,-1.8e-05,1e-05,-4e-06,0,-1.3e-05,4e-06,2.1e-05,5e-06,1.2e-05,-1e-06,6e-06,7e-06,-4e-06,-1.4e-05,-1.2e-05,3e-06,-1.1e-05,6e-06,-7e-06,1.7e-05,4e-06,-6e-06,-8e-06,1e-06,1.4e-05,-5e-06,-1.1e-05,1.3e-05,-2e-06,-1e-05,9e-06,-1.4e-05,2.4e-05,-1e-06,5e-06,-2.1e-05,-5e-06,2e-06,3e-05,-2.5e-05,-3.4e-05,4e-06,3e-06,8e-06,1.4e-05,1e-06,-1.4e-05,1e-06,-1.5e-05,1e-05,-2.2e-05,-2e-06,-1.4e-05,4e-06,-5e-06,3e-06,-1.5e-05,3e-06,-4e-06,2.6e-05,4e-06,-1.6e-05,-1e-05,1.9e-05,-2e-06,8e-06,-1e-05,3e-06,2e-06,2e-06,5e-06,-1.1e-05,0,2e-06,3e-06,1.6e-05,8e-06,-3e-06,-2e-05
-5e-06,-5e-06,-1.2e-05,8e-06,-4e-06,-1e-06,5e-06,1e-05,0,-1e-06,1e-06,-3e-06,1e-06,-2e-05,-1e-06,-5e-06,6e-06,-7e-06,-1.3e-05,-1e-05,2e-06,-4e-06,-4e-06,3e-06,1e-06,1e-05,0,2e-06,-3.9e-05,-1.8e-05,4e-06,-2.1e-05,-6e-06,-1e-06,0,2e-06,-3e-06,-3e-06,-4e-06,8e-06,4e-06,2e-06,-6e-06,-6e-06,1.3e-05,-3e-06,-2e-06,5e-06,-1.5e-05,3e-06,-9e-06,-6e-06,3e-06,9e-06,1e-06,1.3e-05,1e-06,-7e-06,4e-06,-3e-06,-1.2e-05,-1.5e-05,8e-06,4e-06,-2e-06,8e-06,-1.4e-05,3e-06,6e-06,-1.2e-05,-3e-06,1.9e-05,-9e-06,0,1e-06,9e-06,-4e-06,1e-06,-6e-06,-2e-06,-1.3e-05,1.8e-05,2.3e-05,-7e-06,-1e-06,-1.1e-05,1e-06,-1.1e-05,6e-06,-5e-06,1.1e-05,-7e-06,6e-06,-6e-06,-7e-06,-1.3e-05,1.8e-05,7e-06,6e-06,-5e-06,-3e-06,-2.6e-05,-8e-06,0,1.2e-05,-1.3e-05,1e-06,-1.8e-05,1e-06,-8e-06,-2e-06,-4e-06,0,7e-06,-5e-06,1e-06,1e-06,-1.1e-05,-1.4e-05,-1e-06,1.8e-05
9e-06,1.1e-05,8e-06,-2e-05,8e-06,-1e-06,-6e-06,-1e-05,0,5e-06,2e-06,6e-06,-3e-06,6e-06,3e-06,0,-8e-06,-5e-06,6e-06,2.3e-05,3e-06,1e-06,-2e-06,-2e-06,6e-06,-5e-06,9e-06,7e-06,3.1e-05,8e-06,-5e-06,1e-05,-4e-06,-1e-06,9e-06,-1e-06,-2e-06,-9e-06,2e-06,-1e-05,-4e-06,-6e-06,-5e-06,-5e-06,-1.6e-05,0,2e-06,-8e-06,5e-06,3e-06,6e-06,4e-06,-2e-06,4e-06,-8e-06,5e-06,-2e-06,3e-06,-1e-06,-2e-06,1.2e-05,3e-06,6e-06,-4e-06,-1e-06,4e-06,7e-06,-3e-06,-1.6e-05,7e-06,2e-06,-1e-05,-2e-06,1.1e-05,1e-06,-5e-06,8e-06,4e-06,3e-06,-2e-06,-7e-06,-1.4e-05,-4e-06,-5e-06,-5e-06,-1e-06,1e-05,2e-06,2.1e-05,2e-06,-9e-06,3e-06,1.1e-05,1.6e-05,2e-06,0,5e-06,-6e-06,-4e-06,7e-06,-1e-06,1.1e-05,1.6e-05,-2e-06,-1e-05,0,-7e-06,2e-06,6e-06,1.1e-05,5e-06,5e-06,-2e-06,7e-06,7e-06,5e-06,-7e-06,4e-06,-1e-06,-8e-06,-1e-05
5e-06,3e-06,0,1.4e-05,-7e-06,5e-06,2e-06,-2e-06,1e-06,-1.3e-05,-2e-06,-9e-06,-2e-06,3e-06,-1e-06,7e-06,6e-06,0,2e-06,-1.7e-05,-3e-06,-1e-06,-4e-06,5e-06,-7e-06,-1e-05,5e-06,-3e-06,-1.4e-05,-5e-06,-4e-06,4e-06,2e-06,-1e-06,-3e-06,-7e-06,5e-06,9e-06,5e-06,5e-06,4e-06,1e-05,1e-06,0,1.1e-05,-4e-06,-6e-06,-1e-06,-3e-06,1e-06,-2e-06,-4e-06,6e-06,6e-06,5e-06,2e-06,-3e-06,-1e-06,7e-06,-5e-06,-5e-06,1e-06,-1.7e-05,-4e-06,-8e-06,-3e-06,-3e-06,5e-06,1.5e-05,-5e-06,-2e-06,9e-06,1e-06,-1.9e-05,6e-06,6e-06,-8e-06,4e-06,4e-06,-1e-06,1e-05,8e-06,3e-06,-5e-06,1.5e-05,2e-06,3e-06,3e-06,-1.4e-05,1e-06,6e-06,1e-06,-9e-06,-8e-06,6e-06,1e-06,-1.5e-05,5e-06,3e-06,-6e-06,4e-06,8e-06,-2.1e-05,-1.2e-05,6e-06,4e-06,1e-06,1e-06,-8e-06,-1.1e-05,1e-06,0,6e-06,-1.4e-05,-2.1e-05,1e-06,-1e-06,-7e-06,0,1e-06,-3e-06
-6e-06,-4e-06,1e-06,-4e-06,1e-06,-7e-06,2e-06,4e-06,0,1.5e-05,-3e-06,3e-06,4e-06,-1e-06,6e-06,-5e-06,-9e-06,-5e-06,4e-06,1e-05,3e-06,-2e-06,4e-06,-1e-06,5e-06,4e-06,-8e-06,-5e-06,-8e-06,1e-05,8e-06,-1e-05,3e-06,3e-06,-7e-06,1e-05,3e-06,-2e-06,0,6e-06,-6e-06,-1.3e-05,6e-06,3e-06,-1e-05,4e-06,4e-06,2e-06,-2e-06,-9e-06,-1e-06,2e-06,-3e-06,0,1e-06,-1.1e-05,6e-06,-7e-06,2e-06,1e-06,1.2e-05,-1.3e-05,1.4e-05,9e-06,1e-05,-5e-06,-6e-06,0,-9e-06,4e-06,0,5e-06,4e-06,1.4e-05,-8e-06,-7e-06,0,1e-06,1e-06,-3e-06,-6e-06,1e-06,2e-06,-4e-06,-1.2e-05,4e-06,1e-06,-2e-06,-2e-06,-1e-06,0,0,8e-06,-1e-06,-8e-06,8e-06,3e-06,-1e-06,-3e-06,2e-06,0,-1.2e-05,1.4e-05,6e-06,-3e-06,-6e-06,2e-06,-1e-06,3e-06,6e-06,2e-06,-6e-06,-3e-06,7e-06,1.4e-05,0,3e-06,8e-06,1e-06,1e-06,1.6e-05
2e-06,0,2e-06,1e-06,-4e-06,-2e-06,-2e-06,2e-06,-3e-06,-7e-06,-2e-06,5e-06,-3e-06,-1e-06,-4e-06,2e-06,9e-06,3e-06,6e-06,4e-06,0,1e-06,-3e-06,1e-06,2e-06,1e-06,4e-06,1e-06,1.9e-05,-8e-06,-4e-06,1.5e-05,-3e-06,-3e-06,7e-06,-6e-06,1e-06,-2e-06,-2e-06,-1.5e-05,3e-06,1.2e-05,-7e-06,-2e-06,4e-06,1e-06,-9e-06,-5e-06,-6e-06,2e-06,1e-06,0,-2e-06,2e-06,-9e-06,0,-3e-06,5e-06,0,-1e-06,-8e-06,2e-05,-1.9e-05,4e-06,-9e-06,-4e-06,6e-06,0,5e-06,5e-06,1e-06,-4e-06,-1e-06,-5e-06,-8e-06,-1e-06,4e-06,-1e-05,2e-06,0,5e-06,6e-06,-9e-06,6e-06,7e-06,-5e-06,-3e-06,3e-06,4e-06,-1e-06,0,-5e-06,-2e-06,-2e-06,-3e-06,-1e-06,-4e-06,-7e-06,4e-06,-3e-06,4e-06,2e-06,-6e-06,-5e-06,2e-06,9e-06,-2e-06,6e-06,-1e-05,-7e-06,-3e-06,9e-06,0,0,-4e-06,-4e-06,0,-3e-06,6e-06,1e-06,-1e-05
1e-06,-6e-06,-3e-06,1e-06,5e-06,5e-06,0,-4e-06,-1e-06,2e-06,4e-06,0,5e-06,-5e-06,-2e-06,1e-06,-9e-06,3e-06,-1.1e-05,-7e-06,3e-06,-1e-06,2e-06,-2e-06,-5e-06,-3e-06,-6e-06,4e-06,-1.6e-05,2e-06,4e-06,-9e-06,2e-06,-1e-06,-4e-06,1e-06,4e-06,-2e-06,-1e-06,1.7e-05,-1e-06,-7e-06,-1e-06,1e-06,-2e-06,-5e-06,1.2e-05,2e-06,9e-06,0,2e-06,-2e-06,-1e-06,-6e-06,3e-06,4e-06,3e-06,0,2e-06,3e-06,-2e-06,-1.2e-05,1e-05,-4e-06,3e-06,6e-06,-3e-06,-1e-06,3e-06,1e-06,-2e-06,-1e-06,-2e-06,1e-06,-2e-06,-1e-05,-4e-06,3e-06,-1e-06,-1e-06,-9e-06,-1.3e-05,1.5e-05,2e-06,2e-06,-4e-06,0,-4e-06,2e-06,-2e-06,2e-06,-1e-06,1e-05,2e-06,2e-06,-4e-06,8e-06,4e-06,-4e-06,0,0,2e-06,4e-06,4e-06,-1e-06,-6e-06,-4e-06,0,7e-06,5e-06,0,-8e-06,3e-06,1e-06,-6e-06,-2e-06,-2e-06,-5e-06,-2e-06,1e-06,1.1e-05
-9e-06,1e-06,-3e-06,-5e-06,3e-06,-2e-06,-1e-06,1e-06,2e-06,-2e-06,-5e-06,-8e-06,-5e-06,8e-06,0,-3e-06,7e-06,0,7e-06,8e-06,-4e-06,4e-06,1e-06,-1e-06,5e-06,0,2e-06,-2e-06,1.1e-05,-2e-06,2e-06,2e-06,2e-06,0,-2e-06,-2e-06,-1e-06,1e-06,-2e-06,-1e-05,1e-06,3e-06,9e-06,3e-06,4e-06,5e-06,-3e-06,-1e-06,-8e-06,1e-06,-3e-06,2e-06,-1e-06,0,-1e-06,-8e-06,-2e-06,-3e-06,-2e-06,-2e-06,7e-06,1.2e-05,-3e-06,-4e-06,2e-06,2e-06,-5e-06,-1e-06,-7e-06,0,1e-06,0,1e-06,2e-06,-6e-06,2e-06,6e-06,-3e-06,0,1e-06,2e-06,8e-06,-1.4e-05,8e-06,-8e-06,1e-06,-3e-06,-3e-06,-4e-06,1e-06,-1e-05,5e-06,1e-06,-2e-06,8e-06,-1e-06,-5e-06,6e-06,1e-06,-2e-06,2e-06,-4e-06,-7e-06,2e-06,-1e-06,2e-06,-1e-06,-3e-06,-4e-06,-3e-06,-2e-06,6e-06,-2e-06,-6e-06,1.6e-05,1e-06,-1e-06,8e-06,1e-06,-2e-06,-1.4e-05
4e-06,3e-06,1e-06,-1e-06,0,-2e-06,2e-06,3e-06,-2e-06,-2e-06,4e-06,4e-06,2e-06,0,1e-06,-2e-06,-3e-06,2e-06,-1.2e-05,-1.3e-05,-1e-06,-5e-06,0,1e-06,-3e-06,2e-06,2e-06,-2e-06,-3e-06,-2e-06,-2e-06,2e-06,1e-06,-1e-06,3e-06,2e-06,2e-06,-1e-06,0,3e-06,-1e-06,0,2e-06,0,-6e-06,-5e-06,-4e-06,-7e-06,6e-06,3e-06,4e-06,-1e-06,3e-06,-2e-06,0,-4e-06,1e-06,3e-06,4e-06,1e-06,-4e-06,-2e-06,5e-06,0,1e-06,1e-06,5e-06,3e-06,7e-06,-1e-06,-1e-06,-3e-06,1e-06,-2e-06,-3e-06,-1e-06,-4e-06,2e-06,0,3e-06,8e-06,-7e-06,5e-06,-5e-06,7e-06,0,-5e-06,0,-7e-06,1e-06,1.1e-05,-1e-06,-6e-06,6e-06,-4e-06,0,-1e-06,-5e-06,1e-06,-2e-06,0,8e-06,6e-06,-1e-06,1e-06,1e-06,5e-06,1e-06,1e-06,0,2e-06,-1e-06,-1e-06,5e-06,-1.5e-05,1e-06,1e-06,-7e-06,4e-06,0,8e-06
3e-06,-4e-06,2e-06,7e-06,-1e-06,4e-06,0,-2e-06,-1e-06,7e-06,-2e-06,-1e-06,1e-06,-5e-06,-1e-06,5e-06,1e-06,-2e-06,1.2e-05,1.2e-05,0,2e-06,0,0,-2e-06,1e-06,4e-06,2e-06,-4e-06,4e-06,-2e-06,-8e-06,0,1e-06,-2e-06,-2e-06,0,3e-06,2e-06,0,1e-06,-3e-06,-3e-06,-3e-06,7e-06,6e-06,5e-06,8e-06,0,0,-4e-06,0,2e-06,2e-06,-5e-06,0,-1e-06,0,-4e-06,-3e-06,3e-06,-3e-06,-1.1e-05,1e-06,1e-06,-2e-06,-1e-06,-3e-06,-1e-05,0,-2e-06,-3e-06,1e-06,-1e-06,0,4e-06,1e-06,-1e-06,-2e-06,-2e-06,-7e-06,5e-06,0,-2e-06,-6e-06,4e-06,-4e-06,-1e-06,6e-06,-1e-06,-1e-05,1e-06,9e-06,-3e-06,-7e-06,1e-06,5e-06,-5e-06,0,2e-06,1e-06,0,0,4e-06,-1e-06,-4e-06,1e-06,-4e-06,1e-06,2e-06,0,-3e-06,2e-06,-2e-06,1e-05,1e-06,0,5e-06,-2e-06,-3e-06,0
1e-06,0,-4e-06,-9e-06,-3e-06,-1e-06,-1e-06,-1e-06,2e-06,-6e-06,4e-06,0,-2e-06,1e-06,2e-06,-2e-06,0,-1e-06,-9e-06,-5e-06,1e-06,1e-06,-1e-06,0,3e-06,-2e-06,-2e-06,2e-06,9e-06,1e-06,0,1e-05,-1e-06,2e-06,0,0,1e-06,-2e-06,1e-06,-2e-06,-1e-06,1e-06,-2e-06,0,-6e-06,-3e-06,-6e-06,-6e-06,0,0,2e-06,1e-06,-1e-06,1e-06,1e-06,2e-06,0,0,3e-06,1e-06,-4e-06,-4e-06,1.1e-05,0,3e-06,-4e-06,0,2e-06,5e-06,1e-06,1e-06,7e-06,-2e-06,-1e-06,1e-06,0,0,1e-06,-1e-06,-1e-06,-1e-06,-4e-06,-5e-06,-7e-06,6e-06,-1e-06,1e-06,2e-06,2e-06,0,7e-06,-2e-06,-4e-06,-2e-06,6e-06,-1e-06,-2e-06,5e-06,0,-1e-06,0,-1e-06,-5e-06,-4e-06,0,3e-06,0,0,-7e-06,-3e-06,1e-06,3e-06,-2e-06,4e-06,-2e-06,1e-06,0,-3e-06,-2e-06,1e-06,-6e-06
2e-06,-1e-06,4e-06,1e-05,2e-06,-4e-06,1e-06,2e-06,0,1e-06,-3e-06,0,3e-06,0,-2e-06,-1e-06,-2e-06,1e-06,4e-06,1e-06,0,-3e-06,1e-06,1e-06,-2e-06,3e-06,-3e-06,-2e-06,-1.2e-05,-1e-06,3e-06,-6e-06,-1e-06,1e-06,-2e-06,-1e-06,-1e-06,2e-06,-1e-06,7e-06,1e-06,-1e-06,-1e-06,1e-06,6e-06,2e-06,2e-06,-1e-06,-2e-06,-2e-06,0,-1e-06,-3e-06,2e-06,0,2e-06,1e-06,2e-06,-3e-06,-1e-06,3e-06,7e-06,-5e-06,3e-06,2e-06,0,3e-06,-4e-06,0,0,-1e-06,-3e-06,0,2e-06,1e-06,2e-06,-1e-06,0,-1e-06,0,4e-06,7e-06,7e-06,1e-06,-4e-06,-2e-06,-1e-06,0,-5e-06,1e-06,-4e-06,-1e-06,-1e-06,-3e-06,3e-06,1e-06,0,2e-06,-1e-06,2e-06,0,1e-06,7e-06,-2e-06,-2e-06,-1e-06,-2e-06,4e-06,7e-06,4e-06,-2e-06,-1e-06,-1e-06,-8e-06,-4e-06,-1e-06,-1e-06,-1e-06,2e-06,1e-06,6e-06
-4e-06,3e-06,-4e-06,-7e-06,0,4e-06,-1e-06,0,-2e-06,1e-06,-1e-06,1e-06,-3e-06,2e-06,-1e-06,3e-06,5e-06,-1e-06,-1e-06,3e-06,-1e-06,1e-06,-1e-06,0,0,0,1e-06,-1e-06,6e-06,-3e-06,-3e-06,-1e-06,1e-06,0,-1e-06,2e-06,-2e-06,-3e-06,-1e-06,-1e-05,-2e-06,-1e-06,2e-06,-1e-06,-4e-06,-2e-06,0,3e-06,5e-06,-2e-06,-1e-06,1e-06,-2e-06,1e-06,-3e-06,1e-06,0,0,0,1e-06,2e-06,-1e-05,1e-06,1e-06,-4e-06,3e-06,-3e-06,2e-06,-1e-06,-1e-06,-1e-06,1e-06,1e-06,-3e-06,4e-06,0,1e-06,-2e-06,0,-1e-06,-4e-06,-6e-06,-1.2e-05,0,0,1e-06,0,-1e-06,3e-06,0,1e-06,2e-06,-1e-06,1e-06,-5e-06,-2e-06,-3e-06,-3e-06,1e-06,-1e-06,0,-5e-06,-8e-06,-3e-06,0,0,1e-06,1e-06,-6e-06,-5e-06,-1e-06,-1e-06,1e-06,9e-06,6e-06,-1e-06,1e-06,6e-06,0,0,-7e-06
-1e-06,4e-06,0,6e-06,2e-06,-1e-06,-1e-06,-1e-06,1e-06,0,1e-06,-2e-06,2e-06,-2e-06,0,0,-5e-06,2e-06,4e-06,-2e-06,1e-06,3e-06,-1e-06,0,2e-06,-3e-06,-2e-06,2e-06,3e-06,-1e-06,-4e-06,4e-06,-1e-06,0,2e-06,-3e-06,0,1e-06,-1e-06,9e-06,1e-06,0,2e-06,0,4e-06,1e-06,2e-06,-4e-06,-6e-06,1e-06,3e-06,1e-06,3e-06,0,1e-06,1e-06,1e-06,0,-2e-06,-1e-06,-4e-06,1.3e-05,-1e-06,-2e-06,2e-06,2e-06,1e-06,0,2e-06,-1e-06,0,4e-06,0,5e-06,3e-06,-1e-06,0,-2e-06,1e-06,-1e-06,3e-06,1e-06,1.2e-05,5e-06,2e-06,2e-06,2e-06,0,2e-06,0,3e-06,-1e-06,-1e-06,1e-06,-2e-06,1e-06,3e-06,-1e-06,-1e-06,-1e-06,-2e-06,4e-06,7e-06,-2e-06,0,1e-06,2e-06,-1e-06,3e-06,4e-06,0,2e-06,-1e-06,-6e-06,-9e-06,0,-1e-06,-9e-06,0,0,6e-06
1e-06,-4e-06,1e-06,-2e-06,-2e-06,-3e-06,0,0,1e-06,3e-06,-2e-06,2e-06,-2e-06,0,0,-4e-06,4e-06,0,-1e-06,-2e-06,1e-06,-1e-06,0,0,-1e-06,0,3e-06,1e-06,-9e-06,-3e-06,2e-06,-7e-06,0,-1e-06,1e-06,0,-1e-06,0,0,-4e-06,0,-1e-06,-3e-06,2e-06,-4e-06,0,1e-06,4e-06,4e-06,1e-06,-4e-06,-2e-06,0,-3e-06,-1e-06,0,-1e-06,3e-06,1e-06,-1e-06,1e-06,-9e-06,1e-06,-2e-06,-4e-06,0,3e-06,1e-06,-2e-06,-1e-06,-1e-06,-3e-06,-1e-06,-6e-06,1e-06,0,0,2e-06,1e-06,0,-4e-06,-1e-06,-7e-06,2e-06,-2e-06,-1e-06,2e-06,-1e-06,-2e-06,-1e-06,-5e-06,-1e-06,3e-06,1e-06,4e-06,0,2e-06,1e-06,1e-06,0,-1e-06,-3e-06,-5e-06,-1e-06,1e-06,0,1e-06,-1e-06,-2e-06,-3e-06,1e-06,-1e-06,0,3e-06,1e-05,0,0,7e-06,-1e-06,0,-2e-06
0,-2e-06,0,-1e-06,0,3e-06,-1e-06,1e-06,-1e-06,-4e-06,1e-06,-1e-06,1e-06,3e-06,0,1e-06,-2e-06,0,0,2e-06,0,-1e-06,-1e-06,0,-1e-06,2e-06,0,-1e-06,1.1e-05,5e-06,2e-06,7e-06,0,1e-06,-2e-06,3e-06,-1e-06,0,1e-06,-1e-06,0,0,-4e-06,0,4e-06,0,-3e-06,-1e-06,-1e-06,1e-06,2e-06,2e-06,-1e-06,-1e-06,0,3e-06,0,-1e-06,-2e-06,-1e-06,-1e-06,8e-06,-2e-06,0,-1e-06,-3e-06,-2e-06,-1e-06,2e-06,1e-06,0,-2e-06,0,4e-06,3e-06,-1e-06,0,0,0,0,5e-06,0,1e-06,1e-06,1e-06,-4e-06,1e-06,1e-06,-2e-06,0,5e-06,2e-06,-7e-06,-3e-06,2e-06,1e-06,0,1e-06,-1e-06,-1e-06,-2e-06,3e-06,6e-06,-1e-06,-1e-06,1e-06,-1e-06,0,-3e-06,1e-06,0,-2e-06,1e-06,-3e-06,-4e-06,0,-1e-06,-2e-06,-1e-06,0,-2e-06
2e-06,2e-06,0,-1e-06,-1e-06,0,1e-06,-1e-06,0,2e-06,-1e-06,-2e-06,2e-06,-1e-06,1e-06,2e-06,2e-06,0,-4e-06,0,0,2e-06,1e-06,0,1e-06,0,2e-06,-1e-06,-7e-06,-1e-06,-3e-06,-3e-06,1e-06,0,1e-06,-1e-06,-1e-06,-1e-06,1e-06,3e-06,0,2e-06,3e-06,-1e-06,-5e-06,0,2e-06,-3e-06,1e-06,0,-2e-06,-2e-06,0,-2e-06,-3e-06,0,0,-1e-06,1e-06,-1e-06,3e-06,-6e-06,2e-06,0,1e-06,-2e-06,0,0,-3e-06,0,0,0,2e-06,-2e-06,-1e-06,2e-06,1e-06,2e-06,0,0,-3e-06,1e-06,4e-06,-3e-06,-3e-06,2e-06,1e-06,1e-06,1e-06,1e-06,-7e-06,0,2e-06,0,-4e-06,0,-2e-06,0,1e-06,1e-06,0,1e-06,-7e-06,2e-06,1e-06,0,0,0,4e-06,-1e-06,0,4e-06,-1e-06,0,-2e-06,0,0,-2e-06,1e-06,-1e-06,3e-06
2e-06,1e-06,1e-06,3e-06,1e-06,-2e-06,1e-06,-1e-06,1e-06,0,1e-06,1e-06,-2e-06,-1e-06,0,-2e-06,-1e-06,-1e-06,3e-06,-2e-06,-1e-06,-2e-06,0,0,-1e-06,-2e-06,-2e-06,1e-06,1e-06,1e-06,-1e-06,0,0,0,0,0,0,0,0,-4e-06,0,-3e-06,4e-06,0,5e-06,0,-2e-06,3e-06,-1e-06,0,0,1e-06,0,-1e-06,1e-06,-5e-06,0,2e-06,0,0,-1e-06,0,0,1e-06,1e-06,1e-06,2e-06,0,2e-06,0,-1e-06,1e-06,0,0,-2e-06,-1e-06,-1e-06,-3e-06,0,0,-1e-06,0,-5e-06,-3e-06,4e-06,2e-06,1e-06,0,4e-06,0,6e-06,-1e-06,2e-06,-1e-06,-3e-06,-3e-06,-1e-06,0,-1e-06,0,-1e-06,-1e-06,5e-06,-1e-06,0,0,0,0,-5e-06,1e-06,0,-4e-06,0,3e-06,5e-06,0,0,4e-06,0,1e-06,-3e-06
-3e-06,1e-06,-1e-06,-3e-06,1e-06,2e-06,0,1e-06,-1e-06,0,0,3e-06,1e-06,0,-1e-06,0,0,0,-4e-06,3e-06,0,1e-06,1e-06,0,0,1e-06,0,0,4e-06,-3e-06,-1e-06,4e-06,0,0,-2e-06,0,0,0,-1e-06,7e-06,0,4e-06,0,1e-06,-4e-06,1e-06,0,0,2e-06,0,1e-06,0,0,0,0,-2e-06,1e-06,-2e-06,0,0,-2e-06,-2e-06,-3e-06,1e-06,0,2e-06,-2e-06,1e-06,-1e-06,0,0,-2e-06,-1e-06,2e-06,-2e-06,2e-06,1e-06,0,0,0,1e-06,2e-06,8e-06,-2e-06,-2e-06,-3e-06,0,0,-5e-06,-1e-06,-5e-06,-1e-06,-4e-06,2e-06,5e-06,2e-06,2e-06,0,1e-06,0,0,-2e-06,-1e-06,0,1e-06,-1e-06,0,3e-06,4e-06,0,0,2e-06,1e-06,-5e-06,-7e-06,0,0,-5e-06,-2e-06,1e-06,5e-06
-3e-06,-1e-06,0,3e-06,1e-06,0,0,0,-1e-06,0,-1e-06,-3e-06,-2e-06,0,0,2e-06,1e-06,0,7e-06,-3e-06,0,1e-06,0,0,1e-06,2e-06,0,-1e-06,-8e-06,2e-06,2e-06,-6e-06,0,0,0,0,0,0,0,-7e-06,0,-4e-06,-1e-06,0,3e-06,-1e-06,2e-06,-1e-06,-3e-06,-1e-06,-1e-06,-1e-06,0,1e-06,-1e-06,1e-06,0,0,0,-1e-06,2e-06,5e-06,2e-06,1e-06,1e-06,2e-06,0,0,1e-06,0,0,3e-06,0,-1e-06,-3e-06,-2e-06,0,-1e-06,0,-1e-06,3e-06,-3e-06,-7e-06,2e-06,0,-1e-06,-1e-06,0,-1e-06,0,3e-06,1e-06,2e-06,2e-06,2e-06,0,0,0,0,0,0,3e-06,-1e-06,1e-06,-1e-06,1e-06,0,1e-06,-5e-06,0,0,1e-06,-1e-06,5e-06,6e-06,0,0,6e-06,0,0,-4e-06
2e-06,-3e-06,1e-06,-3e-06,-1e-06,-1e-06,0,-1e-06,0,-2e-06,0,-1e-06,1e-06,1e-06,0,-1e-06,-1e-06,1e-06,-5e-06,2e-06,0,0,0,0,-1e-06,-1e-06,0,0,8e-06,-2e-06,-1e-06,4e-06,0,-1e-06,0,-1e-06,1e-06,0,0,4e-06,0,4e-06,-1e-06,0,-3e-06,1e-06,-1e-06,2e-06,2e-06,0,1e-06,1e-06,0,1e-06,0,0,0,0,0,0,0,-4e-06,0,-2e-06,0,-1e-06,1e-06,0,1e-06,0,-1e-06,2e-06,1e-06,0,-2e-06,2e-06,0,0,0,0,-4e-06,2e-06,5e-06,2e-06,1e-06,2e-06,0,0,4e-06,1e-06,0,1e-06,-1e-06,1e-06,-5e-06,1e-06,0,0,0,0,0,-2e-06,2e-06,-1e-06,1e-06,-1e-06,0,-2e-06,2e-06,0,0,-3e-06,0,-4e-06,-4e-06,0,0,-4e-06,1e-06,0,1e-06
0,2e-06,-2e-06,1e-06,0,1e-06,0,0,1e-06,1e-06,0,1e-06,0,0,0,-2e-06,1e-06,1e-06,4e-06,-1e-06,0,0,0,0,0,-1e-06,1e-06,0,-5e-06,4e-06,-1e-06,-2e-06,0,0,-1e-06,-1e-06,0,0,1e-06,1e-06,0,-3e-06,1e-06,0,3e-06,-1e-06,0,-1e-06,-2e-06,0,0,-1e-06,1e-06,0,-1e-06,-2e-06,0,-2e-06,1e-06,-1e-06,1e-06,6e-06,0,-2e-06,-1e-06,-2e-06,-1e-06,0,-1e-06,0,0,-1e-06,0,-1e-06,0,-3e-06,1e-06,1e-06,0,1e-06,1e-06,-2e-06,1e-06,4e-06,-1e-06,1e-06,0,0,0,0,-2e-06,0,3e-06,-2e-06,0,-1e-06,0,0,-1e-06,0,1e-06,3e-06,-3e-06,0,-1e-06,1e-06,0,0,1e-06,-1e-06,1e-06,3e-06,1e-06,3e-06,1e-06,0,0,0,0,0,1e-06
0,1e-06,1e-06,0,-1e-06,0,0,1e-06,-1e-06,1e-06,-1e-06,0,-1e-06,0,0,2e-06,-1e-06,0,-3e-06,-2e-06,0,0,0,0,0,1e-06,-1e-06,0,0,-3e-06,0,-1e-06,0,0,-1e-06,1e-06,0,0,0,-5e-06,0,3e-06,2e-06,0,-3e-06,0,0,1e-06,2e-06,0,0,0,0,-1e-06,-1e-06,0,0,0,0,0,-1e-06,-3e-06,0,1e-06,0,-1e-06,1e-06,-1e-06,1e-06,0,0,1e-06,-1e-06,2e-06,1e-06,2e-06,0,-1e-06,0,-1e-06,-1e-06,2e-06,-6e-06,-1e-06,1e-06,-3e-06,-1e-06,0,-4e-06,-1e-06,4e-06,-1e-06,-1e-06,0,4e-06,-1e-06,0,-1e-06,1e-06,0,0,-2e-06,5e-06,-1e-06,0,0,0,0,-2e-06,2e-06,-1e-06,-1e-06,0,-2e-06,2e-06,0,0,3e-06,0,0,-2e-06
1e-06,-1e-06,0,-1e-06,0,-1e-06,0,0,0,-1e-06,2e-06,-1e-06,2e-06,0,0,1e-06,1e-06,-1e-06,1e-06,5e-06,0,0,0,0,0,1e-06,1e-06,0,6e-06,1e-06,1e-06,5e-06,0,0,0,1e-06,1e-06,0,0,6e-06,0,-2e-06,-1e-06,0,4e-06,0,0,3e-06,-2e-06,0,1e-06,0,0,-1e-06,-1e-06,2e-06,0,0,1e-06,0,-1e-06,3e-06,2e-06,1e-06,-1e-06,1e-06,1e-06,1e-06,0,0,0,-1e-06,0,-4e-06,2e-06,-2e-06,0,0,0,-1e-06,3e-06,-2e-06,7e-06,0,-2e-06,-1e-06,0,0,-1e-06,0,-5e-06,-1e-06,-2e-06,0,0,2e-06,0,0,0,0,1e-06,1e-06,-6e-06,-1e-06,-1e-06,-1e-06,0,0,4e-06,-2e-06,0,-1e-06,0,1e-06,-6e-06,0,0,-5e-06,0,0,4e-06
