-1.8e-05,4.3e-05,-8.2e-05,3.4e-05,3.4e-05,-1.1e-05,0.000287,0.000374,-0.00117,-0.001826,-0.001147,-0.001221,-0.00036,8.9e-05,-0.000316,-0.00059,-0.000347,-0.000471,-0.000703,-0.000795,-8.5e-05,0.000149,0.000458,7e-05,2.3e-05,0.000266,0.000427,1e-05,0.000295,3.2e-05,0.000176,0.000309,8.2e-05,4.6e-05,4e-05,7.5e-05,0.000303,0.000137,7.9e-05,0.000382,9e-05,0.000301,5.2e-05,4.3e-05,-7.4e-05,5.1e-05,0.000127,5.2e-05,2.7e-05,4.2e-05,0.000211,0.000333,0.000267,0.000118,0.00025,0.000214,0.000204,0.000185,7.3e-05,3e-05,0.000368,0.000384,0.000206,6e-05,3.7e-05,0.000304,0.000199,0.000293,0.000128,0.00012,0.00046,0.00022,5.6e-05,0.000173,0.00021,0.000183,0.000147,6.9e-05,4.7e-05,0.000125,0.000166,4.4e-05,0.000171,0.00012,0.000222,0.000213,1.3e-05,9.1e-05,0.000134,0.000156,-0.003018,-0.005278,-0.002492,-0.001159,-0.001851,-0.002808,-0.002061,-0.001619,-0.000993,-0.002448,-0.001481,-0.000921,-0.00063,-0.000531,-0.00055,-0.000522,-0.000426,-0.000416,-2.2e-05,-0.000436,-0.000811,-0.000515,-0.000568,7.2e-05,8.9e-05,0.00031,7.6e-05,-9.2e-05,0.000263,5.9e-05,-0.000178
0.000129,0.000592,0.000227,2.1e-05,-3e-05,-7e-06,0.000235,9.7e-05,8.2e-05,7.5e-05,-4.2e-05,0.000273,8.8e-05,2.8e-05,-0.000764,-0.000704,-0.000192,7.7e-05,0.000372,0.00011,-0.00041,-0.000969,-0.000496,0.000171,-0.000114,-7.4e-05,-2.4e-05,8.5e-05,-0.000151,4.2e-05,-0.000125,1.7e-05,-1.2e-05,-0.000341,-0.000127,4.2e-05,0.000211,0.000105,-0.000242,-0.000109,-5.6e-05,0.000158,-2.4e-05,-3.1e-05,5.4e-05,0.000168,0.000105,7.7e-05,0.000145,-5.7e-05,0.000161,0.000144,4.6e-05,3.8e-05,1.6e-05,0.000221,8.9e-05,4.4e-05,3.5e-05,-4.6e-05,0.00027,0.000164,0.000228,5.6e-05,-7e-06,0.000134,8.3e-05,-6.1e-05,-0.000124,-3.1e-05,0.000194,9.9e-05,4.8e-05,-6e-06,0.000111,3.7e-05,0.000161,8.9e-05,0.000128,0.000112,0.000258,5.5e-05,-0.000153,6.1e-05,9.7e-05,9.8e-05,4.3e-05,-6.1e-05,-5.6e-05,5.7e-05,0.000586,0.001676,0.001368,0.000779,0.001253,0.002478,0.001164,-0.000457,-0.000457,0.001638,0.001358,0.000867,-7.8e-05,-0.000189,0.000122,0.000224,0.000185,0.00041,0.000307,0.000217,0.000428,9.7e-05,0.000281,2e-06,-9e-05,0.000123,-0.000273,-7.8e-05,-0.00013,0.000252,0.000309
-7e-06,2.2e-05,0.000126,4.1e-05,-2.9e-05,-0.000118,-4e-06,-8.8e-05,-3.9e-05,-1e-06,-0.000267,-0.000209,-8.3e-05,-0.000405,0.000242,0.000775,0.000547,0.000278,-0.000239,2e-04,0.000518,0.000522,3.3e-05,5.3e-05,-4e-06,-2.9e-05,0.000217,0.000218,-3e-06,-3.4e-05,0.000239,8.3e-05,8.8e-05,0.00032,4.7e-05,0.000114,-9.5e-05,-0.000134,5.8e-05,3.1e-05,0.000177,0.000178,6.6e-05,-9.2e-05,-0.000141,8.9e-05,-2.5e-05,-2e-06,2.3e-05,-1.8e-05,0.000134,-0.000124,-7.8e-05,-7.3e-05,-0.000221,-7.1e-05,9.8e-05,2e-06,-6.1e-05,-9e-06,4.1e-05,-1.6e-05,-0.000127,-0.00017,-8.5e-05,0.000195,-1.1e-05,-0.000152,-4.5e-05,-7.1e-05,-4.2e-05,-0.000105,-1.3e-05,-4.2e-05,-0.000104,0.000137,-5.3e-05,-0.000138,-1.6e-05,-0.000139,2.1e-05,1.8e-05,-0.000101,-3.9e-05,-5.5e-05,4.6e-05,-3.2e-05,-0.000201,-8.3e-05,0,9e-06,-0.000795,-0.000353,0.000203,-0.001005,-0.001455,-0.001749,-4.2e-05,-4.4e-05,-0.000788,-0.001571,-0.001108,-0.000439,0.000138,2.5e-05,0.000107,-0.000225,-0.000168,0.000192,0.000289,-0.000192,5.3e-05,-2.4e-05,-0.000147,0.000175,0.000207,0.000193,1.4e-05,-0.000234,-8e-06,3e-06
-3.5e-05,0.000225,1e-04,0.000199,4.7e-05,2.2e-05,5e-06,-0.000173,1e-05,0.000587,0.000491,0.000512,0.000438,-0.000131,0.000128,-0.000558,-0.000486,-0.000233,5.2e-05,2e-05,-0.000428,0.000399,-1e-05,-0.000155,4e-06,1.2e-05,4e-05,5.2e-05,1.9e-05,-5.9e-05,5.9e-05,3.3e-05,0.000216,-1.7e-05,-9.6e-05,7e-06,-9.2e-05,7.2e-05,-5.6e-05,-0.000128,-1e-05,2.5e-05,2.6e-05,3.1e-05,5.1e-05,0.000115,-0.000128,5e-06,-4.4e-05,0.000126,0.000252,4e-06,3.4e-05,-1e-05,-4.5e-05,0.000107,-6.4e-05,5.8e-05,1.6e-05,-3.1e-05,3.7e-05,-2e-06,-1e-05,7.1e-05,8.2e-05,0.000118,-0.000101,-1.8e-05,7.1e-05,1.4e-05,2.3e-05,2.1e-05,4.8e-05,9.5e-05,-0.000114,0.000111,-3e-06,1.9e-05,4.5e-05,-2.4e-05,7.1e-05,-4.9e-05,2.9e-05,7e-06,-0.000133,5.3e-05,6.3e-05,9.6e-05,3.1e-05,-6e-06,-9.9e-05,0.001538,0.001348,-0.000167,9.8e-05,0.001396,0.000707,0.000507,-0.00015,-0.000238,0.000763,0.000866,0.000214,0.000138,-8.8e-05,-0.000238,8.8e-05,-5.1e-05,-0.000241,-0.000301,-0.000169,4.8e-05,-1e-05,-0.000108,9.3e-05,0.000166,-1.4e-05,-2e-06,-9.9e-05,3e-05,-0.000111
-1.7e-05,-1e-05,-0.000141,-5e-06,0.000143,0.000115,3.9e-05,-2.5e-05,0.000138,-0.000232,-0.000147,-0.000853,-0.000155,-6.7e-05,0.000236,0.000173,-2.8e-05,-0.000223,-0.000335,-0.000321,0,-0.000351,1e-05,0.000113,-3.4e-05,0,9.3e-05,5.6e-05,-5.8e-05,-2.9e-05,-0.000213,-0.000299,3.4e-05,1.9e-05,6e-05,1e-05,2e-05,8.9e-05,3.1e-05,4.8e-05,0.000107,-0.000132,-0.000114,3.8e-05,-0.000108,-0.000121,-2.2e-05,4.7e-05,4.6e-05,-5e-05,5e-06,-0.00011,0.000106,9.2e-05,4.8e-05,0.000134,-0.000139,5.7e-05,5.6e-05,1e-06,2.7e-05,-5.2e-05,6.5e-05,7.5e-05,-2.8e-05,1.4e-05,-5.9e-05,5.1e-05,2.1e-05,-3e-06,3.9e-05,5.6e-05,6.9e-05,9e-05,-4.1e-05,5.8e-05,-5e-05,7e-06,6.8e-05,2e-06,9.5e-05,4.1e-05,-1.6e-05,-1.4e-05,-9e-05,6.7e-05,6.7e-05,2.7e-05,0.000103,8.4e-05,-6.9e-05,-0.001438,-0.001928,-0.000865,-0.000506,-0.000584,-0.000289,-0.000841,-0.00034,-0.000112,-0.000857,-0.000653,0.000142,-1.3e-05,0.000141,6.9e-05,-0.000401,0.000111,-0.000161,0.000161,-5.5e-05,-1.4e-05,-1e-05,-2e-04,-7.9e-05,-9.1e-05,-9.8e-05,-4.8e-05,-5.1e-05,-0.000182,1.8e-05
3e-05,4.3e-05,-2.8e-05,-4.7e-05,7e-05,5.6e-05,3e-05,-5e-06,9.8e-05,-0.000377,0.000477,-9.3e-05,-1e-05,-8.8e-05,9.6e-05,0.000174,0.000443,0.000129,0.000272,0.000247,0.000151,0.000248,-0.000417,-0.000286,-0.000153,7.1e-05,-5.6e-05,-4.6e-05,-0.000124,-1.2e-05,-0.000108,-4.1e-05,-0.000151,4.7e-05,0.000101,4.8e-05,-1.2e-05,-3.7e-05,0.00011,0.000177,0.00014,1.8e-05,3.3e-05,-9e-05,1.2e-05,8e-05,-0.000114,-7e-06,9e-05,4.8e-05,0.000184,-1.2e-05,3.2e-05,4e-05,5.8e-05,6.9e-05,-2.8e-05,-2.4e-05,9.4e-05,2.7e-05,-3.1e-05,-7.6e-05,0.00014,0.000127,-1e-06,4.3e-05,-2.5e-05,-1.1e-05,9e-06,2e-06,2.3e-05,-6.3e-05,4e-05,8.9e-05,9e-06,6e-05,-5.6e-05,9.1e-05,3.2e-05,-1.9e-05,2.5e-05,-1e-06,-6.4e-05,-3.8e-05,7e-06,-1.3e-05,4e-06,3.9e-05,0.00013,7.6e-05,-6e-06,0.00064,0.001072,0.000534,0.000186,-0.000139,-9.6e-05,0.000101,0.000856,-0.000191,0.000391,0.000232,-0.000106,-0.000228,-2.4e-05,8e-06,5.3e-05,7.7e-05,-6.4e-05,3.3e-05,0.000122,1.8e-05,4.2e-05,0.000108,-0.000106,-0.000271,-4.5e-05,8.8e-05,-0.000106,9e-05,-0.000121
-5.7e-05,-5.9e-05,-0.00018,-4.3e-05,0.000131,3.9e-05,-2.1e-05,-0.000167,-2e-06,0.000119,7.3e-05,0.000179,0.000206,-9e-05,-2e-04,-0.000384,-0.000303,-0.000303,-0.000355,-7.4e-05,-0.000359,-8.5e-05,-9.8e-05,7.5e-05,-0.000109,-0.000162,-0.000306,-9.1e-05,9e-06,-0.000201,1.7e-05,-3e-06,4.4e-05,-3.9e-05,-7e-06,1.5e-05,-0.000145,-0.000146,-2e-06,-8.2e-05,-4.6e-05,-3.2e-05,-5.2e-05,3.5e-05,-4e-06,9e-06,-0.000109,6.8e-05,-1.8e-05,-0.000182,-2.6e-05,-9.4e-05,-8.2e-05,-1.6e-05,-1.1e-05,-5.2e-05,-8e-05,-5e-05,-2e-06,2.7e-05,-3.4e-05,-0.000163,6.4e-05,5.6e-05,-7.5e-05,-2e-05,-8e-05,-1e-04,-3.1e-05,6e-06,-6.4e-05,-0.000117,-8.6e-05,2.5e-05,-1.6e-05,-3.5e-05,-6.6e-05,2.6e-05,-3.8e-05,-2.9e-05,-7.5e-05,-2.3e-05,-6.3e-05,-6e-06,-6e-05,-8.3e-05,-2e-06,-2.6e-05,-2.2e-05,2.4e-05,-4.8e-05,-7.2e-05,-0.000233,-0.000278,-0.00074,-7.2e-05,0.000352,0.000187,-0.000566,-0.000171,-7.4e-05,-0.000466,-0.000113,2.4e-05,-0.00014,-0.000185,2e-06,9e-05,2.8e-05,-3.4e-05,-0.00013,-4.1e-05,-4.4e-05,-0.000251,0.000179,0.000301,9.9e-05,-2.3e-05,-8.1e-05,-6.7e-05,-0.000142
-8.2e-05,-3.3e-05,-3.9e-05,2e-06,-2.1e-05,-3.8e-05,-2.2e-05,-0.000134,-8.5e-05,0.000161,-0.000203,-0.000272,-7.9e-05,-9.2e-05,2.1e-05,-5.7e-05,6.4e-05,5.3e-05,-9.8e-05,0.000109,8.9e-05,-0.000159,6.7e-05,0.000141,3e-06,-0.00013,-0.000114,-2.3e-05,-3.1e-05,-4.3e-05,-2.8e-05,-0.000166,1.5e-05,-7.8e-05,3.7e-05,3.5e-05,-7.6e-05,-9.2e-05,-3.8e-05,-4.2e-05,-1.8e-05,-0.000103,-4e-06,-0.000118,1.9e-05,6.1e-05,5.3e-05,3.5e-05,5.4e-05,-2.4e-05,-0.000148,-0.000119,-0.000138,-0.000122,-2.1e-05,-5.6e-05,-3.5e-05,9e-06,-5e-06,-1.1e-05,-1.3e-05,-0.000108,4.3e-05,4e-06,4.6e-05,-6.9e-05,-6.3e-05,-7e-05,5.1e-05,-4.3e-05,-5.5e-05,-8.8e-05,-2.1e-05,2e-06,-2.7e-05,-3.2e-05,-4.3e-05,1.3e-05,2.2e-05,-4.3e-05,-3.5e-05,-3.5e-05,-4.2e-05,4.4e-05,-8.4e-05,-8.2e-05,-7e-06,-5.8e-05,-6.4e-05,-1.8e-05,-6.5e-05,-0.000305,-0.000274,-0.000147,0.000627,-1.7e-05,-5.7e-05,0.000172,-3.8e-05,-0.000117,-2e-06,0.000585,-0.000271,-2e-06,-0.000164,0.000113,0.000158,-0.000167,-1.9e-05,4.5e-05,-5.2e-05,0.000154,6.2e-05,0.000134,-4.1e-05,-0.000143,-6.2e-05,-0.000199,3e-05,-3.5e-05,-7.4e-05
-2.6e-05,-4e-05,-4.8e-05,-6.2e-05,-2.3e-05,2.4e-05,-5.4e-05,-1e-04,-2.5e-05,-1.9e-05,-1e-04,0.000159,-8.3e-05,-0.000118,4.9e-05,3.4e-05,2.6e-05,8.7e-05,0.000118,7.6e-05,-1.4e-05,0.000168,-4.9e-05,-0.00016,-8.8e-05,8.6e-05,-9e-06,-1.2e-05,-0.000166,-7e-06,8.9e-05,-1.8e-05,-4.7e-05,-0.000101,-2.9e-05,-5.8e-05,-6e-06,-7.7e-05,-6.8e-05,2.1e-05,-2e-06,-4e-06,5e-05,5e-05,1.5e-05,-4.1e-05,-5.8e-05,-2.9e-05,-5.8e-05,-4e-05,-1.4e-05,-5e-05,-4.8e-05,-7e-05,-1e-06,-3.9e-05,-8.7e-05,2.9e-05,-1.8e-05,-2.2e-05,-3e-06,-6e-05,-1.3e-05,-3.7e-05,7e-06,2.1e-05,-7e-06,-0.000113,-5e-06,8e-06,-3e-06,-2.9e-05,1e-05,-2e-06,-3.8e-05,-2.7e-05,-6.5e-05,-4.1e-05,-3.2e-05,-2.3e-05,-6.3e-05,-6.2e-05,-3e-06,1.2e-05,-2.4e-05,-9.5e-05,7e-06,2.4e-05,1e-06,-3e-06,-6.1e-05,-7e-06,5.3e-05,-0.000108,-6.7e-05,-6.4e-05,0.000313,-8.8e-05,7.9e-05,0.000465,0.000292,-0.000115,0.000252,0.000113,1e-05,-8.7e-05,-2e-05,8.4e-05,-4.7e-05,6.3e-05,0.00015,6.4e-05,2e-06,-0.000105,-4.9e-05,-0.000172,-0.000107,1.5e-05,5.6e-05,-1e-06,-1e-06
-2.2e-05,-1.1e-05,-2.4e-05,-3.1e-05,2.9e-05,1.3e-05,1.5e-05,-3.1e-05,-3.4e-05,-1.8e-05,-2.9e-05,0.000157,-8.5e-05,8.4e-05,0.000167,0.00019,3.4e-05,-0.000262,-0.000116,-4.9e-05,-0.000148,-0.000185,-0.000138,-5.7e-05,2.9e-05,-2.3e-05,1.1e-05,-7.7e-05,7e-06,-2.7e-05,-2.7e-05,2.7e-05,2.6e-05,2.1e-05,5e-05,3.4e-05,2.3e-05,3e-06,1e-06,2.4e-05,-3.3e-05,-3.8e-05,2.1e-05,1.6e-05,-3.1e-05,-3e-05,-4e-06,-1.6e-05,6e-05,9e-06,3.3e-05,-3.2e-05,-5e-06,2.5e-05,1.2e-05,1.9e-05,-4e-06,-4.9e-05,7e-06,6e-06,2e-05,-1.2e-05,-2e-06,4e-06,1e-05,3e-06,-2.2e-05,7e-06,3.5e-05,7.4e-05,-2e-05,-1.2e-05,5e-06,2e-06,-5.8e-05,-4.1e-05,-6e-06,-4e-06,5.6e-05,1.2e-05,-8e-06,3.8e-05,7e-06,3e-05,1.3e-05,2.1e-05,2.6e-05,1.1e-05,1e-05,-1.6e-05,-2.9e-05,1.2e-05,1e-05,0.000444,-0.000171,-0.000563,7.4e-05,5.9e-05,1e-05,-3e-04,9.4e-05,8.7e-05,-0.000378,-0.000163,0.000182,-0.000126,0.000109,-0.00014,-2.7e-05,-0.000159,-0.000209,1.9e-05,-9e-06,-6e-06,-1.6e-05,-0.000144,1.6e-05,1e-05,-2.3e-05,6e-06,6e-06
-4.4e-05,1.3e-05,-2.7e-05,-2.9e-05,3e-05,-2.2e-05,3e-06,2e-06,-7.8e-05,-5.2e-05,1e-04,-4.9e-05,0.000135,3e-05,0.000106,2e-06,4.1e-05,0.000228,0.000116,-1.7e-05,-1.3e-05,-1.6e-05,2.9e-05,1.6e-05,9.9e-05,2.5e-05,5.4e-05,-3.2e-05,1.3e-05,1.5e-05,4e-05,4.4e-05,3.6e-05,-1.2e-05,1.8e-05,4.8e-05,-3.1e-05,3.2e-05,2.4e-05,-3e-06,1.5e-05,-6.1e-05,-2.2e-05,1.5e-05,4.3e-05,-9e-06,-4.1e-05,-7.1e-05,1e-05,7e-06,-2.4e-05,-1e-06,-1.7e-05,-4.1e-05,3e-05,9e-06,-3.4e-05,1.1e-05,8e-06,2e-06,-2e-06,-6e-06,-2.3e-05,8e-06,-4.2e-05,6e-06,-1.9e-05,7e-06,3.1e-05,2.5e-05,-3e-06,1.3e-05,-2.3e-05,3.4e-05,1.6e-05,-3e-05,-5e-05,-2.1e-05,1.4e-05,-4.1e-05,5e-06,-1e-06,1.3e-05,1.9e-05,1.3e-05,3e-06,8e-06,-2e-06,-9e-06,3.1e-05,6e-06,3.5e-05,-6e-05,-0.000507,0.00018,8.3e-05,-4.7e-05,-7e-06,-0.000274,4.5e-05,5.5e-05,-1e-06,4.3e-05,-2.1e-05,-0.000352,3.3e-05,-2e-05,-2.5e-05,-5.4e-05,3.4e-05,4.9e-05,-6.5e-05,-2e-05,2.2e-05,-4.2e-05,-5.3e-05,3.1e-05,-2e-06,4.4e-05,4.1e-05,2.7e-05
1e-06,-3.8e-05,-1.3e-05,-3.7e-05,-3e-05,3.1e-05,-1e-06,-2e-05,-6e-05,-3.1e-05,-0.00018,6.6e-05,-0.000173,-5.7e-05,-4.3e-05,-2.9e-05,1.3e-05,-8.6e-05,8e-06,6.8e-05,4.8e-05,8.5e-05,-8.9e-05,2.4e-05,-2.3e-05,6e-06,-4e-06,2.2e-05,-4.8e-05,0,8.2e-05,-2.9e-05,-7.3e-05,-9.3e-05,0,-1.9e-05,2.3e-05,-9e-06,-6.1e-05,3.5e-05,2.3e-05,-1.6e-05,2e-06,4.9e-05,-8e-06,-2.3e-05,3e-06,-2.2e-05,5.6e-05,-1.3e-05,-5e-06,-3e-05,6e-06,-4e-05,-7e-06,1.9e-05,-2.4e-05,-4.3e-05,-2.7e-05,-1e-06,-5e-06,-1.9e-05,-6.4e-05,6e-06,-4.4e-05,-3.2e-05,8e-06,-5e-06,-3e-06,-3e-05,1e-05,-1.8e-05,-7.4e-05,3e-06,-2.7e-05,-1e-05,-4.6e-05,-4.8e-05,1.5e-05,-2.9e-05,-7e-06,3.8e-05,0,-4e-06,1.6e-05,4e-06,2e-06,-2.5e-05,-1e-05,-5e-06,2.7e-05,1e-06,-9.8e-05,0.000341,-3.8e-05,-9.5e-05,-6.6e-05,-6e-06,5.9e-05,-8.5e-05,-8e-06,-0.000104,-2.1e-05,-3.9e-05,0.00024,6.3e-05,1.6e-05,7.5e-05,8e-06,1e-06,1.6e-05,4e-06,6.7e-05,-2.7e-05,3.1e-05,-4.6e-05,-3.3e-05,-5e-06,-5.2e-05,-4.3e-05,-1.8e-05
-3.1e-05,-2.7e-05,-1e-05,0,-4e-06,-5e-06,-1.4e-05,-4.8e-05,-4.1e-05,2.5e-05,-0.000213,-2e-06,9.7e-05,9.3e-05,-5.1e-05,-2.2e-05,-3.2e-05,-6.5e-05,-1.4e-05,-4.9e-05,3.5e-05,-0.000115,-9e-06,-3.7e-05,-6.2e-05,3.9e-05,-3.8e-05,2.8e-05,-9e-06,7e-06,1.7e-05,-3e-06,0,-1.6e-05,-1.1e-05,-5e-06,-4e-06,1.1e-05,-6.9e-05,6e-06,-5e-06,5e-06,-8e-06,6.1e-05,2e-05,-2e-06,-4.5e-05,3e-06,-4e-06,-1.8e-05,-2.3e-05,-2.6e-05,9e-06,-3.4e-05,-3.9e-05,1.7e-05,-1.9e-05,-1.9e-05,6e-06,-4e-06,-1.2e-05,-9e-06,-5.6e-05,-5e-06,-2.4e-05,6e-06,-2.5e-05,9e-06,1.4e-05,-5e-06,-1.5e-05,-2e-06,-2.2e-05,-1.5e-05,-1e-05,1.9e-05,-1.5e-05,-2.8e-05,-1.5e-05,-4e-06,-5e-06,-1.3e-05,1.1e-05,1.2e-05,-1.3e-05,5e-06,-1.5e-05,-2.6e-05,-1e-06,-1.1e-05,-8e-06,1.4e-05,-2e-06,-0.000209,-1.2e-05,0.000226,0.000224,1.2e-05,0.000162,-3e-06,-8.4e-05,-2.3e-05,0.000213,-1.2e-05,-9e-05,-0.000101,5.3e-05,2e-06,1.9e-05,-2.4e-05,8e-06,-5e-06,1.8e-05,-1.5e-05,-2.2e-05,3.1e-05,1.3e-05,2.7e-05,4e-06,5e-06,-2.6e-05
-4e-06,-1e-05,-8e-06,-3e-06,6e-06,-4e-06,-1.1e-05,-1.2e-05,-7e-06,4.4e-05,0.000142,-9e-06,-5.3e-05,-1.1e-05,-2.8e-05,5.2e-05,-9.3e-05,1.4e-05,1.9e-05,8e-06,-3.8e-05,7e-05,1.6e-05,-4.9e-05,-9e-06,3.2e-05,7e-06,3e-05,-5e-06,-2e-05,-3.5e-05,-5e-06,1.6e-05,-1.3e-05,-9e-06,1.3e-05,-3.1e-05,2.2e-05,-2.3e-05,-2.9e-05,4e-06,2.6e-05,-8e-06,1.2e-05,-2.1e-05,2.5e-05,1.2e-05,-2.9e-05,-2.7e-05,-2.2e-05,1e-06,5e-06,9e-06,-6e-06,-1.1e-05,-1e-05,1e-06,0,2.3e-05,-3e-06,-6e-06,-1.1e-05,-3.6e-05,2e-06,-1e-06,1e-05,2e-06,2.1e-05,5e-06,-1e-06,-6e-06,-2e-06,-2e-05,3e-06,-1.4e-05,1.2e-05,-7e-06,-1.3e-05,-1.5e-05,3e-06,0,2e-06,1.7e-05,-3e-06,-2.9e-05,7e-06,-1.5e-05,-2e-05,5e-06,1e-06,-1.4e-05,-2.3e-05,0.000106,0.000119,-8.3e-05,0.000129,-5e-06,-7.5e-05,-4.3e-05,4.7e-05,6e-05,-4e-06,-0.000141,1.1e-05,7.4e-05,2.5e-05,-5e-06,3.9e-05,-2.3e-05,1.3e-05,9e-05,-6.4e-05,2.1e-05,-2.2e-05,-1e-05,2.8e-05,-4e-06,-7e-06,7.1e-05,2.5e-05,-5e-06
-1e-05,5e-06,6e-06,-6e-06,0,3e-06,3e-06,-1.6e-05,1.2e-05,-7e-06,3e-06,5.8e-05,5.4e-05,-3e-05,-2e-05,5.9e-05,7e-05,-3e-06,-4.4e-05,-3.3e-05,-2.7e-05,-5.3e-05,-3.9e-05,2.1e-05,1.4e-05,-1e-05,5e-06,-5e-06,-1e-06,6e-06,-1.3e-05,1.7e-05,-2.6e-05,7e-06,-2.1e-05,-5e-06,-3e-06,-2.2e-05,-5e-06,-4e-06,6e-06,-5e-06,1e-05,3.6e-05,-4e-06,9e-06,-4e-06,3e-06,-9e-06,-1.8e-05,3e-06,-2.3e-05,-7e-06,-7e-06,-1e-05,-2e-06,1e-05,7e-06,2e-06,-5e-06,-1e-06,-1.1e-05,-1.9e-05,8e-06,1.1e-05,1.1e-05,-5e-06,-1.3e-05,-4e-06,1.2e-05,1.7e-05,-9e-06,6e-06,6e-06,-1e-05,-3e-06,8e-06,-1e-05,-1e-05,3e-06,-7e-06,-4e-06,1.6e-05,-4e-06,-1e-06,-2.1e-05,5e-06,-1.7e-05,2e-06,6e-06,-1.8e-05,-3e-06,-9e-06,-4.1e-05,0.000209,1.4e-05,-0.000194,-1.7e-05,0,0.000103,1.2e-05,-1.7e-05,0.000111,-3e-06,-5.8e-05,-1.7e-05,-5e-06,7.5e-05,4.5e-05,-1.7e-05,-2.5e-05,4.5e-05,-7e-06,3.1e-05,2e-05,3e-05,1.3e-05,-2.9e-05,-1.6e-05,-3e-06,-1e-05
-1.3e-05,-6e-06,-5e-06,9e-06,-1.2e-05,5e-06,-2.3e-05,-1e-06,1.2e-05,-2.2e-05,-5e-06,-1.3e-05,7.7e-05,9e-06,-6.7e-05,4.9e-05,-1.4e-05,-1.4e-05,2.8e-05,-1.1e-05,-2.9e-05,4e-05,3e-06,1.4e-05,2e-06,2e-05,-1.1e-05,-1.6e-05,1.2e-05,5e-06,-5e-06,-6e-06,1.8e-05,-2e-06,-8e-06,1e-06,-3e-06,-1.4e-05,-4e-06,7e-06,0,-2.2e-05,6e-06,-4e-06,3e-06,-8e-06,-3e-06,1.3e-05,-8e-06,2e-06,-1.1e-05,-1e-06,-1e-06,2e-06,-1.7e-05,-5e-06,-2e-05,-2e-06,-8e-06,-1.4e-05,2e-06,-9e-06,-7e-06,-3e-06,-6e-06,-2.4e-05,-3e-06,1e-06,-6e-06,-9e-06,0,-6e-06,1.4e-05,0,-1.4e-05,-6e-06,-1e-06,-1e-06,-1.3e-05,-8e-06,-7e-06,-3e-06,1.4e-05,-1e-06,3e-06,-4e-06,-1.4e-05,-1.3e-05,0,-1e-06,-6e-06,1e-05,-4.4e-05,7.6e-05,-0.000164,2.3e-05,-2.2e-05,1.4e-05,2e-05,-0.00011,-5e-05,0,-0.00015,2e-05,-3.1e-05,3.9e-05,8e-06,-2.2e-05,-1.7e-05,2.3e-05,2e-05,-4.4e-05,-1e-05,-3.1e-05,-1.1e-05,9e-06,-1e-05,-1.4e-05,-2e-05,-2e-06,6e-06
-1.8e-05,0,-8e-06,-1e-05,-1.1e-05,0,7e-06,-1.3e-05,5e-06,-1.5e-05,9e-06,4.9e-05,-3.3e-05,-6e-06,9e-06,3e-05,-3e-06,-1.9e-05,6e-06,-5e-06,1.1e-05,-1.4e-05,-1e-05,-2.2e-05,2e-06,-3e-06,1.8e-05,-1.8e-05,-1e-06,1e-06,2.9e-05,-1.8e-05,-2e-06,1.2e-05,-1.6e-05,-4e-06,9e-06,-1e-06,4e-06,-1.1e-05,-6e-06,-9e-06,-3e-06,3e-06,-1.6e-05,-8e-06,-8e-06,-3e-06,-5e-06,-8e-06,6e-06,-9e-06,-5e-06,3e-06,-9e-06,-8e-06,-1.7e-05,-6e-06,9e-06,-5e-06,2e-06,-7e-06,8e-06,-9e-06,-1.3e-05,-3e-06,-5e-06,-1e-06,-7e-06,-3e-06,-8e-06,2e-06,7e-06,-1.5e-05,-2e-06,-7e-06,-1.2e-05,1e-06,9e-06,-1e-05,-4e-06,-1e-06,9e-06,-1.1e-05,-8e-06,-8e-06,3e-06,-9e-06,2e-06,-6e-06,2e-06,-2.6e-05,-2.7e-05,-0.000112,5.3e-05,-4.3e-05,-8.6e-05,-1.7e-05,3.9e-05,1.8e-05,3.7e-05,-4.4e-05,4.1e-05,-4e-06,5e-05,-4e-05,-2e-05,1.9e-05,-8e-06,-1.2e-05,-9e-06,-1.2e-05,2e-06,-3e-06,-1e-06,-5e-06,0,-6e-06,9e-06,-8e-06,1e-06
-3e-06,3e-06,-5e-06,-4e-06,-8e-06,-7e-06,4e-06,-9e-06,3e-06,0,3e-05,-1.3e-05,1.4e-05,5e-06,3e-06,5e-06,-3.3e-05,2.4e-05,-6e-06,1.1e-05,-1.2e-05,-1.8e-05,-1.5e-05,7e-06,1e-06,0,1e-05,-1e-06,-2e-05,-5e-06,6e-06,3e-06,-8e-06,4e-06,-7e-06,1e-06,-1e-05,-2e-06,9e-06,-1e-05,-1e-06,1e-06,-8e-06,6e-06,8e-06,9e-06,-4e-06,9e-06,-1e-05,1e-06,5e-06,-7e-06,-3e-06,8e-06,-3e-06,1e-06,-1e-05,3e-06,-3e-06,-3e-06,-1e-06,-4e-06,1.6e-05,-2e-06,-1.5e-05,-6e-06,-5e-06,-9e-06,-2e-06,9e-06,0,-2e-06,4e-06,-1.1e-05,-1e-05,-8e-06,-1e-05,5e-06,0,-3e-06,0,-2e-06,6e-06,4e-06,-5e-06,-1e-06,3e-06,-4e-06,-4e-06,3e-06,1e-06,7e-06,1.1e-05,0.000124,1.6e-05,-2.4e-05,-3.3e-05,-9e-06,-4.2e-05,-9e-06,-4.5e-05,1.7e-05,-5.7e-05,-1.1e-05,-2.3e-05,9e-06,-2.2e-05,-2.4e-05,1e-06,-3e-06,-3e-06,-6e-06,0,-2e-06,9e-06,-1.5e-05,-1e-05,9e-06,-1e-05,5e-06,6e-06
-2e-06,-5e-06,-6e-06,-5e-06,-1e-06,4e-06,-1e-06,-7e-06,-5e-06,1.7e-05,-7e-06,-1.7e-05,-4e-06,-6e-06,-2e-06,-2.5e-05,4.5e-05,-4.1e-05,2.3e-05,-6e-06,-6e-06,2.4e-05,-1e-05,-1e-05,-2e-06,-9e-06,-1e-06,4e-06,2e-06,7e-06,-3e-06,1e-06,6e-06,-7e-06,-7e-06,-3e-06,-1e-06,5e-06,1.1e-05,1e-06,2e-06,7e-06,-4e-06,2e-06,-6e-06,5e-06,-3e-06,6e-06,5e-06,-6e-06,3e-06,-4e-06,-4e-06,-6e-06,-5e-06,4e-06,3e-06,-5e-06,-8e-06,-2e-06,0,-5e-06,1.3e-05,-4e-06,-6e-06,6e-06,-2e-06,3e-06,-8e-06,-2e-06,2e-06,-3e-06,-1e-05,-2e-06,-5e-06,-4e-06,-6e-06,8e-06,5e-06,-6e-06,2e-06,6e-06,7e-06,-5e-06,0,5e-06,-1e-06,-1e-06,-3e-06,1e-06,-1e-06,0,4.7e-05,-0.000119,-1e-06,-1.8e-05,-2e-05,-2.6e-05,-2.4e-05,3.9e-05,-1.9e-05,-4e-06,3.4e-05,1e-06,-2.2e-05,-4e-06,5e-06,3e-06,6e-06,1.4e-05,2.1e-05,-1.8e-05,-1e-06,-1.7e-05,-9e-06,-5e-06,9e-06,-1e-05,-7e-06,5e-06,-7e-06
-6e-06,-1e-06,-3e-06,-4e-06,-3e-06,3e-06,-2e-06,-1.1e-05,-5e-06,1.2e-05,-1.2e-05,2.5e-05,-2.7e-05,6e-06,-3e-06,-4e-06,-2.6e-05,8e-06,-2e-05,-2e-06,-2e-06,-3e-05,6e-06,-5e-06,-4e-06,1.1e-05,-1e-05,8e-06,-2e-06,0,-1.4e-05,7e-06,0,-1.5e-05,-4e-06,7e-06,9e-06,7e-06,1e-06,6e-06,-2e-06,-6e-06,4e-06,3e-06,-6e-06,-2e-06,-9e-06,-5e-06,2e-06,-6e-06,-8e-06,-7e-06,3e-06,-1.3e-05,-2e-06,1e-06,-5e-06,-1e-06,-2e-06,-1e-06,-1e-06,-3e-06,1.3e-05,-2e-06,1e-06,-2e-06,-1e-06,2e-06,3e-06,-9e-06,-3e-06,1e-06,-6e-06,-4e-06,-6e-06,0,-8e-06,1e-06,0,-4e-06,0,-1e-06,6e-06,0,3e-06,6e-06,1e-06,-2e-06,-4e-06,-1e-06,0,1.1e-05,-3e-05,0.000123,-1.5e-05,-1.9e-05,-1.1e-05,5e-06,2e-05,-4.7e-05,1e-05,2e-06,-1.8e-05,-1e-06,4.4e-05,-1e-05,-1.3e-05,-1.9e-05,2e-06,-1.2e-05,-2.5e-05,2.3e-05,-6e-06,9e-06,4e-06,-1.6e-05,-6e-06,3e-06,7e-06,-1e-05,-1.1e-05
-5e-06,-1e-06,1e-06,-3e-06,5e-06,-7e-06,0,-7e-06,-6e-06,-2e-06,-1.3e-05,-1.2e-05,1.2e-05,-2e-06,-1.6e-05,9e-06,2e-06,4e-06,1.9e-05,-2e-06,-1e-06,2.7e-05,-1.9e-05,1.3e-05,-9e-06,2e-06,-3e-06,1e-06,-5e-06,-4e-06,-5e-06,-1.2e-05,-9e-06,-1.4e-05,4e-06,-8e-06,-1.1e-05,7e-06,-5e-06,-5e-06,2e-06,-4e-06,-1e-06,8e-06,6e-06,-5e-06,4e-06,0,3e-06,-5e-06,-3e-06,-8e-06,3e-06,-8e-06,-1e-06,4e-06,-8e-06,5e-06,-2e-06,0,0,-3e-06,6e-06,1e-06,3e-06,4e-06,-5e-06,0,-5e-06,-1e-06,-1e-06,-2e-06,-2e-06,1e-06,-4e-06,2e-06,-4e-06,0,-3e-06,-1e-06,1e-06,3e-06,7e-06,-2e-06,-5e-06,0,1e-06,0,0,-1e-06,0,4e-06,-1.6e-05,-0.000108,8e-06,-3e-06,-4e-06,3e-06,0,2.6e-05,-1.8e-05,2.7e-05,3.1e-05,-1e-06,-1.7e-05,1.3e-05,-1.4e-05,-1.5e-05,-1e-05,1e-06,2.4e-05,-8e-06,-4e-06,-1.3e-05,-1e-06,2e-06,6e-06,9e-06,-3e-06,5e-06,-4e-06
1e-06,-1e-06,-2e-06,-2e-06,5e-06,4e-06,3e-06,-7e-06,-3e-06,-1.2e-05,1.1e-05,1.2e-05,-1.3e-05,2e-06,1.4e-05,2e-05,-7e-06,-1.3e-05,-1.2e-05,8e-06,-3e-06,-2.6e-05,-2e-06,-1e-06,-3e-06,-2e-06,-1e-06,2e-06,0,2e-06,6e-06,4e-06,1e-05,-3e-06,1e-06,2e-06,0,-5e-06,-7e-06,-5e-06,0,0,2e-06,-6e-06,-7e-06,-3e-06,-7e-06,-4e-06,-4e-06,-6e-06,3e-06,-1e-06,1e-06,-6e-06,1e-06,0,-4e-06,-3e-06,2e-06,1e-06,0,-4e-06,0,1e-06,-2e-06,2e-06,-1e-06,2e-06,0,5e-06,3e-06,-3e-06,-2e-06,2e-06,-5e-06,4e-06,-4e-06,-1e-06,-3e-06,-1e-06,-1e-06,-4e-06,7e-06,0,-7e-06,2e-06,-4e-06,-1e-06,0,1e-06,-1e-06,-2e-06,8e-06,9.2e-05,3.1e-05,1e-05,3e-06,2e-06,-2.3e-05,1.9e-05,1.5e-05,-3.2e-05,-3.2e-05,-1e-06,-3e-06,-1e-05,-4e-06,2.3e-05,-3e-06,4e-06,-1e-05,1.2e-05,1e-06,-1e-06,-2e-06,-5e-06,-6e-06,-6e-06,-6e-06,2e-06,2e-06
-5e-06,2e-06,0,2e-06,8e-06,1e-06,-5e-06,-4e-06,-3e-06,-8e-06,-3.4e-05,1.1e-05,2e-06,5e-06,-4e-06,1e-06,1.4e-05,-3e-06,1e-06,3e-06,-4e-06,1.6e-05,-5e-06,-1.5e-05,7e-06,4e-06,1e-06,1e-06,-1e-06,1e-06,4e-06,-2e-06,-1e-06,-3e-06,6e-06,1e-06,1e-06,-4e-06,-6e-06,7e-06,1e-06,-1e-06,0,2e-06,3e-06,3e-06,-2e-06,-5e-06,-1e-06,0,-4e-06,-7e-06,0,-7e-06,0,-4e-06,-3e-06,-1e-06,1e-06,0,1e-06,-4e-06,-3e-06,5e-06,-7e-06,-1e-06,0,2e-06,0,2e-06,0,-1e-06,1e-06,4e-06,-2e-06,3e-06,-7e-06,-5e-06,-2e-06,-5e-06,-1e-06,1e-06,5e-06,-2e-06,3e-06,-7e-06,4e-06,0,1e-06,-1e-06,-1e-06,-7e-06,5e-06,-7.9e-05,-5.2e-05,5e-05,-1e-05,-1e-06,8e-06,-5.5e-05,-1e-05,2.7e-05,4e-05,-6e-06,-5e-06,-1e-06,-9e-06,-4e-06,4e-06,-6e-06,6e-06,1e-06,4e-06,-2e-06,3e-06,7e-06,3e-06,-9e-06,3e-06,1e-06,3e-06
-5e-06,0,-3e-06,-1e-06,4e-06,-4e-06,1e-06,-5e-06,-2e-06,3e-06,0,-2.7e-05,9e-06,-1.4e-05,1.6e-05,3e-06,2e-06,-5e-06,1.2e-05,1e-06,2e-06,-2e-06,-1e-05,6e-06,4e-06,-2e-06,6e-06,0,-1e-06,-1e-06,-3e-06,2e-06,-5e-06,-1e-06,2e-06,0,1e-06,-4e-06,-6e-06,0,0,1e-06,-1e-06,-6e-06,-2e-06,2e-06,-4e-06,-1e-06,1e-06,-2e-06,3e-06,-1e-06,-1e-06,-3e-06,2e-06,-1e-06,-2e-06,1e-06,-1e-06,0,0,-2e-06,-9e-06,4e-06,-6e-06,-5e-06,-3e-06,-4e-06,0,-3e-06,-2e-06,-1e-06,-4e-06,3e-06,-5e-06,1e-06,-4e-06,-5e-06,4e-06,0,-2e-06,-1e-06,5e-06,2e-06,1e-06,-5e-06,-2e-06,-1e-06,2e-06,2e-06,-1e-06,1e-06,1e-05,5.6e-05,3.7e-05,1.7e-05,3.4e-05,2e-06,2.3e-05,2.2e-05,-2e-06,-1.4e-05,-3.7e-05,0,-1e-06,1e-06,-9e-06,1.3e-05,5e-06,3e-06,9e-06,-3e-06,-3e-06,-3e-06,-3e-06,7e-06,-1e-06,-6e-06,-4e-06,-3e-06,0
-2e-06,-2e-06,-3e-06,0,2e-06,4e-06,0,-6e-06,1e-06,7e-06,3e-06,9e-06,0,1.2e-05,1.1e-05,-8e-06,-8e-06,7e-06,-7e-06,1e-06,-3e-06,-1e-05,-2e-06,1e-06,-3e-06,0,3e-06,-2e-06,-2e-06,1e-06,-3e-06,-3e-06,5e-06,2e-06,6e-06,-1e-06,-2e-06,-4e-06,-1.1e-05,-4e-06,0,0,-1e-06,-6e-06,-2e-06,1e-06,0,-3e-06,2e-06,0,0,-5e-06,-1e-06,-1e-06,0,-1e-06,-7e-06,-2e-06,3e-06,-1e-06,0,-2e-06,-1.1e-05,0,-4e-06,1e-06,-1e-06,2e-06,1e-06,-1e-06,1e-06,-1e-06,-3e-06,0,-3e-06,-1e-06,-4e-06,-5e-06,1e-06,-2e-06,0,0,3e-06,-1e-06,-4e-06,1e-06,2e-06,-2e-06,1e-06,-2e-06,0,-2e-06,-1.7e-05,-3e-05,-8e-06,-6e-06,1e-05,-2e-06,-6e-06,1.1e-05,3e-06,-1e-06,1e-05,1e-06,1.5e-05,0,2e-06,0,-3e-06,-2e-06,-1.1e-05,7e-06,-3e-06,-1e-06,1e-06,2e-06,0,0,-2e-06,-3e-06,0
-2e-06,-1e-06,-1e-06,-1e-06,0,0,1e-06,-5e-06,0,3e-06,0,-6e-06,5e-06,-4e-06,5e-06,-1e-05,2e-06,-1.5e-05,1.4e-05,-1e-06,-2e-06,1.8e-05,-1e-06,0,-3e-06,-3e-06,-1e-06,-5e-06,1e-06,1e-06,-1e-06,-1e-06,-2e-06,1e-06,2e-06,1e-06,-1e-06,4e-06,-6e-06,0,0,0,-1e-06,-2e-06,4e-06,-1e-06,-4e-06,0,1e-06,-2e-06,3e-06,-2e-06,-2e-06,3e-06,-2e-06,-1e-06,-3e-06,0,3e-06,1e-06,0,-2e-06,-7e-06,2e-06,1e-06,1e-06,-2e-06,-2e-06,0,4e-06,0,0,-3e-06,0,-4e-06,-4e-06,-4e-06,-4e-06,3e-06,-1e-06,1e-06,1e-06,3e-06,1e-06,0,0,0,-1e-06,0,0,0,-1e-06,2e-06,1.3e-05,-2e-06,-6e-06,5e-06,5e-06,-1e-05,1e-06,-4e-06,2e-05,-1.8e-05,0,-1.9e-05,2e-06,-1e-06,9e-06,-5e-06,2e-06,1.3e-05,-1e-06,-3e-06,-5e-06,1e-06,0,-1e-06,-2e-06,4e-06,6e-06,-4e-06
-3e-06,1e-06,-1e-06,-1e-06,-2e-06,-1e-06,-1e-06,-4e-06,1e-06,-4e-06,6e-06,-5e-06,-3e-06,-2e-06,6e-06,-8e-06,-1e-06,2e-06,-5e-06,3e-06,-1e-06,-1.9e-05,-9e-06,1e-06,-4e-06,1e-06,-3e-06,-2e-06,-3e-06,0,5e-06,3e-06,-4e-06,1e-06,2e-06,-1e-06,3e-06,1e-06,-2e-06,5e-06,-2e-06,-2e-06,1e-06,-5e-06,-3e-06,-1e-06,-1e-06,2e-06,1e-06,-3e-06,1e-06,-2e-06,0,-3e-06,2e-06,2e-06,-2e-06,2e-06,-3e-06,-1e-06,0,-2e-06,-5e-06,-1e-06,0,2e-06,-1e-06,-1e-06,2e-06,-1e-06,-1e-06,-1e-06,0,-1e-06,-2e-06,-2e-06,-3e-06,-1e-06,0,-1e-06,0,-1e-06,2e-06,1e-06,0,2e-06,-1e-06,-2e-06,0,0,0,1e-06,8e-06,-7e-06,-7e-06,-2.1e-05,1.6e-05,2e-06,7e-06,-1.4e-05,9e-06,-2.2e-05,6e-06,2e-06,2e-06,-9e-06,-4e-06,-1.4e-05,-1e-06,2e-06,-1.3e-05,3e-06,0,1e-06,-1e-06,-1e-06,0,-1e-06,-2e-06,-2e-06,-5e-06
-2e-06,-1e-06,2e-06,-2e-06,-5e-06,0,-1e-06,-4e-06,1e-06,-4e-06,8e-06,6e-06,4e-06,3e-06,-1.1e-05,2e-06,6e-06,0,4e-06,0,2e-06,1.5e-05,-1e-06,-4e-06,-2e-06,1e-06,-2e-06,1e-06,1e-06,-1e-06,0,0,6e-06,-4e-06,1e-06,0,-3e-06,5e-06,0,-4e-06,1e-06,-2e-06,0,-3e-06,3e-06,1e-06,-1e-06,0,1e-06,-2e-06,-4e-06,-3e-06,1e-06,-3e-06,-1e-06,2e-06,-2e-06,0,-2e-06,0,0,-1e-06,-2e-06,-3e-06,-2e-06,-1e-06,0,1e-06,0,-2e-06,1e-06,-1e-06,4e-06,-1e-06,-4e-06,-1e-06,-3e-06,0,-3e-06,-1e-06,0,2e-06,1e-06,-1e-06,-1e-06,5e-06,0,-3e-06,-1e-06,1e-06,0,0,-5e-06,2e-06,1.6e-05,-1.5e-05,1.1e-05,-1e-06,9e-06,3e-06,0,1.1e-05,-1.2e-05,-2e-06,1.5e-05,6e-06,8e-06,2e-06,4e-06,-3e-06,6e-06,-5e-06,2e-06,-4e-06,1e-06,-6e-06,0,2e-06,-4e-06,-1e-06,-1e-06
-1e-06,0,-1e-06,0,-3e-06,0,1e-06,-4e-06,0,0,-5e-06,-1.3e-05,-7e-06,1e-06,1e-06,2e-06,-1e-05,-9e-06,1e-06,-2e-06,-1e-06,-7e-06,-4e-06,-2e-06,2e-06,-2e-06,-1e-06,4e-06,-1e-06,0,-3e-06,0,-3e-06,-1e-06,0,1e-06,-1e-06,1e-06,0,-1e-06,0,1e-06,0,-1e-06,-1e-06,0,-4e-06,3e-06,0,-3e-06,1e-06,-3e-06,1e-06,0,-2e-06,0,-4e-06,-1e-06,2e-06,-1e-06,0,-2e-06,3e-06,-1e-06,-5e-06,0,-2e-06,1e-06,1e-06,1e-06,0,0,2e-06,0,-2e-06,1e-06,-5e-06,1e-06,-1e-06,-2e-06,0,-1e-06,2e-06,1e-06,0,0,0,-2e-06,-1e-06,-1e-06,0,4e-06,-1e-06,-4e-06,-9e-06,5e-06,-2e-06,-2e-06,-1.7e-05,2e-06,4e-06,-6e-06,2e-05,0,-1.5e-05,-1e-06,2e-06,-1.1e-05,3e-06,3e-06,0,-1e-06,1e-06,0,0,1e-06,0,2e-06,3e-06,0,2e-06
-2e-06,2e-06,-2e-06,-2e-06,-3e-06,2e-06,0,-4e-06,0,4e-06,2e-06,0,5e-06,-5e-06,-9e-06,-1e-06,9e-06,2e-06,-4e-06,-3e-06,-1e-06,-2e-06,-5e-06,5e-06,1e-06,1e-06,2e-06,4e-06,0,1e-06,-2e-06,-2e-06,-1e-06,-3e-06,-1e-06,-1e-06,1e-06,-3e-06,3e-06,2e-06,1e-06,1e-06,0,-4e-06,-1e-06,0,0,1e-06,0,0,0,-1e-06,1e-06,-1e-06,1e-06,0,-3e-06,1e-06,-1e-06,0,0,-1e-06,5e-06,-3e-06,-4e-06,0,0,-1e-06,1e-06,2e-06,-1e-06,-1e-06,2e-06,-1e-06,-3e-06,2e-06,-3e-06,3e-06,-2e-06,0,0,0,0,0,-1e-06,-2e-06,-1e-06,-2e-06,-1e-06,0,0,1e-06,-1e-06,9e-06,-8e-06,3e-06,7e-06,0,1e-06,-9e-06,2e-06,-6e-06,-1.4e-05,0,4e-06,-3e-06,1e-06,3e-06,-4e-06,-1e-06,-6e-06,-4e-06,-1e-06,-2e-06,0,-3e-06,0,-3e-06,0,0,2e-06
-2e-06,0,-2e-06,1e-06,-2e-06,-2e-06,0,-3e-06,-1e-06,3e-06,0,-5e-06,-7e-06,5e-06,2e-06,-5e-06,-6e-06,-3e-06,1e-05,0,-1e-06,1e-05,0,-1e-06,0,0,3e-06,1e-06,-2e-06,-1e-06,1e-06,1e-06,2e-06,-2e-06,-2e-06,1e-06,1e-06,-1e-06,4e-06,1e-06,0,0,-1e-06,0,2e-06,0,-2e-06,-1e-06,-1e-06,-1e-06,0,-3e-06,0,-5e-06,-1e-06,-1e-06,-1e-06,0,-2e-06,-1e-06,0,-1e-06,5e-06,-1e-06,-2e-06,0,0,2e-06,0,0,0,0,-1e-06,0,-3e-06,2e-06,-4e-06,3e-06,1e-06,-1e-06,0,-1e-06,0,0,0,-2e-06,1e-06,-1e-06,0,1e-06,0,-2e-06,7e-06,-6e-06,1.8e-05,1e-06,-5e-06,-1e-06,3e-06,9e-06,-2e-06,1.1e-05,1.4e-05,-1e-06,3e-06,4e-06,9e-06,-9e-06,-2e-06,-2e-06,9e-06,0,-1e-06,-2e-06,0,0,-1e-06,-6e-06,-3e-06,2e-06,0
-1e-06,-1e-06,-1e-06,-1e-06,0,1e-06,-2e-06,-3e-06,-1e-06,-1e-06,-2e-06,-6e-06,2e-06,-3e-06,1e-06,-5e-06,5e-06,-3e-06,-5e-06,0,1e-06,-1.1e-05,-5e-06,-2e-06,0,0,1e-06,-2e-06,0,0,2e-06,1e-06,-1e-06,-3e-06,-1e-06,0,-1e-06,-4e-06,2e-06,-3e-06,0,-2e-06,0,-2e-06,-2e-06,-1e-06,-1e-06,1e-06,0,0,1e-06,-2e-06,0,-3e-06,-1e-06,-1e-06,-2e-06,-1e-06,1e-06,0,0,-1e-06,5e-06,1e-06,0,-1e-06,-1e-06,0,0,-1e-06,1e-06,0,-3e-06,0,-2e-06,1e-06,-3e-06,1e-06,1e-06,0,0,0,0,1e-06,0,-4e-06,-1e-06,-1e-06,0,0,0,-3e-06,-2e-06,-5e-06,-1.4e-05,1e-05,-5e-06,-2e-06,2e-06,6e-06,3e-06,-8e-06,-1.1e-05,0,-7e-06,-5e-06,3e-06,1.1e-05,2e-06,2e-06,-9e-06,0,1e-06,0,0,2e-06,1e-06,-1e-06,2e-06,-3e-06,-2e-06
-1e-06,0,1e-06,1e-06,1e-06,1e-06,2e-06,-3e-06,-1e-06,-4e-06,-9e-06,6e-06,0,0,-3e-06,-5e-06,-3e-06,-3e-06,5e-06,1e-06,-1e-06,9e-06,-3e-06,0,-1e-06,-1e-06,-1e-06,-3e-06,-1e-06,1e-06,2e-06,-1e-06,-2e-06,-2e-06,-2e-06,0,0,0,-1e-06,0,0,-1e-06,0,-2e-06,1e-06,0,-3e-06,-2e-06,0,0,0,-2e-06,-1e-06,-1e-06,0,0,-2e-06,1e-06,1e-06,0,0,-1e-06,4e-06,0,0,0,0,-1e-06,0,0,0,0,-2e-06,0,-2e-06,0,-2e-06,1e-06,2e-06,0,0,0,-1e-06,-1e-06,-1e-06,0,0,-1e-06,1e-06,0,0,1e-06,-7e-06,1.3e-05,6e-06,7e-06,-7e-06,-2e-06,-3e-06,-1.4e-05,1e-06,4e-06,5e-06,0,1.1e-05,2e-06,3e-06,0,3e-06,-2e-06,7e-06,-1e-06,1e-06,-3e-06,0,1e-06,-1e-06,-1e-06,1e-06,2e-06,-3e-06
-2e-06,0,0,-1e-06,2e-06,-3e-06,0,-3e-06,0,-2e-06,-3e-06,-5e-06,2e-06,1e-06,3e-06,0,1e-06,2e-06,0,-1e-06,0,-3e-06,-3e-06,0,-3e-06,-1e-06,-1e-06,-1e-06,-1e-06,-1e-06,-2e-06,0,4e-06,0,-1e-06,0,2e-06,1e-06,-2e-06,2e-06,-1e-06,2e-06,0,0,-1e-06,0,0,-1e-06,0,-2e-06,2e-06,-2e-06,0,-1e-06,0,0,-3e-06,0,1e-06,0,0,-1e-06,0,2e-06,-2e-06,0,0,1e-06,0,1e-06,0,0,-1e-06,0,-3e-06,-2e-06,-3e-06,-1e-06,0,-1e-06,0,0,-1e-06,0,0,2e-06,0,0,0,0,0,0,2e-06,-1.4e-05,-4e-06,-1e-06,-7e-06,-2e-06,-1e-06,1e-06,0,1e-06,-9e-06,0,-1.8e-05,0,6e-06,4e-06,0,1e-06,-3e-06,2e-06,1e-06,0,1e-06,1e-06,1e-06,-2e-06,-3e-06,1e-06,-2e-06
-1e-06,-1e-06,1e-06,0,2e-06,0,-1e-06,-3e-06,0,1e-06,8e-06,0,-2e-06,1e-06,-7e-06,1e-06,-2e-06,-4e-06,-1e-06,-1e-06,-1e-06,-3e-06,-1e-06,0,0,1e-06,-1e-06,0,0,0,-2e-06,-1e-06,-2e-06,-1e-06,-2e-06,1e-06,-1e-06,3e-06,-4e-06,-1e-06,0,1e-06,0,-1e-06,0,1e-06,-2e-06,0,0,-1e-06,-1e-06,-1e-06,0,-3e-06,0,1e-06,-1e-06,-1e-06,0,0,0,-1e-06,-2e-06,1e-06,-3e-06,0,-1e-06,-1e-06,0,0,1e-06,0,1e-06,0,-2e-06,-2e-06,-3e-06,-2e-06,-2e-06,-1e-06,0,1e-06,-2e-06,0,0,2e-06,-1e-06,-1e-06,0,0,0,2e-06,4e-06,1.8e-05,7e-06,3e-06,-6e-06,-2e-06,1.1e-05,6e-06,1e-06,-6e-06,5e-06,0,1.7e-05,-1e-06,2e-06,2e-06,-3e-06,0,-2e-06,-3e-06,-1e-06,-2e-06,-1e-06,2e-06,-1e-06,1e-06,1e-06,0,0
-1e-06,1e-06,-1e-06,0,2e-06,1e-06,0,-3e-06,0,3e-06,-2e-06,1e-06,6e-06,-3e-06,1e-06,1e-06,3e-06,-4e-06,5e-06,0,1e-06,8e-06,-4e-06,0,2e-06,-1e-06,0,0,0,1e-06,0,1e-06,0,1e-06,0,0,0,3e-06,-4e-06,-2e-06,-1e-06,0,0,1e-06,1e-06,0,-1e-06,-2e-06,0,-2e-06,-1e-06,-2e-06,0,-2e-06,0,1e-06,-2e-06,0,0,0,0,-1e-06,-4e-06,0,-3e-06,0,0,0,0,-1e-06,0,0,1e-06,0,-2e-06,-1e-06,-2e-06,-2e-06,-1e-06,0,0,0,-1e-06,-1e-06,-1e-06,2e-06,0,-1e-06,0,0,0,0,1e-06,-2.2e-05,-8e-06,-6e-06,-4e-06,-1e-06,-1e-05,-2e-06,-2e-06,7e-06,-9e-06,0,-6e-06,1e-06,0,0,0,0,5e-06,4e-06,-1e-06,-2e-06,0,-2e-06,1e-06,1e-06,1e-06,0,2e-06
-1e-06,0,-2e-06,-1e-06,1e-06,0,1e-06,-3e-06,1e-06,1e-06,-1e-06,-5e-06,-6e-06,3e-06,-5e-06,0,1e-06,1e-06,-5e-06,1e-06,-1e-06,-1e-05,-1e-06,-1e-06,1e-06,1e-06,1e-06,0,0,0,2e-06,-1e-06,2e-06,0,-1e-06,0,0,-1e-06,-4e-06,1e-06,0,-1e-06,0,1e-06,-1e-06,-1e-06,-1e-06,0,0,0,1e-06,-2e-06,0,1e-06,0,0,-2e-06,0,0,0,0,-1e-06,-5e-06,0,-1e-06,0,-1e-06,1e-06,0,0,0,0,0,0,-2e-06,0,-3e-06,-3e-06,-2e-06,-1e-06,0,0,-2e-06,0,1e-06,1e-06,0,0,0,0,0,0,-5e-06,2.2e-05,4e-06,-9e-06,-6e-06,-1e-06,4e-06,-3e-06,0,-4e-06,9e-06,0,-3e-06,-3e-06,2e-06,-3e-06,1e-06,1e-06,-8e-06,-1e-06,0,0,0,0,-1e-06,0,-2e-06,-2e-06,2e-06
-1e-06,-1e-06,0,0,1e-06,0,0,-2e-06,0,-1e-06,8e-06,4e-06,6e-06,-1e-06,4e-06,-1e-06,-3e-06,-4e-06,6e-06,1e-06,0,9e-06,-3e-06,1e-06,-1e-06,-1e-06,1e-06,1e-06,0,0,0,0,-1e-06,0,0,0,1e-06,0,-5e-06,2e-06,0,0,0,0,1e-06,0,-1e-06,1e-06,0,-1e-06,-1e-06,-1e-06,0,0,0,0,-2e-06,-1e-06,0,0,0,-1e-06,-4e-06,-1e-06,-1e-06,1e-06,-1e-06,0,-1e-06,1e-06,0,0,0,0,-2e-06,1e-06,-3e-06,-2e-06,1e-06,0,0,0,-2e-06,0,0,-2e-06,0,0,0,0,0,0,-1e-06,-2.5e-05,2e-06,1e-06,-1e-06,-1e-06,-2e-06,6e-06,0,3e-06,-7e-06,1e-06,5e-06,4e-06,-1e-06,-4e-06,1e-06,-2e-06,7e-06,2e-06,1e-06,-2e-06,0,-1e-06,1e-06,-3e-06,2e-06,2e-06,0
-1e-06,0,0,-1e-06,0,-1e-06,-1e-06,-3e-06,0,-1e-06,-1e-06,-1e-06,-5e-06,-2e-06,3e-06,0,4e-06,-1e-06,-2e-06,0,0,-6e-06,-3e-06,0,-1e-06,0,0,1e-06,0,0,-1e-06,0,-1e-06,0,0,0,-1e-06,-4e-06,-2e-06,-2e-06,0,0,0,2e-06,-1e-06,0,-1e-06,-1e-06,0,0,1e-06,-2e-06,0,-2e-06,0,0,-2e-06,0,-1e-06,0,0,-1e-06,-2e-06,-1e-06,-1e-06,-1e-06,0,-1e-06,0,-1e-06,0,0,-1e-06,0,-2e-06,1e-06,-2e-06,-1e-06,1e-06,0,0,0,-2e-06,0,-1e-06,-2e-06,1e-06,-1e-06,0,0,0,0,3e-06,3.1e-05,-4e-06,3e-06,0,0,1e-06,-1e-06,-1e-06,1e-06,7e-06,0,-4e-06,-3e-06,-3e-06,-1e-06,-1e-06,1e-06,-4e-06,0,0,0,0,-1e-06,-1e-06,-3e-06,0,-1e-06,-2e-06
-1e-06,0,1e-06,0,-1e-06,1e-06,0,-3e-06,0,0,-2e-06,4e-06,3e-06,2e-06,1e-06,0,-4e-06,-1e-06,1e-06,0,0,0,-1e-06,-1e-06,-1e-06,0,0,1e-06,-1e-06,1e-06,0,0,2e-06,-1e-06,1e-06,0,-1e-06,-2e-06,-1e-06,0,0,0,0,1e-06,0,0,-1e-06,1e-06,0,0,0,-1e-06,0,-1e-06,1e-06,-1e-06,-1e-06,0,-1e-06,0,0,-1e-06,-1e-06,0,-2e-06,0,-1e-06,1e-06,0,0,0,0,0,0,-3e-06,1e-06,-3e-06,0,1e-06,-1e-06,0,0,-2e-06,0,0,-2e-06,0,-1e-06,0,0,0,-2e-06,1e-06,-3.3e-05,3e-06,-2e-06,1e-06,0,0,-8e-06,1e-06,-5e-06,-5e-06,0,3e-06,0,0,-2e-06,0,0,0,-1e-06,-1e-06,-1e-06,0,0,1e-06,-2e-06,-2e-06,0,-2e-06
-1e-06,-1e-06,0,-1e-06,-1e-06,-1e-06,0,-3e-06,0,1e-06,4e-06,3e-06,-4e-06,-1e-06,4e-06,2e-06,4e-06,-3e-06,4e-06,-1e-06,-1e-06,5e-06,-3e-06,0,-1e-06,-1e-06,0,0,0,0,0,1e-06,-1e-06,-1e-06,1e-06,0,1e-06,1e-06,1e-06,1e-06,0,0,0,1e-06,0,0,0,0,0,-1e-06,0,-2e-06,0,0,0,0,-2e-06,-1e-06,1e-06,0,0,-1e-06,2e-06,0,-2e-06,0,0,-1e-06,0,0,0,0,0,0,-2e-06,0,-3e-06,1e-06,1e-06,0,0,0,-2e-06,1e-06,0,0,0,-1e-06,0,0,0,-1e-06,-2e-06,3e-05,-4e-06,3e-06,5e-06,0,-5e-06,5e-06,-1e-06,3e-06,5e-06,-1e-06,-1e-06,1e-06,-4e-06,1e-06,0,-1e-06,3e-06,1e-06,-1e-06,-1e-06,0,1e-06,-1e-06,-1e-06,1e-06,1e-06,-1e-06
-1e-06,0,-1e-06,1e-06,-1e-06,-1e-06,0,-2e-06,0,0,-2e-06,-2e-06,4e-06,-1e-06,-4e-06,2e-06,-4e-06,-1e-06,-4e-06,1e-06,0,-1e-05,-2e-06,0,0,1e-06,0,-1e-06,0,0,0,-1e-06,-1e-06,-2e-06,1e-06,0,0,1e-06,2e-06,1e-06,0,0,0,2e-06,-1e-06,0,-2e-06,-1e-06,0,0,0,-2e-06,0,-2e-06,-1e-06,0,-2e-06,0,0,0,0,-1e-06,4e-06,0,-1e-06,0,0,0,0,1e-06,0,0,0,0,-2e-06,-1e-06,-2e-06,2e-06,-1e-06,0,0,0,-2e-06,-1e-06,-1e-06,2e-06,0,-1e-06,0,0,0,1e-06,-1e-06,-2.8e-05,7e-06,2e-06,5e-06,0,9e-06,4e-06,-1e-06,0,-7e-06,0,-4e-06,-2e-06,-5e-06,1e-06,0,1e-06,-6e-06,-3e-06,0,0,0,0,1e-06,0,1e-06,-1e-06,1e-06
