0.020563,0.022924,0.020791,0.018282,0.0183,0.016474,0.014325,0.01618,0.017281,0.015566,0.013664,0.012389,0.012566,0.013987,0.014738,0.015248,0.014729,0.014234,0.015172,0.014877,0.014178,0.012932,0.012569,0.014766,0.016024,0.014161,0.012186,0.012315
0.02538,0.028144,0.026028,0.023035,0.022826,0.020063,0.017174,0.018986,0.019986,0.018305,0.016606,0.015639,0.016107,0.018035,0.018426,0.018342,0.017993,0.017437,0.018719,0.018864,0.018038,0.01631,0.015938,0.018601,0.020006,0.017959,0.015566,0.015631
0.034758,0.037813,0.036464,0.032964,0.031999,0.027525,0.02316,0.024333,0.024842,0.02371,0.02268,0.022428,0.023863,0.026901,0.026231,0.024626,0.024468,0.023757,0.025618,0.026581,0.025865,0.023221,0.022497,0.025847,0.02733,0.025271,0.022504,0.022275
0.046008,0.048899,0.049298,0.045586,0.043543,0.038043,0.032421,0.032666,0.032003,0.031642,0.03109,0.031388,0.034922,0.039689,0.037321,0.033069,0.032443,0.031456,0.033858,0.035368,0.034733,0.031174,0.030615,0.034974,0.035588,0.033832,0.031499,0.030867
0.059431,0.062228,0.065391,0.061465,0.058983,0.053172,0.045941,0.045942,0.04363,0.043404,0.041959,0.041944,0.04874,0.056448,0.053068,0.045149,0.043135,0.041973,0.043838,0.045063,0.043746,0.03879,0.040255,0.046998,0.045858,0.044511,0.043333,0.042375
0.072773,0.075904,0.083595,0.079806,0.076403,0.070764,0.062527,0.062493,0.058096,0.056599,0.053462,0.053497,0.063163,0.074019,0.071263,0.05961,0.055373,0.054322,0.055069,0.055421,0.052696,0.046177,0.051263,0.061298,0.058557,0.05794,0.057429,0.055525
0.080836,0.084099,0.095034,0.092246,0.08797,0.084131,0.076386,0.075665,0.069853,0.065246,0.060273,0.06134,0.071797,0.084858,0.084603,0.070735,0.064284,0.063656,0.064223,0.065462,0.061879,0.053292,0.06096,0.073609,0.070255,0.070382,0.06929,0.065414
0.079374,0.081979,0.092844,0.09183,0.087385,0.086678,0.080261,0.07962,0.075584,0.067215,0.060435,0.061419,0.069328,0.081799,0.085464,0.073809,0.065644,0.065674,0.068976,0.073183,0.069147,0.058157,0.06496,0.077478,0.075236,0.076447,0.073907,0.068316
0.081185,0.08465,0.092415,0.091942,0.088898,0.087173,0.079932,0.086683,0.08898,0.074663,0.063689,0.062391,0.067419,0.075418,0.080935,0.076463,0.067266,0.069105,0.081366,0.087694,0.077221,0.062136,0.066622,0.076316,0.075215,0.078657,0.074791,0.066587
0.105663,0.110247,0.113085,0.112861,0.115047,0.103286,0.09035,0.110634,0.11971,0.09911,0.08002,0.073406,0.079994,0.084959,0.088545,0.091293,0.081163,0.084884,0.108436,0.113946,0.092669,0.073286,0.078434,0.086793,0.08318,0.086207,0.082356,0.071402
0.139152,0.146624,0.146781,0.144903,0.150883,0.127998,0.107591,0.135937,0.150513,0.128264,0.102077,0.090911,0.0997,0.106939,0.109449,0.112039,0.102292,0.111591,0.141485,0.140986,0.109556,0.090171,0.098699,0.104954,0.095545,0.098865,0.099181,0.086439
0.166994,0.178271,0.173808,0.166076,0.173993,0.143569,0.114336,0.14111,0.161047,0.14593,0.118226,0.104349,0.114902,0.127486,0.127606,0.122656,0.120808,0.140333,0.164352,0.155364,0.11889,0.103438,0.116696,0.117284,0.100242,0.106426,0.117506,0.107608
0.179446,0.190185,0.185099,0.174711,0.174204,0.136548,0.103865,0.122143,0.146886,0.148597,0.124984,0.107911,0.119146,0.138762,0.134433,0.116174,0.125575,0.157551,0.16867,0.151497,0.117025,0.107467,0.125108,0.121274,0.100283,0.108971,0.130308,0.12709
0.173049,0.180576,0.178859,0.172414,0.162201,0.125267,0.095056,0.1029,0.132173,0.144129,0.12307,0.106871,0.12085,0.143085,0.132746,0.105039,0.118037,0.154329,0.156247,0.134584,0.108365,0.104752,0.121982,0.121325,0.107285,0.116079,0.135527,0.135816
0.152444,0.157904,0.15981,0.157233,0.144921,0.121515,0.100811,0.100921,0.129604,0.139194,0.11747,0.106106,0.122417,0.143022,0.127646,0.093825,0.098749,0.131072,0.134971,0.116161,0.099713,0.102076,0.112828,0.114226,0.11604,0.128605,0.136058,0.131599
0.129839,0.1323,0.142777,0.141002,0.127518,0.120784,0.116904,0.111645,0.127919,0.130523,0.114317,0.111962,0.124071,0.142745,0.134982,0.100836,0.090838,0.110485,0.116407,0.105897,0.097991,0.107592,0.111295,0.10559,0.122355,0.139924,0.133844,0.120159
0.135791,0.131753,0.145461,0.14899,0.137641,0.131338,0.133969,0.127562,0.134264,0.13296,0.118904,0.121121,0.126894,0.148362,0.155787,0.123599,0.103854,0.117625,0.12687,0.116418,0.103149,0.11292,0.119599,0.109625,0.123832,0.141139,0.134661,0.117646
0.172591,0.162647,0.167388,0.174748,0.16635,0.150467,0.153511,0.14893,0.149142,0.147969,0.131029,0.133677,0.13827,0.158102,0.173992,0.147215,0.126711,0.142801,0.158203,0.145706,0.121874,0.119153,0.130388,0.123788,0.127004,0.150974,0.153412,0.128424
0.21908,0.200008,0.191633,0.196732,0.18935,0.170983,0.176538,0.174401,0.163503,0.156879,0.139345,0.143897,0.154289,0.169486,0.181763,0.16023,0.143472,0.155636,0.172285,0.162224,0.132235,0.120982,0.137806,0.138789,0.139933,0.174528,0.180548,0.145926
0.241151,0.221345,0.204456,0.202857,0.194605,0.184697,0.193664,0.197455,0.180249,0.155884,0.138724,0.147881,0.164497,0.173218,0.170995,0.158926,0.161289,0.164799,0.166221,0.155242,0.124988,0.118536,0.141193,0.142682,0.146364,0.187872,0.187535,0.147363
0.228709,0.226236,0.218649,0.201812,0.186707,0.192377,0.193534,0.20257,0.196913,0.149568,0.127731,0.144135,0.174114,0.185234,0.168214,0.165256,0.186643,0.180644,0.165208,0.151775,0.117199,0.113553,0.141159,0.142192,0.143332,0.18032,0.174574,0.135684
0.218149,0.226585,0.235219,0.20484,0.18545,0.200528,0.176424,0.186881,0.213922,0.159727,0.128237,0.159148,0.205707,0.219004,0.194948,0.196583,0.226508,0.215223,0.170831,0.143161,0.114084,0.113183,0.1476,0.148038,0.140019,0.162379,0.150712,0.119988
0.21074,0.217954,0.247455,0.218494,0.185275,0.195299,0.163718,0.165705,0.205067,0.165975,0.13434,0.180057,0.242173,0.26096,0.229331,0.225704,0.260282,0.24397,0.168894,0.131026,0.116195,0.110051,0.147285,0.153107,0.135918,0.14631,0.13241,0.109618
0.190398,0.194507,0.228781,0.21311,0.174224,0.173639,0.150514,0.139799,0.163919,0.144633,0.131045,0.184456,0.241616,0.265336,0.231495,0.217068,0.262711,0.249162,0.169013,0.140661,0.12673,0.099766,0.132248,0.143712,0.121113,0.131992,0.122339,0.104365
0.161507,0.158768,0.184305,0.191446,0.159735,0.143604,0.127809,0.113589,0.123161,0.110122,0.110131,0.16062,0.195555,0.21527,0.187805,0.166775,0.222562,0.2146,0.147956,0.143761,0.13507,0.091014,0.103145,0.115957,0.101864,0.115624,0.104331,0.088184
0.131034,0.127647,0.147333,0.164027,0.150005,0.131559,0.106228,0.091545,0.102348,0.084451,0.078362,0.12244,0.147826,0.153723,0.133203,0.119414,0.160504,0.150925,0.110811,0.122524,0.128454,0.088743,0.075101,0.085368,0.082085,0.090106,0.079172,0.065993
0.104508,0.107491,0.126207,0.143091,0.140023,0.132475,0.101292,0.085281,0.09533,0.067957,0.050154,0.080836,0.10256,0.102473,0.09348,0.09594,0.108531,0.096266,0.082694,0.088848,0.102032,0.086969,0.062098,0.060912,0.062228,0.060451,0.050428,0.046277
0.079814,0.095601,0.122495,0.124785,0.1138,0.1208,0.099208,0.084781,0.087703,0.056997,0.037419,0.05459,0.071596,0.074864,0.0735,0.084363,0.086842,0.076952,0.067189,0.060938,0.073347,0.081076,0.063737,0.054094,0.0528,0.043608,0.037926,0.043492
0.058292,0.082722,0.116387,0.10567,0.089414,0.103258,0.093134,0.077565,0.06961,0.049388,0.039646,0.048395,0.060297,0.067244,0.070901,0.078251,0.078978,0.072355,0.059338,0.051794,0.069104,0.083827,0.069197,0.057463,0.053411,0.041671,0.040939,0.053734
0.048922,0.073671,0.103478,0.096473,0.086126,0.095961,0.085871,0.06692,0.056369,0.051726,0.05416,0.059195,0.05911,0.063126,0.074791,0.074365,0.075281,0.073278,0.056385,0.055759,0.074969,0.081467,0.067996,0.066704,0.06689,0.048127,0.045855,0.063719
0.049326,0.061699,0.081021,0.093333,0.100363,0.106512,0.087125,0.06471,0.061885,0.067804,0.076668,0.075173,0.056541,0.054768,0.078499,0.082724,0.083818,0.081038,0.060948,0.065362,0.080269,0.073515,0.061555,0.080601,0.089897,0.059434,0.051403,0.069557
0.050597,0.050915,0.063917,0.093171,0.115064,0.114904,0.084816,0.059421,0.065327,0.082528,0.096117,0.087025,0.056422,0.053049,0.082401,0.089601,0.085702,0.079131,0.058397,0.066656,0.077756,0.064245,0.055867,0.091959,0.107171,0.06564,0.054704,0.071
0.054804,0.054645,0.066218,0.092158,0.110125,0.103058,0.074236,0.052172,0.058552,0.081623,0.098016,0.083767,0.053374,0.053088,0.078677,0.085336,0.072864,0.06165,0.047425,0.060412,0.0682,0.055818,0.054951,0.094854,0.105561,0.05991,0.054097,0.073127
0.056329,0.059009,0.065209,0.080628,0.087892,0.073646,0.056024,0.04611,0.046519,0.061692,0.076583,0.065639,0.04878,0.05066,0.062896,0.069502,0.05475,0.042949,0.04126,0.056856,0.055286,0.042795,0.052409,0.084508,0.084341,0.048337,0.055036,0.074724
0.054507,0.066113,0.064435,0.071807,0.068616,0.046943,0.041446,0.037202,0.031358,0.034931,0.044326,0.043299,0.045604,0.048299,0.049151,0.054398,0.045524,0.038275,0.047675,0.061843,0.049023,0.031914,0.043497,0.060976,0.054222,0.035301,0.052552,0.074053
0.057325,0.074042,0.064834,0.06387,0.053303,0.034193,0.040368,0.034778,0.024459,0.021163,0.022214,0.028453,0.041985,0.048636,0.046228,0.044976,0.038871,0.038939,0.05478,0.063241,0.042908,0.026333,0.03214,0.036888,0.030399,0.023255,0.044879,0.068908
0.058963,0.071598,0.055184,0.047996,0.043218,0.033436,0.043397,0.037875,0.026688,0.021397,0.018248,0.022539,0.035641,0.046867,0.047496,0.041899,0.030841,0.034372,0.053772,0.05372,0.03113,0.019904,0.024576,0.027977,0.025359,0.022091,0.041487,0.070338
0.049888,0.055996,0.038374,0.029738,0.030907,0.030791,0.04182,0.036084,0.027092,0.021675,0.01475,0.015809,0.024987,0.037549,0.041088,0.033544,0.021731,0.026289,0.042495,0.036876,0.020379,0.015603,0.01966,0.022738,0.022933,0.023735,0.036922,0.064826
0.032827,0.03496,0.025229,0.020485,0.024695,0.028002,0.034795,0.027199,0.02233,0.018374,0.009713,0.008966,0.014666,0.023883,0.02819,0.023003,0.016382,0.0197,0.026887,0.023067,0.015691,0.013794,0.014259,0.015859,0.017741,0.022567,0.027993,0.048164
0.018532,0.019389,0.016976,0.020655,0.028088,0.03019,0.027011,0.016519,0.014913,0.013571,0.00675,0.006037,0.00954,0.013151,0.017444,0.020113,0.018407,0.01691,0.015735,0.017637,0.017614,0.015821,0.014449,0.013855,0.01344,0.01788,0.018423,0.029093
