0.066109,0.063534,0.061644,0.056548,0.053551,0.051041,0.050776,0.052059,0.053402,0.051771,0.047686,0.052009,0.054334,0.049902,0.051986,0.057102,0.057792,0.05812,0.063991,0.063822,0.058567,0.057542,0.053649,0.056138,0.060341,0.055897,0.052117,0.0496
0.085478,0.078766,0.075957,0.070253,0.068682,0.063913,0.060847,0.063951,0.068397,0.069184,0.065152,0.070838,0.071174,0.062586,0.065441,0.073539,0.076316,0.078323,0.089026,0.08979,0.078908,0.07432,0.06857,0.073753,0.081081,0.074251,0.068152,0.065173
0.123763,0.108013,0.104021,0.097207,0.098518,0.088899,0.079146,0.086422,0.09839,0.104776,0.100697,0.108368,0.103863,0.087024,0.093265,0.107869,0.113279,0.117853,0.139064,0.142528,0.120259,0.10888,0.099731,0.109442,0.121997,0.109794,0.099787,0.096568
0.161295,0.135894,0.133867,0.126174,0.128643,0.114801,0.097791,0.108639,0.12998,0.143493,0.139489,0.148641,0.13795,0.112469,0.124476,0.146597,0.152853,0.158928,0.191201,0.198072,0.163489,0.146308,0.135605,0.148109,0.163194,0.144104,0.132207,0.130828
0.180589,0.151354,0.15737,0.149704,0.149334,0.138805,0.119324,0.126985,0.15444,0.170828,0.166531,0.177587,0.163418,0.133696,0.14892,0.174181,0.178208,0.183206,0.21837,0.227712,0.191074,0.176455,0.167426,0.176494,0.187362,0.162717,0.154491,0.155906
0.183251,0.167442,0.188063,0.178292,0.170327,0.173286,0.156819,0.150267,0.174036,0.183246,0.180977,0.195877,0.186036,0.164193,0.175993,0.194781,0.195145,0.193629,0.210844,0.220726,0.205612,0.206979,0.198257,0.189378,0.187838,0.165493,0.170036,0.174231
0.236705,0.238613,0.275045,0.256284,0.229797,0.247027,0.233389,0.211847,0.233528,0.227786,0.227673,0.252685,0.252237,0.239282,0.246628,0.262115,0.256026,0.235841,0.223962,0.24086,0.261904,0.27907,0.260558,0.223715,0.211049,0.19837,0.22171,0.227839
0.379399,0.371985,0.418653,0.399331,0.352319,0.378014,0.359298,0.331113,0.366973,0.34984,0.344027,0.373071,0.376273,0.362351,0.376358,0.409843,0.39238,0.344741,0.320797,0.354684,0.393871,0.410831,0.384267,0.328272,0.299883,0.289566,0.333518,0.335769
0.605488,0.571193,0.619488,0.598905,0.516261,0.549494,0.528801,0.508445,0.585258,0.557182,0.515073,0.537629,0.552545,0.526289,0.542411,0.612097,0.574209,0.492599,0.481863,0.541697,0.603707,0.610624,0.55626,0.485342,0.432842,0.430218,0.50247,0.481365
0.910872,0.868795,0.918858,0.873103,0.730144,0.775931,0.758742,0.757853,0.901387,0.853179,0.735367,0.754155,0.815727,0.757806,0.737306,0.86007,0.798625,0.660322,0.684731,0.796934,0.932332,0.932653,0.775776,0.680783,0.62063,0.631179,0.733888,0.684458
1.234962,1.237551,1.306248,1.215984,1.01407,1.067982,1.047307,1.074949,1.291308,1.212426,0.995051,1.024914,1.17793,1.070109,0.972493,1.170375,1.092651,0.852146,0.899889,1.103503,1.376253,1.369874,1.032188,0.904387,0.872862,0.899918,1.029061,0.962009
1.427415,1.528002,1.63746,1.50721,1.290725,1.336245,1.301047,1.366205,1.622083,1.499866,1.189162,1.239149,1.501783,1.351344,1.158711,1.42288,1.350264,1.010629,1.063849,1.38162,1.813422,1.774621,1.226114,1.063832,1.112388,1.171287,1.294999,1.21835
1.362702,1.554261,1.700582,1.561598,1.397309,1.408825,1.342682,1.426301,1.658533,1.522683,1.193736,1.246244,1.565372,1.420944,1.16447,1.430121,1.410159,1.067241,1.106824,1.464143,1.950223,1.864426,1.219961,1.054967,1.194778,1.282633,1.352175,1.292968
1.092549,1.307418,1.438101,1.292156,1.208125,1.189054,1.106701,1.183094,1.326873,1.231318,1.018611,1.035831,1.291529,1.23469,1.006022,1.174157,1.215071,0.982311,1.005518,1.26691,1.605293,1.501571,1.002564,0.899869,1.067259,1.130077,1.117082,1.094621
0.911052,1.139457,1.209553,1.022365,0.948241,0.918138,0.854396,0.880206,0.93471,0.973241,1.019771,0.964606,1.00995,1.04662,0.893203,0.879689,0.907749,0.866064,0.917317,1.03081,1.116565,1.01287,0.794272,0.82515,0.966195,0.894965,0.83965,0.894286
1.194578,1.521596,1.486996,1.197899,1.112915,1.075783,0.977463,0.885513,0.92096,1.149238,1.410602,1.277672,1.196675,1.311308,1.135847,0.954964,0.931625,1.007636,1.114118,1.188926,1.157628,1.000293,0.870708,1.037619,1.217889,0.957104,0.875773,1.080049
1.778323,2.222289,2.078338,1.587486,1.455132,1.446463,1.352688,1.190875,1.190115,1.522574,1.919936,1.751397,1.589731,1.718374,1.574978,1.352801,1.265396,1.320888,1.394183,1.495562,1.56295,1.400418,1.213306,1.457344,1.671896,1.250534,1.136784,1.4509
2.511282,2.908889,2.631145,1.938696,1.726622,1.798795,1.757737,1.582148,1.4974,1.77397,2.203519,2.039499,1.814627,1.928908,1.953499,1.803462,1.62823,1.590911,1.647649,1.794344,1.971619,1.855637,1.61333,1.834197,1.99771,1.500575,1.397557,1.783745
3.233319,3.283476,2.912463,2.27587,1.921248,1.999693,2.025848,1.894668,1.723354,1.775201,2.11449,2.031034,1.799084,1.903141,2.15307,2.114148,1.825078,1.660582,1.848145,2.068953,2.243441,2.273754,2.054719,2.088665,2.110074,1.650858,1.610549,2.040108
3.596654,3.143465,2.781915,2.536993,2.053906,2.011015,2.086107,2.080479,1.937111,1.68574,1.843912,1.939227,1.858938,2.017911,2.320143,2.33676,1.95085,1.644847,1.967463,2.185398,2.365483,2.606885,2.40862,2.219091,2.189119,1.815024,1.77564,2.212888
3.352004,2.740571,2.406833,2.500628,2.05003,1.871336,1.923442,1.999395,1.98061,1.584883,1.569633,1.794979,1.845212,2.122826,2.492954,2.472835,1.990737,1.58555,1.850866,1.986642,2.238213,2.588369,2.447919,2.273006,2.208374,1.852295,1.786831,2.110196
2.556964,2.263464,2.034166,2.143236,1.759095,1.479373,1.579397,1.69932,1.685342,1.314969,1.243902,1.556878,1.610822,1.869239,2.274583,2.2386,1.826061,1.412796,1.447759,1.498449,1.780706,2.047266,2.026858,2.034997,1.921171,1.624073,1.593433,1.720287
1.569388,1.573897,1.596234,1.611554,1.280698,1.010408,1.168537,1.286404,1.21792,0.999601,0.965684,1.240667,1.262679,1.383177,1.661825,1.689956,1.474773,1.099956,0.936161,1.002844,1.251838,1.306768,1.381379,1.552602,1.413055,1.234392,1.281092,1.313233
0.914785,1.085113,1.229819,1.165459,0.927922,0.810542,0.990675,1.059175,0.945094,0.818211,0.812589,0.913244,0.904741,0.999703,1.117909,1.197566,1.187759,0.873479,0.606523,0.710043,0.933475,0.900693,0.983631,1.123657,0.981574,0.876315,0.93297,0.958445
1.095738,1.234706,1.170537,0.975113,0.785452,0.788497,1.024093,1.035965,0.887234,0.790661,0.743623,0.721045,0.700773,0.813991,0.876038,1.022059,1.09835,0.831049,0.60988,0.692628,0.879194,0.903203,0.925027,0.911483,0.828941,0.744315,0.784127,0.841313
1.506113,1.607524,1.325894,1.04705,0.847862,0.796389,1.018534,1.123499,0.945677,0.776936,0.67274,0.615554,0.654888,0.747629,0.826691,1.057385,1.099589,0.840416,0.758102,0.885366,1.027772,1.055345,0.980874,0.870819,0.87972,0.798338,0.815056,0.871198
1.755741,1.859183,1.417737,1.098824,0.901111,0.743789,0.877197,1.161471,0.993398,0.712717,0.635876,0.586898,0.664759,0.696768,0.812566,1.182322,1.170386,0.871461,0.920017,1.061192,1.115857,1.123888,1.027176,0.959175,0.959358,0.787528,0.778748,0.807251
1.643428,1.719093,1.311196,1.072983,0.878677,0.664757,0.717191,1.086261,0.955231,0.603586,0.563884,0.569259,0.662813,0.616892,0.704112,1.113002,1.074339,0.811781,0.967111,1.052682,1.016309,1.042553,0.973205,1.027585,1.000116,0.74365,0.704788,0.679543
1.217835,1.218483,0.997044,0.896885,0.741516,0.574499,0.63361,0.929014,0.79575,0.476522,0.429373,0.476903,0.618824,0.5131,0.493848,0.80512,0.779953,0.62421,0.805346,0.831281,0.738583,0.787155,0.817463,0.966712,0.925435,0.703013,0.679912,0.59428
0.745991,0.727477,0.67046,0.62223,0.52723,0.446912,0.506398,0.661606,0.5915,0.39419,0.338527,0.39754,0.551634,0.415896,0.284727,0.444606,0.495852,0.462116,0.549254,0.538738,0.451627,0.525629,0.658057,0.764276,0.723324,0.630509,0.61516,0.526831
0.366439,0.445022,0.484134,0.424571,0.362201,0.356776,0.411686,0.45543,0.427958,0.336224,0.321526,0.374884,0.494176,0.383989,0.205754,0.268427,0.350454,0.365586,0.370552,0.321722,0.283672,0.377507,0.493017,0.49844,0.450842,0.454212,0.445729,0.393236
0.192833,0.315911,0.365979,0.3117,0.256859,0.290873,0.38998,0.421231,0.36345,0.289498,0.303386,0.317663,0.370274,0.317849,0.17804,0.22221,0.321863,0.322509,0.283814,0.232216,0.22127,0.273802,0.334298,0.333995,0.281308,0.288658,0.280222,0.266749
0.163588,0.252775,0.289533,0.273921,0.235071,0.274103,0.379076,0.373289,0.316202,0.279462,0.267795,0.222914,0.225711,0.23909,0.181586,0.210325,0.306439,0.297276,0.252789,0.196595,0.15675,0.177345,0.229822,0.25884,0.233629,0.225053,0.196146,0.199986
0.184654,0.209147,0.239419,0.267553,0.241855,0.285336,0.362388,0.28585,0.246925,0.262217,0.223856,0.156427,0.141642,0.180014,0.179292,0.189342,0.251903,0.234329,0.207605,0.174012,0.121918,0.134559,0.193638,0.229432,0.201904,0.183267,0.16079,0.164682
0.213146,0.183048,0.198136,0.229661,0.21251,0.260908,0.290009,0.187199,0.176138,0.209319,0.161835,0.115541,0.122546,0.157178,0.152212,0.150235,0.174242,0.16328,0.162559,0.15463,0.115918,0.116721,0.175063,0.197599,0.145023,0.12161,0.119809,0.134443
0.227254,0.18241,0.16561,0.161121,0.150551,0.194051,0.188006,0.120568,0.126324,0.141398,0.095374,0.075671,0.12486,0.150441,0.113801,0.118614,0.121064,0.103674,0.115889,0.133712,0.116725,0.10127,0.140937,0.1541,0.105089,0.076697,0.09209,0.112134
0.203019,0.156539,0.119101,0.105325,0.110339,0.129676,0.11783,0.100015,0.097744,0.098509,0.064781,0.052975,0.11946,0.136661,0.094872,0.09714,0.096323,0.081616,0.088168,0.11304,0.116675,0.105793,0.118777,0.115011,0.095623,0.07364,0.085538,0.111631
0.150715,0.117552,0.101055,0.104862,0.104267,0.093045,0.087212,0.092499,0.091964,0.083804,0.060629,0.057355,0.107868,0.106916,0.083946,0.093567,0.085296,0.07638,0.078645,0.101575,0.121804,0.119086,0.116497,0.095265,0.084545,0.076857,0.079907,0.109423
0.11502,0.084516,0.103383,0.109342,0.092275,0.062642,0.056758,0.075224,0.092337,0.085556,0.061618,0.068548,0.090015,0.068945,0.066632,0.08317,0.063195,0.0631,0.067174,0.084759,0.116257,0.116392,0.112855,0.098769,0.081043,0.072263,0.077995,0.103289
0.089052,0.059831,0.09517,0.095353,0.073146,0.051489,0.04002,0.050791,0.080127,0.08211,0.068003,0.076325,0.068787,0.042084,0.055687,0.067533,0.038999,0.046246,0.064338,0.068819,0.097258,0.092937,0.091868,0.103477,0.082952,0.059667,0.071795,0.085472
