7e-06,8e-05,5.9e-05,7.5e-05,3e-06,4e-05,2e-06,9.7e-05,7.8e-05,0.00012,4.5e-05,4.2e-05,5.9e-05,0.000128,1e-05,0.000213,2e-06,0.000114,2.4e-05,3e-06,9.7e-05,0.000219,3.2e-05,3.8e-05,8.2e-05,7.9e-05,6.8e-05,0.000189,4e-05,5e-06,0.00024,0.000213,9.4e-05,1.2e-05,9e-06,0.000184,6.3e-05,1.4e-05,0.000221,0.000165,5.7e-05,6.4e-05,5.9e-05,2e-05,0.000148,0.000251,2.9e-05,0.000101,0.000238,0.00025,4.2e-05,3.3e-05,5.6e-05,0.000255,9.6e-05,1.6e-05,4.1e-05,0.000208,8e-06,1.5e-05,7e-05,1e-06,9e-05,9.7e-05,0.000159,0.000119,1e-06,5.8e-05,3.5e-05,8.6e-05,1.6e-05,3.7e-05,5e-06,4.5e-05,0.000101,5.2e-05,7.3e-05,6.1e-05,6.2e-05,7.5e-05,1.8e-05,9e-06,1e-06,6.6e-05,4.6e-05,3e-05,2.7e-05,1.3e-05,8.3e-05,8e-06,0.000131,9.7e-05,5.8e-05,8e-06,1.5e-05,1.2e-05,0.000103,5.2e-05,6.3e-05,7.4e-05,0.000107,5.8e-05,8.3e-05,0.000135,6.1e-05,0.000105,0.000209,0.000256,0.000163,4.8e-05,3.1e-05,5.6e-05,6.6e-05,8.7e-05,2.8e-05,2.1e-05,0.000132,3.1e-05,6.8e-05,1e-04,6.8e-05
7.9e-05,0.000138,0.000119,0.000162,4e-05,7.4e-05,4.5e-05,0.000255,0.000178,0.000313,5.9e-05,8.8e-05,8.2e-05,0.000363,9.6e-05,0.000413,2.4e-05,0.000187,4.1e-05,5.3e-05,0.000226,0.000476,5.4e-05,0.000151,0.000161,0.000176,9.1e-05,0.00044,0.000126,7.9e-05,0.000585,0.000433,0.000198,0.000106,7.3e-05,0.000367,8.9e-05,1.5e-05,0.000483,0.000396,0.000191,0.000152,0.000196,6.3e-05,0.000286,0.000453,5.6e-05,0.000246,0.000461,0.000555,5.5e-05,7e-05,0.000114,0.000535,0.000282,0.000134,0.000116,0.000505,0.000106,3.4e-05,0.000194,0.000101,0.000248,0.000231,0.000367,0.00033,6.8e-05,8.6e-05,7.5e-05,0.000247,2.4e-05,0.000106,5.9e-05,0.000121,0.00018,0.000133,0.000201,9.7e-05,4.5e-05,0.00014,6.6e-05,0.000102,3.5e-05,0.000146,0.000147,0.000161,9.3e-05,8.7e-05,0.000141,0.000119,0.000255,0.000253,1.7e-05,7.1e-05,6.8e-05,3.2e-05,0.000201,0.000132,0.00018,0.000184,0.000212,0.000148,0.000165,0.000319,0.000178,0.000249,0.000456,0.000479,0.000311,9e-05,7.8e-05,8.9e-05,0.000164,0.000175,2.1e-05,7.2e-05,0.000274,9.8e-05,0.000135,0.000139,0.00014
0.000217,0.000335,7.7e-05,0.000371,0.000266,0.00027,0.000183,0.000219,0.00043,0.000215,6.7e-05,0.00016,0.000217,0.000342,0.000159,0.000567,0.000218,0.000316,0.000136,0.000216,0.00029,0.000572,0.000249,0.000189,0.000301,0.000231,0.00018,0.000579,0.00015,0.000218,0.000858,0.000361,0.000334,0.000276,7.6e-05,0.000687,0.000104,0.000198,0.000564,0.000259,0.000137,0.000369,0.000395,0.000238,0.000449,0.000708,0.000133,0.000195,0.000405,0.000554,0.000126,0.000147,0.000169,0.000453,0.000369,0.000192,0.000216,0.000551,6.1e-05,0.000117,0.000313,0.000335,0.00032,0.000283,0.000285,0.000381,7.7e-05,6.6e-05,0.000268,0.000273,0.00011,3.7e-05,0.000107,0.000139,0.000246,0.000167,0.000371,9.5e-05,0.000263,0.00033,0.000112,0.000302,0.000159,0.000203,0.000208,0.000217,1.6e-05,3.6e-05,0.000312,0.00027,0.000351,0.000128,7.7e-05,8.1e-05,0.000184,8.3e-05,0.000167,0.000203,0.000225,0.000265,0.000378,0.000168,0.000181,0.000528,0.000607,0.000401,0.000689,0.000416,0.000194,0.000224,0.000247,0.00025,0.000232,0.000266,0.000104,0.000165,0.000263,0.000123,0.000156,5.1e-05,0.000205
0.000339,0.000312,0.000332,0.000895,0.000335,6.9e-05,8.2e-05,0.000278,0.00072,0.000391,0.000465,0.000657,0.00028,0.000495,0.000357,0.000199,0.000361,0.000669,0.000112,0.00052,0.000257,0.00119,0.000833,0.000335,0.000901,0.000265,0.000155,0.000665,0.000635,0.000952,0.00056,0.000641,0.000612,0.000473,0.000274,0.000838,0.000583,0.000258,0.000612,0.00111,0.000582,0.00025,0.00027,0.000332,0.000976,0.000471,0.000293,0.000301,0.000314,0.001004,0.000587,0.000363,0.000459,0.001141,0.000139,0.000617,0.00056,0.000534,0.000247,0.000319,0.000546,0.000383,0.000569,0.000576,0.000662,0.000902,0.00062,0.000202,0.000521,0.000355,0.000377,0.000206,0.000127,0.000248,0.000301,0.000452,0.000675,0.000776,0.000178,0.000128,0.000156,0.000194,0.000262,0.000267,0.000524,0.000254,0.000159,0.000166,0.000328,6.2e-05,0.000715,0.000751,0.000443,0.000265,5.8e-05,5.6e-05,0.000138,0.000347,0.000961,0.000969,0.000503,0.000356,0.00077,0.000837,0.000508,0.000825,0.000952,0.000722,0.00033,0.000386,0.000259,0.000367,0.000543,0.000789,0.000539,0.000381,0.000481,0.000117,0.000331,0.000288,0.000212
0.000848,0.000597,0.00035,0.000934,0.000887,0.000258,0.000212,0.000243,0.000916,0.000702,0.000533,0.001007,0.000723,0.000697,0.000488,0.00019,0.000358,0.000469,0.000744,0.000687,0.000617,0.001336,0.001349,0.001574,0.000417,0.000391,0.000141,0.000415,0.000912,0.000565,0.001177,0.001481,0.001351,0.001082,0.000839,0.000611,0.000614,0.000257,0.000692,0.001179,0.00061,0.000262,0.00092,0.000368,0.000624,0.001189,0.000765,7.3e-05,0.001009,0.001223,0.001019,0.00056,0.000365,0.001017,0.000636,0.000771,0.000173,0.000889,0.000734,0.000374,0.000172,0.000287,0.000905,0.000924,0.001129,0.001265,0.001185,0.001166,0.001341,0.000902,0.001269,0.000724,0.000321,0.000517,0.000129,0.000933,0.000357,0.001201,0.00128,0.000666,0.000477,0.000304,0.000195,0.000171,0.00076,0.000613,0.000457,0.000156,0.000239,0.00047,0.000945,0.000839,0.000312,0.000579,0.000402,0.000469,0.000692,0.000203,0.001159,0.001186,0.001619,0.001144,0.000434,0.000723,0.001067,0.001164,0.00075,0.000217,0.00022,0.000581,0.000803,0.000547,0.00025,0.000656,0.000535,0.000424,0.000494,0.000327,0.000307,0.000127,0.000459
0.000819,0.000627,0.000225,0.00089,0.000763,0.000575,0.000715,0.000449,0.000403,0.001176,0.001045,0.000236,0.000617,0.000942,0.000916,0.001308,8.1e-05,0.000112,0.000784,0.000193,0.000401,0.001133,0.00082,0.000826,0.000743,0.000579,0.000696,0.000763,0.00045,0.00101,0.000142,0.000393,0.000149,0.00053,5.6e-05,2.8e-05,0.000272,0.000344,0.000369,0.000174,0.000389,0.000146,0.001101,0.001121,0.000838,0.000776,0.000366,0.000357,0.000774,0.000365,0.000569,0.000302,0.000406,0.00055,0.000645,0.000339,0.000134,0.001024,0.000216,0.000245,0.000617,9.2e-05,0.000363,0.000584,0.000317,0.000524,0.000522,5e-04,0.000782,0.000539,0.000883,0.000696,0.000241,0.000245,0.00055,0.000417,0.001072,0.000679,0.000665,0.000594,0.00053,0.000409,0.000475,0.000494,0.000801,1.8e-05,0.000391,0.000432,0.000166,0.000765,0.000522,0.000533,0.000161,0.000221,0.000141,0.000486,0.000824,0.000771,0.000599,0.000465,0.000769,0.000536,0.001056,0.000703,0.000279,0.000869,0.001342,0.000699,0.000456,0.000807,0.000277,0.000436,0.000255,0.000634,0.001265,0.001055,0.000675,0.000373,0.000721,0.000458,0.000492
0.000363,0.000379,0.000482,0.000111,0.000622,0.000679,0.000647,0.000726,0.000833,0.001039,0.001312,4.8e-05,0.001075,0.000457,0.000152,0.001824,0.001336,0.000637,0.00102,0.000407,0.000575,0.000624,0.000883,0.000965,0.000859,0.000583,0.000459,0.000729,0.000199,8.7e-05,0.000289,0.000479,0.001002,0.000524,0.000245,0.000216,0.000756,0.000547,0.000734,0.000854,0.001082,0.000469,0.000493,0.000753,0.000404,0.000433,0.000959,0.000179,0.000785,0.00128,0.000729,0.000249,0.000589,0.00175,0.001062,0.000859,0.000164,0.000827,0.000867,0.000396,0.001024,0.000897,0.000869,0.000391,0.000309,0.000826,7.9e-05,0.000698,0.00095,0.000581,0.000387,0.00049,0.000114,0.000106,0.000224,0.000434,0.000581,0.000308,0.00047,0.000191,0.000601,0.000168,0.000453,0.000349,0.000378,0.000733,0.000669,0.000412,0.000622,0.000987,0.000151,0.000298,0.000694,0.000503,0.000237,0.000341,0.000379,0.000602,0.000429,0.000572,0.00059,0.000309,0.000576,0.000356,0.000428,0.001177,0.001132,0.00105,0.001156,0.000919,0.000817,0.000407,0.00052,0.000895,0.000865,0.000316,0.000706,0.000728,0.000481,0.00044,0.000318
0.001538,0.001238,0.000458,0.000537,0.000524,0.000377,0.001469,0.00119,0.001268,0.001095,0.000924,0.000974,0.002066,0.001373,0.000732,0.001868,0.001463,0.001136,0.001123,0.001187,0.000567,0.001279,0.001519,0.000762,0.001078,0.001206,0.001399,0.001707,0.001454,0.00079,0.000597,0.000969,0.001224,0.001569,0.00048,0.000347,0.001259,0.000338,0.000822,0.002333,0.001545,0.001226,0.001131,0.000786,0.001591,0.001404,0.001995,0.002651,0.001663,0.002354,0.001598,0.001242,0.00122,0.001714,0.002803,0.002519,0.001675,0.000902,0.000578,0.000525,0.000851,0.001744,0.001191,0.000614,0.000869,0.0014,0.00159,0.001306,0.000719,0.000404,0.001592,0.001454,0.000665,0.000399,0.000268,0.001049,0.001131,0.000917,0.000622,0.000818,0.000302,0.000352,0.000314,0.000247,0.000946,0.001236,0.001161,0.001656,0.001404,0.002392,0.001483,0.001687,0.001224,0.000821,0.000771,0.000802,0.001121,0.00043,0.000822,0.000644,0.000961,0.001065,0.001346,0.000864,0.001284,0.002448,0.002365,0.001346,0.002145,0.000834,0.000745,0.00028,0.000892,0.001376,0.000976,0.00067,0.000976,0.000897,0.001115,0.001251,0.001377
0.001039,0.000197,0.000715,0.000993,0.001192,0.001353,0.001425,0.001486,0.002721,0.000959,0.001159,0.001507,0.001139,0.002178,0.001692,0.002214,0.001276,0.000944,0.001519,0.001629,0.000431,0.001891,0.001369,0.000917,0.000751,0.000415,0.000545,0.000773,0.001587,0.002208,0.001934,0.001297,0.000644,0.001924,0.001406,0.000862,0.000738,0.002198,0.000761,0.002263,0.000537,0.001117,0.001488,0.001193,0.002021,0.000367,0.001221,0.003002,0.00366,0.001624,0.000195,0.00173,0.001592,0.002316,0.001886,0.000482,0.000572,0.000786,0.001116,0.000835,0.001505,0.001351,0.001831,0.002166,0.001182,0.001181,0.001789,0.000746,0.000641,0.000181,0.002221,0.002162,0.001351,0.001185,0.001626,0.000897,0.001603,0.000695,0.000878,0.001056,0.000568,0.000381,0.000632,0.000946,0.000926,0.001167,0.000162,0.001367,0.000955,0.001415,0.001814,0.001287,0.001602,0.002375,0.001124,0.000929,0.001498,0.001428,0.002052,0.00115,0.001308,0.001268,0.001013,0.000642,0.001669,0.001176,0.001498,0.002077,0.00175,0.001156,0.000469,0.001173,0.001807,0.000839,9e-04,0.00118,0.000995,0.002131,0.00053,0.001105,0.000603
0.00055,9.4e-05,0.000827,0.001772,0.000805,0.000366,0.001097,0.000944,0.001455,0.001777,0.000309,0.000526,0.001846,0.00169,0.001284,0.000532,0.001296,0.001191,0.000788,0.00078,0.001095,0.002137,0.000587,0.000655,0.000823,0.000573,0.000675,0.0015,0.001478,0.000939,0.000888,0.000569,0.000817,0.001721,0.001749,0.001404,0.000433,0.002163,0.001163,0.001149,0.001512,0.000686,0.002438,0.002682,0.000855,0.001882,0.000803,0.002887,0.000388,0.000254,0.00015,0.001661,0.001272,0.001632,0.000755,0.000279,0.000307,0.001096,0.001627,0.001045,0.00141,0.000921,0.001397,0.001066,0.000348,0.000902,0.001782,0.001523,0.000915,0.001216,0.002506,0.000544,0.000388,0.000536,0.001473,0.000366,0.000942,0.001251,0.001251,0.000137,0.000309,0.000977,0.00109,0.000998,0.00152,0.001116,0.001115,0.001585,0.000526,0.000737,0.000584,0.002123,0.000891,0.00134,0.000653,0.001079,0.001781,0.001256,0.000989,0.000854,0.00101,0.000497,0.000656,0.000336,0.0017,0.002166,0.001208,0.002095,0.001377,0.000479,0.001465,0.001305,0.000468,0.001448,0.00118,0.000736,0.000728,0.001504,0.002374,0.001787,0.001103
0.000336,0.00043,0.000928,0.000731,0.000736,0.000472,0.001418,0.002415,0.001161,0.001744,0.002078,0.001016,0.001016,0.000308,0.000588,0.001084,0.001075,0.00048,0.001047,0.000701,0.00122,0.002698,0.00176,0.000657,0.000761,0.000695,0.000637,0.001196,0.000521,0.001218,0.001493,0.001111,0.00103,0.000503,0.001382,0.000786,0.000236,0.001441,0.000957,0.000951,0.000209,0.000687,0.002221,0.00074,0.00126,0.001678,0.001239,0.00126,0.001117,0.000218,0.00037,0.000801,0.000522,0.000853,0.001459,0.001037,0.00025,0.001649,0.002432,0.001216,0.000998,0.001289,0.000737,0.000887,0.001176,0.00049,0.001601,0.001813,0.001212,8e-04,0.000239,0.000451,0.000338,0.000439,0.000943,0.001598,0.000427,0.000795,0.00058,0.000174,0.000389,0.001097,0.000882,0.001342,0.000342,0.001019,0.001999,0.002154,0.00147,0.000649,0.000862,0.000851,0.001285,0.000669,0.000507,0.000765,0.001519,0.001231,0.001619,0.001094,0.00088,0.000763,0.000986,0.00059,0.001151,0.0012,0.000928,0.001833,0.00084,0.000585,0.001997,0.00105,0.000231,0.001259,0.002623,0.002092,0.002086,0.001835,0.000922,0.000237,0.000105
0.000252,0.000364,0.000665,0.000577,0.000695,0.000492,0.000853,0.001135,0.00062,0.001056,0.000811,0.000665,5.8e-05,0.000363,0.000129,0.000599,0.00013,0.000285,0.000878,0.000803,0.000569,0.000645,0.000456,0.00057,0.000731,0.000285,0.000165,0.000586,0.000549,0.001198,0.000345,0.000536,0.000866,0.000955,0.00074,0.000508,0.00032,0.000763,0.000681,0.000132,0.000258,0.000383,0.000932,0.000449,0.000583,0.00045,6.1e-05,0.00036,0.000498,0.000605,0.000812,0.000552,0.000178,0.000932,0.000753,0.000307,0.000624,0.000992,0.000235,0.000557,0.000717,0.000362,0.000667,0.000733,0.000826,0.000296,0.000773,0.000693,0.000393,0.001077,0.00087,0.000576,0.000338,0.000578,0.000427,0.000877,0.000991,0.000606,0.000593,0.000689,8.8e-05,0.000833,0.000189,0.00061,0.000502,0.000798,0.00104,0.000175,0.000503,0.000672,0.000203,0.000731,0.000561,0.000178,0.000349,0.000271,0.000146,0.000757,0.000591,0.00033,0.000413,0.000517,0.000831,0.000338,0.000591,0.000477,0.000414,0.000592,0.000517,0.000798,0.0013,0.000746,0.000681,0.00031,0.001236,0.000781,0.000617,0.000243,0.001144,0.000598,0.000382
0.000166,0.000295,0.000241,0.000187,0.000278,0.000348,0.000589,0.000583,0.000232,0.000752,0.000242,0.000361,0.000289,0.000208,0.000223,0.000383,0.000398,7.9e-05,0.000414,0.000241,0.000164,0.000383,0.000195,0.000639,0.000363,0.00033,0.000106,0.000333,0.000427,0.000616,0.000654,5.4e-05,0.000358,0.000654,0.00059,0.000275,0.00016,0.000299,0.000294,0.000151,0.000324,0.000122,0.000531,0.000237,0.000211,0.000117,0.000358,0.000185,0.000334,0.000115,0.00034,0.000383,0.000203,0.00034,0.00021,4.4e-05,0.000518,0.000478,0.000618,0.000345,0.000388,0.000747,0.000241,0.000397,0.000255,0.000242,0.000486,0.000643,0.000295,0.000534,0.000413,0.000189,0.000351,0.000704,0.000206,0.000455,0.000368,0.000296,0.000372,0.000483,0.000396,0.000321,0.000186,8e-05,0.000226,0.000537,0.000925,0.000264,0.000448,0.000266,0.000146,0.000394,0.000413,7.1e-05,0.000296,0.000213,0.000251,0.000398,0.000313,0.000247,0.000248,0.000318,0.000332,0.000417,9e-05,0.000347,0.000115,0.000273,3.1e-05,0.000602,0.000743,0.000203,0.000236,0.000408,0.00058,0.000229,0.00033,0.000307,0.000349,4.1e-05,0.000482
0.000394,0.00037,0.00041,0.000246,0.000232,0.000357,0.000638,0.000818,0.000547,0.000716,6e-05,0.000351,0.000441,0.000359,0.000314,0.000121,0.000526,0.000286,0.000285,0.000111,0.000189,0.00053,0.000103,0.000505,0.000339,0.000263,0.000127,0.000375,0.000125,0.000409,0.00037,0.000221,0.000716,0.000643,0.000782,0.000693,0.000333,0.000169,0.000621,0.000313,0.000224,0.00039,0.000439,0.000345,0.000326,0.000238,0.000475,0.000572,0.000482,0.00038,0.000398,0.000138,0.000414,0.000523,0.000572,0.000375,0.000129,0.000175,0.000689,0.000181,0.000164,0.000946,0.000279,0.000442,0.000294,0.000158,0.000584,0.000536,0.00048,0.000321,0.000596,0.000109,0.000527,0.000815,0.000431,0.000336,0.000315,0.000581,0.000429,0.000479,0.000114,0.000482,0.00034,0.000198,0.000483,0.000577,0.000814,0.00019,0.000306,7.1e-05,0.000295,0.000518,0.000408,6.7e-05,0.000334,0.000325,0.00028,0.000353,0.000319,0.000222,0.000208,0.000445,0.00052,0.000159,0.000309,0.000294,0.000293,0.000635,0.000267,0.00049,0.000336,0.000464,0.000207,0.00031,0.000442,0.000181,0.000359,0.000597,4.9e-05,6.1e-05,0.000512
0.000325,0.001086,0.000431,0.000463,0.000404,0.000231,0.001112,0.000785,0.000623,0.000729,0.000798,0.000182,0.00035,0.000695,0.001048,0.000735,0.001223,0.001053,0.001162,0.000283,0.000239,4e-04,0.000698,0.001367,0.00013,0.000547,0.000217,8.3e-05,0.000513,0.000709,0.000775,0.000426,0.000489,0.000338,0.000769,0.000688,0.000666,0.000604,0.000753,0.000458,0.000702,0.000941,0.00113,0.00074,0.000459,0.000715,0.000669,0.001151,0.000344,0.000845,0.000318,0.000601,0.000546,0.000655,0.000279,0.000487,0.00054,0.000287,0.000359,0.001479,0.00081,0.000913,0.00137,0.000641,0.000138,0.000735,0.000849,0.000996,0.000792,0.000634,0.000747,0.000405,0.000806,0.000514,0.000683,0.000822,0.000593,0.000825,0.000407,0.001029,0.000921,0.000504,0.000397,0.000187,0.001006,0.000821,0.001313,0.000661,0.000471,0.000658,0.00048,0.000667,0.000514,0.000353,0.000335,0.000498,0.000304,0.000506,0.000294,0.000918,0.000319,0.000576,0.000855,0.00078,0.000281,0.000784,0.000378,0.001682,0.00042,0.000865,0.001043,0.000784,0.000758,0.000446,0.000318,0.000642,0.000696,0.000735,0.00057,0.000185,0.000616
0.000271,0.001209,0.001925,0.001926,0.001176,0.001086,0.001793,0.002567,0.002513,0.001238,0.001572,0.001569,0.000928,0.000414,0.001736,0.002408,0.002929,0.002831,0.001118,0.000292,0.000695,0.001186,0.001518,0.002237,0.002021,0.001336,0.000612,0.000302,0.000462,0.000675,0.001402,0.000814,0.000372,0.000556,0.00089,0.001883,0.002196,0.001301,0.000696,0.00104,0.001154,0.00082,0.00092,0.001355,0.001502,0.002113,0.002444,0.002571,0.002642,0.002476,0.001393,0.001007,0.00119,0.00129,0.000303,0.00061,0.000768,0.000536,0.000451,0.001939,0.001131,0.001436,0.001015,0.000699,0.000844,0.000629,0.000453,0.001747,0.002613,0.001535,0.001734,0.000915,0.001249,0.002182,0.002193,0.00222,0.002083,0.001952,0.001928,0.001909,0.001892,0.001552,0.001433,0.000874,0.001097,0.001702,0.002926,0.002373,0.002047,0.000809,0.000781,0.000965,0.001391,0.001477,0.001366,0.001161,0.001477,0.000894,0.000622,0.00082,0.001716,0.001591,0.001581,0.001454,0.001276,0.001156,0.000751,0.002464,0.002606,0.002488,0.00229,0.002504,0.000711,0.000533,0.001104,0.00113,0.00229,0.001275,0.00052,0.000512,0.000269
0.000574,0.000676,0.001267,0.000917,0.000561,0.001002,0.001326,0.001,0.002457,0.002376,0.00087,0.000713,0.000913,0.001153,0.000807,0.001546,0.003245,0.001505,0.001062,0.001265,0.000677,0.00169,0.002294,0.000377,0.001004,0.001411,0.001189,0.000442,0.00038,0.00047,0.001558,0.001016,0.000617,0.000911,0.001472,0.001828,0.000407,0.000228,0.000658,0.001709,0.001598,0.001389,0.001499,0.001439,0.001104,0.00196,0.002003,0.002584,0.001765,0.000219,0.000303,0.000662,0.001509,0.002007,0.00184,0.00046,0.000725,0.000452,0.000448,0.001714,0.001166,0.001011,0.000871,0.000481,0.000552,0.001337,0.001619,0.00174,0.001748,0.001287,0.001044,0.00051,0.00123,0.001889,0.002377,0.002078,0.000608,0.001514,0.002756,0.001602,0.000895,0.000963,0.000956,0.000748,0.001617,0.000583,0.001322,0.001206,0.000195,0.001049,0.000919,0.000619,0.000777,0.001078,0.000889,0.000827,0.000955,0.000371,0.000113,0.000785,0.001404,0.001454,0.000987,0.000612,0.001199,0.000594,0.001344,0.000907,0.002042,0.000549,0.00058,0.00089,0.001308,0.000675,0.001373,0.001568,0.001447,0.002026,0.001339,0.000237,0.000528
0.000381,0.000554,0.000588,0.000192,0.000418,0.00069,9.4e-05,0.001115,0.000774,0.000611,0.00039,0.000497,0.000384,0.000555,0.00015,0.001447,0.001079,0.00094,0.00029,0.000325,0.000775,0.000345,0.000852,0.000521,0.000429,0.000428,0.00045,0.000334,0.00037,0.000527,0.00112,0.000423,0.000431,0.000571,0.000989,0.000138,0.000703,0.000148,0.000401,0.000985,0.000186,0.000959,0.001466,0.000576,0.000938,0.000786,0.000685,0.001131,0.000338,0.000338,6.8e-05,0.000436,0.000933,0.000891,0.000438,0.000359,0.000677,0.000312,0.000617,0.000841,0.001142,0.000493,0.000606,0.000692,0.001001,0.000232,0.000608,0.001111,0.000533,1e-04,0.000499,0.000346,0.000568,0.000814,0.000718,0.000508,0.000667,0.000694,0.001068,0.000507,0.000357,0.000256,0.000765,0.000124,0.000994,0.000746,0.000369,0.000164,1e-04,0.000672,0.000227,0.000457,0.000259,0.000466,7.5e-05,0.000222,0.000577,0.000342,0.000277,0.000125,0.000665,0.000194,0.000777,0.001291,0.000982,0.000763,0.000916,0.001212,0.000719,0.001101,0.000494,0.000634,0.000282,0.000487,0.000486,0.000163,0.001353,0.00075,0.000352,0.000602,0.000106
0.000522,0.000143,0.000259,0.000243,0.000459,0.000147,0.00039,0.000565,0.000622,0.00085,0.000655,0.000461,0.000369,0.000699,2e-05,0.000834,0.000634,0.000734,0.000551,0.000257,0.000282,0.000338,0.000181,0.000578,0.000206,0.000339,7.5e-05,0.000305,0.000529,0.000314,0.000791,0.00042,0.000478,0.001098,0.000307,0.000317,0.000435,0.000712,0.000165,0.000403,0.000141,0.000695,0.000185,0.000335,0.000718,0.00073,0.000406,0.00094,0.00072,0.000198,0.000295,0.000324,0.000423,0.000431,0.000367,0.000155,0.000401,0.00033,8e-05,0.000583,0.000318,0.000449,0.000357,0.000241,0.000585,0.000386,0.000351,0.000632,0.000535,0.000263,0.000297,0.000111,0.000257,0.000604,0.000666,0.00046,0.000818,0.001039,0.000159,0.000526,0.000291,6.6e-05,0.000544,0.000654,0.000545,0.000461,0.000578,0.00058,0.000384,0.000218,8.5e-05,0.000327,0.000265,0.000253,0.000144,0.000224,0.000431,0.000212,3.3e-05,0.000573,0.000335,0.000186,0.000597,0.00094,0.000405,0.000281,0.000266,0.000307,0.000496,0.000219,0.000341,0.000263,0.000114,0.000136,0.000265,0.000473,0.001193,0.000603,0.000445,0.000189,0.00031
0.000156,0.000262,0.000319,0.000213,4.7e-05,0.000211,0.000401,0.000402,0.000257,0.000247,0.000148,0.000258,0.000309,0.000589,0.000694,0.000225,0.000611,0.00036,0.000324,0.000181,7.2e-05,0.00055,0.000167,0.000392,0.000358,0.000395,0.000368,0.000119,0.000214,0.000285,0.000188,0.00019,0.000625,0.000988,0.000732,0.000561,0.000313,0.000577,0.000984,0.000519,4.7e-05,0.000242,0.000175,0.000286,0.000175,0.000146,0.000577,0.000554,0.000381,0.000483,0.000364,0.000195,0.000246,3e-04,0.000254,0.000303,0.000223,0.000537,0.000667,0.000544,0.00047,0.000281,0.000735,0.000867,0.000621,0.000713,0.000387,0.000424,0.000362,0.000565,0.000595,0.000246,0.000216,0.000282,0.000136,0.000805,0.000417,0.000711,0.000271,7e-04,5.1e-05,0.000179,0.00022,0.000281,0.000297,0.000265,0.000195,0.00031,0.000117,0.000321,0.000338,0.000251,0.000187,0.000594,8.6e-05,0.00019,0.000495,0.000309,0.000432,0.000601,0.000672,0.00013,0.000293,0.000457,0.000396,0.000361,0.000355,0.000736,4.4e-05,0.000409,0.000424,0.000537,0.000161,0.00021,0.000403,0.000509,0.000852,0.000526,0.000257,0.000179,0.000482
0.000248,0.00035,8.7e-05,0.00016,0.000232,0.000243,0.000466,0.000317,0.000139,0.000387,0.000224,0.00029,0.000114,0.000471,5.4e-05,0.000794,0.000265,0.000522,0.000677,0.000305,0.000145,0.000319,0.000181,0.000198,0.000147,0.000457,0.000131,0.000303,0.000218,0.000558,0.000153,3.8e-05,0.000476,5.1e-05,0.000433,0.000257,0.000399,0.000338,0.000338,0.000231,0.000153,0.000299,0.000205,0.000101,0.000106,6.5e-05,0.000593,0.000633,0.000296,0.000571,0.000459,0.000585,0.000103,0.000361,0.000509,0.000224,0.000267,0.000425,0.000297,0.000111,0.000276,0.000254,0.000216,0.000408,2e-04,0.000697,0.00072,0.000737,0.000634,0.000193,0.000519,0.000327,0.000267,5.7e-05,0.000352,0.000594,0.000313,0.000431,0.000471,0.000171,0.00043,0.000441,0.000349,0.000467,0.000353,0.000157,0.000268,0.000246,0.000277,0.000619,0.000572,0.000788,0.000308,0.000739,0.000282,0.000449,0.000477,0.000361,0.000536,0.000865,0.000171,0.000204,0.000133,0.000626,0.000255,0.000144,0.000198,0.000485,0.000588,0.000349,0.000348,0.00031,0.00049,0.000239,0.000244,0.000245,0.000739,0.000354,0.000245,0.000378,0.000202
0.00055,0.000801,0.000475,8.3e-05,0.000114,7.5e-05,0.000322,0.000355,0.000311,0.000331,0.00023,0.000345,0.000226,0.000433,0.000424,0.000506,0.000393,0.000603,0.000487,0.000247,0.000134,0.000318,0.000263,0.000253,0.000272,0.000101,0.000291,0.000574,0.000481,0.000551,0.000555,0.000335,0.000388,0.000252,0.00034,0.000186,0.000155,0.000256,0.000177,0.000285,0.000388,0.000155,0.000104,0.000111,5.6e-05,0.000248,0.000232,0.000635,0.000625,4e-05,0.000131,0.00046,0.000702,0.000552,0.000652,0.00027,0.000299,0.000256,0.000133,2.7e-05,0.000426,0.000535,0.000416,0.000195,8.2e-05,0.000636,0.000722,0.000133,0.00056,0.000509,0.000155,0.000291,0.000112,4.3e-05,0.000309,0.000461,0.000122,0.000145,0.000134,0.000221,0.000108,0.000223,0.000236,0.000153,0.000282,0.000271,0.000373,0.00062,0.000109,0.000509,0.000249,0.000759,0.000426,0.000475,0.000505,0.000712,0.000362,0.000132,0.000262,0.000387,0.000509,0.000497,0.000343,0.000873,0.000509,0.000142,0.00019,0.000479,0.000663,0.00064,0.000497,0.000485,0.000384,0.000343,0.000612,0.000335,0.000116,0.000249,0.000599,0.000111,0.000288
0.000194,7.9e-05,4.5e-05,7.4e-05,6.5e-05,6.9e-05,9.3e-05,2.3e-05,0.000125,2.2e-05,0.000181,0.000134,0.000148,0.000305,0.000171,0.000237,3e-05,0.000151,0.000114,0.000105,0.000169,9.9e-05,0.000142,2.1e-05,0.000213,0.000129,9.4e-05,0.00015,0.000159,0.000225,0.000105,6.2e-05,0.000109,1e-05,7.9e-05,0.000101,0.000108,0.000102,0.000129,0.000177,6.2e-05,0.000128,8.6e-05,5.4e-05,0.000112,0.000122,0.000102,0.000201,0.000148,0.000186,6.4e-05,0.000173,0.000171,0.000147,5.4e-05,0.000172,6.8e-05,7.5e-05,2.4e-05,2.9e-05,0.000159,0.000168,9.9e-05,0.000134,2.7e-05,0.000131,6.8e-05,8e-05,0.000247,7.9e-05,0.000106,1.1e-05,4.8e-05,5.1e-05,4.4e-05,0.000121,4.3e-05,0.000148,0.000116,0.000116,9.1e-05,4.9e-05,4.1e-05,0.000126,0.000312,0.000151,0.000257,8.6e-05,0.000118,8.9e-05,0.000198,0.000149,0.000105,0.000217,0.000267,0.000198,7e-05,0.000122,5.6e-05,0.000152,7.7e-05,7.9e-05,0.000177,2e-04,0.00017,0.000165,4.5e-05,8.2e-05,0.000398,0.000108,2e-05,5.4e-05,0.000104,0.000112,0.000241,5.1e-05,0.000144,0.000237,0.000163,0.00016,0.000152
8.6e-05,0.000104,4.9e-05,4e-05,6.4e-05,3.5e-05,4.7e-05,5.5e-05,2.7e-05,0.000103,5e-05,1.9e-05,1.6e-05,0.000141,4.2e-05,0.000161,6.1e-05,7.3e-05,5.8e-05,5.7e-05,5.9e-05,5.7e-05,0.000142,8.3e-05,0.000132,3.9e-05,2.7e-05,0.000105,6.1e-05,6.3e-05,5.8e-05,4.6e-05,5.6e-05,6.7e-05,5.3e-05,4.1e-05,4.2e-05,7.1e-05,0.000125,8.8e-05,4e-06,2.3e-05,9e-05,4e-06,5.1e-05,8.7e-05,1.9e-05,0.000151,4e-05,4e-05,4e-06,0.000118,7.8e-05,7.5e-05,2.4e-05,8.7e-05,7.3e-05,6e-05,1.8e-05,1.5e-05,4.7e-05,0.000146,4.9e-05,8.1e-05,4.6e-05,0.00012,0.000106,3.3e-05,9.9e-05,7.6e-05,3.3e-05,4.5e-05,9e-05,4.1e-05,9.2e-05,0.000104,4.3e-05,0.000109,7.3e-05,3.8e-05,4.6e-05,5.3e-05,2.4e-05,8.1e-05,0.000126,3.2e-05,0.000135,0.000171,0.000119,7.2e-05,7.3e-05,3e-05,7.8e-05,9.9e-05,0.000109,7.2e-05,4.8e-05,3.8e-05,3.1e-05,8.1e-05,5.3e-05,4.3e-05,9.3e-05,7.8e-05,4.2e-05,7.7e-05,5e-05,0.000175,0.000187,0.000118,8e-05,6.4e-05,4e-05,8.3e-05,8.2e-05,7.7e-05,1e-04,0.00014,3.8e-05,7.7e-05,1.6e-05
4.3e-05,6.5e-05,3.5e-05,5.5e-05,2.7e-05,2.3e-05,5.5e-05,4.5e-05,3.9e-05,0.000105,3.2e-05,4.4e-05,1.9e-05,9.3e-05,4e-06,0.000176,7e-05,2.2e-05,5.7e-05,3.1e-05,5.4e-05,7.4e-05,0.000124,4.3e-05,6.6e-05,2.8e-05,1.3e-05,7.1e-05,6.3e-05,9e-06,2.2e-05,3.4e-05,4e-05,4.8e-05,6.9e-05,2.6e-05,4.7e-05,5.8e-05,0.00012,9.8e-05,2.2e-05,5.5e-05,5.4e-05,2.2e-05,7.3e-05,8.5e-05,4.7e-05,0.000171,2.6e-05,2.5e-05,1.9e-05,9.2e-05,4.3e-05,7.6e-05,1.9e-05,5.9e-05,2.1e-05,4.8e-05,3.3e-05,2.8e-05,5.5e-05,8.5e-05,1.2e-05,6.8e-05,5e-05,7.2e-05,0.000101,3.4e-05,7.7e-05,6.8e-05,4.3e-05,5.3e-05,3.8e-05,3.6e-05,7.4e-05,0.000111,5.4e-05,7.5e-05,4.6e-05,3.4e-05,7e-06,2.3e-05,2e-05,3.9e-05,9.3e-05,3e-06,3.8e-05,0.000112,4.7e-05,9e-06,5.7e-05,5.3e-05,5.3e-05,6e-05,6.1e-05,5.1e-05,6.7e-05,7.4e-05,3.8e-05,7.4e-05,5.4e-05,2.9e-05,6e-05,5.7e-05,1.9e-05,5.3e-05,4.1e-05,0.000127,9.5e-05,7.2e-05,3.6e-05,5.6e-05,2.9e-05,6.8e-05,9.4e-05,8.8e-05,6e-05,8e-05,2.9e-05,5.1e-05,4.9e-05
3.4e-05,7e-05,2.1e-05,4.3e-05,2.6e-05,2.8e-05,4.2e-05,5.8e-05,2.5e-05,8.1e-05,3.6e-05,4.6e-05,2.3e-05,9.2e-05,1.7e-05,0.000163,4.3e-05,2.4e-05,4.7e-05,5.2e-05,4.3e-05,8.6e-05,0.000105,4.6e-05,6.8e-05,1.6e-05,2.6e-05,6.2e-05,7.7e-05,4.1e-05,1.5e-05,3.9e-05,2.9e-05,3.6e-05,3.4e-05,6e-06,2.1e-05,6.2e-05,0.000105,8.3e-05,3.9e-05,3.2e-05,1.2e-05,1.1e-05,5.9e-05,7.1e-05,4.5e-05,0.000133,5e-05,3.3e-05,6e-06,6.9e-05,2.3e-05,3.9e-05,3.8e-05,3.5e-05,2.4e-05,5e-05,2.7e-05,4.1e-05,2.1e-05,9.4e-05,3.3e-05,6.8e-05,3.7e-05,7.4e-05,8.5e-05,1.6e-05,8.7e-05,6.1e-05,2.2e-05,3.1e-05,4.9e-05,9e-06,6.7e-05,7.3e-05,5.4e-05,8e-05,3.5e-05,4e-05,1.7e-05,1.7e-05,1.4e-05,4.2e-05,9.8e-05,3.6e-05,8e-06,0.000127,7.6e-05,1.3e-05,3e-05,5.5e-05,7e-05,7e-05,4.8e-05,3.3e-05,4.6e-05,4.9e-05,4e-05,2.8e-05,4.8e-05,4.6e-05,7.9e-05,4.8e-05,2.7e-05,5.2e-05,6.1e-05,0.000107,0.000121,4.6e-05,2.1e-05,3.7e-05,3.4e-05,4.5e-05,7.7e-05,6.3e-05,6e-05,6.4e-05,2.3e-05,1.5e-05,5.4e-05
2.4e-05,5.4e-05,2.6e-05,3e-05,2e-05,2.8e-05,3.1e-05,4.7e-05,2.8e-05,9e-05,4.6e-05,4.2e-05,2.1e-05,5.9e-05,2.3e-05,0.000146,5.1e-05,2.6e-05,2.4e-05,4.6e-05,3.6e-05,6.2e-05,8.6e-05,5.2e-05,6.8e-05,1.9e-05,1.8e-05,6.5e-05,6.6e-05,1.7e-05,2.1e-05,4.1e-05,3.6e-05,5.3e-05,4.9e-05,7e-06,1.1e-05,5.3e-05,9.7e-05,6.5e-05,2.1e-05,1.9e-05,6.1e-05,3.4e-05,5.5e-05,7.1e-05,3.8e-05,0.00011,4.4e-05,1.4e-05,4e-06,7.3e-05,2.5e-05,3.6e-05,3.3e-05,2.9e-05,2.4e-05,4.1e-05,2.7e-05,2e-05,1.8e-05,9.1e-05,2.5e-05,5.5e-05,3.8e-05,6.7e-05,7.3e-05,3.6e-05,4.3e-05,5.3e-05,1.7e-05,1.1e-05,5.6e-05,1.8e-05,7.7e-05,8.2e-05,5.5e-05,8.4e-05,2.4e-05,3.3e-05,2.7e-05,2.1e-05,3.6e-05,1.7e-05,0.000112,1.2e-05,2.6e-05,6.7e-05,4.3e-05,1e-05,3.7e-05,4.3e-05,6.8e-05,6.6e-05,4.4e-05,1.5e-05,6.2e-05,6.5e-05,4.5e-05,5e-05,3.7e-05,4.1e-05,5.8e-05,5e-05,3.2e-05,4.5e-05,5.5e-05,0.000107,9.8e-05,5.8e-05,3.4e-05,3e-05,2.2e-05,5.3e-05,8.1e-05,5.8e-05,5.1e-05,6.7e-05,8.3e-05,4.1e-05,6.1e-05
3.6e-05,5.6e-05,3.9e-05,2.8e-05,1.6e-05,2.7e-05,2.7e-05,3.3e-05,3.7e-05,8.5e-05,1.4e-05,3.4e-05,4e-06,3.2e-05,2.2e-05,0.00013,1.9e-05,2.6e-05,3.9e-05,5.2e-05,2.7e-05,8.4e-05,8.7e-05,4.8e-05,8.4e-05,3e-05,1.7e-05,5.3e-05,4.4e-05,1e-05,2.5e-05,3.9e-05,2.8e-05,5.3e-05,3.5e-05,2.4e-05,2.2e-05,4.6e-05,8.3e-05,1.5e-05,4.9e-05,2.4e-05,7.7e-05,2e-05,5.1e-05,7.7e-05,6.3e-05,9.5e-05,9e-06,4e-05,2.1e-05,7.7e-05,3.3e-05,3.6e-05,3.3e-05,1.7e-05,3.2e-05,3.2e-05,2.4e-05,3.9e-05,5.6e-05,7.7e-05,2.3e-05,4.4e-05,3.5e-05,5.2e-05,6.2e-05,3.4e-05,6.5e-05,2.4e-05,2.5e-05,1.2e-05,5.7e-05,1.7e-05,5.5e-05,8.2e-05,4.2e-05,7e-05,3e-05,2e-05,1.4e-05,3.5e-05,3.1e-05,2.8e-05,8.1e-05,1.6e-05,3.4e-05,1e-04,6.3e-05,1.6e-05,2e-05,5.7e-05,6.7e-05,6.7e-05,3.4e-05,3e-05,3.2e-05,3.6e-05,5.3e-05,2.3e-05,4.9e-05,3.4e-05,5.6e-05,2.9e-05,3.8e-05,3.3e-05,4.1e-05,8.3e-05,5.6e-05,4.9e-05,1.5e-05,3.8e-05,3.7e-05,5.3e-05,5.2e-05,7.2e-05,4.8e-05,7.5e-05,5.6e-05,2.4e-05,8.6e-05
4.5e-05,6.8e-05,3.7e-05,3.7e-05,2.6e-05,4e-06,3.5e-05,4.9e-05,6e-05,5.7e-05,1.4e-05,3.1e-05,1.7e-05,4.4e-05,4.2e-05,0.000127,2.2e-05,5e-06,3.8e-05,5.1e-05,3.9e-05,7.2e-05,0.000112,4.9e-05,6.5e-05,8e-06,2.3e-05,7.2e-05,4.5e-05,1.7e-05,2.1e-05,5.1e-05,1.1e-05,5.6e-05,2.1e-05,3.2e-05,9e-06,3.4e-05,0.000119,3.5e-05,3.9e-05,1.7e-05,2e-05,2.4e-05,5.3e-05,8.2e-05,3.8e-05,0.000102,3.5e-05,4.6e-05,1.1e-05,5.9e-05,2.9e-05,3.3e-05,5.5e-05,2e-05,3.5e-05,2.4e-05,2.9e-05,1.9e-05,4.6e-05,7.1e-05,2.4e-05,3.8e-05,2e-05,2.1e-05,5.6e-05,2.4e-05,5.8e-05,5e-05,1.5e-05,4.2e-05,6e-05,5.8e-05,8.3e-05,1.5e-05,2.4e-05,0.00011,1.8e-05,3.7e-05,5e-05,3.3e-05,4.4e-05,1e-05,9e-05,1.4e-05,6e-05,5.7e-05,6e-05,5e-06,2.5e-05,4.5e-05,6.2e-05,2.9e-05,7.2e-05,3.5e-05,2.9e-05,3.4e-05,5.8e-05,5.3e-05,3.4e-05,2.4e-05,4.2e-05,2.2e-05,5.9e-05,4.2e-05,2.6e-05,6e-05,8.7e-05,4.3e-05,5.2e-05,5.5e-05,3e-05,1.1e-05,6.1e-05,0.000113,2.4e-05,5.9e-05,5.7e-05,3.7e-05,7.4e-05
3e-05,3.4e-05,7.3e-05,2.6e-05,6.8e-05,8.2e-05,3.7e-05,1.9e-05,9e-05,0.000119,2.9e-05,3.1e-05,4.6e-05,5e-05,1e-05,0.000133,2.9e-05,8e-06,4.1e-05,4.1e-05,4.4e-05,6.2e-05,0.000128,5.5e-05,3.5e-05,9.8e-05,2.1e-05,9.5e-05,6.5e-05,2.6e-05,5.1e-05,3.1e-05,1.7e-05,7.3e-05,8.1e-05,6.9e-05,4.4e-05,0.000104,0.000115,7.1e-05,5.9e-05,6.4e-05,4.1e-05,2.9e-05,2e-05,8e-05,8.1e-05,6.6e-05,6e-05,2.6e-05,4e-05,7.7e-05,4.2e-05,3.4e-05,6e-05,6.6e-05,6.1e-05,9e-06,7.3e-05,2.5e-05,6.7e-05,0.000101,1.8e-05,7e-06,2.7e-05,8.3e-05,9.1e-05,7.3e-05,4.3e-05,6.8e-05,1.8e-05,3.9e-05,6.5e-05,9.4e-05,8.1e-05,0.000161,0.00011,0.000187,9.6e-05,7.8e-05,8.2e-05,2.9e-05,3.6e-05,7.1e-05,9.5e-05,5.6e-05,0.000116,0.000132,9.1e-05,6.7e-05,5.2e-05,5.7e-05,0.000101,6.2e-05,4.6e-05,7.7e-05,0.000102,6.3e-05,3.6e-05,5.9e-05,6e-06,1.9e-05,5.8e-05,6.4e-05,6.4e-05,4.2e-05,5.8e-05,4.1e-05,2.2e-05,7.8e-05,9e-05,0.000122,0.000108,6.9e-05,1.5e-05,7.8e-05,3.1e-05,1.2e-05,5.4e-05,2.7e-05,4.7e-05
1.3e-05,5.3e-05,0.000111,6.9e-05,4.2e-05,7.9e-05,7.6e-05,5.3e-05,0.000125,9.6e-05,7.1e-05,4.9e-05,2.7e-05,6.8e-05,4.9e-05,4.8e-05,0.00017,0.000118,3.7e-05,7.5e-05,3.1e-05,8.1e-05,5.2e-05,0.000119,8.4e-05,0.000159,0.000169,0.000196,6.4e-05,3.4e-05,9.2e-05,8.6e-05,7.1e-05,5.2e-05,0.000153,4.4e-05,2.2e-05,0.000107,0.000127,0.000147,6e-05,5.4e-05,0.000113,8.7e-05,4.1e-05,9.9e-05,9.2e-05,0.000226,0.000146,0.000117,8.4e-05,4.6e-05,2e-05,4.3e-05,0.000111,0.00013,0.000109,0.000119,0.000156,0.000164,0.000124,3.6e-05,7.5e-05,0.000103,9.4e-05,0.000144,6.1e-05,9e-05,8.2e-05,0.000125,9.1e-05,6.8e-05,0.000114,0.000156,0.000143,0.00013,8.4e-05,0.000165,0.000129,0.000108,0.000141,0.000147,3.7e-05,5.6e-05,6.7e-05,0.000103,5.2e-05,8.5e-05,0.000194,0.000128,6e-05,9.1e-05,0.000195,9.4e-05,1.2e-05,0.000115,8.6e-05,4.6e-05,5.8e-05,9.7e-05,7.8e-05,0.000114,0.000103,0.000144,0.000167,0.000172,6.4e-05,0.000109,7e-05,8.7e-05,0.000136,4.1e-05,6.8e-05,7.6e-05,0.000102,3.8e-05,7.5e-05,0.000103,7.3e-05,9.2e-05,8.2e-05
6.5e-05,9.8e-05,4.3e-05,5e-05,6.2e-05,7.3e-05,4.3e-05,2.5e-05,9.5e-05,8.3e-05,3.8e-05,4.2e-05,1.4e-05,4.9e-05,3.7e-05,7.9e-05,0.000136,5.9e-05,4.5e-05,6.1e-05,6.4e-05,5.6e-05,5.6e-05,8.8e-05,4.7e-05,6.7e-05,8.8e-05,3e-05,8.8e-05,3e-05,9e-05,7.8e-05,7.6e-05,8.1e-05,9.4e-05,5.6e-05,1.6e-05,8.6e-05,8.2e-05,8.7e-05,6.2e-05,2.1e-05,0.000102,7.1e-05,5.7e-05,6.8e-05,3e-05,0.000167,2.6e-05,1.2e-05,4.8e-05,8.3e-05,2e-05,5.1e-05,2.8e-05,8.7e-05,6.7e-05,7.4e-05,8.2e-05,5.1e-05,1.5e-05,8e-05,2.3e-05,0.000109,3.5e-05,0.000115,0.000117,2.8e-05,5.4e-05,0.000107,6.1e-05,1.6e-05,5.4e-05,6.3e-05,4.5e-05,0.000132,6.9e-05,6.9e-05,4.9e-05,4.1e-05,5.9e-05,6.5e-05,4e-05,1.6e-05,2.8e-05,4e-06,7.4e-05,4.9e-05,5.2e-05,4.9e-05,3.3e-05,4.6e-05,9.4e-05,8.7e-05,4.5e-05,8.6e-05,4.5e-05,4.1e-05,3.1e-05,2.6e-05,8e-05,3.9e-05,4.2e-05,0.000122,4.4e-05,7.7e-05,6e-05,0.000117,5.7e-05,5.9e-05,9.6e-05,6.4e-05,2.9e-05,1.5e-05,3.7e-05,4.7e-05,4.3e-05,7.7e-05,3.6e-05,4.8e-05,9.5e-05
4e-05,6.2e-05,1.7e-05,2.3e-05,4.2e-05,2.2e-05,2.3e-05,2.2e-05,4.5e-05,6.4e-05,9e-06,8e-06,5e-06,5.1e-05,4e-06,0.000106,6.1e-05,2.3e-05,2.4e-05,2.1e-05,3.6e-05,3.1e-05,5.2e-05,5.5e-05,4.8e-05,3.6e-05,1e-05,6e-06,4.9e-05,2.5e-05,2.3e-05,4.6e-05,2.6e-05,5.3e-05,4e-05,1.9e-05,1.6e-05,3.6e-05,3.2e-05,5.7e-05,2.1e-05,2.9e-05,5.9e-05,1.2e-05,4.2e-05,6.2e-05,7e-06,8.1e-05,3.4e-05,2.1e-05,2.8e-05,7.9e-05,1.5e-05,3.7e-05,3e-05,6.9e-05,2.3e-05,4.7e-05,2.7e-05,5e-05,2.3e-05,9.1e-05,4.5e-05,2.9e-05,3.1e-05,4.5e-05,5.2e-05,5.1e-05,1.2e-05,8.8e-05,2.7e-05,3.5e-05,1.4e-05,3.3e-05,4.3e-05,9.7e-05,4.1e-05,3.2e-05,1.9e-05,1.9e-05,5.1e-05,2.1e-05,8e-06,3e-06,4.3e-05,1.5e-05,6.2e-05,3.6e-05,4e-06,5.4e-05,3.4e-05,5e-06,4.2e-05,6.2e-05,3.5e-05,3.7e-05,3.8e-05,4.7e-05,4.2e-05,1.4e-05,4.5e-05,4.6e-05,1.2e-05,6.6e-05,2.7e-05,3e-05,1.2e-05,9.4e-05,5e-05,2.6e-05,5.7e-05,3e-05,3.4e-05,3.2e-05,5.9e-05,5.5e-05,1.9e-05,5.4e-05,2.5e-05,2.3e-05,2.8e-05
2.9e-05,6.9e-05,7e-06,1.7e-05,2.5e-05,1.9e-05,2.7e-05,2.2e-05,1.4e-05,7.6e-05,2.3e-05,3.1e-05,1.4e-05,4.8e-05,2.6e-05,7.5e-05,4.4e-05,1.7e-05,8e-06,3e-05,2.1e-05,3.9e-05,6.4e-05,1.4e-05,3.3e-05,7e-06,2e-05,2.5e-05,4.9e-05,1.9e-05,2.5e-05,3.6e-05,1.4e-05,4.7e-05,4.3e-05,2.3e-05,1.7e-05,1.1e-05,5.6e-05,3.8e-05,1.6e-05,1.9e-05,4.1e-05,1.4e-05,2.8e-05,6.3e-05,1.8e-05,0.000126,1.2e-05,2.5e-05,2.1e-05,6.3e-05,2e-05,2.5e-05,4.2e-05,6.1e-05,2.6e-05,2.3e-05,1.2e-05,3.2e-05,2.2e-05,9e-05,1.7e-05,4.1e-05,3e-05,5.9e-05,7e-05,4.6e-05,3.1e-05,9.9e-05,2.4e-05,2.3e-05,1.9e-05,2.7e-05,6.3e-05,0.000107,2.9e-05,4.6e-05,1.2e-05,4e-06,3e-05,1.3e-05,8e-06,1.5e-05,4.4e-05,2.7e-05,2.3e-05,5.9e-05,2.4e-05,1e-05,3e-05,1.2e-05,2.6e-05,5.1e-05,1.8e-05,4.2e-05,2.1e-05,5.6e-05,3.9e-05,8e-06,2.3e-05,1.7e-05,2.5e-05,4.3e-05,1.6e-05,1.4e-05,2.2e-05,7.9e-05,6e-05,2.7e-05,3.2e-05,1.9e-05,2.7e-05,1.5e-05,3.3e-05,4.3e-05,3.5e-05,6.6e-05,2.2e-05,4e-06,2.2e-05
1.9e-05,5e-05,2e-06,1.5e-05,3.2e-05,1.3e-05,1.2e-05,2.1e-05,2.8e-05,5.9e-05,1.6e-05,2.6e-05,1.6e-05,6.6e-05,1.5e-05,8.3e-05,4.6e-05,3.1e-05,2.4e-05,3.6e-05,2.7e-05,3.2e-05,5.1e-05,2.1e-05,4.5e-05,2.7e-05,2.9e-05,2.8e-05,3.2e-05,3.1e-05,2.1e-05,4.3e-05,6e-06,3e-05,1.2e-05,6e-06,1.6e-05,1.4e-05,5.1e-05,2.7e-05,2e-05,2.7e-05,2.2e-05,1.5e-05,2.4e-05,5.7e-05,1.9e-05,0.000111,1.9e-05,2e-05,1.7e-05,6.4e-05,2.4e-05,1e-05,2.2e-05,3.4e-05,2.4e-05,2.4e-05,8e-06,1e-05,1.2e-05,6.8e-05,1.8e-05,5.4e-05,1.1e-05,3.6e-05,3e-05,2.7e-05,1.1e-05,7.6e-05,1.8e-05,9e-06,2.1e-05,9e-06,3.1e-05,9.5e-05,2.2e-05,3.8e-05,1.1e-05,1.5e-05,6e-06,2.9e-05,8e-06,2.2e-05,4.8e-05,2.3e-05,1.3e-05,4.1e-05,4.9e-05,3.5e-05,1e-05,9e-06,2.9e-05,3.8e-05,3e-06,3.3e-05,1.6e-05,5e-05,2.8e-05,1.2e-05,1.2e-05,2.6e-05,3.1e-05,4.1e-05,7e-06,2.5e-05,1.7e-05,6.9e-05,7.1e-05,2.9e-05,2.4e-05,2.2e-05,6e-06,1.7e-05,2.4e-05,4.1e-05,4.4e-05,5e-05,2.7e-05,1.1e-05,2.7e-05
2.2e-05,6.2e-05,2e-05,3e-05,1.9e-05,1e-06,2.2e-05,2.3e-05,2.4e-05,4.6e-05,4.1e-05,4.4e-05,3e-06,5.2e-05,1.5e-05,9.6e-05,6.7e-05,4e-06,1.5e-05,1.9e-05,1.5e-05,5.2e-05,7.1e-05,1.7e-05,4.5e-05,8e-06,6e-06,2.8e-05,4e-05,3.1e-05,9e-06,3.1e-05,9e-06,1.4e-05,3.9e-05,9e-06,1.2e-05,1.3e-05,4.7e-05,4.2e-05,7e-06,2.1e-05,5.2e-05,3e-05,6.3e-05,7.5e-05,3e-05,9.8e-05,1.2e-05,2.2e-05,1.9e-05,4.6e-05,2.2e-05,2.7e-05,1.4e-05,4.1e-05,2e-05,1.2e-05,8e-06,1.9e-05,1.9e-05,7.4e-05,2.6e-05,5.4e-05,1.1e-05,2.6e-05,4.6e-05,2.3e-05,1.7e-05,6.8e-05,1.2e-05,1.3e-05,1.1e-05,3e-06,5.7e-05,8.9e-05,3.5e-05,4e-05,1.4e-05,2.6e-05,1.7e-05,1.8e-05,7e-06,1.1e-05,4.4e-05,1.6e-05,2.4e-05,4.7e-05,3.7e-05,4e-06,5e-06,5e-06,3.9e-05,3.8e-05,1.1e-05,2.4e-05,2.6e-05,2e-05,2.2e-05,2.2e-05,2.8e-05,1.1e-05,1.5e-05,2.3e-05,2e-05,2.1e-05,1.5e-05,6.2e-05,4e-05,7e-06,2.8e-05,1.9e-05,1.6e-05,4e-06,4.2e-05,3.9e-05,2.3e-05,5.3e-05,3.3e-05,1.9e-05,1.8e-05
2.6e-05,6.8e-05,7e-06,1.7e-05,2.3e-05,1e-05,2.3e-05,1.7e-05,4.4e-05,5.1e-05,1.8e-05,4.4e-05,1e-05,3.9e-05,9e-06,9.7e-05,5.5e-05,1.5e-05,1.4e-05,2.7e-05,1.2e-05,4.4e-05,5.6e-05,2.1e-05,2.2e-05,8e-06,7e-06,3.9e-05,3.8e-05,2.3e-05,2.2e-05,2.4e-05,1.5e-05,3.1e-05,3.1e-05,1.3e-05,1.8e-05,1.3e-05,6.9e-05,2.5e-05,6e-06,1.6e-05,5.7e-05,2.1e-05,4e-05,4.2e-05,1.3e-05,7.9e-05,2.7e-05,1.7e-05,1.3e-05,5.3e-05,1.8e-05,9e-06,2.5e-05,3.9e-05,2.4e-05,1.7e-05,1e-05,2.3e-05,2.7e-05,6.9e-05,1e-05,4.5e-05,8e-06,3.3e-05,5.6e-05,1.8e-05,9e-06,7.5e-05,1.1e-05,8e-06,8e-06,7e-06,4.7e-05,8.1e-05,2.1e-05,4.4e-05,1e-05,2e-05,1.2e-05,3.7e-05,1.5e-05,1.6e-05,4.5e-05,1.9e-05,2.4e-05,5.8e-05,2.7e-05,1.1e-05,1.6e-05,1.3e-05,3.8e-05,3.2e-05,1.9e-05,5.1e-05,9e-06,5.2e-05,3e-05,1.1e-05,2.8e-05,1.3e-05,2.1e-05,3e-05,1.2e-05,2.9e-05,1.3e-05,5.6e-05,7.5e-05,1.2e-05,8e-06,1.4e-05,9e-06,8e-06,3e-05,3.3e-05,4e-05,4e-05,3.3e-05,1.1e-05,2.8e-05
2.2e-05,5.1e-05,1.4e-05,1.9e-05,2.1e-05,7e-06,2.3e-05,6e-06,1.5e-05,5.8e-05,7e-06,2.7e-05,9e-06,5.1e-05,1e-05,8e-05,2.9e-05,1.1e-05,1.7e-05,1.2e-05,1.2e-05,4.5e-05,5.2e-05,3.8e-05,4.5e-05,2e-05,1.8e-05,3.6e-05,5e-05,1.5e-05,2e-05,3.1e-05,1.5e-05,2.9e-05,2.5e-05,1.8e-05,1.1e-05,1.7e-05,4.8e-05,2.7e-05,9e-06,8e-06,3e-05,3.2e-05,4.4e-05,5.9e-05,1.4e-05,7.4e-05,3.7e-05,2.8e-05,1.6e-05,5.5e-05,1.6e-05,2e-05,2.9e-05,3.1e-05,8e-06,5e-06,1.1e-05,2.8e-05,2.6e-05,8.9e-05,2.4e-05,3.3e-05,1.2e-05,3.5e-05,4.6e-05,1.6e-05,1e-05,6.6e-05,2.2e-05,1.6e-05,5e-06,7e-06,4.4e-05,7.7e-05,2.2e-05,3.5e-05,2e-06,1.5e-05,1.7e-05,3e-05,6e-06,1.9e-05,5e-05,1.1e-05,1.6e-05,6e-05,1.3e-05,1.6e-05,1.4e-05,9e-06,4.6e-05,5.2e-05,1.1e-05,4.1e-05,4e-06,4e-05,4.3e-05,1.3e-05,2.6e-05,2.2e-05,1.3e-05,2.4e-05,9e-06,3.3e-05,3.2e-05,5.2e-05,6.3e-05,3e-05,3e-06,1.2e-05,2.8e-05,1.5e-05,3.3e-05,3.9e-05,3.9e-05,3.7e-05,1.6e-05,2.2e-05,2.4e-05
2.2e-05,5e-05,9e-06,1.9e-05,2.6e-05,8e-06,2.4e-05,3e-06,1.8e-05,3.4e-05,2.5e-05,3.3e-05,1.1e-05,4.2e-05,1e-05,8.9e-05,5.1e-05,1.4e-05,1.6e-05,6e-06,1.5e-05,4.6e-05,6.3e-05,2e-05,3.1e-05,2.2e-05,1.2e-05,2.5e-05,4.2e-05,2.9e-05,3e-05,1.1e-05,1.3e-05,4.2e-05,4.6e-05,1.6e-05,2e-05,2.2e-05,6.1e-05,4.4e-05,8e-06,1e-05,2.8e-05,1.2e-05,3.7e-05,5.5e-05,1.1e-05,9.4e-05,1.5e-05,1.8e-05,1.4e-05,5.2e-05,1.2e-05,2.1e-05,1.6e-05,2.5e-05,1.4e-05,1.6e-05,1.4e-05,1e-06,1.8e-05,7.9e-05,1.9e-05,3.5e-05,8e-06,3e-05,4.8e-05,2e-05,1.7e-05,4.6e-05,1.8e-05,1.5e-05,1.3e-05,9e-06,5.2e-05,7.7e-05,4.2e-05,3.8e-05,1.3e-05,7e-06,1.7e-05,2.4e-05,8e-06,1.4e-05,3.5e-05,1.5e-05,1.7e-05,4.8e-05,3e-05,1.1e-05,1e-05,6e-06,3.6e-05,2.3e-05,7e-06,3.7e-05,1.7e-05,4e-05,2.2e-05,1.6e-05,2.2e-05,1.7e-05,1.5e-05,1.1e-05,8e-06,2.9e-05,1.3e-05,6.8e-05,3.1e-05,1e-06,2.4e-05,1.2e-05,2e-05,1.4e-05,4.5e-05,4.1e-05,3.7e-05,2.4e-05,2.3e-05,1.2e-05,1.2e-05
1.8e-05,5.2e-05,7e-06,1.4e-05,2.1e-05,5e-06,2e-05,2e-06,1.2e-05,4.6e-05,2.1e-05,3.2e-05,1.1e-05,3.9e-05,3e-06,9.9e-05,4e-05,1.5e-05,4e-06,1.8e-05,1.5e-05,4.4e-05,6.5e-05,1.7e-05,3.8e-05,1.3e-05,9e-06,2.6e-05,4.2e-05,2.4e-05,8e-06,2.2e-05,6e-06,3.3e-05,4.4e-05,3e-06,1.5e-05,2.1e-05,5e-05,4e-05,7e-06,5e-06,5.7e-05,3e-05,4.6e-05,4.9e-05,1.3e-05,9.9e-05,2.2e-05,9e-06,1.5e-05,4.7e-05,1.9e-05,3e-06,2.3e-05,3.5e-05,2.1e-05,2.1e-05,3e-06,4e-06,1.2e-05,7.4e-05,1.1e-05,4.2e-05,1e-05,2.3e-05,3.6e-05,1.4e-05,7e-06,5.4e-05,1.7e-05,2e-06,2e-06,1e-05,5e-05,7.1e-05,2.5e-05,3.7e-05,1.4e-05,1.6e-05,1.6e-05,1.5e-05,2e-06,5e-06,4e-05,1e-05,2.4e-05,4.9e-05,1.7e-05,6e-06,4e-06,3e-06,1.5e-05,4e-05,6e-06,3.5e-05,1.5e-05,2.9e-05,3.9e-05,1.5e-05,2e-05,2.2e-05,1e-05,1.7e-05,1.1e-05,2.1e-05,9e-06,5.8e-05,4.2e-05,7e-06,1.1e-05,1.8e-05,9e-06,1.7e-05,3.6e-05,4.6e-05,2.2e-05,4.3e-05,3.1e-05,1.3e-05,1.5e-05
2.1e-05,5.1e-05,8e-06,1e-05,2.3e-05,4e-06,2.2e-05,4e-06,1.6e-05,5.1e-05,2.2e-05,3.1e-05,5e-06,3.8e-05,5e-06,9.9e-05,4.2e-05,1.5e-05,8e-06,1.8e-05,1.7e-05,4.3e-05,6.3e-05,1.1e-05,3.5e-05,8e-06,1e-06,2.7e-05,4.4e-05,1.6e-05,7e-06,1.4e-05,3e-06,3.4e-05,3.6e-05,4e-06,1.8e-05,1.4e-05,5.9e-05,3.7e-05,9e-06,7e-06,5.1e-05,7e-06,3.4e-05,5.4e-05,1.1e-05,8.7e-05,1.5e-05,8e-06,9e-06,5.3e-05,1e-05,6e-06,3e-05,2.4e-05,1.4e-05,1.5e-05,7e-06,5e-06,1.9e-05,7.5e-05,8e-06,3.9e-05,5e-06,2.9e-05,4.4e-05,3e-06,7e-06,5.5e-05,1.5e-05,5e-06,7e-06,4e-06,3.7e-05,6.5e-05,2.6e-05,4.3e-05,1.2e-05,8e-06,1.6e-05,2.2e-05,2e-06,8e-06,4.3e-05,3e-06,7e-06,4.5e-05,2.2e-05,7e-06,9e-06,5e-06,2.8e-05,4e-05,5e-06,3.1e-05,3e-06,2.3e-05,2.7e-05,1.2e-05,1.7e-05,1e-05,9e-06,1.9e-05,1.2e-05,3.1e-05,1.2e-05,5.8e-05,4.4e-05,8e-06,2.1e-05,1.3e-05,1.7e-05,7e-06,3.5e-05,4.6e-05,2.1e-05,3.8e-05,3e-05,7e-06,1.8e-05
1.9e-05,5e-05,8e-06,1.3e-05,2.3e-05,8e-06,2.4e-05,4e-06,1.9e-05,4.4e-05,2.3e-05,2.5e-05,3e-06,4e-05,6e-06,9.8e-05,4e-05,1.1e-05,9e-06,1.3e-05,1.8e-05,4.5e-05,6.4e-05,1.5e-05,3.7e-05,6e-06,5e-06,3e-05,4e-05,1.2e-05,3e-06,2e-05,6e-06,3.1e-05,3.9e-05,6e-06,1.7e-05,1.2e-05,5.4e-05,3.6e-05,8e-06,7e-06,4.1e-05,1.8e-05,2.8e-05,5.4e-05,1.8e-05,8.7e-05,1.2e-05,4e-06,7e-06,4.6e-05,1.1e-05,8e-06,2.7e-05,2.4e-05,9e-06,1.3e-05,5e-06,5e-06,1.5e-05,7.3e-05,9e-06,3.7e-05,7e-06,2.7e-05,4.9e-05,5e-06,2e-06,5.3e-05,1e-05,2e-06,8e-06,5e-06,4.2e-05,6.7e-05,2.1e-05,4.1e-05,7e-06,1.1e-05,1.5e-05,1.7e-05,3e-06,6e-06,3.8e-05,5e-06,6e-06,4.5e-05,2.4e-05,7e-06,5e-06,2e-06,2.7e-05,4.1e-05,4e-06,2.9e-05,6e-06,3.1e-05,2.7e-05,1.4e-05,2.2e-05,1.3e-05,1.5e-05,2.4e-05,6e-06,2.4e-05,1e-05,5.6e-05,3.7e-05,3e-06,1.6e-05,2e-05,1.1e-05,2e-06,3.2e-05,3.7e-05,1.4e-05,3.7e-05,2.7e-05,1e-05,1.8e-05
