0.969647,0.994917,1.035179,1.037908,1.001746,1.005418,1.002872,0.994054,1.083128,1.225091,1.204557,1.064134,1.044762,1.036608,0.94884,0.879285,0.792966,0.850149,0.933411,0.887902,0.840989,0.848266,0.860299,0.755678,0.67959,0.717901,0.731658,0.674529
1.157873,1.222098,1.282347,1.259669,1.250416,1.251581,1.228825,1.247542,1.363304,1.548478,1.534311,1.31958,1.269562,1.28003,1.182896,1.08362,0.961418,1.003252,1.094795,1.052009,1.005252,1.021708,1.007553,0.879976,0.820775,0.850703,0.855411,0.825051
1.469601,1.604639,1.723457,1.657195,1.686772,1.681389,1.633149,1.714474,1.863942,2.118964,2.126419,1.772301,1.653999,1.702738,1.594582,1.434881,1.244694,1.248985,1.364318,1.343609,1.289442,1.307874,1.232004,1.070596,1.056771,1.067729,1.056681,1.086106
1.683501,1.868896,2.077518,1.97542,2.019086,2.027259,1.972093,2.099972,2.23657,2.545034,2.605302,2.13304,1.938292,2.027101,1.900412,1.667453,1.438526,1.420582,1.57271,1.59551,1.512315,1.485937,1.340695,1.182228,1.229099,1.217874,1.189643,1.280166
1.69791,1.875111,2.150645,2.048677,2.063356,2.091895,2.032206,2.129959,2.203805,2.528684,2.675905,2.231133,1.990544,2.05004,1.910266,1.65359,1.435101,1.429729,1.619218,1.668441,1.547038,1.46823,1.29598,1.160112,1.242589,1.22622,1.186494,1.308145
1.462473,1.582754,1.833744,1.763402,1.725953,1.757911,1.71489,1.741705,1.77564,2.053399,2.239653,1.993828,1.780363,1.742243,1.630381,1.45506,1.298051,1.311442,1.47924,1.505872,1.362699,1.267624,1.151773,1.061192,1.123462,1.106012,1.061533,1.143921
1.290971,1.289951,1.381119,1.319334,1.257155,1.319039,1.3587,1.357152,1.379176,1.529978,1.680958,1.709863,1.581041,1.454546,1.428442,1.446429,1.416014,1.396314,1.447167,1.445705,1.302419,1.15548,1.131882,1.105322,1.078093,1.048561,0.996126,1.004648
1.559301,1.444582,1.447433,1.345197,1.254313,1.41532,1.589101,1.540446,1.486881,1.545796,1.718634,1.984703,1.863519,1.6277,1.645332,1.87122,2.025803,1.947414,1.924528,1.949627,1.757203,1.479366,1.526361,1.546645,1.386124,1.331203,1.292246,1.251777
2.120686,1.951413,1.958975,1.794092,1.733022,2.053984,2.324466,2.157914,1.994426,2.088384,2.415283,2.883656,2.634008,2.202825,2.225783,2.614157,2.948356,2.822384,2.687894,2.713336,2.459954,2.042651,2.173522,2.280443,1.998213,1.909309,1.872126,1.752296
2.675134,2.452043,2.479037,2.257614,2.295274,2.78722,3.069173,2.764689,2.562516,2.711625,3.228473,3.906637,3.514457,2.885406,2.862455,3.31617,3.793938,3.696045,3.421922,3.421211,3.157014,2.590817,2.791666,3.008427,2.633985,2.525145,2.481404,2.270697
3.092047,2.806643,2.785907,2.508609,2.67057,3.252449,3.458369,3.087665,2.919382,3.059321,3.70602,4.539817,4.10956,3.408096,3.291946,3.719177,4.283946,4.293867,3.908351,3.778377,3.57036,2.999333,3.242949,3.466413,3.023842,2.929214,2.882956,2.624326
3.309041,2.893254,2.775764,2.47698,2.677341,3.227185,3.381298,3.108376,2.966181,2.945587,3.531572,4.4023,4.106324,3.571765,3.478262,3.850325,4.409486,4.47847,3.996169,3.680917,3.662582,3.288683,3.39626,3.464077,3.001862,2.947061,3.000746,2.780728
3.23402,2.594398,2.39022,2.210452,2.483124,2.947144,3.056422,2.930208,2.725196,2.466997,2.876705,3.688349,3.585841,3.430871,3.585735,3.793033,4.263489,4.410889,3.854701,3.447797,3.70266,3.518783,3.278301,3.099885,2.706392,2.727438,2.924871,2.718835
2.912401,2.200729,1.961681,1.915651,2.295488,2.641719,2.617674,2.554578,2.325295,1.986402,2.292662,3.0402,3.019215,3.138942,3.603013,3.674495,4.010263,4.194026,3.689727,3.368472,3.678497,3.512312,3.110693,2.817425,2.49473,2.487945,2.647756,2.419245
2.655505,2.013189,1.808726,1.833906,2.174934,2.349945,2.183942,2.116605,2.033224,1.851477,2.072649,2.730887,2.784167,3.009171,3.594022,3.657974,3.78452,3.760071,3.421622,3.186892,3.228073,3.091246,2.783214,2.472726,2.22681,2.226307,2.247854,2.015395
2.942909,2.25345,2.010121,2.134528,2.453274,2.538386,2.381378,2.31505,2.357841,2.352919,2.38136,2.875062,3.069934,3.402706,4.144175,4.325858,4.016544,3.451601,3.301842,3.260036,2.93667,2.930596,2.788252,2.261477,2.038549,2.129258,2.045995,1.873357
3.780646,3.098215,2.780962,2.866332,3.191686,3.268418,3.132202,3.054637,3.133319,3.212789,3.079925,3.396715,3.733145,4.317529,5.612442,5.80965,4.778521,3.807295,3.762425,4.033636,3.56057,3.638838,3.54821,2.582343,2.354461,2.632332,2.468412,2.322604
4.922605,4.543544,4.131738,3.806431,3.881688,4.066909,4.241317,4.162604,4.1806,4.260549,4.02667,4.264662,4.715338,5.616087,7.753918,7.836538,5.658625,4.333762,4.432708,5.114679,4.526431,4.390201,4.432098,3.336775,3.233058,3.605729,3.230142,3.054237
6.56455,6.504282,6.052819,5.020216,4.435957,4.841763,5.802275,5.839764,5.722579,5.744734,5.417069,5.797975,6.281577,7.636087,10.870077,10.668984,7.155092,5.182305,5.110143,6.124772,5.550147,4.921066,5.036015,4.23967,4.35182,4.895367,4.374129,3.979343
8.089499,8.229273,7.842645,6.261724,5.121889,5.936489,7.851489,7.879491,7.577196,7.505909,6.977585,7.608275,8.001025,9.737608,14.015741,13.891319,9.473012,6.56413,5.898554,6.752544,6.539174,5.600182,5.369708,5.009781,5.323098,6.14549,5.824915,5.070721
8.159699,8.452183,8.340338,6.7931,5.698897,7.027559,9.475129,9.244748,8.665569,8.328335,7.665427,8.619955,8.870739,10.547802,14.922404,15.25971,11.029683,7.359764,6.355094,7.023787,7.122059,5.9719,5.256955,5.463114,5.983763,6.997881,6.934116,5.701255
6.798924,7.067891,7.312046,6.198547,5.641321,7.53631,9.66938,8.964742,8.153469,7.390823,6.742595,7.973989,8.291238,9.295096,12.334859,13.372675,10.722062,6.924352,6.078234,6.817437,6.75326,5.534259,4.880108,5.597219,6.113726,7.17586,7.13637,5.440824
5.785437,6.108014,6.214824,5.169747,5.251492,7.306057,8.285534,6.905567,6.035847,5.520084,5.376223,6.654213,7.082691,7.016437,8.083318,9.405913,8.585425,5.711011,5.068558,5.611676,5.374148,4.703815,4.645933,5.281401,5.400634,6.175796,5.989466,4.45599
4.588255,5.038131,5.232206,4.489637,4.978115,6.441215,6.214033,4.603575,3.90512,4.163491,4.829951,5.897061,5.940713,5.331912,5.312699,5.894435,6.103896,4.88085,4.066135,3.941101,3.718745,3.624592,3.952996,4.331195,4.338508,4.632558,4.329935,3.356921
3.186876,3.702144,4.082324,3.768228,4.241,4.633507,3.776269,2.84822,2.779716,3.288423,3.892696,4.496683,4.387503,3.925361,3.663297,3.783351,4.443457,4.433315,3.735656,3.171178,2.967271,3.131752,3.053665,2.960224,3.235921,3.432458,3.391805,2.94785
2.253531,2.465198,2.585361,2.62135,2.937665,2.731733,2.118637,1.823657,2.117995,2.557017,2.675491,2.919382,3.1117,3.010956,3.183944,3.752428,4.129812,4.08791,3.702093,3.247971,3.23102,3.243974,2.406357,1.941028,2.30653,2.623187,3.145941,3.135684
1.859585,1.985954,1.65401,1.641971,1.873694,1.667364,1.564772,1.586351,1.829258,2.106098,1.932167,1.939709,2.284968,2.37134,2.761661,3.442781,3.496528,3.293065,3.041954,2.840495,3.24193,3.143679,2.066513,1.631683,1.792557,2.042139,2.962994,3.114528
1.653989,1.975914,1.53708,1.357378,1.392312,1.205729,1.22426,1.337933,1.512748,1.719904,1.538267,1.290537,1.450323,1.649146,2.043841,2.487783,2.459381,2.33223,2.075672,2.026045,2.783096,2.703163,1.632369,1.306023,1.420728,1.569759,2.490977,2.64924
1.410046,1.803098,1.440824,1.241674,1.20317,0.957916,0.908738,0.989642,1.135652,1.332338,1.375882,1.141344,0.961582,1.0572,1.498582,1.675822,1.61682,1.647982,1.435243,1.515538,2.206472,2.088617,1.213752,0.914837,1.087739,1.234641,1.92363,2.055477
1.045753,1.311328,1.127187,1.102812,1.08376,0.70736,0.579271,0.694494,0.823292,0.938464,1.127294,1.098806,0.842354,0.815525,1.295214,1.382154,1.155202,1.236324,1.078436,1.134656,1.492586,1.403805,1.003486,0.748249,0.837268,0.931573,1.265119,1.364974
0.737848,0.791711,0.704907,0.829256,0.91356,0.536741,0.353671,0.48637,0.578058,0.658389,0.838515,0.897674,0.751863,0.761279,1.149047,1.189143,0.861409,0.876903,0.813628,0.892043,0.971879,0.928004,0.873435,0.670934,0.690932,0.73221,0.703422,0.693354
0.623542,0.532795,0.420013,0.531909,0.688107,0.444171,0.239343,0.331688,0.43619,0.536978,0.666208,0.728594,0.696288,0.721439,0.892882,0.848983,0.61795,0.588015,0.558765,0.699058,0.728415,0.658306,0.672014,0.533984,0.570169,0.611917,0.408419,0.342738
0.576984,0.444494,0.302754,0.317307,0.491875,0.399317,0.234834,0.293485,0.384504,0.453546,0.584843,0.645337,0.646838,0.605034,0.576323,0.595955,0.517824,0.425378,0.408052,0.508111,0.504339,0.425219,0.416697,0.377742,0.456735,0.487673,0.348115,0.312574
0.511438,0.419898,0.262715,0.243656,0.374498,0.340207,0.236148,0.290084,0.34614,0.339622,0.450957,0.509086,0.526492,0.445295,0.398886,0.534399,0.48515,0.416358,0.409164,0.401005,0.334653,0.263595,0.288942,0.341325,0.419563,0.366273,0.287689,0.296575
0.417055,0.36768,0.259269,0.218286,0.254751,0.259496,0.266263,0.330513,0.342824,0.27921,0.336504,0.423995,0.448559,0.352216,0.377966,0.530852,0.422062,0.414205,0.446331,0.406034,0.289817,0.198746,0.306795,0.398887,0.390068,0.279061,0.225431,0.262323
0.342595,0.325222,0.2869,0.218947,0.185236,0.221735,0.319968,0.361224,0.324961,0.265012,0.298095,0.382424,0.422126,0.339712,0.352013,0.511739,0.41926,0.432777,0.486721,0.443693,0.305046,0.169549,0.312934,0.434333,0.386431,0.248061,0.154941,0.202759
0.289698,0.328687,0.337691,0.254345,0.210119,0.226673,0.347343,0.374252,0.319653,0.263808,0.260627,0.299919,0.371265,0.362919,0.320694,0.457327,0.424647,0.415696,0.464437,0.422742,0.291175,0.150219,0.284813,0.390825,0.354736,0.257791,0.125359,0.151616
0.302457,0.343198,0.372239,0.310896,0.251588,0.205987,0.320737,0.356096,0.313769,0.275792,0.248756,0.237104,0.298541,0.362735,0.297889,0.36861,0.374292,0.367425,0.39143,0.3487,0.261816,0.140409,0.224529,0.285768,0.28379,0.257706,0.135481,0.148707
0.298025,0.319154,0.354734,0.349147,0.305592,0.201044,0.251149,0.287448,0.272493,0.281313,0.249869,0.207114,0.243941,0.337642,0.300248,0.291813,0.300204,0.356328,0.355255,0.305205,0.255376,0.156285,0.157335,0.202112,0.249259,0.227681,0.13459,0.152322
0.247851,0.246122,0.280083,0.334973,0.346166,0.24021,0.19629,0.221511,0.245098,0.251773,0.220589,0.199491,0.253711,0.340072,0.32307,0.286336,0.265627,0.337399,0.320337,0.27472,0.262909,0.197901,0.120939,0.155693,0.214521,0.170916,0.117625,0.156052
