-0.001587,-0.000737,-0.000849,-0.000822,-0.000861,-0.001015,-0.001363,-0.001043,-0.000669,-0.000423,-0.000764,-0.000688,0.000119,-0.000749,-0.000599,-0.000375,-0.001116,-0.000783,-0.001198,-0.001183,-0.000606,-0.000869,-0.000565,-0.001104,-0.000288,-0.00031,-0.000299,-0.000236,-9e-06,3.2e-05,-0.000593,-0.000328,-0.000984,-0.000479,-0.000266,-0.000552,-0.001469,-0.000803,-0.000328,-0.000119,-0.00089,-0.000743,-0.00094,-0.000758,-0.00037,-0.000761,-0.000137,-0.000181,-0.000599,-0.000948,-0.000815,-1e-06,-0.000525,-0.000546,-0.000259,-0.000557,-0.000543,-0.000528,-0.001857,-0.001304,-0.001118,-0.001018,-0.000824,-0.000461,-0.000164,-0.000528,-0.000963,-0.000575,-0.000976,-0.000873,-0.001052,-0.000424,-0.000847,-0.000878,-0.000745,-0.000493,-0.000555,-0.00022,-0.000512,-0.000475,-0.001046,-0.000194,-0.000418,-0.000385,-0.000943,-0.000385,-0.001041,-0.000693,-0.000381,-0.00049,-0.000381,-0.000241,-0.000245,-0.001062,-0.000754,-0.000411,-0.000429,-0.00071,-0.000488,-0.000339,-0.000315,-7.7e-05,-0.001726,-0.001402,-0.000727,-0.000554,-0.000241,-0.000881,-0.000507,-0.000751,-0.000688,-0.000394,-0.000952,-0.000568,-3.7e-05,-0.000499,-0.000462,-0.000392,-0.000458,-0.000636,-0.000846
-6.8e-05,-0.000156,-0.000214,-0.000443,-0.000463,0.000268,0.000196,-0.000216,0.000123,0.000173,-0.000235,-7.4e-05,-0.000606,-0.000185,-0.000428,-0.000243,-0.00015,-0.00017,-0.000365,0.000271,-0.000123,0.000138,0.000446,0.000256,-0.000286,4.2e-05,9.6e-05,-0.000488,-0.000306,-0.000581,-0.000151,0.000311,-5.7e-05,-2e-05,0.000272,-0.000258,0.000361,-0.000132,7e-06,-4.1e-05,0.000393,2.5e-05,0.000172,0.000144,-1e-06,0.000182,0.00012,-0.000332,0.000546,-0.000136,2e-06,-0.000325,-0.000162,-3e-04,1.5e-05,0.000195,0.000214,-0.000723,0.000955,0.000411,0.000441,0.000352,-9.1e-05,0.000107,-0.000641,-0.000322,0.000135,0.000268,0.000267,0.000672,0.000126,0.00013,0.000383,7e-05,-0.000175,-7e-06,-6.7e-05,-0.000102,0.000336,-0.00019,0.000113,0.000234,-0.000222,-5.1e-05,2.5e-05,-0.000106,0.000123,0.000115,-0.000588,-0.000162,-5.1e-05,-9.9e-05,0.000185,0.000479,0.000476,2.3e-05,-0.000155,-8.8e-05,-0.000469,-8.7e-05,0.000145,0.000309,0.001246,0.000782,0.000301,0.000216,0.000141,0.000442,-0.000109,0.000102,-0.000258,-0.000259,8e-05,-0.000188,-2.6e-05,2.8e-05,0.00021,0.000156,0.000332,0.000359,9.7e-05
-5.5e-05,0.000549,-0.000595,0.00049,-0.000416,-0.000707,-0.000124,-0.000251,-0.00029,-0.000559,-0.000811,-0.000765,-0.000511,-0.000633,-5e-06,-0.000508,-0.000218,0.000101,0.000158,-0.000213,-0.000717,6.5e-05,-0.000578,-0.000435,-0.000921,-0.000783,5e-06,0.000178,6e-05,-0.000242,-0.000329,-0.00021,-0.000458,-0.000223,-0.00021,-0.000346,9.4e-05,-0.000408,-0.000236,0.000244,-0.000512,-0.000119,-0.000774,-0.000145,-5.5e-05,-0.000453,-0.000876,-0.000242,-0.000419,-0.000743,-0.000288,-0.000151,-0.000129,-0.000522,-0.001001,-0.000549,6.9e-05,0.000116,-0.000881,-0.000837,-0.000402,-0.000435,0.000244,0.000221,0.000188,4.1e-05,-0.000262,-0.000328,0.000266,-0.000532,-1.4e-05,0.000183,7e-06,-0.000183,-0.000263,-0.000119,-9.5e-05,-0.000326,-0.00039,-6.6e-05,0.000278,0.000102,0.000156,-8e-06,-1e-04,-0.000235,-0.000185,0.000154,-0.000272,-0.000319,-0.00015,-0.000384,-8.7e-05,-0.00055,-0.00058,-0.000482,5.5e-05,3.2e-05,-0.000207,-0.000325,-6.3e-05,0.000105,-0.001182,-0.000395,-0.000433,-0.00035,-0.00015,-0.000271,-0.000149,-0.000181,-0.00023,6.8e-05,-7.5e-05,-0.000299,-0.000213,-0.000159,-0.000249,-0.000181,-0.000681,-0.000256,0.00011
-0.000109,-0.00072,0.000143,-0.000184,0.000343,0.000198,-2.1e-05,-0.00021,-0.000524,0.000198,-0.000181,-0.000253,-6.5e-05,-8.2e-05,-0.000164,-0.000343,-3.9e-05,7.8e-05,-3.2e-05,-0.000185,0.000161,-0.000456,-0.000286,0.000263,0.000193,-0.000197,-0.000265,-0.000546,-0.000156,-0.000251,-0.000153,-0.000168,-0.000581,-0.000446,0.000179,-0.000192,-6e-05,0.000108,-7.6e-05,-0.000313,0.000104,0.000196,0.000172,0.000191,-0.000512,7.2e-05,0.000179,-0.000144,-3e-05,0.000101,-0.000205,-7e-06,0.000112,1.8e-05,0.000378,-0.000195,-0.000641,-0.00044,-8.3e-05,0.000569,2.4e-05,0.000168,-0.000183,-4.2e-05,-0.000529,-0.000407,0.000243,-8.6e-05,-0.000219,0.000252,0.000263,0.000223,2.2e-05,0.000215,-0.000131,-0.000226,-0.000376,6.4e-05,-0.000146,-8e-05,-0.000287,-0.000533,-0.000744,-0.000385,-2.2e-05,0.000164,-0.000256,-0.000542,-0.000275,-0.000263,6.7e-05,0.00024,0.000127,5e-06,0.000116,-0.00016,-0.00041,-0.000436,-0.000107,-0.000221,-0.000214,-8.9e-05,1.4e-05,-3.7e-05,-0.000271,-9.6e-05,-0.00022,1.9e-05,0.000375,0.000264,-0.000201,-0.000216,1.3e-05,7e-05,-4.1e-05,0.00011,-4.5e-05,-0.000255,0.000303,0.000185,-0.000195
-0.000148,0.000429,-0.000281,1.3e-05,-0.000182,-0.000306,-0.00023,0.000186,0.000516,5.3e-05,-1.7e-05,0.000369,0.000568,0.00017,0.000169,0.000336,0.000289,-6.1e-05,0.000168,0.000102,2e-04,0.000215,4.5e-05,-0.000421,5.1e-05,3e-04,0.000152,-0.000229,0.000227,0.00036,5e-05,-0.000372,0.000533,0.000149,-5.5e-05,0.000453,-0.000203,0.000348,0.000116,-0.000129,-0.000115,-0.000251,-0.000433,-0.000366,0.000456,0.000346,9.2e-05,-4.6e-05,8.1e-05,0.000272,6.9e-05,-0.000203,-0.000259,0.000294,0.000391,0.000284,0.000433,0.00045,-9.9e-05,-0.00018,0.000424,-3e-06,7.4e-05,3.1e-05,7.3e-05,-0.000253,-0.000292,-0.000422,-1e-06,-0.000567,-7e-05,-0.000252,0.000219,0.000206,0.000361,0.000521,0.000177,6.7e-05,0.000124,-3.8e-05,7.9e-05,-8.1e-05,0.000172,0.000149,-9e-06,-9.9e-05,8.8e-05,0.000281,0.000113,0.000257,-5e-05,-0.000162,1.8e-05,-0.000289,-0.000312,-4.3e-05,-6.6e-05,0.000369,0.000455,0.000345,-0.000166,-0.000273,-0.000183,6e-05,0.00025,0.000346,-0.000215,-7e-05,-0.000119,-0.00051,-0.000133,-0.000269,2.9e-05,-2.8e-05,-8.7e-05,-7.7e-05,-0.00016,-9e-05,-7.4e-05,0.000275,0.000272
-1.3e-05,8.6e-05,8.6e-05,0.00014,1.8e-05,9.1e-05,0.000285,0.000253,3.1e-05,0.000379,0.000524,0.000165,3.3e-05,3.3e-05,-6.6e-05,0.000185,0.000417,-1.2e-05,0.000105,0.000171,8e-06,0.000144,-0.00012,0.000185,-0.000218,0.000126,-0.000109,-0.000124,-6.5e-05,-0.000196,-3.2e-05,-0.000233,6e-05,0.000145,-2.1e-05,-0.000229,0.000193,-0.000411,-0.000564,-0.000162,-2e-05,0.000209,0.000495,0.000146,0.000204,6.9e-05,4.3e-05,6.7e-05,-2.1e-05,8.3e-05,9.3e-05,7.8e-05,-0.000184,-2e-04,2e-06,7.7e-05,-1.8e-05,-0.000215,2.4e-05,-0.000117,-0.000278,-0.000308,-9.7e-05,-0.000241,4.2e-05,0.000315,0.00019,0.000235,3.9e-05,0.000137,2.1e-05,0.000274,-0.00016,-0.000243,-0.000114,-0.000218,-0.000285,9e-05,-0.000131,1.6e-05,-0.000192,-0.000209,-7.3e-05,-0.000217,2e-06,-0.000103,-5e-06,-0.000123,-1.4e-05,-1.1e-05,0.000222,0.000151,-6.5e-05,9.6e-05,-2e-06,4.1e-05,0.000154,-7.7e-05,-0.000259,-0.000132,-0.000114,2.8e-05,-1e-06,-0.000456,-0.000278,-0.000181,7.8e-05,-0.000118,-0.000105,4e-05,0.000154,0.000291,8.9e-05,0.00012,-2e-05,9e-05,7e-05,0.000122,-0.000235,-0.000534,-0.000249
-0.000215,-0.000504,6.7e-05,1.5e-05,0.000116,0.000152,-5.6e-05,-0.000173,-6.1e-05,-0.000668,-0.000187,0.000194,-0.000389,7.5e-05,-0.000177,-2.1e-05,-0.000106,0.000108,-2.5e-05,-0.000169,0.000189,9.3e-05,-6e-06,-0.000158,2.2e-05,0.000145,-7e-06,0.00012,-0.000134,-2.3e-05,0.00024,0.000391,2e-04,-1.2e-05,-0.000163,0.000114,-7.3e-05,0.000247,0.000103,-0.000111,-2.3e-05,-0.000284,-3e-06,-0.000322,-0.000123,1.8e-05,-0.000119,-8.3e-05,-0.000213,-0.000149,-0.00016,-5.2e-05,-4.9e-05,1e-05,-0.000313,0.000111,2.4e-05,0.000166,0.000462,-2.2e-05,5.1e-05,6.2e-05,0.000166,0.000117,-7.3e-05,0.000128,1.8e-05,3e-05,-0.000233,-3.4e-05,1.9e-05,-0.00029,-0.000347,0.000168,-0.000327,-5.6e-05,0.000107,-5.5e-05,7e-05,5.7e-05,1e-05,0.000157,0.000111,0.000251,9.6e-05,-2e-04,0.00019,-5.4e-05,5.6e-05,0.000114,3.5e-05,-0.000147,9.2e-05,-6.6e-05,-0.00014,-8.3e-05,0.000168,0.000146,9.1e-05,-1.7e-05,-0.000158,-0.000344,0.000137,0.000497,0.000128,-0.000159,8.8e-05,-0.000197,7e-06,-1.8e-05,-8.1e-05,-1.7e-05,5e-06,-0.000131,0.00015,-3e-05,-8.1e-05,0.000138,0.000102,0.000137,-0.000116
0.000214,-0.000265,-0.000266,-0.000406,-2.9e-05,0.000158,-3.1e-05,-1e-06,-0.000172,-0.000155,-4.8e-05,-9.3e-05,0.00019,-0.000232,-0.000137,-0.000271,-0.000115,-6.7e-05,-0.000206,-0.000121,-2e-04,-0.000246,0.000323,0.000231,-4e-05,-6.8e-05,0.000119,4.4e-05,2.8e-05,-1e-06,-0.000138,-1.9e-05,-0.000206,-0.000238,6.6e-05,-5.4e-05,7e-06,8e-05,0.000127,6.1e-05,2.3e-05,1e-05,-9.2e-05,0.000149,-9.6e-05,-0.000121,-0.000121,0.00014,0.000151,7e-05,-3.2e-05,-0.000133,0.00019,5.7e-05,6.6e-05,-0.000273,-0.000143,-0.000159,-0.000327,-0.000231,-0.000144,4.1e-05,-0.000112,3.6e-05,-4e-05,-0.000149,2.8e-05,-0.000145,0.000131,0.00018,-0.000196,-0.000147,7.6e-05,-0.000167,0.000238,7.3e-05,0.00018,-0.000128,-6.9e-05,0.000128,0.000131,3.8e-05,0.000136,0.000141,3.3e-05,0.000132,5.2e-05,-0.000199,-0.000131,1e-06,-1e-05,-1.4e-05,-0.00021,2e-05,0.000129,0.000238,0.000161,0,-0.000118,9.8e-05,6.2e-05,-1.5e-05,0.000178,-0.000376,-0.000137,-1.5e-05,-2.1e-05,0.000281,7.4e-05,0.000162,0.000255,5.1e-05,-7.3e-05,3.3e-05,0.00011,6.2e-05,2.1e-05,-3.2e-05,-5.8e-05,-0.000247,-8.9e-05
-1e-05,0.000416,0.000371,0.000101,3e-06,-0.000347,-1.8e-05,0.000327,6e-06,-2.7e-05,-1e-06,-0.000374,-0.000296,8.2e-05,0.000123,0.000204,-0.000263,-0.000119,-0.000177,0.000151,0.000155,9.6e-05,-2.5e-05,0.000167,0.000249,-0.000197,-0.000138,-4.5e-05,-0.000156,5.7e-05,1.9e-05,6.8e-05,5.5e-05,0.00022,-0.000219,0.000173,0.000214,-1.7e-05,2.4e-05,0.000171,0.000167,3.9e-05,-3e-06,-9e-05,6.8e-05,-1.3e-05,-4.5e-05,0.000189,-0.000145,-2e-05,0.000233,-3.6e-05,-0.000103,-5.4e-05,-1e-05,0.000218,-0.000162,2.3e-05,0.00019,0.000271,0.000271,-2.4e-05,-3.4e-05,-0.000105,-2.7e-05,0.000114,-4.4e-05,-0.000123,0.000121,-0.000139,-7.7e-05,1.4e-05,1.7e-05,-6.6e-05,9.2e-05,4.1e-05,-4.5e-05,-1.5e-05,8e-05,-1.4e-05,-8.4e-05,-0.000243,-8.4e-05,-6.3e-05,0.000149,-8.2e-05,-0.000116,0.000245,0.000233,-4.9e-05,-5e-05,-1.3e-05,-1e-04,-5.9e-05,0.000136,-0.000152,-0.000168,-6.1e-05,8.8e-05,-0.000226,0.000108,0.000215,-6.4e-05,0.000216,9.8e-05,-9.5e-05,-1.7e-05,-5e-06,-5e-05,3.6e-05,-0.000133,-1e-05,4.3e-05,3e-06,-0.000214,-6.4e-05,2.2e-05,3.6e-05,9.3e-05,9.1e-05,-3.6e-05
0.000142,5.6e-05,-5.8e-05,2.5e-05,-8.5e-05,7.2e-05,7.1e-05,-0.000326,4.1e-05,9.1e-05,0.000341,0.000108,0.000272,5.5e-05,0.000196,-8e-06,6.6e-05,-9.1e-05,0.000215,5e-06,-6.7e-05,-0.000156,-4.6e-05,-0.000173,2.5e-05,0.000222,8.8e-05,0.000175,-1e-05,0.000196,-5.2e-05,-8.7e-05,-0.000215,-0.000111,-4.2e-05,-8.2e-05,-0.000326,-0.000176,8e-05,-2.1e-05,-0.00018,3e-06,3.7e-05,0.000112,-3.1e-05,-6.9e-05,0.000118,-0.000137,-7.3e-05,-2e-06,-6.8e-05,0,-1.9e-05,-0.000178,1.1e-05,-0.000112,0.00011,-2e-06,-0.000148,0.00012,-0.00018,3.1e-05,0.000124,1e-04,0.00013,-4e-05,-0.000129,0.000152,9e-05,7.8e-05,5.2e-05,0.000147,4.9e-05,-6.7e-05,-5.4e-05,8e-06,2.8e-05,-3.9e-05,-8.4e-05,-2.6e-05,-6e-05,0.000194,0.000131,-0.000122,-9.7e-05,9e-05,3.5e-05,1e-06,-0.000108,-5e-06,-0.000143,-4e-05,4e-06,4.1e-05,7e-05,0.000254,-0.000106,-8.1e-05,6.8e-05,8.4e-05,8.8e-05,0.00013,5.8e-05,3e-05,0.000117,0.000188,-2.2e-05,-4.3e-05,0,4.6e-05,1.4e-05,-3.7e-05,1.7e-05,-2.4e-05,3.8e-05,-1.1e-05,4.1e-05,-8.3e-05,-4e-06,-5.9e-05,0.00014
1e-05,-5.6e-05,-8e-05,2e-05,0.000125,0.000143,-2.1e-05,0.000241,-0.000113,0.000119,-0.000159,0.000172,-7e-05,-9.1e-05,-7.2e-05,-0.000182,-3.5e-05,7.6e-05,7.6e-05,5e-05,5.3e-05,0.00011,-1.4e-05,2.5e-05,-4.7e-05,-0.000118,-1.1e-05,3e-06,1.6e-05,-4.9e-05,-6e-05,7.5e-05,-2.8e-05,-2.6e-05,8.6e-05,4.4e-05,3.5e-05,1.2e-05,-2e-05,-5.9e-05,9.5e-05,3.5e-05,6e-05,0.000163,2.4e-05,0.000168,7e-06,-1.5e-05,9.1e-05,-3.6e-05,-9.5e-05,0.000171,9.5e-05,-1.7e-05,-5e-05,7.2e-05,0.000102,-1.1e-05,3.2e-05,-0.000107,-0.000107,-8.7e-05,-7.4e-05,-8.2e-05,-3e-05,3.1e-05,9e-06,4e-06,1e-05,-6.6e-05,5.2e-05,-9.5e-05,-4.8e-05,8e-05,0.000119,-1.5e-05,-0.000164,4e-06,5.3e-05,-1.6e-05,-8.4e-05,6.6e-05,-3.5e-05,-4.8e-05,-0.000105,-1.8e-05,-4.9e-05,6.6e-05,8.7e-05,7.2e-05,-0.000106,3e-05,0.000176,0.000116,-0.000107,-0.000153,-9e-06,9.7e-05,-3.6e-05,-3e-06,-0.000183,8e-06,-0.000103,5.3e-05,-9.8e-05,-4.8e-05,6.5e-05,0.00012,-3.1e-05,-0.000166,9.3e-05,4.1e-05,6.3e-05,8.3e-05,1.8e-05,3.3e-05,1.8e-05,2.5e-05,-4e-06,4e-05,-8e-05
-0.000123,0.000132,0.000106,-9e-06,-0.000197,2.3e-05,2e-06,-0.000126,-1e-06,9e-06,7.1e-05,2.9e-05,0.000129,0.000149,-2.3e-05,7.9e-05,0.000176,6.3e-05,-9.8e-05,-6e-06,-5.6e-05,-6.8e-05,2.1e-05,6.1e-05,-0.000128,-3.2e-05,-1.3e-05,-3.2e-05,0.00012,-2.4e-05,4.2e-05,-9.3e-05,0,4.4e-05,0.000139,-2.5e-05,-1.4e-05,-3.3e-05,-6.1e-05,0.00011,3.2e-05,0.000117,-6.2e-05,-5.6e-05,-0.000128,-6.7e-05,3.2e-05,1.5e-05,0.000142,7.8e-05,3.9e-05,-2.1e-05,-9e-05,0.00015,6e-05,-3e-05,2.1e-05,0.000132,1.5e-05,8.3e-05,0.000125,7.5e-05,-5.1e-05,2.1e-05,-9.3e-05,2.6e-05,7.2e-05,8.2e-05,6e-06,-0.000111,3e-06,-7.9e-05,4.4e-05,4.4e-05,-4.4e-05,-5.5e-05,5e-05,7.5e-05,4.3e-05,1.8e-05,3.1e-05,-2e-06,-1e-06,-7e-06,2.6e-05,0.000113,0.000111,-0.000111,6.4e-05,-0.000103,2.6e-05,1.9e-05,-0.00011,-4.9e-05,-5.7e-05,3.1e-05,2.6e-05,-4.3e-05,4.6e-05,-1e-05,6e-05,-4.1e-05,-3.8e-05,-0.000103,9.9e-05,4.7e-05,5.1e-05,-6.5e-05,0.00011,9.6e-05,-1.8e-05,-1.4e-05,-5.3e-05,-3e-05,1.8e-05,-4.7e-05,3.9e-05,-2.9e-05,-3.8e-05,2e-05,4.2e-05
2e-05,-1.7e-05,-5.9e-05,3.8e-05,4.3e-05,-7e-05,1e-05,0.000102,8e-06,-1e-06,-0.000124,-6.6e-05,-0.000151,-7.9e-05,-9.4e-05,-0.000103,-0.000189,-2.3e-05,-4.1e-05,-6.9e-05,-2.2e-05,-5e-06,0.000103,-0.000101,6.2e-05,-0.000149,-4.4e-05,-6.5e-05,2e-06,4.7e-05,-5.3e-05,-1.2e-05,1.9e-05,1e-06,5.1e-05,2.3e-05,3.2e-05,8e-05,-5.1e-05,3.2e-05,-2e-05,-4.6e-05,-2.2e-05,-0.000112,-5.8e-05,2.6e-05,-1.7e-05,4.6e-05,1.1e-05,-8.7e-05,2.7e-05,-3.4e-05,6.9e-05,1.4e-05,-4e-05,-2.2e-05,-3.8e-05,-5.3e-05,-5.7e-05,-0.000174,-0.000189,-2e-05,2.8e-05,-6.9e-05,7e-05,-5.3e-05,5.9e-05,2e-06,-0.000116,9.8e-05,-3.1e-05,0.00013,3.9e-05,-1.2e-05,-4e-06,2.2e-05,6.2e-05,1.6e-05,-7e-05,0,2e-05,4e-06,7.1e-05,9e-06,4.7e-05,-5.4e-05,-0.000105,-5.9e-05,-1e-04,3.7e-05,0.000142,3.4e-05,6.5e-05,3e-05,7.5e-05,-6.6e-05,-3e-05,-6e-06,-3.9e-05,-2.9e-05,-5e-05,-9e-06,-7e-06,7.8e-05,-8e-05,-2e-06,4.9e-05,3e-05,-5.8e-05,-7.6e-05,-6.3e-05,-1.4e-05,-5.2e-05,5e-06,-2.7e-05,2e-05,-2e-05,-3.1e-05,-2.4e-05,2.2e-05,-2.4e-05
-1.3e-05,-7.1e-05,-5.1e-05,4.6e-05,2.9e-05,-3.8e-05,2e-06,-0.000153,4.4e-05,-0.000127,-5.3e-05,3.6e-05,-4.2e-05,2.5e-05,5.4e-05,5.3e-05,0.000109,4.6e-05,0.000112,-6e-06,4.1e-05,6.2e-05,-4e-06,5.7e-05,-1e-06,0.000153,7e-06,-1.6e-05,1.6e-05,-9.1e-05,-7e-06,7e-05,5.4e-05,1e-06,1e-06,-0.000116,-4.6e-05,-3.5e-05,5.9e-05,-4.4e-05,2e-05,-1.5e-05,1.4e-05,-3.1e-05,5.1e-05,-7e-06,-2.1e-05,-4.8e-05,6.9e-05,-2.5e-05,-3.1e-05,-3.9e-05,1.3e-05,3.2e-05,-4.5e-05,-2.8e-05,-4e-05,-3e-05,2.3e-05,8.5e-05,0.000143,8.4e-05,1.9e-05,4.2e-05,-6e-06,1.3e-05,-2.3e-05,1.1e-05,0.000124,1.9e-05,5.8e-05,-7.6e-05,-2.6e-05,9.7e-05,-4.9e-05,-2.9e-05,1e-06,1.4e-05,4.1e-05,-2.6e-05,1.9e-05,-5.9e-05,-6.3e-05,-2.8e-05,2e-06,-1.1e-05,-3.2e-05,2.7e-05,2.9e-05,-4.2e-05,3.1e-05,1.2e-05,-2.9e-05,-2.8e-05,3e-06,3.2e-05,-3.2e-05,8e-06,-6.4e-05,1.7e-05,4.1e-05,4.3e-05,-4.3e-05,-0.000109,-2.2e-05,8e-06,-9.2e-05,-4.2e-05,1.5e-05,4e-06,-2.4e-05,2.7e-05,1.8e-05,2.7e-05,-5.8e-05,2e-06,1.5e-05,1.7e-05,-1.1e-05,-1.7e-05,6.6e-05
-2e-05,-3.1e-05,-1e-06,-3.2e-05,1e-05,8.9e-05,-2.4e-05,4.4e-05,-6e-05,3.2e-05,1e-05,5.1e-05,2.8e-05,-3.6e-05,2.8e-05,2.7e-05,-1.5e-05,-2e-05,-6.4e-05,-1.2e-05,-2.4e-05,-1.5e-05,-2.8e-05,-2.5e-05,-1.5e-05,-4e-05,1.2e-05,5.4e-05,2e-05,-1.9e-05,5e-06,3.2e-05,4.3e-05,-6e-06,-0.000148,3.9e-05,6e-06,-5.1e-05,-8e-06,-5.3e-05,-7e-06,-2.5e-05,-2.1e-05,4.2e-05,4e-06,-2e-06,2e-05,-1.9e-05,-0.000134,3.6e-05,-5e-06,-1.6e-05,-2.5e-05,2e-05,2.9e-05,2.8e-05,6.1e-05,1.3e-05,-1.4e-05,-6.3e-05,-4.3e-05,-6.7e-05,-8e-06,-1.8e-05,0,-3.8e-05,-7e-06,1.5e-05,-5e-05,-1.3e-05,-6.6e-05,8.7e-05,1e-06,-4.1e-05,1e-06,0,-1.7e-05,-2.8e-05,1.4e-05,-6e-06,1.5e-05,5.1e-05,-4e-06,4.3e-05,-5.7e-05,-2.2e-05,-8e-06,2.8e-05,-3.5e-05,-4e-06,-5.1e-05,-3.9e-05,1.5e-05,2e-06,-2.4e-05,0,6.6e-05,5e-06,8e-06,1e-06,2.8e-05,-1.2e-05,3.2e-05,5.1e-05,4.2e-05,-2.8e-05,-1.2e-05,-1.7e-05,1.3e-05,4e-05,3.6e-05,-9e-06,-1.4e-05,-1.5e-05,3.1e-05,1e-06,-2.8e-05,-4.2e-05,4.1e-05,-1e-05,-5.3e-05
-2e-06,4e-06,1.1e-05,-1.3e-05,-3e-06,-1.8e-05,-1.4e-05,-5.5e-05,4.5e-05,5e-06,-2.5e-05,1.2e-05,2.7e-05,3.5e-05,3e-05,2.7e-05,7e-06,-1.4e-05,4.4e-05,4e-06,2.3e-05,2e-06,-2.3e-05,-1.9e-05,4.9e-05,1.9e-05,-9e-06,1.5e-05,-2.5e-05,4e-05,0,1.5e-05,-2.6e-05,2.3e-05,2e-06,-1.3e-05,3.7e-05,4.4e-05,-1.4e-05,2.5e-05,-3e-06,-1.4e-05,1.7e-05,-1.4e-05,5.2e-05,-1.9e-05,-1.5e-05,2e-05,-2.2e-05,-3e-05,2.9e-05,4.9e-05,-1e-06,-3e-06,-1.1e-05,-1.5e-05,-3.4e-05,1e-05,-1.3e-05,6.1e-05,9e-05,1.5e-05,-1e-06,5e-06,-1e-06,8e-06,-4e-06,-4.2e-05,-3e-06,6.8e-05,2.4e-05,-3e-05,4e-06,2e-06,1.2e-05,1.3e-05,4e-06,-2.9e-05,-5e-06,-1.3e-05,-1e-06,4.6e-05,-2e-06,1.9e-05,6e-06,2e-06,-3e-06,-1.1e-05,5.6e-05,2.1e-05,-2.6e-05,6e-06,1.2e-05,-1e-06,5e-06,-1.8e-05,-1.4e-05,-2e-05,6e-06,-1.7e-05,7e-06,4e-06,-4.3e-05,-2e-06,-1.6e-05,-2.4e-05,2e-05,3.7e-05,-6.3e-05,-2.1e-05,8e-06,-6e-06,-9e-06,-1.5e-05,2e-06,1.6e-05,1.9e-05,4e-06,0,-5e-06,2.6e-05
-3e-05,3.3e-05,-1.6e-05,1.2e-05,2.1e-05,2.1e-05,1.4e-05,1.5e-05,-2.2e-05,-1e-06,2e-06,-2.3e-05,-2.5e-05,-2.4e-05,-1e-06,-1.5e-05,-2.9e-05,-2.8e-05,-3.2e-05,2e-05,-1.7e-05,1e-05,2.2e-05,6e-06,-2.2e-05,-4.1e-05,2e-05,-5e-06,-2.3e-05,-3.5e-05,3.7e-05,-5.9e-05,0,1e-06,3.3e-05,5e-06,-3.3e-05,-2e-06,1.4e-05,3.8e-05,0,1.5e-05,-1.2e-05,9e-06,1.4e-05,9e-06,9e-06,-8e-06,2.8e-05,4.3e-05,-1.3e-05,-2.5e-05,-1.4e-05,-6e-06,4e-06,1.6e-05,7e-06,-7e-06,3e-05,1.3e-05,-5.6e-05,6e-06,-1.8e-05,-1e-06,-4e-06,4e-06,-1.6e-05,-3e-06,1.5e-05,-3.9e-05,-2.8e-05,5e-06,1.2e-05,-1e-05,-2.1e-05,-3e-06,-1.3e-05,1.6e-05,-7e-06,1.2e-05,-1.5e-05,-8e-06,5e-06,-1.9e-05,0,8e-06,1.2e-05,2.7e-05,-2e-05,-2.2e-05,1.3e-05,1e-06,-1.5e-05,6e-06,-1.2e-05,-3e-06,2.7e-05,2.1e-05,6e-06,2.2e-05,-1.1e-05,-1e-05,-5e-06,1e-06,1.3e-05,2.4e-05,3e-06,-8e-06,4.2e-05,1.3e-05,-6e-06,-1.3e-05,3.1e-05,0,8e-06,-2.2e-05,4e-06,1.6e-05,-2.5e-05,0,0
2.7e-05,-3.6e-05,-8e-06,-3.2e-05,-5e-06,-7e-06,9e-06,1e-05,5e-06,3.9e-05,-4.5e-05,-3.6e-05,2.7e-05,1e-05,0,1e-05,-1e-05,2.3e-05,-1.3e-05,-3e-06,1e-05,-1.9e-05,-1.2e-05,-2.1e-05,-7e-06,5.6e-05,2e-06,-8e-06,3e-06,1e-06,-2.5e-05,2e-06,2.5e-05,1e-06,6e-06,-9e-06,8e-06,5e-06,-2.3e-05,-3e-05,-6e-06,-6e-06,6e-06,3.5e-05,-1e-05,-1.3e-05,8e-06,-7e-06,1.5e-05,-9e-06,-9e-06,1.3e-05,-4e-06,5e-06,1.7e-05,-2.7e-05,-2.8e-05,-1.4e-05,-3.1e-05,2.6e-05,3.8e-05,-2e-06,3e-06,1.5e-05,6e-06,-1.5e-05,2e-06,1.5e-05,-5e-05,-6e-06,1.9e-05,1e-05,-2e-06,-1.4e-05,1.6e-05,-8e-06,1.3e-05,-1.5e-05,4e-06,-3e-06,1e-06,-4.6e-05,-1.8e-05,3.1e-05,-5e-06,-2e-06,-4e-06,-3.5e-05,-1.4e-05,1e-05,-2e-06,-3e-06,9e-06,-5e-06,-3.5e-05,4e-06,-1.8e-05,-2.4e-05,1e-06,-9e-06,-1.8e-05,1.7e-05,2.6e-05,-1.6e-05,-1e-05,4e-06,2e-06,-1.2e-05,-2.1e-05,-4e-06,1.9e-05,8e-06,1e-06,1.1e-05,-1.1e-05,2e-06,0,-8e-06,1.3e-05,2e-06,1.5e-05
6e-06,3.3e-05,3e-06,1.2e-05,-8e-06,-2.2e-05,-1.1e-05,2.6e-05,2.3e-05,1.9e-05,3.3e-05,1.3e-05,2.6e-05,1e-06,-5.2e-05,-7e-06,1e-05,-4e-06,6.5e-05,-8e-06,3e-06,-3e-06,-6e-06,1.2e-05,7e-06,1.3e-05,8e-06,3e-06,-4e-06,-5e-06,7e-06,4.2e-05,-4.1e-05,9e-06,1.4e-05,1.4e-05,2.7e-05,2.7e-05,-1.3e-05,1e-05,1e-05,9e-06,2e-06,-1.3e-05,-1e-05,-1.3e-05,-2e-06,9e-06,-9e-06,8e-06,1.9e-05,2e-06,1.1e-05,-1.5e-05,1.9e-05,1.3e-05,3.8e-05,2e-06,1.8e-05,-7.2e-05,-2.8e-05,3e-06,7e-06,-9e-06,3e-06,7e-06,1.1e-05,1.5e-05,0,3.1e-05,-5e-06,-3.7e-05,-3e-06,-1e-05,-1.8e-05,2.1e-05,1.4e-05,3e-06,2e-06,-1e-06,6e-06,2.5e-05,5e-06,5e-06,1.6e-05,1.4e-05,-5e-06,1.6e-05,2e-05,1e-05,-2.4e-05,5e-06,-4e-06,2e-06,7e-06,2e-06,-5e-06,9e-06,-9e-06,-7e-06,3e-06,-3e-06,-9e-06,4.2e-05,1.4e-05,-1e-06,-2.7e-05,-8e-06,4e-06,-1.3e-05,-4e-05,3e-06,-1.3e-05,-1.4e-05,-2e-06,-1e-06,6e-06,2e-06,-8e-06,3e-06,-2.2e-05
7e-06,1.9e-05,-2e-06,-9e-06,4e-06,3.3e-05,-6e-06,-3.9e-05,-2.3e-05,1e-05,-2.5e-05,-4e-06,-2.9e-05,-1e-06,2e-06,-6e-06,1e-06,-4e-06,-5.2e-05,-5e-06,-6e-06,-9e-06,-2e-06,-1.7e-05,7e-06,-1.7e-05,-9e-06,4e-06,2e-06,-1.4e-05,1.3e-05,1e-06,-1.7e-05,-1e-06,2e-06,-1.1e-05,-2.4e-05,-2.7e-05,2e-05,-5e-06,-1.6e-05,-1.2e-05,-1.3e-05,-2.1e-05,1.3e-05,-3e-06,-7e-06,-5e-06,1.1e-05,1.3e-05,-4e-06,1.1e-05,1.1e-05,1.1e-05,-1.5e-05,3e-06,-2e-06,1.7e-05,-1.1e-05,2.1e-05,-8e-06,5e-06,0,2e-06,-3e-06,-1e-05,-1.1e-05,-2e-06,-1.6e-05,-4e-06,3e-05,2.7e-05,1.2e-05,1e-05,1e-06,-6e-06,-1.2e-05,9e-06,3e-06,-5e-06,-6e-06,5e-06,-8e-06,5e-06,2e-06,-2e-05,3e-06,-2.7e-05,-7e-06,-9e-06,-1.5e-05,-1e-06,2.6e-05,3e-06,3e-05,-6e-06,1.7e-05,0,8e-06,1.7e-05,1.9e-05,-6e-06,5e-06,-4.5e-05,-2.5e-05,2e-05,4e-06,8e-06,1.6e-05,2e-06,2e-05,0,1e-06,-2e-06,1.3e-05,1.1e-05,-6e-06,7e-06,0,6e-06,1.6e-05
0,-5.6e-05,6e-06,0,9e-06,4e-06,5e-06,3.9e-05,1.7e-05,-4.2e-05,1.4e-05,-1.7e-05,1.9e-05,-2e-06,8e-06,-1.3e-05,-4e-06,7e-06,9e-06,-1.1e-05,1e-06,1.1e-05,-1.7e-05,7e-06,1e-06,-1.9e-05,-7e-06,-3e-06,1e-05,0,-1.3e-05,-1e-06,1.1e-05,-1.7e-05,1.1e-05,1.7e-05,-1e-06,3e-06,-3e-06,-1.3e-05,1e-06,-5e-06,6e-06,-2.2e-05,-6e-06,1.4e-05,1.1e-05,-7e-06,-2e-06,-1.2e-05,-1.4e-05,-1.4e-05,-1.6e-05,7e-06,2e-06,-1.7e-05,-1.8e-05,-7e-06,-5e-06,-2.2e-05,-3.4e-05,-6e-06,9e-06,-6e-06,-5e-06,4e-06,-1e-06,-1.2e-05,1.4e-05,-9e-06,-2.2e-05,-9e-06,-4e-06,9e-06,2e-06,-3e-06,2e-06,-1e-06,-4e-06,1e-06,-3e-06,1e-06,-3e-06,3e-06,-1.2e-05,1.1e-05,1.5e-05,1.7e-05,0,3e-06,2e-06,6e-06,-1.7e-05,-4e-06,-1.2e-05,6e-06,-1e-06,9e-06,-6e-06,-1.5e-05,6e-06,-1e-06,9e-06,1.1e-05,1.4e-05,-9e-06,9e-06,-3e-06,-2.2e-05,1.3e-05,0,-8e-06,1.3e-05,1.1e-05,9e-06,-1e-05,2e-06,1e-05,8e-06,-1e-06,4e-06
-9e-06,1.1e-05,-7e-06,2e-05,-1.2e-05,-2.3e-05,5e-06,-2.6e-05,-1.2e-05,3e-06,-1e-06,0,1e-05,-5e-06,3.3e-05,1.4e-05,4e-06,9e-06,1.5e-05,6e-06,3e-06,1e-06,8e-06,9e-06,1e-05,2.3e-05,4e-06,4e-06,1e-06,7e-06,8e-06,-3.2e-05,-1.2e-05,1.4e-05,-3e-06,-8e-06,5e-06,1.4e-05,-3e-06,6e-06,5e-06,1.1e-05,3e-06,9e-06,-1.6e-05,-8e-06,-6e-06,-6e-06,-3e-06,1.5e-05,1e-06,-7e-06,9e-06,9e-06,7e-06,1e-05,2e-06,-1.1e-05,1.8e-05,2.7e-05,4.1e-05,-3e-06,8e-06,-1e-06,5e-06,-3e-06,2.8e-05,7e-06,5e-06,9e-06,1.6e-05,1e-06,-6e-06,1.1e-05,-2e-06,0,2e-06,7e-06,6e-06,4e-06,-3e-06,-2e-06,2e-06,-1.3e-05,-6e-06,0,5e-06,6e-06,-4e-06,4e-06,9e-06,-1e-06,7e-06,-1e-06,-2.4e-05,-2e-06,-1.1e-05,-1.1e-05,-2e-06,5e-06,-7e-06,3e-06,-5e-06,3e-06,2e-06,-5e-06,6e-06,-7e-06,2e-05,-6e-06,1.1e-05,-3e-06,-2e-06,-7e-06,-1.1e-05,3e-06,-3e-06,3e-06,-2e-06,0,1e-06
8e-06,-5e-06,1e-06,-1e-05,5e-06,3e-06,-6e-06,3.3e-05,-1e-06,-2e-06,1e-06,9e-06,-1.8e-05,1.1e-05,-7e-06,-7e-06,1.5e-05,-1.1e-05,-1.3e-05,5e-06,-3e-06,2e-06,-2e-06,-2e-05,-1e-06,7e-06,4e-06,2e-06,0,-5e-06,-7e-06,8e-06,-1e-06,-1.7e-05,2e-06,7e-06,6e-06,-1.6e-05,5e-06,1e-05,-2e-06,-4e-06,-1e-06,1.5e-05,4e-06,3e-06,3e-06,1.2e-05,1e-05,-1e-05,1e-05,6e-06,-3e-06,1.3e-05,-1.1e-05,-1e-06,3e-06,8e-06,-1.2e-05,2e-06,-1.1e-05,1.1e-05,-1.4e-05,3e-06,0,-2e-06,-1.8e-05,3e-06,4e-06,-4e-06,-2.7e-05,-1e-06,4e-06,-1e-06,2e-06,5e-06,5e-06,2e-06,-6e-06,1e-06,2e-06,-1.4e-05,-4e-06,5e-06,1.2e-05,-1e-06,6e-06,6e-06,-1e-06,-2e-06,1.3e-05,-4e-06,-1.1e-05,2e-06,5e-06,0,-1.7e-05,1e-05,1.1e-05,0,2e-06,-2e-06,9e-06,4e-06,-6e-06,-9e-06,-1.3e-05,1e-05,-1.3e-05,3e-06,-1.4e-05,-1e-06,3e-06,2e-06,-4e-06,2e-06,-4e-06,-1e-05,-5e-06,-4e-06,-9e-06
-4e-06,2.5e-05,5e-06,-5e-06,-1.7e-05,1.2e-05,-3e-06,-1.4e-05,3e-06,6e-06,2.2e-05,0,-2e-06,-1.4e-05,-9e-06,-9e-06,-5e-06,4e-06,4e-06,0,4e-06,1e-06,8e-06,1.2e-05,-2e-06,-2.4e-05,7e-06,2e-06,4e-06,1.7e-05,-3e-06,1.6e-05,2e-05,1.1e-05,-2.3e-05,5e-06,-1e-05,6e-06,-1e-05,3e-06,-6e-06,0,-1e-06,6e-06,1e-06,-1e-06,5e-06,-1e-06,-1.7e-05,-4e-06,-6e-06,5e-06,-1e-05,4e-06,0,2e-06,9e-06,0,5e-06,5e-06,6e-06,-3e-06,-6e-06,5e-06,1e-06,3e-06,-7e-06,-6e-06,-7e-06,-2e-06,1.1e-05,6e-06,3e-06,2e-06,3e-06,-9e-06,0,-1e-05,3e-06,3e-06,3e-06,1.1e-05,3e-06,-7e-06,1e-05,-8e-06,-4e-06,-4e-06,1.1e-05,4e-06,1.4e-05,-1e-06,6e-06,-3e-06,7e-06,1e-06,5e-06,-5e-06,-5e-06,-2e-06,-1.2e-05,2e-06,-3e-06,-1e-05,2e-06,4e-06,-6e-06,-3e-06,3e-06,-3e-06,4e-06,9e-06,1.2e-05,-2e-06,1e-05,0,8e-06,0,3e-06,-2e-06,8e-06
2e-06,-1.6e-05,-1e-05,1e-05,-3e-06,-8e-06,4e-06,3.1e-05,4e-06,9e-06,0,-3e-06,1.7e-05,5e-06,-1.6e-05,3e-06,4e-06,-5e-06,7e-06,-1e-06,-5e-06,3e-06,-9e-06,1e-06,2e-06,0,-8e-06,-4e-06,-4e-06,-4e-06,6e-06,-5e-06,-1e-06,-2e-06,-7e-06,-2e-06,-1e-06,4e-06,-5e-06,-1.6e-05,0,2e-06,-1e-06,5e-06,-1e-06,0,-6e-06,-3e-06,-1.3e-05,6e-06,-5e-06,-6e-06,1.4e-05,2e-06,6e-06,-5e-06,-1.6e-05,-1e-06,1e-06,0,-1e-06,-1e-06,6e-06,-4e-06,-4e-06,-4e-06,1.3e-05,-1e-06,-1e-06,1.2e-05,-1.3e-05,-5e-06,-2e-06,-9e-06,5e-06,5e-06,2e-06,0,4e-06,-4e-06,4e-06,5e-06,-3e-06,-2e-06,-1e-05,1.4e-05,-1e-06,0,-1.6e-05,3e-06,-6e-06,-2e-06,-1e-06,1e-06,-6e-06,1e-06,9e-06,0,4e-06,-2e-06,8e-06,-2e-06,-3e-06,1.8e-05,4e-06,-3e-06,7e-06,-4e-06,4e-06,-7e-06,-4e-06,-6e-06,-7e-06,-2e-06,-7e-06,-2e-06,-3e-06,5e-06,-2e-06,-1e-06,4e-06
-1e-06,8e-06,4e-06,-3e-06,1e-05,5e-06,2e-06,-2.9e-05,-4e-06,6e-06,7e-06,0,-2.1e-05,7e-06,5e-06,8e-06,-1.6e-05,4e-06,-1.7e-05,-4e-06,2e-06,-6e-06,2e-06,-9e-06,3e-06,4e-06,-1e-06,-3e-06,-9e-06,2e-06,-7e-06,-1e-06,-1e-06,4e-06,1e-05,-2e-06,1.1e-05,-1.1e-05,9e-06,5e-06,3e-06,-8e-06,5e-06,-1e-05,-4e-06,-1e-06,3e-06,7e-06,1.1e-05,-7e-06,1e-05,1.5e-05,-7e-06,-7e-06,1e-06,6e-06,5e-06,-3e-06,-9e-06,-7e-06,8e-06,-1e-06,3e-06,3e-06,2e-06,5e-06,-1e-05,2e-06,0,-7e-06,1.4e-05,-5e-06,-1e-06,-9e-06,-5e-06,-2e-06,-6e-06,-3e-06,-6e-06,2e-06,0,0,4e-06,9e-06,-6e-06,-9e-06,0,-1.8e-05,8e-06,-6e-06,-1e-05,0,1e-06,0,5e-06,-4e-06,1e-06,-2e-06,3e-06,1e-06,-1e-06,0,7e-06,-1.3e-05,-1e-06,5e-06,2e-06,3e-06,-8e-06,7e-06,4e-06,1e-06,-1e-05,0,5e-06,-3e-06,-2e-06,1e-06,1e-06,2e-06,-5e-06
0,4e-06,-4e-06,-6e-06,1e-06,0,-2e-06,4e-06,2e-06,6e-06,-4e-06,-4e-06,5e-06,-7e-06,1e-06,-2e-06,1.4e-05,-1.1e-05,1.6e-05,-1e-06,1e-06,0,-1e-06,1.1e-05,-2e-06,1e-05,-1e-06,2e-06,5e-06,8e-06,3e-06,-9e-06,1.1e-05,4e-06,1e-05,0,-1.1e-05,6e-06,-2e-06,7e-06,-5e-06,7e-06,0,-5e-06,8e-06,4e-06,1e-06,4e-06,1.1e-05,3e-06,0,-1.6e-05,-5e-06,2e-06,-7e-06,-3e-06,4e-06,1e-06,7e-06,-1.9e-05,-2e-06,1e-06,-2e-06,-6e-06,1e-06,0,0,2e-06,6e-06,1e-06,-5e-06,1.4e-05,1e-06,3e-06,2e-06,3e-06,4e-06,0,-1e-06,0,-2e-06,-1.3e-05,-1e-06,-4e-06,4e-06,3e-06,1e-06,1.7e-05,-1e-06,3e-06,-5e-06,0,-1e-06,-3e-06,6e-06,1e-05,-6e-06,4e-06,-8e-06,1e-06,1e-05,1e-06,-7e-06,3e-06,-8e-06,6e-06,4e-06,1e-06,8e-06,-2e-06,4e-06,-8e-06,1e-06,0,-4e-06,5e-06,2e-06,-6e-06,-1e-06,0,-2e-06
4e-06,-9e-06,-3e-06,0,1e-06,-6e-06,1e-06,-8e-06,0,-1.6e-05,1e-06,2e-06,7e-06,0,1.2e-05,0,-1.5e-05,1.1e-05,-1e-06,0,-4e-06,-1e-06,2e-06,-2e-06,5e-06,-1.1e-05,1e-06,3e-06,0,-2e-06,0,6e-06,-4e-06,-7e-06,7e-06,-1e-06,0,4e-06,3e-06,1e-06,1e-06,-2e-06,-2e-06,-5e-06,-3e-06,0,-2e-06,-6e-06,-6e-06,-1e-06,-9e-06,1e-05,8e-06,2e-06,8e-06,6e-06,3e-06,3e-06,-8e-06,9e-06,-1.2e-05,-1e-06,-5e-06,2e-06,1e-06,1e-06,5e-06,2e-06,3e-06,5e-06,1.2e-05,-1e-05,-1e-06,-6e-06,3e-06,-5e-06,3e-06,7e-06,5e-06,2e-06,-1e-06,1e-05,4e-06,-2e-06,2e-06,-1e-06,-2e-06,-5e-06,0,-1e-06,6e-06,-1e-06,6e-06,2e-06,-1e-05,-1.2e-05,3e-06,-6e-06,3e-06,-6e-06,-8e-06,-2e-06,-1e-06,3e-06,1e-05,-2e-06,-9e-06,0,-3e-06,-4e-06,-3e-06,6e-06,0,2e-06,-2e-06,-2e-06,-4e-06,-4e-06,1e-06,2e-06,5e-06
-3e-06,-6e-06,5e-06,1e-06,0,1e-05,1e-06,8e-06,-5e-06,-1e-06,-2e-06,1e-06,-3e-06,8e-06,5e-06,4e-06,1.1e-05,-3e-06,-1.6e-05,0,5e-06,2e-06,1e-06,-1e-06,-1e-06,0,3e-06,-1e-06,0,0,-1e-06,0,-1e-05,2e-06,-1e-06,-6e-06,9e-06,-1.1e-05,-5e-06,-5e-06,2e-06,-1e-06,1e-06,0,5e-06,-3e-06,0,-6e-06,3e-06,-2e-06,3e-06,-6e-06,-3e-06,-1e-06,-1e-06,-7e-06,-5e-06,-3e-06,4e-06,1.4e-05,1.5e-05,4e-06,-2e-06,1e-06,-3e-06,2e-06,-3e-06,-6e-06,-4e-06,-5e-06,-7e-06,6e-06,0,8e-06,-2e-06,3e-06,1e-06,-2e-06,0,-2e-06,2e-06,-3e-06,0,1e-06,1e-06,1e-06,-6e-06,8e-06,2e-06,-5e-06,-2e-06,3e-06,-2e-06,-2e-06,-7e-06,1.1e-05,5e-06,5e-06,-1e-06,7e-06,2e-06,2e-06,1e-06,-6e-06,-4e-06,-1e-06,0,-2e-06,0,7e-06,-4e-06,1e-06,-3e-06,-3e-06,6e-06,1e-06,3e-06,2e-06,2e-06,-1e-06,3e-06
1e-06,5e-06,-5e-06,0,-2e-06,-1e-06,-1e-06,-1.2e-05,5e-06,-3e-06,1e-06,-3e-06,-9e-06,-1e-05,-3e-06,0,-1e-05,0,1.7e-05,1e-06,-3e-06,0,-4e-06,1e-06,-4e-06,1e-06,0,-2e-06,2e-06,5e-06,4e-06,-3e-06,3e-06,-1e-06,-6e-06,3e-06,-2e-06,9e-06,-3e-06,1e-06,-2e-06,3e-06,1e-06,9e-06,0,1e-06,2e-06,4e-06,-2e-06,6e-06,5e-06,3e-06,-1e-06,0,-5e-06,6e-06,-5e-06,-2e-06,3e-06,-2e-06,-9e-06,-3e-06,2e-06,1e-06,1e-06,-3e-06,-6e-06,2e-06,7e-06,1e-06,4e-06,-3e-06,0,2e-06,1e-06,-2e-06,-1e-06,3e-06,-3e-06,-1e-06,0,3e-06,1e-06,2e-06,0,0,-4e-06,-5e-06,-5e-06,3e-06,-9e-06,-1e-06,-2e-06,0,8e-06,-6e-06,2e-06,-3e-06,-4e-06,-5e-06,-5e-06,-1e-06,-5e-06,-3e-06,-1e-06,-4e-06,4e-06,0,0,-2e-06,3e-06,1e-06,2e-06,2e-06,0,-1e-06,-1e-06,3e-06,-3e-06,0,-7e-06
-2e-06,-4e-06,0,-2e-06,2e-06,-8e-06,1e-06,1.1e-05,-3e-06,5e-06,-5e-06,2e-06,1e-05,7e-06,-1.3e-05,-5e-06,1.1e-05,1e-06,-8e-06,0,2e-06,-1e-06,4e-06,-2e-06,4e-06,1.2e-05,1e-06,0,-3e-06,-3e-06,-3e-06,6e-06,-2e-06,-4e-06,-4e-06,-6e-06,-4e-06,-4e-06,2e-06,1e-06,1e-06,-6e-06,0,5e-06,-1e-06,2e-06,-3e-06,3e-06,-5e-06,-3e-06,-5e-06,-4e-06,6e-06,5e-06,3e-06,-4e-06,7e-06,3e-06,-6e-06,6e-06,-1e-06,-1e-06,5e-06,-3e-06,2e-06,2e-06,1.2e-05,1e-06,-1.1e-05,3e-06,-9e-06,-5e-06,1e-06,5e-06,1e-06,2e-06,0,0,0,0,-1e-06,-3e-06,2e-06,3e-06,-2e-06,-3e-06,-1e-06,-1e-06,5e-06,-1e-06,2e-06,-2e-06,-1e-06,0,6e-06,2e-06,-3e-06,1e-06,4e-06,0,7e-06,1e-06,4e-06,1.1e-05,1e-06,-2e-06,2e-06,2e-06,0,-2e-06,4e-06,-2e-06,2e-06,0,-3e-06,1e-06,-1e-06,-2e-06,0,-1e-06,2e-06
-1e-06,7e-06,0,2e-06,2e-06,4e-06,3e-06,-1.5e-05,6e-06,4e-06,-6e-06,2e-06,-5e-06,-3e-06,-3e-06,3e-06,-5e-06,0,-1e-06,0,-1e-06,0,-2e-06,2e-06,0,-8e-06,-4e-06,1e-06,-2e-06,-3e-06,1e-06,-2e-06,-7e-06,5e-06,-2e-06,6e-06,2e-06,-2e-06,1e-06,-4e-06,0,4e-06,0,1e-06,-4e-06,-2e-06,2e-06,-1e-06,5e-06,1e-06,-1e-06,5e-06,-1e-06,2e-06,2e-06,1e-06,-2e-06,-1e-06,4e-06,-1.4e-05,-6e-06,2e-06,1e-06,2e-06,0,-1e-06,-3e-06,-2e-06,4e-06,-2e-06,1e-06,7e-06,0,0,0,-3e-06,-1e-06,-3e-06,1e-06,0,0,-2e-06,-1e-06,1e-06,-3e-06,4e-06,2e-06,-5e-06,-3e-06,-1e-06,6e-06,1e-06,2e-06,-1e-06,-6e-06,0,-3e-06,-1e-06,-2e-06,2e-06,-2e-06,2e-06,0,-6e-06,2e-06,-1e-06,-1e-06,-1e-06,-3e-06,5e-06,-1e-06,-3e-06,-2e-06,-1e-06,-1e-06,0,2e-06,-2e-06,1e-06,-1e-06,4e-06
1e-06,-5e-06,-3e-06,0,0,3e-06,-1e-06,8e-06,-4e-06,4e-06,-2e-06,-1e-06,-2e-06,-2e-06,6e-06,1e-06,7e-06,0,4e-06,-1e-06,-1e-06,1e-06,3e-06,-2e-06,-3e-06,-2e-06,1e-06,-1e-06,3e-06,1e-06,2e-06,0,6e-06,-2e-06,-2e-06,-6e-06,4e-06,6e-06,0,4e-06,2e-06,3e-06,0,-8e-06,2e-06,0,1e-06,2e-06,-1e-06,3e-06,6e-06,-1e-06,-4e-06,0,-3e-06,-1e-06,-1e-06,-2e-06,-4e-06,4e-06,7e-06,0,0,-2e-06,-1e-06,0,-7e-06,-1e-06,3e-06,-1e-06,-3e-06,-5e-06,-2e-06,-3e-06,-2e-06,3e-06,3e-06,0,-2e-06,1e-06,-1e-06,2e-06,2e-06,0,1e-06,-2e-06,1e-06,5e-06,-1e-06,3e-06,4e-06,0,0,0,-4e-06,0,2e-06,3e-06,-1e-06,-2e-06,4e-06,-2e-06,-3e-06,-1e-06,-2e-06,3e-06,-3e-06,-1e-06,4e-06,-7e-06,-2e-06,2e-06,-1e-06,2e-06,2e-06,-2e-06,-3e-06,0,-1e-06,0,0
-1e-06,1.2e-05,2e-06,3e-06,-5e-06,-4e-06,-2e-06,-7e-06,-2e-06,4e-06,-2e-06,0,3e-06,6e-06,7e-06,-3e-06,-4e-06,-3e-06,-1e-06,0,2e-06,-1e-06,-2e-06,2e-06,3e-06,1e-06,-1e-06,0,0,-6e-06,-3e-06,-6e-06,6e-06,3e-06,3e-06,7e-06,-5e-06,-1e-06,1e-06,-1e-06,-3e-06,-3e-06,0,-4e-06,3e-06,-1e-06,-2e-06,1e-06,-5e-06,-4e-06,-2e-06,0,4e-06,-2e-06,-1e-06,2e-06,-3e-06,1e-06,0,-6e-06,-4e-06,0,-3e-06,0,-1e-06,1e-06,8e-06,0,-2e-06,1e-06,4e-06,3e-06,-1e-06,-2e-06,0,-2e-06,1e-06,0,0,-1e-06,1e-06,1e-06,-1e-06,-2e-06,5e-06,-1e-06,0,-2e-06,4e-06,-1e-06,0,1e-06,1e-06,-1e-06,4e-06,1e-06,4e-06,-3e-06,3e-06,0,-3e-06,1e-06,4e-06,5e-06,-1e-06,0,2e-06,0,-3e-06,1e-06,0,1e-06,2e-06,-1e-06,-1e-06,2e-06,0,3e-06,1e-06,1e-06,-5e-06
2e-06,-1.9e-05,-2e-06,-2e-06,-1e-06,2e-06,1e-06,1.5e-05,0,-8e-06,0,1e-06,2e-06,-7e-06,3e-06,0,1e-06,2e-06,-2e-06,1e-06,-1e-06,1e-06,1e-06,1e-06,0,7e-06,2e-06,0,1e-06,-2e-06,3e-06,1e-06,-4e-06,-1e-06,3e-06,-6e-06,-2e-06,-5e-06,-4e-06,-1e-06,-1e-06,3e-06,-1e-06,1e-06,-3e-06,0,1e-06,-4e-06,6e-06,3e-06,-4e-06,-3e-06,-2e-06,-1e-06,5e-06,-3e-06,4e-06,0,2e-06,2e-06,6e-06,0,-3e-06,3e-06,1e-06,-1e-06,-4e-06,3e-06,4e-06,-1e-06,2e-06,2e-06,1e-06,-4e-06,-1e-06,1e-06,-2e-06,-1e-06,2e-06,0,1e-06,-1e-06,0,-2e-06,-2e-06,1e-06,0,8e-06,-3e-06,-1e-06,0,-1e-06,-2e-06,0,0,-1e-06,-3e-06,2e-06,-2e-06,0,-1e-06,-1e-06,-1e-06,-4e-06,4e-06,2e-06,0,1e-06,0,5e-06,-1e-06,0,1e-06,0,0,-1e-06,1e-06,1e-06,1e-06,1e-06,4e-06
0,1.4e-05,-1e-06,-1e-06,0,1e-06,2e-06,-9e-06,3e-06,-2e-06,-4e-06,0,-2e-06,4e-06,-2e-06,2e-06,-2e-06,2e-06,6e-06,1e-06,1e-06,0,-1e-06,-4e-06,-2e-06,-5e-06,0,0,0,-2e-06,-2e-06,8e-06,2e-06,-2e-06,4e-06,9e-06,5e-06,1e-05,0,-3e-06,3e-06,-3e-06,0,2e-06,-2e-06,0,0,-4e-06,2e-06,-1e-06,3e-06,6e-06,-3e-06,-1e-06,-3e-06,3e-06,1e-06,1e-06,-2e-06,2e-06,1e-06,0,1e-06,-2e-06,0,1e-06,0,-1e-06,-5e-06,1e-06,2e-06,-3e-06,0,-1e-06,-1e-06,-1e-06,0,2e-06,-2e-06,-1e-06,0,-2e-06,-1e-06,0,-4e-06,1e-06,2e-06,-7e-06,3e-06,2e-06,-3e-06,0,1e-06,0,-4e-06,3e-06,-2e-06,-1e-06,1e-06,1e-06,0,0,0,-2e-06,-3e-06,1e-06,2e-06,-1e-06,4e-06,-5e-06,3e-06,0,2e-06,0,-2e-06,2e-06,-1e-06,-2e-06,-2e-06,0,2e-06
0,-1e-05,1e-06,1e-06,0,-4e-06,0,9e-06,0,-4e-06,1e-06,-1e-06,-2e-06,1e-06,-6e-06,-1e-06,-1e-06,-3e-06,-5e-06,1e-06,1e-06,0,0,2e-06,2e-06,-4e-06,-1e-06,0,-1e-06,-2e-06,-1e-06,-2e-06,4e-06,4e-06,0,-8e-06,-3e-06,-9e-06,2e-06,3e-06,-2e-06,-1e-06,0,4e-06,2e-06,1e-06,-1e-06,3e-06,-4e-06,-2e-06,1e-06,-9e-06,4e-06,-3e-06,-1e-06,-2e-06,-3e-06,-1e-06,3e-06,1.2e-05,4e-06,-1e-06,3e-06,1e-06,0,-1e-06,4e-06,-2e-06,-2e-06,-1e-06,1e-06,0,0,3e-06,0,2e-06,0,-1e-06,0,1e-06,0,4e-06,0,2e-06,2e-06,-3e-06,3e-06,3e-06,-3e-06,-2e-06,-3e-06,2e-06,1e-06,0,3e-06,-4e-06,-1e-06,0,1e-06,-3e-06,0,1e-06,1e-06,3e-06,0,-2e-06,-3e-06,-1e-06,-7e-06,3e-06,0,-2e-06,2e-06,1e-06,2e-06,-2e-06,1e-06,-1e-06,0,0,-2e-06
0,1.3e-05,-1e-06,0,3e-06,3e-06,-1e-06,-9e-06,-2e-06,3e-06,0,-1e-06,6e-06,-6e-06,-6e-06,0,3e-06,4e-06,-1e-06,1e-06,-1e-06,-1e-06,1e-06,0,-1e-06,0,0,-1e-06,-1e-06,-1e-06,2e-06,-3e-06,-5e-06,-6e-06,-2e-06,9e-06,-3e-06,3e-06,0,3e-06,0,4e-06,0,1e-06,4e-06,-1e-06,0,3e-06,1e-06,3e-06,-3e-06,9e-06,-2e-06,-1e-06,3e-06,1e-06,0,0,-2e-06,-9e-06,-1e-05,1e-06,0,-2e-06,-1e-06,0,-1e-06,0,1e-06,-1e-06,-4e-06,1e-06,0,1e-06,0,-2e-06,1e-06,1e-06,2e-06,0,-1e-06,-2e-06,0,1e-06,3e-06,2e-06,2e-06,-6e-06,2e-06,1e-06,1e-06,-1e-06,-2e-06,0,4e-06,5e-06,4e-06,0,-1e-06,2e-06,4e-06,-2e-06,-2e-06,-1e-06,2e-06,-1e-06,0,1e-06,8e-06,0,-3e-06,1e-06,-2e-06,0,0,1e-06,-1e-06,3e-06,1e-06,-1e-06,-3e-06
-1e-06,-1.3e-05,2e-06,-5e-06,-1e-06,1e-06,-1e-06,8e-06,2e-06,2e-06,3e-06,0,-2e-06,8e-06,4e-06,2e-06,-4e-06,-2e-06,8e-06,-1e-06,1e-06,0,0,-2e-06,-1e-06,6e-06,0,0,-1e-06,2e-06,-3e-06,-7e-06,-2e-06,5e-06,-5e-06,-8e-06,3e-06,3e-06,0,-3e-06,1e-06,-3e-06,0,-1e-06,-4e-06,0,0,-2e-06,1e-06,-4e-06,1e-06,-6e-06,-1e-06,0,-1e-06,0,2e-06,1e-06,-1e-06,1e-06,3e-06,0,-2e-06,2e-06,1e-06,0,-3e-06,1e-06,-1e-06,2e-06,-1e-06,-1e-06,0,4e-06,0,1e-06,0,2e-06,-1e-06,0,-1e-06,1e-06,0,-2e-06,0,-1e-06,0,3e-06,-1e-06,2e-06,1e-06,0,2e-06,0,-5e-06,-3e-06,1e-06,2e-06,1e-06,0,-4e-06,1e-06,2e-06,-1e-06,-1e-06,0,1e-06,0,-6e-06,-5e-06,0,0,-1e-06,0,-1e-06,0,1e-06,2e-06,0,0,4e-06
0,9e-06,-1e-06,3e-06,-1e-06,-5e-06,0,-5e-06,-2e-06,2e-06,0,1e-06,0,-5e-06,7e-06,1e-06,6e-06,0,-8e-06,-1e-06,-1e-06,0,0,2e-06,2e-06,-1e-06,1e-06,0,1e-06,-1e-06,1e-06,6e-06,4e-06,-2e-06,-2e-06,8e-06,2e-06,-4e-06,0,0,1e-06,2e-06,0,-4e-06,-1e-06,1e-06,-1e-06,-1e-06,-4e-06,2e-06,3e-06,3e-06,3e-06,0,-2e-06,0,1e-06,-1e-06,0,-1.1e-05,-2e-06,-1e-06,0,-2e-06,-1e-06,-1e-06,4e-06,0,2e-06,-1e-06,-4e-06,0,0,2e-06,0,0,0,-2e-06,-2e-06,0,1e-06,0,0,-1e-06,-2e-06,1e-06,-2e-06,1e-06,0,-1e-06,-2e-06,0,-1e-06,0,-4e-06,2e-06,-2e-06,-2e-06,0,-2e-06,2e-06,-1e-06,-1e-06,6e-06,-1e-06,-2e-06,0,-1e-06,2e-06,5e-06,1e-06,0,1e-06,1e-06,2e-06,-1e-06,1e-06,-1e-06,0,0,0
0,-2e-06,0,-1e-06,0,2e-06,0,9e-06,0,3e-06,-2e-06,-1e-06,1e-06,-1e-06,4e-06,-2e-06,-7e-06,1e-06,3e-06,0,0,0,-1e-06,0,-1e-06,-5e-06,0,0,0,3e-06,0,8e-06,-3e-06,0,1e-06,-9e-06,-3e-06,-1e-06,-2e-06,0,-1e-06,0,1e-06,-2e-06,2e-06,1e-06,1e-06,2e-06,1e-06,0,-2e-06,-2e-06,-1e-06,-2e-06,2e-06,-1e-06,-2e-06,0,-1e-06,8e-06,-2e-06,0,0,3e-06,0,0,0,-1e-06,2e-06,0,2e-06,0,0,-2e-06,0,0,-1e-06,-1e-06,2e-06,0,0,1e-06,-1e-06,-1e-06,0,0,-2e-06,4e-06,0,0,-2e-06,0,1e-06,0,6e-06,0,-3e-06,2e-06,0,2e-06,-4e-06,0,-1e-06,-4e-06,1e-06,2e-06,1e-06,1e-06,3e-06,-1e-06,2e-06,1e-06,-2e-06,-1e-06,-2e-06,1e-06,-1e-06,-3e-06,0,0,-3e-06
0,3e-06,1e-06,1e-06,0,2e-06,-1e-06,-1e-05,0,-5e-06,4e-06,-1e-06,1e-06,5e-06,-5e-06,-1e-06,7e-06,-2e-06,2e-06,0,1e-06,0,1e-06,-1e-06,-2e-06,1e-06,0,0,0,2e-06,-2e-06,-4e-06,-1e-06,2e-06,2e-06,8e-06,-1e-06,7e-06,0,1e-06,-1e-06,-2e-06,0,3e-06,1e-06,-1e-06,0,0,3e-06,-2e-06,-1e-06,2e-06,-1e-06,-1e-06,2e-06,1e-06,0,1e-06,1e-06,-2e-06,2e-06,1e-06,1e-06,-3e-06,-1e-06,0,-4e-06,-1e-06,-2e-06,1e-06,0,-1e-06,0,-1e-06,0,-1e-06,0,1e-06,1e-06,1e-06,-1e-06,-1e-06,1e-06,1e-06,0,-1e-06,-1e-06,-6e-06,0,1e-06,1e-06,1e-06,-1e-06,0,1e-06,-1e-06,1e-06,-1e-06,1e-06,-1e-06,5e-06,1e-06,1e-06,-2e-06,2e-06,0,-1e-06,0,-8e-06,-3e-06,-2e-06,-1e-06,-1e-06,0,0,-2e-06,0,0,0,0,-1e-06
