0.032706,0.029461,0.02979,0.031638,0.03042,0.029333,0.026304,0.027196,0.027472,0.026184,0.025939,0.024904,0.038508,0.070305,0.072334,0.043075,0.033532,0.061902,0.097905,0.131847,0.246592,0.211213,0.117678,0.203178,0.152005,0.034145,0.020515,0.149085
0.038784,0.035012,0.035345,0.037274,0.035191,0.033218,0.029725,0.030952,0.031753,0.031008,0.030666,0.02991,0.048415,0.087135,0.087864,0.05255,0.040824,0.070149,0.109056,0.148696,0.277723,0.237256,0.126771,0.213584,0.162428,0.039894,0.02445,0.171733
0.047999,0.044011,0.044899,0.046262,0.04163,0.037734,0.034088,0.035885,0.03774,0.038758,0.038055,0.038096,0.065566,0.114043,0.110727,0.066408,0.051626,0.079672,0.121313,0.168494,0.309524,0.263393,0.133202,0.214051,0.168195,0.048633,0.030854,0.202996
0.053681,0.051005,0.05357,0.052552,0.043158,0.03699,0.035158,0.037719,0.040466,0.044501,0.043085,0.043387,0.077502,0.129085,0.1203,0.072108,0.056254,0.080117,0.120631,0.166403,0.292829,0.249089,0.129594,0.202653,0.162238,0.052904,0.034711,0.215731
0.054276,0.053404,0.057988,0.05448,0.041366,0.034215,0.034774,0.03749,0.04066,0.047395,0.045012,0.043742,0.079024,0.130049,0.119269,0.070515,0.05486,0.080516,0.124716,0.161026,0.255922,0.216024,0.12564,0.20142,0.159877,0.052261,0.035768,0.242517
0.052221,0.050184,0.05419,0.050503,0.039347,0.034562,0.036542,0.038496,0.041344,0.047743,0.044381,0.041962,0.077917,0.133331,0.124398,0.07282,0.058321,0.093786,0.152847,0.177375,0.232722,0.191776,0.135195,0.236424,0.184962,0.053779,0.036653,0.314797
0.064524,0.056628,0.054185,0.050593,0.044647,0.042511,0.047522,0.050296,0.050275,0.051868,0.047702,0.047679,0.090679,0.155042,0.142727,0.083673,0.072481,0.124404,0.213604,0.235607,0.267428,0.214985,0.170952,0.325429,0.251928,0.061682,0.04089,0.45719
0.109764,0.093864,0.083327,0.075686,0.069835,0.067234,0.077376,0.082959,0.079183,0.075659,0.066931,0.06675,0.118664,0.192872,0.169384,0.096018,0.090247,0.168217,0.303444,0.331257,0.3615,0.286471,0.222321,0.439882,0.338981,0.073886,0.050809,0.6956
0.186906,0.159268,0.145027,0.131719,0.119082,0.113656,0.12874,0.135413,0.127689,0.119859,0.103093,0.098718,0.156204,0.237573,0.196606,0.10451,0.103958,0.209096,0.402568,0.447699,0.486687,0.379796,0.291512,0.588582,0.446335,0.08985,0.064708,0.967132
0.288198,0.242675,0.230813,0.210116,0.184422,0.176553,0.192812,0.195212,0.185853,0.175033,0.147145,0.136936,0.197292,0.282049,0.224928,0.112707,0.108392,0.242167,0.516153,0.585987,0.617245,0.471008,0.398831,0.829605,0.605256,0.105064,0.079828,1.18689
0.383811,0.31761,0.317515,0.288555,0.247022,0.239625,0.247559,0.238062,0.231214,0.21977,0.180735,0.168203,0.229399,0.306651,0.242384,0.124457,0.111144,0.278747,0.656091,0.748269,0.757478,0.569806,0.55656,1.196187,0.842493,0.12108,0.097673,1.34065
0.423294,0.344242,0.360991,0.326738,0.277142,0.277089,0.272375,0.245726,0.238658,0.229197,0.184952,0.175837,0.231173,0.288099,0.231739,0.131453,0.116742,0.315703,0.806787,0.929835,0.912892,0.675208,0.724411,1.599678,1.106178,0.13623,0.11379,1.52024
0.371953,0.300518,0.325477,0.294516,0.25198,0.258725,0.249938,0.217239,0.204212,0.199074,0.160948,0.155896,0.202881,0.245188,0.211991,0.135441,0.120531,0.334062,0.900026,1.066619,1.051366,0.758381,0.811264,1.807247,1.235397,0.137823,0.117553,1.616088
0.250889,0.205791,0.224131,0.202798,0.175217,0.181805,0.178083,0.156908,0.145806,0.147693,0.12331,0.117895,0.171995,0.236192,0.219972,0.138225,0.112683,0.30778,0.836673,1.031107,1.093477,0.785796,0.750315,1.630678,1.098785,0.117711,0.101855,1.391906
0.140773,0.11629,0.115782,0.106551,0.091839,0.093882,0.095369,0.087113,0.083348,0.093404,0.085699,0.079939,0.159715,0.285765,0.277529,0.151452,0.101556,0.273558,0.674704,0.847243,1.057746,0.794251,0.591238,1.18631,0.790771,0.091167,0.07425,0.928534
0.074002,0.062445,0.051769,0.047894,0.042634,0.04166,0.043224,0.04238,0.043266,0.056469,0.059552,0.057114,0.165996,0.375976,0.388163,0.190838,0.101419,0.277479,0.632202,0.773413,1.034733,0.805816,0.505616,0.953165,0.643348,0.080264,0.05808,0.680895
0.050389,0.046043,0.032699,0.025397,0.02261,0.020961,0.023315,0.029382,0.033288,0.042107,0.04561,0.050053,0.17998,0.473384,0.52001,0.246296,0.113327,0.33943,0.823851,0.981722,1.164499,0.878005,0.578432,1.148892,0.791336,0.093029,0.065568,0.899465
0.05097,0.05197,0.038146,0.023985,0.019928,0.019808,0.02234,0.03033,0.037844,0.043359,0.043089,0.048565,0.187352,0.547373,0.632968,0.299247,0.130121,0.432096,1.068324,1.249415,1.405749,1.037385,0.777512,1.684915,1.187648,0.13335,0.078749,1.168639
0.06337,0.06596,0.05353,0.032456,0.02786,0.029549,0.029175,0.03871,0.050654,0.055735,0.053574,0.054624,0.187353,0.571202,0.68978,0.332626,0.142179,0.515547,1.249183,1.455439,1.745881,1.328542,1.005685,2.287252,1.665275,0.191077,0.085434,1.292221
0.086738,0.088987,0.07584,0.047613,0.043169,0.046202,0.042548,0.051546,0.064299,0.07181,0.07394,0.07334,0.177682,0.533687,0.677124,0.340986,0.148976,0.556461,1.306626,1.537817,2.028769,1.606172,1.155425,2.694156,2.030295,0.244823,0.083007,1.172591
0.108567,0.114212,0.101502,0.06628,0.060786,0.064089,0.058495,0.063332,0.071228,0.082887,0.093377,0.093675,0.161448,0.446685,0.59285,0.320243,0.151245,0.552079,1.242103,1.468124,2.063634,1.676634,1.131393,2.644502,2.05212,0.266121,0.075932,0.856813
0.120197,0.131689,0.117963,0.079977,0.072654,0.075803,0.071786,0.071629,0.070692,0.083009,0.101721,0.105077,0.142032,0.332142,0.444911,0.259791,0.145688,0.502347,1.057753,1.230336,1.748603,1.434793,0.907282,2.062516,1.636054,0.236467,0.071474,0.532712
0.114141,0.131018,0.114971,0.07991,0.075395,0.081886,0.082049,0.078847,0.067978,0.072686,0.097583,0.108488,0.131844,0.275076,0.340069,0.19069,0.130637,0.409136,0.792995,0.890454,1.205844,0.984778,0.595351,1.250728,0.999108,0.17266,0.075256,0.45567
0.102164,0.126802,0.106329,0.070419,0.074531,0.091282,0.091833,0.08191,0.066052,0.064028,0.090468,0.111491,0.135267,0.276717,0.298286,0.135705,0.113306,0.320919,0.579084,0.632481,0.754208,0.596998,0.397745,0.748246,0.578904,0.127,0.086351,0.532448
0.092713,0.112,0.094362,0.061947,0.068007,0.093404,0.093212,0.076004,0.060055,0.055169,0.076777,0.106004,0.141991,0.308285,0.306778,0.108726,0.096568,0.260756,0.439595,0.500043,0.670919,0.554475,0.402082,0.739417,0.55619,0.125836,0.097466,0.635289
0.07852,0.082216,0.076125,0.058436,0.058928,0.07962,0.076335,0.058091,0.046501,0.044328,0.05848,0.085443,0.140653,0.351192,0.347284,0.109381,0.083812,0.214962,0.359462,0.449977,0.702761,0.594392,0.414436,0.752229,0.556635,0.123432,0.099589,0.714794
0.061072,0.05576,0.058919,0.054877,0.049303,0.057263,0.055448,0.045388,0.037931,0.04111,0.049132,0.061045,0.126827,0.381706,0.387425,0.117485,0.079881,0.195175,0.345965,0.470726,0.74372,0.593945,0.371322,0.678584,0.488764,0.100363,0.088194,0.766377
0.045585,0.041403,0.045807,0.04684,0.042216,0.040138,0.039318,0.039127,0.0362,0.042949,0.044685,0.04182,0.114625,0.398121,0.404532,0.117755,0.078839,0.192663,0.381394,0.551143,0.819993,0.600797,0.321168,0.582965,0.39976,0.07532,0.078361,0.802016
0.035201,0.031587,0.032165,0.035911,0.03632,0.031196,0.029958,0.036859,0.03928,0.044308,0.042468,0.033599,0.112623,0.398897,0.3979,0.114955,0.08497,0.219986,0.472871,0.676493,0.920086,0.637453,0.311871,0.566224,0.37208,0.061838,0.076867,0.806451
0.033622,0.028471,0.030828,0.039042,0.042282,0.034619,0.029148,0.03735,0.045274,0.047467,0.046506,0.041445,0.10689,0.35379,0.352996,0.107054,0.098483,0.256369,0.549246,0.766857,1.007688,0.697393,0.342255,0.620037,0.400022,0.060659,0.082863,0.765823
0.04131,0.035855,0.041537,0.052985,0.055252,0.045568,0.038829,0.045825,0.054634,0.051442,0.051761,0.053675,0.090813,0.263236,0.27011,0.096224,0.109904,0.269577,0.558605,0.764297,1.029209,0.730083,0.374801,0.666993,0.41403,0.062913,0.094399,0.696737
0.047237,0.041122,0.048802,0.062617,0.064595,0.053466,0.045705,0.053243,0.063169,0.055666,0.058023,0.062176,0.075989,0.180689,0.19269,0.088869,0.112763,0.252125,0.512373,0.683994,0.991303,0.728737,0.392497,0.690983,0.411717,0.068739,0.099312,0.621233
0.043619,0.037059,0.044984,0.058529,0.06094,0.050615,0.042791,0.050185,0.060323,0.05328,0.057478,0.058424,0.064874,0.160918,0.1778,0.086895,0.102307,0.213801,0.44872,0.617752,0.971507,0.733606,0.405437,0.725444,0.429115,0.07089,0.090379,0.569574
0.032252,0.02499,0.030828,0.041033,0.044896,0.038411,0.03155,0.036786,0.045785,0.047389,0.050089,0.042921,0.052819,0.174474,0.196584,0.082067,0.08866,0.199152,0.449158,0.639003,0.978632,0.739662,0.415505,0.790498,0.489394,0.069484,0.07753,0.550617
0.027091,0.014208,0.016313,0.022304,0.030265,0.030062,0.02338,0.024443,0.02772,0.036554,0.036933,0.026784,0.045245,0.182824,0.20295,0.074258,0.080152,0.197231,0.499346,0.704852,0.99417,0.737391,0.428324,0.882208,0.584072,0.081086,0.071524,0.535063
0.031074,0.014446,0.013535,0.018964,0.026768,0.027518,0.02099,0.020504,0.019355,0.026343,0.026107,0.01654,0.037804,0.183932,0.200569,0.070391,0.080013,0.181858,0.512589,0.755336,1.012015,0.731763,0.459385,0.999595,0.688362,0.097297,0.069631,0.50874
0.032189,0.018875,0.017421,0.0208,0.025505,0.026673,0.021182,0.019207,0.018557,0.02331,0.024791,0.014037,0.03449,0.194394,0.214436,0.073241,0.08328,0.154214,0.461186,0.76552,1.030017,0.723998,0.481476,1.086664,0.758803,0.096978,0.060888,0.486013
0.027222,0.022335,0.021625,0.020993,0.023495,0.025488,0.021702,0.020036,0.02,0.023574,0.024965,0.013989,0.036425,0.208,0.234606,0.08003,0.082437,0.147284,0.398307,0.693113,0.978193,0.707908,0.479713,1.113944,0.773229,0.078288,0.054021,0.479302
0.019474,0.023193,0.024523,0.021975,0.024263,0.027008,0.024838,0.021557,0.019898,0.023341,0.023235,0.015044,0.036636,0.210905,0.252646,0.090276,0.076353,0.158835,0.355546,0.567707,0.86632,0.689146,0.462263,1.099823,0.767077,0.061739,0.050568,0.464248
0.017204,0.023183,0.023564,0.020895,0.022548,0.02534,0.026762,0.020776,0.017037,0.021251,0.019264,0.014661,0.031333,0.19833,0.256439,0.097411,0.071806,0.179378,0.324063,0.498257,0.843263,0.658005,0.443878,1.074721,0.762647,0.056169,0.046906,0.446926
