0.000113,2e-05,5.7e-05,0.000135,2.3e-05,6.8e-05,4.9e-05,4.6e-05,7e-06,7.2e-05,0.000142,3.4e-05,5.2e-05,8e-05,1e-05,4.3e-05,0.000143,8.8e-05,0.000124,2.8e-05,2.2e-05,2e-05,1.8e-05,6.4e-05,0.000177,0.000106,0.00018,8.5e-05,0.00015,7.3e-05,7e-06,4e-05,0.000137,1.1e-05,3.5e-05,3.6e-05,6.5e-05,0.000169,0.000108,2e-05,2.3e-05,3.8e-05,9.3e-05,1.7e-05,3.2e-05,5.5e-05,3.6e-05,0.000102,3.8e-05,0.00017,5e-06,4e-05,0.00011,8e-06,9.3e-05,5.1e-05,6.6e-05,1.7e-05,6.7e-05,5.6e-05,4.3e-05,3.7e-05,8.6e-05,2.5e-05,2.4e-05,3e-05,7.5e-05,3e-05,1e-05,0.00017,8e-06,5.2e-05,2.1e-05,7.1e-05,7.3e-05,1.8e-05,2.9e-05,7e-05,1.3e-05,0.000159,3.8e-05,2.8e-05,1.1e-05,3.9e-05,1.2e-05,5e-05,0.000111,2e-06,1.2e-05,4e-05,3e-05,9e-06,5e-05,5.5e-05,4.9e-05,7.2e-05,2.7e-05,1.7e-05,3.7e-05,3.2e-05,0,4e-06,1e-05,3e-06,1.9e-05,2.3e-05,1e-06,3e-06,1.3e-05,1.2e-05,2.4e-05,1.6e-05,5e-06,1e-06,8e-06,6e-06,3e-06,3e-06,4e-06,5e-06,7e-06
0.000213,9.5e-05,0.00013,0.000336,0.000112,0.000155,2.4e-05,0.000142,0.000135,0.000112,0.000344,8.2e-05,9.3e-05,0.000259,3.6e-05,0.000147,0.000402,0.000172,0.000286,7.2e-05,6.9e-05,6.5e-05,7.1e-05,0.000186,0.000381,0.00018,0.000362,0.000218,0.000345,0.000186,6.4e-05,0.000126,0.000272,9e-05,9.8e-05,0.000195,0.000154,0.000306,0.000235,5.3e-05,4.4e-05,0.000122,0.000191,0.000176,9.5e-05,7.9e-05,0.000152,0.000168,0.000177,0.000405,2.7e-05,8.9e-05,0.00029,2.1e-05,0.000172,4.2e-05,9.2e-05,3.6e-05,0.000111,0.000141,0.000114,0.000154,0.000167,0.000122,0.00011,0.000125,0.000164,9e-05,3.6e-05,0.000361,7.1e-05,9.1e-05,9.7e-05,0.00021,0.000115,6.1e-05,0.000137,9.3e-05,4.7e-05,0.000288,9.4e-05,6.5e-05,4.1e-05,9e-05,1.2e-05,8.6e-05,0.000241,3.2e-05,3.4e-05,7.1e-05,7.8e-05,3.9e-05,0.000125,0.000116,0.000137,8.7e-05,0.000111,5.4e-05,0.000104,3e-05,1.6e-05,7e-06,3.4e-05,2.3e-05,4.6e-05,3e-05,7e-06,2.6e-05,3.5e-05,4.7e-05,5.2e-05,1.1e-05,4.4e-05,2.6e-05,1.3e-05,2.4e-05,1e-05,1e-05,1.2e-05,1.7e-05,1.6e-05
0.000164,0.00018,0.000277,0.000346,0.000248,0.000206,0.00019,0.000194,0.000276,0.000202,0.000451,0.000295,0.00022,0.000324,0.000427,0.000304,0.000482,0.000434,0.000125,0.000325,0.000277,0.000181,0.000348,0.000496,0.000319,0.00036,0.000671,0.000479,0.000677,0.000424,0.000465,0.000381,0.000431,0.000243,0.000295,0.00048,0.000209,0.000527,0.000334,0.000474,0.000252,0.000185,0.000407,0.000497,0.000433,0.000444,0.000271,0.000425,0.000305,0.000401,0.000145,0.000173,0.00052,0.00019,0.000368,0.000187,9.4e-05,0.000426,6.2e-05,0.000208,0.000231,0.000268,0.000394,0.000269,0.000125,8.6e-05,3.8e-05,0.000204,0.000273,0.000242,0.000159,0.000124,4.8e-05,0.000177,0.000217,0.000175,9.5e-05,0.000159,9.5e-05,0.000354,7.7e-05,7.1e-05,9e-05,0.000129,5.3e-05,0.000102,0.000319,7.1e-05,3.1e-05,0.000123,6.1e-05,2e-05,0.000129,0.000134,8.8e-05,0.000105,0.000119,8.8e-05,9.1e-05,1e-04,2.6e-05,3.4e-05,3.5e-05,3.2e-05,8.6e-05,0.000116,4.4e-05,1.1e-05,2.3e-05,5.8e-05,4.8e-05,1.6e-05,3.8e-05,2e-05,1.2e-05,3e-05,1.8e-05,2.5e-05,3.1e-05,8e-06,3.5e-05
9.4e-05,3.8e-05,0.000234,0.00017,0.000516,0.000732,0.000293,0.000403,0.000116,0.000157,4.3e-05,0.000522,0.000503,0.000291,0.000724,0.000413,0.000549,0.000687,0.000777,0.000485,0.00078,0.000747,0.000242,0.000454,0.000643,0.000675,0.000756,0.00022,0.001013,0.000584,0.000328,0.000369,0.00043,0.00043,0.000402,0.000313,0.000509,0.000821,0.00053,0.00031,0.000235,0.000259,0.000664,0.000912,0.000476,0.000217,0.000179,0.000469,0.000621,0.000938,0.000748,0.000669,0.000327,0.000493,0.000298,0.000355,0.00068,0.000734,0.000714,0.000209,0.00044,0.000161,0.000198,0.00015,0.000145,0.000198,0.000394,0.000274,0.00035,0.00056,0.000174,0.000119,0.000255,0.000353,0.000187,7.1e-05,0.000214,0.000129,0.00018,0.000473,0.000127,0.000219,0.000124,0.000118,5.2e-05,0.000171,0.000299,0.000103,1.4e-05,0.000176,2.2e-05,0.000165,0.000272,3.4e-05,0.000204,0.000157,8.1e-05,9.5e-05,8e-05,8.4e-05,6.4e-05,6.4e-05,4.6e-05,5.3e-05,4.6e-05,6.2e-05,2.4e-05,4.8e-05,8e-06,9e-05,0.000105,4.2e-05,2.7e-05,7.1e-05,2.3e-05,1.5e-05,1.4e-05,2.4e-05,1.8e-05,1.9e-05,3.5e-05
0.000749,0.000255,0.000137,0.000425,0.000621,0.000273,0.000631,0.000561,0.000354,0.000244,0.000241,0.000429,0.000735,0.000706,0.000389,0.000188,0.000462,0.000937,0.000249,0.000401,0.000545,0.00036,0.00065,0.00051,0.000516,0.001129,0.001618,0.001567,0.001416,0.000865,0.000566,0.000535,0.000444,0.000335,0.000858,0.001052,0.000705,0.000853,0.000923,0.000707,0.000191,0.000401,0.000932,0.000175,0.000268,0.000422,0.000372,0.000445,0.000222,0.000531,0.000572,0.000747,0.00047,0.000852,0.000874,0.000272,0.000798,0.00147,0.000982,0.000472,0.000215,0.000313,0.000423,0.000116,0.00021,0.000394,0.000554,0.000304,0.000722,0.000974,0.000144,0.00027,0.000385,0.000498,0.000342,0.00033,0.000381,0.000343,0.000406,0.000659,0.000342,0.000546,0.000345,0.000464,0.000212,0.000157,0.000333,0.000353,0.000307,0.000238,0.000417,0.00021,0.000483,0.000167,0.00032,0.00024,0.000184,3.6e-05,0.000141,0.000155,5.9e-05,0.000142,0.000121,6.9e-05,4.2e-05,4.6e-05,0.000165,0.000148,5.9e-05,6.4e-05,7.7e-05,4.4e-05,7e-05,6.1e-05,5.5e-05,4.2e-05,2.5e-05,2.8e-05,1.3e-05,1.8e-05,1.8e-05
0.000324,0.000621,6e-04,0.000609,0.000543,0.000182,0.000487,0.000263,0.00056,0.000497,0.000691,0.000524,0.000478,0.000241,0.000731,0.000361,0.000216,0.000565,0.000237,0.000479,0.000951,0.000318,0.000507,0.000424,0.000519,0.000665,0.000496,0.000774,0.000372,0.00026,0.000391,0.000695,0.000312,0.000206,0.000388,0.000702,0.000285,0.000684,0.000653,0.000473,0.000104,0.000375,0.000169,0.000251,0.000356,0.000409,0.000169,0.000109,0.000323,0.000382,0.000687,0.000204,0.000352,0.000736,0.000423,0.000213,0.00097,0.000248,0.000141,0.000424,0.000222,0.000227,0.000402,0.000392,0.000233,0.000532,0.000736,0.000424,0.000811,0.001559,0.000933,0.00053,0.00027,0.000622,0.000892,0.001014,0.001294,0.001771,0.001818,0.00163,0.001334,0.001425,0.000511,0.00028,0.000321,0.000263,0.000666,0.000607,0.000283,0.00034,0.00074,0.000915,0.000965,0.000792,0.000684,0.000737,0.000266,0.000236,0.000171,0.000397,0.000279,0.00036,0.000464,0.00032,0.000189,0.000149,0.000196,0.000411,0.000189,0.000117,0.000122,0.000134,0.000175,0.000186,8.4e-05,2.3e-05,6.3e-05,6.5e-05,2.8e-05,2.3e-05,1.7e-05
0.000459,0.000326,0.000544,0.000547,0.000162,0.000517,0.000286,0.000589,0.000391,0.00023,0.000641,0.000298,0.00036,0.000446,0.000484,0.000434,0.000305,0.00094,0.000584,0.000286,0.000517,0.000588,7.7e-05,0.000324,0.000506,0.000231,0.00016,0.000668,0.000628,0.000703,0.000746,0.001446,0.000805,0.000234,0.000288,0.000605,0.000443,0.000445,0.000295,0.000417,0.000351,0.000362,0.000607,0.000257,0.00031,0.000408,0.000182,0.000576,0.000608,0.000144,0.000723,0.000589,0.000661,0.000537,0.00073,8.2e-05,0.000681,0.001516,0.000675,0.000782,0.000326,0.00024,0.000273,0.000317,0.000389,0.000733,0.00024,0.000341,0.000708,0.000808,0.00055,0.000309,0.000526,0.000883,0.000867,0.000437,0.000711,0.001734,0.000348,0.000475,0.000418,0.000726,0.001292,0.000769,0.00024,3e-05,0.00116,0.000137,0.000442,0.000469,0.000769,0.000499,0.000123,0.00072,9.2e-05,0.000489,0.000573,0.000205,0.000489,0.000282,0.000185,0.000424,0.000535,0.000476,0.000202,9.6e-05,0.000336,0.000146,0.000244,0.000294,0.000239,0.00013,0.000126,0.000111,3.9e-05,5.4e-05,9.6e-05,7e-05,3.4e-05,5e-06,4.2e-05
0.000338,0.000336,0.000591,0.000458,0.000244,0.000967,0.001284,0.001188,0.000516,0.000175,0.000745,0.000885,0.000404,0.000319,0.000862,0.000648,0.000235,0.001025,6e-04,0.000437,0.000484,0.00052,0.000723,0.00042,0.000375,0.000281,0.000262,0.001371,0.001195,0.000862,0.000852,0.000605,0.000876,0.001356,0.000658,0.000277,0.000453,0.000708,0.000635,0.00034,0.000248,0.000436,0.001213,0.001131,0.00044,0.000513,0.000324,0.000675,1e-04,0.000534,0.000761,0.000681,0.001047,0.001062,0.000298,0.000332,0.000289,0.001498,0.000756,0.00028,0.000885,0.000433,0.000224,0.000594,0.000675,0.000321,0.000303,0.000702,0.000959,0.001481,0.000729,0.000537,0.000696,0.000189,0.000879,0.000852,0.001026,0.000856,0.001901,0.00143,0.000911,0.000187,0.001211,0.00063,0.00021,5.2e-05,0.00123,0.001267,0.000982,0.000233,0.000292,0.000278,0.000184,0.000811,0.000534,0.000572,0.000681,0.000412,0.000532,0.000402,9.7e-05,0.000573,0.000129,0.000268,0.000279,0.000211,0.000212,0.000294,0.000328,9.4e-05,8.7e-05,2.3e-05,7.2e-05,6.1e-05,4.8e-05,7.4e-05,4.6e-05,1.7e-05,1.8e-05,3e-05,2.2e-05
0.000302,0.000373,0.000771,0.000922,0.00041,0.001033,0.00142,7.1e-05,0.000708,0.001206,0.000166,0.0011,0.001288,0.001014,0.000884,0.000698,0.000421,0.000842,0.000787,0.000482,0.000663,0.000309,0.000908,0.000935,9e-04,0.000492,0.000397,0.001836,0.000814,0.001167,0.000726,0.000436,0.000175,0.000782,0.000636,0.000552,0.000652,3.5e-05,0.000335,0.000114,0.000127,0.000759,0.000907,0.000864,0.000799,0.00098,0.000731,0.000413,0.000614,0.000932,0.000168,0.000683,0.001218,0.001146,0.001093,0.001303,0.001043,0.001288,0.001448,0.000955,0.000755,0.00031,0.000506,0.000773,0.000746,0.000273,0.000304,0.000518,6e-04,0.001046,0.001345,0.00037,0.00036,0.000735,0.001163,0.000915,0.000221,0.000679,0.001083,0.001062,0.000185,0.000528,0.000375,0.000468,0.000124,0.000117,0.000809,0.000934,0.000764,0.000768,0.000607,0.000401,0.000323,0.000517,0.000701,0.000156,0.000401,0.000272,0.000338,0.000259,0.000395,0.000474,0.000367,5e-05,0.000168,0.000309,0.000179,0.000135,0.000269,0.000221,0.000104,9.1e-05,9.4e-05,8e-05,6e-05,8e-05,6e-05,2.2e-05,6e-06,2.1e-05,4.2e-05
0.000574,0.000444,0.000133,0.001219,0.002081,0.002041,0.001586,0.001623,0.001666,0.00072,0.001207,0.001008,0.000613,0.00107,0.000241,0.000566,0.000471,0.000432,0.000865,0.000579,0.000734,0.000417,0.000729,0.000427,0.000822,0.00051,0.000526,0.001131,0.000949,0.000831,0.000176,0.000381,0.000421,8e-04,0.000267,0.000343,0.000763,0.000529,0.000515,0.000335,0.000258,0.000489,0.000305,0.000606,0.000407,0.000421,0.000126,0.000506,0.000442,0.000736,0.000703,0.00075,0.000261,0.000394,0.000794,0.001558,0.000499,0.000267,0.001147,0.000721,0.00117,0.001307,0.000702,0.000573,0.000367,0.001052,0.000756,0.000637,0.000812,0.001637,0.00175,0.001192,0.000262,0.001002,0.001629,0.000532,0.000173,0.000203,0.000594,0.000555,0.000551,0.00029,0.000399,0.000614,0.000453,0.000298,0.000709,0.000315,0.000453,0.000338,0.000364,7.8e-05,0.00052,0.000743,0.000153,9.2e-05,0.00018,0.000511,0.000524,0.000115,0.000386,0.00031,0.00011,2.7e-05,8.8e-05,8.6e-05,2.9e-05,0.000145,0.000339,0.000188,8.7e-05,5e-05,1.5e-05,6.9e-05,9.9e-05,7.3e-05,6.3e-05,2e-05,6e-06,1.9e-05,6.5e-05
0.00042,0.000634,0.000676,0.001118,0.001766,0.001294,0.000823,0.00086,0.000502,0.001425,0.000853,0.000254,0.001157,0.001577,0.001192,0.000976,0.000608,0.000544,0.000965,0.000761,0.000213,0.000767,0.000599,0.000539,0.001194,0.001421,0.000635,0.000977,0.000773,0.000666,0.000409,0.00071,0.000609,0.000437,0.001095,0.000501,0.000418,0.00057,0.000901,0.000398,0.000315,0.000776,0.000954,0.000408,0.000553,0.000662,0.00061,0.00078,0.000752,0.000663,0.000328,0.000258,0.000476,9e-05,0.000401,0.000856,0.00088,0.000878,0.000727,0.00052,0.000359,0.000657,0.000647,0.00065,9.9e-05,0.000554,0.000338,0.000125,0.000435,0.000637,0.000519,0.000178,0.000407,0.000993,0.000341,0.000525,0.000607,0.000479,0.000749,0.000173,0.000161,0.000221,0.000473,0.000333,0.000208,0.00011,0.000538,0.000415,0.00021,0.000412,0.000519,0.000347,0.000479,0.000858,0.000772,0.000539,0.000292,0.000523,0.000482,0.000457,0.000338,7.3e-05,7.1e-05,9.5e-05,4.9e-05,6.7e-05,8.4e-05,0.000164,0.000122,0.000212,0.000111,3.1e-05,3.1e-05,3.3e-05,5.6e-05,5.6e-05,3.6e-05,2.5e-05,8e-06,2.1e-05,4.2e-05
0.000468,0.000353,0.00019,0.000209,0.000818,0.000151,0.000246,0.000689,0.000454,0.000641,0.000701,0.000323,0.000779,0.000372,0.000165,0.000519,1.8e-05,4e-04,0.000124,0.000181,0.000426,0.000652,0.00023,0.000422,0.00072,0.000372,0.000242,0.000631,0.000186,0.000138,0.000741,0.000731,0.00041,0.000571,0.000307,0.000162,0.000257,0.000363,0.000479,0.000653,0.000439,0.000789,0.000313,0.000146,0.000341,0.000136,0.000258,0.00035,0.000401,1.7e-05,0.000269,0.000132,0.000191,0.000188,0.000434,0.000182,0.000375,0.000584,0.000253,0.000419,0.000522,6.6e-05,0.000257,0.000345,0.000459,0.000301,7e-04,0.000217,0.000176,0.000644,0.000213,6.8e-05,0.000308,0.000262,0.000347,0.000296,0.000458,0.000141,0.000488,0.000222,0.000262,0.000434,0.000226,0.000245,0.000229,0.000161,0.000307,0.000139,0.000192,0.000197,0.000198,0.000117,0.00023,0.000326,0.000125,0.000163,0.000246,0.000107,0.000152,0.00015,8.8e-05,0.000147,6.6e-05,7.4e-05,2.6e-05,3.6e-05,4e-05,9.1e-05,0.000108,6e-05,1.8e-05,1.4e-05,2.8e-05,3.8e-05,1.6e-05,4.1e-05,1.8e-05,1.4e-05,9e-06,2.5e-05,9e-06
0.000301,0.000176,9.8e-05,0.000285,0.000215,0.000381,0.000155,0.000525,0.000341,0.000369,0.000439,0.000363,0.000589,0.000487,0.000116,0.000232,0.00025,0.000155,0.000218,0.000255,0.000407,0.000387,0.000119,0.000163,0.000384,0.000199,0.000264,0.000404,0.000476,0.000293,0.000451,6.8e-05,0.000301,0.000272,0.000495,0.000236,0.00016,0.000377,0.000119,0.000409,0.000481,0.000418,8.4e-05,0.000239,0.000187,0.000181,0.00032,0.000189,0.000264,0.000107,0.000122,0.000292,0.000191,9.8e-05,0.000197,0.000407,4e-04,0.000281,0.000324,0.000151,0.000219,0.000148,0.000157,4e-05,0.000425,0.000294,0.000419,0.000115,0.000212,0.000392,0.000136,0.000177,0.000265,0.000219,0.000227,0.00016,0.00022,0.000176,6e-05,0.000123,0.000124,0.000267,6.4e-05,0.000178,0.000136,6.1e-05,0.000122,8.3e-05,0.000189,0.000156,0.000104,7.2e-05,0.000182,7.7e-05,1e-04,0.000116,0.000143,0.000207,8.1e-05,0.000174,8.3e-05,2.3e-05,7.6e-05,4.9e-05,6.2e-05,3.6e-05,5.4e-05,6.3e-05,2.5e-05,3.1e-05,4.6e-05,3.6e-05,3.5e-05,3.1e-05,1.9e-05,2.8e-05,1.4e-05,1.5e-05,8e-06,1.8e-05,3.2e-05
0.000169,0.000203,7.6e-05,0.000331,0.00015,0.000477,0.000337,0.000727,0.000544,0.000577,7.8e-05,0.000276,0.00051,0.000246,0.000645,1.4e-05,0.000327,0.000259,0.000583,0.000488,0.000556,0.00046,0.000235,0.000254,0.000432,0.000506,0.000359,0.000487,0.000315,0.000421,0.000422,0.000295,0.000648,0.000411,0.00063,0.000148,0.000402,0.000441,0.000244,0.00107,0.000198,0.000405,0.000172,0.00027,0.000326,0.000158,0.000471,0.000243,0.000338,0.000136,0.000128,0.000403,8.3e-05,0.000194,0.000134,0.000415,0.000432,0.000295,0.000333,0.000193,0.000182,0.000315,9.1e-05,0.000108,0.000336,0.000311,0.00037,0.000291,0.000218,0.000173,0.000211,0.000326,0.000192,0.000215,0.000385,0.000294,0.000343,0.000327,6.7e-05,0.000273,0.000164,0.000116,6e-05,7.3e-05,0.000178,6.9e-05,0.00015,1.1e-05,8.4e-05,0.000197,8e-06,0.000163,6.8e-05,0.000154,0.000268,0.000146,0.000175,0.000166,4.9e-05,0.000118,0.000107,0.000131,0.000119,5.4e-05,4.6e-05,3.7e-05,5.4e-05,9.5e-05,0.000125,1.7e-05,4.6e-05,2.7e-05,2.7e-05,3.7e-05,3.2e-05,4.2e-05,2.4e-05,2.8e-05,9e-06,1.6e-05,4e-05
0.00067,0.000534,0.000481,9.9e-05,9.6e-05,0.000456,0.000236,0.000617,0.001339,8e-04,0.000504,0.000399,0.000922,0.000675,0.001115,0.001102,0.000596,0.000673,0.000264,0.000768,0.000706,0.000568,0.000142,0.000333,0.000894,0.001508,0.000982,0.000425,0.001091,0.001215,0.000428,0.000789,0.000504,0.000256,0.001006,0.00087,0.00017,6e-04,0.00103,0.002093,0.001928,0.000533,0.000477,0.000338,0.000323,0.000369,0.000627,0.000735,0.000333,0.000396,0.000224,0.000464,0.000702,0.000468,0.000833,0.00049,0.001165,0.000711,0.000292,0.000586,0.000167,0.000369,0.000547,0.000352,0.000227,0.000224,0.00065,0.000708,0.000653,0.00025,0.000261,0.000569,0.00054,0.000503,0.000845,0.000421,0.00045,0.000524,0.000318,0.000345,0.000294,0.000161,0.000388,0.000189,0.000122,0.000139,8.1e-05,0.000126,0.000356,0.000419,0.000156,0.000272,6.5e-05,0.000281,0.000482,0.00032,8.6e-05,0.000155,0.000149,9.9e-05,3.3e-05,8.1e-05,9.9e-05,0.000103,4.1e-05,6.4e-05,8.5e-05,9.8e-05,5.9e-05,9.7e-05,5.4e-05,6.5e-05,4e-05,3.2e-05,7.2e-05,1.8e-05,2e-05,2.1e-05,2.1e-05,1.9e-05,3.7e-05
0.001673,0.000687,0.000266,0.000103,0.000653,0.000552,0.000266,0.000688,0.00116,0.001526,0.001529,0.001461,0.001905,0.001907,0.001434,0.000324,0.000691,0.000395,4e-04,0.000594,0.000357,0.000572,0.000573,0.000429,0.000764,0.001609,0.000968,0.000245,0.001439,0.002224,0.002361,0.001732,0.001776,0.001639,0.00188,0.002103,0.001452,0.001485,0.001867,0.001447,0.001286,0.001214,0.000914,0.000903,0.000976,0.00126,0.000247,0.000856,0.001292,0.000759,0.000426,0.000733,0.000936,0.000812,0.001319,0.001661,0.002419,0.001941,0.001106,0.000749,0.000765,0.000909,0.001139,0.001061,0.000905,0.000139,0.000887,0.001308,0.000654,0.000781,0.000528,0.000564,0.000557,0.000162,0.000725,0.001232,0.000765,0.000649,0.000496,0.000265,0.000388,0.000137,0.000885,0.001016,0.000688,0.000448,0.00034,0.000253,0.000365,0.00058,0.000422,0.000413,0.000533,0.000593,0.000882,0.000561,0.000399,0.000183,0.000134,1e-04,9.7e-05,6.9e-05,0.000148,0.000129,9.5e-05,0.000136,5.2e-05,9.8e-05,1.1e-05,3.9e-05,6e-05,9e-05,0.000101,6.7e-05,4.6e-05,2.9e-05,2.4e-05,2.1e-05,1.7e-05,1.6e-05,3e-05
0.000523,0.000299,0.000183,0.000154,0.000674,0.000393,0.000566,0.000774,6e-05,0.000778,0.00064,0.000233,0.000919,0.000473,0.000369,0.000206,0.000781,0.000567,0.000464,9.3e-05,0.000272,0.000513,0.000301,0.000207,0.00074,0.000626,0.00047,0.000324,0.000957,0.000995,0.000631,0.000642,0.000872,5e-04,0.000491,0.000937,0.000463,0.00079,0.000682,0.00022,0.000643,0.000295,3e-04,0.000152,0.000356,0.00098,0.000936,0.000308,0.000448,0.000332,0.000238,0.000425,0.00039,0.000632,0.000367,0.000713,0.000813,0.000106,0.00029,0.000446,0.000505,0.000347,0.000406,0.000709,0.000506,0.000756,0.000936,4e-04,0.00029,0.000637,0.000166,0.000325,0.000235,0.000295,0.000369,0.000574,0.000656,0.000595,0.000347,0.000319,0.000288,0.000366,0.00079,0.000558,0.000213,8.8e-05,0.000185,0.000211,0.000188,0.000236,0.000132,0.00024,0.000199,0.000409,0.000262,0.000134,2e-04,0.000134,8.3e-05,2.8e-05,8.2e-05,5.7e-05,8.8e-05,4.5e-05,8.4e-05,0.000131,6.3e-05,8.4e-05,5.9e-05,2.4e-05,3.1e-05,3.1e-05,1.6e-05,2e-05,3.4e-05,5.7e-05,1.2e-05,1.5e-05,3.5e-05,3.2e-05,5.3e-05
0.000196,0.000245,5.4e-05,8.1e-05,0.000291,0.000254,0.000454,0.000197,0.000175,0.000244,0.000284,0.000299,0.000286,0.000243,0.000175,0.000201,0.000473,0.000163,0.000186,0.000259,0.000279,0.000221,0.00027,0.000311,0.000493,0.000318,0.000243,0.000221,0.000374,0.000606,2e-04,0.000538,0.000364,0.000222,0.000328,0.000341,0.000203,0.000144,0.000569,0.000177,0.000219,0.000236,9.9e-05,0.000218,0.000422,0.000419,0.000131,0.000202,9.5e-05,0.000234,0.000217,0.000312,8.4e-05,0.000339,0.000553,0.000294,0.00035,0.000439,0.000266,0.000323,0.000297,0.000261,0.000171,0.000425,6.6e-05,0.00035,8.5e-05,0.000157,0.000119,0.000194,0.000196,6.7e-05,0.000293,7.7e-05,0.00032,0.000246,0.000103,0.000168,8.6e-05,0.000141,0.000145,0.00022,0.000366,0.000131,0.000202,9.3e-05,0.000139,0.000118,9.5e-05,3.1e-05,0.000135,0.000132,0.000165,0.000135,0.000152,3.3e-05,8.1e-05,8.8e-05,5.2e-05,1.3e-05,5.4e-05,2.6e-05,8.7e-05,4.6e-05,5.2e-05,4.8e-05,3.7e-05,1.1e-05,3e-05,3.7e-05,2.3e-05,2.7e-05,9e-06,2.4e-05,2.1e-05,4.2e-05,2.3e-05,8e-06,2.3e-05,6.2e-05,6.6e-05
0.000247,0.000271,0.000168,0.000125,0.000282,3.6e-05,0.00023,0.000293,7.4e-05,0.000263,0.000346,0.000402,0.000268,0.000151,9.5e-05,0.000183,0.000174,0.000193,0.000123,0.000293,0.000164,0.000158,7.4e-05,0.000156,0.000191,4.8e-05,0.000235,6.9e-05,0.000276,0.000282,9.2e-05,0.000247,0.00029,0.00018,0.000226,0.00012,0.000183,0.00023,0.000299,0.000239,0.000117,0.00019,0.000152,0.000303,0.000357,4.7e-05,0.000299,0.000155,6e-05,0.000152,5.9e-05,0.00025,0.000158,0.000156,0.000353,0.000354,0.000354,0.000356,4.8e-05,0.000117,0.000244,0.000212,0.000109,0.000292,2.9e-05,0.00018,0.000128,8.4e-05,3.8e-05,5.4e-05,0.000187,3.6e-05,6.1e-05,0.000103,0.000264,0.000239,0.000135,0.000214,0.000221,0.000204,0.000163,0.000239,0.000229,0.000178,7.2e-05,8.5e-05,8.8e-05,0.000114,7e-06,2.3e-05,9.1e-05,0.000104,0.000139,9.8e-05,0.000101,7e-05,2.5e-05,2.4e-05,2.8e-05,1.3e-05,3.1e-05,1.7e-05,5.6e-05,9e-06,5.5e-05,1.1e-05,3.4e-05,1.1e-05,2.3e-05,2.9e-05,2.7e-05,2.2e-05,3.6e-05,4.3e-05,6.6e-05,4.8e-05,2.7e-05,1.2e-05,1e-05,8e-05,8e-06
0.000183,6.8e-05,0.000194,4.5e-05,0.000339,6.9e-05,4.1e-05,0.000132,0.000211,0.000299,9.8e-05,0.000142,0.000246,6.6e-05,0.000125,0.000179,0.000148,0.000165,5.1e-05,0.000177,1e-04,0.000118,0.000201,3.8e-05,0.00019,0.000129,7.9e-05,8.7e-05,0.000317,0.000159,0.000177,2.4e-05,0.000107,0.000155,0.000254,0.000168,6.8e-05,0.000236,0.000237,0.00011,3.2e-05,0.000152,0.000129,0.00015,0.000216,6e-05,0.000173,0.000106,3.5e-05,4.7e-05,5e-05,0.000147,9.2e-05,6.5e-05,0.000295,0.00023,9.9e-05,0.00032,0.000163,0.000113,3.8e-05,0.000125,3.8e-05,0.000231,1.3e-05,4.9e-05,7.7e-05,6.9e-05,2.9e-05,0.000166,6.5e-05,0.000126,0.000147,0.00011,9.6e-05,4.3e-05,0.000132,0.000217,0.00012,9e-05,0.000105,0.000156,0.000217,7.2e-05,7.6e-05,5.6e-05,4e-05,0.000102,5.2e-05,5.6e-05,6.2e-05,0.000126,9.2e-05,5.8e-05,5.8e-05,5.7e-05,8e-06,1.6e-05,3.9e-05,1.6e-05,1e-05,2.9e-05,2.3e-05,1.9e-05,4e-05,0,2.3e-05,2.3e-05,1.6e-05,5e-06,4e-06,1.2e-05,1.1e-05,3.4e-05,5.7e-05,7.5e-05,5.8e-05,4.9e-05,1.9e-05,0.000103,0.000104
8.9e-05,0.000158,0.000211,0.000218,0.000156,0.000219,0.000124,0.000145,5.6e-05,0.000171,1e-04,0.000167,0.000129,1.4e-05,3.7e-05,6.7e-05,9e-05,0.000141,0.000121,0.000101,6.2e-05,8e-05,0.00017,8.2e-05,0.000132,0.000149,2.1e-05,4.7e-05,0.000232,0.000172,0.000111,0.000164,0.000159,6.3e-05,0.000177,5.6e-05,8e-05,6.6e-05,0.000167,4.5e-05,7.5e-05,0.000206,4.6e-05,8.6e-05,9.2e-05,0.000125,3.3e-05,9.5e-05,0.000105,0.000101,0.000119,0.000107,3.8e-05,6.9e-05,0.000192,0.000188,0.000217,0.00016,4.2e-05,0.000119,0.00015,1e-04,3e-05,0.000198,1e-06,7.4e-05,6.6e-05,6.2e-05,8.9e-05,9.9e-05,7e-06,3e-05,0.000152,1.4e-05,0.000102,3.8e-05,7.3e-05,3.2e-05,0.000151,0.000119,1.2e-05,0.000151,0.000185,7.5e-05,6.8e-05,1.6e-05,5.3e-05,7.6e-05,2.7e-05,4.3e-05,1.7e-05,0.000115,8.7e-05,7e-05,6e-05,2.8e-05,2.9e-05,1.8e-05,1.3e-05,1.9e-05,1.4e-05,2.6e-05,3e-05,1.3e-05,1.8e-05,4e-06,1.2e-05,2.5e-05,7e-06,9e-06,5e-06,1.7e-05,1.7e-05,1.8e-05,4e-05,6.4e-05,6e-05,2.9e-05,9e-06,8e-05,5.4e-05
5e-06,8.4e-05,5.3e-05,0.000143,0.000109,0.000106,6.5e-05,2.3e-05,0.000136,0.000128,5.3e-05,0.000121,3.7e-05,0.000121,2.4e-05,2e-05,8.4e-05,5.6e-05,7.8e-05,8.7e-05,4.9e-05,7.3e-05,0.00011,1.9e-05,0.000181,0.000176,5.4e-05,9e-05,0.000192,0.000177,3e-05,0.000116,0.000138,0.000105,0.000125,2.7e-05,0.000122,5e-05,0.000162,7.7e-05,7.4e-05,0.000109,2.9e-05,6.6e-05,0.000115,3.8e-05,0.000115,4.6e-05,5.7e-05,9.2e-05,8.3e-05,0.000129,3.1e-05,0.000154,0.000173,0.000163,0.000109,0.000147,8e-06,4.8e-05,9.9e-05,4.8e-05,1.3e-05,0.000105,5.1e-05,8.1e-05,0.000113,4e-05,3.3e-05,9.1e-05,3.8e-05,4.2e-05,9.9e-05,2.9e-05,5.7e-05,4.2e-05,4.6e-05,4.3e-05,8.3e-05,6.6e-05,6.6e-05,0.000134,0.000126,5.7e-05,4.6e-05,1.5e-05,3.1e-05,5.3e-05,2.3e-05,1.7e-05,2e-06,7.1e-05,6.3e-05,5.2e-05,5.4e-05,1.9e-05,1.1e-05,1.5e-05,2.4e-05,2e-05,1e-05,2.8e-05,4.3e-05,8e-06,2.4e-05,8e-06,1.8e-05,2e-05,8e-06,8e-06,1.3e-05,1.7e-05,2e-06,1.3e-05,2.6e-05,4.6e-05,2e-05,2.9e-05,2.9e-05,3.1e-05,3.6e-05
2.2e-05,4.3e-05,4.6e-05,4.6e-05,7.1e-05,1.8e-05,2.7e-05,7e-06,8e-05,3.8e-05,2.4e-05,7.5e-05,2.2e-05,4.5e-05,5.9e-05,2e-05,5.6e-05,4.8e-05,2.4e-05,5e-05,2.9e-05,4.7e-05,4.4e-05,4e-06,7.5e-05,6.6e-05,3.1e-05,1.9e-05,9.3e-05,7.3e-05,3.2e-05,3.9e-05,5.9e-05,3.6e-05,6.8e-05,1.9e-05,3.7e-05,2.2e-05,7.9e-05,3.6e-05,9e-06,5.6e-05,1.6e-05,1.8e-05,6.1e-05,3e-05,6.8e-05,3.1e-05,1.3e-05,6.2e-05,6e-06,5.4e-05,3.2e-05,5.6e-05,9.8e-05,5.6e-05,7.5e-05,6.5e-05,2.4e-05,3.1e-05,1.8e-05,3.2e-05,1.5e-05,9.8e-05,2e-05,3e-05,2.5e-05,1.3e-05,1.8e-05,4.3e-05,2.4e-05,1.8e-05,2.7e-05,4e-06,2.2e-05,1.7e-05,1.9e-05,9e-06,5.2e-05,2.1e-05,2.5e-05,6.4e-05,4.8e-05,2.4e-05,2.7e-05,1e-06,1.6e-05,3.4e-05,1.2e-05,7e-06,4e-06,2.4e-05,3.5e-05,1.4e-05,1.8e-05,1e-05,2e-05,3e-06,1.1e-05,8e-06,1.2e-05,6e-06,1.8e-05,4e-06,1.2e-05,7e-06,7e-06,1.1e-05,2e-06,3e-06,4e-06,2e-06,7e-06,9e-06,8e-06,2.1e-05,1.5e-05,8e-06,1.5e-05,2.4e-05,3e-05
1.9e-05,2.3e-05,3.4e-05,1.9e-05,3.1e-05,4.6e-05,3.1e-05,4e-06,7e-05,5.2e-05,2.4e-05,5e-05,2.9e-05,3.4e-05,3.4e-05,8e-06,5e-05,3.6e-05,1.3e-05,4.1e-05,1.2e-05,1.9e-05,4.7e-05,5e-06,4.8e-05,5.6e-05,2.9e-05,2.8e-05,8.6e-05,5.6e-05,1e-05,3.6e-05,4.8e-05,3.1e-05,5.7e-05,2.1e-05,6.9e-05,3.8e-05,7.3e-05,4.4e-05,1.9e-05,2.2e-05,4e-06,2.9e-05,6.5e-05,4.3e-05,2.8e-05,3e-05,2.1e-05,3.2e-05,1.6e-05,4.8e-05,3.7e-05,6.3e-05,8.9e-05,3.6e-05,5.9e-05,6.7e-05,3.8e-05,1.3e-05,2.8e-05,1.7e-05,3.1e-05,7.3e-05,2.4e-05,2.6e-05,2.9e-05,1e-05,2.8e-05,3.1e-05,1.2e-05,8e-06,4.1e-05,1e-05,3.1e-05,1.6e-05,9e-06,2.2e-05,4.2e-05,2e-05,1.6e-05,6.7e-05,5.2e-05,2.9e-05,1.8e-05,6e-06,1.4e-05,3.3e-05,6e-06,2e-06,2e-06,2.7e-05,2e-05,1.6e-05,1.5e-05,2.1e-05,5e-06,7e-06,5e-06,1.1e-05,9e-06,1e-05,1.5e-05,2e-06,1e-05,6e-06,7e-06,9e-06,4e-06,5e-06,4e-06,3e-06,8e-06,1.1e-05,5e-06,1.6e-05,3e-06,3e-06,1e-05,1e-05,1.2e-05
3.3e-05,1.6e-05,1.6e-05,2e-05,4.6e-05,5e-06,2e-05,3e-05,8.4e-05,3.9e-05,5.7e-05,7.7e-05,4.5e-05,1.5e-05,1.4e-05,4e-05,3.5e-05,3.2e-05,2e-05,5.3e-05,2.4e-05,2.7e-05,4.4e-05,2.6e-05,5.3e-05,7.8e-05,3.8e-05,3.2e-05,6.3e-05,4.5e-05,1.7e-05,3e-05,4.3e-05,3.5e-05,7.4e-05,3.3e-05,5.6e-05,1.1e-05,0.000111,1.7e-05,6e-06,3.7e-05,1.8e-05,2e-05,5.7e-05,5.2e-05,7.6e-05,4.4e-05,1.4e-05,9e-06,1e-05,2.6e-05,8e-06,3.6e-05,7.8e-05,4e-05,5e-05,7.1e-05,2.4e-05,1.7e-05,6.1e-05,3.1e-05,1.5e-05,6.2e-05,3.5e-05,1.8e-05,3.4e-05,9e-06,3.3e-05,4.1e-05,2.4e-05,9e-06,3.8e-05,6e-06,3.5e-05,8e-06,1.1e-05,1.1e-05,4.6e-05,1.4e-05,1.8e-05,5.8e-05,3.3e-05,3.1e-05,2.4e-05,1.4e-05,1.7e-05,2.7e-05,1e-06,1.1e-05,8e-06,3.2e-05,2.4e-05,9e-06,1.6e-05,2.5e-05,2e-05,1.1e-05,5e-06,1.1e-05,4e-06,1.3e-05,1.4e-05,2e-06,7e-06,4e-06,7e-06,5e-06,3e-06,2e-06,3e-06,1e-06,6e-06,7e-06,1.2e-05,1.9e-05,1.3e-05,7e-06,3e-06,7e-06,4e-06
3.9e-05,4e-05,4.7e-05,5.1e-05,4.8e-05,1.5e-05,1.7e-05,5.8e-05,0.000108,7.1e-05,0.000101,7.2e-05,1.2e-05,2.7e-05,5.6e-05,7.6e-05,6.6e-05,0.000122,5.7e-05,6.1e-05,4.9e-05,2.5e-05,6.6e-05,5.3e-05,5.4e-05,8.4e-05,0.000104,6.3e-05,1e-04,7e-05,4e-06,5.9e-05,8.7e-05,6.6e-05,4.3e-05,1.1e-05,4.7e-05,3.1e-05,9.9e-05,4.5e-05,3.8e-05,7.1e-05,2.2e-05,2.5e-05,3.5e-05,4.8e-05,2.5e-05,4.2e-05,4.8e-05,3.5e-05,1.6e-05,4.6e-05,2.9e-05,2.1e-05,7.5e-05,7.2e-05,5.7e-05,9.6e-05,7e-05,5.1e-05,4.5e-05,4.6e-05,2.1e-05,7.4e-05,3e-05,5.2e-05,2.2e-05,2.6e-05,6e-06,1e-05,2.8e-05,2.6e-05,2.1e-05,9e-06,3.4e-05,7e-06,1.7e-05,3.2e-05,4.7e-05,1.9e-05,7e-06,6.1e-05,3.7e-05,2.7e-05,2.2e-05,1.3e-05,1e-05,3.4e-05,2e-06,1.5e-05,1e-05,3.2e-05,2.3e-05,1.5e-05,2e-06,1.3e-05,1.7e-05,5e-06,1.1e-05,1.1e-05,3e-06,7e-06,1.5e-05,3e-06,1e-05,2e-06,8e-06,1.1e-05,6e-06,4e-06,1e-06,2e-06,2e-06,4e-06,1.4e-05,1.2e-05,8e-06,5e-06,3e-06,8e-06,8e-06
2.1e-05,4.7e-05,2.9e-05,4.7e-05,0.000102,5.6e-05,8e-06,8.6e-05,0.000111,7.7e-05,2.5e-05,8.1e-05,2.7e-05,6.7e-05,6.7e-05,7.7e-05,6.6e-05,5.1e-05,4.4e-05,5.7e-05,7.2e-05,0.000107,4.4e-05,3.4e-05,2.3e-05,4e-05,0.000112,0.000151,0.000123,0.000132,0.000102,3.2e-05,1.8e-05,4.1e-05,4.7e-05,1.9e-05,6.7e-05,3e-05,2.8e-05,3.9e-05,6.8e-05,5.6e-05,2.9e-05,2.5e-05,6e-05,2.9e-05,7.2e-05,1.8e-05,6.7e-05,8.8e-05,8e-05,5.2e-05,6.1e-05,0.000106,7.8e-05,7.2e-05,1e-05,0.000132,2.2e-05,0.000102,0.000123,7.2e-05,6e-05,5.6e-05,4.2e-05,3.1e-05,5e-05,4e-05,3.6e-05,7.8e-05,5.9e-05,3.3e-05,2e-05,2.6e-05,6.6e-05,2.6e-05,1.5e-05,1.3e-05,4.1e-05,1.1e-05,3.1e-05,4e-05,4e-05,4.3e-05,1.5e-05,3e-05,1.3e-05,3.7e-05,1.2e-05,2.1e-05,3.8e-05,3.9e-05,1e-05,1.5e-05,9e-06,1.5e-05,1.9e-05,8e-06,4e-06,1.6e-05,1.8e-05,1.2e-05,1.2e-05,1.1e-05,5e-06,4e-06,1e-05,3e-06,4e-06,2e-06,3e-06,4e-06,1e-06,3e-06,1.1e-05,1e-06,7e-06,3e-06,9e-06,5e-06,1.1e-05
4.3e-05,3.9e-05,5.9e-05,5.5e-05,5.7e-05,3.7e-05,4.8e-05,6.3e-05,5.3e-05,4.4e-05,2.8e-05,4.1e-05,2.6e-05,8.3e-05,4.3e-05,4.4e-05,2.7e-05,5.1e-05,2e-05,2.6e-05,7.6e-05,2.4e-05,7e-05,3e-05,1.8e-05,3.6e-05,3.8e-05,4.7e-05,2e-05,1.5e-05,3.8e-05,6.7e-05,6.2e-05,2.4e-05,7.7e-05,2.6e-05,4.5e-05,4e-05,5.7e-05,1.2e-05,4.4e-05,5.4e-05,1.7e-05,2.4e-05,3.4e-05,2e-06,2.5e-05,2.5e-05,8.3e-05,5.7e-05,2.3e-05,1.8e-05,4.9e-05,6.2e-05,0.000109,7e-05,9.7e-05,6.6e-05,6.9e-05,6.9e-05,3.9e-05,4.5e-05,2.6e-05,0.000112,3.8e-05,1.4e-05,2.9e-05,3e-05,3.5e-05,8.9e-05,6.5e-05,4.9e-05,4.1e-05,7e-06,5.9e-05,3.4e-05,1.7e-05,3.8e-05,1.7e-05,5.1e-05,6.3e-05,7.5e-05,1.3e-05,6.8e-05,4.1e-05,4.6e-05,2.4e-05,1.3e-05,2e-05,3.3e-05,5.3e-05,3.8e-05,3e-05,2.5e-05,7e-06,1.4e-05,3.4e-05,1.2e-05,1.6e-05,2e-05,2.3e-05,1.8e-05,9e-06,6e-06,1.4e-05,6e-06,9e-06,1.2e-05,7e-06,6e-06,4e-06,4e-06,4e-06,5e-06,6e-06,3e-06,9e-06,7e-06,8e-06,7e-06,1.7e-05
2.3e-05,4e-05,1.3e-05,0.000112,0.000119,4e-06,2.4e-05,3.1e-05,4.1e-05,5.5e-05,2e-05,5.8e-05,8.4e-05,5.6e-05,7.7e-05,6.7e-05,5.8e-05,2.7e-05,2.7e-05,6.1e-05,7e-05,4.7e-05,0.000102,3.1e-05,4.2e-05,3.4e-05,4e-05,1.6e-05,5.6e-05,1.4e-05,6.7e-05,3.8e-05,1.9e-05,4.2e-05,6.1e-05,5.8e-05,4.9e-05,1.1e-05,7.4e-05,4.5e-05,4e-06,8.1e-05,2.9e-05,5.7e-05,2e-05,3.9e-05,5.6e-05,5.6e-05,7.6e-05,5.9e-05,3.2e-05,1.2e-05,4e-05,8.2e-05,0.000128,8.7e-05,7.4e-05,2.8e-05,4.8e-05,4.4e-05,8.8e-05,6.9e-05,4.2e-05,0.000121,2.3e-05,6e-05,7.3e-05,5.1e-05,4.4e-05,5.3e-05,5.5e-05,2e-05,7.7e-05,4.2e-05,3.8e-05,2.3e-05,4.7e-05,9.4e-05,8.9e-05,6.5e-05,1.8e-05,5.3e-05,4.1e-05,7.6e-05,4.8e-05,3.8e-05,6.3e-05,3.8e-05,6.5e-05,4.3e-05,1.2e-05,1.5e-05,1.7e-05,2.1e-05,2.5e-05,5.2e-05,5.1e-05,2.1e-05,2.1e-05,1.8e-05,6e-06,7e-06,1.6e-05,1.5e-05,1.3e-05,5e-06,9e-06,2e-06,7e-06,1e-06,3e-06,4e-06,5e-06,5e-06,5e-06,6e-06,3e-06,3e-06,5e-06,8e-06,4e-06
8.6e-05,2.7e-05,3.2e-05,0.000145,0.000118,8.7e-05,0.000105,2.4e-05,2.7e-05,4.9e-05,7.2e-05,0.000147,2.1e-05,6.6e-05,8.6e-05,7.6e-05,2.7e-05,6.1e-05,1.9e-05,7e-05,0.000111,2e-05,0.000129,7.9e-05,6.2e-05,7e-05,7.8e-05,9.3e-05,7.8e-05,9.3e-05,4.2e-05,0.000118,0.000117,0.000128,8.3e-05,0.000123,4.7e-05,4.9e-05,7.8e-05,5.4e-05,7.1e-05,4.6e-05,1.4e-05,6.7e-05,0.00012,6.7e-05,0.000144,8e-05,6.2e-05,9.9e-05,7.5e-05,7.9e-05,4.2e-05,5.6e-05,0.000134,9.5e-05,4.7e-05,8.6e-05,7.7e-05,0.00016,0.000194,6.2e-05,8.2e-05,0.000137,8.6e-05,9e-05,3e-05,9.1e-05,6.1e-05,9.2e-05,0.000163,9.1e-05,3.9e-05,4.2e-05,8.7e-05,5.8e-05,6.2e-05,7.6e-05,3.1e-05,1.5e-05,4.9e-05,8.6e-05,6.2e-05,2.3e-05,3.2e-05,3.9e-05,8e-05,6.7e-05,6.5e-05,6e-05,6.2e-05,1.6e-05,3.3e-05,3.4e-05,3.7e-05,7.7e-05,5.2e-05,3.3e-05,2e-05,3e-05,2.4e-05,1.2e-05,1.4e-05,2.1e-05,1e-05,1.1e-05,1.5e-05,4e-06,7e-06,8e-06,2e-06,2e-06,5e-06,2e-06,1e-06,4e-06,1e-06,6e-06,4e-06,1.5e-05,1.3e-05
0.000132,0.000123,3.3e-05,1e-04,7.3e-05,4e-05,0.000101,0.000118,8.6e-05,0.000101,0.000106,0.000188,0.00019,0.000169,2.4e-05,0.000112,0.000117,8.7e-05,4.7e-05,4e-05,4.7e-05,9.6e-05,0.000147,0.000111,5e-06,4.8e-05,5.1e-05,7.7e-05,3.7e-05,8e-05,0.000115,0.00021,0.000129,8.1e-05,6.2e-05,4.9e-05,9.9e-05,0.00012,5.4e-05,9.8e-05,1e-04,7.2e-05,6.1e-05,5.1e-05,7.3e-05,7.3e-05,0.000104,0.000159,0.000161,8.3e-05,2.3e-05,4.3e-05,8e-06,7.7e-05,0.000179,0.000241,0.000181,1.2e-05,0.000118,0.000144,5.7e-05,8.2e-05,0.000115,0.000166,2e-04,8.7e-05,4.5e-05,0.000106,9.3e-05,4.4e-05,0.000127,8.7e-05,6e-05,9e-05,0.000124,6.7e-05,4.1e-05,8e-05,7.8e-05,3.1e-05,7.1e-05,0.000108,0.000121,8.4e-05,8.4e-05,3.1e-05,5.4e-05,2e-06,3.3e-05,7.9e-05,1e-04,5.9e-05,5.3e-05,2.3e-05,4.8e-05,0.000111,9.3e-05,5.9e-05,2.9e-05,1.5e-05,1.3e-05,2e-06,3.3e-05,4.7e-05,3.8e-05,2.3e-05,1.6e-05,2.7e-05,1.2e-05,1e-05,5e-06,6e-06,7e-06,2e-06,5e-06,8e-06,3e-06,5e-06,8e-06,2.1e-05,8e-06
5.1e-05,6.5e-05,8.9e-05,9.6e-05,9.3e-05,2.6e-05,8.5e-05,0.000105,4.4e-05,7e-05,4.8e-05,8.1e-05,6.5e-05,3.3e-05,6.3e-05,6.1e-05,6.3e-05,2.1e-05,2.7e-05,3.1e-05,1e-05,5.6e-05,7.6e-05,5.3e-05,5.3e-05,3e-05,4.8e-05,1e-05,6.4e-05,6.4e-05,7.1e-05,7.9e-05,5e-05,2.6e-05,4.1e-05,6.7e-05,2.6e-05,1.6e-05,4.1e-05,9.7e-05,3e-05,2.5e-05,3.7e-05,8.5e-05,4.7e-05,4.8e-05,2e-05,4.5e-05,3.7e-05,2.4e-05,3.7e-05,6.5e-05,3.9e-05,8.9e-05,5.7e-05,6.2e-05,5.2e-05,4.3e-05,7.8e-05,2.9e-05,1.2e-05,2.7e-05,3.1e-05,6.5e-05,6.8e-05,3.3e-05,3.6e-05,5.8e-05,3e-05,9.2e-05,1.7e-05,1.2e-05,3.2e-05,6.8e-05,1.9e-05,4.8e-05,4.8e-05,4.3e-05,9e-06,1e-05,5.9e-05,2.2e-05,4.7e-05,4.3e-05,1.4e-05,1.9e-05,1.9e-05,2e-06,2.2e-05,5.5e-05,3.3e-05,3.3e-05,1.2e-05,2.5e-05,3.7e-05,2.2e-05,1e-05,1.6e-05,5e-06,4e-06,8e-06,1.8e-05,2.4e-05,3.5e-05,1.8e-05,6e-06,1.4e-05,1.4e-05,4e-06,2e-06,3e-06,6e-06,5e-06,2e-06,1.2e-05,7e-06,5e-06,7e-06,5e-06,2.9e-05,1.7e-05
1.6e-05,1e-05,5.8e-05,5e-05,4.4e-05,1.7e-05,3.2e-05,3.8e-05,3e-05,1.6e-05,7.5e-05,4.4e-05,7e-05,2.6e-05,4e-05,2.3e-05,4.2e-05,2.5e-05,1.1e-05,9e-06,1.8e-05,3.2e-05,4.2e-05,2.8e-05,2.8e-05,4.6e-05,2e-05,8e-06,4e-05,4.3e-05,2.1e-05,3.9e-05,4.5e-05,2.8e-05,2.1e-05,2.2e-05,3e-06,1.3e-05,6e-05,1.7e-05,1.4e-05,4e-06,5e-05,1.6e-05,3.5e-05,2.9e-05,1.4e-05,1.9e-05,2.3e-05,2.1e-05,9e-06,3.6e-05,4.3e-05,4e-05,2e-05,1.6e-05,5.9e-05,3.3e-05,3.8e-05,4.6e-05,2.2e-05,2.4e-05,1.8e-05,3e-05,2.4e-05,1.6e-05,5e-06,2e-05,1.6e-05,6.7e-05,2.6e-05,2e-06,3e-05,3.4e-05,1.4e-05,2.7e-05,2.9e-05,1.6e-05,1.9e-05,1.2e-05,2.5e-05,2.1e-05,4.9e-05,2.7e-05,1e-05,1e-05,1.5e-05,1.4e-05,1.4e-05,3.9e-05,1.1e-05,2.6e-05,6e-06,1.9e-05,2e-05,1.5e-05,6e-06,1.2e-05,4e-06,2e-06,5e-06,1.5e-05,2e-05,1.1e-05,7e-06,6e-06,2e-06,6e-06,3e-06,2e-06,5e-06,5e-06,9e-06,2e-06,1.2e-05,1.2e-05,9e-06,7e-06,7e-06,2e-05,1.7e-05
1.7e-05,6e-06,4.7e-05,4e-05,4.4e-05,1.7e-05,1.8e-05,2e-05,3.2e-05,5e-06,5.4e-05,3.5e-05,4.2e-05,1.1e-05,1.4e-05,2.1e-05,2.5e-05,2.5e-05,1.1e-05,1.6e-05,2.3e-05,1.7e-05,3.3e-05,1.2e-05,2.9e-05,2e-05,9e-06,1.5e-05,4.5e-05,2e-05,2.4e-05,4.1e-05,3.6e-05,1.1e-05,2e-05,2e-05,9e-06,2.3e-05,5.5e-05,2.8e-05,1.4e-05,2.1e-05,1.3e-05,1.8e-05,3.4e-05,2.6e-05,2.1e-05,3.1e-05,2.7e-05,1.5e-05,1e-05,4.8e-05,2.1e-05,2.9e-05,2.7e-05,2.7e-05,5.3e-05,3.6e-05,2e-05,5e-05,2.8e-05,1.5e-05,2.1e-05,2e-05,2.4e-05,1e-05,6e-06,2.2e-05,1.9e-05,5.3e-05,1.8e-05,1.8e-05,1.5e-05,2.8e-05,2e-05,1.9e-05,1.5e-05,1e-06,2.2e-05,1.6e-05,2.2e-05,4.1e-05,2.5e-05,2.5e-05,8e-06,8e-06,1.2e-05,1.8e-05,1.1e-05,3.1e-05,4e-06,2.1e-05,1.5e-05,2e-05,1.2e-05,9e-06,5e-06,1e-05,2e-06,2e-06,8e-06,8e-06,8e-06,1e-05,3e-06,2e-06,3e-06,1.2e-05,4e-06,4e-06,3e-06,4e-06,1e-05,1e-05,1e-05,2.5e-05,1e-05,8e-06,1.4e-05,1.8e-05,1.3e-05
6e-06,1.2e-05,3e-05,4.2e-05,4.8e-05,1.4e-05,1.8e-05,2.6e-05,3.1e-05,3e-06,3.7e-05,5e-05,3e-05,4e-06,1.2e-05,3.3e-05,3.9e-05,1.8e-05,5e-06,6e-06,1.2e-05,2.7e-05,1e-05,9e-06,3.3e-05,3.2e-05,9e-06,7e-06,3.5e-05,3e-05,2.7e-05,2e-05,4.2e-05,2.5e-05,2.1e-05,1.9e-05,6e-06,1.2e-05,4.9e-05,3.1e-05,1.6e-05,1.3e-05,1.8e-05,1.1e-05,3.1e-05,1.6e-05,1.5e-05,1.8e-05,1.2e-05,8e-06,2.1e-05,2.5e-05,1.6e-05,2.9e-05,3e-05,1.8e-05,5.3e-05,5.3e-05,4.2e-05,2.3e-05,1.2e-05,5e-06,1.5e-05,2.3e-05,3.1e-05,1.3e-05,1e-05,2.3e-05,4e-06,4.1e-05,1.1e-05,3e-06,2.5e-05,1e-05,1.5e-05,2.6e-05,3.2e-05,5e-06,1.7e-05,1.6e-05,2.6e-05,3.8e-05,2.6e-05,1.5e-05,1.2e-05,6e-06,8e-06,1.8e-05,1.3e-05,1.9e-05,9e-06,2.3e-05,1.3e-05,1.6e-05,1.3e-05,1.9e-05,6e-06,1.1e-05,3e-06,2e-06,1e-05,8e-06,1.7e-05,1e-05,8e-06,3e-06,6e-06,1e-05,4e-06,6e-06,5e-06,8e-06,4e-06,1.6e-05,1.4e-05,1.6e-05,1e-05,2e-06,9e-06,1.1e-05,1.2e-05
1.4e-05,1.1e-05,2.7e-05,5e-05,3.2e-05,2.2e-05,1.1e-05,1.2e-05,2.8e-05,1.3e-05,2.6e-05,3.1e-05,4.7e-05,2e-05,9e-06,1.4e-05,3.4e-05,2.6e-05,9e-06,4e-06,1.6e-05,1.7e-05,1.7e-05,1.2e-05,3.3e-05,2.2e-05,1.3e-05,1.5e-05,3.3e-05,2.5e-05,1.5e-05,1.2e-05,4e-05,2.3e-05,9e-06,7e-06,1e-05,1.9e-05,5e-05,1.6e-05,1.2e-05,3.1e-05,1.5e-05,9e-06,3.2e-05,1.5e-05,9e-06,1.5e-05,1.3e-05,1e-05,1.6e-05,3.6e-05,2.5e-05,2.6e-05,3.4e-05,1.7e-05,5.7e-05,4.7e-05,2.5e-05,1.7e-05,2e-06,1.5e-05,9e-06,2.6e-05,2.3e-05,5e-06,7e-06,1.4e-05,1.1e-05,4.7e-05,3e-06,6e-06,2.9e-05,3e-06,1.6e-05,2.4e-05,2e-05,1e-05,1.3e-05,1.4e-05,2.4e-05,4.3e-05,2.2e-05,2.5e-05,1.5e-05,7e-06,1.6e-05,1.5e-05,1.3e-05,2.6e-05,6e-06,2.5e-05,1.6e-05,1.7e-05,1.4e-05,1.2e-05,8e-06,7e-06,1e-06,4e-06,6e-06,8e-06,1.3e-05,6e-06,9e-06,1e-06,2e-06,8e-06,2e-06,3e-06,5e-06,6e-06,9e-06,1e-05,9e-06,6e-06,4e-06,7e-06,5e-06,1.3e-05,1.1e-05
5e-06,7e-06,2.3e-05,3.5e-05,4.2e-05,2e-05,3e-06,3e-06,2.4e-05,1.3e-05,3.5e-05,2.6e-05,3.1e-05,5e-06,2.1e-05,5e-06,1.8e-05,1.9e-05,1e-05,5e-06,8e-06,1.7e-05,1.8e-05,6e-06,2.4e-05,2.5e-05,1.2e-05,1.3e-05,3.7e-05,2.6e-05,4e-06,2.8e-05,3.3e-05,3.1e-05,1.9e-05,1.8e-05,6e-06,1.3e-05,5.5e-05,1.5e-05,6e-06,2.9e-05,2.2e-05,9e-06,3.7e-05,1.9e-05,1.5e-05,8e-06,6e-06,5e-06,1.2e-05,3.2e-05,2.2e-05,2.3e-05,3.2e-05,1e-05,5.1e-05,5e-05,2.2e-05,2.3e-05,1.4e-05,1.5e-05,1.7e-05,2.5e-05,1.3e-05,5e-06,5e-06,1.1e-05,1.6e-05,4.7e-05,2e-06,1e-05,2.3e-05,6e-06,1.5e-05,1.6e-05,2.4e-05,7e-06,3.1e-05,1.5e-05,2.4e-05,3.7e-05,2.4e-05,2.3e-05,6e-06,8e-06,1.4e-05,2.2e-05,1.7e-05,2.3e-05,5e-06,1.3e-05,1.4e-05,1.1e-05,7e-06,9e-06,4e-06,7e-06,4e-06,4e-06,2e-06,5e-06,1.1e-05,8e-06,6e-06,2e-06,2e-06,6e-06,2e-06,1e-06,4e-06,1e-06,4e-06,1.1e-05,3e-06,1.4e-05,1e-05,4e-06,3e-06,5e-06,6e-06
2e-06,1.4e-05,2.6e-05,2.8e-05,5.2e-05,1e-05,8e-06,2e-06,3.2e-05,9e-06,3.1e-05,3.9e-05,3.4e-05,1.2e-05,8e-06,9e-06,2.7e-05,2e-05,6e-06,7e-06,1.3e-05,1.8e-05,1.3e-05,5e-06,2.1e-05,1.4e-05,1.5e-05,1.9e-05,4.3e-05,2.3e-05,1.5e-05,1.9e-05,4.3e-05,1.4e-05,1.4e-05,1.8e-05,2e-06,1.6e-05,5.2e-05,1.9e-05,8e-06,2.5e-05,1.6e-05,7e-06,3e-05,7e-06,1e-05,6e-06,9e-06,3e-06,9e-06,3.3e-05,2.3e-05,2.3e-05,3.1e-05,1.9e-05,4.9e-05,5e-05,1.9e-05,2.6e-05,1e-06,3e-06,2.1e-05,2.8e-05,2.7e-05,1.2e-05,4e-06,1.4e-05,6e-06,3.9e-05,9e-06,8e-06,2.7e-05,5e-06,1.7e-05,1.7e-05,1.9e-05,2e-06,2.6e-05,1.2e-05,2.5e-05,4.1e-05,3.1e-05,1.7e-05,9e-06,8e-06,1.6e-05,1.5e-05,1e-05,2.5e-05,4e-06,1.6e-05,1.8e-05,1.2e-05,5e-06,1e-05,5e-06,9e-06,1e-06,2e-06,6e-06,7e-06,7e-06,5e-06,3e-06,2e-06,4e-06,6e-06,3e-06,6e-06,4e-06,1e-06,3e-06,7e-06,3e-06,1.2e-05,1e-05,4e-06,2e-06,5e-06,7e-06
2e-06,1e-05,2.1e-05,3.5e-05,5.5e-05,1.2e-05,7e-06,5e-06,3.4e-05,5e-06,2.3e-05,3.5e-05,3.4e-05,1e-05,7e-06,1.4e-05,2.1e-05,2e-05,8e-06,4e-06,1.2e-05,1.9e-05,1.5e-05,4e-06,1.9e-05,1.7e-05,5e-06,1.8e-05,3.6e-05,2.5e-05,4e-06,8e-06,3.3e-05,2.4e-05,1.4e-05,1.3e-05,8e-06,7e-06,4.9e-05,8e-06,4e-06,2.6e-05,1.1e-05,2e-06,2.8e-05,8e-06,1.5e-05,1.1e-05,6e-06,1.3e-05,1.4e-05,3.3e-05,1.8e-05,2.4e-05,3.9e-05,1.4e-05,4.9e-05,4.6e-05,2e-05,1.8e-05,1.6e-05,8e-06,1.6e-05,2.5e-05,2.4e-05,6e-06,3e-06,1e-05,7e-06,3.3e-05,8e-06,1.5e-05,2.3e-05,8e-06,2.4e-05,1.4e-05,1.6e-05,3e-06,2.1e-05,5e-06,2.5e-05,4.1e-05,2.8e-05,1.1e-05,1.5e-05,1e-06,1.3e-05,1.6e-05,8e-06,2.2e-05,2e-06,1.8e-05,1.7e-05,8e-06,8e-06,9e-06,5e-06,7e-06,2e-06,1e-06,4e-06,1e-05,9e-06,6e-06,4e-06,2e-06,3e-06,8e-06,3e-06,3e-06,2e-06,1e-06,0,6e-06,4e-06,5e-06,4e-06,1e-06,1e-06,9e-06,7e-06
4e-06,4e-06,2.3e-05,2.9e-05,4.6e-05,2.2e-05,3e-06,2e-06,3.5e-05,6e-06,2.8e-05,3.4e-05,2.9e-05,8e-06,1.1e-05,1.3e-05,2.3e-05,1.5e-05,4e-06,1e-06,1.3e-05,2.2e-05,1.3e-05,5e-06,2.1e-05,2.8e-05,1e-05,1.8e-05,3.3e-05,3.5e-05,1.2e-05,1.3e-05,2.3e-05,1.6e-05,7e-06,1.9e-05,1.1e-05,1.4e-05,4.8e-05,1e-05,3e-06,3e-05,1.3e-05,1.1e-05,2.2e-05,7e-06,1.1e-05,1.3e-05,1e-06,8e-06,1.3e-05,2.7e-05,1.8e-05,1.8e-05,3.5e-05,1.1e-05,5e-05,4.5e-05,1.9e-05,1.6e-05,2.3e-05,2e-05,1.7e-05,3.2e-05,2e-05,2e-06,2e-06,1e-05,8e-06,3.6e-05,1e-05,3e-06,1.6e-05,2e-06,2.8e-05,1.7e-05,1.6e-05,4e-06,3.1e-05,1.6e-05,1.9e-05,4.2e-05,3.1e-05,2e-05,1.1e-05,6e-06,1.1e-05,2e-05,9e-06,2.1e-05,4e-06,1.3e-05,1.3e-05,9e-06,8e-06,1e-05,1e-06,4e-06,3e-06,5e-06,4e-06,9e-06,8e-06,5e-06,5e-06,1e-06,1e-06,8e-06,0,1e-06,2e-06,1e-06,2e-06,6e-06,4e-06,4e-06,1e-06,2e-06,1e-06,8e-06,7e-06
4e-06,4e-06,2e-05,2.5e-05,4.8e-05,2e-05,1.2e-05,4e-06,3.3e-05,5e-06,2.7e-05,3.4e-05,2.6e-05,7e-06,1.2e-05,9e-06,2.3e-05,1.7e-05,9e-06,2e-06,8e-06,2.2e-05,1.9e-05,5e-06,1.9e-05,3.1e-05,4e-06,1.3e-05,3.7e-05,3.4e-05,4e-06,9e-06,2.5e-05,1.6e-05,1.4e-05,1.2e-05,2e-06,2e-05,4.6e-05,1.4e-05,9e-06,2.5e-05,1e-05,6e-06,2.5e-05,1.1e-05,1.2e-05,1.2e-05,2e-06,7e-06,1.1e-05,2.8e-05,1.6e-05,2.2e-05,3.8e-05,1e-05,5.2e-05,4.2e-05,1.8e-05,1.9e-05,1.4e-05,1.1e-05,1.2e-05,3.1e-05,1.6e-05,1e-06,3e-06,7e-06,1.2e-05,3.5e-05,8e-06,8e-06,2.6e-05,3e-06,1.7e-05,1.3e-05,1.9e-05,3e-06,2.5e-05,1.3e-05,2.5e-05,4.6e-05,2.6e-05,1.8e-05,9e-06,5e-06,1.1e-05,1.5e-05,7e-06,1.9e-05,3e-06,1.7e-05,1.3e-05,1e-05,7e-06,1.2e-05,6e-06,6e-06,4e-06,2e-06,3e-06,7e-06,6e-06,7e-06,6e-06,1e-06,2e-06,7e-06,2e-06,2e-06,2e-06,1e-06,2e-06,5e-06,4e-06,2e-06,2e-06,0,1e-06,5e-06,1e-06
0,5e-06,2.2e-05,2.7e-05,4e-05,1.1e-05,7e-06,2e-06,3.1e-05,1e-06,2.7e-05,3.6e-05,2.4e-05,9e-06,1.1e-05,1.4e-05,1.8e-05,1.6e-05,7e-06,4e-06,9e-06,1.7e-05,2e-05,4e-06,2e-05,2.7e-05,3e-06,1.1e-05,3.6e-05,2.8e-05,1e-05,1.1e-05,2.8e-05,1.8e-05,1.5e-05,6e-06,6e-06,1.5e-05,4.9e-05,9e-06,6e-06,2.4e-05,1.3e-05,4e-06,2.7e-05,9e-06,1.3e-05,9e-06,1e-06,6e-06,9e-06,2.7e-05,1.7e-05,1.9e-05,3.6e-05,1.5e-05,4.8e-05,4.6e-05,1.5e-05,1.5e-05,1e-05,1.2e-05,1.1e-05,3e-05,1.7e-05,1e-06,5e-06,4e-06,1e-05,3.5e-05,7e-06,7e-06,2.2e-05,2e-06,1.3e-05,1.3e-05,1.9e-05,2e-06,2.2e-05,1.2e-05,2.2e-05,4.1e-05,2.8e-05,1.9e-05,1e-05,4e-06,1e-05,1.6e-05,6e-06,1.9e-05,3e-06,1.9e-05,1.3e-05,1.1e-05,5e-06,1.2e-05,3e-06,4e-06,3e-06,1e-06,4e-06,8e-06,8e-06,5e-06,4e-06,1e-06,1e-06,6e-06,1e-06,1e-06,1e-06,1e-06,2e-06,5e-06,3e-06,1e-06,2e-06,0,1e-06,3e-06,1e-06
