0.019521,0.024506,0.024755,0.019845,0.01837,0.017971,0.016389,0.013903,0.012444,0.014404,0.016011,0.013152,0.011632,0.014829,0.016887,0.014601,0.011473,0.010491,0.011204,0.01204,0.012319,0.0123,0.011466,0.011215,0.011534,0.011565,0.011117,0.010955
0.02664,0.033396,0.033565,0.026639,0.024799,0.023883,0.020711,0.017308,0.016032,0.018904,0.021163,0.017548,0.015501,0.019903,0.022853,0.019804,0.015386,0.013861,0.014596,0.015301,0.015866,0.016152,0.014984,0.014847,0.015296,0.014976,0.014221,0.014429
0.039885,0.049922,0.050153,0.039413,0.036625,0.034756,0.028719,0.023661,0.022602,0.026904,0.03059,0.026026,0.023113,0.029737,0.034258,0.029608,0.022792,0.02035,0.021076,0.0214,0.02258,0.023393,0.021423,0.02158,0.022387,0.021602,0.020214,0.021024
0.051579,0.063948,0.064626,0.05119,0.046897,0.044267,0.036603,0.030583,0.029123,0.033607,0.038758,0.034662,0.031663,0.039797,0.044748,0.038738,0.030375,0.027189,0.027538,0.027431,0.029616,0.031104,0.028361,0.028232,0.029549,0.029356,0.027594,0.028536
0.058523,0.07122,0.073111,0.060362,0.053674,0.050992,0.044876,0.038894,0.035593,0.038311,0.044419,0.042789,0.040864,0.048479,0.051703,0.045848,0.038419,0.03474,0.033794,0.033561,0.037821,0.04022,0.036384,0.034202,0.036493,0.039824,0.039578,0.039353
0.069027,0.083658,0.086951,0.075924,0.066658,0.06476,0.061433,0.053784,0.046168,0.046091,0.053824,0.056276,0.05518,0.061209,0.062314,0.057861,0.052408,0.046933,0.043818,0.044325,0.0523,0.056881,0.051275,0.045055,0.048828,0.057357,0.059556,0.057606
0.094259,0.115138,0.117964,0.103813,0.093684,0.09382,0.091457,0.078746,0.065524,0.063462,0.0737,0.080133,0.078678,0.084751,0.085738,0.081365,0.075374,0.06587,0.06096,0.0634,0.074333,0.081338,0.074798,0.06532,0.069631,0.081277,0.084456,0.08091
0.1305,0.153273,0.151707,0.133159,0.127203,0.131672,0.127608,0.107162,0.090323,0.088111,0.098452,0.105972,0.10378,0.110818,0.111958,0.105656,0.098005,0.087535,0.084927,0.087789,0.096237,0.104921,0.099967,0.089191,0.092239,0.103527,0.10511,0.099461
0.162048,0.179843,0.173555,0.154855,0.157542,0.167087,0.157011,0.128936,0.113806,0.112577,0.117539,0.120902,0.122693,0.13386,0.13108,0.120845,0.112019,0.10539,0.109823,0.111034,0.111291,0.119885,0.119155,0.111138,0.112964,0.120273,0.117402,0.107756
0.178548,0.189216,0.184842,0.17031,0.17375,0.182925,0.168357,0.141959,0.133459,0.132653,0.129204,0.121854,0.131972,0.151005,0.142392,0.130887,0.121784,0.119757,0.131043,0.129562,0.122596,0.130217,0.132608,0.129783,0.130997,0.132452,0.126608,0.113814
0.182396,0.191279,0.191044,0.178645,0.173176,0.175388,0.162964,0.149951,0.150721,0.150585,0.141494,0.121148,0.133542,0.155523,0.143827,0.138367,0.133896,0.134155,0.148685,0.144795,0.13331,0.141283,0.144357,0.144895,0.148897,0.143094,0.130511,0.119082
0.187995,0.189861,0.187248,0.18128,0.172259,0.159448,0.147712,0.153531,0.16818,0.173519,0.162313,0.132131,0.134918,0.149816,0.137595,0.142296,0.146611,0.145259,0.158483,0.151154,0.135474,0.145654,0.149182,0.149321,0.157327,0.145272,0.123376,0.118718
0.18022,0.176698,0.172215,0.172473,0.172129,0.151482,0.134942,0.149138,0.172862,0.187462,0.173642,0.139123,0.132451,0.137224,0.127081,0.134157,0.141862,0.141696,0.155796,0.147343,0.127083,0.135764,0.137728,0.133809,0.143696,0.136568,0.114662,0.115345
0.151499,0.149661,0.144415,0.145116,0.154018,0.136643,0.115927,0.1294,0.154085,0.173798,0.158834,0.128561,0.12488,0.123555,0.112789,0.110829,0.116663,0.125146,0.142426,0.132713,0.106701,0.110856,0.11273,0.103708,0.108685,0.111167,0.100667,0.105734
0.128127,0.128408,0.120214,0.117602,0.124903,0.1106,0.093771,0.100532,0.115086,0.13196,0.122781,0.10355,0.105929,0.105705,0.09708,0.088028,0.089202,0.101505,0.120031,0.110415,0.084973,0.089947,0.093446,0.080109,0.076791,0.084704,0.083195,0.086291
0.147879,0.149108,0.135894,0.122717,0.113095,0.104697,0.097455,0.088445,0.091261,0.100123,0.090985,0.081805,0.09665,0.110468,0.103065,0.088235,0.080878,0.081393,0.094381,0.09188,0.078531,0.091081,0.097654,0.080337,0.069594,0.076512,0.08088,0.083963
0.226204,0.226327,0.203352,0.17099,0.13795,0.129755,0.13379,0.115226,0.111957,0.118821,0.102601,0.090396,0.123672,0.159887,0.148085,0.123864,0.110025,0.096729,0.104474,0.110691,0.10717,0.126985,0.134571,0.105984,0.08542,0.098541,0.111785,0.116038
0.322775,0.316888,0.281549,0.231512,0.186236,0.177837,0.18388,0.160306,0.159208,0.177352,0.153397,0.124682,0.176372,0.233827,0.209626,0.172486,0.154996,0.131381,0.140504,0.161198,0.158839,0.174107,0.179143,0.141556,0.117675,0.140495,0.153644,0.155027
0.398953,0.389454,0.338231,0.282603,0.239132,0.226996,0.227171,0.199656,0.205691,0.24195,0.212515,0.163236,0.226833,0.30481,0.273753,0.222749,0.202849,0.171114,0.184836,0.227559,0.216721,0.213375,0.213571,0.17111,0.152378,0.187392,0.192315,0.190284
0.43162,0.424097,0.352244,0.311319,0.289983,0.283965,0.27661,0.22908,0.233884,0.282918,0.256435,0.194894,0.25352,0.338631,0.311962,0.259415,0.250122,0.218278,0.228221,0.28571,0.260811,0.242536,0.245094,0.196747,0.181995,0.224276,0.219362,0.217028
0.431019,0.414338,0.320841,0.3013,0.322128,0.349355,0.340308,0.247723,0.231116,0.278559,0.267312,0.218151,0.266756,0.333741,0.308364,0.278204,0.299428,0.278964,0.261151,0.302179,0.276242,0.258789,0.267724,0.218683,0.198225,0.230529,0.225281,0.235176
0.378392,0.346174,0.262573,0.27265,0.32348,0.380859,0.373419,0.245146,0.210092,0.251282,0.260523,0.233424,0.271686,0.310742,0.277588,0.274337,0.325979,0.32576,0.267234,0.267865,0.267257,0.2613,0.263361,0.223561,0.20051,0.209349,0.206299,0.23424
0.290964,0.266171,0.214381,0.24528,0.297173,0.344898,0.334045,0.224837,0.205872,0.237983,0.246586,0.229435,0.250272,0.264176,0.237854,0.251081,0.30507,0.322706,0.24754,0.2072,0.224574,0.232612,0.225844,0.19791,0.177421,0.176923,0.176188,0.203371
0.234628,0.203832,0.164907,0.196714,0.240555,0.258666,0.237811,0.178661,0.178553,0.196211,0.203775,0.195457,0.19851,0.202606,0.202917,0.231788,0.260107,0.267867,0.221403,0.166729,0.16456,0.174825,0.174555,0.159945,0.135847,0.135105,0.140495,0.168884
0.202144,0.164165,0.135713,0.15184,0.173147,0.173608,0.161679,0.138817,0.133282,0.141423,0.163572,0.15927,0.137846,0.131378,0.148242,0.193237,0.202504,0.187925,0.172204,0.127696,0.112108,0.127641,0.132804,0.129921,0.113685,0.101913,0.10087,0.129137
0.152956,0.116939,0.11277,0.121112,0.122986,0.120212,0.112959,0.108887,0.108189,0.120406,0.153059,0.136967,0.092476,0.087948,0.110913,0.143511,0.134445,0.113587,0.116232,0.092398,0.082491,0.096559,0.097637,0.10803,0.110374,0.089989,0.077979,0.093216
0.103693,0.071285,0.084681,0.101967,0.101852,0.092764,0.080682,0.087272,0.09446,0.116181,0.152952,0.124199,0.070422,0.07222,0.091184,0.095869,0.078365,0.066783,0.072453,0.06912,0.072896,0.076639,0.072479,0.093091,0.103429,0.082842,0.06977,0.074948
0.078702,0.051456,0.064963,0.083712,0.08475,0.079615,0.073045,0.075519,0.087403,0.108504,0.127199,0.102418,0.060722,0.057544,0.065367,0.061309,0.049816,0.048849,0.059308,0.065428,0.070263,0.069893,0.065657,0.077309,0.08111,0.065261,0.055537,0.060179
0.075488,0.057986,0.062131,0.074912,0.077189,0.073341,0.06642,0.060627,0.073318,0.08571,0.081847,0.068354,0.051674,0.047662,0.047547,0.043265,0.038338,0.042326,0.054508,0.06301,0.062414,0.063721,0.063634,0.059905,0.05593,0.047778,0.04322,0.050316
0.079688,0.071158,0.072773,0.079392,0.077763,0.067492,0.058459,0.050588,0.060094,0.063347,0.054365,0.050423,0.051017,0.052845,0.046527,0.039071,0.034555,0.036133,0.047301,0.055715,0.051618,0.055504,0.061083,0.056785,0.051486,0.041258,0.037503,0.044925
0.077402,0.079439,0.084847,0.089556,0.088096,0.073338,0.060129,0.057556,0.068518,0.062731,0.051955,0.052293,0.058559,0.060294,0.050671,0.04449,0.038039,0.036557,0.042804,0.047206,0.04507,0.048524,0.058142,0.065486,0.064811,0.053229,0.044609,0.041158
0.076321,0.083418,0.09259,0.098261,0.098652,0.081167,0.063349,0.065412,0.076789,0.061046,0.047342,0.053577,0.063037,0.062494,0.051489,0.046712,0.043365,0.043968,0.044702,0.039413,0.037573,0.046244,0.060066,0.07311,0.074168,0.063499,0.053453,0.043434
0.070253,0.075932,0.083828,0.088078,0.089167,0.075839,0.059098,0.061883,0.071647,0.052043,0.036503,0.046352,0.055848,0.054618,0.046062,0.04416,0.045691,0.046492,0.046257,0.036529,0.03285,0.044302,0.057971,0.067721,0.067189,0.061081,0.053869,0.043273
0.055408,0.05766,0.059812,0.06024,0.060097,0.054679,0.044685,0.047682,0.055375,0.039093,0.024259,0.031985,0.038834,0.037578,0.034204,0.039132,0.042115,0.040247,0.044315,0.03791,0.030355,0.035932,0.044085,0.047772,0.04691,0.046545,0.04513,0.041053
0.043633,0.046187,0.043687,0.037664,0.03067,0.031364,0.031173,0.037949,0.041842,0.02576,0.01507,0.022023,0.027387,0.024053,0.024518,0.03326,0.031786,0.030218,0.041921,0.039244,0.02743,0.024248,0.02604,0.026686,0.031611,0.035516,0.03501,0.035528
0.03569,0.044678,0.047366,0.034377,0.01985,0.021151,0.024427,0.032483,0.030179,0.016237,0.012128,0.021258,0.025805,0.020788,0.023193,0.029033,0.02267,0.021128,0.034316,0.034827,0.024026,0.018452,0.019614,0.021898,0.028165,0.030731,0.02968,0.028421
0.028752,0.040678,0.048837,0.036044,0.018829,0.016802,0.021196,0.027866,0.021634,0.0106,0.011001,0.023519,0.027937,0.022353,0.024052,0.025202,0.019989,0.018176,0.023638,0.026435,0.022683,0.017341,0.021111,0.02313,0.02366,0.023989,0.026418,0.024079
0.023461,0.033213,0.043516,0.036026,0.021097,0.014908,0.016618,0.021509,0.015793,0.007918,0.010104,0.023861,0.025929,0.021176,0.02761,0.025896,0.019809,0.018904,0.016989,0.021009,0.02136,0.018173,0.022206,0.02062,0.016298,0.015571,0.020993,0.018969
0.017973,0.02474,0.034718,0.03634,0.025068,0.015374,0.015326,0.017901,0.011173,0.005108,0.008266,0.021008,0.021551,0.018463,0.031805,0.030393,0.0217,0.020058,0.017264,0.020954,0.019235,0.017064,0.02045,0.015965,0.011753,0.012139,0.018255,0.015055
0.015411,0.022141,0.028774,0.033462,0.027379,0.016452,0.01703,0.018291,0.009641,0.003771,0.006449,0.016653,0.020457,0.021606,0.035609,0.031382,0.020393,0.019253,0.017992,0.020117,0.01778,0.015187,0.016854,0.01466,0.011218,0.012933,0.019409,0.016062
