0.000181,7.6e-05,5.9e-05,0.000282,6e-05,0.000364,0.000103,0.000332,2.1e-05,0.000407,0.00011,0.000104,0.000203,8.8e-05,5.8e-05,1.9e-05,0.000115,2.6e-05,0.000215,0.000204,1.4e-05,0.000211,2e-05,1.2e-05,1.8e-05,2.8e-05,8.8e-05,5.4e-05,0.000191,2.9e-05,7.2e-05,0.000182,9e-06,7.1e-05,0.000233,0.000107,5e-06,9.6e-05,0.000255,4.3e-05,0.000171,1.9e-05,5.5e-05,6e-05,8.2e-05,0.000189,0.000211,4.2e-05,0.000289,4.6e-05,0.00018,5.2e-05,2.5e-05,3.1e-05,0.000101,5e-06,0.000167,0.000128,4.2e-05,0.000184,0.000145,0.00013,0.00011,9.9e-05,0.000186,0.000187,2e-05,0.000139,7.2e-05,0.00015,0.000183,3.3e-05,4.8e-05,8.5e-05,3.1e-05,2e-06,0.000158,0.000193,6.9e-05,2.8e-05,5.8e-05,0.000132,0.000108,0.000218,7.9e-05,6e-06,0.000134,1e-05,0.000142,3.1e-05,2.1e-05,0.000114,0.00024,0.000234,1.9e-05,8.8e-05,0.000199,5e-06,0.000235,6e-05,0.000102,1.9e-05,0.00024,0.00018,0.000207,9.5e-05,6.7e-05,1.2e-05,4.3e-05,8.3e-05,0.00021,6.7e-05,8.3e-05,0.000252,0.000132,0.000115,0.000194,5.8e-05,1.4e-05,9.7e-05,2e-06
0.000352,0.000116,0.000242,0.000406,0.000201,0.000611,0.000387,0.000433,0.000311,0.000478,0.000643,9.1e-05,0.000613,0.000126,1.7e-05,0.000108,0.000191,8.4e-05,0.000292,0.000599,0.000501,0.000528,0.000234,8.2e-05,4e-05,0.000167,0.000304,0.000166,0.00052,0.000232,0.00017,0.000281,8.5e-05,0.000156,0.000558,0.000498,0.000383,0.000438,0.000473,0.000314,0.000416,0.000303,0.000512,0.000235,0.000195,0.000375,0.000518,0.000427,0.000367,7.8e-05,0.00024,0.000138,0.000154,6.5e-05,0.00019,2.8e-05,0.000455,0.000732,0.000517,7.4e-05,0.000344,0.00018,0.000222,0.00045,0.000522,0.000378,0.000213,0.000328,4.2e-05,0.000177,0.000473,0.00013,0.000167,0.00017,4.7e-05,0.000145,0.00016,0.000376,0.000245,0.000218,0.000194,0.000311,0.000415,0.000623,0.000411,0.000196,0.000332,0.000108,0.00025,7.3e-05,0.000152,0.000287,0.000415,0.000796,0.000698,0.000441,0.00027,0.000264,0.000226,0.000258,0.000365,6.1e-05,0.000519,0.000431,0.000534,0.000386,0.000348,0.000149,0.000135,0.000237,0.000421,0.000427,0.000406,0.000422,0.000182,0.000316,0.000508,0.000237,6.9e-05,0.000146,9.6e-05
0.000407,0.000194,0.000289,0.000824,0.000472,0.000671,0.000295,0.00058,0.000241,0.000225,0.000466,0.000624,0.001066,0.000293,0.000398,0.000374,7.2e-05,0.000341,0.000194,0.000751,0.000496,0.000635,7.1e-05,0.00026,0.000303,8.5e-05,0.000151,0.000494,0.000945,0.000218,0.00014,0.000493,6.4e-05,8.9e-05,0.000254,0.000269,0.000566,0.00045,0.000553,6e-04,0.00043,0.000402,0.00053,0.00023,0.000461,0.000466,0.00046,0.000546,0.000682,0.000147,9.1e-05,0.00017,0.000603,0.000444,0.000309,0.000227,0.000616,0.00081,0.000321,0.000146,3.4e-05,0.000581,0.00054,0.000514,0.000634,0.000845,0.000652,0.000517,0.000144,0.000184,0.000144,0.000158,0.000331,9.7e-05,0.000109,0.00037,0.000767,0.000408,0.000596,0.000851,0.000736,0.000452,0.000571,0.00035,0.000745,0.000568,0.00052,0.000313,0.000373,0.000271,0.00023,0.000497,0.000431,0.000649,0.00055,8.5e-05,0.000562,0.000772,0.000607,0.000271,0.00034,3.1e-05,0.000508,0.000299,0.000251,0.000166,0.000151,0.00035,0.000185,0.000372,0.000544,0.00032,0.000188,0.00051,0.00028,0.000102,0.000404,0.000232,0.000421,2.2e-05,0.000111
0.001084,0.000746,0.001109,0.001019,0.000333,0.000985,0.000306,0.000376,0.000264,0.000713,0.000322,7e-05,0.000945,0.00076,0.000314,0.00047,0.000628,0.000267,0.000589,0.001026,0.000371,0.001131,0.000533,0.000204,0.000787,0.000704,0.000145,0.001029,0.000445,0.000607,0.000268,0.000898,7.1e-05,0.000118,0.000146,0.000657,0.00097,0.001162,0.000123,0.000318,0.000665,0.000385,0.000335,0.000436,0.000544,0.000754,0.000404,0.00089,1e-04,0.000388,0.000324,0.000281,0.000778,0.000189,0.000354,0.000394,0.000918,0.000423,0.000852,0.000677,0.000547,0.000737,0.000691,0.000745,0.000935,0.001,0.000386,0.000696,0.000208,0.000698,0.000247,0.000555,0.000541,0.000466,0.000408,0.000787,0.000744,0.00055,0.000525,0.000974,0.000272,0.000209,0.00023,0.000879,0.000937,0.000453,0.000311,0.000534,0.000611,6e-04,0.000275,0.000648,0.000588,0.000921,0.000741,0.000176,0.00057,0.000572,0.000293,0.000301,0.000332,0.000126,0.000677,0.000429,0.000436,0.000597,0.000816,0.000776,0.000208,0.000387,0.001308,0.000986,0.000156,0.001333,0.000707,0.000238,0.000595,0.000593,0.000294,0.000408,0.000193
0.001127,0.001795,0.001002,0.002106,0.002017,0.001732,0.001305,0.001241,0.000559,0.000793,0.000493,0.000485,0.001498,0.001172,0.001597,0.001475,0.000938,0.000928,0.000902,0.001639,0.000868,0.001203,0.001452,0.001284,0.001995,0.002386,0.001952,0.001903,0.002118,0.001953,0.001398,0.001737,0.001205,0.00075,8.5e-05,0.000551,0.001634,0.002516,0.002367,0.001466,0.001483,0.001339,0.000669,0.001239,0.000848,0.000913,0.000956,0.000628,0.001267,0.000411,0.000471,0.000578,0.001081,0.000954,0.000803,0.00062,0.001674,0.001946,0.001779,0.000751,0.000107,0.000864,0.001115,0.001397,0.002109,0.001764,0.002046,0.002319,0.001425,0.001243,0.001274,0.00034,0.001108,0.001166,0.001528,0.001524,0.002015,0.000769,0.001172,0.000682,0.000708,0.00027,0.000783,0.000471,0.001601,0.002025,0.001317,0.000918,0.000317,0.001033,0.001402,0.001426,0.00161,0.001826,0.00192,0.00123,0.000765,0.001313,0.001378,0.001151,0.001074,0.000516,0.000684,0.000879,0.000956,0.000137,0.000811,0.000702,0.000466,0.000484,0.001425,0.001309,0.001055,0.002367,0.002231,0.001059,0.000934,0.001082,0.001146,0.000313,0.000319
0.001722,0.000946,0.001718,0.002105,0.002656,0.002191,0.00124,0.001721,0.00184,0.001836,0.001003,0.001525,0.001669,0.000955,0.001687,0.000372,0.000666,0.000821,0.000451,0.001244,0.001271,0.001025,0.00144,2.9e-05,0.001585,0.000925,0.000423,0.000331,0.000994,0.001125,0.000407,0.000747,0.001287,0.000386,0.000367,0.000293,0.001504,0.000849,0.000897,0.001592,0.000591,0.000483,0.000986,0.001288,0.001726,0.001592,0.000546,0.000861,0.000483,0.000868,0.000348,0.000736,0.000982,0.000626,0.001072,0.000831,0.000944,0.000756,0.000343,0.001216,0.000572,0.000398,0.000338,0.000105,0.001017,0.001391,0.001113,0.000872,0.000856,0.001488,0.001345,0.00095,0.000652,0.00061,0.000827,0.00035,0.001192,0.001529,0.001957,0.000996,0.000889,0.000203,0.00098,0.000961,0.001056,0.001292,0.000537,0.000325,0.001647,0.001606,0.000277,0.001266,0.000833,0.000358,0.000477,0.001151,0.000682,0.000319,0.000314,0.000422,0.000507,0.000241,0.000879,0.000181,0.000339,0.001139,0.000387,0.000628,0.000703,0.000712,0.000745,0.000347,0.000378,0.001682,0.000935,0.000711,0.001027,0.000861,0.000423,0.000508,0.000331
0.000816,0.000688,0.000938,0.000527,0.001362,0.001601,0.000228,0.002082,0.000489,0.000417,0.001115,0.001237,0.000675,0.001552,0.000458,0.000999,0.000564,0.000903,0.001046,0.000832,0.000735,0.000871,0.000769,0.000816,0.00073,9.4e-05,0.000198,0.00033,0.001021,0.001517,0.000249,0.000431,0.000345,0.000439,0.000186,0.000996,0.001507,0.000548,0.000637,0.000475,0.000139,0.000237,0.000967,0.00023,0.00165,0.000647,0.000177,0.000201,0.000475,0.001153,0.000627,0.000586,0.000478,0.000773,0.000798,0.000886,0.000762,0.000934,0.000688,0.001902,0.000444,0.000113,0.000342,0.000731,0.000382,6e-04,9.6e-05,0.00144,0.000651,0.001865,0.000812,0.000579,0.00069,0.000358,0.000775,0.001147,0.000173,0.001297,0.001171,0.001044,0.000696,0.000176,0.000844,0.000495,0.000652,0.000386,0.000563,0.00044,0.001932,0.000302,0.000557,0.00049,0.000691,0.000524,0.000288,0.000582,0.000281,0.000451,0.00063,0.000279,0.00035,0.000359,0.000554,0.000948,0.000703,0.001627,0.000593,0.000573,0.000639,0.000515,0.000825,0.000492,0.00057,0.001262,0.001132,0.000682,0.000629,0.000898,0.000434,0.00032,0.000842
0.001271,0.00084,0.002053,0.002773,0.002144,0.004011,0.003368,0.001922,0.001582,0.00148,0.002177,0.001882,0.000477,0.001674,0.002105,0.001224,0.00185,0.001984,0.000429,0.000762,0.001394,0.001979,0.001235,0.000347,0.000169,0.000941,0.001364,0.001569,0.002246,0.00313,0.002602,0.001278,0.000252,0.000404,0.000796,0.001529,0.002722,0.001731,0.000579,0.00088,0.00022,0.000545,0.001035,1.3e-05,0.001129,0.000865,0.000666,0.001365,0.001717,0.001892,0.001604,0.000902,0.001796,0.002129,0.002015,0.001596,0.002026,0.002113,0.002014,0.001784,0.002034,0.001205,0.000881,0.001213,0.001602,0.002184,0.002485,0.002433,0.002434,0.001014,0.001041,0.001828,0.001424,0.001304,0.000323,0.000848,0.000624,0.001329,0.001611,0.001594,0.000407,0.000459,0.000579,0.001213,0.002162,0.001944,0.001353,0.001489,0.002551,0.002154,0.00093,0.000317,0.00074,0.000875,0.000573,0.000306,0.000683,0.000505,0.001688,0.001811,0.000829,0.000544,0.000296,8e-04,0.000138,0.001406,0.001892,0.001337,0.000797,0.001189,0.001351,0.001446,0.001242,0.001251,0.001824,0.001242,0.00061,0.001327,0.001898,0.001042,0.001938
0.00094,0.000986,0.00205,0.002281,0.001038,0.002902,0.001458,0.000871,0.002063,5.9e-05,0.00164,0.001078,0.001756,0.000295,0.000919,0.001389,0.002169,0.000484,0.000656,0.000938,0.000614,0.00061,0.001024,0.001392,0.000368,0.001443,0.001335,0.000271,0.001554,0.002052,0.001384,0.001339,0.001564,0.000724,0.000518,0.001547,0.000698,0.001973,0.002255,0.001188,0.001025,0.001659,0.000924,0.001283,0.000597,0.000403,0.000263,0.001123,0.001051,0.000937,0.000273,0.001101,0.001309,0.001513,0.000447,0.000881,0.000685,0.000676,0.000472,0.00113,0.00162,0.001187,0.000466,7e-04,0.000734,0.001265,0.001152,0.001282,0.000879,0.001664,0.00108,0.001223,0.00131,0.000629,0.001044,0.000759,0.000477,0.000827,0.001336,0.001313,0.001565,0.000718,0.000342,0.001116,0.00234,0.001374,0.000475,0.001015,0.001772,0.001527,0.001552,0.00095,0.000296,0.00124,0.000735,0.000574,0.000558,0.00094,0.001122,0.001059,0.000915,0.000683,0.000171,0.000591,0.000626,0.000288,0.001823,0.001776,0.001988,0.001549,0.000303,0.000696,0.000848,0.001319,0.000938,0.000729,0.000648,0.000433,0.002136,0.00132,0.002576
0.000629,0.001155,0.000256,0.000813,0.00171,0.000866,0.00094,0.000249,0.00178,0.00204,0.000262,0.000931,0.000493,0.001328,0.000461,0.001446,0.001522,0.000782,0.000533,0.001142,0.001307,0.001144,0.001307,0.000714,0.001276,0.002078,0.000874,0.00052,0.000613,0.000247,0.000853,0.000475,0.001027,0.000873,0.000647,0.000966,0.000818,0.00094,0.000656,0.000597,0.000842,0.001023,0.001482,0.001389,8.2e-05,0.00033,0.000519,0.001325,0.000647,0.000851,0.000888,0.000559,0.000895,0.001143,0.000789,0.000658,0.000597,0.000304,8e-04,0.000192,0.001059,0.001037,0.000628,0.000174,0.000531,0.000484,0.001437,0.000511,0.000744,0.000912,0.000998,0.000679,0.000817,0.000755,0.000557,0.001235,0.000725,0.000523,0.000354,0.001083,0.000423,0.000936,0.00082,0.000798,0.000637,0.000163,0.000348,0.001188,0.000955,0.000598,0.001529,0.000986,0.000432,0.000925,0.000613,0.00069,0.000781,0.000714,0.000903,0.001667,0.000676,0.000308,0.000684,0.000637,0.000471,0.000799,0.001447,0.000301,0.001306,0.001053,0.000808,0.000275,0.000867,0.000229,0.000458,0.001171,0.001404,0.000749,0.001259,0.00077,0.001658
0.000876,0.000524,0.000583,0.000333,0.001139,0.001156,0.001176,0.001243,9e-04,0.001266,0.001256,0.001506,9e-04,0.001047,0.001366,0.000888,0.000165,4e-04,0.000488,0.000322,0.000782,0.000977,0.000626,0.001002,0.000887,0.000752,0.001273,0.000565,0.000482,0.000561,0.000721,0.000407,0.000737,0.001184,0.000991,0.000141,0.000272,0.000369,0.000674,0.000734,0.000164,0.001016,0.000605,0.000908,0.00091,0.00064,0.000265,0.000921,0.000913,0.000245,0.000852,0.000593,0.000198,0.001005,0.000898,0.001114,0.001047,0.001214,0.001155,0.000855,0.000855,0.000798,0.000524,0.000931,0.000514,0.000365,0.000628,0.000795,0.000928,0.000277,0.000856,0.001248,0.001822,0.001348,0.000614,0.000865,0.000758,0.00082,0.000859,0.000543,0.00103,0.001469,0.001282,0.001376,0.000979,0.000691,0.000702,0.000846,0.001445,0.00129,0.000264,0.000551,0.000538,0.000483,0.000131,0.000231,0.000787,0.001254,0.000852,0.00071,0.000801,0.000627,0.000565,0.001452,0.001248,0.001787,0.000809,0.000951,0.001874,0.000769,0.000511,0.000549,0.000817,0.000758,0.000571,0.001487,0.001786,0.001331,0.000308,0.000159,0.001203
0.000172,5.2e-05,0.000798,0.00034,0.000728,0.000408,0.000267,0.00038,0.000882,0.00041,6.5e-05,0.00033,0.000221,0.000896,0.000505,0.000712,0.000245,0.000278,5.1e-05,0.00017,0.000533,0.000422,0.000158,8.8e-05,0.000319,0.000668,0.000601,0.000527,0.000593,0.000413,0.000466,0.000182,0.000447,0.000303,0.000149,0.000245,0.000311,0.000331,0.000133,0.000155,3.4e-05,0.000434,0.000182,0.00013,5e-04,0.00043,0.000187,0.000679,0.000277,1.9e-05,0.000554,0.000392,7.6e-05,0.000567,0.000292,0.000323,0.00053,0.000515,0.000299,0.000567,0.000343,9.6e-05,0.00041,0.000474,4.8e-05,0.000353,0.000417,0.000407,0.00015,0.000411,0.000194,0.000566,0.000454,0.000237,0.000366,0.000463,0.000165,0.000214,0.000461,0.000439,0.000661,0.000489,0.000428,0.000242,0.000495,0.000301,0.000209,0.000761,0.000392,0.000405,0.00061,0.000101,0.000349,0.00012,8.2e-05,0.000357,0.000521,0.000559,0.000142,0.000563,0.000493,0.000162,0.000562,0.001087,0.000634,0.000743,0.000399,0.000345,0.000577,0.000305,0.000446,0.000163,0.000128,0.00012,0.000147,0.000833,0.000422,0.00033,0.000291,0.000175,0.000458
0.000128,0.000275,0.000473,6.7e-05,0.000467,0.000324,0.000218,0.000155,0.000343,0.000176,0.000154,0.000292,0.000274,0.000352,7.8e-05,0.000408,0.000135,0.000215,0.000206,0.000156,0.000405,0.000227,0.000185,7.5e-05,0.000152,0.000392,0.000157,0.000185,0.000335,0.000226,0.000365,6.1e-05,0.000121,0.000186,0.000183,0.000133,0.000107,0.000311,4.8e-05,0.000142,1e-04,0.000371,0.000159,0.000246,0.000282,0.000396,0.000102,0.000395,0.000195,0.000205,0.000104,0.000363,0.000135,0.000279,0.000188,0.000137,0.000399,0.000365,0.000245,0.000316,0.000165,9.2e-05,0.000267,0.000329,0.00012,0.000113,0.00015,0.000254,7.7e-05,0.000315,0.000135,0.000316,0.000364,6.9e-05,0.000246,0.000128,1e-04,0.000231,0.000383,0.000227,0.000362,0.000364,0.000291,0.000219,0.00041,0.000173,7.6e-05,0.000397,0.000185,0.000319,0.000411,0.000101,0.000313,5.6e-05,5.3e-05,0.000124,0.000251,0.00041,0.000135,0.000327,7.3e-05,9.3e-05,0.000438,0.000509,0.000151,0.000506,0.000137,0.000293,0.000411,0.000219,0.000147,5.1e-05,0.000129,3.3e-05,7.1e-05,0.000404,0.000122,0.000296,0.000154,0.00018,0.000134
0.000176,0.000266,0.000394,5.7e-05,0.000475,0.000261,0.000135,0.000136,0.000298,0.000256,0.000142,0.000236,6.6e-05,0.000147,5.8e-05,0.000138,0.000117,0.000174,0.000203,0.000131,0.000292,0.000135,0.000167,0.000144,0.000195,0.000221,0.000106,0.000221,0.000253,0.000165,0.000262,5.9e-05,0.000122,0.000133,0.000181,0.000116,1.2e-05,0.000257,2.9e-05,0.000115,0.000137,0.000275,0.000183,0.000276,0.000321,0.000355,0.000121,0.000423,7.5e-05,0.000252,0.000135,0.00034,0.00017,0.000338,0.00021,6.3e-05,0.000238,0.000269,0.000315,0.000265,0.000139,2e-05,0.000169,0.000308,8e-05,0.000139,0.000212,0.000224,0.000128,0.000339,0.000281,0.00027,0.000379,8.6e-05,0.000205,0.000107,0.000201,0.000146,0.000405,0.000191,0.000233,0.000289,0.000183,0.000126,0.000301,0.000254,0.000156,0.000426,2.6e-05,0.000289,0.000409,0.000149,0.000179,0.00015,5.9e-05,0.000145,0.000175,0.000324,0.000163,0.000291,1.4e-05,6.1e-05,0.000402,0.000425,0.000154,0.000351,0.000122,0.000366,0.000317,0.000127,0.000198,6.9e-05,0.000175,0.000116,0.000208,0.000306,0.000195,0.000271,0.000225,0.000213,6.6e-05
0.000235,0.000487,0.000157,3.5e-05,0.000272,0.00021,0.000259,9.2e-05,0.000158,0.000246,6.9e-05,0.000125,0.000164,0.000166,0.000197,0.000101,0.000325,0.000204,9.2e-05,8.4e-05,0.000321,0.000149,0.000263,0.000121,0.000265,0.000144,0.000121,4.3e-05,0.000375,0.000115,0.000225,2.5e-05,2.2e-05,0.000158,0.000157,9.9e-05,7.2e-05,3e-04,8.8e-05,0.000212,0.000102,0.00025,0.000166,0.000245,0.000291,0.000352,0.000178,0.000385,0.000155,0.000283,0.000248,0.000427,0.00026,0.000322,6.2e-05,1.5e-05,0.000241,0.000329,0.000257,0.000323,0.000121,0.000126,0.000262,0.000273,0.000112,0.000143,0.000294,0.000303,0.000199,0.000367,0.000353,0.000325,0.000333,0.000139,0.000308,7.7e-05,0.000214,0.000248,0.000356,0.000214,0.000339,0.00035,0.000212,0.000196,0.000425,0.000186,0.00012,0.000398,0.000145,0.000288,0.000445,0.000189,0.000282,0.000146,0.00012,0.000209,0.000165,0.000301,0.000159,0.000391,0.000202,0.000101,0.000192,0.000389,2.1e-05,0.000355,9.7e-05,0.000358,0.000354,0.000102,0.000113,4.5e-05,9.4e-05,7.7e-05,0.000215,0.000245,6.9e-05,0.000222,0.000227,0.000298,0.000209
0.000417,0.000572,0.000501,0.000199,0.000126,0.000206,0.000307,0.00022,0.000137,0.000348,0.000145,0.000311,5.8e-05,0.00029,0.000279,0.000344,0.000424,0.000274,0.000326,5.1e-05,0.000352,0.000257,0.000344,0.000437,0.000443,0.000212,0.000191,0.000233,0.000129,0.000195,0.000309,8.3e-05,0.000213,0.000291,9e-05,0.000347,0.000202,0.000467,0.000227,0.000187,5.9e-05,0.000339,0.000272,0.000316,0.000594,0.000515,0.000119,0.000376,6.6e-05,0.000515,0.000573,0.000651,0.000338,0.000282,0.00028,0.00025,0.000182,0.000391,0.000244,0.000247,9.6e-05,0.000184,7.5e-05,0.000224,0.00014,0.000164,0.000379,0.000528,0.000426,0.000511,0.000706,0.000562,0.000666,0.000129,0.000406,0.000146,6e-05,0.000248,0.000349,0.000406,0.000517,0.000564,0.000535,0.000345,0.00041,0.000269,0.000148,0.000614,0.00024,0.000487,0.000758,0.000103,0.000518,0.000355,0.000342,0.000328,0.000224,0.000193,0.000269,0.000342,0.000217,0.000392,0.000278,0.000503,0.00012,0.000248,0.000376,0.000615,0.000622,8.6e-05,3.1e-05,0.000353,7.2e-05,8.5e-05,0.00022,0.000622,0.000392,8.6e-05,0.000352,4e-04,0.000197
0.000227,0.00102,0.000982,9.1e-05,0.000141,0.000945,0.000641,0.000495,0.000658,0.000684,0.000257,0.00066,0.000376,0.000397,0.000574,0.00026,0.000445,0.001175,3.9e-05,0.000356,0.000248,0.001031,0.000333,0.000218,0.000394,0.000887,0.000937,0.000875,0.000654,0.000621,0.000245,0.000104,0.000517,0.000709,0.000408,0.000425,0.000364,0.000416,0.00011,0.000401,0.00035,0.00043,0.000763,0.000976,0.001282,0.000942,0.000452,0.000455,0.000501,0.000703,0.001605,0.001348,0.000731,0.000716,0.000462,0.001092,0.00035,0.00081,0.001064,6.8e-05,0.000232,0.000302,0.000118,0.000187,0.000192,0.000179,0.000879,0.00143,0.001548,0.001574,0.001979,0.001874,0.000536,0.000591,0.001011,0.000771,0.000357,0.000639,0.000437,0.000629,0.001048,0.00115,0.000731,0.000716,0.001229,0.00041,0.000241,0.000409,0.001343,0.001766,0.001721,0.001487,0.000737,0.001065,0.00079,0.001271,0.000439,0.000472,0.000579,0.000859,0.000541,0.000554,0.001017,0.001081,0.000722,0.00051,0.000862,0.001399,0.001844,0.001245,0.000655,0.000491,0.000696,0.00027,0.000371,0.000795,0.000367,0.000114,0.000402,0.000713,0.000983
0.000858,0.000844,0.002619,0.002271,0.000549,0.000818,0.000477,0.000594,0.000206,0.000483,0.001074,0.001385,0.001473,0.001021,0.000521,0.001089,0.001107,0.001366,0.001496,0.001142,0.000709,0.001334,0.00136,0.000932,0.000408,0.001477,0.00153,0.000498,0.00094,0.000962,0.001291,0.000842,0.000986,0.000723,0.000933,0.001043,0.000581,0.00033,0.000781,0.000949,0.001052,0.000891,0.001099,0.000536,0.000382,0.001687,0.002174,0.001821,0.001326,0.001396,0.00199,0.002737,0.002924,0.002751,0.001533,0.001197,0.001297,0.001594,0.002012,0.001728,0.001004,0.000819,0.000765,0.000295,0.000137,0.000729,0.001014,0.001341,0.00172,0.000628,0.002007,0.002538,0.002786,0.002032,0.000904,0.001217,0.000797,0.00082,0.001192,0.000301,0.000358,0.000401,0.001304,0.001418,0.001185,0.00122,0.000885,0.000839,0.001782,0.001726,0.001495,0.001677,0.001638,0.001924,0.001164,0.001439,0.00146,0.000998,0.000667,0.000393,0.00067,0.00027,0.000831,0.000651,0.000957,0.000484,0.001258,0.002185,0.00195,0.001106,0.000372,0.000954,0.001185,0.000804,0.000101,0.000307,0.000608,0.000505,0.000526,0.000464,0.000949
0.000643,0.000811,0.002284,0.001942,0.001834,0.000688,0.00037,0.000522,0.000601,0.000544,0.001004,0.000222,0.000609,0.000287,0.000543,0.000946,0.000971,0.001362,0.001099,0.000463,0.000207,0.000956,0.000751,0.000486,0.000939,0.000689,0.000593,0.00045,0.000833,0.000314,0.000561,0.000406,0.000536,0.000367,0.000461,0.000172,0.000349,0.000637,0.000583,0.000272,0.000574,0.001064,0.000523,0.00053,0.00023,0.001278,0.001239,0.000808,0.000508,0.00073,0.00058,0.001284,0.000618,0.000794,0.000833,0.000831,0.001323,0.00061,0.000578,0.000695,0.000408,0.000448,0.000865,0.000594,0.000307,0.000976,0.000344,0.000983,0.00048,0.000831,0.000889,0.000525,0.00113,0.000554,0.000712,0.000697,0.000312,0.000377,0.000266,0.000544,0.000221,0.000451,0.000647,9.6e-05,0.000853,0.000368,0.000222,0.000383,0.000817,0.000499,0.000477,0.000444,0.000637,0.000582,0.000509,0.00068,0.000899,0.000794,0.000529,0.000353,0.000392,0.000375,0.000223,0.000294,0.00051,0.000416,0.001232,0.000691,0.000468,0.000238,0.000201,0.00094,0.000462,9.4e-05,0.000224,0.000267,0.000388,0.000391,0.000479,0.000566,0.000333
0.000252,0.000257,0.001033,0.00057,0.000684,0.000442,0.000245,0.000362,0.000318,0.000313,0.000381,0.000503,0.000298,0.000307,0.000172,0.000745,0.000426,0.000528,0.000318,0.000199,9.9e-05,0.000625,0.000257,0.000127,0.000464,0.001072,0.000204,0.00013,0.000209,0.000298,0.000179,0.00015,0.000425,0.000415,0.00042,0.000232,0.000351,0.000186,0.000252,0.000337,0.000166,0.00066,0.000419,0.000375,0.000297,0.000605,0.000505,0.000153,0.000353,0.000473,0.000412,0.000716,0.000545,0.000391,0.000202,0.000634,0.000532,0.000492,9.9e-05,0.000348,0.000322,3.3e-05,0.000437,0.000129,0.000235,0.000644,0.000314,0.000606,0.000512,7.2e-05,0.000686,9.1e-05,0.000715,0.000281,0.000351,0.000253,0.000211,0.000166,0.000209,0.000493,0.000333,0.000206,0.000289,0.000186,0.000484,0.000276,9.5e-05,0.000185,0.000439,0.000423,0.000609,0.00045,0.000545,0.000216,0.000616,0.000535,0.000525,4.2e-05,0.000481,0.000361,0.000383,0.000334,0.000314,0.000322,0.000405,3.9e-05,0.00058,0.000197,8e-05,0.000256,0.000209,0.000398,0.000307,1.7e-05,0.000148,0.000323,0.000424,0.000133,0.000322,2.8e-05,0.000389
3.4e-05,0.000191,0.00049,0.00044,0.000526,0.000282,0.000441,0.000292,0.000203,0.000178,0.000249,8.3e-05,0.000225,0.00027,0.000271,0.000411,0.000365,0.000221,3.2e-05,0.000114,0.000161,0.000451,0.000455,0.000366,0.000124,0.000499,8.6e-05,0.000182,0.000168,0.000168,7.9e-05,0.000123,0.000118,0.000174,0.000336,0.000215,0.000109,0.000245,8.1e-05,5.5e-05,6.2e-05,0.000274,0.000151,0.000174,8.2e-05,0.000338,0.000527,0.000359,0.000122,0.000394,6.8e-05,0.000326,0.000203,0.000331,0.00026,0.000525,0.000584,0.000565,0.000464,0.00026,0.000198,0.000293,4.6e-05,6.7e-05,0.000306,0.000192,0.000381,0.000471,0.00043,0.000385,0.000523,9.4e-05,0.000128,0.000187,0.000336,0.000236,0.000276,0.000162,0.000244,0.000245,0.000116,6.6e-05,0.000115,0.000203,0.00029,5.2e-05,4.9e-05,4.7e-05,0.000378,0.000287,0.000203,0.000289,0.000483,8.2e-05,0.000236,0.00034,0.000113,0.000334,0.000353,0.000258,0.00016,0.000334,1.9e-05,0.000191,3.5e-05,4.9e-05,0.000501,0.000206,8.4e-05,0.000171,8.7e-05,0.000199,0.000133,0.000137,0.000119,0.000141,0.000177,0.000213,5.7e-05,0.000117,0.000273
0.000125,0.000322,0.000541,0.000318,0.000433,0.000232,0.000325,0.000122,7.3e-05,6.9e-05,0.000148,0.000128,0.000138,0.000124,0.000106,0.000221,0.000238,0.000186,0.000185,0.00017,0.000227,0.000323,0.00025,0.000139,4.5e-05,0.000474,0.000102,0.000321,0.000333,0.000203,0.000146,2.9e-05,7.1e-05,0.000201,0.000121,0.000356,0.000119,5.2e-05,4e-05,0.000212,9.7e-05,5.6e-05,8.1e-05,8.1e-05,0.000233,0.000319,0.000205,6.1e-05,0.000165,0.00014,0.000272,0.000261,0.000216,0.000342,0.000265,0.000236,0.000382,0.000376,0.000266,3.1e-05,0.000121,0.000249,5.1e-05,0.000115,0.000205,0.000289,0.00017,0.000159,0.000135,5.4e-05,0.00036,0.000259,9.2e-05,0.000198,0.000202,2.5e-05,0.000216,0.000108,0.000137,0.000132,0.000203,9e-06,0.000131,0.000125,0.000165,4.4e-05,8.8e-05,0.000201,0.000285,0.000172,0.000244,0.000171,0.000224,0.000178,2e-04,0.000162,0.00012,0.000172,0.000177,0.000105,0.000149,8.4e-05,0.000174,2.9e-05,0.000156,7e-05,0.000414,0.000122,0.000116,9.6e-05,0.000106,0.000237,0.000128,0.000177,0.000105,0.000128,0.000131,4.3e-05,0.000151,0.000101,0.000204
7.7e-05,6.8e-05,0.000262,4.8e-05,9e-05,8.3e-05,0.000122,0.000126,7.5e-05,1.4e-05,5.7e-05,8e-06,5e-05,3.4e-05,3.8e-05,8.2e-05,6.3e-05,1.6e-05,0.000107,3.7e-05,5.2e-05,0.000141,8.6e-05,4.6e-05,6e-06,0.000157,6.6e-05,5.2e-05,0.000103,4.2e-05,1.4e-05,4.5e-05,2.6e-05,7.6e-05,4e-05,0.000122,0.000115,1e-04,1e-05,8.9e-05,8.2e-05,4.3e-05,8e-06,4.9e-05,0.000128,8.2e-05,3.1e-05,5.5e-05,8e-05,0.000104,0.000111,8.4e-05,6.5e-05,0.00012,5.8e-05,0.000125,0.000203,0.000218,4.5e-05,3.9e-05,7.6e-05,5.7e-05,6.7e-05,1.6e-05,0.000104,9.3e-05,3.6e-05,3.6e-05,9.3e-05,9.9e-05,0.000111,7.2e-05,9.9e-05,6e-05,7.4e-05,6.5e-05,5.9e-05,9.1e-05,0.000126,9.4e-05,0.000107,8.5e-05,6.1e-05,3.4e-05,0.000107,2.4e-05,3.3e-05,8e-05,0.000171,8.5e-05,0.000136,0.000119,0.000153,7.5e-05,9.3e-05,7.5e-05,4e-05,9.7e-05,4.9e-05,3.7e-05,7.7e-05,2.9e-05,2.5e-05,5.2e-05,7.7e-05,4.8e-05,0.000197,9.7e-05,5.9e-05,7.2e-05,6.3e-05,5.4e-05,7.1e-05,5.1e-05,6.2e-05,2.7e-05,2.3e-05,4.6e-05,6.2e-05,3.5e-05,8.1e-05
5.8e-05,8.5e-05,0.000218,0.000107,0.000175,4.7e-05,1.8e-05,2.5e-05,1.4e-05,1.7e-05,3.6e-05,0.000107,8.8e-05,2.6e-05,3e-05,9.1e-05,5.9e-05,3.1e-05,0.000121,8.2e-05,2.5e-05,8.2e-05,4.1e-05,4.9e-05,4.2e-05,0.000128,4.8e-05,6.5e-05,6.7e-05,2.5e-05,5.8e-05,4.9e-05,2.4e-05,3.1e-05,2.3e-05,4.3e-05,0.000102,5e-05,7.7e-05,5.7e-05,4.6e-05,3.3e-05,1.6e-05,5e-05,5.3e-05,6.9e-05,7.5e-05,6.8e-05,7.1e-05,9.6e-05,6e-05,1e-04,7.5e-05,0.000104,2.8e-05,3.4e-05,0.000105,0.000144,4.4e-05,3e-05,7.2e-05,4.3e-05,4e-05,3.9e-05,0.000105,0.000106,4.1e-05,6.2e-05,1.7e-05,5.6e-05,6.6e-05,2.8e-05,4.1e-05,3.4e-05,8.3e-05,5.5e-05,6.4e-05,3e-05,8.7e-05,0.000105,5.7e-05,5.2e-05,4.6e-05,4.1e-05,8.2e-05,7e-06,6.3e-05,6e-05,0.000135,2.6e-05,5.3e-05,6.1e-05,7.4e-05,7.2e-05,4.2e-05,5.6e-05,3.8e-05,0.000113,4e-05,3.8e-05,4.7e-05,5.2e-05,1.7e-05,5.5e-05,6.4e-05,3.7e-05,0.000204,4.8e-05,1.6e-05,5.2e-05,6.2e-05,9.6e-05,3.2e-05,4.6e-05,3e-05,3.4e-05,4.7e-05,2.5e-05,4.1e-05,5.2e-05,3.1e-05
5.1e-05,6.8e-05,0.000148,3e-05,0.000137,3.5e-05,2.6e-05,4.2e-05,2.8e-05,3.4e-05,4.5e-05,6.5e-05,3.6e-05,6.2e-05,9.2e-05,6.5e-05,5.6e-05,1.9e-05,9.7e-05,3.5e-05,5.3e-05,6e-05,7e-05,5.1e-05,1.3e-05,0.00014,6.1e-05,8.3e-05,0.000103,3.2e-05,3.5e-05,2.8e-05,2.2e-05,2.4e-05,3.1e-05,4.5e-05,8.2e-05,3.9e-05,1.6e-05,4.3e-05,5.5e-05,1.2e-05,7e-06,3.2e-05,5.3e-05,3.5e-05,6.7e-05,5.4e-05,8.7e-05,2e-05,6.1e-05,6.7e-05,0.000114,4.8e-05,2.8e-05,8.9e-05,0.000104,0.000154,2.7e-05,5.8e-05,5.2e-05,3e-06,8.5e-05,2.5e-05,6.7e-05,8e-05,6.5e-05,6.2e-05,2.7e-05,4.6e-05,9.2e-05,2.8e-05,6.5e-05,3.4e-05,4.2e-05,2.8e-05,1.6e-05,7.2e-05,8.1e-05,7.8e-05,7.9e-05,9.4e-05,4.5e-05,3.7e-05,6.8e-05,2.7e-05,4.6e-05,8e-06,0.000141,6.7e-05,7.2e-05,3.9e-05,6.2e-05,8.4e-05,9e-05,7.6e-05,4.5e-05,7.5e-05,2.1e-05,1.7e-05,5.8e-05,8.3e-05,8.5e-05,1.3e-05,6.1e-05,2.1e-05,0.000138,3.3e-05,3.3e-05,5.1e-05,7.1e-05,7.2e-05,4.2e-05,5e-05,4.2e-05,5.8e-05,1.9e-05,3.2e-05,3.9e-05,4e-05,6.3e-05
2.4e-05,6.7e-05,0.000146,1.8e-05,0.000141,4.8e-05,1.5e-05,3.8e-05,2.4e-05,4e-05,3.2e-05,3.5e-05,4.6e-05,4e-05,4.6e-05,6.9e-05,5.4e-05,4.3e-05,3.5e-05,3.6e-05,1.5e-05,9.5e-05,1.9e-05,5e-05,3.1e-05,0.000129,7.8e-05,4.6e-05,6.6e-05,5.2e-05,1.8e-05,3.5e-05,3.3e-05,3.8e-05,2e-05,4.7e-05,2.8e-05,3.4e-05,2.7e-05,4.3e-05,4.1e-05,3.4e-05,1.5e-05,3.8e-05,4.5e-05,5.8e-05,3.8e-05,6e-05,6.2e-05,3.4e-05,5e-05,3.7e-05,4.9e-05,5.4e-05,4.2e-05,8.1e-05,8.7e-05,0.00011,3.1e-05,5.2e-05,4.7e-05,2.7e-05,7.4e-05,3.3e-05,3.1e-05,0.000118,3e-06,1.9e-05,1.2e-05,1.9e-05,8.1e-05,3.2e-05,4.4e-05,3.8e-05,2.2e-05,1.7e-05,1.4e-05,6.7e-05,6.2e-05,4.6e-05,2.3e-05,6e-05,5.9e-05,1.6e-05,6.8e-05,4.1e-05,1.6e-05,2.8e-05,9.2e-05,2.6e-05,6.1e-05,7.2e-05,0.000109,8.4e-05,3.5e-05,4e-05,1.5e-05,8.3e-05,2.5e-05,3e-05,6.7e-05,2.1e-05,4.5e-05,3.7e-05,4.3e-05,4e-05,0.000161,5.7e-05,1.9e-05,3.4e-05,6e-05,5.5e-05,3.9e-05,5.8e-05,6e-06,3.5e-05,1.3e-05,1.8e-05,3.1e-05,5e-06,3.5e-05
3.8e-05,7.4e-05,0.000121,7e-06,0.000134,5.4e-05,2.2e-05,2.8e-05,1.9e-05,2.9e-05,3.7e-05,6e-06,5.1e-05,4e-06,2.7e-05,8.4e-05,3.4e-05,3.1e-05,4.3e-05,2.7e-05,2.1e-05,8.3e-05,4e-05,4.6e-05,4e-06,0.000114,6e-05,3e-05,6.3e-05,2.5e-05,3.6e-05,2.6e-05,1.5e-05,4e-05,1.3e-05,5.6e-05,4.8e-05,2.1e-05,2.5e-05,5.7e-05,4e-05,2.6e-05,1.8e-05,2.6e-05,3.6e-05,4.4e-05,3.5e-05,5.1e-05,5e-05,4.7e-05,3.8e-05,4.1e-05,5.8e-05,3.8e-05,2.8e-05,7.1e-05,0.000111,0.000122,2.3e-05,4.8e-05,2.1e-05,1.2e-05,6.6e-05,1.8e-05,2.4e-05,0.000115,2.6e-05,2.4e-05,1.2e-05,4e-05,7.6e-05,7e-06,2.8e-05,6.2e-05,1.8e-05,2.7e-05,2.4e-05,3.5e-05,8.8e-05,1.2e-05,2.9e-05,4.3e-05,4.9e-05,2.8e-05,5.3e-05,1.5e-05,1.2e-05,2.9e-05,5.9e-05,3.3e-05,4.2e-05,7.3e-05,5.9e-05,6.8e-05,3.6e-05,2e-05,2.3e-05,7.3e-05,2.7e-05,3.5e-05,1.6e-05,2e-05,4.8e-05,2.1e-05,5.6e-05,5e-05,0.000132,2.2e-05,2e-05,3.1e-05,4.2e-05,3e-05,3.9e-05,2.5e-05,1.1e-05,1.3e-05,1.1e-05,7e-06,3.4e-05,1.9e-05,3.9e-05
4.7e-05,4.7e-05,0.000144,2.7e-05,0.000124,4.3e-05,3.2e-05,2.8e-05,2e-05,3.1e-05,1.6e-05,9e-06,3.7e-05,1.9e-05,3.2e-05,7.9e-05,4.8e-05,4.8e-05,3.3e-05,3.4e-05,6e-06,7.6e-05,5e-05,1.5e-05,2.3e-05,0.000104,5.1e-05,2.6e-05,5.4e-05,3.3e-05,4.3e-05,2.2e-05,1.4e-05,2e-05,3.9e-05,2.4e-05,4.3e-05,2.9e-05,3.7e-05,4e-05,4.6e-05,2.2e-05,9e-06,3.5e-05,3.5e-05,3.6e-05,2.9e-05,5e-05,4.6e-05,3.7e-05,4.8e-05,3.7e-05,5.3e-05,3.2e-05,4.3e-05,8.6e-05,9.6e-05,9e-05,3.9e-05,3.5e-05,2e-05,1.6e-05,5.7e-05,4.4e-05,4.2e-05,9.6e-05,2.3e-05,3.6e-05,2.3e-05,4e-05,7.5e-05,2.3e-05,3.5e-05,3.5e-05,2.8e-05,3.3e-05,7e-06,3.3e-05,7.2e-05,2.9e-05,3.4e-05,4.7e-05,1.3e-05,1.5e-05,5.1e-05,7e-06,1.9e-05,2e-05,6.3e-05,1.4e-05,4.1e-05,5.3e-05,6e-05,5.8e-05,4.8e-05,4.1e-05,3e-06,8.3e-05,3.1e-05,3.4e-05,3.5e-05,2.8e-05,3.2e-05,2.6e-05,4.5e-05,6.2e-05,0.000142,4.4e-05,3.5e-05,3.1e-05,3.5e-05,5.6e-05,2.5e-05,2.5e-05,3.2e-05,2.8e-05,1e-05,2.6e-05,3e-05,1.8e-05,6.3e-05
5.2e-05,3.7e-05,0.000147,2.9e-05,9.8e-05,3.7e-05,3.9e-05,3e-05,9e-06,2.4e-05,4.4e-05,1.7e-05,3.6e-05,9e-06,3.2e-05,7.2e-05,2.8e-05,3.1e-05,5.5e-05,5e-06,1.7e-05,6.4e-05,2.5e-05,2.9e-05,3.3e-05,0.000113,6.2e-05,5.7e-05,4e-05,4.2e-05,2.9e-05,2.1e-05,2.9e-05,1.2e-05,2.7e-05,3e-05,3e-05,3.7e-05,3.8e-05,4.2e-05,4.4e-05,1.8e-05,2e-05,2.3e-05,2.6e-05,2.1e-05,3e-05,6.3e-05,3.1e-05,1.7e-05,4.5e-05,4.3e-05,6e-05,4.8e-05,3.5e-05,8.4e-05,0.000118,0.000104,3e-05,3.5e-05,2.2e-05,9e-06,3.2e-05,3e-05,4.3e-05,0.000102,2.1e-05,6.2e-05,1.3e-05,3.6e-05,6.1e-05,1.7e-05,4.7e-05,3.9e-05,3e-06,7e-06,1.7e-05,3.2e-05,7.6e-05,2e-05,4.3e-05,5.8e-05,2.7e-05,2.6e-05,4.8e-05,5e-06,6e-06,3e-05,7e-05,8e-06,5.1e-05,2.6e-05,6.5e-05,2.8e-05,5.1e-05,1.4e-05,6e-06,6.3e-05,1.4e-05,2.1e-05,3.9e-05,3e-05,2.1e-05,9e-06,4e-05,5.2e-05,0.000124,4.8e-05,4e-05,3.6e-05,3.7e-05,4.9e-05,1.7e-05,5.1e-05,1.3e-05,1.7e-05,4e-06,2.5e-05,2.7e-05,2.3e-05,5.1e-05
3.3e-05,2.8e-05,0.000149,3.1e-05,0.000144,1.3e-05,2.7e-05,2.4e-05,2.9e-05,2.5e-05,4.1e-05,1.4e-05,3.5e-05,1.5e-05,4.3e-05,9.3e-05,2.8e-05,3.7e-05,3.2e-05,1.7e-05,3.1e-05,6e-05,3.2e-05,2.6e-05,1.2e-05,0.000107,5.4e-05,3.7e-05,4.6e-05,5e-05,2.2e-05,1.7e-05,3.7e-05,3.9e-05,1.4e-05,4.7e-05,4.6e-05,3e-05,2.8e-05,4.9e-05,2.8e-05,1.9e-05,2.5e-05,2e-05,4.1e-05,1.7e-05,9e-06,6.9e-05,4.2e-05,2.9e-05,4.9e-05,3.7e-05,5.3e-05,4.9e-05,4e-05,8e-05,0.000105,0.000102,3.6e-05,5.5e-05,3e-05,1.8e-05,5.4e-05,3.3e-05,4.5e-05,0.000106,3e-05,3.8e-05,1.6e-05,6.5e-05,2.7e-05,1.9e-05,4.2e-05,6e-06,1.6e-05,1.6e-05,1.6e-05,1.9e-05,9.4e-05,5.3e-05,3.4e-05,4.3e-05,2.6e-05,1.3e-05,4.2e-05,2.1e-05,1.4e-05,2.7e-05,8e-05,1e-05,4.8e-05,3.7e-05,8.1e-05,7.1e-05,4.9e-05,3.4e-05,3.1e-05,7.5e-05,2.7e-05,3.2e-05,2.6e-05,4.6e-05,4e-05,1.9e-05,2.9e-05,4.5e-05,0.000125,9e-06,3.2e-05,2.6e-05,1.6e-05,6.5e-05,4e-05,2.7e-05,3.2e-05,2.5e-05,1e-05,4.1e-05,7e-06,1.7e-05,2.9e-05
2.4e-05,3.5e-05,0.000125,2.2e-05,0.000138,2.6e-05,4.2e-05,5e-06,2.7e-05,2.1e-05,2.5e-05,1.8e-05,2e-05,2.8e-05,3.3e-05,6.3e-05,2.2e-05,2e-05,3.5e-05,3.9e-05,1.4e-05,8.5e-05,8e-06,3.3e-05,2.2e-05,9.4e-05,2.8e-05,4.9e-05,5.5e-05,2.3e-05,2.3e-05,3.9e-05,2.6e-05,2.6e-05,2.6e-05,6.3e-05,2.9e-05,3e-05,4.7e-05,5.2e-05,4.4e-05,1.5e-05,3.6e-05,4.9e-05,3.3e-05,4e-05,2.1e-05,6.1e-05,8e-06,1.8e-05,4.4e-05,3.3e-05,3.5e-05,5.4e-05,2.3e-05,8.1e-05,9.9e-05,9.6e-05,6.8e-05,1.8e-05,3.4e-05,1.2e-05,4.9e-05,7.5e-05,1.6e-05,7e-05,1.9e-05,3.6e-05,5e-06,5.5e-05,6.8e-05,2.5e-05,2.9e-05,3.7e-05,1e-05,1e-05,4e-06,1.1e-05,7.1e-05,2.3e-05,2e-05,3.6e-05,2.8e-05,2.2e-05,4.1e-05,3.4e-05,2.2e-05,1.7e-05,4.4e-05,3.2e-05,3.7e-05,8e-05,1.4e-05,6.7e-05,5.3e-05,4.8e-05,1.8e-05,6e-05,3.7e-05,3.7e-05,3.9e-05,2.2e-05,2.6e-05,3e-05,3.5e-05,2e-05,0.000114,3.2e-05,5e-05,3.7e-05,3.1e-05,4.3e-05,7.7e-05,3.8e-05,3.2e-05,4e-05,2.6e-05,4.3e-05,1.1e-05,3.8e-05,3.6e-05
1.9e-05,3.6e-05,0.000151,1.7e-05,0.000119,2.8e-05,2.3e-05,1.2e-05,1.6e-05,2.3e-05,2e-05,3.6e-05,2.3e-05,1.6e-05,4e-05,6.4e-05,3e-05,3.4e-05,4.2e-05,4.7e-05,5.1e-05,9.3e-05,1.8e-05,6e-06,2.8e-05,0.000113,3.9e-05,3.8e-05,5.2e-05,4e-05,2.2e-05,4.4e-05,1.8e-05,1.3e-05,1.6e-05,3.6e-05,4.4e-05,7.7e-05,8e-06,3.3e-05,1.2e-05,2.2e-05,3.8e-05,2.4e-05,1e-05,2.3e-05,2.6e-05,4.5e-05,3.7e-05,3.6e-05,2.3e-05,3.4e-05,4.6e-05,7.4e-05,5.5e-05,8.3e-05,8.1e-05,6.7e-05,3.9e-05,3.6e-05,1.6e-05,2.6e-05,1.2e-05,3.5e-05,4.3e-05,7.7e-05,3e-06,2.3e-05,2.5e-05,3.8e-05,5.5e-05,3.3e-05,5.1e-05,4.4e-05,3.9e-05,2.9e-05,2.1e-05,1.6e-05,4.8e-05,2.9e-05,1e-06,6.5e-05,3.2e-05,2.8e-05,3.9e-05,1.8e-05,1.3e-05,1.5e-05,7.4e-05,2.8e-05,6.8e-05,9e-05,4.6e-05,5.5e-05,4.1e-05,5.2e-05,1.7e-05,3.8e-05,3.5e-05,1.5e-05,6e-06,3.3e-05,1.7e-05,1.5e-05,3.8e-05,3.5e-05,0.000112,4.1e-05,3.5e-05,2e-05,4.8e-05,1.1e-05,5.5e-05,1.8e-05,3e-05,5.1e-05,4e-06,1.9e-05,3.4e-05,2.2e-05,3.8e-05
3.9e-05,2.4e-05,0.000145,2.1e-05,9.1e-05,2.4e-05,2.1e-05,2.5e-05,1.5e-05,2.6e-05,2.6e-05,1.6e-05,5.2e-05,6e-06,3.3e-05,6.5e-05,2.9e-05,2.8e-05,1.6e-05,2.6e-05,1.4e-05,7.5e-05,1.5e-05,2.1e-05,2.2e-05,0.000125,5e-05,7.1e-05,6e-05,4.2e-05,3.6e-05,4e-05,2.4e-05,9e-06,2.6e-05,8e-06,1.3e-05,5.7e-05,2.6e-05,2.2e-05,3.7e-05,1.8e-05,1e-05,6e-06,5e-06,3.9e-05,3.3e-05,6e-06,2.5e-05,1.4e-05,3.5e-05,4.7e-05,4.4e-05,7e-05,2e-05,5.8e-05,8.4e-05,7.1e-05,5.1e-05,2.7e-05,2.2e-05,2.2e-05,2e-05,5.2e-05,5.3e-05,6.9e-05,1.6e-05,1.9e-05,3e-06,3.9e-05,5.1e-05,3.5e-05,3.5e-05,1.1e-05,2.9e-05,9e-06,1.8e-05,4.5e-05,7.5e-05,4.8e-05,6.1e-05,7.3e-05,7.3e-05,4.7e-05,4.6e-05,1.6e-05,5e-06,1.6e-05,7.5e-05,5.2e-05,1.8e-05,8.9e-05,6e-05,2.5e-05,2e-05,4.3e-05,1.3e-05,6.3e-05,4.1e-05,3.8e-05,1.9e-05,1.3e-05,1.1e-05,4.2e-05,6.5e-05,3.2e-05,0.000114,4.3e-05,3.6e-05,3.2e-05,4.7e-05,4.1e-05,5.3e-05,4.6e-05,3.9e-05,1.5e-05,1.1e-05,1.6e-05,1e-05,1e-06,5.5e-05
2.8e-05,3.8e-05,9.8e-05,4.3e-05,6.9e-05,6.6e-05,5.9e-05,2.1e-05,2.1e-05,2.9e-05,4e-05,4e-05,5e-05,1.1e-05,4e-06,3.8e-05,9e-06,2e-05,4.2e-05,3.7e-05,2.8e-05,5.3e-05,1.3e-05,4e-06,9e-06,0.000107,9.6e-05,0.000128,2e-05,3e-05,1.6e-05,2.4e-05,1.2e-05,1.5e-05,2.3e-05,3e-05,2.6e-05,7.2e-05,5e-06,1.9e-05,3.5e-05,3.4e-05,9e-06,2.4e-05,1.1e-05,1.4e-05,1e-05,2.7e-05,4.7e-05,8e-06,1.8e-05,5.6e-05,2.3e-05,5.5e-05,2.4e-05,5.5e-05,6.4e-05,4.6e-05,2.3e-05,4.1e-05,3.8e-05,3.5e-05,2.2e-05,3.8e-05,6.3e-05,7.2e-05,2.7e-05,5.9e-05,1.7e-05,2.8e-05,6.2e-05,3e-06,3.7e-05,1.5e-05,3.1e-05,2.6e-05,2.6e-05,2.6e-05,6.4e-05,2.4e-05,6.4e-05,4.1e-05,1.5e-05,3.4e-05,6.6e-05,2.3e-05,2.3e-05,1.9e-05,3.8e-05,1.8e-05,4.7e-05,1e-04,9.1e-05,6.7e-05,2.2e-05,5.5e-05,2.7e-05,9.2e-05,3.3e-05,3.5e-05,1.4e-05,3.9e-05,2.1e-05,2.4e-05,6.8e-05,6.6e-05,1e-04,5e-05,4e-05,2.8e-05,6.7e-05,7.2e-05,5.5e-05,3.2e-05,3e-05,8e-05,2.7e-05,1e-05,2e-05,3.2e-05,5.7e-05
7.7e-05,9.7e-05,0.000143,4.1e-05,0.000151,2.5e-05,6.9e-05,4.5e-05,4.7e-05,2.1e-05,2e-06,3.6e-05,4.8e-05,1.3e-05,4.7e-05,9.3e-05,4.1e-05,5.8e-05,5.3e-05,2.1e-05,6e-06,7.6e-05,4e-05,2.4e-05,5.6e-05,0.000102,4e-05,6.5e-05,0.00011,6.3e-05,4.5e-05,1.9e-05,1.4e-05,2.5e-05,1.5e-05,8e-06,1.7e-05,6.6e-05,5.5e-05,3.2e-05,3.9e-05,2.8e-05,2.2e-05,1.9e-05,3.5e-05,2.6e-05,2.7e-05,7.1e-05,3.6e-05,4.8e-05,1.7e-05,4.9e-05,3.7e-05,5.2e-05,7e-06,4.8e-05,5.3e-05,9.1e-05,7.5e-05,6.1e-05,3.6e-05,3e-05,3.1e-05,1.6e-05,6.5e-05,7.3e-05,7e-06,4.3e-05,5.9e-05,6.7e-05,3.7e-05,4.7e-05,2.8e-05,5.1e-05,6e-06,2.6e-05,2e-05,4.1e-05,5.9e-05,2.8e-05,3e-05,1.7e-05,3e-05,2.1e-05,1.4e-05,1.1e-05,2.9e-05,1e-06,4.4e-05,2.8e-05,5.9e-05,4.2e-05,7.9e-05,1.7e-05,1.5e-05,7.2e-05,1.3e-05,8e-05,9e-06,2e-05,3.1e-05,2e-05,4.2e-05,3.1e-05,6.3e-05,2e-05,0.000104,3.8e-05,5.9e-05,2.1e-05,7.7e-05,2.9e-05,6.6e-05,2.3e-05,3.1e-05,7.5e-05,6.1e-05,2.9e-05,3.5e-05,1.5e-05,5.4e-05
4.7e-05,5e-05,0.000106,1.8e-05,0.000141,4.3e-05,6.3e-05,1.9e-05,4e-05,4.9e-05,1.1e-05,1.2e-05,3.3e-05,3e-06,7.7e-05,6e-05,5.4e-05,3.1e-05,2.8e-05,1.7e-05,3.6e-05,9.7e-05,8e-06,5e-05,4.5e-05,5.8e-05,3e-05,8e-06,5.9e-05,9e-06,1e-05,2.9e-05,2.5e-05,1.9e-05,2.9e-05,7e-06,2.9e-05,3.8e-05,1.3e-05,1e-05,4.6e-05,3e-05,1.9e-05,1.7e-05,1.5e-05,1.9e-05,3e-05,4.4e-05,2.7e-05,3e-05,1.7e-05,5.2e-05,4.7e-05,4.7e-05,1.7e-05,4.1e-05,0.000104,6.6e-05,6.1e-05,5.4e-05,1.9e-05,4.4e-05,2e-05,1.3e-05,1.6e-05,9.5e-05,7e-06,1.1e-05,3.6e-05,2.9e-05,4.3e-05,3.7e-05,2.1e-05,2.6e-05,2.4e-05,5e-05,3e-06,3.1e-05,6.6e-05,6.7e-05,4.6e-05,5.6e-05,3.6e-05,2.7e-05,6.7e-05,1.1e-05,2.3e-05,3.5e-05,3.7e-05,2e-06,4.4e-05,3.9e-05,9.9e-05,7.7e-05,1.8e-05,3.9e-05,4.7e-05,6.7e-05,4.3e-05,1.7e-05,2.6e-05,1.6e-05,1.2e-05,5.5e-05,4.8e-05,3.3e-05,0.000101,1.6e-05,1.3e-05,5.5e-05,1.4e-05,7.8e-05,1.8e-05,4e-06,1e-05,3.1e-05,9e-06,2.5e-05,4e-05,3.1e-05,3.4e-05
6.7e-05,4.2e-05,7.4e-05,1.3e-05,7.5e-05,1.3e-05,2.6e-05,1.8e-05,3.7e-05,6.7e-05,6.9e-05,6.7e-05,8.7e-05,2.3e-05,6.3e-05,0.000104,1.7e-05,2.1e-05,4.9e-05,2.1e-05,3.3e-05,0.000116,5.1e-05,6.2e-05,6.5e-05,0.000102,2.7e-05,3.3e-05,6.5e-05,4.8e-05,3e-06,4.5e-05,1.6e-05,2.9e-05,4.6e-05,4.3e-05,3.3e-05,1.8e-05,5.5e-05,4.1e-05,3.6e-05,3.9e-05,1.6e-05,2.9e-05,2.6e-05,3.7e-05,9e-06,3e-05,3.4e-05,4e-05,4.1e-05,4.5e-05,2.1e-05,3e-05,1.2e-05,3.2e-05,8.1e-05,9.2e-05,3.5e-05,5.4e-05,3.9e-05,3.1e-05,4.7e-05,5.2e-05,7e-06,3.9e-05,3.8e-05,2.4e-05,2.7e-05,4.6e-05,2.7e-05,3.3e-05,1.3e-05,3.3e-05,1.8e-05,4.1e-05,4.7e-05,6.2e-05,6.5e-05,5e-05,2.7e-05,5.9e-05,2e-05,3.9e-05,5e-05,3.5e-05,2.1e-05,4.2e-05,8.1e-05,5.3e-05,4.1e-05,1.8e-05,3e-05,2.7e-05,5.1e-05,3.2e-05,4.1e-05,2.6e-05,2.8e-05,3.6e-05,3e-05,3.1e-05,6e-06,4.9e-05,3.9e-05,2.8e-05,0.000105,4.5e-05,3.7e-05,4.9e-05,3.6e-05,4.2e-05,3e-06,3.8e-05,1.6e-05,3.9e-05,4.5e-05,1.7e-05,3e-05,3.6e-05,1.8e-05
6.5e-05,1.5e-05,0.000116,2.3e-05,9e-05,3.3e-05,3.8e-05,1.5e-05,2.4e-05,5e-05,8.7e-05,4.2e-05,7.3e-05,2.9e-05,3.1e-05,4.6e-05,1.5e-05,2.8e-05,2.2e-05,2.9e-05,1.8e-05,4.6e-05,2.6e-05,3.4e-05,6e-06,8.3e-05,2.9e-05,2.9e-05,6.6e-05,2.6e-05,3.1e-05,1.8e-05,1.5e-05,1.5e-05,3.3e-05,2.6e-05,6e-06,3.8e-05,6e-05,1.6e-05,4.4e-05,4.3e-05,4.7e-05,5.4e-05,7.3e-05,4.7e-05,3.3e-05,6.7e-05,2e-05,3e-05,1.8e-05,1.8e-05,3.8e-05,3e-05,1.6e-05,5.3e-05,9.2e-05,9.4e-05,1.3e-05,6e-05,5.5e-05,5.1e-05,2.1e-05,5.1e-05,5.8e-05,4.2e-05,2.7e-05,2.2e-05,1e-05,1.2e-05,5.4e-05,1.7e-05,4e-05,6.1e-05,2.6e-05,4.7e-05,4.9e-05,2.4e-05,8.2e-05,4.3e-05,3e-05,4.7e-05,1.9e-05,4.6e-05,5.1e-05,1.7e-05,2.2e-05,6.4e-05,6.3e-05,2.6e-05,8.1e-05,4.4e-05,5.1e-05,2.5e-05,1.8e-05,1.8e-05,3.4e-05,8e-05,4.5e-05,2.6e-05,4.2e-05,5.5e-05,4.1e-05,5.2e-05,2.5e-05,4.8e-05,0.000114,3.8e-05,4.1e-05,1.1e-05,1.6e-05,4.7e-05,3.9e-05,7e-06,2.2e-05,2e-05,4.1e-05,3.8e-05,1.9e-05,2.2e-05,3.6e-05
3.3e-05,2.8e-05,0.000115,1.7e-05,0.000111,3.7e-05,4e-06,1.5e-05,6e-06,4e-05,2.7e-05,2.2e-05,2.3e-05,2.1e-05,4.8e-05,5.1e-05,3.5e-05,1.8e-05,1.6e-05,1.3e-05,2.8e-05,5.7e-05,2.9e-05,5e-06,2.3e-05,8.2e-05,2.8e-05,1.8e-05,5.3e-05,1.9e-05,1.4e-05,2e-05,1.5e-05,1.7e-05,1.9e-05,1e-05,1.3e-05,1.4e-05,8e-06,3.2e-05,3.7e-05,2.4e-05,4e-06,2.6e-05,4e-05,4.3e-05,2.5e-05,5.1e-05,2.6e-05,4.1e-05,3.1e-05,2.9e-05,4.5e-05,4.6e-05,3e-05,2.1e-05,0.000107,5.8e-05,3.5e-05,3.8e-05,1.5e-05,3.7e-05,6.1e-05,7e-06,3.2e-05,5.8e-05,1.5e-05,4e-06,9e-06,2.1e-05,2.3e-05,1.2e-05,5.1e-05,1.8e-05,1.6e-05,1.8e-05,1.5e-05,3.2e-05,4.7e-05,3.6e-05,3e-05,4e-05,3.1e-05,1.7e-05,4.8e-05,9e-06,1.6e-05,2.7e-05,7.8e-05,2e-05,6.4e-05,3.2e-05,7.5e-05,5.5e-05,3.3e-05,3.3e-05,1.4e-05,5.4e-05,4.7e-05,2.6e-05,2.4e-05,7e-06,2.2e-05,4e-05,2.1e-05,5.1e-05,0.00012,1.8e-05,2e-05,2.8e-05,3.5e-05,1.3e-05,5.4e-05,4e-06,6e-06,2.8e-05,3e-05,1.5e-05,3e-05,1.3e-05,1.1e-05
3.5e-05,2.9e-05,0.000105,1.7e-05,0.000101,3.1e-05,2.2e-05,2.2e-05,1e-05,2.8e-05,3.5e-05,1.9e-05,2.5e-05,1.7e-05,3e-05,5.7e-05,1.3e-05,1.5e-05,2.4e-05,1.3e-05,8e-06,4.5e-05,1.5e-05,9e-06,2.3e-05,7.8e-05,1.9e-05,2.2e-05,5.4e-05,2.5e-05,1.8e-05,2.1e-05,3e-06,1.9e-05,2.2e-05,1.7e-05,9e-06,1.2e-05,2.9e-05,3.2e-05,3.6e-05,6e-06,9e-06,1.8e-05,3.3e-05,3.6e-05,2.6e-05,5.5e-05,2.3e-05,2.4e-05,2e-05,3.6e-05,2.8e-05,3.4e-05,2.6e-05,4.2e-05,9.3e-05,6e-05,1.2e-05,6e-06,4.6e-05,1.3e-05,3.4e-05,1.7e-05,2.9e-05,7.4e-05,2e-06,7e-06,1e-05,1.7e-05,3.5e-05,4e-06,3.1e-05,1.9e-05,1.5e-05,1e-05,1e-05,1e-05,7e-05,3.1e-05,2.7e-05,3.8e-05,2.7e-05,1.2e-05,4.3e-05,7e-06,2.1e-05,2.4e-05,6.4e-05,1.9e-05,3.7e-05,1.4e-05,4.9e-05,3.6e-05,3.4e-05,9e-06,1e-05,5.7e-05,3e-05,6e-06,1.1e-05,1.5e-05,1.5e-05,3.3e-05,2.9e-05,4.7e-05,9.8e-05,5e-06,5e-06,2.5e-05,3.2e-05,3e-05,2.8e-05,2e-05,1.4e-05,2.9e-05,1.1e-05,2.4e-05,2.2e-05,1.2e-05,1.4e-05
3e-05,3.1e-05,9.5e-05,9e-06,0.000107,2.9e-05,9e-06,2.8e-05,6e-06,1.8e-05,2.4e-05,2e-05,3.4e-05,1.4e-05,3.4e-05,5.5e-05,1.6e-05,1.8e-05,2e-05,5e-06,3e-06,5.3e-05,1.8e-05,1.1e-05,1.9e-05,7.3e-05,2.9e-05,2.3e-05,4.6e-05,2.8e-05,2.6e-05,1.9e-05,6e-06,1.4e-05,1.6e-05,1.5e-05,6e-06,1.9e-05,2.7e-05,2.7e-05,3.2e-05,1e-06,4e-06,1.1e-05,3.1e-05,2.7e-05,2.5e-05,4.7e-05,2.3e-05,1.2e-05,1.5e-05,3.4e-05,3.2e-05,3e-05,2.5e-05,4.8e-05,8.3e-05,6.6e-05,2.5e-05,1.9e-05,2.8e-05,8e-06,3.8e-05,2.3e-05,3.5e-05,7.2e-05,6e-06,7e-06,1e-06,1.8e-05,3.1e-05,7e-06,2.4e-05,2.7e-05,1.6e-05,9e-06,7e-06,1e-05,6.2e-05,3.2e-05,2.7e-05,4.2e-05,2.4e-05,2e-06,4.3e-05,6e-06,1.4e-05,1.1e-05,5.9e-05,7e-06,3.7e-05,1.7e-05,5.1e-05,3.5e-05,2.6e-05,1.7e-05,1e-05,5.9e-05,2.7e-05,4e-06,1.5e-05,2e-05,1.4e-05,3.2e-05,3.2e-05,3.9e-05,0.000101,1e-05,8e-06,3e-05,3e-05,4e-05,2.5e-05,1.7e-05,5e-06,2.5e-05,5e-06,2.2e-05,2.1e-05,1e-05,2.1e-05
3.1e-05,3e-05,9.7e-05,7e-06,0.000104,1.7e-05,1.7e-05,1.8e-05,9e-06,1.6e-05,2.2e-05,1.7e-05,3.3e-05,1.2e-05,3.4e-05,5.6e-05,2.1e-05,1.7e-05,2.3e-05,6e-06,8e-06,5e-05,1.9e-05,1.3e-05,1.6e-05,7.6e-05,2.6e-05,3.1e-05,4.5e-05,2.5e-05,2e-05,1.5e-05,3e-06,1.7e-05,1.8e-05,1.1e-05,3e-06,2e-05,2.9e-05,2.8e-05,3.2e-05,0,1e-05,1.4e-05,2.9e-05,2.7e-05,1.8e-05,4.9e-05,2.2e-05,1.2e-05,1.1e-05,3e-05,2.7e-05,3.5e-05,2.6e-05,4.2e-05,8.6e-05,6.5e-05,3e-05,1.7e-05,2.6e-05,8e-06,3.4e-05,2.4e-05,2.9e-05,7e-05,5e-06,5e-06,4e-06,1.4e-05,2.7e-05,3e-06,2.7e-05,2.8e-05,1.2e-05,1.1e-05,5e-06,1e-05,6.3e-05,3e-05,2.9e-05,4.1e-05,2.5e-05,3e-06,4e-05,7e-06,1.1e-05,1.2e-05,5.8e-05,4e-06,3.4e-05,1.9e-05,4.7e-05,3.8e-05,2.2e-05,1.7e-05,9e-06,5.6e-05,2.8e-05,8e-06,1.2e-05,1.8e-05,1.4e-05,3.2e-05,3.1e-05,3.8e-05,0.000104,8e-06,1.3e-05,2.9e-05,3.3e-05,3.7e-05,2.8e-05,2.3e-05,5e-06,2.6e-05,6e-06,2.2e-05,1.9e-05,1.1e-05,2.4e-05
