0.005334,0.00513,0.005358,0.005847,0.006103,0.005937,0.005488,0.00505,0.005115,0.006657,0.008946,0.009344,0.008151,0.007121,0.007512,0.008209,0.007329,0.006555,0.006317,0.006268,0.006428,0.005912,0.005938,0.006169,0.005469,0.005062,0.005126,0.005047
0.006378,0.006049,0.006408,0.007047,0.007434,0.007333,0.006791,0.00616,0.00615,0.00816,0.011186,0.011649,0.010078,0.00884,0.009265,0.010027,0.008965,0.008045,0.007627,0.007473,0.007748,0.007264,0.007297,0.007582,0.006856,0.0064,0.00646,0.006276
0.00797,0.007442,0.008039,0.00892,0.009453,0.009474,0.008846,0.007936,0.007807,0.01059,0.014838,0.015343,0.013206,0.011771,0.012134,0.01282,0.011511,0.010419,0.009645,0.009188,0.009711,0.009483,0.00949,0.009761,0.009031,0.008503,0.008553,0.008196
0.00884,0.008116,0.008864,0.009905,0.01027,0.010327,0.009898,0.008969,0.008815,0.012085,0.017102,0.017562,0.01519,0.013877,0.013817,0.014057,0.012912,0.011869,0.010776,0.010006,0.010809,0.011024,0.010757,0.01086,0.010223,0.009643,0.009719,0.009217
0.008961,0.008249,0.008967,0.009888,0.009707,0.009745,0.00979,0.009203,0.009282,0.012822,0.018003,0.018595,0.016576,0.015117,0.01386,0.013429,0.013173,0.012374,0.011122,0.010347,0.011262,0.011653,0.010768,0.010721,0.010235,0.009646,0.009766,0.009101
0.009302,0.009127,0.009565,0.00979,0.009111,0.009231,0.009685,0.009826,0.010497,0.014599,0.0203,0.021147,0.019066,0.016497,0.013944,0.013359,0.013758,0.012753,0.011372,0.010935,0.011783,0.011928,0.010594,0.010577,0.010246,0.009554,0.009599,0.008926
0.010111,0.010999,0.011167,0.01059,0.01003,0.010155,0.010509,0.011246,0.012365,0.018044,0.025919,0.026754,0.023271,0.018929,0.015204,0.014794,0.015246,0.013742,0.012114,0.011796,0.012523,0.012416,0.011032,0.011237,0.01134,0.010517,0.010263,0.010001
0.011042,0.012715,0.013074,0.012069,0.011751,0.011841,0.012085,0.013271,0.014357,0.021637,0.032573,0.033112,0.027477,0.021962,0.017158,0.016343,0.016515,0.014647,0.013273,0.013415,0.014076,0.01406,0.012969,0.013305,0.013832,0.012629,0.011875,0.012609
0.012164,0.014006,0.014658,0.0141,0.014274,0.014466,0.014633,0.015406,0.016411,0.024857,0.037497,0.037945,0.030823,0.024372,0.018658,0.017487,0.018098,0.016419,0.015482,0.016178,0.016954,0.01697,0.016175,0.016944,0.01745,0.015544,0.014617,0.016278
0.013172,0.014758,0.015666,0.015974,0.016721,0.017199,0.017358,0.017099,0.018,0.027145,0.039968,0.041057,0.033928,0.026211,0.019199,0.017988,0.020249,0.019319,0.018069,0.019412,0.020683,0.019797,0.018732,0.020404,0.0209,0.018545,0.017751,0.01959
0.013899,0.014382,0.015366,0.016807,0.018305,0.018889,0.018655,0.017541,0.018474,0.027985,0.039766,0.040605,0.034862,0.027308,0.019443,0.017957,0.021135,0.020821,0.018787,0.020922,0.022939,0.020867,0.019271,0.021334,0.021582,0.019507,0.019402,0.02074
0.014741,0.01379,0.014957,0.016721,0.017835,0.017857,0.017357,0.015878,0.016673,0.025798,0.035685,0.035641,0.03124,0.025513,0.018763,0.016816,0.019767,0.020429,0.017823,0.0193,0.021723,0.020043,0.018537,0.019762,0.01922,0.01783,0.018636,0.019571
0.015739,0.013544,0.014789,0.016564,0.016514,0.015363,0.014892,0.013305,0.013118,0.020389,0.027274,0.026683,0.024256,0.02139,0.016954,0.015088,0.01813,0.019933,0.017156,0.01644,0.018467,0.018328,0.017156,0.017211,0.016125,0.015446,0.016935,0.017632
0.0157,0.013054,0.013846,0.015338,0.014542,0.012933,0.012979,0.011381,0.009921,0.01413,0.017969,0.017831,0.017721,0.017553,0.015332,0.014074,0.016602,0.018515,0.016588,0.014965,0.015941,0.016396,0.015351,0.014943,0.014147,0.014128,0.015829,0.016221
0.014798,0.013524,0.014194,0.015763,0.014683,0.012573,0.012349,0.010872,0.009422,0.011979,0.014324,0.014226,0.014237,0.014503,0.014277,0.01494,0.01639,0.016466,0.01496,0.015138,0.016726,0.016153,0.014575,0.014837,0.014818,0.014905,0.015497,0.014954
0.017348,0.017693,0.018612,0.02104,0.019039,0.015188,0.014017,0.012628,0.011726,0.014441,0.016802,0.016087,0.014955,0.015599,0.01738,0.018667,0.017936,0.015772,0.014495,0.017954,0.022266,0.020762,0.018153,0.018718,0.01865,0.018518,0.018219,0.017132
0.025213,0.025787,0.027183,0.031359,0.027926,0.021443,0.019382,0.017191,0.016793,0.021927,0.025245,0.02246,0.019791,0.021334,0.024322,0.025465,0.023576,0.020631,0.019008,0.023866,0.030897,0.030475,0.027995,0.027679,0.026434,0.026864,0.02626,0.024994
0.034807,0.034864,0.036743,0.042392,0.038644,0.030165,0.026899,0.023179,0.023434,0.031849,0.035981,0.030741,0.026323,0.027986,0.031784,0.033392,0.031056,0.028173,0.026565,0.029894,0.037743,0.040578,0.040624,0.038786,0.035489,0.03793,0.037276,0.035729
0.042235,0.04159,0.043652,0.04835,0.045842,0.038443,0.034343,0.028666,0.029011,0.039681,0.044157,0.038597,0.033229,0.03347,0.037226,0.040133,0.038431,0.035223,0.034106,0.033436,0.039299,0.047493,0.051859,0.046994,0.041522,0.048151,0.048642,0.046271
0.045469,0.044622,0.044962,0.045214,0.045898,0.043987,0.039686,0.03152,0.030555,0.040887,0.044893,0.042118,0.037794,0.035424,0.037628,0.041766,0.043551,0.040829,0.039799,0.036093,0.039098,0.05131,0.057555,0.048453,0.043316,0.05537,0.058309,0.05372
0.045652,0.047171,0.044819,0.038957,0.043882,0.048747,0.042611,0.032319,0.030622,0.039257,0.042614,0.043048,0.040879,0.0358,0.033735,0.037217,0.043751,0.043267,0.042905,0.041927,0.044447,0.0546,0.057199,0.046028,0.044512,0.056889,0.059797,0.054887
0.049619,0.055846,0.050879,0.042157,0.047895,0.056672,0.047406,0.033532,0.035311,0.045887,0.047396,0.046,0.043613,0.037068,0.033054,0.033867,0.04067,0.044968,0.04392,0.04734,0.054798,0.057859,0.053544,0.044462,0.044492,0.051855,0.052447,0.051037
0.054933,0.061268,0.056266,0.049185,0.053578,0.063808,0.053168,0.035178,0.040048,0.054288,0.054261,0.049633,0.045201,0.03864,0.036752,0.035975,0.041442,0.049284,0.043069,0.048057,0.063573,0.060204,0.049053,0.041963,0.039967,0.043223,0.04421,0.047189
0.053448,0.057855,0.055041,0.049893,0.053045,0.061916,0.051312,0.034161,0.040887,0.055447,0.055148,0.050398,0.045836,0.038935,0.038905,0.041288,0.048754,0.055007,0.040727,0.043321,0.061559,0.05647,0.045333,0.038935,0.032245,0.035813,0.042592,0.046034
0.044005,0.04565,0.045381,0.045718,0.050138,0.051998,0.041261,0.031525,0.040723,0.051879,0.052809,0.050231,0.044712,0.036284,0.038487,0.045699,0.052593,0.055572,0.038411,0.035784,0.047609,0.045935,0.043474,0.036648,0.028188,0.034627,0.04512,0.047198
0.036472,0.036402,0.037958,0.043432,0.050614,0.045891,0.035283,0.029937,0.039234,0.048414,0.048871,0.048629,0.0432,0.032863,0.036968,0.046863,0.051923,0.05397,0.038534,0.03154,0.034737,0.038293,0.043116,0.03348,0.030156,0.042455,0.049961,0.050027
0.033465,0.036561,0.044982,0.048958,0.054297,0.052201,0.042814,0.03593,0.042402,0.050376,0.047835,0.046597,0.044588,0.036668,0.039336,0.047765,0.05238,0.054164,0.041631,0.034031,0.034986,0.040569,0.043371,0.032262,0.036598,0.053413,0.056947,0.053961
0.038154,0.046205,0.057405,0.052893,0.054083,0.061219,0.056718,0.050931,0.053682,0.05945,0.057102,0.055182,0.055794,0.050887,0.051845,0.06042,0.061817,0.055292,0.044572,0.038411,0.039087,0.044777,0.043102,0.034615,0.04661,0.065607,0.068761,0.061456
0.048777,0.058338,0.064635,0.050888,0.047686,0.067134,0.073044,0.072635,0.075762,0.074945,0.071659,0.071978,0.07169,0.068781,0.067157,0.077668,0.079046,0.059964,0.045385,0.041118,0.043345,0.053218,0.050807,0.042249,0.057963,0.077355,0.082228,0.06912
0.064946,0.07117,0.065891,0.046206,0.039693,0.066449,0.086922,0.0947,0.098389,0.087641,0.080253,0.08477,0.082742,0.081125,0.074433,0.087546,0.09496,0.065289,0.041807,0.037833,0.044132,0.061436,0.061008,0.051758,0.067105,0.082655,0.087865,0.072933
0.079912,0.08416,0.068947,0.049752,0.045327,0.068322,0.093195,0.105351,0.111499,0.096861,0.079494,0.086159,0.086872,0.082961,0.071474,0.087755,0.10025,0.06508,0.0352,0.029011,0.036874,0.061594,0.066114,0.059422,0.068759,0.071864,0.077186,0.072706
0.085412,0.092146,0.072796,0.059712,0.060248,0.078064,0.094544,0.100177,0.106845,0.097763,0.076149,0.076501,0.079287,0.075417,0.067738,0.088837,0.100327,0.062066,0.028479,0.018675,0.026996,0.056177,0.064547,0.061676,0.065792,0.053044,0.053189,0.061664
0.076498,0.085887,0.068675,0.065707,0.069817,0.080814,0.083402,0.084207,0.090565,0.085227,0.071383,0.062529,0.064442,0.065382,0.058969,0.081858,0.093227,0.054738,0.021404,0.012248,0.021888,0.047978,0.056573,0.056195,0.054887,0.036673,0.035441,0.046511
0.056698,0.066987,0.059409,0.061876,0.064331,0.06639,0.058041,0.057248,0.063285,0.060587,0.054849,0.043963,0.044817,0.050445,0.047067,0.061642,0.069504,0.03902,0.014238,0.010474,0.020614,0.03625,0.041746,0.046498,0.041429,0.025039,0.027236,0.035373
0.036397,0.04596,0.049454,0.04815,0.045127,0.041328,0.034414,0.034222,0.039519,0.041049,0.032877,0.029714,0.033186,0.035079,0.033268,0.036462,0.039332,0.024218,0.011634,0.011028,0.017994,0.023808,0.028762,0.043606,0.041917,0.026432,0.027844,0.028151
0.024139,0.029139,0.033356,0.030308,0.028195,0.025675,0.024683,0.024724,0.027816,0.026689,0.016908,0.020833,0.029211,0.0279,0.024351,0.021121,0.018571,0.015721,0.013001,0.012275,0.013218,0.017142,0.02801,0.045799,0.045624,0.033698,0.034684,0.029851
0.018816,0.019304,0.018684,0.021628,0.028319,0.02589,0.021606,0.025159,0.027618,0.020471,0.013343,0.020015,0.026545,0.025876,0.025493,0.018891,0.011891,0.012575,0.014058,0.013128,0.00905,0.015098,0.030982,0.044444,0.041907,0.03725,0.039183,0.032071
0.016101,0.012311,0.01119,0.020081,0.030835,0.025634,0.016671,0.023114,0.026002,0.019515,0.016343,0.019602,0.02303,0.022605,0.02742,0.023096,0.01284,0.012837,0.015794,0.014044,0.007593,0.013886,0.0303,0.035394,0.030514,0.03339,0.036294,0.028559
0.018144,0.01143,0.011006,0.020092,0.030159,0.025569,0.015809,0.021529,0.02177,0.01842,0.018898,0.018433,0.023521,0.025017,0.032261,0.03019,0.017633,0.017038,0.019421,0.01351,0.006216,0.013316,0.025454,0.022709,0.017926,0.024036,0.026901,0.021093
0.023183,0.014213,0.013644,0.021304,0.029418,0.028745,0.021371,0.022885,0.018011,0.020433,0.020627,0.019031,0.025458,0.02879,0.038004,0.035244,0.022533,0.022704,0.022698,0.011626,0.005179,0.013373,0.019468,0.014891,0.015006,0.017085,0.016826,0.015632
