5e-05,1.9e-05,8.9e-05,1e-06,0.000128,2.1e-05,1.3e-05,8e-06,0.000117,0.00011,3.4e-05,2.1e-05,1e-05,3e-05,7.1e-05,9e-05,2.6e-05,4.5e-05,7.4e-05,0.000124,5e-06,7.9e-05,7.7e-05,3.4e-05,3.6e-05,5.5e-05,4e-05,1.8e-05,7.9e-05,3e-05,6.6e-05,2e-06,3e-05,3.7e-05,9e-06,1.4e-05,8.5e-05,3.7e-05,2.2e-05,4.5e-05,9e-06,6e-06,3.9e-05,3.7e-05,2.1e-05,3.5e-05,4.4e-05,5.4e-05,8.1e-05,4.9e-05,2e-05,2.2e-05,4.8e-05,3.9e-05,1.2e-05,2e-06,8e-06,2.7e-05,3.8e-05,5.1e-05,9e-06,6.3e-05,3.3e-05,6e-06,6.2e-05,8.5e-05,7e-06,3.2e-05,2.2e-05,1e-05,3.2e-05,4.9e-05,9e-06,1.6e-05,2e-06,5.2e-05,3e-06,5e-06,6e-06,8e-06,1.2e-05,5e-06,2.2e-05,3.7e-05,2.7e-05,6.9e-05,6.3e-05,2e-06,2.8e-05,1e-06,5e-06,5e-05,1.1e-05,1.4e-05,1.2e-05,4.6e-05,1.5e-05,3.6e-05,3.4e-05,2.3e-05,2.1e-05,2.5e-05,9e-06,3.2e-05,9.6e-05,1.7e-05,2.5e-05,1e-06,4e-06,8.5e-05,2.4e-05,6.5e-05,6.2e-05,4.2e-05,4.6e-05,1.5e-05,1.6e-05,1.4e-05,7e-06,4.9e-05,4.9e-05
0.000157,3.9e-05,0.00019,3.7e-05,0.000278,5.4e-05,1.1e-05,4.2e-05,0.000289,0.000314,0.000112,5.9e-05,3.4e-05,8.6e-05,0.000136,0.000174,0.000112,8.6e-05,0.000123,0.000295,6e-05,0.000167,0.000157,0.000109,6.5e-05,0.000114,3e-05,0.000102,0.000142,7.5e-05,8.1e-05,6.1e-05,8e-05,7.2e-05,4.6e-05,5.3e-05,0.000136,5e-05,0.000108,7.5e-05,3e-05,3.5e-05,0.00011,5e-05,0.000108,3.5e-05,0.000141,0.000138,0.000184,7.6e-05,7.4e-05,4.8e-05,0.000112,7.2e-05,5.5e-05,8.5e-05,3.3e-05,3.7e-05,0.000117,0.000134,2.8e-05,0.000142,7.7e-05,6.1e-05,0.000179,0.000241,2.9e-05,6.1e-05,8e-06,2.2e-05,8.1e-05,0.000107,8e-05,0.000104,4e-05,0.000128,1.9e-05,6.7e-05,6.2e-05,4.5e-05,4.3e-05,7e-06,6.7e-05,0.000113,8.5e-05,0.000167,0.000132,2e-05,5.9e-05,5e-06,5.4e-05,9.5e-05,4.2e-05,4.3e-05,5.2e-05,9.4e-05,2.3e-05,3.8e-05,7.7e-05,4e-05,4.1e-05,9e-05,3e-05,7e-05,0.000228,3e-05,7.5e-05,4.2e-05,2.7e-05,0.000174,6.4e-05,0.000178,0.000103,8.3e-05,9.2e-05,5.9e-05,1.9e-05,1.7e-05,7.8e-05,0.000106,0.000104
0.00033,0.000167,0.00037,3.9e-05,0.00025,0.000103,0.000241,3e-05,0.000334,0.000236,0.000134,0.000177,0.000168,5.5e-05,0.000276,0.000153,0.000262,0.000135,2.6e-05,0.000253,0.000118,0.000304,0.000161,0.00027,0.000187,7.7e-05,6e-05,0.000163,0.000124,0.000134,0.000155,7.4e-05,7.6e-05,8.1e-05,0.000103,0.000138,0.000197,0.000247,0.000269,0.00021,0.00016,0.000105,8.4e-05,0.000116,0.000209,0.000204,0.000212,0.000114,0.000206,7.9e-05,0.000122,0.000132,0.000335,5.5e-05,0.000227,0.000107,8.5e-05,9.6e-05,0.000201,0.000121,0.000118,0.00021,5.8e-05,0.000138,0.000266,0.000259,4.3e-05,5.3e-05,2.9e-05,0.000186,0.000119,0.000101,0.000152,9.9e-05,2.3e-05,0.000156,1.6e-05,0.000106,2.6e-05,4.9e-05,0.000191,0.000104,0.000136,5.5e-05,8.5e-05,0.000224,0.00017,2e-06,9.2e-05,3.6e-05,0.000181,0.000191,0.00011,0.000116,0.000116,3e-05,0.000185,0.000106,0.000178,6e-05,7.1e-05,0.000143,6e-05,3.5e-05,0.000305,0.000156,0.000117,0.000132,5e-06,0.000299,0.000117,0.000143,0.000227,0.000166,6.7e-05,7.2e-05,8e-05,6.7e-05,0.000155,0.000165,4.6e-05
0.000747,0.000917,0.000302,0.000177,0.000409,0.000186,0.000194,0.00038,0.000306,0.000219,0.000375,0.000129,0.000326,0.000178,0.000343,0.000425,0.00029,0.000306,0.000275,0.000325,0.00026,0.000433,0.00044,0.000569,0.000253,0.000183,0.000124,0.000213,0.000223,0.000367,0.000457,0.000271,0.000262,0.000434,8.5e-05,0.000194,0.000295,0.000503,0.000693,0.000367,0.000107,0.000286,0.000366,0.000287,0.000339,0.000202,0.000109,0.000254,0.000441,0.000261,0.000135,0.000149,0.000272,0.000568,0.000584,0.000412,0.000385,0.000135,0.000467,0.00027,0.000289,8.5e-05,0.000326,0.000186,0.00051,0.000786,0.000344,0.000186,0.000215,0.000197,0.000294,6.3e-05,0.000211,0.000197,0.000251,6.9e-05,0.000166,4.4e-05,0.000181,0.00021,0.000409,0.000233,0.000137,0.00032,0.000349,0.000184,0.000319,0.00032,0.000272,9.4e-05,0.000342,6.5e-05,2.9e-05,0.000182,0.000332,0.000248,0.000301,0.000347,0.000156,0.000148,0.000146,0.000298,0.000173,6.8e-05,0.000338,0.000313,0.000106,0.000308,0.000249,0.000517,0.000249,0.000185,0.000172,0.000278,0.000202,0.000133,0.000281,0.000231,0.000126,9.7e-05,0.000267
0.000859,0.001146,0.000822,0.000719,0.000659,0.000343,0.00019,0.00048,3e-04,0.000399,0.000494,0.000413,0.000104,0.000132,0.00018,0.000483,0.000295,0.000244,0.000525,0.000587,0.000613,0.000197,0.000313,0.000607,0.00069,0.000601,5.6e-05,0.000207,0.000298,0.000557,0.000167,0.000129,0.000226,0.000619,0.000624,7.4e-05,0.000348,0.000729,0.000555,0.000178,0.000216,0.000177,0.000202,0.000335,0.000354,0.000265,0.000157,0.00015,0.000593,0.000295,0.000362,0.00032,0.000311,0.000488,0.000987,0.000672,0.000149,0.000226,0.000679,0.000719,7.3e-05,0.000263,0.000415,0.000448,0.000799,0.000891,0.000607,0.000182,0.000327,0.00041,6e-04,0.000536,0.000413,0.000407,0.00039,0.000305,0.000363,0.000276,0.000106,0.000451,0.000393,0.000308,0.000439,0.000256,0.000368,0.000688,0.000563,0.000564,0.000179,0.000338,0.000158,0.000314,0.000252,0.000128,0.000514,0.000198,0.000242,0.000193,0.000194,8.6e-05,0.000117,0.000301,0.000329,0.000309,0.000401,0.000545,0.00018,0.000366,0.000344,0.000467,0.000537,0.000477,0.000262,0.000219,0.000458,0.00042,0.000183,0.000194,0.00018,7.5e-05,0.000344
0.000338,0.00037,0.00024,0.000325,0.00073,0.000249,0.00038,0.000539,0.000531,0.00019,0.000115,0.000222,0.000156,0.000193,0.000315,0.000479,0.000379,0.000316,0.00025,0.000373,0.000113,0.000262,0.000238,0.00027,0.000302,0.000257,0.000352,0.000375,0.000165,0.000417,2e-04,9.5e-05,0.00032,0.000229,0.000234,0.000417,0.000218,0.000317,0.000184,0.00041,0.000121,0.000258,0.00038,0.000193,0.000297,9.6e-05,9.2e-05,4.6e-05,0.000417,0.000309,0.000196,0.00022,0.00015,0.000481,0.000549,0.000268,9.4e-05,0.000283,0.000501,3.9e-05,0.000212,0.000208,1e-04,0.000367,0.000324,0.000177,0.000136,0.000181,0.00014,0.000264,0.000236,0.000367,0.000602,0.000143,0.000187,6.9e-05,0.000184,7.6e-05,0.000273,0.000285,0.000104,0.000213,0.000383,0.000163,0.000272,0.00044,9.4e-05,0.000298,0.000181,0.000381,0.000484,0.000414,0.000106,0.000168,0.000176,0.000231,0.000288,8.6e-05,0.000116,4.5e-05,0.000123,0.000125,0.000279,0.000173,0.000171,0.000165,0.000308,0.000317,0.000232,0.00025,0.000107,0.000132,7.7e-05,0.000202,0.000167,4e-05,0.000236,0.000378,0.000191,0.000108,0.000105
0.000192,0.000166,0.000151,0.000309,0.000291,0.000333,0.000593,0.000136,0.000457,0.000541,0.000302,0.000175,3.7e-05,0.000144,0.000427,0.000211,0.00019,0.000293,0.000194,0.000204,0.000504,0.000462,0.00042,7.1e-05,3.2e-05,0.000147,6e-06,0.000377,0.000248,0.000179,0.000145,0.000152,0.000337,0.00015,0.000209,0.000379,5.4e-05,0.000145,0.000207,0.000224,0.000312,0.000279,0.000155,0.000139,0.000153,0.000187,1.5e-05,0.000188,0.000348,0.000146,0.000112,0.000209,0.000108,0.000571,0.000124,0.000166,0.000205,0.000229,0.000285,0.000384,8.3e-05,7.5e-05,0.000307,0.000337,0.000177,0.000369,0.000202,0.000144,7.1e-05,0.000175,0.000225,0.000403,0.000227,0.000272,0.000252,0.000344,0.000442,0.000321,0.000111,0.000317,0.000157,0.000204,0.000541,0.000169,0.000169,0.00026,0.000275,6.4e-05,0.000141,0.000215,0.000144,0.000186,0.000148,0.000215,3.8e-05,0.00019,0.000204,0.000114,0.000302,0.000179,7.6e-05,0.000258,0.000246,0.000258,0.000111,0.000162,0.000362,0.000231,0.00026,0.000274,0.000404,0.000248,0.000145,9.7e-05,0.000179,0.000101,0.000208,0.000115,0.000252,0.00025,8.1e-05
0.000266,0.000429,0.000112,0.000134,0.000647,0.000531,0.000313,0.000653,0.000202,0.000347,0.000364,0.000269,0.000469,0.000322,0.000415,0.000959,0.000987,0.000727,0.000305,0.000422,0.000418,0.000871,0.000389,0.000254,0.000184,0.000234,9.3e-05,0.00027,9.9e-05,0.000138,0.000264,0.00043,6.5e-05,4e-04,0.000576,3.2e-05,0.000494,0.000357,0.000151,0.000314,6e-05,0.000413,0.00042,0.000327,0.000365,0.000346,0.000422,0.000318,0.000484,0.000851,0.000525,0.000291,0.000157,0.000597,0.000442,0.000154,0.000167,0.00023,0.00058,0.000724,0.000674,0.000472,0.000481,0.000658,0.000159,0.000561,0.000292,0.000349,0.000201,0.000348,0.000238,0.000188,0.000239,0.000153,0.00027,0.000187,0.000599,0.000473,0.000163,0.000228,0.000296,0.000138,0.000149,0.000297,9.9e-05,0.000168,0.000195,0.000221,0.000154,4e-05,0.000111,0.000301,0.000244,0.000385,0.000467,0.000138,0.000282,0.000281,0.000497,0.000295,0.000254,0.000451,0.000508,2e-04,4.5e-05,4e-04,0.000255,0.00018,0.000107,0.000233,0.000437,0.000119,0.000326,0.000267,0.00022,0.000208,0.000112,0.000248,0.000252,0.000257,0.000352
0.001087,0.000972,0.000626,3e-04,0.000818,0.000596,0.000758,0.000664,0.000189,0.000111,0.000591,0.000331,0.000753,0.000974,0.001075,0.001053,0.000569,0.000401,8.2e-05,0.000617,0.000817,0.000705,0.000684,0.000331,0.000467,0.000179,0.000342,0.000377,0.000266,0.000185,0.000101,0.000436,0.000419,0.000756,0.000739,0.000914,0.001026,0.000529,0.000343,0.000431,0.000502,0.000581,0.000496,0.000308,0.000221,0.000189,0.000337,0.000364,0.000406,0.000903,0.000951,0.000356,0.000302,0.000174,0.000394,5e-04,0.000413,5.3e-05,0.000658,0.000403,0.000683,0.000242,0.000355,0.000515,0.00061,0.000596,0.000411,0.000639,0.00043,7.8e-05,6.1e-05,0.000163,0.000278,0.000449,0.000264,0.000369,0.000308,0.000257,0.000452,0.000351,0.000334,0.000211,0.000305,0.000113,0.000428,0.000125,0.000236,0.000438,0.000236,0.000309,8.1e-05,0.000125,0.000384,0.000173,0.000167,0.000163,0.00023,0.000125,0.00021,0.000183,0.000344,0.000335,0.000325,0.000247,0.00034,0.000596,0.000567,0.000329,0.00028,7.4e-05,0.000536,0.000377,0.000481,0.000399,0.000442,0.000194,0.000252,0.000295,0.000101,0.000122,0.000154
0.000357,0.000695,0.000522,0.000383,8e-04,0.000807,0.000792,0.000302,0.000486,0.000297,0.000905,0.00066,0.000458,0.000461,0.000502,0.000454,0.000161,0.000196,0.000456,0.00055,0.000334,2.1e-05,0.000443,0.000736,0.000357,0.000382,0.00043,0.000513,0.000244,7.8e-05,0.000524,0.000478,0.000288,0.000429,0.000122,0.000657,0.000449,0.000295,0.00025,0.000416,9.4e-05,0.000411,0.000165,0.000279,5e-05,6.7e-05,0.000534,0.000364,0.000181,0.000467,0.000114,0.000406,0.000157,8.9e-05,0.000482,8.8e-05,0.000251,0.000368,0.000592,0.000939,0.00026,0.000157,0.000436,0.000605,0.000617,0.000622,0.000308,0.000537,0.000444,0.000217,0.000178,0.00019,0.00021,0.000156,0.000331,0.000434,0.000375,0.00033,0.000443,0.000151,0.000194,0.000172,0.000494,0.00049,0.000322,0.000564,0.000185,0.000349,0.000288,0.000544,0.000451,0.000487,0.000398,0.00045,0.000363,9.7e-05,8.5e-05,5.1e-05,0.000178,0.000203,0.000351,0.000309,0.000193,8.5e-05,0.000291,0.00015,0.000458,0.000287,0.000142,0.00016,0.00035,0.000169,0.000183,0.000173,0.000179,0.000308,0.000276,0.000138,0.000385,0.000229,4.5e-05
0.000516,0.000413,0.000289,0.000516,0.000653,0.000448,0.00012,0.00012,0.000522,0.000352,0.000446,0.000174,0.000643,0.000603,0.000743,0.000679,0.000517,0.000636,0.00062,0.000623,0.00049,0.000498,0.000457,0.000342,4.2e-05,0.000396,0.000502,0.000309,0.000598,0.000584,0.000978,0.000664,0.000342,5.9e-05,0.00014,0.000561,0.00032,0.000279,0.00045,0.000454,0.000332,0.000156,8.3e-05,0.000424,0.000339,6.5e-05,0.000532,0.000211,0.000283,0.000167,3.9e-05,0.000379,0.000635,0.000331,0.000504,0.000452,0.000402,0.000266,0.000652,0.000427,0.000332,6e-05,0.000436,0.000385,0.000356,0.000145,8.9e-05,0.000499,0.000611,0.000256,0.00037,0.000509,0.000607,0.000411,0.000225,7.7e-05,0.000575,0.000609,0.000375,0.000536,0.000556,1e-04,0.000662,0.000666,0.000487,0.000474,0.000681,0.000467,0.000362,0.000469,0.000231,0.000493,0.000266,0.000278,0.000203,0.000335,0.00021,0.000205,0.000361,7.3e-05,0.000108,0.000249,0.000122,9.6e-05,0.000424,0.000545,0.000149,0.000145,0.000169,0.000342,0.000292,0.000228,0.000235,0.000175,0.000348,0.00038,0.000273,0.000154,0.000274,0.000156,3.1e-05
0.000683,0.000447,0.000325,0.000262,0.000217,0.000246,0.000249,0.000111,0.000285,0.000145,0.000115,0.00034,0.00035,0.000317,0.000162,0.000123,0.000405,0.000206,0.000144,0.000153,0.000255,0.000199,0.000113,0.000231,0.000497,0.000202,7.6e-05,0.000227,0.000378,0.00014,0.000556,0.000499,0.000462,0.000429,9.5e-05,0.000412,0.000297,0.000252,0.000419,0.000282,0.000298,0.000105,2.8e-05,0.000311,0.000255,0.000256,0.000558,0.000432,0.000268,0.000204,0.000116,0.000216,4e-04,0.000307,0.00016,0.000229,0.000165,0.000252,0.000416,0.000322,2e-04,0.000284,0.000197,0.000227,0.00027,0.000322,0.000388,0.000735,0.000381,0.000388,0.000315,0.000176,0.000234,0.00019,0.000371,0.000518,0.000614,0.000361,0.00036,0.00031,0.000335,0.000267,0.000623,0.000288,0.000171,0.000377,0.000457,0.000219,0.000131,4.4e-05,0.00016,0.000586,0.000484,0.000354,0.000476,0.00048,0.000344,0.00038,0.000272,0.000239,0.00021,0.000216,0.000228,0.000135,0.000382,0.000371,0.000242,0.000143,0.000237,0.000337,0.00018,0.000253,0.000129,4.1e-05,0.000286,7.4e-05,3.5e-05,0.000126,4.5e-05,5.5e-05,0.000134
0.000289,0.000166,0.000151,0.000206,0.000192,0.00011,4.3e-05,4.7e-05,0.000225,0.000195,0.000225,0.000138,0.000112,8.9e-05,8.2e-05,8.4e-05,0.000193,8.4e-05,0.000199,7e-05,0.000136,0.000107,0.000115,0.000159,0.000259,0.000119,1.6e-05,8.8e-05,0.000299,0.000187,0.000385,0.000182,0.000157,0.000191,0.000109,0.000294,4.5e-05,0.000199,0.000262,0.000107,0.000143,2.9e-05,8.8e-05,0.000112,8.9e-05,0.000147,2e-04,0.000117,0.000175,0.000123,7.1e-05,0.000123,0.000191,8.8e-05,1e-04,0.000165,5.3e-05,0.000185,0.000156,0.000117,6.3e-05,0.000228,0.00021,5e-05,0.000107,0.000173,0.000175,0.000351,0.000142,0.000323,8.3e-05,0.000226,0.000101,0.000143,0.000142,0.000287,0.00026,0.00011,0.000173,5.5e-05,0.000102,6.2e-05,0.000271,2.3e-05,0.000119,0.000157,0.000255,6.5e-05,0.000208,0.000205,0.00017,0.000199,2.2e-05,0.000148,0.000158,0.000183,0.000119,0.000147,5.7e-05,7.4e-05,0.000139,6.5e-05,1.6e-05,8.3e-05,0.000256,0.000132,0.00013,6.4e-05,0.00018,3.5e-05,5.9e-05,0.000151,6.9e-05,0.000149,0.000145,4.7e-05,4.7e-05,7.3e-05,0.000132,4.4e-05,4.7e-05
0.00018,0.000349,0.000117,5.5e-05,6.3e-05,9.2e-05,0.000157,5.2e-05,8.9e-05,0.000235,0.000291,0.00015,0.000159,0.000108,0.000109,7.8e-05,7.5e-05,0.000203,5.4e-05,2e-05,8.5e-05,6.9e-05,0.000187,0.000107,0.000123,3.2e-05,3.8e-05,0.00015,0.000109,6.8e-05,0.000329,0.000312,0.000258,0.000198,0.000261,6.6e-05,2.8e-05,0.000223,0.000282,0.000114,0.000234,6.4e-05,7e-05,9.3e-05,8.4e-05,0.000104,2.7e-05,0.000165,0.000136,0.00022,0.000168,0.000131,0.000137,0.000144,4.9e-05,0.000124,0.000149,0.000147,0.000208,0.000242,0.00013,0.000237,0.000138,8.3e-05,3.7e-05,9.9e-05,0.000169,0.000249,0.000108,0.000269,0.000126,0.000163,9.6e-05,0.000158,0.000204,0.000317,0.000156,8.2e-05,0.000166,0.000135,0.000223,6.1e-05,0.000191,6.9e-05,7e-05,0.000115,0.000206,0.000154,0.000201,0.000109,0.000248,0.000178,0.000127,8e-05,6.7e-05,0.000165,0.00012,9e-05,8e-06,7.7e-05,5.7e-05,0.000122,8.6e-05,0.000102,1.3e-05,2.7e-05,0.000151,6.9e-05,8.2e-05,0.000111,2.7e-05,0.000134,8.3e-05,0.00014,0.000131,6.4e-05,9.7e-05,2.2e-05,0.000154,0.00017,4.5e-05
0.000354,0.000464,0.000294,0.000191,0.000284,0.00024,0.000295,0.000227,0.000272,0.000387,0.000458,0.000183,0.000199,0.000207,0.000315,6.9e-05,0.000118,0.00024,0.000293,7.6e-05,1e-04,0.000156,0.000232,0.000215,0.000102,0.00015,0.000153,0.000117,0.000193,0.000172,0.000156,0.000233,0.000176,0.000203,0.000466,0.000265,9.4e-05,0.000142,0.000182,0.000144,0.000465,0.000188,0.000137,5.2e-05,0.000128,0.000155,0.000271,5.4e-05,0.000171,0.000152,0.000112,0.000238,0.000147,0.000163,0.000185,9.3e-05,0.000153,0.000124,0.000168,8e-05,0.000326,0.000229,0.000184,8.8e-05,0.000286,6.2e-05,0.000226,0.000127,9e-05,0.000288,0.00018,0.000178,0.000172,0.000131,0.000265,0.000447,0.000256,0.000391,0.000263,0.000159,0.000265,0.000181,0.000209,0.000164,0.000217,0.000169,0.000189,0.000125,0.000168,0.000144,0.000246,0.000193,0.00019,0.00029,0.000144,0.000156,1e-04,4e-05,0.000163,6.3e-05,6.3e-05,9.3e-05,8.7e-05,0.000175,0.000246,0.000137,0.000255,0.000128,0.00016,0.000231,0.00011,0.000235,0.00013,0.000108,0.000318,0.000135,3e-05,0.000142,0.000122,0.000253,0.000168
0.00098,0.000482,0.000763,0.000326,0.000717,0.000507,0.000518,7.5e-05,0.000576,0.000837,0.000602,0.000482,0.000377,0.000436,0.000787,0.000591,0.000198,0.000326,0.000732,0.000491,0.000338,0.000275,0.000112,0.000624,0.000619,0.000227,0.000182,0.000365,0.000502,0.000463,0.000395,0.000124,0.000562,0.000558,0.000708,0.000507,0.000211,0.000184,0.000366,0.000263,0.000789,0.00053,0.000305,0.000241,0.000328,9.8e-05,0.000482,0.000273,4.2e-05,7.1e-05,8.4e-05,0.000352,0.000329,0.000316,0.000361,0.000191,0.000245,0.000393,8.5e-05,0.000191,0.000514,0.000633,0.000408,0.000448,0.000733,0.000491,0.000443,0.000466,0.000349,0.000343,0.000604,0.000566,0.000289,0.000134,0.000363,0.000311,1.2e-05,0.000228,0.000372,0.000351,0.000467,0.000297,0.000127,0.000222,0.000431,0.000531,0.000322,0.000341,4.5e-05,0.000128,0.000425,0.000571,0.00038,0.00051,0.000342,0.000119,0.000111,5.9e-05,0.000325,0.00035,9.7e-05,4e-05,0.000134,0.000415,0.000468,0.000351,0.000279,0.000293,0.000414,0.000423,0.000234,0.000397,0.000612,0.000495,0.000577,0.000216,4.6e-05,0.000189,0.00028,0.000388,0.000503
0.000712,0.001428,0.001254,0.000884,0.00107,0.000875,0.000414,0.000598,0.001034,0.001247,0.001185,0.000989,0.000511,9.8e-05,0.00065,0.000565,0.000514,0.000298,0.000878,0.000651,0.000238,0.00028,0.000443,0.000832,0.000519,0.000654,6e-04,0.000221,0.00043,0.000484,7.7e-05,0.000412,0.000819,0.000637,0.000553,0.000692,0.000443,0.000348,0.00051,0.000356,0.000838,0.000679,0.000286,0.000279,0.000123,0.000442,0.000408,0.000325,0.000142,0.000232,0.000238,0.000395,0.000402,0.000382,0.000455,0.000197,0.000225,0.000443,0.000428,0.000436,0.000516,0.000538,0.000344,0.000249,0.000542,0.000393,0.000497,0.000586,0.000317,9.4e-05,0.000556,0.00018,5.5e-05,0.000128,0.000447,0.000528,0.000422,9.7e-05,0.000262,0.000381,0.000158,0.000102,0.000242,9.2e-05,0.000369,0.000609,0.000778,0.000612,0.000609,0.000506,0.000287,0.000533,0.000419,0.000308,0.000149,0.000159,0.000349,0.000216,0.000339,0.000203,0.000259,0.000183,0.000264,0.000578,0.000228,0.000167,0.000535,0.000503,0.000331,0.000138,7.4e-05,0.000397,0.000633,0.000564,0.00057,6e-04,0.000383,0.000164,0.000223,0.000602,0.000392
0.000661,0.000451,0.000238,0.000317,0.000779,0.000453,0.00054,0.000493,0.000422,0.000449,0.000435,0.00049,0.000351,0.000309,0.000289,9.6e-05,0.000221,0.000288,0.00029,0.000116,0.00029,0.00015,0.000386,0.000179,5.2e-05,4e-04,0.000289,0.000453,0.000301,0.000437,0.000385,0.000436,0.000225,0.000103,0.000159,0.00024,0.00022,0.000245,0.000116,0.000222,0.000329,5.1e-05,0.000173,0.000232,0.00041,0.000528,0.000316,0.000199,0.000243,0.000155,5.1e-05,0.000114,6.8e-05,0.000179,0.000173,0.000222,0.000337,0.000168,0.000166,0.000142,0.000306,0.000183,0.000203,0.000342,0.000165,0.00011,0.000265,0.000225,9.3e-05,2e-04,0.000463,0.000291,0.000113,5.8e-05,0.000331,0.000141,0.000137,0.000195,0.000221,0.000188,0.000224,6e-05,0.000199,0.000268,0.000174,0.000264,0.000242,0.000132,0.000393,0.00027,0.000212,0.000123,0.000139,0.000276,0.000259,0.000291,0.000227,6.2e-05,0.000237,0.000121,0.000225,0.000194,0.000205,0.000439,0.000372,0.000265,0.000205,6.1e-05,0.000307,0.000237,0.000199,0.000176,0.00015,9.5e-05,0.000302,0.000196,2.9e-05,0.000176,0.000119,0.000249,3.8e-05
0.000442,0.000271,0.000284,3e-05,0.000441,0.00024,0.000213,0.000233,0.000383,0.000381,0.000561,0.000123,0.000186,0.000179,0.000139,0.000195,0.000197,3.2e-05,0.000111,0.000147,1.1e-05,0.000155,0.000363,0.000167,7.2e-05,0.000269,0.000142,0.000434,0.000114,0.000239,0.000208,0.000126,8.9e-05,0.000101,0.000101,8.1e-05,4.2e-05,0.00013,9.2e-05,0.000207,0.000231,0.000224,0.000101,6.5e-05,0.00026,7.8e-05,0.000104,2.5e-05,0.000119,5.4e-05,8.2e-05,5.8e-05,1e-05,7.5e-05,8.3e-05,0.000186,0.00022,0.000139,0.000192,8.9e-05,0.000213,0.00011,7.3e-05,0.000153,0.000189,0.000152,0.000128,0.000214,0.000239,0.000282,5.2e-05,9.7e-05,8.9e-05,8.9e-05,0.000198,0.000197,6e-05,6.1e-05,5.5e-05,9.1e-05,0.000121,0.00018,9.1e-05,0.000172,0.000194,0.000177,6.1e-05,0.00012,0.000218,9.4e-05,3.9e-05,0.000101,5.4e-05,0.000146,6.1e-05,0.000162,0.000246,0.000273,0.000212,0.000136,0.000124,0.000227,6.8e-05,0.000222,7.3e-05,8.8e-05,4.4e-05,3.9e-05,0.000152,3.1e-05,0.000105,0.00022,0.000159,9.2e-05,9e-05,3.8e-05,4.5e-05,0.000239,8.8e-05,4.9e-05,3.8e-05
0.000258,2e-04,0.000209,0.000128,0.000214,2.9e-05,0.000278,0.000188,0.000128,7.7e-05,0.000376,0.000221,0.000269,0.000296,0.000147,0.00017,6.4e-05,0.000114,0.000118,0.000206,0.000285,8.3e-05,0.000126,0.000155,3.1e-05,0.000122,9.4e-05,0.000187,0.000207,0.000149,2.2e-05,0.000236,0.000167,0.00017,8.6e-05,9.2e-05,5.1e-05,4.6e-05,5.4e-05,0.00015,0.000103,9.2e-05,0.000194,0.000177,5.8e-05,7.4e-05,9.4e-05,5.2e-05,0.000151,5e-05,8e-05,1e-04,5.5e-05,9e-05,5e-06,6.1e-05,0.000131,9.8e-05,0.000133,8.1e-05,0.000129,6.3e-05,0.000123,0.000195,7.8e-05,9.8e-05,0.000116,7.3e-05,0.000115,8.7e-05,8.2e-05,5.7e-05,3.1e-05,2.6e-05,0.000148,6.7e-05,5.6e-05,9.2e-05,0.000139,0.000214,0.000164,9.3e-05,0.000158,7.2e-05,0.000122,0.000204,0.000108,5.7e-05,0.000169,0.000182,0.000196,1.5e-05,8.6e-05,0.000127,9.8e-05,0.000145,0.000222,0.000207,0.000117,4.5e-05,9.3e-05,0.000109,4e-05,5e-05,0.000133,1e-04,7.5e-05,6.4e-05,9e-06,1.6e-05,9.5e-05,0.000143,0.000156,3.8e-05,6e-06,7.4e-05,8e-05,0.000124,6.2e-05,0.000141,3.1e-05
0.000358,9e-05,0.000116,7.1e-05,5.7e-05,6.1e-05,0.000272,9.1e-05,0.000169,2.8e-05,0.000221,0.000143,7.3e-05,0.000106,8.8e-05,8.5e-05,0.000186,0.000176,0.000119,0.000233,9.9e-05,8.5e-05,1.7e-05,8.1e-05,0.000125,0.000145,6.4e-05,3.9e-05,0.000114,0.000199,0.000123,0.000175,0.000107,3.8e-05,0.000118,3.8e-05,2.3e-05,8e-05,4.2e-05,3.8e-05,6.1e-05,9.5e-05,7.7e-05,4e-05,5.3e-05,1.4e-05,8.1e-05,0.000151,8.3e-05,0.000105,2.2e-05,4.7e-05,3.3e-05,1e-04,4.1e-05,7e-05,0.000132,5.2e-05,0.000162,9e-05,0.000138,0.000128,2.2e-05,0.000173,0.000103,0.000109,8e-06,9.1e-05,5.9e-05,6.7e-05,3.2e-05,5.7e-05,4.6e-05,4.7e-05,1.9e-05,2.7e-05,1.2e-05,1e-04,3.5e-05,0.00013,6e-05,8e-06,0.000154,0.000104,0.000147,0.000101,3.2e-05,0.000109,7.7e-05,6.7e-05,2.1e-05,7.2e-05,1.7e-05,0.000103,5.6e-05,4.9e-05,0.000128,7.3e-05,5.8e-05,6.2e-05,5.6e-05,9.1e-05,8.1e-05,8e-06,5e-05,3.7e-05,1.9e-05,6.6e-05,4.4e-05,7.2e-05,6.2e-05,9.7e-05,8.6e-05,4e-05,7.4e-05,5.7e-05,1.4e-05,6e-05,6.4e-05,0.000123,0.000106
0.000168,7.7e-05,4.4e-05,6.9e-05,0.000137,0.000182,0.00015,0.000102,8.1e-05,0.000117,0.000143,2.6e-05,0.000115,0.000157,3.4e-05,7.3e-05,5.6e-05,0.000143,0.00015,0.000107,7.8e-05,3.8e-05,0.000104,0.000102,8.8e-05,1.6e-05,5.1e-05,7.7e-05,0.000103,9.3e-05,7.5e-05,2e-05,8.9e-05,0.000117,0.000128,7.1e-05,2.5e-05,0.000112,8.4e-05,0.000112,0.000117,2.9e-05,0.000137,4.4e-05,6.7e-05,1.4e-05,5.6e-05,0.000105,4.4e-05,4.9e-05,6.7e-05,0.000123,0.000125,0.000119,4.3e-05,3.5e-05,5.2e-05,1.4e-05,0.00011,6.4e-05,8e-06,4.3e-05,7.9e-05,5.9e-05,7.4e-05,4.8e-05,3.7e-05,4.2e-05,4e-05,5.5e-05,0.000108,8.8e-05,3e-05,9.7e-05,5.6e-05,7.9e-05,4.6e-05,2.1e-05,1.8e-05,5.1e-05,7e-06,6.9e-05,9.4e-05,1.6e-05,0.000116,6.7e-05,2.7e-05,5.5e-05,6.3e-05,4.2e-05,2e-05,6.3e-05,3e-05,5.6e-05,4.6e-05,2.2e-05,6.6e-05,6.6e-05,5.5e-05,4.1e-05,3.9e-05,4e-05,3.7e-05,3.2e-05,7e-05,4.6e-05,6.3e-05,5e-05,9e-06,6.2e-05,5.8e-05,0.000107,0.000106,6.7e-05,2.2e-05,7.8e-05,3.8e-05,3.6e-05,3.8e-05,6.7e-05,3e-05
4.9e-05,4.4e-05,2e-05,6.3e-05,9.6e-05,4.5e-05,9.3e-05,1.2e-05,5.4e-05,3.1e-05,4.6e-05,2.4e-05,5.7e-05,2.1e-05,6.1e-05,1.1e-05,2.3e-05,7.2e-05,3.8e-05,5e-05,5.1e-05,9e-06,3.6e-05,4.8e-05,4e-06,2.6e-05,2e-05,1.9e-05,2.6e-05,6.8e-05,9.6e-05,2.5e-05,1.4e-05,6e-05,4.1e-05,1.9e-05,8e-06,2e-05,1.2e-05,2.2e-05,2.6e-05,2.6e-05,4.4e-05,1e-05,4.8e-05,9e-06,1.7e-05,2.4e-05,2.2e-05,5.2e-05,4.2e-05,2.7e-05,9e-06,3.8e-05,8e-06,1.2e-05,2.5e-05,1.4e-05,1.3e-05,3.4e-05,6e-06,1.3e-05,3.9e-05,6.3e-05,5.3e-05,8e-06,4.1e-05,3.7e-05,1.1e-05,4.5e-05,3.1e-05,4.8e-05,4.8e-05,1.1e-05,1.9e-05,1.4e-05,1.4e-05,2.7e-05,9e-06,1.2e-05,1.7e-05,4.1e-05,6.5e-05,4.7e-05,3.1e-05,3e-05,1.2e-05,1.1e-05,7e-06,6e-06,5e-05,3.3e-05,3.6e-05,1.3e-05,2.2e-05,9e-06,2.4e-05,5e-06,3.3e-05,8e-06,2.5e-05,2.2e-05,1.4e-05,9e-06,2.2e-05,2.8e-05,2.9e-05,2.1e-05,1.1e-05,6e-06,4.6e-05,3.9e-05,5e-05,4.6e-05,3.3e-05,2e-05,1.4e-05,1e-05,1.2e-05,2.7e-05,2.5e-05
7e-05,1.6e-05,3.7e-05,5.1e-05,5.9e-05,7.1e-05,9.4e-05,2.1e-05,4.8e-05,2.7e-05,2e-05,2.8e-05,2.5e-05,2.9e-05,5.4e-05,4.9e-05,1.1e-05,2.8e-05,2.5e-05,9e-06,7.1e-05,4.8e-05,4.4e-05,3.5e-05,1.2e-05,2.2e-05,2.4e-05,4e-05,1e-05,3.7e-05,2.7e-05,8.2e-05,4.1e-05,6.5e-05,3.8e-05,3.7e-05,9e-06,5e-06,1.8e-05,2e-05,4e-05,3.3e-05,3e-05,1.9e-05,3.4e-05,3.2e-05,2.5e-05,1.3e-05,3.8e-05,3.7e-05,7e-06,2.3e-05,2.4e-05,3.2e-05,4.1e-05,4.8e-05,4.9e-05,3e-06,1.8e-05,1.6e-05,1.8e-05,1.6e-05,1.2e-05,4.9e-05,5.4e-05,4e-05,5.2e-05,5.2e-05,3.8e-05,1.9e-05,2.6e-05,3e-05,1.4e-05,3e-05,5e-05,5.4e-05,4e-05,9e-06,3e-06,2.9e-05,1.5e-05,3.8e-05,1.6e-05,2.3e-05,2e-05,4.5e-05,2.3e-05,1e-05,3e-05,2.6e-05,5.9e-05,4.4e-05,5e-05,4.2e-05,1.3e-05,1.8e-05,3.1e-05,4.1e-05,2e-05,2.1e-05,2.8e-05,3.3e-05,3.1e-05,3.2e-05,4.5e-05,2.6e-05,3.9e-05,3.7e-05,4e-06,1.9e-05,2.5e-05,4.6e-05,1.1e-05,2.4e-05,2.7e-05,3.8e-05,3.6e-05,2e-05,2.3e-05,5e-05,3.7e-05
5.5e-05,2.2e-05,3.3e-05,2.4e-05,1.8e-05,3.3e-05,8.6e-05,1.7e-05,3.7e-05,3.5e-05,3.8e-05,1.8e-05,1.8e-05,5e-06,2.4e-05,3.1e-05,2.7e-05,3.3e-05,2.3e-05,2.2e-05,4.1e-05,1.8e-05,2.1e-05,1.9e-05,7e-06,2.9e-05,2e-05,2.1e-05,1.3e-05,9e-06,3.3e-05,4.8e-05,2.5e-05,2.1e-05,1.6e-05,1.6e-05,1.3e-05,9e-06,2.5e-05,2.5e-05,7e-06,1.6e-05,2e-05,3e-06,7e-06,4e-06,1.1e-05,7e-06,1.6e-05,3e-05,1.3e-05,2.2e-05,2.2e-05,4.6e-05,3.5e-05,2e-05,7e-06,1.6e-05,1.9e-05,6e-06,1.5e-05,1.6e-05,1e-05,4e-05,3.5e-05,4.1e-05,1.4e-05,2.7e-05,1.5e-05,1.3e-05,2.8e-05,9e-06,2e-05,3.6e-05,1.7e-05,4.3e-05,2.5e-05,2.2e-05,2.2e-05,7e-06,1.3e-05,5e-06,1.3e-05,3.2e-05,4.2e-05,1e-05,1.1e-05,1.9e-05,2.4e-05,9e-06,2e-05,1.3e-05,1.6e-05,1.3e-05,2e-05,3.4e-05,1.1e-05,2.9e-05,2.5e-05,1.4e-05,7e-06,1.4e-05,8e-06,1.6e-05,1.9e-05,2.4e-05,1.4e-05,2.9e-05,1.4e-05,3e-06,1.1e-05,3.3e-05,1.9e-05,2.4e-05,2.5e-05,1.4e-05,1.2e-05,1.6e-05,1.4e-05,2.5e-05,1.4e-05
5.7e-05,1e-05,4.3e-05,2e-06,1.9e-05,3e-05,4.6e-05,2.2e-05,2.6e-05,3e-05,1.9e-05,1.4e-05,1.6e-05,1.4e-05,9e-06,7e-06,7e-06,4e-05,2.2e-05,1.3e-05,3.7e-05,7e-06,1.7e-05,2.8e-05,1.4e-05,1.5e-05,7e-06,2.4e-05,1.1e-05,9e-06,2.8e-05,2.1e-05,2.3e-05,2.9e-05,2.1e-05,2.4e-05,1.5e-05,9e-06,1.8e-05,1.9e-05,6e-06,1.2e-05,2.4e-05,8e-06,1.3e-05,8e-06,3e-06,1.9e-05,5e-06,3.1e-05,7e-06,1.3e-05,1.2e-05,4e-05,3.3e-05,3e-06,1e-05,4e-06,2.3e-05,2.3e-05,1e-05,1.2e-05,3.2e-05,2.9e-05,4.2e-05,2.3e-05,3e-06,2.2e-05,2.4e-05,1.6e-05,3.1e-05,4e-06,2.2e-05,2.6e-05,1.6e-05,4.2e-05,3.5e-05,2.6e-05,9e-06,1e-05,1e-05,1.4e-05,6e-06,1.8e-05,5.1e-05,1e-05,1.6e-05,4e-06,1.3e-05,8e-06,2.1e-05,8e-06,8e-06,7e-06,1.4e-05,1.6e-05,2.1e-05,2.2e-05,1.1e-05,1.3e-05,1.4e-05,1e-05,6e-06,1.7e-05,2.3e-05,1.5e-05,1.4e-05,3.3e-05,6e-06,1e-05,1.4e-05,3.7e-05,1.4e-05,1.9e-05,1.5e-05,5e-06,1e-05,1.3e-05,8e-06,2.3e-05,1.2e-05
5.7e-05,2e-05,2.4e-05,2.4e-05,1.5e-05,3.1e-05,2.9e-05,1.6e-05,2.1e-05,2.5e-05,2.4e-05,2.4e-05,2.1e-05,2.3e-05,9e-06,1.3e-05,1.9e-05,4.8e-05,1.9e-05,1e-05,2.2e-05,8e-06,3e-05,3.1e-05,5e-06,1.9e-05,7e-06,2e-05,1e-05,1.8e-05,2.2e-05,4.1e-05,3e-05,1.8e-05,1.4e-05,2e-05,4e-06,1.5e-05,2e-06,2e-05,9e-06,1.2e-05,2.4e-05,2e-06,1.6e-05,1.4e-05,9e-06,2e-05,2e-05,1.6e-05,7e-06,4e-06,9e-06,4.5e-05,3.4e-05,4e-06,1.6e-05,6e-06,2.3e-05,2.6e-05,2.7e-05,1.1e-05,1.8e-05,2.1e-05,2.7e-05,2.6e-05,4e-06,7e-06,1.9e-05,1.2e-05,2.4e-05,6e-06,2.3e-05,1.7e-05,3e-06,2.5e-05,3.5e-05,1.7e-05,5e-06,7e-06,1.1e-05,1.2e-05,1.8e-05,1.2e-05,3e-05,2e-05,2.3e-05,9e-06,1.5e-05,5e-06,2.3e-05,6e-06,6e-06,6e-06,1.3e-05,2e-05,9e-06,2.1e-05,1.2e-05,9e-06,4e-06,2e-06,7e-06,9e-06,1.7e-05,1.3e-05,1.9e-05,3.4e-05,1.2e-05,6e-06,7e-06,2.8e-05,1.8e-05,1.9e-05,5e-06,1e-05,1e-05,7e-06,7e-06,2.3e-05,1e-05
8e-05,1.2e-05,6e-06,1.3e-05,1e-05,2.9e-05,5.4e-05,0,1.4e-05,2.8e-05,2.4e-05,3.8e-05,2e-05,2.2e-05,1.3e-05,1.5e-05,2.2e-05,4.2e-05,1.1e-05,2.1e-05,2.9e-05,1.8e-05,3.9e-05,2.4e-05,6e-06,1.9e-05,5e-06,3e-05,1.6e-05,2.4e-05,1.9e-05,1.3e-05,1.4e-05,2.2e-05,1.7e-05,1.5e-05,9e-06,7e-06,9e-06,1.3e-05,1e-06,9e-06,1.7e-05,2e-06,1.1e-05,8e-06,5e-06,1.6e-05,1.5e-05,1.9e-05,4e-06,3e-06,8e-06,3.7e-05,2.1e-05,1.6e-05,3e-06,1e-05,1.2e-05,1.2e-05,1.8e-05,4e-06,1.6e-05,2.8e-05,2.6e-05,2.4e-05,1.1e-05,7e-06,1.2e-05,1.2e-05,2.9e-05,7e-06,1.3e-05,1.4e-05,3e-06,3.2e-05,3.3e-05,2.4e-05,9e-06,5e-06,1.2e-05,3e-06,9e-06,1.1e-05,2.9e-05,1.2e-05,2e-06,1.2e-05,1.4e-05,1e-06,2.4e-05,1.1e-05,1.5e-05,7e-06,8e-06,1e-05,1.2e-05,1.8e-05,4e-06,1e-06,8e-06,5e-06,6e-06,1.3e-05,1.5e-05,2e-05,5e-06,3e-05,5e-06,5e-06,9e-06,2.3e-05,1.7e-05,1.9e-05,9e-06,6e-06,1.3e-05,1.3e-05,4e-06,2.5e-05,4e-06
4.7e-05,3.7e-05,2.8e-05,2e-05,2e-05,2.4e-05,5.5e-05,3.1e-05,1.9e-05,2.8e-05,1.2e-05,2.4e-05,1.1e-05,1.8e-05,2.1e-05,1.4e-05,3.3e-05,4.5e-05,1.8e-05,2.2e-05,5.5e-05,1.8e-05,2.3e-05,3.7e-05,6e-06,1e-05,1e-05,3.5e-05,7e-06,1.2e-05,7e-06,1.6e-05,2.3e-05,1.2e-05,1.2e-05,1.8e-05,5e-06,1.4e-05,3e-06,1.6e-05,2e-06,1.3e-05,2e-05,1e-06,5e-06,1.8e-05,1.7e-05,9e-06,2.4e-05,2e-05,1e-06,5e-06,1.5e-05,3.3e-05,1.5e-05,1.1e-05,5e-06,9e-06,1.2e-05,1.3e-05,2.3e-05,8e-06,1.7e-05,2.8e-05,3.6e-05,2.9e-05,6e-06,1.8e-05,7e-06,2e-05,2.1e-05,3e-05,1.4e-05,1.1e-05,1e-05,2.6e-05,2.4e-05,1.3e-05,8e-06,5e-06,1e-05,4e-06,1.8e-05,2e-05,2.5e-05,3e-06,3e-06,1.7e-05,1.9e-05,9e-06,2.3e-05,2e-05,1e-05,1.4e-05,8e-06,7e-06,6e-06,2.1e-05,1.4e-05,6e-06,1.1e-05,1.4e-05,6e-06,1.2e-05,1.7e-05,1.5e-05,9e-06,2.6e-05,1.2e-05,1.6e-05,6e-06,2.8e-05,1.6e-05,1.8e-05,5e-06,6e-06,1.8e-05,1.6e-05,2e-06,1.9e-05,1.4e-05
5e-05,2.1e-05,2.1e-05,1.4e-05,1.5e-05,4.8e-05,4.8e-05,5.7e-05,4.6e-05,1.2e-05,1.2e-05,3.5e-05,2.5e-05,3.1e-05,2.1e-05,2.5e-05,2.9e-05,3.3e-05,2.3e-05,2.3e-05,5.8e-05,1.8e-05,1.3e-05,2.3e-05,4.1e-05,3.8e-05,1.9e-05,3.7e-05,3.9e-05,8e-06,2.9e-05,3.3e-05,9e-06,3e-06,2.1e-05,6e-06,1.4e-05,2.9e-05,4.6e-05,3.6e-05,2e-05,1.6e-05,3.3e-05,5e-06,1.9e-05,1.5e-05,1.9e-05,1.2e-05,3e-05,4.2e-05,1.8e-05,5e-06,3.7e-05,6.4e-05,1.9e-05,1.7e-05,2.2e-05,6e-06,1.9e-05,2.3e-05,4.6e-05,2.3e-05,2.2e-05,3.8e-05,2.7e-05,3.4e-05,1.5e-05,8e-06,1.1e-05,3.7e-05,4.1e-05,3.2e-05,4e-06,2.6e-05,1.2e-05,1e-05,2.2e-05,1.1e-05,1.4e-05,1.5e-05,2e-05,1.5e-05,8e-06,1.5e-05,1e-05,2.4e-05,2e-05,3e-05,1e-05,1.2e-05,1.7e-05,1.4e-05,3.1e-05,1.3e-05,2.4e-05,1e-05,1.1e-05,2.2e-05,2.6e-05,6e-06,8e-06,2.2e-05,2.4e-05,9e-06,7e-06,2.7e-05,1.3e-05,3.4e-05,2.2e-05,8e-06,8e-06,2e-05,2e-05,8e-06,1.8e-05,2e-05,1.1e-05,5e-06,1.6e-05,1.5e-05,1.9e-05
5e-05,3.8e-05,3.9e-05,4.1e-05,5.1e-05,2e-05,5.3e-05,6e-05,4.3e-05,4e-05,3e-05,3.2e-05,2.6e-05,2.3e-05,1.9e-05,4.4e-05,3.1e-05,2.8e-05,6.1e-05,3.5e-05,6e-05,9e-06,2.5e-05,1e-05,3.8e-05,2.5e-05,5e-05,3.3e-05,3.2e-05,3.9e-05,5e-06,4.1e-05,8e-06,4.4e-05,9e-06,2.9e-05,2.4e-05,1.3e-05,5.1e-05,4.1e-05,1.4e-05,3.5e-05,2.6e-05,4.2e-05,5.2e-05,4.4e-05,4.4e-05,2.9e-05,2.6e-05,2.1e-05,3.1e-05,3.7e-05,3.5e-05,3.8e-05,6.1e-05,2.7e-05,1.1e-05,1.6e-05,2.1e-05,1.6e-05,3.8e-05,3.3e-05,2.7e-05,4.1e-05,2.8e-05,2.9e-05,1.6e-05,1.7e-05,2.1e-05,1.6e-05,4.1e-05,3.3e-05,3.3e-05,3.1e-05,1.7e-05,1.7e-05,3.4e-05,3.2e-05,3.9e-05,5e-05,5.3e-05,6e-05,3.5e-05,1.1e-05,7e-06,4.1e-05,3.2e-05,6e-06,2e-05,2.6e-05,1.5e-05,2.3e-05,3.1e-05,3.8e-05,4.7e-05,4.8e-05,2.9e-05,8e-06,2.3e-05,2.7e-05,9e-06,2.3e-05,3.2e-05,1.4e-05,1.1e-05,2.2e-05,3.9e-05,4e-05,9e-06,2.4e-05,1.8e-05,2.3e-05,1e-05,3.4e-05,3.9e-05,1.9e-05,2.1e-05,2.2e-05,1.5e-05,2.3e-05,1.4e-05
3.9e-05,4e-06,4.5e-05,1.2e-05,2.9e-05,2e-05,5.4e-05,3.8e-05,2.9e-05,2.8e-05,2.3e-05,1.4e-05,1e-05,2e-05,2.5e-05,2.7e-05,1.8e-05,2.3e-05,3.9e-05,2.1e-05,3.3e-05,1.8e-05,1.6e-05,7e-06,3.1e-05,1.7e-05,2.8e-05,2.2e-05,2.6e-05,1.9e-05,1.4e-05,3.6e-05,3.3e-05,4.2e-05,2.1e-05,3.1e-05,2.1e-05,1.6e-05,3.7e-05,1.6e-05,2.4e-05,1.7e-05,6e-06,2.5e-05,1.5e-05,3.3e-05,1.6e-05,2.1e-05,1.6e-05,1.9e-05,2.2e-05,8e-06,9e-06,2.6e-05,4e-05,1.7e-05,1.9e-05,1.4e-05,1.7e-05,1.5e-05,1.5e-05,1.2e-05,1.6e-05,3.5e-05,3.8e-05,1.2e-05,2.5e-05,1e-06,1.5e-05,1.6e-05,1.5e-05,9e-06,1.1e-05,2.9e-05,1.2e-05,4.5e-05,1.3e-05,2.3e-05,1.8e-05,2.2e-05,2e-05,3e-05,2.4e-05,2.6e-05,3.2e-05,1.9e-05,4e-06,6e-06,1.3e-05,1e-05,2.4e-05,7e-06,1.3e-05,2.2e-05,1.6e-05,2.4e-05,2.4e-05,3.2e-05,8e-06,1.3e-05,1.5e-05,1.8e-05,2e-06,1.2e-05,3e-05,1.6e-05,2e-05,2.2e-05,2.5e-05,2.4e-05,1.3e-05,2.8e-05,1.1e-05,1.4e-05,1.4e-05,1.4e-05,1.5e-05,1.1e-05,1e-05,1e-05,1.7e-05
6e-05,1.3e-05,3.7e-05,1.8e-05,1.4e-05,2.8e-05,4.2e-05,1.5e-05,3.5e-05,2e-05,2.3e-05,1.9e-05,1.5e-05,1.4e-05,5e-06,2e-06,1.1e-05,1.8e-05,1.8e-05,1.7e-05,3.2e-05,1e-05,2.4e-05,1e-05,2e-05,7e-06,1.7e-05,9e-06,1.5e-05,7e-06,2.1e-05,2.6e-05,2.7e-05,3e-05,6e-06,1e-05,1.5e-05,1e-05,1.4e-05,1.6e-05,1.3e-05,7e-06,8e-06,9e-06,1.3e-05,1.3e-05,9e-06,4e-06,1e-05,1e-05,1.1e-05,1.4e-05,1.6e-05,3.2e-05,2.3e-05,6e-06,6e-06,3e-06,2.1e-05,2.2e-05,1e-06,1.1e-05,2.1e-05,2.3e-05,2.7e-05,2e-05,1.3e-05,2.6e-05,1.1e-05,1.4e-05,2.4e-05,1e-05,7e-06,1.3e-05,1.4e-05,3.9e-05,7e-06,1.1e-05,1.2e-05,8e-06,1e-05,1.2e-05,2e-05,1.4e-05,2.7e-05,1.3e-05,7e-06,9e-06,5e-06,6e-06,2e-05,1.2e-05,1.3e-05,1.4e-05,1.3e-05,5e-06,1.3e-05,1.2e-05,7e-06,6e-06,3e-06,1.5e-05,4e-06,1.2e-05,2.5e-05,9e-06,9e-06,1.5e-05,1.6e-05,5e-06,1e-05,2.4e-05,4e-06,4e-06,1.5e-05,3e-06,1e-05,6e-06,7e-06,1.9e-05,6e-06
4.8e-05,1.2e-05,2.4e-05,1.2e-05,3e-06,3.3e-05,5e-05,1e-05,2.5e-05,1.2e-05,2.9e-05,3e-06,1.1e-05,4e-06,1.1e-05,9e-06,4e-06,2.1e-05,1.7e-05,1.2e-05,2.4e-05,6e-06,1.5e-05,7e-06,1.2e-05,6e-06,5e-06,7e-06,1.4e-05,7e-06,1.9e-05,1.6e-05,2e-05,2.8e-05,1.3e-05,1.8e-05,7e-06,1.7e-05,1.4e-05,1.4e-05,1.5e-05,1e-05,8e-06,6e-06,7e-06,8e-06,4e-06,8e-06,1.4e-05,1.6e-05,2e-06,1e-05,1.2e-05,2.5e-05,1.6e-05,5e-06,7e-06,5e-06,1.5e-05,9e-06,5e-06,1.2e-05,1.4e-05,2.7e-05,2e-05,1.9e-05,5e-06,2e-05,1.2e-05,6e-06,1.4e-05,5e-06,9e-06,1.7e-05,1.2e-05,2.7e-05,1e-05,1.1e-05,1.3e-05,1.2e-05,1.4e-05,9e-06,8e-06,1.1e-05,2.5e-05,1e-05,6e-06,5e-06,1.3e-05,7e-06,6e-06,9e-06,4e-06,1e-06,1.1e-05,1.2e-05,8e-06,1.8e-05,1e-06,1e-06,6e-06,7e-06,6e-06,7e-06,1.9e-05,1.1e-05,1.3e-05,1.8e-05,1.1e-05,3e-06,1.3e-05,2.2e-05,3e-06,6e-06,9e-06,6e-06,6e-06,4e-06,4e-06,1.8e-05,7e-06
5.7e-05,1.9e-05,3e-05,9e-06,1.1e-05,2.9e-05,4.7e-05,2.1e-05,2.3e-05,1.7e-05,3.1e-05,1.8e-05,9e-06,1.7e-05,8e-06,7e-06,8e-06,2.4e-05,1.7e-05,6e-06,2.5e-05,3e-06,2.7e-05,1.1e-05,2.7e-05,1.1e-05,8e-06,1.3e-05,7e-06,4e-06,2.3e-05,1.7e-05,1.1e-05,2.1e-05,6e-06,1.5e-05,1e-06,1.6e-05,7e-06,1.2e-05,1.5e-05,6e-06,7e-06,4e-06,1.4e-05,6e-06,1.2e-05,3e-06,7e-06,1.8e-05,8e-06,1e-05,7e-06,3.2e-05,1.6e-05,8e-06,1e-05,3e-06,1e-05,7e-06,1e-06,5e-06,1.2e-05,2.5e-05,2.3e-05,2.3e-05,1e-05,1.2e-05,1.2e-05,1.2e-05,1.5e-05,9e-06,1e-05,1.3e-05,8e-06,3.3e-05,9e-06,1.8e-05,8e-06,1.4e-05,5e-06,7e-06,9e-06,1.2e-05,2.2e-05,1.1e-05,6e-06,3e-06,1.5e-05,3e-06,1.3e-05,7e-06,4e-06,1.2e-05,1e-05,1e-05,8e-06,1.5e-05,3e-06,3e-06,1.2e-05,1e-05,4e-06,9e-06,1.2e-05,1.3e-05,1.2e-05,2e-05,1.4e-05,4e-06,4e-06,1.3e-05,2e-06,7e-06,9e-06,4e-06,6e-06,4e-06,5e-06,1.7e-05,5e-06
4.8e-05,9e-06,4.9e-05,2.3e-05,1.2e-05,2.4e-05,2.8e-05,8e-06,2.5e-05,2.3e-05,1.6e-05,1e-05,1.2e-05,1.7e-05,1.2e-05,1e-05,1.1e-05,1.5e-05,6e-06,8e-06,2.6e-05,5e-06,2.6e-05,1.1e-05,1.8e-05,1.2e-05,1e-05,9e-06,5e-06,6e-06,2.4e-05,2.7e-05,2.3e-05,2.6e-05,7e-06,8e-06,1.1e-05,1.2e-05,1e-05,1.5e-05,8e-06,5e-06,1.5e-05,8e-06,4e-06,9e-06,1.2e-05,9e-06,1.2e-05,8e-06,1e-06,7e-06,6e-06,3.2e-05,8e-06,5e-06,6e-06,6e-06,1.5e-05,1e-05,4e-06,2e-06,1.1e-05,2.8e-05,1.6e-05,1.5e-05,1e-05,1.5e-05,9e-06,5e-06,1.3e-05,1.4e-05,9e-06,9e-06,1.1e-05,2.8e-05,1.2e-05,1.5e-05,4e-06,9e-06,6e-06,1e-05,1.3e-05,9e-06,2.5e-05,1.6e-05,1.3e-05,4e-06,9e-06,8e-06,1.4e-05,5e-06,4e-06,1.3e-05,1e-05,3e-06,4e-06,1.9e-05,2e-06,2e-06,9e-06,1e-05,2e-06,8e-06,1.9e-05,1.2e-05,6e-06,1.7e-05,1.3e-05,9e-06,6e-06,1.4e-05,1e-05,1.3e-05,6e-06,7e-06,6e-06,2e-06,7e-06,1.6e-05,3e-06
3.7e-05,7e-06,4.9e-05,1.7e-05,2.2e-05,1.1e-05,4.4e-05,1.6e-05,2.3e-05,1.6e-05,1.5e-05,2e-05,7e-06,4e-06,1.5e-05,8e-06,1.7e-05,1.9e-05,9e-06,1.2e-05,2.9e-05,8e-06,2.1e-05,1.3e-05,1.8e-05,1.5e-05,4e-06,6e-06,8e-06,7e-06,2.2e-05,2.3e-05,1.6e-05,1.6e-05,5e-06,1.4e-05,6e-06,1.2e-05,1.1e-05,1.2e-05,3e-06,6e-06,1.2e-05,6e-06,4e-06,8e-06,8e-06,7e-06,1.1e-05,1e-05,2e-06,9e-06,1.1e-05,2.8e-05,1.6e-05,5e-06,3e-06,3e-06,1.3e-05,1.1e-05,4e-06,6e-06,8e-06,2.2e-05,1.7e-05,1.8e-05,3e-06,2.1e-05,4e-06,6e-06,1.8e-05,1.1e-05,1.5e-05,1.6e-05,1.2e-05,2.7e-05,1.1e-05,1e-05,4e-06,1e-05,6e-06,7e-06,1.8e-05,1e-05,2e-05,1.7e-05,7e-06,3e-06,8e-06,5e-06,1.5e-05,3e-06,3e-06,5e-06,5e-06,7e-06,3e-06,1.5e-05,1e-06,2e-06,1e-06,4e-06,4e-06,3e-06,2e-05,9e-06,8e-06,2.1e-05,6e-06,8e-06,7e-06,1.8e-05,7e-06,3e-06,2e-06,3e-06,1.1e-05,1e-06,3e-06,1.9e-05,7e-06
4.3e-05,7e-06,2.8e-05,1.7e-05,1.6e-05,3.3e-05,5.4e-05,8e-06,1.6e-05,1.7e-05,1e-05,1.7e-05,2.1e-05,3e-06,9e-06,7e-06,3e-06,2.6e-05,2e-05,1e-05,1.5e-05,5e-06,2.3e-05,9e-06,1.7e-05,8e-06,5e-06,6e-06,1e-06,7e-06,2.1e-05,2.7e-05,1.8e-05,2.3e-05,1e-06,1.4e-05,3e-06,1.4e-05,7e-06,1e-05,7e-06,1.1e-05,1.5e-05,9e-06,3e-06,0,9e-06,8e-06,1.2e-05,1e-05,2e-06,7e-06,3e-06,2.7e-05,1.8e-05,2e-06,3e-06,1e-06,1.4e-05,1.5e-05,3e-06,6e-06,1.6e-05,2.2e-05,1.7e-05,1.9e-05,4e-06,1.3e-05,6e-06,4e-06,1.9e-05,6e-06,6e-06,1e-05,1.4e-05,2.7e-05,7e-06,1.2e-05,5e-06,7e-06,6e-06,4e-06,1.1e-05,9e-06,2.4e-05,9e-06,8e-06,2e-06,7e-06,2e-06,1.2e-05,4e-06,2e-06,2e-06,5e-06,8e-06,4e-06,1.9e-05,1e-06,4e-06,2e-06,6e-06,1e-06,7e-06,1.9e-05,5e-06,7e-06,1.7e-05,9e-06,3e-06,7e-06,1.8e-05,8e-06,6e-06,3e-06,5e-06,3e-06,5e-06,4e-06,1.9e-05,5e-06
4e-05,5e-06,1.9e-05,7e-06,1.2e-05,2.2e-05,4e-05,7e-06,1.3e-05,1.2e-05,1.1e-05,7e-06,8e-06,1.2e-05,6e-06,7e-06,3e-06,2.5e-05,7e-06,1.7e-05,3.3e-05,1e-05,1.4e-05,9e-06,1.5e-05,1.2e-05,7e-06,1.2e-05,8e-06,7e-06,1.8e-05,1.7e-05,8e-06,1.8e-05,6e-06,7e-06,8e-06,1.4e-05,1.2e-05,1.6e-05,4e-06,8e-06,1.6e-05,6e-06,9e-06,9e-06,3e-06,4e-06,1.4e-05,7e-06,5e-06,2e-06,6e-06,2.4e-05,2.2e-05,6e-06,3e-06,4e-06,1.1e-05,6e-06,8e-06,1e-05,6e-06,2.4e-05,2.2e-05,2.3e-05,5e-06,1.8e-05,4e-06,4e-06,1.7e-05,6e-06,5e-06,1.3e-05,1.1e-05,2.5e-05,1e-05,1.1e-05,4e-06,9e-06,5e-06,2e-06,1.3e-05,1.2e-05,2.4e-05,9e-06,2e-06,4e-06,8e-06,2e-06,9e-06,4e-06,4e-06,4e-06,1e-06,6e-06,4e-06,1.5e-05,4e-06,3e-06,6e-06,2e-06,4e-06,5e-06,1.8e-05,8e-06,9e-06,1.8e-05,1.1e-05,2e-06,8e-06,1.7e-05,6e-06,5e-06,4e-06,7e-06,4e-06,1e-06,6e-06,1.5e-05,3e-06
3.8e-05,2e-06,1.8e-05,1e-06,6e-06,1.5e-05,4.2e-05,8e-06,1.9e-05,1.1e-05,8e-06,3e-06,1.1e-05,1e-05,7e-06,6e-06,9e-06,2.3e-05,7e-06,1.5e-05,2.6e-05,8e-06,2e-05,8e-06,9e-06,8e-06,5e-06,1e-05,5e-06,6e-06,1.5e-05,1.9e-05,1.2e-05,1.5e-05,4e-06,1.5e-05,9e-06,1.5e-05,8e-06,1.6e-05,8e-06,5e-06,1.2e-05,5e-06,8e-06,3e-06,1e-06,1e-05,1e-05,9e-06,4e-06,3e-06,5e-06,2.6e-05,1.9e-05,2e-06,1e-06,5e-06,1.1e-05,5e-06,1e-06,8e-06,1.3e-05,1.9e-05,1.8e-05,2e-05,4e-06,1.6e-05,7e-06,2e-06,1.2e-05,6e-06,3e-06,1.1e-05,1e-05,2.6e-05,1.1e-05,1e-05,3e-06,7e-06,5e-06,2e-06,1.2e-05,1.1e-05,2.3e-05,8e-06,4e-06,1e-06,6e-06,1e-06,1e-05,3e-06,3e-06,5e-06,3e-06,6e-06,3e-06,1.4e-05,3e-06,4e-06,8e-06,7e-06,2e-06,5e-06,1.5e-05,4e-06,7e-06,1.9e-05,8e-06,5e-06,6e-06,1.4e-05,7e-06,4e-06,2e-06,8e-06,2e-06,3e-06,5e-06,1.8e-05,3e-06
4.2e-05,1e-06,1.9e-05,4e-06,7e-06,2e-05,3.9e-05,5e-06,1.8e-05,1.1e-05,1e-06,2e-06,6e-06,9e-06,4e-06,2e-06,5e-06,2.5e-05,9e-06,1.3e-05,2.3e-05,4e-06,2.2e-05,9e-06,1.1e-05,1e-05,1e-06,1.4e-05,6e-06,8e-06,1.9e-05,2.1e-05,1.4e-05,1.6e-05,9e-06,1.2e-05,5e-06,1.5e-05,1.2e-05,1.6e-05,5e-06,8e-06,7e-06,3e-06,6e-06,8e-06,2e-06,4e-06,8e-06,9e-06,1e-06,2e-06,4e-06,2.6e-05,1.6e-05,3e-06,2e-06,4e-06,1e-05,7e-06,5e-06,4e-06,1.2e-05,1.9e-05,2.2e-05,2e-05,2e-06,1.3e-05,7e-06,5e-06,1.2e-05,2e-06,5e-06,1.3e-05,1e-05,2.5e-05,1e-05,1.3e-05,4e-06,8e-06,1e-06,4e-06,1.2e-05,9e-06,2.1e-05,6e-06,2e-06,4e-06,2e-06,3e-06,1.3e-05,2e-06,2e-06,2e-06,1e-06,5e-06,3e-06,1.4e-05,1e-06,2e-06,6e-06,7e-06,2e-06,6e-06,1.5e-05,7e-06,8e-06,1.9e-05,9e-06,5e-06,6e-06,1.4e-05,6e-06,6e-06,3e-06,9e-06,7e-06,2e-06,5e-06,1.7e-05,2e-06
3.9e-05,3e-06,1.7e-05,7e-06,9e-06,2.1e-05,4e-05,5e-06,1.8e-05,1.5e-05,1e-06,3e-06,7e-06,1e-05,2e-06,3e-06,7e-06,2.2e-05,8e-06,1.4e-05,2.3e-05,4e-06,2.2e-05,1e-05,1.3e-05,9e-06,3e-06,1.2e-05,4e-06,6e-06,2.1e-05,1.6e-05,1.1e-05,1.8e-05,6e-06,1.2e-05,4e-06,1.4e-05,1.1e-05,1.4e-05,4e-06,3e-06,1e-05,5e-06,4e-06,5e-06,5e-06,5e-06,1e-05,8e-06,2e-06,3e-06,5e-06,2.6e-05,1.7e-05,1e-06,1e-06,3e-06,9e-06,7e-06,4e-06,4e-06,1.2e-05,2e-05,1.9e-05,1.9e-05,3e-06,1.3e-05,7e-06,4e-06,1.4e-05,4e-06,4e-06,1.3e-05,1.3e-05,2.5e-05,1e-05,1.2e-05,2e-06,9e-06,2e-06,3e-06,1e-05,9e-06,2.1e-05,8e-06,4e-06,2e-06,5e-06,3e-06,1.2e-05,3e-06,2e-06,2e-06,2e-06,5e-06,2e-06,1.5e-05,1e-06,3e-06,6e-06,8e-06,1e-06,3e-06,1.6e-05,7e-06,7e-06,1.9e-05,9e-06,4e-06,6e-06,1.7e-05,7e-06,5e-06,4e-06,7e-06,4e-06,1e-06,6e-06,1.6e-05,1e-06
