-0.003576,-0.002804,-0.002643,-0.002356,-0.003458,-0.003326,-0.002642,-0.001813,-0.001818,-0.00298,-0.00311,-0.003271,-0.002081,-0.003196,-0.001904,-0.001201,-0.002647,-0.002833,-0.001881,-0.001853,-0.002934,-0.002714,-0.00179,-0.00134,-0.001753,-0.002696,-0.002682,-0.002341
-0.003736,-0.002499,-0.002549,-0.001877,-0.001744,-0.001808,-0.002019,-0.001141,-0.000882,-0.001147,-0.000679,-0.001516,-0.00144,-0.002708,-0.002033,-0.000809,-0.00099,-0.000707,-0.00046,-0.001014,-0.001368,-0.001681,-0.001023,5.1e-05,-0.000233,0.000244,6e-05,-0.000683
-0.001119,-0.000285,-0.00107,-0.001467,-5e-06,0.000145,-0.000391,-0.000825,-0.000642,0.000181,0.000288,8.4e-05,-0.000867,-0.001087,-0.001139,-0.000602,-0.000241,0.000152,-5.8e-05,-0.000426,0.000326,0.000263,7.1e-05,-7.1e-05,-7e-05,0.000457,0.000517,6.1e-05
0.001465,0.001398,0.000441,-0.001225,0.000116,0.000386,0.000454,-0.000863,-0.001146,0.000125,-2.2e-05,0.000175,-0.000481,0.000681,-2e-05,-0.000449,-0.000196,-0.000347,-0.000466,-0.000281,0.000729,0.001106,0.000371,-0.000852,-0.000996,-0.001121,-0.00057,-9.8e-05
0.002244,0.001309,0.001377,0.000389,0.000791,0.000538,0.000907,0.000369,7e-06,0.001145,0.001412,0.000724,0.000799,0.002426,0.001052,0.000424,0.001352,0.000881,0.000652,0.000731,0.001368,0.001287,0.000577,0.000285,1e-06,0.000606,0.001047,0.001178
-0.000917,-0.001038,-0.000729,-0.000447,-0.000799,-0.001028,-0.000441,-3.4e-05,-6e-06,-0.000145,-0.000152,-0.000751,-0.000237,-0.000169,-0.000119,-1.7e-05,-0.00014,-0.000286,0.000279,0.000111,-0.000391,-0.000529,-0.000308,0.00027,-2e-06,0.000342,0.000262,3.4e-05
-0.003224,-0.001886,-0.002341,-0.001547,-0.002011,-0.001551,-0.001253,-0.000838,-0.000631,-0.001988,-0.002276,-0.001385,-0.001436,-0.003271,-0.001342,-0.000617,-0.002432,-0.002071,-0.000983,-0.000923,-0.002332,-0.001956,-0.000984,-0.000714,-0.000701,-0.001687,-0.002058,-0.002143
0,0.00063,0.000491,0.001685,0.001419,0.001651,0.000793,0.001095,0.001317,0.000572,0.000662,0.001698,0.000866,-0.000541,0.000384,0.000752,0.000361,0.000849,0.000318,0.000465,8.6e-05,4.8e-05,0.000341,5e-04,0.001188,0.000853,0.000452,8.8e-05
0.003387,0.002224,0.002886,0.003591,0.002971,0.002512,0.001696,0.001922,0.002082,0.002284,0.002083,0.001921,0.00211,0.00281,0.001949,0.001342,0.00276,0.002672,0.001079,0.00115,0.002197,0.00163,0.001037,0.001076,0.001849,0.002457,0.002258,0.002306
0.002282,0.000816,0.001463,0.000862,-0.000167,-0.000457,3.7e-05,-0.000105,-0.000341,-0.000426,-0.000927,-0.001427,0.000169,0.0019,0.001044,-4.9e-05,0.000502,-0.000287,-0.000593,-0.000179,0.000363,0.000247,-0.000188,-0.000617,-0.000712,-0.001155,-0.000907,0.000291
-0.000426,-0.000916,-0.000206,-0.000827,-0.001012,-0.000928,-0.000566,-0.000677,-0.000967,-0.001105,-0.000791,-0.00106,-0.000493,0.000247,-0.000287,-0.000765,-0.000695,-0.001111,-0.000682,-0.000352,-0.000775,-0.000472,-0.000557,-0.00062,-0.001119,-0.001864,-0.001517,-0.000941
-0.002144,-0.00134,-0.000825,-0.000648,0.000334,0.000331,-0.000186,1.8e-05,0.000402,0.00076,0.001199,0.001117,-0.00014,-0.001073,-0.001148,-0.000542,-8.4e-05,0.000673,0.000788,0.000196,-0.000193,9.5e-05,0.000241,0.000745,0.000676,0.001238,0.00104,-4.4e-05
-0.002326,-0.000807,-0.001597,-0.00194,-0.001066,-0.001012,-0.000896,-0.00084,-0.000448,-0.000321,-0.000605,-9.9e-05,-0.001124,-0.002506,-0.001607,-0.000602,-0.001319,-0.000439,0.000137,-0.00058,-0.000867,-0.000542,-5.6e-05,-7.4e-05,-0.00011,0.000516,0.000176,-0.000651
-5.1e-05,0.000451,-0.000934,-0.001744,-0.001547,-0.001525,-0.000849,-0.00093,-0.001291,-0.001301,-0.001198,-0.000911,-0.000687,-0.000856,-0.00047,1.9e-05,-0.001066,-0.001404,-0.000815,-0.000524,-0.000545,-0.000736,-0.000499,-0.000801,-0.001251,-0.001291,-0.000916,-0.000572
0.002306,0.001216,0.000587,0.000653,0.00079,0.000543,0.00064,0.000538,0.000132,0.000656,0.001179,0.00037,0.001019,0.002238,0.001282,0.000926,0.001403,0.000447,0.000194,0.000758,0.001492,0.000651,0.000183,0.00037,1.4e-05,0.00033,0.000955,0.001337
0.001205,0.000287,0.000121,0.000616,0.000813,0.00112,0.001122,0.00049,0.000372,0.00075,0.000558,0.000163,0.000424,0.001525,0.001213,5e-04,0.00077,0.000485,0.000518,0.000502,0.001036,0.000914,0.000511,0.000417,0.000455,6e-04,0.000531,0.00061
-0.001263,-0.000882,-0.000503,-0.000168,-0.000483,0.000415,0.000454,-0.000225,-0.000398,-0.000649,-0.000953,-0.00014,-0.000576,-0.001107,-0.000133,-0.000155,-0.001064,-0.000624,-0.000244,-0.000466,-0.000998,-4.9e-05,0.000246,-0.000267,-4.4e-05,-0.00067,-0.001212,-0.001347
-0.00139,-0.000657,0.000548,0.001095,0.000313,0.00037,-0.000151,0.000339,0.000518,0.000185,0.000376,0.000679,0.000159,-0.001419,-0.000761,-6.2e-05,7.1e-05,0.000692,6.6e-05,-0.000273,-0.000897,-0.00037,0.000155,0.000296,0.000787,0.000642,0.000222,-0.000374
0.000279,0.000388,0.000974,0.001244,0.000692,-0.000252,-0.000651,0.000429,0.000961,0.000441,0.000385,-3.7e-05,0.000327,-0.000255,-0.000335,-0.000151,0.000768,0.001041,0.000298,3.8e-05,5e-05,-0.000487,-0.000271,0.000171,0.000738,0.00112,0.000942,0.000796
