0.077068,0.080264,0.083648,0.080989,0.078425,0.074902,0.069501,0.074573,0.074402,0.068217,0.06008,0.050969,0.054941,0.073074,0.08113,0.077748,0.076481,0.078743,0.088153,0.079259,0.064632,0.067163,0.072013,0.081236,0.077618,0.067224,0.072196,0.071185
0.095243,0.100084,0.103622,0.100091,0.095966,0.091541,0.085395,0.091438,0.091938,0.084762,0.074836,0.063755,0.068151,0.090069,0.099772,0.095277,0.093711,0.097761,0.11006,0.098933,0.081442,0.082991,0.087452,0.099697,0.09555,0.083048,0.089414,0.087429
0.121614,0.129967,0.133427,0.127583,0.120413,0.114722,0.107757,0.114537,0.116874,0.110019,0.09849,0.085044,0.089135,0.115167,0.126295,0.119834,0.118126,0.12577,0.1419,0.127499,0.107004,0.106279,0.108909,0.125478,0.1213,0.106633,0.114756,0.110815
0.126572,0.138166,0.141217,0.133779,0.12427,0.118362,0.112279,0.117002,0.121795,0.120313,0.111337,0.097774,0.099157,0.122009,0.130608,0.122596,0.122091,0.133293,0.14848,0.133471,0.115927,0.112502,0.111455,0.128992,0.126932,0.114583,0.122292,0.115713
0.110645,0.12018,0.121886,0.114938,0.105269,0.100728,0.096939,0.097891,0.10587,0.113383,0.109148,0.096184,0.093026,0.106077,0.108101,0.09938,0.102615,0.116106,0.123014,0.109596,0.100772,0.097433,0.093908,0.105956,0.106893,0.103184,0.108306,0.100325
0.09786,0.099771,0.099817,0.095388,0.088921,0.086588,0.084474,0.084196,0.092353,0.103438,0.102425,0.089044,0.081805,0.087254,0.085068,0.077052,0.081419,0.091761,0.090105,0.081328,0.081317,0.079748,0.07574,0.077908,0.08034,0.086615,0.087734,0.081356
0.107336,0.103658,0.104099,0.104951,0.105432,0.09877,0.089698,0.093946,0.102378,0.106179,0.103742,0.094141,0.088589,0.089231,0.085613,0.085802,0.091611,0.093064,0.089158,0.090661,0.097315,0.095231,0.088844,0.080376,0.07873,0.089733,0.090623,0.08704
0.146244,0.141671,0.142972,0.146937,0.154071,0.14015,0.116965,0.126301,0.139747,0.13475,0.128493,0.12476,0.122734,0.11814,0.11161,0.121321,0.13173,0.13049,0.127691,0.134594,0.147096,0.143589,0.1315,0.114067,0.105908,0.11803,0.124458,0.127901
0.20464,0.203843,0.211039,0.210651,0.21574,0.200851,0.162559,0.170767,0.19623,0.188957,0.175019,0.171415,0.172579,0.16715,0.158339,0.17416,0.185949,0.182822,0.18145,0.192177,0.214724,0.210802,0.188512,0.158548,0.144103,0.157585,0.171701,0.187104
0.258701,0.262596,0.279658,0.2717,0.268267,0.255989,0.206955,0.209658,0.249187,0.244383,0.219604,0.211393,0.214529,0.21087,0.204168,0.22492,0.233802,0.226033,0.22491,0.240635,0.278209,0.275564,0.239843,0.197084,0.179305,0.194672,0.213311,0.238665
0.284891,0.290242,0.311791,0.308066,0.299858,0.286758,0.239523,0.23184,0.275318,0.276133,0.240505,0.226381,0.230195,0.227727,0.226413,0.250833,0.252285,0.235849,0.237243,0.26201,0.313702,0.310417,0.259673,0.210949,0.199143,0.223081,0.238157,0.256961
0.295221,0.302606,0.308922,0.335096,0.332775,0.299853,0.266185,0.245599,0.276264,0.289565,0.257111,0.242562,0.231727,0.221356,0.227412,0.251567,0.24789,0.229377,0.235103,0.258817,0.310612,0.30953,0.257008,0.209991,0.205907,0.247925,0.262891,0.260243
0.336857,0.368742,0.351291,0.401598,0.413592,0.339274,0.30946,0.289494,0.304846,0.31898,0.283991,0.276665,0.250553,0.228298,0.240172,0.266824,0.277361,0.271939,0.270102,0.282537,0.335406,0.335134,0.280133,0.233045,0.244896,0.321465,0.341476,0.302861
0.411063,0.464594,0.430432,0.471529,0.498519,0.410204,0.379893,0.368795,0.373606,0.369804,0.31242,0.308226,0.283486,0.262466,0.286537,0.331,0.3605,0.341918,0.325151,0.361922,0.424371,0.400572,0.317577,0.262577,0.312419,0.433305,0.451858,0.376448
0.429804,0.496692,0.473418,0.479071,0.517612,0.470759,0.447998,0.43073,0.41244,0.39434,0.32354,0.313099,0.303167,0.298549,0.33264,0.392796,0.439013,0.389135,0.358254,0.452634,0.514807,0.44077,0.333636,0.281638,0.368381,0.519754,0.534645,0.429947
0.363533,0.426762,0.43676,0.413139,0.465621,0.482044,0.468796,0.434633,0.393977,0.382555,0.322234,0.30083,0.298406,0.296439,0.327504,0.398062,0.454922,0.385212,0.356218,0.501385,0.538252,0.428886,0.349754,0.300311,0.372031,0.523165,0.543212,0.432439
0.271551,0.325457,0.363798,0.342516,0.387778,0.41991,0.412047,0.381138,0.348606,0.345279,0.296564,0.274851,0.273919,0.263212,0.277472,0.332706,0.378988,0.321444,0.312948,0.463706,0.484982,0.384657,0.342564,0.295034,0.323239,0.43419,0.452927,0.369215
0.236928,0.273861,0.295357,0.282616,0.300148,0.303691,0.30526,0.306207,0.299379,0.300744,0.266837,0.260991,0.269047,0.247499,0.233442,0.248029,0.267504,0.248488,0.274431,0.375034,0.371376,0.305851,0.29309,0.274963,0.298332,0.338782,0.320785,0.285923
0.262862,0.302121,0.309961,0.307214,0.294132,0.245088,0.257589,0.289817,0.29206,0.30895,0.284275,0.266585,0.291631,0.286048,0.257356,0.260543,0.281663,0.27451,0.318592,0.387604,0.330262,0.248501,0.252072,0.278526,0.327322,0.323477,0.271373,0.266427
0.309616,0.376476,0.390249,0.398311,0.366491,0.269851,0.290278,0.335303,0.327957,0.354127,0.325303,0.289863,0.324996,0.34515,0.318165,0.33174,0.38836,0.389135,0.41879,0.471929,0.389525,0.267103,0.247188,0.306143,0.41281,0.41581,0.322194,0.288409
0.341393,0.441248,0.481689,0.509656,0.471849,0.333685,0.343914,0.380809,0.352259,0.376735,0.34182,0.302347,0.346498,0.38587,0.363121,0.382256,0.47328,0.488203,0.489673,0.531206,0.462758,0.302291,0.23938,0.319408,0.482756,0.509201,0.381586,0.304081
0.354247,0.460957,0.525898,0.578047,0.54951,0.383726,0.375672,0.391678,0.32013,0.331012,0.330955,0.321958,0.347799,0.382451,0.369057,0.38966,0.488013,0.50379,0.476252,0.513411,0.488408,0.333082,0.264402,0.330556,0.474032,0.508766,0.396751,0.330363
0.333836,0.410104,0.48393,0.552901,0.533796,0.38249,0.36973,0.363607,0.25823,0.26886,0.317948,0.342268,0.335055,0.337656,0.337361,0.369687,0.452957,0.455011,0.392611,0.409184,0.436176,0.331336,0.28661,0.322749,0.39244,0.405054,0.349424,0.352123
0.294652,0.310959,0.365391,0.434338,0.41895,0.329551,0.330454,0.301929,0.205548,0.25437,0.324514,0.335577,0.303525,0.286471,0.296317,0.317995,0.382927,0.407357,0.328705,0.304874,0.367233,0.301199,0.25873,0.273504,0.281556,0.269784,0.270422,0.334889
0.239368,0.214627,0.230209,0.284544,0.276351,0.243251,0.251247,0.224369,0.166501,0.238319,0.313869,0.311767,0.284067,0.276299,0.277021,0.249372,0.295657,0.349145,0.284959,0.246944,0.302031,0.243458,0.187732,0.201333,0.196629,0.18842,0.208219,0.26314
0.173691,0.150116,0.14846,0.16564,0.151981,0.153372,0.157178,0.145355,0.139945,0.212384,0.276294,0.2653,0.239975,0.242142,0.235311,0.188747,0.219482,0.267522,0.217538,0.18764,0.226407,0.183559,0.135855,0.156209,0.154521,0.143936,0.157361,0.186516
0.131779,0.113302,0.118003,0.126669,0.108886,0.09922,0.090237,0.097413,0.125108,0.178245,0.226012,0.210765,0.173822,0.173644,0.168082,0.138558,0.149102,0.165197,0.141816,0.147604,0.170467,0.135568,0.111434,0.132344,0.125976,0.11041,0.114808,0.138279
0.11472,0.093014,0.11288,0.137215,0.117235,0.090092,0.076951,0.085676,0.107372,0.150829,0.195187,0.179576,0.136361,0.121997,0.122621,0.115695,0.106894,0.11327,0.114464,0.129004,0.144895,0.111644,0.098504,0.107082,0.102905,0.104648,0.108894,0.123751
0.126092,0.099881,0.121986,0.150708,0.125443,0.097878,0.0935,0.092221,0.088659,0.126878,0.173072,0.16081,0.125076,0.106692,0.119084,0.128395,0.113338,0.123933,0.129168,0.135722,0.156492,0.124409,0.10857,0.109102,0.102893,0.119209,0.130093,0.127004
0.156557,0.128091,0.129371,0.140024,0.123715,0.122122,0.126945,0.106306,0.096009,0.129775,0.149187,0.137614,0.122796,0.117097,0.137345,0.154035,0.139379,0.139896,0.137487,0.158575,0.188561,0.139279,0.123995,0.12678,0.111704,0.12912,0.142581,0.124816
0.181759,0.166569,0.143941,0.117573,0.124382,0.166987,0.173064,0.12225,0.119586,0.15568,0.13921,0.130437,0.135655,0.137902,0.155291,0.17496,0.158506,0.136256,0.128603,0.171089,0.201404,0.135694,0.133248,0.142927,0.117997,0.130866,0.145889,0.130056
0.174803,0.190725,0.16154,0.10935,0.136702,0.207388,0.209182,0.139999,0.147886,0.179939,0.140308,0.129466,0.135679,0.1399,0.155225,0.181028,0.163576,0.11591,0.104277,0.165202,0.190919,0.120219,0.128292,0.148438,0.127591,0.138498,0.153286,0.151709
0.136803,0.182709,0.168141,0.121814,0.160763,0.219158,0.208893,0.151905,0.173257,0.182841,0.121661,0.105783,0.107686,0.11214,0.126388,0.153863,0.140622,0.08688,0.079287,0.143751,0.170034,0.11667,0.124379,0.151394,0.148581,0.164988,0.171421,0.165229
0.097332,0.145292,0.150371,0.133352,0.164062,0.183327,0.175481,0.1651,0.184643,0.161631,0.094822,0.070175,0.068545,0.073921,0.090775,0.107873,0.100589,0.071363,0.072646,0.117534,0.139685,0.109204,0.114238,0.138129,0.152246,0.187842,0.181062,0.146489
0.060795,0.08992,0.107988,0.121386,0.134245,0.119571,0.124471,0.16365,0.167694,0.118024,0.065412,0.051415,0.059803,0.057607,0.061472,0.070137,0.078799,0.075926,0.07539,0.107059,0.12121,0.097522,0.104081,0.123553,0.130645,0.175484,0.160934,0.104611
0.040222,0.048769,0.063712,0.086243,0.088582,0.071031,0.079086,0.13468,0.128094,0.070398,0.038105,0.040567,0.061454,0.055357,0.044935,0.058885,0.08398,0.087436,0.080704,0.095558,0.098755,0.083488,0.091247,0.104636,0.093343,0.130374,0.130232,0.090603
0.033084,0.035896,0.040094,0.050673,0.058693,0.047813,0.048134,0.090071,0.091507,0.054225,0.033057,0.032155,0.057168,0.058211,0.052126,0.073452,0.093407,0.087302,0.080569,0.084265,0.084604,0.073281,0.072112,0.075035,0.060673,0.083325,0.10031,0.093728
0.031103,0.029511,0.030225,0.041543,0.05032,0.0393,0.031538,0.06434,0.077715,0.05905,0.039435,0.030579,0.053791,0.063807,0.061963,0.082524,0.088664,0.069229,0.065809,0.068894,0.073138,0.064595,0.058853,0.05374,0.039563,0.055768,0.087641,0.095229
0.034186,0.030347,0.029816,0.051148,0.0513,0.030645,0.02669,0.061687,0.081084,0.067666,0.04209,0.032265,0.058493,0.071819,0.065162,0.075071,0.068612,0.041525,0.042129,0.049519,0.055064,0.048868,0.053516,0.050311,0.027342,0.03659,0.073301,0.081843
0.037598,0.03449,0.032263,0.058594,0.051916,0.023046,0.021881,0.0555,0.076845,0.068583,0.038999,0.031203,0.057924,0.071972,0.057753,0.054102,0.043819,0.018588,0.024865,0.042181,0.040113,0.030083,0.042514,0.045541,0.020437,0.029801,0.055689,0.056381
