2.9e-05,0.000125,3.6e-05,1e-05,3.8e-05,4.2e-05,3.8e-05,4.2e-05,2.8e-05,1.7e-05,5.9e-05,6.4e-05,9e-06,1.7e-05,1.4e-05,2.8e-05,6e-06,2.6e-05,3.1e-05,9e-06,2.1e-05,3.4e-05,1.4e-05,1.3e-05,3.3e-05,1.1e-05,1.2e-05,2e-05,1.2e-05,4.6e-05,3.3e-05,5.1e-05,1e-04,0.000181,2e-06,0.001233,0.00086,7.8e-05,0.000196,2.7e-05,5.6e-05,1.5e-05,1.7e-05,2.2e-05,8.6e-05,3.3e-05,7.6e-05,2.7e-05,4.7e-05,0.000394,9.8e-05,0.000638,0.000194,0.000134,0.000184,1.6e-05,9.5e-05,0.00019,3.9e-05,0.000152,0.000196,0.000581,0.000173,2e-05,4.5e-05,5.7e-05,2.3e-05,3.9e-05,6.2e-05,7.2e-05,5e-06,2.8e-05,4.8e-05,7e-06,9.4e-05,0.00033,0.000248,2.6e-05,0.000221,7.9e-05,0.000273,4.1e-05,1.7e-05,7.1e-05,3.7e-05,3.5e-05,8.2e-05,7.3e-05,4.6e-05,4.3e-05,7e-06,6e-06,0.000506,0.000369,0.000181,8.8e-05,4.1e-05,0.000105,2e-06,6.8e-05,3.9e-05,0.000158,6.8e-05,5.1e-05,3.8e-05,3.6e-05,1.6e-05,1.2e-05,5.5e-05,4e-05,6.3e-05,3e-05,5.2e-05,2.4e-05,3.8e-05,1e-05,5.7e-05,5.8e-05,2.2e-05,4.9e-05,4.1e-05
0.000115,0.000278,6.9e-05,4.4e-05,9.4e-05,0.000148,0.000133,0.000154,0.000204,0.000155,0.000162,0.000218,0.000155,7.8e-05,9.7e-05,3.6e-05,7.5e-05,4e-05,8e-05,9.1e-05,8.5e-05,0.000105,9.6e-05,4.1e-05,8.5e-05,5.9e-05,4.6e-05,3.2e-05,2.6e-05,0.000119,0.000151,0.000273,0.000172,0.000382,7.3e-05,0.002405,0.002122,0.000147,0.000375,0.000133,9.7e-05,0.000113,8.4e-05,8.2e-05,0.000173,0.000129,0.000205,0.000224,0.000287,0.000979,0.001303,0.001521,0.001472,0.000751,0.000178,0.00018,0.000131,0.000199,0.000252,0.000284,0.000617,0.001105,0.000716,0.000433,6.2e-05,0.000104,8e-05,0.000141,0.000211,0.000102,0.000302,0.000211,0.000146,0.000161,0.000178,0.001252,0.000612,0.001032,3e-04,8.7e-05,0.000542,0.000635,0.000374,0.000163,0.00024,0.000277,0.000213,0.000282,0.000184,0.000186,0.000176,0.000195,0.001293,0.000678,0.000284,0.000214,0.000289,0.000209,2e-04,0.000112,0.000166,0.000465,0.000163,0.000222,0.000198,0.000211,0.000195,0.000184,0.000141,0.00018,9.2e-05,0.000139,0.000199,0.000146,0.000153,0.000183,0.000126,0.000219,0.000214,0.000298,0.000265
5.9e-05,0.000267,4.2e-05,2.8e-05,7.4e-05,6.2e-05,6.3e-05,2.5e-05,0.000111,0.000104,3.7e-05,2.9e-05,6.1e-05,3.7e-05,3.7e-05,1.1e-05,6.9e-05,3.7e-05,1e-05,3.9e-05,5.5e-05,3.8e-05,3e-05,2.5e-05,6.6e-05,8e-05,3.6e-05,3.5e-05,3.5e-05,5.6e-05,4.4e-05,0.000183,0.000181,0.000358,0.000109,0.002537,0.003158,0.001362,0.000458,6.7e-05,4.6e-05,6.7e-05,3.8e-05,3e-05,3.5e-05,5.4e-05,6.8e-05,8.5e-05,0.000193,0.001506,0.001049,0.00037,8.3e-05,2e-04,7.6e-05,9.7e-05,5.1e-05,0.000121,0.000113,9.2e-05,0.000639,0.000979,4.8e-05,0.000211,3.7e-05,0.000118,7.6e-05,0.000107,5.1e-05,6.5e-05,0.000229,7e-05,0.000122,1.6e-05,0.000321,0.001971,0.003405,0.00108,0.000535,8.2e-05,0.000423,5.1e-05,0.000154,0.000118,0.000149,0.000131,2.2e-05,9.3e-05,6e-05,6.6e-05,7e-05,0.00012,0.001552,0.000918,0.000462,0.000126,8.9e-05,6.9e-05,3.6e-05,1.2e-05,6e-05,0.000361,2.9e-05,5.1e-05,0.000115,7.6e-05,5.3e-05,9.6e-05,2.2e-05,7.5e-05,0.000134,3.9e-05,0.000119,0.000123,0.000279,6.2e-05,8.6e-05,2.8e-05,7.4e-05,0.000255,0.000275
4.9e-05,0.000366,8.1e-05,3.6e-05,5.1e-05,8e-05,7e-05,3.4e-05,4.2e-05,9.5e-05,7e-05,0.000132,1.5e-05,5.2e-05,9.9e-05,5.5e-05,7e-05,5.1e-05,7.9e-05,5.1e-05,9e-05,6.2e-05,2.6e-05,1.8e-05,6.5e-05,4.4e-05,7.1e-05,5.5e-05,2.2e-05,1.6e-05,2.9e-05,0.000145,5.6e-05,0.00059,0.000377,0.002821,0.001802,0.000841,0.000559,0.00063,0.000292,6.7e-05,5.5e-05,7.7e-05,3e-05,3.5e-05,2.5e-05,5.7e-05,0.000159,0.00188,0.001963,0.001323,0.00063,0.000256,0.000224,0.000251,0.000124,3.7e-05,0.000117,0.000164,0.000643,0.000696,0.000879,0.000426,0.000166,0.00018,0.000106,8.4e-05,7.2e-05,0.000148,0.000168,7e-06,0.000171,0.000185,0.000279,0.00203,0.002446,0.002443,0.002019,0.000871,0.000689,5e-04,0.000183,2.8e-05,3.5e-05,0.000123,1.2e-05,5.5e-05,3.7e-05,7.5e-05,0.000115,8.3e-05,0.001821,0.001299,0.00057,0.000261,2.6e-05,0.000115,7.8e-05,8.5e-05,3.2e-05,0.000399,8.8e-05,7.3e-05,0.000107,0.000129,7.1e-05,4.5e-05,3.9e-05,9e-05,0.000151,1e-04,7.3e-05,0.000192,0.000259,9.7e-05,0.000233,5.3e-05,0.000105,0.000172,0.000219
9.2e-05,0.000339,0.00019,8.2e-05,3.1e-05,1.2e-05,6e-06,4.3e-05,4.9e-05,0.000103,7.7e-05,0.000137,9.3e-05,8.2e-05,0.000143,6.6e-05,6.8e-05,0.000123,7e-05,7e-06,4.3e-05,2.9e-05,3.9e-05,4.3e-05,5e-05,3.5e-05,1e-04,7.1e-05,4.7e-05,2.7e-05,5.6e-05,0.000198,0.000199,0.000322,0.000472,0.002609,0.002258,0.001441,0.000318,0.000142,0.000211,8.5e-05,6.7e-05,4.6e-05,4.8e-05,3.8e-05,0.00011,5.8e-05,0.000169,0.002411,0.003819,0.001548,0.000341,0.000195,0.000236,0.000149,9.5e-05,0.000158,7.5e-05,0.000189,0.000876,0.000535,0.000623,0.000278,0.000313,6.6e-05,8.8e-05,0.000115,7.1e-05,0.00011,0.000218,3.8e-05,0.000197,0.000139,0.00029,0.002378,0.001243,0.001454,0.000751,0.000369,0.000531,0.000241,5.1e-05,6.9e-05,0.000134,0.000115,1.5e-05,6.2e-05,2.1e-05,3.9e-05,8.5e-05,0.000103,0.002585,0.001017,0.00113,0.000127,0.000112,0.00016,5.5e-05,2.6e-05,3e-05,0.00045,0.000166,9e-05,2.3e-05,5.3e-05,7.2e-05,6.4e-05,8.1e-05,1.8e-05,0.000164,0.000189,0.000153,5.4e-05,2.8e-05,0.000185,0.000267,0.000274,0.000195,0.000204,7.2e-05
2e-05,0.000394,0.00051,0.000265,0.00011,6.8e-05,4e-05,5.1e-05,4.6e-05,0.000143,0.00022,0.000243,3.4e-05,0.00012,0.000198,8.5e-05,0.000205,0.000105,1e-04,5e-05,7.9e-05,8.2e-05,0.000134,8.6e-05,5.4e-05,4.3e-05,0.000104,5.1e-05,6.4e-05,3.4e-05,4.8e-05,9.4e-05,0.000264,0.000221,0.000532,0.002694,0.003958,0.000621,0.000511,0.000122,0.000174,8.7e-05,1.6e-05,9.5e-05,0.000166,0.000131,0.000123,9e-05,0.000198,0.002994,0.000463,0.000437,0.000171,0.000215,0.000416,0.000372,0.000314,0.000136,9.8e-05,8.1e-05,0.000976,0.000975,0.001706,0.001069,0.000571,0.000451,8.6e-05,0.000171,8.4e-05,0.000136,0.000242,0.000104,0.000114,0.000158,0.000442,0.00351,0.000581,0.000791,0.000916,0.000389,0.000385,0.000289,0.000255,0.000178,0.00027,0.000119,6.5e-05,0.000139,9e-05,6.8e-05,3.5e-05,6.1e-05,0.003815,0.004625,0.002402,0.000693,0.000138,0.000172,0.00012,0.00014,3.6e-05,0.00069,0.000122,0.000108,3.4e-05,0.000103,5.9e-05,5.7e-05,8.7e-05,7.8e-05,0.000186,0.00017,0.000171,0.000152,0.00021,0.000186,0.000122,5.2e-05,4.8e-05,0.000323,0.000226
6.4e-05,0.000386,0.000583,0.000436,0.000141,3.4e-05,5.1e-05,0.000135,6e-05,0.000209,0.00039,0.000164,0.000221,0.000117,0.000182,0.000292,0.000378,4e-04,0.000237,6.7e-05,0.000115,6e-05,0.000177,0.000146,4.3e-05,6.1e-05,9.6e-05,0.000118,0.000118,2.2e-05,6.2e-05,0.000116,0.000247,0.000763,0.000836,0.003428,0.002323,0.001502,0.001011,0.000338,0.000123,3.9e-05,2.6e-05,0.000174,7.6e-05,3.4e-05,3.5e-05,5.4e-05,0.000225,0.002751,0.005941,0.004022,0.002188,0.000826,7.3e-05,0.000245,6.7e-05,0.000168,6.8e-05,7.6e-05,0.000981,0.000876,0.00147,0.000787,0.000204,0.000345,0.000188,0.000236,0.000153,0.000311,0.000424,5.4e-05,7.2e-05,0.000157,0.000858,0.00508,0.001602,0.001235,0.000796,0.000475,0.000797,8.5e-05,7.7e-05,0.000139,9.4e-05,0.000266,2.3e-05,9.1e-05,0.000104,9.8e-05,2.4e-05,8.9e-05,0.004611,0.004969,0.003073,0.001246,0.000254,0.000759,0.000578,3.4e-05,0.000228,0.001057,0.000421,0.00026,0.000118,0.000131,4.1e-05,0.000152,6.7e-05,1.7e-05,0.000266,0.000277,0.000211,8.8e-05,0.000159,2e-04,0.000536,0.000142,8.1e-05,0.000334,0.00052
8.8e-05,0.000393,0.000368,5.2e-05,5.6e-05,1.1e-05,4.1e-05,0.000125,7.5e-05,0.000249,0.000307,0.000302,0.000236,0.000359,0.000312,0.000227,0.000152,0.000393,0.000202,8.4e-05,7.2e-05,6.4e-05,0.000224,8.7e-05,8.7e-05,8e-05,4.3e-05,2e-05,0.000115,0.00011,0.000133,0.000169,0.000234,0.000951,0.001257,0.001896,0.010869,0.006863,0.003546,0.001131,0.000473,0.000315,0.000174,0.00016,0.000158,0.000126,0.000153,6e-05,0.000139,0.001816,0.007369,0.00144,0.000505,0.000273,0.000501,0.000282,0.00014,3e-05,0.00017,0.000125,0.001011,0.003577,0.004004,0.001833,0.000588,0.000473,0.00044,0.000581,0.000184,0.000544,0.000252,0.000248,0.00015,0.000319,0.001351,0.005887,0.006375,0.005146,0.002846,0.001371,0.00125,0.000824,0.000335,8.7e-05,0.000265,8.6e-05,0.000327,1e-04,0.000114,0.000114,9.5e-05,0.000116,0.004618,0.003263,0.003941,0.001508,0.000648,0.000488,0.00034,0.000638,0.000349,0.001012,0.001169,0.000627,0.000271,0.000156,0.000145,9.9e-05,0.000239,2e-04,0.000269,0.000465,0.000517,0.00029,0.000541,0.000358,0.001419,0.00105,0.000304,0.000168,0.000693
3.5e-05,0.000491,0.00059,0.000453,0.000274,9.4e-05,1.9e-05,9.4e-05,0.000145,0.000338,0.000164,0.000206,0.000365,0.00058,0.00031,0.00037,0.000401,4e-05,0.000159,0.000266,0.000176,8.8e-05,0.000182,6.7e-05,0.000172,0.000238,0.000254,0.000203,9e-05,0.000234,7.7e-05,0.000357,0.000416,0.000679,0.000965,0.002041,0.015241,0.010005,0.005002,0.001299,0.000422,0.000229,0.000114,0.000162,0.000283,9.1e-05,0.000263,0.000239,0.000161,0.001257,0.006934,0.007594,0.003836,0.001501,0.000894,7e-04,0.000381,0.000156,0.000248,9.7e-05,0.001024,0.005637,0.002914,0.000635,0.000367,0.000416,0.000701,0.000311,0.000323,0.000678,0.001025,9e-04,0.000869,0.000365,0.001237,0.008495,0.015646,0.006182,0.00222,0.000544,0.000499,0.000845,0.000446,0.000147,0.000127,0.000245,0.000511,0.000255,0.000192,0.000128,8.4e-05,0.00022,0.004409,0.007691,0.004762,0.003643,0.000742,0.00054,0.000157,0.000497,0.000238,0.001337,0.001738,0.000791,0.000439,0.000104,0.000266,0.000292,0.000203,5.8e-05,0.000162,0.000203,0.001008,0.000276,0.001215,0.000668,0.001871,0.000865,0.000605,0.000202,0.001279
0.000154,0.000371,0.000555,0.000213,0.000154,0.00011,6.7e-05,4.7e-05,0.000139,0.000181,0.00034,0.000476,0.000748,0.000619,0.000424,0.000285,0.000236,0.000266,0.000243,6.7e-05,0.00012,8.3e-05,0.000162,0.000234,0.000296,0.000102,0.000226,0.000187,0.00026,0.000235,0.000157,0.000568,0.000591,0.001209,0.000848,0.00351,0.012048,0.007281,0.002554,0.000611,0.000262,0.000108,0.000133,0.000228,0.000304,0.000253,8.7e-05,2.7e-05,0.000285,0.000774,0.005007,0.006755,0.003369,0.002097,0.001477,0.00089,0.000317,6.1e-05,0.000266,0.000222,0.001183,0.005235,0.007211,0.00536,0.003154,0.001092,0.000456,0.000345,0.000387,0.000349,0.000672,0.000885,0.000329,0.000396,0.000774,0.007015,0.011999,0.009276,0.004108,0.00102,0.000741,0.000591,0.000347,0.00018,0.00013,0.000194,0.000576,0.000585,0.00048,0.000366,0.000127,0.000217,0.004817,0.007234,0.004352,0.003831,0.002469,0.001244,0.000538,0.000253,0.00021,0.001238,0.001492,0.000954,0.00064,0.000492,0.000344,5e-05,0.000247,0.000207,0.000413,0.000412,0.001351,0.001181,0.001841,0.001462,0.000881,0.000572,0.000466,0.000623,0.001574
9.3e-05,0.000239,0.000229,0.000129,4.8e-05,2.4e-05,5e-05,0.000112,9.5e-05,0.000177,0.000217,0.000219,0.000294,2.6e-05,0.000117,6.2e-05,0.000147,0.000131,3.4e-05,0.000137,9.7e-05,3.3e-05,0.000117,0.000138,6.9e-05,0.000154,0.000236,0.00016,0.000136,1.7e-05,6.9e-05,0.000907,0.000705,0.000641,0.000362,0.002826,0.00386,0.002307,0.001297,0.000513,0.000131,0.00016,5.3e-05,0.000151,0.000104,4.3e-05,0.000159,0.000128,0.000233,0.000481,0.003463,0.003219,0.001368,0.001081,0.000254,0.000199,9.2e-05,0.000121,9.7e-05,8.8e-05,0.001192,0.002639,0.001638,0.001159,9.8e-05,0.000239,0.000274,0.000416,0.000515,0.000333,0.000341,0.000484,7e-04,0.000676,0.00116,0.003637,0.006016,0.003154,0.001828,0.000574,0.000462,0.000138,8e-05,6e-06,9e-06,0.00026,0.000321,9.1e-05,0.000128,6.6e-05,0.000156,0.000331,0.00437,0.00165,0.002146,0.001035,0.000133,0.000302,0.000303,3.9e-05,4e-05,0.0012,0.00069,0.000269,0.000107,0.000183,9e-05,8.2e-05,0.000245,0.000115,0.000539,0.000624,0.00063,0.000423,0.001083,0.001218,0.001193,0.00078,0.000485,0.000707,0.00144
2.9e-05,0.000228,0.000104,1.7e-05,3.7e-05,6.2e-05,4e-05,8.2e-05,3.3e-05,6.4e-05,5.5e-05,8.8e-05,0.000172,2.3e-05,7.3e-05,5.3e-05,0.000104,1e-04,3.2e-05,0.000107,2.2e-05,3.3e-05,5.1e-05,4.5e-05,7e-05,0.000163,2.4e-05,7.6e-05,6.4e-05,3.6e-05,6.3e-05,0.000941,0.000182,0.000273,0.000333,0.002578,0.002396,0.000857,0.000615,0.000143,5.9e-05,6e-05,2.1e-05,0.000132,6.6e-05,4.5e-05,0.000169,2.7e-05,0.000138,0.001131,0.00439,0.00081,0.000305,0.000236,0.000134,2.2e-05,0.000134,0.000107,3.8e-05,9.6e-05,0.001036,0.000585,0.000962,0.000456,0.000183,5e-05,0.000191,0.000317,0.000227,0.000201,0.000225,0.000103,0.000197,5.7e-05,0.000907,0.002279,0.002825,0.000811,0.000372,0.000123,0.000436,0.000179,9.5e-05,5.3e-05,3.3e-05,0.000288,0.000148,6.7e-05,3.8e-05,3.5e-05,0.000132,0.000195,0.002893,0.002328,0.001487,0.000586,6.9e-05,0.000241,7.6e-05,0.000143,5.2e-05,0.000954,0.000113,0.00011,0.00011,9.2e-05,7e-05,7.1e-05,6.5e-05,1.6e-05,0.000395,0.000158,0.000458,0.000301,0.000706,0.000409,0.000109,0.000182,0.000204,0.00036,0.000492
1.2e-05,0.000175,0.000112,6.7e-05,2.2e-05,2.5e-05,4.5e-05,6.1e-05,5.6e-05,6.3e-05,1.5e-05,8.7e-05,0.000146,5.7e-05,4.7e-05,5.2e-05,7.1e-05,4e-05,2.4e-05,7.6e-05,6.5e-05,3.7e-05,4.1e-05,1.3e-05,5.7e-05,0.00013,5.9e-05,6.1e-05,9.3e-05,1.8e-05,2.5e-05,0.000942,0.00073,0.00043,0.000208,0.002353,0.001213,0.000745,0.000514,0.000138,3.6e-05,4.4e-05,3.6e-05,7.7e-05,2.6e-05,2.7e-05,0.000126,0.000145,0.000244,0.000967,0.003017,0.001137,0.000786,0.000609,5.8e-05,0.000138,0.000147,0.000158,0.000106,0.000113,0.000986,0.000236,0.001019,0.000504,3.3e-05,6.8e-05,0.000187,0.000173,4.6e-05,5.8e-05,7.9e-05,0.000127,7.5e-05,0.000345,0.000773,0.001793,0.002263,0.000184,0.000372,0.000175,0.000267,2.8e-05,5e-05,3.8e-05,2.9e-05,0.000264,0.000233,0.000105,0.000101,0.000135,5.6e-05,0.000206,0.001907,0.001933,0.001776,0.000751,0.000179,0.000133,5e-05,9.1e-05,7.6e-05,0.000638,0.000377,0.000215,6.5e-05,3.3e-05,5e-05,7.6e-05,6e-05,5.2e-05,0.000295,0.000217,0.000174,0.000186,0.000473,0.000191,0.000243,0.000132,0.000246,0.000465,0.001
7.6e-05,8.4e-05,6.7e-05,3.3e-05,3.5e-05,4e-05,4.4e-05,6.2e-05,6.7e-05,0.000113,2.3e-05,0.000108,5.3e-05,9.4e-05,7e-05,6e-05,3.6e-05,8.2e-05,3.5e-05,2.2e-05,4.5e-05,2.9e-05,3.7e-05,7e-06,7.5e-05,0.000118,4.9e-05,6.5e-05,2.5e-05,5.6e-05,8.9e-05,0.000917,0.00081,0.001125,0.000556,0.002443,0.002694,0.001958,0.000702,0.000201,3.4e-05,5.8e-05,2.6e-05,1.6e-05,1.7e-05,4.9e-05,7.6e-05,7.2e-05,0.000119,0.000443,0.000588,0.002464,0.001479,0.000673,0.000124,0.000104,0.000169,6.4e-05,9.8e-05,4.2e-05,0.000899,0.000775,0.000704,0.000314,9.6e-05,8.7e-05,0.00026,0.000329,0.000155,0.000126,0.000168,0.000123,0.000294,0.000277,0.00096,0.004308,0.001344,0.001675,0.000534,7.5e-05,2.1e-05,0.000139,3.3e-05,2.3e-05,5.6e-05,0.000258,6.3e-05,0.00011,0.000122,7e-05,1e-04,0.000189,0.001515,0.001017,0.000778,0.000457,0.000224,5.8e-05,0.000175,9e-05,4.1e-05,0.000416,0.000265,0.000181,7.3e-05,5.2e-05,7.6e-05,5.1e-05,0.000143,0.000138,0.000447,0.000222,0.000148,0.000112,8.1e-05,0.000157,0.000361,0.000185,0.000153,0.000354,0.000842
2.9e-05,8.4e-05,6.7e-05,1.5e-05,6.8e-05,3.9e-05,4.7e-05,2.8e-05,1.7e-05,8e-05,9.8e-05,3.2e-05,8.8e-05,2.9e-05,3.5e-05,7.6e-05,5.6e-05,6.5e-05,4e-05,3.2e-05,3.6e-05,3.6e-05,8.6e-05,6e-05,3.4e-05,6.2e-05,4.2e-05,8.3e-05,4.7e-05,3.6e-05,7.4e-05,0.000629,0.000224,0.000518,0.00054,0.002338,0.001744,0.000124,0.000166,6e-05,3.9e-05,6.1e-05,4.2e-05,2.8e-05,9.5e-05,3.6e-05,7.4e-05,6.2e-05,4.6e-05,0.000992,0.002204,0.001353,0.001365,0.000652,0.000401,0.000197,7.8e-05,8.4e-05,6.9e-05,8e-05,0.000841,0.001342,0.00106,0.000696,0.000185,0.000125,0.000232,7.4e-05,8.5e-05,0.000156,0.000293,0.00034,0.000405,0.000522,0.000897,0.004302,0.001653,0.001258,0.000962,0.000294,0.000276,7.8e-05,7.8e-05,2.9e-05,7.3e-05,0.00021,0.000188,9.1e-05,0.000164,0.000141,8.9e-05,0.000157,0.001582,0.000454,0.000308,0.000174,1.6e-05,4.1e-05,0.000113,3.4e-05,3e-05,0.000336,8.7e-05,2.9e-05,6.2e-05,0.000104,9.1e-05,9.3e-05,0.000159,4.3e-05,0.000443,0.000276,0.00012,4.5e-05,0.000287,0.000248,0.000466,0.000535,0.000301,0.000516,0.000347
1.2e-05,0.00021,0.000225,0.000112,4.6e-05,3.4e-05,4.7e-05,4.5e-05,3.7e-05,0.000103,6e-05,9e-05,7.4e-05,4.3e-05,3.7e-05,5.1e-05,6.2e-05,4.6e-05,4.9e-05,4.8e-05,4.4e-05,4.9e-05,7.3e-05,5e-05,2.1e-05,4.7e-05,3.9e-05,1.7e-05,2.8e-05,5.8e-05,1.8e-05,0.000524,0.000604,0.000305,0.000195,0.001391,0.001214,0.000825,0.000472,0.000135,9.7e-05,8.9e-05,3.5e-05,7.3e-05,0.000106,9.3e-05,0.000134,9.3e-05,0.000179,0.00075,0.00252,0.002059,0.000781,0.000869,0.000321,0.000169,7.8e-05,0.000208,0.000126,0.000108,0.000791,0.001656,0.001502,0.00072,0.000122,0.000143,0.000197,0.000137,0.000104,0.000222,0.000187,0.000386,0.00021,0.000417,3e-04,0.002919,0.001507,0.002064,6e-04,0.000387,0.000418,0.000249,0.000115,6.9e-05,0.000104,0.000256,0.000192,9.2e-05,7.1e-05,0.000147,0.000122,0.000262,0.001127,0.001394,0.000266,0.000257,5.4e-05,1e-05,3.3e-05,0.000119,2.9e-05,0.000453,0.000172,0.00011,6.1e-05,8.8e-05,5.5e-05,0.000117,0.000142,3.1e-05,0.000592,0.000506,0.000321,0.000148,0.00026,0.000227,0.00013,0.000285,0.000211,0.000494,0.000155
6.9e-05,0.000321,8.4e-05,0.000126,7.3e-05,7.3e-05,4.3e-05,5.6e-05,3.6e-05,8.2e-05,4.3e-05,7.3e-05,0.000106,5.7e-05,5.3e-05,2.6e-05,6.1e-05,4.7e-05,1.9e-05,8.4e-05,9e-05,3.3e-05,6.9e-05,4.4e-05,0.000103,4.1e-05,8.1e-05,8.6e-05,4.4e-05,8.3e-05,3.1e-05,0.000569,0.00044,0.000134,0.000248,0.001021,0.001525,0.000849,0.000549,0.000324,0.000119,4.6e-05,9.5e-05,7.7e-05,5.2e-05,3.8e-05,4e-05,2.3e-05,0.000126,0.001784,0.00124,0.00059,0.000611,0.001416,0.000677,0.000175,0.000149,0.000331,9.5e-05,0.00015,0.000705,0.001199,0.000415,0.000335,0.000159,0.000197,0.000273,0.000341,0.000386,7.9e-05,0.000139,0.000514,0.00023,0.000651,0.000603,0.001201,0.000643,0.00153,0.001421,0.000898,0.000773,0.000516,0.000193,9.7e-05,0.000271,8.5e-05,0.000129,5.9e-05,2.1e-05,0.000149,9.6e-05,0.000224,0.000761,0.0015,0.001206,0.000575,1.6e-05,0.000125,5.9e-05,0.00013,0.00015,0.000551,0.000515,0.000189,0.000113,0.000198,0.000106,0.000126,9.2e-05,0.00019,0.000922,0.000485,0.000166,0.000296,0.000276,0.000376,0.00034,0.000171,0.000124,0.000446,0.000438
0.000155,0.000234,0.000167,0.000112,0.000122,4.9e-05,6.5e-05,6.6e-05,2.9e-05,3.4e-05,3.5e-05,6.5e-05,6e-05,6.9e-05,1.8e-05,6.1e-05,1.9e-05,4.4e-05,3.3e-05,0.000109,3.1e-05,5e-05,4.6e-05,6.1e-05,8.7e-05,0.000169,0.00018,4.5e-05,1.3e-05,0.00012,8e-05,0.000512,0.000411,0.000184,0.000212,0.00043,0.000847,0.000687,0.000329,6e-05,0.000123,8.7e-05,0.000117,0.000137,9.8e-05,4.7e-05,5.1e-05,4.9e-05,0.000124,0.003814,0.00167,0.000371,0.00125,0.002584,0.001619,0.000777,0.00021,0.000275,0.000462,0.000274,0.000593,0.000979,0.001209,0.000631,0.000323,9.5e-05,0.000192,0.000241,0.00037,0.000251,6.3e-05,0.000566,0.000332,0.000536,0.000202,0.002142,0.000554,0.001513,0.001173,0.000359,0.000707,0.000227,0.000157,7.9e-05,0.000201,0.000227,0.000222,9.9e-05,6.5e-05,9.4e-05,5e-05,7.6e-05,0.001829,0.002166,0.00155,0.000614,0.000141,0.000112,7.9e-05,0.000171,5.8e-05,0.000409,0.000522,0.00038,0.000222,0.000333,0.000415,0.00036,0.000374,0.000275,0.000983,0.000695,0.000455,0.000623,0.000233,0.000266,0.000324,0.000336,0.000408,0.000312,0.00016
0.000171,0.000378,0.000152,5.8e-05,5.7e-05,7.7e-05,8e-05,3.8e-05,4.1e-05,7.6e-05,6.8e-05,5.8e-05,8.4e-05,4e-05,4.7e-05,6.1e-05,6.9e-05,4.7e-05,7e-06,8.2e-05,5.5e-05,6.3e-05,3.8e-05,0.000135,0.000143,0.000132,0.00012,0.000122,0.000102,9.8e-05,8.7e-05,0.000382,0.000681,0.000565,0.000216,0.00059,0.000375,0.000947,0.000452,0.000107,0.000104,5.7e-05,7.4e-05,0.000115,7.3e-05,4.5e-05,0.000123,0.000158,0.00026,0.005019,0.006074,0.003677,0.0025,0.003174,0.000891,7.8e-05,0.000122,7.7e-05,0.000283,0.000256,0.000398,0.00141,0.000988,0.000261,0.000229,0.000243,0.00018,0.000332,0.000267,4e-05,0.000172,0.000765,0.000197,0.000785,0.000853,0.002185,0.001978,0.001649,0.000865,0.000364,0.000552,0.000374,0.000237,0.000145,0.00013,7.4e-05,4.3e-05,4.6e-05,7.9e-05,0.000119,3.6e-05,6.6e-05,0.002662,0.000266,0.000822,0.000381,0.000219,6.4e-05,4.2e-05,0.000109,2.5e-05,0.00028,0.000384,0.000121,0.000258,0.000253,0.000107,0.000224,0.000173,8.9e-05,0.000834,0.00026,0.000482,0.00063,0.001179,0.00028,5e-05,5e-06,0.000289,0.000125,0.000499
3.5e-05,0.000254,0.000221,5.2e-05,8.6e-05,0.000167,4.8e-05,2.5e-05,2.3e-05,8.7e-05,0.00015,7.8e-05,5.1e-05,5.3e-05,6.8e-05,8.3e-05,5e-05,4.5e-05,2e-06,6e-05,3.6e-05,7.6e-05,7.3e-05,0.000111,6.4e-05,8.1e-05,7.4e-05,2e-06,9.9e-05,6.9e-05,4.7e-05,0.000378,0.000625,0.000282,0.000466,0.0011,0.001825,0.000899,0.000551,0.000252,8.1e-05,0.000145,9.2e-05,4.8e-05,4.2e-05,4.2e-05,0.000139,7.2e-05,0.000178,0.005089,0.004029,0.002425,0.000692,0.000992,0.001283,0.000374,0.000209,0.000406,0.000158,0.000152,0.000349,0.001055,0.000517,0.000628,0.000502,0.000325,0.000428,0.000673,0.000449,0.000165,0.000371,0.000862,0.000862,0.001245,0.000808,0.002134,0.001119,0.000301,0.000343,5e-04,0.000198,0.000397,0.000177,0.000282,0.000248,0.000192,0.000177,0.000158,3.7e-05,0.000235,0.000174,0.000149,0.0028,0.002617,0.000925,0.000135,0.000229,0.000372,0.000331,0.000158,0.000185,0.000171,0.000294,0.000117,0.000312,0.000153,0.000268,2e-05,0.000356,2.4e-05,0.000696,0.000737,0.000844,0.000571,0.001468,0.000748,0.000428,5.2e-05,3.4e-05,0.000359,0.000503
0.000103,0.000338,0.000392,0.000396,0.000303,0.000202,0.00012,4e-05,4e-05,0.000124,0.000122,4.4e-05,5.9e-05,4.7e-05,3.1e-05,2.5e-05,3.5e-05,6.7e-05,4.1e-05,4e-05,2.2e-05,9.5e-05,0.000102,0.000154,0.000204,0.000206,0.000104,1.8e-05,6.5e-05,7.1e-05,5.5e-05,0.000535,0.000722,0.000325,0.000402,0.000918,0.001317,0.000694,0.000472,0.000111,4.7e-05,0.000207,0.000361,0.000377,2e-04,1e-04,0.00013,0.000225,0.000236,0.003646,0.000878,0.00123,0.001156,0.001242,0.000884,0.000544,0.000343,0.000457,0.000482,0.000193,0.000205,0.000572,0.00061,0.000527,0.000259,0.000467,0.000756,0.001155,9.2e-05,0.000445,0.000694,0.001311,0.000782,0.00037,0.000474,0.002348,0.002194,0.00091,0.000395,0.000258,0.000217,0.000369,0.00019,0.00031,0.000128,0.000123,0.000113,0.000185,0.000144,0.000191,0.000173,0.000285,0.002514,0.002989,0.001239,0.000149,0.000362,0.000458,1e-05,0.000129,0.000268,0.000274,0.000422,0.00029,0.000304,0.00013,0.000275,0.000387,0.000432,0.00045,0.000514,0.000607,0.00042,0.000708,0.000787,0.000798,0.000818,0.000505,0.000431,0.000548,0.000281
1.2e-05,0.000301,0.000148,5.9e-05,6.7e-05,0.000142,9.9e-05,0.000117,5.5e-05,0.000115,9.5e-05,9.5e-05,1.4e-05,8e-05,5e-06,3.7e-05,8.4e-05,8.8e-05,4.7e-05,5.4e-05,2.6e-05,7.8e-05,2.3e-05,5.8e-05,0.000222,3.5e-05,5.8e-05,6.4e-05,4e-05,3.8e-05,0.000102,0.000519,0.000575,0.000706,0.000355,0.001026,0.000634,0.000299,0.000196,0.000159,8e-05,0.000117,0.000233,9e-05,8.8e-05,8.6e-05,9.7e-05,0.000121,0.000164,0.001982,0.001121,0.001349,0.003151,0.003635,0.002105,0.000773,0.00024,0.000477,0.000138,0.000297,0.000302,0.001336,0.00072,0.000196,0.000492,0.000949,0.00081,0.000936,0.001412,0.000971,0.000932,0.000235,0.00037,0.000369,0.000829,0.002737,0.000488,0.00025,0.000194,0.000386,0.000258,0.000319,0.000145,0.000196,0.000227,8.1e-05,9.9e-05,0.000122,4.9e-05,0.000163,0.000173,0.000147,0.001745,0.000973,0.001217,0.00056,0.000135,0.000248,0.000437,0.000405,0.000514,0.000295,6.2e-05,0.000113,0.000305,0.000299,0.000347,0.000177,0.00053,0.000713,0.000498,0.000576,0.000613,0.000246,0.001319,0.001642,0.000603,0.000536,8.4e-05,0.000289,0.000529
2.7e-05,0.000103,6.5e-05,2.4e-05,2.5e-05,3.5e-05,3.4e-05,1.6e-05,2.5e-05,3.7e-05,2.2e-05,3.4e-05,5.3e-05,7.7e-05,6.4e-05,1.6e-05,3.2e-05,3e-06,2e-06,2.8e-05,1.7e-05,2e-05,4.3e-05,2.8e-05,8e-05,4.9e-05,3.9e-05,1.8e-05,4.2e-05,6.4e-05,6e-05,0.000314,7.2e-05,0.000245,0.00021,0.00058,0.000459,2.5e-05,5.8e-05,4.6e-05,5.6e-05,8.1e-05,2.2e-05,8.4e-05,7.2e-05,1.7e-05,2.6e-05,3.3e-05,5e-05,0.000375,0.001131,0.001367,0.001035,0.001247,0.000535,0.000183,7.5e-05,5.2e-05,0.000101,0.000181,0.000254,0.001031,0.000733,0.000323,0.000287,0.00024,0.000118,0.000357,0.000577,0.000266,0.000381,0.000397,0.000372,0.000276,0.000171,0.000966,0.000396,0.000205,0.00021,0.000134,0.000113,0.000101,3e-05,2e-05,7.8e-05,8.2e-05,5.1e-05,5.6e-05,3.8e-05,7.4e-05,5.5e-05,7.8e-05,0.000623,0.001034,0.00066,0.00029,0.000125,9e-05,0.000137,4.7e-05,0.000174,0.000218,9.9e-05,4.2e-05,7.3e-05,8.5e-05,1.8e-05,0.000114,0.000267,0.000121,0.000177,7.5e-05,0.000206,0.00057,0.000939,0.000655,0.000546,0.000345,0.000173,0.000161,0.000212
2.5e-05,5.3e-05,4.9e-05,3.6e-05,8e-06,1.8e-05,1.4e-05,1.8e-05,9e-06,5e-05,6.1e-05,5e-06,3.3e-05,2.7e-05,1e-06,1.1e-05,2e-06,1e-05,1e-05,2.6e-05,1.6e-05,2e-05,4.2e-05,4e-05,8e-06,3.4e-05,3.5e-05,2.4e-05,4.8e-05,0.000107,0.000108,0.000209,0.000116,0.000157,4.4e-05,0.000461,0.00033,7.1e-05,7.8e-05,1.2e-05,4.6e-05,6e-05,4e-05,7.3e-05,2e-05,4.5e-05,4.9e-05,4.1e-05,5e-05,0.000426,0.001214,0.000542,0.001611,0.000321,0.000248,0.000139,5.9e-05,7.1e-05,0.00013,3.5e-05,5.4e-05,0.000817,0.000746,0.000302,0.000126,8e-05,8.9e-05,0.000316,3.7e-05,0.000133,0.000214,0.000175,9e-05,0.000126,0.000192,0.000826,1.4e-05,0.000108,0.000211,5.7e-05,0.000132,3.9e-05,5.6e-05,4.5e-05,4.5e-05,2e-05,1.9e-05,4.1e-05,2.6e-05,3.9e-05,4.2e-05,1.9e-05,0.00056,0.000853,0.000402,0.000127,0.000104,0.000114,8.3e-05,8e-05,4.9e-05,0.000133,5e-05,7e-06,3.5e-05,1.4e-05,3.5e-05,2.3e-05,7.9e-05,9.1e-05,0.000236,5.9e-05,0.00017,0.000472,0.000314,6.2e-05,0.000192,0.000124,0.00013,0.000209,0.000102
1.6e-05,4.8e-05,2e-06,2.5e-05,8e-06,1.1e-05,2.1e-05,3e-06,5e-06,2.9e-05,3.8e-05,3.9e-05,1.8e-05,6e-06,1.1e-05,2.8e-05,1.9e-05,9e-06,4e-06,1.7e-05,7e-06,2.9e-05,5e-06,1.9e-05,1.1e-05,3.2e-05,1.1e-05,2e-05,6.3e-05,5.1e-05,3e-06,0.000207,4.5e-05,0.000104,3.3e-05,0.000345,0.000849,0.000416,0.000175,2.2e-05,2.8e-05,2.9e-05,3.1e-05,2.5e-05,6e-06,2.7e-05,1.6e-05,3.1e-05,3.1e-05,0.000367,0.000579,0.000256,0.000781,0.00031,0.000106,4.7e-05,5.6e-05,8.2e-05,8.4e-05,5.6e-05,4.6e-05,0.000551,9.9e-05,0.000117,5.8e-05,2.1e-05,7.8e-05,0.00016,8.8e-05,0.000105,0.000229,0.000124,8.7e-05,0.000106,0.000264,0.000598,0.000688,0.000383,5.2e-05,1.4e-05,7e-05,9e-06,3.4e-05,1.9e-05,1e-05,2.1e-05,3.1e-05,3.2e-05,4.1e-05,5.2e-05,1.9e-05,4.3e-05,0.000527,0.000252,0.000192,3.9e-05,7.2e-05,3.3e-05,3.9e-05,6.7e-05,6.2e-05,2.5e-05,1.9e-05,3.6e-05,3.2e-05,1.8e-05,4.6e-05,8.4e-05,8.5e-05,0.000167,0.000174,0.000138,9.2e-05,0.000172,0.00049,0.000377,0.000244,0.000102,3.6e-05,0.000129,3.9e-05
9e-06,3e-05,1.7e-05,2.5e-05,1.7e-05,1e-05,1.2e-05,1.2e-05,8e-06,1.3e-05,1.8e-05,1.5e-05,2.4e-05,1.3e-05,2.7e-05,1.5e-05,6e-06,8e-06,1e-05,9e-06,8e-06,1.9e-05,8e-06,1.5e-05,2.9e-05,2.9e-05,1.3e-05,1e-05,3.9e-05,4.1e-05,3.4e-05,0.000134,7.4e-05,5.5e-05,1.7e-05,0.000247,0.000865,0.000366,0.00014,3.5e-05,2e-05,5e-05,4.9e-05,2.5e-05,1.1e-05,8e-06,1e-05,2.6e-05,1.3e-05,0.000216,0.000217,0.000126,0.00037,0.000164,0.000151,7.8e-05,8e-06,8.7e-05,4.4e-05,4.6e-05,5.9e-05,0.000336,0.000207,0.000121,6.8e-05,8.4e-05,9.9e-05,0.00013,0.000155,3.4e-05,0.000134,5.9e-05,0.000101,7.6e-05,0.000164,0.000389,0.000766,0.000418,0.000115,3.1e-05,4e-05,5e-06,1e-05,2.6e-05,1.3e-05,5e-06,1.7e-05,1.9e-05,1.1e-05,2.3e-05,1.4e-05,5.1e-05,0.000381,0.00038,0.000119,1.4e-05,3e-05,1.8e-05,3.9e-05,1.3e-05,3e-05,3.7e-05,1.3e-05,2.1e-05,2.7e-05,1.4e-05,6.2e-05,6.4e-05,7.7e-05,8.8e-05,0.000191,0.000181,0.000114,5e-05,0.000344,0.000126,0.00015,3.9e-05,2.4e-05,0.000144,2.9e-05
1.8e-05,1e-05,1.7e-05,2.9e-05,4e-06,4e-06,9e-06,7e-06,1.2e-05,2e-05,1.8e-05,1.8e-05,1.1e-05,1.5e-05,2.7e-05,2.8e-05,2e-05,7e-06,3e-06,5e-06,5e-06,1.5e-05,5e-06,2e-06,2e-05,5e-06,1e-05,3e-06,2.8e-05,4.1e-05,1e-05,4.2e-05,9.5e-05,6e-06,3.7e-05,0.000232,0.000436,0.000219,7e-05,4.3e-05,2.5e-05,4.2e-05,2.5e-05,1.2e-05,2e-05,7e-06,3e-05,2.9e-05,5.9e-05,0.000175,0.000563,0.000356,0.000257,0.000342,0.000187,5.3e-05,1.6e-05,3.4e-05,5.4e-05,5.2e-05,4e-05,0.000176,8.6e-05,9.6e-05,5.5e-05,4.8e-05,6.8e-05,0.000149,5.7e-05,1.3e-05,0.000115,0.000151,2.7e-05,0.000112,0.000121,0.000188,0.000427,0.000187,6.1e-05,1.7e-05,6e-05,1.5e-05,5e-06,1.4e-05,2.8e-05,1.5e-05,2.6e-05,5e-06,5e-06,1.3e-05,3.7e-05,1.7e-05,0.000291,0.000339,0.000255,5.9e-05,3.4e-05,7.1e-05,3.4e-05,1.9e-05,3.5e-05,3.8e-05,1.3e-05,1e-05,1.6e-05,2.6e-05,5.1e-05,9.7e-05,6.7e-05,5.2e-05,9.5e-05,4.5e-05,7.6e-05,0.000111,0.000148,0.000138,0.000241,6.3e-05,1.7e-05,0.00015,5.9e-05
2.2e-05,2.1e-05,3.5e-05,1.5e-05,5e-06,8e-06,8e-06,4e-06,1.3e-05,1e-06,1.7e-05,2e-05,3.1e-05,2.5e-05,1.7e-05,1.4e-05,5e-06,8e-06,6e-06,8e-06,4e-06,1.1e-05,9e-06,7e-06,1e-05,1.3e-05,6e-06,1.5e-05,3.1e-05,2.6e-05,3.5e-05,9.2e-05,8.1e-05,8.8e-05,7.9e-05,0.000329,0.000141,7.3e-05,2.6e-05,3.1e-05,1e-05,8e-06,4.5e-05,5.1e-05,4.9e-05,3.6e-05,1.1e-05,1.4e-05,5.1e-05,0.000217,0.000438,0.00017,0.000237,0.000213,9.7e-05,5.8e-05,1.2e-05,6.7e-05,1.1e-05,2.9e-05,7.1e-05,0.00017,0.000106,6e-05,7.5e-05,8.3e-05,8.3e-05,0.000187,0.000117,5.8e-05,0.000144,3.3e-05,5e-05,7.7e-05,8e-05,0.000201,0.000216,5e-05,9.7e-05,4.9e-05,9.3e-05,3.3e-05,2e-05,1e-05,1.6e-05,1.5e-05,2.3e-05,9e-06,8e-06,2.3e-05,2.5e-05,1.6e-05,0.000264,0.000301,0.000126,0.00012,4.5e-05,7e-05,2.9e-05,2.3e-05,3.5e-05,7e-05,5.9e-05,2.1e-05,6e-06,8e-06,3.5e-05,4.3e-05,2.4e-05,2.3e-05,5.8e-05,8.1e-05,7e-05,1.5e-05,6.9e-05,2.9e-05,0.000112,1e-04,6.7e-05,0.000116,8e-05
7e-06,8e-06,8e-06,7e-06,8e-06,6e-06,3e-06,1e-05,1.4e-05,1.6e-05,3.3e-05,3e-05,2.1e-05,2e-06,2.2e-05,7e-06,1.8e-05,1.4e-05,1.1e-05,6e-06,4e-06,4e-06,1.3e-05,7e-06,1e-05,1e-05,1e-05,1.5e-05,2.2e-05,1.8e-05,1.9e-05,0.000131,6.4e-05,7.5e-05,2.1e-05,0.000286,0.000354,4e-05,2.4e-05,5e-06,1.6e-05,1e-05,8e-06,2.8e-05,1.9e-05,1.8e-05,5e-06,3e-06,1.9e-05,0.000236,5e-05,6.9e-05,0.000242,2.5e-05,0.000114,1.2e-05,1.8e-05,6.8e-05,4.5e-05,1.7e-05,5.9e-05,0.000215,0.000194,0.000105,7.2e-05,9.6e-05,3.4e-05,0.000107,5.1e-05,5.4e-05,0.00012,9.6e-05,1.1e-05,9e-06,4.6e-05,0.000178,0.000107,0.000123,5.7e-05,3.2e-05,7.8e-05,3.9e-05,1.6e-05,4e-06,1.8e-05,7e-06,2.3e-05,1.2e-05,3e-06,3.3e-05,1.7e-05,8e-06,0.000347,0.000229,0.00011,5.9e-05,6.3e-05,4e-05,4.9e-05,3e-05,2.3e-05,5e-05,2.1e-05,1.4e-05,1.3e-05,1.9e-05,5e-06,2.9e-05,4.2e-05,4.9e-05,2.3e-05,0.000111,0.000126,7.6e-05,0.000134,7.9e-05,0.000131,7.8e-05,3.9e-05,0.000125,0.000206
8e-06,2e-06,4e-06,1.7e-05,2.2e-05,5e-06,5e-06,8e-06,3e-06,1.2e-05,2e-05,1.7e-05,4.4e-05,2.6e-05,8e-06,2.4e-05,1.3e-05,1.1e-05,9e-06,6e-06,5e-06,1.7e-05,6e-06,6e-06,1.5e-05,1.1e-05,1.3e-05,2.5e-05,2.9e-05,2.8e-05,3.2e-05,0.000163,9.5e-05,3.3e-05,2.4e-05,0.000284,0.000374,0.000181,8.7e-05,1.9e-05,1.7e-05,3.4e-05,6e-06,3.5e-05,3.3e-05,2.8e-05,3.3e-05,1.6e-05,2.6e-05,0.000206,7.9e-05,7.5e-05,0.000163,0.000147,0.000125,8.1e-05,3.4e-05,7e-05,5.5e-05,1.6e-05,3.3e-05,0.000185,9e-05,7.2e-05,3.7e-05,0.000104,6.9e-05,6.1e-05,9.6e-05,1.5e-05,9e-05,6.1e-05,5.4e-05,4e-05,7.2e-05,0.000109,0.000204,7.2e-05,9.8e-05,8e-05,2.6e-05,5.7e-05,3.7e-05,1.2e-05,2.4e-05,1.9e-05,3.7e-05,3e-05,1.9e-05,5e-06,3.9e-05,1.6e-05,0.000367,0.000148,7.2e-05,3.6e-05,6e-05,7e-06,1.9e-05,3.2e-05,2.4e-05,5.9e-05,5.3e-05,1.4e-05,1.3e-05,1.5e-05,2.6e-05,1.9e-05,6.5e-05,4.4e-05,4.9e-05,0.000124,4.1e-05,0.000144,0.000104,8.9e-05,6.3e-05,1.2e-05,5.4e-05,0.000136,0.00022
1.2e-05,1.8e-05,1.4e-05,1.7e-05,2.2e-05,1.6e-05,2e-05,1.5e-05,2e-05,1.2e-05,1.8e-05,1.8e-05,1.7e-05,5e-06,1.4e-05,7e-06,6e-06,1.1e-05,3e-06,1.1e-05,1e-05,2.1e-05,8e-06,9e-06,2.3e-05,1.2e-05,1.3e-05,2e-05,1.3e-05,1.8e-05,1.5e-05,0.000152,4.3e-05,5.2e-05,1.2e-05,0.00021,7.2e-05,0.000161,0.000109,5.8e-05,3.5e-05,1.9e-05,2.6e-05,3.8e-05,4.5e-05,2.9e-05,2.7e-05,2e-05,2.5e-05,0.000109,0.000229,9.1e-05,4.4e-05,0.000146,0.000105,3.8e-05,3e-05,5.2e-05,4.7e-05,2.4e-05,1.9e-05,0.00018,0.000191,4.4e-05,3e-05,5.7e-05,3.7e-05,4e-05,3.6e-05,4.7e-05,0.000103,1.1e-05,6.5e-05,2.8e-05,9.7e-05,0.000378,0.000231,0.000119,9.5e-05,5.2e-05,7.6e-05,6.4e-05,1.8e-05,1.7e-05,1.5e-05,4e-06,1.9e-05,7e-06,9e-06,3.4e-05,3e-05,4.8e-05,0.000347,0.000354,0.000161,2.2e-05,7e-06,3.8e-05,2.8e-05,3.9e-05,4.2e-05,5.6e-05,5e-05,1.7e-05,1.8e-05,2.7e-05,7e-06,4e-05,0.000103,8e-05,4.8e-05,5.8e-05,4.2e-05,6.8e-05,0.000118,5.1e-05,4.3e-05,4.3e-05,1.9e-05,7.8e-05,5.1e-05
1.5e-05,1.5e-05,2.4e-05,1.7e-05,2.1e-05,7e-06,1e-05,6e-06,1.3e-05,1.5e-05,4.4e-05,1.9e-05,1.4e-05,1.2e-05,1.8e-05,1e-05,1.1e-05,1e-05,9e-06,2.1e-05,1.2e-05,9e-06,1.2e-05,1e-05,1.3e-05,1.1e-05,7e-06,1.2e-05,2.3e-05,3.1e-05,2.7e-05,0.000127,8.4e-05,1.7e-05,3.1e-05,0.000149,0.000306,0.000139,3.7e-05,2e-05,1.3e-05,3.3e-05,2.1e-05,1.6e-05,3.6e-05,1.4e-05,1.3e-05,9e-06,2.7e-05,7.8e-05,3.7e-05,7e-05,0.000141,6.3e-05,4.1e-05,1.3e-05,2.2e-05,2.7e-05,2.8e-05,1.6e-05,5.2e-05,0.00019,0.000162,6.6e-05,5.9e-05,2.9e-05,3.6e-05,4.7e-05,1.4e-05,1.7e-05,8.5e-05,9.2e-05,8.6e-05,7.4e-05,7.5e-05,0.000535,0.000158,0.000176,0.000108,3.3e-05,4.9e-05,2.3e-05,1.4e-05,1.3e-05,2.7e-05,4e-05,1.4e-05,2e-06,2.8e-05,3.3e-05,3.6e-05,2.9e-05,0.000315,0.000219,8.4e-05,3.1e-05,2.3e-05,4.3e-05,3.4e-05,1.2e-05,1.9e-05,0.000117,8.8e-05,5.5e-05,3e-06,8e-06,1.6e-05,5.4e-05,3.7e-05,5.3e-05,4.6e-05,8.8e-05,0.00014,4.9e-05,0.000133,8.4e-05,1.2e-05,1.6e-05,3.3e-05,0.000107,0.000164
1.3e-05,2.4e-05,1.7e-05,9e-06,1.5e-05,1.1e-05,3e-06,1.9e-05,1.6e-05,2.6e-05,3.8e-05,3.6e-05,1.5e-05,2.8e-05,2.6e-05,1.3e-05,2.1e-05,1e-05,5e-06,1.7e-05,1.3e-05,6e-06,1.1e-05,1.4e-05,1.9e-05,6e-06,1e-05,1.3e-05,4.1e-05,2.7e-05,1.5e-05,8.1e-05,1.6e-05,4.9e-05,3.7e-05,0.000156,0.000252,0.000102,7.7e-05,3.6e-05,1.4e-05,3.5e-05,4e-06,2.6e-05,1.4e-05,9e-06,1.5e-05,1.1e-05,2.3e-05,0.000154,0.000262,0.000152,0.000321,0.000247,0.000173,7.2e-05,3.6e-05,2.7e-05,1.9e-05,6e-06,4.5e-05,2.5e-05,3.5e-05,6.5e-05,3.3e-05,4.2e-05,2.4e-05,4.9e-05,6.4e-05,3.9e-05,7.7e-05,1.4e-05,1.3e-05,5.7e-05,8.4e-05,0.000401,0.000158,0.000147,0.000149,7.4e-05,3.4e-05,3.6e-05,1.6e-05,2.3e-05,1.2e-05,3.7e-05,3.2e-05,6e-06,4.4e-05,3.1e-05,2.9e-05,1.8e-05,0.000249,0.000168,6.6e-05,2.5e-05,5.6e-05,7.1e-05,2.2e-05,4.2e-05,9e-06,0.000131,2.6e-05,4e-06,2.7e-05,1.3e-05,2.1e-05,4.7e-05,4.5e-05,7e-05,9.2e-05,1.9e-05,8.9e-05,8.9e-05,7.4e-05,0.000101,8.2e-05,4e-05,9.2e-05,0.000152,0.000172
6e-06,6e-06,2.5e-05,1.3e-05,1.5e-05,1.9e-05,1.4e-05,2.1e-05,2.3e-05,1.7e-05,2.1e-05,3.4e-05,4.6e-05,1e-05,1.5e-05,2.6e-05,9e-06,7e-06,7e-06,1.9e-05,6e-06,1.7e-05,6e-06,1.5e-05,6e-06,6e-06,9e-06,6e-06,3.2e-05,3.4e-05,4.3e-05,6.7e-05,5.5e-05,6.7e-05,2.5e-05,0.000112,0.000118,3.7e-05,7e-06,1.1e-05,2.4e-05,1.6e-05,1.2e-05,3.3e-05,3.7e-05,2.3e-05,1.5e-05,1.3e-05,2.2e-05,0.000169,0.000126,6.2e-05,0.000311,0.000139,3.6e-05,9e-06,1.8e-05,3.7e-05,1.7e-05,3.9e-05,8.2e-05,0.000175,0.000122,1e-05,3.8e-05,2.8e-05,7e-05,3e-05,7e-05,2e-05,6.3e-05,0.000157,7.6e-05,9.4e-05,0.000158,0.000476,7.4e-05,0.000271,0.00011,3.9e-05,7.1e-05,1.2e-05,3e-06,2.4e-05,8e-06,2.5e-05,4.3e-05,5.8e-05,2e-05,1.6e-05,3.5e-05,3.4e-05,0.000136,9.6e-05,0.000123,0.000118,0.000107,9e-06,7.3e-05,6.5e-05,2.3e-05,0.000142,7.7e-05,3.8e-05,1.9e-05,1e-05,5.8e-05,6e-05,4.6e-05,4.7e-05,7.5e-05,8.9e-05,2e-05,3.7e-05,1.9e-05,1.7e-05,2.7e-05,6.4e-05,5.5e-05,8.4e-05,2.6e-05
2.1e-05,6e-06,1.4e-05,3.5e-05,3.6e-05,3.3e-05,1.6e-05,2.1e-05,2.1e-05,3.2e-05,1e-05,2.4e-05,4.8e-05,6.3e-05,3.4e-05,2.2e-05,2.8e-05,1.8e-05,1e-05,1.7e-05,1.1e-05,1.5e-05,9e-06,7e-06,1.3e-05,5e-06,2.1e-05,3.9e-05,2.3e-05,3.2e-05,1.8e-05,0.000103,7.4e-05,8.6e-05,0.000111,5.4e-05,0.000258,9e-05,5.8e-05,9e-06,2.2e-05,4e-06,2e-05,4.6e-05,2.4e-05,2.3e-05,1.2e-05,2.9e-05,9e-06,0.000216,0.000271,0.000136,0.00011,0.000151,7.8e-05,5.2e-05,9e-06,4.4e-05,2.2e-05,4.4e-05,6.5e-05,0.000179,7.5e-05,7.8e-05,1.3e-05,5.4e-05,7.7e-05,1.5e-05,1.2e-05,1.1e-05,5.5e-05,0.000155,0.00015,0.000178,0.000199,0.000502,0.000373,0.000337,0.000213,0.000116,9.2e-05,4.8e-05,1.2e-05,1.9e-05,2.7e-05,3.8e-05,3.3e-05,5.7e-05,5.9e-05,7.1e-05,3.9e-05,4e-06,9e-05,0.000122,3e-05,5.3e-05,3.8e-05,4e-05,0.000107,8.2e-05,4.6e-05,0.000117,9.7e-05,3.8e-05,2e-05,1.8e-05,7.3e-05,3.4e-05,4.7e-05,4.8e-05,9.8e-05,6.2e-05,4.8e-05,0.000158,0.000115,5.2e-05,2.3e-05,0.000121,9.6e-05,0.000122,0.00013
2.1e-05,2.7e-05,1.9e-05,4.5e-05,2.9e-05,2.4e-05,2.1e-05,7e-06,2.9e-05,3.5e-05,4.8e-05,3.7e-05,4e-05,4.3e-05,4.4e-05,3.2e-05,1.4e-05,1.2e-05,5e-06,8e-06,9e-06,1.3e-05,1.1e-05,8e-06,1.6e-05,8e-06,2.2e-05,4.1e-05,4.8e-05,3.7e-05,3.2e-05,7.4e-05,5.9e-05,0.000119,0.000103,0.000191,0.000261,0.000144,3.5e-05,1.5e-05,2.4e-05,1.9e-05,2.4e-05,3.7e-05,3e-06,1.8e-05,2.1e-05,3.3e-05,3.1e-05,0.000191,0.000215,7e-05,4.6e-05,0.000124,0.000173,8.8e-05,3.3e-05,2.4e-05,1.8e-05,1.4e-05,8.3e-05,3.6e-05,6.8e-05,6.8e-05,4.5e-05,1.7e-05,2.2e-05,4.9e-05,6.7e-05,4.3e-05,8.7e-05,3.8e-05,0.000115,1.3e-05,7e-06,0.000141,5.8e-05,0.00023,0.000116,3.6e-05,4.3e-05,2.3e-05,2.7e-05,3e-05,1.9e-05,2.1e-05,3.7e-05,3e-05,8e-06,3.3e-05,1.2e-05,1e-05,5.7e-05,7.6e-05,8.9e-05,5.6e-05,2.7e-05,3e-05,7e-05,2.9e-05,1.4e-05,0.000123,5.1e-05,3.6e-05,1.2e-05,2.3e-05,3.8e-05,2.5e-05,1.5e-05,3.8e-05,0.000106,0.000135,8.3e-05,0.000134,0.000323,0.000274,0.000146,3.8e-05,4.1e-05,0.000169,3.5e-05
2e-05,2.4e-05,1.9e-05,2.5e-05,5e-06,1.2e-05,1e-05,1.6e-05,1.2e-05,1.1e-05,2.4e-05,3e-05,3.5e-05,1.2e-05,1.2e-05,1.1e-05,1.6e-05,1.5e-05,8e-06,7e-06,5e-06,1.2e-05,1.4e-05,8e-06,1.3e-05,8e-06,1.6e-05,3e-05,4.1e-05,3.7e-05,1.4e-05,8.1e-05,9.5e-05,8.7e-05,1.4e-05,9.8e-05,8.6e-05,6.6e-05,2.1e-05,2.3e-05,3.3e-05,2.7e-05,3.5e-05,2.6e-05,1.7e-05,8e-06,1.4e-05,3.3e-05,2.7e-05,0.00013,8.5e-05,0.000138,0.000197,8.8e-05,0.000182,6.7e-05,4.1e-05,1.2e-05,1.3e-05,3e-06,7.8e-05,0.000117,0.000147,3.8e-05,1.9e-05,1.9e-05,2.5e-05,4.8e-05,4.8e-05,4.5e-05,4.7e-05,6.4e-05,6.1e-05,3.8e-05,9.4e-05,0.000237,0.000241,0.00017,1e-04,5e-05,4.5e-05,2.3e-05,2.4e-05,2.8e-05,9e-06,6e-06,3.8e-05,1.4e-05,1e-05,1.6e-05,1.2e-05,2.5e-05,4.2e-05,0.000215,4.7e-05,2.7e-05,9e-06,5.7e-05,8e-06,3e-05,2.7e-05,0.000118,0.000105,7e-05,2.7e-05,1.4e-05,2.4e-05,1.5e-05,3.9e-05,4.8e-05,4.4e-05,6.6e-05,2.5e-05,0.000131,0.000174,2e-05,4.5e-05,2.2e-05,4e-05,0.000169,0.000196
3e-06,1.9e-05,2.4e-05,7e-06,8e-06,7e-06,1.7e-05,1.8e-05,1.6e-05,7e-06,1.8e-05,4e-06,1.5e-05,9e-06,4e-06,1.3e-05,5e-06,1.4e-05,4e-06,3e-06,3e-06,3e-06,6e-06,2e-06,2e-06,8e-06,1.8e-05,2.8e-05,3.1e-05,3e-05,9e-06,8.1e-05,8.7e-05,5.5e-05,4.7e-05,0.000116,5.6e-05,0.000102,6.6e-05,6e-06,3.2e-05,3e-05,1.7e-05,3.9e-05,2.3e-05,1.9e-05,4e-06,1e-05,4.8e-05,0.000121,9.9e-05,0.000192,6.4e-05,6.1e-05,4.6e-05,4.2e-05,2e-06,3.3e-05,2.4e-05,1.4e-05,9e-05,0.000114,0.00013,4.2e-05,1.9e-05,1.9e-05,2.9e-05,2.1e-05,3.8e-05,2.8e-05,2.6e-05,6.3e-05,2.3e-05,4.9e-05,9e-05,0.000268,4.8e-05,0.000105,6.7e-05,5.3e-05,9.2e-05,7.2e-05,2.5e-05,1.4e-05,2.1e-05,3.8e-05,4.3e-05,2.8e-05,1.4e-05,1e-05,1.4e-05,1.9e-05,2.5e-05,0.000296,0.000204,6.9e-05,2.6e-05,3.5e-05,3.4e-05,1e-06,1.3e-05,8.3e-05,0.000156,6.4e-05,1.2e-05,2.6e-05,1.5e-05,2.3e-05,4.3e-05,7.6e-05,8.5e-05,7.7e-05,6.5e-05,6.7e-05,2.1e-05,5.2e-05,5.5e-05,2.8e-05,4.9e-05,7.1e-05,0.00017
1.2e-05,9e-06,1.9e-05,3e-05,3e-06,4e-06,7e-06,4e-06,3e-06,5e-06,5e-06,5e-06,1.5e-05,1.4e-05,1.2e-05,2e-06,6e-06,7e-06,5e-06,4e-06,3e-06,4e-06,5e-06,2e-06,5e-06,3e-06,8e-06,3e-06,2.6e-05,6e-06,1.1e-05,8.3e-05,3.2e-05,2.7e-05,5e-06,0.00013,5.1e-05,7.8e-05,3.7e-05,2e-05,3e-06,1.5e-05,1.1e-05,1.9e-05,4e-06,5e-06,5e-06,8e-06,4.8e-05,5.6e-05,4.5e-05,0.000116,0.00021,4.1e-05,2.6e-05,9e-06,1.1e-05,3.2e-05,1.1e-05,1.6e-05,8.9e-05,7.9e-05,2.4e-05,4.7e-05,3.2e-05,6e-06,7e-06,2e-05,2.1e-05,2.4e-05,2.8e-05,4e-05,4e-05,2.3e-05,5.8e-05,0.000358,0.00011,5.7e-05,5.7e-05,6.6e-05,3.8e-05,4.9e-05,2.8e-05,1.6e-05,1.1e-05,2.5e-05,1.7e-05,4e-06,5e-06,1.5e-05,1.4e-05,4e-06,4.5e-05,0.000222,1e-04,4.1e-05,3e-05,2.1e-05,2e-05,1.6e-05,5e-06,6.7e-05,9.3e-05,5.6e-05,2.8e-05,2.2e-05,9e-06,2.8e-05,4.2e-05,3.7e-05,3.5e-05,3e-05,3.4e-05,7.3e-05,6.4e-05,6.6e-05,6.8e-05,2.4e-05,2e-05,7.1e-05,0.000113
9e-06,1.3e-05,7e-06,1.3e-05,7e-06,1e-06,1e-06,5e-06,4e-06,3e-06,2e-06,2e-06,1.6e-05,1e-05,9e-06,3e-06,6e-06,2e-06,0,1e-06,1e-06,3e-06,5e-06,3e-06,6e-06,4e-06,3e-06,4e-06,1.9e-05,6e-06,5e-06,8.2e-05,1.6e-05,4e-06,1.2e-05,0.000117,0.000135,4.4e-05,8e-06,5e-06,1e-05,6e-06,5e-06,1.1e-05,7e-06,2e-06,3e-06,9e-06,2.4e-05,5.7e-05,0.000106,0.000153,7.7e-05,6e-05,1.5e-05,2.7e-05,1e-05,1.1e-05,4e-06,1.6e-05,9.4e-05,7.8e-05,6.8e-05,4.3e-05,8e-06,6e-06,2.4e-05,2.1e-05,2.9e-05,1.7e-05,3.3e-05,4e-05,3.4e-05,2.6e-05,4.3e-05,0.000388,0.000108,4.8e-05,3.1e-05,1.9e-05,4.3e-05,2e-05,1.5e-05,1.1e-05,7e-06,1.7e-05,1.2e-05,6e-06,4e-06,1e-05,7e-06,0,5.8e-05,9.6e-05,4.3e-05,1.2e-05,1.3e-05,1e-05,6e-06,7e-06,5e-06,5.3e-05,2.3e-05,1.4e-05,2.8e-05,4e-06,5e-06,1.5e-05,1.6e-05,4e-05,3.8e-05,2e-05,2.9e-05,4.9e-05,0.000104,1e-05,5.3e-05,1e-05,2.7e-05,5.9e-05,4.2e-05
7e-06,1e-05,3e-06,1.2e-05,4e-06,0,2e-06,2e-06,2e-06,1e-06,3e-06,2e-06,1.7e-05,1.2e-05,9e-06,4e-06,5e-06,3e-06,2e-06,1e-06,2e-06,4e-06,3e-06,2e-06,6e-06,2e-06,1e-06,4e-06,1.6e-05,4e-06,5e-06,7.6e-05,1.3e-05,5e-06,2e-06,9.8e-05,0.000125,5e-05,3.1e-05,6e-06,6e-06,1.2e-05,4e-06,1.5e-05,4e-06,0,2e-06,5e-06,2.2e-05,6.7e-05,0.000106,6e-06,8.7e-05,4.7e-05,3e-05,1.6e-05,2e-06,1.1e-05,8e-06,1.1e-05,9.1e-05,4.6e-05,4.9e-05,1.9e-05,6e-06,5e-06,1.8e-05,2e-05,1.9e-05,1.9e-05,2.9e-05,3.4e-05,3.4e-05,2e-05,2.4e-05,0.000295,0.000143,4.5e-05,1e-05,4e-06,2.5e-05,6e-06,7e-06,7e-06,6e-06,1.9e-05,1.1e-05,2e-06,3e-06,1.3e-05,4e-06,6e-06,5.5e-05,1.1e-05,2.1e-05,8e-06,1.2e-05,1.1e-05,4e-06,2e-06,3e-06,4e-05,7e-06,9e-06,1.1e-05,5e-06,8e-06,9e-06,9e-06,2.7e-05,3.7e-05,1.9e-05,7e-06,5e-05,9.3e-05,3.6e-05,4.4e-05,1e-05,2e-05,5.9e-05,6e-06
8e-06,1.1e-05,3e-06,1.2e-05,3e-06,1e-06,2e-06,3e-06,1e-06,0,3e-06,2e-06,1.6e-05,1e-05,7e-06,3e-06,3e-06,4e-06,1e-06,2e-06,1e-06,5e-06,4e-06,1e-06,5e-06,2e-06,2e-06,2e-06,1.6e-05,0,5e-06,7.3e-05,1.2e-05,6e-06,5e-06,8.9e-05,4.3e-05,2.6e-05,1.7e-05,5e-06,3e-06,6e-06,5e-06,1.1e-05,5e-06,4e-06,2e-06,2e-06,1.9e-05,6.8e-05,7e-06,2.9e-05,0.000114,6e-05,2.9e-05,1.4e-05,6e-06,1.3e-05,8e-06,1e-05,8.5e-05,1.9e-05,2.9e-05,1.4e-05,5e-06,1e-06,2e-05,2.3e-05,2.6e-05,1.6e-05,2.5e-05,3.3e-05,3.3e-05,1.2e-05,3.4e-05,0.000211,7.4e-05,2e-05,1.2e-05,1e-05,2.8e-05,1.2e-05,3e-06,5e-06,5e-06,1.7e-05,1.3e-05,2e-06,2e-06,1.2e-05,1e-06,6e-06,4e-05,3.8e-05,1.2e-05,9e-06,8e-06,7e-06,1e-06,3e-06,4e-06,3.2e-05,6e-06,7e-06,7e-06,3e-06,6e-06,1e-05,1e-05,2.8e-05,2.9e-05,2.4e-05,5e-06,4.6e-05,7.1e-05,2.9e-05,4.7e-05,9e-06,1.4e-05,5.7e-05,1e-06
