5e-06,1.6e-05,1.4e-05,3.2e-05,4e-06,6e-05,3.7e-05,2e-05,0.000124,1e-06,2.1e-05,3.3e-05,3e-06,9e-06,9e-06,0,1.9e-05,1e-05,3e-06,1e-05,6e-06,3e-06,2.1e-05,1.4e-05,5e-06,0.000114,3.1e-05,6e-06,5e-05,1.6e-05,0.00049,0.000245,4.5e-05,7.8e-05,6.9e-05,5.8e-05,7.5e-05,6.3e-05,5.1e-05,3e-05,0.000167,0.000129,0.00018,8.1e-05,9.9e-05,0.000166,2e-06,9.5e-05,1.2e-05,7e-06,0.000121,0.00021,0.000165,0.000668,0.000165,0.000245,0.000689,0.000114,0.000185,4.5e-05,0.000137,3.6e-05,0.000601,0.000902,0.000253,0.000121,4.1e-05,0.000522,0.000117,0.000343,0.000863,4.9e-05,0.000432,0.000813,0.00056,0.000414,0.000105,0.000418,0.00051,0.000405,0.000667,0.000359,0.000322,2.1e-05,0.000508,0.000626,0.000149,0.001129,0.000408,0.000132,2e-05,1e-05,0.000372,1.2e-05,0.000657,0.000139,4.6e-05,0.000344,4.2e-05,0.000338,0.001419,0.000145,0.001126,0.000781,0.00124,0.000968,0.000591,0.000192,0.00031,0.000164,0.000636,0.000181,0.001839,0.001332,0.001002,0.00072,0.000944,0.000468,0.000643,0.000574,0.00036
3.5e-05,6.1e-05,1e-05,5.9e-05,3.9e-05,0.00012,7.6e-05,5.8e-05,0.000226,1.9e-05,1.5e-05,7.2e-05,2.3e-05,4.4e-05,2.3e-05,4.8e-05,5.1e-05,1.9e-05,1e-05,1e-05,2e-06,3.2e-05,6.9e-05,2.7e-05,2.1e-05,0.00024,0.000138,0.000174,0.00015,0.000173,0.001075,0.000789,0.000591,0.000398,0.000394,0.000139,0.000148,0.000152,7.1e-05,6.1e-05,0.000368,0.000386,0.000277,0.000235,0.000277,0.000356,0.000219,0.000278,0.00023,0.00033,0.000393,0.000704,0.000833,0.001086,0.001039,0.000935,0.001407,0.000555,0.001407,0.001375,0.001339,0.001902,0.001785,0.003259,0.002208,0.000388,0.000317,0.000724,0.001323,0.001675,0.003041,0.002144,0.002397,0.002185,0.000933,0.001161,0.001823,0.000836,0.000301,0.001134,0.000832,0.001476,0.000378,0.000859,0.001313,0.001505,0.001258,0.00284,0.002134,0.000907,0.000592,0.000467,0.00119,0.00033,0.001709,0.000492,8.2e-05,0.001329,0.000297,0.001067,0.002265,0.001886,0.003182,0.003941,0.002313,0.002444,0.001552,0.000846,0.002054,0.000776,0.001419,0.002647,0.003086,0.00535,0.005825,0.003159,0.003311,0.00116,0.000896,0.000516,0.001544
1.3e-05,5.2e-05,1.4e-05,6.5e-05,5.8e-05,9e-05,0.000116,7.8e-05,0.000212,5.3e-05,2.7e-05,7.6e-05,4.1e-05,4.3e-05,1.4e-05,5.9e-05,5e-06,2.3e-05,2.4e-05,2e-05,2e-05,6.8e-05,4.8e-05,4.7e-05,3.8e-05,0.000319,4.9e-05,9.3e-05,9e-05,0.000136,0.000986,1.4e-05,0.000291,0.000109,0.00021,7.8e-05,0.000187,0.000103,0.00015,0.000137,0.000365,0.00027,0.000462,0.000368,0.000127,0.000645,0.000662,0.000324,0.000183,0.000496,0.000248,0.000434,0.000434,0.001735,0.002057,0.001924,0.001808,0.001434,0.002838,0.001945,0.002235,0.000515,0.000843,0.001634,0.00104,0.000566,0.000582,0.000823,0.001829,0.002622,0.001453,0.001095,0.002833,0.002242,0.001039,0.000761,0.002105,0.001627,0.000372,0.000724,0.001494,0.001058,0.001546,0.00137,0.002804,0.003082,0.003857,0.000244,0.002463,0.002176,0.001643,0.001543,0.001639,0.001039,0.002771,0.001896,0.001469,0.002225,0.001308,0.001186,0.003455,0.003581,0.001035,0.001901,0.00257,0.001831,0.002592,0.001259,0.00295,0.001375,0.00185,0.001564,0.001295,0.002789,0.002619,0.003734,0.001705,0.002172,0.001612,0.001914,0.001183
5.1e-05,3.7e-05,7.6e-05,1.7e-05,8.2e-05,0.000153,0.00014,0.000177,0.000209,4.2e-05,7.8e-05,0.000118,7.9e-05,4.6e-05,5e-05,4.2e-05,4.5e-05,5.4e-05,5.5e-05,2.7e-05,2.3e-05,4.7e-05,4.9e-05,4.9e-05,7.9e-05,0.000463,9.8e-05,7.7e-05,7.9e-05,0.000167,0.000654,0.001534,0.00046,8.2e-05,0.000104,3.9e-05,0.000257,0.000113,0.000139,0.000383,0.000178,0.000523,0.000478,0.000228,0.000101,0.000342,0.000298,0.000885,0.000535,0.000675,0.000286,0.000285,0.001119,0.00102,0.000154,0.002519,0.003654,0.003365,0.001663,0.001085,0.002793,0.002666,0.001025,0.0011,0.003298,0.001461,0.000932,0.001398,0.00159,0.003684,0.003019,0.002181,0.001332,0.000977,0.000233,0.001195,0.001238,0.00041,0.000556,0.002136,0.002313,0.001586,0.002568,0.000593,0.002398,0.00344,0.001371,0.003105,0.003686,0.001775,0.002225,0.001483,0.001243,0.000718,0.002605,0.001391,0.001999,0.001495,0.001834,0.001189,0.002185,0.002535,0.003642,0.003327,0.001532,0.002651,0.00425,0.001938,0.004272,0.00538,0.003119,0.002299,0.001441,0.000876,0.0045,0.001188,0.001722,0.001186,0.001566,0.002902,0.003463
4.4e-05,4.9e-05,7.2e-05,7.4e-05,5.9e-05,0.000117,0.000111,0.000166,0.000332,5e-05,1.4e-05,0.000114,3.8e-05,2.8e-05,4.5e-05,2.7e-05,3.6e-05,1.5e-05,9e-06,8e-06,1.2e-05,2e-05,4.7e-05,7e-06,4.9e-05,0.000451,0.000101,7.1e-05,6.6e-05,0.00016,0.000867,0.001068,0.001117,0.000659,0.000431,0.000211,0.000278,0.000272,0.000107,0.000324,0.000587,0.000737,0.000541,0.000639,0.000393,0.000419,0.000283,0.000638,0.000103,0.000681,0.000983,0.000598,0.001569,0.001229,0.001781,0.002357,0.000432,0.001313,0.000994,0.001092,0.001595,0.000755,0.002533,0.001631,0.001932,0.001069,0.001101,0.001012,0.000909,0.001929,0.001435,0.00134,0.000247,0.002128,0.001189,0.00133,0.001014,0.001893,0.001329,0.002577,0.002593,0.002203,0.000991,0.002756,0.000692,0.001926,0.003007,0.001372,0.002145,0.001663,0.00057,0.000841,0.000808,0.000489,0.0021,0.001727,0.001126,0.000476,0.001084,0.000177,0.002914,0.00261,0.001858,0.000678,0.003031,0.004737,0.001901,0.001521,0.003725,0.004001,0.002607,0.001034,0.000774,0.001989,0.004151,0.00447,0.003497,0.002103,0.001265,0.002782,0.003168
5.3e-05,4.4e-05,7.9e-05,4.8e-05,7.7e-05,0.000162,0.000116,0.00022,0.000311,0.000103,1e-04,9.6e-05,7.3e-05,7.7e-05,9e-06,1.9e-05,1.9e-05,1.8e-05,3e-06,1.5e-05,5e-05,5.8e-05,1e-04,5.6e-05,4.5e-05,0.000584,0.000206,4.4e-05,8.5e-05,0.000293,0.001592,0.000343,0.000536,0.000244,0.00049,0.000129,0.000106,0.00033,0.00022,6.4e-05,0.000446,0.000763,0.000507,0.000976,0.000425,0.000477,0.000682,0.000472,0.00076,0.000472,0.000636,0.000296,0.00109,0.001211,0.002562,0.001374,0.000503,0.000819,0.00177,0.00274,0.001395,0.000491,0.002916,0.001894,0.001699,0.001485,0.001422,0.00152,0.002034,0.001324,0.001795,0.001023,0.000575,0.001063,0.001335,0.00166,0.001962,5e-04,0.000594,0.002932,0.000922,0.000581,0.001567,0.001566,0.002187,0.003665,0.001245,0.001487,0.001313,0.002144,0.001875,0.00167,0.000513,0.000237,0.001782,0.001373,0.000924,0.001461,0.001282,0.000546,0.002561,0.00252,0.00228,0.00176,0.002222,0.000888,0.000465,0.00142,0.001417,0.001424,6e-04,0.001976,0.001637,0.001938,0.002683,0.003217,0.001777,0.002064,0.002592,0.004839,0.000793
2.8e-05,9.9e-05,0.00012,5.3e-05,9.3e-05,0.000287,0.000238,0.000406,0.000444,6e-05,0.000127,0.000104,5.6e-05,9.1e-05,4.2e-05,2.7e-05,5e-06,1.1e-05,3e-05,1e-05,0.000105,5.5e-05,0.00013,6.9e-05,5.6e-05,0.000834,0.000209,0.000293,0.000126,0.000157,0.001608,0.000622,0.000354,9.5e-05,0.000336,0.000245,0.000278,0.000332,0.00029,0.000623,0.000198,0.000623,0.000876,0.00029,0.000137,0.000725,0.000569,0.000753,0.000898,0.000956,0.000361,0.00133,0.000595,0.000996,0.001097,0.000928,0.000416,0.001159,0.002045,0.000978,0.000353,0.001742,0.002918,0.001387,0.003729,0.001803,0.001052,0.001519,0.00023,0.001529,0.001631,0.002482,0.002123,0.001037,0.000488,0.001345,0.001308,0.0018,0.001368,0.001681,0.001813,0.000713,0.000402,0.001818,0.001662,0.002728,0.00047,0.000948,0.001241,0.001068,0.001722,0.002511,0.00215,0.000681,0.001089,0.000865,0.001226,0.001502,0.00023,0.000117,0.001641,0.002579,0.001412,0.000749,0.000854,0.001547,0.001361,0.00223,0.002772,0.00057,0.001205,0.001751,0.000504,0.000466,0.001267,0.001549,0.000834,0.001481,0.00213,0.002145,0.001636
5.8e-05,0.000177,0.00021,0.000149,0.000232,0.000382,0.00037,0.000547,0.00112,0.000561,0.000361,0.000294,0.000118,0.000195,9.9e-05,5.3e-05,2.8e-05,2.6e-05,6.8e-05,2.4e-05,0.000161,9.5e-05,0.000198,8.5e-05,0.000254,0.001013,0.000824,0.000657,0.000314,0.000495,0.001557,0.000698,3e-04,0.000466,0.000269,0.000316,0.000258,5.6e-05,0.000341,0.000846,0.000237,0.000552,0.000429,0.00161,0.001242,0.001105,0.000216,0.001454,0.00059,0.000666,0.000623,0.002605,0.002849,0.003073,0.001808,0.001703,0.001651,0.001336,0.000316,0.000711,0.001507,0.004314,0.002158,0.000646,0.006271,0.003115,0.001359,0.002136,0.00214,0.001043,0.002614,0.003374,0.000904,0.004407,0.00256,0.000971,0.002127,0.002392,0.003923,0.002744,0.003146,0.00154,0.001167,0.001116,0.001005,0.002662,0.003804,0.002205,0.001446,0.000758,0.002855,0.000991,0.001292,0.001615,0.000739,0.001012,0.001915,0.000823,0.001996,0.001414,0.001658,0.004454,0.003427,0.003757,0.001933,0.002599,0.00034,0.001178,0.002053,0.002276,0.002121,0.002369,0.002284,0.002034,0.004329,0.002772,0.002167,0.001488,0.001471,0.003608,0.002654
0.000212,0.000155,0.000174,0.000388,0.000139,0.000575,0.001069,0.001318,0.001188,0.001679,0.000743,0.000324,0.000617,0.000324,0.000177,3.2e-05,2.8e-05,1.5e-05,0.000106,8e-05,0.000208,0.000159,0.000197,0.000277,0.000488,0.001171,0.00103,0.00045,0.000305,0.001049,0.002566,0.001878,0.000654,0.000499,0.000649,0.000905,0.000861,0.000318,0.000567,0.001265,0.001146,0.000427,0.000262,0.00187,0.001782,0.001139,0.001479,0.00086,0.001414,0.000934,0.000941,0.002739,0.001872,0.001358,0.001492,0.000612,0.000731,0.000678,0.000839,0.000451,0.001123,0.003751,0.002526,0.00239,0.005994,0.005048,0.002826,0.002078,0.004124,0.00374,0.001578,0.002365,0.00219,0.004457,0.004297,0.0037,0.003777,0.006242,0.008753,0.007893,0.005853,0.004015,0.002994,0.001917,0.001911,0.002319,0.002222,0.001349,0.001027,0.000787,0.002633,0.003828,0.004545,0.004776,0.003194,0.002564,0.003173,0.00387,0.004289,0.002533,0.002356,0.005311,0.004148,0.002991,0.001505,0.000682,0.000525,0.000562,0.001762,0.003222,0.003433,0.003207,0.002177,0.001604,0.002898,0.003082,0.002598,0.001344,0.00121,0.002768,0.001953
7.1e-05,0.000178,0.000584,0.000655,0.00071,0.000917,0.000839,0.000738,0.000478,0.001415,0.000828,0.000272,0.000642,0.000442,0.000184,7.8e-05,2.5e-05,2.3e-05,0.000106,9.2e-05,0.000182,0.000139,6.6e-05,0.000112,0.00043,0.0015,0.001275,0.000683,0.00022,0.001039,0.001988,0.00279,0.001961,0.000935,0.000364,0.000621,0.000167,0.000378,0.000744,0.000463,0.000888,0.000649,0.000621,0.001267,6.1e-05,0.00049,0.000485,0.000799,0.001712,0.00123,0.000474,0.001747,0.001112,0.000788,0.000418,0.001196,0.001014,0.001644,0.001623,0.001898,0.000473,0.003055,0.000744,0.001359,0.005848,0.002826,0.000594,0.002046,0.001913,0.00196,0.001272,0.002227,0.001112,0.00225,0.001193,0.001039,0.001299,0.003035,0.003639,0.00148,0.001873,0.001687,0.001562,0.001893,0.003901,0.002651,0.003633,0.003413,0.003305,0.003198,0.004203,0.003418,0.00331,0.001674,0.001984,0.001099,0.000529,0.001781,0.001532,0.001085,0.00125,0.003001,0.003513,0.0014,0.001836,0.001503,0.000868,0.001221,0.000591,0.001563,0.001207,0.00144,0.002212,0.002301,0.001602,0.0024,0.001499,0.000349,0.000983,0.003145,0.001991
0.000103,0.000217,0.000654,0.000244,0.000397,0.000344,0.000588,0.000346,0.000806,0.001001,0.000489,0.000612,7.2e-05,4.3e-05,3.9e-05,4.3e-05,1.5e-05,3e-05,3.6e-05,2.8e-05,0.000129,6.6e-05,5.3e-05,5.4e-05,0.00013,0.001134,0.001024,0.000558,0.000301,0.000575,0.001736,0.001633,0.000264,0.000156,0.000111,0.000283,0.000156,0.000545,0.000223,0.000543,5.9e-05,0.000138,0.000652,0.000207,0.000232,0.000199,0.000447,0.001233,0.001052,0.000504,0.000657,0.000679,0.000905,0.000268,0.000191,0.001509,0.001178,0.001529,0.00044,0.001034,0.001568,0.002721,0.002253,0.001142,0.003356,0.001799,0.001268,0.000344,0.001266,0.001408,0.00203,0.000146,0.001749,0.001397,0.001493,0.001444,0.001238,0.001338,0.000888,0.001632,0.001493,0.000833,0.001794,0.001579,0.00285,0.001617,0.002727,0.002665,0.001327,0.000892,0.001267,0.000542,0.002141,0.001374,0.001328,0.000824,0.001343,0.00187,0.00077,0.000885,0.001,0.001325,0.001758,0.00148,0.00204,0.00054,5e-04,0.00075,0.002034,0.002085,0.001238,0.001238,0.000475,0.000973,0.001594,0.001424,0.001633,0.001705,0.001578,0.000968,0.000462
9e-06,0.000124,0.00036,8.2e-05,0.000181,1.5e-05,0.000322,0.000543,0.00048,0.000302,6e-05,0.000266,0.000245,0.000152,4.9e-05,1.5e-05,6e-06,3.2e-05,2.9e-05,3.9e-05,3.4e-05,1.2e-05,7.3e-05,0.000116,0.000142,0.000768,9.1e-05,0.000211,7.1e-05,0.000362,0.001497,0.000793,0.000392,7.4e-05,8.6e-05,0.000214,9.6e-05,0.000308,0.000183,0.000317,0.000163,4.2e-05,0.000471,3e-05,0.000206,0.000299,0.000713,0.000507,0.000179,0.000264,0.000371,0.00038,0.000763,0.000234,0.00022,0.000881,0.001147,0.000226,0.001022,0.000164,0.000884,0.001086,0.00098,0.000727,0.000526,0.000362,0.000649,0.000549,0.00119,0.001374,0.000374,0.000476,0.001881,0.000675,0.000393,0.000412,0.000495,0.001829,0.001046,0.000774,0.000508,0.000567,0.00053,0.002064,0.000721,0.000576,0.001718,0.000187,0.000812,0.001094,0.000865,0.001041,0.000859,0.000861,0.000853,0.00106,0.000768,6.9e-05,0.000328,0.00044,0.001255,0.000652,0.001067,0.000698,0.00082,0.002166,0.000351,0.000666,0.002181,0.000821,0.001005,0.001061,0.000164,0.000428,0.001168,0.001045,0.001816,0.000894,0.000753,0.000783,0.000898
3.2e-05,0.000108,0.000205,0.000157,0.000165,4.7e-05,2e-04,0.000478,0.000311,0.000236,0.00018,9.9e-05,2.9e-05,6e-06,1.8e-05,2.3e-05,2.2e-05,9e-06,1.4e-05,2.5e-05,5.4e-05,1.3e-05,7.5e-05,7.5e-05,0.000163,0.000472,0.000254,6.1e-05,0.000121,0.000304,0.000895,0.000452,0.000267,0.00013,0.000112,0.000267,6.4e-05,0.000105,0.000105,8.8e-05,8e-05,0.000129,0.000442,0.000179,0.000246,0.000337,0.000333,0.000191,0.000317,0.000466,0.000208,0.000148,0.00054,0.000159,0.000244,0.000453,0.000278,0.000273,0.000439,0.000566,0.000648,0.001156,0.000206,0.000391,0.000218,0.000716,0.000524,0.000592,0.00073,0.00058,0.001051,0.000593,0.00046,0.000798,0.000262,0.000601,0.000453,0.00147,0.000749,0.000145,0.000352,9.3e-05,0.000242,0.001495,0.001193,0.000507,0.000821,0.000428,0.000571,0.001227,0.000972,0.000235,0.000517,0.001127,0.00129,0.000927,0.000628,0.000283,0.000669,0.000541,0.000586,5.4e-05,0.000984,0.000846,0.000953,0.001835,0.001397,0.000639,0.000888,0.000973,0.000921,0.00082,0.000569,0.000117,0.001151,0.000544,0.001583,0.001246,0.000586,0.000704,0.001143
4e-05,4.3e-05,0.000291,0.000288,9.1e-05,0.000164,0.000152,0.000291,0.000206,0.000209,0.000113,8.5e-05,0.000193,0.000109,6.7e-05,2.6e-05,1.2e-05,2.2e-05,1.7e-05,2.6e-05,6.9e-05,5e-05,8.4e-05,6.1e-05,0.000159,0.000154,0.000198,0.000143,0.000139,0.000342,0.001286,0.001332,0.000556,0.000194,0.000171,7.9e-05,0.000164,0.000105,8.9e-05,5.3e-05,0.000119,5e-05,0.000315,5e-05,0.000117,0.000235,0.000379,0.000161,0.000167,0.000246,0.000306,0.000309,0.00035,0.000133,0.000122,0.00041,0.000456,0.000371,0.00019,0.000315,0.000688,0.001099,0.000149,0.000343,0.000269,0.000651,0.000697,0.000554,0.000327,0.000209,0.000838,0.000698,0.000961,0.000957,0.000446,0.000554,0.000684,0.000597,0.000464,0.001047,0.000132,0.000168,0.000407,0.000762,0.000195,2e-04,0.000171,0.001053,0.000653,0.001249,0.000425,0.000364,0.00064,0.000282,0.000864,0.00137,0.000581,3.7e-05,0.000864,0.000593,0.000714,0.000891,0.001351,0.001386,0.001674,0.000693,0.001279,0.002214,0.00244,0.001475,0.001362,0.00163,0.000822,0.001289,0.001923,0.000579,0.000483,0.000722,0.000273,0.000622,0.000534
6.3e-05,5.5e-05,0.000395,0.000275,0.000389,0.000365,0.000159,0.000117,7.7e-05,9e-05,0.000157,4e-05,0.000186,8.7e-05,2.6e-05,1.4e-05,5e-06,2.4e-05,1.2e-05,5e-06,5.9e-05,2.1e-05,2.9e-05,4.9e-05,0.000113,6.1e-05,0.000166,0.000172,2.9e-05,0.000238,0.0019,0.001948,0.000777,0.00015,0.000141,0.000117,3.6e-05,0.000207,0.000141,8.7e-05,0.000189,0.000225,0.000177,0.000227,0.000421,0.000165,0.000185,0.000193,0.000286,0.000572,8.2e-05,0.000395,0.000222,0.00013,6.4e-05,0.000299,0.000476,0.000716,0.000573,0.000355,0.001041,0.000651,0.000703,0.000759,0.000278,0.001075,4.5e-05,0.000886,0.000442,0.000207,0.000652,0.000325,0.001227,0.001145,0.000415,0.001033,0.000209,0.000849,0.001016,0.001272,0.000492,0.000237,0.000452,0.000606,0.000212,0.000463,0.000645,0.001006,0.000469,0.001082,0.000256,0.000935,0.000615,0.000718,0.000446,0.000305,0.001101,0.000902,0.000316,0.000476,0.000573,0.001278,0.000669,0.001102,0.000796,0.000581,0.000955,0.000621,0.00146,0.000806,0.000213,0.000539,0.00074,0.001296,0.000218,0.000869,0.00047,0.000173,0.000403,0.000339,0.000217
4.4e-05,6.5e-05,0.00031,0.000284,0.000241,0.000172,0.000129,2.9e-05,0.000209,0.000292,0.000435,0.000218,0.000217,7.7e-05,1.9e-05,6e-06,9e-06,3.3e-05,1.5e-05,1.5e-05,6.3e-05,3.6e-05,9.5e-05,4.1e-05,0.000252,8.3e-05,0.000125,0.000183,7e-05,0.00022,0.002167,0.001184,0.000664,0.000242,0.000108,9.6e-05,0.00014,0.000268,2.9e-05,0.000101,0.000199,6.2e-05,0.000278,0.000201,0.00024,0.000268,0.000167,7.1e-05,2e-05,0.000701,0.000319,0.000613,0.000156,0.000414,0.000188,0.000542,0.000186,0.000504,0.000695,0.000785,0.000597,0.000539,0.000286,0.000164,0.000229,0.001181,0.000989,0.000891,0.000729,0.000387,0.000245,0.000512,0.00189,0.001484,0.000523,0.000694,0.000598,0.000494,0.001227,0.000943,0.000354,0.000241,0.000881,0.000765,0.000587,0.000358,0.000467,0.000622,0.001038,0.00112,0.000486,0.001385,0.000782,0.000911,0.00027,0.000256,0.000832,0.000351,0.000577,0.000792,0.000959,0.000925,0.000858,0.001598,0.000935,0.000917,7e-04,0.00031,0.000872,0.001749,0.001258,0.001332,0.000869,0.000922,0.000295,0.001079,0.001148,0.000342,0.000573,0.000578,0.001309
1.7e-05,7.2e-05,0.000165,9.5e-05,3.6e-05,0.000126,0.000104,0.000414,0.000142,0.000255,0.000282,0.000243,5e-05,7.6e-05,6.3e-05,2.6e-05,1.1e-05,3.6e-05,9e-06,1.7e-05,6e-05,8.8e-05,0.000105,0.000231,0.000542,0.00037,0.000417,0.000332,0.000207,0.000147,0.002025,0.00083,0.000402,4.3e-05,9.2e-05,0.000149,0.000307,0.00023,0.000141,0.000263,3.4e-05,5.9e-05,0.00042,0.000377,8.8e-05,0.00014,0.000222,0.000233,0.000697,0.000981,0.000864,0.001069,0.000361,0.000279,0.000144,0.000703,0.00025,0.000339,0.000555,0.001279,0.000614,0.001261,0.000751,0.000972,0.000698,0.000813,0.000106,0.000263,0.001832,0.000853,0.000608,0.000601,0.002025,0.000544,0.001871,0.001865,0.000899,0.000806,0.001737,0.001923,0.001571,0.001173,0.002099,0.000458,0.000797,0.00067,0.000686,0.000593,0.001317,0.001842,0.001858,0.000199,0.000835,0.000577,0.000156,0.000851,0.001323,0.000742,0.000845,0.000508,0.000628,0.000108,0.001772,0.002098,0.000189,0.00064,0.000578,0.000392,0.000817,0.001573,0.000727,0.002078,0.000874,0.000344,0.001684,0.000794,0.001006,0.000873,0.000769,0.001652,0.002209
6.6e-05,0.000105,0.00011,0.000119,0.000203,0.00027,0.000267,0.000686,0.000434,8e-05,0.000392,0.000275,9.6e-05,9.6e-05,5.2e-05,1.6e-05,6e-06,1.9e-05,4.3e-05,3.8e-05,7.5e-05,0.000119,0.000207,0.000234,0.000566,0.000534,0.000113,7.3e-05,0.000247,0.000449,0.001846,0.000851,0.00042,0.000208,0.00011,0.000331,0.000586,0.00072,0.000504,0.000689,0.000511,0.000119,0.000526,0.000578,0.000796,0.000358,0.000522,0.000586,0.001861,0.001357,0.001745,0.000844,0.001655,0.001617,0.000359,0.00155,0.000688,0.000696,0.001934,0.001479,0.002561,0.002929,0.002975,0.002472,0.000901,0.001355,0.001441,0.001254,0.002478,0.002416,0.002249,0.000679,0.002671,0.00404,0.004058,0.001126,0.002704,0.001493,0.001505,0.000491,0.002313,0.001419,0.001846,0.001792,0.000362,0.00051,0.000457,0.00161,0.000634,0.000522,0.002639,0.001717,0.00032,0.000845,0.001448,0.000802,0.001626,0.002421,0.001977,0.000511,0.000786,0.001298,0.002526,0.001025,0.001806,0.001739,0.00143,0.000637,0.002393,0.000643,0.000443,0.002551,0.002185,0.001354,0.001968,0.002093,0.001176,0.000695,0.000135,0.00131,0.003071
7.8e-05,9.6e-05,0.000257,0.000237,0.00023,0.000287,0.000373,0.00047,0.000198,0.000318,0.000256,0.000286,0.000241,3.4e-05,1.6e-05,1.6e-05,1.2e-05,3e-06,4.2e-05,1e-06,3.2e-05,6.9e-05,5.7e-05,8.9e-05,0.000304,7e-05,0.000176,0.000148,0.000175,0.000253,0.001492,0.001324,0.000627,0.000476,0.000473,0.00034,0.000177,0.000464,0.000365,0.000791,0.000333,0.000348,0.00061,0.000106,0.000671,0.000923,0.000896,0.000705,0.002378,0.002596,0.000791,0.001003,0.001873,0.000525,0.001616,0.003034,0.002531,0.001411,0.001944,0.003993,0.003555,0.002466,0.002851,0.001126,0.001082,0.002449,0.002047,0.003266,0.004044,0.002464,0.002252,0.001636,0.001305,0.003534,0.00279,0.003281,0.00416,0.002557,0.001099,0.001909,0.002579,0.002108,0.002642,0.003317,0.002713,0.002812,0.001429,0.001797,0.002425,0.003182,0.00462,0.003623,0.002253,0.00014,0.001236,0.001449,0.000914,0.001996,0.002264,0.002037,0.00203,0.001225,0.001522,0.001997,0.002536,0.001016,0.000944,0.001275,0.003542,0.002645,0.000437,0.001254,0.001597,0.000549,0.001587,0.001753,0.000683,0.000232,0.000124,0.00101,8e-04
6.5e-05,0.000197,0.000158,0.000111,5.7e-05,0.000192,0.000688,0.000872,0.000645,0.000406,0.000356,0.000415,0.000102,6.2e-05,6.2e-05,2.4e-05,2e-05,5e-06,2.6e-05,3.5e-05,2.2e-05,3.6e-05,7e-05,7.7e-05,8.6e-05,4.1e-05,0.000239,1e-04,0.000153,0.000232,0.001146,0.001127,0.00048,0.000344,0.000195,0.000216,0.00026,0.000199,0.000131,0.000614,0.000519,0.000344,0.000297,0.000247,0.000536,0.000508,0.000274,0.001091,0.000773,0.000813,0.001026,0.001632,0.00077,0.001605,0.001269,0.000906,0.000874,0.000652,0.001389,0.002374,0.000599,0.001407,0.000759,0.000991,0.001631,0.001569,0.001145,0.002471,0.001461,0.000307,0.001303,0.000626,0.001564,0.001038,0.00114,0.001126,0.001025,0.000314,0.00082,0.000456,0.001181,0.000928,0.00056,0.001543,0.000349,0.001439,0.00113,0.000179,0.001462,0.001494,0.001787,0.000519,0.000145,0.000566,0.00084,5e-06,0.000834,0.000721,0.000789,0.000675,0.00092,0.000242,0.000762,0.00098,0.001371,0.000781,0.001283,0.000731,0.002102,0.000883,0.001087,0.001135,0.001056,0.000434,0.001537,0.00053,0.00075,4e-04,0.000122,0.000426,0.000448
0.000163,0.000193,0.00035,0.000318,0.000284,0.000177,0.000447,0.000236,0.00024,0.000369,0.000134,0.000246,0.00019,3.6e-05,2.6e-05,1.8e-05,2.1e-05,1.5e-05,9e-06,1.6e-05,1.4e-05,1.3e-05,4.4e-05,4.9e-05,4.8e-05,0.000152,3e-05,5.6e-05,9.7e-05,0.000147,0.000994,0.00062,0.000379,0.000265,0.000164,0.000119,0.000247,0.000271,0.000179,0.000239,0.000373,0.000254,0.000224,0.000231,0.00022,0.000404,0.000172,0.000675,0.000318,0.000571,6e-04,0.000642,0.000115,0.000764,0.000554,0.000304,0.000268,0.000241,0.000243,0.00123,0.000822,0.000473,0.000586,0.000403,0.000923,0.000139,0.000897,0.000729,0.001039,0.000389,0.00076,0.000702,0.001319,0.000604,0.00039,0.000205,0.000203,0.000573,6.4e-05,0.000548,5.1e-05,0.000851,0.000789,0.000602,6.3e-05,0.000993,0.000345,0.000176,0.000788,0.001376,0.00105,0.000159,0.000464,0.000701,0.000739,0.000613,0.000472,0.000163,0.000257,0.000251,0.001047,0.000193,0.000361,0.000684,0.000145,0.00081,0.000363,0.000428,0.000941,0.000895,0.000323,0.000984,0.000335,0.000317,0.000978,0.000186,0.000398,0.00017,0.000217,0.000371,0.000653
9.5e-05,4.3e-05,0.000177,0.00022,7.5e-05,0.000101,0.00024,0.000243,8.9e-05,9.5e-05,0.000199,0.000135,0.00013,5.2e-05,2.5e-05,9e-06,1.3e-05,7e-06,8e-06,7e-06,1.5e-05,2.2e-05,3.8e-05,6.5e-05,5.8e-05,0.000126,8.6e-05,3.1e-05,1.7e-05,0.000157,0.000939,0.000401,1.9e-05,8.7e-05,0.000146,7e-05,0.000154,0.000179,6.4e-05,0.000134,9.8e-05,0.000127,9.8e-05,0.000254,4.2e-05,0.000198,0.000276,0.000204,0.000335,0.000334,0.000591,0.00031,0.000275,0.000424,0.000647,0.000682,0.000403,0.000205,0.000439,0.000891,0.000392,0.000437,0.000262,0.000404,0.000599,9.4e-05,0.000736,0.000293,0.000586,0.000402,7.7e-05,0.000213,0.000863,0.000199,0.00036,0.000628,0.000537,0.000556,0.000274,0.000771,0.000665,0.000438,0.000318,0.000898,0.000313,0.000386,0.000244,0.000686,0.000437,0.000552,0.00083,0.000313,0.000722,0.000408,0.000275,0.000352,0.000442,5.7e-05,0.000348,0.000131,0.000338,0.000444,0.00046,0.000469,0.000303,0.000663,0.000523,0.000374,4.6e-05,0.000347,7e-04,0.000462,0.000278,0.000457,0.000622,0.000125,0.000356,0.000182,0.000314,0.000335,0.000335
6.5e-05,5.7e-05,6.4e-05,2.2e-05,4e-06,4.5e-05,7.8e-05,4.5e-05,5.4e-05,4.6e-05,9.3e-05,3.4e-05,6.7e-05,3.6e-05,1.3e-05,4e-06,2e-06,4e-06,4e-06,3e-06,2e-06,1.2e-05,2.1e-05,1.4e-05,2.8e-05,5.7e-05,4.5e-05,2.6e-05,1.9e-05,5.2e-05,0.00037,8.3e-05,6.7e-05,5e-05,2.8e-05,9e-06,3.9e-05,4.8e-05,3.4e-05,6e-05,5.9e-05,3.7e-05,2.8e-05,6.5e-05,6.5e-05,3.1e-05,8.4e-05,0.000224,5.7e-05,0.000128,0.000233,0.000139,0.000194,0.00011,0.000248,0.000236,3.4e-05,3e-05,0.000178,0.000257,0.000156,0.000169,0.000309,0.000146,3.1e-05,0.000113,0.000123,1e-05,0.000211,0.000225,0.000156,0.000253,0.000288,0.000209,9.6e-05,0.00027,4.3e-05,0.000247,0.000135,0.000243,6.4e-05,0.00011,0.000193,0.000364,7.7e-05,0.000234,9.9e-05,0.00024,0.000159,0.00014,0.000356,7e-05,0.000256,0.000114,4.9e-05,0.000161,0.000156,0.000211,3.1e-05,9.7e-05,0.000264,0.000101,0.00023,0.000171,8.3e-05,8.3e-05,4e-05,0.000219,0.000101,0.00011,0.000266,0.000189,3.8e-05,5.9e-05,0.000268,8.1e-05,0.000163,8.1e-05,2.5e-05,0.000114,0.000135
1.8e-05,1e-05,3.2e-05,3.5e-05,3.6e-05,3.1e-05,0.000103,9.1e-05,8e-05,8e-05,8.2e-05,5.6e-05,3.7e-05,2e-05,9e-06,3e-06,2e-06,1e-06,1e-06,4e-06,5e-06,1e-06,8e-06,3.1e-05,3.7e-05,3.5e-05,5.5e-05,3.2e-05,1.3e-05,5.9e-05,0.000286,0.000121,7.9e-05,4.8e-05,4e-05,2.3e-05,4.3e-05,3.5e-05,2.6e-05,1.4e-05,4.1e-05,6e-06,4.5e-05,3.7e-05,4.3e-05,8e-06,6.7e-05,0.000194,0.000166,4.1e-05,0.000179,6.8e-05,0.000109,0.000139,0.000229,0.000167,0.000141,6.1e-05,9.9e-05,0.000181,5.7e-05,0.000176,7.4e-05,6.3e-05,2e-04,0.000143,0.000196,6.6e-05,0.000206,0.000127,0.000177,6.9e-05,0.000165,0.000177,0.000176,0.000169,3.8e-05,0.000277,4.9e-05,0.000186,0.000141,0.000119,0.000106,0.00032,0.000163,9.6e-05,0.000112,0.000267,0.000164,4.8e-05,0.000195,0.000145,0.000167,0.000109,6.3e-05,9.2e-05,8.5e-05,0.000167,0.000123,6.6e-05,0.00028,7.2e-05,0.00016,0.000121,7.9e-05,0.000112,0.000108,0.000213,0.000108,0.00012,0.000176,7.1e-05,1.3e-05,5.5e-05,0.000223,0.000133,0.000173,5.4e-05,4.5e-05,0.000127,0.000119
9e-06,1e-05,1.3e-05,2.4e-05,1.4e-05,5.5e-05,2.5e-05,2.7e-05,3.9e-05,2.5e-05,0.000109,1.5e-05,1.6e-05,5e-06,8e-06,6e-06,3e-06,2e-06,5e-06,4e-06,1e-05,2e-06,4e-06,2.9e-05,4.6e-05,1.7e-05,3.2e-05,6e-06,2.1e-05,4.7e-05,0.000208,9.3e-05,2.8e-05,1.6e-05,3.2e-05,1.1e-05,2.9e-05,1.9e-05,1.9e-05,1.5e-05,3.6e-05,1e-05,3.1e-05,4.1e-05,2.7e-05,2.4e-05,2.7e-05,0.000162,0.000101,3.2e-05,0.00015,0.000119,6.8e-05,8.6e-05,0.000208,0.000102,5.2e-05,5.2e-05,8.9e-05,0.000186,1.7e-05,5.8e-05,9.1e-05,3.9e-05,2e-04,8.9e-05,0.000171,2.2e-05,0.00019,1e-04,0.000107,9.6e-05,0.000128,7e-05,0.000122,8.8e-05,9.2e-05,0.000285,6.4e-05,9.3e-05,0.000147,9.1e-05,0.000129,0.000226,7.8e-05,0.000144,9.4e-05,8.1e-05,0.000146,0.00014,0.000194,9e-05,0.000158,5.4e-05,3e-05,9e-06,4.8e-05,0.000118,3.5e-05,1.6e-05,0.000206,6e-05,0.000118,0.000104,7e-05,5.1e-05,0.000106,8.9e-05,0.000139,3.2e-05,9.8e-05,7.3e-05,6.6e-05,7.7e-05,0.000288,4.7e-05,6e-05,6.1e-05,2.4e-05,0.000112,9.8e-05
2e-05,1.1e-05,2e-05,1.4e-05,3.1e-05,6.5e-05,2.7e-05,4.5e-05,3.3e-05,3.2e-05,8.9e-05,4.6e-05,2.6e-05,2.2e-05,1.8e-05,1.2e-05,8e-06,3e-06,3e-06,4e-06,7e-06,5e-06,8e-06,2.2e-05,2.7e-05,1.5e-05,1.9e-05,1e-05,1.1e-05,1.9e-05,9.8e-05,8.8e-05,4.7e-05,2.7e-05,3.5e-05,1.7e-05,3e-05,2.5e-05,1.9e-05,1.2e-05,4.2e-05,1.1e-05,2.6e-05,4.8e-05,1.1e-05,1.7e-05,3.1e-05,0.000123,9.9e-05,5.7e-05,0.000126,5.9e-05,6.5e-05,8.7e-05,0.000181,6.1e-05,4.4e-05,2.3e-05,0.000101,0.000168,9.4e-05,8.6e-05,0.000162,8.5e-05,0.000125,8.4e-05,0.000131,1.9e-05,0.000203,7.3e-05,0.000116,0.000126,0.000147,0.000123,7.6e-05,3e-05,7.4e-05,0.000235,6.9e-05,0.000119,0.000126,1e-04,0.000114,0.000227,6.1e-05,0.000104,2.8e-05,1e-04,0.000119,0.000128,0.000207,2.4e-05,0.000175,0.000109,4.3e-05,3.8e-05,4.4e-05,7.6e-05,8.3e-05,5.5e-05,0.000235,5.8e-05,0.000103,2.9e-05,0.000112,0.000119,6.6e-05,0.000151,0.000113,4.6e-05,0.000136,6.4e-05,4.5e-05,0.000104,0.000291,7.6e-05,6.8e-05,1.9e-05,7.9e-05,9e-05,7.6e-05
1.9e-05,2.3e-05,4e-06,2.9e-05,1.5e-05,4.1e-05,1.6e-05,4.6e-05,3.4e-05,8e-06,9e-05,2.1e-05,1e-05,1e-05,1.1e-05,9e-06,4e-06,4e-06,2e-06,4e-06,7e-06,6e-06,6e-06,1.8e-05,1.8e-05,1.5e-05,1.2e-05,1.9e-05,2e-05,2e-06,7.5e-05,9.3e-05,6.6e-05,2.6e-05,2.7e-05,2.6e-05,1.3e-05,2.9e-05,2e-06,2.3e-05,2.7e-05,4e-06,2.5e-05,4.6e-05,1.9e-05,2.5e-05,4.6e-05,0.000101,0.000101,6.2e-05,7.2e-05,7.6e-05,7.6e-05,6.8e-05,0.000166,6.1e-05,4.6e-05,1.1e-05,8.1e-05,0.000188,8.9e-05,0.000105,0.000168,5.9e-05,8e-05,6.6e-05,9.4e-05,5.2e-05,0.000218,7.6e-05,9.7e-05,1e-04,0.000134,0.000142,9.5e-05,5.9e-05,0.000124,0.000203,0.000104,0.000116,0.000148,7.2e-05,4e-05,0.000233,6.6e-05,8.4e-05,2.7e-05,7.9e-05,0.000102,4.7e-05,0.000157,7.9e-05,0.000146,0.000116,1.8e-05,4.6e-05,6.3e-05,0.000103,7.2e-05,3.4e-05,0.000204,2.5e-05,7.4e-05,6.1e-05,9.7e-05,5.3e-05,3.1e-05,0.000129,8e-05,8e-05,0.000132,7.2e-05,8.6e-05,5.6e-05,0.000232,7.2e-05,7.8e-05,4.5e-05,3.6e-05,7.6e-05,0.000117
1.7e-05,1.4e-05,1.3e-05,1.4e-05,2.1e-05,4.4e-05,2.4e-05,6.4e-05,2e-05,3.4e-05,5.9e-05,1.8e-05,1.7e-05,1e-05,7e-06,4e-06,7e-06,5e-06,3e-06,1e-06,1.4e-05,4e-06,7e-06,2.7e-05,3.8e-05,4e-05,8e-06,2.2e-05,1.6e-05,9e-06,0.000133,6.6e-05,6.1e-05,3.2e-05,1.6e-05,2.3e-05,2.9e-05,2.8e-05,1e-05,2.9e-05,3.9e-05,2e-05,1.2e-05,4.5e-05,3.9e-05,3.6e-05,2.9e-05,0.000101,7e-05,1.4e-05,8.3e-05,9.2e-05,8e-05,6.9e-05,9.8e-05,7.3e-05,1.3e-05,1.7e-05,9e-05,0.000164,6.6e-05,9.8e-05,0.000127,9e-05,0.000166,3.5e-05,0.000107,5.8e-05,0.000144,6.1e-05,0.000135,0.000117,0.000142,2.5e-05,0.000182,5e-05,8.5e-05,0.000184,9.3e-05,8.8e-05,9.8e-05,1e-04,0.000103,0.000203,1.1e-05,6.1e-05,6.9e-05,6.8e-05,0.00012,2.6e-05,0.000122,8.2e-05,0.000136,7e-05,4.5e-05,1.3e-05,2.5e-05,8.1e-05,2.6e-05,6.3e-05,0.000213,3.2e-05,5.6e-05,2.2e-05,8e-06,3.2e-05,5.4e-05,0.000163,0.000101,4.1e-05,0.000137,0.000107,7.1e-05,3.5e-05,0.000307,5.8e-05,6.3e-05,6.1e-05,7.1e-05,6.4e-05,6.7e-05
2.2e-05,2.1e-05,2e-05,5e-06,1.4e-05,4.2e-05,1.9e-05,9.1e-05,6e-06,6.3e-05,5e-05,5.1e-05,2.6e-05,1.1e-05,9e-06,4e-06,4e-06,2e-06,3e-06,3e-06,1.7e-05,9e-06,1.3e-05,1.5e-05,1.8e-05,3e-05,3.7e-05,3.7e-05,5.5e-05,9e-06,0.000149,0.000103,1.8e-05,1.4e-05,3.8e-05,1.2e-05,2e-05,3.7e-05,1.3e-05,2.6e-05,1e-05,2e-06,1.7e-05,3.5e-05,2.4e-05,1.6e-05,4.4e-05,0.00013,7.7e-05,4.1e-05,8.1e-05,6.6e-05,6.2e-05,7.2e-05,0.000171,1.4e-05,1.7e-05,7e-06,1e-04,0.000181,9.4e-05,4.8e-05,0.000163,8.9e-05,0.000116,7.1e-05,7.7e-05,1.9e-05,0.00014,8.3e-05,0.000179,9.1e-05,0.000157,0.000107,0.000128,0.000119,0.000107,0.000237,5.5e-05,5e-05,9.9e-05,8.4e-05,9.3e-05,0.000212,4e-06,7.5e-05,7.6e-05,7.8e-05,0.00015,4.7e-05,0.000112,5.5e-05,0.000192,9.2e-05,3.7e-05,5e-05,1.8e-05,9.6e-05,7.6e-05,6.1e-05,2e-04,4.1e-05,5.1e-05,4.4e-05,4.7e-05,8.1e-05,6e-05,8.3e-05,8.7e-05,2.4e-05,0.000121,3.9e-05,0.000116,6.5e-05,0.000245,9.2e-05,0.000158,6.4e-05,1.4e-05,3e-05,6.5e-05
3.9e-05,5.9e-05,6.4e-05,2.4e-05,2.1e-05,3.3e-05,3.6e-05,2.4e-05,0.000102,6.7e-05,4.9e-05,0.000128,0.000105,4.2e-05,1.7e-05,9e-06,7e-06,6e-06,3e-06,6e-06,1e-05,1.8e-05,6e-06,2e-05,4e-06,4.7e-05,4.7e-05,1.2e-05,4.8e-05,5.7e-05,0.000185,9.5e-05,5.4e-05,3.8e-05,2.4e-05,1.2e-05,3.3e-05,2.9e-05,2.8e-05,1.7e-05,1.2e-05,1.6e-05,2.7e-05,4.3e-05,2.9e-05,1.8e-05,4.5e-05,0.000101,7.1e-05,5.4e-05,8.7e-05,4.9e-05,8.6e-05,5.7e-05,0.000135,1.6e-05,8.7e-05,5.1e-05,0.000103,0.000114,6.6e-05,4.4e-05,0.000168,0.000132,0.000111,8.3e-05,7.1e-05,4.1e-05,0.000143,4.3e-05,0.000118,0.00015,8.1e-05,6.4e-05,0.000102,2.1e-05,5.4e-05,0.000223,0.000133,5.1e-05,5.1e-05,0.000102,0.000129,0.000285,0.000102,5.9e-05,9.4e-05,0.000137,0.000122,2.7e-05,0.000115,1.9e-05,0.000144,0.000164,6.3e-05,1.5e-05,1.3e-05,0.000124,9.3e-05,4.8e-05,0.00018,4.5e-05,0.000108,2.1e-05,3.2e-05,6e-05,8.5e-05,9.9e-05,4e-05,8.8e-05,0.000101,0.00012,8.2e-05,8.2e-05,0.000163,0.000109,0.000107,7.1e-05,4.4e-05,9.1e-05,4.8e-05
4.7e-05,4.5e-05,1.6e-05,3.3e-05,1.3e-05,1e-05,3.4e-05,8.1e-05,9.8e-05,0.000126,6.9e-05,0.000132,3.8e-05,9e-06,1e-05,3e-06,3e-06,3e-06,7e-06,2e-06,7e-06,1.1e-05,1.4e-05,4.1e-05,3.9e-05,5.5e-05,4e-06,3.3e-05,9e-06,2.6e-05,0.000193,6.6e-05,3.8e-05,2.2e-05,1.9e-05,1.3e-05,3e-05,3.1e-05,2.1e-05,2.2e-05,2.6e-05,7e-06,3.8e-05,1.4e-05,5.3e-05,2.2e-05,5.2e-05,6.6e-05,6.9e-05,3.3e-05,5.4e-05,9.6e-05,0.000107,5.7e-05,0.000161,1.8e-05,0.000158,0.000104,6.7e-05,9.3e-05,5.9e-05,6.4e-05,2.5e-05,0.000127,7.1e-05,0.00013,0.000168,0.000129,0.000171,2.8e-05,9.9e-05,7.4e-05,0.000138,6.8e-05,4.4e-05,5.7e-05,4.9e-05,0.000201,0.000153,9.7e-05,5.9e-05,5e-05,4e-05,0.000288,0.000103,0.000119,0.000102,7e-05,0.000128,0.000107,0.000209,6.4e-05,0.000101,7.3e-05,5.9e-05,2.2e-05,2.5e-05,0.000118,7.7e-05,5.6e-05,0.000167,7.7e-05,5.2e-05,8.8e-05,5.5e-05,2.2e-05,7e-06,4e-05,5.8e-05,7.4e-05,9e-05,4.5e-05,7.4e-05,7.9e-05,0.000244,5.6e-05,0.000129,0.00012,6.7e-05,8.5e-05,1.8e-05
3.6e-05,1.8e-05,3.7e-05,3.1e-05,3e-05,7e-06,4.5e-05,0.000166,0.000195,0.000186,4.7e-05,8.9e-05,7.4e-05,2.2e-05,1e-06,3e-06,2e-06,1e-06,8e-06,3e-06,4e-06,1e-06,1.3e-05,2.4e-05,2.3e-05,3.3e-05,1.8e-05,3.5e-05,1.9e-05,4.2e-05,0.000163,0.000101,4.1e-05,3.5e-05,2e-05,1.4e-05,1.7e-05,2.4e-05,4e-06,7e-06,2.9e-05,3.3e-05,3.4e-05,1e-05,1e-05,1.3e-05,5.8e-05,8.5e-05,9e-05,2.2e-05,8.6e-05,7.9e-05,8.7e-05,2e-05,0.000137,3.1e-05,9.9e-05,2.6e-05,0.000106,1.8e-05,6.6e-05,3e-05,0.000135,0.000123,0.000104,2.2e-05,0.000101,4.6e-05,0.000164,1.3e-05,3.4e-05,8.5e-05,0.000149,0.000102,4.3e-05,5.2e-05,1e-04,0.00017,0.000197,4.6e-05,4.9e-05,0.000109,0.000125,0.000218,3.9e-05,5.5e-05,0.000145,0.000145,9.4e-05,6.6e-05,0.000139,1.5e-05,7.7e-05,6.9e-05,4.5e-05,7.3e-05,3.3e-05,5.8e-05,0.000112,0.000109,0.000168,5.2e-05,6.6e-05,9.5e-05,8.8e-05,8.5e-05,2.6e-05,9e-06,7.8e-05,4.3e-05,0.000124,4.5e-05,0.000109,3.6e-05,0.000238,7.8e-05,6.4e-05,7.4e-05,9e-05,0.000101,4.1e-05
6.6e-05,2.8e-05,7.9e-05,7.3e-05,0.000104,0.000101,5.1e-05,0.000144,1.9e-05,9.1e-05,0.000126,0.000113,5.5e-05,6e-06,6e-06,7e-06,9e-06,5e-06,4e-06,5e-06,1e-06,3e-06,7e-06,1.8e-05,2.4e-05,1.4e-05,1.5e-05,2.8e-05,1.9e-05,2.8e-05,0.000166,3.2e-05,2.6e-05,2.7e-05,3e-05,1.4e-05,9e-06,2.5e-05,2e-06,1.1e-05,1.4e-05,2.3e-05,2.4e-05,1.4e-05,2.3e-05,2.6e-05,3.2e-05,9.9e-05,8e-05,3.7e-05,1e-04,5.8e-05,5.5e-05,4e-05,0.000148,1.7e-05,2.1e-05,4.9e-05,3.5e-05,6.7e-05,8.8e-05,2e-05,0.000129,4.2e-05,6e-05,5.7e-05,8e-05,5.2e-05,0.000149,1.9e-05,0.000106,9.1e-05,0.000144,5.3e-05,7.2e-05,7.3e-05,3.5e-05,0.000144,8e-05,7.7e-05,9e-06,7.6e-05,5e-05,0.000182,5e-05,5.9e-05,7.9e-05,4.7e-05,4.9e-05,5.1e-05,7.8e-05,2.4e-05,0.000111,1.1e-05,6.5e-05,4.1e-05,4.9e-05,3.2e-05,0.000105,5.8e-05,0.000153,6.2e-05,1.5e-05,3.8e-05,4e-05,7e-05,6.1e-05,7.9e-05,7.4e-05,4.5e-05,0.000117,3.6e-05,8.7e-05,4.8e-05,0.000208,4.3e-05,0.00011,1.9e-05,0.000112,8.1e-05,0.000102
5e-05,3.5e-05,7.4e-05,0.000108,0.000207,0.000165,0.000125,0.000105,3e-05,2.1e-05,9.7e-05,7.6e-05,2e-05,2.3e-05,9e-06,5e-06,4e-06,1e-06,4e-06,2e-06,3e-06,5e-06,1.1e-05,1.7e-05,2e-05,1.4e-05,1e-05,1.3e-05,2e-05,3.7e-05,0.000136,9.9e-05,3.9e-05,1e-05,3.7e-05,1.6e-05,1e-05,1.4e-05,9e-06,1.7e-05,2e-05,1.2e-05,1.5e-05,2.4e-05,7e-06,2.1e-05,3.8e-05,9.9e-05,4.3e-05,3.9e-05,8.2e-05,4.8e-05,6.4e-05,2.6e-05,0.00011,5.2e-05,6.7e-05,2.3e-05,4.8e-05,7.2e-05,4.1e-05,9.3e-05,0.000151,0.000128,9e-05,8.3e-05,0.000114,6e-05,9.7e-05,7e-05,8.9e-05,0.000134,5.4e-05,3.5e-05,8.3e-05,5.2e-05,3.8e-05,0.000266,9.6e-05,4.1e-05,0.000111,9.5e-05,4.3e-05,0.000231,8.5e-05,6.1e-05,8.2e-05,5.1e-05,7.4e-05,4.9e-05,0.000118,6.3e-05,0.000122,4.6e-05,4.8e-05,4.8e-05,5.8e-05,5.7e-05,0.000125,3.9e-05,0.000176,5e-05,3e-05,5e-06,1.8e-05,7.3e-05,5.4e-05,8.2e-05,5.3e-05,3.1e-05,7.5e-05,6.3e-05,9.1e-05,8.5e-05,0.000142,5.7e-05,0.000104,6.1e-05,0.000113,0.000135,6.4e-05
2.8e-05,1.4e-05,3.3e-05,7.3e-05,0.000168,8.3e-05,5.8e-05,4.2e-05,3.6e-05,7.7e-05,0.000142,6.4e-05,4.5e-05,2.9e-05,1.3e-05,6e-06,3e-06,1e-06,4e-06,2e-06,4e-06,3e-06,1.1e-05,1.4e-05,2.6e-05,1e-05,2.9e-05,2.3e-05,1.3e-05,3.1e-05,0.000153,0.000132,6.3e-05,1.2e-05,1e-05,1.7e-05,5e-06,3.1e-05,8e-06,3e-05,2e-05,2.6e-05,2.8e-05,3e-05,4e-06,2.2e-05,2.5e-05,8.5e-05,5.9e-05,2.1e-05,0.000102,3.1e-05,6.4e-05,3.9e-05,0.000104,5.3e-05,3.3e-05,2.5e-05,5.4e-05,7.7e-05,3.9e-05,5.8e-05,9.1e-05,9.1e-05,0.000184,6.1e-05,4.9e-05,3.1e-05,0.000138,7.4e-05,0.000144,0.000122,9.2e-05,2.6e-05,9.3e-05,9.4e-05,0.000143,0.000171,0.000179,3.8e-05,5.2e-05,8.7e-05,6.3e-05,0.000172,3e-05,7.5e-05,9.5e-05,4.2e-05,6.2e-05,9.5e-05,6.7e-05,9e-05,6.1e-05,7.1e-05,8.8e-05,6.1e-05,2.3e-05,9.7e-05,0.000141,2.7e-05,0.000207,0.000107,3.9e-05,3.4e-05,3.7e-05,4.6e-05,2.9e-05,5.8e-05,0.000136,0.000148,0.000135,6.8e-05,3.5e-05,4e-05,0.000186,7.2e-05,0.000156,7.3e-05,8.7e-05,0.000102,0.000105
2.8e-05,3.8e-05,2e-05,3.4e-05,0.00011,4.8e-05,1e-04,5.9e-05,3.9e-05,2.8e-05,7.4e-05,4.2e-05,6.9e-05,4.1e-05,1.6e-05,6e-06,1e-06,2e-06,2e-06,3e-06,5e-06,1e-06,1e-05,2.1e-05,3e-05,2.7e-05,2.1e-05,6e-06,1.6e-05,4.2e-05,0.000204,0.000106,5.7e-05,2.6e-05,4.2e-05,2.9e-05,3.2e-05,3.8e-05,2.4e-05,1.7e-05,4.6e-05,4.4e-05,4.1e-05,3.3e-05,2.8e-05,1e-06,3.9e-05,7.1e-05,6.4e-05,3.1e-05,0.000106,3.4e-05,6.2e-05,3.5e-05,0.000118,5e-05,7.5e-05,6.4e-05,4.1e-05,7.5e-05,5.7e-05,1.5e-05,5e-05,0.000122,0.000161,1.7e-05,0.000115,0.000115,0.000139,0.000162,0.000106,9.3e-05,8e-05,2.3e-05,8.2e-05,0.000144,0.000158,0.000278,0.000118,1e-04,0.000177,8.7e-05,0.000189,0.00018,7.9e-05,9.1e-05,3e-05,0.000141,5e-05,0.000121,0.000107,8.5e-05,5.6e-05,3.2e-05,0.000122,8.4e-05,0.000113,0.000109,0.000219,1e-04,0.000204,1e-05,8.2e-05,0.000119,6.4e-05,3.8e-05,7e-05,1.3e-05,0.000207,0.000182,0.000233,0.000135,6.5e-05,6.4e-05,0.000276,0.000104,7.6e-05,7.7e-05,6.3e-05,0.000107,9.3e-05
1.2e-05,3.5e-05,9e-06,1.5e-05,0.000168,9e-05,3e-05,6.6e-05,6.7e-05,6.7e-05,6.6e-05,5.6e-05,5.5e-05,1.5e-05,5e-06,6e-06,8e-06,4e-06,2e-06,4e-06,7e-06,7e-06,3e-06,1.8e-05,1.7e-05,2.4e-05,3.7e-05,3.5e-05,3.3e-05,2.3e-05,0.00021,0.000101,2.9e-05,3.2e-05,7e-06,3.2e-05,1.6e-05,3e-05,2.6e-05,4.4e-05,2.9e-05,2.9e-05,8.6e-05,7.8e-05,9.6e-05,6e-05,2.3e-05,0.000113,0.000102,1e-05,7.7e-05,8.9e-05,2.6e-05,0.000106,0.00011,6.2e-05,0.000226,2.1e-05,8.6e-05,8.8e-05,0.000119,7.8e-05,3.1e-05,9.6e-05,0.000298,0.000293,0.000224,8.8e-05,0.000198,0.000338,0.000288,0.000157,6.2e-05,7.2e-05,8.4e-05,3.9e-05,0.000271,0.000374,9.7e-05,0.000189,0.000121,0.000119,0.000162,0.000473,0.000372,0.000159,0.000163,0.000143,0.000138,0.000262,9.7e-05,0.00016,0.00014,9.3e-05,0.000192,0.000291,0.000158,7.5e-05,0.00031,0.000336,0.000102,3.7e-05,5.4e-05,0.000143,0.000133,8.9e-05,0.000144,0.000214,0.000384,5.3e-05,0.000124,0.000192,0.000113,0.000137,0.000297,5.9e-05,0.000214,6.3e-05,0.000128,0.000148,0.000294
8e-06,2.4e-05,2.5e-05,4.5e-05,0.00023,0.000222,0.000182,0.000169,0.000226,0.000193,0.000128,1e-04,6.4e-05,4.3e-05,2e-05,5e-06,5e-06,3e-06,2e-06,3e-06,4e-06,1.1e-05,2e-06,1.4e-05,1.8e-05,6e-05,5.4e-05,2.3e-05,1.5e-05,1.4e-05,0.00018,0.000125,8.1e-05,1.8e-05,1.5e-05,2.8e-05,1.6e-05,2.9e-05,9e-06,1.7e-05,1.3e-05,1.1e-05,6.1e-05,3.4e-05,8.6e-05,3.2e-05,2.8e-05,0.000156,9.2e-05,3.5e-05,6e-06,6e-05,9.8e-05,0.000225,0.000291,0.000101,0.00021,0.000252,0.000229,0.000244,4.9e-05,0.000116,0.000119,0.000161,0.000279,0.000349,0.000238,0.000374,0.000287,0.000328,0.000229,0.000117,6.8e-05,0.000109,8.2e-05,0.000176,0.000297,0.000561,0.000575,0.00047,0.000398,0.00032,0.000332,0.000269,0.000281,0.000225,0.000223,0.000171,2.1e-05,0.000272,0.00046,0.000418,0.000457,0.000336,0.000292,0.000349,0.000448,0.000356,0.00031,0.00017,0.000153,0.000235,0.000243,0.000273,0.000225,0.000191,0.000171,9.8e-05,0.000364,0.000285,0.000224,0.000144,0.000165,0.000196,8.6e-05,0.000321,0.000325,0.000202,3.5e-05,0.000106,0.00013
3.2e-05,2.6e-05,1.3e-05,5.1e-05,0.000147,9.5e-05,2.9e-05,9e-05,8.2e-05,5.3e-05,1.7e-05,3.2e-05,7e-06,8e-06,3e-06,4e-06,2e-06,2e-06,2e-06,3e-06,6e-06,7e-06,1e-05,8e-06,1.7e-05,3.5e-05,2.4e-05,3e-06,1.6e-05,1.2e-05,0.000133,0.000107,4.9e-05,3.2e-05,1.2e-05,8e-06,5e-06,2.6e-05,9e-06,8e-06,6e-06,1.5e-05,2.1e-05,4.8e-05,4.3e-05,5.6e-05,4.5e-05,0.000171,6.4e-05,4.2e-05,8.7e-05,5.8e-05,0.000128,0.000106,0.000136,0.000184,8.2e-05,0.000153,4.7e-05,0.000131,0.000119,0.000119,0.000134,7.4e-05,0.000136,0.000126,4.1e-05,0.000234,0.000161,0.000147,0.00011,8.9e-05,5.1e-05,2.4e-05,5.5e-05,0.00014,7e-05,0.000159,0.000203,9.2e-05,8.5e-05,0.000158,7.1e-05,0.000192,1e-04,6.8e-05,5.9e-05,9.3e-05,0.000156,0.00016,0.000264,0.00011,0.000172,0.000148,7.1e-05,0.000134,0.000148,4.3e-05,0.000171,8.9e-05,0.000294,0.000213,0.000175,1.4e-05,0.000122,0.000163,3.9e-05,0.000141,0.000138,4.7e-05,0.000206,0.000184,2.5e-05,7.9e-05,0.000109,0.000155,0.000109,2.1e-05,3.7e-05,6.4e-05,0.000104
1.2e-05,3e-06,8e-06,4.4e-05,5.8e-05,2.8e-05,7e-06,5.7e-05,0.000101,3.3e-05,3.1e-05,1.4e-05,3e-06,6e-06,2e-06,3e-06,3e-06,1e-06,3e-06,1e-06,2e-06,2e-06,4e-06,7e-06,6e-06,3.4e-05,3.5e-05,1.2e-05,1.1e-05,1.8e-05,9.3e-05,1.8e-05,2.1e-05,5e-06,1e-05,1.6e-05,1.7e-05,2.6e-05,8e-06,1.1e-05,4e-06,6e-06,4e-06,3.7e-05,8e-06,1.8e-05,2e-05,9.8e-05,4.8e-05,4.6e-05,6.5e-05,3e-05,1e-04,5.3e-05,7.5e-05,8.1e-05,5.1e-05,2.4e-05,5.4e-05,6.2e-05,5.6e-05,8.6e-05,0.000118,1.2e-05,0.000126,4.1e-05,1.6e-05,0.000115,9.3e-05,3.3e-05,8.9e-05,1e-04,4.5e-05,4.7e-05,7.4e-05,4.9e-05,2.9e-05,1.4e-05,1.7e-05,1.7e-05,9.5e-05,8.7e-05,3.1e-05,0.000149,5.3e-05,3.7e-05,3.8e-05,8.6e-05,7.2e-05,8.7e-05,0.000193,5.5e-05,0.000131,9.9e-05,3.8e-05,5.7e-05,6.4e-05,8.2e-05,2.9e-05,4.6e-05,0.00024,7.4e-05,8.3e-05,5.1e-05,5.7e-05,0.00012,2.4e-05,0.000133,5.7e-05,1e-04,0.000114,2.4e-05,0.000104,1.7e-05,0.000174,7.9e-05,4.2e-05,2.5e-05,1.5e-05,3.4e-05,7.1e-05
6e-06,4e-06,4e-06,3.3e-05,2.1e-05,2.5e-05,2.1e-05,3.8e-05,6.9e-05,2e-05,1.3e-05,8e-06,4e-06,3e-06,2e-06,1e-06,4e-06,4e-06,2e-06,0,1e-06,1e-06,2e-06,1e-05,6e-06,3.3e-05,1.6e-05,1.2e-05,1.2e-05,2.2e-05,2.5e-05,4.5e-05,1e-05,8e-06,1.8e-05,4e-06,1e-05,2e-05,4e-06,8e-06,1.1e-05,9e-06,3e-06,3.4e-05,7e-06,6e-06,2.4e-05,8.7e-05,5.4e-05,3.2e-05,6.7e-05,3e-05,9.5e-05,2e-05,7.3e-05,5.8e-05,2e-05,2.2e-05,3.7e-05,8e-05,5.1e-05,8.3e-05,0.000121,4e-06,5.9e-05,2.4e-05,1.5e-05,0.000102,9.6e-05,3.5e-05,8.7e-05,8.6e-05,3.4e-05,3.1e-05,7.9e-05,2.7e-05,2.2e-05,3.6e-05,7e-06,2.2e-05,8.8e-05,9e-05,3.1e-05,0.000141,4.9e-05,1.7e-05,1.8e-05,7.3e-05,8.8e-05,7.2e-05,0.000178,4.6e-05,0.000111,9.9e-05,2.6e-05,3.2e-05,4.3e-05,8.2e-05,3.3e-05,3.4e-05,0.000214,5.9e-05,7.2e-05,2.5e-05,5e-05,0.000113,3e-06,0.000121,9.6e-05,9e-05,9.3e-05,1.7e-05,8.2e-05,1.4e-05,0.000176,8.8e-05,5.7e-05,8e-06,7e-06,3.8e-05,7.4e-05
7e-06,6e-06,5e-06,2.6e-05,1.1e-05,1.9e-05,9e-06,2.8e-05,6.7e-05,1e-05,8e-06,7e-06,3e-06,1e-06,2e-06,3e-06,2e-06,2e-06,1e-06,0,1e-06,1e-06,3e-06,1e-05,7e-06,2.5e-05,1.8e-05,1.2e-05,1.1e-05,2.4e-05,3.1e-05,1.2e-05,1.6e-05,3e-06,1.5e-05,1e-06,9e-06,1.9e-05,3e-06,6e-06,9e-06,7e-06,8e-06,3.2e-05,3e-06,8e-06,3e-05,8.6e-05,5.6e-05,3.1e-05,7.1e-05,3.6e-05,9.4e-05,1e-05,8.2e-05,4.8e-05,1.3e-05,1.7e-05,3.5e-05,9.3e-05,3.8e-05,8.2e-05,0.000103,4e-06,6.6e-05,4e-05,1e-06,9.2e-05,0.000103,1.6e-05,8.1e-05,8.2e-05,3.8e-05,2.5e-05,6.1e-05,1.6e-05,2.2e-05,6e-05,2.3e-05,2e-05,6.3e-05,8.5e-05,3e-05,0.000133,4e-05,1.3e-05,1.6e-05,6.6e-05,8.6e-05,5.4e-05,0.000161,5.2e-05,1e-04,8.9e-05,1.3e-05,2.6e-05,4e-05,6.8e-05,3.5e-05,3.5e-05,0.000197,3.7e-05,4.9e-05,2.5e-05,4e-05,9.9e-05,2e-06,0.000115,8.5e-05,6.4e-05,8e-05,1.1e-05,6.7e-05,1.6e-05,0.000171,9.2e-05,6.6e-05,2.3e-05,4e-06,4.2e-05,7.7e-05
