0.067794,0.083481,0.068237,0.046054,0.03954,0.035116,0.036993,0.056482,0.074832,0.056727,0.038217,0.04834,0.052477,0.048253,0.060324,0.06448,0.050564,0.037846,0.030472,0.032588,0.034642,0.041641,0.073847,0.077837,0.042742,0.025486,0.027746,0.053644
0.079039,0.096159,0.078536,0.054911,0.048174,0.042388,0.044474,0.068828,0.091786,0.069089,0.047117,0.060767,0.064951,0.057737,0.069797,0.074902,0.05996,0.044496,0.035771,0.039105,0.04179,0.051287,0.091894,0.095948,0.051674,0.030987,0.03366,0.065415
0.092816,0.111681,0.091662,0.067676,0.060933,0.053035,0.05542,0.086442,0.116441,0.087988,0.062405,0.081771,0.084619,0.072013,0.083564,0.09022,0.07391,0.053366,0.042655,0.048778,0.052693,0.066694,0.120092,0.122563,0.064835,0.040552,0.043685,0.084548
0.090903,0.11117,0.093039,0.071914,0.065337,0.056554,0.0594,0.091196,0.12352,0.096974,0.076115,0.098368,0.095816,0.078668,0.089422,0.097581,0.080951,0.055336,0.043089,0.052663,0.058593,0.0781,0.137019,0.1322,0.069445,0.048429,0.051511,0.099248
0.080416,0.101111,0.086884,0.070071,0.062157,0.05246,0.055189,0.083658,0.116159,0.099015,0.091643,0.116898,0.105099,0.082049,0.092446,0.101702,0.083091,0.051871,0.038309,0.052136,0.061952,0.085883,0.141772,0.125043,0.065259,0.053422,0.056524,0.111603
0.081689,0.107045,0.092247,0.075617,0.065125,0.050619,0.051794,0.082829,0.124069,0.116929,0.128719,0.169107,0.143182,0.099996,0.105535,0.116483,0.096547,0.058305,0.03935,0.057268,0.071392,0.096686,0.160862,0.137906,0.068829,0.059726,0.063824,0.137763
0.104623,0.145225,0.122892,0.096886,0.084207,0.059794,0.057098,0.106762,0.169975,0.163628,0.198675,0.27147,0.221857,0.139902,0.136458,0.148778,0.128707,0.08031,0.049223,0.069732,0.090503,0.119914,0.210337,0.190068,0.094044,0.075867,0.080365,0.188906
0.140167,0.200824,0.169664,0.12315,0.10519,0.075497,0.07441,0.148814,0.233261,0.223916,0.29018,0.404188,0.320477,0.19477,0.193085,0.200515,0.168034,0.107702,0.064488,0.090986,0.12251,0.157375,0.274449,0.257954,0.135554,0.10602,0.107633,0.266956
0.172918,0.254761,0.218483,0.140649,0.113938,0.089616,0.096737,0.191975,0.288166,0.275923,0.373385,0.521089,0.399395,0.242125,0.26238,0.259749,0.199817,0.129285,0.082613,0.121315,0.16038,0.190633,0.318873,0.307699,0.176573,0.140463,0.139378,0.36395
0.19929,0.297705,0.260901,0.155258,0.118333,0.102746,0.117716,0.218188,0.309443,0.292621,0.406144,0.570772,0.428708,0.26534,0.326478,0.311458,0.208586,0.134295,0.096778,0.148779,0.186546,0.198275,0.313084,0.310543,0.195082,0.158156,0.159164,0.433544
0.224304,0.328018,0.287098,0.168684,0.121781,0.110251,0.128493,0.218233,0.294318,0.274539,0.373854,0.525301,0.400542,0.263524,0.364944,0.344449,0.19957,0.126919,0.103136,0.158375,0.185291,0.177797,0.262092,0.264153,0.178718,0.148641,0.155585,0.425256
0.245439,0.342591,0.288037,0.171333,0.116004,0.104591,0.125243,0.203396,0.271046,0.257178,0.323015,0.430561,0.342427,0.24471,0.356985,0.340689,0.18204,0.11491,0.099713,0.143467,0.158012,0.1538,0.227313,0.228755,0.153675,0.124521,0.130307,0.335406
0.245187,0.327447,0.265442,0.160121,0.09844,0.087121,0.111281,0.192354,0.259323,0.244684,0.271532,0.320096,0.259965,0.204332,0.299903,0.294703,0.165612,0.109094,0.093747,0.116712,0.122779,0.147281,0.244945,0.246327,0.153939,0.108637,0.101777,0.244344
0.213049,0.280555,0.228207,0.141164,0.08449,0.078498,0.102025,0.181524,0.250144,0.22773,0.216448,0.21527,0.176888,0.166206,0.230934,0.23537,0.159053,0.108959,0.085736,0.092309,0.09646,0.144349,0.259012,0.267494,0.165625,0.100234,0.082876,0.204312
0.161875,0.218572,0.189478,0.125583,0.088687,0.095233,0.114772,0.205752,0.303404,0.243365,0.176535,0.163185,0.148547,0.169083,0.20793,0.20772,0.16091,0.108087,0.075153,0.075674,0.087913,0.140329,0.233704,0.243741,0.156149,0.087507,0.072275,0.197899
0.149432,0.20639,0.1844,0.131342,0.115858,0.13647,0.160858,0.288924,0.444896,0.329456,0.189834,0.175346,0.170221,0.204462,0.254121,0.257808,0.199271,0.125065,0.077785,0.079763,0.101594,0.155101,0.226117,0.22316,0.145356,0.090637,0.082543,0.210934
0.206841,0.273222,0.225527,0.162523,0.161377,0.195082,0.232942,0.407325,0.629413,0.460905,0.259065,0.242416,0.220041,0.250275,0.352647,0.396678,0.303311,0.178501,0.101441,0.10059,0.12457,0.196818,0.283566,0.268949,0.176028,0.121634,0.110814,0.250968
0.287647,0.3808,0.30824,0.219348,0.215096,0.25245,0.301727,0.505745,0.77654,0.585557,0.36106,0.350517,0.29075,0.295391,0.48202,0.593136,0.447793,0.252533,0.134391,0.128293,0.149752,0.249573,0.379051,0.364381,0.252986,0.183612,0.15198,0.309049
0.358021,0.479767,0.395509,0.281928,0.256972,0.284047,0.33354,0.530554,0.799937,0.638206,0.45767,0.464783,0.375149,0.345824,0.623295,0.792714,0.575002,0.314082,0.164051,0.155075,0.167208,0.292426,0.481951,0.474277,0.340201,0.25413,0.198363,0.34541
0.36757,0.496823,0.430711,0.32012,0.27427,0.282079,0.317444,0.471417,0.679419,0.580439,0.487561,0.518756,0.434927,0.37831,0.730452,0.924308,0.623621,0.335976,0.18103,0.170427,0.173356,0.309548,0.537782,0.532862,0.383656,0.29779,0.23567,0.339148
0.297884,0.410643,0.403295,0.322788,0.256431,0.241793,0.254547,0.346506,0.479939,0.449719,0.426117,0.468786,0.422022,0.364882,0.740863,0.920749,0.573555,0.311838,0.182267,0.173482,0.175128,0.290885,0.500899,0.495627,0.34834,0.280008,0.240828,0.297492
0.203717,0.286214,0.333553,0.295162,0.217182,0.175553,0.166055,0.215122,0.305226,0.318348,0.329212,0.363095,0.360163,0.344233,0.657027,0.781117,0.469244,0.266265,0.160086,0.148991,0.156063,0.224558,0.362241,0.356898,0.249755,0.216415,0.206938,0.238429
0.141962,0.186238,0.242658,0.236332,0.178636,0.139422,0.109393,0.117214,0.167042,0.205414,0.269755,0.30418,0.304999,0.316836,0.530096,0.59222,0.376583,0.232603,0.123753,0.105753,0.121802,0.153556,0.210824,0.200383,0.154084,0.161497,0.161858,0.183771
0.118376,0.127227,0.179772,0.201252,0.162088,0.13568,0.104068,0.081562,0.099028,0.1444,0.260473,0.329328,0.295974,0.274358,0.425203,0.460984,0.330496,0.227469,0.109812,0.088233,0.104756,0.128244,0.140188,0.109863,0.096235,0.122824,0.117711,0.147082
0.117955,0.11576,0.18087,0.224612,0.183039,0.141855,0.113686,0.084504,0.082149,0.121524,0.260741,0.357578,0.293944,0.232347,0.337961,0.367224,0.282217,0.20191,0.109595,0.093542,0.094776,0.112996,0.11971,0.091335,0.074604,0.086631,0.084313,0.141125
0.137349,0.128,0.213277,0.267005,0.206252,0.143974,0.121662,0.101225,0.089473,0.130329,0.283814,0.390065,0.309423,0.209222,0.264121,0.285451,0.209834,0.148262,0.103811,0.099453,0.087402,0.101013,0.11394,0.090118,0.065886,0.066227,0.075409,0.154911
0.176602,0.15348,0.273725,0.333005,0.230855,0.151241,0.135507,0.120114,0.106325,0.171031,0.339425,0.43001,0.364326,0.247898,0.234141,0.232588,0.151067,0.102289,0.100004,0.111918,0.091961,0.097083,0.123043,0.100438,0.064264,0.059765,0.0758,0.162836
0.202147,0.173485,0.349981,0.425466,0.26933,0.173975,0.160259,0.132361,0.118357,0.227046,0.421987,0.499235,0.454692,0.331171,0.240753,0.19572,0.119786,0.080745,0.096997,0.122675,0.093671,0.086608,0.127835,0.109971,0.065591,0.064968,0.083018,0.157615
0.194192,0.174199,0.397922,0.499889,0.31637,0.211683,0.189423,0.130242,0.117203,0.291445,0.529619,0.590461,0.537409,0.413139,0.267691,0.1681,0.107437,0.076683,0.092014,0.121608,0.09168,0.087264,0.135308,0.111594,0.060846,0.071266,0.090194,0.146051
0.176897,0.180587,0.393161,0.497149,0.34796,0.257156,0.210199,0.123508,0.129535,0.363767,0.687395,0.729273,0.569722,0.444825,0.296402,0.152051,0.096823,0.072879,0.085672,0.114391,0.097696,0.107772,0.161094,0.122129,0.057922,0.079761,0.097031,0.137721
0.168073,0.207224,0.361618,0.432866,0.343784,0.286087,0.232159,0.139907,0.162148,0.411752,0.828856,0.845399,0.527722,0.42351,0.313062,0.145522,0.087482,0.069301,0.084081,0.116666,0.108182,0.121946,0.181368,0.135368,0.057192,0.081951,0.10294,0.13194
0.171278,0.232302,0.35092,0.415812,0.366244,0.325837,0.272241,0.168202,0.189569,0.428774,0.916835,0.910601,0.514552,0.44169,0.325431,0.137242,0.078312,0.069801,0.085297,0.116013,0.108601,0.126992,0.183351,0.138691,0.060403,0.077766,0.102719,0.137548
0.200574,0.254797,0.339265,0.416325,0.402935,0.365088,0.305896,0.19081,0.19847,0.442033,0.960021,0.971386,0.634117,0.536235,0.336838,0.122529,0.066674,0.066353,0.075344,0.098306,0.104466,0.127617,0.158164,0.124805,0.068392,0.074007,0.089079,0.1332
0.253619,0.307507,0.379495,0.424514,0.407597,0.381048,0.338627,0.215332,0.199818,0.421009,0.898726,0.976603,0.820931,0.667469,0.332616,0.112514,0.068506,0.065781,0.060092,0.080393,0.108919,0.121926,0.1167,0.10051,0.075869,0.06745,0.066249,0.114757
0.333117,0.406809,0.426858,0.409991,0.387136,0.350815,0.335404,0.241226,0.211454,0.413374,0.827772,0.929767,0.96416,0.796677,0.323259,0.103237,0.088997,0.08613,0.074421,0.090645,0.114497,0.117532,0.09738,0.09055,0.080374,0.062161,0.054122,0.10206
0.423093,0.494175,0.454641,0.408859,0.360445,0.290452,0.293681,0.251953,0.228368,0.406302,0.830159,0.941079,0.99088,0.904092,0.37131,0.109132,0.121071,0.126057,0.111102,0.122575,0.119675,0.105076,0.092236,0.095456,0.091592,0.072563,0.056122,0.087464
0.501919,0.502039,0.432341,0.413508,0.358756,0.258139,0.267678,0.239739,0.211155,0.343196,0.75655,0.92515,0.923248,0.946828,0.452345,0.11956,0.161497,0.177426,0.151116,0.156919,0.126271,0.081348,0.078922,0.093139,0.104777,0.10174,0.074185,0.075257
0.511734,0.418447,0.354321,0.4215,0.415985,0.295619,0.255062,0.197089,0.170349,0.241271,0.583795,0.898473,0.887534,0.940281,0.538296,0.147017,0.205652,0.221886,0.178772,0.174636,0.131521,0.066982,0.066071,0.082299,0.114708,0.130413,0.095398,0.086855
0.468609,0.338775,0.347491,0.50114,0.541627,0.36587,0.232473,0.149674,0.1537,0.177314,0.396395,0.793113,0.966954,1.048829,0.630806,0.195345,0.23198,0.232963,0.189185,0.177072,0.128519,0.061903,0.066234,0.079932,0.128676,0.142516,0.106546,0.106418
0.461041,0.355284,0.41077,0.60259,0.652266,0.395527,0.183202,0.104938,0.137311,0.15699,0.286922,0.649751,1.017099,1.141195,0.715453,0.23752,0.224913,0.198886,0.200894,0.198166,0.12475,0.064552,0.064699,0.074032,0.132078,0.129219,0.103856,0.119643
