1.1e-05,5e-06,2e-06,2e-06,2.2e-05,8e-06,0,1e-05,7e-05,1.6e-05,5.6e-05,2.8e-05,4.7e-05,2.6e-05,2.7e-05,2.6e-05,1e-05,1.3e-05,4e-05,3.3e-05,7.1e-05,0.00012,4e-06,4.3e-05,5.6e-05,1.8e-05,9.3e-05,1e-04,8.1e-05,1.9e-05,0.000145,4.4e-05,7e-05,5.7e-05,3.1e-05,9.8e-05,5e-05,4.9e-05,0.000153,4.6e-05,2.7e-05,5.1e-05,0.00011,3.1e-05,4.4e-05,0.000166,9.4e-05,0.000155,5.4e-05,0.00016,0.000104,0.000158,0.000107,5.5e-05,0.000144,5.8e-05,0.000115,4e-06,0.000142,0.000399,0.000201,0.000212,7.9e-05,4.1e-05,2.7e-05,0.000175,4e-06,0.000222,0.000108,0.000182,9.4e-05,8.1e-05,7.4e-05,0.000182,0.000344,0.000255,6.2e-05,0.000127,5.4e-05,0.000104,0.000203,0.000136,0.000202,0.000104,9.4e-05,0.000108,1.2e-05,0.000117,0.000105,0.000141,0.00011,2.2e-05,1.8e-05,5.7e-05,4.4e-05,3e-06,5.2e-05,0.000211,3.7e-05,9.8e-05,5.7e-05,5.7e-05,4.7e-05,0.000191,1.8e-05,0.000326,0.000327,0.00011,6.4e-05,0.000296,0.000157,3e-05,9.7e-05,2.1e-05,0.000134,4.4e-05,0.000231,0.000124,8.9e-05,4.3e-05,0.000385
2.7e-05,3.1e-05,1.7e-05,8.1e-05,6.2e-05,3.2e-05,1.6e-05,6.7e-05,9e-05,0.000101,7.1e-05,7.4e-05,4.9e-05,0.000102,0.000111,0.00015,1e-04,1.3e-05,5e-05,0.000102,0.000146,0.00019,0.000167,5e-05,0.000107,0.000135,9.3e-05,0.000252,0.000228,7.6e-05,0.00033,0.000356,0.00023,0.000109,0.000288,0.000267,0.00029,0.000311,0.000339,0.000122,0.000261,0.000124,0.000446,0.00014,0.000242,0.000437,0.000312,0.000342,0.000236,0.000482,9.2e-05,0.000226,0.000215,0.000359,0.000193,0.000316,0.000243,8.2e-05,0.000786,0.000611,0.000546,0.000404,0.00016,0.00013,0.000246,0.000531,0.000536,0.000497,0.00032,0.000578,0.000573,0.000128,0.000353,0.000108,0.000575,0.000752,0.000207,0.000562,0.000248,0.000542,0.00094,0.000489,0.000816,0.000368,0.000355,0.000552,0.000387,0.000232,0.000384,0.00066,0.000588,0.000113,0.000393,0.000474,0.000398,0.000356,0.000133,0.000422,0.000153,0.000136,0.000176,0.000292,0.000275,0.000447,0.000505,0.001125,0.000183,0.00055,0.00021,0.000356,0.000429,0.00041,0.000365,0.00032,0.000405,0.000282,0.000126,0.000421,0.000551,0.000777,0.000845
6.1e-05,1.4e-05,2.3e-05,0.000103,7e-05,3.6e-05,1.1e-05,8.6e-05,0.000143,6.2e-05,0.000132,7.3e-05,0.000103,1e-05,6.5e-05,0.000206,0.000132,0.000154,9e-05,2e-04,0.000313,0.000233,0.000178,0.000199,0.000264,0.000148,0.000258,0.00057,0.000453,0.000163,0.000341,0.000515,0.000103,3.8e-05,0.000309,0.000152,0.000475,0.000216,0.000176,9.9e-05,0.000267,0.000216,0.000518,2.9e-05,0.000304,0.000364,0.000605,0.000496,0.000556,0.000332,0.000427,0.000461,0.000176,0.000707,0.000458,0.00069,0.000403,0.000532,0.000697,0.000644,0.000315,0.000766,0.000246,0.000333,0.000557,0.00042,0.000387,3.2e-05,0.000436,0.000897,0.000688,0.000457,0.000696,0.00029,9.9e-05,0.000773,0.000943,0.000285,0.000453,0.000281,0.000587,0.000441,0.000236,0.000101,0.000701,9e-05,0.000234,0.000264,0.000247,0.00063,0.000271,0.000628,0.000215,0.000313,0.000886,0.000636,0.000755,0.000977,0.000245,0.000366,0.000308,0.000252,0.000426,0.000213,0.000593,0.000736,0.001318,0.000781,0.000462,0.000506,0.000125,0.000392,0.000227,0.000275,0.000376,0.000238,0.000744,0.000327,0.000959,0.000724,0.000633
8e-05,1.5e-05,2.5e-05,0.000114,6.2e-05,3.4e-05,3.8e-05,5.1e-05,0.000189,3.4e-05,0.000181,8.6e-05,0.000163,6.4e-05,4.4e-05,0.000359,0.000123,0.000268,6e-05,0.000145,0.00062,0.000542,0.000399,4.1e-05,0.000543,0.000155,0.00028,0.000457,0.000385,9.6e-05,0.000297,0.000565,0.00042,0.000164,0.000269,0.00053,0.000197,0.000332,0.000263,0.00046,0.000273,9.7e-05,0.000465,0.000378,0.000143,0.000151,0.000155,0.000436,3e-04,0.000114,0.000163,0.000597,0.000213,0.000434,0.000215,0.000496,0.000748,0.000652,0.000315,0.000531,0.001001,0.000989,0.00093,0.000221,0.00028,0.000824,0.00144,0.000789,0.000363,0.00082,6e-05,0.000511,0.000425,0.001028,0.000777,0.001316,0.000932,0.001292,0.000373,0.000329,0.001363,0.00074,0.001233,0.000322,0.000676,0.000586,0.000798,0.000662,0.00104,7.2e-05,0.000407,0.000454,0.000382,0.001249,0.000843,0.000537,0.000912,0.00037,0.000541,0.000787,0.000554,0.000303,0.000868,0.000803,0.000464,0.00087,0.00081,0.000635,0.000283,0.000923,0.000782,0.000277,0.000592,0.000878,0.000719,0.00048,0.001308,0.000684,0.001086,0.001087,0.000955
5.9e-05,8.3e-05,4.5e-05,3.6e-05,9e-05,8.1e-05,4.2e-05,9.1e-05,0.000267,0.000353,0.000434,0.000272,0.000213,0.000361,0.000199,0.000483,0.00037,0.000367,0.000297,0.000184,0.000773,0.00066,0.00049,0.000382,0.000769,0.000287,0.000429,0.000531,0.000278,0.000249,0.000408,0.000533,0.000327,0.000481,0.000527,0.000662,0.000517,0.000426,0.000486,0.000811,0.000214,0.000307,0.000243,0.000558,3.7e-05,0.000383,0.000433,0.000336,0.000439,5e-04,0.000487,0.000811,0.000576,0.000717,0.000283,0.000445,0.000977,0.00048,0.000193,0.00151,0.001111,0.000634,0.001305,0.0014,0.001071,0.001222,0.000569,0.000438,8.6e-05,0.000563,0.000529,0.000776,0.001067,0.001396,0.001939,0.001383,0.00116,0.000502,0.000799,0.001059,0.00097,0.001774,0.001226,0.000271,0.001047,0.001021,0.000123,0.001495,0.000286,0.000575,0.000565,0.00067,0.000192,0.001684,0.001983,0.001494,0.001452,0.001682,0.001204,0.000794,0.00132,0.001579,0.001763,0.000671,0.000592,0.000427,0.000951,0.001142,0.001056,0.001233,0.001232,0.000381,0.000689,0.00081,0.000689,0.000378,0.000908,0.000872,0.001043,0.000649,0.000252
0.000144,7e-05,8e-05,3.7e-05,8.2e-05,0.000111,0.000158,0.000147,4.8e-05,0.000275,0.000412,0.000243,0.000311,0.000459,0.000265,0.000314,0.000223,0.000673,0.000712,0.000308,0.00068,0.001331,0.001565,0.000677,0.000282,0.001064,0.000736,0.000684,0.000652,0.000144,0.000727,0.000779,0.001134,0.001125,0.000498,8.4e-05,0.000199,0.000555,0.000791,0.000965,0.000762,0.000512,0.000321,0.000428,0.000743,0.000254,0.000489,0.000232,0.000693,0.001128,0.00158,0.001457,0.000786,0.000338,0.000395,0.000612,0.000655,0.000681,0.000891,0.001821,0.001552,0.001442,0.001593,0.001159,0.00074,0.000589,0.000709,0.000706,0.000371,0.000407,0.001143,0.001122,0.001082,0.000887,0.000406,0.001958,0.001888,0.002022,0.001511,0.001621,0.000843,0.000876,0.000893,0.001335,0.001701,0.000535,0.000239,0.001142,0.001292,0.001125,0.001044,0.000817,0.000553,0.001188,0.00163,0.000811,0.000965,0.001177,0.00093,0.000535,0.00096,0.001027,0.000737,0.000149,0.000968,0.000773,0.000773,0.000535,0.000927,0.000534,0.000625,0.001367,0.00103,0.001599,0.001197,0.000757,0.001068,0.001419,0.00146,0.001776,0.001747
6.8e-05,7.3e-05,4.3e-05,8.4e-05,0.000111,4.8e-05,9.5e-05,0.00017,5.8e-05,5e-05,0.00027,8.1e-05,0.000136,0.000267,0.000169,0.000385,0.00033,0.000493,0.000394,0.000301,0.00072,0.000487,0.000485,0.000756,0.000356,0.00071,0.000379,0.000452,0.00122,0.000735,0.000408,0.000878,0.000375,0.000513,0.00048,0.000315,0.000976,0.000499,0.000535,0.002025,0.000985,0.000598,0.000435,0.000275,0.000524,0.001353,0.000288,0.000964,0.000345,0.000299,0.000697,0.000594,0.000409,0.000351,0.000695,0.000877,0.001688,0.000125,0.001193,0.002097,0.00081,0.001381,0.001929,0.000324,0.00068,0.000558,0.000965,0.00051,0.00124,0.000747,0.001253,0.001497,0.000627,0.000203,0.00062,0.000125,0.00049,0.001165,0.00168,0.001587,0.000754,0.000895,0.001135,0.001596,0.000775,0.00027,0.000815,0.001079,0.00054,0.000438,0.001107,0.000179,0.000272,0.000962,0.000352,0.000316,0.001169,0.002683,0.001481,0.000987,0.000678,0.001282,0.000954,0.000623,0.000298,7e-04,0.001226,0.00144,0.001383,7e-04,0.000834,0.00142,0.00093,0.001667,0.000212,0.00055,0.001019,0.000224,0.001356,0.000762,0.001325
4.2e-05,0.000108,7.2e-05,8.5e-05,4.7e-05,7.6e-05,6.2e-05,0.000138,0.000267,0.00024,0.000252,0.000224,6.7e-05,0.000201,0.000187,0.000734,0.000836,0.000805,0.00031,0.000278,0.000602,0.000154,0.000397,0.000756,0.000692,0.000738,0.000562,0.000906,0.002194,0.003199,0.001315,0.000654,0.000261,0.001593,0.001339,0.000893,0.00145,0.000827,0.000928,0.00243,0.001689,0.000438,0.000961,0.000624,0.000355,0.0015,0.002272,0.00214,0.0012,0.000373,0.000423,0.001681,0.001777,0.000985,1.5e-05,0.000955,0.001531,0.002009,0.000873,0.00127,0.002291,0.002553,0.00411,0.003665,0.001717,0.000843,0.001383,0.000297,0.001759,0.000869,0.001998,0.003881,0.002786,0.000478,0.001382,0.002317,0.002678,0.002512,0.004259,0.004262,0.003302,0.003048,0.004267,0.003992,0.003047,0.001193,0.001736,0.002477,0.00211,0.000942,0.001348,0.001561,0.001188,0.00195,0.002295,0.001814,0.002222,0.003416,0.001727,0.001225,0.001441,0.002347,0.001677,0.000924,0.000903,0.000429,0.001478,0.001522,0.002933,0.003114,0.00134,0.00198,0.001915,0.000897,0.001576,0.001917,0.000646,0.000972,0.000312,0.001271,0.001252
9.8e-05,0.000224,0.000169,6.3e-05,1.7e-05,5.6e-05,0.000118,0.000176,0.00036,0.000413,0.000228,0.000582,0.000461,0.000307,0.000488,0.001119,0.001499,0.000646,0.000603,0.000861,0.001185,0.000908,0.000779,0.001441,0.000516,0.000911,0.000728,0.000989,0.002501,0.003192,0.003098,0.002252,0.002018,0.002927,0.002885,0.002026,0.001938,0.00187,0.002327,0.003652,0.003286,0.002534,0.002731,0.002595,0.000993,0.000983,0.001603,0.002408,0.002006,0.001167,0.001136,0.002544,0.00271,0.001903,0.000911,0.000536,0.002058,0.002291,0.002854,0.00344,0.003193,0.001865,0.002682,0.002549,0.001225,0.001329,0.000593,0.001278,0.002596,0.001566,0.002196,0.003805,0.002962,0.002712,0.002131,0.003137,0.00376,0.001374,0.002787,0.004026,0.003391,0.000701,0.002896,0.001673,0.00109,0.002845,0.003651,0.003098,0.002995,0.002707,0.001869,0.001047,0.000613,0.001742,0.001498,0.001432,0.000746,0.001124,0.000971,0.001396,0.00195,0.001555,0.002835,0.002762,0.001434,0.001366,0.002278,0.001965,0.002842,0.003327,0.002524,0.001728,0.000825,0.001787,0.00148,0.000896,0.001828,0.002166,0.002162,0.001622,0.001609
5.3e-05,0.000146,6.1e-05,4.1e-05,4.6e-05,8.6e-05,8.4e-05,9e-05,0.000258,5.7e-05,0.000257,0.000473,0.000394,0.000169,0.000414,0.00096,0.00045,0.000598,0.000499,0.000463,0.00067,0.000998,0.000337,0.001003,0.001262,0.000809,0.000657,0.000528,0.001182,0.001143,0.001499,0.000393,0.001359,0.001523,0.001089,0.000902,0.001544,0.001049,0.000798,0.001156,0.00108,0.000611,0.001389,0.001011,0.000807,0.000249,0.001227,0.00073,0.000741,0.000601,0.000771,0.001295,0.000473,0.000536,0.000328,0.000666,0.000848,4e-04,0.000747,0.001007,5e-04,0.001126,0.001115,0.000489,0.000893,0.001231,8e-04,0.001262,0.001551,0.000904,0.001533,0.001151,0.00025,0.001189,2e-04,0.002086,0.00162,0.001769,0.000937,0.002517,0.001692,0.001958,0.001428,0.000462,0.001329,0.001762,0.000569,0.000639,0.001516,0.000563,0.000183,0.000465,0.00064,0.000304,0.000565,0.000869,0.001246,0.001237,0.000989,0.000704,0.001001,0.001321,0.001222,0.000538,0.000387,0.001173,0.000759,0.000832,0.001452,0.000496,0.001356,0.001098,0.000604,0.000499,0.000876,0.000951,0.002058,0.002107,0.001026,0.001011,0.000583
1.5e-05,8.4e-05,9.2e-05,6.1e-05,4.9e-05,8.8e-05,0.000115,8.4e-05,0.000103,7.8e-05,0.000199,0.000123,0.000157,0.000103,0.000242,0.000321,0.000212,0.00046,0.00024,0.000247,0.000525,0.000305,0.000246,0.000442,0.000447,0.000386,0.000169,0.000277,0.000439,0.000683,0.000698,0.000658,0.000325,0.000622,0.000404,0.000386,0.000392,0.000614,0.000566,0.000994,6.8e-05,0.000619,0.000973,0.000107,0.000236,0.00021,0.001091,0.000996,0.000665,0.000384,0.000691,0.000648,0.000541,0.000831,0.000633,0.000732,0.000928,0.000491,0.000183,0.000336,0.000231,0.000328,0.00122,0.00079,0.001171,0.000537,0.000464,0.000531,0.000406,0.000755,0.00134,0.001316,0.000432,0.000683,0.00062,0.000572,0.001332,0.000738,0.000297,0.00118,0.000714,0.00033,0.000313,0.000608,0.000903,0.000549,0.00092,0.000893,0.000425,0.000645,0.00055,0.000597,0.000201,0.000363,0.000654,0.000786,0.000308,0.000774,0.000232,0.001036,0.000123,0.000747,0.000679,0.000656,0.000721,0.000861,0.000924,0.000882,0.000486,0.000188,0.001001,0.00073,0.000753,0.000235,0.000255,0.000948,0.000755,0.000417,0.001118,0.000355,0.000394
4e-05,6e-06,4.7e-05,4.3e-05,1.7e-05,5.6e-05,6.8e-05,1.8e-05,9.4e-05,1.9e-05,9.1e-05,8.2e-05,0.000115,4e-05,0.00011,0.000305,0.000161,0.000241,0.000227,3.8e-05,0.000125,0.000278,0.000194,0.000113,0.00031,0.000268,0.000114,9.9e-05,0.000365,0.000521,0.000401,0.00027,0.00048,0.000581,0.000376,0.000384,0.000291,0.000221,0.000299,0.000519,0.000122,0.000213,0.000482,2.8e-05,0.000254,0.00025,0.000809,0.000638,6.5e-05,0.000272,0.000108,0.00013,0.000171,0.000301,0.000328,0.000231,0.000296,0.000138,0.000368,0.000746,0.000602,0.000315,0.000816,0.000549,0.000443,3e-04,0.000143,0.000459,0.000327,0.000693,0.000173,0.000536,9.3e-05,0.00065,0.000367,0.000393,0.00064,9.2e-05,0.000787,0.001246,0.000268,0.000338,0.000597,0.000371,0.000518,0.000383,0.000217,0.000776,0.000137,0.000169,0.000635,0.000605,0.000566,0.00068,0.000714,0.000184,0.000417,0.000454,0.000462,0.000692,8.6e-05,0.000407,0.000125,4.1e-05,0.000748,0.000619,0.000375,0.00057,0.000437,0.000337,0.000271,0.000252,0.000309,8e-05,0.000325,0.000639,0.000354,0.000182,7.5e-05,0.000198,0.000333
2.5e-05,2.9e-05,2.2e-05,2e-05,5e-06,1e-05,5.4e-05,2.7e-05,6e-05,4e-05,7.7e-05,4.6e-05,5.3e-05,5.5e-05,0.000119,0.00022,0.000126,7e-05,0.000139,4.2e-05,0.000151,7.3e-05,0.000102,0.000209,0.000166,0.000211,9e-06,0.000266,0.000241,0.000383,0.000249,0.00027,0.000401,0.000358,0.000317,0.000174,0.000171,0.000214,0.000111,0.000471,0.000212,8.6e-05,0.000203,0.000201,0.000348,0.000342,0.000288,0.000269,8.5e-05,0.000255,0.000181,8.4e-05,0.000159,0.000287,0.000186,2.2e-05,0.000162,0.000168,0.000359,0.000444,0.000199,0.000224,0.000609,0.000333,0.000236,8.6e-05,8.8e-05,0.000239,0.000211,0.000259,0.000266,0.000442,0.000142,0.000671,0.000233,0.000624,0.000263,0.000211,0.000396,0.00064,0.000301,0.000575,0.000389,0.000263,0.000289,0.000191,0.000296,0.000626,0.000101,0.000354,0.000213,0.000167,0.000288,0.000371,0.000783,0.00021,0.000335,0.000213,0.000153,0.000737,0.000151,0.000272,0.000394,0.000264,0.000366,0.000352,0.000226,0.000363,0.000436,0.00021,0.000253,0.000286,0.000338,0.00022,0.000533,0.000613,8.9e-05,0.000158,0.00038,0.000208,3.9e-05
1.6e-05,2.3e-05,5e-05,4.5e-05,2.1e-05,2.4e-05,3.2e-05,2.5e-05,5e-05,3.5e-05,8.7e-05,5.1e-05,6.6e-05,5.3e-05,1e-04,0.000129,6.6e-05,5.6e-05,0.000101,7.9e-05,0.000115,1.2e-05,0.000159,4.3e-05,0.000171,1.2e-05,0.000109,0.000287,0.000297,0.000365,0.000101,7.5e-05,0.000231,0.000403,0.000332,0.000169,0.000168,0.000261,0.000229,0.000336,0.000195,4.8e-05,0.000133,2.8e-05,0.000147,0.000142,0.000217,0.000129,4e-06,0.000217,0.000192,0.000137,0.000208,8.7e-05,0.000103,6.7e-05,0.000284,0.000229,0.000197,0.000203,0.000162,0.000233,0.000476,0.000255,0.000433,0.000191,0.000154,0.000132,0.000303,0.000247,0.000246,0.000373,0.000209,0.000799,0.000295,0.000556,0.000114,0.00038,8.5e-05,0.000346,0.000682,0.000673,0.000273,6.4e-05,0.000414,0.000267,0.000529,0.000566,6.5e-05,0.000591,0.000255,0.000104,0.000284,0.000368,0.000571,0.000129,0.000345,0.000379,0.000345,0.000767,0.000504,0.000301,0.000241,0.000194,0.000403,0.000454,9.2e-05,0.000489,0.000297,0.000534,0.000237,1e-04,0.000513,0.000283,0.000488,0.000315,0.000433,0.000315,0.000381,0.000119,0.00044
3.9e-05,5.4e-05,5.9e-05,2e-05,2.9e-05,1.1e-05,4.6e-05,9e-06,4.2e-05,3.4e-05,5.8e-05,6.2e-05,7.2e-05,3.9e-05,9.8e-05,0.000169,8.5e-05,8.6e-05,4.9e-05,4e-05,0.000139,9e-05,0.000241,0.000144,0.000146,0.000182,5.5e-05,0.000256,0.000271,0.000357,9.3e-05,0.000117,0.000353,0.000327,0.000217,6.2e-05,0.000348,5.1e-05,0.000223,0.000414,0.000153,0.000117,0.00025,0.000183,4.9e-05,0.000132,0.00038,0.000132,0.000135,0.000204,0.000162,0.00016,0.000228,0.000317,0.00016,0.000166,0.000213,0.000242,0.000351,0.000114,0.000491,0.000353,0.00053,0.000352,0.000582,0.000142,0.000364,0.000237,0.000392,0.000305,0.000344,0.000163,0.000192,0.000872,0.000354,5.3e-05,0.000434,0.000563,0.000248,0.000394,0.000483,0.00037,0.000771,0.00046,0.000762,0.000191,0.000529,0.000615,0.000162,0.000662,0.000292,0.000451,0.000752,0.000223,0.000856,0.000212,0.000154,0.000693,0.000623,0.000562,0.000367,0.000264,0.000288,0.00045,0.000292,0.000323,0.000274,3.5e-05,0.000315,0.000742,0.000542,0.000359,0.000896,0.000435,0.00051,0.000848,0.000416,0.000605,0.000168,0.000112,0.000633
2.6e-05,4.4e-05,2e-06,5.2e-05,2e-05,2.1e-05,3.4e-05,3.8e-05,6e-05,3.4e-05,8.3e-05,7.1e-05,0.000101,3.2e-05,4.5e-05,9e-05,0.000217,0.000138,6.8e-05,6.9e-05,0.000237,0.000232,0.000156,0.000125,9e-05,0.000312,0.000106,0.000219,0.000385,0.000347,0.000115,0.000179,0.000389,0.000123,0.000293,0.000252,0.000312,4.5e-05,0.000193,0.000328,0.000472,0.000493,0.00043,0.000316,0.000206,7.1e-05,0.000504,0.000223,0.00012,0.000247,1.3e-05,0.000292,0.000361,0.000126,8.8e-05,0.000345,0.000733,0.000495,0.000313,0.000584,0.000551,0.000311,0.000814,0.000303,0.00033,0.000925,0.000599,0.000147,0.000251,4e-04,0.000478,0.000843,0.000669,0.001304,0.001127,0.000827,0.000346,0.000929,0.000586,0.000438,0.001064,0.001543,0.000597,0.000224,7.6e-05,0.000709,0.000802,0.001046,0.000419,0.000241,0.000265,0.000386,0.000655,0.000628,0.001154,0.00102,0.000761,0.001082,0.000768,0.001075,0.001062,0.00039,0.000685,0.000938,0.000513,0.000368,0.000147,0.001118,0.000204,0.000452,0.000399,0.000424,0.001196,0.001052,0.000377,0.000778,0.000381,0.000859,0.000864,0.000283,0.000481
7e-06,3.1e-05,3.9e-05,4.6e-05,3.4e-05,1.1e-05,1e-05,3.4e-05,4.1e-05,5.1e-05,0.000102,0.000122,0.000173,8.2e-05,0.000181,0.000185,0.00016,0.000121,7.4e-05,0.000135,0.000318,0.000211,0.00039,0.000391,0.000245,0.00033,0.000101,5.7e-05,0.000167,0.000292,0.000212,0.000433,0.00023,0.00017,0.000421,5.5e-05,0.000225,0.000364,0.000454,0.000434,0.000562,0.000981,5e-04,0.000424,6.9e-05,0.000434,0.000923,0.000602,0.000729,0.000274,0.000291,0.000656,0.000366,0.000334,0.000422,0.000463,0.000728,0.000258,0.000555,0.001488,0.001099,0.000508,0.001333,0.001073,0.001318,0.001797,0.000912,0.000223,0.000154,0.000241,0.000367,0.000979,0.000552,0.001308,0.001447,0.001193,0.000894,0.00131,0.001762,0.001213,0.001588,0.003066,0.002673,0.001776,0.000735,0.001164,0.001764,0.002824,0.002611,0.001339,0.000572,0.00056,0.000742,0.000602,0.000837,0.000953,0.001163,0.00135,0.002027,0.002728,0.003529,0.002464,0.001959,0.000605,0.001,0.000453,0.000364,0.001748,0.001423,0.000745,0.000501,0.000699,0.000968,0.000447,0.000304,0.000654,0.000887,0.000248,3.2e-05,0.000576,0.000914
3.3e-05,1.4e-05,2.5e-05,3.3e-05,2e-05,2.7e-05,3.7e-05,2.9e-05,4.9e-05,0.000103,4.1e-05,0.000114,0.000135,0.000113,0.000279,0.000136,0.000233,0.00022,0.000174,0.000119,0.000138,9e-05,0.000231,0.000199,0.000246,0.000169,0.000443,0.000339,0.000351,0.000609,0.000387,0.000636,0.000502,0.000189,0.000928,0.000742,0.000564,0.000534,0.000232,0.000841,0.00133,0.000683,0.000173,0.000782,0.000602,0.000335,0.000762,0.000875,0.000786,0.000657,0.000508,0.00112,0.000394,0.000572,0.000489,0.000559,0.001086,0.00114,0.000924,0.000849,0.001369,0.001105,0.000608,0.000285,0.00152,0.002285,0.001491,0.001464,0.00076,0.000471,0.000715,0.00084,0.001085,0.000455,0.000657,0.000899,0.001994,0.001297,0.001467,0.001658,0.001965,0.001377,0.001471,0.000579,0.001229,0.001024,0.0012,0.002575,0.002344,0.001493,0.000843,0.00071,0.000681,0.000193,0.000518,0.000659,0.001336,0.000279,0.001199,0.00096,0.001883,0.000648,0.000874,0.000366,0.001055,0.000987,0.000976,0.001071,0.000185,0.000337,0.000526,0.000608,0.001222,0.001053,0.00069,0.000632,0.000655,0.000628,0.000895,0.001038,0.001308
4e-05,1.5e-05,1e-05,2.4e-05,4.3e-05,1.9e-05,6.7e-05,7.2e-05,8.8e-05,0.000144,8.3e-05,0.000209,0.000283,4e-04,0.000415,0.000372,6e-04,0.000649,0.000649,0.000468,0.000307,0.000429,0.000238,5.1e-05,0.000116,0.000363,0.000731,0.000303,0.000642,0.000725,0.000188,0.000407,0.000108,0.000197,0.001112,0.001412,0.000652,0.000585,0.000187,0.000837,0.000151,0.000207,0.000357,0.001056,0.00073,0.00075,0.000817,0.001267,0.001533,0.001131,0.000477,0.000809,0.000629,0.000881,0.001375,0.00146,0.000726,0.000518,0.000427,0.000424,0.000833,0.000614,0.000599,0.000458,0.001993,0.001121,0.000673,0.001007,0.000891,0.000209,0.000871,0.000486,0.00031,0.000137,0.000606,0.000405,0.001407,0.000604,0.001595,0.000489,0.000565,0.001107,0.000596,0.000397,0.000899,0.000408,0.001113,0.000937,0.000777,0.000171,0.000236,0.000388,0.000717,0.00057,0.000683,0.000499,0.000498,0.000596,0.000318,0.000304,0.001245,0.000643,0.000407,0.000169,0.000556,0.000233,0.000495,0.000938,0.00083,0.000435,0.000386,0.000648,0.000827,0.000218,0.000351,0.000226,0.000367,0.000216,0.000904,0.000598,0.000442
6.1e-05,4.2e-05,2.5e-05,3.3e-05,1.7e-05,2.4e-05,5.9e-05,0.000134,5.2e-05,5.4e-05,4.7e-05,0.000231,0.000126,0.00029,0.00047,0.000442,0.000502,0.000365,0.000175,9.3e-05,0.000212,0.000418,0.000154,0.000176,0.000291,0.000663,0.000954,0.000643,0.000756,0.000465,0.000503,0.000612,0.000152,0.000485,0.000331,0.000581,0.00058,0.000428,0.000741,0.000538,0.000198,0.000219,0.000619,0.000536,0.000294,0.000266,0.000412,0.001041,0.00016,0.000252,0.000224,0.00016,0.000222,0.000347,0.000743,0.000268,0.000333,0.000594,0.000593,0.000548,0.000321,0.000368,0.000325,0.000101,0.001535,0.000985,0.000342,0.000504,0.00038,0.000462,0.00087,0.000176,9e-05,0.000251,0.000303,0.000732,0.000105,0.000742,0.000354,0.000206,0.00047,0.000765,0.000443,0.000266,0.000299,0.000291,0.001122,0.00078,0.000914,0.000522,0.00024,0.000534,0.000475,0.000189,0.000237,0.000296,0.000204,0.000381,0.000486,0.000341,0.000448,0.000365,0.000341,0.000202,0.000177,0.000401,0.000388,0.000574,0.00052,0.000363,0.000676,0.00017,0.000277,0.000598,0.000128,6.4e-05,0.000124,0.000307,0.000407,0.000417,0.000544
1.8e-05,2.1e-05,1.8e-05,2.8e-05,1e-05,1.4e-05,2.1e-05,7.3e-05,6.9e-05,3.7e-05,5.9e-05,0.000122,6.3e-05,0.000228,9.6e-05,0.000131,0.000233,8.4e-05,0.000179,0.000112,0.000214,0.000183,0.000234,0.000266,0.000169,0.000461,0.000304,5.1e-05,0.00027,0.000297,0.00029,0.000217,0.000287,0.00038,0.000305,0.000183,0.000154,0.000224,0.000506,0.000493,0.000241,0.000202,0.000333,6e-05,0.000109,8.2e-05,0.000365,0.000519,0.00027,0.000193,0.000227,3.3e-05,0.000261,0.000249,0.000139,0.000279,0.000335,9.6e-05,0.000261,0.000303,0.000114,5e-04,0.000361,0.000121,0.001003,0.000263,3.4e-05,0.000121,0.000336,0.00029,0.000105,0.000134,0.000265,0.000376,0.000123,0.000405,0.000164,5.5e-05,5.1e-05,5e-04,0.000297,0.000387,0.000329,0.00018,0.000437,0.000225,0.000506,0.000344,0.000469,0.000225,0.000239,0.000286,0.00044,0.000141,0.000207,0.000378,0.000352,0.000679,0.000247,0.000719,0.000372,0.000216,0.000199,6.6e-05,0.000267,0.000249,0.000378,0.000245,0.00016,0.000112,0.000371,0.000256,5e-05,0.000183,0.000167,0.000158,0.000142,0.00023,0.000285,0.000321,0.000203
1.4e-05,1.4e-05,1e-05,2e-05,1.4e-05,3e-06,2.2e-05,3.4e-05,1.6e-05,1.1e-05,2.7e-05,5.7e-05,2.2e-05,0.000134,9.1e-05,2.4e-05,6.9e-05,7.1e-05,6.5e-05,1.2e-05,0.00014,4.6e-05,0.000197,9.7e-05,0.000215,0.000249,9.4e-05,0.000111,0.000123,0.000235,0.000373,0.000242,0.000206,0.000176,0.000219,2.8e-05,6.9e-05,0.000151,0.000337,0.000352,0.000241,0.000264,0.000248,0.00014,5.6e-05,3.3e-05,0.000273,0.000367,9.1e-05,0.000193,6.7e-05,0.000225,0.000185,0.000196,0.000192,0.000291,0.00019,0.000104,4e-05,0.000368,0.000152,0.000264,0.000126,0.000124,0.000548,0.000144,0.000185,0.000294,0.00011,0.000139,5.1e-05,0.000306,0.000321,0.000125,5.4e-05,0.000182,0.000323,0.000132,0.000386,6.3e-05,0.000251,0.000136,0.000324,9.1e-05,0.000321,0.000414,0.000436,0.000348,0.00024,0.000296,0.00025,0.000261,0.000239,2e-04,8.8e-05,0.000169,0.000145,0.000309,0.000137,0.000348,5.3e-05,0.000166,0.000208,0.000134,0.000225,0.000235,0.000182,0.000272,1e-04,6.8e-05,0.000141,0.000121,2.9e-05,0.000202,9.6e-05,0.000129,0.000232,0.000109,0.000125,5.7e-05,0.000291
3e-06,8e-06,3e-06,1e-05,1e-05,8e-06,5e-06,1.2e-05,9e-06,3e-06,9e-06,2e-05,1.7e-05,5.6e-05,4.6e-05,2.7e-05,9e-06,2.6e-05,2.5e-05,1.6e-05,3.8e-05,1.3e-05,8.2e-05,3e-05,8.7e-05,9.5e-05,3.9e-05,5.3e-05,7.6e-05,9.2e-05,9.3e-05,3.9e-05,8.7e-05,0.000136,4.9e-05,1.8e-05,4.6e-05,4.3e-05,0.000114,0.000139,7.1e-05,6.5e-05,7e-05,6.1e-05,1.8e-05,2.7e-05,0.000134,0.000138,8.5e-05,7.2e-05,3.2e-05,5.5e-05,1.8e-05,9e-05,7.2e-05,7.3e-05,8.9e-05,5.2e-05,4.8e-05,0.000101,6.4e-05,7.9e-05,0.000124,5e-06,0.000216,3.2e-05,5.4e-05,5.8e-05,6.2e-05,3.7e-05,0.000137,5.8e-05,0.000125,2.5e-05,7.3e-05,6.4e-05,0.000161,6.8e-05,0.000176,0.000122,0.000107,7.7e-05,7.1e-05,3.8e-05,9.8e-05,8.6e-05,0.000138,0.000131,5.2e-05,6.9e-05,6.8e-05,1.9e-05,2.6e-05,2.5e-05,2e-05,6.9e-05,4.8e-05,0.000112,8.1e-05,0.00011,3.8e-05,1.1e-05,5.8e-05,7.5e-05,9.1e-05,6.3e-05,0.000119,8.6e-05,2.1e-05,1.6e-05,1.9e-05,3.2e-05,4.4e-05,0.000122,6.8e-05,9.4e-05,4.6e-05,1e-05,6.3e-05,7.1e-05,0.000151
2e-06,1.2e-05,6e-06,5e-06,2e-06,3e-06,2e-06,9e-06,7e-06,8e-06,1e-05,2.1e-05,6e-06,3.7e-05,1.9e-05,3.1e-05,2.1e-05,1e-06,2.6e-05,2.1e-05,2.9e-05,1.7e-05,6.2e-05,1.1e-05,6.7e-05,4.5e-05,1.1e-05,5.3e-05,6.3e-05,5.3e-05,6.5e-05,6.8e-05,6.6e-05,0.000135,4.8e-05,1.4e-05,2.2e-05,2.3e-05,8.2e-05,0.00012,4.7e-05,5.3e-05,9.8e-05,4e-05,1.7e-05,2.9e-05,0.000108,0.000126,6.2e-05,8.4e-05,2.7e-05,2.9e-05,4.2e-05,9.4e-05,3.9e-05,7e-05,6.1e-05,5.5e-05,1.4e-05,3.1e-05,2.1e-05,7.5e-05,0.000114,8.5e-05,0.000194,0.000107,9.9e-05,6.1e-05,3e-05,2.1e-05,0.000118,8.6e-05,0.000112,3e-05,8.5e-05,0.000144,0.000103,6.6e-05,0.000128,0.000133,8.1e-05,6.7e-05,0.000163,9e-05,5.1e-05,9.1e-05,0.000101,8.7e-05,0.000157,5.8e-05,4.4e-05,3.1e-05,2.5e-05,2.7e-05,4.7e-05,0.000101,5.4e-05,8.3e-05,0.000102,5.6e-05,4.2e-05,5.3e-05,6.4e-05,4.5e-05,7.6e-05,5.3e-05,0.000101,0.000109,4.1e-05,4e-05,2.9e-05,2.9e-05,2.9e-05,5.4e-05,1.4e-05,1.8e-05,2.9e-05,2.6e-05,2.2e-05,5.3e-05,7.3e-05
2e-06,6e-06,1e-06,5e-06,3e-06,5e-06,1e-06,2e-06,9e-06,3e-06,7e-06,7e-06,1.9e-05,2.2e-05,1.4e-05,1.6e-05,1.1e-05,1.3e-05,4.2e-05,1.5e-05,2.9e-05,1.2e-05,5.2e-05,1.7e-05,3.2e-05,3.7e-05,1.1e-05,6.4e-05,8.2e-05,8.1e-05,5.6e-05,6.9e-05,7.1e-05,8.9e-05,4e-05,5e-05,6.7e-05,3.8e-05,4.4e-05,0.000104,4.5e-05,6.5e-05,9.4e-05,1.5e-05,1e-05,2.2e-05,0.000108,0.000103,3.7e-05,5.5e-05,5.6e-05,4.9e-05,2.3e-05,6.9e-05,9e-06,5.5e-05,4.2e-05,3.8e-05,3.9e-05,4.3e-05,3.8e-05,4.7e-05,9.1e-05,7.1e-05,0.000106,8.3e-05,5e-05,6.6e-05,4e-05,5e-05,8.5e-05,5.2e-05,7.1e-05,5.9e-05,6.7e-05,7.4e-05,7.9e-05,0.000115,1e-04,8.7e-05,0.000114,7.9e-05,0.000139,2.5e-05,5e-05,7.1e-05,0.000151,6.4e-05,0.000135,8e-05,1.8e-05,3.6e-05,6.1e-05,5.6e-05,0.00011,6.1e-05,1.2e-05,5.1e-05,5.2e-05,8.5e-05,1.8e-05,1.6e-05,5.7e-05,6.6e-05,7.9e-05,6e-05,6.6e-05,4.3e-05,2.5e-05,3.5e-05,4.5e-05,3.6e-05,2.2e-05,3.4e-05,1e-05,4.6e-05,5.5e-05,6.3e-05,1.9e-05,6e-05,0.000115
1e-06,5e-06,2e-06,6e-06,1e-06,7e-06,5e-06,7e-06,9e-06,3e-06,9e-06,1.1e-05,9e-06,2.8e-05,1.8e-05,9e-06,1.5e-05,1.3e-05,3.3e-05,2.8e-05,3.1e-05,1.2e-05,4.8e-05,1.6e-05,4.6e-05,4.2e-05,1.4e-05,4.2e-05,3.4e-05,8.8e-05,3.9e-05,7.6e-05,8.6e-05,7.2e-05,3.8e-05,2.5e-05,2.4e-05,2.8e-05,5.6e-05,0.000129,5.6e-05,5.7e-05,6.4e-05,3.2e-05,9e-06,2.2e-05,6.6e-05,8.8e-05,1.9e-05,5.5e-05,2.4e-05,3.8e-05,2.8e-05,4.2e-05,4.9e-05,3.3e-05,4e-05,4.2e-05,2.3e-05,5.4e-05,1.4e-05,6.1e-05,5.7e-05,5.9e-05,0.000128,6.3e-05,6.8e-05,4e-05,5.1e-05,1.4e-05,7.6e-05,7.2e-05,4.4e-05,5.3e-05,2.5e-05,8.6e-05,0.00017,7.1e-05,0.000125,0.000132,4.9e-05,8.2e-05,2.5e-05,2.9e-05,5.8e-05,7e-05,0.000153,8.7e-05,7.1e-05,2.6e-05,3.9e-05,5.6e-05,4.3e-05,5.2e-05,5e-05,3.8e-05,1.8e-05,8.3e-05,7e-05,7.8e-05,2.1e-05,4.5e-05,6.3e-05,2.4e-05,6.4e-05,2e-05,6.4e-05,3.8e-05,2.2e-05,1.8e-05,2.2e-05,2.1e-05,1.3e-05,4e-05,1.9e-05,3.7e-05,4.9e-05,2e-05,1.7e-05,3.4e-05,9.8e-05
4e-06,9e-06,3e-06,6e-06,6e-06,4e-06,2e-06,1.1e-05,1.1e-05,8e-06,8e-06,1.4e-05,9e-06,2e-05,1.6e-05,2.3e-05,1.1e-05,7e-06,1.9e-05,2e-05,2.2e-05,1.4e-05,3.5e-05,1.3e-05,4.9e-05,3.1e-05,2.1e-05,3e-05,5.1e-05,5.9e-05,3.7e-05,6.9e-05,8.2e-05,9.7e-05,4.5e-05,1.8e-05,2.5e-05,3.3e-05,3.7e-05,1e-04,3.9e-05,5.6e-05,7.5e-05,1.9e-05,1.8e-05,0,5.7e-05,8.4e-05,1.5e-05,2.3e-05,4.9e-05,3.2e-05,1.9e-05,2.1e-05,1.1e-05,3.5e-05,6.1e-05,5.1e-05,3.1e-05,5.5e-05,5.2e-05,5.9e-05,6.7e-05,4.5e-05,0.000117,4.9e-05,4e-05,3.2e-05,1.4e-05,1.5e-05,3.1e-05,5.9e-05,5.8e-05,3.1e-05,1.5e-05,0.000114,0.000119,3.9e-05,0.00012,0.000125,4.2e-05,8.5e-05,8.7e-05,4.1e-05,6.2e-05,8e-05,0.000107,6.3e-05,6.4e-05,3.6e-05,1.3e-05,1.4e-05,3.7e-05,3.3e-05,5.1e-05,3.5e-05,1.2e-05,8e-05,4.3e-05,4.3e-05,2.9e-05,4.3e-05,8.9e-05,5.3e-05,3.7e-05,2.3e-05,5.9e-05,7.5e-05,4.2e-05,2.7e-05,3.3e-05,4.6e-05,2.7e-05,3.4e-05,2.9e-05,3.5e-05,3e-06,3.1e-05,9e-06,1.9e-05,8.4e-05
9e-06,1e-05,3e-06,3e-06,4e-06,3e-06,4e-06,8e-06,1.1e-05,1e-06,9e-06,1.8e-05,7e-06,2.6e-05,2.1e-05,3.5e-05,1e-05,8e-06,1.6e-05,7e-06,7e-06,4e-06,3.3e-05,3e-06,4.8e-05,2.5e-05,1.7e-05,3.3e-05,5.3e-05,6.2e-05,3.4e-05,6e-05,6e-05,6.9e-05,3.6e-05,1.3e-05,3.6e-05,1.8e-05,2.7e-05,8.7e-05,3.5e-05,5.5e-05,6.2e-05,7e-06,9e-06,2e-05,7.8e-05,9.1e-05,1e-05,2.3e-05,2.4e-05,5.7e-05,5e-05,3.1e-05,1.3e-05,3.3e-05,6.2e-05,3.7e-05,8e-06,5.1e-05,3.7e-05,4.2e-05,6.3e-05,3.5e-05,0.000106,5.4e-05,4e-05,5.1e-05,3.3e-05,3e-05,6.4e-05,5.4e-05,8.6e-05,7e-05,3.3e-05,0.000121,1e-04,4.7e-05,0.000154,0.000131,4e-05,7.3e-05,8.1e-05,3.6e-05,5.6e-05,6.4e-05,0.000115,5.7e-05,8e-05,6.2e-05,8e-06,2.1e-05,3.4e-05,2.5e-05,5.5e-05,2.4e-05,1.6e-05,7.1e-05,6e-05,3.4e-05,1.7e-05,1.2e-05,6.2e-05,4.6e-05,5.1e-05,4.4e-05,5.9e-05,5.2e-05,3.9e-05,2.3e-05,6e-06,1.9e-05,2.6e-05,3e-05,3.3e-05,3.4e-05,1.3e-05,3.8e-05,1.7e-05,1.6e-05,6.1e-05
7e-06,9e-06,7e-06,3e-06,2e-06,4e-06,3e-06,7e-06,9e-06,6e-06,1.2e-05,1.4e-05,8e-06,2.9e-05,1e-05,2.9e-05,9e-06,7e-06,1.1e-05,2e-05,2e-05,4e-06,3e-05,8e-06,3.8e-05,2.5e-05,9e-06,1.9e-05,6e-05,6e-05,1.8e-05,6.3e-05,7.1e-05,6.9e-05,5.2e-05,1.3e-05,4e-05,2.9e-05,2.8e-05,8.1e-05,6e-05,4.1e-05,5.2e-05,9e-06,2.6e-05,2.8e-05,6.7e-05,8.5e-05,3.6e-05,2.1e-05,8e-06,6.5e-05,1.8e-05,2.3e-05,1.1e-05,4.1e-05,5.4e-05,9e-06,2.2e-05,5.3e-05,1.8e-05,4.7e-05,5.9e-05,4.1e-05,1e-04,2.9e-05,2.3e-05,4.9e-05,2.2e-05,6e-06,5.5e-05,6.1e-05,7.4e-05,3.7e-05,8e-06,0.000101,1e-04,4.7e-05,0.000114,0.00011,2.6e-05,9.3e-05,8e-05,3.4e-05,5.3e-05,9.3e-05,9.1e-05,5.5e-05,9.4e-05,6e-05,2.6e-05,1.5e-05,2.2e-05,2.8e-05,5.6e-05,4e-05,1.4e-05,6e-05,8.5e-05,4.3e-05,1.2e-05,3.1e-05,3.3e-05,4.7e-05,4.4e-05,2.9e-05,4.3e-05,4.6e-05,2e-05,2.4e-05,8e-06,1.2e-05,3.1e-05,1.3e-05,1.1e-05,3.3e-05,1.8e-05,3.7e-05,1.9e-05,1.6e-05,7.8e-05
1e-06,8e-06,5e-06,4e-06,5e-06,3e-06,1e-06,8e-06,3e-06,6e-06,1e-05,2.1e-05,6e-06,2.4e-05,2e-05,2.5e-05,6e-06,5e-06,9e-06,1.1e-05,7e-06,6e-06,3.7e-05,4e-06,3.5e-05,2e-05,1e-06,2.5e-05,5.2e-05,6e-05,3e-05,4.8e-05,9.1e-05,0.000107,5e-05,1e-05,3.4e-05,4e-06,3.2e-05,0.000113,2.5e-05,4.5e-05,6.1e-05,1.5e-05,1.6e-05,2.1e-05,7.4e-05,9.4e-05,3.7e-05,3e-05,3.6e-05,2.1e-05,2.4e-05,2.6e-05,3.2e-05,5.3e-05,6.5e-05,3e-05,7e-06,4.7e-05,3.1e-05,6.1e-05,6.5e-05,2.4e-05,0.000129,5.9e-05,4.2e-05,4.5e-05,3.5e-05,3.7e-05,4.7e-05,7.8e-05,4e-05,4.2e-05,1.6e-05,0.000106,0.000115,5.5e-05,9.1e-05,0.000114,1.9e-05,5.3e-05,7.4e-05,4.6e-05,7e-06,6.4e-05,0.000112,3.7e-05,7.6e-05,5.7e-05,2.4e-05,1e-05,6.6e-05,5.1e-05,6.6e-05,2.2e-05,1.1e-05,4e-05,5.2e-05,7.1e-05,6e-05,5e-06,3.9e-05,4e-05,5.1e-05,1.1e-05,4.3e-05,7.8e-05,5.1e-05,2.9e-05,3.2e-05,2.8e-05,2.3e-05,4.1e-05,2.4e-05,7e-06,3e-05,2.6e-05,1.2e-05,2.6e-05,7.2e-05
9e-06,6e-06,1.4e-05,9e-06,5e-06,5e-06,2e-06,5e-06,8e-06,2e-06,7e-06,1.6e-05,8e-06,2.2e-05,1e-05,2.2e-05,9e-06,9e-06,1.2e-05,1.1e-05,1.5e-05,1.1e-05,4.4e-05,5e-06,4.3e-05,1.7e-05,1e-05,2e-05,4.1e-05,7e-05,3.8e-05,5.5e-05,6.3e-05,5.6e-05,3.6e-05,3.3e-05,3.9e-05,1e-05,1.1e-05,0.000125,4.3e-05,5.5e-05,4.4e-05,2.4e-05,1.9e-05,2e-06,5.9e-05,6.7e-05,4.2e-05,1.7e-05,4.3e-05,4e-05,1.5e-05,4.1e-05,2.5e-05,2.4e-05,4.6e-05,8e-06,4.8e-05,6.8e-05,1.4e-05,4.3e-05,0.000115,7.9e-05,0.00011,7.1e-05,6.1e-05,1.8e-05,2.8e-05,2.9e-05,2.7e-05,6.3e-05,2.5e-05,2.3e-05,2.8e-05,9.7e-05,0.000128,5.9e-05,9e-05,0.000101,5.3e-05,0.000101,7.6e-05,4.3e-05,3.6e-05,7.3e-05,9.4e-05,2.4e-05,8.3e-05,5.7e-05,4e-05,2.3e-05,6.3e-05,2.9e-05,6.5e-05,3.7e-05,7e-06,3.1e-05,3.7e-05,6.1e-05,6e-05,3.3e-05,3.8e-05,2.8e-05,5.5e-05,4e-05,6.1e-05,4.6e-05,5.5e-05,2.7e-05,3.1e-05,4.3e-05,2e-05,7.9e-05,2.5e-05,2.9e-05,3.9e-05,5.2e-05,2.7e-05,1.7e-05,4e-05
4e-06,6e-06,7e-06,1e-06,7e-06,2e-06,3e-06,3e-06,4e-06,5e-06,6e-06,1e-05,7e-06,2.2e-05,1.8e-05,2.3e-05,1.8e-05,1.7e-05,4e-06,1.5e-05,1.5e-05,4e-06,3.9e-05,2e-05,5.5e-05,2.4e-05,1.1e-05,1e-05,5.5e-05,4.9e-05,6.4e-05,2.7e-05,5.5e-05,0.000117,4.1e-05,2.4e-05,2.1e-05,2.3e-05,1.4e-05,8.1e-05,6.7e-05,2.6e-05,6.8e-05,2.6e-05,2.3e-05,1.6e-05,5.7e-05,7.6e-05,4.7e-05,3.2e-05,4e-05,1.9e-05,3.1e-05,2.4e-05,2.1e-05,2.4e-05,4.3e-05,1.4e-05,3.5e-05,4.9e-05,2.6e-05,2.2e-05,8.7e-05,4e-05,7.1e-05,6.9e-05,6.8e-05,3.7e-05,4.4e-05,2.4e-05,3.4e-05,8.2e-05,1.2e-05,5.3e-05,4.3e-05,0.000133,0.000101,6.1e-05,0.000109,9.9e-05,4.2e-05,8e-05,7e-05,3.9e-05,1.7e-05,9.7e-05,9.7e-05,8.4e-05,8.2e-05,6.1e-05,3.3e-05,2.9e-05,3.9e-05,1e-05,6.4e-05,4.7e-05,3e-05,4.1e-05,2.9e-05,6.7e-05,2.6e-05,2.7e-05,3.8e-05,2.4e-05,7.3e-05,1.5e-05,7e-05,6.7e-05,5e-05,3e-05,3.5e-05,3.4e-05,2.3e-05,3.2e-05,2e-05,4.4e-05,2.2e-05,2.9e-05,1.2e-05,2.5e-05,9e-05
1.2e-05,7e-06,1e-05,6e-06,5e-06,5e-06,6e-06,8e-06,7e-06,9e-06,1e-05,1.3e-05,1e-05,4e-06,1.2e-05,2.8e-05,1.7e-05,1.4e-05,4e-06,1e-05,1.1e-05,5e-06,3.2e-05,2.3e-05,1.6e-05,1.4e-05,1.1e-05,9e-06,3.4e-05,2.5e-05,3.4e-05,4.5e-05,2.9e-05,6.4e-05,1.4e-05,1.8e-05,3.6e-05,2.2e-05,2.6e-05,6.7e-05,3.1e-05,2.4e-05,4e-05,6e-06,1.8e-05,8e-06,6.7e-05,8.9e-05,2.5e-05,3.4e-05,4.3e-05,2.9e-05,1.4e-05,2.5e-05,7e-06,3.1e-05,2.2e-05,2.5e-05,1.8e-05,5.3e-05,7e-06,1.4e-05,9.1e-05,3.2e-05,0.00011,4.2e-05,3.3e-05,3e-05,4.7e-05,3.7e-05,3e-06,0.000117,7.3e-05,3.5e-05,4.3e-05,8.4e-05,7.8e-05,6.4e-05,0.000116,9.8e-05,1.5e-05,3.8e-05,1e-04,3.9e-05,1.2e-05,5.3e-05,9e-05,0.000101,7.6e-05,6.2e-05,2.2e-05,1.3e-05,3.2e-05,5.4e-05,4.9e-05,2.3e-05,2e-05,7.3e-05,4e-05,2.6e-05,2.1e-05,4.5e-05,5.5e-05,3.4e-05,5.5e-05,2.5e-05,4.4e-05,5.4e-05,4.2e-05,4e-06,3.4e-05,2.2e-05,9e-06,2.9e-05,2.6e-05,2.8e-05,1.8e-05,2.7e-05,2.2e-05,2.2e-05,6.6e-05
1.8e-05,5e-06,1.7e-05,1.5e-05,1.7e-05,6e-06,9e-06,2e-06,7e-06,7e-06,7e-06,1.6e-05,5e-06,9e-06,2.4e-05,2.3e-05,2e-06,2.2e-05,1.4e-05,9e-06,8e-06,6e-06,2.4e-05,3e-06,2e-05,2.7e-05,1.3e-05,9e-06,5.5e-05,4e-05,2.6e-05,5.6e-05,2.2e-05,8.6e-05,2.1e-05,1.4e-05,1.5e-05,1.2e-05,1.5e-05,8.8e-05,3.7e-05,3.2e-05,4.7e-05,8e-06,2.9e-05,2.2e-05,5.6e-05,6.7e-05,1.6e-05,1e-06,3.1e-05,2.1e-05,3e-05,2.8e-05,1.2e-05,3.8e-05,4.3e-05,1e-05,1.9e-05,3.2e-05,3.9e-05,1.8e-05,7.6e-05,5e-06,0.000109,4.9e-05,2.2e-05,9e-06,1.2e-05,6e-06,3.4e-05,6.6e-05,5e-05,2.5e-05,5.2e-05,9.4e-05,9.1e-05,5.1e-05,0.000126,5.7e-05,2e-05,3.9e-05,4.3e-05,5.5e-05,1.4e-05,5.9e-05,8.7e-05,9.2e-05,7.1e-05,5.7e-05,2.6e-05,1.4e-05,5.3e-05,4.6e-05,5.4e-05,2.4e-05,1.4e-05,7.4e-05,3.5e-05,3.7e-05,2.1e-05,1.7e-05,0.000104,1.5e-05,3.8e-05,3e-06,6.1e-05,5.5e-05,4.8e-05,1.7e-05,2.8e-05,1.5e-05,2.2e-05,5.6e-05,8e-06,5.2e-05,3.7e-05,3.5e-05,2.7e-05,1.6e-05,6.3e-05
1.3e-05,1.3e-05,2.4e-05,1.1e-05,9e-06,6e-06,6e-06,7e-06,9e-06,6e-06,1.2e-05,2.1e-05,1.4e-05,1.1e-05,1.3e-05,1.9e-05,2e-06,8e-06,8e-06,1.1e-05,2.1e-05,1e-06,2.2e-05,9e-06,3.7e-05,1.4e-05,2.4e-05,1.7e-05,5.2e-05,3.8e-05,2.7e-05,4.9e-05,2.4e-05,8.6e-05,2.6e-05,3e-05,1.2e-05,2.4e-05,1.7e-05,0.000101,1.4e-05,3e-05,6e-05,1.3e-05,3.2e-05,4e-06,4.7e-05,7.4e-05,3.4e-05,3.3e-05,3.6e-05,2.4e-05,8e-06,1.7e-05,1.7e-05,2.5e-05,5.3e-05,7e-06,1.4e-05,2e-05,1e-05,1.2e-05,8.8e-05,1.9e-05,8.1e-05,8.5e-05,6.2e-05,1.7e-05,3.7e-05,2.9e-05,1.2e-05,7.7e-05,5.9e-05,2.3e-05,8.3e-05,5.1e-05,8.6e-05,6.1e-05,0.000122,0.000105,3.1e-05,6.3e-05,4.5e-05,6.8e-05,1.6e-05,6.5e-05,8.9e-05,5.2e-05,7.8e-05,5.5e-05,3e-05,3e-05,7e-05,8.8e-05,5.8e-05,3.1e-05,2.1e-05,6e-05,6e-05,2.9e-05,5.8e-05,3.6e-05,2.7e-05,6.7e-05,5.7e-05,2.1e-05,3.8e-05,3.7e-05,6.9e-05,5.6e-05,2.7e-05,2.8e-05,2.7e-05,4.1e-05,3.1e-05,9.1e-05,5.1e-05,2.9e-05,6e-06,2.1e-05,7.8e-05
2.9e-05,1.1e-05,1.1e-05,7e-06,6e-06,8e-06,4e-06,4e-06,8e-06,5e-06,7e-06,2.6e-05,6e-06,1.7e-05,2.1e-05,2.3e-05,4e-06,1e-05,1.2e-05,1.1e-05,1.2e-05,1.1e-05,3.6e-05,1.7e-05,4.3e-05,1.6e-05,1.2e-05,3.9e-05,5.9e-05,3.4e-05,2.1e-05,5.5e-05,1.1e-05,1.2e-05,7.2e-05,3.4e-05,4e-05,9e-06,3.5e-05,9.2e-05,2.3e-05,3.6e-05,4.2e-05,1.9e-05,2e-06,2.5e-05,4.5e-05,7.1e-05,2.9e-05,3.1e-05,6.6e-05,3.9e-05,3.1e-05,6e-06,1.6e-05,1.1e-05,4.5e-05,1.8e-05,4e-05,5e-05,1.2e-05,7.2e-05,6.4e-05,1.5e-05,6.5e-05,9.5e-05,1.1e-05,3.1e-05,3.7e-05,5.7e-05,1.7e-05,9.3e-05,5.9e-05,4e-06,9.4e-05,0.000128,7e-05,9.7e-05,0.000114,7e-05,8.9e-05,8.2e-05,9e-06,8.5e-05,3.5e-05,7.7e-05,5.1e-05,7.4e-05,5.3e-05,4.2e-05,8.1e-05,8e-06,9.5e-05,0.000104,6.1e-05,5.8e-05,7.7e-05,4.3e-05,4.4e-05,3.5e-05,1.9e-05,1.3e-05,0.000136,5.1e-05,6.5e-05,3.5e-05,6.1e-05,7.3e-05,0.000127,5.6e-05,5.2e-05,3.9e-05,3.2e-05,0.000101,3.2e-05,0.000121,5.6e-05,4.2e-05,1.3e-05,2.1e-05,0.000127
1.5e-05,5e-06,3e-06,3e-06,4e-06,4e-06,5e-06,8e-06,3e-06,4e-06,7e-06,2.3e-05,2.1e-05,2e-05,9e-06,1e-05,1.2e-05,2e-05,1e-05,1.4e-05,2e-05,1.6e-05,2.3e-05,9e-06,1.9e-05,3.8e-05,1.9e-05,4.5e-05,1.7e-05,6.4e-05,1.9e-05,8.2e-05,5.4e-05,8.4e-05,2.8e-05,4.8e-05,8e-06,2.4e-05,7.9e-05,0.000123,3.2e-05,5.9e-05,1.6e-05,1.5e-05,1.2e-05,1.8e-05,8.4e-05,6.5e-05,5.3e-05,3.6e-05,6.4e-05,4.7e-05,6.5e-05,3.5e-05,7e-05,1.4e-05,6.6e-05,2.3e-05,5.4e-05,8.9e-05,7.6e-05,5.6e-05,6.4e-05,5.7e-05,7.4e-05,0.000158,0.000117,7.7e-05,0.000185,0.000146,0.000132,0.000136,2.4e-05,8.4e-05,0.000146,3.2e-05,0.000171,0.000225,0.000274,0.000266,0.000305,0.000199,0.000131,3.4e-05,8e-05,0.000167,0.000195,0.000225,0.000103,0.000136,0.000161,0.000123,0.000199,0.000249,0.00018,0.000122,9e-05,0.000181,1.9e-05,5e-05,5.3e-05,2.5e-05,0.000245,0.00023,0.000132,1e-04,0.000166,0.000199,6.3e-05,0.000178,9.9e-05,9.3e-05,3.6e-05,9.9e-05,0.000179,0.000227,0.000234,0.000186,0.000136,5.3e-05,0.000112
1.5e-05,9e-06,1e-05,1e-05,9e-06,1e-05,5e-06,8e-06,7e-06,8e-06,9e-06,1.3e-05,1e-05,1.5e-05,4e-06,4e-06,2e-05,2.8e-05,1.7e-05,2.2e-05,1.9e-05,1e-05,3.3e-05,1.1e-05,2.4e-05,2.9e-05,5e-05,5.9e-05,8.1e-05,7.5e-05,3.6e-05,2.3e-05,7.4e-05,0.000156,5.3e-05,2.9e-05,2.1e-05,3.9e-05,3e-05,4.2e-05,6e-05,8e-05,5.1e-05,3.3e-05,5e-06,3e-05,7.7e-05,0.000132,6.2e-05,0.000103,0.000117,0.00014,3.4e-05,3.4e-05,8.8e-05,0.000102,4.1e-05,5.9e-05,8.2e-05,7.5e-05,4.7e-05,5.6e-05,7.4e-05,3.2e-05,7.8e-05,0.000153,0.000145,0.000249,0.000268,0.000168,0.000104,0.000277,0.000221,6.8e-05,0.000136,0.000204,0.000205,0.000231,0.000143,0.000353,0.00025,0.000154,0.000114,0.000109,0.000147,3.1e-05,0.000134,0.00015,0.000118,9.7e-05,8.8e-05,3.1e-05,0.000157,0.000236,0.000309,0.000216,0.000166,0.000236,0.000226,0.000176,7.2e-05,2.4e-05,0.000228,0.000221,0.000159,9.8e-05,1.9e-05,0.00012,0.000181,0.000204,0.000165,0.000157,8.3e-05,6.4e-05,0.000189,0.000268,0.000104,5.5e-05,4.6e-05,3.8e-05,4.1e-05
5e-06,6e-06,2e-06,5e-06,9e-06,6e-06,6e-06,4e-06,7e-06,8e-06,1.2e-05,1.4e-05,1e-06,1.5e-05,1.4e-05,1.5e-05,9e-06,2.1e-05,5e-06,1e-05,1e-06,5e-06,2.6e-05,9e-06,3.6e-05,2e-05,2.7e-05,1.5e-05,3.3e-05,4.3e-05,4.6e-05,3.2e-05,6.4e-05,0.000104,5.4e-05,3e-05,3e-05,1.9e-05,2e-05,7.2e-05,9e-06,1e-05,3.8e-05,3.7e-05,2.9e-05,4.2e-05,6.6e-05,8.5e-05,4.3e-05,7e-05,9.2e-05,5.6e-05,3.4e-05,6.8e-05,2e-05,5.7e-05,6e-06,3.2e-05,6.4e-05,5e-06,5.6e-05,3e-05,8.5e-05,6.5e-05,4.1e-05,5.2e-05,6.5e-05,0.000105,9.9e-05,6e-05,0.000165,9.9e-05,8.2e-05,9.5e-05,0.00016,4.2e-05,0.000152,6.2e-05,6.8e-05,0.000195,5.1e-05,7.8e-05,0.000106,3.2e-05,6.9e-05,9e-06,0.000132,5.9e-05,6.7e-05,3.2e-05,4.9e-05,4.1e-05,8.8e-05,6.3e-05,9.9e-05,4.3e-05,3.9e-05,8.3e-05,7.3e-05,5.1e-05,1.6e-05,1.6e-05,0.000122,1.9e-05,4.9e-05,5.5e-05,8.1e-05,4.5e-05,1e-05,7.7e-05,8.2e-05,8e-06,2.6e-05,5.7e-05,0.000139,4.1e-05,4.4e-05,7.6e-05,2.6e-05,3.2e-05,5.7e-05
2e-06,2e-06,3e-06,2e-06,4e-06,5e-06,3e-06,0,4e-06,7e-06,8e-06,1.1e-05,1e-06,1.5e-05,1.3e-05,1.5e-05,2e-06,1.6e-05,3e-06,4e-06,3e-06,3e-06,2.1e-05,3e-06,3.2e-05,1.3e-05,1.8e-05,1.3e-05,3.7e-05,5.4e-05,2.9e-05,4.3e-05,3.7e-05,5.9e-05,2.2e-05,8e-06,2.4e-05,2.1e-05,1e-05,7.5e-05,8e-06,1.6e-05,4.8e-05,2e-06,9e-06,9e-06,5.2e-05,7.6e-05,2.9e-05,2.4e-05,2.4e-05,3.2e-05,2.4e-05,4.1e-05,2.8e-05,3.8e-05,2.7e-05,1.1e-05,4.2e-05,1.9e-05,5.1e-05,2.1e-05,8.8e-05,3.2e-05,6.1e-05,2.6e-05,4e-05,9.5e-05,5e-05,2.3e-05,0.000104,2.6e-05,1.6e-05,5.5e-05,3.5e-05,8.8e-05,0.000129,4.4e-05,5.1e-05,0.000143,5.2e-05,6.2e-05,9.9e-05,1.6e-05,5.5e-05,1.8e-05,0.000129,6.7e-05,8e-05,4e-06,2.3e-05,2.6e-05,5.7e-05,2.2e-05,6.2e-05,2.2e-05,4.6e-05,5.1e-05,6.2e-05,1.3e-05,2.7e-05,2.6e-05,5e-05,2.4e-05,5.2e-05,3.9e-05,5.7e-05,1.4e-05,2.3e-05,3.4e-05,4.3e-05,2.9e-05,3.1e-05,4.1e-05,7.3e-05,2.7e-05,3.8e-05,3.3e-05,1.5e-05,2.3e-05,4.7e-05
3e-06,1e-06,3e-06,2e-06,3e-06,4e-06,2e-06,1e-06,5e-06,6e-06,8e-06,1.1e-05,3e-06,1.2e-05,1e-05,1.3e-05,5e-06,1.4e-05,3e-06,4e-06,3e-06,4e-06,2e-05,3e-06,2.8e-05,1e-05,2e-05,6e-06,3.5e-05,5.5e-05,2.6e-05,3.9e-05,3e-05,6.5e-05,1.5e-05,5e-06,1.6e-05,1.2e-05,1.7e-05,7e-05,1.5e-05,1.5e-05,3.6e-05,4e-06,9e-06,6e-06,4.4e-05,6.8e-05,1.6e-05,1.8e-05,1.3e-05,2.8e-05,1.9e-05,3.6e-05,2.1e-05,3.7e-05,2.7e-05,1.2e-05,2.8e-05,1e-05,3.7e-05,2.5e-05,7.2e-05,3.7e-05,5.6e-05,2.3e-05,2.3e-05,7.5e-05,2.6e-05,1.1e-05,9.2e-05,2.4e-05,1.9e-05,4.7e-05,2.2e-05,9.4e-05,0.000119,3.7e-05,4.4e-05,0.000145,2.9e-05,5.6e-05,8.5e-05,1e-05,4.1e-05,1.8e-05,0.000105,5.6e-05,6.9e-05,7e-06,1e-05,2e-05,5.8e-05,1.9e-05,5.2e-05,1.7e-05,3.1e-05,4.5e-05,5.6e-05,2.2e-05,1.4e-05,2.1e-05,3.6e-05,2.9e-05,4.2e-05,3.2e-05,4.2e-05,2.7e-05,2.2e-05,2.4e-05,3.5e-05,2.8e-05,1.1e-05,3.5e-05,5.4e-05,1.5e-05,3.4e-05,3.8e-05,1.7e-05,1.8e-05,5e-05
2e-06,2e-06,2e-06,2e-06,3e-06,4e-06,1e-06,1e-06,5e-06,6e-06,7e-06,1e-05,2e-06,1.4e-05,1.1e-05,1.3e-05,4e-06,1.2e-05,5e-06,4e-06,3e-06,3e-06,2.1e-05,2e-06,3.1e-05,1.1e-05,1.8e-05,7e-06,3.6e-05,5.1e-05,2.8e-05,3.9e-05,3.3e-05,6.4e-05,1.4e-05,7e-06,1.9e-05,1.1e-05,1.6e-05,7.1e-05,3e-05,2.7e-05,4.1e-05,3e-06,8e-06,3e-06,4.2e-05,7e-05,1.6e-05,1.4e-05,1.1e-05,3e-05,2.1e-05,3.2e-05,1.5e-05,3.3e-05,2.8e-05,8e-06,2.8e-05,8e-06,3.6e-05,1.7e-05,7.8e-05,3.4e-05,6.4e-05,2.4e-05,2.6e-05,7.6e-05,1.7e-05,1.1e-05,8.8e-05,2e-05,1.8e-05,4.5e-05,2e-05,9.4e-05,0.000115,3.9e-05,3.8e-05,0.000127,3.6e-05,5.2e-05,7.6e-05,1.7e-05,4.4e-05,2.2e-05,0.000104,5.6e-05,7.2e-05,1.4e-05,1.2e-05,2e-05,5.2e-05,1e-05,4.4e-05,1.7e-05,3.2e-05,3.7e-05,4.7e-05,2.4e-05,1.6e-05,1.9e-05,2.8e-05,3.4e-05,4.1e-05,2.7e-05,4.2e-05,3.3e-05,2.4e-05,2.5e-05,3e-05,2.9e-05,1.1e-05,3.1e-05,4.7e-05,6e-06,3e-05,3.9e-05,1.4e-05,1.5e-05,4.8e-05
