-0.002357,-0.001291,-0.002079,-0.00185,-0.000686,-0.001032,-0.001855,-0.001247,-0.001268,-0.000967,-0.001516,-0.001668,-0.001119,-0.000617,-0.000544,-0.001369,-0.001181,-0.001006,-0.001106,-0.00126,-0.000765,-0.001977,-0.00127,-0.001901,-0.001728,-0.001547,-0.001403,-0.001264,-0.000932,-0.001903,-0.00101,-0.001247,-0.001593,-0.000989,-0.000788,-0.001015,-0.001195,-0.001374,-0.001539,-0.001361,-0.000741,-0.001427,-0.001254,-0.002549,-0.001774,-0.000891,-0.001733,-0.001526,-0.001749,-0.001961,-0.001998,-0.001499,-0.001693,-0.001096,-0.000958,-0.001654,-0.001031,-0.000584,-0.000741,-0.000794,-0.000459,-0.000803,-0.000804,-0.000731,-0.001163,-0.000904,-0.000406,-0.001222,-0.000756,-0.000549,-0.000552,-0.000754,-0.001079,-0.000943,-0.000634,-0.000971,-0.000577,-0.001241,-0.001181,-0.000612,-0.001212,-0.000795,-0.000999,-0.000912,-0.001113,-0.001246,-0.000695,-0.000584,-0.000373,-0.000685,-0.000639,-0.000472,-0.000703,-0.000601,-0.000663,-0.000636,-0.000514,-0.000266,-0.000188,-0.000383,-0.000467,-0.000864,-0.000747,-0.000692,-0.001393,-0.000888,-0.000456,-0.000166,-0.00055,-0.000617,-0.000498,-0.00049,-0.000344,-0.000383,-0.000553,-0.000538,-0.000549,-0.000576,-0.000394,-0.000387,-0.00034
0.001511,0.000511,0.000689,0.001183,0.000512,0.000497,0.000798,0.000618,0.000697,0.000385,0.000684,0.000936,0.000563,0.000149,0.000232,0.000894,0.000321,0.000303,0.000588,0.000476,0.000469,0.000998,0.000703,0.001059,0.001219,0.000784,0.000948,0.000913,0.000741,0.000976,0.000521,0.000627,0.000712,0.000437,7.1e-05,0.000288,0.000747,0.000849,0.000781,0.000899,0.000388,0.001236,0.000772,0.001799,0.001115,0.000204,0.001049,0.000582,0.000818,0.001232,0.001467,0.00082,0.000769,0.000464,0.000399,0.000804,0.000724,0.000335,0.000495,0.000462,1e-04,0.000532,0.000461,0.000348,0.000946,0.000473,7.2e-05,0.000729,0.00057,0.000155,0.000629,0.000459,0.00022,0.000637,4e-04,0.000622,0.000263,0.000669,0.000519,2.5e-05,0.000868,0.000531,0.000392,0.000604,0.000283,0.000884,0.00037,0.000333,-6.1e-05,0.000417,0.00051,0.000318,0.000373,0.000445,0.000598,0.000542,3e-06,-0.000208,-6.2e-05,0.000148,3.1e-05,0.000606,0.000564,0.00058,0.000841,0.000322,0.000157,2.3e-05,0.000379,0.000331,0.000176,0.000291,0.000233,0.000112,0.000418,0.000287,0.000293,0.000201,8e-05,0.00015,0.000205
-0.001083,-0.000374,-5.3e-05,-0.000727,-0.000496,-0.000158,-0.000562,-0.000308,-0.000249,-0.000274,-1.1e-05,-0.000132,0.00021,-9.9e-05,-0.000301,-0.000575,9.5e-05,-5.2e-05,-0.000101,-9.4e-05,-8.4e-05,-0.000296,-0.000185,-0.001,-0.00098,-0.000146,-0.000251,-0.000855,-0.00076,-0.000456,-0.000263,-0.000297,-0.000318,-0.000161,-0.000211,-0.000187,-0.000607,-0.000545,-0.000307,-0.000543,-0.000448,-0.000958,-0.000623,-0.001259,-0.000681,-0.000144,-0.000402,-0.000476,-0.000816,-0.00084,-0.00106,-0.000347,-0.000437,-0.000302,-0.000122,-0.000389,-0.000214,-0.000256,-0.000417,-0.000259,8e-05,-0.000398,-0.000447,-0.000331,-0.000629,-0.000172,-0.000115,-0.000582,-0.000476,0.000297,-0.000246,-0.000122,-0.000259,-0.000325,-0.000281,-0.000463,-9.2e-05,-0.000294,-0.000491,-0.000272,-0.00038,-0.00043,-0.000148,-0.00038,0.000108,-0.000539,-0.000203,-7.4e-05,8.5e-05,-4.7e-05,-0.00047,-0.000111,-0.000221,-0.000191,-0.000512,-0.000395,2.8e-05,-9.5e-05,-0.000144,-0.000117,0.000168,-0.000505,-0.000254,-0.000504,-0.000463,-0.000143,1e-04,-2.5e-05,0.000228,0.000203,-0.000162,-0.00025,-0.000169,-7.1e-05,-0.000124,-5.7e-05,-0.000215,-0.000164,-5.9e-05,-0.00012,-0.000139
0.000473,7.3e-05,-0.000239,0.000146,0.000148,0.00046,0.000384,0.000249,5.8e-05,0.00014,-0.000246,-0.000546,-0.000423,-0.000146,-6.6e-05,0.000333,-0.000409,-0.000226,-0.00047,-0.000495,-0.000398,-0.000142,-0.000386,0.00063,0.000684,-2.1e-05,-0.000284,0.000375,0.000258,-2.2e-05,0.000118,3.2e-05,-0.000102,-0.000386,0.000297,0.000208,0.000303,0.000324,0.000351,0.000285,-6.9e-05,0.000171,0.000203,0.000992,3e-04,-0.000333,-0.000293,0.000215,0.000585,0.000706,0.000576,3.9e-05,0.000173,-0.000229,4.2e-05,-4.1e-05,4.4e-05,-0.00014,0.000339,6.6e-05,-0.000109,-3.1e-05,0.000129,0.000409,0.000158,-1.9e-05,-0.000116,0.000115,0.000124,-8.1e-05,0.000147,0.000297,-2.6e-05,4e-06,0.000135,0.000321,-9e-05,5.1e-05,0.000532,0.000294,-2.3e-05,0.000133,-1.8e-05,0.000174,-0.00013,4.2e-05,7.8e-05,-0.000105,-0.000141,-4.4e-05,7.8e-05,-8.6e-05,-0.000118,0.000183,0.000348,0.000377,1e-06,-0.000187,-1e-05,-0.000135,-0.00026,3.6e-05,0.000219,9.6e-05,-9.6e-05,-0.000146,-0.000269,-0.000223,-0.000265,-0.00028,-8.6e-05,-0.000119,4.8e-05,-4e-06,-0.000113,5e-05,9e-05,-1.5e-05,-7e-05,8.3e-05,-3.6e-05
-0.000121,-8.3e-05,0.000337,0.000173,8.4e-05,-0.000694,-9.1e-05,-0.00014,-8.1e-05,-0.000111,-0.000111,0.000664,0.000254,0.000303,3.6e-05,-0.000184,0.000328,0.000158,0.000393,0.000703,0.000156,0.00012,0.000435,-0.000296,-0.000471,-0.000167,0.000398,-9.8e-05,-0.000181,0.000156,-0.000146,-9.3e-05,0.000308,0.000461,-4e-06,-6.9e-05,-0.000197,-0.000233,-4e-04,-0.00023,0.000246,-6e-06,-0.000248,-0.000699,-3.2e-05,0.000166,0.000322,-0.000402,-5.2e-05,-0.000658,-0.000392,7.7e-05,-0.000221,0.000341,-0.000135,3.6e-05,0.00022,-0.000232,-0.00025,-6.5e-05,-8.7e-05,-5e-05,-0.000125,-0.00026,-4.6e-05,-0.000133,-9.3e-05,2e-06,-9.5e-05,-6.5e-05,-6e-05,-0.000381,0.000136,2.7e-05,-0.000128,-0.000226,-0.000165,3.7e-05,-0.000371,-0.000108,9.8e-05,-0.000134,-0.000209,-0.000107,1.4e-05,1e-04,-0.000115,-3.7e-05,0.000285,0.000181,-7.8e-05,-0.000151,-4.2e-05,-0.000133,3e-06,-0.00032,0,0.000301,-1e-05,0.000165,0.000218,-1e-04,-0.000321,-2.6e-05,0.000181,0.000304,6.2e-05,6.3e-05,0.000179,0.00023,0.000139,-6.6e-05,8.4e-05,-4e-06,0.000119,6e-05,2.7e-05,4.7e-05,2.9e-05,-0.000104,-1e-06
0.000109,1e-05,-0.000276,-6.5e-05,-0.000197,0.000418,0.000107,-0.00012,-0.000243,-4.7e-05,0.000186,-0.000604,-0.000198,-8.9e-05,-7.1e-05,-1.1e-05,-0.000398,-0.000163,7e-06,-0.000216,0.000278,6.7e-05,-0.000197,0.000228,0.000181,1.1e-05,-0.000236,-0.000126,0.000548,-0.000231,0.000428,0.00011,-0.000126,-0.000168,1.9e-05,0.000233,0.000134,0.000376,0.000381,0.000202,-0.000192,0.000265,0.00031,0.000399,-0.000184,-9.2e-05,0.000126,0.000517,6.5e-05,0.00076,0.000187,0.000227,0.000297,-0.000217,0.000115,-5.5e-05,-0.000226,0.00021,0.000125,9.8e-05,6e-05,5.4e-05,7e-06,0.000146,5.1e-05,0.000169,0.00025,0.000196,-1e-05,-0.000166,-0.000116,0.000244,7e-06,1e-05,-9e-06,5.7e-05,0.00019,-8.1e-05,0.000169,0.000102,6.9e-05,0.000265,0.000194,0.000161,6.9e-05,-0.000178,-3.8e-05,7.5e-05,-0.000265,-1.3e-05,-0.000127,2.6e-05,5.8e-05,3.2e-05,-1.5e-05,0.00016,0.000274,-0.000198,-0.000123,-0.000109,-5.3e-05,0.000108,0.000377,0.000194,0.000146,0.00013,-1.9e-05,0.000193,-1.4e-05,-0.000188,-1.1e-05,0.000253,-8.4e-05,-2.1e-05,-8.5e-05,4.6e-05,6.8e-05,1.6e-05,0.000158,-1.7e-05,-1.9e-05
-0.000117,2e-04,0.000162,3.1e-05,0.000357,1.9e-05,7.8e-05,0.000134,0.000347,0.000183,-5.6e-05,0.000241,-3.2e-05,-5.1e-05,0.000138,-9.7e-05,0.000253,0.000177,7.7e-05,-4.2e-05,-0.000284,-0.000181,2.7e-05,-0.000165,-0.000285,1.5e-05,-1e-05,0.000216,-0.000417,8.4e-05,-0.00028,-0.000253,-7.1e-05,7.2e-05,-0.000253,-0.000212,-3e-05,-0.00036,-4e-04,-0.000232,0.000101,-8.4e-05,7.3e-05,-0.000118,0.000237,-5.1e-05,4e-05,-0.000243,-0.000225,-0.000735,-2.3e-05,-0.000314,-0.000161,0.000202,-8.6e-05,0.000131,4e-06,-0.000105,-6.4e-05,-6e-05,-6.2e-05,-0.000131,0.000192,-9.8e-05,-0.000125,-0.000156,-8.4e-05,5.8e-05,-0.000114,3.9e-05,5.4e-05,-2.4e-05,2.1e-05,-2e-05,-0.000213,-7.6e-05,-0.000176,-6.5e-05,-0.000106,-0.000122,-5.8e-05,-0.000101,3.1e-05,-0.000216,3e-05,0.000161,-0.00012,-0.000104,0.00011,-6.4e-05,8.6e-05,0,4.3e-05,-3e-06,-1.8e-05,-0.000125,-0.000182,-9.3e-05,0.000103,4.5e-05,-8e-06,-1.8e-05,-0.000175,-0.000145,-0.000209,-0.000172,-0.000168,-5.3e-05,-2.6e-05,6.1e-05,-2.3e-05,-0.000101,0.000116,-3e-06,-1.3e-05,-0.000226,-0.000154,9.5e-05,-0.000289,-8.2e-05,5.3e-05
9.3e-05,-0.000266,-6.1e-05,2.8e-05,-0.00032,-9.1e-05,-0.000174,6.1e-05,-0.000195,-0.000187,7.2e-05,2.2e-05,0.000173,0.000109,-0.000116,5.9e-05,-0.000199,-0.000199,2.3e-05,-3.3e-05,0.000101,0.000143,9e-06,0.000207,0.00021,-2e-06,-3.1e-05,-8.2e-05,0.000277,5.8e-05,0.000217,0.000126,-1.8e-05,-2.2e-05,0.000205,1.9e-05,-0.000208,0.000136,0.000181,0.000153,-3.1e-05,7.6e-05,-0.000154,-0.000223,-0.000176,5e-05,-0.000161,6.5e-05,0.000201,0.000353,9.5e-05,0.00026,5.1e-05,-5.4e-05,-1.8e-05,-4e-06,-1.8e-05,4.2e-05,2.5e-05,5.1e-05,0.00023,0.000123,-0.000149,-2.3e-05,3.9e-05,0.000138,-9e-05,-6e-06,-4.5e-05,0.00012,-0.000187,0.000252,0.000105,2.2e-05,0.000186,2.5e-05,0.000126,2.5e-05,6e-06,7e-06,-0.000224,4e-06,-0.000108,0.000252,-9.9e-05,-0.000171,0.000111,8.4e-05,-0.000144,1.5e-05,-3.1e-05,-2.4e-05,0.000134,-7e-06,-9.1e-05,0.000186,1e-04,0.000152,3e-06,-0.000116,-4.2e-05,4.7e-05,6e-05,9.7e-05,0.000167,0.000168,0.000181,0.00011,6.7e-05,-0.00014,-3.8e-05,0.000145,-5.8e-05,1e-05,6.8e-05,7.7e-05,9.9e-05,-0.000106,0.000107,1.7e-05,-5.5e-05
-5.1e-05,0.000116,-0.000178,-0.00014,0.000212,-4.2e-05,-3.4e-05,-0.000178,0.000127,0.000136,-7.1e-05,4.9e-05,-5.4e-05,-0.000179,-0.000104,-2.2e-05,0.000211,0.000109,-2.5e-05,-6.2e-05,-5.6e-05,-4.2e-05,-0.000144,-6.7e-05,-8.2e-05,0.000231,5e-05,-5.7e-05,-0.000199,8e-05,-0.000192,-3.6e-05,4.3e-05,-5e-05,-3.5e-05,-1.3e-05,0.00015,-0.000129,3.8e-05,2e-05,-9.4e-05,-0.000163,4e-06,0.000299,0.000142,4.5e-05,1.5e-05,-9.9e-05,5.6e-05,-0.000115,-1e-04,-0.000299,3.9e-05,0.000151,-0.000101,-0.000179,-0.000104,0.000114,-7e-06,-8.5e-05,-0.000257,-5.7e-05,5.5e-05,0.000109,-3.7e-05,4e-06,0.000143,-1e-06,1.2e-05,-2.3e-05,-2.8e-05,-0.000209,-0.000297,-4.6e-05,-0.000205,-0.00014,-8.5e-05,4.6e-05,-2.1e-05,6.6e-05,0.000252,5.5e-05,0.000117,-0.000184,7.7e-05,0.000111,-4e-06,-0.000103,6.7e-05,1.9e-05,2.3e-05,0.000164,-4.2e-05,3.3e-05,5.1e-05,-6.6e-05,-0.000228,-9.6e-05,4.8e-05,4.2e-05,-5e-06,-3.9e-05,-0.000141,-4.9e-05,-0.000176,-0.000149,-5e-05,-2.5e-05,-6.2e-05,3e-06,9.2e-05,-0.000125,9.4e-05,2.7e-05,-2.3e-05,7.7e-05,-8.2e-05,1.8e-05,-2.4e-05,1e-06,3e-06
1.9e-05,-6.1e-05,8.7e-05,4.2e-05,-0.000134,1.2e-05,9.8e-05,2e-04,-6.7e-05,-5e-05,-5.6e-05,-0.000122,-4.9e-05,3.8e-05,0.000127,2.9e-05,-4.6e-05,6e-05,-4.6e-05,7e-05,-0.000206,-6.3e-05,0.000209,-0.00013,8.3e-05,-0.000215,-3.1e-05,8e-05,3.2e-05,-0.000148,9e-05,0.000108,-0.000122,2.9e-05,5.6e-05,8.5e-05,-5.2e-05,0.000117,-1.3e-05,-2.2e-05,0.000109,0.000113,3.7e-05,-0.000288,-0.000122,-0.000119,-0.000118,0.000153,-0.000116,7.6e-05,2.1e-05,0.000223,-2.2e-05,-0.000115,1.7e-05,0.000262,0.000148,-5.1e-05,-0.000278,5e-05,0.000159,-4.5e-05,-2e-06,4e-06,2.3e-05,0.000147,-8.5e-05,-0.000123,4.8e-05,0.000102,0.000163,0.000186,0.000171,0.00016,0.000221,0.000113,6.5e-05,0.000154,9.5e-05,-4.8e-05,-6.4e-05,-1.5e-05,-0.000117,-1.3e-05,-4.8e-05,-8e-05,2.3e-05,0.000123,-5.3e-05,5.6e-05,-2e-05,-0.00012,-1e-06,-4.9e-05,-3.6e-05,4.8e-05,0.000115,8e-05,-3.9e-05,-3.8e-05,-7e-06,-8.6e-05,-2.3e-05,3e-05,9.5e-05,5.2e-05,5.8e-05,-0.000125,2.4e-05,-6.8e-05,-2e-05,4.1e-05,1e-06,-8.3e-05,2.8e-05,-8.7e-05,6.7e-05,-2e-05,2.1e-05,2.2e-05,2.5e-05
1.9e-05,2.3e-05,-8.7e-05,-3.2e-05,6.6e-05,8.1e-05,-1.3e-05,-4.8e-05,0.000115,-2e-06,0.00015,0.000111,0.00016,4.3e-05,-7.6e-05,2.5e-05,1.4e-05,-1.6e-05,9.3e-05,-3.3e-05,0.000204,4.1e-05,-0.000197,0.000124,-2.7e-05,0.000153,9.3e-05,-3.2e-05,-5.5e-05,5.4e-05,2.8e-05,-0.000115,0.000103,8.9e-05,-7.6e-05,-1.3e-05,2e-06,-6.9e-05,-0.000121,5e-06,-9.6e-05,-0.000127,3.7e-05,0.000181,0.000116,0.00022,5.3e-05,-8.3e-05,0.000144,0.000189,-7.2e-05,-0.000173,-0.000122,0.000101,6e-05,-0.000175,-9.4e-05,9.3e-05,0.000187,6e-06,-0.00012,-1.9e-05,-7.4e-05,3.4e-05,1.1e-05,-3.9e-05,2.4e-05,0.000108,7e-05,-3.5e-05,-2e-05,-0.000143,-6.3e-05,-0.000102,-0.000121,-4e-06,-5e-05,-0.000123,-0.000109,1.4e-05,-1.9e-05,3.1e-05,2.2e-05,2e-05,-4e-06,3.3e-05,-8e-06,2.1e-05,9.9e-05,-9.7e-05,5.2e-05,7.9e-05,-2.9e-05,9e-06,2.1e-05,4e-06,-4.9e-05,8.2e-05,8e-06,0.000109,1e-06,0.000186,5.5e-05,4.2e-05,-2.9e-05,-1.9e-05,5.3e-05,0.000118,-6.3e-05,3.1e-05,3.9e-05,2.5e-05,-0.00012,5.3e-05,-1.1e-05,8.8e-05,4.1e-05,3.2e-05,2.2e-05,-0.000109,0
7e-06,-2.3e-05,0.000206,1.1e-05,-1.6e-05,-2.6e-05,-5e-05,-4.5e-05,-0.000147,1.1e-05,-0.000142,-9.2e-05,-0.00013,-7e-06,1e-06,-4.3e-05,1.7e-05,-6e-05,-0.000177,-2.8e-05,-7.2e-05,7e-06,8.8e-05,-8.1e-05,-4.7e-05,-8.6e-05,4.7e-05,3.9e-05,2e-05,-0.000111,-0.000187,0.000186,-2.8e-05,-8.6e-05,6.9e-05,-5.4e-05,7.4e-05,-3.1e-05,9.6e-05,-6e-05,0.000143,3.4e-05,3.8e-05,-5.3e-05,-1.7e-05,-0.000232,-3.7e-05,5.5e-05,-0.000158,-0.000257,6e-05,0.000105,0.00018,-4.7e-05,9e-06,3.2e-05,9.7e-05,-7e-05,-4.3e-05,-5.7e-05,7.3e-05,6.1e-05,7e-05,-4.4e-05,-3.9e-05,-6.8e-05,-3.4e-05,-2.6e-05,-2e-06,-6e-05,2e-05,2.1e-05,4e-06,2.9e-05,-2.4e-05,5.9e-05,-8e-06,8.2e-05,1e-05,-4.7e-05,-1.1e-05,3e-06,2.2e-05,0,-4.4e-05,-9e-06,-1.1e-05,1.8e-05,-3.5e-05,-2.8e-05,-5e-05,-1e-05,-5e-06,4.1e-05,-2e-06,-5e-05,4.4e-05,-5.4e-05,4.5e-05,6.6e-05,-2e-05,-9.7e-05,-1.9e-05,-3.9e-05,5.5e-05,1.4e-05,-8.2e-05,-0.000105,-2.1e-05,4.6e-05,-5.8e-05,-4e-05,-3e-06,-5.5e-05,5e-06,-1.5e-05,-5.1e-05,-6.2e-05,-2.9e-05,5.2e-05,7e-06
-5.2e-05,1.2e-05,-0.00026,-3.8e-05,9.7e-05,-5e-06,2.3e-05,-4e-06,7.3e-05,2.2e-05,0.000144,5e-05,6.7e-05,2.6e-05,5.5e-05,-2.4e-05,4.1e-05,5.8e-05,0.000138,7.7e-05,3.9e-05,-6.4e-05,-8.3e-05,-1.5e-05,2.7e-05,0.000104,-6.9e-05,-4.7e-05,5.7e-05,8.7e-05,8.1e-05,-0.000134,-2.4e-05,6.8e-05,-0.000111,-4e-06,-3.8e-05,7.1e-05,-1.7e-05,-1.3e-05,-8.9e-05,-6.1e-05,-5e-06,3.2e-05,-3.6e-05,0.000169,-1.1e-05,1.6e-05,-2.7e-05,0.000109,-6e-06,1.9e-05,-0.000153,-3.2e-05,3e-05,7.8e-05,-8.3e-05,2.2e-05,2.7e-05,4.7e-05,-3.3e-05,-6.4e-05,-4.1e-05,1.5e-05,2e-06,-3e-06,4.5e-05,-6.1e-05,-3.8e-05,0.000147,-4.5e-05,2.6e-05,-1.2e-05,-1.5e-05,5.3e-05,-3.3e-05,-2.6e-05,-5.1e-05,-8e-06,2.4e-05,-5.5e-05,-8.4e-05,-3.4e-05,3.1e-05,8.5e-05,-3e-06,-2.3e-05,-2.1e-05,2.3e-05,2.4e-05,1e-05,-1.1e-05,-5.3e-05,3.5e-05,1.6e-05,5.6e-05,-4.2e-05,-2e-06,-3.8e-05,-8.6e-05,-2.3e-05,2.3e-05,2.7e-05,1.6e-05,-4.7e-05,-6.5e-05,4.2e-05,1.7e-05,3.9e-05,-3.3e-05,1.4e-05,2.5e-05,-1.4e-05,-1.2e-05,-8e-06,-2.5e-05,1.8e-05,3.7e-05,2.4e-05,1e-06,-3.1e-05
3.5e-05,-3.8e-05,0.000221,-4e-06,-0.000178,1.7e-05,3.2e-05,-6e-06,-1.8e-05,-7e-06,-9.6e-05,-1.3e-05,-5.2e-05,-8e-06,-1.1e-05,2.9e-05,-6e-06,-3.3e-05,-9.5e-05,-5.5e-05,-3.4e-05,8.6e-05,5.7e-05,5.7e-05,3e-06,-0.000103,0,6e-06,-3e-06,-2.5e-05,-9e-06,-1e-05,7.2e-05,-3.3e-05,5e-05,5e-05,-4.4e-05,-9.4e-05,4.2e-05,3.5e-05,4.8e-05,7.9e-05,-7.1e-05,5.9e-05,2e-05,-0.000144,7.2e-05,-4.7e-05,5.4e-05,7e-06,5.2e-05,-2e-05,0.000106,1.7e-05,-3.1e-05,-3.5e-05,3.9e-05,-7e-06,3e-05,2e-06,1e-06,1.8e-05,-1.1e-05,-4.2e-05,-1e-06,-2.7e-05,-6.1e-05,3.2e-05,-1.7e-05,-8.5e-05,-3.6e-05,-0.000124,-4e-06,0,-5.7e-05,5.2e-05,-1.9e-05,5.3e-05,-2.1e-05,-3.9e-05,1e-04,4.8e-05,-1.5e-05,-1.8e-05,-0.000125,-9e-06,3e-05,-6e-06,-1.8e-05,-1.4e-05,2.9e-05,1.1e-05,4.8e-05,-2.3e-05,1e-05,-6.3e-05,6.1e-05,-2e-05,-3e-06,-1e-06,4.5e-05,-4e-05,1.2e-05,-1.3e-05,1.4e-05,3.8e-05,1.3e-05,-4.9e-05,-1.3e-05,-1.6e-05,-2.8e-05,-3.1e-05,1.1e-05,-1.7e-05,2.2e-05,-1.4e-05,-1e-06,-5.1e-05,-5.4e-05,-1.2e-05,2e-06
-7e-06,2.7e-05,-0.000102,-6e-06,0.00011,-3.4e-05,-2.5e-05,5e-05,2e-05,-5e-06,5.2e-05,2.9e-05,3.5e-05,2e-06,-3.9e-05,-8e-06,-1.3e-05,2.1e-05,2.1e-05,1.2e-05,-3.6e-05,-6.7e-05,9e-06,-5.7e-05,-3e-06,3e-06,-2.1e-05,-2.3e-05,-5.4e-05,3.4e-05,4.8e-05,5.6e-05,-2.7e-05,1.4e-05,2.5e-05,-1.8e-05,3.8e-05,8.2e-05,-2.7e-05,7e-06,-7.1e-05,-6.1e-05,8e-06,-0.000102,-2.6e-05,0.000126,-2.9e-05,5.6e-05,-2.6e-05,1.5e-05,-6.5e-05,3.2e-05,-5.9e-05,-1e-05,2.8e-05,5.7e-05,-2e-05,3.1e-05,-3.9e-05,3.9e-05,5e-06,-1.2e-05,1.8e-05,1.4e-05,-1.2e-05,4.7e-05,0.000113,8e-06,8e-06,3e-05,2.4e-05,4.3e-05,-1.4e-05,-3.5e-05,1e-05,-2.7e-05,-1.5e-05,-4.7e-05,3.4e-05,3.4e-05,-7.8e-05,1e-06,7e-06,2.1e-05,9.1e-05,4e-06,1.1e-05,-9e-06,1.5e-05,1.4e-05,1.9e-05,2e-06,-3.4e-05,-6e-06,-2e-06,3.2e-05,-2.5e-05,3.7e-05,5e-06,-6e-06,-1.7e-05,4.3e-05,-4e-06,-2.2e-05,1.1e-05,-3.2e-05,2e-06,9.5e-05,2.7e-05,1e-06,-8e-06,2.5e-05,1.9e-05,-1.1e-05,-1.8e-05,0,-1.6e-05,6e-06,3.2e-05,1.8e-05,6e-06
-1.1e-05,-2.6e-05,2.4e-05,1.4e-05,-4.8e-05,4.1e-05,-3e-06,-1.6e-05,-2.2e-05,-7e-06,-2.4e-05,-7e-06,-9e-06,7e-06,2.3e-05,-2e-06,1.8e-05,-2e-05,2.3e-05,-8e-06,7.4e-05,4.4e-05,0,4.2e-05,1e-06,8e-06,-2e-06,2.9e-05,5.6e-05,-2.2e-05,-1.6e-05,-2e-05,2.4e-05,-2.1e-05,-3.5e-05,-3e-06,-5e-06,-3.1e-05,2.1e-05,0,6.5e-05,1.6e-05,3e-05,7e-06,1.6e-05,-9.8e-05,2.4e-05,-5.5e-05,1.7e-05,-2.1e-05,2.2e-05,-6.1e-05,1.3e-05,-9e-06,-2.7e-05,-3.2e-05,3e-05,-5.1e-05,6.4e-05,1e-06,-6e-06,1e-06,-1e-05,-1e-05,2e-06,-3.7e-05,-3.2e-05,-9e-06,1.4e-05,-3.6e-05,-2.1e-05,-2.1e-05,-6e-06,3.4e-05,-4e-06,2.6e-05,2e-05,3.8e-05,2.1e-05,-2.6e-05,3.6e-05,-3.4e-05,-6e-06,-3.8e-05,-4.2e-05,-1e-05,-1.2e-05,1e-05,-3.8e-05,2.5e-05,2e-06,-1.9e-05,6e-06,-1.1e-05,-1.8e-05,-6e-06,-1.5e-05,-3.1e-05,-2.2e-05,5e-06,2.7e-05,0,-2e-06,-5e-06,2e-06,3e-05,2.4e-05,-4.2e-05,-8e-06,-1e-05,1.2e-05,-1e-05,4e-06,1.5e-05,2.7e-05,1.2e-05,2e-06,7e-06,-8e-06,-2.1e-05,2e-06
1.1e-05,9e-06,-1.7e-05,1.9e-05,-1e-05,3e-06,-1.2e-05,-1.3e-05,3.8e-05,-5e-06,-1.9e-05,-2.3e-05,4e-06,-3.4e-05,-8e-06,1.6e-05,-2.2e-05,3.9e-05,-6e-06,1.1e-05,-3.4e-05,-3.2e-05,-1.1e-05,-1.7e-05,1.5e-05,-6e-06,-1e-05,-1e-06,-2e-05,-1e-05,-7e-06,2e-05,-5e-05,-1e-06,3.3e-05,1.6e-05,3e-06,-2e-06,-1.8e-05,-2.1e-05,-3.5e-05,2e-05,-3.7e-05,3.8e-05,4e-06,5.2e-05,7e-06,1.3e-05,-9e-06,-1.5e-05,1.7e-05,3.4e-05,3.1e-05,8e-06,0,8e-06,-4.1e-05,3.6e-05,-3e-05,-1.7e-05,1.2e-05,5e-06,-2e-05,2.2e-05,0,-2.4e-05,1.6e-05,3e-06,8e-06,-3.2e-05,5e-06,5.9e-05,6e-06,-6e-06,3e-06,-6e-06,-1e-06,3e-06,-2e-06,1.6e-05,-1.2e-05,1.1e-05,5e-06,2.6e-05,5e-05,2e-06,0,4e-06,2.2e-05,-3e-06,-1.6e-05,4e-06,1.9e-05,-2.4e-05,-1e-06,-2.7e-05,-1.4e-05,2.9e-05,1.4e-05,-4e-06,-7e-06,-2.5e-05,-3e-06,1e-06,-2.4e-05,-9e-06,-2.1e-05,3.1e-05,4e-06,4e-06,-1.3e-05,9e-06,-2.2e-05,1e-05,-2e-05,-1e-05,5e-06,-1e-06,-2e-06,-9e-06,-1.1e-05
-2e-06,-6e-06,1.5e-05,1e-06,4.1e-05,-3.4e-05,4e-06,-1e-05,-3.6e-05,1.9e-05,1e-05,2e-06,-2e-06,1.2e-05,-1e-05,-1.6e-05,2.9e-05,-3.9e-05,1.4e-05,-1.1e-05,1.3e-05,2.3e-05,3e-06,1.5e-05,-2.1e-05,-2e-06,1e-06,0,-2e-05,-2e-06,-7e-06,-2.7e-05,3.8e-05,-3e-06,-3.9e-05,-1e-06,-9e-06,8e-06,5e-06,-2e-06,1.7e-05,-2e-06,1.8e-05,-2.8e-05,-7e-06,-9e-06,-2.8e-05,-1e-05,-6e-06,3.4e-05,-4e-06,-2.5e-05,-4.4e-05,0,1e-06,-1e-06,5.3e-05,-2e-05,-1.1e-05,5e-06,-1.1e-05,1e-06,2.5e-05,-9e-06,-5e-06,2e-05,-2e-06,-1e-06,1.1e-05,3.5e-05,1.2e-05,-2.7e-05,-2.1e-05,-1.7e-05,-1.6e-05,-1.2e-05,-7e-06,-4e-06,3e-06,-2.1e-05,6e-06,5e-06,0,-7e-06,-3.3e-05,-6e-06,1e-05,-9e-06,-3.1e-05,-1.5e-05,1.1e-05,-5e-06,1.1e-05,2.3e-05,-1.3e-05,3e-05,-8e-06,-2e-06,-3e-06,7e-06,-1e-06,1e-05,-1e-06,6e-06,2e-06,2.4e-05,1e-06,0,-8e-06,2e-06,8e-06,-8e-06,2.4e-05,9e-06,2.1e-05,1.5e-05,1e-05,-1e-06,8e-06,1e-06,5e-06
1e-06,-1e-06,-1.3e-05,5e-06,-6.5e-05,2.2e-05,4e-06,-3e-06,2.5e-05,-1.3e-05,-2e-06,1.3e-05,-5e-06,-1e-05,1e-05,-2e-06,-2.3e-05,2.8e-05,-6e-06,1e-06,-2e-06,-2e-05,1.2e-05,7e-06,-1e-06,1.1e-05,1e-05,1e-06,2.8e-05,1.3e-05,3.1e-05,2.4e-05,-2.8e-05,-7e-06,1.8e-05,-1.2e-05,-4e-06,-1.3e-05,2e-06,5e-06,-5e-06,-5e-06,-9e-06,4.1e-05,0,-2e-06,-3e-06,8e-06,-1.5e-05,-4.2e-05,-1.4e-05,1.2e-05,3.1e-05,-3e-06,-5e-06,-2e-06,-3.3e-05,1e-06,2e-06,3e-06,4e-06,-5e-06,-2.8e-05,-4e-06,-1e-06,-4e-05,-1.3e-05,1.8e-05,-1e-06,-5e-06,-1e-05,-4e-06,1.4e-05,-6e-06,1.2e-05,2.9e-05,4e-06,-3e-06,-6e-06,7e-06,-1.7e-05,-6e-06,-5e-06,-1.2e-05,2.1e-05,-1e-06,-4e-06,-2e-06,2.7e-05,6e-06,4e-06,-4e-06,5e-06,-6e-06,0,-2.5e-05,5e-06,-1.5e-05,-9e-06,6e-06,-1e-05,-7e-06,-6e-06,-6e-06,6e-06,-1.8e-05,-3e-06,-3e-06,1.1e-05,7e-06,-5e-06,5e-06,-1.4e-05,-9e-06,-1.6e-05,-5e-06,-4e-06,4e-06,-6e-06,-1e-06,3e-06
-3e-06,0,9e-06,-1e-05,4.7e-05,-7e-06,-9e-06,1.6e-05,-1.3e-05,0,5e-06,-2e-06,-1e-06,8e-06,-4e-06,5e-06,2.3e-05,-1.6e-05,1.1e-05,-2e-06,4e-06,1.6e-05,-2.6e-05,-3.2e-05,5e-06,-2e-05,0,-1e-06,-2.4e-05,-3e-06,-3.2e-05,0,-1e-06,4e-06,-1.2e-05,-1.3e-05,1.4e-05,6e-06,1.2e-05,1.6e-05,3e-06,-4e-06,1e-05,-2.9e-05,-2e-06,3e-06,-1.6e-05,-1e-05,1.8e-05,1.1e-05,9e-06,4e-06,-5e-06,4e-06,2.8e-05,-6e-06,2.7e-05,-2e-06,-2.8e-05,-5e-06,1e-06,-4e-06,2.4e-05,-4e-06,3e-06,2e-05,1.5e-05,-1.6e-05,-8e-06,1.8e-05,4e-06,6e-06,-1e-06,4e-06,-1.8e-05,-2e-06,-1e-06,-6e-06,-9e-06,-4e-06,4e-06,2e-06,5e-06,6e-06,-2e-05,0,7e-06,9e-06,-1e-05,-3e-06,2e-06,9e-06,-8e-06,7e-06,8e-06,1.2e-05,1e-06,8e-06,4e-06,-2e-06,1.1e-05,1.4e-05,1e-06,4e-06,-1e-06,1.7e-05,-8e-06,1e-05,-7e-06,5e-06,-1e-06,7e-06,1.7e-05,6e-06,1.7e-05,-1e-05,-3e-06,5e-06,8e-06,5e-06,-5e-06
0,3e-06,8e-06,-8e-06,-2.2e-05,-2e-06,-1e-06,-2e-06,4e-06,2e-06,1e-06,-9e-06,-1e-06,1.3e-05,-7e-06,-6e-06,-2.4e-05,5e-06,-9e-06,1.4e-05,1.2e-05,-1.2e-05,3e-05,2.5e-05,2e-06,5e-06,-3e-06,9e-06,2.1e-05,2e-06,-2e-06,-1.7e-05,1.6e-05,-7e-06,1.8e-05,1e-05,-1.1e-05,-9e-06,-1e-05,-1e-06,1.1e-05,6e-06,-1.1e-05,1.1e-05,4e-06,0,4e-06,1.3e-05,0,3e-06,-8e-06,-4e-06,-1.3e-05,-1e-06,-1.5e-05,-2e-06,-2.6e-05,-7e-06,3.4e-05,2e-06,2e-06,-1e-06,-1.5e-05,-2e-06,-4e-06,2e-06,-1.6e-05,1.2e-05,-8e-06,-2.2e-05,-1.6e-05,0,-3e-06,6e-06,1.3e-05,9e-06,3e-06,9e-06,5e-06,-2e-06,7e-06,7e-06,-4e-06,-3e-06,1.9e-05,-3e-06,4e-06,-1.5e-05,1.2e-05,6e-06,1e-06,-1.6e-05,1.4e-05,-6e-06,6e-06,2e-06,8e-06,-3e-06,-3e-06,-8e-06,-1.1e-05,-1.3e-05,7e-06,1e-06,-5e-06,-1.8e-05,1.4e-05,-3e-06,-1e-06,-1.2e-05,9e-06,-9e-06,-2e-06,-3e-06,-1.4e-05,5e-06,-1e-06,-1e-05,-1.1e-05,-2e-06,2e-06
-1e-06,-7e-06,-1e-05,-6e-06,2e-05,3e-06,1e-05,-4e-06,-2e-06,-1e-06,-6e-06,9e-06,4e-06,-1e-05,8e-06,7e-06,1.3e-05,1.1e-05,3e-06,-1.1e-05,-2.1e-05,7e-06,-2.6e-05,9e-06,4e-06,7e-06,-3e-06,-1e-05,-2.7e-05,-1.2e-05,6e-06,3e-06,0,9e-06,-1.2e-05,9e-06,-1e-06,7e-06,-1e-06,-6e-06,-2.3e-05,1e-06,7e-06,1e-05,0,-3e-06,3e-06,-9e-06,7e-06,8e-06,1.1e-05,1.8e-05,1.7e-05,8e-06,1.8e-05,5e-06,2.3e-05,1.5e-05,-1.1e-05,8e-06,2e-06,1e-06,9e-06,7e-06,0,5e-06,-5e-06,-1e-06,2e-06,-7e-06,-3e-06,2.1e-05,2e-06,-1.2e-05,-8e-06,-7e-06,-7e-06,-1e-06,6e-06,6e-06,-3e-06,-6e-06,1e-06,1e-06,-1.7e-05,0,-9e-06,7e-06,-1e-05,-2e-06,0,1e-05,-7e-06,5e-06,-1e-06,-7e-06,4e-06,-5e-06,2e-06,-1e-06,9e-06,-3e-06,-6e-06,0,8e-06,7e-06,-1.1e-05,-1e-05,1e-06,5e-06,-9e-06,2e-06,-1e-05,-2e-06,1.4e-05,-3e-06,-1e-06,6e-06,7e-06,-9e-06,-1e-06
0,2e-06,9e-06,0,-3.2e-05,-7e-06,-1e-06,3e-06,2e-06,-1e-06,5e-06,-8e-06,4e-06,8e-06,-3e-06,2e-06,-1.6e-05,-8e-06,-3e-06,-3e-06,1.3e-05,-7e-06,1.5e-05,-3.2e-05,-4e-06,-4e-06,1e-06,7e-06,2.5e-05,0,-8e-06,1e-05,1e-06,-6e-06,1.4e-05,-9e-06,7e-06,-3e-06,2e-06,-7e-06,2e-05,-7e-06,-1.3e-05,-2e-05,-7e-06,4e-06,1e-06,-3e-06,-4e-06,-2e-06,-3e-06,-1.6e-05,-9e-06,-9e-06,-2.5e-05,-6e-06,-2.1e-05,-1e-05,7e-06,-1e-05,-6e-06,0,-1e-05,5e-06,1e-06,1.6e-05,1.9e-05,-6e-06,7e-06,6e-06,1.3e-05,-2e-05,0,7e-06,-2e-06,-1e-06,4e-06,-2e-06,-1e-06,-5e-06,-7e-06,6e-06,-4e-06,8e-06,1.3e-05,-2e-06,2e-06,-8e-06,3e-06,5e-06,2e-06,-4e-06,-3e-06,-4e-06,0,9e-06,8e-06,3e-06,0,-5e-06,-7e-06,5e-06,9e-06,4e-06,1e-06,-1.2e-05,4e-06,0,-2e-06,-5e-06,8e-06,-1e-06,-1e-05,1e-06,-1.2e-05,1e-06,-1e-06,-4e-06,1e-06,0,0
1e-06,-4e-06,-1.6e-05,-2e-06,3.7e-05,6e-06,-4e-06,3e-06,-9e-06,2e-06,-6e-06,2e-06,-1.2e-05,-9e-06,-8e-06,-7e-06,1.4e-05,1e-06,-5e-06,1.3e-05,-7e-06,7e-06,-6e-06,1.9e-05,-2e-06,9e-06,2e-06,-6e-06,-9e-06,3e-06,1.1e-05,-3e-06,2e-06,5e-06,-1.6e-05,-1e-06,-8e-06,9e-06,0,1e-06,-1.4e-05,-2e-06,1.5e-05,1.4e-05,4e-06,-8e-06,1.1e-05,1.1e-05,-3e-06,-1.1e-05,-2e-06,1.3e-05,-4e-06,4e-06,1.4e-05,4e-06,1.9e-05,-4e-06,1e-06,0,6e-06,-2e-06,1.1e-05,2e-06,-1e-06,-2.2e-05,-2.4e-05,3e-06,6e-06,-2e-06,-3e-06,8e-06,-4e-06,2e-06,1e-06,0,-2e-06,-1e-06,1e-06,2e-06,8e-06,1e-06,-3e-06,0,-1e-05,0,-4e-06,7e-06,-1.3e-05,-9e-06,0,-6e-06,-3e-06,4e-06,-1e-06,-8e-06,-7e-06,2e-06,-1e-06,6e-06,8e-06,1e-06,-6e-06,-1e-06,-1e-06,7e-06,-7e-06,1e-06,3e-06,-3e-06,2e-06,4e-06,0,-4e-06,1e-05,4e-06,-1e-06,0,-6e-06,1e-06,2e-06
-1e-06,1e-06,1.2e-05,1e-06,-3.5e-05,-1e-06,0,-7e-06,1e-05,0,4e-06,-4e-06,1.1e-05,-1e-06,7e-06,1e-06,-1.4e-05,-3e-06,6e-06,-1.1e-05,0,-6e-06,-2e-06,5e-06,-3e-06,-1.3e-05,-1e-06,4e-06,-6e-06,6e-06,-1.6e-05,-6e-06,-1e-06,-3e-06,5e-06,7e-06,5e-06,-7e-06,2e-06,1e-06,1.5e-05,1.1e-05,-5e-06,-1.3e-05,0,1.1e-05,7e-06,-2.1e-05,-4e-06,1.2e-05,4e-06,-1.7e-05,1.4e-05,0,-1.2e-05,-3e-06,-1.5e-05,6e-06,-7e-06,6e-06,-3e-06,3e-06,-1e-05,-3e-06,-1e-06,1.2e-05,1.7e-05,-5e-06,0,2.1e-05,0,-1.6e-05,1e-06,-1e-06,-7e-06,-2e-06,-2e-06,4e-06,-1e-06,-2e-06,-2e-06,-4e-06,1e-06,-9e-06,7e-06,-1e-06,9e-06,1e-06,7e-06,-2e-06,-1e-06,1e-05,2e-06,-7e-06,-5e-06,7e-06,-2e-06,-2e-06,1e-06,3e-06,-7e-06,3e-06,1e-06,0,-2e-06,-5e-06,-1e-06,0,1e-06,2e-06,-3e-06,-5e-06,4e-06,0,-9e-06,1e-06,7e-06,-2e-06,8e-06,-2e-06,-2e-06
1e-06,0,-1.4e-05,1e-06,2.8e-05,2e-06,0,2e-06,-5e-06,1e-06,-2e-06,8e-06,-9e-06,-3e-06,-1e-06,1e-06,6e-06,5e-06,-7e-06,-1e-06,7e-06,4e-06,9e-06,-1.8e-05,6e-06,1e-05,1e-06,-1e-06,1.3e-05,-2e-06,1.9e-05,7e-06,-6e-06,3e-06,1e-06,0,3e-06,2e-06,1e-06,4e-06,-1.5e-05,-4e-06,3e-06,5e-06,2e-06,-1e-05,-3e-06,1.7e-05,4e-06,-6e-06,-1e-05,8e-06,-1.9e-05,0,4e-06,0,1.3e-05,1e-06,1.5e-05,0,1e-06,-1e-06,9e-06,-2e-06,1e-06,3e-06,-5e-06,0,-3e-06,-1.5e-05,4e-06,1.6e-05,-3e-06,-6e-06,3e-06,2e-06,-2e-06,-5e-06,-3e-06,3e-06,-3e-06,-1e-06,1e-06,4e-06,-6e-06,0,-5e-06,-3e-06,-7e-06,3e-06,2e-06,-6e-06,-5e-06,-5e-06,-2e-06,-4e-06,-8e-06,-5e-06,1e-06,-3e-06,6e-06,-1.1e-05,3e-06,3e-06,0,5e-06,6e-06,-6e-06,1e-06,4e-06,2e-06,-1e-06,0,-1e-06,7e-06,-3e-06,-1e-06,0,-6e-06,4e-06,-3e-06
0,-3e-06,9e-06,3e-06,-1.6e-05,-7e-06,0,3e-06,5e-06,-1e-06,3e-06,-6e-06,6e-06,3e-06,-8e-06,-2e-06,-8e-06,-4e-06,3e-06,3e-06,-1e-05,-2e-06,-6e-06,1.3e-05,-2e-06,-6e-06,1e-06,-1e-06,-1.2e-05,-3e-06,-6e-06,-5e-06,-2e-06,-1e-06,-3e-06,-5e-06,-7e-06,0,-2e-06,2e-06,1.2e-05,-3e-06,-5e-06,1.1e-05,-1e-06,9e-06,0,-9e-06,1e-06,-3e-06,1.3e-05,-6e-06,1.4e-05,-2e-06,1e-06,-3e-06,-9e-06,-4e-06,-1.5e-05,-1e-06,1e-06,-2e-06,-1.1e-05,-3e-06,-1e-06,3e-06,0,-3e-06,-4e-06,-2e-06,-7e-06,-6e-06,-4e-06,6e-06,-4e-06,-2e-06,-1e-06,1e-06,3e-06,-4e-06,-2e-06,4e-06,-4e-06,2e-06,6e-06,-2e-06,2e-06,2e-06,1.1e-05,6e-06,1e-06,1e-06,-2e-06,8e-06,2e-06,3e-06,-1e-06,7e-06,-1e-06,0,-5e-06,7e-06,-7e-06,-1e-06,-1e-06,0,-4e-06,9e-06,-2e-06,0,-3e-06,0,5e-06,-1e-06,-6e-06,-4e-06,-4e-06,-4e-06,3e-06,-6e-06,4e-06
-1e-06,-2e-06,1e-06,3e-06,3e-06,7e-06,-1e-06,-3e-06,-8e-06,-2e-06,-1e-06,3e-06,-1e-06,-3e-06,5e-06,5e-06,3e-06,0,0,0,7e-06,0,4e-06,-1e-06,1e-06,8e-06,1e-06,1e-06,8e-06,-4e-06,9e-06,0,3e-06,0,9e-06,-1e-06,3e-06,-1e-06,-1e-06,-3e-06,-6e-06,0,3e-06,-1.2e-05,-2e-06,-4e-06,-8e-06,5e-06,-1e-06,1e-06,-6e-06,1e-06,-3e-06,2e-06,2e-06,-1e-06,7e-06,3e-06,1e-06,-4e-06,-3e-06,1e-06,9e-06,2e-06,-1e-06,5e-06,1e-06,2e-06,0,0,2e-06,-2e-06,1e-06,1e-06,4e-06,5e-06,1e-06,-1e-06,2e-06,2e-06,5e-06,-1e-06,0,-4e-06,-6e-06,0,-1e-06,-2e-06,-1e-06,-1e-06,-1e-06,3e-06,7e-06,2e-06,0,-1e-06,-1e-06,-7e-06,2e-06,2e-06,4e-06,1e-06,7e-06,-2e-06,-1e-06,2e-06,4e-06,-3e-06,2e-06,-1e-06,3e-06,2e-06,-6e-06,-1e-06,5e-06,3e-06,1e-06,3e-06,-1e-06,-3e-06,-2e-06
0,-1e-06,-1e-06,2e-06,3e-06,-4e-06,-1e-06,5e-06,4e-06,2e-06,-2e-06,-7e-06,0,6e-06,0,1e-06,-3e-06,3e-06,0,-2e-06,-2e-06,1e-06,-5e-06,-3e-06,1e-06,-9e-06,-1e-06,-1e-06,-7e-06,2e-06,-9e-06,-3e-06,-3e-06,0,-1e-05,5e-06,1e-06,1e-06,0,-3e-06,3e-06,2e-06,-3e-06,1e-05,1e-06,-3e-06,-4e-06,1e-06,-1e-06,5e-06,1e-06,6e-06,-8e-06,-1e-06,9e-06,1e-06,-5e-06,-1e-06,-2e-06,-1e-06,3e-06,-2e-06,-8e-06,2e-06,1e-06,-7e-06,0,2e-06,2e-06,-2e-06,-2e-06,1e-06,-2e-06,-3e-06,-7e-06,-2e-06,-2e-06,3e-06,1e-06,0,1e-06,-6e-06,-1e-06,-1e-06,7e-06,-1e-06,-6e-06,2e-06,2e-06,-1e-06,-2e-06,-4e-06,-5e-06,2e-06,3e-06,-2e-06,3e-06,1e-06,-2e-06,-2e-06,-4e-06,0,-6e-06,0,2e-06,2e-06,-3e-06,2e-06,-2e-06,-1e-06,-2e-06,-1e-06,3e-06,1e-06,-4e-06,-1e-06,-1e-06,-2e-06,-1e-06,1e-06,-2e-06
0,-2e-06,1e-06,-1e-06,0,3e-06,2e-06,-6e-06,-3e-06,0,0,9e-06,1e-06,0,-5e-06,-3e-06,0,-4e-06,2e-06,1e-06,2e-06,-2e-06,6e-06,1e-06,-1e-06,8e-06,0,2e-06,7e-06,3e-06,-1e-06,3e-06,2e-06,0,7e-06,0,0,-3e-06,2e-06,-3e-06,-3e-06,2e-06,4e-06,-8e-06,1e-06,5e-06,-1e-06,0,0,-1e-06,-4e-06,-4e-06,1.4e-05,0,-1e-05,0,3e-06,2e-06,-2e-06,2e-06,-3e-06,0,5e-06,2e-06,-1e-06,2e-06,-4e-06,-1e-06,2e-06,1.5e-05,-3e-06,-5e-06,-1e-06,1e-06,4e-06,-5e-06,1e-06,0,1e-06,-3e-06,-5e-06,5e-06,1e-06,3e-06,-6e-06,0,3e-06,0,-2e-06,0,2e-06,3e-06,3e-06,-2e-06,2e-06,5e-06,5e-06,3e-06,1e-06,-2e-06,3e-06,-2e-06,2e-06,0,0,-1e-06,-3e-06,-1e-06,2e-06,2e-06,-1e-06,-3e-06,-1e-06,0,3e-06,1e-06,-1e-06,1e-06,4e-06,-2e-06,3e-06
0,0,-2e-06,-2e-06,-1e-05,-4e-06,1e-06,-3e-06,5e-06,-2e-06,1e-06,-5e-06,-1e-06,2e-06,4e-06,1e-06,0,2e-06,-1e-06,1e-06,2e-06,2e-06,-8e-06,-1e-06,-2e-06,-1.2e-05,0,-1e-06,-4e-06,0,6e-06,3e-06,6e-06,1e-06,-7e-06,-5e-06,-1e-06,3e-06,0,5e-06,-1e-06,-2e-06,-4e-06,-1e-06,0,-7e-06,-2e-06,-1e-06,-1e-06,-3e-06,0,8e-06,-1.1e-05,-1e-06,5e-06,1e-06,-1e-06,-1e-06,1.1e-05,-1e-06,4e-06,1e-06,-4e-06,-1e-06,-1e-06,-6e-06,5e-06,3e-06,2e-06,-1e-05,9e-06,1.2e-05,0,1e-06,-6e-06,-1e-06,-1e-06,-3e-06,-3e-06,3e-06,3e-06,2e-06,-1e-06,-2e-06,6e-06,-1e-06,2e-06,0,-4e-06,-2e-06,0,0,-1e-06,-4e-06,-1e-06,-7e-06,4e-06,-2e-06,0,1e-06,-4e-06,-2e-06,2e-06,-1e-06,0,1e-06,4e-06,4e-06,-1e-06,-4e-06,2e-06,2e-06,6e-06,1e-06,-2e-06,3e-06,1e-06,-1e-06,-6e-06,2e-06,-1e-06
0,-1e-06,1e-06,-3e-06,1.4e-05,2e-06,-1e-06,7e-06,-1e-06,0,0,3e-06,1e-06,-2e-06,-2e-06,-1e-06,-3e-06,-2e-06,2e-06,1e-06,-6e-06,-1e-06,7e-06,5e-06,1e-06,1.2e-05,0,0,0,-3e-06,-1.1e-05,-7e-06,-4e-06,-1e-06,5e-06,0,-2e-06,-1e-06,0,4e-06,6e-06,-1e-06,2e-06,6e-06,-1e-06,7e-06,4e-06,1e-06,2e-06,2e-06,2e-06,-7e-06,3e-06,1e-06,-9e-06,-1e-06,0,-3e-06,-9e-06,-1e-06,-4e-06,0,2e-06,-2e-06,1e-06,0,-6e-06,1e-06,0,2e-06,-4e-06,-7e-06,-1e-06,1e-06,1e-06,-2e-06,0,1e-06,-2e-06,-2e-06,2e-06,-5e-06,-2e-06,1e-06,-6e-06,0,0,1e-06,-1e-06,0,-1e-06,0,6e-06,0,1e-06,7e-06,1e-06,0,-1e-06,3e-06,3e-06,5e-06,-5e-06,0,1e-06,-3e-06,-4e-06,-5e-06,0,0,-2e-06,0,-4e-06,0,1e-06,-1e-06,2e-06,1e-06,6e-06,-1e-06,0
0,-1e-06,-3e-06,-2e-06,-1.2e-05,2e-06,0,-1e-06,0,1e-06,1e-06,-4e-06,0,-2e-06,-2e-06,-1e-06,2e-06,2e-06,-2e-06,-2e-06,6e-06,1e-06,-5e-06,-6e-06,2e-06,-1e-05,0,-1e-06,1e-06,-2e-06,7e-06,3e-06,2e-06,1e-06,-4e-06,4e-06,4e-06,2e-06,-1e-06,1e-06,-8e-06,1e-06,2e-06,-7e-06,-1e-06,-8e-06,3e-06,1e-06,0,0,1e-06,4e-06,6e-06,-1e-06,6e-06,0,2e-06,6e-06,6e-06,1e-06,2e-06,0,-2e-06,-1e-06,-1e-06,-1e-06,3e-06,-1e-06,-2e-06,-7e-06,-2e-06,5e-06,-1e-06,-3e-06,0,1e-06,-1e-06,1e-06,1e-06,1e-06,-2e-06,2e-06,0,2e-06,6e-06,-1e-06,1e-06,-1e-06,0,1e-06,0,1e-06,-6e-06,2e-06,-2e-06,-4e-06,-3e-06,1e-06,0,1e-06,-3e-06,-1e-06,5e-06,0,0,1e-06,4e-06,2e-06,0,2e-06,1e-06,1e-06,3e-06,0,-1e-06,-1e-06,1e-06,-2e-06,-4e-06,-3e-06,1e-06
0,-1e-06,3e-06,-1e-06,7e-06,-3e-06,0,-2e-06,-1e-06,0,-1e-06,5e-06,0,-2e-06,1e-06,3e-06,-3e-06,0,2e-06,-2e-06,-3e-06,-3e-06,2e-06,0,-1e-06,1.1e-05,0,2e-06,0,0,-9e-06,2e-06,-3e-06,0,5e-06,0,0,-3e-06,0,-5e-06,5e-06,-1e-06,0,9e-06,1e-06,9e-06,3e-06,-4e-06,0,1e-06,-4e-06,-4e-06,-1.2e-05,0,-4e-06,0,-3e-06,-1e-06,-2e-06,0,0,0,2e-06,-1e-06,0,2e-06,2e-06,0,-3e-06,2e-06,3e-06,-8e-06,0,2e-06,-3e-06,0,0,0,1e-06,-1e-06,-3e-06,2e-06,1e-06,-3e-06,-5e-06,0,-2e-06,1e-06,1e-06,3e-06,0,-1e-06,4e-06,1e-06,-2e-06,-1e-06,-3e-06,1e-06,1e-06,0,3e-06,0,-4e-06,0,-1e-06,-4e-06,-2e-06,1e-06,0,1e-06,-1e-06,-2e-06,-6e-06,-1e-06,0,-1e-06,-1e-06,2e-06,0,1e-06,-2e-06
0,-2e-06,-2e-06,0,-1e-06,3e-06,0,0,1e-06,-1e-06,0,-6e-06,1e-06,1e-06,0,0,4e-06,0,-1e-06,4e-06,0,3e-06,2e-06,6e-06,1e-06,-1.3e-05,0,-2e-06,-2e-06,3e-06,8e-06,-2e-06,-1e-06,0,-4e-06,-2e-06,-4e-06,2e-06,0,-3e-06,-4e-06,-2e-06,-2e-06,-4e-06,0,-7e-06,2e-06,8e-06,0,-2e-06,3e-06,0,1.2e-05,1e-06,4e-06,0,5e-06,-3e-06,-1e-06,-1e-06,0,-1e-06,-4e-06,1e-06,0,-1e-06,-4e-06,-1e-06,0,8e-06,-5e-06,7e-06,-1e-06,0,2e-06,-1e-06,0,-1e-06,1e-06,1e-06,2e-06,-4e-06,-1e-06,1e-06,5e-06,-1e-06,0,-1e-06,2e-06,-1e-06,-1e-06,0,-1e-06,-2e-06,1e-06,5e-06,-4e-06,-2e-06,-1e-06,-1e-06,-1e-06,-3e-06,1e-06,1e-06,-1e-06,3e-06,-1e-06,-6e-06,0,-1e-06,1e-06,1e-06,-2e-06,0,1e-06,0,0,-2e-06,2e-06,-1e-06,0
0,0,3e-06,0,-3e-06,-4e-06,0,-1e-06,-3e-06,0,0,5e-06,-2e-06,-1e-06,-3e-06,-2e-06,-4e-06,-1e-06,0,-3e-06,1e-06,-3e-06,-4e-06,-5e-06,-1e-06,1.2e-05,0,2e-06,2e-06,2e-06,-3e-06,-2e-06,-2e-06,1e-06,3e-06,0,4e-06,-1e-06,1e-06,1e-06,5e-06,1e-06,0,-1e-06,0,6e-06,-1e-06,-7e-06,0,2e-06,-1e-06,1e-06,-6e-06,0,1e-06,0,-6e-06,2e-06,4e-06,0,1e-06,0,3e-06,1e-06,0,-5e-06,3e-06,0,2e-06,-4e-06,4e-06,-1e-06,-1e-06,-1e-06,-3e-06,0,-1e-06,1e-06,1e-06,-2e-06,3e-06,2e-06,-1e-06,0,-5e-06,0,0,0,2e-06,-1e-06,0,1e-06,-2e-06,1e-06,0,-6e-06,-1e-06,2e-06,1e-06,-1e-06,2e-06,2e-06,1e-06,0,0,-3e-06,2e-06,4e-06,0,0,1e-06,0,3e-06,0,-1e-06,0,-1e-06,0,-4e-06,0,2e-06
0,0,-1e-06,2e-06,2e-06,3e-06,0,2e-06,3e-06,1e-06,0,-4e-06,2e-06,1e-06,2e-06,1e-06,4e-06,0,0,0,-4e-06,3e-06,4e-06,-2e-06,-1e-06,-1.1e-05,0,-2e-06,0,-2e-06,3e-06,2e-06,0,-1e-06,-1e-06,2e-06,1e-06,1e-06,0,3e-06,-5e-06,2e-06,0,5e-06,0,-6e-06,-3e-06,5e-06,-1e-06,0,0,-1e-06,-2e-06,0,1e-06,0,6e-06,0,-8e-06,0,-1e-06,0,-3e-06,1e-06,0,4e-06,2e-06,-2e-06,2e-06,3e-06,0,0,0,-1e-06,0,0,0,1e-06,-1e-06,1e-06,-3e-06,2e-06,-2e-06,0,5e-06,-1e-06,0,0,-3e-06,-1e-06,0,-2e-06,-1e-06,-1e-06,1e-06,5e-06,1e-06,1e-06,-1e-06,0,-2e-06,2e-06,-3e-06,-1e-06,0,4e-06,-3e-06,0,0,0,-1e-06,0,0,0,2e-06,1e-06,0,-1e-06,5e-06,0,-2e-06
0,0,1e-06,2e-06,-1e-06,-1e-06,1e-06,1e-06,-2e-06,0,0,3e-06,-3e-06,2e-06,-1e-06,-1e-06,-4e-06,1e-06,-1e-06,2e-06,4e-06,-3e-06,-2e-06,6e-06,1e-06,1.2e-05,0,1e-06,-1e-06,-2e-06,0,2e-06,2e-06,0,-2e-06,-1e-06,-2e-06,0,0,2e-06,3e-06,0,1e-06,-7e-06,0,5e-06,-4e-06,-1e-06,0,0,1e-06,3e-06,8e-06,0,0,0,-7e-06,1e-06,5e-06,1e-06,1e-06,0,1e-06,-1e-06,0,-5e-06,-7e-06,-1e-06,0,-9e-06,-3e-06,-2e-06,-1e-06,1e-06,-1e-06,-1e-06,0,0,-1e-06,0,-1e-06,-3e-06,0,0,-4e-06,0,2e-06,0,2e-06,1e-06,-1e-06,1e-06,1e-06,3e-06,1e-06,-3e-06,3e-06,-2e-06,0,1e-06,2e-06,-2e-06,5e-06,1e-06,0,-2e-06,4e-06,0,0,-1e-06,2e-06,0,2e-06,0,-2e-06,1e-06,0,0,-4e-06,-2e-06,0
0,-1e-06,-1e-06,2e-06,1e-06,-1e-06,1e-06,-4e-06,1e-06,-1e-06,0,-3e-06,2e-06,-3e-06,-3e-06,-1e-06,5e-06,-1e-06,0,-2e-06,-3e-06,3e-06,0,-1e-06,0,-1.1e-05,0,0,1e-06,0,1e-06,-2e-06,1e-06,0,4e-06,-3e-06,1e-06,-2e-06,0,-1e-06,0,-2e-06,0,6e-06,1e-06,-6e-06,-3e-06,-2e-06,0,-1e-06,-2e-06,-1e-06,-9e-06,0,-5e-06,0,8e-06,-2e-06,-4e-06,0,-1e-06,1e-06,1e-06,-1e-06,0,6e-06,8e-06,0,-1e-06,2e-06,6e-06,-3e-06,-1e-06,0,0,-2e-06,0,-1e-06,1e-06,-1e-06,3e-06,1e-06,0,0,4e-06,0,-2e-06,0,-6e-06,0,0,0,1e-06,0,-1e-06,0,3e-06,1e-06,0,0,-2e-06,-1e-06,-4e-06,1e-06,1e-06,4e-06,-2e-06,-2e-06,0,0,-1e-06,0,0,0,3e-06,-1e-06,1e-06,0,3e-06,0,2e-06
0,-1e-06,-2e-06,0,-3e-06,0,0,1e-06,-1e-06,0,0,3e-06,-1e-06,3e-06,2e-06,2e-06,-3e-06,1e-06,0,1e-06,1e-06,-2e-06,0,-5e-06,-1e-06,1e-05,0,0,-1e-06,2e-06,2e-06,-2e-06,2e-06,-1e-06,-4e-06,0,-1e-06,2e-06,0,-3e-06,-1e-06,-1e-06,-1e-06,-3e-06,0,7e-06,-1e-06,3e-06,0,-1e-06,2e-06,2e-06,5e-06,-1e-06,1e-06,0,-8e-06,0,1e-06,-1e-06,1e-06,0,-1e-06,-1e-06,-1e-06,0,-6e-06,-1e-06,-2e-06,5e-06,-4e-06,5e-06,0,-1e-06,-2e-06,0,-1e-06,0,0,2e-06,1e-06,2e-06,-2e-06,-1e-06,-4e-06,0,0,0,2e-06,1e-06,0,-1e-06,-5e-06,-4e-06,1e-06,2e-06,2e-06,0,0,0,1e-06,1e-06,2e-06,-1e-06,1e-06,-3e-06,0,4e-06,0,0,0,1e-06,-2e-06,0,-3e-06,-1e-06,1e-06,0,0,0,-2e-06
0,-1e-06,2e-06,-1e-06,9e-06,0,-1e-06,1e-06,1e-06,1e-06,0,-3e-06,0,-2e-06,-2e-06,0,5e-06,0,0,0,1e-06,2e-06,1e-06,5e-06,1e-06,-1.2e-05,0,0,3e-06,2e-06,-6e-06,2e-06,-1e-06,1e-06,4e-06,2e-06,0,-1e-06,1e-06,-2e-06,1e-06,1e-06,1e-06,-2e-06,-1e-06,-8e-06,1e-06,-3e-06,1e-06,2e-06,-2e-06,-1e-06,2e-06,1e-06,-2e-06,0,9e-06,0,3e-06,2e-06,-1e-06,0,0,-1e-06,0,-1e-06,1e-06,1e-06,0,-1e-06,-1e-06,-2e-06,-1e-06,1e-06,0,1e-06,0,1e-06,1e-06,-2e-06,-3e-06,-3e-06,-1e-06,1e-06,4e-06,0,0,0,-2e-06,0,-1e-06,1e-06,6e-06,-1e-06,-1e-06,-2e-06,0,-1e-06,0,1e-06,-1e-06,2e-06,1e-06,0,-1e-06,3e-06,1e-06,-3e-06,-1e-06,1e-06,1e-06,0,-2e-06,-1e-06,3e-06,0,0,0,-2e-06,0,1e-06
0,0,-1e-06,-2e-06,-1.5e-05,1e-06,0,-1e-06,-1e-06,0,0,4e-06,1e-06,1e-06,-1e-06,-1e-06,-3e-06,1e-06,0,0,-3e-06,-3e-06,-2e-06,2e-06,0,1.3e-05,0,0,-4e-06,-1e-06,5e-06,2e-06,-2e-06,0,-4e-06,0,1e-06,1e-06,0,2e-06,-3e-06,1e-06,-1e-06,6e-06,0,8e-06,2e-06,1e-06,-1e-06,-1e-06,1e-06,0,-8e-06,0,4e-06,0,-9e-06,2e-06,-5e-06,1e-06,0,0,1e-06,1e-06,0,6e-06,3e-06,1e-06,1e-06,4e-06,4e-06,4e-06,-1e-06,0,-1e-06,0,-1e-06,0,0,1e-06,0,-1e-06,0,1e-06,-4e-06,0,-1e-06,0,3e-06,-1e-06,0,0,-2e-06,1e-06,-1e-06,2e-06,-3e-06,0,1e-06,0,1e-06,-1e-06,-4e-06,0,-1e-06,-4e-06,-2e-06,1e-06,1e-06,-1e-06,-1e-06,0,5e-06,1e-06,-3e-06,0,-1e-06,0,4e-06,0,1e-06
