0.004461,0.004677,0.004929,0.005287,0.0052,0.004958,0.0045,0.004488,0.005346,0.006309,0.005537,0.004263,0.004438,0.004603,0.004654,0.004214,0.003844,0.0044,0.004602,0.004467,0.004431,0.004375,0.004805,0.004768,0.004468,0.004553,0.004636,0.00496
0.005543,0.005639,0.005856,0.00631,0.006306,0.006076,0.005426,0.005395,0.006412,0.007503,0.006664,0.00512,0.005168,0.0054,0.005621,0.005129,0.004616,0.00531,0.005613,0.005454,0.005401,0.005345,0.00593,0.005878,0.005455,0.00551,0.005503,0.005797
0.007338,0.007078,0.007177,0.007781,0.007989,0.007886,0.006936,0.006842,0.008033,0.009298,0.008499,0.006549,0.006269,0.006636,0.007193,0.006607,0.005849,0.00679,0.007263,0.007066,0.006955,0.006838,0.007664,0.007628,0.007019,0.007041,0.006835,0.006957
0.008624,0.007815,0.007726,0.008428,0.008857,0.00893,0.007826,0.007752,0.008884,0.010071,0.009689,0.007639,0.006912,0.007388,0.008196,0.007585,0.006753,0.007835,0.008276,0.007981,0.007779,0.007514,0.0084,0.008473,0.0079,0.00801,0.007621,0.007295
0.009118,0.008042,0.007695,0.008205,0.008704,0.009057,0.008059,0.008118,0.009084,0.009759,0.009805,0.00819,0.007242,0.007688,0.008486,0.007865,0.007163,0.008078,0.008197,0.007869,0.007612,0.007246,0.008019,0.008315,0.00805,0.008278,0.00785,0.007047
0.008869,0.008193,0.007795,0.007935,0.008236,0.008831,0.007999,0.008019,0.008853,0.008914,0.009029,0.008208,0.00735,0.007572,0.008361,0.007749,0.007202,0.007785,0.007492,0.00723,0.007067,0.006997,0.00773,0.008146,0.008123,0.008399,0.008008,0.006975
0.008299,0.008209,0.008253,0.008323,0.008192,0.00857,0.007811,0.0079,0.008835,0.008376,0.008081,0.007888,0.007365,0.007448,0.008251,0.007568,0.006989,0.007271,0.006804,0.006863,0.006944,0.007165,0.007681,0.008017,0.008389,0.009141,0.008635,0.007273
0.007854,0.007954,0.008887,0.009306,0.008359,0.008225,0.007737,0.00792,0.008947,0.008588,0.007924,0.007628,0.007434,0.007637,0.008303,0.007499,0.006907,0.007329,0.007288,0.007632,0.007578,0.007434,0.007507,0.007955,0.009049,0.010958,0.010246,0.007837
0.008238,0.008075,0.009845,0.010525,0.008407,0.007816,0.007859,0.00809,0.009272,0.009654,0.008718,0.007514,0.00752,0.008319,0.008873,0.007928,0.007224,0.007699,0.008387,0.009107,0.008709,0.007751,0.007101,0.007898,0.009943,0.012826,0.011648,0.008145
0.009277,0.008532,0.010697,0.011573,0.008731,0.007787,0.007973,0.008425,0.009962,0.010807,0.009736,0.00772,0.007692,0.009294,0.010077,0.009103,0.007971,0.007937,0.009237,0.010507,0.009873,0.008215,0.00694,0.00794,0.010511,0.013615,0.012077,0.00844
0.01035,0.00912,0.011143,0.012181,0.00951,0.008425,0.008378,0.008937,0.010654,0.011435,0.010348,0.008116,0.007947,0.010006,0.011161,0.010273,0.008824,0.008346,0.009704,0.011281,0.010818,0.009084,0.0076,0.0085,0.010913,0.01328,0.011678,0.008762
0.010883,0.009788,0.011502,0.012447,0.010175,0.009041,0.008969,0.009662,0.01126,0.011914,0.01115,0.009223,0.008626,0.010122,0.011516,0.010991,0.009593,0.008892,0.009672,0.011146,0.011101,0.009712,0.008448,0.009426,0.011236,0.012241,0.010579,0.008709
0.011226,0.010361,0.011554,0.012063,0.010537,0.009547,0.009563,0.01047,0.011701,0.012358,0.012077,0.010432,0.009481,0.009947,0.011344,0.011404,0.010167,0.0094,0.009788,0.010975,0.011148,0.010198,0.009186,0.010253,0.011202,0.010768,0.009028,0.008186
0.010871,0.010339,0.011053,0.011103,0.010588,0.009974,0.009807,0.010642,0.011878,0.012599,0.012527,0.011228,0.010218,0.010178,0.011456,0.011787,0.010773,0.010133,0.010408,0.011081,0.011158,0.010647,0.009864,0.010711,0.011111,0.010218,0.008401,0.008078
0.009633,0.009684,0.010365,0.010539,0.010728,0.01042,0.009775,0.010043,0.011756,0.012655,0.012396,0.011524,0.010525,0.010395,0.011596,0.012254,0.01172,0.01103,0.011181,0.011375,0.010869,0.0105,0.010311,0.010945,0.011139,0.010515,0.008906,0.00883
0.008809,0.009308,0.010031,0.010647,0.011499,0.011153,0.009959,0.009965,0.012094,0.013489,0.012989,0.012075,0.011047,0.010919,0.012013,0.012875,0.012951,0.012041,0.01202,0.012175,0.01101,0.010459,0.010873,0.011258,0.011325,0.01125,0.010099,0.009976
0.008395,0.009193,0.009871,0.010711,0.011559,0.010789,0.009407,0.009434,0.011821,0.014129,0.013359,0.011657,0.010718,0.010661,0.012018,0.013284,0.013304,0.011885,0.011437,0.011559,0.010479,0.010465,0.011032,0.010859,0.010923,0.011168,0.010776,0.010832
0.008202,0.009052,0.009863,0.01069,0.01058,0.009507,0.008756,0.008898,0.011275,0.014317,0.013074,0.010741,0.01011,0.009784,0.011481,0.013204,0.012552,0.010678,0.009731,0.009412,0.008759,0.009672,0.010169,0.009686,0.01036,0.0111,0.011428,0.011573
0.009066,0.009719,0.010591,0.01147,0.010258,0.008932,0.009145,0.009711,0.011645,0.014298,0.012976,0.011178,0.010692,0.009959,0.011914,0.013685,0.012218,0.010051,0.009398,0.008936,0.008236,0.009383,0.009792,0.009525,0.010836,0.012195,0.012448,0.012072
0.009721,0.010385,0.011278,0.011899,0.010437,0.009294,0.009932,0.011133,0.012569,0.014208,0.013176,0.011707,0.010846,0.010224,0.012098,0.013439,0.012383,0.010898,0.0105,0.009918,0.009399,0.010435,0.010193,0.009952,0.011518,0.013208,0.012665,0.011235
0.01059,0.010603,0.011203,0.012059,0.011765,0.01143,0.011524,0.012182,0.013453,0.01454,0.013727,0.012122,0.011218,0.011573,0.012504,0.012946,0.013531,0.013283,0.012155,0.010753,0.010918,0.011998,0.0111,0.011026,0.012331,0.013841,0.012807,0.010653
0.013781,0.012433,0.011719,0.013445,0.015467,0.016321,0.015105,0.014306,0.017036,0.018716,0.016852,0.014878,0.014221,0.015658,0.015811,0.015192,0.01695,0.017367,0.01537,0.013587,0.014491,0.015199,0.014055,0.014423,0.015338,0.016234,0.015298,0.013677
0.018711,0.016088,0.013665,0.016128,0.020511,0.022812,0.020712,0.019166,0.02342,0.025426,0.022218,0.0199,0.018972,0.020627,0.021048,0.020009,0.021574,0.022036,0.020289,0.0187,0.020053,0.020525,0.019231,0.020144,0.020739,0.020786,0.019666,0.018645
0.022138,0.019011,0.015909,0.018741,0.024087,0.026989,0.024316,0.022757,0.028039,0.030098,0.026172,0.023767,0.022515,0.023969,0.024947,0.023796,0.024787,0.025262,0.023871,0.022337,0.024077,0.024652,0.023168,0.024211,0.024399,0.024074,0.022967,0.022158
0.020742,0.018284,0.015892,0.018105,0.02229,0.024824,0.022506,0.021524,0.026361,0.028045,0.024484,0.022481,0.02135,0.022309,0.023529,0.022373,0.022677,0.023302,0.022404,0.021089,0.022738,0.02341,0.0223,0.023111,0.022505,0.021869,0.021262,0.020898
0.014917,0.014151,0.013895,0.014419,0.015428,0.016776,0.016232,0.016323,0.018807,0.019996,0.017796,0.016383,0.016007,0.016396,0.017386,0.016273,0.015472,0.016132,0.016257,0.015757,0.016725,0.017583,0.017846,0.018061,0.015916,0.014761,0.015193,0.015958
0.010085,0.010404,0.012005,0.011032,0.009827,0.010079,0.010668,0.011511,0.01207,0.014039,0.01392,0.012536,0.012409,0.012007,0.012978,0.012312,0.009711,0.009963,0.011194,0.011209,0.011677,0.013771,0.015684,0.014819,0.011155,0.009856,0.011519,0.013285
0.01146,0.012217,0.013953,0.0126,0.010967,0.011402,0.011203,0.011004,0.011768,0.015148,0.016307,0.013934,0.012608,0.011321,0.012019,0.013272,0.01159,0.0114,0.012192,0.012687,0.013669,0.015841,0.016409,0.014158,0.012051,0.012674,0.014098,0.014621
0.01779,0.018853,0.01955,0.018653,0.017927,0.019157,0.018499,0.017799,0.01858,0.020541,0.020606,0.017644,0.016628,0.016397,0.01719,0.019002,0.018608,0.018546,0.019206,0.020661,0.021078,0.021025,0.019688,0.016617,0.016525,0.019714,0.021285,0.020872
0.028965,0.030378,0.030637,0.029471,0.029091,0.031651,0.031035,0.029997,0.030566,0.028456,0.026138,0.02504,0.025862,0.026786,0.028173,0.0304,0.03011,0.030051,0.031301,0.034152,0.033553,0.030463,0.028531,0.025005,0.025699,0.031081,0.033234,0.033258
0.042133,0.043637,0.044249,0.042337,0.041772,0.046066,0.045376,0.04398,0.044673,0.037773,0.033186,0.034793,0.037031,0.038864,0.041104,0.043819,0.043346,0.043281,0.045402,0.049783,0.048501,0.043281,0.040338,0.035335,0.036701,0.044441,0.047441,0.047983
0.050762,0.051861,0.053346,0.050508,0.049641,0.055477,0.054559,0.052878,0.054286,0.044588,0.038318,0.041334,0.044232,0.046545,0.049634,0.052445,0.051768,0.051735,0.054546,0.05984,0.058035,0.051973,0.048172,0.041686,0.043726,0.053042,0.056475,0.057199
0.047963,0.048334,0.050755,0.047236,0.046109,0.052401,0.051298,0.049559,0.051885,0.042278,0.036015,0.039176,0.041602,0.04374,0.047077,0.049271,0.048536,0.048555,0.05149,0.056472,0.054368,0.048992,0.045185,0.038441,0.040834,0.04972,0.052693,0.053163
0.03399,0.034312,0.036799,0.033275,0.032056,0.037144,0.036178,0.034723,0.037213,0.032537,0.029103,0.029364,0.029999,0.031632,0.033959,0.035133,0.034635,0.034666,0.037242,0.040777,0.038412,0.034422,0.031525,0.026238,0.028299,0.034579,0.036554,0.036883
0.018736,0.021566,0.022254,0.019826,0.018329,0.020019,0.020668,0.020345,0.020259,0.023486,0.024934,0.020836,0.019977,0.021801,0.02123,0.021258,0.021703,0.021972,0.025374,0.027057,0.022323,0.018408,0.016176,0.01375,0.014846,0.017344,0.01954,0.021025
0.011045,0.014624,0.014511,0.01508,0.012816,0.011341,0.013879,0.014733,0.012635,0.020076,0.023258,0.017407,0.016164,0.018212,0.016612,0.015015,0.016323,0.016919,0.021037,0.02242,0.016717,0.012463,0.009927,0.010453,0.011186,0.01072,0.015346,0.018527
0.006926,0.009537,0.009308,0.011446,0.009671,0.008115,0.012531,0.014755,0.012865,0.018798,0.020825,0.013284,0.011198,0.013156,0.011798,0.009218,0.01123,0.014459,0.018384,0.016963,0.012184,0.010685,0.009367,0.010178,0.012315,0.013205,0.016491,0.017368
0.004261,0.00713,0.008936,0.011081,0.009374,0.007849,0.011805,0.013068,0.012328,0.019004,0.021612,0.012106,0.006494,0.007887,0.00771,0.004938,0.008711,0.015742,0.016476,0.010564,0.00783,0.009569,0.00941,0.008697,0.011845,0.014631,0.015522,0.015312
0.003782,0.007954,0.012001,0.013522,0.010248,0.007883,0.009636,0.009802,0.010406,0.019502,0.02359,0.013321,0.004795,0.005663,0.00653,0.004859,0.008314,0.016549,0.015217,0.00691,0.005689,0.009545,0.009765,0.007911,0.010889,0.013592,0.013352,0.013494
0.004743,0.010703,0.016001,0.015139,0.009982,0.006902,0.006516,0.007739,0.009081,0.017231,0.023235,0.013809,0.004656,0.005109,0.006093,0.00568,0.007748,0.015443,0.016204,0.007606,0.005812,0.010034,0.010336,0.009625,0.010726,0.011217,0.012553,0.011964
