-6.6e-05,-6.7e-05,-4.2e-05,-3.3e-05,-1.8e-05,-1.3e-05,-2.7e-05,-0.000271,-0.001405,-0.002058,-0.001511,-0.001354,-0.002978,-0.003,-0.003703,-0.003638,-0.001671,-0.001522,-0.001281,-0.000705,-0.00065,-0.000589,-0.000408,-0.001156,-0.00207,-0.001663,-0.000669,-0.000319
-7.6e-05,-6.2e-05,-5.1e-05,-5.9e-05,-5.2e-05,-5e-05,-7.5e-05,-0.000439,-0.002498,-0.003343,-0.001966,-0.001752,-0.004747,-0.003816,-0.003725,-0.004393,-0.001978,-0.00176,-0.001711,-0.001075,-0.000885,-0.000497,-0.000229,-0.00024,0.000214,0.001486,-5.7e-05,-0.000433
-1.5e-05,-4e-06,-8e-06,-3.4e-05,-4.9e-05,-5.2e-05,-7.2e-05,-0.000272,-0.001344,-0.001532,-0.000766,-0.000801,-0.002125,-0.000883,0.000325,-0.000312,-0.000194,-0.000167,-0.000395,-0.000389,-0.000295,-0.000216,-0.000418,-0.00182,-0.003093,-0.002612,-0.00154,-0.000729
1.4e-05,1.4e-05,1.8e-05,1e-06,-1.8e-05,-2.5e-05,-1.9e-05,0.00017,0.001067,0.001734,0.001308,0.001125,0.002633,0.002671,0.003296,0.003638,0.001809,0.001722,0.001459,0.000656,0.000553,0.000265,-1e-06,-0.000242,-0.000568,-0.000966,-0.000574,-0.000253
-3e-06,-4e-06,0,7e-06,8e-06,-6e-06,1e-05,0.000403,0.002286,0.002897,0.001705,0.001659,0.004376,0.002865,0.001827,0.002919,0.001462,0.001311,0.001345,0.000806,0.000718,0.000464,0.000491,0.002381,0.00452,0.003515,0.001407,0.000624
-1.1e-05,-2e-06,-1.6e-05,-4e-06,1.1e-05,-3e-06,-1e-06,0.000227,0.001308,0.001237,0.000317,0.000399,0.001632,0.000236,-0.001187,-0.000531,-0.00038,-0.000562,-0.000206,0.000167,8.2e-05,3.9e-05,0.000135,0.000597,0.000503,-0.000561,0.000337,0.000481
9e-06,1.9e-05,2e-06,8e-06,1.4e-05,1e-05,-1e-06,-9e-05,-0.000644,-0.001168,-0.000903,-0.00079,-0.002065,-0.001683,-0.001598,-0.00252,-0.001502,-0.001522,-0.001288,-0.000453,-0.000522,-0.000347,-0.00011,-0.000214,-0.000887,-0.000649,0.000354,0.000209
2e-05,1.9e-05,2.6e-05,2.8e-05,2e-05,3.1e-05,1.5e-05,-0.000328,-0.00198,-0.002391,-0.001242,-0.001227,-0.003646,-0.001941,-0.00051,-0.002029,-0.001092,-0.000802,-0.000945,-0.000571,-0.000501,-0.000282,-0.000116,-0.000464,-0.000146,0.001393,0.000502,1.6e-05
1e-06,-1e-05,1.5e-05,1.9e-05,1.2e-05,3.8e-05,3.4e-05,-0.000287,-0.001537,-0.001384,-0.000476,-0.000629,-0.001988,-0.000968,-0.000122,-3.5e-05,0.000456,0.000802,0.000483,-0.000133,2e-05,0.000113,-8.7e-05,-0.00122,-0.002362,-0.001609,-0.000898,-0.00041
-1.9e-05,-3.5e-05,-1.9e-05,-9e-06,-1e-06,2.1e-05,4.2e-05,4.2e-05,0.000338,0.000779,0.000679,0.000569,0.001529,0.000847,0.000301,0.001803,0.001369,0.001307,0.001084,0.000282,0.000417,0.000349,-2.2e-05,-0.000862,-0.001527,-0.001498,-0.000901,-0.000471
-1.7e-05,-2.1e-05,-2.8e-05,-2.7e-05,-1.1e-05,-1.2e-05,2.4e-05,0.000344,0.001876,0.002141,0.001172,0.001265,0.003667,0.002363,0.001455,0.002362,0.000961,0.000461,0.000539,0.000413,0.000295,0.000156,0.000162,0.00117,0.003052,0.002225,0.000312,8e-06
1.2e-05,2.6e-05,-2e-06,-2.1e-05,-1.8e-05,-3.4e-05,-1.8e-05,0.000299,0.001605,0.001452,0.000446,0.000665,0.002211,0.001663,0.001358,0.000662,-0.000453,-0.000853,-0.000476,0.000163,-0.000139,-0.000188,6.1e-05,0.001122,0.001423,-0.000226,1.5e-05,0.000229
3e-05,4.9e-05,2e-05,0,-1e-05,-3.2e-05,-5e-05,-1.9e-05,-0.000151,-0.000534,-0.00065,-0.000564,-0.00138,-0.001032,-0.000869,-0.00228,-0.001603,-0.001286,-0.000964,-0.000268,-0.000341,-0.000273,-0.000174,-6e-05,-7e-04,-0.000928,0.000175,0.000178
2e-06,3e-06,5e-06,2e-06,-5e-06,-1.9e-05,-5.3e-05,-0.000313,-0.001671,-0.001757,-0.000833,-0.001079,-0.003581,-0.002885,-0.002632,-0.002924,-0.000808,-7.6e-05,-0.000236,-0.000382,-0.000164,-0.000139,-6.7e-05,2.8e-05,0.000559,0.001934,0.000898,0.000193
-2.6e-05,-4.8e-05,-1.8e-05,-7e-06,-6e-06,-7e-06,-3.4e-05,-0.000326,-0.001589,-0.001411,-0.000414,-0.000735,-0.002433,-0.001843,-0.001348,-0.000224,0.000877,0.001011,0.000471,-0.000189,9.9e-05,1.9e-05,-2e-05,-0.000859,-0.002133,-0.00118,-0.00026,-4e-05
3e-06,-1.2e-05,-7e-06,4e-06,6e-06,9e-06,8e-06,-2e-06,-3e-06,0.000171,0.000347,0.000392,0.001341,0.001578,0.002161,0.003061,0.001573,0.000955,0.000637,0.000189,0.00025,0.000287,6.6e-05,-0.001035,-0.002028,-0.001456,-0.000563,-0.000254
2.9e-05,3.1e-05,1.3e-05,1.6e-05,1.7e-05,2.1e-05,3.7e-05,0.000273,0.001394,0.001361,0.000708,0.001172,0.003748,0.003373,0.003153,0.00285,0.000503,-9.3e-05,0.000193,0.000334,8.5e-05,0.000234,0.000221,0.000589,0.002222,0.001902,0.00022,-6.3e-05
2e-06,8e-06,9e-06,1.2e-05,1.6e-05,2.2e-05,3.2e-05,0.000238,0.001314,0.001078,0.000154,0.000513,0.001992,0.000961,-0.000255,-0.001039,-0.001339,-0.001212,-0.000569,7.1e-05,-0.000208,-0.000237,-4.4e-05,0.00082,0.001226,-0.000545,-0.000397,5.6e-05
-3e-05,-2.6e-05,-1.1e-05,-2e-06,8e-06,1.7e-05,2.3e-05,5.4e-05,0.000272,0.000307,-6.8e-05,-0.000354,-0.001443,-0.002176,-0.003028,-0.003412,-0.001418,-0.00069,-0.000454,-0.000106,-0.00014,-0.000252,-0.000219,0.000252,3e-05,-0.000682,-0.000195,-1.2e-05
