0.004576,0.004702,0.005024,0.005287,0.005597,0.005508,0.005524,0.005396,0.005126,0.005345,0.00545,0.00525,0.004804,0.004728,0.005244,0.004952,0.004708,0.005219,0.005396,0.005016,0.00523,0.005356,0.005253,0.005464,0.006214,0.006583,0.006708,0.007781
0.005533,0.005653,0.006118,0.006427,0.006752,0.006628,0.006598,0.006448,0.006105,0.006268,0.006489,0.006361,0.005758,0.00571,0.00641,0.006001,0.005753,0.006472,0.006598,0.006123,0.006373,0.006384,0.006314,0.006607,0.007474,0.007984,0.008001,0.008996
0.007169,0.007181,0.007771,0.008258,0.008595,0.008269,0.008124,0.007973,0.007594,0.007714,0.008142,0.008109,0.00725,0.007316,0.008278,0.007653,0.007389,0.00843,0.008465,0.007851,0.008165,0.007958,0.007954,0.008338,0.00935,0.010185,0.009977,0.010656
0.008382,0.008157,0.008576,0.009272,0.009582,0.009006,0.008753,0.008521,0.008359,0.00878,0.00927,0.009047,0.00811,0.008443,0.009468,0.008651,0.008271,0.009429,0.009361,0.008636,0.009109,0.008851,0.008819,0.009123,0.010026,0.011127,0.010753,0.011035
0.008851,0.008372,0.008355,0.009185,0.009576,0.008956,0.008542,0.008181,0.008476,0.009301,0.009641,0.009026,0.008221,0.008843,0.009692,0.008958,0.008462,0.009308,0.009148,0.008323,0.008847,0.008866,0.008827,0.008829,0.009242,0.010353,0.010279,0.010668
0.009192,0.008783,0.008275,0.008874,0.009434,0.00894,0.008311,0.007995,0.008635,0.009268,0.009457,0.009016,0.008628,0.009392,0.009786,0.00901,0.008591,0.009167,0.008977,0.008047,0.008242,0.008536,0.008592,0.008403,0.00842,0.009261,0.009498,0.010171
0.010103,0.010468,0.009663,0.009637,0.010114,0.009692,0.009081,0.008834,0.009373,0.009655,0.010274,0.010339,0.010078,0.010931,0.01078,0.009712,0.009579,0.01014,0.009976,0.008971,0.008583,0.008609,0.00863,0.008604,0.008991,0.009721,0.009767,0.010667
0.012358,0.013368,0.012359,0.011849,0.011999,0.011525,0.010951,0.010706,0.011172,0.011203,0.01208,0.01224,0.011767,0.012791,0.012653,0.011213,0.010871,0.01131,0.01123,0.010687,0.010193,0.009502,0.0095,0.009822,0.010578,0.011377,0.011459,0.012556
0.015412,0.016413,0.015567,0.01496,0.014726,0.014052,0.013053,0.012801,0.013267,0.013086,0.013897,0.014326,0.013869,0.014985,0.015177,0.013163,0.0123,0.012616,0.012533,0.01212,0.011826,0.011017,0.010945,0.0113,0.012274,0.013392,0.013807,0.014692
0.017725,0.018073,0.018052,0.018454,0.017883,0.016532,0.014779,0.014369,0.014832,0.014753,0.015268,0.016025,0.016001,0.017175,0.017682,0.015511,0.014625,0.014484,0.013745,0.012829,0.012804,0.012695,0.012598,0.012622,0.013763,0.01523,0.01556,0.015888
0.018811,0.018216,0.019086,0.021189,0.020433,0.018315,0.016406,0.015721,0.015795,0.01586,0.015825,0.016573,0.016933,0.017737,0.018431,0.017173,0.01692,0.016109,0.014551,0.013442,0.013694,0.014045,0.013965,0.013684,0.014907,0.016542,0.016321,0.015899
0.018454,0.017751,0.018762,0.021606,0.020715,0.01796,0.016809,0.016336,0.015777,0.015862,0.015466,0.015845,0.015903,0.015979,0.016751,0.016651,0.017234,0.016202,0.014637,0.014265,0.014338,0.014413,0.01468,0.014484,0.016056,0.017581,0.016373,0.01523
0.016822,0.017091,0.017938,0.02071,0.019571,0.016013,0.01546,0.015735,0.015064,0.015239,0.015007,0.014842,0.013827,0.013382,0.014359,0.014333,0.015174,0.015057,0.014554,0.014954,0.014196,0.013653,0.014508,0.014725,0.016399,0.017766,0.016555,0.015027
0.015401,0.015927,0.015983,0.018345,0.017899,0.01436,0.013345,0.014508,0.01467,0.014558,0.01446,0.014029,0.012399,0.012164,0.013078,0.01207,0.012824,0.013915,0.013977,0.014488,0.013596,0.01311,0.014558,0.014769,0.015443,0.016473,0.015921,0.014903
0.014339,0.014155,0.014301,0.016613,0.016443,0.013742,0.012709,0.014042,0.014612,0.013459,0.013022,0.013419,0.012596,0.012902,0.013543,0.011864,0.011908,0.012685,0.012219,0.01296,0.013848,0.014598,0.016408,0.0158,0.013784,0.013708,0.014362,0.015148
0.014353,0.013831,0.014852,0.017704,0.016799,0.014355,0.014425,0.015712,0.01567,0.013857,0.013298,0.014702,0.014973,0.015037,0.015183,0.013374,0.012922,0.013572,0.012496,0.012618,0.014634,0.016714,0.019124,0.018345,0.014783,0.014241,0.01532,0.016767
0.015982,0.015649,0.017615,0.021255,0.01887,0.015761,0.017091,0.018015,0.017548,0.016423,0.016318,0.018584,0.019708,0.018926,0.018688,0.016774,0.015749,0.016656,0.015433,0.014861,0.016091,0.018351,0.021333,0.021061,0.018228,0.019096,0.02037,0.020895
0.018767,0.017949,0.02099,0.025479,0.022267,0.018926,0.020638,0.020906,0.021189,0.020383,0.02023,0.02381,0.025395,0.023482,0.023064,0.02153,0.020917,0.021761,0.019758,0.018431,0.018068,0.01996,0.023402,0.024403,0.023584,0.025874,0.026775,0.026209
0.023959,0.022424,0.026268,0.030339,0.026218,0.022852,0.024863,0.025375,0.026544,0.024845,0.024728,0.029795,0.030422,0.02734,0.027217,0.026376,0.026993,0.028065,0.02531,0.022965,0.020699,0.022032,0.025616,0.027525,0.029077,0.031458,0.031074,0.031344
0.02955,0.028337,0.032195,0.034425,0.028723,0.026176,0.030184,0.030873,0.030506,0.028574,0.030203,0.034817,0.033393,0.030701,0.031485,0.030621,0.031426,0.03227,0.02922,0.027174,0.0241,0.023713,0.026779,0.029469,0.032076,0.032532,0.031566,0.03536
0.031878,0.032963,0.03626,0.03574,0.029393,0.029389,0.035672,0.035591,0.032439,0.031807,0.035974,0.038543,0.036214,0.035221,0.035567,0.033767,0.034125,0.033992,0.031764,0.031642,0.02778,0.023759,0.025918,0.031261,0.03363,0.030663,0.031279,0.039638
0.032903,0.035602,0.035846,0.034038,0.029089,0.030274,0.037432,0.038348,0.03498,0.035249,0.039621,0.040546,0.039227,0.040088,0.039999,0.037326,0.035979,0.035378,0.036027,0.037572,0.031415,0.024284,0.026025,0.032859,0.032907,0.027143,0.030426,0.043059
0.03933,0.041072,0.035073,0.033361,0.02982,0.029013,0.035764,0.038351,0.035454,0.035308,0.040055,0.040549,0.042721,0.048215,0.048304,0.044673,0.039737,0.035885,0.037928,0.041197,0.035053,0.028121,0.03003,0.035028,0.030873,0.025294,0.030825,0.043358
0.044933,0.046439,0.036422,0.033921,0.030142,0.027497,0.035035,0.039451,0.035742,0.033529,0.037795,0.037703,0.042728,0.051904,0.052001,0.048801,0.042767,0.035954,0.03774,0.042545,0.03799,0.031652,0.032258,0.035382,0.031705,0.027506,0.03112,0.039397
0.042026,0.043037,0.03404,0.031462,0.028104,0.027423,0.036809,0.041264,0.035138,0.029967,0.0325,0.032152,0.037699,0.047219,0.047267,0.044505,0.040219,0.035374,0.035744,0.039194,0.036751,0.033208,0.0335,0.033268,0.0308,0.028453,0.030052,0.033515
0.031168,0.03378,0.030209,0.026789,0.023693,0.027931,0.039527,0.042878,0.03388,0.026391,0.028833,0.02993,0.034401,0.039721,0.038639,0.036221,0.033537,0.034132,0.033614,0.031545,0.030823,0.033504,0.036373,0.031791,0.02768,0.027471,0.029987,0.029759
0.026174,0.031545,0.031553,0.024861,0.019747,0.026527,0.038442,0.041273,0.033374,0.028709,0.032063,0.032901,0.034787,0.037423,0.038808,0.038881,0.034866,0.035762,0.034733,0.027777,0.026307,0.032983,0.038156,0.032287,0.030187,0.031778,0.030529,0.027461
0.03196,0.035166,0.035789,0.02766,0.022762,0.028594,0.037942,0.040722,0.038089,0.040427,0.041979,0.036141,0.032859,0.037318,0.044679,0.046921,0.041047,0.042155,0.04283,0.033122,0.030295,0.034778,0.037691,0.0339,0.040146,0.045139,0.037129,0.030801
0.045857,0.04018,0.037875,0.032309,0.030706,0.036112,0.041579,0.041898,0.048062,0.058597,0.056563,0.042395,0.034129,0.040207,0.052433,0.055249,0.047248,0.052426,0.056961,0.046416,0.043459,0.042358,0.040363,0.041447,0.057982,0.066624,0.053341,0.041724
0.070216,0.054105,0.041433,0.036706,0.041388,0.047232,0.050102,0.046883,0.060038,0.078183,0.077103,0.058044,0.046182,0.04775,0.05718,0.059731,0.051984,0.063818,0.072763,0.064045,0.062827,0.053936,0.042753,0.052025,0.077652,0.087464,0.072382,0.055102
0.098247,0.076093,0.050375,0.040671,0.050467,0.057607,0.058235,0.050295,0.069446,0.094767,0.096525,0.077688,0.065477,0.058637,0.063007,0.06652,0.05735,0.07574,0.087445,0.077875,0.080444,0.067914,0.047753,0.062669,0.089202,0.095756,0.087871,0.069662
0.11455,0.094927,0.063293,0.04483,0.052132,0.062553,0.06236,0.053206,0.077177,0.105833,0.104976,0.088861,0.08192,0.068583,0.067785,0.073442,0.063757,0.082344,0.093662,0.08304,0.085564,0.074695,0.054905,0.07058,0.08547,0.08411,0.09138,0.079392
0.104699,0.095897,0.066692,0.041475,0.044134,0.057711,0.058232,0.050793,0.073866,0.098675,0.091053,0.080921,0.08353,0.06886,0.063438,0.068217,0.060022,0.073629,0.083091,0.074675,0.071608,0.065101,0.052704,0.065012,0.068031,0.059388,0.076802,0.073958
0.071331,0.074461,0.054749,0.030495,0.033798,0.046162,0.049521,0.045466,0.056861,0.072139,0.059699,0.055901,0.065586,0.058616,0.052499,0.050223,0.044065,0.050407,0.057372,0.053674,0.045303,0.042441,0.038184,0.045616,0.04935,0.041049,0.051655,0.054292
0.035778,0.04344,0.033933,0.017827,0.023891,0.032181,0.038198,0.036775,0.036109,0.041827,0.030458,0.029661,0.03844,0.041669,0.043361,0.033808,0.028073,0.028607,0.031115,0.030808,0.022181,0.020307,0.020233,0.024133,0.031943,0.029978,0.030367,0.036894
0.017606,0.022561,0.018875,0.013125,0.018823,0.023528,0.030252,0.028976,0.027321,0.026891,0.019704,0.018244,0.018934,0.025499,0.035333,0.026277,0.021394,0.020774,0.019713,0.020517,0.013733,0.009804,0.010731,0.015728,0.023206,0.024281,0.022038,0.030487
0.013248,0.017458,0.015944,0.013488,0.015914,0.017802,0.021956,0.020936,0.021979,0.01962,0.015168,0.014092,0.011321,0.014829,0.025583,0.022669,0.017917,0.018273,0.018005,0.017714,0.012334,0.010016,0.010697,0.015891,0.020114,0.020486,0.020499,0.028135
0.011721,0.014485,0.01395,0.012314,0.012801,0.014916,0.017082,0.015829,0.016395,0.014455,0.011368,0.011617,0.009561,0.009244,0.017972,0.02084,0.0147,0.014176,0.016409,0.014806,0.010741,0.011651,0.011667,0.014955,0.020306,0.020309,0.020141,0.025168
0.01224,0.012349,0.010783,0.00974,0.011699,0.013489,0.014642,0.015233,0.013652,0.011784,0.009609,0.010016,0.011237,0.011133,0.015599,0.018893,0.013557,0.010472,0.013405,0.012231,0.010151,0.012343,0.010656,0.011488,0.020353,0.020354,0.019491,0.02724
0.01383,0.012678,0.009015,0.009297,0.0138,0.014687,0.014425,0.016314,0.016404,0.013672,0.010619,0.010404,0.01382,0.015871,0.015077,0.016236,0.015375,0.011441,0.011488,0.011865,0.011354,0.011437,0.008129,0.007835,0.021349,0.024009,0.022757,0.03364
