-0.000753,-0.000754,-0.000587,-0.000569,-0.000335,-0.000212,-0.000344,-0.001111,-0.000951,-0.000786,-0.000567,-0.000721,-0.000528,-0.000398,-0.00054,-0.000474,-0.000657,-0.000528,-0.00025,-0.000421,-0.000256,-0.000247,-0.000658,-0.000467,-0.000319,-0.000773,-0.000428,-0.000689,-0.000513,-0.000548,-0.00099,-0.000571,-0.000588,-0.00057,-0.00054,-0.000515,-0.000612,-0.000504,-0.000617,-0.00038,-0.000292,-0.000304,-0.000642,-0.000782,-0.000743,-0.000456,-0.000514,-0.000798,-0.000556,-0.000338,-0.000255,-0.000323,-0.001023,-0.000796,-0.000552,-0.000681,-0.000282,-0.000898,-0.000583,0,5e-06,-0.000243,-0.000253,-0.000549,-0.000668,-0.000689,-5e-04,-0.000514,-0.000327,-0.000724,-0.000536,-0.000295,-0.000688,-0.000286,-0.000329,-0.000431,-0.000339,-0.000498,-0.000446,-0.000396,-0.000481,-0.000329,-0.000761,-0.000668,-0.000719,-0.000667,-0.000662,-0.000642,-0.000662,-0.000583,-0.000383,-5e-06,-0.000512,-0.000414,-0.000361,-0.000723,-0.000746,-0.000468,-0.000204,-0.000598,-0.000854,-0.000946,-0.000561,-0.000525,-0.000201,-0.000375,-0.000539,-0.000429,-0.000521,-0.00026,-0.000176,-0.000111,-0.000169,-0.000386,-0.000236,-0.000422,-0.000305,-0.000405,-0.000367,-0.000822,-0.000538
0.000168,0.000463,0.000405,0.000356,-9.7e-05,-0.000197,1.5e-05,0.000686,0.000711,0.000152,0.000183,0.00041,0.000207,9e-06,0.000185,0.000258,0.000205,0.000294,0.000185,4.1e-05,-5e-05,-4.1e-05,0.000434,0.000201,0.000116,0.000266,0.000173,0.000329,0.000224,0.000225,0.000685,0.000297,0.00028,0.000433,0.00036,6.4e-05,0.000441,0.000392,0.000276,9.6e-05,8.8e-05,0.000162,0.000396,0.00016,0.000273,0.000199,0.000446,0.000514,0.000373,0.000292,-5e-06,-6.4e-05,0.00073,0.000747,0.000144,0.000418,0.000196,0.000426,0.00011,-0.000147,-0.000221,-0.000215,-4.4e-05,0.000185,0.000448,0.000387,0.00033,0.000156,0.000156,0.000477,0.000415,0.000408,0.000505,0.000203,0.000145,0.000204,0.000371,0.000354,0.000269,6.7e-05,0.000215,0.000225,0.000407,0.000257,0.000292,0.000522,0.000211,0.000173,0.000172,0.000196,6.2e-05,0.000153,0.000165,0.000153,-1e-06,0.000219,0.000253,0.00013,-4.5e-05,0.000385,0.000824,0.000742,0.000429,0.000193,0.000166,0.000105,0.000205,0.000351,0.00037,0.000317,6.1e-05,9e-06,-2.7e-05,0.000516,0.000234,0.00034,0.000228,0.000148,0.000328,0.000412,0.000441
9e-05,-0.000343,-0.000293,-0.000181,1.1e-05,0.000183,-2.5e-05,-0.00061,-0.000542,-0.000136,-0.00039,-0.00039,-0.000228,-1.1e-05,1.7e-05,-0.000303,-0.000224,-0.000214,2.3e-05,-0.000124,-5.3e-05,6e-05,-0.000369,-0.000155,0.000129,4.2e-05,-1e-05,-0.000119,-0.000188,-0.000137,-0.000716,-0.000427,-0.000206,-0.000342,-9.2e-05,0.000177,-0.000391,-0.000646,-0.000338,6.5e-05,-3.9e-05,-0.000155,-0.000355,-0.000215,-9.1e-05,2.6e-05,-0.00031,-0.000399,-0.000133,-9e-05,-0.00011,-4.7e-05,-0.000251,-0.000358,-0.000325,-0.00028,-7e-05,8.8e-05,-9e-06,1.5e-05,-0.00017,-0.000131,-0.000158,-0.000118,-0.00031,-0.000294,-0.000107,-0.00028,0.000149,-0.000235,-0.000151,-0.000287,-0.00033,-0.000167,-0.000235,-0.000292,-0.000196,-0.000426,-0.000155,-2.3e-05,-7e-05,-7e-06,-0.000248,-0.000274,-5.1e-05,-0.000303,-6.6e-05,-0.000247,-0.000109,-8.1e-05,-0.000141,-0.000305,-9.9e-05,-0.000109,0.00012,-0.00012,-4.7e-05,4.5e-05,-4.6e-05,-0.000509,-0.000367,-0.000318,-0.000244,4.8e-05,-0.00023,-0.000472,-0.000292,-0.000345,-0.000314,-0.000343,-0.000125,0.000148,-7.6e-05,-0.000265,2.2e-05,-0.000255,-0.000341,-7.7e-05,-1.6e-05,-5.8e-05,-7.7e-05
-9.3e-05,4.4e-05,5.6e-05,-8.5e-05,-1e-04,-5e-06,-6e-06,5.5e-05,-7.5e-05,-6.3e-05,0.000232,0.000242,8.4e-05,-7.3e-05,1.2e-05,7.2e-05,1.2e-05,-1.8e-05,-5.6e-05,-0.000104,3e-06,-0.000141,-0.000124,3.5e-05,-0.000538,-0.000235,-0.00013,-4e-05,0.000172,4.2e-05,0.000366,0.000225,-9.6e-05,0.000179,-9.5e-05,-0.000254,0.000248,0.000247,-1.1e-05,-0.000196,-0.000131,-0.000122,0.000122,7.1e-05,-0.000209,-7.9e-05,-5e-06,0.000117,-0.000134,8e-05,3e-05,-7.5e-05,7e-06,7.1e-05,3.6e-05,-3.7e-05,-1e-04,-0.000134,-0.000116,-0.000114,-0.000257,-2.7e-05,2e-05,2.4e-05,0.00018,0.000168,-0.000264,0.000107,-8.7e-05,-4e-05,-0.000113,-7.8e-05,4.4e-05,-1.7e-05,-8.1e-05,0.00013,-1.6e-05,0.000159,-0.000122,5e-05,-2.7e-05,-0.00012,4.8e-05,0.000231,-0.000137,-4.1e-05,-0.000106,7.5e-05,7e-05,3e-05,1.8e-05,7e-05,-0.00012,4.9e-05,-0.000167,-4.3e-05,-3.6e-05,-0.000212,-2.2e-05,0.00014,7e-05,-0.000188,-0.00024,-0.00015,-0.000216,2.9e-05,0.00023,0.000118,9.1e-05,2.5e-05,-8.8e-05,1.9e-05,-1.9e-05,9e-06,-4.9e-05,-0.000109,-0.000161,-0.000222,-0.000143,6.7e-05,-0.000309
0.000102,-0.000112,-8.3e-05,9.5e-05,0.000141,-5.7e-05,7e-06,4.5e-05,0.000183,0.000214,3e-05,-0.000115,-3.3e-05,-6.5e-05,-7.7e-05,-0.000174,-0.000117,-1.5e-05,2e-05,3e-06,4e-05,7.6e-05,9.5e-05,3.6e-05,0.000156,0.00011,3.6e-05,2.9e-05,-0.000134,-0.000149,-0.000148,-0.000236,9.4e-05,-0.000109,-4e-05,-9e-05,-0.000141,-0.00022,9.2e-05,5.4e-05,9.7e-05,1.2e-05,-4e-05,7.8e-05,0.000228,-3.1e-05,-6.5e-05,-0.000211,-0.000194,-0.000146,1.4e-05,0.00018,0.000108,0.000159,9.4e-05,-6.7e-05,-2e-06,3.6e-05,-1.6e-05,-8.2e-05,0.000145,0.000108,-0.000114,-3.1e-05,-0.000183,-0.000117,0.000144,8.3e-05,4e-06,7.1e-05,-9.6e-05,0.000125,-5.7e-05,-9.1e-05,0.00012,-1e-06,-9.8e-05,-9.1e-05,9.9e-05,-0.000105,-0.000184,0.000119,0.000115,-0.000184,0.00024,-2.4e-05,-7.5e-05,0.000261,-4.9e-05,3.9e-05,0.000103,0.000109,8.2e-05,-4.7e-05,0.000108,9.6e-05,-1.3e-05,4.6e-05,8.9e-05,-4e-06,0.000136,0.000215,0.000102,3.5e-05,8.1e-05,2.8e-05,-0.000102,3e-06,-0.000148,-6e-06,0.000129,8.4e-05,-0.000109,-9.2e-05,-8.1e-05,0.000139,0.00021,6.7e-05,5.9e-05,-0.000151,0.000193
0.000104,0.000108,4.5e-05,-0.000222,-3.8e-05,0.000159,-8.2e-05,-7.1e-05,7e-06,-9.9e-05,0.000161,6.9e-05,5.4e-05,8.4e-05,0.000104,0.000173,0.000175,6.9e-05,2e-06,-9e-06,-0.000115,0.000103,8e-05,-0.000158,5.9e-05,8.2e-05,-0.00011,6.7e-05,0.000161,0.000201,0.000235,0.000185,9.9e-05,-1.9e-05,-0.000114,4.9e-05,7.4e-05,0.00027,-2e-06,4.6e-05,-1e-05,2.5e-05,-3.7e-05,-0.000117,-0.000108,1e-05,2e-06,0.000172,0.000191,0.000152,1.3e-05,-0.000118,-7.2e-05,-0.000186,1.1e-05,6.9e-05,1.5e-05,-3.5e-05,3.2e-05,1.8e-05,8.1e-05,8.7e-05,0.00026,9.5e-05,0.000103,0.000125,-7.9e-05,-0.000117,-2.3e-05,-4.8e-05,0.000213,-9.1e-05,-0.00016,-3.3e-05,4e-05,-8e-05,0.000131,9.5e-05,-4.5e-05,0.000138,0.000118,-0.000185,-0.000215,0.00013,0.000247,9.2e-05,0.000173,-0.000162,0.000101,-5.2e-05,-0.00012,-6.9e-05,-4.3e-05,-7.7e-05,0,-4.6e-05,0.000134,1.5e-05,-1.8e-05,-5e-06,-7.1e-05,-0.000163,-6e-05,4.3e-05,3.6e-05,6.6e-05,6.9e-05,-8e-06,1.3e-05,-6.5e-05,-0.000121,4.9e-05,1.2e-05,8.4e-05,-5.4e-05,1.7e-05,-1.1e-05,-0.000118,-0.000254,7.8e-05,-0.000112
-0.00022,-0.000221,0.000192,0.00017,3e-05,-2.5e-05,5.1e-05,0.000181,0.000109,6.3e-05,-0.000179,-0.000121,-0.000129,1.4e-05,-1e-05,-7.5e-05,-5.3e-05,7e-06,3.1e-05,-4e-06,-1.5e-05,8.9e-05,-6.7e-05,0.000105,-5e-05,2.7e-05,-3.1e-05,1.4e-05,2.3e-05,-0.000147,-0.000119,-0.000162,-2.1e-05,-6e-06,9.1e-05,-3.8e-05,3.9e-05,-0.000178,3.6e-05,-6.8e-05,-4.6e-05,5.8e-05,-6.3e-05,3.3e-05,4e-05,-9.4e-05,-0.000107,-0.000216,-0.000193,-0.000169,6e-06,-2e-06,2.8e-05,0.000127,0.000116,-5.6e-05,-8.4e-05,-1.6e-05,5.2e-05,-1.5e-05,-2.7e-05,-0.000159,-0.00012,2e-06,-8.1e-05,-6.1e-05,5.3e-05,6.8e-05,1.3e-05,-1.5e-05,-8.6e-05,-3.4e-05,0.00017,9.7e-05,5.6e-05,6.3e-05,-1e-04,3.6e-05,0.000115,-8.4e-05,-0.000104,8e-05,0.000131,-6.1e-05,-0.000259,-0.000148,-4e-05,4.1e-05,-8.1e-05,-5.5e-05,5.5e-05,-4.4e-05,2.9e-05,0.000143,2.7e-05,-1.4e-05,-8e-05,-5.3e-05,4.3e-05,-5.6e-05,0.000167,0.000255,6e-05,-6.2e-05,-5.6e-05,1e-04,-0.000102,0.000106,0.000105,-5.3e-05,-5e-06,-6.2e-05,-2.7e-05,2.1e-05,-8.4e-05,3e-06,4e-06,3e-06,0.000103,-1.6e-05,-5.3e-05
0.000124,0.00018,-0.000117,-0.000106,-2.4e-05,-0.000103,3e-05,-0.000154,-0.000142,-0.000124,-1e-05,-1.9e-05,8.2e-05,2.7e-05,-9.8e-05,-2.4e-05,0.000129,3.5e-05,-5e-05,3.5e-05,4.1e-05,3.1e-05,-2e-05,-9.4e-05,1.3e-05,3.3e-05,7.7e-05,-6.4e-05,-5.3e-05,6e-05,-2.3e-05,9.7e-05,-6e-05,-6e-06,-0.000159,4e-06,-0.000104,6.7e-05,-5.1e-05,5e-06,7.3e-05,5.2e-05,9.7e-05,5.6e-05,6e-05,0.000154,9.9e-05,0.000161,0.000183,3.9e-05,-6e-05,-4.1e-05,-6e-06,6e-06,-7.7e-05,9.6e-05,5.7e-05,-1.3e-05,-3.3e-05,-5.8e-05,4.9e-05,-5.6e-05,-4.8e-05,-2.2e-05,-2.3e-05,7.8e-05,-5e-06,-7.6e-05,-1.3e-05,-6e-06,-1.2e-05,-0.000131,-9.7e-05,-6.3e-05,-7.6e-05,-9.6e-05,8.9e-05,3.3e-05,-0.000164,1.9e-05,1.2e-05,-5.8e-05,4.4e-05,1.1e-05,0.000145,7.8e-05,-6e-05,6.4e-05,-3.8e-05,-1e-06,-9e-06,-5e-05,3.3e-05,-6.4e-05,0,3.7e-05,2.5e-05,1.1e-05,-9e-05,-2e-06,-0.000191,-0.00014,4.2e-05,0.00011,9.1e-05,-2.1e-05,9.6e-05,-5.9e-05,-0.000111,-4e-05,-3.8e-05,-8e-06,-6.4e-05,5.7e-05,-2.8e-05,0.000108,1e-05,0.000183,-1.4e-05,-0.000166,0
-7.6e-05,-1.8e-05,3.7e-05,6.6e-05,5e-06,6.9e-05,2.2e-05,1.1e-05,-4.6e-05,-4e-06,8e-06,3.2e-05,-2.6e-05,-2e-05,0.00011,6e-05,-0.000117,-2.6e-05,7.9e-05,2.8e-05,1.9e-05,-0.000102,-3.5e-05,7.1e-05,0,-0.000175,-5.4e-05,5.9e-05,4.9e-05,-5.9e-05,-9.7e-05,-7.8e-05,3.7e-05,-1e-05,0.000111,3e-05,6.1e-05,-6.1e-05,3.3e-05,-5.5e-05,-5.2e-05,-5e-05,7.6e-05,1.3e-05,-6.4e-05,-8.3e-05,-3.5e-05,1.9e-05,-8.5e-05,-7.5e-05,1.1e-05,7.1e-05,-8.3e-05,-2e-05,-8.8e-05,-7.7e-05,-9.1e-05,-0.000119,7e-06,1.7e-05,2e-06,-1.5e-05,5e-06,-9.4e-05,-4e-05,-8.1e-05,-3.4e-05,-1e-06,1.5e-05,2.9e-05,2e-06,-5.6e-05,1e-04,0.000125,-7e-06,4.4e-05,-7.7e-05,-4.3e-05,3.2e-05,5.7e-05,-1.2e-05,2.7e-05,-0.000128,9e-06,-0.000195,-5.4e-05,0.000147,-2.8e-05,-7e-06,7.2e-05,2.5e-05,1.9e-05,5e-06,3.3e-05,1.6e-05,-4.2e-05,-6.1e-05,-1.4e-05,5e-06,1e-05,3.7e-05,7.7e-05,-1.6e-05,-1e-05,-0.000124,-1.7e-05,-9.3e-05,-2.6e-05,9.3e-05,5.8e-05,2.2e-05,-2.3e-05,5.2e-05,4.9e-05,-6.8e-05,-7.8e-05,-3.7e-05,-7.2e-05,3.2e-05,8.9e-05,2.9e-05
-6.7e-05,1.9e-05,-0.000101,-1.3e-05,-1e-06,-2.3e-05,6e-06,4.6e-05,3.3e-05,5.2e-05,-4e-06,6.3e-05,4e-05,-1.9e-05,5.3e-05,-2e-05,-1.3e-05,-2e-06,-8.3e-05,7e-06,7.8e-05,5.6e-05,-3.4e-05,-1.4e-05,4.2e-05,7.3e-05,1.5e-05,-6.4e-05,-3.6e-05,2e-06,4.9e-05,7.4e-05,-0.000128,-7e-06,-8.2e-05,-1e-06,1.6e-05,4e-05,1.4e-05,5.3e-05,2.1e-05,1e-06,-1.6e-05,2.3e-05,-0.000103,3.1e-05,8e-06,4.2e-05,3.7e-05,5.5e-05,-1.8e-05,-2e-06,9.6e-05,3.1e-05,8.2e-05,7.2e-05,5e-05,5.9e-05,4.4e-05,0.00011,2e-05,7.2e-05,1.8e-05,7.1e-05,0,1.2e-05,0.000117,4e-05,-5.2e-05,-5.6e-05,-8.2e-05,3.6e-05,-6.1e-05,-3.5e-05,-3.5e-05,-1e-05,9.1e-05,7.1e-05,-3.3e-05,1.7e-05,1.1e-05,-3.1e-05,8e-05,-3e-05,0.000101,0.000194,-0.000135,9.4e-05,7e-06,-0.00015,-2e-06,-1.7e-05,-3.6e-05,-3e-06,4e-06,-2.1e-05,1.1e-05,4.5e-05,-5.9e-05,3.6e-05,-6.3e-05,4.2e-05,-7.5e-05,8e-06,5.5e-05,-8e-06,6e-06,-5.2e-05,-0.00011,3.4e-05,3e-05,3.1e-05,-1.9e-05,5e-06,0.000129,3e-05,-5e-06,3.1e-05,-6e-06,-0.00012,-6.6e-05
-3.1e-05,1e-06,6.2e-05,1.9e-05,-3.4e-05,2.6e-05,1.5e-05,1e-06,-4.1e-05,-1.9e-05,6.3e-05,-1.6e-05,1.5e-05,3.4e-05,-7.6e-05,-1.7e-05,-2.2e-05,-3.1e-05,5.7e-05,1e-05,-2.6e-05,-3.6e-05,-5e-06,-5e-06,1e-05,-5.3e-05,-7.1e-05,-9.6e-05,1.2e-05,2e-05,3.2e-05,1.7e-05,0.000131,-2.1e-05,7e-05,-1.6e-05,-0.000121,-1.8e-05,-5.2e-05,5.4e-05,4e-06,8e-06,-3.6e-05,-1.9e-05,8e-05,-1.3e-05,-1.3e-05,-1.3e-05,-4.1e-05,-4e-06,5.5e-05,2.2e-05,-5.4e-05,-7.3e-05,-4.5e-05,-3.5e-05,3.5e-05,1.1e-05,6e-06,-8.5e-05,-2.1e-05,7.4e-05,3.7e-05,-9.2e-05,-7e-06,-1.9e-05,-8.6e-05,-2.1e-05,0.000142,4.9e-05,-9e-06,6.2e-05,4.5e-05,-1.5e-05,-5e-05,-2.3e-05,3.1e-05,-4.3e-05,-7e-06,1.1e-05,-2.6e-05,6.6e-05,-9.2e-05,4.1e-05,-7.2e-05,-2.2e-05,7.3e-05,-3.2e-05,-4e-06,0.000172,1.7e-05,1.8e-05,-4e-06,-2.2e-05,-3.2e-05,2.8e-05,5.8e-05,7e-06,2.9e-05,-3.3e-05,3.1e-05,-1.9e-05,-1.4e-05,2.7e-05,-1.7e-05,-1.8e-05,3.8e-05,8.1e-05,3.1e-05,4.2e-05,2.4e-05,2e-06,-1.6e-05,-5.7e-05,-1.4e-05,-7.2e-05,5e-06,-8.8e-05,1.5e-05,-5.6e-05,-1.2e-05
0.000155,-1.9e-05,-9.4e-05,-6.5e-05,-2.5e-05,1.3e-05,-4.2e-05,-2.3e-05,3.2e-05,3.6e-05,-0.000102,-6e-06,-4.5e-05,1.8e-05,5.6e-05,-1.3e-05,1e-06,1e-06,-3.7e-05,0,1e-06,2.4e-05,4.3e-05,-2.6e-05,-2e-05,3e-05,-9e-06,8.6e-05,4.3e-05,-5.1e-05,-5.4e-05,-2.4e-05,-2.5e-05,4.1e-05,2e-06,1.4e-05,1.5e-05,-8e-06,5.7e-05,2e-06,1.4e-05,3e-06,-4.1e-05,1.1e-05,-5e-06,1.1e-05,1.6e-05,-2.2e-05,1e-06,2.4e-05,-5.3e-05,-8e-06,4e-06,4.9e-05,-2.3e-05,0,2.5e-05,-1.3e-05,3e-05,-3e-06,-4e-06,-3.8e-05,-2.9e-05,7.1e-05,4.2e-05,2e-06,6.2e-05,2.2e-05,-0.000124,-1.6e-05,2.4e-05,-6.2e-05,5.9e-05,-1.2e-05,0,-3e-06,-4.4e-05,4e-06,3.4e-05,-4e-06,4e-05,-8.6e-05,1.5e-05,-5e-06,4.8e-05,-5e-06,-3.2e-05,2.3e-05,1.6e-05,-9.4e-05,-3.5e-05,-1.5e-05,4.9e-05,-2.9e-05,-1.8e-05,-4.2e-05,8e-06,-5e-06,-1.9e-05,3.9e-05,9e-06,6.1e-05,1.9e-05,-4.5e-05,3e-05,3e-06,-1e-06,-5.7e-05,3.2e-05,1e-05,0,-4.7e-05,0,2.1e-05,-2.2e-05,4e-06,-4e-05,-9.1e-05,-3.8e-05,4.8e-05,1.2e-05
-8.6e-05,-1.7e-05,4.8e-05,-3.7e-05,-5e-06,-2.3e-05,1.3e-05,-2.3e-05,-2.1e-05,-5.6e-05,2.8e-05,-1.9e-05,2.1e-05,-5.2e-05,-4.2e-05,1.2e-05,0,2.8e-05,2.5e-05,-1e-06,-2.2e-05,-7.8e-05,4e-06,9e-06,-1.8e-05,-1.2e-05,-1.9e-05,-3.2e-05,-5.6e-05,4.5e-05,1.7e-05,3.2e-05,2.9e-05,-1.4e-05,-2.8e-05,-1.7e-05,7e-06,2.5e-05,-5.7e-05,-3.6e-05,-2e-06,-1.5e-05,-1.5e-05,-4.4e-05,1.4e-05,-2.9e-05,-3.1e-05,-1.1e-05,-3.1e-05,-2.2e-05,5e-06,0,-1.2e-05,-3e-06,-1e-06,1.3e-05,-1.1e-05,1.3e-05,-2.2e-05,1.8e-05,-2.5e-05,4.2e-05,3e-06,-3.7e-05,-2e-05,-2.4e-05,-9e-05,-1.9e-05,-1.1e-05,-1.1e-05,-4.7e-05,2e-06,-5e-06,1.4e-05,2e-05,-1e-05,3.4e-05,-2e-06,-2e-06,-2.3e-05,-4.3e-05,3.8e-05,-4.3e-05,1e-05,-4e-05,4e-06,1.6e-05,-6.4e-05,-3e-06,-6e-06,4.3e-05,5e-06,-2.8e-05,-6.5e-05,4e-06,1.3e-05,-3.7e-05,-1.5e-05,3e-05,-3.4e-05,1.3e-05,-4e-05,3.9e-05,-1.5e-05,-8e-06,-4.1e-05,2.1e-05,6e-06,-4.1e-05,-1.8e-05,2.1e-05,-2.5e-05,-1.9e-05,-1.1e-05,-1.6e-05,-5.3e-05,3.7e-05,7.9e-05,3.5e-05,9e-06,-5e-06
3.3e-05,-2.3e-05,-3.8e-05,5.3e-05,8e-06,1.7e-05,1.5e-05,3.6e-05,3.2e-05,2.6e-05,6e-06,1e-06,-5e-06,2.2e-05,-3e-06,-6e-06,-3e-05,2e-06,-3e-06,3.2e-05,-1e-05,3.4e-05,-2.1e-05,3e-06,-3.9e-05,2.3e-05,4.1e-05,-7e-06,4.2e-05,-3.8e-05,3.5e-05,1e-05,-2.1e-05,1.6e-05,1.4e-05,2.3e-05,-1.6e-05,-5e-06,2.8e-05,-3.7e-05,-2.2e-05,1e-05,3.6e-05,4.6e-05,3e-06,7e-06,2.4e-05,2.2e-05,-2e-05,-1.3e-05,-3e-06,-2.6e-05,-1.6e-05,-8e-06,7e-06,-1.7e-05,-1.9e-05,6e-06,-1e-06,-2.8e-05,1.7e-05,-1.5e-05,1e-06,-1.8e-05,-2.5e-05,1.2e-05,6.5e-05,1.9e-05,-3e-06,-3e-06,3.1e-05,0,-4e-06,1e-05,5e-06,3.1e-05,-5.2e-05,-5e-06,7e-06,8e-06,7e-06,-4e-06,1.5e-05,3.4e-05,4.7e-05,-1.3e-05,-8.2e-05,7e-06,3e-06,-1.3e-05,-1.7e-05,6e-06,4e-06,2.7e-05,0,-4e-06,2.7e-05,-3.5e-05,-1.2e-05,-1e-05,-2.4e-05,-1e-06,-4.8e-05,2.7e-05,5.7e-05,1.9e-05,-5e-06,-4.8e-05,-7e-06,-6e-06,-1.8e-05,1.1e-05,1.6e-05,-2.7e-05,-5.1e-05,-9e-06,-3e-05,-3.1e-05,-5.1e-05,9e-06,0
2e-05,2.2e-05,4.9e-05,-2e-06,0,-2.9e-05,2e-06,-1.2e-05,-2.7e-05,-1e-05,-1.6e-05,-3e-06,-5e-06,-2.1e-05,-1.6e-05,3e-06,6e-06,5e-06,-3e-06,-2.2e-05,-2e-06,8e-06,1.4e-05,6e-06,3e-06,-2e-05,1.6e-05,1.1e-05,-2.6e-05,1e-05,-2.6e-05,-5e-06,-1e-06,1.7e-05,-1e-06,-2.1e-05,1.4e-05,2.6e-05,-2.3e-05,2.9e-05,1.1e-05,-1.1e-05,4e-06,-2.8e-05,0,3.6e-05,-2e-05,-1e-05,7e-06,8e-06,-3e-06,-4e-06,4.6e-05,5e-06,-9e-06,1.5e-05,-1e-06,-2.4e-05,1e-06,-1e-06,-1e-06,-2.7e-05,0,3.8e-05,-1e-05,-3.2e-05,-3.8e-05,-1.9e-05,-3.3e-05,1.7e-05,-2.1e-05,-3.1e-05,1.3e-05,-3.1e-05,5e-06,2e-05,2.7e-05,6e-06,-6e-06,1.3e-05,7e-06,4e-06,-2.2e-05,-2.6e-05,1.9e-05,1e-06,6.9e-05,-2.6e-05,-3e-06,3e-05,-1.5e-05,-5e-06,-7e-06,-1e-05,1e-06,-4e-06,-5e-06,2.9e-05,1.3e-05,1.5e-05,2.4e-05,-2.4e-05,3e-06,-7e-06,-2e-06,-5e-06,-1.2e-05,2e-05,2.6e-05,2.5e-05,1.7e-05,3.1e-05,-2e-06,-2e-06,-2.7e-05,1.4e-05,1.7e-05,2.2e-05,1.7e-05,9e-06,2.7e-05
-4.3e-05,-1.6e-05,-7e-06,-6e-06,1.3e-05,-6e-06,5e-06,1.2e-05,1.5e-05,2e-06,4e-05,2.4e-05,8e-06,2.4e-05,3.1e-05,0,2e-05,1.9e-05,0,2.3e-05,0,2.3e-05,1.4e-05,-1e-06,6e-06,4.5e-05,-1.1e-05,-6e-06,8e-06,7e-06,-4e-06,-1e-06,1.4e-05,-3.3e-05,1.8e-05,1.2e-05,1.4e-05,-1.9e-05,1e-05,0,-2e-06,1.5e-05,9e-06,1e-05,2e-06,-4e-06,9e-06,-9e-06,-7e-06,-2e-05,-5e-06,0,-2e-06,2e-06,2.4e-05,-1e-05,2e-06,1.3e-05,-2.2e-05,5e-06,-5e-06,5e-06,-2e-06,-1.5e-05,2.1e-05,9e-06,3.1e-05,6e-06,3.6e-05,-8e-06,2.1e-05,9e-06,0,1.4e-05,1.8e-05,1.2e-05,0,-3e-06,7e-06,-3e-06,-2e-05,-1.4e-05,1.8e-05,1.6e-05,-4.1e-05,7e-06,-4.4e-05,3.6e-05,5e-06,-4e-06,2.8e-05,-6e-06,-2e-06,1.2e-05,0,9e-06,1.1e-05,1.2e-05,-1e-05,-2.9e-05,-5e-06,1e-05,-4e-06,6e-06,1.2e-05,-2.1e-05,-4e-06,1e-06,-1.6e-05,3e-06,-1.6e-05,1.3e-05,-4e-06,-1e-05,3.4e-05,8e-06,-9e-06,-5.3e-05,-3e-06,-2.1e-05,3e-06
-5e-06,8e-06,3e-06,-5e-06,-7e-06,-1e-06,-7e-06,4e-06,-1.1e-05,1e-06,-1.1e-05,-1.8e-05,-4e-06,-7e-06,0,-1e-06,-1e-06,-1e-06,0,-4e-06,7e-06,-6e-06,-1.6e-05,4e-06,-8e-06,-2.6e-05,-4e-06,3e-06,-2.9e-05,-1.4e-05,1.4e-05,1e-06,-2.5e-05,-1.2e-05,-1.1e-05,-1.6e-05,6e-06,1.3e-05,-1.1e-05,4e-06,4e-06,-9e-06,-1.4e-05,-5e-06,6e-06,-1e-06,-4e-06,4e-06,6e-06,8e-06,1.8e-05,0,-1.7e-05,-1.3e-05,-1.3e-05,7e-06,0,-4e-06,8e-06,-1.3e-05,-1.1e-05,-5e-06,-7e-06,5e-06,-9e-06,7e-06,-3.4e-05,-7e-06,-1.4e-05,-6e-06,-7e-06,2e-05,5e-06,-1.2e-05,-9e-06,-8e-06,-2e-06,-1e-06,-1.8e-05,4e-06,6e-06,2e-05,-4e-06,-6e-06,4.2e-05,4e-06,2.9e-05,-1.6e-05,-2e-06,-1e-06,-7e-06,4e-06,1e-06,-1.6e-05,-2e-06,-7e-06,-9e-06,-1.8e-05,2e-06,1.4e-05,-1e-06,-1e-05,1.2e-05,0,-1e-06,7e-06,-2e-06,5e-06,-3e-06,5e-06,8e-06,1.4e-05,3e-06,0,1e-05,-2e-06,5e-06,0,1.8e-05,1.3e-05,1.7e-05
1e-06,-1e-05,-6e-06,9e-06,6e-06,-2e-06,0,-5e-06,8e-06,1.1e-05,3e-06,7e-06,0,-7e-06,-3e-06,5e-06,8e-06,1e-06,1e-06,3e-06,-1.2e-05,3e-06,-8e-06,-1.4e-05,0,-2e-06,-6e-06,0,5e-06,9e-06,-7e-06,2e-06,1e-05,8e-06,6e-06,1.5e-05,1e-06,-4e-06,1e-05,1e-06,-5e-06,1e-06,-1.7e-05,0,-1e-06,-2.2e-05,3e-06,-1.6e-05,-7e-06,5e-06,-1e-05,-2e-06,9e-06,1.3e-05,-1.2e-05,-8e-06,2e-06,-3e-06,-1.3e-05,3e-06,1.4e-05,1.4e-05,1.5e-05,-5e-06,4e-06,9e-06,2e-05,1e-06,8e-06,9e-06,-3e-06,-6e-06,9e-06,-3e-06,-1e-06,6e-06,5e-06,-2e-06,9e-06,-2.6e-05,-2e-06,-2.4e-05,1.3e-05,-2e-06,-3.4e-05,2e-06,-2.9e-05,9e-06,0,8e-06,-5e-06,-9e-06,2e-06,-6e-06,-1.2e-05,-6e-06,-4e-06,5e-06,-9e-06,-9e-06,-1.1e-05,6e-06,2e-06,-1.7e-05,5e-06,2e-06,-6e-06,2e-06,1.1e-05,6e-06,-4e-06,-6e-06,-5e-06,0,-1.3e-05,3e-06,0,1e-06,-1e-05,-2.8e-05,-5e-06
6e-06,6e-06,9e-06,-1.6e-05,-9e-06,1e-05,1e-06,6e-06,-1.4e-05,-5e-06,-9e-06,-1.6e-05,3e-06,4e-06,-8e-06,-8e-06,-1.2e-05,-2e-06,1e-06,0,-2e-06,1.3e-05,3e-06,6e-06,-6e-06,-3e-06,3e-06,-8e-06,-5e-06,-5e-06,-8e-06,0,-1.1e-05,-2e-06,-1.1e-05,-4e-06,2e-06,-3e-06,-1.1e-05,5e-06,5e-06,7e-06,1.1e-05,1e-05,-1.9e-05,7e-06,-3e-06,1e-06,-5e-06,1e-06,3e-06,2e-06,-4e-06,-1e-05,1.7e-05,3e-06,1e-06,3e-06,-5e-06,-7e-06,-1e-05,9e-06,-4e-06,0,8e-06,-3e-06,-1.1e-05,0,-1e-06,-5e-06,-5e-06,-1e-06,-7e-06,6e-06,-1.3e-05,2e-06,-8e-06,4e-06,-1.3e-05,3e-06,1e-06,1.3e-05,-4e-06,9e-06,-1e-06,-3e-06,1.3e-05,6e-06,0,-5e-06,3e-06,6e-06,-2e-06,1.9e-05,5e-06,1e-06,1.7e-05,1e-06,-5e-06,-6e-06,5e-06,-1.1e-05,-3e-06,4e-06,0,-2e-06,5e-06,5e-06,-5e-06,0,-2e-06,-3e-06,2e-06,-2e-06,1e-06,4e-06,-5e-06,4e-06,-4e-06,-5e-06,1e-06
8e-06,-4e-06,-3e-06,1.2e-05,2e-06,2e-06,-2e-06,7e-06,8e-06,6e-06,1e-05,1e-06,-3e-06,5e-06,5e-06,6e-06,1.4e-05,0,-3e-06,3e-06,-6e-06,-3e-06,5e-06,6e-06,1.2e-05,-6e-06,1e-05,1e-06,9e-06,1e-06,8e-06,-1e-06,2.5e-05,2e-06,9e-06,0,0,5e-06,6e-06,7e-06,0,-7e-06,1e-05,-1.2e-05,6e-06,5e-06,0,4e-06,4e-06,-1e-06,2e-06,-8e-06,-5e-06,5e-06,-1e-05,2e-06,4e-06,4e-06,3e-06,5e-06,0,-1e-06,0,4e-06,-2e-06,-2e-06,3e-06,2e-06,4e-06,1e-06,0,7e-06,-3e-06,-5e-06,-2e-06,5e-06,1e-06,-1e-06,1.1e-05,-6e-06,-6e-06,-3e-06,-2e-06,-1.2e-05,-5e-06,-1.3e-05,9e-06,-9e-06,-3e-06,-5e-06,5e-06,-2e-06,-2e-06,6e-06,6e-06,-1e-06,-8e-06,2e-06,-1e-06,3e-06,-1e-06,8e-06,-9e-06,-4e-06,-6e-06,1e-05,1e-06,3e-06,-7e-06,-5e-06,-3e-06,-1.6e-05,-1e-06,8e-06,-1.1e-05,0,1.2e-05,1.5e-05,-8e-06,1e-06,8e-06
-8e-06,0,-1e-06,1e-06,-5e-06,3e-06,2e-06,-1.1e-05,-3e-06,-6e-06,-2.4e-05,-1e-06,-3e-06,-3e-06,0,-4e-06,-1e-05,-2e-06,0,-4e-06,3e-06,-7e-06,-7e-06,-3e-06,-1.2e-05,1e-06,-8e-06,-6e-06,-8e-06,2e-06,2e-06,0,-2.2e-05,6e-06,-7e-06,-2e-06,-6e-06,-5e-06,-2e-06,-1.4e-05,-1e-06,3e-06,-1e-06,1.1e-05,3e-06,8e-06,1e-06,-1e-06,-2e-06,-4e-06,-2e-06,-1e-06,5e-06,-2e-06,-3e-06,-3e-06,-4e-06,1e-06,-9e-06,-4e-06,6e-06,-4e-06,-2e-06,0,-1e-06,2e-06,2e-06,-1e-06,-6e-06,2e-06,-3e-06,-8e-06,2e-06,6e-06,-6e-06,-2e-06,-1e-05,2e-06,-8e-06,-2e-06,-5e-06,2e-06,-3e-06,1e-05,6e-06,2e-06,-5e-06,5e-06,2e-06,3e-06,-1e-05,-2e-06,2e-06,-4e-06,-3e-06,-3e-06,5e-06,-1e-06,2e-06,-6e-06,2e-06,-5e-06,-2e-06,8e-06,1e-05,-1e-06,3e-06,-5e-06,1.1e-05,1e-06,-1e-06,1e-06,-1e-06,-4e-06,-8e-06,-1e-06,-1.5e-05,-2.4e-05,1.1e-05,-5e-06,0
2.4e-05,5e-06,-1.5e-05,8e-06,0,1e-06,2e-06,7e-06,4e-06,-1e-06,1.2e-05,5e-06,5e-06,-1e-06,-2e-06,3e-06,4e-06,0,1e-06,1e-06,2e-06,-6e-06,1e-06,2e-06,5e-06,-3e-06,-6e-06,-4e-06,1.3e-05,-4e-06,-5e-06,0,2e-05,-8e-06,8e-06,-1e-06,7e-06,4e-06,0,1e-06,0,3e-06,4e-06,-1.1e-05,-1e-06,-3e-06,-2e-06,1e-06,1e-06,0,-1e-06,-4e-06,-5e-06,-1e-06,6e-06,2e-06,-3e-06,-2e-06,2e-06,5e-06,-3e-06,-7e-06,2e-06,-7e-06,-2e-06,2e-06,-3e-06,0,-1e-06,-2e-06,5e-06,-6e-06,1e-06,-7e-06,-1e-06,4e-06,1.2e-05,0,1e-05,1.3e-05,6e-06,-2e-06,-4e-06,-1e-06,2e-06,3e-06,-5e-06,2e-06,3e-06,-6e-06,4e-06,1e-06,1e-06,-1e-06,-1e-06,-2e-06,-8e-06,-5e-06,2e-06,-1e-06,-3e-06,4e-06,9e-06,-1e-06,-3e-06,4e-06,1e-06,-6e-06,-6e-06,1e-06,0,2e-06,2e-06,0,5e-06,-1e-06,1.3e-05,-5e-06,0,5e-06,7e-06
-1.4e-05,-5e-06,1e-05,-1.6e-05,-4e-06,-6e-06,-6e-06,-4e-06,-3e-06,1e-06,-2e-06,4e-06,-1e-06,1e-06,4e-06,-1e-06,-2e-06,2e-06,-2e-06,-2e-06,3e-06,1e-06,4e-06,-1e-06,1e-06,0,-1e-06,8e-06,-1.1e-05,4e-06,3e-06,0,-2.2e-05,2e-06,-9e-06,4e-06,-8e-06,-1e-06,2e-06,-5e-06,-2e-06,-6e-06,-9e-06,5e-06,1e-06,-1.1e-05,1e-06,-6e-06,-5e-06,-4e-06,0,2e-06,3e-06,3e-06,-4e-06,-4e-06,-2e-06,-2e-06,-1e-06,-8e-06,-2e-06,-7e-06,2e-06,8e-06,-2e-06,-1e-06,4e-06,0,6e-06,-2e-06,-5e-06,5e-06,-4e-06,4e-06,1e-06,-1e-06,-4e-06,-2e-06,-4e-06,-9e-06,-3e-06,6e-06,-4e-06,-5e-06,1e-06,-5e-06,1.3e-05,1e-06,0,9e-06,2e-06,1e-06,-3e-06,-9e-06,0,-1e-06,-1e-06,5e-06,4e-06,3e-06,0,-1e-06,6e-06,-2e-06,1e-06,1e-06,0,1e-06,-1e-06,0,0,5e-06,-4e-06,9e-06,6e-06,-2e-06,-1.1e-05,-6e-06,7e-06,5e-06,-6e-06
0,5e-06,-5e-06,1e-06,-2e-06,-3e-06,0,-3e-06,3e-06,-1e-06,4e-06,-3e-06,-1e-06,0,2e-06,-1e-06,-1.6e-05,-1e-06,3e-06,-2e-06,1e-06,3e-06,-2e-06,-3e-06,-2e-06,3e-06,1e-06,-3e-06,9e-06,-4e-06,3e-06,0,1.9e-05,1e-06,1.1e-05,0,0,1e-06,-5e-06,1.4e-05,1e-06,4e-06,-3e-06,-2e-06,3e-06,4e-06,-1e-06,3e-06,-1e-06,3e-06,1e-06,2e-06,5e-06,3e-06,1e-06,4e-06,3e-06,0,-1e-06,7e-06,2e-06,1e-06,-7e-06,-3e-06,-4e-06,-8e-06,-7e-06,-1e-06,-3e-06,3e-06,2e-06,1e-06,-4e-06,2e-06,5e-06,0,2e-06,0,2e-06,4e-06,-4e-06,-1.1e-05,-3e-06,7e-06,1.4e-05,2e-06,-1e-05,1e-06,2e-06,-1e-06,-2e-06,-3e-06,1e-06,-3e-06,0,-2e-06,8e-06,0,1e-06,-5e-06,2e-06,3e-06,-1.1e-05,1e-06,-3e-06,-1e-06,-3e-06,-1e-06,3e-06,2e-06,-2e-06,2e-06,2e-06,-4e-06,0,-2e-06,1e-05,9e-06,-1e-05,-2e-06,1.2e-05
1e-06,-6e-06,3e-06,1e-06,2e-06,-1e-06,3e-06,5e-06,0,1e-06,0,-1e-06,1e-06,5e-06,-3e-06,2e-06,1.1e-05,-1e-06,-4e-06,-1e-06,-3e-06,-8e-06,-2e-06,2e-06,3e-06,9e-06,6e-06,0,-8e-06,1e-06,-4e-06,-1e-06,-1.6e-05,-4e-06,-9e-06,-1e-06,5e-06,-2e-06,6e-06,-5e-06,-1e-06,1e-06,3e-06,1e-06,-3e-06,-2e-06,1e-06,0,1e-06,0,2e-06,4e-06,-9e-06,-3e-06,-1e-06,-1e-06,3e-06,-1e-06,4e-06,-4e-06,3e-06,4e-06,4e-06,-2e-06,4e-06,-1e-06,9e-06,0,-4e-06,-1e-06,-1e-06,-1e-06,-2e-06,-4e-06,4e-06,1e-06,0,0,-2e-06,-4e-06,2e-06,8e-06,-2e-06,-9e-06,-1.2e-05,0,1.1e-05,3e-06,-1e-06,4e-06,2e-06,1e-06,1e-06,-5e-06,-1e-06,-1e-06,-6e-06,1e-06,-2e-06,3e-06,2e-06,0,-5e-06,-3e-06,4e-06,2e-06,-2e-06,3e-06,-1e-06,-2e-06,0,-2e-06,-1e-06,-2e-06,3e-06,-2e-06,-8e-06,3e-06,1e-06,-3e-06,-6e-06
-9e-06,4e-06,-1e-06,6e-06,-1e-06,2e-06,-2e-06,-1e-06,0,2e-06,-1e-06,-4e-06,0,-7e-06,-2e-06,-2e-06,1e-06,1e-06,4e-06,-2e-06,2e-06,0,3e-06,1e-06,-4e-06,-7e-06,1e-06,3e-06,3e-06,0,0,1e-06,8e-06,1e-06,9e-06,-2e-06,-6e-06,3e-06,-7e-06,-1e-06,1e-06,-4e-06,5e-06,-1e-06,3e-06,9e-06,-2e-06,0,-5e-06,1e-06,-2e-06,-1e-06,3e-06,3e-06,1e-06,1e-06,-1e-06,2e-06,0,0,-6e-06,3e-06,2e-06,5e-06,4e-06,0,-7e-06,0,2e-06,-1e-06,0,4e-06,3e-06,4e-06,0,4e-06,-8e-06,0,-2e-06,0,2e-06,-1e-06,-3e-06,4e-06,6e-06,-2e-06,-1.3e-05,-7e-06,-1e-06,-1e-05,0,0,-1e-06,-2e-06,1e-06,0,-3e-06,-3e-06,-1e-06,-1e-06,-4e-06,1e-06,5e-06,1e-06,-4e-06,-3e-06,-1e-06,-3e-06,0,-2e-06,-1e-06,2e-06,-1e-06,3e-06,-5e-06,0,5e-06,-9e-06,-2e-06,-7e-06,8e-06
4e-06,-3e-06,3e-06,-3e-06,3e-06,4e-06,1e-06,-2e-06,-2e-06,0,7e-06,3e-06,-2e-06,3e-06,2e-06,2e-06,-5e-06,1e-06,-3e-06,-1e-06,-2e-06,3e-06,-1e-06,0,2e-06,5e-06,-3e-06,-1e-06,0,-1e-06,1e-06,-1e-06,-8e-06,-2e-06,-1e-05,0,5e-06,-1e-06,5e-06,-2e-06,0,3e-06,3e-06,-1e-06,0,-3e-06,0,4e-06,1e-06,1e-06,0,0,3e-06,-2e-06,-3e-06,0,-1e-06,-1e-06,1e-06,3e-06,6e-06,1e-06,0,-6e-06,-3e-06,1e-06,6e-06,1e-06,-4e-06,0,1e-06,-2e-06,-2e-06,-5e-06,1e-06,-2e-06,7e-06,0,2e-06,5e-06,-3e-06,-2e-06,3e-06,1e-06,-5e-06,0,7e-06,2e-06,0,3e-06,-3e-06,0,0,4e-06,1e-06,-2e-06,4e-06,-2e-06,-3e-06,-3e-06,1e-06,-1e-06,6e-06,2e-06,1e-06,-1e-06,0,1e-06,-1e-06,1e-06,0,-1e-06,2e-06,-2e-06,-9e-06,0,-2e-06,-4e-06,7e-06,-3e-06,-5e-06
-1e-06,2e-06,-1e-06,2e-06,-2e-06,1e-06,0,3e-06,1e-06,-1e-06,-1.1e-05,-1e-06,3e-06,-1e-06,-1e-06,-2e-06,-1e-06,-1e-06,2e-06,-2e-06,4e-06,4e-06,-3e-06,-1e-06,-3e-06,-5e-06,-1e-06,0,0,2e-06,-2e-06,0,8e-06,-1e-06,7e-06,0,2e-06,-1e-06,-4e-06,1e-06,0,-1e-06,-4e-06,3e-06,-4e-06,1e-06,0,-1e-06,-3e-06,-1e-06,1e-06,-2e-06,-4e-06,-1e-06,4e-06,0,-1e-06,2e-06,3e-06,-2e-06,-3e-06,-1e-06,-3e-06,4e-06,-2e-06,-3e-06,-6e-06,-1e-06,2e-06,2e-06,-3e-06,-3e-06,-2e-06,5e-06,-3e-06,1e-06,-3e-06,0,-3e-06,4e-06,-2e-06,0,-1e-06,-6e-06,-6e-06,-1e-06,-7e-06,-3e-06,-1e-06,2e-06,2e-06,0,0,-5e-06,-2e-06,0,-4e-06,5e-06,0,3e-06,1e-06,1e-06,-5e-06,0,-1e-06,0,1e-06,0,1e-06,0,-1e-06,2e-06,-3e-06,1e-06,2e-06,0,0,-1.1e-05,-3e-06,-2e-06,7e-06
5e-06,0,6e-06,-7e-06,3e-06,0,-1e-06,-1e-06,1e-06,0,1e-05,3e-06,-2e-06,1e-06,0,1e-06,4e-06,-2e-06,-3e-06,-1e-06,-1e-06,2e-06,2e-06,-1e-06,0,2e-06,0,0,0,-1e-06,1e-06,0,-3e-06,0,-4e-06,2e-06,-3e-06,1e-06,4e-06,3e-06,0,-2e-06,-5e-06,-2e-06,0,-4e-06,0,0,0,-1e-06,-1e-06,0,4e-06,2e-06,-1e-06,2e-06,1e-06,0,0,-1e-06,0,-4e-06,1e-06,-1e-06,2e-06,0,7e-06,0,2e-06,0,0,2e-06,-1e-06,-2e-06,-2e-06,1e-06,2e-06,-1e-06,2e-06,-1e-06,3e-06,3e-06,1e-06,6e-06,3e-06,1e-06,8e-06,-2e-06,1e-06,-3e-06,2e-06,0,0,1e-06,1e-06,-1e-06,7e-06,0,-1e-06,-4e-06,0,0,-3e-06,-1e-06,-1e-06,-4e-06,1e-06,0,2e-06,-2e-06,0,0,2e-06,-2e-06,3e-06,1e-06,1e-06,8e-06,1e-06,-2e-06,-5e-06
2e-06,-1e-06,-7e-06,2e-06,-3e-06,-2e-06,1e-06,0,-1e-06,-1e-06,-5e-06,-1e-06,0,-1e-06,0,0,3e-06,0,2e-06,-1e-06,1e-06,-2e-06,1e-06,0,3e-06,-4e-06,1e-06,-3e-06,1e-06,1e-06,2e-06,0,2e-06,3e-06,3e-06,-2e-06,4e-06,-2e-06,-4e-06,-5e-06,0,3e-06,1e-06,2e-06,1e-06,-1e-06,0,-1e-06,0,-1e-06,1e-06,0,-2e-06,-1e-06,-2e-06,-1e-06,0,-1e-06,2e-06,3e-06,-1e-06,-3e-06,2e-06,-4e-06,1e-06,2e-06,-5e-06,0,-2e-06,-2e-06,0,0,-1e-06,-3e-06,-3e-06,0,0,0,-1e-06,2e-06,-1e-06,-5e-06,0,-5e-06,0,2e-06,-1.1e-05,4e-06,1e-06,7e-06,-1e-06,-1e-06,0,-3e-06,-1e-06,-1e-06,-7e-06,-2e-06,2e-06,0,-1e-06,0,-2e-06,-2e-06,-2e-06,1e-06,1e-06,1e-06,-3e-06,1e-06,0,0,-1e-06,-1e-06,3e-06,1e-06,-2e-06,3e-06,-5e-06,2e-06,3e-06
0,1e-06,2e-06,0,1e-06,-3e-06,0,1e-06,1e-06,0,-2e-06,0,2e-06,-2e-06,0,-1e-06,-5e-06,0,-1e-06,-1e-06,-1e-06,0,-2e-06,-1e-06,-4e-06,2e-06,2e-06,-1e-06,-2e-06,0,-2e-06,0,-3e-06,1e-06,-2e-06,1e-06,-2e-06,2e-06,3e-06,3e-06,0,-1e-06,3e-06,-3e-06,-1e-06,3e-06,0,1e-06,-3e-06,1e-06,-1e-06,1e-06,-2e-06,0,3e-06,1e-06,-1e-06,-1e-06,0,-3e-06,4e-06,0,-2e-06,3e-06,-3e-06,2e-06,2e-06,0,2e-06,1e-06,1e-06,-2e-06,1e-06,5e-06,-1e-06,-1e-06,-2e-06,0,3e-06,-5e-06,-2e-06,5e-06,-1e-06,2e-06,2e-06,-1e-06,1e-05,-3e-06,0,-5e-06,-1e-06,1e-06,0,4e-06,0,0,1e-06,-1e-06,0,0,0,0,3e-06,0,1e-06,-1e-06,0,-1e-06,2e-06,1e-06,0,-2e-06,-1e-06,2e-06,3e-06,0,3e-06,-3e-06,3e-06,1e-06,-1e-06
1e-06,-1e-06,2e-06,1e-06,-3e-06,-1e-06,1e-06,-1e-06,-1e-06,0,3e-06,-2e-06,-1e-06,1e-06,-1e-06,1e-06,5e-06,-1e-06,1e-06,0,-2e-06,2e-06,-1e-06,2e-06,2e-06,-3e-06,-1e-06,0,1e-06,-1e-06,0,-1e-06,3e-06,-3e-06,0,-1e-06,-1e-06,-1e-06,-2e-06,1e-06,0,0,2e-06,2e-06,0,0,-1e-06,1e-06,1e-06,0,1e-06,0,5e-06,0,-2e-06,-1e-06,0,0,-1e-06,0,-4e-06,2e-06,0,-2e-06,0,0,-2e-06,0,1e-06,1e-06,-1e-06,3e-06,1e-06,-5e-06,0,2e-06,1e-06,0,-3e-06,0,-1e-06,-1e-06,-1e-06,2e-06,-1e-06,0,-8e-06,1e-06,1e-06,4e-06,1e-06,0,0,6e-06,0,-1e-06,4e-06,1e-06,2e-06,-2e-06,0,-1e-06,1e-06,1e-06,0,-1e-06,0,2e-06,1e-06,-2e-06,0,-1e-06,2e-06,-2e-06,-2e-06,0,-2e-06,-6e-06,-1e-06,0,1e-06
-3e-06,2e-06,-3e-06,1e-06,1e-06,0,0,1e-06,2e-06,1e-06,-3e-06,1e-06,-1e-06,1e-06,-1e-06,-1e-06,-4e-06,0,-1e-06,0,1e-06,-1e-06,2e-06,0,-2e-06,4e-06,-1e-06,0,0,0,2e-06,0,-2e-06,-1e-06,1e-06,1e-06,2e-06,0,1e-06,3e-06,0,1e-06,0,-2e-06,2e-06,4e-06,1e-06,-1e-06,-3e-06,0,0,0,-4e-06,-1e-06,0,1e-06,1e-06,0,1e-06,2e-06,2e-06,3e-06,1e-06,1e-06,2e-06,0,2e-06,0,-3e-06,0,-1e-06,0,-2e-06,3e-06,1e-06,0,0,0,3e-06,4e-06,1e-06,-2e-06,-1e-06,-5e-06,5e-06,2e-06,7e-06,1e-06,0,-5e-06,-2e-06,-1e-06,-1e-06,-2e-06,0,-1e-06,-4e-06,3e-06,-1e-06,1e-06,1e-06,0,0,0,-2e-06,2e-06,-2e-06,-2e-06,-3e-06,-1e-06,0,-1e-06,-2e-06,1e-06,-6e-06,0,1e-06,-7e-06,2e-06,-2e-06,0
-2e-06,-2e-06,-1e-06,0,-1e-06,1e-06,0,0,-2e-06,0,1e-06,0,1e-06,0,0,1e-06,-3e-06,1e-06,1e-06,0,-1e-06,-1e-06,-1e-06,-1e-06,2e-06,0,-1e-06,1e-06,0,0,-1e-06,0,0,2e-06,0,0,-2e-06,0,0,-3e-06,0,-1e-06,-1e-06,1e-06,-1e-06,-5e-06,-1e-06,0,1e-06,1e-06,0,-2e-06,0,1e-06,1e-06,0,1e-06,1e-06,-2e-06,-2e-06,0,1e-06,1e-06,2e-06,0,0,-1e-06,0,1e-06,0,-1e-06,-1e-06,-1e-06,-1e-06,1e-06,-1e-06,2e-06,0,-3e-06,-4e-06,-1e-06,1e-06,-2e-06,5e-06,-4e-06,-1e-06,-3e-06,0,-1e-06,1e-06,0,1e-06,0,-1e-06,1e-06,0,3e-06,-3e-06,1e-06,-2e-06,0,0,-4e-06,1e-06,0,0,0,1e-06,2e-06,1e-06,0,2e-06,1e-06,1e-06,-1e-06,0,-1e-06,3e-06,-3e-06,-3e-06,0
0,2e-06,2e-06,-4e-06,0,2e-06,0,0,1e-06,0,-1e-06,1e-06,-1e-06,-1e-06,1e-06,-1e-06,6e-06,0,0,1e-06,2e-06,-1e-06,-1e-06,1e-06,-1e-06,1e-06,1e-06,-1e-06,1e-06,0,-1e-06,0,0,-2e-06,1e-06,0,1e-06,0,-1e-06,-2e-06,0,-1e-06,-3e-06,0,1e-06,0,1e-06,-1e-06,-2e-06,-1e-06,-1e-06,-1e-06,4e-06,1e-06,-1e-06,0,-1e-06,0,0,-1e-06,-1e-06,-1e-06,-2e-06,-3e-06,-1e-06,0,0,0,0,0,2e-06,0,1e-06,-1e-06,1e-06,-1e-06,-2e-06,0,2e-06,6e-06,-2e-06,1e-06,-1e-06,-3e-06,0,0,1e-06,0,-1e-06,0,2e-06,0,0,-3e-06,-1e-06,-1e-06,-4e-06,-1e-06,-2e-06,0,0,0,0,-1e-06,0,1e-06,0,-2e-06,1e-06,0,0,1e-06,0,-3e-06,1e-06,0,0,1e-06,2e-06,-3e-06,1e-06
0,-2e-06,-4e-06,-1e-06,0,1e-06,0,0,0,0,4e-06,0,0,0,-1e-06,1e-06,-4e-06,0,0,0,-1e-06,0,1e-06,0,-1e-06,0,2e-06,0,-1e-06,0,1e-06,0,-1e-06,1e-06,-2e-06,0,0,0,1e-06,1e-06,0,2e-06,-1e-06,0,0,-3e-06,-1e-06,0,-2e-06,0,1e-06,-1e-06,-4e-06,-1e-06,0,0,0,1e-06,-1e-06,2e-06,0,-1e-06,-1e-06,2e-06,0,-1e-06,1e-06,0,-1e-06,1e-06,0,1e-06,1e-06,2e-06,0,0,2e-06,0,-1e-06,-5e-06,1e-06,-3e-06,-1e-06,0,1e-06,1e-06,0,2e-06,0,1e-06,0,-1e-06,0,-1e-06,1e-06,-1e-06,0,2e-06,0,0,0,0,3e-06,-1e-06,0,1e-06,0,1e-06,-3e-06,0,0,1e-06,-1e-06,2e-06,1e-06,0,0,2e-06,-2e-06,-3e-06,-2e-06
0,1e-06,5e-06,3e-06,0,0,0,1e-06,1e-06,0,-3e-06,0,0,0,0,0,-2e-06,1e-06,-1e-06,0,0,2e-06,0,0,1e-06,-1e-06,0,1e-06,2e-06,-1e-06,0,0,3e-06,1e-06,2e-06,0,0,0,-1e-06,2e-06,0,-1e-06,3e-06,0,-2e-06,4e-06,0,0,1e-06,-1e-06,-1e-06,0,2e-06,0,1e-06,-1e-06,0,0,-2e-06,-3e-06,1e-06,-2e-06,2e-06,0,-1e-06,-2e-06,-1e-06,0,2e-06,0,1e-06,-2e-06,0,-3e-06,-1e-06,-1e-06,-1e-06,0,0,-1e-06,0,3e-06,-1e-06,3e-06,-4e-06,0,3e-06,-1e-06,0,3e-06,-1e-06,0,0,1e-06,0,-1e-06,4e-06,0,-1e-06,-2e-06,0,0,2e-06,1e-06,-1e-06,0,1e-06,0,1e-06,0,0,0,2e-06,1e-06,4e-06,0,0,-6e-06,2e-06,-1e-06,1e-06
2e-06,-1e-06,-1e-06,1e-06,1e-06,-1e-06,0,-1e-06,-1e-06,0,3e-06,0,0,1e-06,0,0,1e-06,0,0,0,-1e-06,-2e-06,-1e-06,1e-06,-1e-06,0,-1e-06,0,-2e-06,1e-06,-1e-06,0,-4e-06,-3e-06,-3e-06,1e-06,1e-06,0,2e-06,0,0,0,2e-06,-1e-06,0,2e-06,0,0,-3e-06,0,1e-06,0,1e-06,-1e-06,0,1e-06,0,0,1e-06,0,0,0,0,-2e-06,-1e-06,0,1e-06,0,-2e-06,0,-1e-06,2e-06,-1e-06,4e-06,-1e-06,-1e-06,1e-06,0,1e-06,1e-06,-1e-06,-2e-06,0,-5e-06,2e-06,0,-4e-06,1e-06,1e-06,-1e-06,0,0,0,-3e-06,1e-06,0,-4e-06,0,1e-06,0,0,0,-4e-06,0,1e-06,1e-06,0,0,1e-06,0,0,-1e-06,-2e-06,-2e-06,0,0,0,-6e-06,-3e-06,1e-06,-1e-06
0,0,-2e-06,-1e-06,-1e-06,-2e-06,0,1e-06,1e-06,0,0,0,0,-1e-06,0,0,2e-06,0,0,0,0,1e-06,0,0,1e-06,-2e-06,0,0,2e-06,-1e-06,0,0,5e-06,1e-06,3e-06,0,-1e-06,0,-2e-06,-1e-06,0,1e-06,-2e-06,1e-06,1e-06,-1e-06,0,0,1e-06,0,-1e-06,1e-06,-4e-06,0,-1e-06,0,0,-1e-06,-1e-06,2e-06,-2e-06,1e-06,-1e-06,2e-06,2e-06,0,-2e-06,0,1e-06,0,0,1e-06,0,-3e-06,-1e-06,0,1e-06,0,-1e-06,-3e-06,0,-1e-06,0,4e-06,0,0,5e-06,0,1e-06,-2e-06,0,0,0,-1e-06,0,-1e-06,3e-06,-2e-06,0,-1e-06,0,0,-1e-06,0,-1e-06,-1e-06,1e-06,-1e-06,-2e-06,0,0,0,1e-06,1e-06,-3e-06,0,0,-1e-06,2e-06,1e-06,1e-06
1e-06,1e-06,2e-06,-3e-06,1e-06,-1e-06,-1e-06,-1e-06,-1e-06,0,-3e-06,1e-06,1e-06,0,0,0,-3e-06,0,0,0,1e-06,0,1e-06,-1e-06,0,1e-06,0,0,-2e-06,0,1e-06,0,-7e-06,2e-06,-4e-06,0,1e-06,0,1e-06,0,0,-2e-06,-3e-06,-1e-06,-1e-06,-1e-06,0,-1e-06,-2e-06,0,1e-06,0,4e-06,0,1e-06,0,0,0,0,-3e-06,3e-06,1e-06,0,-2e-06,0,0,2e-06,0,0,0,0,-1e-06,1e-06,1e-06,-1e-06,0,-2e-06,0,2e-06,5e-06,0,2e-06,-1e-06,-2e-06,-1e-06,-1e-06,-6e-06,-1e-06,1e-06,2e-06,0,1e-06,0,-3e-06,-1e-06,-1e-06,-2e-06,1e-06,1e-06,-1e-06,0,0,1e-06,0,0,0,0,1e-06,0,0,0,-1e-06,0,-1e-06,-2e-06,0,-1e-06,2e-06,-1e-06,0,-2e-06
0,-1e-06,0,1e-06,-1e-06,0,0,1e-06,1e-06,0,3e-06,0,-1e-06,0,0,0,0,1e-06,0,1e-06,-1e-06,0,-1e-06,1e-06,-1e-06,-2e-06,1e-06,-1e-06,2e-06,1e-06,-1e-06,0,8e-06,-1e-06,5e-06,0,0,-1e-06,-2e-06,1e-06,0,1e-06,-1e-06,1e-06,0,-4e-06,0,0,-1e-06,0,-1e-06,0,-1e-06,0,0,0,0,0,0,1e-06,-3e-06,1e-06,1e-06,0,-2e-06,0,-2e-06,0,0,0,1e-06,0,1e-06,1e-06,0,-1e-06,1e-06,0,-2e-06,0,0,0,0,-1e-06,1e-06,0,5e-06,0,0,-4e-06,1e-06,0,0,-1e-06,0,-1e-06,1e-06,2e-06,-1e-06,0,0,0,3e-06,0,1e-06,0,0,-1e-06,0,0,0,1e-06,-1e-06,0,-2e-06,0,1e-06,3e-06,3e-06,-1e-06,2e-06
-2e-06,2e-06,-3e-06,0,1e-06,1e-06,1e-06,-1e-06,-1e-06,0,-2e-06,1e-06,0,0,0,0,3e-06,0,0,0,1e-06,1e-06,0,0,1e-06,3e-06,0,0,-2e-06,-1e-06,-1e-06,0,-9e-06,-1e-06,-5e-06,0,-1e-06,0,2e-06,0,0,1e-06,1e-06,-1e-06,1e-06,4e-06,0,0,0,-1e-06,1e-06,0,-3e-06,0,-1e-06,0,0,1e-06,0,1e-06,1e-06,-1e-06,0,2e-06,0,1e-06,2e-06,0,0,0,0,1e-06,0,-3e-06,1e-06,0,0,0,1e-06,-1e-06,-1e-06,-2e-06,0,4e-06,1e-06,0,-5e-06,-1e-06,-1e-06,5e-06,0,0,0,3e-06,-1e-06,-1e-06,3e-06,-1e-06,0,0,0,0,-2e-06,0,1e-06,-1e-06,0,1e-06,-1e-06,0,0,0,1e-06,1e-06,1e-06,0,-1e-06,-4e-06,-2e-06,-2e-06,-2e-06
