0.006058,0.005803,0.005498,0.005559,0.00598,0.006646,0.006628,0.00569,0.005427,0.005622,0.005147,0.004667,0.00482,0.005216,0.005247,0.005196,0.005235,0.005534,0.006157,0.006041,0.00514,0.004627,0.004675,0.00466,0.004667,0.005377,0.005828,0.005474
0.007467,0.007166,0.006943,0.007088,0.007544,0.008162,0.008007,0.007004,0.006779,0.006957,0.006268,0.005602,0.0059,0.006512,0.006466,0.00639,0.006592,0.007009,0.007683,0.007338,0.006194,0.005713,0.005783,0.005731,0.00582,0.006703,0.007123,0.006648
0.009606,0.009302,0.009317,0.009618,0.010081,0.010467,0.01002,0.009028,0.008903,0.009025,0.008033,0.007155,0.007683,0.008567,0.00836,0.008366,0.008965,0.009452,0.010031,0.00935,0.007888,0.007457,0.007552,0.007528,0.00783,0.008878,0.009115,0.008463
0.010636,0.010378,0.010691,0.011112,0.01149,0.011536,0.010839,0.010013,0.009961,0.00996,0.00899,0.008328,0.008967,0.009724,0.009281,0.009557,0.010646,0.010948,0.011106,0.010381,0.008938,0.008444,0.008587,0.008763,0.009295,0.010147,0.009994,0.009325
0.01079,0.010479,0.010883,0.011454,0.011943,0.011817,0.010857,0.009903,0.009813,0.009778,0.009278,0.009303,0.009667,0.009556,0.008977,0.0097,0.010987,0.010899,0.010599,0.010297,0.009296,0.00873,0.008934,0.009233,0.009868,0.010308,0.009838,0.009385
0.010963,0.010149,0.010536,0.011663,0.012355,0.012128,0.011075,0.009651,0.009097,0.009106,0.009397,0.010184,0.01022,0.008992,0.008311,0.009402,0.010411,0.010172,0.010103,0.010379,0.009844,0.009386,0.009406,0.009308,0.009658,0.009665,0.009337,0.009342
0.011014,0.009975,0.010655,0.012262,0.012859,0.012593,0.011675,0.009757,0.008469,0.008414,0.009287,0.010504,0.010622,0.009125,0.008488,0.009543,0.010004,0.00988,0.010024,0.01027,0.010265,0.010158,0.010027,0.009546,0.009447,0.00959,0.009995,0.01001
0.010338,0.009695,0.011154,0.013183,0.013342,0.012884,0.012066,0.009889,0.008659,0.00888,0.00946,0.010393,0.010741,0.009854,0.009627,0.010471,0.010653,0.010619,0.010391,0.010221,0.010744,0.01071,0.010443,0.010121,0.009852,0.010526,0.011653,0.011199
0.010759,0.010601,0.013087,0.01546,0.014629,0.014174,0.013576,0.010842,0.01005,0.011107,0.011268,0.011696,0.012137,0.011814,0.01183,0.01216,0.012664,0.013151,0.012564,0.012001,0.012414,0.011725,0.01118,0.011334,0.011465,0.012626,0.013699,0.012683
0.013022,0.01331,0.016797,0.019236,0.017468,0.016809,0.016109,0.012853,0.012344,0.014016,0.013895,0.014145,0.014762,0.01446,0.014454,0.014876,0.016369,0.017273,0.016201,0.015403,0.015311,0.013301,0.012203,0.013325,0.014549,0.015945,0.015771,0.014123
0.015747,0.016521,0.02035,0.022307,0.020119,0.019218,0.01864,0.015046,0.014219,0.01631,0.015938,0.016071,0.017021,0.016408,0.016245,0.017967,0.020762,0.020857,0.01874,0.01779,0.017303,0.014726,0.013806,0.016032,0.01829,0.019531,0.017223,0.014797
0.017107,0.018324,0.021674,0.022322,0.01969,0.019109,0.019776,0.016678,0.015254,0.017156,0.016725,0.016783,0.017691,0.016922,0.016587,0.019398,0.023015,0.022173,0.019187,0.018183,0.017777,0.015518,0.014916,0.017544,0.020416,0.021616,0.017946,0.014931
0.016223,0.017515,0.020019,0.019557,0.016513,0.016123,0.018209,0.01662,0.015075,0.016283,0.016558,0.016814,0.016989,0.016359,0.015723,0.01798,0.021064,0.020318,0.017694,0.017024,0.017511,0.015889,0.015033,0.017417,0.020155,0.02113,0.017554,0.014223
0.014272,0.015098,0.016413,0.01579,0.013267,0.012341,0.014179,0.014316,0.013968,0.014386,0.015083,0.015618,0.014856,0.014315,0.013613,0.014645,0.016395,0.016571,0.015146,0.01468,0.015925,0.014882,0.014047,0.016384,0.018589,0.018574,0.015429,0.012504
0.012006,0.012857,0.013168,0.012652,0.011548,0.010659,0.011118,0.011834,0.012752,0.012728,0.012899,0.013219,0.012239,0.011886,0.011454,0.011622,0.01228,0.012903,0.012541,0.012374,0.01332,0.012613,0.012271,0.014355,0.016155,0.015029,0.012057,0.010393
0.011169,0.011967,0.012095,0.012022,0.011557,0.01075,0.010588,0.011446,0.012315,0.011705,0.011309,0.01158,0.011351,0.011201,0.010734,0.010548,0.010973,0.011875,0.01213,0.012137,0.012243,0.011623,0.011225,0.012121,0.013965,0.012888,0.010062,0.009466
0.014253,0.01388,0.013821,0.01475,0.013762,0.011917,0.011697,0.013201,0.014068,0.013114,0.012394,0.012976,0.01328,0.012703,0.012282,0.012205,0.012577,0.014137,0.015107,0.014729,0.01432,0.013665,0.012403,0.011738,0.013752,0.01393,0.011598,0.0112
0.020366,0.018597,0.018122,0.020105,0.018901,0.015013,0.013892,0.01664,0.017926,0.016907,0.016343,0.017378,0.018408,0.017315,0.016424,0.016536,0.017071,0.019278,0.021,0.020659,0.020422,0.019015,0.015478,0.013259,0.016235,0.018196,0.01624,0.01556
0.026553,0.023641,0.022394,0.025246,0.024534,0.019195,0.016754,0.020437,0.022571,0.021836,0.021537,0.02286,0.025172,0.024095,0.021739,0.021385,0.022796,0.025759,0.027551,0.027581,0.028212,0.026031,0.019723,0.016148,0.020389,0.023435,0.02189,0.021198
0.02907,0.02601,0.024115,0.027066,0.027498,0.023475,0.021097,0.024035,0.026782,0.026389,0.02509,0.025971,0.029872,0.029368,0.02487,0.023447,0.026237,0.029502,0.030254,0.031093,0.033507,0.031014,0.022958,0.019076,0.023604,0.026789,0.026796,0.02683
0.026851,0.02507,0.024306,0.026204,0.027299,0.026537,0.025416,0.026229,0.028963,0.028874,0.025489,0.024864,0.030219,0.0324,0.026401,0.022336,0.026061,0.029089,0.028472,0.030631,0.034856,0.032103,0.023868,0.02161,0.025892,0.028762,0.03141,0.03335
0.023243,0.023543,0.026008,0.026701,0.026384,0.027994,0.027573,0.025385,0.02823,0.029307,0.025283,0.023992,0.028282,0.032867,0.028311,0.022056,0.024925,0.027077,0.025987,0.029143,0.03455,0.033014,0.02564,0.024132,0.027482,0.029767,0.034927,0.039309
0.022781,0.024085,0.030728,0.030238,0.028206,0.031351,0.02904,0.024815,0.029798,0.031759,0.027614,0.027035,0.028053,0.03042,0.028973,0.024465,0.025967,0.027806,0.028056,0.030564,0.035566,0.035925,0.029686,0.028116,0.030255,0.030958,0.035947,0.040742
0.024976,0.024961,0.034104,0.034065,0.030897,0.03468,0.030853,0.025713,0.032797,0.034856,0.029963,0.030559,0.029585,0.028333,0.027971,0.026288,0.028416,0.031118,0.032421,0.034254,0.039122,0.039611,0.032969,0.032174,0.034432,0.033211,0.03515,0.038087
0.023456,0.02276,0.031984,0.032453,0.02907,0.032693,0.029846,0.024931,0.030848,0.032811,0.028219,0.02881,0.0272,0.025571,0.026263,0.025153,0.026774,0.029745,0.031095,0.031948,0.036281,0.036545,0.030564,0.030799,0.032615,0.03025,0.030846,0.032779
0.017877,0.018179,0.024636,0.025639,0.024007,0.025526,0.023835,0.020774,0.024266,0.025223,0.021359,0.021874,0.020351,0.019506,0.021019,0.019872,0.020803,0.023071,0.024211,0.023762,0.025741,0.026179,0.02406,0.024523,0.024311,0.023072,0.023488,0.024088
0.015254,0.015838,0.017261,0.019802,0.021,0.019537,0.018131,0.018433,0.019703,0.017972,0.015494,0.017512,0.016413,0.015914,0.01684,0.015187,0.016135,0.017844,0.019577,0.019725,0.018615,0.017396,0.017851,0.018125,0.01742,0.019054,0.020247,0.019913
0.018175,0.017763,0.01714,0.020481,0.020375,0.017705,0.017411,0.018414,0.018295,0.016151,0.016544,0.019638,0.01795,0.016643,0.01769,0.017295,0.018493,0.020219,0.021336,0.021677,0.020495,0.017574,0.016611,0.018068,0.018886,0.020075,0.020512,0.019855
0.026171,0.024618,0.024301,0.027684,0.02589,0.023139,0.022405,0.021841,0.020501,0.020587,0.025576,0.02831,0.024354,0.020411,0.020416,0.022526,0.025444,0.027343,0.029187,0.030814,0.028751,0.024465,0.023946,0.027247,0.027626,0.025386,0.023433,0.022974
0.040409,0.034838,0.033577,0.037557,0.035952,0.035448,0.034799,0.032154,0.028688,0.031436,0.041966,0.046026,0.038099,0.028594,0.025626,0.03143,0.03914,0.041501,0.045015,0.047321,0.042115,0.037,0.038927,0.043089,0.039858,0.034086,0.031495,0.033675
0.056726,0.046036,0.043182,0.049266,0.049023,0.050257,0.050056,0.045654,0.039475,0.044183,0.061095,0.068007,0.054704,0.038205,0.03158,0.041521,0.055795,0.058261,0.063432,0.066214,0.057195,0.051447,0.056419,0.062172,0.055223,0.045111,0.042967,0.048282
0.066351,0.052144,0.047948,0.056233,0.057697,0.059647,0.060306,0.054592,0.046145,0.051538,0.073531,0.084105,0.06597,0.043804,0.036769,0.049454,0.06744,0.069605,0.07516,0.078029,0.065911,0.060456,0.068012,0.075385,0.066381,0.05112,0.050254,0.058506
0.060717,0.046797,0.042366,0.051766,0.054638,0.055902,0.057254,0.051245,0.042359,0.046817,0.06931,0.082334,0.063322,0.040338,0.036916,0.048881,0.064829,0.066168,0.070385,0.0727,0.059775,0.056062,0.064399,0.072192,0.063957,0.045999,0.046893,0.056026
0.041079,0.031143,0.027745,0.036191,0.039442,0.039445,0.040544,0.035797,0.029077,0.031614,0.048702,0.060568,0.046764,0.029072,0.029111,0.037351,0.047068,0.047068,0.049213,0.050516,0.040081,0.038699,0.04532,0.051761,0.047084,0.032914,0.034653,0.040767
0.019848,0.015171,0.013878,0.019391,0.021994,0.021431,0.020855,0.018558,0.016014,0.017054,0.025359,0.032024,0.02753,0.018603,0.018128,0.022964,0.025916,0.024225,0.024834,0.024987,0.019596,0.020043,0.023144,0.026906,0.028407,0.025322,0.024592,0.024049
0.009285,0.008565,0.010513,0.012789,0.012869,0.011792,0.011021,0.011506,0.011093,0.013157,0.013838,0.013052,0.01427,0.012602,0.014292,0.017509,0.014715,0.011229,0.010373,0.009789,0.011614,0.014361,0.011727,0.011981,0.020836,0.025058,0.02004,0.016402
0.008132,0.006603,0.009811,0.01118,0.010018,0.009074,0.00992,0.011466,0.010246,0.012605,0.011724,0.010461,0.012667,0.011359,0.01501,0.016192,0.012662,0.010936,0.007035,0.006712,0.012844,0.015156,0.009669,0.009645,0.018727,0.023436,0.017237,0.014437
0.009752,0.007262,0.008568,0.010621,0.012706,0.011235,0.012463,0.015911,0.013008,0.01345,0.01451,0.013588,0.014388,0.011621,0.014398,0.013755,0.01161,0.012781,0.008347,0.00781,0.014865,0.015094,0.008934,0.012889,0.018892,0.018861,0.013889,0.015087
0.010565,0.008807,0.008247,0.011438,0.017399,0.014325,0.015205,0.021377,0.017545,0.015243,0.01734,0.016712,0.015584,0.013611,0.013198,0.011452,0.012188,0.014853,0.009822,0.009127,0.015525,0.015431,0.009346,0.016834,0.019833,0.015279,0.013443,0.017428
0.009712,0.010061,0.010599,0.01525,0.022295,0.017488,0.017662,0.024858,0.020841,0.015681,0.018077,0.019823,0.018618,0.017654,0.014012,0.011552,0.01432,0.017184,0.011931,0.011401,0.016573,0.017629,0.012329,0.020198,0.02263,0.014434,0.013665,0.018269
