-0.004713,-0.003862,-0.002092,-0.001029,-0.000547,7.1e-05,0.000153,0.000191,7.8e-05,4.8e-05,0.000382,-0.000285,-0.00069,-0.000262,0.000105,1.4e-05,0.000171,0.000159,0.000341,0.000421,0.000183,-1e-04,-0.00011,0.000326,0.000293,6.7e-05,0.000126,-0.000185,2e-05,-0.000128,-0.000151,-0.000115,0.000742,-0.000445,-0.000535,-0.000494,1e-06,-0.006381,-0.006215,-0.003074,-0.000722,5.1e-05,-5.9e-05,-3.6e-05,-0.000226,0.000825,-0.002797,-0.004281,-0.000609,-0.002476,0.000862,-0.008013,-0.025862,-0.01008,-0.024524,-0.019365,-0.013515,-0.02685,-0.016979,-0.009775,-0.009816,-0.012759,-0.016325,-0.015524,-0.012093,-0.008432,-0.011576,-0.004674,-0.008867,-0.013799,-0.013878,-0.009793,-0.009176,-0.009119,-0.011902,-0.016906,-0.014289,-0.009574,-0.010931,-0.007365,-0.002664,-0.009894,-0.007096,-0.00533,-0.003218,-0.00215,-0.000732,-0.002924,-0.001403,-0.000524,-0.00156,0.000226,-0.000264,-0.001126,-0.00076,-0.000178,-3e-04,-0.006415,-0.005321,-0.001566,-0.000542,0.000814,0.00053,2e-05,0.001202,0.004204,0.003692,-0.007909,-0.004639,-0.005366,-0.001618,-0.000362,0.00055,0.000373,6.2e-05,0.000145,-0.000198,6.1e-05,3.9e-05,-5.5e-05,-2.6e-05
0.00165,0.002524,0.001437,0.000721,0.000446,0.000285,0.000119,8e-06,-0.000156,-6.6e-05,0.00019,0.000352,0.000507,0.000307,0.000559,0.000283,2.5e-05,3.9e-05,0.000403,0.000377,0.000169,3e-05,0.000343,0.000225,0.000363,0.000292,0.000165,0.000385,0.00041,0.000128,0.000211,0.00017,-0.000837,6.9e-05,0.000262,0.000383,0.000512,0.00132,0.003267,0.001368,0.000546,0.000337,0.000236,0.000241,0.000185,-0.001581,0.000472,0.00165,0.002148,0.007272,-0.005604,-0.007097,-0.001688,0.000655,0.004018,0.000684,-0.003471,0.007044,0.011093,0.006796,0.002236,0.005852,0.002219,-0.003493,-0.011447,-0.004995,-0.006584,-0.006501,-0.000119,-0.002182,-0.005753,-0.007093,-0.003091,-0.008139,-0.002335,-0.003864,0.002491,-0.000484,-0.001581,-0.003379,-7e-05,-0.000415,-0.000691,-0.002795,-0.004095,-0.003693,-0.001748,0.000278,0.00034,0.000374,0.000482,0.000571,-0.000825,-0.000841,0.000598,0.000576,-0.000238,-0.000704,0.001335,-0.000273,0.000224,0.000409,0.00011,-0.000181,0.000411,0.001086,0.002819,0.004439,0.002508,0.004562,0.003942,0.002039,0.001083,0.000379,0.000347,5.4e-05,0.000335,0.000252,7.6e-05,0.000108,0.000235
0.000418,0.000188,-1.3e-05,-0.00015,4e-06,0.000124,1.7e-05,-0.000111,-3.4e-05,-0.000133,0.000104,5.9e-05,0.000123,0.00017,-0.00014,4.2e-05,3.1e-05,9.7e-05,0.000309,1.1e-05,4.7e-05,-0.000125,0.000143,0.000221,1.7e-05,-0.000135,6.4e-05,-0.000151,-4.3e-05,-0.000124,-0.000197,7.2e-05,-0.000452,-0.000584,-9.1e-05,0.000311,0.000231,-0.000208,-0.001376,-0.000746,-3.3e-05,0.000173,9.9e-05,9.6e-05,0.000295,-0.000281,-0.00066,-0.00204,-0.000473,-0.000766,-0.004802,-0.000457,0.001067,-0.002292,-0.009091,-0.004278,0.002472,-0.002547,-0.011616,-0.007914,-0.001493,-0.003919,0.002776,-0.000891,0.001189,-0.004429,0.001071,-0.004607,-0.004293,0.003854,0.001323,0.001203,0.000275,0.003075,-0.000624,0.000376,-0.004758,-0.000105,0.000335,-0.00078,-0.003808,-0.002416,-0.00055,0.00098,-0.000354,-0.00304,-0.001444,-0.000761,-0.000204,-0.00117,-0.001047,-0.00137,8e-06,0.000199,0.000787,0.000217,-1.9e-05,0.000888,-0.000311,-0.000943,-2.6e-05,-0.000953,-0.000353,-0.000751,-0.001247,-0.001405,0.000906,-0.000932,-0.000236,-0.00115,0.000798,0.000277,0.000662,0.000219,-0.000173,-0.000393,-5.6e-05,-7.5e-05,-0.000168,-9e-05,-0.000102
0.000309,-0.00096,-0.000474,4.9e-05,-2.8e-05,2.5e-05,-0.000161,-8.1e-05,-2.6e-05,7.4e-05,-2e-05,-3.3e-05,-0.000391,6e-06,-0.000247,-0.000209,0.000163,-3.3e-05,0.000131,-0.00025,-0.000139,5.2e-05,-6.5e-05,-0.000178,-0.000139,1.4e-05,0.000154,0.000192,-0.000173,-0.000127,-0.000237,-4.5e-05,-0.000146,-4e-06,-0.000226,-9e-06,-8.2e-05,-0.000248,0.000475,0.000349,0.000336,-7.6e-05,-0.000138,-9e-05,-0.000134,8e-06,-0.000203,0.000592,-0.000107,0.002127,-0.010189,-0.004123,-0.005312,-0.005554,0.000869,0.003664,0.001821,0.002536,0.007458,0.000678,-0.000347,-0.00126,-0.001328,0.001366,0.004288,0.002673,-0.000538,0.000215,0.004822,-0.004949,0.000813,-0.001901,0.000319,0.00091,0.003508,0.001718,0.002809,0.001166,4e-06,0.001017,0.004115,0.000397,0.003995,0.001369,0.000834,0.001459,0.001188,0.000755,9.5e-05,2.4e-05,-7.8e-05,-0.000588,0.000286,0.000315,0.000429,-0.000357,0.000342,-7.8e-05,-0.000325,-0.000214,-0.000209,-0.000365,6.8e-05,-8.8e-05,-0.001483,-0.001914,-0.000763,-0.000506,-0.000118,-0.001744,-0.000619,-0.000318,6.3e-05,0.000249,-0.000234,-3.6e-05,-5e-06,-0.000264,-0.000263,-0.000322,-0.000257
-0.000508,0.001008,0.000444,-7.7e-05,0.000203,2.7e-05,-0.000145,7.1e-05,0.000159,0.000102,-1.2e-05,-9e-05,0.000118,8.8e-05,-8.4e-05,0.000138,0.000179,-5e-05,1.1e-05,-8.8e-05,8e-06,1.5e-05,0.000202,-8.2e-05,-0.000133,0.000164,-1.3e-05,0.000286,0.000241,0.000127,-3.6e-05,-3e-06,-0.000154,-0.00017,3e-06,3.6e-05,-0.00015,-8.3e-05,0.001047,0.000412,0.00016,-7.3e-05,2.2e-05,-2e-05,-3.9e-05,8.9e-05,0.001067,0.000411,0.00066,0.001061,0.001829,0.00388,0.00848,0.00281,-0.000102,0.000103,-0.004126,-0.007488,-0.005594,-0.004972,0.003306,-0.000949,-0.001894,-0.000718,0.001007,-0.000643,0.002089,-0.002138,0.002665,0.001872,-0.004055,0.002923,0.00067,0.00051,-0.0012,0.002812,-0.000241,-0.007124,0.002377,-0.000734,-0.000257,-0.002809,0.000436,-0.000469,-0.001212,0.001821,0.001186,-2.6e-05,0.000165,0.000613,0.000435,5.4e-05,0.000574,-0.000165,0.000214,-3.8e-05,0.000444,-0.000552,-1e-06,-0.000287,0.00074,-0.000107,0.000261,0.000273,-0.001067,-0.002018,-0.002667,-0.001568,-0.000611,0.000275,0.000248,-5e-05,0.000121,-7e-05,-0.000209,-8e-05,-8.1e-05,-0.000107,6e-06,4.3e-05,-0.000124
-3.6e-05,-0.000425,-0.000137,0.000181,0.000118,-4.2e-05,-0.000106,-0.000106,3.4e-05,-6.8e-05,-0.000159,-7.3e-05,-7.8e-05,0.000107,5e-06,-0.000242,-6.9e-05,-4.6e-05,2e-06,-0.00014,-3.9e-05,-2.3e-05,-6.9e-05,0,-0.000128,4.7e-05,5.4e-05,4e-05,-0.000153,0.000167,0.000179,-3.1e-05,-0.000106,0.000251,6.6e-05,0.000131,7.7e-05,-1e-04,-0.000285,-0.000396,-0.000217,-0.000141,-0.000194,-1e-05,-8.2e-05,-0.000137,-0.000427,-0.000199,-1.9e-05,-0.001619,-0.001539,-0.011173,-0.005414,0.004239,-0.000475,0.004398,0.001399,0.004054,-0.002331,-0.00322,-0.00372,-0.001523,-0.000994,0.000309,-0.001766,0.000244,-0.000975,-0.002478,0.000172,0.001054,0.004829,-0.000304,0.001085,-0.001077,0.002911,-0.00124,-0.000232,0.000486,-0.001107,0.002063,0.001744,0.002325,0.000319,-0.000711,0.000253,-0.000324,0.000198,-4.9e-05,-0.001238,0.000576,-0.000409,-0.000339,0.000664,0.00047,0.000316,-0.000271,-0.000427,-0.000396,0.000201,-2e-05,-0.000246,-0.000128,-0.000531,0.000373,-0.000645,-0.001181,-0.001114,-0.000989,0.000458,-0.000247,-0.000945,-0.000415,4.6e-05,-8.6e-05,-4.9e-05,0.000118,3.7e-05,-9.1e-05,-9.7e-05,5e-06,-0.000189
-0.000353,-0.000592,-0.000307,-6.8e-05,-0.000121,-0.000145,-1.5e-05,-0.000112,-8.9e-05,-9.6e-05,-5.3e-05,-0.000131,3e-05,-0.000213,-0.000114,-0.000115,3.6e-05,-8.9e-05,-0.000156,-0.000152,-7.4e-05,2.3e-05,6.2e-05,-0.000133,-0.000278,-0.000104,-0.000122,-2.3e-05,-0.000143,-9.3e-05,-5.9e-05,-4.4e-05,-7.5e-05,0.000471,1.2e-05,-0.000221,-0.000207,-0.000293,-0.000522,-0.000292,7.3e-05,-9.7e-05,-0.000115,-8.7e-05,-9.7e-05,0.000269,-0.000314,0.001001,0.000181,0.000171,0.001816,0.004405,0.00349,-0.001141,0.000432,-0.005871,-0.002794,-0.000136,-0.001431,-0.00045,-0.000368,-0.001769,-0.002363,-0.002593,-0.002413,-0.002403,3.9e-05,0.003658,-0.001952,-0.003996,-0.003908,-1.9e-05,-0.002438,-0.00059,-0.002763,0.002868,0.000854,0.000736,-0.001775,-0.000302,-0.004139,0.000304,-0.001508,0.001022,0.000442,-0.000362,2.8e-05,-0.000485,-0.000253,0.000197,0.000423,-0.00036,-8.6e-05,-0.000187,-0.000292,-0.000606,-0.000317,-0.000599,-0.000163,0.000519,-0.000271,-0.00012,-0.00059,0.00027,0.000153,-0.00034,-0.000764,-9.6e-05,-0.00026,-0.001079,-0.001012,-0.000958,-0.000212,-0.000235,-8.5e-05,4.3e-05,-5.8e-05,-0.000157,-0.000127,-0.000136,-3.1e-05
-4.7e-05,0.000254,-7e-05,4.5e-05,4.2e-05,-1.9e-05,-9.1e-05,-7.6e-05,-2e-05,6.5e-05,4.7e-05,-0.000116,-0.000145,-0.000146,-7.9e-05,-0.000172,-0.000157,7.9e-05,-4.6e-05,-1e-04,-1.6e-05,2.5e-05,-8.8e-05,-3.2e-05,-8.8e-05,2.3e-05,-0.000109,-3.2e-05,-0.000121,-0.000104,-1.1e-05,-8.6e-05,-1.3e-05,-0.000142,-8.5e-05,4.7e-05,-0.000119,-0.000144,-0.000136,-0.000408,-0.000193,-0.00015,-4.5e-05,-0.00012,-6.4e-05,2.7e-05,5.2e-05,-0.001147,-0.000594,-0.00073,-0.001656,0.001941,0.002359,-0.000844,-0.000983,0.003742,0.006664,0.001792,0.005152,-0.00065,-0.002197,0.000656,0.001228,-0.001183,0.000198,0.001417,-0.001928,-0.00077,-0.003527,0.000556,0.002521,0.000277,1.5e-05,-0.002548,-0.000782,-0.004257,-0.001984,-0.001136,-0.001217,-0.004205,-0.000262,0.001714,0.001069,-0.000576,-0.000241,-0.001308,-0.000618,-0.000278,0.000214,-0.000556,-0.000385,-0.000524,-0.000787,-0.000256,-0.000337,-0.000155,-1e-05,2.3e-05,-6e-05,-0.000947,-0.00043,-0.000477,-0.000288,-0.00016,-0.000225,-0.000564,-0.000452,-0.000654,0.000543,0.000356,5.6e-05,-0.000842,-0.000244,-0.000147,-0.000244,7.3e-05,-0.000111,-7.2e-05,8.1e-05,-7.9e-05,5.2e-05
-6.6e-05,-0.000102,-2.1e-05,-0.000432,-1e-04,8e-06,-3.9e-05,-0.000107,-5.1e-05,3.5e-05,1.8e-05,-1e-06,-9.1e-05,7.4e-05,-0.000113,-6.1e-05,-6.4e-05,3e-05,-3.6e-05,-0.000112,-4.7e-05,3.7e-05,-3.2e-05,-0.000123,8.9e-05,-8.3e-05,-5.3e-05,2.7e-05,-1.4e-05,-0.000126,-7.3e-05,6.6e-05,-3.2e-05,-5.9e-05,-0.000177,5.4e-05,-7.4e-05,-0.000179,-6.7e-05,0.000486,0.000138,-4.2e-05,-3e-06,-1.8e-05,-1.2e-05,0.000149,-0.000124,0.000658,8.8e-05,-0.001033,0.00198,0.002753,0.000543,0.002062,-0.001097,-0.001457,-0.004457,-0.000407,-0.001312,0.00254,-0.000738,-0.002585,-0.001929,0.003946,8.2e-05,0.000666,0.000337,-0.000253,0.00035,-0.001219,0.002055,-0.000523,-0.001149,0.000238,0.000771,-0.001146,0.001661,0.001904,0.001265,0.000941,0.001336,-0.001005,-0.001464,-0.000732,-0.00066,-0.001163,-0.001103,0.000201,0.000366,-0.000264,-0.000293,-0.000257,-7e-04,-0.000254,-0.000429,-0.000221,-0.000402,0.000214,-0.000251,0.000346,0.000171,-0.000413,0.000128,-0.000215,-0.000301,0.000122,0.000175,0.000139,0.000298,-2.8e-05,4.1e-05,-0.000427,-0.000193,-0.000301,-0.000116,9.5e-05,-2e-04,-3.3e-05,1.2e-05,-5.2e-05,1.7e-05
4.3e-05,-2.1e-05,-8e-06,0.000223,6.4e-05,-2.5e-05,3.4e-05,-3.5e-05,3e-06,3.6e-05,-2e-05,-5e-06,-0.000135,-0.000143,-9.6e-05,8.1e-05,-2.3e-05,-0.000101,-6.2e-05,-6.3e-05,8e-06,5.7e-05,-8e-06,5.1e-05,1.5e-05,1.3e-05,1.2e-05,-5.2e-05,-5.1e-05,-0.000151,-5.7e-05,-7e-06,-6e-06,6.5e-05,0.000157,-2.9e-05,-9.8e-05,-8.6e-05,-0.000138,-0.00034,-0.000151,-8.1e-05,-3.5e-05,-7.8e-05,0,0.000106,1.2e-05,-6.4e-05,4.3e-05,-7.4e-05,0.000408,0.002858,-0.00152,-0.007607,-0.00155,0.002432,0.001207,-0.000698,-0.001592,-0.00182,0.000325,0.000256,0.000483,-0.002538,-0.000265,-0.000141,-0.000819,-0.000957,-0.00199,0.000472,-0.00038,-0.001423,0.001402,-0.000766,0.000368,0.000593,-0.001451,-0.002713,-0.002244,-0.000174,-0.001086,0.000428,-0.001105,-0.002133,-0.000157,0.000265,0.000168,-0.000311,-0.000765,-0.000105,-3.6e-05,-4.3e-05,-0.000192,-0.000397,-0.000189,-8.5e-05,-9.3e-05,0.000173,-0.000272,-0.000347,-4.1e-05,-1.4e-05,0.000106,-6.5e-05,-0.000247,0.000415,-3.3e-05,0.000747,0.000171,-0.000843,-0.000159,-0.000537,-0.000391,-0.000325,-5.4e-05,3e-06,-1e-05,-6e-06,-2.6e-05,4.6e-05,1.5e-05
1.8e-05,-7.2e-05,-0.000161,-7.8e-05,-4.5e-05,-4.2e-05,-7e-06,4e-05,-1.9e-05,-2.9e-05,-7.2e-05,-1.1e-05,-4e-06,7.1e-05,2.9e-05,4.2e-05,-7.7e-05,-7.6e-05,-1.9e-05,4e-06,-4.2e-05,-6.3e-05,2.6e-05,-1.7e-05,-3.3e-05,-7.1e-05,-3.3e-05,3.1e-05,-2.2e-05,5.5e-05,1.3e-05,2.8e-05,2.8e-05,-7.1e-05,-2e-06,-0.000107,-2.4e-05,-6e-05,1.9e-05,-0.000128,-7e-06,-5e-05,-1.4e-05,2e-05,-4e-05,3.9e-05,0.000239,2.4e-05,-0.000128,-0.000215,0.000983,-0.001032,-0.002059,0.003866,0.000632,-0.002663,-0.001993,0.000187,0.000556,0.000297,0.000645,-0.001429,-0.000629,0.000492,0.000113,-0.00103,0.000674,0.000139,0.000588,-0.001637,0.000489,0.000748,0.001287,-0.000702,-0.001352,0.00159,0.000243,0.001896,0.000767,-0.000273,0.001145,-0.000325,0.000441,0.000803,-6.8e-05,0.000366,0.000233,-0.000708,0.00017,-0.000615,-0.000146,0.00038,-0.000285,-0.000178,3e-05,-0.00014,-8.3e-05,-0.000123,-4e-06,0.000126,-1.9e-05,5.6e-05,3.2e-05,-3.7e-05,-0.000322,-0.000237,-0.000169,0.000184,-0.000101,0.000919,-7.7e-05,9.7e-05,-0.000116,-0.000153,-0.000101,6.1e-05,9.5e-05,-4e-05,1.6e-05,0.000131,-2.2e-05
-5e-05,-7.8e-05,0.000204,-0.000217,-5e-06,-7.7e-05,-1.3e-05,5e-05,-3.5e-05,-5.1e-05,4e-05,-3.2e-05,1.3e-05,-6.4e-05,2.4e-05,-3e-05,-3.6e-05,-2.8e-05,4e-06,-1.9e-05,1.5e-05,-5.7e-05,-3e-06,2.4e-05,1.2e-05,-2.2e-05,-2.5e-05,-1.8e-05,-6e-06,-5.6e-05,1.8e-05,1e-06,2.4e-05,-2.8e-05,-1e-05,1.4e-05,-6e-06,4.2e-05,-1.7e-05,0.000171,-6.4e-05,-7.1e-05,-2e-06,1.7e-05,4e-05,2.4e-05,7.9e-05,-0.000373,8e-06,0.000317,-0.000174,-0.001261,3.6e-05,0.000137,-0.000868,-0.001734,0.000738,0.000557,-0.000625,0.000397,0.001453,0.001405,-0.000135,0.000543,0.000538,0.001021,-0.000608,0.001675,0.001605,0.000459,-0.001169,-0.000623,-0.0022,0.000972,0.000574,-0.002138,0.000297,-0.00077,0.000183,0.00014,-0.000365,0.000859,-0.000272,0.000433,0.000288,0.000298,0.000121,-0.000307,2.4e-05,-0.000175,-1.8e-05,-1.5e-05,0.000104,0.000198,-3.1e-05,-0.000391,-1e-05,0.000137,9.6e-05,6e-05,5.6e-05,0.000108,-3e-05,-0.000206,-0.000158,-9.3e-05,7.2e-05,-0.000259,-0.000425,-0.000493,-0.000259,-0.000121,2.1e-05,-9.6e-05,-3.1e-05,6.5e-05,7e-05,-7.3e-05,2.7e-05,2.2e-05,-1.1e-05
9e-06,-5.3e-05,-3e-05,0.000248,2.2e-05,3.9e-05,0,-9e-06,1.9e-05,-1.7e-05,1.6e-05,4e-06,3.5e-05,1.4e-05,-3e-05,-2.6e-05,-3.9e-05,-2e-06,-1.4e-05,-1.3e-05,-1.1e-05,-3.5e-05,-2.7e-05,-1.2e-05,-6e-06,-5e-06,-9.9e-05,-2.9e-05,-2.6e-05,-7e-06,1.2e-05,-3.8e-05,5e-06,-7.4e-05,-8.9e-05,2.9e-05,-6.7e-05,-1.8e-05,-4.9e-05,-7.5e-05,-7.2e-05,8.5e-05,9e-06,3e-06,-2.2e-05,-2.5e-05,-3e-05,0.000107,-5.5e-05,0.00032,0.000918,-0.000236,-0.00031,-0.000249,0.001791,0.000929,-0.00124,-0.000491,4.5e-05,-3.4e-05,-0.0016,0.000151,7.4e-05,0.000888,0.000262,-0.000578,0.001147,-0.000381,0.000192,0.00121,0.000507,0.000321,-0.000395,0.000107,-0.000215,0.00056,-0.000944,0.00027,0.000545,-0.000979,-0.000853,-3.8e-05,0.000121,6e-06,-8.2e-05,-0.000238,-0.000109,0.000195,3.3e-05,-2.7e-05,7.9e-05,-6.3e-05,-0.000106,0.000123,0.000108,-8.5e-05,1.7e-05,5.2e-05,0.000115,-0.000377,-0.000152,-0.000139,-0.000154,-0.000385,-7.4e-05,-3.3e-05,5.9e-05,0.000232,-0.000185,0.000154,-1.1e-05,-2.2e-05,-6.7e-05,-2.6e-05,2.8e-05,4.6e-05,4e-05,4e-05,-2.3e-05,-8e-06,5.7e-05
-3.5e-05,9.7e-05,0,-0.00021,-2.4e-05,-2.5e-05,-3e-05,2.3e-05,-2.4e-05,-1e-06,-1.3e-05,2.9e-05,7e-06,-8e-06,1.8e-05,-1.1e-05,4e-06,2e-06,-8e-06,1e-06,-8e-06,-4e-05,4e-06,1e-05,1.2e-05,1.6e-05,-1.2e-05,-2.5e-05,5e-06,1.4e-05,1.3e-05,4e-06,1.8e-05,-3.8e-05,-9.4e-05,2.7e-05,-4e-05,9e-06,2.8e-05,-1.9e-05,8.5e-05,-6.8e-05,-1.9e-05,2.1e-05,3.2e-05,-4e-05,2.9e-05,1e-05,6.6e-05,-6.4e-05,-0.000265,0.001181,0.000246,0.000508,-0.000863,-0.00132,0.001069,0.00092,0.000108,7.2e-05,-0.000211,0.000165,-0.000423,-6.4e-05,-0.000271,-0.000274,-0.001376,-0.000698,0.000121,0.000691,-0.000892,0.000231,0.000511,0.000658,-0.000308,-5.6e-05,0.000149,0.000478,-0.000224,0.000746,-3.7e-05,-0.000492,0.000139,-0.000427,0.000147,3e-04,3e-05,0.000324,-9.3e-05,4.6e-05,4e-05,-4.2e-05,0.000398,-4.1e-05,-6.5e-05,0.000186,4.7e-05,0.000107,6.4e-05,-3.4e-05,1.7e-05,1.3e-05,-1.6e-05,-0.000113,-8.1e-05,-2.9e-05,-2.7e-05,-0.000245,-0.000445,-0.000247,6.8e-05,0.000231,5.1e-05,0,9e-06,-2.8e-05,-2.9e-05,4.4e-05,2e-05,6e-06,2.1e-05
3.8e-05,-1.6e-05,-3.1e-05,3.5e-05,-1.3e-05,2.3e-05,2.2e-05,1.2e-05,4e-06,7e-06,-1.5e-05,-1.4e-05,1.1e-05,-1.6e-05,8e-06,-1.3e-05,3.5e-05,2.2e-05,-2.6e-05,-4e-06,-1.1e-05,8e-06,-5e-06,-1.3e-05,3e-06,1.9e-05,-1.2e-05,2.1e-05,-1.8e-05,3.3e-05,2e-06,2.1e-05,-1.5e-05,4e-05,3.9e-05,-1.2e-05,-2.1e-05,4.5e-05,-3e-05,7.9e-05,-1e-04,-2.7e-05,2.7e-05,-5e-06,0,-1.4e-05,-1e-06,-5.8e-05,-7e-06,-0.000226,0.000431,-0.000466,0.000155,-0.000422,-0.000807,0.001983,-0.001549,-0.000897,0.00017,0.000232,-0.000215,-0.000351,0.000477,-0.000194,-6.4e-05,0.000829,0.000486,0.000465,0.000208,-0.000335,0.000659,3.7e-05,0.00033,0.000122,-0.000198,0.000344,0.000187,-0.000124,-0.000421,0.000165,0.00027,0.000113,6.4e-05,0.00043,-4.7e-05,0.000392,3.7e-05,9.7e-05,-0.000159,9.1e-05,-7e-06,-5.3e-05,-8.2e-05,5.9e-05,-0.000103,7.3e-05,2.9e-05,7.6e-05,3e-06,-3.3e-05,-6.3e-05,2.5e-05,2.2e-05,-1.4e-05,-0.000101,9.1e-05,-5.6e-05,1.9e-05,-0.00025,-3.5e-05,5e-05,-0.000138,-3.2e-05,-7e-06,5.4e-05,2.2e-05,-4.3e-05,2.3e-05,8e-06,2e-06,-4e-06
-4e-06,-1.4e-05,-2.6e-05,0.000102,2e-06,-2e-05,1e-05,-1.4e-05,8e-06,6e-06,-1.2e-05,-1e-05,3e-06,-5e-06,-2e-06,1.7e-05,2.2e-05,-1.7e-05,-8e-06,-1.3e-05,6e-06,-1e-06,-1.2e-05,-3e-06,1.5e-05,3e-06,1.5e-05,-1.3e-05,1e-05,3.9e-05,0,0,-7e-06,-2.5e-05,-1.1e-05,3e-05,1.6e-05,1.2e-05,-4.5e-05,-5e-06,1e-04,-5e-06,-3e-06,-1.3e-05,7e-06,-3.9e-05,-4.8e-05,2.2e-05,-1.2e-05,-8.2e-05,-0.000426,0.000356,-0.000485,0.000121,0.001029,-0.000778,0.000805,3.7e-05,-0.000111,5e-05,0.000312,-0.00013,0.000147,-0.000314,3.1e-05,1e-04,5.5e-05,0.000125,-0.000448,-0.000301,-0.000568,0.000161,-0.000238,-0.000179,-9.5e-05,-0.000429,-0.000239,-0.000197,-8.7e-05,-4.6e-05,-0.000138,-0.000379,-0.000143,-0.000154,-7.1e-05,-0.00029,-6e-06,-7.6e-05,-4.8e-05,-2.7e-05,4.1e-05,1.5e-05,0.000126,-3.9e-05,-8e-06,8e-06,-3.1e-05,3.8e-05,3.5e-05,0.000151,4.7e-05,-3.9e-05,6.3e-05,0.000119,-4.4e-05,6e-05,-5.3e-05,0.000133,-0.000158,-0.00011,-4.1e-05,-0.000159,-4e-06,-2.7e-05,-1.5e-05,2e-06,-3.1e-05,-3.2e-05,1.4e-05,-2.7e-05,-2.7e-05
1e-06,-3.2e-05,1.7e-05,-5.6e-05,-2e-06,-2e-06,-1.5e-05,-9e-06,3e-06,3e-06,-4e-06,-6e-06,-7e-06,-2e-06,-1.5e-05,1.5e-05,8e-06,-4e-06,-6e-06,-3e-06,-9e-06,5e-06,-1.2e-05,3e-06,2e-06,7e-06,2.2e-05,7e-06,-1.2e-05,-2.7e-05,7e-06,8e-06,-4e-06,-9e-06,-1.4e-05,-2.6e-05,0,2.1e-05,1.4e-05,-5.3e-05,-7e-05,3.9e-05,-5e-06,6e-06,2e-06,-2.1e-05,2.9e-05,0.000115,2.4e-05,2.6e-05,0.000383,-0.000802,0.000194,-0.000868,0.00016,0.000814,0.000561,-0.000226,0.000296,-0.000471,-0.000106,-0.000137,-2.1e-05,0.00032,-0.000358,-0.000153,6.2e-05,-9e-06,-0.000213,9.8e-05,-0.000455,-0.000116,0.00021,-0.000133,0.000253,0.00018,0.000317,-0.000507,0.000121,0.000117,0.000174,0.000231,3.5e-05,0.000246,-6e-06,1e-06,2.4e-05,-3.9e-05,3.7e-05,0.000104,3.9e-05,-1.8e-05,-3.2e-05,9.2e-05,-1.5e-05,-5.7e-05,-2.4e-05,5.9e-05,2e-05,-0.000109,-5e-05,-3.2e-05,-5e-06,5e-05,-6e-06,-8.3e-05,2e-05,5.1e-05,-6.8e-05,-4.9e-05,-8.8e-05,-0.000101,1.2e-05,-5.1e-05,6e-06,-1.1e-05,-4.6e-05,-3e-06,-1e-05,-1.5e-05,-2.3e-05
-9e-06,3.7e-05,2.2e-05,2e-06,1.7e-05,-5e-06,-5e-06,8e-06,3e-06,-4e-06,1.7e-05,9e-06,-1.2e-05,7e-06,-3e-06,6e-06,-4e-06,8e-06,5e-06,-8e-06,-2e-06,6e-06,-3e-06,-6e-06,-1.2e-05,-1e-05,1.2e-05,4e-06,-4e-06,-3e-06,-6e-06,-1e-06,1e-06,3.6e-05,-7e-06,-2.9e-05,-3e-06,-1e-06,1.1e-05,-1.1e-05,2.8e-05,6e-06,-6e-06,-1.7e-05,-3e-06,1.1e-05,2e-05,-6.6e-05,-2.1e-05,1e-05,-0.000215,-0.000799,0.000214,-0.000457,-0.000587,-0.000399,-4.2e-05,-9.4e-05,-2.9e-05,6.4e-05,0.000487,1.8e-05,-0.000116,-4.2e-05,5.5e-05,-0.000353,-7.6e-05,-0.000289,0.000113,-0.000363,-8e-06,0.000208,-1.4e-05,0.000112,-9.9e-05,-0.000562,-0.000233,0.000126,-0.000103,-9.8e-05,-0.000121,0.000113,0.000147,4.7e-05,-5.4e-05,-0.000116,-8.5e-05,-7.1e-05,9.4e-05,-4.9e-05,-2.5e-05,5.9e-05,-8.7e-05,-7.5e-05,-1.4e-05,-8.8e-05,1.1e-05,9e-06,-6e-06,0.000118,2e-05,-7e-06,6e-06,6.7e-05,-2.4e-05,-1e-05,5.5e-05,-8e-06,6e-06,6.4e-05,-2.1e-05,-7e-05,-9.4e-05,-4e-05,1.1e-05,-1.2e-05,-1.4e-05,-1.2e-05,8e-06,1.5e-05,2.1e-05
-7e-06,-3.8e-05,-2.6e-05,-1.9e-05,-3e-06,-1.1e-05,6e-06,1e-06,-4e-06,-4e-06,5e-06,-1e-06,-9e-06,4e-06,8e-06,-4e-06,-1.8e-05,1.3e-05,1e-05,-7e-06,3e-06,7e-06,-5e-06,9e-06,4e-06,-1e-06,-6e-06,-3e-06,-4e-06,-1.4e-05,1e-06,-6e-06,1e-06,8e-06,1.9e-05,-5e-06,-1.5e-05,5e-06,-7e-06,-6e-06,4e-06,-4.1e-05,3e-06,3e-06,1e-06,-6e-06,-3.6e-05,3e-05,3.3e-05,4.1e-05,0.000101,0.00011,2.7e-05,0.000716,7.8e-05,-0.000357,-0.000198,9.3e-05,-0.00012,9.9e-05,-0.000163,0.000287,-0.000167,-0.000143,2e-04,0.000304,0.000203,-5e-05,1e-04,0.000147,-8.2e-05,-0.000414,-0.000148,-0.000114,0.000155,0.000421,1e-05,0.000561,7.3e-05,8.8e-05,0.000165,-0.000222,-0.000189,-4.7e-05,0.000137,-3.6e-05,-1.8e-05,-3.5e-05,2.4e-05,-2.5e-05,-3.4e-05,1e-06,-6.1e-05,-4.3e-05,2.4e-05,-3.6e-05,-1.3e-05,1e-05,-1e-05,-7.9e-05,1.8e-05,2e-05,-2.3e-05,3.9e-05,-1.9e-05,4e-05,-1.9e-05,-8.4e-05,-8e-06,3.2e-05,2.2e-05,-7e-06,1.4e-05,-2.7e-05,-1.1e-05,-9e-06,1.7e-05,5e-06,2e-06,1e-05,7e-06
3e-06,1.4e-05,-4e-06,2.4e-05,-2e-06,1.1e-05,-3e-06,8e-06,1e-06,3e-06,-1e-05,-8e-06,-3e-06,-5e-06,-5e-06,-4e-06,-1.5e-05,-1e-06,-7e-06,-2e-06,-4e-06,6e-06,9e-06,-6e-06,6e-06,-5e-06,-1.1e-05,-3e-06,0,-1.8e-05,-2e-06,5e-06,0,2e-05,-6e-06,9e-06,-2e-06,4e-06,-6e-06,1.6e-05,4e-06,2e-06,-4e-06,0,2e-06,-1.6e-05,2.6e-05,1.9e-05,-2.5e-05,1.3e-05,-0.00022,0.00026,0.000234,0.000131,-0.000119,0.000408,-0.00023,-3.5e-05,0.00015,0.000224,-3.4e-05,-0.000146,4.3e-05,0.000337,-7.5e-05,-4.9e-05,-1.6e-05,0.000298,5.6e-05,0.000155,0.00011,0.000116,0.000116,0.000162,6.5e-05,-0.000121,0.000134,-0.000204,0.000134,-8.8e-05,-0.00034,0.000101,7e-05,-0.000224,3.4e-05,0.000157,4.6e-05,3.1e-05,-6.2e-05,-6.4e-05,9e-06,-1.1e-05,-1e-05,6e-06,2.2e-05,1.4e-05,7e-06,2.3e-05,-3.6e-05,-5.1e-05,-3.3e-05,8e-06,-4.8e-05,1.2e-05,-3.8e-05,-2.8e-05,-4.2e-05,-6.5e-05,7.4e-05,-6.4e-05,2.1e-05,1.3e-05,-3.6e-05,-4.4e-05,3e-06,-7e-06,1.5e-05,3e-06,5e-06,-4e-06,-8e-06
1e-06,-8e-06,1.8e-05,-7.2e-05,1e-06,1e-06,0,1.2e-05,-5e-06,5e-06,-6e-06,4e-06,2e-06,-3e-06,0,-1.7e-05,-1.1e-05,-1e-05,1e-06,-1e-06,0,1e-05,-2e-06,5e-06,0,-5e-06,-1.9e-05,1e-06,-7e-06,-3e-06,4e-06,-1e-05,-2e-06,3e-06,-9e-06,1.6e-05,-2e-06,4e-06,5e-06,-5e-06,-3.4e-05,-1.1e-05,4e-06,4e-06,2e-06,6e-06,1.4e-05,2.8e-05,2.9e-05,-2.2e-05,0.000142,6.7e-05,6e-05,-0.000182,-0.000193,-0.000439,0.000148,4.2e-05,-7.8e-05,-0.00036,-0.000147,1.8e-05,-5.5e-05,0.00011,6.9e-05,7.7e-05,5.7e-05,-0.000153,0.000123,4.5e-05,-0.000295,3.2e-05,-0.000195,-5.7e-05,-2.6e-05,-5.1e-05,-9.4e-05,-1.5e-05,0.000186,-0.000214,0.000273,-0.000252,5.4e-05,-2.2e-05,-0.000128,-0.000173,-1.3e-05,-5e-06,6e-06,3e-06,-1.7e-05,-2.1e-05,-1e-06,4e-06,4e-06,-5e-06,-2.7e-05,1.7e-05,4e-06,9.7e-05,6e-06,-7e-06,5e-06,-1.9e-05,-3e-05,2.6e-05,-4e-06,3.9e-05,5.2e-05,4.3e-05,7e-06,1.2e-05,8e-06,-2.8e-05,5e-06,-1.3e-05,1.7e-05,-7e-06,-1e-06,-8e-06,-5e-06
1e-05,1e-06,-1e-06,5.5e-05,-1e-06,-2e-06,-5e-06,-1e-06,-1e-06,3e-06,-2e-06,4e-06,6e-06,-2e-06,0,0,-4e-06,0,-1e-05,-6e-06,0,5e-06,-2e-06,-6e-06,3e-06,1e-06,3e-06,-4e-06,1e-06,-1e-05,1e-06,7e-06,-1e-06,-4e-06,-1.8e-05,-8e-06,-5e-06,3e-06,1e-06,1.4e-05,2.7e-05,1.4e-05,2e-06,3e-06,2e-06,1e-06,-2.6e-05,-8e-06,-2.2e-05,1e-05,-0.000185,-2.7e-05,-0.000129,-6.4e-05,2e-04,0.000758,-0.000106,-2.5e-05,-0.000193,0.000196,2.1e-05,-7.6e-05,0.000185,-0.000504,9.1e-05,4.4e-05,-0.000159,-6.8e-05,7.8e-05,-3.7e-05,0.000395,4e-06,-6.1e-05,8.5e-05,-8.4e-05,6.8e-05,4.9e-05,-9.9e-05,-8.9e-05,0.00019,-8.5e-05,9.9e-05,-6.3e-05,3.2e-05,-9e-06,-2.6e-05,6e-06,-6.4e-05,-4.1e-05,-2.1e-05,-5e-06,-1.9e-05,2.7e-05,2.5e-05,-5e-06,-2.3e-05,8e-06,1.3e-05,2.6e-05,-6e-05,-2.6e-05,-2.8e-05,2.4e-05,-2.7e-05,-2e-05,-4e-06,1e-05,5.5e-05,9.8e-05,-5.7e-05,-1.6e-05,-1.8e-05,1.3e-05,-1.1e-05,-1e-06,-9e-06,-8e-06,6e-06,3e-06,-2e-06,-7e-06
-1e-06,2.2e-05,-6e-06,-1.5e-05,-5e-06,-3e-06,-2e-06,1e-06,-2e-06,0,8e-06,-6e-06,4e-06,1e-06,0,1e-05,8e-06,-5e-06,2e-06,-1e-06,-2e-06,-2e-06,0,4e-06,1e-06,0,1e-06,3e-06,2e-06,1.5e-05,1e-06,4e-06,1e-06,1.1e-05,1e-06,6e-06,-4e-06,3e-06,-1.2e-05,-1.6e-05,-3.7e-05,-1.6e-05,-1e-06,-4e-06,0,-5e-06,3e-06,-3e-05,1e-06,-2.2e-05,7.1e-05,-0.000216,-5.5e-05,3.2e-05,6.8e-05,-0.000687,0.00036,-5.4e-05,0.000226,-8e-06,1.5e-05,0.000123,-6e-05,0.000518,1.4e-05,-4.8e-05,2.8e-05,-1.7e-05,-0.000231,-0.000141,-0.000223,0.000104,0.000242,-1.7e-05,-4e-06,6.2e-05,-5.3e-05,9.2e-05,-5.9e-05,-5.7e-05,-0.000129,7e-05,1.3e-05,0.000118,3e-05,1e-04,3e-06,-3.2e-05,4.4e-05,-7.1e-05,3e-06,3.6e-05,5.4e-05,1.1e-05,-2.3e-05,1.6e-05,1.4e-05,6e-06,3.1e-05,-4e-05,3.6e-05,2.8e-05,1.9e-05,-2.6e-05,-2.9e-05,-2.3e-05,1.7e-05,-2.2e-05,3.9e-05,0,-2.7e-05,-2.2e-05,6e-06,-7e-06,1.4e-05,-3e-06,-2.1e-05,-7e-06,4e-06,-4e-06,1e-06
0,-2.2e-05,-1.2e-05,-3.6e-05,-3e-06,-9e-06,5e-06,1e-06,1e-06,-4e-06,3e-06,-3e-06,4e-06,-5e-06,3e-06,9e-06,4e-06,1e-06,-2e-06,-2e-06,-1e-06,-4e-06,3e-06,-4e-06,-3e-06,3e-06,3e-06,-1e-06,-4e-06,1.1e-05,3e-06,0,-2e-06,-1.2e-05,2e-05,0,-4e-06,3e-06,-2e-06,-1.2e-05,3.1e-05,5e-06,-3e-06,2e-06,0,8e-06,6e-06,2e-06,3e-06,-1e-05,-0.000145,-0.00023,-2.6e-05,0.000365,-0.000166,0.000183,-0.000383,1.6e-05,-0.000125,8.5e-05,3.7e-05,-3.6e-05,5.2e-05,-0.000427,-9.2e-05,-9.8e-05,-3.3e-05,-0.000109,-0.000178,0.000159,6.2e-05,-1.6e-05,0.000104,1.9e-05,-2.6e-05,-0.000164,5.8e-05,6.8e-05,-1.4e-05,4.4e-05,0.000233,-3e-06,2.3e-05,-3.2e-05,7.1e-05,2.6e-05,-2.1e-05,4.3e-05,4e-06,3e-05,2e-06,-1.7e-05,2.2e-05,-2.3e-05,-1.9e-05,-1.9e-05,-2.4e-05,-1e-06,2.6e-05,6.1e-05,-1.6e-05,-1.5e-05,1.3e-05,-2.2e-05,-3.5e-05,2.4e-05,-4e-06,7e-06,2e-06,-2.4e-05,-6e-06,-8.7e-05,-1.5e-05,-7e-06,-3e-06,-6e-06,-8e-06,-4e-06,1e-06,-5e-06,7e-06
-7e-06,-1e-06,1.7e-05,5.7e-05,4e-06,9e-06,0,-2e-06,2e-06,-3e-06,-3e-06,3e-06,-1e-06,1e-06,-1e-06,-3e-06,9e-06,4e-06,3e-06,-4e-06,0,-7e-06,-5e-06,2e-06,-1e-06,0,3e-06,1e-06,0,5e-06,0,-2e-06,0,-1.2e-05,-1.8e-05,-1e-06,2e-06,2e-06,0,7e-06,-6e-06,-6e-06,-1e-06,-1e-06,1e-06,6e-06,-1.2e-05,-8e-06,0,1e-06,9.5e-05,0.000251,-0.000168,-6.3e-05,9e-05,-0.000368,9.7e-05,-4.1e-05,-6.8e-05,-0.000183,0.000194,1.7e-05,-4.1e-05,0.000225,-2.3e-05,8.1e-05,7.5e-05,0.000138,-1e-05,-2.8e-05,0.000223,3.3e-05,-0.00021,1.9e-05,-3.2e-05,0.000165,6.5e-05,1.5e-05,-2.2e-05,7.5e-05,-0.00015,4.9e-05,-2.7e-05,2.7e-05,-8.5e-05,-9e-06,2e-05,5.7e-05,-2.4e-05,4e-05,1e-06,1e-05,3.3e-05,6e-06,-5e-06,-3.2e-05,8e-06,-3e-06,-2e-06,-3.1e-05,4e-06,-1.8e-05,-4e-06,-1.9e-05,-2.4e-05,6e-06,-1.4e-05,-1e-05,-1.5e-05,1.2e-05,3e-06,-6.3e-05,9e-06,-1.6e-05,7e-06,-2e-06,-1e-05,7e-06,-1e-06,-4e-06,-4e-06
-3e-06,1e-06,-1e-06,-3.7e-05,2e-06,-2e-06,-8e-06,-1e-06,0,-1e-06,-5e-06,3e-06,-3e-06,1e-06,-3e-06,-1e-06,2e-06,0,3e-06,-1e-06,-2e-06,-5e-06,-1e-06,0,3e-06,2e-06,-6e-06,1e-06,-2e-06,6e-06,0,1e-06,-1e-06,-1e-06,-2e-06,-5e-06,4e-06,1e-06,-1e-06,3e-06,1.1e-05,-4e-06,3e-06,-3e-06,0,-2e-06,1e-06,-3.4e-05,0,1.3e-05,-0.000117,0.000143,-1.7e-05,-0.000352,-9.2e-05,4.3e-05,-7.4e-05,5.8e-05,2.2e-05,0.000255,-1.7e-05,-9.3e-05,-7.3e-05,-9.9e-05,5.5e-05,9.3e-05,-1.9e-05,8e-06,3.7e-05,-4.7e-05,-0.000197,-7.7e-05,-3.8e-05,-2.6e-05,-4e-06,-0.000109,-0.000108,-0.000106,-2.4e-05,-3.6e-05,-2.8e-05,-0.000135,-6.9e-05,-6.8e-05,-1.9e-05,-1.6e-05,1.1e-05,8e-06,-1e-06,1.2e-05,6e-06,7e-06,-3.2e-05,1e-05,3e-06,-1.5e-05,6e-06,-6e-06,-1.1e-05,3.2e-05,5e-06,1.4e-05,-2.4e-05,-9e-06,-2.7e-05,-2.5e-05,-5e-06,-2.4e-05,-4.9e-05,6e-06,1.4e-05,0,-1.2e-05,-1.7e-05,6e-06,-1e-06,0,-5e-06,1e-06,4e-06,-4e-06
0,1.5e-05,-1.1e-05,2e-06,1e-06,3e-06,1e-06,5e-06,2e-06,2e-06,1e-06,-3e-06,-4e-06,3e-06,1e-06,-6e-06,0,-4e-06,-3e-06,0,0,-3e-06,1e-06,-1e-06,3e-06,0,-2e-06,-2e-06,2e-06,-9e-06,0,-4e-06,0,-9e-06,-4e-06,-3e-06,-5e-06,1e-06,6e-06,-1.5e-05,-2.1e-05,4e-06,0,1e-06,1e-06,4e-06,1.4e-05,1e-06,-6e-06,-3e-06,5.4e-05,0.000156,-7e-06,0.000198,-9e-05,0.000242,0.000188,-1.9e-05,6.7e-05,-0.00026,-4e-05,8e-06,-1.3e-05,-0.000155,-9.6e-05,-7.7e-05,5.1e-05,-0.000128,6.9e-05,2e-06,0.000253,0.000136,2.5e-05,4e-06,-1.1e-05,-6.6e-05,4.4e-05,-2.7e-05,7.4e-05,8.8e-05,3.5e-05,3.5e-05,4.2e-05,9e-06,4.4e-05,2.1e-05,-2.1e-05,-1.5e-05,-8e-06,-4e-06,2e-06,-9e-06,-1.8e-05,-1e-05,7e-06,0,-4e-06,-3e-06,-8e-06,-1.5e-05,5e-06,-4e-06,-2e-06,7e-06,-2.8e-05,1.1e-05,2e-06,-7e-06,-2.5e-05,-1.1e-05,1.1e-05,-2.8e-05,-2e-06,-2e-05,-2e-06,2e-06,9e-06,-1e-06,5e-06,3e-06,-3e-06
2e-06,-1.6e-05,7e-06,2e-05,0,-3e-06,4e-06,1e-06,-1e-06,2e-06,2e-06,-3e-06,-1e-06,0,1e-06,-3e-06,-3e-06,0,2e-06,-4e-06,0,-1e-06,2e-06,1e-06,-2e-06,0,-3e-06,2e-06,-6e-06,-1e-06,1e-06,4e-06,0,0,2e-06,4e-06,-3e-06,1e-06,-2e-06,9e-06,1.2e-05,-1e-06,0,-1e-06,0,0,-1.1e-05,1.7e-05,0,7e-06,-6.5e-05,-7e-05,7e-06,-1.7e-05,0.00019,-3.3e-05,-6.6e-05,-1.1e-05,-9.3e-05,0.000115,-9.5e-05,3.3e-05,-1.3e-05,0.000182,3.7e-05,-4.6e-05,-7.4e-05,-9e-06,0.000148,-1.9e-05,-0.000218,-7.5e-05,3.4e-05,-5e-06,6.6e-05,2.6e-05,2.9e-05,-4.2e-05,4.3e-05,-3.3e-05,3e-05,3.4e-05,-1.2e-05,2.4e-05,1.3e-05,2.3e-05,2e-06,-3.5e-05,3.3e-05,4e-06,-4e-06,-1e-06,-2.2e-05,-4e-06,1.6e-05,1.1e-05,-1e-05,-3e-06,-8e-06,-2e-05,-1.3e-05,-1e-06,-3e-06,1e-05,-2.2e-05,3e-06,7e-06,5e-06,-5.7e-05,6e-06,-9e-06,-4e-06,-1.7e-05,-2.3e-05,5e-06,1e-06,7e-06,-4e-06,-3e-06,-1e-06,-1e-06
4e-06,8e-06,3e-06,-1.6e-05,0,-3e-06,-2e-06,1e-06,-1e-06,0,4e-06,3e-06,0,-4e-06,0,1e-06,-4e-06,3e-06,-4e-06,-2e-06,-1e-06,0,-1e-06,-2e-06,-1e-06,-2e-06,2e-06,0,4e-06,-1.1e-05,-1e-06,-1e-06,-1e-06,-1e-06,3e-06,-1e-06,-3e-06,0,-3e-06,6e-06,-4e-06,0,-1e-06,1e-06,0,-3e-06,0,8e-06,3e-06,0,5.1e-05,-0.000122,3.2e-05,-0.000195,-5.9e-05,0.000342,0.000119,-1.1e-05,6.3e-05,-3.3e-05,1.3e-05,1.6e-05,7e-05,-8.5e-05,9e-06,4.1e-05,-1e-06,5e-06,7.7e-05,8.6e-05,8.7e-05,-1e-06,2.9e-05,3.3e-05,-3.2e-05,3e-06,-4.2e-05,1.9e-05,1.3e-05,-3.6e-05,-6e-05,2e-05,-4.1e-05,4.6e-05,-3.7e-05,2.1e-05,2e-06,-4e-05,-1e-06,-4e-06,3e-06,-2e-06,-1.5e-05,-1e-05,-3e-06,-6e-06,1.7e-05,-7e-06,2e-06,0,4e-06,1e-06,1.5e-05,1.3e-05,-2.2e-05,-9e-06,1e-06,3.1e-05,-3.5e-05,-2e-06,-1.2e-05,1e-05,0,-1.6e-05,5e-06,2e-06,8e-06,-1e-06,2e-06,-4e-06,5e-06
0,4e-06,-5e-06,-7e-06,-1e-06,2e-06,-2e-06,3e-06,0,-1e-06,-2e-06,1e-06,2e-06,1e-06,-2e-06,4e-06,-5e-06,2e-06,1e-06,0,1e-06,1e-06,0,2e-06,1e-06,0,4e-06,-1e-06,-3e-06,-8e-06,0,2e-06,0,-1e-06,-1e-05,3e-06,3e-06,0,3e-06,-6e-06,1e-06,-8e-06,-1e-06,0,0,0,8e-06,-1e-05,3e-06,-7e-06,-4.5e-05,-5.7e-05,4.9e-05,0.000121,-0.000174,-0.000352,-0.000159,-2.1e-05,5.2e-05,6.3e-05,1.8e-05,2.1e-05,8e-06,-0.000107,8e-06,3.8e-05,1e-06,7.9e-05,-5e-05,-7.3e-05,-3.6e-05,-2.6e-05,-2.2e-05,1.3e-05,2.2e-05,-2.9e-05,4e-06,6.9e-05,-3.3e-05,6.4e-05,2e-05,2.4e-05,5e-05,-5e-05,-4e-06,-5.1e-05,-7e-06,-9e-06,8e-06,-4e-06,-3e-06,1.1e-05,-4e-06,4e-06,-5e-06,-2.1e-05,-3e-06,-7e-06,-3e-06,2.4e-05,-1e-06,-6e-06,1.1e-05,8e-06,-2.2e-05,1.3e-05,-1e-06,1e-05,-3.4e-05,-7e-06,-7e-06,-1.9e-05,1.2e-05,-1.2e-05,1e-06,4e-06,-3e-06,1e-06,0,-1e-06,1e-06
0,-8e-06,0,3e-06,-1e-06,-2e-06,-2e-06,0,-1e-06,-1e-06,-4e-06,-3e-06,0,-3e-06,0,2e-06,-1e-06,-1e-06,-2e-06,-2e-06,-1e-06,2e-06,0,-2e-06,-1e-06,0,2e-06,2e-06,1e-06,2e-06,0,1e-06,0,1e-05,-1e-06,1e-06,1e-06,0,-2e-06,-6e-06,-3e-06,0,0,0,0,0,-9e-06,1.3e-05,-5e-06,-1e-06,2.8e-05,9.8e-05,2.4e-05,1.4e-05,0.00015,0.000119,9.4e-05,3e-05,-3.7e-05,-0.00014,5.4e-05,-4.3e-05,7e-06,9.2e-05,1.8e-05,-5.1e-05,4e-06,-4.3e-05,-8.1e-05,9.4e-05,-8e-06,-5e-06,-3.6e-05,1.7e-05,2.7e-05,5.3e-05,-1.9e-05,3e-06,-3.8e-05,-8.7e-05,5e-05,-6.8e-05,-1.1e-05,0,2.7e-05,-4.5e-05,9e-06,1.8e-05,-6e-06,-1.6e-05,-4e-06,-1e-05,2.1e-05,1.3e-05,-3e-06,-1.9e-05,-1.1e-05,-7e-06,1e-06,-1.2e-05,1e-06,-7e-06,0,8e-06,-1.8e-05,-9e-06,-6e-06,-3e-05,-1.3e-05,1e-06,4e-06,-3.4e-05,0,-1.1e-05,7e-06,3e-06,-1.3e-05,0,3e-06,0,-5e-06
-2e-06,8e-06,-2e-06,7e-06,-1e-06,3e-06,1e-06,-1e-06,0,0,0,-1e-06,0,3e-06,2e-06,1e-06,-1e-06,-1e-06,1e-06,-2e-06,0,2e-06,0,2e-06,-1e-06,-1e-06,-2e-06,-2e-06,-3e-06,0,1e-06,-2e-06,0,2e-06,7e-06,1e-06,-3e-06,0,-4e-06,2e-06,5e-06,5e-06,2e-06,0,0,1e-06,0,2.1e-05,3e-06,-1e-06,-1.5e-05,0.000143,1.8e-05,0.000109,3e-06,-0.000179,-3.2e-05,-2.1e-05,1.8e-05,0.000172,-1.5e-05,-2e-06,-1.6e-05,-0.000137,-5.3e-05,-2.3e-05,-3e-06,-7.9e-05,-7.7e-05,-3.9e-05,9e-06,3e-06,2.8e-05,-2.4e-05,-3.2e-05,-3.7e-05,2.7e-05,-1.6e-05,-5.1e-05,4.4e-05,-5.6e-05,3e-06,-1.1e-05,-3.2e-05,9e-06,3.9e-05,0,1.1e-05,-1.5e-05,-1.1e-05,0,2e-06,1.2e-05,-5e-06,-1.1e-05,8e-06,7e-06,-7e-06,7e-06,-1.6e-05,-2e-06,1.7e-05,-8e-06,3e-06,-1.6e-05,-6e-06,-2e-06,-1.7e-05,3e-06,-6e-06,1.1e-05,-3.6e-05,-4e-06,-8e-06,0,3e-06,-7e-06,-1e-06,-4e-06,-1e-06,-1e-06
-1e-06,0,3e-06,-2.1e-05,0,-1e-06,2e-06,1e-06,-1e-06,1e-06,3e-06,3e-06,0,-1e-06,-1e-06,-2e-06,2e-06,-1e-06,1e-06,-1e-06,1e-06,3e-06,1e-06,-2e-06,2e-06,1e-06,-2e-06,0,3e-06,9e-06,0,-1e-06,-1e-06,2e-06,2e-06,-1e-06,-1e-06,0,0,-1e-06,-4e-06,-3e-06,0,-1e-06,0,-2e-06,5e-06,-1.1e-05,-3e-06,-2e-06,2.3e-05,-1.4e-05,5.6e-05,-0.000101,-0.000128,6.8e-05,2.8e-05,1.5e-05,2.4e-05,-8.7e-05,1.2e-05,-1.4e-05,-3.4e-05,3.3e-05,5.6e-05,2e-05,1.9e-05,6.1e-05,-7.7e-05,-2.5e-05,-4.5e-05,3.2e-05,2.5e-05,1.9e-05,-1.9e-05,-3.3e-05,-1.1e-05,-5.5e-05,1.4e-05,-2.3e-05,-1.5e-05,0,7e-06,5e-05,-3e-05,4e-06,-8e-06,-4e-06,1.1e-05,-3e-06,0,2e-06,1.4e-05,-2e-06,-6e-06,1e-06,4e-06,-5e-06,6e-06,1.8e-05,4e-06,-1.5e-05,-1.5e-05,-3e-06,-1.8e-05,1.2e-05,6e-06,1.3e-05,1e-06,1e-05,1e-06,-3e-05,5e-06,-7e-06,5e-06,2e-06,-2e-06,-1e-06,1e-06,-1e-06,-1e-06
0,-7e-06,4e-06,2.2e-05,1e-06,-1e-06,-3e-06,1e-06,0,1e-06,1e-06,1e-06,1e-06,1e-06,-1e-06,-5e-06,4e-06,-1e-06,-1e-06,-1e-06,-2e-06,2e-06,-1e-06,2e-06,1e-06,1e-06,-5e-06,1e-06,-2e-06,4e-06,-1e-06,1e-06,0,4e-06,-8e-06,-3e-06,1e-06,0,2e-06,-2e-06,4e-06,-1e-06,-1e-06,0,0,0,-1e-06,1e-06,5e-06,3e-06,-1.4e-05,-8.3e-05,-3e-06,-7.3e-05,5.2e-05,0.000176,-5.4e-05,-3e-06,-4.6e-05,4.9e-05,-7.4e-05,3e-05,5e-06,-3.5e-05,-3.5e-05,3e-06,1.2e-05,9e-06,3.7e-05,-2e-06,2.9e-05,8e-06,-8.3e-05,-2.7e-05,2.2e-05,3e-05,-3.7e-05,-2.6e-05,1.3e-05,6e-06,5.5e-05,2.1e-05,2.3e-05,-8e-06,-1e-06,-4.2e-05,7e-06,-6e-06,5e-06,0,-2e-06,-3e-06,6e-06,0,9e-06,-1.4e-05,-9e-06,-4e-06,8e-06,-1.5e-05,-3e-06,4e-06,-4e-06,-6e-06,-1.4e-05,-1e-06,6e-06,1.1e-05,2.4e-05,-8e-06,-8e-06,-2.3e-05,-9e-06,-9e-06,6e-06,3e-06,2e-06,0,1e-06,2e-06,2e-06
0,3e-06,-6e-06,-6e-06,1e-06,0,-2e-06,-1e-06,0,0,-1e-06,-3e-06,0,0,0,-1e-06,2e-06,2e-06,1e-06,0,0,0,0,-1e-06,-1e-06,0,1e-06,-2e-06,0,3e-06,0,-1e-06,0,-2e-06,1e-06,1e-06,1e-06,0,2e-06,-1e-06,0,-6e-06,0,0,0,2e-06,-4e-06,5e-06,-2e-06,2e-06,1.6e-05,-0.000118,-1.1e-05,0.000167,-4e-06,-0.000142,1.2e-05,-2.6e-05,2.8e-05,-9.8e-05,-3.8e-05,-3e-06,-1e-05,-1.4e-05,-1.4e-05,-5e-06,-2e-06,-1.4e-05,8.3e-05,-1.4e-05,-0.000125,-1.7e-05,2e-06,1.6e-05,-9e-06,-3.7e-05,3.3e-05,0.000111,3.2e-05,3.2e-05,-3.6e-05,1.3e-05,-2.3e-05,1e-05,1.8e-05,1.1e-05,1e-06,7e-06,-2e-06,5e-06,1e-06,2e-06,-5e-06,-1e-06,5e-06,-6e-06,-1e-06,-4e-06,-1e-06,4e-06,1e-06,3e-06,4e-06,-7e-06,-1.5e-05,-7e-06,-1e-06,1e-06,1.7e-05,6e-06,-6e-06,-1e-06,6e-06,-1.3e-05,0,2e-06,8e-06,-2e-06,-1e-06,1e-06,3e-06
0,6e-06,1e-06,-2e-05,0,-2e-06,2e-06,2e-06,0,-1e-06,-2e-06,-1e-06,-1e-06,-1e-06,0,3e-06,2e-06,1e-06,-1e-06,0,0,-1e-06,1e-06,1e-06,0,0,1e-06,1e-06,1e-06,2e-06,0,1e-06,0,0,-1e-06,1e-06,-2e-06,0,-1e-06,0,-6e-06,7e-06,0,0,0,-2e-06,5e-06,-8e-06,-3e-06,0,-4e-06,1.3e-05,-3.9e-05,-6.7e-05,-6.3e-05,8.8e-05,2.5e-05,2.2e-05,-2.7e-05,0.000132,4.7e-05,-3e-06,3.5e-05,1.4e-05,1.2e-05,1e-06,-1.7e-05,5e-06,5.4e-05,6e-05,0.000152,1.3e-05,6.6e-05,-1.5e-05,-2.1e-05,-4.4e-05,1e-06,-4e-06,3.4e-05,-1.1e-05,-1.5e-05,-2.7e-05,1.5e-05,-3.5e-05,-1e-06,2.5e-05,-6e-06,8e-06,4e-06,6e-06,2e-06,-5e-06,-8e-06,6e-06,4e-06,0,9e-06,-3e-06,-7e-06,2e-06,1e-06,-4e-06,8e-06,-4e-06,-1.5e-05,7e-06,-8e-06,-2e-06,3.1e-05,-2e-06,2e-06,-3e-06,-7e-06,-1.4e-05,4e-06,0,5e-06,0,-1e-06,0,-3e-06
0,-6e-06,2e-06,3.1e-05,0,4e-06,1e-06,2e-06,1e-06,-1e-06,0,2e-06,-1e-06,0,1e-06,3e-06,-1e-06,-2e-06,0,-2e-06,0,-2e-06,0,0,1e-06,0,3e-06,0,0,-7e-06,0,0,0,-3e-06,6e-06,1e-06,-1e-06,0,0,-2e-06,2e-06,-2e-06,0,0,0,-2e-06,-2e-06,-1.2e-05,1e-06,1e-06,9e-06,7.2e-05,-4.7e-05,-1.7e-05,6.9e-05,-0.000234,-2.3e-05,-9e-06,-1.2e-05,-0.000104,-3.3e-05,-1.1e-05,8e-06,1.8e-05,1.5e-05,-6e-06,-1e-05,-2.6e-05,2.2e-05,-4.9e-05,-0.000146,-7e-06,1.5e-05,6e-06,2e-05,8e-06,-2.1e-05,-2.9e-05,2.3e-05,1.9e-05,5.8e-05,1e-06,2.7e-05,1.7e-05,-9e-06,9e-06,3e-06,0,-9e-06,5e-06,0,5e-06,-7e-06,-2e-06,4e-06,-4e-06,-5e-06,-3e-06,-5e-06,-1.9e-05,-3e-06,1e-06,4e-06,-4e-06,-1.4e-05,-7e-06,-2e-06,-2e-06,1.4e-05,1e-06,6e-06,-1.7e-05,-3e-06,-1.2e-05,4e-06,0,2e-06,0,0,-2e-06,-1e-06
1e-06,-1e-06,2e-06,-2e-05,0,-1e-06,-2e-06,-1e-06,0,0,2e-06,1e-06,0,-1e-06,0,0,-3e-06,-1e-06,0,-1e-06,0,-1e-06,-1e-06,0,0,0,1e-06,-1e-06,0,-3e-06,0,-1e-06,0,-5e-06,-1e-06,0,0,0,0,3e-06,-1e-06,0,0,0,0,1e-06,-2e-06,-1.1e-05,-1e-06,0,-3e-06,7.6e-05,-4.2e-05,3.8e-05,-3.3e-05,9.4e-05,5e-05,-1e-06,-5e-06,6.5e-05,-6e-06,6e-06,1.2e-05,-8.6e-05,-4e-06,-1.3e-05,4e-06,2.6e-05,-2.2e-05,2.2e-05,0.000111,-1e-06,-2.6e-05,1e-06,6e-06,7e-06,2e-06,-2.8e-05,-4.3e-05,1.5e-05,-5.3e-05,-1.6e-05,-1.1e-05,-1.1e-05,-4e-06,2.4e-05,1e-06,-6e-06,1e-05,-3e-06,0,-2e-06,-9e-06,-7e-06,-5e-06,-8e-06,-4e-06,-2e-06,-5e-06,1.3e-05,1e-06,-2e-06,2e-06,-2e-06,-1.5e-05,1e-06,7e-06,-2e-06,1.3e-05,-7e-06,3e-06,-1.2e-05,4e-06,-1.3e-05,1e-06,0,-3e-06,-1e-06,2e-06,0,0
0,5e-06,-3e-06,-3e-06,0,0,-2e-06,0,0,0,1e-06,-3e-06,0,2e-06,-1e-06,-1e-06,-3e-06,0,1e-06,0,0,-1e-06,0,0,0,-1e-06,-3e-06,2e-06,-1e-06,-8e-06,0,1e-06,0,2e-06,-8e-06,0,2e-06,0,-1e-06,2e-06,5e-06,0,0,0,0,1e-06,2e-06,3e-06,4e-06,-2e-06,3e-06,-3.6e-05,-2e-06,-7.1e-05,-5e-05,-9e-06,-7.6e-05,2e-05,1.8e-05,-6.6e-05,3.8e-05,2e-06,-1.4e-05,0.000114,-1.1e-05,1.8e-05,8e-06,1.9e-05,-6.2e-05,-7e-06,-2.4e-05,-1.2e-05,-4.2e-05,-4e-06,-5e-06,-3e-05,8e-06,-7e-06,-2.5e-05,-7e-06,1.5e-05,1.6e-05,1e-06,3.6e-05,4e-06,-2.8e-05,-4e-06,-1.4e-05,-9e-06,2e-06,1e-06,-1e-06,-1e-06,2e-06,-8e-06,-1e-05,5e-06,-1e-06,1e-06,2e-06,1e-06,-1e-06,-1e-05,-1e-06,-1.7e-05,7e-06,5e-06,-6e-06,4e-06,-2e-06,-4e-06,-2.9e-05,1e-06,-1.1e-05,7e-06,-1e-06,-9e-06,0,-2e-06,1e-06,-1e-06
1e-06,-3e-06,-4e-06,1.4e-05,0,-1e-06,0,1e-06,0,1e-06,-1e-06,0,1e-06,1e-06,0,-3e-06,-2e-06,2e-06,1e-06,-1e-06,0,0,0,-1e-06,0,0,-2e-06,-1e-06,2e-06,-2e-06,0,-2e-06,0,-2e-06,5e-06,0,-1e-06,0,0,-2e-06,-5e-06,-2e-06,0,0,0,-3e-06,-1e-06,4e-06,-3e-06,0,4e-06,-8.1e-05,1.7e-05,3.3e-05,5.7e-05,8.3e-05,6.7e-05,-1.9e-05,-4.3e-05,6e-05,-1e-06,-2e-06,-1.3e-05,-6.1e-05,4.1e-05,8e-06,1.1e-05,-3e-06,-6.7e-05,7e-06,-3e-05,1e-06,1e-06,1e-05,-6e-06,3.8e-05,1.5e-05,5e-05,-1.6e-05,4e-06,1.8e-05,9e-06,2.3e-05,-3.8e-05,4e-06,1e-06,4e-06,-1.3e-05,7e-06,2e-06,0,1e-06,1e-06,0,-2e-06,-3e-06,2e-06,0,0,-1.2e-05,0,3e-06,-5e-06,1e-06,-1.6e-05,-9e-06,-5e-06,4e-06,-8e-06,0,-6e-06,-3.2e-05,3e-06,-9e-06,0,-2e-06,-6e-06,-1e-06,0,0,2e-06
0,-3e-06,5e-06,-1.3e-05,0,-2e-06,2e-06,-1e-06,0,0,-2e-06,2e-06,0,-1e-06,1e-06,0,0,0,0,-1e-06,0,0,0,1e-06,0,0,-1e-06,0,-3e-06,3e-06,0,1e-06,0,0,3e-06,-1e-06,-2e-06,0,-1e-06,-1e-06,3e-06,4e-06,-1e-06,0,0,2e-06,0,-4e-06,-2e-06,0,-5e-06,-4.8e-05,1.4e-05,-2.3e-05,-4.8e-05,0.000131,-6.4e-05,6e-06,3.7e-05,-7.2e-05,0,4e-06,1e-05,1.3e-05,-3e-05,-8e-06,0,-2.3e-05,0,3e-06,9.6e-05,-1.7e-05,3.5e-05,-8e-06,1.3e-05,-4.3e-05,-1.7e-05,1e-05,-4e-06,6e-06,-2.4e-05,-3e-06,-2.8e-05,1.7e-05,-5e-06,2.7e-05,-2e-06,-4e-06,-5e-06,-4e-06,0,0,4e-06,2e-06,-2e-06,5e-06,-5e-06,1e-06,0,1e-05,0,1e-06,-3e-06,3e-06,-1.7e-05,1e-06,-7e-06,1.2e-05,-1.2e-05,-6e-06,-2e-06,-1.6e-05,0,-1e-05,4e-06,-1e-06,0,0,0,-1e-06,0
-1e-06,3e-06,3e-06,1e-06,0,2e-06,0,0,0,0,1e-06,0,0,1e-06,0,0,2e-06,-1e-06,0,-1e-06,0,1e-06,0,-1e-06,0,0,1e-06,1e-06,2e-06,2e-06,0,0,0,3e-06,-1e-06,0,0,0,0,0,-3e-06,-6e-06,0,0,0,2e-06,0,6e-06,1e-06,1e-06,6e-06,4.5e-05,2.9e-05,-2.1e-05,-4.7e-05,-0.000165,7.7e-05,1.3e-05,1.2e-05,8.6e-05,2.5e-05,-7e-06,3e-06,6.1e-05,-1.3e-05,-3e-06,-4e-06,0,5.1e-05,-2.1e-05,-0.000107,2e-05,1.1e-05,9e-06,0,-1.8e-05,-7e-06,-3.3e-05,9e-06,-1.8e-05,7e-06,7e-06,-9e-06,-1.7e-05,2e-06,-1.9e-05,-3e-06,7e-06,-3e-06,-3e-06,0,3e-06,3e-06,1e-06,3e-06,-5e-06,1e-06,0,3e-06,-1e-05,-2e-06,-1e-05,8e-06,3e-06,-1.7e-05,3e-06,2e-06,-2e-06,-2.8e-05,4e-06,3e-06,-9e-06,-9e-06,-9e-06,6e-06,-2e-06,4e-06,0,1e-06,0,-2e-06
