-0.005516,-0.005837,-0.004057,-0.003961,-0.003368,-0.003284,-0.002734,-0.002615,-0.004027,-0.005394,-0.003902,-0.002058,-0.001499,-0.001836,-0.002663,-0.004383,-0.003801,-0.001865,-0.002378,-0.002737,-0.00309,-0.002732,-0.002949,-0.002244,-0.002521,-0.001841,-0.001713,-0.001068
0.001198,0.000783,-0.00078,0.000898,0.000915,0.000747,0.00073,0.000628,0.000613,0.00216,0.001782,0.00023,-0.000368,-0.000912,5.9e-05,0.000486,-7.3e-05,0.000252,0.000369,-0.000178,0.000194,-5.6e-05,-0.000791,-0.000892,-0.001105,-0.000754,-0.000541,-0.000263
0.001924,0.001697,0.000842,0.001443,0.00109,0.001133,0.000798,0.000762,0.001362,0.001976,0.001385,0.000652,-0.000169,-2.3e-05,0.000576,0.001132,0.001272,0.000553,0.000777,0.000882,0.001079,0.000797,0.000459,0.00028,0.000395,0.000275,0.000238,0.000145
-0.003573,-0.003501,-0.001287,-0.002353,-0.002253,-0.001824,-0.001737,-0.001771,-0.001908,-0.003744,-0.002942,-0.00102,-0.000919,-0.000387,-0.001288,-0.001912,-0.000863,-0.000919,-0.001193,-0.000613,-0.001147,-0.000705,-3.2e-05,-3.8e-05,0.000228,8.4e-05,0.000128,-4.7e-05
-0.000282,-9e-05,-0.000142,-0.000333,0.000112,0.000244,0.000438,0.000351,0.00071,0.00081,0.00052,2.2e-05,9.6e-05,6.8e-05,0.000335,0.001122,0.000725,0.000238,0.000295,0.000357,0.000235,0.000553,0.001156,0.000529,0.000697,0.000561,0.000896,0.000494
0.002545,0.002266,0.000507,0.001457,0.001712,0.001495,0.001279,0.001544,0.0021,0.003119,0.002228,0.000764,0.000286,1.7e-05,0.001074,0.001732,0.000991,0.000873,0.001231,0.000811,0.001339,0.00095,0.00036,0.000182,8.3e-05,0.000157,0.000309,0.000245
-0.002768,-0.003493,-0.002217,-0.001885,-0.001984,-0.001727,-0.00196,-0.001689,-0.002406,-0.003421,-0.002498,-0.000977,-0.001325,-0.00115,-0.001661,-0.003621,-0.002779,-0.00103,-0.001294,-0.001451,-0.00126,-0.001566,-0.002378,-0.001497,-0.001539,-0.001189,-0.001435,-0.000832
-0.001405,-0.001501,-0.000783,-0.000771,-0.001008,-0.000714,-0.000788,-0.00113,-0.001486,-0.001256,-0.000746,-0.000381,-0.000469,-0.00022,-0.000666,-0.001384,-0.001103,-0.000595,-0.000968,-0.000764,-0.000697,-0.000669,-0.000602,-0.000322,-0.000138,-0.000304,-0.000523,-0.000299
0.004844,0.005555,0.003031,0.003176,0.002932,0.0023,0.002233,0.002111,0.003292,0.004939,0.003538,0.001375,0.001495,0.001661,0.00247,0.004654,0.003594,0.001406,0.001805,0.00184,0.001876,0.001958,0.002345,0.001703,0.001786,0.001254,0.00116,0.00068
0.000893,0.001476,0.00151,0.000525,0.00058,0.000192,0.000236,0.000474,0.000661,-0.000342,-0.000536,-9.7e-05,0.000722,0.001031,0.000728,0.001326,0.001245,0.000376,0.000718,0.000529,-0.000139,0.000294,0.000598,0.000637,0.00043,0.000402,0.000395,0.000176
-0.003804,-0.00362,-0.001158,-0.002428,-0.002177,-0.001619,-0.001192,-0.001552,-0.002779,-0.004068,-0.002902,-0.001199,-0.000251,-0.000336,-0.001717,-0.003142,-0.002708,-0.001222,-0.001559,-0.001437,-0.001896,-0.001521,-0.000995,-7e-04,-0.000905,-0.000643,-0.000395,-0.000196
0.001378,0.001469,0.000578,0.000664,0.000627,0.000791,0.001121,0.000771,0.000581,0.002174,0.001978,0.000865,0.000579,-6.8e-05,0.000147,0.000213,-0.000314,5.1e-05,-8.3e-05,0.000278,0.000966,0.000222,0.000137,-3.1e-05,-1.9e-05,8.6e-05,0.000147,0.000177
0.002556,0.002333,7e-04,0.001272,0.001105,0.000661,0.000404,0.000955,0.001251,0.001621,0.001462,0.0011,0.000299,-0.000256,0.000629,0.00105,0.001329,0.000712,0.000889,0.00089,0.001386,0.000582,-0.000447,-0.000197,-0.000257,8.4e-05,-0.000289,-0.000233
-0.003273,-0.003797,-0.002153,-0.002194,-0.001865,-0.001613,-0.00167,-0.001371,-0.001971,-0.003783,-0.002756,-0.000971,-0.000878,-0.001023,-0.001259,-0.001977,-0.000949,-0.000542,-0.000707,-0.001043,-0.001645,-0.000919,-0.001129,-0.000877,-0.000891,-0.000548,-0.000668,-0.000518
-0.001661,-0.00184,-0.001181,-0.000684,-0.000304,-0.000144,0.000221,-0.000155,0.000193,0.000534,8.2e-05,-0.000532,-0.000241,-0.00011,-0.000103,0.00041,-9.3e-05,-0.000157,-0.000292,-0.000363,-0.00067,0.000208,0.001153,0.000519,0.000736,0.000231,0.000588,0.000421
0.003253,0.00338,0.002011,0.002858,0.002325,0.00175,0.001439,0.001533,0.002874,0.004095,0.002527,0.00097,0.000661,0.001193,0.001674,0.002732,0.001858,0.000989,0.001355,0.001566,0.002012,0.001475,0.001736,0.001309,0.001365,0.000681,0.000831,0.000638
-0.000231,-0.000447,0.000284,7.9e-05,-0.00031,-6.7e-05,-0.000825,-0.000684,-0.001154,-0.00219,-0.001548,-0.000188,-0.000514,-0.000193,-0.000582,-0.001881,-0.000931,-0.000232,-0.000193,-0.000157,-3.6e-05,-0.000517,-0.000983,-0.000491,-0.000661,-0.000527,-0.000604,-0.000364
-0.002633,-0.002767,-0.001852,-0.002274,-0.001797,-0.001203,-0.001023,-0.001312,-0.002522,-0.002849,-0.001714,-0.001033,-0.000945,-0.001312,-0.001527,-0.00257,-0.002128,-0.001003,-0.001438,-0.001629,-0.001743,-0.001376,-0.001311,-0.001151,-0.001131,-0.00067,-0.000655,-0.000446
0.001743,0.002082,0.000419,0.001008,0.000891,8.3e-05,0.000635,0.000995,0.001791,0.003221,0.002216,0.000269,0.000178,-2.9e-05,0.00098,0.002599,0.001447,0.000432,0.000475,0.000317,0.000551,0.000525,0.000442,0.000269,0.000471,0.000486,0.000288,0.000158
