4e-06,5.8e-05,9e-06,7.2e-05,1.3e-05,1.2e-05,3.3e-05,4e-06,3.3e-05,1.5e-05,1.6e-05,2e-05,2e-06,1.5e-05,1.9e-05,1.4e-05,2e-05,8e-06,7e-06,1.8e-05,1.1e-05,2.8e-05,4e-06,8e-06,9e-06,2.7e-05,9e-06,1.8e-05,3e-06,2.8e-05,1.2e-05,9e-06,2.1e-05,5e-06,2.2e-05,9e-06,1.3e-05,2e-06,1.2e-05,8e-06,9e-06,1.5e-05,0.000191,0.000317,3.8e-05,3.4e-05,6e-06,7.7e-05,6.6e-05,2.4e-05,0.000629,2e-05,0.000171,5.2e-05,0.000351,7.9e-05,0.001003,0.00029,0.000258,8.6e-05,0.00053,0.000253,0.00043,0.000809,0.000363,4.4e-05,0.000503,0.00057,0.000153,0.000392,9.3e-05,0.000532,7.6e-05,8e-05,0.000121,0.00049,2.1e-05,0.000375,0.000263,0.000188,0.000428,0.000192,0.000368,0.000324,0.000188,2.1e-05,4.2e-05,6.4e-05,5.8e-05,0.000177,9.8e-05,0.000197,9.2e-05,0.000137,0.000196,6.3e-05,4.7e-05,0.000114,0.000193,0.000102,1.8e-05,3.2e-05,5.1e-05,3.8e-05,6.3e-05,6.2e-05,0.000141,0.000115,0.000126,0.000237,6.8e-05,0.000178,9.6e-05,5.9e-05,1.8e-05,4e-06,4.2e-05,5.8e-05,4.3e-05,2.3e-05,1.3e-05
2.4e-05,8.8e-05,9e-05,0.000121,0.000112,0.000101,1.5e-05,5.4e-05,6e-05,2.8e-05,3.1e-05,2.2e-05,2.4e-05,1.4e-05,6.5e-05,3.4e-05,5.2e-05,8e-05,4.6e-05,1.4e-05,4.2e-05,2.5e-05,2e-05,1.9e-05,2.2e-05,3.4e-05,8.2e-05,8.4e-05,4.7e-05,4e-05,8.1e-05,7.3e-05,9.8e-05,6.7e-05,9e-06,1.6e-05,4.9e-05,2.4e-05,5.2e-05,3.7e-05,6.4e-05,6.2e-05,0.00032,0.000761,5.8e-05,6e-06,5.1e-05,0.000109,0.000202,0.000243,0.001264,0.000214,0.000323,0.000263,0.00075,0.000446,0.001508,0.002156,0.001786,0.001332,0.001129,0.002561,0.002089,0.003064,0.001716,0.001239,0.001219,0.00191,0.001265,0.001575,0.001298,0.000506,0.000266,0.00049,0.000112,0.001622,0.00058,0.001158,0.001082,0.001055,0.001717,0.000256,0.000766,0.000892,0.000412,0.000601,0.000207,0.000186,0.000233,0.000502,0.00024,0.000254,0.000306,0.000177,0.000464,0.000409,0.000352,0.000171,0.000329,2.3e-05,0.000206,8.8e-05,9.4e-05,0.00021,6.3e-05,0.000132,0.000809,0.000975,0.000733,0.000168,0.000363,0.000636,0.000616,0.000271,1.9e-05,7.5e-05,0.000127,9.8e-05,0.000163,0.000111,5.5e-05
2.1e-05,6.4e-05,1.1e-05,1.9e-05,4.6e-05,6e-05,5.8e-05,2.2e-05,7e-06,1.5e-05,2.7e-05,1.4e-05,1.6e-05,2.3e-05,4.3e-05,9e-06,8e-06,5.3e-05,2.1e-05,3.3e-05,2.2e-05,6.9e-05,5.8e-05,2.5e-05,3.5e-05,7e-06,7.3e-05,2.6e-05,3.5e-05,2.6e-05,3.9e-05,3.5e-05,5.8e-05,4.8e-05,2.7e-05,4.7e-05,6.4e-05,4e-05,4.6e-05,6.9e-05,4.4e-05,1.5e-05,0.000296,0.000822,0.000569,0.000169,2.2e-05,0.000111,0.000463,0.000272,0.001244,0.000415,0.000885,0.000802,0.000731,0.000712,0.001253,0.003198,0.001636,0.000873,0.00168,0.002139,0.001634,0.001969,0.000652,0.002648,0.00264,0.001092,0.001836,0.000351,0.00082,0.001374,0.000742,0.000502,0.000567,0.001846,0.00148,0.001957,0.000695,0.000284,0.001209,0.001355,0.000376,0.001227,0.000853,0.000117,0.00017,0.000615,0.000624,0.000731,0.001018,0.000453,0.000532,0.000111,0.000529,0.001045,0.000307,0.000191,0.000123,0.000246,0.000356,0.00015,0.000131,0.000293,0.00024,2.7e-05,0.001117,9e-04,0.000361,0.000139,0.000325,0.000729,0.000434,0.000207,5e-05,0.000103,4.8e-05,2.6e-05,6.8e-05,9e-06,1.6e-05
3.2e-05,5.3e-05,9.2e-05,6.7e-05,5e-05,8.7e-05,5.3e-05,6.8e-05,3.8e-05,3.7e-05,4.8e-05,2.5e-05,4.6e-05,4.1e-05,4.8e-05,5.4e-05,4.6e-05,3.2e-05,7.3e-05,6.4e-05,4.9e-05,7.3e-05,6e-05,3.2e-05,5.5e-05,5.1e-05,3.1e-05,6e-05,6.1e-05,7e-05,5.5e-05,2.8e-05,6.2e-05,5.9e-05,5.7e-05,5.7e-05,7e-05,3.7e-05,6.6e-05,3.6e-05,7.1e-05,6.8e-05,0.000454,0.000363,0.000369,0.000376,0.000201,7.2e-05,0.000444,0.00089,0.000877,0.000276,0.000793,0.000678,0.000741,0.000207,0.001001,0.001943,0.000971,0.000418,0.001923,0.000392,0.003515,0.001722,0.000244,0.002117,0.00134,0.001835,0.00088,0.000648,0.000501,0.001174,0.000306,0.000894,0.000347,0.00064,0.000958,0.000657,0.001125,0.001232,0.000729,0.000392,0.000233,0.000345,0.000731,0.00022,3e-05,0.000657,0.001117,0.000604,0.00084,0.000508,0.000336,0.000395,0.000661,0.000775,0.000589,0.000164,0.00046,0.000178,0.000263,0.000287,8e-05,0.000193,0.000109,0.000258,0.00114,0.000474,0.00037,0.000311,0.000196,0.001069,0.000633,0.00035,0.000226,0.00012,0.000141,9.5e-05,3.6e-05,3.3e-05,1.8e-05
2.4e-05,2e-05,4.8e-05,2.9e-05,3e-05,3.1e-05,4e-06,3.2e-05,1.2e-05,1.6e-05,2.4e-05,2e-06,4.6e-05,1.3e-05,2e-05,4.2e-05,6e-06,1.9e-05,5.7e-05,1.3e-05,2.7e-05,3.7e-05,2.3e-05,1.5e-05,2.8e-05,2.4e-05,1.3e-05,1.8e-05,2e-05,3.2e-05,2e-05,2.3e-05,3.5e-05,3.3e-05,6e-06,1.8e-05,2.6e-05,8e-06,4e-05,5.1e-05,6.3e-05,1.9e-05,0.000584,0.000327,0.000195,0.000302,6.1e-05,7.9e-05,0.000108,0.000672,0.002197,0.000358,0.000754,6.9e-05,0.000609,0.000228,0.000851,0.002054,0.00102,0.00233,0.003141,0.00146,0.003236,0.000655,0.000764,0.001471,0.000923,0.002855,0.001214,0.000787,0.000326,0.000486,0.000843,0.001813,0.001491,0.000894,0.001431,0.002651,0.001127,0.000798,0.000213,0.001155,0.00038,0.000698,0.000943,0.00118,0.000921,0.000804,0.00074,0.000754,0.00074,0.000617,0.000295,0.000598,0.000315,0.000221,0.000273,0.000103,0.000511,7.3e-05,6.1e-05,0.000245,0.000288,0.000123,9.2e-05,0.00023,0.001187,0.00086,0.000571,0.000354,0.000228,0.001142,0.00046,0.000148,7.6e-05,2.5e-05,0.000108,1.7e-05,3.1e-05,3.4e-05,9e-06
4.9e-05,4.8e-05,4.3e-05,5.1e-05,1.1e-05,2.3e-05,3.2e-05,1e-05,1.6e-05,2e-06,2.8e-05,3e-05,3.5e-05,5.7e-05,5e-05,2.8e-05,2e-05,2.7e-05,4.2e-05,2.1e-05,2.1e-05,3.1e-05,2.1e-05,3.2e-05,4.7e-05,2.4e-05,3.7e-05,2.8e-05,2.4e-05,2.2e-05,2.1e-05,3e-05,1.1e-05,1.8e-05,1e-05,2e-05,1.2e-05,2.1e-05,1.4e-05,0.000115,6.2e-05,1.8e-05,0.000755,0.001188,0.000314,0.000276,0.000264,0.000179,0.000348,0.000839,0.002246,0.001065,0.001011,0.000511,0.000364,0.000393,0.000338,0.002631,0.001335,0.003298,0.002136,0.004531,0.001003,0.001893,0.001096,0.003551,0.001119,0.003717,0.001751,0.000601,0.000341,0.001717,0.000867,0.00103,0.000205,0.001879,0.000343,0.001875,0.001899,0.001054,0.001076,0.000649,0.000177,0.000878,0.000657,0.000459,0.00076,0.000711,0.000871,0.00052,0.000533,0.000429,0.000671,0.000636,0.000733,0.001031,0.000915,0.000451,0.000537,0.000223,0.000277,0.000368,0.000128,4.4e-05,6.2e-05,0.000194,0.001119,0.000182,8.8e-05,0.000379,0.000351,0.001163,0.000589,0.000215,8.2e-05,8.4e-05,0.000112,7.4e-05,4.4e-05,2.8e-05,2.2e-05
4.9e-05,2.1e-05,2.4e-05,3.3e-05,1.4e-05,3.5e-05,5.9e-05,5.1e-05,2.8e-05,1.1e-05,2.6e-05,3.8e-05,5.2e-05,4.1e-05,4.4e-05,2.1e-05,2e-05,2.1e-05,2.8e-05,2.3e-05,1.6e-05,2.7e-05,3.1e-05,3.3e-05,4.6e-05,3.3e-05,6.2e-05,4.9e-05,4.2e-05,3.4e-05,8e-06,1.6e-05,2.6e-05,2.3e-05,3.1e-05,1.7e-05,4e-05,4e-05,5.6e-05,0.000178,7.1e-05,1.9e-05,0.000847,0.000922,0.000349,0.000235,0.000289,0.000452,0.000435,0.001414,0.00331,0.000427,0.000497,0.000113,0.000297,0.000207,0.000806,0.002757,0.001557,0.003007,0.002337,0.008444,0.004765,0.002017,0.002231,0.006612,0.003779,0.005277,0.003401,0.001143,0.000253,0.002465,0.001002,0.000672,0.001504,0.001989,0.002981,0.000716,0.002048,0.001715,0.002767,0.001615,0.000918,0.00296,0.001505,0.000239,0.000957,0.00093,0.000552,0.001168,0.000671,0.000458,0.000558,0.001054,0.001044,0.000765,0.00062,0.000221,0.00053,0.000735,0.000341,0.000213,0.000105,9.7e-05,6.3e-05,0.000112,0.001301,0.001021,0.000744,0.00011,7.3e-05,0.001552,0.00093,0.000484,0.000275,0.000166,0.000141,5.2e-05,3e-05,9e-06,2.3e-05
1.4e-05,2.8e-05,4.7e-05,1e-05,2.7e-05,1.2e-05,3.6e-05,1.8e-05,1.8e-05,2.4e-05,3.2e-05,3.4e-05,3e-05,1.5e-05,4.5e-05,3.6e-05,1.4e-05,1.9e-05,5.2e-05,2.9e-05,2.6e-05,2.9e-05,2.6e-05,2.8e-05,7.5e-05,4.5e-05,2.1e-05,4.6e-05,3.9e-05,3e-05,8e-06,1e-05,2.4e-05,2.3e-05,4e-05,3.3e-05,5.1e-05,2.1e-05,4.9e-05,0.000165,5.8e-05,3e-06,9e-04,0.001726,0.000681,0.000397,0.000214,0.00024,0.000139,0.001206,0.005578,0.004347,0.001415,0.000589,0.000406,0.00051,0.001134,0.00191,0.00153,0.001695,0.003219,0.014336,0.014871,0.008766,0.000419,0.005703,0.008249,0.005113,0.001828,0.00166,0.000543,0.00247,0.002805,0.002861,0.000855,0.003795,0.008668,0.007212,0.002945,0.001068,0.003632,0.001584,0.001118,0.003426,0.002801,0.002321,0.00187,0.000629,0.001205,0.000309,0.001539,0.001388,0.000392,0.000456,0.000281,0.000619,0.000754,0.000579,0.000153,0.001101,0.000385,0.000247,0.00024,0.000345,0.000157,0.000116,0.001177,0.001435,0.00032,0.000588,0.000423,0.001457,0.001244,0.000421,0.000224,3.4e-05,5.6e-05,4.9e-05,5.5e-05,2.7e-05,1.4e-05
1.5e-05,3.6e-05,3e-05,3.3e-05,5.6e-05,3.1e-05,8e-06,1.4e-05,1.6e-05,2.8e-05,5.2e-05,1.7e-05,2.3e-05,4e-05,2.8e-05,1.2e-05,2.6e-05,2.5e-05,2.3e-05,3e-05,1.5e-05,4e-05,3.1e-05,4.5e-05,4.7e-05,2.8e-05,1.6e-05,2.1e-05,1.7e-05,2.3e-05,1.6e-05,2.5e-05,4e-06,2.5e-05,2.7e-05,1.1e-05,1.7e-05,3e-05,2.5e-05,0.000177,0.000236,0.000114,0.000935,0.003679,0.002929,0.001169,0.000448,0.000207,0.000326,0.001119,0.003979,0.00508,0.003277,0.00156,0.000575,0.000729,0.000655,0.002248,0.000684,0.001249,0.005604,0.012973,0.004271,0.002423,0.005793,0.010624,0.008028,0.003321,0.000701,0.000522,0.001349,0.002072,0.00122,0.001821,0.003185,0.003337,0.006361,0.002969,0.002818,0.0023,0.001937,0.001098,0.00078,0.003398,0.000785,0.000549,0.000291,0.000373,0.000637,0.000715,0.001765,0.001309,0.000666,0.001007,0.000516,0.000194,0.000612,0.000881,0.000525,0.001187,0.001092,0.000777,0.000425,0.000182,0.000218,0.000189,0.001072,0.000886,0.001722,0.001047,0.000474,0.000955,0.000726,0.00043,0.000307,0.000162,0.000123,7.2e-05,5.1e-05,8.8e-05,4e-05
2.8e-05,1.4e-05,1.4e-05,7e-06,2.6e-05,1.8e-05,8e-06,8e-06,1e-05,1.1e-05,3.6e-05,2e-05,1.7e-05,2.2e-05,2.3e-05,3.2e-05,2.1e-05,1.9e-05,2.2e-05,2.4e-05,1.4e-05,2.2e-05,1.5e-05,3.6e-05,2.5e-05,2.6e-05,2.5e-05,7e-06,2.1e-05,4.5e-05,5e-05,2.3e-05,1.1e-05,1.6e-05,1.5e-05,1.3e-05,2e-05,1.9e-05,3e-05,0.000107,0.000187,0.000132,0.000836,0.003391,0.002565,0.00128,0.000527,0.000222,0.000283,0.001195,0.00182,0.002174,0.000596,0.000322,0.000233,0.000436,0.000345,0.001512,0.00135,0.000299,0.003421,0.006239,0.00322,0.000641,0.003255,0.004609,0.002048,0.002422,0.001226,0.001072,0.001353,0.001477,0.001302,0.000935,0.001887,0.000106,0.004183,0.000649,0.001476,0.001018,0.001825,0.002614,0.0022,0.001614,0.001514,0.00071,0.000538,0.000189,0.000202,0.000715,0.00125,0.000775,0.000383,0.000698,0.000208,0.000174,0.000583,0.000203,0.000419,0.000919,0.000293,0.000132,0.00032,4.4e-05,0.000143,0.000125,0.000747,0.000224,0.001419,0.000891,0.000217,0.000975,0.000605,0.000292,8.7e-05,0.000123,3.6e-05,7e-05,5.3e-05,6.5e-05,5e-05
2.1e-05,1.9e-05,4e-06,1.2e-05,5e-06,1.6e-05,1e-05,1.6e-05,2e-06,1.2e-05,2.8e-05,1.7e-05,2.3e-05,1e-05,2e-05,9e-06,6e-06,9e-06,1.1e-05,1.6e-05,8e-06,9e-06,3e-06,2.3e-05,1.3e-05,1e-06,1.2e-05,5e-06,1.4e-05,3e-05,3.2e-05,1.5e-05,1.3e-05,1.2e-05,2e-05,1.4e-05,1.3e-05,2.1e-05,3.4e-05,5.9e-05,8.9e-05,4.6e-05,0.000698,0.001792,0.000676,0.000262,0.000358,0.000164,0.000544,0.000945,0.003471,0.001448,0.000439,0.000234,0.000493,0.000438,0.000513,0.00091,0.000478,0.000735,0.000529,0.002003,0.000162,6e-04,0.002442,0.002492,0.002559,0.002374,0.000785,0.001263,0.001252,0.001042,0.001379,0.000819,0.00312,0.001788,0.003114,0.001361,0.000661,0.000939,0.001268,0.001978,0.000448,0.000648,0.000626,0.000452,0.000582,0.000272,0.000238,0.000681,3e-04,0.000498,9.6e-05,0.000182,0.000435,0.00017,0.000313,8.6e-05,0.000442,0.000146,0.000215,8.6e-05,0.000144,0.000111,4.8e-05,0.000249,0.000689,0.000205,0.001355,0.000364,0.000303,0.000715,3e-04,0.000171,0.00011,0.000104,0.00011,0.000131,6.8e-05,5.8e-05,8.4e-05
5e-06,1.7e-05,1.4e-05,4e-06,1.5e-05,1.8e-05,5e-06,1.5e-05,1.6e-05,1.7e-05,1.4e-05,1.2e-05,1.2e-05,1.2e-05,1.8e-05,1e-05,6e-06,7e-06,1.5e-05,1.1e-05,7e-06,1.3e-05,7e-06,1.2e-05,1.1e-05,4e-06,6e-06,8e-06,1.1e-05,5e-06,1.1e-05,1e-05,1.5e-05,5e-06,2.1e-05,4e-06,6e-06,1.8e-05,1.3e-05,0.000133,7.4e-05,6e-05,0.000602,0.001186,0.000388,9.8e-05,0.000243,0.000176,0.00045,0.000464,0.003568,0.002864,0.001417,0.000319,0.000431,0.000498,0.000759,0.001439,0.001015,0.001383,0.003318,0.002687,0.001803,0.001075,0.00192,0.002137,0.000987,0.003112,0.002138,0.00118,0.000741,0.000106,0.000346,0.000591,0.003803,0.001247,0.003118,0.002122,0.000411,0.002304,0.000466,0.000903,0.000364,0.000637,0.000585,0.000275,0.000407,0.000292,0.000383,0.001093,0.000799,0.00031,0.000322,0.000216,0.000371,7.7e-05,0.000296,0.000116,0.000536,0.000372,0.000223,0.00016,0.000313,0.000105,0.000102,0.000226,0.000236,0.000213,0.001261,0.001036,0.000733,0.000803,0.000151,7.9e-05,0.000181,8e-05,3.8e-05,6.9e-05,2.4e-05,5e-05,5.4e-05
9e-06,3e-06,7e-06,1.1e-05,3e-06,3e-06,1e-06,8e-06,1.4e-05,5e-06,4e-06,1e-06,9e-06,4e-06,4e-06,1e-05,1.1e-05,9e-06,1.1e-05,6e-06,7e-06,1.8e-05,8e-06,5e-06,2e-06,7e-06,5e-06,4e-06,1e-05,1.5e-05,1.9e-05,4e-06,1e-05,7e-06,1.1e-05,1.6e-05,1.9e-05,1.4e-05,1.5e-05,0.000124,2.9e-05,6e-06,0.000546,0.00101,0.000604,0.000286,7.1e-05,0.000105,0.000268,0.00111,0.002091,0.000974,0.000494,0.000338,0.000521,0.000557,0.000525,0.001674,0.000364,0.001714,0.003666,0.0028,0.001432,0.001163,0.002126,0.001051,0.001641,0.002413,0.000435,0.000372,0.001531,0.001013,0.00144,0.000787,0.003572,0.001448,0.001924,0.00046,0.001787,0.001866,0.000267,0.002016,0.000337,0.000701,0.000737,0.000304,0.000673,0.000328,0.000388,0.001296,0.000557,0.000356,0.000511,0.000342,0.000408,0.000233,0.000331,0.000181,0.000422,0.000143,0.000419,0.000391,0.000189,3.3e-05,0.000105,0.000294,6e-04,0.000445,0.000664,0.000104,0.000307,0.000106,0.000175,8.1e-05,0.000133,3.8e-05,5.1e-05,2.4e-05,7e-06,2.9e-05,3.1e-05
6e-06,7e-06,5e-06,7e-06,4e-06,8e-06,6e-06,1e-06,8e-06,6e-06,5e-06,2e-06,1.2e-05,2e-06,1e-06,9e-06,1e-05,9e-06,1e-06,2e-06,1.1e-05,2e-05,3e-06,1e-05,4e-06,8e-06,3e-06,5e-06,7e-06,1.1e-05,1.6e-05,3e-06,8e-06,6e-06,1.1e-05,1.5e-05,6e-06,2.9e-05,1.3e-05,4.7e-05,4.1e-05,2.7e-05,0.000457,0.000723,0.000356,0.000196,5.4e-05,0.000203,0.00016,0.000888,0.001593,0.000561,0.000347,0.000234,3.1e-05,0.000164,0.000353,0.002262,0.001267,0.001115,0.000488,0.00213,0.002606,0.000893,0.003326,0.00139,0.001834,0.002744,0.002162,0.002143,0.001191,0.002824,0.000725,0.003181,0.005538,0.003905,0.001502,0.000899,0.001771,0.001162,0.003126,0.002451,0.002019,0.001608,0.000805,0.001079,7e-04,0.000495,0.000769,0.001859,0.000781,0.000206,0.00091,0.000362,0.000585,0.000156,0.000448,0.000481,0.000166,0.000306,0.000259,0.000367,0.000405,3.2e-05,7.2e-05,0.000246,0.000412,6.9e-05,0.000184,0.000374,3.4e-05,0.000254,7.3e-05,8.7e-05,4.7e-05,6.8e-05,1.2e-05,2.3e-05,1.1e-05,4.9e-05,2.8e-05
7e-06,1.9e-05,1.5e-05,1.5e-05,1.3e-05,2e-05,1.4e-05,7e-06,9e-06,7e-06,5e-06,9e-06,1.1e-05,1.6e-05,6e-06,3e-06,6e-06,2e-06,6e-06,4e-06,1e-05,1e-05,3e-06,1e-05,2e-05,1.1e-05,1.3e-05,6e-06,8e-06,1.7e-05,1.8e-05,1.8e-05,2e-05,1.5e-05,1.5e-05,7e-06,4e-06,2.5e-05,2.2e-05,5.3e-05,3.6e-05,2.7e-05,0.00035,0.000645,0.00029,0.00015,3.9e-05,0.000226,0.000303,0.000777,0.001532,0.000641,0.000333,0.000205,0.000209,0.000286,3e-04,0.001659,0.001923,0.004365,0.002053,0.001462,0.003528,0.00301,0.00214,0.002994,0.000807,0.006919,0.002383,0.003275,0.003467,0.004709,0.001681,0.004155,0.003776,0.001461,0.004274,0.001831,0.001029,0.003953,0.002412,0.003606,0.003171,0.003773,0.001276,0.000136,0.001069,0.001131,0.001287,0.002395,0.001286,7e-04,0.001266,0.00035,0.000896,0.000317,0.001349,0.000482,0.000691,0.000994,0.000636,0.000386,0.000678,0.000309,0.000211,0.000137,0.000173,0.000325,0.000161,0.000614,0.00039,0.000226,4.2e-05,6.3e-05,0.000116,7e-05,8e-05,7.5e-05,5.5e-05,9.9e-05,4.7e-05
1e-06,1.5e-05,1.6e-05,5e-06,3e-06,1.6e-05,1.2e-05,5e-06,1e-06,3e-06,1.1e-05,4e-06,1.1e-05,1.8e-05,9e-06,3e-06,1.1e-05,1.3e-05,1e-05,4e-06,6e-06,2.6e-05,1.6e-05,1.1e-05,2.5e-05,1.6e-05,1.4e-05,1.3e-05,6e-06,1.1e-05,1.5e-05,1.3e-05,1.5e-05,1.2e-05,3e-06,2e-06,1.7e-05,2.7e-05,1.6e-05,9.7e-05,1.8e-05,2.4e-05,0.000298,0.000614,0.000344,2e-04,0.000131,0.000248,0.000222,0.000923,0.001228,0.000613,0.000317,0.000192,0.000502,0.000286,5.4e-05,0.003181,0.002949,0.00868,0.011188,0.00584,0.005812,0.009271,0.003788,0.00419,0.004462,0.009225,0.009424,0.00389,0.002337,0.005234,0.00861,0.008162,0.007974,0.005765,0.004385,0.006055,0.002068,0.006218,0.00463,0.006531,0.003321,0.002242,0.002462,0.000861,0.002944,0.001029,0.00091,0.003927,0.00242,0.001816,0.002274,0.001945,0.002999,0.000592,0.002293,0.002218,0.002168,0.000292,0.000785,0.001131,0.000809,0.000803,0.000399,0.000256,0.00019,0.000281,0.000671,0.000383,0.00034,0.000182,0.000115,0.000106,8.3e-05,6.4e-05,9.3e-05,0.000109,4.3e-05,6.5e-05,4.4e-05
1.8e-05,1.6e-05,2e-05,1.7e-05,1.4e-05,1.8e-05,2e-05,1.3e-05,1e-05,9e-06,1e-05,6e-06,1.3e-05,8e-06,1.5e-05,9e-06,9e-06,1e-05,6e-06,3e-06,7e-06,2.3e-05,2.9e-05,7e-06,1.4e-05,1.4e-05,1e-05,5e-06,1.7e-05,2.8e-05,4.2e-05,2.6e-05,2.3e-05,8e-06,7e-06,1.4e-05,1.7e-05,6e-06,4.1e-05,6.8e-05,6.4e-05,2.7e-05,0.000177,0.000747,0.000697,0.000267,0.000104,0.000346,0.000896,0.000998,0.001797,0.001576,0.000809,0.000534,0.000338,0.000197,0.000293,0.005254,0.006897,0.00434,0.006652,0.003814,0.006981,0.010387,0.009277,0.000574,0.005215,0.004517,0.007932,0.012328,0.013874,0.011963,0.012625,0.003811,0.005333,0.009502,0.007465,0.009794,0.008146,0.01086,0.006865,0.009021,0.011128,0.007759,0.004127,0.003591,0.004859,0.005883,0.004735,0.004437,0.005707,0.004629,0.001386,0.00501,0.001337,0.002793,0.001013,0.001835,0.001301,0.001035,0.001396,0.000977,0.001726,0.001363,0.000487,0.000145,0.000409,0.000133,0.000483,0.000906,0.001117,0.00065,0.000268,7.5e-05,1.5e-05,4.8e-05,5.7e-05,7.6e-05,1.5e-05,7.2e-05,6.1e-05
2.9e-05,2.2e-05,1.5e-05,2.6e-05,4.3e-05,2e-05,2.2e-05,1.1e-05,1.6e-05,9e-06,8e-06,1.1e-05,1.5e-05,1.8e-05,2.6e-05,2.1e-05,5e-06,1.6e-05,6e-06,2e-06,1.2e-05,1e-05,1.3e-05,2.2e-05,2.5e-05,1.7e-05,9e-06,8e-06,1.6e-05,2.1e-05,1e-05,1.5e-05,2.1e-05,1.2e-05,1.6e-05,3.1e-05,3.9e-05,2.8e-05,5e-05,6.1e-05,6.1e-05,4.7e-05,7.3e-05,0.000879,0.000688,0.000267,5.3e-05,0.000453,0.000779,0.000632,0.000733,0.001409,0.000327,0.000376,0.00038,0.000236,0.00086,0.006095,0.007982,0.008879,0.005053,0.001715,0.005977,0.001262,0.006122,0.008564,0.009057,0.004009,0.006051,0.003208,0.006074,0.005978,0.004549,0.007038,0.006413,0.005197,0.005511,0.005466,0.001462,0.004006,0.00731,0.001823,0.007164,0.003603,0.001473,0.001716,0.003015,0.004773,0.002763,0.002004,0.004567,0.00546,0.00601,0.00549,0.007004,0.004059,0.003742,0.001671,0.000951,0.00074,0.000682,0.00103,0.000995,0.000154,0.000225,8.3e-05,0.000379,0.000191,0.000269,0.000537,0.00101,0.000578,0.000204,5.3e-05,3.4e-05,0.000123,7.4e-05,0.000127,5.2e-05,5.5e-05,4.1e-05
1.5e-05,1.3e-05,1.7e-05,2e-06,2.5e-05,2e-05,1e-06,3e-06,1.5e-05,6e-06,1.8e-05,4e-06,1.3e-05,2e-06,1.6e-05,1.2e-05,1.4e-05,8e-06,1e-05,8e-06,4e-06,9e-06,1.6e-05,4e-06,1.8e-05,1.2e-05,1.1e-05,5e-06,5e-06,2.7e-05,1.7e-05,1.6e-05,1.1e-05,6e-06,1.6e-05,9e-06,1.6e-05,1e-05,1.7e-05,3e-05,3.7e-05,2.3e-05,3.8e-05,0.000977,0.000579,0.000307,8.1e-05,0.000329,0.000156,0.000765,0.000571,0.001817,0.00152,0.000704,0.000242,0.000375,0.000777,0.004011,0.003712,0.001127,0.00255,0.002482,0.004742,0.004112,0.002575,0.005056,0.002981,0.001544,0.003916,0.002712,0.00252,0.00083,0.002507,0.005342,0.003711,0.003738,0.00353,0.003357,0.005824,0.004956,0.004853,0.005164,0.001739,0.004116,0.0035,0.000993,0.004056,0.000418,0.001956,0.002814,0.002239,0.003978,0.002432,0.002936,0.004361,0.002221,0.002218,0.000647,0.000593,0.000476,0.00066,0.000375,0.000114,0.000153,0.00012,0.000126,0.000475,0.000123,0.00028,0.000667,0.000281,0.000289,9.2e-05,2.2e-05,3.2e-05,0.000118,9.6e-05,3.8e-05,7.7e-05,2.3e-05,5.8e-05
2e-05,5e-06,4e-06,1e-05,6e-06,9e-06,6e-06,4e-06,2.1e-05,1.7e-05,1.1e-05,1.4e-05,1.3e-05,7e-06,4e-06,7e-06,3e-06,4e-06,6e-06,5e-06,1.5e-05,8e-06,8e-06,0,2e-05,8e-06,6e-06,6e-06,6e-06,2.1e-05,4e-06,1.1e-05,8e-06,1e-05,1.3e-05,1e-05,2.4e-05,1.4e-05,5e-06,6.1e-05,4.2e-05,4e-05,4.9e-05,0.000809,9.8e-05,3.3e-05,7.5e-05,0.000215,9.8e-05,0.000734,0.001211,0.00228,0.000675,0.000217,0.000193,0.000446,0.000315,0.002206,0.004625,0.003944,0.002708,0.000964,0.000787,0.002118,0.002523,0.000491,0.002886,0.004253,0.002903,0.003209,0.001766,0.00237,0.002777,0.003244,0.001022,7.6e-05,0.001733,0.001246,0.005892,0.002954,0.005005,0.000803,0.002934,0.002918,0.002546,0.002722,0.004939,0.003563,0.002933,0.002007,0.001326,0.002207,0.002034,0.000355,0.002166,0.001594,0.000748,0.000803,0.001111,0.000321,0.000247,0.000393,0.000145,0.00018,0.000152,0.000126,0.000281,0.000263,0.000185,0.000566,0.000318,8.9e-05,5.4e-05,7e-05,6.2e-05,7.5e-05,4.6e-05,3.8e-05,7.2e-05,6.8e-05,9.5e-05
1e-05,6e-06,1.2e-05,2.1e-05,1.9e-05,2e-06,4e-06,5e-06,1.3e-05,1.1e-05,1.4e-05,1.3e-05,1.4e-05,1.1e-05,1.1e-05,9e-06,7e-06,5e-06,8e-06,4e-06,1.3e-05,8e-06,2e-06,1e-05,1.6e-05,8e-06,8e-06,1.1e-05,9e-06,1.1e-05,1.5e-05,2e-06,1.3e-05,2e-06,1.1e-05,4e-06,1.8e-05,1.5e-05,5e-06,6.8e-05,2.6e-05,1.7e-05,8.2e-05,0.000702,0.000588,0.000366,0.000227,0.000234,0.000388,0.000385,0.000714,0.001348,0.000848,0.000472,0.00022,0.000317,0.000423,0.000612,0.00277,0.000628,0.000563,4.8e-05,0.001409,0.000737,0.002784,0.002496,0.001936,0.001345,0.001046,0.002637,0.000574,0.001853,0.001149,0.00169,0.002499,0.000388,0.00196,0.002785,0.003159,0.002408,0.00219,0.003527,0.001614,0.001433,0.00139,0.001441,0.002187,0.000641,0.000633,0.00204,0.001419,0.001693,0.000943,0.000267,0.00086,0.00055,0.000512,0.000787,0.000939,0.000926,0.000365,0.000146,0.000198,0.000134,8.2e-05,0.000135,0.000177,0.000132,3.8e-05,0.000404,0.000168,0.000214,0.00011,1e-04,5.1e-05,7.2e-05,5e-05,3.8e-05,4.5e-05,2.3e-05,4.6e-05
9e-06,1e-06,1.6e-05,5e-06,7e-06,8e-06,7e-06,6e-06,8e-06,1e-05,7e-06,8e-06,6e-06,6e-06,1e-05,6e-06,1.1e-05,7e-06,2e-06,6e-06,1.5e-05,1e-05,1.1e-05,1e-05,1.1e-05,4e-06,4e-06,3e-06,5e-06,1.1e-05,1.1e-05,7e-06,1.7e-05,2e-06,5e-06,8e-06,8e-06,6e-06,1.4e-05,4.1e-05,1.8e-05,1.1e-05,0.000117,0.000537,0.000414,0.000166,0.000161,0.000219,0.000308,0.000197,0.000717,0.001153,0.000551,0.000193,3.5e-05,0.000244,0.000234,0.001195,0.002203,0.001981,0.001409,0.001537,0.001161,0.000876,0.001831,0.000221,0.000475,0.001691,0.001087,0.001383,0.001411,0.000723,0.001227,0.000856,0.00074,0.000482,0.001437,0.001086,0.000422,0.000959,0.000635,0.000992,0.001758,0.001272,0.000596,0.001855,0.00056,0.000245,0.000322,0.001686,0.000349,0.000619,0.000912,0.000644,0.000499,0.000687,0.000204,0.000576,0.000374,0.000232,0.000193,0.000231,0.000122,4.9e-05,1.7e-05,0.000108,0.000262,3.8e-05,0.000108,0.000354,7.8e-05,0.000212,4.1e-05,4.1e-05,3.1e-05,2.1e-05,1.3e-05,4e-05,5.3e-05,5.5e-05,6.2e-05
1e-06,2e-06,8e-06,3e-06,1e-06,2e-06,3e-06,1e-06,3e-06,4e-06,0,2e-06,4e-06,3e-06,4e-06,3e-06,4e-06,4e-06,2e-06,4e-06,1e-06,2e-06,2e-06,1e-06,5e-06,4e-06,3e-06,1e-06,3e-06,9e-06,9e-06,5e-06,8e-06,6e-06,3e-06,2e-06,4e-06,7e-06,6e-06,1.1e-05,1.4e-05,7e-06,5.2e-05,0.00012,2.6e-05,4e-05,5.3e-05,0.00013,0.000292,9.5e-05,0.000461,0.000445,0.000231,2.4e-05,5.6e-05,0.000113,0.000111,0.000721,0.000648,0.000553,0.000174,0.000657,0.000496,0.000614,0.000443,0.000491,0.000503,0.000889,0.000532,0.000138,0.000152,0.000335,0.000468,0.000833,0.000649,0.000252,0.000259,0.000567,0.000782,0.000376,0.000212,0.000273,0.000598,0.000106,0.000136,0.000365,0.00013,0.000168,0.000209,0.000458,0.000135,0.000289,0.000279,0.000147,0.000128,8.4e-05,7.2e-05,9.7e-05,0.000124,2.4e-05,8.3e-05,3.8e-05,4.8e-05,4.4e-05,1.5e-05,4.7e-05,0.000119,9.7e-05,7.6e-05,7.9e-05,1.8e-05,8.2e-05,2.2e-05,1.6e-05,2.4e-05,2.9e-05,2.7e-05,1.2e-05,1.4e-05,1e-05,1.2e-05
2e-06,2e-06,6e-06,2e-06,4e-06,4e-06,3e-06,2e-06,3e-06,2e-06,3e-06,1e-06,2e-06,2e-06,4e-06,1e-06,6e-06,7e-06,8e-06,4e-06,5e-06,2e-06,3e-06,1e-06,2e-06,0,3e-06,1e-06,4e-06,5e-06,4e-06,1e-06,6e-06,6e-06,4e-06,5e-06,6e-06,1e-05,7e-06,1e-06,1.1e-05,1.1e-05,4.2e-05,2.9e-05,3e-05,2.2e-05,1e-05,8.8e-05,2e-04,5.8e-05,0.000341,0.000199,4.1e-05,7.1e-05,6.6e-05,0.000119,0.000115,0.000602,0.000513,0.000522,0.000701,0.000689,0.000232,0.000765,0.000332,0.000212,0.000437,0.000587,0.000494,0.000236,0.000347,0.000452,0.000297,0.000771,0.000388,0.000175,0.000296,0.00037,0.000392,0.000417,0.000213,0.000282,0.00058,0.000356,9.6e-05,0.000173,0.000135,0.000112,0.000171,0.000371,0.000134,0.000241,0.000172,0.000193,4.8e-05,0.000135,6.7e-05,6.8e-05,6e-05,4.7e-05,2.3e-05,3.7e-05,5.7e-05,2.5e-05,1.3e-05,5.2e-05,4.7e-05,6.1e-05,2.5e-05,4.6e-05,5.8e-05,2.9e-05,1.2e-05,3.2e-05,3e-06,2.2e-05,1.6e-05,1.9e-05,8e-06,6e-06,1e-05
3e-06,2e-06,3e-06,4e-06,3e-06,2e-06,1e-06,5e-06,5e-06,3e-06,1e-06,1e-06,0,2e-06,3e-06,3e-06,7e-06,3e-06,2e-06,4e-06,0,3e-06,3e-06,1e-06,1e-06,2e-06,3e-06,3e-06,3e-06,5e-06,4e-06,2e-06,5e-06,3e-06,4e-06,3e-06,3e-06,4e-06,7e-06,1.2e-05,1.5e-05,6e-06,5.3e-05,4e-05,3e-05,1.7e-05,8e-06,6.8e-05,5e-05,0.000129,0.000405,0.000109,7.1e-05,3.7e-05,3.9e-05,5.6e-05,0.000128,0.000428,0.000492,0.000826,0.000282,0.000287,0.000404,0.000508,0.000951,8e-04,0.000274,0.000469,0.000477,0.000515,0.00025,0.000329,0.000286,0.000638,0.000327,0.000325,0.00044,0.00031,0.000171,0.000424,7.8e-05,0.000206,0.000375,0.000148,1e-04,0.000246,5.5e-05,0.000184,0.000177,0.000313,0.000109,0.000234,0.000142,9.1e-05,2.9e-05,0.00011,9.9e-05,9.8e-05,4.1e-05,7.9e-05,2.6e-05,3.6e-05,4.2e-05,1.8e-05,2.2e-05,8.1e-05,6.9e-05,2.8e-05,1.7e-05,4.1e-05,4.3e-05,4.3e-05,2.4e-05,1.9e-05,2e-05,6e-06,6e-06,8e-06,8e-06,9e-06,9e-06
1e-06,4e-06,5e-06,2e-06,3e-06,6e-06,4e-06,3e-06,1e-06,1e-06,4e-06,2e-06,1e-06,3e-06,1e-06,1e-06,2e-06,3e-06,2e-06,3e-06,1e-06,2e-06,3e-06,2e-06,0,1e-06,3e-06,2e-06,3e-06,2e-06,3e-06,4e-06,1e-06,5e-06,2e-06,2e-06,2e-06,3e-06,3e-06,4e-06,1e-05,8e-06,5.1e-05,5e-05,3e-05,5e-06,2.3e-05,8.6e-05,8.6e-05,0.000117,0.000342,7e-06,3.6e-05,2.8e-05,7e-05,6.5e-05,0.000106,0.000209,0.000467,0.000356,0.000628,0.000226,0.000239,0.000315,0.000312,0.000698,0.000168,0.000352,0.000154,0.000537,2e-04,0.000268,0.000231,0.000248,0.000471,0.000349,0.000189,0.000545,0.000449,0.000375,0.000205,0.000298,0.000339,0.000199,9.6e-05,0.000195,1.9e-05,0.000126,0.000139,0.000222,8.5e-05,0.000148,0.000156,0.000123,6.3e-05,6.5e-05,6.4e-05,0.000109,5.2e-05,3.9e-05,3.7e-05,3e-05,3.2e-05,1.2e-05,1e-05,7.4e-05,6.8e-05,3.1e-05,2.1e-05,4.6e-05,2.9e-05,5.1e-05,1.3e-05,2.4e-05,1.4e-05,5e-06,8e-06,3e-06,2e-06,5e-06,4e-06
0,2e-06,3e-06,4e-06,2e-06,3e-06,0,0,1e-06,2e-06,2e-06,4e-06,3e-06,4e-06,4e-06,1e-06,2e-06,1e-06,2e-06,2e-06,4e-06,0,1e-06,3e-06,2e-06,1e-06,1e-06,1e-06,0,1e-06,4e-06,5e-06,5e-06,6e-06,3e-06,3e-06,1e-06,3e-06,1e-06,3e-06,6e-06,8e-06,4.2e-05,5.6e-05,1.2e-05,2.2e-05,2.9e-05,0.000105,4.1e-05,7.8e-05,0.000296,0.000102,7.9e-05,7.4e-05,3.8e-05,7.4e-05,0.000114,0.000218,0.000359,5.7e-05,0.000561,0.000168,0.000329,0.000143,0.000115,0.00092,0.000512,0.000284,0.000188,0.000349,0.000419,0.000187,0.000102,0.000225,0.00029,0.000161,0.000315,0.000382,0.000169,0.00048,2.4e-05,8.7e-05,0.000161,0.000173,0.000133,0.000178,0.000119,0.000109,0.000142,0.00017,0.00011,0.000107,0.000184,0.000173,7.7e-05,5.6e-05,5.7e-05,6.8e-05,4.1e-05,6.9e-05,5.8e-05,1.9e-05,2e-06,2.4e-05,9e-06,6.8e-05,0.000109,8e-06,1e-05,3.8e-05,2.4e-05,5e-05,4e-06,9e-06,1.5e-05,8e-06,6e-06,8e-06,3e-06,1e-05,9e-06
1e-06,2e-06,5e-06,2e-06,0,2e-06,1e-06,1e-06,1e-06,2e-06,2e-06,2e-06,1e-06,2e-06,2e-06,4e-06,1e-06,2e-06,1e-06,1e-06,2e-06,1e-06,2e-06,2e-06,1e-06,2e-06,0,2e-06,0,1e-06,5e-06,1e-06,3e-06,3e-06,2e-06,3e-06,2e-06,2e-06,3e-06,4e-06,6e-06,4e-06,3.8e-05,7.7e-05,1.5e-05,7e-06,1.4e-05,8.6e-05,4.9e-05,0.000118,0.000212,8.2e-05,9.5e-05,6.6e-05,2.5e-05,6.6e-05,0.000102,0.000414,0.000279,9.7e-05,0.000501,9.1e-05,0.000503,0.000269,0.000307,0.00029,0.000365,0.000501,0.000428,0.000227,0.000176,0.000344,0.000282,0.000404,0.00041,0.00039,0.000291,0.000141,0.000211,0.000324,0.000275,0.000268,0.000243,0.000346,0.000115,0.000188,0.000178,0.000182,0.000117,0.000154,3.4e-05,7.6e-05,0.000148,0.000179,7.2e-05,4.2e-05,6.3e-05,3.9e-05,5.7e-05,1.7e-05,3.5e-05,1.2e-05,3.6e-05,1e-05,2.2e-05,5.7e-05,4.2e-05,7.7e-05,3.6e-05,4.7e-05,1.6e-05,6.5e-05,8e-06,1.2e-05,1.5e-05,1.1e-05,6e-06,6e-06,6e-06,1.7e-05,7e-06
2e-06,3e-06,3e-06,1e-06,2e-06,2e-06,1e-06,1e-06,1e-06,1e-06,1e-06,1e-06,2e-06,2e-06,2e-06,3e-06,3e-06,1e-06,2e-06,1e-06,2e-06,1e-06,2e-06,1e-06,2e-06,0,1e-06,1e-06,2e-06,1e-06,3e-06,1e-06,1e-06,2e-06,3e-06,2e-06,3e-06,2e-06,3e-06,6e-06,6e-06,4e-06,3.7e-05,6.1e-05,4.1e-05,2.2e-05,9e-06,6.3e-05,3.9e-05,0.000123,6e-05,7.6e-05,3.5e-05,5.1e-05,5.9e-05,5.5e-05,8.8e-05,0.000459,0.000257,0.000233,7.2e-05,0.000207,0.000495,0.000274,0.000403,0.000128,0.000298,0.000479,0.000167,0.000269,0.000229,0.000308,0.000311,0.000215,0.000222,0.000546,7e-05,0.000124,0.000338,0.00022,0.000328,0.000138,0.000266,0.000239,1.2e-05,0.000201,6.3e-05,0.000182,4e-06,0.000157,5.2e-05,5.2e-05,0.000161,0.000129,0.000106,5.8e-05,3.3e-05,6e-05,2.3e-05,3.7e-05,4.7e-05,4.2e-05,4.2e-05,7e-06,2e-05,1.9e-05,2.7e-05,3.8e-05,2e-05,4.5e-05,1.7e-05,5.2e-05,1.4e-05,1.1e-05,5e-06,5e-06,7e-06,1.1e-05,3e-06,9e-06,6e-06
2e-06,3e-06,5e-06,3e-06,1e-06,0,1e-06,1e-06,1e-06,2e-06,2e-06,3e-06,1e-06,2e-06,2e-06,1e-06,4e-06,2e-06,2e-06,1e-06,3e-06,0,1e-06,2e-06,3e-06,2e-06,1e-06,0,2e-06,2e-06,2e-06,1e-06,3e-06,1e-06,3e-06,1e-06,2e-06,3e-06,4e-06,2e-06,4e-06,1e-06,3.1e-05,4.5e-05,2e-05,3e-06,2e-05,7.5e-05,3.5e-05,0.000115,5.4e-05,0.000121,0.000102,7.5e-05,5.3e-05,6.8e-05,0.000111,0.000417,0.000119,0.000238,0.000261,0.000171,0.000193,5e-05,0.00042,0.000228,0.000417,0.000345,0.000219,0.000363,0.000167,0.000151,0.000154,0.000142,0.000189,0.000332,0.000521,0.000209,0.000418,0.000115,0.000337,0.000433,0.000277,7.9e-05,0.000136,0.000221,7.7e-05,0.000176,0.000128,0.000292,0.000189,0.000153,0.000136,9.4e-05,8.4e-05,9.9e-05,8.6e-05,2.6e-05,0.000117,1.8e-05,2.5e-05,4.3e-05,3.9e-05,3.2e-05,1.9e-05,3.6e-05,4.2e-05,1.4e-05,2.5e-05,2.3e-05,2.6e-05,2.4e-05,3.2e-05,2.1e-05,1.1e-05,1.3e-05,2e-06,7e-06,7e-06,6e-06,6e-06
3e-06,2e-06,1e-06,1e-06,1e-06,3e-06,2e-06,1e-06,2e-06,2e-06,2e-06,2e-06,1e-06,2e-06,2e-06,1e-06,4e-06,1e-06,2e-06,2e-06,2e-06,0,1e-06,1e-06,2e-06,1e-06,1e-06,2e-06,1e-06,1e-06,2e-06,1e-06,3e-06,2e-06,2e-06,2e-06,1e-06,5e-06,2e-06,3e-06,4e-06,6e-06,2.1e-05,4.5e-05,5e-05,3.7e-05,6e-06,8.6e-05,7.6e-05,7.1e-05,0.000116,0.00012,6.4e-05,2.6e-05,0.000144,0.000116,8e-05,0.00029,0.000189,0.000283,0.000238,0.000257,0.000496,0.000167,0.000437,0.000382,0.000202,0.000142,0.000188,0.000371,0.000156,2.6e-05,0.000287,0.000349,0.000379,0.000273,0.000517,0.000259,0.000298,0.000391,0.000184,0.00027,0.00016,0.000178,0.000186,8.4e-05,0.00036,0.000193,5.5e-05,0.000315,0.000273,0.000184,0.000214,0.000126,3e-05,6.4e-05,8.1e-05,8.8e-05,9.5e-05,9.8e-05,1.9e-05,1.1e-05,2e-06,1e-05,1.8e-05,3.5e-05,7.8e-05,8.3e-05,2.9e-05,1.5e-05,4.8e-05,3.9e-05,1.1e-05,4e-06,0,1.5e-05,1e-05,2e-06,3e-06,3e-06,5e-06
2e-06,1e-06,2e-06,1e-06,1e-06,2e-06,0,1e-06,2e-06,0,0,2e-06,2e-06,1e-06,0,1e-06,2e-06,1e-06,2e-06,1e-06,1e-06,2e-06,3e-06,1e-06,2e-06,2e-06,2e-06,0,2e-06,3e-06,4e-06,3e-06,4e-06,1e-06,2e-06,0,1e-06,4e-06,1e-06,4e-06,4e-06,5e-06,2.6e-05,1.3e-05,4.6e-05,7e-06,1.9e-05,6.9e-05,0.000102,0.000168,0.000179,8.6e-05,7.1e-05,3.5e-05,0.000145,3.9e-05,7.3e-05,7e-06,0.000109,0.000192,5.1e-05,0.000222,0.000414,0.00027,0.00039,5.3e-05,0.00014,0.000205,0.000203,0.000249,0.000175,2.4e-05,0.000236,0.00031,0.000346,0.000266,0.000417,0.000209,0.000235,0.000128,0.000131,0.000207,0.000336,0.000229,0.000124,7.8e-05,0.000375,0.000148,0.000169,0.000179,0.000362,2e-04,2e-04,5.1e-05,6.4e-05,3.4e-05,7.7e-05,0.000133,4.3e-05,3.3e-05,6.2e-05,5.9e-05,4.5e-05,1.7e-05,2.7e-05,6e-06,5.6e-05,7.3e-05,3.3e-05,2e-05,4.4e-05,4.4e-05,1.1e-05,9e-06,1.2e-05,1.7e-05,7e-06,7e-06,6e-06,3e-06,6e-06
1e-06,2e-06,1e-06,2e-06,3e-06,4e-06,2e-06,1e-06,2e-06,1e-06,1e-06,2e-06,3e-06,2e-06,1e-06,1e-06,2e-06,2e-06,1e-06,1e-06,2e-06,2e-06,1e-06,3e-06,3e-06,1e-06,0,1e-06,4e-06,3e-06,3e-06,1e-06,1e-06,1e-06,3e-06,4e-06,4e-06,2e-06,2e-06,2e-06,2e-06,5e-06,3.2e-05,3.4e-05,2.8e-05,1.5e-05,3.7e-05,7.8e-05,0.000132,4.8e-05,0.000179,6.2e-05,3.7e-05,5e-05,0.000134,0.000138,3.4e-05,0.000192,0.000132,0.000287,0.000195,8.9e-05,0.000274,0.000161,0.000252,0.000334,5.2e-05,0.000286,0.000182,0.000104,8.2e-05,4.2e-05,0.000211,0.000153,0.000242,0.000382,0.000246,0.000149,0.000101,0.000312,0.000179,0.000344,0.000167,0.000118,8.2e-05,7.9e-05,9.7e-05,8.6e-05,0.000201,0.000215,0.00028,0.000273,6.5e-05,0.000112,1.9e-05,8.7e-05,7.7e-05,0.000143,0.000124,3.5e-05,4.6e-05,8.2e-05,6e-05,7e-06,1.5e-05,6e-06,2.4e-05,3.1e-05,3.1e-05,3.1e-05,3.7e-05,9e-06,2.5e-05,9e-06,1e-05,1e-06,7e-06,1.3e-05,2e-06,9e-06,6e-06
2e-06,1e-06,1e-06,1e-06,1e-06,1e-06,1e-06,1e-06,2e-06,2e-06,2e-06,1e-06,2e-06,2e-06,1e-06,0,2e-06,2e-06,1e-06,1e-06,2e-06,1e-06,1e-06,3e-06,1e-06,3e-06,3e-06,2e-06,3e-06,3e-06,2e-06,1e-06,3e-06,1e-06,3e-06,3e-06,3e-06,5e-06,4e-06,4e-06,5e-06,0,2.6e-05,6.4e-05,3.6e-05,4.1e-05,3.9e-05,7.4e-05,0.000159,0.000167,0.000171,0.000143,0.000117,7.5e-05,6e-05,4e-05,8.1e-05,0.000238,0.000125,0.00031,0.000385,0.00024,0.000144,9.1e-05,0.000279,0.000219,0.000167,0.000257,0.000184,0.000167,0.000169,9.7e-05,0.000203,0.000197,0.000159,0.000255,4.2e-05,8.5e-05,0.000248,0.000294,0.00035,0.000247,0.000129,0.000172,0.000154,0.000179,8.2e-05,4.2e-05,0.000174,0.000101,0.000231,2.9e-05,5.4e-05,0.000115,8e-05,1.4e-05,7e-05,0.000108,0.000106,4.8e-05,9e-06,6.3e-05,5.5e-05,4e-05,1.3e-05,2.5e-05,2.8e-05,5.4e-05,3.5e-05,3.6e-05,3.4e-05,4.5e-05,1.2e-05,3e-06,1.3e-05,1.9e-05,1.9e-05,1.8e-05,1.7e-05,2e-05,1.7e-05
2e-06,1e-06,2e-06,1e-06,1e-06,1e-06,1e-06,1e-06,3e-06,1e-06,1e-06,3e-06,4e-06,3e-06,1e-06,2e-06,0,3e-06,3e-06,2e-06,2e-06,2e-06,3e-06,1e-06,1e-06,3e-06,1e-06,4e-06,4e-06,3e-06,2e-06,3e-06,5e-06,2e-06,3e-06,1e-06,5e-06,1e-06,1e-06,6e-06,8e-06,4e-06,2.8e-05,7.4e-05,3.1e-05,3.3e-05,1.5e-05,5.7e-05,0.000142,6e-05,0.000146,0.000157,5.1e-05,8e-06,5e-05,4.6e-05,0.000102,0.000262,0.000155,0.000119,0.000259,0.000144,0.000102,1.7e-05,0.000188,0.000238,0.000156,0.000409,0.000165,0.000232,8.7e-05,1e-04,0.000167,7.3e-05,0.000142,0.000359,0.000229,7e-05,0.000187,6.4e-05,0.000247,0.000264,0.000311,0.000335,6.9e-05,0.00019,0.000303,0.000114,1e-04,0.000192,6.5e-05,2.1e-05,0.000165,0.000161,6.2e-05,4.9e-05,6.9e-05,7.5e-05,0.000121,4.1e-05,8e-06,1e-05,2.8e-05,2.3e-05,1.6e-05,1.7e-05,4.7e-05,6.4e-05,1.8e-05,6.7e-05,3.8e-05,1.9e-05,7e-06,5e-06,1e-05,1.7e-05,1.9e-05,2.5e-05,9e-06,9e-06,1.5e-05
1e-06,2e-06,2e-06,2e-06,2e-06,1e-06,1e-06,1e-06,2e-06,0,1e-06,2e-06,1e-06,1e-06,1e-06,2e-06,2e-06,2e-06,3e-06,1e-06,1e-06,2e-06,3e-06,4e-06,1e-06,0,1e-06,2e-06,2e-06,1e-06,1e-06,3e-06,4e-06,0,1e-06,1e-06,3e-06,2e-06,1e-06,8e-06,1.1e-05,3e-06,3.4e-05,5.5e-05,3.2e-05,1.5e-05,2.8e-05,6.8e-05,8.4e-05,6.5e-05,5.7e-05,2.5e-05,2.5e-05,4.8e-05,0.000116,9.4e-05,9.2e-05,0.000313,0.00022,0.000512,0.000152,0.000106,0.000128,0.000107,0.00015,0.000112,9.4e-05,0.000385,0.000207,0.000215,0.000152,0.000167,0.000153,0.000261,0.000112,0.000244,0.000318,0.000247,3.6e-05,0.000239,0.000149,0.000234,4.9e-05,0.000281,0.000198,0.000167,0.000115,0.000221,0.000165,0.000206,5.5e-05,0.000143,0.000105,0.000206,0.000163,0.000151,0.000171,8.6e-05,0.000165,0.000182,8.2e-05,0.000109,8.8e-05,6.1e-05,2.4e-05,1.3e-05,5e-05,6.7e-05,3.9e-05,4.2e-05,4.1e-05,3.9e-05,4e-05,1.4e-05,1.5e-05,1.4e-05,3e-06,2.2e-05,1.7e-05,1.9e-05,2e-06
2e-06,0,1e-06,1e-06,1e-06,1e-06,2e-06,1e-06,1e-06,2e-06,0,1e-06,2e-06,0,0,1e-06,1e-06,1e-06,3e-06,1e-06,2e-06,1e-06,3e-06,1e-06,1e-06,1e-06,1e-06,1e-06,1e-06,2e-06,4e-06,2e-06,4e-06,2e-06,1e-06,1e-06,1e-06,2e-06,1e-06,4e-06,7e-06,6e-06,2.9e-05,4.4e-05,5.5e-05,1.9e-05,2.5e-05,5.3e-05,6.1e-05,0.000124,5e-05,8.5e-05,4.9e-05,2e-05,8.8e-05,5.2e-05,7.6e-05,0.000222,0.000168,0.000414,0.000342,0.000203,0.000171,0.000232,2.5e-05,0.000376,0.000258,0.00025,0.00025,0.000188,0.000124,0.000136,0.000133,2e-04,6.8e-05,0.000354,0.00021,0.000122,0.000267,0.000218,0.000106,0.000158,0.000293,0.000204,0.000101,0.000227,0.000134,0.000171,0.000263,0.000297,3.7e-05,0.000191,0.000208,0.000224,6.7e-05,0.000239,5.9e-05,6.6e-05,4.6e-05,0.000127,8.7e-05,0.000133,0.000103,3.2e-05,1.5e-05,1.3e-05,4.3e-05,5.5e-05,3.2e-05,2.4e-05,3.9e-05,9.2e-05,5.1e-05,1.8e-05,3e-05,3.1e-05,1.8e-05,2.1e-05,6e-06,1.8e-05,2.4e-05
2e-06,1e-06,2e-06,1e-06,1e-06,1e-06,3e-06,2e-06,1e-06,1e-06,1e-06,1e-06,2e-06,2e-06,1e-06,2e-06,3e-06,1e-06,1e-06,1e-06,1e-06,2e-06,2e-06,2e-06,1e-06,1e-06,1e-06,1e-06,1e-06,1e-06,5e-06,1e-06,2e-06,1e-06,3e-06,4e-06,5e-06,3e-06,3e-06,3e-06,6e-06,7e-06,1.6e-05,2.1e-05,3.2e-05,3e-05,2.1e-05,5.9e-05,4.5e-05,0.000177,8.5e-05,6.1e-05,2.1e-05,2e-05,9.5e-05,0.000117,4.3e-05,0.00013,0.000288,9.2e-05,0.000311,0.000216,0.000228,0.000252,0.000138,0.000242,0.000202,0.000186,0.000143,0.000169,0.000116,8.7e-05,0.000156,9.7e-05,0.000138,0.000128,6.3e-05,4.3e-05,0.000208,8.6e-05,0.000237,0.000193,0.000188,6.2e-05,0.000122,0.000358,0.000299,0.000303,0.000115,0.000162,3.2e-05,0.000166,0.000208,0.000285,0.000293,0.000281,0.000169,0.000192,0.000209,0.000165,5.2e-05,9.6e-05,2.6e-05,7e-06,2e-05,7e-06,1.3e-05,7e-05,2e-05,4.9e-05,6e-05,0.000144,6.7e-05,2.3e-05,2.6e-05,3e-05,1.5e-05,1.6e-05,7e-06,1.6e-05,1.9e-05
2e-06,1e-06,1e-06,0,1e-06,1e-06,2e-06,1e-06,2e-06,2e-06,2e-06,1e-06,1e-06,2e-06,3e-06,1e-06,2e-06,1e-06,2e-06,1e-06,0,2e-06,1e-06,2e-06,2e-06,2e-06,2e-06,1e-06,1e-06,1e-06,3e-06,3e-06,2e-06,2e-06,3e-06,1e-06,2e-06,2e-06,4e-06,4e-06,4e-06,4e-06,2.7e-05,1e-05,3.1e-05,3.2e-05,2.5e-05,3.8e-05,6.4e-05,6.7e-05,4.4e-05,1.5e-05,1.7e-05,2.2e-05,6.7e-05,5e-06,4.7e-05,0.000136,0.000275,2e-04,0.000178,0.000172,0.00031,0.000323,0.000388,0.000506,9.6e-05,0.000168,0.000114,0.000228,0.000137,9.6e-05,4.5e-05,7.4e-05,0.00031,0.000254,6.9e-05,0.000137,6.7e-05,0.000231,0.000305,0.000107,0.000151,0.000137,4.4e-05,0.000314,0.00024,7e-05,0.000198,0.000171,0.000147,0.000163,0.000262,0.000167,7.7e-05,9.4e-05,7.7e-05,0.000156,0.00019,0.000146,7e-05,2.8e-05,3.7e-05,1.9e-05,2.3e-05,1.5e-05,9e-06,5.5e-05,3.9e-05,3.8e-05,5e-05,7.1e-05,2.2e-05,1.9e-05,1.6e-05,5e-06,2e-06,9e-06,9e-06,7e-06,6e-06
1e-06,0,2e-06,1e-06,1e-06,0,1e-06,0,1e-06,1e-06,0,0,1e-06,1e-06,1e-06,1e-06,3e-06,0,1e-06,0,1e-06,0,1e-06,1e-06,1e-06,1e-06,1e-06,1e-06,1e-06,3e-06,2e-06,2e-06,2e-06,1e-06,1e-06,1e-06,0,1e-06,1e-06,4e-06,2e-06,2e-06,2.8e-05,2.8e-05,2.9e-05,6e-06,8e-06,4.6e-05,7.7e-05,7.1e-05,2.3e-05,6.3e-05,2.8e-05,1e-05,4e-05,5.1e-05,6e-05,0.000179,0.000249,0.000154,0.000342,0.000403,3e-05,0.00014,0.000311,0.000239,0.000157,0.000278,8.1e-05,0.000227,0.000106,8.1e-05,0.000146,0.000155,0.000254,8.9e-05,0.000208,0.000103,4.5e-05,9.7e-05,0.00014,7.4e-05,0.000135,9.9e-05,3e-05,0.00013,5.3e-05,0.000121,6.1e-05,0.000163,0.000126,7.3e-05,0.000175,0.000114,6.4e-05,6e-05,1.6e-05,0.000103,6.8e-05,2.4e-05,2e-05,1.1e-05,1.9e-05,8e-06,1.4e-05,2.3e-05,2.6e-05,5e-06,1.1e-05,3.6e-05,1.8e-05,6.6e-05,1.2e-05,6e-06,4e-06,7e-06,8e-06,2e-06,4e-06,1e-05,4e-06
1e-06,0,2e-06,0,1e-06,1e-06,1e-06,1e-06,1e-06,0,0,1e-06,1e-06,0,1e-06,1e-06,2e-06,0,1e-06,0,1e-06,0,1e-06,1e-06,0,1e-06,1e-06,0,0,2e-06,1e-06,1e-06,3e-06,1e-06,1e-06,1e-06,0,0,1e-06,4e-06,1e-06,3e-06,2.7e-05,4.2e-05,1.1e-05,4e-06,9e-06,4.4e-05,6e-05,7.4e-05,2.8e-05,5.1e-05,2.2e-05,2e-06,1.7e-05,4.2e-05,6.3e-05,0.000161,0.00023,0.000205,0.000353,0.000171,0.000196,7.6e-05,0.000218,0.000341,9.9e-05,0.000257,0.000222,0.00021,0.000129,4.8e-05,0.000108,0.000235,0.00029,9.6e-05,4e-05,0.000159,0.000102,9e-05,0.000117,2.3e-05,0.000112,8e-05,4.2e-05,3.3e-05,2.5e-05,8.2e-05,0.000106,0.000157,9.6e-05,1.8e-05,0.000122,9.4e-05,7.4e-05,1.7e-05,1.3e-05,8.2e-05,3.7e-05,1e-06,4e-06,8e-06,9e-06,8e-06,3e-06,1.3e-05,3.2e-05,1.4e-05,1.2e-05,3.1e-05,4e-06,5.7e-05,3e-06,4e-06,4e-06,1e-06,6e-06,2e-06,2e-06,8e-06,2e-06
0,0,2e-06,0,0,1e-06,1e-06,0,1e-06,0,0,0,0,0,1e-06,0,2e-06,0,1e-06,0,1e-06,0,0,1e-06,0,1e-06,1e-06,0,0,2e-06,2e-06,1e-06,2e-06,0,0,1e-06,1e-06,0,1e-06,4e-06,1e-06,3e-06,2.7e-05,4e-05,8e-06,4e-06,1e-05,4.2e-05,5e-05,7e-05,2e-05,9e-06,1e-06,5e-06,1.2e-05,4.9e-05,6e-05,0.000138,0.000228,0.000203,0.000356,0.000227,0.00017,7.3e-05,8.7e-05,0.000207,0.000114,0.000166,0.000202,0.000151,0.000154,6.4e-05,0.000105,0.000139,0.000186,0.000122,6.2e-05,9.4e-05,3.4e-05,0.000131,1e-04,4.7e-05,0.000123,1e-04,3.1e-05,5.1e-05,2e-05,5.9e-05,0.000102,0.000162,5.8e-05,1.2e-05,0.000123,0.000114,4.6e-05,2.1e-05,2.6e-05,6.6e-05,2.6e-05,9e-06,7e-06,6e-06,2e-06,4e-06,4e-06,1.4e-05,3.1e-05,1.6e-05,8e-06,3.4e-05,8e-06,4.8e-05,5e-06,3e-06,2e-06,1e-06,4e-06,1e-06,2e-06,8e-06,2e-06
