-0.003765,-0.003228,-0.00141,-0.000127,-0.001345,-0.003188,-0.001012,-0.004717,-7e-04,-0.001442,-0.001966,-0.002371,-4e-06,0.000619,-0.001004,0.001232,-0.001109,-0.001746,-0.002343,-0.002924,-0.002407,-0.003009,-0.001813,-0.001303,-0.000971,0.000577,-0.000553,-0.00142,-0.000272,0.000684,-0.000728,-0.001642,-0.003068,-0.000101,-0.001085,-0.001301,-0.000808,-0.002475,-0.002497,-0.000252,-0.000521,-0.00302,-0.001466,-0.001415,-0.00013,-0.000605,-0.00124,-0.003026,-0.002217,-0.001705,-0.001116,-0.000927,-0.001044,-0.001626,-0.001592,-0.000166,5e-05,0.000173,-0.000601,-0.001179,-0.001877,-0.000534,-0.000903,-0.001171,-0.001876,-0.002008,-0.001268,-0.000419,-0.000151,-0.000191,0.000224,9.5e-05,-0.001511,-0.000606,-0.001156,-0.001753,0.00014,-0.000749,-0.000821,-0.001553,-0.00116,-0.00201,-0.001225,-0.000803,-0.001728,-0.001388,-0.002789,-0.00127,-0.001201,-0.001014,-6.3e-05,-0.000904,-0.000929,0.000267,0.00055,0.000178,-0.000241,-0.000513,-0.000463,-0.001451,-0.000463,-0.000842,0.000358,2e-06,-0.000878,0.000325,-0.000943,-0.000617,-0.000867,-0.000191,-0.000361,-0.000768,-0.000379,-0.000763,0.000293,-0.001353,-0.000144,0.000488,0.000357,-0.000173,-0.000352
-0.000434,8e-05,-0.002513,-0.004457,-0.00081,-0.000119,-0.000388,0.001989,-0.000211,-0.00153,-0.00191,-0.000167,-0.002219,-0.003516,-0.003056,-0.001475,-0.001696,-0.000856,-0.00027,-0.001929,1e-06,0.001273,-0.001079,-0.000609,0.000254,-0.001328,-0.001548,-0.000447,-0.001106,-0.002255,-0.001653,0.000224,0.000392,-0.001621,-0.001199,-0.000321,-0.001603,-0.000295,-0.000624,-0.000385,-0.003127,0.000129,-0.000283,-0.000779,-0.001717,-0.000521,0.000557,0.000908,-0.000278,-0.000711,-0.000239,-0.000947,-0.002827,-0.001917,-0.00102,-0.000734,-0.001046,-0.001871,-0.001115,-0.001541,-8.1e-05,0.000102,-0.000119,0.00107,0.000754,0.000812,1.7e-05,-9.9e-05,-0.001622,-0.000932,-0.00305,-0.001706,-0.000758,3.8e-05,-0.000174,-0.000725,-0.00095,-0.001356,-0.001793,-0.00088,-0.000353,0.000222,0.000563,-0.000704,-6.5e-05,4.9e-05,0.00077,-9e-05,-0.001004,-0.00211,-0.003177,-0.00173,-0.000773,-0.00011,-0.000105,-0.002308,-0.001462,-0.001228,-0.001551,-0.00082,-0.000403,-0.000756,-0.001149,0.000232,-9e-06,-0.001918,-0.001362,-0.000311,-0.000625,-0.000807,-0.001178,-0.000762,-0.000707,-0.001021,-0.000718,-0.000968,-0.000929,-0.000828,-0.001253,-0.00114,-0.000319
0.000182,-0.000574,0.000616,-0.000731,-0.001133,-0.002323,-0.00291,-0.003435,-0.001844,-0.002575,0.000384,-0.003144,-0.003124,-0.002427,-0.001235,-0.002024,-0.001004,-0.000601,-0.000896,-0.000173,-0.000782,-0.003632,-0.001385,-0.000824,-0.00179,-0.001475,-0.000769,2.4e-05,-0.001018,-0.000788,-0.000823,-0.000125,-0.001292,-0.000709,-0.000734,-0.000446,-0.00034,0.001461,0.000297,-0.002517,-0.00075,-0.002011,-0.001224,-0.000244,-0.000779,-0.000291,-0.000131,-0.001448,-0.001635,-0.000774,8e-06,0.000361,-0.00075,-0.000515,-0.000524,-0.002844,-0.001447,-7.6e-05,-0.002184,-0.000964,1.8e-05,-0.001504,-0.001479,-0.002289,-0.001353,-0.002039,-0.001231,-0.001254,-0.001673,-0.001199,-4.4e-05,-7.1e-05,-0.000418,-0.000382,-0.000814,-0.001257,-0.001312,0.000399,-0.000519,-0.000292,-0.001318,-0.000703,-0.000977,-0.000222,0.000412,-0.000855,-0.00051,-0.000744,-0.000614,-8.4e-05,2.1e-05,-0.001301,-0.000855,-0.000969,-0.000571,-0.000916,-0.000903,-0.000723,-0.000393,0.000155,-9.7e-05,-0.000699,-0.001091,-0.001036,-0.001959,-0.000893,0.000124,-0.001255,-0.001028,-0.001131,-0.000267,0.000281,-0.000324,0.000141,-0.001325,-0.000716,-0.001082,-0.00033,-0.000498,8e-06,6.4e-05
0.000725,0.000864,0.000867,0.001533,0.000901,0.000596,-0.000323,0.001028,0.000968,0.00133,-0.00021,0.002092,0.003019,0.00299,0.001911,0.000711,0.002278,0.001358,0.000733,0.000149,0.000702,0.002874,0.002224,0.000879,0.000905,0.000568,0.002103,0.000734,-0.000207,0.000775,0.001125,0.000109,0.001146,0.000701,0.001703,0.001881,0.001219,-4.2e-05,0.000134,0.000638,0.001403,0.001758,0.000656,0.000419,0.000468,-0.000104,-0.001011,0.001705,0.001049,0.00078,0.00013,-0.000927,0.002649,0.00268,0.000681,0.001139,0.000512,0.000803,0.001822,0.001892,-3.4e-05,0.000173,0.001276,0.000849,0.000297,0.000497,0.000106,-0.000332,0.00056,0.000161,0.000269,-0.000343,0.000776,0.000224,-6.2e-05,0.00076,0.000335,-0.000971,0.000695,0.000435,0.000799,-1.9e-05,0.000127,0.000321,-0.000846,0.000622,0.000325,0.00037,0.000795,-0.000138,0.001578,0.000932,0.001029,-0.000245,-0.001032,8.8e-05,0.000486,0.00031,-5e-05,4.3e-05,-0.000198,-0.000111,0.000101,0.000117,0.000777,0.001075,0.000674,0.000592,0.000732,0.000508,0.000195,0.000259,0.000213,-0.00014,0.000904,-0.000272,0.000801,0.000723,0.000257,0.00032,-0.00028
-0.000703,-0.001761,-0.000648,-0.000541,-0.00053,9.1e-05,0.00194,0.000691,-0.00023,4.7e-05,-0.000499,1.6e-05,-0.000851,0.00165,-0.000118,0.000544,-9.2e-05,-0.000568,-0.000255,1.1e-05,-0.000127,-0.000853,0.000392,0.000231,-0.000711,-7.7e-05,0.000397,0.000415,2.9e-05,-0.001186,-0.000104,0.000236,-0.000611,-0.000788,-0.000743,-0.002006,-0.000831,-0.000611,-0.000365,0.001236,0.000484,0.001036,0.000403,-0.000372,0.000203,0.001811,0.00131,-0.000613,-0.000934,0.000357,0.00055,2.9e-05,-0.000844,-0.001677,-0.000311,0.000675,0.000639,-0.000148,0.000308,-0.000891,0.000316,0.001159,-0.000914,-0.00023,-0.000229,0.000696,0.000753,0.000576,0.000868,0.000795,6.1e-05,-5.2e-05,-0.000917,0.000255,-0.000411,-0.000432,-0.000129,0.000397,-0.000348,0.00051,0.000501,0.001334,0.000279,1.9e-05,-0.000148,-0.000153,0.000199,-0.000288,0.000163,-0.000292,-0.000619,0.000131,-0.000187,0.000319,0.000136,0.000775,0.000988,0.00036,0.00042,0.00051,3.3e-05,0.000821,0.000412,0.000409,0.000548,0.000301,2.6e-05,-0.000295,0.000328,-3.5e-05,0.000293,-0.000344,0.00019,-0.000188,0.000342,0.000839,0.000256,-0.000619,0.000477,0.000403,0.000493
0.000512,0.001381,-0.000335,-0.00064,-0.000578,-0.000939,1.3e-05,0.000424,0.000268,-0.000224,0.000452,-0.000402,0.000102,-0.002043,-0.001622,0.00121,-0.000805,-0.001027,-0.000504,-0.000682,-0.000205,0.000375,-0.001199,-0.000942,0.000694,-0.000932,-0.002368,-0.001582,-0.000578,0.000401,-0.000747,-0.000668,-0.000192,0.000597,-0.001169,-0.00028,-4.3e-05,-0.000694,0.000313,-6.7e-05,-0.000284,-0.001497,-0.000426,-0.000146,-0.000473,-0.00073,-0.001324,-0.000432,0.000971,-0.000849,-0.000944,0.000955,-0.000236,-0.000379,-0.000544,-1.1e-05,-0.000326,-0.000628,-0.000731,3e-06,-0.000911,-0.000785,-0.000214,0.000519,0.001127,-0.000585,-0.000781,5.1e-05,0.000268,0.000265,-0.000365,0.001007,0.000204,0.000413,0.000175,0.000122,0.000244,0.000671,0.00055,-0.000102,0.000176,-0.001153,-0.000168,-0.000383,-0.000254,-0.000401,-0.00075,6.4e-05,-1.7e-05,-1.3e-05,-1.3e-05,0.000654,9.8e-05,-1e-04,0.00051,-0.000247,-7.1e-05,-0.000441,0.00031,-0.000426,-0.000458,-9.3e-05,-0.000132,-9e-05,-0.000141,0.000477,-0.000885,-7e-06,1e-06,-0.000365,-8e-05,0.000213,0.000135,0.000549,-5.5e-05,-0.000277,-0.000487,-0.000319,-0.000164,-0.000373,-1.6e-05
-0.000774,-0.000696,0.000356,0.000817,0.00026,-0.000118,-0.001131,-0.001141,0.000614,0.000156,0.000446,3.9e-05,-0.000769,-0.000427,0.00066,-0.001675,-0.000592,-0.00013,0.000507,9.3e-05,2.8e-05,-0.000186,-0.000131,-8.1e-05,-0.000734,0.000147,0.000201,1e-04,0.000657,0.001135,0.000728,0.000975,0.000137,-0.000634,0.000383,0.00043,0.000193,0.00079,0.000577,-0.000822,-0.00128,-0.000832,-0.000849,-0.000242,-0.000261,-0.000978,0.00079,0.000449,-9.9e-05,-4.8e-05,-0.000202,-0.000122,0.00019,0.000227,0.000474,-0.000374,-0.000614,-0.000418,0.000207,-0.000798,-0.000179,3.5e-05,-6.8e-05,-0.000554,-0.001028,0.000841,0.000357,0.000406,-0.000997,-0.000871,-0.000427,-0.000123,0.000228,-0.000316,-0.000212,0.000138,0.000145,9.7e-05,-0.00071,-0.000865,-0.001001,-0.000243,-0.000504,-0.000201,0.000272,-0.000293,0.000166,-4.8e-05,-0.000587,0.000185,-0.000295,-0.000861,-0.000377,-0.000301,0.000512,2.5e-05,-0.000574,-0.000374,0.000254,0.00032,0.000521,6.4e-05,7.4e-05,-0.000772,-0.000662,-0.000891,0.000536,-0.000384,-0.000482,-0.000463,-0.000403,2.5e-05,-4e-04,-9.3e-05,-0.000328,-0.000497,-0.000169,-8.2e-05,-0.000106,-0.000217,-0.000253
-0.000102,2.2e-05,-0.000591,-3.7e-05,0.000435,0.000675,0.000267,0.000243,-0.000296,-0.000283,-0.000245,0.000115,0.000434,0.000304,0.000742,-0.000195,0.000484,0.000882,-0.000415,0.000182,-0.000243,0.000275,0.000302,0.00042,-1e-06,0.000695,0.000418,0.000272,0.000195,-9.1e-05,-0.000486,-0.000387,-0.000432,0.000344,0.000684,0.000463,0.000169,6.3e-05,-0.001195,0.000847,0.000557,0.001074,0.000691,0.000159,0.000579,-6e-06,-0.000187,-0.00033,-0.000439,3.9e-05,0.000159,4.4e-05,-0.000314,0.000691,0.000485,0.00014,-0.000342,0.000655,0.000687,0.000624,0.000633,-0.000215,0.000607,0.000324,0.00027,-0.000272,-0.00076,-0.000872,0.000181,-1e-06,0.000124,-0.000426,-8e-05,-0.000289,0.000165,0.000349,-0.000283,-0.000623,-0.000424,0.000532,0.000739,-5.6e-05,-0.000215,-0.000417,-0.000303,1.8e-05,1e-04,0.000431,0.000538,0.000221,-0.000221,-0.00041,-8.8e-05,0.000104,-0.000311,-0.000589,-0.000355,-3.3e-05,-0.001112,-0.000218,-4.7e-05,-0.000151,-0.000541,-0.000186,-8.1e-05,0.000174,0.000108,0.000747,0.000428,6e-04,0.000228,-0.000172,0.00037,-2.7e-05,0.00013,5.1e-05,-0.000233,0.000485,0.000388,9.6e-05,0.000214
-0.00031,0.000402,0.000687,-8.2e-05,0.000486,-1.6e-05,-0.000408,-0.000442,0.000231,-7.8e-05,-0.000817,-4.5e-05,0.000203,0.000926,3.3e-05,0.001059,0.000502,-0.000484,-0.000423,0.000237,-3.2e-05,-0.000653,-0.000365,0.000393,0.00018,-0.000266,0.000233,0.000238,2.9e-05,-0.000539,5.6e-05,8e-05,0.000291,-0.000315,-9e-06,-0.000266,-0.000641,-0.000392,-1.7e-05,-0.000229,0.000366,0.00016,9.3e-05,0.000602,-0.000355,0.000103,-9.4e-05,-0.000171,-0.000132,8.3e-05,-0.000164,-9.2e-05,0.000349,-0.000572,-0.001003,0.000439,0.000353,0.000381,-0.00052,-0.000172,-1.1e-05,0.00015,-0.000176,-0.000336,-0.000212,-0.000462,0.000664,0.000445,-0.000265,-8.5e-05,0.000477,-9.5e-05,0.000373,7.7e-05,-0.00031,-0.000589,-0.000762,2e-06,0.000674,-1e-05,0.000176,0.000277,4.3e-05,0.000168,-0.000173,0.000159,0.000106,-0.000558,-0.000319,-0.000504,-4.1e-05,0.000685,0.000121,0.000435,-0.000128,0.000136,0.000311,0.00045,0.000443,0.00017,-0.000255,2.4e-05,0.000163,0.000192,4.3e-05,1.8e-05,-0.000176,-0.000216,-0.000343,6.4e-05,0.00028,-0.000176,-0.000184,-0.000244,-6.6e-05,0.000323,0.00012,-0.00018,-0.000155,1.8e-05,-9.5e-05
0.000322,-0.000415,-0.000151,-4.5e-05,-0.000258,-0.000559,0.000246,0.000388,-0.00071,-0.000278,0.000363,6.4e-05,-0.000312,-0.000772,-0.000607,0.000312,0.00016,-4e-05,0.000316,-0.000117,0.000163,-0.000347,1.8e-05,-0.000748,0.00022,0.000506,-0.000223,-0.000218,-0.000517,-0.000141,-9e-05,-0.000274,-0.000218,-1.1e-05,-0.000437,-0.000356,0.000316,0.000215,0.000127,2.5e-05,-0.000194,-0.000518,-0.000298,-0.000714,-0.000236,-0.000167,-0.000334,0.000179,0.000319,0.000121,0.000336,0.000146,0.000105,1.7e-05,0.000452,-0.000239,-0.000101,-0.000235,8.9e-05,-7.4e-05,-0.000419,-7e-05,-0.000184,-0.000126,7.7e-05,-0.000343,-0.000195,0.000107,4e-04,0.000358,-2.1e-05,0.000334,0.000225,0.000162,4.1e-05,0.000277,0.000654,7.6e-05,1.1e-05,-0.000238,-0.000423,-0.000139,0.000206,1.4e-05,-5.5e-05,-0.00015,7e-05,-0.000108,-9.3e-05,8.1e-05,-1.8e-05,0.000152,0.000244,-0.000262,6e-06,0.000341,-6.1e-05,0.000106,0.000178,-1.6e-05,-1e-06,-9e-06,0.000191,0.000186,2.5e-05,-1.5e-05,0.00016,-0.000383,7.3e-05,-2.4e-05,-9.1e-05,4e-06,-0.000182,0.000278,8e-06,-4.2e-05,0.000357,-0.000139,-0.000381,-6.1e-05,0.000185
-0.000255,-0.00031,-0.000114,-5e-06,-9.2e-05,0.000449,-0.000351,-0.000111,0.000445,0.000687,0.000271,0.000283,-1.3e-05,0.000471,-0.000149,-0.000821,-0.000692,0.000285,0.000401,0.000378,0.00024,8.3e-05,-2e-04,0.000588,-0.000173,-0.000501,0.000707,0.000174,0.000371,-0.000201,-6e-06,-0.000118,-4e-05,6e-05,0.000509,0.000489,0.000248,9.2e-05,0.000163,1.1e-05,0.000153,0.000451,-0.000157,0.000166,0.000178,0.000158,-0.000425,6.1e-05,-0.000302,0.000128,-0.000596,0.000322,-0.000224,-1.2e-05,5e-06,-0.000183,0.000119,-0.000237,0.000125,0.000267,0.000127,-9.2e-05,-2.2e-05,-0.000143,4e-06,0.000174,5.3e-05,-0.000104,5.3e-05,-0.000127,-0.000586,-0.000268,-0.000675,-0.000273,0.000413,-0.000151,0.000131,8.8e-05,0.000189,0.000132,0.00014,5.3e-05,-0.000282,0.000172,0.00024,0.00066,-6.7e-05,0.000229,0.000258,7.8e-05,0.000293,-0.000648,-0.000294,-0.000103,0.000107,0.000156,2.8e-05,-0.000182,9.2e-05,9.2e-05,0.000247,-8.5e-05,-5.8e-05,6.7e-05,-0.000161,-9e-05,-0.000174,0.000238,-0.000206,-0.000255,-0.000183,0.000236,0.000211,-7.8e-05,0.000205,-0.000113,-0.000276,2.8e-05,5.3e-05,5.2e-05,3.7e-05
0.000199,0.000147,-9.6e-05,-9.2e-05,0.000107,0.000251,0.000126,-3.7e-05,0.000556,-0.000422,-0.000117,6e-06,8.2e-05,-0.000314,0.000293,0.000454,0.000158,-1.5e-05,-0.000202,-4e-04,-0.000269,0.000146,7.2e-05,-0.000456,-0.00015,0.000362,-0.000277,-0.000246,0.000248,0.00013,-1.1e-05,4.1e-05,0.000237,-3.6e-05,-0.000613,-8.2e-05,-0.000163,-4.5e-05,-0.000206,0.000169,1.3e-05,-0.000401,0.000168,3.6e-05,-2.6e-05,0.000146,0.00063,-0.000135,7.2e-05,-0.000291,0.000415,-0.000298,2.7e-05,-0.000195,0.000238,0.000422,0.000114,0.000142,-3.7e-05,-0.000124,0.00022,8.2e-05,3.6e-05,0.000201,-0.000143,0.000153,0.00018,-0.000147,1e-05,-2.7e-05,0.00012,-7.1e-05,9e-06,9.4e-05,-4.6e-05,6.7e-05,-8e-05,-0.000128,-0.000406,1.5e-05,-0.000262,-0.000118,-9.8e-05,-0.000307,-2.2e-05,-0.000204,0.000141,-5.2e-05,7.4e-05,0.000378,-3.8e-05,0.000161,-8.7e-05,-6.2e-05,-9.9e-05,-3.4e-05,3e-05,2.3e-05,-0.000372,-0.00034,7.2e-05,0.000218,-4.6e-05,-0.000184,-0.000104,-6.3e-05,0.000204,0.000233,0.000196,0.000101,0.000147,4e-05,-0.000118,-4.7e-05,-9.4e-05,5.8e-05,-1e-06,6.6e-05,0.000218,-2.6e-05,-0.000285
7e-06,0.000126,0.000186,0.000134,-0.000184,-0.000274,0.000277,2e-05,-0.000353,0.000323,-0.000151,-0.000596,2.4e-05,0.000223,-0.000122,0.000358,0.000147,-0.000128,-6.5e-05,0.000208,0.000269,0.000165,-6e-05,0.000358,0.000226,-3.4e-05,5.2e-05,-1.5e-05,-0.000275,4e-05,3e-06,0.00015,-2.7e-05,0.000191,0.000446,-0.000113,7e-05,-0.000323,-1.1e-05,-0.000464,-3e-05,7.8e-05,0.000134,0.000152,8.8e-05,7.4e-05,0.000256,-2.6e-05,-0.000259,-0.000144,-0.000221,-5.3e-05,-0.000249,0.000361,-0.000337,-0.000171,-7.4e-05,0.000146,0.000291,-2.7e-05,-5.3e-05,0.000214,0.000223,-3.2e-05,6.3e-05,5.2e-05,-0.000231,0.000101,-6.6e-05,-0.000127,0.000103,-8e-05,0.000146,0.000271,-0.000257,-0.000194,-9e-05,4.7e-05,0.000114,-0.000246,0.000115,9e-06,7.6e-05,0.000277,-1.9e-05,-0.000189,-9.9e-05,2.4e-05,-0.000137,-0.000342,-0.000105,0.000102,0.000193,3.8e-05,-0.000121,-0.000123,-7.1e-05,-1.6e-05,0.000187,8.1e-05,3.8e-05,-5.4e-05,4.1e-05,8.8e-05,6.3e-05,-9.7e-05,-4.6e-05,-0.000215,2.9e-05,2.5e-05,-0.000109,-0.000158,-0.000132,-2.7e-05,-8.1e-05,8e-06,0.000106,7.4e-05,-9.6e-05,-4.1e-05,4e-06
1.7e-05,-5.8e-05,-0.000335,1.2e-05,0.000111,1.2e-05,-0.000152,-7.1e-05,-0.000292,-0.000234,-5.2e-05,0.000301,-5.4e-05,-0.000172,0.000111,-0.000138,-6.2e-05,-5.4e-05,0.000164,-0.000227,-0.000186,-0.000296,8e-06,-9.7e-05,0.000108,4.3e-05,-0.000291,-2.7e-05,-0.000195,0,-7.3e-05,-6.1e-05,-3e-04,0,-9e-06,2.3e-05,-9.6e-05,8.3e-05,0.000225,0.000133,-5.8e-05,0.00017,9.9e-05,-1.8e-05,7e-06,-0.00017,-0.000233,-4.7e-05,0.000369,0.000147,0.000115,2.8e-05,-2.1e-05,-7.4e-05,5.8e-05,-0.000213,4.6e-05,0.000177,-0.000236,8.2e-05,8.3e-05,-9.2e-05,-0.000104,3.5e-05,3.8e-05,-7.9e-05,-0.000147,-3.1e-05,-0.000127,0.000102,6.1e-05,0.000188,1.8e-05,-7.1e-05,7.4e-05,0.000112,9.3e-05,-3e-05,-8.3e-05,0.000249,4.9e-05,4.8e-05,0.000104,-2e-04,2.1e-05,0.000145,6e-06,-3.4e-05,7.3e-05,-8e-06,1.3e-05,-5.3e-05,-7.6e-05,-1.6e-05,1e-06,-9.2e-05,1e-05,-4.5e-05,0.000112,9.7e-05,-0.000185,-0.00012,-3e-05,-8.3e-05,0.000163,8.7e-05,-3e-05,-8.6e-05,-0.000161,5e-05,1.2e-05,-0.000139,8.8e-05,0.000131,7.7e-05,-7.5e-05,-2.3e-05,4e-06,1.9e-05,-4.2e-05,5.6e-05
-0.000151,-0.000102,0.000123,2.6e-05,-1.8e-05,-2.1e-05,0.000146,-6.1e-05,1.3e-05,3e-06,9.4e-05,-7.2e-05,0.000107,8.9e-05,-6.5e-05,-0.000334,3e-05,-0.000122,7.3e-05,0.000286,2.5e-05,0.000103,5.6e-05,4.8e-05,-0.000172,-4.1e-05,9.8e-05,-3.1e-05,0.000197,0.000201,8e-05,-1.2e-05,0.000178,-7.6e-05,-3.1e-05,-9.5e-05,7.9e-05,2.2e-05,9e-06,1.3e-05,5.4e-05,5.7e-05,-0.000134,-9.1e-05,-0.00013,-1.4e-05,-7e-06,8.4e-05,-0.000301,-6.8e-05,-5.5e-05,-1e-06,6.5e-05,-0.000122,-7.8e-05,0.000178,-1e-06,-0.000111,-0.000129,-6.3e-05,-7.2e-05,-0.000125,9e-06,2.2e-05,-6.9e-05,-1.9e-05,0.000128,1.6e-05,0.000223,-5.5e-05,1.1e-05,5.3e-05,2.7e-05,-8.3e-05,0.000111,-4.1e-05,-0.000113,-5.3e-05,-2.4e-05,5e-05,-0.000117,-0.000106,-5.9e-05,0.000276,1.6e-05,-5.9e-05,-1.4e-05,6.4e-05,1.6e-05,-1.9e-05,-1e-05,-0.000117,-6.7e-05,5.7e-05,0.000136,4e-06,9.5e-05,6.3e-05,1e-06,-8.2e-05,3.6e-05,0.00011,-3.4e-05,0.000105,-3e-05,1.1e-05,-7.6e-05,0.000136,0.00012,-2e-06,-5.9e-05,0.000123,8.6e-05,-4.4e-05,-3.8e-05,-3.3e-05,-2e-05,-0.000168,-4.3e-05,4e-06,1.7e-05
7.6e-05,0.000105,0.000103,-0.000132,-7.1e-05,4e-06,-7e-05,-8.8e-05,-1.7e-05,0.00015,1e-06,0.000124,2.6e-05,-0.000126,-0.000147,3.8e-05,-1e-05,0.000168,-8.3e-05,-0.000168,2.4e-05,-5e-05,0.000117,-4.9e-05,-0.00017,-7.6e-05,-7.4e-05,5.4e-05,1.7e-05,-8.7e-05,-4e-06,-7.2e-05,0.000123,0.000106,-1.4e-05,7.7e-05,-1.6e-05,4.8e-05,-0.000137,-0.000182,2.8e-05,-0.000126,-2.7e-05,8.1e-05,0.000129,2.7e-05,8.1e-05,7.5e-05,0.000149,3e-05,6.5e-05,-3e-06,-0.000131,-5.4e-05,0.000151,0.000101,-6.2e-05,-4e-05,0.000116,1.5e-05,-1e-04,7e-06,-7.6e-05,-2.5e-05,-4.6e-05,3.3e-05,-4.7e-05,6e-06,-0.000143,6.6e-05,-1.1e-05,-7e-05,-0.000122,-1e-05,-7.4e-05,1.3e-05,3.8e-05,3.4e-05,6.4e-05,-9.5e-05,8.3e-05,5.8e-05,-9e-06,-0.000161,-3.9e-05,4.3e-05,-3e-06,2.5e-05,-6.5e-05,9.2e-05,6.7e-05,0.00027,0.000101,2e-06,5e-06,-3.3e-05,-1e-06,-1e-06,-0.000138,-1.7e-05,6.3e-05,-5e-06,1e-05,-2.1e-05,3.7e-05,2.1e-05,3.3e-05,-4.3e-05,-3.4e-05,2.2e-05,7e-05,1e-05,-3e-05,-1.2e-05,0,0.000155,2.3e-05,6.2e-05,4.9e-05,1.8e-05,-3.9e-05
-1.3e-05,-2e-05,2e-06,0.000129,-1.4e-05,-4.6e-05,6.6e-05,2.1e-05,0.00017,-5.4e-05,-2.9e-05,3.7e-05,-8.4e-05,0.000107,1e-04,0.000232,-0.000132,6.3e-05,-8.5e-05,0.000129,-9.4e-05,2.6e-05,-1.9e-05,-6.5e-05,0.000218,7.3e-05,0.000162,2.5e-05,-5.4e-05,5.4e-05,3.6e-05,-1e-06,-6.8e-05,-1e-04,1.9e-05,0.000105,-1.3e-05,5.3e-05,-2.1e-05,0.000172,-6.6e-05,-1.6e-05,-1.3e-05,-9e-06,5.8e-05,-5e-05,-8.9e-05,-1e-04,-3.3e-05,8.9e-05,-0.00018,-0.000208,8e-05,9e-06,5e-06,-0.00018,3.9e-05,-0.000113,-7.3e-05,8e-05,1.5e-05,9.4e-05,5.4e-05,2e-06,0.000112,-1.2e-05,3.2e-05,5.5e-05,4.6e-05,5e-05,-8.2e-05,2.8e-05,5e-06,-0.000106,-2.1e-05,4.2e-05,-6.5e-05,4e-05,2e-05,-2e-06,-1.8e-05,-4.4e-05,2.1e-05,0.000108,-2.1e-05,2.7e-05,-3.8e-05,-4e-06,4.9e-05,-7e-06,-2.9e-05,2.4e-05,-4.5e-05,-6.8e-05,-9.4e-05,2.2e-05,-1.8e-05,3e-06,3.7e-05,-8e-06,-2.2e-05,-5.8e-05,6e-06,1e-06,9e-06,4.3e-05,-7.1e-05,9.3e-05,-1.9e-05,-4.5e-05,-8.2e-05,-4.2e-05,7e-06,-3.8e-05,2.1e-05,-0.000106,-3.3e-05,-2e-06,-2.4e-05,2.2e-05,4.5e-05
3.4e-05,1.1e-05,-6.1e-05,-7.8e-05,-1.5e-05,7e-05,-6.1e-05,9e-06,-8.5e-05,4.1e-05,-1.2e-05,-3.2e-05,6e-05,-0.000121,-5e-05,-0.000286,-2.2e-05,-6.7e-05,3.4e-05,-7.3e-05,0.00011,3.7e-05,-6.4e-05,7.7e-05,-1e-04,-2.9e-05,-8.9e-05,1e-05,1e-06,-1e-06,8e-06,1.6e-05,-1e-06,7e-05,-8.3e-05,-9.3e-05,-4.6e-05,-3.6e-05,6e-06,-6.1e-05,2.7e-05,1.6e-05,1.3e-05,-1.2e-05,-5.9e-05,5e-05,6.8e-05,3.5e-05,1e-05,-8e-05,4.7e-05,9.1e-05,-1.6e-05,0.000121,-0.000113,9.2e-05,6e-06,7.3e-05,5e-06,-3.1e-05,0.000138,-0.000105,1.8e-05,7e-06,-2.9e-05,2e-05,1.1e-05,-2.7e-05,4e-06,-2.6e-05,9e-06,3.6e-05,4e-06,4.6e-05,3.1e-05,3.8e-05,2.7e-05,2e-06,4.7e-05,-3e-06,-7e-06,3.7e-05,-4.1e-05,-4.2e-05,1.5e-05,-4.7e-05,5.8e-05,1e-06,8e-06,-3.8e-05,-8e-06,-0.000194,9e-06,-1.2e-05,8e-06,6e-05,1.1e-05,-3.9e-05,1.9e-05,-3e-06,1.3e-05,1.5e-05,1.8e-05,3.4e-05,-9.2e-05,-4.2e-05,7.3e-05,3.6e-05,3.6e-05,4.5e-05,6.1e-05,-2.7e-05,9e-06,3.2e-05,-1.9e-05,-5e-06,1.4e-05,4.6e-05,3.1e-05,1.8e-05,-1.8e-05
1.4e-05,-6e-06,-6.2e-05,8.7e-05,2.1e-05,-7.3e-05,-1e-06,2e-05,-3.9e-05,7e-05,6.9e-05,-1.3e-05,-2.4e-05,0.000117,0.000101,0.00013,6e-06,2.1e-05,4.1e-05,3.5e-05,3.1e-05,-5.3e-05,-1.5e-05,-3.1e-05,3.4e-05,5.2e-05,4.3e-05,-4.8e-05,-2.2e-05,-2.1e-05,-2e-06,1.8e-05,-2.5e-05,-1.9e-05,5.1e-05,-2.7e-05,5e-05,-2.6e-05,2.8e-05,-1.7e-05,-2.6e-05,-7e-05,5.6e-05,7.1e-05,0,8.4e-05,2e-06,-1.9e-05,-1.4e-05,-2.5e-05,2e-05,-2.3e-05,3e-06,1.6e-05,6.7e-05,6.4e-05,4e-06,2.6e-05,4.2e-05,2.9e-05,-7.4e-05,5.1e-05,-3.8e-05,1e-06,-2.6e-05,-8.6e-05,2e-06,-3e-06,2e-05,1.1e-05,3.3e-05,1.2e-05,2.7e-05,-4.7e-05,1.2e-05,-2.2e-05,4e-05,1.2e-05,-7.2e-05,-4.2e-05,2.5e-05,-1.8e-05,-1.7e-05,5.8e-05,-9e-06,0,-7.5e-05,-2e-05,-7e-06,1e-06,0,8.3e-05,-3e-06,2.9e-05,6e-05,-1.4e-05,-3.3e-05,-6e-06,-3e-05,1.5e-05,-5.4e-05,7e-06,-2.2e-05,-2.9e-05,-1e-06,3.9e-05,-4.3e-05,-5.9e-05,-2.5e-05,-1.2e-05,-1.4e-05,3.2e-05,-6.3e-05,-1.8e-05,-1e-05,1e-05,-1.7e-05,-1.3e-05,-3.2e-05,-9e-06,-1.1e-05
1.3e-05,2e-05,4e-05,-8.6e-05,1.8e-05,-2e-05,3.5e-05,2.6e-05,3.1e-05,-8.3e-05,3.8e-05,-6e-06,-1.6e-05,-9.4e-05,-7.8e-05,8.8e-05,6.4e-05,-8.9e-05,6.1e-05,-3e-05,-8.4e-05,5.1e-05,-3.4e-05,0,-8e-06,-7.8e-05,-9.5e-05,1.6e-05,-1.8e-05,-5e-06,-1.8e-05,-6.2e-05,-3.6e-05,-2.8e-05,1.9e-05,-1.8e-05,7e-06,1.2e-05,-8e-06,3.5e-05,0,6.9e-05,-1e-06,-8.4e-05,-5e-06,-1.5e-05,-9.6e-05,7e-06,1.3e-05,2.4e-05,-1e-05,1.7e-05,4.8e-05,-2.7e-05,-4.5e-05,-0.000135,8e-06,6.7e-05,-7.3e-05,1e-06,-9e-06,3.7e-05,-5e-06,-2.1e-05,1e-05,4.1e-05,-2.7e-05,-5e-06,-2.7e-05,-5.3e-05,6e-06,-7.4e-05,6.8e-05,7.7e-05,1.7e-05,4e-05,-9e-06,-1.3e-05,-2.9e-05,-1.6e-05,1.9e-05,7e-06,1.4e-05,-2.9e-05,1.4e-05,-4.3e-05,3.4e-05,1.9e-05,5e-06,1.5e-05,-2e-06,8.1e-05,1e-06,2e-06,-2.2e-05,1.3e-05,-4.2e-05,-1e-06,-5.7e-05,1.8e-05,2.1e-05,-4.2e-05,1.8e-05,-1.2e-05,3e-05,-2.4e-05,1.1e-05,-2.4e-05,-1.9e-05,3e-05,-3e-06,3.6e-05,2.1e-05,-1.3e-05,2.6e-05,1e-06,3e-06,-3.7e-05,-2.7e-05,-3e-06,1e-05
2.6e-05,-2e-05,-3e-06,5.8e-05,-1.6e-05,6.2e-05,-5.5e-05,3e-06,3e-06,7.4e-05,-4.9e-05,5.2e-05,1.7e-05,6.7e-05,-5e-06,-7e-05,3.3e-05,3e-06,-7.4e-05,3.7e-05,9.5e-05,-1.2e-05,-1.1e-05,3.2e-05,1.4e-05,4.7e-05,-1.4e-05,1.7e-05,5.4e-05,-3.9e-05,2e-05,2.6e-05,6e-06,5.3e-05,-4e-05,4.4e-05,-2.5e-05,5e-06,-5e-06,4.3e-05,4e-06,4e-05,-1.5e-05,9e-06,-1.2e-05,-4.1e-05,2.3e-05,1.2e-05,-3.4e-05,-3e-05,2.1e-05,-3.4e-05,-4e-05,-1.8e-05,7.4e-05,3.5e-05,-7e-06,-6.9e-05,1.3e-05,-3.7e-05,-3e-06,-7.7e-05,-2.5e-05,2.1e-05,2.4e-05,1e-05,4e-06,3.6e-05,-7e-06,2.9e-05,1.2e-05,2.7e-05,-2.4e-05,3.2e-05,-1.2e-05,3e-06,-3.1e-05,1.1e-05,2.1e-05,8.2e-05,-1.1e-05,-2.2e-05,2e-05,2.7e-05,-4e-06,1.8e-05,-1.5e-05,-1.5e-05,1.8e-05,3.3e-05,6e-06,-0.000125,2.4e-05,-1.2e-05,-4.4e-05,-4e-05,1.7e-05,6e-06,6.5e-05,2e-06,5e-05,-8e-06,-1.5e-05,-9e-06,-2.2e-05,6e-06,8e-06,5.1e-05,1.3e-05,-1.6e-05,1.8e-05,-2.1e-05,1.4e-05,-4e-06,-1.8e-05,-3.7e-05,2.2e-05,3e-06,2.6e-05,-1.6e-05,-7e-06
-3.2e-05,-2e-05,1.5e-05,-2.8e-05,8e-06,-3.1e-05,2.9e-05,-7e-06,4.3e-05,-3.5e-05,-2e-05,-5.6e-05,-1.8e-05,-6.2e-05,-1e-06,-6e-05,-6e-05,5.9e-05,5e-06,-1.9e-05,-8.2e-05,2.4e-05,8e-06,-6.8e-05,9e-06,-4.3e-05,2.4e-05,-1.9e-05,-1.3e-05,4e-06,-1e-05,-1.5e-05,2.8e-05,-6.1e-05,6e-06,3.6e-05,2.6e-05,-3e-06,3.8e-05,-5.4e-05,-2e-06,-4.1e-05,-3.3e-05,-8e-06,1.7e-05,2e-05,6.7e-05,-1.6e-05,2.6e-05,2.5e-05,7e-06,2e-05,3.5e-05,-8e-06,-5.7e-05,5.7e-05,0,-3.1e-05,3.3e-05,3.9e-05,-1.2e-05,3.7e-05,3.5e-05,-6e-06,-1e-05,1.7e-05,3e-06,-3.6e-05,3e-05,-2.3e-05,-1.7e-05,2e-06,-3.6e-05,-3.5e-05,-1.2e-05,-3.4e-05,6e-06,-9e-06,-1.5e-05,-3.5e-05,-1.9e-05,2.4e-05,-1e-05,8e-06,-8e-06,-2.5e-05,-2e-05,1.8e-05,-1.4e-05,-4.1e-05,-1.4e-05,0,-3.5e-05,1.7e-05,1.6e-05,-9e-06,-3e-06,1e-05,1.8e-05,1e-06,-3.4e-05,3.3e-05,7e-06,2.2e-05,2e-05,-1e-05,-2e-06,-1e-05,2e-06,1e-06,-1.3e-05,-3.8e-05,-3.1e-05,7e-06,-3e-06,2.7e-05,-2.1e-05,-3e-06,-9e-06,-1e-06,1.4e-05
-1.2e-05,3.1e-05,-6e-06,5e-06,-6e-06,1e-06,-1.1e-05,-1.3e-05,-6.7e-05,1.3e-05,-1.7e-05,3.8e-05,0,6.7e-05,-1e-05,5.8e-05,-6e-06,5e-06,3.5e-05,2.6e-05,-2e-06,6e-06,4.6e-05,3.4e-05,-4.8e-05,2.6e-05,3.5e-05,1.7e-05,-4.1e-05,8e-06,6e-06,4.3e-05,7e-06,6e-05,2.4e-05,-4.1e-05,-3.4e-05,9e-06,4e-06,1.7e-05,1e-05,-2.5e-05,2.5e-05,2.3e-05,6e-06,-3.4e-05,2.1e-05,1.4e-05,-1.9e-05,4.4e-05,-3.8e-05,3.5e-05,-2e-06,2.8e-05,5e-06,-5.4e-05,-1e-06,-1.3e-05,-5.1e-05,-2e-05,1.6e-05,2.1e-05,-2.8e-05,-7e-06,-1.7e-05,-2.1e-05,1e-05,-3e-06,-1.6e-05,8e-06,-1.6e-05,4e-06,-9e-06,2.2e-05,1.3e-05,6e-06,7e-06,-1.5e-05,3.5e-05,6e-06,1.9e-05,-1.3e-05,-2.5e-05,-7e-06,7e-06,0,5e-06,-2.6e-05,-1.5e-05,1e-06,0,8.2e-05,1.2e-05,1e-06,2.9e-05,1e-05,5e-06,-8e-06,-2.2e-05,3e-06,-1.5e-05,-2.5e-05,-1.4e-05,-1e-06,1.7e-05,-3e-06,1.3e-05,-5e-05,-4e-06,-5e-06,1.8e-05,1e-06,1.1e-05,1e-06,1.9e-05,2.4e-05,5e-06,3.8e-05,-8e-06,-1e-06,1e-06
-9e-06,-9e-06,1.2e-05,1.4e-05,6e-06,-1.1e-05,1.7e-05,-9e-06,-1.7e-05,8e-06,3.3e-05,3e-05,-1.3e-05,-5.6e-05,5.7e-05,5.5e-05,-1.3e-05,-3.7e-05,-2.1e-05,-2.6e-05,5.4e-05,-3.8e-05,1.3e-05,-1.3e-05,4.4e-05,5e-06,-5e-06,7e-06,3.3e-05,5e-06,-1e-06,-5e-06,-2e-06,-2.8e-05,-5.2e-05,-1.3e-05,2.6e-05,-4e-06,-2.3e-05,3.6e-05,-1.3e-05,1.2e-05,-4e-06,1.8e-05,-2e-05,-2.1e-05,-5.2e-05,-1.7e-05,-1.6e-05,-3.1e-05,-7e-06,-6e-06,-2.3e-05,3.1e-05,-2e-06,-9e-06,2e-06,2.9e-05,2.5e-05,1.3e-05,2.8e-05,-3.5e-05,3.7e-05,1.2e-05,3.5e-05,2e-05,-1e-05,1.4e-05,6e-06,1.2e-05,2.1e-05,-2.9e-05,1.9e-05,-1e-06,1.6e-05,-1.8e-05,0,1e-05,-1.5e-05,1e-05,-1.6e-05,6e-06,1e-05,7e-06,2e-05,4.4e-05,7e-06,1.1e-05,1.7e-05,-2e-06,6e-06,-2.2e-05,1.6e-05,-2.1e-05,-1e-05,-2e-06,2.3e-05,4e-06,-1.9e-05,-1.1e-05,-3e-06,-6e-06,1.6e-05,4e-06,-1.6e-05,-2e-06,2e-06,5.2e-05,1.2e-05,8e-06,-1.3e-05,2.8e-05,1.4e-05,-1e-05,-1.1e-05,-4.3e-05,4e-06,-2.5e-05,-1e-06,9e-06,-1.5e-05
1.7e-05,-1.2e-05,-3.5e-05,-2.4e-05,1.2e-05,1e-05,-1.7e-05,-8e-06,7.4e-05,0,-1.5e-05,-5.4e-05,8e-06,4.7e-05,-3.6e-05,-9.2e-05,4e-06,1.4e-05,-2.4e-05,2.7e-05,-6.3e-05,1.1e-05,-6e-06,-7e-06,-1.1e-05,-2.6e-05,3.4e-05,-3e-05,1.5e-05,-3e-06,-5e-06,3e-06,-2e-06,0,4.8e-05,-1.3e-05,-1.3e-05,1e-06,3e-06,-3.9e-05,1e-06,-2e-06,4e-06,-2.7e-05,1.8e-05,2e-05,-1.8e-05,4e-06,2.3e-05,-1.1e-05,5e-06,-9e-06,1.6e-05,-3.5e-05,1.9e-05,5.2e-05,1e-05,2.3e-05,1.3e-05,9e-06,-2.9e-05,-2e-06,-3e-05,7e-06,-1.3e-05,-1.4e-05,2.3e-05,5e-06,-2e-06,-1e-05,-1e-06,2e-05,2.2e-05,-2.2e-05,-1e-05,-2e-06,-4e-06,-5e-06,1.7e-05,-4e-06,-1e-05,3e-06,2e-05,-1e-05,-1.6e-05,-4.5e-05,-7e-06,8e-06,-1.4e-05,2.9e-05,5e-06,-4.4e-05,-2.8e-05,5e-06,-2.4e-05,1.9e-05,-6e-06,-1.1e-05,1.5e-05,0,8e-06,3.3e-05,-9e-06,7e-06,8e-06,1.6e-05,-1e-06,-2.5e-05,4e-06,6e-06,1e-05,1.1e-05,-1e-05,5e-06,-6e-06,8e-06,-1.3e-05,-5e-06,8e-06,1e-06,-8e-06
-1e-06,-4e-06,2.2e-05,1.5e-05,-2e-06,-1.1e-05,1.2e-05,-1e-06,-2.5e-05,-1.6e-05,-2e-05,2.7e-05,-5e-06,-3.7e-05,2e-06,9e-06,4.3e-05,1.3e-05,-1.1e-05,-4e-05,5.4e-05,-2e-06,3e-06,3.4e-05,1.1e-05,3.2e-05,-4.6e-05,-5e-06,-2.1e-05,3e-06,-1e-06,-2e-05,-3e-06,2.2e-05,-7e-06,3.8e-05,8e-06,-9e-06,-1e-06,1.8e-05,-5e-06,1e-06,-6e-06,2e-06,-2e-06,3.5e-05,1.8e-05,0,-1.6e-05,7e-06,3.1e-05,-7e-06,-2.2e-05,-1.3e-05,2e-06,-1.7e-05,-6e-06,-1.5e-05,-3.5e-05,-1.1e-05,-3.9e-05,2.3e-05,0,-9e-06,-2e-06,1.1e-05,-1.2e-05,-1.6e-05,1.6e-05,1.8e-05,2e-06,1.7e-05,-4e-06,-8e-06,-1e-05,-2e-05,3e-06,3e-06,-1.6e-05,-2.6e-05,2.2e-05,-1e-06,-2.7e-05,7e-06,-9e-06,1.2e-05,1.5e-05,-3e-06,3e-06,-2.1e-05,3e-06,3.4e-05,1.1e-05,1.7e-05,5e-06,-1e-06,-3e-06,7e-06,7e-06,1e-06,1.6e-05,-1e-05,6e-06,-1.9e-05,1e-06,-1e-05,-8e-06,-7e-06,-6e-06,-2e-06,-4e-06,-1.8e-05,-1e-06,0,1.1e-05,1.3e-05,9e-06,-3e-06,-8e-06,1e-06,1.7e-05
1.1e-05,6e-06,-6e-06,-1e-06,-2e-06,2e-06,1e-06,1.3e-05,-2e-06,6e-06,6e-06,-1e-05,-7e-06,3.7e-05,-1.3e-05,6.5e-05,-6e-06,-3.1e-05,3.5e-05,4.4e-05,2e-06,-1.2e-05,4e-06,-4.6e-05,-2.9e-05,-3.2e-05,3e-06,1.3e-05,-1e-06,4e-06,3e-06,1.7e-05,-7e-06,-3.5e-05,-1.9e-05,1.8e-05,-8e-06,-4e-06,-5e-06,-2e-06,-1e-06,2.1e-05,-3e-06,-2e-06,-4e-06,-1.3e-05,6e-06,0,1.3e-05,-2e-05,-2.8e-05,1.6e-05,3e-06,-2e-06,-2.5e-05,-3.7e-05,0,-9e-06,3.8e-05,1.3e-05,4e-05,-2e-05,2.9e-05,0,-1.6e-05,-9e-06,-1e-06,6e-06,-1.6e-05,-2.4e-05,4e-06,-6e-06,-2.8e-05,-1e-05,1.2e-05,2.4e-05,9e-06,-1e-06,-2.1e-05,2.5e-05,-1.6e-05,-3e-06,-2e-06,-2e-06,1e-05,6e-06,-1.3e-05,1e-06,1e-05,2e-06,-1e-05,3.8e-05,6e-06,-6e-06,2.4e-05,-2e-06,1e-06,-1e-06,-2.8e-05,-9e-06,-1.9e-05,-1.4e-05,-4e-06,5e-06,-1.5e-05,9e-06,1.1e-05,1.2e-05,1.3e-05,4e-06,-1e-06,-5e-06,2e-05,9e-06,-8e-06,7e-06,-1e-06,4e-06,1e-05,-4e-06,-8e-06
8e-06,1e-05,1.1e-05,-9e-06,-1e-06,1.2e-05,-1.4e-05,1.3e-05,8e-06,0,2.3e-05,-2.5e-05,2e-05,-4.1e-05,8e-06,-1.5e-05,-2e-05,1.8e-05,1.8e-05,-3.8e-05,-4.3e-05,5e-06,-1.9e-05,3.7e-05,1.9e-05,2.9e-05,-1.6e-05,-3e-06,7e-06,3e-06,-3e-06,-8e-06,-7e-06,3e-05,1.3e-05,-3.5e-05,1e-05,2e-06,-6e-06,-1e-05,7e-06,-7e-06,-4e-06,-6e-06,8e-06,1e-06,-1.1e-05,1.5e-05,-1.2e-05,1e-05,1.7e-05,5e-06,0,5e-06,1.6e-05,3.5e-05,1e-06,-3.3e-05,-3e-06,-1.8e-05,3e-06,4e-06,-3.7e-05,3e-06,1.6e-05,-1e-06,-4e-06,0,2e-06,1.2e-05,-8e-06,-3e-06,-6e-06,2.4e-05,5e-06,-1e-05,-4e-06,0,1e-05,-8e-06,0,0,2.1e-05,-3e-06,4e-06,-2.9e-05,6e-06,-8e-06,-3e-06,-5e-06,-1e-06,-4.1e-05,-1.1e-05,-5e-06,-3e-06,-1e-06,-9e-06,3e-06,-4e-06,0,-1e-05,2e-05,4e-06,1e-06,8e-06,2e-06,-1.9e-05,0,-1.3e-05,-6e-06,-6e-06,1e-05,-1e-05,-1.4e-05,-4e-06,-2.3e-05,-3e-06,1.3e-05,-3e-06,-1e-06,-2e-06
5e-06,-4e-06,-1.3e-05,1.2e-05,-4e-06,-1.7e-05,1.5e-05,6e-06,-2.9e-05,-3e-06,1e-05,3.3e-05,-1.1e-05,3.8e-05,1.2e-05,-6.4e-05,-5e-06,-2e-06,-2.3e-05,3.9e-05,4.5e-05,2e-06,-1.7e-05,-3.6e-05,0,-2.1e-05,1.1e-05,-8e-06,-1e-05,-2e-06,4e-06,1.9e-05,1.2e-05,-1.9e-05,2e-06,-6e-06,-1e-06,8e-06,0,-4e-06,0,-1.7e-05,1.2e-05,2.2e-05,-2e-06,1e-06,1.6e-05,1e-06,1.5e-05,2.5e-05,-1.5e-05,-1.1e-05,-1.3e-05,2.6e-05,-1.3e-05,1e-05,-7e-06,2.6e-05,-2.8e-05,5e-06,1e-06,6e-06,2.8e-05,-6e-06,-3e-06,-3e-06,4e-06,6e-06,3e-06,-6e-06,-7e-06,1e-06,-2e-06,1e-06,-5e-06,7e-06,-6e-06,6e-06,-3e-06,-1.2e-05,1.1e-05,2e-06,-1.3e-05,6e-06,-8e-06,3.3e-05,6e-06,1.4e-05,1e-06,1e-05,-1e-06,1e-06,9e-06,4e-06,-2.2e-05,-1.5e-05,0,1e-06,1.5e-05,2e-06,6e-06,0,-4e-06,0,-2e-06,-6e-06,1.9e-05,-1.9e-05,2e-06,6e-06,0,5e-06,-1e-05,8e-06,9e-06,2e-05,9e-06,-6e-06,-3e-06,-1e-06,9e-06
-1.2e-05,1e-06,1.3e-05,-1.9e-05,4e-06,1.5e-05,-1.5e-05,-2e-06,2.3e-05,-4e-06,-2.4e-05,-5e-06,8e-06,-3.3e-05,-1e-06,5.9e-05,-1.4e-05,0,-9e-06,-3.4e-05,-3.4e-05,-6e-06,4e-06,2.8e-05,-1.3e-05,1.1e-05,2.1e-05,1.6e-05,1.7e-05,-9e-06,0,-2.1e-05,1.1e-05,-4e-06,-1.6e-05,-2e-06,-1e-05,7e-06,1.7e-05,1.5e-05,5e-06,1e-06,3e-06,-1.5e-05,-8e-06,-1.3e-05,-1.9e-05,-1.3e-05,-1.3e-05,-1.1e-05,-3e-06,-5e-06,1.4e-05,-9e-06,2.5e-05,-4e-05,2e-06,8e-06,3.1e-05,4e-06,-5e-06,-8e-06,-1.5e-05,2e-06,-1.3e-05,1e-06,-7e-06,-8e-06,1e-06,6e-06,1.3e-05,1.3e-05,1.5e-05,-3e-06,-2e-06,9e-06,2e-06,-3e-06,2.1e-05,1.5e-05,-6e-06,-6e-06,-1.2e-05,-9e-06,5e-06,-1e-05,-5e-06,-1e-05,-2e-06,2e-06,4e-06,2.7e-05,-1e-06,1e-06,4e-06,4e-06,1e-06,-6e-06,9e-06,-1e-06,1.5e-05,-1.6e-05,3e-06,-3e-06,-1.1e-05,1.5e-05,-1.8e-05,1.8e-05,-1e-06,-5e-06,0,-1.5e-05,1.2e-05,-4e-06,-3e-06,1e-06,-9e-06,-9e-06,0,1e-06,-4e-06
-8e-06,-1e-06,-9e-06,2.6e-05,-2e-06,2e-06,1.1e-05,-1.1e-05,-4e-06,-4e-06,6e-06,-1.2e-05,9e-06,2.8e-05,-9e-06,7e-06,2.1e-05,3e-06,6e-06,2.9e-05,1e-06,8e-06,-1e-06,-7e-06,8e-06,-3e-06,-5e-06,-6e-06,-7e-06,-1e-06,-2e-06,1e-05,-8e-06,1.9e-05,2.1e-05,2.2e-05,1.4e-05,-4e-06,1e-06,-2.2e-05,-3e-06,6e-06,-6e-06,-3e-06,7e-06,-1.2e-05,-8e-06,-2e-06,1.1e-05,-4e-06,-3e-06,-1e-06,-5e-06,-7e-06,-1.9e-05,1.7e-05,3e-06,1.4e-05,-1.1e-05,-4e-06,-7e-06,1e-06,-6e-06,2e-06,7e-06,7e-06,3e-06,3e-06,-4e-06,1e-06,-4e-06,-1.8e-05,1e-05,9e-06,1e-06,1.1e-05,2e-06,-2e-06,-1e-05,2e-06,1e-06,8e-06,5e-06,1e-05,5e-06,-1e-06,1.1e-05,2e-06,0,-8e-06,2e-06,-8e-06,-1e-06,-1e-05,1.7e-05,-4e-06,-1e-06,3e-06,-1.4e-05,4e-06,-1.3e-05,9e-06,-3e-06,8e-06,1.5e-05,-1.9e-05,1e-05,1.2e-05,-1.3e-05,7e-06,-7e-06,-1e-05,-1.2e-05,6e-06,-4e-06,-1.1e-05,0,3e-06,3e-06,1e-06,-4e-06
-1e-06,-5e-06,2e-06,-2.8e-05,-1e-06,-4e-06,-8e-06,-1.2e-05,-3e-06,-1.2e-05,1e-06,4e-06,-1.2e-05,-2.6e-05,0,-4.3e-05,1.3e-05,-4e-06,-2e-06,-2.8e-05,2.7e-05,1e-06,-5e-06,-3e-06,-5e-06,-2e-06,6e-06,-1e-05,-1.3e-05,-1e-06,1e-06,-1.1e-05,-4e-06,-2.6e-05,-2e-06,1e-05,-1.5e-05,-6e-06,-9e-06,7e-06,-3e-06,6e-06,-4e-06,-2e-06,-2e-06,1.5e-05,3e-05,1e-06,-1.1e-05,3e-06,2.4e-05,8e-06,0,-6e-06,1e-06,2.8e-05,-1e-06,-2.3e-05,-1.5e-05,6e-06,-1.4e-05,1e-06,1.9e-05,-4e-06,3e-06,-4e-06,1e-06,1e-06,1e-06,-9e-06,0,-1e-06,-1.1e-05,-3e-06,3e-06,-8e-06,-1e-06,3e-06,0,-7e-06,5e-06,-2e-06,6e-06,-8e-06,-2e-06,1.2e-05,-7e-06,0,-6e-06,2e-06,-2e-06,-1.7e-05,6e-06,7e-06,-1e-06,8e-06,4e-06,-3e-06,7e-06,3e-06,2e-06,8e-06,0,1e-06,0,1e-05,-8e-06,-2.8e-05,1.6e-05,-6e-06,8e-06,1.2e-05,-4e-06,-6e-06,6e-06,2e-06,7e-06,-3e-06,-1e-06,0,2e-06
2e-06,7e-06,-8e-06,2e-05,-2e-06,2e-06,3e-06,-4e-06,-7e-06,1.9e-05,1.4e-05,9e-06,1.1e-05,2.4e-05,-1e-06,-9e-06,-1.1e-05,7e-06,-7e-06,2.3e-05,-2.9e-05,-3e-06,9e-06,8e-06,9e-06,6e-06,-1.3e-05,1.5e-05,6e-06,2e-06,0,1.7e-05,2e-06,2.8e-05,-1.4e-05,-3.1e-05,1.1e-05,-3e-06,-1e-06,1.8e-05,0,-3e-06,-3e-06,0,-1e-06,8e-06,-3e-06,-8e-06,1e-05,-1.4e-05,-9e-06,1e-06,9e-06,9e-06,1e-06,-3.1e-05,3e-06,-3e-06,2.6e-05,-4e-06,2.6e-05,-2e-06,-8e-06,1e-06,4e-06,0,3e-06,-1e-06,6e-06,1.2e-05,4e-06,-2e-06,-5e-06,-1.2e-05,-1e-06,1.1e-05,1e-06,-2e-06,-4e-06,2e-06,-3e-06,-2e-06,-1e-06,8e-06,1e-06,-1.7e-05,3e-06,-4e-06,3e-06,-2e-06,1e-06,2e-06,-7e-06,9e-06,-1.6e-05,1e-06,0,5e-06,8e-06,0,-7e-06,-1.3e-05,1e-06,-9e-06,-8e-06,-6e-06,4e-06,1.5e-05,-1e-05,4e-06,-5e-06,1.3e-05,9e-06,6e-06,-2e-06,1.3e-05,-9e-06,1.3e-05,-2e-06,0,2e-06
2e-06,-1e-06,1.1e-05,-1.4e-05,-2e-06,-4e-06,4e-06,5e-06,-3e-06,-7e-06,-1.3e-05,-1.4e-05,-8e-06,-2.2e-05,3e-06,3.5e-05,-1e-06,-7e-06,-5e-06,-1.9e-05,1.7e-05,1e-06,2e-05,-7e-06,-1.3e-05,-1.2e-05,-7e-06,6e-06,1.5e-05,1e-06,-2e-06,-1e-05,-6e-06,-1.5e-05,1.3e-05,-3e-06,-7e-06,4e-06,2e-06,-2.8e-05,-2e-06,0,3e-06,1e-05,1e-06,-3e-06,-2.1e-05,1.2e-05,-1e-05,4e-06,-1.5e-05,-1e-06,-7e-06,1.1e-05,3e-06,-4e-06,0,0,-1.6e-05,-3e-06,8e-06,2e-06,0,5e-06,-1.6e-05,1e-06,-6e-06,-2e-06,-7e-06,-1e-05,-6e-06,9e-06,-3e-06,-3e-06,-3e-06,-2e-06,-2e-06,2e-06,-8e-06,9e-06,-1e-06,-1e-06,-1.1e-05,-5e-06,2e-06,1.3e-05,1e-06,6e-06,2e-06,6e-06,-1e-06,1.4e-05,1e-06,-9e-06,1e-06,-2e-06,-1e-06,-1e-06,8e-06,0,7e-06,2e-06,-4e-06,4e-06,1.1e-05,2e-06,-4e-06,1e-06,4e-06,-5e-06,3e-06,-4e-06,-2e-06,-2e-06,-4e-06,-9e-06,4e-06,-7e-06,4e-06,-2e-06,-2e-06
4e-06,-3e-06,-2e-06,1e-05,0,1e-06,-8e-06,9e-06,2.6e-05,-5e-06,0,0,-1e-06,2e-05,8e-06,5e-06,-1.5e-05,-4e-06,1.5e-05,1.8e-05,4e-06,0,3e-06,-2e-06,1.2e-05,1.5e-05,-2e-06,-1.1e-05,-1.3e-05,-1e-06,0,7e-06,2e-06,2e-06,-3e-06,6e-06,7e-06,1e-06,3e-06,1.3e-05,3e-06,-2e-06,4e-06,-6e-06,-1e-06,0,2e-06,3e-06,5e-06,1.2e-05,1.8e-05,-2e-06,6e-06,-5e-06,5e-06,3.1e-05,-1e-06,1.2e-05,-7e-06,4e-06,-2e-05,1e-06,5e-06,-1e-06,1.4e-05,2e-06,7e-06,6e-06,3e-06,8e-06,1e-06,-1e-05,1.2e-05,6e-06,0,-1.1e-05,3e-06,-3e-06,6e-06,-1.6e-05,2e-06,4e-06,2e-06,3e-06,-3e-06,-8e-06,-2e-06,-7e-06,-1e-06,-4e-06,1e-06,-3e-06,6e-06,-5e-06,1.5e-05,-1e-06,2e-06,1e-06,-1.4e-05,-1e-06,7e-06,1.1e-05,3e-06,-2e-06,-2e-06,2e-06,4e-06,-5e-06,8e-06,5e-06,1e-06,-1.1e-05,-2e-06,3e-06,4e-06,-9e-06,4e-06,-3e-06,-3e-06,-1e-06,5e-06
6e-06,-4e-06,-1e-06,-8e-06,2e-06,-5e-06,9e-06,6e-06,-1.5e-05,-3e-06,1e-06,1.5e-05,2e-06,-2e-05,-1.4e-05,-4.9e-05,3e-06,7e-06,1.1e-05,-1.5e-05,-1.8e-05,4e-06,-7e-06,1.6e-05,-3e-06,-1.6e-05,1e-05,1e-06,1e-06,1e-06,0,-1.6e-05,9e-06,1.4e-05,-1e-05,1.7e-05,-6e-06,1e-06,-4e-06,4e-06,1e-06,-4e-06,2e-06,-3e-06,0,-1e-06,9e-06,-7e-06,-2e-06,-4e-06,-1.9e-05,0,-1e-06,-7e-06,-1e-05,-1.9e-05,0,1.1e-05,2.1e-05,-5e-06,-3e-06,-4e-06,-1.1e-05,-2e-06,-1e-06,-4e-06,-5e-06,-3e-06,-1e-06,-9e-06,6e-06,2e-06,7e-06,4e-06,3e-06,-2e-06,0,1e-06,-4e-06,6e-06,0,-4e-06,1.1e-05,-2e-06,3e-06,3e-06,-3e-06,7e-06,4e-06,1e-06,-2e-06,-1.6e-05,-9e-06,6e-06,0,-6e-06,-2e-06,0,8e-06,-2e-06,-1.1e-05,-8e-06,-2e-06,2e-06,-1e-05,-1e-06,-2e-06,-3e-06,-1e-05,-3e-06,0,1e-06,5e-06,-2e-06,-1e-06,1.4e-05,-7e-06,0,2e-06,-1e-06,-4e-06
-1e-06,2e-06,-3e-06,3e-06,0,5e-06,-7e-06,0,-1.4e-05,-6e-06,6e-06,-1.7e-05,-1e-05,2.1e-05,1.3e-05,2.7e-05,1.6e-05,7e-06,-7e-06,1.4e-05,1.5e-05,-3e-06,-1e-06,-2e-05,3e-06,1.4e-05,0,3e-06,0,0,1e-06,1.2e-05,-3e-06,-2.5e-05,1.5e-05,5e-06,4e-06,0,-4e-06,-5e-06,2e-06,2e-06,-3e-06,3e-06,3e-06,-9e-06,0,9e-06,1e-06,0,1.5e-05,3e-06,-4e-06,-5e-06,4e-06,-1.8e-05,0,-7e-06,-1.8e-05,-2e-06,9e-06,6e-06,0,2e-06,-2e-06,2e-06,-1e-06,-1e-06,3e-06,7e-06,-4e-06,6e-06,-4e-06,-4e-06,1e-06,-3e-06,-2e-06,1e-06,1.4e-05,3e-06,-3e-06,1e-06,-1.1e-05,-1e-06,3e-06,9e-06,6e-06,-6e-06,-2e-06,-2e-06,-1e-06,1.2e-05,3e-06,1e-06,-1.5e-05,3e-06,-1e-06,-2e-06,3e-06,0,-6e-06,-6e-06,3e-06,0,8e-06,-2e-06,1e-06,1.4e-05,7e-06,2e-06,1e-06,8e-06,4e-06,-1e-06,-3e-06,-1e-06,5e-06,-1e-06,1e-06,1e-06,-2e-06
-5e-06,4e-06,1e-06,-4e-06,1e-06,-2e-06,4e-06,-6e-06,2.8e-05,8e-06,-6e-06,9e-06,8e-06,-2e-05,-1.4e-05,2.5e-05,-2e-06,-1.3e-05,-6e-06,-1.7e-05,-6e-06,3e-06,-5e-06,2.2e-05,-4e-06,-9e-06,9e-06,-1.3e-05,1e-06,3e-06,2e-06,-8e-06,-3e-06,2.4e-05,-5e-06,-2.5e-05,-2e-06,0,5e-06,0,0,9e-06,-2e-06,-5e-06,-1e-06,-3e-06,-1e-06,-6e-06,1e-06,1e-06,-4e-06,1e-06,6e-06,7e-06,-2e-06,3.1e-05,0,-9e-06,1e-06,7e-06,3e-06,-2e-06,1.4e-05,-1e-06,-4e-06,-2e-06,1e-06,0,-5e-06,-1e-06,1e-06,3e-06,-6e-06,-2e-06,-2e-06,-6e-06,0,-2e-06,-6e-06,-4e-06,1e-06,2e-06,-7e-06,3e-06,-4e-06,-1.5e-05,-9e-06,4e-06,-1e-06,4e-06,0,1.2e-05,3e-06,-3e-06,1e-06,-3e-06,1e-06,1e-06,6e-06,-1e-06,1.5e-05,1e-05,-3e-06,2e-06,-1e-06,6e-06,5e-06,-1.4e-05,-4e-06,-3e-06,1e-06,-3e-06,-7e-06,2e-06,4e-06,-1e-05,0,9e-06,-1e-06,1e-06,2e-06
-6e-06,0,-1e-06,3e-06,-1e-06,0,-2e-06,-6e-06,-1.4e-05,6e-06,-1.4e-05,4e-06,-8e-06,1.9e-05,9e-06,-2.9e-05,2e-06,0,-3e-06,1.6e-05,-5e-06,1e-06,-1.5e-05,-1.9e-05,1e-06,3e-06,-1.4e-05,4e-06,-1e-06,-1e-06,1e-06,1.3e-05,2e-06,-2e-05,-7e-06,-1e-06,-3e-06,0,1e-06,7e-06,-2e-06,-1e-06,0,7e-06,-2e-06,9e-06,-2e-06,-6e-06,-1e-06,-6e-06,1.3e-05,0,-7e-06,3e-06,7e-06,-3e-06,0,-4e-06,1.7e-05,-6e-06,1e-06,-5e-06,-1.7e-05,-1e-06,6e-06,2e-06,2e-06,4e-06,3e-06,-2e-06,3e-06,-2e-06,-2e-06,7e-06,-1e-06,-5e-06,2e-06,1e-06,-4e-06,-2e-06,1e-06,-1e-06,1.1e-05,-5e-06,0,1.5e-05,8e-06,1e-06,-2e-06,-1e-06,2e-06,-1.3e-05,-7e-06,3e-06,1.2e-05,3e-06,-3e-06,-1e-06,-1.2e-05,-2e-06,-7e-06,-3e-06,5e-06,-2e-06,-6e-06,-2e-06,-5e-06,-3e-06,-3e-06,1e-06,1e-06,-7e-06,2e-06,-2e-06,0,2e-06,-5e-06,-6e-06,-1e-06,1e-06,-1e-06
-1e-06,-2e-06,1e-06,-3e-06,1e-06,4e-06,0,-4e-06,-1e-06,-1.2e-05,5e-06,-1.5e-05,3e-06,-1.8e-05,2e-06,-1.5e-05,-1.1e-05,1.1e-05,0,-1.8e-05,1e-05,-4e-06,-7e-06,1e-05,5e-06,3e-06,6e-06,1.4e-05,5e-06,-1e-06,0,-1.4e-05,-5e-06,6e-06,1.1e-05,9e-06,7e-06,-2e-06,1e-06,-7e-06,-1e-06,-9e-06,2e-06,-3e-06,2e-06,5e-06,4e-06,8e-06,1e-06,1e-06,-2.9e-05,-3e-06,3e-06,-1e-06,-4e-06,-2.7e-05,0,1.3e-05,-1.9e-05,4e-06,2e-06,7e-06,1.3e-05,1e-06,5e-06,-1e-06,-2e-06,-1e-06,3e-06,3e-06,-5e-06,-4e-06,5e-06,1e-06,0,9e-06,-1e-06,0,-4e-06,8e-06,-3e-06,-2e-06,-1e-06,6e-06,5e-06,-1e-05,-7e-06,-2e-06,-1e-06,-1e-06,1e-06,-7e-06,5e-06,2e-06,1e-06,2e-06,0,2e-06,5e-06,0,1.1e-05,-1e-05,-5e-06,-2e-06,8e-06,-1e-06,8e-06,1.8e-05,2e-06,-1e-06,-1e-06,3e-06,3e-06,2e-06,-3e-06,1e-05,5e-06,1e-06,1e-06,-1e-06,-1e-06
0,-2e-06,3e-06,1e-06,0,-3e-06,3e-06,0,7e-06,-2e-06,5e-06,1.1e-05,4e-06,1.7e-05,-9e-06,3.2e-05,-7e-06,-7e-06,-4e-06,1.8e-05,-5e-06,2e-06,1e-05,-2e-06,-9e-06,-1e-05,-1.3e-05,-5e-06,-9e-06,-1e-06,-1e-06,8e-06,0,9e-06,-5e-06,1.2e-05,-8e-06,-2e-06,-1e-06,-2e-06,-1e-06,3e-06,1e-06,-2e-06,-1e-06,-1e-06,-1e-06,-3e-06,-2e-06,2e-06,2e-05,-1e-06,1e-06,-4e-06,-3e-06,2.3e-05,0,2e-06,7e-06,0,-1.8e-05,-4e-06,1e-06,-2e-06,-1.2e-05,1e-06,4e-06,-2e-06,-5e-06,-6e-06,3e-06,8e-06,4e-06,-4e-06,0,-5e-06,0,0,-5e-06,-6e-06,2e-06,1e-06,-8e-06,-8e-06,-1e-06,-3e-06,3e-06,3e-06,0,-1e-06,-1e-06,1.4e-05,0,-8e-06,-1.4e-05,-1e-06,1e-06,0,-2e-06,0,-1e-05,8e-06,4e-06,2e-06,-2e-06,4e-06,-8e-06,-1.4e-05,-2e-06,0,2e-06,9e-06,-4e-06,-2e-06,2e-06,-1.1e-05,-2e-06,-4e-06,0,0,2e-06
3e-06,2e-06,-1e-06,-5e-06,0,0,-5e-06,4e-06,-6e-06,1e-06,1e-05,5e-06,-6e-06,-1.8e-05,1.6e-05,7e-06,9e-06,-2e-06,2e-06,-1.8e-05,-3e-06,0,8e-06,-5e-06,7e-06,1.3e-05,1.1e-05,-7e-06,3e-06,-1e-06,-1e-06,-9e-06,3e-06,-1.8e-05,-6e-06,1e-06,7e-06,1e-06,-2e-06,1e-05,1e-06,3e-06,-1e-06,3e-06,-1e-06,-4e-06,-2e-06,-2e-06,3e-06,-1e-06,-1.2e-05,1e-06,-5e-06,-1e-06,3e-06,1e-05,0,-1e-06,1.2e-05,-7e-06,3e-06,-4e-06,-1.7e-05,0,6e-06,-1e-06,-3e-06,-1e-06,2e-06,8e-06,3e-06,-5e-06,-2e-06,-1e-06,0,6e-06,1e-06,1e-06,9e-06,-4e-06,1e-06,1e-06,0,8e-06,-1e-06,1.4e-05,-2e-06,-5e-06,0,-1e-06,0,3e-06,-4e-06,-1e-06,1e-06,2e-06,0,0,2e-06,1e-06,0,4e-06,-5e-06,-1e-06,-4e-06,-1e-05,6e-06,1e-06,2e-06,-1e-06,-5e-06,-2e-06,1e-06,3e-06,1e-06,-1e-06,-3e-06,1e-06,-1e-06,0,2e-06
