5e-06,9e-06,3.5e-05,3e-06,7e-06,0,9e-06,1.2e-05,0,1.5e-05,1.7e-05,8e-06,1.8e-05,1.8e-05,2e-05,0,1e-06,1e-05,2e-06,9e-06,1.4e-05,6e-06,1.4e-05,3e-05,1.9e-05,2.6e-05,1e-05,1.7e-05,2.8e-05,4e-06,9e-06,1.6e-05,0,0,1e-06,1.5e-05,2.3e-05,1.3e-05,1.9e-05,1.5e-05,1.2e-05,3e-05,4e-06,1.4e-05,2e-06,3.1e-05,4e-06,9e-06,1.1e-05,2.9e-05,4e-06,1.1e-05,2.1e-05,4.7e-05,9e-06,1.2e-05,5e-06,1.4e-05,1.1e-05,4e-06,2.3e-05,5.5e-05,1.3e-05,2.9e-05,5.3e-05,2.4e-05,1.7e-05,2.5e-05,0,1.8e-05,4e-06,4e-06,4e-06,1.2e-05,1e-06,5e-06,8e-06,2.4e-05,3.4e-05,1e-06,3e-06,1.7e-05,1.5e-05,2.2e-05,1.7e-05,1.4e-05,3.4e-05,3.2e-05,7e-06,2.1e-05,2e-05,9e-06,3.2e-05,4e-06,3.7e-05,2.2e-05,1e-05,9e-06,2e-06,2.2e-05,2.3e-05,1e-05,6e-06,9e-06,7e-06,1e-05,1e-05,1.7e-05,8e-06,2.3e-05,4.3e-05,9e-06,6e-06,8e-06,1.1e-05,1.3e-05,2.9e-05,2.6e-05,1e-06,9e-06,2.1e-05
2.1e-05,3.3e-05,6.8e-05,6.7e-05,2.3e-05,2.3e-05,2.5e-05,5.3e-05,1.4e-05,2.9e-05,3.7e-05,0,3.8e-05,2.6e-05,5.4e-05,3.2e-05,3.2e-05,2.3e-05,1.2e-05,1.2e-05,2.7e-05,3e-05,3.3e-05,5.8e-05,2.2e-05,7.1e-05,1.9e-05,3.5e-05,4.4e-05,1.8e-05,4.3e-05,3e-05,2.5e-05,1.9e-05,1.5e-05,1.8e-05,4.4e-05,2.2e-05,5.4e-05,3.3e-05,7.2e-05,8.5e-05,5.3e-05,6.8e-05,3.8e-05,9.2e-05,4.4e-05,5.8e-05,1.9e-05,5.1e-05,4.2e-05,5.7e-05,1.5e-05,9e-05,8.1e-05,4.2e-05,3.2e-05,6e-06,4.4e-05,4.4e-05,6.5e-05,8e-05,6.9e-05,5e-06,0.000101,2.2e-05,4.7e-05,4.2e-05,1.8e-05,2.9e-05,2.6e-05,1.1e-05,3.2e-05,5.4e-05,2.8e-05,3e-05,1.5e-05,5.1e-05,7.6e-05,3.1e-05,1.6e-05,4.4e-05,4.1e-05,6.1e-05,3e-05,5.2e-05,4.7e-05,6.5e-05,2.9e-05,3.4e-05,4.8e-05,1.5e-05,6.2e-05,3.1e-05,7.2e-05,2.6e-05,3.4e-05,3.9e-05,3.5e-05,6.1e-05,3.6e-05,1.4e-05,3.8e-05,4e-05,1.9e-05,1.7e-05,3.9e-05,5.2e-05,4e-05,4.9e-05,0.000135,4.9e-05,2e-05,3.2e-05,1.3e-05,1.4e-05,7.2e-05,6.2e-05,2.7e-05,3.9e-05,9.7e-05
9e-06,6.4e-05,2.7e-05,3.7e-05,5e-06,3.4e-05,5.1e-05,5.2e-05,2.6e-05,2.1e-05,1e-06,2.9e-05,2.4e-05,3.1e-05,1.7e-05,1.2e-05,4.8e-05,5e-05,1.2e-05,2.1e-05,2.4e-05,6.2e-05,1.5e-05,9.3e-05,9e-06,9.3e-05,3e-05,7.3e-05,4.9e-05,1.5e-05,5.1e-05,6.1e-05,5.9e-05,6.9e-05,4e-06,3.5e-05,5e-05,4e-06,3.1e-05,2e-05,0.000101,1.7e-05,4.2e-05,7.4e-05,4.2e-05,7.5e-05,2.7e-05,5.4e-05,1.4e-05,5.2e-05,6.4e-05,6e-05,8.5e-05,6.4e-05,2.2e-05,6e-05,2.9e-05,3.6e-05,6.4e-05,6.8e-05,5.7e-05,4.4e-05,0.000103,3.8e-05,6.8e-05,6.2e-05,4.5e-05,8.4e-05,2.4e-05,6.4e-05,2.5e-05,3.5e-05,3.1e-05,6.3e-05,9e-06,4.8e-05,5.5e-05,5.3e-05,0.00012,5.4e-05,1.5e-05,8.4e-05,1.1e-05,7.1e-05,3.7e-05,5.4e-05,7.2e-05,9.4e-05,3.4e-05,8.2e-05,4.1e-05,2e-05,8.5e-05,2.6e-05,3.5e-05,5.5e-05,5.7e-05,1e-06,3.2e-05,6.9e-05,8.7e-05,1.5e-05,4.6e-05,6.3e-05,3.9e-05,2.5e-05,2.7e-05,8.5e-05,7.3e-05,8e-06,0.000107,1.8e-05,4e-05,5.1e-05,4.8e-05,5.4e-05,3.7e-05,9e-06,4.3e-05,8.9e-05,0.000112
4.9e-05,8.6e-05,4.9e-05,7.2e-05,6e-05,2.1e-05,1.6e-05,2.4e-05,5e-05,7.9e-05,5.9e-05,4.1e-05,1.9e-05,1.9e-05,5.4e-05,3.1e-05,8.7e-05,8.5e-05,4.4e-05,6.9e-05,5.3e-05,3.9e-05,7.1e-05,8e-05,4e-05,6.4e-05,7.4e-05,8.4e-05,8.7e-05,4.7e-05,5.4e-05,7.2e-05,4.8e-05,4.9e-05,0.000109,6.7e-05,4.8e-05,9.1e-05,5e-05,6.2e-05,0.000116,5.2e-05,5.9e-05,5.7e-05,5.9e-05,8.9e-05,2.6e-05,5e-05,4e-05,6.5e-05,4e-05,4.1e-05,5.3e-05,6.9e-05,9.9e-05,9.5e-05,6.9e-05,5.6e-05,7.2e-05,4.3e-05,4.2e-05,0.000155,0.000105,6.7e-05,0.000117,3.7e-05,4.1e-05,9.2e-05,9.5e-05,0.000112,6.9e-05,4.1e-05,6.9e-05,5.8e-05,3.5e-05,5.3e-05,4.6e-05,1e-05,7.2e-05,2.8e-05,6e-05,7.8e-05,7.7e-05,0.000117,0.000117,5.5e-05,5.1e-05,0.000148,0.000101,1.2e-05,9.5e-05,2.3e-05,8.9e-05,4.3e-05,9.7e-05,4.9e-05,7.5e-05,1.8e-05,3.5e-05,7.3e-05,3e-05,6e-05,3.7e-05,7.4e-05,0.000135,8e-05,2.7e-05,0.000141,1e-04,4.9e-05,8.8e-05,6.5e-05,5.4e-05,9.4e-05,9.5e-05,1e-05,3e-05,6.9e-05,5.1e-05,8e-05,0.000123
7.5e-05,6.9e-05,0.000108,4.2e-05,8.3e-05,0.000108,2.3e-05,8.9e-05,0.000101,0.000128,0.000139,4e-05,9.6e-05,6e-05,8.5e-05,0.000107,0.000139,0.000141,5.5e-05,8.8e-05,6e-05,6.5e-05,0.000145,0.000168,4.7e-05,9.9e-05,0.00015,9e-05,9e-05,9.9e-05,5.1e-05,7.8e-05,3.2e-05,0.000101,0.000188,8.2e-05,2.7e-05,0.000126,0.000103,7.8e-05,0.000215,5.6e-05,4.2e-05,0.000141,0.000131,4.2e-05,2.9e-05,7.1e-05,2.1e-05,7.6e-05,5.6e-05,8.4e-05,5.7e-05,7.2e-05,0.000219,0.000156,4.8e-05,4.4e-05,1.4e-05,8.2e-05,7e-05,0.000204,0.000223,0.000211,0.000218,5.9e-05,5.8e-05,6e-05,0.000106,0.000168,5.5e-05,3.9e-05,2.6e-05,6.5e-05,0.000112,7e-06,7.7e-05,0.000137,0.000117,4.9e-05,0.000122,0.000131,7.1e-05,9.7e-05,0.000123,0.000123,0.000192,8.2e-05,8.8e-05,8.2e-05,0.000172,8.1e-05,0.000119,6.6e-05,0.000143,7.8e-05,0.000235,0.000113,0.000116,3.7e-05,0.000131,8.1e-05,0.000145,0.000108,0.000109,0.000117,0.000134,0.00017,0.000161,2.7e-05,0.000178,9.6e-05,7.9e-05,9.6e-05,8.1e-05,0.000115,5.5e-05,5e-05,0.000101,0.000135,8.1e-05
5.6e-05,7e-06,8.9e-05,8.4e-05,7.8e-05,0.000115,0.000115,7.6e-05,0.000113,0.000155,6.7e-05,0.000107,0.000123,6.6e-05,4.6e-05,0.000123,2.5e-05,0.000195,0.000145,0.000143,1e-04,7.2e-05,8.2e-05,0.000157,0.000164,0.000191,0.000168,8.2e-05,4.6e-05,0.000107,0.000152,0.000122,9e-05,3.5e-05,0.000225,0.000102,4.7e-05,0.000181,0.000102,9.3e-05,0.000252,0.000148,0.000108,0.000229,0.000107,0.000193,3.5e-05,0.00019,0.000103,5.6e-05,6.3e-05,0.000185,2.3e-05,0.000175,0.000324,0.000183,8.4e-05,3.3e-05,0.000128,0.000142,9.4e-05,0.000158,0.000318,0.000172,0.00025,0.000284,0.000131,0.000172,0.000109,5.2e-05,0.000204,0.000188,0.000172,0.000121,0.000287,0.00015,7.5e-05,0.000174,0.000292,0.000205,0.000152,0.000133,4.8e-05,0.00021,7.1e-05,3.9e-05,0.000165,4e-05,5.1e-05,6.7e-05,0.00017,0.000219,0.000323,4.6e-05,0.00019,2.2e-05,0.000208,0.000255,4.5e-05,6e-05,6.2e-05,0.000173,0.00012,0.000121,9.8e-05,0.000253,0.000291,0.000259,0.000227,0.000148,0.000227,0.000231,7.7e-05,8.1e-05,8e-05,4.3e-05,4.4e-05,8.1e-05,8.1e-05,0.000115,0.000132
0.000187,0.000118,0.000108,6.9e-05,6.3e-05,0.000138,7.7e-05,0.00013,5.1e-05,0.000196,0.000166,0.000132,0.000258,0.000229,0.000191,2.3e-05,0.000126,0.000125,5e-05,2e-05,1.4e-05,7.1e-05,7.6e-05,0.000351,0.000287,0.000136,6.4e-05,0.000144,0.000132,0.000116,5.2e-05,7.2e-05,0.000209,0.000153,0.000259,0.000253,0.000178,0.00014,0.000279,0.000302,0.000399,0.000121,0.000218,0.00035,0.000337,0.000337,0.000263,0.000357,0.000492,0.000296,0.00018,0.000321,0.000226,0.000248,0.000135,0.000272,0.000198,6.1e-05,0.000169,0.000162,0.000228,0.000125,0.00013,0.000374,0.000201,0.000176,0.000104,0.000202,0.000409,0.000178,0.000248,0.000143,0.000181,0.000102,0.000295,0.000425,0.000124,0.000203,6.3e-05,0.000182,0.000155,0.000344,0.000184,0.000257,0.000371,0.000227,0.000224,0.000424,0.000129,4.7e-05,2e-04,0.000336,0.00023,0.000379,0.000329,0.00038,0.000207,0.000242,0.000211,0.000305,0.000115,7.9e-05,0.00029,0.000216,0.000101,0.000122,7.7e-05,0.000168,0.000204,0.000262,0.000401,0.000256,0.000239,0.000171,0.000227,0.000208,3.2e-05,0.00019,0.000103,6.9e-05,0.000259
8.1e-05,6.7e-05,2.6e-05,0.00019,0.000153,5.5e-05,0.000177,0.000275,0.000212,0.000231,0.000171,0.000107,8.9e-05,9.4e-05,7.4e-05,0.000167,0.00016,0.000203,0.000111,0.000117,9.1e-05,0.000173,0.000145,0.000379,0.00016,0.000292,0.000368,0.000344,0.000184,3.3e-05,5.7e-05,0.00019,3e-04,7.1e-05,0.000209,4.8e-05,0.000239,0.000226,0.000342,5.2e-05,9.6e-05,0.000333,0.000257,0.000215,0.000304,0.000136,0.000309,5.8e-05,0.000448,0.000247,0.000147,4e-04,0.000505,0.000507,0.000451,0.000267,0.000106,0.000143,0.000249,0.00032,0.00038,0.00012,0.000123,0.000193,0.00025,0.000175,8.1e-05,0.000274,0.000449,0.000382,0.000192,4.4e-05,0.000332,0.000223,0.000228,0.000221,0.000332,0.000211,0.000206,0.000254,0.000182,0.000232,0.000242,0.000203,0.000223,0.000168,0.000414,0.00073,0.000487,0.000109,0.000205,0.000173,0.000326,0.000398,0.000183,0.000451,0.000234,0.000146,0.00035,0.00046,0.00046,0.000257,0.000251,0.000442,0.000402,0.000153,9.4e-05,0.000325,0.000247,0.000231,0.000189,0.000196,0.000214,4.2e-05,0.000254,0.000131,0.000298,0.000325,0.000168,0.000123,0.000221
0.000135,0.00015,7.9e-05,0.000162,5.8e-05,4.6e-05,0.000196,0.000111,6.7e-05,0.000129,0.000131,9e-05,1.9e-05,3e-06,8.3e-05,0.000165,1e-04,0.000144,0.000134,4.3e-05,0.00012,8.9e-05,0.000183,0.000256,0.000205,0.000388,0.000294,0.000131,9.6e-05,0.000103,4.1e-05,0.000173,0.000117,0.000162,9.5e-05,0.000132,0.000298,0.000336,0.000113,0.000282,0.000146,0.000333,0.000392,2e-04,0.000325,0.000307,0.000185,0.000251,0.000185,8.6e-05,0.000172,0.000163,0.000294,0.000195,0.00014,0.000106,0.000118,0.000177,0.000253,4.1e-05,0.000212,0.000271,0.000366,0.000138,6.3e-05,0.000155,0.000257,0.000186,0.000239,0.000324,0.000195,0.000128,0.000252,8.8e-05,8.3e-05,8.2e-05,0.00014,0.000259,0.000113,0.00011,5e-05,0.000237,7.2e-05,0.000162,0.000171,0.000198,0.000267,0.000356,0.000362,0.00026,0.000151,0.000316,0.000315,0.000167,0.000215,0.000489,0.000384,0.000382,2e-04,0.000166,0.000164,0.000128,0.000105,0.000431,7.8e-05,0.000354,0.00027,0.000163,6.8e-05,0.000417,0.000415,0.000488,0.000118,0.000215,0.000111,0.000286,0.000365,0.000141,2.5e-05,0.000174,0.000184
0.000173,0.000218,0.000144,9.8e-05,1.8e-05,4.2e-05,0.000113,7.9e-05,0.000136,6.7e-05,0.000133,8.9e-05,0.000119,1e-04,9.4e-05,7.3e-05,0.000134,3.9e-05,2.2e-05,0.000107,3e-05,0.000123,9.7e-05,6.2e-05,0.000151,0.000147,9.5e-05,9e-06,7.1e-05,4.4e-05,3.6e-05,1e-04,3.3e-05,9.2e-05,8.6e-05,0.000103,0.000158,4.6e-05,0.000231,0.000325,0.000243,0.000323,3.9e-05,0.000116,0.00015,6.2e-05,0.000172,3.9e-05,0.000155,0.000127,0.000203,0.000236,0.00019,0.000173,0.00011,8.3e-05,0.000156,0.000171,0.000199,0.000235,0.000142,0.000227,0.00018,0.000257,0.000257,0.00022,0.000104,0.000147,0.000335,0.000295,0.000133,0.000155,0.000349,0.000266,0.00022,9.5e-05,4.1e-05,0.000132,0.000298,0.00018,8.6e-05,0.000183,0.000215,0.000326,0.000273,0.000321,0.000235,0.000294,0.000108,0.000157,7.4e-05,0.000256,0.000201,0.000161,0.00014,0.000228,0.000263,0.000362,0.00058,0.000373,5.9e-05,5.8e-05,3.3e-05,0.000405,0.000543,0.000321,3.7e-05,0.000228,0.000195,0.000285,0.00011,0.000402,0.000334,0.000284,0.000266,0.000405,0.000227,5.6e-05,0.00011,0.000195,0.000268
0.000119,5.9e-05,1.1e-05,1.6e-05,7.7e-05,4.8e-05,3.3e-05,3.6e-05,7.6e-05,9.2e-05,0.000114,4.6e-05,0.000114,7.8e-05,3.5e-05,6.5e-05,9.6e-05,9.7e-05,3.7e-05,6.9e-05,5.9e-05,5.6e-05,9.7e-05,3.1e-05,0.000112,6.6e-05,6.3e-05,4.5e-05,6.7e-05,9.3e-05,4.6e-05,2e-06,6e-06,5.5e-05,5.8e-05,3e-06,7.7e-05,5e-05,0.000122,0.000148,1.6e-05,6.6e-05,7.2e-05,9.7e-05,4e-05,0.000108,0.000168,0.000239,0.000203,9.2e-05,0.000132,8.4e-05,6.3e-05,0.000107,4.9e-05,5.8e-05,7.8e-05,4.6e-05,6.9e-05,0.000107,2.5e-05,0.000198,5.8e-05,0.000206,0.000155,5.7e-05,0.000156,0.000124,0.000288,0.000167,0.000117,0.000138,0.000112,5.4e-05,0.000118,3.3e-05,6.7e-05,3.6e-05,0.000185,0.000193,8.7e-05,5.4e-05,8.1e-05,0.00013,8e-05,0.000208,0.00026,0.00018,0.000183,0.000152,8.2e-05,0.000128,6.9e-05,5.6e-05,0.000126,0.000149,0.000113,0.000248,0.000264,0.000236,0.000172,5.7e-05,0.000129,0.000221,0.000324,0.000199,5.7e-05,0.000147,5.4e-05,0.000139,0.000199,0.000149,0.000108,2.2e-05,0.000109,0.000188,3.5e-05,0.000183,0.000212,0.000254,0.000152
4.4e-05,3e-05,3.4e-05,2.9e-05,5.4e-05,4.8e-05,2.1e-05,2e-05,4.5e-05,3.4e-05,4.5e-05,4.8e-05,5.3e-05,5e-06,2e-05,7.1e-05,2.8e-05,5.9e-05,2.9e-05,2.4e-05,4.3e-05,5.1e-05,7.2e-05,1.5e-05,5.9e-05,4.5e-05,5.2e-05,2.5e-05,4.8e-05,2.6e-05,2.3e-05,5.8e-05,2.5e-05,4.7e-05,6e-06,1.5e-05,3.4e-05,4.1e-05,6.9e-05,5.4e-05,4.6e-05,3.2e-05,2.3e-05,2.7e-05,4.2e-05,3.1e-05,6e-05,0.000143,0.000114,1.4e-05,5.4e-05,6.1e-05,5.1e-05,8.5e-05,4.2e-05,3e-05,6.2e-05,1.4e-05,5.2e-05,0.000101,1e-05,9.6e-05,2.5e-05,6.3e-05,4.5e-05,5.3e-05,3.4e-05,0.000101,0.000106,8.2e-05,4.7e-05,1.8e-05,1.8e-05,4e-06,6.3e-05,2.6e-05,4.3e-05,3e-05,6.6e-05,2.2e-05,1.3e-05,4e-05,5.9e-05,4.2e-05,7.3e-05,0.000105,0.000144,7.8e-05,2.7e-05,4.5e-05,6.2e-05,7.8e-05,6.1e-05,2.4e-05,4.4e-05,8e-05,5.5e-05,2.3e-05,0.000174,6.6e-05,4.5e-05,1.7e-05,0.000112,0.000116,7e-05,8.7e-05,5.1e-05,4.1e-05,4.7e-05,9e-05,0.000168,7.9e-05,5.9e-05,1.5e-05,7.9e-05,9.7e-05,5.6e-05,0.00011,4.4e-05,9.7e-05,2.2e-05
6.4e-05,5.6e-05,3.3e-05,5e-05,5.3e-05,4.3e-05,2.9e-05,3e-05,2.6e-05,9e-06,4.2e-05,5.8e-05,2.4e-05,6e-06,2.7e-05,4.1e-05,6e-05,4.9e-05,2.1e-05,2.4e-05,4.3e-05,4.5e-05,8e-05,3.4e-05,4.9e-05,5.4e-05,1.9e-05,2e-05,4.3e-05,5e-05,5.1e-05,5.1e-05,1.2e-05,5e-05,1.9e-05,5.6e-05,3.3e-05,3.6e-05,7.9e-05,6.6e-05,5.8e-05,2.9e-05,5.7e-05,1.1e-05,3.3e-05,1.5e-05,6.9e-05,0.000116,0.000118,2.7e-05,1.9e-05,4.4e-05,6e-05,6.5e-05,5.5e-05,3.8e-05,4.2e-05,2.1e-05,3.5e-05,5e-05,6.4e-05,9.8e-05,6.1e-05,3e-05,5.4e-05,4e-05,3.1e-05,5e-05,0.000114,8.1e-05,3.1e-05,7e-06,5.3e-05,3e-05,3.7e-05,4.4e-05,1.5e-05,1.9e-05,1.9e-05,8e-06,2.2e-05,3.3e-05,1.1e-05,5.8e-05,7.7e-05,6.4e-05,0.000124,5.4e-05,1.1e-05,0.000124,3.5e-05,3.5e-05,6.4e-05,3.2e-05,7e-05,4e-05,3.8e-05,5.7e-05,0.000119,1e-04,5.1e-05,2.1e-05,4.1e-05,5.5e-05,0.000101,7.8e-05,4.4e-05,4.2e-05,1.7e-05,9.7e-05,8.7e-05,5.5e-05,6.9e-05,1.8e-05,8.5e-05,9e-05,6.3e-05,8.7e-05,6e-05,6.2e-05,5.5e-05
2.5e-05,2.2e-05,2.8e-05,4.8e-05,2.8e-05,3e-06,6.8e-05,5.5e-05,6.9e-05,1.9e-05,6e-05,7.8e-05,9.2e-05,9.7e-05,5.5e-05,7.2e-05,7.7e-05,8.5e-05,9.3e-05,1.8e-05,7.9e-05,9e-05,7.9e-05,8.4e-05,2.9e-05,3.5e-05,2.1e-05,4.7e-05,5.4e-05,3e-06,0.000101,9.7e-05,7e-05,2.7e-05,6.7e-05,3.5e-05,5.8e-05,4.4e-05,6.9e-05,0.000105,1.9e-05,0.000128,0.00015,0.000134,0.00012,6.2e-05,7.4e-05,0.000102,9e-05,0.000106,5.3e-05,3.7e-05,2.3e-05,1.7e-05,0.000109,6.4e-05,1.2e-05,7.6e-05,3.8e-05,9.8e-05,0.000108,0.000177,6.7e-05,0.000101,4.5e-05,0.00011,7.2e-05,4.4e-05,0.000123,2e-06,3.3e-05,4e-05,5.3e-05,9.7e-05,5.5e-05,0.000103,7.1e-05,4.3e-05,4.3e-05,3.1e-05,4.1e-05,4.9e-05,9.3e-05,6.3e-05,5.7e-05,0.000186,0.000147,8.2e-05,4.9e-05,0.000127,7.3e-05,7.3e-05,8e-05,3e-05,0.000129,7.3e-05,1.8e-05,3.2e-05,7.9e-05,6e-05,3.5e-05,1.6e-05,9.6e-05,6e-05,9.1e-05,0.000171,5.9e-05,5.1e-05,5.6e-05,0.000106,0.000105,8.6e-05,7.2e-05,0.000147,0.000126,2e-05,0.000128,1e-04,2e-05,7.6e-05,0.000101
1.8e-05,3.6e-05,0.000105,7e-05,8.1e-05,9.6e-05,0.000114,0.000156,8.4e-05,2.4e-05,1.8e-05,0.000121,3.1e-05,5.7e-05,0.00011,0.00012,6.4e-05,4.3e-05,4.8e-05,7.5e-05,0.000164,9e-05,0.000137,6.9e-05,8.3e-05,6.2e-05,5.9e-05,7e-05,7e-06,6.3e-05,0.000142,0.000118,5.4e-05,0.000103,7.7e-05,7.9e-05,5.6e-05,3.3e-05,1.1e-05,0.000139,7.9e-05,0.000122,0.000106,0.000173,0.000107,0.000148,4.2e-05,6.3e-05,7.4e-05,0.000189,0.000117,9.3e-05,8.8e-05,2e-05,2.2e-05,0.00013,0.000132,0.000149,8.9e-05,0.000234,0.000194,7.2e-05,0.000281,0.000208,0.000125,0.000118,0.000198,0.000103,8.2e-05,0.000103,7.3e-05,3.6e-05,2.2e-05,0.000107,0.000145,2.9e-05,6.3e-05,6e-05,5.1e-05,7.4e-05,3.6e-05,2.3e-05,7.1e-05,0.000124,0.000126,9.6e-05,3.6e-05,0.000207,7.7e-05,7.8e-05,0.000114,0.000151,0.000187,0.000113,0.000165,8.9e-05,4.7e-05,6.6e-05,5.2e-05,3.4e-05,0.000134,6.3e-05,0.000115,3.8e-05,0.000105,0.000173,0.000112,4.4e-05,7.2e-05,0.000154,6.7e-05,3.1e-05,6.4e-05,0.000195,0.00016,0.000162,0.000129,4.5e-05,8.2e-05,6.8e-05,6.1e-05
1.1e-05,8.9e-05,8.9e-05,0.000141,0.000184,0.000203,0.000107,0.000198,0.000127,2.8e-05,0.000131,0.000121,0.000129,4.2e-05,0.000129,0.000181,0.000122,5.9e-05,4.4e-05,1.9e-05,0.000162,0.000139,0.000185,6.7e-05,0.000128,5.5e-05,6.8e-05,0.000106,5.8e-05,3.4e-05,0.000121,4.3e-05,4.5e-05,0.000111,6e-05,3.1e-05,6.1e-05,1.4e-05,6e-06,0.000102,0.000145,0.000158,8.4e-05,0.000107,5.2e-05,0.000129,0.000106,6.5e-05,0.000193,0.000223,0.000153,0.000103,0.000128,0.000157,7.5e-05,0.000197,2.9e-05,9.9e-05,8.5e-05,0.000195,7.4e-05,0.000129,0.000268,0.000276,0.000222,4.8e-05,1e-04,9.8e-05,9.3e-05,7.7e-05,9.1e-05,5.7e-05,5.4e-05,7.6e-05,0.000127,0.000107,0.00015,0.00012,0.000185,0.000252,0.00012,7.2e-05,3.6e-05,8.8e-05,4.6e-05,7.9e-05,5.6e-05,0.000165,0.000119,2.7e-05,7.6e-05,0.000124,4e-05,0.000129,3.8e-05,0.000136,9.2e-05,1e-04,0.000119,6.7e-05,9.1e-05,6.3e-05,8.3e-05,0.000141,0.00017,0.000141,0.000134,2.2e-05,2.4e-05,0.000107,0.000205,0.000116,8.2e-05,0.000233,0.00014,0.000102,0.000115,5.3e-05,0.000105,0.000152,0.000169
8.2e-05,0.000125,0.000204,0.000216,1.9e-05,0.000149,0.000188,8e-05,2.2e-05,8.7e-05,0.000184,0.000146,5e-06,5.9e-05,0.000222,1e-04,7e-05,0.000144,8.9e-05,2.6e-05,0.000136,7.8e-05,0.000133,8.9e-05,0.000118,0.000101,4.4e-05,5.9e-05,0.000107,4.2e-05,0.000148,1e-04,9e-05,2.1e-05,4.3e-05,5.3e-05,9e-06,4.5e-05,5.7e-05,7.1e-05,0.000126,7.9e-05,7e-05,0.000129,6.5e-05,4.5e-05,3.3e-05,0.000174,0.000243,0.000134,7.9e-05,9.8e-05,0.000146,8.2e-05,0.000175,0.000106,0.000116,6e-05,0.000115,0.000122,0.000168,0.000141,0.000218,6.3e-05,5.3e-05,4.6e-05,6.3e-05,0.000116,7.5e-05,6.3e-05,0.000155,0.000111,4.3e-05,4.7e-05,5.7e-05,0.000196,0.00024,0.000144,0.000189,0.000282,0.000157,4.5e-05,0.000154,5.2e-05,6.3e-05,0.000135,0.000142,0.000165,0.000139,0.00011,0.000146,0.000101,0.000103,0.000103,0.000121,7.6e-05,1.6e-05,0.000103,9e-05,6e-05,0.000131,8.7e-05,0.000146,0.000111,0.000119,0.000149,9.5e-05,0.000123,7.1e-05,6.7e-05,8.9e-05,8.4e-05,0.000132,0.00011,8.5e-05,5.8e-05,5.1e-05,2e-05,1e-04,8e-05,3.4e-05
0.000101,5.2e-05,8.4e-05,1.1e-05,8.3e-05,7.3e-05,4.9e-05,4e-05,3.8e-05,5.6e-05,0.000105,4.7e-05,5.1e-05,8.1e-05,0.000125,8.5e-05,7.6e-05,4.6e-05,8e-05,0.000115,0.000125,9.1e-05,5.6e-05,4.9e-05,7.7e-05,0.000102,4.1e-05,2.9e-05,6.3e-05,6.9e-05,0.000123,0.000108,3.9e-05,3.8e-05,3.6e-05,2.2e-05,5.4e-05,2.7e-05,7e-05,8.8e-05,7.9e-05,0.000118,7.8e-05,0.000132,3.1e-05,1.8e-05,5.4e-05,0.000187,4.6e-05,2.2e-05,4.7e-05,1.7e-05,8.5e-05,6.5e-05,9.8e-05,3.9e-05,3.5e-05,3e-06,8.1e-05,5.7e-05,6.9e-05,9.2e-05,0.000124,0.00017,0.000141,9.7e-05,4.6e-05,0.000112,8e-05,4e-05,9.3e-05,5.2e-05,3.4e-05,5.4e-05,1e-05,0.000153,3.4e-05,7.3e-05,0.000168,5.9e-05,5.7e-05,0.000111,0.000154,0.000104,0.000105,6.2e-05,0.000203,0.000108,8e-05,3.2e-05,0.000112,0.000106,2.7e-05,4.9e-05,5.3e-05,4.6e-05,7e-05,4e-05,4.7e-05,3.7e-05,0.000132,8.5e-05,9.5e-05,5.9e-05,9.6e-05,8.2e-05,3.8e-05,3.3e-05,4e-06,6.8e-05,3.2e-05,5.2e-05,8.1e-05,9.5e-05,3e-05,0.000109,0.000162,8.5e-05,8.5e-05,6e-06,8e-06
0.000132,7.6e-05,6.5e-05,1.9e-05,4.7e-05,8.3e-05,0.000101,7.5e-05,2.9e-05,2.6e-05,1.6e-05,3.2e-05,8.9e-05,0.000124,0.000137,0.000132,0.000124,9.2e-05,2.9e-05,3.5e-05,8.7e-05,8.2e-05,0.000158,6.7e-05,2.7e-05,3e-05,5.7e-05,5.1e-05,3.7e-05,2.7e-05,3.5e-05,6.3e-05,6.1e-05,7.5e-05,7.7e-05,5.4e-05,9.5e-05,0.000106,1.6e-05,0.00015,9.5e-05,8.8e-05,4.7e-05,8.5e-05,7.5e-05,8.1e-05,9.1e-05,5.3e-05,6e-06,4.9e-05,6.8e-05,7.7e-05,0.000116,0.00015,5e-05,7.2e-05,2.6e-05,4.6e-05,6.1e-05,6.7e-05,2.3e-05,2.5e-05,0.000109,6.5e-05,4e-05,0.000162,0.000131,6.9e-05,0.000106,9.9e-05,0.000127,0.000187,9.6e-05,6.5e-05,7.9e-05,0.000113,7.5e-05,6.2e-05,0.000165,6.4e-05,8.1e-05,2.7e-05,0.000123,4.3e-05,0.00015,0.00015,0.000103,3.6e-05,2.5e-05,3.1e-05,8.7e-05,0.000129,0.00015,8.9e-05,6.8e-05,0.000116,5e-05,0.000117,6.3e-05,4.8e-05,6.7e-05,4.9e-05,4.5e-05,3.2e-05,8.7e-05,2.3e-05,5e-05,4.2e-05,1.6e-05,7.1e-05,5.3e-05,4.5e-05,9e-05,4e-05,2.4e-05,0.000113,0.000126,0.000151,0.000101,7.2e-05,0.000107
9.2e-05,3.6e-05,2.2e-05,5.6e-05,7.5e-05,0.000109,6.6e-05,3.8e-05,5e-06,0.000102,0.000109,5.1e-05,4.2e-05,7.3e-05,6.1e-05,0.000131,6.9e-05,4.7e-05,4e-05,2.6e-05,6.3e-05,0.000131,0.000125,7.5e-05,5.6e-05,4.1e-05,5.1e-05,0.000131,9.6e-05,8e-05,1.6e-05,0.000118,6.7e-05,4.3e-05,0.000116,7.6e-05,0.000163,5.1e-05,6.4e-05,0.00015,0.000176,0.00012,0.000103,5.9e-05,7.2e-05,0.000134,7.4e-05,2.8e-05,5.1e-05,4.8e-05,0.000114,4.9e-05,0.000159,1.9e-05,0.000123,1.8e-05,5.2e-05,7.8e-05,5.2e-05,3.7e-05,4.6e-05,7.7e-05,4.1e-05,7.9e-05,1e-05,7.9e-05,1.7e-05,0.000128,2.3e-05,8.6e-05,0.000193,0.000111,0.000114,7.2e-05,8.2e-05,5.9e-05,1.2e-05,5.1e-05,9.8e-05,4.6e-05,6.3e-05,2e-05,4.9e-05,7.1e-05,8.2e-05,1e-06,2e-05,9.4e-05,6.2e-05,3.2e-05,8.5e-05,7.7e-05,0.000134,6.8e-05,3.5e-05,6.2e-05,0.000129,0.000119,0.000107,4e-05,2.2e-05,7.6e-05,3.4e-05,0.000142,8.5e-05,9.4e-05,0.00013,4.8e-05,1.2e-05,0.000106,0.000133,3.1e-05,4e-05,0.000115,3.6e-05,4.9e-05,5.3e-05,0.000139,5.9e-05,5.5e-05,0.000138
3.1e-05,3.8e-05,4.9e-05,7.4e-05,5.4e-05,2.6e-05,4.2e-05,1.8e-05,3.1e-05,0.000151,2.4e-05,3.4e-05,4.2e-05,5.1e-05,6.3e-05,4.4e-05,4.7e-05,6e-05,8.5e-05,5.8e-05,7.9e-05,8.9e-05,3.6e-05,5.6e-05,1.4e-05,9.8e-05,3.6e-05,0.000113,2.7e-05,9e-05,8e-05,9.1e-05,2.3e-05,2.1e-05,0.000101,3.5e-05,0.000116,7.1e-05,7.5e-05,0.00015,3e-05,9.3e-05,2e-05,7e-05,7.7e-05,8.3e-05,3.8e-05,7.2e-05,4.8e-05,5.6e-05,4.5e-05,0.000143,7.2e-05,8.6e-05,0.000103,5.6e-05,3.8e-05,3.1e-05,6.8e-05,2.5e-05,6e-05,0.000106,6.4e-05,7.6e-05,0.000102,3.4e-05,4.1e-05,0.000108,0.000102,5.8e-05,7.6e-05,8.7e-05,5.4e-05,6.2e-05,0.000112,4.2e-05,2.4e-05,0.000108,4e-05,4.8e-05,6.4e-05,8.4e-05,0.00012,3.7e-05,9.5e-05,1.9e-05,3.7e-05,7.8e-05,5.7e-05,2.4e-05,0.00011,0.000166,3.1e-05,2.2e-05,8.7e-05,6.8e-05,0.000108,8.2e-05,4.9e-05,1.9e-05,3.3e-05,5.4e-05,5.8e-05,0.000157,2e-04,0.00015,7.2e-05,6.9e-05,2.9e-05,8.9e-05,8.9e-05,9.8e-05,6.9e-05,8.5e-05,1e-04,5.3e-05,6e-05,9.2e-05,5.4e-05,6.5e-05,8e-05
5.4e-05,4.8e-05,7.6e-05,6e-05,9.9e-05,7.4e-05,4.5e-05,1.9e-05,4.3e-05,0.000104,0.000103,9.9e-05,3.8e-05,2.4e-05,7.6e-05,0.000106,7.1e-05,0.000101,8e-05,2e-05,9.5e-05,7.9e-05,1e-05,7.1e-05,6.8e-05,4e-05,6e-05,5e-05,1.5e-05,8.6e-05,6.4e-05,9.8e-05,7.3e-05,8.4e-05,3.9e-05,6.3e-05,5.8e-05,5.4e-05,6.5e-05,5e-05,7.8e-05,4.5e-05,5.4e-05,0.000109,0.000125,0.00017,7.1e-05,7e-05,1.5e-05,4e-06,2.8e-05,8e-05,7.9e-05,3.4e-05,7.3e-05,2.6e-05,5e-05,4.7e-05,8e-05,8.5e-05,0.000111,9.1e-05,1.7e-05,7e-05,7.7e-05,3.5e-05,0.000105,7e-05,3.6e-05,0.000112,0.000109,9.2e-05,5e-05,4.9e-05,2.3e-05,7.9e-05,3.5e-05,0.000114,3.6e-05,8.7e-05,3.4e-05,5.7e-05,6.1e-05,0.000111,0.000111,0.000124,9.6e-05,6.3e-05,4e-06,2.6e-05,6.5e-05,6.1e-05,0.000116,6.3e-05,0.000121,4.5e-05,5.1e-05,6.8e-05,7.7e-05,2.6e-05,2.3e-05,4.8e-05,4.8e-05,2.6e-05,0.00013,1.8e-05,3e-05,5.9e-05,3e-05,4.2e-05,5.6e-05,3.1e-05,4.5e-05,2.2e-05,0.000112,0.000123,6.7e-05,7.2e-05,3.2e-05,9.8e-05,0.000107
3.3e-05,1.5e-05,2.3e-05,2.9e-05,3.8e-05,2.2e-05,1.1e-05,2.3e-05,2.1e-05,5.9e-05,4.3e-05,1.3e-05,1.4e-05,1.1e-05,5e-05,5.4e-05,3.4e-05,3.1e-05,1.5e-05,2.5e-05,2.6e-05,2.5e-05,5e-05,5e-05,3.8e-05,2.7e-05,2.4e-05,3.6e-05,4.6e-05,3.1e-05,1.7e-05,3.1e-05,1e-05,4.4e-05,5.9e-05,5.6e-05,2.7e-05,1.7e-05,7e-05,2.5e-05,3.2e-05,2.1e-05,3.2e-05,1.2e-05,3e-05,4.5e-05,3.3e-05,3.9e-05,2.6e-05,3e-05,3.5e-05,2.2e-05,1.9e-05,4.9e-05,6.5e-05,4.6e-05,5.8e-05,5.4e-05,1.2e-05,4.9e-05,7.3e-05,5.9e-05,6.5e-05,3.1e-05,1.6e-05,2.5e-05,6.7e-05,5e-05,5e-05,2.9e-05,8e-06,5e-05,3.8e-05,3.5e-05,2.4e-05,3.5e-05,2e-05,4.8e-05,5.9e-05,2.9e-05,5.3e-05,2.7e-05,2.6e-05,2.1e-05,2.2e-05,3.5e-05,7e-05,4.7e-05,3.8e-05,1.3e-05,3e-05,4.5e-05,2.5e-05,3.2e-05,7e-05,5.3e-05,3.6e-05,2.6e-05,2.4e-05,2.9e-05,1.7e-05,1.6e-05,1.6e-05,2.5e-05,3.1e-05,1.6e-05,9e-06,2.8e-05,1.1e-05,2.2e-05,4e-05,3.7e-05,7e-06,2.5e-05,5.9e-05,2.1e-05,2.2e-05,4.1e-05,4.9e-05,4.2e-05,2.3e-05
2.3e-05,1.3e-05,1.4e-05,3.3e-05,8e-06,3.7e-05,2.6e-05,2.8e-05,6e-06,3.5e-05,3.8e-05,4e-05,1.3e-05,1.5e-05,2.7e-05,5.4e-05,6.5e-05,3.7e-05,2.6e-05,2.2e-05,2.7e-05,2.2e-05,3.6e-05,1.8e-05,2.6e-05,5.1e-05,2.8e-05,1.9e-05,3.3e-05,2.9e-05,3.3e-05,2.7e-05,2.8e-05,1.9e-05,2.8e-05,2.1e-05,4e-05,4.8e-05,2.6e-05,3.7e-05,3.5e-05,3.2e-05,5.7e-05,6e-05,7e-06,5.6e-05,2.9e-05,4.3e-05,3.6e-05,3.8e-05,1e-05,2.6e-05,3.7e-05,1.5e-05,1.6e-05,6e-06,3.3e-05,1.2e-05,1.2e-05,4.8e-05,1.8e-05,5.6e-05,4.8e-05,2.7e-05,2.1e-05,1.4e-05,3.8e-05,1.2e-05,4.2e-05,4.3e-05,2.6e-05,4.6e-05,4.9e-05,2.8e-05,3.1e-05,8e-06,1.7e-05,1.7e-05,2.8e-05,2.3e-05,4.2e-05,1.3e-05,1.9e-05,3.2e-05,3.2e-05,6e-06,3.5e-05,2.3e-05,1.3e-05,2.5e-05,3.2e-05,1e-05,1.5e-05,3.3e-05,1.6e-05,3e-05,2e-05,1.6e-05,1.2e-05,2e-05,9e-06,1.3e-05,9e-06,4.2e-05,2.8e-05,1.9e-05,9e-06,4e-06,1.5e-05,2.3e-05,2.2e-05,3.3e-05,2.3e-05,3.1e-05,6.8e-05,4.9e-05,4e-05,1.3e-05,3.6e-05,2.3e-05,3.9e-05
3.1e-05,2.1e-05,2.3e-05,2.2e-05,1.4e-05,1.7e-05,8e-06,1.1e-05,2e-06,1.9e-05,1.3e-05,1.2e-05,1.5e-05,8e-06,2.3e-05,5e-05,2.8e-05,1.5e-05,3.3e-05,2.4e-05,2.8e-05,2e-05,2.2e-05,2.2e-05,1.9e-05,3.1e-05,1.9e-05,3e-05,2.9e-05,1.3e-05,3e-06,8e-06,1.1e-05,4e-06,3.2e-05,2e-05,4.4e-05,6e-06,3e-06,2.9e-05,7e-06,1.9e-05,5.7e-05,3.7e-05,3.1e-05,4.1e-05,2.7e-05,3.1e-05,1.6e-05,1.7e-05,1.3e-05,2.1e-05,1.1e-05,1.2e-05,2e-05,2.2e-05,7e-06,1e-06,4e-06,3.4e-05,2.9e-05,5.2e-05,2.7e-05,2.5e-05,1.4e-05,1.2e-05,3.5e-05,4.5e-05,4e-06,3.1e-05,9e-06,2.7e-05,1.7e-05,7e-06,2.6e-05,1.7e-05,1.3e-05,4e-06,2.4e-05,2.2e-05,3.3e-05,4e-05,3e-05,2.7e-05,1.1e-05,1.3e-05,1.4e-05,9e-06,9e-06,1.4e-05,3.8e-05,3.5e-05,3.2e-05,3e-06,1.1e-05,1.9e-05,3.1e-05,5e-06,2.7e-05,2.1e-05,2.2e-05,3.1e-05,9e-06,1.4e-05,1.7e-05,2e-05,1.6e-05,2.2e-05,2e-05,2.8e-05,3.6e-05,2.4e-05,2.4e-05,2.5e-05,1.9e-05,1.1e-05,1.5e-05,2.5e-05,2e-05,2.7e-05,3.2e-05
2e-05,1.4e-05,1.3e-05,6e-06,3e-06,5e-06,8e-06,6e-06,1e-06,6e-06,7e-06,7e-06,9e-06,1.2e-05,1.7e-05,1.5e-05,8e-06,4e-06,1.5e-05,9e-06,8e-06,2e-06,1.2e-05,1.2e-05,1.1e-05,1.4e-05,9e-06,1.5e-05,2e-05,1.2e-05,1.6e-05,1e-05,5e-06,7e-06,1e-05,6e-06,1.3e-05,1.2e-05,1.5e-05,1.7e-05,6e-06,7e-06,2.2e-05,3e-06,4e-06,1.9e-05,1.5e-05,2.4e-05,1e-05,1.8e-05,1.7e-05,3e-06,1.3e-05,8e-06,1.2e-05,1.5e-05,1.2e-05,3e-06,1e-06,1.8e-05,1.6e-05,1e-05,2.5e-05,1.3e-05,6e-06,1.2e-05,3.2e-05,2.2e-05,3.2e-05,1.6e-05,1.5e-05,9e-06,2.2e-05,8e-06,2.1e-05,6e-06,7e-06,1.1e-05,5e-06,1.9e-05,7e-06,2.4e-05,1.2e-05,1.8e-05,1.9e-05,1.4e-05,1.4e-05,5e-06,8e-06,4e-06,1.9e-05,2.4e-05,1.2e-05,1.5e-05,1.3e-05,1.1e-05,1e-05,2.1e-05,3.8e-05,1.2e-05,1.4e-05,1.4e-05,1.2e-05,2.4e-05,1.4e-05,1.9e-05,1.3e-05,8e-06,5e-06,1.8e-05,1.3e-05,1.8e-05,6e-06,1.5e-05,1.1e-05,2.9e-05,9e-06,1.2e-05,2.5e-05,1e-05,1.1e-05
1.8e-05,9e-06,3e-06,6e-06,1e-06,3e-06,7e-06,9e-06,5e-06,8e-06,1.1e-05,5e-06,6e-06,9e-06,3e-06,1.4e-05,1e-05,9e-06,1.1e-05,7e-06,1e-06,3e-06,4e-06,6e-06,4e-06,1e-06,6e-06,1e-05,6e-06,4e-06,1.1e-05,9e-06,4e-06,7e-06,1e-05,6e-06,4e-06,1.5e-05,7e-06,1.4e-05,6e-06,1e-06,1.3e-05,6e-06,1e-06,5e-06,5e-06,3.1e-05,2.5e-05,1.4e-05,7e-06,6e-06,1e-05,6e-06,1e-05,3e-06,4e-06,3e-06,3e-06,1.4e-05,7e-06,1.6e-05,1.6e-05,5e-06,8e-06,1.9e-05,1.5e-05,2.7e-05,3e-05,1.1e-05,4e-06,1e-05,1.7e-05,1e-05,1.8e-05,1e-06,6e-06,9e-06,7e-06,7e-06,9e-06,1.2e-05,3e-06,1.2e-05,1e-05,2e-06,6e-06,1.1e-05,1e-05,5e-06,1.8e-05,1.3e-05,1.2e-05,9e-06,5e-06,1e-05,1.3e-05,2e-05,1.9e-05,6e-06,4e-06,1e-05,3e-06,2.8e-05,1.4e-05,1.6e-05,1.4e-05,1.7e-05,1e-05,1.3e-05,1.4e-05,7e-06,1.9e-05,5e-06,3e-06,2.3e-05,1.1e-05,7e-06,1.1e-05,6e-06,6e-06
1.8e-05,6e-06,6e-06,7e-06,1e-06,3e-06,6e-06,5e-06,2e-06,6e-06,6e-06,3e-06,4e-06,3e-06,4e-06,7e-06,1.1e-05,4e-06,1.2e-05,1.1e-05,3e-06,6e-06,9e-06,8e-06,2e-06,9e-06,1e-06,8e-06,3e-06,8e-06,3e-06,2e-06,9e-06,1.1e-05,3e-06,6e-06,3e-06,1.5e-05,7e-06,1.2e-05,4e-06,3e-06,1.8e-05,6e-06,4e-06,5e-06,6e-06,2.4e-05,9e-06,1.2e-05,4e-06,4e-06,2e-06,5e-06,1.6e-05,2e-06,7e-06,6e-06,5e-06,1.1e-05,1e-06,1e-05,1.9e-05,5e-06,1e-05,3e-06,5e-06,1.4e-05,2.8e-05,5e-06,8e-06,5e-06,8e-06,5e-06,9e-06,1.1e-05,3e-06,2e-06,1.3e-05,2e-06,5e-06,1.6e-05,1.5e-05,1.6e-05,1e-05,9e-06,9e-06,3e-06,3e-06,4e-06,7e-06,9e-06,8e-06,5e-06,1.1e-05,1e-05,1.6e-05,1.3e-05,1.3e-05,8e-06,3e-06,2e-06,8e-06,1.4e-05,9e-06,1e-05,1.5e-05,8e-06,8e-06,1.3e-05,1.1e-05,2e-06,1e-05,3e-06,7e-06,1.6e-05,1e-06,1.2e-05,1.3e-05,7e-06,6e-06
1.4e-05,5e-06,6e-06,9e-06,3e-06,3e-06,4e-06,5e-06,3e-06,5e-06,4e-06,2e-06,5e-06,3e-06,7e-06,6e-06,7e-06,4e-06,1.2e-05,5e-06,4e-06,5e-06,2e-06,6e-06,3e-06,1.1e-05,7e-06,7e-06,4e-06,8e-06,5e-06,6e-06,7e-06,6e-06,6e-06,0,4e-06,1.2e-05,8e-06,8e-06,1e-06,1e-06,8e-06,6e-06,2e-06,3e-06,3e-06,1.9e-05,8e-06,9e-06,1e-05,6e-06,9e-06,6e-06,1.2e-05,2e-06,6e-06,3e-06,4e-06,1.3e-05,3e-06,6e-06,1.1e-05,5e-06,1e-05,9e-06,7e-06,1.5e-05,2.1e-05,7e-06,7e-06,7e-06,1.2e-05,4e-06,9e-06,1.2e-05,2e-06,3e-06,9e-06,4e-06,4e-06,7e-06,9e-06,1.1e-05,9e-06,1.1e-05,4e-06,9e-06,5e-06,8e-06,9e-06,2e-06,1.2e-05,1.2e-05,5e-06,4e-06,1.3e-05,1e-06,1.5e-05,6e-06,4e-06,2e-06,4e-06,1.5e-05,1.3e-05,6e-06,1.9e-05,6e-06,1.2e-05,8e-06,1e-05,7e-06,5e-06,9e-06,8e-06,1.3e-05,4e-06,3e-06,7e-06,2e-06,6e-06
1.2e-05,2e-06,3e-06,6e-06,3e-06,3e-06,5e-06,4e-06,2e-06,5e-06,2e-06,1e-06,6e-06,2e-06,5e-06,2e-06,6e-06,1e-06,1.2e-05,1e-05,5e-06,5e-06,2e-06,1e-05,1.1e-05,5e-06,5e-06,9e-06,3e-06,9e-06,6e-06,3e-06,7e-06,6e-06,6e-06,6e-06,4e-06,1e-05,9e-06,8e-06,4e-06,4e-06,1.4e-05,3e-06,3e-06,6e-06,1e-06,1.4e-05,1e-05,1.1e-05,8e-06,7e-06,1.1e-05,8e-06,1.7e-05,6e-06,6e-06,1e-06,3e-06,6e-06,4e-06,6e-06,1.2e-05,2e-06,8e-06,8e-06,5e-06,1.9e-05,1.5e-05,1.3e-05,5e-06,2e-06,1e-05,5e-06,8e-06,9e-06,2e-06,2e-06,6e-06,1e-05,5e-06,5e-06,8e-06,1e-05,9e-06,1e-05,4e-06,6e-06,8e-06,5e-06,1e-05,3e-06,1.5e-05,6e-06,1e-06,7e-06,1.2e-05,7e-06,1.4e-05,6e-06,3e-06,6e-06,4e-06,1.2e-05,1.1e-05,4e-06,6e-06,1.5e-05,1.1e-05,1e-05,1.2e-05,8e-06,3e-06,8e-06,7e-06,1.8e-05,2e-06,4e-06,7e-06,2e-06,3e-06
1.5e-05,9e-06,5e-06,7e-06,3e-06,6e-06,7e-06,5e-06,8e-06,6e-06,5e-06,2e-06,3e-06,4e-06,6e-06,4e-06,9e-06,9e-06,9e-06,6e-06,1.3e-05,5e-06,5e-06,1.3e-05,1.1e-05,1e-05,1.6e-05,9e-06,8e-06,3e-06,1e-05,1.6e-05,1e-06,3e-06,8e-06,6e-06,4e-06,4e-06,1.5e-05,9e-06,3e-06,6e-06,1e-05,9e-06,3e-06,5e-06,5e-06,1.5e-05,6e-06,2.1e-05,7e-06,9e-06,2e-06,9e-06,1e-05,4e-06,1.1e-05,8e-06,6e-06,1.1e-05,4e-06,7e-06,6e-06,6e-06,1.9e-05,1.6e-05,9e-06,1.7e-05,2.2e-05,7e-06,6e-06,3e-06,9e-06,1.1e-05,8e-06,1.7e-05,3e-06,4e-06,1e-05,9e-06,5e-06,1e-05,5e-06,1.3e-05,9e-06,7e-06,1.6e-05,4e-06,9e-06,1.2e-05,5e-06,9e-06,6e-06,1e-05,5e-06,1.8e-05,1.7e-05,1.1e-05,7e-06,2e-06,4e-06,1.1e-05,1e-05,2e-05,6e-06,9e-06,1.4e-05,1.1e-05,1.3e-05,1.1e-05,1.1e-05,2e-06,2e-06,1.8e-05,1.4e-05,1.1e-05,1e-05,4e-06,1e-05,2e-06,7e-06
1.5e-05,6e-06,5e-06,8e-06,3e-06,1e-05,1.1e-05,1.5e-05,7e-06,4e-06,1.2e-05,8e-06,3e-06,3e-06,6e-06,4e-06,6e-06,7e-06,1.8e-05,1.4e-05,1.8e-05,1.1e-05,6e-06,1.1e-05,1.8e-05,8e-06,1.7e-05,1.3e-05,6e-06,1.1e-05,1e-05,2.2e-05,1.3e-05,1.4e-05,9e-06,1.9e-05,1.2e-05,1.5e-05,1.4e-05,1e-05,1.4e-05,5e-06,8e-06,2e-05,1.2e-05,1.3e-05,8e-06,3.3e-05,1.9e-05,2.3e-05,1.7e-05,1.1e-05,8e-06,1.2e-05,2.2e-05,1.5e-05,1.1e-05,1.3e-05,2e-06,1.6e-05,7e-06,8e-06,3.2e-05,2.5e-05,2.7e-05,5e-06,8e-06,6e-06,1.9e-05,8e-06,7e-06,6e-06,7e-06,2e-06,9e-06,1.6e-05,1.8e-05,9e-06,1.5e-05,1.6e-05,9e-06,4e-06,9e-06,1.6e-05,1.3e-05,6e-06,8e-06,1.3e-05,5e-06,5e-06,1.8e-05,1.4e-05,1.3e-05,7e-06,9e-06,1.3e-05,5e-06,1.4e-05,2.2e-05,1.1e-05,1.2e-05,1e-05,1.2e-05,1.3e-05,6e-06,1.3e-05,2.4e-05,1e-05,5e-06,1.1e-05,1.7e-05,1.1e-05,1.4e-05,1.1e-05,5e-06,1.4e-05,9e-06,7e-06,1.4e-05,1.1e-05,1.3e-05
8e-06,5e-06,3e-06,6e-06,6e-06,5e-06,1.5e-05,5e-06,9e-06,7e-06,8e-06,9e-06,6e-06,7e-06,2e-06,6e-06,1.4e-05,1.1e-05,8e-06,1e-05,1.9e-05,1.9e-05,7e-06,4e-06,1.6e-05,1e-05,1.3e-05,1.6e-05,1e-05,1.5e-05,2e-05,1.6e-05,2.1e-05,1.1e-05,1.7e-05,1e-05,1e-05,2.1e-05,1.8e-05,1e-05,1.6e-05,1.9e-05,1.4e-05,2e-05,1.1e-05,1.6e-05,1.1e-05,3e-05,1.1e-05,1.7e-05,2.2e-05,1.1e-05,6e-06,9e-06,2.1e-05,1e-05,9e-06,5e-06,1e-05,1.3e-05,6e-06,1.1e-05,2.7e-05,3e-06,2.1e-05,2.3e-05,1.1e-05,1e-05,3.1e-05,1.7e-05,1.3e-05,4e-06,9e-06,1e-05,8e-06,1.9e-05,2.7e-05,1.4e-05,2.6e-05,6e-06,8e-06,3e-06,1.6e-05,1.7e-05,8e-06,1e-05,7e-06,1.1e-05,1e-05,7e-06,1.4e-05,2e-06,9e-06,1.6e-05,1.4e-05,1.1e-05,8e-06,1.3e-05,5e-06,2.4e-05,1.6e-05,1.3e-05,2e-05,1.4e-05,9e-06,1.1e-05,5e-06,1.4e-05,1e-06,1.6e-05,9e-06,0,8e-06,4e-06,1.1e-05,9e-06,8e-06,8e-06,1.4e-05,7e-06,2e-06
1e-05,5e-06,7e-06,6e-06,4e-06,6e-06,5e-06,8e-06,3e-06,4e-06,4e-06,4e-06,9e-06,6e-06,1.3e-05,1.2e-05,7e-06,1.3e-05,6e-06,1.6e-05,3e-06,8e-06,9e-06,7e-06,1.1e-05,1.1e-05,4e-06,1e-05,6e-06,6e-06,9e-06,1.4e-05,1.5e-05,1.7e-05,1.1e-05,1.1e-05,1.1e-05,8e-06,1.2e-05,1.1e-05,1.1e-05,1.2e-05,1.3e-05,2.2e-05,1.5e-05,1.5e-05,1.2e-05,7e-06,1.9e-05,7e-06,6e-06,6e-06,1.3e-05,7e-06,2e-05,7e-06,7e-06,4e-06,8e-06,1.6e-05,6e-06,7e-06,1.3e-05,1.1e-05,1.4e-05,6e-06,1.3e-05,1.4e-05,1.1e-05,2.1e-05,1.9e-05,2e-05,5e-06,7e-06,1.1e-05,1.7e-05,1e-05,1.9e-05,2.3e-05,2.5e-05,8e-06,1.2e-05,1.9e-05,1.2e-05,6e-06,3e-06,9e-06,1.2e-05,1.3e-05,2e-06,5e-06,6e-06,9e-06,1e-05,4e-06,8e-06,8e-06,7e-06,1.1e-05,1.9e-05,8e-06,6e-06,1.2e-05,1.4e-05,1.5e-05,1.3e-05,1e-05,1.3e-05,1.3e-05,1.3e-05,1.2e-05,5e-06,1e-06,1.9e-05,8e-06,1.3e-05,1.4e-05,5e-06,8e-06,1e-06,1e-05
1.4e-05,5e-06,3e-06,5e-06,3e-06,4e-06,4e-06,3e-06,3e-06,8e-06,2e-06,1e-06,8e-06,1e-06,1e-05,8e-06,2e-06,8e-06,2e-06,1.1e-05,6e-06,4e-06,5e-06,3e-06,3e-06,9e-06,5e-06,9e-06,3e-06,1e-06,8e-06,1.1e-05,1.1e-05,6e-06,2e-06,3e-06,1e-05,1.1e-05,3e-06,1e-05,8e-06,1.4e-05,1.8e-05,6e-06,5e-06,4e-06,5e-06,1.9e-05,4e-06,8e-06,4e-06,2e-06,9e-06,3e-06,1.9e-05,8e-06,5e-06,4e-06,6e-06,1.1e-05,2e-06,8e-06,1.2e-05,4e-06,7e-06,6e-06,6e-06,1.5e-05,1.8e-05,1.6e-05,5e-06,1e-05,1.4e-05,4e-06,6e-06,1e-05,9e-06,5e-06,6e-06,1.8e-05,9e-06,1.6e-05,7e-06,9e-06,5e-06,1e-06,4e-06,1.3e-05,1.2e-05,1.4e-05,1.4e-05,4e-06,4e-06,9e-06,6e-06,6e-06,9e-06,2e-06,2e-06,8e-06,5e-06,2e-06,1.3e-05,1.3e-05,1.3e-05,8e-06,6e-06,8e-06,9e-06,2e-06,9e-06,4e-06,8e-06,1.1e-05,1e-05,5e-06,4e-06,8e-06,1.3e-05,8e-06,1.4e-05
1.2e-05,4e-06,5e-06,4e-06,2e-06,2e-06,5e-06,1e-06,3e-06,5e-06,3e-06,2e-06,4e-06,3e-06,7e-06,1e-05,7e-06,0,5e-06,5e-06,3e-06,3e-06,6e-06,4e-06,2e-06,6e-06,3e-06,1e-05,5e-06,1e-06,7e-06,9e-06,7e-06,3e-06,4e-06,5e-06,1.3e-05,9e-06,7e-06,1e-05,3e-06,5e-06,1.7e-05,9e-06,3e-06,5e-06,9e-06,1.6e-05,1e-06,5e-06,1e-06,2e-06,6e-06,2e-06,1.5e-05,6e-06,4e-06,3e-06,4e-06,1.2e-05,4e-06,8e-06,6e-06,4e-06,1e-06,8e-06,8e-06,1.4e-05,1.5e-05,9e-06,3e-06,8e-06,3e-06,2e-06,3e-06,1e-05,6e-06,8e-06,8e-06,1.4e-05,7e-06,7e-06,1e-06,7e-06,8e-06,1e-06,1.1e-05,1.2e-05,2e-06,3e-06,8e-06,3e-06,2e-06,8e-06,6e-06,2e-06,4e-06,2e-06,9e-06,7e-06,2e-06,2e-06,1e-05,1.4e-05,8e-06,4e-06,7e-06,4e-06,2e-06,1e-06,5e-06,3e-06,8e-06,6e-06,5e-06,7e-06,4e-06,4e-06,3e-06,2e-06,6e-06
1.3e-05,3e-06,5e-06,7e-06,1e-06,2e-06,5e-06,1e-06,1e-06,5e-06,2e-06,4e-06,4e-06,2e-06,8e-06,9e-06,4e-06,6e-06,4e-06,4e-06,4e-06,2e-06,2e-06,1e-06,1e-06,3e-06,5e-06,4e-06,3e-06,4e-06,8e-06,6e-06,4e-06,4e-06,2e-06,2e-06,9e-06,1.1e-05,7e-06,8e-06,4e-06,8e-06,1.4e-05,5e-06,1e-06,2e-06,4e-06,2e-05,6e-06,5e-06,3e-06,3e-06,7e-06,4e-06,1.2e-05,2e-06,3e-06,5e-06,3e-06,1e-05,4e-06,6e-06,1e-05,3e-06,4e-06,5e-06,9e-06,1.5e-05,1.3e-05,8e-06,2e-06,6e-06,8e-06,1e-06,5e-06,1.2e-05,7e-06,4e-06,1.1e-05,5e-06,1e-06,7e-06,6e-06,9e-06,8e-06,3e-06,1e-05,6e-06,3e-06,4e-06,6e-06,4e-06,2e-06,9e-06,3e-06,4e-06,5e-06,0,1.3e-05,1e-05,3e-06,4e-06,1.2e-05,1e-05,1.3e-05,7e-06,8e-06,2e-06,6e-06,3e-06,9e-06,5e-06,7e-06,8e-06,4e-06,5e-06,3e-06,2e-06,3e-06,1e-06,7e-06
1.3e-05,4e-06,5e-06,4e-06,1e-06,1e-06,3e-06,2e-06,2e-06,4e-06,3e-06,4e-06,6e-06,3e-06,9e-06,8e-06,3e-06,3e-06,5e-06,2e-06,1e-06,2e-06,1e-06,3e-06,2e-06,3e-06,4e-06,9e-06,3e-06,5e-06,7e-06,2e-06,5e-06,4e-06,4e-06,3e-06,9e-06,6e-06,9e-06,5e-06,2e-06,8e-06,1.2e-05,7e-06,3e-06,3e-06,3e-06,2e-05,3e-06,5e-06,4e-06,4e-06,7e-06,4e-06,1.2e-05,4e-06,2e-06,2e-06,3e-06,9e-06,4e-06,8e-06,7e-06,3e-06,4e-06,8e-06,6e-06,1.9e-05,1.1e-05,5e-06,3e-06,4e-06,5e-06,3e-06,4e-06,1.1e-05,5e-06,4e-06,9e-06,7e-06,3e-06,3e-06,3e-06,7e-06,1.1e-05,4e-06,5e-06,1e-05,7e-06,2e-06,6e-06,1e-06,1e-06,7e-06,6e-06,5e-06,7e-06,1e-06,7e-06,8e-06,4e-06,4e-06,9e-06,1.4e-05,1.2e-05,2e-06,1.1e-05,3e-06,8e-06,7e-06,3e-06,6e-06,5e-06,9e-06,7e-06,9e-06,5e-06,0,3e-06,3e-06,1.2e-05
1.2e-05,4e-06,3e-06,6e-06,3e-06,3e-06,5e-06,3e-06,1e-06,4e-06,3e-06,2e-06,5e-06,1e-06,7e-06,8e-06,3e-06,2e-06,5e-06,3e-06,1e-06,2e-06,1e-06,2e-06,2e-06,3e-06,3e-06,5e-06,1e-06,5e-06,8e-06,1e-06,2e-06,3e-06,2e-06,2e-06,7e-06,5e-06,8e-06,6e-06,1e-06,7e-06,9e-06,2e-06,3e-06,3e-06,6e-06,1.3e-05,7e-06,2e-06,2e-06,3e-06,9e-06,1e-06,1.4e-05,2e-06,2e-06,3e-06,3e-06,1e-05,1e-06,5e-06,9e-06,4e-06,5e-06,6e-06,3e-06,1.5e-05,1e-05,7e-06,6e-06,4e-06,4e-06,1e-06,4e-06,1e-05,5e-06,6e-06,1.1e-05,6e-06,4e-06,2e-06,2e-06,5e-06,8e-06,3e-06,3e-06,6e-06,5e-06,7e-06,3e-06,1e-06,1e-06,1e-06,4e-06,4e-06,4e-06,0,9e-06,6e-06,2e-06,2e-06,8e-06,1.1e-05,1.2e-05,2e-06,6e-06,5e-06,6e-06,7e-06,8e-06,5e-06,8e-06,7e-06,8e-06,1.1e-05,5e-06,1e-06,5e-06,1e-06,7e-06
1.2e-05,2e-06,4e-06,7e-06,3e-06,1e-06,4e-06,3e-06,1e-06,5e-06,2e-06,3e-06,4e-06,1e-06,1e-05,4e-06,4e-06,4e-06,2e-06,4e-06,1e-06,1e-06,1e-06,2e-06,2e-06,1e-06,1e-06,6e-06,1e-06,2e-06,8e-06,3e-06,3e-06,3e-06,1e-06,1e-06,7e-06,7e-06,7e-06,6e-06,1e-06,8e-06,1.1e-05,4e-06,1e-06,1e-06,5e-06,1.7e-05,6e-06,3e-06,2e-06,3e-06,8e-06,1e-06,1.3e-05,1e-06,1e-06,2e-06,3e-06,1e-05,1e-06,4e-06,8e-06,2e-06,3e-06,5e-06,4e-06,1.5e-05,1.1e-05,3e-06,1e-06,3e-06,3e-06,2e-06,3e-06,9e-06,5e-06,4e-06,8e-06,5e-06,3e-06,2e-06,3e-06,8e-06,9e-06,3e-06,2e-06,7e-06,2e-06,3e-06,5e-06,2e-06,2e-06,2e-06,6e-06,0,6e-06,2e-06,1e-05,6e-06,3e-06,4e-06,8e-06,1.2e-05,1.3e-05,1e-06,6e-06,2e-06,7e-06,4e-06,7e-06,3e-06,4e-06,9e-06,6e-06,6e-06,4e-06,1e-06,6e-06,2e-06,7e-06
1.2e-05,2e-06,3e-06,6e-06,1e-06,2e-06,5e-06,1e-06,2e-06,4e-06,0,2e-06,4e-06,1e-06,1e-05,8e-06,2e-06,1e-06,5e-06,5e-06,1e-06,1e-06,1e-06,3e-06,2e-06,3e-06,1e-06,7e-06,2e-06,3e-06,8e-06,3e-06,2e-06,2e-06,1e-06,0,7e-06,7e-06,7e-06,6e-06,2e-06,8e-06,9e-06,4e-06,2e-06,1e-06,2e-06,1.7e-05,2e-06,7e-06,2e-06,4e-06,8e-06,0,1.4e-05,2e-06,0,2e-06,1e-06,1e-05,1e-06,3e-06,9e-06,1e-06,5e-06,4e-06,4e-06,1.4e-05,1.1e-05,6e-06,1e-06,3e-06,4e-06,1e-06,3e-06,9e-06,4e-06,4e-06,8e-06,8e-06,2e-06,1e-06,3e-06,5e-06,8e-06,2e-06,6e-06,6e-06,1e-06,2e-06,5e-06,2e-06,2e-06,4e-06,4e-06,2e-06,5e-06,2e-06,1e-05,5e-06,2e-06,1e-06,8e-06,1.1e-05,1.2e-05,3e-06,8e-06,1e-06,7e-06,4e-06,7e-06,3e-06,6e-06,9e-06,6e-06,8e-06,4e-06,1e-06,4e-06,1e-06,7e-06
1.2e-05,3e-06,3e-06,5e-06,2e-06,3e-06,4e-06,2e-06,2e-06,4e-06,0,1e-06,3e-06,0,7e-06,7e-06,0,2e-06,4e-06,6e-06,1e-06,2e-06,0,3e-06,2e-06,2e-06,1e-06,6e-06,1e-06,3e-06,8e-06,2e-06,2e-06,2e-06,0,0,7e-06,7e-06,8e-06,6e-06,2e-06,8e-06,1e-05,5e-06,2e-06,1e-06,4e-06,1.6e-05,3e-06,4e-06,1e-06,3e-06,7e-06,1e-06,1.3e-05,3e-06,1e-06,2e-06,1e-06,9e-06,1e-06,4e-06,8e-06,2e-06,5e-06,7e-06,4e-06,1.3e-05,1.2e-05,5e-06,1e-06,3e-06,4e-06,1e-06,4e-06,8e-06,4e-06,3e-06,1e-05,7e-06,2e-06,0,3e-06,6e-06,7e-06,3e-06,5e-06,4e-06,1e-06,2e-06,4e-06,2e-06,2e-06,3e-06,3e-06,2e-06,6e-06,1e-06,1e-05,5e-06,2e-06,2e-06,8e-06,1e-05,1.2e-05,3e-06,7e-06,1e-06,6e-06,2e-06,7e-06,4e-06,6e-06,8e-06,5e-06,7e-06,4e-06,1e-06,4e-06,0,6e-06
