0.090425,0.154739,0.163864,0.320903,0.532037,0.490319,0.406934,0.397331,0.432407,0.581679,0.65424,0.541924,0.34956,0.216686,0.17129,0.18296,0.17296,0.133586,0.112619,0.096777,0.072396,0.056739,0.052861,0.050033,0.040669,0.037948,0.037574,0.038015
0.101748,0.172581,0.183983,0.357023,0.594727,0.552055,0.472157,0.468148,0.504363,0.665304,0.742405,0.624346,0.410035,0.257824,0.199002,0.203584,0.190664,0.151834,0.131973,0.112238,0.08309,0.066282,0.061928,0.058529,0.048431,0.044997,0.044087,0.045211
0.118348,0.197545,0.211149,0.412543,0.705128,0.67005,0.600129,0.605222,0.635147,0.796139,0.86971,0.749666,0.504986,0.324492,0.243069,0.22857,0.207521,0.174543,0.159969,0.132591,0.096208,0.08004,0.075033,0.070482,0.060249,0.055267,0.053213,0.056241
0.132004,0.215966,0.228104,0.470809,0.857815,0.859119,0.785548,0.784824,0.796822,0.928999,0.97744,0.847606,0.570073,0.373261,0.282018,0.238523,0.199806,0.181757,0.177965,0.139946,0.098115,0.086582,0.081448,0.075097,0.066534,0.059982,0.056747,0.062509
0.149248,0.240126,0.257019,0.607015,1.163536,1.216286,1.10068,1.073554,1.072018,1.183691,1.172512,0.965779,0.619929,0.401859,0.322806,0.249991,0.188246,0.183731,0.188214,0.141108,0.095681,0.090201,0.086539,0.077696,0.0689,0.062466,0.059609,0.066958
0.191854,0.304079,0.318226,0.852412,1.690927,1.838096,1.687961,1.635186,1.599027,1.704332,1.629158,1.261245,0.747694,0.449091,0.391427,0.308136,0.220829,0.20191,0.197524,0.146474,0.10662,0.108952,0.104753,0.088891,0.072603,0.069415,0.0706,0.07949
0.274982,0.434167,0.455906,1.346793,2.702952,3.059622,2.943741,2.866586,2.752244,2.825391,2.668872,2.040339,1.164129,0.659475,0.597869,0.493132,0.364274,0.305605,0.262281,0.190274,0.151754,0.157783,0.148278,0.122228,0.095745,0.095105,0.097397,0.10671
0.373607,0.595716,0.702116,2.307231,4.565242,5.288347,5.286894,5.169865,4.957259,4.956062,4.584752,3.47951,1.986286,1.127517,1.022476,0.865428,0.652835,0.5288,0.424576,0.29732,0.234677,0.237612,0.219702,0.184549,0.151094,0.146521,0.144486,0.151943
0.464035,0.749045,1.035751,3.798465,7.40169,8.672393,8.864939,8.717713,8.455069,8.274015,7.466957,5.64014,3.223754,1.837239,1.673969,1.444931,1.092395,0.864776,0.672207,0.450577,0.336125,0.329437,0.308615,0.270853,0.237688,0.219716,0.207707,0.217546
0.585766,0.944128,1.411178,5.588295,10.761424,12.696852,13.14103,13.023126,12.859568,12.323754,10.931493,8.38535,4.836903,2.748883,2.523863,2.19946,1.631526,1.267861,0.975329,0.62431,0.436853,0.417165,0.405258,0.374182,0.353748,0.312628,0.28047,0.302179
0.721399,1.148101,1.686631,7.036272,13.561992,16.079302,16.605144,16.561052,16.647978,15.677683,13.886642,11.090898,6.59594,3.718041,3.368169,2.91769,2.096016,1.621925,1.277129,0.785554,0.519041,0.494261,0.504063,0.480937,0.479626,0.414351,0.350869,0.385792
0.816911,1.275244,1.700068,7.372715,14.446679,17.005333,17.195455,17.244109,17.455375,16.135824,14.429092,12.162322,7.630477,4.290665,3.745134,3.210456,2.244386,1.756573,1.439011,0.851986,0.535784,0.524055,0.567354,0.54821,0.551679,0.475859,0.385967,0.4231
0.784179,1.184251,1.467169,6.49599,12.718081,14.291839,13.806735,13.933305,14.111345,12.843116,11.623883,10.373196,6.938093,3.915824,3.25921,2.761439,1.916162,1.529983,1.28642,0.739953,0.451735,0.464004,0.52774,0.50879,0.505612,0.449199,0.369643,0.393407
0.608033,0.879409,1.122523,4.728147,8.862935,9.24832,8.315525,8.368479,8.481663,7.835548,7.32542,6.661692,4.614036,2.620942,2.094823,1.736974,1.194807,0.97895,0.854738,0.49854,0.318122,0.351872,0.402534,0.37934,0.368032,0.352142,0.305298,0.30824
0.400083,0.556506,0.76123,2.756124,4.88382,4.878683,4.27473,4.243122,4.127965,3.935959,3.822755,3.316534,2.212983,1.269513,1.008121,0.791941,0.535414,0.456831,0.436924,0.290509,0.225939,0.273021,0.291435,0.261763,0.243772,0.255787,0.234353,0.228406
0.28393,0.392078,0.518485,1.463318,2.607854,2.786357,2.664958,2.581663,2.299456,2.317952,2.317559,1.788801,1.025609,0.612192,0.55041,0.415401,0.262435,0.224451,0.229861,0.188516,0.188192,0.235151,0.24656,0.218286,0.178751,0.206886,0.217877,0.221218
0.269725,0.388784,0.47008,1.122596,2.305813,2.549662,2.308412,2.187963,1.835473,1.856605,1.874269,1.459871,0.844831,0.528977,0.525919,0.403479,0.22612,0.187769,0.197556,0.173738,0.1914,0.235016,0.258728,0.229947,0.153263,0.206573,0.270466,0.277726
0.309689,0.494188,0.552125,1.180234,2.722276,2.986369,2.506038,2.431096,1.942771,1.764433,1.765556,1.540353,1.024258,0.638848,0.580746,0.450702,0.247999,0.189929,0.214289,0.190459,0.217486,0.266948,0.295814,0.255463,0.141157,0.229179,0.360931,0.356183
0.39316,0.683207,0.734896,1.417981,3.266426,3.497911,2.87995,2.921536,2.286239,1.900763,1.953291,1.914769,1.400107,0.853904,0.657395,0.490251,0.285316,0.224634,0.27186,0.22829,0.240577,0.30657,0.343514,0.287816,0.141279,0.266032,0.474612,0.441064
0.483843,0.873996,0.933596,1.655065,3.553452,3.674011,3.076001,3.264481,2.660636,2.195932,2.309223,2.468676,1.877896,1.139991,0.782431,0.523329,0.331975,0.292748,0.343463,0.276116,0.259712,0.340379,0.38906,0.328311,0.170534,0.332531,0.601993,0.523069
0.526935,0.941312,1.020968,1.760473,3.389049,3.429099,3.007645,3.169787,2.818779,2.563757,2.752796,3.056759,2.298783,1.350223,0.878687,0.529068,0.379283,0.370523,0.391877,0.301941,0.26477,0.353382,0.407259,0.358008,0.225495,0.403479,0.681339,0.553518
0.474641,0.81054,0.923415,1.722893,2.964848,2.957368,2.781538,2.740977,2.635625,2.74819,3.009423,3.355533,2.47184,1.37725,0.851671,0.496399,0.416377,0.414257,0.386073,0.291787,0.25438,0.359815,0.415518,0.371223,0.288736,0.441941,0.662585,0.508855
0.37603,0.581647,0.771795,1.637432,2.631568,2.582671,2.519655,2.315793,2.230464,2.541203,2.713859,2.92042,2.209983,1.21469,0.707833,0.473952,0.448917,0.401436,0.336154,0.266713,0.249313,0.386868,0.449733,0.381757,0.343782,0.457646,0.575953,0.434986
0.331409,0.456473,0.71497,1.635044,2.518927,2.267586,2.104146,2.035477,1.954938,2.143748,2.010661,1.969207,1.645681,0.991287,0.594876,0.487513,0.463762,0.367118,0.277223,0.236783,0.267372,0.437351,0.499017,0.401705,0.398547,0.48804,0.494336,0.39176
0.300826,0.398443,0.682532,1.662296,2.46057,1.896505,1.705413,1.971828,1.950747,1.985541,1.512131,1.175307,1.057965,0.741568,0.536373,0.482683,0.443338,0.347953,0.236669,0.205332,0.293852,0.455921,0.481769,0.401352,0.434854,0.504724,0.437829,0.362879
0.229883,0.323953,0.6176,1.613913,2.36518,1.685885,1.575356,1.992967,1.901156,1.897256,1.339981,0.818621,0.676942,0.527523,0.457888,0.39157,0.342807,0.291036,0.188384,0.17054,0.291753,0.395214,0.378528,0.341373,0.386425,0.449923,0.38817,0.330551
0.151303,0.260209,0.542694,1.482962,2.158306,1.535889,1.536379,1.901266,1.591993,1.572897,1.192193,0.644899,0.483285,0.397374,0.339158,0.258348,0.216933,0.204774,0.156007,0.158341,0.247413,0.275732,0.254626,0.254746,0.262986,0.307342,0.285146,0.260823
0.113174,0.228814,0.488501,1.319879,1.852536,1.363838,1.58785,1.87192,1.275134,1.195501,1.001816,0.534976,0.434878,0.382651,0.269359,0.186786,0.16416,0.137769,0.124756,0.132989,0.164198,0.151777,0.141022,0.152429,0.134626,0.181218,0.200116,0.189768
0.123665,0.238639,0.531226,1.38509,1.763907,1.259044,1.59908,1.84827,1.166924,1.039978,0.871591,0.471451,0.407645,0.403059,0.284575,0.187912,0.167408,0.123207,0.117529,0.105687,0.095782,0.0875,0.0781,0.077364,0.065617,0.123221,0.158752,0.138324
0.14117,0.253268,0.592521,1.512899,1.819282,1.247067,1.449661,1.632979,1.083828,0.930088,0.781779,0.478888,0.404355,0.43428,0.318884,0.195615,0.166361,0.135492,0.139128,0.110234,0.09039,0.082147,0.064249,0.059782,0.046628,0.092197,0.128642,0.128374
0.154572,0.257469,0.630814,1.586274,1.807974,1.14407,1.125901,1.248529,0.94409,0.795288,0.733797,0.552665,0.436622,0.458076,0.338084,0.184149,0.146386,0.139296,0.149734,0.122232,0.10631,0.090527,0.069907,0.064799,0.046847,0.079387,0.103561,0.133228
0.153976,0.23757,0.616423,1.526174,1.628055,0.969296,0.786678,0.850003,0.762047,0.711049,0.75243,0.590514,0.416743,0.409587,0.302626,0.157598,0.135019,0.143146,0.138405,0.114838,0.106893,0.087839,0.074021,0.071521,0.051256,0.068312,0.079658,0.138894
0.140598,0.229395,0.57039,1.318727,1.326171,0.781809,0.612086,0.6154,0.622198,0.644598,0.690437,0.54108,0.355094,0.321098,0.245309,0.156298,0.154841,0.151856,0.124728,0.094421,0.085944,0.072638,0.072386,0.06914,0.047149,0.054188,0.061317,0.132259
0.120877,0.213646,0.476144,1.057836,1.085408,0.65479,0.526975,0.594309,0.625638,0.56023,0.561263,0.480467,0.318758,0.299734,0.23513,0.165866,0.174133,0.145509,0.11432,0.078121,0.054035,0.049932,0.065385,0.060679,0.036632,0.047567,0.056747,0.110036
0.106369,0.179512,0.380037,0.958758,1.113278,0.718324,0.557032,0.62905,0.682312,0.529943,0.46824,0.462165,0.322907,0.309319,0.247082,0.174936,0.16713,0.122149,0.104052,0.074394,0.037417,0.034073,0.064482,0.060115,0.03185,0.044955,0.0506,0.078802
0.093403,0.148221,0.38495,1.130802,1.416612,0.963207,0.682692,0.60352,0.659346,0.543442,0.441644,0.478945,0.339209,0.272369,0.243152,0.173545,0.15038,0.118317,0.107727,0.085551,0.042246,0.031782,0.067323,0.066589,0.03503,0.047637,0.048172,0.066034
0.088764,0.151861,0.45835,1.301986,1.662026,1.25794,0.788863,0.486778,0.565081,0.620774,0.5173,0.491698,0.3278,0.199706,0.22222,0.165163,0.128924,0.11794,0.105627,0.091099,0.046369,0.03464,0.069178,0.074925,0.043196,0.054028,0.054118,0.072679
0.090783,0.152735,0.49937,1.366071,1.754939,1.518054,0.874237,0.427812,0.539541,0.753747,0.613201,0.457115,0.333481,0.171959,0.199772,0.167277,0.113896,0.113362,0.102035,0.083105,0.042701,0.036527,0.06608,0.076014,0.0461,0.053023,0.055925,0.077326
0.091406,0.146173,0.472906,1.440098,2.012175,1.731301,0.934476,0.516845,0.624514,0.896435,0.703814,0.419448,0.338325,0.174944,0.176589,0.164667,0.102919,0.102121,0.09123,0.067601,0.036285,0.033272,0.054727,0.06541,0.039382,0.042546,0.053552,0.079058
0.088216,0.158948,0.408287,1.464607,2.278761,1.768146,0.865754,0.592927,0.654675,0.937722,0.765405,0.417559,0.31069,0.173635,0.156316,0.150368,0.101039,0.083584,0.069023,0.053572,0.032767,0.026109,0.038838,0.046422,0.026035,0.029423,0.049736,0.078486
