7e-06,-0.000194,-0.000121,-0.000196,-0.000138,9.4e-05,-0.00017,2.1e-05,-3.6e-05,-0.000123,-0.000171,-0.000499,-0.000194,-0.00063,-0.000791,-0.001102,-0.000623,-0.000817,-0.000648,-0.000344,-0.000692,-0.000837,-0.000883,-0.000629,-0.000687,-0.000766,-0.001299,-0.001001,-0.000847,-0.000892,-0.000938,-0.000256,-0.000954,-0.000517,-0.001343,-0.001774,-0.001455,-0.000926,-0.000593,-0.001335,-0.000899,-0.000649,-0.000563,-0.000695,-0.00157,-0.001236,-0.000788,-0.000906,-0.00077,-0.001196,-0.001342,-0.000897,-0.001046,-0.00163,-0.001889,-0.001664,-0.002426,-0.001594,-0.001034,-0.000959,-0.001333,-0.001994,-0.0016,-0.000773,-0.000997,-0.001261,-0.00132,-0.001598,-0.001229,-0.000942,-0.001227,-0.00116,-0.000207,-0.001321,-0.001006,-0.001,-0.002882,-0.001431,-0.000928,-0.000976,-0.001316,-0.001583,-0.001427,-0.001047,-0.001264,-0.001398,-0.001472,-0.00125,-0.000626,-0.002097,-0.001662,-0.001401,-0.001944,-0.002485,-0.001651,-0.000859,-0.00218,-0.002608,-0.002438,-0.002133,-0.001516,-0.001317,-0.002062,-0.002171,-0.002731,-0.0016,-0.001327,-0.00152,-0.002238,-0.001772,-0.001402,-0.001816,-0.001404,-0.0016,-0.00422,-0.002785,-0.003397,-0.001816,-0.002782,-0.001677,-0.002611
-0.000137,0.000108,0.000357,0.000221,-6.9e-05,-0.000317,-6.6e-05,-6.5e-05,-3e-05,-9e-06,0.000123,0.000222,-3e-06,-6e-06,0.00022,0.000565,0.000388,0.000193,0.000239,-0.000315,-8e-06,-0.00018,-0.000162,-0.000299,-7.1e-05,-6.7e-05,0.000276,0.000333,-2.5e-05,3.6e-05,0.00021,-1.3e-05,0.000714,0.000218,0.000714,0.001085,0.001157,0.000106,-0.000346,0.000238,0.000204,0.000267,-6.7e-05,0.000487,0.001045,0.000624,0.000177,0.000227,0.000105,0.000293,0.000664,0.000418,0.000602,0.000321,0.00056,0.001043,0.001608,0.000748,0.00037,0.00025,0.001029,0.000764,0.000852,-0.000465,-0.000152,0.000105,0.000474,5e-04,0.000455,0.000271,-0.000179,9.4e-05,-0.000154,-7.8e-05,-4.2e-05,-0.000164,0.001911,0.001295,-0.000314,0.000304,0.000482,0.000882,0.00048,-0.000198,0.000225,-3.9e-05,0.000153,1.3e-05,-0.000559,0.000434,0.000726,0.000419,0.000662,0.000325,0.000502,-0.000739,0.000308,0.001002,0.001352,0.000859,-4.8e-05,-7e-06,0.001262,0.000472,0.000945,0.000583,-8.4e-05,0.000251,0.00062,0.00042,0.00052,0.000204,0.00012,2.2e-05,0.002931,0.001291,0.00151,-0.000345,0.001042,0.000648,0.001728
-9.2e-05,-0.000261,-0.000115,-0.000344,-3.6e-05,2.1e-05,-1.4e-05,5.2e-05,-0.000164,-4e-05,4e-06,2.9e-05,-1.7e-05,0.00015,-0.000408,-0.000378,-0.000202,-0.000284,2e-05,0.00021,5.6e-05,0.000572,0.000384,-0.000158,5.4e-05,0.000163,0.000131,-2.3e-05,8.5e-05,0.000215,0.000181,0.000747,-0.000407,-0.000351,-0.000429,-0.000614,-0.000862,-0.000182,0.000276,0.000586,0.000552,7.3e-05,3.7e-05,-0.000254,-0.00043,-0.000294,-0.000349,-0.000211,-1.6e-05,-0.000277,-0.000577,-0.000395,-0.000495,0.000325,0.000335,-0.000278,-0.000673,-0.000195,-0.000412,0.000116,-0.000767,-0.000554,-0.000232,0.00016,-0.00024,-0.000402,-0.000383,0.000206,5.9e-05,3e-04,0.000197,0.000312,0.000334,0.000266,0.000483,0.000263,-0.000816,-0.000978,-0.000159,-0.000315,-0.000406,-0.00045,0.000136,0.00021,0.000498,0.000465,0.000383,0.000243,0.000208,6.7e-05,-0.00051,-0.000771,-0.000367,0.000387,-7.9e-05,0.000492,0.000679,-0.000619,-0.00113,-0.000492,8.9e-05,3.7e-05,-0.000671,0.000202,-5.4e-05,0.000221,0.000224,-4.4e-05,7.6e-05,0.00013,-0.000332,0.00016,-0.000415,0.000271,-0.00151,-0.001131,-0.000103,0.001107,0.000178,-0.000179,-0.000564
-6e-06,-1.1e-05,-1e-05,9.5e-05,0.000113,4.2e-05,-3.8e-05,-0.000249,7.1e-05,-0.000304,-0.000181,-0.000118,-3.2e-05,-0.000252,0.000155,0.000142,1.6e-05,0.000122,-6.6e-05,7.6e-05,-5e-05,-0.000514,-0.000474,-0.000155,-0.000325,-0.000129,-0.000695,-0.000467,-0.00029,-0.000485,-0.000629,-0.00098,-0.00017,-9.2e-05,5.1e-05,7.3e-05,0.000631,0.000279,-5.3e-05,-0.000656,-0.000848,-0.000142,3e-05,-0.000316,0.000193,4.6e-05,3.9e-05,0.000204,-0.000222,-0.000119,-2.5e-05,-0.000224,0.000205,-0.000317,-0.000357,-0.000494,3.9e-05,-0.00025,5.6e-05,-0.00015,0.000356,0.000196,-0.000238,6.6e-05,-1.7e-05,-0.000258,8.1e-05,-0.000645,-0.000416,-5.2e-05,-0.000521,-0.000476,-0.000351,-0.000651,-0.000835,9.6e-05,0.000198,0.000895,0.000381,0.00018,6.4e-05,-9e-05,-0.000212,-6.8e-05,-0.000139,-0.000403,-0.000429,-3.6e-05,0.000302,-0.000331,0.000303,0.000751,7.8e-05,-0.00047,0.00012,-0.000233,-0.001152,-0.000517,0.000599,0.000283,-0.00021,-0.000143,8.6e-05,-0.000314,-0.00083,-0.000948,-0.000355,-0.000196,-0.000225,7.8e-05,0.00026,2.5e-05,0.000154,0.000173,0.000332,0.000645,-0.000556,-0.001088,-0.000462,0.000209,0.000152
7e-05,1.3e-05,0.000125,-1e-05,9.5e-05,5e-06,5.9e-05,6e-06,4e-06,8.1e-05,-0.000126,-8e-05,8.1e-05,2.7e-05,-4.7e-05,2.1e-05,-2e-04,-0.000208,1.1e-05,3e-05,0.00012,0.000132,0.000424,0.000556,0.000395,2.7e-05,0.00059,0.000642,0.000385,9.3e-05,0.000442,0.000266,-3.4e-05,0.000193,0.000213,0.000188,-0.000595,-0.000171,-3.8e-05,0.000328,0.000502,0.000159,6.6e-05,3.5e-05,-0.000115,-4.1e-05,5.3e-05,2.3e-05,0.00043,0.000219,-6e-05,0.000471,-6.6e-05,-0.000244,0.000192,0.000633,-6.7e-05,0.00053,5.9e-05,-0.000117,-0.000281,-9.7e-05,0.000384,2e-04,0.000301,0.000171,0.000147,0.000195,0.000218,-7e-05,0.000564,0.000601,-2.1e-05,0.00063,0.00069,-1.3e-05,-0.000425,-0.000757,-0.000117,0.000261,0.000306,-0.00013,9e-06,-0.000168,-2.1e-05,4.4e-05,9.5e-05,-8.6e-05,-0.000223,0.000315,-0.000217,-0.000451,6.2e-05,0.000308,-0.000136,0.000393,0.000501,0.000707,0.000343,8.8e-05,0.000266,-8.2e-05,-0.000188,0.000326,0.001086,0.000933,0.000621,0.000348,0.000261,-0.00028,2.2e-05,-0.000216,2.4e-05,-0.000554,7.6e-05,-7.1e-05,0.000316,0.000295,0.000205,0.000248,0.000167
3.6e-05,0.000117,-0.000162,-6.5e-05,9.6e-05,-0.000115,-0.000163,-9.9e-05,-0.000238,8e-05,6.4e-05,5.9e-05,6.4e-05,2.1e-05,2.5e-05,-0.000115,0.000219,0.000257,9.3e-05,-0.000223,-6.9e-05,-0.000298,-0.000435,-0.000343,3e-06,-0.000186,-0.000364,-0.000269,-0.000206,0.00016,-0.000272,0.000163,-6.4e-05,-0.000378,9.1e-05,-0.000157,5e-05,6.4e-05,-1.8e-05,-9.2e-05,-0.000516,-9.3e-05,-0.000222,3.1e-05,-0.000113,-3e-06,6.6e-05,-0.000162,-0.00033,-0.000144,0.000322,-0.000308,-3.8e-05,0.000324,-0.000148,-0.000555,-0.000172,-0.000428,-0.000305,1.2e-05,0.000194,-1.3e-05,-0.000651,-3.3e-05,2.2e-05,0.000161,6.2e-05,0.000153,9.4e-05,9.7e-05,-6.4e-05,-0.000284,-8.8e-05,-0.000285,7.5e-05,-1.9e-05,0.000282,0.000643,0.000286,-0.00037,-0.000458,-1e-05,7.3e-05,0.000418,-0.000106,0.000145,0.000102,-0.000233,-1.6e-05,0.000228,0.000129,-3.2e-05,-7.4e-05,7.8e-05,-0.000128,1.3e-05,-0.000314,-0.000324,-0.000324,-0.000439,-0.000614,0.000588,0.000425,-0.000182,-0.000711,-3e-04,-0.000285,-0.000483,-0.00025,6e-06,0.000155,2.3e-05,0.000314,0.000437,-0.000149,-0.00095,-0.000515,-0.000496,0.000136,-0.000242,-0.000385
-0.000139,4e-05,4.4e-05,-4.4e-05,-4e-05,6e-06,-0.000148,0.000149,-1.6e-05,9.7e-05,-3.9e-05,4e-05,0.000116,3e-06,-2.5e-05,-1e-04,-0.000244,-0.000138,-0.000167,6.3e-05,-2.6e-05,0.000162,0.000244,5.9e-05,-0.000124,0.000123,0.000282,0.000119,0.000107,-6e-05,0.000143,-0.00018,0.00015,0.000296,-5.6e-05,-3.4e-05,-0.000118,0.000158,-0.000126,-0.000107,0.000111,0.000154,0.000165,3e-06,6.5e-05,0.000234,-9.1e-05,-3.8e-05,4.1e-05,0.000154,-0.000366,0.000304,8.3e-05,-0.000326,-0.000108,0.000387,0.000243,0.000313,0.000194,6.4e-05,5.2e-05,-2.2e-05,0.000562,-0.000305,-0.000388,0.000212,-0.000296,-0.000226,-0.000269,-0.000141,-0.00023,1.9e-05,-4.6e-05,-2.2e-05,-0.000338,-0.000143,-0.000214,-0.00031,-0.000492,0.000103,5.2e-05,-0.000113,7.6e-05,-0.000266,-0.00019,-0.000247,2.8e-05,0.000467,0.000365,-0.000277,-0.000216,0.000138,-5.4e-05,-0.00028,0.000304,9.5e-05,9.3e-05,2.8e-05,3e-06,0.000422,0.000519,-9.9e-05,-0.000219,0.00037,0.000273,-0.00027,-3.5e-05,0.000115,0.000343,-6.8e-05,-0.000199,-6.2e-05,-0.000126,-0.000238,-1.4e-05,0.001225,0.00047,0.001102,0.000113,-2e-06,0.000457
-5.7e-05,-0.000123,-0.000103,-4.5e-05,-0.000116,-3.6e-05,0.000157,4.6e-05,-2.4e-05,-2.2e-05,-4.9e-05,-0.00013,-8.3e-05,-0.000166,-8.6e-05,0.000151,0.000233,6.1e-05,0.000105,-8.8e-05,0.000199,-0.000116,-9.1e-05,2.2e-05,4.7e-05,-1.3e-05,-9.6e-05,-0.00012,-0.000284,-0.00011,-2e-04,0.000223,-2.9e-05,-0.000106,-4.2e-05,0.000138,9.4e-05,-8.3e-05,-0.00012,0.000214,4.9e-05,-0.000154,-8.8e-05,1.6e-05,-0.000206,-6e-06,-0.00023,-9.2e-05,-0.000135,6.4e-05,0.000288,-0.000259,-0.000131,0.000367,3.6e-05,6.1e-05,-9e-05,-0.000308,-4.4e-05,0.000172,-6.7e-05,-6.4e-05,-0.000298,0.000186,0.000343,-0.00019,0.000224,0.000388,0.00023,2.6e-05,0.000433,1.8e-05,0.000138,4.7e-05,-7e-06,-8.4e-05,9e-06,5.8e-05,0.000186,-4e-06,-2.2e-05,0,2.2e-05,-4.1e-05,0.000247,0.000169,-0.000143,-0.000436,-0.000605,2e-05,6.3e-05,-8.3e-05,4.7e-05,0.000181,-0.000169,-0.000124,8.5e-05,0.000434,-9.4e-05,-0.000255,-5.5e-05,-7.8e-05,-7.7e-05,-0.000799,-0.000352,0.000146,-9.6e-05,0.000183,-0.000165,1.8e-05,2.6e-05,-2.2e-05,-0.000293,1.8e-05,-5.6e-05,-0.000876,-0.000566,-0.000858,-0.000174,0.000268,-0.000456
-7.4e-05,2.7e-05,0.000108,-1.2e-05,-4.9e-05,-7.4e-05,-3.3e-05,-8e-06,-9e-05,0.000105,0.000102,0.000122,-2e-06,3.8e-05,-9.6e-05,-0.000109,-0.000238,2e-05,4.7e-05,1.6e-05,-0.000167,0,-0.000133,-8.7e-05,-0.000146,-6.2e-05,-7.4e-05,-0.000108,0.000149,5.1e-05,-1e-06,-0.000279,-5.5e-05,0.000235,3.1e-05,-0.000266,-0.000122,0.00014,0.000276,-8.6e-05,-0.000147,0.000135,2.5e-05,-5.1e-05,-5e-05,1.7e-05,0.000377,0.000132,0.00014,-0.000192,-0.000167,-4.5e-05,0.000168,-0.000317,-0.000195,-0.000116,-2.5e-05,0.000101,4.7e-05,-2.7e-05,-7e-05,3.5e-05,0.000142,-0.000152,-0.000107,3.7e-05,9.3e-05,-0.00037,-0.00015,2.8e-05,-0.000237,-0.000129,-0.000178,-0.000209,-4.5e-05,0.000233,8.2e-05,-9.9e-05,-8.9e-05,4.7e-05,6.4e-05,4.6e-05,0.000236,0.000121,-9.2e-05,7.6e-05,-7.5e-05,0.000247,2e-04,8.1e-05,0.000192,0.000161,0.000206,-0.000231,-0.000132,0.000182,0.000108,-0.000529,-0.000305,0.000244,-0.00018,2.2e-05,-9.9e-05,0.000253,0.000163,-5.2e-05,-0.000166,-0.000123,1.5e-05,-3.3e-05,5e-06,7.8e-05,0.00059,-3.1e-05,0.000121,0.000722,0.000393,-0.000241,-3.2e-05,-0.000156,-2.3e-05
-5.2e-05,0,1e-05,1.5e-05,6.1e-05,2.7e-05,-3e-06,-2.4e-05,0.000131,9.5e-05,-1.3e-05,6.6e-05,4.3e-05,0.000117,-1.4e-05,5e-06,8.4e-05,-7.7e-05,0,8e-06,-2.5e-05,0.00011,5.2e-05,1.4e-05,0.00021,0.000171,5.5e-05,3.2e-05,7.6e-05,1.8e-05,-1.4e-05,9e-06,-2.2e-05,-8.5e-05,-2.1e-05,0.00012,0.000134,-4.1e-05,-5e-05,8.8e-05,9.7e-05,0,-3.2e-05,-2.1e-05,0.000128,-7e-06,-0.000218,-9e-06,-9.7e-05,8.4e-05,-1.7e-05,-5.8e-05,-0.000154,0.000285,0.000215,-5.7e-05,0.000221,-7.8e-05,-6.9e-05,-8.5e-05,7e-05,5.9e-05,-4.6e-05,9.5e-05,0.000102,-6.6e-05,-9.7e-05,0.000174,6e-06,-9.5e-05,3.9e-05,0.000165,0.00022,0.000138,0.000171,-7e-05,0.000142,1.9e-05,-2.7e-05,6.1e-05,4.8e-05,1.8e-05,-0.00018,-7.5e-05,5e-05,0.000116,0.000172,-4.5e-05,-0.000116,1.5e-05,-7.7e-05,-0.000164,-0.000266,0.00027,0.000175,4.6e-05,-9.4e-05,0.000337,0.000384,-0.000135,0.000141,-0.000183,0.000227,0.000358,-0.000105,9.8e-05,0.000195,6.5e-05,-5.2e-05,-6e-05,-0.00024,-0.000108,-0.000517,-0.000158,-7.8e-05,-0.000342,-0.000121,0.00055,-6.7e-05,5.1e-05,-7.7e-05
2.8e-05,4.2e-05,3e-05,-1.8e-05,-3.8e-05,-3.5e-05,-3.3e-05,-4.5e-05,-3.1e-05,-3.3e-05,-2e-05,-5.1e-05,2.2e-05,-0.000103,2.6e-05,-3.4e-05,-4.6e-05,5e-06,-3e-06,-5.8e-05,-5.5e-05,-5e-05,-3.3e-05,-8.5e-05,-8e-05,-8.9e-05,2.7e-05,6.7e-05,-0.000138,-3.6e-05,1e-05,-3.2e-05,-3e-06,-2.9e-05,-3.4e-05,1.2e-05,-0.000139,-6e-06,1e-05,-0.000102,-5e-05,3.5e-05,8e-05,5.2e-05,-5.6e-05,2e-05,8.1e-05,4e-05,-3.4e-05,-6.1e-05,9.2e-05,0.000197,0.000109,-0.000232,-0.000152,0.000217,-0.000259,2.8e-05,-8.2e-05,-7.5e-05,-1.8e-05,-4.4e-05,-5e-06,3.6e-05,-0.000118,0.000285,0.000183,-1.8e-05,6e-05,5e-06,9e-06,-7.8e-05,5.1e-05,-6.1e-05,-7.6e-05,-9.5e-05,-0.000235,-6.9e-05,-0.000115,-0.000151,-0.00021,-0.000101,0.000161,6.3e-05,-1.9e-05,-0.000169,-9.4e-05,-9.3e-05,0.000136,-0.000144,-0.000121,5.3e-05,0.000104,-0.000128,-0.000133,-0.000459,-0.000116,-0.000165,-0.000175,0.000127,-0.000116,0.000188,-6.4e-05,-0.000298,1e-04,-0.000137,-5.4e-05,-0.000155,2.3e-05,0.000112,0.000115,-1.8e-05,0.000215,0.000119,-0.000158,-6e-06,8.6e-05,-0.000455,-8.2e-05,-9.6e-05,9.2e-05
-1.1e-05,-2e-05,-6.1e-05,-1.2e-05,1.1e-05,-1.9e-05,-7e-06,4e-05,5.2e-05,3.5e-05,-4.4e-05,-4.7e-05,1.7e-05,4.4e-05,-2.2e-05,1.2e-05,-0.000126,-3.9e-05,-1.3e-05,-1.2e-05,0.00011,-9.1e-05,3e-06,9.5e-05,2.7e-05,-1.6e-05,0.00011,2e-05,7.7e-05,4.9e-05,2.1e-05,0.000122,6e-05,-5.9e-05,7.4e-05,1.4e-05,0.000104,8.7e-05,9e-06,-3.3e-05,-2.8e-05,-3.2e-05,-7.5e-05,-6.6e-05,-2.4e-05,-1.1e-05,5.2e-05,-0.000157,6e-06,8.7e-05,-7.9e-05,-0.000162,-1.8e-05,0.000108,0.000112,-9.5e-05,6.6e-05,-5e-05,0.00017,6.2e-05,4.9e-05,7e-05,3.9e-05,-2.8e-05,3.8e-05,-0.000212,-0.000186,-7.5e-05,-3.8e-05,7.8e-05,2.5e-05,-3.8e-05,-0.000203,3.9e-05,-4.1e-05,0.000103,6.5e-05,-1e-06,0.000147,6.3e-05,0.000216,3.1e-05,-7.5e-05,-6.5e-05,2.1e-05,9.2e-05,7.2e-05,6e-05,-9.5e-05,0.000164,1.3e-05,0.000118,4e-05,4.8e-05,2.3e-05,0.000468,0.000153,7.6e-05,0.000127,-0.000163,4.4e-05,-0.000269,8.8e-05,0.000197,3.9e-05,6.5e-05,-9e-06,8.1e-05,6.7e-05,-8.9e-05,-0.000108,6.9e-05,-3e-06,3.3e-05,0.000149,-0.00012,1.9e-05,0.000131,0.000255,4.3e-05,1.3e-05
4.8e-05,-3.2e-05,-2.3e-05,-1.5e-05,-1.3e-05,-8e-06,-1.1e-05,-3e-05,-7.1e-05,-2.2e-05,-2.3e-05,2.4e-05,3.5e-05,3e-06,-3.3e-05,-1.7e-05,0.000104,7e-06,-1.9e-05,7.8e-05,-5.4e-05,9.4e-05,1e-06,-3.3e-05,4e-05,9.7e-05,-0.000136,-2.5e-05,-7.8e-05,-6.5e-05,-3.4e-05,-7.4e-05,-4.9e-05,-6.2e-05,-1.3e-05,-0.000108,-6.3e-05,-2.8e-05,-2e-06,9e-06,4.8e-05,-2.8e-05,6e-05,2.3e-05,2.1e-05,1.7e-05,-7.5e-05,0.000104,2e-05,-5.6e-05,3.1e-05,0.000129,-1.3e-05,-8.2e-05,-2.9e-05,-8.1e-05,8.7e-05,0.000106,-9e-05,-0.000101,-1.2e-05,-8.8e-05,3.2e-05,0.000122,-4e-06,-2.8e-05,-4.5e-05,7.5e-05,3.2e-05,-3.1e-05,-7.1e-05,3.3e-05,0.000112,2.6e-05,4.4e-05,-6.9e-05,2.3e-05,2e-05,-0.000129,-0.000104,-6.4e-05,8e-05,-9e-06,-4.8e-05,-2e-06,-3.3e-05,-8e-06,2e-06,1.1e-05,-0.000176,2.4e-05,-0.000104,-4.5e-05,-3.1e-05,9.6e-05,-0.000246,-1.3e-05,0.000144,8.1e-05,1e-04,-5.7e-05,0.000164,-2e-05,-0.000116,-3.4e-05,-3.5e-05,4.4e-05,1.1e-05,-8.2e-05,0.000117,8.2e-05,4.5e-05,-1.8e-05,2.8e-05,3e-05,0.000239,-2.7e-05,-6e-06,-0.000148,-3e-06,-6.7e-05
2e-05,-1.1e-05,3.2e-05,7e-06,9e-06,-2.3e-05,2.7e-05,-6.3e-05,-3.3e-05,-1.9e-05,-4e-06,-4.7e-05,-1e-06,-4.6e-05,1.7e-05,3.8e-05,-2e-06,-2.2e-05,-1.1e-05,-5.4e-05,6e-05,-3.7e-05,4.4e-05,-3.5e-05,1e-05,-4.7e-05,3.5e-05,2e-05,-8e-06,4.2e-05,8e-06,-7.2e-05,3.8e-05,-4.2e-05,3.9e-05,9.2e-05,-1.1e-05,1.9e-05,-1.1e-05,3e-05,-4.7e-05,7e-06,1.9e-05,-4.8e-05,-2e-05,-8.2e-05,-1e-06,-6e-06,-4e-06,3.9e-05,2.3e-05,-0.000104,4.1e-05,5.3e-05,1.8e-05,-1.4e-05,-9.2e-05,-7e-05,6.9e-05,-1.2e-05,1.6e-05,2.7e-05,-1.2e-05,-0.000189,-7.3e-05,8.9e-05,-2.4e-05,-0.000107,-2e-06,-6e-05,-2.3e-05,-3.5e-05,-3.9e-05,-1.5e-05,1e-06,0.000118,-1.5e-05,2.9e-05,3.9e-05,6.4e-05,-3.2e-05,0,-4.8e-05,-9e-06,-1.4e-05,2.6e-05,-5.1e-05,2.7e-05,6.5e-05,5.3e-05,1e-05,-1.1e-05,3e-05,9.3e-05,-5.6e-05,9.1e-05,-5e-06,-4.5e-05,-0.000131,-0.000121,4.8e-05,-9e-06,-2.3e-05,7.8e-05,-4.7e-05,-2.1e-05,-2e-05,2e-05,-1.7e-05,-6e-05,-1.1e-05,-5.8e-05,-3.5e-05,-6.5e-05,-6.2e-05,-0.000105,-6.6e-05,3.4e-05,-4.2e-05,7.8e-05,-2e-06
-1.4e-05,-2.8e-05,-9e-06,-6e-06,-5e-06,-2e-06,1.1e-05,6e-06,3e-06,-4e-05,-2.2e-05,5.3e-05,1.1e-05,2e-06,-2e-06,-3.4e-05,6e-06,-1.1e-05,-3e-06,1.6e-05,2.4e-05,-2.4e-05,-3.3e-05,3.7e-05,-5.7e-05,3.6e-05,4e-05,3.2e-05,2.7e-05,-2.5e-05,-3.5e-05,1e-05,-2.7e-05,3.4e-05,9e-06,5e-06,1.8e-05,-1.8e-05,-2.8e-05,2e-05,-2e-06,-2.7e-05,-2.9e-05,3.5e-05,-3.8e-05,-3.2e-05,-4.2e-05,-2.5e-05,2.5e-05,1e-06,-4.7e-05,4.8e-05,-4e-06,3.8e-05,-3.6e-05,4.1e-05,8e-06,3.9e-05,-3.8e-05,3.7e-05,-8e-06,-7e-06,-2.1e-05,0.000103,8.9e-05,3.5e-05,8.2e-05,-9e-06,1.5e-05,2.6e-05,6.7e-05,-3e-06,9.4e-05,6.1e-05,-5.8e-05,-7.1e-05,6.5e-05,2.7e-05,2.3e-05,-5.3e-05,-1.5e-05,-6e-05,-2.2e-05,-1e-05,2.4e-05,-5e-05,1.7e-05,-7e-06,-5.3e-05,-3.3e-05,-3.6e-05,2.6e-05,-9e-06,-4.8e-05,-1.2e-05,-8e-05,-1e-06,-7e-06,2.5e-05,0.000102,-2.3e-05,-0.000101,1.3e-05,-7.8e-05,0.000104,2.6e-05,2.1e-05,8e-06,8e-05,1.7e-05,-5.6e-05,8e-06,2e-05,8.1e-05,6.6e-05,-3.6e-05,4.6e-05,-8.4e-05,1.9e-05,-8.4e-05,0.000102
7e-06,-2.5e-05,6e-06,-5e-06,-1.6e-05,-1.4e-05,-8e-06,2.4e-05,2.2e-05,-7e-06,1e-06,-2.9e-05,-1.1e-05,0,-4e-06,-9e-06,-2.4e-05,2.6e-05,-2e-06,-2.6e-05,-1.3e-05,-2.4e-05,1.1e-05,-7e-06,3e-05,-5.9e-05,2e-06,-1.6e-05,1e-05,1.6e-05,1.6e-05,5.1e-05,1e-05,-2.8e-05,-4.8e-05,-6.5e-05,0,-2.4e-05,7.5e-05,-4.6e-05,5e-06,-7e-06,2.8e-05,-6e-06,4e-06,-8e-06,1.4e-05,2.6e-05,-5e-06,3e-05,1.6e-05,-2.9e-05,-3.5e-05,-8.5e-05,-1.2e-05,-7.3e-05,-1e-06,-5.3e-05,3.8e-05,-5.8e-05,-1.4e-05,2.5e-05,2.7e-05,-5.6e-05,-2e-05,-8.9e-05,-8e-06,-1.4e-05,-7e-06,9e-06,-7.7e-05,-1e-06,-8.4e-05,-1e-04,4.7e-05,5e-06,-8.6e-05,-3.8e-05,7e-06,5.5e-05,3e-05,1.7e-05,1.3e-05,-1.2e-05,-1.1e-05,4.6e-05,-8e-06,-1.9e-05,5e-06,4.2e-05,-1.7e-05,-1.9e-05,1.6e-05,-2.8e-05,1e-05,6.7e-05,-1.9e-05,-1.1e-05,0,-3.2e-05,6.6e-05,0.00012,-3.6e-05,3.7e-05,-0.000115,2.4e-05,-1.5e-05,-1.1e-05,-1e-05,-8e-06,9.4e-05,9e-06,1.3e-05,-3e-05,-2e-05,1e-05,7e-06,0.000134,2e-06,6e-06,-9.8e-05
-2.5e-05,-2e-06,0,3e-06,-1e-06,8e-06,-1.9e-05,1e-06,-5e-06,-1e-06,-1.4e-05,2.5e-05,-2.2e-05,5e-06,1.1e-05,1e-06,-6e-06,-5.6e-05,-1.4e-05,-1.7e-05,1.1e-05,2.2e-05,-8e-06,-1.4e-05,-1.9e-05,2.6e-05,-2.5e-05,-1.4e-05,-8e-06,-1.9e-05,2e-06,-2.9e-05,7e-06,-1.7e-05,-1.9e-05,3.3e-05,1.6e-05,1e-05,0,3.4e-05,-4e-06,1e-05,-2.8e-05,-8e-06,1e-06,-5e-06,1.1e-05,-4e-06,-2.9e-05,3e-06,1.3e-05,2.6e-05,3.3e-05,6.4e-05,-7e-06,3e-05,1.2e-05,-3e-06,-5.1e-05,4.3e-05,7e-06,-1.9e-05,-3.2e-05,8e-06,-1.2e-05,4e-05,-1.7e-05,3.4e-05,7e-06,2.3e-05,5.6e-05,2e-05,4.8e-05,3.3e-05,-2e-06,6e-06,8e-06,3e-06,-3.9e-05,-4.6e-05,-5.4e-05,2.8e-05,-1.1e-05,1.3e-05,-6e-06,-4.4e-05,-4.5e-05,1e-06,6e-06,-1.2e-05,2.4e-05,4.7e-05,-1.1e-05,1.4e-05,-8e-06,-5.8e-05,2.6e-05,3.2e-05,-5e-06,-7e-06,-3.8e-05,-6.5e-05,6e-06,-7e-05,6e-05,3e-06,-1.1e-05,-2.5e-05,-4e-06,-9e-06,-4.9e-05,-1.4e-05,1.1e-05,-2.7e-05,-2.4e-05,5.8e-05,-4e-06,-0.000115,-2.6e-05,4e-06,-2.6e-05
-1.1e-05,-1e-06,-1.2e-05,-1.1e-05,1e-06,-8e-06,6e-06,-5e-06,1.3e-05,-1.5e-05,-8e-06,-2.1e-05,-1.8e-05,2e-06,-8e-06,0,2.9e-05,4.5e-05,6e-06,9e-06,2e-05,-1e-06,1e-06,2.3e-05,1.9e-05,0,8e-06,2e-06,2.5e-05,2.7e-05,-5e-06,-6e-06,-3e-06,-1.5e-05,-1e-05,-1e-06,-1.2e-05,-2.5e-05,1.1e-05,-2.7e-05,-3e-06,-1.1e-05,1.4e-05,4e-06,1.1e-05,1e-06,-5.1e-05,-2e-05,9e-06,0,-3.5e-05,-3.2e-05,-2.2e-05,-4.4e-05,1.4e-05,-1.7e-05,-2.5e-05,1e-05,4.2e-05,-2e-05,-2e-05,1.6e-05,3.7e-05,2.4e-05,1.5e-05,-2.4e-05,1.3e-05,7e-06,7e-06,-5e-06,-2.1e-05,-1.8e-05,-4.1e-05,-1e-06,2.4e-05,-2.6e-05,1.8e-05,-1e-06,6.1e-05,1.1e-05,4.7e-05,-5e-06,-4.1e-05,-1e-06,-1.1e-05,2.3e-05,2e-05,-3e-06,-2.4e-05,5e-06,6e-06,4e-06,-4e-06,7e-06,1.7e-05,4.5e-05,5e-06,-7.3e-05,2.3e-05,4e-06,-2e-05,6.7e-05,3e-06,8.7e-05,-4.1e-05,-1.8e-05,2.4e-05,1e-05,5e-06,1.5e-05,1.6e-05,1.8e-05,-2.9e-05,1.8e-05,2.8e-05,-0.000103,-7e-06,7.9e-05,-1.4e-05,1.5e-05,2.7e-05
-7e-06,1e-05,-4e-06,3e-06,2e-06,4e-06,-3e-06,-1e-05,-1.5e-05,-8e-06,1e-06,-3e-06,-1e-05,-1e-06,-7e-06,-1e-05,-1.6e-05,-3.7e-05,-2e-06,-8e-06,-3.5e-05,5e-06,-6e-06,-1.2e-05,-3.6e-05,2.3e-05,-9e-06,0,-3.2e-05,-1.2e-05,-8e-06,-9e-06,-9e-06,1.2e-05,-1.3e-05,-3e-06,2e-06,-2.5e-05,-8e-06,1.5e-05,1.6e-05,5e-06,-7e-06,1e-06,-4e-06,3e-06,4.2e-05,-7e-06,-2e-06,-1e-06,2.1e-05,4.1e-05,1.3e-05,4.1e-05,1e-06,2e-06,4.4e-05,-1e-05,-2.9e-05,7e-06,7e-06,-2.2e-05,-2.5e-05,-2.1e-05,2e-05,3e-05,-2.4e-05,-3e-05,-1.1e-05,6e-06,7e-06,1.6e-05,1.9e-05,-8e-06,-2.6e-05,2.7e-05,-6e-06,-1.4e-05,-4.9e-05,0,-3e-06,2e-06,1.5e-05,1.6e-05,6e-06,-3.1e-05,4e-06,-4e-06,1.7e-05,2.6e-05,-2.4e-05,-3.2e-05,6e-06,-2e-06,8e-06,-2.6e-05,1.2e-05,4.8e-05,3.7e-05,-1e-05,2.6e-05,-6.6e-05,4e-06,-5e-05,3.5e-05,6e-06,-2.7e-05,1.3e-05,-2e-05,-4e-06,1.3e-05,-2.2e-05,6.1e-05,-1e-05,-2.9e-05,0.000117,-4e-06,-2.7e-05,1.4e-05,-5e-06,-2e-06
1e-06,-5e-06,3e-06,-6e-06,0,-1e-05,5e-06,2e-06,-2e-06,5e-06,-5e-06,4e-06,0,-3e-06,-3e-06,3e-06,4e-06,2.5e-05,-3e-06,1.7e-05,-2e-05,-1.8e-05,6e-06,-4e-06,3.5e-05,-2.6e-05,1.5e-05,-1e-06,5e-06,-1e-06,1e-05,1.6e-05,9e-06,8e-06,3e-06,-2.4e-05,-2.2e-05,9e-06,1.5e-05,1e-06,-2.2e-05,2e-06,5e-06,7e-06,-7e-06,-1e-06,-1e-06,1e-05,0,2e-06,-1.4e-05,-2.6e-05,-6e-06,-2.8e-05,2e-06,1.8e-05,-4.7e-05,1e-05,1.8e-05,-3e-06,-2e-06,1e-05,1.8e-05,2.3e-05,-4e-05,-2.4e-05,-2e-06,5.7e-05,-3e-06,-8e-06,6e-06,7e-06,-1e-06,-5e-06,1.3e-05,4e-06,1.1e-05,1.6e-05,1.3e-05,-1e-06,8e-06,-5e-06,2e-06,-4e-06,-4e-06,1.8e-05,-1.2e-05,1.7e-05,0,-2.6e-05,3.2e-05,1.7e-05,-5e-06,1.4e-05,-2.6e-05,2.4e-05,-1.7e-05,-4.1e-05,-2.1e-05,3e-06,-2.3e-05,1.1e-05,1e-06,-1.4e-05,-1.6e-05,2e-06,2.3e-05,2e-06,-3e-06,1.5e-05,-2.2e-05,1.5e-05,-4e-05,1.8e-05,2.3e-05,-9.8e-05,0,-3.9e-05,1.4e-05,-1e-06,2e-06
1.3e-05,4e-06,-2e-06,0,3e-06,-5e-06,7e-06,1.3e-05,-3e-06,-1e-06,3e-06,-1e-06,0,1e-06,-5e-06,-1e-06,-1.4e-05,-2.2e-05,2e-06,-9e-06,2.2e-05,3e-06,-1e-05,5e-06,-1.2e-05,2.4e-05,-1.6e-05,2e-06,-9e-06,5e-06,-7e-06,7e-06,-1e-06,4e-06,1.3e-05,2.4e-05,1.6e-05,-1e-06,-2e-05,1.2e-05,-1e-06,-5e-06,-1e-06,-2e-06,-6e-06,6e-06,-3.2e-05,-1e-06,2e-06,-3e-06,6e-06,1.6e-05,-1e-06,1.9e-05,8e-06,1e-06,3.2e-05,-6e-06,-1.8e-05,0,1e-06,-1.1e-05,-2e-05,-2.8e-05,2.3e-05,-9e-06,1.3e-05,-3.4e-05,6e-06,6e-06,-8e-06,-1.2e-05,-2.8e-05,2.2e-05,-1.2e-05,1e-06,-2e-06,-1.3e-05,-4e-06,6e-06,-2.6e-05,6e-06,1.2e-05,0,-1e-06,-1.2e-05,1.2e-05,-2.5e-05,7e-06,1.2e-05,-7e-06,-2e-06,2e-06,-1.8e-05,0,-1.7e-05,-1e-06,5e-06,6e-06,5e-06,2.3e-05,3.6e-05,1e-06,5e-05,2.3e-05,-1.7e-05,-3e-06,-3e-06,1.6e-05,-1.5e-05,2e-06,1e-06,4e-06,-4e-06,-1.4e-05,3.8e-05,1.1e-05,2.1e-05,-2e-06,5e-06,1.8e-05
2e-06,9e-06,4e-06,-3e-06,2e-06,0,-7e-06,4e-06,-1e-06,0,-4e-06,1e-05,5e-06,-3e-06,-3e-06,-6e-06,1.1e-05,5e-06,6e-06,-6e-06,-1.1e-05,-2e-06,8e-06,-2e-06,8e-06,-1.5e-05,-1.1e-05,3e-06,-8e-06,-7e-06,-1e-06,-1.3e-05,1e-06,2e-05,9e-06,-3e-06,8e-06,1e-06,2.7e-05,-1.6e-05,2e-06,7e-06,3e-06,-4e-06,-1e-06,8e-06,2.5e-05,6e-06,8e-06,-3e-06,2e-06,-1.8e-05,8e-06,-1.1e-05,-1.7e-05,-1.6e-05,-1.8e-05,2.1e-05,4e-06,2.3e-05,0,8e-06,2.2e-05,1.2e-05,1.3e-05,-3e-06,2.7e-05,3.9e-05,-2e-06,0,2.1e-05,-5e-06,4e-05,-9e-06,8e-06,7e-06,-1.2e-05,1.1e-05,-3e-06,-4e-06,1.6e-05,-2e-06,3e-06,-4e-06,5e-06,7e-06,-1.2e-05,1.4e-05,-9e-06,-1e-05,-2e-05,-8e-06,0,2.1e-05,2e-05,-4e-06,6e-06,1.4e-05,-4e-06,1.1e-05,-2.9e-05,-4e-05,-6e-06,-4.2e-05,-3.5e-05,1.5e-05,2e-06,-1.1e-05,-2e-05,1e-06,-1e-06,-6e-06,-1e-06,-1.5e-05,-6e-06,6e-06,-1.2e-05,2.4e-05,-2e-06,-1.5e-05,-3e-05
7e-06,-3e-06,2e-06,0,-1e-06,-5e-06,-5e-06,-8e-06,2e-06,5e-06,-3e-06,-1e-05,4e-06,-3e-06,0,0,1e-06,-2e-06,-1e-06,7e-06,6e-06,-2e-06,-5e-06,-1e-06,-1.4e-05,7e-06,7e-06,2e-06,9e-06,6e-06,-5e-06,2e-06,-4e-06,-7e-06,2e-06,-1.3e-05,-3e-06,3e-06,-8e-06,2e-06,-1e-06,0,-5e-06,3e-06,-1e-06,5e-06,-1e-05,-4e-06,-1.2e-05,-3e-06,-1e-05,1.6e-05,-1.2e-05,4e-06,6e-06,1.9e-05,6e-06,-2.1e-05,1e-05,-2.2e-05,1e-06,-5e-06,-2e-05,-2e-06,-2.8e-05,2.2e-05,-1.1e-05,-1.9e-05,3e-06,-1e-06,-2.3e-05,5e-06,-3.6e-05,-6e-06,-1.4e-05,-2.2e-05,1e-06,0,0,5e-06,-8e-06,1e-05,1e-06,-8e-06,-9e-06,-3e-06,-6e-06,-6e-06,8e-06,1.2e-05,2.1e-05,1.2e-05,-8e-06,-1.7e-05,-8e-06,2.7e-05,1.4e-05,-9e-06,-1.7e-05,-8e-06,2.1e-05,2.3e-05,5e-06,2.2e-05,2.2e-05,-6e-06,1e-06,1.1e-05,-5e-06,4e-06,4e-06,2e-06,0,7e-06,2.6e-05,-1.7e-05,4e-06,-3.8e-05,1e-06,1.3e-05,1.8e-05
-2e-06,1e-06,-4e-06,-2e-06,-5e-06,0,1e-06,-6e-06,6e-06,6e-06,1e-06,6e-06,2e-06,3e-06,-2e-06,-1e-06,-1.4e-05,-5e-06,-2e-06,-1.1e-05,1.8e-05,-2e-06,3e-06,2e-06,8e-06,-5e-06,6e-06,2e-06,6e-06,-3e-06,3e-06,-1e-05,2e-06,-5e-06,9e-06,9e-06,-2e-06,-3e-06,1.6e-05,0,2e-06,1e-06,6e-06,0,-1e-06,0,0,-1e-06,4e-06,1e-06,1.5e-05,-9e-06,6e-06,-3e-06,-1.1e-05,0,2e-06,1.1e-05,-6e-06,1.4e-05,-1e-06,4e-06,2.2e-05,-1e-05,1.1e-05,-1.3e-05,-5e-06,-4e-06,3e-06,2e-06,1.4e-05,-4e-06,3.2e-05,1.4e-05,1.9e-05,1.1e-05,3e-06,-2e-06,6e-06,-8e-06,1e-06,4e-06,5e-06,5e-06,4e-06,1e-05,1.1e-05,0,-9e-06,-2.1e-05,-1.2e-05,-3e-06,4e-06,6e-06,-2e-06,-3.1e-05,-1e-05,4e-06,1.1e-05,-7e-06,-2.2e-05,-1.6e-05,-4e-06,-2.1e-05,-1.5e-05,7e-06,-5e-06,2e-06,2.5e-05,-5e-06,-4e-06,7e-06,-4e-06,-8e-06,-2e-05,-7e-06,6e-06,1.9e-05,-5e-06,-2e-06,1.4e-05
-1e-05,-1e-06,-3e-06,-2e-06,0,-3e-06,3e-06,5e-06,-3e-06,2e-06,-4e-06,-8e-06,-2e-06,-1e-06,-1e-06,-2e-06,1.8e-05,-3e-06,2e-06,4e-06,-2e-06,4e-06,-2e-06,-3e-06,-5e-06,4e-06,-5e-06,-2e-06,-9e-06,-1e-06,-1e-06,2e-05,1e-06,3e-06,-1e-05,-3e-06,-7e-06,8e-06,-1.4e-05,1e-06,1e-06,4e-06,-5e-06,0,-1e-06,0,7e-06,-5e-06,-1e-06,2e-06,-1.2e-05,1e-06,4e-06,1e-06,1e-06,-4e-06,5e-06,-2.1e-05,-2e-06,-1.5e-05,-2e-06,-5e-06,-2.4e-05,1.6e-05,1.3e-05,-3e-06,1e-06,1e-05,2e-06,-1e-06,-1.2e-05,0,-3.8e-05,-1.8e-05,-1e-05,-6e-06,6e-06,4e-06,-4e-06,6e-06,-4e-06,-7e-06,2e-06,-9e-06,-1e-06,-6e-06,-8e-06,9e-06,0,1.6e-05,-2e-06,-6e-06,-1e-06,-2e-06,1e-06,2.4e-05,2e-06,-2e-06,-6e-06,1.3e-05,2.2e-05,1.3e-05,4e-06,1.6e-05,2e-06,-9e-06,3e-06,0,-8e-06,5e-06,1e-06,-8e-06,-2e-06,8e-06,-3e-06,3.1e-05,-1e-06,6e-06,2e-06,6e-06,-3.5e-05
-6e-06,0,4e-06,1e-06,-1e-06,-1e-06,0,6e-06,-1e-06,1e-06,1e-06,4e-06,-2e-06,0,0,0,-7e-06,0,0,-2e-06,-1e-05,-5e-06,2e-06,1e-06,3e-06,-3e-06,-7e-06,-5e-06,9e-06,4e-06,-1e-06,-1e-05,-1e-06,-2e-06,-6e-06,0,-3e-06,9e-06,0,6e-06,-8e-06,-2e-06,-1e-06,-3e-06,4e-06,0,-8e-06,2e-06,3e-06,1e-06,-1e-06,-4e-06,-1e-05,1e-06,7e-06,0,-1.3e-05,1.4e-05,6e-06,4e-06,-2e-06,3e-06,1.2e-05,-1.5e-05,-1.9e-05,0,-1.8e-05,-1.3e-05,-2e-06,1e-06,5e-06,6e-06,3.7e-05,3e-06,3e-06,2e-06,6e-06,-1e-06,7e-06,-8e-06,1.5e-05,0,2e-06,-1e-06,-2e-06,7e-06,0,-5e-06,3e-06,-1e-05,1.7e-05,6e-06,-2e-06,2e-06,-8e-06,-2.8e-05,-5e-06,2e-06,1.4e-05,-1.8e-05,-1.8e-05,8e-06,1e-06,-1.1e-05,-1e-05,7e-06,-3e-06,-2e-06,-3e-06,-4e-06,1.1e-05,-4e-06,-1e-06,-3e-06,1.9e-05,-2.9e-05,-4e-06,-2.1e-05,4e-06,-1.5e-05,9e-06
-8e-06,-2e-06,-2e-06,-3e-06,1e-06,-4e-06,2e-06,-3e-06,-3e-06,3e-06,-3e-06,-2e-06,0,-1e-06,0,-3e-06,-2e-06,-7e-06,-1e-06,-2e-06,1.4e-05,-3e-06,-3e-06,1e-06,-6e-06,4e-06,4e-06,1e-06,-4e-06,-4e-06,-2e-06,0,1e-06,-1.2e-05,-4e-06,-2e-06,5e-06,-3e-06,-6e-06,-5e-06,0,1e-06,4e-06,3e-06,2e-06,0,1.1e-05,2e-06,-6e-06,-1e-06,4e-06,8e-06,8e-06,-1e-06,-1e-06,-2e-06,3e-06,-1.1e-05,-6e-06,4e-06,1e-06,-2e-06,-8e-06,1.2e-05,0,1.7e-05,7e-06,1e-05,0,2e-06,4e-06,-3e-06,-2.3e-05,0,-4e-06,1e-05,-1.2e-05,-2e-06,-4e-06,7e-06,-1.5e-05,8e-06,0,-1e-06,3e-06,-1e-06,1.4e-05,-3e-06,-2e-06,6e-06,-1.9e-05,-1e-06,0,-1e-06,6e-06,2.9e-05,2e-06,-1.5e-05,-6e-06,1.5e-05,7e-06,-2.9e-05,-2e-06,1.6e-05,1.7e-05,-3e-06,2e-06,5e-06,1.1e-05,2e-06,-1.3e-05,5e-06,5e-06,-2e-06,-1.8e-05,1.3e-05,-3e-06,3e-05,-5e-06,1.4e-05,1e-05
1e-06,-9e-06,1e-06,0,0,-1e-06,-2e-06,-6e-06,-2e-06,2e-06,-2e-06,6e-06,0,0,-1e-06,-4e-06,-1e-06,8e-06,1e-06,3e-06,-8e-06,0,2e-06,0,8e-06,-4e-06,5e-06,0,-4e-06,2e-06,0,-7e-06,-1e-06,-1e-06,0,2e-06,9e-06,9e-06,6e-06,1e-06,4e-06,-1e-06,-4e-06,-1e-06,-5e-06,-2e-06,-1e-05,5e-06,5e-06,1e-06,-5e-06,-7e-06,-3e-06,1e-06,2e-06,-3e-06,1.2e-05,1.2e-05,-2e-06,-9e-06,1e-06,1e-06,1.1e-05,-6e-06,1.7e-05,-1e-05,1e-05,-2e-05,-1e-06,-4e-06,-1.3e-05,-1e-06,1.4e-05,-1e-06,1.2e-05,-6e-06,-3e-06,-2e-06,-3e-06,-3e-06,2e-06,1e-06,-5e-06,-4e-06,0,3e-06,-6e-06,6e-06,0,-5e-06,3e-06,-4e-06,-1e-06,-1e-06,6e-06,-2.4e-05,4e-06,1.8e-05,8e-06,-9e-06,-1e-06,3.1e-05,2e-06,-3e-05,-7e-06,0,1e-06,-1e-05,-7e-06,4e-06,6e-06,0,-4e-06,9e-06,5e-06,-1e-06,2e-06,-1.7e-05,-3e-06,-1.2e-05,-8e-06
3e-06,-2e-06,1e-06,-2e-06,2e-06,-1e-06,-4e-06,1e-06,3e-06,-2e-06,0,-2e-06,3e-06,-2e-06,0,3e-06,0,-1.3e-05,0,-3e-06,-1.8e-05,1e-06,-2e-06,0,0,2e-06,1e-06,-1e-06,6e-06,0,0,9e-06,0,-1.3e-05,0,-3e-06,-7e-06,2e-06,-4e-06,-3e-06,-2e-06,-2e-06,1e-06,-1e-06,-3e-06,-3e-06,-2e-06,-1e-06,-4e-06,0,6e-06,7e-06,-3e-06,-4e-06,-2e-06,6e-06,-1.3e-05,-8e-06,8e-06,8e-06,1e-06,-1e-06,-7e-06,-1e-06,-1.4e-05,-3e-06,4e-06,5e-06,-2e-06,0,1.4e-05,2e-06,-7e-06,-2e-06,-1.4e-05,2e-06,5e-06,2e-06,6e-06,1e-06,7e-06,-3e-06,0,5e-06,-2e-06,0,-2e-06,-6e-06,4e-06,6e-06,1.3e-05,4e-06,1e-06,3e-06,-7e-06,1.9e-05,1e-06,-1.2e-05,-1e-05,6e-06,-2e-06,-1.7e-05,-2e-06,2.7e-05,8e-06,3e-06,-1e-06,6e-06,-2e-06,1e-06,2e-06,3e-06,9e-06,1e-06,5e-06,5e-06,4e-06,-5e-06,7e-06,9e-06,9e-06
4e-06,-3e-06,-2e-06,0,1e-06,-2e-06,1e-06,4e-06,1e-06,-1e-06,-3e-06,-1e-06,3e-06,1e-06,-1e-06,-2e-06,1e-05,8e-06,-1e-06,2e-06,5e-06,-2e-06,1e-06,-1e-06,0,0,-6e-06,1e-06,-4e-06,-2e-06,-1e-06,1e-06,1e-06,-4e-06,5e-06,1e-06,0,-2e-06,8e-06,2e-06,1e-06,0,2e-06,0,0,-2e-06,1.2e-05,-2e-06,2e-06,-1e-06,-4e-06,-1e-06,6e-06,5e-06,-2e-06,-5e-06,1e-05,1.1e-05,-8e-06,-1.1e-05,-1e-06,-1e-06,6e-06,3e-06,0,3e-06,-1.2e-05,0,0,2e-06,-1e-05,-3e-06,-5e-06,6e-06,6e-06,-3e-06,3e-06,-3e-06,-7e-06,-3e-06,-1e-06,0,-2e-06,-3e-06,1e-06,0,3e-06,4e-06,-4e-06,-2e-06,-1.2e-05,0,0,-1e-06,-2e-06,-1.5e-05,-5e-06,8e-06,3e-06,-8e-06,1e-06,1e-06,0,-4e-06,-1e-05,-2e-06,3e-06,4e-06,4e-06,-6e-06,-5e-06,-3e-06,-6e-06,1e-06,-6e-06,-9e-06,0,1.6e-05,-1e-06,-2e-06,-9e-06
6e-06,-5e-06,-1e-06,-2e-06,0,-1e-06,3e-06,1e-06,0,0,1e-06,-1e-06,2e-06,-1e-06,-1e-06,-4e-06,-1.1e-05,-1.2e-05,0,-2e-06,2e-06,-1e-06,-1e-06,0,-2e-06,-2e-06,2e-06,1e-06,-1e-06,4e-06,-1e-06,-4e-06,0,-7e-06,7e-06,2e-06,-3e-06,1e-06,-3e-06,1e-06,-4e-06,0,-3e-06,1e-06,1e-06,-1e-06,-1.5e-05,-3e-06,-1e-06,-1e-06,-2e-06,-6e-06,-3e-06,-5e-06,-2e-06,-5e-06,-1.1e-05,-8e-06,5e-06,1e-05,0,0,-6e-06,-7e-06,1e-05,7e-06,0,-4e-06,2e-06,-2e-06,9e-06,0,1.5e-05,-2e-06,-1e-06,-3e-06,2e-06,4e-06,2e-06,-1e-06,-9e-06,4e-06,-3e-06,3e-06,1e-06,0,-8e-06,2e-06,3e-06,0,4e-06,-5e-06,0,-1e-06,4e-06,1.1e-05,-4e-06,1e-06,-5e-06,2e-06,-6e-06,2e-06,0,-1.5e-05,3e-06,0,-3e-06,-1e-06,-7e-06,3e-06,2e-06,1e-06,2e-06,-9e-06,5e-06,1.3e-05,-2e-06,-8e-06,-2e-06,1e-06,-5e-06
-1e-06,-1e-06,1e-06,1e-06,-1e-06,-3e-06,0,-3e-06,0,-1e-06,-2e-06,-1e-06,1e-06,0,-1e-06,2e-06,2e-06,7e-06,0,0,-6e-06,-1e-06,1e-06,0,1e-06,1e-06,2e-06,1e-06,1e-06,-5e-06,1e-06,-4e-06,-1e-06,5e-06,-2e-06,-3e-06,-2e-06,-4e-06,-4e-06,1e-06,-1e-06,1e-06,1e-06,0,0,0,5e-06,-1e-06,3e-06,-1e-06,7e-06,5e-06,0,5e-06,1e-06,8e-06,7e-06,4e-06,-2e-06,-4e-06,1e-06,0,4e-06,9e-06,-6e-06,-6e-06,0,9e-06,0,4e-06,-6e-06,2e-06,-2e-05,-5e-06,5e-06,5e-06,-5e-06,-3e-06,3e-06,2e-06,6e-06,1e-06,-1e-06,2e-06,0,-3e-06,-1e-06,-5e-06,-3e-06,3e-06,4e-06,6e-06,0,2e-06,-2e-06,-9e-06,2e-06,-1e-06,5e-06,4e-06,8e-06,-6e-06,0,1.7e-05,-9e-06,-1e-06,1e-06,-4e-06,-1e-06,1e-06,0,2e-06,3e-06,1e-06,-5e-06,-1.2e-05,0,-1e-05,-1e-06,-7e-06,1.7e-05
-2e-06,-1e-06,-1e-06,-1e-06,-1e-06,0,0,-2e-06,-2e-06,-2e-06,0,3e-06,-1e-06,1e-06,-1e-06,0,1e-06,-5e-06,-1e-06,-2e-06,1e-05,0,-1e-06,-1e-06,1e-06,0,2e-06,-1e-06,-5e-06,3e-06,0,3e-06,0,-4e-06,1e-06,0,5e-06,-1e-06,-3e-06,-1e-06,3e-06,-1e-06,1e-06,-1e-06,0,1e-06,5e-06,1e-06,-2e-06,0,-8e-06,-2e-06,1e-06,-6e-06,-1e-06,1e-06,-3e-06,-7e-06,0,-1e-06,0,1e-06,0,-6e-06,-4e-06,-1e-06,-4e-06,-8e-06,0,-3e-06,2e-06,1e-06,2e-05,4e-06,-8e-06,-4e-06,-3e-06,1e-06,-4e-06,-1e-06,2e-06,-1e-06,-1e-06,-1e-06,0,0,2e-06,3e-06,1e-06,-3e-06,-9e-06,-2e-06,0,-2e-06,2e-06,8e-06,4e-06,1e-06,0,-6e-06,-1.1e-05,1.5e-05,1e-06,-1.3e-05,7e-06,2e-06,-1e-06,2e-06,4e-06,-4e-06,1e-06,-1e-06,-1e-06,2e-06,3e-06,-1e-06,1e-06,1.8e-05,1e-06,7e-06,-1.5e-05
-6e-06,4e-06,1e-06,-1e-06,0,-2e-06,-1e-06,2e-06,-1e-06,-1e-06,0,-1e-06,-3e-06,-1e-06,-1e-06,-3e-06,2e-06,-2e-06,0,0,8e-06,0,0,0,-6e-06,0,-4e-06,0,-1e-06,-1e-06,-1e-06,3e-06,1e-06,5e-06,-3e-06,3e-06,1e-06,-2e-06,-1e-06,-1e-06,2e-06,-1e-06,-3e-06,0,-1e-06,1e-06,-1e-05,4e-06,0,0,0,-1e-06,-2e-06,5e-06,2e-06,-5e-06,6e-06,4e-06,2e-06,3e-06,-1e-06,-1e-06,-2e-06,3e-06,8e-06,-1e-06,1e-05,9e-06,1e-06,1e-06,4e-06,0,-2.1e-05,-4e-06,4e-06,4e-06,2e-06,1e-06,1e-06,1e-06,-4e-06,2e-06,3e-06,2e-06,-1e-06,-3e-06,-6e-06,0,1e-06,1e-06,4e-06,-3e-06,1e-06,1e-06,1e-06,-4e-06,-2e-06,-1e-06,0,9e-06,1.1e-05,-1.8e-05,0,1e-05,-6e-06,0,0,-1e-06,0,5e-06,-1e-06,-1e-06,-2e-06,-5e-06,5e-06,1.4e-05,0,-9e-06,2e-06,-3e-06,-1e-06
-6e-06,0,1e-06,0,0,-1e-06,-2e-06,3e-06,1e-06,0,-1e-06,2e-06,-3e-06,0,0,1e-06,0,2e-06,1e-06,1e-06,-8e-06,-2e-06,0,0,6e-06,0,-2e-06,-1e-06,4e-06,-1e-06,0,0,-1e-06,2e-06,-5e-06,0,-1e-06,-7e-06,2e-06,-1e-06,-3e-06,1e-06,3e-06,1e-06,0,1e-06,6e-06,0,0,0,2e-06,0,4e-06,-4e-06,1e-06,2e-06,-7e-06,-2e-06,-1e-06,-4e-06,0,1e-06,2e-06,0,-2e-06,5e-06,4e-06,-1e-06,-1e-06,-1e-06,-9e-06,0,2.1e-05,-1e-06,0,-2e-06,2e-06,-3e-06,5e-06,-2e-06,0,0,-1e-06,-3e-06,0,2e-06,2e-06,0,-2e-06,-3e-06,3e-06,5e-06,0,-3e-06,-5e-06,1e-06,-3e-06,1e-06,2e-06,-8e-06,-1.1e-05,9e-06,0,-6e-06,7e-06,-2e-06,1e-06,3e-06,-1e-06,-1e-06,1e-06,1e-06,-1e-06,2e-06,-1.1e-05,-1.4e-05,-1e-06,-7e-06,-1e-06,0,1.1e-05
-1e-06,0,-1e-06,-1e-06,0,-1e-06,1e-06,-1e-06,0,-1e-06,1e-06,-1e-06,-2e-06,0,0,0,-7e-06,-7e-06,-1e-06,-1e-06,3e-06,-1e-06,0,-1e-06,-4e-06,-1e-06,2e-06,-1e-06,-4e-06,2e-06,0,-4e-06,0,5e-06,-2e-06,-4e-06,1e-06,-2e-06,-1e-06,1e-06,-2e-06,0,-1e-06,-1e-06,-1e-06,1e-06,-2e-06,-2e-06,-1e-06,0,0,6e-06,-3e-06,3e-06,0,3e-06,3e-06,2e-06,-2e-06,7e-06,0,-1e-06,-4e-06,-3e-06,-4e-06,-3e-06,-4e-06,2e-06,-1e-06,1e-06,1.1e-05,-1e-06,-1.7e-05,0,2e-06,-1e-06,2e-06,2e-06,-8e-06,2e-06,4e-06,-1e-06,2e-06,-2e-06,-1e-06,-4e-06,2e-06,1e-06,3e-06,3e-06,-6e-06,-5e-06,0,2e-06,0,0,-1e-06,-2e-06,-4e-06,6e-06,7e-06,5e-06,0,0,-4e-06,2e-06,-1e-06,0,1e-06,-2e-06,2e-06,0,1e-06,1e-06,8e-06,-2e-06,0,1.8e-05,0,3e-06,-9e-06
0,4e-06,0,0,0,-2e-06,2e-06,-2e-06,2e-06,-1e-06,-2e-06,-1e-06,-1e-06,-1e-06,-1e-06,-3e-06,9e-06,5e-06,0,2e-06,4e-06,0,0,1e-06,5e-06,-1e-06,2e-06,1e-06,4e-06,-2e-06,0,0,0,0,3e-06,2e-06,-2e-06,-1e-06,4e-06,1e-06,0,0,0,0,-3e-06,1e-06,-1e-06,-1e-06,1e-06,1e-06,0,-1.1e-05,1e-06,-1e-06,0,-3e-06,-2e-06,-1e-06,5e-06,-6e-06,1e-06,1e-06,5e-06,5e-06,4e-06,-2e-06,-8e-06,1e-06,0,-1e-06,-1e-05,-1e-06,1.1e-05,2e-06,-4e-06,3e-06,-1e-06,-1e-06,5e-06,-1e-06,-1e-06,1e-06,0,0,1e-06,3e-06,-5e-06,0,0,-3e-06,6e-06,1e-06,0,1e-06,3e-06,-4e-06,0,4e-06,2e-06,-7e-06,-5e-06,-9e-06,-1e-06,0,4e-06,-2e-06,2e-06,-3e-06,2e-06,2e-06,-3e-06,-1e-06,1e-06,4e-06,1e-06,1.2e-05,1e-06,-1.7e-05,1e-06,-5e-06,6e-06
4e-06,-1e-06,1e-06,-1e-06,1e-06,-1e-06,0,0,0,1e-06,0,1e-06,1e-06,0,0,0,-4e-06,-7e-06,1e-06,-2e-06,-1.2e-05,-1e-06,1e-06,1e-06,-6e-06,0,-2e-06,-1e-06,0,2e-06,0,3e-06,0,7e-06,1e-06,3e-06,-2e-06,-3e-06,-4e-06,-1e-06,1e-06,0,0,0,0,1e-06,3e-06,-1e-06,1e-06,0,-3e-06,9e-06,2e-06,0,-2e-06,2e-06,0,1e-06,-4e-06,3e-06,-1e-06,-1e-06,-3e-06,-5e-06,-1e-06,-2e-06,4e-06,-3e-06,0,1e-06,6e-06,1e-06,-4e-06,-2e-06,4e-06,-3e-06,-4e-06,0,0,1e-06,-5e-06,1e-06,1e-06,-3e-06,1e-06,-4e-06,1e-06,-1e-06,-2e-06,3e-06,0,3e-06,0,0,-1e-06,7e-06,2e-06,-4e-06,-3e-06,5e-06,1e-06,7e-06,0,8e-06,-7e-06,1e-06,-1e-06,1e-06,-1e-06,-1e-06,2e-06,1e-06,-3e-06,-1e-06,-9e-06,-6e-06,0,9e-06,-2e-06,3e-06,2e-06
4e-06,0,0,0,0,-1e-06,-1e-06,2e-06,-1e-06,0,-1e-06,-1e-06,2e-06,0,0,0,-1e-06,2e-06,0,0,-4e-06,-1e-06,0,-1e-06,7e-06,0,-3e-06,1e-06,-4e-06,-1e-06,0,1e-06,1e-06,-4e-06,3e-06,-3e-06,4e-06,1e-06,1e-06,1e-06,2e-06,0,1e-06,1e-06,2e-06,0,-6e-06,1e-06,1e-06,0,4e-06,-5e-06,-4e-06,1e-06,0,-1e-06,6e-06,1e-06,2e-06,-3e-06,0,1e-06,6e-06,3e-06,-2e-06,5e-06,0,3e-06,0,-1e-06,-3e-06,1e-06,-2e-06,1e-06,-1e-06,2e-06,0,1e-06,-4e-06,-1e-06,4e-06,0,1e-06,1e-06,0,4e-06,2e-06,0,4e-06,-2e-06,-7e-06,-5e-06,0,-1e-06,-1e-06,-8e-06,1e-06,3e-06,2e-06,-2e-06,1e-06,-5e-06,0,-1e-05,2e-06,-1e-06,0,-1e-06,-3e-06,0,0,1e-06,1e-06,-1e-06,9e-06,-4e-06,-1e-06,2e-06,2e-06,-2e-06,-1.2e-05
2e-06,-2e-06,0,-1e-06,0,-1e-06,0,0,-1e-06,0,0,3e-06,1e-06,0,-1e-06,-2e-06,0,-3e-06,0,-1e-06,6e-06,0,0,0,-7e-06,0,1e-06,1e-06,2e-06,0,0,0,0,-1e-06,4e-06,-2e-06,0,1e-06,-5e-06,-1e-06,-3e-06,0,-1e-06,-1e-06,0,0,7e-06,3e-06,-3e-06,0,-2e-06,2e-06,3e-06,-2e-06,-1e-06,-2e-06,-7e-06,-2e-06,2e-06,1e-06,0,-1e-06,-6e-06,-1e-06,2e-06,-1e-06,0,-2e-06,0,1e-06,-1e-06,-1e-06,9e-06,2e-06,1e-06,-1e-06,3e-06,-1e-06,4e-06,1e-06,2e-06,-1e-06,1e-06,-1e-06,-1e-06,-3e-06,-4e-06,0,-4e-06,2e-06,6e-06,4e-06,0,-1e-06,1e-06,7e-06,-2e-06,-1e-06,-1e-06,-1e-06,-4e-06,6e-06,0,5e-06,-6e-06,1e-06,0,0,3e-06,2e-06,0,0,0,2e-06,-3e-06,8e-06,0,-6e-06,0,3e-06,1.2e-05
0,-1e-06,0,0,0,-2e-06,-1e-06,-2e-06,0,1e-06,0,-2e-06,1e-06,0,0,1e-06,1e-06,-2e-06,1e-06,-1e-06,-4e-06,-1e-06,0,0,5e-06,1e-06,2e-06,0,-1e-06,1e-06,0,-5e-06,0,-5e-06,-1e-06,4e-06,1e-06,4e-06,4e-06,0,-1e-06,-1e-06,1e-06,-1e-06,-1e-06,-1e-06,-3e-06,1e-06,3e-06,0,-2e-06,-4e-06,0,3e-06,0,2e-06,4e-06,1e-06,-2e-06,3e-06,1e-06,0,6e-06,-1e-06,0,-3e-06,7e-06,0,0,-1e-06,6e-06,0,-1.5e-05,-3e-06,-2e-06,-2e-06,3e-06,1e-06,0,0,-3e-06,0,-2e-06,0,0,5e-06,1e-06,1e-06,1e-06,-1e-06,-1e-06,-1e-06,-1e-06,2e-06,-1e-06,-7e-06,-3e-06,0,2e-06,3e-06,6e-06,-2e-06,0,4e-06,3e-06,-1e-06,-1e-06,2e-06,-2e-06,-2e-06,0,-1e-06,1e-06,-2e-06,-3e-06,-4e-06,0,-2e-06,-1e-06,-4e-06,-3e-06
-5e-06,-2e-06,0,-1e-06,0,-1e-06,0,0,0,1e-06,-1e-06,2e-06,-1e-06,0,-1e-06,0,4e-06,1e-06,0,2e-06,0,-1e-06,0,0,-6e-06,-1e-06,0,0,-3e-06,-1e-06,0,4e-06,0,-2e-06,-3e-06,1e-06,0,3e-06,-4e-06,1e-06,0,0,-1e-06,0,-1e-06,-1e-06,-6e-06,-2e-06,-1e-06,0,2e-06,9e-06,-3e-06,-4e-06,1e-06,2e-06,-4e-06,-2e-06,0,-5e-06,0,-1e-06,-7e-06,3e-06,-1e-06,-1e-06,-3e-06,-1e-06,0,0,-9e-06,0,1.7e-05,1e-06,2e-06,3e-06,-1e-06,0,-4e-06,0,-2e-06,1e-06,1e-06,2e-06,1e-06,-3e-06,2e-06,-1e-06,3e-06,1e-06,-4e-06,-4e-06,0,-2e-06,0,8e-06,0,-1e-06,-3e-06,-3e-06,-8e-06,-7e-06,0,-9e-06,-2e-06,-1e-06,1e-06,2e-06,-1e-06,-2e-06,-1e-06,0,1e-06,0,5e-06,2e-06,0,1.6e-05,0,6e-06,-8e-06
