5.7e-05,0.000148,9.6e-05,7.5e-05,4.7e-05,0.000139,0.000114,4e-06,1.7e-05,0.000179,4.6e-05,0.00012,8.8e-05,3.6e-05,1.4e-05,0.000222,1.7e-05,7.2e-05,6.2e-05,2e-05,9.4e-05,7e-05,3e-05,0.000113,2.6e-05,5e-05,1e-04,0.000192,6.3e-05,6.2e-05,4e-06,0.000127,0.000132,1e-06,0.000176,0.000191,0.000329,0.000269,3.3e-05,0.000159,0.000192,1e-04,0.000159,0.000122,0.000176,3.9e-05,7.2e-05,0.000189,0.000215,0.000111,0.000119,1.3e-05,6.4e-05,9.9e-05,5.4e-05,5.2e-05,0.000158,0.000154,5.2e-05,9.9e-05,6.2e-05,4e-05,0.000152,3.7e-05,8.4e-05,0,0.000123,4.3e-05,7.6e-05,9.4e-05,6.4e-05,1e-06,8e-05,4.7e-05,0.000261,0.000104,6e-05,0.000151,0.000135,9e-06,4.6e-05,0.000101,4.6e-05,0.000107,0.000164,7.9e-05,8.5e-05,0.000104,4.7e-05,5.9e-05,7e-05,0.000119,5.5e-05,0.000233,0.000174,1.4e-05,7.8e-05,6.4e-05,1e-06,9.7e-05,8.7e-05,0.000136,0.00013,6.5e-05,5.6e-05,0.000151,5.1e-05,2e-06,4.9e-05,1.8e-05,1.1e-05,0.000111,9.3e-05,2.1e-05,9.8e-05,0.000156,2.1e-05,6.5e-05,0.000112,0.00011,0.000125
0.000345,0.000377,0.000296,0.000176,0.000731,0.00087,0.000761,0.000544,0.000301,0.00048,0.00034,0.000199,0.000269,0.000205,0.000119,0.000488,0.000115,0.000209,0.00018,0.000269,0.000138,8.7e-05,0.000339,0.000407,0.000233,0.000283,0.000417,0.000107,0.000319,0.000447,0.000498,0.000535,0.00067,0.000507,0.00034,2.6e-05,0.000727,0.001088,0.000873,0.000453,0.00071,0.00066,0.000383,0.000532,9e-06,0.000243,0.00016,0.000672,0.000937,0.000519,0.000405,0.000202,3.4e-05,0.000284,7.9e-05,0.000179,0.000473,0.000524,0.00029,0.000302,0.000323,0.000292,0.000487,0.000317,0.000468,0.000532,0.000295,0.000141,0.000323,0.00025,0.000272,0.000197,0.000267,0.000192,0.00043,0.000577,0.000358,0.000355,0.000436,0.000398,0.000421,0.000349,0.000303,0.000202,0.00047,0.000546,0.00013,0.000241,0.000459,8.8e-05,0.00035,0.000649,0.000378,0.000604,0.000725,0.000522,0.000626,0.00026,0.000279,0.000266,9.6e-05,0.000288,0.000529,0.000487,0.000255,0.000271,0.000438,0.00032,0.000302,0.000136,0.000107,0.000406,0.000518,0.000249,0.00017,0.000446,0.000381,0.000284,0.000305,0.000414,0.000373
0.000265,5.8e-05,0.000433,0.000353,0.000863,0.000459,0.000291,0.000224,0.000339,0.000444,0.000537,0.000525,0.000515,0.000615,0.000572,0.000821,0.000531,0.000519,0.000466,0.000231,0.000404,0.000214,0.000415,0.000319,0.00054,0.000393,0.000573,0.000561,0.000313,0.00033,0.000694,0.000124,0.000384,0.000102,0.000294,0.000349,0.00056,0.000102,0.000535,0.000396,0.000611,0.00018,0.000181,0.000215,0.000417,0.000439,0.000295,0.000755,0.000822,0.000872,0.000438,0.000216,0.000154,0.00047,0.000379,0.000503,0.000667,0.00075,0.000376,0.000575,0.000512,0.000118,0.000368,0.000677,0.000215,0.000602,0.000548,0.000359,0.000377,0.000517,0.000544,0.000347,0.000388,2.4e-05,0.000239,0.000293,0.00055,0.000223,0.000316,3.2e-05,0.000277,0.000512,0.000224,8.9e-05,0.00024,0.000556,0.000591,0.00029,0.000368,0.000402,0.000479,0.000692,0.000708,0.000389,0.000545,0.000201,0.000636,0.000573,0.000726,0.000402,5.9e-05,0.000262,0.000263,0.00012,6.6e-05,0.000139,0.000514,0.000184,0.000356,0.000397,0.000412,0.000686,0.000552,0.000315,0.000237,0.000371,0.000245,2.7e-05,0.000346,0.000425,0.000268
0.000804,0.000778,0.000637,0.000456,0.000729,0.000583,0.000675,0.000685,0.000286,0.000416,0.000516,0.000432,0.000492,0.000383,0.000325,0.000411,0.001009,0.000384,0.000335,0.000489,0.000242,0.000165,0.000196,0.000819,4e-04,0.000213,0.000546,0.000756,0.000641,0.000314,0.000409,0.000559,0.000488,0.000396,0.000454,0.000398,0.00022,0.000432,0.000774,0.000246,0.000429,0.00043,0.000198,7.3e-05,0.000305,0.000355,0.000318,0.000309,0.000297,0.00047,0.000123,0.000365,0.00054,0.000274,0.000248,0.00042,0.001115,0.000338,0.000295,0.000507,0.000373,0.000227,6.2e-05,0.000482,0.000532,0.000157,0.000346,0.000365,0.000281,0.00022,0.00012,0.000367,0.000549,0.000429,0.000221,0.000225,0.000893,0.000431,0.000502,0.000535,0.000229,0.000311,0.000708,0.000401,0.000146,0.000382,0.000593,0.000294,0.000389,0.000129,0.000315,0.000252,0.000412,0.000363,0.000223,0.000342,0.000488,0.000258,0.000331,0.000239,0.000277,0.000379,0.00021,0.000232,0.000113,4e-04,0.000446,0.000501,0.00041,0.000537,0.000315,9.3e-05,0.000342,0.00011,0.000311,3.7e-05,0.000132,5.8e-05,0.000204,0.000158,0.000197
0.000511,0.000386,0.000285,5e-04,0.000599,0.000263,0.000484,0.000444,0.000764,0.000207,0.000374,5.9e-05,0.000406,0.00029,0.000304,0.000424,0.001032,0.000659,0.000106,0.000447,0.000496,0.000504,0.000218,0.000716,0.000764,0.000376,0.00036,0.000131,0.000663,0.000659,2.6e-05,0.000467,0.00025,0.000204,0.000347,0.000152,0.00033,0.000693,0.000554,0.000896,0.000296,0.00037,0.000126,0.00015,0.000147,0.000115,0.000162,4.9e-05,0.000211,0.00022,0.00025,0.000457,0.000514,0.000822,0.000956,0.000637,0.000386,0.000493,0.000462,0.000511,0.000618,0.00045,0.000384,0.000361,0.000146,9e-05,5.6e-05,0.000266,0.000262,0.000157,0.000288,0.000238,0.000448,0.000625,0.00047,0.000467,0.000611,0.000401,0.000437,0.000208,0.000261,0.000346,0.000475,0.000411,0.000171,0.000223,0.000276,0.000205,0.00017,0.000356,0.000203,0.000339,3e-05,0.000248,0.000287,0.000247,0.000421,0.000146,3.4e-05,0.00018,8.9e-05,0.000183,0.00024,0.00043,0.000161,0.000428,0.000441,0.000202,0.000545,0.000205,0.000192,0.000253,0.000297,0.000184,0.000313,0.000395,0.000232,0.000117,5.7e-05,0.000113,0.000221
0.000203,0.000508,0.000369,0.000591,0.000648,6.1e-05,0.00043,0.000411,0.000771,0.000619,0.000145,0.000296,0.000283,0.000275,0.000419,0.000434,0.000518,0.000305,3.5e-05,0.000414,0.000634,0.00055,0.000492,0.000596,0.000786,0.000677,0.000279,0.000407,0.000441,0.000275,0.000252,0.000287,0.000266,0.000261,0.000361,0.000507,0.000607,9.1e-05,0.000594,0.000363,0.000257,0.000281,0.000203,0.000195,9.3e-05,0.00039,0.000226,0.000389,0.000152,0.000262,6.7e-05,0.000313,0.000216,0.000509,0.000626,0.000302,0.000345,9.6e-05,0.000124,0.000545,0.000578,0.000143,0.000627,0.000589,0.000277,0.000349,0.000176,0.000172,0.000238,0.00039,0.000461,8.4e-05,0.000427,0.000157,0.00014,0.000144,0.000343,0.000368,0.00013,0.000396,0.00032,0.000305,0.00016,0.000159,0.000161,0.000158,0.000146,8e-05,0.000129,0.000521,0.000316,0.00049,0.000575,0.000491,0.000169,0.000453,0.000317,0.000195,0.000268,5.1e-05,0.000148,0.000231,0.000286,0.000375,0.000437,0.00035,0.000334,0.000242,0.000569,0.000372,0.000191,0.000356,0.000424,0.00034,0.000224,0.000123,0.000336,0.000206,0.000202,9e-05,0.00031
0.000146,0.000357,0.000373,0.000424,0.000535,0.000484,2.7e-05,0.000217,0.000309,0.000255,0.000301,0.000146,0.000365,9.8e-05,0.000338,0.000203,0.000386,0.000376,0.000287,0.000107,0.000349,0.000173,0.000183,0.000273,0.000439,0.000652,0.000758,0.000186,0.000197,0.000158,0.000315,0.000288,0.000162,0.000239,0.000154,3e-04,0.000253,0.000439,0.000379,0.000122,0.000157,0.000143,2.6e-05,5.3e-05,0.000195,0.000391,0.000403,7e-05,0.000217,5.1e-05,0.000345,0.000153,0.00021,0.000347,0.000435,0.000146,0.000451,0.000386,0.000158,0.000643,0.000241,0.000108,0.000373,0.000379,0.000288,0.000484,0.000131,0.000161,0.000297,0.000386,0.000155,0.000484,0.000239,0.00031,0.000165,4.4e-05,4.2e-05,0.000121,8.3e-05,0.000208,0.000128,0.000335,0.00016,0.00017,7.4e-05,0.000222,0.000106,0.00014,0.000183,0.000429,0.000219,0.000349,0.000304,9.7e-05,0.000247,0.000326,0.000373,0.000165,0.000192,0.000154,0.000141,5.7e-05,0.000192,0.000197,0.000187,0.000124,0.000125,8.3e-05,0.00025,6.8e-05,0.000105,0.000219,3.1e-05,0.000102,0.000177,0.000168,0.000356,0.000209,0.000201,0.000133,0.000103
0.000171,0.000366,0.000259,0.000217,0.000292,0.000309,0.000107,7.9e-05,0.000226,0.000164,5.3e-05,4e-05,0.000131,0.000207,0.000306,0.000402,0.000421,0.000514,0.000225,0.000259,0.000155,0.000291,0.00027,0.000211,0.000326,0.000409,8.8e-05,0.000281,0.000743,0.000501,0.00038,0.00022,0.000467,0.000131,7.7e-05,0.000284,0.000317,0.000413,0.000179,0.00031,0.000332,0.000183,4.5e-05,8.4e-05,0.000139,0.000271,0.000162,8.6e-05,0.000125,2e-04,0.000302,0.000329,0.000199,2.5e-05,0.000409,0.000322,0.000423,0.000305,0.000504,8e-05,0.000219,0.000107,0.000265,0.000501,0.000272,0.000445,0.000459,0.000353,0.000398,6.9e-05,0.000287,0.000405,0.000389,0.000154,0.000185,0.000161,0.000359,0.000297,0.000228,0.000146,0.000184,0.000212,1.5e-05,0.000149,5.5e-05,0.000235,0.00017,1.3e-05,0.000217,0.000347,0.000322,0.000424,3.5e-05,0.000146,0.000248,0.000208,0.000447,0.000213,0.000129,9.9e-05,0.000261,0.000225,0.000235,0.000332,0.000169,0.000165,0.000173,0.000137,0.000116,5.1e-05,6e-05,0.000139,0.000152,0.00015,5.9e-05,0.000149,0.000262,0.000206,0.000291,8.2e-05,4.8e-05
7e-05,0.000371,0.00016,0.000243,0.000331,3.2e-05,1e-06,4.8e-05,7.4e-05,0.00013,0.000279,0.00023,0.00018,9.4e-05,0.000306,6.2e-05,0.000399,0.000227,0.000115,0.000318,0.000499,0.000364,0.000141,7.4e-05,0.000286,0.000349,0.000275,0.000461,0.000498,0.000203,0.000159,1e-04,0.000411,0.000298,0.000195,9.2e-05,0.000212,7.1e-05,0.000323,0.000126,0.000355,0.000261,0.000283,0.00017,0.000156,0.000177,0.000102,0.000199,0.000122,0.000146,0.000133,0.000363,0.000229,0.000129,0.000276,0.00021,0.00033,0.000135,0.000261,0.000154,0.000404,0.000122,0.000319,6.1e-05,0.000142,0.000328,0.000175,0.000185,6.9e-05,0.000144,0.000298,7.7e-05,0.000244,0.000314,0.000271,1.3e-05,0.000258,0.000133,7.5e-05,0.000118,0.000192,0.000228,0.00016,7.8e-05,9.9e-05,0.000115,0.000129,0.00012,0.000209,0.000299,0.000108,0.00037,0.00015,0.000126,0.000166,0.000245,0.000237,0.000188,6.7e-05,0.000155,0.00011,0.00025,0.000184,0.000278,0.000167,0.000266,0.000139,0.000132,0.000139,0.000183,0.000146,0.000144,5.4e-05,7.9e-05,8.1e-05,0.000265,0.000173,8.6e-05,0.000134,0.000314,0.000118
0.00011,0.000349,0.000188,0.000304,0.000235,0.000187,6.4e-05,6.1e-05,9.9e-05,3.2e-05,0.000165,7.1e-05,8.9e-05,2.5e-05,0.000237,0.000231,0.000249,0.000209,3.7e-05,0.000186,0.000219,0.000102,0.000206,0.000163,0.000136,9.8e-05,0.000162,0.000399,0.000264,3.4e-05,5.6e-05,0.000131,0.000168,4.6e-05,0.000136,7.1e-05,7.4e-05,0.00014,0.000223,0.000267,0.000249,0.000177,0.000271,9.2e-05,0.000223,6.3e-05,9.6e-05,8e-05,5.6e-05,0.000152,0.000236,0.000221,0.000175,7.1e-05,0.000295,0.000275,0.000246,0.000212,0.000108,9.6e-05,0.000381,0.00044,0.000134,0.000272,0.000213,0.000257,0.000198,0.000167,0.000156,0.000153,0.000144,3.5e-05,0.000153,0.000215,6.7e-05,0.000219,0.00021,7e-05,6.2e-05,9.7e-05,5.7e-05,2.7e-05,4.7e-05,5.1e-05,8.5e-05,0.000114,9.4e-05,7.7e-05,9.4e-05,2.8e-05,0.000126,0.000153,0.000122,9.4e-05,0.000154,0.000158,0.000101,5.9e-05,0.000194,0.000146,0.000182,0.000146,0.000133,9e-05,6.7e-05,0.000174,0.000224,7.8e-05,0.000103,9.4e-05,9.3e-05,2.4e-05,5e-05,7.3e-05,0.000197,7.2e-05,0.000227,0.000103,3.7e-05,0.000212,0.000159
2.7e-05,0.000148,6.5e-05,0.000241,8e-05,7.8e-05,5.8e-05,3.9e-05,6.1e-05,4.6e-05,0.000161,5.3e-05,0.000117,0.000193,6.3e-05,6.2e-05,0.000167,1.5e-05,9.2e-05,0.00019,0.000121,0.000159,0.000264,0.000204,7.5e-05,0.000131,5.7e-05,0.000267,0.000144,0.000118,8.4e-05,0.000198,8.5e-05,4.3e-05,8.8e-05,0.00012,0.000153,0.000283,0.000223,0.000321,0.000149,5.9e-05,0.00013,0.000117,0.000266,0.000274,0.000245,0.000145,5.6e-05,7.9e-05,0.000173,0.000111,0.000122,0.000191,0.000211,0.000202,0.000114,0.000188,0.000125,0.000202,2e-04,6.9e-05,2.6e-05,0.000197,0.000126,0.000104,7.2e-05,3.4e-05,8.2e-05,1.5e-05,6.9e-05,0.000188,9.3e-05,8.8e-05,0.000115,0.000198,0.00018,7.3e-05,7.2e-05,4.7e-05,3.5e-05,0.000137,6.5e-05,5.7e-05,0.000116,0.000172,6.6e-05,3.9e-05,0.000132,0.000164,0.000178,0.000128,0.000188,0.000104,0.00012,0.000247,0.000184,0.000151,0.000124,2.1e-05,0.000145,3.1e-05,4.7e-05,2.9e-05,5.2e-05,0.000116,0.000143,0.000173,0.000145,8.3e-05,0.000102,8.1e-05,0.000109,9.3e-05,0.000164,0.000173,0.000168,0.000214,0.00013,9.8e-05,5e-06
7.2e-05,6.7e-05,4.5e-05,0.000169,1.4e-05,7.4e-05,5.3e-05,6.5e-05,9.9e-05,6e-05,8.9e-05,3e-05,9.6e-05,0.000103,8.1e-05,0.000104,1.7e-05,8.7e-05,0.000107,0.000115,0.00015,6.2e-05,0.000125,2.4e-05,4.4e-05,8.6e-05,7.9e-05,5.6e-05,0.000142,3.2e-05,9.5e-05,0.000138,3.5e-05,3.9e-05,2.5e-05,0.00012,0.000135,0.000129,0.000215,7.5e-05,7e-05,7.9e-05,4.6e-05,2.3e-05,0.000151,8.4e-05,0.000115,4.2e-05,4.5e-05,5.8e-05,9.6e-05,0.000121,4.7e-05,0.000201,2.8e-05,1e-04,9.2e-05,0.000105,6.3e-05,0.000144,0.000144,0.000144,3.9e-05,9.9e-05,3.3e-05,1.7e-05,3.4e-05,0.000104,2.3e-05,2.7e-05,9.9e-05,6.2e-05,7.8e-05,6.2e-05,0.00012,5.5e-05,8.1e-05,3.2e-05,3.6e-05,3.1e-05,5.9e-05,0.000114,0.00013,8.2e-05,0,7.1e-05,5.6e-05,4.1e-05,5.8e-05,6.2e-05,9.1e-05,1.6e-05,7e-05,0.000116,4.4e-05,0.00015,9.9e-05,8.5e-05,0.000124,5.2e-05,6.2e-05,2.9e-05,5.7e-05,9e-06,4.5e-05,6.5e-05,6e-06,6.1e-05,4.1e-05,1e-05,8.1e-05,6.4e-05,7.1e-05,6.7e-05,0.000108,7.7e-05,1.5e-05,0.000127,8.1e-05,7.1e-05,1.9e-05
7.7e-05,7.4e-05,8.3e-05,0.00014,4.3e-05,8e-05,7.9e-05,6.4e-05,9.2e-05,2.5e-05,6.6e-05,1e-04,0.00015,8e-05,6.8e-05,5.4e-05,4.2e-05,4.5e-05,0.000105,9.8e-05,9e-05,4.7e-05,0.000119,2.8e-05,8.6e-05,0.00012,8.8e-05,0.000106,5.5e-05,6.8e-05,9.3e-05,0.000164,6.8e-05,3.3e-05,1.7e-05,7.8e-05,0.000189,0.000116,7.2e-05,0.000185,5.3e-05,4.2e-05,5.3e-05,2.1e-05,9.6e-05,4.2e-05,0.00011,4.5e-05,4e-05,6.4e-05,9.9e-05,3.5e-05,1e-04,0.000156,9.2e-05,7.6e-05,8.8e-05,6.1e-05,3e-05,0.00012,5.2e-05,9.2e-05,6.6e-05,1.9e-05,0.000111,4.8e-05,7.5e-05,0.000114,6.5e-05,4.5e-05,6.6e-05,5.4e-05,5.5e-05,4.7e-05,6e-05,9e-05,6.3e-05,2.9e-05,2.6e-05,4.5e-05,3.6e-05,0.000102,4.7e-05,3e-05,3.6e-05,4.4e-05,4.7e-05,8.6e-05,6.1e-05,5.5e-05,4.3e-05,2.8e-05,7.6e-05,5.3e-05,5.7e-05,0.000129,9.8e-05,5.8e-05,0.000124,6e-05,6.5e-05,3.4e-05,5.2e-05,2.3e-05,3.2e-05,5.1e-05,7.1e-05,6.5e-05,5.3e-05,2.1e-05,0.000106,7.6e-05,5.6e-05,2.2e-05,0.000106,4.1e-05,2e-05,8.3e-05,4.5e-05,4.5e-05,4e-05
0.000102,0.00011,5.8e-05,0.000111,0.00017,0.000156,9.4e-05,0.000133,0.000187,0.000134,0.000147,0.000239,0.000207,9.1e-05,0.000156,0.000168,0.000178,0.000121,0.000125,0.000101,0.000105,8.7e-05,0.000146,0.000102,0.000202,0.000275,0.000189,0.000184,4.2e-05,9.9e-05,5.2e-05,0.00016,0.000176,0.000109,0.000173,4.7e-05,0.000206,0.000121,0.000126,0.000219,0.000215,0.000127,0.000101,6.9e-05,0.000186,9.5e-05,1e-04,5.5e-05,4.1e-05,0.000129,0.000228,0.000178,0.000268,0.000267,5.3e-05,0.00012,8.6e-05,7.2e-05,9.8e-05,0.000115,2e-05,0.000105,8.3e-05,5.2e-05,0.00011,6.5e-05,0.000174,0.000236,0.000255,2e-04,8.6e-05,7.2e-05,9e-05,0.000136,8.8e-05,0.000132,3.9e-05,0.000127,0.000158,9.8e-05,0.000125,0.000105,0.000102,4.3e-05,8.5e-05,6.6e-05,7.8e-05,0.00012,0.000106,9.8e-05,9e-05,1.4e-05,0.000107,0.000102,6.4e-05,8.7e-05,8.2e-05,8.4e-05,5.4e-05,8.8e-05,3.5e-05,4.8e-05,9.7e-05,4.4e-05,4.4e-05,3.9e-05,0.000147,4.5e-05,4.9e-05,5.9e-05,1e-04,4.6e-05,7.5e-05,0.000109,0.000149,6.7e-05,7.2e-05,6.9e-05,0.000119,9.3e-05,1.9e-05
8.6e-05,9.2e-05,3.9e-05,0.000181,9.1e-05,6e-05,4.8e-05,0.000122,7.6e-05,6.3e-05,0.000179,0.000325,0.000128,2.1e-05,0.000142,9.9e-05,0.000132,6.1e-05,7.2e-05,0.000183,7.8e-05,0.000116,3.4e-05,0.00014,0.000109,0.000158,0.000152,0.000251,7.5e-05,5e-05,3.2e-05,8e-05,0.000186,0.000181,8e-05,0.00014,6.3e-05,0.000259,0.000213,5.8e-05,0.000148,4.7e-05,0.000102,3e-05,0.00016,0.000206,0.000123,0.000106,0.000104,6.3e-05,0.000138,0.000159,0.000126,0.000208,7.6e-05,0.000131,6.8e-05,2.4e-05,1.4e-05,2.7e-05,0.00011,7.7e-05,9.5e-05,2.4e-05,6.1e-05,0.000114,0.000188,7.9e-05,5.4e-05,6.5e-05,0.000163,0.000148,8.1e-05,0.000112,9.8e-05,9.9e-05,9.2e-05,0.000124,0.00011,3.3e-05,6.9e-05,4e-06,1.8e-05,6.8e-05,0.000152,2.4e-05,2.1e-05,6.6e-05,6e-06,0.00013,0.000135,8.1e-05,0.000134,5.7e-05,3e-06,0.000156,7.2e-05,2.3e-05,0.000138,6.4e-05,6.8e-05,4.2e-05,6.3e-05,3.9e-05,5.9e-05,3e-05,0.000128,0.000131,0.000133,0.000103,6.3e-05,0.000127,0.000148,0.000116,9.5e-05,7.6e-05,0.000102,8.6e-05,0.000117,8.7e-05,2.2e-05
4.7e-05,0.000129,0.000106,0.000105,0.000101,6.9e-05,4.6e-05,9.8e-05,0.000114,9.5e-05,0.000121,0.000159,0.000194,0.000197,8.9e-05,0.000247,0.000156,4.4e-05,8.5e-05,0.000157,0.000118,1.8e-05,7e-05,0.000149,0.000107,3.6e-05,0.00012,0.000122,0.00011,0.00011,8.5e-05,3.8e-05,7.8e-05,8.1e-05,0.000154,5.4e-05,6.5e-05,0.000177,0.000176,0.000149,0.000176,0.000116,0.000108,8.8e-05,3.4e-05,0.000208,9.6e-05,3.7e-05,4.5e-05,0.000172,0.000357,0.000278,0.000119,0.000316,0.000239,6.9e-05,0.000144,9.9e-05,8.4e-05,7.9e-05,0.000141,0.000146,0.000141,0.000238,9.2e-05,0.000224,8e-05,0.000144,0.000183,0.000127,0.000107,8e-05,3.5e-05,8e-05,8.4e-05,9.1e-05,4.6e-05,4.1e-05,7.4e-05,9.9e-05,8.5e-05,9.2e-05,8.7e-05,6.1e-05,0.000139,0.00024,0.000124,8.2e-05,7.2e-05,0.000177,6.1e-05,9.6e-05,0.000215,0.000151,7.5e-05,0.000219,0.000161,5e-05,0.000226,0.000217,7.7e-05,7.6e-05,0.00013,0.000119,3.5e-05,6e-05,5.4e-05,0.000175,4.7e-05,0.000197,6.8e-05,0.000162,0.000297,0.000103,0.000105,0.00012,0.000223,0.000157,0.000159,0.000191,5.9e-05
0.000234,0.000153,2.1e-05,9e-05,2.2e-05,0.000119,9e-05,0.000155,0.000136,9.6e-05,3.9e-05,0.000135,7.4e-05,9e-05,7.8e-05,0.000231,0.000204,0.00014,0.000115,0.000119,0.000176,0.000148,7e-05,0.000158,0.000107,3.8e-05,0.000117,6.3e-05,6.4e-05,0.000268,0.000121,6e-05,6.9e-05,7.1e-05,4.1e-05,3.3e-05,0.000112,5.9e-05,0.000249,3.7e-05,0.00012,9.8e-05,4.4e-05,0.00012,0.000174,0.000252,8.7e-05,4.8e-05,7.4e-05,0.000228,0.000271,0.000392,0.000243,0.000189,0.000221,0.000166,9.7e-05,7.5e-05,9.8e-05,0.000205,0.00024,7.7e-05,7e-05,0.000267,0.000237,0.000414,0.000279,0.000268,9.7e-05,4.5e-05,6.2e-05,7.9e-05,0.000133,0.00011,7.6e-05,0.000146,0.00018,0.000194,0.000116,0.000103,4e-05,0.00013,0.000153,0.000161,0.000223,0.000267,0.000121,3.1e-05,2.2e-05,0.000169,0.000217,8e-05,0.00026,0.000167,0.000104,8.6e-05,0.000302,0.000178,0.000259,0.000326,0.000189,4.3e-05,0.000134,5e-05,0.000108,0.000126,0.000164,0.000198,0.000132,0.000362,0.000308,0.000207,0.00037,0.000291,0.000159,9.6e-05,0.000142,0.000113,0.000175,0.000178,0.000144
5.4e-05,6.4e-05,7.7e-05,8.7e-05,4.8e-05,0.000126,4.9e-05,0.000132,9e-05,0.000117,6.2e-05,7.1e-05,0.000116,9.2e-05,5.1e-05,0.000134,0.000129,1.5e-05,4.5e-05,5.7e-05,0.000138,3.7e-05,3.4e-05,8.7e-05,0.000107,0.000179,8.8e-05,0.000218,0.000144,0.000137,0.000181,0.000174,4.4e-05,5.6e-05,4.5e-05,6.6e-05,0.000104,0.000165,0.000137,8.3e-05,1.4e-05,6.4e-05,5.3e-05,0.000137,4.7e-05,0.000154,0.000138,7.3e-05,0.00011,0.000194,3.6e-05,0.000121,6.1e-05,0.000164,6.6e-05,0.000104,5.7e-05,7.3e-05,0.000129,0.000227,6.5e-05,5e-05,7.7e-05,0.000169,5.1e-05,0.000237,9.8e-05,8.7e-05,0.000163,2e-05,8.1e-05,6.9e-05,0.000103,8.9e-05,4.1e-05,0.000122,8.2e-05,8.6e-05,7.3e-05,0.000103,8.9e-05,7.8e-05,0.000165,5.9e-05,0.000103,6.8e-05,4.3e-05,3.5e-05,1.3e-05,0.000154,3.6e-05,8.2e-05,0.000135,8.5e-05,3.6e-05,5.1e-05,0.000191,0.000142,0.000126,0.000171,5.9e-05,9e-05,7.1e-05,2.7e-05,8e-05,4.2e-05,0.000148,2.7e-05,2.8e-05,0.000288,0.000217,0.000148,0.000221,6.3e-05,7.6e-05,6.7e-05,0.000154,9.3e-05,0.000192,0.000194,0.00015
9.5e-05,0.000139,0.00011,0.000189,9.7e-05,4.5e-05,1.3e-05,8.3e-05,0.000167,0.000133,5.5e-05,2.1e-05,9.4e-05,1.9e-05,2.5e-05,0.000139,6.7e-05,1.3e-05,9e-06,0.000154,4.1e-05,8.1e-05,8.5e-05,4.7e-05,8e-05,0.000211,0.000281,8.1e-05,9.9e-05,0.000123,3.3e-05,4.8e-05,5e-05,4.9e-05,1e-05,5e-06,0.000132,0.000152,0.000128,0.000126,4.9e-05,9.6e-05,2.5e-05,8e-05,6.4e-05,0.000105,5.7e-05,5.9e-05,6.3e-05,0.000115,1.2e-05,0.000106,0.000137,0.000114,0.000111,3e-05,0.000136,6.7e-05,5.5e-05,0.000193,0.000145,0.000165,0.000119,0.000114,8.1e-05,0.000107,0.000181,0.000137,0.000139,5.8e-05,0.000135,5.3e-05,0.00015,0.000192,9.4e-05,4.4e-05,0.000118,0.000133,6.2e-05,3.7e-05,3.9e-05,7.9e-05,0.000159,0.000167,0.000243,0.000164,8.8e-05,7e-05,7.9e-05,7.7e-05,7.7e-05,9e-05,6.9e-05,0.000134,0.000137,8.4e-05,0.000104,6.9e-05,9.1e-05,6.5e-05,3.1e-05,8.1e-05,0.000111,8.7e-05,8e-05,4.1e-05,0.000139,0.000124,0.000125,0.000153,8.2e-05,2.4e-05,5.8e-05,2.3e-05,5.3e-05,6e-06,0.000125,6.5e-05,0.000119,6.1e-05,0.000102
8e-05,1.1e-05,5.9e-05,0.000121,0.000104,0.000127,4.8e-05,7.4e-05,0.000102,8.5e-05,3.8e-05,4.7e-05,0.000103,0.000156,0.000107,7e-05,4.1e-05,4.2e-05,6.4e-05,0.000144,8.7e-05,3.5e-05,8.5e-05,4.1e-05,1e-04,0.000132,0.000125,0.000246,0.000118,7.4e-05,1.9e-05,7.3e-05,6.7e-05,7.6e-05,8.8e-05,0.000129,0.000171,4.4e-05,0.000128,9e-05,4.5e-05,7.5e-05,0.000109,1.8e-05,4.4e-05,1.5e-05,3.9e-05,4e-05,5.5e-05,8.5e-05,5.5e-05,0.000215,0.000235,0.000134,1e-05,1.4e-05,9.4e-05,6.5e-05,4.4e-05,0.000112,4.7e-05,9.8e-05,2.6e-05,8.4e-05,4e-06,5.5e-05,6.7e-05,7.3e-05,2.5e-05,4.8e-05,0.000114,6.8e-05,0.000157,0.000114,6.3e-05,8e-05,0.00016,0.000135,8e-05,6.7e-05,7e-05,9.3e-05,7.9e-05,4.1e-05,0.000142,5.1e-05,5.1e-05,6.4e-05,6.9e-05,4.7e-05,0.000123,9e-05,0.000158,0.000197,5.1e-05,1.2e-05,4.2e-05,4.9e-05,8.6e-05,0.000126,8.7e-05,4.3e-05,6.1e-05,4e-05,8.8e-05,5.6e-05,0.000116,4.5e-05,9.2e-05,9.4e-05,5.7e-05,5.2e-05,0.000134,7.5e-05,9.3e-05,9.4e-05,0.000123,0.000105,6.5e-05,4.1e-05,3.6e-05
3.7e-05,3.3e-05,2.8e-05,2.7e-05,5.4e-05,0.000179,0.000143,0.000118,2.7e-05,9.6e-05,9.4e-05,5.4e-05,7.5e-05,7.3e-05,6.4e-05,7.2e-05,0.000164,0.000123,2.1e-05,0.000124,4.5e-05,9.3e-05,0.000135,5.9e-05,9.6e-05,1.2e-05,9.7e-05,9.7e-05,1.5e-05,4e-05,2.4e-05,7.5e-05,2.6e-05,9.3e-05,6.9e-05,8.8e-05,8.4e-05,0.000137,0.000123,8.5e-05,5.4e-05,8.7e-05,7.6e-05,9.1e-05,0.000115,0.000135,5.4e-05,3.4e-05,8.6e-05,9.7e-05,9.8e-05,8.6e-05,9.2e-05,6.1e-05,4.7e-05,7.1e-05,9e-05,7e-05,4.8e-05,9e-06,8.5e-05,0.000135,6.9e-05,7.9e-05,7.2e-05,5.1e-05,1.8e-05,4e-05,4.2e-05,5.3e-05,2.6e-05,3.1e-05,0.000104,8.4e-05,1.4e-05,2.9e-05,0.000104,6.5e-05,5.1e-05,5e-06,1.8e-05,0.000123,3.2e-05,5.7e-05,7.5e-05,3.7e-05,2.4e-05,5.4e-05,2.1e-05,6.3e-05,5.5e-05,0.000107,0.00014,7.6e-05,3.9e-05,3.9e-05,5.8e-05,2.1e-05,7e-05,0.00012,8e-05,5.5e-05,5.2e-05,3.5e-05,4.8e-05,3.4e-05,0.000111,0.000138,8.1e-05,4.4e-05,2.7e-05,8.5e-05,0.000108,6.2e-05,6.1e-05,5.1e-05,0.000108,6.9e-05,1e-05,4.3e-05,3.1e-05
2.9e-05,6.9e-05,4.2e-05,7.9e-05,2.4e-05,9.6e-05,1.9e-05,2.7e-05,8.8e-05,5.6e-05,5.7e-05,2.2e-05,2.3e-05,9e-06,5.9e-05,0.000127,8e-05,3e-05,1.6e-05,0.000108,7.7e-05,5.3e-05,1.2e-05,2e-05,9.7e-05,5.1e-05,2.9e-05,7.3e-05,0.000128,5.8e-05,2.5e-05,5.5e-05,1.6e-05,9e-05,4.7e-05,6.2e-05,4.7e-05,0.000168,0.000116,8.5e-05,4.9e-05,3e-05,8.9e-05,7.5e-05,3.1e-05,8.8e-05,3.5e-05,1.8e-05,8.9e-05,5.4e-05,0.000109,0.000113,1.3e-05,3.1e-05,5.6e-05,4.9e-05,8.7e-05,1.7e-05,2.6e-05,9.4e-05,2.2e-05,2.5e-05,7e-05,6.8e-05,3.3e-05,6.9e-05,7.5e-05,5.2e-05,4e-05,3.4e-05,2.9e-05,4.7e-05,5e-05,7.6e-05,7.2e-05,5.3e-05,3.3e-05,6.6e-05,2.8e-05,4.3e-05,4.2e-05,9.6e-05,5.3e-05,7.5e-05,3.4e-05,3.6e-05,3.9e-05,1.6e-05,1.6e-05,5.9e-05,2.1e-05,6.5e-05,0.000131,8.5e-05,4.1e-05,2.9e-05,5.8e-05,2e-05,5.2e-05,6.1e-05,2.7e-05,2.8e-05,4e-05,5e-06,2.8e-05,8e-06,9.3e-05,9.1e-05,9.2e-05,5e-05,4.2e-05,0.000102,3.8e-05,3.9e-05,4.4e-05,4.3e-05,3.7e-05,4.7e-05,6e-05,5.4e-05,3.7e-05
1.7e-05,1e-05,8e-06,1.3e-05,2.5e-05,1.3e-05,2.2e-05,1.1e-05,4e-05,1.2e-05,6e-06,1.6e-05,1.4e-05,1.5e-05,8e-06,3.3e-05,7e-06,8e-06,1.6e-05,3.1e-05,1.1e-05,2.4e-05,3.9e-05,2.4e-05,3.6e-05,5e-06,2.4e-05,1.9e-05,4.8e-05,1.5e-05,8e-06,2.1e-05,5e-06,2.1e-05,1.1e-05,2.3e-05,2.3e-05,6e-05,2.9e-05,5.5e-05,1.1e-05,1.1e-05,3.5e-05,8e-06,3.1e-05,2.5e-05,6e-06,6e-06,2.6e-05,2.8e-05,3.6e-05,5.3e-05,1.3e-05,2.7e-05,1.3e-05,1.2e-05,1.4e-05,3.5e-05,1.1e-05,4.8e-05,3e-05,3.1e-05,2.5e-05,1.5e-05,1.4e-05,7e-06,8e-06,2.5e-05,1.7e-05,1.7e-05,7e-06,2e-05,2e-05,6e-06,1e-05,3.9e-05,2.3e-05,3.2e-05,1.5e-05,2e-05,9e-06,3.4e-05,2.4e-05,2e-05,3.5e-05,1.2e-05,1.2e-05,6e-06,1.4e-05,1.6e-05,2.9e-05,3.1e-05,3.2e-05,1.8e-05,1.8e-05,8e-06,4.1e-05,3e-05,2e-05,3.2e-05,1.4e-05,1.1e-05,2e-05,7e-06,1.6e-05,1.2e-05,3e-05,2e-06,2e-05,3.5e-05,2.8e-05,2.6e-05,1.3e-05,2.2e-05,3e-05,6e-06,1.5e-05,2.4e-05,1.1e-05,2e-05,5e-06
1.5e-05,1.2e-05,7e-06,1e-05,2.1e-05,1.8e-05,2.6e-05,1.9e-05,1.9e-05,6e-06,1.3e-05,3e-06,1e-05,6e-06,8e-06,3e-05,6e-06,1.3e-05,5e-06,1.3e-05,1.5e-05,9e-06,3e-05,1.8e-05,2.3e-05,8e-06,1.8e-05,2.4e-05,3.5e-05,9e-06,6e-06,2.8e-05,1.1e-05,3e-06,1e-05,2.7e-05,3e-05,3.8e-05,3.2e-05,2.4e-05,8e-06,6e-06,1.3e-05,9e-06,1.3e-05,1e-06,1.9e-05,8e-06,1.1e-05,2.7e-05,2.8e-05,3e-05,1.1e-05,2.3e-05,2.3e-05,8e-06,1e-06,1.7e-05,1.3e-05,3.7e-05,1.5e-05,1.8e-05,2.6e-05,9e-06,1.1e-05,8e-06,4e-06,1.9e-05,7e-06,9e-06,6e-06,1.1e-05,7e-06,3e-06,1.2e-05,2.4e-05,8e-06,1.6e-05,9e-06,4e-06,4e-06,3.5e-05,2e-05,1.4e-05,2.2e-05,8e-06,1e-05,5e-06,1.3e-05,1.5e-05,1.7e-05,2.2e-05,2.4e-05,1.5e-05,1.4e-05,1.5e-05,2e-05,3e-06,7e-06,1.6e-05,1e-05,5e-06,1.5e-05,7e-06,1e-05,3e-06,2.1e-05,6e-06,1.9e-05,2.4e-05,2.2e-05,2.7e-05,1.2e-05,2.3e-05,1.8e-05,6e-06,1.7e-05,6e-06,1.2e-05,1.3e-05,7e-06
1.6e-05,6e-06,2e-06,2.3e-05,1.5e-05,1.3e-05,7e-06,5e-06,1.8e-05,3e-06,1.4e-05,8e-06,1.7e-05,1.8e-05,1.2e-05,2.5e-05,7e-06,1e-05,1e-05,2.2e-05,9e-06,1e-05,2.6e-05,8e-06,2.4e-05,1e-05,2.1e-05,1.7e-05,1.6e-05,7e-06,1.2e-05,2.2e-05,2e-06,6e-06,5e-06,2.2e-05,1.3e-05,1.6e-05,2.6e-05,2.5e-05,3e-06,6e-06,1.1e-05,4e-06,6e-06,1e-05,3e-06,3e-06,1.5e-05,1.8e-05,1.8e-05,2.1e-05,6e-06,8e-06,1.4e-05,5e-06,9e-06,9e-06,2e-06,2.8e-05,9e-06,1.6e-05,1.4e-05,1e-05,1.5e-05,7e-06,7e-06,3e-06,1e-05,1e-06,1.5e-05,6e-06,2e-06,4e-06,8e-06,1.6e-05,6e-06,1e-05,4e-06,8e-06,8e-06,2.8e-05,1.4e-05,7e-06,2.1e-05,5e-06,5e-06,1e-06,7e-06,1.3e-05,8e-06,1.7e-05,1.8e-05,6e-06,8e-06,9e-06,7e-06,3e-06,6e-06,1.1e-05,4e-06,8e-06,1.6e-05,3e-06,1e-05,9e-06,1.8e-05,8e-06,1.2e-05,1.8e-05,2e-05,2.5e-05,1e-05,1.5e-05,2e-05,1e-05,2.1e-05,7e-06,6e-06,1.4e-05,9e-06
1.2e-05,7e-06,2e-06,1.7e-05,6e-06,3e-06,1e-05,2e-06,1.3e-05,8e-06,1.1e-05,1.3e-05,8e-06,1.2e-05,1.3e-05,2.5e-05,2e-06,1e-05,1.1e-05,2.3e-05,1.2e-05,2e-06,1.8e-05,4e-06,1.9e-05,2e-06,3e-05,1.8e-05,2.3e-05,8e-06,4e-06,1.6e-05,8e-06,8e-06,6e-06,1.5e-05,2e-05,9e-06,2e-05,2e-05,3e-06,7e-06,1.5e-05,5e-06,8e-06,1.2e-05,1.4e-05,3e-06,1.2e-05,1.9e-05,1.7e-05,2.6e-05,3e-06,1.3e-05,8e-06,8e-06,1.3e-05,6e-06,2e-06,2.4e-05,9e-06,2.2e-05,1.6e-05,7e-06,1.3e-05,4e-06,3e-06,7e-06,1e-05,9e-06,1.3e-05,4e-06,6e-06,2e-06,2e-06,1.6e-05,9e-06,9e-06,5e-06,3e-06,1e-05,2.8e-05,9e-06,6e-06,1.5e-05,8e-06,2e-06,7e-06,7e-06,2e-06,1.3e-05,1.7e-05,2.3e-05,2e-06,5e-06,5e-06,1.3e-05,4e-06,7e-06,6e-06,3e-06,3e-06,1.3e-05,4e-06,6e-06,6e-06,1.2e-05,4e-06,1.5e-05,2e-05,1.9e-05,2.1e-05,1.2e-05,9e-06,1.1e-05,9e-06,1.9e-05,3e-06,5e-06,1.1e-05,6e-06
9e-06,7e-06,3e-06,2e-05,3e-06,9e-06,2e-06,6e-06,1.4e-05,6e-06,1.1e-05,8e-06,0,1.2e-05,1.1e-05,2.3e-05,6e-06,1.6e-05,1e-05,2.1e-05,1.4e-05,2e-06,1.8e-05,1e-05,2.1e-05,9e-06,2.1e-05,1.8e-05,2.1e-05,8e-06,9e-06,1.3e-05,1e-05,8e-06,4e-06,1.4e-05,1.8e-05,7e-06,2.2e-05,3e-05,6e-06,6e-06,1.2e-05,2e-06,9e-06,1.3e-05,1.4e-05,2e-06,9e-06,1.9e-05,1.8e-05,3.1e-05,2e-06,1.3e-05,1.4e-05,3e-06,3e-06,2e-06,5e-06,2.9e-05,1.3e-05,1.1e-05,1.1e-05,4e-06,6e-06,7e-06,2e-06,4e-06,1e-05,9e-06,1e-05,1e-06,2e-06,4e-06,5e-06,1.7e-05,7e-06,1.2e-05,5e-06,3e-06,7e-06,2.8e-05,1.1e-05,8e-06,1.6e-05,5e-06,7e-06,5e-06,3e-06,6e-06,1.5e-05,1.9e-05,1.7e-05,1.3e-05,1.1e-05,8e-06,7e-06,1.2e-05,7e-06,9e-06,4e-06,8e-06,1.5e-05,2e-06,5e-06,5e-06,1.3e-05,6e-06,1.6e-05,2e-05,1.9e-05,2.2e-05,7e-06,1e-05,1.4e-05,5e-06,1.9e-05,5e-06,7e-06,1.2e-05,5e-06
8e-06,9e-06,1e-05,1.7e-05,5e-06,1.1e-05,6e-06,3e-06,1.6e-05,1e-06,1.4e-05,6e-06,9e-06,1.9e-05,1.3e-05,1.9e-05,8e-06,1.1e-05,9e-06,1.6e-05,1.4e-05,1e-06,1.6e-05,1e-05,2.1e-05,7e-06,2e-05,1.5e-05,2e-05,5e-06,2e-06,1.1e-05,1.2e-05,8e-06,7e-06,9e-06,1.7e-05,5e-06,3.5e-05,1.8e-05,3e-06,2e-06,1.8e-05,5e-06,9e-06,1.4e-05,1.3e-05,3e-06,1.2e-05,2.1e-05,1.2e-05,2.6e-05,1e-06,1e-05,1.4e-05,3e-06,3e-06,3e-06,6e-06,2.4e-05,1.6e-05,1.6e-05,8e-06,8e-06,1e-05,6e-06,2e-06,3e-06,9e-06,6e-06,1.5e-05,4e-06,3e-06,5e-06,4e-06,1.8e-05,8e-06,1.2e-05,7e-06,2e-06,8e-06,2.7e-05,1.3e-05,9e-06,1.1e-05,1.2e-05,1e-05,6e-06,4e-06,7e-06,1.4e-05,1.9e-05,1.1e-05,5e-06,6e-06,9e-06,3e-06,5e-06,3e-06,2e-06,7e-06,7e-06,1.2e-05,1e-06,4e-06,1e-06,1e-05,9e-06,1e-05,1.6e-05,1.6e-05,2.3e-05,1.1e-05,1e-05,1.6e-05,4e-06,1e-05,8e-06,3e-06,1.4e-05,3e-06
7e-06,6e-06,9e-06,1.9e-05,6e-06,1.3e-05,8e-06,5e-06,1.5e-05,7e-06,1.1e-05,8e-06,1.1e-05,1.1e-05,1.1e-05,1.7e-05,1.2e-05,1.2e-05,8e-06,2e-05,1.2e-05,3e-06,1.7e-05,1e-05,1.8e-05,3e-06,2.6e-05,1.2e-05,1.7e-05,3e-06,2e-06,1.6e-05,8e-06,9e-06,4e-06,9e-06,1.2e-05,7e-06,2.8e-05,2.2e-05,2e-06,3e-06,1.1e-05,2e-06,6e-06,1e-05,1.5e-05,4e-06,1.4e-05,1.7e-05,1.3e-05,2.5e-05,2e-06,9e-06,1e-05,4e-06,6e-06,5e-06,4e-06,2.3e-05,1.4e-05,9e-06,1e-05,9e-06,8e-06,5e-06,7e-06,2e-06,7e-06,7e-06,1.2e-05,2e-06,4e-06,6e-06,4e-06,1.2e-05,0,1.5e-05,6e-06,2e-06,1.1e-05,2.3e-05,6e-06,6e-06,1e-05,7e-06,6e-06,3e-06,5e-06,4e-06,1.2e-05,1.6e-05,1e-05,6e-06,6e-06,7e-06,7e-06,6e-06,3e-06,4e-06,4e-06,7e-06,1.3e-05,3e-06,4e-06,3e-06,1e-05,4e-06,1e-05,1.6e-05,2.1e-05,2.3e-05,1.2e-05,6e-06,1.5e-05,8e-06,1.4e-05,9e-06,1.1e-05,1.1e-05,2e-06
6e-06,1.1e-05,2e-06,2.2e-05,8e-06,5e-06,5e-06,4e-06,1.2e-05,5e-06,1.1e-05,5e-06,4e-06,6e-06,9e-06,2.1e-05,9e-06,9e-06,1.1e-05,2e-05,1.9e-05,3e-06,1.2e-05,1.3e-05,1.6e-05,9e-06,1.6e-05,1.5e-05,1.6e-05,5e-06,6e-06,1.1e-05,3e-06,8e-06,9e-06,7e-06,1.2e-05,3e-06,2.4e-05,1.9e-05,4e-06,1e-06,1.2e-05,2e-06,3e-06,8e-06,8e-06,6e-06,1.4e-05,1.7e-05,8e-06,2.4e-05,3e-06,1.3e-05,1.3e-05,2e-06,6e-06,1e-05,9e-06,1.9e-05,1.3e-05,1.8e-05,1.4e-05,7e-06,1.1e-05,4e-06,6e-06,4e-06,9e-06,4e-06,1.2e-05,3e-06,5e-06,9e-06,5e-06,1.5e-05,5e-06,6e-06,9e-06,5e-06,8e-06,2.4e-05,8e-06,6e-06,5e-06,4e-06,4e-06,8e-06,6e-06,8e-06,1.4e-05,1.1e-05,9e-06,9e-06,6e-06,3e-06,9e-06,8e-06,9e-06,1.3e-05,6e-06,1e-05,1.1e-05,5e-06,6e-06,2e-06,1.4e-05,7e-06,1.1e-05,1.6e-05,2.1e-05,1.7e-05,1.3e-05,1.4e-05,1.4e-05,1.1e-05,9e-06,2e-06,5e-06,1.6e-05,5e-06
2e-06,1.2e-05,8e-06,2.1e-05,5e-06,9e-06,7e-06,1.1e-05,1.9e-05,1e-06,1.3e-05,1.2e-05,7e-06,1.7e-05,8e-06,2.4e-05,6e-06,3e-06,1e-05,2e-05,1.9e-05,1.2e-05,1.8e-05,7e-06,1.7e-05,1.2e-05,2.4e-05,1.1e-05,1.6e-05,7e-06,2e-06,1.1e-05,2e-06,8e-06,6e-06,8e-06,1.1e-05,8e-06,2.5e-05,1.9e-05,0,3e-06,8e-06,5e-06,9e-06,1.3e-05,5e-06,5e-06,1.2e-05,1.3e-05,1.2e-05,2.5e-05,4e-06,1.4e-05,9e-06,3e-06,9e-06,9e-06,7e-06,2.3e-05,1e-05,1.3e-05,1.2e-05,4e-06,1.7e-05,1.1e-05,8e-06,6e-06,5e-06,5e-06,1.5e-05,3e-06,4e-06,4e-06,4e-06,1.9e-05,5e-06,8e-06,5e-06,4e-06,7e-06,2.5e-05,8e-06,4e-06,1.2e-05,4e-06,4e-06,3e-06,3e-06,1.1e-05,8e-06,1.5e-05,1.6e-05,1e-05,6e-06,1e-05,1.2e-05,1.1e-05,6e-06,7e-06,9e-06,8e-06,1.4e-05,3e-06,5e-06,6e-06,8e-06,5e-06,1e-05,1.5e-05,1.1e-05,2.4e-05,8e-06,5e-06,6e-06,7e-06,8e-06,4e-06,1e-06,9e-06,8e-06
2e-06,7e-06,1e-06,1.6e-05,1e-05,1.2e-05,3e-06,3e-06,1.3e-05,7e-06,1.3e-05,8e-06,6e-06,1.1e-05,5e-06,2e-05,9e-06,8e-06,5e-06,1.9e-05,1.4e-05,9e-06,1.7e-05,1.2e-05,1.5e-05,6e-06,1.8e-05,1.9e-05,1.8e-05,5e-06,3e-06,1e-05,5e-06,3e-06,3e-06,1.1e-05,1.4e-05,5e-06,2.4e-05,2.1e-05,0,4e-06,8e-06,4e-06,3e-06,1e-05,1.5e-05,4e-06,8e-06,1.4e-05,1e-05,2e-05,6e-06,1.1e-05,1.7e-05,3e-06,1.3e-05,2e-06,7e-06,2.6e-05,1e-05,1.2e-05,6e-06,1.5e-05,6e-06,7e-06,2e-06,7e-06,9e-06,7e-06,1.4e-05,4e-06,2e-06,5e-06,4e-06,1.4e-05,7e-06,3e-06,7e-06,2e-06,8e-06,2.3e-05,6e-06,3e-06,1.4e-05,6e-06,6e-06,6e-06,4e-06,1.1e-05,1.3e-05,2.2e-05,5e-06,7e-06,3e-06,1.2e-05,4e-06,1e-05,1.1e-05,8e-06,9e-06,9e-06,1.6e-05,5e-06,8e-06,6e-06,1.2e-05,2e-06,1.1e-05,1.2e-05,1.6e-05,1.8e-05,9e-06,4e-06,9e-06,7e-06,1.2e-05,2e-06,1e-06,1e-05,1e-06
3e-06,7e-06,4e-06,1.9e-05,9e-06,1.9e-05,4e-06,4e-06,1e-05,3e-06,8e-06,9e-06,5e-06,1.4e-05,8e-06,2e-05,1e-05,2e-06,5e-06,2.2e-05,1.5e-05,4e-06,1.7e-05,1e-05,1.5e-05,5e-06,1.4e-05,1.6e-05,1.7e-05,4e-06,3e-06,1.2e-05,9e-06,8e-06,6e-06,9e-06,1.3e-05,7e-06,2.5e-05,1.6e-05,6e-06,5e-06,1e-05,4e-06,7e-06,2e-06,9e-06,1e-06,9e-06,1.3e-05,1.1e-05,1.8e-05,2e-06,1.5e-05,1.3e-05,4e-06,1e-05,5e-06,2e-06,2.3e-05,7e-06,1.1e-05,5e-06,1.1e-05,1.3e-05,3e-06,0,3e-06,8e-06,6e-06,8e-06,4e-06,5e-06,5e-06,2e-06,1.3e-05,7e-06,6e-06,1e-06,3e-06,1e-05,2.1e-05,1e-05,0,1.3e-05,5e-06,4e-06,1e-06,3e-06,7e-06,1.4e-05,1.8e-05,1e-05,5e-06,0,1e-05,1.2e-05,5e-06,5e-06,4e-06,7e-06,4e-06,1.1e-05,1e-06,7e-06,0,8e-06,6e-06,9e-06,1.4e-05,1.5e-05,1.4e-05,8e-06,6e-06,7e-06,3e-06,1.3e-05,7e-06,7e-06,1.2e-05,4e-06
6e-06,5e-06,7e-06,2e-05,9e-06,4e-06,5e-06,4e-06,7e-06,9e-06,4e-06,7e-06,6e-06,1.2e-05,8e-06,1.4e-05,2e-06,1e-06,1.3e-05,1.8e-05,1.2e-05,2e-06,2.2e-05,1.2e-05,1.6e-05,1e-05,1.8e-05,1.1e-05,1.5e-05,3e-06,6e-06,1.6e-05,9e-06,3e-06,5e-06,8e-06,1.4e-05,6e-06,2.5e-05,2e-05,5e-06,3e-06,1e-05,4e-06,3e-06,8e-06,1.4e-05,5e-06,1.2e-05,1.4e-05,9e-06,1.6e-05,5e-06,1.5e-05,1.7e-05,5e-06,8e-06,2e-06,6e-06,1.6e-05,1.1e-05,9e-06,7e-06,9e-06,8e-06,4e-06,1e-06,6e-06,1e-05,3e-06,7e-06,3e-06,1e-06,8e-06,5e-06,1.1e-05,7e-06,7e-06,3e-06,3e-06,8e-06,2e-05,1.1e-05,6e-06,1e-05,1.1e-05,1e-06,3e-06,6e-06,1e-06,1.1e-05,1.7e-05,1.1e-05,4e-06,4e-06,1.5e-05,4e-06,4e-06,6e-06,3e-06,5e-06,4e-06,1.2e-05,0,5e-06,1e-06,6e-06,9e-06,1.1e-05,1.2e-05,1.1e-05,1.3e-05,9e-06,5e-06,7e-06,5e-06,6e-06,4e-06,3e-06,9e-06,7e-06
4e-06,8e-06,7e-06,2.3e-05,5e-06,6e-06,4e-06,4e-06,1.1e-05,7e-06,4e-06,8e-06,5e-06,1.1e-05,9e-06,1.3e-05,3e-06,6e-06,7e-06,1.9e-05,1.2e-05,6e-06,1.1e-05,5e-06,1.3e-05,7e-06,1.7e-05,1.8e-05,1.9e-05,2e-06,5e-06,9e-06,3e-06,8e-06,7e-06,1e-05,1e-05,6e-06,2.7e-05,1.8e-05,4e-06,9e-06,1e-05,1e-06,0,1.3e-05,3e-06,4e-06,1.3e-05,1.2e-05,8e-06,1.4e-05,5e-06,1.2e-05,1.1e-05,8e-06,6e-06,2e-06,4e-06,1.8e-05,1e-05,1.5e-05,1.2e-05,3e-06,8e-06,6e-06,1e-06,5e-06,6e-06,2e-06,7e-06,2e-06,4e-06,4e-06,1e-06,1e-05,9e-06,1.3e-05,1e-06,0,8e-06,2.1e-05,5e-06,1e-06,7e-06,7e-06,4e-06,4e-06,4e-06,8e-06,1.7e-05,2.1e-05,7e-06,5e-06,7e-06,8e-06,7e-06,1e-06,6e-06,4e-06,9e-06,5e-06,1e-05,4e-06,2e-06,4e-06,8e-06,9e-06,1e-05,1.2e-05,1.4e-05,1.4e-05,1e-05,5e-06,9e-06,5e-06,6e-06,1.1e-05,6e-06,1.3e-05,7e-06
1e-06,7e-06,6e-06,1.4e-05,6e-06,1e-05,3e-06,5e-06,1.3e-05,7e-06,1.1e-05,4e-06,3e-06,1.2e-05,8e-06,1.6e-05,5e-06,4e-06,9e-06,1.7e-05,1.3e-05,6e-06,1.2e-05,9e-06,1.3e-05,6e-06,1.8e-05,2.4e-05,9e-06,8e-06,6e-06,1.1e-05,1e-06,4e-06,6e-06,4e-06,1.3e-05,1e-05,1.8e-05,1.8e-05,3e-06,7e-06,1e-05,3e-06,3e-06,1.1e-05,8e-06,3e-06,9e-06,1.2e-05,9e-06,1.9e-05,3e-06,1e-05,8e-06,1e-05,1.1e-05,6e-06,2e-06,2.5e-05,3e-06,1.3e-05,7e-06,2e-06,9e-06,7e-06,1e-06,5e-06,7e-06,4e-06,6e-06,3e-06,2e-06,4e-06,2e-06,1.1e-05,5e-06,6e-06,5e-06,5e-06,8e-06,1.9e-05,2e-06,2e-06,1.1e-05,1e-06,4e-06,7e-06,5e-06,7e-06,1.7e-05,1.8e-05,1.4e-05,1.1e-05,9e-06,1.1e-05,9e-06,6e-06,4e-06,7e-06,4e-06,2e-06,1.2e-05,7e-06,1.1e-05,1e-06,9e-06,6e-06,9e-06,1.3e-05,1.4e-05,1.5e-05,1.3e-05,7e-06,9e-06,5e-06,7e-06,6e-06,2e-06,1.2e-05,3e-06
5e-06,5e-06,6e-06,2e-05,9e-06,6e-06,5e-06,9e-06,1.2e-05,1e-06,9e-06,8e-06,2e-06,1.3e-05,7e-06,1.1e-05,9e-06,1.2e-05,7e-06,1.7e-05,1.2e-05,5e-06,1.8e-05,9e-06,1.1e-05,7e-06,1.9e-05,1.6e-05,1.3e-05,2e-06,4e-06,1.3e-05,4e-06,4e-06,6e-06,8e-06,1.6e-05,8e-06,2e-05,1.6e-05,4e-06,6e-06,8e-06,1e-06,4e-06,1.1e-05,7e-06,2e-06,8e-06,1.4e-05,8e-06,2.2e-05,4e-06,1.2e-05,1.8e-05,9e-06,3e-06,4e-06,6e-06,1.7e-05,7e-06,1.2e-05,9e-06,6e-06,1e-05,4e-06,5e-06,6e-06,8e-06,4e-06,8e-06,3e-06,4e-06,4e-06,2e-06,9e-06,5e-06,7e-06,2e-06,2e-06,6e-06,2.2e-05,7e-06,7e-06,1e-05,6e-06,7e-06,2e-06,4e-06,8e-06,1.6e-05,2.2e-05,7e-06,5e-06,4e-06,1e-05,5e-06,1e-06,3e-06,3e-06,5e-06,4e-06,9e-06,3e-06,7e-06,2e-06,6e-06,7e-06,8e-06,1.3e-05,1e-05,1.3e-05,1.2e-05,7e-06,9e-06,4e-06,9e-06,2e-06,2e-06,1.3e-05,5e-06
3e-06,9e-06,5e-06,1.7e-05,1e-05,1.4e-05,4e-06,4e-06,1.1e-05,6e-06,9e-06,4e-06,5e-06,7e-06,9e-06,1.2e-05,2e-06,1.2e-05,1.2e-05,1.5e-05,1e-05,4e-06,1.5e-05,6e-06,1.4e-05,1e-05,2.1e-05,1.9e-05,1.1e-05,7e-06,3e-06,1e-05,3e-06,1e-06,4e-06,9e-06,1.7e-05,5e-06,2.2e-05,1.8e-05,2e-06,0,9e-06,2e-06,4e-06,7e-06,5e-06,2e-06,8e-06,1.2e-05,8e-06,1.4e-05,2e-06,1.3e-05,2.1e-05,8e-06,7e-06,6e-06,7e-06,1.9e-05,9e-06,1.4e-05,8e-06,9e-06,1.2e-05,1e-06,3e-06,1e-06,1e-05,5e-06,1e-05,2e-06,4e-06,2e-06,2e-06,1e-05,3e-06,4e-06,3e-06,2e-06,7e-06,1.9e-05,9e-06,6e-06,5e-06,9e-06,1e-06,4e-06,1e-06,7e-06,1.2e-05,1.7e-05,9e-06,1e-06,8e-06,7e-06,4e-06,3e-06,0,7e-06,8e-06,2e-06,9e-06,3e-06,5e-06,3e-06,3e-06,3e-06,8e-06,1e-05,1.5e-05,1.5e-05,4e-06,7e-06,8e-06,5e-06,1e-05,3e-06,2e-06,1e-05,2e-06
2e-06,7e-06,3e-06,1.4e-05,6e-06,8e-06,2e-06,1e-06,1e-05,6e-06,6e-06,6e-06,6e-06,1.2e-05,9e-06,2e-05,7e-06,5e-06,7e-06,1.7e-05,1e-05,4e-06,1.6e-05,1e-05,1.3e-05,1.1e-05,1.9e-05,1.5e-05,1.5e-05,5e-06,1e-06,1e-05,5e-06,4e-06,6e-06,1e-05,1e-05,3e-06,2.5e-05,1.8e-05,1e-06,2e-06,7e-06,3e-06,1e-06,9e-06,1e-05,4e-06,8e-06,1.7e-05,7e-06,1.9e-05,6e-06,1.2e-05,1.8e-05,5e-06,6e-06,5e-06,3e-06,1.7e-05,8e-06,1.2e-05,7e-06,6e-06,8e-06,2e-06,3e-06,3e-06,6e-06,1e-06,1.1e-05,0,3e-06,3e-06,2e-06,1.2e-05,4e-06,7e-06,2e-06,1e-06,7e-06,1.8e-05,8e-06,1e-06,1e-05,9e-06,4e-06,5e-06,3e-06,9e-06,1e-05,1.6e-05,1.1e-05,4e-06,8e-06,7e-06,2e-06,2e-06,2e-06,7e-06,3e-06,5e-06,9e-06,3e-06,8e-06,4e-06,5e-06,6e-06,8e-06,1.2e-05,1.6e-05,1.3e-05,8e-06,8e-06,6e-06,3e-06,6e-06,4e-06,2e-06,8e-06,4e-06
4e-06,8e-06,4e-06,1.8e-05,3e-06,9e-06,3e-06,2e-06,1.2e-05,1e-06,6e-06,5e-06,5e-06,1e-05,6e-06,1.7e-05,9e-06,9e-06,4e-06,1.5e-05,9e-06,1e-06,1.4e-05,6e-06,1.1e-05,8e-06,1.6e-05,1.3e-05,1.3e-05,3e-06,4e-06,9e-06,2e-06,5e-06,5e-06,1e-05,1.3e-05,1e-06,2e-05,1.7e-05,3e-06,3e-06,7e-06,3e-06,2e-06,1.3e-05,5e-06,1e-06,1e-05,1.5e-05,1.1e-05,2e-05,1e-06,1e-05,1.3e-05,4e-06,6e-06,4e-06,4e-06,2e-05,6e-06,1.2e-05,7e-06,3e-06,1e-05,6e-06,1e-06,5e-06,6e-06,4e-06,1e-05,2e-06,4e-06,1e-06,0,1.2e-05,4e-06,8e-06,2e-06,1e-06,8e-06,1.8e-05,8e-06,2e-06,9e-06,8e-06,2e-06,5e-06,3e-06,7e-06,1.2e-05,1.6e-05,1.1e-05,3e-06,4e-06,6e-06,5e-06,2e-06,2e-06,5e-06,3e-06,1e-06,8e-06,3e-06,6e-06,1e-06,5e-06,8e-06,1.1e-05,1.1e-05,1.5e-05,1.6e-05,6e-06,6e-06,8e-06,2e-06,7e-06,2e-06,2e-06,1.1e-05,6e-06
5e-06,6e-06,3e-06,1.7e-05,1e-06,7e-06,1e-06,1e-06,1e-05,3e-06,7e-06,6e-06,5e-06,1.1e-05,7e-06,1.6e-05,9e-06,5e-06,8e-06,1.6e-05,1e-05,2e-06,1.1e-05,9e-06,1.2e-05,6e-06,1.5e-05,1.5e-05,1.4e-05,4e-06,5e-06,1.1e-05,2e-06,3e-06,4e-06,8e-06,1.4e-05,1e-06,2.1e-05,1.6e-05,2e-06,3e-06,8e-06,3e-06,1e-06,1.2e-05,7e-06,3e-06,9e-06,1.4e-05,7e-06,1.7e-05,2e-06,1.1e-05,1.2e-05,3e-06,7e-06,5e-06,1e-06,2e-05,4e-06,9e-06,9e-06,4e-06,7e-06,4e-06,2e-06,4e-06,7e-06,3e-06,8e-06,2e-06,2e-06,1e-06,1e-06,1.2e-05,2e-06,8e-06,2e-06,1e-06,8e-06,1.9e-05,8e-06,1e-06,7e-06,8e-06,2e-06,4e-06,3e-06,6e-06,1.2e-05,1.7e-05,8e-06,3e-06,5e-06,6e-06,4e-06,3e-06,1e-06,5e-06,3e-06,3e-06,9e-06,2e-06,7e-06,2e-06,6e-06,6e-06,8e-06,1e-05,1.4e-05,1.6e-05,5e-06,3e-06,7e-06,2e-06,7e-06,2e-06,2e-06,1.1e-05,4e-06
4e-06,7e-06,3e-06,1.5e-05,2e-06,1.1e-05,2e-06,3e-06,1.2e-05,4e-06,7e-06,5e-06,5e-06,1.1e-05,6e-06,1.6e-05,5e-06,6e-06,8e-06,1.6e-05,1e-05,3e-06,1.3e-05,9e-06,1.2e-05,7e-06,1.7e-05,1.6e-05,1.5e-05,1e-06,5e-06,9e-06,4e-06,4e-06,5e-06,8e-06,1.2e-05,1e-06,2.1e-05,1.7e-05,2e-06,3e-06,8e-06,3e-06,2e-06,1e-05,7e-06,2e-06,9e-06,1.3e-05,8e-06,1.7e-05,2e-06,1e-05,1.1e-05,5e-06,5e-06,2e-06,3e-06,2e-05,6e-06,1.1e-05,8e-06,4e-06,9e-06,4e-06,1e-06,2e-06,8e-06,3e-06,9e-06,1e-06,2e-06,2e-06,1e-06,1.3e-05,1e-06,6e-06,1e-06,1e-06,6e-06,1.9e-05,7e-06,1e-06,7e-06,7e-06,2e-06,4e-06,4e-06,6e-06,1.2e-05,1.7e-05,8e-06,4e-06,5e-06,5e-06,2e-06,3e-06,1e-06,4e-06,3e-06,3e-06,8e-06,2e-06,6e-06,1e-06,6e-06,5e-06,8e-06,1.1e-05,1.4e-05,1.6e-05,5e-06,4e-06,8e-06,2e-06,7e-06,2e-06,0,1.1e-05,4e-06
