-0.000484,-0.000314,-0.000767,-0.001729,-0.003214,-0.001761,-0.008888,-0.008492,-0.008575,-0.005547,-0.003446,-0.004175,-0.002619,-0.000734,0.013458,0.000837,-0.012063,-0.010539,-0.005739,-0.018009,-0.011978,-0.008831,-0.006268,-0.010834,-0.010659,-0.011461,-0.009582,-0.007337,-0.016038,-0.021962,-0.015499,-0.007853,-0.011717,-0.018668,-0.015333,-0.016856,-0.01529,-0.014925,-0.010291,-0.010465,-0.009812,-0.013786,-0.011221,-0.007957,-0.009203,-0.008585,-0.003977,-0.004096,-0.005062,-0.00268,-0.001898,-0.001975,-0.003018,-0.00396,-0.003176,-0.001311,-0.001544,-0.00283,-0.003306,-0.002662,-0.001443,-0.00027,-0.000608,-0.000801,-0.001277,-0.001733,-0.001686,-0.001042,-0.000907,-0.000762,-0.000637,-0.000928,-0.000775,-0.000834,-0.000281,-0.000537,-0.000995,-0.000701,-0.000549,0.000662,0.000239,-0.000425,-0.000636,-6e-04,-0.000245,-0.000295,-0.000426,-0.000526,-0.000366,-0.000424,-0.000472,-0.000633,-0.000809,-0.001102,-0.000943,-0.000529,-0.000647,-0.000622,-0.000581,-0.000414,-0.000565,-0.000309,-0.000669,-0.000694,-0.000399,-0.000388,-0.000461,-0.000233,-0.000231,-0.000273,-0.000185,-0.000347,-0.000495,-0.000698,-0.000741,-0.008401,-0.008257,-0.006686,-0.003638,-0.008927,-0.00528
0.000155,3.6e-05,0.000166,0.000729,0.002463,-0.002576,-0.000769,-0.001845,0.001305,0.000387,-0.000783,-0.002197,-0.00228,-0.000941,-0.008501,-0.006468,-0.001124,-0.003988,-0.005431,-0.000481,-0.000997,-0.003099,-0.002983,0.000207,-0.00092,-0.004914,-0.003267,0.000384,0.005209,0.000865,-0.003594,-0.002162,-0.00261,-0.002181,0.002011,0.005747,-0.000585,-0.005431,-0.005348,-0.003729,-0.002826,-0.002031,-0.002258,0.000355,-0.003287,-0.002338,-0.000973,-0.00023,-0.000345,-0.002844,-0.001397,0.000255,-0.000553,-0.000366,0.000688,-0.000426,-0.000899,0.000471,0.000383,-0.000432,-0.000179,-0.001254,-0.000763,-0.000336,-0.000537,-0.000588,-0.000763,-0.000568,-0.000658,-0.000373,-0.000256,-0.00043,-0.000253,-0.000131,-0.000564,-0.00036,-6.9e-05,-3.4e-05,-0.000304,-0.001766,-0.000779,7e-06,0.000388,-0.000206,-0.000535,-0.000716,-0.000644,-0.000359,-0.000234,7.8e-05,-7.2e-05,-0.000345,-0.000462,0.000204,0.000154,0.000187,8.9e-05,-0.000102,-0.000166,0.000372,3.9e-05,-0.000352,-0.000151,-0.000223,-0.000429,-0.000229,-0.000539,-0.000357,-0.00043,-0.00028,-6e-06,-0.000104,-0.000122,0.000245,3.3e-05,0.000326,0.005087,0.003609,0.002282,0.003466,0.00146
-0.000118,-4.9e-05,-9.7e-05,-0.000298,-0.001279,-0.000979,0.001464,0.001787,-6.8e-05,-0.000922,-0.000373,-0.001094,0.001459,0.00067,-0.004247,-0.00061,-0.000964,-0.002807,-0.000177,0.000173,-0.003053,-0.002662,0.00029,-0.002889,0.002429,-0.002411,-0.001329,0.003612,-0.003464,-0.002522,-0.002718,-0.001905,0.000895,0.003778,0.003392,-0.003071,0.003029,0.003637,-0.00183,-0.00021,0.000337,0.001315,2e-05,-0.003449,0.001098,0.00046,-0.000894,-0.000162,-0.001382,0.000214,0.000395,-0.001741,-0.000959,0.000331,-0.000866,-0.00045,-0.000821,-0.000514,-0.001001,0.000695,-0.000575,0.000416,0.00051,-0.000565,-0.00035,-0.00025,0.000262,0.000117,0.000223,8.1e-05,-0.000126,0.000176,-0.000289,8.9e-05,0.000195,0.000126,-0.000161,-0.000103,0.000228,-0.000819,-0.000612,-0.000104,0.000127,0.000143,-0.000271,0.000462,0.000268,0.000196,-0.000121,-6e-06,2e-05,0.000146,0.00027,-0.000126,-0.000125,-0.000374,-4e-06,-6.9e-05,0.000193,-0.000176,-0.000382,9.8e-05,0.000181,0.000144,7.8e-05,-5.2e-05,0.000136,-0.000225,-0.000102,2.9e-05,8e-06,0.000371,5.1e-05,-0.000223,-0.000239,0.000577,-0.004038,-0.002656,-0.001355,-0.003989,-0.00267
0.00018,0.000166,0.000112,-0.000175,0.000736,0.000248,-0.005927,-0.002227,-0.001272,-0.000103,-2.4e-05,-0.000364,-5.9e-05,-2.3e-05,-0.000137,-0.001659,-0.001743,0.001014,0.00291,0.00191,-0.002293,0.000755,0.001139,0.000654,-0.002178,0.003564,-0.002072,0.002764,-0.003305,0.001406,-2.9e-05,0.000876,0.0013,0.004263,0.002966,-0.000155,-0.003182,-0.004772,-0.000695,-0.000213,0.001234,-0.002476,0.003589,0.002107,-0.000878,0.003242,0.001823,0.000742,0.000313,0.001732,0.001595,-0.000564,0.00093,0.000836,0.001149,0.000113,0.000317,-0.000332,0.000924,-0.00031,0.000391,-0.00041,-0.000395,0.000262,0.000196,0.000122,0.000337,0.00028,0.000268,8e-05,9.8e-05,-0.000118,0.000252,-0.000141,-0.000435,-8.2e-05,7.1e-05,9.2e-05,-0.000127,0.000511,0.000544,0.000151,0.000109,0.000222,3.2e-05,-0.000182,-7.9e-05,-8.1e-05,1.3e-05,-2.1e-05,-0.000102,4e-06,9.4e-05,-7.7e-05,0.00014,0.000159,-7e-05,-5.1e-05,-0.00034,-8.5e-05,0.000133,-0.000281,-0.000103,-8.5e-05,7.8e-05,-0.000131,-9e-06,3.9e-05,-5.3e-05,-0.000131,-8e-06,-0.000179,-3e-06,2.2e-05,0.000304,-3e-04,0.001626,0.000803,0.00148,0.000242,0.002129
-0.00015,-0.000119,-8.5e-05,7.6e-05,-0.000716,0.001226,0.002588,0.000616,-0.001263,-0.000882,-0.000661,0.001835,0.000171,-0.000434,-0.001123,0.001391,0.001719,0.001361,0.002042,-0.002058,0.002428,0.002263,0.000645,0.000753,-8e-06,-0.000687,0.003396,-0.000844,0.0011,0.000559,0.000292,0.000464,0.001706,0.000502,-0.003423,-0.00514,-0.002669,-0.001818,-0.001525,0.000767,0.002964,0.001255,-0.000122,-0.00012,0.000893,-0.000939,-0.000381,0.000132,-0.000708,-0.000359,-0.001268,-4.9e-05,2e-04,-0.000287,-0.000997,-0.00071,0.000251,-0.000185,-0.000205,-0.000596,-0.000553,-0.000735,-0.00027,-1.9e-05,5.7e-05,0.000297,0.000155,-6.7e-05,-9e-06,1.2e-05,-0.000292,6.1e-05,-1.4e-05,0.000302,0.000121,3.2e-05,8.2e-05,-0.00018,-6e-05,-0.000208,-0.000897,-0.00053,-0.000321,-9.9e-05,-0.000229,-0.000225,-0.000281,-0.000152,-0.000244,-9.3e-05,8.1e-05,-0.000253,-0.000334,-0.000435,-0.000134,-0.000132,-5.7e-05,-6.2e-05,1e-04,-4.8e-05,-7.2e-05,2.1e-05,-8.1e-05,-0.000136,-0.00011,-4.3e-05,-6.7e-05,2e-05,0.000222,-0.000103,-0.000213,-8e-06,-0.00017,-4.6e-05,-8e-06,-3.6e-05,-0.00017,-0.001576,-0.001156,-0.000297,-0.001249
4.2e-05,0.000164,4.7e-05,-0.000209,0.000649,-0.000171,0.000768,0.002609,0.00152,-0.000616,-0.000425,-0.001238,0.000212,0.000165,-0.000337,-0.004626,-0.004819,0.000608,0.001157,0.002781,-0.000998,-5.6e-05,0.000116,0.001576,-0.000712,-0.000984,-0.000554,-0.001186,0.001207,0.000759,0.001764,0.000814,6.7e-05,-0.000977,0.002804,0.002331,0.001536,0.003316,0.001749,-0.001109,-0.004852,0.002577,0.001362,-0.00151,-0.002459,-0.002538,0.000655,0.001862,0.002168,0.000391,-0.000402,-0.000354,9.7e-05,7e-06,0.001095,0.000667,-0.00039,-0.000173,0.000372,0.00011,0.00016,0.000936,0.000599,5.2e-05,-0.000176,6.1e-05,1.6e-05,-7.7e-05,-6.4e-05,9.4e-05,0.000381,0.000269,-3.5e-05,-1.3e-05,-9e-06,-0.000146,1e-06,0.00022,0.000197,-0.000136,-0.001206,-0.000465,9.2e-05,-1e-04,0.000187,0.00021,0.000329,0.00031,0.000253,0.000144,0.000136,0.000237,0.000378,0.000282,-0.000173,-0.000149,-5.9e-05,0.000135,-3e-05,0.000144,8e-05,-9.9e-05,0.000232,0.00015,0.000228,-7.4e-05,-1.4e-05,8.6e-05,1.3e-05,0.000175,1.6e-05,2e-04,0.000221,0.000138,5.1e-05,3e-06,2.2e-05,0.001119,0.001166,4.1e-05,0.001009
4.7e-05,-0.000132,-6.5e-05,0.000487,-0.000501,-0.000581,0.000106,-0.001149,-0.00112,-5.4e-05,-0.001107,-0.000672,-0.000502,-0.000531,-0.000252,-0.006757,-0.004805,-0.002081,-0.001936,-0.001072,-0.002478,-0.001169,0.000413,-0.001611,0.0012,-0.001051,-0.001395,0.000497,-0.001406,-0.000869,0.001103,-0.002465,-0.001256,-0.001163,-0.007708,0.000418,0.000223,0.000973,-0.001438,-0.000443,0.001867,-0.000873,-0.001847,0.000509,0.000832,-0.001024,-0.001725,-0.000588,-0.000331,1e-05,1e-04,0.000922,-0.000114,0.000558,0.000318,-0.000339,0.000781,0.00078,-0.000121,1.4e-05,0.000374,0.000219,-0.000236,3.8e-05,6e-05,-0.000407,-0.000356,-5.2e-05,8e-05,-0.000161,-0.000185,-0.000242,-0.00027,-0.000145,2.5e-05,-3e-05,5.5e-05,-7.9e-05,-3.1e-05,8.2e-05,0.000259,-0.000225,-0.000242,3.1e-05,-8e-05,0.000104,-0.00013,-2.4e-05,-0.000124,-0.00025,-2.5e-05,-0.000116,-0.000186,1.4e-05,2.7e-05,8.4e-05,-2.4e-05,-1.1e-05,-7e-06,1e-06,-0.000143,6.2e-05,5.6e-05,-6.8e-05,-6.3e-05,0.000113,7.7e-05,-4.3e-05,-1.4e-05,-0.000128,9.1e-05,-0.000101,-0.000278,-8.7e-05,-6.8e-05,-0.000168,-0.000205,-0.001948,-0.001119,-0.000597,-0.00101
-4.5e-05,8.5e-05,0,-0.000142,0.000164,0.000685,-0.000971,0.000514,0.000137,-0.000168,-0.000507,0.000468,0.000162,-8e-06,-0.000297,0.00244,0.00204,0.001456,-0.002447,-0.000796,0.00255,-0.001459,-0.001469,-0.00054,0.000886,0.000167,-0.001663,-0.00067,-0.000259,0.000877,0.000441,-0.001452,-0.000715,-0.000147,0.002537,0.000516,-0.000934,-0.000935,-0.001592,0.000562,0.000749,0.001774,6e-04,0.001201,-8e-05,0.001847,0.000458,0.000292,-0.000397,0.000639,0.000957,0.000754,-0.000396,-0.001076,-0.000564,0.000522,-0.000154,0.000134,0.000478,0.000237,-0.000486,-1e-05,0.000143,1.6e-05,4.1e-05,-2e-05,-0.000187,-0.000102,8.4e-05,-6.1e-05,1.9e-05,-2.5e-05,0.000181,-0.00012,5.6e-05,7.3e-05,-0.000262,-9.2e-05,-0.000131,-6.2e-05,0.000297,0.000284,-4.8e-05,0.000145,-9.4e-05,-0.000101,-5e-05,-0.000107,-0.000138,-4e-06,-3.9e-05,5.4e-05,9.1e-05,-0.000122,-5.2e-05,-4.4e-05,1.4e-05,0.000122,1.8e-05,3.5e-05,0.000105,-9.3e-05,1.6e-05,-6.3e-05,-0.00011,-0.000163,-0.000136,-0.000175,-3.1e-05,-1.3e-05,-7.8e-05,3.2e-05,4.5e-05,7.7e-05,1.4e-05,9.1e-05,-0.000431,0.002026,0.00172,0.00089,0.000492
8e-06,-5.9e-05,-7.4e-05,2.9e-05,-0.000181,-0.000804,0.000101,-0.000259,4e-06,3.7e-05,0.001484,-0.000974,-0.000543,-0.000278,-0.000314,0.001924,0.000301,-0.002261,0.000641,-0.000537,-0.002972,-0.002101,-0.002178,-0.001095,-0.000314,0.002206,0.001311,-0.00211,0.000811,-0.000964,-0.001432,-0.000364,-0.000521,0.000175,0.00045,0.000593,0.000301,0.00015,0.003119,0.000927,0.000382,-0.000133,-0.000916,0.000392,-0.000239,-0.00013,0.000191,-0.001317,-0.000614,-0.000611,-0.000992,-0.000291,0.000449,0.000939,0.000154,-0.00051,0.000149,-0.000381,-0.00029,-0.000169,0.000488,-0.000366,8e-06,0.000174,6.7e-05,9.1e-05,0.000184,0.00015,-5.9e-05,2.4e-05,-2e-05,0.000151,-0.000261,-0.000115,-3e-06,-4.1e-05,7.3e-05,5.8e-05,-3.1e-05,1e-06,-0.000172,-0.000427,-0.000264,-0.000131,4.3e-05,-0.000196,9.2e-05,0.000103,0.000216,8e-05,-5e-06,-1.7e-05,0,6.6e-05,7.7e-05,0.000109,-3.2e-05,-0.000154,5e-05,3.3e-05,-8.4e-05,-7.6e-05,-0.00011,0.000101,6.8e-05,-1.7e-05,3.4e-05,0.000143,5.6e-05,8e-05,3.3e-05,-5.7e-05,6.6e-05,-9.5e-05,-3.2e-05,5.6e-05,2.5e-05,-0.001747,-0.000427,-0.000662,-0.000422
-4.2e-05,-6e-06,-1.9e-05,-9e-06,3.3e-05,0.000452,0.000921,-0.000243,0.000458,-0.000464,-4e-05,-4.2e-05,0.000109,-2.4e-05,0.000119,0.000215,0.000327,-0.000304,-4.5e-05,0.000758,0.003563,0.001765,0.001473,-0.000598,5e-06,-0.000951,0.000269,-0.000778,-0.000194,-0.001415,0.000153,0.002686,0.000474,0.000326,0.000298,0.000544,0.000663,0.000947,0.000186,3.5e-05,0.000321,0.000756,-0.00114,-0.000209,0.000511,0.000432,-0.000255,0.000426,0.000182,3.6e-05,-0.00013,0.000197,0.000165,-0.000428,-0.000212,-8e-06,-0.000141,-0.000184,-0.000474,-0.000143,-0.000166,7.2e-05,-2.1e-05,-0.000292,-2.2e-05,-8.8e-05,7.9e-05,0.000151,-6e-05,5.1e-05,-4.4e-05,-0.000136,7.4e-05,9.2e-05,4.3e-05,9.7e-05,9.7e-05,-6.9e-05,1e-04,3e-06,7.7e-05,0.000179,-4.1e-05,-9.1e-05,-7e-06,5e-05,0,-3.2e-05,-3.6e-05,-3.4e-05,-3.7e-05,-4.5e-05,5.3e-05,6.4e-05,5e-06,-3.1e-05,4.3e-05,6.6e-05,-2.9e-05,-5.6e-05,1.2e-05,6.2e-05,4.9e-05,2.7e-05,7.5e-05,8.3e-05,6.4e-05,0.000134,-2e-05,7.4e-05,7.7e-05,-1.4e-05,-6.4e-05,7.2e-05,1e-05,-5.7e-05,0.000296,0.001726,9e-06,0.000356,-0.000239
-8e-06,4e-06,-6.1e-05,5.1e-05,0.00024,-0.000249,-3.5e-05,2e-05,-5.2e-05,0.000732,-0.000496,0.000903,9e-06,0.000336,-0.000372,0.000228,0.000654,0.001221,0.000784,0.001112,-0.000459,-0.000673,-0.000413,0.000274,-2.3e-05,0.000865,0.000296,9.6e-05,0.00168,-0.000559,0.000339,-0.000576,-9.4e-05,4e-04,-0.000886,-2e-04,0.001138,-0.001122,-0.000566,0.000668,0.000114,-0.000801,0.000454,-0.000184,0.000105,-9.3e-05,-0.000686,0.000571,0.00067,0.000115,0.000257,-7.5e-05,-1.5e-05,0.000217,9.6e-05,-7.9e-05,0.000118,0.000128,0.000565,3.6e-05,6e-06,-0.000243,-0.000114,0.000123,7.6e-05,4.5e-05,-3.4e-05,4.3e-05,0.000164,0.000106,7e-06,5.9e-05,-7.3e-05,-5.5e-05,6.8e-05,1e-06,-0.000104,5.2e-05,-4.1e-05,-5.5e-05,-7.1e-05,-5.8e-05,-2.7e-05,-1e-06,9.2e-05,-1e-05,-1e-06,-3.6e-05,-2.6e-05,-1.5e-05,3e-06,-2.8e-05,-1.9e-05,-9.5e-05,-2e-06,8.8e-05,-5e-05,-5e-06,3.1e-05,5.4e-05,4.5e-05,5.5e-05,-1.8e-05,-4.7e-05,-2.4e-05,3.5e-05,3.6e-05,-0.000108,6.4e-05,6e-06,-6.5e-05,-3e-05,-3.6e-05,7e-06,-4.1e-05,-0.000102,2.2e-05,-0.000648,-0.000448,-0.00023,7e-05
-2.1e-05,-1.6e-05,8.9e-05,-7e-06,-0.000164,0.000357,-0.000618,0.000232,0.000534,-0.000561,3.6e-05,-0.000453,-3.1e-05,6.8e-05,0.000285,1.2e-05,0.000124,-0.000458,3.8e-05,3.8e-05,0.000445,-0.000877,0.000253,0.000599,6.6e-05,0.000217,-0.000437,0.000503,0.000216,-0.000208,0.000493,7.6e-05,0.000459,0.000421,0.000117,0.001755,-0.00157,0.000235,0.000263,-0.000268,-0.000944,0.00019,0.000425,0.000834,0.001281,0.000463,-6.5e-05,-0.000321,0.000597,-0.000126,-0.000544,-0.000206,9.4e-05,-0.00055,-0.000137,0.000491,-0.00017,4.6e-05,-1.7e-05,0.000105,0.000116,0.000249,-5e-05,-1.3e-05,-1.3e-05,0.000111,-4.6e-05,-0.000173,-0.000113,7.5e-05,-5e-06,3e-05,4.7e-05,0.000111,1.4e-05,-3.4e-05,7.6e-05,-2.4e-05,7.1e-05,1.5e-05,-1e-05,0.000123,6.8e-05,-6.7e-05,-0.000126,1.2e-05,2.5e-05,6.3e-05,4.3e-05,1.2e-05,-2.1e-05,2.1e-05,3.4e-05,7.4e-05,-1.9e-05,-1.2e-05,4.7e-05,-8e-06,-5.6e-05,-2.8e-05,-6.9e-05,-5e-06,-6.8e-05,4.6e-05,3.4e-05,-4.2e-05,-5.6e-05,7.5e-05,-4e-05,-4.2e-05,6.3e-05,3.2e-05,8e-06,-2.3e-05,-1e-06,7.8e-05,-4.6e-05,-0.000282,4.9e-05,6.3e-05,-5e-05
-1.1e-05,1.3e-05,-6.7e-05,1.6e-05,1e-04,-0.000318,0.000236,-0.000381,0.000738,-0.00034,3.4e-05,0.000589,7e-06,-0.000196,6e-06,-0.00164,0.000357,-0.000393,0.000177,-0.000845,1.1e-05,0.000495,-0.000239,-0.000242,0.000863,-0.001692,0.00018,0.000565,0.000828,-0.000338,0.000242,-0.000854,-5.8e-05,-9.5e-05,0.000343,-0.000186,-0.00024,-0.000213,-0.000687,0.001145,-0.000303,-0.000887,-7.4e-05,-0.000329,-0.000686,-0.000447,-7.6e-05,-0.000802,-0.000329,-0.000259,0.000562,-5e-05,-0.000222,0.000115,7.2e-05,0.00015,0.00024,-7.5e-05,-2.6e-05,-1e-05,-1.8e-05,-0.000182,0.000151,-3.3e-05,-1.3e-05,-1e-05,-0.000154,3.5e-05,-1.6e-05,-3e-06,2.4e-05,8e-06,8.4e-05,-7.1e-05,-1.4e-05,8e-06,-1.3e-05,4.1e-05,-0.000111,-3.2e-05,5.1e-05,0.000132,8e-06,-7.1e-05,2.8e-05,-5.9e-05,7e-06,-4.2e-05,-1.4e-05,-1e-05,-5.3e-05,-7e-06,-2.6e-05,-9.8e-05,-1.4e-05,6.2e-05,0,-4.2e-05,2.4e-05,-8.1e-05,2.1e-05,4e-06,-2.4e-05,-2e-05,-4.5e-05,4.8e-05,9e-06,-4.8e-05,-2.6e-05,-2.1e-05,-3e-06,-7e-06,2e-05,3.7e-05,-6.1e-05,-5.6e-05,-1.1e-05,0.00011,-0.000193,0.000198,4.5e-05
-1e-06,-2.4e-05,3e-05,-7.2e-05,-5.5e-05,0.000248,6e-05,-4.8e-05,-0.001045,0.000252,-8.4e-05,0.000216,0.000134,2.6e-05,-0.000207,7.4e-05,0.000526,0.00063,0.00042,-0.000163,0.000559,-5.7e-05,6.9e-05,-0.000432,-0.000397,0.000764,0.000124,-2.9e-05,-0.000258,0.000383,0.000463,0.000424,-0.000121,1.3e-05,-0.000433,-0.000544,0.000425,-0.000209,0.00016,-0.000614,-0.000233,-9.9e-05,-1.8e-05,0.000578,9.4e-05,0.000168,0.000822,0.000112,6.4e-05,8.9e-05,-0.000216,0.000484,-8.3e-05,-2.7e-05,-7.5e-05,-0.000199,-0.000225,-0.000145,5e-06,-9.7e-05,0.000114,-9e-06,-8.1e-05,8.7e-05,4e-05,8.6e-05,7.2e-05,-6.2e-05,1e-06,-4.3e-05,6e-06,1.5e-05,-1.6e-05,-4.7e-05,-5.4e-05,2e-06,-3e-06,-3e-06,2e-05,2.5e-05,-2.2e-05,-0.000158,-7.1e-05,5.5e-05,3e-06,1.9e-05,-2.5e-05,-1.1e-05,-2e-05,7e-06,1.1e-05,1.2e-05,2.1e-05,1.2e-05,1.2e-05,-6.8e-05,3.3e-05,1.6e-05,-4.8e-05,1.7e-05,-2.8e-05,-3.5e-05,-1.7e-05,2.3e-05,-6e-06,-4.8e-05,-9e-06,-2.4e-05,6.1e-05,2.2e-05,-5.8e-05,2e-06,2e-06,-4.3e-05,2.6e-05,5.2e-05,-3.1e-05,-2.1e-05,-1.1e-05,7.7e-05,5.2e-05
-7e-06,1.6e-05,8e-06,1.7e-05,3.9e-05,-7.8e-05,0.000103,-0.000254,0.000123,-0.000181,0.000112,-7.8e-05,2.2e-05,-7.8e-05,0.000247,0.001397,-5.4e-05,0.001278,-0.000738,0.00012,-0.000329,-0.000146,5.7e-05,-0.000261,-0.000932,-0.000203,0.000189,0.000238,5.5e-05,-0.000182,-0.000743,-0.000135,0.001042,-0.000156,6.1e-05,-5.1e-05,-0.000238,9.4e-05,-0.000715,-0.00013,-0.000463,0.000431,-0.00017,-0.000233,-0.000635,4.4e-05,-0.000535,0.000472,-0.000105,3.7e-05,-4.2e-05,-0.000134,-2.8e-05,-2e-06,8.3e-05,6.4e-05,0.000146,9.1e-05,-6.7e-05,6.1e-05,-6e-05,0.000142,3.3e-05,-4.2e-05,-4.9e-05,-9.4e-05,-1.3e-05,-4.7e-05,2.2e-05,-2.5e-05,-4.5e-05,-3.1e-05,-1.1e-05,5.4e-05,2.5e-05,1.8e-05,6e-06,-3.1e-05,3.7e-05,1.6e-05,2e-05,-1.4e-05,-4.6e-05,-3.2e-05,1.1e-05,5.2e-05,-3.2e-05,-7e-06,-3e-06,5e-06,-4e-06,-8e-06,-8e-06,-3e-06,3e-06,9e-06,-2.5e-05,-6e-06,2.6e-05,1.4e-05,1.6e-05,2e-05,-4e-06,-3.2e-05,1e-06,1.3e-05,8e-06,-8e-06,-4e-05,3e-06,-2.2e-05,1.4e-05,1.1e-05,-5e-06,-1.5e-05,-2.9e-05,-1e-06,0.000128,-0.000363,6e-05,1.9e-05
-4e-06,-7e-06,-1.2e-05,-1.1e-05,-2.1e-05,-3.8e-05,-0.00027,0.000209,0.000239,0.000211,0.000342,-9.5e-05,-2.4e-05,0.000184,5.9e-05,-0.00018,6.8e-05,0.000205,0.000278,8.2e-05,-0.000483,0.000102,4.9e-05,0.000121,0.000375,3e-05,-4e-04,-1.7e-05,-0.00044,0.000512,8.5e-05,-0.000199,-0.001003,-0.00014,-0.000267,-0.000528,0.000131,-0.000197,0.00061,0.00034,0.000211,0.000313,0.000313,0.00019,0.000347,-1e-04,0.000242,-0.000303,7.7e-05,-0.000169,0.000172,-0.000204,-9e-06,-7.6e-05,-1.3e-05,-1.6e-05,-8.6e-05,2.6e-05,-5.8e-05,5.8e-05,-5e-05,2e-05,-2.1e-05,-5.2e-05,1e-05,9e-06,-3e-05,-6e-06,3e-06,1.3e-05,-9e-06,2.9e-05,1.4e-05,-3e-06,-1.8e-05,5e-06,-2.3e-05,4.1e-05,-3e-06,1.1e-05,-3.2e-05,2.4e-05,1.1e-05,-8e-06,5e-06,4.4e-05,-1.6e-05,2e-05,1e-05,5e-06,7e-06,1e-06,3e-06,-5e-06,-4e-06,-2e-06,4e-06,3e-06,-4e-06,1.6e-05,3e-06,-1.9e-05,1.3e-05,-1e-06,-1.4e-05,2.2e-05,-7e-06,2.1e-05,-1.5e-05,2e-06,1e-06,3e-06,-1.2e-05,1.7e-05,1.4e-05,1.9e-05,2.6e-05,-0.000129,0.000244,4.3e-05,-1.2e-05
8e-06,-3e-06,6e-06,-2e-05,-8e-06,6.7e-05,0.000206,-1.1e-05,5.5e-05,0.000183,-0.000148,0.000141,-1.4e-05,-6.4e-05,-0.000132,-1.6e-05,-3.2e-05,-0.00049,0.000263,0.000107,0.000439,-7.7e-05,0.000224,-0.000165,-0.000103,4e-05,3e-06,-0.000337,0.000148,3.4e-05,-9.8e-05,0.000536,0.000452,-0.00014,0.000277,-8.2e-05,-0.000724,-4.6e-05,0.000125,-0.000318,0.000223,-4.7e-05,-0.000252,-0.000267,2e-05,1.3e-05,-4.7e-05,-5e-05,7e-05,1.5e-05,-9.3e-05,5.1e-05,7e-06,0.000162,6e-06,4.3e-05,0,4.3e-05,-8.8e-05,1.8e-05,5.6e-05,2.5e-05,9e-05,4.8e-05,1e-06,-1.8e-05,4.8e-05,2.6e-05,1.8e-05,9e-06,3e-06,-1.3e-05,-9e-06,-5e-06,-2e-05,-1.1e-05,8e-06,-2e-05,-6e-06,-1.1e-05,1e-06,2.3e-05,6.6e-05,2.7e-05,2e-06,-6e-06,5e-06,6e-06,1.3e-05,-1.3e-05,-1.2e-05,7e-06,4e-06,1.5e-05,3e-06,-1.6e-05,-7e-06,1.8e-05,7e-06,-1.1e-05,1e-06,1.2e-05,1.2e-05,1.9e-05,-1e-06,-1.3e-05,-3e-06,1.2e-05,1.8e-05,1.5e-05,3.5e-05,-9e-06,-1.3e-05,-1e-06,-4e-06,-7e-06,-5e-06,0.000129,-1.7e-05,1.2e-05,-1.3e-05
3e-06,6e-06,-7e-06,-1e-06,2e-05,-7.7e-05,-1.1e-05,-8.8e-05,-5e-06,-0.000111,-1.1e-05,-0.000193,1.2e-05,9.3e-05,8.6e-05,0.000136,0.000268,3e-06,-2.6e-05,-0.000114,-0.000548,-0.000164,-0.000291,0.000194,-0.000294,-0.000201,0.000101,-3e-04,9.1e-05,0.000128,-8e-05,-4e-05,-1.8e-05,-7.6e-05,-0.000217,0.00015,6.9e-05,0.000119,-0.000226,-0.000182,4e-05,-0.000562,2.6e-05,-1.2e-05,0.000226,-0.000135,-0.000171,1e-06,-0.000186,5e-06,6.9e-05,-2.8e-05,4.6e-05,-7.6e-05,2.6e-05,-1.9e-05,-5.5e-05,-2.8e-05,7e-05,8e-06,-2.3e-05,-3.8e-05,-6e-05,3e-06,-1.3e-05,-1e-05,1.1e-05,3.1e-05,-2.5e-05,-8e-06,2.5e-05,2e-06,1.2e-05,-3e-06,-9e-06,-9e-06,8e-06,3e-06,-1.6e-05,-2e-06,3.2e-05,4e-06,-3e-06,2.9e-05,1e-05,-2.3e-05,0,-1.4e-05,-3e-06,-1e-06,2e-06,2e-06,-6e-06,-1.7e-05,1e-06,2.9e-05,6e-06,-5e-06,-1.2e-05,1e-06,2e-06,-1e-06,-3e-06,-1.1e-05,0,-1e-06,7e-06,-2.4e-05,-1e-06,-7e-06,-1e-06,-3e-06,5e-06,-1e-05,1.6e-05,2e-06,1.9e-05,-8.3e-05,0.000156,3.2e-05,-1.1e-05
2e-06,-6e-06,4e-06,7e-06,-2.1e-05,5.6e-05,-3.4e-05,8.3e-05,4.4e-05,-3.2e-05,-5.6e-05,4.4e-05,2.4e-05,-6.1e-05,-2.5e-05,-0.000455,-3.9e-05,-5e-06,0.000151,-3.7e-05,0.000473,0.000349,-0.00011,-0.000128,-0.00017,0.000197,3.1e-05,-0.000115,-0.000237,8.4e-05,3.1e-05,-0.000235,8.3e-05,5e-06,0.000346,-2.8e-05,0.000305,-3e-05,0.000196,0.000135,-1.2e-05,0.000216,3.3e-05,-0.000107,-0.000147,-1.2e-05,4.2e-05,0.000124,-5.2e-05,7e-06,-2e-05,-3.9e-05,1.5e-05,3.6e-05,-1.6e-05,1.2e-05,5.6e-05,-7.4e-05,-5.2e-05,-4e-06,2e-05,5.6e-05,2e-06,0,2e-06,2e-06,1e-06,-8e-06,0,1e-06,-4e-06,6e-06,1.7e-05,9e-06,-4e-06,1.3e-05,-8e-06,6e-06,1.7e-05,3e-06,-3.3e-05,-2.1e-05,-3.9e-05,0,-6e-06,-1.6e-05,-2.3e-05,8e-06,3e-06,-2e-06,6e-06,-1e-06,1e-05,-9e-06,-1.1e-05,-1.5e-05,5e-06,-2e-06,-4e-06,0,-2e-06,2e-05,1.3e-05,9e-06,-1e-06,6e-06,2e-06,4e-06,-3e-06,4e-06,-1.9e-05,-3e-06,-3e-06,4e-06,-1.3e-05,5e-06,1.7e-05,3e-05,5e-05,-1e-06,-4e-06
1e-06,5e-06,-3e-06,-7e-06,2.7e-05,-5.4e-05,-6e-05,4e-05,3.3e-05,2.4e-05,0.000107,0.000119,3.2e-05,4e-05,-1.8e-05,-0.000205,0.000186,-0.000228,-2.8e-05,0.000186,-0.000149,-0.000123,0.000219,-0.00015,4.2e-05,-7.5e-05,1.5e-05,0.000252,-0.000127,-0.000119,-0.000143,-0.000388,0.000118,5.5e-05,-0.000157,-0.000188,-5.8e-05,4.8e-05,-0.000277,-7.4e-05,0.000162,0.000318,-0.000178,5.8e-05,-2.6e-05,-1.9e-05,8e-06,2.1e-05,0.000107,-2.1e-05,-2.7e-05,7e-05,2.5e-05,-7.7e-05,2.7e-05,-1.5e-05,-4.2e-05,1.7e-05,2.3e-05,-2e-06,-4e-06,-5e-06,6e-06,-1.8e-05,1e-06,-5e-06,-2.7e-05,1.1e-05,-6e-06,4e-06,-6e-06,-7e-06,-1e-05,1e-06,1e-06,-6e-06,4e-06,-1e-06,-4e-06,2e-06,3e-05,-8e-06,-2.7e-05,1e-05,1e-06,1e-05,1e-05,3e-06,3e-06,1e-06,-4e-06,-8e-06,-1.1e-05,2e-06,-4e-06,-5e-06,4e-06,1.7e-05,2e-06,4e-06,3e-06,-1.6e-05,-7e-06,-5e-06,1e-06,-6e-06,-7e-06,1.3e-05,-4e-06,-1.6e-05,3e-06,-3e-06,1e-05,0,1.9e-05,1e-06,-2.6e-05,-0.000101,1.4e-05,2.3e-05,9e-06
-2e-06,-5e-06,1e-06,1.3e-05,-3.2e-05,4e-05,7.8e-05,-6.2e-05,-3.3e-05,5.4e-05,5.3e-05,4.1e-05,0,-4.7e-05,2.4e-05,0.000478,-6.2e-05,-5.7e-05,0.000187,-7.7e-05,0.000136,-7e-05,-0.000143,1.3e-05,-0.000254,0.000103,-1e-05,-5.9e-05,-1.9e-05,-0.000311,6e-05,0.000331,0.000139,3.5e-05,-4e-05,-0.00043,-0.000122,-0.000102,4e-06,5.8e-05,-9.2e-05,7.4e-05,0.000169,-0.000313,-8.1e-05,0.00014,5e-06,-3.9e-05,-1.8e-05,8e-05,-7.3e-05,-3.1e-05,-3.8e-05,0.000109,-3.1e-05,-4e-06,2.5e-05,1.7e-05,4.8e-05,2.3e-05,-4e-05,-2.7e-05,-3e-06,2.7e-05,-6e-06,6e-06,1.4e-05,-1e-06,1e-06,-7e-06,-4e-06,6e-06,-8e-06,-1.2e-05,-5e-06,4e-06,3e-06,6e-06,1e-06,-1e-06,-1.5e-05,1.1e-05,1.2e-05,-2.2e-05,2e-06,-1.9e-05,-6e-06,0,1e-06,1e-06,-5e-06,0,5e-06,-3e-06,4e-06,-1.7e-05,5e-06,-1.3e-05,2e-06,-7e-06,-7e-06,6e-06,-1e-06,2e-06,-4e-06,6e-06,2e-06,-1.6e-05,2e-06,7e-06,1e-06,-2e-06,-8e-06,-2e-06,-2e-05,-1e-06,-1.3e-05,0.000151,9e-06,-1.1e-05,7e-06
-2e-06,4e-06,0,-8e-06,2.1e-05,-1.7e-05,2.4e-05,-1.9e-05,5.8e-05,-0.000115,5.5e-05,-1.6e-05,-2.3e-05,1.7e-05,-1e-05,0.000187,0.000114,2.1e-05,-0.000119,-0.00018,-7.6e-05,0.000214,8.8e-05,7.8e-05,0.000171,0.000102,3.2e-05,2.1e-05,0.000121,-0.000115,-7.9e-05,0.000105,-1e-06,4.2e-05,-9e-05,0.000153,-0.000114,0.000154,0.000166,3.9e-05,-9e-06,-0.000153,4e-05,0.000174,-4.9e-05,-1.8e-05,-3.3e-05,2.3e-05,-3.5e-05,-2.9e-05,8.7e-05,-3.3e-05,-2.2e-05,-4.4e-05,-2e-05,1.6e-05,-1.5e-05,1.3e-05,-1.2e-05,-4e-06,2.9e-05,-1.9e-05,-1e-05,-1.5e-05,-9e-06,9e-06,2.2e-05,-1.9e-05,-4e-06,-1.5e-05,1e-06,0,2.6e-05,3e-06,-6e-06,-1.2e-05,-4e-06,-1.3e-05,-1.3e-05,2e-06,-1e-06,1.8e-05,1e-05,-1.1e-05,-3e-06,2e-06,7e-06,-3e-06,9e-06,2e-06,-3e-06,3e-06,-8e-06,4e-06,4e-06,1e-05,-9e-06,0,2e-06,0,4e-06,-1.3e-05,-4e-06,1e-06,2e-06,3e-06,-1e-06,-7e-06,0,9e-06,9e-06,2e-06,-1e-06,3e-06,7e-06,0,8e-06,-0.000136,-4e-05,2.2e-05,-3e-06
0,-3e-06,0,-4e-06,-4e-06,1e-06,-4.6e-05,-3.3e-05,-8.2e-05,9e-06,-3.5e-05,-2.3e-05,5e-06,-2.7e-05,-6e-06,-0.000222,4.3e-05,4.7e-05,-0.000182,1e-06,1.6e-05,-9.3e-05,-7.5e-05,-3.4e-05,0.000152,-0.000167,1.4e-05,6.7e-05,-0.000322,-1.9e-05,8.1e-05,-0.000137,-0.000125,2.2e-05,-9e-05,0.000195,0.000236,-0.000131,-0.000106,3.4e-05,4.8e-05,-8.5e-05,-2.7e-05,-0.000212,2.2e-05,2.6e-05,3e-06,-4.9e-05,-3.9e-05,-2.2e-05,-3.3e-05,4.8e-05,1.9e-05,1.7e-05,1.9e-05,1.8e-05,9e-06,-1.4e-05,3.7e-05,-5e-06,-3.2e-05,2.7e-05,-6e-06,-4e-06,1.2e-05,-6e-06,-7e-06,-1e-06,-3e-06,-4e-06,9e-06,-1e-06,-7e-06,7e-06,2e-06,0,-3e-06,1.2e-05,1.4e-05,-3e-06,1e-05,-3.6e-05,-1.2e-05,3e-06,7e-06,5e-06,-1.8e-05,-1e-06,-5e-06,0,2e-06,1e-06,5e-06,-4e-06,0,-2.1e-05,5e-06,7e-06,-1e-06,-1e-06,-1e-06,1.1e-05,0,-5e-06,5e-06,-9e-06,-1e-06,1.6e-05,2e-06,1e-06,-9e-06,4e-06,-5e-06,-6e-06,-6e-06,-2e-06,-1e-06,9.8e-05,9.6e-05,-6e-06,4e-06
-3e-06,0,-1e-06,1.4e-05,-5e-06,1.7e-05,-2.9e-05,3.5e-05,-0.000158,7.1e-05,4.8e-05,-3.3e-05,1e-06,5.3e-05,1.5e-05,0.000102,9.1e-05,0.000246,0.000134,0.000156,-6.7e-05,-2.2e-05,-4.4e-05,-0.000151,-0.000103,8.3e-05,-5.9e-05,-5.3e-05,-1e-05,2.8e-05,-4.8e-05,-0.000142,-8.3e-05,-2e-06,0.000145,-0.00016,8.4e-05,9.7e-05,0.000103,6.8e-05,1.3e-05,-9e-06,-3.9e-05,6.9e-05,-0.000141,-8.5e-05,4.9e-05,7.4e-05,2.4e-05,2.1e-05,-1.8e-05,-4.1e-05,1.6e-05,-1.7e-05,-2.8e-05,-3.3e-05,-1.3e-05,9e-06,-2.8e-05,9e-06,1.2e-05,-1.1e-05,2.2e-05,1.9e-05,-6e-06,2e-06,-5e-06,-5e-06,5e-06,6e-06,-3e-06,4e-06,-2e-06,-9e-06,4e-06,-3e-06,1e-06,0,1e-06,0,-7e-06,1.8e-05,-7e-06,1e-06,-4e-06,2.4e-05,1e-06,2e-06,0,-3e-06,-1e-06,1e-06,-4e-06,-2e-06,0,1.2e-05,-1e-06,-1e-05,-3e-06,7e-06,-1e-06,-3e-06,-1e-06,5e-06,-5e-06,1.5e-05,-2e-06,-1e-06,6e-06,-5e-06,-3e-06,0,1e-06,2e-06,3e-06,2e-06,8e-06,-7e-05,-8.9e-05,8e-06,-1e-06
-3e-06,3e-06,2e-06,0,9e-06,-2.3e-05,5.3e-05,-1.2e-05,0.000204,5e-06,-7e-05,-3.8e-05,1.3e-05,-1.1e-05,-9e-06,-0.000113,9.1e-05,-7.3e-05,-7.4e-05,8.1e-05,-5.2e-05,8.7e-05,0.000132,9e-06,1.9e-05,-8e-05,-3.5e-05,-8.8e-05,4e-06,5.1e-05,2.6e-05,0.000192,2.8e-05,-2.4e-05,-8.1e-05,4.6e-05,-0.000139,-8.7e-05,-3.2e-05,3.9e-05,-2e-05,0.000112,2e-06,-0.00011,3.4e-05,-3.1e-05,-1.5e-05,-8.7e-05,4.1e-05,2.1e-05,6.9e-05,-9e-06,2.2e-05,4e-05,1.9e-05,7e-06,1.1e-05,1.3e-05,2e-06,-5e-06,1e-05,6e-06,-1.8e-05,-1.7e-05,-6e-06,-2e-06,8e-06,6e-06,1e-05,5e-06,1e-06,-4e-06,7e-06,3e-06,0,-2e-06,1e-06,-5e-06,1e-06,1e-06,7e-06,-1.5e-05,1e-06,-3e-06,2e-06,1.1e-05,8e-06,-1e-06,0,-1e-06,0,-3e-06,2e-06,3e-06,-3e-06,-1e-05,4e-06,2e-06,-1e-06,-4e-06,2e-06,7e-06,-1e-06,-4e-06,4e-06,-4e-06,0,-6e-06,-3e-06,-4e-06,7e-06,1e-06,2e-06,4e-06,-6e-06,0,5e-06,1.2e-05,1e-06,-1e-06,-5e-06
-1e-06,-4e-06,-1e-06,-1e-06,-1.1e-05,1.8e-05,2e-06,1.3e-05,-3.6e-05,1.1e-05,1e-05,2.6e-05,9e-06,2.4e-05,0,-0.000183,0.000167,4.8e-05,-1.3e-05,-5.4e-05,0.000156,-0.00012,-1.1e-05,4.3e-05,0.000144,-1e-06,-5e-06,-0.000116,-3e-06,4.7e-05,-4.7e-05,-6.2e-05,5.8e-05,-2.6e-05,0.000201,-8e-06,-0.000108,1.3e-05,1e-06,-4.1e-05,6.4e-05,6.5e-05,-1.5e-05,5e-05,-6.6e-05,-1.5e-05,-1.2e-05,-4e-06,-2e-05,-2.7e-05,-6.9e-05,6e-05,2e-06,-3.4e-05,-2.2e-05,-1e-06,-1.1e-05,-1.8e-05,-2.5e-05,1.3e-05,-2.4e-05,-1.7e-05,9e-06,2e-06,1.3e-05,-5e-06,-4e-06,6e-06,-7e-06,2e-06,-3e-06,2e-06,-6e-06,9e-06,-2e-06,1e-06,1e-06,6e-06,-7e-06,0,-1.2e-05,1.9e-05,5e-06,3e-06,2e-06,-6e-06,0,2e-06,3e-06,4e-06,-1e-06,1e-06,0,-1e-06,-4e-06,9e-06,-2e-06,-3e-06,-2e-06,-1e-06,-1e-06,-1e-05,2e-06,1e-06,-2e-06,-2e-06,0,-2e-06,1e-06,4e-06,0,-1e-06,0,-1e-06,5e-06,1e-06,-8e-06,-6e-06,-5.6e-05,-3e-06,0
2e-06,3e-06,0,6e-06,1.2e-05,-1.7e-05,-2.6e-05,3.1e-05,-7.6e-05,-1.9e-05,6.8e-05,-2.3e-05,-7e-06,-3.2e-05,7e-06,0.000157,-4.2e-05,-0.000107,1e-04,-6.6e-05,-0.000202,-1.8e-05,-4e-05,3e-05,3.9e-05,6.5e-05,3.6e-05,3.5e-05,-4.8e-05,8.8e-05,3e-05,-0.000139,-5.1e-05,-1.8e-05,-0.000168,-7e-06,7.2e-05,-4.2e-05,3e-06,9e-06,-4.1e-05,-0.000122,-6.1e-05,-1.9e-05,0.000126,1.1e-05,1.4e-05,3.2e-05,-3.1e-05,0,3e-05,-1.1e-05,-1.1e-05,5e-06,1.4e-05,3e-06,1.4e-05,-1.5e-05,2.9e-05,-6e-06,1.8e-05,1.1e-05,-5e-06,9e-06,-6e-06,3e-06,-1.2e-05,6e-06,-1e-06,3e-06,-3e-06,1e-06,6e-06,-9e-06,5e-06,0,0,-5e-06,-2e-06,1e-06,1.3e-05,4e-06,-4e-06,-3e-06,-1e-06,-8e-06,0,-2e-06,2e-06,-1e-06,0,0,0,-2e-06,0,-2e-06,0,5e-06,3e-06,-1e-06,-1e-06,9e-06,3e-06,0,1e-06,4e-06,-1e-06,8e-06,-4e-06,-4e-06,3e-06,0,-2e-06,-2e-06,-3e-06,0,2e-06,-5e-06,8e-06,-2e-06,0
0,-2e-06,0,-6e-06,-1.2e-05,1.9e-05,-1.5e-05,3e-06,4.8e-05,-3.5e-05,4e-06,-1e-05,-7e-06,1.1e-05,-7e-06,0.000175,-1e-06,-2.4e-05,-6.2e-05,-5.2e-05,0.000127,5.4e-05,-2e-05,-3e-06,-2.7e-05,-3.4e-05,1.7e-05,-1.8e-05,6.4e-05,7e-05,-2e-06,9.8e-05,-2.8e-05,-9e-06,3e-05,8.6e-05,0.000165,2.3e-05,-9.2e-05,-4e-06,-3.4e-05,-8.2e-05,6.5e-05,1.8e-05,-4.9e-05,5.5e-05,-2.5e-05,-1.2e-05,3e-06,1.9e-05,3.2e-05,-2.4e-05,-1.7e-05,-1.4e-05,6e-06,1e-06,-8e-06,-4e-06,3e-06,-7e-06,-1.2e-05,1.3e-05,1.2e-05,-5e-06,2e-06,0,-8e-06,2e-06,1e-06,0,-2e-06,-2e-06,3e-06,-3e-06,0,1e-06,-1e-06,4e-06,4e-06,-1e-06,-9e-06,-1.7e-05,7e-06,0,2e-06,-5e-06,-2e-06,-1e-06,1e-06,-1e-06,5e-06,1e-06,1e-06,-1e-06,4e-06,0,-1e-06,-6e-06,1e-06,2e-06,0,-7e-06,4e-06,-2e-06,1e-06,-3e-06,-1e-06,-1e-06,1e-06,2e-06,-4e-06,0,-2e-06,0,4e-06,-1e-06,1e-06,5.1e-05,-2.5e-05,-4e-06,1e-06
0,2e-06,-1e-06,0,7e-06,-1.4e-05,4.4e-05,3e-06,-4.3e-05,1.8e-05,-2.5e-05,2e-05,-1e-06,-1.8e-05,0,-6.9e-05,1.9e-05,-0.000119,1.7e-05,2.6e-05,-2.9e-05,-0.000118,4e-05,-5.7e-05,-2.8e-05,4.2e-05,6e-06,0.000117,6e-06,8.5e-05,4.7e-05,4.9e-05,-1.2e-05,2e-06,-3.9e-05,7.7e-05,-7.3e-05,-4.1e-05,7.9e-05,-4.1e-05,9e-06,3e-05,-1.2e-05,3.9e-05,3.4e-05,-1.3e-05,-4e-06,-2e-05,2.8e-05,-3.4e-05,-4.2e-05,1.5e-05,-1e-05,3.5e-05,-1.4e-05,-1.3e-05,-2e-06,2e-05,-2e-05,7e-06,7e-06,-6e-06,-6e-06,2e-06,0,1e-06,1.1e-05,-7e-06,2e-06,-4e-06,4e-06,3e-06,-1e-06,6e-06,-1e-06,-3e-06,1e-06,-4e-06,0,0,2e-06,7e-06,-8e-06,9e-06,0,1e-06,4e-06,2e-06,3e-06,1e-06,-2e-06,0,-3e-06,0,1e-06,-6e-06,0,7e-06,1e-06,-1e-06,0,7e-06,1e-06,3e-06,-3e-06,1e-06,0,-9e-06,4e-06,1e-06,-3e-06,-1e-06,0,1e-06,-2e-06,0,-7e-06,-0.000105,2.9e-05,-2e-06,-3e-06
1e-06,-2e-06,0,4e-06,-4e-06,6e-06,-1.3e-05,-1e-06,2.9e-05,2.4e-05,9e-06,-1e-06,0,1.6e-05,6e-06,-7.8e-05,-1.1e-05,-9.5e-05,-2.2e-05,6.4e-05,3.6e-05,-6e-06,-4e-06,-3e-05,-8.5e-05,-5.1e-05,2e-05,0.00012,-6.4e-05,-6.4e-05,8e-06,0.000113,-3.7e-05,1.5e-05,1.7e-05,7.4e-05,-0.000158,-6e-06,-6e-06,4.8e-05,-8e-06,0.000116,-1.5e-05,3.7e-05,-0.000105,3e-06,1.1e-05,-2e-06,1.9e-05,3e-06,2.2e-05,-2e-06,-5e-06,-3.7e-05,2.6e-05,1.7e-05,3e-06,1.3e-05,3.7e-05,-1e-06,1.1e-05,2e-06,-6e-06,-1e-06,0,2e-06,3e-06,-3e-06,-3e-06,-2e-06,4e-06,-1e-06,1e-06,1e-06,2e-06,-2e-06,-1e-06,1e-06,1e-06,0,4e-06,-3e-06,-1.1e-05,4e-06,0,-6e-06,-3e-06,-1e-06,-1e-06,-1e-06,-3e-06,-1e-06,2e-06,2e-06,-1e-06,7e-06,2e-06,-3e-06,-4e-06,1e-06,0,-7e-06,0,-2e-06,1e-06,2e-06,0,9e-06,0,3e-06,2e-06,0,1e-06,1e-06,1e-06,0,3e-06,1e-04,1.4e-05,-3e-06,4e-06
0,0,0,-7e-06,0,1e-06,-1.6e-05,-1.4e-05,-1.2e-05,-3e-06,-2.3e-05,1.4e-05,7e-06,3e-06,-6e-06,4.6e-05,-7.7e-05,-2.3e-05,-5.2e-05,-1e-06,-1e-05,4.1e-05,2e-05,2.3e-05,4.7e-05,-1e-06,6e-06,-7.2e-05,6.5e-05,-8.9e-05,9e-06,-0.000182,4.2e-05,1.8e-05,1.6e-05,-3.6e-05,3.1e-05,4e-06,-1.9e-05,1.3e-05,-8e-06,-3.6e-05,5.6e-05,1.6e-05,2e-06,-1.8e-05,4e-06,6e-05,-1.8e-05,9e-06,-1.5e-05,-1.2e-05,6e-06,1.3e-05,-9e-06,-1.8e-05,-1e-06,-5e-06,-2.9e-05,4e-06,-1.2e-05,-1.4e-05,5e-06,2e-06,2e-06,0,-6e-06,-9e-06,1e-06,1e-06,-4e-06,0,1e-06,-6e-06,0,-1e-06,-2e-06,3e-06,-5e-06,-1e-06,-5e-06,4e-06,-1e-06,-6e-06,0,-1e-06,-3e-06,1e-06,-2e-06,-3e-06,1e-06,-1e-06,-3e-06,1e-06,-1e-06,-2e-06,0,0,0,0,1e-06,6e-06,-2e-06,0,0,-3e-06,0,1e-06,-1e-06,-5e-06,2e-06,0,0,0,2e-06,1e-06,5e-06,-7.8e-05,1.1e-05,-3e-06,-3e-06
0,1e-06,0,-1e-06,4e-06,-7e-06,-5e-06,9e-06,-3.9e-05,-2.8e-05,-2e-05,-1.4e-05,4e-06,-3e-06,1e-06,-0.000117,7.6e-05,6e-05,2.1e-05,-2.7e-05,-4e-06,-6.8e-05,-6.5e-05,2.8e-05,-2.8e-05,1.9e-05,-1.3e-05,-2.1e-05,4.8e-05,-6.6e-05,-1e-06,2e-06,-3.9e-05,1e-05,-4.8e-05,-8e-05,9.5e-05,-5e-06,3e-05,-2.5e-05,2.8e-05,-9.7e-05,8e-06,4.5e-05,-2.5e-05,1e-05,0,-2.3e-05,-2.4e-05,4e-06,-7e-06,1.7e-05,8e-06,-1.3e-05,1e-06,1.5e-05,-2e-06,-1.7e-05,1.3e-05,-3e-06,8e-06,1.1e-05,-2e-06,-4e-06,-2e-06,1e-06,-5e-06,-3e-06,2e-06,1e-06,-4e-06,1e-06,-1e-06,1e-06,0,3e-06,1e-06,-5e-06,5e-06,1e-06,4e-06,-3e-06,6e-06,-1e-06,1e-06,5e-06,0,-1e-06,1e-06,1e-06,1e-06,1e-06,3e-06,-1e-06,-2e-06,6e-06,2e-06,3e-06,0,1e-06,0,-7e-06,0,0,0,3e-06,0,-4e-06,-1e-06,-1e-06,-2e-06,2e-06,1e-06,-2e-06,1e-06,0,-2e-06,4.2e-05,7e-06,-3e-06,2e-06
-1e-06,-2e-06,0,4e-06,-6e-06,1.1e-05,2.5e-05,-4e-06,1.1e-05,2.4e-05,3.5e-05,-3.5e-05,-4e-06,5e-06,5e-06,2.4e-05,-8e-06,1e-06,4e-06,1.8e-05,1.3e-05,2.2e-05,2.7e-05,-1.9e-05,-5.6e-05,-2.7e-05,-3.5e-05,-8.6e-05,-3.2e-05,-5.3e-05,-2e-05,-3.4e-05,1.9e-05,3e-06,8.5e-05,5.1e-05,3.2e-05,1.2e-05,-2.2e-05,2.9e-05,9e-06,2.7e-05,-3.2e-05,4.1e-05,3.7e-05,-1.3e-05,1.3e-05,-2.8e-05,1.9e-05,-2.2e-05,9e-06,3e-06,5e-06,1.7e-05,-3e-06,-1e-05,1e-06,-7e-06,-1.3e-05,-4e-06,-3e-06,1e-06,2e-06,2e-06,1e-06,0,2e-06,4e-06,-1e-06,1e-06,-1e-06,-1e-06,4e-06,5e-06,1e-06,0,1e-06,4e-06,-3e-06,0,-2e-06,0,4e-06,-1e-06,0,8e-06,-1e-06,0,0,2e-06,-3e-06,0,-2e-06,-2e-06,-1e-06,1e-06,-2e-06,0,1e-06,1e-06,0,6e-06,-3e-06,0,-1e-06,3e-06,0,-3e-06,-2e-06,2e-06,-1e-06,0,-3e-06,1e-06,0,0,1e-06,-3.3e-05,2.3e-05,-3e-06,0
-1e-06,1e-06,0,-4e-06,6e-06,-1.1e-05,-5e-06,9e-06,6e-05,1.8e-05,-7e-06,1.3e-05,-3e-06,-4e-06,-5e-06,0.000149,-1.9e-05,-1.2e-05,2.1e-05,-2e-06,-4.9e-05,3.2e-05,5e-06,-3.2e-05,-4.4e-05,3.7e-05,-1.5e-05,8e-06,9e-06,0,2.3e-05,5.9e-05,2.2e-05,-2e-06,-7.4e-05,3.2e-05,-0.000117,1.2e-05,2.3e-05,1e-05,-1.1e-05,7.1e-05,-1.8e-05,1.8e-05,9e-06,3.3e-05,-2.7e-05,2.5e-05,1.8e-05,2.1e-05,4e-06,-1.5e-05,0,-2.6e-05,-7e-06,1e-06,-1e-06,1.1e-05,-1.1e-05,5e-06,-1e-06,-5e-06,-1.1e-05,3e-06,1e-06,-1e-06,1e-06,3e-06,2e-06,2e-06,3e-06,1e-06,-2e-06,-4e-06,-1e-06,0,-1e-06,-1e-06,1e-06,0,2e-06,-1e-06,-9e-06,-4e-06,1e-06,3e-06,0,1e-06,0,-1e-06,0,0,2e-06,-1e-06,1e-06,0,0,-3e-06,-1e-06,-1e-06,0,-5e-06,-2e-06,1e-06,1e-06,-2e-06,0,7e-06,2e-06,2e-06,-1e-06,-1e-06,0,1e-06,-1e-06,0,-1e-06,3.8e-05,-5e-06,-2e-06,-1e-06
0,-1e-06,0,2e-06,-5e-06,1.1e-05,-1.3e-05,1.3e-05,-3.2e-05,-1.9e-05,5e-06,-7e-06,-3e-06,0,0,-4e-05,4.6e-05,-1e-06,-9e-06,-4.1e-05,5.3e-05,-2.5e-05,1e-05,3e-06,5.2e-05,-1.5e-05,-7e-06,-2e-06,6.1e-05,-1.5e-05,-4e-06,-9e-06,1.2e-05,-8e-06,6.1e-05,-1e-05,-5.5e-05,-2e-05,-2.6e-05,4e-06,1e-05,4e-06,1.3e-05,4.3e-05,-1e-06,-2e-05,2.8e-05,4e-06,1e-06,1e-06,-1.3e-05,5e-06,-7e-06,1.2e-05,1.4e-05,3e-06,-1e-06,2e-06,8e-06,-2e-06,7e-06,-4e-06,1.1e-05,-4e-06,1e-06,0,-3e-06,5e-06,1e-06,0,4e-06,-2e-06,-2e-06,-3e-06,0,-3e-06,1e-06,0,-2e-06,0,0,4e-06,-2e-06,6e-06,0,-1e-06,-4e-06,-2e-06,-1e-06,-1e-06,-1e-06,0,-1e-06,0,1e-06,1e-06,-2e-06,1e-06,1e-06,0,0,5e-06,-2e-06,-1e-06,-1e-06,3e-06,0,-1e-06,2e-06,-2e-06,1e-06,0,-1e-06,-1e-06,0,0,-3e-06,-2.5e-05,-1.2e-05,-2e-06,0
0,1e-06,0,4e-06,4e-06,-1.1e-05,-1e-06,-8e-06,-3.6e-05,-1e-05,-1e-05,2.1e-05,1e-06,-9e-06,5e-06,-4.5e-05,5e-06,7e-06,3e-06,-1e-06,-6.4e-05,2.9e-05,4e-06,5e-06,1.5e-05,-9e-06,5e-06,-2.8e-05,-8e-06,1.2e-05,1.7e-05,2e-05,3.7e-05,-1e-05,-5.7e-05,-5e-06,0.000103,3.7e-05,0,-9e-06,-9e-06,-3.1e-05,-2.9e-05,-2.9e-05,1.7e-05,-1.9e-05,-1.7e-05,1e-05,-2.2e-05,-8e-06,7e-06,-1e-06,-6e-06,-6e-06,-1.3e-05,-7e-06,4e-06,-4e-06,-1.4e-05,1e-06,-7e-06,2e-06,-4e-06,2e-06,-1e-06,0,2e-06,2e-06,-3e-06,-2e-06,-1e-06,1e-06,4e-06,5e-06,0,1e-06,0,1e-06,0,0,-4e-06,0,3e-06,0,0,-2e-06,2e-06,0,1e-06,1e-06,0,-1e-06,1e-06,1e-06,-1e-06,0,2e-06,0,0,0,-1e-06,-4e-06,0,0,1e-06,-1e-06,0,-4e-06,0,-2e-06,4e-06,1e-06,2e-06,-1e-06,-2e-06,0,2e-06,-8e-06,-4e-06,-1e-06,0
-1e-06,-1e-06,0,-4e-06,-3e-06,8e-06,1.5e-05,7e-06,6.1e-05,-6e-06,-2.1e-05,1e-06,5e-06,1e-05,-6e-06,-5e-06,-6.7e-05,1.3e-05,-2e-06,3.3e-05,6.6e-05,2.3e-05,-4.3e-05,-8e-06,3.5e-05,1.2e-05,1.7e-05,7.4e-05,-1.6e-05,7.6e-05,-2.2e-05,-2e-06,1.9e-05,-5e-06,4.5e-05,-4.3e-05,6.8e-05,-1.9e-05,2.3e-05,-1e-05,-1.3e-05,-2.3e-05,0,6.1e-05,-1e-05,1e-06,-1e-05,-4.4e-05,-1e-05,3e-06,5e-06,-6e-06,0,1.2e-05,1e-06,1.1e-05,-6e-06,1e-06,3e-05,-1e-06,3e-06,5e-06,1e-06,1e-06,-1e-06,0,7e-06,1e-06,1e-06,-1e-06,-3e-06,1e-06,-1e-06,-1e-06,-1e-06,0,0,-3e-06,1e-06,1e-06,7e-06,-1e-06,-1e-06,-5e-06,1e-06,0,-4e-06,1e-06,1e-06,-1e-06,1e-06,1e-06,0,0,-1e-06,0,0,-4e-06,-2e-06,1e-06,1e-06,3e-06,1e-06,0,-1e-06,0,0,2e-06,-1e-06,3e-06,-3e-06,1e-06,-1e-06,0,1e-06,0,1e-06,1.2e-05,-1.4e-05,-1e-06,0
0,1e-06,0,1e-06,1e-06,-3e-06,-4e-06,-1.2e-05,-2.4e-05,8e-06,-3e-06,-5e-06,1e-06,-8e-06,2e-06,-3e-05,-1.4e-05,-5.6e-05,-3.2e-05,1.8e-05,-2.7e-05,-1.9e-05,5e-05,-1.6e-05,6e-06,-1.5e-05,1.8e-05,-6e-06,3.6e-05,5.8e-05,4e-06,-5e-06,1e-06,-1e-06,-3.8e-05,-2.2e-05,-6.1e-05,1e-05,-3e-05,0,2e-06,1.9e-05,4.2e-05,-6.4e-05,2.4e-05,-6e-06,2.4e-05,1.5e-05,1.9e-05,6e-06,-5e-06,9e-06,3e-06,-2e-05,0,-1.2e-05,3e-06,8e-06,-2.7e-05,-2e-06,-2e-06,0,-2e-06,-2e-06,4e-06,0,2e-06,-5e-06,0,1e-06,-2e-06,-2e-06,-2e-06,-4e-06,-1e-06,0,0,4e-06,0,0,-7e-06,1e-06,-2e-06,2e-06,-1e-06,-4e-06,0,0,-2e-06,-2e-06,-1e-06,0,0,-1e-06,0,-3e-06,0,2e-06,-1e-06,-1e-06,-1e-06,-4e-06,0,0,0,0,0,5e-06,-1e-06,0,-1e-06,-1e-06,0,1e-06,-2e-06,0,-1e-06,-2.4e-05,-3e-06,-1e-06,-1e-06
1e-06,0,0,2e-06,1e-06,0,-9e-06,-6e-06,-3.1e-05,1.6e-05,2.1e-05,-1.1e-05,-2e-06,1.5e-05,4e-06,-1.2e-05,-3.1e-05,3e-06,3.6e-05,2e-06,-1e-05,1.3e-05,-7e-06,-1.9e-05,-3.6e-05,2.1e-05,2e-05,2.6e-05,-1.7e-05,5.8e-05,-8e-06,-1.4e-05,-1.2e-05,0,-3e-06,8e-06,-1e-04,-4e-06,2.4e-05,6e-06,5e-06,3.9e-05,2e-06,4.4e-05,-3.7e-05,1.8e-05,-2.6e-05,1.5e-05,1.3e-05,-3e-06,1.4e-05,2e-06,7e-06,1.8e-05,-3e-06,6e-06,-2e-06,2e-06,1.4e-05,2e-06,-3e-06,-5e-06,3e-06,1e-06,-4e-06,-1e-06,-8e-06,-4e-06,0,1e-06,2e-06,2e-06,3e-06,3e-06,1e-06,0,-1e-06,-3e-06,0,0,3e-06,-3e-06,-1e-06,2e-06,1e-06,-3e-06,-2e-06,0,-1e-06,1e-06,-1e-06,0,1e-06,-1e-06,0,5e-06,0,-1e-06,1e-06,1e-06,0,4e-06,1e-06,1e-06,1e-06,-1e-06,0,-5e-06,1e-06,-1e-06,-1e-06,-1e-06,-1e-06,0,2e-06,0,1e-06,2.5e-05,-1.7e-05,0,0
0,-1e-06,0,-4e-06,-2e-06,3e-06,-1e-06,-1.2e-05,4.4e-05,6e-06,-1.4e-05,1.8e-05,-3e-06,-9e-06,-5e-06,8.9e-05,-8.2e-05,1.5e-05,-3e-06,-2.1e-05,3.3e-05,3e-06,-5e-06,-7e-06,2.9e-05,-1.3e-05,1.2e-05,-1e-06,-3.5e-05,-5e-06,0,-5.3e-05,-2e-05,2e-06,3.8e-05,2.2e-05,4.6e-05,-1.1e-05,-9e-06,-6e-06,-7e-06,-1.7e-05,-1.5e-05,-6.9e-05,1e-06,2.4e-05,1.5e-05,2e-06,-1.1e-05,-1.2e-05,-1e-05,-1.1e-05,5e-06,-1e-05,5e-06,-1e-06,2e-06,-1.4e-05,9e-06,-1e-06,4e-06,2e-06,2e-06,0,-1e-06,0,-3e-06,-2e-06,-2e-06,0,2e-06,-1e-06,-1e-06,3e-06,-2e-06,0,0,1e-06,-1e-06,0,2e-06,2e-06,0,-2e-06,0,-3e-06,0,0,-1e-06,2e-06,2e-06,-1e-06,-1e-06,0,0,-6e-06,-1e-06,-1e-06,2e-06,-1e-06,1e-06,-3e-06,1e-06,-1e-06,-1e-06,1e-06,0,-3e-06,0,-1e-06,1e-06,0,0,0,-1e-06,0,-1e-06,-1.9e-05,1e-05,0,-1e-06
-1e-06,1e-06,0,2e-06,3e-06,-7e-06,1.3e-05,5e-06,-1e-05,-2.1e-05,1.8e-05,-5e-06,-2e-06,9e-06,2e-06,1e-05,-3e-06,2.6e-05,1e-06,-3.9e-05,-2.6e-05,-2.1e-05,0,1e-06,3.2e-05,-3e-06,-1.2e-05,3e-06,3e-05,-4.3e-05,3e-06,6.4e-05,-5e-06,3e-06,-4e-05,8e-06,0.000104,-2e-06,-5e-06,8e-06,8e-06,-3.9e-05,2.1e-05,2.1e-05,-3.8e-05,7e-06,-3e-06,-2e-05,-1.7e-05,1.5e-05,-6e-06,4e-06,0,1.1e-05,-1e-06,-2e-06,-4e-06,-1.1e-05,-1.7e-05,-1e-06,-1e-06,5e-06,-7e-06,0,2e-06,1e-06,3e-06,-1e-06,0,0,0,0,-2e-06,-5e-06,1e-06,1e-06,0,1e-06,1e-06,0,-6e-06,3e-06,-5e-06,4e-06,0,4e-06,1e-06,0,0,-1e-06,0,0,2e-06,0,1e-06,5e-06,0,0,-1e-06,1e-06,-1e-06,4e-06,1e-06,0,1e-06,0,0,5e-06,2e-06,2e-06,2e-06,1e-06,0,0,2e-06,0,0,2.6e-05,-1.1e-05,0,0
0,-1e-06,0,2e-06,-3e-06,8e-06,-5e-06,-5e-06,-1.8e-05,-5e-06,0,3e-06,2e-06,-1.6e-05,3e-06,-6e-05,1e-06,-2e-06,1.9e-05,9e-06,2.6e-05,-1.1e-05,-2.6e-05,-1.1e-05,-1.2e-05,1.3e-05,-1.8e-05,2.3e-05,1e-06,-3.4e-05,2e-06,-5.3e-05,-5e-06,2e-06,5.7e-05,-1.8e-05,-2.3e-05,-1.4e-05,1.8e-05,1.2e-05,2e-06,0,-3e-06,-7.7e-05,4e-05,-2.9e-05,-2e-06,-1e-05,2e-06,-8e-06,1.1e-05,5e-06,-5e-06,-1.4e-05,3e-06,5e-06,4e-06,6e-06,1.7e-05,1e-06,0,-2e-06,5e-06,-1e-06,-1e-06,-1e-06,1e-06,4e-06,2e-06,-1e-06,0,1e-06,1e-06,-1e-06,0,0,0,-2e-06,-2e-06,0,7e-06,-4e-06,1e-06,0,1e-06,1e-06,-2e-06,0,0,-1e-06,-1e-06,0,-2e-06,0,0,-7e-06,-1e-06,3e-06,0,-2e-06,0,-3e-06,0,0,0,1e-06,0,0,-1e-06,0,-1e-06,0,0,0,-1e-06,0,0,-4e-05,2.2e-05,0,0
