0.027686,0.021394,0.024911,0.235046,0.575282,0.548185,0.499773,0.769554,0.702078,0.500778,0.466622,0.462307,0.607938,0.594576,0.398991,0.274821,0.25152,0.228555,0.150746,0.107674,0.114487,0.127083,0.112949,0.102392,0.169836,0.389164,0.600901,0.473902
0.032982,0.025456,0.029399,0.282148,0.694559,0.668556,0.589859,0.865532,0.770245,0.549666,0.537763,0.532568,0.687669,0.678712,0.461959,0.327718,0.296831,0.264286,0.180194,0.131815,0.135996,0.145762,0.128887,0.121029,0.203936,0.469753,0.730314,0.572577
0.041355,0.031807,0.036826,0.355076,0.875893,0.857323,0.728538,1.000646,0.87029,0.634446,0.665627,0.649559,0.804904,0.808283,0.56258,0.412446,0.365912,0.314187,0.227135,0.173352,0.170021,0.173132,0.153492,0.153506,0.266898,0.604732,0.953509,0.752492
0.047256,0.036326,0.043845,0.406279,0.977058,0.97225,0.839175,1.092208,0.965163,0.769706,0.830043,0.779912,0.906852,0.917976,0.647362,0.471076,0.407193,0.339436,0.261543,0.209188,0.196036,0.19269,0.173532,0.182436,0.320901,0.688776,1.105652,0.892284
0.050107,0.039159,0.052714,0.468637,1.058883,1.030006,0.942937,1.208952,1.111942,1.010977,1.106081,1.012215,1.076324,1.060535,0.744379,0.511242,0.427181,0.350805,0.273821,0.228228,0.214588,0.20708,0.189643,0.208228,0.35572,0.696227,1.139621,0.953406
0.051923,0.04238,0.063124,0.562157,1.228291,1.132504,1.079153,1.454531,1.42874,1.457599,1.652731,1.520127,1.45695,1.348935,0.947235,0.605134,0.454869,0.360633,0.271115,0.229421,0.227832,0.223556,0.205022,0.222644,0.36452,0.663313,1.078653,0.921364
0.062992,0.052967,0.077973,0.677903,1.516239,1.360508,1.374429,2.024175,2.165037,2.408917,2.763765,2.57713,2.3352,2.126783,1.561873,0.944573,0.607804,0.445054,0.317131,0.260443,0.280257,0.303343,0.273053,0.244467,0.382074,0.667808,1.008749,0.851193
0.086994,0.074199,0.100913,0.776832,1.839007,1.767595,2.161246,3.382608,3.768335,4.319373,4.892852,4.563357,4.051948,3.771574,2.911482,1.717089,1.021697,0.730603,0.518882,0.419693,0.460081,0.521134,0.464998,0.342474,0.470008,0.799549,1.127171,0.926554
0.121164,0.105118,0.127044,0.814998,2.100617,2.358331,3.696835,5.911882,6.651419,7.547039,8.295047,7.8027,6.991512,6.573166,5.178841,3.004312,1.720246,1.246512,0.888555,0.716723,0.784944,0.893054,0.800322,0.542796,0.640625,1.065617,1.512413,1.241671
0.16194,0.142953,0.152032,0.774701,2.177335,2.932299,5.844487,9.488851,10.767514,11.96709,12.632569,12.13356,11.202938,10.441988,8.151302,4.638243,2.576571,1.915625,1.377309,1.112966,1.214131,1.368885,1.229655,0.799075,0.845548,1.381867,2.018601,1.67392
0.209975,0.182958,0.168978,0.688914,2.055981,3.282168,8.03506,13.301401,15.198856,16.306611,16.464645,16.373595,15.659111,14.210248,10.79317,6.051132,3.295459,2.50964,1.82017,1.476389,1.601312,1.782907,1.600031,1.016628,1.04114,1.689436,2.452621,2.011118
0.250831,0.210417,0.169156,0.654477,1.95102,3.363792,9.204689,15.600432,17.869628,18.136183,17.372958,18.036225,17.886307,15.583125,11.340368,6.310818,3.44285,2.693931,1.971903,1.595469,1.724315,1.91977,1.70494,1.067132,1.153514,1.87953,2.619779,2.100678
0.256016,0.206752,0.155302,0.686013,1.881258,3.06111,8.374012,14.539867,16.560447,15.787904,14.422359,15.547701,15.780639,12.950007,8.842565,4.91877,2.758301,2.223509,1.647656,1.329271,1.461936,1.661726,1.430416,0.877681,1.088064,1.819468,2.425021,1.923635
0.207899,0.165211,0.13082,0.641909,1.62199,2.412623,5.886591,10.32168,11.527925,10.647131,9.841171,10.445447,10.252989,7.741006,4.825376,2.735905,1.650592,1.336184,0.993593,0.801627,0.912694,1.090535,0.909781,0.562311,0.875894,1.490982,1.958227,1.60618
0.137235,0.107888,0.098786,0.54979,1.291746,1.741872,3.381815,5.747017,6.126199,5.841882,5.983354,5.617557,4.940733,3.554083,1.987749,1.175056,0.795377,0.611254,0.446382,0.352604,0.419397,0.53732,0.440547,0.317585,0.663398,1.094256,1.452786,1.254341
0.078018,0.06178,0.072883,0.441132,1.003568,1.274878,1.985258,3.236286,3.379262,3.436537,3.549117,2.72954,2.297742,1.783281,0.982167,0.591125,0.418967,0.301237,0.201919,0.144181,0.178116,0.234605,0.197332,0.234352,0.575333,0.873992,1.188727,1.05778
0.048345,0.039154,0.061996,0.320746,0.711666,0.920041,1.461669,2.641507,2.796632,2.413046,2.141951,1.658682,1.75611,1.497546,0.836247,0.504299,0.332163,0.206085,0.132158,0.096197,0.122954,0.176975,0.159531,0.229848,0.585479,0.921393,1.277952,1.107631
0.053474,0.044649,0.071996,0.274663,0.578539,0.78015,1.560693,3.208374,3.164933,2.097991,1.734531,1.564589,2.007454,1.869141,1.088924,0.662258,0.409497,0.22115,0.14613,0.120869,0.154123,0.253991,0.241133,0.247697,0.62802,1.177498,1.772683,1.505849
0.075134,0.064541,0.093023,0.299044,0.611548,0.821045,1.939984,4.149532,3.841344,2.266912,1.973257,1.915815,2.612937,2.654325,1.678034,1.047447,0.649544,0.335338,0.218419,0.188271,0.237489,0.405323,0.391706,0.302174,0.729296,1.576408,2.415873,1.983497
0.104954,0.090008,0.116587,0.374022,0.780988,1.00958,2.432062,5.260205,4.726934,2.619843,2.370355,2.379819,3.352025,3.710869,2.564727,1.636643,1.019815,0.507625,0.322302,0.281629,0.349124,0.602717,0.5856,0.413475,0.938623,2.062691,2.955779,2.275066
0.133248,0.11525,0.134662,0.454766,1.026427,1.287563,2.807842,6.013893,5.351658,2.955313,2.764206,2.736706,3.968223,4.692628,3.428452,2.244085,1.419129,0.698104,0.426125,0.372036,0.45696,0.79671,0.767817,0.534111,1.193449,2.535786,3.24331,2.232883
0.143087,0.128032,0.14422,0.50525,1.205122,1.492519,2.837799,5.820215,5.256891,3.098471,2.865361,2.799042,4.203933,5.024644,3.730685,2.534539,1.655774,0.840565,0.492967,0.420428,0.515652,0.89264,0.83838,0.582942,1.381171,2.950578,3.359736,1.966508
0.133769,0.125846,0.154638,0.544833,1.225941,1.509403,2.655658,4.917155,4.53385,2.970371,2.546242,2.429621,3.676696,4.263851,3.193998,2.273718,1.551233,0.863459,0.51009,0.403842,0.476539,0.80427,0.739409,0.586845,1.461788,3.127024,3.476058,1.934723
0.138108,0.126656,0.161693,0.52439,1.026539,1.354232,2.532378,4.173808,3.681531,2.543586,2.142836,1.901283,2.672543,3.010975,2.395619,1.791847,1.216617,0.743543,0.469416,0.347362,0.363686,0.578325,0.546042,0.653835,1.514219,2.964479,3.493505,2.130001
0.154452,0.134782,0.162934,0.460686,0.773596,1.128416,2.225911,3.359424,2.849048,2.102398,1.878851,1.53592,2.021307,2.164939,1.769741,1.473988,0.961186,0.564975,0.386211,0.310386,0.306019,0.437099,0.429529,0.75306,1.58592,2.838574,3.693945,2.499975
0.154705,0.132565,0.157549,0.455292,0.714913,1.02,1.905983,2.660192,2.212063,1.768094,1.654938,1.374066,1.860197,1.736476,1.211578,1.151806,0.78086,0.436354,0.331387,0.321249,0.339175,0.442526,0.428411,0.78696,1.563047,2.756258,3.916366,2.788474
0.127965,0.106137,0.140615,0.457362,0.722027,1.126774,2.069631,2.61231,1.991984,1.515364,1.396761,1.215355,1.731897,1.576349,0.969854,0.864249,0.647705,0.416857,0.330321,0.335684,0.363163,0.463246,0.429715,0.66724,1.408254,2.723496,3.915461,2.733083
0.100669,0.075721,0.114376,0.444664,0.775772,1.406645,2.412709,2.755685,2.01987,1.349016,1.133435,1.06,1.444609,1.335138,0.831573,0.648864,0.512347,0.376463,0.317153,0.309514,0.319437,0.416093,0.371497,0.436292,1.110321,2.629245,3.714469,2.425749
0.074737,0.051163,0.088888,0.433364,0.885926,1.70088,2.763532,2.949891,2.105662,1.304956,0.98374,0.89835,1.086625,1.069402,0.721264,0.467528,0.346728,0.273121,0.255844,0.242879,0.23766,0.329912,0.290431,0.23757,0.748717,2.2153,3.234733,2.082382
0.05282,0.039745,0.069344,0.3994,0.96742,1.837558,2.83864,2.807395,1.87572,1.224355,0.954963,0.794655,0.859561,0.906987,0.686849,0.409907,0.249165,0.179098,0.171499,0.172139,0.187396,0.323725,0.292248,0.163979,0.522628,1.645175,2.534907,1.801543
0.049726,0.036504,0.053415,0.316553,0.882946,1.811011,2.69729,2.344043,1.417406,1.049488,0.907639,0.722971,0.765436,0.850768,0.683845,0.42525,0.242718,0.153306,0.114191,0.109237,0.159307,0.36065,0.339145,0.185384,0.46551,1.326022,2.144497,1.722737
0.053912,0.038967,0.04562,0.213727,0.654518,1.685792,2.567325,2.03896,1.171548,0.96138,0.832615,0.580873,0.651315,0.775658,0.626061,0.414478,0.262703,0.161538,0.106654,0.093249,0.145664,0.377316,0.3699,0.239462,0.491286,1.129653,2.066772,1.922778
0.050414,0.037573,0.038315,0.124329,0.494681,1.581226,2.559818,1.968068,1.010382,0.907642,0.739266,0.451476,0.609297,0.668061,0.480474,0.358585,0.266826,0.186474,0.134968,0.095988,0.131452,0.358054,0.354566,0.284996,0.594256,1.256278,2.325051,2.187588
0.036064,0.028147,0.02818,0.106342,0.544456,1.614334,2.593531,1.991041,0.998782,0.990908,0.786475,0.470879,0.667421,0.649621,0.383759,0.284403,0.225115,0.190278,0.156437,0.092876,0.112798,0.327526,0.322018,0.311993,0.713515,1.583903,2.634042,2.279479
0.018985,0.016688,0.021225,0.121812,0.658431,1.773846,2.665318,1.993399,0.996029,1.040805,0.843807,0.562938,0.734436,0.683831,0.403017,0.26971,0.180108,0.168211,0.156072,0.097874,0.124377,0.353256,0.341688,0.329109,0.798479,1.958377,3.14951,2.461567
0.011137,0.012604,0.019145,0.127662,0.695717,1.710681,2.426979,1.759977,0.861221,0.932395,0.819736,0.672201,0.81085,0.653736,0.380994,0.281191,0.193446,0.150442,0.136703,0.106177,0.134687,0.377033,0.360263,0.302501,0.825344,2.293136,3.763722,2.776706
0.014386,0.016268,0.018412,0.126843,0.630121,1.386791,1.942715,1.387906,0.724739,0.749509,0.73483,0.789476,0.880319,0.570882,0.306769,0.250695,0.210106,0.151234,0.112032,0.105554,0.126406,0.36781,0.353083,0.24041,0.740806,2.338156,3.926817,2.890848
0.01913,0.021175,0.017816,0.119318,0.489627,1.145242,1.800097,1.334423,0.640834,0.659611,0.752341,0.913663,0.898237,0.526229,0.275555,0.199124,0.202542,0.151971,0.089813,0.093816,0.120528,0.353047,0.330875,0.177124,0.564872,1.995612,3.389927,2.545829
0.022415,0.024566,0.017966,0.104875,0.348229,0.9846,1.788207,1.492542,0.718323,0.659541,0.800856,0.922541,0.851119,0.531314,0.338158,0.197768,0.179112,0.150963,0.084762,0.086465,0.123662,0.327601,0.295084,0.145016,0.420333,1.539295,2.478271,1.883383
0.02363,0.024484,0.016674,0.093729,0.341307,0.848502,1.582842,1.533013,0.903429,0.72896,0.737206,0.759283,0.822596,0.645502,0.400342,0.194161,0.137155,0.140437,0.087462,0.081058,0.117434,0.278306,0.248357,0.140736,0.377802,1.419174,2.042259,1.439993
