-1e-05,-1e-05,-1.4e-05,-1.9e-05,-2.6e-05,-0.00074,-0.003752,-0.004188,-0.025214,-0.129785,-0.208126,-0.190108,-0.161581,-0.160815,-0.144852,-0.129462,-0.103289,-0.056532,-0.019732,-0.005976,-0.002919,-0.002575,-0.001892,-0.002588,-0.003048,-0.001195,-0.001139,-0.000507
2e-06,0,4e-06,8e-06,-5e-06,-0.000309,-0.00139,-0.003774,-0.026224,-0.06291,-0.091836,0.014929,0.124136,0.130537,0.107676,0.091741,0.100915,0.061058,0.018736,0.005483,0.003441,0.003302,0.002067,0.001432,0.001062,-0.000412,-0.000554,-0.000351
-3e-06,-4e-06,0,2e-06,4e-06,0.000262,0.001456,-0.000588,-0.015143,-0.069054,-0.101502,-0.050143,-0.022994,-0.028766,-0.029858,-0.026075,-0.017467,-0.009665,-0.002405,-0.001462,-0.000623,-0.000621,-0.000185,-0.000189,-0.000319,2.2e-05,0.000295,6.6e-05
-6e-06,-6e-06,-8e-06,-7e-06,4e-06,0.000178,0.001036,0.001647,0.003497,-0.032039,-0.053324,-0.089609,-0.147592,-0.144196,-0.100603,-0.074071,-0.086713,-0.055922,-0.019905,-0.005903,-0.003167,-0.002838,-0.001868,-0.001737,-0.000735,0.000548,0.000817,0.000382
-2e-06,1e-06,4e-06,1e-05,1e-05,-2.5e-05,-9.7e-05,0.002795,0.026168,0.136633,0.233926,0.18834,0.150764,0.162253,0.152757,0.136484,0.108442,0.061979,0.020788,0.007086,0.003398,0.00309,0.001659,0.001649,0.0022,0.000818,0.000293,0.00019
-3e-06,-2e-06,-1e-06,0,-5e-06,-9.4e-05,-0.000811,0.000437,0.017993,0.110916,0.170896,0.112695,0.08839,0.078146,0.037553,0.01539,0.022313,0.015535,0.008045,0.00166,0.00062,0.000288,0.000404,0.000587,-0.000224,-0.000465,-0.000678,-0.000305
-6e-06,-9e-06,-1.9e-05,-1.8e-05,-1.4e-05,-9.5e-05,-0.000722,-0.002112,-0.010494,-0.060997,-0.149575,-0.16555,-0.165248,-0.168424,-0.150462,-0.136384,-0.111464,-0.063118,-0.022605,-0.007037,-0.003364,-0.002702,-0.001432,-0.001606,-0.001877,-0.000801,-0.000461,-0.000287
-3e-06,-5e-06,-7e-06,-1e-06,6e-06,7.3e-05,0.000656,-0.001134,-0.018281,-0.075397,-0.128779,-0.051707,0.011209,0.030211,0.036809,0.036354,0.039212,0.026059,0.006347,0.002847,0.001669,0.001658,0.000815,0.00057,0.000989,0.000323,0.000267,0.000108
4e-06,3e-06,8e-06,7e-06,9e-06,0.000146,0.001192,0.000654,-0.004825,-0.01882,-0.004749,0.058145,0.091463,0.079644,0.054793,0.051807,0.042585,0.023579,0.010668,0.002417,0.001187,0.000779,0.000434,0.000725,0.000759,0.000482,0.000319,0.000205
1e-05,1e-05,3e-06,-4e-06,-5e-06,-7.2e-05,-0.000269,0.001141,0.00485,-0.022813,-0.055143,-0.060512,-0.091496,-0.10378,-0.06864,-0.048554,-0.058905,-0.040317,-0.014318,-0.004738,-0.002378,-0.00183,-0.001099,-0.001227,-0.000825,0.000178,0.00025,0.000167
1e-06,4e-06,-1e-06,-1e-06,-4e-06,-0.000177,-0.001368,7.1e-05,0.006049,0.029886,0.051707,0.012337,2e-05,0.025272,0.04878,0.041886,0.033378,0.01926,0.004305,0.002883,0.001087,0.000908,0.000416,1e-06,0.000368,0.000129,-0.000194,-7.2e-05
2e-06,0,6e-06,5e-06,3e-06,4.6e-05,-0.000166,-0.000357,0.006694,0.079531,0.166043,0.117342,0.107482,0.097615,0.045481,0.025974,0.039071,0.025126,0.01233,0.003441,0.001414,0.000725,0.000565,0.000868,0.000364,-0.00022,-0.000312,-0.000154
1.1e-05,6e-06,4e-06,2e-06,5e-06,0.000199,0.001313,-0.000179,0.001957,0.010005,-0.006764,-0.03215,-0.053948,-0.078019,-0.088198,-0.07934,-0.06152,-0.033947,-0.011497,-0.004825,-0.001824,-0.001237,-0.000713,-0.000515,-0.000439,-0.000289,-1.2e-05,-8e-06
-4e-06,-2e-06,-5e-06,-4e-06,-1e-06,-4e-05,0.000273,-0.000244,-0.007844,-0.058491,-0.116463,-0.082452,-0.066895,-0.040171,-0.004727,0.000808,-0.00355,0.000531,-0.003784,9.8e-05,5e-05,0.000289,-9e-06,-0.000583,-0.00033,5.8e-05,0.000285,0.000119
-1.1e-05,-8e-06,-4e-06,-3e-06,-9e-06,-0.000237,-0.001257,-0.000684,-0.007147,-0.027353,-0.000928,0.044894,0.067205,0.06733,0.057249,0.059231,0.043661,0.022107,0.010105,0.003104,0.001323,0.000703,0.000552,0.000589,0.000157,0.000117,5.9e-05,-1e-06
0,0,0,-2e-06,-4e-06,1.5e-05,-0.000254,0.000487,0.001722,0.002362,0.017317,0.021051,0.013561,-0.017471,-0.021088,-0.016929,-0.023138,-0.016091,-0.004985,-0.003208,-0.000887,-0.000463,-0.00027,0.000253,0.000291,4.4e-05,-0.000186,-1e-04
0,0,-3e-06,1e-06,1e-05,0.000251,0.001022,0.000953,0.003066,0.007368,-0.019195,-0.051229,-0.055765,-0.027069,0.004731,-0.013743,-0.006634,6e-06,-0.003815,0.00023,-0.000217,-0.000165,-0.000319,-0.000548,-0.000207,-5e-05,-8.9e-05,-2.9e-05
-2e-06,-3e-06,-2e-06,5e-06,9e-06,0.000101,0.00045,0.000279,0.003316,0.040785,0.084305,0.04551,0.025961,0.042154,0.026471,0.021459,0.028054,0.01313,0.007977,0.003636,0.000921,0.000293,0.000343,-0.000104,-0.000546,-0.000195,0.000106,6.6e-05
-5e-06,-4e-06,-3e-06,-5e-06,-7e-06,-0.000105,-0.000241,-0.000369,0.003375,0.028945,0.079022,0.05976,0.029088,-0.008941,-0.046711,-0.027177,-0.021709,-0.012562,-0.002204,-0.002754,-0.00058,-0.000101,-1e-05,0.000111,-0.000337,-0.000284,-9e-06,3e-06
