-0.000944,-0.000216,-0.000735,-0.001,-0.00108,-0.001414,-0.000784,-0.00099,-0.001383,-0.00203,-0.001503,-0.001155,-0.001194,-0.000896,-0.000578,-0.001293,-0.000849,-0.000789,-0.001049,-0.00056,-0.001015,-0.001792,-0.001157,-0.000978,-0.000834,-0.001409,-0.001627,-0.001208,-0.000565,-0.001177,-0.001222,-0.001115,-0.001109,-0.000427,-0.000601,-0.000291,-0.000351,-0.000765,-0.000711,-0.000591,-0.001331,-0.000652,-0.000407,-0.000696,-0.000876,-0.001552,-0.001121,-0.000812,-0.001051,-0.001248,-0.000362,-0.001721,-0.001323,-0.00049,-0.001005,-0.001077,-0.001025,-0.001261,-0.000529,-0.000894,-0.001075,-0.000598,-0.001574,-0.001215,-0.001912,-0.002536,-0.002328,-0.002111,-0.001254,-0.000769,-0.000943,-0.001936,-0.00092,-0.000925,-0.001011,-0.00166,-0.001223,-0.001838,-0.000911,-0.001145,-0.001896,-0.001091,-0.001527,-0.001366,-0.001085,-0.000681,-0.00149,-0.001132,-0.000502,-0.000836,-0.00138,-0.000975,-0.001349,-0.001439,-0.000941,-0.000887,-0.000837,-0.001174,-0.001529,-0.001271,-0.001176,-0.000729,-0.00107,-0.001099,-0.000761,-0.001431,-0.0012,-0.000907,-0.001223,-0.000789,-0.001068,-0.00055,-0.000994,-0.001021,-0.000573,-0.001258,-0.001112,-0.001094,-0.001554,-0.000964,-0.000586
0.000419,3e-04,0.000629,0.000537,0.00063,0.000353,0.000233,0.00072,0.000345,0.000468,2e-05,0.000258,0.000319,0.000102,-0.000344,0.000643,1.1e-05,0.00047,0.000213,-0.000283,0.000515,0.000762,0.000426,-7.4e-05,-0.000196,0.000214,0.001133,0.000437,-0.000295,0.000373,0.000614,0.000421,0.000528,-0.000323,-0.000277,-0.00032,-0.000226,0.000127,0.000156,-0.000503,0.000225,-2e-06,-5.3e-05,-6.7e-05,-5.9e-05,0.000865,0.000386,5.4e-05,0.000138,0.000361,-0.000195,0.000606,0.000646,0.000265,-5.1e-05,0.000587,0.00018,7e-05,0.000356,-0.000324,-0.000161,9.9e-05,0.000686,0.000402,0.000921,0.00178,0.00163,0.00105,0.000365,0.000241,0.000153,0.001077,0.000809,0.000304,0.000186,0.000521,0.001054,0.000708,0.000368,-8.2e-05,0.001044,0.000649,-0.000178,-0.00018,0.000239,-6.7e-05,0.000464,0.000143,0.000281,0.000434,0.000226,0.000553,0.000866,0.000379,0.000484,0.00023,0.000315,0.000105,0.000961,0.001126,0.001031,0.000579,0.000545,0.000318,0.000349,0.000743,0.000607,0.000474,1.7e-05,-2e-06,0.000374,-0.000206,0.000419,8.4e-05,0.000126,0.000362,0.000106,0.000609,0.001311,0.000334,-0.000102
-0.000415,0.000107,-3e-06,-0.000531,-0.000479,-1.8e-05,-0.00053,-0.000359,0.000404,0.000301,0.000703,0.000333,1e-06,-1.1e-05,8.3e-05,-0.000678,-0.000319,-0.000393,0.000145,-0.00015,0.000121,-0.000766,-0.000258,7.4e-05,0.000118,0.000194,-0.001294,-0.000583,3e-06,-0.000579,-0.000481,-0.00017,-0.000235,-0.000221,0.000323,0.000132,0.00017,0.000211,0.000101,0.000138,-0.000131,-5.3e-05,-0.000595,-0.00014,-2.2e-05,-0.000769,-0.000622,-0.000255,8.4e-05,-0.000316,-0.000176,-0.000732,-0.00078,-0.000477,-0.000775,-0.000415,7e-06,-0.000166,-0.000794,-0.000103,-0.000194,-0.000469,-0.000802,-0.000162,0.000149,-0.001385,-0.001423,-0.000468,-0.000124,-0.000365,-0.00037,-0.000205,-0.000509,-0.000567,-0.000306,-0.000113,-0.000535,-0.000438,-0.000291,0.000203,-0.000534,-0.000613,-7.2e-05,0.00027,0.000205,0.000264,-0.000604,-0.000689,-0.000554,-0.000592,0.000144,-0.000763,-0.000898,-0.000145,-0.000416,-6.6e-05,3.2e-05,0.000386,-0.000728,-0.000669,-0.000578,-0.000408,-0.000414,-0.000409,-0.000362,-0.00053,-0.000697,-0.000465,0.000187,8.1e-05,-0.000296,-7.3e-05,-0.000286,0.000123,-0.000213,-0.000295,-0.000151,0.000309,-0.000601,-7.8e-05,9.2e-05
-8.6e-05,-0.000498,-0.000459,0.000291,0.000346,-4.6e-05,-0.00055,-0.000132,-0.000979,-0.000635,-0.000973,-0.000351,-0.000193,-7.9e-05,0.000296,0.000397,-0.000321,0.000245,8.9e-05,1.8e-05,-0.000189,0.000435,5.2e-05,-9.4e-05,-6e-05,-0.000339,0.000625,0.000555,-0.000546,-3.1e-05,-0.000102,0.000251,0.000531,0.000686,0.000138,-0.000135,-0.000368,-0.000433,-0.00055,-0.000325,-0.000154,-0.000275,0.000131,2.9e-05,7e-05,0.000377,0.000433,0.00012,3.5e-05,0.000283,0.000165,-0.000116,-0.000124,-0.000305,7.9e-05,-0.000182,-2.4e-05,-0.000192,0.000491,0.000303,0.00019,5.6e-05,0.000339,-0.000207,-0.00054,0.000275,0.000493,-0.000177,-0.0011,-0.000158,0.000331,0.00026,5.4e-05,0.000534,0.000475,-0.000627,7.8e-05,3.8e-05,-0.000269,-0.000532,-1.3e-05,0.000553,0.000645,-0.000311,-0.000518,-0.000214,0.000316,0.000119,-7e-05,-0.000138,-0.000702,0.000164,0.000749,0.000382,0.000263,-0.000132,-0.000545,-0.000341,0.000431,0.000346,0.000129,2e-05,0.000133,0.000236,-2e-05,2.3e-05,-0.000103,-0.00037,-0.000676,-5.5e-05,0.00016,2.4e-05,-9.9e-05,-5.9e-05,-4.5e-05,-5e-06,-4.4e-05,-0.000156,0.000197,-0.000118,-0.00016
-0.000105,0.00037,0.000295,-8.5e-05,-0.000273,-0.00019,0.000478,-5.1e-05,0.000656,0.000549,0.000481,0.000408,-0.000172,-0.000347,-0.000411,7.2e-05,0.000489,9.9e-05,-0.000165,0.000283,0.000215,-5.2e-05,0.000335,0.000174,0.000235,0.000299,-0.000435,-0.000779,0.000463,0.000424,0.000181,-0.00036,-0.000246,-0.00035,-0.000303,0.000204,0.000297,0.000383,0.000417,2.4e-05,0.000454,0.000292,9.4e-05,-1.5e-05,-0.000104,-0.000144,5.9e-05,0.000109,-0.000129,-1e-05,0.000336,0.000373,0.000579,0.000403,0.000559,0.000365,-3e-05,-5.9e-05,3.1e-05,0.000239,-1.4e-05,-0.000205,-0.000195,0.000319,0.000541,-0.000258,0.000114,0.000176,0.000724,0.000424,-0.000127,-8e-06,-5.3e-05,-0.00042,-0.000355,0.000336,-0.000293,-0.000612,0.000233,0.000124,0.000223,8.1e-05,-0.000672,0.00018,0.000395,-1e-04,9.7e-05,0.000156,-7.5e-05,0.000209,0.000206,0.000142,0.000107,-0.000215,-0.000401,0.00022,0.000358,0.000244,-6e-06,-0.000408,-0.000105,-0.000332,0.000127,-0.000241,-0.000128,6.2e-05,0.000226,0.000168,0.000685,6.3e-05,-0.000136,2.9e-05,-0.000273,0.000145,4e-05,0.000336,-0.000152,0.000422,-5.6e-05,0.000102,0.000371
2.4e-05,5.4e-05,-0.000304,3.3e-05,-5.7e-05,0.000198,-0.000402,0.000221,-3.3e-05,-6.8e-05,-0.000308,-0.000297,-0.000146,0.000135,1.4e-05,0.000112,-0.000168,-0.000108,7.7e-05,-0.000454,-0.000366,5.4e-05,-0.00048,-0.000386,-0.000179,-0.000287,0.000134,0.000558,3.3e-05,-4.3e-05,0.000271,0.000235,0.000374,0.000321,0.000193,-1e-04,-3.5e-05,-0.000501,-0.000313,1.3e-05,-0.000216,-0.000156,-7.1e-05,0.000233,0.000251,0.000128,-0.000575,-0.000302,9.6e-05,4.7e-05,-0.000314,-0.000113,-0.000282,-0.00023,-0.000151,0.000166,0.000295,1.7e-05,-0.000439,-0.000496,0.000299,-1.7e-05,-0.000115,-4.4e-05,1.9e-05,0.000625,-6.7e-05,-0.000372,-0.000394,2.6e-05,-0.000229,-0.000101,-4.2e-05,-7.6e-05,0.000429,6.3e-05,0.000403,0.000453,-5.1e-05,-0.00024,-0.00048,-0.000164,0.000501,-2.6e-05,-0.000176,-9.5e-05,-0.000141,0.000105,0.000437,0.000108,-0.000203,-0.000106,-0.000656,7.8e-05,0.000113,-9.1e-05,-0.00018,-2.8e-05,0.000248,0.000282,0.000101,0.000395,3.3e-05,0.000396,-9.9e-05,0.00012,-0.000197,0.000207,-0.000132,-0.00013,6e-06,-3.7e-05,0.000187,-0.000284,0.000114,-7.5e-05,0.00016,-0.000256,-0.000139,-0.000152,-0.000255
1e-05,0.000172,-0.000187,1.9e-05,0.000185,-5e-05,0.000274,-8.1e-05,-0.000381,-0.000306,0.000171,0.000161,-8.3e-05,0.000164,7e-05,-0.00016,0.000104,2.2e-05,0.000196,0.000191,0.000301,1e-06,7.1e-05,0.000301,0.000214,-0.000138,4e-06,-0.000159,-0.000221,9.8e-05,3.5e-05,-0.000229,-0.000299,-7.8e-05,5.6e-05,0.000103,2e-06,-1.7e-05,3.1e-05,0.000224,-9.3e-05,8e-06,0.000114,8.1e-05,-5.8e-05,-4e-05,0.000471,6.7e-05,-0.000116,1e-06,0.000324,-7.1e-05,0.000326,0.000248,0.000109,7.6e-05,-0.000257,-0.000115,0.00028,0.000125,4.9e-05,-0.000266,0.000348,0.000243,-0.000159,-0.000161,0.000189,0.000406,0.000566,8.3e-05,2.7e-05,0.000209,-5.8e-05,-1.8e-05,-4.7e-05,-5.1e-05,8e-06,0.000146,-8.6e-05,0.000363,0.000596,0.000249,-0.000129,-0.000256,0.00018,0.000131,0.000412,-0.000404,-0.000271,-6.2e-05,0.000208,0.000217,0.000289,0.000256,2.1e-05,0.00015,0.000196,-0.000161,-9.4e-05,-1.5e-05,-0.000337,0.000119,-3e-06,-0.000163,0.000235,5e-06,-6.1e-05,-9.6e-05,-0.000222,0.000158,0.000124,-3.9e-05,-0.000133,0.00018,-7.8e-05,1.8e-05,0.000152,0.000291,-0.000154,-7.4e-05,-6.5e-05
-3.3e-05,-0.000255,8.4e-05,0.000146,-4e-06,-9e-06,-0.000274,-0.000306,0.000279,0.000137,4.7e-05,-0.000195,7e-05,-7.6e-05,7e-05,-4e-06,-0.000222,-0.000198,-0.000261,-6.7e-05,0.000292,-5.8e-05,-6.9e-05,-0.000165,0.000103,0.000168,-0.000264,0.000273,-0.000146,-0.000244,-7.4e-05,0.000102,-3.4e-05,-0.00011,1.5e-05,-0.000264,-0.000137,-9.9e-05,-0.000122,-0.000115,8.5e-05,-8.2e-05,-1e-04,2.6e-05,-2e-05,0,-0.000149,2.7e-05,9.6e-05,2.8e-05,-0.000343,-0.000152,-0.000378,-0.000182,-9.6e-05,-5.4e-05,0.000301,2.7e-05,-1.6e-05,0.000104,-0.000113,0.000375,-0.000252,-2e-05,-3.4e-05,0.000116,-0.000257,-0.000481,-0.000433,-0.000266,-0.000276,-0.00032,-0.000174,-0.000313,-0.00027,-7e-05,-0.000178,1.9e-05,7.2e-05,-0.000159,-0.000516,0.000119,0.000167,0.000126,-8.5e-05,-0.00024,-0.000213,0.000357,0.000186,-9.3e-05,5.7e-05,1e-05,-0.000262,-0.000323,-0.000274,-0.000443,-0.000168,7.1e-05,0.000114,-7.7e-05,7.7e-05,-7e-05,-0.000112,5e-05,-0.000111,-2.3e-05,-3.2e-05,-0.000165,4.2e-05,-0.000182,-0.000167,6.7e-05,0.000211,-6.9e-05,-0.00015,-0.000183,-0.000206,-9.9e-05,8.3e-05,-1.6e-05,4.4e-05
1.5e-05,6.4e-05,1.1e-05,-0.000128,6.9e-05,-3e-05,0.000147,-1.8e-05,-0.00026,-0.000238,-3.7e-05,1e-04,-0.000369,8e-05,-0.000206,7.4e-05,0.000192,0.000148,0.000179,-4.8e-05,-0.00028,-0.000133,0.000155,6.7e-05,-0.000298,-4.6e-05,0.000236,-0.000165,0.000116,7.9e-05,-2e-05,-0.000152,8.5e-05,-0.000117,-0.00015,4.1e-05,0.00014,0.000116,9.1e-05,-1.1e-05,5e-05,-7.1e-05,-6e-06,-0.000368,-7.6e-05,-0.00032,0.000218,0.000117,1.1e-05,-6.2e-05,0.000167,4.2e-05,-5e-05,-0.000284,-1.4e-05,-0.00032,-0.00017,7.7e-05,7.1e-05,-0.000152,-0.000355,0.000102,1.9e-05,-0.000153,-5.3e-05,-0.000146,1.9e-05,0.000434,0.000209,-8e-06,0.000362,0.00021,4.9e-05,0.000375,0.000141,0.000152,0.000292,-0.000127,-0.000133,-4.6e-05,6.6e-05,-0.000139,-0.000104,0.000185,-3.2e-05,2.1e-05,6.1e-05,3.1e-05,-0.000101,-3.5e-05,1.6e-05,0.000134,0.000286,0.000124,7e-05,0.000159,9.5e-05,0.000154,-8.8e-05,-0.000166,-0.000296,5.2e-05,8.4e-05,-8.8e-05,-3.3e-05,-1.1e-05,6.4e-05,4.6e-05,-0.000126,-0.000165,-3.5e-05,-1.6e-05,-0.000187,-8.5e-05,-5.4e-05,-4.7e-05,-3e-06,-0.000102,-0.000159,-0.000198,-0.000158
9.4e-05,-7.8e-05,-4.1e-05,0.000251,-2.7e-05,-9.1e-05,-4.2e-05,2e-06,0.000223,1.6e-05,-9.3e-05,8.7e-05,0.000213,0.000205,0.000436,-5.5e-05,-7.3e-05,5.6e-05,-0.000148,-0.000113,0.000107,0.000208,-0.000134,-4.8e-05,-3.7e-05,-0.000105,-4.5e-05,4e-05,-0.000166,1.2e-05,3.5e-05,6.3e-05,-1.5e-05,-5.3e-05,0.000246,9.9e-05,4.3e-05,-2.7e-05,0.000117,-2.1e-05,0.000128,0.000185,7.3e-05,4.7e-05,8.2e-05,0.000266,-5.9e-05,-0.000155,-0.000103,5.3e-05,-9e-05,3.8e-05,4.4e-05,0.000184,5.9e-05,0.000163,0.000127,-0.000152,0.000101,9.5e-05,0.000226,-0.000155,8e-06,2e-05,2.7e-05,0.000297,0.000158,-0.000529,-6.3e-05,2.9e-05,-0.000256,-0.000148,-3.2e-05,-0.000214,0,-4.4e-05,-0.00037,9.7e-05,-0.000148,2e-05,7.5e-05,-2.9e-05,-5.8e-05,-0.00019,-0.000112,0.000119,3e-06,7.1e-05,3.6e-05,-0.000205,-5.2e-05,7.4e-05,-0.000103,0.000128,1.5e-05,-0.000111,-9.5e-05,-0.000116,6.6e-05,0.000101,0.00013,-0.000139,-6.3e-05,5.9e-05,-7.4e-05,-2.3e-05,7.7e-05,-9e-05,0.000163,0.000235,9e-06,9.6e-05,5.5e-05,0.000148,-2.8e-05,1e-06,5e-05,-6e-06,0.000124,5e-06,3.4e-05
-7.6e-05,1.4e-05,-7.5e-05,-0.000224,3e-05,0.000123,8.5e-05,6.8e-05,-0.000201,0.000137,-1.1e-05,-0.000154,-0.000152,-5.7e-05,-0.000279,-7.3e-05,0.000107,7.7e-05,0.000178,0.000144,-0.000111,-9.8e-05,9.7e-05,-8.3e-05,0.00011,5.3e-05,-1.7e-05,3.5e-05,0.000247,-2.7e-05,2.9e-05,4.2e-05,-0.000117,-9.9e-05,0,-1.3e-05,-0.000135,-4e-06,-3.4e-05,-2e-06,2.6e-05,-3.9e-05,-0.000121,7.4e-05,-4.4e-05,-3.5e-05,5.6e-05,0.000103,7.1e-05,-3.6e-05,1e-06,-0.000156,-8.2e-05,-0.000119,-3.1e-05,-3.3e-05,1.9e-05,-4.7e-05,8e-06,-2.8e-05,0.000118,6e-05,7.7e-05,-5e-06,2.8e-05,-8e-06,-0.000225,0.000339,-0.00016,-5.7e-05,0,-3.2e-05,-0.000146,9.3e-05,-0.000195,0.000163,7.5e-05,-3.1e-05,0.000316,0.000103,-0.000104,-0.000104,0.000219,2e-05,2e-06,-0.000178,-0.000138,-6.3e-05,3.8e-05,0.000258,-0.000136,-7.9e-05,-7.1e-05,-0.000149,3.7e-05,0.000126,2.1e-05,0.000182,-2.4e-05,-8.3e-05,-4e-06,3.2e-05,0.000112,7.1e-05,3.1e-05,5e-06,-7.9e-05,0.000101,-0.000119,-5.2e-05,4.1e-05,5.8e-05,4.1e-05,-1.7e-05,-1.6e-05,8.4e-05,5.4e-05,-0.000123,-0.000161,-0.000124,-5.6e-05
0,-9e-06,-1.7e-05,-6e-06,-5.2e-05,-9.1e-05,-0.000159,-3.9e-05,0.000105,-0.000168,0,9.4e-05,0.000155,6.5e-05,1e-04,4.3e-05,-8e-05,-6.9e-05,-6.4e-05,-6.6e-05,0.000122,-2.4e-05,-0.000107,0.000112,-0.000124,-7.9e-05,7e-05,-2.1e-05,-0.000113,-7.7e-05,0.000128,-0.000119,-2.1e-05,0.00011,4.5e-05,-0.000125,8.4e-05,-0.000116,4.3e-05,-3.8e-05,-4e-06,-0.000133,6.7e-05,1e-06,1.6e-05,-0.000107,-8.9e-05,5.5e-05,-3e-06,1.2e-05,-2.3e-05,0.000152,2e-06,0.000161,-2.9e-05,5.2e-05,1.9e-05,5.4e-05,-1.9e-05,-1.1e-05,-0.000222,6e-05,-0.000146,-4.2e-05,-0.000171,-7e-05,8.1e-05,-3.1e-05,0.000121,5.5e-05,-0.000171,3e-06,-1.1e-05,3e-06,2.8e-05,-0.000156,3.2e-05,0.000105,9e-06,-0.000115,1e-04,0.000136,-0.000212,-8.5e-05,2e-05,6e-05,5.3e-05,0.000187,-7.4e-05,-0.000136,5.7e-05,3e-06,-9.7e-05,-2.7e-05,-5.3e-05,-0.000113,4.4e-05,-0.000184,-4.6e-05,1.2e-05,-4e-05,-3.2e-05,-3.5e-05,-5.9e-05,2.3e-05,3.8e-05,6.1e-05,-0.000114,0.000109,3.1e-05,5.4e-05,-7.3e-05,-1.3e-05,-9.4e-05,-0.000113,-9.6e-05,2.7e-05,0.000175,5.9e-05,8.7e-05,-2.4e-05
8.8e-05,4e-06,1.7e-05,-2.3e-05,3.2e-05,6.6e-05,9.7e-05,-9e-06,-0.000187,0.000116,4e-06,-3.9e-05,-2.4e-05,2.4e-05,-8.5e-05,5e-05,3.6e-05,-4.1e-05,2.7e-05,-1.5e-05,-1.3e-05,-1.1e-05,7.5e-05,-2.1e-05,1.9e-05,-2.3e-05,-5.4e-05,7.4e-05,5e-05,8.5e-05,-0.000166,0.000103,9.3e-05,-5.8e-05,-5e-06,1.8e-05,-7.5e-05,4e-06,-6e-06,-7e-06,-3.8e-05,5.5e-05,-8.1e-05,-2.1e-05,-3.3e-05,5.5e-05,4.2e-05,-8.3e-05,-2e-06,2.3e-05,-9.8e-05,-0.000117,3.9e-05,-0.000164,2.8e-05,-2e-05,0.00011,3.9e-05,4.9e-05,-3.4e-05,0.000123,-8.1e-05,-8e-06,4.2e-05,0.000101,8.4e-05,-8.6e-05,-4.6e-05,-0.000148,-2.7e-05,-3.3e-05,-5.3e-05,9e-05,-2.2e-05,-5.8e-05,-4.5e-05,-7e-06,5.6e-05,-7.9e-05,7.5e-05,-7.3e-05,-0.000198,0.000131,8.6e-05,5.2e-05,0,-2.8e-05,-0.000171,-6.5e-05,2.8e-05,2e-05,-4.9e-05,-3.2e-05,-8.4e-05,-5e-05,2e-05,1.1e-05,4.9e-05,3.5e-05,1.1e-05,1.3e-05,-8.1e-05,2.9e-05,-6e-06,5.5e-05,-4.8e-05,-4.3e-05,-8e-05,-0.000142,-9.3e-05,-9.4e-05,1.6e-05,5e-06,3e-06,0.00011,2e-05,-4.7e-05,-9e-06,1.4e-05,-3.2e-05,2.3e-05
-0.000188,1.7e-05,1.1e-05,-8.1e-05,-5.4e-05,6e-06,-1.2e-05,-1.4e-05,0.00015,-8e-05,-8e-06,-1.5e-05,-4.2e-05,2e-05,-3.8e-05,-5.5e-05,-1e-06,-5.6e-05,-6.5e-05,1.4e-05,-4.5e-05,-3e-05,-5.4e-05,-3.5e-05,-3.9e-05,-3.2e-05,3.7e-05,-0.000145,-0.000116,-7.4e-05,8e-05,-1e-04,-5.7e-05,-2.6e-05,-7.9e-05,2.6e-05,-2.8e-05,3.1e-05,2.4e-05,-1.8e-05,-1.4e-05,5e-06,2.3e-05,-2.7e-05,2.7e-05,-2.8e-05,-1e-05,-1.8e-05,1.4e-05,-4e-06,0.000109,5.7e-05,0,6e-06,-1e-04,5e-06,-9.7e-05,-1e-04,-6.8e-05,-6e-06,-4.9e-05,0.000122,1.2e-05,6.3e-05,-0.000142,-7.8e-05,-8e-06,1.7e-05,3.8e-05,3.9e-05,0.000115,3.6e-05,-6.8e-05,9.9e-05,5e-05,0.000129,-2.5e-05,-9.1e-05,6.3e-05,-0.000117,7e-06,0.000163,-6.2e-05,-7.8e-05,-3.4e-05,-4.1e-05,2.3e-05,5.7e-05,3.3e-05,-3.5e-05,9.4e-05,-2.7e-05,4.8e-05,0.000108,-1e-06,0.000106,-1.6e-05,-6.7e-05,2.3e-05,-2.8e-05,-2.2e-05,-9.9e-05,6e-06,0,-6e-06,-3e-06,5.6e-05,0.00013,6.8e-05,1.1e-05,4.3e-05,1e-06,-3.9e-05,3e-05,-2.6e-05,3.1e-05,-7e-06,2.2e-05,-3.1e-05,5e-05,-2.6e-05
5e-05,5.7e-05,1e-06,5.9e-05,-8e-06,-2.6e-05,4e-06,4.1e-05,-2.3e-05,3.8e-05,-4e-06,3.1e-05,4.8e-05,1.8e-05,1e-05,4.6e-05,-2e-06,1.8e-05,-5e-06,-1e-05,-2.8e-05,1.4e-05,7e-05,3.4e-05,5.3e-05,1.3e-05,3e-05,2.1e-05,7.8e-05,2.7e-05,-5e-05,5.6e-05,4e-06,5e-05,2e-06,-8e-06,5.8e-05,-2.4e-05,-2e-05,-4e-05,-9e-06,7e-06,-4e-06,3.8e-05,-5e-06,-3.5e-05,5e-05,-3.1e-05,1e-05,-4e-06,-4.5e-05,-4.1e-05,1.6e-05,-5.3e-05,7.4e-05,2.9e-05,-4e-05,0.000112,3.1e-05,-2.6e-05,0.000128,8.2e-05,3.6e-05,3.2e-05,0.000179,5.6e-05,-1.2e-05,-7e-05,-5.2e-05,-1.1e-05,2.6e-05,-3.4e-05,1.2e-05,-4.7e-05,8e-06,-2.7e-05,-1.9e-05,7.4e-05,1.5e-05,1.1e-05,2.2e-05,-0.000117,7e-06,3.2e-05,-1.6e-05,5.2e-05,-3.2e-05,-6e-06,3.9e-05,2.4e-05,2e-06,2.7e-05,-1.8e-05,-3.3e-05,-6e-06,-8.1e-05,3e-06,3.6e-05,-1.7e-05,8e-06,-1.9e-05,8.2e-05,-2.2e-05,3e-06,2.4e-05,3e-06,1.9e-05,-3.3e-05,-8e-05,2.5e-05,-4.3e-05,-2.7e-05,-1e-06,-1.6e-05,2.6e-05,-1.6e-05,3.7e-05,-2.5e-05,3.3e-05,-2.2e-05,2.1e-05
1.6e-05,-5.3e-05,-7e-06,-4e-05,-1.6e-05,9e-06,1.3e-05,-3.8e-05,-9e-06,-2.3e-05,4e-06,-5e-06,-4.3e-05,-3.9e-05,-4.1e-05,2.2e-05,-6.1e-05,3e-06,4.3e-05,-1e-06,-1.1e-05,-4.2e-05,-4e-05,-4.3e-05,2e-05,3.1e-05,-4.2e-05,-1.6e-05,-9.1e-05,6e-06,9e-06,-5e-05,3.4e-05,-4e-06,-1.4e-05,-5.6e-05,-1.3e-05,-3e-06,4.8e-05,6.8e-05,6e-06,2.4e-05,3e-06,1.3e-05,1.3e-05,3.3e-05,-0.000118,-3.8e-05,-2.4e-05,5e-06,1.1e-05,4.8e-05,-2e-06,6.1e-05,-2.8e-05,-1.2e-05,-1.6e-05,-3.8e-05,2.7e-05,8e-06,-8.2e-05,-4.2e-05,-8e-06,-2.7e-05,-3.9e-05,-6.1e-05,2.6e-05,-3.3e-05,2.4e-05,-2.1e-05,-3.2e-05,1.7e-05,-2.1e-05,4.7e-05,1e-06,-6.4e-05,2.2e-05,-6e-06,-3.5e-05,2.6e-05,-4e-05,3e-06,7.4e-05,3.4e-05,1.8e-05,-3.5e-05,1.4e-05,7.5e-05,-4.2e-05,3e-06,6e-06,-4e-06,6.1e-05,8e-06,3.1e-05,-1e-06,1.3e-05,-2e-06,2.4e-05,2.4e-05,3.6e-05,-5.1e-05,-3.2e-05,-6e-06,-2.4e-05,9e-06,9e-06,-2.3e-05,3.7e-05,1.6e-05,6e-06,-2.4e-05,-6e-06,1.8e-05,1.1e-05,-7e-06,-4.7e-05,-3e-06,-2.8e-05,-8e-06,-3.5e-05
-5.9e-05,1.6e-05,-2.5e-05,-2e-05,-7e-06,-2.7e-05,2.1e-05,-1.7e-05,1.3e-05,-1.5e-05,-5e-06,-2.1e-05,5.1e-05,-3.1e-05,2.1e-05,-7e-05,5.8e-05,0,-7e-06,1.5e-05,2.5e-05,1.4e-05,-3.3e-05,3.3e-05,-4.3e-05,-3.5e-05,5.3e-05,5e-06,1.6e-05,8e-06,-6.6e-05,-1e-05,-2.4e-05,1.3e-05,-2.2e-05,-2e-06,-2.6e-05,2.4e-05,-6e-06,3e-06,3.1e-05,-1e-06,-1.6e-05,-2.4e-05,-1.5e-05,-1.7e-05,8e-06,7e-06,2.7e-05,-1.5e-05,6e-06,-3.5e-05,0,-4e-05,-4e-06,-3.2e-05,1.6e-05,2e-05,-8e-06,-4e-06,-1e-05,-3.1e-05,-6e-06,2.9e-05,-1.6e-05,-1.1e-05,-5.2e-05,0.000109,1.2e-05,-1.6e-05,2.3e-05,-5.4e-05,3e-05,2.1e-05,3e-05,2.9e-05,6.2e-05,-3.3e-05,-1e-06,-6e-06,-4e-06,3e-05,-0.00012,-5.1e-05,-3e-06,6e-06,-2e-06,-3.9e-05,-1.4e-05,-2e-05,-4e-06,0,-3e-05,-1.9e-05,-1e-06,-1.3e-05,0,-2e-05,1.5e-05,-3.3e-05,-2.2e-05,1.7e-05,1e-05,-1.9e-05,3.2e-05,-2.3e-05,3e-05,4.2e-05,-3.2e-05,-3.4e-05,1e-06,4e-06,1e-05,-1.9e-05,1.3e-05,3e-06,2.8e-05,-2.3e-05,-2.3e-05,7e-06,3.5e-05
3.9e-05,3e-06,4e-06,1.1e-05,2.2e-05,0,-3.3e-05,2e-05,-5e-06,-6e-06,8e-06,1.6e-05,-4.5e-05,-2e-06,-2.9e-05,2.5e-05,-2.1e-05,9e-06,-8e-06,-1.3e-05,-1e-06,1.3e-05,2.5e-05,-2.2e-05,2.2e-05,2.1e-05,8e-06,4e-06,2.6e-05,2e-06,2.4e-05,1.2e-05,4e-06,-1.4e-05,1.9e-05,3e-06,0,-5.7e-05,2e-05,-4.2e-05,-2e-06,1.6e-05,1.1e-05,-1.9e-05,7e-06,-6e-06,-2.1e-05,1.6e-05,-1.2e-05,6e-06,1e-06,1.5e-05,-1.3e-05,3.8e-05,1.1e-05,-9e-06,3.4e-05,7e-06,-1.1e-05,1e-05,7e-06,1.4e-05,-4e-06,-2.5e-05,3.5e-05,-4.2e-05,6e-05,-5.4e-05,-1.2e-05,-2e-06,-6.6e-05,-1.5e-05,1e-06,-1.5e-05,-3e-06,3.2e-05,-3.9e-05,-2.1e-05,2.9e-05,-2e-05,1e-05,9e-06,1e-04,0,2e-06,1.7e-05,5e-06,2.7e-05,4.2e-05,-1.4e-05,2.6e-05,-1.2e-05,-1.5e-05,2e-05,-1.7e-05,1.5e-05,-1.6e-05,3e-06,-3.3e-05,0,2.3e-05,-9e-06,-7e-06,1.2e-05,5e-06,9e-06,-4e-06,-3e-06,1.8e-05,9e-06,2.3e-05,-3e-06,-3e-06,2e-05,-1.2e-05,-2e-06,-1.2e-05,2.5e-05,1e-05,-2.3e-05,-1.7e-05
-4.1e-05,-1.1e-05,-4e-06,2.5e-05,-2.1e-05,1.5e-05,2.8e-05,7e-06,1.7e-05,1.1e-05,1.1e-05,-8e-06,6e-06,-1.6e-05,2.1e-05,-9e-06,-5e-06,-5e-06,1.1e-05,-1.2e-05,-1.1e-05,4e-06,-2.3e-05,1.9e-05,-6e-06,-2.5e-05,-1.1e-05,-2.1e-05,-1.7e-05,0,-2.4e-05,-1e-05,3e-06,-2e-05,-1.7e-05,-6e-06,8e-06,8e-06,-2e-05,4.1e-05,-6e-06,-1.4e-05,-8e-06,-5e-06,-4e-06,2.6e-05,2e-05,-8e-06,-2e-06,9e-06,-2.2e-05,3e-06,0,-6e-06,-2e-06,2.7e-05,-4.1e-05,-1.9e-05,-1.7e-05,-2.2e-05,1.2e-05,1e-05,1.7e-05,-1.1e-05,-2.9e-05,2.7e-05,-3.1e-05,2e-05,-3e-06,-2e-05,1.7e-05,1.6e-05,-4.6e-05,1.6e-05,-1e-06,-8e-06,7e-06,-4e-06,0,2e-05,-1.4e-05,-3.2e-05,-6.7e-05,1.7e-05,-3e-06,-2.8e-05,2e-06,8e-06,-2e-05,1.2e-05,2e-05,-1.2e-05,1.6e-05,-1.5e-05,-3e-06,-1.3e-05,1.2e-05,-1.4e-05,3e-06,1.3e-05,-1.8e-05,-2e-06,1e-06,3.1e-05,-4e-06,4e-06,1.7e-05,6e-06,-7e-06,2.4e-05,-1.3e-05,-1.6e-05,-1.2e-05,-3e-05,-2e-05,-5e-06,1e-06,-1.7e-05,1e-05,7e-06,-1e-05
8e-06,-1.1e-05,1.6e-05,-2e-05,1.1e-05,-1.9e-05,-6e-06,-5e-06,-5.8e-05,-4e-06,-2e-05,0,0,-1.1e-05,-4.4e-05,-7e-06,-8e-06,-2.5e-05,-3e-06,3e-06,-1.8e-05,-1.3e-05,3.4e-05,-3e-05,4e-06,3e-06,1.7e-05,2.1e-05,-3e-06,-6e-06,2.5e-05,2.5e-05,6e-06,-5e-06,8e-06,-1.2e-05,6e-06,1.2e-05,1.1e-05,-1.1e-05,-8e-06,-3e-06,-2e-06,1.6e-05,-9e-06,-1.3e-05,-2e-06,-2.2e-05,6e-06,-1.1e-05,2.5e-05,2e-06,-1.4e-05,9e-06,1.2e-05,-2.2e-05,1.7e-05,-1.4e-05,-8e-06,2.4e-05,-6e-06,1.4e-05,-1e-05,-1.1e-05,-2e-06,-2.7e-05,7e-06,9e-06,-4e-06,1e-05,3e-06,1.9e-05,3.7e-05,7e-06,-6e-06,-2e-05,-3e-06,-9e-06,-2.2e-05,-4e-06,1.3e-05,5e-05,1.5e-05,3e-06,-4e-06,6e-06,-3e-06,-2.5e-05,1e-06,-1.2e-05,-1e-05,1.1e-05,-1.8e-05,-3e-06,0,1.8e-05,-9e-06,1e-06,2e-06,-7e-06,1.5e-05,3.9e-05,-6e-06,-3.8e-05,6e-06,-3e-06,-6e-06,-1.7e-05,0,-2.3e-05,-7e-06,-3e-06,6e-06,7e-06,5e-06,4e-06,6e-06,-1.3e-05,-8e-06,-1e-05,6e-06
4e-06,3e-06,-1.1e-05,4.1e-05,-3e-06,2.1e-05,0,-6e-06,5.8e-05,3e-06,2e-06,1.4e-05,2.2e-05,-1.1e-05,4.4e-05,-4e-06,2.7e-05,4e-06,3e-06,1e-06,1.6e-05,2e-06,-1.9e-05,2.4e-05,-1.2e-05,1.7e-05,9e-06,1.1e-05,7e-06,-6e-06,-2.8e-05,-2.5e-05,-4e-06,-1.6e-05,-9e-06,5e-06,-1.2e-05,-7e-06,-1e-05,1e-06,-1.2e-05,-1e-06,2e-06,-4e-06,3e-06,-8e-06,2.1e-05,1e-05,-1.6e-05,4e-06,-3.3e-05,-1.6e-05,7e-06,-8e-06,-5e-06,1.7e-05,-2.3e-05,3.1e-05,1.5e-05,-1.8e-05,-3e-05,-8e-06,1e-06,-5e-06,-6e-06,1e-06,1.3e-05,-2.4e-05,2.1e-05,9e-06,9e-06,5e-06,-1.9e-05,-4e-06,-4e-06,7e-06,-3e-06,1.5e-05,4.5e-05,6e-06,-1.5e-05,-4.3e-05,1.7e-05,-1e-06,-1e-06,7e-06,1e-06,-6e-06,-6e-06,1.1e-05,-6e-06,2e-06,1.8e-05,3e-06,-5e-06,-1.9e-05,1e-05,4e-06,-6e-06,-1e-06,-1.6e-05,-1.1e-05,9e-06,1.8e-05,1.1e-05,-2e-06,1.2e-05,-3e-06,-5e-06,4e-06,-6e-06,-5e-06,0,0,-8e-06,-2e-06,-5e-06,1.8e-05,1e-05,1e-06,-1.9e-05
-1.9e-05,5e-06,-3e-06,-2e-05,1.1e-05,-1.1e-05,5e-06,1e-06,-3.8e-05,-3e-06,5e-06,-1.2e-05,-1.5e-05,-1.5e-05,-3e-05,1.5e-05,-2e-05,4e-06,-1.8e-05,-7e-06,1.2e-05,1e-06,3e-05,-1.6e-05,-1e-06,0,5e-06,3e-06,-7e-06,-8e-06,3.5e-05,2e-05,0,1.1e-05,2e-06,1.3e-05,8e-06,-6e-06,1.2e-05,-2e-06,-5e-06,1.8e-05,2e-06,-9e-06,-5e-06,1.6e-05,-2.7e-05,-6e-06,1.6e-05,4e-06,3.2e-05,6e-06,-1e-06,-2e-05,7e-06,-1e-06,1.7e-05,-9e-06,-8e-06,1.6e-05,1.8e-05,-3e-06,1e-06,-2e-06,-2e-06,1.9e-05,-1e-05,2.4e-05,-3.8e-05,7e-06,-9e-06,-5e-06,-5e-06,1.3e-05,-6e-06,1.8e-05,3e-06,-2.7e-05,-1.7e-05,-1.3e-05,-2e-06,1e-05,-4.1e-05,-3e-06,7e-06,-1.9e-05,-1e-06,-2e-06,1.5e-05,-1.7e-05,-5e-06,-2e-06,3e-06,1.2e-05,7e-06,3.7e-05,-1.3e-05,-3e-06,-5e-06,5e-06,0,-1.7e-05,-2e-06,-7e-06,6e-06,1e-06,2e-06,2.9e-05,-4e-06,-1.5e-05,1.2e-05,1e-06,1e-06,9e-06,3e-06,0,-2e-05,3e-06,-1.3e-05,-1e-06,2e-05
1e-05,5e-06,-5e-06,8e-06,0,0,-2e-06,9e-06,3e-05,1e-06,-4e-06,3e-06,0,0,2.8e-05,1.1e-05,5e-06,1e-06,3e-06,4e-06,-3e-06,-2e-06,-4.6e-05,2e-05,-1.8e-05,-1.2e-05,-2e-06,-7e-06,-6e-06,5e-06,1e-06,-2.3e-05,0,-8e-06,-1e-06,-9e-06,7e-06,6e-06,-1.6e-05,-3e-06,9e-06,-7e-06,-9e-06,7e-06,5e-06,-7e-06,1.3e-05,-1e-05,-1.5e-05,-6e-06,-2.2e-05,0,3e-06,1.3e-05,4e-06,1.2e-05,-1e-05,-4e-06,-5e-06,-1.2e-05,7e-06,-1.7e-05,1e-06,1e-05,1.5e-05,-4e-06,-6e-06,-3e-05,3.2e-05,5e-06,-1.3e-05,-1e-05,-5e-06,-5e-06,2e-06,-1e-06,-8e-06,1e-06,-3e-05,7e-06,9e-06,2.3e-05,4.9e-05,3e-06,0,1.9e-05,-1e-06,8e-06,-1.5e-05,1.5e-05,2e-05,6e-06,-1.7e-05,-7e-06,-1.1e-05,-2.8e-05,9e-06,8e-06,1e-05,-4e-06,8e-06,7e-06,-4e-06,9e-06,1.1e-05,-3e-06,0,-1.6e-05,-1e-06,1.7e-05,-2.2e-05,2e-06,-4e-06,-2e-06,-9e-06,-1e-06,1.9e-05,1.4e-05,-5e-06,3e-06,-1.9e-05
5e-06,-7e-06,0,0,1e-05,5e-06,1e-06,-1.2e-05,-3.6e-05,-7e-06,4e-06,2e-06,-3e-06,-4e-06,-6e-06,-9e-06,-2e-06,1.5e-05,8e-06,-3e-06,-6e-06,3e-06,2.3e-05,-2.2e-05,6e-06,-4e-06,1.2e-05,8e-06,6e-06,2e-06,1e-06,1.5e-05,-1e-06,1.2e-05,7e-06,-9e-06,-1.4e-05,-1.9e-05,1.3e-05,2e-06,6e-06,-1e-06,4e-06,1e-06,3e-06,-8e-06,-3e-06,1.7e-05,1.6e-05,5e-06,9e-06,-4e-06,4e-06,-3e-06,-8e-06,-3e-06,-1e-06,7e-06,1e-05,1e-05,5e-06,-5e-06,0,8e-06,-1.9e-05,7e-06,7e-06,2.2e-05,-2.7e-05,-3e-06,0,9e-06,2e-06,6e-06,-9e-06,-1.8e-05,1e-06,7e-06,3.5e-05,0,-9e-06,-2.8e-05,-3.8e-05,-1.8e-05,-3e-06,-1e-05,-2e-06,-2.3e-05,9e-06,-8e-06,6e-06,0,0,-8e-06,1e-05,2.3e-05,-5e-06,-8e-06,-3e-06,3e-06,-8e-06,2e-06,-2e-06,2e-06,-1e-05,-1e-06,-3e-06,-1.4e-05,-8e-06,3e-06,1.4e-05,2e-06,-2e-06,0,7e-06,3e-06,-4e-06,-1e-05,1.3e-05,-3e-06,1.3e-05
-6e-06,6e-06,4e-06,-1.2e-05,-1.2e-05,-1.2e-05,9e-06,-2e-06,3.1e-05,-3e-06,-6e-06,-4e-06,1e-06,-2e-06,-7e-06,2e-06,9e-06,-8e-06,9e-06,3e-06,-8e-06,0,-1.4e-05,1.6e-05,1.3e-05,4e-06,2e-06,-3e-06,-4e-06,-2e-06,-4e-06,-1e-05,-6e-06,1.1e-05,5e-06,0,4e-06,3e-06,-1e-05,-6e-06,1e-06,8e-06,1e-06,7e-06,-1e-06,9e-06,2.3e-05,3e-06,-8e-06,-1e-06,-2e-06,-3e-06,0,6e-06,1e-05,-7e-06,1e-05,-5e-06,-1.1e-05,-1e-05,-1.2e-05,1.3e-05,-5e-06,-7e-06,6e-06,-5e-06,-1.8e-05,-4e-06,1.5e-05,-6e-06,1e-06,-5e-06,4e-06,0,1.4e-05,4e-06,2e-06,-1e-06,-1.1e-05,9e-06,-3e-06,1.3e-05,1.9e-05,9e-06,-2e-06,-3e-06,0,1.5e-05,-1.1e-05,1e-06,6e-06,-4e-06,-6e-06,1e-06,-5e-06,-3.2e-05,2e-06,4e-06,-3e-06,2e-06,9e-06,-4e-06,2e-06,-1.3e-05,2e-06,3e-06,0,1.9e-05,3e-06,-8e-06,3e-06,6e-06,1e-06,-8e-06,5e-06,-3e-06,-4e-06,-9e-06,-1.2e-05,1e-06,-1.3e-05
-6e-06,-2e-06,2e-06,4e-06,5e-06,8e-06,-5e-06,6e-06,-1.7e-05,0,-3e-06,2e-06,7e-06,6e-06,1.1e-05,1e-06,-7e-06,-3e-06,-4e-06,-4e-06,1e-05,2e-06,1.9e-05,-1.6e-05,-7e-06,4e-06,-5e-06,1.4e-05,1e-06,2e-06,7e-06,5e-06,-2e-06,-7e-06,4e-06,5e-06,6e-06,2e-06,0,9e-06,0,-3e-06,-7e-06,-8e-06,4e-06,-3e-06,-8e-06,-3e-06,2e-06,-1e-06,0,4e-06,-6e-06,-1.5e-05,-7e-06,-8e-06,-3e-06,5e-06,3e-06,9e-06,3e-06,-8e-06,-3e-06,1.4e-05,1e-06,1.4e-05,4e-06,-1e-06,-1.4e-05,-4e-06,2e-06,3e-06,-1.4e-05,1e-06,-4e-06,1.4e-05,-2e-06,1e-06,-1.3e-05,-7e-06,6e-06,-1e-05,-1e-06,1e-05,3e-06,6e-06,-2e-06,-2.6e-05,8e-06,-5e-06,-1e-05,3e-06,2e-06,6e-06,-2e-06,2e-05,-5e-06,-3e-06,1e-05,-5e-06,-7e-06,-1e-06,-2e-06,8e-06,1.1e-05,-2e-06,1e-06,-2e-06,-6e-06,0,-7e-06,2e-06,0,-3e-06,-5e-06,3e-06,7e-06,-3e-06,8e-06,-3e-06,8e-06
1.4e-05,0,-4e-06,-3e-06,-2e-06,-5e-06,-3e-06,2e-06,6e-06,-2e-06,5e-06,1e-06,-8e-06,1e-06,-1.4e-05,-5e-06,4e-06,-2e-06,-6e-06,0,5e-06,-4e-06,-1.2e-05,1.1e-05,0,-5e-06,1.1e-05,-1.4e-05,-2e-06,1e-06,2e-06,-1e-06,6e-06,7e-06,3e-06,-7e-06,-6e-06,-2e-06,-7e-06,-1.4e-05,-5e-06,6e-06,7e-06,-3e-06,-3e-06,-5e-06,8e-06,7e-06,1e-06,0,4e-06,0,3e-06,1.2e-05,0,4e-06,1.6e-05,1e-05,9e-06,-8e-06,1e-05,0,3e-06,-3e-06,1e-06,-8e-06,-1e-06,1.2e-05,8e-06,-1e-06,1.3e-05,0,6e-06,-4e-06,5e-06,-3e-06,9e-06,-6e-06,1.5e-05,0,-6e-06,4e-06,-1.5e-05,-6e-06,0,-9e-06,3e-06,2.1e-05,0,-1e-06,2e-06,-1e-06,9e-06,0,-3e-06,-1.8e-05,0,3e-06,-2e-06,-2e-06,1e-06,-1.4e-05,1e-06,4e-06,-4e-06,-2e-06,-3e-06,-5e-06,3e-06,2e-06,3e-06,0,2e-06,9e-06,6e-06,-3e-06,-8e-06,8e-06,0,-3e-06,-4e-06
-8e-06,-3e-06,-1e-06,-9e-06,1e-06,-2e-06,1e-05,-2e-06,1e-06,3e-06,-3e-06,-4e-06,3e-06,3e-06,1e-05,-5e-06,-3e-06,-1e-05,-5e-06,-1e-06,-1e-06,-2e-06,1.4e-05,-2e-06,6e-06,2e-06,-2e-06,-5e-06,1.1e-05,-2e-06,0,-5e-06,-6e-06,-1.1e-05,-3e-06,-1e-06,1e-06,-4e-06,5e-06,1e-05,-5e-06,-8e-06,-3e-06,2e-06,-1e-06,5e-06,-1e-05,-1e-06,-4e-06,1e-06,-5e-06,-1e-06,-3e-06,-8e-06,0,0,-1e-05,-2e-06,-1e-05,4e-06,-4e-06,-1.1e-05,1e-06,-1e-05,3e-06,5e-06,-1.1e-05,-1e-05,-2e-06,-2e-06,-1.2e-05,0,0,7e-06,2e-06,-1.4e-05,-5e-06,3e-06,0,1e-06,5e-06,-3e-06,2.6e-05,-8e-06,0,3e-06,-1e-06,-2.7e-05,-4e-06,1e-06,1e-06,1e-06,1e-06,-4e-06,0,1.3e-05,2e-06,1e-06,-4e-06,7e-06,-1e-06,1.1e-05,1e-06,-7e-06,6e-06,0,-1e-06,-5e-06,-6e-06,1e-06,-1e-06,-2e-06,-3e-06,-3e-06,-4e-06,-1e-06,4e-06,-1e-05,-1.1e-05,0,-9e-06
-9e-06,2e-06,-3e-06,1e-06,-3e-06,8e-06,-6e-06,-1e-06,-5e-06,-2e-06,2e-06,4e-06,0,6e-06,-9e-06,4e-06,6e-06,7e-06,4e-06,1e-06,-9e-06,0,-1.7e-05,-1e-06,5e-06,1e-06,2e-06,8e-06,-1.8e-05,1e-06,-2e-06,7e-06,1e-06,-7e-06,-1e-06,-1e-06,2e-06,2e-06,-5e-06,0,3e-06,1e-05,-4e-06,0,-1e-06,-6e-06,7e-06,-1.2e-05,6e-06,-2e-06,3e-06,3e-06,-5e-06,8e-06,-4e-06,-7e-06,1e-06,2e-06,2e-06,-6e-06,-5e-06,-4e-06,-2e-06,-5e-06,-4e-06,-3e-06,1e-05,-1.4e-05,-4e-06,4e-06,-3e-06,3e-06,0,-6e-06,-3e-06,6e-06,-1e-06,8e-06,-3e-06,3e-06,-3e-06,1.3e-05,-2.5e-05,5e-06,-1e-06,2e-06,1e-06,2.3e-05,-2e-06,-2e-06,6e-06,-2e-06,-3e-06,3e-06,-1e-06,-4e-06,-3e-06,-1e-06,2e-06,-4e-06,1e-06,2e-06,0,2e-06,-4e-06,1e-06,-3e-06,6e-06,3e-06,-6e-06,-5e-06,1e-06,0,5e-06,4e-06,-1e-06,4e-06,4e-06,1e-05,-1e-06,7e-06
1.6e-05,2e-06,2e-06,3e-06,0,-8e-06,1e-06,1e-06,1.1e-05,0,-3e-06,0,4e-06,3e-06,7e-06,5e-06,-4e-06,9e-06,2e-06,-3e-06,-1e-06,0,4e-06,3e-06,-3e-06,-1e-06,3e-06,-9e-06,1.1e-05,0,-1e-06,-7e-06,5e-06,-1e-06,-1e-06,4e-06,0,-1.1e-05,3e-06,-5e-06,3e-06,-4e-06,5e-06,0,-2e-06,0,-4e-06,-2e-06,-6e-06,3e-06,-1e-06,1e-06,1e-06,-1.1e-05,1e-06,1.3e-05,-5e-06,1e-06,7e-06,4e-06,-4e-06,4e-06,0,2e-06,4e-06,-1e-06,-4e-06,2.9e-05,4e-06,1e-06,-3e-06,-5e-06,-1e-05,1e-06,3e-06,1e-05,1e-06,1e-06,-6e-06,-2e-06,-2e-06,-1.5e-05,1.7e-05,1e-06,0,-6e-06,1e-06,-1.4e-05,6e-06,0,-1e-06,-1e-06,-3e-06,0,6e-06,1e-05,2e-06,1e-06,0,-4e-06,-2e-06,-7e-06,-1e-06,-3e-06,-1e-06,-1e-06,1e-06,1e-05,-5e-06,3e-06,-3e-06,0,1e-06,-5e-06,-2e-06,1e-06,-6e-06,2e-06,-3e-06,-1e-06,-4e-06
-1.3e-05,-1e-06,0,-1e-05,-6e-06,6e-06,2e-06,1e-06,-1.8e-05,0,-1e-06,-2e-06,-3e-06,6e-06,-1.2e-05,-3e-06,-2e-06,-2e-06,0,1e-06,6e-06,0,-1e-06,-5e-06,-8e-06,-3e-06,-7e-06,8e-06,-3e-06,-1e-06,8e-06,7e-06,2e-06,-6e-06,-1e-06,-7e-06,-3e-06,2e-06,-5e-06,6e-06,2e-06,2e-06,-3e-06,-3e-06,1e-06,4e-06,1.1e-05,2e-06,7e-06,-1e-06,0,-2e-06,2e-06,6e-06,-1e-06,-4e-06,1e-06,-5e-06,-8e-06,-5e-06,7e-06,1e-06,0,-3e-06,-2e-06,3e-06,-1e-06,-2.5e-05,-4e-06,3e-06,3e-06,2e-06,9e-06,3e-06,-5e-06,-7e-06,-2e-06,-2e-06,8e-06,0,5e-06,1.6e-05,-7e-06,-3e-06,0,4e-06,0,1.4e-05,0,-1e-06,-8e-06,2e-06,0,-1e-06,-7e-06,-1.1e-05,-3e-06,-2e-06,-2e-06,5e-06,2e-06,-1e-06,0,4e-06,8e-06,-1e-06,-3e-06,-1.2e-05,1e-06,-1e-06,2e-06,0,0,1e-06,-6e-06,-3e-06,2e-06,2e-06,-3e-06,-2e-06,0
5e-06,-2e-06,1e-06,1.4e-05,6e-06,-1e-06,-1e-06,-4e-06,1.7e-05,-3e-06,2e-06,3e-06,-1e-06,4e-06,9e-06,5e-06,2e-06,4e-06,-2e-06,-1e-06,2e-06,0,8e-06,4e-06,-1e-06,-1e-06,6e-06,-1.2e-05,0,0,-1.1e-05,-7e-06,-2e-06,6e-06,1e-06,-1e-06,2e-06,1e-06,3e-06,-3e-06,3e-06,-6e-06,-2e-06,2e-06,-1e-06,-5e-06,-1.1e-05,-4e-06,-8e-06,-2e-06,-1e-06,0,0,-2e-06,0,7e-06,5e-06,2e-06,5e-06,4e-06,-2e-06,-4e-06,0,2e-06,0,-5e-06,8e-06,1.5e-05,6e-06,-1e-06,2e-06,1e-06,-3e-06,-7e-06,-1e-06,-6e-06,2e-06,2e-06,-2e-06,-2e-06,-5e-06,-1.3e-05,-5e-06,2e-06,1e-06,-3e-06,0,-1e-05,-7e-06,0,-2e-06,-3e-06,0,-3e-06,2e-06,6e-06,4e-06,1e-06,2e-06,-3e-06,-1e-06,5e-06,-1e-06,5e-06,-4e-06,0,0,0,-4e-06,6e-06,5e-06,1e-06,0,-6e-06,7e-06,2e-06,4e-06,7e-06,6e-06,1e-06,0
-2e-06,2e-06,-3e-06,-7e-06,-4e-06,-4e-06,-2e-06,-1e-06,-1.6e-05,0,-2e-06,-2e-06,-1e-06,0,-1.2e-05,0,3e-06,-9e-06,3e-06,0,-2e-06,0,-7e-06,-2e-06,-1e-06,3e-06,-1e-06,1e-06,-4e-06,0,1e-06,4e-06,2e-06,3e-06,-1e-06,0,2e-06,-1e-06,-2e-06,2e-06,-2e-06,6e-06,5e-06,1e-06,2e-06,2e-06,-3e-06,0,6e-06,2e-06,3e-06,2e-06,1e-06,2e-06,0,-7e-06,-4e-06,4e-06,-1e-06,-3e-06,-1e-06,4e-06,1e-06,4e-06,-1e-06,2e-06,-4e-06,0,-9e-06,-1e-06,1e-06,-4e-06,-5e-06,7e-06,0,6e-06,-1e-06,2e-06,-1e-05,3e-06,1e-06,9e-06,1.2e-05,6e-06,-1e-06,-2e-06,0,8e-06,7e-06,1e-06,-2e-06,1e-06,4e-06,3e-06,-1e-06,-2e-06,-3e-06,-1e-06,0,0,0,2e-06,-1e-06,-1.2e-05,-3e-06,0,0,9e-06,1e-06,-5e-06,-4e-06,1e-06,-1e-06,6e-06,-6e-06,-2e-06,-5e-06,-6e-06,-7e-06,-1e-06,-6e-06
-4e-06,1e-06,-1e-06,4e-06,5e-06,5e-06,5e-06,2e-06,1.8e-05,-1e-06,0,0,1e-06,3e-06,8e-06,-3e-06,-6e-06,-6e-06,2e-06,-2e-06,-6e-06,-1e-06,3e-06,1e-06,-1e-06,1e-06,-5e-06,8e-06,6e-06,0,-8e-06,-2e-06,1e-06,4e-06,-1e-06,2e-06,-1e-06,-2e-06,-1e-06,-2e-06,-2e-06,-3e-06,-5e-06,0,1e-06,3e-06,-9e-06,2e-06,-4e-06,-1e-06,-5e-06,-2e-06,0,-2e-06,1e-06,0,2e-06,-1e-06,-4e-06,1e-06,-3e-06,-6e-06,-1e-06,-1e-06,1e-06,-2e-06,-2e-06,-1e-05,1e-05,-1e-06,-1e-06,-2e-06,5e-06,-6e-06,-1e-06,5e-06,0,3e-06,1.4e-05,-1e-06,1e-06,-7e-06,-1.4e-05,-6e-06,0,4e-06,-1e-06,0,-1e-06,-3e-06,5e-06,2e-06,0,1e-06,0,-4e-06,2e-06,1e-06,-3e-06,2e-06,-1e-06,1e-06,0,9e-06,3e-06,0,0,-3e-06,-3e-06,-1e-06,-1e-06,0,0,1e-06,1e-06,1e-06,4e-06,-3e-06,1e-06,0,7e-06
7e-06,0,1e-06,4e-06,-4e-06,-5e-06,-5e-06,2e-06,-1.6e-05,0,-1e-06,2e-06,1e-06,1e-06,-3e-06,0,1e-06,7e-06,-1e-06,3e-06,2e-06,0,-3e-06,0,-2e-06,-3e-06,5e-06,-4e-06,-6e-06,0,7e-06,1e-06,-3e-06,5e-06,-1e-06,-5e-06,-1e-06,0,0,3e-06,-2e-06,0,0,-1e-06,0,-2e-06,5e-06,-9e-06,3e-06,-1e-06,6e-06,-1e-06,0,1e-06,0,-2e-06,-5e-06,5e-06,4e-06,-1e-06,5e-06,0,0,7e-06,1e-06,3e-06,6e-06,1e-05,-1e-05,-1e-06,-5e-06,-3e-06,-6e-06,1e-06,0,-5e-06,2e-06,-1e-06,-6e-06,0,-1e-06,4e-06,1e-05,-4e-06,-1e-06,-4e-06,0,3e-06,-2e-06,0,-2e-06,-2e-06,-3e-06,-1e-06,3e-06,2e-06,-2e-06,0,3e-06,-3e-06,1e-06,-8e-06,1e-06,-2e-06,-6e-06,1e-06,0,-3e-06,1e-06,2e-06,3e-06,-3e-06,0,2e-06,1e-06,-2e-06,0,-1e-06,5e-06,-1e-06,-1.2e-05
-9e-06,-1e-06,0,-4e-06,3e-06,2e-06,3e-06,0,1e-05,0,-1e-06,-2e-06,-1e-06,-1e-06,0,-1e-06,3e-06,0,-5e-06,-3e-06,4e-06,-1e-06,-2e-06,0,2e-06,-1e-06,-4e-06,5e-06,3e-06,0,-6e-06,1e-06,-1e-06,-2e-06,-1e-06,0,2e-06,-6e-06,1e-06,-5e-06,2e-06,0,3e-06,-1e-06,1e-06,1e-06,-6e-06,-4e-06,-2e-06,3e-06,-5e-06,1e-06,0,0,0,1e-06,0,-1e-06,0,1e-06,0,6e-06,0,-1e-06,-2e-06,-3e-06,-8e-06,-1e-06,6e-06,-1e-06,0,2e-06,6e-06,3e-06,2e-06,-4e-06,-1e-06,-3e-06,-4e-06,-3e-06,2e-06,-1e-06,-4e-06,3e-06,1e-06,1e-06,-1e-06,1e-06,-3e-06,0,-2e-06,0,1e-06,-2e-06,-4e-06,-4e-06,2e-06,0,1e-06,0,-1e-06,5e-06,0,0,5e-06,0,-1e-06,-3e-06,-2e-06,0,-7e-06,-2e-06,0,-3e-06,-2e-06,1e-06,-2e-06,0,-6e-06,-1e-06,1.2e-05
3e-06,1e-06,0,3e-06,0,2e-06,-1e-06,-1e-06,-4e-06,-1e-06,1e-06,1e-06,0,0,3e-06,-1e-06,-2e-06,5e-06,2e-06,1e-06,1e-06,0,6e-06,2e-06,1e-06,2e-06,-2e-06,-5e-06,-2e-06,0,3e-06,-2e-06,0,-2e-06,0,0,-1e-06,2e-06,-1e-06,3e-06,0,0,-4e-06,1e-06,-2e-06,1e-06,5e-06,1e-06,0,-2e-06,3e-06,0,-2e-06,-2e-06,1e-06,-3e-06,-1e-06,0,-1e-06,0,-2e-06,0,0,-6e-06,1e-06,1e-06,1e-06,-8e-06,-4e-06,0,5e-06,1e-06,-8e-06,-7e-06,-1e-06,6e-06,1e-06,1e-06,9e-06,2e-06,0,0,-3e-06,3e-06,0,0,0,-2e-06,6e-06,-1e-06,-3e-06,1e-06,-1e-06,2e-06,-1e-06,9e-06,-1e-06,0,-2e-06,3e-06,1e-06,2e-06,0,-1e-06,-2e-06,0,1e-06,5e-06,0,-1e-06,-1e-06,-1e-06,0,-2e-06,6e-06,-2e-06,3e-06,1e-06,3e-06,0,-1.4e-05
2e-06,0,0,1e-06,4e-06,-4e-06,1e-06,0,1e-06,0,-1e-06,1e-06,0,-2e-06,-3e-06,-1e-06,-2e-06,2e-06,1e-06,-1e-06,-4e-06,0,-1e-06,-2e-06,3e-06,1e-06,-1e-06,4e-06,1e-06,0,-6e-06,2e-06,0,-4e-06,1e-06,2e-06,-1e-06,-1e-06,0,0,2e-06,2e-06,1e-06,0,0,0,-5e-06,-3e-06,1e-06,-1e-06,-2e-06,-2e-06,0,1e-06,-1e-06,2e-06,-1e-06,2e-06,1e-06,-1e-06,0,-2e-06,0,-1e-06,-2e-06,0,-1e-06,1.3e-05,2e-06,1e-06,-2e-06,-1e-06,4e-06,6e-06,3e-06,3e-06,-1e-06,1e-06,-7e-06,-1e-06,-1e-06,-1e-06,6e-06,-2e-06,0,-3e-06,0,1e-05,-4e-06,0,0,-1e-06,1e-06,0,3e-06,-9e-06,0,0,1e-06,-3e-06,0,-1e-06,0,-4e-06,-7e-06,0,0,5e-06,-2e-06,0,5e-06,1e-06,-1e-06,-1e-06,-7e-06,1e-06,-2e-06,4e-06,0,0,1.1e-05
-3e-06,-1e-06,-1e-06,-4e-06,-2e-06,5e-06,-1e-06,0,2e-06,-1e-06,1e-06,-2e-06,1e-06,-2e-06,3e-06,3e-06,2e-06,-9e-06,2e-06,1e-06,-3e-06,0,4e-06,3e-06,3e-06,-2e-06,-5e-06,4e-06,-3e-06,0,1.1e-05,-2e-06,-1e-06,-4e-06,0,-4e-06,2e-06,-1e-06,1e-06,-2e-06,0,-4e-06,2e-06,-1e-06,-2e-06,0,4e-06,1e-06,-2e-06,2e-06,0,1e-06,0,-2e-06,1e-06,5e-06,1e-06,2e-06,-3e-06,1e-06,1e-06,0,0,1e-06,1e-06,0,-5e-06,-1.2e-05,1e-06,1e-06,2e-06,1e-06,1e-06,-5e-06,-1e-06,-5e-06,0,-1e-06,2e-06,0,2e-06,1e-06,-6e-06,-1e-06,-1e-06,2e-06,0,-1.2e-05,1e-06,-1e-06,0,0,3e-06,-1e-06,-2e-06,1e-05,1e-06,0,0,-1e-06,-1e-06,-4e-06,0,8e-06,2e-06,1e-06,0,-9e-06,-1e-06,2e-06,-2e-06,1e-06,0,0,6e-06,-2e-06,-2e-06,-4e-06,-5e-06,0,-7e-06
-1e-06,0,-1e-06,2e-06,2e-06,-3e-06,2e-06,-1e-06,-7e-06,-1e-06,-1e-06,1e-06,-1e-06,-1e-06,-4e-06,1e-06,1e-06,0,-2e-06,-2e-06,3e-06,0,-1.2e-05,-5e-06,-1e-06,0,3e-06,-3e-06,4e-06,1e-06,-6e-06,2e-06,1e-06,-2e-06,2e-06,1e-06,0,-2e-06,0,3e-06,-2e-06,2e-06,-3e-06,0,0,0,-3e-06,5e-06,2e-06,-2e-06,1e-06,0,-1e-06,4e-06,-1e-06,-3e-06,0,3e-06,3e-06,-1e-06,1e-06,5e-06,-1e-06,-4e-06,0,1e-06,4e-06,9e-06,-4e-06,1e-06,-3e-06,-1e-06,-4e-06,1e-06,1e-06,-2e-06,0,-1e-06,-1e-06,-1e-06,-1e-06,-2e-06,4e-06,0,1e-06,-1e-06,0,1e-05,-1e-06,0,-2e-06,0,-2e-06,0,2e-06,-1.3e-05,-1e-06,0,-1e-06,3e-06,1e-06,1e-06,0,-3e-06,-3e-06,0,0,2e-06,-1e-06,0,-2e-06,1e-06,0,5e-06,0,1e-06,3e-06,6e-06,5e-06,-1e-06,1e-06
1e-06,1e-06,0,1e-06,-3e-06,-1e-06,-3e-06,-1e-06,1.1e-05,-1e-06,-1e-06,0,-1e-06,-2e-06,5e-06,-3e-06,-2e-06,-1e-06,0,1e-06,3e-06,0,9e-06,6e-06,-2e-06,2e-06,-4e-06,-2e-06,-2e-06,0,4e-06,-1e-06,1e-06,1e-06,0,1e-06,-1e-06,0,1e-06,-2e-06,0,-3e-06,1e-06,0,1e-06,-1e-06,7e-06,-2e-06,-2e-06,1e-06,-1e-06,0,1e-06,-3e-06,0,3e-06,2e-06,2e-06,0,1e-06,-3e-06,-3e-06,0,-1e-06,-1e-06,-1e-06,-2e-06,-1e-06,7e-06,-1e-06,-2e-06,0,4e-06,2e-06,0,5e-06,0,-2e-06,-1e-06,1e-06,0,-2e-06,1e-06,-2e-06,0,-1e-06,0,-1.1e-05,2e-06,-1e-06,-1e-06,-1e-06,0,1e-06,-2e-06,1.5e-05,2e-06,-1e-06,1e-06,-1e-06,-1e-06,2e-06,1e-06,-3e-06,0,0,0,6e-06,-1e-06,0,4e-06,1e-06,0,-1e-06,-4e-06,-2e-06,0,1e-06,-1e-06,-1e-06,0
3e-06,0,0,-7e-06,1e-06,3e-06,3e-06,1e-06,-1.2e-05,-1e-06,1e-06,-1e-06,1e-06,-2e-06,-7e-06,0,0,-1e-06,1e-06,-1e-06,-1e-06,0,-9e-06,-6e-06,-1e-06,0,-6e-06,-1e-06,-2e-06,-1e-06,-5e-06,1e-06,0,4e-06,1e-06,1e-06,0,-3e-06,0,2e-06,0,5e-06,1e-06,1e-06,0,-1e-06,-3e-06,-3e-06,2e-06,1e-06,0,0,1e-06,2e-06,1e-06,-6e-06,-1e-06,-1e-06,-2e-06,-1e-06,1e-06,1e-06,0,4e-06,2e-06,2e-06,-4e-06,-6e-06,-8e-06,0,1e-06,2e-06,-4e-06,-6e-06,-2e-06,1e-06,0,-1e-06,4e-06,-1e-06,2e-06,6e-06,-4e-06,0,0,2e-06,0,1.2e-05,-2e-06,1e-06,-1e-06,0,1e-06,0,-1e-06,-1.3e-05,-2e-06,1e-06,1e-06,-1e-06,0,3e-06,0,1e-06,1e-06,0,0,-2e-06,-1e-06,-2e-06,-3e-06,-1e-06,0,1e-06,5e-06,1e-06,-2e-06,-3e-06,-3e-06,-1e-06,-2e-06
