1e-05,3.3e-05,1e-05,6e-06,6e-06,1.6e-05,3e-06,6e-06,1.3e-05,1.1e-05,1.5e-05,2.7e-05,2e-06,6e-06,1.7e-05,2e-06,4e-06,1e-05,1.5e-05,1.8e-05,3.2e-05,1e-05,1.4e-05,1.5e-05,7e-06,7e-06,3e-06,9e-06,4e-06,1e-06,3e-06,1e-06,5e-06,3e-06,1.3e-05,1.8e-05,1.5e-05,4e-06,9e-06,2.1e-05,1.2e-05,7e-06,2.2e-05,4e-06,1.3e-05,2.5e-05,9e-06,1.1e-05,2.3e-05,0,1.7e-05,6e-06,4e-06,2.3e-05,1.6e-05,1.6e-05,1.9e-05,1.3e-05,0,3.6e-05,1e-06,1.8e-05,1.1e-05,5e-06,9e-06,2.2e-05,3e-06,2e-06,2e-05,1.6e-05,1e-05,1.5e-05,2e-06,5e-06,1e-05,1.1e-05,1.4e-05,4e-06,9e-06,9e-06,7e-06,8e-06,4e-06,1.1e-05,5e-06,2e-06,1.7e-05,1.2e-05,0,1.7e-05,1.5e-05,2e-06,2e-05,2e-05,4e-06,2e-05,1e-06,7e-06,1.5e-05,3e-06,1.9e-05,5e-06,1.3e-05,4e-06,2e-06,1.1e-05,1.1e-05,1.7e-05,1.4e-05,1e-05,2e-06,2e-05,1.2e-05,1.5e-05,4e-06,8e-06,8e-06,1.1e-05,1.1e-05,1.1e-05,1.6e-05
8e-06,4.7e-05,3.5e-05,3.1e-05,5e-06,2.7e-05,1.9e-05,3.3e-05,3e-05,3.1e-05,2.9e-05,6.4e-05,2.2e-05,2.3e-05,5.1e-05,2.1e-05,1e-05,3.7e-05,5e-05,3.8e-05,8.6e-05,2.8e-05,4e-05,3.2e-05,3.1e-05,3.4e-05,9e-06,3.2e-05,1.9e-05,2.4e-05,3.2e-05,2.4e-05,3.6e-05,1.9e-05,4.3e-05,3.9e-05,1.3e-05,2.7e-05,2.4e-05,4.9e-05,5e-06,4.7e-05,6.4e-05,2.8e-05,3.4e-05,5.2e-05,3.1e-05,2.2e-05,7.3e-05,2e-05,6.5e-05,7e-06,1e-05,6.3e-05,2.6e-05,1.1e-05,2.6e-05,4.6e-05,1.7e-05,0.000103,3.3e-05,4.6e-05,2.6e-05,9e-06,4.4e-05,1.9e-05,2.2e-05,1.6e-05,3e-05,4.3e-05,2.2e-05,1.9e-05,2.5e-05,1.4e-05,6.3e-05,2.2e-05,1.7e-05,9e-06,2.7e-05,1.6e-05,3.4e-05,5.4e-05,4e-05,2.6e-05,1.5e-05,7e-06,5.9e-05,2.6e-05,8e-06,3e-05,5.9e-05,3.5e-05,5.4e-05,4.5e-05,3e-06,3e-05,4.2e-05,2.6e-05,5e-05,1.7e-05,4.9e-05,4e-06,1.6e-05,3.5e-05,3.5e-05,2.3e-05,3.6e-05,2.1e-05,5.7e-05,4e-05,4.5e-05,2.8e-05,3.4e-05,3.6e-05,9e-06,2.1e-05,2.7e-05,1e-05,3e-05,3.8e-05,4.7e-05
1.4e-05,6.9e-05,3.8e-05,6e-05,4.6e-05,1.8e-05,2.6e-05,4.9e-05,3.7e-05,1.4e-05,1e-05,3.8e-05,3e-05,8.8e-05,2e-05,4.9e-05,5.3e-05,4e-05,6.2e-05,0.000112,0.000145,7e-06,5.4e-05,6.1e-05,7.8e-05,4.7e-05,7.4e-05,7.3e-05,5.8e-05,9e-06,8.3e-05,0.000106,6.1e-05,1.1e-05,6.3e-05,2.8e-05,1.7e-05,7.1e-05,3.3e-05,5.9e-05,7.5e-05,7.7e-05,1.3e-05,5.2e-05,2.1e-05,4.8e-05,5.3e-05,1.9e-05,5.5e-05,6e-05,7.1e-05,9.6e-05,6.2e-05,0.000101,5.1e-05,1.6e-05,4.7e-05,7.2e-05,2.1e-05,0.00011,5.5e-05,7.5e-05,5.3e-05,5.9e-05,5.9e-05,9.3e-05,5.7e-05,5e-05,6.8e-05,8.9e-05,5.9e-05,4.2e-05,4.7e-05,3.4e-05,1e-04,3.6e-05,4.9e-05,6.2e-05,3.7e-05,1.5e-05,8.2e-05,3.9e-05,4.7e-05,4.8e-05,5.6e-05,4.9e-05,8.7e-05,7.5e-05,3.3e-05,5.4e-05,9.5e-05,1.1e-05,8.1e-05,9.5e-05,6e-05,1.6e-05,6.4e-05,4.4e-05,6.7e-05,3.6e-05,0.000115,2.6e-05,3.2e-05,6.6e-05,2.9e-05,3.2e-05,2.7e-05,4.1e-05,6.7e-05,4.8e-05,3.2e-05,4.5e-05,1.6e-05,6.3e-05,3.4e-05,3.7e-05,1.1e-05,3e-05,3.3e-05,5.5e-05,7e-05
1e-05,0.000143,0.000138,0.000104,3.2e-05,8.3e-05,0.000125,0.000165,7.5e-05,0.000109,5.8e-05,7e-05,6.2e-05,0.000107,9.8e-05,3.4e-05,5.7e-05,9.2e-05,8.9e-05,0.000155,0.000224,0.000227,0.00015,0.000134,0.000123,0.000156,9.9e-05,0.000198,0.000105,7.5e-05,7.2e-05,0.000104,9.9e-05,8.4e-05,0.00013,9.8e-05,5.1e-05,6.2e-05,5.2e-05,7.4e-05,9.1e-05,0.000107,3.9e-05,6.2e-05,0.000104,7.5e-05,9.1e-05,6.4e-05,5.8e-05,8.6e-05,5.4e-05,8.4e-05,4.2e-05,6e-05,5.6e-05,1.9e-05,0.000106,7.4e-05,0.000121,8.9e-05,0.000107,4.5e-05,9.7e-05,7.9e-05,5.3e-05,6e-05,4.8e-05,4.2e-05,0.00014,0.000144,0.000101,5.9e-05,5.3e-05,6.4e-05,3.1e-05,4.8e-05,6.8e-05,4.8e-05,6.1e-05,3.2e-05,8.3e-05,0.000101,0.000125,5e-05,6.1e-05,4.8e-05,0.000166,0.000146,3.3e-05,0.000117,5.3e-05,0.000102,0.00012,0.000138,0.00013,0.000138,8.7e-05,3.7e-05,9e-06,3.3e-05,0.00014,0.000104,4.6e-05,9.9e-05,4.3e-05,2.9e-05,2.2e-05,7.1e-05,4.2e-05,2.7e-05,5.5e-05,0.000127,7.8e-05,9.4e-05,7.1e-05,4.4e-05,3.1e-05,5.7e-05,7.8e-05,7e-05,0.00012
6.4e-05,0.000201,0.000201,0.000164,0.000121,1.2e-05,0.000151,8.7e-05,6.7e-05,0.000163,6.6e-05,8.2e-05,5e-05,0.000114,0.000108,9.8e-05,4.7e-05,6.4e-05,7.1e-05,8.3e-05,5.5e-05,8.8e-05,2.9e-05,7.6e-05,6.2e-05,8e-05,0.000166,0.000195,7.8e-05,7.4e-05,0.000123,3.6e-05,3.1e-05,6.1e-05,8.1e-05,0.000132,0.000112,7.2e-05,1.9e-05,3.4e-05,6e-05,4.7e-05,8.7e-05,2.2e-05,6.7e-05,6e-05,3.9e-05,4.3e-05,2.5e-05,5.5e-05,1.9e-05,9.7e-05,0.000113,0.000119,5.3e-05,6.6e-05,0.000125,0.000102,0.000109,5.8e-05,5.4e-05,9e-05,8.9e-05,3.2e-05,6e-05,9.7e-05,6.8e-05,6.3e-05,0.000139,4.1e-05,7.2e-05,0.000119,0.000125,5.1e-05,3.3e-05,4.9e-05,7.1e-05,0.000109,9e-05,8e-05,0.000125,0.000158,5.2e-05,5.9e-05,1.9e-05,9.3e-05,9.5e-05,5.4e-05,0.000105,9.3e-05,7e-05,0.000108,4.5e-05,3.8e-05,8.1e-05,0.000106,7e-05,7e-05,2.3e-05,4.2e-05,9.6e-05,0.000134,0.000119,1.7e-05,3.2e-05,4.2e-05,3.6e-05,8.1e-05,6.6e-05,5.2e-05,2e-06,6.7e-05,3.3e-05,0.000107,5.2e-05,3.6e-05,3.7e-05,4.7e-05,0.000111,1.5e-05,6e-06
1.2e-05,0.000162,1.2e-05,6.7e-05,0.000205,0.000136,8.2e-05,0.000116,3.1e-05,0.000101,0.000103,4.1e-05,4.1e-05,5.6e-05,4.9e-05,8e-05,0.000127,0.000168,7.1e-05,8.1e-05,8.1e-05,0.000117,0.000149,0.000107,0.000112,9.4e-05,0.000182,7.1e-05,5.2e-05,3.8e-05,9.6e-05,1e-04,5.1e-05,8.5e-05,1.8e-05,0.000153,4.7e-05,0.000148,0.000123,6.7e-05,7.1e-05,0.000186,0.000151,9.7e-05,3.7e-05,0.000124,0.000107,7e-05,5.7e-05,4.1e-05,7.6e-05,3.5e-05,5.1e-05,9.7e-05,0.000132,7.8e-05,6e-05,0.00012,6.7e-05,8e-05,6.3e-05,9e-06,0.000174,6.4e-05,9.3e-05,3.2e-05,5.6e-05,0.000102,3.8e-05,3.4e-05,9.5e-05,7.3e-05,9.4e-05,3.5e-05,8.5e-05,7.6e-05,5.5e-05,6e-05,6.3e-05,3.9e-05,6.2e-05,4.6e-05,2.6e-05,6.6e-05,8.4e-05,0.000126,0.000186,0.00018,0.000113,6.4e-05,5.9e-05,7.6e-05,1e-04,9.4e-05,5.1e-05,0.000121,0.000144,2e-05,0.000103,6.9e-05,2.1e-05,5.5e-05,7.9e-05,4.5e-05,8.4e-05,0.000129,4.8e-05,8.1e-05,4.2e-05,7e-06,9.2e-05,8.5e-05,3.2e-05,7.1e-05,4.5e-05,6e-05,8.1e-05,4.7e-05,9e-05,5.9e-05,0.000121
2.9e-05,9.7e-05,0.000126,9.1e-05,0.000161,0.000154,8.5e-05,9.7e-05,0.000131,4.3e-05,8.1e-05,8.8e-05,7.3e-05,6e-05,0.000136,0.000117,3.5e-05,8.2e-05,0.000102,4.9e-05,0.000235,0.000382,0.000309,0.000334,8e-05,7.9e-05,0.000255,0.000263,0.000205,0.000198,0.000139,0.000118,5.8e-05,0.000159,7.2e-05,0.000233,8.8e-05,0.000241,0.000273,0.000128,6.2e-05,0.000148,0.000167,8.1e-05,1.1e-05,0.000171,0.00023,0.000184,7.1e-05,5.9e-05,8.2e-05,0.000162,4.6e-05,0.000165,0.000162,0.000159,0.000209,7.6e-05,5.7e-05,8.9e-05,0.000159,0.000147,0.000138,0.00014,0.000119,8e-05,7.9e-05,0.00012,4.4e-05,3.8e-05,0.000105,0.000151,2.2e-05,1.7e-05,0.000146,0.00018,0.000149,4.5e-05,7e-05,5.2e-05,4.4e-05,1.7e-05,8e-05,4.9e-05,2.7e-05,3.4e-05,0.000112,0.000105,0.000176,4.6e-05,4.2e-05,6e-05,0.000132,4.2e-05,0.000114,0.000186,1.9e-05,0.000134,5.3e-05,5.5e-05,6.3e-05,5.1e-05,0.000129,6.3e-05,7.9e-05,4.9e-05,3.4e-05,9.7e-05,5.8e-05,4e-05,0.000141,0.000126,4e-05,0.000103,0.000121,6.5e-05,5.6e-05,5.3e-05,8e-05,9.1e-05,0.000197
0.000131,6.5e-05,0.000132,0.000193,0.000121,0.00011,0.000124,1.8e-05,0.000126,0.000121,1.8e-05,0.000112,0.000165,7.6e-05,0.000118,0.000145,0.000142,0.000102,7.1e-05,3.8e-05,0.000224,0.000187,7.3e-05,0.000247,0.000175,0.000147,0.000142,0.000186,3.1e-05,0.000115,0.000142,5.6e-05,5.5e-05,0.00013,0.000168,0.000136,0.000181,0.000205,0.000126,9.1e-05,6.9e-05,0.000171,0.000121,6.8e-05,5.4e-05,0.000134,0.000112,0.000108,0.000165,7.8e-05,0.000168,0.000237,0.000221,0.000266,0.000121,0.000102,0.000109,0.000146,3.4e-05,6.2e-05,0.00011,9.5e-05,0.000222,0.000121,6.2e-05,5.1e-05,0.000146,0.000213,0.000154,4.2e-05,0.000149,0.00026,0.000211,1e-04,0.000141,7.1e-05,7.8e-05,0.000117,3.2e-05,5.5e-05,7.1e-05,7e-06,4e-05,5.3e-05,9.8e-05,8.5e-05,9.1e-05,0.000101,8.9e-05,0.000226,0.000115,0.00016,0.000102,6.2e-05,1e-04,0.000157,0.000134,0.000143,0.000213,0.000193,9e-05,7.3e-05,0.000108,0.000116,8.7e-05,4.6e-05,2.8e-05,8.1e-05,3e-05,0.000101,5.7e-05,0.000124,0.000145,0.000123,0.000192,0.000113,6.3e-05,4.9e-05,0.000126,6.1e-05,0.000108
1.5e-05,0.000157,5.6e-05,0.000219,0.000106,0.000148,0.000154,9.2e-05,9.5e-05,0.000104,0.000114,6.3e-05,5.6e-05,1e-04,8.5e-05,0.000273,0.000166,0.000133,0.000124,0.000188,1.9e-05,0.00013,0.000182,8.1e-05,0.000159,0.000199,0.000239,6.4e-05,4.7e-05,0.000122,0.000145,0.000144,9.9e-05,0.00013,7.5e-05,0.000189,0.000254,9.4e-05,8.9e-05,2.7e-05,4.8e-05,9.2e-05,2.7e-05,3.3e-05,2.3e-05,4.7e-05,6.7e-05,8e-05,0.000152,0.000144,0.00016,9.1e-05,0.000164,0.00014,5.4e-05,5.8e-05,0.000132,0.000219,0.000154,0.000139,0.000149,0.000114,0.000251,0.000113,0.000119,0.000137,7.9e-05,0.000175,7.8e-05,6.3e-05,0.000123,0.000286,7.3e-05,0.000129,0.000207,4.6e-05,4.4e-05,6.8e-05,0.000142,5.9e-05,9.2e-05,9.3e-05,3.6e-05,8.5e-05,9.9e-05,2.4e-05,5.9e-05,0.000143,6.5e-05,0.00023,0.000119,0.000107,7.9e-05,2.8e-05,0.000129,5.4e-05,2.5e-05,0.000161,0.000133,0.000143,0.000139,0.000168,4.6e-05,9.9e-05,7.9e-05,0.000124,0.000121,3.4e-05,1.4e-05,0.000113,0.000132,0.000181,0.000268,0.000168,6.4e-05,9.9e-05,6.7e-05,4.3e-05,0.000137,0.000115,4.3e-05
0.000106,0.000124,0.000139,0.000212,0.000156,0.000205,7.9e-05,8.9e-05,7.2e-05,0.000111,8.5e-05,8.2e-05,4.9e-05,8.5e-05,5.6e-05,0.00029,0.000155,0.000191,0.000179,0.000167,0.00013,0.000146,0.000153,0.000165,0.000153,7.4e-05,4.3e-05,8.4e-05,0.000131,8.8e-05,0.000161,0.00017,9.7e-05,0.00012,0.000152,8.2e-05,9.8e-05,0.000139,9.2e-05,4.8e-05,8.9e-05,3.4e-05,6.7e-05,6.9e-05,6.9e-05,0.000135,0.000257,0.000168,0.000149,0.000193,4.9e-05,3e-05,0.000129,9.7e-05,5.9e-05,9.7e-05,7.7e-05,0.000163,8.3e-05,0.000116,0.000101,3.8e-05,0.00024,0.000115,0.00016,4.2e-05,0.000135,0.000251,0.000128,4.7e-05,9.3e-05,0.000116,0.000193,0.00017,9.3e-05,0.000256,0.000229,0.000111,4.8e-05,9.2e-05,8.4e-05,8.5e-05,9.4e-05,3e-05,0.000113,0.000137,9.8e-05,0.000139,7.7e-05,0.000212,0.000161,0.000145,7e-05,5e-05,0.000183,0.00017,0.000143,6.7e-05,7.5e-05,0.000118,9.5e-05,0.000153,0.00017,0.000202,8.6e-05,0.000136,0.000278,0.000257,0.00017,0.000126,3.8e-05,0.000119,0.000131,5.8e-05,0.000102,6.4e-05,0.000172,0.000166,0.000114,0.000182,0.000257
0.00014,2e-04,0.000196,0.000152,5.9e-05,0.000103,3.8e-05,0.00012,6.2e-05,5.3e-05,4.9e-05,0.000112,6.5e-05,0.000123,0.000158,0.000192,0.000138,8.3e-05,1.8e-05,9.3e-05,5.6e-05,7.7e-05,6.2e-05,3.4e-05,0.000107,2.8e-05,4.3e-05,9.4e-05,0.000146,6.9e-05,0.000119,0.00011,0.000109,9.9e-05,7.2e-05,6e-05,5.8e-05,0.000105,1.6e-05,5.7e-05,9.1e-05,0.000103,0.000155,7.3e-05,9.9e-05,8.4e-05,0.000126,0.000184,0.000133,0.000163,0.000113,8.7e-05,0.000128,0.000147,0.000108,0.000101,7.2e-05,4.8e-05,1.8e-05,0.000111,0.000104,4.4e-05,0.000162,0.000143,0.000111,0.000119,0.000129,9.5e-05,0.000158,0.000133,8.7e-05,9.4e-05,0.000186,0.00014,0.000105,0.000137,0.000245,0.000143,6.3e-05,0.000122,4.8e-05,8.1e-05,4.4e-05,6.1e-05,0.000131,0.000176,0.000102,7.6e-05,5.8e-05,0.000137,5e-06,4.5e-05,4.3e-05,5.1e-05,0.000142,0.000141,1.8e-05,1e-04,9.5e-05,2.6e-05,0.000157,2.9e-05,0.000104,0.000133,0.000125,1e-04,9.3e-05,0.000118,8.5e-05,8.2e-05,6.1e-05,0.000133,4.9e-05,5.7e-05,3.2e-05,6.6e-05,8e-05,5.9e-05,0.000101,6.8e-05,0.000104
9.6e-05,9.8e-05,0.000103,0.000117,5.7e-05,9.8e-05,0.000126,7.4e-05,8.4e-05,5e-05,0.000133,7.8e-05,1.4e-05,8.3e-05,2.7e-05,7.6e-05,3.2e-05,0.000105,0.000132,9e-05,7e-05,9.5e-05,1.2e-05,5.1e-05,8.9e-05,5.2e-05,1e-04,0.000111,7.6e-05,3e-05,2.9e-05,7.9e-05,5.7e-05,5.1e-05,4.6e-05,1.8e-05,7.6e-05,3.8e-05,6.1e-05,0.000126,9.5e-05,0.000107,9.5e-05,8e-05,6.5e-05,6.6e-05,0.000121,8.9e-05,0.00018,6e-05,0.000108,5.7e-05,8.8e-05,9.4e-05,2e-05,5.6e-05,0.000125,5e-05,5.4e-05,9.7e-05,6.8e-05,0.000115,3e-05,8.7e-05,9.7e-05,7.5e-05,4.6e-05,1.7e-05,0.000124,8.4e-05,2.8e-05,9.1e-05,4.3e-05,9.2e-05,0.000212,0.000165,0.000106,3.5e-05,5.1e-05,0.000136,0.000135,7.2e-05,0.000118,7e-05,7.3e-05,5.3e-05,3.6e-05,8.4e-05,5.5e-05,7.4e-05,9.7e-05,5.6e-05,9.7e-05,4.6e-05,9.5e-05,8.2e-05,0.000103,6.1e-05,7.6e-05,4.4e-05,0.000113,7.8e-05,0.000107,5e-06,0.000112,8.8e-05,6.2e-05,7.9e-05,6.1e-05,4.2e-05,2.9e-05,7.3e-05,3e-05,5.5e-05,3.8e-05,7.7e-05,9.3e-05,7.2e-05,3e-05,4.1e-05,4.8e-05
0.000112,1.9e-05,6.1e-05,1.8e-05,0.000102,5.9e-05,0.000121,0.000116,0.000102,0.000131,7.4e-05,5.6e-05,6e-05,5.5e-05,3.6e-05,3.1e-05,4.4e-05,0.00014,5.4e-05,4.4e-05,2e-05,6.3e-05,1.7e-05,1.2e-05,3.2e-05,4.1e-05,6.2e-05,2e-04,0.000115,2.5e-05,4.1e-05,3.7e-05,8.7e-05,6.9e-05,5.4e-05,4.8e-05,6.9e-05,1.8e-05,3.6e-05,0.000119,0.000136,9.8e-05,1.2e-05,3.4e-05,5.1e-05,5.2e-05,5.3e-05,8.7e-05,0.000135,3.3e-05,0.000127,0.000155,1e-04,0.000175,0.000155,4.2e-05,7.5e-05,3.1e-05,7e-05,7.7e-05,9.5e-05,5.8e-05,3.7e-05,7e-05,4.3e-05,0.000145,0.000157,0.000103,5.6e-05,5e-05,4.8e-05,5.6e-05,2.4e-05,0.00012,0.000173,0.000111,8.1e-05,6.1e-05,0.000103,0.000122,1.8e-05,0.000105,0.000143,3.5e-05,1.6e-05,3.7e-05,2.6e-05,7.7e-05,2.4e-05,6.9e-05,0.000116,6.5e-05,8e-05,7.2e-05,6.1e-05,6.4e-05,7.3e-05,0.000109,7.7e-05,2.6e-05,5.9e-05,7.3e-05,9e-05,7.4e-05,8.9e-05,3.1e-05,6.9e-05,4.1e-05,4e-05,6.1e-05,6.3e-05,4.2e-05,5.3e-05,9.3e-05,4e-05,8e-06,3e-05,8e-05,6.2e-05,7e-06,5.6e-05
0.000106,0.000168,4.9e-05,6.2e-05,9.9e-05,4.1e-05,9.8e-05,9.4e-05,2.7e-05,5.3e-05,4.6e-05,0.000136,7.7e-05,2.3e-05,8.6e-05,3.5e-05,5.1e-05,0.000197,0.000177,4.3e-05,4.2e-05,7.4e-05,8e-05,4.2e-05,5.7e-05,2.8e-05,4.4e-05,8.4e-05,7.7e-05,7.8e-05,5.2e-05,8.3e-05,0.000101,4.7e-05,0.000121,0.000163,9.3e-05,3.1e-05,0.000103,3.7e-05,0.000135,9e-05,4.1e-05,3.3e-05,2.1e-05,1.8e-05,6.5e-05,6.7e-05,0.000133,6.2e-05,9.7e-05,4.6e-05,9.1e-05,5e-05,6.4e-05,3.7e-05,7.3e-05,3.5e-05,4.1e-05,4.6e-05,8.7e-05,0.000117,5.2e-05,8.1e-05,5.4e-05,9.9e-05,7.9e-05,6.2e-05,2.9e-05,2.1e-05,4.5e-05,9.1e-05,7.4e-05,9.1e-05,1.6e-05,0.000133,0.000149,7.9e-05,4.1e-05,8.3e-05,4.7e-05,9.6e-05,0.000104,8.2e-05,5.8e-05,3.4e-05,1.4e-05,3.4e-05,4.9e-05,3.2e-05,4.1e-05,3.7e-05,6e-05,2.7e-05,2.9e-05,1.1e-05,2.6e-05,9e-05,9.1e-05,0.000117,9e-05,7.5e-05,2.2e-05,6.2e-05,8.1e-05,7.7e-05,7.6e-05,9.5e-05,6.6e-05,4.5e-05,5.4e-05,5.9e-05,6.3e-05,9e-05,5.6e-05,6.4e-05,2.9e-05,7.4e-05,7.6e-05,8e-05,4.5e-05
0.000109,8.5e-05,6.8e-05,0.000109,0.000118,0.000115,9.4e-05,0.000105,8.2e-05,6.6e-05,7e-05,8.3e-05,3e-05,2.9e-05,7.3e-05,1e-04,5.5e-05,0.000111,5.4e-05,6.4e-05,8.9e-05,3.3e-05,8.4e-05,5.2e-05,9.1e-05,0.000112,3.8e-05,3.6e-05,1e-05,2.6e-05,8.4e-05,0.000121,3.8e-05,7.8e-05,7e-05,8.1e-05,4.7e-05,8.8e-05,7.5e-05,0.000126,6.8e-05,0.00011,5.7e-05,8e-06,3.3e-05,1.8e-05,2.3e-05,6.6e-05,1e-04,0.000137,0.000151,5.7e-05,6.2e-05,7.3e-05,0.000149,0.000131,3.3e-05,2.9e-05,5.8e-05,9.7e-05,0.000135,9.8e-05,7.7e-05,2.7e-05,1.9e-05,5.3e-05,7.8e-05,9.3e-05,7.3e-05,4e-05,8.2e-05,2.7e-05,3.7e-05,8.4e-05,4.5e-05,0.000154,7.4e-05,4.8e-05,6.1e-05,3.7e-05,2.8e-05,4.5e-05,0.000169,0.000153,7e-05,5e-05,5.6e-05,5.6e-05,7.6e-05,2.8e-05,1.8e-05,5.3e-05,1e-05,4.7e-05,1.9e-05,4.4e-05,2.1e-05,0.000113,6.2e-05,6.8e-05,4.3e-05,4e-05,4.6e-05,4.6e-05,4.5e-05,5e-06,7.6e-05,4.3e-05,1.1e-05,1.4e-05,3.2e-05,0.000115,0.000102,4e-05,1.2e-05,8.7e-05,3.8e-05,5e-05,1.1e-05,6e-06,4.9e-05
5.1e-05,3.3e-05,5.7e-05,6.6e-05,3.6e-05,4.5e-05,8.9e-05,3.3e-05,4.2e-05,5e-06,6.3e-05,2.9e-05,1.2e-05,3.4e-05,4e-05,6.7e-05,5.8e-05,7e-05,4.8e-05,5.6e-05,9.2e-05,2.8e-05,4.3e-05,2.3e-05,7.6e-05,5e-05,4.6e-05,3.9e-05,2.6e-05,3.8e-05,0.000111,4.3e-05,4e-05,5.3e-05,6.1e-05,9e-06,3.3e-05,6.2e-05,1.8e-05,8.9e-05,5.8e-05,7.5e-05,6.3e-05,4e-05,7.7e-05,5.4e-05,6.1e-05,8.8e-05,2.6e-05,9e-05,2.1e-05,3.6e-05,2.7e-05,5.2e-05,4.2e-05,4.7e-05,6.8e-05,4.5e-05,5.2e-05,6.2e-05,0.000108,6.9e-05,7.7e-05,5.2e-05,3.8e-05,3.9e-05,3.9e-05,3.4e-05,2.2e-05,5.8e-05,6e-05,4.4e-05,3.2e-05,9.3e-05,8e-06,0.000112,8.9e-05,5.7e-05,5.3e-05,6.7e-05,2.2e-05,1.8e-05,9.7e-05,3.3e-05,7e-06,8.6e-05,6.4e-05,1e-06,6e-05,6.7e-05,4.8e-05,1.2e-05,2.5e-05,8e-05,6.7e-05,2e-05,4.5e-05,7.9e-05,4.6e-05,1.4e-05,1.9e-05,2.9e-05,1.6e-05,1.9e-05,1.7e-05,2.6e-05,2.4e-05,3.9e-05,3.8e-05,6.1e-05,2.9e-05,7.5e-05,1.5e-05,2.5e-05,3.3e-05,4.2e-05,5.3e-05,2.2e-05,2.1e-05,5.9e-05,2.1e-05
2.7e-05,3.6e-05,6.9e-05,8.3e-05,2.1e-05,5.3e-05,4.3e-05,5.6e-05,9.1e-05,9.6e-05,0.000132,5.9e-05,1.5e-05,3.3e-05,5.1e-05,7.6e-05,0.000124,5.4e-05,9.4e-05,5.3e-05,0.000122,8.4e-05,6.5e-05,5.2e-05,5.2e-05,0.000115,1.4e-05,2e-05,2e-05,2.1e-05,4.6e-05,8e-06,6.6e-05,1.9e-05,3.1e-05,4e-05,3.7e-05,7.1e-05,5.4e-05,2.2e-05,2.3e-05,7.2e-05,1e-05,1.4e-05,8e-05,2e-05,7.3e-05,5.9e-05,6.4e-05,8.8e-05,6.9e-05,8.7e-05,4.9e-05,5.8e-05,2.9e-05,2.3e-05,5.5e-05,6.4e-05,8.7e-05,4.8e-05,7.4e-05,6.1e-05,3.3e-05,4.2e-05,2.9e-05,6.7e-05,2.1e-05,2e-05,6e-06,4.7e-05,4.7e-05,4.8e-05,7.2e-05,9.3e-05,1e-04,4.7e-05,5.2e-05,5.7e-05,1.7e-05,7.7e-05,5.7e-05,7e-05,1.9e-05,2.2e-05,1.5e-05,9e-05,2.2e-05,4.9e-05,7.6e-05,1.5e-05,3.3e-05,1.4e-05,4.1e-05,3.3e-05,3.3e-05,4.8e-05,3.3e-05,5e-06,2.9e-05,7e-06,3e-05,4.9e-05,3.1e-05,3e-05,1.2e-05,5.7e-05,8.3e-05,3.5e-05,2.4e-05,8.5e-05,3.7e-05,4.1e-05,3.5e-05,2.1e-05,2.2e-05,2.4e-05,5.7e-05,5e-05,3.3e-05,7.9e-05,3e-05
9.6e-05,9.1e-05,5.5e-05,2.4e-05,4.8e-05,7.9e-05,5.3e-05,2.7e-05,5.7e-05,7.6e-05,7.9e-05,7e-05,3.9e-05,2.7e-05,2.8e-05,2.4e-05,9.3e-05,9.7e-05,0.000124,8.4e-05,3.5e-05,3.1e-05,0.000104,0.000114,0.000109,0.000136,0.000119,3.9e-05,2.5e-05,3.4e-05,4.9e-05,1.5e-05,4.9e-05,5.1e-05,5.5e-05,1.7e-05,2.4e-05,6.9e-05,1.9e-05,1.7e-05,4.9e-05,4.2e-05,4.2e-05,5.7e-05,8.2e-05,4.4e-05,8.6e-05,0.000166,0.00013,5.1e-05,6e-05,8.9e-05,2.6e-05,2.3e-05,8.4e-05,7.9e-05,3.7e-05,5.8e-05,4.8e-05,5.5e-05,6.8e-05,2.6e-05,2e-05,1.8e-05,4.4e-05,5.6e-05,6.1e-05,7.1e-05,3.2e-05,2.2e-05,4.3e-05,6.8e-05,0.000119,0.000168,0.000129,7.5e-05,3.8e-05,6e-05,4.6e-05,8.6e-05,4.5e-05,4.1e-05,0.000106,8.4e-05,3.8e-05,7.7e-05,7.5e-05,1e-04,8.3e-05,6.7e-05,6.1e-05,4e-05,7.4e-05,4.1e-05,4.3e-05,6.8e-05,4.5e-05,3.3e-05,1e-05,4.3e-05,8.7e-05,3e-05,4e-06,5.3e-05,5.1e-05,6.7e-05,6.4e-05,2.9e-05,1.4e-05,7.1e-05,3.2e-05,8.4e-05,3.2e-05,8e-06,3.5e-05,7.9e-05,5.7e-05,3e-05,5.2e-05,5.6e-05,6.9e-05
8.6e-05,3.3e-05,2.6e-05,4.7e-05,4.9e-05,4.9e-05,5.1e-05,3.3e-05,6.9e-05,2.5e-05,6.2e-05,5.9e-05,6e-05,4e-05,7.8e-05,8.9e-05,2.5e-05,8.7e-05,1.5e-05,7.1e-05,8.8e-05,7.9e-05,5e-05,6e-05,7e-05,5.5e-05,2.1e-05,4.1e-05,3.8e-05,2.6e-05,3.3e-05,3.5e-05,2e-05,3.3e-05,9.3e-05,6.5e-05,1.3e-05,3.5e-05,2.9e-05,3.6e-05,6.9e-05,4.4e-05,2.7e-05,5.4e-05,2.1e-05,2.3e-05,6.7e-05,7.1e-05,2.4e-05,4.8e-05,2.8e-05,5.6e-05,6.4e-05,2.4e-05,4.8e-05,3.5e-05,3.2e-05,2.6e-05,5.7e-05,2.8e-05,1.4e-05,9e-06,3.5e-05,3e-05,5.5e-05,2.5e-05,4.6e-05,5.7e-05,2.6e-05,2.3e-05,3.5e-05,1.1e-05,4.3e-05,3.8e-05,1e-05,1.8e-05,2.8e-05,4.4e-05,4.4e-05,3.4e-05,4.6e-05,1.9e-05,9.3e-05,8e-05,5.7e-05,3.4e-05,2.4e-05,6.1e-05,1.2e-05,7e-05,6.7e-05,6.6e-05,2.5e-05,2.1e-05,2.2e-05,4.6e-05,3.3e-05,4.1e-05,2.7e-05,6.3e-05,5.8e-05,2.1e-05,2.1e-05,2.5e-05,2.9e-05,3e-05,9.5e-05,5.3e-05,2.7e-05,4.8e-05,6.1e-05,4.3e-05,2.6e-05,3.1e-05,1.8e-05,6.2e-05,5.2e-05,1.6e-05,5.1e-05,3.7e-05,4.3e-05
2.5e-05,3.5e-05,2.5e-05,4e-05,3.2e-05,6.7e-05,3.2e-05,3.1e-05,3.4e-05,2.2e-05,6.2e-05,1.9e-05,4.2e-05,3.8e-05,6.2e-05,2.8e-05,4.4e-05,2.4e-05,1.6e-05,7.9e-05,8e-06,4.3e-05,1.8e-05,5.4e-05,3.4e-05,4.7e-05,1.6e-05,4.6e-05,1.9e-05,3.7e-05,5.8e-05,3.6e-05,1e-06,1.7e-05,3.7e-05,2.7e-05,2.4e-05,2.9e-05,1e-05,2.5e-05,3.8e-05,2.8e-05,1.5e-05,3.4e-05,2.2e-05,2e-06,5.3e-05,3.3e-05,3.5e-05,3.5e-05,3.6e-05,2.9e-05,1.8e-05,2.9e-05,2.5e-05,2.3e-05,2.3e-05,1.2e-05,2.1e-05,4.2e-05,5.8e-05,2.8e-05,2.3e-05,2.3e-05,5.7e-05,2.4e-05,1.4e-05,4.3e-05,1.1e-05,2.7e-05,8e-06,2.3e-05,9e-06,7e-06,2.5e-05,1.5e-05,2.4e-05,2.9e-05,5.5e-05,4.9e-05,5.2e-05,8.1e-05,3.1e-05,2.2e-05,7e-06,4e-06,4.5e-05,9e-06,4e-06,5.4e-05,2.5e-05,2.9e-05,2.5e-05,3e-05,7e-06,4.2e-05,5.1e-05,2e-05,2.5e-05,5.4e-05,2.9e-05,2.1e-05,1e-05,1.1e-05,1.1e-05,2.6e-05,6.2e-05,4.1e-05,2.6e-05,3.4e-05,1.8e-05,5e-05,1.8e-05,1.7e-05,2e-05,4.1e-05,1e-05,1.8e-05,1.7e-05,2.7e-05,3.5e-05
4.9e-05,3.4e-05,1.4e-05,3.7e-05,3.4e-05,3.6e-05,2.4e-05,3.2e-05,2.6e-05,3.3e-05,4.2e-05,1.8e-05,3.3e-05,2.6e-05,4.5e-05,2.4e-05,2.5e-05,2.2e-05,2.6e-05,6.9e-05,6.3e-05,1.7e-05,3.4e-05,4.5e-05,5.8e-05,3.6e-05,4e-05,4.5e-05,1.3e-05,3.7e-05,1.4e-05,1.2e-05,1e-05,1.7e-05,2e-05,1.4e-05,1.6e-05,9e-06,3.3e-05,1.7e-05,1.2e-05,3e-05,2.4e-05,3.3e-05,4.1e-05,3.8e-05,1.6e-05,3e-05,3.8e-05,2.8e-05,2.5e-05,4e-06,2.1e-05,3.1e-05,2.6e-05,8e-06,2.7e-05,2.5e-05,4.1e-05,3.9e-05,1.1e-05,2.3e-05,2.6e-05,2.4e-05,4.9e-05,3.6e-05,1.6e-05,4.3e-05,1.6e-05,1.3e-05,3e-05,2.2e-05,1.9e-05,1.6e-05,2.8e-05,6.7e-05,3e-05,2.3e-05,8e-06,4e-06,4.8e-05,3.5e-05,3.1e-05,1.5e-05,1.1e-05,1.7e-05,3e-05,3.4e-05,2.4e-05,2.9e-05,3.6e-05,4.2e-05,1.8e-05,1.4e-05,2.1e-05,2e-05,3.2e-05,7e-06,1.1e-05,3.6e-05,1.5e-05,4.1e-05,4e-05,2.7e-05,1.4e-05,1.5e-05,5.5e-05,7e-06,6e-06,2.2e-05,2.1e-05,2.8e-05,3e-05,2e-05,5e-06,1.3e-05,1.6e-05,2.1e-05,3.6e-05,1.6e-05,2.8e-05
2.2e-05,2.5e-05,1.9e-05,3e-06,1.7e-05,3.5e-05,2.5e-05,4.8e-05,2.8e-05,2.2e-05,2e-05,3.6e-05,4e-06,1.5e-05,3.5e-05,3.2e-05,2.7e-05,2.1e-05,6e-06,4.9e-05,1.2e-05,2.2e-05,2.7e-05,1.2e-05,5e-05,2.4e-05,4.1e-05,1.3e-05,1.2e-05,2.5e-05,4.9e-05,3.9e-05,1.9e-05,2e-05,3.4e-05,1.9e-05,5e-06,2.1e-05,5e-06,3.8e-05,3e-05,3.8e-05,1.9e-05,1.9e-05,4e-05,1.2e-05,4.2e-05,4e-05,9e-06,1.2e-05,8e-06,2.5e-05,1.2e-05,4e-06,1.5e-05,8e-06,1.4e-05,8e-06,3.5e-05,2e-05,1.6e-05,1e-05,3.6e-05,2.3e-05,1.9e-05,2.2e-05,6e-06,3.1e-05,2.1e-05,2.7e-05,2.7e-05,3e-06,9e-06,8e-06,1e-05,4.1e-05,7e-06,3e-06,1.9e-05,2.8e-05,2.1e-05,1.8e-05,1.7e-05,1.4e-05,2.5e-05,2.8e-05,2.3e-05,2.3e-05,1.6e-05,1.5e-05,1.6e-05,1.4e-05,2.1e-05,1.8e-05,1.6e-05,1.7e-05,4.3e-05,1.8e-05,1.7e-05,1.9e-05,1.9e-05,3e-05,1e-05,2.7e-05,2.3e-05,2e-05,3.3e-05,3.8e-05,2.7e-05,2.9e-05,1.2e-05,4e-06,2.1e-05,1.5e-05,2.3e-05,1.7e-05,1.7e-05,1e-05,3.5e-05,1.8e-05,5e-06
1.7e-05,1.7e-05,6e-06,2.4e-05,1.6e-05,3.2e-05,1.6e-05,2.3e-05,2e-05,1.5e-05,2.6e-05,2e-05,1.4e-05,1e-05,1.1e-05,1.1e-05,6e-06,1.1e-05,9e-06,5e-06,1.9e-05,4e-06,5e-06,5e-06,2.8e-05,1e-05,1.8e-05,1.5e-05,6e-06,8e-06,1.2e-05,2.4e-05,6e-06,1.1e-05,1.5e-05,1.6e-05,1.9e-05,3e-05,1.5e-05,2e-05,2e-06,2e-06,1.3e-05,6e-06,2.2e-05,1.7e-05,1.2e-05,1.4e-05,1.4e-05,8e-06,3e-06,1e-05,1.5e-05,9e-06,1.3e-05,2e-06,1.1e-05,7e-06,1.6e-05,1.1e-05,1e-05,5e-06,2.2e-05,5e-06,1.1e-05,6e-06,8e-06,5e-06,1.3e-05,1.8e-05,1.1e-05,7e-06,6e-06,5e-06,1e-05,1e-05,2e-06,7e-06,8e-06,7e-06,1e-05,6e-06,1.2e-05,1.4e-05,2e-06,1.7e-05,1.7e-05,3e-06,1.6e-05,2e-06,9e-06,9e-06,1e-05,1.2e-05,8e-06,1e-06,1.2e-05,1.5e-05,1.1e-05,1.1e-05,9e-06,3e-06,1.8e-05,5e-06,1e-05,4e-06,4e-06,6e-06,4e-06,1.3e-05,1.1e-05,1.1e-05,1.2e-05,1.2e-05,1.1e-05,8e-06,3e-06,1.3e-05,2.3e-05,4e-06,4e-06
1.1e-05,1.6e-05,1.9e-05,3.8e-05,1.2e-05,2.8e-05,2.2e-05,6e-06,6e-06,1.9e-05,2.1e-05,2.1e-05,1.4e-05,4e-06,1.2e-05,1.4e-05,1.5e-05,1.5e-05,4e-06,1.3e-05,2.2e-05,1.1e-05,1.3e-05,5e-06,3.8e-05,1.6e-05,2.9e-05,1.9e-05,2.7e-05,1.4e-05,1e-06,2.8e-05,1.9e-05,1.4e-05,1.8e-05,1.3e-05,8e-06,2.7e-05,1.6e-05,1.9e-05,2.4e-05,1.4e-05,3.2e-05,3.6e-05,1.3e-05,1.3e-05,1.3e-05,1.7e-05,6e-06,1.8e-05,9e-06,1.1e-05,1.4e-05,4e-06,1.8e-05,1.4e-05,2.6e-05,1.1e-05,1.3e-05,1.6e-05,1.2e-05,1e-05,3.6e-05,2.3e-05,9e-06,1.3e-05,9e-06,1e-05,1.1e-05,8e-06,4e-06,4e-06,8e-06,1.6e-05,3.6e-05,2.3e-05,4e-06,5e-06,1e-05,7e-06,5e-06,1.2e-05,1.6e-05,2.2e-05,2.1e-05,2e-05,6e-06,1.1e-05,2.5e-05,8e-06,7e-06,1.2e-05,2e-06,6e-06,1.5e-05,9e-06,8e-06,8e-06,4e-06,3e-06,9e-06,9e-06,1.9e-05,1.4e-05,5e-06,9e-06,1e-06,9e-06,1.7e-05,1.7e-05,6e-06,2.2e-05,1.7e-05,1.3e-05,1.4e-05,1.5e-05,1.1e-05,1e-05,1.3e-05,6e-06,1.4e-05
3e-06,1e-05,1.2e-05,3.2e-05,2.8e-05,3.7e-05,2.7e-05,9e-06,1.9e-05,1e-05,1.3e-05,1.5e-05,2.5e-05,2.6e-05,1.9e-05,2.9e-05,1.1e-05,2.2e-05,2.3e-05,2e-05,1.3e-05,1.8e-05,2e-06,8e-06,4.1e-05,3.5e-05,3.7e-05,1.4e-05,2.9e-05,2.6e-05,8e-06,2.7e-05,1.4e-05,8e-06,1.2e-05,3.2e-05,3.5e-05,7e-06,5e-06,2.8e-05,2.4e-05,3.5e-05,1.3e-05,3.3e-05,5e-05,3.5e-05,3.2e-05,2.1e-05,1.2e-05,1.5e-05,2.6e-05,8e-06,5e-06,1.6e-05,1.4e-05,1.1e-05,2.1e-05,2.9e-05,2.9e-05,1.7e-05,1.8e-05,4e-06,3e-05,2.3e-05,2.4e-05,8e-06,2.2e-05,1.8e-05,3e-06,1e-05,4e-06,5e-06,2e-05,9e-06,2.8e-05,1.8e-05,2.1e-05,6e-06,2.3e-05,1.3e-05,4e-06,1.9e-05,2.1e-05,1.4e-05,1.6e-05,3e-06,2.5e-05,1.1e-05,2.1e-05,2.3e-05,2.1e-05,3e-05,2.1e-05,1.6e-05,1.3e-05,1.5e-05,1.8e-05,8e-06,8e-06,3e-06,1.3e-05,2.2e-05,1.8e-05,1e-05,5e-06,1.3e-05,2.1e-05,7e-06,1.8e-05,2.7e-05,2.1e-05,1.9e-05,2.2e-05,1.6e-05,1e-05,7e-06,6e-06,1.9e-05,3.2e-05,2.4e-05,1.6e-05
1.2e-05,9e-06,5e-06,2.5e-05,5e-06,2.4e-05,4e-06,3.2e-05,3.7e-05,2.9e-05,3.9e-05,4e-05,1.8e-05,2.1e-05,1e-06,2e-05,3e-06,1.9e-05,2e-05,1.6e-05,1.1e-05,1.6e-05,1.5e-05,7e-06,3.8e-05,4.9e-05,1.5e-05,5e-06,2.8e-05,2.1e-05,1.7e-05,1.5e-05,7e-06,7e-06,2e-05,1.4e-05,2.8e-05,1.8e-05,1.1e-05,3e-05,2.5e-05,1.3e-05,1.9e-05,2.2e-05,4.3e-05,2.8e-05,4e-05,3.7e-05,3.3e-05,1.5e-05,2.3e-05,2.9e-05,2.8e-05,3.1e-05,3.7e-05,2.2e-05,2.7e-05,5e-06,5e-06,1.3e-05,1.7e-05,1e-05,1.7e-05,1.3e-05,2.2e-05,1.8e-05,1.1e-05,1.4e-05,1.8e-05,7e-06,7e-06,4e-06,1.9e-05,2e-05,1.5e-05,6e-06,3.1e-05,3.9e-05,3.6e-05,2e-05,1.9e-05,2.9e-05,1e-05,1.6e-05,1.7e-05,1.6e-05,3.6e-05,1.5e-05,1.9e-05,3.3e-05,2.6e-05,1.9e-05,7e-06,1.3e-05,1.2e-05,1.4e-05,9e-06,8e-06,1.5e-05,7e-06,1e-05,1e-05,6e-06,5e-06,7e-06,1e-05,2.1e-05,1.2e-05,1.3e-05,2.9e-05,1.2e-05,8e-06,1.3e-05,1.4e-05,5e-06,6e-06,1.4e-05,2.3e-05,3e-06,1.8e-05,2e-06
1.1e-05,1.2e-05,1.4e-05,1.7e-05,1.5e-05,8e-06,2.2e-05,3.7e-05,1.2e-05,1.3e-05,2.2e-05,2.7e-05,1.6e-05,5e-06,1e-05,9e-06,2.2e-05,2.5e-05,8e-06,2.7e-05,1.3e-05,2e-05,8e-06,1.9e-05,1e-05,1.2e-05,3.6e-05,3.4e-05,1.6e-05,7e-06,8e-06,4e-06,5e-06,4e-06,1e-05,1.1e-05,2.6e-05,1.5e-05,7e-06,1.3e-05,7e-06,6e-06,5e-06,2.2e-05,2.7e-05,2.5e-05,4.1e-05,1.5e-05,1e-06,7e-06,8e-06,5e-06,1.7e-05,1.1e-05,1.6e-05,4e-06,2.2e-05,1.9e-05,1.2e-05,1.4e-05,1.6e-05,9e-06,1.2e-05,2.1e-05,1.3e-05,1e-06,8e-06,5e-06,1.6e-05,2.1e-05,1.7e-05,6e-06,1.2e-05,1.7e-05,2.5e-05,2.3e-05,1.6e-05,1.3e-05,8e-06,3e-06,1.9e-05,8e-06,9e-06,1.1e-05,1.3e-05,1.5e-05,5e-06,9e-06,1.5e-05,1.1e-05,2.5e-05,3e-06,5e-06,1.2e-05,8e-06,7e-06,1.1e-05,6e-06,1.1e-05,5e-06,1.3e-05,7e-06,1.9e-05,5e-06,4e-06,4e-06,9e-06,6e-06,1.1e-05,1.8e-05,1.5e-05,6e-06,1.5e-05,6e-06,4e-06,8e-06,1.1e-05,1e-05,9e-06,1.1e-05,1.2e-05
9e-06,1.3e-05,1.3e-05,2.2e-05,6e-06,4e-06,1.7e-05,1.2e-05,1.7e-05,8e-06,7e-06,6e-06,7e-06,7e-06,1.3e-05,8e-06,1.4e-05,1.7e-05,8e-06,1e-05,1e-05,1.3e-05,1e-05,1.2e-05,1e-05,1.6e-05,3.2e-05,1.9e-05,1.6e-05,9e-06,1e-05,1.2e-05,1.2e-05,7e-06,6e-06,7e-06,2.2e-05,1.3e-05,9e-06,1.6e-05,1.7e-05,8e-06,2e-06,1.9e-05,1.9e-05,6e-06,1.4e-05,1.7e-05,8e-06,7e-06,1.1e-05,4e-06,1.4e-05,1.1e-05,1e-05,8e-06,1.5e-05,7e-06,8e-06,5e-06,2e-06,1.1e-05,3e-06,1.4e-05,3e-06,3e-06,7e-06,8e-06,8e-06,8e-06,8e-06,1e-06,1.3e-05,4e-06,1e-05,1e-05,9e-06,1.2e-05,4e-06,1e-05,9e-06,8e-06,1.4e-05,7e-06,9e-06,1.2e-05,5e-06,9e-06,1.6e-05,8e-06,1.6e-05,1.2e-05,9e-06,5e-06,6e-06,1.3e-05,5e-06,5e-06,2e-06,5e-06,1.4e-05,8e-06,1.6e-05,1.5e-05,6e-06,5e-06,3e-06,2e-06,1e-05,6e-06,5e-06,6e-06,9e-06,9e-06,1.1e-05,7e-06,5e-06,6e-06,1.1e-05,7e-06,8e-06
7e-06,1.5e-05,2e-05,1.4e-05,1.8e-05,1.3e-05,1.3e-05,7e-06,1.9e-05,3.3e-05,1.4e-05,8e-06,8e-06,1e-05,8e-06,7e-06,7e-06,2e-05,2.8e-05,3.1e-05,1.3e-05,5e-06,1.2e-05,1.1e-05,1e-05,2.3e-05,1.9e-05,5e-06,2.4e-05,1.3e-05,1.4e-05,1.2e-05,1.4e-05,1e-05,1.2e-05,2e-06,1.6e-05,1.8e-05,1.2e-05,1.9e-05,1e-06,5e-06,1e-05,1.7e-05,2.8e-05,2.7e-05,2.3e-05,2.8e-05,2e-05,1.2e-05,1.9e-05,2.4e-05,6e-06,9e-06,1e-05,6e-06,8e-06,1.3e-05,1.2e-05,4e-06,8e-06,1.9e-05,1.2e-05,9e-06,2e-06,5e-06,1.3e-05,5e-06,9e-06,2e-06,1e-05,8e-06,1.8e-05,1.4e-05,3e-06,6e-06,1.2e-05,1.3e-05,0,1.9e-05,1.1e-05,9e-06,1.3e-05,1.7e-05,6e-06,1e-06,1.9e-05,1.4e-05,2e-06,1.1e-05,2.6e-05,1.7e-05,5e-06,6e-06,1.2e-05,5e-06,1.3e-05,8e-06,1e-06,6e-06,1e-05,1.2e-05,1.7e-05,1.2e-05,9e-06,1e-05,1.3e-05,1.3e-05,6e-06,2e-06,1e-06,1e-05,9e-06,1.6e-05,2e-06,1.2e-05,1e-06,3e-06,5e-06,1.2e-05,1.1e-05
2.4e-05,2.6e-05,1.9e-05,1.8e-05,2.3e-05,9e-06,3e-06,1.1e-05,2e-05,2.6e-05,2.6e-05,1.6e-05,2e-05,1.8e-05,2.4e-05,7e-06,1e-05,8e-06,1.7e-05,6e-06,1.6e-05,1.4e-05,9e-06,6e-06,1e-05,3.6e-05,3.1e-05,1.1e-05,1.4e-05,1.4e-05,2e-05,1.6e-05,1.1e-05,5e-06,6e-06,1e-06,1.4e-05,1.5e-05,1.3e-05,1e-05,1e-05,2e-05,1.7e-05,8e-06,1.5e-05,1e-06,2e-05,2.7e-05,7e-06,5e-06,1.8e-05,1.8e-05,2e-05,7e-06,9e-06,7e-06,8e-06,1.2e-05,1e-05,6e-06,1.1e-05,1.2e-05,8e-06,6e-06,6e-06,8e-06,5e-06,2e-06,4e-06,4e-06,1e-05,2e-06,1e-05,9e-06,8e-06,2e-06,1.9e-05,1.8e-05,8e-06,2.2e-05,9e-06,7e-06,7e-06,1.9e-05,2.6e-05,1.2e-05,2e-05,8e-06,4e-06,1.4e-05,1.2e-05,6e-06,7e-06,7e-06,1.3e-05,1.5e-05,1.1e-05,1e-05,1e-05,3e-06,9e-06,5e-06,7e-06,8e-06,6e-06,5e-06,9e-06,1e-05,1e-05,7e-06,5e-06,1e-05,1.4e-05,1.6e-05,9e-06,1.3e-05,1.2e-05,5e-06,6e-06,9e-06,1.5e-05
6e-06,7e-06,1.5e-05,8e-06,6e-06,8e-06,7e-06,1.8e-05,4e-06,1.6e-05,1.3e-05,9e-06,1.6e-05,9e-06,1.3e-05,1.2e-05,2.2e-05,9e-06,8e-06,3e-06,1.6e-05,8e-06,2.1e-05,2.5e-05,1.4e-05,1.8e-05,1e-05,6e-06,4e-06,1.6e-05,2.5e-05,8e-06,1.4e-05,6e-06,4e-06,8e-06,1.4e-05,1.5e-05,1e-05,4e-06,1.3e-05,1.3e-05,1e-05,1.5e-05,1.5e-05,1e-05,4e-06,5e-06,6e-06,1.2e-05,9e-06,2e-05,1.4e-05,9e-06,1.1e-05,3e-06,2e-06,1.3e-05,1.2e-05,9e-06,3e-06,8e-06,6e-06,9e-06,0,7e-06,9e-06,1.6e-05,1.1e-05,5e-06,1e-05,7e-06,6e-06,4e-06,5e-06,3e-06,1.2e-05,1.7e-05,9e-06,5e-06,8e-06,7e-06,9e-06,1.6e-05,5e-06,3e-06,7e-06,3e-06,8e-06,1.1e-05,1.4e-05,3e-06,2e-06,4e-06,1.4e-05,1e-06,3e-06,6e-06,2e-06,2e-06,3e-06,8e-06,4e-06,6e-06,6e-06,1.1e-05,1.1e-05,6e-06,4e-06,6e-06,5e-06,1e-05,7e-06,8e-06,7e-06,2e-06,7e-06,1e-05,8e-06,5e-06,7e-06
6e-06,9e-06,1.2e-05,1.7e-05,2.2e-05,1.9e-05,1.8e-05,7e-06,1.2e-05,9e-06,5e-06,3e-06,9e-06,1e-05,1e-05,1.2e-05,9e-06,2e-05,2.1e-05,1.6e-05,1.2e-05,2.6e-05,1.8e-05,1.1e-05,6e-06,9e-06,1.4e-05,1.9e-05,6e-06,1.8e-05,6e-06,1.4e-05,1.1e-05,1e-05,2e-06,3e-06,1e-05,2e-06,1.1e-05,1.5e-05,2.2e-05,1e-05,1.5e-05,1e-05,1.4e-05,1.7e-05,1e-05,5e-06,3e-06,8e-06,1.6e-05,1.7e-05,1.3e-05,2.2e-05,1.5e-05,1.3e-05,2e-06,5e-06,1.1e-05,8e-06,6e-06,9e-06,6e-06,1.4e-05,6e-06,1.3e-05,1.6e-05,2e-05,5e-06,1e-06,2e-06,7e-06,1e-05,5e-06,4e-06,5e-06,5e-06,1.5e-05,2e-06,4e-06,7e-06,1.3e-05,1.1e-05,5e-06,6e-06,4e-06,9e-06,3e-06,8e-06,2e-06,1.2e-05,7e-06,6e-06,5e-06,4e-06,7e-06,8e-06,2e-06,3e-06,2e-06,3e-06,2e-06,4e-06,2e-06,2e-06,8e-06,4e-06,1.1e-05,4e-06,6e-06,2e-06,1.1e-05,4e-06,5e-06,0,2e-06,7e-06,7e-06,7e-06,5e-06,3e-06
3e-06,1.2e-05,1.1e-05,1.5e-05,1.3e-05,9e-06,6e-06,1.2e-05,1e-05,1.1e-05,8e-06,9e-06,1.7e-05,4e-06,1.2e-05,1.3e-05,1.3e-05,1.1e-05,5e-06,1.5e-05,1.4e-05,2.7e-05,2e-06,1.6e-05,1.3e-05,6e-06,1e-06,2e-05,1e-05,3e-06,1e-05,1.7e-05,2e-06,7e-06,6e-06,2e-06,8e-06,1.4e-05,1.7e-05,1.5e-05,1e-05,3e-06,1.2e-05,2e-05,1.3e-05,1e-05,4e-06,5e-06,4e-06,9e-06,1.3e-05,1.3e-05,2e-05,1.3e-05,5e-06,4e-06,1.1e-05,3e-06,6e-06,4e-06,1.1e-05,1.1e-05,1.7e-05,1.5e-05,3e-06,1.3e-05,5e-06,1.2e-05,8e-06,6e-06,5e-06,9e-06,3e-06,4e-06,4e-06,1e-05,1e-06,1.5e-05,1e-05,9e-06,1.3e-05,1.1e-05,2e-05,1.6e-05,1.1e-05,8e-06,2e-06,6e-06,2e-06,5e-06,1.4e-05,3e-06,3e-06,5e-06,6e-06,5e-06,3e-06,4e-06,1e-06,7e-06,2e-06,2e-06,4e-06,4e-06,4e-06,5e-06,9e-06,1.1e-05,6e-06,6e-06,9e-06,1.2e-05,1e-05,3e-06,5e-06,4e-06,5e-06,8e-06,9e-06,1e-06,3e-06
6e-06,1e-05,1.7e-05,8e-06,1.3e-05,9e-06,6e-06,9e-06,2.1e-05,2.9e-05,2e-06,1.7e-05,1.7e-05,1.3e-05,8e-06,2e-06,1.5e-05,6e-06,2e-05,9e-06,1.5e-05,1.2e-05,4e-06,6e-06,6e-06,1e-05,1.2e-05,2.1e-05,4e-06,7e-06,1.1e-05,2.6e-05,8e-06,1.1e-05,7e-06,4e-06,6e-06,8e-06,1.6e-05,9e-06,1.2e-05,8e-06,3e-06,1e-05,4e-06,1.1e-05,1.4e-05,8e-06,5e-06,4e-06,8e-06,1.4e-05,1.4e-05,2.6e-05,1e-05,1.1e-05,1.6e-05,8e-06,4e-06,1e-06,1.2e-05,7e-06,3e-06,1.3e-05,1.5e-05,2e-06,9e-06,1.4e-05,6e-06,6e-06,1e-05,1.1e-05,1.1e-05,4e-06,4e-06,7e-06,4e-06,8e-06,7e-06,9e-06,1.4e-05,1.4e-05,1.3e-05,1e-05,6e-06,1e-06,8e-06,1.4e-05,9e-06,8e-06,1.4e-05,7e-06,9e-06,1.3e-05,6e-06,1e-06,1e-06,4e-06,7e-06,6e-06,2e-06,3e-06,1.3e-05,6e-06,9e-06,3e-06,9e-06,9e-06,3e-06,1.1e-05,7e-06,9e-06,1e-05,7e-06,9e-06,7e-06,4e-06,5e-06,1.1e-05,9e-06,5e-06
1.5e-05,4e-06,3.4e-05,1.9e-05,2.1e-05,1.3e-05,1.2e-05,2.2e-05,3.6e-05,2e-06,2.5e-05,9e-06,2.3e-05,1.3e-05,3.9e-05,2.9e-05,2.1e-05,1.3e-05,3.3e-05,2.7e-05,1.8e-05,1.6e-05,9e-06,1.8e-05,2e-06,5e-06,1.1e-05,1.5e-05,2.8e-05,1.4e-05,5e-06,3e-05,2.7e-05,1.5e-05,1e-06,4e-06,6e-06,1.6e-05,2.8e-05,1.9e-05,2.3e-05,5e-06,1.3e-05,6e-06,9e-06,7e-06,8e-06,2.5e-05,1.6e-05,1e-06,9e-06,7e-06,1.4e-05,2e-05,1.9e-05,1.4e-05,1.6e-05,4e-06,4e-06,1.2e-05,9e-06,4e-06,8e-06,1e-06,7e-06,1e-05,1.1e-05,1.1e-05,8e-06,1.4e-05,2e-05,9e-06,9e-06,9e-06,7e-06,3e-06,6e-06,8e-06,6e-06,2.1e-05,4e-06,1.1e-05,6e-06,2.2e-05,9e-06,4e-06,1.7e-05,2.3e-05,8e-06,1e-05,1.3e-05,4e-06,1.1e-05,7e-06,5e-06,6e-06,5e-06,4e-06,6e-06,1e-05,1e-05,2e-06,1.4e-05,5e-06,4e-06,2e-06,8e-06,1e-05,2e-06,5e-06,2e-06,6e-06,5e-06,1.1e-05,1.4e-05,1e-05,6e-06,3e-06,6e-06,7e-06,6e-06
1.4e-05,1.2e-05,5e-05,4.7e-05,3.7e-05,2.3e-05,3e-06,1.6e-05,2e-05,2.4e-05,2e-05,2.8e-05,4.4e-05,2.3e-05,4.8e-05,4.9e-05,3.9e-05,2.3e-05,4.8e-05,3.6e-05,9e-06,3e-06,8e-06,2.5e-05,2.6e-05,2.6e-05,1.9e-05,3.1e-05,5e-05,4.1e-05,1.8e-05,2.1e-05,4.5e-05,3.5e-05,2.9e-05,1.5e-05,1e-06,3.1e-05,1.4e-05,1.1e-05,3.6e-05,3.2e-05,2.7e-05,5e-06,2e-05,2.5e-05,1.8e-05,2.5e-05,1.9e-05,1.5e-05,2e-05,6e-06,1.2e-05,3e-06,2.4e-05,3.6e-05,4.5e-05,3.2e-05,1.4e-05,2.7e-05,3.6e-05,2e-05,1e-05,2e-05,1.8e-05,1.3e-05,4e-06,1.2e-05,2e-05,6e-06,1.8e-05,1.8e-05,8e-06,1.8e-05,1.1e-05,1.3e-05,7e-06,1.3e-05,7e-06,1.3e-05,1.1e-05,4e-06,8e-06,3.3e-05,2e-05,5e-06,1.8e-05,2.4e-05,1.3e-05,1.3e-05,2.9e-05,1.7e-05,1.8e-05,1.9e-05,1.5e-05,1.3e-05,1.5e-05,1.5e-05,1.1e-05,1.6e-05,2.8e-05,1.6e-05,1.1e-05,1e-06,5e-06,8e-06,1.1e-05,1.6e-05,1.7e-05,1.3e-05,1.2e-05,1e-05,9e-06,1.7e-05,1.2e-05,1.2e-05,9e-06,4e-06,1.1e-05,1.1e-05,7e-06
5e-05,5.6e-05,3.7e-05,2.4e-05,1.6e-05,6e-06,5e-06,1.5e-05,1.5e-05,1e-05,1.9e-05,4.1e-05,3.9e-05,3.2e-05,4.3e-05,2.6e-05,2.3e-05,4e-06,3.3e-05,6e-06,1.4e-05,2e-05,1.5e-05,1.2e-05,1.1e-05,2.2e-05,3.5e-05,4e-06,2.7e-05,1.5e-05,1.1e-05,1.2e-05,2.8e-05,7e-06,1.5e-05,4e-06,8e-06,3.3e-05,2.9e-05,2.8e-05,3.6e-05,5.3e-05,2.7e-05,1.7e-05,1.3e-05,1.8e-05,2.5e-05,2e-05,8e-06,1.1e-05,1.9e-05,2.6e-05,5e-06,9e-06,2.6e-05,6e-06,2e-05,2.5e-05,2.2e-05,1.9e-05,2.6e-05,2.5e-05,9e-06,1.7e-05,1.3e-05,1.6e-05,1.5e-05,1.8e-05,1.8e-05,2.1e-05,2.9e-05,2.8e-05,1.9e-05,6e-06,5e-06,2.1e-05,1.1e-05,1.5e-05,7e-06,4e-06,5e-06,4e-06,6e-06,2.1e-05,2.4e-05,1.9e-05,1.1e-05,1.5e-05,9e-06,7e-06,1.5e-05,1e-05,5e-06,1e-05,1.5e-05,1e-05,1.1e-05,1.4e-05,1.3e-05,2.9e-05,1.7e-05,8e-06,5e-06,5e-06,1e-05,1.6e-05,2.1e-05,2.4e-05,1.3e-05,1e-06,7e-06,6e-06,1e-05,1.1e-05,7e-06,8e-06,9e-06,4e-06,1.8e-05,1.8e-05,7e-06
1.5e-05,2.3e-05,1.1e-05,1.3e-05,2e-06,4e-06,7e-06,4e-06,1e-05,9e-06,2.4e-05,2.9e-05,9e-06,7e-06,2e-05,6e-06,9e-06,1.8e-05,1e-06,1.7e-05,1.1e-05,7e-06,1e-05,1.2e-05,9e-06,1.3e-05,8e-06,1.4e-05,7e-06,5e-06,5e-06,1.2e-05,1.2e-05,6e-06,3e-06,9e-06,1.2e-05,1.5e-05,1.3e-05,1.2e-05,2.2e-05,1.7e-05,5e-06,5e-06,1.2e-05,4e-06,1.5e-05,1e-05,5e-06,7e-06,4e-06,9e-06,1e-05,8e-06,1e-05,1.4e-05,1.6e-05,5e-06,9e-06,1.1e-05,1.6e-05,1.3e-05,1.1e-05,5e-06,2e-06,1.3e-05,7e-06,6e-06,1.1e-05,6e-06,1.2e-05,8e-06,3e-06,9e-06,4e-06,1.4e-05,8e-06,2e-06,1e-06,5e-06,6e-06,8e-06,4e-06,1.3e-05,3e-06,1e-05,1.6e-05,1e-05,4e-06,4e-06,6e-06,1e-06,4e-06,2e-06,3e-06,2e-06,6e-06,5e-06,5e-06,1.5e-05,4e-06,3e-06,9e-06,7e-06,8e-06,6e-06,4e-06,1e-06,1.1e-05,1e-05,2e-06,6e-06,6e-06,3e-06,2e-06,6e-06,1e-06,3e-06,1.3e-05,8e-06,5e-06
6e-06,1.8e-05,9e-06,5e-06,2e-06,7e-06,5e-06,7e-06,2e-06,4e-06,1.7e-05,1.2e-05,6e-06,2e-06,1.2e-05,7e-06,5e-06,8e-06,1.3e-05,3e-06,2e-06,1.1e-05,8e-06,4e-06,9e-06,9e-06,7e-06,6e-06,5e-06,4e-06,7e-06,3e-06,6e-06,6e-06,4e-06,6e-06,3e-06,3e-06,1e-05,8e-06,5e-06,1.6e-05,5e-06,5e-06,7e-06,6e-06,4e-06,2e-06,7e-06,2e-06,2e-06,1e-06,2e-06,4e-06,3e-06,4e-06,7e-06,1e-05,7e-06,9e-06,1.2e-05,3e-06,1e-06,2e-06,4e-06,4e-06,2e-06,3e-06,5e-06,3e-06,4e-06,4e-06,3e-06,1e-06,1e-06,5e-06,8e-06,7e-06,1e-06,5e-06,3e-06,2e-06,3e-06,6e-06,5e-06,7e-06,1e-05,4e-06,1e-06,0,6e-06,0,2e-06,2e-06,2e-06,3e-06,4e-06,3e-06,2e-06,7e-06,2e-06,1e-06,9e-06,4e-06,6e-06,4e-06,2e-06,2e-06,7e-06,4e-06,2e-06,3e-06,3e-06,3e-06,2e-06,3e-06,2e-06,3e-06,1e-05,4e-06,2e-06
6e-06,1.4e-05,8e-06,4e-06,3e-06,3e-06,1e-06,2e-06,4e-06,3e-06,1.6e-05,1e-05,3e-06,3e-06,9e-06,4e-06,2e-06,1.1e-05,1.2e-05,2e-06,3e-06,9e-06,7e-06,4e-06,6e-06,3e-06,8e-06,4e-06,4e-06,4e-06,6e-06,5e-06,1e-05,5e-06,2e-06,5e-06,3e-06,9e-06,3e-06,6e-06,6e-06,1.3e-05,5e-06,4e-06,8e-06,5e-06,3e-06,4e-06,4e-06,2e-06,2e-06,5e-06,2e-06,5e-06,5e-06,1e-06,5e-06,5e-06,4e-06,6e-06,7e-06,4e-06,3e-06,3e-06,5e-06,2e-06,2e-06,4e-06,2e-06,2e-06,4e-06,2e-06,5e-06,2e-06,3e-06,6e-06,6e-06,2e-06,3e-06,3e-06,1e-06,1e-06,2e-06,2e-06,3e-06,5e-06,8e-06,2e-06,0,1e-06,6e-06,1e-06,2e-06,2e-06,1e-06,3e-06,5e-06,2e-06,3e-06,5e-06,4e-06,1e-06,8e-06,1e-06,5e-06,5e-06,0,1e-06,2e-06,5e-06,1e-06,5e-06,1e-06,2e-06,1e-06,1e-06,3e-06,1e-06,8e-06,1e-06,1e-06
4e-06,1.2e-05,7e-06,2e-06,1e-06,5e-06,2e-06,2e-06,3e-06,2e-06,1.3e-05,9e-06,2e-06,3e-06,8e-06,1e-06,2e-06,9e-06,1.2e-05,1e-06,2e-06,9e-06,6e-06,4e-06,4e-06,5e-06,8e-06,4e-06,5e-06,3e-06,7e-06,2e-06,7e-06,5e-06,3e-06,4e-06,2e-06,1e-05,4e-06,6e-06,4e-06,1e-05,4e-06,2e-06,6e-06,3e-06,4e-06,4e-06,1e-06,1e-06,2e-06,5e-06,1e-06,5e-06,5e-06,1e-06,2e-06,5e-06,3e-06,7e-06,4e-06,2e-06,2e-06,1e-06,5e-06,1e-06,2e-06,3e-06,1e-06,2e-06,2e-06,3e-06,3e-06,3e-06,2e-06,7e-06,7e-06,9e-06,3e-06,3e-06,1e-06,1e-06,1e-06,1e-06,4e-06,4e-06,7e-06,3e-06,1e-06,1e-06,6e-06,2e-06,0,2e-06,1e-06,2e-06,2e-06,2e-06,2e-06,5e-06,3e-06,1e-06,6e-06,1e-06,4e-06,3e-06,3e-06,2e-06,2e-06,3e-06,1e-06,3e-06,2e-06,3e-06,0,0,3e-06,1e-06,7e-06,3e-06,1e-06
3e-06,1.1e-05,5e-06,3e-06,1e-06,3e-06,1e-06,1e-06,3e-06,3e-06,1.3e-05,1e-05,1e-06,3e-06,7e-06,1e-06,1e-06,9e-06,1.1e-05,1e-06,2e-06,1e-05,5e-06,4e-06,4e-06,3e-06,7e-06,4e-06,4e-06,3e-06,7e-06,2e-06,6e-06,4e-06,2e-06,3e-06,2e-06,1e-05,2e-06,7e-06,3e-06,1e-05,4e-06,3e-06,6e-06,2e-06,4e-06,4e-06,1e-06,0,2e-06,5e-06,2e-06,4e-06,4e-06,1e-06,1e-06,4e-06,3e-06,6e-06,5e-06,2e-06,2e-06,2e-06,4e-06,1e-06,3e-06,3e-06,1e-06,1e-06,3e-06,2e-06,3e-06,2e-06,3e-06,7e-06,5e-06,6e-06,2e-06,3e-06,1e-06,2e-06,1e-06,1e-06,4e-06,5e-06,7e-06,3e-06,1e-06,1e-06,6e-06,1e-06,1e-06,1e-06,1e-06,1e-06,3e-06,1e-06,2e-06,5e-06,3e-06,1e-06,6e-06,1e-06,4e-06,2e-06,2e-06,2e-06,3e-06,4e-06,2e-06,3e-06,3e-06,2e-06,1e-06,0,3e-06,1e-06,8e-06,3e-06,1e-06
