0.076959,0.081141,0.082604,0.081945,0.075605,0.073606,0.075449,0.070433,0.064525,0.057671,0.048476,0.051145,0.06236,0.066145,0.059161,0.057258,0.071017,0.075817,0.071011,0.070768,0.06662,0.061931,0.058841,0.055871,0.050905,0.044999,0.041903,0.042573
0.105566,0.112328,0.113269,0.110038,0.100141,0.098946,0.103602,0.097114,0.087987,0.0778,0.063728,0.066377,0.081477,0.086615,0.079166,0.077718,0.096871,0.101644,0.094812,0.095865,0.090316,0.083458,0.075243,0.069884,0.066558,0.061184,0.056744,0.057433
0.159205,0.170725,0.171925,0.164205,0.147483,0.147989,0.157678,0.148802,0.133782,0.116123,0.09182,0.093924,0.117041,0.126094,0.118275,0.117414,0.146434,0.15026,0.139217,0.143135,0.135384,0.124387,0.106082,0.096402,0.096779,0.09224,0.084478,0.085353
0.204635,0.220274,0.22343,0.212385,0.189886,0.191993,0.205877,0.197479,0.177368,0.150834,0.116117,0.116209,0.147918,0.161403,0.153747,0.154943,0.19202,0.193994,0.179547,0.185685,0.175687,0.161575,0.134758,0.120864,0.124397,0.120229,0.108692,0.11046
0.215089,0.231579,0.238124,0.22526,0.202812,0.205632,0.217879,0.21396,0.194475,0.164979,0.12764,0.123005,0.157272,0.172626,0.166728,0.172896,0.209951,0.21034,0.195184,0.200544,0.189144,0.174402,0.14782,0.132145,0.134577,0.128741,0.11545,0.119155
0.194728,0.21216,0.223501,0.211042,0.197171,0.196682,0.194884,0.194108,0.183218,0.162815,0.135332,0.125,0.153047,0.171836,0.172238,0.179619,0.201545,0.199919,0.186979,0.189981,0.180162,0.168137,0.154832,0.141658,0.134366,0.119257,0.106311,0.113547
0.223112,0.251374,0.261813,0.255201,0.24995,0.235161,0.216615,0.217909,0.219447,0.210275,0.182133,0.164036,0.199055,0.234336,0.231811,0.228539,0.241895,0.237503,0.220762,0.223564,0.214233,0.205633,0.212196,0.201247,0.175302,0.138179,0.12275,0.137077
0.34908,0.392718,0.407485,0.433472,0.427909,0.388123,0.357573,0.359209,0.3683,0.354447,0.292757,0.257419,0.329219,0.403288,0.391417,0.371924,0.389442,0.380255,0.356905,0.367727,0.349727,0.339436,0.36519,0.351903,0.306537,0.233859,0.201205,0.22224
0.565246,0.635293,0.667376,0.762103,0.754585,0.673443,0.620283,0.622358,0.64201,0.601453,0.467452,0.403302,0.553161,0.708827,0.682309,0.635383,0.655855,0.630824,0.600569,0.630538,0.590209,0.576406,0.641989,0.623339,0.540782,0.411843,0.352416,0.37969
0.866671,0.998887,1.07082,1.262745,1.257763,1.107604,0.9928,0.992605,1.042299,0.959374,0.705282,0.59381,0.8717,1.158121,1.108803,1.030096,1.040012,0.981436,0.957806,1.017439,0.927321,0.900959,1.035191,1.00489,0.858787,0.659347,0.573971,0.613574
1.161195,1.387152,1.526872,1.827556,1.830639,1.604006,1.395381,1.380834,1.475091,1.35421,0.963558,0.784287,1.200704,1.637015,1.561223,1.456296,1.438772,1.341932,1.349585,1.440998,1.289825,1.2458,1.448194,1.384549,1.153994,0.897522,0.80637,0.864181
1.280213,1.591494,1.798633,2.160657,2.176102,1.911766,1.621432,1.579718,1.713057,1.583821,1.110677,0.878989,1.365221,1.883743,1.800155,1.69521,1.643413,1.538585,1.588744,1.692085,1.50204,1.432365,1.65501,1.537201,1.236433,0.978462,0.917309,0.990979
1.104717,1.418922,1.636481,1.954966,1.981428,1.761183,1.464168,1.393185,1.536478,1.455504,1.032088,0.804056,1.212876,1.65605,1.602656,1.534285,1.465467,1.41451,1.491805,1.56195,1.37837,1.285544,1.464752,1.307811,1.000743,0.808243,0.792909,0.866157
0.749344,0.949507,1.092393,1.2866,1.315393,1.199495,1.00109,0.922508,1.023441,1.019513,0.776565,0.615352,0.8193,1.056635,1.072775,1.059364,0.985878,1.005004,1.09124,1.10822,0.962799,0.864129,0.959433,0.835422,0.623402,0.510598,0.498699,0.547402
0.538563,0.571911,0.589795,0.669171,0.699604,0.671827,0.621694,0.56166,0.582686,0.635596,0.592818,0.520616,0.543717,0.588329,0.626745,0.637552,0.597106,0.655265,0.735101,0.703169,0.580364,0.504435,0.510215,0.454064,0.378835,0.323183,0.283898,0.301546
0.588243,0.525599,0.483926,0.548951,0.609744,0.632587,0.627101,0.561463,0.566892,0.639888,0.655941,0.609983,0.585717,0.59409,0.62289,0.612842,0.61284,0.675004,0.716533,0.641361,0.499734,0.429173,0.371338,0.341997,0.349419,0.317313,0.284169,0.302535
0.742839,0.662461,0.638369,0.752927,0.793471,0.793115,0.786086,0.737831,0.780454,0.836959,0.85189,0.827949,0.767893,0.773148,0.839449,0.860574,0.908532,0.954595,0.93202,0.803058,0.619963,0.541508,0.478875,0.440869,0.447203,0.405194,0.37394,0.41196
0.949715,0.895163,0.923579,1.074239,1.06626,0.992466,0.955285,0.959714,1.068575,1.080853,1.045805,1.052938,0.963014,0.958344,1.066173,1.149888,1.276322,1.292686,1.162665,0.987221,0.834274,0.807302,0.745186,0.646227,0.603404,0.537059,0.501554,0.589072
1.21642,1.214275,1.287034,1.4197,1.376399,1.271375,1.233804,1.261683,1.370033,1.292617,1.167617,1.251055,1.216023,1.197689,1.281614,1.410577,1.610609,1.598155,1.360102,1.151625,1.107422,1.198925,1.121937,0.892739,0.752892,0.693225,0.683113,0.809643
1.474178,1.527089,1.573138,1.686799,1.647152,1.555063,1.541788,1.551379,1.619588,1.483257,1.332138,1.495449,1.502967,1.474985,1.496991,1.585169,1.806654,1.786111,1.440324,1.267126,1.428947,1.612702,1.453516,1.076441,0.863694,0.866841,0.892869,1.005748
1.53317,1.632179,1.613272,1.72888,1.727345,1.645982,1.631438,1.646195,1.664121,1.53479,1.538582,1.76316,1.723874,1.658568,1.599835,1.5326,1.678105,1.734146,1.40262,1.351333,1.680959,1.807695,1.510707,1.067768,0.879316,0.980397,1.044817,1.076118
1.327597,1.411494,1.386,1.546402,1.596824,1.463007,1.362831,1.387606,1.382901,1.335123,1.55652,1.775362,1.689443,1.585468,1.457211,1.257409,1.261683,1.388054,1.234068,1.357584,1.683915,1.620075,1.221416,0.847073,0.761967,0.946325,1.042509,0.965957
1.100564,1.083343,1.079883,1.222898,1.265416,1.091496,0.930643,0.998944,1.033136,1.06749,1.336403,1.452314,1.402342,1.29809,1.190073,1.041187,0.944587,1.017512,1.025643,1.298247,1.543615,1.335582,0.966751,0.743659,0.706604,0.806955,0.83491,0.709488
1.081243,1.008217,0.977646,1.037696,0.950244,0.745189,0.64606,0.819979,0.918938,0.992662,1.142252,1.136684,1.121558,1.015099,0.9931,0.987922,0.918164,0.92024,0.887571,1.111551,1.394588,1.311431,1.084021,0.941002,0.865342,0.761526,0.599299,0.552923
1.305713,1.153584,1.019541,0.997932,0.876449,0.683724,0.658462,0.916232,0.985261,1.008593,1.213118,1.35366,1.295073,1.064966,1.048535,1.074562,1.045004,1.049136,0.863375,0.927781,1.29748,1.407241,1.415486,1.286018,1.083749,0.848692,0.549341,0.575212
1.527219,1.219331,1.013975,1.023388,0.969168,0.818046,0.802142,1.0745,1.067993,0.958308,1.333265,1.776849,1.723694,1.364383,1.311607,1.338843,1.325989,1.309397,0.96767,0.967134,1.362354,1.480073,1.739507,1.683223,1.323127,1.039446,0.662584,0.675884
1.569638,1.142292,0.950615,1.059781,1.097084,0.980608,0.893271,1.15018,1.091416,0.810292,1.275822,1.988665,2.052936,1.642372,1.521737,1.550277,1.523099,1.456413,1.072575,1.087686,1.438159,1.468895,1.907101,1.967416,1.484424,1.206694,0.802179,0.747457
1.323549,0.956429,0.824378,0.965545,1.060094,1.013368,0.877477,1.057318,0.968554,0.638834,1.065054,1.770316,1.967868,1.693902,1.543675,1.542201,1.437692,1.282805,0.996135,1.049387,1.26975,1.222423,1.739903,1.909326,1.385107,1.167303,0.823944,0.692165
0.909436,0.8242,0.755598,0.798512,0.864842,0.853391,0.754122,0.839338,0.768279,0.531907,0.759435,1.171286,1.400793,1.355043,1.243764,1.206146,1.048494,0.863226,0.765815,0.827127,0.897055,0.862641,1.293593,1.454943,1.010135,0.901917,0.721982,0.547327
0.561585,0.778797,0.765915,0.667101,0.632811,0.59072,0.569877,0.565614,0.501032,0.391824,0.427962,0.548865,0.709153,0.802425,0.785484,0.759239,0.659106,0.54478,0.520778,0.574056,0.704483,0.680299,0.779871,0.847294,0.606842,0.614589,0.6043,0.445848
0.439317,0.752457,0.749116,0.564332,0.478985,0.418683,0.419129,0.374266,0.330382,0.272394,0.243607,0.293966,0.367914,0.459808,0.539901,0.514561,0.427753,0.401934,0.36414,0.439423,0.67872,0.665274,0.504185,0.457007,0.435829,0.542454,0.565032,0.441098
0.379434,0.630651,0.640296,0.452067,0.331632,0.290345,0.304776,0.274998,0.271212,0.227929,0.205033,0.273172,0.305552,0.369188,0.454832,0.386482,0.27289,0.308492,0.317053,0.363703,0.581676,0.656293,0.527753,0.412138,0.428509,0.523112,0.510085,0.466383
0.32628,0.441677,0.45166,0.330911,0.211223,0.180083,0.213426,0.241645,0.26786,0.214696,0.183152,0.241808,0.280246,0.357039,0.409016,0.328655,0.190403,0.205871,0.296852,0.330026,0.415405,0.564739,0.569034,0.432209,0.42021,0.437738,0.414515,0.482234
0.264401,0.300827,0.306792,0.243146,0.1828,0.14889,0.157205,0.206586,0.280126,0.246898,0.192492,0.211609,0.257802,0.336658,0.385269,0.357355,0.199666,0.136436,0.255346,0.282062,0.249167,0.420213,0.51463,0.390376,0.354363,0.333439,0.322381,0.451637
0.238343,0.281755,0.246566,0.200354,0.196987,0.152078,0.141076,0.200206,0.283831,0.258253,0.189892,0.193985,0.241308,0.278837,0.340811,0.39502,0.220221,0.087212,0.194029,0.22437,0.171818,0.315303,0.390127,0.297833,0.309374,0.319177,0.279968,0.357288
0.238266,0.300334,0.226035,0.18038,0.208324,0.161408,0.1558,0.230269,0.26873,0.219517,0.177825,0.199767,0.214949,0.208604,0.31706,0.422797,0.233564,0.079807,0.144753,0.179442,0.164246,0.260297,0.29381,0.210307,0.27175,0.341344,0.27924,0.256007
0.233746,0.294471,0.188405,0.149307,0.216728,0.181563,0.17135,0.246866,0.228857,0.158332,0.151724,0.211861,0.21042,0.178996,0.299573,0.39546,0.224993,0.091215,0.117058,0.138352,0.150849,0.210039,0.218603,0.148237,0.217345,0.332538,0.267091,0.183885
0.218536,0.263738,0.156641,0.137453,0.231793,0.197473,0.161939,0.231813,0.208926,0.136666,0.122655,0.19618,0.199808,0.156074,0.251318,0.306711,0.19494,0.111962,0.122581,0.134922,0.160378,0.171565,0.140489,0.117036,0.171788,0.271639,0.239023,0.179752
0.184425,0.223697,0.135694,0.127717,0.220058,0.187726,0.127698,0.189332,0.204056,0.139743,0.104459,0.157308,0.173864,0.129713,0.178515,0.202224,0.156817,0.122212,0.115996,0.131755,0.174167,0.146446,0.088244,0.108329,0.13293,0.186259,0.190676,0.164863
0.167547,0.182445,0.116825,0.104382,0.17353,0.159492,0.104348,0.134353,0.171479,0.129014,0.097005,0.126053,0.147559,0.122787,0.141521,0.155963,0.140093,0.110601,0.089056,0.106038,0.165411,0.137453,0.074082,0.105989,0.133443,0.163081,0.151292,0.125063
