-0.001802,-0.001207,-0.002359,-0.001751,-0.001212,-0.001304,-0.001927,-0.002194,-0.001689,-0.00175,-0.002313,-0.002736,-0.002764,-0.001957,-0.001157,-0.001521,-0.001476,-0.000934,-0.001359,-0.001753,-0.001594,-0.00091,-0.001977,-0.001621,-0.001614,-0.000801,-0.001116,-0.000444,-0.001162,-0.001977,-0.001323,-0.000976,-0.002857,-0.002331,-0.002041,-0.002417,-0.001772,-0.001593,-0.002386,-0.002273,-0.00164,-0.002125,-0.001198,-0.00101,-0.001403,-0.001845,-0.00218,-0.001479,-0.001323,-0.001546,-0.001853,-0.001532,-0.001101,-0.001854,-0.002683,-0.001657,-0.001184,-0.000858,-0.002121,-0.001536,-0.001778,-0.00127,-0.001724,-0.002101,-0.001749,-0.002053,-0.001325,-0.001824,-0.000881,-0.001459,-0.001912,-0.001877,-0.00201,-0.001479,-0.001493,-0.001956,-0.001879,-0.00141,-8e-04,-0.000792,-0.001732,-0.001317,-0.00117,-0.00204,-0.00145,-0.001774,-0.00111,-0.000769,-0.001518,-0.002229,-0.001551,-0.000984,-0.000933,-0.001174,-0.001931,-0.001932,-0.001485,-0.000879,-0.000673,-0.000581,-0.000943,-0.001327,-0.001369,-0.001912,-0.002461,-0.002352,-0.001969,-0.001306,-0.001074,-0.000935,-0.001342,-0.001617,-0.000918,-0.001755,-0.001215,-0.00098,-0.00124,-0.001051,-0.001221,-0.001262,-0.001235
0.000691,0.000367,0.001178,0.00054,0.000559,0.000462,0.000668,0.001063,0.001062,0.000558,0.000541,0.001305,0.001332,0.000818,0.000339,0.000723,0.00071,0.000251,0.000755,0.000915,0.000867,0.000267,0.001453,0.000759,0.000615,0.000421,0.000388,1.6e-05,9.1e-05,0.000589,8.7e-05,0.000778,0.001318,0.000954,0.000761,0.001684,0.001203,0.000591,0.001212,0.001326,0.000691,0.001038,0.001024,3.1e-05,0.000762,0.000977,0.000982,0.000368,0.000458,0.000564,0.001003,0.000232,0.000558,0.000895,0.001303,0.00121,0.000504,-5.6e-05,0.001204,0.000845,0.000792,0.000482,0.000805,0.001189,0.000914,0.001179,0.000568,0.000509,0.000156,0.000482,0.000799,0.00129,0.001307,0.000736,0.000464,0.001089,0.001168,0.000719,2.6e-05,0.000261,0.000915,0.000452,0.000643,0.001183,0.00042,0.000699,0.000486,7e-05,0.000726,0.001081,0.001012,0.000333,0.000394,0.000257,0.000922,0.000729,0.000866,0.000366,0.000143,0.00014,0.000508,0.000398,0.000656,0.001289,0.001291,0.001847,0.001397,0.001185,0.000546,0.000489,0.000701,0.000737,0.000365,0.001102,0.000579,0.000149,0.000595,0.000424,0.00043,0.000628,0.000614
-0.000168,-9.8e-05,-0.000993,-0.000446,-0.000152,-0.000102,-0.000145,0.000188,-0.00053,-7.2e-05,0.000426,-0.000279,-0.000785,-0.000933,-0.000467,-0.000354,-0.000432,-0.000266,-0.000399,-0.000629,-0.000633,-7.5e-05,-0.001041,-0.000293,-0.000321,-0.000124,-0.000354,0.000258,0.000111,0.000137,0.000332,-0.000653,-0.000332,-0.000514,-0.000378,-0.000712,-0.000556,0.000148,8e-05,-0.000426,-0.000367,-0.000438,-0.000573,0.000113,-0.000254,-0.000231,-0.00016,0.000134,-8e-05,-0.000196,-0.000328,-0.000361,-0.000477,-0.000569,-0.000769,-0.001066,-0.000343,0.000359,-0.000411,-0.000245,-0.000612,-0.000257,-0.000838,-0.000561,-0.00078,-0.000207,-0.000255,-3.7e-05,6.6e-05,-0.000286,-0.000673,-0.000956,-0.000844,-0.000449,-0.000207,-0.000546,-0.000673,-0.000663,-0.000167,-4.8e-05,-0.000725,-0.000483,-0.000137,-0.000192,0.000206,-0.000118,-5.2e-05,-0.000212,-0.000549,-7e-04,-0.000754,6.7e-05,-0.000304,-0.000248,-0.000379,4.9e-05,-0.000426,-0.000137,0.000154,-0.000191,-0.000389,4.4e-05,-0.000336,-0.000927,-0.000183,-0.000759,-0.001164,-0.000915,-0.000604,-0.000382,-0.000549,-0.000144,-0.00023,-0.000759,-0.000198,-0.000174,-0.000512,-0.000419,-3e-05,-0.000488,-0.000616
-0.000532,-0.000279,0.000283,-0.000136,-0.000438,-3.5e-05,-0.000215,-0.000273,0.000144,-0.00031,-0.000672,-0.000259,0.000502,0.000842,0.000675,-0.000169,-9.6e-05,-0.000156,-4.4e-05,0.000107,0.000353,-0.000131,0.000584,0.000198,0.000161,4.5e-05,-2.9e-05,-0.000233,-5e-04,-0.000198,-0.000374,0.000569,7.2e-05,3e-04,1.8e-05,6.8e-05,-0.000144,-0.000287,-0.000595,-0.000233,8.2e-05,0.000263,-4.4e-05,-0.000129,-9.1e-05,-0.000171,-0.000337,-0.000443,-8.8e-05,0.000136,-0.000235,0.000108,0.000187,0.000185,9.8e-05,0.000783,-2.4e-05,-0.000304,-9.5e-05,-0.000375,7.2e-05,0.000137,0.000191,8.5e-05,0.000198,-0.000534,-5.7e-05,5.5e-05,-0.000233,-1.5e-05,0.00027,0.000312,2.5e-05,1e-04,-0.000177,2.2e-05,0.000247,3e-05,6.5e-05,-0.000314,0.000305,-2.2e-05,-8.8e-05,-0.000363,-0.000199,-6.8e-05,-0.000329,0.000257,0.000306,0.00032,0.000234,0.000121,0.000279,0.00023,-1.7e-05,-0.000655,0.000143,0.000219,-0.000303,-1e-04,0.000136,-3.4e-05,-0.00028,0.000137,-0.000329,-0.000248,0.000769,0.000234,0.000471,0.000219,0.00012,-9.1e-05,-0.000275,7.9e-05,-0.000149,0.000189,0.000392,6e-05,-9.5e-05,0.000368,0.000296
0.000401,2.9e-05,9.3e-05,0.000389,0.000455,0.00012,0.000472,-0.000271,-0.000274,0.000199,0.000408,0.000575,-0.000662,-0.000916,-0.000509,0.000277,-6.8e-05,-2.1e-05,0.000375,0.000166,-0.000226,-3.4e-05,-0.000332,-0.000283,-0.000193,-0.00012,-0.000127,6e-05,0.000444,0.000156,0.000103,-0.000182,-0.000129,0.000151,-8.6e-05,0.000217,0.000352,0.000148,0.000506,0.000145,1.8e-05,-3.7e-05,7.8e-05,-8.9e-05,-0.000168,0.000406,0.000262,0.000137,-0.000183,-0.000519,0.000358,-0.000213,1e-06,-7.6e-05,0.00054,-0.000386,1.7e-05,0.000319,0.000249,0.000475,0.000202,-0.00024,0.000176,-0.000124,-2.4e-05,0.000222,0.000263,-0.000133,-0.000108,0.000147,2.6e-05,9.9e-05,0.000253,3.7e-05,0.000298,0.000247,-0.000169,-7e-06,-0.000163,0.000251,9e-06,0.000188,-0.000189,0.000179,3.6e-05,0.000112,0.000401,-8.6e-05,-8e-06,0.000118,-0.00019,-0.000378,-8.7e-05,-0.000334,7.9e-05,0.000478,-0.000136,-4.8e-05,0.000311,9e-05,-0.000187,5e-06,0.000321,0.000231,0.000404,0.000561,-0.00034,-0.000442,-0.000176,2.4e-05,4.9e-05,0.000231,0.000422,0.000188,0.000383,-0.000124,-0.000491,-5.4e-05,7.4e-05,-0.00012,1.7e-05
0.00012,0.000122,-7.5e-05,-0.000375,-0.000229,4.7e-05,-0.000438,0.000389,0.000232,3e-06,-0.000184,-0.000347,0.000437,0.000837,0.00053,4.6e-05,0.000314,5.2e-05,-0.000334,-0.000138,0.000419,7.8e-05,5.5e-05,0.000614,0.000217,1.8e-05,0.000114,-3e-05,-9.4e-05,-0.00029,0.000117,-6.1e-05,0.000115,-0.000335,0.000269,-0.00031,-0.000164,-2e-04,-7.4e-05,0.000246,4e-06,0.000131,-9.8e-05,0.000146,-7e-06,-0.000291,-9.7e-05,0.00042,7e-05,0.000352,-0.000434,0.00051,-2.4e-05,0.000179,-0.000609,0.000142,-7.2e-05,-0.000126,0.000173,-0.000373,2.5e-05,0.00015,-0.000153,9.8e-05,-8.3e-05,-0.000177,-0.000257,0.000121,5.3e-05,-0.000292,0.000267,-0.000205,-0.000275,0.000157,-0.000141,-0.000255,0.000166,2.5e-05,9.1e-05,-7.9e-05,-0.000104,2.7e-05,1.6e-05,-0.000188,8.6e-05,-0.000119,-0.000323,-2e-06,6.7e-05,-0.00024,1e-05,0.000184,-1e-05,0.000154,0.000448,-0.000191,-2.3e-05,-2.3e-05,-0.000149,-0.000129,8e-05,-0.000239,-0.000314,-6.5e-05,-0.000158,-0.000803,0.000322,0.000715,2e-05,0.000119,8.7e-05,-0.00012,-0.000277,-0.000151,-0.000362,-1e-05,0.000213,1.2e-05,-0.000252,-6.7e-05,-0.000175
4e-05,-4e-06,-8.3e-05,0.000151,0.000238,-0.000199,0.000161,-0.000608,-4.5e-05,-0.000206,-2.8e-05,8.8e-05,-0.000182,-0.000503,-0.00033,-0.000106,-0.000241,0.000107,7.7e-05,5.1e-05,-0.000317,1.3e-05,-0.000151,-0.000657,-0.000361,0.000193,1.5e-05,9.1e-05,2.2e-05,0.000346,5e-05,-0.000154,8.3e-05,0.000166,-0.000301,-3.6e-05,0,0.000212,-5.6e-05,-0.000295,-0.000145,-0.000192,0.000127,-8.1e-05,0.000204,0.000242,8.2e-05,-0.000451,0.000269,5e-06,0.000135,-0.000351,-0.000292,-2.8e-05,0.000324,3.2e-05,9e-05,-0.000288,-0.000345,0.000121,-8.9e-05,-4.9e-05,0.000193,7e-05,-2.6e-05,0.00015,0.000276,7.8e-05,0.000256,0.000218,-0.000268,2e-04,0.000257,-0.000334,3.3e-05,5.8e-05,-0.000222,4.6e-05,-0.000118,8.7e-05,7.8e-05,-0.000281,-0.000261,-0.000102,-8e-05,-2.7e-05,0.000135,-9.6e-05,-0.000137,7.5e-05,0.000169,-6.6e-05,4.2e-05,2.4e-05,-0.000483,3.9e-05,9.7e-05,6.4e-05,0.000159,0.000125,-0.000112,0.000202,0.000146,-4.9e-05,-0.00012,0.000558,-0.00021,-0.000677,-0.000235,-9.3e-05,-5.3e-05,0.00017,0.000107,5.3e-05,0.000152,5e-06,0.000125,3e-06,6.2e-05,9.1e-05,0.000383
-0.00034,-0.000179,0.00026,4.9e-05,-4.7e-05,-7.5e-05,-6.8e-05,0.000505,0.000151,0.000207,0.000162,-4.5e-05,-0.000142,5.5e-05,0.000239,-6e-05,-2.6e-05,-0.00012,0.000126,6.6e-05,0.000303,-0.000207,7.8e-05,0.000266,0.000227,-0.000251,-0.000103,-0.000118,1.5e-05,-0.000106,-0.000165,8.9e-05,-0.000218,-6.4e-05,0.000205,0.000111,-5.1e-05,-0.000265,-0.000146,7.5e-05,7.1e-05,0.000138,-5.2e-05,0.00017,-0.00025,-0.000125,-8e-06,0.000312,-0.000327,-1.3e-05,-6e-05,0.000187,0.000331,-5.2e-05,-0.00012,-0.000156,-0.000135,8.6e-05,0.000168,0.000117,0.000197,-1.3e-05,-9.8e-05,1e-05,0.000278,3.1e-05,-9.1e-05,-0.000251,-0.00028,-0.000118,0,-0.000183,-1e-04,0.00048,5e-06,0.000272,0.000267,1e-05,0.000114,3.8e-05,-0.000128,0.000258,0.000422,-6e-06,4.6e-05,-6.2e-05,-5.7e-05,6.4e-05,6.3e-05,-6.8e-05,-1e-05,-0.000134,-0.000227,-8.5e-05,0.00017,0.000344,-8e-06,-0.000177,-0.000162,-5.5e-05,6.5e-05,-4e-05,-5.5e-05,0.000141,0.00016,-4.9e-05,-0.000121,0.000465,0.000127,1.8e-05,8.8e-05,-5.9e-05,-2.8e-05,-0.000122,-6.9e-05,6.6e-05,9e-06,-5.2e-05,0.000105,-3.1e-05,-0.000367
0.000355,7e-06,-0.000177,5.1e-05,-7.1e-05,0.000117,0.000126,-0.000219,-2e-04,-0.000275,-0.000224,4.4e-05,0.00033,0.00016,-0.000202,0.000277,5.1e-05,9.9e-05,-6.9e-05,2.1e-05,-0.000242,0.000244,0.000114,-0.000246,-9.1e-05,6.6e-05,9.2e-05,0.000133,-0.000122,-1.2e-05,-3e-05,-1e-04,0.000218,0.000122,-0.000259,-0.000112,-2.7e-05,0.000308,9.3e-05,7.2e-05,4.8e-05,-0.000267,-0.000149,-0.000126,0.000128,-2.4e-05,-3.7e-05,-0.00017,0.000157,1e-06,0.000202,-4.5e-05,-9e-05,9.1e-05,0.000147,0.000196,0.000136,-5.1e-05,-1.8e-05,-6.2e-05,-9e-05,6.1e-05,0.000273,-0.000121,-0.000281,-5e-06,-1.6e-05,0.000183,4.1e-05,-3.5e-05,5.3e-05,0.000245,-8e-06,-0.000406,-3e-06,-0.00016,-0.000192,-0.000111,-8.3e-05,-6.2e-05,7.2e-05,-0.000202,-7.6e-05,8.5e-05,2e-05,0.000174,0.000151,0.000127,-2.9e-05,0.000108,-7e-06,0.000194,-6.7e-05,-8.5e-05,-1.2e-05,-0.000318,8e-06,5.6e-05,1.6e-05,-0.00015,1.6e-05,0.000105,2.7e-05,-0.000275,-0.000168,-0.000176,0.000183,-0.000336,-0.000106,-0.000102,-9.6e-05,-0.000158,0.000106,7.8e-05,7.3e-05,-5.2e-05,-0.000121,9.5e-05,-0.00018,-5.1e-05,0.000157
-0.000132,1e-05,4e-06,2.7e-05,1e-05,-4.7e-05,-0.000193,5.7e-05,1e-04,0.000415,8.9e-05,4e-06,-2.6e-05,-5.6e-05,0.000128,-0.000141,-9.7e-05,-0.000229,0.000142,-0.000106,5.2e-05,-0.000104,-0.000214,0.00018,0.000147,-0.000123,8.4e-05,-0.000252,4.4e-05,-0.000116,9.7e-05,3.6e-05,-4.5e-05,-0.000153,0.000291,-1.7e-05,-5.1e-05,-0.000316,-8.7e-05,-0.00017,-8.5e-05,0.000347,9.9e-05,0.000118,9.8e-05,-7.8e-05,6e-05,2e-05,-3e-06,1.4e-05,-0.000248,-0.000141,1.2e-05,-0.000132,-0.000118,-0.000107,-2.5e-05,2e-04,4e-06,-4.5e-05,-0.000105,0.000101,-0.000201,1.1e-05,0.000223,-2.1e-05,-3.5e-05,-0.000114,9.8e-05,0.000103,-3.4e-05,-5.7e-05,0,7.2e-05,-8e-05,-6.1e-05,6.9e-05,0.000215,0.000101,-4.5e-05,-1.3e-05,0.000167,-0.000124,-2.1e-05,-6.1e-05,-0.000208,-0.000117,-0.000138,3.5e-05,5e-05,2.4e-05,-8.1e-05,0.000123,0.000124,3.4e-05,0.000108,-4.1e-05,-7.3e-05,-9.5e-05,0.000245,-5.2e-05,-5.5e-05,-1.9e-05,0.000193,0.000178,0.000186,-0.000115,0.000292,0.000256,0.000244,1e-05,9.1e-05,-8.1e-05,5.3e-05,-5e-06,8.8e-05,0.000103,-1.6e-05,0.000225,4e-06,-2.9e-05
0.000123,-5.4e-05,0.000205,-2.5e-05,0.000104,-3.9e-05,0.000117,3.1e-05,-6.4e-05,-0.000354,-6.4e-05,-6.3e-05,-0.000114,2.5e-05,-0.00018,0.000152,0.000158,0.000313,-0.000133,5.4e-05,0.000125,0.000139,0.000151,7.1e-05,-8.2e-05,0.000166,1.5e-05,1e-04,7.1e-05,0.000107,-0.000149,0.000151,-5e-06,0.000163,3.4e-05,0.000114,0.000162,0.00019,-4.5e-05,2.9e-05,9.2e-05,-0.000317,-6.9e-05,-0.000103,-6.3e-05,1.6e-05,2e-05,4.8e-05,-0.000144,2.4e-05,0.000233,0.000234,7.6e-05,0.000187,0.000133,1e-06,1.7e-05,3.8e-05,8.2e-05,-1.6e-05,0.000144,-4.9e-05,8.5e-05,-2.9e-05,-8.4e-05,5.4e-05,-5.5e-05,2.8e-05,-8.8e-05,8e-05,-2e-06,3.5e-05,4.8e-05,4.7e-05,2e-04,0.00011,-1.6e-05,-0.000234,-7.8e-05,0.000246,4.3e-05,-0.000101,3.3e-05,0.000147,-1.6e-05,1e-04,4.2e-05,0.000142,-4.9e-05,-3.1e-05,-6e-06,6.4e-05,-5.5e-05,-7.2e-05,-7.8e-05,-0.000143,-2.9e-05,9.9e-05,6.9e-05,-0.000134,0.000101,0.000114,5.4e-05,-5.7e-05,-9.3e-05,-1.4e-05,0.00019,-0.000138,-0.000126,-0.000198,-8.7e-05,-9e-06,7e-06,-0.000179,-6.7e-05,0.000139,-8.3e-05,1.1e-05,-0.000192,-4.8e-05,-3.2e-05
-3.8e-05,0.00011,-0.000118,3.7e-05,-6.2e-05,2.7e-05,-7.4e-05,-0.000132,-2.6e-05,0.000233,3.2e-05,1.9e-05,9.4e-05,1.2e-05,0.000136,-0.000134,-0.000123,-0.000206,5.1e-05,5.1e-05,-0.000149,-0.00012,-0.000102,-1.6e-05,1.1e-05,-0.000139,-6.8e-05,3.4e-05,-5.7e-05,-7.2e-05,6.4e-05,-0.000215,-0.00012,-4.5e-05,-0.000255,-0.000122,-5.4e-05,2.5e-05,0.000121,-2e-05,-5.9e-05,0.000205,0.00012,9.2e-05,-4.6e-05,2.5e-05,-3e-06,-0.000104,0.000159,-9.2e-05,-0.000125,-0.000207,-0.000118,-0.000124,-6.1e-05,9e-06,2.2e-05,-0.000119,-8.8e-05,3.3e-05,-0.000238,-1e-06,-4.8e-05,4.8e-05,1.6e-05,-0.000112,-1.2e-05,-3.7e-05,4e-05,-0.000171,-4.7e-05,-0.000107,-0.000112,-1e-04,-0.000136,-9.4e-05,6.7e-05,0.000201,3.8e-05,-0.000165,1.3e-05,2.5e-05,1.8e-05,-8.7e-05,5e-06,1.5e-05,-1e-06,-0.000131,-4.4e-05,-4.4e-05,2.3e-05,-2.5e-05,9.1e-05,5.7e-05,6.3e-05,1e-04,4.1e-05,2.6e-05,-3.9e-05,0.000135,-7.8e-05,-2.4e-05,-1.3e-05,1.6e-05,-1.8e-05,-0.000112,-0.000114,1.2e-05,3.6e-05,4.3e-05,7e-05,7.6e-05,-6e-05,0.000138,-5.6e-05,-0.000221,9.8e-05,-3e-06,0.000141,3.6e-05,1e-05
-8e-06,-6.9e-05,1.3e-05,-5.7e-05,1.2e-05,-4.3e-05,5e-05,0.000116,3.7e-05,-7.7e-05,-0.000104,-8e-06,7.1e-05,-3.6e-05,-7.1e-05,0.00012,6.4e-05,4.9e-05,-8.7e-05,-5.7e-05,0.000112,8e-05,3.1e-05,-1e-06,-7.7e-05,4.4e-05,0.000105,5.2e-05,1e-05,4.8e-05,-5.7e-05,9.9e-05,9.9e-05,7e-06,0.000163,6.3e-05,4.5e-05,-8.8e-05,-6e-05,8.2e-05,1e-05,-0.000133,-8.8e-05,-7.2e-05,-2.1e-05,-7.6e-05,2.5e-05,0.000127,-2.7e-05,0.000103,4.7e-05,0.000116,3e-06,-9.9e-05,-4.1e-05,5.4e-05,-8.1e-05,3.2e-05,-3e-05,-2.1e-05,0.000124,-1.3e-05,-3e-06,-5.1e-05,-9.7e-05,0.000104,3.5e-05,1.4e-05,-3.7e-05,9.9e-05,7.3e-05,-2e-05,8.8e-05,0.00017,3.9e-05,3.5e-05,-0.000112,-0.00012,-1.1e-05,1.6e-05,-1.3e-05,2.2e-05,1.4e-05,1.3e-05,-1.1e-05,-4.2e-05,-2e-06,8.3e-05,5.9e-05,3.5e-05,-4.1e-05,-4.8e-05,-4.3e-05,7.9e-05,4.5e-05,-7.6e-05,-6.6e-05,-8.3e-05,4e-05,-6e-05,-7e-06,1.5e-05,-1.5e-05,5.4e-05,7.5e-05,0.000104,0.000104,4.4e-05,-1.2e-05,-0.000104,-4e-05,-7.2e-05,3.3e-05,-7.8e-05,3.4e-05,0.00015,-6.3e-05,-8e-06,-0.000105,-1.6e-05,4.8e-05
3.7e-05,2.4e-05,4.6e-05,4e-06,-0.000101,2.7e-05,0,-4.9e-05,-2.7e-05,-6.8e-05,4.4e-05,-1.9e-05,-0.000128,-6.9e-05,2e-06,-0.000113,8e-06,8e-06,0.000117,-1.8e-05,-3e-05,-3.9e-05,-2.4e-05,4e-05,1.9e-05,1.5e-05,-9.4e-05,-1.7e-05,-2.5e-05,-2e-05,0.000101,-4.1e-05,-5.9e-05,2e-05,-0.000117,-4.8e-05,-1e-06,0.000101,6.1e-05,-1.9e-05,1.4e-05,3.2e-05,-1e-05,5e-05,-5.6e-05,5.2e-05,-4.6e-05,-7.4e-05,-1.5e-05,-5.3e-05,-4.2e-05,-4.9e-05,-1.9e-05,5.7e-05,-4e-06,-9e-05,5.7e-05,4.1e-05,-1.2e-05,1.6e-05,-4e-05,-1e-05,-7e-06,2e-05,0.000117,-8.4e-05,3.5e-05,-4.5e-05,-3.4e-05,-2.5e-05,-4.7e-05,7.1e-05,-6.9e-05,-0.000133,-5e-06,-1.9e-05,1.4e-05,6.3e-05,1e-05,-9.3e-05,1.2e-05,-3.9e-05,3.1e-05,-2.2e-05,0,6e-05,-1.9e-05,-1.5e-05,-4e-05,6.6e-05,-2.9e-05,6.7e-05,7.2e-05,-5.4e-05,-5.7e-05,7.4e-05,5.3e-05,8.9e-05,-1e-06,1.6e-05,8.4e-05,-6.6e-05,1.7e-05,-1.2e-05,-5.5e-05,-5e-06,-9e-05,-0.000108,-3.8e-05,7.6e-05,2e-05,4.5e-05,-2.9e-05,2.6e-05,1.1e-05,-7.9e-05,-5.2e-05,3e-06,9.7e-05,5.4e-05,-4.9e-05
-1.8e-05,-1e-05,-5.8e-05,1.1e-05,5.7e-05,-2.6e-05,3e-06,3.2e-05,-1e-06,6.9e-05,-2.6e-05,1.9e-05,0.000159,-3e-05,2.2e-05,6.7e-05,8e-06,-3.6e-05,-9.5e-05,-1e-05,-2.7e-05,3.4e-05,4.1e-05,-2e-05,2e-05,4e-06,5e-05,6e-06,8e-06,-6e-06,-3.9e-05,-3.6e-05,3e-05,2e-06,6.8e-05,1.9e-05,2.9e-05,-9.3e-05,-4.6e-05,9e-06,-3.1e-05,1e-06,5.2e-05,-4.9e-05,0.00011,2.2e-05,1.8e-05,4.7e-05,2.4e-05,-3e-06,6.2e-05,4e-05,2.1e-05,6.8e-05,5e-06,4.6e-05,-2e-06,-0.000109,6.3e-05,7e-06,-1.2e-05,5e-06,1.6e-05,-2e-06,-8e-06,2e-06,-1.5e-05,5.6e-05,5.2e-05,-3e-06,-3.2e-05,-3.6e-05,2.9e-05,7.8e-05,-1.2e-05,1.2e-05,6.6e-05,-1.2e-05,-1.1e-05,6.6e-05,3.5e-05,6.1e-05,-6.2e-05,-4e-06,1.6e-05,-5.1e-05,9e-06,-4.6e-05,1.4e-05,-7e-05,2.4e-05,-1.1e-05,-7e-05,0,2.5e-05,-7e-05,6e-06,-6e-05,1.5e-05,-4.1e-05,-7.7e-05,0,1.2e-05,-1.1e-05,4.3e-05,-3.8e-05,1.2e-05,0.000125,4.5e-05,-5e-06,-3.3e-05,-2.4e-05,1.8e-05,0,2.1e-05,3.4e-05,5.3e-05,-5e-06,-8.4e-05,1.6e-05,5.3e-05
-2.1e-05,4.5e-05,2.4e-05,1.8e-05,-1.6e-05,-4e-06,-6e-06,-7.1e-05,4e-06,-2.1e-05,6e-05,6e-06,-9.6e-05,6.4e-05,6e-06,-9.1e-05,2.3e-05,5.2e-05,0.000111,-1.1e-05,2.1e-05,-2.6e-05,-1.2e-05,1.3e-05,-3.1e-05,-6e-06,-4.6e-05,-3.2e-05,1.4e-05,-5e-06,-2e-05,2.7e-05,2.5e-05,2e-06,-3.9e-05,2e-05,-4.7e-05,-3e-06,-2.9e-05,3.3e-05,4.8e-05,6e-06,-3.3e-05,-1e-05,-6e-05,-1.5e-05,-1.9e-05,-8e-06,-1e-05,5.3e-05,-4.9e-05,-1.2e-05,2.7e-05,-3.9e-05,7e-06,-9e-06,5e-06,0.00011,-3e-06,-2.3e-05,6.5e-05,-1.2e-05,-1.3e-05,7e-06,-3.9e-05,3.4e-05,6e-06,-5e-06,-1.6e-05,8e-06,3.7e-05,5e-06,-2.4e-05,-3e-05,1.9e-05,-1.7e-05,-5e-05,-1.5e-05,-1e-06,-6.2e-05,-2.5e-05,-4.3e-05,1e-05,3.8e-05,0,6.3e-05,-1.7e-05,4.1e-05,6e-06,3.2e-05,1.9e-05,-9e-06,1.7e-05,9e-06,1.6e-05,5e-05,1.7e-05,2.6e-05,-3.2e-05,3.4e-05,3.7e-05,-1e-06,-2e-06,-1.3e-05,-5.1e-05,-1.8e-05,-3e-06,-7.4e-05,-1.3e-05,4.4e-05,8e-06,1.8e-05,-1e-06,-2e-06,8e-06,-4e-06,-6.2e-05,-6e-06,5.5e-05,-1.8e-05,-3e-06
3.1e-05,-1.9e-05,-1.1e-05,-2.5e-05,3.2e-05,2.8e-05,0,3.4e-05,5e-06,3.7e-05,-2.2e-05,-2.5e-05,3.9e-05,-4e-05,-1.5e-05,6.9e-05,-2.5e-05,-1.9e-05,-7.2e-05,9e-06,-2e-05,4.1e-05,-3e-06,-2.8e-05,4.1e-05,1.4e-05,1.4e-05,3.3e-05,0,8e-06,1e-06,-1.2e-05,-2.6e-05,-1.8e-05,6e-06,-1.8e-05,4e-06,2.4e-05,3.5e-05,-3.5e-05,-8e-06,1.2e-05,2e-06,5e-06,9e-06,-1.9e-05,-2e-06,4e-06,-9e-06,-6.2e-05,1.8e-05,-8e-06,-2.1e-05,2.2e-05,-1.5e-05,-2e-06,-1.7e-05,-8e-05,-6e-06,1e-06,-3.6e-05,4e-06,0,1.4e-05,5.9e-05,-3.2e-05,-3e-06,-8e-06,-1e-06,2.9e-05,5e-06,-1.1e-05,2.6e-05,-4e-06,-2.9e-05,2.5e-05,1.7e-05,3.8e-05,3e-06,5.2e-05,5e-06,3.3e-05,-2.3e-05,-3e-06,1.4e-05,-5e-05,3e-06,-2.5e-05,-8e-06,-1.8e-05,-1.9e-05,1.5e-05,-2.8e-05,-1.5e-05,-3.3e-05,-1.9e-05,-5e-06,-1.6e-05,1.3e-05,-3.5e-05,-1.1e-05,2e-06,-4e-06,1.1e-05,7e-06,2.3e-05,-1.4e-05,4.9e-05,1.7e-05,-2.6e-05,3e-05,-4.3e-05,1.2e-05,-4e-06,-1.4e-05,-1.2e-05,4.5e-05,1.8e-05,-2.6e-05,0,-6e-06
-2.6e-05,-4e-06,1.7e-05,2e-06,-2.3e-05,-2.3e-05,-1.7e-05,2e-06,-8e-06,-1.1e-05,8e-06,6e-06,8e-06,1.2e-05,4.8e-05,-5.7e-05,9e-06,-9e-06,1.6e-05,2.5e-05,2.6e-05,-2e-05,3e-06,1.8e-05,-2.7e-05,-4e-05,-1e-06,-1.6e-05,8e-06,-1e-06,3.4e-05,2.2e-05,2.9e-05,2e-05,8.1e-05,-4e-06,1.4e-05,4e-06,-2.6e-05,1e-05,-1.2e-05,-2.5e-05,-2e-06,-1.5e-05,4e-06,1.3e-05,5e-06,6e-06,2.6e-05,4e-05,-1.6e-05,2.7e-05,1.4e-05,-2e-05,8e-06,3e-05,2.6e-05,7.4e-05,7e-06,1.7e-05,4e-05,2e-06,7e-06,-7e-06,-4.9e-05,2.4e-05,2e-06,2.5e-05,-6e-06,-3.9e-05,-6e-06,-7e-06,-1.9e-05,2.5e-05,3.3e-05,-4e-06,4e-06,-2.7e-05,4e-06,-1.7e-05,-8e-06,-2.7e-05,5.5e-05,5e-06,-1.4e-05,2e-05,-2e-06,2.9e-05,6e-06,1.8e-05,-1.7e-05,-1.4e-05,2e-05,1.7e-05,1e-05,1.5e-05,-1.6e-05,1.7e-05,-7e-06,3.3e-05,-1e-05,1.3e-05,5e-06,-2.2e-05,1e-06,8e-06,3.9e-05,-2e-05,-1.2e-05,1.1e-05,-7e-06,1e-05,-2.6e-05,1.3e-05,-1.7e-05,-3e-06,4e-06,-8e-06,3e-06,-9e-06,2e-06
8e-06,1.4e-05,2e-06,-5e-06,3e-06,9e-06,3e-05,7e-06,-2e-06,-8e-06,-1e-05,-2.4e-05,-6.4e-05,8e-06,-4.1e-05,4.5e-05,1e-05,4e-06,-8e-06,-1.6e-05,-4.1e-05,1.3e-05,0,1.1e-05,5e-06,3.3e-05,-7e-06,2e-06,-3e-06,-6e-06,-2.4e-05,-1.9e-05,-4.1e-05,-1.6e-05,-7.7e-05,-4e-06,5e-06,-1e-06,9e-06,-1.9e-05,9e-06,4e-05,1.6e-05,2.4e-05,-1e-06,-1.7e-05,-5e-06,-1.4e-05,-3.2e-05,-9e-06,2.2e-05,-2.4e-05,-1.6e-05,1.4e-05,1.7e-05,-2.8e-05,-1.8e-05,-6.4e-05,3e-06,-4e-06,-5e-06,-1.4e-05,-9e-06,-6e-06,2.6e-05,-3.3e-05,-8e-06,-3.8e-05,-1.7e-05,2.1e-05,-8e-06,-5e-06,1.4e-05,-4.4e-05,-2.7e-05,-6e-06,-7e-06,4.1e-05,4e-06,9e-06,-4e-06,1.1e-05,-5e-06,-2.3e-05,4e-06,3e-06,1e-05,-1.5e-05,1e-06,-1e-05,-7e-06,-3e-06,-3e-06,-5e-06,-1.2e-05,9e-06,-1e-06,3e-06,-3e-06,-2.7e-05,2.1e-05,-8e-06,2e-06,6e-06,-7e-06,-4e-06,-4e-05,-9e-06,-1.6e-05,1e-06,-3e-06,5e-06,1.9e-05,-2e-06,6e-06,-1.5e-05,-3e-05,-2e-06,1.5e-05,1.3e-05,-4e-06
-7e-06,6e-06,-2e-05,2e-06,1.8e-05,-8e-06,-4e-06,-7e-06,1e-06,-4e-06,-1.1e-05,3.7e-05,5.6e-05,-3.9e-05,1e-05,-4.9e-05,-2e-05,-7e-06,1.7e-05,-8e-06,2.7e-05,-1.3e-05,-7e-06,-2.2e-05,1.1e-05,-1.6e-05,7e-06,-1.1e-05,3e-06,2e-06,4e-06,1e-05,1.5e-05,-6e-06,4.7e-05,1e-05,-5e-06,7e-06,-1e-06,2e-05,-9e-06,-3.9e-05,-6e-06,-2.8e-05,6e-06,6e-06,-4e-06,7e-06,2e-05,-1.4e-05,-2e-05,1e-05,-5e-06,2e-06,-1e-05,1.3e-05,9e-06,1.9e-05,-1.4e-05,-1e-06,-2.5e-05,1e-06,2.1e-05,-4e-06,-1.9e-05,2.6e-05,-8e-06,2e-05,1.6e-05,1e-06,6e-06,8e-06,-3e-06,3.6e-05,2.4e-05,7e-06,-5e-06,-5.2e-05,-1e-05,9e-06,2e-06,-4e-06,-2.9e-05,8e-06,1e-06,-1.6e-05,-9e-06,-4e-06,-3e-06,1.2e-05,1.4e-05,1.2e-05,1e-05,-3e-06,1.4e-05,-3.1e-05,1.7e-05,1e-06,-6e-06,1.3e-05,-1.1e-05,-6e-06,0,2.3e-05,1.3e-05,-1e-06,2.4e-05,2.2e-05,2e-06,-2.4e-05,1.6e-05,4e-06,-1.4e-05,-1.1e-05,7e-06,1.9e-05,1.2e-05,2e-06,-1.6e-05,-1.4e-05,-9e-06
-2e-06,-4e-06,7e-06,4e-06,-1.4e-05,-5e-06,4e-06,-3e-06,1e-06,-1.2e-05,2e-05,-2e-05,-1.9e-05,2.3e-05,-1e-05,3.9e-05,2.3e-05,2.2e-05,-8e-06,1.1e-05,7e-06,1.4e-05,1e-06,2.5e-05,-2.4e-05,4e-06,-1.7e-05,6e-06,1e-06,-1e-06,-1.6e-05,-2e-06,9e-06,7e-06,-2.4e-05,-6e-06,1.3e-05,-3.1e-05,9e-06,0,1e-06,3e-05,-9e-06,2.4e-05,-1e-05,3e-06,-1e-06,0,3e-06,2e-05,1.4e-05,-6e-06,6e-06,-9e-06,5e-06,3e-06,-2e-06,-1.5e-05,-5e-06,-3e-06,2.7e-05,0,-1.9e-05,6e-06,1.8e-05,-1.8e-05,0,-2.1e-05,-3e-06,-1.2e-05,-2e-06,-6e-06,-2e-06,-3.6e-05,-1.5e-05,-8e-06,1.8e-05,3.6e-05,9e-06,1.1e-05,-7e-06,-6e-06,2e-06,-5e-06,-5e-06,1.4e-05,6e-06,1.6e-05,0,-1.3e-05,0,-2.3e-05,1.1e-05,1.4e-05,-1.2e-05,1.2e-05,-3e-06,-1e-06,8e-06,-1e-06,0,1e-06,1e-06,-1.2e-05,-7e-06,-7e-06,-5e-06,-2.6e-05,7e-06,1.6e-05,-6e-06,4e-06,1.1e-05,9e-06,3e-06,-1.7e-05,1.3e-05,-1e-06,1.4e-05,-1e-06,1.1e-05
-2e-06,-1e-05,0,4e-06,0,8e-06,-1e-06,-3e-06,2e-06,3.2e-05,-2e-05,-4e-06,-1.6e-05,-2.4e-05,-2e-06,-3.2e-05,-1.2e-05,-3.2e-05,4e-06,-5e-06,-1.6e-05,-1.5e-05,5e-06,-2e-05,3e-05,-6e-06,4e-06,7e-06,2e-06,3e-06,1.6e-05,-1.2e-05,-7e-06,-1e-05,-4e-06,-1e-06,-2e-06,4.5e-05,-1e-06,-9e-06,4e-06,-2.2e-05,5e-06,-1.5e-05,3e-06,1e-06,3e-06,0,-6e-06,-1.7e-05,-1.6e-05,-2e-06,8e-06,-5e-06,2e-06,-2e-05,-2e-06,6e-06,1.7e-05,7e-06,-2.4e-05,9e-06,9e-06,-5e-06,-1.7e-05,1.2e-05,3e-06,1.5e-05,-1.5e-05,1e-05,-1.6e-05,2.2e-05,5e-06,2.4e-05,1.3e-05,0,-1.3e-05,-1.3e-05,-9e-06,-2.5e-05,4e-06,1.3e-05,-5e-06,1e-05,5e-06,1e-06,-2e-06,-1.9e-05,3e-06,-2e-06,0,1.9e-05,-1.1e-05,-5e-06,9e-06,-1.8e-05,-8e-06,-2.1e-05,9e-06,-1e-05,2e-06,4e-06,-1e-06,8e-06,9e-06,7e-06,-1.8e-05,2.9e-05,3e-06,-1e-05,-1.3e-05,-9e-06,-1.2e-05,-1e-06,-4e-06,-2e-06,-1.4e-05,0,-1.9e-05,5e-06,-8e-06
-1e-06,1.2e-05,-7e-06,6e-06,1e-06,-3e-06,2e-06,4e-06,-8e-06,-2.8e-05,2e-05,4e-06,2.2e-05,2.1e-05,4e-06,2.6e-05,7e-06,2.5e-05,0,-6e-06,2.3e-05,1.6e-05,1e-06,1e-05,-1.5e-05,5e-06,-3e-06,6e-06,-3e-06,-3e-06,-2e-06,2.5e-05,5e-06,-1e-06,3.6e-05,8e-06,-9e-06,-4e-05,-3e-06,8e-06,4e-06,1.4e-05,5e-06,1.9e-05,8e-06,-7e-06,0,-8e-06,0,1.2e-05,2.1e-05,0,5e-06,6e-06,-4e-06,1.3e-05,5e-06,1e-05,-1.4e-05,-5e-06,7e-06,-2e-06,0,-2e-06,-4e-06,-5e-06,3e-06,-1e-06,1e-05,1.1e-05,1e-06,-2.8e-05,0,1e-06,-9e-06,3e-06,-5e-06,-1e-06,5e-06,9e-06,-4e-06,-1.7e-05,2.3e-05,-5e-06,-6e-06,-8e-06,2e-06,1.2e-05,-2e-06,2e-06,-2e-06,-6e-06,0,-6e-06,1e-06,2.2e-05,1e-06,2.6e-05,-3e-06,5e-06,-3e-06,-3e-06,2e-06,-3e-06,-5e-06,-7e-06,9e-06,-2.2e-05,8e-06,1.2e-05,1.2e-05,8e-06,8e-06,-6e-06,-5e-06,1.9e-05,4e-06,0,1.6e-05,-3e-06,1e-06
-2e-06,1e-06,7e-06,-8e-06,-2e-06,1e-06,-2e-06,6e-06,0,3e-05,-1.9e-05,1e-06,-1e-05,2.4e-05,3e-06,-2.5e-05,2e-06,-1e-06,-1e-05,8e-06,-2.5e-05,-1.6e-05,-5e-06,-5e-06,3e-06,0,1e-06,-1.2e-05,-5e-06,-2e-06,-8e-06,-2.1e-05,-6e-06,-3e-06,-4.1e-05,-6e-06,-1e-06,2.6e-05,-2e-06,-2e-06,3e-06,-1e-05,-9e-06,-1.1e-05,-2e-06,1e-05,-1e-06,5e-06,8e-06,-5e-06,-1.8e-05,-3e-06,-1.1e-05,4e-06,1e-06,4e-06,-4e-06,-1.1e-05,9e-06,3e-06,-6e-06,-6e-06,-5e-06,-1e-06,2.3e-05,0,3e-06,-3e-06,-6e-06,-1.8e-05,5e-06,2.2e-05,0,-1.6e-05,1.2e-05,0,1.2e-05,3e-06,1e-06,1.7e-05,-1e-06,1.5e-05,-3e-06,1.2e-05,5e-06,1.4e-05,-5e-06,-7e-06,-1e-06,0,1e-06,-3e-06,-6e-06,4e-06,-7e-06,-2.1e-05,0,-2.8e-05,8e-06,0,4e-06,5e-06,-3e-06,-6e-06,0,1.2e-05,-2e-06,1e-05,-9e-06,-2.3e-05,-7e-06,-2e-06,-2e-06,2e-06,-7e-06,-1.7e-05,3e-06,0,-1.8e-05,5e-06,3e-06
7e-06,5e-06,6e-06,-2e-06,9e-06,1e-06,5e-06,-2e-06,5e-06,-2.3e-05,1.1e-05,-5e-06,-1.3e-05,-2.9e-05,8e-06,2.3e-05,-1.1e-05,-1.1e-05,5e-06,3e-06,1.2e-05,1.1e-05,3e-06,-3e-06,4e-06,-1e-06,-6e-06,6e-06,2e-06,0,4e-06,7e-06,9e-06,3e-06,3.6e-05,-1e-06,3e-06,-1.2e-05,-4e-06,3e-06,-6e-06,3e-06,3e-06,1.2e-05,-9e-06,-2e-06,2e-06,-7e-06,-1.2e-05,-2e-06,5e-06,7e-06,0,-8e-06,3e-06,-8e-06,1e-06,1.6e-05,-7e-06,-3e-06,-2e-06,2e-06,-2e-06,2e-06,-3e-05,-4e-06,2e-06,3e-06,6e-06,1.2e-05,1e-06,-2e-05,1e-06,2.5e-05,-1.3e-05,-2e-06,-4e-06,-1.7e-05,-2e-06,-8e-06,3e-06,-1.4e-05,-7e-06,-1.2e-05,-1e-06,-1.6e-05,5e-06,-1e-06,2e-06,0,4e-06,9e-06,-1e-06,-5e-06,1e-06,1.2e-05,9e-06,2.6e-05,-7e-06,-3e-06,-4e-06,-5e-06,1e-06,3e-06,-3e-06,-9e-06,1.2e-05,1e-06,-4e-06,1.8e-05,-7e-06,4e-06,0,2e-06,8e-06,8e-06,-7e-06,1e-06,1.9e-05,1e-06,-1e-06
-5e-06,-1.1e-05,-7e-06,1e-06,-1.2e-05,-4e-06,-2e-06,0,-1e-06,5e-06,-1.6e-05,1.1e-05,1.2e-05,1.2e-05,-1.6e-05,-1.3e-05,1.3e-05,6e-06,-3e-06,-8e-06,-1e-06,-5e-06,0,1.2e-05,-1.1e-05,0,5e-06,-7e-06,0,3e-06,4e-06,9e-06,-9e-06,-2e-06,-2e-05,2e-06,-5e-06,-7e-06,1e-06,-4e-06,5e-06,-2e-06,3e-06,-6e-06,3e-06,-2e-06,3e-06,1.3e-05,8e-06,4e-06,2e-06,-4e-06,-1e-06,-5e-06,-4e-06,3e-06,-3e-06,-1.1e-05,2e-06,3e-06,9e-06,1e-06,4e-06,3e-06,1.9e-05,4e-06,0,-7e-06,-1e-06,-3e-06,-1e-06,1.7e-05,0,-2.3e-05,9e-06,2e-06,-6e-06,1.2e-05,2e-06,-1.1e-05,-6e-06,9e-06,-8e-06,4e-06,1e-06,6e-06,0,8e-06,-2e-06,0,-3e-06,-1.4e-05,3e-06,1e-06,2e-06,-8e-06,-3e-06,-8e-06,2e-06,2e-06,4e-06,6e-06,-1e-06,-7e-06,1e-06,-2e-06,-6e-06,-1.1e-05,1e-06,-5e-06,7e-06,-1e-05,-3e-06,-4e-06,3e-06,4e-06,8e-06,-1e-06,-1.3e-05,4e-06,-1e-06
4e-06,9e-06,-2e-06,1e-06,6e-06,-2e-06,-2e-06,-1.2e-05,-3e-06,-1e-06,1e-05,-7e-06,-1.6e-05,-8e-06,1.4e-05,2.1e-05,-7e-06,-9e-06,3e-06,3e-06,-6e-06,2e-06,-4e-06,-1.2e-05,1.2e-05,0,1e-06,6e-06,-3e-06,-1e-06,0,-1.4e-05,-2e-06,-4e-06,8e-06,0,2e-06,1.3e-05,1e-06,-2e-06,-1e-06,-1e-06,-6e-06,2e-06,3e-06,-1e-06,-1e-06,-1.1e-05,0,-1e-05,7e-06,6e-06,-4e-06,8e-06,-2e-06,6e-06,0,1e-06,-4e-06,-6e-06,-7e-06,-3e-06,-7e-06,2e-06,-9e-06,3e-06,-2e-06,7e-06,-7e-06,-5e-06,1e-06,-7e-06,-1e-06,1.8e-05,-1e-05,-1e-06,6e-06,-6e-06,-3e-06,6e-06,4e-06,-5e-06,-1e-06,-1.3e-05,4e-06,5e-06,-1e-06,-1e-05,1e-06,4e-06,0,7e-06,4e-06,3e-06,1e-06,7e-06,-5e-06,-1e-06,-1e-05,4e-06,-3e-06,-4e-06,2e-06,2e-06,1e-06,4e-06,8e-06,1.7e-05,-1e-06,3e-06,-2e-06,6e-06,1e-06,3e-06,3e-06,1e-06,-3e-06,0,9e-06,-3e-06,2e-06
0,-2e-06,7e-06,0,-5e-06,-2e-06,-3e-06,1e-05,0,1e-06,1e-06,6e-06,4e-06,-5e-06,-1.3e-05,-2.1e-05,-2e-06,7e-06,-2e-06,3e-06,7e-06,-4e-06,1e-06,5e-06,-8e-06,-5e-06,4e-06,-2e-06,2e-06,1e-06,-4e-06,8e-06,1e-05,8e-06,-1e-06,2e-06,4e-06,0,4e-06,4e-06,-2e-06,5e-06,5e-06,1e-06,2e-06,6e-06,0,8e-06,-7e-06,9e-06,-1.6e-05,-5e-06,5e-06,2e-06,2e-06,-1e-05,1e-06,-4e-06,7e-06,7e-06,1.1e-05,4e-06,6e-06,-1e-06,4e-06,-4e-06,-1e-06,-6e-06,6e-06,5e-06,1e-06,3e-06,0,-1e-05,7e-06,-2e-06,2e-06,7e-06,2e-06,1e-06,0,0,1.7e-05,1.5e-05,-3e-06,-1.2e-05,0,9e-06,0,-3e-06,2e-06,2e-06,-1e-06,-5e-06,-4e-06,2e-06,4e-06,4e-06,8e-06,-8e-06,0,4e-06,0,0,-1e-06,3e-06,-7e-06,-1.7e-05,5e-06,2e-06,-3e-06,1e-06,-3e-06,-1e-06,-1e-06,-6e-06,-3e-06,1e-06,-5e-06,-4e-06,-2e-06
1e-06,3e-06,-4e-06,2e-06,6e-06,2e-06,2e-06,-3e-06,2e-06,1e-05,-6e-06,-9e-06,1.2e-05,1.4e-05,7e-06,1.8e-05,4e-06,-4e-06,4e-06,-7e-06,-7e-06,5e-06,3e-06,-1e-06,5e-06,8e-06,-2e-06,-2e-06,-1e-06,-3e-06,2e-06,-4e-06,-7e-06,-7e-06,-1.6e-05,-1e-06,0,-9e-06,-1e-06,-4e-06,4e-06,-8e-06,-2e-06,-5e-06,-5e-06,-5e-06,3e-06,-4e-06,8e-06,-7e-06,1.2e-05,4e-06,5e-06,-2e-06,-2e-06,5e-06,0,8e-06,4e-06,-2e-06,-7e-06,0,-4e-06,-1e-06,-4e-06,-1e-06,-1e-06,2e-06,2e-06,3e-06,-4e-06,-6e-06,1e-06,-4e-06,-6e-06,3e-06,-9e-06,-1.3e-05,0,-5e-06,-3e-06,3e-06,0,-5e-06,0,1.4e-05,3e-06,-5e-06,-1e-06,0,2e-06,-6e-06,6e-06,4e-06,2e-06,0,-1e-06,-7e-06,-5e-06,9e-06,3e-06,-7e-06,0,3e-06,2e-06,-9e-06,0,1.1e-05,-1e-06,0,5e-06,2e-06,3e-06,-1e-06,-7e-06,5e-06,3e-06,0,2e-06,1e-06,0
2e-06,-6e-06,-2e-06,-2e-06,-3e-06,3e-06,3e-06,6e-06,0,-1.6e-05,1e-05,2e-06,-1.7e-05,-6e-06,1e-06,-1.4e-05,-6e-06,4e-06,-6e-06,1e-06,7e-06,-4e-06,0,-5e-06,-1e-06,-5e-06,-1e-06,0,2e-06,1e-06,1e-06,1e-06,9e-06,5e-06,2.4e-05,-2e-06,-3e-06,1.2e-05,1e-06,1e-06,-3e-06,9e-06,0,5e-06,-1e-06,0,-4e-06,0,-3e-06,3e-06,-1e-06,-3e-06,-1e-06,-2e-06,-1e-06,0,-1e-06,-4e-06,-6e-06,0,4e-06,0,2e-06,1e-06,4e-06,2e-06,-1e-06,2e-06,-2e-06,-6e-06,-2e-06,7e-06,-2e-06,1e-05,4e-06,0,5e-06,1.4e-05,1e-06,0,5e-06,-6e-06,-1e-05,9e-06,-1e-06,-7e-06,-3e-06,1e-06,0,-1e-06,-1e-06,7e-06,-4e-06,-1e-06,2e-06,2e-06,-2e-06,5e-06,4e-06,-9e-06,-5e-06,5e-06,0,-6e-06,-1e-06,1.2e-05,3e-06,-5e-06,0,2e-06,0,-4e-06,-2e-06,2e-06,-1e-06,-1e-06,-3e-06,0,1e-06,-1e-06,0
0,3e-06,5e-06,-2e-06,-3e-06,0,1e-06,-4e-06,-1e-06,1.5e-05,-1.2e-05,4e-06,1.2e-05,5e-06,-3e-06,1.4e-05,7e-06,1e-06,5e-06,5e-06,-2e-06,5e-06,-2e-06,7e-06,-2e-06,2e-06,5e-06,3e-06,2e-06,1e-06,2e-06,1e-06,-1.2e-05,-1e-06,-2e-05,1e-06,2e-06,-1.6e-05,-2e-06,-1e-06,1e-06,-7e-06,-1e-06,-8e-06,2e-06,1e-06,0,4e-06,-4e-06,4e-06,-2e-06,0,-4e-06,0,1e-06,-4e-06,1e-06,6e-06,4e-06,-2e-06,3e-06,-3e-06,0,0,1e-06,2e-06,-1e-06,-5e-06,1e-06,3e-06,1e-06,-1e-05,1e-06,-1.4e-05,-2e-06,-2e-06,2e-06,-8e-06,0,-3e-06,-1e-06,7e-06,-5e-06,-1.2e-05,0,-1e-06,0,2e-06,0,2e-06,-3e-06,-7e-06,-4e-06,-2e-06,-1e-06,-1.1e-05,2e-06,-3e-06,-2e-06,7e-06,4e-06,-4e-06,0,8e-06,1e-06,-4e-06,-8e-06,-1e-06,-1e-06,-8e-06,-2e-06,-2e-06,2e-06,-1e-06,3e-06,-5e-06,1e-06,0,-2e-06,-1e-06,-1e-06
-1e-06,1e-06,-2e-06,0,4e-06,0,-1e-06,-2e-06,-2e-06,-1.3e-05,8e-06,-1e-06,0,-3e-06,-1e-06,-1.6e-05,-5e-06,-6e-06,-2e-06,-2e-06,0,-5e-06,1e-06,-6e-06,2e-06,-1e-06,-2e-06,-1e-06,3e-06,0,-7e-06,-1e-06,9e-06,2e-06,1.6e-05,1e-06,-2e-06,1.1e-05,-1e-06,2e-06,0,7e-06,0,6e-06,3e-06,0,1e-06,-1e-05,7e-06,-9e-06,-4e-06,1e-06,0,3e-06,3e-06,8e-06,0,-9e-06,-5e-06,2e-06,-1e-05,-1e-06,1e-06,-1e-06,-8e-06,-2e-06,1e-06,2e-06,-3e-06,1e-06,1e-06,1.3e-05,-1e-06,1.4e-05,1e-06,3e-06,-6e-06,2e-06,-2e-06,4e-06,0,-6e-06,1e-06,6e-06,1e-06,5e-06,2e-06,-5e-06,0,-2e-06,-1e-06,2e-06,-1e-06,2e-06,1e-06,1e-05,-2e-06,1e-06,5e-06,-4e-06,1e-06,5e-06,-1e-06,-1e-06,-1e-06,-5e-06,9e-06,6e-06,-2e-06,6e-06,2e-06,2e-06,-3e-06,-1e-06,4e-06,7e-06,2e-06,0,3e-06,2e-06,0
1e-06,0,-1e-06,1e-06,0,0,-1e-06,4e-06,1e-06,8e-06,-8e-06,-3e-06,-1.1e-05,-8e-06,1e-06,1.2e-05,-1e-06,7e-06,3e-06,-1e-06,3e-06,4e-06,1e-06,4e-06,-2e-06,-1e-06,1e-06,4e-06,-2e-06,-1e-06,6e-06,-1e-06,-4e-06,0,-7e-06,-1e-06,-2e-06,3e-06,-1e-06,1e-06,-1e-06,-5e-06,2e-06,-8e-06,-2e-06,-2e-06,-2e-06,1.2e-05,-4e-06,8e-06,9e-06,-2e-06,2e-06,1e-06,-3e-06,-6e-06,1e-06,8e-06,0,0,8e-06,2e-06,-1e-06,-2e-06,1e-05,0,2e-06,-4e-06,1e-06,-5e-06,-1e-06,-1.2e-05,0,-8e-06,0,-2e-06,3e-06,3e-06,-1e-06,3e-06,2e-06,5e-06,1.1e-05,-8e-06,-1e-06,-6e-06,-1e-06,6e-06,0,1e-06,1e-06,3e-06,-1e-06,-2e-06,0,-6e-06,2e-06,-1e-06,-2e-06,3e-06,-4e-06,-5e-06,0,-8e-06,-1e-06,4e-06,-3e-06,-8e-06,0,-5e-06,-1e-06,0,0,1e-06,1e-06,0,-5e-06,0,-3e-06,-2e-06,1e-06
-1e-06,-2e-06,2e-06,0,0,-1e-06,-2e-06,-3e-06,2e-06,-1e-06,1.1e-05,4e-06,1.2e-05,3e-06,-3e-06,-1e-05,4e-06,-5e-06,-1e-06,3e-06,-9e-06,-2e-06,-2e-06,1e-06,2e-06,3e-06,0,-5e-06,0,0,-2e-06,1e-06,-2e-06,1e-06,-2e-06,0,2e-06,-1e-05,0,-3e-06,2e-06,4e-06,-4e-06,7e-06,-1e-06,1e-06,0,-1.1e-05,-2e-06,-4e-06,-7e-06,3e-06,-2e-06,-4e-06,2e-06,1e-06,0,-1e-05,-2e-06,-1e-06,-6e-06,2e-06,1e-06,0,-6e-06,-1e-06,1e-06,1e-06,3e-06,5e-06,-1e-06,1.2e-05,0,5e-06,-1e-06,0,4e-06,-8e-06,2e-06,1e-06,-1e-06,-4e-06,0,8e-06,0,2e-06,0,-4e-06,0,0,1e-06,-6e-06,2e-06,-1e-06,0,6e-06,0,8e-06,0,-2e-06,4e-06,4e-06,0,7e-06,1e-06,5e-06,0,8e-06,2e-06,7e-06,0,0,0,0,-3e-06,-5e-06,3e-06,0,3e-06,3e-06,-1e-06
0,-1e-06,0,0,-2e-06,0,0,6e-06,-1e-06,-3e-06,-8e-06,-4e-06,-5e-06,-3e-06,5e-06,1.3e-05,-4e-06,-2e-06,1e-06,-1e-06,6e-06,1e-06,1e-06,-3e-06,-1e-06,-1e-06,0,2e-06,1e-06,0,3e-06,3e-06,4e-06,3e-06,9e-06,-1e-06,2e-06,1.3e-05,1e-06,2e-06,0,-3e-06,0,-4e-06,1e-06,-1e-06,1e-06,8e-06,6e-06,3e-06,2e-06,-3e-06,1e-06,0,1e-06,4e-06,1e-06,6e-06,6e-06,0,0,0,0,1e-06,2e-06,1e-06,0,0,-4e-06,-1e-06,0,-1e-05,0,3e-06,2e-06,1e-06,-6e-06,9e-06,0,-1.1e-05,2e-06,2e-06,-6e-06,-7e-06,0,2e-06,1e-06,1e-06,0,1e-06,0,4e-06,2e-06,2e-06,-2e-06,-7e-06,-3e-06,-9e-06,-2e-06,3e-06,-1e-06,-5e-06,0,-5e-06,-1e-06,-1e-05,1e-06,-6e-06,1e-06,-6e-06,1e-06,-2e-06,0,0,-3e-06,4e-06,2e-06,0,-4e-06,-1e-06,0
-2e-06,2e-06,-1e-06,1e-06,1e-06,0,2e-06,-5e-06,-1e-06,6e-06,5e-06,3e-06,2e-06,2e-06,-1e-06,-1.2e-05,2e-06,5e-06,-2e-06,-3e-06,-1e-06,-2e-06,2e-06,4e-06,2e-06,-2e-06,1e-06,0,-1e-06,2e-06,-4e-06,-6e-06,-3e-06,-2e-06,-1.7e-05,-1e-06,-1e-06,-1.4e-05,1e-06,-1e-06,-1e-06,2e-06,5e-06,2e-06,1e-06,-1e-06,-1e-06,-6e-06,-6e-06,3e-06,0,3e-06,2e-06,2e-06,-1e-06,-6e-06,0,-1e-06,-3e-06,-1e-06,5e-06,-3e-06,-1e-06,1e-06,-2e-06,0,0,0,2e-06,-3e-06,-1e-06,6e-06,0,-9e-06,-2e-06,-1e-06,1e-06,-9e-06,0,1e-05,0,0,-6e-06,9e-06,0,-4e-06,0,1e-06,0,0,-1e-06,-1e-06,1e-06,-1e-06,1e-06,3e-06,3e-06,5e-06,-1e-06,-4e-06,-1e-06,5e-06,0,0,1e-06,6e-06,-4e-06,4e-06,1e-06,3e-06,-2e-06,3e-06,0,0,0,0,-4e-06,0,4e-06,0,1e-06
0,-1e-06,-1e-06,-1e-06,2e-06,1e-06,-1e-06,1e-06,0,-6e-06,-3e-06,-2e-06,3e-06,4e-06,-1e-06,1.1e-05,-1e-06,-2e-06,1e-06,2e-06,-1e-06,2e-06,0,-4e-06,-3e-06,0,0,0,-2e-06,0,2e-06,4e-06,5e-06,2e-06,1.6e-05,1e-06,1e-06,7e-06,1e-06,0,-1e-06,-1e-06,-2e-06,0,-1e-06,0,0,4e-06,2e-06,-7e-06,2e-06,-2e-06,-3e-06,0,-1e-06,1e-06,1e-06,2e-06,-1e-06,1e-06,-7e-06,1e-06,1e-06,0,5e-06,2e-06,0,-1e-06,0,3e-06,-1e-06,-3e-06,0,1.1e-05,3e-06,-1e-06,5e-06,6e-06,0,0,0,-1e-06,0,-6e-06,1e-06,4e-06,-1e-06,-3e-06,0,0,0,1e-06,1e-06,0,1e-06,-2e-06,0,-5e-06,1e-06,4e-06,2e-06,-5e-06,0,3e-06,0,0,2e-06,-1e-06,-2e-06,0,-1e-06,1e-06,1e-06,-1e-06,4e-06,-6e-06,2e-06,0,-3e-06,1e-06,-1e-06
1e-06,1e-06,1e-06,-1e-06,-2e-06,0,0,-1e-06,1e-06,4e-06,-3e-06,1e-06,-2e-06,0,-1e-06,-1.2e-05,-1e-06,3e-06,0,1e-06,2e-06,-2e-06,-2e-06,2e-06,3e-06,0,-1e-06,-1e-06,0,-1e-06,-1e-06,0,-6e-06,0,-1.3e-05,1e-06,1e-06,3e-06,-1e-06,-1e-06,-1e-06,-1e-06,-3e-06,-1e-06,0,1e-06,0,1e-06,2e-06,7e-06,-4e-06,1e-06,-2e-06,-1e-06,2e-06,2e-06,0,2e-06,3e-06,-1e-06,7e-06,-1e-06,-1e-06,-1e-06,-4e-06,-2e-06,-1e-06,1e-06,0,-1e-06,0,3e-06,0,-1.2e-05,-3e-06,2e-06,-5e-06,-4e-06,-1e-06,0,1e-06,2e-06,1.1e-05,6e-06,0,-1e-06,1e-06,3e-06,0,-1e-06,0,2e-06,-1e-06,1e-06,0,3e-06,-1e-06,1e-06,0,-2e-06,-2e-06,4e-06,0,2e-06,0,-2e-06,-1e-06,-2e-06,-3e-06,0,2e-06,0,0,1e-06,1e-06,5e-06,1e-06,0,2e-06,-2e-06,0
-1e-06,-3e-06,1e-06,1e-06,1e-06,0,1e-06,0,0,-3e-06,4e-06,0,-2e-06,-2e-06,-1e-06,1.1e-05,2e-06,-5e-06,0,-1e-06,-3e-06,2e-06,1e-06,-1e-06,-2e-06,3e-06,-1e-06,0,-1e-06,0,1e-06,-4e-06,3e-06,-1e-06,9e-06,-1e-06,-2e-06,-6e-06,-1e-06,1e-06,1e-06,2e-06,3e-06,3e-06,0,-1e-06,0,-3e-06,-4e-06,-4e-06,3e-06,1e-06,1e-06,-1e-06,-1e-06,-2e-06,0,-4e-06,-1e-06,2e-06,-2e-06,0,1e-06,0,0,-1e-06,-1e-06,-2e-06,3e-06,-2e-06,1e-06,-3e-06,0,6e-06,4e-06,-1e-06,-1e-06,4e-06,0,-8e-06,-2e-06,-2e-06,0,-9e-06,0,-2e-06,-1e-06,-2e-06,0,-1e-06,0,-4e-06,-3e-06,-2e-06,1e-06,3e-06,2e-06,4e-06,3e-06,0,0,-5e-06,-1e-06,-3e-06,0,-1e-06,3e-06,3e-06,1e-06,1e-06,0,-2e-06,0,0,0,2e-06,-3e-06,0,0,1e-06,0
0,3e-06,0,2e-06,-1e-06,0,0,2e-06,0,0,-4e-06,-1e-06,2e-06,-4e-06,2e-06,-1.2e-05,-2e-06,3e-06,0,1e-06,3e-06,-2e-06,0,0,1e-06,-2e-06,0,-1e-06,-1e-06,0,-2e-06,4e-06,2e-06,0,1e-06,0,-2e-06,1e-06,-1e-06,0,-1e-06,-3e-06,1e-06,-4e-06,1e-06,0,0,5e-06,3e-06,1e-06,-3e-06,-1e-06,2e-06,1e-06,-1e-06,2e-06,0,2e-06,0,-2e-06,0,1e-06,1e-06,1e-06,4e-06,0,0,0,-3e-06,2e-06,0,4e-06,1e-06,-1e-06,-4e-06,0,5e-06,0,1e-06,8e-06,1e-06,1e-06,-6e-06,7e-06,0,3e-06,0,0,0,0,1e-06,1e-06,-1e-06,1e-06,0,-5e-06,-2e-06,-4e-06,-2e-06,1e-06,1e-06,5e-06,1e-06,2e-06,-1e-06,5e-06,0,-3e-06,2e-06,-1e-06,-1e-06,0,-1e-06,-1e-06,-3e-06,-4e-06,3e-06,0,-1e-06,-1e-06,-1e-06
1e-06,-2e-06,1e-06,-1e-06,1e-06,0,1e-06,-1e-06,-1e-06,1e-06,7e-06,-1e-06,-3e-06,-1e-06,-2e-06,1e-05,1e-06,-1e-06,0,0,-1e-06,2e-06,-1e-06,2e-06,2e-06,-1e-06,-1e-06,2e-06,2e-06,0,2e-06,-2e-06,-6e-06,-1e-06,-9e-06,-1e-06,1e-06,5e-06,-1e-06,-1e-06,1e-06,3e-06,-2e-06,5e-06,0,1e-06,1e-06,-5e-06,0,1e-06,2e-06,2e-06,-1e-06,1e-06,1e-06,0,-1e-06,-3e-06,0,1e-06,2e-06,2e-06,-1e-06,1e-06,-5e-06,1e-06,0,1e-06,-1e-06,0,-1e-06,-7e-06,0,-4e-06,4e-06,0,-3e-06,-5e-06,0,-3e-06,-1e-06,-1e-06,-5e-06,-6e-06,0,-2e-06,0,2e-06,0,0,0,1e-06,0,0,-1e-06,3e-06,0,3e-06,2e-06,-1e-06,0,-5e-06,-1e-06,0,0,-6e-06,-1e-06,2e-06,2e-06,4e-06,1e-06,2e-06,0,1e-06,-3e-06,4e-06,0,0,1e-06,1e-06,0
0,2e-06,0,-1e-06,0,0,0,1e-06,0,-4e-06,-9e-06,4e-06,1e-06,2e-06,3e-06,-9e-06,1e-06,-2e-06,0,0,0,-1e-06,0,-2e-06,-4e-06,1e-06,1e-06,-2e-06,1e-06,0,-1e-06,-1e-06,7e-06,1e-06,1.3e-05,0,1e-06,-1.3e-05,1e-06,-1e-06,1e-06,-3e-06,0,-7e-06,-1e-06,0,0,6e-06,-3e-06,-5e-06,-2e-06,-2e-06,-1e-06,0,0,-2e-06,0,4e-06,3e-06,-1e-06,-4e-06,-2e-06,-1e-06,-1e-06,4e-06,0,1e-06,-3e-06,1e-06,-3e-06,-1e-06,9e-06,0,1e-05,-4e-06,0,-2e-06,7e-06,0,3e-06,-2e-06,1e-06,1e-06,7e-06,0,0,1e-06,-3e-06,0,1e-06,0,-1e-06,1e-06,-1e-06,0,-5e-06,2e-06,-4e-06,-3e-06,0,0,4e-06,1e-06,-5e-06,0,1e-06,1e-06,-2e-06,-1e-06,-5e-06,1e-06,-1e-06,0,0,2e-06,0,-3e-06,0,-1e-06,0,0
