0.074346,0.076092,0.074154,0.059988,0.059983,0.066889,0.065907,0.061595,0.061587,0.069198,0.075554,0.07306,0.066087,0.064921,0.063246,0.06015,0.055708,0.047187,0.046405,0.056573,0.066305,0.074182,0.075911,0.071102,0.066277,0.060169,0.062548,0.066013
0.086563,0.092798,0.093323,0.075084,0.072693,0.079403,0.077131,0.07281,0.074135,0.082263,0.089127,0.086505,0.080441,0.081165,0.079058,0.074577,0.068508,0.058865,0.057792,0.06904,0.079524,0.087322,0.09007,0.085681,0.079753,0.071836,0.07497,0.080447
0.103968,0.118243,0.123591,0.100079,0.093978,0.098843,0.093466,0.090878,0.096095,0.103539,0.109864,0.107762,0.105235,0.10919,0.105452,0.099439,0.091136,0.080048,0.078543,0.090414,0.100638,0.107067,0.111937,0.109084,0.101386,0.091305,0.096366,0.1055
0.113799,0.132053,0.138845,0.11643,0.110152,0.113452,0.106048,0.106755,0.114887,0.117176,0.122304,0.123751,0.126835,0.132029,0.125573,0.121805,0.112355,0.09966,0.098884,0.110098,0.117316,0.118296,0.12378,0.124269,0.116481,0.107428,0.116205,0.129178
0.128271,0.139732,0.14063,0.129278,0.1272,0.129729,0.123534,0.126019,0.133024,0.129677,0.135017,0.139229,0.146282,0.148774,0.137264,0.138076,0.128868,0.115747,0.118241,0.128982,0.131301,0.124027,0.126363,0.130983,0.128153,0.124769,0.137249,0.149933
0.157154,0.155442,0.149365,0.153201,0.160369,0.161729,0.150163,0.145943,0.152372,0.152241,0.161359,0.168677,0.17425,0.167862,0.151527,0.152532,0.141394,0.130465,0.138402,0.150381,0.150064,0.138885,0.136935,0.143409,0.147021,0.147893,0.157766,0.164396
0.190761,0.18077,0.172694,0.188531,0.207089,0.207329,0.184035,0.167541,0.173228,0.181754,0.197904,0.210244,0.209967,0.194499,0.17743,0.174342,0.159992,0.149055,0.158986,0.18164,0.185101,0.175067,0.173895,0.175778,0.17775,0.179493,0.181228,0.17568
0.224887,0.211319,0.199623,0.219988,0.249467,0.248719,0.219652,0.202949,0.207219,0.215706,0.238222,0.254687,0.245239,0.229402,0.217836,0.211232,0.195028,0.18067,0.189367,0.233497,0.247188,0.232936,0.234516,0.228949,0.221243,0.221134,0.210525,0.193202
0.265751,0.251265,0.234364,0.250442,0.284868,0.28459,0.25931,0.257349,0.263678,0.259887,0.286017,0.306319,0.280862,0.272953,0.270579,0.258091,0.238953,0.219343,0.225606,0.292269,0.322931,0.305213,0.316479,0.311797,0.284167,0.269933,0.246548,0.230457
0.300855,0.294434,0.27823,0.288806,0.321621,0.320338,0.298673,0.306987,0.315962,0.304608,0.336566,0.362603,0.317883,0.309959,0.315804,0.296502,0.271907,0.249451,0.250928,0.332669,0.386525,0.365934,0.383089,0.388699,0.343624,0.311997,0.282337,0.276265
0.299343,0.304108,0.292606,0.301678,0.336265,0.34002,0.322686,0.318547,0.316614,0.307457,0.345589,0.372737,0.317022,0.308085,0.324981,0.302932,0.274065,0.252974,0.249318,0.32918,0.393819,0.368294,0.379096,0.396003,0.352312,0.316789,0.287921,0.290129
0.262527,0.268187,0.260579,0.277266,0.310804,0.319237,0.31145,0.285641,0.265919,0.262709,0.299293,0.314844,0.26506,0.268954,0.300577,0.277337,0.24544,0.229504,0.226339,0.288185,0.345802,0.322456,0.309399,0.317928,0.296191,0.282518,0.26462,0.260912
0.230111,0.224972,0.216219,0.237429,0.262694,0.276019,0.282915,0.255109,0.227705,0.220206,0.244351,0.235782,0.204422,0.239234,0.275558,0.245497,0.2086,0.193164,0.191985,0.243018,0.299266,0.280608,0.241325,0.234477,0.234206,0.243979,0.236768,0.217201
0.21662,0.20375,0.189656,0.20068,0.214311,0.230019,0.246612,0.227771,0.203634,0.196451,0.20653,0.188844,0.17704,0.226008,0.25612,0.226915,0.194663,0.17697,0.173534,0.20852,0.25552,0.247835,0.210556,0.203401,0.209758,0.22055,0.216037,0.192196
0.21779,0.209899,0.188423,0.192627,0.198091,0.199871,0.210221,0.201512,0.193873,0.189638,0.177586,0.166797,0.173392,0.206415,0.227364,0.215156,0.212799,0.199736,0.180741,0.199673,0.226777,0.225982,0.206531,0.202988,0.210415,0.214456,0.209817,0.202841
0.254992,0.263474,0.244299,0.258365,0.252588,0.217293,0.231397,0.239879,0.23012,0.225392,0.204042,0.199739,0.205987,0.219186,0.246054,0.252177,0.287653,0.288126,0.248542,0.25401,0.267312,0.273531,0.258521,0.255878,0.274141,0.276015,0.257428,0.259631
0.35779,0.381423,0.361907,0.380183,0.374152,0.313985,0.337205,0.356095,0.329317,0.321853,0.299023,0.295589,0.300742,0.300732,0.327832,0.354739,0.427959,0.431271,0.367866,0.360602,0.367268,0.379184,0.354175,0.348994,0.382562,0.395692,0.36411,0.347822
0.499304,0.535126,0.516458,0.517726,0.514762,0.44991,0.479089,0.501306,0.455477,0.45522,0.437018,0.420103,0.430275,0.426158,0.43847,0.484578,0.58851,0.586571,0.506872,0.480432,0.475205,0.485973,0.440963,0.437405,0.485463,0.519843,0.484341,0.425375
0.637864,0.670112,0.6449,0.604974,0.615649,0.600887,0.631942,0.632084,0.563747,0.572319,0.564669,0.519564,0.544692,0.563098,0.555628,0.600033,0.69695,0.704987,0.634443,0.570654,0.551168,0.550727,0.47331,0.467926,0.520621,0.577879,0.567597,0.470462
0.701115,0.698308,0.665567,0.584172,0.613778,0.693076,0.723613,0.688093,0.602288,0.614187,0.618206,0.539013,0.590513,0.660163,0.658707,0.675112,0.692829,0.748063,0.751041,0.631654,0.573985,0.576142,0.483588,0.454859,0.499131,0.556778,0.591531,0.509045
0.656084,0.614892,0.578331,0.505091,0.545917,0.687351,0.705009,0.643238,0.56219,0.575975,0.593011,0.499945,0.557587,0.64431,0.669895,0.662563,0.58892,0.707331,0.797763,0.649103,0.560278,0.567422,0.48423,0.431239,0.461506,0.496942,0.557881,0.517627
0.562784,0.540787,0.523617,0.491597,0.529273,0.654616,0.628494,0.556111,0.476772,0.488583,0.516993,0.441918,0.467601,0.52326,0.591127,0.582888,0.498231,0.6348,0.712306,0.602836,0.542749,0.515277,0.441663,0.396544,0.42,0.436514,0.506631,0.506566
0.449273,0.459904,0.491234,0.495691,0.53113,0.604968,0.541374,0.490665,0.405817,0.392671,0.450224,0.436323,0.41083,0.407383,0.500894,0.507539,0.445821,0.519126,0.536846,0.534937,0.54038,0.465848,0.41038,0.408665,0.439198,0.426693,0.468687,0.482313
0.344745,0.383977,0.471261,0.489326,0.491027,0.531044,0.479426,0.448038,0.369399,0.316479,0.381938,0.442346,0.413112,0.371566,0.42724,0.436578,0.427182,0.465393,0.436677,0.470823,0.496265,0.423072,0.417737,0.451658,0.472802,0.43972,0.440822,0.446494
0.323345,0.357487,0.475487,0.475961,0.393628,0.39093,0.358628,0.346081,0.331828,0.282471,0.32868,0.420266,0.410849,0.385366,0.397886,0.408978,0.423733,0.44842,0.419337,0.416147,0.410356,0.366635,0.405113,0.441971,0.442787,0.423122,0.418909,0.423472
0.361269,0.374419,0.482641,0.44192,0.299694,0.263265,0.24789,0.272708,0.32259,0.280115,0.306463,0.385183,0.383249,0.40001,0.396404,0.409102,0.434271,0.45246,0.433222,0.41938,0.390691,0.331746,0.343289,0.346891,0.346637,0.403207,0.423581,0.398246
0.368082,0.367911,0.446252,0.391856,0.260879,0.239786,0.260996,0.313528,0.356023,0.30843,0.310182,0.345287,0.347373,0.37547,0.36162,0.369705,0.40538,0.444142,0.438558,0.445593,0.436347,0.346394,0.285369,0.264844,0.278486,0.371836,0.38873,0.332995
0.325974,0.330717,0.372718,0.344081,0.256532,0.246859,0.285696,0.335606,0.365721,0.340309,0.324514,0.343504,0.331257,0.308605,0.313644,0.320579,0.329001,0.367067,0.377176,0.42043,0.471382,0.38733,0.277294,0.246146,0.249283,0.318712,0.32218,0.257847
0.308011,0.304601,0.299178,0.308838,0.291779,0.278255,0.279663,0.305746,0.348209,0.349867,0.346129,0.382844,0.343239,0.281501,0.312859,0.327353,0.294053,0.275532,0.277366,0.351877,0.454646,0.417147,0.299958,0.237148,0.203101,0.255309,0.295053,0.236004
0.329878,0.305559,0.257849,0.285478,0.333884,0.305153,0.248196,0.248663,0.304653,0.339568,0.354379,0.421604,0.421978,0.356375,0.351477,0.367194,0.334984,0.267918,0.220045,0.273029,0.381025,0.383314,0.328303,0.274598,0.209274,0.248994,0.311099,0.258984
0.310757,0.264129,0.195748,0.242141,0.335171,0.307963,0.249609,0.264835,0.301231,0.324441,0.35116,0.423014,0.491604,0.438582,0.361818,0.374602,0.389895,0.307151,0.206846,0.211147,0.293129,0.315074,0.357488,0.359503,0.277075,0.272703,0.316166,0.285259
0.280326,0.229977,0.155007,0.199031,0.282396,0.280659,0.276586,0.312816,0.309445,0.298215,0.314252,0.363205,0.512433,0.52059,0.389956,0.386401,0.427019,0.337688,0.211902,0.174503,0.223574,0.288007,0.411207,0.43453,0.340513,0.293252,0.298173,0.27517
0.268215,0.234351,0.168634,0.203701,0.235726,0.228123,0.290444,0.358051,0.312313,0.263099,0.251398,0.278416,0.474159,0.58933,0.469669,0.430603,0.471366,0.367942,0.239679,0.196353,0.220284,0.313403,0.464996,0.478888,0.385082,0.305028,0.26533,0.245879
0.255299,0.213224,0.174786,0.216783,0.218497,0.195982,0.289725,0.392436,0.322926,0.237163,0.19726,0.224531,0.4078,0.572116,0.499176,0.418784,0.464466,0.364245,0.251091,0.233709,0.24954,0.320073,0.441011,0.464076,0.416678,0.328928,0.232398,0.209482
0.202115,0.173454,0.190636,0.22744,0.208459,0.200857,0.306366,0.391707,0.304529,0.227936,0.174897,0.176822,0.298502,0.442775,0.427035,0.336906,0.377242,0.316548,0.245298,0.232856,0.23931,0.270583,0.330575,0.370073,0.399947,0.353571,0.234925,0.213229
0.140428,0.158657,0.233765,0.24504,0.217191,0.253671,0.311788,0.333254,0.259557,0.22468,0.182722,0.147618,0.188882,0.269839,0.297374,0.255183,0.266798,0.245728,0.220636,0.192667,0.190831,0.216696,0.21671,0.265455,0.361005,0.334833,0.220711,0.212437
0.11885,0.18871,0.274622,0.250888,0.217506,0.298778,0.291843,0.262299,0.237034,0.215161,0.167984,0.11853,0.133864,0.160325,0.187081,0.204776,0.235413,0.207493,0.168334,0.158272,0.158459,0.188509,0.178043,0.207133,0.304903,0.271386,0.180496,0.184207
0.119425,0.215087,0.279807,0.248035,0.216781,0.299088,0.28169,0.229705,0.222401,0.18315,0.134621,0.107011,0.117935,0.15675,0.17855,0.191537,0.237558,0.200639,0.138577,0.154579,0.17452,0.17212,0.168024,0.200497,0.241661,0.215649,0.17985,0.167668
0.126602,0.213518,0.235309,0.206914,0.180705,0.244997,0.244525,0.194812,0.195096,0.142087,0.115586,0.142805,0.174871,0.206589,0.195068,0.179392,0.211357,0.188412,0.159416,0.218504,0.219215,0.179255,0.180973,0.208097,0.182543,0.164861,0.21526,0.189794
0.127669,0.178287,0.165547,0.140739,0.115823,0.164582,0.181012,0.164813,0.163125,0.115337,0.124384,0.20667,0.265055,0.250965,0.217306,0.194872,0.173863,0.170056,0.217004,0.321327,0.266149,0.212065,0.232052,0.228551,0.159795,0.138686,0.2467,0.224227
