-0.008574,-0.010127,-0.012926,-0.01186,-0.012109,-0.014349,-0.010233,-0.006298,-0.006574,-0.010644,-0.009532,-0.015273,-0.01228,-0.013429,-0.013727,-0.006585,-0.008091,-0.008948,-0.008212,-0.00744,-0.005351,-0.005387,-0.007015,-0.005919,-0.005645,-0.006012,-0.006585,-0.009981
-0.005237,-0.008707,-0.014,-0.012902,-0.012824,-0.01183,-0.008823,-0.006211,-0.005733,-0.011075,-0.00752,-0.012874,-0.013271,-0.012212,-0.009967,-0.005136,-0.005934,-0.005166,-0.006836,-0.006763,-0.005275,-0.005434,-0.006454,-0.005176,-0.005346,-0.005868,-0.005434,-0.00789
0.005729,0.003225,0.001139,0.001359,0.002751,0.004368,0.002411,0.001874,0.002567,0.002168,0.003914,0.00552,0.001901,0.004285,0.005226,0.001928,0.002557,0.003286,0.002223,0.00149,0.000779,0.000964,0.001878,0.001027,0.000675,8e-05,0.000503,0.00265
0.004915,0.005294,0.009622,0.010138,0.011352,0.009567,0.006084,0.004646,0.004646,0.008882,0.007027,0.012353,0.01073,0.010386,0.007733,0.003004,0.003931,0.002961,0.0054,0.005423,0.004043,0.004636,0.005869,0.00325,0.003586,0.002949,0.002025,0.005953
-0.00208,-0.00147,0.004416,0.006705,0.006019,0.003653,0.002513,-3.4e-05,0.000146,0.004067,0.002178,0.003478,0.004483,0.001112,-0.000116,-0.000264,0.00058,0.000274,0.002185,0.002836,0.002414,0.002399,0.002153,0.001289,0.002257,0.002051,0.001258,0.002095
-0.003948,-0.005193,-0.005126,-0.004015,-0.006272,-0.004009,-0.001663,-0.003988,-0.003738,-0.005171,-0.003434,-0.006466,-0.006014,-0.008486,-0.00546,-0.002178,-0.002229,-0.000995,-0.002916,-0.002289,-0.001412,-0.002301,-0.003474,-0.001726,-0.001446,-0.000903,2.8e-05,-0.00279
-0.000914,-0.002463,-0.008816,-0.010846,-0.011325,-0.008732,-0.004609,-0.00219,-0.002638,-0.008219,-0.006115,-0.00767,-0.008498,-0.007496,-0.004575,-0.001862,-0.00351,-0.003313,-0.00561,-0.005614,-0.004046,-0.004187,-0.004935,-0.00334,-0.003617,-0.003414,-0.002263,-0.004686
0.002362,0.003777,-0.001174,-0.004665,-0.002938,-0.003869,-0.002506,0.002637,0.001876,-0.001023,-0.0024,-0.000458,-0.000899,0.002182,0.001766,0.000815,-0.000431,-0.001541,-0.001755,-0.00224,-0.001734,-0.000796,-0.000314,-0.000563,-0.000899,-0.001174,-0.001344,-5e-04
0.002949,0.005978,0.008433,0.007973,0.009825,0.007372,0.003353,0.003419,0.004148,0.008372,0.004882,0.006268,0.006443,0.008328,0.006901,0.003041,0.004663,0.004703,0.00494,0.004232,0.00252,0.00344,0.004872,0.003879,0.003132,0.003265,0.002514,0.004898
-0.000138,0.000673,0.007734,0.009937,0.009693,0.009047,0.004286,-0.000617,0.000732,0.006841,0.005081,0.004517,0.005648,0.003936,0.002507,0.000987,0.002791,0.003592,0.004463,0.004632,0.002762,0.002788,0.003801,0.003402,0.002489,0.003074,0.002796,0.003011
-0.00269,-0.004058,-0.001194,6.5e-05,-0.002117,-0.001618,-0.000548,-0.002949,-0.003427,-0.003295,-0.002505,-0.001664,0.000178,-0.003378,-0.004901,-0.002078,-0.003834,-0.004008,-0.001879,-0.000871,-0.00042,-0.001217,-0.001848,-0.001042,-0.000586,-0.00051,-0.000303,-0.002482
-0.001066,-0.001562,-0.006666,-0.007927,-0.009949,-0.00866,-0.002538,-0.000262,-0.002557,-0.007931,-0.006268,-0.003717,-0.00296,-0.003248,-0.002678,-0.00077,-0.003775,-0.004011,-0.003823,-0.00392,-0.002028,-0.002921,-0.004348,-0.00323,-0.001649,-0.001831,-0.001216,-0.002422
0.000944,0.002606,-0.004168,-0.005148,-0.004368,-0.003207,0.00026,0.002928,0.001641,-0.001756,-0.001731,-0.001701,-0.002354,0.001817,0.003911,0.001667,0.002391,0.002758,1.8e-05,-0.001426,-0.000753,-0.000684,-0.001041,-0.001598,-0.001145,-0.001247,-0.00089,0.000392
-0.001861,-0.000596,-0.000133,0.001749,0.004836,0.002806,0.00015,0.000722,0.002171,0.004366,0.001929,-0.000834,-0.000914,0.00209,0.001382,-0.000533,0.002982,0.00258,0.001945,0.001394,0.00015,0.001644,0.002556,0.000197,-0.000788,-0.001335,-0.002155,-0.000421
-0.003495,-0.004213,0.003194,0.005961,0.007162,0.003336,-0.001672,-0.002945,-0.000478,0.003157,0.001082,0.001035,0.001677,-0.001111,-0.004092,-0.002541,-0.001247,-0.001815,0.001158,0.002235,0.000422,0.001523,0.002319,0.001171,0.000654,7.5e-05,-0.000998,-0.000645
-8.4e-05,-0.001058,0.004062,0.004226,0.001568,0.001755,0.000126,-0.002579,-0.001658,-0.001459,0.000185,0.004266,0.003331,-0.001951,-0.001388,0.000547,-0.00141,-0.000127,0.001155,0.001479,0.000598,-0.000262,-0.000386,0.001342,0.00191,0.002461,0.002737,0.002279
0.001398,0.002419,1.5e-05,-0.003216,-0.00613,-0.001457,0.001321,0.00053,-0.000712,-0.003683,-0.000446,0.001979,0.000723,-0.001354,0.002177,0.002912,0.000665,0.002001,-0.000256,-0.001343,9.4e-05,-0.001467,-0.00243,-0.000327,0.000423,0.001586,0.002436,0.001707
-0.001964,0.000597,-0.00492,-0.007469,-0.006741,-0.004591,-0.001069,0.001842,0.000362,-0.0015,-0.001904,-0.004732,-0.003532,-0.001129,-0.000435,0.000181,0.000193,-0.001347,-0.003098,-0.003316,-0.000555,-0.000683,-0.001675,-0.001741,-0.001531,-0.001334,-0.001423,-0.002538
-0.002583,-0.001222,-0.003273,-0.002564,0.000441,-0.001753,-0.001874,0.000441,0.000696,0.002644,-0.000875,-0.005077,-0.003555,0.000511,-0.001568,-0.002206,-2.7e-05,-0.002415,-0.002384,-0.001122,-0.00032,0.000957,0.001214,-0.00033,-0.001142,-0.001511,-0.001546,-0.002508
