-0.101054,-0.062036,-0.001166,-0.000178,-0.00899,-0.044919,-0.030462,-0.070936,-0.156195,-0.152322,-0.158802,-0.167663,-0.162424,-0.153579,-0.130154,-0.084325,-0.032782,-0.008403,-0.004307,-0.00227,-0.002215,-0.001623,-0.001401,-0.001562,-0.00087,-0.000636,-0.000547,-0.000604
-0.121756,-0.077481,-0.002075,-0.000564,0.006159,0.031453,0.02294,0.069494,0.172082,0.18014,0.166902,0.174546,0.181035,0.170934,0.154062,0.106921,0.040598,0.009597,0.003889,0.001413,0.001992,0.001597,0.001471,0.001753,0.000801,0.000318,0.000295,0.000223
-0.021018,-0.011799,0.000787,0.000321,0.002776,0.01265,0.006921,0.006192,0.008303,-0.018336,0.000199,0.006432,-0.002511,-0.004832,-0.012289,-0.014772,-0.004867,-0.000888,4.2e-05,-0.000243,-5.1e-05,-0.000401,-0.000411,-0.000198,4e-05,0.000108,7.6e-05,3.9e-05
0.089699,0.059763,0.000366,-0.000124,-0.007531,-0.037476,-0.029433,-0.088078,-0.175675,-0.162721,-0.155993,-0.170429,-0.172257,-0.170532,-0.145905,-0.095621,-0.038916,-0.009763,-0.004292,-0.002098,-0.002375,-0.001975,-0.001685,-0.001835,-9e-04,-0.000563,-0.000514,-0.000493
0.078232,0.052848,0.004323,0.001056,0.003377,0.02003,0.012318,0.030628,0.109481,0.142268,0.131105,0.131203,0.13802,0.129936,0.122769,0.091411,0.0334,0.008128,0.003107,0.001785,0.00173,0.001477,0.001412,0.00137,0.000446,0.000158,0.000173,0.000218
-0.015981,-0.012409,-0.002677,-0.000628,0.005131,0.023723,0.01636,0.038007,0.078367,0.047323,0.052529,0.073756,0.065965,0.069834,0.05185,0.023973,0.01247,0.003535,0.002071,0.001474,0.001381,0.000681,0.000488,0.000707,0.000543,0.000606,0.000491,0.000501
-0.063151,-0.046294,-0.003195,-0.00085,-0.006693,-0.036297,-0.025169,-0.066478,-0.15562,-0.16519,-0.171043,-0.17112,-0.170935,-0.164441,-0.143525,-0.100403,-0.038856,-0.009622,-0.003943,-0.001984,-0.002085,-0.001838,-0.001623,-0.00147,-0.000466,-0.000158,-0.00022,-0.00026
-0.03801,-0.025059,0.002774,0.000891,-0.001248,-0.004436,-0.003029,0.007202,0.03643,0.073154,0.068982,0.050019,0.062769,0.055832,0.056905,0.054553,0.018199,0.004061,0.000924,9e-05,0.000336,0.00058,0.000724,0.000748,6e-06,-0.000351,-0.000215,-0.000265
0.018404,0.017085,-0.001381,-0.000415,0.006817,0.035068,0.023499,0.060263,0.116846,0.090195,0.102318,0.110082,0.10077,0.105576,0.083341,0.049182,0.022442,0.005346,0.00254,0.001264,0.001191,0.000897,7e-04,0.000696,0.00027,0.000129,0.000198,0.000209
0.0446,0.034885,0.003472,0.000861,-0.002407,-0.013893,-0.00893,-0.037651,-0.106329,-0.129801,-0.131941,-0.123499,-0.132477,-0.126463,-0.112838,-0.084423,-0.03194,-0.007835,-0.002376,-0.001069,-0.001419,-0.001129,-0.001173,-0.00137,-0.000248,7.5e-05,-2.8e-05,5.3e-05
0.014104,0.007925,-0.002218,-0.000826,-0.004849,-0.022596,-0.013762,-0.028477,-0.032749,0.016455,0.013834,-0.003333,0.013527,0.001228,0.005853,0.018251,0.002107,0.000855,-0.000486,-0.000444,-2.5e-05,0.000379,0.000494,0.000311,-0.000103,-0.000217,-0.000212,-0.000177
-0.00403,-0.010985,5.6e-05,0.000149,0.004491,0.022169,0.013354,0.04597,0.110263,0.105183,0.106703,0.112269,0.112309,0.117935,0.09638,0.058384,0.026141,0.006332,0.00196,0.001027,0.001266,0.000942,0.000815,0.000834,0.000148,6.8e-05,0.000109,8e-05
-0.015901,-0.016497,-0.002251,-0.000633,0.000804,0.002103,0.001141,-0.001548,-0.039621,-0.087572,-0.10425,-0.084039,-0.097541,-0.087705,-0.073731,-0.063301,-0.021648,-0.005227,-0.001046,-0.000437,-0.000893,-0.001047,-0.001118,-0.001042,-6.4e-05,0.000251,0.000141,0.000119
-0.030158,-0.013136,0.00373,0.001141,-0.0036,-0.017166,-0.010789,-0.029708,-0.060717,-0.031121,-0.025705,-0.041161,-0.030296,-0.052028,-0.036314,-0.007909,-0.009223,-0.001442,-0.000517,-0.000519,-0.000259,-0.000151,3.1e-05,0.000237,8.4e-05,-3.3e-05,-8.7e-05,-0.00014
-0.012092,0.001077,-0.001882,-0.000575,0.002787,0.014675,0.009204,0.030339,0.080954,0.099537,0.122865,0.109697,0.111188,0.109239,0.087754,0.063696,0.02734,0.005996,0.001689,0.001145,0.001124,0.000898,0.000947,0.001011,0.000122,-0.000172,-5e-06,-3.2e-05
0.017947,0.014176,0.001229,0.000344,0.001254,0.00527,0.005418,0.013226,0.00253,-0.046293,-0.063245,-0.038791,-0.058871,-0.036249,-0.027925,-0.034012,-0.008859,-0.003158,-0.000682,4.9e-05,-0.00071,-0.00064,-0.000749,-0.000978,-0.000189,-3e-05,5.9e-05,0.000151
0.035406,0.015451,-0.001255,-0.000397,-0.004279,-0.020988,-0.011751,-0.035892,-0.075457,-0.062278,-0.070487,-0.076722,-0.064257,-0.077068,-0.058992,-0.029788,-0.017655,-0.003172,-0.001433,-0.001097,-0.000466,-0.000221,-0.000213,-0.000196,1e-05,7.9e-05,-5e-05,6e-06
0.017612,0.004025,0.000378,0.000119,0.001248,0.006874,0.002275,0.007808,0.044564,0.084391,0.106142,0.083353,0.101629,0.093702,0.063798,0.048045,0.020484,0.005078,0.000943,0.000153,0.000965,0.000876,0.000885,0.001037,0.000161,1.6e-05,-2e-05,-4e-05
-0.027082,-0.015796,-0.000195,-6.9e-05,0.002899,0.014048,0.008321,0.020685,0.036853,7e-05,-0.016505,0.009202,-0.011836,0.015741,0.011971,-0.010111,0.001266,-0.001038,0.000224,0.000268,-0.000519,-0.000483,-0.000561,-0.000751,-0.000207,-5.8e-05,1e-06,-1.9e-05
