-8e-04,0.002303,0.001506,-0.001702,-0.000149,0.001609,0.001035,0.001652,-0.000928,-0.002947,-0.002609,-0.001032,-0.000919,8e-06,0.00027,0.000634,-1.8e-05,-0.000745,-0.001298,0.000109,-0.000306,-0.00063,-0.000188,0.000546,0.00076,5.8e-05,-0.000131,-1.7e-05,-0.000287,-0.000658,-0.001097,9.3e-05,-0.000187,-0.000161,-5.3e-05,-9.5e-05,0.000546,0.000344,0.00026,0.000346,0.000355,0.000222,0.000264,-1.7e-05,-9.5e-05,-2e-06,0.000266,0.000148,0.000414,0.000265,0.000106,0.000264,-9.9e-05,4.8e-05,-7.9e-05,0.000134,3.4e-05,0.000523,0.00012,0.000291,8.5e-05,4.8e-05,-0.000123,-1.5e-05,0.000131,4.7e-05,-0.000124,-0.000161,0.000287,0.000415,-1e-05,5e-05,-0.000278,-2.8e-05,0.000222,0.00061,0.000517,0.000479,4e-04,0.000429,0.00012,0.000308,0.000108,7.8e-05,7.2e-05,0.000253,0.000548,-0.000106,0.000522,5.4e-05,-1.1e-05,-7.5e-05,0.000403,-4.8e-05,0.000301,0.000494,0.000347,0.000169,8.8e-05,8.2e-05,6.8e-05,0.000346,0.000348,0.000632,0.000394,0.000161,0.000214,0.000177,0.00018,6.2e-05,0.00013,-2.6e-05,0.000172,-8.1e-05,3.2e-05,7.6e-05,-2.6e-05,-0.000179,0.000153,-0.00016,0.000365
-0.003368,-0.005535,-0.003852,-0.000176,0.000232,-0.000285,-0.002508,-0.002432,-0.004002,-0.0028,3.2e-05,-0.002245,-0.001076,-0.002495,-0.000184,-0.000758,-0.002334,-0.003294,-0.000542,-0.003021,-0.001491,-0.000648,-0.000571,-0.00139,-0.000686,-0.001182,-0.001937,-0.00093,-0.000304,-0.000305,0.000711,-1.3e-05,-0.000251,0.000144,-0.000826,-0.000454,0.000225,0.000234,-0.000135,0.00017,-0.000365,-0.000678,-0.000384,0.000104,-0.000118,4.7e-05,-0.000575,-0.000748,-0.000422,-0.000291,-0.000135,-0.000128,-0.000197,-1e-04,-0.000108,0.000298,0.000151,-0.000144,-0.000651,-2e-06,-0.000215,-1.9e-05,0.000191,0.000236,0.000154,0.000203,0.000329,0.000534,0.000162,-4.3e-05,5.4e-05,-9.6e-05,0.000156,-5.7e-05,8.2e-05,9.8e-05,0.000521,0.000244,0.000137,0.000176,1.7e-05,-0.000208,-0.000118,5.1e-05,0.000149,-0.000481,-3.5e-05,0.000244,-0.000251,0.000202,0.000188,8.3e-05,0.000133,9e-05,8.4e-05,0.000157,-4e-06,8.6e-05,0.000174,0.000125,2.3e-05,0.00024,-4e-06,0.000291,1.7e-05,0.000503,0.000222,-0.000219,-0.000274,-0.000142,0.000138,0.000209,0.000307,0.000203,0.000136,-0.000272,-0.000109,1.1e-05,4.1e-05,-0.00013,0.000204
0.002774,1.8e-05,0.000715,-0.00119,-0.003176,-0.000935,-0.000851,-0.002515,-0.000601,0.000697,0.000222,-0.000258,-0.003482,-0.000623,-0.000545,5e-06,0.000364,0.001294,0.000852,0.00094,0.001123,-0.000347,-0.000343,0.000123,-0.000445,-0.000251,0.000783,0.000598,0.000151,0.000187,-0.000613,-0.000674,-0.001016,-0.000664,0.000148,0.000139,-0.000616,-0.000534,-6.8e-05,0.000121,-7.2e-05,-0.000148,3e-05,0.00027,0.000376,-0.000412,-0.000128,-0.000235,-5.1e-05,-3.7e-05,-0.000196,-0.000182,2.4e-05,0.000235,1e-06,0.000164,-0.000172,-8.5e-05,0.000302,-9.4e-05,0.000196,0.000249,0.000117,-6.1e-05,-0.000253,-6.6e-05,3.5e-05,-3e-06,-0.000223,0.000651,7.2e-05,-0.000238,-0.000144,0.000309,5e-06,-2e-06,0.000448,3.9e-05,0.000277,0.000194,5.1e-05,0.000143,-6.2e-05,-0.000431,-0.000476,-0.00026,0.000588,0.000173,-9.1e-05,-4.4e-05,-0.000115,-0.000217,-7.1e-05,0.000249,-9.8e-05,0.000259,-8.5e-05,0.000363,0.000121,0.000137,-0.000188,0.000247,-8.7e-05,1.8e-05,3.4e-05,-7.5e-05,-0.000176,-0.00011,-0.000115,-0.00037,-7.8e-05,-9.6e-05,0.000224,0.000164,-4.3e-05,-0.000181,-3.7e-05,5.6e-05,0.000406,0.000163,0.000389
-0.001981,-0.000882,0.001291,-0.000739,-0.000538,-0.000209,0.00127,0.00017,0.001388,6e-06,-8.9e-05,-0.000118,0.001928,0.000555,0.000601,-0.000164,0.000259,0.001447,0.000182,-0.000313,-0.000596,-0.000827,-0.000505,0.000107,0.000924,0.000193,-0.00038,-0.000445,-0.000329,-0.000219,0.000543,-3.1e-05,0.000236,0.000194,4.6e-05,0.000107,6.5e-05,5.7e-05,0.000509,0.000355,-0.000699,8.9e-05,0.000224,7.3e-05,-0.000301,3.8e-05,0.00073,0.000516,-0.000178,-2e-05,0.00018,2.6e-05,-0.000227,-4.7e-05,0.000128,9e-05,0.000163,-2.5e-05,0.000311,0.000731,0.000381,-4e-06,-2.3e-05,0.000232,-9e-05,0.000287,6.1e-05,0.000307,-0.000307,0.000106,0.000221,0.000149,9.8e-05,0.00015,3.2e-05,-4.6e-05,0.000353,3e-05,-4.9e-05,8.5e-05,0.000148,0.000276,0.000102,0.000238,0.000118,0.000171,0.000413,0.000217,0.000182,0.000122,0.000156,-3.2e-05,0.000171,0.000468,0.000141,5.6e-05,5e-05,0.000102,-6.1e-05,-0.000165,0.000235,0.000125,9e-05,0.000313,0.000255,0.000173,-3.8e-05,0.000145,6.9e-05,-1e-04,0.000402,0.00019,7.7e-05,-2.8e-05,4.8e-05,0.000263,0.000153,-0.000117,-3.8e-05,6e-06,8.8e-05
-0.000785,0.001005,0.000268,0.002344,0.002522,0.001416,0.000612,0.0015,0.000515,0.000604,0.000326,0.001048,0.001236,0.000309,4.4e-05,6.7e-05,8.3e-05,-0.000734,9.4e-05,-0.000373,0.000158,0.001019,7.3e-05,-0.000912,-9.9e-05,9e-06,3.8e-05,0.00034,8.7e-05,0.000145,-0.00039,-0.000225,9.3e-05,0.000127,-2.3e-05,-0.000542,7.8e-05,0.000289,-0.000326,0.000186,0.000114,0.000265,0.000639,0.000187,5.5e-05,0.000103,-3.9e-05,0.000187,-0.000414,-6.4e-05,3e-04,8.2e-05,-0.000103,3.4e-05,0.000275,0.000416,7.5e-05,-0.000123,-0.000164,-9.9e-05,9.7e-05,0.000209,0.000269,3e-05,-6.1e-05,-8.3e-05,8.4e-05,3.7e-05,0.000101,7.2e-05,3.2e-05,-2.5e-05,-4.1e-05,-4.6e-05,0.000205,5.8e-05,0.000193,7e-05,0.00018,0.000298,-4.1e-05,-4.1e-05,-0.000197,-1.7e-05,0.000132,9.7e-05,-6.4e-05,-5.8e-05,0.000417,-9e-06,-4.1e-05,-0.000156,-1.7e-05,9.2e-05,-9.3e-05,8e-05,0.000263,0.000123,0.00018,0.000143,0.000251,2.5e-05,-7.8e-05,0.000291,-2e-05,0.000178,9.1e-05,-3.1e-05,-0.000102,8.8e-05,5.6e-05,-4.7e-05,2.3e-05,-7.7e-05,-6.6e-05,-0.00019,-0.000166,7e-06,-6.2e-05,4.6e-05,0.000237
0.001072,-0.000106,-0.000713,-0.000962,-0.000554,-0.000897,0.00092,-0.000971,-0.000834,0.000679,0.000189,0.000241,-0.000808,-0.000779,-0.000103,-0.000508,-0.001345,-0.001284,-0.000255,0.000447,5.6e-05,0.000433,0.000648,-0.000341,-0.000275,-0.000327,0.000238,0.000486,0.00012,-8.2e-05,-0.000182,-0.000208,0.000278,3.5e-05,-9.1e-05,0.000205,-0.000191,-0.000834,-0.000591,-0.000155,1.2e-05,-0.000406,-0.000258,-0.000284,-0.000231,-0.00028,-0.00018,-0.000389,-7.6e-05,0.000294,-4.7e-05,-6.3e-05,4.2e-05,0.000216,-0.000166,0.000122,-0.000101,1e-04,-7.6e-05,-0.000128,-0.000179,-0.000155,7.5e-05,-3.3e-05,-4.5e-05,0.000107,-0.00028,0.000318,7.8e-05,0.000121,-0.000142,-0.000141,-0.000161,-0.000181,-2.8e-05,-0.000201,0.000227,-3.6e-05,8.3e-05,0.000155,-0.00022,-0.000135,-0.00021,3.5e-05,0.000172,0.000105,-7.6e-05,-8.2e-05,-7.5e-05,-0.000206,-3.3e-05,-8.8e-05,-0.000117,-4.7e-05,-0.00013,0.000236,-3.6e-05,1.8e-05,-0.000102,-7e-05,2.1e-05,-8.1e-05,-0.000247,0.00015,-0.000234,-6e-06,-3.1e-05,-0.000138,7.1e-05,0.000108,-5e-05,-0.000162,6.9e-05,-8e-06,-2.6e-05,-2.7e-05,-2.7e-05,-9.3e-05,0.000111,-8.9e-05,-0.000187
-0.000318,-0.001586,-0.001045,-0.000765,0.000229,0.000258,-0.001538,-0.000595,-0.002394,-0.002278,-0.001003,-0.000277,-0.001083,-4e-05,0.000399,-0.000505,-0.000507,0.001112,-0.000498,-0.000364,-0.001498,-0.001008,-0.000355,7.8e-05,-6.4e-05,-7.5e-05,-0.00043,-0.001076,-0.000496,-0.000304,-2.7e-05,-2e-04,-0.000205,-0.000482,-0.000357,-4.2e-05,4.6e-05,-0.000348,-0.000322,-0.000587,-0.000116,-6.8e-05,-0.000115,-0.000327,6.6e-05,2.4e-05,-0.00019,-0.000122,5.5e-05,-1.3e-05,-0.000262,-0.000154,9.7e-05,-0.000217,-0.000285,-0.000328,-0.000309,-1.6e-05,0.000101,-4.5e-05,3.9e-05,-0.00022,-0.00011,-0.000113,-9e-06,0.000141,-5e-05,-0.000122,-0.000139,-0.000135,-0.000208,-0.000159,-7.2e-05,4.4e-05,2.4e-05,-3e-04,-2.7e-05,-6.7e-05,6.3e-05,-9.8e-05,-9e-05,0.000102,0.00013,-0.000158,-0.000269,-0.000235,9.9e-05,-0.000281,0.000124,0.000211,-4.1e-05,1.3e-05,-0.000112,6.7e-05,-6.5e-05,-1e-05,-0.000188,-2.7e-05,-4.9e-05,-0.000188,-6.9e-05,9.3e-05,3e-06,-4.9e-05,-5.4e-05,-0.000188,-9e-06,-0.000123,0.000244,-3.8e-05,-0.000138,-0.000108,9e-06,-0.000163,-0.000124,-5.2e-05,5.5e-05,-3e-06,-5.9e-05,5e-06,0.000184
4.5e-05,0.00177,-6.9e-05,0.000683,-0.000491,-0.001064,-0.000774,0.000596,0.001475,0.000674,0.000497,0.000338,0.001235,9.9e-05,0.00031,0.000325,0.000754,-0.00015,0.00014,-0.000277,0.000678,0.000384,-0.000235,0.00012,-0.000142,0.000371,-0.000377,0.000247,1e-04,-0.000269,-0.000533,-0.000264,-9.3e-05,3.1e-05,-1.9e-05,2e-06,7.8e-05,2.7e-05,0.00021,4.7e-05,-6e-05,-0.000187,-0.00012,5e-06,-0.000117,-0.000147,0.000206,0.000276,8.4e-05,-8.4e-05,5.3e-05,-0.000128,0.000205,-8.3e-05,1.2e-05,0.000135,7.4e-05,3.1e-05,6.5e-05,0.000164,9.5e-05,8.7e-05,6.5e-05,-4.3e-05,-0.000149,-1.2e-05,-7.1e-05,0.000193,6e-06,7.7e-05,-6e-05,-6.3e-05,-6.5e-05,-0.000101,0.000234,-4e-05,-0.000164,-7.9e-05,-6.8e-05,1e-05,-1e-06,-0.000116,3.6e-05,-4.6e-05,-1.5e-05,-6.5e-05,1.9e-05,1.9e-05,4.6e-05,6.7e-05,-8.2e-05,6.3e-05,4.1e-05,9.7e-05,-4.7e-05,-0.000154,-0.000114,-9.5e-05,0.000165,-0.000121,4.8e-05,-0.000124,-0.00018,-0.000336,-0.000114,-8.8e-05,-0.000232,-0.000154,-0.000156,-7e-06,-2.1e-05,-4e-05,3e-05,-8e-06,-1e-06,0.000105,0.000107,-5.7e-05,-1.8e-05,-7e-05,-3.3e-05
-0.000356,0.000292,0.000561,-0.000184,0.000165,0.000354,0.000273,9e-04,0.000727,0.000464,-0.000157,-1.1e-05,-0.000296,0.000252,-0.000185,-9.1e-05,-0.00032,-3.4e-05,0.000428,0.00013,1e-06,-0.000355,-0.000369,4.3e-05,-0.000316,5.2e-05,0.000321,0.000266,9e-05,-8.1e-05,0.00027,0.000308,0.000222,0.000194,0.00025,-0.000135,-7.3e-05,0.000207,-4.9e-05,-0.000101,0.000108,6.1e-05,0.000137,0.00018,-6.1e-05,0.000158,0.000131,-0.000104,-0.000187,-0.000165,2.3e-05,0.000175,-6e-06,0.000105,-5.2e-05,2.4e-05,-0.000123,-0.000185,4.4e-05,-0.000143,-1.2e-05,-2.4e-05,-2.9e-05,3.5e-05,-3.2e-05,-3.3e-05,1.2e-05,-0.000151,-5.1e-05,-0.000173,-0.000249,3.9e-05,-3.4e-05,-4.6e-05,7.7e-05,1e-05,-0.000116,-0.000146,-0.000145,3.8e-05,-4.1e-05,2.6e-05,-2e-06,-1.8e-05,-5.8e-05,3e-05,-0.000134,-5.5e-05,3e-05,3.1e-05,-0.00013,1.2e-05,-7e-05,-2.1e-05,-7.7e-05,-0.000116,-4.2e-05,-0.000129,-0.000164,-6.7e-05,-1.1e-05,-0.000148,-0.000121,-3.7e-05,-2.7e-05,2e-06,-0.000151,6.4e-05,-4.9e-05,-2.9e-05,6.5e-05,-3.9e-05,-5e-06,-6.5e-05,-9.8e-05,-8e-06,-4.7e-05,0.000135,-3.3e-05,-0.000103,-0.000156
0.000449,-0.00046,-0.000451,-0.000128,0.000645,0.000369,0.000359,-4.6e-05,0.000199,8.4e-05,0.000795,0.000389,0.000344,-0.000444,-0.001164,-0.000291,-8e-06,-7.8e-05,-4.2e-05,-0.000586,2.8e-05,0.000342,0.000375,0.000199,-0.000143,-6.1e-05,0.000336,-0.000231,4.7e-05,0.00033,5.7e-05,-0.000311,-0.000164,0.000142,-0.00016,-4.7e-05,0.00021,-3.1e-05,-5.6e-05,-0.000198,0.000167,0.000251,-0.000163,-0.000214,-5.8e-05,-5.9e-05,-8.7e-05,-0.00021,-7.6e-05,-0.000154,3.9e-05,-8.3e-05,-1.8e-05,-7e-06,-7.7e-05,2e-06,3.9e-05,-0.000106,4.6e-05,-6.6e-05,-0.000114,-6.8e-05,3e-05,-9.8e-05,5.7e-05,-0.000141,-8.8e-05,3.2e-05,-7e-05,-0.000206,-0.000158,-7.2e-05,9e-05,1e-06,-7e-05,2.6e-05,-0.000101,-7.5e-05,-7e-06,1e-05,-6e-06,-0.000166,-9.2e-05,2.1e-05,1.6e-05,2.1e-05,-7.9e-05,-0.000264,-0.000134,-0.000109,-0.000139,-6.1e-05,5.3e-05,-5.3e-05,-9.2e-05,5.2e-05,-7.3e-05,-7.1e-05,-4.4e-05,1.5e-05,-4.4e-05,-0.00014,3.4e-05,-5.4e-05,-5e-05,-6.6e-05,-2.5e-05,-5.7e-05,2.1e-05,-6.9e-05,-1e-06,-4.2e-05,-1e-05,1.9e-05,-5e-05,6.5e-05,3.6e-05,-4.7e-05,-3.2e-05,0,4.6e-05
0.000475,0.000698,0.000657,-0.000383,-0.000406,0.000188,1.9e-05,0.000281,-0.000141,-0.00048,-0.001046,-0.000778,9.3e-05,0.000217,0.000315,0.000213,9.5e-05,1.7e-05,-0.00037,0.000565,-0.000105,-0.000427,0.000266,-0.000493,1.8e-05,0.000137,7.6e-05,-2.8e-05,-0.000187,-3.9e-05,-0.000115,-2.2e-05,7e-05,-8e-06,-3.6e-05,7.8e-05,0.000114,-1e-05,-2.8e-05,-3.9e-05,0.000175,4.5e-05,4.9e-05,-0.000106,0.000159,0.000146,0.000105,0.000117,0.000151,3.4e-05,-7.1e-05,-1.4e-05,-8.7e-05,3.6e-05,6.6e-05,-2.8e-05,-9.7e-05,5.6e-05,-2.5e-05,6.8e-05,5.1e-05,-0.00011,-3.1e-05,-6.2e-05,-2.9e-05,-3.5e-05,1e-06,4e-05,1.6e-05,9e-06,6.3e-05,-7e-06,-7e-06,6.3e-05,6.9e-05,-9.8e-05,7.1e-05,1.4e-05,-0.000125,1.7e-05,-0.000115,4e-06,3.8e-05,-3.4e-05,-2.8e-05,-1.3e-05,-7e-06,1.2e-05,-9.3e-05,-7e-06,5.1e-05,3.6e-05,5.8e-05,9e-06,-5.9e-05,-3.3e-05,1.5e-05,4.3e-05,1e-05,-2e-05,2.5e-05,6e-05,-6.1e-05,-0.000142,-0.000131,-4.1e-05,-2.1e-05,6.6e-05,2.6e-05,1.3e-05,-2.9e-05,-3.3e-05,-5e-05,-4.1e-05,2e-06,3.7e-05,-2.8e-05,-5.4e-05,9e-06,-3.6e-05,2.2e-05
-0.000341,-0.000302,-9.5e-05,-0.000327,-0.000239,-0.00019,-0.000317,-0.000619,-0.000374,0.000226,-0.000514,0.000464,-0.000431,-0.000168,7.5e-05,-0.000256,9.3e-05,0.000401,0.000308,-4e-06,5.9e-05,-0.000252,-7e-05,0.000146,0.000114,5.3e-05,-0.000265,9.2e-05,0.000127,-1.1e-05,7e-06,0.000137,-4e-05,-3.2e-05,-1.9e-05,-3.4e-05,6e-05,-1.3e-05,5.6e-05,5.4e-05,-0.000109,2.2e-05,-3.2e-05,-5e-06,-3.4e-05,8.2e-05,-1.3e-05,-7.2e-05,3.3e-05,2.6e-05,-1.9e-05,2.3e-05,0.00013,6.1e-05,-7e-05,-9e-05,-2.7e-05,-6e-06,5e-06,-1.7e-05,-7e-06,2e-05,-5.9e-05,-2.4e-05,-6e-05,-5.1e-05,-6.3e-05,-0.000206,-4.9e-05,-1.6e-05,-2.4e-05,9.4e-05,2e-06,1.7e-05,-8.2e-05,-3.2e-05,-5.3e-05,-1.8e-05,-7.7e-05,-4e-06,-4e-05,-1.9e-05,1e-06,9.5e-05,-2.7e-05,-8.7e-05,8.9e-05,2e-05,-6.8e-05,-2.3e-05,1.1e-05,6.5e-05,1.1e-05,-3.3e-05,-5.2e-05,-4.3e-05,-3.8e-05,-4.7e-05,1.3e-05,-5.3e-05,-0.000123,-4e-06,-5e-05,-6e-06,-8.4e-05,-8.2e-05,-2.4e-05,-6.8e-05,-6.6e-05,4.9e-05,2.3e-05,-1.8e-05,-5.5e-05,-2e-06,-1.5e-05,3.3e-05,-6e-06,0,3e-06,0,-6.9e-05
-5.9e-05,-0.000596,5.5e-05,0.000578,0.00024,0.000172,0.000435,-4.4e-05,0.00034,1.5e-05,0.000613,-0.000481,7e-06,-5.5e-05,0.000358,-0.000146,-7.3e-05,-0.000397,-1.1e-05,-0.000334,-0.000192,0.000203,2.6e-05,9.1e-05,0.000142,-0.000142,1.3e-05,-0.000151,2e-06,-5e-06,-1.2e-05,3.6e-05,-1.5e-05,-0.000152,0.000119,-4e-06,-0.000168,-3.1e-05,0.000102,6.7e-05,5.4e-05,2e-06,3.3e-05,8.5e-05,-0.000122,-1e-06,-3.5e-05,8.5e-05,-9e-05,-2.7e-05,-6e-06,-3.8e-05,-5.4e-05,5.3e-05,-3.1e-05,4e-06,5e-06,-3.3e-05,-4.1e-05,-4.4e-05,-1.9e-05,-2.9e-05,4e-06,-4.3e-05,3.1e-05,4.3e-05,-6.4e-05,2.5e-05,-8e-06,5.4e-05,-4.1e-05,-2.6e-05,5e-06,-3.7e-05,-2.8e-05,7e-06,-3.7e-05,-1.1e-05,-3.3e-05,-2.5e-05,3e-05,-1.5e-05,3.7e-05,6.6e-05,1.2e-05,-1.3e-05,-3e-06,-3.5e-05,-3.5e-05,-1e-06,-1e-05,2.7e-05,1.1e-05,-2.8e-05,-3.4e-05,-4.5e-05,-6e-05,-9.6e-05,-3.3e-05,3e-06,5.3e-05,-4e-05,-6.4e-05,3.6e-05,5.2e-05,1.7e-05,7e-06,-1e-05,-7.5e-05,-1.9e-05,-1.5e-05,-8e-06,-2.3e-05,-3.1e-05,1e-05,2.3e-05,-1.2e-05,4.1e-05,7e-06,5e-06,-2.2e-05
-8.1e-05,0.000258,1.5e-05,0.000249,-1.5e-05,-0.000242,-0.000132,7.7e-05,-0.000335,0.000125,-5e-06,0.00027,-4.6e-05,-2.4e-05,-0.000283,8e-06,7.1e-05,8.1e-05,-0.000213,9.5e-05,-1.1e-05,0.000108,2.2e-05,1e-04,1.2e-05,2e-06,6.1e-05,8.8e-05,-4.6e-05,-8.7e-05,5.2e-05,8e-06,4e-05,-2.2e-05,-8e-06,-5.4e-05,-4e-06,-7e-05,-4.7e-05,2.5e-05,0.000121,-1.5e-05,7.7e-05,1.8e-05,5e-05,7.5e-05,1.6e-05,1.7e-05,2.1e-05,7e-06,-2.7e-05,3.4e-05,-8e-06,-3e-05,7e-05,-2.8e-05,-3.1e-05,-2e-06,2.7e-05,-6.9e-05,2.7e-05,-4.3e-05,1.2e-05,3.6e-05,1.5e-05,-2.1e-05,-5e-06,-2.8e-05,-2.1e-05,-2.3e-05,-4.6e-05,-2.3e-05,-1.3e-05,-3e-06,-5e-06,-9.2e-05,3.4e-05,1.1e-05,-3.7e-05,-5.1e-05,-2.8e-05,3.6e-05,-8e-06,-3.8e-05,-1e-06,-4e-06,-3.3e-05,1.2e-05,-9e-05,-9e-06,-2.6e-05,4e-06,-2.8e-05,2.2e-05,-1.8e-05,5e-05,-1.5e-05,-2.4e-05,7e-06,-2.1e-05,2.4e-05,-2.5e-05,3.5e-05,-6e-06,2.4e-05,-3.9e-05,-2e-06,1.5e-05,-3.9e-05,-2.4e-05,-2.3e-05,3e-06,5e-06,-3e-05,1.9e-05,2.9e-05,-2.6e-05,-5e-05,-1e-05,-1.8e-05,-2.8e-05
0.000208,0.000108,-0.000172,-0.000218,-0.000187,0.000156,6.3e-05,3.2e-05,3.1e-05,-0.000101,-4.7e-05,2.6e-05,-8e-05,2e-06,-8.6e-05,0.000104,-4.1e-05,-9.9e-05,3.5e-05,0.00013,0.000125,-0.000166,-5.1e-05,7.6e-05,-2e-05,-5.5e-05,-7.8e-05,0.00012,5.7e-05,0.000113,-3.4e-05,-3e-05,-9e-06,-2.4e-05,4e-06,2.1e-05,1.2e-05,2.4e-05,-2.9e-05,-3e-05,-6.6e-05,1e-06,4.2e-05,1.1e-05,5.5e-05,3.6e-05,-2.5e-05,-6.1e-05,5.7e-05,3.5e-05,6e-05,-1e-06,-6.2e-05,-6.9e-05,-4e-06,-1e-06,3e-06,-7e-06,2.2e-05,-6.9e-05,9e-06,7e-06,-1.8e-05,-2.8e-05,-1.5e-05,-5e-06,2.2e-05,3.3e-05,2.1e-05,1e-06,-4.8e-05,4.1e-05,1e-06,3e-05,-1.7e-05,-4.9e-05,2.4e-05,2e-06,-1.9e-05,1.4e-05,7e-06,-2.6e-05,-7e-06,9e-06,-8e-06,-1.1e-05,-4.6e-05,2.2e-05,-5.4e-05,-9e-06,-3.4e-05,-8e-06,-1e-06,-9e-06,-2e-05,-1e-05,1.2e-05,-9e-06,-1e-06,-4.2e-05,-3.4e-05,-2.5e-05,1.4e-05,-1.4e-05,9e-06,1.6e-05,2.9e-05,2.5e-05,1.5e-05,3.8e-05,1.5e-05,-6e-06,-3.7e-05,2e-06,-1.2e-05,1.8e-05,-1.5e-05,1.5e-05,2.3e-05,7e-06,6e-06
-4.8e-05,-0.000134,6e-06,0.000195,-7.1e-05,-8.5e-05,-0.000155,-0.000109,-7e-06,0.000132,7.1e-05,-0.000211,-0.000115,0,0.000107,0.000118,4.7e-05,-1.1e-05,3.3e-05,-9.8e-05,4.6e-05,0.000131,6.6e-05,-0.000249,-6.7e-05,-5.2e-05,-3.2e-05,-1.7e-05,-6e-06,-8.4e-05,7.3e-05,-4e-06,-2.1e-05,1.8e-05,-3.6e-05,2.1e-05,-3.6e-05,1.6e-05,-5.1e-05,1.8e-05,-4.9e-05,-1.4e-05,-9e-06,-2.5e-05,-6e-06,5e-06,-2.9e-05,-5e-06,1.1e-05,4e-05,7.9e-05,-9e-06,-1e-05,1.7e-05,-2e-05,2.5e-05,-2e-05,3.8e-05,-1.3e-05,-1.2e-05,-1.4e-05,9e-06,-2e-06,-7e-06,4e-06,2.3e-05,1.8e-05,-2.1e-05,9e-06,-2.9e-05,2.8e-05,-9e-06,1.8e-05,-3e-06,-5e-06,2e-05,1.7e-05,-3e-06,-5e-06,-4e-06,-1.4e-05,1.3e-05,2e-06,2e-06,2.9e-05,-1e-06,-3e-06,-1.5e-05,1.3e-05,-1.5e-05,-2e-05,0,9e-06,1e-05,-1.6e-05,-2e-05,-4e-06,1e-05,-1e-06,-7e-06,3e-05,2.1e-05,4e-06,2.1e-05,3e-06,-1.4e-05,-6e-06,1.8e-05,1.7e-05,1e-06,-2e-06,-1.2e-05,7e-06,3e-06,8e-06,-3e-06,-1e-05,-7e-06,-3e-06,-7e-06,1e-06
-0.000104,1.4e-05,-6.4e-05,-1.6e-05,3.9e-05,6.2e-05,3.9e-05,5.6e-05,-3.2e-05,-0.000159,5e-05,-7.9e-05,0.000128,7e-06,0.000123,-1.9e-05,2.7e-05,0.000105,-6.5e-05,-5.2e-05,-6.8e-05,0.000114,-0.000183,6e-06,-1.8e-05,-2.7e-05,3.6e-05,-8.8e-05,1.2e-05,3.7e-05,-4.7e-05,1.2e-05,1.9e-05,2.8e-05,-1.8e-05,-1.6e-05,5e-06,-5.2e-05,2.2e-05,-6.3e-05,1e-05,1.6e-05,-1.7e-05,-2.7e-05,-1.9e-05,1.9e-05,-1e-05,-8e-06,-7e-06,-2e-06,6e-06,2.4e-05,3e-06,-1.8e-05,-3e-06,-1e-06,1e-06,-4e-06,-8e-06,3.1e-05,4e-06,-1.5e-05,1.7e-05,5e-06,-6e-06,2.6e-05,1.1e-05,1.6e-05,-1.9e-05,9e-06,-1.5e-05,0,-1.1e-05,6e-06,-6e-06,-1.9e-05,-4.6e-05,-4e-06,1e-06,-1e-06,-3e-05,2e-06,7e-06,-2e-06,-1.3e-05,3e-06,3.1e-05,-5.2e-05,-1.1e-05,2.7e-05,-1.5e-05,-1.8e-05,3e-06,1.1e-05,-8e-06,-7e-06,4e-06,-6e-06,6e-06,9e-06,-8e-06,0,-9e-06,-1.2e-05,-2.4e-05,-4e-06,-3.3e-05,1.6e-05,-1.4e-05,-5e-06,4e-06,-1e-05,1.7e-05,7e-06,-1.3e-05,5e-06,-3e-06,4e-06,-1.3e-05,-1.3e-05,6e-06
-3e-06,5.4e-05,0.000103,-0.00018,2.4e-05,-5e-05,-3e-05,-9.7e-05,-1.8e-05,4.8e-05,-4.9e-05,0.000178,-5.5e-05,-6e-06,-2.3e-05,-3.2e-05,2.5e-05,-1.2e-05,-5.8e-05,1.1e-05,-1.5e-05,-0.000131,4.3e-05,4.2e-05,8e-06,1.9e-05,5.1e-05,8e-06,-1.5e-05,9e-06,-3.7e-05,-2.6e-05,-8e-06,-8e-06,-8e-06,-6e-06,-9e-06,-2.4e-05,2.1e-05,2.5e-05,2.1e-05,3.3e-05,-4.4e-05,-6e-06,-1.7e-05,-1.8e-05,-1.7e-05,-7e-06,-2e-05,-3.2e-05,-1.4e-05,-1.9e-05,1e-06,1.8e-05,-1.1e-05,0,-2.1e-05,-1.2e-05,-1.5e-05,2.3e-05,-9e-06,-5e-06,-5e-06,-1.3e-05,8e-06,6e-06,-1e-05,1.6e-05,2e-06,-1.6e-05,4e-06,1.4e-05,1.4e-05,-1e-05,4e-06,-1.9e-05,-1.3e-05,-6e-06,4e-06,9e-06,-1e-06,-1.4e-05,4e-06,-4e-06,4e-06,-1e-06,3e-06,1e-06,1.9e-05,0,-1.6e-05,1e-05,5e-06,1.1e-05,-1.3e-05,1e-05,3e-06,-5e-06,5e-06,-5e-06,-1.9e-05,-2.2e-05,-1.4e-05,-3.3e-05,-1.1e-05,-1.2e-05,1e-06,-5e-06,1.4e-05,-1e-06,4e-06,-1e-05,3e-06,-1.1e-05,-5e-06,-1.2e-05,-7e-06,-2.2e-05,-6e-06,-1e-06,-6e-06
7.6e-05,-9.2e-05,8e-06,6e-05,-3.9e-05,5.5e-05,-3.9e-05,-3.5e-05,1.3e-05,-7e-05,-0.000117,-0.000152,-5.7e-05,1e-06,-0.000105,-4.7e-05,1e-05,-3.9e-05,2e-05,-1.6e-05,-2.9e-05,8e-06,3.9e-05,3.5e-05,-3e-06,-5.2e-05,-5e-05,2.4e-05,2e-05,2.2e-05,2.9e-05,2.9e-05,3e-06,-2.7e-05,1.4e-05,-1.3e-05,-2.6e-05,1.5e-05,1.9e-05,-3e-06,-4e-05,-1e-06,-8e-06,1.9e-05,1e-06,3.1e-05,3e-06,-1.5e-05,1.5e-05,-1.6e-05,-7e-06,8e-06,-1.3e-05,3e-06,-2.4e-05,-5e-06,7e-06,-5e-06,-1e-06,3e-06,-7e-06,3e-06,-5e-06,9e-06,-5e-06,-1.1e-05,-2.5e-05,-8e-06,4e-06,-5e-06,-2.6e-05,8e-06,-6e-06,0,1e-06,8e-06,7e-06,-5e-06,3e-06,8e-06,0,5e-06,0,1.3e-05,2e-06,-1.1e-05,-1e-05,-1.2e-05,2.1e-05,-2e-06,-1.5e-05,-1.5e-05,-3e-06,1e-06,-1.1e-05,6e-06,-1.1e-05,0,-8e-06,-1.2e-05,1.2e-05,-1e-05,-6e-06,-1.2e-05,-1e-06,-1e-06,-1e-06,-4e-06,2.2e-05,6e-06,-6e-06,-1.2e-05,-7e-06,-7e-06,0,-4e-06,1e-06,1.4e-05,5e-06,-4e-06,6e-06
-9e-06,2.6e-05,1.5e-05,6.5e-05,3.1e-05,-7e-05,5.7e-05,2.8e-05,4.5e-05,9.7e-05,0.000213,0.000152,0.000109,-2e-05,-0.000104,-2e-06,1e-05,2.4e-05,3e-06,1.4e-05,-1.9e-05,3.6e-05,2.3e-05,3.1e-05,2e-05,8e-06,-2.4e-05,-4.3e-05,-2e-06,-3.8e-05,-2.3e-05,1e-05,-4e-06,-1.8e-05,1e-05,9e-06,1.3e-05,-2.2e-05,1e-06,1.2e-05,-2.3e-05,-1.3e-05,-1.2e-05,1.5e-05,3e-05,-1e-05,0,2.5e-05,1.8e-05,0,-2e-05,0,-1.1e-05,1.7e-05,1e-06,8e-06,-1.4e-05,8e-06,7e-06,4e-06,3e-06,-1.7e-05,5e-06,-2e-06,-1.1e-05,-1.4e-05,-8e-06,3e-06,-5e-06,-1.2e-05,-8e-06,0,-3e-06,3e-06,4e-06,-1.4e-05,-7e-06,0,-9e-06,-3e-06,-3e-06,-5e-06,-7e-06,6e-06,-1e-05,-2e-06,-1.5e-05,-1.6e-05,9e-06,4e-06,1e-06,-3e-06,0,-4e-06,-1e-05,-1.3e-05,-3e-06,-2e-06,-1e-06,-2e-06,-4e-06,1e-05,0,5e-06,4e-06,1e-06,-1.5e-05,-2e-06,1.6e-05,-1e-05,-3e-06,3e-06,3e-06,-5e-06,0,-7e-06,3e-06,3e-06,6e-06,-4e-06,0
-7.5e-05,7.9e-05,2.2e-05,-0.00013,7e-05,5.3e-05,2.7e-05,4.8e-05,-4e-05,-3.5e-05,-7e-06,-5.3e-05,-7.3e-05,1.1e-05,9.8e-05,2.8e-05,1.2e-05,-5.6e-05,-1.7e-05,-1.1e-05,2.6e-05,-2.1e-05,-7.1e-05,-4e-05,2e-05,-1e-05,-4e-06,1.2e-05,-7e-06,1.2e-05,1.8e-05,-2.4e-05,2e-06,-9e-06,4e-06,1e-06,-8e-06,3e-06,-2.7e-05,1e-06,-4e-06,-6e-06,2.8e-05,-9e-06,-1.8e-05,8e-06,1e-06,-2.1e-05,1.4e-05,-1.2e-05,-1.2e-05,-6e-06,8e-06,-1e-06,1.1e-05,-1e-05,-2e-06,-6e-06,2e-06,-2.2e-05,6e-06,-9e-06,2e-06,-1.2e-05,8e-06,-5e-06,7e-06,-1.1e-05,-7e-06,1e-05,-1.4e-05,4e-06,-1e-06,1e-06,1.6e-05,-1.5e-05,1e-06,1e-06,-5e-06,-7e-06,1e-06,-7e-06,2e-06,0,3e-06,-5e-06,8e-06,2e-05,1e-06,-5e-06,1e-05,-8e-06,-5e-06,-8e-06,-1.2e-05,-2e-06,-7e-06,-1.1e-05,5e-06,-7e-06,-8e-06,4e-06,-9e-06,0,0,-6e-06,1e-06,5e-06,-6e-06,4e-06,-1e-06,-3e-06,3e-06,-3e-06,-1e-06,-8e-06,1e-06,-6e-06,0,2e-06,-4e-06
4e-06,-1.3e-05,-0.000101,2.8e-05,-3.5e-05,-5e-05,1.9e-05,-2.7e-05,1.6e-05,2.7e-05,-9.4e-05,7e-05,4.6e-05,-1.9e-05,3.6e-05,-7e-06,6e-06,6.1e-05,2.6e-05,-1.7e-05,3.7e-05,-3.6e-05,4.4e-05,-4.7e-05,1.1e-05,1.1e-05,2.5e-05,4.7e-05,7e-06,-1.2e-05,2.2e-05,1.8e-05,2e-06,1.1e-05,-1.1e-05,-1.1e-05,-1.4e-05,1.1e-05,-7e-06,1.3e-05,5e-06,-2.4e-05,5e-06,-1.2e-05,-1.5e-05,-2e-06,-1e-06,6e-06,-1.8e-05,-4e-06,1.4e-05,1e-05,1.3e-05,-2.3e-05,1e-06,0,-7e-06,2e-06,3e-06,-4e-06,-1e-06,1e-05,-6e-06,3e-06,3e-06,-7e-06,4e-06,1.1e-05,5e-06,3e-06,-1.6e-05,9e-06,2e-06,0,-7e-06,-5e-06,5e-06,-1e-06,-4e-06,6e-06,-1.2e-05,1.2e-05,2e-06,-2e-06,-2e-06,1e-06,1.2e-05,7e-06,2e-06,4e-06,-8e-06,1e-06,3e-06,-9e-06,-7e-06,7e-06,-3e-06,-1.2e-05,-2e-06,-9e-06,9e-06,-2e-06,2e-06,-1e-06,-3e-06,0,2e-06,9e-06,-6e-06,2e-06,1e-06,-4e-06,-3e-06,1e-06,0,-5e-06,3e-06,-9e-06,-7e-06,-1e-06,0
4.2e-05,-2.2e-05,3e-05,6.2e-05,-2.7e-05,4.1e-05,-3e-05,3.3e-05,2e-06,-2.2e-05,-6.8e-05,-2.8e-05,2.3e-05,4e-06,2.7e-05,3e-06,1.8e-05,-2.6e-05,1.2e-05,5e-06,-2.1e-05,1.1e-05,-1.8e-05,1.1e-05,1e-06,-8e-06,-1.3e-05,-2.3e-05,0,1.1e-05,-2e-05,9e-06,-9e-06,1.9e-05,2e-06,0,1.7e-05,-2.1e-05,3e-06,-7e-06,-3.3e-05,4e-06,1.5e-05,-5e-06,1.6e-05,-8e-06,1e-06,7e-06,3e-06,6e-06,7e-06,-9e-06,1.2e-05,6e-06,2e-06,1e-05,-4e-06,-5e-06,-5e-06,-1e-06,3e-06,-6e-06,-2e-06,-8e-06,-8e-06,1e-06,2e-06,-1e-05,-1e-06,7e-06,-1.1e-05,-3e-06,0,2e-06,5e-06,0,1.8e-05,0,-9e-06,-5e-06,-7e-06,-1.3e-05,3e-06,6e-06,2e-06,-7e-06,-3e-06,-1.4e-05,-1.2e-05,2e-06,-1.2e-05,-1.1e-05,-4e-06,-1e-06,-8e-06,3e-06,-3e-06,0,-2e-06,-6e-06,-3e-06,-1.3e-05,0,1e-05,-1e-05,1e-06,4e-06,1.1e-05,-1e-06,-3e-06,3e-06,-2e-06,-5e-06,0,2e-06,-1e-05,1e-06,8e-06,3e-06,-1e-06,-2e-06
1.6e-05,6.4e-05,-4.4e-05,-4.4e-05,4.3e-05,-2.9e-05,4e-06,-1.1e-05,7e-06,1.1e-05,2e-05,9e-06,-1.2e-05,-6e-06,-9.3e-05,-4e-06,3e-06,2.4e-05,-2.1e-05,-4e-06,-1.1e-05,9e-06,-3e-06,3.8e-05,-9e-06,2.3e-05,2e-06,-2.7e-05,-1e-06,0,1e-06,-1.3e-05,1e-05,8e-06,-1e-06,-2e-06,0,1e-06,1.7e-05,-1e-05,-1e-05,3e-06,-2e-06,6e-06,1.2e-05,0,2e-06,-3e-06,1.2e-05,1.3e-05,1e-06,5e-06,-4e-06,-1.2e-05,1e-06,-1.1e-05,-3e-06,0,-1e-06,-3e-06,0,-5e-06,0,0,0,-3e-06,-4e-06,-8e-06,-4e-06,-3e-06,-5e-06,3e-06,3e-06,1e-06,3e-06,-2e-06,4e-06,2e-06,-4e-06,2e-06,1e-06,1.2e-05,-1e-06,-6e-06,0,1e-06,-6e-06,-5e-06,-1e-05,-4e-06,-1.1e-05,-1e-06,3e-06,3e-06,-7e-06,-1e-05,5e-06,6e-06,1e-06,1e-06,-2e-06,1e-06,-2e-06,8e-06,3e-06,-5e-06,1e-06,2e-06,-2e-06,-1e-06,-1e-06,-8e-06,1e-06,0,-3e-06,-4e-06,1e-06,-4e-06,1e-06,-2e-06,0
-4.7e-05,-4e-05,4.9e-05,3.1e-05,-7e-06,2.8e-05,-2.2e-05,-1e-05,8e-06,-2.8e-05,8.3e-05,1e-05,-1e-06,-8e-06,-5e-06,-8e-06,9e-06,-2e-06,-1.1e-05,5e-06,-2e-06,7e-06,-2.6e-05,4e-06,-1.3e-05,-8e-06,1.2e-05,3.3e-05,-7e-06,-3e-06,-8e-06,4e-06,-3e-06,-2e-06,3e-06,4e-06,1e-06,-3e-06,-6e-06,-2e-06,2e-06,3e-06,-3e-06,9e-06,-1.1e-05,-1e-05,-1e-06,-1.2e-05,4e-06,1.4e-05,1e-06,1e-06,3e-06,8e-06,-7e-06,0,-6e-06,5e-06,1e-06,1e-05,-3e-06,0,0,4e-06,2e-06,2e-06,-1e-05,0,1e-06,-5e-06,4e-06,7e-06,0,0,-7e-06,-6e-06,-1.2e-05,-1e-06,-1e-06,-1e-06,-3e-06,-8e-06,-2e-06,-5e-06,0,-3e-06,-9e-06,2e-06,-1e-05,0,-1.1e-05,-1.2e-05,1e-06,3e-06,-5e-06,1e-06,-5e-06,0,1e-06,-1e-06,6e-06,6e-06,-5e-06,-7e-06,7e-06,-1e-06,-9e-06,3e-06,-1e-05,4e-06,2e-06,-5e-06,0,-3e-06,1e-06,-7e-06,0,-2e-06,2e-06,-3e-06,4e-06
-5e-06,-9e-06,9e-06,2.6e-05,-2.6e-05,-2.7e-05,-7e-06,1.3e-05,-7e-06,1.5e-05,-5.1e-05,-8e-06,1.3e-05,-3e-06,6.3e-05,1e-06,2e-06,-8e-06,1.3e-05,-1.8e-05,-1.7e-05,-6e-06,5e-06,3e-06,-7e-06,1.4e-05,1e-06,-6e-06,8e-06,1.6e-05,-1e-06,4e-06,-5e-06,-1.8e-05,-1e-06,-2e-06,-1e-06,-3e-06,1e-06,1e-06,9e-06,4e-06,-1e-05,2e-06,-1e-05,-5e-06,3e-06,1e-05,-3e-06,-1e-06,1e-06,-6e-06,3e-06,1e-06,-3e-06,2e-06,0,-2e-06,2e-06,1e-06,-1e-06,-1e-06,0,-5e-06,3e-06,7e-06,-4e-06,6e-06,1e-06,-3e-06,-5e-06,0,-3e-06,-2e-06,3e-06,-4e-06,-8e-06,-2e-06,0,3e-06,1e-06,3e-06,1e-06,6e-06,3e-06,-2e-06,9e-06,-9e-06,-8e-06,-2e-06,-3e-06,1e-06,-1e-06,3e-06,-7e-06,2e-06,2e-06,-2e-06,-1e-06,-4e-06,-2e-06,2e-06,1e-06,-7e-06,-1e-06,0,0,-1e-06,-1.1e-05,-1e-06,-1e-06,0,-3e-06,-3e-06,-1e-06,-3e-06,0,0,-4e-06,-1e-06,-5e-06
2.6e-05,3.6e-05,2e-05,-4.9e-05,1.2e-05,2.4e-05,1.1e-05,1.5e-05,6e-06,3e-06,5.3e-05,-2.5e-05,-2e-05,-4e-06,3.1e-05,4e-06,6e-06,1e-06,3e-06,-3e-06,1.8e-05,2e-06,2e-05,-4.1e-05,1e-06,0,-1.6e-05,-1.7e-05,-3e-06,-1.9e-05,2e-06,-3e-06,7e-06,-5e-06,0,-5e-06,1e-06,1e-06,-6e-06,-4e-06,-1.4e-05,-8e-06,-3e-06,-7e-06,4e-06,-1e-06,2e-06,-8e-06,-4e-06,-5e-06,-2e-06,6e-06,9e-06,1e-05,-1e-06,1e-06,-6e-06,-1e-06,3e-06,0,1e-06,-8e-06,0,3e-06,-6e-06,7e-06,5e-06,-1e-06,-2e-06,-2e-06,-6e-06,2e-06,2e-06,-1e-06,-3e-06,0,-4e-06,0,0,-4e-06,-2e-06,-1e-06,1e-06,-3e-06,-3e-06,-2e-06,5e-06,-7e-06,-3e-06,2e-06,-4e-06,-6e-06,1e-06,2e-06,-5e-06,4e-06,-2e-06,-4e-06,1e-06,-4e-06,-3e-06,-6e-06,-3e-06,0,2e-06,0,1e-06,0,-4e-06,-3e-06,-4e-06,-3e-06,-1e-06,-3e-06,-2e-06,-3e-06,-1e-06,3e-06,-1e-06,-2e-06,1e-06
1.2e-05,-1.3e-05,-3e-06,1e-05,3e-06,-2.5e-05,5e-06,-1.5e-05,-4e-06,0,6e-06,8e-06,-9e-06,-3e-06,-2.6e-05,4e-06,1e-06,-1e-06,0,1.1e-05,7e-06,2.5e-05,7e-06,-6e-06,6e-06,6e-06,-6e-06,1.5e-05,-2e-06,1.2e-05,8e-06,3e-06,-4e-06,-4e-06,-2e-06,2e-06,1e-06,1e-06,-3e-06,1.1e-05,-5e-06,-1.1e-05,-6e-06,-8e-06,1e-05,-1e-05,-1e-06,-7e-06,7e-06,-4e-06,1e-06,-4e-06,-1e-06,3e-06,0,-3e-06,1e-06,1e-06,-1e-06,-8e-06,-1e-06,2e-06,3e-06,-2e-06,-1e-06,2e-06,5e-06,-1e-06,0,2e-06,-1e-05,4e-06,-3e-06,1e-06,-2e-06,-7e-06,3e-06,0,0,0,-6e-06,-2e-06,1e-06,1e-06,1e-06,-2e-06,2e-06,6e-06,-1e-06,1e-06,-4e-06,2e-06,-2e-06,0,-5e-06,-5e-06,0,0,0,-2e-06,4e-06,-4e-06,1e-06,-3e-06,-6e-06,-2e-06,-7e-06,6e-06,6e-06,3e-06,1e-06,-1e-06,3e-06,0,1e-06,-1e-06,-1e-06,-6e-06,3e-06,-1e-06,0
-1.7e-05,-1.2e-05,-3.5e-05,6e-06,-7e-06,2.3e-05,1.9e-05,1e-05,2e-06,-1e-06,-5.4e-05,-2.1e-05,1.5e-05,-4e-06,-6e-05,1e-06,6e-06,-1.4e-05,5e-06,-1.3e-05,5e-06,-1.7e-05,-1.8e-05,2.7e-05,6e-06,-6e-06,1.2e-05,4e-06,4e-06,-1.3e-05,2e-06,2e-06,2e-06,9e-06,1e-06,-1e-06,0,-3e-06,7e-06,5e-06,1.4e-05,-6e-06,4e-06,1e-06,1e-06,2e-06,0,1.5e-05,2e-06,-8e-06,3e-06,0,-5e-06,-1.1e-05,1e-06,1e-06,-6e-06,-1e-06,-1e-06,-4e-06,1e-06,3e-06,1e-06,-3e-06,5e-06,-2e-06,2e-06,6e-06,1e-06,-2e-06,-1.1e-05,1e-06,2e-06,1e-06,0,-4e-06,-2e-06,-1e-06,1e-06,1e-06,-1e-06,1e-06,0,1e-06,-1e-06,1e-06,-9e-06,-3e-06,4e-06,-2e-06,-1e-06,-5e-06,1e-06,1e-06,-5e-06,-1e-06,-3e-06,-1e-06,0,-3e-06,-2e-06,4e-06,-3e-06,-4e-06,-6e-06,1e-06,0,2e-06,1e-06,-1e-06,2e-06,-3e-06,2e-06,2e-06,-1e-06,1e-06,-1e-06,-2e-06,1e-06,1e-06,0
-1.4e-05,1.3e-05,5e-06,-2.7e-05,-2e-06,-1.7e-05,-9e-06,-5e-06,-4e-06,-3e-06,-9e-06,-6e-06,-2.4e-05,-2e-06,-7e-06,0,1e-06,2.1e-05,-3e-06,-4e-06,-1e-05,-1.3e-05,6e-06,1.2e-05,4e-06,8e-06,4e-06,-1.5e-05,-2e-06,1.1e-05,-1.3e-05,4e-06,-1e-06,7e-06,1e-06,1e-06,2e-06,-3e-06,0,-3e-06,6e-06,-2e-06,1e-06,6e-06,-1.1e-05,-7e-06,0,-9e-06,3e-06,-6e-06,-1e-06,2e-06,-5e-06,4e-06,1e-06,6e-06,0,2e-06,-2e-06,-4e-06,0,-6e-06,-2e-06,3e-06,-2e-06,-2e-06,-3e-06,-1e-06,-1e-06,2e-06,-4e-06,0,1e-06,0,-1e-06,3e-06,2e-06,0,0,-1e-06,0,-1e-06,-2e-06,0,0,-3e-06,-2e-06,-3e-06,4e-06,1e-06,-1e-06,0,0,-1e-06,-4e-06,3e-06,2e-06,-1e-06,0,-4e-06,-4e-06,4e-06,0,3e-06,5e-06,0,1e-06,4e-06,2e-06,-2e-06,1e-06,-4e-06,-3e-06,0,0,1e-06,-2e-06,4e-06,-1e-06,-1e-06,0
1.8e-05,-3e-06,-1.6e-05,2.2e-05,-3e-06,1.5e-05,3e-06,-8e-06,1e-06,3e-06,1.4e-05,1.7e-05,4e-06,-3e-06,6.1e-05,-4e-06,2e-06,-1.1e-05,-1.3e-05,4e-06,-7e-06,1.6e-05,9e-06,1e-06,0,-6e-06,-2e-06,1e-06,0,-9e-06,7e-06,-1e-06,-2e-06,2e-06,1e-06,-2e-06,-1e-06,-1e-06,-1e-06,-2e-06,-7e-06,2e-06,8e-06,3e-06,-2e-06,-2e-06,0,1e-06,-7e-06,-2e-06,-4e-06,-4e-06,0,-8e-06,0,-7e-06,-5e-06,-2e-06,1e-06,4e-06,1e-06,-1e-06,0,-3e-06,-3e-06,-3e-06,-6e-06,1e-06,-1e-06,1e-06,-3e-06,2e-06,0,0,1e-06,-3e-06,8e-06,1e-06,-1e-06,1e-06,-1e-06,-1e-06,0,-1e-06,1e-06,0,4e-06,6e-06,5e-06,-1e-06,-5e-06,-2e-06,1e-06,-1e-06,-5e-06,1e-06,-2e-06,-1e-06,0,-1e-06,5e-06,-2e-06,-2e-06,6e-06,-2e-06,-1e-06,0,1e-06,6e-06,1e-06,1e-06,-1e-06,1e-06,-1e-06,0,3e-06,0,0,-2e-06,-1e-06,0
7e-06,-1.4e-05,1.2e-05,5e-06,7e-06,-1.3e-05,-8e-06,2e-06,3e-06,-4e-06,7e-05,-2.4e-05,7e-06,-4e-06,1e-05,-4e-06,1e-06,1.2e-05,-3e-06,-7e-06,-1e-06,-3e-06,-7e-06,-1.9e-05,-2e-06,-3e-06,-5e-06,1.3e-05,-1e-06,1e-05,-5e-06,-1e-06,4e-06,-7e-06,0,-2e-06,-2e-06,0,-5e-06,-3e-06,4e-06,7e-06,1e-06,-1e-06,7e-06,0,-1e-06,4e-06,4e-06,2e-06,-2e-06,3e-06,0,3e-06,0,2e-06,0,-1e-06,1e-06,7e-06,0,0,2e-06,1e-06,3e-06,-2e-06,-4e-06,-4e-06,1e-06,2e-06,-3e-06,2e-06,0,-1e-06,-1e-06,-4e-06,3e-06,0,-2e-06,0,0,2e-06,0,-2e-06,-2e-06,-2e-06,3e-06,0,3e-06,1e-06,-8e-06,2e-06,0,-2e-06,-4e-06,-2e-06,0,2e-06,0,0,-1e-06,-5e-06,0,0,4e-06,-1e-06,2e-06,0,7e-06,1e-06,-1e-06,-3e-06,2e-06,-3e-06,0,2e-06,0,-3e-06,1e-06,0,-1e-06
-6e-06,1.2e-05,2.2e-05,-2.1e-05,-1e-06,1.2e-05,-6e-06,5e-06,-1e-06,5e-06,-4.9e-05,2.7e-05,-1.5e-05,-1e-06,-2.1e-05,4e-06,1e-06,-9e-06,9e-06,1e-06,4e-06,-1.7e-05,-4e-06,-1.5e-05,-4e-06,-4e-06,4e-06,-7e-06,2e-06,-6e-06,-4e-06,6e-06,-4e-06,-7e-06,-1e-06,1e-06,3e-06,-1e-06,4e-06,-4e-06,1.2e-05,0,2e-06,-4e-06,6e-06,-5e-06,0,-4e-06,1e-06,7e-06,0,-2e-06,-3e-06,-1e-06,0,3e-06,-3e-06,1e-06,0,1e-06,0,-1e-06,-2e-06,0,-1e-06,-2e-06,3e-06,2e-06,0,0,-2e-06,0,-1e-06,0,2e-06,1e-06,-2e-06,-1e-06,-1e-06,1e-06,-3e-06,-2e-06,0,1e-06,2e-06,0,-1e-06,-7e-06,3e-06,1e-06,-5e-06,-2e-06,0,-2e-06,-4e-06,-1e-06,-1e-06,0,0,-2e-06,-3e-06,0,-1e-06,-1e-06,-1e-06,1e-06,-3e-06,1e-06,2e-06,-2e-06,-1e-06,-1e-06,-1e-06,-1e-06,0,4e-06,0,-2e-06,1e-06,-1e-06,1e-06
-1e-05,2e-06,-4e-06,2.3e-05,-8e-06,-1.2e-05,-2e-06,-8e-06,-3e-06,-5e-06,-3.1e-05,-1.5e-05,9e-06,-4e-06,-4.2e-05,0,0,-4e-06,4e-06,0,7e-06,1e-05,-2e-06,9e-06,-2e-06,-3e-06,-3e-06,-6e-06,-1e-06,4e-06,1.3e-05,-1e-06,2e-06,-5e-06,-1e-06,-1e-06,-2e-06,0,0,-1e-06,3e-06,1e-06,-4e-06,-2e-06,-8e-06,2e-06,0,-2e-06,3e-06,5e-06,0,0,-4e-06,4e-06,-1e-06,-2e-06,-2e-06,-1e-06,0,2e-06,-1e-06,-2e-06,-1e-06,-3e-06,0,-2e-06,4e-06,-1e-06,-1e-06,-2e-06,-3e-06,1e-06,-1e-06,0,1e-06,-2e-06,-6e-06,1e-06,-1e-06,-2e-06,-2e-06,2e-06,0,0,-1e-06,-1e-06,-4e-06,-2e-06,-1e-06,-1e-06,-4e-06,2e-06,0,0,-4e-06,1e-06,0,-1e-06,0,-3e-06,5e-06,4e-06,-1e-06,1e-06,-3e-06,0,-1e-06,2e-06,0,0,0,-1e-06,-2e-06,0,0,2e-06,0,2e-06,-1e-06,-1e-06,0
7e-06,-6e-06,9e-06,2e-06,8e-06,1.1e-05,3e-06,3e-06,-1e-06,5e-06,1.4e-05,2.3e-05,4e-06,-3e-06,2.1e-05,0,0,0,-1e-06,-6e-06,1e-06,7e-06,1.4e-05,2.1e-05,-1e-06,-3e-06,-3e-06,1.1e-05,0,-4e-06,-6e-06,-2e-06,-1e-06,3e-06,1e-06,0,-1e-06,0,2e-06,6e-06,-3e-06,-5e-06,-3e-06,2e-06,-4e-06,-2e-06,0,2e-06,-4e-06,3e-06,2e-06,2e-06,-1e-06,4e-06,0,-1e-06,-2e-06,1e-06,-1e-06,-5e-06,-1e-06,3e-06,1e-06,2e-06,0,1e-06,2e-06,-2e-06,0,-1e-06,-6e-06,2e-06,1e-06,0,-1e-06,-3e-06,-3e-06,0,-1e-06,1e-06,0,0,-1e-06,-1e-06,-1e-06,-1e-06,1e-06,0,-2e-06,0,-3e-06,-2e-06,-1e-06,0,-3e-06,1e-06,-1e-06,-2e-06,0,-1e-06,-2e-06,1e-06,0,-2e-06,1e-06,-1e-06,2e-06,2e-06,-5e-06,1e-06,-1e-06,-4e-06,1e-06,0,0,2e-06,1e-06,-3e-06,-1e-06,-1e-06,-1e-06
6e-06,0,-2.7e-05,-1.9e-05,4e-06,-1.1e-05,5e-06,1e-06,4e-06,-7e-06,-7e-06,-1.2e-05,-3e-06,-2e-06,4.3e-05,0,0,2e-06,-1e-06,3e-06,-1e-06,-9e-06,-5e-06,1e-06,1e-06,-2e-06,0,-4e-06,0,1e-06,-3e-06,6e-06,-1e-06,6e-06,0,-1e-06,3e-06,-1e-06,-1e-06,1e-06,0,-3e-06,-3e-06,3e-06,6e-06,0,0,0,0,0,2e-06,-2e-06,1e-06,-6e-06,0,1e-06,-2e-06,-1e-06,0,-4e-06,0,-1e-06,1e-06,-1e-06,-2e-06,3e-06,-2e-06,1e-06,0,-1e-06,-7e-06,-1e-06,0,0,2e-06,0,0,0,0,-1e-06,-1e-06,-1e-06,0,1e-06,2e-06,0,2e-06,-4e-06,-4e-06,0,-2e-06,2e-06,1e-06,1e-06,-4e-06,-1e-06,0,0,0,-1e-06,-2e-06,-4e-06,0,-4e-06,-1e-06,0,-3e-06,3e-06,-2e-06,-1e-06,1e-06,-1e-06,1e-06,0,-1e-06,2e-06,0,0,0,0,0
-4e-06,9e-06,1e-05,1.8e-05,-8e-06,9e-06,-1e-06,-4e-06,2e-06,6e-06,2.9e-05,2.2e-05,3e-06,-3e-06,-4e-06,-3e-06,-1e-06,2e-06,-5e-06,-2e-06,-9e-06,4e-06,1e-06,-1.1e-05,2e-06,0,6e-06,-8e-06,0,2e-06,4e-06,0,3e-06,5e-06,1e-06,-1e-06,-2e-06,-2e-06,-2e-06,1e-06,9e-06,0,0,0,5e-06,3e-06,0,-4e-06,1e-06,-4e-06,0,1e-06,1e-06,3e-06,-1e-06,3e-06,-1e-06,0,0,-2e-06,0,-2e-06,-1e-06,-1e-06,3e-06,3e-06,-4e-06,-1e-06,0,0,-4e-06,0,1e-06,0,-1e-06,-1e-06,-1e-06,0,0,0,0,3e-06,0,0,-1e-06,-1e-06,2e-06,0,-4e-06,0,-3e-06,-1e-06,-1e-06,1e-06,-3e-06,-1e-06,0,0,0,-2e-06,4e-06,-2e-06,-1e-06,0,2e-06,0,-1e-06,0,-3e-06,0,1e-06,-2e-06,-1e-06,0,1e-06,1e-06,0,-1e-06,1e-06,0,0
-3e-06,-1e-05,-1.6e-05,-4e-06,2e-06,-8e-06,2e-06,2e-06,-1e-06,-5e-06,-7e-06,-1.9e-05,6e-06,-2e-06,-3.1e-05,1e-06,0,4e-06,-4e-06,-4e-06,0,4e-06,-1e-05,-1.1e-05,2e-06,-2e-06,-1e-06,9e-06,0,-3e-06,-6e-06,0,-3e-06,0,0,1e-06,0,0,-1e-06,0,-1e-06,2e-06,2e-06,-2e-06,-4e-06,-2e-06,0,3e-06,0,-5e-06,-2e-06,0,0,-4e-06,1e-06,-5e-06,-3e-06,1e-06,1e-06,1e-06,0,0,0,2e-06,0,1e-06,-3e-06,2e-06,0,1e-06,-5e-06,1e-06,0,0,0,-2e-06,3e-06,0,0,0,0,-3e-06,0,-2e-06,0,0,-2e-06,4e-06,-3e-06,1e-06,-3e-06,2e-06,1e-06,1e-06,-3e-06,1e-06,-1e-06,1e-06,0,-1e-06,-3e-06,2e-06,0,2e-06,1e-06,-1e-06,1e-06,1e-06,-5e-06,1e-06,0,-2e-06,-2e-06,0,-1e-06,1e-06,0,2e-06,0,0,0
1e-06,2e-06,1.5e-05,-1.6e-05,5e-06,8e-06,-4e-06,3e-06,-2e-06,5e-06,2.3e-05,2.1e-05,-6e-06,-3e-06,-2.8e-05,1e-06,-1e-06,-7e-06,4e-06,1e-06,5e-06,-3e-06,1.7e-05,-6e-06,1e-06,2e-06,-5e-06,0,-1e-06,4e-06,1e-06,4e-06,1e-06,-6e-06,0,-1e-06,1e-06,1e-06,0,-2e-06,-6e-06,5e-06,3e-06,-1e-06,-5e-06,4e-06,0,2e-06,0,-4e-06,-1e-06,-1e-06,-1e-06,1e-06,1e-06,2e-06,-1e-06,0,0,3e-06,0,0,1e-06,-2e-06,-3e-06,1e-06,2e-06,-2e-06,0,1e-06,-1e-06,0,0,0,0,-1e-06,4e-06,0,0,0,-2e-06,3e-06,0,1e-06,0,-1e-06,-3e-06,-1e-06,-2e-06,-1e-06,-3e-06,-1e-06,0,1e-06,-3e-06,0,1e-06,-1e-06,0,0,-1e-06,3e-06,-1e-06,0,-2e-06,0,-1e-06,0,-4e-06,0,-1e-06,0,2e-06,-1e-06,0,-1e-06,0,-4e-06,-1e-06,0,1e-06
3e-06,6e-06,1.1e-05,1.7e-05,-3e-06,-8e-06,-1e-06,-4e-06,0,-5e-06,-2.2e-05,-2.4e-05,2e-06,-2e-06,2.5e-05,1e-06,-1e-06,2e-06,7e-06,-4e-06,1e-06,1e-06,-1.3e-05,2e-05,0,-2e-06,-1e-06,-7e-06,1e-06,-5e-06,6e-06,1e-06,0,-5e-06,0,0,-1e-06,-2e-06,4e-06,-5e-06,-3e-06,4e-06,2e-06,1e-06,2e-06,0,0,-5e-06,-2e-06,-3e-06,-1e-06,1e-06,2e-06,0,0,3e-06,-2e-06,0,-1e-06,3e-06,1e-06,-2e-06,0,1e-06,2e-06,0,4e-06,1e-06,0,1e-06,-1e-06,-1e-06,-1e-06,0,0,-1e-06,3e-06,0,0,0,-1e-06,-3e-06,0,0,0,-1e-06,2e-06,-2e-06,0,0,-4e-06,1e-06,0,0,-3e-06,0,-1e-06,1e-06,0,-1e-06,2e-06,-2e-06,0,0,0,0,1e-06,0,2e-06,-1e-06,-1e-06,-3e-06,0,-1e-06,0,-1e-06,0,1e-06,0,0,-1e-06
-3e-06,-6e-06,-5e-06,-5e-06,-1e-06,7e-06,-1e-06,3e-06,1e-06,5e-06,-3.8e-05,2.1e-05,1e-06,-2e-06,3.8e-05,1e-06,-1e-06,-3e-06,0,0,4e-06,0,5e-06,9e-06,-1e-06,3e-06,2e-06,5e-06,-1e-06,6e-06,-2e-06,0,-1e-06,-3e-06,0,-1e-06,0,0,0,2e-06,5e-06,2e-06,1e-06,1e-06,7e-06,1e-06,0,3e-06,2e-06,1e-06,0,0,2e-06,-1e-06,0,-4e-06,-1e-06,0,0,1e-06,0,1e-06,-1e-06,0,0,0,1e-06,1e-06,0,0,-4e-06,1e-06,0,0,0,-1e-06,0,0,0,0,-1e-06,2e-06,0,-1e-06,0,-1e-06,2e-06,1e-06,1e-06,0,-4e-06,0,1e-06,0,-3e-06,0,1e-06,0,0,-2e-06,-2e-06,-3e-06,-1e-06,2e-06,-2e-06,0,-2e-06,1e-06,2e-06,1e-06,0,-2e-06,-1e-06,0,0,-2e-06,0,-1e-06,1e-06,-1e-06,0
-1e-06,-2e-06,3e-06,-9e-06,1e-06,-7e-06,0,1e-06,0,-6e-06,2.9e-05,-2.6e-05,-6e-06,-3e-06,-1.5e-05,-1e-06,0,1e-06,-3e-06,1e-06,-1e-06,-2e-06,-1e-05,-1.1e-05,-1e-06,-1e-06,1e-06,2e-06,-1e-06,-6e-06,-2e-06,2e-06,2e-06,4e-06,0,-1e-06,1e-06,0,-1e-06,1e-06,-3e-06,-3e-06,-2e-06,0,0,4e-06,0,0,-2e-06,4e-06,0,0,1e-06,4e-06,0,1e-06,-2e-06,-1e-06,0,-4e-06,-1e-06,0,0,-2e-06,-2e-06,-2e-06,-2e-06,-1e-06,0,0,-5e-06,0,0,0,0,-1e-06,-3e-06,0,0,0,-1e-06,-1e-06,0,1e-06,-1e-06,-1e-06,1e-06,-1e-06,3e-06,0,-3e-06,0,-1e-06,-1e-06,-3e-06,0,-1e-06,0,0,-2e-06,-1e-06,0,0,0,1e-06,0,-2e-06,1e-06,4e-06,0,1e-06,-1e-06,0,0,0,-2e-06,0,2e-06,0,-1e-06,0
