1e-05,2.3e-05,3e-06,4e-06,3e-06,4e-06,8e-06,1e-06,1.1e-05,5e-06,2.4e-05,2.1e-05,4.6e-05,2.4e-05,0.000115,4.1e-05,0.000101,3.3e-05,6.5e-05,8e-05,4.5e-05,0.000112,5.9e-05,5e-06,7.5e-05,0.000131,8.1e-05,0.000172,0.000129,0.000143,1.1e-05,0.000164,4e-05,0,0.000127,0.000184,1.6e-05,5e-05,9.5e-05,0.000201,1.2e-05,0.000194,2.3e-05,0.000196,0.000298,4.7e-05,0.000225,9.8e-05,0.000152,4.8e-05,3.6e-05,9.1e-05,3.7e-05,0.000192,1.3e-05,0.000126,1.4e-05,3.1e-05,0.000167,6e-05,3.4e-05,0.00015,6e-06,6.1e-05,0.00011,0.000122,0.000134,9.8e-05,4.1e-05,1.3e-05,0.000246,7.5e-05,0.00012,0.00016,0.00016,1e-04,0.000119,7.1e-05,1.4e-05,6.4e-05,0.000216,4.9e-05,0.00016,8.4e-05,5.8e-05,1.9e-05,5e-05,0.000132,0.000108,0.000126,0.000272,0.000257,3.8e-05,0.000103,8.9e-05,0.000131,4.8e-05,8e-05,2.2e-05,2.1e-05,1.9e-05,0.000139,0.000103,8.2e-05,0.000135,0.000116,9.2e-05,0.000155,0.000165,0.000101,0.000173,9.5e-05,5.2e-05,2.9e-05,1e-05,2.3e-05,8e-05,6.9e-05,2.2e-05,6e-06,1.5e-05
2e-05,3.4e-05,1.8e-05,4e-06,3e-05,5e-06,1.4e-05,2.5e-05,2e-05,2.1e-05,1.9e-05,6.1e-05,8e-05,0.00013,0.000176,0.000266,0.000158,0.000123,9.7e-05,9.3e-05,3e-05,0.000209,0.000138,5e-05,0.000204,0.000395,0.000452,0.000408,0.00055,0.000271,0.000167,0.000159,0.000338,0.000408,0.000433,0.000613,0.000406,0.000173,0.000112,0.00048,0.000488,0.000369,0.000401,0.000452,0.000889,0.000941,0.000672,0.000631,0.000313,0.000318,0.000204,0.00024,0.00028,0.000469,0.000483,0.000309,0.000213,0.000215,0.000318,0.000365,0.00029,0.000387,0.000336,0.000198,0.000125,0.000193,0.000396,0.000289,0.000249,0.000267,0.000532,0.000604,0.00014,0.000106,0.000469,0.000504,0.00053,0.000463,0.000359,0.00039,0.00059,0.000574,0.000303,0.000437,0.000497,0.000371,0.000272,0.000382,0.000498,0.000407,0.00068,0.001117,0.001019,0.00063,0.000211,0.000246,0.000264,0.000215,0.000144,9.8e-05,4.2e-05,0.000255,0.000465,0.000425,0.000442,0.000554,0.000465,0.000501,0.000155,0.000311,0.000265,0.000441,0.000323,0.000259,0.000158,7.7e-05,0.000168,0.000276,0.000283,0.000271,0.000105
1.9e-05,4.3e-05,1.9e-05,8e-06,4e-05,1.4e-05,7e-06,3.3e-05,1.9e-05,1.6e-05,8e-06,3.5e-05,4.4e-05,5.8e-05,4.6e-05,8.9e-05,7.2e-05,6.5e-05,6.7e-05,4.2e-05,5.7e-05,0.000101,1e-04,0.000145,0.000191,7.8e-05,8.6e-05,0.000219,0.000112,4.1e-05,7.2e-05,5.5e-05,0.000194,0.000284,8.2e-05,0.000179,0.000151,9.4e-05,0.00014,0.000162,0.000129,3.6e-05,0.000123,0.000283,0.000206,0.000367,9.4e-05,0.000234,2.6e-05,0.000104,7.3e-05,0.000164,0.000167,0.000131,0.000146,4.4e-05,2.5e-05,0.000159,0.00026,0.00028,0.000116,0.000121,9.2e-05,5.7e-05,0.00019,5.7e-05,0.000101,8.9e-05,0.000135,0.000248,0.000198,9.4e-05,0.000231,8.4e-05,0.000302,0.00027,0.000172,0.000148,0.000199,0.000257,0.000123,0.000169,7.6e-05,0.000247,0.000191,0.000175,4.6e-05,0.000128,0.000154,0.000162,0.000177,0.00056,0.000482,0.000153,0.000144,0.000143,5.2e-05,4.8e-05,5.9e-05,2.2e-05,0.000134,0.000204,0.000174,0.000164,5.8e-05,0.000216,0.000201,6.6e-05,7.2e-05,0.000205,8.7e-05,0.000253,6.5e-05,8.9e-05,4.5e-05,5.6e-05,6.5e-05,7.7e-05,0.000182,0.000183,0.000127
2.7e-05,2.9e-05,5.8e-05,4.7e-05,1.8e-05,3e-05,2.5e-05,5.4e-05,5.4e-05,4.9e-05,7.1e-05,2.7e-05,5.3e-05,7.8e-05,3.9e-05,2.4e-05,6.1e-05,6.3e-05,3.5e-05,4.4e-05,2.6e-05,5.6e-05,9.9e-05,7.3e-05,1e-04,9.1e-05,0.000124,0.000113,0.000103,6.4e-05,0.000114,9.4e-05,5.6e-05,0.000153,0.00011,4.5e-05,6.5e-05,4.7e-05,0.00011,0.000145,9.7e-05,7.2e-05,2.6e-05,0.000179,0.00019,0.000138,3.3e-05,0.000107,7.6e-05,8.4e-05,6.6e-05,0.000147,9.6e-05,6.9e-05,0.000185,6.2e-05,8.7e-05,0.00011,2.6e-05,8.1e-05,7.7e-05,1.6e-05,6e-05,5.3e-05,0.000132,9.7e-05,8.4e-05,5.5e-05,0.000132,0.000156,4.4e-05,8.5e-05,0.000146,4.5e-05,0.000176,9.8e-05,0.00013,0.00012,0.000132,8.8e-05,0.000118,0.000132,9.7e-05,4.9e-05,0.000171,2.3e-05,5e-05,7.5e-05,0.000171,2.5e-05,3.2e-05,0.000361,0.000157,2.7e-05,1e-04,0.000144,0.000106,2.7e-05,2.9e-05,5.7e-05,0.000128,3.8e-05,8.5e-05,0.000142,2e-05,0.000122,0.000147,0.000107,8.3e-05,0.000123,5.9e-05,0.000146,0.000152,6.2e-05,8e-05,9e-05,7.3e-05,0.000157,3.3e-05,5e-05,1.6e-05
2.3e-05,2.2e-05,3.1e-05,6e-06,2.1e-05,1.8e-05,8e-06,3.2e-05,1.8e-05,1.4e-05,5.5e-05,2.4e-05,2.5e-05,2.4e-05,5.4e-05,3.9e-05,1.7e-05,6.2e-05,4.4e-05,3.2e-05,2.6e-05,6.7e-05,9.7e-05,6.5e-05,4e-05,9e-06,9e-05,8.4e-05,5.2e-05,1.6e-05,4.6e-05,8.4e-05,8.2e-05,6.6e-05,6.9e-05,4.7e-05,3e-06,2.7e-05,8.2e-05,6.5e-05,7.7e-05,4.5e-05,0.000125,0.00014,0.000143,0.000152,5.8e-05,9.3e-05,9e-05,9.9e-05,1.4e-05,3.2e-05,6.5e-05,2.5e-05,8.4e-05,2.9e-05,7e-05,5.2e-05,5.1e-05,3.1e-05,9.2e-05,6.8e-05,1.4e-05,1.4e-05,5.6e-05,1e-05,8.2e-05,6e-06,6.8e-05,0.000152,2e-05,3.9e-05,5.4e-05,5.4e-05,7.4e-05,7.4e-05,6.9e-05,0.000105,0.000134,5.1e-05,3.2e-05,0.000126,6.3e-05,9.2e-05,9.2e-05,2.9e-05,1.7e-05,2.8e-05,6.1e-05,2.4e-05,7.8e-05,0.000261,0.000195,8.5e-05,0.000137,4.2e-05,6.7e-05,1.2e-05,4.8e-05,7.1e-05,4.1e-05,4.2e-05,7.4e-05,8.4e-05,5.2e-05,9.6e-05,0.000151,6.4e-05,3.9e-05,0.000102,1e-05,2.8e-05,9.2e-05,9.5e-05,4.8e-05,1.7e-05,2.1e-05,0.000117,6.3e-05,6e-05,2e-05
2e-05,1e-05,2.3e-05,2.3e-05,2.8e-05,1.6e-05,2.3e-05,2.5e-05,4e-06,1.6e-05,3.7e-05,2.7e-05,1.8e-05,3.1e-05,4.7e-05,2.1e-05,1.5e-05,3.6e-05,3.2e-05,4.3e-05,3.8e-05,3e-05,8.5e-05,0.000108,3.6e-05,3.8e-05,2.9e-05,7.8e-05,3.3e-05,9.4e-05,6.8e-05,7.6e-05,8.3e-05,0.000111,9.5e-05,6.5e-05,8.7e-05,5.1e-05,5.8e-05,9.6e-05,7.8e-05,0.00013,9.3e-05,9.6e-05,0.000121,8.8e-05,8.7e-05,0.000196,3.5e-05,0.000104,7e-05,9.5e-05,0.000152,7.8e-05,0.000139,3.2e-05,5.9e-05,4e-05,2e-05,3.1e-05,1e-04,9.5e-05,4.9e-05,2.5e-05,8e-06,3e-05,4.6e-05,3.9e-05,8.8e-05,3.5e-05,5.8e-05,3.1e-05,0.000125,8.9e-05,3.6e-05,0.000169,0.000103,0.000111,4.7e-05,4e-05,7.2e-05,0.000105,8.5e-05,0.000117,4e-05,6.4e-05,3.8e-05,6.6e-05,5.5e-05,6.3e-05,7.8e-05,0.000212,0.000141,6e-05,8.6e-05,0.000108,0.000129,0.000125,3.8e-05,5e-05,3.9e-05,2.4e-05,9.8e-05,4.3e-05,3.1e-05,0.000106,8.6e-05,6.4e-05,3.9e-05,6.3e-05,2.6e-05,8.1e-05,9.4e-05,0.000101,0.000111,6.4e-05,2.6e-05,9.6e-05,6.3e-05,0.000144,0.000122
2.4e-05,1.2e-05,5.4e-05,4.4e-05,2.5e-05,1.1e-05,1.1e-05,1.2e-05,1.7e-05,9e-06,1.4e-05,7.4e-05,4.6e-05,1.3e-05,4.3e-05,1.4e-05,2.6e-05,2.4e-05,6e-05,2.9e-05,9.3e-05,0.000147,0.000149,0.000203,0.000126,6e-05,4.3e-05,7.7e-05,7.3e-05,0.000118,5.5e-05,9.7e-05,0.000171,6e-05,0.000104,4.5e-05,5.9e-05,9.1e-05,9.4e-05,5.4e-05,5.2e-05,0.000119,0.000113,9.3e-05,0.000132,0.000124,9.4e-05,0.000136,0.000225,0.000206,0.000237,0.00011,0.000195,0.000174,9.8e-05,0.000131,8e-05,6.4e-05,7.9e-05,6e-06,1e-04,0.000132,0.000208,0.000161,7.3e-05,2e-05,3.3e-05,6e-05,8.3e-05,0.000101,1.6e-05,6.9e-05,0.000163,8.7e-05,7.8e-05,5.8e-05,8.7e-05,8.6e-05,6.4e-05,6.8e-05,1e-04,0.000201,0.000195,0.000312,0.000257,0.000189,5.4e-05,8.8e-05,5.2e-05,3.8e-05,9e-05,7.6e-05,0.000235,0.000116,7.5e-05,2.1e-05,0.000143,0.000155,0.000178,0.000203,7.4e-05,6e-05,9e-05,8e-05,0.000122,3.2e-05,0.000124,8.6e-05,6.5e-05,7.6e-05,1.5e-05,0.000123,0.000167,0.000182,0.000116,5.6e-05,5.5e-05,2.6e-05,0.000145,0.000132,0.000153
2e-06,1.6e-05,3.5e-05,1.7e-05,2.9e-05,4e-06,1.7e-05,2.6e-05,3.9e-05,1.6e-05,2.7e-05,8.4e-05,4.3e-05,4.7e-05,4e-05,3.8e-05,2.1e-05,6.2e-05,5.1e-05,4.8e-05,6.2e-05,0.000104,0.00011,3.1e-05,2.2e-05,2.7e-05,6.3e-05,3.8e-05,3.1e-05,5.2e-05,8.4e-05,0.000111,0.000207,6.3e-05,5e-05,3.7e-05,5.5e-05,8.1e-05,5.2e-05,4.9e-05,9.6e-05,0.000112,5.9e-05,8e-05,2.1e-05,3.8e-05,1.7e-05,9.7e-05,0.000181,5.9e-05,0.00012,0.000122,0.000113,9e-05,7.4e-05,0.00013,8.3e-05,4.1e-05,6.9e-05,6.5e-05,6.2e-05,9e-06,0.000131,8.1e-05,2.3e-05,4.3e-05,2.6e-05,9.2e-05,7.6e-05,0.000133,5.2e-05,4.9e-05,5.4e-05,9.8e-05,0.000152,8.1e-05,0.000102,0.000171,9.9e-05,9.2e-05,0.000136,0.000186,0.000129,0.000125,4.9e-05,8.5e-05,5.9e-05,6.4e-05,1.4e-05,0.000115,9.6e-05,8.6e-05,0.000135,7e-05,3.7e-05,7.3e-05,9.7e-05,8.9e-05,0.000115,6.8e-05,7.1e-05,7.1e-05,3.3e-05,8.3e-05,5e-05,3.3e-05,8.5e-05,8.6e-05,2.5e-05,8.4e-05,4.6e-05,8.7e-05,0.000133,0.000112,7.8e-05,5.1e-05,7.3e-05,0.000102,0.000185,0.000218,6.2e-05
1.7e-05,1.1e-05,1.3e-05,2.4e-05,2.2e-05,1.3e-05,2.6e-05,3.8e-05,4e-05,4.1e-05,3e-05,5.3e-05,3.8e-05,4.6e-05,4.8e-05,2.5e-05,3.9e-05,8.7e-05,7.4e-05,1.5e-05,6.1e-05,6.8e-05,2.6e-05,3e-05,3.3e-05,2e-05,6.3e-05,6e-05,3.6e-05,6.2e-05,3.5e-05,5.4e-05,5.3e-05,7.1e-05,1.2e-05,1.3e-05,6.4e-05,8e-06,9.9e-05,7.1e-05,9.1e-05,5.7e-05,3.4e-05,6e-05,5.1e-05,7.4e-05,6.5e-05,9.3e-05,5.7e-05,6.7e-05,2.9e-05,1.9e-05,1.6e-05,7.5e-05,2.2e-05,7.1e-05,4.1e-05,4e-05,5.4e-05,6e-05,8.4e-05,6.1e-05,6.5e-05,5.1e-05,3.9e-05,1.3e-05,1.5e-05,6.5e-05,7.4e-05,8.2e-05,2.4e-05,5.2e-05,5.7e-05,3.2e-05,5.4e-05,1.8e-05,5.2e-05,4.4e-05,6.5e-05,0.000101,2.1e-05,6.6e-05,4.4e-05,7.7e-05,8.5e-05,8.6e-05,6e-05,3.6e-05,0.00011,1e-04,8.1e-05,0.000116,7.8e-05,5.1e-05,5.1e-05,4.5e-05,4.1e-05,8.2e-05,1.6e-05,4.9e-05,6.1e-05,3.1e-05,4.2e-05,6.5e-05,1e-05,5.4e-05,4.4e-05,5e-05,5.9e-05,3.6e-05,2.7e-05,8.7e-05,1.6e-05,8.3e-05,2.2e-05,4e-05,2.9e-05,4.6e-05,0.000104,3.4e-05,3e-05
1.8e-05,4.8e-05,4.3e-05,2.4e-05,7.5e-05,1.6e-05,4.5e-05,6e-06,1.5e-05,2e-05,2e-05,1.2e-05,1.7e-05,2e-05,4.8e-05,2e-05,2.3e-05,4.1e-05,3.1e-05,2.2e-05,5.2e-05,2.2e-05,3.6e-05,4.1e-05,4.7e-05,3e-05,5.9e-05,3.8e-05,4.4e-05,1.6e-05,3.7e-05,1.3e-05,4.7e-05,3.9e-05,9e-06,1.8e-05,5.1e-05,4.5e-05,6.6e-05,3.5e-05,8.6e-05,3.6e-05,5.7e-05,3.4e-05,4.5e-05,7.2e-05,1.6e-05,8.2e-05,5.2e-05,5.2e-05,7.4e-05,4.5e-05,8.5e-05,1.9e-05,2e-05,2.8e-05,4e-05,1.6e-05,1.3e-05,5.1e-05,4e-05,1e-05,4.4e-05,4.5e-05,2.1e-05,2.1e-05,3.8e-05,4.4e-05,3.5e-05,0.000105,4e-05,2.7e-05,1.6e-05,2.8e-05,8.5e-05,7.9e-05,6.2e-05,5.5e-05,6.3e-05,2.8e-05,3e-05,5.4e-05,5.2e-05,4.1e-05,8.6e-05,3.7e-05,4e-05,2.5e-05,6.4e-05,9.8e-05,5.4e-05,2.5e-05,8.5e-05,3.3e-05,4.8e-05,3.2e-05,4.9e-05,3.2e-05,1.6e-05,2e-05,5.3e-05,5e-05,2.8e-05,2e-05,4.8e-05,6.6e-05,4.6e-05,3.7e-05,3.6e-05,4.9e-05,4.7e-05,3.7e-05,3.6e-05,5.9e-05,4.9e-05,4.9e-05,4.4e-05,1.8e-05,5.3e-05,3.1e-05,1.5e-05
5e-05,2.9e-05,2.4e-05,2.4e-05,0.000104,0.000106,3.7e-05,3.9e-05,1.9e-05,2.6e-05,2.8e-05,3.3e-05,3.1e-05,1.1e-05,1.6e-05,2.6e-05,6e-06,2.4e-05,1.3e-05,4.5e-05,1.3e-05,6.4e-05,4.1e-05,3.1e-05,1.2e-05,2.7e-05,0.000125,4e-05,1.8e-05,1.5e-05,4.4e-05,5.3e-05,5.3e-05,2.1e-05,4.9e-05,3e-05,6.2e-05,5.7e-05,5.4e-05,3.2e-05,6.1e-05,1.3e-05,3.8e-05,4.9e-05,4.7e-05,1.6e-05,3.8e-05,2.6e-05,4e-05,6.7e-05,4.7e-05,4.4e-05,5.5e-05,4.1e-05,2.9e-05,9e-06,3.4e-05,1.3e-05,2.8e-05,3.5e-05,1.5e-05,1.8e-05,2.4e-05,1.3e-05,2.8e-05,5.3e-05,2.8e-05,4.3e-05,4.9e-05,8e-05,5.9e-05,8e-06,2.1e-05,3.2e-05,6.6e-05,4.3e-05,5.3e-05,3.1e-05,8e-06,7.6e-05,4.5e-05,4.9e-05,5.9e-05,0.000119,5.1e-05,2.7e-05,2.8e-05,2.9e-05,1.8e-05,2.8e-05,9.4e-05,3.9e-05,5.1e-05,5.9e-05,8.8e-05,0.000115,5.9e-05,7.2e-05,5e-05,5.5e-05,4.1e-05,4.6e-05,6.3e-05,1.5e-05,3.6e-05,2.4e-05,1.4e-05,4.3e-05,4.8e-05,4.8e-05,4.8e-05,4.6e-05,1.4e-05,5.4e-05,4.7e-05,5.5e-05,1.2e-05,2.2e-05,1.6e-05,3.1e-05,4e-06
5.9e-05,6.1e-05,0.000124,0.000107,0.000112,0.00022,0.00013,4.3e-05,3.5e-05,3e-06,3.7e-05,5.3e-05,6.1e-05,2.9e-05,3.1e-05,3e-05,2.4e-05,1.6e-05,5.6e-05,1.3e-05,2e-05,6.7e-05,3.6e-05,3.5e-05,5.4e-05,5e-05,0.000103,3.1e-05,7.7e-05,1.5e-05,5.1e-05,8.6e-05,3.1e-05,5.1e-05,9.8e-05,7.4e-05,3e-05,0.000104,1.8e-05,2.9e-05,8.8e-05,2.4e-05,2.3e-05,0.000109,0.000117,0.000113,8.7e-05,1.9e-05,4e-05,3.1e-05,4e-05,5.1e-05,5.4e-05,4.2e-05,1.2e-05,1.8e-05,2e-05,2.6e-05,1.5e-05,3.6e-05,4e-05,3e-05,2.8e-05,1e-05,5e-05,2.5e-05,2.1e-05,1.7e-05,5.9e-05,3.2e-05,9e-06,6.3e-05,3.8e-05,1.5e-05,3.9e-05,1.1e-05,3.9e-05,6.3e-05,7.9e-05,6.3e-05,4.2e-05,2.5e-05,3.6e-05,1e-05,0.000108,6.7e-05,5.9e-05,4e-05,7.3e-05,3.3e-05,1.8e-05,7.8e-05,4.7e-05,5.8e-05,4.9e-05,6.9e-05,4.2e-05,4.9e-05,3.1e-05,3.3e-05,5.8e-05,4.2e-05,3.5e-05,6.4e-05,1.4e-05,4e-05,1.6e-05,4.2e-05,4.9e-05,4.3e-05,6.3e-05,5.9e-05,3.5e-05,0.000102,7.1e-05,4.9e-05,2.9e-05,1.7e-05,2.8e-05,3e-05,3.4e-05
6.7e-05,4.2e-05,9.4e-05,3.1e-05,7e-05,0.000193,8.5e-05,4.9e-05,1.7e-05,1.5e-05,3.4e-05,4.7e-05,2.9e-05,1.1e-05,7.8e-05,6.8e-05,4.6e-05,2.6e-05,0.000118,3.7e-05,2.4e-05,4.3e-05,9e-06,3.4e-05,2.7e-05,1.9e-05,8.6e-05,2.6e-05,1e-04,0.000107,7.4e-05,5.6e-05,7.2e-05,8.8e-05,6.2e-05,4.8e-05,3e-06,6.4e-05,6.2e-05,1.1e-05,4.1e-05,8.5e-05,3.7e-05,5.7e-05,2e-05,0.000133,3e-05,7.4e-05,5.3e-05,6.2e-05,3.4e-05,4e-06,4.3e-05,3.5e-05,3.6e-05,4.6e-05,2.8e-05,3.3e-05,2.3e-05,3.8e-05,6.4e-05,2.2e-05,6e-06,5.2e-05,1.2e-05,1e-05,2.5e-05,5.9e-05,4.6e-05,1.7e-05,3.7e-05,7.2e-05,1.5e-05,2.8e-05,8.7e-05,8.2e-05,5.7e-05,2.5e-05,2.4e-05,3.1e-05,7e-06,3.8e-05,5.6e-05,4.3e-05,9.2e-05,8.8e-05,8e-06,2.5e-05,3.8e-05,3e-05,5.3e-05,0.000106,1.6e-05,2.8e-05,5.4e-05,6.1e-05,2.9e-05,4.8e-05,8.2e-05,2.5e-05,4.6e-05,5.6e-05,2.8e-05,1.7e-05,4.4e-05,3.1e-05,2.2e-05,4.2e-05,6.7e-05,6.9e-05,5.4e-05,2e-05,4e-06,0.000111,3.2e-05,2.8e-05,2.8e-05,3.5e-05,5.2e-05,5.5e-05,1.8e-05
1.1e-05,2.2e-05,7.6e-05,6e-05,3.6e-05,0.00019,0.000153,7.4e-05,5.7e-05,2.6e-05,6.6e-05,6.3e-05,2.3e-05,3.3e-05,0.000104,9.3e-05,4e-05,2.5e-05,0.000113,0.000146,8.3e-05,5.5e-05,6.1e-05,1.1e-05,4.7e-05,2e-05,0.000164,9.3e-05,5.4e-05,9.7e-05,2.4e-05,0.000101,8.7e-05,8.8e-05,9.2e-05,0.000134,4.4e-05,5.8e-05,4.7e-05,8.6e-05,7.5e-05,6.3e-05,8.3e-05,2e-05,3.9e-05,0.000158,9.3e-05,8.4e-05,6.5e-05,5.7e-05,0.000151,0.000129,8.1e-05,6.1e-05,1.6e-05,5e-05,6.7e-05,3.3e-05,0.000149,0.000125,7.9e-05,8.1e-05,5.8e-05,0.000104,1.7e-05,3.8e-05,4.2e-05,7.7e-05,7.4e-05,9e-05,3.4e-05,2.6e-05,7e-05,4.4e-05,0.000148,0.000138,6.9e-05,1.8e-05,6e-05,5.9e-05,3.5e-05,8.1e-05,7.1e-05,6.6e-05,7.1e-05,5.4e-05,5.8e-05,2.3e-05,6e-05,3.5e-05,0.000106,7e-06,7.8e-05,4.7e-05,3.8e-05,6.3e-05,3.5e-05,9.2e-05,6.9e-05,7.7e-05,5.6e-05,8e-05,3e-05,5.2e-05,3.9e-05,1e-05,4.7e-05,6e-05,4.8e-05,0.000162,5.9e-05,1.6e-05,4.6e-05,0.000174,0.000138,5.3e-05,6.2e-05,6.6e-05,6.5e-05,3.3e-05,4.7e-05
1e-05,4.3e-05,3.7e-05,9e-06,5e-05,0.000104,1.6e-05,2.9e-05,3.5e-05,7.8e-05,0.000132,0.000187,0.000122,5.5e-05,4.9e-05,0.000115,0.000132,9.8e-05,0.000113,0.000228,8.9e-05,5.4e-05,3e-05,9.5e-05,4.4e-05,3.2e-05,0.000225,0.000314,3.4e-05,7.4e-05,0.000107,0.000116,5e-05,0.000147,0.000167,0.000132,0.000122,7.5e-05,2.6e-05,8.9e-05,2.3e-05,9.7e-05,2.9e-05,0.000112,0.000112,0.000152,0.00011,3.5e-05,5.1e-05,6.1e-05,0.000154,5.1e-05,0.000116,0.000135,5.7e-05,6.1e-05,2.1e-05,4.5e-05,0.000189,1.9e-05,3.7e-05,1.9e-05,0.000108,0.000241,0.00022,3.8e-05,7e-05,7.1e-05,5.4e-05,4.8e-05,5.9e-05,1.7e-05,8.7e-05,2.4e-05,0.000169,0.000294,0.000188,6.1e-05,0.000124,6.4e-05,4.2e-05,5.1e-05,0.00014,7.8e-05,0.000145,2.7e-05,0.00011,0.000108,0.000174,7.1e-05,0.000116,0.000118,5.4e-05,6e-05,8e-05,4.5e-05,8.1e-05,0.000145,0.00019,5.9e-05,7.4e-05,8.8e-05,0.000141,0.000105,4e-05,8.8e-05,0.000114,0.000132,6.6e-05,0.000159,0.000164,7.5e-05,3.6e-05,0.000286,3e-04,0.00013,8.2e-05,5.8e-05,9.9e-05,0.000103,0.000127
4.4e-05,3.3e-05,6.2e-05,5.7e-05,6e-06,2.1e-05,2.3e-05,3.4e-05,4.7e-05,4.4e-05,5.2e-05,0.000129,0.000132,9.5e-05,5.7e-05,6.9e-05,1.7e-05,6.8e-05,0.000105,0.000136,0.000153,0.000104,0.00012,6.6e-05,5.6e-05,2.4e-05,0.000189,0.000251,0.000308,0.000169,4.3e-05,9.5e-05,0.000121,0.000196,0.000142,4.6e-05,7.6e-05,0.000143,0.000195,0.000155,0.000125,7.1e-05,0.000141,0.000147,5.2e-05,0.000147,0.000132,0.000131,0.000135,7.2e-05,0.000119,0.000101,9.8e-05,0.000175,9.5e-05,5.9e-05,0.000161,0.000147,0.000205,0.000242,0.00015,1e-04,0.000118,0.000171,0.00024,0.000253,0.000216,0.000105,7.2e-05,5.8e-05,0.000124,8.5e-05,0.000119,0.000102,0.000199,0.000176,0.000106,0.000155,0.000211,4.8e-05,9.1e-05,0.000162,0.000203,0.000316,0.000236,0.00019,0.000227,0.000121,0.00012,0.000113,0.000141,7.6e-05,0.000124,6.5e-05,0.00017,0.000182,8.5e-05,6.9e-05,9.6e-05,0.000175,0.000169,0.000128,0.000233,7.7e-05,3.4e-05,6e-05,7.2e-05,0.000177,9.9e-05,7.7e-05,7e-05,8.2e-05,1e-05,0.000294,0.000184,0.000118,0.000115,0.000126,0.000145,5.8e-05,5.9e-05
1.6e-05,4.1e-05,1.4e-05,4.3e-05,3.6e-05,2.3e-05,3e-05,2.7e-05,4e-05,3e-05,4.3e-05,6.1e-05,2.4e-05,3.1e-05,2.4e-05,6.8e-05,5.9e-05,9.2e-05,6.4e-05,3.9e-05,1e-04,5e-05,7.6e-05,5.2e-05,3.9e-05,6.2e-05,0.000118,0.000122,0.000135,8.4e-05,8.6e-05,3.5e-05,8.9e-05,3.3e-05,0.000134,0.000186,8.6e-05,6.2e-05,0.000169,5.6e-05,6.6e-05,5.3e-05,0.000134,9.2e-05,5.5e-05,0.000109,5.9e-05,0.000129,9e-06,1.2e-05,0.000139,2.7e-05,4.9e-05,0.000119,9.4e-05,6.4e-05,0.000184,6e-05,2.3e-05,9.2e-05,5.8e-05,3.3e-05,8.9e-05,4.1e-05,0.000139,9e-05,8.2e-05,5.1e-05,9.4e-05,8.3e-05,9.6e-05,6.7e-05,0.000104,7.9e-05,0.000115,3.4e-05,8.7e-05,5.4e-05,4.1e-05,0.000145,0.000138,5.8e-05,9.7e-05,0.000204,9.4e-05,0.000133,0.000161,0.000118,8e-05,4.1e-05,1.9e-05,8.4e-05,0.000118,7.2e-05,0.000106,6.5e-05,4.3e-05,3.5e-05,0.000148,0.000119,1.4e-05,0.000113,0.000108,0.000122,7.9e-05,5.1e-05,0.000122,6.8e-05,7.9e-05,5.5e-05,4.3e-05,7.4e-05,9.2e-05,0.000165,7.6e-05,6.6e-05,0.000105,3.6e-05,7.7e-05,0.000144,7.2e-05
1.9e-05,4e-06,1.6e-05,4.6e-05,2.5e-05,2.1e-05,1.1e-05,1.7e-05,1.7e-05,4.3e-05,3.6e-05,5.4e-05,5.1e-05,2.6e-05,4.3e-05,6.8e-05,5.9e-05,6.6e-05,6.2e-05,6e-06,9e-05,9.7e-05,2.6e-05,7e-05,9.2e-05,0.000122,5.6e-05,0.000104,0.00011,0.000134,6.7e-05,3e-05,6.5e-05,8e-05,4.6e-05,0.000102,0.000179,0.000139,0.000165,0.000128,7.9e-05,8.3e-05,7e-05,0.000128,0.000206,0.000106,5.9e-05,9.1e-05,0.000123,8.7e-05,0.000181,0.000153,5.9e-05,9.7e-05,8e-05,0.000139,8.2e-05,0.000139,0.000217,0.00016,4.1e-05,4.2e-05,6.5e-05,7.7e-05,4.9e-05,0.000108,0.000137,0.000137,0.000138,0.000107,0.000131,9.6e-05,0.000163,9.8e-05,0.000121,8.9e-05,0.000135,9.7e-05,9.8e-05,0.000141,4.9e-05,0.000119,2.2e-05,0.000158,9.7e-05,0.000129,7.6e-05,5.8e-05,4.2e-05,0.000111,7e-05,7.8e-05,0.00015,0.000151,0.000144,9.9e-05,3.1e-05,2.2e-05,0.000121,9.9e-05,2.9e-05,7.9e-05,0.000116,8.1e-05,1e-04,5e-05,8.9e-05,6.5e-05,0.000117,0.000132,6.6e-05,3.8e-05,6.6e-05,0.000114,2.8e-05,5.4e-05,8.3e-05,8.8e-05,4.2e-05,5.7e-05,7.1e-05
2.5e-05,1.2e-05,5.2e-05,8e-06,2.2e-05,3.9e-05,3.1e-05,4.4e-05,2.1e-05,3.3e-05,4.3e-05,8e-06,1.1e-05,2.7e-05,5.9e-05,8e-05,1.9e-05,5.5e-05,5.5e-05,8.4e-05,4.7e-05,6.4e-05,6.6e-05,9e-05,7.7e-05,2.5e-05,3.6e-05,7e-05,0.000145,2.8e-05,9e-06,3.8e-05,2.4e-05,6e-05,8.9e-05,5.1e-05,0.000104,9.5e-05,5.1e-05,1.2e-05,6.6e-05,5e-05,8.7e-05,6.2e-05,0.000103,0.000127,5.2e-05,3.7e-05,6.1e-05,5.2e-05,0.000107,5.9e-05,0.000109,9.4e-05,8.7e-05,4.2e-05,9e-05,0.000109,0.000121,0.000141,0.000122,4.4e-05,7.1e-05,0.000112,3.1e-05,4.9e-05,5.6e-05,9.5e-05,3.9e-05,0.000139,7.1e-05,7e-05,0.000112,0.000124,6.1e-05,6.8e-05,4.7e-05,1.9e-05,0.000112,9.5e-05,3.9e-05,8.3e-05,5.3e-05,2.5e-05,4.7e-05,3.9e-05,9.8e-05,8e-05,5.4e-05,6.2e-05,3.7e-05,6.7e-05,9e-05,7.6e-05,0.000106,3.1e-05,4.9e-05,4.5e-05,4.7e-05,6.4e-05,8.7e-05,0.00012,0.000105,6.7e-05,6.8e-05,2.5e-05,0.000109,6.6e-05,6.6e-05,8e-06,2e-05,5.4e-05,2.4e-05,2.8e-05,3.6e-05,9.4e-05,0.000149,6.1e-05,4.5e-05,3e-05,6.3e-05
2e-05,1.8e-05,3.7e-05,3.2e-05,2e-05,2e-05,2.1e-05,3.1e-05,2.4e-05,2.3e-05,3.9e-05,3.4e-05,1.1e-05,3.2e-05,5e-05,1.9e-05,8e-06,3e-05,2.5e-05,4.2e-05,5.8e-05,7.6e-05,2.4e-05,2.9e-05,5.6e-05,3.3e-05,2.2e-05,7e-05,6.1e-05,7.4e-05,6.1e-05,7.2e-05,6.7e-05,1.6e-05,6.3e-05,7.3e-05,4.2e-05,0.000104,4.8e-05,4.4e-05,8.3e-05,0.00011,2.4e-05,7.6e-05,8.1e-05,0.000118,7.1e-05,7.3e-05,4.9e-05,3.9e-05,2.9e-05,7e-05,2.9e-05,7.6e-05,6e-06,4.2e-05,2.9e-05,0.000137,9.8e-05,4.7e-05,2.8e-05,1.8e-05,7.8e-05,0.000157,0.000111,4.5e-05,6.3e-05,1.9e-05,8.2e-05,9.9e-05,5.6e-05,1e-04,8.4e-05,9e-05,0.000128,7.1e-05,9.1e-05,8.5e-05,7.6e-05,5.8e-05,2.9e-05,1.4e-05,4.4e-05,7.8e-05,8.2e-05,7e-05,6.1e-05,2.8e-05,4.9e-05,8.4e-05,7.1e-05,4.8e-05,3.3e-05,0.000121,9.7e-05,4.7e-05,5.4e-05,4.9e-05,2.3e-05,8.2e-05,4.7e-05,4.5e-05,2e-05,6.7e-05,4.6e-05,2.7e-05,0.000109,5.5e-05,3.6e-05,3.3e-05,2.5e-05,3.6e-05,2.1e-05,2.6e-05,8.4e-05,8.8e-05,4.7e-05,7.9e-05,5.3e-05,7.7e-05,4.5e-05
4e-06,5e-06,3.2e-05,1.1e-05,2.8e-05,1.5e-05,2.7e-05,6e-06,1.8e-05,2.9e-05,6.6e-05,7.2e-05,5.1e-05,4.6e-05,1.1e-05,1.2e-05,9e-06,3.7e-05,1.7e-05,3.2e-05,9.7e-05,5.5e-05,5.4e-05,5.4e-05,2e-05,3e-05,2.9e-05,2.5e-05,3.7e-05,4e-05,2.1e-05,5.4e-05,9e-06,2e-05,2.7e-05,4.8e-05,9.6e-05,7e-06,0.000104,8.5e-05,1.9e-05,5.5e-05,5.4e-05,8.3e-05,7.6e-05,2.5e-05,1.8e-05,4.8e-05,1.7e-05,7.8e-05,8.3e-05,8.7e-05,8.9e-05,6.9e-05,4.5e-05,5.2e-05,4.5e-05,5.8e-05,2.6e-05,6.3e-05,1.2e-05,5e-05,4.1e-05,5.4e-05,2.8e-05,3.4e-05,6e-05,1.6e-05,6.3e-05,0.000108,5.1e-05,6.1e-05,9.6e-05,4.5e-05,8.4e-05,4.3e-05,2.4e-05,2.2e-05,8.4e-05,0.000125,6.7e-05,1.3e-05,5.8e-05,0.000112,0.000102,4.6e-05,4.5e-05,2.4e-05,3.2e-05,4.2e-05,5.9e-05,6e-05,5.7e-05,0.000111,2.9e-05,4.3e-05,4.8e-05,4e-06,5.1e-05,2.2e-05,5.7e-05,3.4e-05,2.9e-05,7.6e-05,4.5e-05,1.1e-05,6.2e-05,4.1e-05,5.8e-05,7.2e-05,7e-06,1.7e-05,1.8e-05,4e-05,9e-05,6e-05,2.6e-05,0.000101,4e-05,5e-06,3.6e-05
1.5e-05,1.9e-05,2.6e-05,1.8e-05,1.9e-05,1.1e-05,2.4e-05,9e-06,1.9e-05,3.2e-05,5.6e-05,5e-06,2e-05,2e-05,1.7e-05,4e-06,1.6e-05,3.1e-05,8e-06,1.3e-05,6.6e-05,7.5e-05,8.6e-05,2.9e-05,3.1e-05,6.8e-05,2.7e-05,4e-05,8.2e-05,2.9e-05,2.2e-05,3.3e-05,5.5e-05,3.3e-05,6e-06,2.2e-05,8.7e-05,5e-05,8.1e-05,4.7e-05,4.3e-05,6.8e-05,3.2e-05,6.9e-05,3.2e-05,6.8e-05,7.2e-05,8.2e-05,7.7e-05,9.2e-05,2.5e-05,2.9e-05,2.3e-05,5.6e-05,1.9e-05,3.3e-05,1.5e-05,1.7e-05,9.7e-05,0.000101,0.000102,9.6e-05,9.5e-05,7.1e-05,2.1e-05,5.5e-05,1.7e-05,3.9e-05,5.5e-05,3e-05,5e-05,5.1e-05,2.6e-05,1.5e-05,5.6e-05,4.6e-05,1.9e-05,1.3e-05,9.5e-05,4.2e-05,1.6e-05,7e-05,9.7e-05,5e-05,3.7e-05,4.6e-05,4.9e-05,6e-05,2.8e-05,1.6e-05,4e-05,6e-06,1.9e-05,4e-06,3.1e-05,3.6e-05,4.1e-05,4.3e-05,3.4e-05,4.9e-05,3.6e-05,1.6e-05,3.9e-05,4.5e-05,5.5e-05,8.5e-05,9.9e-05,2.6e-05,8.5e-05,3e-05,7e-06,4e-06,2.2e-05,3.8e-05,3.6e-05,4.8e-05,2.7e-05,6.2e-05,3.3e-05,6.6e-05,9e-06
5e-06,1e-06,1e-05,6e-06,8e-06,2e-06,3e-06,9e-06,1.4e-05,5e-06,2e-06,8e-06,1e-06,8e-06,9e-06,8e-06,1.3e-05,1.4e-05,1.7e-05,9e-06,3.1e-05,7e-06,2.2e-05,2.3e-05,1e-05,1.3e-05,2e-05,2e-05,1.3e-05,1.2e-05,1.1e-05,1e-05,1.6e-05,1.4e-05,1e-05,1.2e-05,2.3e-05,1.1e-05,1.6e-05,3.1e-05,1.4e-05,2.6e-05,3.9e-05,5.6e-05,3.8e-05,2.9e-05,1.9e-05,1.4e-05,1.5e-05,1.1e-05,1.9e-05,1.9e-05,2.2e-05,3.6e-05,2.8e-05,1.5e-05,7e-06,2.2e-05,4.3e-05,2.2e-05,2.8e-05,9e-06,3.7e-05,2.1e-05,1.7e-05,8e-06,9e-06,1e-05,1.8e-05,2e-05,2.2e-05,8e-06,1e-05,1e-06,3e-05,3.8e-05,3.2e-05,2.6e-05,2.9e-05,5.5e-05,3.2e-05,3.3e-05,2.1e-05,9e-06,7e-06,4.5e-05,4.4e-05,1.2e-05,8e-06,1.5e-05,1.7e-05,8e-06,3.4e-05,3.3e-05,3.4e-05,3.1e-05,2.9e-05,1.2e-05,3.4e-05,5e-06,1.8e-05,1.8e-05,8e-06,2e-05,2.6e-05,3.2e-05,4.3e-05,4.1e-05,4.1e-05,4.3e-05,2.8e-05,1.5e-05,1.1e-05,1.2e-05,5e-06,3.2e-05,2.6e-05,1.8e-05,2.4e-05,1.8e-05,2.2e-05
4e-06,4e-06,1.1e-05,5e-06,7e-06,2e-06,2e-06,5e-06,4e-06,1.1e-05,1.2e-05,1.9e-05,1.2e-05,1.1e-05,2e-06,4e-06,1.7e-05,7e-06,1.5e-05,2.2e-05,1.3e-05,1.1e-05,1.9e-05,1e-05,2.1e-05,1.1e-05,1.2e-05,6e-06,1.4e-05,1.8e-05,1.2e-05,1e-06,1.3e-05,1e-05,6e-06,2.3e-05,2.8e-05,7e-06,2.2e-05,2.4e-05,1.1e-05,1.6e-05,1.4e-05,1.9e-05,3e-06,2e-05,7e-06,1.1e-05,1.7e-05,1.3e-05,2.3e-05,1.7e-05,1.6e-05,1.1e-05,1.4e-05,7e-06,2e-06,1.8e-05,1e-05,1.4e-05,5e-06,4e-06,3.1e-05,1.3e-05,2.1e-05,1.3e-05,1.1e-05,1e-05,2.5e-05,6e-06,2e-06,9e-06,1.1e-05,4e-06,3e-05,4e-05,2.4e-05,8e-06,1.4e-05,3.1e-05,1.4e-05,2.8e-05,2.6e-05,4e-06,2e-05,4.6e-05,2.9e-05,1.6e-05,9e-06,2e-05,2e-05,2.1e-05,3.5e-05,4.3e-05,9e-06,3e-06,1.6e-05,7e-06,3.6e-05,3.8e-05,2.6e-05,1.3e-05,8e-06,1.2e-05,1.5e-05,4.5e-05,1.2e-05,1e-05,2.3e-05,2.1e-05,8e-06,4e-06,7e-06,1.4e-05,1.8e-05,3e-06,2.5e-05,2.9e-05,3e-05,2e-05,5e-06
4e-06,1e-06,7e-06,5e-06,5e-06,4e-06,5e-06,6e-06,5e-06,4e-06,1.9e-05,1.1e-05,3e-06,1.6e-05,4e-06,1e-06,6e-06,8e-06,1.3e-05,1.3e-05,1e-05,1.7e-05,2.8e-05,2.7e-05,4e-06,5e-06,1.4e-05,8e-06,3.1e-05,3.2e-05,2.1e-05,1.2e-05,2.5e-05,3.7e-05,1.7e-05,2.1e-05,8e-06,3e-05,9e-06,1.8e-05,5e-06,4e-06,9e-06,4e-05,3.3e-05,3e-05,1.6e-05,7e-06,1.4e-05,1e-05,1.3e-05,1.5e-05,9e-06,2.7e-05,5e-06,1.2e-05,4e-06,1.3e-05,2.4e-05,2e-05,8e-06,1.8e-05,1.4e-05,2e-06,2.8e-05,1.9e-05,2e-05,1.7e-05,1.9e-05,1.6e-05,8e-06,5e-06,8e-06,7e-06,3.8e-05,2.6e-05,9e-06,1.6e-05,2e-05,2e-05,1e-05,3.1e-05,2.4e-05,1.1e-05,2.6e-05,2.7e-05,1.8e-05,3e-06,1.1e-05,1.1e-05,1.4e-05,1.3e-05,1.3e-05,6e-06,1.4e-05,1e-05,7e-06,9e-06,2.2e-05,1.1e-05,1.6e-05,5e-06,1.3e-05,2e-06,1.8e-05,2.1e-05,3.1e-05,1.2e-05,2.5e-05,2.1e-05,7e-06,7e-06,4e-06,1.4e-05,2.2e-05,1.4e-05,2.6e-05,1.2e-05,1.3e-05,3.1e-05,1.7e-05
1.4e-05,7e-06,1.2e-05,1.9e-05,1e-06,6e-06,1e-05,4e-06,4e-06,4e-06,2.1e-05,8e-06,2e-06,1e-05,7e-06,8e-06,4e-06,1.3e-05,1.5e-05,1.8e-05,1.7e-05,3e-05,2.6e-05,1.5e-05,1.9e-05,2e-06,1.5e-05,2.2e-05,6e-06,1.3e-05,3.1e-05,3.5e-05,3.2e-05,6e-06,9e-06,1e-05,9e-06,3.1e-05,2.7e-05,3.2e-05,2.7e-05,9e-06,1.6e-05,4.5e-05,3.3e-05,1.1e-05,2.2e-05,4e-06,2e-05,7e-06,1.4e-05,1.4e-05,1.7e-05,3.3e-05,3.4e-05,2.7e-05,2.6e-05,9e-06,2.6e-05,1.7e-05,2e-05,1e-05,1.4e-05,1.5e-05,3.4e-05,3e-05,2.4e-05,2.6e-05,1.1e-05,5e-06,1.9e-05,2.2e-05,3.3e-05,1.4e-05,3.8e-05,3.2e-05,1.4e-05,1.8e-05,1.8e-05,1.5e-05,1.2e-05,1.9e-05,1.8e-05,1e-06,2.1e-05,2.1e-05,6e-06,6e-06,1.9e-05,2e-05,2.8e-05,2e-05,1.8e-05,2.6e-05,9e-06,1.6e-05,3.1e-05,1.5e-05,1.6e-05,2e-05,1.5e-05,1.7e-05,1.9e-05,6e-06,2.3e-05,3e-05,3.2e-05,1.7e-05,2e-05,5e-06,8e-06,8e-06,7e-06,1.6e-05,3.5e-05,1.5e-05,1.7e-05,2e-05,2.7e-05,3.2e-05,2e-06
1.3e-05,8e-06,2.2e-05,1.2e-05,1.3e-05,9e-06,5e-06,7e-06,7e-06,3e-06,1.8e-05,3e-06,4e-06,4e-06,4e-06,1.1e-05,9e-06,1.4e-05,1.5e-05,3e-06,2.3e-05,1.3e-05,3.2e-05,2.1e-05,2e-05,1.7e-05,2.1e-05,2.4e-05,1e-05,7e-06,2.7e-05,3e-05,3.5e-05,2.6e-05,1e-05,3e-06,1e-05,3.3e-05,1.5e-05,1.5e-05,1.7e-05,2.2e-05,2.5e-05,2.2e-05,2e-05,2.2e-05,6e-06,7e-06,1.8e-05,1.9e-05,3.1e-05,3.4e-05,1.7e-05,7e-06,8e-06,8e-06,2e-05,2.8e-05,2.8e-05,2.8e-05,2.7e-05,2.1e-05,1.1e-05,1.6e-05,4.1e-05,2.9e-05,2e-05,1.1e-05,1.2e-05,2.1e-05,1.9e-05,9e-06,3.1e-05,2.6e-05,2.6e-05,2.1e-05,2.4e-05,2.8e-05,3e-05,2.6e-05,2.7e-05,3e-05,3.9e-05,1.7e-05,1.5e-05,1.1e-05,1.5e-05,9e-06,3.1e-05,3.5e-05,1.7e-05,1.8e-05,2.9e-05,1.5e-05,2.8e-05,8e-06,3e-05,3.9e-05,3.4e-05,3.3e-05,1.7e-05,3e-06,1e-05,1.7e-05,2.6e-05,2.3e-05,1.2e-05,9e-06,1.8e-05,4e-05,2.3e-05,2e-06,1.3e-05,2.5e-05,1.6e-05,3e-05,2.8e-05,1e-05,1.8e-05,1.2e-05,2.7e-05
1.2e-05,1.4e-05,2.1e-05,3.5e-05,1.9e-05,1.3e-05,6e-06,3e-06,6e-06,3e-06,1.8e-05,1.6e-05,1.2e-05,1.5e-05,6e-06,7e-06,6e-06,1e-05,7e-06,1.3e-05,1.6e-05,2.2e-05,1.9e-05,1.2e-05,1.5e-05,1.1e-05,5e-06,8e-06,2.3e-05,2.8e-05,1.3e-05,1.2e-05,1e-05,1.6e-05,3e-06,1.5e-05,9e-06,2.7e-05,3.7e-05,2.6e-05,2e-05,3.6e-05,1.8e-05,1.5e-05,3.4e-05,2.9e-05,2.9e-05,1.6e-05,3.4e-05,2.6e-05,1.7e-05,4e-06,2.8e-05,2.7e-05,1.6e-05,1.5e-05,3e-06,4e-06,1.5e-05,1.3e-05,2.1e-05,1e-05,2.4e-05,2e-05,2.3e-05,3.6e-05,3.1e-05,8e-06,5e-06,1.4e-05,3.1e-05,2.6e-05,1.4e-05,3.3e-05,3.1e-05,2.6e-05,1.6e-05,5.1e-05,1.4e-05,5e-06,3.5e-05,2.5e-05,9e-06,2.3e-05,1.6e-05,2e-05,7e-06,1.1e-05,1.8e-05,3.3e-05,3e-05,3.4e-05,2.6e-05,2.5e-05,3e-05,2.5e-05,8e-06,2.5e-05,3e-05,7e-06,1.6e-05,1.9e-05,6e-06,1e-05,1.4e-05,1.6e-05,1e-06,1.8e-05,8e-06,2.6e-05,3e-06,2.3e-05,1.9e-05,1.5e-05,6e-06,1.4e-05,9e-06,1e-05,1.4e-05,2.3e-05,3.3e-05
1.3e-05,1.3e-05,1.1e-05,3.6e-05,2.8e-05,8e-06,3e-06,5e-06,8e-06,6e-06,1e-05,1.1e-05,5e-06,9e-06,9e-06,1.1e-05,2.5e-05,2.2e-05,1.2e-05,1.4e-05,0,8e-06,2.1e-05,2.1e-05,1.1e-05,1.9e-05,9e-06,1.2e-05,2.4e-05,2.6e-05,1.9e-05,8e-06,2.2e-05,1.9e-05,1.3e-05,3.3e-05,3.6e-05,4e-06,4e-06,5e-06,2.1e-05,1e-05,1.4e-05,1e-05,2.1e-05,2.7e-05,2.5e-05,1.4e-05,3e-05,1.6e-05,1.9e-05,2.4e-05,1.8e-05,2.4e-05,2.7e-05,2.5e-05,1.3e-05,1.3e-05,2e-06,8e-06,4e-06,6e-06,4.4e-05,1.9e-05,1.2e-05,2.9e-05,2.5e-05,2.2e-05,1.9e-05,2.2e-05,5.5e-05,3e-05,2.7e-05,1.6e-05,2.3e-05,1.4e-05,3.4e-05,4.5e-05,2.6e-05,2e-05,2.9e-05,2.9e-05,8e-06,2e-05,2e-05,2.1e-05,2.7e-05,8e-06,9e-06,2.9e-05,2.8e-05,6e-06,2.9e-05,5.8e-05,1.6e-05,2e-06,1.2e-05,1.1e-05,3.6e-05,2.7e-05,2.9e-05,1.1e-05,1.2e-05,1e-05,3.5e-05,2.7e-05,1.2e-05,2.8e-05,4.1e-05,3.7e-05,3.2e-05,4.2e-05,2e-05,4.5e-05,4e-05,1.7e-05,2.1e-05,3e-06,1.1e-05,2e-05,1.6e-05
8e-06,1e-05,2.5e-05,1.7e-05,2e-06,4e-06,8e-06,8e-06,5e-06,4e-06,1e-05,1.3e-05,1e-05,7e-06,1.7e-05,1.8e-05,1.1e-05,1.6e-05,1.3e-05,8e-06,6e-06,2.1e-05,1.3e-05,3e-06,1.4e-05,4.1e-05,3e-05,1e-05,1.7e-05,2.1e-05,1.3e-05,1.3e-05,2.8e-05,4.7e-05,4e-05,2.8e-05,9e-06,1.5e-05,8e-06,5e-06,2.8e-05,2.6e-05,1.1e-05,1.5e-05,9e-06,2.4e-05,2.9e-05,3.5e-05,7e-06,2.2e-05,3.1e-05,2.2e-05,2.8e-05,1.8e-05,1.1e-05,1.4e-05,8e-06,1.8e-05,2.4e-05,2e-05,1.7e-05,1.5e-05,3e-05,1.9e-05,2.7e-05,6e-06,1.7e-05,1.5e-05,1e-05,3.4e-05,3.8e-05,3e-05,1.6e-05,2.6e-05,3.8e-05,2.3e-05,4.6e-05,1.1e-05,9e-06,9e-06,3e-06,3.5e-05,1.8e-05,1.5e-05,9e-06,3.5e-05,3.1e-05,4.5e-05,1.5e-05,3.2e-05,2e-06,2.7e-05,1.3e-05,3.9e-05,2.9e-05,1.9e-05,2.7e-05,2.4e-05,1.5e-05,1.1e-05,2e-05,2e-05,6e-06,1.1e-05,4.3e-05,1.3e-05,2.7e-05,2.8e-05,2.9e-05,4e-06,1.7e-05,2.8e-05,1.5e-05,5.1e-05,9e-06,1.3e-05,2.2e-05,1.3e-05,6e-06,2e-05,1.6e-05
4e-06,1.1e-05,1e-05,5e-06,3e-06,4e-06,3e-06,2e-06,3e-06,3e-06,6e-06,7e-06,7e-06,1.4e-05,1.4e-05,3e-06,9e-06,5e-06,7e-06,1.3e-05,4e-06,1.9e-05,2.3e-05,3e-06,2.3e-05,2.5e-05,2.3e-05,2.2e-05,1.7e-05,1.9e-05,7e-06,2e-05,3e-06,3.3e-05,1e-05,2e-05,3.1e-05,3.1e-05,3.1e-05,2.8e-05,2.3e-05,4e-05,4.3e-05,3.1e-05,1.9e-05,2e-06,8e-06,1.8e-05,1.6e-05,4e-05,4.1e-05,3.3e-05,3.1e-05,1.5e-05,5e-06,1e-05,7e-06,1e-05,1e-05,9e-06,1.1e-05,2.5e-05,1e-05,1.5e-05,1.5e-05,1.8e-05,1.9e-05,1.5e-05,1.9e-05,3.6e-05,3.2e-05,3e-05,3.1e-05,1.4e-05,2.1e-05,2.1e-05,2.9e-05,7e-06,1.1e-05,4e-06,1.7e-05,4e-05,4.1e-05,1.8e-05,2.2e-05,4.4e-05,1.4e-05,3.4e-05,4.2e-05,1.6e-05,1.2e-05,2.8e-05,2.5e-05,2.4e-05,2.7e-05,3.2e-05,2.9e-05,2e-05,1.6e-05,2.2e-05,3e-05,2.3e-05,1.7e-05,1.7e-05,2.6e-05,2.1e-05,3e-05,7e-06,2.2e-05,2.3e-05,5e-06,3.1e-05,2e-05,4.5e-05,2.9e-05,6e-06,3e-05,1.7e-05,2e-05,2.9e-05,1.3e-05
1e-06,7e-06,1.1e-05,4e-06,1e-06,8e-06,3e-06,2e-06,3e-06,2e-06,5e-06,1e-05,3e-06,6e-06,1.6e-05,1.4e-05,6e-06,4e-06,1e-05,1e-05,1.2e-05,1.2e-05,1.9e-05,2.9e-05,2.4e-05,3.3e-05,1.4e-05,1e-05,1.9e-05,2.3e-05,3.3e-05,7e-06,1e-06,3e-05,2.9e-05,1.2e-05,1.2e-05,3.2e-05,3e-06,1.6e-05,3.2e-05,1.7e-05,2.4e-05,1.1e-05,1.5e-05,7e-06,1.4e-05,7e-06,9e-06,3.7e-05,3.7e-05,4.7e-05,2.8e-05,2.4e-05,5e-06,1.4e-05,1.7e-05,2.4e-05,3.6e-05,2.8e-05,2.1e-05,2.5e-05,1.9e-05,2.2e-05,2.3e-05,2.5e-05,7e-06,2.2e-05,3.1e-05,1.6e-05,1.7e-05,1.1e-05,1.6e-05,5e-06,7e-06,2.2e-05,1.6e-05,2.6e-05,3e-06,1.9e-05,1e-05,1.9e-05,1.6e-05,1.6e-05,1.9e-05,4.2e-05,5.2e-05,1.1e-05,3.1e-05,4.2e-05,2.1e-05,2.4e-05,1.2e-05,8e-06,2.4e-05,2.1e-05,2.6e-05,2.4e-05,3.9e-05,4.4e-05,1.9e-05,4e-06,5e-06,7e-06,1.3e-05,3.1e-05,2.6e-05,1.4e-05,2.2e-05,2.1e-05,3.6e-05,3.5e-05,1.7e-05,2.9e-05,7e-06,8e-06,1.6e-05,9e-06,2e-05,8e-06,1e-06
5e-06,8e-06,7e-06,1e-06,3e-06,9e-06,4e-06,4e-06,5e-06,6e-06,3e-06,5e-06,7e-06,7e-06,6e-06,2e-06,6e-06,5e-06,1e-05,1.6e-05,1.8e-05,1e-05,1e-05,2.9e-05,1.4e-05,1.4e-05,1.3e-05,7e-06,1.7e-05,1e-05,2.1e-05,1.2e-05,1.2e-05,3e-05,1e-05,1.3e-05,2.2e-05,2e-05,2.2e-05,2.5e-05,2.5e-05,2e-05,2.1e-05,2.2e-05,3.8e-05,3.8e-05,1.9e-05,2.6e-05,7e-06,2.5e-05,4.1e-05,3e-06,1.5e-05,2.6e-05,1.8e-05,2.2e-05,1.7e-05,1.7e-05,3.1e-05,8e-06,9e-06,5e-06,1.6e-05,1.9e-05,2.7e-05,1e-06,1e-05,1e-05,1.1e-05,5e-06,2.8e-05,1.8e-05,2e-06,2.1e-05,2e-05,3.6e-05,1.7e-05,1.3e-05,2.8e-05,1.2e-05,1.5e-05,1.2e-05,1.8e-05,1.2e-05,2.9e-05,1.8e-05,3.3e-05,3e-05,2.7e-05,3e-05,9e-06,1.3e-05,2.6e-05,2.5e-05,1.8e-05,5e-06,2.2e-05,3.1e-05,3.8e-05,3.4e-05,1.7e-05,7e-06,4e-06,1.6e-05,1e-05,2.5e-05,3.3e-05,2.7e-05,2.1e-05,1.4e-05,1.7e-05,1.2e-05,1.1e-05,1e-05,2e-05,1.8e-05,2.8e-05,2.6e-05,1.4e-05,7e-06,9e-06
3e-06,4e-06,9e-06,5e-06,6e-06,6e-06,4e-06,6e-06,7e-06,3e-06,2e-06,9e-06,1.3e-05,4e-06,4e-06,4e-06,8e-06,5e-06,1.1e-05,2.6e-05,2.5e-05,2.6e-05,9e-06,2.3e-05,9e-06,2e-06,8e-06,2.2e-05,2.4e-05,9e-06,1.3e-05,1.5e-05,2.5e-05,1.1e-05,5e-06,1.5e-05,1e-06,5e-06,3e-06,1.2e-05,5e-05,3e-05,2.2e-05,1.1e-05,1.8e-05,8e-06,9e-06,3e-05,3e-05,2.8e-05,2.2e-05,2.5e-05,2.2e-05,3e-06,7e-06,1.2e-05,9e-06,1.7e-05,8e-06,1.6e-05,1.1e-05,3e-06,5e-06,3.4e-05,8e-06,2e-06,1.2e-05,1.4e-05,8e-06,4e-06,2.6e-05,1e-05,1e-05,1.9e-05,1.6e-05,6e-06,3e-06,6e-06,2.3e-05,2.3e-05,9e-06,1.7e-05,9e-06,1.3e-05,2.9e-05,3.3e-05,4.3e-05,2.6e-05,3.6e-05,1.9e-05,1.5e-05,1.4e-05,2.9e-05,1.4e-05,1.4e-05,8e-06,9e-06,1.5e-05,5e-06,2.7e-05,1.9e-05,1e-05,1e-05,1.8e-05,2.1e-05,3.3e-05,1.9e-05,1.2e-05,1e-05,1e-05,8e-06,1.5e-05,9e-06,1.5e-05,1.8e-05,2.8e-05,3.9e-05,3.7e-05,2.7e-05,1.3e-05,1.4e-05
4e-06,6e-06,6e-06,5e-06,8e-06,4e-06,8e-06,3e-06,6e-06,3e-06,8e-06,1.4e-05,1e-05,1e-06,5e-06,8e-06,1.5e-05,1.2e-05,3e-06,1.7e-05,6e-06,6e-06,3.3e-05,1.7e-05,2e-05,1e-05,1.3e-05,3e-05,5e-06,9e-06,1.6e-05,7e-06,2.1e-05,1.8e-05,1.1e-05,7e-06,1.5e-05,1.9e-05,2e-05,1e-06,4.1e-05,2.3e-05,8e-06,1.9e-05,2.8e-05,1.4e-05,1.3e-05,1.2e-05,2.5e-05,4.3e-05,2.3e-05,1.3e-05,1.6e-05,1.5e-05,1.3e-05,1.5e-05,1.3e-05,6e-06,1.7e-05,3.2e-05,1.6e-05,8e-06,1e-05,3.7e-05,2.1e-05,9e-06,1.3e-05,2.9e-05,2.7e-05,8e-06,2.2e-05,2.3e-05,1.4e-05,1.3e-05,1e-05,1.9e-05,1.3e-05,1.8e-05,2.6e-05,9e-06,1.2e-05,2e-05,2.9e-05,1e-05,2.8e-05,4.4e-05,2.2e-05,2.2e-05,6e-06,1.5e-05,8e-06,1.4e-05,2.4e-05,3.1e-05,1.5e-05,1.9e-05,6e-06,1.4e-05,7e-06,5e-06,1.4e-05,1.3e-05,2.1e-05,2.6e-05,9e-06,4e-06,2.2e-05,1.7e-05,3e-06,1.8e-05,1.3e-05,2.1e-05,6e-06,9e-06,3e-05,3e-06,1.5e-05,1.1e-05,8e-06,1.5e-05,2.2e-05
3e-06,4e-06,1e-06,1e-06,5e-06,6e-06,8e-06,2e-06,5e-06,4e-06,7e-06,3e-06,1.1e-05,1.6e-05,5e-06,4e-06,1.2e-05,7e-06,1e-05,1.1e-05,1.1e-05,1.1e-05,2.9e-05,2.7e-05,1.2e-05,1.4e-05,2e-05,2.9e-05,3.2e-05,2e-05,9e-06,1.3e-05,1.9e-05,2.1e-05,2.5e-05,1.2e-05,1.4e-05,1.5e-05,1.3e-05,1.7e-05,2.2e-05,2e-05,2.6e-05,1.1e-05,2.4e-05,1.1e-05,4e-06,1.7e-05,3.3e-05,1.1e-05,1.2e-05,1.9e-05,5e-06,1.3e-05,1.2e-05,8e-06,4e-06,2.4e-05,4e-06,2.2e-05,2.2e-05,2.2e-05,4e-06,1.7e-05,6e-06,1.4e-05,7e-06,1.1e-05,1.7e-05,3.5e-05,2.9e-05,1.6e-05,1e-05,2e-05,1.5e-05,1.6e-05,7e-06,7e-06,1.7e-05,1e-05,1.4e-05,1.3e-05,1.4e-05,7e-06,2.8e-05,2e-05,2e-06,1.1e-05,2.1e-05,1e-05,5e-06,1.1e-05,2e-06,5e-06,9e-06,1.1e-05,1e-05,1.5e-05,1e-05,1.3e-05,7e-06,1.3e-05,8e-06,8e-06,2.1e-05,1.8e-05,1.6e-05,1e-05,8e-06,1.9e-05,1.5e-05,1.6e-05,1.3e-05,4e-06,2.3e-05,1.9e-05,1.7e-05,1.9e-05,1.2e-05,1.5e-05,1.8e-05
2e-06,4e-06,4e-06,1e-06,4e-06,6e-06,1e-06,3e-06,2e-06,4e-06,6e-06,8e-06,6e-06,8e-06,3e-06,4e-06,7e-06,1e-06,7e-06,1.2e-05,7e-06,6e-06,8e-06,7e-06,4e-06,1e-05,2.1e-05,8e-06,3.1e-05,2.8e-05,2e-05,7e-06,1.2e-05,1.4e-05,2.7e-05,2.4e-05,1.5e-05,1.9e-05,1.2e-05,8e-06,6e-06,5e-06,1e-05,7e-06,1.3e-05,3.1e-05,1.1e-05,2e-05,4e-06,1.5e-05,9e-06,2.4e-05,1.9e-05,3e-06,1.5e-05,1.1e-05,9e-06,2.5e-05,2.7e-05,2.5e-05,2.3e-05,9e-06,1.3e-05,1.7e-05,7e-06,1.4e-05,8e-06,1e-05,1.6e-05,1.1e-05,2.9e-05,1.4e-05,7e-06,1.7e-05,1.6e-05,7e-06,4e-06,6e-06,2.1e-05,1.2e-05,1.1e-05,5e-06,1.9e-05,1.1e-05,2.1e-05,1.3e-05,1.6e-05,1.2e-05,1.6e-05,5e-06,1.8e-05,1.6e-05,1.9e-05,2e-06,3e-06,2e-06,1e-05,8e-06,2e-06,6e-06,4e-06,8e-06,9e-06,1.1e-05,1.6e-05,2e-06,0,9e-06,3e-06,1.1e-05,1e-06,1.6e-05,2.6e-05,2.7e-05,2.7e-05,1.3e-05,1e-06,2.1e-05,1.2e-05,1.7e-05,1.8e-05
1e-06,2e-06,6e-06,2e-06,4e-06,2e-06,2e-06,2e-06,2e-06,4e-06,6e-06,1e-05,4e-06,5e-06,2e-06,3e-06,5e-06,2e-06,6e-06,3e-06,6e-06,1.1e-05,9e-06,4e-06,1e-05,4e-06,1.7e-05,2.3e-05,1.6e-05,1.1e-05,4e-06,4e-06,6e-06,1.5e-05,2e-05,1.8e-05,9e-06,5e-06,1.2e-05,1e-05,2e-06,4e-06,3e-06,6e-06,4e-06,1.2e-05,1.8e-05,0,6e-06,8e-06,2e-06,1.2e-05,1e-05,3e-06,9e-06,1e-06,9e-06,8e-06,2.5e-05,2.1e-05,2e-06,6e-06,1.7e-05,1.8e-05,4e-06,8e-06,1.1e-05,2e-05,1.4e-05,1.8e-05,2e-05,1.2e-05,1.3e-05,1.1e-05,7e-06,1.4e-05,5e-06,1e-05,1.4e-05,2e-06,3e-06,5e-06,1.2e-05,8e-06,1.1e-05,1e-05,3e-06,1.1e-05,1.2e-05,7e-06,1e-05,5e-06,1.4e-05,1.4e-05,5e-06,2e-06,1.3e-05,3e-06,4e-06,5e-06,5e-06,7e-06,1e-05,1.2e-05,6e-06,8e-06,3e-06,7e-06,7e-06,5e-06,2e-06,1.7e-05,1.1e-05,1.1e-05,1.5e-05,1.1e-05,4e-06,1.8e-05,1.3e-05,4e-06,6e-06
1e-06,2e-06,5e-06,1e-06,3e-06,4e-06,2e-06,1e-06,2e-06,3e-06,3e-06,7e-06,2e-06,4e-06,3e-06,2e-06,5e-06,3e-06,3e-06,4e-06,7e-06,4e-06,6e-06,8e-06,6e-06,4e-06,8e-06,6e-06,1.6e-05,3e-06,2e-06,3e-06,1.1e-05,2e-06,2.2e-05,8e-06,9e-06,8e-06,5e-06,4e-06,5e-06,3e-06,1.2e-05,1.1e-05,7e-06,4e-06,1e-05,9e-06,8e-06,1e-06,3e-06,1.3e-05,5e-06,5e-06,1e-06,4e-06,5e-06,9e-06,1.9e-05,1.2e-05,6e-06,1.2e-05,1e-05,9e-06,7e-06,9e-06,1.1e-05,9e-06,1.1e-05,7e-06,7e-06,5e-06,7e-06,8e-06,1.6e-05,9e-06,3e-06,6e-06,2e-06,4e-06,3e-06,3e-06,9e-06,4e-06,7e-06,8e-06,5e-06,4e-06,8e-06,1.1e-05,1e-05,1.2e-05,9e-06,8e-06,3e-06,3e-06,6e-06,1e-06,3e-06,8e-06,3e-06,5e-06,9e-06,9e-06,7e-06,7e-06,8e-06,4e-06,7e-06,1e-05,4e-06,8e-06,9e-06,4e-06,1.7e-05,8e-06,8e-06,7e-06,1e-06,5e-06,8e-06
0,3e-06,4e-06,0,1e-06,2e-06,2e-06,0,3e-06,1e-06,4e-06,5e-06,1e-06,6e-06,1e-06,2e-06,3e-06,3e-06,1e-06,1e-06,4e-06,4e-06,6e-06,5e-06,3e-06,3e-06,4e-06,8e-06,1.3e-05,2e-06,1e-06,1e-06,1.3e-05,4e-06,1.3e-05,8e-06,2e-06,4e-06,4e-06,3e-06,8e-06,2e-06,7e-06,1e-05,1e-06,1e-05,9e-06,6e-06,7e-06,4e-06,1e-06,1.2e-05,1e-05,3e-06,4e-06,1e-06,3e-06,1e-05,1.4e-05,9e-06,3e-06,7e-06,1.1e-05,9e-06,3e-06,7e-06,9e-06,7e-06,5e-06,1.3e-05,5e-06,4e-06,2e-06,4e-06,1e-05,6e-06,3e-06,6e-06,6e-06,2e-06,1e-06,3e-06,4e-06,3e-06,8e-06,3e-06,8e-06,5e-06,1.2e-05,1.2e-05,1e-06,5e-06,8e-06,2e-06,3e-06,2e-06,5e-06,1e-06,2e-06,4e-06,2e-06,5e-06,7e-06,7e-06,4e-06,5e-06,4e-06,2e-06,6e-06,6e-06,3e-06,4e-06,6e-06,6e-06,8e-06,2e-06,4e-06,2e-06,3e-06,1e-06,3e-06
0,3e-06,4e-06,1e-06,1e-06,3e-06,3e-06,2e-06,2e-06,1e-06,4e-06,5e-06,1e-06,6e-06,1e-06,1e-06,2e-06,3e-06,1e-06,2e-06,5e-06,5e-06,6e-06,7e-06,1e-06,3e-06,2e-06,8e-06,1.1e-05,2e-06,1e-06,1e-06,1.2e-05,3e-06,1.1e-05,7e-06,2e-06,2e-06,1e-06,3e-06,7e-06,2e-06,5e-06,8e-06,2e-06,1e-05,7e-06,6e-06,6e-06,3e-06,1e-06,9e-06,9e-06,2e-06,5e-06,2e-06,5e-06,9e-06,1.3e-05,8e-06,4e-06,5e-06,1e-05,9e-06,4e-06,7e-06,9e-06,5e-06,2e-06,1e-05,3e-06,4e-06,1e-06,3e-06,1.1e-05,7e-06,3e-06,4e-06,4e-06,3e-06,1e-06,3e-06,2e-06,1e-06,6e-06,3e-06,5e-06,6e-06,9e-06,8e-06,4e-06,5e-06,9e-06,4e-06,3e-06,1e-06,6e-06,1e-06,4e-06,5e-06,1e-06,5e-06,8e-06,7e-06,5e-06,4e-06,2e-06,2e-06,5e-06,7e-06,5e-06,4e-06,6e-06,7e-06,6e-06,2e-06,1e-06,3e-06,2e-06,1e-06,5e-06
0,3e-06,4e-06,1e-06,1e-06,2e-06,2e-06,0,2e-06,1e-06,4e-06,5e-06,1e-06,6e-06,1e-06,1e-06,3e-06,3e-06,1e-06,2e-06,5e-06,4e-06,5e-06,6e-06,1e-06,3e-06,2e-06,7e-06,1.1e-05,3e-06,1e-06,0,1e-05,3e-06,1.1e-05,6e-06,2e-06,3e-06,1e-06,3e-06,6e-06,0,5e-06,8e-06,1e-06,1.1e-05,4e-06,3e-06,5e-06,3e-06,1e-06,9e-06,8e-06,0,5e-06,1e-06,5e-06,9e-06,1.3e-05,7e-06,5e-06,4e-06,1e-05,9e-06,4e-06,6e-06,8e-06,5e-06,1e-06,1e-05,4e-06,4e-06,1e-06,2e-06,1e-05,8e-06,2e-06,2e-06,4e-06,3e-06,2e-06,3e-06,1e-06,2e-06,7e-06,3e-06,6e-06,6e-06,8e-06,8e-06,3e-06,7e-06,8e-06,5e-06,2e-06,1e-06,5e-06,0,4e-06,4e-06,2e-06,6e-06,6e-06,8e-06,4e-06,4e-06,2e-06,1e-06,4e-06,6e-06,4e-06,5e-06,6e-06,7e-06,5e-06,1e-06,1e-06,4e-06,1e-06,1e-06,5e-06
