4.3e-05,2.7e-05,6.8e-05,0.000124,6.7e-05,9.4e-05,1.8e-05,2.5e-05,3.6e-05,0.000103,0.000394,0.000875,4.9e-05,4.7e-05,0.000629,0.000163,0.000264,5.4e-05,0.000448,0.000181,7e-06,6.6e-05,8e-06,7.3e-05,1.3e-05,3.9e-05,0.000281,0.000146,1.7e-05,0.000131,0.000111,7.3e-05,5.1e-05,3.9e-05,9.5e-05,0.000154,0.000424,0.000105,0.000375,0.000205,0.000151,0.000152,8.1e-05,4.3e-05,6.2e-05,7e-06,2e-06,1e-05,1.3e-05,2e-06,3e-06,2e-06,8.5e-05,0,3.8e-05,2.4e-05,1e-05,0.000162,6.4e-05,9e-06,0.000147,2e-05,6.2e-05,9e-06,2.9e-05,2.1e-05,5.5e-05,5.8e-05,8e-06,6e-06,7e-05,0.000224,0.000173,5e-05,2.6e-05,3.6e-05,0.000114,7e-05,0.000264,4.5e-05,2.7e-05,8.5e-05,5.4e-05,1.2e-05,5e-06,3.4e-05,3.7e-05,1.8e-05,4.3e-05,7e-06,1e-05,5.6e-05,2.5e-05,2.6e-05,6.1e-05,3.7e-05,0.000431,0.001132,0.00055,4.9e-05,0.000106,0.000154,0.000216,4.1e-05,7.4e-05,4e-05,2.3e-05,2e-05,8.3e-05,1.4e-05,1.4e-05,1.4e-05,2.7e-05,5.4e-05,5.6e-05,3.4e-05,4.1e-05,8.6e-05,6.5e-05,6.2e-05,1.3e-05
0.000198,0.000102,0.00011,0.000133,0.000262,0.000212,0.000345,0.000246,0.000142,0.000185,0.000533,0.002244,0.001304,0.000512,0.000145,0.000612,0.000114,0.000123,0.000777,0.000141,0.000171,0.000189,0.000203,0.000153,0.000145,0.00013,0.000665,0.000462,0.000573,0.000541,0.000321,0.000337,0.000252,0.000141,0.000325,0.001061,0.00067,0.000662,0.000553,0.000401,0.000431,0.000798,0.000139,0.000104,9.1e-05,0.000106,8.9e-05,3.6e-05,1.4e-05,4e-05,5.2e-05,7.4e-05,0.000164,0.000106,0.000212,6.3e-05,8.4e-05,0.000366,5.9e-05,0.000117,0.000457,0.000272,0.000243,0.000184,0.000134,7.1e-05,0.000136,3.5e-05,5.8e-05,3.2e-05,0.000127,0.000684,0.000525,8.3e-05,0.00013,0.000139,0.000202,0.000137,0.000458,0.000565,0.000459,0.000177,0.00021,0.000376,0.000216,8.1e-05,6.8e-05,0.000122,5.5e-05,0.00011,0.000176,0.000135,0.000155,0.000194,0.000111,0.000124,0.000838,0.00278,0.000927,0.001403,0.000868,0.000357,0.000272,0.000339,0.000228,0.000195,0.000147,0.000196,0.000146,0.000122,9.4e-05,6.5e-05,0.000115,9.5e-05,0.000199,0.000166,0.000156,0.000275,7.8e-05,0.000202,0.000192
0.000191,6.7e-05,1.6e-05,4.6e-05,4e-05,7e-05,3e-04,7.2e-05,5.7e-05,0.00011,0.000334,0.001813,0.002903,0.002005,0.001725,0.000255,0.000242,0.000153,0.000915,0.000236,0.000181,9.8e-05,0.000126,0.000105,4.4e-05,8.4e-05,0.000925,0.001643,0.000876,0.000345,0.00019,7.9e-05,9.1e-05,3.2e-05,0.000283,0.001083,0.000956,0.000542,2.2e-05,0.00012,0.000118,0.000588,0.000493,3.4e-05,2.5e-05,8.9e-05,6.8e-05,4.6e-05,2e-06,5.1e-05,6e-05,7.2e-05,7e-05,2.4e-05,0.000171,7.7e-05,9.4e-05,0.000293,5.5e-05,0.000179,0.000595,0.000306,0.00012,0.00011,7.1e-05,1.7e-05,6.7e-05,5.2e-05,2.6e-05,2.3e-05,5.3e-05,0.000769,0.000321,0.00022,4.3e-05,0.000207,0.000175,0.000142,0.000292,0.000303,0.000146,0.000225,0.00068,8e-05,9e-05,1e-04,9.2e-05,0.000111,0.000182,0.00026,3.3e-05,6.4e-05,4.3e-05,8e-05,3.4e-05,5.2e-05,0.001151,0.003291,0.00065,0.000744,0.000279,0.00027,0.000118,0.000115,5.4e-05,0.000114,7.3e-05,0.000104,5.9e-05,8.1e-05,2.5e-05,3.6e-05,0.000105,2.8e-05,0.000128,5.2e-05,2.3e-05,8.9e-05,0.000109,0.000176,4.9e-05
0.000328,0.000326,0.000126,0.000133,1.2e-05,3.2e-05,0.000249,0.000108,9e-05,0.000246,5.5e-05,0.001057,0.003401,0.00161,0.00255,0.001165,0.000778,0.00016,0.001265,0.000511,7.2e-05,7.2e-05,0.000106,8.3e-05,0.000126,5.9e-05,0.001105,0.00252,0.001357,0.00031,0.000166,0.000142,0.000134,7.2e-05,0.000273,0.000487,0.000933,0.001506,0.000855,0.000438,0.000138,0.000588,0.000399,0.000301,0.000132,1e-04,0.000121,0.000113,6.3e-05,8.7e-05,5.4e-05,0.000111,5.5e-05,0.000103,0.000124,5.7e-05,8.1e-05,0.000275,3.6e-05,0.00022,0.000536,0.000284,0.000175,0.000175,0.00015,7.5e-05,1.4e-05,5.3e-05,5.8e-05,5e-05,4.4e-05,0.000993,0.001295,0.00031,0.000112,0.00022,0.000112,4.1e-05,0.000155,6.9e-05,0.000142,0.000765,0.001015,0.000871,0.000557,0.000331,0.000224,0.000172,0.000161,0.000107,3.1e-05,6.5e-05,0.000158,8.5e-05,0.000129,7.8e-05,0.001409,0.005641,0.002345,0.00046,0.000191,0.000217,0.000102,8.2e-05,7.1e-05,0.000138,0.000108,0.000121,4.6e-05,6.5e-05,8.5e-05,5.1e-05,3.2e-05,4.2e-05,8.8e-05,0.000117,5.8e-05,0.000106,0.000264,7.7e-05,2.7e-05
0.000331,0.00018,0.000147,8.4e-05,0.000134,0.000153,0.000262,1.3e-05,7.1e-05,0.000219,0.000919,0.00183,0.001947,0.001597,0.000974,0.00056,0.000101,0.000252,0.00189,0.000601,0.000418,0.000213,0.000164,8.6e-05,8.1e-05,0.000106,0.001856,0.001206,0.000559,0.000287,7e-05,0.000105,7.1e-05,7.5e-05,0.000265,0.00026,0.000805,0.00082,0.000451,0.000223,7.6e-05,0.000684,0.000187,8.4e-05,0.000173,0.000208,0.00016,0.000179,6.2e-05,0.000107,9.7e-05,0.000128,6.5e-05,0.00014,0.000228,0.00011,0.000153,0.00032,9.1e-05,8.9e-05,0.000639,0.000315,0.000187,6.3e-05,5.9e-05,4.3e-05,6.1e-05,0.000136,8.7e-05,1.4e-05,9.7e-05,0.001374,0.000431,0.000229,0.000108,9.1e-05,0.000193,0.00018,0.000153,0.000123,6.9e-05,0.001602,0.000309,0.000144,0.000142,0.000104,0.000377,0.000185,0.000222,0.000223,0.000118,3.7e-05,0.000197,2.3e-05,0.000162,9.7e-05,0.001682,0.007068,0.004151,0.002724,0.00062,0.000262,5.3e-05,3.3e-05,8.2e-05,5.7e-05,5.7e-05,6.3e-05,9.1e-05,5.8e-05,6.2e-05,6.9e-05,6.2e-05,3.9e-05,1.3e-05,6.2e-05,1.6e-05,0.000299,0.000181,5.1e-05,3.5e-05
0.000518,0.000186,0.000134,0.000167,3.6e-05,0.000101,0.000151,4.3e-05,8.7e-05,0.000312,0.001787,0.002495,0.002208,0.002786,0.001859,0.000604,0.000259,0.000131,0.002703,0.001854,0.000428,0.00025,9.7e-05,4.3e-05,1e-04,7.1e-05,0.002421,0.003017,0.001358,0.000431,0.000298,0.000173,0.000299,5.5e-05,5e-04,0.000302,0.000326,0.000295,0.000433,0.000158,6.8e-05,0.000787,0.000579,0.000237,7.7e-05,7.1e-05,6.7e-05,6.8e-05,4.8e-05,0.000174,6.2e-05,0.000129,9.5e-05,0.000162,0.000125,0.00013,0.000113,0.000457,8.2e-05,7.4e-05,0.000672,0.000541,0.000398,2.9e-05,7.1e-05,7e-05,5.2e-05,0.000143,0.000256,0.000173,4.1e-05,0.002066,0.003943,0.001531,0.000828,0.000307,0.000289,3e-05,0.000265,0.000212,8.2e-05,0.002353,0.000548,0.000247,0.000134,0.000377,0.000395,0.000196,0.000191,0.000154,2.9e-05,2.8e-05,0.000154,0.000219,0.000129,0.000139,0.001776,0.006356,0.004479,0.004101,0.001497,0.000285,0.000223,0.000204,0.000175,7.8e-05,7.6e-05,0.000134,0.000159,5.9e-05,4.9e-05,5.5e-05,5.6e-05,4.9e-05,2e-05,4.7e-05,6.3e-05,0.000572,0.000191,3.3e-05,6.1e-05
0.000524,3.6e-05,7.6e-05,6e-05,7.7e-05,8.1e-05,0.000466,4.1e-05,0.000303,0.00012,0.002174,0.003585,0.003256,0.005161,0.002155,0.001131,0.000412,6.8e-05,0.003188,0.001288,0.000689,0.000346,0.000109,6.8e-05,0.000127,4.8e-05,0.002625,0.00464,0.004098,0.002407,0.001089,0.00035,0.000439,0.000515,0.000784,0.000493,0.000493,0.002607,0.001435,0.000695,0.000414,0.00085,0.00023,0.000298,0.000203,0.000213,8.1e-05,0.000114,5.2e-05,0.000211,0.00017,0.000338,4.8e-05,0.000267,0.000148,0.000209,0.00017,0.000598,8.7e-05,0.000107,0.000287,0.000968,0.000163,0.000273,0.000152,6.2e-05,4.8e-05,0.000136,0.000314,0.000119,7.7e-05,0.003027,0.004792,0.003059,0.001284,0.000696,0.000135,0.000147,0.000454,3.3e-05,0.000139,0.002838,0.001404,0.000733,0.000405,0.000723,0.000694,3e-04,0.000202,0.00018,5.7e-05,0.000116,0.000206,0.000315,0.000192,0.00014,0.001857,0.001892,0.002155,0.002155,0.00066,0.000462,0.000394,0.000514,0.000351,0.000248,2.2e-05,0.000126,9.4e-05,9.4e-05,0.000105,4.9e-05,3.7e-05,9.3e-05,2.9e-05,5.5e-05,1.6e-05,0.000821,0.000223,8.2e-05,6.7e-05
0.000736,0.000692,0.000362,0.000136,5.6e-05,1.4e-05,0.000666,0.000615,0.000404,0.000684,0.00281,0.004617,0.011376,0.011662,0.00747,0.003236,0.001335,0.000383,0.00347,0.006512,0.004084,0.001704,0.000392,0.000269,0.000254,0.000199,0.002494,0.006086,0.002376,0.001414,0.00111,0.000415,0.000108,0.000354,0.000645,0.000434,0.001748,0.004983,0.002562,0.000498,0.000347,0.000795,0.001494,0.000549,0.000564,0.000362,0.000169,0.000181,0.000221,0.00047,0.000171,0.000322,0.000646,0.00048,0.000359,0.000262,0.000212,0.001041,0.000815,0.000731,0.000469,0.001117,0.000959,0.000597,0.000165,0.000221,8.8e-05,0.000174,0.000196,0.000147,8e-05,0.003996,0.006912,0.003394,0.001044,0.000167,0.00033,0.00035,0.000819,0.000596,0.000318,0.002925,0.00469,0.002482,0.000592,0.001263,0.001139,0.000696,0.000265,0.000524,0.000497,0.000193,0.000384,0.000124,0.000652,0.000277,0.002051,0.007951,0.005832,0.003644,0.002974,0.001164,0.000521,0.000844,0.000959,0.001087,0.000609,0.000259,0.00041,0.000141,8.5e-05,8.3e-05,3.2e-05,0.000116,0.000149,0.000106,8e-05,0.001061,0.000661,0.000318,9e-05
0.002154,0.001055,0.000326,0.000188,0.000213,7.6e-05,0.000576,0.000744,0.000922,0.000281,0.003132,0.00523,0.008904,0.002614,0.000887,0.00181,0.001984,0.001054,0.003747,0.008996,0.004606,0.001807,0.000389,0.000155,4.1e-05,9.6e-05,0.002332,0.008919,0.005838,0.004927,0.001652,0.000355,8e-05,0.000256,0.000841,0.000944,0.002563,0.008689,0.004871,0.002778,0.000952,0.001467,0.00275,0.001995,0.000809,0.000198,0.000493,0.000481,0.00046,0.00037,0.000351,0.000313,8e-04,0.000585,0.000838,0.000908,0.000955,0.001818,0.001883,0.000567,0.001371,0.001961,0.000926,0.000264,8e-05,0.00031,0.000434,0.000134,6.1e-05,5.9e-05,0.000101,0.0049,0.00907,0.005794,0.002386,0.000561,0.000115,0.000232,0.000478,0.000463,0.000295,0.002394,0.005597,0.002468,0.000839,0.001605,0.00152,0.000392,0.000532,6e-04,0.00051,0.00029,0.000458,0.000404,0.001134,0.001142,0.002405,0.012695,0.006321,0.007443,0.00505,0.002823,0.000845,0.000946,0.000158,0.000544,0.00046,0.000157,0.000556,0.00041,0.00021,0.000126,5.1e-05,7.9e-05,0.000122,0.000136,8e-05,0.001072,0.000315,0.000886,0.000391
0.000886,0.000471,0.000383,8.9e-05,0.000246,0.000318,0.000138,0.000321,0.000436,0.000629,0.002997,0.004024,0.010644,0.012659,0.009385,0.006084,0.003343,0.001467,0.00342,0.005793,0.002834,0.00085,6.1e-05,0.000238,0.000257,0.000172,0.002385,0.006796,0.002742,0.002699,0.001911,0.000917,0.000251,0.000202,0.000442,0.000768,0.002239,0.010417,0.005802,0.002378,0.000733,0.001318,0.002221,0.000822,0.000225,0.000655,0.00073,0.000468,0.000392,0.00052,0.000353,0.000452,0.000444,0.000389,0.000643,0.000522,0.000309,0.000921,0.000751,0.001036,0.002651,0.002434,0.001196,0.000232,0.000118,0.000323,0.000258,0.000321,0.000206,9.8e-05,0.000101,0.005157,0.002218,0.001415,0.000976,9e-05,0.000304,0.000491,0.000412,0.000344,0.000136,0.001735,0.003987,0.002736,0.001388,0.001883,0.00159,0.000957,0.000307,0.000248,0.000563,0.000456,0.000447,0.000454,0.000732,0.000828,0.002698,0.008944,0.006106,0.006075,0.001563,0.000688,0.001099,0.001192,0.001284,0.000498,0.000249,0.000122,0.000533,0.000521,0.000241,0.000135,0.000181,2e-04,3.2e-05,0.000145,9.8e-05,0.000943,0.00122,0.00126,0.000853
0.000174,0.000253,3.7e-05,9.9e-05,0.000173,0.000203,0.000409,0.000395,0.000551,0.000302,0.00331,0.002129,0.003776,0.003958,0.002192,0.000944,0.000965,0.000485,0.003018,0.001525,0.000898,0.000379,2e-04,0.000138,1.2e-05,7.1e-05,0.002224,0.002354,0.002896,0.001505,0.000372,0.000169,0.000109,0.00022,0.000451,0.000411,0.002806,0.006044,0.003921,0.00136,0.000511,0.001248,0.000622,0.000499,5.3e-05,0.000307,0.000213,0.000289,7.5e-05,0.000257,5.3e-05,0.000114,0.000425,0.000606,0.000591,0.000303,0.00032,0.000557,9.3e-05,0.000616,0.001603,0.000686,0.000388,0.000278,0.000225,7.5e-05,0.000124,5.7e-05,6.1e-05,3e-05,0.000128,0.004436,0.003307,0.000743,0.000109,0.000261,6e-05,0.000207,0.000217,4.4e-05,6.1e-05,0.001814,0.001645,0.000387,0.00018,0.001016,0.00029,8.3e-05,0.000204,0.000263,0.00038,0.000168,8.4e-05,0.000153,0.000675,9.9e-05,0.002125,0.002019,0.004998,0.002072,0.001151,5e-04,0.000306,0.000906,0.000762,0.000584,0.000212,0.000273,0.000362,0.000107,8e-05,6.9e-05,0.000155,0.000205,0.000146,7.9e-05,9.1e-05,0.000734,0.001465,0.001459,0.000647
0.000218,5.9e-05,4.4e-05,7.3e-05,0.000123,0.000208,0.00029,0.000209,0.000221,0.000149,0.003332,0.000697,0.001163,0.002618,0.001743,0.001106,0.000238,7.4e-05,0.002296,0.000346,7.6e-05,6.2e-05,5e-05,2.4e-05,5e-05,9.3e-05,0.001346,0.002184,0.001142,0.000631,0.000117,0.000117,0.000132,7.3e-05,0.000388,7.5e-05,0.002228,0.001351,0.000234,0.000343,9.9e-05,0.001327,0.000509,0.000249,8e-05,0.000155,6e-05,0.000204,0.000149,6.1e-05,2.2e-05,0.000135,0.000321,0.000138,0.000345,0.00019,0.000234,0.000184,0.000133,0.000207,0.000837,0.000183,0.000119,6.3e-05,4.2e-05,5.5e-05,5.3e-05,5.3e-05,1.6e-05,3.7e-05,5e-05,0.002711,0.001025,0.000603,0.000153,7.6e-05,5.1e-05,0.000222,0.000126,8.3e-05,3.2e-05,0.001959,0.000249,0.000191,4.4e-05,0.000551,0.000251,9.6e-05,4.5e-05,0.000295,5.7e-05,6e-05,6.6e-05,0.000126,0.00022,0.000167,0.00188,0.003102,0.004002,0.001584,0.000615,0.000146,0.000164,0.00023,0.000577,0.000191,0.000174,0.00022,0.00016,3e-05,9e-06,2.9e-05,1e-04,6.6e-05,3.3e-05,7.2e-05,7e-06,0.00048,0.000556,0.000298,5.4e-05
0.000261,0.000176,9.6e-05,0.000106,0.000143,0.000275,0.000452,0.000172,0.000297,0.000392,0.002521,0.00157,0.001655,0.001528,0.000817,0.000286,0.000194,3.8e-05,0.001558,0.000672,0.000516,9.6e-05,5.3e-05,9.2e-05,4.5e-05,5e-05,0.000395,0.000967,0.000549,0.000239,0.000113,6.9e-05,5.3e-05,3.7e-05,0.000355,0.00038,0.002152,0.001074,0.000701,0.00025,5.8e-05,0.000905,0.000363,0.000305,5e-05,0.000168,6.7e-05,0.000216,0.000117,5.5e-05,9.9e-05,0.000143,0.000291,0.000159,0.000357,0.000156,0.000385,0.000126,0.000237,0.000192,0.000561,0.000123,9.5e-05,6.1e-05,8.6e-05,8e-06,3.3e-05,5e-05,2.2e-05,7.3e-05,7.6e-05,0.001124,0.000932,0.000306,9.1e-05,3.3e-05,5.3e-05,0.000232,0.000193,0.000191,0.000172,0.001672,0.000133,2.3e-05,0.000142,0.000209,0.000144,0.000146,5.3e-05,0.00013,0.000132,2.6e-05,1.2e-05,8.3e-05,0.00034,7.5e-05,0.001874,0.001806,0.000532,0.000475,0.000395,0.000166,0.000214,0.000338,0.000359,0.000149,6.6e-05,0.000159,7.8e-05,4.3e-05,1.3e-05,4.5e-05,9.8e-05,4.5e-05,3e-05,2.6e-05,1.5e-05,0.00024,0.000239,8.2e-05,2.4e-05
0.000151,5.9e-05,0.00012,6.5e-05,0.000186,0.000296,0.000136,4e-05,0.000155,0.000166,0.002379,0.000995,0.001576,0.001546,0.000798,9.2e-05,0.000213,1.9e-05,0.000754,0.00066,0.000212,0.000206,0.000115,2.3e-05,6.1e-05,6.1e-05,0.000459,0.00029,0.000627,0.000192,0.000118,5.2e-05,6.9e-05,5.7e-05,0.000511,0.000392,0.00281,0.000867,0.000211,0.000242,2.2e-05,0.000295,0.000716,0.000281,0.000186,0.000121,5.9e-05,0.000212,4.5e-05,8.9e-05,0.000205,0.000158,0.000116,0.00025,0.000244,0.000227,0.000349,0.00022,6e-05,5.5e-05,0.000801,0.000127,0.000133,0.000137,0.000168,0.000115,3.4e-05,9e-06,2.6e-05,5.3e-05,6.9e-05,0.000691,0.000468,0.000369,5.2e-05,7.1e-05,0.000113,0.000257,0.000152,0.000193,0.000131,0.001108,0.001213,0.000489,0.000154,0.000165,0.000333,0.000116,0.000137,3.6e-05,5.6e-05,0.000191,0.000146,9.1e-05,0.000278,0.000411,0.00162,0.000489,0.00106,0.000748,0.000479,0.000386,0.000169,0.000379,0.000451,0.000115,7.9e-05,0.000129,0.00013,2.5e-05,3.1e-05,2.2e-05,7.9e-05,0.000124,0.000119,7e-05,5.4e-05,0.00019,0.000533,8.7e-05,3.9e-05
0.000254,0.000146,0.000113,0.000194,0.000317,0.000109,0.000141,9.4e-05,0.000174,0.000337,0.002616,0.001409,0.001049,0.001056,0.000407,0.000661,0.000399,0.000283,0.000263,0.000484,0.000216,9.3e-05,9.2e-05,0.000117,0.000118,0.000122,0.000801,0.000316,0.001165,0.000435,0.000166,4.6e-05,7.3e-05,5.6e-05,0.000643,0.000241,0.003176,0.000456,0.00042,0.000265,0.000101,0.000597,0.000544,0.000337,6.6e-05,9.5e-05,2.4e-05,0.000196,9.3e-05,3.7e-05,0.00035,0.000316,0.000185,0.000232,0.000381,0.00035,0.000364,0.000543,0.000526,0.000326,0.000651,0.000795,0.000322,6.5e-05,0.000184,0.000137,3.1e-05,5.8e-05,7.8e-05,2.4e-05,8.1e-05,0.000195,0.001073,0.000703,0.000394,0.000138,6e-05,8.8e-05,6.9e-05,3.7e-05,5.6e-05,0.000358,0.001069,0.000715,0.000176,6.8e-05,0.000206,0.000184,0.000283,0.000175,4.1e-05,0.000126,1.1e-05,7.4e-05,6e-06,0.000346,0.001405,0.000461,0.003124,0.000618,0.00074,9.6e-05,0.000262,0.000471,0.000147,9.9e-05,1e-04,0.000197,0.000154,0.000104,8.3e-05,6.7e-05,5.9e-05,0.000117,6.7e-05,2e-05,1.6e-05,0.000277,0.000324,0.000327,0.000152
0.000223,8.5e-05,0.000189,2.7e-05,0.000127,0.000177,0.000156,4.3e-05,0.000164,0.00035,0.001914,0.00207,0.002421,0.000832,0.001332,0.000468,0.000176,0.000113,0.00077,0.000614,0.000379,0.000164,0.000152,0.000144,0.000128,8.2e-05,0.000782,0.001751,0.000792,0.000212,4.2e-05,0.000139,2.1e-05,1e-05,0.000587,0.000336,0.003097,0.002616,0.001335,0.000385,4.3e-05,0.001071,0.001219,0.000733,0.00028,9.9e-05,0.00011,0.00018,9.9e-05,0.000177,0.000218,0.000313,0.000227,0.000357,7.7e-05,0.00024,0.000375,0.000159,0.00027,8.3e-05,0.000293,0.000312,0.000227,0.000177,0.000172,7.4e-05,8.9e-05,7.2e-05,9.3e-05,6e-05,6.7e-05,0.000629,0.000971,0.000557,0.000186,5.2e-05,7.2e-05,0.000185,0.000142,6e-05,5e-05,0.000607,0.001003,0.000563,0.00019,0.000492,0.00037,0.000176,0.000258,2.5e-05,6.8e-05,4.1e-05,0.000106,9e-06,0.000132,0.000289,0.001128,0.001673,0.00439,0.003453,0.001,5.2e-05,0.000234,4.6e-05,0.000127,7.6e-05,0.000253,0.000307,7.6e-05,5e-05,5.5e-05,4.1e-05,0.000115,0.000118,6.9e-05,4e-05,2e-05,0.000312,0.000184,0.000176,7.2e-05
0.000222,0.000185,0.000124,0.000161,0.000218,0.000286,0.000603,0.000316,0.000308,0.000166,0.001209,0.001014,0.001878,0.001255,0.001076,0.000799,0.000222,0.000142,0.001174,0.00113,0.000516,0.000102,2e-05,5.8e-05,0.000173,7.1e-05,0.000119,0.001579,0.001012,0.000644,7e-05,7.4e-05,0.000119,0.000105,0.000504,0.000287,0.002369,0.002616,0.001297,0.000158,0.000114,0.001285,0.001182,0.000466,0.000183,3.7e-05,5.3e-05,0.000173,0.000164,4.4e-05,0.000187,0.000148,0.000195,0.000696,0.000555,0.000142,0.000314,0.000287,0.000484,0.000508,0.000351,0.000283,9.7e-05,8.7e-05,0.000216,0.00014,7.1e-05,3e-05,0.000103,6.1e-05,0.000106,0.000981,0.001435,0.000683,0.000273,0.000106,7e-06,0.000271,0.000165,5.7e-05,6.4e-05,0.000512,0.000542,0.000332,0.000119,0.000957,0.00025,5.6e-05,0.000131,0.000207,1.8e-05,5.4e-05,0.000119,0.000165,0.000182,0.000179,0.000937,0.002256,0.002548,0.001963,0.001101,0.000189,0.000161,0.000182,0.000294,0.000203,0.000323,0.000123,6.4e-05,5.1e-05,1.8e-05,4.5e-05,7e-05,6.9e-05,5.1e-05,6.3e-05,6.6e-05,0.00024,0.000193,9.8e-05,7.1e-05
4e-04,0.000165,0.000269,0.000275,0.000224,0.000166,0.000577,0.000715,0.000535,0.000469,0.000159,0.001243,0.000508,0.000291,0.000249,8e-05,0.000272,0.000174,0.00107,0.001103,0.000468,0.000204,0.000191,0.000132,0.000109,5.4e-05,0.001022,0.001767,0.001511,0.000473,9.2e-05,0.000102,2e-05,4.3e-05,0.000637,0.000442,0.001204,0.00058,0.000504,0.000294,0.000131,0.001324,0.000948,0.000302,0.000169,0.000136,8.9e-05,0.000289,0.000205,0.000152,7.2e-05,0.00046,0.000158,0.000486,4e-05,0.000288,0.000192,0.000622,0.000184,0.000321,0.000225,0.000356,0.000232,6.9e-05,0.00015,5.4e-05,7e-05,8.6e-05,3.1e-05,3.9e-05,0.000124,0.000401,0.002086,0.001171,3e-04,7.1e-05,6.8e-05,0.000162,4.2e-05,0.000172,0.000161,0.000297,0.000906,0.000476,0.000192,0.001343,0.000945,0.000472,0.000341,0.000119,0.000164,3.7e-05,6e-05,0.000363,0.00027,0.000199,0.000312,0.002212,0.001948,0.000429,0.000204,0.000183,0.000237,0.000106,0.000152,0.000299,0.000127,9.3e-05,7.3e-05,5e-05,2.3e-05,5e-05,5.2e-05,4.1e-05,3.7e-05,5.8e-05,3.8e-05,7.6e-05,4.6e-05,0.00013,4.6e-05
0.000509,0.000144,5.3e-05,4.1e-05,6.4e-05,0.000224,0.000441,0.000239,0.000466,2.6e-05,0.000622,0.003953,0.003152,0.001425,0.001243,0.000704,0.000365,0.00041,0.000734,0.001003,0.000621,0.000197,0.00012,5e-05,8.3e-05,9.7e-05,0.002339,0.000342,0.000573,0.000365,0.000266,1.9e-05,8.8e-05,6.1e-05,0.000848,0.000265,0.000364,0.001246,0.000342,0.000152,0.000116,0.001467,7.5e-05,0.000383,0.000273,0.000158,8.1e-05,0.000454,1e-04,9.7e-05,0.000186,0.000608,0.000474,0.000424,0.000579,0.000617,0.000816,0.000771,0.00068,0.000596,0.000535,4e-04,4.2e-05,0.000101,7.6e-05,0.000133,0.000105,4.8e-05,5e-05,5.8e-05,3.8e-05,0.00067,0.001667,0.000703,0.000116,8.5e-05,0.000194,0.000147,0.000176,0.000165,7.6e-05,0.001524,0.000688,0.000309,0.00028,0.001471,0.000408,0.000147,9.3e-05,0.000203,0.000361,0.000223,6.8e-05,0.000301,9.6e-05,0.00049,0.000921,0.001423,0.002343,0.001468,0.000316,0.000268,0.000469,0.000299,0.000267,0.000139,0.00011,4.8e-05,0.000102,0.000146,3e-05,4.1e-05,5e-05,3.2e-05,1.5e-05,7.5e-05,5e-05,0.000106,0.000202,7e-05,1e-04
0.000384,0.000227,0.000448,0.000357,0.000109,0.000205,0.000363,0.00051,0.000408,0.000298,0.000626,0.00581,0.005183,0.003727,0.001013,0.000484,0.000607,0.000401,0.00023,0.001194,0.000898,0.000441,0.000123,4.3e-05,0.000137,0.000221,0.003094,0.002083,0.000478,0.000318,0.000434,0.000187,8.4e-05,3.3e-05,0.000937,0.000751,0.000785,0.001212,0.00078,0.00062,0.00028,0.001678,0.001132,0.000975,0.000421,0.000185,9e-05,0.000408,0.000395,0.000328,0.000304,0.000659,0.000575,0.000835,0.000856,0.000832,0.000897,0.000366,0.000548,0.000678,0.000315,0.00037,0.000255,0.000297,0.000209,0.000182,0.000144,0.000193,9.1e-05,6.5e-05,0.00013,0.001504,0.001636,0.000886,0.000331,0.000175,0.000234,3.3e-05,0.000191,0.00031,0.000125,0.002423,0.002293,0.001182,0.000523,0.001535,0.001335,0.000402,0.000197,0.000119,0.000195,0.000416,0.000231,8e-05,0.000303,0.000475,0.000308,0.001712,0.002859,0.002383,0.000784,0.000189,0.000253,9.4e-05,0.000251,0.000489,0.000303,0.000141,5e-05,0.000106,0.000102,4.4e-05,3.1e-05,8.9e-05,0.000104,0.000112,6.4e-05,0.000166,0.000282,0.000152,6.2e-05
0.000106,0.000386,0.00011,0.000282,0.000316,0.000235,0.000399,0.000275,0.000284,9.2e-05,0.000492,0.005597,0.001693,0.001229,0.000847,0.000476,4e-04,0.000206,0.000432,0.00046,0.000217,7.5e-05,7.9e-05,0.000136,0.000116,6.8e-05,0.003319,0.003708,0.002995,0.001334,0.000197,0.00014,0.000106,6.3e-05,0.000854,0.00061,0.001851,0.001318,0.000412,0.000558,0.000308,0.001979,0.000798,0.000105,9.1e-05,6e-05,0.000117,0.000232,0.000331,4.8e-05,0.00025,0.000663,0.000258,0.000871,0.000181,0.000636,8.6e-05,0.000307,0.000478,2.4e-05,1e-04,0.000479,0.00046,0.000183,0.000268,0.000211,7e-06,8.6e-05,0.000157,0.000164,5.6e-05,0.001725,0.001089,0.000521,9.1e-05,0.000113,0.000212,0.000378,0.000239,0.000351,0.000399,0.002417,0.001229,0.000448,0.000158,0.001576,0.001249,9e-04,0.000261,0.000191,8.2e-05,0.000332,0.000262,9.8e-05,0.000326,0.000164,0.000462,0.002347,0.002798,0.002073,0.001121,0.000333,0.000311,0.000206,0.00034,0.000789,0.000345,8.3e-05,0.000117,0.000168,9.1e-05,5.3e-05,3e-05,4.9e-05,9.1e-05,6.1e-05,4.5e-05,0.00021,0.000128,6.4e-05,3.3e-05
0.000234,9.8e-05,0.000262,5.1e-05,5.5e-05,0.00025,0.000173,0.000216,0.00031,0.000435,0.00014,0.003215,0.002794,0.001358,0.001556,0.000728,0.000232,0.00025,0.001055,0.001073,0.000265,0.00011,0.000149,4.7e-05,6.1e-05,8.2e-05,0.002852,0.00262,0.000218,0.000207,0.000305,7.9e-05,4.4e-05,8.5e-05,0.000524,0.000164,0.002258,0.002397,0.00113,0.000468,0.000251,0.001998,0.00148,0.000646,0.000237,0.00013,6.3e-05,0.000175,0.000136,0.000146,0.000279,0.000203,0.00011,0.000436,0.000329,0.000396,0.000505,0.000268,0.000117,0.00024,0.000103,0.000205,0.000389,0.000502,0.000206,6.5e-05,9.9e-05,7e-05,0.000159,3.6e-05,6.5e-05,0.001561,0.000398,0.000195,0.000132,3.7e-05,0.000138,0.000329,0.000238,0.000617,0.000307,0.002284,0.001093,0.000427,2.6e-05,0.001614,0.000486,0.000328,0.000272,0.000209,0.000101,9.2e-05,0.000185,0.000452,0.000257,0.000239,0.000357,0.002452,0.00435,0.002237,0.001281,0.000769,0.000296,0.000111,0.000153,0.000505,0.000341,0.000256,6.1e-05,6e-05,2.3e-05,2.6e-05,5.2e-05,7.8e-05,7e-05,5.2e-05,3.8e-05,0.00029,0.000207,3e-05,1.5e-05
0.000138,5.5e-05,8.3e-05,0.000129,0.000138,0.000108,0.000128,6.5e-05,7.5e-05,0.000183,0.000309,0.000439,0.000695,0.000634,0.001155,0.000881,0.00052,0.000151,0.000554,0.000558,0.000349,0.000173,6.7e-05,8.3e-05,9e-06,3.2e-05,0.001003,0.000258,0.000455,1e-04,2.5e-05,2e-05,7e-06,2.8e-05,0.000157,5.7e-05,0.001087,0.001035,0.000564,0.000206,0.000125,0.000834,0.001158,0.000568,0.000181,7.6e-05,8.3e-05,3.9e-05,5.2e-05,3.1e-05,7.2e-05,0.000138,2.9e-05,7.2e-05,1.7e-05,0.000145,0.000145,0.000248,0.00014,0.00021,0.000174,7.8e-05,0.000179,0.000144,0.000135,3.2e-05,3.5e-05,3.8e-05,2.8e-05,4.5e-05,5.7e-05,0.000708,0.00058,0.000221,7.1e-05,2.3e-05,4.9e-05,0.000111,3.1e-05,0.000279,0.00016,8e-04,0.000567,0.000235,6.2e-05,0.000712,0.000559,0.000273,0.000101,6.2e-05,1.4e-05,2.7e-05,0.000111,0.000167,9.8e-05,9.9e-05,0.000268,0.000919,0.000906,0.001272,0.000549,0.000193,0.00017,0.000154,0.00016,9.4e-05,7e-05,6.1e-05,6.9e-05,6.4e-05,3.6e-05,1.6e-05,2.3e-05,2.5e-05,3.4e-05,3.2e-05,1.1e-05,0.000124,3.1e-05,2.7e-05,1e-05
0.000101,5.2e-05,8.5e-05,9.4e-05,7.4e-05,8.6e-05,0.000117,0.000104,0.000115,0.000147,7.4e-05,0.000504,0.00054,0.001283,0.000817,0.000134,6.8e-05,4e-05,0.000478,0.000306,0.000219,7.9e-05,5.1e-05,1.5e-05,5.2e-05,2e-05,0.000551,0.000588,0.000176,9.2e-05,3.6e-05,2.1e-05,2.6e-05,4.7e-05,0.000118,0.000117,0.000866,0.000421,0.000118,5.2e-05,4.6e-05,0.000637,0.000687,0.00033,0.000106,3.5e-05,8e-06,5.3e-05,2.9e-05,4.8e-05,6e-05,0.000134,5e-05,6e-06,1.7e-05,9.9e-05,3.3e-05,5.8e-05,2.9e-05,0.000143,0.000112,0.000113,1.8e-05,3.7e-05,2.3e-05,4e-05,4.2e-05,8.7e-05,5.3e-05,4.6e-05,2e-05,0.000602,0.000305,1e-04,2.4e-05,3.4e-05,3.2e-05,8.1e-05,5.9e-05,0.000159,7e-05,0.000312,0.000122,8.9e-05,4.4e-05,0.000645,0.000414,0.000166,4e-05,4e-05,1.6e-05,5.8e-05,8.7e-05,7.1e-05,0.000188,0.000129,0.000216,0.000356,0.001372,0.001096,0.000503,0.000175,0.000106,7.8e-05,0.00016,6.4e-05,9.6e-05,7.7e-05,2.9e-05,5e-06,9e-06,1.3e-05,5e-06,3.3e-05,2.1e-05,2.6e-05,8e-06,8.2e-05,2.7e-05,3e-05,2.3e-05
5.2e-05,5.3e-05,4.2e-05,6.2e-05,8.4e-05,6.1e-05,0.000189,0.000111,2.6e-05,0.000124,0.000108,0.000139,0.000493,0.000547,0.000244,0.000242,8.3e-05,6.3e-05,0.000359,0.00025,0.000103,5e-05,3.8e-05,2.3e-05,3.7e-05,4.2e-05,0.000264,0.000414,0.000134,7.2e-05,9e-06,3e-06,2e-05,6.3e-05,8.4e-05,5.7e-05,0.000547,0.000116,3.7e-05,3.3e-05,1.2e-05,0.000532,0.000357,0.000214,5.4e-05,2.7e-05,3.8e-05,5.8e-05,4.2e-05,5.9e-05,2.4e-05,7.1e-05,4e-05,5.9e-05,7.8e-05,6e-05,7.6e-05,3.3e-05,1.9e-05,5.4e-05,2e-05,5.8e-05,4.9e-05,4.6e-05,1.6e-05,2.3e-05,2.9e-05,4.1e-05,1.7e-05,2.2e-05,3.4e-05,0.000488,0.000281,0.000126,3.3e-05,2e-05,1.2e-05,3.1e-05,3.4e-05,5.8e-05,4.5e-05,0.00014,0.000175,0.000114,8.2e-05,0.000451,0.000199,6.3e-05,4.9e-05,6.3e-05,1.8e-05,2.3e-05,6.7e-05,3.7e-05,0.000125,3.9e-05,0.000184,0.000181,0.000931,0.000633,0.000294,0.000134,1e-05,8.1e-05,8.2e-05,4.6e-05,4.4e-05,4e-06,1.6e-05,8e-06,1e-05,9e-06,1e-05,1.8e-05,2.9e-05,1.1e-05,1.2e-05,7.3e-05,2.8e-05,3.3e-05,1e-05
5.2e-05,3.1e-05,5.1e-05,7e-06,4.9e-05,4.6e-05,9.7e-05,4.6e-05,6.1e-05,0.000104,0.000124,0.000502,0.000271,0.000129,0.000144,0.000184,4.1e-05,7.5e-05,0.000223,0.000148,5.9e-05,2.4e-05,2.7e-05,3e-05,9e-06,2.2e-05,0.000228,0.000422,0.000256,7.3e-05,2.9e-05,1.9e-05,4e-06,5.1e-05,7.3e-05,3.2e-05,0.000273,0.000102,4.5e-05,3.1e-05,1e-05,0.000417,0.000268,7.1e-05,2.4e-05,4.8e-05,2.7e-05,1.4e-05,2.8e-05,1.7e-05,3.2e-05,4.9e-05,2.7e-05,5.7e-05,6e-05,4.2e-05,4.5e-05,5.7e-05,3.4e-05,2.8e-05,2e-05,3.3e-05,9e-05,1.4e-05,1.7e-05,8e-06,1.1e-05,2.6e-05,1.6e-05,3.1e-05,1.4e-05,0.000333,0.000175,8.7e-05,3.4e-05,1.9e-05,2.1e-05,1.7e-05,2.1e-05,4.2e-05,8e-06,0.000197,0.00012,4.2e-05,2.5e-05,0.00021,8e-05,3.9e-05,5.1e-05,1.4e-05,2.4e-05,5.8e-05,5.8e-05,5.5e-05,7.4e-05,1.5e-05,0.000208,0.000259,0.000273,0.000137,0.000105,9.6e-05,5.2e-05,6.3e-05,0.000112,1.9e-05,3.9e-05,3.8e-05,2.4e-05,2.6e-05,1.1e-05,8e-06,1.2e-05,5e-06,1.3e-05,7e-06,1.2e-05,6.3e-05,1.7e-05,2.4e-05,1.1e-05
2.6e-05,1.2e-05,5e-05,5e-06,6.4e-05,4.4e-05,4.9e-05,3.1e-05,9.3e-05,2.5e-05,0.000177,0.000476,0.000183,0.000319,0.000189,0.000141,6.2e-05,1.2e-05,0.000203,0.000108,7.4e-05,3.9e-05,1.1e-05,1.6e-05,1e-05,3e-05,0.000241,0.000262,0.000268,3.8e-05,3e-06,1.2e-05,6e-06,4.3e-05,9.1e-05,4e-05,0.000116,0.000204,7.8e-05,6.4e-05,8e-06,0.000276,4e-05,3.8e-05,1.2e-05,2.5e-05,2e-05,9e-06,2e-05,1.3e-05,3.9e-05,7.7e-05,3.3e-05,7.5e-05,1.6e-05,4.9e-05,1.7e-05,5.5e-05,3.2e-05,6.9e-05,6e-06,5.8e-05,8.9e-05,3.6e-05,2.2e-05,2.2e-05,2.5e-05,4e-05,1.4e-05,2.1e-05,4.2e-05,0.00019,7.7e-05,6e-05,2.4e-05,2.3e-05,2.5e-05,1.9e-05,7e-06,5.6e-05,9e-06,0.000228,5.8e-05,3.3e-05,8e-06,3.1e-05,3.1e-05,2.2e-05,1.1e-05,3.4e-05,1.6e-05,6e-05,7.4e-05,6.5e-05,6.1e-05,3e-05,0.000257,0.000145,0.000265,0.000245,9.5e-05,8.7e-05,2e-05,7.5e-05,7.1e-05,2.6e-05,1.4e-05,3.6e-05,2.4e-05,1e-05,9e-06,6e-06,6e-06,1.4e-05,8e-06,5e-06,1.6e-05,5.6e-05,3.4e-05,3e-05,1e-05
7e-05,2.2e-05,1.8e-05,2.9e-05,3.8e-05,7.2e-05,4.6e-05,5e-05,5.7e-05,6.8e-05,7.5e-05,6.8e-05,0.000417,5.6e-05,0.000259,0.000229,8.1e-05,7e-06,0.000201,4e-05,2.2e-05,1.6e-05,1.1e-05,3e-06,1.9e-05,2e-06,0.000241,7.8e-05,7.9e-05,5.7e-05,3.1e-05,2.1e-05,1.4e-05,3.5e-05,1e-04,4.3e-05,0.000195,0.000244,5.7e-05,3.1e-05,2.4e-05,0.000168,6.1e-05,4.7e-05,7e-06,3.5e-05,1e-05,2.6e-05,6e-06,1.3e-05,4.4e-05,4e-06,2.1e-05,6.4e-05,3.5e-05,6.5e-05,3.9e-05,3.4e-05,2.8e-05,4.4e-05,6.3e-05,0.000135,4.4e-05,1.9e-05,3e-06,1.3e-05,1.2e-05,1.3e-05,1e-05,1.5e-05,2.8e-05,0.000118,7.8e-05,2.4e-05,1.6e-05,1.1e-05,1.3e-05,1.2e-05,2.6e-05,5.4e-05,3.8e-05,0.000207,8.7e-05,6.2e-05,3.7e-05,0.000117,3e-05,9e-06,2.8e-05,2.2e-05,2.5e-05,4e-05,7.6e-05,2e-05,4.1e-05,2.5e-05,0.000231,0.000251,0.000239,8.1e-05,2.8e-05,5.6e-05,1.7e-05,7.1e-05,7.6e-05,3.2e-05,3.7e-05,2.8e-05,1.8e-05,1.7e-05,2e-05,1.2e-05,1e-05,1.6e-05,2e-06,9e-06,2.5e-05,5.3e-05,3.1e-05,3.2e-05,3e-06
1.7e-05,7e-06,4.5e-05,3.8e-05,1.6e-05,5.9e-05,1.4e-05,5.4e-05,5.1e-05,3e-05,0.000169,0.000388,0.000438,0.000352,4e-05,0.000113,1.5e-05,3.6e-05,0.00022,1.7e-05,2e-06,6e-06,1.2e-05,1.7e-05,2.4e-05,5e-06,0.000334,0.000152,0.000171,1.5e-05,9e-06,8e-06,9e-06,3.6e-05,8e-05,5e-05,0.000275,0.000108,8.1e-05,3e-05,3.3e-05,6.7e-05,0.000143,3.9e-05,1.1e-05,3.5e-05,1.6e-05,9e-06,1.4e-05,5e-06,4.2e-05,7.2e-05,6.1e-05,6e-05,1.6e-05,4.5e-05,1.4e-05,1.5e-05,4.7e-05,7.4e-05,1.4e-05,0.000145,6.1e-05,1.3e-05,2e-06,6e-06,1e-05,1.5e-05,9e-06,2.1e-05,3.2e-05,0.000126,6.1e-05,4.8e-05,2.1e-05,5e-06,2.1e-05,2.6e-05,5e-06,1.3e-05,1.7e-05,0.000136,0.000203,8.6e-05,4.5e-05,0.000191,4.9e-05,2.6e-05,4.7e-05,2.6e-05,2.9e-05,4.2e-05,1.6e-05,5.7e-05,6.8e-05,4.1e-05,0.00026,0.00027,0.000301,6.2e-05,7.8e-05,0.000106,4.7e-05,5.1e-05,9.2e-05,3.8e-05,3.3e-05,3.5e-05,3.1e-05,2.1e-05,1.8e-05,7e-06,2e-06,5e-06,9e-06,9e-06,2e-05,5.2e-05,2e-05,2.8e-05,1.3e-05
3.7e-05,2.2e-05,4.5e-05,4.3e-05,2.3e-05,7.5e-05,4.9e-05,7.2e-05,6.9e-05,7.5e-05,0.000294,3e-04,0.000226,0.000212,0.000197,0.00016,9.8e-05,4.7e-05,0.000228,4.8e-05,3.7e-05,3.7e-05,2.2e-05,1.5e-05,4e-06,3.5e-05,0.000459,0.000377,0.000132,7.7e-05,1.4e-05,2e-06,9e-06,3.2e-05,4.9e-05,7.8e-05,0.000312,0.000207,0.000111,1.9e-05,3.2e-05,8.8e-05,9.6e-05,5.7e-05,1.4e-05,1.3e-05,1.6e-05,1.5e-05,1.2e-05,2.1e-05,1.1e-05,7.4e-05,4.5e-05,4.2e-05,1.8e-05,6.1e-05,7.4e-05,3.8e-05,1.6e-05,7.6e-05,0.000109,6.5e-05,4.9e-05,6e-05,2.4e-05,9e-06,7e-06,1.8e-05,6e-06,1.2e-05,3.1e-05,0.000201,0.000212,9.2e-05,3.8e-05,1.5e-05,1.8e-05,1.8e-05,4.4e-05,4.1e-05,9e-06,0.000139,0.000172,8.9e-05,3.9e-05,0.000153,9.3e-05,1.5e-05,2.8e-05,1.3e-05,1.7e-05,2.2e-05,2.7e-05,7.8e-05,2e-05,5.7e-05,0.000338,0.000129,8.6e-05,0.000114,9.2e-05,6.3e-05,3.6e-05,6.2e-05,5e-05,8e-06,5e-05,2e-05,1.1e-05,9e-06,6e-06,8e-06,3e-06,1.1e-05,1.3e-05,6e-06,1e-05,3.3e-05,2.5e-05,9e-06,1e-05
1.4e-05,3.2e-05,2.4e-05,6e-05,3.5e-05,8.8e-05,5.4e-05,3.2e-05,7.3e-05,3e-05,0.00026,0.000262,1e-04,0.000153,0.000178,0.000179,5.5e-05,6e-06,0.000237,0.000156,8.5e-05,3.4e-05,2.7e-05,3e-05,1e-05,3.1e-05,0.000443,0.000205,0.000269,7.4e-05,1.4e-05,7e-06,2.4e-05,2.1e-05,1.9e-05,3.7e-05,0.000345,0.000301,0.000194,3.9e-05,2.3e-05,8.4e-05,5.1e-05,4.7e-05,8e-06,2.7e-05,1.2e-05,2.3e-05,2.2e-05,2.7e-05,2e-05,5.2e-05,1e-04,9.5e-05,5.2e-05,9.1e-05,4.8e-05,2.3e-05,6.1e-05,0.000129,2.9e-05,3.4e-05,1.2e-05,3e-05,1.3e-05,1.5e-05,1.8e-05,1.8e-05,1.3e-05,1.4e-05,3.1e-05,0.000253,0.000116,3e-05,2.8e-05,1e-05,1.4e-05,1e-05,3.8e-05,1e-05,1.4e-05,0.000146,7.2e-05,1.9e-05,1.9e-05,0.000104,9.4e-05,5.6e-05,1.5e-05,4.7e-05,1e-05,3.7e-05,4.7e-05,4.4e-05,5.6e-05,7.8e-05,0.000196,0.000213,0.000329,0.000209,7.4e-05,4.4e-05,6.3e-05,1.7e-05,3.7e-05,2.2e-05,1.6e-05,2.8e-05,2.2e-05,2.5e-05,1e-05,1e-06,9e-06,1.2e-05,3e-06,6e-06,1e-05,5.7e-05,1.4e-05,2.1e-05,7e-06
4.1e-05,3.7e-05,1.7e-05,5.3e-05,3.9e-05,4.9e-05,1.8e-05,8.1e-05,3.3e-05,6.3e-05,0.000332,0.000178,0.000289,0.000609,0.000245,6.1e-05,5e-05,1.3e-05,0.000298,0.000239,0.000125,3.6e-05,3e-05,3.5e-05,3.2e-05,1.5e-05,0.000392,0.000393,0.000113,8.3e-05,1.3e-05,2e-05,2.7e-05,4e-05,7e-06,2.5e-05,0.000325,0.000465,0.000167,6.6e-05,1.7e-05,9e-05,6.1e-05,5.9e-05,3.6e-05,2e-05,1.1e-05,1.2e-05,1.9e-05,3e-05,4.1e-05,3.9e-05,8.8e-05,3.9e-05,2.5e-05,6.3e-05,3.7e-05,3.1e-05,4.7e-05,8.6e-05,7.2e-05,1.7e-05,3.8e-05,2.4e-05,8e-06,1.8e-05,8e-06,2.2e-05,1.6e-05,2.1e-05,3.4e-05,0.000244,0.000178,5e-05,3.5e-05,2.8e-05,1.5e-05,1.4e-05,1.7e-05,2.2e-05,1.8e-05,0.000141,7.5e-05,7.4e-05,3.4e-05,8.5e-05,2.6e-05,2.8e-05,3.5e-05,4.4e-05,2.2e-05,2.2e-05,4.8e-05,3.6e-05,1.8e-05,5.5e-05,0.000209,0.000351,0.000343,0.000295,0.000171,6.1e-05,3.9e-05,4.7e-05,2.3e-05,2.5e-05,1.4e-05,3.6e-05,2.4e-05,6e-06,6e-06,3e-06,1e-05,2.2e-05,7e-06,6e-06,9e-06,5.6e-05,1.5e-05,7e-06,4e-06
1.6e-05,2e-06,1.5e-05,2.4e-05,2.8e-05,6.6e-05,1.2e-05,5.9e-05,3.9e-05,5.6e-05,0.000388,0.000341,0.000138,0.000512,0.000182,0.000105,7.7e-05,4.7e-05,0.000305,0.000298,0.000145,3e-05,1.8e-05,1.3e-05,2.8e-05,2.1e-05,0.000282,0.000481,0.000227,6.4e-05,2.1e-05,2.1e-05,2e-06,1.9e-05,2e-05,2.6e-05,0.000301,0.000316,0.00022,0.000122,4.6e-05,0.000123,2.5e-05,3e-05,1.2e-05,2.3e-05,1.5e-05,2.4e-05,9e-06,3.3e-05,1.9e-05,3.2e-05,8.2e-05,5.3e-05,4.6e-05,3.5e-05,9.8e-05,6.4e-05,4.3e-05,7.6e-05,3e-05,4.1e-05,5.8e-05,1.8e-05,2.2e-05,1e-05,1.9e-05,1.1e-05,1.6e-05,4.4e-05,2.7e-05,0.000199,0.000129,7.7e-05,3.6e-05,8e-06,8e-06,5e-06,1.9e-05,2.3e-05,1e-06,0.000221,0.000103,4.4e-05,2.3e-05,0.000108,2.5e-05,3.9e-05,5.5e-05,4.7e-05,3.5e-05,3.8e-05,5.3e-05,5.3e-05,3.6e-05,4.9e-05,0.000203,0.000429,0.000622,0.000339,0.000109,3.5e-05,5.8e-05,1.8e-05,5.9e-05,4.7e-05,6.1e-05,1e-05,9e-06,7e-06,9e-06,1.2e-05,4e-06,2e-05,1.2e-05,2e-06,1e-05,6.3e-05,1.5e-05,2.3e-05,1.1e-05
5.3e-05,1.8e-05,4.1e-05,6.1e-05,8e-06,8.4e-05,7.9e-05,4.5e-05,2.7e-05,9.3e-05,0.000365,0.000339,0.000423,0.000272,0.000232,0.00018,0.000228,0.000111,0.000205,0.000204,1e-04,2.1e-05,1.2e-05,1e-05,1.5e-05,2.6e-05,0.000152,0.000413,0.000368,0.000107,5.4e-05,4.8e-05,2.4e-05,2.7e-05,5e-05,7e-06,0.000269,7.5e-05,6.3e-05,4.8e-05,4.3e-05,0.000187,1.8e-05,1.2e-05,2.6e-05,4.2e-05,3.2e-05,1.5e-05,2.6e-05,1e-05,3e-05,2.4e-05,9.8e-05,3.5e-05,2.2e-05,9.6e-05,0.000102,0.00012,3.2e-05,0.000104,6.1e-05,5.4e-05,1.1e-05,4.6e-05,4.3e-05,2.3e-05,7e-06,2.5e-05,2.1e-05,3.6e-05,6.1e-05,0.00014,7.7e-05,5.2e-05,2.6e-05,6e-06,2e-05,1.4e-05,3.4e-05,1.5e-05,4e-06,0.00034,0.000117,7.5e-05,2.6e-05,0.000107,5.8e-05,1.5e-05,0.000109,7.8e-05,4e-05,7.8e-05,8e-05,6.3e-05,1.8e-05,3.9e-05,0.00019,0.000286,0.000332,0.000229,0.000108,4.3e-05,5.4e-05,3.8e-05,1.1e-05,8.6e-05,5.2e-05,4.5e-05,2.7e-05,1.4e-05,1.6e-05,2e-06,1e-05,2.1e-05,2.8e-05,2.1e-05,1.7e-05,4.7e-05,3.7e-05,3.8e-05,4e-06
2.1e-05,1e-05,5.6e-05,8.3e-05,6.6e-05,4.4e-05,7.5e-05,4.6e-05,9.1e-05,7.5e-05,0.000388,0.000125,0.000336,0.000467,1e-04,0.000172,6.9e-05,4.6e-05,0.000169,0.00018,0.000113,3.5e-05,3.9e-05,2.3e-05,1.7e-05,1e-05,4.5e-05,0.000443,0.000174,7.8e-05,3.5e-05,1e-05,2e-06,2.7e-05,9.1e-05,6.4e-05,0.000165,7.5e-05,1e-05,5.9e-05,8e-06,0.000159,9.8e-05,6e-05,6e-06,2.9e-05,1.3e-05,6e-06,1.6e-05,2.7e-05,3.2e-05,6.3e-05,5.1e-05,5.5e-05,4.5e-05,6.4e-05,0.000155,5.3e-05,8.6e-05,0.000134,0.000111,5e-05,5.5e-05,4.3e-05,7e-06,1.7e-05,6e-06,3.1e-05,1.8e-05,2.2e-05,3.9e-05,4.3e-05,0.000224,8.6e-05,3.4e-05,6e-06,1.7e-05,1e-05,2.7e-05,5.7e-05,3.9e-05,0.000409,0.000205,0.000101,2e-05,0.000116,8.4e-05,4.9e-05,0.000125,7.5e-05,4.8e-05,9e-05,8.1e-05,4.5e-05,3e-05,5.1e-05,9.9e-05,0.000165,0.000442,0.000148,3.9e-05,6.4e-05,6.8e-05,9.5e-05,9.4e-05,0.000149,8e-05,3.8e-05,9e-06,8e-06,1.3e-05,1.3e-05,1.7e-05,1e-05,1e-05,2.3e-05,1.3e-05,3.8e-05,3.8e-05,2e-05,1.3e-05
2.5e-05,9e-06,2.6e-05,5.1e-05,4.4e-05,4.3e-05,3.7e-05,7.3e-05,7e-05,7e-05,0.000218,1.5e-05,0.000431,0.000163,4e-05,0.000121,5.1e-05,2.1e-05,0.000126,0.000101,9e-06,3.3e-05,2.8e-05,1.7e-05,1.7e-05,2.1e-05,8.6e-05,0.000463,0.000295,7.6e-05,1.5e-05,2.4e-05,9e-06,1.6e-05,9e-05,7.7e-05,0.000136,0.000128,8.6e-05,5.1e-05,4.4e-05,0.00018,0.000178,7.6e-05,3.6e-05,3.4e-05,2.7e-05,9e-06,2.4e-05,6e-06,3e-05,5.8e-05,5.6e-05,2.9e-05,4.4e-05,6.9e-05,6.2e-05,5.2e-05,0.000114,7.5e-05,2.9e-05,1e-05,3.6e-05,3.1e-05,2.1e-05,3.3e-05,2.4e-05,3e-05,1e-05,7e-06,2.7e-05,4.5e-05,0.000143,9.5e-05,7e-05,2.6e-05,5e-06,1.2e-05,2.8e-05,7.1e-05,3e-05,0.000406,0.000105,5.7e-05,6.5e-05,0.000102,0.000169,7.9e-05,0.000122,5.8e-05,4.1e-05,6.8e-05,3.5e-05,5e-05,4.2e-05,1.8e-05,0.000132,0.000218,0.000265,0.000196,8.5e-05,3.7e-05,7e-05,2.9e-05,3.6e-05,0.00012,7.3e-05,7.3e-05,3.2e-05,1.4e-05,2e-05,1.2e-05,6e-06,1.4e-05,1.2e-05,4.3e-05,2.9e-05,2.7e-05,6.1e-05,2.9e-05,2.5e-05
7e-06,1.2e-05,2.8e-05,1.9e-05,1.3e-05,1.4e-05,2.3e-05,2.7e-05,6.4e-05,6.6e-05,0.000304,0.000161,0.000386,0.000185,6e-05,8.2e-05,0.000138,7.2e-05,0.000107,5.5e-05,6.3e-05,2.3e-05,3e-05,2.4e-05,1.3e-05,2.5e-05,0.000126,0.000335,0.000241,3.7e-05,1.4e-05,2.7e-05,1.5e-05,2.1e-05,5.8e-05,1.9e-05,6e-05,0.000105,3.1e-05,1.8e-05,2e-05,0.000141,0.000206,0.000122,4.4e-05,1.2e-05,4e-06,1.1e-05,2.8e-05,3e-05,3.9e-05,1e-05,5e-06,2.9e-05,1.1e-05,5.4e-05,6e-05,3.1e-05,5.2e-05,5.6e-05,1.9e-05,2.1e-05,2e-06,2.7e-05,1e-05,3.9e-05,2.6e-05,3e-05,2.4e-05,4e-06,4.5e-05,0.000102,7.9e-05,3.2e-05,3.3e-05,1.5e-05,5e-06,1e-05,1.9e-05,8.5e-05,5.7e-05,0.000353,0.000216,0.000112,3.3e-05,9.1e-05,0.000151,7.8e-05,0.000123,4e-05,1.3e-05,1.9e-05,4.1e-05,3.8e-05,6.8e-05,2.8e-05,9e-05,0.00034,0.000386,0.000129,5.9e-05,4e-06,2e-05,6.1e-05,6.2e-05,0.000115,4.7e-05,4.8e-05,2.8e-05,1.8e-05,1.3e-05,4e-06,8e-06,1.8e-05,1.3e-05,3.8e-05,1e-05,2.2e-05,4.4e-05,2.6e-05,1.2e-05
6.7e-05,4.4e-05,5.2e-05,1.5e-05,1.5e-05,3.1e-05,1.7e-05,3.4e-05,2.6e-05,9e-06,0.000246,0.000243,0.000106,0.000349,7e-06,2.7e-05,8.7e-05,5.1e-05,9.3e-05,9e-05,3.7e-05,1e-05,3.5e-05,3.7e-05,3e-05,4.7e-05,0.00016,0.000101,0.000154,0.000127,5.3e-05,2.1e-05,1.3e-05,2.5e-05,5e-06,3.4e-05,2.7e-05,0.000252,0.000172,6.1e-05,2.7e-05,0.000124,0.000194,0.000124,5.7e-05,2.2e-05,7e-06,2.1e-05,1.6e-05,3.2e-05,3.6e-05,3.1e-05,1.2e-05,2.9e-05,1.2e-05,4.2e-05,2.1e-05,3.3e-05,8e-06,2.1e-05,7e-06,9e-06,8e-06,2.1e-05,4e-05,4e-05,1.6e-05,3.4e-05,1.3e-05,1.7e-05,3.8e-05,9.9e-05,0.00014,4.2e-05,2.6e-05,2e-05,1.1e-05,8e-06,3e-06,6.6e-05,2.8e-05,0.000268,0.00031,0.000175,7.7e-05,4.5e-05,0.000103,5.1e-05,7.6e-05,7.1e-05,3.7e-05,2e-05,3.1e-05,2.6e-05,8.4e-05,6.3e-05,0.000121,0.000332,0.000258,6.9e-05,4.8e-05,2.1e-05,7.2e-05,8.6e-05,4.4e-05,5e-05,3.8e-05,3.7e-05,2.1e-05,2.6e-05,1.6e-05,5e-06,8e-06,1.4e-05,1.3e-05,9e-06,6e-06,1.4e-05,1.6e-05,1.5e-05,1.2e-05
4.5e-05,1.4e-05,2.2e-05,9e-06,1.7e-05,2.5e-05,5e-06,2.9e-05,2e-05,1.2e-05,0.000205,0.000157,0.000219,0.000255,0.000157,0.000143,6.2e-05,1e-05,7.7e-05,0.00014,9.2e-05,3.4e-05,2.2e-05,1.3e-05,0,2.5e-05,8.8e-05,9.2e-05,0.000187,8e-05,3.9e-05,1.6e-05,1.2e-05,2.8e-05,3.5e-05,5.4e-05,0.000103,0.000284,0.000123,5.4e-05,2.6e-05,0.000104,0.000122,4.7e-05,3.5e-05,2e-06,1.1e-05,1.2e-05,1.3e-05,1e-05,3.7e-05,2e-05,1.4e-05,1.3e-05,1.6e-05,2.6e-05,1.7e-05,3.2e-05,3.5e-05,1e-05,2.7e-05,4e-06,1e-05,6e-06,2.8e-05,1.5e-05,1.2e-05,1.8e-05,1.7e-05,1.3e-05,3.4e-05,8e-05,0.00015,9.7e-05,5.1e-05,1.1e-05,6e-06,8e-06,1e-05,3.8e-05,2.5e-05,0.000192,0.000203,8e-05,3.7e-05,1e-05,6.4e-05,3.4e-05,5.3e-05,6.9e-05,3.1e-05,1.4e-05,2.6e-05,3.4e-05,5.1e-05,3.2e-05,8e-05,0.000231,0.000255,0.00019,8.4e-05,3.2e-05,6.5e-05,8.2e-05,2.2e-05,2.8e-05,1.9e-05,2.4e-05,1.3e-05,1.2e-05,4e-06,3e-06,4e-06,5e-06,1e-06,7e-06,1.5e-05,2.2e-05,2.3e-05,1.4e-05,1e-05
2.3e-05,1e-05,3.2e-05,1.3e-05,2e-05,4e-06,1e-05,2.3e-05,1.6e-05,7e-06,0.000224,0.000131,0.000121,5.5e-05,3.3e-05,7.1e-05,1.1e-05,9e-06,0.000119,8.7e-05,2.1e-05,1.6e-05,1.7e-05,1.3e-05,8e-06,1e-05,8.1e-05,8.1e-05,0.000135,1.7e-05,1.5e-05,1.4e-05,1e-06,1.7e-05,2.6e-05,2.7e-05,0.000121,0.000108,6.6e-05,1.1e-05,5e-06,9.5e-05,5.3e-05,1.9e-05,2.1e-05,1.6e-05,7e-06,2e-06,6e-06,1.2e-05,2.9e-05,2.8e-05,1.5e-05,1.1e-05,1.6e-05,3e-05,5e-06,1.8e-05,2.6e-05,2.4e-05,2.4e-05,1.4e-05,8e-06,6e-06,6e-06,4e-06,8e-06,1e-05,4e-06,4e-06,3.1e-05,5.7e-05,7.2e-05,3.3e-05,8e-06,1.1e-05,5e-06,8e-06,2e-05,1e-05,4e-06,0.000114,7e-05,3.3e-05,1.3e-05,2.1e-05,2.1e-05,2.2e-05,2.5e-05,2e-05,2.5e-05,1.6e-05,1e-05,2.3e-05,4.6e-05,2.1e-05,9.3e-05,0.00018,5.5e-05,3.1e-05,4.4e-05,1.8e-05,1.9e-05,5.1e-05,4.2e-05,1.1e-05,1.9e-05,1.7e-05,1e-05,3e-06,3e-06,1e-06,0,7e-06,3e-06,9e-06,7e-06,1.8e-05,2.2e-05,1.4e-05,6e-06
1.4e-05,3e-06,2.6e-05,1.2e-05,1.4e-05,5e-06,3e-06,2.5e-05,8e-06,3e-06,0.000235,5e-05,8.6e-05,0.000236,6e-06,7e-05,2.2e-05,1.3e-05,0.000157,2.8e-05,9e-06,1.1e-05,9e-06,1.1e-05,4e-06,9e-06,5.4e-05,2.5e-05,8.8e-05,1.6e-05,5e-06,4e-06,5e-06,2.2e-05,9e-06,1e-05,0.000147,2.7e-05,4.1e-05,1e-05,5e-06,7.3e-05,2e-05,5e-06,6e-06,1.3e-05,7e-06,1.1e-05,3e-06,1.2e-05,1.9e-05,2.4e-05,9e-06,8e-06,5e-06,2.9e-05,3e-06,2e-05,1.5e-05,1.9e-05,1.2e-05,9e-06,9e-06,2e-06,1.1e-05,3e-06,8e-06,1.5e-05,4e-06,3e-06,3e-05,6.4e-05,6.6e-05,4e-05,8e-06,3e-06,6e-06,3e-06,1.1e-05,1.1e-05,4e-06,4.2e-05,3.1e-05,2.4e-05,1.4e-05,2.1e-05,1.9e-05,1.6e-05,2e-06,5e-06,6e-06,1.2e-05,1.7e-05,1.5e-05,4.4e-05,2e-05,9.7e-05,0.000168,0.00011,2.5e-05,2.7e-05,1.3e-05,1.3e-05,5e-05,4.5e-05,7e-06,2e-06,2.2e-05,8e-06,3e-06,2e-06,1e-06,2e-06,6e-06,2e-06,7e-06,6e-06,1.9e-05,1.5e-05,1.7e-05,5e-06
7e-06,9e-06,2.1e-05,7e-06,1.1e-05,8e-06,4e-06,2.2e-05,1.6e-05,1e-06,0.000236,3.3e-05,0.000162,0.000172,4.9e-05,7.3e-05,1.4e-05,1e-05,0.00016,2.4e-05,1.8e-05,2e-06,1.5e-05,8e-06,3e-06,7e-06,1.6e-05,9.1e-05,0.000119,1.4e-05,6e-06,5e-06,4e-06,1.5e-05,2e-06,3e-06,0.000145,2.6e-05,2.1e-05,6e-06,7e-06,7.9e-05,3e-05,9e-06,8e-06,1e-05,1e-05,5e-06,1e-06,9e-06,1.9e-05,2.7e-05,9e-06,1.2e-05,4e-06,2.8e-05,4e-06,1.6e-05,1.4e-05,1.2e-05,2e-05,1e-05,7e-06,4e-06,9e-06,3e-06,8e-06,1.4e-05,3e-06,2e-06,3e-05,6.5e-05,1.4e-05,1.6e-05,2e-06,3e-06,4e-06,1e-06,1.2e-05,1.7e-05,7e-06,7e-06,1.6e-05,5e-06,4e-06,1.5e-05,9e-06,5e-06,9e-06,5e-06,1.2e-05,5e-06,1.2e-05,1.6e-05,3.8e-05,1.8e-05,9.6e-05,0.00013,8.2e-05,1.9e-05,2.9e-05,2.2e-05,1.1e-05,4.6e-05,4e-05,4e-06,6e-06,1.9e-05,8e-06,3e-06,2e-06,1e-06,2e-06,6e-06,2e-06,7e-06,6e-06,1.9e-05,1.3e-05,1.5e-05,2e-06
