0.013871,0.012768,0.011978,0.010719,0.010236,0.009705,0.007749,0.007199,0.007125,0.006755,0.006281,0.005482,0.004983,0.005191,0.005889,0.005494,0.005203,0.005936,0.006393,0.006314,0.006318,0.006053,0.005406,0.005517,0.005697,0.005765,0.005381,0.00496
0.016191,0.014811,0.013713,0.012258,0.011888,0.01129,0.009119,0.008611,0.008612,0.008059,0.007403,0.006578,0.006078,0.006349,0.007053,0.006562,0.006229,0.007065,0.007521,0.007469,0.007659,0.007319,0.006537,0.006725,0.006875,0.006922,0.006515,0.005933
0.019925,0.018058,0.016384,0.014731,0.01456,0.013668,0.011239,0.010875,0.010943,0.010038,0.009081,0.008309,0.007876,0.008276,0.0089,0.008207,0.007839,0.008845,0.00926,0.009231,0.009742,0.009216,0.008202,0.008579,0.008669,0.008635,0.008259,0.007391
0.022794,0.020535,0.018578,0.016893,0.016452,0.015091,0.012739,0.012427,0.012397,0.011354,0.010304,0.00965,0.009315,0.009858,0.01011,0.009207,0.008883,0.009814,0.010101,0.010207,0.01097,0.010112,0.008964,0.009622,0.009579,0.009408,0.009295,0.008204
0.027,0.024707,0.022076,0.019485,0.017885,0.016495,0.014637,0.013798,0.013421,0.012485,0.011411,0.010798,0.010517,0.011245,0.011183,0.01018,0.009917,0.010346,0.010118,0.01032,0.011058,0.009854,0.008935,0.009859,0.009556,0.009135,0.00932,0.008289
0.036805,0.034216,0.029544,0.024619,0.021244,0.019922,0.01856,0.016829,0.01597,0.015231,0.014283,0.013324,0.012638,0.013483,0.013333,0.012265,0.012238,0.012109,0.010977,0.010722,0.010707,0.009325,0.008765,0.009862,0.009624,0.008985,0.009003,0.008205
0.056781,0.052617,0.04333,0.034652,0.029303,0.028007,0.027183,0.024231,0.02221,0.020985,0.020389,0.018693,0.016528,0.017194,0.017208,0.016254,0.0165,0.016069,0.014129,0.012801,0.011643,0.010336,0.00977,0.010811,0.010763,0.010067,0.009728,0.00895
0.088456,0.08119,0.064695,0.050351,0.042597,0.041559,0.040989,0.036243,0.03264,0.029867,0.02946,0.027061,0.022953,0.02364,0.02378,0.022545,0.022156,0.021506,0.019587,0.017464,0.015456,0.013859,0.012962,0.013811,0.013416,0.012231,0.011366,0.010553
0.123724,0.112742,0.089215,0.068685,0.058773,0.05848,0.057554,0.050543,0.045941,0.041242,0.040627,0.037598,0.031893,0.03261,0.032139,0.030316,0.028606,0.028078,0.02733,0.024357,0.021265,0.01878,0.017245,0.017861,0.017116,0.015306,0.013625,0.013137
0.148328,0.134271,0.106977,0.083292,0.073376,0.073334,0.071573,0.064022,0.05917,0.052625,0.052284,0.048261,0.041245,0.042191,0.040477,0.0383,0.036257,0.036656,0.037097,0.032188,0.027053,0.023417,0.021423,0.021862,0.021085,0.019213,0.016868,0.016441
0.158095,0.140136,0.113803,0.092456,0.084247,0.081943,0.079158,0.074498,0.068738,0.060785,0.061783,0.056338,0.048357,0.048989,0.045505,0.044854,0.045138,0.046614,0.047761,0.039858,0.031415,0.026749,0.024881,0.025177,0.024533,0.023548,0.020896,0.019338
0.158121,0.135241,0.116466,0.09959,0.092454,0.085692,0.08071,0.080375,0.072157,0.063309,0.066939,0.060862,0.052208,0.051526,0.046585,0.049005,0.053519,0.055167,0.056439,0.046331,0.034698,0.029075,0.0267,0.026631,0.026078,0.025956,0.023351,0.020326
0.145704,0.124756,0.118012,0.103368,0.093267,0.081177,0.075654,0.079758,0.068787,0.059231,0.064107,0.060178,0.055421,0.05435,0.046786,0.048714,0.056238,0.058185,0.059506,0.050585,0.037154,0.029453,0.026223,0.026172,0.02521,0.024388,0.022245,0.019477
0.125412,0.111512,0.111777,0.099638,0.085915,0.072057,0.068705,0.072933,0.061321,0.052652,0.054417,0.053056,0.056773,0.058221,0.047939,0.044241,0.051021,0.053712,0.0539,0.04955,0.037582,0.027203,0.023663,0.023863,0.022177,0.020283,0.018702,0.017678
0.114512,0.102406,0.102021,0.092723,0.078424,0.068645,0.064036,0.06425,0.056689,0.050683,0.048992,0.047503,0.053388,0.056348,0.048408,0.03984,0.04064,0.042667,0.042523,0.043593,0.035667,0.02513,0.021174,0.020315,0.01951,0.018506,0.017142,0.016737
0.117051,0.105677,0.106412,0.096041,0.077495,0.071657,0.067619,0.06486,0.059205,0.054121,0.051096,0.047892,0.049458,0.052227,0.049769,0.039833,0.033921,0.034454,0.037621,0.041424,0.034092,0.025597,0.021863,0.019017,0.018755,0.018673,0.017294,0.016194
0.145033,0.130622,0.128669,0.112829,0.084317,0.078284,0.080523,0.076051,0.065509,0.059838,0.05613,0.051186,0.050304,0.054794,0.056158,0.044269,0.035259,0.035938,0.041703,0.045357,0.035458,0.027886,0.025436,0.021053,0.020193,0.019937,0.018303,0.016465
0.188932,0.168683,0.155379,0.129923,0.096047,0.088376,0.094986,0.089711,0.075408,0.073138,0.069285,0.060449,0.058197,0.063,0.064228,0.048828,0.039787,0.042541,0.046978,0.0475,0.03639,0.029421,0.027732,0.022988,0.021885,0.021088,0.019426,0.01803
0.237577,0.2056,0.172966,0.132386,0.10109,0.095033,0.101626,0.093856,0.081518,0.088242,0.08541,0.069688,0.064604,0.068776,0.068503,0.052316,0.047504,0.052137,0.050516,0.045499,0.036178,0.029092,0.025526,0.022095,0.021838,0.020596,0.019166,0.019421
0.285187,0.236486,0.191943,0.133158,0.101539,0.103725,0.107715,0.093822,0.087176,0.100395,0.095225,0.073372,0.067564,0.073473,0.071246,0.054519,0.053489,0.058941,0.051817,0.04102,0.033998,0.027799,0.021919,0.020748,0.022107,0.020765,0.019147,0.019353
0.312947,0.262626,0.220421,0.13937,0.103009,0.115309,0.118482,0.097423,0.092445,0.106984,0.096722,0.071597,0.070554,0.080188,0.073879,0.055615,0.054444,0.058815,0.05281,0.042044,0.03433,0.028836,0.02348,0.023437,0.025119,0.022895,0.02023,0.018866
0.306705,0.267833,0.237658,0.144863,0.106464,0.120349,0.122899,0.099197,0.090993,0.10621,0.096712,0.071072,0.071522,0.084695,0.079435,0.059882,0.051853,0.054297,0.056383,0.050555,0.038132,0.031015,0.028823,0.028738,0.028894,0.025266,0.021876,0.020466
0.280498,0.256639,0.24077,0.150176,0.10781,0.114729,0.124033,0.113932,0.097943,0.106296,0.101042,0.074513,0.072294,0.090393,0.085475,0.066491,0.057374,0.054777,0.059543,0.058979,0.042749,0.032558,0.033578,0.034221,0.033383,0.02904,0.02419,0.023821
0.283675,0.268082,0.255864,0.162695,0.111708,0.109081,0.128169,0.14013,0.12115,0.115831,0.114304,0.088869,0.084312,0.103598,0.092875,0.075885,0.072271,0.068752,0.072175,0.072558,0.052153,0.034712,0.036845,0.040844,0.039977,0.035046,0.028273,0.027686
0.330396,0.339167,0.313315,0.194288,0.134248,0.124779,0.135198,0.153527,0.148422,0.135704,0.130181,0.11002,0.109587,0.125482,0.112231,0.094206,0.090308,0.092392,0.095145,0.091972,0.065799,0.03934,0.039511,0.050643,0.052578,0.046611,0.036827,0.03117
0.3985,0.429184,0.391114,0.236392,0.168317,0.161689,0.145264,0.149328,0.162634,0.146458,0.131167,0.12475,0.129693,0.134696,0.127169,0.112217,0.108754,0.118036,0.114607,0.103947,0.075205,0.044981,0.042896,0.060126,0.064908,0.059489,0.047125,0.033508
0.423786,0.467115,0.431055,0.254588,0.185511,0.192526,0.164297,0.153128,0.166648,0.142911,0.120572,0.135035,0.138144,0.124487,0.124569,0.116614,0.121325,0.136297,0.119586,0.09841,0.073643,0.048027,0.044893,0.063002,0.068666,0.065381,0.054591,0.038014
0.381026,0.40763,0.383259,0.239477,0.186977,0.193279,0.163704,0.155582,0.161228,0.130174,0.114587,0.140078,0.134731,0.111102,0.108465,0.103157,0.123131,0.138384,0.10755,0.081874,0.067398,0.049036,0.044725,0.057032,0.06203,0.061203,0.054431,0.041218
0.326522,0.305721,0.286501,0.224075,0.192661,0.17189,0.135586,0.139713,0.141542,0.118378,0.118581,0.135513,0.11985,0.096501,0.086297,0.081212,0.110586,0.122396,0.088563,0.067696,0.063921,0.054276,0.048741,0.0528,0.056747,0.059937,0.054911,0.040688
0.298552,0.276945,0.264435,0.247243,0.245373,0.200621,0.130188,0.131561,0.132167,0.1138,0.128454,0.133683,0.10552,0.084428,0.070119,0.063552,0.099794,0.113656,0.078876,0.060913,0.063972,0.063193,0.058293,0.060031,0.061955,0.067324,0.066507,0.046154
0.29141,0.276887,0.271449,0.28167,0.326474,0.272112,0.167207,0.160552,0.145715,0.119543,0.154522,0.158031,0.107315,0.080571,0.067846,0.058472,0.096226,0.116305,0.08158,0.060247,0.06621,0.076024,0.075237,0.080778,0.078687,0.074395,0.077074,0.057507
0.259161,0.239744,0.232378,0.27197,0.372281,0.318913,0.198669,0.185158,0.159605,0.131436,0.17392,0.173216,0.113958,0.087942,0.077244,0.063924,0.096455,0.128116,0.089808,0.054966,0.063625,0.088899,0.092699,0.099438,0.092007,0.074746,0.076688,0.064854
0.23597,0.222107,0.193439,0.239506,0.35712,0.301696,0.195784,0.185745,0.171442,0.142366,0.164343,0.16152,0.12247,0.112898,0.098515,0.069044,0.091321,0.133076,0.093803,0.058737,0.064767,0.096106,0.107808,0.111234,0.104317,0.081366,0.068275,0.062459
0.246509,0.227002,0.209376,0.250547,0.305795,0.241745,0.1625,0.169259,0.190387,0.157815,0.142144,0.151604,0.14552,0.138593,0.120451,0.074037,0.08526,0.126364,0.0955,0.076183,0.074069,0.095661,0.115012,0.116381,0.115618,0.092881,0.068723,0.063461
0.253026,0.199476,0.211099,0.259099,0.263427,0.200458,0.139335,0.14554,0.188729,0.15913,0.119188,0.156521,0.168473,0.147742,0.13774,0.084644,0.082963,0.123106,0.104948,0.100358,0.086259,0.091808,0.115259,0.131207,0.132304,0.097617,0.082082,0.078599
0.216144,0.142903,0.180966,0.250779,0.24991,0.177129,0.144142,0.145195,0.162971,0.142298,0.12018,0.178557,0.175939,0.152017,0.162722,0.09545,0.096467,0.154329,0.13589,0.122879,0.116614,0.124233,0.13574,0.151994,0.141752,0.089236,0.091945,0.091
0.171797,0.118548,0.1711,0.243949,0.219538,0.133755,0.138962,0.153305,0.143245,0.112647,0.13489,0.212761,0.183016,0.172205,0.187331,0.103287,0.118129,0.19953,0.173356,0.149303,0.166299,0.17838,0.166718,0.171576,0.139954,0.080411,0.096259,0.097349
0.20438,0.140888,0.188702,0.254741,0.186461,0.10617,0.131295,0.146318,0.128339,0.100922,0.156027,0.241706,0.193756,0.188996,0.192134,0.112758,0.138776,0.226269,0.193549,0.173686,0.224487,0.229646,0.177077,0.168361,0.134901,0.078646,0.09457,0.101886
0.277184,0.166393,0.184791,0.248761,0.174663,0.123435,0.125684,0.120453,0.125096,0.120062,0.188328,0.256511,0.20765,0.186611,0.166433,0.118472,0.148764,0.212638,0.180136,0.175323,0.264078,0.255516,0.157962,0.139711,0.123248,0.086349,0.104796,0.099983
0.338228,0.186575,0.173004,0.232969,0.192568,0.157867,0.117305,0.111317,0.148478,0.14944,0.2105,0.239096,0.194553,0.164085,0.127725,0.115199,0.143061,0.16138,0.144611,0.167391,0.264072,0.249068,0.149165,0.123295,0.105438,0.08383,0.113637,0.089178
