-0.000619,-0.000957,-0.000981,-0.002005,-0.002971,-0.00244,-0.002834,-0.00309,-0.003288,-0.003997,-0.004276,-0.00535,-0.004696,-0.002482,-0.007387,-0.00795,-0.004,-0.00459,-0.003487,-0.004198,-0.006373,-0.006305,-0.006921,-0.00576,-0.005963,-0.006785,-0.004708,-0.005045
-0.000509,-0.000801,-9e-04,-0.002128,-0.002946,-0.002379,-0.002936,-0.002928,-0.00327,-0.003938,-0.004215,-0.004932,-0.003925,-0.002008,-0.00604,-0.006755,-0.003716,-0.003845,-0.002401,-0.003818,-0.006152,-0.005956,-0.006929,-0.005743,-0.005616,-0.005412,-0.004352,-0.005093
0.000138,0.000221,9.1e-05,0.000134,0.00056,0.000367,0.000193,0.000454,-3.6e-05,0.000305,0.000528,0.001311,0.00141,0.000528,0.003225,0.003119,0.000586,0.000975,0.000624,8.5e-05,0.000994,0.001131,0.001338,0.001149,0.001417,0.002539,0.000602,0.00057
0.000572,0.00089,0.000908,0.002178,0.003175,0.002531,0.002855,0.003037,0.00293,0.003647,0.004249,0.005577,0.004608,0.002184,0.007512,0.007961,0.003797,0.004426,0.002521,0.003514,0.006334,0.006074,0.007063,0.005855,0.005727,0.006483,0.004309,0.004879
0.000225,0.000322,0.000514,0.001298,0.001398,0.001184,0.001716,0.001387,0.002148,0.002144,0.002187,0.002402,0.001464,0.000807,0.001129,0.00157,0.001865,0.002146,0.001695,0.002855,0.003156,0.002805,0.003254,0.002397,0.001979,0.001384,0.002354,0.002737
-0.000402,-0.000599,-0.000464,-0.001057,-0.001845,-0.001439,-0.001342,-0.001649,-0.000775,-0.00149,-0.002224,-0.003693,-0.003348,-0.001285,-0.006387,-0.006348,-0.002039,-0.002924,-0.001277,-0.000969,-0.003157,-0.002892,-0.003816,-0.003856,-0.003736,-0.00513,-0.002223,-0.002374
-0.000378,-0.000547,-0.000719,-0.001834,-0.002304,-0.001801,-0.0022,-0.002073,-0.002255,-0.002407,-0.002959,-0.004515,-0.00328,-0.001394,-0.004362,-0.004794,-0.002741,-0.003723,-0.002594,-0.003405,-0.004716,-0.004094,-0.004957,-0.004402,-0.003726,-0.004076,-0.003315,-0.003594
0.000156,0.000207,-3e-05,-0.00026,0.000215,0.000195,-0.000142,0.000214,-0.001039,-0.000254,0.000202,0.000778,0.001236,0.000379,0.003757,0.00345,0.000149,0.000451,-0.000281,-0.001356,-0.000223,-0.000353,0.000233,0.000984,0.001083,0.002753,0.000346,9e-05
0.000319,0.000495,0.000567,0.00147,0.002082,0.001544,0.001572,0.001815,0.001,0.001394,0.002371,0.004533,0.003573,0.00114,0.005633,0.005911,0.002333,0.003482,0.002154,0.002019,0.00385,0.002969,0.003881,0.004257,0.003435,0.004938,0.002845,0.002692
2.9e-05,7.7e-05,0.000363,0.001116,0.000925,0.000605,0.000773,0.000485,0.001145,0.000384,0.000652,0.001697,0.000527,-0.000102,-0.000913,-0.000592,0.000763,0.001648,0.00121,0.001758,0.001629,0.001421,0.001545,0.00134,0.000799,-0.000405,0.000326,0.000744
-0.000219,-0.000376,-0.000313,-0.000657,-0.001342,-0.001042,-0.000825,-0.001202,0.00025,-0.000749,-0.001677,-0.003132,-0.002846,-0.000786,-0.005257,-0.005291,-0.001471,-0.002128,-0.001209,-0.000277,-0.001969,-0.001163,-0.002052,-0.002586,-0.001975,-0.004414,-0.002165,-0.001669
-6.1e-05,-0.000139,-0.000372,-0.001232,-0.001215,-0.000725,-0.000702,-0.000601,-2.8e-05,0.000176,-0.000861,-0.003007,-0.001591,0.000103,-0.001385,-0.001622,-0.001012,-0.002525,-0.001237,-0.000722,-0.001573,-0.000772,-0.001389,-0.001884,-0.000786,-0.001295,-0.000698,-0.000767
9e-05,0.000178,-3.9e-05,-0.000269,0.000345,0.000352,0.000344,0.000611,-0.00049,0.000946,0.0011,0.001073,0.001579,0.000659,0.003918,0.003837,0.000754,0.000308,0.00038,-0.000394,0.00076,0.00045,0.000995,0.001319,0.001159,0.003027,0.001689,0.001246
8.1e-05,0.000182,0.000255,0.000884,0.001232,0.000873,0.000805,0.000809,-0.000819,6e-05,0.001452,0.003271,0.002156,0.000138,0.003006,0.00314,0.001248,0.002331,0.00086,-0.00012,0.00145,0.000259,0.001194,0.002004,0.000638,0.002648,0.001772,0.001255
-6.8e-05,-5.6e-05,0.000237,0.000776,0.000232,6e-06,-0.000126,-0.000279,-0.000356,-0.001421,-0.000586,0.00073,-0.00031,-0.000702,-0.002323,-0.002174,-0.000205,0.001,-8.2e-05,-0.000269,-0.000559,-0.001181,-0.001129,-0.000836,-0.001427,-0.001387,-0.000869,-0.000964
-6.2e-05,-0.00014,-3.7e-05,-0.00028,-0.000944,-0.00082,-0.000971,-0.001011,0.000705,-0.000986,-0.001937,-0.002547,-0.002035,-0.000426,-0.003884,-0.003876,-0.00127,-0.001253,-0.000343,0.000233,-0.001519,-0.000565,-0.001648,-0.002568,-0.001303,-0.003164,-0.002786,-0.002082
0.000106,-7e-06,-0.000235,-0.000794,-0.00052,-0.00022,-0.000331,-0.00016,0.001199,0.001082,-0.000309,-0.001909,-0.000687,0.000592,0.000665,0.00035,-0.000497,-0.001512,-4.6e-05,0.000797,4.8e-05,0.001506,0.000852,-0.000299,0.001059,-0.000475,-0.00085,-4.7e-05
6.8e-05,5.8e-05,-0.000177,-0.000259,0.000487,0.000455,0.000825,0.000938,0.000127,0.001635,0.001537,0.00118,0.001444,0.000755,0.00405,0.003825,0.000829,-8.3e-05,-1.3e-05,0.000337,0.001649,0.001564,0.002441,0.002599,0.001844,0.002672,0.00262,0.002375
-0.000113,1.9e-05,0.000131,0.000561,0.000818,0.00054,0.00095,0.000736,-0.001195,0.000164,0.001461,0.002445,0.001368,-0.000152,0.001081,0.001329,0.001023,0.001277,0.000259,-0.000294,0.001076,-0.000478,0.000569,0.001773,4.5e-05,0.001847,0.002614,0.001538
