0.050648,0.053564,0.061885,0.063651,0.056038,0.053148,0.05006,0.045359,0.0481,0.047453,0.043395,0.048695,0.052718,0.050395,0.051757,0.054314,0.053984,0.047845,0.051461,0.058705,0.05378,0.053352,0.054771,0.055025,0.060477,0.062504,0.056058,0.054693
0.060169,0.064149,0.073319,0.075112,0.066436,0.06341,0.060888,0.056106,0.059405,0.058508,0.053625,0.059549,0.06397,0.061789,0.063568,0.066691,0.067416,0.060884,0.0635,0.07084,0.065353,0.065107,0.067794,0.067889,0.073406,0.076426,0.069255,0.067167
0.076458,0.08113,0.08978,0.091374,0.0816,0.07842,0.077892,0.074119,0.078381,0.076824,0.07124,0.078638,0.083782,0.081369,0.082536,0.087329,0.090697,0.083677,0.083305,0.089566,0.084147,0.085084,0.089864,0.089294,0.09433,0.098754,0.09064,0.087034
0.090712,0.093117,0.095428,0.09598,0.088241,0.085927,0.088112,0.08825,0.094809,0.090934,0.08603,0.095338,0.101094,0.097401,0.093952,0.100711,0.108128,0.102511,0.099061,0.103053,0.099605,0.102038,0.106962,0.104336,0.108107,0.112706,0.10643,0.102773
0.109308,0.106024,0.096036,0.095173,0.092702,0.093122,0.096669,0.101303,0.109568,0.101783,0.100454,0.109276,0.112666,0.109371,0.099098,0.106539,0.118737,0.116427,0.113618,0.117675,0.11811,0.120843,0.122248,0.115732,0.118249,0.123942,0.122461,0.117316
0.139124,0.130047,0.10723,0.10497,0.105606,0.109493,0.114433,0.121666,0.128317,0.116728,0.118612,0.12322,0.124871,0.12841,0.111703,0.114801,0.130805,0.13222,0.135175,0.142566,0.146412,0.148407,0.144554,0.13628,0.140381,0.150338,0.151956,0.137403
0.172455,0.16143,0.133871,0.131277,0.130595,0.133933,0.139981,0.151394,0.157394,0.142328,0.142206,0.141129,0.143904,0.159823,0.138278,0.133065,0.15442,0.156972,0.163362,0.174814,0.179341,0.178579,0.169888,0.162079,0.169736,0.183688,0.183791,0.161789
0.202793,0.194375,0.172967,0.166596,0.160621,0.161358,0.164508,0.179628,0.191116,0.177718,0.175973,0.175287,0.176642,0.197778,0.178016,0.16992,0.192087,0.187152,0.189339,0.203612,0.209481,0.205257,0.189153,0.180665,0.195113,0.213692,0.211074,0.186542
0.237611,0.227062,0.212221,0.200806,0.192511,0.19505,0.194098,0.211617,0.231818,0.219872,0.219337,0.227654,0.221032,0.233204,0.218044,0.212958,0.236565,0.226424,0.215067,0.224521,0.229086,0.220766,0.202582,0.200817,0.227979,0.246645,0.238855,0.215838
0.274261,0.258428,0.243087,0.225479,0.218302,0.230066,0.226771,0.240347,0.266982,0.255932,0.258198,0.280015,0.262981,0.255164,0.2461,0.252518,0.278406,0.264532,0.241305,0.243894,0.24173,0.23099,0.222647,0.230414,0.256698,0.265795,0.262443,0.249719
0.281156,0.267893,0.257484,0.236409,0.226742,0.242664,0.237025,0.242939,0.26973,0.262223,0.269628,0.298348,0.272592,0.250803,0.251632,0.270666,0.294622,0.276185,0.246693,0.243455,0.236749,0.231503,0.241699,0.248287,0.254636,0.254233,0.261782,0.263225
0.252634,0.250735,0.250335,0.229507,0.209302,0.216639,0.210711,0.221718,0.243953,0.23255,0.247585,0.277219,0.243238,0.214622,0.225762,0.247259,0.264019,0.248134,0.223344,0.216772,0.212717,0.219576,0.245083,0.241284,0.220604,0.217529,0.235656,0.249114
0.20693,0.219365,0.231759,0.218835,0.191384,0.182625,0.179008,0.204146,0.212273,0.183759,0.203479,0.23957,0.21164,0.184343,0.192831,0.196913,0.206011,0.203652,0.196436,0.19069,0.197871,0.217245,0.228714,0.211126,0.188277,0.191922,0.21667,0.231752
0.169948,0.193364,0.209935,0.204474,0.182038,0.163884,0.163698,0.191622,0.190944,0.158976,0.178504,0.222107,0.20968,0.186241,0.181622,0.166711,0.167063,0.174803,0.185993,0.186026,0.201283,0.224523,0.212987,0.186249,0.172507,0.176945,0.208211,0.222408
0.159718,0.188835,0.199151,0.190591,0.176901,0.167176,0.170824,0.183766,0.177116,0.158025,0.177709,0.209698,0.201887,0.187921,0.174651,0.150393,0.148284,0.168949,0.187186,0.180009,0.19353,0.211869,0.196786,0.179438,0.166683,0.171424,0.201422,0.206701
0.177932,0.202177,0.207191,0.209142,0.22026,0.225695,0.225877,0.215064,0.200089,0.186543,0.204217,0.224648,0.207138,0.208971,0.206989,0.179481,0.177041,0.216505,0.243568,0.21718,0.219182,0.23037,0.198817,0.183358,0.175505,0.199436,0.232528,0.218856
0.239809,0.256027,0.260118,0.275754,0.307753,0.330975,0.332039,0.299097,0.272661,0.24742,0.259395,0.292468,0.270278,0.288561,0.300548,0.25898,0.25384,0.315017,0.353324,0.305699,0.307733,0.321006,0.255151,0.223829,0.225484,0.285898,0.334949,0.290991
0.320492,0.336339,0.345411,0.352201,0.392155,0.431902,0.433662,0.387587,0.35947,0.324861,0.316615,0.368557,0.361281,0.395676,0.41311,0.348865,0.335737,0.405394,0.447189,0.382374,0.387704,0.416573,0.336001,0.292135,0.307221,0.403155,0.461743,0.381538
0.386757,0.406665,0.442947,0.435057,0.453384,0.488571,0.477563,0.433275,0.424201,0.398983,0.359096,0.412217,0.419003,0.459898,0.48964,0.413085,0.386251,0.439701,0.478933,0.412895,0.409156,0.455237,0.389834,0.345006,0.38279,0.500136,0.540807,0.42962
0.451009,0.457634,0.511207,0.505402,0.501004,0.516398,0.466595,0.424742,0.446095,0.448974,0.390722,0.415498,0.410937,0.446913,0.505261,0.426194,0.387409,0.421069,0.454903,0.410854,0.389862,0.43615,0.409087,0.381712,0.425433,0.525373,0.531855,0.42583
0.503263,0.471621,0.496223,0.518779,0.534924,0.540426,0.452027,0.391184,0.408887,0.443428,0.417375,0.407728,0.362711,0.394949,0.486057,0.397506,0.338277,0.378274,0.412019,0.404186,0.397884,0.421816,0.433179,0.426819,0.423284,0.487068,0.483333,0.404981
0.499929,0.441531,0.407403,0.446652,0.507297,0.505688,0.405599,0.333055,0.325842,0.38801,0.425732,0.420337,0.343847,0.354605,0.437229,0.355134,0.291705,0.344094,0.384964,0.390747,0.41079,0.410715,0.44319,0.448034,0.399306,0.446651,0.435083,0.38007
0.459843,0.394442,0.344413,0.376991,0.454701,0.429166,0.330302,0.293259,0.280859,0.332861,0.388272,0.416977,0.353134,0.323439,0.357997,0.313978,0.281344,0.324522,0.354547,0.351244,0.388901,0.388022,0.418564,0.415984,0.374578,0.429455,0.399637,0.356804
0.415891,0.328005,0.314707,0.361718,0.409478,0.363809,0.29625,0.315163,0.304935,0.309003,0.331256,0.365351,0.339939,0.304668,0.301731,0.289869,0.287068,0.316091,0.335754,0.312616,0.346883,0.36054,0.371427,0.380102,0.363012,0.388812,0.360147,0.322871
0.369137,0.281326,0.317246,0.366659,0.348749,0.293057,0.281751,0.340034,0.317706,0.267677,0.266259,0.294196,0.313704,0.297618,0.272852,0.288463,0.310884,0.324981,0.334957,0.29937,0.322332,0.348317,0.317851,0.330101,0.350184,0.344143,0.342128,0.324316
0.322627,0.270263,0.340137,0.367443,0.289601,0.237614,0.272803,0.357723,0.331217,0.237338,0.227457,0.256844,0.301889,0.304354,0.26353,0.292824,0.333819,0.319148,0.337112,0.34698,0.363045,0.36589,0.315373,0.310606,0.335299,0.348579,0.385401,0.376492
0.275507,0.24958,0.329278,0.352411,0.274557,0.229027,0.271021,0.380107,0.380501,0.260867,0.228999,0.246203,0.274319,0.27983,0.256378,0.294033,0.331553,0.304848,0.350607,0.431431,0.421124,0.358085,0.314908,0.295253,0.310117,0.353041,0.410579,0.416083
0.250154,0.22305,0.311754,0.351285,0.275653,0.238552,0.27543,0.401932,0.452252,0.318882,0.239701,0.245689,0.243787,0.250649,0.241491,0.25544,0.288188,0.315328,0.402585,0.503177,0.442978,0.312883,0.280446,0.270274,0.302834,0.348888,0.372143,0.388534
0.294784,0.224361,0.305803,0.35706,0.268246,0.251397,0.280638,0.388443,0.493715,0.385285,0.262157,0.261097,0.229665,0.236385,0.237777,0.219967,0.257434,0.344165,0.438571,0.501661,0.415494,0.274202,0.244311,0.248077,0.306904,0.351662,0.32372,0.317907
0.351984,0.256004,0.326284,0.368831,0.279092,0.293764,0.303391,0.362253,0.486723,0.420869,0.276368,0.264418,0.219008,0.22198,0.235176,0.212259,0.255275,0.345392,0.424893,0.44145,0.335311,0.232794,0.221884,0.25031,0.325962,0.365432,0.313375,0.29701
0.348818,0.270588,0.332032,0.390719,0.333047,0.344962,0.32853,0.349517,0.425231,0.382607,0.256686,0.231978,0.210574,0.226267,0.218347,0.1973,0.242515,0.292048,0.347121,0.345551,0.249383,0.194642,0.20594,0.247373,0.297878,0.331649,0.295625,0.280894
0.281033,0.247624,0.294985,0.364861,0.356997,0.346202,0.307991,0.311848,0.328018,0.291343,0.222493,0.208765,0.209559,0.216279,0.181477,0.178597,0.23721,0.250994,0.265307,0.268044,0.197127,0.165482,0.199147,0.226224,0.222371,0.237645,0.223345,0.224469
0.210053,0.199694,0.227713,0.302666,0.330557,0.278416,0.223858,0.238127,0.237591,0.202816,0.207784,0.238794,0.221221,0.176963,0.133635,0.151377,0.239093,0.278961,0.248739,0.214617,0.159821,0.135608,0.176999,0.189028,0.159895,0.14299,0.1536,0.179351
0.168515,0.169537,0.18632,0.278777,0.287017,0.182762,0.136344,0.15399,0.14225,0.139177,0.193371,0.251172,0.204673,0.121934,0.09694,0.134729,0.240992,0.296599,0.234926,0.167307,0.121307,0.11687,0.147237,0.142756,0.130513,0.119544,0.142217,0.160915
0.147216,0.152319,0.187652,0.276026,0.249607,0.156743,0.132978,0.127889,0.081927,0.096865,0.162524,0.219891,0.16291,0.092358,0.107417,0.142885,0.224878,0.264646,0.218866,0.167185,0.103347,0.103883,0.135834,0.12168,0.127431,0.156262,0.170361,0.149752
0.121542,0.125899,0.17919,0.23876,0.212766,0.171534,0.165713,0.134526,0.071659,0.073408,0.127058,0.183231,0.135713,0.095173,0.129672,0.149056,0.187486,0.205118,0.183233,0.165543,0.10084,0.092529,0.125338,0.127809,0.148344,0.191481,0.183029,0.133446
0.094586,0.102106,0.152935,0.187837,0.196553,0.184436,0.180114,0.143343,0.086521,0.068809,0.109217,0.165191,0.138985,0.130458,0.153354,0.147691,0.172858,0.187582,0.161912,0.152931,0.115484,0.103479,0.116902,0.139366,0.170062,0.202703,0.176803,0.126125
0.085163,0.090752,0.115731,0.140298,0.166324,0.166482,0.166216,0.151733,0.11035,0.075842,0.100559,0.140697,0.152572,0.180386,0.177557,0.139778,0.169223,0.203425,0.178227,0.164088,0.145664,0.137819,0.138537,0.152454,0.171188,0.189991,0.179578,0.14191
0.095687,0.108796,0.115822,0.134314,0.132102,0.133309,0.152885,0.177414,0.146598,0.093885,0.092298,0.134268,0.191952,0.225908,0.190518,0.140565,0.175056,0.228994,0.241335,0.209475,0.182495,0.17147,0.169641,0.166172,0.176867,0.19916,0.19026,0.179759
0.117082,0.159242,0.151459,0.126999,0.12014,0.152516,0.198862,0.220629,0.181919,0.114395,0.088885,0.162986,0.248644,0.241694,0.188733,0.163187,0.183447,0.243428,0.305399,0.239396,0.19656,0.185371,0.180968,0.194813,0.205877,0.217155,0.1948,0.212833
