-0.008961,-0.005629,-0.010475,-0.002997,-0.015944,-0.007205,-0.012007,2.9e-05,-0.01983,-0.011855,-0.010402,-0.015836,-0.007703,-0.017176,-0.01662,-0.010565,-0.011555,-0.008252,-0.015106,-0.013513,-0.010212,-0.010959,-0.005935,-0.008018,-0.006614,-0.009266,-0.008241,-0.003966,-0.009184,-0.007092,-0.005227,-0.008571,-0.005235,-0.01517,-0.013261,-0.008138,-0.013312,-0.008546,-0.01235,-0.009799,-0.011161,-0.007134,-0.014289,-0.013565,-0.008468,-0.008062,-0.01031,-0.009513,-0.003681,-0.006738,-0.009011,-0.008291,-0.005382,-0.011595,-0.004898,-0.012597,-0.011023,-0.008562,-0.007761,-0.015736,-0.013985,-0.008358,-0.005236,-0.006919,-0.009469,-0.004579,-0.011612,-0.013937,-0.008306,-0.008314,-0.010192,-0.011085,-0.007784,-0.008904,-0.006177,-0.009442,-0.010269,-0.01089,-0.010607,-0.01295,-0.009337,-0.007009,-0.010786,-0.009016,-0.009525,-0.006275,-0.008842,-0.009091,-0.00949,-0.00914,-0.009938,-0.01065,-0.009962,-0.008663,-0.003831,-0.008813,-0.010281,-0.008415,-0.005296,-0.006174,-0.006862,-0.006996,-0.007179,-0.007291,-0.009513,-0.003741,-0.007346,-0.006227,-0.005563,-0.008292,-0.008732,-0.006244,-0.005297,-0.004976,-0.007849,-0.004716,-0.006439,-0.006511,-0.005129,-0.00571,-0.005236
0.00039,-0.002132,0.000368,-0.002446,0.006006,0.009333,-8.7e-05,-0.001846,0.005543,0.004525,0.002544,0.002583,0.001411,0.006454,0.002634,0.002243,0.00423,-0.000595,0.006888,0.003021,0.002898,0.004829,-0.007346,-0.007434,-0.001675,0.001106,5e-05,-0.000382,0.00364,0.002177,0.000266,-0.001327,-0.000269,0.007168,0.007288,0.00411,0.001444,0.003834,0.005896,-0.001324,0.001593,-0.001319,0.008165,0.007799,0.003582,0.002979,0.006985,0.00293,0.000539,-0.001873,0.003334,0.005913,-0.003126,0.000102,-0.000557,0.005844,0.002305,0.001259,0.002639,0.005499,0.005199,0.001848,0.000166,-0.002126,0.001475,-0.000567,0.006246,0.00787,0.002082,-0.001979,0.00592,0.006774,0.004621,0.001959,0.003631,0.001769,0.003456,0.002034,0.003015,0.003508,0.002584,0.001819,-0.00707,0.000813,0.001478,-0.000104,2.5e-05,0.001559,0.002928,0.002448,0.003237,0.002425,0.002367,0.003541,-0.00266,0.003886,0.002357,-0.002974,-0.000198,0.001823,0.000918,0.002925,0.001438,0.005897,0.003478,0.001131,0.002779,0.002064,0.002437,0.003633,0.003826,0.001593,-0.002239,-0.000111,-0.002173,-0.001077,-0.001241,0.001913,0.00015,0.0031,-0.000707
-0.002815,0.001512,-0.00119,-0.000787,-0.003363,-0.009104,-0.000553,-0.003187,-0.003055,-0.005077,-0.002873,-0.001042,0.000109,-0.002284,-0.005825,-0.005093,-0.005001,0.003839,-0.003072,-0.00652,-0.001717,-0.004937,0.003486,0.007458,0.002631,0.001226,-0.001334,0.000641,-0.004093,-0.001087,-0.003043,0.005723,0.002216,-0.002424,-0.004113,-0.004466,-0.000227,-0.000466,-0.003744,0.000516,0.00305,0.00108,-0.005738,-0.004292,-0.001427,-0.000615,-0.004429,-0.003845,-0.001436,0.003255,-0.00091,-0.002935,0.001088,0.003241,0.001916,-0.001201,-0.000154,0.000127,-0.001502,-0.004687,-9.8e-05,-0.001445,-0.000625,0.003651,-1.4e-05,0.002232,-0.003907,-0.005151,-0.003482,0.003302,-0.001488,-0.004367,-0.004549,-0.000159,-0.000375,0.001018,-0.001616,0.001813,0.00064,-0.000186,0.001405,0.003134,0.008479,0.002173,0.00161,0.001883,0.002647,-0.002617,-0.001611,0.001275,-0.004999,-0.001088,-0.000617,9.6e-05,0.003599,-0.00118,-0.000333,0.001828,-0.000395,-0.000818,0.002511,-4.3e-05,0.000323,-0.005151,-0.003673,-0.002332,-0.002617,-0.002041,-0.001169,-0.002083,-0.00139,-0.001036,0.000973,0.000215,0.003613,0.00309,0.000872,-0.001884,0.000394,-0.001294,0.002916
0.000813,0.001697,0.001512,0.003123,0.002754,0.005873,0.004491,0.004236,0.00239,0.000838,0.003182,0.002301,-0.000412,0.001875,0.004468,0.006643,0.00405,-0.001797,0.001655,0.00469,0.004666,0.00432,0.001535,0.000126,-1.8e-05,-0.001691,0.001948,-0.000732,0.004199,0.001256,0.000615,-0.003414,-0.002753,0.001452,0.003387,0.001755,0.001323,0.001487,0.00098,0.001675,-0.001997,-0.000724,0.002079,0.003149,0.002708,-0.00114,0.0025,0.005127,0.001437,-0.001949,-0.000414,0.001382,0.001749,-0.00039,-0.001763,-0.000696,-0.00077,-0.003155,-7e-06,0.003398,0.000393,0.002329,-0.000511,-0.001425,0.000599,-0.000693,0.001675,0.002313,0.004088,-0.001963,-0.001022,0.003731,0.002336,0.000883,-1e-05,-0.000799,0.002064,-0.001264,-0.001901,-1.4e-05,-0.004151,-0.005295,-0.004781,-0.002261,-0.002025,-0.001146,-0.004387,-0.000712,-0.000247,-0.00293,0.003299,-0.001094,0.001063,-0.001791,-0.000976,0.000538,0.001228,-0.000934,0.000617,0.000474,-0.003442,-0.002038,-0.002917,0.003441,0.002683,0.001934,0.003928,0.001913,0.000599,0.002277,0.000308,0.000757,0.001051,0.001184,-0.001989,-0.003037,0.000993,0.000268,-0.000193,0.001387,-0.002029
0.002551,-0.003113,0.00086,-0.002101,-0.00084,-0.003979,-0.005461,-0.003693,-0.003436,0.003473,-0.001449,-0.002101,-0.000443,-0.00091,-0.002544,-0.005716,-0.002383,-0.000944,-0.001471,-0.00202,-0.005,-0.002384,-0.002213,-0.00626,-0.004014,0.00034,-0.001809,-0.002793,-0.001989,-0.001359,-5.2e-05,-0.00066,0.003394,-0.002288,-0.001885,-0.001687,-0.001885,-0.00379,-0.00143,-0.000664,0.00097,0.001521,1.2e-05,-0.001304,-0.000794,0.002021,-0.001945,-0.003637,0.001219,0.000948,0.001311,-0.001025,-0.001202,-0.001846,0.000781,1.8e-05,0.000557,0.00315,0.000643,-0.002257,-0.000571,-0.00211,0.000783,-0.00011,-0.000922,0.000397,-0.001363,-0.003308,-0.002443,0.000126,0.000919,-0.002631,-0.000965,-0.002205,-0.003298,0.00062,2e-06,-0.001991,0.000916,0.000327,0.000958,0.001218,0.003309,0.001007,0.001647,-0.001374,0.001948,0.000998,-0.000658,0.003765,-0.001397,0.001627,-0.001252,0.000668,-0.000299,-0.001562,-0.001812,0.002259,-0.002619,0.000783,0.000937,0.00083,0.001167,-0.001205,-0.001078,-0.002091,-0.002626,-0.002184,-0.001362,-0.002768,8e-05,-0.000304,7.2e-05,6e-05,0.001788,0.000315,-0.001084,0.002246,-0.000243,-0.002365,-0.000491
-0.004639,-0.00151,-0.001559,-0.000325,-0.001378,0.003472,0.0023,0.001881,0.001241,-0.002629,-0.001151,0.002,-8.3e-05,-0.000771,0.002805,0.00165,-1e-05,0.000447,0.001037,0.002565,0.002832,0.000216,0.000808,0.005053,0.003285,-0.000151,-0.000911,0.001991,-0.000308,0.000212,-0.000878,-0.001211,-0.002227,0.002313,-0.000279,0.001751,-9.5e-05,0.001647,0.001534,0.000314,0.000385,-0.002068,-0.000404,0.000256,-0.000377,-0.001533,-0.000181,0.001728,-0.000511,-0.000322,-0.002063,-0.00071,6.7e-05,0.001759,0.000666,-0.000514,9.6e-05,-0.002506,-0.001524,0.000602,0.000328,0.001583,-0.000509,-0.000601,-0.000429,-0.000289,0.000374,0.002716,-0.000427,-0.000802,-0.000589,0.001103,0.000654,0.001864,0.002863,-0.002118,-0.0029,0.001666,-0.000122,0.001198,0.000561,-0.000545,-0.001258,-0.000393,-0.001784,0.001435,0.001295,0.000546,0.001616,-0.003232,0.001655,-0.00236,-0.000353,-0.001238,1e-04,0.000173,0.000724,-0.002283,0.002503,-0.001285,-0.001311,-0.001069,-0.000459,0.000356,0.000466,0.001383,0.000982,0.001602,0.000966,0.001747,-0.000382,-0.000277,-0.000728,-0.001202,-0.001675,-0.000489,0.000161,-0.001532,-0.000434,0.002087,-0.000174
0.00316,0.001246,-0.00025,0.001183,0.000116,-0.004695,-0.001603,0.000748,0.00045,0.00282,0.002226,-0.001674,-0.000958,0.000908,-0.003604,-3.7e-05,0.000577,-0.000591,-8e-05,-0.002264,-0.000425,0.001184,-0.000635,0.00049,0.000265,-6e-05,0.00206,0.001211,0.002001,7e-05,0.000897,0.001212,-0.000241,-6e-06,0.001731,8.1e-05,0.000268,-0.000616,-0.000233,-0.002102,-0.000921,0.002041,0.000564,-7.7e-05,-0.001069,-2.8e-05,0.000451,-0.000486,-0.001502,-0.000496,-0.000231,0.000161,-0.001215,-0.001331,-0.002289,9.7e-05,-2.7e-05,0.001656,0.000784,0.000137,-0.000314,-0.000272,-0.000333,-0.000146,-1.5e-05,0.001519,0.001691,-0.0017,0.001488,0.001002,0.000222,5e-06,-0.000608,-0.00175,-0.001582,0.001588,0.002674,0.002029,-0.000371,-0.001462,-0.001661,0.000956,-0.000865,-0.002081,0.001605,-0.000614,-0.001645,-0.001632,-0.000797,0.001781,-0.002449,0.001716,0.001025,0.00131,0.001931,0.001181,-0.000119,0.001324,-0.000193,0.000822,0.001607,0.000835,-0.000322,-0.000861,-0.002283,-0.001322,-0.000233,-0.000704,-0.000406,-7.9e-05,0.000502,0.000699,-0.000311,0.002067,0.000445,0.000372,-0.000521,-0.000693,0.001134,-0.000825,0.001282
-0.000269,0.000773,0.001448,-0.000138,0.001644,0.003494,0.00205,-0.00105,-0.000318,-0.003798,-0.001199,0.001439,0.001827,0.001555,0.002863,0.002361,-0.000571,0.000515,0.000189,0.001911,0.001116,0.000131,-0.000424,-0.002879,-0.001992,0.000332,-0.000958,-0.001876,-0.00152,0.000543,0.000757,-0.001143,0.002031,-0.001373,-0.001994,-0.00113,0.000334,0.000877,1.5e-05,0.003219,0.00066,-0.000977,-0.001604,-0.001093,0.000656,0.000856,-0.00085,-0.000553,0.000542,0.000582,0.001983,0.000553,0.000937,0.000742,0.003204,0.000872,0.000467,-0.001169,-0.000159,0.000494,-0.001378,-0.000984,3.8e-05,0.000855,-0.000285,-0.00167,-0.002434,-0.000299,-0.000977,-0.001455,0.001152,6.7e-05,0.000412,0.001614,0.000527,-0.001919,-0.002535,-0.003694,0.000116,0.000521,0.00174,-0.001397,0.00037,0.004382,-0.000403,-0.000437,0.00128,0.001044,-0.000895,-0.001427,0.001006,-0.000459,-0.001739,-0.001712,-0.001892,-0.001427,-0.000782,-0.000559,-0.001661,-0.001861,-0.002093,-0.00112,-0.000121,0.000432,0.002366,0.001951,-6.8e-05,0.000761,0.000748,-4.4e-05,-0.000897,-0.000476,5.2e-05,-0.001355,-0.000372,0.000145,0.000733,0.001236,-0.001359,-0.000949,-0.000386
0.000246,-0.000282,-0.000931,-0.000138,-0.001088,-0.001493,-0.00192,-0.001873,-0.000124,0.002735,0.001603,-0.00098,-0.000845,-0.002086,-0.001402,-0.001962,-7e-04,-0.000305,0.001357,-0.001165,-0.003166,-0.000618,0.000558,0.001007,0.000863,0.000847,0.000599,0.000933,0.000525,-0.001194,-0.000763,0.000611,-0.001125,0.001144,0.001345,0.000869,-0.000689,-0.001788,0.000843,-0.001604,-0.001184,-0.000309,0.001459,-0.000186,1e-06,0.000197,0.001197,0.000362,0.000707,-0.00077,-0.001671,-0.001134,-0.000752,-0.00026,-0.003723,-0.001538,-0.00167,0.001177,0.001434,-0.001209,0.001081,0.001409,0.000161,0.001021,-2.8e-05,0.000239,0.001267,-3.8e-05,0.000825,0.000889,-0.00192,-0.000659,-0.000167,-0.001961,-0.000211,0.000342,0.001203,0.001569,-0.000934,-0.00036,-0.000797,-0.000129,7e-05,-0.002072,-0.000908,0.00103,-0.00129,-5e-06,-0.000152,0.001562,0.000566,0.000135,0.000823,0.001744,0.000573,0.00092,2.6e-05,0.00018,0.000773,0.002491,0.002055,-2.2e-05,-0.00014,-0.001137,-0.001357,-0.001052,-0.000454,-0.000992,-0.000549,0.00022,0.000236,0.000431,0.001184,-0.000679,0.000934,-5.3e-05,-8.2e-05,-0.000105,0.000404,0.001016,0.001021
-0.001155,-0.000934,-0.000909,-0.000852,-0.000762,0.000516,0.00088,0.004047,0.000362,-0.001414,-0.002149,0.000636,0.000307,0.001058,0.000164,0.001009,0.000918,-0.000263,-0.000167,6e-05,0.002155,0.000411,-0.000412,-0.000924,0.000713,-0.001567,-1.8e-05,-0.000317,0.00068,0.000688,-0.000863,0.000375,-0.000764,-0.000587,0.000415,0.000333,0.001164,0.001782,-0.001491,-0.000172,0.000276,0.00219,-0.000414,0.001742,0.000232,-0.001163,-0.001149,-0.000392,-0.000222,0.000573,0.000607,0.000484,0.001041,-1.9e-05,0.001794,0.002214,0.001775,-0.000179,-0.000825,0.000889,0.00011,-0.001144,0.000149,-0.000216,1e-06,0.001011,0.001,0.00028,-0.000269,0.000606,0.000661,0.000701,4e-04,0.001202,0.000409,0.001326,-0.000558,0.001618,0.001152,0.000427,0.000421,0.001613,0.000374,0.000171,0.001188,-0.001153,0.000861,-2e-06,0.001051,-0.001389,-0.001893,-0.000712,4.7e-05,-0.001041,-0.000743,-6.7e-05,0.000915,-0.000407,-0.000656,-0.001003,-0.000715,0.000716,0.000679,0.000532,-3.9e-05,-0.000808,0.000689,0.000731,0.00077,-0.000325,0.000931,5.8e-05,-0.001548,0.000788,-0.000867,0.000371,-0.001352,-0.000422,0.000367,-3e-05,-0.001357
-0.000228,7.6e-05,0.002102,0.000495,0.001064,-0.000196,-0.000601,-0.003184,-0.000658,-0.000516,0.000723,-0.000676,-0.000709,-0.000286,-0.000365,-0.000748,-0.000919,-0.000461,-0.001135,0.000263,-0.000593,-0.000414,0.000924,0.001432,-0.000791,0.001443,-0.000361,0.000952,-0.001179,-0.000554,0.002216,0.000521,0.000154,0.001315,-0.000867,-0.000618,-0.001427,0.000346,0.001185,0.000721,-4e-06,-0.001875,-0.000797,-0.000843,2.2e-05,0.000611,0.000837,0.00021,-0.000759,0.000328,0.001097,0.000502,-0.000537,-0.000159,0.000757,-0.001549,-0.00082,0.00011,0.000252,-0.000734,-0.000691,-0.000678,7.9e-05,-0.000851,0.00029,-0.001404,-0.000701,-0.001034,-0.000226,-0.000933,-0.000224,-0.000638,-0.000578,-8.4e-05,-6.5e-05,-0.000898,0.000217,-0.001452,-0.000105,-0.000447,-1e-06,-0.000999,-0.001072,-0.00044,-0.000745,0.000956,-0.000496,0.000773,-0.000433,0.00081,0.0024,0.00071,0.000113,0.000101,0.000596,0.000312,-0.000551,0.000729,0.001225,0.000458,-0.000395,-0.000228,-0.00091,0.000131,0.000204,0.000771,-0.000938,-0.000185,-0.000671,5e-06,-0.001336,-0.000374,0.000761,8e-05,0.000471,0.000124,0.001657,0.000398,0.000436,-0.000173,0.00112
0.000547,0.00083,-0.000544,0.000981,-0.000881,-0.000992,0.000416,0.001378,0.000608,0.001279,-0.000563,0.000366,0.000776,9e-06,0.000329,0.000151,3e-06,0.000284,0.000382,-0.000567,0.000667,-5.8e-05,-0.000682,-0.000584,0.000643,3e-06,8e-05,-0.001364,-0.000586,-7.7e-05,-0.001717,-0.000226,0.000146,-0.000888,0.000391,-0.00013,0.000583,-0.000289,-0.000661,-0.000866,-0.000376,0.000813,0.000973,0.000292,-0.000736,-0.000245,-0.000771,9.6e-05,0.000371,-0.000855,-0.000928,4.9e-05,0.000654,-0.000145,-0.000736,0.000568,0.000308,-4e-06,-0.000381,0.00023,8.1e-05,0.001159,-0.000358,7e-05,0.000371,0.000877,0.000427,0.001026,-0.000574,0.00022,3e-05,-8.6e-05,0.000391,-7e-06,-0.000146,0.000224,0.000216,3.4e-05,-0.00075,0.000134,-0.000371,0.000571,0.000656,0.000841,0.001203,-0.000694,0.000184,-0.001141,-0.000257,-0.000494,-0.001725,-5e-06,2.2e-05,-0.000338,-0.000957,-2.3e-05,0.000232,-0.00076,-0.000794,-0.00127,0.000142,0.000259,0.000937,-0.000527,-0.000101,0.000246,0.000593,6.9e-05,0.000279,4.8e-05,0.000736,0.00013,-0.000341,-3.2e-05,-0.000239,0.000313,-0.001904,-0.000384,-0.001074,-5.8e-05,-0.000497
-0.000147,-0.000144,-0.000144,-0.001359,-6e-05,0.001641,-0.000114,-0.000954,-0.000171,0.000355,0.000785,-9.7e-05,-0.00054,-0.000544,-0.000298,0.000787,0.000241,0.000478,0.000189,-0.000319,0.000106,-0.000105,5e-06,-0.000475,0.000146,-0.000635,0.000226,0.000222,0.00128,0.000588,0.000734,5.9e-05,-0.000922,-0.000463,-0.000174,0.000578,6e-05,-0.000755,-0.000375,5.7e-05,0.000654,9e-06,-0.000421,-0.000312,0.001026,0.000152,0.000469,0.000101,-0.000265,0.000339,-0.000183,-0.000236,-0.000716,0.000149,-0.000357,-0.000143,-1.7e-05,0.000113,1.5e-05,-0.000467,0.00035,-8.7e-05,0.000162,0.000488,-0.000453,-0.000634,6e-06,-0.000387,0.000587,-0.000391,-0.000209,0.001134,-0.000446,0.000288,0.000121,0.000176,0.000245,-0.000365,0.000179,0.000211,0.000575,0.000221,-0.00018,-0.000136,-0.001141,0.000383,-0.000303,0.00086,0.000477,0.000886,0.000843,5.4e-05,3.7e-05,0.000256,0.000579,-0.000151,-0.000327,0.000102,0.000153,0.001019,8.6e-05,-0.000146,-0.000116,0.000537,9.8e-05,-6.6e-05,-0.000417,0.000168,7e-05,8.8e-05,-0.000566,-0.000118,0.000433,0.000148,-9.1e-05,-8.1e-05,0.000662,0.000163,0.00068,-0.000347,0.000156
-0.000129,-0.000424,0.000185,0.00078,0.000392,-0.001257,-0.000175,0.00038,0.000213,-0.001692,-0.000347,-0.000628,0.000388,0.000414,-2.1e-05,-0.000764,0.000837,-0.000906,-0.000531,-3.8e-05,-0.000826,0.000553,0.000245,0.000364,-0.000363,0.000262,-0.000547,0.000364,-0.000493,-0.000194,-0.000477,-0.000533,0.000647,0.00089,0.000141,-5.7e-05,-0.000246,0.000708,0.000185,0.000699,-0.000313,-4.5e-05,0.000249,0.000517,-0.000419,-1.8e-05,5.9e-05,-0.000106,0.00021,-0.000216,0.000414,-0.000186,0.000406,-6.8e-05,0.000765,-0.000157,3.6e-05,0.000267,2.8e-05,-1.1e-05,-0.00035,0.00014,1.2e-05,-0.000248,-0.000399,0.000238,0.000226,-0.000151,-0.000708,0.000617,0.000696,-0.000667,0.00026,-0.000501,0.000253,-0.000159,-9e-05,0.000674,0.00081,-0.000157,-0.000534,-0.000373,6.6e-05,0.000163,-0.000151,1e-04,0.000466,-0.000802,-0.000253,-0.000671,-0.000422,-0.000327,0.000348,-0.000374,-9.9e-05,5.5e-05,0.000283,-6e-06,0.000383,-9.2e-05,0.000221,0.000198,-0.000191,-0.000341,0.000226,-9e-05,0.000612,-0.000241,-0.000535,4.9e-05,0.000352,0.000133,-0.000304,-0.000495,6.4e-05,9.2e-05,0.000462,-0.00014,-0.000105,0.00055,-0.000241
-0.000173,0.000553,-0.000419,-0.000459,-0.000217,0.000145,0.000307,0.000235,-0.000509,0.00139,0.000105,0.000775,-0.000518,1.2e-05,0.000535,0.000144,-0.000413,0.000185,1.4e-05,-8.1e-05,0.000247,-0.000118,0.000311,-3.6e-05,0.000396,0.000193,0.000446,-0.000105,0.000201,-5e-06,0.000372,0.000134,0.00035,-0.000432,-0.000104,-0.000368,0.000336,0.000231,-8e-06,-0.000343,-9e-06,-0.000123,2.5e-05,-0.000488,1.6e-05,-8.6e-05,-9.4e-05,0.000156,-0.00012,0.000615,-2e-06,0.000409,-9e-06,6.3e-05,-3e-04,-0.000116,-0.00028,-0.000335,9.8e-05,0.000297,-8.4e-05,-0.000169,-7.6e-05,-0.000156,0.000123,-0.000225,-0.00024,0.000302,0.00026,-0.00055,-0.000501,-0.000464,-9.3e-05,0.000447,-9.4e-05,-0.000244,9e-06,-0.000487,-0.000699,-0.000315,0.000437,0.000144,-7.2e-05,-4.6e-05,0.000583,-0.000404,-0.000496,0.000783,0.000272,0.000523,-2.3e-05,-1e-05,-0.000219,0.000595,-4e-06,-6.2e-05,-0.000267,0.000291,-0.000302,-0.000203,-6.8e-05,-0.000257,0.000317,0.000267,8.7e-05,-3.8e-05,-0.000457,-1.2e-05,0.000212,-7e-06,-9.3e-05,-8.2e-05,0.000276,0.000627,7.1e-05,-0.000207,-0.000208,1.4e-05,0.000185,-0.000361,0.000185
0.000205,-0.000146,0.000277,3.7e-05,0.000113,0.000458,-0.000138,-0.000505,0.000334,-0.000598,4.2e-05,-0.000786,0.000523,-0.000223,-0.000477,0.000127,5e-05,0.000307,7.4e-05,-7.6e-05,0.000274,1.5e-05,-4.1e-05,0.000364,-0.00026,-0.000496,4.9e-05,0.000138,-9.1e-05,5e-05,-0.000195,0.000178,-0.000146,7.8e-05,0.00015,0.000231,-0.000165,-0.000263,0.00011,0.000291,0.000104,3.9e-05,0.000103,0.000332,-9.5e-05,0.000183,0.000164,-0.000196,0.000233,-0.000715,-0.000303,-0.000441,-0.000306,-9.2e-05,-0.000202,0.000278,0.000296,6.9e-05,-0.000309,-0.000294,0.000161,4.1e-05,-7e-05,0.000287,8.5e-05,0.000173,0.000139,-0.000117,-5.4e-05,0.00032,-1e-06,0.000432,3.4e-05,-0.000242,-9.2e-05,0.000458,-0.000434,7.7e-05,-0.000151,0.000413,-0.000191,-3.4e-05,0.00018,-0.000507,-2.9e-05,0.000482,0.000411,-0.000523,-8.6e-05,-0.000496,0.000411,0.000326,-1.9e-05,-0.000377,4.3e-05,-7.5e-05,-0.000113,-0.000367,5.7e-05,0.000178,0,0.000167,2e-05,8e-06,2.3e-05,0.000129,3.3e-05,9.1e-05,0.000251,-1.4e-05,0.00011,1e-05,-4.6e-05,-0.000256,6.4e-05,0.000104,4.3e-05,-5.7e-05,-0.000188,0.000139,-0.000191
-0.000174,-5e-06,0.000317,0.000235,9.3e-05,-0.000242,0.000144,0.00024,0.000167,6.1e-05,-0.000127,0.000369,-0.000387,0.000105,0.00031,-0.000339,-0.00026,-3.8e-05,4.1e-05,0.000296,-0.000674,-0.000209,2.8e-05,-0.000583,0.000338,0.000204,-0.000229,-0.000323,-8.2e-05,-7.9e-05,0.00014,9.3e-05,0.000105,-0.000467,-2.8e-05,0.000119,-3e-06,0.000326,-4.6e-05,-0.00038,-6.1e-05,-0.000179,-9.3e-05,-9e-05,-5.9e-05,-0.000137,-0.000241,0.000102,-6e-05,0.00038,0.000258,8e-06,0.000262,0.000122,0.000504,-3.9e-05,-0.000171,4.8e-05,0.000253,0.000405,-2.3e-05,-3e-06,0.000175,-0.000332,7.9e-05,0.000148,-0.000112,0.000194,0.00017,-0.000312,0.000349,-0.00013,1.7e-05,0.000119,-5.1e-05,-0.000445,0.000401,-8.2e-05,0.000233,-0.000101,6.9e-05,-0.000221,-5.5e-05,0.000193,-0.000296,-0.000471,-0.00026,0.000222,-0.00018,0.000179,-0.00045,-0.000507,7e-06,0.00013,-0.000116,1.6e-05,0.000159,0.000326,-1.1e-05,-2.5e-05,-0.000143,-1.9e-05,-1.9e-05,-5.1e-05,-7.8e-05,-1.8e-05,0.000228,-0.00013,-0.00027,-5.5e-05,0,-3.6e-05,-7.2e-05,-9.1e-05,-7.6e-05,-6.9e-05,0.000129,-6.5e-05,-2e-06,0.000205,0.000199
0.000275,0.000219,-0.000102,-0.000577,-0.000314,-0.000261,-0.00019,-1.5e-05,-3.1e-05,1.8e-05,-8.4e-05,3.6e-05,0.000371,5e-05,-0.000148,0.00043,0.00042,8.2e-05,0.000114,-8.4e-05,0.000413,0.000339,-1.6e-05,0.000238,-6.3e-05,5.7e-05,0.000186,0.000121,0.000185,4e-06,-1.1e-05,-0.000101,0.000125,0.000269,-0.000112,-0.000101,6.7e-05,-0.000458,1e-04,0.000338,4e-06,0.000343,4.2e-05,7.9e-05,0.000127,0.000144,0.00013,-2e-05,9.6e-05,-0.000112,-0.000104,0.000494,-0.000215,-4.6e-05,-0.000534,-0.000143,0.000125,7.3e-05,-0.000221,-0.00019,2.3e-05,-0.000156,-0.000127,9.4e-05,-3.6e-05,-2.1e-05,0.000109,-0.000252,-1.1e-05,0.000388,-0.00026,-4e-06,-1.2e-05,-4e-06,0.000118,0.000463,-0.000322,0.000389,0.000184,-4.2e-05,-5.8e-05,0.000274,9e-05,0.000114,0.000152,0.000196,0.000207,0,2e-04,-0.000173,0.000484,0.000502,0.000103,-5.5e-05,3.9e-05,-1.5e-05,0.000101,-0.000188,-2.3e-05,-0.000176,0.000183,4.9e-05,-5.5e-05,9.4e-05,6.3e-05,5.6e-05,-0.000255,8.5e-05,1e-04,1.8e-05,-3e-05,-1.2e-05,0.000243,-7.9e-05,8e-06,2.4e-05,3e-06,6.5e-05,8.8e-05,-0.000251,-0.000231
-0.000142,-0.000277,-6e-05,0.000623,1.4e-05,0.000308,0.000103,0.000194,3.8e-05,0.000109,0.000305,-0.000118,-0.000322,-0.000101,3.4e-05,-0.000193,-0.000336,-0.000335,6.4e-05,0.000111,-0.000178,-0.000154,-6.4e-05,-0.000103,-0.000244,-0.000139,-5.8e-05,0.000291,-5.1e-05,2.6e-05,-7.3e-05,-0.000111,-0.000205,-1.6e-05,0.000122,-2e-05,-0.000174,0.000209,4e-06,-9.4e-05,1.8e-05,-0.000404,3.1e-05,-9.2e-05,-2e-05,-3.2e-05,5e-06,-8.7e-05,-0.000118,9e-05,-9.1e-05,-0.000564,0.000204,-8e-06,0.000361,1.2e-05,-5e-05,-0.00018,5.1e-05,1e-04,-1.7e-05,0.000195,0.000137,6.1e-05,3e-06,-0.000173,-4.3e-05,0.000208,0.000132,-3e-04,-0.000146,9.2e-05,-8.1e-05,-0.000114,-5e-05,-0.000235,0.000214,-0.000203,-0.000169,-7.8e-05,-0.000109,-0.000177,-6.4e-05,0.000126,-7.9e-05,-1e-05,-0.000254,1e-05,-5e-05,0.000277,-0.000349,-0.000301,-6e-05,0.000151,-3.8e-05,-2.7e-05,-0.000114,0.000141,0.000128,8.1e-05,-3.1e-05,-4.8e-05,-5.7e-05,-9.4e-05,-6.6e-05,-0.000139,0.000361,-7e-06,-2.1e-05,6.5e-05,1.2e-05,9e-06,-0.000297,9.7e-05,-6.1e-05,-4.5e-05,-0.000104,1.2e-05,-7e-06,0.000183,0.000158
0.000161,9e-06,1.4e-05,-0.000388,0.000335,2.8e-05,-9.1e-05,-0.000379,-0.000101,2.4e-05,-0.000353,0.000207,0.000267,0.000155,4.9e-05,-0.000212,0.000156,0.000276,-3e-05,-2.8e-05,9e-05,6e-05,2.8e-05,0.000395,0.000204,-4e-06,-7.3e-05,-0.000346,-5.5e-05,-7.9e-05,6.6e-05,-7.4e-05,-9.1e-05,-5.6e-05,-1e-06,4.4e-05,0.000165,0.00015,2.4e-05,-0.000101,-1.5e-05,0.000138,3.2e-05,-6.1e-05,-8.1e-05,-0.000139,-6.8e-05,0.000143,8.6e-05,-9e-05,2e-04,0.00019,-0.000152,0,3.3e-05,2.8e-05,5.3e-05,0.00021,-1.9e-05,0,0.000115,-7.7e-05,-3.7e-05,-3.5e-05,-5e-06,0.000167,-9.3e-05,-3.8e-05,-0.000198,0.000191,0.000202,-0.000125,9.3e-05,0.000189,-1.9e-05,-4e-05,-2.5e-05,-0.000102,2e-05,0.000114,0.000181,0.000105,4e-06,-0.000358,-5.9e-05,6.2e-05,0.000305,1.1e-05,-0.000145,-0.000298,0.000133,3.9e-05,1.4e-05,-0.000174,1e-05,2.2e-05,3.5e-05,-0.000147,-0.000143,-0.000105,7.1e-05,5.3e-05,0.000208,0.00012,0,1.4e-05,-0.000208,-6.1e-05,2.3e-05,-1.4e-05,-0.000122,0,0.000241,9.5e-05,4.1e-05,-1.3e-05,0.000168,-2.5e-05,-2.6e-05,-0.000138,-0.000152
-0.00025,0.000123,-2.9e-05,0.000244,-0.000265,-0.000346,0.000116,0.000388,-1.1e-05,-0.000107,0.000274,-6.8e-05,-0.000291,-5e-05,-6.6e-05,0.000286,-3.9e-05,1.8e-05,-4.4e-05,-4.2e-05,0.000316,-6.2e-05,2.7e-05,-0.00034,-5.6e-05,0.000118,0.000206,9.1e-05,4.5e-05,4.4e-05,7.3e-05,4.7e-05,0.000246,7e-05,-0.000104,2.4e-05,-0.000138,-0.000274,7.4e-05,0.000132,1.5e-05,8.3e-05,-6.1e-05,8.7e-05,6.7e-05,5.9e-05,9e-05,-0.000103,-5.6e-05,8.9e-05,-7.9e-05,0.000174,7e-05,-2.1e-05,-0.000268,0.000156,-1.3e-05,-0.000237,2.2e-05,4.2e-05,-0.000117,2.1e-05,-8.8e-05,4.4e-05,-5.9e-05,-0.00012,5.8e-05,-9e-06,3.5e-05,-9.6e-05,-9.9e-05,5.1e-05,-3e-05,-0.000147,3.6e-05,5.3e-05,-0.00011,0.000137,-6.6e-05,-6.8e-05,-0.000162,-1e-06,-4.7e-05,0.000216,0.000187,2e-05,-0.00022,-0.000104,0.00017,0.000246,8e-05,7.7e-05,-2.7e-05,0.000165,0,-3.2e-05,1e-06,0.000129,5.5e-05,0.000213,-8.1e-05,1.2e-05,-0.000149,-0.000101,0.000107,8.4e-05,3.5e-05,9.6e-05,-8.2e-05,-5.8e-05,0.00014,1.4e-05,-9.8e-05,-6.6e-05,5.3e-05,-9e-06,-0.000169,4.7e-05,-8.4e-05,4.7e-05,0.000191
0.000177,-8e-06,-2e-06,-0.00011,3e-06,0.00039,-6.8e-05,-0.000312,7.5e-05,-0.000186,-0.000167,-2.4e-05,0.000278,-8.5e-05,3.6e-05,-0.000166,0.000125,-5.2e-05,8.1e-05,3.3e-05,-0.000475,0.000111,-1.9e-05,1.6e-05,3.7e-05,-9.5e-05,-0.000114,-3.3e-05,-7.9e-05,1.7e-05,-0.000231,6e-06,-0.000206,-0.000136,0.000129,-3.2e-05,0.000138,2.5e-05,-6.1e-05,-0.000115,-1e-06,-0.000175,4e-06,3e-05,-2.1e-05,-2.4e-05,-9.1e-05,4.4e-05,3.2e-05,-4.2e-05,-0.000103,-0.000311,-4.5e-05,4.9e-05,0.000117,-0.000125,4.5e-05,0.000241,7.5e-05,-3.9e-05,-1.1e-05,8.7e-05,8.3e-05,-8.5e-05,4e-06,1.4e-05,1.1e-05,-4.9e-05,-9.5e-05,9.8e-05,-3.7e-05,9.6e-05,-2.8e-05,0.000123,1e-05,-3.7e-05,1e-04,0.000197,9.7e-05,-2e-06,0.000123,2e-05,-7e-06,-9.9e-05,-0.000171,-9.7e-05,4.1e-05,0.000163,-3.6e-05,-0.000152,-0.000254,4.5e-05,1.3e-05,-9.1e-05,-7e-06,-2e-06,-3.6e-05,-0.000153,1e-06,-0.000129,-2e-06,-3.9e-05,5.7e-05,7.8e-05,-0.000147,-7.7e-05,2.9e-05,-8.5e-05,0.000116,1.3e-05,-0.000117,-5e-06,6.9e-05,-6.1e-05,1.8e-05,7e-06,4e-06,2.1e-05,0.000127,7.2e-05,-0.000111
-0.00014,-4.9e-05,-4.2e-05,-1e-04,0.000151,-0.000241,-2.8e-05,0.000281,-2.2e-05,0.000517,5.1e-05,2.8e-05,-0.000186,-1.1e-05,-9e-06,4.8e-05,-0.000204,-4e-05,4.1e-05,-4.4e-05,9.1e-05,-0.000126,-9e-06,-5.3e-05,-9e-06,-7.1e-05,-8e-06,0.000117,4e-05,-4e-05,0.000236,9.9e-05,5e-06,2e-04,-0.000104,-1.1e-05,-9.3e-05,0.000268,1.2e-05,9e-06,3.4e-05,0.000114,5.3e-05,3.1e-05,-3e-05,6e-06,4.8e-05,3.4e-05,-6.9e-05,3.2e-05,0.000148,0.000257,4e-06,-6.4e-05,0.000188,-9e-06,-5.1e-05,-0.000238,-7.2e-05,-6e-06,-1.5e-05,-6.7e-05,-4e-05,6.8e-05,5e-06,6.1e-05,-4.5e-05,0.000106,5.4e-05,-5.8e-05,0.000159,-0.000154,6.4e-05,-0.000151,1.8e-05,-3.6e-05,-6.8e-05,-0.000331,2.4e-05,6e-06,-9.8e-05,-0.000115,-1e-05,2.7e-05,6.4e-05,8e-05,-3e-06,-0.000128,-6e-06,0.000103,0.000283,-0.000164,-4.5e-05,2.9e-05,2e-05,-3e-06,-3.6e-05,0.000102,-7e-06,-4e-05,-1.1e-05,-2.3e-05,-3e-06,-4e-06,0.000115,2e-05,-2.7e-05,2.5e-05,-4.8e-05,8e-06,0.000135,3e-06,-8e-05,5.5e-05,-8.2e-05,-2.7e-05,0.000105,-5.8e-05,-9.1e-05,-0.000107,5.8e-05
7.2e-05,8e-05,3.4e-05,0.000263,-0.000137,8e-05,-1.4e-05,-0.000201,-4.4e-05,-0.000504,8.1e-05,4.9e-05,0.000135,0.000105,2.3e-05,0.000116,0.000106,-6.7e-05,-3.6e-05,2.7e-05,4.6e-05,4.3e-05,1.9e-05,0.00015,-4e-05,0.000158,7e-05,-1.1e-05,-1e-05,3.6e-05,-0.000128,6e-06,1.3e-05,-9.8e-05,-3.2e-05,3.2e-05,6e-05,-0.000244,2e-06,6.8e-05,-3.3e-05,5.6e-05,-4e-05,-0.000136,6e-05,2.2e-05,4e-06,-6.7e-05,4.1e-05,-1.8e-05,-3.3e-05,-7.4e-05,2.3e-05,2.8e-05,-0.000252,5.9e-05,1.9e-05,0.000103,8.2e-05,-3.9e-05,9.7e-05,4.4e-05,8e-05,1.2e-05,2.3e-05,-1e-04,-6e-06,-3.3e-05,4.8e-05,-3.7e-05,-0.000116,8.1e-05,-3.7e-05,0.000108,-3.6e-05,8.5e-05,-2.2e-05,0.00013,-0.000135,-7.6e-05,6.2e-05,0.000123,9e-06,8.3e-05,3.3e-05,-6.4e-05,5.7e-05,7.3e-05,1.7e-05,-5.7e-05,-0.000254,0.000137,6e-06,-3.3e-05,-1.1e-05,1.6e-05,6e-06,-8.8e-05,-3e-06,2e-05,8e-06,3.2e-05,1e-06,-4.8e-05,-9e-06,-1.8e-05,5.9e-05,1.2e-05,3.2e-05,-2.1e-05,-0.000104,-9e-06,7.9e-05,4.3e-05,2e-05,-2.7e-05,-0.00013,1.2e-05,3.3e-05,3.4e-05,-9e-05
-0.000142,-0.000116,-2.4e-05,-0.000294,2.8e-05,2.9e-05,-2.1e-05,3.5e-05,8e-06,0.000109,-6.9e-05,-0.000121,-0.000119,-1.7e-05,-3e-05,-0.000206,-1.9e-05,7.6e-05,-5.7e-05,-2.9e-05,-1e-05,-2.3e-05,-2e-05,-2.9e-05,3.7e-05,-9.1e-05,-6.4e-05,-0.000177,1.6e-05,-4e-06,7.1e-05,-3.8e-05,8e-05,-4.7e-05,0.000121,-4e-06,-3.5e-05,5.9e-05,-3.1e-05,-4.2e-05,9e-06,-9.4e-05,8e-06,0.000132,-3.3e-05,-6e-05,-2.7e-05,5.1e-05,-3.1e-05,2.5e-05,-0.000119,-5.3e-05,-3e-05,-1.2e-05,3.7e-05,-6e-06,-5e-06,-7.1e-05,-3.2e-05,-2.2e-05,-5.4e-05,-7.8e-05,-6.7e-05,-3.3e-05,3.3e-05,9.6e-05,8e-06,-4.1e-05,-5.1e-05,4.4e-05,-2.9e-05,2.2e-05,2e-05,-5e-06,1.1e-05,1.3e-05,8.9e-05,4.3e-05,3.1e-05,0.000115,-3.3e-05,-0.000102,3.9e-05,2.2e-05,1.6e-05,4.4e-05,-6.6e-05,1e-06,-8.8e-05,9.1e-05,0.000194,-3.5e-05,1.6e-05,6.4e-05,2.5e-05,3e-06,5.4e-05,5.8e-05,-2.1e-05,2.3e-05,2.7e-05,1.2e-05,-2.4e-05,8.5e-05,-4.5e-05,2.5e-05,-3.5e-05,-2.9e-05,-1.5e-05,2e-05,4.8e-05,9e-06,-3e-05,-5.6e-05,-1.5e-05,1.6e-05,0.000113,1.4e-05,-3.9e-05,3.5e-05,8e-05
0.000122,8.5e-05,1.8e-05,0.000227,0.000102,-8.9e-05,5.9e-05,0.000112,3e-06,0.000249,8e-06,0.000109,1e-04,-6.8e-05,3.9e-05,0.000106,5.6e-05,6.4e-05,-2.1e-05,-1.6e-05,9.1e-05,1.1e-05,3.2e-05,-8.6e-05,-1e-05,-1.2e-05,3.5e-05,0.000114,2.1e-05,-1.1e-05,-3.5e-05,-6.9e-05,-0.000107,7.9e-05,-8.3e-05,-3.7e-05,-6e-06,2.2e-05,-2.2e-05,7.4e-05,-2.3e-05,0.000118,1.8e-05,-9.9e-05,-3e-06,5.1e-05,3.4e-05,-1.3e-05,3.6e-05,-6e-05,0.000131,5.8e-05,4.6e-05,1.6e-05,0.00017,-5e-05,-1.4e-05,7.2e-05,-5e-05,7e-06,5.6e-05,6.3e-05,2.7e-05,4.5e-05,-1.2e-05,-8.2e-05,3.4e-05,6e-05,1e-05,-4.3e-05,0.000122,-0.000105,-1.9e-05,-4.9e-05,-1e-06,-0.000102,-0.000102,1.3e-05,0.000166,-1e-04,-2.8e-05,0.000115,-9e-06,-0.000164,-5.5e-05,4e-06,2.2e-05,-6e-05,0.000116,-0.000153,-0.000112,-8.1e-05,1e-06,-5.7e-05,-1.9e-05,3e-06,-4.6e-05,-5.3e-05,2.8e-05,-1.7e-05,2e-06,-2.6e-05,1.2e-05,-6.8e-05,6.6e-05,-1e-06,-6e-06,3.3e-05,-1.1e-05,-4e-06,-1.7e-05,-4e-06,-2.9e-05,-4e-06,5e-06,1.6e-05,-2.8e-05,-2.8e-05,5.4e-05,-5.2e-05,-4.7e-05
-0.000113,3.3e-05,4.4e-05,-0.000121,-8.3e-05,8.9e-05,-3.7e-05,-0.000161,4.4e-05,-0.00022,4.8e-05,-5e-05,-8.3e-05,3.5e-05,-4.7e-05,4.8e-05,-7.9e-05,-0.000126,-2e-06,3e-06,-4.3e-05,-2.6e-05,-3.2e-05,-9e-06,-3.5e-05,5.2e-05,2.1e-05,3.5e-05,-4.7e-05,1e-05,3.9e-05,7e-06,0.000124,-4.5e-05,-1.3e-05,1.8e-05,2.3e-05,-8.5e-05,-9e-06,-8.9e-05,-7e-06,-6e-05,-2.5e-05,5.4e-05,-2.3e-05,-3e-06,-3.3e-05,-3.3e-05,-2.2e-05,7.8e-05,1e-06,-6e-05,-4.9e-05,-1.2e-05,-0.00019,1.7e-05,1.4e-05,-9.9e-05,9.4e-05,-3.1e-05,-2.7e-05,1e-06,1.1e-05,-6.8e-05,-4.5e-05,5.9e-05,-3.6e-05,-2.4e-05,1.6e-05,6.6e-05,-7.4e-05,0.00011,1.1e-05,8.1e-05,-3e-06,0.000129,8.6e-05,-8.1e-05,-0.000119,7.4e-05,8.2e-05,-7.5e-05,1.8e-05,5.3e-05,-5.2e-05,-3e-05,3.3e-05,8e-05,-3.8e-05,8.9e-05,2.2e-05,0.000129,-3e-06,3.8e-05,7e-06,-3e-06,3e-05,6.4e-05,-1e-05,-1e-06,-2e-06,8e-06,4.2e-05,3.2e-05,-4.4e-05,-4e-06,4.4e-05,-8e-06,2e-05,-1.2e-05,-2.3e-05,6e-06,1.1e-05,-4.7e-05,0,3e-06,4.3e-05,1.7e-05,-3.8e-05,5.3e-05,5.5e-05
0.000109,-4.5e-05,-8.4e-05,3.4e-05,0,-5.5e-05,2.9e-05,0.00017,2e-06,-2.4e-05,-0.000112,-5.4e-05,6.1e-05,-1e-05,3.4e-05,-0.000107,3.9e-05,0.000105,-3e-06,5e-06,-8.8e-05,4.1e-05,1e-06,0.000117,2.8e-05,1.6e-05,-4.8e-05,-9e-06,1.7e-05,-1.8e-05,-5e-05,1.6e-05,-4.3e-05,6.2e-05,6.6e-05,1.8e-05,-2.1e-05,0.000181,1.6e-05,5.3e-05,1.3e-05,0,-6e-06,-8e-05,2.1e-05,8e-06,2.2e-05,3.6e-05,2.5e-05,-4e-05,-9.5e-05,9.8e-05,5.4e-05,-9e-06,8.8e-05,1.4e-05,-1.3e-05,0.000105,-9.3e-05,2.8e-05,4e-06,-6e-05,-3.9e-05,4.7e-05,-1.4e-05,-2.4e-05,6e-06,1.9e-05,-2.5e-05,-7.9e-05,-4e-05,-2e-06,-5e-06,-9.7e-05,-4e-06,-0.000128,-2.7e-05,3e-06,-8.6e-05,-3e-05,-7.8e-05,1.2e-05,-1.4e-05,0.000122,6.1e-05,3.3e-05,-3e-05,-6.4e-05,-8.2e-05,-3.6e-05,8.4e-05,-8e-05,-1.1e-05,-1.5e-05,-6e-06,0,-2e-06,-4.3e-05,-2.9e-05,4.6e-05,-3.7e-05,-2e-06,-5.6e-05,-1.9e-05,2.4e-05,-2e-06,-7.4e-05,-1.1e-05,-2.8e-05,2.1e-05,4e-05,1e-06,7e-06,8.1e-05,2.3e-05,-1.2e-05,-4.6e-05,1.4e-05,1.8e-05,-4.7e-05,-5.8e-05
-5.4e-05,1.9e-05,2e-05,2.5e-05,5.6e-05,3.7e-05,-3.8e-05,-0.000176,-2.2e-05,0.000159,0.000136,0.000101,-3.8e-05,-6e-06,-2.2e-05,0.000109,1.1e-05,-0.000134,2e-05,5e-06,0.000156,-2.2e-05,1.5e-05,-2.2e-05,-1.2e-05,-8e-05,3.9e-05,-5.4e-05,2.4e-05,1e-06,3.2e-05,3.6e-05,-2.5e-05,-6.5e-05,-5.1e-05,-1.8e-05,1.6e-05,-0.000118,-9e-06,-1e-06,1e-06,6e-05,2.1e-05,0.000102,1e-05,-1.6e-05,-1.8e-05,-2.4e-05,-1.2e-05,-2e-06,7.2e-05,-0.000116,-4.3e-05,1.4e-05,3.4e-05,4e-06,-7e-06,-9.9e-05,5.9e-05,-1.9e-05,-5.8e-05,5.2e-05,5.4e-05,-3e-06,2.2e-05,1e-05,1.5e-05,-3.9e-05,-1.8e-05,9.6e-05,8.3e-05,-8.8e-05,6e-06,8.6e-05,7e-06,6.5e-05,-6e-06,4.2e-05,0.000121,2.3e-05,6.4e-05,-1.9e-05,0,-0.000109,6.1e-05,-2.9e-05,8e-06,6.7e-05,9.7e-05,2.5e-05,-0.000162,2.1e-05,5e-06,5e-06,4e-06,2e-06,-3.3e-05,4.7e-05,2.3e-05,-1.6e-05,3.9e-05,-3e-06,-8e-06,5e-06,-3.2e-05,-2.4e-05,4.6e-05,2e-05,8e-06,0,-3.3e-05,-1e-06,-7e-06,2.5e-05,1e-06,1e-06,6e-06,-2.2e-05,-2.5e-05,5e-06,4.9e-05
4.6e-05,-3.3e-05,5.1e-05,-6.1e-05,-5.4e-05,-5.7e-05,3.4e-05,0.000147,-9e-06,-0.000146,-8.2e-05,-9.3e-05,1.5e-05,3.4e-05,-3e-06,-5.5e-05,1.5e-05,0.000174,8e-06,9e-06,-7e-05,2.2e-05,-4e-06,-6.1e-05,9e-06,9.3e-05,-1e-05,-1e-05,-3.1e-05,1.3e-05,-1.2e-05,6e-06,8e-06,3.3e-05,-1.5e-05,-9e-06,-5e-06,-5.9e-05,1.7e-05,-7.1e-05,1.4e-05,-6.1e-05,-1.1e-05,-5.4e-05,1e-06,-2.7e-05,7e-06,-1.4e-05,1.5e-05,-1.4e-05,7e-06,3.4e-05,2.6e-05,-3e-06,-0.000103,-1.3e-05,0,8.6e-05,-1.2e-05,4e-05,5.2e-05,-1.8e-05,-8e-05,-7e-06,1.8e-05,-1.1e-05,7e-06,5.3e-05,-8e-06,-8e-05,-4.3e-05,7.5e-05,-1.7e-05,-2.7e-05,1e-05,-6e-06,4e-05,5.4e-05,2.2e-05,2e-06,-4.5e-05,4.7e-05,-1.3e-05,3.4e-05,-7.6e-05,1.8e-05,5e-06,-9.2e-05,-2.2e-05,-2.3e-05,0.000192,-9e-06,-1e-05,-3e-06,-2e-06,1e-06,1.9e-05,-2.3e-05,1.4e-05,-2.9e-05,-2e-05,-3e-06,1.9e-05,0,9e-06,4.1e-05,-1.6e-05,0,3.5e-05,-1.8e-05,4.6e-05,1e-06,-4e-06,-8.6e-05,-7e-06,1.7e-05,2.3e-05,2e-06,4.2e-05,3.6e-05,-4.2e-05
-2.5e-05,-9e-06,-4.9e-05,6.7e-05,3e-06,9.1e-05,-6e-06,-7.2e-05,1.4e-05,0.000115,1.7e-05,3.1e-05,5e-06,-1.3e-05,1.8e-05,-5.7e-05,-2.7e-05,-0.000133,-2.1e-05,-1.1e-05,-5.6e-05,8e-06,-7e-06,-1.5e-05,4e-06,-4.8e-05,-2.1e-05,0.00012,4.1e-05,-7e-06,-4e-06,0,2.2e-05,1.7e-05,4.6e-05,2.4e-05,-3e-06,0.000103,5e-06,9.9e-05,8e-06,1.5e-05,1e-06,3.7e-05,-3e-06,2.1e-05,7e-06,4.2e-05,-6e-06,3.3e-05,-7.1e-05,8.7e-05,-1.2e-05,2e-06,5.6e-05,-5e-06,1.8e-05,-4.5e-05,-2.5e-05,4e-06,-6e-06,1.7e-05,6.2e-05,1.2e-05,2e-06,2.4e-05,-5e-06,-3e-05,1.1e-05,7e-05,-3.5e-05,-1.5e-05,1.9e-05,-1.1e-05,-9e-06,9e-06,-3.7e-05,-1e-04,-9.2e-05,-1.3e-05,2.3e-05,-5.1e-05,-3e-06,0,-2.4e-05,-1e-06,9e-06,9e-05,-2e-06,4.1e-05,-0.000168,3.7e-05,-3e-06,3e-06,-1e-06,0,1.3e-05,2.2e-05,-1.3e-05,1.6e-05,2.5e-05,6e-06,2.3e-05,-9e-06,2.3e-05,-1.5e-05,-2.4e-05,-1.5e-05,-2.6e-05,1.3e-05,-4e-05,-3e-06,-6e-06,3e-05,-2e-06,1.5e-05,-3.6e-05,1.1e-05,-2.3e-05,-5.7e-05,3.8e-05
2.1e-05,1.9e-05,2.9e-05,-5.3e-05,4.1e-05,-9.3e-05,2.2e-05,2.2e-05,5e-06,-0.000143,1.3e-05,3e-05,-1.2e-05,-3.1e-05,-2.1e-05,0.000118,9e-06,9.1e-05,2.8e-05,4e-06,3.1e-05,9e-06,-2e-06,4.5e-05,-2.8e-05,2e-06,2.6e-05,-7.1e-05,-2e-05,5e-06,-2e-06,-2.9e-05,-4.1e-05,-4.1e-05,-2.2e-05,-6e-06,2e-06,-2.8e-05,7e-06,-5.7e-05,5e-06,2.1e-05,4e-06,-5.4e-05,-4e-06,-3e-06,-8e-06,-4.3e-05,-8e-06,-1.4e-05,7.1e-05,-0.000129,-1e-06,-9e-06,5.4e-05,1.5e-05,-1.5e-05,-4e-06,3.6e-05,1.2e-05,1.3e-05,1.4e-05,-1.1e-05,-3.1e-05,-6e-06,-2.7e-05,-1e-05,1e-06,3.2e-05,-7.2e-05,6.4e-05,-4.2e-05,-1.5e-05,7e-06,-3e-06,-2.4e-05,2.6e-05,-2e-06,1.1e-05,1.2e-05,-1.9e-05,5.3e-05,-3e-06,-3.4e-05,6.7e-05,-8e-06,-3.1e-05,-5.2e-05,-7e-06,-3.8e-05,9.7e-05,-6e-05,-1e-06,6e-06,3e-06,-1e-06,-1.7e-05,-2.2e-05,-1e-06,1.8e-05,-4.1e-05,-9e-06,-3.9e-05,2.4e-05,-4.4e-05,-5e-06,5.2e-05,1.3e-05,-1.4e-05,-4e-06,2.4e-05,0,2.9e-05,2e-05,-1.1e-05,-9e-06,3.8e-05,-1.4e-05,5e-06,4.2e-05,-3.8e-05
-1.7e-05,-1e-06,1.3e-05,2.8e-05,-5.2e-05,5.2e-05,-6e-06,-3.3e-05,-3e-06,0.000138,-4.8e-05,-5.1e-05,2.1e-05,1e-05,1.6e-05,-7.4e-05,1.9e-05,-7.4e-05,6.1e-05,1e-06,-3.2e-05,-1.2e-05,-4e-06,7.7e-05,1.7e-05,-2e-05,-1.4e-05,-3.7e-05,-3.5e-05,-2e-06,3.4e-05,-1.9e-05,6e-06,2.2e-05,-1e-05,-1.8e-05,-9e-06,-4.5e-05,1.4e-05,8e-06,-6e-06,-4.6e-05,-8e-06,4e-05,-5e-06,-5e-06,9e-06,2e-05,2e-06,-1.9e-05,8e-06,8.3e-05,1.4e-05,1.1e-05,-0.000104,-6e-06,5e-06,3e-05,-4.6e-05,6e-06,-3.4e-05,-2.9e-05,-1.1e-05,2.3e-05,-1e-06,2e-05,1.2e-05,5e-06,8e-06,6e-05,-2.8e-05,6.4e-05,8e-06,-1.8e-05,-1e-06,4.4e-05,1.1e-05,8.9e-05,4.2e-05,-4.1e-05,-1e-06,-3.7e-05,1.2e-05,-3e-06,-4.5e-05,1.3e-05,3.2e-05,8e-06,-2e-05,2.4e-05,-2.2e-05,5.2e-05,1e-05,-1.2e-05,-5e-06,1e-06,2.6e-05,1.6e-05,1e-06,2e-06,2e-05,7e-06,-1.3e-05,-3.2e-05,4.2e-05,-4e-06,-6.8e-05,-1.5e-05,2.4e-05,-7e-06,-3.3e-05,0,-2.8e-05,-4e-06,1.1e-05,-6e-06,-3.8e-05,7e-06,-1.5e-05,-8e-06,2.7e-05
-1e-06,-2.2e-05,-2.7e-05,-1.1e-05,1e-05,2.3e-05,-9e-06,5.8e-05,-1e-05,9e-06,4.4e-05,3.2e-05,-3.9e-05,3e-05,-6e-06,-7e-06,-1.8e-05,5.9e-05,-3e-06,-5e-06,5.6e-05,3e-06,2e-06,-0.000121,-9e-06,7.4e-05,-8e-06,4e-06,4e-05,-1e-05,-4.3e-05,3e-06,4.7e-05,-2.7e-05,3.8e-05,1.3e-05,1.3e-05,6.5e-05,-4e-06,9e-06,-1.1e-05,2.9e-05,-1e-06,-7e-06,2e-06,6e-06,-1e-05,2.1e-05,5e-06,1.7e-05,-8e-05,2e-05,-2.6e-05,-2e-06,5.7e-05,-3e-06,4e-06,-1.9e-05,3.5e-05,-4e-06,1.5e-05,2.3e-05,1.9e-05,-6e-06,-1.1e-05,-2.5e-05,1e-05,1.3e-05,-1.6e-05,-3.8e-05,-3e-05,-4.8e-05,0,3.9e-05,3e-06,-5.3e-05,-1.9e-05,-2.5e-05,-1e-06,3.7e-05,4.1e-05,2.5e-05,-4e-06,9.7e-05,2e-05,-1.7e-05,-2.2e-05,1.4e-05,6.6e-05,-6e-06,-4.2e-05,-3.7e-05,2e-06,1.1e-05,8e-06,1e-06,-3e-06,-2.1e-05,-7e-06,-2.2e-05,-1.2e-05,2e-06,2.9e-05,2.8e-05,-2e-05,0,7.1e-05,4e-06,-1.2e-05,1.1e-05,2.4e-05,0,-1e-06,-3e-06,-1e-06,1.3e-05,9e-06,1.3e-05,2.4e-05,-1.1e-05,-1.9e-05
-3e-06,4.1e-05,1.9e-05,2.1e-05,2.7e-05,-9.8e-05,-1e-06,-5.5e-05,-3e-06,-0.00017,0,1.1e-05,4.5e-05,-2.7e-05,3e-06,7.1e-05,1e-06,-5.6e-05,-4.5e-05,9e-06,4e-05,1.1e-05,1.9e-05,-1.1e-05,3e-06,-9.4e-05,1.5e-05,4.9e-05,-1.3e-05,1.2e-05,3.1e-05,2.7e-05,-5.9e-05,3.7e-05,-2.9e-05,1e-05,-1.1e-05,-6.1e-05,-3e-06,-4e-06,-1.4e-05,-1e-05,7e-06,-1.1e-05,-3e-06,-2.4e-05,4e-06,-4.9e-05,-7e-06,4e-06,6.1e-05,-8.7e-05,2.8e-05,-5e-06,2.6e-05,1.6e-05,9e-06,2.5e-05,-9e-06,-6e-06,-2.4e-05,-3.5e-05,-4.2e-05,0,-9e-06,1.2e-05,-1.4e-05,-1.3e-05,-1.8e-05,2.7e-05,4.8e-05,-9e-06,-4e-06,-3.4e-05,-2e-06,2e-05,2.9e-05,-4.7e-05,-1.7e-05,-3.9e-05,-4.9e-05,-2.7e-05,6e-06,-8.3e-05,3e-06,1.3e-05,2.1e-05,-2.4e-05,-5.6e-05,2e-06,9.8e-05,1.6e-05,0,-1.3e-05,-9e-06,-2e-06,-1.3e-05,1.2e-05,1.9e-05,-4e-06,2.2e-05,-2e-06,-1.3e-05,-1.6e-05,-8e-06,1.7e-05,-1.6e-05,1.7e-05,-1.5e-05,-4e-06,-1.4e-05,-2e-06,5e-06,-3.5e-05,-5e-06,1.1e-05,2.3e-05,-1.4e-05,-1.6e-05,2e-05,2.6e-05
-3.1e-05,-1.3e-05,-6e-06,-3.9e-05,-4.2e-05,0.000121,-1e-05,3.5e-05,5e-06,0.000159,-2.7e-05,-4e-05,-5.1e-05,6e-06,-4e-06,-9.7e-05,-1.6e-05,6.3e-05,0,-1e-05,-8.1e-05,-2.6e-05,-2.4e-05,3e-06,8e-06,6.4e-05,-1.5e-05,2.4e-05,-5e-06,2e-06,-1.7e-05,5e-06,2.9e-05,-1.4e-05,-2e-05,-1.2e-05,1.2e-05,6e-05,-5e-06,1.1e-05,-4e-06,-1.7e-05,-1e-06,1.4e-05,1.5e-05,9e-06,1e-06,4.4e-05,-9e-06,-1.2e-05,2.1e-05,5.3e-05,-2.2e-05,3e-06,-7.6e-05,-7e-06,-9e-06,-2.3e-05,-7e-06,-1.1e-05,1.4e-05,5e-06,4.2e-05,1.5e-05,1.3e-05,1.2e-05,-3e-06,-6e-06,-1.1e-05,-1.3e-05,-1e-05,6.3e-05,6e-06,2.8e-05,1e-06,1.4e-05,-2e-05,1.5e-05,-2.7e-05,3.8e-05,3.7e-05,1.2e-05,-2e-06,-2.3e-05,-2.5e-05,-8e-06,-3.3e-05,2.8e-05,-1.9e-05,-2e-06,-0.000137,-1e-05,-3e-06,2.3e-05,9e-06,-1e-06,2e-06,-1.4e-05,-9e-06,2.1e-05,-1e-05,-3e-06,-8e-06,-3e-06,2.2e-05,-1.3e-05,-2.4e-05,-1.6e-05,2.6e-05,-5e-06,1.4e-05,0,-2e-06,2.1e-05,-4e-06,-5e-06,-1.9e-05,-2e-06,9e-06,-2.1e-05,-2.5e-05
3.2e-05,9e-06,-1.3e-05,4.5e-05,7e-06,-7.9e-05,9e-06,-2e-06,1.1e-05,2.8e-05,3.3e-05,3.2e-05,6.2e-05,1.3e-05,6e-06,5e-05,3e-05,-7.1e-05,2e-06,-2e-06,1e-05,-5e-06,1.1e-05,0.000104,-1.5e-05,-2.8e-05,2e-06,-9.7e-05,1.7e-05,-7e-06,3e-06,-6e-06,-3e-06,-2.3e-05,4.8e-05,-5e-06,-7e-06,-1.5e-05,-8e-06,-1.9e-05,3e-06,3.2e-05,-7e-06,-2e-06,-1e-06,1.1e-05,-5e-06,-1.8e-05,1.3e-05,4e-06,-7.3e-05,1.1e-05,1.5e-05,1e-06,6e-05,-1.6e-05,8e-06,3.2e-05,2.3e-05,-1e-05,1.1e-05,2.4e-05,-3.1e-05,-2.3e-05,9e-06,-1.6e-05,1.2e-05,1.8e-05,-6e-06,4e-06,-3.1e-05,-5.5e-05,-2e-06,-3.3e-05,4e-06,-2.7e-05,0,3.7e-05,2.7e-05,-1.4e-05,-3e-05,-1.1e-05,-2e-06,5.3e-05,2.1e-05,7e-06,3.5e-05,-2.5e-05,5.5e-05,-1e-05,0.000148,1.3e-05,1e-06,-3.2e-05,-8e-06,1e-06,-9e-06,1.1e-05,-9e-06,-2.1e-05,5e-06,0,1e-06,1.2e-05,-2.6e-05,1e-05,4.4e-05,3e-06,-2e-06,1e-05,1e-06,-2e-06,4e-06,3.6e-05,7e-06,-1e-05,6e-06,1e-05,-1e-05,3e-06,1.5e-05
-4.7e-05,0,1.2e-05,-4.1e-05,3e-05,1.3e-05,-8e-06,-5.3e-05,-4e-06,-0.000212,-5.1e-05,9e-06,-6.8e-05,-1.9e-05,-5e-06,4e-05,-2.2e-05,7.3e-05,-8e-06,1e-06,4.9e-05,9e-06,0,-5e-05,9e-06,2.3e-05,8e-06,4e-05,-2.2e-05,1e-06,-2e-06,-1e-05,2.2e-05,2.3e-05,-2.5e-05,1e-05,0,-5.4e-05,-5e-06,1.7e-05,1.1e-05,-2.7e-05,0,1.7e-05,2e-06,-7e-06,5e-06,-2.3e-05,-2e-06,2e-06,4.4e-05,-3.4e-05,-9e-06,5e-06,-3e-06,4e-06,-1e-06,-3.8e-05,-2.9e-05,-1.4e-05,2.9e-05,-1.7e-05,2.2e-05,1.4e-05,0,1.9e-05,2e-06,-1e-05,1.9e-05,1.3e-05,3.3e-05,3e-06,-2e-06,2.3e-05,1e-06,2.7e-05,1.3e-05,-1e-05,4.1e-05,1.3e-05,1.9e-05,3.1e-05,3e-06,-1.7e-05,1.7e-05,-1e-06,-2.9e-05,2.1e-05,-2.3e-05,5e-06,-0.000118,-1e-06,-1e-06,3.3e-05,5e-06,0,-2e-06,-9e-06,1.1e-05,3e-06,-9e-06,-1e-06,1.2e-05,-1.1e-05,2.5e-05,-1.5e-05,-4.7e-05,3e-06,-1.7e-05,-3e-06,-7e-06,-1e-06,-1.8e-05,-2.1e-05,-2e-06,3e-06,-6e-06,-6e-06,7e-06,1.8e-05,-1.8e-05
4.8e-05,-3.2e-05,2e-06,2.5e-05,-2.2e-05,2.3e-05,5e-06,9.9e-05,-9e-06,0.000206,3.6e-05,-3.8e-05,7e-05,0,3e-06,-8.9e-05,1.3e-05,-9.1e-05,5e-06,-4e-06,-6.1e-05,-1e-06,-9e-06,-3.1e-05,-6e-06,-5.5e-05,-1.1e-05,3.5e-05,1.1e-05,-2e-06,1.1e-05,-1e-06,-4.9e-05,-1e-06,-2e-05,1e-06,3e-06,7.4e-05,-6e-06,-3e-06,6e-06,1.1e-05,1e-06,-5.3e-05,-1.2e-05,0,-2e-06,3.8e-05,0,2e-06,2.7e-05,1e-05,4e-06,-9e-06,-4.5e-05,1.5e-05,0,5.4e-05,2.5e-05,-2e-06,-2.3e-05,2.4e-05,-1.3e-05,-1e-05,0,-2.5e-05,-1.2e-05,2e-06,-7e-06,-2.8e-05,-3e-06,4.2e-05,1e-06,1.2e-05,-2e-06,-1.3e-05,-2e-05,-1.2e-05,-5e-05,9e-06,-1e-05,-3.5e-05,-5e-06,-5e-06,-3.5e-05,-6e-06,2.5e-05,-1.5e-05,1e-06,3e-06,5.3e-05,-2e-05,0,-2.5e-05,-1e-06,0,3e-06,1.2e-05,-1.3e-05,8e-06,-3e-06,3e-06,-1.6e-05,8e-06,-1.7e-05,8e-06,4.4e-05,-1.4e-05,1.6e-05,-6e-06,8e-06,1e-06,2.3e-05,-3e-05,2e-06,8e-06,1e-05,-2e-06,-6e-06,-2.5e-05,2.1e-05
-5.2e-05,1.4e-05,-1e-06,1e-06,-6e-06,-1.8e-05,-9e-06,-9.2e-05,4e-06,-5.9e-05,-1.2e-05,4.4e-05,-7.5e-05,1.8e-05,-1e-06,7.5e-05,-1.6e-05,9.9e-05,-6e-06,4e-06,4.8e-05,-1.4e-05,1.4e-05,-6e-06,-2e-06,8.3e-05,5e-06,-4e-06,1.2e-05,0,-1.4e-05,-4e-06,6.2e-05,5e-06,4.6e-05,-4e-06,-6e-06,-3.3e-05,-1e-06,-2.1e-05,7e-06,4e-06,-2e-06,4.4e-05,-2e-06,4e-06,0,-3.3e-05,-9e-06,-7e-06,-6.7e-05,2.4e-05,4e-06,2e-06,5.4e-05,-1e-06,-4e-06,-6.8e-05,-1.4e-05,-2e-06,-5e-06,-1.5e-05,2e-06,8e-06,-9e-06,2e-05,-1e-06,-5e-06,2.7e-05,3.2e-05,-3.1e-05,-5.3e-05,2e-06,-2.4e-05,-2e-06,6e-06,1.2e-05,-3.6e-05,-3.5e-05,-9e-06,0,1.8e-05,5e-06,2.2e-05,-4e-06,4e-06,-2.7e-05,3e-06,-1.7e-05,1e-06,1.6e-05,3.3e-05,3e-06,1.9e-05,2e-06,-1e-06,6e-06,-9e-06,6e-06,6e-06,6e-06,3e-06,-1.1e-05,1e-06,3e-06,5e-06,-2.6e-05,1.5e-05,-6e-06,7e-06,-2e-05,0,-1.1e-05,1.8e-05,4e-06,-2e-06,-7e-06,7e-06,2e-06,1.7e-05,-1.4e-05
5.5e-05,-2e-06,-1e-06,-3.6e-05,1.7e-05,1.6e-05,3e-06,4.4e-05,6e-06,-5.2e-05,6e-06,-1.2e-05,7.8e-05,-1e-06,-3e-06,-1.9e-05,2.9e-05,-9.1e-05,-1.9e-05,1e-06,-3.6e-05,1.9e-05,-1.3e-05,6.7e-05,2e-06,-8e-05,1e-06,-4.1e-05,-1e-05,7e-06,1.5e-05,-1e-06,-5.4e-05,-1.6e-05,-2.2e-05,0,7e-06,-2e-06,5e-06,2.8e-05,-3e-06,1e-06,4e-06,-3.4e-05,0,-3e-06,0,5e-06,1.6e-05,8e-06,3.9e-05,-2.4e-05,-1.2e-05,7e-06,-1.6e-05,-1.1e-05,4e-06,6.8e-05,-5e-06,8e-06,-1e-05,-1.2e-05,2.6e-05,7e-06,-1e-05,-1.1e-05,1e-05,9e-06,3e-06,-3.6e-05,2.4e-05,2.3e-05,-3e-06,1.4e-05,2e-06,-2.1e-05,-3e-06,6.5e-05,7.3e-05,1.7e-05,2.2e-05,-1.7e-05,-1e-06,-2.8e-05,3.7e-05,-6e-06,2.8e-05,1.5e-05,2.2e-05,-8e-06,-7.9e-05,-2.7e-05,1e-06,-2.4e-05,-5e-06,0,-2e-06,9e-06,9e-06,-1.7e-05,-2e-06,-7e-06,2.8e-05,-1e-06,1e-05,-9e-06,-4e-06,0,-4e-06,-5e-06,1.7e-05,1e-06,6e-06,2e-05,1e-06,-1.2e-05,-5e-06,-5e-06,3e-06,3e-06,1.5e-05
-5.7e-05,2e-06,-1e-06,6.8e-05,-3e-06,-3.3e-05,2e-06,-5e-06,-2e-06,5.4e-05,7e-06,-3.1e-05,-7.8e-05,-1.5e-05,8e-06,-5.8e-05,-2.7e-05,9.2e-05,1.3e-05,0,-2.6e-05,-1e-06,5e-06,-1.5e-05,-6e-06,4.8e-05,-6e-06,-2.5e-05,-1e-06,-1e-06,-9e-06,1e-06,3.3e-05,-3e-06,-2.1e-05,2e-06,-6e-06,1.4e-05,7e-06,-1e-05,-4e-06,-8e-06,2e-06,4.8e-05,6e-06,-5e-06,-1e-06,2.3e-05,-6e-06,-7e-06,3.2e-05,-1.4e-05,1.5e-05,-3e-06,-3.9e-05,-3e-06,-4e-06,-6.8e-05,2.2e-05,7e-06,1.3e-05,1.6e-05,-3.5e-05,-1.5e-05,5e-06,9e-06,-1e-06,-7e-06,-8e-06,4.5e-05,1.2e-05,3.1e-05,5e-06,-1.7e-05,0,4e-05,-1.7e-05,1e-06,1.2e-05,-2.9e-05,-3.5e-05,1.3e-05,-2e-06,-3.3e-05,-1.1e-05,5e-06,-2.3e-05,-2.8e-05,2.5e-05,1.4e-05,0.000121,1.5e-05,0,3.6e-05,7e-06,0,-3e-06,-1e-05,-7e-06,2e-06,8e-06,-1e-06,-5e-06,-6e-06,-2.1e-05,1.1e-05,3.4e-05,-1.1e-05,1e-06,-5e-06,-1.5e-05,0,-2.4e-05,-4e-06,-4e-06,-2e-06,4e-06,-4e-06,-1e-06,-1.9e-05,-1.6e-05
