9.9e-05,0.000106,4.3e-05,8.3e-05,3.6e-05,6e-06,2.8e-05,4.4e-05,4.6e-05,6.4e-05,9e-06,4e-05,8.3e-05,6.9e-05,0.000777,2e-06,0.000444,9.6e-05,0.000194,0.000119,7.7e-05,9.3e-05,1.6e-05,0.000352,0.000136,3e-05,0.000597,0.000342,0.000148,0.000171,7.3e-05,0.000312,0.000135,0.000253,0.000952,0.00013,0.000126,0.000357,0.000743,0.000257,0.000178,0.000352,4.8e-05,0.00094,0.000474,0.000254,0.000249,0.000648,5.4e-05,0.000411,0.00047,0.000422,0.000318,0.000527,0.000349,0.000405,0.000235,4.2e-05,0.000154,4.6e-05,0.000369,0.000113,3.8e-05,0,7.2e-05,9.1e-05,0,0.000136,5.9e-05,2.2e-05,2e-06,7.6e-05,2e-05,0.000102,2.3e-05,1.9e-05,0.000368,0.000102,8.3e-05,5.7e-05,3.3e-05,7.4e-05,5.6e-05,2e-05,7.1e-05,8.8e-05,8.3e-05,8.3e-05,3.3e-05,2.9e-05,0.000112,1e-06,1e-06,6.7e-05,2.6e-05,1.2e-05,2.6e-05,3e-06,4e-05,0.000132,0.000111,4.9e-05,4.1e-05,4.2e-05,7.7e-05,3.1e-05,6.4e-05,1.7e-05,2.5e-05,3.2e-05,2.4e-05,4.5e-05,1.4e-05,4.2e-05,2.7e-05,7e-06,4.5e-05,4.2e-05,4.8e-05,4.9e-05,1.3e-05
0.000182,0.000347,0.000279,0.000263,0.000255,0.000164,9.4e-05,0.000146,0.000105,0.000193,0.000167,0.000155,0.000218,0.00011,0.002157,0.001043,0.000612,0.00022,0.000574,0.000627,0.000206,0.000227,0.000488,0.000888,0.000782,0.000713,0.001696,0.002202,0.002365,0.000874,0.000636,0.000325,0.000429,0.000768,0.000916,0.001289,0.00137,0.000268,0.002854,0.001843,0.000292,0.000907,0.000774,0.001216,0.001495,0.001469,0.001419,0.001318,0.000315,0.00119,0.000537,0.000763,0.001164,0.001767,7.5e-05,0.001165,0.00067,0.000401,0.000205,0.000197,0.000845,0.00025,5.4e-05,0.000203,0.000185,0.000327,0.000221,0.000328,0.000274,0.000123,0.000166,0.000184,0.000119,0.00012,0.000128,0.000112,0.000635,0.000447,0.000444,0.000249,0.000146,0.000156,0.000361,0.000425,0.000284,0.000174,6.2e-05,0.000157,9.8e-05,0.000133,0.000292,8.7e-05,2.9e-05,0.000125,0.000188,0.000138,4e-05,4.6e-05,5.7e-05,0.000468,0.000197,3.8e-05,0.000127,0.000199,0.000215,0.000167,0.000149,0.00013,6.9e-05,0.000126,7.6e-05,7.7e-05,9.8e-05,0.000105,0.000128,9.9e-05,9.7e-05,0.000127,4.3e-05,0.000113,7.5e-05
2.5e-05,0.000172,4.4e-05,5.7e-05,2.2e-05,5.5e-05,6.9e-05,8.5e-05,3.3e-05,9.8e-05,3.7e-05,0.00013,0.000131,0.000154,0.002702,0.001603,0.001254,0.000144,0.000703,0.000247,0.000393,4.8e-05,0.000522,0.000411,0.000344,0.000198,0.00358,0.003838,0.001917,0.002101,0.00168,0.002111,0.000191,0.00149,0.002015,0.00189,0.000214,0.001098,0.00287,0.000831,0.000938,0.001083,0.00138,0.002178,0.00116,0.000164,0.001358,0.001977,0.000438,0.000463,0.000822,0.001235,0.001967,0.001674,0.001526,0.001166,0.001108,0.001494,0.000696,7.3e-05,0.001284,0.000426,0.000186,0.000358,7.1e-05,0.000378,0.000135,0.000315,0.000145,0.000338,0.000434,0.000428,0.000343,0.000239,0.000127,4.6e-05,0.000678,0.000832,0.000371,0.000209,0.000221,7.9e-05,0.000251,0.000583,0.000311,0.000118,0.000493,0.000186,0.000126,0.000115,0.000214,0.000125,9.5e-05,9.3e-05,0.000125,6.1e-05,7e-05,0.00016,6.9e-05,0.000686,0.000315,5.7e-05,0.000115,0.000119,3.5e-05,0.000108,9.2e-05,6e-05,5.2e-05,8.4e-05,0.000109,0.000131,4.9e-05,5.6e-05,4.4e-05,5.3e-05,0.000112,0.000144,0.000102,6.5e-05,2.3e-05
8.3e-05,4e-05,7.6e-05,5.9e-05,6.9e-05,5.6e-05,8.5e-05,4.9e-05,8.5e-05,8.9e-05,0.000106,0.000113,0.000151,0.000224,0.001842,0.001348,0.001298,0.000154,0.000575,0.000882,0.000364,7.6e-05,0.000534,0.00075,0.000562,0.000121,0.004638,0.003069,0.002627,0.001207,0.001159,0.003775,0.00382,0.003036,0.003225,0.00221,0.000522,0.001158,5e-04,0.001162,0.000495,0.001377,0.00082,0.001718,0.000506,0.00034,0.002125,0.001315,0.001557,0.000784,0.000555,0.000622,0.00196,0.001583,0.00057,0.00174,0.000294,0.001058,0.00028,0.000177,0.001448,0.000526,0.000699,0.00013,6.1e-05,0.000189,0.000168,0.000396,0.000358,0.000488,0.00089,0.000369,0.000192,0.00032,5.8e-05,8.1e-05,0.000615,0.000686,0.00053,0.000165,0.000187,0.000137,0.000488,0.00058,0.000216,0.000125,0.000438,0.000108,8.7e-05,7.1e-05,0.000252,0.000186,1.1e-05,9.2e-05,8.3e-05,0.000118,5.6e-05,0.000177,0.000165,0.000893,0.000754,0.000512,0.000125,0.000138,0.000137,0.000174,0.00022,0.000145,4e-05,4.2e-05,0.000168,0.000179,0.000165,1.2e-05,0.000108,0.000144,9.2e-05,0.00011,2.6e-05,2.4e-05,0.000146
0.000124,6.5e-05,3.6e-05,7.7e-05,5.5e-05,1.8e-05,2.6e-05,0.00011,8.4e-05,7e-05,7.2e-05,0.000143,0.000346,2e-04,0.000728,0.000723,0.00048,0.000211,0.000493,0.002045,0.000733,0.000167,0.00078,0.001126,0.000415,6.7e-05,0.005192,0.003316,0.000809,0.002121,0.00143,0.004837,0.004934,0.001635,0.003451,0.000639,0.001379,0.001223,0.000677,0.000599,0.001169,0.001797,0.002689,0.001073,5e-04,0.000438,0.003097,0.002993,0.001908,0.002356,0.001494,0.001555,0.001244,0.002035,0.001507,0.000657,0.000108,0.000658,0.000779,0.000727,0.001146,0.001029,0.001904,0.001024,0.000308,0.000612,0.000413,0.000391,0.000291,0.000248,0.000823,0.00077,0.000313,0.000443,0.000348,0.000143,0.000514,0.001401,0.000693,0.000273,0.000154,0.000131,0.000866,0.000217,0.000188,0.000186,4.2e-05,0.000242,0.000138,8.3e-05,0.000302,0.000521,0.000309,9.7e-05,7.9e-05,0.000217,0.000152,7.3e-05,0.000132,0.000804,0.000503,6.5e-05,0.000152,9e-05,6e-05,0.000121,9.2e-05,6.4e-05,7.3e-05,5.1e-05,9.7e-05,0.000106,0.000115,0.000132,3.6e-05,0.000228,0.000136,0.00011,0.000161,7.7e-05,0.000238
0.000108,8.2e-05,3.5e-05,2e-05,9.9e-05,4.7e-05,3.3e-05,0.000141,7.9e-05,0.000111,2.2e-05,7.8e-05,0.000343,0.00027,0.002977,0.000826,0.000998,6.8e-05,0.000378,0.001303,0.000842,8.3e-05,0.000601,0.000968,0.00063,0.000221,0.004971,0.001355,0.00196,0.001691,0.002335,0.008257,0.003847,0.00101,0.003827,0.00285,0.002186,0.001501,0.002442,0.00209,0.001157,0.002803,0.005402,0.003342,0.001577,0.001046,0.004839,0.002396,0.002611,0.001587,0.001992,0.001114,9e-04,0.003388,0.003423,0.003494,0.001994,0.001639,0.001193,0.000887,0.000633,0.000958,0.001589,0.000426,0.000238,0.000929,0.000444,0.000338,0.000354,0.000435,0.000784,0.000292,0.000283,0.000518,0.000384,0.000235,0.000474,0.00168,0.00061,0.000341,0.000168,0.000164,0.000708,0.000154,0.000204,0.000163,0.000589,0.000202,0.000175,0.000182,0.000126,0.000769,0.000443,0.000153,0.000132,0.00023,9.2e-05,2.6e-05,6.8e-05,0.000495,0.000364,9.3e-05,8.2e-05,0.000217,4.7e-05,7e-05,0.000159,4.5e-05,8.5e-05,0.000139,0.000148,6e-05,9.2e-05,0.000111,0.000144,0.000177,0.000146,0.000108,4.4e-05,8.7e-05,0.000139
0.000114,0.000188,7.9e-05,0.000162,0.000164,0.000147,8.4e-05,0.000166,7.1e-05,7.5e-05,0.000105,5.5e-05,0.00044,0.000153,0.003742,0.00225,0.001852,0.000567,0.00027,0.00333,0.001219,0.000132,0.000467,0.001533,0.000526,1e-05,0.004328,0.002609,0.001496,0.001212,0.000812,0.00861,0.013304,0.008081,0.002654,0.000966,0.00074,0.000947,0.00267,0.004024,0.000696,0.002805,0.003137,0.0037,0.002617,0.00225,0.004248,0.003746,0.003781,0.004256,0.00245,0.003506,0.003778,0.003995,0.003074,0.004225,0.003224,0.001005,0.000186,0.001456,0.002245,0.000775,0.001832,0.001706,0.001062,0.000711,0.00048,0.000701,0.000199,0.000258,0.001003,0.000464,0.000387,0.000397,0.000286,0.000206,0.000512,0.000614,0.000271,0.000171,9.8e-05,0.000333,0.000409,0.000512,0.000232,0.000188,0.000992,0.000324,0.000167,5.8e-05,0.000148,0.001389,0.000542,0.000107,0.000163,0.000198,9e-05,8.9e-05,0.000183,0.000687,0.000155,9e-05,5.2e-05,0.000157,0.000317,0.000194,0.000188,0.000153,5.8e-05,0.000193,5.9e-05,2e-05,6.7e-05,0.000131,0.000134,0.000224,0.000124,7.7e-05,0.00013,0.000184,0.000176
0.000148,0.000111,0.000116,0.000246,9.6e-05,5.5e-05,8.8e-05,0.000138,0.000102,7e-05,1.2e-05,9e-05,0.000433,0.000704,0.004051,0.000603,0.001916,0.000916,0.000914,0.008202,0.004223,0.001433,0.000864,0.000547,0.000986,0.000418,0.003067,0.002066,0.002719,0.003289,0.002298,0.009013,0.0078,0.005395,0.00704,0.00483,0.000862,0.002846,0.007164,0.00281,0.002544,0.001594,0.005524,0.008695,0.007181,0.002798,0.003262,0.006532,0.002944,0.003622,0.005865,0.001423,0.001863,0.000539,0.003858,0.00127,0.00399,0.003619,0.00179,0.001264,0.001167,0.00191,0.000487,0.000913,0.000432,0.001115,0.001182,0.000926,0.000783,0.00047,0.00099,0.00104,0.000732,0.000327,0.000402,0.000241,0.000444,0.00098,0.000836,0.000507,0.000129,0.000164,0.001647,0.001627,0.000962,0.000487,0.00112,0.000935,0.000355,0.000109,0.000263,0.00224,0.001375,0.000494,0.000191,0.000181,0.000109,8.3e-05,0.000178,0.001112,0.000547,0.000131,0.000132,0.00013,0.000229,0.00027,0.000185,0.000196,0.000106,0.00017,0.000275,0.000155,0.000208,0.000181,0.000191,0.000264,0.000148,3.9e-05,8.3e-05,0.000198,0.000255
0.000139,0.000108,0.000158,0.000198,0.000172,0.000107,6.5e-05,0.000142,0.000147,0.000197,0.000164,0.000166,0.000269,0.000896,0.005547,0.006044,0.00397,0.002503,0.001115,0.01084,0.006562,0.002231,0.000692,0.000391,0.000944,0.000627,0.001877,0.001709,0.002875,0.00205,0.000725,0.006728,0.005082,0.001293,0.003138,0.002936,0.001945,0.004047,0.00608,0.005648,0.00242,0.001959,0.003833,0.003687,0.005607,0.002804,0.002644,0.002699,0.00174,0.002826,0.004498,0.003581,0.001852,0.000568,0.003749,0.002838,0.002416,0.00036,0.000807,0.000486,0.001106,0.00106,0.000976,0.000343,0.000225,0.00041,0.000373,0.000412,0.000208,0.000474,0.000479,0.00045,0.000556,0.000384,0.00046,0.000202,0.000338,0.001414,0.002474,0.001238,0.00042,0.000133,0.002061,0.002346,0.000966,0.000159,0.001211,0.001153,0.000607,0.000204,0.000399,0.002474,0.001299,0.000391,0.000129,7.7e-05,8.3e-05,0.000161,1e-05,0.001425,0.001474,0.000813,0.000249,0.000218,0.000298,6.6e-05,0.000157,1.4e-05,3.7e-05,0.000117,0.000191,0.000202,0.000135,1.5e-05,7.1e-05,8.6e-05,0.000179,0.000137,5.2e-05,0.000113,0.000253
2.2e-05,3.3e-05,7.5e-05,4.1e-05,7.1e-05,2.7e-05,1.4e-05,7.3e-05,6.2e-05,7.6e-05,9.1e-05,3.2e-05,0.000322,0.000719,0.00503,0.00934,0.00584,0.002034,0.00032,0.009252,0.005551,0.002188,0.000636,0.000782,0.000858,0.000468,0.001178,0.00065,0.00085,0.001038,0.000281,0.003205,0.003868,0.00236,0.002554,0.001592,0.000943,0.002692,0.007913,0.004233,0.001589,0.00061,0.001383,0.004395,0.005056,0.003153,0.000642,0.001882,0.001335,0.001034,0.001176,0.001272,0.000599,0.000738,0.002473,0.00179,0.001539,0.000525,0.000641,0.000323,0.000555,0.000654,0.000343,0.000276,0.000409,0.000188,0.000294,0.000242,0.000288,0.000114,0.000429,0.000504,0.000585,0.000345,0.000209,7.3e-05,0.000296,0.000835,0.002698,0.00133,0.000487,0.000342,0.001554,0.000537,0.000471,0.000119,0.001014,0.000574,0.000326,0.000194,0.000617,0.001566,0.00075,0.000244,0.000177,2.1e-05,7e-06,0.000117,0.000117,0.001484,0.001626,0.000666,0.000224,0.000331,0.000181,9.6e-05,9.7e-05,0.000105,6e-05,9.6e-05,2.9e-05,5.9e-05,0.000109,9.9e-05,4.3e-05,5.6e-05,8.3e-05,3.5e-05,1.1e-05,6.9e-05,0.000139
6e-06,2.8e-05,5.2e-05,2.5e-05,4.8e-05,1.1e-05,1e-05,2.7e-05,7.4e-05,4.9e-05,3.3e-05,7.9e-05,0.000334,0.00041,0.003965,0.005369,0.002597,0.000987,0.000651,0.00522,0.002505,0.001274,0.000661,0.001286,0.000381,0.000346,0.001042,0.000285,0.001625,0.000894,0.000604,0.00048,0.001628,0.00096,0.001819,0.001027,0.000575,0.001232,0.005209,0.004055,0.000494,0.000293,0.00032,0.002939,0.003469,0.001441,0.000459,0.000795,0.000824,0.000924,0.001182,0.001732,0.000558,0.001184,0.001372,0.000258,0.001386,0.001042,0.00078,0.000752,0.00041,0.000235,2.2e-05,7.5e-05,4.3e-05,0.000379,0.000295,6.1e-05,0.000216,0.000167,0.000328,0.000488,0.000128,0.000151,0.000117,6.8e-05,0.000201,0.000174,0.002189,0.001262,0.000535,0.000326,0.000599,0.00122,0.000769,0.000281,0.000777,0.000497,0.000222,0.000192,0.000475,0.000642,0.000404,0.000198,7.7e-05,3.2e-05,7.3e-05,6.7e-05,4.3e-05,0.001512,0.000935,0.000518,0.000214,0.000169,0.000118,0.000119,6e-05,5.4e-05,2.2e-05,2.8e-05,1.9e-05,2.7e-05,8.9e-05,4.9e-05,1.6e-05,8e-06,8.1e-05,7.7e-05,5.5e-05,4.3e-05,8.5e-05
2.8e-05,1.4e-05,4.7e-05,2.9e-05,2.7e-05,6e-06,1.8e-05,2.4e-05,3.1e-05,2.6e-05,3.1e-05,0.000105,0.000223,0.000171,0.003944,0.000215,0.00088,0.000202,0.000559,0.00134,0.000432,0.000774,0.000324,0.000686,0.000415,0.000237,0.000293,0.000964,0.001535,0.00102,0.00083,0.001193,0.001443,0.001073,0.001915,0.001485,0.001257,0.000909,0.002026,0.002091,0.001401,0.000338,0.001121,0.004324,0.002443,0.000867,0.000738,0.001351,0.000353,0.000559,0.000745,0.001022,0.000783,0.001,0.001367,0.000125,0.001437,6.3e-05,0.000154,0.000123,0.000867,5.1e-05,3.3e-05,2.6e-05,0.000141,0.000192,0.000289,0.000208,0.000207,0.000144,0.000107,0.000375,0.000117,9.5e-05,0.000245,0.000145,0.000197,0.000668,0.001986,0.001028,0.000298,0.000287,6.2e-05,0.000624,0.000267,8.5e-05,0.000579,0.000209,4.6e-05,0.000173,0.00045,0.000205,0.000129,4.3e-05,6.9e-05,2.2e-05,5.4e-05,7.9e-05,1.3e-05,0.001227,0.000247,0.000143,5.6e-05,0.000113,1.8e-05,6.5e-05,3.6e-05,3.5e-05,2.1e-05,2.5e-05,3.1e-05,3.4e-05,5.6e-05,2.4e-05,1.3e-05,2.1e-05,4.4e-05,2.9e-05,2.1e-05,1.7e-05,5.1e-05
1.8e-05,1.1e-05,4.9e-05,2.4e-05,2.7e-05,1.1e-05,1.6e-05,2.4e-05,5e-06,4.5e-05,3.3e-05,9e-05,0.000241,6.2e-05,0.003075,0.000575,0.001494,0.000671,0.000435,0.000828,0.000194,0.000745,0.000255,0.000239,0.000179,0.000202,0.000488,0.001807,0.002688,0.001035,0.001209,0.001767,0.001512,0.001096,0.003321,0.000142,0.001264,0.000932,0.000863,0.003045,0.001688,0.000982,0.002637,0.003419,0.002534,0.000667,0.001104,0.000958,0.000708,0.000894,0.002291,0.002096,0.000568,0.001485,0.001713,0.00117,0.000954,0.000837,0.000612,0.000145,0.001271,0.00037,0.000313,0.000132,0.000165,0.000387,0.000356,0.000294,0.000214,3.2e-05,9.4e-05,0.000515,1.3e-05,4.8e-05,0.000113,0.000112,0.000114,0.00096,0.000799,0.000429,7.9e-05,0.000446,0.000156,9.9e-05,0.000126,8.4e-05,0.00038,0.000154,2.9e-05,0.000234,0.000785,0.000419,0.000253,6.5e-05,3.7e-05,1.2e-05,8e-06,4.7e-05,2.9e-05,0.000703,0.00027,0.000114,0.000113,6.9e-05,1.5e-05,2.6e-05,4.9e-05,2.1e-05,4e-06,1.3e-05,3e-05,2.1e-05,4e-05,1.4e-05,2.1e-05,2.4e-05,2e-05,3.2e-05,4e-05,4.3e-05,3.8e-05
1.5e-05,1e-05,3.4e-05,2.8e-05,1.8e-05,1.8e-05,1.7e-05,1.5e-05,1.9e-05,2.7e-05,3.7e-05,4.1e-05,0.000164,0.00013,0.001745,0.00228,0.001943,0.000684,0.000203,0.00071,8.1e-05,0.000748,0.000198,0.000109,0.000184,8.8e-05,0.000393,0.001257,0.002387,0.001069,0.00016,0.000931,0.001965,0.001164,0.004252,0.003685,0.000995,0.001255,0.000815,0.001199,0.001948,0.000767,0.003841,0.002624,0.002093,0.002292,0.002105,0.001913,0.000334,0.001484,0.001944,0.0024,0.001229,0.003698,0.001226,0.00075,0.000526,0.001957,6e-04,0.000412,0.001197,0.000524,0.000198,4.9e-05,0.000415,0.000425,0.000272,0.000418,0.000327,0.000121,0.000165,0.000356,0.000249,1.7e-05,0.000169,9.2e-05,0.000151,0.001065,0.000485,0.000246,4.3e-05,0.00057,0.000119,0.000108,0.000165,0.000114,0.000196,5.8e-05,0.000117,0.000238,0.000635,0.000151,8.6e-05,3.3e-05,7.3e-05,2e-06,4.7e-05,6.3e-05,2.8e-05,0.000313,3e-05,4.7e-05,0.000111,4.9e-05,3.5e-05,2.2e-05,4.7e-05,2.1e-05,2.5e-05,7e-06,1.1e-05,1e-05,3.6e-05,2.5e-05,1e-05,2.9e-05,2.1e-05,1.9e-05,5.4e-05,2.5e-05,7.4e-05
1.5e-05,1.9e-05,3.1e-05,1.8e-05,3.2e-05,1.4e-05,2.2e-05,3.3e-05,3.6e-05,3e-05,4e-05,4e-05,0.000211,0.000201,0.002491,0.001413,0.00187,0.000793,0.000413,0.000671,7e-06,0.000759,0.00083,0.000307,8.3e-05,0.00016,0.000136,0.000929,0.001799,0.002171,0.003607,0.00058,0.003007,0.003475,0.004639,0.000856,0.004103,0.004327,0.003905,0.00328,0.00174,0.003115,0.00482,0.004645,0.003381,0.002336,0.00322,0.002068,0.001979,0.001511,0.00404,0.000938,0.001758,0.004638,0.000845,0.002829,0.001557,0.001528,0.001386,0.001021,0.002101,0.000291,0.000148,0.000502,0.000403,0.000847,0.00044,0.000172,0.00048,0.000268,0.000607,0.00066,0.000159,0.000174,0.000241,5.1e-05,0.000138,0.000898,0.000333,0.000161,0.000123,0.000527,0.000269,3.7e-05,0.000146,4.4e-05,0.000209,0.000128,0.000181,0.000357,0.000654,0.000361,0.000112,3.5e-05,9e-05,3.3e-05,7e-05,0.000117,7.7e-05,0.000533,0.000106,7e-05,0.000157,0.000159,7.7e-05,5.1e-05,0.000109,8.5e-05,3.9e-05,4.5e-05,4e-05,1.9e-05,3.7e-05,4.3e-05,1.7e-05,5.4e-05,3.2e-05,3.8e-05,7.1e-05,8.1e-05,7.8e-05
1e-05,3e-05,3e-05,3.5e-05,4.5e-05,4.1e-05,4e-05,2.3e-05,3.1e-05,4.8e-05,8e-06,3.9e-05,0.000198,0.000175,0.002313,0.002373,0.002178,0.000706,0.001173,0.000604,0.000382,0.000825,0.001618,0.000982,0.000466,0.000228,0.000276,0.003625,0.005182,0.00828,0.009041,0.005457,0.005595,0.002252,0.006414,0.00849,0.006643,0.001872,0.004207,0.009034,0.008226,0.004497,0.003993,0.002142,0.007497,0.00635,0.007833,0.004296,0.000417,0.00226,0.005386,0.006312,0.000653,0.002784,0.005988,0.003612,0.005689,0.003798,0.000397,0.000511,0.004558,0.002488,0.000802,0.001049,0.000977,0.002871,0.00214,0.001456,0.000743,0.000549,0.000839,0.000155,0.000359,0.000236,0.00049,0.000283,0.000176,0.00072,0.000137,0.000347,3e-04,0.000436,0.000454,0.000289,7.5e-05,5.4e-05,0.00019,0.000214,6.5e-05,0.00023,0.000775,0.00056,0.000475,0.00033,0.000127,2.1e-05,6.5e-05,0.000103,6.8e-05,0.000393,0.000423,0.000332,0.000103,9.8e-05,7.6e-05,8e-05,6.4e-05,6.5e-05,3.1e-05,6.3e-05,1.4e-05,2.5e-05,5e-05,0.000122,6.5e-05,0.00011,0.000121,6.6e-05,1e-05,9.1e-05,8.1e-05
2e-05,4.4e-05,5.5e-05,6.3e-05,4.4e-05,1.9e-05,3.4e-05,1.9e-05,1.6e-05,1.8e-05,5.5e-05,6.9e-05,0.000177,0.000198,0.000959,0.001419,0.002369,0.001996,0.00096,8.1e-05,7.4e-05,0.000631,0.001033,0.000413,0.000227,8.2e-05,0.000827,0.005662,0.005341,0.011057,0.011516,0.005071,0.000903,0.0078,0.00902,0.008877,0.012071,0.013691,0.004249,0.007162,0.009666,0.01286,0.008515,0.00224,0.008043,0.010591,0.001719,0.003944,0.008093,0.005893,0.007898,0.011843,0.00995,0.00722,0.009599,0.010681,0.008682,0.003885,0.003625,0.001658,0.005719,0.007895,0.005011,0.000976,0.000488,0.003249,0.003055,0.001923,0.003049,0.002209,0.001501,0.001175,0.000789,0.001016,0.00112,0.001058,0.000564,0.000581,0.000314,0.000412,0.000444,0.000495,0.000385,0.000206,8.3e-05,5.5e-05,0.000191,5.5e-05,1.4e-05,0.000166,0.001125,0.000598,0.000363,0.000324,8.2e-05,6.9e-05,8.9e-05,2.4e-05,0.000127,9.1e-05,0.000111,0.000152,3.9e-05,4.3e-05,0.000121,0.000139,0.000177,0.000128,5.8e-05,5.6e-05,5e-05,3.4e-05,8.4e-05,0.000135,0.000112,0.000192,7e-06,9.5e-05,8.1e-05,2.7e-05,4.1e-05
5e-05,5.8e-05,7e-05,8.4e-05,2.4e-05,1.5e-05,4.3e-05,1.6e-05,5.2e-05,2.3e-05,4.4e-05,0.000107,0.000234,0.000444,0.001045,0.000834,0.001626,0.002541,0.001378,0.001296,0.000664,0.000229,0.000201,9.5e-05,5.5e-05,5.5e-05,0.001227,0.005242,0.010545,0.00168,0.003524,0.004585,0.002736,0.006709,0.004976,0.008745,0.001817,0.005499,0.007261,0.001598,0.006426,0.003457,0.002085,0.004991,0.004041,0.005169,0.006965,0.005788,0.006305,0.00128,0.005838,0.003584,0.003224,0.002904,0.005007,0.001328,0.004092,0.003014,0.006728,0.003118,0.00469,0.00601,0.001337,0.002282,0.001962,0.00211,0.001189,0.001569,0.001963,0.001448,0.000353,0.000223,0.000362,0.00072,0.001036,0.000753,0.000464,0.001089,0.000528,0.000376,0.000462,0.000121,0.000268,0.000114,7.4e-05,5.7e-05,0.000206,0.000195,5.6e-05,0.00022,0.000985,0.001434,0.000702,0.000442,0.000308,0.000196,0.000224,0.000124,0.000128,0.000476,0.000296,6.7e-05,0.000166,6.4e-05,0.000175,7e-05,0.000123,5.3e-05,7e-05,3.6e-05,5.6e-05,1.4e-05,5.8e-05,9.8e-05,6.4e-05,0.000151,0.000183,0.000107,5.6e-05,8e-05,3.9e-05
7e-06,3.2e-05,3.5e-05,3.8e-05,2.1e-05,5.8e-05,7.8e-05,7.5e-05,2.3e-05,6.9e-05,2.1e-05,5.2e-05,8.6e-05,0.000178,0.001536,0.001934,0.002309,0.003043,0.001281,0.001232,0.000647,0.000284,0.000508,0.00049,0.00019,0.000107,0.001216,0.005631,0.005259,0.005089,0.003682,0.004698,0.006059,0.005861,0.002339,0.001456,0.002908,0.000688,0.003092,0.002826,0.004712,0.003447,0.002232,0.005234,0.004151,0.005416,0.002232,0.00371,0.008073,0.008712,0.003666,0.004598,0.00122,0.004033,0.000968,0.000736,0.004006,0.002511,0.004824,0.00388,0.004283,0.001768,0.00268,0.002012,0.000549,0.001963,0.000632,0.000604,0.000972,0.000251,0.000783,0.000782,0.000837,0.000993,0.000558,0.000122,5.4e-05,0.001058,0.000691,0.000185,0.000271,1e-04,0.000286,0.00022,0.000139,9.3e-05,0.00019,0.000104,0.000102,0.000362,0.000403,0.000658,0.000299,0.000177,0.000166,4.3e-05,0.000108,0.00011,5.9e-05,0.000685,0.000226,0.000127,0.000183,0.000101,0.000119,0.000178,6.6e-05,5e-05,0.00012,0.000143,3.1e-05,4.2e-05,3.6e-05,6.3e-05,0.000154,5.5e-05,0.000103,7.2e-05,5.2e-05,0.000154,0.000171
3e-05,1.3e-05,3.8e-05,5.1e-05,3.9e-05,5.9e-05,3.3e-05,1.3e-05,3.2e-05,3.6e-05,4.2e-05,3.7e-05,4.7e-05,0.000102,0.001007,0.001178,0.001975,0.002032,0.001444,0.001297,0.000505,0.000378,0.000532,0.000348,2e-04,8.7e-05,0.001071,0.003856,0.001162,0.002062,0.001567,0.001387,0.003129,0.001433,0.003751,0.002276,0.002087,0.001701,0.001713,0.002308,0.001243,0.002546,0.004908,0.003563,0.001905,0.00206,0.003372,0.004584,0.000527,0.003429,0.002656,0.003256,0.001133,0.00293,0.001153,0.002054,0.003949,0.003544,0.004938,0.002393,0.001234,0.001131,0.001724,0.0012,0.000874,0.001566,0.00093,0.001117,0.001057,0.000453,0.000715,0.000279,0.000557,0.000141,0.000207,0.000183,0.000216,0.000728,0.000677,0.000382,0.00028,0.000403,0.000388,0.000154,0.000111,0.000132,0.000171,0.000167,0.000153,0.000249,0.000918,0.000721,0.00053,0.000228,4.2e-05,5.8e-05,1e-05,2.7e-05,4.2e-05,0.000598,0.000471,0.000205,0.000225,0.000193,0.000134,4.7e-05,2.9e-05,2.7e-05,9.8e-05,8.8e-05,0.000138,9.8e-05,2e-06,3.6e-05,8e-05,8e-05,2e-05,6.7e-05,3e-05,0.000149,7.3e-05
1.8e-05,2e-05,2.4e-05,4.5e-05,2.1e-05,5.7e-05,4.8e-05,8e-06,2.7e-05,3.2e-05,5.5e-05,4.2e-05,7.3e-05,0.000175,0.001193,0.00128,0.00271,0.00081,0.000642,0.000963,0.00036,8.5e-05,0.000482,0.000402,0.000247,0.000155,0.000718,0.001189,0.000518,0.001569,0.001153,0.001168,0.000559,0.00203,0.001885,0.000634,0.001527,0.001543,0.002842,0.002722,0.001474,0.001512,0.003711,0.001543,0.000786,0.001902,0.003244,0.003465,0.002718,0.000574,0.002327,0.000927,0.001003,0.001159,0.000667,0.002303,0.000239,0.001924,0.000437,0.000252,0.000869,0.000638,0.000955,0.000688,0.000224,0.000373,0.000555,0.000466,0.000434,0.000235,0.000351,0.000952,0.000348,0.000138,0.00023,0.000114,0.000194,0.000742,0.000552,0.000419,0.000237,0.000288,0.000142,6.8e-05,0.00013,5.7e-05,0.000228,9.6e-05,5.7e-05,0.000278,0.001363,0.001075,0.000383,0.000111,1.8e-05,9.7e-05,2.8e-05,1.3e-05,5.9e-05,0.00051,0.000269,9.7e-05,0.000241,0.000314,0.000174,0.000111,5.7e-05,4.3e-05,4.3e-05,6.2e-05,0.000121,7.7e-05,5e-05,2.1e-05,6.3e-05,4e-05,4e-05,6.2e-05,6e-05,8e-05,5.2e-05
1.8e-05,8e-06,1.8e-05,1.4e-05,1.2e-05,1.9e-05,4e-05,4.6e-05,6.5e-05,8e-05,1.7e-05,3e-05,4.8e-05,0.000119,0.001616,0.001026,0.001104,0.000463,0.000292,0.001092,0.00047,0.000324,0.000464,0.000462,0.000119,4.7e-05,0.00055,0.001214,0.000234,0.000759,0.000968,0.002082,0.002593,0.000653,0.001316,0.001575,0.001401,0.001244,0.001176,0.000829,0.000811,0.001267,0.001736,0.003133,0.002473,0.001315,0.000561,0.001581,0.000615,0.001633,0.000339,0.000479,0.000851,0.000913,0.00071,0.001024,0.000436,0.000765,0.00048,0.000366,0.000998,0.000494,0.000148,0.000198,0.000227,0.000237,0.000236,0.000407,0.000205,0.000145,0.000305,0.000457,0.000217,0.000132,0.000111,6.9e-05,0.000221,0.000445,0.000215,6e-06,1.8e-05,0.00031,8.3e-05,6.6e-05,7.9e-05,6.3e-05,0.000184,0.000123,3.4e-05,0.000241,0.00081,0.000597,0.000353,0.000211,6.5e-05,6.5e-05,9.3e-05,5.7e-05,3.3e-05,6e-04,0.000317,0.000124,0.000181,0.000229,0.000111,9.8e-05,5.9e-05,4.4e-05,4.3e-05,6.2e-05,4e-05,2.9e-05,2.4e-05,1.6e-05,3e-05,4.2e-05,3e-05,2.1e-05,3.1e-05,9e-05,7.5e-05
1e-05,1.1e-05,1.2e-05,1.3e-05,2e-06,1.3e-05,1e-05,1.2e-05,1.4e-05,2.1e-05,1.7e-05,1.2e-05,1.8e-05,7.7e-05,0.000824,0.000221,0.00076,0.000387,0.00026,0.000392,0.000169,0.000154,0.000181,6.4e-05,0.000103,5e-05,0.00027,0.000621,0.000446,0.000555,0.000367,0.000951,0.000542,0.000533,0.000506,6.3e-05,0.000639,0.000744,0.000812,0.000851,0.000787,0.000482,0.000594,0.001143,0.000407,0.000387,0.000842,0.001095,0.000816,0.00061,0.000475,5.1e-05,0.000182,0.000547,0.000421,0.00041,0.000412,0.000587,0.000339,9e-05,0.000522,0.000114,8.9e-05,0.000179,0.000104,0.000156,5.1e-05,0.000145,0.000116,5.4e-05,8e-05,0.000111,5.8e-05,8.2e-05,0.00012,6.9e-05,5e-05,0.000297,6.9e-05,1.2e-05,1.5e-05,6.2e-05,4.2e-05,2.8e-05,4.2e-05,1.7e-05,2.7e-05,4e-06,2.1e-05,0.000121,0.000253,0.000186,0.000105,4.8e-05,5.1e-05,3.7e-05,2.1e-05,9e-06,1.8e-05,0.000262,0.000101,3.3e-05,7.3e-05,3.6e-05,3e-05,1.4e-05,7e-06,1.9e-05,6e-06,1.3e-05,2.2e-05,0,1.3e-05,1.2e-05,6e-06,1e-05,2.1e-05,6e-06,1.6e-05,3.3e-05,2.7e-05
9e-06,2e-05,3e-06,1.2e-05,1.1e-05,6e-06,1.4e-05,9e-06,1e-06,1.6e-05,1.1e-05,9e-06,8e-06,8e-05,0.000647,0.000206,0.000649,0.000135,0.000164,9.4e-05,0.00013,0.000189,0.000201,0.000109,8.2e-05,5.4e-05,0.00026,0.000292,0.000463,0.000139,0.000337,0.000744,0.000187,0.000627,0.000167,0.000585,0.000444,0.000629,0.000578,0.000869,0.000152,0.000403,0.000573,0.000766,0.000748,0.000383,0.000898,0.000402,0.000207,8.3e-05,0.000215,0.000319,9.5e-05,0.00066,9.9e-05,0.000282,0.000326,0.000433,0.000212,2.5e-05,0.000537,0.000169,8.4e-05,0.000127,4.2e-05,9.1e-05,8.9e-05,8.2e-05,0.000111,6.1e-05,7.6e-05,5.6e-05,5.2e-05,6.6e-05,5.4e-05,3e-06,2.7e-05,0.000317,0.000186,8.2e-05,2.7e-05,2.9e-05,5.2e-05,8e-06,8e-06,0,5e-06,1.6e-05,3.4e-05,0.000156,0.000471,0.000189,7.4e-05,1.6e-05,2.2e-05,1.7e-05,1.6e-05,6e-06,1.3e-05,0.000151,0.00012,4.7e-05,6.6e-05,1.9e-05,2.9e-05,2.7e-05,1.1e-05,3e-06,7e-06,1.1e-05,5e-06,6e-06,1.7e-05,1.1e-05,6e-06,2.4e-05,2.4e-05,1.9e-05,3e-06,3.4e-05,1.4e-05
1.5e-05,5e-06,1.2e-05,3e-06,1.4e-05,7e-06,9e-06,1.8e-05,6e-06,7e-06,1.2e-05,2e-06,1.4e-05,6.3e-05,0.000508,0.000281,0.000285,0.000144,0.000304,0.000466,0.000114,2e-04,0.000135,0.000223,0.000112,1.4e-05,0.000194,0.000439,0.000355,0.000641,0.000657,0.000349,0.000416,0.000589,0.000193,0.000374,0.000325,0.000379,0.000616,0.000526,0.00067,0.000769,2e-05,0.000523,0.000283,0.000539,0.000394,4e-05,0.000421,0.000445,0.000404,0.00027,6.5e-05,0.000444,2.7e-05,0.000265,0.000105,0.000366,0.00021,0.000121,0.000463,5.5e-05,5.8e-05,5.9e-05,6.5e-05,0.000114,7.2e-05,8.7e-05,8.6e-05,2.5e-05,4.1e-05,4.2e-05,3.5e-05,6.5e-05,5.7e-05,2.5e-05,1.9e-05,0.000308,0.000191,9.7e-05,1.9e-05,3.7e-05,6.8e-05,2.6e-05,7e-06,1.1e-05,7e-06,4e-06,2.9e-05,0.000132,0.000269,6.7e-05,1.2e-05,9e-06,1.7e-05,2.9e-05,1.7e-05,7e-06,1.8e-05,0.000117,6.2e-05,3.2e-05,3.8e-05,4.5e-05,3e-05,3e-06,1.2e-05,2.1e-05,1.7e-05,8e-06,8e-06,1e-05,1.6e-05,2e-05,7e-06,1.2e-05,7e-06,7e-06,1.1e-05,1.4e-05,1.8e-05
8e-06,1e-05,7e-06,7e-06,1.7e-05,2e-06,6e-06,1.2e-05,9e-06,1.1e-05,1.2e-05,8e-06,1.2e-05,3.9e-05,0.00039,0.000314,0.000341,0.000112,0.000146,0.000378,0.000231,0.000251,0.000137,1e-04,2.7e-05,7e-06,0.000234,0.000484,0.000393,0.000543,0.000342,0.000459,0.000365,0.000658,0.00016,8.7e-05,0.000443,3e-04,0.000453,0.000339,0.000403,0.000562,2.7e-05,0.000521,0.00031,0.000315,0.000769,0.000148,0.000207,0.000398,0.000312,0.000198,0.000115,0.000356,0.00028,0.000529,0.000228,0.000302,0.00029,8.5e-05,0.000273,0.000194,0.00011,5.8e-05,3.4e-05,6.2e-05,6.8e-05,7.1e-05,8.6e-05,2.3e-05,6.6e-05,5.2e-05,3.1e-05,4.2e-05,4.6e-05,2.2e-05,4e-05,0.000275,0.000197,6.9e-05,1.1e-05,3.1e-05,4.3e-05,3.8e-05,2.2e-05,3e-06,1.5e-05,1.7e-05,2.4e-05,0.000145,0.000227,7.6e-05,4.7e-05,1.3e-05,8e-06,3.1e-05,1.9e-05,1.7e-05,1.7e-05,0.000115,4.1e-05,1.6e-05,2.2e-05,3.7e-05,4.1e-05,2.4e-05,8e-06,1.4e-05,2e-06,1.4e-05,9e-06,1.4e-05,1.4e-05,3e-06,1.7e-05,1e-05,1.3e-05,8e-06,1.3e-05,1.6e-05,8e-06
8e-06,1.4e-05,1.1e-05,8e-06,1.1e-05,1.2e-05,4e-06,1.1e-05,8e-06,2e-06,1.5e-05,4e-06,7e-06,6.2e-05,0.000373,0.000139,0.000233,0.000131,6.4e-05,0.000176,8.2e-05,0.00013,0.000138,0.000116,5.3e-05,2.6e-05,0.000235,0.00034,0.000533,0.000267,0.000317,0.000246,0.000131,0.000485,0.000228,0.000214,0.00025,0.000453,0.000848,0.000171,7e-05,0.000528,0.000227,0.000351,0.000399,0.000216,0.000658,0.000673,0.000387,0.000444,0.00039,0.000221,0.000165,0.000478,0.000399,0.000154,3.9e-05,0.000287,0.000229,0.000152,0.000179,7.4e-05,1.9e-05,3.8e-05,6e-05,8.2e-05,4e-06,8.8e-05,7.8e-05,2.7e-05,4.7e-05,7e-06,2.4e-05,7e-05,3.8e-05,2e-05,3.4e-05,0.000238,0.000179,0.000108,2.4e-05,6e-05,1.2e-05,6e-06,6e-06,7e-06,1.7e-05,1.1e-05,1.5e-05,0.000104,0.00027,0.000122,3.4e-05,2e-05,2e-05,2.7e-05,1.4e-05,1.4e-05,1.7e-05,8e-05,3.9e-05,1.2e-05,1.5e-05,2.3e-05,3.1e-05,9e-06,2e-06,1.2e-05,6e-06,9e-06,6e-06,1.4e-05,5e-06,7e-06,1.1e-05,1.4e-05,2.3e-05,9e-06,1.5e-05,1.1e-05,2.2e-05
1.2e-05,8e-06,2e-06,4e-06,6e-06,9e-06,1e-06,9e-06,2e-06,4e-06,9e-06,1.5e-05,1.2e-05,5.5e-05,0.00058,0.000202,9.2e-05,0.000147,5e-05,0.000147,0.000105,8.3e-05,0.000159,0.000113,6.5e-05,3.4e-05,0.000148,0.000216,0.000354,0.00026,0.00018,0.000385,8.6e-05,0.000265,0.000219,0.000206,0.000209,0.000123,0.000416,0.001018,0.000519,0.000295,0.000166,0.000556,0.000505,0.000193,0.000288,0.000224,0.000482,0.00019,0.000248,0.000118,8.2e-05,0.000251,2.3e-05,3.3e-05,0.000359,0.000206,0.000105,8.6e-05,0.000261,7.6e-05,4.8e-05,8e-05,2.2e-05,0.000141,2.9e-05,0.000113,0.000132,5.1e-05,2.1e-05,1.1e-05,3.6e-05,5.4e-05,4.3e-05,1.9e-05,1.5e-05,0.000154,0.000136,7.8e-05,3.8e-05,4.3e-05,3.5e-05,6e-06,1.6e-05,1.2e-05,1.2e-05,8e-06,1.2e-05,0.00012,6.7e-05,3.6e-05,4.2e-05,1e-05,1.5e-05,7e-06,2e-06,8e-06,9e-06,3.9e-05,2.7e-05,1.5e-05,1.7e-05,6e-06,2.1e-05,1.6e-05,6e-06,1.3e-05,4e-06,7e-06,2e-06,8e-06,1.4e-05,7e-06,7e-06,9e-06,1.2e-05,2e-06,4e-06,1.3e-05,1.1e-05
9e-06,7e-06,8e-06,2e-06,9e-06,2e-06,9e-06,8e-06,5e-06,8e-06,8e-06,8e-06,3e-06,5.6e-05,0.00066,0.000499,0.000204,0.000158,0.000144,9.7e-05,3.9e-05,7.2e-05,0.000175,0.000106,9.9e-05,6.4e-05,8e-05,0.00041,4.5e-05,0.000467,0.000138,0.000787,0.000579,0.000505,0.000159,0.000171,0.000257,0.000262,6.7e-05,0.000531,0.000242,0.000322,0.000386,0.000334,0.000563,0.000148,0.000485,0.000208,3.1e-05,0.000277,8.2e-05,0.000248,0.000191,1.5e-05,0.000298,8.4e-05,0.000317,0.000383,2.6e-05,0.000117,0.000168,0.000215,0.000151,7.3e-05,3.7e-05,7.4e-05,5.6e-05,0.000124,7.4e-05,5.4e-05,9.9e-05,5.7e-05,2e-05,3.7e-05,1.5e-05,2.2e-05,3.1e-05,8.3e-05,0.000143,5.8e-05,4.2e-05,4.5e-05,4.4e-05,4.7e-05,2e-05,1e-05,7e-06,1.1e-05,2.4e-05,9.1e-05,0.000228,9e-05,2.8e-05,1.7e-05,9e-06,1e-05,5e-06,2e-06,7e-06,3e-06,4.1e-05,1.9e-05,1.1e-05,1.5e-05,1e-05,2e-06,5e-06,7e-06,9e-06,7e-06,6e-06,8e-06,1e-05,1e-05,1.8e-05,2e-06,6e-06,5e-06,8e-06,1e-05,9e-06
7e-06,7e-06,6e-06,8e-06,4e-06,4e-06,1e-05,9e-06,6e-06,1.8e-05,2e-06,7e-06,1.6e-05,5.5e-05,0.000453,0.000144,0.000114,0.000204,0.000251,0.000129,6.3e-05,4.9e-05,5.3e-05,4.3e-05,2.1e-05,2.7e-05,9.6e-05,0.000229,0.000361,0.000242,0.000148,0.000886,0.000384,0.000361,6.2e-05,9.2e-05,0.000202,0.000182,0.000137,0.00028,0.000281,0.000252,0.000311,0.000239,8.4e-05,0.000162,0.000564,0.00054,6.3e-05,0.000266,0.000295,0.00023,0.000224,0.000181,0.00022,0.000115,0.000228,0.000106,0.00016,0.000197,0.000147,0.000193,8.3e-05,5.6e-05,5.2e-05,3.5e-05,3.5e-05,5.1e-05,0.000114,2.2e-05,9.3e-05,7.1e-05,5.5e-05,5e-05,4.9e-05,2.1e-05,4.4e-05,9.9e-05,0.000136,9.4e-05,5.6e-05,3.1e-05,2.7e-05,2.5e-05,2.2e-05,1.7e-05,1.6e-05,1.3e-05,3.4e-05,9.8e-05,0.000277,0.000137,4.5e-05,1.6e-05,1.4e-05,1.2e-05,6e-06,7e-06,4e-06,1.8e-05,3.4e-05,1.7e-05,7e-06,2.9e-05,2.6e-05,1.1e-05,5e-06,1.3e-05,1.8e-05,1.8e-05,1.2e-05,3e-06,9e-06,7e-06,1.7e-05,1.7e-05,9e-06,9e-06,1.2e-05,6e-06,2.5e-05
8e-06,9e-06,1.1e-05,1.4e-05,9e-06,9e-06,7e-06,3e-06,2e-06,1.3e-05,7e-06,4e-06,1.4e-05,6.2e-05,0.000245,0.000308,0.00027,8.1e-05,0.000136,0.000165,3.7e-05,8.1e-05,0.000105,8.3e-05,3e-05,3.8e-05,0.000138,0.000139,0.00029,0.000221,0.000176,0.000551,0.000321,8.1e-05,0.000158,0.000121,0.000267,0.000122,0.000107,0.000359,3.8e-05,0.000189,0.000128,0.000177,0.000528,0.000244,0.000335,0.00016,0.000253,0.000299,0.000261,6.6e-05,0.000136,0.000147,0.000117,0.000121,0.000324,0.000192,3e-05,0.000184,0.000205,0.000127,9.4e-05,5.7e-05,5.2e-05,9.5e-05,6.4e-05,7.4e-05,3.8e-05,4.9e-05,5e-05,9e-05,4e-05,2.2e-05,5.3e-05,7.1e-05,2.6e-05,6.1e-05,4.9e-05,4e-06,8e-06,5.9e-05,9e-06,2.3e-05,1.5e-05,1.3e-05,9e-06,1e-05,2.8e-05,8.3e-05,0.000113,9e-05,3.8e-05,1.2e-05,1.5e-05,5e-06,2e-06,1e-05,6e-06,1.5e-05,1.8e-05,2e-05,1.4e-05,1.2e-05,6e-06,1.2e-05,1.1e-05,8e-06,1.4e-05,1.6e-05,1.4e-05,6e-06,1.1e-05,1e-05,1.2e-05,1.1e-05,9e-06,1e-05,8e-06,9e-06,2.5e-05
5e-06,6e-06,1e-06,7e-06,8e-06,7e-06,6e-06,7e-06,4e-06,2e-06,8e-06,5e-06,7e-06,6.2e-05,0.000378,0.000359,0.000208,0.000125,7e-05,0.000118,6.7e-05,3e-05,0.000122,5.2e-05,1e-05,2.6e-05,0.000158,0.000187,0.000198,0.000179,0.000203,0.000247,0.000125,0.000245,0.000132,0.000174,0.000299,0.000228,0.000205,0.000295,0.000389,0.000168,0.00027,0.000114,0.000306,9.1e-05,0.000121,0.000259,9.3e-05,0.000403,0.000225,9.1e-05,0.000131,0.000302,5e-05,0.000175,0.000287,0.000202,0.000129,0.000125,0.000194,9.5e-05,0.000128,0.000175,0.000126,0.000134,9.7e-05,6.6e-05,6.7e-05,6.5e-05,3.4e-05,7e-06,9e-06,1.4e-05,5.8e-05,4.1e-05,2.1e-05,4e-05,4.6e-05,4.1e-05,3.7e-05,8.1e-05,5.1e-05,2.5e-05,9e-06,1.3e-05,1.8e-05,5e-06,1.9e-05,8.6e-05,4.8e-05,5.1e-05,2.9e-05,1.8e-05,9e-06,6e-06,4e-06,3e-06,9e-06,5.5e-05,4.8e-05,2.9e-05,7e-06,1.9e-05,1.2e-05,1.5e-05,2e-06,1e-06,1.2e-05,6e-06,7e-06,4e-06,4e-06,0,9e-06,1.2e-05,1e-05,1.4e-05,1e-05,1.4e-05,2.4e-05
4e-06,8e-06,8e-06,5e-06,8e-06,2e-06,4e-06,7e-06,1.2e-05,1e-05,1.6e-05,1.2e-05,2.5e-05,8.7e-05,0.000359,0.000109,1e-04,7.4e-05,7.9e-05,7.1e-05,1.5e-05,6.3e-05,7.6e-05,7.7e-05,3.9e-05,3.9e-05,0.000197,0.000249,0.000336,0.000361,0.000207,0.000391,9.9e-05,0.000383,0.000243,0.000141,0.00026,0.000212,6.9e-05,6.9e-05,7.4e-05,0.000206,0.00028,0.000117,0.000209,0.000125,0.000299,0.000212,0.000224,0.000335,0.000178,0.000123,0.00016,0.000266,0.000144,6.5e-05,6.7e-05,0.000239,0.000155,6e-05,0.000201,3.6e-05,0.000138,7.7e-05,1.6e-05,7e-06,3e-06,7.3e-05,5.1e-05,7.1e-05,7.4e-05,3.5e-05,3.7e-05,1.9e-05,3.6e-05,3.1e-05,2e-05,2.1e-05,0.000137,6.1e-05,3.1e-05,9.3e-05,2.9e-05,2.7e-05,2.8e-05,9e-06,6e-06,4e-06,1.6e-05,7.1e-05,8.7e-05,9.4e-05,4.3e-05,2.4e-05,2.1e-05,1.5e-05,8e-06,6e-06,1.1e-05,0.000114,7.8e-05,3.1e-05,1.2e-05,1.8e-05,1.2e-05,1e-05,3e-06,6e-06,2e-06,1.2e-05,6e-06,3e-06,2e-06,9e-06,7e-06,1.1e-05,1.4e-05,1e-06,4e-06,1.6e-05,8e-06
7e-06,3e-06,4e-06,8e-06,4e-06,3e-06,9e-06,9e-06,9e-06,6e-06,1.8e-05,2.2e-05,2.3e-05,6.7e-05,0.000254,8.9e-05,0.000244,3.3e-05,0.00014,0.000196,0.000111,9e-05,6.3e-05,9.4e-05,8.8e-05,1.5e-05,0.000124,0.000104,0.000266,0.000314,8.8e-05,0.000475,0.000392,0.000195,0.000309,0.000178,0.000227,0.000107,0.000123,0.000226,0.000146,0.000211,0.000148,0.000435,0.000347,0.000169,0.000426,0.000209,0.000146,5.4e-05,9.2e-05,0.000103,8.5e-05,0.000192,2.3e-05,0.000251,0.00013,0.000237,9.8e-05,3.1e-05,0.000247,0.000132,7.7e-05,0.000145,5.2e-05,6.2e-05,5.5e-05,3.8e-05,8.1e-05,3.5e-05,9.5e-05,0.000106,3.2e-05,3e-05,5.2e-05,4.4e-05,4.4e-05,5.4e-05,0.000162,9e-05,2.7e-05,9.8e-05,4.7e-05,2.6e-05,1.8e-05,1.5e-05,8e-06,1.5e-05,2.1e-05,5.5e-05,5.9e-05,1e-05,9e-06,1.5e-05,1.8e-05,9e-06,7e-06,1.1e-05,3e-06,0.000161,9.4e-05,3.2e-05,9e-06,1.3e-05,1.3e-05,1.1e-05,2e-06,1.1e-05,3e-06,1.3e-05,4e-06,4e-06,4e-06,4e-06,1e-06,1e-05,6e-06,1.2e-05,6e-06,1.3e-05,2.1e-05
9e-06,1e-06,5e-06,6e-06,7e-06,3e-06,9e-06,6e-06,9e-06,6e-06,1.1e-05,1.9e-05,2.3e-05,5.1e-05,0.000527,0.000656,0.000273,0.00014,0.000196,0.000217,0.000103,5.1e-05,0.000319,0.000126,2.9e-05,5.4e-05,0.000165,0.000153,0.000129,0.000178,0.000181,0.000371,0.000221,0.000144,0.000431,0.000206,0.000181,0.000154,0.000111,0.000151,0.000187,0.00019,9e-05,0.000257,0.000373,0.000171,0.000349,9.5e-05,0.000135,0.000166,0.000117,0.00012,0.000187,0.000217,7e-06,0.000282,0.000199,0.000164,0.000134,5.9e-05,0.000252,7.8e-05,2.9e-05,8.3e-05,8e-06,5.5e-05,4.5e-05,1.3e-05,8.2e-05,5.2e-05,6.3e-05,7e-05,1.7e-05,1.4e-05,5.2e-05,2.5e-05,8e-06,3.2e-05,8e-05,4.5e-05,2.5e-05,0.000114,0.000113,9.1e-05,5.4e-05,2.6e-05,2.8e-05,6e-06,1.2e-05,6.8e-05,6.5e-05,3.9e-05,1.7e-05,2e-05,1.1e-05,8e-06,7e-06,5e-06,1.1e-05,0.000162,9.2e-05,4.8e-05,2.9e-05,2e-06,1.2e-05,1.6e-05,8e-06,1.5e-05,1.3e-05,1.5e-05,7e-06,6e-06,7e-06,5e-06,3e-06,3e-06,4e-06,1e-05,8e-06,6e-06,1.3e-05
9e-06,1e-05,1e-05,7e-06,9e-06,3e-06,9e-06,1e-06,9e-06,6e-06,5e-06,1.2e-05,6e-06,4.6e-05,0.000779,0.000403,0.000122,4.1e-05,6.2e-05,5.4e-05,4.9e-05,5.6e-05,0.000489,0.00028,0.000104,4.1e-05,0.000171,0.000234,0.000263,0.000224,0.00011,0.000405,8.8e-05,0.000259,0.00037,0.000218,0.000188,0.000166,0.000181,2.3e-05,9.8e-05,0.000101,6e-05,0.000244,2.7e-05,8.7e-05,0.000134,0.000329,7.7e-05,0.000265,0.000201,6.5e-05,0.00025,0.000226,0.00016,0.000214,0.000111,0.000177,5.1e-05,2e-05,0.000205,7.4e-05,3.3e-05,0.000118,5.6e-05,5.2e-05,3.6e-05,5.4e-05,9.2e-05,2.8e-05,8.4e-05,0.000129,6.2e-05,3e-06,3.3e-05,1.1e-05,1.2e-05,1.9e-05,5.4e-05,1.2e-05,1.4e-05,0.000105,0.000113,5.7e-05,1e-05,8e-06,2.3e-05,2e-06,7e-06,6.6e-05,0.000179,0.00015,5.9e-05,3.5e-05,1e-05,1.6e-05,2.2e-05,1.7e-05,1e-06,0.000132,1.6e-05,4e-06,3e-05,2.4e-05,8e-06,1.2e-05,5e-06,6e-06,9e-06,1.1e-05,9e-06,4e-06,1e-05,5e-06,6e-06,9e-06,8e-06,1e-06,4e-06,4e-06,1e-05
2e-06,3e-06,5e-06,8e-06,5e-06,2e-06,3e-06,9e-06,6e-06,4e-06,2e-06,7e-06,1e-05,4.5e-05,0.000814,0.000351,0.000192,5.9e-05,0.000103,9.6e-05,4.1e-05,7.4e-05,0.000476,3e-04,0.000112,5.7e-05,0.000165,0.000107,0.000232,0.000364,0.000121,0.000176,0.000188,7.5e-05,0.000236,0.000203,0.000186,0.000117,0.000248,0.000302,8.6e-05,7.7e-05,0.000164,0.000212,7.8e-05,0.000208,0.000196,0.000372,0.000246,0.000215,0.000167,0.000154,0.000246,0.000188,0.000117,0.00029,0.000235,1.8e-05,0.000208,7.1e-05,0.000162,0.000141,0.000135,0.000224,9.8e-05,7.5e-05,0.000129,9.9e-05,5.6e-05,6.7e-05,5.5e-05,4.5e-05,5.2e-05,5.3e-05,4e-05,6.3e-05,4.7e-05,3.7e-05,5e-05,4.2e-05,2e-05,8e-05,4.8e-05,4e-05,2.5e-05,1e-05,2.9e-05,3.2e-05,3.4e-05,7.8e-05,0.000298,9.3e-05,4.1e-05,2.2e-05,2.8e-05,1.5e-05,1.7e-05,6e-06,3e-06,7.4e-05,8.6e-05,4e-05,2.6e-05,1.9e-05,2e-05,1.3e-05,5e-06,7e-06,2e-06,1.1e-05,8e-06,5e-06,6e-06,1e-05,8e-06,1e-06,7e-06,8e-06,2e-06,6e-06,4e-06
4e-06,4e-06,5e-06,4e-06,6e-06,2e-06,1e-06,5e-06,8e-06,9e-06,2e-06,3e-06,1.1e-05,4.9e-05,0.000627,0.000172,6.9e-05,0.000175,0.000133,0.000143,0.000106,5.3e-05,0.000463,0.000225,7.5e-05,5.5e-05,0.000145,0.000127,7.5e-05,0.000201,0.00022,9.4e-05,0.000446,0.000408,2e-04,0.000226,0.000278,5.8e-05,0.000319,0.000171,0.000184,0.000279,0.000288,0.000191,0.000314,5.1e-05,8e-05,0.000258,7.5e-05,0.000142,0.00012,9.6e-05,0.000333,0.000579,0.000373,0.000249,0.000216,0.00023,0.000143,0.000257,0.000311,0.00019,0.000126,0.000122,0.000187,0.000121,2.5e-05,6.9e-05,8.1e-05,7.9e-05,9.7e-05,0.00013,4.3e-05,2.7e-05,2.7e-05,5.6e-05,3e-05,4.6e-05,5e-06,1.1e-05,1.2e-05,2.7e-05,2.9e-05,6e-05,3.5e-05,1e-05,1.2e-05,2.4e-05,6e-06,6.3e-05,0.000286,0.000208,9.5e-05,3.1e-05,6e-06,7e-06,9e-06,1.1e-05,9e-06,8.4e-05,9.3e-05,3.7e-05,1.7e-05,7e-06,1.2e-05,4e-06,8e-06,4e-06,2e-06,1e-05,8e-06,6e-06,7e-06,5e-06,7e-06,6e-06,4e-06,4e-06,4e-06,4e-06,1.6e-05
3e-06,3e-06,3e-06,5e-06,5e-06,4e-06,3e-06,4e-06,5e-06,1e-06,5e-06,5e-06,1.2e-05,5.1e-05,0.000316,0.000422,0.000189,0.000103,3.2e-05,0.000158,8.4e-05,7.8e-05,0.000389,0.000303,0.000176,7.5e-05,0.000125,0.000177,0.00021,0.000166,0.000246,0.000277,0.000165,0.000123,0.000178,1.4e-05,0.00022,1.5e-05,0.000211,0.000203,0.000127,0.000367,0.000431,7e-05,0.000228,8.5e-05,0.000105,0.000254,0.000198,0.000141,0.000339,0.00028,0.000169,0.000159,0.000142,0.000204,0.00011,0.000223,0.000181,0.000219,0.000132,5.3e-05,4.4e-05,0.000115,0.000106,0.000128,6e-06,8e-06,6.5e-05,4.1e-05,3.5e-05,6.3e-05,6.6e-05,2.7e-05,4.7e-05,9e-06,2e-05,2.6e-05,2.4e-05,2.2e-05,1.3e-05,2.9e-05,1.6e-05,3.5e-05,1.5e-05,1.7e-05,7e-06,9e-06,3e-06,5.1e-05,0.000196,0.000175,9.2e-05,3.9e-05,1.7e-05,7e-06,1.2e-05,7e-06,1.4e-05,0.000104,4.3e-05,2.1e-05,1.3e-05,1.5e-05,5e-06,7e-06,4e-06,6e-06,5e-06,4e-06,9e-06,3e-06,4e-06,0,5e-06,6e-06,2e-06,7e-06,2e-06,4e-06,1e-05
2e-06,1e-06,4e-06,6e-06,3e-06,1e-06,1e-06,2e-06,3e-06,4e-06,7e-06,3e-06,6e-06,4e-05,0.000193,0.000156,9.2e-05,4.3e-05,9.3e-05,0.000164,5.1e-05,2.8e-05,0.000188,9.5e-05,2.8e-05,1.6e-05,0.00011,0.000175,0.000176,0.000322,6.7e-05,0.000262,0.000362,0.000171,4e-05,0.00017,0.000214,6.7e-05,0.000105,0.000139,0.000168,0.000294,0.000127,0.000253,0.000383,3.9e-05,0.000209,0.000131,0.000114,7.3e-05,0.000293,0.000112,0.000151,0.000123,0.000183,0.000155,4.6e-05,0.000169,0.000109,2.2e-05,0.000113,4.3e-05,2.1e-05,4.9e-05,1.6e-05,6.4e-05,1.9e-05,2.5e-05,5.6e-05,2.4e-05,3.3e-05,5e-06,1.5e-05,1.7e-05,2.7e-05,8e-06,1.6e-05,2.9e-05,3e-05,2e-05,1.2e-05,1.7e-05,5e-06,1.3e-05,6e-06,1.2e-05,4e-06,1.6e-05,7e-06,6.1e-05,6.4e-05,2e-06,1.5e-05,5e-06,1.3e-05,1e-06,5e-06,4e-06,6e-06,8.9e-05,8e-06,6e-06,3e-06,1.2e-05,1.1e-05,7e-06,2e-06,4e-06,5e-06,1e-06,5e-06,1e-06,3e-06,2e-06,3e-06,6e-06,2e-06,5e-06,3e-06,3e-06,9e-06
3e-06,2e-06,4e-06,6e-06,4e-06,0,1e-06,3e-06,4e-06,3e-06,5e-06,2e-06,6e-06,3.5e-05,0.000264,0.000145,8.9e-05,1.5e-05,7.7e-05,0.000131,1.1e-05,1.1e-05,7.1e-05,1.9e-05,7e-06,5e-06,0.00012,0.000136,8.2e-05,0.000198,0.00013,0.000247,0.000271,0.000213,0.000151,0.000182,0.000305,0.000202,8.9e-05,0.000111,0.00017,0.000272,8.9e-05,0.000175,0.000242,2.6e-05,0.000237,0.000166,2.6e-05,5.4e-05,0.000107,0.000129,0.000162,5.3e-05,8.5e-05,0.000152,8e-05,0.000156,6.4e-05,3.3e-05,9.4e-05,3.1e-05,1.6e-05,1.9e-05,2.6e-05,6.5e-05,1.4e-05,2.8e-05,4.1e-05,1.4e-05,3.2e-05,6e-06,2e-05,1.8e-05,2.2e-05,4e-06,9e-06,3e-05,1.1e-05,1.2e-05,5e-06,2.1e-05,9e-06,3e-06,1e-06,3e-06,8e-06,1.9e-05,2e-06,5.8e-05,6e-06,1e-05,6e-06,6e-06,9e-06,5e-06,3e-06,5e-06,5e-06,5.5e-05,4e-06,6e-06,5e-06,1.1e-05,7e-06,5e-06,2e-06,6e-06,4e-06,2e-06,3e-06,1e-06,3e-06,3e-06,2e-06,4e-06,3e-06,4e-06,3e-06,3e-06,9e-06
3e-06,1e-06,4e-06,5e-06,4e-06,1e-06,1e-06,3e-06,3e-06,3e-06,5e-06,2e-06,6e-06,3.4e-05,0.000257,0.000132,9e-05,6e-06,6.4e-05,8.4e-05,1.4e-05,9e-06,3.5e-05,2e-05,8e-06,3e-06,0.000122,0.000143,0.000179,0.00027,9.3e-05,0.000261,0.000175,0.000262,3e-05,6.3e-05,0.000264,0.000152,0.000238,0.000177,0.000182,0.00019,7.9e-05,0.000159,0.000221,6.7e-05,0.00023,0.000127,9.6e-05,4.9e-05,6e-05,9e-05,8.2e-05,0.00011,8.7e-05,6.2e-05,5.7e-05,0.000175,4.2e-05,1.8e-05,0.000102,1.4e-05,1.8e-05,2.6e-05,2.3e-05,5.1e-05,1.5e-05,2.5e-05,3.5e-05,5e-06,3.2e-05,1e-05,1.5e-05,1.8e-05,2.2e-05,2e-06,4e-06,2.9e-05,1e-05,6e-06,7e-06,1.8e-05,9e-06,0,3e-06,6e-06,5e-06,1.2e-05,1e-06,5.5e-05,1.7e-05,9e-06,4e-06,8e-06,1.1e-05,2e-06,1e-06,6e-06,5e-06,5.6e-05,6e-06,6e-06,9e-06,9e-06,8e-06,4e-06,3e-06,5e-06,3e-06,2e-06,3e-06,1e-06,4e-06,3e-06,3e-06,5e-06,2e-06,4e-06,2e-06,3e-06,8e-06
