0.000292,0.00031,0.00043,0.000439,0.000312,0.000343,0.00022,0.000195,0.000141,0.000144,0.000247,0.000292,0.000287,0.000271,0.000225,0.000262,0.000291,0.000175,2.3e-05,0.000208,-0.001012,-0.000633,-0.000354,-0.000119,3.9e-05,-0.000447,-0.000479,-0.000516,-0.000335,0.000258,5e-06,6.4e-05,-0.003505,-0.002654,-0.003674,-0.002027,-0.001071,5e-05,0.000366,0.001871,0.001293,-0.000184,-0.000357,-0.002108,-0.001947,-0.000128,-0.001127,-0.000237,-0.002403,-0.001651,-0.004886,-0.004603,-0.00209,-3.8e-05,-0.000335,-0.000202,-0.000231,0.000141,0.000471,0.000692,0.00261,0.002773,0.00341,0.001341,0.000878,0.001156,0.001491,0.001556,0.000206,0.003717,0.003741,0.002681,0.002539,0.004503,0.002082,0.002766,0.002564,0.002653,0.002481,0.001258,0.001255,0.000965,0.001618,0.001541,0.000138,-0.000429,-0.001499,-0.000229,-0.000204,-0.000526,-0.000815,4.1e-05,0.000698,0.001312,0.003314,0.002121,0.001443,0.001639,0.001897,0.002083,0.001665,0.000822,0.001446,0.001729,0.00156,0.001127,0.000833,-0.000109,0.000986,-0.002565,-0.002422,-0.00075,-0.000562,-0.000643,-0.000182,0.001042,0.000381,0.00218,0.003197,0.008285,0.006721
0.000219,0.000287,3e-05,3e-04,6.1e-05,0.000215,0.000181,4e-05,6.6e-05,0.000124,0.000106,0.000153,-3.6e-05,9e-05,0.000149,8.1e-05,0.000164,0.000126,0.00018,5.3e-05,0.000262,0.000432,0.000439,0.000357,0.000331,0.000258,0.000305,0.000297,0.000186,0.000397,0.00022,0.000368,0.000136,0.000958,-0.000237,8.4e-05,7.6e-05,0.000302,0.000179,-0.000321,0.00052,0.000175,0.000743,-0.000255,-0.000139,0.000199,0.000597,0.000523,-4e-04,-0.000174,-0.000417,0.000149,0.000202,-0.00012,4.6e-05,-0.00083,-0.000259,0.000513,-0.002266,-0.001886,-0.001416,-0.00012,-0.000129,0.000109,-0.000476,0.00021,-0.000633,-0.001004,0.000591,-0.003991,-0.000742,-0.001132,9.2e-05,0.00028,-0.000351,-0.001404,-0.001146,0.000509,0.000772,0.000807,0.000791,0.000509,0.000923,0.000375,0.000756,0.001572,0.001736,-0.000516,-0.000311,-5.3e-05,0.001121,0.001178,0.002427,0.000627,0.001157,0.001228,0.000955,-2.3e-05,5.2e-05,0.000593,0.000863,0.000675,0.000795,0.000763,0.000924,9.3e-05,7e-05,0.001204,0.00112,-0.000712,0.000273,0.001209,0.000286,0.000838,0.000174,-0.000364,0.000394,-0.00017,-0.000187,0.00259,0.003668
5.2e-05,8.5e-05,-9.6e-05,1e-05,-4.1e-05,1.1e-05,0.000202,1e-04,8.4e-05,6.3e-05,-3.8e-05,-2.8e-05,-0.000212,-0.00012,8.9e-05,-1.7e-05,0.000147,5e-05,4.6e-05,-6.1e-05,-1e-06,0.000264,6.3e-05,-9.2e-05,0.000154,6.5e-05,9e-05,3.9e-05,-0.000104,0.000121,7e-05,9.9e-05,0.000625,-0.000188,0.000481,-8e-06,-0.000167,-0.000145,0.000125,-0.001121,-0.000193,0.000355,-4.2e-05,2.4e-05,0.000127,-3.4e-05,0.000252,-1.6e-05,0.000905,0.001258,-0.000291,0.001918,0.000867,-3e-05,0.000152,6.3e-05,0.000164,-0.000376,-0.000661,-0.000634,-0.002053,-0.001172,-0.001328,-0.002246,-0.00136,-0.000212,0.000456,-0.001495,-5.7e-05,-0.0022,-0.001272,-0.002828,-0.001499,-0.001474,-0.001039,-0.000521,-0.00129,-0.000202,0.000147,8.9e-05,0.000299,0.000203,0.000275,-3e-06,0.000292,5e-06,0.00033,-0.000253,-0.000128,-0.001319,-0.000609,-0.00148,-0.001635,-0.000593,-0.002257,-0.000647,-0.001295,-0.001288,-0.001966,-0.001108,5.5e-05,7.4e-05,0.000541,-0.000146,0.000367,-0.000125,0.00015,0.000933,2.9e-05,0.002276,0.000804,0.000322,-0.000816,-0.000171,-0.000734,-0.000739,0.00011,-0.000466,-0.002341,-0.001047,-0.001222
4.8e-05,0.000175,0.000101,0.000251,0.000174,8e-05,0.000209,9.8e-05,8.9e-05,0.000103,-4.7e-05,8.9e-05,3.4e-05,8.7e-05,0.000124,-2.6e-05,-1.4e-05,-6.1e-05,-1.6e-05,0.000156,-4e-06,-0.000252,-2.1e-05,-7e-06,0.000114,2e-06,-0.000317,-0.000193,4e-06,-8.1e-05,8e-05,-2.7e-05,0.000187,0.000117,-0.000776,2.6e-05,0.000284,2.7e-05,-3.1e-05,-0.000709,-0.000322,-0.000175,-0.000133,7.8e-05,-0.000612,-0.000604,-0.001683,-0.001206,0.000328,-0.000779,-0.000166,-0.001938,-0.000908,-0.000381,2.3e-05,-0.000107,7.7e-05,-0.000279,0.000821,0.000932,-0.000411,-0.001645,0.000846,-0.001455,-0.000775,-0.000471,0.000322,-0.000527,-0.000687,-0.001456,-0.00236,-0.002398,-0.001635,-0.001685,-0.001096,-0.000565,-0.000226,-0.000165,-1.9e-05,-0.000265,-5.7e-05,-2.6e-05,-0.000126,-6.4e-05,-0.000429,-6.4e-05,-0.000202,0.000467,-5.3e-05,-0.000285,-9.5e-05,-0.000692,-0.000599,-0.000614,-0.001581,0.000915,-0.001052,-0.00013,-0.000432,-0.00094,-0.000644,-0.000585,0.000858,-0.000414,0.000392,0.000105,-0.000436,0.000204,-0.000295,-0.000186,-0.000808,-0.000619,-0.000344,-0.000607,0.000952,0.000235,0.000755,-0.000101,0.000787,8e-05,-0.002619
6.5e-05,0.000116,-9e-05,0.000113,0.000176,7e-05,8.7e-05,-6.8e-05,8.3e-05,7.7e-05,-4.7e-05,-4e-05,0.000167,0.000109,9.4e-05,1.5e-05,0.000133,9.1e-05,6.7e-05,1.8e-05,3.3e-05,0.000237,0.000143,-4.1e-05,4.8e-05,-5e-05,5.7e-05,0.000293,0.00018,7e-05,-1e-06,-0.00011,-0.000129,9.4e-05,0.000343,-1.7e-05,-0.000273,8.6e-05,0.000157,-8e-06,-0.000168,-0.000148,0.000107,0.000269,0.000428,-7.1e-05,0.000139,-8.4e-05,-0.00031,-7e-06,-0.000184,0.000529,0.000623,-3.7e-05,-0.00014,-7e-06,-0.000624,-0.000596,-0.000177,-0.000498,0.000249,-0.002066,0.000595,-0.000181,0.000355,7.7e-05,-0.001116,-7e-05,-0.000552,-0.000539,-0.002776,-0.00033,-0.001419,-0.000789,-0.000426,-0.00066,-0.000299,-0.000651,-0.000161,-8.6e-05,5.3e-05,0.000113,-0.000292,-7.5e-05,0.000278,-0.00012,-3.3e-05,0.000471,-0.000156,0.000182,0.000334,0.000244,-0.001083,-0.001959,-0.001277,-0.000494,-0.001212,-0.00086,-4.5e-05,-0.001073,-0.000539,-0.000462,0.000515,-0.00045,0.000392,0.00022,-0.000217,0.000496,-0.000349,0.000333,0.000672,0.000464,0.000724,0.000226,0.000163,0.001808,-0.000373,-0.000534,-8.7e-05,-0.00054,-0.003767
-0.000102,0.000124,-5.6e-05,1.3e-05,0.000104,-0.000104,2.5e-05,-1e-06,3.3e-05,3.5e-05,-7.9e-05,-8.3e-05,3.1e-05,7.5e-05,0.000117,-4.4e-05,1.6e-05,2.5e-05,1.8e-05,1.5e-05,2.9e-05,3.2e-05,-1.3e-05,-7.2e-05,8.4e-05,3.6e-05,0.000104,0.000134,1.4e-05,3.6e-05,-0.000129,-6.6e-05,-6e-06,2e-04,-0.000227,0.000164,-0.000126,4e-06,0.000164,-7.1e-05,-7.2e-05,-0.000391,-0.000326,0.000458,0.000125,2.1e-05,-0.000814,-0.000698,0.00021,-7.2e-05,-3e-04,-0.000842,0.000133,-0.000198,-0.000255,-3e-05,0.000397,-7e-06,-0.000348,-0.001203,-0.000136,-0.00074,-0.000131,0.000102,0.000532,0.000612,-0.000736,4.9e-05,-0.000641,0.000204,-0.00139,0.000667,-0.000721,-0.001408,-0.001225,-0.000304,0.00022,-0.000696,-0.000421,-0.000204,0.000124,3.7e-05,-0.000238,-4.1e-05,7.3e-05,1.4e-05,3.7e-05,0.000374,-0.000217,-0.000504,-0.000333,-0.000314,-0.000386,-0.000417,-0.001326,-0.000998,-0.000211,-0.000593,0.001252,2.9e-05,-0.000383,-0.000486,-6.6e-05,-3e-05,0.000311,0.000459,-4.1e-05,0.000175,-7.2e-05,0.000386,-2.8e-05,-9.7e-05,-0.000143,-0.000686,0.00013,0.000755,-0.000381,-0.001294,-0.000737,0.001514,-0.000899
-0.000162,-1e-05,-7.9e-05,-0.000141,2.7e-05,-0.000128,-1.1e-05,-5.1e-05,7e-06,4.9e-05,-4.4e-05,-7.9e-05,-2.2e-05,-0.000146,1e-06,-0.000143,-2.4e-05,8.4e-05,-2.8e-05,2.8e-05,-8.4e-05,-0.000237,0.000151,-3.6e-05,-6.3e-05,-6.9e-05,-0.000186,-9.2e-05,-0.00011,4e-06,-7.2e-05,-0.000135,-7.9e-05,-0.000228,-0.000101,0.000132,-9.2e-05,-2.8e-05,0.000231,-9.5e-05,-0.000175,-0.000298,-0.000185,-3.5e-05,0,-1.6e-05,8e-05,-0.000377,2.6e-05,-0.000258,-0.000211,-0.000174,-0.00018,-0.000163,-0.000312,0.000133,1.8e-05,6.5e-05,-0.000474,-0.000129,-0.000278,0.000793,-0.000921,0.00065,0.000865,0.000505,0.000106,0.000138,-0.000738,0.000117,0.000653,0.001496,0.001031,-0.00053,-0.000517,-0.000285,0.000253,-0.000361,-0.000913,-0.000372,-5.4e-05,-0.000195,-0.000165,-0.000175,-1e-04,-0.000265,-0.001146,-0.000325,0.000176,-0.000268,-0.000363,0.000437,-0.000522,-0.000643,-0.000829,-0.000873,-0.000422,-6.8e-05,-2.3e-05,0.000358,-0.000222,-0.000493,4e-06,-0.000239,-4e-05,0.000308,0.000286,0.00013,-0.000442,0.00046,-0.000245,-0.000141,0.000558,0.000228,0.000288,-0.000171,-0.000236,-1.6e-05,-0.000292,-0.001126,-0.000688
-8.6e-05,4.7e-05,-2.8e-05,-6.3e-05,-6e-06,-3.7e-05,2.3e-05,-7.1e-05,-4.6e-05,0,1e-06,-4.7e-05,4.8e-05,-5.7e-05,-5.2e-05,-2.8e-05,-4.3e-05,3.5e-05,-5.4e-05,1.2e-05,4e-06,4.4e-05,-9.1e-05,-5.4e-05,3.5e-05,-1.5e-05,-9.8e-05,7e-06,7.3e-05,2.7e-05,2.2e-05,-3.8e-05,0.000117,4.4e-05,2.6e-05,3.2e-05,0.000286,0.000168,0.000168,-1.8e-05,-0.00023,-0.000269,6.8e-05,-7e-06,-0.000127,2.6e-05,8.1e-05,0.000219,0.000102,-0.000106,-7e-06,-0.000309,-7.7e-05,0.000213,3.5e-05,6.5e-05,-2.1e-05,0.000458,-0.000103,0.000145,0.001016,0.00076,-0.000421,-0.000639,8.4e-05,0.000559,-0.000122,0.001179,0.000627,0.000559,0.001641,0.000377,0.000777,0.000589,4.3e-05,-0.000354,0.000191,3e-04,-0.000607,-0.000266,-0.000195,-0.000274,-7.9e-05,-0.000511,-0.000185,-0.000206,7.4e-05,0.000371,6.3e-05,8.9e-05,-3.1e-05,-0.000179,0.000789,0.000274,0.00032,-6.7e-05,-0.000623,0.000552,0.000106,0.000242,3e-04,-0.000168,-2.9e-05,-0.000148,-0.000163,0.00011,4e-06,-4.2e-05,-0.000333,0.000122,0.000128,0.000625,0.000276,0.00046,-0.000122,0.000132,0.000151,-0.000258,-0.000383,-0.002021,0.000318
-1e-05,-3.5e-05,-2.4e-05,-6.6e-05,4.5e-05,1e-05,-6.1e-05,-6.1e-05,-3e-06,2.3e-05,-5.5e-05,-2.2e-05,-5.1e-05,-3.7e-05,-4e-06,-4.8e-05,-7.9e-05,-5.9e-05,-0.000101,0,-8.4e-05,-6.2e-05,0.000275,2e-05,-6.3e-05,-3.4e-05,-8.5e-05,0.000104,-6.2e-05,-0.00013,-3.3e-05,-0.000101,8.8e-05,3.1e-05,0.000101,-5.1e-05,-0.000112,-1.3e-05,6.3e-05,-0.000135,-0.000209,-0.000223,-0.000209,3.7e-05,6.6e-05,0.000141,-4.5e-05,-1.8e-05,4e-06,-9e-05,-0.000624,6.9e-05,-1.6e-05,-0.000203,-2.1e-05,-0.000149,5.2e-05,-0.000102,-0.000336,-7.7e-05,0.000418,-0.000186,-0.001484,-0.000202,-0.000495,-0.000371,-0.000127,0.000719,0.000538,0.000294,-0.000358,0.000444,3.4e-05,0.000555,0.000358,-0.000406,0.000133,0.000532,-0.000306,-0.000135,-0.000424,-0.000123,-0.000223,-0.000601,-0.000135,-0.000339,-0.000454,-0.000121,-0.000302,-0.000308,0.00037,0.000731,-8.7e-05,-3.8e-05,-0.000291,-9.2e-05,-0.00023,0.000755,-0.000218,-0.000209,0.000306,-2.9e-05,-0.000216,-0.000428,-0.00054,5.5e-05,-0.000185,-0.000291,-0.000224,1e-05,-0.000418,-0.000279,-8.9e-05,-5.1e-05,-0.000369,-6.4e-05,-0.000307,-0.000758,0.000183,-0.000848,-0.000362
4e-06,2.4e-05,-3.8e-05,-3.9e-05,3.4e-05,2e-06,-1.4e-05,-3.2e-05,-3.4e-05,4.7e-05,-2.6e-05,5e-06,-1.7e-05,-1e-06,4.4e-05,-3e-06,-7e-06,-3.2e-05,-2e-05,1.3e-05,-4.1e-05,2.1e-05,-9.1e-05,-5.1e-05,-3.5e-05,-1e-05,3.4e-05,-3.3e-05,0.000124,2e-05,1.2e-05,-4e-06,0.000125,5.2e-05,-0.000149,-2.4e-05,0.000381,8e-06,-0.000177,-9.4e-05,0.000119,3.7e-05,-0.000252,-0.000306,-8.7e-05,-0.000218,-5e-05,-6.3e-05,-0.000608,-4.2e-05,0.000436,7e-05,-0.000103,-0.000232,-4.1e-05,-1.8e-05,-0.000101,0.00015,0.00024,0.00012,-0.000659,-0.000565,-0.000456,0.000253,-0.00042,-0.000769,-0.000208,-0.000119,4e-06,-0.00041,-0.000967,-0.00035,-0.000665,0.000382,0.000245,0.000211,0.000147,0.000211,4.8e-05,-4.1e-05,-0.000358,4.1e-05,-0.000122,-0.000417,-0.000163,-0.000302,1.7e-05,0.000183,-0.000258,0.000198,0.000226,8.3e-05,0.000172,0.000169,0.00032,7.1e-05,3.6e-05,0.000137,6e-05,-0.000282,0.000155,0.000139,-0.000231,-0.000153,-0.000371,3.3e-05,-0.000204,-9e-06,-0.00024,-0.000484,2.5e-05,0.00018,0.00024,0.000176,-6.5e-05,-0.000174,-0.000652,-6.1e-05,-0.000585,0.000223,-0.000759
-4.8e-05,-4.7e-05,-5.8e-05,-3.1e-05,-4.2e-05,-6.7e-05,-2.4e-05,-4.4e-05,-3.3e-05,1.5e-05,-3.3e-05,-6e-06,-6.2e-05,-4e-06,-7e-06,-6.7e-05,1.1e-05,-4.8e-05,-2.8e-05,-3.3e-05,-8e-06,-2.3e-05,7.9e-05,-8e-06,-2.4e-05,-4.7e-05,-1.1e-05,-7e-06,-2.8e-05,-1.2e-05,1.5e-05,-2.2e-05,5.7e-05,1.9e-05,7e-05,0.000126,-0.000154,-4.2e-05,-9.8e-05,-4.7e-05,8e-06,1.8e-05,-1.9e-05,-6.8e-05,1.6e-05,0.000118,1e-04,0.000229,-9.6e-05,-8e-05,-3.6e-05,3.1e-05,-0.00011,-6.2e-05,2.9e-05,0.000199,9.4e-05,0.000114,-3e-06,0,-0.000194,-6.7e-05,0.000227,0.000456,-0.000194,8.6e-05,-0.000268,-0.000135,-0.000572,-0.00032,1.1e-05,-0.000927,-0.000523,0.000494,7.6e-05,0.000948,0.000213,-0.000415,0.000111,5.2e-05,-0.000172,-4.5e-05,-6.9e-05,-5e-05,-0.000118,1.4e-05,1.8e-05,-0.000335,0.000145,0.00033,-2e-06,-1.1e-05,-0.000109,-4e-06,0.000594,0.00023,0.000577,0.000263,-0.000431,-0.000278,0.000158,0.000173,-0.000301,-9.4e-05,-0.000133,0.000128,-0.000186,-2.5e-05,-6.6e-05,-0.00025,-0.000146,-0.000486,-1.9e-05,-0.000249,-0.000348,-0.000126,-0.000586,0.000328,3.6e-05,0.00024,-0.000152
-1.5e-05,-7.4e-05,-2.9e-05,6e-06,-4.6e-05,-6e-05,0,-3.4e-05,-2e-05,-1.1e-05,-1.5e-05,1e-05,-2e-05,-5e-06,-2.8e-05,-3.4e-05,-4.2e-05,-9e-06,-3e-06,-3.9e-05,-1.3e-05,-3e-05,-5.6e-05,-1.1e-05,-2.9e-05,2e-06,-4.6e-05,-2e-06,-2.1e-05,1.1e-05,-5e-05,-2.4e-05,4.6e-05,1.8e-05,-0.000119,-0.000256,-3e-06,-0.000124,0.000116,3.9e-05,-7e-06,3.7e-05,5.2e-05,-0.000199,1.6e-05,-2.6e-05,-0.00017,-3.2e-05,-0.000253,1.8e-05,2.1e-05,-6.5e-05,-0.000157,3e-05,4.3e-05,-0.000284,-6.2e-05,-8e-05,0.000239,7.7e-05,0.000137,0.000377,0.000673,7.3e-05,-0.00018,0.000351,9.5e-05,-0.000138,-0.000383,-0.000227,0.000236,-0.00062,-0.000224,-0.000103,4.1e-05,0.000447,5.8e-05,-0.000105,0.000152,4e-05,-8.2e-05,-5.4e-05,-7e-06,-1e-05,6.9e-05,8e-05,8e-05,-5.5e-05,-0.000166,-0.000429,8.4e-05,-0.000186,-3e-04,-4.5e-05,-9e-05,2.1e-05,0.000227,-9.7e-05,-0.000344,1e-04,5.5e-05,9.3e-05,-6.6e-05,-0.000182,-2e-06,6.9e-05,-6.4e-05,-0.000123,-0.000244,-4.6e-05,0.00016,0.000239,-0.000129,3.8e-05,-0.000151,7e-06,0.000212,-4.7e-05,0.000165,7.6e-05,0.000152
-3.8e-05,-3.6e-05,-3.8e-05,-1.5e-05,-1.4e-05,-6.2e-05,3e-06,-2.7e-05,-2e-05,0,-2.6e-05,-1.2e-05,-3e-05,-2.2e-05,-3.9e-05,-4.9e-05,-1.9e-05,-6e-06,-4e-06,-2e-06,-1.1e-05,-7e-06,-1.9e-05,-7.9e-05,1.4e-05,-2e-05,2.3e-05,-4.3e-05,2e-06,-4.7e-05,-1.1e-05,3e-06,-3.8e-05,9e-06,0.00022,0.000152,-5.1e-05,-2.8e-05,-5.1e-05,5.5e-05,-1.3e-05,0.00012,1.4e-05,-0.000219,-4.9e-05,-4.4e-05,-3.6e-05,-8.4e-05,-0.00013,-4.4e-05,0.000101,5.1e-05,2.1e-05,-0.000224,-0.000111,-0.000122,1.1e-05,1e-05,-7.1e-05,0.00015,1.4e-05,-0.000128,0.000291,0.000126,-0.000283,0.00026,-6.3e-05,-0.000181,0.00016,1.1e-05,9.7e-05,8.1e-05,7.9e-05,-0.000356,-3.3e-05,0.000161,-6.5e-05,-5.8e-05,0.000146,3.3e-05,7e-06,-7.8e-05,-1.5e-05,4.5e-05,-1.7e-05,2.1e-05,-5e-05,-0.000169,1.5e-05,-5.7e-05,7.3e-05,-0.00021,0.000297,-0.000114,1e-05,-8.4e-05,-5.5e-05,-5.2e-05,0.000177,0.000104,-4e-05,-0.000134,-2.4e-05,-7.9e-05,0,6.8e-05,-0.000101,6.9e-05,-6e-05,-8.6e-05,-3.8e-05,-0.000224,7e-05,3e-06,-2e-06,3.7e-05,4.6e-05,-0.000421,-0.000194,0.000232,0.00056
-2.9e-05,6e-06,-5e-06,-6e-06,-2.2e-05,-1.4e-05,-8e-06,4e-06,-1.2e-05,-7e-06,-5e-06,-1.3e-05,2e-06,-2.8e-05,0,-3e-06,9e-06,-4e-06,-2.1e-05,-9e-06,-1e-05,-2.2e-05,-5.4e-05,-3e-06,6e-06,-4e-06,0,1e-05,6e-06,-5e-06,9e-06,-1.8e-05,5e-06,-7e-06,4.3e-05,-0.000134,5.9e-05,-5e-06,1.1e-05,-1.8e-05,4e-05,8e-05,-4e-06,0.000146,4e-05,-5.7e-05,8.7e-05,-1.2e-05,0.000274,0.000143,-9e-05,4.9e-05,5.1e-05,0.000311,2.1e-05,-9.8e-05,-2.8e-05,4.8e-05,-7.8e-05,1.8e-05,-1.9e-05,-0.000269,5.4e-05,-6.4e-05,-0.000192,4.8e-05,-6.9e-05,-9.1e-05,-0.000148,5.3e-05,-0.000193,0.000111,-8.4e-05,-9.2e-05,-0.000122,-0.000251,-0.000107,3.2e-05,0.000175,-1.2e-05,8e-06,-5.3e-05,-3.6e-05,4.7e-05,3e-06,-3.1e-05,-2.8e-05,-0.000108,-5.4e-05,0.000134,-9.7e-05,0.000132,-0.000326,-5.6e-05,0.000107,5.3e-05,-4.4e-05,9.2e-05,8.9e-05,-0.000104,-0.00014,-0.000113,3.9e-05,-5e-05,-2.6e-05,-2e-05,-0.000108,8e-05,-4.5e-05,-0.000145,-5.8e-05,-8.4e-05,-2.1e-05,7.3e-05,5.3e-05,-0.000122,3.6e-05,-0.000103,-4.8e-05,0.000235,1.1e-05
-1.4e-05,1e-05,-2.4e-05,-1e-05,-1.5e-05,-5e-06,3e-06,-1.1e-05,2e-06,-1e-05,-2.2e-05,4e-06,9e-06,-2.2e-05,1.1e-05,1e-06,-1e-06,0,-1.8e-05,7e-06,-3e-06,9e-06,-3e-06,-9e-06,4e-06,7e-06,-2.7e-05,-2.3e-05,-1.3e-05,-3.1e-05,2.3e-05,-8e-06,-7e-05,-1.2e-05,-9.9e-05,6.2e-05,2.8e-05,5e-06,-3.7e-05,3e-06,-2.6e-05,-0.000111,1.2e-05,-9.1e-05,-6e-06,-3e-05,-6.4e-05,5.3e-05,0.000102,2e-05,4.5e-05,2.6e-05,2.4e-05,-0.000104,6e-06,-2.7e-05,-5.7e-05,-3e-06,-0.000124,-2.3e-05,-9e-06,2.9e-05,-0.000102,4.7e-05,-1.3e-05,-0.000114,2.7e-05,-3.9e-05,-0.000104,-7.8e-05,-0.000293,-0.000524,-0.00017,0.000258,7.2e-05,-5.5e-05,-7e-05,9e-05,-0.000137,-1.4e-05,3.9e-05,1.4e-05,-1.4e-05,6.1e-05,-4.3e-05,-1.9e-05,-3.5e-05,3e-06,3.2e-05,-4.3e-05,4e-05,2.7e-05,8.6e-05,2.2e-05,-2.8e-05,3.5e-05,-3.3e-05,9e-06,0.000223,-3.3e-05,0.000146,-8.1e-05,0.000111,4.1e-05,2.6e-05,-1e-04,-7e-05,-1.8e-05,-7.3e-05,-6.3e-05,3e-05,0.000124,-3.3e-05,-7.9e-05,0.000135,6.9e-05,-0.000207,6.2e-05,2e-05,5.4e-05,-0.00034
-7e-06,-3e-06,-1.2e-05,-1.6e-05,1e-05,-5e-06,-1e-06,-1.1e-05,-3e-06,-8e-06,-1.8e-05,1e-06,4e-06,-1.7e-05,-6e-06,-1.5e-05,-1.2e-05,1.8e-05,-2.5e-05,2e-06,-9e-06,-1.5e-05,-2.1e-05,-2.8e-05,5e-06,1e-06,1.5e-05,-7e-06,-2e-06,3.8e-05,-1.1e-05,-9e-06,-2.2e-05,0,6.9e-05,3.7e-05,1.1e-05,-1.6e-05,3.6e-05,-1.2e-05,3e-06,-6.2e-05,2.5e-05,2e-06,5e-06,-6.4e-05,2.7e-05,-2.4e-05,7.6e-05,1.2e-05,1.5e-05,2.5e-05,-2e-05,-2.2e-05,-8e-06,-3.9e-05,2.2e-05,7e-06,-7e-05,-1.7e-05,-8.9e-05,0.000126,-0.00021,-0.000156,8.4e-05,-3.2e-05,-7e-06,-0.000154,3.6e-05,-2.7e-05,8.8e-05,-0.000147,2.6e-05,0.000133,1.5e-05,-1.1e-05,-5.6e-05,-2.9e-05,-0.000261,-2.2e-05,4.2e-05,2.8e-05,-2.5e-05,-4.8e-05,2e-05,1.3e-05,4.8e-05,-3e-06,4e-06,2.6e-05,7.4e-05,5e-06,-6e-05,4.8e-05,1.7e-05,-4e-05,6.4e-05,-0.000207,2.9e-05,5.1e-05,7.3e-05,2.7e-05,4.4e-05,-7e-06,2.4e-05,-7.4e-05,-4.5e-05,-3.6e-05,2e-05,7.3e-05,1.9e-05,-0.000171,-0.000105,4e-06,3e-05,1.3e-05,-8.4e-05,0.000181,-4e-05,-0.000299,-5.1e-05
-9e-06,1.4e-05,3e-06,-8e-06,1.4e-05,-9e-06,0,-3e-06,1e-06,-3e-06,-6e-06,0,2e-05,-5e-06,6e-06,-2e-05,2e-06,7e-06,-8e-06,-2e-06,-9e-06,1e-06,3.5e-05,7e-06,-1.5e-05,1e-06,-4e-06,1.8e-05,2.1e-05,-6e-06,-3e-06,-8e-06,1e-06,2e-06,-6.4e-05,-9e-05,2.2e-05,-7e-06,2.8e-05,8e-06,-6e-06,-1.7e-05,3.6e-05,5.8e-05,3e-06,2.2e-05,-6.1e-05,1.1e-05,5.7e-05,-3.1e-05,-6e-06,-3.5e-05,3e-05,7.8e-05,2.5e-05,1.2e-05,-1.4e-05,-7e-06,-6e-06,-2e-06,-6.7e-05,7e-05,-9.5e-05,-4e-05,7.6e-05,-9.6e-05,1.9e-05,-0.000121,3.7e-05,-1.8e-05,0.000194,0.000244,9.6e-05,6.9e-05,-7.9e-05,-4.3e-05,-4.4e-05,-9.3e-05,-8.1e-05,-3e-06,5e-06,4.1e-05,2e-06,-5.7e-05,-1e-06,-2.5e-05,4.5e-05,6.4e-05,2e-06,4.9e-05,-3.2e-05,-5.7e-05,-1.3e-05,-3.1e-05,6.2e-05,8.4e-05,-4.1e-05,-0.000112,0.000158,6.6e-05,1.4e-05,-1.3e-05,7.3e-05,-3.4e-05,-4.7e-05,-5.6e-05,-7e-06,-6.8e-05,-1.1e-05,9.4e-05,-5e-06,-4.9e-05,8.4e-05,-5.6e-05,-3e-06,-4.7e-05,-2.7e-05,1e-06,1.5e-05,9.3e-05,0.000147
-1e-06,4e-06,-5e-06,0,7e-06,-7e-06,-1.1e-05,-3e-06,1e-06,0,-5e-06,3e-06,0,4e-06,1e-05,-8e-06,-5e-06,6e-06,-6e-06,3e-06,-3e-06,8e-06,-4.1e-05,-2.2e-05,4e-06,-2e-06,5e-06,8e-06,-1.4e-05,-1.2e-05,3e-06,9e-06,-2.1e-05,0,0.000151,4.4e-05,-4.4e-05,1.7e-05,-1.5e-05,-4e-06,1.9e-05,3.2e-05,-2e-06,3.7e-05,-4e-06,-2e-05,3.2e-05,7e-06,9e-06,-5e-06,2.7e-05,1.5e-05,2.6e-05,-7.7e-05,1e-06,1.1e-05,1.5e-05,-2.9e-05,0,1.1e-05,9.3e-05,-4.3e-05,-0.000115,-3.3e-05,3.2e-05,1.2e-05,-5.4e-05,-3e-06,-0.000126,-6e-06,2.9e-05,-9e-06,0.000109,5e-06,6e-06,2.3e-05,-3.4e-05,-6.4e-05,0.000135,2e-06,-4.1e-05,1.7e-05,-9e-06,-5.9e-05,-2.2e-05,-1.9e-05,7e-06,5.2e-05,1e-06,-5.6e-05,-3.9e-05,8.9e-05,5.9e-05,-2.1e-05,4e-05,-1e-05,-1.7e-05,-9.7e-05,6.1e-05,3e-06,-1.2e-05,2.2e-05,7e-06,-2.4e-05,-6.4e-05,-3.1e-05,-2e-05,-1.7e-05,-3.2e-05,4.6e-05,-6.5e-05,1.1e-05,-0.000104,1.9e-05,-2.5e-05,2.3e-05,1.7e-05,-7.5e-05,-4e-05,2.2e-05,0.000154
-6e-06,3e-06,-2e-06,3e-06,1e-05,-1.4e-05,-3e-06,-1e-06,1e-06,1e-06,-1e-05,-2e-06,3e-06,4e-06,0,-5e-06,1e-06,-2e-06,3e-06,1e-06,-3e-06,-6e-06,2.1e-05,-3e-06,-1.3e-05,0,-6e-06,2e-06,5e-06,-8e-06,-6e-06,-1.2e-05,-1.4e-05,1e-06,-0.000138,2.4e-05,2.5e-05,9e-06,-6e-06,-2e-06,-4e-06,3.5e-05,-5.7e-05,3.6e-05,-4e-06,9e-06,-1.5e-05,-5e-06,-7e-06,2.6e-05,-1.4e-05,-2e-06,-2.9e-05,-2e-06,-1e-05,2.5e-05,-9e-06,3e-05,2.3e-05,8e-06,2.9e-05,-0.000102,3.5e-05,5.5e-05,3.9e-05,-8.5e-05,-1.4e-05,-2e-06,1.4e-05,8e-06,-0.00015,7e-06,1.9e-05,-8.2e-05,-3e-06,3.1e-05,-2.2e-05,2.1e-05,2.4e-05,8e-06,-4.7e-05,-1.3e-05,-4e-06,-3.8e-05,-8e-06,-2.2e-05,1.4e-05,2.3e-05,-2.9e-05,2.6e-05,2.4e-05,-5.2e-05,-3.3e-05,-9e-06,-1.4e-05,0,9.4e-05,-7.2e-05,-5.6e-05,-5.5e-05,-4.7e-05,-3.5e-05,-7.3e-05,-7e-06,-4.2e-05,-2.1e-05,-2e-05,1.3e-05,-5.8e-05,-6e-06,1.3e-05,4.7e-05,2e-06,2.7e-05,-5.4e-05,1e-05,-4e-06,-1.3e-05,1.9e-05,4e-06,-0.000106
-8e-06,-6e-06,-5e-06,1e-06,6e-06,-5e-06,1e-06,-1.4e-05,-1e-06,-1e-06,-5e-06,-1e-06,0,1e-06,-7e-06,-1.3e-05,-1e-06,-2e-06,0,2e-06,-2e-06,0,-1.6e-05,1e-06,8e-06,-3e-06,4e-06,4e-06,-5e-06,1e-05,1e-06,-4e-06,-1e-05,2e-06,0.000119,9e-06,-1.3e-05,-9e-06,-1e-05,0,0,2.4e-05,-2.1e-05,-5e-06,1e-06,-2.8e-05,2e-05,-2.2e-05,-5.3e-05,4e-06,-1.9e-05,3e-05,-1.8e-05,1.2e-05,-6e-06,2.4e-05,-9e-06,5e-06,-1e-06,2.3e-05,-3.2e-05,-1e-05,9.6e-05,-3e-05,6.4e-05,-6e-05,-2e-06,1.3e-05,8.4e-05,-2.6e-05,-9.3e-05,9e-05,-5.5e-05,1e-05,-3.5e-05,3.4e-05,-1.1e-05,5.4e-05,5.6e-05,2e-06,-2.1e-05,-1.3e-05,-5e-06,-1.8e-05,8e-06,9e-06,-2.5e-05,2.4e-05,-1.8e-05,-1e-06,1e-06,7e-06,-1e-06,-1e-06,3e-05,6e-06,4.2e-05,-2.1e-05,2e-06,-8e-06,3e-06,-3.6e-05,-3.1e-05,-1e-05,-1.6e-05,2e-06,-2e-05,-6e-06,-1.7e-05,-2.5e-05,7e-06,-6.3e-05,2.7e-05,6e-06,-4.7e-05,-5e-06,-6e-05,1.4e-05,-2.6e-05,-2.3e-05,-8.7e-05
-7e-06,2e-06,-6e-06,2e-06,2e-06,6e-06,4e-06,-4e-06,-5e-06,2e-06,-5e-06,0,-4e-06,-3e-06,-3e-06,0,-3e-06,-3e-06,3e-06,-1e-06,-1e-06,-1e-05,2.6e-05,-1.5e-05,-4e-06,0,-4e-06,7e-06,-1e-06,1e-06,5e-06,-3e-06,-8e-06,-2e-06,-4.8e-05,-3.3e-05,4.5e-05,1.4e-05,1e-06,-2e-06,-3e-06,-2e-06,2.8e-05,-6e-06,-4e-06,-5e-06,-2.8e-05,2.1e-05,-3.6e-05,6e-06,4e-05,-1e-06,0,-7e-06,1e-06,1e-06,2.1e-05,-2.3e-05,-1.7e-05,2e-06,8e-06,9.5e-05,0.000113,-1.7e-05,-1e-06,-5e-06,-9e-06,5.3e-05,1.4e-05,-2e-05,6.6e-05,3.3e-05,-2e-05,6e-05,2e-06,-2.9e-05,-6e-06,3e-05,2.9e-05,1e-06,-1.4e-05,-9e-06,-4e-06,1.7e-05,-5e-06,2.6e-05,1.2e-05,9e-06,1.2e-05,-3.2e-05,-3.6e-05,4.2e-05,-6e-06,2e-06,-1.3e-05,-1.3e-05,-2.1e-05,-4e-05,-2.2e-05,2.1e-05,1.4e-05,-4.6e-05,-4.6e-05,-3.5e-05,7e-06,1.6e-05,-8e-06,6e-06,-2e-06,-7e-06,1.2e-05,4e-05,-7e-06,-1e-05,-3.1e-05,-1.5e-05,-4.6e-05,-1e-06,2e-06,6.7e-05,8e-06
-1e-06,-2e-06,-2e-06,-2e-06,-4e-06,-1e-06,5e-06,-5e-06,-2e-06,2e-06,-6e-06,-2e-06,-8e-06,-4e-06,4e-06,-7e-06,-1e-06,-3e-06,-3e-06,1e-06,-2e-06,6e-06,4e-06,-4e-06,3e-06,-1e-06,0,-1e-06,1e-06,-7e-06,1e-06,-4e-06,4e-06,-3e-06,3.3e-05,1.7e-05,-3e-05,-1e-05,1.7e-05,2e-06,7e-06,-9e-06,1.1e-05,-1.6e-05,3e-06,1.9e-05,-3e-06,4e-06,-2.4e-05,-1.5e-05,-1.6e-05,6e-06,1e-05,-6e-06,1e-06,-3e-06,-1.5e-05,5e-06,-3.5e-05,6e-06,4e-06,3e-05,3.8e-05,-2.1e-05,-5.4e-05,6e-05,1e-06,3.4e-05,-5.4e-05,-1.7e-05,0.000116,-9e-06,1.9e-05,8e-06,-1.1e-05,-6.2e-05,-1e-06,-3.5e-05,-2.7e-05,-3e-06,-4e-06,-2e-06,0,9e-06,-7e-06,-7e-06,-2.7e-05,-8e-06,-1.9e-05,2.5e-05,2e-06,2.5e-05,1.6e-05,-3e-06,1.6e-05,6e-06,-4.3e-05,-5.7e-05,-2.4e-05,1.4e-05,3.3e-05,-8e-06,-8e-06,-1e-05,1.1e-05,1.7e-05,-1.5e-05,2.8e-05,-2.7e-05,-6e-06,-8e-06,-3.6e-05,-4e-06,-2.3e-05,-1.3e-05,1.2e-05,-2e-06,-2.2e-05,1e-06,6.9e-05,0.000106
-2e-06,-4e-06,-4e-06,-4e-06,-5e-06,-5e-06,-2e-06,-3e-06,-2e-06,0,-3e-06,2e-06,-3e-06,-5e-06,1e-06,-8e-06,4e-06,-5e-06,-6e-06,-2e-06,-1e-06,-1e-06,8e-06,1e-06,-1e-06,-1e-06,-3e-06,-5e-06,3e-06,1e-06,-4e-06,3e-06,6e-06,0,-1.3e-05,1.6e-05,0,-1e-06,-1.7e-05,1e-06,-3e-06,-1.7e-05,3e-06,-3.6e-05,-1e-06,-1.3e-05,2e-06,-1.4e-05,-1.4e-05,2e-05,1e-06,-1.4e-05,-1.6e-05,-3e-06,5e-06,-5e-06,1.1e-05,9e-06,-1.8e-05,0,-1.6e-05,-5.1e-05,-2e-05,2.8e-05,-6.3e-05,4e-05,-8e-06,1.5e-05,5e-06,-1.6e-05,-1.7e-05,-6.4e-05,2.6e-05,8e-06,-2.3e-05,-5e-05,6e-06,-3e-05,-5.7e-05,-3e-06,1e-06,0,-7e-06,1.3e-05,7e-06,-1.2e-05,2.5e-05,-2.6e-05,-2.2e-05,1.9e-05,2.5e-05,-3e-05,-1.4e-05,-4e-06,0,1.4e-05,9e-06,-1.7e-05,-5.4e-05,-5e-06,-2.4e-05,-2e-06,2.5e-05,-6e-06,1.2e-05,1.3e-05,-1.4e-05,1.7e-05,-1.7e-05,-2.9e-05,-1e-05,7e-05,3.5e-05,1.3e-05,1e-05,2e-06,3e-05,-8e-06,-9e-06,-5.1e-05,2.8e-05
-1e-06,-5e-06,-2e-06,-3e-06,-4e-06,-5e-06,0,-2e-06,-2e-06,1e-06,-4e-06,-1e-06,-1e-06,-2e-06,-4e-06,-6e-06,-4e-06,0,-6e-06,0,-1e-06,-3e-06,0,-1.2e-05,1e-06,0,0,-3e-06,1e-06,-2e-06,0,-6e-06,5e-06,0,1.5e-05,-1.8e-05,-2.7e-05,-2e-06,-2e-06,0,-2e-06,-1.1e-05,-6e-06,-1.4e-05,0,6e-06,2e-06,-3e-06,1.6e-05,-2e-06,2.6e-05,8e-06,-8e-06,3.5e-05,0,-7e-06,-6e-06,-1.5e-05,-1.6e-05,1.5e-05,1.6e-05,-5.5e-05,-5.8e-05,-2.1e-05,-4.6e-05,-1.3e-05,-9e-06,3.7e-05,2e-05,1e-06,-0.000113,3.3e-05,-1.7e-05,3e-05,-5e-06,-1.5e-05,1e-05,-1.8e-05,-4.4e-05,-2e-06,1.3e-05,5e-06,-1e-06,4e-06,-1e-06,-8e-06,1e-06,-2.5e-05,6e-06,-3e-05,-1.5e-05,2e-06,1.8e-05,-8e-06,1.7e-05,-5e-06,4.4e-05,-4e-06,8e-06,-2.7e-05,-1.4e-05,8e-06,1.4e-05,-3e-06,1.3e-05,1.2e-05,-2.2e-05,-1.3e-05,-3e-06,-4.5e-05,1.9e-05,-6.7e-05,1e-06,9e-06,2.8e-05,-1.4e-05,2e-06,1.8e-05,7e-06,-3.9e-05,-5.4e-05
-2e-06,-1e-06,-2e-06,0,-5e-06,-7e-06,-3e-06,-4e-06,0,1e-06,-5e-06,0,-4e-06,0,0,-3e-06,-2e-06,1e-06,-5e-06,0,-1e-06,1e-06,2e-06,-3e-06,1e-06,-1e-06,1e-06,-6e-06,-1e-06,6e-06,1e-06,0,5e-06,1e-06,3.8e-05,0,-2e-06,-3e-06,-9e-06,0,2e-06,4e-06,-6e-06,-1.4e-05,1e-06,-7e-06,-1e-06,-5e-06,2.1e-05,1.2e-05,-1.1e-05,2e-06,1.8e-05,-4.8e-05,0,-2.1e-05,-4e-06,5e-06,0,0,2.1e-05,2.5e-05,-6.7e-05,-2.1e-05,-3.8e-05,-4e-06,0,2.6e-05,-2.2e-05,-1.2e-05,-3.9e-05,-3.1e-05,-5.9e-05,-3.2e-05,-1e-06,1.4e-05,8e-06,1.8e-05,1.4e-05,1e-06,1.6e-05,6e-06,-2e-06,-1.3e-05,-5e-06,8e-06,2.1e-05,-2.2e-05,-1e-06,1.7e-05,-2.1e-05,8e-06,-1.5e-05,-1e-06,-4e-06,7e-06,-6e-06,2.1e-05,2.8e-05,-5e-06,2e-06,-6e-06,3e-05,-1.2e-05,7e-06,5e-06,-1.4e-05,-1e-05,-2e-06,-2e-05,-5e-06,2.1e-05,1.1e-05,1.1e-05,1.7e-05,1.1e-05,-3.1e-05,1.2e-05,-8e-06,1.4e-05,-4.8e-05
-2e-06,4e-06,-3e-06,-1e-06,-4e-06,-4e-06,-1e-06,0,1e-06,0,-3e-06,0,5e-06,0,3e-06,-6e-06,2e-06,2e-06,-1e-06,-1e-06,-1e-06,-2e-06,-1.2e-05,-2e-06,0,1e-06,0,-4e-06,1e-06,-1e-06,-2e-06,-3e-06,6e-06,2e-06,-6.4e-05,-9e-06,1.4e-05,4e-06,1.9e-05,0,2e-06,7e-06,6e-06,-4e-06,0,2e-06,-7e-06,2e-06,2.4e-05,-7e-06,2e-06,1.2e-05,1.2e-05,2.4e-05,-3e-06,-2.3e-05,9e-06,1e-06,2e-06,3e-06,-1.7e-05,4.9e-05,-1.9e-05,-5e-06,-3.4e-05,-1.6e-05,-1e-06,-3e-06,-1.5e-05,-4e-06,8.4e-05,-0.000112,-2.3e-05,-2e-05,-1.3e-05,7e-06,8e-06,3.3e-05,1.8e-05,1e-06,2e-06,-2e-06,0,-2.2e-05,-2e-06,2e-06,-3e-06,-1.4e-05,-4e-06,5e-06,1.6e-05,-2e-06,-1e-06,-4e-06,1.3e-05,-3e-06,-1.4e-05,2.6e-05,3e-06,2.4e-05,4e-06,-1.5e-05,1.1e-05,-1.1e-05,-1e-05,1e-05,-9e-06,-8e-06,-2.5e-05,2.4e-05,-1e-05,1.2e-05,1.1e-05,-1.3e-05,2.1e-05,1e-06,-2.3e-05,-1.8e-05,-2e-06,4e-05,2.4e-05
-4e-06,0,-1e-06,2e-06,0,3e-06,-2e-06,-4e-06,1e-06,0,-3e-06,-1e-06,1e-06,0,-1e-06,-4e-06,0,2e-06,0,1e-06,-1e-06,4e-06,1e-05,-6e-06,-2e-06,-1e-06,-4e-06,0,-2e-06,-3e-06,1e-06,1e-06,-1e-06,0,6.8e-05,7e-06,5e-06,-6e-06,0,0,-1e-06,8e-06,1.3e-05,8e-06,1e-06,7e-06,4e-06,2e-06,2e-05,1e-06,2e-06,1e-06,-1e-05,1.8e-05,-1e-06,-1.7e-05,-9e-06,-1.1e-05,-5e-06,-4e-06,-1.1e-05,-1e-06,5e-06,2.5e-05,-2.3e-05,2.2e-05,-2e-06,-2e-06,2.7e-05,-4e-06,6e-05,-7.4e-05,2.5e-05,2.6e-05,-1e-05,2e-06,6e-06,4e-06,2.6e-05,1e-06,-1e-05,-6e-06,1e-06,-1.1e-05,5e-06,-1.2e-05,-5e-06,-6e-06,-1.2e-05,-2e-05,6e-06,2e-06,5e-06,0,-1.8e-05,-5e-06,6e-06,1.4e-05,1.1e-05,8e-06,-1.3e-05,-2.5e-05,-1e-06,0,-2.1e-05,-1e-06,-8e-06,-8e-06,-8e-06,3.1e-05,-7e-06,-3.1e-05,0,-1e-05,5e-06,-5e-06,-6e-06,-1.4e-05,4e-06,-5.1e-05,5.2e-05
-2e-06,3e-06,-2e-06,1e-06,2e-06,2e-06,1e-06,-2e-06,1e-06,-1e-06,-4e-06,0,1e-06,0,-2e-06,-3e-06,-2e-06,1e-06,2e-06,0,0,-4e-06,-1.4e-05,-5e-06,0,0,4e-06,-1e-06,0,-2e-06,1e-06,-1e-06,3e-06,-1e-06,-4.9e-05,1.5e-05,-1e-06,4e-06,3e-06,0,-2e-06,8e-06,-1e-05,8e-06,0,-1.2e-05,-7e-06,6e-06,6e-06,-4e-06,-2e-06,-4e-06,-3e-06,-3.3e-05,1e-06,-8e-06,4e-06,1.1e-05,0,1e-06,1e-05,-3.6e-05,3.2e-05,-1e-06,1.2e-05,-1.5e-05,0,-7e-06,-1e-05,-2e-06,-4.8e-05,4e-06,2.6e-05,-1e-06,-4e-06,0,3e-06,-1.9e-05,4e-06,0,-1.1e-05,2e-06,-2e-06,-1.3e-05,-3e-06,-3e-06,-5e-06,-1e-06,1.2e-05,2.1e-05,-1.8e-05,-1.1e-05,-4e-06,-3e-06,2e-05,2e-06,2.4e-05,1.3e-05,2.1e-05,-1.1e-05,1.3e-05,-1.3e-05,-3e-06,-4e-06,-1.2e-05,5e-06,-1.2e-05,0,6e-06,9e-06,5e-06,3e-05,-4e-06,-2e-06,-8e-06,3e-06,1.4e-05,9e-06,-6e-06,1.5e-05,1.2e-05
0,1e-06,-1e-06,0,2e-06,-2e-06,2e-06,-2e-06,0,0,-2e-06,0,3e-06,-1e-06,1e-06,-5e-06,1e-06,0,0,0,-1e-06,-1e-06,9e-06,-2e-06,-2e-06,0,-1e-06,2e-06,-1e-06,5e-06,-2e-06,-2e-06,1e-06,0,4.9e-05,-3e-05,-1.5e-05,-1e-06,-1.4e-05,0,3e-06,3e-06,-1.5e-05,1.4e-05,0,3e-06,7e-06,-3e-06,-4e-06,0,1e-06,-4e-06,9e-06,2.1e-05,1e-06,-6e-06,-4e-06,-1e-06,-1.1e-05,-1e-06,-7e-06,-2e-05,3.5e-05,-1e-05,3.2e-05,-7e-06,-4e-06,-2.1e-05,-3.1e-05,5e-06,-7.1e-05,-8e-06,-7e-06,-1.3e-05,-3e-06,-4e-06,2e-06,-2.4e-05,1.7e-05,0,-5e-06,1e-06,1e-06,-4e-06,-4e-06,4e-06,-7e-06,2.2e-05,-1.3e-05,0,6e-06,7e-06,4e-06,-1e-06,-6e-06,0,5e-06,1.1e-05,1.3e-05,-1.5e-05,0,-3e-06,-1.9e-05,-6e-06,-4e-06,-5e-06,-1e-05,-2e-06,-9e-06,-4e-06,2e-06,-1.4e-05,2e-06,9e-06,-1.5e-05,3e-06,1e-06,7e-06,2e-06,1.5e-05,-3.7e-05
0,2e-06,-1e-06,0,3e-06,-2e-06,1e-06,-2e-06,0,0,-3e-06,0,1e-06,-2e-06,2e-06,-3e-06,0,0,-1e-06,0,0,1e-06,-1e-05,-2e-06,2e-06,-1e-06,-1e-06,5e-06,1e-06,0,-1e-06,1e-06,1e-06,-1e-06,-3.4e-05,1.6e-05,4e-06,-2e-06,7e-06,0,-1e-06,-7e-06,4e-06,8e-06,0,-7e-06,-8e-06,-5e-06,-1.2e-05,5e-06,1e-06,0,1e-06,-2.2e-05,0,3e-06,1e-06,-7e-06,-1.2e-05,0,-3e-06,2.3e-05,2.3e-05,-4e-06,2.8e-05,-3e-06,0,-1.5e-05,-2e-06,-2e-06,-7e-06,-7.2e-05,-2.2e-05,1.2e-05,-7e-06,-7e-06,0,0,-1.2e-05,-1e-06,-5e-06,0,-3e-06,8e-06,2e-06,9e-06,1.1e-05,1.1e-05,-4e-06,-1.6e-05,1.4e-05,-1e-06,-3e-06,-1e-06,-7e-06,3e-06,-2.5e-05,1.7e-05,-1.4e-05,4e-06,-5e-06,2e-06,-1.5e-05,-1e-05,2e-06,-1e-06,-5e-06,1.3e-05,-1.4e-05,5e-06,0,4e-06,-6e-06,8e-06,-2.1e-05,-3e-06,-1.1e-05,-2e-06,4e-06,9e-06,-3.3e-05
-1e-06,-2e-06,-2e-06,-1e-06,4e-06,-3e-06,2e-06,-1e-06,-1e-06,0,-3e-06,1e-06,-2e-06,-1e-06,0,-3e-06,-1e-06,0,-3e-06,1e-06,0,0,1e-06,-5e-06,0,0,0,3e-06,1e-06,-1e-06,1e-06,-2e-06,-1e-06,0,2.4e-05,4e-06,-9e-06,5e-06,2e-06,0,0,-8e-06,1e-05,3e-06,0,8e-06,5e-06,-2e-06,-1.4e-05,0,-1e-06,6e-06,-1e-05,1.1e-05,1e-06,1e-06,2e-06,8e-06,-8e-06,0,1e-05,2.5e-05,-5e-06,1.7e-05,1.9e-05,6e-06,0,-7e-06,2.2e-05,-3e-06,7.4e-05,-6e-06,-1e-05,-7e-06,-4e-06,-5e-06,-1e-06,1.8e-05,-2.6e-05,0,-4e-06,0,1e-06,5e-06,2e-06,-3e-06,-2e-06,1.5e-05,-2e-06,2.1e-05,-1.2e-05,1e-06,0,-3e-06,6e-06,-2e-06,-4e-06,1.8e-05,-1.3e-05,1.6e-05,-4e-06,0,-5e-06,-2e-06,6e-06,-7e-06,-4e-06,1.4e-05,-5e-06,1.4e-05,2e-06,-2.8e-05,-1e-05,-1e-06,-1e-05,-4e-06,-1.5e-05,-4e-06,-5e-06,-7e-06,3.1e-05
-1e-06,-1e-06,-1e-06,-1e-06,2e-06,-3e-06,0,-3e-06,-1e-06,0,-2e-06,0,-1e-06,0,-2e-06,-3e-06,1e-06,-1e-06,-3e-06,0,0,1e-06,-2e-06,-3e-06,2e-06,0,1e-06,2e-06,0,-1e-06,0,2e-06,-1e-06,1e-06,-1.9e-05,-2e-06,1.7e-05,-3e-06,8e-06,1e-06,-2e-06,-6e-06,3e-06,0,0,2e-06,-6e-06,-1e-06,-9e-06,5e-06,3e-06,3e-06,-5e-06,3e-06,-2e-06,2e-06,-4e-06,1e-06,-2e-06,2e-06,0,-4e-06,-1.9e-05,0,1.7e-05,1.1e-05,-1e-06,-1.3e-05,-3e-06,-3e-06,2.8e-05,5.4e-05,1.6e-05,-1.7e-05,-3e-06,1e-06,-2e-06,1.7e-05,-2.4e-05,0,0,2e-06,-2e-06,2e-06,-4e-06,-9e-06,1.3e-05,1e-05,2e-06,-4e-06,-6e-06,-9e-06,-2e-06,0,7e-06,3e-06,2.2e-05,3e-06,1e-06,0,2e-06,-8e-06,-3e-06,-1e-06,5e-06,-3e-06,-7e-06,-4e-06,5e-06,-2e-06,-3e-06,2.8e-05,-1e-06,-7e-06,1e-06,5e-06,-1e-06,-4e-06,3e-06,-2.3e-05,3.7e-05
-2e-06,-1e-06,-1e-06,0,0,2e-06,0,-1e-06,-1e-06,0,-2e-06,0,0,0,0,-3e-06,0,-1e-06,-2e-06,0,0,-3e-06,1e-06,-2e-06,0,0,-1e-06,2e-06,0,0,-1e-06,-1e-06,-2e-06,0,1.5e-05,-3e-06,-9e-06,1e-06,-1.1e-05,0,2e-06,2e-06,-4e-06,-6e-06,0,-3e-06,4e-06,0,-6e-06,-8e-06,0,1e-06,8e-06,1e-05,1e-06,0,3e-06,-7e-06,-3e-06,3e-06,-9e-06,-2.8e-05,-2.2e-05,-1.2e-05,8e-06,-4e-06,-1e-06,-7e-06,-1e-05,-6e-06,-5.1e-05,-3.7e-05,1.8e-05,1.3e-05,-7e-06,8e-06,-3e-06,-2e-06,1.2e-05,0,5e-06,-2e-06,0,-1e-06,-1e-06,0,-8e-06,3e-06,-1.2e-05,-1.5e-05,1.3e-05,1.1e-05,4e-06,0,-1.5e-05,-2e-06,1.2e-05,1e-06,-9e-06,-1.1e-05,-2e-06,-1.3e-05,1e-05,-5e-06,6e-06,-6e-06,-7e-06,-7e-06,-1.1e-05,-2e-05,5e-06,-2.5e-05,-3e-06,-6e-06,8e-06,-3e-06,7e-06,2e-06,-4e-06,2.7e-05,-1.6e-05
-2e-06,0,-1e-06,1e-06,0,2e-06,-2e-06,-1e-06,0,0,-2e-06,0,-3e-06,0,1e-06,-2e-06,-1e-06,-1e-06,-1e-06,0,0,1e-06,3e-06,-3e-06,-1e-06,0,0,0,0,2e-06,1e-06,-1e-06,-2e-06,0,-2e-06,-3e-06,4e-06,-1e-06,-4e-06,0,-1e-06,6e-06,-7e-06,-6e-06,0,2e-06,-4e-06,0,1e-06,4e-06,1e-06,-5e-06,2e-06,-1.4e-05,-1e-06,4e-06,-2e-06,5e-06,-3e-06,0,1e-06,-4e-06,-1.5e-05,-1e-06,-8e-06,1e-06,-1e-06,4e-06,9e-06,-1e-06,-5.4e-05,-7e-06,-6e-06,8e-06,-3e-06,7e-06,-2e-06,-1.7e-05,1.5e-05,0,7e-06,-3e-06,0,-8e-06,4e-06,5e-06,6e-06,1e-06,1e-06,1.9e-05,0,-3e-06,-4e-06,0,7e-06,-4e-06,-1.2e-05,-4e-06,-1.5e-05,-5e-06,1e-06,-1.5e-05,1.3e-05,-5e-06,3e-06,-1e-06,-6e-06,-3e-06,-8e-06,-2e-05,-4e-06,2.8e-05,-6e-06,4e-06,1e-05,-2e-06,3e-06,3e-06,0,-7e-06,-2.2e-05
0,-1e-06,-1e-06,0,-2e-06,-1e-06,-1e-06,-1e-06,0,0,-2e-06,0,1e-06,0,-1e-06,-3e-06,1e-06,0,1e-06,0,0,1e-06,5e-06,-2e-06,1e-06,0,0,-2e-06,0,0,1e-06,1e-06,-2e-06,0,-1.2e-05,8e-06,-9e-06,0,3e-06,0,0,6e-06,1e-06,-6e-06,1e-06,-3e-06,2e-06,-1e-06,6e-06,-1e-06,2e-06,-1e-06,-9e-06,1.2e-05,1e-06,-3e-06,2e-06,-1e-06,-1e-06,2e-06,4e-06,1.7e-05,2e-06,1.3e-05,-2.2e-05,-7e-06,-1e-06,3e-06,5e-06,-3e-06,2.2e-05,2.4e-05,-1.9e-05,-1.2e-05,0,1e-06,-2e-06,-1.3e-05,4e-06,0,2e-06,0,0,-8e-06,0,3e-06,-1e-05,-1.4e-05,0,-4e-06,-1e-05,-4e-06,2e-06,-1e-06,5e-06,3e-06,-1.4e-05,-8e-06,4e-06,5e-06,1e-05,-4e-06,5e-06,-3e-06,-3e-06,-4e-06,-4e-06,-3e-06,4e-06,-2e-06,0,-2.3e-05,2e-06,5e-06,9e-06,3e-06,-1e-05,-4e-06,2e-06,-8e-06,-9e-06
1e-06,-1e-06,-1e-06,0,-3e-06,-2e-06,-1e-06,-1e-06,0,0,-2e-06,0,0,0,-1e-06,-3e-06,0,0,1e-06,0,0,-1e-06,-2e-06,-3e-06,-2e-06,0,0,-2e-06,0,-2e-06,-1e-06,-2e-06,-1e-06,0,1.4e-05,1e-06,7e-06,1e-06,8e-06,0,-1e-06,3e-06,1e-05,-5e-06,0,1e-06,-1e-06,-1e-06,7e-06,4e-06,-3e-06,0,1e-06,-4e-06,1e-06,-3e-06,0,-5e-06,-5e-06,-1e-06,-3e-06,1.4e-05,1e-05,1e-06,-2.7e-05,4e-06,-1e-06,5e-06,-1.3e-05,-1e-06,6e-05,6e-06,-1e-05,1e-06,-7e-06,-1e-06,-2e-06,5e-06,1.3e-05,0,-3e-06,3e-06,1e-06,-2e-06,-2e-06,-6e-06,3e-06,-8e-06,0,-1.2e-05,7e-06,2e-06,-1e-06,-1e-06,-9e-06,0,1.3e-05,1e-06,8e-06,1e-05,-9e-06,-3e-06,6e-06,0,-6e-06,2e-06,-5e-06,-4e-06,-4e-06,1.2e-05,-1e-06,2e-05,1e-06,3e-06,3e-06,-1e-06,-8e-06,-2e-06,-3e-06,-4e-06,2.5e-05
0,1e-06,-1e-06,0,-2e-06,-1e-06,1e-06,-2e-06,0,0,-2e-06,0,-1e-06,-1e-06,1e-06,-3e-06,-1e-06,1e-06,0,0,0,0,8e-06,-3e-06,1e-06,0,-1e-06,-2e-06,0,0,0,1e-06,-1e-06,-1e-06,-1.3e-05,-1e-05,3e-06,-2e-06,-2e-06,0,1e-06,-1e-06,2e-06,-1e-06,0,-2e-06,-1e-06,0,7e-06,-3e-06,1e-06,4e-06,8e-06,-4e-06,-1e-06,-5e-06,-2e-06,7e-06,-6e-06,-1e-06,3e-06,-7e-06,1.2e-05,-1e-05,-2.4e-05,0,0,8e-06,1e-06,0,7e-06,-2.3e-05,5e-06,3e-06,-3e-06,-2e-06,-1e-06,1.5e-05,1e-06,0,-4e-06,1e-06,-1e-06,-4e-06,1e-06,-3e-06,-2e-06,-1.3e-05,-9e-06,1.7e-05,5e-06,6e-06,-1e-06,-1e-06,1e-06,-2e-06,1.4e-05,-5e-06,4e-06,-1e-06,-2e-06,2e-06,-4e-06,-3e-06,-5e-06,-2e-06,-5e-06,-2e-06,-6e-06,7e-06,-1e-06,-9e-06,-3e-06,-6e-06,-2e-06,0,0,2e-06,3e-06,2e-05,1.3e-05
-1e-06,1e-06,-1e-06,0,-2e-06,-2e-06,1e-06,-1e-06,0,0,-2e-06,0,2e-06,0,0,-2e-06,1e-06,1e-06,-1e-06,0,0,-1e-06,-6e-06,-1e-06,-1e-06,0,0,-3e-06,0,1e-06,1e-06,-1e-06,1e-06,0,7e-06,0,2e-06,2e-06,-4e-06,0,0,-4e-06,-1.1e-05,0,0,0,0,-1e-06,5e-06,-3e-06,1e-06,1e-06,1e-06,-6e-06,1e-06,-4e-06,2e-06,-2e-06,-5e-06,-4e-06,4e-06,-1.5e-05,8e-06,0,-1.8e-05,-3e-06,0,5e-06,1.1e-05,-2e-06,-5.6e-05,-3.3e-05,1.3e-05,-9e-06,-1e-06,0,0,9e-06,-7e-06,0,-2e-06,-1e-06,0,0,2e-06,5e-06,2e-06,-6e-06,4e-06,-6e-06,-9e-06,-2e-06,2e-06,0,6e-06,3e-06,-9e-06,-8e-06,-1e-06,-1e-05,2e-06,-7e-06,-1e-05,-3e-06,-1e-06,4e-06,-6e-06,6e-06,-6e-06,-4e-06,2e-06,-1.3e-05,5e-06,-3e-06,-6e-06,0,5e-06,1e-06,-1e-06,-7e-06,-1.5e-05
-1e-06,0,-1e-06,-1e-06,-1e-06,1e-06,1e-06,-1e-06,0,0,-2e-06,0,1e-06,0,0,-2e-06,0,1e-06,-2e-06,0,0,2e-06,5e-06,-2e-06,1e-06,0,0,-1e-06,0,1e-06,0,0,0,0,-1.2e-05,7e-06,0,-1e-06,-4e-06,0,0,-4e-06,-5e-06,2e-06,-1e-06,3e-06,-2e-06,-1e-06,2e-06,0,-1e-06,0,-6e-06,1.3e-05,-1e-06,-6e-06,-2e-06,-3e-06,-4e-06,-1e-06,-4e-06,-2e-06,2e-06,9e-06,-1.2e-05,-4e-06,0,2e-06,-8e-06,1e-06,-3.4e-05,9e-06,-1e-06,2e-06,-4e-06,1e-06,0,-5e-06,-2e-05,0,-2e-06,0,-1e-06,3e-06,-2e-06,4e-06,5e-06,-8e-06,-4e-06,-1e-05,1e-06,-4e-06,-2e-06,-1e-06,-4e-06,-2e-06,-1.3e-05,-1e-06,1e-05,-3e-06,4e-06,-6e-06,-5e-06,-3e-06,0,-1e-06,-5e-06,9e-06,3e-06,-2e-06,2e-06,2.6e-05,2e-06,1e-06,-7e-06,1e-06,2e-06,0,-2e-06,-7e-06,-1.6e-05
-1e-06,0,0,0,0,3e-06,1e-06,-1e-06,0,0,-2e-06,0,-1e-06,0,-1e-06,-3e-06,-1e-06,0,-2e-06,0,0,0,-4e-06,-4e-06,-1e-06,0,0,1e-06,0,-1e-06,-1e-06,0,0,0,1.3e-05,1e-06,-9e-06,0,8e-06,0,-1e-06,-2e-06,8e-06,2e-06,0,1e-06,3e-06,-1e-06,-1e-06,1e-06,0,-3e-06,-1e-06,-1.8e-05,0,-3e-06,2e-06,7e-06,-4e-06,-2e-06,-3e-06,1.1e-05,-4e-06,1e-06,-1e-06,2e-06,0,2e-06,-1.1e-05,0,3.9e-05,3e-06,-1.4e-05,1e-05,-3e-06,0,0,-1.5e-05,-5e-06,0,-3e-06,1e-06,-1e-06,1e-06,-2e-06,-2e-06,-3e-06,0,-1e-06,1.7e-05,8e-06,2e-06,1e-06,0,-6e-06,-1e-06,6e-06,-7e-06,5e-06,5e-06,-3e-06,-1.3e-05,-7e-06,-2e-06,0,4e-06,-4e-06,3e-06,-3e-06,1e-05,0,-1.8e-05,0,6e-06,-5e-06,-1e-06,-8e-06,-3e-06,0,0,7e-06
-1e-06,1e-06,-1e-06,0,1e-06,0,0,-1e-06,0,0,-2e-06,0,0,0,1e-06,-2e-06,1e-06,0,0,0,0,-1e-06,1e-06,-2e-06,1e-06,0,0,1e-06,0,-1e-06,1e-06,-1e-06,1e-06,0,-1.7e-05,-1e-05,6e-06,1e-06,-1e-06,0,1e-06,0,6e-06,1e-06,0,1e-06,-3e-06,-3e-06,-3e-06,4e-06,0,-1e-06,7e-06,1.4e-05,0,-4e-06,0,-3e-06,-3e-06,1e-06,2e-06,1e-05,-3e-06,-1.1e-05,1.2e-05,7e-06,-1e-06,-1e-06,8e-06,-1e-06,4.9e-05,-5.5e-05,-1.1e-05,-3e-06,-2e-06,1e-06,1e-06,-7e-06,5e-06,0,-1e-06,-2e-06,1e-06,0,2e-06,-6e-06,5e-06,1e-05,-4e-06,-7e-06,-7e-06,-1e-06,0,-1e-06,7e-06,1e-06,1.7e-05,-2e-06,-1e-05,7e-06,2e-06,-4e-06,1e-06,-1e-06,1e-06,-1e-06,-4e-06,-4e-06,-8e-06,9e-06,-3e-06,1.3e-05,0,4e-06,-1e-06,0,-5e-06,1e-06,-1e-06,5e-06,1.8e-05
0,-1e-06,-1e-06,0,2e-06,-2e-06,-1e-06,-1e-06,0,0,-2e-06,0,1e-06,0,0,-3e-06,0,0,0,0,0,0,-2e-06,-2e-06,0,0,0,2e-06,0,0,0,1e-06,1e-06,0,1e-05,4e-06,-4e-06,0,3e-06,0,0,3e-06,-2e-06,1e-06,0,-2e-06,3e-06,1e-06,-4e-06,-4e-06,0,1e-06,0,1e-06,1e-06,-1e-06,-2e-06,-4e-06,-3e-06,0,2e-06,-5e-06,-2e-06,0,1.8e-05,-2e-06,-1e-06,-4e-06,4e-06,-1e-06,-1.2e-05,-1.9e-05,4e-06,-4e-06,-3e-06,0,1e-06,7e-06,7e-06,0,3e-06,0,-1e-06,-3e-06,1e-06,1e-06,-8e-06,5e-06,1e-06,-9e-06,-3e-06,2e-06,-1e-06,-1e-06,-1e-06,-1e-06,-1e-06,2e-06,-2e-06,-2e-06,2e-06,-6e-06,8e-06,-3e-06,1e-06,3e-06,-5e-06,-4e-06,-1e-06,-6e-06,2e-06,-1.9e-05,2e-06,-3e-06,5e-06,1e-06,0,1e-06,2e-06,1.4e-05,-6e-06
