0.297048,0.245175,0.231775,0.232194,0.266362,0.250811,0.22599,0.228122,0.207893,0.17298,0.160174,0.157048,0.133495,0.124331,0.132667,0.132939,0.134864,0.127649,0.116018,0.115176,0.111361,0.104864,0.100007,0.095815,0.083555,0.085067,0.09934,0.105623
0.335752,0.27777,0.261873,0.263792,0.306465,0.290561,0.26139,0.262246,0.237333,0.198534,0.186568,0.185519,0.15955,0.146428,0.153952,0.15752,0.164572,0.154873,0.13991,0.14302,0.142837,0.134922,0.127419,0.121611,0.106237,0.109849,0.125859,0.12926
0.371712,0.309063,0.28964,0.29358,0.345494,0.334309,0.304322,0.299993,0.269586,0.231568,0.222382,0.225376,0.200089,0.179155,0.182969,0.195879,0.214011,0.199112,0.179188,0.191725,0.199541,0.189799,0.179061,0.170424,0.149779,0.159005,0.176732,0.171911
0.33291,0.28544,0.265044,0.265662,0.310218,0.312923,0.295558,0.283696,0.256104,0.233109,0.228176,0.234913,0.220576,0.194492,0.192661,0.216175,0.244175,0.227836,0.208347,0.230151,0.245573,0.23641,0.226006,0.217693,0.196901,0.213776,0.22999,0.211478
0.263518,0.242409,0.2217,0.214846,0.234832,0.247009,0.253347,0.244133,0.221384,0.213139,0.211664,0.219066,0.221942,0.196277,0.185044,0.209702,0.239564,0.235084,0.220527,0.236233,0.251863,0.247914,0.2436,0.239868,0.232696,0.261694,0.269889,0.231969
0.260018,0.254949,0.232047,0.215875,0.215829,0.231382,0.252244,0.242942,0.21716,0.217043,0.216204,0.221277,0.233309,0.204792,0.181498,0.197137,0.222515,0.238247,0.224882,0.211396,0.216417,0.224663,0.227001,0.225601,0.24875,0.292685,0.281583,0.227744
0.371474,0.363192,0.320875,0.306721,0.308203,0.307977,0.321839,0.308222,0.277447,0.281931,0.276869,0.272648,0.278041,0.247969,0.228388,0.241496,0.253348,0.270758,0.253661,0.213179,0.203714,0.213705,0.212573,0.214088,0.260057,0.303583,0.275178,0.224612
0.604965,0.590229,0.505131,0.501749,0.511947,0.485267,0.4947,0.472132,0.426003,0.439477,0.427658,0.394567,0.384767,0.370544,0.381511,0.40784,0.380964,0.36057,0.341413,0.306914,0.299686,0.278718,0.253855,0.267716,0.304399,0.3185,0.287543,0.256854
0.986198,0.966178,0.817117,0.845999,0.875483,0.824965,0.839375,0.803744,0.727324,0.747579,0.726461,0.647203,0.61961,0.633298,0.68832,0.736075,0.659755,0.57749,0.538062,0.507873,0.516138,0.44688,0.375283,0.414838,0.434698,0.408618,0.386387,0.371364
1.531793,1.510546,1.267383,1.376494,1.445494,1.350055,1.370021,1.319017,1.203338,1.246654,1.218816,1.072181,1.018188,1.07385,1.194968,1.258574,1.10564,0.940039,0.86699,0.825071,0.852717,0.726117,0.581595,0.669368,0.695539,0.6227,0.593028,0.580709
2.200451,2.199644,1.838782,2.03411,2.120854,1.942269,1.990615,1.942482,1.795301,1.899528,1.858645,1.622213,1.538921,1.663529,1.881137,1.925987,1.68007,1.443113,1.315515,1.236102,1.286065,1.094516,0.855114,1.012092,1.071482,0.948105,0.892741,0.88475
2.776304,2.839538,2.378193,2.569937,2.59738,2.318388,2.44069,2.432029,2.278174,2.477007,2.425228,2.098678,1.97319,2.191584,2.545871,2.533699,2.202745,1.926964,1.72331,1.606294,1.680686,1.432391,1.112297,1.35607,1.488192,1.321455,1.216652,1.220636
2.90002,3.018856,2.516618,2.587267,2.51746,2.223584,2.443023,2.468106,2.309706,2.592251,2.568076,2.200793,2.021495,2.326829,2.812933,2.727463,2.370353,2.103722,1.830599,1.716731,1.813973,1.551616,1.203186,1.499663,1.72064,1.544318,1.390301,1.409857
2.338816,2.465119,2.03478,1.954196,1.869677,1.705996,1.932116,1.939461,1.786237,2.067248,2.10158,1.785458,1.578659,1.882989,2.375014,2.248408,1.952837,1.753728,1.499696,1.426534,1.518982,1.331446,1.042212,1.293839,1.544978,1.409551,1.246124,1.273461
1.471562,1.557414,1.304632,1.168615,1.13125,1.130051,1.265408,1.233435,1.124002,1.292395,1.351589,1.163149,0.983253,1.148488,1.45853,1.355631,1.182715,1.073092,0.940849,0.925748,0.964716,0.88518,0.715178,0.83481,1.018476,0.969931,0.873883,0.882329
1.170407,1.175074,1.103527,1.003766,0.886001,0.973228,1.126723,1.06825,0.946946,0.944216,0.973556,0.848004,0.698122,0.74273,0.848367,0.783829,0.691827,0.647866,0.631525,0.610414,0.560065,0.541325,0.482571,0.491654,0.566494,0.610061,0.631942,0.601237
1.481887,1.460393,1.471917,1.404344,1.207856,1.303529,1.506057,1.47095,1.35287,1.275994,1.19918,0.93316,0.728132,0.756292,0.897635,0.898636,0.792114,0.764018,0.741446,0.689386,0.603386,0.559575,0.523616,0.483904,0.498298,0.574513,0.706598,0.6931
1.9654,2.035691,2.034226,1.976771,1.745184,1.803317,2.029784,2.075635,1.998213,1.843016,1.634315,1.22288,0.944041,0.975171,1.159042,1.193782,1.056141,1.025546,1.009794,0.960972,0.891469,0.808664,0.722713,0.645542,0.644138,0.724367,0.901124,0.908727
2.33881,2.624662,2.610153,2.621006,2.352531,2.398748,2.691228,2.82865,2.806312,2.59315,2.313171,1.750992,1.302822,1.230194,1.424499,1.587219,1.410558,1.315169,1.355957,1.335129,1.327063,1.221967,1.00931,0.856478,0.841211,0.892066,1.069873,1.110275
2.478569,2.975055,3.005983,3.193762,2.813166,2.877983,3.322271,3.555647,3.651059,3.372005,3.020002,2.391103,1.744803,1.443216,1.616746,1.990818,1.799921,1.598736,1.665479,1.657144,1.761298,1.681035,1.305885,1.051024,1.012379,1.021019,1.177082,1.25493
2.456684,2.865409,2.853179,3.247108,2.823249,2.988972,3.544435,3.745921,3.966058,3.665516,3.272142,2.810183,2.12429,1.545618,1.653564,2.226139,2.070334,1.808577,1.877006,1.786158,1.934142,1.91129,1.43667,1.149162,1.128615,1.09473,1.227482,1.327063
2.285338,2.337897,2.155747,2.676889,2.407585,2.715991,3.238801,3.186617,3.34731,3.107062,2.780745,2.65812,2.142342,1.439505,1.48568,2.111379,2.03691,1.842798,2.00027,1.742631,1.688176,1.696953,1.298113,1.100097,1.105046,1.023303,1.112976,1.196107
2.113984,1.879956,1.580989,1.966154,1.883411,2.169859,2.434463,2.211568,2.206138,2.049622,1.890137,1.969847,1.702684,1.199248,1.194214,1.614633,1.669951,1.685131,2.002027,1.661523,1.240065,1.190768,1.038404,1.038247,1.042292,0.89801,0.907028,0.918127
1.935593,1.701687,1.43235,1.548755,1.51189,1.641913,1.671199,1.481065,1.400267,1.313687,1.218668,1.22385,1.10232,0.947391,0.998598,1.153721,1.251058,1.476601,1.86497,1.539362,0.985716,0.998431,1.02371,0.983279,0.977503,0.904274,0.807039,0.674645
1.771251,1.647433,1.467623,1.588512,1.584088,1.543892,1.482687,1.266306,1.079435,1.020641,1.003948,1.067112,1.004864,0.982143,1.112424,1.116464,1.122024,1.319832,1.532156,1.24062,0.921965,1.174521,1.242779,0.999272,0.940455,0.932411,0.744924,0.53043
1.542291,1.534989,1.6644,1.957816,1.874854,1.711565,1.712639,1.428744,1.075196,0.924148,0.89325,1.070847,1.11625,1.178133,1.427293,1.350473,1.147726,1.135403,1.160905,1.022722,0.96594,1.408228,1.504515,1.060573,0.887332,0.90399,0.792846,0.591302
1.424229,1.387766,1.801467,2.274594,2.09138,1.824652,1.933117,1.640018,1.072771,0.903768,0.916254,1.026322,1.125015,1.297281,1.677233,1.603115,1.244253,1.102425,1.025496,0.985822,1.06737,1.637036,1.78849,1.230168,0.903116,0.912334,0.908787,0.674971
1.385795,1.21101,1.780945,2.377621,2.091971,1.76291,2.036375,1.890529,1.140728,0.893069,1.063155,1.088445,1.045181,1.22476,1.681544,1.653205,1.275735,1.192251,1.146354,1.062149,1.090571,1.739982,2.031753,1.432629,0.990355,1.034138,1.040771,0.717093
1.350966,0.991613,1.567911,2.189127,1.881511,1.53304,1.932091,2.000721,1.230862,0.854902,1.15245,1.183517,0.944715,1.091021,1.508892,1.404825,1.08788,1.12372,1.226781,1.119004,1.037173,1.651831,2.002019,1.462142,1.00509,1.121712,1.138735,0.787366
1.30971,0.731567,1.118688,1.636899,1.505696,1.316102,1.609415,1.779023,1.211832,0.829718,1.148892,1.129227,0.761005,0.87859,1.132394,0.965455,0.839129,0.97438,1.162485,1.054118,0.932401,1.383851,1.673235,1.328345,0.946134,1.071748,1.149203,0.844375
1.189428,0.554035,0.783322,1.136001,1.11516,1.080944,1.214369,1.406107,1.148055,0.902937,1.070291,0.91598,0.573583,0.652804,0.729116,0.54764,0.643542,0.836211,0.995662,0.969471,0.859916,1.02958,1.233154,1.101271,0.819001,0.861311,0.959479,0.791743
1.100876,0.581208,0.687899,0.925845,0.976448,0.977579,1.001215,1.162222,1.065973,0.894532,0.874505,0.617082,0.409843,0.509507,0.52175,0.373086,0.607399,0.794129,0.827622,0.894934,0.810423,0.718338,0.77344,0.745517,0.669846,0.676026,0.686822,0.610082
1.021104,0.645522,0.578654,0.719593,0.908474,1.032793,0.877511,0.829837,0.843268,0.77924,0.750431,0.50104,0.313501,0.396624,0.457526,0.400321,0.613203,0.741951,0.65353,0.706422,0.715532,0.555231,0.466199,0.463595,0.529329,0.551165,0.506197,0.418627
0.916908,0.657557,0.472836,0.590246,0.900734,1.082302,0.741962,0.496511,0.602618,0.650021,0.644142,0.523216,0.349477,0.362444,0.445864,0.436765,0.522242,0.644346,0.571853,0.494591,0.53361,0.429927,0.37614,0.442933,0.461273,0.446061,0.38981,0.311548
0.804686,0.607706,0.408355,0.482273,0.815761,0.978157,0.639688,0.421146,0.535436,0.610414,0.545752,0.475492,0.374268,0.38664,0.458207,0.414045,0.359181,0.490725,0.51365,0.347967,0.326574,0.326443,0.340178,0.422681,0.366123,0.302847,0.262778,0.250793
0.772355,0.534213,0.406555,0.507641,0.72957,0.752099,0.560035,0.458845,0.604561,0.663812,0.483916,0.367631,0.336848,0.414671,0.450367,0.356316,0.253181,0.36409,0.440335,0.276653,0.193338,0.218917,0.272773,0.371512,0.307834,0.222972,0.206579,0.23035
0.770837,0.476568,0.409975,0.537878,0.601337,0.482201,0.425558,0.429452,0.600119,0.687643,0.519042,0.332655,0.29296,0.457635,0.485094,0.315666,0.221945,0.289318,0.349104,0.254887,0.161102,0.149698,0.219075,0.315434,0.278744,0.228607,0.212734,0.231751
0.7421,0.518476,0.39258,0.475663,0.484097,0.339179,0.307946,0.349616,0.489397,0.59242,0.546002,0.376842,0.33202,0.509604,0.498693,0.288813,0.223826,0.272993,0.306487,0.244264,0.162378,0.115016,0.192494,0.269476,0.223395,0.234673,0.245255,0.246762
0.668515,0.612554,0.391981,0.353929,0.370406,0.297916,0.282024,0.32418,0.358947,0.413925,0.484959,0.380967,0.360484,0.502564,0.440205,0.283146,0.254158,0.281775,0.301555,0.223772,0.176944,0.126701,0.21064,0.274345,0.184011,0.225661,0.288508,0.276641
0.713623,0.719552,0.380139,0.237623,0.249345,0.27526,0.311613,0.303997,0.303321,0.288869,0.356578,0.319582,0.335946,0.424918,0.333036,0.270294,0.277056,0.268406,0.289251,0.209387,0.203739,0.173716,0.251418,0.291783,0.165258,0.200716,0.294399,0.289223
