-9.4e-05,-0.016421,-0.066833,-0.03154,-0.086521,-0.144417,-0.139807,-0.135573,-0.147276,-0.14272,-0.117781,-0.109674,-0.059083,-0.026635,-0.009014,-0.001209,-0.00056,-0.000413,-0.000342,-0.000179,-0.000271,-0.00043,-0.000366,-0.001565,-0.001887,-0.009499,-0.040393,-0.093435
0.00013,-0.01799,-0.075782,-0.002524,0.120659,0.143101,0.152207,0.147275,0.15254,0.158345,0.147746,0.128863,0.071671,0.032612,0.010931,0.000807,0.000576,0.000524,0.000469,0.000261,0.00019,-3e-05,-0.000103,-0.00165,-0.002835,-0.012183,-0.035801,-0.077385
-2e-05,-0.002052,-0.004905,-0.004166,-0.029907,-0.052668,-0.035935,-0.033777,-0.023132,-0.025567,-0.035473,-0.015715,-0.006853,-0.006522,-0.003346,-0.000603,-0.00041,-0.000157,-4.6e-05,-5.9e-05,-5e-05,-2.7e-05,-7.3e-05,-0.000815,-0.001648,-0.003657,0.001879,0.004895
-0.000104,0.014592,0.064323,0.002641,-0.098907,-0.118761,-0.136787,-0.128578,-0.134749,-0.143289,-0.129142,-0.122337,-0.068191,-0.028871,-0.009473,-0.000984,-0.000569,-0.000487,-0.000452,-0.00022,-0.000132,0.000122,7.6e-05,0.000625,0.000642,0.003741,0.02802,0.063002
0.000157,0.013216,0.052613,0.0279,0.108735,0.168839,0.148999,0.143657,0.147084,0.150209,0.143067,0.117286,0.061786,0.028711,0.010656,0.001671,0.000899,0.000563,0.00037,0.00022,0.000277,0.000354,0.000336,0.001014,0.001225,0.001091,0.009011,0.041724
-7.7e-05,-0.006341,-0.028865,-0.009742,0.003994,0.01244,0.032809,0.031752,0.043072,0.042494,0.020621,0.03793,0.020786,0.005911,0.00109,9.8e-05,-8.4e-05,7.2e-05,0.000137,7e-06,-4e-05,-0.000187,-1e-04,-0.000707,-0.001195,-0.007991,-0.032689,-0.02815
-4.2e-05,-0.014538,-0.06248,-0.034654,-0.108468,-0.147538,-0.14545,-0.13593,-0.154054,-0.157472,-0.141065,-0.137919,-0.074706,-0.029074,-0.009482,-0.00132,-0.000536,-0.000508,-0.00044,-0.000196,-0.000272,-0.000373,-0.000358,-0.001297,-0.00186,-0.004308,-0.025135,-0.048475
8e-05,-0.003734,-0.016401,0.0059,0.074174,0.085171,0.07472,0.063084,0.058787,0.0744,0.091861,0.062745,0.035231,0.015873,0.006314,0.000704,0.00052,0.000301,0.000171,0.000127,0.000137,0.000119,7.3e-05,0.000264,-2e-06,0.004429,0.011696,-0.014462
-6.4e-05,0.009441,0.04249,0.018189,0.028125,0.031006,0.052689,0.047657,0.068786,0.06684,0.044376,0.072462,0.041465,0.012435,0.003195,0.000355,-6.7e-05,9.8e-05,0.000225,4.9e-05,8.7e-05,0.000152,0.000178,0.001195,0.000764,0.001416,0.018279,0.02098
2.1e-05,0.009981,0.044875,0.002461,-0.089216,-0.106235,-0.112496,-0.099409,-0.109793,-0.126398,-0.126555,-0.115234,-0.064064,-0.022262,-0.007234,-0.000649,-0.000379,-0.000394,-0.000315,-0.000125,-9.2e-05,6.3e-05,5.6e-05,0.00104,0.00023,-0.00634,0.004584,0.039607
3.5e-05,-0.001774,-0.007603,0.004864,0.055361,0.072485,0.036941,0.021294,0.02217,0.044647,0.063864,0.028088,0.011089,0.004527,0.002462,0.000613,0.000466,0.000211,-3e-06,5.2e-05,6.7e-05,4.6e-05,4.5e-05,-3.9e-05,-0.001277,-0.010816,-0.0178,0.015139
-2.3e-05,-0.008781,-0.040786,-0.008484,0.039217,0.055733,0.0731,0.066726,0.086418,0.090524,0.070007,0.092622,0.051873,0.015245,0.003888,0.000204,-3.8e-05,0.000214,0.000292,6e-05,9e-06,-0.000142,-0.000108,-0.001108,-0.00204,-0.005124,-0.015244,-0.016206
-3.6e-05,-0.004342,-0.020966,-0.017439,-0.081022,-0.090579,-0.079402,-0.055969,-0.083023,-0.112134,-0.113235,-0.098361,-0.048926,-0.013339,-0.004829,-0.00099,-0.000401,-0.000287,-0.000154,-5.4e-05,-0.000114,-0.000153,-0.000195,-0.00099,-0.000735,0.005648,0.005898,-0.033587
5e-05,0.003223,0.014989,0.007872,0.024008,0.021511,-0.001717,-0.017076,-0.029038,-0.008495,0.023191,-0.017544,-0.011089,-0.004128,-0.000594,2e-06,0.000228,1.5e-05,-0.000184,-2.7e-05,2.7e-05,0.000113,6.4e-05,-7.1e-05,0.001019,0.00832,0.013474,-0.023259
-3.2e-05,0.006153,0.029405,0.012684,0.037055,0.046945,0.069031,0.054212,0.093741,0.104901,0.083202,0.102144,0.0533,0.014627,0.004554,0.00063,5.5e-05,0.00019,0.000264,6.1e-05,0.000103,0.000137,0.000181,0.000634,0.001578,0.003543,0.00665,0.013733
3.8e-05,0.001854,0.009789,-0.004479,-0.064203,-0.073751,-0.052778,-0.022637,-0.036108,-0.064778,-0.082095,-0.059391,-0.03138,-0.005557,-0.001651,-0.000199,-0.000221,-0.000188,-2.4e-05,-5e-06,-2.9e-05,-1.6e-05,-7e-06,0.000277,0.000617,-0.001305,0.001018,0.041859
-3.4e-05,-0.004609,-0.020393,-0.0044,0.009498,-0.004595,-0.031557,-0.038777,-0.064024,-0.041582,-0.006574,-0.045969,-0.026138,-0.010847,-0.003197,0,0.000212,-1.2e-05,-0.000244,-6.7e-05,-4.6e-05,-3.9e-05,-7.9e-05,-0.00053,-0.000943,-0.003415,-0.005491,0.015069
-2e-06,-0.003177,-0.017592,-0.003798,0.038434,0.061153,0.066641,0.043091,0.073365,0.086708,0.078008,0.093204,0.050392,0.011024,0.003022,0.00038,7.9e-05,0.000177,0.000183,3e-05,2e-06,-8.8e-05,-3.8e-05,-0.000486,-0.000869,0.000162,-0.003534,-0.0314
8e-06,0.001109,0.002537,-0.005475,-0.044455,-0.027672,-0.012022,0.021001,0.007215,-0.036994,-0.0595,-0.028935,-0.010285,0.005396,0.001646,-0.00031,-0.000185,-6.7e-05,0.000128,4.6e-05,-6e-06,-4.2e-05,-3.9e-05,0.00035,0.000734,0.003129,0.002045,-0.034954
