-0.002922,-0.003828,-0.005023,-0.004978,-0.004623,-0.007169,-0.011721,-0.011998,-0.00818,-0.009732,-0.00763,-0.010153,-0.010732,-0.012646,-0.019975,-0.02047,-0.021446,-0.02347,-0.033327,-0.028577,-0.022979,-0.025335,-0.02229,-0.02204,-0.022363,-0.028957,-0.024491,-0.014331
-0.001307,-0.000349,-0.000205,-0.000168,0.000587,-0.004,-0.005903,-0.006314,-0.002994,-0.003329,-0.002001,-0.005128,0.00071,-0.001278,-0.008612,-0.011573,-0.013962,-0.015484,-0.017245,-0.014387,-0.006204,-0.000581,-0.004574,-0.005898,-0.012984,-0.017322,-0.014145,-0.005456
0.000565,-0.000101,0.000337,0.000962,-0.00038,0.000111,0.00137,0.002971,0.002253,0.001508,0.000334,0.000757,-0.000486,0.001561,0.006664,0.005764,0.001715,0.003543,0.008181,0.006913,0.003128,0.006978,0.010369,0.006851,0.002479,0.006076,0.007149,0.001907
0.00125,5.5e-05,0.000274,0.000326,-0.000427,0.003517,0.006195,0.006454,0.002873,0.003394,0.001154,0.004757,-0.000338,0.002722,0.011098,0.01251,0.013535,0.015742,0.019623,0.017377,0.007352,0.001859,0.007538,0.007799,0.013047,0.018111,0.014976,0.004782
0.000915,0.00204,0.002193,0.000779,0.002367,0.003559,0.005959,0.00265,0.000524,0.0038,0.00281,0.004511,0.008228,0.007299,0.004313,0.004483,0.011255,0.010907,0.012123,0.011435,0.010392,0.003842,-0.002311,0.002492,0.011225,0.010595,0.00465,0.005513
-0.001286,-0.001339,-0.002314,-0.002706,-0.00225,-0.003976,-0.006505,-0.007393,-0.005034,-0.004941,-0.003875,-0.005984,-0.003004,-0.005395,-0.013419,-0.013344,-0.012212,-0.013507,-0.018396,-0.016104,-0.011004,-0.011474,-0.01331,-0.012689,-0.012066,-0.017019,-0.01559,-0.006648
-0.001406,-0.002416,-0.002943,-0.001596,-0.002662,-0.00497,-0.00895,-0.005707,-0.002391,-0.006417,-0.004724,-0.006875,-0.009668,-0.009786,-0.010486,-0.010142,-0.016205,-0.017114,-0.020569,-0.019098,-0.014058,-0.007518,-0.000806,-0.004645,-0.015769,-0.018527,-0.011333,-0.009167
0.001086,0.002473,0.003798,0.003999,0.003399,0.003111,0.004734,0.006072,0.005832,0.004787,0.004984,0.005428,0.006045,0.006675,0.01207,0.010394,0.006795,0.00777,0.013341,0.00953,0.011565,0.020258,0.017764,0.016172,0.007293,0.009973,0.011879,0.006014
0.001087,0.001715,0.002147,0.001287,0.001338,0.004413,0.006981,0.005069,0.002797,0.005434,0.004143,0.006181,0.005714,0.005765,0.010086,0.009647,0.012525,0.014498,0.016263,0.013633,0.008067,0.005939,0.000971,0.00228,0.010028,0.013665,0.010881,0.00696
-0.000345,-0.001715,-0.002744,-0.002644,-0.001639,0.000375,-7.7e-05,-0.001882,-0.003407,-0.001692,-0.002353,-0.001532,-0.004885,-0.004798,-0.006407,-0.003545,0.002729,0.00061,-0.00548,-0.001827,-0.007195,-0.019016,-0.016948,-0.013648,9.6e-05,-0.000461,-0.003797,-0.002485
-0.000215,4.1e-05,0.000136,0.000628,0.001427,-0.001057,-0.000774,-0.000477,-0.00048,-0.000892,-0.000181,-0.002207,0.001284,0.001099,-0.004458,-0.002782,-0.000999,-0.004945,-0.00448,-0.002289,0.001422,-0.000123,-0.000827,0.001063,0.001248,3.7e-05,-0.002785,0.000294
-0.000262,0.000283,0.000954,0.001339,0.000301,-0.002485,-0.003303,-0.000575,0.001534,-0.000959,0.000121,-0.002054,0.00088,0.001143,0.001013,5e-05,-0.006757,-0.005118,-0.000231,-0.002533,0.001316,0.010755,0.012147,0.007591,-0.003748,-0.002388,-0.00049,0.000968
-0.000642,-0.001463,-0.001562,-0.001337,-0.002323,-0.002303,-0.005018,-0.003585,-0.001453,-0.003635,-0.002806,-0.001721,-0.006831,-0.00591,-0.00115,-0.002818,-0.007773,-0.003669,-0.005606,-0.006351,-0.007359,-0.004863,0.001839,-0.002188,-0.00818,-0.008347,-0.003966,-0.004869
0.000384,0.000735,0.000481,-0.000394,0.000313,0.001709,0.003233,0.000113,-0.001125,0.001671,0.001028,0.00295,0.002168,0.001801,0.001748,-0.00089,0.003521,0.004379,0.001761,0.002962,0.002197,-0.003462,-0.006908,-0.002698,0.003349,0.000964,-9.3e-05,-0.000833
0.00105,0.001273,0.000546,-3.5e-05,0.000783,0.00242,0.005867,0.003819,0.000771,0.004521,0.002279,0.002355,0.006144,0.005225,0.001886,0.001685,0.005916,0.004738,0.006692,0.007889,0.005506,0.002135,-0.005223,-0.00144,0.006519,0.006784,0.003503,0.003543
3.6e-05,-0.001109,-0.00166,-0.000952,-0.00104,-0.000305,-0.000813,0.001938,0.001027,-0.00089,-0.001368,-0.001684,-0.003115,-0.002298,-0.002122,0.002027,0.000699,-0.002015,-0.000445,0.000335,-0.000996,0.000303,0.003964,0.001636,0.000226,0.001409,0.001581,0.000301
-0.000919,-0.000131,0.001185,0.001018,0.000214,-0.000992,-0.002721,-0.001034,0.000781,-0.002525,-8.1e-05,-0.000137,-0.000541,-0.000429,0.00067,0.002652,0.000355,-0.001272,9.4e-05,-0.002576,0.00175,0.006113,0.009212,0.007455,-7.6e-05,-0.001003,0.000378,0.00033
-0.000705,0.000664,0.001827,0.001206,0.000511,-0.000792,-0.002456,-0.004292,-0.001599,-0.000806,0.000567,0.000252,0.002637,0.000783,8e-04,-0.002017,-0.003292,7.6e-05,-0.001006,-0.003889,-0.001313,0.000884,-0.002306,-0.002068,-0.004524,-0.005749,-0.003456,0.000212
0.000341,-0.000954,-0.002085,-0.001239,-0.00067,-0.000382,-0.001728,-0.003126,-0.0024,-0.000219,-0.001999,-0.001987,-0.004321,-0.004461,-0.004001,-0.006234,-0.005142,-0.00254,-0.008085,-0.004947,-0.006625,-0.010716,-0.010631,-0.010482,-0.00668,-0.006737,-0.004131,-0.003077
