0.000183,2.3e-05,3e-05,0.000191,7.3e-05,1.1e-05,0.000121,3.9e-05,9e-06,4.3e-05,2e-05,2.9e-05,0.000157,9.2e-05,3.6e-05,9.1e-05,1.2e-05,3.3e-05,4.8e-05,9.3e-05,0.000148,0.000137,0.000142,7.9e-05,0.000135,3.7e-05,1.9e-05,6.2e-05,3e-06,9.5e-05,9e-05,4.9e-05,2.4e-05,0.00013,8.4e-05,9.4e-05,9.5e-05,0.000188,0.00013,1.1e-05,2e-05,0.000224,0.000109,2e-06,2.1e-05,1.2e-05,5.1e-05,1.4e-05,4.2e-05,8.4e-05,0.00016,0.000127,6.6e-05,8e-05,1.8e-05,9.1e-05,4.5e-05,7.3e-05,0.000138,6.4e-05,3.9e-05,1.7e-05,2.3e-05,0.000173,3.9e-05,9.1e-05,2.3e-05,8e-05,0.000118,2.7e-05,7.2e-05,0.000257,7.2e-05,2.2e-05,2.9e-05,0.000114,2.2e-05,2.4e-05,7.2e-05,7.7e-05,4.2e-05,0.000161,0.000141,5.1e-05,6.5e-05,4e-06,4.3e-05,8e-05,0.000216,9.2e-05,0.000123,6.5e-05,8.8e-05,0.000121,0.000147,0.000222,0.000108,0.000129,0.000103,8.3e-05,5e-06,1.2e-05,0.000193,8.1e-05,0.000103,4e-06,8.5e-05,5.5e-05,5.1e-05,4.3e-05,5e-06,3.4e-05,2.8e-05,2.7e-05,2.8e-05,9.4e-05,2e-06,3.1e-05,8.9e-05,6.1e-05,0.000134
0.000478,0.000168,0.000152,0.000288,5e-05,0.000121,0.000289,6.5e-05,1e-04,9e-06,5.3e-05,6.7e-05,0.000414,0.000338,0.000135,0.000252,7.5e-05,0.000133,0.00026,0.000245,0.000302,0.000165,0.000264,0.000249,6.3e-05,0.000108,0.000166,0.000238,0.000107,0.000178,5.5e-05,0.000217,0.000194,0.000449,0.000141,0.000235,0.000208,0.00042,0.000256,4.2e-05,5.8e-05,0.000588,0.000397,0.000126,3.2e-05,9.6e-05,0.000272,0.000295,0.000139,6e-05,0.000372,0.000444,0.000209,9.8e-05,1e-04,3.6e-05,0.000251,0.000184,6.5e-05,0.000173,0.000126,0.000126,9.1e-05,0.000425,1.8e-05,0.000276,7.6e-05,0.000249,0.000336,0.000193,0.000324,0.000391,0.000246,0.000135,9.8e-05,0.000246,0.000163,0.00011,0.000167,0.000128,0.000111,0.000395,0.000354,0.000133,0.000221,7.3e-05,0.000152,0.000293,0.00042,0.000151,0.000284,0.000143,0.000235,0.000265,0.00038,0.000579,0.000287,0.000259,0.00026,0.000121,0.000106,0.000117,0.000537,0.000238,0.000364,0.000124,0.000237,4.6e-05,0.000207,0.000194,6.4e-05,4.6e-05,6.4e-05,0.000184,5.2e-05,0.00018,0.000102,3.5e-05,0.000148,0.000329,0.000281
0.000717,0.000445,0.000671,0.001103,0.00054,0.000317,0.00035,0.000154,0.00013,0.000354,0.00039,0.000214,0.000415,0.000477,0.000438,0.000291,0.000336,0.000416,0.000643,0.000563,0.000136,0.000423,0.000287,0.000382,0.000326,0.000357,0.000406,0.000491,0.000472,0.000495,0.000628,0.000317,0.000495,0.000262,0.000389,0.000397,7.6e-05,0.000377,0.000383,0.000156,0.000266,0.000366,0.000439,0.000417,0.000399,0.000163,0.000428,0.000474,0.00015,0.000417,0.000767,0.000665,0.000172,0.000288,0.000256,0.000129,0.00028,0.000346,2e-04,1e-04,5.2e-05,0.000367,0.000185,0.000309,0.000243,0.000508,0.000393,0.000613,0.000455,0.000204,0.00023,0.00064,0.000208,0.000354,0.000215,0.000194,0.000465,0.000243,0.00034,0.000332,0.000254,0.00018,0.000188,0.000146,9.8e-05,6.7e-05,0.000312,0.000387,0.000385,9.2e-05,0.000205,0.000307,0.000312,0.000682,0.000174,0.000525,0.000453,0.000417,0.000408,0.000157,9.7e-05,0.000455,0.000853,0.000163,0.000692,0.00052,0.00042,0.000155,8.8e-05,0.000246,6.1e-05,0.000291,5e-05,0.00028,0.00016,0.000117,0.000209,0.000256,0.000209,0.000553,0.000533
0.000206,0.000537,0.000627,0.00092,0.00022,0.000247,0.000593,0.000362,0.000229,0.000578,0.000475,0.000138,0.000322,0.000148,0.000243,0.000294,0.000283,0.000161,0.000488,0.000497,0.000467,0.000488,0.000388,0.000628,0.000478,0.000288,0.000105,0.000519,0.000252,0.000215,0.000887,7.1e-05,0.00027,0.000567,0.000553,0.000145,0.000515,0.00033,4.1e-05,0.000395,0.000252,0.000665,0.000462,0.000411,0.00028,0.000152,0.000505,0.000132,0.000298,0.000658,0.000386,0.000558,0.000446,0.000466,0.000237,0.000408,0.000335,0.000489,0.000512,0.000276,0.000348,0.00065,0.00044,0.000422,0.000372,0.000731,0.000599,0.000734,0.000543,0.000143,7.3e-05,0.00061,0.000385,0.000447,0.000313,0.00021,0.000167,0.000187,0.000308,0.000616,9.8e-05,0.000391,0.000683,0.00028,0.00077,0.000203,0.000519,0.000218,0.00046,0.000637,0.000506,0.000232,0.000184,0.000521,0.000706,0.001044,0.00114,0.000644,0.000235,0.000325,0.000134,0.000799,0.000583,0.000547,0.000846,0.000171,0.000309,0.000536,0.00021,0.000483,0.000304,5e-04,0.000447,0.000835,0.000613,0.000296,0.00018,0.000298,7.1e-05,0.000408,0.000192
0.000405,0.00077,0.00132,0.001832,0.001501,0.000857,0.001531,0.001038,0.000867,0.001114,0.001316,0.001103,0.000545,0.000609,0.001033,0.001471,0.001225,0.000827,0.000714,0.001349,0.001824,0.001353,0.001232,0.001522,0.001559,0.000471,0.000526,0.000676,0.000824,0.000588,0.001423,0.001251,0.000443,0.000763,0.00028,0.000265,0.000509,0.000928,0.001152,0.000865,0.00077,0.000587,0.000663,0.000724,0.000933,0.000954,0.000151,0.000276,0.000364,0.000764,0.000957,0.000845,0.001394,0.000574,0.000234,0.00024,0.000417,0.000448,0.001023,0.001012,0.000316,0.00123,0.000761,0.000428,0.000325,0.000754,0.001481,0.000701,0.000542,0.000662,0.000438,0.000863,0.001375,0.000556,0.000316,0.00027,0.000412,0.000431,0.000116,0.000731,0.000918,0.000961,0.00097,0.000885,0.001418,0.001077,0.000637,0.001047,0.001107,0.001495,0.001551,0.001087,0.00013,0.000561,0.000884,0.001413,0.002404,0.003115,0.001781,0.001127,0.000568,0.001194,0.001849,0.001731,0.001013,0.001088,0.00124,0.000894,0.000863,0.00116,0.000964,0.000268,3.4e-05,0.00109,0.001301,0.000586,0.000178,0.000475,0.000587,0.000622,0.000753
6.3e-05,0.000575,0.000654,0.000208,0.000534,0.000525,0.001542,0.000806,0.001036,0.000744,0.001027,0.000749,0.000635,0.000349,0.000839,0.000927,9e-05,0.000327,0.000156,0.001188,0.00069,0.000865,0.000358,0.000909,0.001488,0.001581,0.00026,0.00052,0.000677,0.000393,0.00126,0.001331,0.001373,0.001495,0.001023,0.000604,0.000493,0.000719,0.001746,0.001396,0.000793,0.000457,0.000388,0.000639,0.000987,0.001181,0.001064,0.00054,0.000431,0.000297,0.000293,0.000424,0.001057,0.00107,0.001322,0.000596,0.000791,0.000573,0.000921,0.000128,0.001337,0.001363,0.000409,0.000448,0.000343,0.000787,0.000628,0.001247,0.000964,0.000676,0.000868,0.000268,0.000552,0.000904,0.000709,0.000507,0.00101,0.000353,0.000285,0.000595,0.000425,0.000531,0.000135,0.000321,0.001114,0.001053,0.001157,0.000941,9.8e-05,0.001205,0.000226,0.000789,0.000905,0.0015,0.000983,0.001449,0.001308,0.001395,0.001264,0.000638,0.000707,0.000535,0.000677,0.000229,0.00022,0.000696,0.000882,0.001301,0.001114,0.000686,0.000646,0.000537,0.00027,0.001075,0.001292,0.000921,0.00044,0.000488,0.000337,0.000376,0.000112
0.000127,0.000579,0.001184,6e-04,0.000545,0.000302,0.00158,0.001025,0.000868,0.000357,0.000749,0.000409,0.00051,0.000166,0.000228,0.000709,0.001097,0.000428,0.000798,0.000215,0.00052,0.001264,0.000587,0.000742,0.000517,0.000605,0.000947,4e-04,0.001097,0.000346,0.001029,0.000753,0.001384,0.000656,0.00056,0.000523,3.3e-05,0.000824,0.00065,0.000648,0.001156,0.000623,0.000502,7.6e-05,0.001167,0.00073,0.000188,0.000428,0.001249,0.00093,0.000594,0.000946,0.001575,0.001001,0.001628,0.000399,0.000625,0.000511,0.000406,0.000162,0.0016,0.000208,0.000684,0.000226,0.000227,0.000814,0.000237,0.000926,0.000489,0.001462,0.000832,0.000989,0.000193,0.000533,0.000554,0.000313,0.000745,0.000392,0.000459,0.000356,0.000622,6e-04,0.000109,0.000346,0.000587,0.000662,0.001074,0.000229,0.000495,0.000693,0.000896,0.000405,0.000673,0.001058,0.000242,0.000788,0.000649,0.001232,0.001094,0.001368,0.000493,0.000732,0.000529,0.001016,0.000249,0.000539,6e-04,0.000145,0.000616,0.000717,0.000689,0.000639,0.001259,0.000757,0.0014,0.000569,0.000451,0.000299,0.000561,0.000463,0.000964
0.00087,0.000814,0.000738,0.001731,0.001703,0.000568,0.001292,0.001074,0.000964,0.000375,0.001053,0.001137,0.000277,0.000566,0.001154,0.001027,0.001684,0.001261,0.000677,0.000583,0.000494,0.001029,0.001765,0.000548,0.000289,0.000479,0.000881,8.5e-05,0.001472,0.000987,0.000493,0.001802,0.002247,0.001592,0.000836,0.000222,0.000268,0.001172,0.000742,0.001212,0.000984,0.000772,0.000536,0.000639,0.001389,0.001683,0.00104,0.000706,0.001012,0.001086,0.001397,0.001318,0.000325,0.000751,0.001172,0.001891,0.001038,0.000479,0.00048,0.000707,0.001784,0.00175,0.000266,0.00101,7.7e-05,0.000976,0.001263,0.001594,0.001204,0.001275,0.001261,0.002788,0.00237,0.000762,0.000233,0.000283,0.000527,0.000488,0.000915,0.00095,0.000804,0.001112,0.000666,0.000902,0.000758,0.000322,0.001735,0.000942,0.000599,0.001083,0.001179,0.000835,0.000636,0.001613,0.001711,0.001779,0.001401,0.002327,0.000448,0.000782,0.000534,0.000816,0.001138,0.001625,0.001434,0.001178,0.000574,0.000233,0.000657,0.001044,0.001828,0.001972,0.000684,0.001086,0.001962,0.001554,0.001158,0.000974,0.001245,0.000526,0.001383
0.001167,0.000789,0.000864,0.001927,9.5e-05,0.000824,0.001172,0.00047,0.000772,0.000387,0.001506,0.000761,0.000642,0.000823,0.000997,0.000463,0.001496,0.000658,0.000882,0.000294,0.000952,0.000827,0.002069,0.001371,0.000254,0.001008,0.001582,0.001591,0.002194,0.00204,0.001854,0.001848,0.002585,0.002248,0.001645,0.001373,0.001019,0.001731,0.001421,0.000889,0.002139,0.002137,0.001857,0.000862,0.001616,0.002433,0.001739,0.000997,0.001365,0.000405,0.000902,0.000641,0.000536,0.00077,0.001174,0.001573,0.000351,0.000614,0.000513,0.000551,0.000856,0.001763,0.00187,0.001891,0.001633,0.001381,0.001422,0.00145,0.000941,0.000624,0.000662,0.002526,0.00265,0.002228,0.00146,0.00105,0.000815,0.000782,0.001538,0.000809,0.000399,0.001079,0.00097,0.000635,0.000592,0.000449,0.001209,0.000878,0.000246,0.001014,0.000668,0.000435,0.001258,0.000148,0.00105,0.000639,0.000205,0.001861,0.002227,0.001592,0.001308,0.001107,0.000796,0.001108,0.000217,0.000378,0.000565,0.000651,0.000489,0.000909,0.001285,0.002297,0.002292,0.00125,0.000549,0.001144,0.00066,0.000276,0.00097,0.001135,0.002358
0.001207,0.001136,0.001075,0.000968,0.002012,0.002354,0.002033,0.00178,0.001894,0.001205,0.001474,0.000931,0.000668,0.000396,0.001045,0.001535,0.001984,0.001216,0.000495,0.000659,0.001294,0.001616,0.000667,0.000672,0.000978,0.000348,0.000743,0.000572,0.001409,0.000854,0.000499,0.000496,0.000964,0.00045,0.001165,0.000666,0.000463,0.001659,0.000777,0.000487,0.001339,0.000577,0.000602,0.000838,0.000724,0.000753,0.000451,0.000376,0.000561,0.00062,0.000507,0.000391,0.000622,0.001114,0.000695,0.000686,0.000955,0.00074,0.000118,0.000282,0.000801,0.001085,0.000595,0.001243,0.000221,0.000599,0.000127,0.000699,0.000121,0.000657,0.000725,0.001274,0.00043,0.000903,0.000235,0.000443,0.000716,0.001312,0.001352,0.00097,0.000629,0.000715,0.000951,0.000993,0.000702,0.000473,0.000447,0.000165,0.000787,0.001199,0.000597,0.000646,0.001121,0.001227,0.000166,0.001177,0.000995,0.001103,0.001291,0.001103,0.000662,0.000435,0.001247,0.00081,0.000353,0.000176,0.000411,0.000437,0.000729,0.000866,0.001513,0.000768,0.000576,0.000188,0.000409,0.000605,0.000631,0.000534,0.000699,0.000695,0.000936
0.00064,0.000807,0.000494,0.000542,0.002079,0.001915,0.000486,0.001153,0.000168,0.000764,0.000308,0.000531,0.000508,0.00038,0.000583,0.001291,0.001225,0.000858,0.001154,0.000477,0.000753,0.000843,0.001242,0.00066,0.000377,0.000497,0.000376,0.001079,0.000598,0.000552,0.000517,0.000278,0.000655,0.000145,0.000793,0.000589,0.000858,0.000858,0.000955,0.000689,0.001139,5e-04,0.000545,0.000724,0.000549,0.000105,0.000776,0.000554,0.000599,0.000835,0.000843,0.000389,0.000529,0.000884,0.000918,0.000379,0.000769,0.000302,0.000448,0.000608,0.001188,0.000363,0.001125,0.000853,0.000791,0.000838,0.000803,0.000365,0.000485,0.000231,0.000377,0.000418,0.000182,0.000556,0.000374,3e-05,0.000558,0.000688,0.000895,0.000795,0.000162,0.000532,0.000531,0.000293,0.000195,0.000629,0.000711,0.000403,0.000673,0.000264,0.000116,0.000744,0.001043,0.000298,0.000748,0.001177,0.000552,0.000802,0.001376,0.000617,0.000419,0.000347,0.000854,0.001128,0.001345,0.001436,0.000802,0.000446,0.00065,0.000746,0.000796,0.000181,0.000514,0.000597,0.000546,0.00024,0.000452,0.000345,0.000792,0.000615,0.000468
0.000982,0.000241,0.000784,0.000548,0.000997,0.000335,0.000615,0.000549,0.000838,0.000371,0.00045,0.000158,0.000181,9.1e-05,0.000111,0.000663,0.000399,0.000674,0.000179,0.000211,0.000245,0.000933,0.001162,0.000513,0.000361,0.000339,0.000229,0.000525,0.000679,0.00022,0.000224,0.000519,0.000905,0.000366,0.000402,0.000364,0.00093,0.000313,0.000462,0.00025,0.000325,0.00025,0.000268,0.000626,0.000593,0.00019,0.000324,0.000346,0.000182,0.000566,0.000313,0.000234,0.000199,0.000282,0.00037,0.000444,0.000283,0.000314,3.3e-05,0.000611,0.000334,0.000371,0.000617,0.000264,0.000176,0.000194,5e-04,0.000132,0.000123,0.000225,0.000396,0.000399,0.000547,0.000341,0.000343,0.000192,0.000261,0.00064,0.000835,0.000142,0.00029,0.000511,9.8e-05,0.000327,0.000331,0.000502,0.000395,0.000485,0.000426,0.000212,0.000192,0.000547,1e-04,0.000568,0.000484,0.000277,5.2e-05,0.000229,0.000669,0.000643,0.000612,0.000334,0.000495,0.000596,0.000413,0.000546,0.00017,0.000406,0.00029,0.000998,0.000996,0.000629,0.000702,0.000445,6.8e-05,0.000201,0.000262,0.000288,0.000242,0.000359,0.000345
0.000415,0.000169,0.000164,0.000404,0.000738,0.000268,0.000336,0.000111,0.000219,0.00018,0.000277,0.000324,5.9e-05,9.6e-05,0.000218,0.000204,0.000297,0.000205,0.000127,0.000109,0.000212,5e-04,0.000214,4.1e-05,0.000238,0.000236,0.000152,0.000303,0.000281,0.000167,0.000207,0.000286,0.000298,0.000132,0.000107,6.6e-05,0.000501,0.000234,4.7e-05,0.000157,0.000245,0.000173,8.3e-05,0.000327,0.00012,0.000169,0.000245,0.000171,0.000202,0.00015,4e-05,0.000234,6.7e-05,0.000138,0.000206,0.000158,0.000137,0.000274,6e-05,0.000347,0.000179,0.000187,0.00033,0.000114,0.000203,4.5e-05,0.00033,0.000119,0.000118,9.7e-05,0.000304,0.000325,0.000328,0.00025,0.000189,0.000228,2.3e-05,0.000155,0.000239,5.3e-05,0.000116,0.000212,6.1e-05,9.9e-05,0.000148,0.00029,0.000228,0.000182,0.00028,5.4e-05,0.00025,0.000283,0.000158,0.000223,0.000116,0.000242,0.000137,0.000277,0.000349,0.000383,0.000299,3e-05,0.000339,0.000247,0.000212,0.000245,0.000135,0.000398,0.000219,0.000265,0.00067,0.000114,0.000226,0.000112,2.9e-05,0.000204,0.000225,3.3e-05,0.000287,0.000161,0.000212
0.000457,0.000162,0.000363,0.000328,0.000534,2.2e-05,0.000399,7.9e-05,0.000142,0.000101,0.000223,0.000247,6.1e-05,0.000259,0.000303,0.000152,0.000271,0.000212,0.000243,0.000152,6.5e-05,0.000326,0.000347,5.8e-05,6.8e-05,0.000282,8.1e-05,0.000198,0.000322,0.000201,0.000176,0.00021,0.000351,0.000118,3.3e-05,8.1e-05,0.000421,0.00026,3.9e-05,9.8e-05,0.000257,0.000192,0.000212,8e-05,0.000112,8.5e-05,0.000162,0.000146,4.5e-05,4e-05,5e-05,0.000173,0.000198,7.5e-05,0.000172,1.6e-05,0.000325,6.6e-05,0.000132,0.000191,0.000197,0.000111,0.000309,0.000175,7.6e-05,2.2e-05,0.000186,0.000144,0.000169,0.000198,0.00024,0.000174,0.000186,0.00026,0.000171,0.000217,0.000201,0.000121,0.000299,0.000134,0.000238,0.000236,4.1e-05,2.6e-05,0.000144,0.000248,4.5e-05,0.000115,0.000221,0.000152,0.000172,0.000215,9.1e-05,0.000109,0.000232,0.000272,9.7e-05,0.000251,0.000298,0.000282,0.000239,9.6e-05,0.000459,0.000363,0.000236,0.000136,6.1e-05,0.000281,0.00025,0.000189,0.000409,2.8e-05,0.000318,0.000301,0.000201,9.3e-05,8.3e-05,0.000279,0.000146,7.1e-05,0.000277
0.00034,0.000212,0.000288,0.000294,0.000403,0.000104,0.000233,0.000213,0.000124,0.000197,0.000195,0.000284,0.000172,0.000148,0.000231,0.00013,0.000271,0.000219,0.000391,0.00018,0.000328,9.7e-05,0.000264,0.000183,0.000118,0.000347,0.000124,2e-04,8.6e-05,9.3e-05,4.8e-05,3.3e-05,0.000316,0.000104,1.8e-05,0.000134,0.000655,0.000337,0.000163,0.000178,0.000177,0.000264,0.000176,7.1e-05,7.9e-05,0.00022,0.000225,0.000239,0.000182,0.000311,0.00025,7.3e-05,9.7e-05,0.000277,0.000156,0.00012,0.000378,0.000176,8.6e-05,0.000189,8.3e-05,0.000136,0.000346,0.000118,0.000296,4.5e-05,0.000268,0.000163,3.1e-05,0.000201,0.000182,0.000235,0.000169,6.2e-05,7.7e-05,8.9e-05,0.000176,0.000252,0.00024,0.000113,0.000159,0.000377,9.3e-05,5.7e-05,0.000234,0.000318,0.000161,0.000177,0.000238,0.000138,9.2e-05,7.8e-05,0.000146,0.000141,7.8e-05,0.000137,5e-06,0.000386,0.000205,8.5e-05,0.000205,2.4e-05,0.000293,0.000488,0.000139,0.000131,0.000173,0.000384,0.000393,0.000146,0.000284,0.000323,0.000156,0.000195,4.2e-05,0.000176,0.000131,0.000102,0.00012,0.00017,0.000188
0.000438,0.000259,0.000431,0.000168,0.000389,0.000178,0.000503,0.000185,0.000142,0.000134,0.000277,0.000513,0.000198,7.8e-05,0.000365,0.000151,0.000524,0.000354,0.000484,0.000235,0.000474,7.8e-05,0.000295,0.000302,0.000229,0.000402,0.000251,0.000387,0.00035,0.000232,3.3e-05,0.000147,0.000233,1e-04,0.000206,0.000174,0.000729,0.000215,0.000148,0.000256,0.000279,0.000141,0.000138,0.000272,7.4e-05,0.000149,0.000385,8.8e-05,0.000245,0.000449,0.00043,5.4e-05,0.000199,0.000402,0.000178,2.6e-05,0.000498,0.000208,0.000198,0.00029,0.000358,0.000203,0.000204,0.000103,0.000227,0.000194,0.000209,0.000305,8.4e-05,0.000145,0.000306,0.000445,0.000466,0.00019,5e-06,0.000407,0.000244,0.000272,0.000325,0.000134,0.000103,0.000301,0.000281,0.000137,0.000464,0.000149,0.000356,0.000258,0.000459,4e-04,0.00017,0.000141,7.8e-05,0.000378,4.9e-05,6.8e-05,0.000249,0.000483,0.000331,0.000185,0.000426,0.00035,0.000381,0.000263,0.000574,0.00019,0.000211,0.000532,0.000401,0.000108,0.000402,0.000577,0.000393,0.000363,0.000309,0.000129,0.000437,0.000232,3.9e-05,0.000169,0.000298
0.000395,0.000489,7.1e-05,0.00043,0.000591,0.000143,0.000822,0.000598,0.000336,0.000431,0.000446,0.000461,0.000744,0.000237,0.000813,0.000697,0.000883,0.000634,0.000539,0.000413,0.000637,0.000629,9.3e-05,0.000362,0.000107,0.000562,0.000505,0.000618,0.000732,0.000771,0.000537,0.000161,0.000443,0.000257,0.000517,0.000943,0.00022,0.001325,0.000974,0.000201,0.000372,0.000682,0.000394,0.000519,0.000478,0.000715,0.000308,0.000354,0.000313,0.000348,0.000292,0.000704,0.000271,0.000424,0.000565,0.000464,0.000754,0.000747,8e-04,0.00019,0.000314,0.000137,0.000718,6.1e-05,0.000411,0.000165,0.00034,0.000713,0.000457,0.000117,0.000141,0.000324,0.000349,0.000427,0.000424,0.000572,0.000473,0.000651,0.000785,0.000516,0.000141,0.000719,0.000628,0.000309,0.000449,0.000648,0.000217,0.000397,0.000248,0.000688,0.00047,0.000274,0.000235,0.000533,0.000744,0.000364,0.000222,0.000537,0.000971,0.000623,0.000725,0.001191,0.001181,0.000468,0.000492,0.000951,0.000791,0.000831,0.000909,0.000658,0.00027,0.000463,0.000356,0.000447,0.000409,0.000429,0.000511,0.000829,0.000442,0.000201,0.000915
0.000719,0.000565,0.000506,0.000628,0.00049,0.000553,0.001214,0.001135,0.000622,0.000488,0.00035,0.000355,0.000898,0.001207,0.000863,0.00145,0.000882,0.000759,0.000892,0.001167,0.000319,0.000408,0.000511,0.000521,0.000383,0.00102,0.001301,0.001828,0.000579,0.000523,0.000513,0.000687,0.000362,0.000549,0.000825,0.000553,0.00133,0.002525,0.002613,0.001523,0.001007,0.001371,0.000682,0.000523,0.000695,0.000315,0.000974,0.000523,0.000883,0.000841,0.000546,0.00095,0.001011,0.001039,0.000747,0.000194,0.000981,0.000951,0.000521,0.000897,0.000682,0.00057,0.001174,0.001046,0.001215,0.000722,7.8e-05,0.000426,0.000521,0.000493,0.000386,0.000198,0.00074,0.000435,0.000128,0.000625,0.000527,0.000544,0.001287,0.00083,0.000406,0.001131,0.001197,0.00057,0.000188,0.000819,0.000541,0.000397,0.000434,0.000433,0.000314,0.000535,0.000851,0.000604,0.000598,0.00089,0.000948,0.001437,0.001875,0.000937,0.000511,0.001055,0.001471,0.001804,0.001559,0.000644,0.000149,0.000324,0.001329,0.001369,0.000977,0.001241,0.001402,0.000845,0.000663,0.000737,0.000261,0.001022,0.001208,0.001064,0.001288
0.000152,0.000278,0.000512,0.000659,0.000452,0.000345,0.000659,0.00051,0.00019,0.00067,0.000857,0.000498,0.000704,0.000655,0.001192,0.000693,0.000401,0.000701,0.000421,0.000658,0.000764,0.000525,0.000211,3e-04,0.000156,0.001,0.001105,0.000488,0.00113,0.000485,0.00065,0.000346,0.000313,0.000136,0.000347,0.00079,0.001172,0.001369,0.000425,0.000434,0.000516,0.000798,0.000532,4e-04,0.000211,0.000427,0.00075,0.000536,0.000807,0.000227,0.000431,0.000597,0.000185,0.000758,0.000492,0.000428,0.000765,0.000338,0.000488,0.000314,0.000239,0.000421,0.000569,0.000524,0.000673,0.000669,0.000593,0.000387,0.000416,8.2e-05,0.00041,0.000212,0.000622,0.000434,0.000314,0.000175,0.000225,0.000804,0.000592,0.000478,0.000811,0.001129,0.00052,0.000253,0.000369,0.000662,0.000791,0.000957,0.000274,0.000473,0.000212,0.000358,0.000876,0.000516,0.000446,0.000459,0.000378,0.000686,0.000648,0.000596,0.000704,0.000262,0.001006,0.000743,0.000181,0.000336,0.000121,0.000168,0.00086,0.000312,0.000398,0.000556,0.000916,0.000675,0.000305,0.000444,0.000319,0.000876,0.00039,7.2e-05,0.000693
0.000276,0.000406,0.000307,0.000227,0.000244,0.000118,0.000443,5.7e-05,0.00018,0.000258,0.00041,0.000269,3.5e-05,0.000653,0.000175,0.000486,0.000374,0.000198,0.000318,0.000186,0.000228,0.000328,0.000267,0.000138,0.000282,5e-04,0.000101,0.000568,0.000557,0.000128,0.000366,0.000167,9e-06,0.000235,0.000134,0.000479,0.000426,0.000451,0.000448,0.000228,8e-05,0.000207,0.000254,8.8e-05,0.000156,0.000161,0.000273,0.000185,0.00024,0.000413,0.000251,0.000374,0.000322,0.000298,0.000202,0.000108,0.000307,0.000162,0.000184,5.6e-05,0.000102,0.00026,0.000111,0.000205,0.000339,0.000113,0.000225,0.000258,0.00014,0.000254,0.000397,0.000256,0.000311,0.000166,5.9e-05,0.000111,0.000138,0.000382,0.000422,0.000177,0.000397,0.000152,0.000158,1.3e-05,0.000505,5.4e-05,0.000455,0.000322,0.000287,0.000293,0.000259,4.1e-05,0.000456,0.000241,0.000203,0.000269,0.000303,0.000443,0.000224,0.00039,1e-04,8.8e-05,0.000742,0.000272,0.000238,0.000386,0.000192,8.9e-05,0.000371,0.000103,0.000282,0.000405,0.000328,0.000145,0.000313,8.9e-05,0.000234,0.000248,0.000264,0.00026,0.000205
0.000214,0.000166,2e-04,0.000146,0.000169,4.3e-05,0.000189,7.1e-05,0.000114,0.000202,0.000131,0.00014,0.000214,0.000282,0.000223,5e-05,7.3e-05,0.000179,0.000262,0.000203,0.000188,0.000128,0.000188,8.9e-05,0.000253,0.000312,2e-04,0.000309,0.000291,0.000185,0.000122,0.000125,0.000148,0.000187,0.000201,0.000138,0.000301,0.000501,0.000293,6.7e-05,0.00023,9.8e-05,0.000125,8.8e-05,5e-05,0.000265,8.7e-05,0.000126,6.5e-05,0.000214,0.000161,0.000237,0.000319,0.000311,0.000123,0.000129,8.3e-05,8e-05,5.1e-05,0.00014,5.7e-05,0.000115,0.000163,0.000107,9e-05,8.1e-05,0.000128,0.000182,0.00012,0.000154,3.9e-05,8.3e-05,0.000186,0.000184,5.5e-05,0.000133,0.000112,4.8e-05,0.000124,0.000291,0.000267,0.000123,9.3e-05,0.00015,0.00028,0.000185,0.000244,5e-05,0.00013,4e-06,0.000142,9.3e-05,0.000156,0.000114,0.000198,0.000237,0.000155,0.000238,0.000251,4.6e-05,9.1e-05,0.000114,0.000396,0.000224,0.000212,0.000151,0.000141,0.000144,0.000121,7.6e-05,0.000215,0.00013,0.000188,0.000178,0.00018,0.000105,6.5e-05,0.000132,0.000235,0.000206,0.000169
0.000143,8.3e-05,5.1e-05,0.00015,0.000214,4.4e-05,0.000136,6.9e-05,6.7e-05,8.9e-05,8.7e-05,0.000138,0.000117,0.000143,0.000126,9.1e-05,4.8e-05,0.000169,2.5e-05,0.000133,0.000126,0.000104,0.000129,3e-05,0.000164,5.7e-05,0.000157,0.000138,0.000202,0.000146,0.000104,4.6e-05,0.000142,0.000254,7.9e-05,0.00013,0.000254,0.000289,0.000131,2.5e-05,0.000157,4.3e-05,9.8e-05,6e-05,3.5e-05,0.000116,2.2e-05,0.000113,2.1e-05,0.000121,0.00013,0.000114,0.000136,9.9e-05,0.000141,0.000114,4.9e-05,6.2e-05,5e-05,0.000114,5.4e-05,0.000147,0.000137,0.000156,0.00013,0.000133,0.000193,8.2e-05,2.9e-05,4.7e-05,5.9e-05,2e-05,0.000206,0.000246,9.6e-05,0.000139,4.9e-05,0.000114,5.5e-05,0.000132,0.000192,3.8e-05,3.6e-05,7.6e-05,0.000198,4.7e-05,0.000126,0.000135,0.000144,1.1e-05,1e-04,5.8e-05,0.000178,0.000116,6.6e-05,0.000215,0.000195,0.000135,0.000151,3.5e-05,3.8e-05,0.000163,0.000262,0.000163,0.000184,7.7e-05,6.4e-05,0.000113,0.000143,8e-05,0.000214,7.4e-05,0.000114,0.00011,0.000125,0.000139,7.2e-05,0.000136,0.00018,0.000259,1e-04
4.7e-05,2.6e-05,3.1e-05,0.000106,8.1e-05,2.2e-05,5.4e-05,1.6e-05,2.8e-05,4e-05,3.5e-05,3.1e-05,2.7e-05,4.8e-05,7e-06,3.7e-05,6.8e-05,2.6e-05,1.9e-05,7.8e-05,6.2e-05,8.4e-05,2.2e-05,1.4e-05,6.2e-05,4.8e-05,2.3e-05,7e-05,4.1e-05,7.8e-05,3.5e-05,4.2e-05,6.2e-05,4.8e-05,1.5e-05,7.7e-05,7.3e-05,9e-05,6.8e-05,2.2e-05,6.6e-05,6.9e-05,4e-05,6.1e-05,1.4e-05,9.3e-05,1e-05,2.8e-05,3.4e-05,3.4e-05,4.7e-05,6.5e-05,2.5e-05,8e-05,7.2e-05,3.1e-05,8e-06,7e-06,3.6e-05,3.9e-05,4.7e-05,4.7e-05,7.3e-05,2.9e-05,5.8e-05,3.1e-05,4.6e-05,9e-05,4.8e-05,3.5e-05,1.8e-05,2.2e-05,6.1e-05,3.6e-05,1.9e-05,3.7e-05,6.2e-05,3e-05,5.5e-05,1.8e-05,6.2e-05,4.7e-05,1.9e-05,3.7e-05,5.5e-05,6.2e-05,6.3e-05,9e-05,5.7e-05,1.7e-05,3.8e-05,1.9e-05,8.8e-05,1.1e-05,3.1e-05,7.8e-05,0.000155,8.1e-05,2.9e-05,4.3e-05,5.2e-05,0.000127,0.000102,1.2e-05,0.000102,5.5e-05,1.6e-05,2.9e-05,6.5e-05,1.7e-05,6.7e-05,2.4e-05,8.6e-05,3.8e-05,1.4e-05,4.5e-05,1.4e-05,3.8e-05,5.5e-05,7.7e-05,1.1e-05
5.6e-05,3.9e-05,6.2e-05,4.3e-05,0.000106,4.5e-05,4.8e-05,3.3e-05,4.9e-05,8.5e-05,6e-05,5e-06,3.1e-05,5.4e-05,5.7e-05,2.9e-05,6.3e-05,3.7e-05,2.8e-05,6e-05,8.7e-05,6.1e-05,3.7e-05,5.2e-05,7.4e-05,5.7e-05,8.2e-05,8.1e-05,0.000116,3.8e-05,3.1e-05,5.7e-05,8.8e-05,4.2e-05,5e-06,8e-05,2.9e-05,0.000111,8.9e-05,9e-06,8.8e-05,5.9e-05,7.3e-05,4e-05,6.7e-05,8.2e-05,4.4e-05,2.3e-05,6.1e-05,8.6e-05,4.1e-05,3.7e-05,1.8e-05,1.1e-05,8.9e-05,2.4e-05,3.6e-05,3.3e-05,2.7e-05,3.4e-05,3.9e-05,6.4e-05,4e-05,2.6e-05,1.4e-05,2.1e-05,8.8e-05,5.2e-05,1.1e-05,9e-06,4e-05,4e-05,3.2e-05,7e-05,2.7e-05,2e-05,3.5e-05,7.6e-05,9.3e-05,9.9e-05,6.5e-05,5e-05,2.6e-05,5e-05,2.8e-05,4.6e-05,4.9e-05,2.8e-05,3.6e-05,4.5e-05,6.8e-05,4.6e-05,2e-05,4.1e-05,8.7e-05,8.2e-05,8.1e-05,2.8e-05,4e-05,5.8e-05,7.6e-05,5.3e-05,0.000119,4e-05,6.3e-05,4.5e-05,3.1e-05,3.1e-05,2e-05,2.1e-05,7.4e-05,2.4e-05,3.2e-05,4.3e-05,5.2e-05,7.9e-05,5.9e-05,6.1e-05,2e-05,8.9e-05,1.9e-05
9.7e-05,5e-05,5.1e-05,6.7e-05,7.2e-05,1e-05,6.3e-05,2.3e-05,4.2e-05,1.4e-05,4.1e-05,3.2e-05,3e-05,7.8e-05,2.5e-05,3.5e-05,3.5e-05,4.4e-05,5.5e-05,1e-05,3.1e-05,5.8e-05,4.9e-05,2.3e-05,1.2e-05,8.7e-05,3e-05,3.7e-05,0.000107,4.4e-05,3.5e-05,2.4e-05,5.4e-05,3.9e-05,3e-05,4.1e-05,3.8e-05,9.9e-05,5.8e-05,2.4e-05,4.9e-05,2.1e-05,3e-05,3.6e-05,5.9e-05,4.2e-05,1.8e-05,2e-05,3.9e-05,4.1e-05,4.3e-05,2.6e-05,1.4e-05,2.8e-05,5.8e-05,2.8e-05,2.6e-05,1.3e-05,1.7e-05,4.9e-05,3.5e-05,3.7e-05,4.5e-05,3.8e-05,4.3e-05,3.9e-05,0.000103,5.9e-05,9e-06,3.3e-05,1.1e-05,1.6e-05,3.9e-05,6.5e-05,2.1e-05,3.1e-05,6e-06,6.1e-05,4.6e-05,7e-05,3.2e-05,6e-06,1.7e-05,2.2e-05,3.4e-05,6e-05,5.1e-05,1.7e-05,1.4e-05,2e-05,5.8e-05,1.6e-05,6.1e-05,4e-05,5.2e-05,2.3e-05,7.8e-05,4.8e-05,1.6e-05,2.4e-05,3.3e-05,6.1e-05,0.000107,1.3e-05,6.2e-05,5.9e-05,3.3e-05,2.4e-05,5.8e-05,2.8e-05,6.4e-05,1.7e-05,2e-05,1.8e-05,4.2e-05,5.1e-05,4.7e-05,4e-06,2.6e-05,5.5e-05,2.5e-05
6.7e-05,4.4e-05,8.5e-05,2.7e-05,9.8e-05,3.9e-05,2e-05,8e-06,1.9e-05,3.1e-05,1.9e-05,1.6e-05,3.6e-05,4.9e-05,3e-05,3.7e-05,5.5e-05,3e-05,2.8e-05,1e-05,1.4e-05,2.9e-05,6.8e-05,3.7e-05,4.6e-05,4.1e-05,3.4e-05,4.3e-05,5.6e-05,2.9e-05,3.7e-05,1.8e-05,3.4e-05,2.2e-05,2.1e-05,5.1e-05,3.9e-05,8.5e-05,3.8e-05,2.1e-05,5e-05,1.8e-05,1.3e-05,2.7e-05,5.4e-05,3.4e-05,2e-05,2.8e-05,3.5e-05,5.4e-05,3.1e-05,4.2e-05,2e-05,3.6e-05,5.4e-05,3.9e-05,1.2e-05,1.5e-05,2.3e-05,4.3e-05,5e-06,4.5e-05,5.5e-05,1.2e-05,4.3e-05,3.5e-05,8.6e-05,3.5e-05,1.8e-05,3.8e-05,2.5e-05,2.4e-05,2.9e-05,6.3e-05,1.2e-05,2.4e-05,3e-05,2.7e-05,5.8e-05,7e-06,4e-05,2.5e-05,1.7e-05,2e-05,4e-05,3.8e-05,2.6e-05,2.2e-05,1.2e-05,7e-06,4.7e-05,2e-05,6.8e-05,2.1e-05,5.2e-05,7.1e-05,7.7e-05,4.1e-05,1.4e-05,2.6e-05,4.6e-05,7.1e-05,7.4e-05,1.4e-05,5e-05,5.9e-05,2.7e-05,2e-06,2.7e-05,3e-05,8.2e-05,2.2e-05,1.3e-05,2.4e-05,4.2e-05,5.3e-05,1.5e-05,2.7e-05,2e-05,6.7e-05,1.8e-05
6e-05,1.9e-05,5.1e-05,3.3e-05,9e-05,4.3e-05,5.1e-05,8e-06,1.2e-05,3.3e-05,1.4e-05,1.9e-05,1.7e-05,4e-05,1e-05,3.3e-05,3.6e-05,1.9e-05,1.9e-05,3e-06,1.8e-05,2.3e-05,4.1e-05,3.1e-05,3.7e-05,3.3e-05,3.2e-05,2.8e-05,6.2e-05,1.6e-05,3.8e-05,1.3e-05,3.8e-05,9e-06,3.2e-05,4.4e-05,4.4e-05,8.5e-05,2.9e-05,2.3e-05,2.5e-05,1e-05,9e-06,3.9e-05,4.3e-05,2.7e-05,1.4e-05,2.3e-05,1.5e-05,3.7e-05,2.1e-05,1.4e-05,6e-06,2.6e-05,3.9e-05,2.8e-05,9e-06,1.4e-05,2.3e-05,4.3e-05,1.6e-05,3.9e-05,4.4e-05,1.6e-05,1.4e-05,1.6e-05,7.2e-05,3.7e-05,1.4e-05,2.3e-05,6e-06,1.1e-05,3.9e-05,5.6e-05,9e-06,2.4e-05,1.5e-05,1.9e-05,3.8e-05,1.6e-05,2e-05,3.3e-05,5e-06,2.2e-05,3.3e-05,3.4e-05,3.7e-05,2e-05,1.9e-05,2e-06,4.2e-05,1.3e-05,5.1e-05,2.3e-05,2.3e-05,4.4e-05,5.6e-05,2.7e-05,1e-06,1.2e-05,3.9e-05,5.8e-05,8.1e-05,6e-06,5.6e-05,5.8e-05,2.5e-05,2.1e-05,1.9e-05,4.4e-05,8.4e-05,2e-05,2.1e-05,3e-05,2.5e-05,3.3e-05,1.9e-05,2.8e-05,1.9e-05,5.1e-05,8e-06
5.7e-05,1.6e-05,5e-05,3.3e-05,8.1e-05,1.9e-05,3.2e-05,1.9e-05,2.8e-05,3.1e-05,1.3e-05,6e-06,2.9e-05,4.7e-05,3e-05,2.6e-05,3.8e-05,1.9e-05,1.1e-05,4e-06,1.3e-05,3.5e-05,4.4e-05,2.9e-05,4.2e-05,3.3e-05,2.9e-05,3.4e-05,7e-05,1.2e-05,4.1e-05,5e-06,4.8e-05,5e-06,1.4e-05,3.9e-05,4.5e-05,6.1e-05,3.7e-05,1.8e-05,2.5e-05,1.3e-05,1.4e-05,3.9e-05,4.6e-05,4.4e-05,8e-06,1.6e-05,2.8e-05,2.5e-05,1.6e-05,1.2e-05,7e-06,2.6e-05,3e-05,3.2e-05,1.2e-05,8e-06,1.4e-05,4.3e-05,1.1e-05,4.2e-05,5e-05,2e-05,1.6e-05,2.3e-05,7.3e-05,3.7e-05,5e-06,1.2e-05,7e-06,2.2e-05,4.5e-05,4.3e-05,7e-06,2.3e-05,2e-05,2.4e-05,3.1e-05,2.6e-05,2.7e-05,2.9e-05,1.1e-05,2e-05,3.4e-05,3.3e-05,4e-05,1.3e-05,2.5e-05,1.7e-05,3.5e-05,1.4e-05,3.5e-05,2e-05,2.7e-05,3.7e-05,6.6e-05,2.1e-05,1.7e-05,1.7e-05,2.2e-05,5.5e-05,9.1e-05,1.7e-05,3.8e-05,4.7e-05,2.1e-05,2.6e-05,2.1e-05,3.3e-05,6.6e-05,1.2e-05,1.3e-05,3e-05,2.1e-05,2.8e-05,1.1e-05,2.4e-05,8e-06,3.2e-05,1.9e-05
7.3e-05,3.1e-05,4.7e-05,1.7e-05,7.5e-05,3.3e-05,3e-05,1.9e-05,2e-05,1.4e-05,2.2e-05,4e-06,3.2e-05,2.4e-05,2.3e-05,2.7e-05,2.5e-05,1.4e-05,2.8e-05,1.1e-05,1.9e-05,2.8e-05,4.4e-05,2.7e-05,4e-05,3.2e-05,1.9e-05,4.1e-05,6.4e-05,2.5e-05,3.6e-05,1.7e-05,3.2e-05,8e-06,3.4e-05,3.4e-05,4.9e-05,6.6e-05,1.9e-05,1.4e-05,4e-05,1.6e-05,1.5e-05,2.9e-05,3.3e-05,3.8e-05,1e-05,5e-06,2.1e-05,2.7e-05,1.3e-05,1.6e-05,1.4e-05,1.4e-05,3.5e-05,2.7e-05,7e-06,1.5e-05,5e-06,4.6e-05,1.6e-05,3.9e-05,4.3e-05,1e-05,1.5e-05,1.8e-05,7.1e-05,3.5e-05,1.1e-05,1.8e-05,1.1e-05,1.8e-05,2.6e-05,4.5e-05,9e-06,1.9e-05,1.5e-05,2.2e-05,4.3e-05,3.5e-05,1.7e-05,2.1e-05,1.6e-05,9e-06,3.3e-05,3.4e-05,3.6e-05,2.3e-05,1.7e-05,7e-06,4e-05,1.6e-05,4.1e-05,1.7e-05,2.9e-05,4.2e-05,5.3e-05,2.2e-05,3.3e-05,2.1e-05,2.5e-05,5.6e-05,7.7e-05,8e-06,3.8e-05,4.1e-05,2.3e-05,1e-05,2e-05,1.5e-05,6.9e-05,1.3e-05,8e-06,1.5e-05,4.1e-05,2.9e-05,6e-06,1.6e-05,1.1e-05,4.5e-05,1.5e-05
7.2e-05,1.2e-05,4.4e-05,2.8e-05,7.3e-05,3e-05,3.6e-05,2.8e-05,9e-06,3.4e-05,2.9e-05,1.7e-05,2.4e-05,2.5e-05,3.1e-05,2e-06,3.9e-05,1.3e-05,2.9e-05,5e-06,1.1e-05,3.3e-05,4.4e-05,1.3e-05,4.1e-05,1.9e-05,2.8e-05,4.4e-05,3.5e-05,1.1e-05,5.5e-05,1.5e-05,2.8e-05,1.3e-05,1.7e-05,2.9e-05,5e-05,5.8e-05,2.9e-05,2.9e-05,2.3e-05,5e-06,1.1e-05,2.3e-05,3.6e-05,3.4e-05,1.2e-05,7e-06,1.2e-05,2.8e-05,1.2e-05,2.6e-05,1.4e-05,1.1e-05,1.6e-05,3.4e-05,1.4e-05,2.2e-05,2.4e-05,3.6e-05,1.9e-05,4.6e-05,6.3e-05,3.3e-05,1.5e-05,2.1e-05,8.2e-05,4.7e-05,5e-06,9e-06,5e-06,1.2e-05,2.9e-05,4.1e-05,3e-06,2e-06,2e-05,2e-05,5.1e-05,3.4e-05,3.5e-05,1e-06,2.1e-05,1.1e-05,3.8e-05,4.1e-05,2.7e-05,1.1e-05,1.6e-05,1.1e-05,3.8e-05,1.4e-05,4.3e-05,1.5e-05,2e-05,3.3e-05,5.4e-05,2.9e-05,1.3e-05,1.9e-05,8e-06,5.9e-05,6.1e-05,1.6e-05,2.4e-05,2.2e-05,4e-06,2.8e-05,1.3e-05,2.1e-05,5.5e-05,2.2e-05,9e-06,3e-05,3.4e-05,3e-06,2.2e-05,1.7e-05,9e-06,3.6e-05,1e-05
6.1e-05,2.6e-05,4.8e-05,1.8e-05,6.4e-05,1.6e-05,4.8e-05,8e-06,2.4e-05,8e-06,2.2e-05,6e-06,2.7e-05,1.8e-05,1.1e-05,2.1e-05,3e-05,6e-06,2.3e-05,9e-06,2e-06,2.9e-05,4.5e-05,2e-05,5e-05,5e-06,2e-05,1e-05,7e-05,4.8e-05,2.4e-05,1.3e-05,2e-05,2.7e-05,3.4e-05,4.7e-05,4.3e-05,4.8e-05,3.4e-05,4.6e-05,5.2e-05,2.1e-05,8e-06,2.1e-05,2.9e-05,2.8e-05,8e-06,1e-05,1.4e-05,2.5e-05,2.3e-05,3.1e-05,1.4e-05,3.5e-05,4e-05,1.4e-05,1.7e-05,4e-05,3.7e-05,4.2e-05,4.4e-05,3.6e-05,3.8e-05,2.1e-05,5e-06,3e-05,6.5e-05,3.2e-05,1.9e-05,6e-06,8e-06,2e-06,3e-05,5.1e-05,1.1e-05,1.2e-05,2e-05,2.1e-05,4.3e-05,1.5e-05,1.3e-05,2.2e-05,2.5e-05,3.4e-05,1.7e-05,1.4e-05,4e-05,2.3e-05,1e-05,1.8e-05,2e-05,1.7e-05,6e-05,2.1e-05,2.5e-05,3.4e-05,5.7e-05,2.4e-05,1.2e-05,7e-06,1.2e-05,5.7e-05,9.4e-05,3e-05,5.6e-05,5.4e-05,1.9e-05,1.7e-05,9e-06,2.9e-05,6.7e-05,3e-06,1.9e-05,3.5e-05,3.6e-05,3.2e-05,1.8e-05,9e-06,1.8e-05,2.4e-05,9e-06
4.8e-05,1.5e-05,3.1e-05,2.9e-05,7.6e-05,2.4e-05,3.3e-05,1.9e-05,3.6e-05,3e-05,2.2e-05,6e-06,3.3e-05,4.3e-05,1e-05,2.2e-05,3e-06,2e-05,1.9e-05,1.3e-05,1.6e-05,1.6e-05,5.8e-05,3.7e-05,3.9e-05,2.2e-05,2.2e-05,2.1e-05,9.3e-05,2.5e-05,3.5e-05,1.5e-05,2.4e-05,8e-06,3.8e-05,3.4e-05,1.7e-05,6.3e-05,4.5e-05,4.2e-05,2.2e-05,8e-06,1.8e-05,1.2e-05,2.7e-05,3.1e-05,1.3e-05,1.7e-05,2.1e-05,2.4e-05,2e-05,9e-06,1e-05,2.4e-05,4.9e-05,3.4e-05,1.6e-05,3.6e-05,2e-05,1.8e-05,2.3e-05,2e-05,5.2e-05,1.7e-05,8e-06,1.7e-05,6e-05,2.8e-05,3e-06,1.9e-05,4e-06,1.3e-05,3.2e-05,4.1e-05,1.7e-05,7e-06,2.3e-05,4e-05,5.2e-05,3e-05,9e-06,6e-06,1e-06,1e-05,1.2e-05,1.1e-05,2.4e-05,1.2e-05,1.1e-05,1e-05,4.5e-05,9e-06,4.5e-05,2e-05,2.6e-05,2.7e-05,5.7e-05,2.1e-05,1.7e-05,1.6e-05,1.6e-05,3.8e-05,6e-05,4e-06,5.4e-05,2.9e-05,3e-05,1.6e-05,8e-06,2.6e-05,6.7e-05,6e-06,5e-06,3.9e-05,2.2e-05,3.2e-05,5e-06,1e-05,2.2e-05,5.1e-05,1.2e-05
5.2e-05,1.1e-05,3.4e-05,3.5e-05,7.2e-05,1.3e-05,4e-05,2.5e-05,1.2e-05,1.5e-05,3.6e-05,2.3e-05,1.3e-05,3.1e-05,1.7e-05,1.8e-05,4.6e-05,4e-05,3.6e-05,3e-06,1.9e-05,3.3e-05,5e-05,2.2e-05,4.8e-05,1.2e-05,2.4e-05,2.7e-05,8.2e-05,3.1e-05,3.2e-05,2e-05,5.8e-05,1.4e-05,3.2e-05,4.8e-05,1.2e-05,8e-05,1e-05,2.3e-05,4.9e-05,4.9e-05,1.7e-05,3.2e-05,2.1e-05,1.6e-05,1.4e-05,7e-06,2.6e-05,1e-05,3e-06,2.3e-05,1.1e-05,2.2e-05,4.1e-05,3.1e-05,9e-06,1.4e-05,1.4e-05,1.6e-05,2.1e-05,1.2e-05,3.6e-05,3e-06,1.3e-05,3e-05,5.4e-05,1.7e-05,9e-06,1.4e-05,1.8e-05,1.7e-05,3.8e-05,3.2e-05,7e-06,9e-06,1.6e-05,1.9e-05,2.8e-05,2.2e-05,2e-06,1.4e-05,1.4e-05,1.9e-05,2.7e-05,3e-05,3.4e-05,2.4e-05,1.5e-05,2.3e-05,2.8e-05,2.2e-05,4.6e-05,2.8e-05,2.7e-05,2.9e-05,6.7e-05,1.7e-05,1.8e-05,2.4e-05,2.5e-05,3.9e-05,5.9e-05,9e-06,5e-05,2.9e-05,7e-06,2.6e-05,2.4e-05,3.6e-05,5.8e-05,7e-06,1e-06,4.7e-05,4.8e-05,4.4e-05,1.7e-05,1.7e-05,1e-05,3.5e-05,8e-06
4.5e-05,1.9e-05,3.5e-05,2.5e-05,6.8e-05,1.8e-05,1.8e-05,1.6e-05,4.1e-05,4.8e-05,3.5e-05,1.1e-05,2.4e-05,4.6e-05,1.7e-05,1.3e-05,4.2e-05,2.6e-05,3.6e-05,1.2e-05,1.3e-05,2.3e-05,4.4e-05,2.6e-05,3.6e-05,2.6e-05,3.5e-05,3.1e-05,3.4e-05,5.4e-05,2.9e-05,1.5e-05,4.2e-05,9e-06,4e-05,3.1e-05,2.3e-05,6.1e-05,1.7e-05,1.3e-05,3e-05,3.9e-05,6.1e-05,2.7e-05,5.5e-05,2.5e-05,1.4e-05,1e-05,1.5e-05,1.1e-05,4e-06,2e-05,9e-06,2.3e-05,2.8e-05,2e-05,1.2e-05,1.4e-05,2e-05,1.7e-05,1.9e-05,3.5e-05,5.5e-05,7e-06,1.6e-05,9e-06,6.9e-05,1.9e-05,2.1e-05,2.1e-05,2e-05,3.4e-05,2.1e-05,4.6e-05,1.7e-05,1.8e-05,4e-06,3.3e-05,4.3e-05,3.1e-05,1.4e-05,3.1e-05,2.7e-05,6e-06,2.2e-05,4.4e-05,2.1e-05,3.2e-05,2.9e-05,2.6e-05,3.1e-05,2.7e-05,2.4e-05,2e-05,1e-05,4.9e-05,6.9e-05,4e-05,3.1e-05,2.8e-05,2.6e-05,6.6e-05,7.7e-05,1.5e-05,2.7e-05,3.5e-05,3.4e-05,3.2e-05,3.7e-05,9e-06,7.2e-05,2.7e-05,2.1e-05,3.3e-05,6e-06,3.5e-05,2e-05,6e-06,6e-06,3.9e-05,6e-06
2.2e-05,1.8e-05,4.3e-05,4e-06,5.4e-05,3.7e-05,3.2e-05,1.6e-05,2.1e-05,1e-05,1.4e-05,2e-05,3.8e-05,1.6e-05,1.6e-05,3e-06,4.6e-05,1.3e-05,8e-06,1e-06,9e-06,1.6e-05,4e-05,2e-05,3.6e-05,1.1e-05,3.9e-05,2.4e-05,3.1e-05,3.7e-05,3.6e-05,1e-05,2.1e-05,5e-06,4.1e-05,3.2e-05,6e-06,7.4e-05,2.3e-05,1.2e-05,3.3e-05,2e-05,3.3e-05,1.8e-05,3.8e-05,1.6e-05,8e-06,5e-06,1.2e-05,2.5e-05,1e-05,2e-05,5e-06,3.5e-05,4.9e-05,1.4e-05,4e-06,2.5e-05,7e-06,3.6e-05,1.1e-05,3.4e-05,2.4e-05,3e-06,1.5e-05,2.5e-05,6.6e-05,4.1e-05,2.3e-05,1.5e-05,2e-05,2e-05,3.6e-05,4.1e-05,3e-06,1.6e-05,8e-06,1.4e-05,2.1e-05,2.7e-05,2.4e-05,1.1e-05,1e-05,2.1e-05,1.5e-05,4.3e-05,3.7e-05,3e-05,2.5e-05,3e-05,3e-05,1.9e-05,4.3e-05,1.1e-05,1.9e-05,6.1e-05,6.5e-05,1.2e-05,2.3e-05,3e-05,2.5e-05,2.9e-05,5.8e-05,2.2e-05,5e-05,4.4e-05,1.3e-05,1.7e-05,2.2e-05,2.6e-05,7.8e-05,9e-06,1.4e-05,1.7e-05,1.7e-05,1.9e-05,1.9e-05,1.3e-05,1.6e-05,4e-05,7e-06
4.8e-05,1.6e-05,3.7e-05,1.5e-05,6.8e-05,2.6e-05,3e-05,4e-06,8e-06,1.7e-05,1.4e-05,1.9e-05,2.2e-05,1.6e-05,1.2e-05,1.6e-05,3.1e-05,1.2e-05,1.6e-05,7e-06,1.2e-05,2.7e-05,3.9e-05,1.6e-05,2.9e-05,8e-06,4.2e-05,1.9e-05,6.7e-05,4.8e-05,1.6e-05,1.4e-05,4.4e-05,4e-06,2.5e-05,4.2e-05,1.6e-05,6.7e-05,2.2e-05,1.5e-05,3.3e-05,1e-06,1.2e-05,1.7e-05,2.6e-05,2.1e-05,1.1e-05,6e-06,2.2e-05,1.9e-05,3e-06,1.4e-05,1.3e-05,2.2e-05,4.1e-05,9e-06,3e-06,1.6e-05,9e-06,3.1e-05,1.4e-05,3.4e-05,3.5e-05,1.2e-05,4e-06,2.7e-05,4.2e-05,1.1e-05,2.9e-05,2e-05,8e-06,1.4e-05,3.1e-05,4.3e-05,4e-06,8e-06,2e-06,7e-06,2.9e-05,1.6e-05,1.5e-05,4e-06,9e-06,1.3e-05,2.2e-05,3.8e-05,1.7e-05,2.2e-05,2.4e-05,2e-06,3.7e-05,9e-06,4.3e-05,1.2e-05,1.8e-05,4.5e-05,5.6e-05,1.5e-05,2.2e-05,2.3e-05,3e-06,2.5e-05,6.4e-05,1.7e-05,2.8e-05,4.4e-05,1.8e-05,1.6e-05,1.1e-05,1.4e-05,7.2e-05,7e-06,1.9e-05,1.7e-05,1e-05,2.7e-05,1.2e-05,8e-06,1.6e-05,3e-05,5e-06
5e-05,1.7e-05,2.8e-05,2.8e-05,5.9e-05,3e-05,3.5e-05,1.2e-05,1.9e-05,1.6e-05,1.5e-05,9e-06,1.6e-05,1.5e-05,1e-05,1.3e-05,3.1e-05,4e-06,2.1e-05,8e-06,7e-06,1.4e-05,4.5e-05,1.6e-05,2.8e-05,6e-06,3.2e-05,2.3e-05,7.9e-05,2e-05,2.7e-05,1.2e-05,3.5e-05,1.2e-05,2.2e-05,3.1e-05,1.5e-05,2.1e-05,1e-05,1.6e-05,1.6e-05,1.2e-05,1.7e-05,1.2e-05,4.2e-05,2.1e-05,4e-06,6e-06,2.8e-05,2.8e-05,1e-05,2.6e-05,2.1e-05,2.5e-05,3.5e-05,7e-06,1e-06,1.2e-05,9e-06,3.2e-05,1.7e-05,2.1e-05,4.2e-05,5e-06,2e-06,1.7e-05,4.5e-05,2.3e-05,3e-06,1.4e-05,5e-06,8e-06,3.1e-05,4.2e-05,1.3e-05,1.2e-05,7e-06,1.8e-05,3.8e-05,2.5e-05,8e-06,5e-06,1.1e-05,3e-06,1.4e-05,3.4e-05,2.8e-05,1.7e-05,7e-06,1e-06,2.9e-05,6e-06,3.9e-05,1.7e-05,1.6e-05,2.6e-05,3.7e-05,1.7e-05,7e-06,1.2e-05,2.3e-05,3.8e-05,4e-05,1.4e-05,3.7e-05,5e-05,1.2e-05,2e-05,3e-06,1.6e-05,7.8e-05,3e-06,1.8e-05,2.2e-05,2e-05,2.6e-05,1.1e-05,1.4e-05,1.7e-05,3.6e-05,9e-06
4e-05,6e-06,4e-05,3.1e-05,6.5e-05,3.5e-05,1.7e-05,2e-05,1.6e-05,1.2e-05,1.9e-05,1e-06,2.8e-05,3.3e-05,8e-06,1.1e-05,2.9e-05,8e-06,1.7e-05,1.6e-05,1.6e-05,2.8e-05,3.2e-05,1.9e-05,2.4e-05,6e-06,2.9e-05,3e-06,6.1e-05,3.6e-05,1.9e-05,9e-06,2.4e-05,4e-06,2.7e-05,3.2e-05,8e-06,6.4e-05,2.8e-05,1.2e-05,1.5e-05,1.5e-05,3.1e-05,1.2e-05,2e-05,3e-05,1e-05,8e-06,1.7e-05,2.2e-05,6e-06,1.7e-05,4e-06,1.1e-05,3.3e-05,1.4e-05,8e-06,2e-06,1e-05,3.3e-05,1.1e-05,2.4e-05,3.9e-05,6e-06,7e-06,1.5e-05,4.4e-05,2e-05,1.3e-05,2.3e-05,6e-06,9e-06,2.8e-05,3.9e-05,2.3e-05,1e-05,5e-06,2e-05,3.4e-05,1.7e-05,9e-06,7e-06,7e-06,1.6e-05,2.2e-05,3.5e-05,2.7e-05,9e-06,1.9e-05,3e-06,3.4e-05,7e-06,3.8e-05,3e-05,2.2e-05,3.9e-05,4.6e-05,3e-05,1.5e-05,1.9e-05,3.1e-05,2.6e-05,4.8e-05,1.1e-05,3.9e-05,4.6e-05,2.8e-05,2.2e-05,7e-06,2.1e-05,5.7e-05,8e-06,2.4e-05,2.4e-05,9e-06,2.4e-05,1e-05,8e-06,1.8e-05,1.8e-05,2e-05
4.3e-05,1.5e-05,3.8e-05,2.5e-05,7.3e-05,1.7e-05,2.5e-05,1.4e-05,3e-06,1.1e-05,1.4e-05,5e-06,2.5e-05,2.4e-05,7e-06,1.3e-05,4.3e-05,6e-06,2.4e-05,1.5e-05,4e-06,2.7e-05,3.4e-05,2.1e-05,3.1e-05,1.3e-05,6e-06,1e-05,4.5e-05,2.7e-05,1.7e-05,1.4e-05,3.9e-05,5e-06,1.9e-05,3.7e-05,1.4e-05,6.6e-05,1.2e-05,3e-06,1.4e-05,7e-06,1.1e-05,2.3e-05,2.3e-05,2.4e-05,5e-06,1e-06,7e-06,1.7e-05,1.3e-05,1.7e-05,6e-06,4e-06,2.7e-05,1.5e-05,0,1.1e-05,9e-06,3e-05,1e-06,2.7e-05,4.4e-05,7e-06,1.1e-05,1.2e-05,4.9e-05,2.6e-05,1e-05,2.2e-05,6e-06,1e-05,3.4e-05,3.9e-05,1.4e-05,3e-06,1e-05,2.3e-05,3e-05,2.1e-05,1e-06,8e-06,1e-06,1.8e-05,1.9e-05,2.8e-05,2.7e-05,2.5e-05,1e-05,1.1e-05,2e-05,1.6e-05,1.8e-05,6e-06,9e-06,3.5e-05,6.5e-05,2.4e-05,8e-06,2.2e-05,1.9e-05,2.8e-05,6e-05,1.7e-05,3.2e-05,4.1e-05,2.4e-05,1.1e-05,4e-06,3.4e-05,7e-05,9e-06,1.9e-05,2.1e-05,1e-05,2.1e-05,8e-06,1.1e-05,1.1e-05,3.4e-05,5e-06
4.6e-05,1.5e-05,3.4e-05,2.4e-05,6.5e-05,2.1e-05,2.4e-05,1.2e-05,1e-06,1.6e-05,1.6e-05,2e-06,1.5e-05,2.4e-05,3e-06,2e-06,3.3e-05,6e-06,2e-05,5e-06,8e-06,2.9e-05,3.4e-05,1.9e-05,2.9e-05,1.2e-05,2e-05,1.8e-05,4.9e-05,3.5e-05,2.4e-05,1.7e-05,2.8e-05,3e-06,2.4e-05,3.3e-05,7e-06,6.5e-05,1.9e-05,9e-06,1.3e-05,3e-06,1.2e-05,2e-05,2.1e-05,2.3e-05,2e-06,1e-06,1.9e-05,1.8e-05,3e-06,1.8e-05,1.1e-05,1.7e-05,2.5e-05,9e-06,0,1.2e-05,6e-06,3e-05,3e-06,2.6e-05,4.1e-05,7e-06,4e-06,1.4e-05,5e-05,2.4e-05,8e-06,1.8e-05,2e-06,9e-06,3e-05,3.4e-05,9e-06,1e-05,7e-06,1.4e-05,2.7e-05,1.8e-05,1.4e-05,5e-06,1e-06,1.5e-05,1.9e-05,2.6e-05,2e-05,2.1e-05,1.3e-05,1.2e-05,2.5e-05,1.3e-05,2e-05,1.5e-05,1.6e-05,2.4e-05,4.4e-05,1.3e-05,5e-06,1.1e-05,1.5e-05,3.4e-05,6.3e-05,7e-06,3.3e-05,4.4e-05,2e-05,1.7e-05,1e-06,3.4e-05,5.9e-05,1.1e-05,2.2e-05,3e-05,1.1e-05,2.5e-05,7e-06,1.1e-05,1.1e-05,3e-05,1e-06
4e-05,1.4e-05,2.9e-05,2e-05,6.2e-05,2.3e-05,2.4e-05,1e-05,1e-06,1.2e-05,1.2e-05,2e-06,1.4e-05,1.9e-05,2e-06,1e-06,3.5e-05,5e-06,2.3e-05,1e-06,3e-06,2.1e-05,3.3e-05,1.8e-05,2.9e-05,1.1e-05,2.3e-05,9e-06,4.8e-05,2e-05,2.4e-05,1.5e-05,3.5e-05,6e-06,2.2e-05,3.4e-05,1e-06,5.8e-05,1.2e-05,0,1.3e-05,4e-06,1.5e-05,2.5e-05,3e-05,2.5e-05,6e-06,4e-06,2e-05,2.1e-05,1e-06,1.8e-05,5e-06,1.4e-05,3.1e-05,1.5e-05,6e-06,8e-06,4e-06,2.4e-05,5e-06,2.4e-05,4e-05,5e-06,7e-06,1.4e-05,5.2e-05,2.6e-05,6e-06,1.8e-05,5e-06,9e-06,2.9e-05,3.1e-05,6e-06,7e-06,8e-06,1.4e-05,2.5e-05,1.6e-05,1.1e-05,1.1e-05,4e-06,1.6e-05,1.7e-05,2.6e-05,2.1e-05,2e-05,1e-05,9e-06,2.6e-05,1.1e-05,2e-05,6e-06,1.8e-05,2.3e-05,5.2e-05,1.5e-05,8e-06,1.7e-05,1.7e-05,3.3e-05,5.3e-05,1e-05,2.9e-05,3.8e-05,1.9e-05,1.8e-05,0,2.8e-05,6.4e-05,5e-06,1.1e-05,2.5e-05,1.4e-05,2.1e-05,4e-06,8e-06,9e-06,3.4e-05,2e-06
4.1e-05,1.8e-05,3.1e-05,1.7e-05,6.7e-05,1.9e-05,2.3e-05,1.1e-05,2e-06,1.3e-05,9e-06,2e-06,1.3e-05,2.2e-05,1e-06,2e-06,3.6e-05,5e-06,2.2e-05,1e-06,2e-06,2.1e-05,3.5e-05,1.7e-05,2.8e-05,1.4e-05,2.1e-05,1.1e-05,5.1e-05,2.2e-05,2.1e-05,1.6e-05,3.4e-05,3e-06,2.2e-05,3.4e-05,1e-06,6e-05,1.2e-05,1e-06,1.3e-05,4e-06,1.5e-05,2.5e-05,2.8e-05,2e-05,3e-06,0,1.8e-05,1.7e-05,5e-06,1.8e-05,5e-06,1.4e-05,3.1e-05,1.3e-05,3e-06,8e-06,7e-06,2.8e-05,1e-06,2.5e-05,4.2e-05,4e-06,1e-06,1.3e-05,5.2e-05,2.3e-05,8e-06,2e-05,3e-06,8e-06,3.2e-05,3.3e-05,1.1e-05,8e-06,5e-06,1.3e-05,2.1e-05,1.4e-05,8e-06,7e-06,1e-06,1.4e-05,1.8e-05,2.5e-05,1.9e-05,2.2e-05,1.1e-05,6e-06,2.6e-05,7e-06,2.4e-05,7e-06,1.9e-05,2.8e-05,4.8e-05,1.7e-05,8e-06,1.6e-05,1.9e-05,3.1e-05,5.1e-05,2e-06,3.1e-05,3.7e-05,1.7e-05,1.7e-05,2e-06,2.5e-05,6e-05,3e-06,1.1e-05,2.4e-05,9e-06,2.2e-05,2e-06,6e-06,6e-06,3.4e-05,3e-06
