3e-06,0,5e-06,1e-05,3e-06,3e-06,1e-06,9e-06,7e-06,5e-06,2e-06,4e-06,2e-06,2e-06,4e-06,1.5e-05,5e-06,2e-05,1.6e-05,4e-06,7e-06,2e-06,1e-06,9e-06,8e-06,4e-06,2e-05,2e-06,1.1e-05,1.2e-05,9e-06,1.7e-05,8e-06,1.6e-05,2.1e-05,1e-05,1e-06,4e-06,0,1e-06,4e-06,1.2e-05,9e-06,1.2e-05,7e-06,8e-06,6e-06,1.1e-05,1.6e-05,1.1e-05,1e-06,6e-06,3e-06,4e-06,9e-06,6e-06,3e-06,1.7e-05,1e-06,1.5e-05,1.3e-05,1.3e-05,6e-06,7e-06,4e-06,1.3e-05,1.5e-05,1.3e-05,1e-06,7e-06,1.7e-05,1e-05,1e-06,2.4e-05,1.5e-05,2e-05,2e-05,3e-05,2.3e-05,2e-06,1.6e-05,2.4e-05,2.7e-05,2.7e-05,2.8e-05,2.3e-05,7e-06,1e-06,1.2e-05,1e-06,4e-06,0,2.8e-05,2.6e-05,2e-05,4e-06,8e-06,5e-06,1e-06,1.4e-05,7e-06,1.5e-05,7e-06,1.1e-05,2e-06,1.8e-05,6e-06,3e-06,9e-06,8e-06,1.4e-05,1.4e-05,1.7e-05,0,1.4e-05,3e-06,4e-06,2.1e-05,3.6e-05,7e-06,2.5e-05
3e-06,1.3e-05,1.2e-05,1.1e-05,2.3e-05,1.5e-05,1.6e-05,1.4e-05,2.2e-05,2.9e-05,1.7e-05,6e-06,1e-05,1.5e-05,8e-06,5e-05,6.1e-05,4.9e-05,6.1e-05,4.1e-05,3e-05,2.9e-05,4.5e-05,4.4e-05,5.1e-05,5.4e-05,4.8e-05,4.1e-05,4.5e-05,4.9e-05,1.8e-05,3.6e-05,5.3e-05,2.9e-05,5.6e-05,1.9e-05,3.3e-05,2.4e-05,1.3e-05,1.4e-05,2.2e-05,4.6e-05,1.2e-05,3.4e-05,3.6e-05,2.3e-05,2.1e-05,1.2e-05,4.7e-05,6.4e-05,5.2e-05,2.2e-05,1.7e-05,2e-05,2.8e-05,4e-06,1.3e-05,4.9e-05,3.7e-05,2.6e-05,2.7e-05,3.9e-05,1.6e-05,1.5e-05,1.7e-05,4.9e-05,2.6e-05,1.5e-05,1.8e-05,2.6e-05,3.9e-05,1.5e-05,1.1e-05,4.2e-05,3.2e-05,7.7e-05,5.2e-05,6.6e-05,3.3e-05,1.4e-05,2.1e-05,6.6e-05,7.8e-05,5.6e-05,6.2e-05,5.3e-05,2.3e-05,1.9e-05,3.3e-05,1e-05,1.3e-05,1e-05,6.4e-05,5.9e-05,5.7e-05,2.6e-05,1.9e-05,2.7e-05,8e-06,3.2e-05,1.7e-05,5e-05,1.5e-05,3.9e-05,3.6e-05,4.1e-05,5e-06,1.4e-05,1.2e-05,2.7e-05,2.3e-05,5.6e-05,2.6e-05,1.6e-05,1.7e-05,8e-06,7e-06,5.1e-05,8.2e-05,3.4e-05,3.6e-05
1.1e-05,2.8e-05,5e-06,1.9e-05,2.8e-05,4.3e-05,1.3e-05,3.4e-05,1.9e-05,1.8e-05,1.7e-05,1e-05,1.5e-05,9e-06,4.6e-05,5.2e-05,2.4e-05,4.6e-05,1.3e-05,1.8e-05,2.9e-05,1.3e-05,4.4e-05,3.6e-05,4.5e-05,4e-05,3.8e-05,3.1e-05,2.3e-05,2.3e-05,1.3e-05,1.5e-05,2.2e-05,1.8e-05,3.1e-05,3.6e-05,2.7e-05,1.2e-05,8e-06,1.1e-05,3.2e-05,2.5e-05,3.3e-05,3.3e-05,1.6e-05,2.5e-05,2.5e-05,1.3e-05,3.3e-05,1.1e-05,1.5e-05,9e-06,2.4e-05,2e-06,3.6e-05,2e-05,1.2e-05,4.1e-05,1.8e-05,1.1e-05,5.2e-05,5.3e-05,5.2e-05,1.9e-05,4.8e-05,6.8e-05,5.6e-05,4.4e-05,3.1e-05,4.7e-05,6.7e-05,5.1e-05,6.1e-05,3.9e-05,0.000101,9.6e-05,0.000113,9.8e-05,7.9e-05,7.4e-05,9.3e-05,0.000117,0.000138,0.000104,0.000104,0.000113,6.2e-05,7.5e-05,4.2e-05,3.8e-05,4.6e-05,5.8e-05,7.6e-05,0.000118,9.6e-05,3.3e-05,2.5e-05,1.5e-05,2.3e-05,5.7e-05,6.2e-05,5e-05,2.2e-05,4.8e-05,3.3e-05,4.3e-05,4.1e-05,1.9e-05,2e-05,2.2e-05,5.8e-05,6.6e-05,4.8e-05,3e-06,4.1e-05,2e-06,1.6e-05,3.6e-05,8.4e-05,5e-05,3.5e-05
3.9e-05,5.9e-05,4.7e-05,2.8e-05,3.6e-05,5.4e-05,6.2e-05,7.9e-05,5.6e-05,4.4e-05,1.6e-05,7e-06,2.6e-05,3.8e-05,9.5e-05,7.3e-05,2e-05,4.1e-05,5.5e-05,4.9e-05,5.7e-05,4.3e-05,5.2e-05,1e-05,4.3e-05,9e-05,8.6e-05,4.6e-05,5.1e-05,4.9e-05,5.4e-05,4.8e-05,1.4e-05,1.4e-05,6.9e-05,7.2e-05,7.8e-05,6.5e-05,2.6e-05,1.8e-05,5.2e-05,5.4e-05,5.8e-05,3.2e-05,3e-06,2.6e-05,4.2e-05,3.4e-05,2.9e-05,3.4e-05,3.5e-05,2.4e-05,3.6e-05,1.8e-05,3.1e-05,3.5e-05,2.9e-05,3e-05,5.6e-05,5.3e-05,5.8e-05,7.9e-05,7.7e-05,1e-04,0.00011,0.000141,0.000144,0.000121,0.000127,0.000122,0.000139,0.000153,0.000169,0.000173,0.00019,0.000199,0.000215,0.000215,0.000218,0.000256,0.000273,0.000298,0.000302,0.000265,0.000235,0.000233,0.000241,0.000234,0.000196,0.000129,8.7e-05,0.000121,0.000183,0.000226,0.000249,0.000232,0.000147,5.6e-05,1.6e-05,0.000109,0.000141,0.00015,0.000106,4.5e-05,8.5e-05,0.000108,0.000106,9.3e-05,6.3e-05,2e-05,4.7e-05,0.000151,0.000152,0.000123,0.00011,7.7e-05,6.7e-05,5.2e-05,0.000109,0.000189,0.000181
3.1e-05,2.2e-05,8e-06,3.2e-05,2.4e-05,2.9e-05,5.3e-05,1.6e-05,7e-06,2e-05,9e-06,5e-06,2.3e-05,3.6e-05,6.2e-05,4.7e-05,4.9e-05,6e-06,4.2e-05,2.5e-05,3.1e-05,1.6e-05,1.3e-05,2.4e-05,2.3e-05,4.3e-05,2.5e-05,2.9e-05,2e-05,2e-05,3.5e-05,3.1e-05,3.3e-05,2.5e-05,4.2e-05,4e-05,1.3e-05,1.4e-05,1.7e-05,3.9e-05,2e-05,1.3e-05,1.7e-05,9e-06,1.3e-05,3.3e-05,1.9e-05,1.7e-05,2.7e-05,1.5e-05,4.4e-05,1.1e-05,2e-05,2.9e-05,8e-06,3.2e-05,1.1e-05,1.2e-05,1e-05,2.1e-05,1.4e-05,2.1e-05,4e-06,3.5e-05,3.9e-05,4.8e-05,5.6e-05,3.4e-05,5.3e-05,4.8e-05,4.9e-05,6.5e-05,5.4e-05,4.9e-05,4.2e-05,4.2e-05,5.7e-05,4.7e-05,6.8e-05,8.7e-05,6.8e-05,8e-05,7.3e-05,4.8e-05,4.9e-05,6.8e-05,6.4e-05,6.5e-05,5.3e-05,2.8e-05,3.3e-05,6.4e-05,6e-05,6.7e-05,6.1e-05,7.3e-05,2.9e-05,2e-05,2.6e-05,7.9e-05,5.7e-05,3.2e-05,4e-05,2.8e-05,4.2e-05,4.8e-05,3.1e-05,1.9e-05,1.1e-05,2.3e-05,3.4e-05,8.3e-05,5.9e-05,4.4e-05,3e-05,5.5e-05,1.5e-05,7.8e-05,8.8e-05,8.9e-05,3.6e-05
5e-06,9e-06,9e-06,4.5e-05,9e-06,3.5e-05,2.3e-05,7e-06,1.3e-05,3.3e-05,2.6e-05,4e-06,2.5e-05,8e-06,4.3e-05,2.1e-05,4.5e-05,5.4e-05,1.6e-05,2.4e-05,3.4e-05,2.5e-05,2.3e-05,2.4e-05,1.7e-05,4e-06,4.2e-05,1e-05,2.5e-05,3.5e-05,4e-05,1.1e-05,3.1e-05,1.8e-05,1.7e-05,9e-06,1.3e-05,1.5e-05,3.1e-05,2.4e-05,3.4e-05,2.7e-05,3e-06,6e-06,1.3e-05,1.6e-05,2.7e-05,2.9e-05,3.8e-05,4.3e-05,1.6e-05,1.5e-05,2e-05,5e-05,3.2e-05,4.4e-05,4.4e-05,3.8e-05,4.3e-05,4.6e-05,2.7e-05,3.9e-05,5.5e-05,6.3e-05,4.5e-05,5.9e-05,8.5e-05,6.7e-05,8e-05,5.8e-05,6.9e-05,6.5e-05,4.9e-05,2.9e-05,1.4e-05,9e-06,1.2e-05,3.3e-05,3.8e-05,5.8e-05,3e-05,2.3e-05,3.8e-05,5.3e-05,4.1e-05,2.2e-05,6.9e-05,2.8e-05,5.5e-05,4.3e-05,2.6e-05,3.7e-05,3.8e-05,8e-06,2.5e-05,4.8e-05,1e-05,2.3e-05,2.1e-05,3.6e-05,2.3e-05,3e-05,8e-06,4e-06,2.3e-05,1.2e-05,1.5e-05,2e-05,8e-06,3.2e-05,1.2e-05,2.6e-05,2.7e-05,3.1e-05,3e-05,3.9e-05,1.6e-05,5.2e-05,0.000167,1.4e-05,2.7e-05
1.7e-05,1.6e-05,1.4e-05,6.6e-05,4.3e-05,3.4e-05,6.8e-05,4e-05,2.1e-05,3.6e-05,5.1e-05,5.5e-05,8e-06,2.2e-05,6.9e-05,0.000118,2.3e-05,6.7e-05,7.1e-05,5e-05,1.9e-05,3e-05,3.7e-05,8e-06,1.2e-05,2.6e-05,4.8e-05,3.3e-05,2.5e-05,2e-05,2.9e-05,1.7e-05,3.9e-05,1.8e-05,2.3e-05,3.3e-05,2.4e-05,1.9e-05,2.7e-05,5.4e-05,2.7e-05,1.1e-05,1.6e-05,6e-06,2.4e-05,8e-06,1.8e-05,5.7e-05,3.7e-05,6.5e-05,9e-05,2.9e-05,2.3e-05,4.4e-05,3.6e-05,1.8e-05,4.8e-05,1.8e-05,8.4e-05,9.3e-05,6.3e-05,9.9e-05,8.4e-05,0.000114,0.00011,6.6e-05,0.000107,9.3e-05,7.7e-05,0.000117,6.3e-05,5.7e-05,4.6e-05,4.5e-05,8.4e-05,5.9e-05,2.7e-05,1.1e-05,1e-06,6.2e-05,6.7e-05,9.7e-05,9.1e-05,8.1e-05,4.8e-05,2.2e-05,8.8e-05,5.2e-05,6.9e-05,7.5e-05,5.7e-05,3.3e-05,2.5e-05,2.9e-05,4.3e-05,3.4e-05,2.8e-05,4.2e-05,3.1e-05,4.7e-05,3.6e-05,3.5e-05,2.1e-05,4e-06,3.4e-05,3.6e-05,1.8e-05,1.3e-05,4e-06,3.1e-05,3.8e-05,4.3e-05,6e-05,3.9e-05,2.5e-05,5.1e-05,2.6e-05,1.4e-05,0.000201,0.000186,0.000136
5.3e-05,3.4e-05,3.1e-05,3e-05,5.4e-05,6.1e-05,5.4e-05,5.8e-05,4.1e-05,3e-06,3.2e-05,3.8e-05,4e-05,6.4e-05,4.3e-05,0.000149,0.000108,8.7e-05,7.6e-05,3.5e-05,2.5e-05,2.9e-05,1.8e-05,2.4e-05,1.1e-05,2.6e-05,1.2e-05,9e-06,1.1e-05,8e-06,1.4e-05,2.6e-05,2.6e-05,2.1e-05,1.8e-05,3.2e-05,7e-06,3.1e-05,1e-05,4.7e-05,3e-05,1.6e-05,2.8e-05,2.9e-05,3.9e-05,3.9e-05,2.9e-05,8.8e-05,5.4e-05,4.9e-05,4.3e-05,5.9e-05,2.4e-05,6.4e-05,4.2e-05,2.8e-05,2e-05,4e-05,5.6e-05,4.4e-05,5.1e-05,5.7e-05,1.2e-05,7.7e-05,1.6e-05,1.7e-05,6.3e-05,5.2e-05,9.9e-05,8.2e-05,6.2e-05,3.4e-05,4.2e-05,6.8e-05,5e-05,1.2e-05,4.1e-05,2.6e-05,1.7e-05,5.8e-05,5.1e-05,5.5e-05,1.2e-05,3.1e-05,1.9e-05,2.7e-05,6.2e-05,2.7e-05,6.2e-05,4.2e-05,1.4e-05,5.2e-05,4.6e-05,1.5e-05,2.2e-05,1.2e-05,2e-05,1.5e-05,1.6e-05,3.3e-05,8e-06,1.1e-05,9e-06,1.4e-05,3.2e-05,8e-06,9e-06,4e-06,2e-06,1.9e-05,3.2e-05,7.3e-05,6.7e-05,4.2e-05,6e-05,6.5e-05,8.5e-05,8.7e-05,0.000132,0.000193,3.8e-05
3.1e-05,2.2e-05,1.2e-05,1.3e-05,3.7e-05,9e-06,3.8e-05,1.6e-05,1.9e-05,1.5e-05,3.6e-05,2.4e-05,3e-05,4.3e-05,3.3e-05,0.000167,1e-04,1.8e-05,2.8e-05,2.9e-05,1.6e-05,3.6e-05,9e-06,1.7e-05,1.1e-05,1.8e-05,1.6e-05,6e-06,9e-06,6e-06,1e-06,2.1e-05,1.6e-05,1e-05,2.2e-05,2.3e-05,1.6e-05,3.1e-05,1.9e-05,3.4e-05,3.2e-05,1.4e-05,2e-05,2.5e-05,2.6e-05,2.3e-05,1.9e-05,6.8e-05,4.9e-05,3.5e-05,4.9e-05,6.2e-05,5.5e-05,7.3e-05,5.6e-05,6.7e-05,3.7e-05,5.5e-05,4.9e-05,4.5e-05,2.3e-05,5.9e-05,4.4e-05,4.4e-05,2.9e-05,3.7e-05,1.2e-05,3.7e-05,2.4e-05,3.7e-05,3.7e-05,3.8e-05,7e-06,5.3e-05,3.3e-05,1.5e-05,6e-06,2e-05,2.2e-05,8e-06,2.8e-05,3.4e-05,1.2e-05,2e-05,2.7e-05,3e-05,4.7e-05,3.4e-05,2e-06,2.4e-05,3.3e-05,3.4e-05,2.6e-05,2.8e-05,3.3e-05,2.3e-05,2.8e-05,1.7e-05,1.1e-05,2.2e-05,2.4e-05,1.5e-05,1.3e-05,9e-06,7e-06,6e-06,1e-05,1e-05,1.7e-05,1.5e-05,5.1e-05,2e-05,6.1e-05,4e-05,4.9e-05,3e-06,5.2e-05,2e-05,4e-05,9.8e-05,0.000115
1.7e-05,1.4e-05,7e-06,5e-06,1.8e-05,1.6e-05,2.2e-05,3.7e-05,2.6e-05,2.9e-05,2.1e-05,2.7e-05,7e-06,5e-05,7e-05,1e-04,6.5e-05,4.8e-05,4.3e-05,1.5e-05,5e-06,1.7e-05,1.5e-05,1.2e-05,2.2e-05,1e-06,1.7e-05,1.8e-05,1.8e-05,1.2e-05,8e-06,1.3e-05,6e-06,1.7e-05,1.7e-05,1.9e-05,1.8e-05,1.2e-05,1.5e-05,2.7e-05,2.5e-05,3.2e-05,3.5e-05,2e-06,1.2e-05,1.1e-05,2.1e-05,1.2e-05,1.9e-05,1.2e-05,2e-05,1.3e-05,1.4e-05,1.7e-05,1.5e-05,3.7e-05,3e-05,2.5e-05,3.6e-05,9e-06,5e-06,2e-05,7e-06,2e-05,2.3e-05,2.2e-05,2.5e-05,2.4e-05,3.1e-05,4.1e-05,1.5e-05,2.1e-05,1.8e-05,2e-05,1.3e-05,1.5e-05,2e-05,2.5e-05,1.3e-05,2.9e-05,2.9e-05,1.6e-05,1.1e-05,1e-05,1.1e-05,1.5e-05,2.2e-05,3.1e-05,6e-06,1.3e-05,1.3e-05,1.4e-05,1.8e-05,7e-06,2.7e-05,1.6e-05,2.4e-05,1.2e-05,1.5e-05,1.9e-05,1.5e-05,1.1e-05,1e-05,1.8e-05,7e-06,7e-06,8e-06,2.1e-05,1e-05,2e-05,3.1e-05,1.4e-05,2.7e-05,1.9e-05,1.5e-05,1.9e-05,2.4e-05,1.7e-05,0.000134,0.000133,3.7e-05
8e-06,2.1e-05,2.2e-05,1.8e-05,1e-05,2.2e-05,3.1e-05,9e-06,1.6e-05,1.4e-05,3.1e-05,1.9e-05,1.5e-05,1.6e-05,0.000125,3.9e-05,6.1e-05,1e-05,1.1e-05,2e-05,9e-06,1e-06,6e-06,1.7e-05,6e-06,1.1e-05,7e-06,9e-06,7e-06,1.1e-05,7e-06,8e-06,1.1e-05,1e-05,2.4e-05,2.4e-05,2.5e-05,2.2e-05,9e-06,2.1e-05,6e-06,1.8e-05,1.2e-05,1.4e-05,1.3e-05,6e-06,1.7e-05,1.9e-05,2.6e-05,1.2e-05,8e-06,6e-06,1.8e-05,1.6e-05,2e-06,2.4e-05,1.6e-05,2e-06,3.3e-05,1.1e-05,6e-06,1e-05,3e-06,1.7e-05,1.5e-05,1.8e-05,8e-06,2.1e-05,3e-06,1.4e-05,7e-06,1.3e-05,1e-05,1.5e-05,1.6e-05,1.9e-05,1.7e-05,8e-06,1.1e-05,1.8e-05,2.9e-05,1.7e-05,1.1e-05,1.1e-05,2e-06,1.8e-05,1.9e-05,1.7e-05,1.4e-05,9e-06,1.6e-05,1.6e-05,2.6e-05,1.3e-05,2.7e-05,3.4e-05,5e-06,8e-06,5e-06,1.6e-05,2.3e-05,1.2e-05,1.8e-05,1e-06,1.3e-05,6e-06,2e-06,2.2e-05,3.1e-05,2.2e-05,2.8e-05,4.1e-05,2.6e-05,3.1e-05,2e-05,1e-05,1.1e-05,7.4e-05,0.000129,0.000106,6.6e-05
2.2e-05,2e-06,1.1e-05,9e-06,1.3e-05,1.6e-05,9e-06,1.4e-05,6e-06,2e-06,7e-06,6e-06,3e-06,4e-06,0.000111,5.5e-05,4.1e-05,1.9e-05,1.1e-05,5e-06,5e-06,7e-06,4e-06,1.3e-05,5e-06,6e-06,3e-06,1e-05,5e-06,1e-05,6e-06,8e-06,7e-06,1.2e-05,2.8e-05,1.6e-05,8e-06,1.1e-05,8e-06,5e-06,9e-06,8e-06,6e-06,7e-06,1e-06,5e-06,1e-05,1.2e-05,1.9e-05,9e-06,1e-05,6e-06,8e-06,1e-05,0,9e-06,1.8e-05,6e-06,2.4e-05,1.7e-05,9e-06,1.8e-05,1.3e-05,1.7e-05,7e-06,9e-06,1.5e-05,2.3e-05,1.5e-05,3e-06,6e-06,1.1e-05,8e-06,1.5e-05,1.3e-05,1.2e-05,1.6e-05,1e-05,8e-06,2e-05,2.5e-05,1.7e-05,7e-06,4e-06,8e-06,9e-06,1.8e-05,5e-06,1e-06,1e-05,1.7e-05,7e-06,1e-05,9e-06,9e-06,2.4e-05,5e-06,6e-06,1.4e-05,1.9e-05,8e-06,3e-06,9e-06,1.1e-05,9e-06,5e-06,4e-06,1.1e-05,2.1e-05,2e-06,3e-06,2.5e-05,2e-05,5e-06,1.1e-05,5e-06,5e-06,9.6e-05,0.00011,4e-05,5e-06
1.6e-05,8e-06,6e-06,2e-06,7e-06,1.5e-05,2.2e-05,2e-05,1.5e-05,7e-06,1.4e-05,1.1e-05,7e-06,2.5e-05,0.000121,7.3e-05,1.2e-05,9e-06,1.5e-05,4e-06,4e-06,2e-06,6e-06,6e-06,7e-06,6e-06,8e-06,5e-06,5e-06,5e-06,6e-06,3e-06,2e-06,5e-06,1.2e-05,6e-06,4e-06,1e-05,5e-06,2e-06,6e-06,8e-06,1.1e-05,3e-06,4e-06,7e-06,1.4e-05,1e-05,1e-05,1e-06,9e-06,1e-05,9e-06,9e-06,6e-06,6e-06,6e-06,8e-06,2.8e-05,8e-06,3e-06,9e-06,8e-06,1.8e-05,1e-05,4e-06,8e-06,9e-06,4e-06,1.4e-05,3e-06,7e-06,9e-06,1.5e-05,1.4e-05,6e-06,3e-06,5e-06,1e-05,2.6e-05,1.6e-05,8e-06,9e-06,5e-06,6e-06,1.4e-05,8e-06,1.5e-05,7e-06,6e-06,1.5e-05,8e-06,8e-06,4e-06,1e-05,1.6e-05,1e-05,6e-06,1e-05,1.1e-05,9e-06,2e-06,1e-06,5e-06,8e-06,9e-06,5e-06,1.2e-05,1.1e-05,3e-06,1.1e-05,2.1e-05,5e-06,4e-06,5e-06,3e-06,6e-06,0.000109,6.3e-05,5e-06,1.4e-05
1.3e-05,1e-05,1e-05,1.3e-05,4e-06,6e-06,8e-06,1.5e-05,3.1e-05,9e-06,9e-06,1.8e-05,1.2e-05,3.3e-05,9.4e-05,5.4e-05,2.7e-05,3.1e-05,1.4e-05,8e-06,6e-06,8e-06,1e-05,6e-06,1.1e-05,7e-06,1e-05,7e-06,4e-06,5e-06,1e-06,7e-06,1e-06,4e-06,8e-06,1e-05,7e-06,6e-06,1.2e-05,1.4e-05,1.3e-05,6e-06,4e-06,5e-06,2e-06,8e-06,8e-06,1.3e-05,7e-06,8e-06,7e-06,8e-06,4e-06,4e-06,8e-06,6e-06,1.1e-05,1.4e-05,1.5e-05,4e-06,4e-06,8e-06,2e-06,1.8e-05,7e-06,4e-06,6e-06,2e-06,7e-06,1.3e-05,7e-06,1e-05,1.2e-05,1.5e-05,1.7e-05,1.6e-05,8e-06,3e-06,3e-06,2.1e-05,2.1e-05,1.2e-05,9e-06,3e-06,5e-06,1.4e-05,1.3e-05,1e-05,2e-06,4e-06,1.5e-05,7e-06,8e-06,1e-06,8e-06,1.3e-05,1.1e-05,1.3e-05,3e-06,1.2e-05,9e-06,4e-06,5e-06,3e-06,9e-06,1.4e-05,5e-06,5e-06,2.1e-05,6e-06,1.2e-05,1.6e-05,8e-06,8e-06,1e-05,8e-06,4e-06,0.000131,9.8e-05,4.7e-05,1.1e-05
3.7e-05,2.1e-05,5e-06,1.8e-05,2e-05,3e-06,3e-06,2.7e-05,2.4e-05,2.8e-05,1.7e-05,1.3e-05,9e-06,6.1e-05,0.00011,0.000131,6.9e-05,3e-05,2e-05,8e-06,1e-05,1.4e-05,1e-05,2e-06,2e-06,5e-06,1e-05,3e-06,6e-06,6e-06,3e-06,1.2e-05,1.4e-05,7e-06,6e-06,6e-06,2e-06,1.6e-05,1.8e-05,1.9e-05,5e-06,9e-06,1e-05,1e-05,5e-06,5e-06,6e-06,1.3e-05,2e-06,5e-06,1.1e-05,1.4e-05,1e-05,5e-06,1.5e-05,2.1e-05,3.2e-05,2.6e-05,8e-06,1.3e-05,1e-05,2e-05,1.1e-05,8e-06,1.2e-05,1.3e-05,1.6e-05,1.5e-05,9e-06,8e-06,1.5e-05,2.2e-05,2e-05,1.2e-05,8e-06,7e-06,1e-05,2e-06,8e-06,2.8e-05,1.7e-05,1e-05,1.7e-05,1.5e-05,8e-06,9e-06,1.5e-05,2.6e-05,6e-06,2e-06,1.6e-05,7e-06,1.1e-05,1e-06,8e-06,6e-06,8e-06,1.5e-05,5e-06,9e-06,3e-06,3e-06,4e-06,4e-06,9e-06,2e-05,9e-06,8e-06,2e-05,1.6e-05,1e-05,9e-06,3e-06,7e-06,9e-06,7e-06,1.3e-05,0.000135,9e-05,6.1e-05,1e-05
1.5e-05,1.2e-05,1e-05,1.3e-05,1.4e-05,3.3e-05,1e-05,4.2e-05,5e-06,8e-06,1.2e-05,1.8e-05,1.2e-05,9.5e-05,3.8e-05,0.000142,7.8e-05,3.8e-05,7e-06,5e-06,1e-05,6e-06,8e-06,1e-05,1e-06,6e-06,1e-06,2e-06,5e-06,2e-06,2e-06,9e-06,7e-06,6e-06,1.1e-05,9e-06,9e-06,1.2e-05,2e-05,1.6e-05,1.2e-05,2e-05,2e-05,1.3e-05,1.5e-05,8e-06,1.9e-05,1.6e-05,6e-06,1.3e-05,5e-06,9e-06,3e-06,4e-06,1e-05,9e-06,2.8e-05,1.1e-05,1.3e-05,1.2e-05,5e-06,1e-05,3e-06,1.2e-05,1.7e-05,9e-06,1.2e-05,5e-06,6e-06,1.1e-05,1.5e-05,9e-06,1.1e-05,1e-05,9e-06,2e-06,3e-06,7e-06,1.2e-05,2.5e-05,1.6e-05,1.5e-05,9e-06,5e-06,6e-06,6e-06,2e-05,1.9e-05,1.4e-05,9e-06,1.8e-05,1.4e-05,1.1e-05,1.5e-05,6e-06,8e-06,1e-05,1.4e-05,1.2e-05,8e-06,2e-06,3e-06,5e-06,3e-06,5e-06,1.1e-05,1.6e-05,1.3e-05,6e-06,7e-06,7e-06,1e-05,4e-06,4e-06,1.3e-05,9e-06,9e-06,0.000151,0.000217,7.8e-05,2.4e-05
1.1e-05,3e-06,8e-06,2e-05,4e-06,2.9e-05,2.7e-05,3.2e-05,8.1e-05,2.6e-05,5e-06,2.9e-05,1.1e-05,0.000133,5.5e-05,0.000122,4e-05,1.4e-05,2.3e-05,1.2e-05,9e-06,5e-06,1.5e-05,6e-06,1.3e-05,8e-06,8e-06,5e-06,3e-06,2e-06,4e-06,7e-06,7e-06,9e-06,6e-06,2e-05,8e-06,1e-05,5e-06,3e-06,6e-06,1e-05,1.9e-05,1.5e-05,1.5e-05,1.1e-05,1.7e-05,1.7e-05,1.7e-05,1.2e-05,1.7e-05,1.5e-05,3e-06,7e-06,4e-06,1.1e-05,2.1e-05,4e-06,2.2e-05,1.4e-05,4e-06,0,1.7e-05,2.2e-05,1.4e-05,1.1e-05,1e-06,5e-06,5e-06,1.4e-05,1.4e-05,9e-06,4e-06,1.8e-05,1.3e-05,5e-06,4e-06,8e-06,1.3e-05,1.6e-05,1e-05,1.7e-05,4e-06,9e-06,7e-06,1.1e-05,8e-06,1.4e-05,1.9e-05,5e-06,6e-06,2.4e-05,7e-06,1.8e-05,1.9e-05,9e-06,2e-06,1.1e-05,1.7e-05,2.3e-05,7e-06,8e-06,1e-05,1e-05,1.1e-05,1.7e-05,2.7e-05,3.2e-05,2.1e-05,1.5e-05,1.8e-05,2.1e-05,2e-05,1e-05,1.6e-05,2.2e-05,1.7e-05,0.000154,0.000263,0.000154,5.9e-05
3.5e-05,1.3e-05,1e-05,4.4e-05,4.3e-05,2.2e-05,2.2e-05,3.6e-05,0.000118,0.000123,6.3e-05,4.6e-05,3.5e-05,0.000105,0.000116,0.000253,0.000132,6.7e-05,1.7e-05,1.3e-05,1.4e-05,5e-06,5e-06,1.1e-05,1.7e-05,7e-06,1.3e-05,1e-05,4e-06,1e-06,4e-06,3e-06,5e-06,6e-06,6e-06,2.3e-05,2.6e-05,1.3e-05,4e-06,1.3e-05,1.2e-05,1.7e-05,3.1e-05,1.3e-05,1.4e-05,1.6e-05,8e-06,4.2e-05,3e-05,4e-05,1.9e-05,2.1e-05,2.5e-05,1.7e-05,1.1e-05,1.2e-05,2.2e-05,1.6e-05,3.1e-05,1.2e-05,1.5e-05,2.2e-05,2.5e-05,3.4e-05,1e-05,1.2e-05,1.3e-05,1.5e-05,8e-06,2e-05,3.1e-05,2.8e-05,3.1e-05,1e-05,6e-06,1.1e-05,5e-06,6e-06,1.9e-05,1.3e-05,1.9e-05,2.4e-05,1e-05,1.2e-05,1.4e-05,8e-06,1.6e-05,1.1e-05,1e-05,2.6e-05,2.1e-05,2.8e-05,2.7e-05,2.3e-05,2.1e-05,8e-06,1e-05,5e-06,3e-06,2.1e-05,1e-05,1e-06,5e-06,8e-06,1.1e-05,1e-05,7e-06,9e-06,7e-06,7e-06,1.5e-05,4e-06,1.1e-05,9e-06,1.9e-05,2.7e-05,2.2e-05,0.000137,0.000191,0.000105,5.8e-05
2.2e-05,2.8e-05,1.5e-05,5.7e-05,5.8e-05,4.4e-05,2e-05,7.5e-05,0.000147,9.6e-05,4.9e-05,3.8e-05,8.6e-05,0.000156,0.000299,0.000472,0.000271,9.3e-05,2.2e-05,2.4e-05,6e-06,3e-06,4e-06,1.2e-05,6e-06,6e-06,6e-06,6e-06,6e-06,7e-06,6e-06,4e-06,1e-05,4e-06,8e-06,3.9e-05,4.4e-05,1.8e-05,1.3e-05,2.7e-05,1.5e-05,1.5e-05,2.4e-05,1.3e-05,1.2e-05,1.9e-05,2.8e-05,4e-05,3.5e-05,3.6e-05,3.1e-05,5e-06,1.2e-05,1.5e-05,1.7e-05,1.3e-05,1.5e-05,1.6e-05,1.3e-05,1.6e-05,1.3e-05,2.5e-05,9e-06,6e-06,2.7e-05,1.3e-05,1.2e-05,8e-06,6e-06,1.9e-05,1.9e-05,1.6e-05,1.6e-05,1.8e-05,6e-06,6e-06,8e-06,8e-06,9e-06,2e-06,1.9e-05,1.2e-05,1.1e-05,2e-06,1e-05,1.1e-05,2.1e-05,9e-06,1.3e-05,2.2e-05,1e-05,2.1e-05,1.1e-05,1.2e-05,4e-06,1.5e-05,1.8e-05,1e-05,9e-06,2.3e-05,1.6e-05,5e-06,8e-06,8e-06,1.7e-05,1.1e-05,2e-06,5e-06,7e-06,1.3e-05,2.2e-05,2.3e-05,6e-06,6e-06,8e-06,1.5e-05,9e-06,0.000118,0.000149,5.4e-05,3.2e-05
1.1e-05,1.7e-05,3.2e-05,1.3e-05,1.4e-05,1.6e-05,2.7e-05,6.2e-05,5.2e-05,5.6e-05,2.1e-05,5.8e-05,6.7e-05,1e-04,0.000232,0.000479,0.000211,5.1e-05,1.1e-05,2e-05,7e-06,3e-06,8e-06,7e-06,1e-05,8e-06,1.1e-05,2e-06,5e-06,1e-05,4e-06,2e-06,5e-06,2e-06,1.5e-05,3.6e-05,9e-06,7e-06,1.6e-05,1e-05,5e-06,1e-06,1.7e-05,8e-06,7e-06,2.5e-05,3.3e-05,5.1e-05,2.8e-05,1.8e-05,3.4e-05,2.6e-05,9e-06,2.6e-05,3.1e-05,3e-05,7e-06,1.5e-05,1.6e-05,2.2e-05,1.6e-05,3.7e-05,1.5e-05,1.8e-05,2.7e-05,9e-06,4e-06,5e-06,6e-06,1.9e-05,2.1e-05,1.6e-05,2.3e-05,8e-06,2.3e-05,1.3e-05,1.2e-05,1.4e-05,2e-05,7e-06,4e-06,4e-06,6e-06,4e-06,8e-06,9e-06,1.3e-05,1.6e-05,2e-05,4e-05,3.8e-05,3.9e-05,4.2e-05,3.8e-05,3.6e-05,3.9e-05,3.4e-05,1.9e-05,2.1e-05,3.5e-05,2.1e-05,1.5e-05,1.2e-05,8e-06,2e-05,2.5e-05,2.2e-05,6e-06,2.3e-05,3.3e-05,3.2e-05,4.9e-05,3.2e-05,1.4e-05,1.6e-05,3.4e-05,1.5e-05,0.000118,8e-05,3.6e-05,3.4e-05
3.2e-05,1.3e-05,2.1e-05,1.9e-05,2e-06,2.3e-05,3.6e-05,6.5e-05,3.1e-05,0.000107,9.6e-05,2e-05,4.9e-05,2e-04,6.9e-05,0.000248,0.000134,3.1e-05,1.1e-05,8e-06,9e-06,4e-06,5e-06,5e-06,7e-06,1.3e-05,1e-05,5e-06,3e-06,2e-06,3e-06,1e-06,3e-06,4e-06,1.9e-05,2.7e-05,1.3e-05,1.3e-05,3e-06,1.2e-05,9e-06,1e-05,3e-06,9e-06,9e-06,6e-06,2.1e-05,3.9e-05,5e-05,1.9e-05,1.8e-05,1e-05,8e-06,3.4e-05,1.5e-05,2.1e-05,2.7e-05,2.6e-05,1.1e-05,3.5e-05,3e-05,2e-05,1.1e-05,1.8e-05,2.1e-05,2.5e-05,1.7e-05,1.3e-05,1.7e-05,1.8e-05,1.5e-05,1.4e-05,2e-05,3.9e-05,3.3e-05,2.2e-05,7e-06,8e-06,1.3e-05,1.7e-05,6e-06,8e-06,1e-05,1.3e-05,1.4e-05,9e-06,1.2e-05,9e-06,9e-06,1.9e-05,1.8e-05,2e-05,2.9e-05,3.8e-05,1.9e-05,1.6e-05,7e-06,8e-06,1.8e-05,1.3e-05,1e-06,1e-05,8e-06,1.5e-05,1.1e-05,9e-06,9e-06,1.6e-05,3.1e-05,3.7e-05,1.6e-05,6.1e-05,5.5e-05,2.8e-05,2.3e-05,5.4e-05,3.3e-05,0.000106,7.7e-05,5.2e-05,5.1e-05
3.7e-05,8e-06,2e-06,1.5e-05,8e-06,2.5e-05,2.3e-05,4.5e-05,5.3e-05,7.2e-05,2.6e-05,1.7e-05,6.4e-05,0.000182,0.00023,0.000177,6.5e-05,4e-06,1e-05,3e-06,9e-06,9e-06,6e-06,7e-06,4e-06,6e-06,2e-06,5e-06,3e-06,2e-06,3e-06,4e-06,6e-06,8e-06,1.1e-05,2.9e-05,1.4e-05,1.6e-05,5e-06,9e-06,1.7e-05,1.1e-05,2e-06,7e-06,4e-06,9e-06,2.3e-05,2.5e-05,2.1e-05,1e-05,5e-06,1.2e-05,1e-06,2.4e-05,2.1e-05,1.1e-05,4e-06,3e-06,2.4e-05,1.9e-05,1.6e-05,2e-06,2.3e-05,1.1e-05,7e-06,9e-06,8e-06,8e-06,1.1e-05,1.4e-05,7e-06,6e-06,0,2.1e-05,8e-06,2e-06,8e-06,7e-06,8e-06,8e-06,4e-06,1e-06,1.1e-05,7e-06,6e-06,1e-05,6e-06,7e-06,3e-06,9e-06,4e-06,3e-06,2e-05,1.1e-05,2e-05,1.1e-05,6e-06,1.1e-05,7e-06,7e-06,5e-06,1e-05,1.4e-05,1e-05,9e-06,8e-06,1e-05,1.2e-05,1.5e-05,1e-05,1.4e-05,3.4e-05,2.1e-05,1.1e-05,2.3e-05,1.4e-05,1.2e-05,9.3e-05,0.000127,7.1e-05,4.8e-05
1.5e-05,1.4e-05,8e-06,7e-06,2e-06,1.4e-05,2.1e-05,3e-06,5e-06,2.5e-05,1.6e-05,1e-05,2.1e-05,5.7e-05,3e-05,4.6e-05,2.5e-05,3e-06,6e-06,4e-06,4e-06,1e-06,2e-06,2e-06,1e-06,2e-06,3e-06,1e-06,1e-06,3e-06,4e-06,1e-06,2e-06,1e-06,2e-06,7e-06,7e-06,3e-06,1e-06,4e-06,6e-06,7e-06,7e-06,6e-06,7e-06,0,6e-06,9e-06,6e-06,1e-06,6e-06,9e-06,8e-06,9e-06,7e-06,1.3e-05,1.3e-05,1.3e-05,1.8e-05,1.5e-05,5e-06,1.1e-05,1.5e-05,1.6e-05,1.2e-05,1.4e-05,1.2e-05,1.1e-05,6e-06,1.5e-05,1e-05,6e-06,4e-06,9e-06,9e-06,1.2e-05,1.2e-05,9e-06,6e-06,1.1e-05,4e-06,7e-06,2e-06,7e-06,7e-06,1e-05,1e-05,8e-06,4e-06,3e-06,1e-06,3e-06,5e-06,2e-06,9e-06,8e-06,3e-06,7e-06,6e-06,6e-06,6e-06,1e-05,1.9e-05,1.7e-05,1.5e-05,1.1e-05,1.2e-05,1.1e-05,1.1e-05,9e-06,5e-06,1.2e-05,5e-06,9e-06,2e-06,6e-06,4e-06,4.8e-05,4.2e-05,1.5e-05,1.2e-05
1.8e-05,1.3e-05,6e-06,3e-06,2e-06,1.2e-05,5e-06,1.8e-05,8e-06,6e-06,6e-06,1.8e-05,3e-06,2.9e-05,4.3e-05,1.9e-05,1e-05,2e-06,1.3e-05,7e-06,4e-06,2e-06,5e-06,3e-06,1e-06,4e-06,2e-06,2e-06,2e-06,2e-06,2e-06,2e-06,3e-06,3e-06,2e-06,3e-06,3e-06,7e-06,6e-06,6e-06,3e-06,1e-06,3e-06,2e-06,3e-06,2e-06,4e-06,6e-06,6e-06,4e-06,2e-06,3e-06,4e-06,4e-06,1.3e-05,1.6e-05,2e-05,1.8e-05,3e-06,4e-06,1e-05,1.4e-05,1.9e-05,2.3e-05,1.7e-05,1.5e-05,9e-06,7e-06,1.1e-05,1.4e-05,1.2e-05,9e-06,6e-06,1.3e-05,7e-06,1.3e-05,1.3e-05,9e-06,9e-06,4e-06,8e-06,7e-06,6e-06,7e-06,7e-06,9e-06,1.3e-05,3e-06,6e-06,1e-06,3e-06,5e-06,1e-05,5e-06,5e-06,1e-06,2e-06,4e-06,2e-06,1e-06,2e-06,6e-06,1.1e-05,4e-06,5e-06,8e-06,9e-06,4e-06,3e-06,6e-06,7e-06,1.1e-05,6e-06,1.1e-05,1.1e-05,8e-06,7e-06,4.5e-05,1.6e-05,1.1e-05,2e-06
1.1e-05,3e-06,5e-06,4e-06,1e-06,6e-06,7e-06,1.2e-05,1e-05,1.1e-05,4e-06,1.6e-05,1.1e-05,1e-05,4e-05,2.8e-05,8e-06,4e-06,1.1e-05,4e-06,1e-06,1e-06,2e-06,0,1e-06,3e-06,1e-06,1e-06,3e-06,2e-06,1e-06,1e-06,2e-06,1e-06,1e-06,2e-06,2e-06,4e-06,6e-06,1e-06,2e-06,2e-06,2e-06,3e-06,3e-06,1e-06,3e-06,2e-06,3e-06,2e-06,1e-06,3e-06,3e-06,3e-06,5e-06,6e-06,1.1e-05,7e-06,3e-06,1e-06,6e-06,3e-06,9e-06,4e-06,4e-06,3e-06,7e-06,3e-06,6e-06,4e-06,1e-06,3e-06,3e-06,5e-06,2e-06,7e-06,2e-06,2e-06,3e-06,3e-06,5e-06,2e-06,1e-06,3e-06,2e-06,4e-06,5e-06,2e-06,2e-06,1e-06,2e-06,4e-06,7e-06,4e-06,2e-06,1e-06,2e-06,3e-06,0,2e-06,2e-06,4e-06,5e-06,3e-06,1e-06,4e-06,4e-06,1e-06,2e-06,4e-06,0,1e-05,5e-06,9e-06,3e-06,6e-06,5e-06,3.3e-05,1.1e-05,8e-06,3e-06
7e-06,4e-06,5e-06,3e-06,1e-06,7e-06,6e-06,9e-06,1.2e-05,8e-06,2e-06,9e-06,7e-06,1.3e-05,4.7e-05,1.5e-05,6e-06,5e-06,5e-06,4e-06,4e-06,1e-06,3e-06,3e-06,2e-06,4e-06,1e-06,1e-06,2e-06,2e-06,0,1e-06,1e-06,3e-06,2e-06,2e-06,3e-06,4e-06,0,1e-06,2e-06,3e-06,1e-06,2e-06,1e-06,3e-06,5e-06,3e-06,2e-06,5e-06,2e-06,4e-06,3e-06,5e-06,5e-06,8e-06,1.4e-05,1.6e-05,1.4e-05,1e-05,5e-06,4e-06,2e-06,7e-06,6e-06,8e-06,7e-06,1e-06,4e-06,4e-06,3e-06,2e-06,3e-06,4e-06,1e-06,3e-06,5e-06,2e-06,5e-06,2e-06,8e-06,2e-06,4e-06,2e-06,2e-06,3e-06,7e-06,3e-06,3e-06,1e-06,0,5e-06,5e-06,3e-06,3e-06,1e-06,4e-06,4e-06,4e-06,3e-06,5e-06,6e-06,2e-06,0,1e-06,3e-06,1e-06,2e-06,2e-06,5e-06,3e-06,7e-06,6e-06,4e-06,1e-06,2e-06,0,2.9e-05,4e-06,6e-06,6e-06
7e-06,6e-06,3e-06,2e-06,2e-06,8e-06,4e-06,2e-06,1e-05,9e-06,8e-06,7e-06,5e-06,2e-06,3.7e-05,1.9e-05,9e-06,1e-05,9e-06,7e-06,1e-06,4e-06,3e-06,2e-06,2e-06,3e-06,1e-06,2e-06,5e-06,1e-06,2e-06,1e-06,1e-06,2e-06,1e-06,3e-06,1e-06,2e-06,1e-06,3e-06,1e-06,3e-06,3e-06,0,1e-06,3e-06,4e-06,4e-06,2e-06,7e-06,5e-06,5e-06,2e-06,4e-06,6e-06,6e-06,3e-06,8e-06,9e-06,4e-06,6e-06,7e-06,8e-06,6e-06,6e-06,7e-06,4e-06,2e-06,0,2e-06,1e-06,2e-06,2e-06,4e-06,1e-06,4e-06,5e-06,3e-06,2e-06,3e-06,5e-06,3e-06,3e-06,0,2e-06,5e-06,5e-06,6e-06,1e-06,2e-06,3e-06,2e-06,3e-06,2e-06,4e-06,2e-06,2e-06,2e-06,3e-06,5e-06,2e-06,4e-06,2e-06,2e-06,3e-06,5e-06,2e-06,3e-06,3e-06,2e-06,3e-06,6e-06,5e-06,2e-06,3e-06,4e-06,3e-06,2.3e-05,1.2e-05,8e-06,9e-06
5e-06,5e-06,6e-06,5e-06,6e-06,1.2e-05,5e-06,8e-06,3e-06,2e-06,5e-06,7e-06,5e-06,1.4e-05,4.7e-05,1.8e-05,1.4e-05,1.4e-05,1e-05,4e-06,5e-06,3e-06,3e-06,3e-06,2e-06,4e-06,1e-06,3e-06,3e-06,2e-06,3e-06,2e-06,1e-06,3e-06,2e-06,3e-06,3e-06,3e-06,2e-06,3e-06,2e-06,2e-06,3e-06,2e-06,2e-06,4e-06,4e-06,4e-06,4e-06,2e-06,5e-06,0,3e-06,2e-06,6e-06,5e-06,4e-06,4e-06,4e-06,3e-06,5e-06,4e-06,4e-06,4e-06,4e-06,4e-06,5e-06,1e-06,2e-06,2e-06,1e-06,1e-06,2e-06,5e-06,0,2e-06,3e-06,1e-06,3e-06,6e-06,6e-06,2e-06,0,0,2e-06,3e-06,4e-06,4e-06,1e-06,3e-06,2e-06,1e-06,3e-06,1e-06,1e-06,2e-06,3e-06,0,1e-06,3e-06,1e-06,3e-06,2e-06,2e-06,2e-06,2e-06,2e-06,2e-06,1e-06,1e-06,2e-06,3e-06,1e-06,4e-06,2e-06,1e-06,3e-06,1.7e-05,8e-06,5e-06,1e-05
6e-06,3e-06,3e-06,1e-06,2e-06,5e-06,1e-06,6e-06,8e-06,7e-06,9e-06,8e-06,2e-06,1.2e-05,3.2e-05,7e-06,6e-06,7e-06,4e-06,6e-06,1e-06,1e-06,4e-06,2e-06,3e-06,2e-06,2e-06,3e-06,0,1e-06,1e-06,1e-06,1e-06,1e-06,0,1e-06,3e-06,1e-06,1e-06,2e-06,2e-06,1e-06,2e-06,1e-06,2e-06,2e-06,4e-06,2e-06,3e-06,3e-06,2e-06,2e-06,4e-06,5e-06,7e-06,7e-06,5e-06,7e-06,2e-06,3e-06,5e-06,2e-06,4e-06,2e-06,3e-06,2e-06,3e-06,3e-06,3e-06,2e-06,1e-06,2e-06,3e-06,4e-06,1e-06,2e-06,1e-06,3e-06,3e-06,5e-06,5e-06,1e-06,4e-06,3e-06,4e-06,3e-06,2e-06,4e-06,3e-06,4e-06,5e-06,3e-06,6e-06,2e-06,3e-06,3e-06,3e-06,2e-06,2e-06,1e-06,3e-06,5e-06,1e-06,3e-06,2e-06,1e-06,1e-06,2e-06,1e-06,3e-06,3e-06,4e-06,1e-06,3e-06,3e-06,0,2e-06,1.8e-05,3e-06,5e-06,6e-06
2e-06,3e-06,1e-06,0,1e-06,3e-06,2e-06,1e-06,1e-05,3e-06,5e-06,3e-06,8e-06,1.1e-05,2.3e-05,9e-06,1.2e-05,9e-06,5e-06,7e-06,5e-06,0,2e-06,2e-06,4e-06,3e-06,2e-06,0,1e-06,0,1e-06,1e-06,0,1e-06,1e-06,1e-06,2e-06,2e-06,2e-06,3e-06,1e-06,1e-06,1e-06,1e-06,3e-06,2e-06,4e-06,3e-06,4e-06,4e-06,1e-06,0,2e-06,2e-06,1e-06,3e-06,2e-06,2e-06,4e-06,2e-06,1e-06,2e-06,5e-06,2e-06,3e-06,3e-06,2e-06,3e-06,2e-06,1e-06,1e-06,1e-06,2e-06,4e-06,1e-06,4e-06,2e-06,3e-06,4e-06,4e-06,6e-06,3e-06,3e-06,1e-06,3e-06,2e-06,5e-06,2e-06,4e-06,2e-06,2e-06,3e-06,2e-06,1e-06,3e-06,1e-06,2e-06,2e-06,2e-06,3e-06,2e-06,2e-06,4e-06,1e-06,3e-06,2e-06,2e-06,1e-06,1e-06,3e-06,2e-06,5e-06,3e-06,4e-06,1e-06,2e-06,0,1.4e-05,1e-06,3e-06,5e-06
8e-06,7e-06,5e-06,4e-06,5e-06,7e-06,6e-06,1e-05,8e-06,6e-06,3e-06,4e-06,2e-06,4e-06,2e-05,1.8e-05,1.2e-05,6e-06,7e-06,1e-06,1e-06,3e-06,4e-06,3e-06,1e-06,1e-06,1e-06,2e-06,2e-06,1e-06,0,1e-06,1e-06,3e-06,0,1e-06,1e-06,2e-06,2e-06,2e-06,0,0,1e-06,0,2e-06,2e-06,3e-06,1e-06,3e-06,1e-06,1e-06,1e-06,1e-06,4e-06,1e-06,2e-06,2e-06,3e-06,4e-06,0,1e-06,2e-06,3e-06,4e-06,0,1e-06,3e-06,2e-06,1e-06,2e-06,1e-06,1e-06,2e-06,4e-06,0,2e-06,3e-06,1e-06,4e-06,6e-06,5e-06,1e-06,1e-06,1e-06,1e-06,2e-06,3e-06,2e-06,2e-06,1e-06,3e-06,2e-06,3e-06,1e-06,4e-06,2e-06,1e-06,2e-06,2e-06,2e-06,3e-06,2e-06,2e-06,2e-06,4e-06,1e-06,1e-06,1e-06,1e-06,2e-06,3e-06,6e-06,3e-06,1e-06,2e-06,2e-06,2e-06,1.1e-05,6e-06,8e-06,4e-06
8e-06,4e-06,2e-06,3e-06,4e-06,2e-06,4e-06,8e-06,1.4e-05,6e-06,3e-06,5e-06,3e-06,1e-05,1.9e-05,1.2e-05,6e-06,9e-06,5e-06,6e-06,2e-06,2e-06,3e-06,0,1e-06,2e-06,0,2e-06,2e-06,1e-06,1e-06,1e-06,2e-06,0,1e-06,3e-06,1e-06,3e-06,7e-06,6e-06,5e-06,3e-06,2e-06,1e-06,0,2e-06,2e-06,2e-06,1e-06,1e-06,2e-06,2e-06,1e-06,4e-06,2e-06,1e-06,1e-06,2e-06,2e-06,2e-06,1e-06,2e-06,4e-06,4e-06,3e-06,1e-06,3e-06,0,2e-06,1e-06,1e-06,3e-06,2e-06,2e-06,3e-06,3e-06,1e-06,3e-06,2e-06,5e-06,6e-06,1e-06,2e-06,2e-06,2e-06,2e-06,4e-06,1e-06,2e-06,1e-06,2e-06,1e-06,3e-06,2e-06,3e-06,2e-06,1e-06,1e-06,1e-06,2e-06,2e-06,0,2e-06,1e-06,3e-06,2e-06,3e-06,2e-06,1e-06,2e-06,1e-06,5e-06,2e-06,2e-06,3e-06,1e-06,3e-06,5e-06,7e-06,3e-06,2e-06
4e-06,4e-06,3e-06,2e-06,2e-06,3e-06,4e-06,9e-06,0,1.3e-05,5e-06,7e-06,9e-06,1.3e-05,1.6e-05,1.7e-05,1.5e-05,5e-06,1e-05,3e-06,4e-06,2e-06,0,0,1e-06,2e-06,1e-06,2e-06,1e-06,1e-06,0,1e-06,1e-06,1e-06,2e-06,2e-06,3e-06,4e-06,8e-06,3e-06,2e-06,1e-06,2e-06,2e-06,2e-06,2e-06,2e-06,0,2e-06,0,2e-06,2e-06,3e-06,2e-06,2e-06,1e-06,1e-06,1e-06,4e-06,3e-06,1e-06,3e-06,4e-06,1e-06,2e-06,1e-06,3e-06,2e-06,3e-06,2e-06,1e-06,1e-06,2e-06,3e-06,2e-06,2e-06,1e-06,4e-06,4e-06,2e-06,3e-06,1e-06,1e-06,2e-06,1e-06,1e-06,4e-06,2e-06,1e-06,1e-06,4e-06,2e-06,3e-06,1e-06,3e-06,2e-06,2e-06,1e-06,0,1e-06,2e-06,2e-06,0,1e-06,0,3e-06,4e-06,3e-06,1e-06,1e-06,2e-06,4e-06,2e-06,5e-06,2e-06,5e-06,2e-06,5e-06,1.3e-05,1.1e-05,1e-06
1e-05,9e-06,6e-06,1e-06,1e-06,3e-06,3e-06,6e-06,1.1e-05,1.8e-05,1.4e-05,1.3e-05,1.2e-05,1.7e-05,1.8e-05,3.3e-05,1.4e-05,6e-06,7e-06,7e-06,5e-06,2e-06,0,0,2e-06,1e-06,1e-06,3e-06,2e-06,1e-06,0,0,1e-06,2e-06,1e-06,1e-06,5e-06,2e-06,6e-06,5e-06,3e-06,5e-06,4e-06,4e-06,3e-06,2e-06,3e-06,1e-06,2e-06,2e-06,2e-06,1e-06,2e-06,2e-06,2e-06,1e-06,2e-06,2e-06,6e-06,3e-06,1e-06,1e-06,4e-06,2e-06,1e-06,2e-06,3e-06,2e-06,1e-06,1e-06,2e-06,2e-06,1e-06,4e-06,2e-06,3e-06,2e-06,3e-06,2e-06,5e-06,4e-06,3e-06,2e-06,1e-06,2e-06,1e-06,5e-06,3e-06,0,1e-06,2e-06,3e-06,3e-06,1e-06,3e-06,1e-06,2e-06,1e-06,2e-06,2e-06,0,1e-06,1e-06,2e-06,0,3e-06,1e-06,2e-06,2e-06,0,3e-06,3e-06,3e-06,3e-06,1e-06,4e-06,1e-06,5e-06,1.2e-05,1e-06,6e-06
1e-05,3e-06,1e-06,5e-06,5e-06,2e-06,6e-06,5e-06,1.2e-05,1.6e-05,6e-06,4e-06,2e-06,1.9e-05,1.1e-05,1.7e-05,1.3e-05,5e-06,1e-06,1e-06,4e-06,3e-06,2e-06,1e-06,2e-06,4e-06,2e-06,3e-06,1e-06,1e-06,1e-06,1e-06,1e-06,2e-06,2e-06,2e-06,4e-06,1e-06,2e-06,6e-06,8e-06,7e-06,5e-06,5e-06,1e-06,2e-06,2e-06,2e-06,1e-06,2e-06,1e-06,1e-06,0,0,3e-06,2e-06,3e-06,3e-06,4e-06,3e-06,2e-06,1e-06,2e-06,2e-06,1e-06,3e-06,3e-06,1e-06,0,1e-06,1e-06,2e-06,2e-06,2e-06,2e-06,3e-06,1e-06,1e-06,2e-06,5e-06,4e-06,3e-06,2e-06,2e-06,3e-06,3e-06,6e-06,3e-06,2e-06,2e-06,2e-06,4e-06,2e-06,1e-06,2e-06,3e-06,1e-06,0,1e-06,3e-06,1e-06,2e-06,2e-06,2e-06,2e-06,3e-06,3e-06,2e-06,2e-06,2e-06,1e-06,5e-06,1e-06,2e-06,0,4e-06,3e-06,5e-06,7e-06,1e-05,6e-06
6e-06,1e-06,1e-06,5e-06,2e-06,3e-06,6e-06,5e-06,3e-06,2e-06,4e-06,4e-06,0,1.6e-05,4e-06,1.4e-05,6e-06,1e-06,1e-06,2e-06,5e-06,4e-06,1e-06,1e-06,1e-06,3e-06,1e-06,1e-06,2e-06,0,1e-06,1e-06,1e-06,1e-06,2e-06,4e-06,4e-06,1e-06,6e-06,6e-06,1e-06,1e-06,2e-06,1e-06,2e-06,2e-06,2e-06,2e-06,3e-06,2e-06,1e-06,1e-06,1e-06,2e-06,4e-06,2e-06,2e-06,2e-06,5e-06,2e-06,1e-06,2e-06,4e-06,1e-06,3e-06,2e-06,2e-06,2e-06,2e-06,2e-06,1e-06,1e-06,2e-06,3e-06,1e-06,1e-06,2e-06,1e-06,3e-06,3e-06,3e-06,3e-06,3e-06,2e-06,2e-06,0,3e-06,2e-06,1e-06,2e-06,2e-06,1e-06,1e-06,1e-06,1e-06,3e-06,2e-06,1e-06,0,2e-06,1e-06,2e-06,2e-06,2e-06,1e-06,2e-06,1e-06,1e-06,1e-06,1e-06,2e-06,5e-06,2e-06,0,1e-06,4e-06,1e-06,4e-06,6e-06,1e-06,3e-06
1e-05,5e-06,3e-06,3e-06,4e-06,1e-06,1e-06,3e-06,5e-06,9e-06,6e-06,5e-06,5e-06,1.2e-05,7e-06,5e-06,4e-06,1e-06,2e-06,4e-06,5e-06,4e-06,3e-06,1e-06,1e-06,1e-06,2e-06,2e-06,2e-06,1e-06,0,1e-06,1e-06,1e-06,1e-06,5e-06,1e-06,2e-06,6e-06,2e-06,2e-06,3e-06,1e-06,1e-06,1e-06,1e-06,0,2e-06,2e-06,4e-06,2e-06,0,1e-06,1e-06,1e-06,2e-06,1e-06,2e-06,5e-06,0,3e-06,0,4e-06,1e-06,2e-06,2e-06,3e-06,3e-06,1e-06,2e-06,1e-06,1e-06,2e-06,4e-06,1e-06,2e-06,1e-06,2e-06,2e-06,3e-06,5e-06,3e-06,2e-06,1e-06,2e-06,0,4e-06,1e-06,3e-06,2e-06,1e-06,1e-06,3e-06,3e-06,3e-06,1e-06,1e-06,1e-06,1e-06,2e-06,1e-06,2e-06,2e-06,1e-06,1e-06,0,1e-06,1e-06,1e-06,0,2e-06,4e-06,3e-06,2e-06,2e-06,3e-06,1e-06,3e-06,5e-06,2e-06,0
1.4e-05,9e-06,6e-06,2e-06,3e-06,4e-06,5e-06,6e-06,9e-06,1.7e-05,1e-05,5e-06,5e-06,1.1e-05,1.5e-05,1.8e-05,1.4e-05,8e-06,1e-06,2e-06,3e-06,2e-06,1e-06,2e-06,2e-06,3e-06,2e-06,1e-06,1e-06,1e-06,1e-06,0,1e-06,1e-06,1e-06,4e-06,7e-06,5e-06,7e-06,5e-06,1e-06,2e-06,1e-06,1e-06,1e-06,2e-06,2e-06,1e-06,1e-06,1e-06,1e-06,1e-06,1e-06,0,1e-06,3e-06,3e-06,1e-06,3e-06,2e-06,1e-06,2e-06,4e-06,2e-06,2e-06,2e-06,4e-06,3e-06,4e-06,2e-06,1e-06,1e-06,2e-06,4e-06,1e-06,2e-06,1e-06,2e-06,3e-06,4e-06,5e-06,3e-06,2e-06,1e-06,1e-06,2e-06,3e-06,1e-06,2e-06,3e-06,3e-06,2e-06,3e-06,2e-06,3e-06,2e-06,2e-06,1e-06,0,2e-06,2e-06,0,1e-06,1e-06,1e-06,1e-06,1e-06,2e-06,2e-06,1e-06,1e-06,5e-06,2e-06,2e-06,2e-06,2e-06,1e-06,4e-06,2e-06,3e-06,4e-06
9e-06,5e-06,2e-06,2e-06,4e-06,2e-06,4e-06,4e-06,8e-06,1.2e-05,1.1e-05,1.2e-05,1e-05,2e-06,1.1e-05,1.7e-05,8e-06,6e-06,4e-06,2e-06,1e-06,1e-06,0,1e-06,1e-06,3e-06,1e-06,0,0,0,1e-06,1e-06,0,1e-06,2e-06,2e-06,4e-06,3e-06,1e-06,0,0,1e-06,1e-06,0,1e-06,1e-06,2e-06,1e-06,1e-06,1e-06,1e-06,1e-06,1e-06,1e-06,0,2e-06,1e-06,0,3e-06,1e-06,1e-06,1e-06,3e-06,1e-06,2e-06,2e-06,2e-06,2e-06,1e-06,1e-06,1e-06,0,0,2e-06,0,2e-06,0,1e-06,2e-06,3e-06,5e-06,2e-06,1e-06,1e-06,0,2e-06,4e-06,2e-06,1e-06,1e-06,1e-06,2e-06,4e-06,2e-06,3e-06,3e-06,2e-06,1e-06,0,1e-06,1e-06,1e-06,1e-06,0,2e-06,1e-06,1e-06,1e-06,1e-06,1e-06,1e-06,5e-06,0,2e-06,2e-06,1e-06,0,4e-06,2e-06,7e-06,2e-06
4e-06,3e-06,1e-06,1e-06,1e-06,2e-06,3e-06,2e-06,6e-06,4e-06,3e-06,4e-06,2e-06,1e-06,5e-06,1.1e-05,5e-06,3e-06,1e-06,1e-06,0,1e-06,1e-06,0,1e-06,1e-06,1e-06,1e-06,1e-06,0,1e-06,0,0,1e-06,2e-06,1e-06,1e-06,1e-06,0,1e-06,2e-06,1e-06,1e-06,0,1e-06,1e-06,2e-06,1e-06,1e-06,0,1e-06,1e-06,1e-06,1e-06,1e-06,2e-06,0,2e-06,4e-06,2e-06,1e-06,1e-06,3e-06,1e-06,2e-06,2e-06,2e-06,0,2e-06,1e-06,0,1e-06,0,3e-06,1e-06,2e-06,0,1e-06,2e-06,3e-06,3e-06,3e-06,1e-06,1e-06,0,1e-06,4e-06,2e-06,1e-06,0,1e-06,2e-06,3e-06,1e-06,2e-06,2e-06,1e-06,1e-06,0,2e-06,0,1e-06,0,1e-06,2e-06,0,1e-06,2e-06,0,0,1e-06,4e-06,1e-06,2e-06,2e-06,2e-06,1e-06,3e-06,4e-06,5e-06,3e-06
1e-06,2e-06,0,1e-06,0,1e-06,1e-06,0,4e-06,3e-06,2e-06,3e-06,1e-06,1e-06,3e-06,7e-06,3e-06,1e-06,2e-06,1e-06,1e-06,1e-06,0,1e-06,0,2e-06,1e-06,0,1e-06,0,0,0,0,1e-06,2e-06,1e-06,1e-06,0,0,1e-06,2e-06,1e-06,1e-06,0,1e-06,1e-06,1e-06,1e-06,1e-06,1e-06,1e-06,1e-06,1e-06,1e-06,1e-06,1e-06,1e-06,2e-06,4e-06,1e-06,0,1e-06,4e-06,2e-06,2e-06,2e-06,2e-06,0,1e-06,1e-06,0,1e-06,1e-06,3e-06,1e-06,2e-06,0,1e-06,2e-06,4e-06,4e-06,2e-06,1e-06,1e-06,0,1e-06,4e-06,1e-06,1e-06,0,2e-06,1e-06,2e-06,2e-06,2e-06,2e-06,1e-06,1e-06,0,1e-06,1e-06,1e-06,1e-06,2e-06,1e-06,0,1e-06,1e-06,0,1e-06,1e-06,4e-06,1e-06,2e-06,1e-06,1e-06,2e-06,4e-06,3e-06,3e-06,3e-06
1e-06,1e-06,0,1e-06,0,0,1e-06,1e-06,3e-06,1e-06,1e-06,2e-06,0,3e-06,2e-06,8e-06,1e-06,1e-06,1e-06,1e-06,1e-06,0,0,0,1e-06,1e-06,1e-06,0,1e-06,0,0,0,0,1e-06,2e-06,1e-06,1e-06,0,0,1e-06,1e-06,0,0,0,1e-06,1e-06,2e-06,1e-06,1e-06,1e-06,0,1e-06,1e-06,1e-06,1e-06,1e-06,0,2e-06,3e-06,1e-06,0,1e-06,3e-06,1e-06,2e-06,2e-06,2e-06,0,1e-06,1e-06,1e-06,1e-06,1e-06,3e-06,1e-06,2e-06,0,1e-06,2e-06,4e-06,4e-06,2e-06,1e-06,1e-06,0,1e-06,4e-06,2e-06,1e-06,0,1e-06,1e-06,3e-06,1e-06,2e-06,2e-06,1e-06,1e-06,1e-06,1e-06,0,1e-06,0,1e-06,1e-06,0,0,1e-06,1e-06,1e-06,1e-06,4e-06,1e-06,2e-06,1e-06,2e-06,1e-06,3e-06,3e-06,2e-06,3e-06
