0.019338,0.020752,0.119684,0.355327,0.412752,0.547074,0.965736,1.136424,1.131971,1.127934,1.032019,0.96529,0.97119,0.885513,0.65841,0.466068,0.374037,0.354607,0.27291,0.1225,0.066075,0.09993,0.108833,0.061872,0.033419,0.024967,0.020865,0.0174
0.027095,0.028158,0.143392,0.413679,0.479846,0.623226,1.075519,1.299993,1.337567,1.324079,1.205649,1.122479,1.125793,1.027811,0.772504,0.555883,0.439679,0.408527,0.313174,0.143245,0.081832,0.120855,0.129413,0.074483,0.04288,0.032624,0.026595,0.022629
0.043654,0.043616,0.180099,0.488938,0.566049,0.717824,1.207944,1.575148,1.72893,1.661784,1.477954,1.361696,1.346438,1.221197,0.939221,0.705243,0.541352,0.479125,0.36505,0.172441,0.108196,0.154234,0.161057,0.095358,0.060371,0.046831,0.037197,0.032648
0.063751,0.061609,0.200482,0.49817,0.576291,0.747958,1.297538,1.882007,2.173966,1.99462,1.710203,1.551546,1.465802,1.29177,1.028658,0.817622,0.604027,0.491739,0.370389,0.181649,0.125801,0.173746,0.180366,0.112527,0.076608,0.059459,0.046473,0.042509
0.079548,0.0758,0.201765,0.448705,0.518928,0.752222,1.438489,2.202605,2.52858,2.261199,1.939233,1.742769,1.526411,1.276741,1.046115,0.863292,0.617248,0.458484,0.337197,0.172385,0.128517,0.172628,0.18482,0.124779,0.087022,0.066405,0.051266,0.04829
0.080023,0.077362,0.205982,0.42738,0.478962,0.783364,1.625822,2.435207,2.673394,2.398395,2.117872,1.923593,1.602616,1.237199,0.99235,0.821489,0.583779,0.401595,0.278058,0.148887,0.118089,0.161584,0.183471,0.130028,0.087409,0.066454,0.051121,0.046556
0.061001,0.062652,0.25094,0.54801,0.541536,0.884079,1.941201,2.851972,3.083706,2.810186,2.533709,2.348149,1.953576,1.40325,1.03468,0.828645,0.593529,0.4,0.257423,0.135501,0.112963,0.17702,0.209636,0.138949,0.084936,0.070159,0.055773,0.042878
0.038234,0.046212,0.351486,0.797172,0.685469,1.135453,2.736576,4.089118,4.620727,4.271201,3.743676,3.611083,3.174051,2.246636,1.555993,1.228809,0.876397,0.562603,0.328646,0.163626,0.145539,0.253151,0.294869,0.178412,0.100777,0.091992,0.078102,0.053802
0.041475,0.056032,0.504215,1.126642,0.91785,1.706977,4.447834,6.650287,7.498482,6.989864,6.218592,6.183189,5.535437,3.923542,2.664788,2.068503,1.447782,0.895617,0.497649,0.239553,0.217338,0.373863,0.414104,0.239034,0.136505,0.127768,0.112473,0.079268
0.063587,0.085109,0.678184,1.50373,1.236434,2.7354,7.287457,10.34913,11.179668,10.68747,9.917035,9.924104,8.808056,6.184136,4.135718,3.146413,2.138169,1.311429,0.733765,0.344177,0.308436,0.511255,0.532199,0.291456,0.171999,0.161592,0.146187,0.106855
0.092059,0.117123,0.794422,1.773366,1.527875,4.035485,10.58124,13.858199,14.092398,14.177853,14.001355,13.86134,11.968114,8.265459,5.465258,4.092503,2.677875,1.665564,0.980659,0.452013,0.393089,0.631228,0.621615,0.318993,0.191147,0.177418,0.164118,0.124737
0.113192,0.137125,0.813621,1.821589,1.656263,5.00245,12.705692,15.223262,14.414327,15.557982,16.469637,15.94097,13.193866,8.940623,5.91637,4.375092,2.763116,1.781017,1.117469,0.515423,0.445866,0.701074,0.657994,0.31385,0.18633,0.166684,0.154888,0.123531
0.110651,0.130382,0.783599,1.726482,1.582283,4.883552,11.978636,13.345379,11.769581,13.626488,15.337305,14.396284,11.299166,7.557452,5.117744,3.754414,2.358533,1.603707,1.047874,0.491815,0.444556,0.715441,0.64823,0.280547,0.160074,0.137589,0.124858,0.102274
0.081916,0.097406,0.701888,1.550003,1.387113,3.623718,8.444936,9.131124,7.875854,9.550055,10.992569,9.714557,7.159333,4.963619,3.578036,2.566682,1.648484,1.201242,0.805309,0.383951,0.373704,0.640514,0.576974,0.231511,0.119098,0.099797,0.090889,0.072724
0.047949,0.062915,0.567701,1.242985,1.111354,2.165374,4.658092,5.399986,4.976495,5.740396,6.359053,5.132049,3.622163,2.796088,2.101236,1.476253,1.031202,0.862741,0.613016,0.295167,0.29621,0.513865,0.464068,0.191825,0.093669,0.078556,0.073081,0.051727
0.029018,0.043277,0.468024,1.070583,0.977634,1.487403,2.96412,3.739833,3.727933,3.811693,3.727588,2.884818,2.080603,1.572874,1.127459,0.837964,0.701089,0.76842,0.628895,0.309525,0.275799,0.438096,0.407526,0.190448,0.097225,0.085616,0.076574,0.044714
0.02614,0.041374,0.50075,1.291889,1.160976,1.357695,2.726159,3.638195,3.497022,3.040888,2.863508,2.389166,1.744986,1.264489,0.915186,0.724718,0.651092,0.845996,0.788002,0.401269,0.302691,0.458287,0.44935,0.222091,0.110558,0.099524,0.091775,0.053949
0.028993,0.047315,0.699875,1.888283,1.636237,1.606425,3.256065,4.529433,4.118938,3.213086,3.189954,2.712077,1.9199,1.417275,1.06567,0.942669,0.883354,1.145452,1.079981,0.528856,0.348383,0.537938,0.560867,0.283763,0.131344,0.118823,0.119498,0.075736
0.035336,0.059626,1.029264,2.7694,2.354809,2.083945,4.049727,5.922808,5.559497,4.215385,4.170737,3.531371,2.446719,1.711891,1.319535,1.277299,1.208802,1.595299,1.472833,0.65534,0.412462,0.681154,0.733949,0.369279,0.161742,0.144684,0.152047,0.102688
0.044036,0.078014,1.458802,3.907422,3.289941,2.742183,5.083355,7.886177,7.723644,5.606823,5.366375,4.582027,3.161001,2.073964,1.654277,1.655682,1.529898,2.138148,1.923065,0.749294,0.484527,0.84438,0.909429,0.462597,0.197029,0.164931,0.17539,0.126047
0.055463,0.097365,1.824805,4.883103,4.099177,3.431362,6.29957,9.915787,9.746239,6.870471,6.406002,5.443693,3.668373,2.26188,1.917448,1.951289,1.745427,2.620918,2.341591,0.806129,0.538507,0.937435,0.972412,0.504001,0.216479,0.175557,0.184394,0.136603
0.06672,0.110962,1.914456,5.083092,4.31135,3.987451,7.469842,11.072734,10.574773,7.673237,7.046821,5.94398,3.823821,2.113647,2.012179,2.115932,1.817307,2.82833,2.54619,0.816894,0.550195,0.907086,0.876867,0.454607,0.206126,0.168974,0.167036,0.124249
0.069777,0.11259,1.646531,4.260632,3.759826,4.276791,8.179008,10.970517,9.821492,7.504912,7.168805,6.067043,3.605272,1.849294,2.089966,2.120236,1.670675,2.601553,2.341995,0.717271,0.509087,0.795144,0.694553,0.345364,0.171726,0.14144,0.132913,0.09904
0.064271,0.104261,1.228537,3.022236,2.900085,4.26678,7.914662,9.357391,7.682861,6.270795,6.41978,5.651448,3.376418,1.753565,2.056148,1.879535,1.36975,2.111822,1.835233,0.535039,0.438864,0.678318,0.564468,0.260402,0.119877,0.097217,0.094764,0.075366
0.057267,0.094513,1.003759,2.28315,2.284507,3.976243,6.651237,6.608156,5.486594,5.338743,5.143437,4.506625,3.130541,1.765375,1.826333,1.486938,1.060658,1.678997,1.39438,0.404624,0.384231,0.563739,0.460933,0.209579,0.079286,0.063728,0.064057,0.058232
0.049243,0.076184,0.918276,1.992464,1.92591,3.529551,5.11256,4.291122,4.489824,5.191424,4.346318,3.512081,2.707383,1.646622,1.56587,1.270783,0.919749,1.416349,1.203609,0.391054,0.359069,0.488902,0.377183,0.170688,0.059273,0.047954,0.046371,0.044085
0.045249,0.061717,0.811425,1.764181,1.7095,3.076503,4.045913,3.153806,3.834963,4.644058,3.930187,3.219048,2.369308,1.340042,1.157634,1.031185,0.87747,1.227156,1.05184,0.395958,0.351119,0.483664,0.358972,0.141578,0.048359,0.041313,0.03703,0.031497
0.042474,0.05446,0.645749,1.37137,1.449127,2.868803,3.795022,2.876315,2.968285,3.509468,3.34044,2.872913,2.065925,1.1055,0.821888,0.810784,0.843048,1.072463,0.873523,0.367924,0.336904,0.49833,0.384943,0.141539,0.044586,0.0374,0.034012,0.028321
0.044376,0.055231,0.545922,1.122685,1.187294,2.716072,4.090226,3.345831,2.495761,2.420065,2.468564,2.279444,1.897776,1.100624,0.775098,0.830115,0.859401,0.902675,0.727266,0.350215,0.304891,0.496247,0.413253,0.156165,0.046488,0.035344,0.03541,0.033064
0.048023,0.059788,0.503448,1.029823,1.010861,2.347171,4.001522,3.713139,2.507701,1.888231,1.776981,1.904738,1.818456,1.056274,0.739122,0.865437,0.835295,0.7034,0.610421,0.340876,0.274164,0.474529,0.417734,0.170753,0.055945,0.044079,0.046721,0.043904
0.06147,0.071005,0.425144,0.891966,0.905596,1.906929,3.327792,3.371377,2.50759,1.80864,1.583355,1.726493,1.572679,0.914641,0.619626,0.767593,0.74975,0.606725,0.557699,0.325398,0.263576,0.448223,0.411376,0.188327,0.073151,0.060796,0.065681,0.060507
0.073794,0.076745,0.310062,0.690144,0.809216,1.630373,2.621002,2.604397,2.238642,1.755408,1.454863,1.429787,1.23153,0.764902,0.509576,0.601374,0.620095,0.620677,0.558707,0.299719,0.250476,0.390923,0.354196,0.18315,0.087542,0.073231,0.079723,0.073255
0.075011,0.069505,0.216501,0.512477,0.674024,1.403538,2.175458,2.183804,2.013439,1.661025,1.333533,1.15628,1.03608,0.695789,0.447283,0.422406,0.437722,0.62174,0.577936,0.270729,0.214492,0.295734,0.250992,0.145404,0.086528,0.07149,0.078882,0.074495
0.064119,0.053419,0.19704,0.482801,0.561413,1.005871,1.654682,1.818142,1.620298,1.319318,1.157398,0.933377,0.799774,0.663789,0.461567,0.335042,0.352943,0.583537,0.536182,0.241654,0.18476,0.233181,0.171401,0.097536,0.071263,0.059885,0.065662,0.067973
0.050138,0.039523,0.201148,0.490699,0.479346,0.596389,1.027385,1.311037,1.225834,1.071503,1.027969,0.703076,0.552762,0.624654,0.488965,0.321012,0.368712,0.513504,0.426261,0.204262,0.166512,0.191762,0.126779,0.066936,0.053928,0.048,0.048516,0.053725
0.034733,0.031092,0.191841,0.440871,0.40435,0.421607,0.852983,1.226957,1.233709,1.121896,0.906945,0.600994,0.553913,0.660067,0.497223,0.328668,0.356815,0.415093,0.359267,0.188004,0.142128,0.148785,0.102233,0.051696,0.035566,0.034244,0.032539,0.038355
0.022693,0.0244,0.15786,0.337005,0.323335,0.511979,1.064978,1.288877,1.263586,1.14021,0.686678,0.512852,0.619589,0.647091,0.428561,0.290002,0.298423,0.308275,0.31991,0.1986,0.123727,0.1453,0.106804,0.043263,0.028044,0.033334,0.031805,0.030234
0.018026,0.021029,0.11501,0.241313,0.283289,0.659801,1.21069,1.221701,1.254867,1.120402,0.476616,0.389242,0.594609,0.537772,0.336428,0.234488,0.249266,0.277764,0.315005,0.210498,0.100663,0.142309,0.115232,0.042334,0.033295,0.040303,0.034773,0.025098
0.014539,0.021427,0.082981,0.184161,0.283194,0.796923,1.183841,1.059511,1.337507,1.159788,0.417862,0.298129,0.517164,0.410605,0.294676,0.247934,0.222829,0.303706,0.370759,0.222142,0.080478,0.122083,0.115551,0.044521,0.037168,0.042589,0.032918,0.023298
0.012479,0.023431,0.068956,0.164403,0.309129,0.894388,1.050431,0.832806,1.314659,1.123659,0.41609,0.337946,0.552095,0.394208,0.280206,0.276522,0.232947,0.346939,0.408086,0.231915,0.076513,0.104329,0.105656,0.048888,0.035913,0.037972,0.028198,0.022369
