0.022426,0.021811,0.022823,0.023872,0.022618,0.022995,0.023563,0.022883,0.021598,0.019865,0.019203,0.01979,0.021123,0.022244,0.022724,0.02441,0.02525,0.024214,0.023512,0.021852,0.020645,0.020188,0.020497,0.022085,0.023272,0.023127,0.02112,0.020918
0.027989,0.027013,0.028571,0.029445,0.027864,0.027993,0.028678,0.028434,0.026873,0.025147,0.024747,0.025395,0.026854,0.027721,0.027871,0.029948,0.031652,0.030872,0.029962,0.027641,0.025668,0.025306,0.026217,0.028385,0.02923,0.028435,0.026068,0.025894
0.038963,0.037465,0.039865,0.040245,0.038061,0.037376,0.038814,0.039995,0.037855,0.036401,0.036441,0.037289,0.03924,0.039608,0.03894,0.040856,0.044268,0.044816,0.043789,0.039973,0.03592,0.035761,0.037706,0.04066,0.040774,0.038618,0.036111,0.036283
0.052915,0.051756,0.055683,0.05575,0.05191,0.049292,0.05315,0.056982,0.053415,0.052833,0.054029,0.055266,0.057553,0.05777,0.056285,0.055591,0.06,0.062954,0.062368,0.056863,0.049323,0.049491,0.052872,0.056227,0.055207,0.051715,0.050388,0.051208
0.072703,0.072407,0.080516,0.080966,0.072523,0.066842,0.073758,0.080263,0.07524,0.076873,0.080594,0.081905,0.084509,0.085666,0.082819,0.077476,0.081365,0.086816,0.088276,0.080693,0.069803,0.071081,0.075116,0.077866,0.075023,0.071005,0.071325,0.073492
0.101315,0.10084,0.11527,0.116786,0.101921,0.092807,0.101403,0.108751,0.103241,0.108598,0.115013,0.115538,0.120882,0.123824,0.118059,0.108075,0.108412,0.113148,0.118047,0.10951,0.097633,0.102388,0.107257,0.106977,0.100861,0.100025,0.101496,0.101084
0.141383,0.135387,0.153728,0.158634,0.142648,0.131118,0.136351,0.141039,0.134048,0.143904,0.155707,0.156872,0.167927,0.172513,0.160366,0.143835,0.138008,0.139793,0.148587,0.141484,0.133721,0.146532,0.152422,0.145234,0.132487,0.136969,0.141694,0.134488
0.190657,0.172258,0.191281,0.204515,0.197099,0.182876,0.176988,0.176071,0.167797,0.182902,0.202646,0.209851,0.228129,0.232534,0.212029,0.188155,0.17583,0.171496,0.181904,0.178902,0.179034,0.202681,0.2074,0.188351,0.170512,0.180549,0.189378,0.178401
0.24007,0.202702,0.224302,0.252889,0.266536,0.251111,0.229851,0.221519,0.204799,0.221857,0.253304,0.271656,0.295132,0.298067,0.269841,0.24079,0.221891,0.205759,0.219203,0.222746,0.22579,0.255323,0.254313,0.229296,0.219125,0.231978,0.239804,0.228882
0.277054,0.218519,0.250735,0.30432,0.342145,0.323449,0.284758,0.265142,0.230818,0.245056,0.290815,0.327816,0.351695,0.348441,0.318691,0.29547,0.272237,0.234718,0.248084,0.260757,0.262799,0.290988,0.284174,0.271021,0.28287,0.286626,0.285748,0.280743
0.288587,0.22006,0.258001,0.332391,0.386783,0.363551,0.314643,0.286874,0.239711,0.2527,0.30676,0.355808,0.367587,0.351082,0.331608,0.326274,0.306781,0.257896,0.270378,0.283284,0.274788,0.292729,0.290615,0.304117,0.335211,0.324943,0.317753,0.322731
0.268197,0.213368,0.240932,0.309598,0.363159,0.337966,0.299827,0.284109,0.245529,0.250234,0.288433,0.335924,0.328135,0.301031,0.30103,0.308559,0.297479,0.265592,0.282342,0.285788,0.265889,0.271197,0.273342,0.304589,0.346825,0.332686,0.316434,0.323563
0.226997,0.192497,0.197247,0.237345,0.275857,0.261375,0.258011,0.268071,0.247732,0.238624,0.24815,0.285969,0.265293,0.241099,0.261147,0.262271,0.251666,0.258154,0.289325,0.284599,0.262122,0.257776,0.254291,0.275125,0.311902,0.305673,0.280169,0.280635
0.184594,0.165878,0.155118,0.168433,0.189648,0.187798,0.211269,0.236243,0.227258,0.209932,0.19884,0.228799,0.216596,0.20646,0.23779,0.227637,0.207483,0.228691,0.267637,0.277145,0.266813,0.254072,0.236853,0.232916,0.265478,0.26994,0.238558,0.232516
0.153007,0.144672,0.138109,0.138299,0.153142,0.16315,0.182847,0.197889,0.187649,0.176733,0.173032,0.189185,0.181459,0.183707,0.220624,0.220228,0.192966,0.192886,0.223894,0.252004,0.25194,0.22764,0.204934,0.201949,0.231574,0.241711,0.21756,0.201947
0.174246,0.166302,0.162103,0.158141,0.180431,0.211753,0.209735,0.188225,0.169528,0.178202,0.203038,0.207415,0.193052,0.185193,0.220917,0.25544,0.228914,0.208219,0.237244,0.25251,0.228462,0.192183,0.176642,0.210027,0.269882,0.290529,0.253137,0.216936
0.256365,0.242188,0.234297,0.232859,0.277832,0.327603,0.301264,0.253771,0.223145,0.237144,0.295884,0.312582,0.287208,0.25091,0.286367,0.352192,0.320897,0.293025,0.327055,0.314238,0.262699,0.217698,0.199972,0.270201,0.380358,0.426873,0.373919,0.313133
0.355405,0.334693,0.331086,0.337468,0.414306,0.476006,0.428136,0.365258,0.313995,0.315674,0.403175,0.455941,0.429138,0.357904,0.385094,0.472983,0.438366,0.405472,0.433141,0.40299,0.343967,0.289401,0.258965,0.345688,0.500208,0.584097,0.526015,0.432392
0.459977,0.434128,0.428118,0.437747,0.549439,0.611463,0.538166,0.471397,0.405664,0.383243,0.476003,0.580656,0.577371,0.474691,0.46866,0.542407,0.509606,0.485895,0.506105,0.479477,0.430297,0.365287,0.316764,0.393521,0.57856,0.703523,0.648533,0.514988
0.58613,0.547001,0.507192,0.517218,0.650923,0.679938,0.573154,0.517601,0.459938,0.422636,0.484264,0.628022,0.67899,0.563861,0.501187,0.518087,0.488197,0.494027,0.539137,0.539808,0.50184,0.438401,0.371082,0.405029,0.595118,0.757145,0.716608,0.55042
0.672616,0.616423,0.530938,0.55183,0.676598,0.634641,0.50683,0.478903,0.459207,0.419274,0.417224,0.561325,0.681184,0.600037,0.497347,0.451862,0.412964,0.439484,0.526085,0.555407,0.541619,0.50818,0.418927,0.404445,0.574879,0.751382,0.726273,0.53185
0.633991,0.568263,0.463118,0.513431,0.61,0.513195,0.410221,0.405854,0.405432,0.371928,0.329336,0.430217,0.57346,0.541835,0.436934,0.394605,0.370234,0.376875,0.453045,0.482771,0.502028,0.520699,0.438474,0.407483,0.524647,0.655691,0.650787,0.461753
0.47753,0.424662,0.35474,0.429499,0.499081,0.414756,0.354059,0.348211,0.342493,0.32313,0.278948,0.318111,0.419882,0.414256,0.352884,0.385149,0.383174,0.35478,0.397969,0.393604,0.414668,0.458403,0.417035,0.406654,0.463546,0.52344,0.509255,0.378758
0.329974,0.318911,0.282375,0.326145,0.370822,0.342756,0.321827,0.303471,0.273476,0.256325,0.23185,0.250681,0.296997,0.317066,0.330859,0.402979,0.400425,0.358061,0.358463,0.320995,0.3555,0.397398,0.382754,0.406645,0.428503,0.406227,0.349814,0.305028
0.284385,0.273733,0.242517,0.254554,0.280446,0.278827,0.287968,0.276447,0.217188,0.193434,0.198653,0.227751,0.241234,0.269236,0.318144,0.376668,0.374356,0.34658,0.309293,0.268445,0.327393,0.363785,0.341675,0.377693,0.417798,0.375576,0.292804,0.276978
0.294011,0.264915,0.255072,0.242847,0.224554,0.243286,0.275828,0.255498,0.176739,0.147038,0.174463,0.215011,0.216696,0.229334,0.259165,0.283151,0.290883,0.282682,0.244446,0.231491,0.285321,0.31984,0.31123,0.338954,0.393147,0.3837,0.309394,0.280621
0.296044,0.249637,0.266212,0.253253,0.196678,0.228346,0.259896,0.23933,0.171868,0.142975,0.176067,0.203875,0.195598,0.189205,0.187957,0.194309,0.210512,0.209807,0.194691,0.19951,0.220639,0.266087,0.289565,0.30645,0.356225,0.359261,0.310297,0.285074
0.256785,0.204012,0.255158,0.267615,0.185909,0.199113,0.223659,0.225332,0.195692,0.177328,0.191266,0.189221,0.171966,0.159249,0.159075,0.179457,0.200921,0.185396,0.168326,0.177679,0.181278,0.213514,0.249366,0.275292,0.30304,0.294547,0.287711,0.27409
0.199296,0.143057,0.222553,0.268398,0.202847,0.179655,0.174614,0.194434,0.20852,0.202517,0.194538,0.18019,0.159849,0.153927,0.171534,0.182556,0.198276,0.174882,0.148309,0.163505,0.164222,0.175711,0.224741,0.259365,0.258559,0.246124,0.262661,0.254679
0.161624,0.110916,0.175404,0.232945,0.211658,0.178572,0.151034,0.18025,0.209462,0.1899,0.17814,0.179528,0.164405,0.168074,0.187947,0.189708,0.212576,0.198648,0.164863,0.17071,0.165804,0.165215,0.21947,0.237983,0.214745,0.214976,0.22742,0.226281
0.144749,0.121562,0.153828,0.186652,0.201721,0.192598,0.1746,0.209432,0.201574,0.142308,0.145071,0.185926,0.194813,0.217535,0.214078,0.19756,0.251166,0.24275,0.203152,0.207279,0.200338,0.195908,0.220256,0.192624,0.168159,0.201813,0.210147,0.20648
0.145632,0.132991,0.178649,0.197928,0.18944,0.199642,0.227844,0.268864,0.211471,0.133354,0.157838,0.221585,0.231447,0.268017,0.242038,0.206786,0.313949,0.288675,0.222964,0.246696,0.239736,0.22164,0.205247,0.157615,0.162893,0.213381,0.230171,0.22918
0.138867,0.119252,0.188753,0.221599,0.191612,0.218414,0.290422,0.321131,0.244055,0.173645,0.194225,0.249206,0.23712,0.282709,0.258676,0.210922,0.35306,0.302704,0.223101,0.267456,0.248156,0.220315,0.191681,0.161259,0.18563,0.222658,0.254153,0.263876
0.11362,0.091504,0.164755,0.208726,0.184714,0.238426,0.319,0.31717,0.244827,0.205253,0.205789,0.242358,0.224571,0.268285,0.2632,0.211146,0.339392,0.285286,0.223487,0.267518,0.22759,0.210433,0.192266,0.178992,0.186517,0.211784,0.270491,0.284495
0.102665,0.09264,0.134912,0.163783,0.153705,0.218593,0.282095,0.252969,0.223086,0.218383,0.185032,0.206135,0.219307,0.248903,0.239591,0.191503,0.271991,0.251498,0.222252,0.254796,0.204222,0.181868,0.171209,0.168178,0.151053,0.165989,0.240616,0.268504
0.111796,0.108255,0.11349,0.120572,0.12138,0.161396,0.207548,0.181,0.199525,0.211998,0.162,0.170297,0.195088,0.203318,0.181748,0.14491,0.176148,0.200712,0.201741,0.214665,0.178722,0.150952,0.139993,0.131357,0.104536,0.112648,0.168698,0.200589
0.126282,0.124027,0.11413,0.098988,0.089153,0.109728,0.153102,0.162534,0.189803,0.185128,0.148513,0.157686,0.167492,0.147332,0.118112,0.092646,0.099265,0.142066,0.154643,0.158465,0.15708,0.135471,0.136547,0.108567,0.083377,0.10424,0.112557,0.122322
0.120315,0.123539,0.11834,0.085053,0.069486,0.097597,0.128471,0.158794,0.181922,0.172764,0.154659,0.153968,0.143913,0.120718,0.103809,0.083536,0.072095,0.091891,0.09869,0.109363,0.125905,0.106556,0.128386,0.100515,0.091649,0.139699,0.132911,0.1127
0.099533,0.105833,0.109342,0.076318,0.074352,0.120123,0.130032,0.150091,0.160676,0.174201,0.160919,0.130056,0.105458,0.099968,0.123757,0.112072,0.071276,0.06204,0.065358,0.088968,0.095278,0.073392,0.109294,0.100943,0.115377,0.181125,0.170621,0.129919
0.104787,0.100926,0.095815,0.083651,0.091466,0.141569,0.154732,0.156296,0.154268,0.196162,0.164528,0.09799,0.069431,0.087747,0.136916,0.144457,0.095965,0.066478,0.058978,0.078909,0.071537,0.056403,0.092443,0.094645,0.13298,0.199977,0.186166,0.140931
