0.002089,0.001749,-0.000954,-0.001792,-0.000439,0.000401,0.000458,0.002547,0.001717,-0.001805,-0.002413,-0.002487,-0.006364,-0.003919,-0.002916,-0.003793,-0.006616,-0.004581,-0.0047,-2.4e-05,-0.003307,-0.00361,-0.001926,-0.003958,0.000291,0.000339,0.000658,-0.000676,-0.000555,0.002193,-0.000206,-0.000904,0.000195,-0.000401,0.000696,-0.00026,0.002511,0.003812,0.000923,0.000366,0.00098,0.000215,-0.000662,-0.00094,0.00164,0.001156,-0.000256,0.001719,0.002061,0.00117,-0.000648,0.001438,0.001442,0.000789,0.002103,0.002465,-0.002282,0.003119,-0.00035,-0.001989,-0.001018,-0.000558,0.001275,-0.001023,1.8e-05,0.002879,7.2e-05,0.001697,-0.000582,0.000327,0.000842,0.001224,0.000866,-0.000385,-0.001169,0.00066,0.001049,0.00281,-0.000179,-0.00028,-0.000716,-0.002046,0.002174,0.001976,-0.003271,-0.001616,-0.004433,-0.001056,-0.001549,-0.005536,-0.004668,-0.002871,-0.001064,0.001582,0.000508,0.001353,-0.001584,-0.004555,-0.001455,-0.002212,-0.003223,-0.004649,-0.006352,-0.005373,-0.008789,-0.00354,-0.007349,-0.006074,-0.007552,-0.00638,-0.004611,-0.008429,-0.000188,-0.008263,-0.008384,-0.003365,-0.004805,-0.002439,-0.003778,-0.003099,-0.003417
-0.001826,-0.001705,0.000208,-0.000265,-0.001519,-0.00238,-0.001885,0.000275,-0.005768,-0.000271,-0.004397,-0.004653,-0.00148,-0.000913,-0.004382,-0.004159,-0.000705,-0.003573,-0.004931,-0.00073,-0.004113,-0.004478,-0.003066,-0.001463,-0.002107,-0.002667,-0.002532,-0.001348,-0.00442,-0.001532,-0.003916,-0.004964,-0.001084,-0.001314,-0.001424,-0.000136,-0.00322,-0.003242,-0.003456,-0.004616,-0.003961,-0.001892,5.7e-05,-0.000235,-0.003275,-0.004156,-0.001544,-0.005209,-0.0055,-0.002484,-0.00254,-0.003716,-0.002602,-0.006349,-0.005377,-0.005519,-0.008915,-0.00541,-0.007678,-0.007931,-0.005835,-0.008416,-0.005433,-0.003228,-0.004562,-0.001479,-0.00349,-0.003682,-0.002421,-0.002261,-0.000648,-0.003013,-0.00323,-0.000965,-0.003035,-0.002545,-0.003659,-0.002223,-0.005154,-0.007716,-0.00713,-0.009073,-0.010434,-0.007566,-0.010057,-0.008685,-0.006525,-0.007649,-0.007411,-0.005529,-0.005748,-0.003224,-5.9e-05,-0.002832,-0.003522,-0.004938,-0.004333,-0.000623,-0.003426,-0.002931,-0.000904,-3.8e-05,-0.001607,0.000913,0.00076,-0.000212,0.000518,-0.005349,0.001352,-0.000502,0.002522,0.001206,-0.001514,0.000959,-0.005631,-0.001502,-0.004326,-0.005568,-0.004436,-0.005566,-0.00583
-0.000711,-0.000128,-0.000206,0.000163,0.001641,-0.000476,0.002123,0.00129,0.000661,0.001564,0.006025,0.00275,-9.1e-05,0.005133,0.00442,-0.000286,0.002651,0.005232,0.003687,0.002622,0.004389,0.005048,0.003727,0.001596,0.001713,0.002224,-0.000149,-0.0021,0.001361,-0.000253,-0.000959,0.001493,-0.000284,3.8e-05,-0.000871,-0.001182,-0.002232,0.000583,-0.000691,-0.000181,0.000538,-0.000396,-0.00093,-0.000119,-0.002692,-0.001478,-0.001418,-0.002247,-0.000849,0.000616,-0.000707,-0.000421,-0.000955,0.000358,0.002317,0.004783,0.004184,0.001573,0.003822,0.002028,0.002844,0.003703,0.000995,0.001274,0.000962,0.001397,0.002045,-0.000669,0.000831,0.000484,0.001723,0.001545,-7.4e-05,-0.000663,0.00162,0.003405,0.003478,-0.000141,0.003871,0.005616,0.004539,0.006444,0.003211,0.009812,0.009581,0.003818,0.00917,0.004532,0.005696,0.005461,0.001064,0.003661,0.001678,0.002389,0.001553,-0.001056,0.003268,0.001057,0.005574,0.00104,0.000556,0.000344,0.001314,0.000426,0.000993,0.001608,0.001011,0.001124,-0.000512,0.00324,-0.000354,0.000535,-0.000254,0.000826,0.001508,0.003443,0.002397,0.003981,0.003762,-3.3e-05,0.006917
-0.003195,-0.003103,-0.002047,-0.002164,-0.001076,-0.00203,-0.003728,-0.005627,-0.004365,-0.003356,-0.004955,-0.0027,-0.001636,-0.002359,-0.001922,-0.002984,-0.004746,-0.005935,-0.004362,-0.003926,-0.005228,-0.003414,-0.003924,-0.003573,-0.004254,-0.001949,-0.000828,0.000635,0.00049,0.001713,0.000544,4.7e-05,0.001602,-0.000288,-0.000771,-0.000787,0.00072,-0.000202,-0.000613,-0.000584,0.000111,3.7e-05,-0.000746,-0.001532,-0.000864,0.002728,0.002558,0.001241,0.001153,0.000898,0.000123,0.000412,0.000226,0.001282,-0.000318,-0.003685,0.000828,-0.001033,0.000244,0.000807,-0.001598,0.000265,0.00057,0.000427,-0.000944,-0.000989,0.000114,-0.000463,0.00024,-0.00047,-0.00013,-0.000394,-0.000559,-0.001466,-0.000182,-0.000489,-0.000325,-0.00228,-0.002107,-9.2e-05,-0.004787,-0.001127,2.3e-05,-0.005292,-0.003887,-0.002182,-0.004399,0.001871,-0.005766,-0.00088,0.000806,-0.00188,-0.00022,0.000505,-0.003418,0.00047,-0.003203,0.002049,-0.003573,-0.002031,-0.002098,-0.00305,-0.000858,-0.003283,-0.003122,-0.000417,-0.00342,-0.001256,-0.002676,-0.000538,-0.000443,-0.003667,-0.00232,-0.003691,0.000363,-0.000563,-0.001368,-0.002177,-0.003406,0.003236,-0.003387
-0.000483,-0.000382,-0.000598,0.000829,0.000528,0.000842,0.000367,0.000798,0.000637,0.001693,0.000208,0.003186,0.002541,-0.000164,8.7e-05,0.003336,-0.000162,0.000155,0.002192,0.000782,-0.00039,0.001162,0.00018,0.003075,0.001453,-6.8e-05,0.001507,-0.000136,-0.001534,0.001446,-0.000687,-0.000481,0.000642,-0.000287,-0.000839,-0.000572,-0.001057,-0.000578,-0.000231,8.9e-05,0.000666,-0.00104,-4e-04,-0.000901,0.00158,-0.000922,0.001384,0.000938,9.7e-05,-7e-05,-0.000881,0.001266,0.001743,0.000834,0.000829,0.00088,-0.000699,-4e-05,-0.000654,-0.000268,-0.00052,-0.000367,-0.000574,-0.001622,-0.000245,-0.001407,-0.000749,-0.000837,-0.00133,-0.000496,-0.001076,-0.00146,-0.001296,-0.000803,-0.001243,-0.001696,-0.002253,-0.001256,-0.001135,-0.001474,-0.000505,-0.003946,-9.7e-05,-0.000991,-0.003689,-0.002347,-0.000813,-0.004259,0.000855,-0.002995,-4.2e-05,0.000233,-0.001581,-0.002256,-0.001857,-0.000846,0.000953,-0.003549,-0.000159,-0.002485,0.000821,0.000447,0.001658,0.002075,0.000564,0.000868,0.001948,0.003208,0.002018,0.001082,0.001969,0.002056,0.002049,0.000221,0.000287,-0.001367,-0.003691,0.000137,-0.000499,-0.000926,-0.000165
0.000625,3.5e-05,0.000714,0.000563,0.000216,1.8e-05,0.000914,0.000354,0.000254,-0.00228,-6.1e-05,-0.00102,-0.001643,0.000454,-0.002431,-0.000733,-8.4e-05,-0.000293,0.000354,0.000609,0.003572,-0.000507,0.00116,0.000937,0.000183,-0.001039,-0.00034,-0.000781,-8.2e-05,-0.000701,-5e-05,-0.000736,-6.5e-05,-0.000317,0.000249,0.000415,0.000469,-0.001978,-0.000548,-0.000636,-0.001294,0.00013,-0.00015,-0.000346,-0.000644,-0.001459,-0.001761,-0.001118,-0.001567,0.001522,0.000785,-0.000543,-0.000127,-0.000868,-0.000866,0.001082,0.000807,0.004412,0.000813,0.001854,0.002949,0.001315,0.002047,0.000559,0.000163,0.001846,-0.000349,0.00144,0.00102,0.000526,0.000552,0.000574,0.000666,0.001768,-0.000585,0.001346,0.001134,0.001817,0.000566,0.000517,0.003054,0.001845,0.004055,0.003698,0.002781,0.004456,0.000643,0.001065,0.001982,0.002216,0.000855,-0.000838,-0.002065,-0.000281,0.001306,-0.00071,0.001312,-0.000653,-0.000616,0.000859,-0.003567,-0.000558,-0.00321,-0.001093,-0.00167,-0.003017,0.000426,-0.003586,-0.002109,-0.005073,-0.001656,-0.001223,-0.003241,0.000462,-0.003081,0.001907,-6.7e-05,3.5e-05,0.000805,-0.001352,0.000884
0.001243,0.000411,-0.000392,0.00028,-0.000566,-0.000411,-0.000396,0.000177,0.001088,-0.001301,0.001557,-0.000778,-0.002454,-0.002352,0.000326,-0.00195,-0.001729,0.000388,-0.001888,-0.004496,-0.000976,-0.002652,-0.003837,-0.003639,-0.002247,-0.001167,-0.00117,-0.000597,-0.001299,-0.003773,-0.00095,-0.001951,-0.003524,-0.001352,-0.00103,4.3e-05,0.000168,-0.001109,-0.000828,-0.000844,-0.002174,-0.000682,-0.000955,9e-05,0.000416,-0.000719,-0.002523,0.000117,-0.000971,-0.003006,-0.00134,-0.00181,-0.000915,-0.000797,-0.002664,-0.000741,-0.002275,-0.004245,-0.001034,-0.001831,-0.003194,-0.001786,-0.002567,-0.000581,-0.000187,-0.002286,-0.000718,-0.000762,-9.4e-05,-2.2e-05,-0.000507,-0.000578,-0.000884,-0.000559,0.000472,-0.001694,-9e-04,-9.5e-05,0.000267,-0.002125,-0.003296,-0.000763,-0.002816,-0.00272,-0.00193,-0.003789,-0.00129,-0.001589,-0.001598,-0.001153,0.000562,0.000368,0.001904,-0.000255,0.002351,0.000382,0.000812,0.001087,-0.000618,0.002385,0.002481,0.000242,0.002758,0.000667,0.002603,0.002785,0.000547,0.004065,-0.000589,0.002729,0.001305,0.001751,0.002467,0.000936,0.003485,-0.002052,0.00276,-0.000461,0.001857,0.003488,0.000534
0.000128,0.001377,0.001061,-0.000125,0.000576,0.00122,0.000634,0.001524,0.001724,0.003323,0.000893,0.002394,0.003857,0.001735,0.003159,0.003969,0.003185,0.002975,0.003247,0.004915,0.002605,0.003469,0.005071,0.003093,0.002561,0.00285,0.001496,0.001402,0.002719,0.00261,0.002508,0.003915,0.00234,0.001638,0.000949,-7.6e-05,0.000445,0.001923,0.001498,0.002416,0.002409,0.000695,0.001302,0.000145,0.001471,0.000987,0.001507,0.000737,0.001545,0.000115,0.001177,0.000452,0.000269,9.7e-05,0.002201,0.000397,0.000196,0.000199,-0.000844,-0.00036,-0.000166,-0.00032,-0.000617,-0.000161,-0.001053,-0.000749,-0.000571,-0.000876,-0.000448,-0.000718,-0.001357,3.7e-05,-0.000497,-0.000459,-0.000865,4.4e-05,-0.000642,-0.000832,0.000623,-0.000505,0.000127,0.001105,-0.000109,-0.001503,0.001109,0.000665,-0.000836,-0.001748,-0.002041,-0.002052,-0.00318,-0.002134,-0.001935,-0.00088,-0.001183,-0.001118,-0.002939,-0.001998,-0.001157,-0.002721,-0.001095,-0.00128,-0.000808,0.000108,-0.002281,-0.003542,-0.001897,-0.003096,-0.000292,-0.002197,-0.001896,-0.002499,-0.00201,-0.001258,-0.003517,-0.002703,-0.002983,-0.002787,-0.002685,-0.002987,-0.00315
-0.000122,0.000346,0.000377,-0.000258,-0.000812,-0.000761,-0.000593,-0.000301,-0.001102,0.000257,-0.001003,-0.001729,-0.001714,-0.001242,-0.00127,-0.001863,-0.000821,-0.001747,-0.001477,-0.001263,-0.002064,-0.001086,-0.001151,-0.001111,6.4e-05,-0.000229,0.000165,0.000435,-0.000496,-0.00096,-0.000419,-0.000562,-0.000607,-0.000606,0.000495,0.000585,0.000212,0.000709,-0.000104,0.000478,0.000653,0.000335,0.000462,0.001384,-0.000408,0.000645,0.000386,0.000799,0.001747,0.000569,0.00126,0.001431,0.000375,0.001309,0.001066,6.5e-05,0.001759,0.001703,0.001749,0.002613,0.00087,0.002029,0.002611,0.000924,0.002262,0.001365,0.001409,0.002366,0.000156,0.000992,0.000714,2e-04,0.001639,0.000556,0.001831,0.000952,0.001029,0.001458,0.000533,0.001462,0.001671,0.001512,0.001497,0.001092,0.001809,0.002379,0.002052,0.004271,0.003017,0.002524,0.002703,0.002525,0.002041,0.000484,3.8e-05,0.002379,0.00169,0.002922,0.002554,0.002649,0.001602,0.001913,0.001036,0.000447,0.001754,0.001464,0.001906,0.003235,0.001848,0.002725,-0.000789,0.001862,0.000824,0.000617,0.003789,0.002109,0.00245,0.002094,0.000583,0.002187,0.001856
0.000163,-0.000531,-0.000454,-0.000433,0.000346,-5.2e-05,0.000536,-9.3e-05,0.000156,0.00011,7e-06,-0.000454,0.000689,0.001367,0.000318,0.000124,0.000346,-0.000367,-0.000124,0.00087,0.001104,-0.000206,0.000122,-7.1e-05,-0.000205,-0.000526,-0.001199,-0.000309,-0.000332,0.00017,-8.4e-05,-0.000712,-6.8e-05,0.000406,-4.2e-05,-1.4e-05,-0.000372,-0.000352,6.2e-05,-0.000647,-0.000327,-0.00012,-0.000359,-0.000569,2.6e-05,0.000246,-0.000502,-0.000657,-0.001443,8e-05,-5.1e-05,-0.000508,-2.1e-05,-0.000473,-0.001005,-0.00023,-0.00113,-0.000352,-0.001014,-0.001833,0.000416,-0.001239,-0.001022,-0.000718,-0.00108,0.000335,-0.000283,-0.000103,-3.6e-05,3e-04,0.000473,0.000472,0.000404,0.000216,-0.000449,0.000575,-1.6e-05,0.000247,-0.000645,-0.000112,0.000409,-0.001255,-0.001232,0.000689,-0.001432,-0.000599,-0.001136,-0.001968,-0.000271,-0.001355,-0.000697,-0.000368,-0.000493,0.000839,0.001587,0.000426,7.8e-05,-0.000707,-0.000242,-0.000244,0.000318,-0.000216,-0.000886,-0.000412,-0.000396,0.001144,-0.000759,-0.000501,-0.000909,-0.000596,0.00085,0.000539,0.001517,0.00078,-0.001394,0.000407,0.000183,0.000847,0.001209,-0.000808,0.000882
-4e-04,-0.000446,0.000206,0.000187,4.6e-05,0.000238,-8e-06,-0.000285,-0.00051,-0.000266,3.9e-05,0.000246,-0.000189,-0.000423,0.000328,-0.000615,-0.001023,0.000876,-0.000233,-0.000822,1.3e-05,0.000343,-0.000478,-2e-05,0.000167,0.000309,0.000398,0.000143,0.00028,0.000314,-0.000109,-8.8e-05,9.4e-05,0.000214,-0.000238,5.2e-05,-0.000521,-0.000156,-0.000259,-0.000251,9e-05,0.000139,-0.000296,8.3e-05,-0.000256,-5.9e-05,0.000377,-0.00043,0.000198,-6.6e-05,-0.000621,0.000537,-0.000455,-0.000532,-0.000353,-0.000214,0.000274,-0.000676,-0.000143,-0.000876,-0.000601,0.000137,-0.000309,-9e-06,-0.000395,0.00026,0.000152,-0.000403,-0.000204,-0.000534,4.5e-05,-0.000396,-0.000562,-6.8e-05,-1.4e-05,-0.000348,7.4e-05,-0.000522,-0.000346,0.000125,-0.00035,-0.000411,-0.001106,0.001136,-2.8e-05,-0.000238,0.00061,0.00078,-0.000149,0.000692,-0.000393,-0.000647,-0.000636,1.6e-05,-0.000729,-0.000463,-0.000366,-0.000205,-0.000461,-1.8e-05,0.000164,-0.000452,4.7e-05,-3.6e-05,0.000314,-0.000699,-0.00053,-0.000848,0.000218,-0.000115,0.001124,-0.000668,1.1e-05,-0.000446,8e-06,2e-05,-0.000772,-0.000264,-0.000734,-0.001204,-0.000619
-0.00061,0.000237,-0.000462,-2.2e-05,0.000192,-1.3e-05,-0.000313,-0.000381,-9.5e-05,-0.000477,-0.001123,0.000244,-0.000272,-9.8e-05,-0.000696,0.000332,0.000276,-0.000791,0.000188,-0.000296,-0.001056,5.1e-05,-0.000227,8.6e-05,-0.000697,-0.000534,0.000192,-0.000293,-0.000174,0.00084,-7e-06,-6.3e-05,0.000803,-0.000293,0.000158,-0.000169,-0.000107,-0.000173,0.000147,1.9e-05,-0.000291,-5.1e-05,0.000236,-0.000423,-0.000399,-0.00021,0.000564,0.000162,-0.000217,-1.6e-05,0.000119,-0.00026,1.8e-05,0.000177,0.000416,-0.000471,-0.000221,-0.000104,0.000383,0.000599,0.000421,-8.8e-05,-0.000176,0.000209,0.000362,-0.000388,-3.3e-05,-1e-04,0.000278,-0.00017,-9.1e-05,0.000246,0.000217,2.8e-05,-6.9e-05,-0.000182,0.000408,0.000321,0.00039,0.000119,-0.000134,0.000632,0.000653,-0.000833,0.000474,-9.8e-05,0.000142,0.000335,-0.000102,0.000514,0.000183,0.000123,0.000605,0.000253,0.000202,-0.000322,-0.000176,0.000196,8.4e-05,0.000329,-0.001008,0.000318,-0.000702,-1.8e-05,-0.000139,0.000247,0.000326,-0.000543,0.000461,0.000284,-0.00017,-0.000225,-0.000474,0.000262,-0.000259,-3.1e-05,0.000956,6.3e-05,0.000613,-0.000204,0.000182
0.000464,-3.3e-05,0.000218,0.00017,-1.8e-05,0.000132,0.000128,0.000145,0.000233,-0.000693,0.000236,1.2e-05,0.000136,9.3e-05,0.000114,5.7e-05,0.000331,0.000133,0.000191,8.1e-05,-0.000329,7.2e-05,0.000137,0.000314,0.000101,0.000441,0.000168,3.2e-05,9.3e-05,-0.000651,-0.000163,2.4e-05,-0.000167,-3.1e-05,0.000212,0.000148,0.000175,-0.000209,-6.8e-05,-0.000127,-0.000168,-0.000271,0.000173,0.000163,-0.00012,-0.000261,-0.000334,0.00012,1.1e-05,0.000418,5.3e-05,-0.000109,-2.4e-05,-0.000101,-0.000162,0.000273,5.1e-05,0.000319,-0.000131,3e-05,-0.000121,0.000264,0.000119,2.8e-05,8.4e-05,0.000365,0.000103,-8.8e-05,5e-06,-0.000118,-2.4e-05,-0.000104,-0.000262,-0.000208,-6.9e-05,0.000126,-0.000699,-0.000189,0.000114,0.000147,0.000137,-4.4e-05,0.00014,-0.000395,-3.3e-05,9.3e-05,-0.000509,-0.000297,6.5e-05,-0.00016,0.000351,-0.000404,0.00055,-0.000154,-0.001027,-9e-06,-0.00028,-0.000162,-6.3e-05,-0.000794,0.000272,-0.000208,0.000576,-0.000316,-0.000468,-0.000249,-3.5e-05,0.000421,-0.000592,0.000401,-0.000164,0.000152,0.000162,-0.000371,-1.9e-05,0.000263,-0.000574,-9.3e-05,-0.000839,4.4e-05,-8.8e-05
9.6e-05,-4.6e-05,-0.000126,4.7e-05,7.1e-05,-0.000122,0.000106,0.000168,-4.4e-05,0.000291,0.000359,0.000269,-0.00033,0.00019,-7.1e-05,-0.000207,1.9e-05,-0.000268,-0.000124,-0.000209,0.000461,-2.5e-05,-0.000228,-8.1e-05,1.7e-05,-0.000151,-6.7e-05,-0.000176,-0.000212,-4.8e-05,0.000112,-3.8e-05,-0.00032,4.8e-05,-0.000171,-0.000121,-2.7e-05,0.000202,0.000183,-6.9e-05,-0.000156,4.6e-05,-0.000193,2.5e-05,0.000409,-0.000103,-1.3e-05,-0.000155,-8.3e-05,-7.7e-05,-0.000138,-0.000219,0.000163,4.9e-05,0.000198,0.000352,-0.000145,-7.6e-05,5.6e-05,-0.000153,0.000237,-0.000196,0.000136,-0.000134,-6.1e-05,-0.000341,-6.8e-05,-6e-06,-5.8e-05,0.000201,-0.000282,5.7e-05,5.5e-05,2.6e-05,9.6e-05,-0.000256,8.7e-05,-5.5e-05,-0.000139,-0.000197,2.9e-05,-0.000126,0.000279,6.3e-05,-0.000505,-0.000271,0.00026,-1.1e-05,6.1e-05,-0.00018,0.000213,0.000266,-0.000542,-0.000339,4e-04,-0.000108,0.000676,5.3e-05,1e-06,-9.9e-05,0.000125,-0.000178,-0.000117,-9e-05,-0.000208,4.1e-05,-3.4e-05,-0.000695,6.5e-05,-0.000557,0.000287,-0.000251,-0.000201,7.8e-05,2.8e-05,-0.000169,-0.000317,4.7e-05,-7.5e-05,0.000551,0.000113
-0.000178,-6.3e-05,-4e-05,8.1e-05,-0.00014,-1.7e-05,-0.000134,-1.7e-05,2.1e-05,0.000664,0.000453,9.7e-05,0.000219,-0.000224,0.000104,0.00039,-0.00024,0.000363,-3.8e-05,0.000111,8.2e-05,-1.4e-05,5e-06,-0.000221,0.000109,2.8e-05,3.1e-05,0.000118,-7.6e-05,-0.000142,-5.6e-05,0.000106,-0.000152,6.9e-05,-0.000139,0.000109,8.5e-05,0.00018,-8.3e-05,3.4e-05,-8.6e-05,0.000118,5.2e-05,-7.9e-05,-0.000276,0.00014,2.2e-05,7e-05,6.4e-05,-0.000156,-2.8e-05,-9.7e-05,8.7e-05,1.9e-05,7e-06,-0.000136,-3.8e-05,-0.000103,-9.1e-05,0.000225,-0.000372,9.3e-05,-7.7e-05,-0.000104,8e-06,0.000153,-3.9e-05,-0.000221,8.7e-05,-0.00017,0.000198,-1.6e-05,-0.000151,0.000116,0.000172,0.000192,-0.000198,-0.000163,-3.2e-05,-6.8e-05,-0.000278,-0.000364,8.2e-05,0.00026,-1.6e-05,0.000185,-7.4e-05,-0.000419,-0.000213,8.5e-05,5e-05,0.000189,-0.000147,0.000266,-1.3e-05,-0.000144,-0.000137,-8.4e-05,-1.9e-05,0.000349,-0.000341,0.000163,-3.5e-05,0.000258,0.000271,-4.2e-05,0.000119,0.000515,0.000351,0.000215,-0.000215,0.000275,1.6e-05,8.8e-05,0.000365,-0.000152,0.00025,-0.000405,0.000577,5.8e-05,-0.000209
-2.1e-05,0.000109,8e-06,-6e-06,-7.6e-05,-1.7e-05,1.9e-05,-0.00018,9e-05,-0.000213,-0.000169,-0.000126,0.000123,3.5e-05,-0.000102,-4.5e-05,-4.5e-05,-0.000175,3.8e-05,0.000127,-0.000131,-9.9e-05,-8.6e-05,-3.2e-05,-7.2e-05,-0.000228,-0.000142,2.9e-05,3.6e-05,-0.000224,-0.000129,-0.000198,-0.000281,-0.000126,1.2e-05,-0.000145,3e-05,-2.6e-05,3.1e-05,-0.000169,0.000144,-7e-05,-6.8e-05,-0.000173,6.2e-05,6.5e-05,-0.000297,-2.8e-05,-2.1e-05,-0.000291,2.8e-05,-0.000134,8.8e-05,1.1e-05,-0.000227,-0.000142,0.000275,0.000135,0.000118,-0.000126,7.2e-05,9.4e-05,0.000154,0.000127,-1.5e-05,-0.000252,5e-05,0.000121,6.1e-05,5.8e-05,-3.4e-05,6e-06,7.8e-05,-1.5e-05,-0.000141,-0.000246,0.000411,5.7e-05,-3.2e-05,-0.000181,6.3e-05,0,0.000188,-0.000414,0.000167,-6.6e-05,0.000244,0.000241,3.7e-05,0.000121,1.7e-05,-0.000103,-7.1e-05,-1.6e-05,-0.000216,0.000117,-5.1e-05,-3.4e-05,5.7e-05,-0.000219,0.000147,-3e-05,7.6e-05,-8.1e-05,-8.4e-05,-7.6e-05,4.9e-05,-0.000329,-0.000312,-0.000334,-0.000222,-2.2e-05,-8.5e-05,-7.8e-05,-0.000511,-0.000187,-6.1e-05,0.000149,-0.000229,-9.3e-05,-0.000272
0.000131,-1e-04,1.6e-05,3e-06,-9e-06,6.6e-05,-3.2e-05,8.2e-05,1.1e-05,-0.000174,-2.9e-05,-0.00015,1.5e-05,-0.000126,-1.5e-05,3.2e-05,0.000145,0.000129,-1.7e-05,0.000185,-0.000288,6.7e-05,0.000215,-4e-06,0.000117,0.000193,-0.000112,-2.8e-05,5.5e-05,7.1e-05,7.1e-05,1.8e-05,0.000158,0.000101,3.1e-05,5e-05,3e-06,-2.5e-05,-5.2e-05,-6.2e-05,7.4e-05,-1.8e-05,-6.8e-05,0.000138,0.000129,2.9e-05,-3.9e-05,-3.2e-05,-8.2e-05,0.00015,-0.000145,5.1e-05,-1.5e-05,-2.8e-05,8.3e-05,3.4e-05,-4.9e-05,0.000107,4e-06,8.1e-05,-0.000104,-8.1e-05,-0.000114,-3e-05,-4e-06,0.00014,-1.5e-05,1e-05,1e-05,4.3e-05,-2.6e-05,4.6e-05,5e-06,-7.8e-05,5.1e-05,0.000201,-9.6e-05,0.000123,6.4e-05,-3e-06,9.9e-05,-4e-06,-0.000167,-0.000125,0.00012,-5.5e-05,-0.000249,3.6e-05,0.000198,-8.5e-05,-7e-05,0.00022,0.00035,4.9e-05,-6.9e-05,1.8e-05,3.9e-05,0.000174,-1e-05,8.5e-05,-7.4e-05,2.4e-05,5e-05,2.5e-05,1.9e-05,-1.6e-05,4.9e-05,0.000326,-3.3e-05,0.000223,-0.000179,-4.3e-05,-6.6e-05,-0.000114,0.000469,0.000178,9.3e-05,0.000129,4.4e-05,0.000436,0.000105
7.9e-05,8.1e-05,4.5e-05,-3.2e-05,-4e-05,-2.3e-05,8.6e-05,0.000142,-3.2e-05,-6.9e-05,-7.8e-05,-8.5e-05,-0.000116,0.000187,-0.000227,1.2e-05,3.9e-05,-0.000292,-6e-05,-0.000258,0.000325,-4.7e-05,-0.000161,3e-05,-0.000103,-7.5e-05,0.000215,3.3e-05,3.1e-05,0.000354,-1.3e-05,7.4e-05,0.000207,-6.2e-05,-1.5e-05,-3.7e-05,6.5e-05,-1.5e-05,4.4e-05,6.6e-05,1.6e-05,2.5e-05,8.1e-05,-4.3e-05,-9.4e-05,-5.7e-05,0.000241,6.2e-05,5.9e-05,-5.1e-05,-0.000102,0.000123,-5e-05,-2.5e-05,4.2e-05,0.000113,6.2e-05,-0.000251,-0.000142,-6e-05,1.9e-05,-5.8e-05,-2.8e-05,2.5e-05,-6.2e-05,0.000136,-4.7e-05,-0.00017,-7.8e-05,-5.5e-05,6.1e-05,-5.6e-05,-0.000105,3.3e-05,-0.000179,-0.000149,-4.6e-05,-0.000148,5e-05,0.000133,-6.7e-05,0.000172,-1e-04,0.000443,1.9e-05,-6e-06,7.6e-05,-0.000101,-0.000103,-0.000142,-0.000126,-0.000288,3e-05,-4.5e-05,0.00014,-1e-04,9.3e-05,-0.000295,-0.000145,-0.000267,-0.000154,-0.000141,-8.4e-05,5.6e-05,-0.000191,0.000144,-0.000123,-0.00015,0.000153,-6.7e-05,-0.000118,4e-06,7.6e-05,0.000119,-0.000427,4.8e-05,-0.00014,0.000114,-8.7e-05,-0.000134,0.000165
-5.2e-05,1.4e-05,-5.6e-05,-5.5e-05,4.2e-05,-1e-06,-8.1e-05,-5.7e-05,7.9e-05,-7.3e-05,0.000317,-6e-05,0.000121,-0.000115,0.000187,0.00012,-3e-06,0.000218,6.6e-05,0.000128,7.9e-05,2.2e-05,0.000165,-8.9e-05,7.7e-05,0.000102,-0.000197,-2.2e-05,-6.4e-05,-0.000115,2.1e-05,1.5e-05,0.00014,-3.6e-05,5e-06,-6e-06,-6e-06,-5e-06,-1.7e-05,2.9e-05,-4.8e-05,-3.6e-05,3.6e-05,1.6e-05,9.8e-05,-6.5e-05,7.2e-05,5.3e-05,5.9e-05,5.3e-05,6.7e-05,-3.3e-05,-3e-06,6.1e-05,0.000113,-2.1e-05,-4.3e-05,8.7e-05,0.00017,0.000219,4.7e-05,7.6e-05,8.7e-05,-4e-06,5.5e-05,-0.00018,2.4e-05,6.4e-05,0,-3.1e-05,-2.3e-05,3.3e-05,-5e-06,5.3e-05,3.9e-05,1.9e-05,-4.3e-05,3e-06,1.9e-05,7.3e-05,-8.4e-05,5.9e-05,4.9e-05,0.000114,-5.8e-05,6.7e-05,2.7e-05,0.000234,-1.3e-05,0.000186,-0.00012,6.8e-05,-8.4e-05,-4.7e-05,0.000116,-4.1e-05,-0.00012,3.5e-05,0,0.000155,0.00021,4.5e-05,0.000175,9e-06,0.000136,-4.9e-05,4e-05,0.000162,-4.1e-05,6.6e-05,0.000364,-5.9e-05,-1.4e-05,-0.000104,0.000179,-4.4e-05,-0.000154,-0.000149,4.6e-05,7.6e-05,-0.00011
-1.5e-05,2e-06,6.6e-05,-1.1e-05,4e-06,1.2e-05,3e-05,-1.1e-05,-3.8e-05,0.000142,-9.5e-05,-2e-06,-0.000105,0.000123,5.8e-05,-0.000101,2.2e-05,3e-05,-1.5e-05,1.6e-05,0.000133,0,2.6e-05,0.000254,-1.7e-05,-8e-06,9.8e-05,1.2e-05,9e-06,-9e-05,2e-06,3.1e-05,-9.9e-05,5.2e-05,1.4e-05,-1.9e-05,3.7e-05,4.1e-05,3.3e-05,1e-06,1.2e-05,8e-06,-4.3e-05,-3.1e-05,8e-05,-2.1e-05,-0.000113,-4e-05,-6.8e-05,8.5e-05,3.2e-05,-7e-06,-2.8e-05,8e-06,-5.4e-05,-3.9e-05,-4.7e-05,2.4e-05,-0.000141,-2e-06,-5.5e-05,-2.3e-05,-3.5e-05,-3.2e-05,7e-05,7.6e-05,-2e-05,9e-06,2.7e-05,2.5e-05,2.4e-05,-3.1e-05,1.9e-05,-5.5e-05,4.2e-05,-2e-05,-6.4e-05,6.9e-05,-7.1e-05,-5e-06,3.7e-05,-0.000143,-0.000141,-0.000279,-7.7e-05,2.9e-05,-7.4e-05,-0.000297,-6.9e-05,-8e-05,4.6e-05,3.9e-05,-6.1e-05,4e-06,-8.2e-05,5.2e-05,-7.7e-05,5e-05,7.5e-05,4.7e-05,-9.9e-05,8.4e-05,-0.000129,2e-05,2.7e-05,-8e-05,3.3e-05,-4.6e-05,-0.000122,-0.000104,0.000113,-3e-06,-4.9e-05,2.2e-05,1e-06,4e-05,0.000211,1.6e-05,0.000186,7e-06,1e-06
3.7e-05,-5.9e-05,-9e-06,-6e-06,3e-05,-1.8e-05,-3.4e-05,-2e-06,-1.7e-05,0.000283,-0.000152,4.6e-05,1e-05,-0.000135,4.9e-05,-3.3e-05,-0.000141,6.6e-05,-4.6e-05,-3e-05,-0.000347,-1.5e-05,-7.2e-05,-0.000216,5.8e-05,-5.5e-05,-6e-05,2.5e-05,5e-06,0.000117,1.4e-05,-4.3e-05,-2.1e-05,-2.1e-05,-5.9e-05,-8e-06,-3.3e-05,4.4e-05,-1.7e-05,3.7e-05,-1.5e-05,3.5e-05,-4.4e-05,6.4e-05,-5.7e-05,4.6e-05,6.4e-05,1.7e-05,5.3e-05,1.2e-05,-2e-05,-8e-06,4e-06,-2e-06,-3.3e-05,3e-05,-1.6e-05,3.4e-05,9.3e-05,-0.000127,6e-05,8e-06,7.2e-05,-8e-06,-0.00012,-7.9e-05,6e-06,6.1e-05,-3.5e-05,5.9e-05,-6.2e-05,3.5e-05,-6e-06,-2.8e-05,2.6e-05,3e-05,3.1e-05,-2.8e-05,-2.8e-05,-5e-05,4.4e-05,-6e-05,-2.3e-05,-0.000145,-2e-06,-9.5e-05,5.6e-05,3e-06,0.00012,1.7e-05,-4.5e-05,2.8e-05,-3.1e-05,-1.5e-05,-3.8e-05,3.9e-05,3.4e-05,-1.2e-05,1.4e-05,-0.000108,2.5e-05,-0.000106,4.9e-05,6e-06,-4.3e-05,4.7e-05,-7.6e-05,0.000222,7.2e-05,8e-06,-0.000198,3.6e-05,5.7e-05,-7.8e-05,-1.5e-05,1.3e-05,-0.00014,-7.3e-05,-0.00024,-0.000171,1.7e-05
4.2e-05,6.3e-05,1e-05,-6e-06,-2.3e-05,1.9e-05,5.5e-05,5.2e-05,-8e-06,-9.3e-05,-0.000154,2e-05,8.9e-05,8.4e-05,-9e-05,8.4e-05,4e-05,-0.000164,4.4e-05,2.8e-05,0.000254,-2.6e-05,5.2e-05,1e-04,-5e-05,-1e-05,5.1e-05,2e-05,1.8e-05,-0.000191,2e-06,2.3e-05,-0.000141,-4e-06,-3e-06,1e-05,-1.1e-05,-2.3e-05,-3e-06,3.4e-05,6.3e-05,-2.3e-05,4.2e-05,-4e-05,9e-06,4.9e-05,-9e-05,-3e-06,-1.8e-05,-5.8e-05,2e-06,-1e-05,-9e-06,9e-06,-1.4e-05,-1.3e-05,-7e-06,-9.4e-05,-5.5e-05,-1.1e-05,-9.8e-05,-1.6e-05,-8.9e-05,-4e-06,5.3e-05,9.2e-05,-2.2e-05,-1.7e-05,1.7e-05,-1e-06,-3e-06,-3e-05,1.1e-05,4.8e-05,-2.3e-05,3.1e-05,1e-06,-6e-06,3.1e-05,-9.6e-05,-6.1e-05,5.5e-05,4e-06,0.000193,0.000126,0.000136,-2.5e-05,-3e-06,-7.5e-05,-1.9e-05,6e-06,9.2e-05,-3.7e-05,-1e-05,8.6e-05,1.7e-05,0.000109,6.7e-05,-1.6e-05,5.5e-05,9.3e-05,1.5e-05,-4.2e-05,2.5e-05,-1.9e-05,-5.3e-05,1.5e-05,-0.000199,6e-05,-0.000139,4.3e-05,8e-06,-4e-05,3.6e-05,1.4e-05,-8.9e-05,4.4e-05,-3e-06,1.5e-05,6e-06,1.8e-05
-7.7e-05,-1.7e-05,4e-06,1.5e-05,1.5e-05,-3e-06,-4.2e-05,-6.3e-05,-1.7e-05,-0.000218,0.000111,3.6e-05,-4.5e-05,-8.2e-05,-6e-06,-1e-04,8.7e-05,4.4e-05,1.8e-05,2e-05,-1.2e-05,3.5e-05,3e-06,-2.2e-05,-2e-06,3.9e-05,-4.3e-05,-4e-06,2.7e-05,-1e-05,7e-06,-3e-05,-2.6e-05,1.2e-05,3.1e-05,-1.2e-05,1.1e-05,-1.4e-05,4e-06,1e-05,5e-05,1.5e-05,1e-06,-3e-06,1.5e-05,1e-05,-0.000122,-8e-06,1e-06,-6.8e-05,2.6e-05,2e-06,1e-06,-1.7e-05,-5e-06,-1.4e-05,7.4e-05,2.7e-05,2.8e-05,0,2.7e-05,3.7e-05,5.7e-05,2.1e-05,-2.3e-05,-9.2e-05,1e-05,1.1e-05,-9e-06,-3.5e-05,6e-05,2.5e-05,-1e-06,1e-05,-4.5e-05,-4.9e-05,7.9e-05,6e-06,5.5e-05,-2.6e-05,-1.5e-05,0.000141,2.6e-05,1e-04,2.1e-05,-8.5e-05,4e-05,2.4e-05,-2.7e-05,-2.1e-05,1.4e-05,-6.8e-05,0.000185,3.2e-05,0.00013,1e-06,-7.7e-05,-5.7e-05,-2.1e-05,4.4e-05,-7.3e-05,6e-05,-6e-06,-8e-06,5.8e-05,6.2e-05,2.6e-05,0.000158,-0.000113,0.000159,5e-06,-1.5e-05,2.6e-05,2e-06,3e-06,-3.6e-05,-3.9e-05,-3.4e-05,0.000104,-0.00015,-8.9e-05
4e-06,0,6e-06,1.7e-05,-2.2e-05,-7e-06,1.5e-05,1.5e-05,3e-06,-7e-06,-7e-06,3.7e-05,-3.4e-05,7.6e-05,-1.2e-05,7e-06,2.7e-05,1.8e-05,-2.5e-05,-4.4e-05,2.9e-05,-1.6e-05,1.8e-05,6e-05,1.3e-05,3.8e-05,6.3e-05,-5e-06,-2.3e-05,0.000101,1.7e-05,4.6e-05,5.8e-05,-2e-06,2e-06,-1.4e-05,-2.1e-05,-1.6e-05,0,3.2e-05,-1.9e-05,-3e-06,-1e-05,3.1e-05,-4e-05,-2.2e-05,0.000102,9e-06,-1e-06,3.1e-05,4e-06,4.6e-05,0,-4e-06,1.9e-05,-8e-06,-2.4e-05,7.7e-05,1.5e-05,-4.7e-05,-6.8e-05,-3.1e-05,-5.1e-05,-1.5e-05,3.1e-05,2.5e-05,-1e-06,7.2e-05,1e-05,3e-06,-1.2e-05,-2.5e-05,1.7e-05,-3.3e-05,-4.3e-05,5.4e-05,-1.8e-05,4.1e-05,-3.1e-05,4.9e-05,4.7e-05,1.3e-05,2.6e-05,-0.000164,-3.6e-05,4.9e-05,-6.2e-05,9.5e-05,3.3e-05,1.2e-05,3e-06,-3.1e-05,-4.8e-05,4e-06,-7.8e-05,3.3e-05,-5.5e-05,-2e-06,0,8e-06,1.8e-05,-4e-05,7e-06,-3.2e-05,1.2e-05,-3.5e-05,-6e-06,-0.000147,5e-06,-5.2e-05,-0.000133,-7e-06,1.7e-05,-1.7e-05,-9.4e-05,1.9e-05,1.1e-05,9.4e-05,1.1e-05,2.8e-05,0
3.8e-05,-2.4e-05,2e-06,9e-06,-1e-06,-2e-06,-1.8e-05,2e-06,-1.3e-05,4.1e-05,1.9e-05,0,3.7e-05,-3.8e-05,7.7e-05,3.2e-05,-7.9e-05,7.4e-05,1.6e-05,-1.7e-05,-0.000257,-2e-06,-5e-05,-0.000115,-3e-05,-3.2e-05,-4.6e-05,5e-06,-5e-06,6.1e-05,-7e-06,4e-06,5.6e-05,-1.9e-05,-1.5e-05,2.4e-05,1.9e-05,5e-06,6e-06,1.9e-05,-2.5e-05,-8e-06,1.7e-05,6e-06,-3.4e-05,-2.3e-05,6.3e-05,-1.1e-05,1.5e-05,-1.4e-05,2.6e-05,1.5e-05,2e-06,1e-06,3.4e-05,3.5e-05,1e-05,-9.5e-05,-4.1e-05,1.9e-05,7.8e-05,-1e-06,5e-06,-1.3e-05,-4.1e-05,6.5e-05,-5e-06,-4.7e-05,-7e-06,1.4e-05,2e-06,2.1e-05,-1.1e-05,-6e-06,3e-05,-5.4e-05,-1.1e-05,-1.6e-05,-2.8e-05,3.8e-05,6e-06,-7.2e-05,4.1e-05,1.5e-05,-6.7e-05,-3.8e-05,2.6e-05,-8.1e-05,4.2e-05,-4e-05,-6e-06,-9e-06,-7e-05,-8e-06,-5.3e-05,-2e-05,8.3e-05,1e-05,-1.4e-05,1e-05,5.3e-05,-1.7e-05,2.1e-05,2.4e-05,3e-06,4.6e-05,-2.1e-05,6.3e-05,8e-05,5.7e-05,-5.3e-05,0,-1e-05,-3.1e-05,0.000121,6.6e-05,2.4e-05,1.6e-05,-4.1e-05,0.000107,7.4e-05
-3e-06,2.1e-05,-1.5e-05,3e-06,3e-06,7e-06,4.1e-05,1.6e-05,-4e-06,5.1e-05,-5.8e-05,-2.7e-05,-2.4e-05,5e-05,7e-06,-2.2e-05,-2.6e-05,-5.9e-05,6e-06,3.2e-05,0.000141,5e-06,3.4e-05,8.5e-05,2.2e-05,1.2e-05,-2e-06,-5e-06,4e-06,-0.000119,0,-2.6e-05,6.4e-05,1.2e-05,0,-1.8e-05,-1.1e-05,2.1e-05,-6e-06,2e-06,-1.6e-05,1.3e-05,-8e-06,-8e-06,4.8e-05,-1.4e-05,-1.8e-05,-7e-06,-9e-06,2.1e-05,3.8e-05,-6e-06,1.2e-05,6e-06,-3e-05,-8e-06,-2.3e-05,2.3e-05,4.7e-05,2.1e-05,-8e-05,1.1e-05,3.6e-05,8e-06,3.6e-05,-5.8e-05,1e-06,1.6e-05,5e-06,-2e-05,-6e-06,-1.9e-05,-3e-06,2.3e-05,2e-05,4.6e-05,-4.6e-05,-2.9e-05,-1.6e-05,4.6e-05,-4e-05,-4.9e-05,6e-06,8e-05,3.6e-05,4.3e-05,-1.5e-05,5.1e-05,-7.1e-05,2.7e-05,-2.5e-05,-3e-06,-4.5e-05,-4e-06,3e-05,3e-06,8e-06,-3.5e-05,1.5e-05,-4.9e-05,-4.6e-05,1.2e-05,-3.5e-05,-2.1e-05,-4.9e-05,-1.9e-05,0,-9.5e-05,-7e-05,-6.5e-05,5e-05,-1.1e-05,1.6e-05,3.9e-05,-9.5e-05,0,-2.8e-05,-2.2e-05,-5.9e-05,-6.2e-05,3.3e-05
-4.3e-05,-1.8e-05,1.5e-05,-5e-06,4e-06,-3e-06,-4e-05,-3.2e-05,-1e-06,0.000108,7.2e-05,-1.7e-05,-1.1e-05,-5.5e-05,-2.4e-05,-8e-06,4e-06,-3.2e-05,-8e-06,-1e-05,1.5e-05,1e-06,-1.7e-05,-1e-05,2e-06,-4.7e-05,1.4e-05,5e-06,-1e-06,0.000154,-2e-06,3e-06,-1e-05,1e-05,9e-06,1.6e-05,5e-06,1e-06,8e-06,-3e-06,5e-06,-3e-06,-1.5e-05,-1.9e-05,-8e-05,1.7e-05,1.3e-05,-3e-06,-9e-06,1.2e-05,6e-06,-1.3e-05,-6e-06,-1e-06,-1.8e-05,-1.6e-05,-1.2e-05,2.1e-05,-3.7e-05,-3e-06,6.2e-05,0,-3.3e-05,-8e-06,-2e-05,1.9e-05,2e-06,2.3e-05,-7e-06,1.1e-05,-7e-06,1.5e-05,2e-05,2e-06,1.8e-05,-4.3e-05,-1e-06,3.8e-05,2.5e-05,-1.1e-05,1.3e-05,2.4e-05,-1.1e-05,5.3e-05,4.2e-05,-1.6e-05,2.2e-05,-6.7e-05,0,3e-06,-2e-05,5.7e-05,5.2e-05,-2.1e-05,5.3e-05,1.2e-05,-1.4e-05,7.5e-05,3.4e-05,7.1e-05,3.2e-05,2.5e-05,2.6e-05,-4e-06,2.8e-05,-8e-06,3.5e-05,5.4e-05,-3.2e-05,5e-06,9.7e-05,1e-05,-1e-06,-4e-06,6.3e-05,-1.8e-05,-1e-06,-4.9e-05,3.6e-05,0.000123,-4.4e-05
2.1e-05,8e-06,-1.1e-05,-8e-06,6e-06,1e-06,2.1e-05,1e-05,1e-05,-4.2e-05,7e-06,-1.8e-05,3.3e-05,1.7e-05,-2.8e-05,1.5e-05,6.2e-05,-1.1e-05,3e-06,5e-06,6e-06,-2e-06,-1.5e-05,-2.5e-05,-1.7e-05,2.7e-05,2e-06,2e-06,1.2e-05,-8.4e-05,1e-06,-2.3e-05,-2.2e-05,-1.3e-05,-4e-06,-7e-06,8e-06,-8e-06,-1e-05,-8e-06,-3e-06,-4e-06,9e-06,2.3e-05,2.9e-05,1.9e-05,1.5e-05,-6e-06,9e-06,2.5e-05,-1.1e-05,-2e-06,1e-05,-4e-06,1.9e-05,2e-06,6e-06,1.6e-05,1.4e-05,8e-06,-5.1e-05,-4e-06,2.9e-05,4e-06,6e-06,-3.4e-05,-3e-06,-7e-06,2e-06,-5e-06,4e-06,-1.1e-05,-5e-06,-2e-05,-9e-06,4.5e-05,1e-05,-3e-06,1.7e-05,-4.4e-05,2.4e-05,6.6e-05,-1.4e-05,-0.000125,-1e-05,-2.4e-05,-8e-06,0,2.3e-05,-2.5e-05,-1.4e-05,1.4e-05,6.5e-05,1.3e-05,-2.2e-05,6e-06,-7.1e-05,-2.3e-05,-4e-06,-1.4e-05,9e-06,-2.1e-05,-1.4e-05,1.1e-05,1.7e-05,-1.4e-05,-1.2e-05,-7.5e-05,7e-05,-2.7e-05,8.2e-05,1.4e-05,-8e-06,5e-06,-1.5e-05,7e-06,3.6e-05,7e-06,6.4e-05,1e-05,-1.9e-05
1.5e-05,2e-06,4e-06,-9e-06,-1e-06,1e-06,-1.6e-05,1e-05,-7e-06,-0.000164,1.7e-05,-5e-06,-1.1e-05,-5e-06,-5e-06,8e-06,6e-06,6.1e-05,4e-06,-6e-06,-0.000142,-1e-06,1.9e-05,1e-05,1.1e-05,1.5e-05,3e-06,-4e-06,-1.1e-05,-7.2e-05,-6e-06,2.7e-05,-7.5e-05,4e-06,0,6e-06,-7e-06,-6e-06,8e-06,-1.2e-05,2.5e-05,8e-06,1.8e-05,-1e-06,3e-06,5e-06,-7.7e-05,4e-06,-3e-06,-1.7e-05,1e-06,-1.7e-05,-1.4e-05,2e-06,-1.2e-05,1.3e-05,4e-06,-5.2e-05,3e-06,2.9e-05,3.8e-05,-2e-06,-3.1e-05,-8e-06,-1.2e-05,5.5e-05,0,-5e-06,-8e-06,1.4e-05,-1.4e-05,7e-06,2e-06,2e-06,-3.4e-05,-1.9e-05,3.8e-05,-1.8e-05,-1e-06,-2.5e-05,-6e-06,2e-05,-2.1e-05,-3.6e-05,0,3.7e-05,1.8e-05,3.9e-05,1.5e-05,2e-05,-1.8e-05,-1.9e-05,-2.8e-05,8e-06,-8.8e-05,-1e-05,8.3e-05,-2.1e-05,-2.8e-05,-7e-06,-3.6e-05,-1.4e-05,1.5e-05,-5e-06,-6e-06,4e-06,-2.2e-05,6.6e-05,-2.2e-05,5.4e-05,-4.4e-05,-1.9e-05,8e-06,-1.2e-05,-2.7e-05,-1.1e-05,-5.2e-05,2e-06,-5.2e-05,-2.4e-05,2.1e-05
-3e-06,-4e-06,-7e-06,-6e-06,2e-06,-2e-06,2.3e-05,3e-06,3e-06,2e-06,-4.6e-05,1e-05,-6e-06,9e-06,1.2e-05,-2.1e-05,-3.3e-05,-1e-05,-4e-06,9e-06,7e-05,7e-06,-3e-06,2.8e-05,-6e-06,5e-06,-1.1e-05,-2e-06,0,2.8e-05,2e-06,-7e-06,-2.2e-05,6e-06,8e-06,2e-06,1.4e-05,-2e-06,-6e-06,-8e-06,-9e-06,-1e-05,-1.3e-05,-5e-06,-1.3e-05,-8e-06,-1.8e-05,1e-06,-5e-06,-1.6e-05,6e-06,8e-06,6e-06,0,1.9e-05,-1e-06,2.6e-05,2.2e-05,-1.4e-05,1e-05,-6.1e-05,7e-06,1.8e-05,1e-06,1.9e-05,-3.7e-05,1e-06,-1.7e-05,9e-06,-2.3e-05,1.7e-05,-3e-06,-1e-06,1.5e-05,-4e-06,-3e-06,-1e-06,2e-06,-2.2e-05,-6e-06,-2e-05,-5.7e-05,-4e-06,8.9e-05,-3.8e-05,-4e-05,-2.4e-05,-1.3e-05,-5.3e-05,-1.5e-05,5e-06,-1.5e-05,-5.7e-05,-2e-06,3.5e-05,-2e-06,-1.3e-05,5e-06,-7e-06,3e-06,1.3e-05,2.8e-05,-2e-06,2e-06,-1.9e-05,1.7e-05,1.7e-05,-6.6e-05,-4.8e-05,-2.9e-05,-6.6e-05,1.2e-05,-1e-05,2.1e-05,2.8e-05,-3.3e-05,6.6e-05,1.3e-05,-3.3e-05,6.1e-05,3e-06
-1.5e-05,-7e-06,1e-06,-3e-06,-9e-06,2e-06,-2e-05,-1.4e-05,3e-06,9.6e-05,3.9e-05,1.2e-05,4e-06,4e-06,2e-05,1.3e-05,-3.1e-05,-1.7e-05,-1e-06,-1.5e-05,9.1e-05,-2e-06,-1.2e-05,-3.2e-05,3e-06,-1.2e-05,1.3e-05,-2e-06,-1e-06,6.5e-05,-3e-06,7e-06,6e-06,-1.3e-05,-5e-06,4e-06,-9e-06,3e-06,4e-06,-4e-06,-1.5e-05,2e-06,-7e-06,-5e-06,1.5e-05,-1.4e-05,5.3e-05,-2e-06,8e-06,-1e-06,-7e-06,1e-06,-1e-05,0,-4e-06,-7e-06,-7e-06,2.4e-05,2.2e-05,-3e-06,3.7e-05,-9e-06,-4e-06,-6e-06,-1.2e-05,-1e-06,2e-06,1.7e-05,-8e-06,2e-06,5e-06,-2e-06,2e-06,-4e-06,2.3e-05,3e-06,-1e-06,1.1e-05,-8e-06,1.4e-05,1.4e-05,-5.1e-05,-2e-06,2.4e-05,1.6e-05,3.3e-05,7e-06,3.8e-05,2.4e-05,-6e-06,1.6e-05,-2.5e-05,1.5e-05,7e-06,5e-05,-4e-06,-2.2e-05,-2.1e-05,8e-06,-1.7e-05,8e-06,-9e-06,5e-06,-2e-06,-2e-06,1e-06,0,7.4e-05,4.2e-05,4.1e-05,1.7e-05,-4e-06,1e-06,1e-05,-1.9e-05,1.4e-05,-4.5e-05,1.7e-05,3.3e-05,-8.7e-05,-3.1e-05
3e-06,6e-06,2e-06,2e-06,3e-06,2e-06,8e-06,0,-1e-06,3.1e-05,-2.1e-05,8e-06,4e-06,-1e-05,-5e-06,1e-06,8e-06,-3.1e-05,3e-06,1.1e-05,-1.5e-05,-3e-06,7e-06,-5e-06,7e-06,-1.9e-05,-2e-06,3e-06,-2e-06,-7.8e-05,0,-1e-05,6.6e-05,1e-05,-1e-06,-6e-06,3e-06,4e-06,-4e-06,-1.2e-05,1e-06,8e-06,1e-05,7e-06,1.1e-05,-4e-06,-5e-06,2e-06,-3e-06,-8e-06,-7e-06,6e-06,6e-06,3e-06,-6e-06,4e-06,-2e-06,-2.2e-05,-2.7e-05,-1.8e-05,-2.8e-05,4e-06,-7e-06,-3e-06,0,2.3e-05,-1e-06,-1.6e-05,5e-06,1.2e-05,-5e-06,5e-06,-1e-06,-1.1e-05,1.8e-05,-1.6e-05,-3.1e-05,0,9e-06,3.3e-05,1.3e-05,1.7e-05,-5e-06,-3.9e-05,1e-05,-3.5e-05,-5e-06,-3.5e-05,1.3e-05,4e-06,1.8e-05,1.6e-05,2e-06,-5e-06,-2.3e-05,-2e-06,-3.5e-05,3.2e-05,1.1e-05,2.3e-05,-1.7e-05,-1.5e-05,-1.2e-05,1e-05,9e-06,-1e-06,-9e-06,-3.8e-05,1.4e-05,-5.1e-05,-3.4e-05,-8e-06,1.1e-05,-4e-06,1e-05,2.3e-05,1e-05,1.2e-05,1.7e-05,-5e-06,8e-06
1.7e-05,5e-06,-4e-06,6e-06,-4e-06,-2e-06,-6e-06,1.6e-05,0,2.8e-05,-8e-06,7e-06,-1e-05,1.2e-05,-1.5e-05,-1.6e-05,3.6e-05,3.2e-05,-2e-06,-1e-06,-7.6e-05,3e-06,4e-06,2.2e-05,-8e-06,1.4e-05,-1.8e-05,-2e-06,8e-06,6.3e-05,-1e-06,-7e-06,2e-05,0,2e-06,1e-05,0,4e-06,3e-06,-8e-06,0,-1e-05,-3e-06,-8e-06,-1e-06,3e-06,1.5e-05,2e-06,-3e-06,9e-06,-6e-06,-8e-06,-3e-06,1e-06,-1e-06,-1e-06,-1.3e-05,-1.4e-05,2.9e-05,-4e-06,7e-06,-1e-06,1.9e-05,-1e-06,-1e-06,-1.6e-05,1e-06,-1e-05,-4e-06,-3e-06,-5e-06,-6e-06,-4e-06,5e-06,6e-06,2.8e-05,1e-06,-1.6e-05,2e-05,1.3e-05,-1.5e-05,5.1e-05,1.3e-05,-4e-05,6e-06,3.3e-05,8e-06,5e-06,-6e-06,-4e-06,1.9e-05,1.9e-05,4.1e-05,-7e-06,-5.8e-05,-4e-06,5.9e-05,1e-06,3e-06,-1.4e-05,1.5e-05,1.4e-05,6e-06,-1e-06,6e-06,-1e-05,4e-06,4.6e-05,-4.9e-05,2.1e-05,-6.3e-05,1e-05,-2e-06,-8e-06,1.2e-05,1e-05,1.4e-05,-1.1e-05,-4e-06,-2e-05,3.3e-05
-6e-06,-6e-06,5e-06,5e-06,5e-06,-1e-06,1.1e-05,-6e-06,-2e-06,-3.2e-05,-4.2e-05,-1e-06,9e-06,-1.9e-05,-5e-06,4e-06,1.9e-05,9e-06,1e-06,0,9e-06,0,3e-06,-7e-06,9e-06,-8e-06,2.9e-05,1e-06,-8e-06,4.3e-05,1e-06,1.4e-05,2.3e-05,-5e-06,3e-06,-6e-06,-4e-06,-4e-06,-2e-06,2e-06,4e-06,4e-06,-2e-06,3e-06,-3e-06,1.2e-05,2.8e-05,-1e-06,2e-06,-3e-06,-1.2e-05,2e-06,3e-06,0,-1e-06,2e-06,-6e-06,2.4e-05,-2.2e-05,-1.1e-05,-6e-06,2e-06,-2.1e-05,-3e-06,4e-06,1.3e-05,-1e-06,1.1e-05,4e-06,1e-06,-4e-06,6e-06,3e-06,7e-06,-1.2e-05,-2.8e-05,3e-06,7e-06,-6e-06,-8e-06,-4e-06,1.8e-05,1.5e-05,4.1e-05,-5e-06,-2.5e-05,3e-06,-2e-06,-3.1e-05,9e-06,9e-06,7e-06,2e-06,2e-06,2e-05,5e-06,0,-5e-06,-4e-06,-1.4e-05,-8e-06,2e-06,-5e-06,-2e-06,-1.7e-05,7e-06,8e-06,-2.3e-05,1.3e-05,-1.7e-05,5.3e-05,2e-06,-3e-06,1.3e-05,-2e-05,-8e-06,-1.3e-05,-2.2e-05,-3e-05,-6e-05,0
-1.4e-05,3e-06,-4e-06,2e-06,1e-06,0,-1.1e-05,-5e-06,2e-06,-0.00011,3.5e-05,-6e-06,2e-06,2.3e-05,3e-06,1e-06,-3e-05,6e-06,-2e-06,-2e-06,0.000113,1e-06,-1e-06,-1.3e-05,-1e-05,2.7e-05,-1.7e-05,2e-06,4e-06,-9.6e-05,0,-6e-06,-3e-05,5e-06,-2e-06,2e-06,4e-06,-6e-06,2e-06,4e-06,9e-06,4e-06,5e-06,-4e-06,2.3e-05,1e-06,-2.5e-05,3e-06,2e-06,1.9e-05,-1e-05,-3e-06,1e-06,-1e-06,7e-06,-4e-06,5e-06,8e-06,1.5e-05,-1.2e-05,-4e-06,-4e-06,1.4e-05,-3e-06,-4e-06,-2.8e-05,0,-6e-06,-2e-06,-3e-06,6e-06,-5e-06,0,-4e-06,-2.4e-05,3e-05,7e-06,8e-06,-9e-06,-1e-05,9e-06,-4.3e-05,-3e-06,3.4e-05,-2e-05,1e-05,-4e-06,-1.5e-05,2.3e-05,-6e-06,8e-06,4e-06,-3.8e-05,1e-06,6.5e-05,0,-3.1e-05,4e-06,-9e-06,1.8e-05,-1.3e-05,-7e-06,4e-06,7e-06,1e-06,-1.8e-05,-3e-06,3.1e-05,3.3e-05,2.4e-05,6.8e-05,-9e-06,-2e-06,2e-06,9e-06,-8e-06,4e-06,0,2e-06,5.2e-05,-2.6e-05
8e-06,-4e-06,4e-06,1e-06,2e-06,0,4e-06,-6e-06,-1e-06,7e-06,5e-06,-6e-06,-9e-06,-2.5e-05,8e-06,0,-3.2e-05,-3.2e-05,1e-06,-1e-06,-5e-05,-4e-06,2e-06,1.4e-05,2e-06,-2.1e-05,-1e-05,-3e-06,-1e-06,1.2e-05,0,1.4e-05,-5.8e-05,-3e-06,-3e-06,2e-06,-5e-06,5e-06,-3e-06,2e-06,1e-06,-1.1e-05,-1e-06,1.4e-05,-2.7e-05,-2e-06,-3.5e-05,2e-06,-3e-06,-6e-06,-1e-06,-1e-06,-1e-06,0,0,2e-06,8e-06,-3.3e-05,-1e-05,1e-05,6e-06,3e-06,-9e-06,-1e-06,-4e-06,3.6e-05,0,0,1e-06,5e-06,-1e-06,5e-06,-3e-06,-4e-06,7e-06,-2.5e-05,1.5e-05,-9e-06,-1e-05,-2.5e-05,6e-06,-3.5e-05,4e-06,-5.4e-05,1.8e-05,0,4e-06,2.7e-05,1e-05,0,-2e-06,-2.2e-05,-1.9e-05,3e-06,-1.8e-05,-3e-06,-9e-06,-2.1e-05,-6e-06,-1.5e-05,1.7e-05,-2e-06,-2e-06,-7e-06,5e-06,1.8e-05,-1.1e-05,-3.1e-05,-3.4e-05,-1.5e-05,2.2e-05,1.1e-05,-3e-06,-4e-06,3e-06,0,1.1e-05,8e-06,3.4e-05,-1.4e-05,-7e-06
8e-06,8e-06,-2e-06,-2e-06,-1e-06,-1e-06,-2e-06,1.7e-05,-1e-06,0.000103,1.7e-05,-4e-06,5e-06,2.9e-05,5e-06,-5e-06,1.2e-05,8e-06,0,2e-06,-4.9e-05,2e-06,0,2e-06,7e-06,2e-06,2.1e-05,1e-06,0,3.9e-05,3e-06,-1.3e-05,-1.4e-05,1e-06,4e-06,-4e-06,3e-06,2e-06,2e-06,1e-06,-8e-06,9e-06,-6e-06,-1.4e-05,1.5e-05,-8e-06,2e-06,-3e-06,1e-06,0,0,3e-06,2e-06,0,-5e-06,0,8e-06,1.8e-05,6e-06,2e-06,-2.3e-05,-2e-06,4e-06,-3e-06,1.1e-05,-2.2e-05,0,-4e-06,-1e-06,-3e-06,2e-06,-5e-06,0,3e-06,1.5e-05,1.4e-05,-1.1e-05,0,9e-06,-4e-06,-1.2e-05,1.3e-05,0,0,-4e-06,-3e-06,-1.3e-05,-1.3e-05,-1.2e-05,6e-06,-6e-06,-7e-06,1.9e-05,2e-06,-5.2e-05,-1e-06,3.3e-05,9e-06,7e-06,9e-06,-6e-06,6e-06,0,1e-06,5e-06,-1e-06,8e-06,2.6e-05,-1.2e-05,1.7e-05,-9e-06,-9e-06,4e-06,-6e-06,-1.7e-05,-1e-05,-2.8e-05,3e-06,-1.4e-05,2.5e-05,1.4e-05
-9e-06,-1e-05,2e-06,-4e-06,-2e-06,0,5e-06,-7e-06,0,2.4e-05,-3.1e-05,-2e-06,-3e-06,-3e-05,-3e-06,9e-06,3.1e-05,7e-06,1e-06,-1e-06,-3.9e-05,1e-06,-5e-06,-1.2e-05,-1.2e-05,-9e-06,-1.1e-05,-1e-06,3e-06,-3.9e-05,-1e-06,0,1e-05,-3e-06,-1e-06,1e-06,-1e-06,-1e-06,-3e-06,4e-06,1e-06,3e-06,4e-06,5e-06,-5e-06,-3e-06,6e-06,1e-06,0,-6e-06,-2e-06,2e-06,-2e-06,0,1e-06,1e-06,-3e-06,7e-06,-4e-06,-1e-06,1.6e-05,2e-06,2e-06,-1e-06,-1.4e-05,5e-06,1e-06,9e-06,1e-06,-2e-06,0,5e-06,0,2e-06,1e-05,-1.1e-05,5e-06,5e-06,9e-06,9e-06,-1e-06,4.9e-05,-1e-05,5e-06,8e-06,7e-06,9e-06,1.3e-05,-1.8e-05,-9e-06,-4e-06,2e-06,2.9e-05,0,1e-05,1e-06,1.2e-05,6e-06,1.2e-05,-2e-06,-5e-06,-1e-06,-4e-06,-1e-06,-4e-06,0,9e-06,-3.1e-05,3.8e-05,-2.4e-05,-4.2e-05,1e-06,-2e-06,2e-06,3e-05,-6e-06,3e-05,1e-06,-9e-06,5.3e-05,2e-06
1e-06,1.2e-05,1e-06,-3e-06,-2e-06,0,-5e-06,0,1e-06,-2.4e-05,1.9e-05,1e-06,0,2.8e-05,-4e-06,-2e-06,1.2e-05,1.9e-05,1e-06,1e-06,0.000128,-1e-06,4e-06,7e-06,1.1e-05,7e-06,-6e-06,0,-3e-06,-1.7e-05,-1e-06,-1e-06,3.4e-05,6e-06,0,1e-06,0,1e-06,1e-06,4e-06,1e-06,-1e-05,3e-06,-4e-06,-1.1e-05,4e-06,7e-06,1e-06,0,-4e-06,1e-06,1e-06,2e-06,0,-1e-06,-3e-06,-5e-06,-5e-06,0,1.1e-05,-3e-05,-3e-06,-5e-06,-3e-06,1.2e-05,3e-06,-1e-06,-1e-06,0,3e-06,-1e-06,-4e-06,1e-06,-2e-06,0,2e-06,-1.5e-05,-2e-06,4e-06,1.1e-05,9e-06,1.4e-05,-6e-06,4e-05,-9e-06,-1e-05,-5e-06,-1.2e-05,2.5e-05,8e-06,-5e-06,7e-06,1.1e-05,-3e-06,5.9e-05,2e-06,-4.7e-05,-5e-06,-2e-06,-8e-06,1e-05,-5e-06,5e-06,0,-7e-06,4e-06,-7e-06,2.2e-05,-1.3e-05,2.1e-05,-1.8e-05,4e-06,0,2e-06,-3e-05,1.9e-05,-2.1e-05,0,-3e-06,-2.3e-05,-1.2e-05
-2e-06,-1e-05,-2e-06,-3e-06,-3e-06,0,1e-06,-8e-06,0,-3.7e-05,0,3e-06,2e-06,-3e-05,-1e-06,-4e-06,-2.8e-05,-2e-05,0,-1e-06,-6.3e-05,-3e-06,-2e-06,3e-06,-6e-06,6e-06,1.1e-05,0,2e-06,0.000104,2e-06,2e-06,3.9e-05,-4e-06,0,-4e-06,1e-06,-1e-06,0,2e-06,-1e-06,1e-05,-4e-06,9e-06,1.1e-05,5e-06,2.8e-05,-2e-06,-1e-06,2e-06,4e-06,-1e-06,-1e-06,0,1e-06,1e-06,-6e-06,-1.5e-05,1e-06,4e-06,3e-05,4e-06,5e-06,0,-1.2e-05,-4e-06,0,-5e-06,0,4e-06,-3e-06,4e-06,-1e-06,-1e-06,-2.1e-05,1.3e-05,5e-06,-3e-06,-1.2e-05,1.7e-05,0,-3.5e-05,2e-06,-2.1e-05,-2e-06,1.4e-05,1e-05,-6e-06,3e-06,-1e-06,-3e-06,1.3e-05,-3.8e-05,-3e-06,-1.1e-05,-1e-06,1.5e-05,1e-06,-9e-06,1.1e-05,-9e-06,2e-06,-2e-06,-1e-06,4e-06,-1.3e-05,-6e-06,-2.5e-05,-2.9e-05,-1.8e-05,-1.2e-05,-2e-06,2e-06,-3e-06,2.2e-05,9e-06,8e-06,-4e-06,7e-06,3.3e-05,6e-06
5e-06,8e-06,1e-06,1e-06,1e-06,0,2e-06,1.4e-05,-1e-06,-6.4e-05,2.3e-05,1e-06,1e-06,3.3e-05,1e-06,6e-06,-2.3e-05,-4e-06,0,1e-06,-2e-05,4e-06,-1e-06,-3e-06,-1e-06,-3e-06,6e-06,0,-1e-06,-7.4e-05,0,8e-06,1.5e-05,-2e-06,-1e-06,2e-06,-2e-06,-3e-06,-1e-06,-2e-06,3e-06,-3e-06,1e-06,-1e-05,-1e-05,5e-06,3e-06,1e-06,2e-06,-5e-06,3e-06,1e-06,1e-06,0,4e-06,0,-1e-06,1.4e-05,-1e-06,-2e-06,-4.3e-05,-5e-06,-5e-06,-3e-06,1.1e-05,1.1e-05,0,8e-06,0,-7e-06,-4e-06,-4e-06,0,2e-06,-1.1e-05,-1.7e-05,-1e-06,3e-06,-6e-06,1e-06,-6e-06,-3.3e-05,-3e-06,-2.6e-05,9e-06,-1.4e-05,-6e-06,7e-06,-1.7e-05,-2e-06,0,0,-1.4e-05,1e-06,-5.2e-05,2e-06,1.4e-05,-6e-06,-3e-06,-1e-06,1e-06,3e-06,3e-06,0,8e-06,5e-06,5e-06,1.9e-05,2.8e-05,2.1e-05,-3.3e-05,-1e-06,5e-06,-6e-06,-1.5e-05,-6e-06,-5e-06,-4e-06,7e-06,-1e-05,1.9e-05
-1e-06,-1e-05,-2e-06,3e-06,1e-06,0,1e-06,-8e-06,1e-06,1.7e-05,-2.6e-05,1e-06,-1e-06,-3.2e-05,-1e-06,-2e-06,8e-06,-6e-06,0,-2e-06,-5.7e-05,-2e-06,1e-06,-7e-06,7e-06,6e-06,-3.4e-05,0,0,-9e-06,-2e-06,-1.1e-05,-4.1e-05,7e-06,1e-06,-2e-06,2e-06,0,1e-06,-1e-06,1e-06,-6e-06,1e-06,6e-06,7e-06,-5e-06,-1.8e-05,1e-06,0,9e-06,4e-06,-1e-06,-1e-06,0,-3e-06,1e-06,3e-06,1.3e-05,2e-06,-1e-06,3.4e-05,4e-06,3e-06,-2e-06,-1.1e-05,-2.2e-05,0,-1e-06,0,4e-06,4e-06,5e-06,1e-06,0,1.1e-05,2e-05,3e-06,3e-06,2e-06,-1.2e-05,-2e-06,9e-06,2e-06,1.3e-05,-1.1e-05,1.2e-05,4e-06,-1e-05,-7e-06,6e-06,0,-4e-06,1.2e-05,1e-06,1e-06,0,2.2e-05,2e-06,3e-06,-7e-06,7e-06,-2e-06,-1e-06,3e-06,-4e-06,0,1e-06,-1.7e-05,1e-05,-1.6e-05,2.2e-05,6e-06,-5e-06,0,6e-06,-4e-06,2e-06,0,-7e-06,-4.7e-05,-4e-06
