6e-06,6e-06,1.8e-05,3.5e-05,8e-06,2.5e-05,4.5e-05,0.000102,0.000149,4.8e-05,6.3e-05,2.3e-05,1.6e-05,5.9e-05,6.3e-05,3.9e-05,8.7e-05,0.000145,0.000255,0.000161,0.00119,0.000103,0.001085,5e-06,0.000119,0.000249,0.000431,0.000998,0.000938,5.8e-05,0.00038,4.5e-05,2.9e-05,0.00055,3.8e-05,0.000104,0.000694,0.00012,0.00057,0.000416,5.9e-05,0.000802,0.00036,0.000235,0.000103,0.000395,0.000396,0.000157,8.5e-05,0.000101,5.5e-05,0.000108,8.6e-05,6.4e-05,0.000316,0.00017,2.5e-05,3.4e-05,0.000141,3.4e-05,4.8e-05,7.2e-05,1.3e-05,2.9e-05,6.8e-05,3.3e-05,0.000313,1e-06,8.1e-05,2.9e-05,6e-06,2.2e-05,0.000115,0.000137,3.9e-05,8.7e-05,0.000125,0.000151,2.5e-05,0.000103,9e-06,0,0.000101,6.4e-05,4.7e-05,4e-05,6e-06,3.4e-05,1.8e-05,1.9e-05,1e-06,2.2e-05,3e-05,1.8e-05,7.3e-05,1.1e-05,4e-06,2.4e-05,1.2e-05,2e-06,1.2e-05,1.3e-05,5e-05,5e-06,2.8e-05,5.5e-05,8.2e-05,2.7e-05,5.7e-05,9e-06,3.9e-05,5e-06,2.8e-05,1e-05,4e-06,2e-06,2.1e-05,3.1e-05,5.4e-05,2.9e-05,0.000253
4.6e-05,2e-06,3.1e-05,3.6e-05,5.5e-05,5.5e-05,0.00011,0.00023,0.000307,1.8e-05,0.000133,0.000121,2.8e-05,0.000156,0.000171,9.4e-05,0.000296,0.000857,0.000634,0.000837,0.003091,0.001549,0.002555,0.000981,0.00048,0.002161,0.001976,0.001862,0.003799,0.00219,0.000997,0.000616,0.001153,0.001035,0.000802,0.000496,0.001401,0.001242,0.000586,0.000215,0.000451,0.000793,0.001,0.000721,0.000205,0.000687,0.000863,0.000392,9.9e-05,0.000287,0.000246,0.000241,0.00026,0.000256,0.000407,0.000562,0.000431,0.000402,0.000273,0.000306,0.000267,0.000251,0.000282,6.8e-05,9.7e-05,0.000174,0.00079,0.000234,0.000371,0.000243,0.000146,0.000193,0.000252,0.000475,0.000395,0.000375,0.000264,0.000561,0.000699,0.00045,0.000269,0.000128,0.00049,0.000461,0.000305,0.000141,0.000105,0.00013,8.9e-05,4.4e-05,4.2e-05,6.1e-05,9.8e-05,7.2e-05,0.000132,5.5e-05,1.4e-05,2.3e-05,2.8e-05,3e-06,2.2e-05,6e-05,0.000115,0.000103,6.5e-05,0.000216,0.000303,0.000117,0.000126,8.2e-05,7e-05,5.5e-05,4.1e-05,4.1e-05,4.5e-05,3e-05,4.3e-05,0.000109,9.4e-05,0.000121,0.001335
2.9e-05,3.9e-05,1.9e-05,6.2e-05,5.5e-05,1.2e-05,6.5e-05,0.000432,0.000148,0.000169,4.9e-05,0.000149,1.4e-05,0.000131,0.000249,0.000139,0.000267,0.000957,0.00047,0.000377,0.002616,0.00396,0.002922,0.001918,0.00056,0.002748,0.002363,0.001983,0.002569,0.001114,0.000806,0.000216,0.000981,0.001168,0.001193,0.001067,0.000736,0.000521,0.001036,0.001447,0.001473,0.002416,0.000776,0.000282,0.000283,0.00117,0.000983,0.000875,0.000579,0.000283,0.000313,0.000504,5e-04,0.000356,0.00075,0.000723,0.000549,0.00033,0.000153,0.00024,0.000176,2.8e-05,0.000323,0.000381,0.000222,0.00021,0.000684,0.000922,0.000335,5.6e-05,0.000139,0.000207,0.000102,0.000274,0.000303,9.7e-05,0.000301,0.00052,0.000223,1.7e-05,8.1e-05,0.000228,0.000639,0.000264,0.000163,0.000198,4.3e-05,7.4e-05,6.2e-05,4.8e-05,3.4e-05,2.9e-05,5.8e-05,1.2e-05,5.3e-05,6.4e-05,2.4e-05,6e-06,5.4e-05,5.2e-05,9e-06,7.5e-05,5.4e-05,3.7e-05,2e-05,0.00032,0.000585,0.000409,5.6e-05,4.5e-05,6.5e-05,9e-06,2.3e-05,3.6e-05,1.9e-05,1.2e-05,3.6e-05,0.000101,7.2e-05,4.2e-05,0.00233
6.3e-05,5.2e-05,2e-05,6.5e-05,3.8e-05,5.2e-05,2.8e-05,0.000422,0.000314,7.2e-05,0.000176,0.000271,0.000112,4.9e-05,6.7e-05,8.4e-05,0.000455,0.000584,0.000201,0.000675,0.002604,0.004112,0.001698,0.001811,0.000976,0.002424,0.000536,0.001902,0.00094,0.001626,0.000805,0.000684,0.000405,0.000593,0.001083,0.000843,0.001449,0.00107,0.001658,0.000789,0.00081,0.002442,0.002021,0.002133,0.000732,0.001511,0.000758,0.00046,0.000262,0.000481,0.000321,0.000429,0.000531,0.000841,0.000296,0.000706,0.000271,2e-04,0.000359,0.000165,0.00034,0.000242,0.000665,0.000496,0.000203,8.4e-05,0.000837,0.001225,5e-04,0.000139,0.000193,0.000394,2e-04,0.000106,9.9e-05,0.000356,0.000266,0.000338,0.000439,0.00031,0.000131,0.000317,0.000436,0.000475,0.00025,4.8e-05,0.000123,6.2e-05,7.4e-05,4.1e-05,4.1e-05,5.8e-05,3.5e-05,3.8e-05,2.2e-05,0.000119,8.8e-05,7e-05,5.6e-05,3.8e-05,3.3e-05,7.2e-05,7.4e-05,6.6e-05,4.3e-05,0.000391,0.000719,0.000676,0.00054,0.000217,5.8e-05,5.5e-05,6.5e-05,5e-05,2.6e-05,3.6e-05,5e-05,7.8e-05,6.9e-05,6.7e-05,0.002425
1.3e-05,2e-05,1.5e-05,3.3e-05,4.7e-05,4e-05,8e-05,0.00035,0.000832,0.000401,0.000225,0.000285,0.000197,0.000161,0.000412,0.000391,0.000748,0.000963,0.000672,0.000515,0.002533,0.003612,0.005055,0.002474,0.001468,0.003504,0.002442,0.002837,0.00235,0.002745,0.000882,0.000301,0.001016,0.000406,0.001242,0.001109,0.002803,0.003103,0.001035,0.002689,0.001319,0.003618,0.001788,0.000995,0.000597,0.002019,0.001363,0.001015,0.00125,0.001421,0.00092,0.000779,0.000582,0.000822,0.000829,0.000448,0.000315,0.000149,0.000377,0.000236,2e-04,0.000281,0.000593,0.000199,0.000133,7.8e-05,0.00087,0.001148,0.00087,0.000362,7.9e-05,0.000334,0.00024,0.000185,8.4e-05,0.000444,0.000411,0.000553,0.000345,0.000142,7.1e-05,0.000432,0.000478,0.000326,0.000116,6.7e-05,8e-05,5.6e-05,4.7e-05,1.6e-05,1.5e-05,4.6e-05,3.4e-05,1.6e-05,7.8e-05,4.2e-05,1.8e-05,3e-05,1.6e-05,1.8e-05,1.8e-05,1.6e-05,5e-06,3.7e-05,9e-06,0.000281,0.000581,0.000206,0.00018,7e-05,3e-05,6.7e-05,1.3e-05,2.4e-05,2.3e-05,4.6e-05,8e-06,8.8e-05,0.000103,1.6e-05,0.001219
1e-05,2.2e-05,2.7e-05,3e-05,5.2e-05,6.3e-05,4.4e-05,0.00097,0.000642,0.000173,9.5e-05,8.8e-05,0.000111,0.000159,0.000482,0.000286,0.000498,0.000344,0.000502,0.000702,0.00193,0.003197,0.003031,0.001586,0.002127,0.004339,0.004868,0.002355,0.001012,0.001666,0.000366,0.000582,0.001663,0.001695,0.001542,0.002468,0.002143,0.002531,0.004707,0.00444,0.002378,0.002585,0.000671,0.000822,0.000344,0.002013,0.001203,0.00064,0.000385,0.000669,0.000289,0.000598,0.001717,0.000403,0.000109,0.000449,0.000174,7.2e-05,0.000482,0.000341,0.000396,0.000224,0.000627,0.000207,0.000159,0.00015,0.000875,0.001029,0.000371,0.000236,0.000163,0.000448,0.000176,0.000156,6.8e-05,0.000496,0.000945,0.000651,0.000247,9.9e-05,0.00017,0.000534,0.000494,0.000325,0.000129,7.2e-05,4.5e-05,9.6e-05,7e-05,3.6e-05,3.3e-05,2.4e-05,4.6e-05,2.1e-05,8.8e-05,7e-06,2.1e-05,1.1e-05,3.7e-05,2.2e-05,2e-05,1.1e-05,1.2e-05,1.6e-05,7e-06,0.000273,0.000551,0.000195,0.000109,7.1e-05,2.2e-05,2.4e-05,3.7e-05,2.2e-05,1.1e-05,2.9e-05,3.4e-05,0.000128,5.8e-05,8e-06,0.000804
6e-06,1.9e-05,4e-06,4.8e-05,5e-06,6e-06,4.4e-05,0.00158,0.001656,0.000793,0.000179,8e-05,0.00018,0.000125,0.000357,0.000289,0.00049,0.001722,0.000258,0.000589,0.00219,0.001562,0.00371,0.007011,0.002911,0.006945,0.004447,0.001192,0.004791,0.002358,0.003436,3.3e-05,0.0029,0.002495,0.003749,0.001397,0.00256,0.002657,0.004107,0.00126,0.00146,0.002148,0.003757,0.002007,0.001139,0.002301,0.004373,0.002397,0.001472,0.000101,0.000298,0.000932,0.002927,0.001944,0.000771,0.000156,0.000323,0.00027,0.000528,0.000363,0.000196,5.7e-05,0.000246,0.000445,0.000228,2.3e-05,0.000945,0.000837,0.000262,9.1e-05,0.000194,0.000422,0.000336,0.000124,3.3e-05,0.000445,0.001511,0.000647,0.000255,0.000126,0.000208,0.00034,0.000461,0.000601,0.000308,6.9e-05,0.000129,9e-05,1.1e-05,3.1e-05,2.5e-05,2.2e-05,6e-06,4.1e-05,0.000131,5.3e-05,5.1e-05,6.9e-05,2.3e-05,2.4e-05,2.8e-05,1.3e-05,2.9e-05,3e-05,1.5e-05,0.000545,0.000766,0.000379,0.000161,4.3e-05,4.6e-05,4e-05,1e-05,3e-05,2.1e-05,1e-05,1.9e-05,0.000149,0.000201,5.4e-05,0.002969
4.1e-05,3.5e-05,1.2e-05,4.8e-05,3.7e-05,8.3e-05,3.6e-05,0.001676,0.004383,0.002031,0.000563,4.7e-05,0.000126,0.000396,7.4e-05,0.000485,0.000223,0.001563,0.002184,0.001377,0.002914,0.001134,0.002454,0.007678,0.006105,0.011679,0.006081,0.003496,0.006552,0.005227,0.005063,0.00452,0.003761,0.001663,0.003226,0.004891,0.006254,0.005129,0.008218,0.005209,0.002603,0.003079,0.005947,0.005479,0.003782,0.003387,0.0034,0.002484,0.001764,0.000758,0.000109,0.001483,0.002412,0.001557,0.001249,0.000267,0.000287,0.000361,0.000529,0.000479,0.000274,7.7e-05,7.5e-05,0.000478,0.000613,0.000344,0.00091,0.000825,0.000929,0.000492,9.2e-05,0.000514,0.000219,7.6e-05,7.7e-05,0.000418,0.001501,0.000745,0.000185,0.000134,0.000316,0.000597,0.000796,0.000317,0.000235,0.000241,6.5e-05,0.000173,0.000108,7e-05,3e-05,1.5e-05,3.7e-05,6.7e-05,0.000131,5.9e-05,3.4e-05,4.9e-05,6.9e-05,8.2e-05,8e-05,7.4e-05,2.9e-05,3.6e-05,3.7e-05,0.000707,0.000905,0.000874,0.000323,0.000228,7.4e-05,6.3e-05,2.6e-05,2.9e-05,3e-05,2.5e-05,2.2e-05,0.000174,0.000391,0.000248,0.005291
2.5e-05,1.5e-05,1.9e-05,3e-05,9e-06,0.000119,0.000129,0.001228,0.004018,0.002718,0.001153,2e-04,0.000169,0.000456,0.000843,0.000795,0.000448,0.000496,0.001332,0.000624,0.00383,0.001854,0.003124,0.004302,0.003689,0.007435,0.002482,0.002127,0.005904,0.005297,0.001002,0.001897,0.000306,0.000797,0.002125,0.002117,0.004171,0.005991,0.003267,0.003195,0.002149,0.001157,0.003711,0.003463,0.00252,0.002728,0.000859,0.000658,0.00049,0.001133,0.001079,0.000689,0.000463,0.000536,0.000411,5e-04,0.000576,0.000299,0.000408,4e-05,0.000151,0.00028,7.1e-05,0.000388,5.9e-05,7.4e-05,0.001104,0.001573,0.001011,0.00049,0.000121,0.000307,0.000123,4.7e-05,9.4e-05,0.000184,0.001152,0.001168,0.000646,0.000212,0.00017,0.000333,0.000606,0.000415,0.000346,0.000205,2.1e-05,0.000192,0.000133,9.2e-05,4.9e-05,3.6e-05,3.2e-05,4e-05,0.000103,7.2e-05,5.9e-05,5.3e-05,2.1e-05,8.3e-05,4.6e-05,8.9e-05,8.1e-05,6.3e-05,7.8e-05,0.000674,0.00037,0.001234,0.000804,0.000463,0.000158,7.6e-05,4.3e-05,4e-06,1.1e-05,6e-06,4e-05,0.000197,0.000185,0.000211,0.006566
1e-05,8e-06,1.6e-05,3.4e-05,4.2e-05,0.000129,0.000113,0.000709,0.002937,0.002036,0.000925,0.000101,0.00026,0.000278,0.000667,0.000899,0.000467,0.00155,0.001595,0.001502,0.002649,0.00238,0.001826,0.001504,0.003445,0.000544,0.001936,0.001124,0.001857,0.001751,0.00117,0.001669,0.000618,0.000608,0.003038,0.002711,0.002072,0.000862,0.002665,0.00136,0.000334,0.00156,0.0017,0.000614,0.001472,0.000484,0.00035,0.000813,0.000312,0.000546,0.001032,0.001075,0.000688,0.00025,0.000427,0.000179,0.00033,0.000104,7.9e-05,6.5e-05,0.000174,0.000124,0.000497,0.000556,0.000217,6.2e-05,0.000987,0.002835,0.001014,0.000333,4.3e-05,0.00015,0.00014,0.000101,0.000235,0.000186,0.000725,0.000669,0.00024,0.000118,6e-05,0.000385,0.000265,0.000182,0.000329,0.000307,0.00028,0.000138,1.2e-05,2.6e-05,4.3e-05,3e-05,6.2e-05,1.7e-05,2e-04,0.000121,0.000107,7e-05,6.7e-05,6.9e-05,8e-05,6.1e-05,1.4e-05,3.5e-05,2.1e-05,0.000455,0.000151,0.001226,0.001424,0.000524,8.3e-05,1.8e-05,2.7e-05,3.1e-05,7e-06,1.5e-05,4.5e-05,0.000119,0.00031,0.000217,0.006217
1e-05,6e-06,1.4e-05,1.1e-05,3.7e-05,5.9e-05,2.2e-05,0.000226,0.001485,0.000509,0.000296,0.000307,0.000476,0.000413,0.00022,0.00025,0.000334,0.002873,0.001433,0.001084,0.003019,0.002554,0.00169,0.002777,0.004612,0.001482,0.000967,0.001252,0.001702,0.001477,0.000522,0.001094,0.000806,0.001374,0.00129,0.000674,0.000795,0.000365,0.000327,0.000466,0.000497,0.001407,0.001291,0.001012,0.00056,0.000663,0.000495,0.00089,0.00026,0.000501,0.00033,0.00051,0.000805,0.000369,0.000532,0.000173,0.000312,0.000112,0.000311,0.000106,4.3e-05,0.00023,0.000824,0.000522,0.000413,3.5e-05,0.000915,0.00347,0.002213,0.000909,0.000253,3.7e-05,5.2e-05,5.3e-05,0.000287,0.000186,0.000307,0.000236,0.000279,0.00027,0.000211,0.000334,0.000177,0.000131,0.000194,0.000423,7.5e-05,0.000255,0.000152,5e-06,4.2e-05,3.6e-05,6.5e-05,5.3e-05,0.000223,0.000159,6.2e-05,2e-05,4e-05,1.5e-05,4.6e-05,3e-06,3.4e-05,3.1e-05,2e-05,0.000181,0.000693,0.000922,0.000773,0.000605,0.000269,0.000118,5.2e-05,1e-05,4.4e-05,3e-05,3e-05,0.000121,0.00042,0.00027,0.004555
1.6e-05,8e-06,1.5e-05,1.1e-05,4.8e-05,3.8e-05,3.4e-05,0.000354,0.00053,0.000112,8.8e-05,0.000162,0.000163,0.000218,0.000177,9.9e-05,0.000541,0.002408,0.001355,0.000399,0.002052,0.000543,0.001026,0.002957,0.001692,0.001796,0.001636,0.001065,0.001621,0.000855,0.000807,0.002,0.000865,0.001472,0.000509,0.002091,0.000197,0.000559,0.000982,0.000797,0.001611,0.001186,0.001228,0.001672,0.00042,0.000974,0.000371,0.00065,0.000154,0.000217,0.000217,0.000485,0.000382,7.4e-05,0.00041,0.000156,0.000281,0.000153,0.000157,5.3e-05,0.000111,0.000355,0.00063,0.000221,0.000153,9.5e-05,0.000845,0.00287,0.001706,0.000695,0.000275,6.5e-05,3.9e-05,9.8e-05,0.000223,0.00012,0.00033,8.6e-05,0.000195,7.3e-05,0.00015,0.000234,4.6e-05,8.3e-05,0.000133,0.00016,0.000208,0.000417,0.000202,9.5e-05,4.4e-05,5.2e-05,5e-06,2.6e-05,0.000158,0.000107,4e-05,1.6e-05,8e-06,3.8e-05,5.2e-05,2.8e-05,3.3e-05,2.1e-05,1.9e-05,4.9e-05,0.000691,0.000743,0.000471,0.000196,4.2e-05,3.6e-05,1.7e-05,1.3e-05,3.4e-05,1.3e-05,2.1e-05,0.000106,0.000269,8.9e-05,0.003146
6e-06,6e-06,6e-06,4e-06,3.9e-05,3.6e-05,3.5e-05,0.000692,0.000342,0.000142,5.2e-05,0.000125,0.000183,0.000188,0.000141,0.000117,0.000884,0.000406,0.000144,0.000124,0.001577,0.001854,0.00105,0.002589,0.000891,0.001672,0.001371,0.001324,0.000897,0.00021,0.001058,0.002022,0.000863,0.002738,0.000557,0.001386,0.000792,0.001777,0.001115,0.003271,0.001015,0.002173,0.000755,0.00016,0.000338,0.001311,0.000565,0.000496,0.000318,0.000386,0.000261,0.000523,0.000761,0.000185,0.00049,0.000184,0.000165,6.1e-05,0.000233,0.000122,0.000119,0.000411,0.000258,0.000304,0.000272,5.3e-05,0.000807,0.001582,0.000725,0.00025,0.000194,0.000117,0.000121,0.00026,0.000121,0.000144,0.00038,0.000276,0.000125,0.000139,6.9e-05,0.000231,4.9e-05,9.2e-05,0.000102,3e-05,0.000106,0.000229,0.000143,6.6e-05,1.8e-05,5.2e-05,4.3e-05,1.3e-05,0.000101,8.2e-05,5.3e-05,2.5e-05,1.9e-05,5.3e-05,3.8e-05,3e-06,3e-05,1.5e-05,1.1e-05,5.1e-05,0.000705,0.001147,0.000401,0.000146,7.6e-05,2.7e-05,2.7e-05,1.3e-05,1.8e-05,1e-05,2.2e-05,8.1e-05,6.9e-05,5e-05,0.00232
1.5e-05,1.6e-05,1.8e-05,1.4e-05,6.7e-05,7e-06,1.1e-05,0.000741,0.000322,3.8e-05,7e-05,9.1e-05,0.000408,0.000234,9.3e-05,0.000131,0.001427,0.000318,0.000456,0.000383,0.001246,0.002868,0.001275,0.001879,0.00224,0.002637,0.0026,0.001329,0.001031,0.001617,0.001429,0.003361,0.002709,0.004455,0.002679,0.002239,0.001298,0.001943,0.001037,0.003024,0.000809,0.000606,0.001738,0.000961,0.001886,0.001364,0.000371,0.000964,0.001302,0.000835,0.000486,0.000928,0.000874,0.000479,0.000816,0.000362,0.000385,0.00018,0.000334,0.00024,0.000196,0.00044,0.000732,0.000219,0.00021,9.5e-05,0.000865,0.000683,0.000297,0.000177,0.000174,0.00012,6.6e-05,0.000375,5.7e-05,0.000164,0.000427,0.000116,5.9e-05,8e-05,3.6e-05,0.000241,1.8e-05,0.000116,4.8e-05,7e-05,9.7e-05,8.4e-05,6e-05,8.3e-05,5.7e-05,8e-05,2.7e-05,3.9e-05,0.000122,3.5e-05,2.6e-05,1.1e-05,2.7e-05,2.1e-05,5.4e-05,2.2e-05,2e-05,2.7e-05,2.7e-05,8.4e-05,0.000672,0.000287,0.000457,0.000169,2.5e-05,3.2e-05,1.5e-05,1.9e-05,4.1e-05,1.2e-05,2.3e-05,0.000102,7.1e-05,1.8e-05,0.000775
1.2e-05,1.3e-05,2.2e-05,0,8.6e-05,6.4e-05,5.5e-05,0.000452,0.000374,0.000187,0.000164,5.5e-05,0.000725,0.000242,0.000246,0.000113,0.001818,0.001973,0.000825,0.000179,0.00136,0.004835,0.00154,0.003752,0.002665,0.002801,0.001391,0.002106,0.003339,0.003446,0.002478,0.003139,0.000771,0.002801,0.002218,0.003414,0.003454,0.002851,0.00165,0.003375,0.000574,0.003721,0.001921,0.003468,0.002487,0.001901,0.000373,0.002038,0.001445,0.00049,0.000672,0.000343,0.001118,9.8e-05,0.00098,0.000495,8.4e-05,0.00023,0.000232,0.000176,0.000474,0.000726,0.000336,0.000131,0.000334,4.8e-05,0.000837,0.000751,0.000706,0.000237,0.000131,0.000208,0.000134,0.000378,0.000309,2e-05,0.000248,0.000276,0.000246,8.3e-05,8.4e-05,0.000376,0.000222,0.000232,0.00022,0.000111,3.7e-05,0.000172,0.000129,3.2e-05,4.2e-05,4.3e-05,3.7e-05,6.5e-05,0.000127,8.9e-05,6.5e-05,3.6e-05,2.5e-05,1.7e-05,4.2e-05,2e-05,1.8e-05,1.8e-05,1.1e-05,0.000176,0.000339,0.000396,7.2e-05,8.4e-05,5.4e-05,5.2e-05,4.2e-05,1.5e-05,6.3e-05,3.7e-05,4.3e-05,0.000108,9.1e-05,4.6e-05,0.001269
1.7e-05,2.6e-05,1.8e-05,1.8e-05,6.3e-05,8.8e-05,9e-06,2.7e-05,0.000641,0.000281,0.000216,0.000206,0.000795,0.000647,0.00033,5e-05,0.001918,0.002194,0.001135,0.000264,0.001281,0.006617,0.005528,0.006082,0.001596,0.004699,0.00823,0.003579,0.004882,0.005087,0.004747,0.003767,0.00557,0.00157,0.005671,0.003229,0.00726,0.009371,0.003966,0.005085,0.005377,0.008615,0.007954,0.001982,0.004667,0.003682,0.00332,0.003462,0.003259,0.003484,0.00142,0.000398,0.002126,0.001375,0.00102,0.000925,0.001012,0.000633,0.00097,0.000494,0.000656,0.000306,0.001073,0.000455,0.001283,0.000539,0.000776,0.001288,0.000551,0.00029,0.000287,0.000377,0.000252,0.000392,0.000356,0.000299,0.000256,0.000366,0.000262,0.000179,0.000158,0.000311,0.000207,4.3e-05,0.000158,8.6e-05,9.3e-05,0.000198,0.000102,7.1e-05,7.2e-05,5.1e-05,2.6e-05,5.1e-05,0.000139,6.7e-05,7.8e-05,4.6e-05,3.8e-05,2.4e-05,4.4e-05,6e-06,1.1e-05,1.1e-05,1.3e-05,0.000273,0.000517,0.000437,0.000262,7.7e-05,2.7e-05,5.8e-05,2.3e-05,4.5e-05,4.3e-05,2.2e-05,2.8e-05,0.00016,8.7e-05,5.4e-05,0.00185
3.4e-05,3.7e-05,3.7e-05,4.1e-05,1.5e-05,4.4e-05,8.6e-05,0.000219,0.00023,0.000132,6.1e-05,0.000109,0.000998,0.00064,0.000489,0.000516,0.001841,0.000409,0.000431,0.000238,0.001224,0.004939,0.00846,0.004651,0.008773,0.00416,0.007091,0.009496,0.012009,0.013044,0.005724,0.006225,0.012682,0.013602,0.013426,0.007028,0.003603,0.004038,0.003358,0.005998,0.01072,0.004568,0.002624,0.004256,0.006144,0.00654,0.010556,0.008861,0.005908,0.002877,0.002447,0.001699,0.002259,0.002577,0.003119,0.002333,0.000936,0.000841,0.002071,0.001265,0.000483,0.001168,0.001296,0.001464,0.002111,0.001259,0.001274,0.001687,0.001435,0.001487,0.001146,0.001034,0.000763,0.000671,0.000286,0.000284,0.000247,0.000456,0.000275,0.000195,9.5e-05,0.000298,5.7e-05,7e-06,0.000209,3.7e-05,0.000205,6.3e-05,5.8e-05,0.000146,9.1e-05,5e-05,4e-05,8.2e-05,0.000252,5.9e-05,8.3e-05,3.1e-05,2e-05,4.3e-05,5.7e-05,2e-05,5e-06,2.2e-05,1.9e-05,0.000295,0.000474,0.000762,6.2e-05,6.8e-05,5.6e-05,4.1e-05,2.4e-05,6.1e-05,7.9e-05,5.7e-05,1.2e-05,0.000168,0.000134,7.3e-05,0.002195
4e-06,5.5e-05,4.2e-05,8e-06,3.5e-05,2.6e-05,5.2e-05,0.000257,0.000224,0.000154,4.1e-05,0.000164,0.000908,0.000535,0.000547,0.00033,0.001463,0.001762,0.000759,0.000378,0.001068,0.004428,0.006468,0.007089,0.008649,0.003156,0.006688,0.007309,0.001676,0.004794,0.008392,0.011017,0.002567,0.005516,0.002498,0.007025,0.005185,0.007458,0.008902,0.010065,0.003723,0.004975,0.003065,0.004151,0.002677,0.001817,0.006633,0.009314,0.006696,0.005102,0.002496,0.003062,0.004404,0.002462,0.002295,0.002176,0.001046,0.000256,0.001481,0.001078,0.0013,0.000507,0.001019,0.001073,0.001655,0.001168,0.001899,0.001251,0.000673,0.001053,0.000598,0.00057,0.000335,0.000555,0.000288,0.000172,0.000204,0.000313,0.000101,4.4e-05,8e-06,0.000138,3e-05,9.9e-05,0.000168,0.000343,0.000148,0.000156,0.000167,0.000133,6.9e-05,3.9e-05,6.4e-05,5.5e-05,0.00024,0.000351,0.000137,5e-05,1.5e-05,4.4e-05,4.7e-05,4.9e-05,1.2e-05,3.5e-05,2.4e-05,0.000198,0.00081,0.001376,0.00098,0.000516,0.000125,4.1e-05,3.1e-05,2.6e-05,3.2e-05,2e-06,1.2e-05,0.000158,0.00037,0.000206,0.003809
7e-06,5e-05,2.2e-05,2e-06,3.8e-05,2.1e-05,3.4e-05,0.000124,0.000376,6.9e-05,2.7e-05,7.4e-05,8e-04,0.000485,5.8e-05,1.9e-05,0.00141,0.000409,7e-04,0.000478,0.000941,0.001669,0.004017,0.004888,0.000568,0.00223,0.00243,0.003558,0.003801,0.002002,0.007156,0.000899,0.00315,0.003361,0.003518,0.005888,0.004924,0.004064,0.004781,0.001156,0.00388,0.00213,0.003457,0.001589,0.001983,0.001015,0.003134,0.002403,0.001539,0.000955,0.001038,0.00177,0.000791,0.000426,0.001119,0.001322,0.000844,0.00049,0.000576,4.2e-05,0.000577,0.000632,0.000989,6e-05,0.00085,0.000377,0.001423,0.001597,0.000612,0.000592,0.000235,0.000294,0.000409,0.000145,2.5e-05,9.8e-05,0.000281,0.00018,0.000235,0.00014,7.9e-05,0.000159,7e-05,0.00012,0.000254,0.000666,0.000185,0.000234,0.000147,0.000134,6.6e-05,7.5e-05,0.000113,9.1e-05,0.000371,0.000559,0.000352,0.00012,2e-05,3.1e-05,2.4e-05,2e-05,2.4e-05,3.6e-05,1.3e-05,7.4e-05,0.00059,0.000799,4e-04,7.5e-05,0.000141,5.9e-05,3.2e-05,4.5e-05,3.6e-05,2.6e-05,8e-06,0.000148,0.00033,0.000183,0.004661
1.5e-05,1.9e-05,1.5e-05,9e-06,4e-05,1e-05,5.6e-05,0.000112,0.000267,0.000283,0.00013,6.9e-05,0.000494,0.000652,0.000516,0.000368,0.001109,0.00159,0.000871,0.000256,0.000712,0.001944,0.003083,0.00054,0.000329,0.001313,0.000345,0.002408,0.000135,0.001686,0.003866,0.002075,0.000716,0.001064,0.00115,0.003614,0.003926,0.003251,0.004067,0.00126,0.002366,0.003213,0.005884,0.005049,0.00343,0.003029,0.002591,0.000932,0.001337,0.000511,0.000513,0.000543,0.001169,0.001046,0.001839,0.001211,0.000574,0.000461,0.000314,0.000232,0.000259,0.00038,0.000149,0.000147,0.00016,0.000124,0.001223,0.001806,0.000908,0.000294,7.1e-05,9.6e-05,8.3e-05,0.000221,0.000178,0.000162,0.000364,0.000208,0.000147,0.000151,8.3e-05,0.000164,0.000174,4.2e-05,0.000251,0.000586,0.000725,0.000426,4.2e-05,3.3e-05,4.2e-05,9.8e-05,0.000108,5.7e-05,0.000384,0.000524,0.000181,1.3e-05,2.6e-05,3.6e-05,1.1e-05,2.3e-05,1.2e-05,3.6e-05,2.7e-05,7.4e-05,0.000426,0.000274,0.000166,0.000115,7.1e-05,1.4e-05,1.8e-05,2.9e-05,1.6e-05,7e-06,2.1e-05,0.000119,0.000136,7.1e-05,0.003724
8e-06,5e-06,1e-05,7e-06,2.8e-05,3.1e-05,6.4e-05,0.000212,0.000395,0.000171,5.4e-05,0.000114,0.000277,0.000528,0.000223,0.00023,0.000828,0.001119,0.001303,0.000773,0.00102,0.001609,0.002696,0.002443,0.001022,0.002217,0.003042,0.002496,0.002587,0.001192,0.001335,0.000928,0.001526,0.000839,0.002176,0.002687,0.000578,0.003039,0.001709,0.001238,0.001979,0.002459,0.002048,0.003283,0.001805,0.002335,0.001212,0.000918,0.000659,0.000335,0.00034,0.00067,0.001499,0.000362,0.001136,0.000475,0.000152,0.00015,0.000531,0.000311,5.4e-05,0.000246,0.000319,3e-05,0.00036,9.4e-05,0.001143,0.001071,6e-04,0.000342,6.6e-05,2e-04,0.000132,0.000207,0.000272,0.000297,0.000275,0.000255,0.000264,9.3e-05,8.7e-05,0.000106,0.00022,0.00017,0.000353,0.000123,0.000457,0.000484,0.000391,0.00015,9e-06,6.7e-05,1.9e-05,1.4e-05,0.000401,0.00039,0.000234,9.4e-05,3.8e-05,3.2e-05,4.9e-05,4.6e-05,1.8e-05,1.6e-05,9e-06,0.00017,0.000333,0.000247,0.000157,8.3e-05,5.8e-05,2.5e-05,1.5e-05,9e-06,8e-06,2.1e-05,6e-06,0.000116,0.000123,0.000121,0.001679
1.5e-05,1.4e-05,6e-06,1e-06,1e-05,2.9e-05,6e-05,0.000127,0.000336,0.000138,9e-05,0.000145,0.000122,0.00055,0.000376,0.000127,0.000328,0.000514,0.000711,0.000406,0.000978,0.002076,0.001233,0.00052,0.000527,0.002216,0.000298,0.001761,0.001585,0.001189,0.000966,0.000528,0.000956,0.001369,0.001606,0.001786,0.001526,0.001103,0.001131,0.001194,0.000738,0.001047,0.00105,0.000771,0.000718,0.000977,0.001457,0.000859,0.000404,0.000251,0.000227,0.00057,0.000494,0.000402,0.000913,0.000221,0.00021,0.00024,0.000201,0.000117,0.000142,0.000161,0.000149,0.000147,0.000295,0.000103,0.001028,0.000628,0.000314,0.000158,0.00012,0.000243,9.7e-05,0.000165,0.000149,0.000167,0.000319,0.000259,6.4e-05,1.3e-05,7.3e-05,8.6e-05,0.00014,7e-05,0.000238,0.000116,0.000245,0.000134,0.000108,4.7e-05,2.3e-05,1.3e-05,1e-05,1.8e-05,0.000453,0.00036,0.000187,2.4e-05,1.6e-05,3.4e-05,1.2e-05,1.6e-05,1.1e-05,1.2e-05,8e-06,2e-04,0.000463,0.00058,0.000267,4.4e-05,3e-05,2.2e-05,7e-06,7e-06,1.7e-05,1.7e-05,1.2e-05,0.000108,9.3e-05,1.6e-05,0.000363
4e-06,5e-06,2e-06,2e-06,7e-06,1.1e-05,5e-06,4.2e-05,4.2e-05,1.5e-05,1.7e-05,2.7e-05,1e-04,0.000104,0.000131,3.7e-05,0.000214,0.000278,0.000213,0.000155,0.000527,0.000188,0.000593,0.000755,7.7e-05,0.000737,0.000556,0.000767,0.000484,0.000916,0.000495,4e-04,0.000521,0.000635,0.000758,0.000219,0.000416,0.000762,0.000254,0.00028,0.000347,0.000747,0.00033,0.000253,0.000219,0.000449,0.000509,0.000388,0.000274,0.000142,0.000148,0.000179,0.000119,0.000103,0.000247,8.4e-05,8.4e-05,6.1e-05,7.7e-05,2.6e-05,5.1e-05,0.000152,0.000121,4.3e-05,2.7e-05,2.4e-05,0.000417,0.000211,4.5e-05,2.4e-05,4.4e-05,9.7e-05,0.000114,7.6e-05,3.6e-05,5.6e-05,2.1e-05,8.4e-05,1.9e-05,2.6e-05,2.1e-05,2.1e-05,2e-05,2.5e-05,6.6e-05,1.5e-05,5.3e-05,7.8e-05,2.8e-05,1.4e-05,5e-06,5e-06,8e-06,8e-06,0.000213,0.000142,5.7e-05,6e-06,1.9e-05,3e-06,4e-06,2e-06,2e-06,9e-06,9e-06,8.6e-05,0.000271,0.000258,0.000102,2.9e-05,1.3e-05,5e-06,3e-06,2e-06,1.2e-05,1.3e-05,4e-06,3.9e-05,3.4e-05,1.6e-05,0.000646
1e-06,2e-06,4e-06,4e-06,9e-06,3e-06,1.3e-05,3.1e-05,5.4e-05,1.4e-05,9e-06,3.1e-05,0.000102,9.2e-05,1e-06,5.8e-05,0.000259,0.000281,0.000196,0.000111,0.000311,0.000735,0.000708,0.000458,0.000529,0.000769,9.4e-05,0.000413,0.00088,0.000732,0.00053,4e-04,0.000286,0.000642,0.000162,0.000345,0.000566,0.000786,0.000394,0.000266,0.000185,0.000425,0.000906,0.000529,0.000303,0.000207,0.000341,0.00036,0.000238,7.9e-05,5e-05,0.00015,0.000175,3.6e-05,0.000123,0.000104,9e-06,8.2e-05,7.8e-05,1.1e-05,3.8e-05,0.000148,8.2e-05,6.5e-05,4e-05,7e-06,0.000334,4.4e-05,8.6e-05,3.1e-05,2.9e-05,4.5e-05,6.6e-05,3.4e-05,6e-06,8.7e-05,9e-05,5e-05,9e-06,2e-05,7e-06,5e-05,3.6e-05,1.5e-05,3.8e-05,2.1e-05,5.3e-05,8.7e-05,3.6e-05,2.7e-05,1.9e-05,1.4e-05,2.2e-05,1.9e-05,0.000192,0.000102,3.9e-05,5e-06,3e-06,9e-06,1.2e-05,1.2e-05,5e-06,8e-06,7e-06,7.7e-05,0.000196,9.2e-05,9.9e-05,4.9e-05,2.1e-05,9e-06,3e-06,3e-06,9e-06,7e-06,1e-06,2.9e-05,2.7e-05,9e-06,0.000587
2e-06,2e-06,4e-06,5e-06,6e-06,3e-06,1.2e-05,1.5e-05,4.5e-05,1.2e-05,1.7e-05,2.2e-05,0.000102,2.6e-05,2.5e-05,4.5e-05,0.000184,7.5e-05,0.000107,0.00018,0.00034,0.00057,0.000165,0.000461,0.000766,0.00072,0.000403,0.000207,0.000923,0.000999,0.000572,0.000242,0.000562,0.000469,0.000105,0.000446,0.000268,0.000478,0.000377,0.000179,0.000189,1.5e-05,0.000508,0.00012,0.000356,0.000266,0.000502,0.00015,0.00012,9.1e-05,6.5e-05,0.000138,0.000104,2.6e-05,8.2e-05,7e-05,6e-05,0.000103,4.8e-05,1.3e-05,2.3e-05,0.000139,0.000126,6.5e-05,7e-06,1.3e-05,0.000227,4.5e-05,3.5e-05,5.8e-05,4.4e-05,5.1e-05,3.1e-05,4.1e-05,3.4e-05,9.3e-05,4.1e-05,4.8e-05,1.9e-05,2.1e-05,2e-05,4.6e-05,2.7e-05,4e-06,3.5e-05,1.2e-05,3.7e-05,5.8e-05,2.7e-05,1.8e-05,6e-06,1.5e-05,2.2e-05,5e-06,0.000189,6.9e-05,4e-05,2e-05,9e-06,4e-06,5e-06,1.6e-05,1.1e-05,1e-05,5e-06,6.6e-05,0.000193,4.5e-05,4e-06,2.1e-05,1.6e-05,2.1e-05,1.4e-05,1.1e-05,9e-06,1.2e-05,9e-06,2.8e-05,1.3e-05,1.5e-05,0.000268
8e-06,8e-06,3e-06,6e-06,6e-06,4e-06,1.1e-05,3.5e-05,6e-05,2.3e-05,2.2e-05,2.6e-05,6.7e-05,6.3e-05,4e-05,1.8e-05,0.000127,8e-05,9.1e-05,2.8e-05,0.000244,0.000596,0.000328,0.000944,0.000305,0.000615,0.000139,0.000434,0.000518,0.00021,0.000299,0.000336,0.000606,2.8e-05,0.000454,0.000512,0.000339,0.000281,9.5e-05,0.000348,0.000367,0.000174,0.000585,0.000375,0.000237,0.000144,0.000648,0.000327,0.000193,2e-05,8e-05,3.7e-05,8.1e-05,2.8e-05,0.000115,6e-05,2.7e-05,8.2e-05,6.4e-05,2.8e-05,1.5e-05,0.000136,0.000101,3.1e-05,3.7e-05,3.5e-05,0.000149,2.7e-05,2.7e-05,5.6e-05,1.7e-05,7.2e-05,8.4e-05,5.2e-05,2.2e-05,8e-05,6.7e-05,3.4e-05,7e-06,1e-05,2.6e-05,3.6e-05,3e-05,2e-05,1.8e-05,2.6e-05,4.1e-05,2.5e-05,2.4e-05,2e-05,2.3e-05,1.1e-05,1.4e-05,1.7e-05,0.000167,8e-05,3.8e-05,2.2e-05,1.6e-05,1.6e-05,1.6e-05,5e-06,1e-06,1e-06,7e-06,5.7e-05,0.000138,2.8e-05,1.2e-05,1.8e-05,3e-06,9e-06,0,5e-06,6e-06,6e-06,4e-06,1.8e-05,3e-06,1.4e-05,0.000137
9e-06,6e-06,8e-06,1.1e-05,9e-06,6e-06,1.2e-05,7.2e-05,3.2e-05,1.7e-05,1.8e-05,2e-05,1.7e-05,3.4e-05,1.3e-05,1.3e-05,6.3e-05,6.8e-05,6.9e-05,7.3e-05,0.000186,0.000263,0.000231,0.000892,0.000548,0.000225,0.000202,0.000482,0.000288,0.000381,0.000219,0.000483,4.9e-05,0.00029,0.000535,0.000621,0.000555,0.000613,0.000537,0.00043,0.000402,0.000273,0.000332,0.000211,9.9e-05,0.000157,0.000409,0.000245,0.000183,5.3e-05,6.6e-05,4.7e-05,1e-04,1.3e-05,0.00012,3.2e-05,3.3e-05,6.3e-05,2.8e-05,1.7e-05,5.2e-05,0.000144,4.2e-05,3.2e-05,5.3e-05,2.8e-05,7.3e-05,7.1e-05,5.6e-05,4.5e-05,3.1e-05,5.7e-05,3.2e-05,1.1e-05,2.3e-05,4e-05,4.3e-05,5.2e-05,1.7e-05,8e-06,1.7e-05,1.3e-05,1.1e-05,1.5e-05,4.6e-05,4e-06,3.7e-05,5.1e-05,1.6e-05,1e-05,1.4e-05,2.8e-05,2.9e-05,1.4e-05,0.000147,9.5e-05,5.1e-05,3.2e-05,1e-05,7e-06,5e-06,8e-06,1e-06,3e-06,6e-06,6e-05,0.000131,4.7e-05,1.9e-05,7e-06,1.2e-05,1.6e-05,1e-05,6e-06,3e-06,7e-06,6e-06,1.5e-05,1e-05,5e-06,0.000294
7e-06,5e-06,7e-06,1e-06,9e-06,9e-06,1.1e-05,8e-05,7.3e-05,1.3e-05,1.8e-05,1.6e-05,2.7e-05,1.4e-05,6e-06,3.3e-05,8.1e-05,0.000126,0.000114,4.5e-05,0.000113,0.000204,0.000236,0.000367,0.000286,0.00053,0.000232,0.000232,0.000479,0.000202,0.000455,0.000421,7.5e-05,0.000166,0.000375,0.000252,0.000691,0.000322,0.000525,0.000525,0.000218,0.000163,0.000168,0.000144,0.000275,0.00035,0.000125,0.00022,9.2e-05,2.9e-05,5.9e-05,8.5e-05,6.3e-05,4.6e-05,0.000121,5.3e-05,3.8e-05,4.6e-05,4.8e-05,1.2e-05,2.7e-05,9.8e-05,7e-05,1.5e-05,1.3e-05,3e-05,9.6e-05,0.000123,7.1e-05,3.8e-05,2.1e-05,5.3e-05,3.7e-05,2.5e-05,1.3e-05,1.4e-05,8.5e-05,3.9e-05,2e-05,4e-06,1e-05,3e-05,2e-05,1.6e-05,2.9e-05,1.2e-05,4e-06,2.9e-05,1.6e-05,1.1e-05,1.2e-05,2.1e-05,2.9e-05,1.7e-05,0.000117,7.3e-05,2.3e-05,9e-06,1.3e-05,6e-06,3e-06,7e-06,8e-06,5e-06,6e-06,4.5e-05,0.000143,6.8e-05,2.3e-05,1e-05,1.3e-05,1.9e-05,1.1e-05,6e-06,2e-06,2e-06,1e-06,1.2e-05,1e-05,7e-06,0.000434
1e-06,1e-06,5e-06,1e-06,7e-06,7e-06,9e-06,6.7e-05,1.6e-05,1.3e-05,2.4e-05,2.8e-05,4.1e-05,2e-05,3.1e-05,5e-05,0.000159,9.1e-05,0.000206,0.000194,0.000114,0.000212,0.000198,0.000174,6.7e-05,0.000256,0.00065,0.000268,0.000301,0.000316,2.8e-05,0.000247,0.000315,0.000241,0.000192,0.000226,0.000568,4e-04,0.000329,0.000162,0.000211,0.000147,0.000351,0.000237,0.000329,0.000204,8.8e-05,0.000109,5.4e-05,8e-05,1.7e-05,6.9e-05,0.000119,2.7e-05,7.8e-05,3.4e-05,1.5e-05,6.3e-05,3.1e-05,8e-06,2.1e-05,5.8e-05,0.000104,1.6e-05,3.2e-05,2.5e-05,0.000132,0.000124,5.3e-05,3.2e-05,2.6e-05,5.4e-05,3.8e-05,7e-06,1.9e-05,5.8e-05,5.5e-05,5.9e-05,2.2e-05,2.5e-05,2.1e-05,6.6e-05,5e-05,2.8e-05,5.8e-05,1.8e-05,3.4e-05,2.7e-05,2.5e-05,9e-06,1.3e-05,9e-06,1e-05,9e-06,0.000113,6.1e-05,3.7e-05,1.2e-05,6e-06,2.2e-05,4e-06,2e-06,8e-06,4e-06,6e-06,2.6e-05,0.000108,5.2e-05,3e-05,2e-06,1e-05,1.9e-05,1.4e-05,4e-06,6e-06,4e-06,3e-06,6e-06,2.3e-05,1.2e-05,0.000581
7e-06,4e-06,2e-06,2e-06,7e-06,1.8e-05,1.6e-05,6.4e-05,6.5e-05,4.4e-05,2.6e-05,2.8e-05,2.7e-05,2.7e-05,1.9e-05,3.9e-05,1e-04,0.000306,0.000184,1.2e-05,5.3e-05,0.000346,0.000195,0.000218,0.000191,0.000602,0.000205,0.000185,0.000232,0.000297,0.000186,5.3e-05,0.000258,0.000192,0.000239,0.000306,0.000253,0.000318,0.000374,0.000153,0.000182,0.000207,0.000321,0.000287,0.000262,0.000325,0.000183,0.000254,6.6e-05,0.000111,0.00013,0.000147,1.2e-05,0.000114,4.4e-05,7.1e-05,5.3e-05,8.6e-05,7.4e-05,6e-05,7.1e-05,9.8e-05,0.000153,0.000106,3.4e-05,4e-06,0.000201,0.000141,7.7e-05,2.4e-05,3.9e-05,3.9e-05,1.8e-05,3e-05,3.8e-05,5.3e-05,7.7e-05,7.4e-05,3.4e-05,3e-05,3.6e-05,7.5e-05,4.1e-05,2.4e-05,4.7e-05,3.8e-05,8e-06,1.1e-05,3e-06,1.2e-05,2.6e-05,3e-05,2.9e-05,3e-05,8.6e-05,6.6e-05,4.6e-05,1.5e-05,4e-06,2.7e-05,2.3e-05,1.4e-05,9e-06,1.5e-05,1.6e-05,2e-05,0.000118,8.3e-05,6.1e-05,2.5e-05,1e-05,1.2e-05,5e-06,7e-06,8e-06,3e-06,3e-06,4e-06,1.9e-05,1.3e-05,0.000622
4e-06,8e-06,8e-06,7e-06,2e-06,1.5e-05,7e-06,6.4e-05,6.6e-05,3e-06,1.9e-05,1.5e-05,5.3e-05,4.7e-05,1.9e-05,5.9e-05,0.000103,0.000356,0.000146,3e-05,0.000124,0.000224,0.000146,0.000356,0.000136,0.000712,0.00024,0.000202,0.000193,0.000204,0.000356,2e-04,0.00024,8.6e-05,0.000332,0.000188,8.2e-05,0.000354,0.000263,0.000216,0.00016,9.2e-05,9e-05,0.000264,0.000341,0.000205,0.000112,0.000186,0.000141,0.000182,0.000141,9.7e-05,0.000108,6.2e-05,0.000124,0.000116,6.2e-05,4.1e-05,0.000122,4.5e-05,3.4e-05,5.9e-05,0.000151,8e-05,6.6e-05,1.6e-05,0.000225,0.000102,5.4e-05,5.5e-05,5.6e-05,2.8e-05,1.5e-05,4.1e-05,5e-05,6.5e-05,5.3e-05,3.9e-05,1.8e-05,3e-05,1.8e-05,4.2e-05,2.1e-05,3.6e-05,3.8e-05,1.2e-05,6e-06,7e-06,7e-06,1.8e-05,1e-05,8e-06,1.6e-05,2.4e-05,6.7e-05,3.8e-05,2.7e-05,1.6e-05,4e-06,2.5e-05,2.3e-05,9e-06,1e-05,1.4e-05,3e-06,1.3e-05,0.000113,3e-05,4.9e-05,2.2e-05,1.1e-05,1.2e-05,4e-06,3e-06,4e-06,8e-06,6e-06,5e-06,1.5e-05,7e-06,0.000475
2e-06,3e-06,6e-06,7e-06,9e-06,1e-05,1.5e-05,6.2e-05,3e-05,2.2e-05,3.4e-05,3e-05,9.9e-05,6.1e-05,7e-05,4.3e-05,7.6e-05,0.000101,9.4e-05,6.9e-05,0.000117,0.000257,0.000143,5.9e-05,0.000157,0.000216,0.000301,0.000227,0.000259,0.000187,0.000247,0.000163,0.000185,8.6e-05,0.00037,0.000326,0.000255,0.000253,9.2e-05,0.000162,9.2e-05,4.5e-05,0.000208,0.000348,0.000401,0.000268,0.000188,0.000133,9.1e-05,0.000183,0.000185,0.000151,9.5e-05,0.000109,7.8e-05,0.000116,5.7e-05,7.5e-05,1e-04,4.6e-05,8e-06,0.00011,0.000106,8.6e-05,4.8e-05,5.7e-05,0.000217,6.8e-05,3.4e-05,2.9e-05,3.9e-05,9.6e-05,4.1e-05,3.2e-05,1.5e-05,2.9e-05,5e-05,5.1e-05,3.2e-05,2.6e-05,3.2e-05,4.2e-05,2.7e-05,7e-06,2.9e-05,1.8e-05,2.1e-05,2.4e-05,1e-06,1.3e-05,6e-06,4e-06,8e-06,8e-06,3.6e-05,1.1e-05,1.3e-05,6e-06,1e-06,1.8e-05,5e-06,8e-06,7e-06,1e-06,6e-06,3.4e-05,9.8e-05,0.000108,2e-05,1.6e-05,1.5e-05,2.3e-05,1.6e-05,6e-06,3e-06,8e-06,4e-06,7e-06,1.1e-05,8e-06,0.000222
2e-06,4e-06,3e-06,2e-06,7e-06,1.5e-05,1.1e-05,6.9e-05,3.8e-05,3.8e-05,1.6e-05,3.6e-05,0.000102,2.8e-05,4.5e-05,8.8e-05,8.8e-05,0.000238,0.000228,0.000216,0.000213,0.000159,5.2e-05,0.000211,0.000181,0.000446,6.6e-05,0.000257,0.000151,0.000176,0.00017,0.000133,0.00024,0.000172,0.000165,0.000137,0.000344,0.000426,0.000336,0.000168,0.000144,0.000185,0.000316,0.000241,0.000142,0.000196,0.000159,0.000143,0.000125,0.000166,0.000158,0.000139,3.5e-05,6e-05,0.000154,8e-05,7.1e-05,8.5e-05,0.000132,7.8e-05,3e-05,0.000143,6.4e-05,4e-05,7.9e-05,4.9e-05,0.000219,0.000186,0.000108,8e-05,4.3e-05,9.6e-05,6e-05,5.3e-05,3.3e-05,4.9e-05,6.1e-05,4.1e-05,1.8e-05,1.8e-05,1.4e-05,4.7e-05,1.5e-05,5e-06,2.6e-05,1.1e-05,1.4e-05,2.4e-05,1.5e-05,8e-06,8e-06,2e-05,2.3e-05,1.7e-05,3.3e-05,2.1e-05,8e-06,3e-06,1e-05,7e-06,9e-06,6e-06,3e-06,2e-06,6e-06,3.5e-05,0.000108,1e-04,4.9e-05,3e-05,2.3e-05,6e-06,1e-06,3e-06,5e-06,3e-06,5e-06,4e-06,7e-06,5e-06,0.000268
2e-06,2e-06,1e-06,2e-06,7e-06,1.1e-05,1.3e-05,5.9e-05,4.2e-05,3.9e-05,1.8e-05,1.8e-05,9.9e-05,0.000112,6e-05,7e-05,0.000125,0.000584,0.000582,0.00023,0.000151,0.000241,0.000145,2.9e-05,0.000299,0.000601,0.00015,0.000169,0.000236,0.00046,0.000296,0.000226,0.000173,0.000256,0.000175,2e-04,0.000173,0.000404,0.00045,0.000152,0.000165,0.000353,0.000191,0.000143,0.000286,0.000266,0.000221,0.000119,0.000138,7.5e-05,3.8e-05,9.8e-05,6.8e-05,9.4e-05,0.000135,0.000132,9.1e-05,0.000164,0.000134,6.1e-05,6.4e-05,9e-05,5.3e-05,6.7e-05,7.9e-05,5e-05,0.000208,0.00015,8.5e-05,7.3e-05,1.4e-05,8e-05,4.3e-05,3.8e-05,3.4e-05,2.3e-05,6e-05,6.5e-05,1e-05,2.9e-05,2.1e-05,3.6e-05,1.7e-05,1.5e-05,1.9e-05,1.3e-05,2.9e-05,3.2e-05,2.3e-05,1e-05,1.9e-05,1.9e-05,3.9e-05,2e-05,3.4e-05,2e-06,2.3e-05,2.2e-05,1.3e-05,9e-06,3e-06,1.3e-05,6e-06,7e-06,2e-06,3.6e-05,8.5e-05,6.5e-05,4.4e-05,1.8e-05,9e-06,3e-06,5e-06,6e-06,6e-06,8e-06,4e-06,0,6e-06,1.3e-05,0.000439
4e-06,5e-06,2e-06,2e-06,6e-06,5e-06,4e-06,4.2e-05,5.1e-05,3.4e-05,1.7e-05,5.1e-05,4.7e-05,8.3e-05,3e-05,3.4e-05,0.000213,0.000484,0.000149,9.5e-05,0.000119,0.000281,0.000134,0.000273,0.000284,8e-05,0.000241,0.000204,0.000435,0.000199,0.000284,0.000154,0.000213,0.000184,7.3e-05,8.9e-05,7.6e-05,0.000139,0.000272,0.000228,7.2e-05,0.00015,7.8e-05,0.000287,0.000189,0.000289,0.000158,0.000127,0.000151,7.7e-05,4.7e-05,0.000102,4.9e-05,7e-05,3.5e-05,7.9e-05,4.1e-05,0.000116,6e-05,1.9e-05,2.4e-05,8.6e-05,9.4e-05,3.3e-05,4.6e-05,1.4e-05,0.000222,6.9e-05,1e-04,1.4e-05,4.1e-05,3.8e-05,3.2e-05,4.3e-05,1.3e-05,4e-05,6.6e-05,2.4e-05,3.5e-05,4.1e-05,3.3e-05,5.9e-05,2.8e-05,3.1e-05,2e-05,1e-05,3.3e-05,3.4e-05,1.3e-05,2.1e-05,3e-05,4.2e-05,3.3e-05,4.6e-05,1.8e-05,3.5e-05,4.3e-05,1.7e-05,1.6e-05,0,7e-06,1.4e-05,1.4e-05,1e-05,6e-06,3.6e-05,8e-06,7.4e-05,1.8e-05,2e-05,2.3e-05,1.5e-05,9e-06,5e-06,6e-06,3e-06,3e-06,2e-06,9e-06,6e-06,0.000424
4e-06,3e-06,3e-06,1e-06,6e-06,1e-06,5e-06,4.9e-05,3.7e-05,3e-05,2e-05,5.6e-05,7.6e-05,1e-06,2.1e-05,3e-05,0.000199,9.2e-05,5e-06,3.7e-05,7.5e-05,0.000298,0.000241,0.000173,0.000192,0.000349,8.9e-05,0.000335,0.000194,0.000206,0.000248,0.000177,0.000204,0.000229,0.000172,0.000124,0.00016,0.000321,0.000311,0.000154,0.000106,0.000322,0.000147,0.000345,0.000231,0.000375,0.000307,9.1e-05,0.000216,1e-04,0.000104,0.00016,0.000184,3.2e-05,7.3e-05,7.3e-05,3.3e-05,0.000151,0.000129,6.5e-05,6.8e-05,0.000112,0.000128,8.8e-05,7.4e-05,1.7e-05,0.000175,0.000119,8.5e-05,5.7e-05,2.8e-05,5.5e-05,2e-05,1.5e-05,1.7e-05,4.5e-05,0.000131,3.8e-05,2e-05,7e-06,3.4e-05,4.3e-05,1.4e-05,1.6e-05,4.8e-05,1.9e-05,1.3e-05,1.5e-05,7e-06,1.4e-05,1.2e-05,3.2e-05,1.8e-05,3.6e-05,2.8e-05,3.1e-05,2.7e-05,1.8e-05,1.8e-05,9e-06,8e-06,7e-06,5e-06,6e-06,1e-06,3.1e-05,3.5e-05,4.3e-05,7e-06,1.9e-05,9e-06,8e-06,3e-06,6e-06,5e-06,6e-06,4e-06,5e-06,1.6e-05,1e-05,0.000331
4e-06,6e-06,2e-06,5e-06,4e-06,1e-06,1e-05,3.9e-05,4.9e-05,2.6e-05,7e-06,5.3e-05,3.6e-05,1.5e-05,1.6e-05,6e-05,0.000257,5e-04,0.000364,0.000153,0.000105,0.000129,8.5e-05,6.4e-05,0.000398,0.000398,0.000547,0.000544,0.00014,0.000235,0.000181,9.5e-05,0.000252,0.000222,0.00016,0.00025,0.000409,0.00049,0.000185,9.7e-05,0.000137,0.000435,0.000399,0.000221,0.000157,0.000353,0.000119,0.000151,0.000251,0.000232,0.000207,0.000119,0.000215,0.000213,5.7e-05,9.4e-05,0.000116,6.6e-05,9e-05,1.3e-05,6.5e-05,6.4e-05,9.1e-05,0.000106,6.3e-05,9.3e-05,0.000192,0.000177,2.6e-05,4e-05,5.5e-05,3e-05,5.5e-05,3.9e-05,2.2e-05,5.4e-05,8.5e-05,8.5e-05,3.4e-05,2.8e-05,3.9e-05,3.4e-05,3.8e-05,2.5e-05,4.9e-05,1.7e-05,1.4e-05,1.1e-05,1.5e-05,1.5e-05,6e-06,2.2e-05,2.1e-05,1e-05,3e-06,4e-05,1.2e-05,7e-06,1e-05,1.1e-05,6e-06,6e-06,9e-06,2e-06,5e-06,3e-05,2.1e-05,4.7e-05,1.4e-05,1.7e-05,1.4e-05,3e-06,4e-06,2e-06,2e-06,2e-06,0,5e-06,1.8e-05,1.2e-05,0.000312
1e-06,1e-06,2e-06,4e-06,1e-06,2e-06,8e-06,3.3e-05,3e-05,1.5e-05,2.3e-05,4.5e-05,4.5e-05,2.4e-05,2.8e-05,1.3e-05,0.000249,0.000418,0.000308,0.000203,8.1e-05,0.000136,0.000124,0.000172,0.000306,0.000155,0.000321,0.000384,0.000206,0.000117,0.000339,3.1e-05,9.8e-05,0.00012,0.000283,0.000184,0.000147,0.000307,6.1e-05,0.000205,0.000307,0.000287,0.000267,0.000217,7.8e-05,0.000185,0.000237,7.6e-05,8.2e-05,7.9e-05,6.5e-05,7.8e-05,0.000146,0.000173,5e-05,0.000137,5.3e-05,4.7e-05,9.3e-05,8.5e-05,6.2e-05,4.3e-05,0.000117,0.000156,0.00016,0.000175,0.000205,0.000196,0.000163,6.9e-05,2.9e-05,3.4e-05,6.1e-05,4e-05,2.2e-05,6.1e-05,5.9e-05,7.5e-05,4.7e-05,3.8e-05,1.5e-05,3.5e-05,1.9e-05,2e-05,4.6e-05,4.2e-05,1.9e-05,3.1e-05,6e-06,2e-05,3e-05,3.7e-05,1.1e-05,7e-06,2e-06,5.4e-05,5.5e-05,3.3e-05,6e-06,9e-06,8e-06,6e-06,6e-06,4e-06,8e-06,2.8e-05,2.8e-05,5.5e-05,2.2e-05,8e-06,1.3e-05,5e-06,5e-06,7e-06,2e-06,2e-06,2e-06,6e-06,1e-05,1e-05,0.000357
1e-06,2e-06,0,2e-06,2e-06,2e-06,8e-06,3.5e-05,3.3e-05,2.9e-05,1.5e-05,2.9e-05,8e-06,2.8e-05,3.1e-05,1.6e-05,0.00024,0.000198,0.000154,7.1e-05,6e-05,0.00012,4.7e-05,0.000278,0.000172,0.000331,0.000161,0.000254,0.000437,0.000294,0.00012,7.4e-05,0.000379,0.000316,0.000304,0.000214,4.4e-05,4.6e-05,0.00025,0.000226,7.8e-05,7e-05,8.3e-05,0.000131,9.6e-05,0.00016,0.000156,4.2e-05,7.9e-05,2e-05,7.5e-05,0.000156,1.9e-05,0.000103,0.000177,9.4e-05,5.4e-05,6.3e-05,6.5e-05,5.6e-05,2.8e-05,4.5e-05,0.000123,8.7e-05,4.2e-05,9.4e-05,0.000125,9.8e-05,0.000103,5.1e-05,1e-05,5e-06,1.4e-05,1.3e-05,8e-06,4.1e-05,3.9e-05,2.9e-05,2e-05,2.4e-05,3e-06,3.8e-05,2.3e-05,2.5e-05,3.2e-05,1.8e-05,1.3e-05,2e-05,1.6e-05,1.8e-05,1.1e-05,1.4e-05,1.2e-05,4e-06,9e-06,3.5e-05,1.5e-05,1e-05,6e-06,2e-06,1e-06,2e-06,7e-06,4e-06,9e-06,1.1e-05,1.4e-05,2.4e-05,1.6e-05,5e-06,5e-06,7e-06,4e-06,5e-06,1e-06,2e-06,2e-06,4e-06,7e-06,9e-06,0.000399
0,2e-06,0,0,1e-06,1e-06,8e-06,4.2e-05,3.6e-05,2.4e-05,1e-05,9e-06,1.1e-05,1.5e-05,2.3e-05,1.5e-05,0.000208,0.000174,8.8e-05,3.8e-05,4.9e-05,0.000224,0.00013,0.000311,0.000207,0.000384,0.000122,0.000144,0.000392,0.000294,0.000326,3.1e-05,0.000398,0.000127,0.000215,0.00011,8.9e-05,7.2e-05,0.00014,0.000165,0.000182,0.000113,0.000182,0.000128,4.6e-05,0.000196,0.00027,0.000166,0.000121,5e-05,3.9e-05,6.2e-05,4.7e-05,7.6e-05,6.5e-05,9e-06,2.7e-05,6.8e-05,5.4e-05,1.1e-05,3.3e-05,6e-06,7.1e-05,2.5e-05,5.5e-05,1.6e-05,0.000143,6.3e-05,4e-06,3.1e-05,1e-05,1.3e-05,1.2e-05,1.5e-05,8e-06,2.2e-05,1.2e-05,1.6e-05,3e-06,8e-06,2e-06,2.4e-05,1.1e-05,8e-06,2.4e-05,1.1e-05,1.1e-05,2.2e-05,9e-06,6e-06,3e-06,1.5e-05,5e-06,3e-06,6e-06,1.3e-05,1.6e-05,1e-06,6e-06,2e-06,1e-06,3e-06,3e-06,2e-06,3e-06,1.1e-05,2.6e-05,2.2e-05,9e-06,9e-06,7e-06,5e-06,2e-06,4e-06,3e-06,1e-06,1e-06,6e-06,6e-06,1.4e-05,0.000379
1e-06,2e-06,0,0,1e-06,2e-06,8e-06,4.6e-05,2.8e-05,1.2e-05,5e-06,1.1e-05,1.1e-05,7e-06,2.3e-05,1.6e-05,0.000186,0.000123,5.6e-05,3.3e-05,7e-05,0.000252,6.8e-05,0.000233,2.4e-05,0.00031,2.2e-05,0.000311,0.000264,0.000392,0.000131,8.9e-05,0.000228,0.00014,0.000109,0.000136,0.000106,0.000245,0.000116,7.3e-05,2e-04,7.8e-05,0.000136,1.7e-05,7.4e-05,0.000112,0.00026,1.5e-05,6.7e-05,2.3e-05,1.7e-05,6.1e-05,4.5e-05,4.4e-05,8.2e-05,2.2e-05,2.8e-05,7.9e-05,3e-05,1.3e-05,1.6e-05,1.5e-05,4.2e-05,9e-06,3.4e-05,1.1e-05,0.000131,5.4e-05,3.3e-05,2.7e-05,5e-06,6e-06,1.7e-05,6e-06,3e-06,2.4e-05,7e-06,1.6e-05,4e-06,1.3e-05,6e-06,2.4e-05,1.1e-05,6e-06,2.2e-05,1.2e-05,3e-06,1.2e-05,2e-06,2e-06,3e-06,1.2e-05,2e-06,2e-06,7e-06,4e-06,7e-06,4e-06,6e-06,3e-06,1e-06,2e-06,1e-06,2e-06,2e-06,1.4e-05,2.7e-05,2.9e-05,6e-06,6e-06,6e-06,3e-06,1e-06,2e-06,2e-06,3e-06,1e-06,6e-06,2e-06,1e-05,0.000356
0,2e-06,0,0,1e-06,1e-06,8e-06,4.4e-05,3e-05,1e-05,7e-06,6e-06,6e-06,1e-06,1.9e-05,1.3e-05,0.000176,0.000114,5.9e-05,2.8e-05,6.5e-05,0.00024,0.000132,0.000203,7.9e-05,0.000263,4.3e-05,0.000303,0.000246,0.000253,0.000238,0.000149,0.000227,0.000125,9.7e-05,7.3e-05,0.000117,0.000265,0.00011,6.5e-05,0.000181,7.4e-05,4.7e-05,6e-05,7.1e-05,0.000131,0.000178,8.4e-05,4.6e-05,4e-05,7e-06,6.4e-05,3.1e-05,3.8e-05,7.1e-05,1e-05,2.4e-05,7.3e-05,3.1e-05,7e-06,9e-06,1e-05,3.4e-05,7e-06,2.2e-05,4e-06,0.000128,2.3e-05,1.4e-05,2.6e-05,1.2e-05,1.3e-05,1.4e-05,7e-06,4e-06,2.1e-05,6e-06,1.1e-05,3e-06,9e-06,5e-06,2.6e-05,9e-06,6e-06,2e-05,1e-05,2e-06,1.3e-05,1e-06,2e-06,3e-06,1.2e-05,2e-06,1e-06,6e-06,8e-06,3e-06,3e-06,5e-06,2e-06,1e-06,2e-06,1e-06,1e-06,3e-06,1.3e-05,2.3e-05,2.7e-05,1e-06,3e-06,6e-06,3e-06,2e-06,2e-06,0,2e-06,2e-06,5e-06,3e-06,1.1e-05,0.000348
