1.6e-05,1.6e-05,5e-06,3e-06,1.2e-05,1.9e-05,4e-06,8e-06,1.9e-05,2.4e-05,2.2e-05,4.1e-05,3.5e-05,6e-06,5.3e-05,4e-06,8e-06,1.1e-05,1.9e-05,8.6e-05,3.3e-05,5.8e-05,1.5e-05,2.8e-05,4.2e-05,1.2e-05,1.1e-05,3.1e-05,1.8e-05,6e-06,2.9e-05,5.3e-05,1e-06,1.1e-05,6e-06,1.7e-05,2.7e-05,3e-06,3e-05,4.6e-05,0.000124,7e-06,0.00011,2.6e-05,9.6e-05,3.5e-05,0.000105,1e-06,8.2e-05,1.1e-05,3e-06,6e-05,3.9e-05,3e-06,6.8e-05,7.1e-05,3.9e-05,0,3.9e-05,0.000108,1e-06,0.000124,0.000139,1.7e-05,0.000114,4.3e-05,4.2e-05,3e-06,1e-05,1.4e-05,8.5e-05,0.000135,6.9e-05,2.9e-05,2.7e-05,5.4e-05,9e-06,0.000124,3e-06,6.2e-05,6e-05,6e-06,4.1e-05,9.9e-05,0.000167,4e-05,0.000158,0.000111,4e-05,3.9e-05,9.5e-05,3.4e-05,4.6e-05,0.000107,5e-05,3e-05,3.1e-05,7e-06,5.6e-05,3.6e-05,1.1e-05,4e-05,2.8e-05,2.4e-05,3e-05,2.4e-05,1e-05,2.7e-05,7.1e-05,5e-06,2e-06,6e-06,6.2e-05,1.7e-05,9.2e-05,6e-05,0.00011,3.9e-05,4e-06,0.000116,9.4e-05
6.3e-05,8.7e-05,0.000105,9.6e-05,7.8e-05,0.000118,7.5e-05,2.8e-05,5.5e-05,0.000102,6.5e-05,0.000101,5.2e-05,8.5e-05,0.000122,0.000117,7.8e-05,1.2e-05,5.6e-05,0.00016,0.000108,0.000101,9.7e-05,6.7e-05,0.000112,8.2e-05,0.000134,0.000126,0.000131,0.000104,0.000135,0.000177,0.00012,0.000137,6.9e-05,5.6e-05,0.00014,1e-04,9.3e-05,9.3e-05,0.000336,0.000246,0.000186,0.000139,0.000198,0.000119,0.000196,0.000234,0.000202,2e-04,0.000122,0.00013,0.00014,0.000127,0.000117,0.00027,0.000245,0.000169,0.000153,0.000263,0.000148,0.000167,0.000477,0.000437,1e-04,0.000148,0.00021,9.7e-05,3.3e-05,3e-05,0.000146,0.000376,0.000443,0.000208,0.000144,0.000132,0.00016,0.000204,0.000186,0.000252,0.000199,6.1e-05,0.000232,0.000191,0.000379,0.000263,0.00034,0.000568,0.000311,0.000196,0.000266,0.000275,0.000268,0.00035,0.000388,0.000277,0.000149,0.000104,0.000165,0.000227,0.000191,0.000165,0.000218,0.000281,0.000275,0.000155,0.000147,0.000108,0.000263,0.000127,7.6e-05,6.1e-05,0.000135,0.000174,0.000246,0.000363,0.00012,0.000308,0.000187,0.000194,0.000386
0.000122,2.5e-05,8.9e-05,6.8e-05,1.5e-05,0.000144,7.2e-05,5e-05,6.9e-05,3.9e-05,8.6e-05,1.2e-05,8.6e-05,0.000148,6.4e-05,3.5e-05,2.2e-05,7.4e-05,8.1e-05,3.5e-05,0.000124,0.000214,0.000172,7.9e-05,3.6e-05,6e-05,0.000152,0.00015,9.1e-05,1.3e-05,8.7e-05,3.2e-05,4e-05,0.000108,4.4e-05,5.8e-05,0.000157,3e-05,9.7e-05,0.000107,0.000184,0.000245,0.000215,0.000107,0.000132,1e-04,0.000155,6.1e-05,0.000101,0.000116,1e-05,0.00011,0.000166,6.8e-05,6.7e-05,0.000241,8.7e-05,4.9e-05,0.000165,0.000175,0.000243,0.000243,0.000354,0.000172,0.000385,0.000248,4e-05,0.00012,7.2e-05,0.000111,3.7e-05,0.000229,0.000201,0.000282,0.000423,0.000209,0.000273,0.000239,4.5e-05,0.00035,0.000472,0.000259,0.000263,0.000275,0.000402,0.000266,0.000323,0.000458,0.000333,0.000284,3e-05,0.000178,0.000311,0.000244,7.3e-05,0.000113,8.8e-05,0.000144,9.6e-05,0.000197,0.00016,4.4e-05,0.000189,0.000258,1e-04,0.000179,0.000121,0.000282,0.000324,0.000239,2.6e-05,0.000156,0.000177,0.000318,0.000227,0.000388,0.00052,0.000396,0.000242,0.000142,0.000135
6.7e-05,9.4e-05,2.3e-05,5.8e-05,2.6e-05,9.5e-05,9.6e-05,5.9e-05,5.2e-05,5.8e-05,0.000151,8.8e-05,5.5e-05,1.7e-05,3.4e-05,5.3e-05,3.7e-05,6.4e-05,0.000118,9.4e-05,0.000149,0.000165,8.1e-05,7.2e-05,5.3e-05,6.8e-05,5e-05,4e-05,5.3e-05,6.6e-05,5.7e-05,5.5e-05,6.3e-05,8.4e-05,8e-05,7.8e-05,7.1e-05,0.000121,8.7e-05,5.7e-05,0.000142,0.000139,2e-05,4.4e-05,3.9e-05,7.4e-05,3.8e-05,5.8e-05,0.000113,3e-05,3.1e-05,0.000196,0.000185,0.000128,5e-05,0.000153,0.000208,0.000159,0.000199,9.5e-05,0.000116,2.8e-05,0.00025,0.000276,0.000211,8.8e-05,9.7e-05,0.000205,0.000153,0.000146,0.000236,4.3e-05,5e-06,0.000243,0.000235,0.00018,0.000168,2e-04,0.000182,0.000253,0.000359,0.000221,0.000207,0.000171,0.000156,3.2e-05,0.000148,0.000263,0.000128,0.000195,0.000237,0.000129,0.000425,0.000105,2.9e-05,7.6e-05,5.9e-05,6.4e-05,0.00013,8.3e-05,7.9e-05,9.5e-05,0.000178,3.5e-05,0.000149,0.000296,0.000206,0.000287,0.000362,0.000256,0.000203,0.00026,0.000308,0.000134,0.000276,8.4e-05,0.000366,0.000175,0.000196,0.000119,0.000236
3.9e-05,3.9e-05,1.5e-05,4.1e-05,3.5e-05,4e-06,7.3e-05,4.8e-05,5.4e-05,4.2e-05,0.000146,7.1e-05,8e-05,0.000103,0.000109,2.8e-05,3.3e-05,3.1e-05,3.7e-05,0.000122,7e-06,8.8e-05,0.000129,1e-05,2.2e-05,5.4e-05,7.2e-05,7.8e-05,0.000116,0.000108,0.000122,9.9e-05,1.9e-05,1.7e-05,6.8e-05,1.2e-05,3e-05,7.9e-05,8.5e-05,7.8e-05,0.000155,7e-05,4.8e-05,3e-05,6.4e-05,0.000101,0.000167,0.000118,6.1e-05,6.3e-05,3.8e-05,0.000161,3.1e-05,1.9e-05,6.4e-05,8e-05,0.000118,6e-05,0.000186,9.3e-05,3.1e-05,3.6e-05,0.000125,0.000251,0.000305,0.000128,0.000111,0.000151,3.1e-05,0.000112,0.000222,0.000141,0.000102,0.000162,0.000116,0.000181,1e-04,0.000257,0.000252,0.000358,0.000214,1.8e-05,0.000176,0.000197,0.000316,0.000204,0.000307,0.000287,0.000263,0.000204,7.9e-05,3e-06,0.000371,0.00032,0.000259,0.000123,8.3e-05,9e-05,0.000102,0.000161,0.000111,0.000137,0.00016,0.000218,0.000278,0.000146,0.000291,0.000253,0.000229,0.000119,0.000166,5.3e-05,8.7e-05,3.3e-05,0.000306,0.000336,9.2e-05,7.1e-05,0.000242,0.000241,0.000184
5.2e-05,3.2e-05,1.3e-05,2.7e-05,4.7e-05,4.9e-05,4.7e-05,0.000101,1.8e-05,4.9e-05,8.2e-05,6.7e-05,0.000128,7.8e-05,5.2e-05,9.9e-05,5.8e-05,4.6e-05,1.9e-05,8.8e-05,0.000105,3.2e-05,5.3e-05,7.5e-05,6.9e-05,6.2e-05,3e-05,3.2e-05,7.1e-05,3.6e-05,9.1e-05,2.4e-05,4e-05,2.2e-05,6.9e-05,8.5e-05,7.2e-05,7.1e-05,0.000124,5.8e-05,0.00013,4.3e-05,5.2e-05,6.2e-05,0.000124,0.000162,9.1e-05,5.1e-05,1.2e-05,0.000106,0.000123,4.6e-05,5.4e-05,3.5e-05,5.9e-05,8.3e-05,4.5e-05,0.000137,0.000109,9.4e-05,0.000175,0.000156,0.000131,0.000175,0.000376,0.000311,0.000199,0.000175,0.000152,5.6e-05,0.000108,0.000103,0.000113,3.1e-05,2.3e-05,3.7e-05,9.7e-05,7.3e-05,3.7e-05,0.000195,0.000112,0.000215,4e-05,0.000274,0.000398,0.000264,0.000349,0.000197,0.000274,0.00017,0.000146,7.5e-05,0.000262,0.000235,0.000237,8.5e-05,4.2e-05,4.8e-05,2.6e-05,0.000106,0.000171,0.000141,0.000222,0.000166,9e-05,0.000224,0.000349,0.000186,0.000252,0.000248,0.000278,0.000206,0.000116,0.000134,0.000163,0.000147,0.000163,0.00017,0.000261,0.000117,7e-05
1.2e-05,1.6e-05,3.4e-05,1.5e-05,2.1e-05,2.8e-05,7.3e-05,4.2e-05,4.9e-05,3.1e-05,5e-05,1.7e-05,9.7e-05,4.9e-05,6e-05,3.2e-05,2.4e-05,3.5e-05,4.4e-05,3.2e-05,1.1e-05,3.7e-05,5.4e-05,4.1e-05,3.8e-05,3e-05,3.2e-05,2e-05,5.7e-05,8.9e-05,5.4e-05,2.5e-05,3.5e-05,6.3e-05,6e-06,3.9e-05,2.8e-05,9.9e-05,5.8e-05,6.6e-05,8.4e-05,7e-06,1.9e-05,9.2e-05,9.7e-05,2.6e-05,9.2e-05,6.7e-05,6.1e-05,7.6e-05,0.00017,0.000198,0.000119,3.8e-05,5.7e-05,5.6e-05,7.8e-05,4e-06,8.6e-05,4.2e-05,0.000119,3.8e-05,8.2e-05,3.5e-05,0.000205,6.6e-05,6.5e-05,9.3e-05,0.00014,0.000222,5.6e-05,0.00011,8.2e-05,2.1e-05,0.000131,0.000101,9.9e-05,0.000125,0.000114,0.000237,9.8e-05,0.000184,0.000134,0.000293,0.000103,0.000212,1e-05,9.5e-05,0.000193,0.000207,0.000194,0.000115,7.3e-05,8.4e-05,0.000137,0.000129,5.4e-05,0.000111,7.2e-05,7.7e-05,0.000249,0.000145,0.000185,0.000187,7.3e-05,0.000128,0.000206,0.000112,0.000127,9.6e-05,0.000281,4.8e-05,7.7e-05,3.7e-05,0.000117,5.6e-05,8e-06,9e-05,0.000145,6.8e-05,5.3e-05
1.9e-05,2.6e-05,2.8e-05,2.6e-05,3.1e-05,2.7e-05,5e-05,4.8e-05,5.1e-05,4.2e-05,3.2e-05,3.1e-05,7.1e-05,5.8e-05,3.8e-05,2.3e-05,1e-05,1.6e-05,2e-05,6.3e-05,6.5e-05,3.6e-05,8e-06,3e-05,3.1e-05,4.7e-05,1.5e-05,6.1e-05,4.3e-05,7.2e-05,5.7e-05,5.1e-05,1.9e-05,4.2e-05,4.4e-05,7e-06,3.8e-05,4.3e-05,5e-05,8.3e-05,7.5e-05,7e-05,3.2e-05,8.8e-05,6.2e-05,9.7e-05,9.3e-05,3.7e-05,4.2e-05,7.3e-05,5.1e-05,9.8e-05,3.8e-05,4.6e-05,2.7e-05,8.6e-05,2.9e-05,6.7e-05,4.4e-05,7.8e-05,4.3e-05,8.1e-05,4.3e-05,6.1e-05,0.000185,7.3e-05,1.8e-05,2.7e-05,0.000111,9.7e-05,8.3e-05,6.1e-05,6e-05,7.8e-05,0.000178,6.1e-05,0.000103,3.8e-05,8.4e-05,0.000205,0.000195,1.8e-05,5.3e-05,0.00016,0.000121,0.000112,4.4e-05,0.000123,0.000258,3.2e-05,5.9e-05,0.000102,7e-05,5.4e-05,7.2e-05,5.3e-05,6.2e-05,0.000191,0.00011,4.9e-05,0.000197,0.000269,9.2e-05,5.8e-05,7.1e-05,4.2e-05,0.000117,5.7e-05,8.5e-05,0.000112,0.00014,0.000194,9.6e-05,0.000119,6.8e-05,4.2e-05,5.5e-05,5.2e-05,0.000124,0.000147,0.000121
9e-06,2.7e-05,2.4e-05,1.3e-05,2.4e-05,2.9e-05,6.1e-05,4.8e-05,3e-06,1.5e-05,1.1e-05,2.5e-05,5.6e-05,4e-06,4e-06,6e-06,2e-05,1.9e-05,1.3e-05,5.3e-05,7.9e-05,3.9e-05,1.6e-05,4.5e-05,9e-06,1.7e-05,5.7e-05,5.7e-05,1.5e-05,2.7e-05,4e-05,3.9e-05,1.7e-05,2.4e-05,2.7e-05,8e-06,2.5e-05,3.3e-05,4e-05,6.2e-05,3.1e-05,3.6e-05,3.5e-05,5.1e-05,8.1e-05,8.1e-05,1.4e-05,5.7e-05,3e-05,3e-05,2.9e-05,4e-05,1.5e-05,2.9e-05,5e-05,4.1e-05,5.9e-05,0.000127,9.2e-05,8e-05,0.000108,7.5e-05,7.3e-05,9.3e-05,0.000217,0.000156,8.6e-05,4.8e-05,0.000109,0.000164,0.000126,0.000102,0.000106,0.000134,8.9e-05,5e-05,1e-04,7.7e-05,4.4e-05,0.000174,0.000318,0.000286,7.8e-05,6.4e-05,7.4e-05,7.3e-05,0.000136,1e-04,4.2e-05,9.3e-05,7.7e-05,8.6e-05,0.000185,0.000126,7.3e-05,1.4e-05,8.4e-05,0.000197,0.000131,9.1e-05,0.000132,0.000205,0.000147,4.7e-05,4.3e-05,6.1e-05,6.7e-05,5.8e-05,7.7e-05,6.7e-05,9.8e-05,8.1e-05,0.000123,5.2e-05,9.9e-05,5.1e-05,5.7e-05,9.8e-05,0.000155,4.6e-05,0.000116
7e-06,1.9e-05,1.6e-05,1.5e-05,1.9e-05,2.3e-05,1.5e-05,8e-06,3e-06,2.4e-05,2e-05,1.5e-05,3.5e-05,9e-06,1.9e-05,6e-06,1.8e-05,1.1e-05,1.7e-05,1.2e-05,3.5e-05,2.4e-05,2e-05,1.6e-05,1.2e-05,1.6e-05,5e-05,1.2e-05,2.9e-05,9e-06,1.6e-05,1.9e-05,1.9e-05,3.3e-05,3.4e-05,1.9e-05,2.6e-05,3.3e-05,2.1e-05,7.1e-05,4e-05,4.8e-05,2.5e-05,3.6e-05,7e-05,1e-05,3.9e-05,4.5e-05,1.3e-05,2.1e-05,5.2e-05,3.1e-05,3.6e-05,1.6e-05,2.7e-05,3.3e-05,4.3e-05,9.6e-05,6.3e-05,4.2e-05,0.000142,4.9e-05,2.7e-05,0.000191,8e-05,3.1e-05,2.8e-05,1.7e-05,0.00012,0.000108,4.8e-05,0.000114,9.9e-05,6.8e-05,8.9e-05,0.000137,9.3e-05,0.000112,4.9e-05,0.000163,0.00035,0.000189,0.000117,8.6e-05,8.9e-05,5.6e-05,4.5e-05,1.5e-05,1.6e-05,4e-05,9.3e-05,1.8e-05,0.00014,6.8e-05,6.1e-05,5.2e-05,7.6e-05,9.7e-05,0.000121,5.4e-05,0.000167,0.000139,4.2e-05,9.2e-05,7.4e-05,0.000134,0.000154,3e-05,7.2e-05,9.9e-05,8.8e-05,7.7e-05,2.9e-05,9.2e-05,6.3e-05,9.1e-05,3.1e-05,2.8e-05,0.000114,0.000142,6.1e-05
8e-06,2.4e-05,9e-06,2e-05,1.6e-05,2.2e-05,7e-06,1.7e-05,7e-06,1.2e-05,1e-05,1.9e-05,3.2e-05,3.2e-05,2.7e-05,1.7e-05,2.3e-05,1.3e-05,1.7e-05,2.5e-05,1.1e-05,1.3e-05,1.4e-05,2.1e-05,1.2e-05,2.9e-05,3.6e-05,1.8e-05,1.8e-05,3.3e-05,2.9e-05,1.5e-05,7e-06,1.5e-05,3.2e-05,1.4e-05,2.4e-05,4.8e-05,2.9e-05,1.1e-05,2.2e-05,4.4e-05,7e-06,3.1e-05,6.5e-05,4.3e-05,4.4e-05,2.3e-05,3.5e-05,4.2e-05,5.8e-05,3.4e-05,5.6e-05,4.4e-05,3.8e-05,5.6e-05,4.4e-05,1.9e-05,3.8e-05,6.5e-05,5e-05,6.5e-05,1.7e-05,0.000184,6.2e-05,3.2e-05,1.1e-05,1.8e-05,7.8e-05,4.2e-05,2.5e-05,9.3e-05,2e-05,1.6e-05,0.000143,5.7e-05,8.2e-05,0.000133,0.00016,1.3e-05,0.000219,0.00012,4.9e-05,5.7e-05,6.2e-05,9.3e-05,8.3e-05,1.1e-05,6.7e-05,7.1e-05,3.5e-05,1.8e-05,9.7e-05,7.1e-05,4e-05,2.2e-05,4.6e-05,0.000101,3.6e-05,1.7e-05,0.000122,6e-05,0.000107,0.000125,2.3e-05,0.000101,1.3e-05,1.2e-05,5.7e-05,7.6e-05,3.7e-05,7.6e-05,4.9e-05,5.6e-05,6.8e-05,5.8e-05,6.5e-05,0.000102,0.000154,3.9e-05,0.000106
7e-06,2e-05,2.3e-05,1.5e-05,2.1e-05,2.5e-05,2e-05,9e-06,9e-06,8e-06,1e-05,8e-06,1.1e-05,3e-05,1e-05,4e-06,1.5e-05,8e-06,9e-06,1e-05,1.2e-05,9e-06,9e-06,2e-05,2.3e-05,4e-06,3.8e-05,2e-05,1.3e-05,2.7e-05,3e-05,1.5e-05,8e-06,8e-06,1.8e-05,1.8e-05,1.2e-05,2.7e-05,1.2e-05,1e-05,3.6e-05,3.5e-05,3.7e-05,1e-05,1.7e-05,2.3e-05,1.1e-05,2e-05,1.1e-05,3.2e-05,7.5e-05,5.9e-05,6e-06,1.2e-05,2.7e-05,2.2e-05,2.2e-05,4e-06,3.1e-05,5.5e-05,5.5e-05,1.2e-05,4e-05,9.9e-05,2.7e-05,3e-05,1.9e-05,1.7e-05,6e-05,2.7e-05,4.7e-05,4.5e-05,8.8e-05,6.8e-05,5.2e-05,7.9e-05,1.1e-05,0.000116,6.7e-05,0.000128,6.1e-05,3.9e-05,3.6e-05,5.7e-05,5.1e-05,3.9e-05,1.4e-05,3e-05,1.9e-05,2.6e-05,4e-05,1.7e-05,5.6e-05,3.6e-05,1.7e-05,1.9e-05,2e-05,6.6e-05,4.2e-05,2.3e-05,5.1e-05,2.7e-05,4.2e-05,4.1e-05,8.6e-05,5.3e-05,9.1e-05,1.7e-05,2.4e-05,5.5e-05,5.7e-05,5e-05,1.8e-05,4.1e-05,2.2e-05,2e-06,2.4e-05,7.9e-05,4.3e-05,8.8e-05,6.8e-05
6e-06,2.5e-05,1e-05,6e-06,2.2e-05,1.6e-05,6e-06,9e-06,2.8e-05,4e-05,1.7e-05,7e-06,3.1e-05,3.4e-05,7e-06,5e-06,6e-06,5e-06,1.2e-05,2.5e-05,1.8e-05,1.4e-05,2.5e-05,1.9e-05,2.1e-05,8e-06,5.9e-05,5.7e-05,2.6e-05,1.5e-05,3.5e-05,1.8e-05,2.2e-05,1.1e-05,1.5e-05,2.7e-05,1.9e-05,4e-05,1.7e-05,7e-06,3.9e-05,1.4e-05,4.9e-05,1.2e-05,4.3e-05,3e-06,3.7e-05,4e-05,4e-06,2.1e-05,4e-05,3.9e-05,1.9e-05,7e-06,2.5e-05,2.5e-05,4.5e-05,1e-06,1.6e-05,5.2e-05,1.7e-05,5.2e-05,1.5e-05,5.7e-05,3.1e-05,3.7e-05,2.1e-05,1.2e-05,6.2e-05,2.1e-05,3.3e-05,4e-05,5.6e-05,1.9e-05,5.5e-05,2e-05,4e-05,8e-05,9.7e-05,7.7e-05,2.4e-05,2.6e-05,4.6e-05,5.1e-05,5.2e-05,3.9e-05,3.6e-05,1e-05,1.7e-05,1.6e-05,2.7e-05,1.3e-05,3.1e-05,2.6e-05,7.2e-05,4e-05,5.2e-05,4.3e-05,5.7e-05,1.8e-05,7.7e-05,2.9e-05,4.3e-05,1.6e-05,5.4e-05,3.6e-05,5.7e-05,2.9e-05,3.2e-05,1e-05,7.3e-05,4.4e-05,4.8e-05,1.4e-05,2.9e-05,4e-05,8e-06,4.6e-05,2.3e-05,3.9e-05,4.6e-05
1.4e-05,1.5e-05,4.3e-05,2.2e-05,1.6e-05,1.7e-05,1.4e-05,3.3e-05,4.4e-05,2e-05,1.9e-05,1.2e-05,1.9e-05,3.6e-05,2e-05,4e-06,9e-06,1.5e-05,2.5e-05,2.5e-05,3e-06,5e-06,2.8e-05,1.2e-05,2.4e-05,3.6e-05,7.8e-05,4.3e-05,8.1e-05,7.8e-05,4.4e-05,8e-06,2.5e-05,1.6e-05,1.2e-05,7e-06,4e-05,4.5e-05,2.5e-05,1.5e-05,3.5e-05,2.2e-05,2.4e-05,5.3e-05,3.7e-05,7.1e-05,4.1e-05,5e-05,7.5e-05,6.7e-05,4.6e-05,1.8e-05,4.5e-05,4.6e-05,2.6e-05,3.1e-05,7.9e-05,2.6e-05,1.7e-05,6.3e-05,5.2e-05,5.8e-05,7.8e-05,9.7e-05,3.8e-05,7.5e-05,3.8e-05,4.6e-05,9.1e-05,3.6e-05,2.7e-05,0.000113,3.6e-05,0.000103,0.000163,0.000153,6.6e-05,2.2e-05,8.2e-05,0.000151,8.5e-05,8.1e-05,0.000101,0.000147,0.000105,0.000135,0.000125,9.9e-05,6.1e-05,7.7e-05,7.9e-05,4.3e-05,7.6e-05,4.3e-05,9.8e-05,0.000111,0.000131,0.000115,0.000132,5.9e-05,0.000134,9.2e-05,4.1e-05,1.2e-05,2.3e-05,1.4e-05,0.000127,0.000119,0.000106,9.2e-05,6.9e-05,3.5e-05,0.000132,0.000153,8.3e-05,3.3e-05,5.5e-05,7.7e-05,2.4e-05,9.3e-05,0.000139
2e-05,2.9e-05,4e-05,1.6e-05,5e-06,4.2e-05,2.5e-05,3.4e-05,1.7e-05,1.9e-05,3e-05,3.8e-05,3e-05,5.7e-05,2.9e-05,3.8e-05,1.8e-05,2.4e-05,2.3e-05,2.3e-05,3.1e-05,2.5e-05,2.7e-05,3.7e-05,4e-05,1.8e-05,2e-05,4.2e-05,6.5e-05,1.2e-05,1.4e-05,4e-05,3.6e-05,2.7e-05,4.6e-05,3.1e-05,3e-05,3.1e-05,1.3e-05,5.9e-05,3.6e-05,4e-05,3.1e-05,5.8e-05,6.1e-05,4.4e-05,6.8e-05,3e-05,6.7e-05,2.1e-05,5.2e-05,3.8e-05,3.5e-05,2.1e-05,4.1e-05,4.9e-05,6.3e-05,6.7e-05,8.1e-05,1.6e-05,5.6e-05,5.8e-05,6.4e-05,0.000136,4.3e-05,6e-05,4.7e-05,9e-05,0.000168,0.000104,6.1e-05,7.1e-05,0.000115,0.000108,6.8e-05,3.8e-05,1.7e-05,5.9e-05,6e-05,7.9e-05,2.8e-05,9.2e-05,0.000102,9.4e-05,0.000179,0.000157,2e-05,6.4e-05,9.8e-05,0.000162,4.5e-05,6.4e-05,6.8e-05,7.1e-05,8.7e-05,0.000106,3.8e-05,1.7e-05,5.2e-05,0.000118,8.9e-05,6.7e-05,5.5e-05,9.1e-05,4e-05,4.2e-05,0.000126,5.8e-05,5.4e-05,3.6e-05,0.000111,0.000106,0.00018,1.9e-05,2.2e-05,5.2e-05,3.5e-05,4e-05,9.9e-05,0.000174,5.2e-05
3.2e-05,2.7e-05,2.1e-05,1e-06,7e-06,3.1e-05,1.6e-05,9e-06,1.9e-05,9e-06,1.3e-05,1.8e-05,2e-05,5.4e-05,2.4e-05,3.5e-05,1.2e-05,1.7e-05,6e-06,1.5e-05,4.9e-05,5.7e-05,3e-05,4.4e-05,3.1e-05,3e-05,3e-05,4.3e-05,3.3e-05,2.3e-05,3.8e-05,3.9e-05,8.2e-05,5e-05,7e-05,4.3e-05,3.9e-05,7.1e-05,5.9e-05,4.6e-05,4.2e-05,6e-05,3.3e-05,3.1e-05,4.2e-05,7.5e-05,9.1e-05,8.6e-05,2.6e-05,6.1e-05,2.7e-05,1.4e-05,3.1e-05,1.9e-05,6.4e-05,8.5e-05,0.000124,0.000102,4.6e-05,6.6e-05,9.9e-05,5.4e-05,2.8e-05,6.1e-05,2.8e-05,7.3e-05,2.3e-05,7.4e-05,5.4e-05,6.9e-05,0.000126,7.7e-05,7.3e-05,0.000135,6.4e-05,3.8e-05,2.3e-05,0.000137,5.3e-05,1e-04,0.000122,2.3e-05,1.2e-05,0.000121,0.000112,8e-05,0.000124,0.000168,0.000242,0.000225,0.000136,0.000132,0.000152,1.2e-05,1e-04,5.2e-05,7.9e-05,4.3e-05,1.7e-05,9.2e-05,0.000151,7.2e-05,7e-05,0.000137,9e-05,3.7e-05,8.4e-05,3e-05,6e-05,9.2e-05,0.000117,0.000119,7.8e-05,9e-05,8.9e-05,7.7e-05,4.2e-05,3.5e-05,7.2e-05,5.6e-05,0.000137
1.9e-05,8e-06,2.5e-05,2e-05,2.2e-05,8e-06,1.1e-05,2.3e-05,1.8e-05,1e-05,5e-06,2e-05,4.5e-05,2.5e-05,3e-05,5e-06,5e-06,1.3e-05,2.3e-05,2.6e-05,4.2e-05,1.2e-05,2e-05,1.3e-05,2.4e-05,3.7e-05,7.5e-05,7.2e-05,4.5e-05,1.2e-05,3.8e-05,2.8e-05,5.5e-05,2.4e-05,3.4e-05,3e-05,3.2e-05,3.1e-05,5e-06,3.7e-05,2.1e-05,3.6e-05,5.4e-05,3.7e-05,2.8e-05,2.7e-05,4.3e-05,2.5e-05,6e-06,3e-05,1.8e-05,1.9e-05,9e-06,1e-05,5.8e-05,4.3e-05,3.5e-05,5.5e-05,9.2e-05,4.3e-05,4.4e-05,5e-05,7.2e-05,2.5e-05,6.3e-05,7.2e-05,5.9e-05,4.4e-05,8.1e-05,5.1e-05,7.1e-05,7.3e-05,2.2e-05,1.1e-05,4.6e-05,7.9e-05,6.8e-05,0.000125,0.000105,9.2e-05,8e-05,7.6e-05,7e-05,8.7e-05,6.8e-05,0.000112,2.6e-05,7.4e-05,0.000117,3e-05,4.5e-05,8.1e-05,6.3e-05,7.5e-05,8e-05,9.8e-05,7.6e-05,5.8e-05,2.9e-05,3.4e-05,3.6e-05,5e-05,5.9e-05,1e-04,4e-05,9e-06,0.000125,8.7e-05,9.3e-05,7.3e-05,1.2e-05,4.4e-05,6.1e-05,8.5e-05,1.9e-05,4.3e-05,7.6e-05,0.000108,3.3e-05,2.7e-05,3.9e-05
1.7e-05,1.8e-05,2e-05,3.8e-05,1.5e-05,1.7e-05,1.4e-05,2.3e-05,9e-06,4e-06,1.6e-05,2e-05,2.5e-05,2.6e-05,2.7e-05,2.4e-05,1.6e-05,9e-06,9e-06,2e-05,2.7e-05,2.2e-05,1.3e-05,2.2e-05,1.8e-05,2.8e-05,3.6e-05,1.6e-05,1.9e-05,1.2e-05,2.5e-05,3.5e-05,2.8e-05,9e-06,2.1e-05,3.1e-05,9e-06,1.3e-05,9e-06,8e-06,1e-05,2.9e-05,3.4e-05,1.9e-05,2.7e-05,2.6e-05,2.7e-05,1e-05,1.1e-05,3e-05,5.5e-05,4.9e-05,4.1e-05,1.9e-05,4.7e-05,4e-05,2.6e-05,3.7e-05,4.7e-05,6.9e-05,6e-05,1.1e-05,7.7e-05,9.7e-05,3.3e-05,2.4e-05,4.3e-05,2.1e-05,5.7e-05,2.2e-05,7.5e-05,7.4e-05,3.6e-05,6.5e-05,1.3e-05,5.1e-05,7.7e-05,0.000115,4.4e-05,4.9e-05,5.6e-05,2.8e-05,4e-05,7.9e-05,8.4e-05,5.1e-05,3.8e-05,7.3e-05,4.7e-05,1.1e-05,3.1e-05,6e-05,7.9e-05,4.8e-05,2.1e-05,6.5e-05,3e-05,4.5e-05,7.6e-05,4.6e-05,5.3e-05,5.8e-05,4e-05,5.2e-05,5.1e-05,4.1e-05,0.000126,2.4e-05,3.4e-05,3.8e-05,2.9e-05,1e-04,5.1e-05,3e-05,8.7e-05,2.9e-05,4.6e-05,4.4e-05,1.3e-05,7e-06,5.2e-05
1.9e-05,8e-06,1.4e-05,3.7e-05,1.9e-05,1e-05,1.4e-05,2.2e-05,2.5e-05,1.1e-05,2.5e-05,1.4e-05,3e-05,1e-05,9e-06,6e-06,7e-06,1.5e-05,1.5e-05,1.7e-05,1.2e-05,1.5e-05,1.4e-05,1.1e-05,8e-06,2.6e-05,2.4e-05,3.2e-05,1.2e-05,1.5e-05,1.5e-05,1.6e-05,2.5e-05,3.9e-05,3.7e-05,4.1e-05,2.1e-05,6.1e-05,4.6e-05,1.4e-05,3.3e-05,3.3e-05,2.8e-05,5.5e-05,3.7e-05,3e-05,4e-05,3e-05,1.3e-05,2.7e-05,6.1e-05,6e-06,3.2e-05,5e-06,1.6e-05,2.3e-05,1.9e-05,4.2e-05,2.7e-05,6.1e-05,2.6e-05,1.7e-05,5.1e-05,4.9e-05,3.4e-05,4.2e-05,4.3e-05,6.3e-05,6.4e-05,3.2e-05,7.7e-05,9.6e-05,8.1e-05,5.7e-05,1e-04,5.6e-05,3.7e-05,6.7e-05,5.3e-05,4.8e-05,5e-05,4.6e-05,1.9e-05,5.2e-05,0.000133,5.8e-05,1.8e-05,6.9e-05,5.1e-05,4.8e-05,3.1e-05,3.6e-05,5e-06,2.4e-05,3.4e-05,3.5e-05,4.6e-05,5.1e-05,7.7e-05,6.9e-05,5.5e-05,4.9e-05,3.4e-05,3.6e-05,4.7e-05,6e-05,6.8e-05,4.2e-05,3.3e-05,6.4e-05,3.5e-05,9.3e-05,0.000136,8.5e-05,8.8e-05,6e-05,1.9e-05,5.4e-05,2.5e-05,4.1e-05,4.8e-05
1e-05,6e-06,1.5e-05,1.2e-05,2.2e-05,1.4e-05,2.2e-05,1e-05,9e-06,1.3e-05,3.1e-05,2.3e-05,2.6e-05,2.4e-05,5e-06,1.1e-05,7e-06,7e-06,5e-06,4e-06,1e-05,2.5e-05,2.9e-05,2.5e-05,2.9e-05,2.8e-05,2e-05,1.6e-05,3e-06,2.9e-05,2.6e-05,2.7e-05,3.5e-05,4.6e-05,2.7e-05,3e-05,4.6e-05,5.9e-05,2.9e-05,1.7e-05,4.5e-05,5.4e-05,3.2e-05,4.9e-05,2.1e-05,1.7e-05,3.9e-05,1.9e-05,8e-06,2.5e-05,1.4e-05,2.2e-05,4e-05,3.1e-05,4.2e-05,1e-05,1.7e-05,6e-05,1.3e-05,7e-05,6.3e-05,5.7e-05,4.3e-05,5.4e-05,2.9e-05,6.4e-05,1.7e-05,3.9e-05,7.4e-05,3.8e-05,5.3e-05,5.3e-05,2.4e-05,9.5e-05,0.000116,2.7e-05,3.2e-05,7.4e-05,8.1e-05,8.7e-05,5.3e-05,0.000106,6.6e-05,7.9e-05,3.5e-05,4.8e-05,2.6e-05,4.8e-05,2.9e-05,7.2e-05,6.6e-05,3.4e-05,1.8e-05,3.8e-05,4.6e-05,3.8e-05,9e-06,4.3e-05,2e-05,4.2e-05,4.3e-05,3.5e-05,6.9e-05,3.9e-05,4.1e-05,0.000112,0.000111,6.9e-05,5.7e-05,2.5e-05,6e-06,7e-05,8.4e-05,7.7e-05,2.4e-05,5.5e-05,4.4e-05,2.7e-05,4.5e-05,6.8e-05,4.6e-05
6e-06,5e-06,8e-06,7e-06,1.4e-05,1.2e-05,4e-06,1.6e-05,1.2e-05,1.4e-05,1.3e-05,2.6e-05,2e-05,2.7e-05,1.4e-05,1e-05,8e-06,1.7e-05,1.3e-05,8e-06,1.5e-05,4.1e-05,1e-05,8e-06,1.9e-05,2.3e-05,2.3e-05,2.2e-05,2.2e-05,3.7e-05,5.4e-05,4.1e-05,1.3e-05,1.8e-05,2.2e-05,1.4e-05,2e-05,4.3e-05,4.8e-05,1.5e-05,4.5e-05,4.1e-05,1.1e-05,4.2e-05,2.8e-05,2e-05,3e-05,2.5e-05,2.3e-05,2e-05,2.8e-05,8e-06,3.8e-05,3.2e-05,2e-05,4.4e-05,1.6e-05,4.6e-05,4.4e-05,8.7e-05,4.1e-05,1.6e-05,3.6e-05,6.9e-05,7.4e-05,7.4e-05,3e-05,5e-06,2e-05,1.5e-05,3.9e-05,2.9e-05,5.1e-05,5.6e-05,7.1e-05,6.1e-05,7e-05,1e-04,9.4e-05,9e-06,6.5e-05,4.9e-05,7e-06,2.1e-05,2.8e-05,5.8e-05,4.1e-05,3.1e-05,1.8e-05,4.3e-05,2.2e-05,1.8e-05,1e-06,3.3e-05,4.3e-05,2.7e-05,1.3e-05,2.1e-05,2e-05,2.6e-05,6.3e-05,8.7e-05,1.6e-05,5.8e-05,1.8e-05,8.7e-05,6e-05,4e-05,2.9e-05,4.4e-05,1.5e-05,1.6e-05,4.1e-05,5.4e-05,3.1e-05,7.9e-05,5e-05,1.2e-05,2e-05,4.2e-05,2.8e-05
4e-06,5e-06,9e-06,1.3e-05,1e-05,1e-06,7e-06,1.3e-05,9e-06,1.5e-05,1.5e-05,1.3e-05,1.4e-05,1.5e-05,9e-06,7e-06,1e-05,1e-05,3e-06,7e-06,1.7e-05,2.7e-05,2.8e-05,2.2e-05,2.3e-05,3.4e-05,7e-06,6e-06,8e-06,2.5e-05,2.4e-05,1.1e-05,1e-05,1.4e-05,1.7e-05,1.6e-05,1.6e-05,2.9e-05,9e-06,1.8e-05,3.4e-05,8e-06,1.7e-05,3.4e-05,1.3e-05,1.9e-05,2e-05,1.9e-05,1.5e-05,5e-06,3.5e-05,4.3e-05,4.8e-05,3.2e-05,2.1e-05,2.6e-05,2.8e-05,3e-05,2.4e-05,5.2e-05,2.7e-05,3.2e-05,1.9e-05,9.3e-05,8.5e-05,1.8e-05,2.8e-05,3e-05,2.6e-05,1.5e-05,4e-05,2e-05,1.5e-05,4.4e-05,6.3e-05,4.6e-05,5.8e-05,6.5e-05,4.6e-05,6.5e-05,2.4e-05,5.5e-05,5.3e-05,5.4e-05,2.1e-05,3.7e-05,2.4e-05,1.4e-05,3.5e-05,1.7e-05,3.2e-05,2.9e-05,2e-05,3e-05,2.4e-05,5e-06,1e-05,1.9e-05,2.3e-05,4e-05,4.5e-05,3.6e-05,2.3e-05,3.6e-05,1.6e-05,3.8e-05,3.4e-05,9e-06,1e-05,1.4e-05,3.8e-05,6.3e-05,7.2e-05,1.4e-05,1.4e-05,8.4e-05,8.5e-05,3.2e-05,8e-06,3.4e-05,2.2e-05
1e-06,1e-06,6e-06,3e-06,7e-06,5e-06,2e-06,7e-06,4e-06,8e-06,5e-06,5e-06,4e-06,8e-06,0,3e-06,4e-06,2e-06,3e-06,3e-06,7e-06,5e-06,4e-06,4e-06,4e-06,6e-06,8e-06,1e-06,4e-06,4e-06,9e-06,7e-06,5e-06,6e-06,6e-06,9e-06,3e-06,8e-06,7e-06,5e-06,3e-06,4e-06,7e-06,7e-06,5e-06,4e-06,9e-06,1.2e-05,1.9e-05,1.3e-05,1.3e-05,1.3e-05,4e-06,6e-06,2e-06,5e-06,8e-06,1.3e-05,1.5e-05,8e-06,7e-06,1.8e-05,1.2e-05,2.8e-05,1.3e-05,1e-05,1.9e-05,1.4e-05,4e-06,5e-06,6e-06,9e-06,2.2e-05,3e-05,1.4e-05,1.3e-05,8e-06,1.4e-05,1.2e-05,2e-05,2.2e-05,1.7e-05,2.7e-05,1.7e-05,1.9e-05,1.7e-05,6e-06,1e-05,2.4e-05,7e-06,2.3e-05,9e-06,3e-06,1.1e-05,1.2e-05,9e-06,9e-06,1e-05,7e-06,2e-05,2.1e-05,2e-06,7e-06,6e-06,4e-06,1.8e-05,3.7e-05,2.9e-05,1.2e-05,5e-06,1.5e-05,1.7e-05,1.7e-05,1.6e-05,1.9e-05,2.2e-05,1.5e-05,2.5e-05,1.5e-05,6e-06,7e-06
5e-06,6e-06,3e-06,2e-06,4e-06,1.2e-05,1e-05,4e-06,5e-06,1.1e-05,9e-06,7e-06,8e-06,5e-06,3e-06,3e-06,5e-06,1e-06,4e-06,6e-06,8e-06,5e-06,6e-06,6e-06,1e-06,4e-06,4e-06,6e-06,4e-06,1e-06,1e-05,9e-06,3e-06,1e-06,6e-06,7e-06,1e-05,0,5e-06,4e-06,9e-06,9e-06,7e-06,9e-06,1e-05,7e-06,9e-06,5e-06,1.1e-05,4e-06,1e-05,7e-06,3e-06,5e-06,1.3e-05,1.1e-05,6e-06,1e-05,5e-06,1.1e-05,3e-06,1.4e-05,3e-06,2.3e-05,7e-06,7e-06,1.1e-05,6e-06,6e-06,1e-05,1.3e-05,8e-06,1.7e-05,2.9e-05,3e-06,1.7e-05,1.4e-05,1.4e-05,1e-05,1.9e-05,1.8e-05,9e-06,1.5e-05,2.1e-05,1.6e-05,1.6e-05,1e-05,2.3e-05,3.9e-05,1.6e-05,1.6e-05,6e-06,4e-06,1.2e-05,7e-06,1e-06,8e-06,1.5e-05,1.4e-05,1.6e-05,2.4e-05,1.2e-05,1.4e-05,3e-06,8e-06,1.2e-05,3e-05,1.1e-05,4e-06,1e-06,3e-06,1.1e-05,1.8e-05,1e-05,1e-05,2.3e-05,8e-06,1.3e-05,8e-06,8e-06,4e-06
3e-06,5e-06,3e-06,3e-06,4e-06,8e-06,3e-06,5e-06,6e-06,3e-06,4e-06,1e-06,3e-06,5e-06,2e-06,5e-06,2e-06,2e-06,4e-06,3e-06,6e-06,3e-06,6e-06,1e-06,3e-06,2e-06,5e-06,1e-06,4e-06,2e-06,1.5e-05,4e-06,2e-06,3e-06,3e-06,3e-06,7e-06,6e-06,2e-06,6e-06,7e-06,7e-06,7e-06,9e-06,6e-06,7e-06,1e-05,7e-06,4e-06,4e-06,1.2e-05,8e-06,2e-06,3e-06,1e-05,3e-06,8e-06,7e-06,1e-06,9e-06,7e-06,1.1e-05,7e-06,2.3e-05,6e-06,6e-06,1e-05,7e-06,7e-06,1.2e-05,9e-06,1e-06,1.7e-05,3.7e-05,7e-06,7e-06,1.2e-05,1.3e-05,5e-06,8e-06,6e-06,3e-06,8e-06,1.4e-05,1.2e-05,1.4e-05,1e-05,2e-05,2e-05,1.2e-05,1.7e-05,5e-06,5e-06,6e-06,4e-06,4e-06,2e-06,4e-06,6e-06,1e-05,1.3e-05,5e-06,1.2e-05,5e-06,9e-06,7e-06,1.9e-05,1e-06,4e-06,7e-06,6e-06,2e-06,9e-06,1.3e-05,2e-06,7e-06,4e-06,1.5e-05,5e-06,1.4e-05,6e-06
1e-06,4e-06,2e-06,2e-06,4e-06,5e-06,3e-06,3e-06,4e-06,2e-06,4e-06,3e-06,4e-06,4e-06,4e-06,2e-06,2e-06,3e-06,2e-06,4e-06,5e-06,2e-06,2e-06,3e-06,1e-06,1e-06,3e-06,1e-06,3e-06,5e-06,7e-06,1e-06,3e-06,2e-06,2e-06,5e-06,3e-06,1e-06,2e-06,1e-06,5e-06,2e-06,2e-06,3e-06,3e-06,6e-06,5e-06,1e-06,6e-06,2e-06,8e-06,7e-06,2e-06,1e-06,5e-06,7e-06,8e-06,4e-06,3e-06,3e-06,4e-06,2e-06,2e-06,2e-05,7e-06,4e-06,3e-06,1e-06,6e-06,3e-06,7e-06,3e-06,1.4e-05,2.5e-05,8e-06,1e-05,1.6e-05,3e-06,6e-06,3e-06,4e-06,8e-06,4e-06,1.2e-05,8e-06,1.1e-05,8e-06,1.6e-05,1.1e-05,8e-06,1.3e-05,6e-06,2e-06,2e-06,3e-06,3e-06,3e-06,5e-06,1e-06,9e-06,1.4e-05,3e-06,1.3e-05,2e-06,5e-06,1.2e-05,2.8e-05,5e-06,1e-06,5e-06,1e-06,3e-06,1.2e-05,1.2e-05,4e-06,6e-06,3e-06,1.3e-05,5e-06,4e-06,2e-06
1e-06,2e-06,1e-06,1e-06,2e-06,3e-06,2e-06,3e-06,2e-06,1e-06,4e-06,2e-06,3e-06,3e-06,3e-06,2e-06,1e-06,2e-06,1e-06,2e-06,3e-06,1e-06,1e-06,2e-06,2e-06,2e-06,2e-06,0,2e-06,4e-06,6e-06,3e-06,1e-06,1e-06,1e-06,5e-06,2e-06,1e-06,2e-06,3e-06,2e-06,2e-06,2e-06,5e-06,4e-06,5e-06,4e-06,1e-06,6e-06,3e-06,1.2e-05,3e-06,1e-06,2e-06,2e-06,5e-06,5e-06,1.1e-05,5e-06,8e-06,1e-06,5e-06,3e-06,2e-05,7e-06,7e-06,4e-06,1e-06,5e-06,5e-06,5e-06,3e-06,1.1e-05,1.9e-05,8e-06,8e-06,1.6e-05,1e-05,9e-06,6e-06,7e-06,1.1e-05,1.1e-05,2.2e-05,1e-06,9e-06,3e-06,1.3e-05,7e-06,5e-06,8e-06,2e-06,1e-06,5e-06,4e-06,3e-06,7e-06,6e-06,1e-06,1e-05,1.3e-05,4e-06,1e-05,5e-06,2e-06,1.5e-05,2.3e-05,1e-06,4e-06,3e-06,7e-06,8e-06,6e-06,7e-06,2e-06,2e-06,3e-06,8e-06,6e-06,3e-06,3e-06
1e-06,2e-06,2e-06,1e-06,1e-06,5e-06,0,3e-06,1e-06,2e-06,3e-06,2e-06,4e-06,3e-06,1e-06,2e-06,1e-06,1e-06,2e-06,1e-06,5e-06,1e-06,1e-06,2e-06,2e-06,3e-06,3e-06,2e-06,3e-06,2e-06,9e-06,3e-06,2e-06,2e-06,3e-06,1e-06,2e-06,2e-06,1e-06,2e-06,5e-06,1e-06,4e-06,6e-06,3e-06,4e-06,2e-06,3e-06,4e-06,3e-06,1e-05,3e-06,2e-06,2e-06,5e-06,4e-06,1e-06,6e-06,2e-06,7e-06,4e-06,8e-06,8e-06,1.3e-05,5e-06,2e-06,5e-06,5e-06,5e-06,2e-06,6e-06,3e-06,1.3e-05,1.8e-05,9e-06,1e-05,4e-06,1e-06,5e-06,1.2e-05,4e-06,7e-06,7e-06,1.1e-05,2e-06,9e-06,5e-06,1e-05,1.2e-05,6e-06,1.2e-05,6e-06,1e-06,5e-06,7e-06,1e-06,2e-06,7e-06,5e-06,9e-06,9e-06,2e-06,1e-05,2e-06,3e-06,7e-06,1.6e-05,2e-06,2e-06,7e-06,6e-06,1.1e-05,1e-05,4e-06,1e-06,5e-06,3e-06,8e-06,5e-06,3e-06,1e-06
1e-06,3e-06,2e-06,1e-06,1e-06,2e-06,1e-06,3e-06,1e-06,2e-06,1e-06,1e-06,4e-06,5e-06,1e-06,0,1e-06,1e-06,2e-06,2e-06,3e-06,1e-06,1e-06,2e-06,2e-06,2e-06,3e-06,2e-06,3e-06,3e-06,6e-06,1e-06,2e-06,1e-06,3e-06,4e-06,2e-06,1e-06,2e-06,1e-06,4e-06,1e-06,2e-06,5e-06,1e-06,3e-06,2e-06,3e-06,6e-06,1e-06,9e-06,3e-06,3e-06,3e-06,2e-06,3e-06,1e-06,8e-06,1e-06,6e-06,1e-06,7e-06,4e-06,1.5e-05,8e-06,3e-06,4e-06,2e-06,2e-06,6e-06,5e-06,1e-06,1.2e-05,1.8e-05,3e-06,9e-06,5e-06,2e-06,4e-06,1.2e-05,8e-06,2e-06,1e-05,1.4e-05,3e-06,1.1e-05,9e-06,9e-06,9e-06,5e-06,5e-06,5e-06,3e-06,4e-06,2e-06,3e-06,1e-06,5e-06,5e-06,7e-06,1.2e-05,4e-06,9e-06,3e-06,5e-06,4e-06,2.2e-05,3e-06,1e-06,4e-06,6e-06,6e-06,9e-06,3e-06,4e-06,3e-06,3e-06,9e-06,2e-06,5e-06,4e-06
0,2e-06,1e-06,1e-06,1e-06,3e-06,2e-06,5e-06,3e-06,0,1e-06,1e-06,4e-06,4e-06,2e-06,1e-06,2e-06,2e-06,1e-06,2e-06,4e-06,2e-06,2e-06,5e-06,2e-06,4e-06,3e-06,1e-06,2e-06,2e-06,5e-06,2e-06,1e-06,2e-06,2e-06,3e-06,2e-06,1e-06,2e-06,1e-06,7e-06,2e-06,1e-06,2e-06,1e-06,5e-06,4e-06,3e-06,4e-06,2e-06,7e-06,2e-06,2e-06,2e-06,2e-06,2e-06,1e-06,8e-06,1e-06,3e-06,4e-06,5e-06,4e-06,1.2e-05,4e-06,2e-06,7e-06,3e-06,4e-06,8e-06,3e-06,3e-06,1e-05,2e-05,2e-06,8e-06,5e-06,3e-06,4e-06,1.4e-05,4e-06,3e-06,4e-06,1.3e-05,4e-06,1.1e-05,8e-06,8e-06,9e-06,2e-06,3e-06,5e-06,4e-06,3e-06,4e-06,4e-06,2e-06,3e-06,1e-06,4e-06,1e-05,2e-06,8e-06,4e-06,5e-06,1.1e-05,2e-05,3e-06,1e-06,6e-06,3e-06,1e-05,7e-06,8e-06,2e-06,2e-06,2e-06,7e-06,5e-06,7e-06,2e-06
1e-06,2e-06,2e-06,0,2e-06,3e-06,2e-06,2e-06,2e-06,2e-06,1e-06,2e-06,5e-06,5e-06,1e-06,3e-06,2e-06,2e-06,1e-06,2e-06,5e-06,2e-06,3e-06,3e-06,1e-06,2e-06,4e-06,2e-06,2e-06,4e-06,5e-06,2e-06,2e-06,4e-06,4e-06,4e-06,1e-06,1e-06,4e-06,2e-06,4e-06,1e-06,2e-06,4e-06,3e-06,4e-06,4e-06,2e-06,4e-06,2e-06,8e-06,3e-06,0,1e-06,2e-06,4e-06,2e-06,9e-06,1e-06,3e-06,1e-06,6e-06,3e-06,1.2e-05,5e-06,4e-06,5e-06,3e-06,2e-06,6e-06,7e-06,3e-06,8e-06,1.8e-05,1e-06,7e-06,1e-06,6e-06,1e-06,1.2e-05,1e-05,6e-06,4e-06,1.4e-05,8e-06,1e-05,1e-05,7e-06,7e-06,2e-06,6e-06,3e-06,8e-06,8e-06,1e-06,1e-06,3e-06,3e-06,1e-06,7e-06,4e-06,3e-06,9e-06,5e-06,4e-06,6e-06,1.8e-05,4e-06,2e-06,6e-06,2e-06,1e-05,8e-06,8e-06,3e-06,3e-06,4e-06,6e-06,5e-06,4e-06,2e-06
1e-06,2e-06,1e-06,0,1e-06,5e-06,2e-06,3e-06,1e-06,1e-06,1e-06,1e-06,3e-06,3e-06,1e-06,2e-06,3e-06,1e-06,2e-06,3e-06,5e-06,1e-06,3e-06,4e-06,1e-06,3e-06,3e-06,2e-06,2e-06,4e-06,5e-06,1e-06,1e-06,3e-06,3e-06,2e-06,1e-06,2e-06,2e-06,3e-06,1e-06,3e-06,2e-06,4e-06,2e-06,5e-06,3e-06,3e-06,3e-06,2e-06,7e-06,4e-06,3e-06,1e-06,1e-06,4e-06,2e-06,9e-06,3e-06,3e-06,5e-06,3e-06,3e-06,1.2e-05,5e-06,2e-06,4e-06,3e-06,2e-06,6e-06,8e-06,1e-06,8e-06,1.7e-05,3e-06,7e-06,6e-06,2e-06,1e-06,7e-06,8e-06,3e-06,5e-06,1.4e-05,5e-06,9e-06,8e-06,1e-05,1.2e-05,3e-06,5e-06,3e-06,4e-06,2e-06,6e-06,5e-06,6e-06,2e-06,4e-06,5e-06,8e-06,1e-06,8e-06,3e-06,4e-06,4e-06,1.9e-05,3e-06,2e-06,3e-06,4e-06,1e-05,9e-06,1.1e-05,3e-06,2e-06,2e-06,6e-06,2e-06,5e-06,3e-06
1e-06,2e-06,2e-06,1e-06,0,6e-06,1e-06,4e-06,2e-06,0,1e-06,1e-06,2e-06,5e-06,1e-06,0,4e-06,3e-06,1e-06,2e-06,4e-06,1e-06,1e-06,2e-06,1e-06,2e-06,4e-06,1e-06,3e-06,1e-06,4e-06,1e-06,1e-06,2e-06,1e-06,2e-06,1e-06,2e-06,4e-06,3e-06,5e-06,2e-06,2e-06,2e-06,1e-06,8e-06,4e-06,3e-06,5e-06,2e-06,5e-06,2e-06,4e-06,4e-06,5e-06,5e-06,2e-06,7e-06,3e-06,2e-06,5e-06,6e-06,5e-06,1e-05,2e-06,3e-06,4e-06,3e-06,0,2e-06,5e-06,1e-06,1e-05,1.6e-05,5e-06,8e-06,7e-06,5e-06,3e-06,9e-06,1e-05,7e-06,4e-06,1.4e-05,6e-06,8e-06,6e-06,9e-06,1e-05,3e-06,2e-06,1e-06,5e-06,3e-06,5e-06,2e-06,1e-06,2e-06,4e-06,6e-06,8e-06,0,9e-06,2e-06,3e-06,5e-06,1.6e-05,2e-06,5e-06,8e-06,4e-06,6e-06,9e-06,8e-06,5e-06,2e-06,3e-06,4e-06,5e-06,5e-06,0
1e-06,1e-06,2e-06,3e-06,2e-06,5e-06,3e-06,2e-06,2e-06,1e-06,1e-06,1e-06,4e-06,3e-06,2e-06,3e-06,2e-06,2e-06,3e-06,2e-06,5e-06,1e-06,2e-06,1e-06,1e-06,2e-06,5e-06,2e-06,2e-06,2e-06,4e-06,2e-06,3e-06,3e-06,2e-06,5e-06,2e-06,2e-06,4e-06,3e-06,3e-06,1e-06,2e-06,1e-06,0,6e-06,3e-06,0,5e-06,1e-06,5e-06,4e-06,3e-06,2e-06,5e-06,6e-06,1e-06,8e-06,3e-06,2e-06,3e-06,6e-06,2e-06,1.1e-05,2e-06,2e-06,5e-06,0,1e-06,5e-06,4e-06,1e-06,1.2e-05,1.3e-05,3e-06,7e-06,5e-06,4e-06,5e-06,1e-05,6e-06,3e-06,6e-06,1.2e-05,4e-06,1e-05,4e-06,6e-06,7e-06,3e-06,6e-06,4e-06,2e-06,2e-06,4e-06,4e-06,1e-06,1e-06,3e-06,3e-06,6e-06,3e-06,8e-06,2e-06,2e-06,7e-06,1.4e-05,4e-06,3e-06,8e-06,3e-06,1e-05,1e-05,7e-06,1e-06,4e-06,4e-06,7e-06,4e-06,5e-06,3e-06
2e-06,3e-06,2e-06,3e-06,1e-06,5e-06,4e-06,5e-06,1e-06,2e-06,2e-06,2e-06,4e-06,3e-06,1e-06,1e-06,2e-06,2e-06,0,2e-06,4e-06,2e-06,3e-06,1e-06,3e-06,2e-06,5e-06,2e-06,2e-06,4e-06,5e-06,2e-06,1e-06,4e-06,3e-06,3e-06,1e-06,2e-06,4e-06,2e-06,5e-06,2e-06,1e-06,0,1e-06,5e-06,2e-06,3e-06,4e-06,3e-06,7e-06,2e-06,0,3e-06,5e-06,4e-06,3e-06,7e-06,2e-06,5e-06,5e-06,3e-06,4e-06,1.3e-05,2e-06,3e-06,3e-06,2e-06,1e-06,6e-06,3e-06,3e-06,1e-05,1.4e-05,7e-06,8e-06,6e-06,2e-06,4e-06,1.4e-05,1e-05,4e-06,4e-06,1.1e-05,1e-06,9e-06,8e-06,9e-06,1e-05,2e-06,7e-06,5e-06,4e-06,3e-06,3e-06,5e-06,4e-06,3e-06,5e-06,7e-06,6e-06,3e-06,7e-06,3e-06,4e-06,5e-06,1.8e-05,5e-06,0,6e-06,4e-06,6e-06,1e-05,3e-06,5e-06,2e-06,2e-06,6e-06,5e-06,4e-06,2e-06
3e-06,0,1e-06,1e-06,3e-06,3e-06,1e-06,3e-06,0,2e-06,2e-06,1e-06,2e-06,5e-06,1e-06,2e-06,1e-06,2e-06,1e-06,1e-06,4e-06,1e-06,0,4e-06,1e-06,2e-06,3e-06,1e-06,2e-06,4e-06,3e-06,2e-06,1e-06,2e-06,3e-06,3e-06,2e-06,0,1e-06,2e-06,5e-06,0,3e-06,4e-06,2e-06,5e-06,2e-06,1e-06,2e-06,2e-06,8e-06,2e-06,2e-06,2e-06,0,4e-06,2e-06,5e-06,4e-06,4e-06,5e-06,7e-06,5e-06,1.3e-05,1e-06,1e-06,3e-06,3e-06,1e-06,4e-06,6e-06,4e-06,1e-05,1.8e-05,4e-06,5e-06,1e-05,1e-06,6e-06,1.1e-05,4e-06,3e-06,4e-06,1.2e-05,3e-06,1e-05,6e-06,1e-05,8e-06,1e-06,4e-06,3e-06,3e-06,3e-06,3e-06,4e-06,4e-06,1e-06,3e-06,2e-06,7e-06,3e-06,1e-05,1e-06,3e-06,4e-06,2.1e-05,8e-06,4e-06,5e-06,1e-06,9e-06,7e-06,6e-06,4e-06,1e-06,1e-06,9e-06,1e-06,5e-06,1e-06
2e-06,3e-06,1e-06,1e-06,1e-06,2e-06,2e-06,4e-06,0,0,1e-06,2e-06,4e-06,4e-06,1e-06,3e-06,1e-06,2e-06,1e-06,2e-06,3e-06,1e-06,1e-06,2e-06,1e-06,3e-06,4e-06,2e-06,2e-06,4e-06,6e-06,3e-06,1e-06,1e-06,2e-06,3e-06,1e-06,1e-06,4e-06,0,4e-06,2e-06,2e-06,3e-06,2e-06,4e-06,1e-06,1e-06,4e-06,2e-06,6e-06,1e-06,2e-06,2e-06,2e-06,2e-06,1e-06,7e-06,1e-06,3e-06,2e-06,5e-06,3e-06,1.2e-05,2e-06,1e-06,3e-06,4e-06,2e-06,2e-06,7e-06,1e-06,1.2e-05,1.6e-05,1e-06,5e-06,6e-06,2e-06,6e-06,1e-05,4e-06,7e-06,1e-06,1e-05,2e-06,9e-06,6e-06,9e-06,9e-06,1e-06,5e-06,3e-06,2e-06,3e-06,4e-06,3e-06,3e-06,2e-06,2e-06,5e-06,7e-06,3e-06,8e-06,1e-06,1e-06,6e-06,1.8e-05,0,0,3e-06,2e-06,6e-06,7e-06,5e-06,2e-06,2e-06,2e-06,9e-06,3e-06,4e-06,1e-06
1e-06,2e-06,1e-06,0,1e-06,3e-06,1e-06,3e-06,1e-06,1e-06,0,1e-06,2e-06,4e-06,1e-06,1e-06,1e-06,1e-06,1e-06,2e-06,4e-06,2e-06,0,2e-06,1e-06,3e-06,4e-06,1e-06,1e-06,3e-06,6e-06,3e-06,2e-06,1e-06,2e-06,3e-06,0,1e-06,2e-06,0,4e-06,2e-06,2e-06,3e-06,4e-06,4e-06,2e-06,1e-06,3e-06,1e-06,8e-06,2e-06,2e-06,2e-06,2e-06,4e-06,1e-06,6e-06,1e-06,2e-06,2e-06,4e-06,5e-06,9e-06,2e-06,1e-06,5e-06,3e-06,1e-06,4e-06,7e-06,2e-06,7e-06,1.7e-05,0,5e-06,6e-06,1e-06,3e-06,1e-05,6e-06,4e-06,2e-06,1.3e-05,5e-06,6e-06,7e-06,6e-06,1.1e-05,3e-06,4e-06,3e-06,3e-06,4e-06,1e-06,4e-06,3e-06,3e-06,2e-06,3e-06,8e-06,1e-06,7e-06,2e-06,3e-06,6e-06,1.4e-05,2e-06,1e-06,6e-06,3e-06,4e-06,7e-06,4e-06,4e-06,5e-06,3e-06,6e-06,3e-06,3e-06,2e-06
1e-06,2e-06,2e-06,1e-06,1e-06,3e-06,1e-06,3e-06,1e-06,0,0,1e-06,4e-06,4e-06,1e-06,2e-06,0,1e-06,2e-06,2e-06,2e-06,0,1e-06,2e-06,0,3e-06,3e-06,1e-06,1e-06,3e-06,6e-06,2e-06,1e-06,2e-06,1e-06,2e-06,1e-06,2e-06,3e-06,1e-06,3e-06,1e-06,1e-06,2e-06,2e-06,5e-06,2e-06,3e-06,4e-06,1e-06,8e-06,3e-06,1e-06,1e-06,3e-06,3e-06,1e-06,6e-06,1e-06,2e-06,2e-06,1e-06,2e-06,1.1e-05,3e-06,2e-06,3e-06,2e-06,2e-06,4e-06,6e-06,3e-06,9e-06,1.6e-05,2e-06,7e-06,7e-06,1e-06,5e-06,1.2e-05,5e-06,1e-06,5e-06,1.1e-05,6e-06,8e-06,3e-06,9e-06,9e-06,2e-06,2e-06,1e-06,2e-06,3e-06,2e-06,3e-06,3e-06,1e-06,2e-06,5e-06,5e-06,2e-06,8e-06,1e-06,2e-06,7e-06,1.6e-05,2e-06,2e-06,7e-06,1e-06,4e-06,6e-06,4e-06,3e-06,3e-06,1e-06,5e-06,4e-06,4e-06,2e-06
1e-06,1e-06,1e-06,0,1e-06,3e-06,0,3e-06,0,1e-06,1e-06,0,3e-06,4e-06,0,2e-06,1e-06,1e-06,1e-06,1e-06,2e-06,1e-06,1e-06,2e-06,0,2e-06,3e-06,1e-06,2e-06,4e-06,5e-06,1e-06,1e-06,1e-06,1e-06,2e-06,1e-06,1e-06,2e-06,1e-06,4e-06,1e-06,2e-06,2e-06,1e-06,4e-06,1e-06,1e-06,3e-06,2e-06,7e-06,3e-06,1e-06,1e-06,3e-06,3e-06,1e-06,6e-06,1e-06,1e-06,1e-06,2e-06,2e-06,1.1e-05,2e-06,1e-06,3e-06,2e-06,1e-06,5e-06,6e-06,2e-06,8e-06,1.6e-05,3e-06,7e-06,8e-06,2e-06,2e-06,9e-06,4e-06,3e-06,3e-06,1.3e-05,2e-06,1e-05,5e-06,9e-06,8e-06,1e-06,3e-06,1e-06,3e-06,2e-06,1e-06,4e-06,1e-06,0,1e-06,5e-06,5e-06,1e-06,7e-06,1e-06,4e-06,5e-06,1.6e-05,1e-06,1e-06,5e-06,0,5e-06,7e-06,4e-06,3e-06,1e-06,1e-06,6e-06,3e-06,4e-06,1e-06
1e-06,1e-06,1e-06,0,2e-06,2e-06,1e-06,3e-06,0,1e-06,1e-06,0,3e-06,4e-06,0,2e-06,1e-06,1e-06,1e-06,2e-06,3e-06,1e-06,1e-06,2e-06,1e-06,2e-06,3e-06,0,1e-06,2e-06,4e-06,2e-06,1e-06,1e-06,1e-06,3e-06,0,1e-06,3e-06,1e-06,4e-06,0,2e-06,2e-06,2e-06,4e-06,0,1e-06,3e-06,1e-06,7e-06,3e-06,0,1e-06,2e-06,3e-06,0,7e-06,0,2e-06,2e-06,2e-06,3e-06,1.2e-05,2e-06,2e-06,3e-06,2e-06,0,3e-06,5e-06,1e-06,8e-06,1.6e-05,1e-06,5e-06,9e-06,0,2e-06,1e-05,5e-06,2e-06,4e-06,1.3e-05,4e-06,1e-05,4e-06,8e-06,9e-06,1e-06,4e-06,1e-06,4e-06,3e-06,0,2e-06,1e-06,1e-06,1e-06,4e-06,5e-06,0,8e-06,0,4e-06,6e-06,1.5e-05,2e-06,0,5e-06,1e-06,6e-06,7e-06,4e-06,3e-06,2e-06,2e-06,7e-06,2e-06,4e-06,1e-06
1e-06,2e-06,1e-06,0,1e-06,2e-06,0,3e-06,0,1e-06,1e-06,0,3e-06,4e-06,0,2e-06,1e-06,1e-06,1e-06,2e-06,3e-06,0,1e-06,2e-06,1e-06,2e-06,3e-06,1e-06,1e-06,2e-06,5e-06,1e-06,1e-06,1e-06,1e-06,2e-06,0,0,2e-06,1e-06,3e-06,0,2e-06,2e-06,2e-06,4e-06,0,1e-06,4e-06,1e-06,7e-06,3e-06,1e-06,0,2e-06,3e-06,0,6e-06,0,2e-06,2e-06,2e-06,2e-06,1.2e-05,1e-06,1e-06,4e-06,2e-06,1e-06,4e-06,5e-06,0,9e-06,1.7e-05,2e-06,6e-06,7e-06,1e-06,3e-06,1e-05,6e-06,3e-06,4e-06,1.2e-05,3e-06,9e-06,4e-06,8e-06,8e-06,1e-06,4e-06,1e-06,2e-06,2e-06,1e-06,3e-06,2e-06,0,1e-06,4e-06,5e-06,1e-06,7e-06,0,3e-06,5e-06,1.5e-05,3e-06,1e-06,5e-06,1e-06,6e-06,7e-06,4e-06,2e-06,2e-06,3e-06,7e-06,2e-06,4e-06,1e-06
