0.004149,0.004472,0.004481,0.005231,0.005476,0.004701,0.004444,0.005082,0.005729,0.005368,0.004553,0.004335,0.004739,0.004826,0.004164,0.00366,0.003397,0.004263,0.006208,0.006961,0.006199,0.005161,0.00474,0.005022,0.004983,0.004554,0.004473,0.004392
0.004921,0.005249,0.005115,0.005943,0.006394,0.005654,0.005408,0.005914,0.006404,0.006165,0.005445,0.005126,0.005412,0.005387,0.004723,0.004224,0.003907,0.004783,0.006721,0.007611,0.007053,0.006042,0.005578,0.005746,0.005593,0.005269,0.005389,0.005301
0.006171,0.006459,0.006122,0.007064,0.007848,0.00723,0.007015,0.007295,0.007575,0.007614,0.007073,0.006557,0.006635,0.00638,0.005664,0.005129,0.004713,0.005622,0.007526,0.008491,0.008199,0.007369,0.006884,0.006876,0.00655,0.006388,0.00688,0.006788
0.007072,0.007317,0.00693,0.007773,0.008636,0.008215,0.00802,0.008182,0.008435,0.008725,0.008391,0.007798,0.007809,0.007429,0.006487,0.005691,0.005168,0.006136,0.008024,0.00871,0.008426,0.008002,0.007624,0.007461,0.007087,0.007144,0.007998,0.007873
0.007555,0.007738,0.007462,0.007954,0.008625,0.008434,0.008215,0.008403,0.00873,0.009066,0.00891,0.008406,0.008638,0.008397,0.00704,0.005802,0.005294,0.006267,0.007919,0.008098,0.00772,0.00772,0.007517,0.007293,0.006984,0.007194,0.008243,0.0082
0.008013,0.008192,0.008003,0.008158,0.008637,0.008498,0.008218,0.008542,0.008839,0.008794,0.008614,0.008415,0.009165,0.009248,0.007409,0.005642,0.005377,0.006468,0.007725,0.007443,0.006893,0.00703,0.007022,0.00709,0.00692,0.00699,0.007992,0.008215
0.009101,0.009439,0.00905,0.009087,0.009533,0.009242,0.008822,0.009256,0.009488,0.008818,0.008332,0.008424,0.009634,0.010013,0.007808,0.005511,0.005569,0.006915,0.007833,0.00739,0.006991,0.007324,0.007126,0.007278,0.007186,0.006827,0.007414,0.007876
0.011527,0.011962,0.011177,0.011109,0.011532,0.011048,0.010276,0.010413,0.010637,0.009808,0.008998,0.008838,0.010159,0.010841,0.008595,0.006021,0.006185,0.007794,0.008571,0.008202,0.008439,0.009172,0.008395,0.008011,0.007848,0.007169,0.007116,0.007601
0.014093,0.014614,0.013745,0.013722,0.013929,0.012999,0.011566,0.010859,0.011106,0.010666,0.00972,0.009272,0.010936,0.01226,0.010191,0.007512,0.00748,0.00891,0.009546,0.009583,0.010538,0.011543,0.010307,0.009069,0.008668,0.008021,0.00761,0.008081
0.015253,0.016137,0.015732,0.015964,0.015594,0.013832,0.01207,0.011054,0.011463,0.011483,0.010516,0.009916,0.012135,0.014112,0.011987,0.008881,0.008244,0.009403,0.010518,0.0116,0.012812,0.013379,0.012236,0.010773,0.009935,0.009314,0.00905,0.00945
0.015835,0.017114,0.016719,0.017046,0.016162,0.013573,0.01231,0.012436,0.013124,0.013156,0.012193,0.011263,0.013657,0.016087,0.01358,0.009646,0.008315,0.009629,0.01187,0.014041,0.014831,0.014224,0.013404,0.012576,0.011498,0.01075,0.011298,0.011863
0.016382,0.017849,0.016759,0.016453,0.015548,0.01341,0.013123,0.014519,0.015281,0.014984,0.014056,0.012855,0.015196,0.01808,0.015434,0.010936,0.008782,0.009831,0.012736,0.015451,0.016166,0.015123,0.014348,0.013905,0.012816,0.012066,0.013608,0.014476
0.016768,0.017924,0.015966,0.014655,0.01409,0.013507,0.014265,0.016219,0.016749,0.016003,0.015007,0.013766,0.016137,0.019408,0.017142,0.012683,0.009797,0.010333,0.013387,0.015829,0.017114,0.01711,0.016073,0.015317,0.014174,0.013515,0.015433,0.016206
0.016489,0.016903,0.014721,0.013797,0.014119,0.014136,0.014908,0.016546,0.017106,0.016355,0.015057,0.013931,0.016618,0.01998,0.017554,0.012868,0.009949,0.010677,0.013891,0.01548,0.016691,0.017553,0.0168,0.01659,0.015726,0.015002,0.016642,0.017067
0.014649,0.014514,0.013208,0.014429,0.015989,0.015538,0.015532,0.016424,0.01728,0.016953,0.015255,0.013691,0.016123,0.019117,0.01605,0.011,0.008683,0.010037,0.013519,0.014558,0.015487,0.016778,0.016401,0.016802,0.016529,0.015748,0.016547,0.016658
0.013745,0.013533,0.012584,0.01527,0.017988,0.017507,0.01705,0.017218,0.017617,0.017572,0.016142,0.014134,0.016048,0.018788,0.015326,0.009869,0.007845,0.009859,0.013785,0.014804,0.015248,0.016056,0.015695,0.016589,0.016634,0.015633,0.01622,0.016354
0.014632,0.014409,0.013149,0.015421,0.018474,0.018371,0.017576,0.016949,0.016587,0.016501,0.01552,0.013959,0.015934,0.018806,0.015813,0.010521,0.008226,0.009909,0.013701,0.014599,0.014076,0.014149,0.014036,0.015412,0.015707,0.014638,0.015364,0.015784
0.015197,0.014852,0.013592,0.015535,0.019134,0.019011,0.017299,0.016049,0.015255,0.014396,0.0131,0.012566,0.015038,0.018118,0.016164,0.012025,0.009807,0.011127,0.015087,0.016052,0.013982,0.012526,0.012465,0.014289,0.014656,0.01336,0.014296,0.015015
0.017644,0.017023,0.016167,0.01794,0.021272,0.020897,0.018643,0.016763,0.01575,0.013941,0.011694,0.0123,0.015676,0.018669,0.016935,0.013414,0.012129,0.014949,0.020486,0.022363,0.018838,0.014792,0.013809,0.015222,0.014559,0.012598,0.015163,0.017231
0.021151,0.019218,0.018799,0.02077,0.023476,0.022828,0.020606,0.018685,0.017992,0.01598,0.013004,0.014057,0.018705,0.02171,0.018959,0.015131,0.014771,0.019601,0.026819,0.03009,0.02589,0.019213,0.016581,0.01661,0.014826,0.012734,0.016842,0.02066
0.024113,0.02024,0.01922,0.02232,0.025165,0.024067,0.021729,0.019604,0.018998,0.017271,0.014354,0.01546,0.021196,0.02441,0.020895,0.017341,0.016996,0.022192,0.029798,0.034548,0.031126,0.022378,0.018325,0.01727,0.014903,0.013645,0.019911,0.025838
0.023927,0.019908,0.0184,0.023258,0.027086,0.025565,0.022683,0.019918,0.019267,0.01806,0.015575,0.016501,0.022652,0.026131,0.022246,0.018987,0.018263,0.021744,0.027282,0.032526,0.03122,0.022817,0.019566,0.019399,0.017369,0.017221,0.024252,0.030686
0.02208,0.019299,0.017858,0.023513,0.027394,0.025746,0.022594,0.020599,0.021491,0.020307,0.017246,0.017066,0.022656,0.025792,0.021214,0.018304,0.018171,0.019755,0.021885,0.025289,0.026025,0.02142,0.020287,0.021561,0.020738,0.021672,0.028109,0.033106
0.024769,0.022225,0.01986,0.02485,0.027685,0.026209,0.023799,0.023015,0.02463,0.022971,0.01966,0.018376,0.022424,0.024049,0.018299,0.015011,0.015918,0.017509,0.018109,0.018868,0.02016,0.019883,0.019487,0.020554,0.02134,0.024065,0.031336,0.034268
0.027853,0.026538,0.022896,0.024547,0.025278,0.024376,0.024744,0.026529,0.027212,0.024243,0.021192,0.019072,0.020499,0.020318,0.015334,0.012738,0.014016,0.016157,0.018159,0.018533,0.018312,0.018931,0.017633,0.017077,0.019036,0.023023,0.030373,0.031517
0.026535,0.027327,0.023479,0.02123,0.020698,0.020906,0.023478,0.029409,0.030462,0.025934,0.022774,0.019054,0.019039,0.019793,0.014879,0.011113,0.011603,0.014695,0.01989,0.020084,0.017856,0.018721,0.017276,0.015969,0.018742,0.023571,0.028921,0.028454
0.02148,0.023283,0.020716,0.016894,0.017092,0.018938,0.022073,0.03003,0.03196,0.027976,0.025423,0.019967,0.020386,0.024071,0.017271,0.009186,0.008673,0.013867,0.021381,0.020701,0.016724,0.016699,0.016033,0.018019,0.022662,0.027258,0.032938,0.032248
0.019269,0.020543,0.019738,0.017216,0.016906,0.018116,0.020125,0.026485,0.030017,0.027472,0.024907,0.021057,0.024056,0.028881,0.020021,0.008977,0.007979,0.014509,0.021424,0.019947,0.015851,0.014909,0.015124,0.020217,0.026095,0.028257,0.034083,0.035457
0.0215,0.023326,0.024399,0.024588,0.024099,0.023902,0.022284,0.023695,0.026717,0.0246,0.021941,0.021843,0.027938,0.031536,0.021286,0.009346,0.007985,0.015066,0.022207,0.022703,0.020225,0.018458,0.018367,0.023855,0.028965,0.028722,0.031946,0.033712
0.024112,0.027419,0.030196,0.034236,0.035867,0.035804,0.030734,0.027311,0.028703,0.026611,0.023139,0.024242,0.033012,0.036066,0.024309,0.010828,0.008793,0.018528,0.029142,0.032354,0.030601,0.027956,0.026907,0.031873,0.036289,0.036877,0.034744,0.030816
0.027638,0.030969,0.03254,0.040218,0.046804,0.049072,0.041727,0.035012,0.036334,0.032686,0.026654,0.027162,0.040264,0.046777,0.032025,0.014906,0.012537,0.02613,0.041449,0.046007,0.043148,0.039414,0.037939,0.041493,0.04402,0.047587,0.045606,0.037021
0.028978,0.033379,0.03146,0.038279,0.050453,0.056585,0.048186,0.041137,0.044025,0.037965,0.029235,0.02992,0.045467,0.0551,0.038755,0.019023,0.017574,0.033019,0.050658,0.055386,0.050987,0.046205,0.044899,0.048788,0.050848,0.054311,0.05274,0.04501
0.027039,0.031679,0.027353,0.030568,0.043153,0.05187,0.044009,0.039016,0.044205,0.036564,0.026733,0.029468,0.043458,0.052985,0.038548,0.020145,0.021452,0.034895,0.049854,0.053043,0.047411,0.042309,0.041609,0.046487,0.048754,0.049537,0.047901,0.04541
0.027828,0.030766,0.022912,0.021388,0.028766,0.036496,0.030566,0.028766,0.035973,0.028894,0.020847,0.0262,0.034165,0.039452,0.029729,0.016736,0.02168,0.031036,0.039401,0.039516,0.033369,0.02903,0.028961,0.033824,0.035918,0.03444,0.032569,0.035705
0.031066,0.03279,0.021338,0.016215,0.018649,0.022349,0.018143,0.019305,0.027904,0.023778,0.017797,0.025048,0.02573,0.023582,0.01813,0.010919,0.017711,0.02633,0.030001,0.026574,0.019551,0.016473,0.017027,0.020405,0.022515,0.022261,0.019022,0.023309
0.029743,0.032365,0.021991,0.016818,0.017807,0.018169,0.016971,0.018339,0.022596,0.021138,0.01663,0.024382,0.025095,0.019486,0.014874,0.007515,0.011759,0.019463,0.024085,0.02235,0.015066,0.013631,0.014177,0.018398,0.023133,0.022584,0.017026,0.022901
0.024999,0.028497,0.02358,0.01975,0.017386,0.018525,0.02121,0.021716,0.020177,0.019003,0.015631,0.021549,0.027965,0.025902,0.018097,0.006908,0.007863,0.013738,0.025104,0.025189,0.014422,0.012855,0.014879,0.021517,0.027111,0.027506,0.024169,0.031686
0.028127,0.031016,0.027116,0.022854,0.016856,0.021279,0.025734,0.026211,0.024791,0.02131,0.017946,0.021854,0.03081,0.032855,0.021403,0.008298,0.007927,0.012623,0.029344,0.029494,0.016312,0.01495,0.017392,0.023609,0.029399,0.034092,0.034971,0.041256
0.034309,0.036941,0.031766,0.028262,0.019245,0.025668,0.027435,0.027227,0.033317,0.029724,0.023403,0.023463,0.030017,0.035536,0.023526,0.011426,0.011876,0.01457,0.031855,0.034673,0.020387,0.018337,0.019159,0.023187,0.034161,0.044213,0.045044,0.046721
0.036424,0.042905,0.040607,0.034099,0.020485,0.027298,0.02484,0.024342,0.04162,0.038911,0.02703,0.022883,0.024719,0.031981,0.023825,0.016037,0.016876,0.016896,0.03215,0.038007,0.022749,0.019493,0.01759,0.02518,0.043419,0.051907,0.049022,0.044343
