1.3e-05,4.6e-05,3.7e-05,1.8e-05,6.7e-05,5.2e-05,3.5e-05,4e-05,4.3e-05,1.3e-05,5.6e-05,6.3e-05,7.1e-05,5.7e-05,7.2e-05,3.9e-05,0.000104,7e-06,5.6e-05,2.9e-05,8e-05,2.6e-05,3.7e-05,4.4e-05,1e-06,7.7e-05,3.2e-05,2.9e-05,3.6e-05,1.1e-05,8.8e-05,1e-05,6e-05,6.4e-05,1.2e-05,8.9e-05,3.4e-05,6.8e-05,2.5e-05,0.000181,0.000122,8.6e-05,7.8e-05,8e-05,2e-06,5.9e-05,4.2e-05,2.9e-05,6.3e-05,8.5e-05,6e-06,9.7e-05,4.1e-05,2.8e-05,6.1e-05,4.9e-05,6.3e-05,2e-06,0.000159,0.000109,0.000102,7.9e-05,4.7e-05,4.9e-05,8e-05,0.000145,3.1e-05,0.000103,3.5e-05,5.6e-05,1.5e-05,0.000107,3.1e-05,1e-04,6.6e-05,2.4e-05,4.2e-05,3.4e-05,6.3e-05,4e-05,8e-05,9.5e-05,0.000151,6.4e-05,0.000199,6.4e-05,5.4e-05,3e-05,8.9e-05,3.2e-05,0.000158,8.1e-05,0.000118,6.7e-05,0.000198,6.3e-05,4.6e-05,5.1e-05,7.1e-05,0.00018,2.3e-05,8e-06,0.000107,3.5e-05,0.000176,0.000163,5e-05,0.000164,2.4e-05,0.000195,0.000132,8.7e-05,0.000104,4.3e-05,6.1e-05,3.3e-05,8.8e-05,8e-06,3.7e-05,0.000167,0.000184
2e-05,9.2e-05,6.3e-05,6.8e-05,0.000103,0.000197,0.000116,0.000101,9.4e-05,8.8e-05,5.7e-05,9.9e-05,0.000213,0.000124,0.000175,0.000161,0.000219,0.000253,0.000214,9.4e-05,0.000133,0.000212,0.000183,0.000169,0.000172,0.00017,0.000218,0.000185,0.000141,0.000116,0.000113,0.000173,0.000127,6.2e-05,1.6e-05,0.00015,0.000104,0.00013,0.000166,0.000323,0.000556,4e-04,0.000301,9.4e-05,6.4e-05,6.7e-05,0.000102,0.000146,0.000199,0.000202,0.000144,0.000114,9e-05,5.2e-05,0.000171,0.000202,0.000262,0.000194,0.000321,0.000538,0.000409,0.00038,0.000175,0.000141,0.000249,0.000446,0.000442,0.000289,0.000278,0.000242,0.000126,0.000148,0.000137,0.000247,0.000322,0.000258,0.000165,2.8e-05,0.000116,0.000158,0.000214,9.9e-05,0.000342,0.000345,0.000496,0.000516,0.000526,0.000519,0.000483,0.000339,0.000127,0.000375,0.000167,3e-04,0.00036,0.000447,0.000296,0.000235,0.000234,0.000496,0.000322,0.000109,0.000158,0.000111,0.000339,0.000654,0.000552,0.000408,0.000372,0.000364,0.000631,0.000446,0.000318,0.000431,0.000299,0.000221,0.00016,0.000246,0.000173,0.000299,0.000637
2.5e-05,6.6e-05,5e-05,9.7e-05,3.6e-05,6.6e-05,0.000104,0.000149,4.9e-05,1.6e-05,7.2e-05,4.9e-05,6.5e-05,3.3e-05,0.000142,8.9e-05,8.8e-05,0.000149,3e-05,2.1e-05,6.5e-05,7e-05,1e-04,2.9e-05,0.000111,4e-05,0.000178,5.9e-05,0.000129,6.7e-05,4.6e-05,6.7e-05,3.6e-05,3.7e-05,4.2e-05,9.8e-05,9.4e-05,0.000145,9.1e-05,5.3e-05,0.000275,8.6e-05,1.1e-05,3.5e-05,5.4e-05,1.6e-05,0.000112,0.000135,0.000146,4.3e-05,7.6e-05,0.000133,0.000142,9.2e-05,0.000147,4.5e-05,0.000111,4.4e-05,0.000139,0.000265,0.000108,8.8e-05,8.5e-05,0.00014,4.8e-05,0.000193,0.000231,7.8e-05,0.00017,0.000243,0.000267,0.000148,0.000131,0.00014,8.8e-05,0.000129,8.7e-05,5.4e-05,0.000122,0.000177,6.5e-05,8.2e-05,4e-05,0.000206,0.000156,8.3e-05,0.000273,0.000388,0.000251,0.000116,0.000176,0.00026,0.000175,0.000274,7.7e-05,0.000166,0.000126,0.00018,5.6e-05,0.000248,0.000224,8.5e-05,5.5e-05,2.8e-05,0.000219,0.000244,0.000148,0.000121,0.000195,3.4e-05,0.00029,9.6e-05,0.000143,0.000406,0.000247,0.000347,0.000253,0.000253,0.00014,0.000158,0.000328
4.2e-05,1.2e-05,5.2e-05,7.1e-05,2.9e-05,4.7e-05,9.5e-05,8.1e-05,6.6e-05,5.2e-05,5.1e-05,1.8e-05,9e-06,6.9e-05,9.2e-05,6.3e-05,0.000102,3.5e-05,5.3e-05,4.7e-05,3.5e-05,7.2e-05,1.4e-05,1e-05,7.2e-05,8.4e-05,0.00013,0.000113,5.1e-05,3.5e-05,2.2e-05,5.3e-05,4.5e-05,2.5e-05,1e-04,7.3e-05,5.5e-05,5.8e-05,0.000198,9.5e-05,3.1e-05,8.4e-05,8e-05,2.5e-05,9.3e-05,2.8e-05,7.3e-05,3.9e-05,6e-05,9.8e-05,7.6e-05,9.1e-05,7.8e-05,0.00016,7.4e-05,4.9e-05,2.2e-05,9.3e-05,0.000121,0.000155,8.5e-05,5.9e-05,4.7e-05,1.6e-05,6.3e-05,0.000139,2.1e-05,8.1e-05,0.000265,0.000116,0.000109,0.000107,6.9e-05,9.1e-05,7.5e-05,0.000145,0.000102,0.000111,5.6e-05,0.000126,6.3e-05,0.000119,0.000165,0.000102,0.000155,0.000151,0.000123,0.000113,9.9e-05,9.4e-05,0.000154,4.7e-05,4e-05,0.000174,8.7e-05,0.000149,0.000219,6.2e-05,5.8e-05,0.000133,0.000105,0.000175,4.2e-05,6e-06,7.4e-05,0.000153,9.7e-05,0.000111,7.9e-05,1.9e-05,0.00012,0.000107,0.000186,0.000138,0.000102,0.000173,0.000168,6.2e-05,7.5e-05,5.3e-05,0.000229
6.4e-05,3.1e-05,6.2e-05,8.4e-05,1e-05,5.6e-05,8.9e-05,4.5e-05,3.8e-05,5.6e-05,3.2e-05,3.1e-05,3.6e-05,3.6e-05,5.8e-05,7.6e-05,4.5e-05,1.9e-05,8.2e-05,6.8e-05,9.1e-05,6.7e-05,7e-05,3.6e-05,6.8e-05,6.7e-05,9.2e-05,5.9e-05,6.9e-05,1.8e-05,5.7e-05,0.000109,5.3e-05,0.000106,0.000178,7.1e-05,8.1e-05,1.9e-05,0.000127,0.000198,0.000187,0.000101,0.000101,7.3e-05,9.6e-05,0.000123,3.2e-05,7.6e-05,0.000188,0.000195,8.5e-05,0.000186,6.8e-05,0.000198,0.000104,5.1e-05,0.000111,9.3e-05,0.000119,0.000137,7.3e-05,6.9e-05,0.000107,0.000121,0.000142,0.000213,0.000137,0.000172,0.000239,0.000255,0.000137,0.000153,0.000196,0.000145,7.7e-05,4.2e-05,2.1e-05,0.000167,0.00016,0.000116,0.000112,0.000122,0.00018,0.00014,8.4e-05,6.7e-05,0.000195,0.000226,8.8e-05,0.000145,7.4e-05,8.4e-05,8.7e-05,0.000165,0.000138,7.1e-05,6.2e-05,0.000119,8e-05,4.6e-05,1.8e-05,0.000137,8.6e-05,4.2e-05,8.4e-05,1.9e-05,0.000123,0.000101,8.6e-05,3.3e-05,9.4e-05,0.000138,5.8e-05,9.5e-05,3.7e-05,0.000147,0.000134,0.000135,5.7e-05,0.000126,6e-06
2.4e-05,2.7e-05,2.3e-05,7e-05,8.4e-05,5.1e-05,7.4e-05,9.5e-05,4.8e-05,2.6e-05,7e-05,6.1e-05,8e-05,6.1e-05,5.4e-05,2.1e-05,5.2e-05,6.4e-05,0.000146,0.000113,0.000112,0.000122,0.000125,0.000125,2.6e-05,1e-05,6e-05,6.3e-05,8.3e-05,8.1e-05,9.5e-05,9.5e-05,3.6e-05,0.000144,0.00017,0.00015,0.00014,0.000113,0.000114,0.000211,0.000101,4.8e-05,9.6e-05,0.000103,0.000125,0.000157,9e-05,0.000164,0.000288,0.000244,0.000231,6.4e-05,7.8e-05,0.000203,5.7e-05,9.5e-05,8.8e-05,5.4e-05,0.000145,0.000164,9.7e-05,8.4e-05,9.2e-05,9.9e-05,6.4e-05,7e-05,0.000111,0.000131,0.00038,0.000445,0.000385,0.000386,0.000341,0.000206,0.000138,0.000122,7e-05,0.000178,0.000213,0.000116,0.000212,0.000129,0.000135,9.7e-05,8.5e-05,2.8e-05,0.000204,0.000148,4.7e-05,0.000168,0.000182,8.5e-05,6.8e-05,0.000197,9.6e-05,9.4e-05,8.4e-05,0.000207,0.000162,7e-05,5.1e-05,0.000111,0.000112,9.5e-05,0.000122,0.000179,0.000198,0.000117,0.000158,6.8e-05,0.00017,1.8e-05,5.9e-05,0.000115,6.8e-05,6.7e-05,0.000128,6.3e-05,9.2e-05,0.000132,8.6e-05
1.9e-05,3.9e-05,1.7e-05,2.5e-05,2e-05,2e-05,4.6e-05,5.2e-05,2.8e-05,1.5e-05,2.6e-05,3.2e-05,4e-05,3.9e-05,2.4e-05,3.9e-05,6.4e-05,1.6e-05,9.1e-05,4.2e-05,8.9e-05,3.8e-05,5.8e-05,8e-06,7.5e-05,6.5e-05,4.8e-05,7.8e-05,0.000115,5.3e-05,4.5e-05,1.7e-05,9e-06,0.000121,6e-06,5.9e-05,7.4e-05,1.9e-05,3e-06,9.7e-05,5.7e-05,4.7e-05,9.5e-05,7e-05,1.3e-05,5e-05,8e-06,0.000109,8.4e-05,6.2e-05,9.6e-05,0.000152,8.7e-05,7.9e-05,8.9e-05,0.000127,7.1e-05,6.6e-05,4.7e-05,0.000133,9e-05,7.5e-05,1e-05,9.6e-05,7e-05,5.9e-05,9.1e-05,4e-05,0.000193,0.000118,6.8e-05,0.000133,0.000147,5.3e-05,6.2e-05,5.6e-05,1.6e-05,0.000176,0.000105,8.4e-05,0.00016,4.9e-05,0.000109,8e-05,1e-05,9.2e-05,9.7e-05,7.2e-05,2.6e-05,5.2e-05,8.5e-05,4e-05,8e-05,6.7e-05,5.1e-05,8.2e-05,2.7e-05,0.000136,4.8e-05,5.1e-05,6.6e-05,4.4e-05,7e-05,3.3e-05,1.3e-05,0.000139,0.000115,5.8e-05,2.4e-05,8.4e-05,9.1e-05,0.000108,9.2e-05,5e-05,0.000109,6.6e-05,2.1e-05,9.1e-05,0.000115,4.1e-05,1.7e-05
1.8e-05,2.3e-05,3.6e-05,2.9e-05,4.4e-05,2e-06,2e-05,1.6e-05,1e-05,3.5e-05,4.7e-05,1.1e-05,2.1e-05,3e-05,3.8e-05,2e-06,6.2e-05,5.2e-05,5.7e-05,2.5e-05,2.5e-05,6.1e-05,3.2e-05,3.1e-05,4.6e-05,4.4e-05,2.5e-05,6.5e-05,7.5e-05,3.4e-05,1.7e-05,1.3e-05,7e-06,6.9e-05,5.9e-05,9.3e-05,6.4e-05,6.5e-05,1.7e-05,2.1e-05,2.6e-05,4.1e-05,7.9e-05,1.7e-05,3e-05,4.5e-05,6e-06,4.9e-05,2.2e-05,4.6e-05,5.4e-05,7.5e-05,6.9e-05,8.1e-05,7.7e-05,4e-06,3.1e-05,4.5e-05,5e-05,4.2e-05,4.5e-05,8e-06,2.9e-05,4.3e-05,5.3e-05,5.8e-05,5.7e-05,3e-05,5.6e-05,8.7e-05,3.8e-05,0.000122,2.1e-05,7e-05,4.4e-05,1.2e-05,4.3e-05,7.6e-05,6e-06,5.4e-05,4.1e-05,4.6e-05,0.000114,4.6e-05,5.2e-05,0.000132,0.000102,3.5e-05,7.5e-05,7.1e-05,5.8e-05,5e-05,7.7e-05,4.8e-05,5.1e-05,6e-05,6.1e-05,5.2e-05,3.6e-05,1.4e-05,7.3e-05,1e-04,9.6e-05,8.5e-05,2.2e-05,7.5e-05,5.5e-05,9.6e-05,5.4e-05,8.1e-05,4.9e-05,8.3e-05,8.9e-05,0.000108,1.8e-05,6.8e-05,4.6e-05,2.8e-05,3.4e-05,3.9e-05,5.9e-05
1.4e-05,1e-06,2.2e-05,3e-06,2.6e-05,1.7e-05,1.7e-05,2.4e-05,1.8e-05,3.9e-05,4e-05,2.2e-05,4e-06,2.5e-05,8e-06,1.6e-05,3e-05,1.3e-05,2.3e-05,2.9e-05,6e-06,3.8e-05,2.5e-05,1.5e-05,1.7e-05,2.1e-05,1e-05,4.4e-05,2.5e-05,3.2e-05,3.5e-05,1.1e-05,1.5e-05,5.1e-05,4e-05,5.8e-05,2.3e-05,1.8e-05,1.4e-05,3.3e-05,3.2e-05,2.1e-05,3.2e-05,2.2e-05,2.1e-05,4.3e-05,4.1e-05,1.7e-05,4.4e-05,3.1e-05,5.3e-05,2.5e-05,4.4e-05,5.5e-05,3.3e-05,1e-05,3.7e-05,2.5e-05,4.9e-05,4e-05,2.3e-05,1.3e-05,3.1e-05,3.1e-05,4.4e-05,3.7e-05,2.3e-05,6.9e-05,7.2e-05,1.9e-05,1.8e-05,5.6e-05,2.8e-05,4.8e-05,7e-05,6e-05,6.2e-05,4e-05,1.2e-05,4.9e-05,4.3e-05,2.8e-05,4.5e-05,4.2e-05,5.7e-05,2.1e-05,5.5e-05,5.5e-05,8.1e-05,3.6e-05,3.7e-05,2.9e-05,2.4e-05,9.8e-05,1.5e-05,4.1e-05,4.3e-05,1.9e-05,2.2e-05,3.2e-05,6.4e-05,4.6e-05,2.8e-05,1.4e-05,5.2e-05,2.5e-05,3.7e-05,1.6e-05,5.3e-05,6.8e-05,2.7e-05,4.3e-05,6.5e-05,9.6e-05,4.2e-05,4.7e-05,3.7e-05,3.8e-05,1.5e-05,3.7e-05,5.5e-05
1.9e-05,8e-06,6e-06,7e-06,1e-05,5e-06,9e-06,3.1e-05,3.4e-05,2.6e-05,9e-06,5e-06,7e-06,1.4e-05,1.4e-05,2.6e-05,1.7e-05,5e-06,2.1e-05,1.4e-05,6e-06,2.8e-05,1.9e-05,1.9e-05,3.1e-05,3e-06,1.3e-05,1.6e-05,2e-05,3e-05,9e-06,2.3e-05,2.8e-05,3.4e-05,8e-06,4.3e-05,6e-06,1.8e-05,2.2e-05,2.7e-05,5.7e-05,2.8e-05,3.3e-05,1.4e-05,9e-06,3e-05,4.2e-05,3.8e-05,4.7e-05,1e-05,3.9e-05,2.5e-05,4.3e-05,4.6e-05,1.5e-05,2.5e-05,1.1e-05,3.8e-05,5.5e-05,2.4e-05,2.2e-05,1.3e-05,2.8e-05,6.7e-05,6.9e-05,3.9e-05,4.5e-05,4.2e-05,3.4e-05,3e-05,1.9e-05,4.2e-05,3e-05,3.1e-05,3.5e-05,1.5e-05,2.8e-05,4.3e-05,3e-05,4.9e-05,9e-06,2.8e-05,1.8e-05,3e-06,4.4e-05,2.4e-05,6.7e-05,1.4e-05,2.4e-05,1.1e-05,3.7e-05,2.2e-05,2.4e-05,5e-05,3.3e-05,2.9e-05,4e-06,3.5e-05,2.2e-05,3.7e-05,6.3e-05,2.5e-05,2.3e-05,2.8e-05,3e-05,1.5e-05,3.1e-05,2.5e-05,3.9e-05,4.4e-05,2.6e-05,1.2e-05,4.3e-05,4.7e-05,1.6e-05,1e-05,5e-05,4.8e-05,4.2e-05,4.1e-05,1.4e-05
2.2e-05,1.3e-05,9e-06,1.2e-05,4e-06,5e-06,9e-06,1.8e-05,1.5e-05,1.1e-05,5e-06,9e-06,1.3e-05,1.4e-05,1.6e-05,1.8e-05,6e-06,1.9e-05,6e-06,8e-06,9e-06,2.8e-05,2e-05,2.5e-05,4e-06,1.4e-05,1e-05,1.4e-05,3.1e-05,2.3e-05,3.6e-05,2.2e-05,1.9e-05,4.7e-05,2.3e-05,3.6e-05,9e-06,9e-06,2.6e-05,2.6e-05,6.9e-05,9e-06,4.1e-05,1.8e-05,1.1e-05,3.1e-05,7e-06,3.9e-05,4.4e-05,3.4e-05,3.4e-05,4.6e-05,2.1e-05,5.2e-05,2e-05,2.6e-05,2e-06,2.9e-05,2.7e-05,3e-05,3.9e-05,2.5e-05,1.9e-05,2.7e-05,3.4e-05,3.4e-05,4.7e-05,9e-06,4e-05,1.5e-05,2.9e-05,2.3e-05,1.3e-05,2.9e-05,3.1e-05,1.8e-05,2.6e-05,1e-05,2.3e-05,2.6e-05,3.1e-05,3.3e-05,1.3e-05,2.6e-05,2.1e-05,3.3e-05,5.7e-05,3.2e-05,4.7e-05,1.9e-05,2.3e-05,2e-05,3.9e-05,2.2e-05,2.4e-05,2.5e-05,1.6e-05,2.1e-05,7e-06,2.5e-05,1.7e-05,1.6e-05,4e-06,1e-05,1e-05,3.8e-05,2.5e-05,3.5e-05,2.6e-05,4.6e-05,1.9e-05,3.2e-05,5.8e-05,5.9e-05,2.5e-05,5e-06,1.3e-05,2e-05,1.3e-05,1.2e-05,1.7e-05
1.4e-05,1e-06,7e-06,8e-06,2e-06,6e-06,7e-06,1.7e-05,1e-05,1.3e-05,5e-06,9e-06,1.7e-05,1.9e-05,9e-06,9e-06,5e-06,1.3e-05,8e-06,2.1e-05,1.1e-05,3.6e-05,4e-06,2.1e-05,1e-05,1.2e-05,2e-06,5e-06,1.3e-05,1e-05,2.4e-05,2.6e-05,1.4e-05,1.5e-05,7e-06,2.6e-05,1.4e-05,1e-05,1.5e-05,1.3e-05,2.9e-05,2.8e-05,3.8e-05,1.8e-05,1.9e-05,1.1e-05,1e-05,2.8e-05,2.4e-05,5e-06,3.3e-05,3.4e-05,1.8e-05,2.7e-05,1.2e-05,1e-05,1e-05,1e-05,1.2e-05,3.4e-05,2.6e-05,2e-05,1.2e-05,2.6e-05,2.1e-05,2.4e-05,2.7e-05,1.6e-05,4.6e-05,1.5e-05,6e-06,1.9e-05,1e-06,1.9e-05,1.1e-05,2.6e-05,2.8e-05,1.6e-05,2.2e-05,2.4e-05,1.6e-05,2.9e-05,3.2e-05,1e-05,2.4e-05,2.3e-05,4.9e-05,4e-05,3.4e-05,1.3e-05,3e-05,7e-06,1.5e-05,2e-05,1.4e-05,2.2e-05,1e-05,2.1e-05,1.7e-05,1.3e-05,1.6e-05,1.1e-05,1.9e-05,1.8e-05,1e-05,4.3e-05,2.8e-05,7e-06,3.5e-05,3.2e-05,3.8e-05,6e-06,5.9e-05,3.9e-05,1.3e-05,2e-05,4.7e-05,1.2e-05,2.4e-05,1.2e-05,1.7e-05
8e-06,2.3e-05,2e-06,1.2e-05,2.3e-05,1.8e-05,5e-06,1.9e-05,2e-05,1.3e-05,1.4e-05,3.9e-05,2.1e-05,1.4e-05,1.5e-05,2.3e-05,5e-06,3.3e-05,1.3e-05,2.3e-05,7e-06,3e-05,2.4e-05,3.5e-05,9e-06,1.2e-05,1e-05,2.8e-05,3.1e-05,1.1e-05,2.5e-05,2.6e-05,2.5e-05,1.4e-05,2e-05,1.8e-05,2.2e-05,1.6e-05,1.5e-05,7e-06,2.3e-05,2.6e-05,5.5e-05,3.3e-05,7e-06,1e-05,2.6e-05,2.1e-05,1.3e-05,3.2e-05,2.6e-05,3.2e-05,1.7e-05,3e-06,2.5e-05,1.1e-05,8e-06,1.5e-05,1.9e-05,2.5e-05,2.8e-05,2.2e-05,1.4e-05,3.7e-05,4.5e-05,2.4e-05,2.7e-05,1.4e-05,3.5e-05,1.6e-05,4.1e-05,2.4e-05,1.4e-05,2.2e-05,2.5e-05,2.3e-05,1.8e-05,1e-05,4.1e-05,9e-06,3.7e-05,1.8e-05,3.9e-05,3e-05,3.4e-05,1.4e-05,5.2e-05,2.8e-05,2.8e-05,1.8e-05,3.7e-05,2.4e-05,4e-05,2.8e-05,3.5e-05,4e-05,3e-05,4.1e-05,4.7e-05,2e-06,2.2e-05,9e-06,2.2e-05,1.1e-05,2.9e-05,3.8e-05,3e-05,3.4e-05,2.3e-05,6.9e-05,4.4e-05,1.7e-05,5.2e-05,5.1e-05,2e-05,2.4e-05,4.5e-05,2.4e-05,2.3e-05,4e-05,2.8e-05
1e-06,2.8e-05,4.4e-05,3.9e-05,4.7e-05,7e-05,4.9e-05,2.8e-05,5.2e-05,2.9e-05,2.2e-05,6.5e-05,9.2e-05,7.7e-05,5.7e-05,6.3e-05,3.3e-05,3.1e-05,1.9e-05,2.9e-05,1.1e-05,9e-06,2.7e-05,9.3e-05,8.4e-05,4.4e-05,1e-05,4.4e-05,3.9e-05,5.7e-05,1.2e-05,2.7e-05,3.1e-05,5.7e-05,3.6e-05,2.9e-05,9.6e-05,6.4e-05,1.2e-05,3.5e-05,6.3e-05,5e-05,6.8e-05,0.000119,7.2e-05,3.7e-05,2e-05,6.5e-05,3.5e-05,4.2e-05,3.8e-05,9e-05,8.3e-05,3.2e-05,5.6e-05,6.9e-05,1.5e-05,1e-05,6e-06,8e-06,1.1e-05,1.4e-05,2.6e-05,3.8e-05,6e-05,8.9e-05,4.7e-05,4e-05,3.5e-05,3.5e-05,5.1e-05,4e-05,3.4e-05,1.5e-05,5.5e-05,8.9e-05,6.2e-05,2.7e-05,6.2e-05,5.5e-05,9.1e-05,8.4e-05,7.3e-05,2.3e-05,1.5e-05,1.5e-05,8.3e-05,1.8e-05,5.4e-05,3e-05,6.2e-05,7.9e-05,8.1e-05,3.4e-05,4.9e-05,5.3e-05,6.1e-05,3.4e-05,1.5e-05,7.5e-05,4.2e-05,2.8e-05,2.7e-05,2.5e-05,3.4e-05,1.1e-05,8e-05,0.000126,0.000111,0.00012,8.7e-05,8.8e-05,1.9e-05,8e-05,6.9e-05,6.4e-05,5.7e-05,5e-05,5.3e-05,4e-05,3.1e-05
2.1e-05,2.4e-05,4.5e-05,5.4e-05,3.4e-05,3.9e-05,4.3e-05,3.9e-05,3.1e-05,2.1e-05,1.6e-05,5.3e-05,8.6e-05,5.1e-05,1.3e-05,4.1e-05,3.3e-05,2.3e-05,3.2e-05,2.6e-05,1.7e-05,3.4e-05,6e-06,9.2e-05,0.000101,7.8e-05,5.6e-05,3.9e-05,5.2e-05,9.4e-05,8.1e-05,8.5e-05,5.3e-05,6.1e-05,5.4e-05,4.8e-05,0.00012,9e-05,5.2e-05,1.3e-05,3e-05,7.3e-05,9.6e-05,0.000124,7.5e-05,4.6e-05,5.3e-05,0.000116,7.3e-05,8.5e-05,7.2e-05,4.6e-05,3.9e-05,1.7e-05,2e-05,4.4e-05,9.8e-05,7.1e-05,1.7e-05,4.3e-05,2.6e-05,2.5e-05,1.6e-05,1.5e-05,9.8e-05,0.000107,4.5e-05,6.9e-05,4.9e-05,8.4e-05,4.2e-05,3.3e-05,7.5e-05,4.7e-05,2e-05,6.6e-05,7e-05,2.9e-05,4.1e-05,2.3e-05,9.2e-05,7.7e-05,2e-05,3e-05,9e-06,2.8e-05,5.6e-05,5.2e-05,2.3e-05,6.4e-05,5.3e-05,7.3e-05,6e-05,0.000129,5.9e-05,5.4e-05,7e-06,1.9e-05,2.9e-05,7.7e-05,7e-05,4.6e-05,5.5e-05,2.1e-05,3.9e-05,1.9e-05,6.3e-05,9e-05,3.2e-05,5.4e-05,6.4e-05,3e-06,2.4e-05,8.6e-05,2.8e-05,1.6e-05,4.7e-05,2.4e-05,6.5e-05,5.3e-05,6.5e-05
1.2e-05,2.9e-05,1.2e-05,3.5e-05,1.9e-05,2.9e-05,1.2e-05,6e-06,7e-06,1.6e-05,6e-06,3.6e-05,2.4e-05,2.2e-05,2.1e-05,1.8e-05,2e-05,3.6e-05,3.4e-05,3.1e-05,2e-05,5.2e-05,3.9e-05,6.2e-05,1.8e-05,4.1e-05,1.3e-05,3.1e-05,6.3e-05,6.8e-05,2.3e-05,4.3e-05,1.4e-05,6.2e-05,1.6e-05,2.4e-05,7e-05,2.7e-05,2.6e-05,2.6e-05,9e-06,5.2e-05,4e-05,8.3e-05,7.3e-05,1.5e-05,2.4e-05,4.9e-05,3.5e-05,3.8e-05,7.6e-05,6.5e-05,3.8e-05,2.3e-05,2.4e-05,2e-05,8.8e-05,7.7e-05,4.8e-05,2.7e-05,1e-05,1e-05,6e-06,1e-06,8.7e-05,4.2e-05,4.8e-05,1.8e-05,2.3e-05,3.3e-05,2.3e-05,3.9e-05,0.000105,7.2e-05,2e-05,4.5e-05,2.4e-05,2e-05,4.3e-05,2.5e-05,5.6e-05,1.3e-05,1.7e-05,1.4e-05,2.9e-05,2.2e-05,1.1e-05,5e-06,1.8e-05,5e-05,5.4e-05,4.3e-05,7.6e-05,5.7e-05,2.4e-05,1.6e-05,1.3e-05,2.1e-05,4.2e-05,6.3e-05,1.8e-05,2.1e-05,5.9e-05,4.8e-05,4e-05,2.7e-05,3.9e-05,4.1e-05,1.5e-05,3.3e-05,2.9e-05,4.2e-05,8e-06,2.6e-05,5.5e-05,2.6e-05,6.1e-05,3e-05,3e-05,4.4e-05,3.4e-05
6e-06,2.2e-05,1.9e-05,1.8e-05,4e-06,1e-05,1.3e-05,7e-06,1e-06,1.8e-05,1.2e-05,2e-05,1e-05,1.4e-05,1e-05,1.3e-05,1.5e-05,1.4e-05,1.4e-05,2.3e-05,5e-06,3.5e-05,2.8e-05,1.8e-05,2.7e-05,2.4e-05,2.9e-05,3.1e-05,4.5e-05,2.9e-05,2e-05,2.9e-05,3.3e-05,3.9e-05,2.9e-05,1.8e-05,1e-05,2.2e-05,2.4e-05,2.7e-05,3.3e-05,5e-05,1.4e-05,4.7e-05,3.4e-05,2.9e-05,2.7e-05,3.8e-05,2.9e-05,5.5e-05,3.3e-05,1.9e-05,2.5e-05,5.2e-05,2.4e-05,4.5e-05,3.7e-05,6e-06,1.7e-05,2e-06,8e-06,3.7e-05,1.7e-05,2e-06,4.9e-05,2.1e-05,2.7e-05,1.2e-05,3.1e-05,2.5e-05,2.8e-05,5.1e-05,3.8e-05,1.9e-05,2.5e-05,1.6e-05,1.8e-05,2.5e-05,9e-06,4e-05,3.6e-05,1.1e-05,1.9e-05,1.9e-05,4.2e-05,2.1e-05,2.4e-05,3.1e-05,3e-06,3.2e-05,2.1e-05,1.2e-05,4e-05,2.5e-05,3.3e-05,2.5e-05,2e-06,2.2e-05,2.1e-05,6.4e-05,4.7e-05,1.5e-05,3.6e-05,1.6e-05,1.7e-05,3.2e-05,4.6e-05,3.9e-05,1.4e-05,2.5e-05,3.9e-05,3.4e-05,4.8e-05,2.2e-05,1.5e-05,1.1e-05,3.2e-05,3.8e-05,1.6e-05,7e-05,1.6e-05
1.4e-05,2.9e-05,1.2e-05,1.5e-05,1.3e-05,1.9e-05,8e-06,2.3e-05,1.9e-05,1.4e-05,1.6e-05,1.8e-05,1.4e-05,2.5e-05,8e-06,1.8e-05,3.2e-05,3.5e-05,1.1e-05,3.6e-05,3.7e-05,4.7e-05,4.1e-05,3.8e-05,2.6e-05,2e-05,3e-06,2.7e-05,4.5e-05,4.3e-05,3.7e-05,4.9e-05,5.7e-05,3.6e-05,4.3e-05,1.3e-05,4.4e-05,3.8e-05,2.9e-05,4.1e-05,6.2e-05,6e-05,7.8e-05,4.3e-05,3e-05,4.1e-05,3.6e-05,3.2e-05,2.1e-05,1.9e-05,6.6e-05,3.5e-05,3.5e-05,2.5e-05,6.2e-05,2.7e-05,1.9e-05,1.5e-05,1.4e-05,6e-05,4.3e-05,8.6e-05,7.5e-05,3e-05,3.9e-05,4e-05,2.2e-05,5.2e-05,4.8e-05,3e-05,7.3e-05,8.3e-05,3.9e-05,2.4e-05,2.6e-05,2.8e-05,4.4e-05,2.5e-05,1.2e-05,3.6e-05,2.8e-05,3.6e-05,3.6e-05,3.8e-05,5.8e-05,3.1e-05,8e-06,5.9e-05,6.8e-05,3.4e-05,1.6e-05,1.2e-05,4.6e-05,1.5e-05,3.7e-05,3.4e-05,1.8e-05,2e-05,6.4e-05,2.5e-05,4.2e-05,4.5e-05,3.3e-05,6.4e-05,5.4e-05,4e-05,6.5e-05,2e-05,4.7e-05,1.3e-05,6.6e-05,7.8e-05,7.8e-05,5e-05,4.9e-05,1.1e-05,1.4e-05,2e-05,3.9e-05,7.1e-05,4.7e-05
1e-05,3.3e-05,3.8e-05,3.1e-05,2.5e-05,1.2e-05,1.8e-05,3.9e-05,5.1e-05,3.9e-05,7e-06,8e-06,8e-06,2.7e-05,3.5e-05,4.3e-05,7e-06,1.9e-05,9e-06,4.3e-05,3.3e-05,3.2e-05,3.5e-05,1.5e-05,1.9e-05,3.8e-05,2.6e-05,4e-05,5e-06,2.3e-05,3.2e-05,6.3e-05,2e-06,2.1e-05,3e-05,7.6e-05,1.1e-05,2.5e-05,4.1e-05,2.9e-05,6.2e-05,3.2e-05,5.5e-05,8.6e-05,7e-05,4.4e-05,3.2e-05,4.6e-05,4.7e-05,2.4e-05,5.8e-05,4.1e-05,4.5e-05,7.8e-05,8e-05,5.4e-05,2.9e-05,3.9e-05,1e-05,7.1e-05,1.8e-05,6.2e-05,5.6e-05,5.8e-05,6.9e-05,7.1e-05,6.5e-05,5.7e-05,8.8e-05,8.3e-05,1e-04,4.2e-05,6.6e-05,4.9e-05,5.6e-05,6.4e-05,1.8e-05,3.4e-05,4.5e-05,4.2e-05,4.2e-05,3.2e-05,8.3e-05,2.7e-05,2.1e-05,4.2e-05,4.4e-05,7.6e-05,6.4e-05,4e-05,3.7e-05,2.3e-05,5e-05,7.6e-05,5.9e-05,2.2e-05,3.2e-05,1.2e-05,6.8e-05,6.2e-05,7.7e-05,4.6e-05,3.8e-05,4.4e-05,1.2e-05,3.3e-05,1.7e-05,2.8e-05,4.3e-05,7.9e-05,7e-05,6.5e-05,7e-06,5.6e-05,8e-05,6.4e-05,3.7e-05,2.7e-05,2.8e-05,7.7e-05,5.1e-05
2e-05,5e-06,3.5e-05,5.6e-05,2.5e-05,2.4e-05,1.1e-05,2.7e-05,2.5e-05,2.4e-05,1.7e-05,1.2e-05,1.8e-05,1.7e-05,2e-05,2.1e-05,1.4e-05,2.4e-05,2e-05,4.3e-05,1.9e-05,2.2e-05,1.5e-05,3e-05,2.2e-05,7.7e-05,8.5e-05,4.9e-05,3.6e-05,8e-06,3.6e-05,2.1e-05,2.1e-05,1.6e-05,2.3e-05,8.9e-05,7.6e-05,4.6e-05,4.2e-05,2.3e-05,3.3e-05,4e-05,4.6e-05,4.8e-05,2.3e-05,5e-05,8e-06,1.9e-05,5.4e-05,8.5e-05,0.000103,7.7e-05,8.2e-05,0.000112,4.8e-05,4.1e-05,5.6e-05,5.1e-05,2.1e-05,5.7e-05,4.5e-05,2.2e-05,1.3e-05,6.7e-05,2.6e-05,2.6e-05,2.7e-05,4.6e-05,2e-05,3e-05,6.2e-05,4.1e-05,6e-05,3.5e-05,4.1e-05,9e-05,9.9e-05,3.9e-05,2.8e-05,4.1e-05,6.9e-05,6.9e-05,2e-05,4.4e-05,2.3e-05,1.4e-05,6e-05,3.1e-05,4.2e-05,2.2e-05,4.3e-05,2.8e-05,6.5e-05,7e-05,3.9e-05,9e-05,9.9e-05,6.3e-05,3.1e-05,3e-05,5.4e-05,3.1e-05,2.8e-05,6e-05,7.2e-05,2.5e-05,6e-06,3.5e-05,7.3e-05,6e-05,2.2e-05,6.9e-05,3.9e-05,5.4e-05,5e-05,5.1e-05,1.5e-05,5.9e-05,2.3e-05,4.6e-05,4e-05
2e-05,7e-06,2.6e-05,4e-06,1e-05,1.4e-05,1.1e-05,3.1e-05,1.2e-05,2.1e-05,2.2e-05,6e-06,2e-05,1.6e-05,3.1e-05,1.3e-05,1.2e-05,5e-06,1.9e-05,3.1e-05,5e-06,1.6e-05,4.8e-05,2.6e-05,1.9e-05,6.2e-05,4.3e-05,1.3e-05,2.1e-05,2.5e-05,2.8e-05,1.5e-05,1.9e-05,3.7e-05,2.5e-05,6.6e-05,4e-05,1.7e-05,2.9e-05,1.6e-05,2.9e-05,1.2e-05,1.9e-05,4.9e-05,5.4e-05,1.4e-05,3.7e-05,3.6e-05,4.2e-05,5e-05,2.9e-05,4e-06,4.9e-05,4.7e-05,3.2e-05,5.4e-05,3.3e-05,3.7e-05,3.3e-05,3.2e-05,1.6e-05,2.2e-05,2.3e-05,7.8e-05,9.1e-05,5.9e-05,3.2e-05,1e-05,5e-06,4.8e-05,4e-05,8e-06,3.9e-05,1.8e-05,5.2e-05,4.1e-05,2.5e-05,3.3e-05,3e-06,4.7e-05,4.2e-05,4e-05,3.8e-05,3.8e-05,2.9e-05,2.6e-05,2.5e-05,5.2e-05,4.2e-05,3.1e-05,3.4e-05,2.6e-05,7.9e-05,4.4e-05,6.3e-05,5.5e-05,2e-05,1.2e-05,1.7e-05,4.1e-05,4.8e-05,1.9e-05,1.4e-05,5.1e-05,2.1e-05,3.9e-05,2.6e-05,4.3e-05,2.1e-05,2e-05,2.4e-05,4.7e-05,4.1e-05,5e-06,2.5e-05,5.2e-05,4.7e-05,6.3e-05,7.7e-05,3.7e-05,1.2e-05
1e-06,1e-05,1.4e-05,1.6e-05,5e-06,1e-05,1e-05,1e-05,6e-06,2.1e-05,1e-05,5e-06,1.8e-05,1.1e-05,2.1e-05,2e-05,1.4e-05,5e-06,3.2e-05,2.4e-05,2.5e-05,2.1e-05,1.4e-05,7e-06,1.2e-05,5e-05,1.7e-05,1.5e-05,3.3e-05,3.7e-05,1.9e-05,1.4e-05,2.6e-05,2.3e-05,6e-06,3.6e-05,2.9e-05,3.7e-05,1.7e-05,3.8e-05,2.8e-05,2.8e-05,4.9e-05,2e-05,2.2e-05,1.1e-05,2.3e-05,5e-06,2.5e-05,3.1e-05,4.8e-05,2.1e-05,2.5e-05,2.7e-05,7e-06,3e-05,1e-05,6e-06,2.2e-05,1.1e-05,2.3e-05,9e-06,1.2e-05,4.7e-05,2.5e-05,2.2e-05,3.6e-05,4.1e-05,1.2e-05,1.9e-05,3.1e-05,3.1e-05,3.9e-05,2.9e-05,2.5e-05,1.2e-05,2.2e-05,2e-05,7e-06,3e-05,1.6e-05,4.2e-05,3.9e-05,1.8e-05,2.1e-05,1.9e-05,1.5e-05,5.7e-05,2.9e-05,1.5e-05,3.1e-05,1e-05,5.2e-05,1.7e-05,4.9e-05,2.3e-05,1.2e-05,3e-05,2e-05,2e-05,5e-06,2.3e-05,7e-06,2.4e-05,2.4e-05,1.4e-05,2.4e-05,1.5e-05,2.4e-05,1e-05,5.9e-05,1.9e-05,1.4e-05,3.6e-05,4.3e-05,3.1e-05,1.2e-05,4.9e-05,2.4e-05,2.6e-05,2e-05
3e-06,5e-06,5e-06,1e-06,5e-06,4e-06,2e-06,5e-06,2e-06,4e-06,5e-06,6e-06,2e-06,1e-06,6e-06,1e-05,1.2e-05,1e-05,8e-06,6e-06,3e-06,7e-06,5e-06,3e-06,4e-06,1.2e-05,3e-06,7e-06,4e-06,1.1e-05,1.3e-05,9e-06,9e-06,1.4e-05,4e-06,1e-05,8e-06,5e-06,6e-06,1.6e-05,6e-06,6e-06,2.1e-05,8e-06,3e-06,6e-06,8e-06,1e-06,1e-05,7e-06,1.3e-05,1.4e-05,9e-06,1.1e-05,1.4e-05,1.1e-05,1e-05,9e-06,4e-06,7e-06,1.1e-05,7e-06,7e-06,1e-05,1.3e-05,9e-06,1.1e-05,5e-06,1.3e-05,7e-06,1.4e-05,8e-06,4e-06,3e-06,1.8e-05,1.8e-05,1.3e-05,6e-06,6e-06,1.2e-05,1.9e-05,1.8e-05,9e-06,7e-06,6e-06,1e-05,2.3e-05,4e-06,1e-06,7e-06,1.2e-05,8e-06,1.6e-05,1.3e-05,1.4e-05,3e-06,7e-06,9e-06,1.3e-05,1.5e-05,8e-06,1.3e-05,1.4e-05,6e-06,9e-06,1.4e-05,5e-06,7e-06,6e-06,3e-06,2.5e-05,1.2e-05,1.4e-05,2.2e-05,9e-06,1.7e-05,1.3e-05,1.3e-05,1.3e-05,2.3e-05,1.3e-05
5e-06,2e-06,4e-06,4e-06,5e-06,2e-06,6e-06,6e-06,5e-06,3e-06,5e-06,3e-06,2e-06,1e-06,3e-06,4e-06,6e-06,5e-06,5e-06,9e-06,4e-06,7e-06,3e-06,7e-06,5e-06,1e-05,1.2e-05,1.1e-05,8e-06,6e-06,1e-05,7e-06,1e-06,1.5e-05,1e-06,7e-06,7e-06,8e-06,6e-06,9e-06,1.4e-05,1.1e-05,1.7e-05,9e-06,6e-06,8e-06,3e-06,7e-06,5e-06,6e-06,2e-06,8e-06,1.2e-05,1.3e-05,8e-06,6e-06,1.2e-05,7e-06,7e-06,1.2e-05,1e-05,2e-06,6e-06,9e-06,8e-06,1.4e-05,9e-06,9e-06,4e-06,1.4e-05,4e-06,1e-05,5e-06,8e-06,1.6e-05,1.5e-05,7e-06,7e-06,3e-06,1.1e-05,1.5e-05,9e-06,1e-05,4e-06,5e-06,6e-06,2.2e-05,1.6e-05,7e-06,1e-06,5e-06,5e-06,5e-06,8e-06,4e-06,1.2e-05,7e-06,8e-06,4e-06,7e-06,9e-06,8e-06,4e-06,5e-06,7e-06,1e-05,7e-06,9e-06,6e-06,1e-05,2.2e-05,7e-06,4e-06,1.2e-05,1.1e-05,1e-06,4e-06,1.8e-05,1.4e-05,1e-05,3e-06
2e-06,3e-06,1e-06,3e-06,3e-06,4e-06,2e-06,6e-06,2e-06,1e-06,9e-06,6e-06,3e-06,1e-06,2e-06,1e-05,6e-06,1e-06,4e-06,0,3e-06,5e-06,1e-06,5e-06,8e-06,1e-05,1.2e-05,7e-06,7e-06,3e-06,1e-05,6e-06,8e-06,6e-06,1.3e-05,1.4e-05,9e-06,8e-06,6e-06,1.6e-05,1.4e-05,8e-06,1.7e-05,8e-06,9e-06,1.1e-05,6e-06,4e-06,8e-06,8e-06,1.1e-05,4e-06,7e-06,8e-06,1.2e-05,6e-06,1e-05,9e-06,7e-06,8e-06,5e-06,5e-06,3e-06,8e-06,1.3e-05,7e-06,5e-06,6e-06,1e-05,1.4e-05,1.1e-05,1.7e-05,1e-06,9e-06,6e-06,9e-06,7e-06,8e-06,3e-06,1.3e-05,1.5e-05,1.3e-05,1e-05,6e-06,1e-06,5e-06,1.6e-05,8e-06,9e-06,3e-06,6e-06,3e-06,3e-06,8e-06,6e-06,1e-05,6e-06,1.1e-05,2e-06,4e-06,1.3e-05,1.2e-05,2e-06,7e-06,8e-06,1.4e-05,1.1e-05,5e-06,6e-06,9e-06,9e-06,1.3e-05,4e-06,2.1e-05,3e-06,2e-06,7e-06,1e-05,6e-06,3e-06,4e-06
0,1e-06,2e-06,4e-06,4e-06,5e-06,3e-06,2e-06,4e-06,1e-06,7e-06,2e-06,3e-06,1e-06,6e-06,4e-06,3e-06,3e-06,5e-06,1e-06,1e-06,6e-06,1e-06,2e-06,2e-06,5e-06,3e-06,1e-06,6e-06,1e-06,3e-06,4e-06,4e-06,3e-06,8e-06,9e-06,4e-06,3e-06,5e-06,1.3e-05,9e-06,5e-06,8e-06,4e-06,2e-06,7e-06,5e-06,7e-06,5e-06,1.1e-05,6e-06,7e-06,1e-05,3e-06,6e-06,4e-06,9e-06,1.1e-05,4e-06,6e-06,7e-06,4e-06,3e-06,4e-06,6e-06,5e-06,0,6e-06,7e-06,1.1e-05,1e-05,8e-06,6e-06,4e-06,9e-06,1e-06,0,3e-06,7e-06,1e-05,1.2e-05,6e-06,7e-06,3e-06,2e-06,5e-06,1.4e-05,8e-06,1e-06,2e-06,3e-06,2e-06,4e-06,4e-06,5e-06,7e-06,3e-06,5e-06,5e-06,4e-06,4e-06,8e-06,9e-06,1.1e-05,2e-06,7e-06,1.7e-05,4e-06,6e-06,3e-06,5e-06,1e-05,6e-06,1.1e-05,5e-06,4e-06,4e-06,9e-06,6e-06,7e-06,4e-06
1e-06,1e-06,2e-06,4e-06,3e-06,3e-06,1e-06,5e-06,5e-06,2e-06,5e-06,4e-06,1e-06,2e-06,6e-06,4e-06,1e-06,4e-06,5e-06,4e-06,3e-06,4e-06,3e-06,2e-06,3e-06,1e-06,7e-06,3e-06,3e-06,2e-06,5e-06,5e-06,2e-06,4e-06,3e-06,8e-06,8e-06,4e-06,4e-06,1.4e-05,7e-06,3e-06,9e-06,2e-06,3e-06,2e-06,5e-06,5e-06,5e-06,8e-06,5e-06,1e-06,7e-06,1e-06,4e-06,1e-06,2e-06,6e-06,2e-06,6e-06,8e-06,4e-06,1e-06,3e-06,8e-06,6e-06,2e-06,4e-06,9e-06,8e-06,3e-06,8e-06,6e-06,4e-06,9e-06,7e-06,2e-06,4e-06,2e-06,8e-06,2e-06,4e-06,3e-06,2e-06,2e-06,6e-06,1.6e-05,1.1e-05,7e-06,5e-06,3e-06,3e-06,7e-06,8e-06,3e-06,4e-06,6e-06,8e-06,7e-06,4e-06,4e-06,2e-06,4e-06,6e-06,3e-06,8e-06,1.2e-05,1e-05,4e-06,3e-06,9e-06,9e-06,1.1e-05,1.4e-05,4e-06,2e-06,4e-06,3e-06,3e-06,8e-06,6e-06
1e-06,2e-06,1e-06,4e-06,4e-06,3e-06,0,4e-06,1e-06,2e-06,5e-06,2e-06,2e-06,1e-06,6e-06,2e-06,2e-06,4e-06,4e-06,4e-06,2e-06,7e-06,5e-06,3e-06,4e-06,0,5e-06,4e-06,3e-06,4e-06,2e-06,5e-06,3e-06,3e-06,3e-06,7e-06,7e-06,3e-06,3e-06,1.2e-05,7e-06,3e-06,7e-06,1e-06,3e-06,2e-06,3e-06,5e-06,7e-06,3e-06,1e-06,2e-06,6e-06,4e-06,7e-06,5e-06,2e-06,8e-06,3e-06,5e-06,7e-06,4e-06,2e-06,3e-06,4e-06,7e-06,2e-06,7e-06,8e-06,9e-06,7e-06,7e-06,6e-06,7e-06,8e-06,6e-06,4e-06,6e-06,3e-06,4e-06,2e-06,4e-06,2e-06,2e-06,1e-06,6e-06,1.3e-05,1.2e-05,6e-06,6e-06,2e-06,2e-06,4e-06,5e-06,6e-06,5e-06,3e-06,6e-06,2e-06,7e-06,4e-06,3e-06,6e-06,6e-06,2e-06,6e-06,1e-05,8e-06,4e-06,3e-06,1e-05,7e-06,8e-06,1.2e-05,1e-06,3e-06,3e-06,4e-06,3e-06,7e-06,4e-06
1e-06,0,1e-06,3e-06,5e-06,2e-06,2e-06,4e-06,2e-06,2e-06,5e-06,3e-06,1e-06,2e-06,6e-06,4e-06,2e-06,5e-06,6e-06,3e-06,3e-06,5e-06,2e-06,2e-06,2e-06,4e-06,3e-06,4e-06,5e-06,4e-06,2e-06,4e-06,4e-06,7e-06,5e-06,6e-06,7e-06,4e-06,4e-06,9e-06,8e-06,2e-06,9e-06,2e-06,2e-06,3e-06,2e-06,2e-06,6e-06,5e-06,0,1e-06,5e-06,1e-06,3e-06,2e-06,2e-06,7e-06,4e-06,3e-06,1e-06,2e-06,3e-06,4e-06,2e-06,8e-06,6e-06,6e-06,6e-06,1e-05,5e-06,5e-06,4e-06,7e-06,4e-06,6e-06,3e-06,5e-06,2e-06,3e-06,2e-06,5e-06,1e-06,1e-06,2e-06,4e-06,1.2e-05,1e-05,4e-06,6e-06,4e-06,2e-06,6e-06,8e-06,6e-06,4e-06,2e-06,5e-06,2e-06,5e-06,4e-06,1e-06,1e-06,4e-06,3e-06,5e-06,1e-05,9e-06,1e-06,3e-06,7e-06,4e-06,8e-06,1.2e-05,4e-06,3e-06,1e-06,3e-06,2e-06,7e-06,5e-06
1e-06,0,1e-06,3e-06,4e-06,2e-06,1e-06,3e-06,1e-06,1e-06,3e-06,3e-06,0,1e-06,5e-06,1e-06,2e-06,3e-06,3e-06,3e-06,3e-06,8e-06,2e-06,2e-06,3e-06,4e-06,3e-06,1e-06,1e-06,3e-06,1e-06,6e-06,2e-06,4e-06,3e-06,4e-06,6e-06,2e-06,6e-06,1.3e-05,6e-06,3e-06,1e-05,2e-06,3e-06,4e-06,3e-06,3e-06,1e-05,7e-06,3e-06,2e-06,9e-06,1e-06,6e-06,3e-06,7e-06,3e-06,5e-06,5e-06,7e-06,5e-06,3e-06,3e-06,3e-06,9e-06,2e-06,6e-06,6e-06,1.1e-05,8e-06,9e-06,6e-06,4e-06,7e-06,3e-06,0,2e-06,0,4e-06,1e-06,4e-06,2e-06,2e-06,4e-06,6e-06,1.2e-05,1e-05,5e-06,5e-06,3e-06,2e-06,5e-06,7e-06,3e-06,3e-06,1e-06,4e-06,4e-06,5e-06,1e-06,1e-06,4e-06,5e-06,3e-06,8e-06,9e-06,8e-06,2e-06,1e-06,8e-06,5e-06,2e-06,8e-06,4e-06,0,7e-06,5e-06,1e-06,4e-06,5e-06
3e-06,1e-06,1e-06,3e-06,3e-06,1e-06,2e-06,1e-06,2e-06,1e-06,3e-06,4e-06,2e-06,1e-06,4e-06,4e-06,3e-06,3e-06,2e-06,4e-06,1e-06,5e-06,1e-06,0,3e-06,2e-06,2e-06,4e-06,3e-06,2e-06,2e-06,1e-06,4e-06,5e-06,3e-06,6e-06,5e-06,6e-06,3e-06,1e-05,6e-06,2e-06,4e-06,1e-06,2e-06,2e-06,1e-06,6e-06,6e-06,4e-06,2e-06,1e-06,8e-06,5e-06,4e-06,3e-06,5e-06,6e-06,4e-06,7e-06,7e-06,1e-06,1e-06,5e-06,2e-06,6e-06,5e-06,5e-06,9e-06,1.4e-05,1e-06,8e-06,5e-06,2e-06,7e-06,2e-06,3e-06,4e-06,1e-06,6e-06,4e-06,4e-06,3e-06,4e-06,1e-06,4e-06,1.2e-05,1.1e-05,5e-06,4e-06,5e-06,5e-06,7e-06,4e-06,5e-06,5e-06,2e-06,8e-06,2e-06,7e-06,1e-06,2e-06,3e-06,6e-06,1e-06,8e-06,7e-06,5e-06,2e-06,2e-06,7e-06,5e-06,5e-06,8e-06,4e-06,4e-06,6e-06,3e-06,3e-06,5e-06,3e-06
2e-06,2e-06,2e-06,3e-06,3e-06,3e-06,1e-06,3e-06,1e-06,1e-06,5e-06,2e-06,2e-06,3e-06,3e-06,5e-06,0,4e-06,5e-06,3e-06,2e-06,5e-06,2e-06,2e-06,2e-06,1e-06,0,3e-06,4e-06,0,4e-06,3e-06,3e-06,4e-06,4e-06,7e-06,2e-06,3e-06,0,9e-06,2e-06,4e-06,8e-06,3e-06,5e-06,4e-06,1e-06,6e-06,4e-06,4e-06,2e-06,3e-06,4e-06,3e-06,3e-06,4e-06,2e-06,2e-06,2e-06,7e-06,6e-06,1e-06,3e-06,3e-06,5e-06,5e-06,5e-06,6e-06,9e-06,1.3e-05,4e-06,7e-06,7e-06,3e-06,9e-06,2e-06,5e-06,6e-06,1e-06,4e-06,1e-06,5e-06,1e-06,1e-06,1e-06,4e-06,1.1e-05,1e-05,4e-06,2e-06,4e-06,5e-06,4e-06,6e-06,3e-06,5e-06,2e-06,5e-06,3e-06,5e-06,4e-06,3e-06,4e-06,6e-06,3e-06,7e-06,1e-05,7e-06,0,4e-06,1e-05,7e-06,8e-06,1e-05,1e-06,3e-06,3e-06,5e-06,2e-06,4e-06,4e-06
1e-06,0,3e-06,1e-06,5e-06,3e-06,3e-06,1e-06,2e-06,2e-06,3e-06,1e-06,3e-06,1e-06,5e-06,2e-06,0,5e-06,2e-06,3e-06,3e-06,5e-06,1e-06,3e-06,3e-06,1e-06,0,2e-06,3e-06,2e-06,1e-06,3e-06,4e-06,6e-06,3e-06,8e-06,4e-06,5e-06,2e-06,8e-06,6e-06,2e-06,6e-06,3e-06,4e-06,2e-06,2e-06,5e-06,4e-06,1e-06,3e-06,2e-06,3e-06,6e-06,3e-06,2e-06,1e-06,4e-06,4e-06,5e-06,6e-06,1e-06,4e-06,5e-06,7e-06,3e-06,4e-06,6e-06,8e-06,1.2e-05,2e-06,7e-06,6e-06,5e-06,8e-06,4e-06,2e-06,4e-06,2e-06,3e-06,1e-06,2e-06,3e-06,4e-06,1e-06,4e-06,1.2e-05,1.4e-05,0,4e-06,4e-06,2e-06,6e-06,4e-06,4e-06,4e-06,3e-06,2e-06,1e-06,6e-06,5e-06,1e-06,5e-06,2e-06,3e-06,8e-06,8e-06,7e-06,1e-06,3e-06,1e-05,3e-06,5e-06,9e-06,3e-06,2e-06,4e-06,2e-06,3e-06,5e-06,3e-06
1e-06,2e-06,2e-06,2e-06,4e-06,2e-06,2e-06,2e-06,1e-06,2e-06,3e-06,4e-06,2e-06,1e-06,4e-06,4e-06,2e-06,2e-06,0,4e-06,2e-06,4e-06,2e-06,4e-06,1e-06,2e-06,1e-06,4e-06,4e-06,4e-06,3e-06,5e-06,2e-06,4e-06,2e-06,7e-06,2e-06,6e-06,6e-06,8e-06,9e-06,3e-06,8e-06,2e-06,2e-06,4e-06,4e-06,4e-06,6e-06,4e-06,3e-06,1e-06,4e-06,3e-06,7e-06,0,1e-06,4e-06,5e-06,4e-06,6e-06,2e-06,5e-06,2e-06,6e-06,6e-06,2e-06,5e-06,9e-06,9e-06,4e-06,8e-06,4e-06,5e-06,6e-06,3e-06,2e-06,3e-06,3e-06,4e-06,2e-06,4e-06,4e-06,3e-06,2e-06,9e-06,1e-05,1.3e-05,8e-06,2e-06,2e-06,3e-06,7e-06,6e-06,3e-06,7e-06,3e-06,7e-06,1e-06,5e-06,2e-06,3e-06,3e-06,5e-06,1e-06,9e-06,1.1e-05,5e-06,1e-06,5e-06,9e-06,6e-06,5e-06,1.2e-05,1e-06,1e-06,4e-06,2e-06,1e-06,6e-06,4e-06
2e-06,2e-06,4e-06,2e-06,2e-06,3e-06,2e-06,3e-06,2e-06,2e-06,2e-06,3e-06,2e-06,2e-06,4e-06,3e-06,4e-06,4e-06,3e-06,2e-06,1e-06,6e-06,2e-06,3e-06,3e-06,2e-06,1e-06,3e-06,4e-06,4e-06,1e-06,6e-06,0,7e-06,2e-06,6e-06,5e-06,4e-06,5e-06,1.2e-05,6e-06,3e-06,9e-06,5e-06,5e-06,1e-06,6e-06,4e-06,8e-06,3e-06,1e-06,2e-06,6e-06,1e-06,6e-06,7e-06,5e-06,4e-06,4e-06,4e-06,4e-06,1e-06,2e-06,3e-06,5e-06,3e-06,1e-06,6e-06,6e-06,1.1e-05,4e-06,7e-06,4e-06,2e-06,7e-06,3e-06,4e-06,0,2e-06,2e-06,5e-06,4e-06,2e-06,4e-06,2e-06,6e-06,7e-06,6e-06,5e-06,1e-06,3e-06,6e-06,3e-06,8e-06,6e-06,3e-06,2e-06,3e-06,0,6e-06,3e-06,3e-06,2e-06,4e-06,3e-06,5e-06,8e-06,8e-06,2e-06,4e-06,1e-05,5e-06,8e-06,1.3e-05,4e-06,1e-06,6e-06,1e-06,6e-06,5e-06,7e-06
2e-06,3e-06,4e-06,4e-06,3e-06,1e-06,2e-06,5e-06,3e-06,1e-06,5e-06,4e-06,1e-06,1e-06,4e-06,3e-06,1e-06,6e-06,1e-06,4e-06,2e-06,5e-06,2e-06,3e-06,2e-06,1e-06,1e-06,1e-06,6e-06,3e-06,4e-06,6e-06,5e-06,8e-06,4e-06,4e-06,3e-06,3e-06,3e-06,9e-06,3e-06,1e-06,9e-06,1e-05,9e-06,4e-06,4e-06,4e-06,6e-06,4e-06,3e-06,6e-06,6e-06,9e-06,2e-06,7e-06,4e-06,8e-06,8e-06,5e-06,5e-06,4e-06,1e-06,3e-06,4e-06,3e-06,2e-06,2e-06,7e-06,8e-06,3e-06,7e-06,4e-06,5e-06,6e-06,4e-06,3e-06,4e-06,2e-06,3e-06,5e-06,2e-06,4e-06,2e-06,2e-06,3e-06,1.5e-05,7e-06,5e-06,4e-06,3e-06,4e-06,8e-06,9e-06,7e-06,2e-06,2e-06,6e-06,1e-06,7e-06,5e-06,4e-06,3e-06,2e-06,3e-06,1.2e-05,5e-06,6e-06,3e-06,8e-06,8e-06,1e-06,7e-06,4e-06,4e-06,4e-06,9e-06,7e-06,7e-06,1e-05,1.2e-05
1e-06,2e-06,1e-06,1e-06,3e-06,4e-06,3e-06,2e-06,4e-06,3e-06,4e-06,6e-06,4e-06,2e-06,5e-06,3e-06,5e-06,7e-06,4e-06,4e-06,5e-06,3e-06,2e-06,5e-06,5e-06,5e-06,4e-06,3e-06,5e-06,4e-06,4e-06,3e-06,1e-05,7e-06,6e-06,6e-06,5e-06,5e-06,3e-06,1.6e-05,1.4e-05,9e-06,8e-06,7e-06,1.1e-05,1.4e-05,9e-06,9e-06,4e-06,1e-06,3e-06,5e-06,1e-06,1e-06,3e-06,3e-06,7e-06,9e-06,1.8e-05,1.2e-05,6e-06,7e-06,7e-06,9e-06,1e-06,6e-06,2e-06,6e-06,6e-06,7e-06,3e-06,1.4e-05,7e-06,5e-06,2e-06,1.2e-05,9e-06,9e-06,4e-06,5e-06,5e-06,7e-06,5e-06,6e-06,6e-06,6e-06,1.5e-05,1.5e-05,6e-06,7e-06,1e-05,9e-06,8e-06,9e-06,9e-06,9e-06,2e-06,7e-06,6e-06,7e-06,3e-06,7e-06,1e-05,7e-06,2e-06,1.4e-05,1.4e-05,3e-06,2e-06,6e-06,1.1e-05,5e-06,9e-06,1.2e-05,3e-06,6e-06,4e-06,8e-06,6e-06,1e-05,1.2e-05
1e-06,3e-06,1e-06,2e-06,1e-06,3e-06,2e-06,3e-06,3e-06,1e-06,2e-06,4e-06,1e-06,1e-06,5e-06,2e-06,7e-06,3e-06,5e-06,4e-06,3e-06,6e-06,3e-06,5e-06,2e-06,1e-06,2e-06,1e-06,2e-06,4e-06,3e-06,4e-06,5e-06,6e-06,3e-06,4e-06,5e-06,2e-06,4e-06,9e-06,7e-06,3e-06,4e-06,1e-06,8e-06,7e-06,3e-06,7e-06,2e-06,3e-06,7e-06,5e-06,2e-06,5e-06,2e-06,1e-06,1e-06,6e-06,1.1e-05,1.1e-05,3e-06,4e-06,3e-06,4e-06,6e-06,8e-06,3e-06,2e-06,7e-06,8e-06,4e-06,7e-06,1e-06,3e-06,2e-06,1e-05,2e-06,4e-06,1e-06,3e-06,2e-06,3e-06,2e-06,1e-06,2e-06,8e-06,6e-06,9e-06,3e-06,9e-06,7e-06,3e-06,1e-06,5e-06,5e-06,2e-06,2e-06,2e-06,1e-06,6e-06,5e-06,5e-06,8e-06,7e-06,5e-06,1e-05,2e-06,3e-06,5e-06,2e-06,6e-06,4e-06,8e-06,1.2e-05,5e-06,4e-06,9e-06,6e-06,1e-06,6e-06,9e-06
1e-06,1e-06,1e-06,2e-06,1e-06,2e-06,1e-06,2e-06,0,1e-06,4e-06,4e-06,1e-06,1e-06,4e-06,1e-06,2e-06,4e-06,2e-06,3e-06,1e-06,5e-06,2e-06,2e-06,3e-06,0,1e-06,2e-06,1e-06,1e-06,3e-06,1e-06,3e-06,0,2e-06,4e-06,2e-06,2e-06,2e-06,9e-06,8e-06,1e-06,4e-06,1e-06,5e-06,2e-06,1e-06,5e-06,5e-06,4e-06,2e-06,3e-06,2e-06,4e-06,4e-06,3e-06,1e-06,6e-06,2e-06,6e-06,1e-06,2e-06,4e-06,4e-06,6e-06,1e-06,3e-06,2e-06,6e-06,1e-05,3e-06,6e-06,2e-06,2e-06,2e-06,0,3e-06,5e-06,2e-06,2e-06,2e-06,4e-06,1e-06,2e-06,0,3e-06,8e-06,8e-06,6e-06,3e-06,4e-06,1e-06,1e-06,6e-06,5e-06,5e-06,4e-06,5e-06,4e-06,8e-06,3e-06,3e-06,3e-06,5e-06,1e-06,4e-06,9e-06,5e-06,2e-06,3e-06,5e-06,4e-06,9e-06,7e-06,0,2e-06,5e-06,1e-06,0,5e-06,6e-06
1e-06,0,1e-06,2e-06,2e-06,2e-06,1e-06,2e-06,0,1e-06,3e-06,3e-06,1e-06,0,4e-06,0,1e-06,3e-06,2e-06,3e-06,1e-06,4e-06,3e-06,1e-06,2e-06,0,0,2e-06,2e-06,2e-06,1e-06,2e-06,1e-06,2e-06,2e-06,5e-06,2e-06,1e-06,1e-06,8e-06,7e-06,2e-06,3e-06,2e-06,4e-06,3e-06,1e-06,5e-06,5e-06,3e-06,1e-06,4e-06,5e-06,5e-06,4e-06,2e-06,1e-06,3e-06,2e-06,7e-06,3e-06,1e-06,1e-06,3e-06,5e-06,5e-06,4e-06,3e-06,6e-06,1e-05,4e-06,6e-06,2e-06,2e-06,5e-06,2e-06,1e-06,4e-06,1e-06,2e-06,1e-06,3e-06,1e-06,2e-06,1e-06,4e-06,9e-06,9e-06,6e-06,4e-06,4e-06,2e-06,2e-06,6e-06,5e-06,4e-06,2e-06,5e-06,1e-06,4e-06,3e-06,2e-06,1e-06,6e-06,3e-06,2e-06,6e-06,6e-06,2e-06,3e-06,6e-06,5e-06,6e-06,7e-06,2e-06,1e-06,2e-06,2e-06,1e-06,6e-06,2e-06
1e-06,1e-06,1e-06,2e-06,2e-06,3e-06,0,2e-06,0,0,3e-06,2e-06,1e-06,0,3e-06,1e-06,1e-06,3e-06,2e-06,3e-06,1e-06,4e-06,2e-06,1e-06,2e-06,0,0,2e-06,1e-06,2e-06,1e-06,3e-06,0,3e-06,1e-06,5e-06,2e-06,2e-06,1e-06,8e-06,6e-06,2e-06,5e-06,1e-06,3e-06,4e-06,1e-06,4e-06,5e-06,1e-06,2e-06,3e-06,3e-06,2e-06,3e-06,3e-06,0,4e-06,1e-06,5e-06,3e-06,1e-06,0,3e-06,4e-06,6e-06,2e-06,4e-06,7e-06,1e-05,3e-06,5e-06,2e-06,2e-06,5e-06,3e-06,1e-06,2e-06,2e-06,2e-06,0,4e-06,1e-06,1e-06,1e-06,3e-06,9e-06,9e-06,5e-06,3e-06,4e-06,2e-06,2e-06,5e-06,4e-06,3e-06,1e-06,4e-06,0,4e-06,3e-06,2e-06,1e-06,5e-06,2e-06,3e-06,8e-06,5e-06,2e-06,3e-06,7e-06,5e-06,7e-06,8e-06,1e-06,1e-06,3e-06,1e-06,1e-06,5e-06,2e-06
1e-06,1e-06,1e-06,2e-06,2e-06,2e-06,0,2e-06,1e-06,0,3e-06,3e-06,1e-06,0,4e-06,1e-06,1e-06,3e-06,2e-06,3e-06,1e-06,4e-06,3e-06,0,2e-06,1e-06,0,1e-06,1e-06,2e-06,1e-06,3e-06,0,3e-06,1e-06,5e-06,3e-06,2e-06,1e-06,8e-06,6e-06,1e-06,4e-06,1e-06,4e-06,3e-06,1e-06,4e-06,5e-06,2e-06,2e-06,3e-06,3e-06,2e-06,3e-06,3e-06,0,3e-06,1e-06,6e-06,3e-06,1e-06,0,3e-06,4e-06,5e-06,3e-06,5e-06,7e-06,9e-06,3e-06,5e-06,2e-06,2e-06,4e-06,2e-06,1e-06,3e-06,2e-06,3e-06,1e-06,4e-06,2e-06,1e-06,1e-06,3e-06,9e-06,8e-06,4e-06,3e-06,3e-06,2e-06,2e-06,4e-06,4e-06,4e-06,2e-06,4e-06,0,5e-06,2e-06,2e-06,1e-06,5e-06,2e-06,4e-06,7e-06,5e-06,1e-06,3e-06,6e-06,4e-06,6e-06,8e-06,0,1e-06,2e-06,1e-06,1e-06,5e-06,1e-06
