0.000253,0.000132,0.00058,2.6e-05,0.000152,0.000427,0.000127,8.6e-05,0.000221,0.000111,7.4e-05,0.000227,8e-05,7e-06,0.00027,0.000172,3e-06,8.1e-05,0.000283,3.6e-05,0.000136,0.000408,2.4e-05,0.000226,0.000102,3.4e-05,0.000247,5.3e-05,0.000156,4.2e-05,0.000269,6.7e-05,0.000503,0.000238,0.000244,6.1e-05,9.1e-05,0.000396,0.000307,3.9e-05,0.00027,0.000156,0.000122,0.000445,0.000143,0.00055,0.000219,0.000135,0.000284,0.000457,0.000323,7e-05,0.00033,0.000178,0.000338,4e-06,0.000181,0.000269,0.000458,1e-04,0.000275,0.00025,0.000118,0.000148,3.3e-05,4.9e-05,0.000152,0.000197,0.00023,0.000162,2.7e-05,5.8e-05,0.000275,0.000208,0.000216,0.000128,2e-05,6.2e-05,0.000351,0.000512,0.000811,1e-06,0.000525,0.000315,3.2e-05,3e-04,1e-06,3.2e-05,0.000258,0.00037,0.000161,2.9e-05,2.2e-05,0.000387,0.000425,0.000126,3.5e-05,0.000248,0.000223,4.5e-05,0.000536,0.000309,0.000213,0.000159,3e-06,2e-04,0.000145,0.000212,0.000211,6.2e-05,1.6e-05,0.000174,0.000208,0.000305,0.000111,0.000186,0.000262,0.000131,0.000323,0.000103,0.00025
0.000573,0.000936,0.001125,0.000946,0.001527,0.001996,0.001562,0.001022,0.000564,0.000279,0.000255,0.000519,0.000361,0.000557,0.000661,0.000487,0.000769,0.000297,0.000462,0.000652,0.000394,0.000675,0.000378,0.000638,0.000343,0.000637,0.000634,0.000242,0.000508,0.000306,0.000579,0.000281,0.000865,0.00082,0.001157,0.000146,0.000332,0.000979,0.000339,0.000402,8e-04,0.000347,0.000597,5e-04,1.3e-05,0.000812,0.000938,0.000991,0.000996,0.001366,0.00159,0.000437,0.000748,0.000275,0.000649,0.000213,0.000373,0.000857,0.001665,0.000751,0.00065,0.000717,0.000508,0.000218,0.00051,0.000524,0.000182,0.000334,0.000546,0.000645,0.000491,0.00066,0.000756,0.000944,0.000756,9.4e-05,0.000596,0.000346,0.000484,0.00156,0.001388,0.001342,0.000786,0.000851,0.000327,0.000522,0.00097,0.000852,0.001429,0.000934,0.000874,0.000747,0.000435,0.00078,0.001551,0.000983,0.000166,0.001233,0.001455,0.000472,0.00097,0.00036,0.000541,0.00047,0.000582,0.000451,0.000208,0.000495,0.000439,0.000323,0.000332,0.000679,0.000262,0.000205,0.000703,0.000523,0.000801,0.000299,0.000901,0.000624,0.000267
0.000836,0.000322,0.00025,2.5e-05,0.001311,0.00157,0.000489,0.000186,0.000769,0.000425,0.000938,0.00045,0.00079,0.000765,0.000531,0.00126,0.00031,0.000431,0.000754,0.000861,0.00056,0.001631,0.001377,0.000201,0.000174,0.000693,0.000562,0.001148,0.001478,0.000579,0.001269,0.0012,0.001469,0.000853,0.000567,0.000956,0.001147,0.000179,0.001018,0.000728,0.000298,0.00046,0.001024,0.001228,0.000736,0.000368,0.001757,0.000912,0.000162,0.000365,0.000724,0.000781,0.00114,0.000995,0.000747,0.001153,0.000283,0.000295,0.001727,0.001614,0.000623,0.001117,0.000908,0.000519,0.001082,0.000969,0.000801,0.000615,0.001146,0.001774,0.000704,0.000796,0.00129,0.000268,0.000589,0.000999,0.001491,0.00204,0.002051,0.001864,0.00052,0.002166,0.001966,0.002411,2e-04,0.001053,0.001263,0.000825,0.001154,0.00036,0.000535,0.00077,0.000575,0.001411,0.001968,0.000907,0.001137,0.001828,0.001013,0.001971,0.001353,0.000805,0.000627,0.000649,0.001073,0.001801,0.001192,0.000434,0.000598,0.000612,6e-05,0.000623,0.000699,0.00107,0.000585,0.001254,0.000876,0.000683,0.000613,0.000566,0.000669
0.000779,0.000894,0.000794,0.000377,0.001157,0.000349,0.001804,0.001213,0.001519,0.000808,0.001578,0.002129,0.000175,0.000407,0.000561,0.002233,0.001586,0.001268,0.000813,0.001622,0.002136,0.001085,0.00299,0.002058,0.000987,0.000844,0.000736,0.001042,0.000948,0.001002,0.001804,0.000256,0.000326,0.00088,0.000956,0.001215,0.000281,0.000671,0.000753,0.001944,0.001511,0.000269,0.000915,0.001911,0.001737,0.001922,0.002532,0.002648,0.002246,0.001312,5.9e-05,0.000404,0.000992,0.000757,0.000261,0.002604,0.003172,0.001663,0.002812,0.002112,0.001545,0.000481,0.001593,0.000696,0.000833,0.000287,0.00044,0.000976,0.002675,0.000481,0.000795,0.001236,0.002328,0.002662,0.002097,0.002201,0.0023,0.003253,0.000257,0.001231,0.000618,0.001467,0.00104,0.002033,0.002289,0.001838,0.000753,0.001747,0.002349,0.000589,0.001134,0.000976,0.001328,0.001361,0.002049,0.001377,0.000917,0.002375,0.001462,0.002594,0.001177,0.001679,0.001977,0.001487,0.001739,0.000914,0.001068,0.000942,0.000866,0.001297,0.000748,0.000177,0.00036,0.002212,0.001755,0.00144,0.000859,0.000237,0.001073,0.000761,0.000912
0.000595,0.000653,0.001858,0.001708,0.001193,0.001357,0.00106,0.001072,0.000188,5e-04,0.001,0.00162,0.001814,0.001735,0.00046,0.002474,0.002041,0.000988,0.001336,0.001812,0.001045,0.002813,0.00278,0.002221,0.00101,0.000542,0.000781,0.000816,0.000475,0.000755,0.001993,0.002175,0.001573,0.001024,0.001556,0.001492,0.000842,0.002012,0.001511,0.001865,0.000527,0.001129,0.001995,0.001491,0.000443,0.00137,0.000196,0.002074,0.002405,0.001355,0.001389,0.001409,0.00012,0.000504,0.000215,0.002765,0.00313,0.001548,0.001858,0.001237,0.001388,0.001058,0.002356,0.002297,0.001092,0.000519,0.000806,0.00175,0.001559,0.002138,0.002159,0.000711,0.000897,0.000886,0.002486,0.000349,0.003031,0.000594,0.0016,0.002177,0.001293,0.000668,0.001,0.000463,0.001684,0.001871,0.000714,0.001082,0.001495,0.001634,0.00134,0.001283,0.001373,0.003068,0.001353,0.000573,0.000328,0.002306,0.00157,0.000411,0.001795,0.002339,0.001175,0.000301,0.001426,0.002359,0.001194,0.00045,0.001357,0.000363,0.000616,0.000904,0.000816,0.002613,0.001957,0.001541,0.00107,0.000734,0.001632,0.000182,0.000523
0.001238,0.001519,0.001117,0.000684,0.000318,0.000514,0.000833,0.000259,0.000492,0.000648,0.000555,0.000372,0.001049,0.000854,0.000936,0.000951,0.000549,0.000352,0.000849,0.000149,0.000531,0.001814,0.00076,0.001537,0.000429,0.000443,0.000788,0.000751,0.000815,0.000211,0.00081,0.00081,0.000702,0.001148,0.001979,0.001261,0.000932,0.002052,0.001138,0.000307,0.000635,0.001313,0.001242,0.000832,0.000696,0.001433,0.001396,0.000733,0.00062,0.000289,0.001181,0.001605,0.001045,0.000695,0.000463,0.002304,0.000565,0.000827,0.00027,0.000884,0.001024,0.000413,0.002369,0.001603,0.000614,0.000722,0.000611,0.000617,0.001546,0.001089,0.000531,0.001582,0.000935,0.001003,0.001044,0.001261,0.001824,0.001523,0.001111,0.003448,0.003081,0.00147,0.000815,0.000376,0.000607,0.000452,0.001084,0.00112,0.00019,0.001563,0.001188,0.001577,0.000976,0.00125,0.000284,0.000922,0.000614,0.001123,0.000498,0.00095,0.001118,0.00054,0.001043,0.000547,0.000711,0.001164,0.000104,0.00054,0.001296,0.000979,0.001296,0.00037,0.000422,0.001215,0.00015,0.001119,0.000519,0.000195,0.001256,0.001252,0.000678
0.000555,0.00095,0.001285,0.000984,0.00014,0.001308,0.000775,0.00078,0.001025,0.000194,0.000517,0.000203,0.001309,0.000478,0.000593,0.002078,0.000124,0.000266,0.000366,0.001081,0.000808,0.000974,0.000944,0.001414,0.000613,0.00049,0.002185,0.000624,0.00024,0.000398,0.000281,0.001231,0.000753,0.00089,0.001039,0.000308,0.000794,0.001646,8.5e-05,0.001025,0.000543,0.000961,0.001768,0.000655,0.000945,0.001705,0.000596,0.001053,8e-04,0.000723,0.000242,0.001478,0.000625,0.000589,0.000891,0.001643,0.001403,0.001646,0.00209,0.000187,0.001296,0.000355,0.001062,0.001579,0.00176,0.001163,0.001142,0.001687,0.001427,0.001735,0.001936,0.00247,0.000202,0.000656,0.000516,0.000832,0.001299,0.001953,0.001141,0.001838,0.002167,0.001005,0.000888,0.001201,0.001247,0.002013,0.000998,0.002176,0.000671,0.001188,0.00133,0.001665,0.00082,0.00138,0.001671,0.001189,0.000802,0.000581,0.000589,0.001183,0.002126,0.001186,0.002211,0.001944,0.001557,0.000461,0.000878,0.00146,0.000549,0.000214,0.001088,0.001858,0.000324,0.001179,0.000874,0.000794,0.001188,0.000392,0.000737,0.000308,0.00072
0.001298,0.00183,0.001684,0.001753,0.001453,0.00263,0.002322,0.002768,0.002435,0.000726,0.001018,0.001789,0.001698,0.000414,0.00105,0.00505,0.003351,0.001575,5e-04,0.002333,0.000564,0.000755,0.001526,0.001663,0.001427,0.001152,0.004143,0.003072,0.002303,0.000562,0.001483,0.002782,0.00246,0.00201,0.001988,0.001219,0.001672,0.003647,0.0025,0.001603,0.001406,0.001249,0.001608,0.002139,0.000442,0.002147,0.001699,0.001193,0.001867,0.00117,0.000202,0.001934,0.001522,0.002865,0.002947,0.000262,0.004413,0.002244,0.001321,0.001436,0.001275,0.001608,0.001047,0.002614,0.003589,0.001196,0.001156,0.002332,0.002034,0.002139,0.004102,0.001642,0.001552,0.001076,0.001824,0.001419,0.002998,0.004701,0.005621,0.005173,0.004465,0.002733,0.00148,0.001162,0.001627,0.004021,0.003589,0.002013,0.00158,0.002252,0.002177,0.002808,0.003349,0.004596,0.005281,0.003683,0.003571,0.003135,0.001476,0.001915,0.003896,0.003504,0.000509,0.00069,0.001457,0.001569,0.001833,0.002767,0.001931,0.00203,0.00049,0.00115,0.002585,0.002106,0.001492,0.001555,0.000955,0.001444,0.000826,0.002465,0.001005
0.000945,0.001275,0.003688,0.00369,0.000853,0.003026,0.003728,0.001388,0.000898,0.000898,0.001838,0.000869,0.000704,0.002265,0.001161,0.006437,0.004821,0.002429,0.00109,0.002018,0.002987,0.000885,0.003472,0.002118,0.001449,0.003064,0.004714,0.003538,0.000909,0.00043,0.001497,0.001272,0.001616,0.001897,0.001089,0.000684,0.000966,0.004532,0.003467,0.001151,0.000719,0.000594,0.00058,0.000726,0.002291,0.002455,0.002419,0.002722,0.0029,0.001146,0.001492,0.003058,0.001524,0.002514,0.003944,0.004716,0.006898,0.00362,0.000743,0.000476,0.000572,0.002174,0.003304,0.003597,0.000461,0.001908,0.00028,0.002161,0.00479,0.00468,0.001062,0.002523,0.003621,0.003526,0.001845,0.003345,0.004355,0.007793,0.001474,0.003765,0.00698,0.004444,0.003875,0.00048,0.001701,0.001747,0.002807,0.001414,0.003599,0.000768,0.00119,0.00033,0.001362,0.007186,0.007373,0.00384,0.003245,0.004006,0.002548,0.003256,0.003112,0.002682,0.002715,0.002763,0.000652,0.000757,0.000898,0.002843,0.004148,0.002378,0.001475,0.000374,0.003517,0.002351,0.001212,0.001832,0.002814,0.003898,0.002089,0.004318,0.003221
0.001567,0.000377,0.002474,0.001145,0.001814,0.001813,0.000417,0.002557,0.002114,0.002266,0.002144,0.001802,0.00084,0.002537,0.00182,0.003901,0.00193,0.000353,0.00298,0.002322,0.0042,0.003444,0.004876,0.002575,0.001798,0.00159,0.001737,0.002483,0.00172,0.001273,0.000399,0.001293,0.00347,0.001154,0.001787,0.000823,0.000453,0.002846,0.000867,0.001116,0.001398,0.000424,0.000748,0.000725,0.002552,0.002197,0.001096,0.001591,0.000632,0.000221,0.002383,0.003291,0.001344,0.002059,0.002158,0.003489,0.001685,0.002487,0.002997,0.002537,0.002217,0.003083,0.002943,0.00129,0.000745,0.002188,0.002663,0.000966,0.003562,0.002926,0.002707,0.001048,0.00166,0.002123,0.002174,0.001966,0.003122,0.003963,0.004685,0.00062,0.002276,0.000782,0.002438,0.002683,0.000963,0.000833,0.001883,0.004476,0.002689,0.002938,0.002191,0.001819,0.00014,0.005507,0.000334,0.001145,0.002269,0.000818,0.000503,0.002757,0.002323,0.002713,0.002731,0.001915,0.001689,0.001315,0.000752,0.002412,0.00354,0.003276,0.000988,0.000675,0.002548,0.001463,0.001452,0.002404,0.003769,0.002374,0.002539,0.002212,0.002261
0.001604,0.001559,0.00057,0.001778,0.000737,0.000201,0.000546,0.001247,0.000584,0.000705,0.000878,0.000376,0.000533,0.002459,0.002145,0.002169,0.000926,0.000834,0.002164,0.002594,0.001615,0.001312,0.001711,0.00102,0.000332,0.001236,0.002546,0.001331,0.000603,0.000969,0.001282,0.000788,0.002836,0.002669,0.002948,0.002346,0.001469,0.001649,0.002131,0.002313,0.001152,0.001202,0.001011,0.001269,0.001434,0.000492,0.001088,0.002457,0.002195,0.001013,0.002148,0.001309,0.00115,0.001344,0.002047,0.00106,0.002181,0.001442,0.001532,0.00095,0.000841,0.000943,0.001142,0.001837,0.000758,0.001335,0.001299,0.001363,0.001953,0.000442,0.000457,0.001086,0.002076,0.00128,0.000489,0.001625,0.00311,0.00177,0.002529,0.002202,0.001482,0.001481,0.002001,0.001182,0.000284,0.001925,0.000338,0.003393,0.00229,0.002546,0.000734,0.001188,0.0021,0.002589,0.002963,0.001954,0.000424,0.001044,0.001172,0.001108,0.002042,0.000239,0.001936,0.001228,0.001105,0.000851,0.000263,0.002073,0.001154,0.000736,0.001191,0.000551,0.001509,0.000906,0.000969,0.001788,0.001338,0.002903,0.000857,0.002316,0.000866
0.001089,0.000205,0.000139,0.000948,0.000795,0.000728,0.000498,0.000438,0.000636,0.000813,0.000475,0.00017,0.000842,0.001086,0.000531,0.000562,0.000234,0.000751,0.001007,0.000727,0.000881,0.000634,0.000732,0.000477,0.000923,0.000777,0.001516,0.00046,0.00026,0.000641,0.001035,0.000542,0.001119,0.000651,0.000679,0.000496,0.000187,0.000594,0.001083,0.00034,0.001187,0.001273,0.000428,0.00091,0.000509,0.000461,0.000746,0.001141,2.4e-05,0.000166,0.001599,0.000455,0.000902,0.000321,0.001078,0.00084,0.000606,0.000932,0.000551,0.00108,0.00145,0.000925,0.000404,0.000277,0.001014,0.000664,0.001634,0.000312,0.000985,0.000587,0.000494,0.000987,0.001949,0.000977,0.000804,0.000785,0.000963,0.000949,0.000171,0.000861,0.001046,0.001256,0.000475,0.000406,0.000885,0.001256,0.00112,0.001155,0.001107,0.000503,0.000769,0.001223,0.001997,0.00017,0.00104,0.000616,0.000857,0.000267,0.00058,0.000752,0.001163,0.001168,0.000875,0.000259,0.000305,0.000103,0.000731,0.000496,0.000847,0.000132,0.00059,0.001222,0.00016,0.000327,0.000458,0.000887,0.000738,0.000754,0.000592,0.000714,0.001283
0.00045,0.000286,9.4e-05,0.000322,0.000396,0.000499,0.000221,0.000801,0.000526,0.000459,0.000312,0.000207,0.000523,0.000419,0.000526,0.000529,0.000182,0.000233,0.000613,0.000802,5e-05,0.000476,0.000395,0.000541,0.000588,0.000421,0.000519,0.000197,1.7e-05,0.000294,0.000539,0.00042,4e-04,0.000177,0.000285,0.00019,3.9e-05,0.000317,0.000452,0.000329,0.000555,0.000328,0.000542,0.000778,0.000353,0.000488,0.000118,0.000499,0.000259,0.00019,0.000976,6.8e-05,0.000626,0.000124,0.000777,0.000311,0.000807,0.000664,0.000295,0.000484,0.000878,0.000714,0.000121,0.00034,0.00029,0.000549,0.000434,0.000443,0.000484,0.000204,0.000526,0.000669,0.000812,0.000318,0.000336,0.000131,0.000613,0.000449,0.000727,0.000336,0.000432,0.000402,0.000299,4.6e-05,0.000391,0.000793,0.000349,0.000495,0.000542,0.000155,0.000155,0.000927,0.001002,0.000421,0.000174,0.000393,0.000372,0.000502,0.00065,0.000545,0.00044,0.00039,0.000242,0.000303,6.2e-05,0.000119,0.000346,0.000797,0.000606,0.000207,0.000335,0.000615,0.000146,0.000582,0.00017,0.000648,0.000559,0.000431,0.000281,0.000534,0.000651
0.000325,1.2e-05,0.00019,0.000656,0.000709,0.00081,0.000426,0.000836,0.000436,0.000435,0.000134,0.000121,0.000316,0.000497,0.000539,0.000451,0.000242,0.000494,0.000334,0.000819,0.000307,0.000616,0.000226,0.000453,0.000609,0.000509,0.000773,0.000232,0.00017,0.000374,0.000373,0.000276,0.000251,0.000429,0.000706,0.000462,4e-04,0.000331,0.000319,0.000294,0.000633,0.00035,0.000466,0.000639,0.00073,0.000203,0.000119,0.000649,0.000349,0.000186,0.000742,0.000115,0.000359,0.000556,0.00078,0.000237,0.000692,0.000489,0.000116,0.000633,0.000889,0.000413,0.00043,0.000333,0.000268,0.000417,0.000171,0.000588,0.000355,0.000505,0.000631,0.000348,0.000687,0.000196,1.6e-05,0.000125,0.00064,0.000366,0.00088,0.000328,0.000308,0.000252,0.000232,0.000217,0.000306,0.000553,0.000188,0.000225,0.000183,0.000309,0.000257,0.000825,0.000916,0.000539,0.000471,0.000384,0.000283,0.000493,0.000641,0.000619,0.000222,0.000576,0.000415,0.000225,0.000244,0.000294,0.00032,0.000822,0.000721,0.000382,0.000687,0.000435,0.000111,0.000894,0.000504,0.000337,0.000323,0.000748,0.000364,0.000426,0.000718
0.000176,0.000408,0.00038,0.000806,0.000832,0.001086,0.000441,0.001385,0.000922,0.000842,0.000419,0.000458,0.00073,0.00027,0.000838,0.000552,0.000837,0.000421,0.000567,0.000734,0.00013,0.000471,0.000185,0.000715,0.000255,0.000352,0.000811,0.00012,0.000159,0.000382,0.000296,0.000735,8e-04,0.000662,0.000394,0.000138,0.000784,0.000184,0.000615,0.000352,0.000949,0.000522,0.000746,0.000456,0.000824,0.000384,0.000417,0.000623,0.000932,0.000242,0.000931,0.00027,6.8e-05,0.000484,0.000959,0.000344,0.000502,0.000757,0.000661,0.000818,0.000253,0.000888,0.00057,0.000746,0.000525,0.000731,0.000237,0.000838,0.000253,0.000716,3.4e-05,0.000467,0.00073,0.00053,0.000578,0.000434,0.000501,0.000383,0.001311,0.000758,0.000227,0.000862,0.000209,0.000487,0.000513,0.000326,0.000204,9.1e-05,0.000507,8e-05,0.000801,0.001165,0.000541,0.000756,0.001108,0.000553,0.000281,9e-04,0.000906,0.000372,0.000229,0.000446,0.00068,0.001048,0.000221,0.000479,0.000674,0.001293,0.001082,0.00068,0.001213,0.001065,0.000664,0.001086,0.001347,0.001151,0.000529,0.001196,0.001106,0.001185,0.001005
0.000978,0.000264,0.000763,0.001179,0.002713,0.003001,0.001342,0.002182,0.003071,0.00175,8e-05,0.00117,0.000858,0.000667,0.001227,0.000852,0.001229,0.001382,0.000222,0.000651,0.001219,0.001608,0.00066,0.000649,0.001296,0.001224,0.00089,0.000558,0.000609,0.000312,0.000625,0.000202,0.001208,0.001479,0.000967,0.000278,0.000972,0.001563,0.000293,0.000524,0.001339,0.001407,0.001452,0.001489,0.001344,0.000561,0.001145,0.000677,0.000627,0.000921,0.001344,0.001319,0.000927,0.000381,0.001915,0.001999,0.001265,0.000872,0.002143,0.001423,0.001335,0.001201,0.001985,0.00068,0.000175,0.001097,0.000561,0.000971,0.00141,0.001058,0.001195,0.001088,0.000287,0.000669,0.00067,0.000284,0.000211,0.00083,0.001682,0.000264,0.001173,0.001605,0.00119,0.000445,0.000621,0.000651,0.000601,0.000738,0.000592,0.000626,0.001136,0.000511,0.002019,0.000637,0.001515,0.001565,0.000742,0.001316,0.001728,0.001257,0.000626,0.001185,0.001092,0.000218,0.000631,0.000888,0.000654,0.000754,0.000723,0.000721,0.000607,0.00135,0.002296,0.002565,0.002731,0.002311,0.000597,0.001013,0.001624,0.002356,0.002103
0.001762,0.000994,0.001003,0.001609,0.001602,0.003534,0.003955,0.003131,0.004947,0.004485,0.003497,0.002995,0.002476,0.001812,0.002121,0.002406,0.002756,0.001512,0.001377,0.000749,0.001911,0.001354,0.001291,0.000956,0.001072,0.002196,0.002069,0.001995,0.002265,0.001673,0.001158,0.000506,0.001217,0.001394,0.000554,0.000529,0.001034,0.001643,0.001889,0.001823,0.00225,0.002704,0.002682,0.002405,0.001981,0.00148,0.001073,0.000795,0.000965,0.001265,0.002164,0.002135,0.001082,0.00042,0.001394,0.002715,0.001511,0.001258,0.002464,0.00241,0.003013,0.001765,0.001271,0.001861,0.001764,0.000511,0.001254,0.002404,0.003074,0.001713,0.000376,0.00152,0.00137,0.000639,0.000918,0.001272,0.001461,0.00016,0.001364,0.002069,0.002905,0.002334,0.000804,6e-04,0.000833,0.000391,0.00027,0.000601,0.000716,0.000487,0.000431,0.001183,0.002405,0.001886,0.001028,0.000485,0.000139,0.000978,0.00086,0.000105,0.001126,0.000527,0.000411,0.000434,0.000657,0.000438,0.000269,0.00065,0.000107,0.000336,0.000749,0.000941,0.000827,0.000726,0.001383,0.000922,0.00092,0.000365,0.000978,0.000484,0.000616
0.001091,0.000752,0.001356,0.000833,0.001685,0.001313,0.001144,0.000915,0.002999,0.00112,0.000806,0.00087,0.000743,0.001039,0.000904,0.000439,0.000866,0.000116,0.000382,0.000125,0.001021,0.00063,0.000517,0.000215,0.00058,0.001279,0.00017,0.001023,0.001025,0.001484,0.001652,0.001239,0.000299,0.000135,0.000521,0.000403,0.000841,0.000565,0.001212,0.00106,0.000314,0.00124,0.001,0.000973,0.000691,0.000611,0.000551,5.9e-05,0.000413,0.000487,0.000765,0.00059,0.000359,0.000512,0.000626,0.000949,0.000518,0.000663,0.001207,0.000355,0.001306,0.00072,0.001088,0.000205,0.000619,0.000638,0.0011,0.001159,0.001025,0.000566,0.000554,0.000264,0.000833,0.000352,0.000931,0.000594,0.000354,0.000353,0.001166,0.001974,0.000534,0.000638,0.000604,0.000405,0.000476,0.000341,0.00036,0.000434,0.000525,0.000319,0.000216,0.000756,0.000846,0.000372,0.000653,0.000424,0.000581,0.000744,0.000678,9.8e-05,0.000917,0.000346,0.000168,0.000485,5.5e-05,0.000213,0.000215,0.000227,0.000404,0.000216,0.000558,0.000269,0.000663,0.001023,0.000469,0.00029,0.000439,0.000676,0.000406,0.000619,0.000205
8.7e-05,0.000398,0.000522,0.00023,0.00118,0.000667,0.00034,0.000488,0.000936,0.000459,0.00058,0.000486,0.000365,0.000402,3e-04,9.3e-05,0.000335,0.000333,0.000211,0.000208,0.000395,0.000467,0.000274,0.000176,0.000321,0.000619,0.00024,0.000659,0.000363,0.000878,0.000319,0.000133,0.000423,0.000446,0.000557,0.000225,0.000625,0.000677,0.000491,0.000381,0.000424,0.00045,0.001073,0.000384,0.000431,0.000194,0.000324,0.000234,0.000151,0.000331,0.000555,0.000132,0.000524,0.000405,0.000352,0.000631,0.000461,8e-05,0.000544,0.000325,3e-04,0.000343,0.000237,0.000238,0.000385,0.000473,0.000515,0.000857,0.000708,0.000231,0.000386,0.000394,0.000478,0.000124,0.000536,0.000644,0.000414,0.00017,0.00039,0.000619,0.001027,0.000271,0.000249,4.9e-05,0.000315,0.000536,0.000178,0.000222,0.00026,0.000403,0.000279,0.000643,0.00088,0.000631,0.000453,0.000268,0.000129,0.000258,0.000415,0.000468,0.000203,0.000174,3.8e-05,0.000146,0.000161,8.4e-05,0.00027,0.000216,0.000222,0.000129,0.000389,0.000219,0.000136,0.000358,0.00024,0.000161,0.000262,0.000124,0.000231,0.00039,0.000117
0.000247,0.000388,0.000436,0.000288,0.000836,0.000753,0.000325,0.000638,0.000515,0.000307,0.000431,0.000258,0.00036,0.000332,3e-04,0.000132,0.000163,0.000142,0.000386,0.000249,0.000226,7.7e-05,0.000112,0.000177,0.000285,0.000345,0.000272,0.000555,0.000503,3e-04,0.000272,0.000216,0.000254,0.000335,0.000232,0.000173,0.000353,0.000154,0.000456,0.000508,0.000225,0.000162,0.000477,0.000333,7e-05,0.000272,9.6e-05,0.000186,0.000275,0.000209,0.000333,0.000202,0.000225,0.000377,0.00021,0.000417,0.000192,0.000262,0.000386,0.000336,0.000385,0.000297,0.000276,0.000362,0.000533,0.00033,0.000403,0.000472,0.000371,0.000228,0.000288,0.000278,0.000501,0.000124,0.000282,0.000448,0.000264,0.00017,0.000356,0.000268,0.000577,0.000176,7.2e-05,0.000163,0.000398,0.000376,0.000443,0.000143,0.000164,0.000165,1e-04,0.000373,0.000477,0.000202,0.000364,0.000161,2e-05,0.00012,0.000343,0.00041,0.000206,0.000211,0.000198,0.000231,0.000116,0.000132,3.8e-05,0.000211,0.000182,8.1e-05,0.000239,7.1e-05,0.000111,0.000306,0.000126,0.000299,0.000115,0.000298,0.000216,4.5e-05,9e-05
0.000172,0.000156,0.000169,0.000248,0.000652,0.000355,0.000249,0.000489,0.000402,0.000187,0.000137,0.000118,0.00029,0.000213,0.000203,0.000142,0.000234,0.00014,0.000244,0.000242,0.000233,7.3e-05,0.000112,9.7e-05,0.00021,0.000139,0.000239,0.000345,0.000303,0.00018,0.000102,5.1e-05,0.000212,0.000206,0.000182,8.6e-05,0.000138,0.000341,0.000406,0.00015,0.000215,5.3e-05,0.000241,0.000124,9.8e-05,0.000149,0.000149,0.000115,0.00016,0.000175,0.000202,0.000281,0.000309,0.00025,5.3e-05,0.000322,0.000309,0.00018,0.000385,0.000248,0.000346,0.000177,0.000185,0.000174,0.000319,0.000169,0.00032,0.000229,0.00023,9.1e-05,0.000188,0.000279,0.000512,7.7e-05,0.000249,0.000223,0.000322,0.00022,0.000172,0.000263,0.000499,0.000138,0.000184,0.000258,0.000257,0.000216,0.000149,8.3e-05,0.000164,0.000133,0.000103,0.000211,3e-04,0.000337,5.1e-05,9.5e-05,8.1e-05,0.000164,0.000292,0.000264,0.000203,0.00022,0.000201,0.000116,3.1e-05,9.5e-05,9.8e-05,0.000238,0.000183,8.9e-05,0.000196,0.000146,0.000192,0.000261,0.000142,0.000202,7.3e-05,0.00015,0.000291,0.000217,9.9e-05
2e-04,0.000237,0.000203,0.000203,0.000577,0.000276,8.6e-05,0.000369,0.000258,0.000175,0.000219,0.000213,0.000143,0.00022,0.000239,0.000139,0.000265,0.000179,0.000161,0.00022,0.000177,5.2e-05,7.8e-05,7.2e-05,0.000153,0.000253,0.000214,0.000255,0.000185,0.000167,0.00017,0.000136,0.000153,1.5e-05,6e-05,6.7e-05,2.5e-05,9.8e-05,0.00018,0.000213,0.000193,7.7e-05,0.000209,0.000107,0.000115,5.9e-05,0.000161,0.000167,0.000162,0.000125,0.000194,0.000168,0.000209,0.000144,8.1e-05,0.000239,0.000209,7.4e-05,0.000445,0.00019,9.6e-05,0.000194,0.000112,0.000135,0.000236,0.000115,0.00022,7.2e-05,2e-04,8.8e-05,7.9e-05,0.000241,0.000353,8.4e-05,9.5e-05,0.000232,0.000371,0.000198,0.000144,9.5e-05,0.000357,0.000154,0.00019,5.2e-05,0.000212,0.000184,0.000189,3.8e-05,9.5e-05,8.8e-05,3.6e-05,0.000114,0.000184,0.000293,0.000151,0.000195,0.000167,0.000161,0.000213,0.000258,0.000194,0.00018,0.000114,9.9e-05,4.1e-05,0.000161,1.5e-05,0.000205,0.00024,1.7e-05,0.000164,0.000131,0.000101,0.00018,0.000214,0.00019,0.000131,0.00016,0.000234,0.000144,2.8e-05
5.1e-05,8.6e-05,7.8e-05,0.00011,0.000246,0.000198,6.6e-05,0.000215,0.000112,9.6e-05,0.000113,5.2e-05,8.1e-05,4.4e-05,3.4e-05,2.3e-05,7.3e-05,2e-05,0.000135,0.000107,5.3e-05,3.5e-05,3.8e-05,4.6e-05,3.5e-05,0.000169,7.5e-05,0.00018,0.000106,7.9e-05,5.7e-05,1.9e-05,0.000102,2.9e-05,3e-06,3.2e-05,2.2e-05,7.5e-05,5.8e-05,0.000135,0.000107,2.1e-05,0.000119,3.7e-05,7.2e-05,7e-05,7.5e-05,9.4e-05,5.3e-05,3.5e-05,0.000147,8.5e-05,0.000119,6e-05,3.9e-05,7.1e-05,0.000106,3.4e-05,0.000161,7e-05,5.3e-05,0.000101,0.000119,6.9e-05,8.6e-05,2.4e-05,0.000123,6.5e-05,7.2e-05,4e-05,4.9e-05,0.000143,0.000158,3.8e-05,5.9e-05,0.000113,0.000128,9.3e-05,6.3e-05,5.4e-05,0.000178,5.3e-05,5.6e-05,1.3e-05,0.00011,6.8e-05,9.7e-05,7e-05,7.7e-05,3.6e-05,3.3e-05,5e-05,0.000174,0.000176,8.4e-05,3.7e-05,0.000102,6.1e-05,0.000103,0.00012,0.000116,6.2e-05,7.4e-05,4.7e-05,2.3e-05,6.7e-05,3.3e-05,5.7e-05,7.9e-05,2.4e-05,5.7e-05,7.3e-05,3.7e-05,8.7e-05,0.000129,8e-05,6.6e-05,8.6e-05,8.1e-05,4.3e-05,2.8e-05
9.1e-05,4.8e-05,8.7e-05,4.1e-05,0.000214,0.000154,7.1e-05,0.000126,9.4e-05,0.000115,0.000102,3.5e-05,0.000133,6.9e-05,2.9e-05,4.4e-05,7.1e-05,7e-05,0.000103,8.9e-05,1e-04,3.3e-05,3.8e-05,4.2e-05,6.7e-05,0.000129,6.9e-05,0.000144,8.5e-05,5.4e-05,1.3e-05,5.9e-05,4.4e-05,1.9e-05,3.6e-05,2.5e-05,3.9e-05,6.1e-05,0.000104,0.000124,5.5e-05,5.9e-05,9.4e-05,3.1e-05,6.7e-05,3.2e-05,5.3e-05,0.000133,8.6e-05,4e-05,0.000144,4.3e-05,9.8e-05,5.3e-05,3.6e-05,0.000131,0.00017,2.7e-05,0.000164,4.6e-05,4.3e-05,0.000104,6.4e-05,1.6e-05,8.5e-05,2.4e-05,0.000102,5.7e-05,4.6e-05,2.9e-05,5.3e-05,0.000158,0.000119,3.3e-05,7.2e-05,9.1e-05,0.000137,4.8e-05,0.000117,2.9e-05,0.000123,9.6e-05,1e-04,1e-05,9.9e-05,0.000101,0.000121,4.1e-05,4.9e-05,1e-05,3.4e-05,4.5e-05,0.000196,6.5e-05,5.4e-05,4.5e-05,7.1e-05,2.6e-05,9.4e-05,0.000126,8.7e-05,4.8e-05,6.2e-05,7.7e-05,4e-05,4.7e-05,1.3e-05,6.7e-05,0.000102,2.4e-05,6.1e-05,8.6e-05,4.3e-05,6.1e-05,6.4e-05,7.5e-05,5.1e-05,6.7e-05,7.1e-05,4.9e-05,2.4e-05
9.1e-05,6.5e-05,6.9e-05,7.1e-05,0.000184,3.2e-05,7.4e-05,7.8e-05,6.7e-05,1.3e-05,7.9e-05,5.8e-05,7.6e-05,1.9e-05,8.2e-05,0.000109,0.000115,8.5e-05,0.000121,0.000104,8.6e-05,3.5e-05,8.5e-05,5.3e-05,5.4e-05,0.000139,4.8e-05,0.000123,9.6e-05,0.000114,3.9e-05,6e-05,2e-05,5.1e-05,5.9e-05,6.5e-05,2.5e-05,7.2e-05,0.000104,1e-04,4.1e-05,5.5e-05,5.8e-05,2.1e-05,5.7e-05,2.9e-05,0.000106,8.8e-05,6.8e-05,1e-04,0.000113,2.7e-05,0.000105,8.8e-05,5.9e-05,0.000105,0.000135,2.3e-05,0.000156,5.3e-05,0.000108,7e-05,7.5e-05,2.3e-05,8.7e-05,4e-06,0.000103,7.1e-05,4.6e-05,3.8e-05,7.4e-05,0.000127,5.6e-05,8.3e-05,6.3e-05,9.3e-05,8.6e-05,3.8e-05,6.1e-05,3.9e-05,0.000126,6.2e-05,8.5e-05,1.7e-05,8.5e-05,0.000132,9.9e-05,7e-05,5.9e-05,6e-05,4.8e-05,2.3e-05,0.000214,0.000107,6.1e-05,3.2e-05,4.9e-05,3.8e-05,9.6e-05,0.000126,0.000116,4.9e-05,7.3e-05,6.2e-05,2.8e-05,3.2e-05,2.6e-05,6.9e-05,0.000129,2.4e-05,5.8e-05,5.4e-05,3.5e-05,7e-05,5.4e-05,0.000107,4.6e-05,4.3e-05,6e-05,2.8e-05,6e-05
0.000179,1e-04,9.1e-05,0.000181,0.00019,0.000119,0.000147,0.000107,0.000203,0.000118,0.000103,5.6e-05,2.3e-05,6.2e-05,0.000117,5.2e-05,8e-05,0.000104,6.4e-05,8.5e-05,0.000116,9e-06,8.3e-05,6.2e-05,6.7e-05,0.000132,0.000148,0.000103,4.1e-05,8.4e-05,8.8e-05,8.4e-05,0.000157,0.000127,0.000166,9.8e-05,6.8e-05,3.6e-05,2.3e-05,0.000115,6.4e-05,7.5e-05,8.1e-05,0.000152,0.000156,3.2e-05,0.00011,0.000189,9.6e-05,0.000149,0.000209,1.9e-05,3e-05,0.000115,3.3e-05,0.000105,2.3e-05,0.000102,0.000128,8.1e-05,0.000105,0.000156,0.000166,0.000167,0.000118,5.2e-05,8e-05,7.3e-05,6.2e-05,1.7e-05,5.8e-05,0.000101,2e-04,0.000189,0.000142,0.000203,0.000225,0.000236,8.3e-05,7e-05,0.00018,4.4e-05,5.7e-05,0.000166,6.2e-05,8.6e-05,0.000137,0.000113,0.000131,6.6e-05,4.4e-05,7.4e-05,0.000109,0.000165,8.4e-05,0.000105,0.000194,0.000115,0.000198,0.000144,0.000144,0.000109,0.000161,0.000215,5.8e-05,5.1e-05,3.1e-05,0.000112,0.000141,5.6e-05,8.3e-05,0.000173,8.3e-05,0.00011,3.1e-05,7.1e-05,3.3e-05,4.9e-05,9.3e-05,0.000109,6.1e-05
0.000146,0.000138,8.3e-05,0.000138,0.000255,0.000109,8.9e-05,0.000118,6.1e-05,6.9e-05,9.5e-05,6.9e-05,0.000104,6.6e-05,8.4e-05,0.000102,4.2e-05,8.5e-05,4.1e-05,0.000125,0.000138,2.5e-05,8.4e-05,7.3e-05,6.4e-05,1.8e-05,9e-05,0.000107,5.5e-05,8.3e-05,7.9e-05,3.1e-05,0.000107,5.5e-05,5.8e-05,2.6e-05,0.000111,7.4e-05,5.7e-05,0.000209,7.6e-05,7.4e-05,0.000132,0.000142,5.4e-05,0.00011,8e-05,9.8e-05,0.000123,6.3e-05,0.000189,0.000203,7.6e-05,5.7e-05,5.4e-05,0.000111,0.00013,1.8e-05,6.4e-05,5.8e-05,5.7e-05,0.000123,5e-05,6.1e-05,7.8e-05,3.4e-05,3.6e-05,0.000108,0.000125,1.2e-05,4e-05,5.8e-05,0.000267,1.3e-05,0.000101,0.000128,0.000262,9.8e-05,0.000122,0.000154,1.2e-05,7.8e-05,6.8e-05,0.000114,0.000197,0.000189,0.000115,0.000102,2.3e-05,0.000136,0.000122,0.000168,0.000186,0.000175,0.000153,8.7e-05,6.2e-05,7.6e-05,0.000225,0.000108,8.5e-05,0.000242,0.000168,7.2e-05,0.000109,0.00016,0.000144,0.000133,6e-05,0.000115,3.9e-05,6.5e-05,8.7e-05,0.000158,0.00013,0.000133,0.000103,9.4e-05,4.7e-05,0.000167,0.000192
7.3e-05,4.4e-05,4e-05,0.000134,0.000148,4.1e-05,7.8e-05,8.4e-05,5.8e-05,5.6e-05,8e-05,3.7e-05,9.8e-05,7e-05,4.4e-05,9.3e-05,2.7e-05,7.5e-05,6.6e-05,0.000132,5.1e-05,4.6e-05,9.6e-05,3.2e-05,7.5e-05,9.6e-05,8.7e-05,0.000115,2.4e-05,5.9e-05,4.6e-05,5e-06,6.9e-05,6.9e-05,7e-05,2.4e-05,7.3e-05,5.4e-05,3e-06,0.000146,3.3e-05,9.3e-05,0.000177,3.5e-05,7.2e-05,0.000123,7.1e-05,0.000176,8.7e-05,7.8e-05,7.9e-05,5.7e-05,8.2e-05,3e-05,1.1e-05,5.4e-05,0.000171,1.5e-05,0.000116,8.3e-05,8.6e-05,6.8e-05,5.8e-05,4.4e-05,0.000127,5.6e-05,9.3e-05,7.6e-05,2.2e-05,6e-05,5.6e-05,0.00012,0.000207,6.6e-05,5.6e-05,6.2e-05,0.000161,5.8e-05,3.7e-05,0.000137,0.000132,0.000111,4.8e-05,8.9e-05,0.000109,9e-05,2.2e-05,4.8e-05,7.2e-05,0.000133,3.6e-05,7.2e-05,0.000152,0.000184,0.000105,0.000111,8.3e-05,6.3e-05,0.000122,0.000117,6.4e-05,0.000201,7e-05,4.5e-05,4e-05,8.2e-05,8e-05,3.5e-05,4.3e-05,4.9e-05,7.7e-05,2.1e-05,9.4e-05,0.000132,9.3e-05,6.2e-05,7.1e-05,0.000157,9.7e-05,0.000104,0.000129
6e-05,3.7e-05,0.000101,0.000126,0.000158,6e-05,0.000115,0.000148,8e-05,1e-04,3.7e-05,1.9e-05,0.000139,0.000131,2.5e-05,4.1e-05,9.3e-05,0.000117,8.2e-05,0.00016,0.000102,8.2e-05,4.5e-05,3.3e-05,0.000118,4.5e-05,3.6e-05,0.00012,2e-05,9.3e-05,8.1e-05,6.8e-05,3.7e-05,6.7e-05,7.3e-05,8.5e-05,8.6e-05,0.000106,4e-05,0.000156,8.2e-05,6.1e-05,9.4e-05,6.3e-05,7.6e-05,5.8e-05,7e-05,0.00021,0.000111,4.1e-05,5.9e-05,0.000126,0.000121,0.000103,3.9e-05,8.5e-05,2.1e-05,0.000128,4.1e-05,9.7e-05,4.7e-05,0.000104,0.000106,3.3e-05,9.8e-05,2.2e-05,0.000135,8.5e-05,5.1e-05,7.2e-05,4.5e-05,0.000104,0.000177,6.6e-05,3.6e-05,3e-05,0.00019,9.9e-05,0.000102,9.3e-05,0.000153,7.4e-05,3.6e-05,5e-05,3.7e-05,3.2e-05,3.4e-05,0.000126,9e-05,6.5e-05,0.000102,0.000118,0.000123,0.000124,0.000117,0.000137,6.1e-05,4.8e-05,7.7e-05,0.000163,2.5e-05,0.000112,3.9e-05,7.4e-05,5.1e-05,5.7e-05,3.6e-05,0.000132,4.5e-05,3.2e-05,9e-05,8.3e-05,0.000151,8.4e-05,0.000129,9.5e-05,5.6e-05,2.1e-05,6e-05,5.7e-05,8.9e-05
0.000181,0.000108,9.7e-05,8.2e-05,0.000176,4.9e-05,4.7e-05,7.1e-05,0.000108,0.000146,0.000145,5.7e-05,0.000176,0.000126,9.1e-05,4.6e-05,0.000113,2.3e-05,0.000116,0.000126,5.3e-05,0.00011,0.000152,0.000121,9.3e-05,0.000105,4.5e-05,0.000179,0.000166,0.000147,3.8e-05,7.1e-05,0.000123,9.7e-05,2.1e-05,0.000105,7.8e-05,0.000131,0.000107,0.000128,3.5e-05,7.7e-05,0.000139,6.3e-05,7.7e-05,3.1e-05,7.3e-05,6.5e-05,3.3e-05,6.8e-05,2.3e-05,9.9e-05,6.9e-05,6.3e-05,4.5e-05,0.000179,0.000151,0.000132,0.000195,6.5e-05,7.9e-05,1e-06,7.2e-05,3.4e-05,4.4e-05,9.6e-05,0.00011,0.000106,0.000103,0.000125,3.8e-05,9e-05,0.00026,6.7e-05,6.5e-05,3.9e-05,0.000188,1.7e-05,0.000145,0.000138,0.000244,0.00012,4.5e-05,7.3e-05,6.7e-05,0.000157,5.7e-05,0.000214,0.00012,0.000125,5.5e-05,8.2e-05,4.9e-05,7.1e-05,0.000182,4.3e-05,6.7e-05,8.2e-05,9.2e-05,0.000169,0.000117,6.2e-05,7.9e-05,8.2e-05,5.6e-05,2.2e-05,4.7e-05,0.000223,0.000101,2.5e-05,0.000115,0.00018,9.8e-05,0.000114,5.9e-05,4.2e-05,0.000151,0.000202,0.000118,8.1e-05,0.00011
6.4e-05,6e-05,0.000102,3.9e-05,0.00015,0.000119,0.00012,1.5e-05,4.4e-05,8.5e-05,0.000109,8.3e-05,0.000155,0.000225,0.000157,8.6e-05,0.000181,0.000164,0.00017,7.7e-05,6.7e-05,6.2e-05,6.6e-05,4.6e-05,0.00018,8.1e-05,2.8e-05,0.000162,0.000103,3.3e-05,0.00012,6.9e-05,7.6e-05,3.7e-05,4e-05,0.000103,0.00014,8.3e-05,0.000197,0.000266,0.000187,8.9e-05,6.2e-05,9.3e-05,5.5e-05,7.4e-05,7.4e-05,5.6e-05,9.4e-05,6.1e-05,0.00013,0.000189,0.000233,0.000105,6.5e-05,0.000169,9.7e-05,5.4e-05,0.000102,1.4e-05,0.000131,0.000119,5.7e-05,6.7e-05,4.8e-05,0.000108,0.000118,5.9e-05,7.9e-05,9.1e-05,9e-05,0.000173,0.000239,3.1e-05,0.000113,5.2e-05,0.000162,0.00011,0.000129,9e-05,0.000121,4.5e-05,0.000114,6.6e-05,0.000123,0.000125,0.000124,8.7e-05,1e-05,9.7e-05,9.8e-05,4.1e-05,0.00016,5.5e-05,0.000189,0.000176,2.2e-05,6.7e-05,0.000174,0.000226,7.1e-05,2.2e-05,3.4e-05,3.5e-05,3.2e-05,5.3e-05,7.5e-05,0.000141,9.4e-05,4.4e-05,0.000132,6.7e-05,5.9e-05,9.7e-05,0.000134,0.000149,0.000177,4.4e-05,7.6e-05,6.8e-05,3e-05
5e-05,6e-06,6.9e-05,7.6e-05,5.3e-05,0.000128,4.5e-05,3.6e-05,7.9e-05,6.4e-05,0.000151,0.000117,0.000115,0.000138,6.4e-05,2.9e-05,0.00016,7.4e-05,6e-06,0.000134,0.000129,9.4e-05,4.1e-05,2.3e-05,0.000142,0.00012,6.7e-05,0.000125,1.3e-05,5.8e-05,4.1e-05,4.4e-05,0.000111,5e-05,5e-05,0.000116,5.1e-05,8.7e-05,0.00016,3.7e-05,5.5e-05,5.2e-05,2.9e-05,4.5e-05,9.2e-05,7.5e-05,5.2e-05,4.1e-05,7.5e-05,5.6e-05,0.000145,7.8e-05,8.8e-05,0.000115,5.3e-05,0.000111,0.000108,3.9e-05,2.6e-05,8.6e-05,6.1e-05,7.9e-05,2.1e-05,6.4e-05,4.2e-05,4.8e-05,4.8e-05,2.8e-05,9e-06,5.7e-05,6.9e-05,0.000105,0.000157,3e-05,7.5e-05,2.4e-05,6.2e-05,7e-06,1.8e-05,1.9e-05,8.1e-05,2.2e-05,1.8e-05,9e-06,0.000102,0.000105,8.7e-05,2.1e-05,3.9e-05,6.7e-05,3.9e-05,1.8e-05,8.8e-05,0.000168,7.3e-05,4.6e-05,0.000142,7.1e-05,9.5e-05,0.000136,4.7e-05,3.9e-05,5.9e-05,9.8e-05,1.4e-05,5.1e-05,7.1e-05,0.00012,9.6e-05,7.6e-05,9.8e-05,7.9e-05,8.6e-05,7.1e-05,3e-05,2.6e-05,0.000198,0.000128,4.3e-05,7.6e-05,6.2e-05
5e-06,4.1e-05,3e-05,3.6e-05,0.000184,7.4e-05,6.2e-05,6.2e-05,5.4e-05,4.2e-05,8.1e-05,5.8e-05,6.3e-05,0.000109,6.8e-05,9.2e-05,5.7e-05,4.7e-05,0.000138,0.000116,0.00012,0.000101,2.7e-05,2.6e-05,4.1e-05,7.7e-05,2.8e-05,8.5e-05,2e-05,2e-06,3e-05,2.6e-05,0.000113,7.4e-05,4.7e-05,3.9e-05,7.2e-05,2.9e-05,4.6e-05,6e-05,8.2e-05,8.8e-05,0.000138,6e-05,3.8e-05,6.8e-05,7.4e-05,2.4e-05,8.5e-05,4.8e-05,8.2e-05,4.3e-05,0.000135,6.3e-05,2.8e-05,0.000117,6.8e-05,5.3e-05,6.9e-05,9.3e-05,7.2e-05,0.000115,6.3e-05,1.2e-05,8.2e-05,2.7e-05,7.6e-05,2.4e-05,7.1e-05,2.5e-05,6.6e-05,0.000134,0.000189,2.4e-05,7.4e-05,2.5e-05,0.000116,2.4e-05,1.7e-05,4.5e-05,0.000145,7.1e-05,2.1e-05,3.6e-05,2.7e-05,9.4e-05,7.8e-05,4.3e-05,5.2e-05,2.6e-05,3.5e-05,4.8e-05,0.000111,0.000131,6.6e-05,6.6e-05,7.3e-05,4.2e-05,8e-05,5.7e-05,2.6e-05,1.4e-05,5.3e-05,4.4e-05,9e-06,5.5e-05,4.8e-05,5e-05,8.3e-05,3.4e-05,5.6e-05,2.3e-05,7.2e-05,9.1e-05,6.9e-05,3.6e-05,4.4e-05,4e-05,6.7e-05,3.2e-05,5.5e-05
1.9e-05,5.3e-05,3e-05,8.9e-05,0.000162,3e-06,5.1e-05,8e-05,3.8e-05,6e-05,1.7e-05,2.2e-05,2.9e-05,4.7e-05,0.000103,0.000114,8.6e-05,4.1e-05,0.000113,6.6e-05,6.6e-05,2.8e-05,2.8e-05,3.9e-05,6.9e-05,8.4e-05,1.8e-05,5.5e-05,5.7e-05,6.8e-05,0.000107,0.000104,5.6e-05,6.4e-05,4.6e-05,7.8e-05,4.3e-05,4.5e-05,4.2e-05,5.1e-05,9e-05,0.000126,8.3e-05,3.7e-05,0.000117,0.00011,0.00013,0.000104,8.2e-05,9.4e-05,0.000109,5.5e-05,0.00014,5.2e-05,6.1e-05,9.5e-05,5.6e-05,2.3e-05,0.000148,0.000109,6.7e-05,9.6e-05,4.1e-05,4.6e-05,9.5e-05,0.00012,4.8e-05,4.2e-05,0.000106,8.2e-05,2.1e-05,9.9e-05,0.000141,9.4e-05,1.3e-05,1.6e-05,0.000161,4.5e-05,4.1e-05,6.4e-05,1e-04,5.1e-05,4.5e-05,8.5e-05,4.5e-05,6.9e-05,2.5e-05,8.4e-05,2.2e-05,3e-05,2.4e-05,4.6e-05,0.00013,0.000108,0.000104,0.000122,7.4e-05,4.6e-05,9.9e-05,0.000121,7.6e-05,6.9e-05,3.2e-05,0.000107,9.5e-05,5.9e-05,5.7e-05,7.7e-05,7.3e-05,3.8e-05,2.8e-05,3e-05,8.5e-05,8.7e-05,8.1e-05,4.6e-05,8.3e-05,8.8e-05,8.5e-05,3e-05,3.7e-05
1.5e-05,1.5e-05,7.2e-05,9.7e-05,0.000131,6.4e-05,1.7e-05,9.1e-05,7.2e-05,9e-05,6.5e-05,6.5e-05,2.4e-05,6.9e-05,9e-05,5.2e-05,0.000113,1.8e-05,0.000141,0.000127,8.4e-05,0.000103,2.2e-05,0.000126,5.7e-05,8e-05,7.1e-05,0.000131,8.8e-05,0.000119,5.8e-05,3.9e-05,9.1e-05,8e-05,2.3e-05,8.5e-05,5.6e-05,5.1e-05,1.6e-05,6.6e-05,0.00017,9e-05,0.000114,3.4e-05,7.3e-05,9.3e-05,4.9e-05,8.6e-05,0.000133,0.00011,2.2e-05,2.9e-05,0.000144,3e-06,7.7e-05,0.000108,0.000131,4.6e-05,9.9e-05,8.9e-05,0.000109,2.5e-05,5.3e-05,1.5e-05,0.000148,0.000135,0.000137,4.1e-05,8.9e-05,7e-05,0.000102,5.8e-05,0.000161,0.000113,5.3e-05,6.3e-05,0.000109,6.9e-05,4.9e-05,5.7e-05,0.000134,0.000158,3.3e-05,4.4e-05,3.4e-05,0.000164,8.4e-05,8.9e-05,5.4e-05,5e-06,6e-05,4.5e-05,5.3e-05,8.6e-05,0.000122,0.000129,3.5e-05,8.1e-05,0.000187,2.1e-05,0.000124,4.1e-05,0.000109,0.000108,0.00014,1.7e-05,5.9e-05,9.6e-05,5.8e-05,6e-05,6.1e-05,5e-05,9.1e-05,7.8e-05,9.1e-05,3.5e-05,7.3e-05,3.9e-05,7.1e-05,1.6e-05,6.1e-05
6.2e-05,3.4e-05,0.000148,0.000128,0.00021,0.000147,0.000222,5.9e-05,0.000164,0.00028,0.000231,0.000197,9.2e-05,7.5e-05,7.4e-05,0.000117,0.000211,9.8e-05,0.000244,0.000217,0.000203,0.000277,2e-04,0.000297,0.000235,0.000105,0.000119,5.9e-05,0.000128,0.000261,0.000247,0.000163,6.9e-05,0.000108,9.2e-05,8.3e-05,5.5e-05,0.000162,0.000126,0.00014,0.000142,0.000228,0.000119,7.8e-05,9.5e-05,0.000162,0.000249,9.1e-05,0.000228,0.000153,7.6e-05,0.000114,0.000136,0.000178,0.000102,0.000119,0.00013,0.000113,0.000126,0.000134,0.000119,0.000163,0.000157,1.2e-05,0.000183,0.000349,0.000116,9.6e-05,8.4e-05,2.6e-05,0.000113,8.2e-05,0.000164,8.5e-05,0.000157,0.000191,0.000239,9.7e-05,8.5e-05,7.7e-05,0.000163,0.000149,0.000146,9e-05,9.2e-05,0.000301,0.000309,0.000158,0.000147,8.3e-05,0.000141,0.000129,0.000173,6.2e-05,0.000345,0.000352,0.000178,0.000178,5.3e-05,3.4e-05,4.1e-05,0.000168,3.5e-05,0.000173,0.000332,0.000271,0.000262,0.000238,0.000166,0.000198,0.000163,0.000111,0.000144,0.000105,9.9e-05,9.8e-05,3.1e-05,7.2e-05,3.8e-05,7.1e-05,8.1e-05
8.3e-05,9.2e-05,0.00011,0.000104,0.000135,0.00025,0.000264,0.000222,9.4e-05,0.000264,0.000183,0.000168,0.000164,0.000125,0.00015,0.000241,0.000167,0.000252,0.000105,0.00024,0.000145,0.000178,0.000123,0.000177,0.000108,0.000141,4e-05,8.2e-05,0.000176,0.000267,0.000184,8.5e-05,0.000114,8e-05,0.000119,0.00015,2.2e-05,0.000192,0.000261,5.5e-05,0.000147,0.000167,0.000161,0.000145,8.7e-05,0.000181,0.000274,0.000286,0.000194,0.000333,0.000232,0.000172,9.4e-05,0.000153,0.000124,0.000105,0.000244,0.000189,6.2e-05,0.000104,0.000156,8.9e-05,0.000213,0.000274,0.000295,0.000417,0.000332,9.8e-05,6.9e-05,5e-05,7e-05,7.8e-05,0.00024,0.000102,0.000193,3.8e-05,0.000185,0.000251,0.000217,3.3e-05,7.3e-05,0.000262,0.000176,0.000223,0.00036,0.000391,0.000134,5.1e-05,0.000166,4.6e-05,0.000153,0.000236,0.000324,0.00018,0.000412,0.000299,0.00022,0.000109,0.000108,0.000122,1.9e-05,0.000168,0.000201,0.000234,0.00043,0.000226,0.000119,0.000347,0.000181,0.000119,0.000248,0.000308,0.000347,0.000303,0.000228,0.000249,0.000258,0.000183,2.7e-05,0.000101,0.000204
1.7e-05,1e-05,8.3e-05,0.000115,0.000103,0.000233,5.1e-05,9.6e-05,8.6e-05,8.2e-05,3.9e-05,7.7e-05,5.2e-05,6e-05,0.000171,0.000236,0.000122,0.000198,0.00026,0.000236,0.000214,9.9e-05,7.1e-05,0.000135,0.000108,0.000126,0.000103,4.1e-05,0.000118,0.000197,4.1e-05,5.9e-05,4.9e-05,9.3e-05,7.6e-05,0.000114,0.000142,0.000239,0.000129,8.2e-05,0.000146,0.000117,0.000122,0.000101,0.000181,8.2e-05,0.000144,0.000124,6.9e-05,0.000166,0.00024,0.000121,7.5e-05,5.7e-05,1e-05,0.000147,0.000122,4.7e-05,2.1e-05,0.000131,0.000152,0.000203,5.3e-05,0.000149,5.7e-05,0.000221,1.9e-05,0.000125,5e-05,7.7e-05,8.2e-05,9.9e-05,0.000141,9.7e-05,0.000165,0.000135,8.6e-05,0.000129,0.000111,0.000132,8.5e-05,0.000138,0.000121,0.000181,0.000207,0.000123,7.2e-05,6.7e-05,0.000126,9.5e-05,9.4e-05,8.3e-05,0.000232,0.000237,8.2e-05,0.000114,0.000105,4.3e-05,9.6e-05,0.000147,8.7e-05,0.000141,0.000126,3.6e-05,0.000181,0.000133,0.00016,6.7e-05,0.000121,0.000151,5.6e-05,1e-04,0.000205,8.7e-05,0.00013,0.000129,5.2e-05,3.1e-05,1.6e-05,8.3e-05,0.000149
4.5e-05,5.1e-05,1.5e-05,6e-05,0.00011,0.000172,8.2e-05,8.8e-05,8.7e-05,7.1e-05,3.1e-05,3.9e-05,3.1e-05,1e-04,0.000123,3.3e-05,1.6e-05,0.000107,9.1e-05,8.1e-05,8.6e-05,3.7e-05,3.5e-05,4.8e-05,4.9e-05,1.7e-05,5.2e-05,9.8e-05,8.1e-05,7.1e-05,4.8e-05,2.2e-05,3.5e-05,4.6e-05,8.5e-05,4e-06,7.6e-05,7.2e-05,1.6e-05,6.3e-05,0.000116,8.2e-05,7.1e-05,6.9e-05,5.6e-05,5.8e-05,5.8e-05,0.000178,0.000107,3.7e-05,0.000131,7.3e-05,4.3e-05,4.7e-05,4.3e-05,0.000108,9.4e-05,5e-05,8.4e-05,3e-05,4.8e-05,5.7e-05,3.5e-05,0.000134,7.1e-05,2.7e-05,7.5e-05,7.5e-05,7.3e-05,3.6e-05,2.8e-05,4.2e-05,0.000112,8.6e-05,6.8e-05,4.7e-05,7.1e-05,6.7e-05,4.9e-05,1.5e-05,4.6e-05,1.5e-05,0.00011,2.8e-05,0.000198,5.5e-05,3.2e-05,2.2e-05,6.6e-05,3.6e-05,5.9e-05,4e-05,0.000184,0.000143,2.7e-05,4.5e-05,1.4e-05,1.8e-05,9.5e-05,7.2e-05,4.9e-05,5.9e-05,4.6e-05,2.8e-05,6.2e-05,9.5e-05,4.6e-05,3.5e-05,5.4e-05,5.6e-05,2.8e-05,9.9e-05,9.2e-05,6.5e-05,6.9e-05,4.6e-05,6.3e-05,6.7e-05,0.000112,0.000147,1.6e-05
3.8e-05,3e-05,1.7e-05,4.1e-05,0.000105,0.00016,3.2e-05,5.4e-05,4.1e-05,4.4e-05,2.8e-05,5e-06,4.6e-05,5.9e-05,7.3e-05,4.7e-05,2.5e-05,3.9e-05,3e-05,7.2e-05,9.4e-05,3.5e-05,4e-05,1.3e-05,2e-05,2.3e-05,2.4e-05,0.000103,5.5e-05,5.4e-05,1.3e-05,1.6e-05,3.9e-05,9e-06,5.2e-05,1.8e-05,4.2e-05,2.9e-05,3.5e-05,5.3e-05,5.3e-05,2.3e-05,8.1e-05,2e-05,1e-05,2.7e-05,1.5e-05,0.000105,4.6e-05,3.4e-05,0.000111,3.7e-05,2.4e-05,1.6e-05,4.2e-05,9.3e-05,5.4e-05,3.7e-05,0.000101,2.7e-05,6e-06,6.9e-05,1e-05,6.1e-05,4.7e-05,4e-05,8.5e-05,4e-05,4.1e-05,3.9e-05,4.5e-05,7.9e-05,0.000121,4.7e-05,6.9e-05,5e-05,7.2e-05,3.6e-05,3.5e-05,3.1e-05,4.7e-05,4.1e-05,0.000107,6.5e-05,0.000163,5.9e-05,2.8e-05,2.1e-05,5.1e-05,3.7e-05,3.7e-05,3.4e-05,0.000121,0.000155,1.8e-05,7e-06,2.2e-05,1e-05,5.9e-05,7.3e-05,1.8e-05,8.3e-05,3.4e-05,2.6e-05,7.5e-05,5.7e-05,4.7e-05,3.4e-05,4.6e-05,3.5e-05,2.3e-05,9.6e-05,5.1e-05,4.9e-05,6e-05,5.8e-05,5.5e-05,7.9e-05,8.7e-05,6.4e-05,2.8e-05
2.9e-05,1.6e-05,1.2e-05,5.3e-05,0.000112,0.000133,1.5e-05,5.3e-05,3.5e-05,1.5e-05,4e-06,7e-06,2.6e-05,7.2e-05,5e-05,3.6e-05,1e-06,4.3e-05,1e-05,6.8e-05,8.2e-05,3.5e-05,5.4e-05,7e-06,2e-05,4.4e-05,2.4e-05,8.1e-05,5e-05,4e-05,3e-06,8e-06,3.9e-05,1.3e-05,3.8e-05,2.2e-05,5.2e-05,3.2e-05,1.9e-05,4.6e-05,3.7e-05,2.2e-05,5.8e-05,1.4e-05,3e-06,1.6e-05,8e-06,0.000103,3.3e-05,2.4e-05,0.000103,3.9e-05,2.1e-05,5e-06,2.5e-05,0.00011,5.7e-05,2.2e-05,9.7e-05,1.3e-05,1.3e-05,7e-05,8e-06,5.1e-05,2.1e-05,3.3e-05,7.4e-05,1.9e-05,1.8e-05,4e-06,5e-06,7.2e-05,0.000126,3.9e-05,7.3e-05,5.2e-05,8.7e-05,3.6e-05,2.5e-05,2.1e-05,6.9e-05,4.6e-05,8.8e-05,4.9e-05,0.000137,4.3e-05,4.7e-05,1.3e-05,4e-05,3.2e-05,3e-05,2.5e-05,0.000123,0.000132,1.1e-05,1.4e-05,2.3e-05,2.8e-05,7.7e-05,6.8e-05,1.5e-05,5.2e-05,3.9e-05,1.9e-05,5.4e-05,5.3e-05,3.9e-05,2.5e-05,4.2e-05,3.6e-05,1e-05,9e-05,2.8e-05,7e-05,3.8e-05,4.6e-05,4.1e-05,6.4e-05,7.6e-05,6.5e-05,2.7e-05
3.8e-05,2.5e-05,8e-06,5.7e-05,0.000107,0.000117,2.1e-05,5.1e-05,2.7e-05,2.6e-05,7e-06,6e-06,1.7e-05,6.7e-05,4.4e-05,2.1e-05,1.3e-05,4.3e-05,1.5e-05,6.3e-05,8.4e-05,2.7e-05,4.8e-05,3e-06,1.7e-05,5.2e-05,2.1e-05,8.4e-05,3.8e-05,3.4e-05,2e-06,5e-06,4e-05,9e-06,3.1e-05,1.4e-05,3.9e-05,2.4e-05,2.8e-05,5.1e-05,2.9e-05,1.2e-05,6.1e-05,8e-06,7e-06,2.5e-05,8e-06,0.000102,2.9e-05,2.2e-05,9.5e-05,3.3e-05,3e-05,7e-06,3.2e-05,0.000101,6.3e-05,3e-05,9.6e-05,6e-06,9e-06,6.8e-05,5e-06,4.7e-05,1.6e-05,1.6e-05,7.8e-05,1e-05,2.3e-05,5e-06,7e-06,6.7e-05,0.000132,4.3e-05,6.7e-05,4.6e-05,8.3e-05,2.8e-05,1.6e-05,1.9e-05,6.6e-05,4.6e-05,7.9e-05,4.4e-05,0.000129,5.2e-05,3.5e-05,5e-06,4.1e-05,3.3e-05,2.4e-05,2e-05,0.000127,0.000123,8e-06,7e-06,1.3e-05,2.8e-05,7.3e-05,5.9e-05,2.4e-05,5.4e-05,3.4e-05,7e-06,5.4e-05,4.4e-05,3.5e-05,2.4e-05,4.5e-05,2.5e-05,1.6e-05,8e-05,5.3e-05,6.5e-05,4.2e-05,4.1e-05,3.9e-05,5.9e-05,6.8e-05,5.4e-05,2.3e-05
