9e-06,1.8e-05,4.8e-05,4e-06,0.000174,6.4e-05,4.7e-05,4.8e-05,6.2e-05,1e-05,0.000108,7e-05,1.8e-05,2e-05,7.4e-05,5.1e-05,3.4e-05,8.8e-05,2e-05,1.1e-05,3e-05,0.000103,1e-06,5.5e-05,1.9e-05,1.9e-05,1.3e-05,3.7e-05,2.8e-05,3.3e-05,1.8e-05,0.000105,8.4e-05,7e-06,8.2e-05,1e-06,5e-06,0.000103,0.000171,2.1e-05,3.4e-05,1e-05,9.6e-05,1.2e-05,3.5e-05,5.4e-05,4.8e-05,1.4e-05,9.9e-05,8.6e-05,4e-06,6e-06,5.5e-05,6.9e-05,0.00013,2.8e-05,3.4e-05,2.4e-05,1.2e-05,5e-06,6.6e-05,5.1e-05,8e-06,2.3e-05,2e-06,5e-06,1e-05,1.3e-05,4.9e-05,1.1e-05,3.1e-05,5e-05,0,3.5e-05,1.9e-05,6.1e-05,2.1e-05,8.9e-05,7e-06,5.8e-05,3.1e-05,3.1e-05,4e-06,3.3e-05,6.3e-05,4.7e-05,3.9e-05,9e-06,2.5e-05,3e-06,6e-05,3.3e-05,4.2e-05,1.8e-05,2.3e-05,3.6e-05,2e-06,4.5e-05,2.8e-05,2.1e-05,3e-06,3e-05,3.3e-05,4e-05,9e-06,4.1e-05,6e-06,3.1e-05,3.5e-05,5.1e-05,1.1e-05,2.5e-05,0,3.3e-05,2.8e-05,2.2e-05,0,1.7e-05,1.6e-05,2.5e-05,1.8e-05
1.4e-05,8.7e-05,6.2e-05,1.9e-05,0.000326,0.000251,7.7e-05,0.000168,0.000146,2.7e-05,0.00028,0.000187,9.4e-05,8.7e-05,0.000167,0.000102,6.3e-05,0.000272,0.000115,5.6e-05,7.1e-05,0.000197,6e-05,4.5e-05,4.2e-05,3e-06,5.4e-05,4.5e-05,8.2e-05,0.000104,9.5e-05,0.000177,0.000247,7.3e-05,0.000166,0.000107,4.5e-05,0.000194,0.000261,0.000115,6.6e-05,4.3e-05,0.000232,7e-06,5.7e-05,0.000178,0.000137,8.6e-05,0.000228,0.000192,4.8e-05,5.6e-05,0.000108,0.000186,0.000349,0.000109,5.5e-05,8.3e-05,5.5e-05,3e-05,7.4e-05,5e-05,8e-05,3.4e-05,6.3e-05,6.6e-05,6e-05,7.6e-05,0.000153,4.5e-05,6.4e-05,0.000101,6.3e-05,0.000124,6.5e-05,0.000176,9.7e-05,0.000232,4e-05,0.000176,2.7e-05,8.2e-05,2.8e-05,2.6e-05,0.000139,9.7e-05,0.000105,2.3e-05,7.6e-05,5.3e-05,0.000121,6.3e-05,0.000154,5.3e-05,0.000107,0.000119,7.3e-05,6.5e-05,7.8e-05,3.2e-05,2.7e-05,5.7e-05,6.8e-05,9.2e-05,4.3e-05,0.000163,3.2e-05,6e-06,0.000119,0.00013,2.2e-05,4.8e-05,1.3e-05,7.9e-05,4.8e-05,5.5e-05,1.9e-05,4.6e-05,3.8e-05,3.9e-05,0.00012
0.000137,0.000145,6.7e-05,0.000176,0.000398,0.000502,0.000241,0.000428,0.000262,0.000127,0.000433,0.00019,0.000317,2.1e-05,0.000329,0.000244,4.5e-05,0.000335,6.2e-05,0.000256,0.000199,6.3e-05,0.000264,6.4e-05,4.6e-05,4.8e-05,0.000326,0.000217,0.000163,0.000307,5.5e-05,0.000348,0.000362,9e-05,0.000255,0.000227,0.000295,0.000365,0.000441,8.2e-05,0.000191,0.000157,0.000328,0.000174,0.000191,0.000253,0.000308,8.9e-05,0.000416,6.4e-05,0.000124,6.2e-05,9.4e-05,0.000169,0.000321,0.000243,0.000123,4.7e-05,6.9e-05,2.5e-05,0.000338,0.000144,0.000146,0.000158,2.6e-05,3.4e-05,0.000162,0.00012,0.000118,6.1e-05,9.7e-05,0.000232,8.7e-05,9.7e-05,3.8e-05,0.000116,0.000124,0.000372,0.000238,6.3e-05,0.000146,0.000121,4.7e-05,0.000108,0.000309,0.000312,0.000201,0.000107,9.9e-05,0.000195,0.000239,8.3e-05,0.000306,6e-05,0.000206,0.000108,0.000115,0.000157,0.000189,5e-05,5.5e-05,6.1e-05,0.000159,7.4e-05,0.000128,0.000209,4.3e-05,0.000145,0.000138,0.000151,9.1e-05,5.6e-05,0.000119,6.3e-05,0.00012,3.2e-05,5.7e-05,4.2e-05,0.000104,0.000152,0.000152
0.000326,0.000457,0.000446,0.000165,0.00078,0.000508,0.000448,0.000412,0.000411,0.000304,0.000547,0.000613,0.00071,0.000651,0.000423,0.000365,0.000415,0.000465,0.000685,0.000772,0.000608,0.000558,0.000655,0.000486,0.00027,0.000142,0.000668,0.000404,0.000402,0.000515,0.000401,0.000372,0.000404,0.00038,0.000183,0.000211,0.00018,0.000163,0.00107,0.000626,6.1e-05,0.00027,0.000113,0.000423,0.000431,0.000119,0.000243,0.000375,0.000462,0.000781,0.000559,0.000178,0.000198,0.000478,0.000667,0.000541,0.000582,0.000396,0.000251,7.7e-05,0.000497,0.000525,0.000457,0.00039,0.00033,0.000204,0.000303,0.000406,0.000425,0.000362,0.000411,0.00035,0.000298,0.000316,0.000167,9.7e-05,0.000246,0.000269,0.000166,0.000207,2e-05,0.000266,0.000262,0.000305,0.000413,0.000196,0.000345,0.000149,6.8e-05,0.000189,0.000255,0.000227,0.000394,0.000415,0.000371,0.000343,0.000198,4e-05,0.000219,0.000436,0.00024,6.8e-05,0.000269,0.000316,0.00023,0.000467,0.000238,0.000136,0.000293,0.000342,0.000393,0.000206,0.000136,0.00024,0.000295,0.00023,0.000122,9.4e-05,0.000107,0.000308,0.000408
0.000488,0.000421,0.000407,0.000619,0.000689,0.000603,0.000548,0.000301,0.000304,0.000528,0.000424,0.001082,0.00077,0.000292,0.000715,0.000459,0.000273,0.000492,0.00108,0.000228,0.000336,0.00029,0.000594,0.000587,0.000184,1e-04,0.000869,0.000362,0.000551,0.000408,0.000248,0.000455,0.000225,0.000349,0.00038,0.000488,0.000445,0.000523,0.000958,0.000797,0.000573,0.000125,0.000307,0.000512,0.000774,0.000825,0.000178,0.000343,0.000544,0.000605,0.000684,0.000905,0.00069,0.000445,0.00024,0.000562,0.000367,0.000148,0.000109,9.9e-05,0.00034,0.000591,0.000758,0.00038,0.000342,0.000231,0.000576,0.000524,0.000144,0.000108,0.000367,0.000817,0.000602,0.000168,0.000221,0.000124,0.000345,0.000492,0.000175,0.000125,0.000276,0.000388,0.000331,0.000202,0.000564,0.000562,0.000538,0.000376,0.000147,0.000173,0.000236,0.000278,0.000101,0.000287,0.000272,0.000242,0.000406,0.000361,0.000363,0.000253,0.000223,0.000301,0.000355,0.000277,0.000172,0.000407,0.000357,0.000244,4.4e-05,0.000133,9.5e-05,2.8e-05,0.000174,0.000199,5.1e-05,0.000176,7.8e-05,4.3e-05,3.1e-05,0.000235,0.000208
0.000152,0.000173,0.000319,0.000462,0.000219,0.000245,0.000464,0.000489,0.000379,0.00023,0.000444,0.000957,0.00051,0.000146,0.000525,0.000294,0.000246,0.00055,0.00057,0.000721,0.00021,0.000377,0.000141,0.000445,0.000329,0.000117,0.000642,0.000492,0.000396,0.000115,0.00026,2.6e-05,0.000325,0.000567,0.00037,0.000558,0.000258,0.000268,1.4e-05,0.000322,0.000108,3.6e-05,0.000268,0.000124,0.000446,0.000478,0.000606,0.000258,2.7e-05,0.000492,0.000431,0.000574,0.000363,0.000458,0.00025,0.000473,0.000485,9.7e-05,6e-05,0.000138,0.000148,0.000434,1.6e-05,0.000269,0.000125,0.000353,0.000252,6.9e-05,0.000272,0.000369,0.000242,0.000557,0.000296,0.000144,0.000195,0.00034,0.00025,0.000396,0.000466,0.000372,0.000423,1.9e-05,0.000135,2.4e-05,0.000449,0.000645,2.3e-05,5.4e-05,6.1e-05,9.8e-05,0.000132,8.1e-05,9.8e-05,0.000103,0.00019,0.000173,0.000189,0.000123,0.000108,3e-04,0.000145,0.000221,9.6e-05,8.2e-05,0.000164,0.000203,4.6e-05,4e-05,8.6e-05,1.9e-05,1e-04,0.000104,0.000156,0.00016,0.000217,0.000131,0.000137,0.00012,9.9e-05,0.000173,2.1e-05
0.000145,0.000175,0.000266,0.000383,0.000453,0.000115,0.00027,0.000247,0.000203,0.000297,0.000442,0.000804,0.000478,0.000199,0.00036,0.000348,0.000173,4e-05,0.000608,9.1e-05,0.000258,0.000478,0.000421,0.00033,0.000132,0.000113,0.000132,0.000153,0.000469,0.000309,0.00039,9.4e-05,0.000246,0.000501,0.000194,0.000316,5.1e-05,0.000269,0.000283,0.000148,0.000249,0.000197,0.000443,0.000402,0.00011,0.000281,0.000365,0.000251,0.000144,0.000234,0.000808,0.000223,0.00059,0.000567,0.000226,0.000413,0.000156,0.000284,0.000151,0.000278,0.000176,0.000369,0.000209,0.000292,0.000438,0.000692,0.000504,0.000199,0.000429,0.000173,0.000392,0.000142,0.000124,8.3e-05,0.000273,0.000102,0.000566,0.000216,0.000278,0.000278,0.000145,2e-04,0.000277,1e-04,0.000186,0.000305,0.000465,0.000215,0.000273,0.000244,0.000268,0.000185,0.000276,0.000261,0.000151,0.000119,0.000164,0.000148,0.000177,0.000149,1e-04,0.000143,6.9e-05,7.4e-05,0.000105,0.000182,3.7e-05,0.000141,0.000124,5.8e-05,0.000199,0.000187,6.9e-05,0.000206,5.2e-05,4.6e-05,0.000107,9.6e-05,8.5e-05,0.000199,0.000164
0.000351,0.00043,0.000539,0.00076,0.000812,0.000956,0.00057,0.000677,0.000632,0.000772,0.000923,0.001237,0.001007,5e-04,0.00019,0.00029,0.000515,0.000734,0.000637,0.000729,0.00051,0.000512,0.000287,0.000365,0.000516,0.000569,0.00053,0.000378,0.00026,0.000254,7.5e-05,0.000275,0.000253,0.000535,0.00057,0.000723,0.000381,0.000285,0.000579,0.000336,0.000185,5.8e-05,0.000691,0.00053,0.000342,0.000175,0.000269,0.00021,0.000125,0.000225,0.000695,0.000578,0.000305,0.00046,0.000406,0.000119,0.000214,0.000271,0.000604,0.000772,0.000562,0.000238,0.000773,0.000489,0.000465,0.000844,0.000219,0.000228,0.000248,0.000524,6.4e-05,0.000227,0.000182,0.000134,0.00019,0.000391,0.000862,0.000862,0.000424,0.000312,0.000208,0.000319,0.000146,0.000516,0.000376,0.000276,0.000624,0.000471,0.000504,0.000262,1.6e-05,0.000147,0.000316,0.000152,0.000295,0.000399,0.000425,0.000411,0.000284,0.000255,0.000367,0.000207,0.000269,8.4e-05,0.000241,0.000243,0.000322,0.000106,0.000117,5.7e-05,0.000146,7.2e-05,4.4e-05,0.00026,0.00031,2.1e-05,7e-05,0.000158,8.1e-05,0.000243,0.000242
0.000532,0.000793,0.000747,0.000881,0.001055,0.000526,0.000175,0.000696,0.000154,0.000565,0.00076,0.000391,0.001023,0.000336,0.000246,0.000317,0.000494,0.000246,0.000127,0.000491,0.000572,0.000328,0.000528,0.000208,0.000451,0.000674,0.000132,0.000347,0.000433,0.000134,0.000247,0.000275,0.00012,0.000642,0.000418,0.000663,0.000652,0.000439,0.001083,0.000936,0.000751,0.000297,0.000871,0.000357,4.5e-05,0.000172,0.000261,0.000115,0.000134,0.000121,0.000297,0.000516,0.000228,0.000223,0.000232,0.00035,0.000448,0.000266,0.000546,0.000465,0.000479,0.00053,0.000321,0.000418,0.000145,0.00049,0.000409,0.000636,0.000455,0.000298,0.000697,0.000474,0.000168,0.000169,0.000205,0.000263,0.00048,0.000135,0.000232,0.000191,0.000392,0.000315,0.000366,0.000747,0.001031,0.000714,0.000275,0.000335,0.000143,0.000165,9e-05,0.00036,0.000214,0.000395,0.000251,0.000249,0.000501,0.00025,0.000199,0.000216,0.00032,0.000328,0.000684,0.000677,0.000447,0.00045,0.000623,0.000164,0.000137,0.000106,0.000133,7e-05,6.3e-05,0.00025,7.9e-05,0.000285,0.000232,0.000119,0.000223,0.000439,0.000178
0.000768,0.000442,0.000209,0.000721,6.7e-05,6.5e-05,0.000177,0.000643,0.001058,0.000678,0.000665,0.000737,0.000737,0.000503,0.000342,0.000427,0.000472,0.00043,0.000412,0.000475,0.000854,0.000456,0.000477,0.000481,0.000456,0.000335,0.000389,0.000356,0.00026,0.000443,0.000657,0.000338,0.000277,0.000528,0.000156,0.00066,0.000435,0.000282,0.001129,0.00023,0.000354,0.000557,0.000712,0.00028,0.000162,0.00017,4.1e-05,0.000417,0.000517,0.000432,0.000282,0.000494,0.000653,0.000681,0.000975,0.001083,0.00036,7e-06,0.00048,0.000237,0.000417,0.000348,0.000262,0.00044,0.000592,0.000419,0.000316,0.000604,0.000316,0.000543,0.000726,0.000537,0.00066,0.000155,0.000112,0.000209,0.000253,0.000354,0.000317,0.000394,0.00011,0.000667,0.000693,0.000771,0.000328,0.000215,0.000234,0.000268,0.00044,0.000528,0.000328,0.000589,0.000285,0.000355,0.000136,0.000374,0.000386,0.000321,0.000224,0.000405,0.000494,0.000207,0.000518,0.000424,0.000297,0.000156,0.000249,0.000525,0.000282,0.000152,0.000293,0.000299,0.000121,0.000263,0.00028,0.000416,0.000309,0.000203,2e-04,0.000363,0.00038
0.000323,0.000946,0.000771,0.000284,0.000245,0.000375,0.000481,0.000585,0.000515,0.000445,0.000317,0.000375,0.000625,0.000766,0.000281,0.000183,0.000177,0.00027,0.000481,0.000874,0.00045,0.000602,0.000886,0.001127,0.000461,0.000151,0.000471,0.000661,0.000566,0.000551,0.001001,0.000875,0.000893,0.000398,0.000205,0.000278,0.000129,0.000366,0.001028,0.000897,0.000335,0.000224,0.000119,0.000216,0.000298,0.000156,0.000207,0.000447,0.000647,0.000204,2e-04,0.000327,0.000467,0.000821,0.000267,0.000302,0.00066,0.00061,0.000586,0.000402,0.000178,0.000206,0.000287,0.00039,0.000394,0.000706,0.00055,0.00049,0.000399,0.000582,0.000335,0.000201,0.000387,0.000424,0.000384,0.000324,0.000239,0.000466,0.000175,0.000401,0.000527,0.000684,0.000394,0.000433,0.000587,0.000657,0.000843,0.000766,0.000615,0.000193,0.000545,0.000673,0.000807,0.000242,3.1e-05,0.00035,0.000154,0.000189,0.000221,0.000297,0.000501,0.000351,0.000453,0.000542,0.000187,5.1e-05,0.00014,0.000421,0.000314,0.000214,0.000464,0.000315,0.000119,0.000364,0.000214,0.000388,0.000542,0.000305,0.000252,0.000157,0.000138
0.000447,0.000647,0.00013,0.000502,0.000632,0.000394,0.000456,0.000246,0.000494,0.000475,0.000372,0.000744,0.00043,0.000533,0.000289,0.000153,7.9e-05,0.00029,0.00019,0.000309,0.000281,0.000194,0.000385,0.000369,0.00026,0.000199,0.000378,0.000238,0.000407,0.000463,0.000587,9.6e-05,0.000401,0.00018,0.000345,0.000468,9.4e-05,0.000297,0.000241,0.000125,9.7e-05,0.000197,0.000185,0.000286,0.000269,0.000388,0.000433,0.000657,0.000112,5e-05,0.000156,7.1e-05,0.000373,0.000218,0.000415,0.000157,0.000449,0.000421,0.000341,0.000213,0.000249,0.000329,0.000171,0.000344,0.000259,0.000659,0.000171,0.000233,0.000151,0.000235,0.000394,0.000323,0.000144,0.000132,0.000194,8.9e-05,6.7e-05,0.000369,0.000425,0.000546,0.000186,0.000286,0.000217,0.000558,0.000408,3e-04,0.000522,0.000435,8.1e-05,0.000277,0.000313,0.000226,0.00048,0.000461,0.000283,0.000286,0.000345,0.000223,2e-04,0.000402,0.000231,0.000176,0.000298,0.000306,0.000261,0.000118,1.6e-05,0.000339,0.000227,6.6e-05,0.000236,0.000164,0.000215,0.00023,0.000162,0.000259,0.000171,0.00024,0.000362,0.000296,0.000107
6.1e-05,0.000422,5.6e-05,0.000147,0.000337,0.000209,0.000411,0.000311,7.4e-05,0.00032,0.000134,0.000549,4.9e-05,2.9e-05,0.000215,0.000124,8.3e-05,0.000112,9.2e-05,6.5e-05,0.000164,0.000172,0.000247,0.000188,0.000214,0.000209,0.000165,0.000304,0.000102,0.000299,0.000203,0.000187,0.000195,0.000121,0.000157,2e-04,6.6e-05,0.000105,0.000124,0.00012,3e-05,0.000249,0.000105,0.000176,0.000359,0.000108,0.000204,0.000105,4e-05,7.8e-05,0.000147,0.000198,0.000179,0.000303,0.000454,0.000115,0.000116,0.000176,0.000207,5.9e-05,9.3e-05,0.000338,0.000143,0.000157,0.000306,0.000277,0.000275,0.000174,0.000158,0.000398,0.000311,0.000135,0.000242,1e-04,3.6e-05,7e-05,8e-05,0.000139,0.000187,8.2e-05,0.000172,0.000297,0.000137,0.000326,0.000175,0.000195,0.000153,0.000318,4.8e-05,0.000194,0.000171,0.000213,0.000168,0.000198,6.7e-05,9.6e-05,0.000181,0.00017,0.000111,9.1e-05,4.1e-05,7.2e-05,0.000186,5.2e-05,7.8e-05,0.000114,0.000104,7.8e-05,2.4e-05,7e-05,0.000181,0.000108,0.000153,9.1e-05,7.8e-05,0.000104,0.000205,0.000138,0.000141,9.9e-05,4.9e-05
0.000421,0.000368,0.000181,0.000253,0.000211,5.1e-05,0.000456,0.000571,0.000274,0.000513,0.000351,0.000574,0.000335,0.000654,0.000321,9.5e-05,0.000133,0.000184,0.000188,0.000281,0.000232,0.000451,0.000573,8.5e-05,0.000209,0.000406,0.000693,0.000594,0.000372,0.000317,0.000204,8e-05,0.000175,0.000215,0.000206,0.000236,0.000161,0.000116,4e-05,0.000405,0.000198,0.000425,0.000174,0.000217,0.000684,0.000298,0.000214,4.9e-05,0.000217,2e-04,0.000234,0.000206,0.000428,0.000628,0.000594,0.000749,0.000806,0.00037,0.000365,0.000286,9.9e-05,0.000339,0.000405,0.000137,0.000272,0.000243,7.2e-05,0.000391,0.000547,0.000855,0.000974,0.000537,0.000341,0.000339,0.000391,0.000155,8.3e-05,0.000336,0.000394,0.000228,0.000413,0.000719,0.000439,0.000387,0.000256,0.000199,0.000175,0.000356,0.000386,0.000455,0.000237,0.000343,0.00027,0.000302,0.000313,0.00023,0.000218,0.000135,0.000223,0.000263,0.000216,0.000294,0.000172,0.000161,2.7e-05,0.00013,0.000224,2.2e-05,9.7e-05,0.000228,0.000357,0.000372,0.000337,0.000181,0.000128,8e-06,0.000233,0.000385,0.000241,0.00017,0.000108
0.001093,0.001039,0.000804,0.000307,0.000335,0.000173,0.000505,0.001075,0.00115,0.000633,0.000446,0.00083,0.000544,0.000737,0.001048,0.001027,0.000661,0.000455,0.000216,0.00039,0.000594,0.000704,0.000484,0.000579,0.000253,0.000167,0.000602,0.000335,0.00024,0.00022,0.000236,0.000307,0.000271,0.000424,0.000316,0.000188,0.000362,0.000293,0.000469,0.000708,0.000519,0.000312,0.000161,0.000299,0.000673,0.000559,0.000454,0.000519,0.000188,6.8e-05,9.1e-05,0.000243,0.000644,0.00075,0.000745,0.000878,0.000627,0.000334,0.000371,0.00041,0.000359,0.000416,0.000481,0.000406,8.1e-05,0.000139,0.000151,0.000366,0.000207,0.000352,0.000644,0.00092,0.000594,0.000141,0.000454,0.000431,0.000297,0.000438,0.000419,0.000244,0.000456,0.000628,0.000555,0.000313,0.000492,0.000233,0.000276,0.000496,0.000391,0.000217,0.00026,0.000191,0.00033,0.000453,0.000344,0.000179,0.000144,0.000324,0.000246,0.000153,8.7e-05,0.000214,0.000194,0.000119,0.000156,0.000149,8.4e-05,0.000181,0.000124,0.000135,0.000129,0.000216,0.00041,0.00029,0.000118,9.7e-05,0.000149,0.000162,2.5e-05,0.000216,0.000291
0.000437,0.000324,9.6e-05,0.000209,0.000384,0.000375,0.000586,0.000821,0.000536,0.000356,0.000177,0.000537,0.000717,0.000515,0.000446,0.000381,0.000502,0.000339,0.000268,0.000304,0.000307,0.000181,0.000286,0.000229,0.000216,0.000297,0.00014,0.000122,0.000223,0.00035,7.3e-05,2.9e-05,0.000191,0.000155,0.000138,0.000142,0.000243,0.000245,0.000474,0.000265,1e-05,0.000127,6.5e-05,0.000222,0.000154,0.000104,0.000231,0.000207,9.5e-05,7.3e-05,5e-05,0.000132,0.000251,0.000228,0.000136,0.000445,0.000179,8e-05,0.000112,0.000112,0.000162,0.000111,0.000282,0.000164,0.000181,0.000107,5.6e-05,0.000217,0.000122,0.00013,0.000193,0.000363,0.00015,0.000155,0.00022,0.000125,6e-05,0.000315,0.000128,9e-05,0.00023,0.000195,6.5e-05,0.000127,0.000271,0.000137,0.000235,8.2e-05,0.000129,0.000162,0.00017,0.000243,0.000111,0.000169,8e-05,4.7e-05,5.4e-05,0.000227,4.9e-05,0.000141,7.9e-05,0.000154,3.5e-05,8.9e-05,0.000106,8.2e-05,0.000117,6.1e-05,0.000118,8.2e-05,1.7e-05,0.000165,0.000164,0.000114,0.000117,2.5e-05,1.1e-05,8.6e-05,0.000151,0.000161,7e-05
0.000225,2.1e-05,7e-05,0.000148,0.000191,0.000387,0.000402,0.000189,0.000319,0.000205,2.6e-05,0.000282,0.000244,0.000349,4.7e-05,0.000393,0.000313,0.00011,0.000139,5.3e-05,0.000349,0.000208,0.000154,0.000157,0.000113,0.000199,0.000201,0.000199,0.000129,0.00014,8.9e-05,0.000103,0.000167,9.9e-05,7.8e-05,3.4e-05,0.000142,0.000173,0.000243,3.6e-05,5.6e-05,0.000137,6.9e-05,0.000215,0.000118,7e-05,9.3e-05,0.000178,6.6e-05,9e-05,0.00012,4e-05,0.000128,0.000119,0.000156,0.000206,8.8e-05,3.2e-05,6.3e-05,0.000133,3.5e-05,0.000128,0.000246,7.3e-05,7e-05,7.5e-05,6.4e-05,0.000183,0.000122,0.000174,9.4e-05,0.000154,1.7e-05,5.4e-05,0.000107,2.9e-05,7.6e-05,0.000214,0.000156,6.4e-05,9e-05,9.4e-05,7.8e-05,0.000121,0.00013,0.00011,0.000111,1.7e-05,4.6e-05,8.6e-05,6e-06,9.3e-05,4.5e-05,8.8e-05,7e-06,3.1e-05,6.7e-05,9.7e-05,4.8e-05,0.000107,6.1e-05,9.7e-05,5.2e-05,4.6e-05,2.8e-05,8.2e-05,5.7e-05,5.2e-05,3.9e-05,6.5e-05,2.6e-05,8.1e-05,9.9e-05,6.3e-05,1e-05,3.6e-05,3.8e-05,5.8e-05,0.000117,3.5e-05,7.4e-05
0.000212,0.000114,0.000107,0.000142,5.5e-05,0.000264,5.5e-05,0.000249,2.2e-05,0.000157,2.8e-05,3.5e-05,0.000137,0.000125,1.8e-05,1e-04,0.000252,9e-05,4.3e-05,0.000136,0.00012,0.000173,0.000195,0.000114,0.000103,7.2e-05,0.000125,7.5e-05,3.6e-05,0.000113,5e-05,0.000103,0.000108,0.000115,2.5e-05,2.6e-05,3.3e-05,0.000159,0.000139,2.1e-05,2.9e-05,0.000129,5.4e-05,0.000122,0.000119,4.7e-05,4.8e-05,7.2e-05,4.9e-05,2.3e-05,6.9e-05,5.6e-05,0.000106,6.4e-05,0.000137,0.000189,0.000105,6e-06,3.3e-05,6.5e-05,3e-05,5.7e-05,4.7e-05,9.2e-05,0.000131,0.000106,0.000103,8.1e-05,0.000116,0.000116,2e-05,0.000114,2.5e-05,9.6e-05,7.4e-05,1.7e-05,3e-05,0.000153,6.4e-05,1.1e-05,8.7e-05,3.2e-05,3.9e-05,8.4e-05,0.000104,7.7e-05,0.000101,1.6e-05,2.2e-05,5.9e-05,4.4e-05,7e-05,1.6e-05,6.4e-05,2.8e-05,1e-05,2.6e-05,4.2e-05,7.3e-05,6.9e-05,2e-05,8.4e-05,5.5e-05,5.5e-05,2.9e-05,5.3e-05,1.9e-05,5.4e-05,6.1e-05,4.5e-05,2.4e-05,7.8e-05,5.7e-05,8.2e-05,7.4e-05,5.6e-05,2.3e-05,7.9e-05,6.6e-05,3.3e-05,5.4e-05
0.000138,5.5e-05,9.3e-05,3.2e-05,2.8e-05,0.000177,0.000118,0.000261,6.7e-05,0.000153,0.000105,0.00012,4.1e-05,9.8e-05,5.6e-05,3.4e-05,0.000145,4.8e-05,3.6e-05,0.000221,0.000174,0.000194,9e-05,2.5e-05,4.4e-05,7.8e-05,3e-05,6.4e-05,2.7e-05,0.000104,3.2e-05,4.2e-05,0.000109,4.1e-05,5.1e-05,4.5e-05,4.8e-05,0.000113,9.2e-05,1.3e-05,1e-05,0.000107,2.9e-05,9.1e-05,8e-05,5.8e-05,2e-05,7.3e-05,4.7e-05,6.1e-05,5.7e-05,1.7e-05,5.1e-05,4.9e-05,0.000122,0.000136,8.6e-05,2.3e-05,4.8e-05,8e-05,2.8e-05,7.1e-05,0.000102,3.7e-05,9.3e-05,2e-05,3.9e-05,6.3e-05,6e-05,2.2e-05,2.7e-05,0.000122,3.5e-05,8.2e-05,4.1e-05,1.1e-05,3.3e-05,6.7e-05,4.6e-05,3.4e-05,9e-05,8e-06,3.9e-05,5.7e-05,0.00011,5.8e-05,5.2e-05,3.3e-05,5.7e-05,4.5e-05,1.1e-05,3.7e-05,1.8e-05,6.8e-05,1.8e-05,1.9e-05,4.7e-05,9.1e-05,5.3e-05,4.5e-05,6e-06,7e-05,3.3e-05,3.4e-05,1.4e-05,1.4e-05,1.5e-05,4.8e-05,6.4e-05,4.8e-05,5.2e-05,7.1e-05,2.2e-05,2.7e-05,4.6e-05,2.7e-05,3.9e-05,1.8e-05,8.8e-05,4.3e-05,4e-05
8.1e-05,8e-05,8.3e-05,7.1e-05,2.4e-05,0.000191,4e-05,0.000177,8.2e-05,9.7e-05,7e-05,7.4e-05,7.5e-05,6.3e-05,1.8e-05,0.000103,9.4e-05,6.4e-05,3.6e-05,0.000163,0.000106,0.000132,9.4e-05,7.1e-05,4.4e-05,6.1e-05,4.9e-05,2.5e-05,1.8e-05,4.4e-05,7.7e-05,0.000101,6.5e-05,7e-06,2.9e-05,1.8e-05,1.7e-05,9.9e-05,5.9e-05,2.3e-05,1.7e-05,9.1e-05,1.9e-05,9.2e-05,2.8e-05,5e-06,7e-06,7.7e-05,1.5e-05,5.2e-05,1.9e-05,4.8e-05,5e-05,1.6e-05,6.6e-05,0.000144,6.8e-05,4.1e-05,4.5e-05,2.8e-05,2.8e-05,9.9e-05,7.6e-05,3.5e-05,8.1e-05,2.4e-05,6.1e-05,8.3e-05,6.7e-05,5.9e-05,3.4e-05,9e-05,3.3e-05,6.6e-05,3.4e-05,3.6e-05,1.6e-05,4.6e-05,1.2e-05,5.2e-05,6.9e-05,2.1e-05,1.2e-05,3.7e-05,9.6e-05,5.8e-05,5.7e-05,2.2e-05,6.7e-05,4.3e-05,2e-05,3.8e-05,6e-06,6.6e-05,1e-05,2.8e-05,4e-05,3.9e-05,3.1e-05,5.5e-05,2.4e-05,3e-05,2.1e-05,2.7e-05,2.2e-05,3.6e-05,2.2e-05,3.3e-05,4.1e-05,4.4e-05,2.7e-05,3.9e-05,2.2e-05,1.4e-05,3.3e-05,4e-05,2.4e-05,1.7e-05,6.1e-05,4.5e-05,4.7e-05
9.3e-05,6.9e-05,6.4e-05,5.4e-05,2.3e-05,0.000123,7e-05,0.000109,6.9e-05,4.6e-05,5.6e-05,3.1e-05,2.8e-05,7.9e-05,6.3e-05,0.000152,0.000119,1e-05,5.7e-05,0.000156,0.000135,7.1e-05,5.6e-05,3.4e-05,3.5e-05,6.6e-05,2.6e-05,2.6e-05,1.5e-05,6.8e-05,7e-05,6.5e-05,9e-05,4.8e-05,8e-06,2.5e-05,3.1e-05,0.000108,4e-05,3.6e-05,4.1e-05,6.5e-05,6e-06,9e-05,1.3e-05,2.7e-05,2.1e-05,8.5e-05,1.7e-05,4.5e-05,1e-05,6e-06,7.8e-05,3.3e-05,2.8e-05,0.000124,7.2e-05,4.1e-05,1.8e-05,4.3e-05,2.3e-05,6.1e-05,9.4e-05,1.6e-05,4.9e-05,3.4e-05,1.7e-05,5.6e-05,6.4e-05,5e-05,2.7e-05,0.00012,2.2e-05,5.1e-05,5.9e-05,1.6e-05,3.5e-05,4.9e-05,2.2e-05,2.6e-05,8.5e-05,1.2e-05,6e-06,6.6e-05,6.3e-05,6.8e-05,4.5e-05,1.4e-05,2.5e-05,5e-06,2.5e-05,4.1e-05,2.5e-05,3.3e-05,1.8e-05,3e-05,3.1e-05,4.7e-05,3.1e-05,6e-05,1.9e-05,3.2e-05,1.5e-05,5e-06,9e-06,3.3e-05,7e-06,3.3e-05,3.1e-05,3.9e-05,1.4e-05,2.1e-05,1.7e-05,1.8e-05,1.5e-05,1.6e-05,2.7e-05,1.4e-05,5.1e-05,1e-05,1.4e-05
6.3e-05,3.9e-05,3e-06,4e-05,3.2e-05,9.6e-05,5e-05,0.000102,3.5e-05,0.00011,5.8e-05,2.8e-05,4.1e-05,8e-05,4.6e-05,0.000101,9.6e-05,1.6e-05,2.8e-05,0.000157,5e-05,8.7e-05,1.1e-05,3.6e-05,2.5e-05,2.2e-05,3.4e-05,7e-06,2.7e-05,6.1e-05,5.4e-05,3.1e-05,5.2e-05,4.8e-05,1.8e-05,7e-06,2.2e-05,9.8e-05,3.7e-05,2.4e-05,1.9e-05,4.5e-05,1.7e-05,8.5e-05,3e-06,2e-05,8e-06,7.3e-05,8e-06,2.3e-05,3.4e-05,1.3e-05,5.9e-05,1.8e-05,2.3e-05,0.000118,6.3e-05,2.3e-05,2.1e-05,5.8e-05,7e-06,5.7e-05,6.8e-05,1.6e-05,5.9e-05,4.5e-05,3.4e-05,6.1e-05,6.8e-05,2.5e-05,1.3e-05,1e-04,2.5e-05,7.1e-05,4.7e-05,1.7e-05,3.2e-05,6.9e-05,5e-06,4e-06,6e-05,1.6e-05,1.3e-05,4.1e-05,7.8e-05,4.6e-05,3.6e-05,1.1e-05,2.5e-05,1e-05,3.1e-05,5.5e-05,3e-06,2.1e-05,5e-06,1.8e-05,4e-05,4.9e-05,3.3e-05,4.6e-05,2.7e-05,2.6e-05,2.5e-05,1.1e-05,4e-06,2.4e-05,1.2e-05,2.8e-05,2.6e-05,3e-05,1.9e-05,2e-05,8e-06,2e-06,1.2e-05,2e-05,3.3e-05,3.1e-05,3.2e-05,2.8e-05,2.1e-05
3.5e-05,3.2e-05,7e-06,1.9e-05,1.4e-05,5.9e-05,1.2e-05,4.4e-05,8e-06,4.5e-05,2.8e-05,2.2e-05,3.4e-05,3.9e-05,1.9e-05,4.9e-05,4.9e-05,1.1e-05,8e-06,5.2e-05,3.2e-05,3.8e-05,6e-06,2.4e-05,6e-06,1.7e-05,3.1e-05,1.4e-05,8e-06,2.5e-05,2e-05,1.2e-05,3.2e-05,2.3e-05,4e-06,1e-05,1.6e-05,3.9e-05,1.8e-05,4e-06,5e-06,2.8e-05,8e-06,3.7e-05,9e-06,7e-06,3e-06,2.9e-05,3e-06,8e-06,1.2e-05,1.5e-05,2.4e-05,1e-05,1.1e-05,4.8e-05,3e-05,9e-06,7e-06,2.2e-05,9e-06,2.4e-05,4.1e-05,1.6e-05,3e-05,1.8e-05,1.9e-05,2.7e-05,2.1e-05,1.8e-05,1.5e-05,3.2e-05,3e-06,2.3e-05,1.5e-05,7e-06,1.3e-05,3e-05,9e-06,2e-06,2.4e-05,9e-06,9e-06,1.9e-05,3.5e-05,1.8e-05,1.8e-05,4e-06,1.4e-05,6e-06,1.5e-05,1.1e-05,6e-06,8e-06,4e-06,1.1e-05,1.4e-05,2.5e-05,1.5e-05,2e-05,9e-06,6e-06,1.1e-05,2e-06,5e-06,5e-06,4e-06,1.7e-05,1.5e-05,1.5e-05,7e-06,1.5e-05,1.1e-05,1.1e-05,8e-06,3e-06,1.7e-05,1e-05,1.5e-05,1e-05,1.7e-05
3e-05,1.8e-05,2e-06,1.8e-05,1.6e-05,4.8e-05,1.8e-05,3.6e-05,7e-06,3.1e-05,2e-05,2.7e-05,1.2e-05,2.5e-05,1e-05,5.2e-05,4.8e-05,1e-05,1.1e-05,4.4e-05,2.6e-05,3.8e-05,8e-06,2e-05,6e-06,1.8e-05,2.3e-05,7e-06,1.2e-05,3.2e-05,2.2e-05,1.7e-05,3.3e-05,2e-05,9e-06,1.4e-05,9e-06,3.4e-05,1.6e-05,6e-06,1.1e-05,3.4e-05,4e-06,3.2e-05,7e-06,7e-06,1.3e-05,3e-05,4e-06,7e-06,1.1e-05,1.6e-05,1.5e-05,3e-06,5e-06,5.7e-05,2.8e-05,1.4e-05,1e-05,1.8e-05,7e-06,1.8e-05,3.4e-05,6e-06,2.2e-05,2e-05,1.8e-05,2.1e-05,2.8e-05,1.7e-05,9e-06,2.9e-05,4e-06,2.3e-05,2.1e-05,4e-06,1.2e-05,3.1e-05,4e-06,6e-06,3.1e-05,3e-06,3e-06,1.7e-05,3.5e-05,1.7e-05,2e-05,4e-06,1.8e-05,5e-06,5e-06,7e-06,7e-06,7e-06,3e-06,1.5e-05,1.2e-05,1.8e-05,1e-05,2.3e-05,1.2e-05,8e-06,1.4e-05,3e-06,4e-06,1.1e-05,3e-06,1.6e-05,1.1e-05,1.5e-05,7e-06,1.3e-05,7e-06,1e-05,2e-06,6e-06,7e-06,1.2e-05,1.3e-05,1.5e-05,1.8e-05
1.5e-05,3.4e-05,6e-06,1e-05,4e-06,4.8e-05,1.6e-05,3.5e-05,4e-06,3.2e-05,8e-06,1.6e-05,2.6e-05,1.6e-05,2.2e-05,2.9e-05,5.1e-05,6e-06,3e-06,5.1e-05,2.3e-05,3.3e-05,8e-06,1.8e-05,1e-06,7e-06,1.2e-05,1e-05,8e-06,3.2e-05,2e-05,1.3e-05,3e-05,1.3e-05,4e-06,1.6e-05,9e-06,3.5e-05,1.5e-05,1.6e-05,1.1e-05,2.5e-05,5e-06,2.6e-05,8e-06,1.1e-05,9e-06,2.3e-05,4e-06,1.2e-05,9e-06,2.2e-05,2.1e-05,6e-06,1.3e-05,4.2e-05,2.6e-05,9e-06,3e-06,1.2e-05,1.2e-05,1.6e-05,3.6e-05,1.3e-05,1.9e-05,1.5e-05,2.2e-05,2e-05,2.7e-05,2.2e-05,6e-06,3.2e-05,3e-06,2.5e-05,2e-05,5e-06,1.2e-05,2.8e-05,6e-06,8e-06,3e-05,1.1e-05,4e-06,1e-05,2.6e-05,1.9e-05,1.6e-05,1e-05,1.1e-05,3e-06,3e-06,8e-06,1.1e-05,1.3e-05,5e-06,1.6e-05,1.2e-05,1.4e-05,7e-06,1.1e-05,5e-06,9e-06,9e-06,8e-06,1e-06,1.4e-05,6e-06,1.7e-05,7e-06,1e-05,8e-06,7e-06,4e-06,3e-06,1.2e-05,8e-06,1e-05,1e-05,1.4e-05,1.3e-05,1e-05
7e-06,3.5e-05,2.8e-05,2.5e-05,1.5e-05,5e-05,2.1e-05,3.8e-05,1.6e-05,3.7e-05,8e-06,2e-05,1.6e-05,1.5e-05,2.9e-05,3e-05,4.1e-05,1e-05,8e-06,4.6e-05,2.2e-05,1e-05,7e-06,1.7e-05,1.5e-05,1.1e-05,2.5e-05,5e-06,8e-06,2.9e-05,2.1e-05,3e-06,4.1e-05,1.5e-05,1.5e-05,1.9e-05,1.2e-05,3.4e-05,1.8e-05,1.5e-05,2.2e-05,1.7e-05,3e-06,2.8e-05,8e-06,1.1e-05,2.3e-05,2.6e-05,1.2e-05,1.3e-05,1.4e-05,2.4e-05,2.2e-05,6e-06,1.3e-05,4.2e-05,3e-05,7e-06,9e-06,1.8e-05,1.6e-05,2.5e-05,3.2e-05,9e-06,2.3e-05,2.5e-05,1.5e-05,2.3e-05,1.3e-05,3.2e-05,1.6e-05,2.6e-05,9e-06,2.7e-05,9e-06,1.3e-05,1e-06,2.3e-05,3e-06,7e-06,2.8e-05,6e-06,2e-06,1e-05,2.8e-05,2.3e-05,1.3e-05,1.2e-05,1.5e-05,3e-06,5e-06,3e-06,2e-06,1.6e-05,3e-06,1.8e-05,1.8e-05,2.3e-05,1.2e-05,1.7e-05,7e-06,1.3e-05,1.1e-05,5e-06,6e-06,1.1e-05,3e-06,1.2e-05,1.2e-05,1.3e-05,8e-06,1.5e-05,1.3e-05,7e-06,1.1e-05,1.3e-05,1e-05,9e-06,1.4e-05,1.5e-05,1.5e-05
2.1e-05,4.3e-05,3e-05,2.4e-05,3.1e-05,5.2e-05,6e-06,4.2e-05,1.1e-05,1.7e-05,2.8e-05,9e-06,4.2e-05,2e-05,3.2e-05,6.9e-05,5.7e-05,3e-05,2.2e-05,3.1e-05,2.1e-05,2.3e-05,2.6e-05,1.8e-05,3.8e-05,4.2e-05,4.3e-05,2.3e-05,1.7e-05,3.6e-05,1e-05,7e-06,5.7e-05,3.9e-05,3e-05,3.8e-05,3.1e-05,4.4e-05,1e-05,2.7e-05,4.4e-05,3.6e-05,4.3e-05,3.6e-05,1.3e-05,2e-06,2e-05,3.5e-05,1.3e-05,3.3e-05,1.9e-05,2.4e-05,2.9e-05,2.4e-05,1.7e-05,5e-05,4e-05,8e-06,9e-06,2.2e-05,2.5e-05,9e-06,4.3e-05,1.6e-05,3e-05,3.3e-05,1.6e-05,2.1e-05,2e-06,3.8e-05,7e-06,3.3e-05,1.2e-05,3.2e-05,3.5e-05,2.5e-05,1.4e-05,2.6e-05,8e-06,6e-06,1.9e-05,8e-06,9e-06,5e-06,3.3e-05,2.5e-05,1.9e-05,2e-05,7e-06,9e-06,1.6e-05,5e-06,1.4e-05,9e-06,8e-06,1.3e-05,9e-06,2.6e-05,6e-06,1.7e-05,6e-06,1.8e-05,1e-05,1.1e-05,1e-05,6e-06,9e-06,1.7e-05,1.5e-05,9e-06,7e-06,1.5e-05,9e-06,4e-06,5e-06,6e-06,1e-05,1e-06,1.4e-05,1e-05,1.3e-05
1.8e-05,4e-05,7e-06,1.7e-05,2.4e-05,1.8e-05,5.7e-05,2.4e-05,7e-06,2.8e-05,1.4e-05,3.3e-05,2.3e-05,1.8e-05,4.7e-05,5.9e-05,1e-05,5.7e-05,2.3e-05,3.2e-05,2e-05,5.8e-05,2.4e-05,1.5e-05,4.8e-05,3e-05,2.5e-05,1.9e-05,4e-06,2.7e-05,4.7e-05,3.1e-05,5.1e-05,5.7e-05,6.1e-05,2.7e-05,1.8e-05,4.2e-05,3.7e-05,2.7e-05,1.3e-05,6.4e-05,4.9e-05,6.7e-05,3.3e-05,2.9e-05,1.5e-05,4.5e-05,4.2e-05,3.9e-05,3.5e-05,7e-06,1.7e-05,8e-06,2.1e-05,5.8e-05,6.2e-05,3.8e-05,2.5e-05,9e-06,3.4e-05,6.2e-05,2e-05,9e-06,3e-05,2.7e-05,2.5e-05,2.3e-05,7e-06,8e-06,3.8e-05,1.4e-05,2.4e-05,5e-06,1.7e-05,3e-06,1.5e-05,4.8e-05,3.5e-05,2.6e-05,3.1e-05,4e-06,4e-06,1.8e-05,5.3e-05,4.4e-05,4.6e-05,2.4e-05,3.3e-05,4e-06,9e-06,1.2e-05,1.7e-05,1.2e-05,1.9e-05,1.7e-05,2e-05,1.3e-05,0,1.3e-05,1.1e-05,1.4e-05,6e-06,1.8e-05,6e-06,9e-06,1.4e-05,4e-06,9e-06,1.5e-05,3e-06,9e-06,1.2e-05,8e-06,9e-06,4e-06,1.5e-05,5e-06,2e-05,1.4e-05,9e-06
7e-06,2.4e-05,1.7e-05,1.2e-05,3.5e-05,2.4e-05,2.1e-05,2.6e-05,2.7e-05,3.4e-05,1e-05,4.1e-05,2.2e-05,2.9e-05,2.9e-05,4.9e-05,2.1e-05,1e-06,3e-06,1.5e-05,3.4e-05,5.8e-05,2.2e-05,6e-06,2.1e-05,1.3e-05,3.3e-05,1.1e-05,1.2e-05,1.9e-05,5.2e-05,3.8e-05,2.3e-05,2.6e-05,2.4e-05,2.1e-05,8e-06,2.5e-05,1.3e-05,1.7e-05,8e-06,5.6e-05,7e-06,3.4e-05,3.2e-05,3.3e-05,2.8e-05,1e-05,3e-05,1e-06,2.9e-05,1.4e-05,2e-05,1.9e-05,3.3e-05,4.9e-05,2.8e-05,3.3e-05,7e-06,2e-06,1.8e-05,4.4e-05,3.8e-05,3.4e-05,4.3e-05,2e-05,1.7e-05,1.2e-05,1.6e-05,1.4e-05,4.7e-05,1.6e-05,3e-06,7e-06,3e-06,3.1e-05,2.8e-05,3.6e-05,2.1e-05,1e-05,3e-05,2.6e-05,8e-06,2.5e-05,3.5e-05,2.5e-05,2e-05,1.5e-05,8e-06,1.3e-05,1e-05,2e-05,6e-06,4e-06,1.1e-05,6e-06,1e-05,1.7e-05,1e-05,2.4e-05,2.6e-05,1e-05,1.7e-05,6e-06,1e-06,1.2e-05,1.3e-05,1.9e-05,1.5e-05,1e-05,7e-06,1.1e-05,7e-06,6e-06,1.5e-05,1.4e-05,1.2e-05,1.1e-05,2.1e-05,8e-06,5e-06
2.7e-05,5.8e-05,4e-05,5e-05,6.1e-05,9.2e-05,7.1e-05,4e-05,6.5e-05,5.8e-05,2.1e-05,3.4e-05,2.9e-05,2.2e-05,1.9e-05,4.6e-05,5e-05,5.6e-05,2.2e-05,2.9e-05,6.7e-05,8.3e-05,5.6e-05,5.4e-05,3.6e-05,2.2e-05,2.3e-05,1.9e-05,2.8e-05,4.9e-05,4.7e-05,4.5e-05,3.5e-05,1.6e-05,3.1e-05,1.1e-05,1.1e-05,3.9e-05,8e-06,2.5e-05,2.8e-05,4e-05,1.4e-05,3.8e-05,3e-05,4.8e-05,1.5e-05,1.6e-05,3.2e-05,2.3e-05,3.6e-05,2.6e-05,3e-05,1.2e-05,3e-05,3.6e-05,1.9e-05,6e-06,2.3e-05,1.6e-05,1.4e-05,2e-05,3.5e-05,1.4e-05,2e-05,4.4e-05,3.3e-05,3.9e-05,3.6e-05,1.3e-05,2.8e-05,3.9e-05,3.9e-05,7e-06,6e-06,3.8e-05,3.4e-05,3.6e-05,1e-05,2.4e-05,1.9e-05,2.7e-05,3.2e-05,1.1e-05,2.4e-05,2.6e-05,6e-06,2e-05,6e-06,1.1e-05,8e-06,2.3e-05,2e-05,1.2e-05,4e-06,2e-06,1.2e-05,1.7e-05,1.5e-05,1.2e-05,3.3e-05,2.5e-05,2.3e-05,9e-06,1e-05,1.7e-05,5e-06,1.7e-05,2.3e-05,1.3e-05,1.2e-05,6e-06,4e-06,6e-06,1.3e-05,9e-06,4e-06,6e-06,1e-05,1.3e-05,4e-06
4.3e-05,5.8e-05,6.3e-05,2.2e-05,2.4e-05,4.3e-05,3e-05,2.2e-05,4.6e-05,4.6e-05,8e-06,2.6e-05,2.4e-05,4.3e-05,2.9e-05,8e-06,5.4e-05,1.2e-05,1.7e-05,4.4e-05,5.9e-05,6.1e-05,1.7e-05,1.7e-05,2.7e-05,2.7e-05,1.3e-05,7e-06,2.2e-05,3e-05,3e-06,2.1e-05,5e-06,1.7e-05,2.7e-05,2.3e-05,1.7e-05,4.3e-05,3.3e-05,3.6e-05,8e-06,2.7e-05,2.2e-05,2.5e-05,2.3e-05,1.1e-05,1.4e-05,2e-05,1.3e-05,1e-05,1.2e-05,1.7e-05,1.2e-05,6e-06,2.2e-05,5.7e-05,2.9e-05,1.4e-05,1.4e-05,7e-06,1.2e-05,7e-06,3e-05,2.2e-05,1.8e-05,9e-06,1.6e-05,2.9e-05,1.9e-05,1.5e-05,1e-05,4.1e-05,1.7e-05,2.3e-05,2.1e-05,3.3e-05,1.2e-05,2.3e-05,1.2e-05,1.4e-05,9e-06,1.7e-05,2.9e-05,2e-05,2.8e-05,1.9e-05,1.2e-05,1e-05,2.4e-05,2e-05,8e-06,2e-05,7e-06,1.2e-05,2e-06,6e-06,8e-06,1.1e-05,1.2e-05,7e-06,1.4e-05,8e-06,1.1e-05,2e-06,4e-06,1.4e-05,6e-06,9e-06,1e-05,9e-06,1e-05,1e-05,7e-06,3e-06,1.2e-05,3e-06,6e-06,8e-06,1.2e-05,9e-06,8e-06
2.2e-05,1e-05,2.3e-05,5e-06,1.9e-05,3.8e-05,1.3e-05,2.3e-05,1.9e-05,2e-05,8e-06,1.1e-05,1.8e-05,3.1e-05,8e-06,2.4e-05,3.5e-05,1e-06,7e-06,3.7e-05,3.8e-05,3.4e-05,1e-05,1.2e-05,1.1e-05,1.2e-05,1.4e-05,6e-06,9e-06,2e-05,1.7e-05,1.4e-05,1.1e-05,1.3e-05,1.1e-05,1.3e-05,1e-05,3.3e-05,2e-05,4e-06,5e-06,1.8e-05,8e-06,2.5e-05,1.9e-05,1.1e-05,5e-06,2.8e-05,4e-06,2e-06,1e-06,1.2e-05,9e-06,1.2e-05,9e-06,4.7e-05,1.7e-05,1.4e-05,1.5e-05,7e-06,5e-06,9e-06,2.6e-05,2e-05,5e-06,9e-06,1.1e-05,1.2e-05,7e-06,9e-06,1.5e-05,3e-05,7e-06,1.5e-05,9e-06,6e-06,7e-06,2.8e-05,3e-06,9e-06,1.7e-05,1.1e-05,7e-06,1.5e-05,2.8e-05,1.4e-05,1.5e-05,2e-06,1.7e-05,6e-06,0,1.4e-05,3e-06,9e-06,5e-06,9e-06,5e-06,1e-05,1.2e-05,2e-06,2e-06,2e-06,1.2e-05,3e-06,5e-06,1.1e-05,2e-06,8e-06,1.2e-05,1.1e-05,1.2e-05,1.2e-05,4e-06,5e-06,9e-06,3e-06,8e-06,8e-06,1.2e-05,8e-06,5e-06
2.3e-05,1.1e-05,2.5e-05,1.1e-05,1.3e-05,4.2e-05,9e-06,2.7e-05,1.2e-05,2.7e-05,1e-05,1e-05,1.2e-05,3e-05,1.3e-05,2.6e-05,3.3e-05,6e-06,1e-05,3.2e-05,2.3e-05,3.4e-05,1.1e-05,4e-06,5e-06,2e-06,1.1e-05,8e-06,8e-06,2.3e-05,1.6e-05,2e-05,1.1e-05,1.6e-05,5e-06,1.1e-05,1e-05,2.8e-05,1.5e-05,4e-06,1.2e-05,2.4e-05,1.1e-05,2.8e-05,1.8e-05,3e-06,5e-06,3.1e-05,3e-06,5e-06,3e-06,1e-05,1.3e-05,1.1e-05,1.3e-05,4e-05,2e-05,1.2e-05,9e-06,4e-06,7e-06,1.2e-05,2.9e-05,6e-06,1.5e-05,1e-05,1.5e-05,1.7e-05,1.4e-05,5e-06,1.2e-05,2.6e-05,1e-06,1.5e-05,8e-06,6e-06,7e-06,2.8e-05,3e-06,3e-06,1.5e-05,7e-06,1.6e-05,2e-05,3.4e-05,2.2e-05,1.8e-05,1e-06,1.1e-05,2e-06,6e-06,1.4e-05,2e-06,5e-06,5e-06,4e-06,1e-05,1.4e-05,1.1e-05,5e-06,4e-06,1e-06,7e-06,4e-06,6e-06,1.3e-05,6e-06,8e-06,1e-05,1.1e-05,7e-06,9e-06,4e-06,4e-06,2e-06,1.1e-05,6e-06,8e-06,1e-05,1e-05,3e-06
2.1e-05,8e-06,2.3e-05,8e-06,2e-05,3.5e-05,7e-06,2e-05,1.5e-05,2.4e-05,1.3e-05,1.2e-05,1.6e-05,2.7e-05,1.3e-05,2.4e-05,3.2e-05,9e-06,6e-06,3.2e-05,2.1e-05,2.8e-05,1e-06,6e-06,9e-06,7e-06,6e-06,3e-06,3e-06,2.4e-05,1.4e-05,9e-06,1.4e-05,1.4e-05,3e-06,1e-05,1e-05,2.9e-05,1.1e-05,6e-06,1.4e-05,1.7e-05,1e-05,2.9e-05,1.3e-05,1e-05,7e-06,2.7e-05,5e-06,4e-06,4e-06,1.1e-05,8e-06,1e-05,7e-06,5e-05,2.4e-05,1.6e-05,8e-06,5e-06,2e-06,1.2e-05,2.5e-05,3e-06,7e-06,1.1e-05,2e-05,1.5e-05,1.4e-05,4e-06,6e-06,2.1e-05,5e-06,1.6e-05,6e-06,7e-06,8e-06,2.3e-05,5e-06,4e-06,1.8e-05,9e-06,1.2e-05,1.6e-05,2.1e-05,1.6e-05,1.9e-05,7e-06,1.3e-05,5e-06,8e-06,1.2e-05,5e-06,8e-06,1e-05,1e-05,9e-06,1.1e-05,1.3e-05,6e-06,7e-06,7e-06,8e-06,5e-06,3e-06,1.2e-05,2e-06,9e-06,8e-06,1.2e-05,5e-06,7e-06,2e-06,4e-06,5e-06,7e-06,5e-06,1e-05,1e-05,1.3e-05,7e-06
1.2e-05,5e-06,1e-05,9e-06,1.4e-05,3.4e-05,3e-06,2e-05,1.3e-05,3.1e-05,6e-06,1.8e-05,1.1e-05,2.2e-05,2e-05,2.6e-05,2.3e-05,9e-06,2e-06,3.3e-05,1.9e-05,2.6e-05,8e-06,1e-06,6e-06,5e-06,1.2e-05,6e-06,5e-06,1.8e-05,1.3e-05,1.3e-05,1.6e-05,1.7e-05,8e-06,6e-06,1.1e-05,2.5e-05,9e-06,8e-06,4e-06,2.4e-05,6e-06,2.6e-05,1e-05,7e-06,0,2.9e-05,3e-06,2e-06,7e-06,1.3e-05,6e-06,3e-06,1.2e-05,4.2e-05,1.1e-05,7e-06,6e-06,7e-06,3e-06,1.6e-05,2.7e-05,4e-06,1.5e-05,9e-06,1.5e-05,1.4e-05,1.2e-05,6e-06,8e-06,2e-05,2e-06,1.2e-05,7e-06,9e-06,6e-06,2.2e-05,8e-06,6e-06,1.4e-05,3e-06,1.4e-05,1.5e-05,2.3e-05,4e-06,2e-05,6e-06,6e-06,9e-06,5e-06,1.4e-05,6e-06,5e-06,5e-06,7e-06,9e-06,1.2e-05,1e-05,5e-06,7e-06,3e-06,8e-06,7e-06,9e-06,8e-06,7e-06,9e-06,1e-05,1.1e-05,5e-06,6e-06,2e-06,4e-06,7e-06,6e-06,7e-06,5e-06,1.4e-05,7e-06,5e-06
1.4e-05,1.2e-05,2.1e-05,1.7e-05,2.1e-05,2.7e-05,8e-06,2.1e-05,7e-06,2.5e-05,6e-06,1.5e-05,1.9e-05,2.1e-05,1.6e-05,2.8e-05,2.6e-05,1.1e-05,6e-06,3.8e-05,1.7e-05,2.9e-05,6e-06,1e-05,2e-05,1.1e-05,1.6e-05,1.2e-05,2e-06,1.4e-05,1.5e-05,1.4e-05,1.3e-05,2e-05,9e-06,1e-05,7e-06,2.3e-05,3e-06,1.1e-05,5e-06,2.3e-05,3e-06,2.9e-05,1e-06,6e-06,4e-06,2.5e-05,4e-06,3e-06,9e-06,1.7e-05,5e-06,1e-05,1.3e-05,4.1e-05,1.2e-05,1.4e-05,2e-06,1e-05,1e-06,1.6e-05,2.1e-05,5e-06,1.1e-05,8e-06,1.9e-05,7e-06,1e-05,6e-06,7e-06,2.6e-05,3e-06,1.1e-05,4e-06,5e-06,7e-06,2.5e-05,1.2e-05,7e-06,1.1e-05,3e-06,8e-06,1.2e-05,3.3e-05,1.7e-05,1.1e-05,4e-06,8e-06,3e-06,7e-06,9e-06,7e-06,5e-06,3e-06,5e-06,9e-06,1.4e-05,8e-06,3e-06,9e-06,6e-06,9e-06,7e-06,3e-06,8e-06,3e-06,1e-05,8e-06,8e-06,5e-06,8e-06,3e-06,3e-06,8e-06,6e-06,1.2e-05,8e-06,1.2e-05,6e-06,7e-06
1.8e-05,5e-06,1.8e-05,1.1e-05,1.4e-05,3.5e-05,9e-06,2e-05,4e-06,3.2e-05,3e-06,1.3e-05,9e-06,1.8e-05,1.3e-05,2.9e-05,3.3e-05,1.4e-05,8e-06,3e-05,2.6e-05,1.9e-05,7e-06,1e-05,1.3e-05,2e-06,3e-06,4e-06,6e-06,1.8e-05,1.3e-05,9e-06,1.3e-05,1.5e-05,6e-06,1e-05,3e-06,3.1e-05,6e-06,7e-06,6e-06,2e-05,4e-06,2.2e-05,4e-06,3e-06,5e-06,2.7e-05,1e-05,8e-06,3e-06,1.5e-05,5e-06,1.2e-05,4e-06,3.9e-05,2.1e-05,1.3e-05,6e-06,1.4e-05,5e-06,1.2e-05,2e-05,9e-06,1.5e-05,5e-06,1.6e-05,1e-05,1.6e-05,7e-06,3e-06,2.3e-05,3e-06,1.5e-05,7e-06,4e-06,6e-06,2.6e-05,7e-06,2e-06,1.3e-05,4e-06,7e-06,1.5e-05,2.9e-05,1.7e-05,9e-06,4e-06,1.2e-05,3e-06,4e-06,8e-06,6e-06,7e-06,8e-06,8e-06,5e-06,1.2e-05,1e-05,8e-06,7e-06,6e-06,1e-05,6e-06,3e-06,7e-06,4e-06,9e-06,7e-06,7e-06,5e-06,8e-06,2e-06,1e-06,5e-06,5e-06,1e-05,1e-05,1.1e-05,7e-06,5e-06
1e-05,1.1e-05,2.1e-05,1.6e-05,1.4e-05,3.2e-05,1e-05,1.5e-05,1.1e-05,3e-05,6e-06,1.1e-05,1.4e-05,2.1e-05,8e-06,2.4e-05,2.5e-05,7e-06,5e-06,3.7e-05,2.6e-05,2.2e-05,3e-06,7e-06,7e-06,2e-06,1.1e-05,1e-05,2e-06,2e-05,1.8e-05,1.8e-05,1.5e-05,6e-06,3e-06,9e-06,8e-06,2e-05,9e-06,3e-06,4e-06,1.8e-05,2e-06,2.8e-05,7e-06,2e-06,8e-06,2.7e-05,9e-06,1.2e-05,7e-06,1.5e-05,8e-06,7e-06,7e-06,3.7e-05,1.9e-05,7e-06,1.2e-05,8e-06,6e-06,1.1e-05,2.4e-05,9e-06,7e-06,9e-06,1.8e-05,8e-06,4e-06,8e-06,3e-06,2.7e-05,2e-06,1.3e-05,1e-05,1e-05,5e-06,2.2e-05,9e-06,6e-06,1e-05,3e-06,1e-05,1.3e-05,2.3e-05,1.6e-05,1.3e-05,6e-06,8e-06,3e-06,7e-06,9e-06,4e-06,3e-06,2e-06,5e-06,8e-06,1.2e-05,8e-06,1e-05,5e-06,6e-06,6e-06,6e-06,2e-06,1.2e-05,2e-06,9e-06,9e-06,6e-06,5e-06,7e-06,2e-06,5e-06,4e-06,3e-06,6e-06,1e-05,1.5e-05,1e-05,6e-06
2e-05,1.6e-05,1.3e-05,9e-06,5e-06,3.7e-05,5e-06,2.4e-05,6e-06,2.3e-05,2e-06,1e-05,7e-06,1.6e-05,3e-06,2.9e-05,2.6e-05,4e-06,5e-06,3e-05,2.6e-05,1.5e-05,6e-06,1.2e-05,8e-06,7e-06,2e-05,5e-06,5e-06,1.8e-05,1.5e-05,1.3e-05,1.3e-05,9e-06,8e-06,1.3e-05,1.1e-05,2.7e-05,6e-06,5e-06,5e-06,1.8e-05,8e-06,3.2e-05,8e-06,2e-06,7e-06,2.7e-05,1e-06,6e-06,6e-06,1.4e-05,7e-06,6e-06,4e-06,3.4e-05,5e-06,7e-06,1e-05,9e-06,1e-05,1.9e-05,2.5e-05,1.2e-05,1.3e-05,1.3e-05,1.9e-05,2e-05,9e-06,7e-06,4e-06,2.2e-05,1e-06,1e-05,3e-06,5e-06,8e-06,1.9e-05,5e-06,8e-06,1.1e-05,3e-06,1e-05,1.4e-05,2.2e-05,1.1e-05,6e-06,1e-05,1.6e-05,1e-06,5e-06,8e-06,4e-06,1e-05,3e-06,4e-06,9e-06,6e-06,1.2e-05,1.2e-05,4e-06,3e-06,8e-06,4e-06,3e-06,1.3e-05,5e-06,1e-05,8e-06,1.1e-05,3e-06,5e-06,1e-06,6e-06,5e-06,5e-06,5e-06,6e-06,1.2e-05,7e-06,5e-06
1.3e-05,1.2e-05,1.4e-05,5e-06,1e-05,3.6e-05,4e-06,2e-05,3e-06,2.9e-05,7e-06,7e-06,1e-05,1.9e-05,4e-06,2.5e-05,3e-05,1e-05,1e-06,2.7e-05,1.2e-05,3e-05,8e-06,9e-06,1.4e-05,6e-06,8e-06,4e-06,6e-06,2.5e-05,1.3e-05,1.1e-05,1.5e-05,1e-05,4e-06,9e-06,1e-05,2.8e-05,4e-06,1e-05,1e-06,2.5e-05,3e-06,2.6e-05,7e-06,1e-06,2e-06,2.6e-05,2e-06,4e-06,3e-06,3e-06,8e-06,7e-06,8e-06,3.2e-05,1.2e-05,2e-06,0,1.3e-05,9e-06,1.3e-05,2.6e-05,4e-06,1e-05,8e-06,1.4e-05,1.8e-05,1.1e-05,9e-06,5e-06,2.1e-05,3e-06,1.1e-05,4e-06,7e-06,9e-06,1.8e-05,2e-06,2e-06,1.3e-05,4e-06,1.3e-05,8e-06,2.6e-05,1.5e-05,9e-06,6e-06,1e-05,3e-06,5e-06,1e-05,5e-06,8e-06,5e-06,8e-06,8e-06,1.1e-05,1.2e-05,4e-06,4e-06,5e-06,9e-06,5e-06,1e-06,9e-06,1e-06,5e-06,1.1e-05,1.1e-05,8e-06,9e-06,2e-06,2e-06,2e-06,3e-06,3e-06,9e-06,1e-05,8e-06,4e-06
1.3e-05,1e-05,1.4e-05,8e-06,1e-05,3.2e-05,2e-06,2.1e-05,3e-06,2.4e-05,1e-05,2e-06,9e-06,1.5e-05,2e-06,2.4e-05,3.1e-05,6e-06,2e-06,3e-05,1.5e-05,2.3e-05,1e-05,4e-06,8e-06,8e-06,1.1e-05,2e-06,3e-06,1.8e-05,1.2e-05,1.2e-05,1.5e-05,1.1e-05,5e-06,1.1e-05,1e-05,2.8e-05,4e-06,5e-06,2e-06,2.5e-05,2e-06,2.6e-05,3e-06,3e-06,3e-06,2.4e-05,1e-06,2e-06,5e-06,9e-06,3e-06,1e-06,4e-06,3.3e-05,1e-05,4e-06,5e-06,5e-06,4e-06,1.3e-05,2.6e-05,6e-06,1.3e-05,7e-06,1.4e-05,1.3e-05,1.1e-05,3e-06,1e-06,2.4e-05,4e-06,1.3e-05,4e-06,6e-06,4e-06,1.7e-05,3e-06,1e-06,1.1e-05,2e-06,7e-06,1.2e-05,2.3e-05,1.3e-05,1.2e-05,0,9e-06,2e-06,5e-06,9e-06,4e-06,4e-06,4e-06,5e-06,7e-06,1.3e-05,1.1e-05,8e-06,3e-06,4e-06,9e-06,3e-06,3e-06,9e-06,2e-06,8e-06,8e-06,8e-06,6e-06,6e-06,3e-06,1e-06,5e-06,3e-06,5e-06,7e-06,1.1e-05,9e-06,4e-06
1.2e-05,1.2e-05,1.5e-05,7e-06,1.1e-05,3.1e-05,3e-06,1.7e-05,4e-06,2.5e-05,1.1e-05,5e-06,4e-06,1.5e-05,3e-06,2.4e-05,2.8e-05,7e-06,2e-06,3.1e-05,1.9e-05,2.2e-05,8e-06,4e-06,5e-06,5e-06,9e-06,2e-06,3e-06,2e-05,1.2e-05,1.4e-05,1.4e-05,1.1e-05,4e-06,1.1e-05,9e-06,2.7e-05,5e-06,7e-06,2e-06,2.4e-05,1e-06,2.3e-05,4e-06,1e-06,1e-06,2.4e-05,1e-06,0,4e-06,1e-05,2e-06,1e-06,2e-06,3.6e-05,1.2e-05,4e-06,5e-06,5e-06,3e-06,1.2e-05,2.4e-05,3e-06,1.3e-05,9e-06,1.3e-05,1.2e-05,1.1e-05,3e-06,1e-06,2.3e-05,1e-06,1e-05,4e-06,6e-06,6e-06,1.9e-05,3e-06,1e-06,1.3e-05,2e-06,8e-06,1.2e-05,2.3e-05,1.1e-05,1.3e-05,1e-06,1.1e-05,2e-06,4e-06,9e-06,3e-06,4e-06,4e-06,7e-06,8e-06,1.1e-05,1e-05,8e-06,3e-06,5e-06,9e-06,2e-06,3e-06,8e-06,1e-06,8e-06,9e-06,8e-06,5e-06,7e-06,3e-06,2e-06,4e-06,4e-06,4e-06,7e-06,1.1e-05,9e-06,5e-06
