-0.000901,-0.00087,-0.00074,-0.00049,-5e-04,-0.000412,-0.000398,-0.000296,-0.000246,-0.000194,-0.000234,-0.000212,-0.000215,-0.000149,-0.000131,-0.000284,-0.000324,-0.000256,-0.000222,-0.000232,-0.000227,-0.000105,-0.000102,-0.000124,-0.000142,-0.000175,-0.000537,-0.000735
-0.001442,-0.001271,-0.001094,-0.000838,-0.000622,-0.000487,-0.000549,-0.000427,-0.000393,-0.000303,-0.00029,-0.000317,-0.000357,-0.000233,-0.000181,-0.000402,-0.000354,-0.000276,-0.000249,-0.000246,-0.000217,-0.000145,-0.000148,-0.000173,-0.000186,-0.000321,-8e-04,-0.000759
-0.00033,-0.000227,-0.000299,-0.000368,-9.7e-05,-0.000116,-0.000212,-0.000161,-0.000257,-0.000232,-0.000166,-0.000173,-0.000189,-0.00017,-0.000173,-0.000254,-0.000151,-0.000147,-0.000125,-0.000186,-0.00016,-0.00017,-0.00015,-0.000222,-0.000346,-0.00042,-0.00042,-0.000382
0.001091,0.001034,0.000731,0.000335,0.000425,0.000335,0.000265,0.000204,0.000105,7.8e-05,0.000141,0.000123,0.000112,3e-05,9e-06,0.000134,0.000224,0.000119,8.9e-05,6.9e-05,9.1e-05,-1.3e-05,-6e-06,-4.7e-05,-0.000139,-0.000184,0.000215,0.000478
0.001214,0.001142,0.000957,0.000485,0.000302,0.00028,0.000302,0.000228,0.000255,0.000247,0.000249,0.000171,0.000163,0.000139,2e-04,0.00037,0.000356,0.000248,0.000159,0.000237,0.000221,0.000108,0.000105,0.000165,0.000169,8.8e-05,0.000423,0.000779
-8.3e-05,7.6e-05,0.000166,-3.1e-05,-0.00028,-0.000215,-0.000179,-0.000185,-2e-06,4.4e-05,-4.7e-05,-0.000107,-5.4e-05,3.8e-05,0.000105,9e-05,-0.000123,-8.5e-05,-5.9e-05,-1.2e-05,-7.4e-05,-5e-05,6e-06,8.3e-05,6.3e-05,-2.7e-05,6e-06,-5.6e-05
-0.001023,-0.000766,-0.000635,-0.000422,-0.000457,-0.00032,-0.000349,-0.000392,-0.000165,-0.000127,-0.000215,-0.000209,-0.000141,-5.3e-05,-7.1e-05,-0.000167,-0.000368,-0.000226,-0.00012,-0.000137,-0.000158,-0.000107,-5.4e-05,6e-06,5e-05,-6e-06,-0.000282,-0.000387
-0.000839,-0.000694,-0.000671,-0.000278,-7.6e-05,3e-05,-2.3e-05,-0.000151,-8.1e-05,-1e-04,-8.2e-05,-4.4e-05,-2.1e-05,-1.8e-05,-0.000109,-0.000148,-4.8e-05,6.1e-05,6.8e-05,1.3e-05,2.9e-05,0,-2.4e-05,2.6e-05,0.000135,0.000159,-0.000191,-0.000215
-0.000216,-0.000135,-0.000153,5.9e-05,0.000227,0.000229,0.000232,0.000137,4.6e-05,-9e-06,5.6e-05,0.000106,9.4e-05,3.5e-05,-7.7e-05,-7.6e-05,0.000201,0.000184,0.000105,5.7e-05,4.1e-05,4.4e-05,4e-06,-3.5e-05,0,0.000102,-8e-05,-0.000298
0.000203,0.000305,0.000402,0.000283,0.000158,0.000129,0.000169,0.00017,0.000125,0.000133,0.00014,0.000112,6.4e-05,2.4e-05,9e-06,6.5e-05,0.000228,9.6e-05,1e-06,5.9e-05,4e-05,5e-05,1.9e-05,-5.4e-05,-1.5e-05,0.000108,0.000118,6.8e-05
7.3e-05,0.000202,0.000506,0.000222,-0.000116,-0.000127,-0.000128,-6e-06,3.4e-05,0.00014,7.3e-05,-6.2e-05,-8.6e-05,-2.1e-05,9.4e-05,0.00013,3.5e-05,-5e-05,-9.7e-05,1.2e-05,8e-06,-4.4e-05,-2.4e-05,5e-06,3.4e-05,9.2e-05,0.000372,0.00041
-0.000249,-0.000176,5.7e-05,-7e-05,-0.000215,-0.000258,-0.000326,-0.000152,-0.000159,-6.2e-05,-0.000119,-0.000172,-0.000141,-5.9e-05,5.6e-05,1.9e-05,-0.000292,-0.000247,-0.000143,-0.000165,-0.000174,-0.000187,-7.4e-05,-2.7e-05,-0.000103,-9.9e-05,0.000372,0.000235
-0.000178,-0.000353,-0.000492,-0.000235,3.5e-05,-2.3e-05,-7.1e-05,-3.9e-05,-0.000169,-0.000183,-0.000131,-2.8e-05,-7e-06,-5.5e-05,-5.5e-05,-8.9e-05,-0.00033,-0.000258,-0.000107,-0.000166,-0.000143,-0.000153,-5.1e-05,-4.3e-05,-0.000113,-0.000133,2.3e-05,6.2e-05
7e-06,-0.000402,-0.000729,-0.000204,0.00022,0.000177,0.000259,0.000215,2e-06,-0.000127,2.5e-05,0.00018,0.000149,-4e-06,-0.000138,-0.00016,-8.1e-05,-5.6e-05,-2.8e-05,9e-06,4.4e-05,-1.3e-05,-1.7e-05,-1.3e-05,-2e-05,-9.2e-05,-0.000437,-0.000371
-0.000133,-0.000346,-0.000449,-9e-05,6.2e-05,7.1e-05,0.000208,0.000229,0.000147,-2.3e-05,8.7e-05,0.000182,0.000137,2.9e-05,-0.00011,-0.000162,9.8e-05,6.1e-05,3.8e-05,9.8e-05,7.6e-05,0.000104,1.5e-05,-4.9e-05,-4.3e-05,-0.00011,-0.000525,-0.000609
-0.000339,-9.2e-05,0.000257,8.8e-05,-0.000129,-4.1e-05,4e-06,5.3e-05,0.000223,0.000134,6.6e-05,3.6e-05,4.4e-05,3.9e-05,3e-05,2.6e-05,0.000135,9.3e-05,0.000115,0.000163,0.00015,0.00022,6.5e-05,-2.6e-05,6.1e-05,8.7e-05,-2.9e-05,9.4e-05
-0.000423,2e-05,0.000606,0.000152,-0.000114,-7.9e-05,-0.000153,-0.000106,0.000109,0.000178,5e-06,-9.8e-05,-2.8e-05,3.5e-05,9e-05,9.4e-05,-3.6e-05,6.7e-05,0.000136,0.000117,0.000126,0.00013,2.8e-05,3.4e-05,0.000166,0.000212,0.000424,0.000554
-0.000289,-7e-05,0.000116,-8.3e-05,6e-06,-4e-05,-0.000167,-0.000131,-9.4e-05,1.3e-05,-8.1e-05,-9.5e-05,-3.7e-05,2.3e-05,4.6e-05,-1e-05,-0.00022,-6.9e-05,-9e-06,-8.3e-05,-8.8e-05,-7.2e-05,-3.9e-05,8e-06,4.6e-05,2.9e-05,0.00032,0.000278
6.2e-05,-0.000141,-0.000554,-0.00029,8e-05,4.8e-05,-2e-06,-3.2e-05,-0.000146,-9.2e-05,-5.3e-05,2e-06,-1.7e-05,-2.2e-05,-2e-05,-4.2e-05,-0.000135,-0.000119,-0.00013,-0.000146,-0.000122,-0.000102,-3.4e-05,-2.1e-05,-4.3e-05,-9.9e-05,-9.9e-05,-4.2e-05
