0.000366,-0.000128,0.00013,-0.000178,-0.000703,-0.000546,-0.001234,-0.000774,-0.000311,-0.000791,-0.000269,-0.000298,-2e-05,-7.5e-05,0.000227,4.1e-05,-0.000481,0.000231,-0.00017,-0.000463,-0.000179,-0.000961,-0.000797,-0.000212,0.000475,-0.00034,-0.000451,6.8e-05,0.00024,-0.000719,-0.00024,-0.000139,-0.000465,-0.000595,-0.000299,-0.000109,-0.000204,5.3e-05,-0.000877,-0.000865,-0.00082,0.000872,0.001068,0.000455,0.000385,0.000379,0.001707,0.000782,0.000571,0.000449,0.000908,0.000621,-0.00013,-0.000669,-0.000418,-0.000401,0.001791,0.001256,-0.00016,-0.000117,0.000551,-0.000383,-7.2e-05,-0.000147,-0.000645,0.000649,0.000384,0.000426,0.000832,-3.5e-05,0.000383,0.000426,0.000368,-6.9e-05,-0.000535,1e-06,4.4e-05,-0.000146,7.9e-05,-0.000391,0.000256,0.00029,-0.000217,-7.7e-05,0.000165,-0.000262,-0.000841,-0.000341,-0.000617,-0.00056,-0.000173,-0.000166,-0.000128,-0.000446,-0.00045,-0.000623,-0.000447,-0.000356,-0.000961,-0.000921,-0.000696,-0.001395,-0.001082,-0.00062,-0.000651,-0.000974,-0.00045,0.000981,0.000826,0.000453,0.000294,-0.000359,-0.000332,-8e-05,-0.000311,-0.001351,-0.000127,1.2e-05,-0.000282,-0.000967,-0.001286
2.4e-05,-5e-05,-0.000506,6.8e-05,0.000368,0.000175,0.000608,0.000203,-2.3e-05,0.000454,-0.000568,-0.000781,-0.001055,-0.000222,-0.000434,-6.7e-05,0.000194,0.000308,-0.00055,-0.000118,-0.000633,0.000253,-0.001293,-0.00088,-0.001294,-0.000563,-0.000714,-0.000327,-0.000181,-9e-05,-0.000552,-0.000465,0.000224,0.000287,-0.000461,-0.000213,0.000296,-0.000664,-6.4e-05,-0.000105,0.00072,-0.000448,0.000194,-1.5e-05,-0.001579,-0.000168,-0.001012,-0.002307,-0.003375,-0.002285,-0.003186,-0.001323,-0.001122,-0.001517,-0.001347,-0.000904,-0.003357,-0.003141,-0.001871,-0.001504,-0.001332,-0.000107,-0.001816,-0.002633,-0.000613,-0.001013,-0.001559,-0.001149,-0.00163,-0.001681,-0.000336,-0.000846,-1.3e-05,-0.000596,-0.000848,-0.00023,0.000178,-0.000634,-0.000594,0.000248,-0.001189,-0.001511,-0.000506,-0.000147,-0.000414,-0.000608,-0.000941,-0.000377,-0.000571,0.00012,8.5e-05,-0.000757,-0.000394,-0.000877,-0.00118,5e-06,-0.000415,-6.3e-05,-0.000279,0.000288,-3.1e-05,0.000851,0.000612,0.000638,-0.00021,-0.000101,3.8e-05,0.00035,0.000205,-2e-04,0.000855,0.000344,-0.00022,0.000192,0.000129,0.000163,-0.000655,0.000922,0.000164,0.000199,0.000625
-0.001287,-0.000723,-0.001327,-0.000501,-0.001127,-0.000295,-0.000316,-6.3e-05,-0.000148,-0.000186,-0.000767,-0.000134,-0.000115,3.3e-05,-0.000341,-8.4e-05,-2.9e-05,-0.000119,-0.000327,-0.00018,0.00019,-0.000256,-0.000168,0.000547,-0.001258,-0.000326,0.000188,0.000208,9.6e-05,0.000754,0.000357,-0.000308,9.9e-05,-2.1e-05,0.000163,9.1e-05,2.9e-05,0.000734,0.000386,0.00032,9.8e-05,-0.001324,-0.001597,-0.000414,0.000192,-0.000469,-0.000987,-3.7e-05,-0.000176,-0.000194,-0.000701,-0.00058,-0.001361,-0.000212,0.000698,-5.5e-05,-7.4e-05,5.4e-05,-0.001137,0.00021,-0.000654,-0.000417,-0.000818,0.000787,0.000388,-0.000675,-0.000249,-0.000523,-3.5e-05,7e-05,-0.000591,-0.000298,-0.001044,9.9e-05,-0.000109,-8.5e-05,-8e-05,-2e-04,0.000139,0.000494,-0.000354,-0.001297,-0.000285,5.2e-05,0.000656,0.000221,0.00066,-0.000121,-0.000317,-0.000262,-0.000309,-0.000676,-0.000293,-0.000328,-0.000565,0.000292,-0.00024,-0.00032,-0.000112,-0.000595,-0.000191,-0.000282,-0.000341,7.1e-05,-0.000858,-0.000413,-0.000561,-3.5e-05,0.000361,0.000287,-0.000972,-5e-05,-0.000397,-0.000571,-0.001103,-0.000713,-0.000564,-0.001059,-0.001188,-0.000483,-0.000727
-0.00053,0.000272,-6.1e-05,-1.7e-05,-3.1e-05,-2.4e-05,0.000165,-0.000381,6.8e-05,-0.000626,0.000183,-0.000274,0.000176,0.000475,-0.000532,-0.000589,-0.000303,-5.6e-05,-0.00011,-0.000218,0.000196,0.000282,0.001211,0.000778,0.000303,-0.000117,0.000205,-0.000792,-0.000393,-0.000101,-0.000322,-0.000117,-0.000391,-0.000506,-0.000189,0.000961,0.000888,0.000321,-2.4e-05,-0.000303,-1.4e-05,-0.000763,-0.000164,-8.5e-05,0.000225,0.000466,0.001235,0.001554,0.000764,0.000803,0.00155,0.001239,0.001364,0.001111,0.000715,0.000121,0.001163,0.002109,0.002155,0.00171,0.000664,0.000336,0.000773,0.001004,0.000246,-0.00023,0.000758,0.000464,0.000192,0.000394,0.00057,0.000661,0.000272,8e-05,0.000647,-0.000127,-0.000253,0.000583,-8.6e-05,-0.000593,2e-04,0.001725,0.001125,0.000401,0.000324,-0.000881,-0.00068,0.000139,0.000638,0.000821,0.000731,9.4e-05,-0.000312,-0.000128,0.001585,0.000136,-0.000722,-0.000333,0.000371,0.000486,0.000114,0.000113,-0.00023,-0.000234,0.000372,0.00068,0.000773,3.3e-05,0.000419,0.000764,0.000442,-0.000366,4.8e-05,0.000367,-0.000181,0.000194,0.000248,-0.000615,0.000885,-0.000466,0.000421
-0.000328,-6.3e-05,7e-05,-0.00016,-0.000564,-0.000251,1.6e-05,0.000199,-0.000144,-0.00017,0.000502,0.000339,0.000123,-1e-04,-0.000525,-1.4e-05,6.1e-05,0.000307,-7.6e-05,-0.000355,-0.000522,-0.000502,-0.000639,-0.000948,0.000338,9.6e-05,4.6e-05,6.1e-05,-4.6e-05,-0.000247,-0.00033,-4.1e-05,6.8e-05,0.000417,-2.4e-05,-0.000261,-0.000698,-0.000457,-0.000267,4.5e-05,-0.000473,0.000181,-0.001071,-0.000125,-8.1e-05,-0.0012,-1.8e-05,-6.5e-05,-0.000462,0.000189,7.1e-05,-0.000267,2.3e-05,0.000153,-0.000639,4.5e-05,-0.000157,-8.1e-05,0.000455,-0.000785,-0.000674,-0.000149,0.000473,-0.000478,-9.2e-05,-0.000276,0.000449,0.000331,-0.000259,0.000393,9.5e-05,0.000347,7.5e-05,0.000118,-0.000599,-0.000193,0.000439,3.2e-05,-0.000809,-0.000234,-0.000135,-6e-05,-1.4e-05,-0.000442,-0.000284,-0.000217,0.000244,-0.000235,-0.000292,-1e-04,0.000197,0.000322,0.000599,0.000226,0.000297,0.000341,1.2e-05,0.000133,-0.000177,-0.000556,-0.000494,-0.000297,9.1e-05,-0.000108,-7e-05,0.000305,-0.000264,-0.000376,-0.000393,-9e-04,-0.000359,0.000112,0.000506,0.000447,0.000305,-0.000509,-0.000335,-0.000279,-0.000675,-0.00056,-9e-04
0.000524,4.9e-05,-0.000278,-0.000814,-2.1e-05,0.000184,0.000266,-7.7e-05,-0.000199,8.9e-05,-6.8e-05,9.2e-05,-0.000202,0.000106,0.000279,9.1e-05,-0.000223,-0.000447,-9.8e-05,3.2e-05,0.000218,-0.00038,-0.000457,0.000104,-0.000646,-0.000727,-0.000202,-0.00068,-0.000764,-0.000238,0.000318,-0.000657,-0.000816,-0.000545,1.6e-05,-0.000248,-0.000605,-0.000743,-0.000387,-0.000184,0.000409,-0.000231,-0.000363,-0.001185,-0.000445,-3e-05,-0.00132,-0.001292,-0.00056,-0.001278,-0.000927,-0.001187,-7.4e-05,-0.000985,-0.000542,0.000119,4.1e-05,-0.001033,-0.001047,-0.000589,-0.000678,-0.000392,0.000237,-0.000113,-0.000581,1.4e-05,-0.000348,-0.000128,-0.00029,-0.000904,-0.000604,-0.000553,-0.000384,-6e-05,3.1e-05,-0.000248,-0.00018,-0.000929,-0.000195,-0.000516,-3.8e-05,-0.000332,-0.000686,-0.000236,-0.000595,0.000383,0.000126,-0.000556,-0.000649,-0.000615,-0.000524,-0.000171,0.000135,0.00014,-0.000499,-0.00036,-0.000417,-0.000384,-0.000244,0.000725,0.000105,-0.000275,0.00026,2e-05,8.6e-05,-0.000626,-0.000537,2.7e-05,-0.001095,-0.000599,-0.000559,-0.00067,-0.000932,-0.000121,0.000231,0.000165,-0.000391,1.9e-05,0.000627,0.000559,1e-05
0.000161,0.000115,-0.000413,-0.000138,0.000342,0.000202,3.6e-05,2.2e-05,-0.00032,-5.6e-05,0.000385,-5.5e-05,0.000192,0.000375,-0.000159,-0.000234,0.000167,-1.1e-05,7.1e-05,0.000174,-0.000275,0.000253,0.000241,0.000672,0.000366,4.7e-05,-1e-05,-0.000221,-0.000178,-0.000361,-0.000697,-0.000136,9.5e-05,0.000148,-0.000322,0.000174,0.000244,3.4e-05,0.00025,0.00023,0.00015,-3.1e-05,0.000673,0.000175,-0.000302,0.000566,0.000392,-2.7e-05,0.001033,0.000481,0.000351,0.000309,-0.00085,-0.000165,0.00047,0.000152,-4.5e-05,2.7e-05,0.000264,-0.000299,0.000285,-5.9e-05,-9.1e-05,-0.000356,0.000159,-0.000554,-0.000405,-0.000692,-0.000103,-2.9e-05,7.5e-05,-3e-04,-0.000379,0.000161,0.000103,0.000587,-0.000529,-0.000203,-7.1e-05,-0.000226,0.000273,-0.000183,-5.7e-05,-0.000124,0.000266,-0.000257,-0.000156,7.8e-05,-0.000274,2.7e-05,0.000106,-0.000139,0.000204,0.000107,-0.000371,-0.000368,0.000486,-0.000154,-0.000143,-0.000161,0.000114,9.4e-05,-0.000367,-0.000205,0.000129,0.000154,0.000202,-0.000176,-1e-06,-0.000371,-0.000663,-0.000258,-2.9e-05,-0.000301,-0.000417,0.000252,-4e-05,0.000369,0.000182,-0.000329,6.6e-05
-8.3e-05,-0.000163,0.000334,0.00069,3.3e-05,-0.000388,-2e-04,-0.000105,0.000168,-2.3e-05,-0.000357,-0.000611,-0.000565,-0.000131,-0.000131,3.1e-05,6e-06,0.000156,0.000115,0.000266,0.000239,0.000117,-5.4e-05,-0.000492,0.000192,0.000517,7.1e-05,0.000375,3.5e-05,-4.3e-05,-9.4e-05,6.1e-05,5e-05,9.7e-05,1.7e-05,-3.3e-05,-5.3e-05,-2.4e-05,-0.000259,-0.000201,-0.000387,0.000145,0.000565,1.3e-05,6e-05,-0.00016,-8.8e-05,0.000222,0.000356,0.001358,9e-05,0.000529,0.000176,0.000311,1e-05,-0.000694,2e-05,0.000608,0.000943,0.000888,0.000517,0.00058,-2.5e-05,7.2e-05,0.000168,0.000363,-6.5e-05,0.000319,0.000349,0.000503,0.000466,0.000217,0.000239,-0.000405,1e-05,-0.000216,2e-05,-0.000239,4.8e-05,0.000174,-9.7e-05,0.000521,0.000762,0.000607,-0.00033,6.6e-05,0.000222,0.000353,0.000356,0.00012,-0.000115,0.000428,-0.000164,0.000322,0.000425,7.6e-05,-0.000439,-0.000312,-1e-06,-0.00033,-0.000191,6e-06,0.000156,0.000133,3e-06,0.000152,0.000263,-0.000239,-1.2e-05,0.000103,0.000383,-0.000398,2.1e-05,0.000136,0.000125,0.000291,0.000717,-3.6e-05,0.000101,0.00034,-3.5e-05
-5.6e-05,-0.000135,0.000157,0.000175,-3e-06,-0.000107,-6e-06,-0.000128,5.3e-05,7.4e-05,3e-06,0.000364,0.000349,-0.000419,-9.5e-05,1.4e-05,-6.1e-05,-0.00019,-9.2e-05,0.000152,3.5e-05,-0.000244,0.000159,-2.3e-05,-0.000234,-0.000199,-0.000524,0.000199,4.8e-05,-0.000384,0.000152,-7.2e-05,-3.8e-05,-0.000328,-0.00017,-0.000942,-0.000462,-6.1e-05,2e-05,-8.4e-05,0.000173,-1.9e-05,-4.1e-05,0.000428,-0.000115,-7.9e-05,-6.1e-05,0.000111,-0.000516,-0.000356,2.5e-05,0.000201,0.000498,0.000245,-0.000171,0.000321,4.8e-05,-0.000127,-0.000643,-0.000269,-0.000461,0.000129,1.6e-05,0.000133,-0.000183,-0.000107,-0.000243,1.6e-05,0.000504,-1.4e-05,-0.000361,8.3e-05,0.000194,-0.000357,-6.6e-05,-0.000307,-0.000134,0.000263,-0.000215,6.8e-05,0.000234,-2.3e-05,-0.000307,-0.000445,-0.000274,2e-04,-0.000322,-0.000305,-0.000234,-0.000205,-6.6e-05,-8.6e-05,-0.000218,-4.6e-05,-8.1e-05,0.00021,0.000145,0.000617,-3.7e-05,3.7e-05,0.000104,-2.9e-05,-0.000301,-0.000159,6.1e-05,-1.9e-05,-0.000233,-0.000434,-9.9e-05,-8.8e-05,-1e-05,0.000377,-2e-04,0.000171,9.3e-05,-7.8e-05,-0.000363,-9e-05,-0.000292,-3.4e-05,0.00037
0.000137,0.00013,0.000182,9.7e-05,0.000161,5.8e-05,-0.000241,-8.1e-05,-9.5e-05,-2.2e-05,-1.8e-05,0.000162,-4.3e-05,-0.000153,8.3e-05,-1.8e-05,0.000406,0.000209,0.000105,-0.000163,3.8e-05,0.000176,6.9e-05,-4e-05,-7.9e-05,0.000144,0.000167,-0.000295,-3e-05,0.000195,-0.000241,-0.000128,6.9e-05,0.000393,7.3e-05,0.000213,0.000207,8e-06,-0.000179,0.000205,-0.000115,-0.000115,6.7e-05,0.000129,-0.00017,-7.3e-05,0.000239,-8e-06,-0.000298,-0.000269,-0.000389,-0.000314,-0.000579,-0.000266,-2e-04,7e-06,0.00016,5.4e-05,-0.000313,-0.000345,0.000146,-4e-05,-0.000115,8e-06,-6e-06,0.000133,0.000227,0.00019,-0.000314,1.9e-05,-0.000245,-0.000125,0.000162,-2.8e-05,-0.000172,0.00029,7.2e-05,8.1e-05,0.00034,-8.9e-05,-3.6e-05,8.1e-05,-0.000113,-7e-05,0.000162,0.000295,-0.000204,0.000152,8.2e-05,0.000109,-0.000371,-7e-06,0.000203,-4.2e-05,-4.7e-05,-0.00012,0.000261,9.9e-05,0.000175,-1e-06,-4.5e-05,2.7e-05,4e-05,4.7e-05,-6.7e-05,-0.000107,-6.5e-05,0.000498,0.00051,1.8e-05,-9.3e-05,0.000326,0.000279,-8.1e-05,7.8e-05,-0.000205,0.000205,0.00022,-4.2e-05,-0.000232,-0.000156
-0.000219,3.1e-05,-7.3e-05,-0.00012,0.000149,-1.1e-05,9.9e-05,7.1e-05,6.8e-05,7.4e-05,-7.7e-05,1e-04,-7.7e-05,0.000371,0.000109,-3e-05,-1e-05,-2.1e-05,-5.6e-05,-0.000143,6.7e-05,-2.7e-05,0.000129,0.00044,0.000382,-0.000166,0.000138,-8e-06,0.000138,-9.6e-05,-6.5e-05,0.000196,-5.2e-05,-0.000134,8.5e-05,0.000147,-0.000202,0.000262,0.000201,5.9e-05,-4.8e-05,9.9e-05,-0.00024,0.000202,0.000246,0.000258,0.000426,0.000154,0.00012,-1.3e-05,9.1e-05,1.1e-05,-5e-06,-0.000146,0.000112,-0.00037,-9e-05,-0.000159,2.2e-05,0.000218,0.00013,-3.4e-05,-0.000324,0.000104,7e-05,-0.000103,-8.4e-05,-8e-05,-2.5e-05,8e-06,0.000147,-1e-05,-0.000211,0.00027,-0.000118,-3.7e-05,0.000167,-0.00019,-1.6e-05,0.000389,-0.000111,-1.2e-05,-1.6e-05,2.4e-05,0.000164,-6.6e-05,0.000172,-0.000221,8e-05,-2.7e-05,0.000199,2.5e-05,-3.7e-05,-0.000397,5.4e-05,8.8e-05,1.8e-05,-2.2e-05,-0.00014,-1.2e-05,-7.3e-05,-6e-05,-1e-05,-6.6e-05,-0.000178,-0.000115,-2.9e-05,-7.6e-05,-0.000201,0.000351,0.000241,0.00013,-0.00014,-0.000164,2e-06,-9.4e-05,5.4e-05,7.7e-05,-0.000121,-0.000278,2.3e-05
-6.1e-05,0.000134,-3.3e-05,6.7e-05,-9.5e-05,4e-06,-1.8e-05,4.1e-05,-0.000137,0.000184,0.000101,4.4e-05,-3.8e-05,-0.000104,-3.2e-05,5.3e-05,-3.8e-05,8e-06,-1.6e-05,8.7e-05,-4.3e-05,6.4e-05,-8e-06,-0.000365,-0.000239,0.00012,0.000181,6.3e-05,0.000166,0.000117,2.7e-05,-0.000225,-7e-06,-8.7e-05,-6.5e-05,5.1e-05,0.000121,-0.000104,0.00021,-0.000132,-2.3e-05,-3.2e-05,0.000198,-6.7e-05,0.000289,0.000181,-0.000267,6.7e-05,7.1e-05,-0.000124,0.000465,-8e-05,0.000427,-1.9e-05,0.000113,1.6e-05,-0.00022,-0.000152,7.1e-05,-7.2e-05,0.000205,5.4e-05,2.3e-05,-8.8e-05,3.9e-05,0.000127,0.000183,-3.8e-05,6.4e-05,-7.4e-05,0.000126,0.000257,4e-05,2e-06,-0.000187,-9.8e-05,0.000236,0.00021,8e-05,-0.000129,8e-05,-0.000209,-7.9e-05,9.3e-05,5.1e-05,2.8e-05,-3.3e-05,-8.3e-05,1.5e-05,3.1e-05,6.9e-05,-1e-06,-0.000203,2.1e-05,-0.000161,-9e-05,-0.000172,1.6e-05,7e-05,-0.000271,2.1e-05,0.000102,3e-06,-3.4e-05,-7.8e-05,-2.6e-05,1e-06,2e-05,-0.000133,7e-06,0.000157,-0.000235,3e-06,-0.000147,-4.9e-05,0.00012,-0.000159,-0.000153,-0.000179,0.000192,-6.6e-05
-8.7e-05,-0.000242,-0.000157,4.4e-05,-2e-04,0.000108,7.5e-05,-2e-05,6.9e-05,-0.000136,7.4e-05,-8e-06,-5.5e-05,-3.8e-05,1.5e-05,2.2e-05,-3.1e-05,-4.1e-05,1e-06,4.3e-05,-8e-05,7e-06,-0.000136,-3.5e-05,-4.1e-05,-9.3e-05,-0.000119,7.2e-05,-8.3e-05,6.8e-05,0.000118,0.00029,8.4e-05,-6.8e-05,0.000129,0.000115,8e-05,5.2e-05,-0.000122,7.8e-05,-1e-06,-1.2e-05,2e-05,-0.000173,0.000169,-5.6e-05,-8.3e-05,-8.9e-05,-2.6e-05,-0.000189,-0.000142,0.000177,8.2e-05,0.000171,-5e-06,0.00035,0.000148,8.2e-05,2.3e-05,-1.1e-05,1e-05,-6.4e-05,0.000242,4.7e-05,-2.6e-05,0.000282,1.4e-05,-9e-06,7.3e-05,2.6e-05,0.000178,-0.000114,-7e-06,-7.3e-05,0.00016,0.000122,-0.000335,-0.000156,-1.4e-05,2.4e-05,-0.000172,-9.7e-05,-1.7e-05,-1.3e-05,-2.7e-05,0.000119,-3.9e-05,8.8e-05,-2.8e-05,-8e-06,0.000106,-5.2e-05,6.4e-05,9e-05,-4.1e-05,-3.7e-05,7.9e-05,-0.000142,0.000197,8.5e-05,0.000104,-6.8e-05,2.1e-05,6.8e-05,6e-06,0,9.8e-05,-6e-05,0.000164,1.8e-05,-0.000108,0.00012,3e-05,3.1e-05,8.5e-05,2.3e-05,-7.3e-05,-0.000135,0.000146,0.000254,1.5e-05
8.8e-05,0.000114,8.5e-05,6.1e-05,0.000111,2.4e-05,-0.000104,2.2e-05,-3.3e-05,-4.3e-05,-1.7e-05,-0.00014,1.1e-05,-4.2e-05,-3.9e-05,-8e-06,-0.000164,-2.6e-05,4e-06,-2.5e-05,-1e-04,-9.1e-05,3.5e-05,-0.000153,0.000123,0.000129,-2.3e-05,-2.8e-05,-0.000122,-4.4e-05,1e-06,-9.5e-05,-6e-06,0.000188,-2.2e-05,-3.7e-05,9.8e-05,-1.3e-05,0.000109,3.4e-05,6e-06,4.9e-05,-9.5e-05,-0.000153,-0.00011,-3.8e-05,2e-05,-3e-06,-0.000133,0.000227,7.6e-05,1.6e-05,-0.000188,-1.2e-05,-3.8e-05,-0.000171,-0.000115,3.5e-05,-1.4e-05,5.3e-05,-0.000114,-4.1e-05,0.000102,-9.7e-05,7.9e-05,-0.000359,1.1e-05,-2.1e-05,-4.7e-05,-2.2e-05,-0.000122,-6.8e-05,1e-06,5.7e-05,0.00012,1.7e-05,5.1e-05,1.9e-05,-3.2e-05,-9.4e-05,-8e-05,-6.9e-05,5.2e-05,-1.4e-05,-9.9e-05,-0.000106,6.5e-05,6.8e-05,-0.000148,-8e-06,-3.6e-05,-5.8e-05,3.5e-05,1.6e-05,-8e-05,4.2e-05,5.9e-05,-8e-06,-0.000121,0.000118,-4.5e-05,9e-05,5.7e-05,-2.3e-05,-3.7e-05,9e-05,1.7e-05,0.000144,4.8e-05,-4e-05,6e-05,2.6e-05,0.000112,-0.000101,5.9e-05,-8.7e-05,7e-06,0.000128,-4.6e-05,1.4e-05,-2.4e-05
2e-06,-3.1e-05,-1.5e-05,-5.7e-05,9e-06,-7e-06,-3e-06,-7e-06,4e-05,0.000116,6.1e-05,-6e-06,5.1e-05,1e-06,4e-06,-2.4e-05,1.8e-05,-2e-06,-2e-06,-6.6e-05,7.5e-05,5e-06,-5e-06,0.000136,-3.4e-05,-9.2e-05,-5e-06,0.000113,4.1e-05,4.1e-05,-5.8e-05,-3.3e-05,-2.1e-05,-6e-05,1e-05,-2.8e-05,8.8e-05,9e-06,-7.4e-05,-9e-05,-3.5e-05,5e-06,3e-06,9.1e-05,-3.8e-05,2.3e-05,2e-06,-7e-06,1.4e-05,6.2e-05,-4e-05,-2.7e-05,-5.1e-05,6.2e-05,-0.000102,5e-06,-6e-06,-1.2e-05,-5e-05,-1.6e-05,3.5e-05,7e-06,-0.000119,2.2e-05,-7.7e-05,4e-05,-2.5e-05,4.6e-05,-6.3e-05,-7.1e-05,-6.7e-05,9.8e-05,1.8e-05,0.000134,8.7e-05,7.5e-05,7.5e-05,0.000126,7e-05,0.000201,0.000126,-2.8e-05,-5.4e-05,-9e-06,7.7e-05,-8.5e-05,0.000123,5.3e-05,0.000106,3e-05,4.4e-05,-2.9e-05,2e-06,-1e-04,6.7e-05,3.9e-05,-7e-06,6.4e-05,-1.1e-05,-4e-05,3.8e-05,-7.8e-05,0.000118,1e-05,5.3e-05,8.5e-05,-6.7e-05,-1.9e-05,5.1e-05,-0.000133,-3.7e-05,-4e-05,-6.3e-05,8.2e-05,-2.7e-05,-5.9e-05,8.9e-05,-1.3e-05,6e-05,-0.000157,8.9e-05
-1.6e-05,-3.2e-05,6.7e-05,-6.1e-05,7.3e-05,-1.4e-05,5.7e-05,-1.6e-05,2.8e-05,-4.2e-05,-1.2e-05,-4.1e-05,-1.6e-05,0.000122,-1e-06,2.5e-05,6.9e-05,-5.7e-05,-2e-06,-2e-06,2.8e-05,2.4e-05,-1e-05,-1.1e-05,2.5e-05,3.6e-05,1.2e-05,-7.4e-05,3.2e-05,-5e-05,0.000108,8.9e-05,3.8e-05,-1.6e-05,-1.7e-05,6.5e-05,-8.4e-05,8.3e-05,2.1e-05,-2.2e-05,3.4e-05,-2.3e-05,-5.2e-05,2.2e-05,-0.000156,-2.2e-05,1.6e-05,-2.6e-05,6.4e-05,-6.2e-05,-8.5e-05,1.7e-05,2.7e-05,-2e-05,5.4e-05,-2.6e-05,-1.3e-05,1.1e-05,4.7e-05,-1.1e-05,3.4e-05,-2.1e-05,2.5e-05,7e-06,8e-06,0.000122,-5e-05,3.7e-05,-3.5e-05,4e-05,-1.8e-05,-6.5e-05,2e-06,-5.3e-05,-3.5e-05,4.1e-05,-4.2e-05,-8.5e-05,5e-06,-7.5e-05,-6.2e-05,3.7e-05,1.6e-05,-3.3e-05,-7.2e-05,5.5e-05,4e-06,5.4e-05,-8.9e-05,-1.1e-05,-3.3e-05,3.3e-05,-5e-05,1e-05,9.2e-05,1.4e-05,-3.3e-05,5.5e-05,-2.8e-05,2.6e-05,-1.8e-05,5.9e-05,-0.000137,7e-06,5e-06,2e-06,1.6e-05,-0.000112,2.8e-05,8.1e-05,3.1e-05,2.7e-05,3.3e-05,5.5e-05,5.4e-05,-1e-05,4e-06,-4.6e-05,4.8e-05,9.4e-05,2.5e-05
-7e-06,3.6e-05,-3.1e-05,-3.3e-05,-0.000102,-2.7e-05,-1.1e-05,-4e-06,-2.6e-05,2.7e-05,-5e-06,5.8e-05,6.7e-05,-7e-05,4e-06,-1e-06,-3.5e-05,0,0,-9e-06,1.7e-05,-1.6e-05,3.3e-05,2.7e-05,2.6e-05,-2.8e-05,-1.6e-05,-7.8e-05,1.9e-05,-8e-06,-7.2e-05,-2.1e-05,-4.9e-05,2.7e-05,-3e-06,-1.8e-05,-6.2e-05,-1.4e-05,6e-06,-2e-06,2.3e-05,8e-06,-6e-06,5.8e-05,-9e-06,-2.6e-05,-2e-06,6e-06,3.4e-05,-5e-06,5.3e-05,-7.9e-05,-9.4e-05,-2.5e-05,5e-05,0.000164,3.2e-05,-9e-06,7e-05,2.3e-05,4.8e-05,-7.9e-05,-3e-05,3e-05,1.7e-05,7e-06,1.4e-05,-4e-06,-3.1e-05,1e-05,1e-05,2.8e-05,-1.1e-05,-6.6e-05,1e-05,-9.9e-05,-4.2e-05,2.2e-05,1.1e-05,4e-06,5.9e-05,3.8e-05,5e-05,5.1e-05,1e-06,2e-06,-7e-06,-6.3e-05,9.9e-05,7e-06,-4e-06,-3.6e-05,1.9e-05,8e-06,8.6e-05,8e-06,3.9e-05,9e-06,-5e-06,-1e-06,3.5e-05,-1.8e-05,1.6e-05,5e-06,-3e-06,1.9e-05,1.6e-05,3.8e-05,-9.7e-05,6.7e-05,-3.8e-05,0.000105,-5e-05,-2.1e-05,-4.9e-05,5.1e-05,5.6e-05,-4e-06,1.7e-05,-5.2e-05,-2.6e-05
4.9e-05,-1.9e-05,-1e-06,-3e-06,-1e-05,1.3e-05,-5e-06,2e-05,-4e-06,-3e-05,-1.7e-05,2.3e-05,-4.7e-05,-6e-05,4e-06,-1.2e-05,-4.8e-05,-6e-06,-9e-06,3.5e-05,-2.4e-05,1.7e-05,-2.7e-05,-4.3e-05,-6.5e-05,-2e-06,-4e-06,5.5e-05,9e-06,1.1e-05,9e-06,-2e-06,3.4e-05,2.1e-05,8e-06,-8.1e-05,3.3e-05,3e-06,-1.9e-05,5.3e-05,9e-06,4e-06,2.9e-05,-3.3e-05,3.2e-05,-4.6e-05,-2.9e-05,1.1e-05,1.7e-05,-1.3e-05,-1.7e-05,2.7e-05,1.9e-05,-4.7e-05,2e-05,-7.4e-05,7e-06,1e-06,8e-06,-1.2e-05,1.6e-05,1.2e-05,-3.8e-05,5e-06,-1e-05,-5.4e-05,-5e-06,4e-06,1.3e-05,-3.2e-05,2e-05,1e-05,0,-4.7e-05,-1.3e-05,3.2e-05,8.7e-05,-2.4e-05,-2.2e-05,-3.7e-05,-2.3e-05,1.4e-05,2.2e-05,1.7e-05,4.6e-05,-6.1e-05,-1.7e-05,-3.1e-05,2.1e-05,6e-06,-2.3e-05,3.8e-05,2e-06,2.9e-05,3e-06,-4.4e-05,2e-05,-5.7e-05,1.8e-05,6.6e-05,-1.2e-05,3e-05,1e-06,-1.1e-05,4.9e-05,1e-06,2e-06,1.9e-05,-1.1e-05,3.1e-05,6.8e-05,-3.2e-05,-1.8e-05,4.2e-05,2.1e-05,2.4e-05,-7.9e-05,4.7e-05,3.6e-05,5.8e-05,-5.4e-05
-2.3e-05,1.2e-05,-2.6e-05,2.5e-05,4.8e-05,-2.5e-05,-2e-06,-7e-06,-1.5e-05,2.1e-05,-3.6e-05,3e-05,4e-06,2.9e-05,-1e-05,7e-06,-7e-06,6e-06,1e-05,3e-06,-3.1e-05,-1.2e-05,-9e-06,5.4e-05,2e-05,1.8e-05,1.3e-05,4.2e-05,0,2.1e-05,-3e-05,2.5e-05,-5e-06,-1.5e-05,-9e-06,4.9e-05,1.3e-05,-7e-06,3.8e-05,2.5e-05,-3.5e-05,-1.3e-05,-3.3e-05,-8e-05,5.5e-05,-1.2e-05,-1.5e-05,-8e-06,-4.4e-05,-4.2e-05,-6e-06,-5e-06,0.000107,4.5e-05,-3.6e-05,-7.7e-05,-1e-06,1.9e-05,0,-5e-06,-3.8e-05,-1.3e-05,-5.4e-05,-9e-06,5e-06,2.3e-05,2.4e-05,-8e-06,3.6e-05,9e-06,-2.7e-05,-3e-06,0,3.2e-05,1e-05,2.2e-05,-1e-06,-2.7e-05,1.9e-05,-1e-06,1.2e-05,5e-05,1.2e-05,-2.6e-05,3.2e-05,-5.1e-05,-1.4e-05,4.6e-05,-7.7e-05,-1.2e-05,-1.2e-05,-3e-05,7e-06,2.4e-05,-3.8e-05,1.3e-05,-2.2e-05,-4.2e-05,4.7e-05,-2.3e-05,1.1e-05,-2.6e-05,-2.8e-05,-4e-06,-6e-06,-9e-06,3e-06,6.8e-05,4.6e-05,-2.1e-05,-4e-05,-5.8e-05,2.5e-05,7e-06,-2e-05,-2.6e-05,1.3e-05,2e-06,-2.5e-05,-5.8e-05,4e-05
-2.5e-05,2e-06,1e-05,9e-06,-1.6e-05,1e-06,4.3e-05,2e-06,2.8e-05,1.1e-05,0,-2e-05,-3e-06,1.6e-05,4e-06,1.2e-05,-1.9e-05,1e-05,-4e-06,-1.7e-05,1.4e-05,-1.3e-05,-2.3e-05,1.1e-05,3.6e-05,-1.7e-05,2.7e-05,-3.2e-05,-4e-05,1.1e-05,4.5e-05,-1e-06,6e-06,-8e-06,2.1e-05,1.6e-05,2.2e-05,-1.6e-05,2e-06,-4.8e-05,2.1e-05,1.2e-05,-2.6e-05,-1.5e-05,2.3e-05,3.3e-05,-1.7e-05,-3e-06,2.4e-05,9.1e-05,2.1e-05,1e-06,-4.5e-05,-1.9e-05,-2.7e-05,6.5e-05,1.1e-05,6e-06,-3e-05,9e-06,-7e-06,-1.5e-05,2e-06,-1.2e-05,1.7e-05,2.1e-05,1.5e-05,-1e-05,-2.7e-05,-2e-06,6e-06,-2.3e-05,-5e-06,2.7e-05,-4e-06,-3.5e-05,-5.3e-05,4.1e-05,-6e-06,1e-06,4e-05,-8e-06,1.3e-05,-1e-06,7e-06,2.6e-05,-8e-06,-3e-06,3.4e-05,6e-06,4e-06,1.7e-05,-1.3e-05,0,-3.5e-05,-2e-06,-1e-05,1.2e-05,-2.1e-05,-4.5e-05,-5e-06,3e-06,2.3e-05,7e-06,1.6e-05,-2.7e-05,-6e-06,-7.5e-05,-2e-06,-3.8e-05,0,-1.4e-05,1e-06,-1.2e-05,5e-06,-1.2e-05,1.5e-05,-2.7e-05,-1.7e-05,4.5e-05,4e-06
2e-05,-3e-06,1e-06,-4.2e-05,3e-06,2.4e-05,-2.9e-05,7e-06,-9e-06,-2e-05,1e-06,-3e-06,-2e-05,3e-06,-4e-06,-5e-06,-8e-06,-1e-05,-1e-06,-2.7e-05,-5e-06,1.4e-05,6e-06,-2.3e-05,-5.6e-05,1.9e-05,3e-06,-1e-05,1e-05,1.4e-05,4e-06,2e-06,-1.4e-05,1.4e-05,-1.4e-05,1.4e-05,5e-06,1.6e-05,5e-06,3e-06,7e-06,-3e-06,1.4e-05,1.4e-05,1.2e-05,-2e-05,8e-06,4e-06,1.9e-05,-6e-06,-2e-05,-6e-06,-1.9e-05,2.5e-05,1.3e-05,2e-06,-1e-05,-2e-06,-2.2e-05,2e-06,2.8e-05,1.7e-05,-2e-05,-1.4e-05,-1.9e-05,-5.5e-05,1.2e-05,5e-06,-1.5e-05,-1.6e-05,-1.6e-05,1e-06,5e-06,-5e-06,-3.2e-05,8e-06,1.9e-05,-7e-06,1.3e-05,4.2e-05,-2.7e-05,3.4e-05,-3.3e-05,-8e-06,-9e-06,-2.7e-05,-2e-06,-4e-06,-4.3e-05,1e-06,4e-05,6e-06,-3e-06,-2e-06,-5.3e-05,6e-06,1.9e-05,-1.4e-05,1.3e-05,2.6e-05,5e-06,6e-06,-2.1e-05,-3e-06,0,4e-06,-1e-05,2e-05,3.4e-05,-2.1e-05,1.4e-05,3.6e-05,1e-05,-1.2e-05,-2e-06,1.2e-05,1.2e-05,-6e-06,-1.9e-05,-6.7e-05,1.4e-05
-7e-06,-8e-06,9e-06,-2.6e-05,-2.8e-05,6e-06,-6e-06,-4e-06,1.9e-05,5e-06,-1.2e-05,-2.1e-05,1.7e-05,-2.1e-05,-8e-06,-6e-06,-2e-06,0,2e-06,2.2e-05,2.9e-05,-1e-06,1e-06,-3.6e-05,1.5e-05,-2.8e-05,-2.1e-05,2.4e-05,1.9e-05,-7e-06,-3e-05,1.4e-05,1.4e-05,4e-06,1.6e-05,2.4e-05,-2.7e-05,6e-06,5e-06,2.2e-05,-1.5e-05,-3e-06,-1.1e-05,3.6e-05,-1.5e-05,0,2e-06,-1.7e-05,-1.2e-05,-5.4e-05,4.3e-05,-1.3e-05,3.2e-05,-1.9e-05,2e-05,-3.8e-05,1.4e-05,1e-06,-2e-06,2e-06,-1e-05,5e-06,1.3e-05,3e-06,1e-06,4.6e-05,-1e-05,4e-06,-7e-06,1.6e-05,3.9e-05,1.9e-05,8e-06,-7e-06,-7e-06,2e-06,5e-06,1.8e-05,-9e-06,-2.3e-05,2.5e-05,9e-06,-1.2e-05,1.5e-05,-4.5e-05,-3.5e-05,-3e-06,9e-06,1.3e-05,-8e-06,7e-06,-4e-06,1.6e-05,-1.3e-05,2.1e-05,1.7e-05,-1e-06,2.8e-05,-3.4e-05,7e-06,-5e-06,-1e-06,3.5e-05,-3e-06,-1.2e-05,-6e-06,9e-06,2e-06,2e-06,1e-06,-2e-05,8e-06,3e-06,1.3e-05,-1.9e-05,2.5e-05,1.2e-05,3.3e-05,-9e-06,1.9e-05,-1e-05
-9e-06,1.1e-05,0,2e-06,3.8e-05,-4e-06,-3e-06,0,-2.4e-05,0,2.2e-05,3e-06,0,-4e-06,0,7e-06,2.3e-05,4e-06,-1e-06,2.4e-05,-1.4e-05,-4e-06,4e-06,3.7e-05,2.6e-05,2.6e-05,-1e-05,-3.9e-05,-1.2e-05,-6e-06,4.4e-05,8e-06,-1.7e-05,7e-06,-9e-06,-2.2e-05,1.9e-05,0,-3.1e-05,-9e-06,2e-06,7e-06,1.3e-05,9e-06,-4.1e-05,-2.1e-05,-8e-06,1e-06,-1e-06,1e-06,-3.5e-05,-1e-05,-2.1e-05,1e-06,8e-06,7e-06,-1.9e-05,-1.3e-05,-5e-06,-8e-06,-3e-06,-7e-06,1.1e-05,7e-06,1e-05,-1.9e-05,-7e-06,9e-06,1.9e-05,9e-06,-1.2e-05,-1.8e-05,-8e-06,2.6e-05,-5e-06,-1.1e-05,-2.8e-05,2e-06,2e-06,-1.5e-05,-1e-05,2e-06,1.1e-05,3e-06,1e-06,3e-06,1.3e-05,-2.4e-05,1.8e-05,5e-06,1.1e-05,2.4e-05,-6e-06,4e-06,2.2e-05,-8e-06,-7e-06,2.7e-05,3e-06,-4e-06,8e-06,8e-06,-1.2e-05,1e-06,-9e-06,-7e-06,7e-06,1.3e-05,-5.5e-05,3.1e-05,0,-6e-06,-1.1e-05,-1.6e-05,3e-06,7e-06,-2.1e-05,-5e-06,-2.1e-05,2.8e-05,-1.1e-05
-2.1e-05,-7e-06,-7e-06,2e-05,-1e-06,-9e-06,1e-06,1e-06,1.2e-05,-2e-06,-2e-06,4e-06,-1.6e-05,1.8e-05,-2e-06,5e-06,3.5e-05,-3e-06,0,-1e-06,1e-05,2e-06,1.1e-05,1.2e-05,-3.8e-05,-2.4e-05,1e-06,2.2e-05,5e-06,-1e-05,-2.6e-05,-9e-06,2.1e-05,-2.2e-05,2e-06,-2e-06,1e-06,1e-05,6e-06,-1e-05,-8e-06,-3e-06,0,4e-06,-2.5e-05,-1e-06,1.7e-05,1.1e-05,-2.5e-05,-1e-06,4e-06,9e-06,-3.7e-05,-8e-06,-1.7e-05,3e-05,1.1e-05,-1e-06,-9e-06,1.3e-05,-1.4e-05,5e-06,3.8e-05,1.1e-05,-1.5e-05,1.2e-05,-1.2e-05,-7e-06,3e-06,-5e-06,-8e-06,2e-06,-3e-06,6e-06,2.9e-05,3e-05,2.2e-05,-3.7e-05,3e-06,-6e-06,-1.2e-05,-9e-06,-5e-06,0,1.6e-05,2.1e-05,2.2e-05,7e-06,-1.2e-05,1e-06,-1.2e-05,-1.8e-05,-1.8e-05,-6e-06,2.1e-05,-7e-06,2e-06,-3.5e-05,8e-06,-2.5e-05,-2e-06,-1.6e-05,1.6e-05,6e-06,-5e-06,6e-06,-9e-06,-2.6e-05,2e-06,3e-06,1.2e-05,9e-06,-1.4e-05,-1.5e-05,-1.7e-05,-1.5e-05,1.5e-05,-1.6e-05,8e-06,1.9e-05,-1e-06
8e-06,4e-06,3e-06,1.4e-05,-1.5e-05,2e-06,-1.1e-05,-1e-06,-7e-06,6e-06,1e-06,1.9e-05,2.6e-05,1.3e-05,3e-06,-7e-06,-1.3e-05,-4e-06,1e-06,-1.4e-05,-9e-06,-1e-06,-1.3e-05,-2e-06,1.3e-05,2.4e-05,6e-06,1.9e-05,1.1e-05,-2e-06,2e-05,1.9e-05,-1.4e-05,1e-05,1e-06,1e-06,-1e-06,-1.5e-05,0,3e-06,1.7e-05,-2e-06,-1.5e-05,-3.6e-05,-1.1e-05,2.3e-05,-8e-06,-3e-06,6e-06,-5e-06,-1e-06,1.3e-05,1e-05,1.6e-05,-1.3e-05,2.7e-05,-5e-06,1e-05,1.1e-05,-1.8e-05,-6e-06,1.8e-05,7e-06,2e-06,1.2e-05,-2e-05,-3e-06,3e-06,8e-06,-1e-06,-5e-06,1.4e-05,3e-06,-2e-05,1.7e-05,-2.4e-05,2.3e-05,1.1e-05,-8e-06,1.9e-05,2e-05,-1.6e-05,4e-06,-1.1e-05,8e-06,-1.5e-05,2e-06,1.8e-05,1.3e-05,-5e-06,-1.3e-05,1.8e-05,1.3e-05,-4e-06,-3e-06,-3e-06,-1e-06,-2.5e-05,-2e-06,2.4e-05,-4e-06,6e-06,-6e-06,-1e-06,-8e-06,1.5e-05,6e-06,2e-06,1.6e-05,8e-06,-7e-06,-8e-06,1.3e-05,5e-06,0,-1.3e-05,-2.5e-05,-1e-06,5e-06,-4.8e-05,1e-06
8e-06,-3e-06,-7e-06,-7e-06,0,1e-06,7e-06,-2e-06,2e-06,-5e-06,6e-06,-1e-06,-2.6e-05,-1.3e-05,-1e-06,0,-6e-06,1e-05,0,-9e-06,-1.1e-05,1e-06,-3e-06,-3.3e-05,1.6e-05,-1.9e-05,0,-8e-06,-1.3e-05,7e-06,-1.6e-05,-5e-06,1e-05,1.1e-05,-4e-06,-7e-06,6e-06,2e-06,9e-06,1.3e-05,-3e-06,3e-06,1.4e-05,1e-06,1.4e-05,-1.8e-05,-1.3e-05,1e-06,7e-06,2.6e-05,-2.2e-05,-9e-06,1.8e-05,1e-06,1.4e-05,-5.4e-05,-4e-06,-3e-06,5e-06,1.2e-05,3e-06,1e-06,-6e-06,-6e-06,-4e-06,5e-06,5e-06,-6e-06,-3e-06,2e-06,-7e-06,-1.2e-05,0,-1.9e-05,1.6e-05,-9e-06,-3.5e-05,0,9e-06,-2.4e-05,-2.5e-05,-7e-06,3e-06,0,1.4e-05,-6e-06,1e-06,-4e-06,-1.5e-05,5e-06,-1.2e-05,-9e-06,9e-06,-1.5e-05,-1.2e-05,-6e-06,2e-06,-2e-06,7e-06,2.1e-05,3e-06,-5e-06,-1.9e-05,-4e-06,1e-06,1e-05,-4e-06,2.3e-05,1.3e-05,-9e-06,-5e-06,-1.9e-05,-6e-06,-6e-06,-1.3e-05,7e-06,2.1e-05,1.3e-05,6e-06,-3e-06,1.5e-05
-2e-05,3e-06,8e-06,-1.6e-05,3e-06,-8e-06,1.4e-05,2e-06,9e-06,-7e-06,-1e-05,5e-06,1.6e-05,-1.6e-05,-2e-06,3e-06,1e-06,-1e-06,-1e-06,1.1e-05,1.4e-05,3e-06,2e-06,7e-06,-2.9e-05,1.1e-05,3e-06,-3.1e-05,3e-06,1e-05,1.1e-05,0,-1.1e-05,-4e-06,5e-06,-1.1e-05,-1.6e-05,-6e-06,3e-06,5e-06,-1e-05,1e-06,-6e-06,-4e-06,2.5e-05,4e-06,9e-06,5e-06,-7e-06,3e-06,2.1e-05,1e-06,-1.4e-05,5e-06,1.6e-05,2.1e-05,6e-06,-1e-06,1.1e-05,2e-06,-4e-06,5e-06,-1.2e-05,-7e-06,-3e-06,2e-05,6e-06,-3e-06,-6e-06,-2e-06,1.5e-05,-4e-06,-2e-06,5e-06,-6e-06,2.5e-05,1e-05,0,-8e-06,1.9e-05,8e-06,-2.1e-05,-7e-06,1e-05,1e-06,2e-05,-2e-06,-2e-06,-2e-06,-3e-06,-3e-06,2e-06,-1.4e-05,2e-06,-1.4e-05,9e-06,-2e-06,5e-06,2e-06,-2e-05,2e-06,1.1e-05,1.9e-05,4e-06,0,-5e-06,0,-5e-06,1.6e-05,-1.9e-05,1e-05,-1e-05,1e-06,1.6e-05,5e-06,8e-06,-1.3e-05,4e-06,1.9e-05,2.1e-05,-5e-06
-5e-06,-1e-06,-5e-06,-5e-06,2.2e-05,-6e-06,-4e-06,1e-06,-6e-06,8e-06,0,-1.1e-05,-2e-06,9e-06,-1e-06,0,1.6e-05,-5e-06,1e-06,1.2e-05,-1e-05,-4e-06,-1e-06,8e-06,1.3e-05,-8e-06,2e-06,2.5e-05,-2e-06,6e-06,6e-06,1.8e-05,1.1e-05,-1e-05,-6e-06,1.2e-05,2e-06,7e-06,-4e-06,-1.1e-05,9e-06,-2e-06,8e-06,2.5e-05,1.9e-05,4e-06,5e-06,-7e-06,4e-06,-2.7e-05,-7e-06,-5e-06,1.4e-05,-1.2e-05,-5e-06,2.1e-05,-6e-06,1e-06,1.5e-05,-1.1e-05,-1.5e-05,2e-06,-5e-06,-5e-06,6e-06,-2.7e-05,8e-06,7e-06,5e-06,2e-06,-4e-06,1.2e-05,3e-06,1.1e-05,-7e-06,-1.6e-05,1.5e-05,2.3e-05,4e-06,-5e-06,5e-06,6e-06,4e-06,-2e-06,-1e-05,1.1e-05,-2e-06,1e-06,-5e-06,0,4e-06,-3e-06,4e-06,2e-06,-1e-06,5e-06,-4e-06,2.2e-05,-3e-06,-3e-06,0,-5e-06,-2e-05,0,2e-06,7e-06,3e-06,-3e-06,-1.6e-05,-2e-06,-8e-06,2.4e-05,1.1e-05,-8e-06,-7e-06,-3e-06,1.4e-05,-1.4e-05,-2e-06,7e-06,-5e-06
1.1e-05,-1e-06,8e-06,1.5e-05,-1.3e-05,1e-05,0,0,5e-06,0,-2e-06,-2e-06,-8e-06,6e-06,-1e-06,-2e-06,1.2e-05,3e-06,0,-3e-06,1.7e-05,0,8e-06,1.1e-05,1e-05,5e-06,4e-06,-1e-06,0,1e-06,-2e-05,-1.2e-05,-1.2e-05,6e-06,7e-06,5e-06,9e-06,1e-06,-3e-06,-5e-06,1e-06,2e-06,0,2e-06,0,-3e-06,-8e-06,0,-6e-06,8e-06,-3e-06,-3e-06,1.5e-05,-1e-06,-1.1e-05,-2e-05,7e-06,-2e-06,-4e-06,1.3e-05,-4e-06,-3e-06,-1.1e-05,3e-06,-2e-06,7e-06,1e-06,-2e-06,7e-06,0,4e-06,-8e-06,-1e-06,0,-1e-06,-1e-06,-2e-05,-1.3e-05,-2e-06,-3e-06,-1.1e-05,-6e-06,9e-06,0,-9e-06,-9e-06,-9e-06,-9e-06,0,3e-06,5e-06,-3e-06,4e-06,6e-06,1.9e-05,0,1e-06,2e-06,-1e-06,8e-06,-2e-06,0,3e-06,-1e-06,6e-06,-7e-06,-1e-06,-1.2e-05,-2.5e-05,2e-06,-4e-06,5e-06,-1.6e-05,1.8e-05,5e-06,-1e-05,-9e-06,-2e-06,7e-06,-2.2e-05,-1e-06
-7e-06,0,-8e-06,1.3e-05,-9e-06,4e-06,7e-06,1e-06,-1.1e-05,-4e-06,-6e-06,-6e-06,1.2e-05,0,1e-06,3e-06,3e-06,-2e-06,0,-6e-06,-9e-06,2e-06,4e-06,-1.3e-05,-2.3e-05,-2e-06,-5e-06,-6e-06,5e-06,-3e-06,2.8e-05,8e-06,1.5e-05,9e-06,-4e-06,5e-06,-2e-06,0,2e-06,8e-06,-1e-06,1e-06,-7e-06,6e-06,-1.4e-05,1.1e-05,8e-06,4e-06,9e-06,7e-06,1.4e-05,1.3e-05,-1.8e-05,-3e-06,-5e-06,-2e-05,-5e-06,3e-06,-4e-06,-1.2e-05,-2e-06,-2e-06,-6e-06,6e-06,-2e-06,4e-06,-2e-06,3e-06,-4e-06,0,-9e-06,-1e-06,-2e-06,-5e-06,-4e-06,5e-06,1e-06,-3e-06,1e-06,-1.2e-05,1e-05,8e-06,-1e-06,-5e-06,-8e-06,1e-05,-5e-06,2e-06,1.2e-05,-2e-06,1.1e-05,0,-5e-06,2e-06,1.3e-05,-2e-06,3e-06,-5e-06,-2e-06,1.2e-05,2e-06,-2e-06,5e-06,-1e-06,4e-06,-8e-06,-1e-06,1.9e-05,2e-06,1.2e-05,5e-06,-2e-06,1e-05,-7e-06,-5e-06,-6e-06,-2e-06,1.1e-05,-4e-06,2e-06,-4e-06
-4e-06,-1e-06,5e-06,4e-06,9e-06,-4e-06,-3e-06,0,7e-06,0,7e-06,4e-06,-1e-05,-7e-06,-2e-06,1e-06,-1.4e-05,0,0,-1.4e-05,0,-1e-06,-1e-06,-4e-06,1.4e-05,0,-3e-06,3e-06,-2e-06,-6e-06,-1.6e-05,6e-06,-1.4e-05,-8e-06,3e-06,1e-06,6e-06,-1e-06,-7e-06,-2e-06,-3e-06,-2e-06,7e-06,-1.9e-05,-1.8e-05,-1e-05,-1e-06,-4e-06,4e-06,-1e-06,-1.4e-05,-8e-06,-1.3e-05,8e-06,8e-06,1.5e-05,5e-06,0,-4e-06,5e-06,-6e-06,1e-06,-1e-06,5e-06,2e-06,3e-06,-6e-06,-2e-06,-1e-06,-1e-06,9e-06,4e-06,2e-06,6e-06,1e-06,-9e-06,1.3e-05,-5e-06,-3e-06,1.1e-05,-7e-06,4e-06,-1e-06,0,2e-06,1.7e-05,0,8e-06,-1e-05,1e-06,5e-06,-1e-06,4e-06,3e-06,7e-06,-8e-06,-4e-06,-1.1e-05,-4e-06,-1.8e-05,2e-06,2e-06,5e-06,1e-06,3e-06,-5e-06,-1e-06,-9e-06,1.4e-05,8e-06,4e-06,-1.3e-05,-8e-06,-2e-06,7e-06,6e-06,7e-06,0,-7e-06,4e-06,6e-06
-6e-06,2e-06,-6e-06,-1.3e-05,3e-06,-1e-06,-1.1e-05,-1e-06,1e-06,1e-06,-1e-06,3e-06,-2e-06,-2e-06,1e-06,-1e-06,4e-06,1e-06,0,6e-06,-4e-06,2e-06,-1e-06,1.2e-05,6e-06,2e-06,-2e-06,7e-06,2e-06,-3e-06,1.2e-05,-6e-06,1e-05,-5e-06,-1e-06,-6e-06,-4e-06,-4e-06,6e-06,-6e-06,1e-06,1e-06,-4e-06,-3e-06,-1.2e-05,1e-06,-3e-06,2e-06,-3e-06,5e-06,9e-06,4e-06,7e-06,0,9e-06,1.4e-05,-3e-06,-2e-06,-8e-06,2e-06,4e-06,0,8e-06,-1e-06,-3e-06,-1.2e-05,-4e-06,-1e-06,-4e-06,-3e-06,-1e-06,0,-1e-06,6e-06,-8e-06,9e-06,-4e-06,-1.1e-05,2e-06,-6e-06,3e-06,4e-06,-2e-06,2e-06,1.4e-05,0,1e-06,-6e-06,7e-06,0,0,-5e-06,0,2e-06,-1.7e-05,0,-2e-06,-1.6e-05,4e-06,-9e-06,-3e-06,2e-06,-1e-06,1e-06,1e-06,2e-06,2e-06,1e-06,1.2e-05,-1e-06,-1.1e-05,6e-06,4e-06,5e-06,-5e-06,6e-06,-1.3e-05,-1e-05,-6e-06,-8e-06,2e-06
3e-06,-1e-06,5e-06,-9e-06,2e-06,4e-06,0,0,-1e-06,3e-06,1e-06,6e-06,1e-05,1e-05,-3e-06,-1e-06,-1e-05,-1e-06,0,1.4e-05,-3e-06,-2e-06,-3e-06,6e-06,-1.7e-05,-5e-06,3e-06,-2e-05,-2e-06,0,-8e-06,8e-06,-9e-06,7e-06,-1e-06,-1e-06,-7e-06,-1e-06,-8e-06,5e-06,2e-06,0,3e-06,-3e-06,-2e-06,4e-06,-1e-06,2e-06,3e-06,2e-06,-5e-06,-2e-06,-1e-06,2e-06,-3e-06,-1e-05,1e-06,3e-06,-6e-06,-4e-06,-1e-05,-6e-06,3e-06,-5e-06,1e-06,9e-06,-1e-06,-1e-06,1e-06,0,-2e-06,-2e-06,0,-3e-06,2e-06,1e-06,-7e-06,1.6e-05,0,7e-06,7e-06,9e-06,-5e-06,2e-06,5e-06,-4e-06,6e-06,3e-06,-9e-06,-1e-06,-6e-06,5e-06,-5e-06,2e-06,-2e-05,4e-06,1e-06,1.1e-05,-1e-06,1.7e-05,0,0,-3e-06,-2e-06,0,0,-1e-06,-7e-06,5e-06,-1e-05,9e-06,-9e-06,-7e-06,-7e-06,6e-06,-2e-06,1.6e-05,2e-06,-6e-06,5e-06,1e-06
4e-06,1e-06,-2e-06,6e-06,-7e-06,0,4e-06,0,2e-06,-2e-06,6e-06,-3e-06,-1.6e-05,1e-06,0,1e-06,-9e-06,0,0,-2e-06,1e-05,-1e-06,0,-1.1e-05,1.3e-05,6e-06,1e-06,6e-06,-5e-06,4e-06,3e-06,1e-06,1e-05,6e-06,2e-06,-4e-06,5e-06,2e-06,9e-06,5e-06,-1e-06,-1e-06,2e-06,1.3e-05,1.2e-05,-4e-06,4e-06,-3e-06,-5e-06,-1.6e-05,-3e-06,-2e-06,-7e-06,-8e-06,-8e-06,-7e-06,0,-1e-06,0,5e-06,0,-2e-06,1e-05,-4e-06,2e-06,0,2e-06,-1e-06,0,2e-06,3e-06,-1e-06,1e-06,-7e-06,1e-06,-1.1e-05,6e-06,3e-06,-2e-06,1e-06,-1e-05,-1e-06,3e-06,-2e-06,2e-06,1e-05,3e-06,-2e-06,-2e-06,1e-06,-7e-06,-5e-06,9e-06,1e-06,-1.1e-05,2e-06,2e-06,1.9e-05,3e-06,3e-06,1e-06,-1e-06,7e-06,2e-06,-2e-06,0,1e-06,1e-05,-1.6e-05,-1e-05,-1e-06,5e-06,9e-06,0,-1e-06,-5e-06,-1.2e-05,7e-06,-2e-06,6e-06,-4e-06
-1.4e-05,0,2e-06,1.1e-05,0,-7e-06,-3e-06,0,-4e-06,-2e-06,-4e-06,-2e-06,1.5e-05,-7e-06,-1e-06,1e-06,-6e-06,0,0,-8e-06,-7e-06,2e-06,1e-06,-6e-06,1e-06,-5e-06,1e-06,1.5e-05,7e-06,5e-06,1e-05,-2e-06,-1e-05,-1e-05,-3e-06,2e-06,-1e-06,-1e-06,-1e-06,-2e-06,0,1e-06,-6e-06,3e-06,1.3e-05,7e-06,-3e-06,1e-06,3e-06,6e-06,6e-06,3e-06,1.3e-05,2e-06,-2e-06,1.9e-05,-1e-06,-3e-06,-3e-06,-5e-06,3e-06,-2e-06,3e-06,0,-3e-06,-8e-06,4e-06,2e-06,1e-06,-1e-06,-8e-06,5e-06,-1e-06,-2e-06,9e-06,1.1e-05,1e-06,1e-06,3e-06,-2e-06,9e-06,4e-06,3e-06,-2e-06,-6e-06,6e-06,4e-06,-2e-06,2e-06,-1e-06,-6e-06,5e-06,-5e-06,-2e-06,4e-06,2e-06,-4e-06,-4e-06,1e-06,-1e-05,0,-1e-06,-1e-05,0,-2e-06,4e-06,-2e-06,-3e-06,-1.2e-05,1e-06,-6e-06,1e-06,-1.2e-05,-2e-06,3e-06,0,1e-05,-1e-06,-1e-06,-2e-06,-3e-06
-1e-06,0,-2e-06,5e-06,6e-06,-2e-06,0,0,4e-06,3e-06,2e-06,-3e-06,-7e-06,-2e-06,-1e-06,-1e-06,4e-06,-2e-06,0,-8e-06,7e-06,0,1e-06,8e-06,-1.4e-05,5e-06,0,-8e-06,-2e-06,3e-06,-1.6e-05,5e-06,1.2e-05,-1e-06,3e-06,-2e-06,3e-06,2e-06,1e-06,-4e-06,1e-06,0,2e-06,0,1.2e-05,-6e-06,1e-06,3e-06,0,4e-06,-5e-06,-1e-06,7e-06,-3e-06,8e-06,2e-06,2e-06,1e-06,5e-06,2e-06,-3e-06,-2e-06,2e-06,4e-06,3e-06,7e-06,3e-06,-1e-06,-2e-06,-1e-06,6e-06,-5e-06,0,3e-06,3e-06,-2e-06,-8e-06,-1e-06,-2e-06,-8e-06,-2e-06,-3e-06,-2e-06,1e-06,-9e-06,-9e-06,-1e-06,3e-06,-5e-06,-1e-06,1e-06,-1e-06,-6e-06,-3e-06,1.8e-05,-3e-06,0,1e-06,-2e-06,-6e-06,-2e-06,0,5e-06,0,-1e-06,2e-06,-1e-06,-3e-06,1e-06,7e-06,2e-06,1.2e-05,1e-05,4e-06,2e-06,5e-06,-1.2e-05,-6e-06,6e-06,-2.2e-05,2e-06
4e-06,0,1e-06,-9e-06,-4e-06,6e-06,5e-06,1e-06,-3e-06,0,-1e-06,-1e-06,-3e-06,3e-06,-1e-06,-1e-06,1e-06,1e-06,0,4e-06,-6e-06,0,2e-06,7e-06,1.4e-05,-4e-06,0,-8e-06,-2e-06,0,1.7e-05,-2e-06,-1.2e-05,8e-06,-3e-06,2e-06,1e-06,-1e-06,-4e-06,-1e-06,1e-06,-1e-06,1e-06,-8e-06,-2e-06,0,0,-3e-06,-4e-06,-3e-06,4e-06,1e-06,-9e-06,7e-06,3e-06,-1.4e-05,-3e-06,1e-06,7e-06,2e-06,3e-06,0,-1e-05,3e-06,-2e-06,-3e-06,1e-06,0,0,1e-06,-2e-06,-1e-06,0,2e-06,0,-4e-06,4e-06,-1.2e-05,1e-06,8e-06,-5e-06,-1e-06,0,0,-3e-06,0,-1e-06,2e-06,1e-05,1e-06,2e-06,1e-06,1e-05,-4e-06,1.6e-05,-3e-06,2e-06,-1.2e-05,-1e-06,1.5e-05,1e-06,0,-2e-06,-1e-06,-3e-06,1e-06,2e-06,1e-06,1.4e-05,1e-05,4e-06,-1.3e-05,-5e-06,-6e-06,0,3e-06,1e-05,2e-06,3e-06,1.5e-05,1e-06
-5e-06,0,0,-9e-06,1e-06,2e-06,2e-06,-1e-06,2e-06,0,-4e-06,0,9e-06,2e-06,0,0,-1e-06,1e-06,0,9e-06,-1e-06,-1e-06,-1e-06,-4e-06,-2e-06,3e-06,0,9e-06,5e-06,-3e-06,-1e-05,1e-06,1e-05,-2e-06,2e-06,3e-06,-5e-06,-1e-06,0,3e-06,-2e-06,0,-4e-06,-5e-06,-8e-06,4e-06,0,1e-06,1e-06,1e-06,2e-06,-3e-06,1e-06,-2e-06,-6e-06,-3e-06,2e-06,0,4e-06,-3e-06,0,1e-06,-7e-06,1e-06,-1e-06,2e-06,-3e-06,0,-1e-06,0,2e-06,5e-06,0,-1e-06,-3e-06,4e-06,4e-06,1e-06,-1e-06,-1e-06,7e-06,-4e-06,-2e-06,0,2e-06,4e-06,-5e-06,-2e-06,-9e-06,-1e-06,7e-06,1e-06,-1e-06,-1e-06,4e-06,0,-1e-06,-9e-06,-1e-06,3e-06,1e-06,0,0,1e-06,0,-1e-06,0,1e-06,1.2e-05,1e-06,-6e-06,-1e-06,0,4e-06,4e-06,-3e-06,-5e-06,3e-06,6e-06,7e-06,3e-06
-4e-06,1e-06,-1e-06,-1e-06,-4e-06,-4e-06,-2e-06,0,1e-06,-1e-06,2e-06,5e-06,-1.1e-05,-2e-06,-1e-06,1e-06,-1.2e-05,-2e-06,0,3e-06,2e-06,0,-2e-06,-9e-06,-1e-05,-2e-06,-1e-06,-1e-06,-5e-06,-3e-06,6e-06,1e-06,-9e-06,-6e-06,-1e-06,-1e-06,3e-06,0,0,0,2e-06,0,7e-06,3e-06,-1.5e-05,-5e-06,-1e-06,1e-06,-3e-06,3e-06,-3e-06,1e-06,-3e-06,3e-06,-3e-06,9e-06,-2e-06,-1e-06,5e-06,4e-06,0,0,-3e-06,-3e-06,2e-06,-2e-06,-3e-06,-1e-06,0,-1e-06,-2e-06,-3e-06,0,1e-06,-3e-06,-4e-06,-5e-06,3e-06,1e-06,1e-06,-8e-06,-2e-06,-1e-06,0,5e-06,-5e-06,-4e-06,0,3e-06,1e-06,4e-06,-2e-06,-8e-06,-2e-06,-1.2e-05,1e-06,-1e-06,1e-05,1e-06,-1.3e-05,-1e-06,-1e-06,2e-06,0,-1e-06,-1e-06,0,3e-06,-7e-06,-7e-06,1e-06,-3e-06,2e-06,2e-06,-3e-06,-3e-06,-2e-06,-1e-06,3e-06,-2e-06,-1e-06
-5e-06,-1e-06,2e-06,9e-06,2e-06,0,-1e-06,0,-1e-06,0,-3e-06,1e-06,5e-06,-1e-06,0,0,5e-06,1e-06,0,-8e-06,1e-06,0,0,2e-06,1.4e-05,2e-06,0,-9e-06,1e-06,-2e-06,0,0,9e-06,2e-06,-1e-06,1e-06,1e-06,0,2e-06,-1e-06,0,-1e-06,-5e-06,5e-06,-7e-06,2e-06,1e-06,-2e-06,2e-06,-8e-06,4e-06,-1e-06,-5e-06,-7e-06,2e-06,-2e-06,0,-1e-06,1e-06,-3e-06,6e-06,0,-1e-06,-3e-06,-2e-06,0,-3e-06,0,1e-06,0,1e-06,-2e-06,1e-06,2e-06,1e-06,3e-06,2e-06,6e-06,-1e-06,-2e-06,4e-06,0,3e-06,-1e-06,9e-06,-8e-06,-1e-06,0,-5e-06,0,5e-06,4e-06,8e-06,1e-06,-1.4e-05,3e-06,1e-06,8e-06,2e-06,-1e-06,-1e-06,1e-06,2e-06,-1e-06,0,-2e-06,-1e-06,-6e-06,-1e-05,-7e-06,5e-06,1.2e-05,-5e-06,-2e-06,5e-06,2e-06,9e-06,-1e-06,0,-1.8e-05,-2e-06
3e-06,0,-2e-06,8e-06,3e-06,4e-06,1e-06,0,1e-06,1e-06,0,1e-06,3e-06,1e-06,-1e-06,1e-06,6e-06,1e-06,0,-8e-06,3e-06,0,-1e-06,8e-06,-5e-06,-1e-06,-1e-06,1.3e-05,1e-06,0,-4e-06,1e-06,-9e-06,3e-06,2e-06,-3e-06,0,1e-06,-3e-06,2e-06,-1e-06,0,-2e-06,5e-06,-2e-06,-1e-06,-1e-06,1e-06,1e-06,4e-06,-2e-06,1e-06,0,3e-06,4e-06,-8e-06,1e-06,1e-06,-2e-06,-1e-06,3e-06,2e-06,2e-06,-2e-06,0,1e-06,0,0,1e-06,1e-06,2e-06,3e-06,-1e-06,1e-06,0,0,2e-06,5e-06,1e-06,0,1e-06,-1e-06,0,0,1e-06,3e-06,0,-2e-06,-5e-06,0,-3e-06,-4e-06,-2e-06,0,-6e-06,1e-06,0,5e-06,1e-06,1.2e-05,2e-06,0,1e-06,0,2e-06,0,-1e-06,5e-06,-9e-06,-4e-06,-5e-06,-8e-06,2e-06,5e-06,-5e-06,3e-06,-1.1e-05,1e-06,-1e-06,1.3e-05,-1e-06
2e-06,0,2e-06,-5e-06,-5e-06,0,-1e-06,0,-2e-06,1e-06,3e-06,-3e-06,-1e-05,1e-06,-1e-06,-1e-06,7e-06,-1e-06,0,4e-06,-6e-06,0,1e-06,0,-8e-06,0,1e-06,1e-06,-2e-06,2e-06,1.2e-05,1e-06,1e-05,-2e-06,-2e-06,3e-06,1e-06,-1e-06,4e-06,0,1e-06,0,6e-06,-5e-06,1.1e-05,-2e-06,2e-06,1e-06,-1e-06,2e-06,-1e-06,2e-06,2e-06,-4e-06,0,0,-1e-06,1e-06,-5e-06,4e-06,1e-06,2e-06,2e-06,2e-06,1e-06,-1e-06,2e-06,-1e-06,-1e-06,0,-4e-06,0,-1e-06,-2e-06,2e-06,-3e-06,-3e-06,-5e-06,1e-06,-1e-06,-6e-06,3e-06,-2e-06,0,-6e-06,-2e-06,4e-06,2e-06,9e-06,0,-3e-06,3e-06,-4e-06,3e-06,7e-06,-2e-06,0,-1e-06,-2e-06,1e-06,0,1e-06,-6e-06,0,1e-06,0,0,-5e-06,4e-06,5e-06,-1e-06,5e-06,-2e-06,-7e-06,4e-06,-1e-06,1e-05,0,-5e-06,-4e-06,1e-06
