-0.005458,-0.004887,-0.002766,-0.003465,-0.002226,-0.002854,-0.00379,-0.003848,-0.004143,-0.004434,-0.005655,-0.007812,-0.003982,-0.003395,-0.003547,-0.003267,-0.002532,-0.002033,-0.001421,-0.001531,-0.001739,-0.001313,-0.001156,-0.000846,-0.001131,-0.000988,-0.00076,-0.000859
0.000201,0.000302,-0.001278,-0.002173,-0.000773,-0.001122,-0.000533,6.4e-05,-0.001033,-0.001791,-0.000811,0.000929,0.001157,0.000969,-0.00026,-0.000482,-0.000239,9.8e-05,-0.000412,-0.000194,0.000275,-4.4e-05,-0.000502,-6.5e-05,-2.6e-05,-0.000447,-0.000489,-0.000718
0.001115,0.001141,-5.1e-05,0.000193,0.000343,0.000337,0.000723,0.000903,0.000856,0.000831,0.002262,0.003037,0.000587,0.00044,0.000464,0.000677,0.000157,0.000128,-0.000198,-0.000113,0.000208,7.6e-05,-4.4e-05,-0.000416,-1.2e-05,-0.000201,-0.000285,-0.000185
-0.001858,-0.001322,-0.000337,0.000433,-0.000232,-0.000735,-0.001361,-0.001098,0.000354,0.000852,0.000413,-0.002211,-0.003323,-0.002793,-0.000768,-0.000352,-0.000829,-0.000931,-0.00031,-0.000775,-0.000959,-0.000586,-0.00048,-0.001239,-0.000625,-0.000406,-0.000404,0.000132
0.001294,0.001359,5.4e-05,-0.000336,-0.000567,-0.001268,-0.001096,0.000416,0.001429,0.001346,0.000502,0.000476,7.1e-05,0.000316,0.001365,0.000681,0.00074,0.000774,0.00073,0.000293,0.000418,0.000248,-0.000402,-0.000339,0.000177,0.000106,-6.8e-05,0.000268
0.001309,0.00078,-0.000748,-0.002085,-0.000996,-0.00151,-0.001387,-0.00016,-0.000123,-0.000202,-0.000496,0.001004,0.001508,0.001606,0.000693,-2.6e-05,0.000335,0.00054,0.000116,3.1e-05,0.000326,0.000162,-0.00039,5.8e-05,7.8e-05,-9.3e-05,-0.000135,-0.000172
-0.003629,-0.003457,-0.001448,-0.001845,-0.000753,-0.000936,-0.001578,-0.002678,-0.00321,-0.002529,-0.00245,-0.00363,-0.002005,-0.002012,-0.002924,-0.002005,-0.001747,-0.001738,-0.001315,-0.001159,-0.001313,-0.000794,-0.000257,-0.000285,-0.000736,-0.000735,-0.000399,-0.000435
0.000211,0.000354,0.001228,0.002031,0.001083,0.001989,0.002617,0.000942,-2e-06,4e-05,0.001313,0.00154,0.001051,0.000127,-0.00051,0.000433,0.000345,-3.2e-05,-7.2e-05,0.000434,0.00046,0.000427,0.001039,0.000991,0.00045,0.000285,0.000395,0.000339
0.004466,0.003955,0.002678,0.003363,0.00146,0.003021,0.003862,0.003511,0.003339,0.002348,0.00285,0.005165,0.004083,0.003638,0.002882,0.002381,0.0023,0.001935,0.001159,0.0016,0.001777,0.001148,0.001225,0.001425,0.001027,0.00108,0.000939,0.00073
-0.000318,-0.000433,0.000386,0.000595,-7e-06,0.000289,-0.000668,-0.000324,0.000583,2e-04,-0.001905,-0.003249,-0.0012,-0.000157,0.000492,-0.000238,-9.3e-05,-0.000151,0.000209,2.9e-05,-0.000462,-0.00041,-0.000231,-0.000111,-0.000262,0.000219,0.000228,2.3e-05
-0.002759,-0.002563,-0.001176,-0.001104,-0.000327,-0.000875,-0.001447,-0.001705,-0.001897,-0.001033,-0.002351,-0.00448,-0.002808,-0.002436,-0.001378,-0.00129,-0.001188,-0.000999,-0.000202,-0.000373,-0.000831,-0.000636,-0.000559,-0.000432,-0.000296,-0.000215,-0.000219,-0.000431
0.001548,0.001148,-0.000148,-0.000337,0.000473,0.000607,0.001618,0.001146,-0.000276,0.00046,0.002628,0.004773,0.002033,0.00099,0.000481,0.000635,0.000356,0.000733,0.000311,0.000529,0.000785,0.000451,0.000254,0.000262,0.000559,0.000188,-6e-06,-0.000188
6.6e-05,0.00051,3e-05,-5.2e-05,0.000247,0.000161,0.000103,0.000258,0.000321,-0.000148,0.001388,0.002594,0.000463,0.000445,0.000102,4.1e-05,-0.000419,1e-05,-0.000292,-0.000543,-0.000406,-0.000159,-0.000188,-0.000674,-0.000277,-0.000246,-0.00028,-5.2e-05
-0.003068,-0.001901,-0.000803,-0.000453,-0.000672,-0.001751,-0.002654,-0.001672,-0.000364,-0.001339,-0.002638,-0.004973,-0.003499,-0.002648,-0.001373,-0.001216,-0.001108,-0.000939,-0.000629,-0.001233,-0.001221,-0.000521,-0.000844,-0.001246,-0.000836,-0.000612,-0.000497,1.8e-05
0.000797,0.000514,-0.000364,-0.000323,-0.000742,-0.00152,-0.001142,0.000273,0.000623,0.000225,-0.00064,-0.000752,-8.9e-05,-0.000181,0.000685,0.00049,0.001017,0.000819,0.000408,0.000362,0.000745,0.00056,-0.000248,-4.8e-05,0.000124,2.3e-05,1.3e-05,0.000171
0.002462,0.00113,0.000119,-0.000484,-0.00016,-0.000115,0.000259,0.000525,0.000401,0.001474,0.0016,0.003126,0.002192,0.002189,0.001571,0.001101,0.001171,0.000646,0.000428,0.000689,0.000708,0.000264,0.000201,0.000356,0.000186,0.000151,0.000234,2e-06
-0.000695,-0.000871,-0.000228,-0.000861,3.1e-05,0.000198,-0.000173,-0.001244,-0.00115,0.000174,0.000196,-0.000859,-0.000702,-0.000341,-0.000971,-0.000574,-0.000834,-0.001288,-0.000533,-0.000371,-0.000752,-0.000576,0.000253,0.000194,-0.00017,-0.000163,-5.4e-05,-0.000208
-0.000638,0.000195,7.8e-05,-0.000282,-0.000144,0.000254,0.000538,-0.000231,-0.000682,-0.001264,-0.00031,-0.000814,-0.00013,-0.000792,-0.001423,-0.000577,-0.000445,-0.000403,-0.000308,9e-06,0.000146,0.000106,0.000503,0.00084,0.000388,9.3e-05,-8e-06,1.8e-05
0.0012,0.001363,0.000976,0.001222,0.000327,0.000844,0.001132,0.001358,0.001208,-0.000591,0.000245,0.001724,0.002077,0.001552,0.000779,0.000571,0.000631,0.00089,0.000321,0.000489,0.000697,0.000386,0.000371,0.000795,0.000444,0.00033,0.000214,0.000276
