1e-06,8e-06,3e-06,9e-06,6e-06,1.2e-05,1.3e-05,2.4e-05,1.3e-05,7e-06,2e-06,3e-06,1.6e-05,1e-06,8e-06,8e-06,2.9e-05,6e-06,0,3e-06,1.3e-05,2e-05,1.8e-05,2.4e-05,1.4e-05,1.4e-05,2.4e-05,3.3e-05,1.9e-05,1.8e-05,2.8e-05,5e-05,0,4.1e-05,4e-06,3.9e-05,1.2e-05,3.5e-05,3e-05,7e-06,1.4e-05,4.8e-05,4e-05,3.5e-05,2.7e-05,4.4e-05,3.2e-05,4e-05,4.6e-05,1.7e-05,1e-06,3.4e-05,3.2e-05,1.3e-05,9e-06,5e-06,4e-05,2.1e-05,3.3e-05,2.5e-05,4.4e-05,3.5e-05,2e-06,3e-05,6e-05,2e-05,1.9e-05,8e-06,4.9e-05,3.9e-05,2.3e-05,2.3e-05,1.3e-05,4.6e-05,3.7e-05,2.4e-05,4e-05,4.7e-05,1.1e-05,3.1e-05,3.2e-05,3.4e-05,1.5e-05,3.5e-05,1.6e-05,5.2e-05,1.7e-05,2.1e-05,3.5e-05,2.3e-05,7e-06,4.1e-05,4.9e-05,3.1e-05,4.8e-05,5e-06,1.9e-05,3.1e-05,5e-05,5e-06,1.6e-05,4.3e-05,3.6e-05,3e-06,4.7e-05,2.9e-05,3.3e-05,4e-06,7.4e-05,4.7e-05,4.6e-05,3.5e-05,4e-05,5e-05,4.1e-05,4.3e-05,3e-05,6.2e-05,9e-06,4.1e-05,8e-06
3.3e-05,1.3e-05,1.1e-05,1.1e-05,2e-05,8e-06,3.4e-05,3.2e-05,2.5e-05,7e-06,1.1e-05,2.1e-05,2.8e-05,1.1e-05,2.3e-05,9e-06,4.9e-05,3e-06,4.5e-05,2.7e-05,1.2e-05,3.7e-05,1.8e-05,6.3e-05,5.3e-05,7.6e-05,2e-05,7.2e-05,8.1e-05,0.000127,6.8e-05,7.3e-05,8.6e-05,8.5e-05,7.8e-05,4e-05,7.9e-05,4.2e-05,9.5e-05,8.8e-05,9.2e-05,1.1e-05,8.8e-05,4.6e-05,8.5e-05,6e-05,9.1e-05,2.7e-05,0.000128,0.000109,8e-05,1.1e-05,0.000101,0.000121,0.000111,9e-06,7.3e-05,0.000121,3.4e-05,3.3e-05,0.000101,0.000178,9.6e-05,3e-05,0.000111,0.000117,0.000115,1.9e-05,8.8e-05,0.000129,6.9e-05,6.7e-05,8.4e-05,0.000101,3.1e-05,8e-05,3.6e-05,0.000111,9.8e-05,7.1e-05,1.6e-05,9.5e-05,0.000115,5.5e-05,8.2e-05,3.9e-05,8e-05,9e-05,0.00012,0.000134,8.2e-05,6e-05,0.000135,6.1e-05,0.000118,0.000138,0.00012,2.4e-05,0.000127,1e-04,8.7e-05,6.1e-05,9.5e-05,8.2e-05,5.1e-05,0.000143,0.000106,8.3e-05,5.9e-05,0.000149,5e-05,0.000106,5.6e-05,0.000136,5.5e-05,0.000116,5.8e-05,9.6e-05,9.5e-05,0.000101,7e-05
3.8e-05,4.4e-05,2.5e-05,1.7e-05,2.1e-05,2.8e-05,6.5e-05,2.7e-05,3.6e-05,7e-06,1.6e-05,2.8e-05,3.4e-05,2.3e-05,6.3e-05,3.2e-05,2.5e-05,4.5e-05,7.2e-05,1e-05,2.3e-05,5.3e-05,1.8e-05,2.4e-05,2.3e-05,4.8e-05,3.6e-05,2.2e-05,4.3e-05,0.000101,2.3e-05,4.1e-05,3.9e-05,1.4e-05,1.9e-05,5.3e-05,5.9e-05,4.5e-05,5.3e-05,5e-05,7.4e-05,2.1e-05,2.3e-05,2.2e-05,3e-05,6.1e-05,2.5e-05,7.1e-05,1.3e-05,5.4e-05,1.4e-05,2.5e-05,4.9e-05,2.6e-05,7e-05,8e-05,3.2e-05,5.6e-05,7.3e-05,1.5e-05,7.5e-05,6.4e-05,3.7e-05,5.1e-05,7.3e-05,6.3e-05,1.6e-05,6e-05,1.2e-05,2.6e-05,5.8e-05,8.2e-05,5.9e-05,5.8e-05,6.3e-05,8.7e-05,4.3e-05,1.6e-05,3.3e-05,5.1e-05,3.2e-05,7.4e-05,5.1e-05,4.5e-05,9.2e-05,0.000108,5.6e-05,6.3e-05,9.5e-05,7.4e-05,4e-05,8.5e-05,8.8e-05,1e-05,7.8e-05,7.8e-05,7.9e-05,4.9e-05,7e-05,5.6e-05,9.5e-05,7.5e-05,0.000116,7.4e-05,5.6e-05,8.5e-05,4.5e-05,3.5e-05,3.6e-05,3.3e-05,3.9e-05,7.1e-05,7.8e-05,0.000138,7.3e-05,6.3e-05,7.6e-05,7.9e-05,7.4e-05,6.8e-05,3e-06
6.1e-05,3.1e-05,6e-05,2.7e-05,3.6e-05,2.8e-05,6.7e-05,0.000124,1.9e-05,4.4e-05,5.7e-05,7.3e-05,4.7e-05,5e-05,5.6e-05,2.2e-05,9e-06,6.7e-05,4.6e-05,6.8e-05,4.2e-05,6.9e-05,6.4e-05,4.6e-05,6e-05,9e-05,4.8e-05,6e-05,2.1e-05,7.1e-05,0.000113,7e-05,0.000106,0.000104,6.7e-05,4e-05,5e-05,9e-06,3e-05,3.3e-05,6.5e-05,3.8e-05,6e-05,5e-05,1.8e-05,8.1e-05,3e-05,5.3e-05,8.6e-05,5e-05,6.1e-05,4.1e-05,2.6e-05,3.9e-05,6.2e-05,5.1e-05,2.3e-05,4e-05,4.5e-05,3.3e-05,5e-06,4.6e-05,4.4e-05,5.8e-05,8.5e-05,9.1e-05,5.6e-05,5e-05,2.7e-05,5.9e-05,9.4e-05,8.7e-05,0.000131,0.000125,0.000111,5.2e-05,4.8e-05,5.9e-05,4.8e-05,2.5e-05,3.3e-05,4.9e-05,8.8e-05,6.3e-05,5.2e-05,0.000103,5.2e-05,6.4e-05,6.3e-05,6.3e-05,7.9e-05,9.3e-05,1.4e-05,7.7e-05,0.000122,7.3e-05,5.5e-05,5.5e-05,8.4e-05,9.8e-05,1.9e-05,9.5e-05,8.1e-05,3.6e-05,4.8e-05,3e-05,3.6e-05,4.4e-05,1.1e-05,7.6e-05,1.8e-05,2.1e-05,8.1e-05,6.1e-05,3.9e-05,6.4e-05,5.8e-05,5.1e-05,7.1e-05,8e-05,9.1e-05
2.3e-05,2.6e-05,2.4e-05,1.7e-05,3.5e-05,6.2e-05,4.6e-05,8.5e-05,5.4e-05,6.5e-05,8.1e-05,5.6e-05,5.9e-05,4.7e-05,7e-05,1.5e-05,9.7e-05,3.4e-05,0.000106,0.000115,4.6e-05,3.9e-05,9e-05,8.8e-05,4.3e-05,4.1e-05,2.7e-05,6.4e-05,1.5e-05,2.8e-05,6.3e-05,7.8e-05,2.2e-05,0.000105,5.9e-05,2.7e-05,4.7e-05,7.1e-05,8.7e-05,0.000108,0.000102,9.1e-05,7.9e-05,3.8e-05,4.7e-05,5.1e-05,5.9e-05,7.7e-05,7.5e-05,3.3e-05,3.3e-05,5e-05,2.4e-05,7.3e-05,8.4e-05,4.5e-05,1.5e-05,1.8e-05,7.2e-05,5e-05,4.8e-05,2.6e-05,4.2e-05,6.9e-05,9.1e-05,9.3e-05,4.6e-05,2.2e-05,6e-05,6.2e-05,9e-06,5.1e-05,5.8e-05,5.5e-05,2.8e-05,3.5e-05,5.5e-05,0.000104,8.6e-05,2.7e-05,3e-05,2.5e-05,5e-05,2.9e-05,7.7e-05,8.8e-05,6.4e-05,4.2e-05,3.3e-05,6.9e-05,7.5e-05,2.5e-05,6e-05,6.3e-05,3.1e-05,4.4e-05,9e-05,0.000106,0.000102,7.4e-05,2.6e-05,8e-05,3.1e-05,2.2e-05,9.1e-05,5e-05,2.7e-05,3.3e-05,4.9e-05,4.5e-05,6.8e-05,8.6e-05,8.3e-05,4.4e-05,3.5e-05,8.1e-05,2.8e-05,6.5e-05,3.4e-05,1.2e-05,3.9e-05
1.6e-05,0.000124,7.2e-05,6.2e-05,5.6e-05,5.9e-05,7.7e-05,9.5e-05,5.1e-05,4.9e-05,0.000169,5.5e-05,0.000115,1e-05,1.9e-05,5.6e-05,0.000159,5.3e-05,6.4e-05,9.9e-05,6.8e-05,5.7e-05,2e-05,3.6e-05,5.6e-05,6.5e-05,8.8e-05,3.9e-05,4.9e-05,6.9e-05,0.00012,2e-05,8.4e-05,0.000134,4.9e-05,3.9e-05,9.5e-05,2.4e-05,0.000127,2.8e-05,0.000113,6.9e-05,6.6e-05,2.8e-05,6.9e-05,0.000111,4.9e-05,7.7e-05,2.1e-05,6.9e-05,7.8e-05,0.000106,0.000144,3.8e-05,3e-05,7e-05,6.9e-05,4.2e-05,7.8e-05,3.1e-05,4.2e-05,0.000111,0.00011,9.4e-05,0.000121,3.3e-05,2.1e-05,5.2e-05,9.1e-05,3.9e-05,5.2e-05,6.4e-05,6.2e-05,7.6e-05,2.5e-05,3e-05,5.9e-05,4.2e-05,3.2e-05,3.2e-05,6e-05,0.000104,6.8e-05,3.6e-05,9.1e-05,0.000147,3.8e-05,7.1e-05,3e-05,5.1e-05,9.9e-05,5.5e-05,6.9e-05,3.8e-05,3.2e-05,8.9e-05,6.1e-05,3.8e-05,4.2e-05,3.6e-05,5.3e-05,9.8e-05,8.3e-05,4.6e-05,0.000104,4.1e-05,4.3e-05,1e-04,7.4e-05,8.6e-05,4.7e-05,7.7e-05,3.9e-05,4.5e-05,5.4e-05,8.8e-05,2.7e-05,6.6e-05,6.5e-05,7.2e-05,5.7e-05
5.4e-05,0.000171,2.8e-05,0.000147,0.00017,0.000154,0.000119,0.000119,0.000165,9.1e-05,0.000129,8e-05,0.000194,0.000119,8.3e-05,5.1e-05,0.000181,0.000163,8.8e-05,0.000167,7e-05,9.7e-05,5.4e-05,0.00012,0.000157,0.000116,4.8e-05,6e-05,5.3e-05,0.000144,6.5e-05,1.7e-05,0.000156,0.000207,0.000124,9.1e-05,5e-05,0.000137,0.000201,0.00013,0.000167,0.000177,9e-06,3.9e-05,8.2e-05,6.9e-05,0.000116,8.1e-05,5.5e-05,0.000112,0.000132,8.7e-05,0.000114,0.000115,0.000128,6.3e-05,5.6e-05,0.000106,4.9e-05,6e-05,3e-05,9.5e-05,7.1e-05,0.000147,0.000111,0.000134,0.00016,0.000101,5.8e-05,4.2e-05,0.000104,0.000115,4.6e-05,6.6e-05,2.6e-05,5e-05,6.5e-05,3.9e-05,4.7e-05,9e-05,0.000135,2.9e-05,7.6e-05,3.9e-05,1e-04,6e-05,0.000125,0.000126,5e-05,8.2e-05,0.000134,3e-05,0.000121,1e-04,3.9e-05,0.00016,0.000105,1.4e-05,0.000101,8.4e-05,6.7e-05,0.000159,0.000125,0.000101,0.000166,0.000133,9.6e-05,0.000177,0.000186,0.000213,0.000122,0.000177,8.2e-05,6.3e-05,8e-05,5.4e-05,0.000132,7.3e-05,5.7e-05,5.2e-05,0.000159
8.4e-05,0.000129,0.000198,0.000269,5.6e-05,5.5e-05,9.3e-05,2.1e-05,0.00016,0.000118,0.000106,7.8e-05,0.000207,0.000244,0.000104,0.000216,0.000245,8.5e-05,9.3e-05,0.000314,0.000293,9.8e-05,0.000114,0.000198,0.000231,0.000136,0.000125,3.2e-05,0.000147,0.000186,4.8e-05,0.00011,0.000163,0.000189,0.00018,0.000128,6.7e-05,0.000111,0.000198,0.000112,0.000182,0.000267,0.000146,3e-05,0.000125,8.7e-05,9.5e-05,0.000142,0.000193,0.000161,5.3e-05,0.000106,0.000169,0.000131,0.000107,0.000102,4.4e-05,0.000155,0.000116,2e-04,0.00016,0.000117,0.000108,4.3e-05,0.000102,7.3e-05,0.000157,0.000198,0.000155,0.000132,0.000106,6.1e-05,8.1e-05,6.7e-05,8.1e-05,0.00011,0.000119,5e-05,8.3e-05,0.00012,0.000179,0.000103,0.000116,0.00011,7.3e-05,0.000133,1e-04,0.000168,0.000178,0.000203,0.000134,0.000149,0.000117,0.000103,7.5e-05,0.000157,0.000234,0.000174,0.000157,0.000165,0.000275,0.000309,9.6e-05,7.6e-05,6.6e-05,5.7e-05,3.9e-05,9.8e-05,4.7e-05,8.3e-05,6.8e-05,0.000224,0.000123,9.6e-05,0.000149,0.000151,0.000196,6.3e-05,8.9e-05,4e-05,0.000165
0.000272,0.00013,0.000247,0.000122,0.000143,9.5e-05,0.000232,0.000161,5.9e-05,0.000197,4.1e-05,0.000133,0.000178,0.00012,8e-05,0.000303,0.000109,0.000122,0.000206,0.000223,0.000156,0.000197,0.000112,6.1e-05,0.000116,2.1e-05,9e-05,0.000128,0.000146,0.000122,0.000241,0.000192,9.6e-05,0.000124,0.000231,0.000174,0.000144,5.5e-05,0.000152,0.000318,0.000144,0.000205,0.000141,9.8e-05,4.8e-05,0.000102,7.6e-05,0.00018,0.000239,0.000215,0.000249,8.1e-05,0.000134,0.00031,0.000178,0.00021,0.000194,7.4e-05,0.000111,0.000269,0.000162,0.000242,0.000117,0.00027,4.7e-05,0.00019,0.000154,0.000263,0.00021,0.000123,0.000184,0.000206,7.2e-05,6.1e-05,9.6e-05,0.000129,3.1e-05,0.000123,6.6e-05,0.000262,8.5e-05,6.3e-05,6.6e-05,0.00016,0.000187,2.2e-05,0.00011,0.000161,0.000146,1.7e-05,0.000189,0.000186,0.000139,3.4e-05,0.000112,3.6e-05,0.000164,3e-05,5e-05,0.00015,0.000258,0.000223,0.000305,0.000178,9.6e-05,5.1e-05,3e-05,0.000115,0.000221,6.3e-05,5.6e-05,2e-04,0.000181,2.1e-05,0.000125,0.000174,9.8e-05,9.6e-05,0.00013,5e-05,7.8e-05
0.000296,0.000609,0.00043,0.000311,0.000107,0.000161,0.000168,0.000196,0.000265,0.000446,0.000337,0.000276,0.000161,0.000112,0.000237,0.00037,0.000419,0.000181,0.000103,0.000223,0.000137,0.000193,0.000135,0.000108,9.7e-05,0.000109,0.000107,5.5e-05,0.000107,0.000239,0.000504,0.000582,0.000472,0.000409,0.00044,0.000236,6.1e-05,0.000231,0.000414,0.000464,0.000363,0.000231,0.000362,0.000207,0.000171,0.000297,0.000304,0.000221,0.000231,0.00012,9.8e-05,0.000169,0.000104,0.000227,0.00023,0.000147,7e-05,0.000172,0.000329,0.00054,0.00037,0.000399,0.000302,0.000373,0.000362,0.000355,0.000416,0.000124,6.5e-05,0.00025,0.000129,0.000267,0.000338,0.000301,0.000284,0.000305,0.00026,0.000174,8.1e-05,0.000258,0.000365,0.000376,0.000158,0.00014,7.2e-05,0.000197,0.000316,0.000211,8.1e-05,9.2e-05,0.000236,4.8e-05,4.8e-05,4.4e-05,0.000124,0.000255,0.000101,0.000212,0.000145,0.000218,0.000479,0.000316,0.00035,2e-04,0.000145,0.000191,0.000172,0.000325,0.000528,0.000425,0.000182,0.000184,6.1e-05,0.000127,0.000117,0.000125,0.000223,3e-04,0.000293,0.000189,9.3e-05
0.000148,0.000407,0.000278,3.2e-05,9.3e-05,0.000142,0.000201,0.000344,0.000516,0.000533,0.000267,0.000179,0.00014,0.000185,0.000294,0.000393,0.000319,0.000248,0.000102,7.5e-05,4.4e-05,0.00016,0.000159,0.000198,0.000255,7.6e-05,5.2e-05,9.8e-05,8.9e-05,0.000141,0.000284,0.00015,0.000216,0.000203,0.00012,0.000127,0.000124,0.000144,0.000399,8.2e-05,0.000217,0.000311,0.000277,0.000196,0.000118,0.000269,0.00039,0.000507,0.000281,0.000136,0.00011,9.5e-05,0.000108,0.000146,0.000238,0.000157,6.9e-05,0.000147,0.000281,0.00031,0.000295,0.000136,0.000107,0.000322,0.00021,5.1e-05,0.00016,0.000201,9.3e-05,0.000114,0.000185,0.000328,0.000307,8.8e-05,0.000113,0.000104,0.000149,6.7e-05,6.2e-05,0.000161,0.000181,0.000214,0.000217,0.000103,2.9e-05,0.000161,0.000231,2e-04,0.000207,0.000212,0.000151,0.000163,0.000112,5.5e-05,5.2e-05,0.00022,0.000279,0.00029,0.000256,0.00022,0.000351,0.000304,0.000233,0.000154,0.000127,0.000121,5.5e-05,0.000267,0.000248,0.000244,0.000167,1.9e-05,0.000133,0.000111,7.7e-05,2.5e-05,0.000162,0.000167,4.3e-05,5e-05,0.000104
5.8e-05,0.000251,7.6e-05,7.7e-05,1e-04,8.6e-05,0.000107,0.000123,0.000194,0.00011,1.3e-05,4.6e-05,2.6e-05,7.5e-05,0.000132,0.000107,5.6e-05,9.3e-05,8.2e-05,5.1e-05,6.3e-05,7.1e-05,6.8e-05,8.8e-05,0.000107,0.000141,6.2e-05,1.2e-05,3.7e-05,9.5e-05,7.4e-05,5.3e-05,0.000159,7.6e-05,0.000104,4.3e-05,2e-05,0.000137,0.000125,0.000126,8.5e-05,0.00011,8.2e-05,9.1e-05,7.4e-05,0.000121,0.000159,0.000101,5.8e-05,2.8e-05,2.9e-05,7.2e-05,5.2e-05,0.000115,5e-05,5.9e-05,2.2e-05,0.00011,1e-04,0.000139,5e-05,3.3e-05,0.000159,0.000112,5.2e-05,1.4e-05,0.000101,0.000115,8.2e-05,6e-05,0.000103,8e-05,9.3e-05,5.9e-05,4.6e-05,0.00011,2.2e-05,2.9e-05,3e-05,5.1e-05,8.9e-05,7.2e-05,5.5e-05,3.9e-05,3.3e-05,9.9e-05,3.6e-05,4.3e-05,0.000113,5.7e-05,3.6e-05,0.000101,7.6e-05,2.1e-05,3.5e-05,0.000111,4.5e-05,0.000109,6.9e-05,0.000119,0.000113,0.000112,6e-05,2.2e-05,7.4e-05,5.8e-05,0.000117,0.000123,0.000125,5.6e-05,2.5e-05,5.9e-05,3.5e-05,3.4e-05,4.8e-05,5.7e-05,6.8e-05,6.8e-05,2.8e-05,4.9e-05,7.1e-05
6e-05,9.8e-05,3.4e-05,8.9e-05,4.6e-05,2.2e-05,8.4e-05,1e-04,0.000123,0.000106,6.7e-05,5.5e-05,3.5e-05,7.6e-05,6.8e-05,4.7e-05,5.1e-05,1.9e-05,4.7e-05,6.5e-05,1.9e-05,3.5e-05,6.7e-05,5.8e-05,4.8e-05,6.6e-05,4.3e-05,2.6e-05,5.2e-05,4.1e-05,3.9e-05,5.6e-05,7e-05,6e-05,5.1e-05,7.8e-05,3.5e-05,4.4e-05,0.000117,5.7e-05,3.4e-05,0.000119,5.2e-05,4.7e-05,6e-06,7.8e-05,6.6e-05,8.6e-05,3.7e-05,2.6e-05,3.9e-05,4.2e-05,4.1e-05,7.3e-05,4.7e-05,1.2e-05,4.6e-05,0.000104,7.8e-05,7e-05,5.4e-05,3.4e-05,0.000112,9.9e-05,5.7e-05,3.4e-05,6.3e-05,4.6e-05,3.2e-05,3.1e-05,5.8e-05,7.1e-05,5.4e-05,2.5e-05,1.9e-05,4.4e-05,3e-06,6e-05,3.1e-05,4.1e-05,6.8e-05,4.5e-05,1.7e-05,7e-06,4e-06,7.6e-05,4.1e-05,3.3e-05,8.3e-05,2e-05,3.6e-05,6.3e-05,5.7e-05,3.1e-05,3.1e-05,2.5e-05,3.9e-05,6.4e-05,9e-06,4.7e-05,8.7e-05,7e-05,4.5e-05,3e-05,4e-05,3.9e-05,5.2e-05,0.00011,6.3e-05,4.2e-05,5e-06,4.4e-05,3.6e-05,2e-05,1.7e-05,4.5e-05,1.9e-05,3.5e-05,1.7e-05,4.6e-05,3.4e-05
0.000104,3.2e-05,3.6e-05,0.000117,8.6e-05,5.1e-05,7.9e-05,3.1e-05,8e-05,7.4e-05,8.8e-05,0.000122,3.7e-05,2.8e-05,7.7e-05,2.7e-05,2.1e-05,4.3e-05,4.6e-05,0.000148,3.8e-05,3.9e-05,2.5e-05,3e-05,4.7e-05,4.9e-05,6.7e-05,3.4e-05,8.4e-05,3.4e-05,0.000108,6e-06,3.8e-05,8.7e-05,3.2e-05,4e-05,4.6e-05,5.2e-05,0.00016,0.000166,5.4e-05,8.2e-05,2.9e-05,5.1e-05,4.2e-05,0.000115,2.9e-05,9.1e-05,3.8e-05,6.1e-05,2e-05,2.6e-05,1.4e-05,6.2e-05,3.6e-05,3.8e-05,3.6e-05,5.3e-05,9.4e-05,4.9e-05,7.7e-05,3e-05,0.000126,3.5e-05,0.000103,3.3e-05,9.5e-05,8.2e-05,4.8e-05,1.2e-05,3.7e-05,6e-05,2.7e-05,3.2e-05,9.2e-05,0.000112,3e-05,9e-06,4.4e-05,3.5e-05,6.8e-05,3.7e-05,3e-05,4.9e-05,1.3e-05,6.9e-05,3e-05,3.8e-05,8.5e-05,3.3e-05,4.7e-05,9.7e-05,9.4e-05,7.1e-05,1.1e-05,7.4e-05,8.9e-05,6.6e-05,3.4e-05,2.9e-05,6.2e-05,5.9e-05,7e-05,0.000124,0.000101,5.4e-05,5.2e-05,1e-04,8.1e-05,5.7e-05,6.8e-05,8.3e-05,1.9e-05,3.1e-05,5.5e-05,1.9e-05,2.8e-05,5.9e-05,4.8e-05,4.8e-05,1.5e-05
8.3e-05,0.000123,8.4e-05,8.5e-05,6.6e-05,5.6e-05,5e-06,0.000104,5e-05,0.000118,7.2e-05,8.9e-05,9e-05,4.2e-05,0.000115,6.7e-05,0.000104,9.8e-05,2.6e-05,0.000111,0.000121,5e-05,4.6e-05,7.9e-05,2.7e-05,1.8e-05,6.5e-05,8.5e-05,0.000126,8.5e-05,4.1e-05,2.4e-05,5.7e-05,2.8e-05,6.9e-05,4.1e-05,7.4e-05,0.00011,0.000112,9.4e-05,0.000126,4.3e-05,4.9e-05,0.00011,9.2e-05,1.8e-05,6.9e-05,6.8e-05,2.4e-05,9.1e-05,8.3e-05,5.5e-05,7.5e-05,2.2e-05,8e-05,2.3e-05,8.7e-05,5.4e-05,0.000104,0.000115,5.3e-05,4.2e-05,8.2e-05,7.6e-05,5.9e-05,7e-05,6.5e-05,5.5e-05,3.7e-05,4.3e-05,9e-06,4.2e-05,4.7e-05,4.7e-05,7.2e-05,0.000133,0.000112,1.6e-05,7.3e-05,4.3e-05,4.4e-05,2.4e-05,3.5e-05,8.3e-05,6.5e-05,5e-05,5.3e-05,0.000112,0.000158,0.000108,8.1e-05,7.2e-05,5.3e-05,5.6e-05,9.6e-05,2.5e-05,3.8e-05,3.7e-05,4.1e-05,5.4e-05,8e-06,0.000109,5.5e-05,8.1e-05,2.4e-05,4.9e-05,2.9e-05,7.9e-05,0.000164,9.9e-05,7.7e-05,2.3e-05,5.9e-05,8.3e-05,4.3e-05,2.6e-05,3.4e-05,4.3e-05,7.1e-05,2.7e-05,4.2e-05
6e-05,0.000135,8.3e-05,4.6e-05,3.4e-05,8.7e-05,8.4e-05,6.6e-05,8.7e-05,2.5e-05,5.2e-05,7.8e-05,5.9e-05,0.000107,0.000107,3.8e-05,9.2e-05,0.000123,5.7e-05,0.000102,0.000147,0.000134,5e-05,0.000105,3.5e-05,3e-05,4e-05,3.7e-05,8.7e-05,9.7e-05,2.4e-05,3.3e-05,1.9e-05,5.9e-05,3.8e-05,5.7e-05,0.000106,0.000123,0.000119,5.1e-05,6e-06,5.5e-05,3.8e-05,0.000106,0.000135,4.2e-05,5.2e-05,0.00014,8.8e-05,5.7e-05,5.6e-05,4e-05,7.9e-05,2.8e-05,0.000104,9.2e-05,8.8e-05,8.9e-05,5e-06,0.000104,9.3e-05,8.8e-05,3.7e-05,3.4e-05,3e-05,2.5e-05,3.6e-05,3.4e-05,5.6e-05,4.5e-05,3.3e-05,4.8e-05,8e-05,7.7e-05,6e-05,3.6e-05,5.3e-05,5e-05,7e-05,4.5e-05,3.1e-05,7.5e-05,4.2e-05,5.2e-05,2.9e-05,6.2e-05,6.1e-05,9.3e-05,3.7e-05,5.7e-05,8.1e-05,7.5e-05,6e-06,4.9e-05,0.000104,1e-04,7.7e-05,9.1e-05,8.6e-05,1.7e-05,6.9e-05,2.1e-05,5.8e-05,0.000105,0.000117,9.8e-05,5.9e-05,5e-05,0.000107,4.9e-05,3.5e-05,3.5e-05,6.9e-05,5.9e-05,7e-05,5.6e-05,6.9e-05,1.7e-05,2.4e-05,4.2e-05,3.6e-05
0.000119,0.000236,0.000157,7.7e-05,6.1e-05,3e-05,9.2e-05,0.000118,4.1e-05,3.5e-05,9.3e-05,0.000129,5.8e-05,3.4e-05,4.2e-05,5.7e-05,6.4e-05,7.7e-05,0.000117,0.000181,3.1e-05,8.9e-05,0.000103,0.000116,4.4e-05,2.9e-05,1e-05,3.1e-05,6.8e-05,3.3e-05,8.9e-05,8.6e-05,7.4e-05,9e-05,7.2e-05,2.7e-05,0.000101,0.000116,0.000166,0.000135,5.2e-05,9.9e-05,0.000126,0.000147,0.000143,0.000135,2.8e-05,9.9e-05,8.7e-05,0.000125,9e-06,5.2e-05,4.7e-05,7.9e-05,0.000105,2.8e-05,5e-05,3.4e-05,0.000149,0.000153,0.000154,5.6e-05,0.000116,0.000108,4.3e-05,3.6e-05,4.5e-05,6.4e-05,4.7e-05,1e-05,3.1e-05,0.000109,0.000101,3.5e-05,1.3e-05,4.8e-05,3.6e-05,5.1e-05,6.3e-05,3.6e-05,4.8e-05,0.000104,0.000122,8e-05,5.8e-05,9e-05,6e-05,0.000108,8.4e-05,8.5e-05,7.3e-05,3.4e-05,8.3e-05,8.2e-05,9.2e-05,5.1e-05,2.5e-05,5.6e-05,4.4e-05,6e-05,0.000119,6.7e-05,4.7e-05,0.000113,0.000125,4.5e-05,5.4e-05,4.1e-05,5.3e-05,3.4e-05,6.7e-05,0.000106,7.7e-05,0.000135,8.1e-05,8.8e-05,7.4e-05,8.5e-05,5.9e-05,6.2e-05,2.8e-05
6.7e-05,8.2e-05,5.1e-05,5.6e-05,7.2e-05,8.5e-05,0.000102,1.1e-05,6.7e-05,8.9e-05,8.1e-05,7.2e-05,9.8e-05,6.7e-05,7.4e-05,8.6e-05,8.2e-05,3.8e-05,9.1e-05,0.00011,9.9e-05,7.1e-05,0.000107,7.1e-05,9.6e-05,7.9e-05,4.1e-05,5e-05,4.7e-05,6e-05,0.000121,7.8e-05,5.9e-05,2e-05,2.4e-05,3.6e-05,5.6e-05,0.000168,3.3e-05,7.2e-05,0.000106,5.9e-05,4e-05,1.5e-05,0.000106,4.3e-05,5.5e-05,6.9e-05,6.7e-05,0.000105,0.00011,9.7e-05,0.000134,1.1e-05,2.8e-05,4.1e-05,3.9e-05,8e-06,0.000125,3.8e-05,0.000104,0.000169,0.000118,6.6e-05,4.3e-05,4.5e-05,5.2e-05,0.000109,0.000128,6.5e-05,3.8e-05,6.9e-05,5e-06,3.3e-05,6.8e-05,9.1e-05,7.8e-05,4e-05,7e-05,8.5e-05,1.1e-05,6.3e-05,7.9e-05,5.5e-05,6.5e-05,4.1e-05,3.9e-05,2.8e-05,2.2e-05,7.1e-05,2.7e-05,3.1e-05,6.7e-05,2.5e-05,5.3e-05,4.2e-05,3e-06,2.8e-05,7.9e-05,2.3e-05,7.8e-05,1.5e-05,3.6e-05,5.1e-05,3.8e-05,3.3e-05,9.8e-05,4.2e-05,2.9e-05,6.8e-05,6.6e-05,6.9e-05,3.9e-05,8.7e-05,5.2e-05,5.5e-05,1.4e-05,4.1e-05,3.2e-05,4.4e-05,6.9e-05
9.9e-05,0.000127,5.1e-05,0.000111,0.000146,0.000199,1e-04,8.7e-05,6.2e-05,8.2e-05,0.000126,6.2e-05,6.7e-05,6.8e-05,0.000153,0.000125,7.8e-05,6e-05,7.6e-05,0.000108,4.7e-05,8.7e-05,3e-05,3.5e-05,9.1e-05,5.5e-05,1.4e-05,2.9e-05,9.7e-05,0.000134,7.4e-05,0.00014,6.8e-05,8.2e-05,5.1e-05,1.7e-05,2.7e-05,0.000157,9.7e-05,4.5e-05,8.1e-05,3.6e-05,7.5e-05,5.3e-05,7.5e-05,0.000101,3.1e-05,6.1e-05,6.9e-05,0.000139,5.4e-05,3.6e-05,9.6e-05,0.000145,7.7e-05,7.5e-05,5.1e-05,4e-05,9.7e-05,0.000114,2.7e-05,0.000109,4e-05,5.5e-05,4e-06,1e-05,5.3e-05,8.8e-05,0.000117,7.6e-05,6.4e-05,9.7e-05,5.5e-05,8.4e-05,0.000156,4.3e-05,3.4e-05,6.9e-05,0.000105,3.7e-05,5e-05,2.1e-05,9.1e-05,4e-05,2.8e-05,5.6e-05,7.4e-05,2.7e-05,2.5e-05,6.9e-05,3.1e-05,4.3e-05,2.6e-05,6.3e-05,6.7e-05,1.3e-05,6.4e-05,7.6e-05,1e-05,4.4e-05,9.1e-05,5e-05,3.1e-05,6.1e-05,5.2e-05,2.7e-05,7.4e-05,5e-05,2.7e-05,6.6e-05,5.3e-05,5.5e-05,6.9e-05,1.8e-05,6.9e-05,1.9e-05,1e-06,3.3e-05,7.6e-05,3.2e-05,5.3e-05
5.7e-05,7.3e-05,9.3e-05,7.6e-05,9.4e-05,6.2e-05,2.5e-05,5.1e-05,4e-06,8.5e-05,0.00011,7.7e-05,2.7e-05,8.8e-05,8.3e-05,9.2e-05,6e-05,3e-05,3.1e-05,5e-05,6.2e-05,9.9e-05,5.8e-05,7.6e-05,0.000127,6.2e-05,1.8e-05,3e-05,0.000103,3.4e-05,7.7e-05,6.2e-05,5.2e-05,0.000106,4.4e-05,6.4e-05,5.8e-05,5.3e-05,1.2e-05,3.1e-05,4.9e-05,3.9e-05,6.6e-05,4e-05,6.2e-05,1.4e-05,3.2e-05,2.9e-05,9.9e-05,9e-05,2e-05,5.3e-05,0.000106,4.9e-05,3.9e-05,6.6e-05,8.7e-05,4.6e-05,0.000118,8.2e-05,0.000124,4.7e-05,3.2e-05,3.5e-05,4.6e-05,2.4e-05,2.4e-05,0.000123,2.3e-05,4.3e-05,2.3e-05,4.9e-05,1.5e-05,0.000118,0.000146,8.3e-05,9.9e-05,7.1e-05,1.3e-05,8e-05,4.8e-05,3.2e-05,3.2e-05,3.8e-05,1.1e-05,3.8e-05,5.9e-05,3.9e-05,2.5e-05,6e-05,4e-05,4.1e-05,2.2e-05,9.9e-05,5.7e-05,2.7e-05,8e-05,7e-06,1.5e-05,5e-06,0.000107,9.4e-05,7.7e-05,4.8e-05,2.5e-05,8e-06,4.4e-05,6.4e-05,3.4e-05,4.7e-05,2.2e-05,3e-05,3.6e-05,3.6e-05,9.3e-05,6.9e-05,2.8e-05,3.3e-05,2.5e-05,4.8e-05,4.1e-05
7.9e-05,4.1e-05,2.3e-05,4.2e-05,3.6e-05,6e-05,2.8e-05,4.2e-05,4.7e-05,6.1e-05,2.1e-05,4e-05,3.5e-05,4.8e-05,7.3e-05,2.3e-05,5.9e-05,4.7e-05,4.8e-05,7.8e-05,0.000112,5.8e-05,1.2e-05,3.2e-05,6.3e-05,4.6e-05,7.2e-05,3.6e-05,5.2e-05,7.7e-05,0.000112,6e-05,6.6e-05,3e-05,3.9e-05,6.9e-05,2.4e-05,5.7e-05,2.8e-05,4.5e-05,3.6e-05,1.4e-05,2.9e-05,2.3e-05,2.6e-05,2e-05,3.4e-05,5.5e-05,5.9e-05,1.5e-05,8.1e-05,8.4e-05,1.3e-05,3.1e-05,4.2e-05,2e-05,4.1e-05,5.1e-05,6e-05,2.5e-05,5.4e-05,4.4e-05,2.6e-05,5.1e-05,8.2e-05,6.5e-05,5.1e-05,6.3e-05,2.4e-05,8e-06,9e-06,4.4e-05,3e-05,5.4e-05,6.1e-05,6.2e-05,6.6e-05,2.2e-05,9e-06,6.8e-05,3.3e-05,6.9e-05,5.4e-05,3.7e-05,5.9e-05,2e-06,2.6e-05,1.6e-05,4.5e-05,5.9e-05,4.7e-05,2e-05,3.4e-05,7.7e-05,5.8e-05,4.3e-05,5.8e-05,4.9e-05,3.9e-05,3.7e-05,5.9e-05,3.2e-05,5.7e-05,1.2e-05,2.6e-05,4e-06,1.7e-05,3.2e-05,2.5e-05,4.1e-05,4.5e-05,2.6e-05,2.6e-05,2e-05,6.6e-05,4.6e-05,3.8e-05,2.9e-05,3.3e-05,1.9e-05,3e-05
4.7e-05,5.3e-05,3.5e-05,6.8e-05,1.8e-05,7.4e-05,2.5e-05,3.5e-05,3.7e-05,1e-04,8e-05,1e-05,1.1e-05,4e-06,2.8e-05,2.5e-05,4.6e-05,2e-05,7e-06,2.1e-05,2.3e-05,7.4e-05,6.9e-05,6.3e-05,8.5e-05,2e-06,7.6e-05,9.1e-05,4.6e-05,2.7e-05,5.2e-05,2.4e-05,6.8e-05,7e-05,5e-05,2.9e-05,3.2e-05,2.3e-05,2.8e-05,3.6e-05,3e-05,2.3e-05,2.1e-05,2.8e-05,3.5e-05,6.1e-05,3.2e-05,3.5e-05,3.9e-05,3.2e-05,7.7e-05,6.8e-05,3.9e-05,6.2e-05,6.5e-05,2.1e-05,4e-05,7.1e-05,7.2e-05,7e-06,6.3e-05,4.1e-05,7.2e-05,1.9e-05,4.4e-05,5.9e-05,1.5e-05,2.9e-05,6.8e-05,3.5e-05,2.8e-05,8e-05,3.3e-05,2.6e-05,3.5e-05,3.1e-05,2.4e-05,2.3e-05,1.3e-05,5.3e-05,2.2e-05,6.3e-05,1.4e-05,1.1e-05,4.4e-05,6.3e-05,3.1e-05,1.9e-05,5.6e-05,3.8e-05,5.2e-05,4.7e-05,2.5e-05,2.1e-05,1.2e-05,4.5e-05,8.4e-05,3.8e-05,1.8e-05,1e-05,4.7e-05,4.2e-05,8.9e-05,6.1e-05,4.8e-05,4.4e-05,8e-06,4e-05,5.3e-05,2.6e-05,1.9e-05,7e-06,2.1e-05,2.3e-05,3.4e-05,2.9e-05,3.1e-05,2.6e-05,4.5e-05,4.2e-05,3.4e-05
5e-05,1.4e-05,4.1e-05,7.8e-05,3.6e-05,6.4e-05,3.6e-05,6e-06,9e-06,4.3e-05,3.1e-05,1.2e-05,1.8e-05,2.3e-05,3.4e-05,3.6e-05,6.8e-05,6.9e-05,6e-06,3.5e-05,7e-06,2.4e-05,7.6e-05,2.5e-05,6.2e-05,4.7e-05,4e-05,3.9e-05,3.2e-05,4.7e-05,1.8e-05,4e-05,1.4e-05,2.5e-05,6e-06,2.1e-05,1.8e-05,1.5e-05,1.6e-05,2.6e-05,2.3e-05,1.8e-05,1e-05,4.3e-05,3.8e-05,4.1e-05,2.4e-05,2.4e-05,1.7e-05,1.3e-05,3e-05,6.7e-05,5.4e-05,1.6e-05,1.9e-05,3.7e-05,3.5e-05,6.3e-05,0.000115,6e-05,2e-05,4.2e-05,2.2e-05,3.3e-05,1.5e-05,4.2e-05,4.9e-05,5.3e-05,1.3e-05,1.6e-05,4.2e-05,3.5e-05,3.6e-05,3.2e-05,2e-05,3.6e-05,5.9e-05,1.8e-05,4e-06,2.4e-05,4e-06,1.8e-05,2.6e-05,3.4e-05,2.5e-05,6e-06,1e-05,1.9e-05,1.2e-05,2.6e-05,2.9e-05,5.9e-05,2.5e-05,4.1e-05,2.2e-05,2.1e-05,2.9e-05,2.2e-05,1.6e-05,1.5e-05,5e-05,4.3e-05,3.4e-05,3.7e-05,1.5e-05,1.4e-05,1.3e-05,1.1e-05,3e-05,1.7e-05,2.3e-05,1.3e-05,2.1e-05,2.6e-05,2.6e-05,6.1e-05,2.8e-05,2.9e-05,2.8e-05,1.8e-05,2.1e-05
4.6e-05,7.6e-05,5.6e-05,4.4e-05,3.6e-05,5.6e-05,6.3e-05,5.8e-05,5.1e-05,4.3e-05,4.1e-05,1.4e-05,3e-05,4.7e-05,6.2e-05,5e-06,5.6e-05,5.7e-05,8.4e-05,9.9e-05,7.1e-05,3.9e-05,4.9e-05,7.3e-05,0.000124,9.7e-05,5.3e-05,3.6e-05,3.3e-05,4.3e-05,4.2e-05,4.1e-05,3.1e-05,1.3e-05,2.3e-05,3.2e-05,4.3e-05,7.4e-05,6.4e-05,3e-05,4e-06,1.2e-05,3.2e-05,6.7e-05,2.9e-05,3.7e-05,3.8e-05,5.9e-05,6.4e-05,3.8e-05,7.3e-05,9.9e-05,9.7e-05,8e-05,5.1e-05,5.2e-05,3.5e-05,4.9e-05,0.000111,6.9e-05,5.9e-05,3.4e-05,5.6e-05,5.4e-05,5.2e-05,6e-05,9e-06,3e-05,4.4e-05,1.8e-05,5.4e-05,9.2e-05,0.000102,9.3e-05,4.7e-05,1.9e-05,6.6e-05,9.3e-05,7e-05,5.1e-05,2.4e-05,2.5e-05,2.6e-05,3e-05,2.2e-05,2.2e-05,6e-06,2.6e-05,2.8e-05,4.6e-05,6.3e-05,4.9e-05,6.5e-05,9.4e-05,5.2e-05,2.8e-05,3.3e-05,3.8e-05,1.4e-05,2.2e-05,5.5e-05,6.5e-05,4.8e-05,5.1e-05,2.8e-05,1.1e-05,6e-06,2.6e-05,4.9e-05,3.7e-05,5.1e-05,5.3e-05,4.6e-05,2.1e-05,2.6e-05,5.7e-05,5.7e-05,5e-05,5.4e-05,2.4e-05,1.2e-05
4.9e-05,3.5e-05,1.9e-05,3.2e-05,1.9e-05,1.2e-05,3.2e-05,1.8e-05,2.4e-05,1.4e-05,8e-06,2.2e-05,4.4e-05,5.9e-05,2.6e-05,2.7e-05,3.3e-05,2.1e-05,5.6e-05,5.5e-05,2.6e-05,1.9e-05,3.6e-05,2.4e-05,7.2e-05,4.1e-05,3.2e-05,3e-05,2.9e-05,5e-05,2.5e-05,4.7e-05,2.2e-05,2.1e-05,1.2e-05,1.2e-05,2.8e-05,3.9e-05,3.1e-05,1.4e-05,8e-06,2.6e-05,4.4e-05,2.1e-05,1.6e-05,3.1e-05,5.4e-05,2.7e-05,1.3e-05,1.6e-05,4.6e-05,2.5e-05,1e-05,2.5e-05,4e-05,9e-06,2.6e-05,5.9e-05,2.7e-05,8e-06,1.6e-05,7e-06,2.4e-05,2.2e-05,2.6e-05,2.4e-05,4.7e-05,3.6e-05,1.6e-05,2.9e-05,4.2e-05,2.1e-05,4.5e-05,1.8e-05,1.5e-05,2.7e-05,2.1e-05,3.8e-05,1.1e-05,1.4e-05,2.3e-05,1e-05,1.8e-05,1.8e-05,1.2e-05,1.2e-05,8e-06,2.9e-05,1.6e-05,2.7e-05,2.1e-05,1.6e-05,3.4e-05,3.3e-05,2.9e-05,7e-06,3.6e-05,7e-06,1.8e-05,3e-06,2.7e-05,3.1e-05,2.3e-05,1.7e-05,5e-06,1.2e-05,7e-06,3.1e-05,2.1e-05,2.1e-05,1.8e-05,2.2e-05,4e-06,7e-06,1.4e-05,2.5e-05,8e-06,2.9e-05,8e-06,6e-06,3e-06
1.9e-05,3.1e-05,2.9e-05,9e-06,6e-06,1.3e-05,2.2e-05,1.8e-05,1.4e-05,1.4e-05,1.3e-05,1.3e-05,2.2e-05,1.1e-05,1.2e-05,1.1e-05,1.5e-05,2e-05,2e-05,2.6e-05,1e-05,1.1e-05,7e-06,3e-05,2e-05,1e-05,4e-06,2.2e-05,2e-06,2.7e-05,1.6e-05,1e-05,1.4e-05,1e-06,4e-06,3e-06,1.8e-05,3.3e-05,5e-06,7e-06,4e-06,1.9e-05,2.3e-05,2e-05,6e-06,1.9e-05,2.1e-05,1.9e-05,3e-06,1.2e-05,2.8e-05,1.8e-05,1.4e-05,1.1e-05,1.1e-05,1.6e-05,1.6e-05,1.9e-05,2.9e-05,1.5e-05,1.2e-05,1.2e-05,1.1e-05,6e-06,1.7e-05,1.6e-05,1.8e-05,2.2e-05,2.7e-05,1.7e-05,2.3e-05,3.6e-05,9e-06,7e-06,1.4e-05,2.1e-05,1.8e-05,6e-06,1.2e-05,3e-06,4e-06,1.5e-05,1.6e-05,1.6e-05,3e-06,1.2e-05,4e-06,1.9e-05,1.9e-05,2.1e-05,1.4e-05,4e-06,2.8e-05,9e-06,9e-06,1.7e-05,1.3e-05,7e-06,1.1e-05,1.3e-05,3e-05,5e-06,1.1e-05,9e-06,6e-06,1.3e-05,1e-05,2e-05,1.4e-05,1.8e-05,8e-06,9e-06,2e-06,1e-05,9e-06,7e-06,9e-06,1.2e-05,8e-06,7e-06,2e-06
2e-05,2.9e-05,2.8e-05,1.6e-05,1.3e-05,5e-06,2e-05,1.7e-05,1e-05,1.2e-05,9e-06,9e-06,3e-06,7e-06,1.2e-05,7e-06,1e-05,5e-06,2e-06,1.5e-05,4e-06,1.1e-05,7e-06,1.5e-05,1.6e-05,5e-06,1.4e-05,1.5e-05,8e-06,1.1e-05,9e-06,6e-06,1.7e-05,8e-06,1.1e-05,1.4e-05,1.8e-05,2.2e-05,7e-06,5e-06,5e-06,1.4e-05,2.5e-05,1.5e-05,1e-05,1.1e-05,2.3e-05,1.1e-05,1.1e-05,7e-06,1.3e-05,6e-06,1.2e-05,8e-06,8e-06,1.3e-05,1.7e-05,2.3e-05,9e-06,8e-06,2.2e-05,1e-05,1.1e-05,1.1e-05,1e-05,1.5e-05,2.1e-05,1.3e-05,1.4e-05,1.4e-05,1.2e-05,1.6e-05,7e-06,6e-06,1e-06,8e-06,1.4e-05,1.6e-05,8e-06,4e-06,8e-06,1.3e-05,1.7e-05,8e-06,2e-06,7e-06,6e-06,5e-06,8e-06,1.6e-05,8e-06,2e-06,1.8e-05,6e-06,7e-06,3e-06,1.1e-05,7e-06,9e-06,6e-06,2.4e-05,6e-06,2e-06,1.3e-05,4e-06,4e-06,1e-05,1.9e-05,1e-05,1.2e-05,3e-06,1e-05,3e-06,2e-06,9e-06,9e-06,1.6e-05,7e-06,5e-06,3e-06,6e-06
2.4e-05,2.1e-05,2.2e-05,5e-06,2e-06,3e-06,1e-05,1.2e-05,1.1e-05,1.4e-05,3e-06,4e-06,8e-06,1.4e-05,3e-06,9e-06,4e-06,1.2e-05,1.1e-05,1.2e-05,9e-06,7e-06,1.2e-05,7e-06,1.3e-05,2e-06,1e-05,1.4e-05,6e-06,1.1e-05,7e-06,9e-06,6e-06,1.4e-05,7e-06,1.2e-05,1e-05,1.7e-05,4e-06,1e-06,7e-06,1e-06,1.8e-05,4e-06,1e-06,3e-06,1.9e-05,9e-06,1.4e-05,1e-06,1.6e-05,6e-06,1.3e-05,7e-06,7e-06,5e-06,1e-05,8e-06,1.5e-05,7e-06,1.6e-05,9e-06,1.3e-05,7e-06,1e-05,8e-06,1.5e-05,1.1e-05,1e-05,1.2e-05,5e-06,1.9e-05,7e-06,9e-06,9e-06,8e-06,1.1e-05,1e-05,6e-06,3e-06,7e-06,1e-05,1.1e-05,8e-06,5e-06,1.1e-05,8e-06,4e-06,9e-06,1e-05,9e-06,4e-06,1.1e-05,6e-06,8e-06,6e-06,1e-05,9e-06,1e-06,3e-06,2e-05,5e-06,6e-06,8e-06,3e-06,3e-06,1.1e-05,1.2e-05,2e-06,2e-06,4e-06,9e-06,6e-06,1.2e-05,9e-06,5e-06,1.4e-05,4e-06,5e-06,5e-06,2e-06
8e-06,1.9e-05,1.4e-05,6e-06,3e-06,5e-06,4e-06,1.2e-05,2.2e-05,7e-06,1.3e-05,4e-06,4e-06,1.2e-05,1e-06,1.1e-05,4e-06,8e-06,1e-05,9e-06,5e-06,7e-06,1e-05,8e-06,9e-06,3e-06,1.4e-05,5e-06,5e-06,9e-06,9e-06,1.1e-05,1.5e-05,1.2e-05,1e-05,5e-06,8e-06,1.5e-05,8e-06,7e-06,3e-06,0,1.3e-05,6e-06,4e-06,9e-06,1.2e-05,1.5e-05,3e-06,1.3e-05,1.5e-05,5e-06,3e-06,5e-06,5e-06,5e-06,4e-06,3e-06,1.5e-05,4e-06,9e-06,4e-06,7e-06,8e-06,7e-06,7e-06,1.6e-05,1.3e-05,1.1e-05,1e-05,2e-06,1.3e-05,8e-06,6e-06,5e-06,7e-06,6e-06,1e-05,2e-06,2e-06,2e-06,8e-06,8e-06,4e-06,4e-06,3e-06,3e-06,4e-06,6e-06,9e-06,8e-06,4e-06,1.1e-05,7e-06,7e-06,8e-06,1e-05,1.1e-05,6e-06,2e-06,1.9e-05,1.2e-05,1e-06,7e-06,3e-06,7e-06,3e-06,1.4e-05,7e-06,7e-06,2e-06,7e-06,5e-06,1.1e-05,7e-06,8e-06,1e-05,8e-06,6e-06,4e-06,3e-06
1.4e-05,2e-05,9e-06,6e-06,7e-06,4e-06,3e-06,1.2e-05,1.8e-05,4e-06,6e-06,3e-06,3e-06,8e-06,3e-06,1.3e-05,8e-06,3e-06,8e-06,7e-06,7e-06,1e-05,2e-06,9e-06,1.1e-05,5e-06,1.2e-05,3e-06,4e-06,1.2e-05,4e-06,1.1e-05,1.2e-05,9e-06,7e-06,3e-06,4e-06,2e-05,8e-06,3e-06,3e-06,1e-06,1e-05,7e-06,5e-06,6e-06,1.7e-05,1.5e-05,2e-06,9e-06,5e-06,8e-06,1.1e-05,1e-06,4e-06,9e-06,6e-06,2e-06,1.4e-05,3e-06,1.1e-05,3e-06,1e-06,8e-06,8e-06,8e-06,1.3e-05,1.4e-05,6e-06,1.1e-05,4e-06,7e-06,6e-06,1.1e-05,3e-06,2e-06,5e-06,1.1e-05,4e-06,3e-06,5e-06,1.1e-05,1e-05,5e-06,1e-06,5e-06,3e-06,2e-06,1.2e-05,9e-06,7e-06,3e-06,6e-06,4e-06,9e-06,5e-06,1.1e-05,7e-06,5e-06,0,2e-05,9e-06,6e-06,7e-06,3e-06,6e-06,3e-06,1.5e-05,7e-06,5e-06,1e-06,1e-05,4e-06,1.1e-05,8e-06,1.1e-05,8e-06,4e-06,1e-06,7e-06,2e-06
1.5e-05,1.5e-05,1.3e-05,7e-06,3e-06,8e-06,3e-06,1.1e-05,1.5e-05,4e-06,1.3e-05,6e-06,1e-06,4e-06,4e-06,7e-06,2e-06,1e-05,4e-06,1e-05,4e-06,1e-05,9e-06,1.8e-05,6e-06,5e-06,1.5e-05,8e-06,3e-06,9e-06,1.2e-05,1.6e-05,1.7e-05,5e-06,4e-06,6e-06,8e-06,1e-05,3e-06,8e-06,4e-06,4e-06,1.4e-05,9e-06,7e-06,3e-06,1.7e-05,2.1e-05,8e-06,9e-06,9e-06,3e-06,9e-06,2e-06,8e-06,8e-06,5e-06,3e-06,1.1e-05,7e-06,1.1e-05,7e-06,4e-06,6e-06,8e-06,8e-06,1.2e-05,1.2e-05,8e-06,1.7e-05,3e-06,9e-06,6e-06,3e-06,7e-06,1e-05,3e-06,6e-06,2e-06,7e-06,5e-06,7e-06,1.3e-05,9e-06,2e-06,6e-06,3e-06,5e-06,1.2e-05,1.4e-05,8e-06,2e-06,6e-06,5e-06,1.5e-05,1e-05,1e-05,9e-06,4e-06,4e-06,1.6e-05,3e-06,2e-06,1.2e-05,9e-06,4e-06,6e-06,7e-06,7e-06,7e-06,2e-06,1e-05,1.1e-05,6e-06,4e-06,9e-06,5e-06,5e-06,3e-06,4e-06,4e-06
4e-06,1e-05,1.7e-05,1.1e-05,1.3e-05,5e-06,1.5e-05,1.2e-05,4e-06,9e-06,1.8e-05,9e-06,3e-06,1.1e-05,7e-06,6e-06,1.3e-05,7e-06,8e-06,1.6e-05,2e-06,1.1e-05,5e-06,1.2e-05,1.5e-05,5e-06,9e-06,1.5e-05,1.8e-05,7e-06,7e-06,8e-06,2e-05,1.9e-05,1e-05,1.2e-05,9e-06,8e-06,1.1e-05,9e-06,5e-06,7e-06,1.5e-05,4e-06,3e-06,1.5e-05,7e-06,1.7e-05,4e-06,5e-06,1e-05,5e-06,1.6e-05,6e-06,8e-06,1.3e-05,1e-06,7e-06,1.3e-05,1.1e-05,1.2e-05,6e-06,6e-06,7e-06,1.4e-05,4e-06,7e-06,2.3e-05,1.9e-05,1.9e-05,1.1e-05,1.4e-05,1.3e-05,8e-06,8e-06,9e-06,9e-06,3e-06,1.1e-05,1.5e-05,6e-06,1.1e-05,8e-06,5e-06,6e-06,4e-06,7e-06,1e-05,1.7e-05,2.3e-05,1.3e-05,8e-06,7e-06,4e-06,4e-06,5e-06,2e-06,6e-06,7e-06,1.4e-05,1.5e-05,1e-06,1e-06,1.1e-05,1.2e-05,1.1e-05,1.3e-05,5e-06,1.1e-05,1e-05,9e-06,1.4e-05,9e-06,1.6e-05,1e-05,7e-06,4e-06,3e-06,4e-06,7e-06,7e-06
3.1e-05,1.4e-05,2.8e-05,2.2e-05,4e-06,9e-06,1.2e-05,6e-06,2.5e-05,3e-06,9e-06,1e-05,1.1e-05,2.4e-05,2.1e-05,2e-05,2.5e-05,1.6e-05,6e-06,1.3e-05,1.8e-05,1.5e-05,1.2e-05,1.2e-05,5e-06,4e-06,1e-05,1.6e-05,6e-06,1.5e-05,1e-05,6e-06,2.3e-05,3e-06,2e-05,1.3e-05,1.6e-05,1e-05,1.1e-05,9e-06,1.2e-05,1.1e-05,1.2e-05,1.9e-05,1.2e-05,1.8e-05,2.3e-05,4e-06,1.2e-05,1.1e-05,7e-06,8e-06,1.3e-05,8e-06,1.1e-05,1.1e-05,1.6e-05,1.7e-05,1.7e-05,1.5e-05,1.7e-05,4e-06,1e-06,1.1e-05,1.3e-05,1.4e-05,1e-05,1.1e-05,7e-06,1.7e-05,6e-06,1.7e-05,1e-05,1.1e-05,7e-06,6e-06,1e-06,1.1e-05,9e-06,4e-06,9e-06,9e-06,3e-06,9e-06,4e-06,5e-06,4e-06,3e-06,1e-05,6e-06,1e-05,6e-06,9e-06,4e-06,6e-06,6e-06,5e-06,1.1e-05,8e-06,7e-06,1.3e-05,9e-06,6e-06,9e-06,0,1e-06,3e-06,1.1e-05,1.3e-05,3e-06,3e-06,8e-06,4e-06,1.3e-05,1.6e-05,3e-06,8e-06,4e-06,3e-06,7e-06,7e-06
2.2e-05,1.8e-05,5e-06,1e-05,1.3e-05,1.3e-05,1e-05,8e-06,1.8e-05,1.1e-05,8e-06,5e-06,1e-06,2.2e-05,1e-05,4e-06,8e-06,4e-06,9e-06,3e-06,1.4e-05,2e-06,4e-06,6e-06,9e-06,4e-06,8e-06,8e-06,1.2e-05,3e-06,6e-06,8e-06,1.4e-05,7e-06,9e-06,1e-05,7e-06,1.4e-05,5e-06,1.1e-05,4e-06,6e-06,5e-06,5e-06,5e-06,7e-06,1e-05,1.2e-05,5e-06,7e-06,8e-06,6e-06,5e-06,3e-06,4e-06,4e-06,7e-06,6e-06,1.5e-05,3e-06,1.5e-05,1.1e-05,5e-06,1e-05,1e-06,1e-06,6e-06,1.3e-05,7e-06,7e-06,5e-06,1e-05,4e-06,9e-06,3e-06,7e-06,7e-06,1e-05,1e-06,6e-06,6e-06,6e-06,2e-06,6e-06,2e-06,4e-06,5e-06,7e-06,4e-06,1e-06,6e-06,2e-06,4e-06,3e-06,8e-06,8e-06,3e-06,5e-06,6e-06,6e-06,1.2e-05,5e-06,4e-06,3e-06,5e-06,3e-06,4e-06,1.1e-05,1e-05,0,7e-06,3e-06,3e-06,1e-05,1e-05,8e-06,1e-05,1e-06,2e-06,6e-06,3e-06
1e-05,2.3e-05,1.9e-05,7e-06,4e-06,3e-06,8e-06,3e-06,9e-06,4e-06,7e-06,2e-06,3e-06,1.2e-05,7e-06,6e-06,4e-06,6e-06,3e-06,3e-06,5e-06,7e-06,8e-06,0,4e-06,2e-06,9e-06,2e-06,2e-06,6e-06,3e-06,7e-06,1.2e-05,9e-06,9e-06,1.1e-05,1.1e-05,8e-06,3e-06,8e-06,4e-06,1e-06,7e-06,6e-06,5e-06,5e-06,6e-06,1.1e-05,1e-06,6e-06,5e-06,2e-06,7e-06,2e-06,5e-06,2e-06,1e-06,2e-06,1e-05,1e-06,1.1e-05,9e-06,7e-06,5e-06,4e-06,1e-06,8e-06,9e-06,4e-06,4e-06,6e-06,1.7e-05,8e-06,5e-06,8e-06,5e-06,4e-06,1.1e-05,5e-06,6e-06,1e-06,9e-06,8e-06,4e-06,0,1e-06,3e-06,6e-06,3e-06,8e-06,6e-06,2e-06,4e-06,8e-06,4e-06,8e-06,8e-06,9e-06,2e-06,1e-06,1.4e-05,5e-06,2e-06,2e-06,3e-06,2e-06,4e-06,9e-06,1.2e-05,8e-06,2e-06,0,1e-06,7e-06,7e-06,3e-06,7e-06,3e-06,2e-06,6e-06,3e-06
1.1e-05,2.4e-05,2e-06,4e-06,1e-06,3e-06,5e-06,8e-06,8e-06,9e-06,5e-06,1e-06,4e-06,8e-06,3e-06,9e-06,6e-06,2e-06,3e-06,6e-06,8e-06,4e-06,8e-06,1e-06,6e-06,3e-06,8e-06,2e-06,7e-06,9e-06,6e-06,8e-06,1e-05,1.1e-05,6e-06,7e-06,4e-06,1.4e-05,1e-06,7e-06,2e-06,2e-06,7e-06,3e-06,5e-06,5e-06,6e-06,1e-05,7e-06,5e-06,6e-06,4e-06,3e-06,5e-06,2e-06,1e-06,4e-06,6e-06,1.3e-05,5e-06,1.2e-05,6e-06,2e-06,7e-06,5e-06,5e-06,6e-06,8e-06,6e-06,9e-06,5e-06,1.2e-05,6e-06,4e-06,2e-06,3e-06,5e-06,9e-06,4e-06,4e-06,6e-06,6e-06,5e-06,4e-06,2e-06,3e-06,1e-06,2e-06,8e-06,6e-06,3e-06,4e-06,4e-06,6e-06,7e-06,5e-06,9e-06,4e-06,8e-06,4e-06,1.5e-05,1e-06,2e-06,2e-06,1e-06,1e-06,1e-06,1.3e-05,5e-06,5e-06,1e-06,2e-06,1e-06,7e-06,5e-06,3e-06,7e-06,1e-06,1e-06,7e-06,2e-06
1.5e-05,1.9e-05,7e-06,1e-06,3e-06,2e-06,3e-06,5e-06,1e-05,8e-06,6e-06,1e-06,3e-06,1.1e-05,5e-06,9e-06,6e-06,5e-06,1e-06,2e-06,1e-06,4e-06,3e-06,0,6e-06,4e-06,4e-06,3e-06,3e-06,5e-06,2e-06,7e-06,9e-06,8e-06,6e-06,5e-06,8e-06,1.4e-05,2e-06,6e-06,3e-06,2e-06,7e-06,4e-06,6e-06,5e-06,6e-06,6e-06,5e-06,6e-06,7e-06,5e-06,4e-06,1e-06,2e-06,3e-06,3e-06,5e-06,1.2e-05,3e-06,1.2e-05,7e-06,1e-06,5e-06,4e-06,4e-06,1e-05,9e-06,6e-06,8e-06,6e-06,1.5e-05,5e-06,6e-06,3e-06,2e-06,1e-06,7e-06,2e-06,6e-06,8e-06,7e-06,1e-06,3e-06,1e-06,2e-06,0,1e-06,5e-06,7e-06,7e-06,2e-06,7e-06,8e-06,5e-06,5e-06,7e-06,3e-06,3e-06,1e-06,1.6e-05,8e-06,4e-06,4e-06,1e-06,2e-06,3e-06,1e-05,5e-06,7e-06,4e-06,3e-06,2e-06,6e-06,4e-06,5e-06,8e-06,4e-06,6e-06,5e-06,4e-06
1.3e-05,1.6e-05,5e-06,2e-06,2e-06,4e-06,2e-06,4e-06,1.3e-05,8e-06,5e-06,0,1e-06,9e-06,7e-06,1e-05,2e-06,3e-06,5e-06,1e-06,5e-06,1e-06,4e-06,4e-06,7e-06,2e-06,6e-06,4e-06,5e-06,3e-06,1e-06,6e-06,1e-05,1e-05,4e-06,4e-06,2e-06,1.4e-05,4e-06,6e-06,3e-06,2e-06,3e-06,6e-06,5e-06,4e-06,7e-06,9e-06,3e-06,7e-06,6e-06,4e-06,2e-06,3e-06,2e-06,2e-06,2e-06,3e-06,1.3e-05,4e-06,1e-05,6e-06,3e-06,8e-06,6e-06,5e-06,9e-06,1.1e-05,4e-06,6e-06,5e-06,1.2e-05,2e-06,4e-06,5e-06,2e-06,5e-06,8e-06,2e-06,5e-06,3e-06,8e-06,5e-06,5e-06,1e-06,1e-06,2e-06,4e-06,8e-06,5e-06,3e-06,2e-06,6e-06,1e-06,4e-06,4e-06,8e-06,5e-06,2e-06,2e-06,1.4e-05,7e-06,2e-06,1e-06,3e-06,2e-06,5e-06,1.1e-05,6e-06,5e-06,7e-06,0,1e-06,5e-06,4e-06,6e-06,8e-06,3e-06,5e-06,4e-06,4e-06
1.3e-05,1.3e-05,6e-06,3e-06,2e-06,5e-06,1e-06,6e-06,1.1e-05,9e-06,5e-06,1e-06,3e-06,6e-06,2e-06,4e-06,5e-06,3e-06,4e-06,4e-06,6e-06,2e-06,3e-06,2e-06,7e-06,1e-06,6e-06,2e-06,4e-06,4e-06,2e-06,7e-06,1e-05,9e-06,5e-06,3e-06,6e-06,1.2e-05,3e-06,5e-06,2e-06,2e-06,7e-06,2e-06,5e-06,3e-06,7e-06,8e-06,3e-06,4e-06,8e-06,1e-06,5e-06,2e-06,4e-06,2e-06,1e-06,4e-06,1.2e-05,3e-06,1e-05,2e-06,2e-06,7e-06,4e-06,4e-06,6e-06,7e-06,6e-06,7e-06,1e-06,1.1e-05,2e-06,4e-06,3e-06,2e-06,3e-06,1e-05,1e-06,1e-06,5e-06,7e-06,4e-06,3e-06,1e-06,2e-06,2e-06,3e-06,6e-06,5e-06,4e-06,3e-06,3e-06,3e-06,4e-06,4e-06,8e-06,5e-06,2e-06,1e-06,1.4e-05,2e-06,1e-06,2e-06,1e-06,2e-06,5e-06,1e-05,5e-06,1e-06,3e-06,3e-06,1e-06,4e-06,3e-06,6e-06,8e-06,5e-06,2e-06,4e-06,1e-06
1.3e-05,1.5e-05,5e-06,2e-06,1e-06,1e-06,1e-06,6e-06,1.1e-05,6e-06,6e-06,2e-06,3e-06,7e-06,2e-06,1e-06,1e-06,3e-06,1e-06,3e-06,5e-06,3e-06,3e-06,3e-06,4e-06,1e-06,5e-06,2e-06,4e-06,3e-06,2e-06,7e-06,1e-05,8e-06,4e-06,1e-06,6e-06,1.3e-05,2e-06,6e-06,3e-06,1e-06,6e-06,3e-06,5e-06,4e-06,8e-06,7e-06,3e-06,4e-06,4e-06,2e-06,4e-06,1e-06,3e-06,2e-06,3e-06,3e-06,1.2e-05,1e-06,1.1e-05,2e-06,0,6e-06,5e-06,3e-06,7e-06,7e-06,5e-06,9e-06,4e-06,1.3e-05,1e-06,4e-06,3e-06,3e-06,3e-06,9e-06,2e-06,3e-06,5e-06,8e-06,4e-06,3e-06,1e-06,1e-06,2e-06,4e-06,5e-06,5e-06,4e-06,3e-06,1e-06,2e-06,6e-06,5e-06,7e-06,6e-06,3e-06,1e-06,1.5e-05,6e-06,1e-06,3e-06,2e-06,5e-06,3e-06,1e-05,6e-06,2e-06,3e-06,1e-06,1e-06,6e-06,3e-06,3e-06,5e-06,3e-06,2e-06,3e-06,2e-06
1.3e-05,1.5e-05,5e-06,2e-06,2e-06,2e-06,0,6e-06,1e-05,6e-06,5e-06,1e-06,1e-06,6e-06,1e-06,2e-06,2e-06,3e-06,1e-06,2e-06,1e-06,1e-06,5e-06,3e-06,6e-06,2e-06,4e-06,2e-06,4e-06,3e-06,3e-06,6e-06,1e-05,9e-06,5e-06,2e-06,6e-06,1.3e-05,1e-06,5e-06,1e-06,3e-06,6e-06,6e-06,4e-06,1e-06,6e-06,8e-06,3e-06,4e-06,5e-06,1e-06,6e-06,0,3e-06,1e-06,3e-06,3e-06,1.4e-05,2e-06,1e-05,3e-06,0,6e-06,5e-06,5e-06,7e-06,1e-05,4e-06,8e-06,3e-06,1.2e-05,1e-06,4e-06,3e-06,4e-06,2e-06,8e-06,1e-06,3e-06,5e-06,8e-06,4e-06,3e-06,0,1e-06,3e-06,3e-06,5e-06,5e-06,2e-06,2e-06,1e-06,2e-06,5e-06,5e-06,8e-06,6e-06,2e-06,2e-06,1.5e-05,4e-06,2e-06,3e-06,1e-06,3e-06,4e-06,1e-05,7e-06,4e-06,3e-06,2e-06,1e-06,6e-06,3e-06,4e-06,5e-06,2e-06,3e-06,4e-06,1e-06
1.3e-05,1.5e-05,6e-06,2e-06,2e-06,1e-06,0,5e-06,1e-05,8e-06,6e-06,1e-06,1e-06,7e-06,3e-06,1e-06,2e-06,2e-06,1e-06,2e-06,3e-06,1e-06,5e-06,3e-06,6e-06,2e-06,4e-06,2e-06,3e-06,3e-06,2e-06,7e-06,1e-05,8e-06,5e-06,3e-06,5e-06,1.3e-05,2e-06,6e-06,1e-06,1e-06,5e-06,5e-06,3e-06,3e-06,7e-06,8e-06,2e-06,3e-06,6e-06,0,4e-06,0,2e-06,2e-06,2e-06,3e-06,1.2e-05,1e-06,1.1e-05,3e-06,1e-06,5e-06,4e-06,4e-06,6e-06,9e-06,6e-06,8e-06,3e-06,1.2e-05,1e-06,5e-06,3e-06,2e-06,3e-06,7e-06,1e-06,4e-06,5e-06,7e-06,5e-06,3e-06,0,2e-06,2e-06,4e-06,5e-06,4e-06,4e-06,2e-06,1e-06,2e-06,4e-06,5e-06,7e-06,5e-06,3e-06,1e-06,1.4e-05,3e-06,1e-06,2e-06,1e-06,2e-06,4e-06,1e-05,6e-06,3e-06,2e-06,2e-06,0,7e-06,3e-06,4e-06,6e-06,2e-06,3e-06,4e-06,1e-06
