0.015002,0.015838,0.016188,0.016325,0.079394,0.289538,0.393005,0.508705,1.102052,1.60872,1.486695,1.125506,0.929057,0.960697,1.01221,0.983723,0.983089,0.781597,0.406468,0.493287,0.663585,0.367418,0.098187,0.050693,0.052595,0.056893,0.044681,0.023046
0.017679,0.019047,0.019773,0.020009,0.096303,0.345315,0.465625,0.601591,1.275098,1.810456,1.630074,1.218839,1.038565,1.100734,1.151735,1.108313,1.09786,0.877685,0.462738,0.565229,0.751017,0.412899,0.113435,0.060457,0.06425,0.069589,0.052949,0.02679
0.021647,0.023908,0.024942,0.025236,0.119649,0.419952,0.564302,0.732547,1.5105,2.064022,1.810462,1.343989,1.191435,1.307673,1.345328,1.256534,1.213075,0.978023,0.529386,0.650535,0.847643,0.461509,0.134222,0.074863,0.082308,0.088807,0.064141,0.031421
0.02301,0.025639,0.026109,0.026576,0.123356,0.424062,0.578651,0.779423,1.582086,2.11295,1.919162,1.507432,1.331558,1.44064,1.428815,1.271308,1.172899,0.950001,0.530537,0.639573,0.817465,0.447682,0.144659,0.082196,0.090601,0.09651,0.06592,0.03078
0.021465,0.023835,0.023601,0.024639,0.109974,0.378504,0.54679,0.793254,1.575997,2.09706,2.044223,1.769857,1.564929,1.593479,1.499758,1.266442,1.088248,0.852067,0.489858,0.588834,0.741515,0.41301,0.146862,0.080888,0.084855,0.089857,0.061088,0.027755
0.019825,0.021841,0.023571,0.025764,0.113106,0.408336,0.597504,0.837206,1.576056,2.156571,2.273636,2.108751,1.920091,1.864884,1.663916,1.395078,1.170034,0.834119,0.464063,0.565571,0.685223,0.38838,0.150865,0.076261,0.072014,0.080201,0.060989,0.029311
0.021284,0.024829,0.030875,0.034597,0.153012,0.576477,0.802326,0.96351,1.718692,2.494733,2.791693,2.622555,2.47341,2.421555,2.137831,1.883541,1.698753,1.204679,0.609631,0.628073,0.707618,0.396053,0.158378,0.074576,0.066365,0.079939,0.069102,0.036388
0.026779,0.033045,0.042876,0.048133,0.22114,0.831476,1.107023,1.259348,2.3404,3.440585,3.853609,3.719921,3.685143,3.720167,3.358464,3.106985,2.97155,2.134361,0.967986,0.775123,0.824584,0.451524,0.185408,0.08775,0.078517,0.099549,0.090959,0.050095
0.033573,0.042051,0.053962,0.060171,0.303613,1.111295,1.413402,1.686503,3.551313,5.217615,5.820669,6.0475,6.260286,6.236697,5.606217,5.265791,5.050307,3.564998,1.509679,1.001013,1.026404,0.533745,0.219851,0.115475,0.10432,0.133492,0.125249,0.070834
0.037474,0.046908,0.057971,0.064493,0.383496,1.3763,1.667181,2.089825,5.044629,7.555487,8.45721,9.436146,10.16582,9.906206,8.837795,8.303187,7.71603,5.320439,2.224853,1.301099,1.261842,0.5915,0.235019,0.142805,0.134939,0.170382,0.164147,0.095544
0.036325,0.045366,0.053955,0.062407,0.426254,1.535747,1.822573,2.361933,6.360958,10.004461,11.258418,13.06573,14.475352,13.784977,12.27895,11.497019,10.259044,7.018592,3.019346,1.587373,1.444856,0.6095,0.234376,0.154983,0.157169,0.200019,0.194006,0.112053
0.032705,0.040251,0.048303,0.05876,0.415632,1.505164,1.829304,2.474179,6.955089,11.765649,13.396169,15.418385,17.16355,15.985897,14.189571,13.238522,11.687181,8.138446,3.583397,1.719211,1.477707,0.576034,0.224675,0.146924,0.159791,0.20916,0.198775,0.110122
0.028484,0.033413,0.041359,0.050454,0.361746,1.287885,1.65906,2.333598,6.451704,11.90467,13.902332,15.018086,15.940815,14.438016,12.812323,11.997875,10.853783,7.839106,3.491895,1.624406,1.346645,0.503994,0.208843,0.129535,0.144421,0.191295,0.172457,0.091211
0.025522,0.028475,0.034757,0.041317,0.298109,1.007211,1.384975,1.959141,5.169952,10.16058,11.9246,11.567563,11.097833,9.707434,8.748974,8.178372,7.606946,5.730205,2.612074,1.340913,1.125656,0.436443,0.186402,0.104934,0.123829,0.17322,0.143384,0.06781
0.028035,0.03042,0.03243,0.0381,0.294197,0.932919,1.260204,1.554871,3.631639,7.135863,8.104585,6.913713,5.871631,5.187443,4.862099,4.229925,3.84909,2.98656,1.486802,1.060218,0.933821,0.425747,0.196851,0.08666,0.117508,0.184527,0.140691,0.05302
0.033264,0.035519,0.034992,0.044336,0.317394,0.944597,1.263554,1.409796,2.775556,4.960043,5.288613,4.028533,3.086156,2.994722,2.885119,2.164722,1.678158,1.227885,0.864408,1.141392,1.039764,0.492474,0.235247,0.092705,0.14233,0.232958,0.168702,0.053364
0.039146,0.039403,0.041038,0.058026,0.38041,1.057884,1.407744,1.527247,2.735986,4.36273,4.485618,3.329921,2.298865,2.259341,2.410122,1.89279,1.254084,0.8247,0.786168,1.350112,1.250425,0.59437,0.284792,0.123177,0.189915,0.298659,0.209528,0.063648
0.045076,0.042923,0.049037,0.074213,0.491613,1.329545,1.740653,1.87916,3.296478,5.053701,5.352538,4.184746,2.841933,2.694052,2.976236,2.458881,1.672681,1.124319,0.914587,1.51697,1.451203,0.691318,0.318053,0.16309,0.241316,0.360557,0.250499,0.07567
0.05024,0.049029,0.057367,0.083749,0.570773,1.557576,2.030622,2.210788,4.023362,6.535733,7.389984,5.817635,3.957476,3.950423,4.238131,3.415023,2.443829,1.627322,1.044483,1.607198,1.613375,0.766368,0.320854,0.197405,0.271345,0.389219,0.277757,0.086382
0.052127,0.053794,0.059687,0.080598,0.573153,1.630994,2.116356,2.322913,4.533041,7.963215,10.032101,8.301893,5.444951,5.315196,5.5936,4.590413,3.402827,2.160282,1.230986,1.859362,1.895356,0.827423,0.296713,0.207076,0.252938,0.346927,0.265348,0.092938
0.047735,0.05063,0.055184,0.071379,0.490228,1.461565,1.902371,2.101484,4.563087,8.944117,12.381148,10.719436,6.82833,6.197471,6.406398,5.39658,4.004837,2.465175,1.406028,2.188855,2.219365,0.870019,0.269412,0.182523,0.2032,0.259768,0.210585,0.088928
0.04005,0.041482,0.044821,0.055319,0.342106,1.081855,1.46008,1.647554,4.298184,9.340147,13.179834,11.704847,7.598816,6.26241,6.259947,5.274318,3.730726,2.316411,1.40947,2.200328,2.220266,0.815959,0.235355,0.138565,0.148017,0.178303,0.147421,0.076661
0.03571,0.035774,0.036757,0.043631,0.21197,0.703704,1.035574,1.299243,3.960632,8.663358,11.399308,10.291703,7.366499,5.65933,5.239273,4.169003,2.702441,1.820432,1.23091,1.826642,1.836068,0.667922,0.190328,0.099294,0.114438,0.132691,0.103765,0.062077
0.036071,0.034943,0.035114,0.042504,0.180897,0.628946,0.956029,1.243984,3.717899,7.248607,8.032931,7.055763,5.884474,4.776835,4.349467,3.164002,1.804882,1.319974,0.96346,1.358096,1.329711,0.497738,0.14826,0.072555,0.087049,0.094817,0.073887,0.053573
0.037461,0.035578,0.034037,0.040308,0.192028,0.672573,0.973385,1.216932,3.442944,6.209285,5.912383,4.401025,3.890768,3.648012,3.459505,2.546987,1.539354,1.071126,0.773709,1.199312,1.117095,0.393781,0.120815,0.059552,0.059341,0.06106,0.054651,0.046043
0.034989,0.032099,0.029016,0.033925,0.206805,0.683503,0.920488,1.097797,2.893488,5.330333,5.211668,3.387211,2.690837,2.600896,2.406155,2.037087,1.484572,0.946905,0.678607,1.292738,1.229671,0.394092,0.104468,0.050904,0.042284,0.047371,0.050133,0.038703
0.028224,0.026058,0.022675,0.029519,0.226528,0.679336,0.851905,1.043298,2.42089,4.262574,4.369414,2.907653,2.118938,1.835508,1.634077,1.639215,1.376217,0.872251,0.628586,1.294192,1.229758,0.36875,0.098646,0.052228,0.040199,0.045214,0.046239,0.032201
0.022528,0.023899,0.021378,0.026659,0.21836,0.614,0.740338,0.983228,2.089538,3.550254,3.679976,2.547991,1.759699,1.365606,1.297259,1.314034,1.091573,0.721133,0.547265,1.112812,1.031759,0.297138,0.094352,0.057163,0.040736,0.044544,0.045212,0.034612
0.026447,0.028173,0.025747,0.026607,0.183662,0.51435,0.606994,0.870658,1.812439,2.946188,2.989237,2.165978,1.517241,1.138605,1.12851,1.044028,0.876378,0.671989,0.527948,0.888281,0.806012,0.252946,0.088375,0.06033,0.043507,0.046526,0.049898,0.043572
0.040594,0.037947,0.032591,0.034253,0.160281,0.411018,0.504126,0.864178,2.009889,2.886786,2.631489,1.913772,1.261017,0.985874,1.056432,0.894011,0.748678,0.650943,0.532606,0.708133,0.634907,0.231356,0.076074,0.057126,0.046081,0.050859,0.059902,0.058779
0.057904,0.050869,0.042687,0.045715,0.151938,0.372526,0.489404,1.019945,2.528511,3.200589,2.471984,1.674153,1.03405,0.880785,1.070791,0.867192,0.655478,0.622047,0.51627,0.645262,0.603301,0.232927,0.06659,0.05538,0.045243,0.050148,0.068038,0.075897
0.068892,0.059084,0.049762,0.053001,0.14387,0.349525,0.463165,1.103364,2.828402,3.203707,2.228081,1.55648,0.937737,0.851245,1.038076,0.789733,0.544983,0.541601,0.480274,0.695084,0.687734,0.25061,0.064348,0.058268,0.042618,0.049372,0.073857,0.084939
0.064278,0.054509,0.046431,0.048564,0.118371,0.279261,0.378134,1.02429,2.581599,2.714525,1.948441,1.475288,0.84102,0.774824,0.918992,0.697783,0.444397,0.394778,0.417918,0.772017,0.767827,0.251183,0.059836,0.058513,0.042664,0.049362,0.069188,0.075603
0.044507,0.037565,0.032497,0.033288,0.102073,0.252247,0.331608,0.826879,1.878067,1.843385,1.575455,1.532607,0.897492,0.625369,0.725779,0.659919,0.423185,0.305471,0.375403,0.80762,0.789512,0.237853,0.058988,0.055518,0.04563,0.046481,0.051997,0.051019
0.022589,0.019591,0.018287,0.019983,0.103571,0.284519,0.344272,0.68722,1.27705,1.251663,1.467093,1.73419,1.140282,0.595197,0.541551,0.635549,0.518167,0.348043,0.404711,0.851809,0.781172,0.22008,0.066563,0.064391,0.053676,0.042998,0.034024,0.03021
0.01372,0.0122,0.013975,0.01959,0.109397,0.300787,0.342304,0.707167,1.278981,1.346367,1.658129,1.933759,1.362254,0.659292,0.464961,0.602294,0.575678,0.379819,0.427733,0.866367,0.808539,0.248326,0.073789,0.075631,0.058722,0.038158,0.027695,0.02925
0.016117,0.012492,0.01628,0.02562,0.107032,0.26789,0.307515,0.814364,1.676247,1.724981,1.667783,1.826699,1.366129,0.649056,0.428721,0.560908,0.524859,0.369706,0.459454,0.818008,0.815706,0.28357,0.073409,0.074701,0.053283,0.03102,0.02632,0.030059
0.020298,0.013588,0.019467,0.030555,0.090212,0.197859,0.236131,0.854784,2.02807,1.959498,1.365925,1.370657,1.109512,0.556732,0.370951,0.468045,0.403409,0.322157,0.509858,0.833285,0.79842,0.300913,0.072032,0.059146,0.038725,0.026421,0.028212,0.026401
0.02475,0.014439,0.020661,0.031174,0.064908,0.13456,0.182822,0.784072,2.151533,1.987756,0.990588,0.864667,0.75489,0.48576,0.301143,0.369578,0.387028,0.328267,0.531649,0.841894,0.704275,0.276217,0.065658,0.039295,0.023977,0.023972,0.029399,0.02127
0.029947,0.016661,0.019166,0.029588,0.049936,0.114871,0.200185,0.677277,2.026051,2.056649,1.020201,0.801445,0.549637,0.389691,0.24623,0.323489,0.452098,0.342313,0.504277,0.756249,0.527917,0.211371,0.05992,0.032821,0.018396,0.026052,0.034424,0.022067
