5.6e-05,-1.6e-05,-0.013753,-0.030647,-0.005087,-0.000412,-0.001162,-0.002016,0.000327,0.000714,0.000196,-0.002169,-0.021471,-0.013539,-0.000506,0.000213,-3.1e-05,-0.0017,-0.005651,-0.038843,-0.044342,-0.004022,-0.000195,-0.000323,-0.009155,-0.010198,-0.000393,-0.001425
6e-05,-6e-06,-0.00993,-0.024848,-0.003943,0.000521,0.000902,0.001117,0.000363,0.000462,0.000189,8.8e-05,-0.00486,-0.004768,-0.00033,0.000333,0.000164,0.001022,0.002306,-0.009395,-0.019374,-0.002867,-4.7e-05,-8.5e-05,-0.00634,-0.008552,-0.000431,-0.001376
6.2e-05,3.6e-05,-0.005051,-0.00936,-0.001263,-3.1e-05,0.000493,0.000465,-0.000278,7.3e-05,4.1e-05,-0.000265,-0.000419,0.000481,9.9e-05,0.000211,7e-05,-0.000598,-0.00307,-0.019643,-0.015991,-0.000354,2.2e-05,-0.00024,-0.006148,-0.006104,-8e-05,0.000222
5.6e-05,0.000133,0.008599,0.020664,0.003239,-0.000192,-0.000133,-0.000137,-0.000397,-0.000157,-6e-06,0.001739,0.017441,0.011359,0.000612,0.000218,0.000101,-4.1e-05,-0.000782,0.020454,0.030627,0.003728,0.000163,0.000206,0.006768,0.007967,0.00057,0.001685
5.4e-05,0.000122,0.012887,0.028532,0.004805,0.000427,0.000384,0.000772,-0.000213,-0.000254,3e-06,0.001826,0.013653,0.008046,0.000425,0.000164,0.000132,0.001231,0.005451,0.037129,0.039321,0.00325,0.000167,0.000458,0.01226,0.013378,0.000729,0.001099
-1e-06,-4.4e-05,-0.001228,-0.002883,-0.000548,-0.000182,-0.00075,-0.001644,-0.000779,-0.000386,-0.000128,-0.002763,-0.024846,-0.014758,-0.000452,-0.000148,-0.000121,-0.001065,-0.003725,-0.025271,-0.030771,-0.00307,-0.00015,-0.000156,-0.002457,-0.001957,3.2e-05,-0.000861
-3.7e-05,-9.7e-05,-0.006775,-0.017422,-0.003477,-0.000351,-0.001133,-0.001998,-0.000544,-0.000347,-7.7e-05,-0.001254,-0.013288,-0.008828,-0.000475,-0.000114,-6.2e-05,-0.000689,-0.003647,-0.020453,-0.027896,-0.003637,-0.000197,-0.000272,-0.005979,-0.006962,-0.000316,-0.001077
-1e-05,-5.8e-05,-0.006942,-0.015356,-0.002216,0.000131,3.3e-05,0.000507,0.000177,-0.000252,4.1e-05,0.001931,0.015261,0.008691,5e-05,-7.8e-05,1.8e-05,0.000535,0.003901,0.009083,0.006439,0.000254,-1e-05,-0.000138,-0.003689,-0.004767,-0.000211,0.000118
0,-1.1e-05,-6.1e-05,0.001163,0.000537,-9e-06,0.000478,0.000985,0.000236,-0.000268,-8.3e-05,0.000374,0.008261,0.006102,0.000206,-0.000194,-4e-05,-6.7e-05,-0.000546,0.00314,0.01132,0.002394,7e-05,-5.7e-05,-0.0013,-0.001213,3.3e-05,0.00079
4e-06,2.5e-05,0.005814,0.012891,0.002098,-4.5e-05,6e-05,0.000251,0.000319,-0.000236,1.3e-05,0.000606,0.004431,0.002699,0.000144,-0.000158,8e-06,0.00057,-0.000607,0.017453,0.026607,0.002943,5.6e-05,0.00018,0.004209,0.004544,0.000261,0.000558
-2.9e-05,-5.6e-05,0.002573,0.006887,0.001277,-4.6e-05,-0.000376,-0.000311,0.000211,-0.000251,9e-06,-0.000785,-0.00951,-0.005748,-0.000239,-3e-04,-0.000145,-3.1e-05,0.002503,-0.002322,-0.005604,-0.000817,-8.2e-05,0.000103,0.003756,0.004379,0.000242,-0.000237
-2.4e-05,-6.9e-05,0.003306,0.007004,0.000618,-0.000224,9.2e-05,4.2e-05,-0.000162,-0.000341,-6e-05,-0.001904,-0.016574,-0.009654,-0.000339,-0.00027,-0.000133,-0.000911,-0.002401,-0.029031,-0.037134,-0.003859,-9.6e-05,-9.8e-05,-0.00144,-0.000771,3.9e-05,-0.000563
-2.3e-05,-5e-05,-0.001722,-0.004667,-0.001012,6e-06,0.000328,0.000461,-0.000133,-0.000349,-3.7e-05,0.001165,0.010961,0.006235,8.5e-05,-0.000145,-1.2e-05,0.000423,-0.001228,0.005277,0.003875,-0.000406,2.6e-05,-6.1e-05,-0.002087,-0.002038,-3.4e-05,-2e-05
-1.2e-05,-2.7e-05,-0.007541,-0.016682,-0.002315,8.9e-05,-0.000194,-0.000285,-0.000234,-0.00034,-2.6e-05,0.001665,0.015483,0.009118,0.000138,-0.000183,-4.3e-05,0.000474,0.003916,0.017337,0.019275,0.00217,-1.8e-05,-7e-06,-0.000351,-0.001075,-7.4e-05,0.000392
-1.2e-05,3e-06,-0.001614,-0.004312,-0.000574,-7.8e-05,3.6e-05,-0.000273,-0.000463,-0.000336,-0.000125,-0.000961,-0.006676,-0.003803,-0.000114,-0.000265,-0.00012,-0.000225,-0.00011,0.005772,0.010378,0.001581,-2.2e-05,7.3e-05,-0.000513,-0.001551,-0.000144,0.000102
-7e-06,-8e-06,0.002009,0.005593,0.001226,8.2e-05,-6.9e-05,-0.00046,-0.000355,-0.000219,-5.4e-05,-0.000444,-0.0065,-0.004199,-7.1e-05,-0.000147,-5.1e-05,0.000247,-0.001738,0.002119,0.003641,0.000103,6.1e-05,7.5e-05,-0.001105,-0.001257,-4.8e-05,-0.000173
-3.3e-05,-4.1e-05,0.003916,0.010275,0.001567,-4.6e-05,-0.000494,-0.000738,-0.000235,-8.8e-05,-3.3e-05,-0.000463,-0.004673,-0.002392,-5.9e-05,-0.000114,-9.3e-05,-0.00034,0.000345,-0.023315,-0.030188,-0.002703,-5e-06,3e-05,0.002084,0.003137,0.000213,-0.000233
-2.9e-05,-1.9e-05,0.005365,0.010822,0.000995,-0.000134,-2.8e-05,5.8e-05,-9.3e-05,3e-05,-6.4e-05,-0.000313,0.000441,0.000586,5e-06,-1e-04,-4.5e-05,-0.00031,-0.001401,-0.0113,-0.01348,-0.001551,-2.8e-05,-2.1e-05,0.001244,0.002297,0.000188,-4.7e-05
-1.1e-05,-4e-06,-0.003409,-0.008384,-0.001265,0.000173,5.4e-05,0.000158,0.000229,0.000209,4e-05,0.001508,0.013471,0.007345,0.000148,-4.7e-05,1e-06,0.000416,-0.000498,0.020257,0.026761,0.002292,1.3e-05,-2.7e-05,-0.000896,-0.000809,-2.3e-05,0.000138
