-0.024825,-0.021606,-0.042819,-0.056765,-0.051525,-0.04452,-0.051892,-0.046042,-0.057938,-0.057081,-0.04708,-0.025604,-0.039356,-0.035078,-0.025252,-0.043039,-0.034892,-0.02372,-0.02465,-0.013159,-0.0141,-0.022762,-0.017053,-0.01641,-0.016387,-0.016423,-0.012291,-0.014979
-0.031849,-0.0284,-0.044797,-0.045718,-0.051594,-0.050528,-0.057258,-0.053289,-0.079711,-0.086391,-0.064374,-0.036309,-0.055294,-0.04592,-0.031017,-0.047177,-0.045274,-0.032405,-0.028423,-0.019149,-0.022001,-0.032565,-0.020831,-0.019506,-0.01927,-0.02169,-0.018122,-0.018741
-0.005421,-0.001877,0.006008,0.014199,-0.001973,-0.01093,-0.004171,-0.011498,-0.02572,-0.029063,-0.013099,-0.004173,-0.006852,-0.00621,-0.00382,-0.003342,-0.00679,-0.003894,0.000883,-0.00334,-0.003204,-0.003691,0.000696,-0.001401,0.000749,-0.000974,-0.00252,-0.000287
0.014219,0.011513,0.035648,0.041612,0.038652,0.034149,0.041511,0.032955,0.043193,0.042894,0.039223,0.023219,0.040982,0.034357,0.019115,0.034662,0.030471,0.020451,0.019229,0.008776,0.01342,0.023332,0.014104,0.01318,0.01577,0.016181,0.011207,0.013821
0.027401,0.018489,0.025851,0.023179,0.033768,0.039187,0.03806,0.044715,0.068788,0.069002,0.048926,0.024761,0.044275,0.037486,0.020018,0.029117,0.030832,0.02065,0.015538,0.010464,0.013546,0.023256,0.011484,0.012501,0.011821,0.014223,0.013562,0.011837
0.003399,-0.000296,-0.015555,-0.028078,-0.014408,-0.005854,-0.008737,0.004123,0.021172,0.019488,-0.00017,-0.003843,-0.008231,-0.010221,-0.005632,-0.014777,-0.007629,-0.003634,-0.007815,0.00132,-0.001108,-0.004635,-0.004633,-0.002745,-0.006179,-0.004062,-0.001403,-0.005171
-0.021784,-0.012637,-0.034544,-0.039909,-0.035064,-0.035498,-0.036411,-0.035512,-0.042386,-0.038507,-0.038616,-0.022627,-0.045586,-0.035551,-0.01647,-0.026844,-0.027443,-0.017742,-0.012972,-0.006099,-0.011459,-0.021752,-0.009037,-0.010326,-0.014965,-0.014858,-0.011342,-0.011439
-0.007122,0.003024,0.009968,0.02227,0.00307,-0.005756,-0.007551,-0.021685,-0.045886,-0.038055,-0.018513,-0.005335,-0.018247,-0.010672,0.002206,0.007287,-0.003423,-0.004282,0.00208,0.00057,-0.002867,-0.009573,0.000351,-0.002298,-0.001754,-0.0049,-0.00658,-0.002704
-0.001188,-0.003763,0.00862,0.025372,0.01661,0.012786,0.010827,-0.000532,-0.016026,-0.012533,0.007755,0.005574,0.015525,0.012788,0.007339,0.013362,0.009148,0.005056,0.005503,-0.000974,0.001746,0.005851,0.000459,0.001881,0.009204,0.006904,0.003976,0.005131
0.010939,-0.001432,0.004964,0.00047,0.008399,0.016902,0.012854,0.017875,0.022132,0.015992,0.020851,0.013559,0.035242,0.021576,0.002166,0.004892,0.016219,0.009475,-0.000583,-0.00152,0.006087,0.015609,-0.000301,0.0026,0.008205,0.008718,0.008425,0.006219
0.005826,0.003027,0.000895,-0.016079,-0.005162,-0.001373,0.000634,0.016638,0.039314,0.029185,0.009854,0.001585,0.008844,0.006258,-0.005744,-0.009835,0.001178,0.002579,-0.002346,-0.00112,0.001277,0.006128,0.000124,0.001832,-0.002711,0.000237,0.003303,0.001915
-0.000828,0.005061,0.001626,-0.005928,-0.009008,-0.016047,-0.003847,0.005015,0.021359,0.014807,-0.007022,-0.008102,-0.024434,-0.01709,-0.005724,-0.011804,-0.013609,-0.005025,-2.4e-05,0.00128,-0.003217,-0.00696,0.005512,0.001298,-0.008143,-0.006562,-0.005377,-0.004376
-0.007351,0.001907,-0.005145,-0.002482,-0.003996,-0.008185,9.7e-05,-0.009949,-0.017692,-0.012281,-0.018832,-0.009461,-0.024616,-0.011699,0.003245,-2.5e-05,-0.014365,-0.008363,0.002555,0.003049,-0.003968,-0.012844,0.001971,-0.000819,-0.004038,-0.00452,-0.006364,-0.005706
-0.006928,-0.008074,-0.012109,0.005547,0.001959,0.00566,-0.003296,-0.018841,-0.040335,-0.025592,-0.00732,0.000279,0.002641,0.004511,0.006685,0.009259,-7.2e-05,-0.003079,-0.001167,-0.000885,-0.001147,-0.004014,-0.004633,-0.003676,0.003449,0.001291,-0.001058,-0.001367
0.003493,-0.003268,-0.000215,0.005017,0.00481,0.013561,-0.004492,-0.001869,-0.0122,-0.00936,0.010936,0.008576,0.023532,0.009043,0.001278,0.007195,0.013854,0.005153,-0.002706,-0.000591,0.003522,0.007377,-0.007485,-0.003212,0.006867,0.005397,0.00543,0.004326
0.010116,0.003986,0.009853,-0.000205,0.002318,0.003276,-0.001471,0.011755,0.021348,0.0131,0.018334,0.008343,0.015512,0.002641,-0.004872,0.00443,0.017022,0.008152,0.001208,-0.001217,0.004636,0.012356,0.000888,0.001679,0.002605,0.003367,0.005767,0.00615
0.003265,0.008878,0.019135,0.007008,0.004804,-0.004799,0.009064,0.008128,0.022472,0.017353,0.006566,0.001376,-0.007447,-0.003703,-0.003104,-0.000713,0.002855,0.003039,0.005897,0.0031,0.002491,0.003193,0.008366,0.005953,-0.003329,-0.001172,-0.000647,0.001363
-0.011642,-0.006857,-0.007911,-0.004522,-0.002771,-0.010665,0.003692,-0.006177,0.000311,0.001006,-0.015961,-0.012983,-0.025256,-0.007853,-0.001079,-0.014313,-0.020527,-0.006419,-0.001937,-0.002077,-0.006116,-0.010921,0.004413,0.001949,-0.006822,-0.005888,-0.007144,-0.006982
-0.002922,-0.006424,-0.022415,-0.013081,-0.004374,0.001302,-0.000933,-0.004057,-0.009589,-0.010146,-0.018137,-0.006442,-0.004694,0.003092,0.004902,-0.009107,-0.014761,-0.005063,-0.007572,-0.003347,-0.005866,-0.011256,-0.004687,-0.003484,-0.001691,-0.00387,-0.004346,-0.006116
