5e-06,7e-06,-9.2e-05,-0.00969,-0.023306,-0.005422,-1.8e-05,-0.000116,-0.000524,-0.000148,4e-06,3e-06,3e-06,-0.000265,-0.005356,-0.01988,-0.009898,-0.005204,-0.035134,-0.131875,-0.151174,-0.178582,-0.163188,-0.153482,-0.151269,-0.144015,-0.118547,-0.043459
6e-06,7e-06,-2e-06,-0.002478,-0.009456,-0.003121,-7e-06,-1.3e-05,-0.000163,-6.8e-05,5e-06,4e-06,3e-06,-4.2e-05,-0.000185,0.000383,-0.001484,-0.000737,0.025002,0.136342,0.142232,0.09565,0.082196,0.070581,0.121834,0.137497,0.114852,0.045095
4e-06,4e-06,-3e-06,0.002663,0.00751,0.001849,1.4e-05,-3.5e-05,-0.000126,-2.3e-05,2e-06,0,-1e-06,7.1e-05,0.002808,0.009705,0.002287,-0.001189,-0.025362,-0.023015,-0.028127,-0.011773,-0.02088,-0.047593,-0.023234,0.001755,-0.005353,-0.006078
7e-06,6e-06,4.3e-05,0.006835,0.018028,0.004471,2.6e-05,6.2e-05,0.000301,0.000107,4e-06,1e-06,0,1.4e-05,0.000149,0.001814,0.002823,-0.000136,-0.051359,-0.163079,-0.162325,-0.140735,-0.105095,-0.092392,-0.144503,-0.157721,-0.131109,-0.048903
1e-05,9e-06,4.9e-05,0.001695,0.003894,0.001207,1.4e-05,0.000137,0.000561,0.000165,6e-06,2e-06,2e-06,7.1e-05,-0.00067,-2e-06,0.00394,0.005217,0.030048,0.104367,0.137957,0.133389,0.145145,0.17499,0.137597,0.108527,0.102686,0.041656
3e-06,2e-06,-8e-05,-0.009382,-0.021225,-0.004357,-1.6e-05,-7.3e-05,-0.000293,-7.5e-05,0,-1e-06,-2e-06,3.6e-05,-0.000497,-0.006595,-0.004846,-0.003081,0.014853,0.062611,0.07157,0.11027,0.076864,0.053443,0.076425,0.08925,0.070522,0.020357
-2e-06,-1e-06,-2.8e-05,-0.002326,-0.007681,-0.002632,-1.4e-05,-0.00011,-0.000525,-0.000165,-1e-06,-1e-06,-3e-06,-0.000103,-0.000394,-0.003894,-0.004952,-0.002697,-0.023184,-0.127667,-0.152944,-0.150156,-0.139772,-0.159482,-0.158649,-0.144982,-0.128555,-0.046027
0,1e-06,5.1e-05,0.006902,0.014801,0.002656,1.3e-05,3.1e-05,7e-05,2e-06,0,-1e-06,-1e-06,-7.9e-05,0.00043,0.007659,0.003848,0.001211,0.019337,0.049311,0.056841,-0.028842,-0.017665,0.018097,0.02464,0.019234,0.027843,0.017131
1e-06,1e-06,4e-06,0.002365,0.008467,0.002777,1.6e-05,3.1e-05,0.00021,8e-05,-1e-06,-1e-06,-1e-06,3.3e-05,0.000113,0.0028,0.003249,0.001662,0.010662,0.086326,0.097476,0.093012,0.047348,0.041336,0.09533,0.111184,0.088216,0.02668
0,1e-06,-4e-06,-0.002245,-0.004618,-0.000559,-5e-06,3.9e-05,0.000216,7.7e-05,-2e-06,-2e-06,-1e-06,8.2e-05,-7e-06,-0.003906,-0.00058,0.001086,-0.021965,-0.095345,-0.12084,-0.058966,-0.049439,-0.07535,-0.097432,-0.099956,-0.095252,-0.033627
1e-06,1e-06,-1.5e-05,-0.003835,-0.009841,-0.00226,-1.8e-05,2.9e-05,0.000101,2.2e-05,-2e-06,-2e-06,0,4.1e-05,0.000259,-0.001419,-0.001383,-0.000886,0.007353,-0.000867,-0.000886,-0.032514,0.023493,0.071978,0.005275,-0.034473,-0.014589,0.001563
0,1e-06,-9e-06,-0.00073,-0.002084,-0.000791,-1e-05,-6.9e-05,-0.000329,-0.000103,-3e-06,-1e-06,2e-06,-4.1e-05,-0.000111,-0.000297,-0.002198,-0.003014,0.006616,0.08024,0.099687,0.089538,0.070223,0.078499,0.113255,0.118286,0.099255,0.02666
-2e-06,0,3.4e-05,0.00492,0.010194,0.001551,5e-06,-4.8e-05,-0.000267,-9.3e-05,-3e-06,-1e-06,2e-06,-5.8e-05,-0.000376,0.000281,-0.000117,0.000863,-0.015312,-0.065201,-0.094009,-0.031477,-0.045633,-0.103894,-0.079767,-0.047611,-0.052707,-0.021878
-4e-06,-3e-06,1.2e-05,0.001503,0.003703,0.000974,3e-06,4.8e-05,0.000214,5.8e-05,-3e-06,-4e-06,-2e-06,3e-06,0.000273,0.004162,0.003885,0.001958,0.003621,-0.032782,-0.04054,-0.088333,-0.0506,-0.026344,-0.066621,-0.073342,-0.050238,-0.009938
-7e-06,-8e-06,-3.1e-05,-0.00414,-0.007884,-0.000926,-9e-06,3.9e-05,0.000265,9.9e-05,-4e-06,-5e-06,-5e-06,2.3e-05,-8.4e-05,-0.001288,0.000366,-2.8e-05,0.009469,0.07781,0.115933,0.057396,0.029892,0.065143,0.101454,0.098633,0.082755,0.022567
-8e-06,-9e-06,-6e-06,-0.001474,-0.003044,-0.000447,-5e-06,-4e-06,7e-06,9e-06,-3e-06,-5e-06,-5e-06,1.4e-05,-0.000209,-0.004301,-0.003094,0.000338,-0.002354,-0.016912,-0.025908,0.054511,0.008003,-0.037446,-0.008737,0.001789,-0.012192,-0.004609
-7e-06,-9e-06,-4e-06,0.00184,0.003959,0.000594,0,-2e-05,-0.000132,-5.7e-05,-2e-06,-4e-06,-5e-06,-4e-06,0.000181,0.000134,-0.001729,-0.002045,0.003773,-0.047329,-0.058665,-0.040964,-0.014561,-0.010511,-0.072772,-0.092828,-0.065712,-0.010084
-6e-06,-8e-06,1.1e-05,0.002718,0.004361,0.000188,-7e-06,-3.2e-05,-0.000164,-6.3e-05,-2e-06,-4e-06,-4e-06,-3.5e-05,0.000191,0.004231,0.002372,-0.00021,0.003042,0.047378,0.072886,0.003717,0.022466,0.064286,0.073998,0.059982,0.052303,0.011948
-5e-06,-6e-06,7e-06,-0.000313,-0.001944,-0.000731,-1.3e-05,-1.3e-05,-4.8e-05,-1.6e-05,-2e-06,-3e-06,-3e-06,-1.1e-05,-0.00012,0.000616,0.001555,0.001483,-0.00563,0.00681,-0.01853,0.022313,0.01129,-0.028185,0.016283,0.038699,0.018649,-0.001491
