0.006055,0.005896,0.004976,0.005356,0.006039,0.005808,0.006107,0.006761,0.006239,0.005607,0.005712,0.005717,0.005604,0.00603,0.006396,0.006291,0.006135,0.005585,0.005591,0.006054,0.005646,0.00517,0.005182,0.005473,0.005522,0.005601,0.007018,0.007691
0.007281,0.007178,0.006248,0.00661,0.007404,0.007211,0.007433,0.007997,0.007345,0.006712,0.006798,0.006821,0.006845,0.007358,0.007675,0.00752,0.007417,0.006783,0.006782,0.007355,0.006775,0.006233,0.006402,0.006848,0.006835,0.006957,0.008871,0.009619
0.009182,0.009198,0.008454,0.008779,0.009608,0.009493,0.009569,0.009857,0.00901,0.008485,0.008512,0.008572,0.008886,0.009471,0.009574,0.009425,0.009572,0.008843,0.008838,0.009591,0.008732,0.008144,0.008622,0.009268,0.009086,0.009433,0.012328,0.013041
0.010439,0.010629,0.010348,0.010602,0.011149,0.011212,0.011221,0.011027,0.010193,0.009887,0.0097,0.009863,0.010441,0.01087,0.010547,0.010454,0.011049,0.010505,0.01062,0.011436,0.010386,0.00992,0.010713,0.01147,0.011161,0.012152,0.016133,0.016275
0.011326,0.011553,0.011761,0.012073,0.012059,0.012321,0.012806,0.012358,0.011514,0.011302,0.010875,0.01098,0.011373,0.011576,0.010912,0.010848,0.012013,0.011859,0.011975,0.012644,0.011605,0.011371,0.012586,0.013389,0.013077,0.014995,0.019831,0.019101
0.013445,0.013109,0.01316,0.013617,0.012956,0.013381,0.01468,0.014606,0.013936,0.013538,0.012948,0.012514,0.012207,0.012535,0.011714,0.01172,0.013731,0.01375,0.013266,0.013685,0.012965,0.01295,0.01442,0.01501,0.014943,0.017636,0.022633,0.021396
0.01616,0.015002,0.01444,0.014829,0.013768,0.014251,0.016185,0.01703,0.017092,0.01656,0.015485,0.014053,0.013479,0.014503,0.013358,0.013399,0.016351,0.016378,0.015275,0.015193,0.014529,0.014639,0.015959,0.01625,0.017059,0.020245,0.023786,0.022134
0.017732,0.015845,0.015025,0.015438,0.014984,0.015742,0.017708,0.019741,0.020659,0.019955,0.018218,0.015644,0.015063,0.01699,0.015716,0.015628,0.0189,0.019112,0.018052,0.017302,0.016669,0.016854,0.017303,0.017359,0.019222,0.022862,0.024602,0.023076
0.017398,0.015479,0.015066,0.015625,0.0164,0.017481,0.019009,0.022386,0.024089,0.023111,0.020692,0.017294,0.016805,0.019225,0.017918,0.01815,0.021344,0.021304,0.020436,0.019169,0.019051,0.019309,0.018491,0.018802,0.021035,0.024869,0.027141,0.026729
0.016459,0.015199,0.01592,0.016862,0.01824,0.019123,0.019966,0.024233,0.02719,0.026453,0.022852,0.018586,0.018532,0.021523,0.020007,0.020523,0.023823,0.02318,0.022148,0.020496,0.020522,0.020616,0.019107,0.019929,0.021653,0.025714,0.030933,0.03234
0.016591,0.016153,0.017285,0.018237,0.019931,0.020537,0.020847,0.024497,0.028069,0.028216,0.024158,0.019689,0.019839,0.023175,0.021288,0.022275,0.026064,0.024016,0.022387,0.021216,0.021493,0.021268,0.019862,0.020728,0.021418,0.02555,0.033001,0.035887
0.016923,0.017456,0.017743,0.018501,0.020863,0.021287,0.021623,0.023733,0.026501,0.027123,0.023937,0.020369,0.019547,0.022221,0.020797,0.022752,0.026627,0.023236,0.021097,0.021319,0.022399,0.021204,0.01983,0.020984,0.02132,0.024549,0.03161,0.034164
0.016674,0.018067,0.017243,0.017928,0.021123,0.021775,0.021984,0.02262,0.024194,0.024739,0.023156,0.020592,0.018239,0.019898,0.019875,0.022609,0.025288,0.021462,0.019517,0.02108,0.023368,0.021085,0.018814,0.020266,0.020766,0.022482,0.027909,0.028991
0.015823,0.017636,0.01757,0.018043,0.0203,0.021096,0.021448,0.02153,0.022021,0.022328,0.021526,0.01982,0.017736,0.018505,0.018901,0.021568,0.022182,0.018364,0.017453,0.019707,0.022559,0.019795,0.016811,0.018466,0.019621,0.019566,0.022478,0.023749
0.015516,0.016971,0.017405,0.01694,0.018072,0.019181,0.019296,0.019454,0.019823,0.019549,0.018393,0.017609,0.017434,0.018054,0.017407,0.018401,0.017472,0.014674,0.015053,0.016904,0.018798,0.016753,0.014645,0.016154,0.018055,0.017978,0.019367,0.020728
0.016124,0.017201,0.017324,0.016241,0.016935,0.017968,0.017572,0.018206,0.017936,0.016395,0.016103,0.017093,0.01897,0.018891,0.01609,0.01496,0.014375,0.013955,0.014987,0.015866,0.01683,0.016477,0.01442,0.014514,0.017789,0.019774,0.021962,0.021661
0.018368,0.018156,0.018613,0.019252,0.020313,0.020392,0.019479,0.020466,0.018561,0.015145,0.016236,0.018327,0.02111,0.021417,0.01758,0.015646,0.015303,0.016059,0.017643,0.017849,0.018335,0.019697,0.017233,0.016528,0.021513,0.024479,0.028156,0.026593
0.021604,0.019654,0.021367,0.024571,0.025577,0.024973,0.024038,0.025143,0.021894,0.016507,0.017587,0.019942,0.023329,0.025453,0.021576,0.019303,0.018935,0.020219,0.022371,0.02158,0.0217,0.024248,0.021293,0.020373,0.026408,0.029076,0.032836,0.03082
0.024393,0.022053,0.024755,0.02917,0.028729,0.02703,0.025851,0.027863,0.025652,0.019166,0.019108,0.021882,0.02686,0.030664,0.026781,0.024262,0.024342,0.027088,0.029749,0.027294,0.025405,0.027402,0.025026,0.024494,0.02967,0.031047,0.033545,0.032173
0.027293,0.025788,0.027251,0.030786,0.029589,0.026596,0.023913,0.027553,0.029126,0.022949,0.021172,0.024927,0.0321,0.035583,0.0319,0.029636,0.029647,0.033959,0.038131,0.035117,0.029039,0.027976,0.026931,0.027172,0.031479,0.032498,0.033513,0.032671
0.032172,0.030718,0.028134,0.030174,0.03037,0.027022,0.022817,0.027071,0.032172,0.027497,0.023924,0.028001,0.037737,0.039939,0.035604,0.033323,0.032826,0.038082,0.04398,0.041338,0.031736,0.028636,0.029364,0.029172,0.031538,0.034655,0.036604,0.034673
0.035699,0.035321,0.030861,0.031383,0.031241,0.028357,0.025388,0.028472,0.033897,0.03181,0.026906,0.029938,0.0412,0.042467,0.037281,0.034479,0.033921,0.039247,0.043987,0.041255,0.03299,0.030443,0.031512,0.029519,0.028942,0.034815,0.037986,0.034803
0.036105,0.03759,0.035586,0.036359,0.036259,0.033556,0.031285,0.0306,0.034663,0.035603,0.030444,0.031103,0.039709,0.039347,0.033794,0.032785,0.0339,0.036664,0.037354,0.035049,0.031641,0.032845,0.035193,0.031182,0.027527,0.031672,0.033818,0.032969
0.035521,0.036645,0.036383,0.038045,0.040303,0.03825,0.035434,0.032007,0.035185,0.037815,0.033192,0.031898,0.036499,0.035726,0.031224,0.032426,0.035062,0.034616,0.03073,0.028781,0.02979,0.034098,0.038647,0.034406,0.029128,0.028852,0.029975,0.033202
0.036251,0.034578,0.032218,0.03397,0.036897,0.036526,0.034526,0.031284,0.033825,0.035649,0.031315,0.029727,0.03247,0.034629,0.032679,0.031533,0.031835,0.029618,0.025999,0.024909,0.026305,0.031606,0.038982,0.035963,0.030312,0.029596,0.030811,0.032154
0.036326,0.030208,0.024686,0.026144,0.026997,0.028735,0.029362,0.027889,0.030895,0.030825,0.026907,0.024994,0.024266,0.030252,0.032363,0.027486,0.025167,0.021898,0.020124,0.020618,0.021801,0.026825,0.034244,0.033167,0.029452,0.029688,0.030292,0.0277
0.03669,0.026529,0.018983,0.020687,0.019996,0.021268,0.022445,0.023701,0.030936,0.031655,0.026344,0.021834,0.017534,0.024901,0.029995,0.024182,0.021972,0.018149,0.015322,0.017482,0.022027,0.025612,0.027867,0.027696,0.028392,0.028493,0.028184,0.024936
0.034351,0.024424,0.020167,0.023089,0.020689,0.018904,0.019989,0.023943,0.032514,0.036275,0.032442,0.024728,0.018207,0.022937,0.028076,0.023778,0.02205,0.019209,0.016058,0.020404,0.027918,0.028576,0.024411,0.023121,0.026587,0.026162,0.024401,0.021936
0.034419,0.027086,0.026151,0.026289,0.022446,0.023699,0.027618,0.030648,0.035607,0.040256,0.040286,0.032698,0.026489,0.028093,0.030485,0.027901,0.025867,0.025209,0.022588,0.026017,0.033166,0.032779,0.027283,0.024362,0.026073,0.025254,0.023761,0.021314
0.048694,0.038605,0.037039,0.032219,0.02584,0.033657,0.043156,0.04406,0.041006,0.040889,0.04528,0.040774,0.037163,0.037889,0.03555,0.037305,0.039105,0.038782,0.034001,0.03494,0.039883,0.0386,0.036508,0.033453,0.032541,0.032052,0.031075,0.026385
0.06673,0.053148,0.05098,0.042516,0.032571,0.046688,0.062094,0.059473,0.047864,0.041435,0.047708,0.046561,0.047066,0.047584,0.041381,0.049903,0.0564,0.055488,0.04717,0.045971,0.051373,0.048384,0.047624,0.046766,0.045837,0.044024,0.042438,0.035873
0.077036,0.062953,0.060447,0.050755,0.038352,0.057261,0.075669,0.069222,0.053299,0.045095,0.050132,0.049333,0.052827,0.052482,0.046656,0.06059,0.069244,0.066561,0.055776,0.052586,0.059507,0.055959,0.054152,0.056524,0.056244,0.051546,0.049117,0.042333
0.070226,0.059906,0.057837,0.05067,0.040729,0.059292,0.07344,0.0643,0.050772,0.044914,0.045693,0.043399,0.048333,0.049225,0.04794,0.062077,0.068885,0.063297,0.053954,0.049926,0.055822,0.05196,0.049235,0.055236,0.055228,0.048095,0.045594,0.04021
0.048091,0.0446,0.04517,0.040937,0.037215,0.049531,0.053916,0.045879,0.044187,0.04161,0.033413,0.029544,0.0345,0.041246,0.046957,0.055767,0.055626,0.046105,0.043427,0.042544,0.042112,0.036819,0.035672,0.04338,0.042461,0.036589,0.035737,0.030736
0.025208,0.028823,0.033767,0.027957,0.027986,0.032777,0.029796,0.027472,0.037744,0.034823,0.021323,0.016996,0.022414,0.033723,0.043099,0.049995,0.040746,0.0266,0.029963,0.033819,0.028107,0.021753,0.024808,0.033303,0.033243,0.028871,0.027917,0.023345
0.015599,0.019451,0.025612,0.021531,0.021278,0.022658,0.018647,0.021436,0.034071,0.02658,0.012469,0.010998,0.019753,0.028821,0.034231,0.039591,0.029866,0.017385,0.021722,0.026658,0.022231,0.016465,0.016755,0.026669,0.032222,0.025868,0.023577,0.020849
0.012293,0.0138,0.021136,0.020128,0.017827,0.022702,0.019262,0.020945,0.030017,0.01958,0.008448,0.009976,0.018859,0.023224,0.02654,0.029112,0.021801,0.015643,0.021041,0.021927,0.018769,0.016267,0.011684,0.020187,0.029661,0.025252,0.02306,0.022368
0.011921,0.011931,0.019273,0.01739,0.015673,0.024005,0.019407,0.019181,0.025199,0.015582,0.009013,0.01121,0.015789,0.02003,0.026171,0.025891,0.018133,0.01513,0.021581,0.022491,0.019619,0.019278,0.014384,0.01865,0.023772,0.021884,0.020125,0.022386
0.011097,0.011708,0.018074,0.016025,0.016999,0.024609,0.017931,0.016439,0.019562,0.014065,0.011052,0.01119,0.011224,0.01689,0.026242,0.022665,0.014387,0.013646,0.021392,0.0255,0.021682,0.022488,0.020261,0.018435,0.015945,0.018709,0.018544,0.021007
0.009709,0.012545,0.016039,0.014068,0.017409,0.022269,0.015199,0.01351,0.013102,0.013135,0.013014,0.010037,0.008543,0.015285,0.02338,0.019344,0.012209,0.01267,0.023944,0.028474,0.020903,0.023055,0.025185,0.018441,0.010619,0.017955,0.021169,0.021943
