0.000251,0.00015,9.9e-05,0.000181,0.000125,9.9e-05,2.1e-05,0.000113,0.00011,6.5e-05,-1.5e-05,0.000235,0.000134,8.2e-05,0.00026,0.000226,4.4e-05,3.8e-05,0.000194,0.000164,1.6e-05,3.4e-05,0.00022,0.000172,0.000207,0.000243,0.000163,0.000184,0.000121,7.6e-05,0.000159,9.4e-05,7.8e-05,9e-06,1.8e-05,-3.4e-05,0.000179,9.6e-05,-1.9e-05,0.00011,-5.2e-05,-4.5e-05,6e-05,0.000122,9e-05,-3e-06,5.4e-05,0.000121,0.000125,0.000118,0.000149,0.000129,0.000182,7.3e-05,0.000135,3e-05,6.9e-05,-2.7e-05,9.8e-05,9.3e-05,6.4e-05,8e-05,0.00011,9.4e-05,7.5e-05,0.000194,0.000106,5.5e-05,0.000179,8.5e-05,7.4e-05,1.3e-05,1.5e-05,1.2e-05,8.8e-05,6.1e-05,0.00014,0.000153,5.3e-05,9.9e-05,0.000134,0.000117,0.000183,8e-05,5e-06,-2.3e-05,-1.5e-05,0.000204,8.5e-05,1.5e-05,1.9e-05,6.4e-05,9.5e-05,0.000144,5.9e-05,0.000246,1e-04,5.5e-05,0.000108,0.000151,0.000108,-2e-06,-3e-06,-7.4e-05,-4e-06,8.4e-05,0.000208,0.000121,1.3e-05,1e-05,7e-05,0.000118,0.000104,9.8e-05,8.6e-05,5.5e-05,4e-05,5.9e-05,-1.7e-05,2.1e-05,8.3e-05
-1.5e-05,-2.4e-05,-0.00012,-5.6e-05,-5e-06,-6.1e-05,7e-05,-3e-06,-4e-05,1.7e-05,-5.9e-05,-1.5e-05,-0.000104,0.000132,2.6e-05,9.1e-05,-7.1e-05,3.6e-05,3.4e-05,-2e-05,-8.3e-05,5e-06,5.1e-05,9.4e-05,-8.5e-05,-0.000119,-0.000104,2.5e-05,5e-05,-4.1e-05,1.7e-05,0,-1e-04,-4.2e-05,4e-06,-0.000115,-3.4e-05,-6.5e-05,-9.2e-05,-2.1e-05,-4.2e-05,-4.8e-05,-8e-06,-8.6e-05,-1.2e-05,-3.7e-05,-6e-05,-0.000108,-1.7e-05,-0.000165,-0.000114,-1e-04,-0.000128,-4.4e-05,3.8e-05,-3.8e-05,-4.7e-05,2e-05,1.6e-05,-4.8e-05,4.7e-05,5e-05,-1e-06,-1.3e-05,5.8e-05,5.2e-05,-3.8e-05,-4.8e-05,7.4e-05,6.1e-05,3e-06,2.3e-05,3.9e-05,3.2e-05,-7.7e-05,3.8e-05,-4e-05,-4.6e-05,5e-06,4.8e-05,2.4e-05,-7.9e-05,3.4e-05,8e-06,0.000105,7.3e-05,-6e-06,-2.9e-05,-2.3e-05,-6.1e-05,6.2e-05,9.5e-05,-2.4e-05,-8.8e-05,-4.6e-05,-9e-05,-3.8e-05,7e-06,5.9e-05,0.000103,3e-05,-3.1e-05,-4.3e-05,-3.9e-05,-0.000115,-0.000101,-3.2e-05,-1e-06,-4.6e-05,2.8e-05,5.9e-05,-6.8e-05,1.1e-05,-6.2e-05,-7.2e-05,-1.5e-05,-4.2e-05,-3.9e-05,3.3e-05,-1.4e-05,-5.1e-05
-0.000186,-4.5e-05,-3.6e-05,-7.7e-05,-9.6e-05,-0.000168,-9.6e-05,-5e-05,-0.000112,-4.5e-05,1.4e-05,4.8e-05,-1.5e-05,-0.000192,-0.000206,-9.5e-05,-6.5e-05,-0.000144,0,-9e-05,-6e-06,-1.4e-05,-7.2e-05,-9.1e-05,-0.000153,-2e-04,-0.000216,-0.000117,-6.5e-05,-0.000107,-6e-05,-4.2e-05,-4e-05,-5.9e-05,-6.5e-05,4.9e-05,-0.000105,-7.7e-05,-8.6e-05,-0.00013,-9.8e-05,-6.2e-05,-5.8e-05,-4.4e-05,-0.000184,-6.7e-05,-9.6e-05,-7.4e-05,-7.8e-05,-4.8e-05,-2.9e-05,-0.000102,-0.000197,-0.000183,-0.000179,-5.1e-05,-6.3e-05,-7.6e-05,-0.000119,-0.000152,-9.2e-05,-4.5e-05,-1.3e-05,2.3e-05,0.000102,-1.6e-05,-1.6e-05,-9.5e-05,-4.6e-05,-5.6e-05,-5.7e-05,-4.3e-05,-6e-06,2.9e-05,-0.000105,-4.9e-05,-0.00019,-0.000113,1.7e-05,-4e-06,1e-06,-2.7e-05,-7e-06,-0.000134,-0.000109,-5e-05,-4e-05,-0.000132,-7e-05,-3.2e-05,-5.4e-05,0.000118,3e-05,-0.000145,-0.000114,-0.000124,-0.000118,-6e-06,-3.5e-05,-3.2e-05,-9.1e-05,-0.000133,-4.8e-05,5e-06,1.4e-05,4e-06,-9.3e-05,-1.4e-05,-6.1e-05,2.2e-05,-8.3e-05,-0.000143,-0.000129,-3.8e-05,-0.000107,-0.000114,-5.5e-05,-0.000107,-2.9e-05,-1.4e-05,-6e-06
-8.1e-05,-1.9e-05,5.6e-05,7e-06,-3.4e-05,-1.8e-05,-7e-05,-2.7e-05,3e-05,-7e-06,-1.8e-05,4.6e-05,9e-06,-0.000108,-0.000214,-3.2e-05,-1.2e-05,-5.7e-05,3.5e-05,-0.000118,-4.8e-05,1.6e-05,2.2e-05,-8.8e-05,-8e-06,-6e-05,-9.9e-05,-8.6e-05,-1.7e-05,-2.6e-05,4.1e-05,-0.000119,3.1e-05,-2.7e-05,1e-05,-1.6e-05,-9.2e-05,1.8e-05,5.4e-05,-4.6e-05,-7.7e-05,6e-05,2.8e-05,9e-05,-4.9e-05,-5e-05,-5.6e-05,-2.7e-05,-0.000114,4.1e-05,2.9e-05,-2e-06,-9.2e-05,-6e-05,-3.8e-05,-2e-05,-2e-06,3.6e-05,-9e-06,-7.7e-05,-2.1e-05,-6.9e-05,-8.5e-05,-2.1e-05,1.5e-05,-7.2e-05,-2.1e-05,1.7e-05,-4e-06,-5.9e-05,1.4e-05,4e-06,7.7e-05,-5.3e-05,-6.2e-05,1.8e-05,6.2e-05,-8e-05,-6.9e-05,-8e-05,-3.9e-05,-2e-05,1.2e-05,-1.7e-05,6.2e-05,4.8e-05,8e-06,-9.7e-05,-0.000106,-7.4e-05,1.7e-05,-1.9e-05,-9.8e-05,1.6e-05,-6.3e-05,7.7e-05,-8.8e-05,-8.8e-05,1.8e-05,-4.7e-05,-1.6e-05,7e-06,-2.5e-05,-8.1e-05,-6.1e-05,3.9e-05,-7.9e-05,-3e-05,-4.1e-05,1e-05,5e-06,-1e-05,-1.1e-05,6.6e-05,1.3e-05,-4.8e-05,2e-06,-9.1e-05,-0.000109,-0.000109,-0.000137
8.4e-05,7e-06,-1e-05,3.6e-05,4.7e-05,4.6e-05,1.2e-05,9e-06,1.8e-05,4.4e-05,1.3e-05,0.000135,3.1e-05,6.9e-05,-1.2e-05,4.8e-05,2.4e-05,9.7e-05,-1.1e-05,-3.8e-05,3.1e-05,3.4e-05,-2.7e-05,-0.000113,2.3e-05,8.9e-05,3.7e-05,1e-04,3.9e-05,5.6e-05,7e-06,-6.2e-05,4.9e-05,9e-06,4.4e-05,4.4e-05,-5e-05,4.2e-05,3.9e-05,3.6e-05,6.2e-05,-1.8e-05,9e-06,4.3e-05,-3.4e-05,5.1e-05,7.6e-05,6.7e-05,-1.2e-05,-8e-06,5.4e-05,0.000107,9e-05,0.000103,7e-06,5.9e-05,2e-05,6.4e-05,3.8e-05,5.8e-05,6e-05,2.9e-05,4.3e-05,1.6e-05,5.8e-05,-9e-06,5e-05,6.9e-05,6.6e-05,-3.1e-05,2.7e-05,0.000115,-2.4e-05,-2.7e-05,4.7e-05,6.9e-05,5.4e-05,-3e-06,2e-05,-1.2e-05,2.4e-05,6.5e-05,3.2e-05,2.8e-05,-2e-06,-4e-05,2.9e-05,2.5e-05,8.7e-05,0.000105,4e-06,3.5e-05,1.8e-05,5.7e-05,7.9e-05,3.3e-05,5.9e-05,6.5e-05,3.1e-05,-8e-05,9.1e-05,0.000111,2.4e-05,9.5e-05,0.000107,3.6e-05,-9e-06,1.5e-05,9.3e-05,6e-06,0,2.2e-05,5e-06,2.2e-05,6.3e-05,2.4e-05,1.3e-05,2.9e-05,1.7e-05,5.7e-05,6.1e-05
3.6e-05,0.000101,-4e-06,-2e-05,0.000106,2.3e-05,1.2e-05,-2.2e-05,9.6e-05,0.000147,-1e-06,-6.8e-05,-2.7e-05,-7.7e-05,1.7e-05,-3e-06,1.6e-05,-7e-06,-9.3e-05,-1.6e-05,-6.1e-05,2e-06,6e-06,-3e-05,-7e-06,0.000129,9.7e-05,7.2e-05,-4.7e-05,4e-06,1.7e-05,2.1e-05,-3.1e-05,5.1e-05,2.8e-05,-5.2e-05,4.1e-05,7.6e-05,8.7e-05,2.2e-05,6.5e-05,4.9e-05,6.3e-05,-1.1e-05,5.1e-05,9.4e-05,1.3e-05,-2e-06,1.9e-05,-2.4e-05,0.000102,3.3e-05,2e-05,8e-05,9e-05,3.7e-05,-2.1e-05,2.3e-05,5e-06,6.2e-05,3.5e-05,-5.9e-05,3.6e-05,-5.8e-05,1.5e-05,-3.7e-05,1.3e-05,1e-06,2.6e-05,2.6e-05,-5.3e-05,3.7e-05,-2.3e-05,-3.4e-05,1.7e-05,-1.9e-05,5.4e-05,4.2e-05,1.2e-05,-5.5e-05,-8.7e-05,2.2e-05,8.4e-05,4.3e-05,5e-05,1.7e-05,-2.2e-05,-4e-06,7.8e-05,5.7e-05,1e-06,-4.5e-05,-6.4e-05,3e-06,5.1e-05,-9e-06,-1e-06,7e-06,2.6e-05,-3.2e-05,3e-05,5.5e-05,8.5e-05,3.8e-05,6e-06,-6.6e-05,4.2e-05,-7e-05,-4.3e-05,2.7e-05,4.5e-05,2.3e-05,4.1e-05,2.2e-05,1.2e-05,3.8e-05,2.7e-05,2.1e-05,-5.8e-05,8e-06,3.8e-05
-5.4e-05,2.1e-05,-2.3e-05,-6.2e-05,-5e-06,-1.9e-05,1.3e-05,-3e-05,2.2e-05,1e-06,-7e-06,-5.4e-05,-0.000175,-6.7e-05,0.000102,-2.7e-05,-2.6e-05,-3.4e-05,-4e-05,-6.1e-05,-6.9e-05,-7.9e-05,-3.1e-05,-4.4e-05,7.8e-05,2.2e-05,1.2e-05,4.3e-05,-7.2e-05,-1.5e-05,-6.2e-05,-1.4e-05,9e-06,-9e-06,-2.9e-05,-3.1e-05,8e-06,3.8e-05,-4.8e-05,-5e-05,7e-06,-9.2e-05,-3.7e-05,-1.9e-05,-1.3e-05,-6.5e-05,-2.8e-05,-5.3e-05,2.7e-05,-4.2e-05,-5.6e-05,-4.8e-05,-1.4e-05,2e-05,-1.6e-05,8e-06,-3e-05,-2.1e-05,3.6e-05,5e-06,2e-05,-4.8e-05,5.7e-05,-2.7e-05,-9e-06,-3.3e-05,-5.9e-05,-2.7e-05,-1.2e-05,-3.2e-05,-4.4e-05,-2.2e-05,-1.4e-05,-2.2e-05,-9e-06,-7.4e-05,5e-06,1.2e-05,1.7e-05,3e-06,-3.6e-05,-2.5e-05,9e-06,2.5e-05,-3.4e-05,-4.5e-05,-1.7e-05,-6e-06,1.4e-05,1.4e-05,-1.2e-05,-3.4e-05,-2.9e-05,-3.5e-05,5e-06,-1.1e-05,-4e-05,2.1e-05,1.6e-05,-2e-06,4.3e-05,-5e-05,-1e-05,-7e-06,-1e-06,2e-06,-3.7e-05,-9.4e-05,-1.9e-05,-4.4e-05,1.1e-05,-9e-06,-3e-05,-5e-06,-1e-05,-2.4e-05,-2.7e-05,9e-06,-5e-06,-2e-06,3e-06
-7.8e-05,-2.5e-05,-8e-06,-6e-06,-1.2e-05,-3.4e-05,2.9e-05,-6e-05,-6.8e-05,-2.2e-05,3.6e-05,9e-06,7e-06,-6.6e-05,3.4e-05,-6.8e-05,-8.4e-05,-7.1e-05,1.7e-05,-2.2e-05,-3e-05,3.5e-05,-1.3e-05,3e-06,5.7e-05,-7.3e-05,-1.8e-05,-8.4e-05,-4.9e-05,2.8e-05,-2.3e-05,-2.9e-05,-2.8e-05,-2.6e-05,-2.4e-05,-3.2e-05,-5.1e-05,-6.4e-05,-5.5e-05,4e-06,-3e-05,9e-06,-5.7e-05,1e-06,-3.9e-05,-1.1e-05,-1e-05,-4.9e-05,-4e-06,-3.2e-05,-5.4e-05,1.6e-05,-5.9e-05,-8.3e-05,-4.3e-05,-3.6e-05,-3e-06,1.2e-05,-2.8e-05,-3e-06,-1.9e-05,1.7e-05,2.1e-05,-1e-06,8e-06,-1.1e-05,-5.8e-05,3e-06,-5.6e-05,-9e-06,-1.4e-05,9e-06,-6e-06,-9e-06,4.5e-05,9e-06,4e-06,-2.2e-05,4.6e-05,4e-06,-5e-06,-3.8e-05,-4.2e-05,5e-06,-7e-06,-6.4e-05,-3.6e-05,-2.7e-05,-4.2e-05,-9e-06,4.8e-05,-4e-05,-1.8e-05,-1.9e-05,-7e-06,-6.3e-05,-2.1e-05,1.7e-05,1.4e-05,1.3e-05,3e-06,-2e-05,-2e-05,-1.1e-05,0,2.7e-05,-4.1e-05,-1.8e-05,-4e-06,-2e-06,1.5e-05,-2.1e-05,-4.3e-05,-6.4e-05,1.3e-05,-5e-06,-2.7e-05,-1.2e-05,1.3e-05,-9e-06,1.3e-05
-6.2e-05,-6.4e-05,1.6e-05,4.3e-05,-7e-06,-2.7e-05,-2e-05,2e-06,-2.4e-05,-3.2e-05,6e-05,6e-06,1.3e-05,-1.5e-05,-3.6e-05,-2.5e-05,0,1.1e-05,7.2e-05,7.7e-05,-8e-06,1e-05,-5.9e-05,-3.7e-05,3.1e-05,3e-05,-5e-05,-8.7e-05,-2.3e-05,1.8e-05,1.7e-05,-1.9e-05,-1.6e-05,-9e-06,-2.3e-05,2.8e-05,3.8e-05,-4.6e-05,-2e-06,-4.3e-05,-2.1e-05,2.2e-05,-7e-06,1e-06,-2e-06,-6.3e-05,-1.8e-05,-1.5e-05,-3e-06,-2.4e-05,1.6e-05,1e-05,-9e-06,-3.5e-05,-4.1e-05,-1.2e-05,3.9e-05,-1.9e-05,-1.4e-05,-1.1e-05,-2e-05,1.8e-05,-5e-06,0,-1.2e-05,-2.9e-05,-4.3e-05,-2e-06,1e-06,-2.3e-05,1e-06,-1.4e-05,-2.2e-05,-6e-06,-3e-06,4e-06,7e-06,-4.1e-05,3.4e-05,-5e-06,-4e-06,-2.9e-05,-1.7e-05,-1.6e-05,-3e-05,1.2e-05,5e-06,-2e-06,-5.5e-05,-4.3e-05,-1.4e-05,1.4e-05,-2.1e-05,-3.7e-05,0,-1.9e-05,1.2e-05,-7e-06,-2.6e-05,-2.6e-05,-2.3e-05,-5.1e-05,-5.4e-05,-1.3e-05,-2.2e-05,-1e-05,-2.9e-05,-1e-06,8e-06,1.4e-05,2.6e-05,2e-06,-4.1e-05,-3.4e-05,1.7e-05,-1e-06,-3.7e-05,-2.3e-05,3.6e-05,7e-06,-4.3e-05
3.5e-05,-1.9e-05,4.4e-05,1.8e-05,2.3e-05,3.3e-05,-2e-06,5e-06,-5e-06,1.7e-05,1.5e-05,0,-2.3e-05,4.3e-05,1.3e-05,-2.6e-05,3.4e-05,3e-06,2.5e-05,-1.7e-05,4.7e-05,3e-05,-3.2e-05,-1.5e-05,-5.9e-05,-8e-06,5e-06,1.2e-05,2.2e-05,3.1e-05,5.5e-05,7e-06,3.1e-05,3.8e-05,8e-06,6e-06,1.6e-05,-7e-06,1.4e-05,4.6e-05,1.8e-05,8e-06,2.6e-05,1.6e-05,2.7e-05,1.9e-05,1.8e-05,4.6e-05,2.7e-05,5.4e-05,1.2e-05,2.2e-05,3.5e-05,1.1e-05,1.3e-05,-4e-06,-1.1e-05,-9e-06,3.8e-05,1.5e-05,3e-06,1.6e-05,1.3e-05,1.4e-05,-5e-06,-2.1e-05,-2.7e-05,1.1e-05,2.2e-05,-1e-06,1.9e-05,4.1e-05,-2.5e-05,-5.3e-05,-2.3e-05,3.2e-05,4.6e-05,5e-06,3.9e-05,1.7e-05,1.6e-05,-2e-05,2.7e-05,2.2e-05,-2.2e-05,2.1e-05,-6e-06,2.4e-05,-2.5e-05,-6e-06,1.7e-05,2e-06,5e-06,-3.2e-05,9e-06,5.8e-05,-1e-06,-3.7e-05,-3e-06,-2.1e-05,-2.7e-05,-2e-06,2.6e-05,-8e-06,1.3e-05,2.1e-05,7e-06,3.8e-05,1.7e-05,2.4e-05,3e-06,-2.2e-05,-1.6e-05,1e-05,1.1e-05,-1e-05,1.6e-05,3.1e-05,1.1e-05,-1.7e-05,6e-06
-4e-06,2.9e-05,2.9e-05,-3.8e-05,-9e-06,5.3e-05,1.4e-05,5e-05,-4.8e-05,-1.9e-05,-1.7e-05,3e-06,-1.7e-05,2.9e-05,6e-06,2.6e-05,3.6e-05,2.3e-05,-4.2e-05,-4e-06,3.6e-05,2.1e-05,2.2e-05,-1e-05,-4.9e-05,-1.7e-05,3.1e-05,-1e-06,-1.1e-05,-2.8e-05,-6e-06,1.5e-05,2.1e-05,9e-06,1.7e-05,-1.3e-05,-4e-06,-3e-06,4e-06,2e-06,-8e-06,2.5e-05,-1.5e-05,3e-06,-2e-06,1e-06,1.7e-05,-3e-06,2.2e-05,3.7e-05,-2.7e-05,2.8e-05,0,-1.5e-05,3.9e-05,1.3e-05,-4.3e-05,-1e-05,2.5e-05,-6e-06,-1.3e-05,-3.3e-05,-7e-06,-1.4e-05,-3.2e-05,-1e-06,1.1e-05,2e-06,8e-06,1.1e-05,6e-06,-7e-06,-9e-06,1.8e-05,0,1.1e-05,-2.8e-05,3e-06,-2.4e-05,-4e-06,1e-06,-3.4e-05,1.4e-05,1.8e-05,-5e-06,-7e-06,3e-06,-1.1e-05,-1.1e-05,2.1e-05,-1.1e-05,2e-06,8e-06,3e-06,1.6e-05,1.4e-05,-1e-06,-3.1e-05,-9e-06,-1e-05,-3.9e-05,-1.1e-05,1.5e-05,1.5e-05,1.4e-05,-3.6e-05,-1.6e-05,1.9e-05,-1.8e-05,-3e-06,2.7e-05,2e-06,1.9e-05,1.6e-05,1.7e-05,-4e-06,2.6e-05,-1e-06,-5e-06,-4.6e-05,7e-06
-6e-06,-1e-05,-6e-06,1.5e-05,-2e-05,2.5e-05,-1e-06,0,-3e-06,-6e-06,-1.3e-05,-2e-06,-3e-06,-8e-06,2.7e-05,6e-06,-4e-06,1.7e-05,-1.5e-05,-2.9e-05,-2e-05,-6e-06,3.4e-05,1e-06,-4.2e-05,2.4e-05,-1.5e-05,2e-05,-5e-06,-2.6e-05,2e-06,-4e-06,5e-06,-3.5e-05,-3e-06,-7e-06,-1.5e-05,-2.1e-05,0,0,-1.8e-05,-2.1e-05,-5e-06,-2.6e-05,-1.2e-05,2.5e-05,-1.4e-05,-6e-06,7e-06,-5e-06,-1.6e-05,-8e-06,-1.4e-05,-9e-06,7e-06,-7e-06,-2.2e-05,-2e-05,-4e-06,1.4e-05,-3e-06,-1.3e-05,-2.3e-05,-1.3e-05,-1.7e-05,-7e-06,3e-06,-2.7e-05,-1.2e-05,-3e-06,-1.2e-05,7e-06,1.3e-05,-2e-06,-1.4e-05,6e-06,-1e-05,-1.2e-05,-2.5e-05,-2e-05,-2e-06,-1.8e-05,-5e-06,2e-06,-2e-06,-8e-06,-2e-06,-1e-05,-1.7e-05,0,-1e-05,-2.1e-05,1e-06,-2.1e-05,7e-06,-6e-06,2.1e-05,-3e-05,2.4e-05,-3e-06,-6e-06,-5e-06,0,1.3e-05,0,2e-06,-3.9e-05,-3.8e-05,-1.4e-05,-1.8e-05,-8e-06,-2e-06,-1.1e-05,0,1e-06,-3e-06,8e-06,2e-06,-7e-06,3e-06,0
-1e-06,-6e-06,-1.6e-05,6e-06,-5e-06,7e-06,0,-2.5e-05,-2.2e-05,5e-06,5e-06,1e-06,2e-06,3e-05,-1.5e-05,1.6e-05,-2e-06,9e-06,2.2e-05,7e-06,1.3e-05,6e-06,-2.6e-05,7e-06,-1.3e-05,3e-05,4e-06,4e-06,-3e-05,-2e-05,-8e-06,-1e-05,-9e-06,7e-06,-6e-06,-2e-06,-1.2e-05,1.9e-05,-1e-06,8e-06,4e-06,-1e-05,-2e-06,-7e-06,1e-06,-9e-06,-5e-06,-2e-06,6e-06,-9e-06,1e-06,-1.5e-05,1.1e-05,1e-06,-3e-06,4e-06,-6e-06,1.1e-05,-4e-06,-2e-06,1e-06,-1.4e-05,-2.3e-05,-2.5e-05,8e-06,-1.7e-05,1.7e-05,-1.5e-05,-6e-06,-6e-06,-1.4e-05,-5e-06,9e-06,-1.1e-05,-1.2e-05,-4e-06,-1.2e-05,2e-06,-3e-06,-1.5e-05,-5e-06,-1e-06,-1.3e-05,5e-06,4e-06,-2.3e-05,1.4e-05,-2e-06,-5e-06,0,3e-06,7e-06,-8e-06,1.3e-05,-4e-06,-2.8e-05,-2e-05,4e-06,1.2e-05,1e-06,-3e-06,-8e-06,-1.4e-05,2e-06,1e-06,1e-06,1.4e-05,-1.8e-05,-9e-06,-1.1e-05,-2.9e-05,-7e-06,6e-06,-2e-05,-1.5e-05,3e-06,-5e-06,5e-06,-3e-06,8e-06,-1.2e-05
-2e-06,-1.8e-05,-1.1e-05,-1e-05,0,7e-06,-9e-06,-5e-06,-5e-06,-8e-06,1.1e-05,-1e-05,-2e-05,-1e-06,-3.7e-05,-1.6e-05,-1.6e-05,1.2e-05,1.3e-05,1e-06,3e-06,-9e-06,5e-06,-6e-06,-2e-05,2.1e-05,1e-06,-4e-06,-8e-06,-1.1e-05,-5e-06,-9e-06,-7e-06,-9e-06,0,-2e-06,9e-06,7e-06,-1.2e-05,-7e-06,-9e-06,-1.1e-05,7e-06,9e-06,1.2e-05,6e-06,-1.6e-05,-5e-06,-2e-06,-2.2e-05,-1e-06,1e-05,0,4e-06,-2.7e-05,-3e-06,1e-05,1e-06,-1e-06,-5e-06,5e-06,1.1e-05,-6e-06,-1e-05,1.5e-05,3e-06,9e-06,-1.9e-05,6e-06,-1e-06,-5e-06,1.3e-05,-2e-06,-7e-06,-1e-05,-2e-05,-1e-06,-4e-06,8e-06,-2e-05,1e-06,4e-06,-7e-06,-4e-06,-3e-06,8e-06,8e-06,0,8e-06,-1.1e-05,4e-06,-4e-06,6e-06,7e-06,2e-06,-1e-05,-2e-06,1e-06,-4e-06,-3e-06,1e-06,-2e-06,-1e-06,-1.2e-05,0,0,5e-06,6e-06,2e-06,-1.2e-05,8e-06,1e-06,-6e-06,-4e-06,-3e-06,-3e-06,-1.1e-05,-8e-06,7e-06,1e-05,8e-06
-6e-06,1e-05,2e-06,0,6e-06,2e-06,-8e-06,-7e-06,6e-06,-3e-06,4e-06,-1.3e-05,2e-06,3e-06,-3e-06,-1e-05,-8e-06,1.4e-05,1.2e-05,-3e-06,-1e-05,4e-06,2e-06,-4e-06,-6e-06,-1.3e-05,3e-06,3e-06,8e-06,-5e-06,-3e-06,4e-06,-9e-06,-1e-05,3e-06,6e-06,-6e-06,1.3e-05,-6e-06,8e-06,1e-06,9e-06,9e-06,-7e-06,-4e-06,7e-06,-2e-06,0,1e-06,-3e-06,5e-06,-7e-06,6e-06,5e-06,-2e-06,2e-06,1.1e-05,3e-06,2e-06,3e-06,-1e-06,1.2e-05,2e-06,5e-06,8e-06,4e-06,-7e-06,-1e-05,-9e-06,2e-06,1e-06,-7e-06,-1.8e-05,6e-06,-1.5e-05,-6e-06,5e-06,4e-06,0,1e-06,-1e-06,7e-06,-1.2e-05,0,2e-06,-5e-06,1.3e-05,-9e-06,5e-06,-3e-06,6e-06,-2e-06,-2e-06,4e-06,-9e-06,3e-06,3e-06,-6e-06,-1.2e-05,-6e-06,4e-06,-8e-06,4e-06,6e-06,-2e-06,1e-05,-5e-06,7e-06,4e-06,-4e-06,-2e-06,3e-06,0,5e-06,-5e-06,0,3e-06,-3e-06,9e-06,4e-06,1e-06
-3e-06,1e-05,4e-06,-7e-06,-4e-06,2e-06,-6e-06,6e-06,4e-06,5e-06,-2e-06,-1e-05,-5e-06,1e-05,1.2e-05,-8e-06,2e-06,7e-06,-1.1e-05,3e-06,1e-06,-2e-06,-4e-06,0,-4e-06,-5e-06,-4e-06,-3e-06,4e-06,-2e-06,-5e-06,2e-06,-2e-06,-1e-06,-8e-06,5e-06,-2e-06,3e-06,3e-06,2e-06,2e-06,0,-6e-06,6e-06,-2e-06,-4e-06,-5e-06,4e-06,0,-1e-06,1.8e-05,-1.2e-05,4e-06,-2e-06,1e-06,0,-4e-06,2e-06,-7e-06,8e-06,1e-06,0,-3e-06,3e-06,-1e-06,-2e-06,-3e-06,2e-06,-4e-06,-2e-06,3e-06,-9e-06,-7e-06,1e-05,-5e-06,-2e-06,-1e-06,1e-06,-1.4e-05,7e-06,-3e-06,4e-06,-9e-06,2e-06,0,2e-06,2e-06,1e-06,4e-06,-6e-06,-4e-06,-9e-06,-1e-06,1.1e-05,-6e-06,-3e-06,0,1e-06,-1.1e-05,0,1.2e-05,-1e-06,-2e-06,7e-06,2e-06,-5e-06,-7e-06,3e-06,5e-06,-5e-06,6e-06,1e-06,-5e-06,-3e-06,-3e-06,3e-06,-2e-06,3e-06,-3e-06,4e-06,-9e-06
-1e-06,-1e-05,4e-06,-1.3e-05,2e-06,-3e-06,-2e-06,-1e-06,1.3e-05,-4e-06,-1.1e-05,2e-06,-3e-06,6e-06,-8e-06,-2e-06,0,5e-06,-1.3e-05,-3e-06,7e-06,-2e-06,2e-06,-4e-06,7e-06,-5e-06,-3e-06,-1e-05,2e-06,-5e-06,3e-06,-7e-06,-5e-06,2e-06,-1e-06,-2e-06,-4e-06,-2e-06,1e-06,5e-06,2e-06,4e-06,1e-06,-1e-06,5e-06,-1.1e-05,5e-06,-3e-06,1e-06,2e-06,5e-06,1e-06,3e-06,4e-06,-1e-05,0,-3e-06,-5e-06,-4e-06,-1e-06,-2e-06,-8e-06,-2e-06,-1e-06,-5e-06,-4e-06,-7e-06,1e-06,1e-06,-2e-06,3e-06,-4e-06,-2e-06,-6e-06,-2e-06,3e-06,0,-2e-06,-7e-06,-4e-06,3e-06,1e-06,-5e-06,-4e-06,-4e-06,3e-06,1e-06,0,2e-06,-7e-06,-1e-06,2e-06,-6e-06,-3e-06,-4e-06,-2e-06,-4e-06,1e-05,-2e-06,-1e-06,4e-06,-1e-06,-1.1e-05,-6e-06,2e-06,-5e-06,-1e-06,5e-06,-4e-06,3e-06,-6e-06,-1e-06,-4e-06,-1e-06,-3e-06,0,-1e-06,-4e-06,0,-1e-06,-3e-06
0,-3e-06,1e-06,-4e-06,7e-06,3e-06,0,4e-06,2e-06,2e-06,-7e-06,1e-06,-7e-06,0,-3e-06,-5e-06,9e-06,1e-06,-9e-06,-6e-06,7e-06,0,-1e-05,-3e-06,1.1e-05,-1.4e-05,2e-06,0,1e-06,-3e-06,1e-06,-2e-06,4e-06,6e-06,2e-06,-4e-06,0,-4e-06,3e-06,2e-06,3e-06,4e-06,0,1e-06,1e-06,1e-06,-3e-06,4e-06,-3e-06,6e-06,0,0,3e-06,2e-06,0,0,-5e-06,-2e-06,2e-06,0,1e-06,-4e-06,3e-06,-1e-06,-7e-06,0,-5e-06,4e-06,-2e-06,0,-1e-06,-7e-06,2e-06,-2e-06,-2e-06,2e-06,7e-06,0,-2e-06,-4e-06,2e-06,-4e-06,1e-06,-1e-06,1e-06,6e-06,-1e-06,0,-4e-06,-4e-06,-5e-06,0,4e-06,-4e-06,-4e-06,5e-06,3e-06,4e-06,-1e-06,-3e-06,3e-06,0,1e-06,-3e-06,0,3e-06,2e-06,2e-06,2e-06,1e-06,2e-06,-2e-06,-1e-06,2e-06,0,0,2e-06,3e-06,-1e-06,2e-06,0
0,3e-06,-5e-06,1e-06,-1e-06,1e-06,-4e-06,3e-06,-4e-06,-1e-06,-3e-06,5e-06,0,9e-06,-1e-06,4e-06,1e-06,1e-06,4e-06,-2e-06,3e-06,-5e-06,0,1e-06,1.1e-05,-1.1e-05,-1e-06,-1e-06,-6e-06,1e-06,-1e-06,1e-06,2e-06,-1e-06,-1e-06,-4e-06,-2e-06,-5e-06,4e-06,4e-06,2e-06,-6e-06,-4e-06,-1e-06,0,1e-06,3e-06,0,0,1e-06,-7e-06,-6e-06,2e-06,-4e-06,5e-06,0,0,-2e-06,0,4e-06,-1e-06,1e-06,6e-06,-3e-06,-3e-06,-2e-06,0,4e-06,-1e-06,2e-06,-4e-06,-4e-06,2e-06,-6e-06,-2e-06,4e-06,-4e-06,1e-06,-1e-06,1e-06,-2e-06,-7e-06,4e-06,1e-06,-2e-06,-7e-06,1e-06,-1e-06,-3e-06,2e-06,3e-06,2e-06,-1e-06,-1e-06,-2e-06,-2e-06,3e-06,-1e-06,1e-06,-2e-06,0,1e-06,5e-06,1e-06,1e-06,-1e-06,-7e-06,-9e-06,0,-2e-06,-2e-06,1e-06,-1e-06,2e-06,-2e-06,2e-06,4e-06,-2e-06,0,-4e-06,1e-06
-4e-06,5e-06,-7e-06,2e-06,-1e-06,3e-06,2e-06,-1e-06,-1e-06,1e-06,4e-06,0,-2e-06,2e-06,3e-06,1e-06,-1e-06,1e-06,9e-06,3e-06,0,1e-06,1e-06,-3e-06,6e-06,1e-06,0,0,-7e-06,3e-06,-2e-06,1e-06,0,-4e-06,1e-06,-1e-06,-2e-06,-8e-06,2e-06,-2e-06,1e-06,-1e-06,-3e-06,1e-06,-1e-06,-2e-06,-1e-06,-3e-06,-2e-06,-5e-06,-1e-06,0,0,-1e-06,3e-06,0,3e-06,-2e-06,-1e-06,0,0,-1e-06,3e-06,-2e-06,1e-06,-1e-06,4e-06,1e-06,-2e-06,-1e-06,-3e-06,1e-06,-1e-06,3e-06,4e-06,-4e-06,2e-06,-1e-06,1e-06,-3e-06,0,-6e-06,1e-06,-2e-06,-1e-06,-5e-06,2e-06,-1e-06,-7e-06,4e-06,-1e-06,1e-06,1e-06,-3e-06,-1e-06,-2e-06,-5e-06,2e-06,-1e-06,-2e-06,-5e-06,-2e-06,1e-06,2e-06,0,1e-06,-3e-06,-5e-06,-2e-06,-1e-06,-2e-06,-2e-06,0,0,0,1e-06,2e-06,0,1e-06,1e-06,-3e-06
2e-06,-4e-06,-4e-06,-2e-06,1e-06,-4e-06,0,-5e-06,-5e-06,1e-06,1e-06,-1e-06,-6e-06,-1e-06,4e-06,0,-3e-06,1e-06,3e-06,-1e-06,-2e-06,-4e-06,2e-06,-1e-06,2e-06,-2e-06,-2e-06,5e-06,-2e-06,4e-06,1e-06,-4e-06,-2e-06,3e-06,0,2e-06,0,-2e-06,0,2e-06,0,-5e-06,1e-06,-1e-06,2e-06,1e-06,-1e-06,0,-2e-06,-7e-06,-4e-06,3e-06,2e-06,-1e-06,-5e-06,0,-1e-06,-1e-06,-2e-06,0,-1e-06,5e-06,1e-06,1e-06,2e-06,1e-06,5e-06,0,2e-06,-1e-06,-2e-06,3e-06,0,0,0,-5e-06,2e-06,-1e-06,5e-06,0,0,-5e-06,0,-2e-06,0,-3e-06,4e-06,0,-5e-06,2e-06,2e-06,-1e-06,-2e-06,-2e-06,1e-06,-3e-06,1e-06,-3e-06,4e-06,0,-5e-06,-1e-06,-6e-06,-3e-06,0,3e-06,0,2e-06,1e-06,0,3e-06,-1e-06,-2e-06,-4e-06,1e-06,-1e-06,-2e-06,0,3e-06,-2e-06,1e-06
-2e-06,-5e-06,1e-06,-1e-06,3e-06,-1e-06,-1e-06,-1e-06,-6e-06,-3e-06,-1e-06,-2e-06,1e-06,5e-06,-1e-06,0,-2e-06,1e-06,-5e-06,-3e-06,0,3e-06,0,-1e-06,-2e-06,1e-06,1e-06,-3e-06,0,3e-06,0,-2e-06,-1e-06,4e-06,-1e-06,2e-06,1e-06,2e-06,-4e-06,1e-06,1e-06,5e-06,3e-06,1e-06,2e-06,4e-06,-1e-06,0,-2e-06,-5e-06,-3e-06,-2e-06,1e-06,-2e-06,0,0,0,1e-06,0,-2e-06,2e-06,0,2e-06,1e-06,-2e-06,-2e-06,2e-06,0,2e-06,0,1e-06,0,0,1e-06,-1e-06,0,-2e-06,0,1e-06,0,0,-3e-06,1e-06,1e-06,0,5e-06,3e-06,0,-3e-06,3e-06,-1e-06,-1e-06,1e-06,2e-06,1e-06,-1e-06,2e-06,-5e-06,0,1e-06,-5e-06,-4e-06,2e-06,1e-06,-1e-06,-2e-06,1e-06,4e-06,1e-06,2e-06,-1e-06,0,0,-1e-06,1e-06,0,-1e-06,0,-1e-06,-2e-06,0
-1e-06,0,4e-06,1e-06,-3e-06,-3e-06,2e-06,0,-3e-06,1e-06,-4e-06,-1e-06,-3e-06,1e-06,-3e-06,-2e-06,-1e-06,1e-06,-7e-06,0,1e-06,-1e-06,-4e-06,-1e-06,-4e-06,1e-06,1e-06,4e-06,2e-06,2e-06,0,1e-06,-2e-06,-4e-06,0,1e-06,-2e-06,2e-06,-1e-06,-2e-06,-3e-06,1e-06,-1e-06,1e-06,-1e-06,2e-06,1e-06,0,-1e-06,0,1e-06,2e-06,0,-1e-06,0,0,-4e-06,0,2e-06,2e-06,-2e-06,-3e-06,1e-06,1e-06,-1e-06,-1e-06,1e-06,-1e-06,-3e-06,0,2e-06,4e-06,-1e-06,-5e-06,3e-06,0,2e-06,0,-2e-06,-1e-06,0,0,1e-06,-1e-06,1e-06,-1e-06,3e-06,-1e-06,1e-06,2e-06,0,-4e-06,-2e-06,0,1e-06,2e-06,-2e-06,-4e-06,1e-06,-2e-06,-2e-06,-3e-06,2e-06,-1e-06,0,-1e-06,-5e-06,3e-06,-1e-06,1e-06,1e-06,-1e-06,-1e-06,0,1e-06,1e-06,-1e-06,-2e-06,-1e-06,0,1e-06
-2e-06,4e-06,3e-06,-2e-06,-2e-06,-2e-06,-1e-06,4e-06,-2e-06,-1e-06,0,0,-1e-06,-1e-06,3e-06,-3e-06,1e-06,0,0,0,1e-06,0,3e-06,-1e-06,-5e-06,4e-06,-1e-06,0,1e-06,-1e-06,1e-06,1e-06,1e-06,1e-06,0,-1e-06,0,4e-06,-1e-06,3e-06,-3e-06,2e-06,-1e-06,-2e-06,0,-3e-06,-1e-06,1e-06,-1e-06,2e-06,2e-06,2e-06,1e-06,0,0,0,-1e-06,2e-06,-1e-06,-2e-06,2e-06,-2e-06,-1e-06,-1e-06,1e-06,1e-06,-2e-06,-1e-06,0,1e-06,0,0,-2e-06,0,-1e-06,2e-06,-2e-06,0,1e-06,0,1e-06,1e-06,-2e-06,0,0,2e-06,1e-06,0,0,0,0,2e-06,1e-06,1e-06,1e-06,0,-1e-06,1e-06,-1e-06,-1e-06,0,-3e-06,0,2e-06,-1e-06,2e-06,-2e-06,0,0,1e-06,3e-06,0,-2e-06,0,1e-06,0,1e-06,2e-06,-1e-06,3e-06,-1e-06
1e-06,-1e-06,0,0,2e-06,-3e-06,0,0,1e-06,1e-06,3e-06,0,-3e-06,2e-06,2e-06,1e-06,2e-06,0,3e-06,-1e-06,3e-06,1e-06,0,-1e-06,-6e-06,0,0,-3e-06,-1e-06,0,1e-06,-2e-06,1e-06,1e-06,-1e-06,-2e-06,-1e-06,3e-06,0,-1e-06,0,1e-06,1e-06,1e-06,2e-06,1e-06,1e-06,0,-1e-06,3e-06,1e-06,0,0,2e-06,0,0,1e-06,2e-06,-1e-06,-1e-06,0,2e-06,-3e-06,-2e-06,3e-06,-1e-06,-3e-06,-1e-06,2e-06,-1e-06,-1e-06,0,-2e-06,3e-06,-3e-06,3e-06,-1e-06,0,4e-06,-1e-06,-1e-06,2e-06,-1e-06,1e-06,0,-1e-06,1e-06,0,2e-06,0,0,2e-06,-2e-06,3e-06,1e-06,0,2e-06,-3e-06,-1e-06,0,1e-06,-2e-06,-3e-06,-1e-06,0,-2e-06,2e-06,-3e-06,0,-1e-06,-3e-06,0,-1e-06,0,1e-06,0,0,-2e-06,1e-06,-1e-06,0
-1e-06,-3e-06,-2e-06,2e-06,1e-06,0,1e-06,0,2e-06,-1e-06,4e-06,1e-06,0,0,0,-1e-06,1e-06,-1e-06,6e-06,-2e-06,1e-06,-2e-06,-2e-06,-1e-06,-4e-06,-2e-06,0,0,-2e-06,-2e-06,0,-2e-06,1e-06,0,0,-1e-06,1e-06,1e-06,1e-06,0,-2e-06,-4e-06,0,-1e-06,0,-3e-06,0,0,-1e-06,0,0,1e-06,0,1e-06,-1e-06,0,1e-06,0,2e-06,1e-06,1e-06,1e-06,-1e-06,-1e-06,1e-06,-1e-06,-2e-06,-3e-06,-1e-06,0,-1e-06,0,-1e-06,0,0,1e-06,0,0,2e-06,-3e-06,1e-06,1e-06,2e-06,0,0,-1e-06,-1e-06,-1e-06,2e-06,-2e-06,1e-06,1e-06,1e-06,-1e-06,2e-06,0,-1e-06,0,-1e-06,0,3e-06,-1e-06,0,1e-06,0,2e-06,-2e-06,-2e-06,0,-1e-06,1e-06,0,-2e-06,0,0,1e-06,0,1e-06,0,1e-06,0
0,0,-2e-06,-1e-06,-2e-06,-2e-06,-1e-06,-1e-06,2e-06,0,2e-06,0,-2e-06,-1e-06,-1e-06,1e-06,1e-06,-1e-06,0,3e-06,-1e-06,2e-06,1e-06,-1e-06,-3e-06,0,0,0,-2e-06,-1e-06,-1e-06,0,1e-06,-1e-06,1e-06,1e-06,-2e-06,0,1e-06,0,-1e-06,0,-1e-06,1e-06,-1e-06,0,0,0,0,-2e-06,2e-06,1e-06,0,-1e-06,2e-06,0,1e-06,0,1e-06,0,0,0,-1e-06,0,0,0,-1e-06,-2e-06,0,0,-2e-06,0,1e-06,-2e-06,-2e-06,-2e-06,-1e-06,0,-1e-06,1e-06,-1e-06,0,0,1e-06,0,-3e-06,0,0,1e-06,-1e-06,-1e-06,-2e-06,-1e-06,0,1e-06,-1e-06,-1e-06,1e-06,1e-06,0,4e-06,0,2e-06,-2e-06,1e-06,1e-06,-2e-06,-1e-06,1e-06,-1e-06,0,0,0,1e-06,1e-06,0,1e-06,0,1e-06,1e-06,0
-1e-06,3e-06,0,-1e-06,-1e-06,0,0,-1e-06,2e-06,1e-06,0,0,-1e-06,2e-06,-1e-06,0,-1e-06,-1e-06,-3e-06,-1e-06,-1e-06,-2e-06,-1e-06,-1e-06,0,1e-06,0,-1e-06,0,-2e-06,0,1e-06,-1e-06,-2e-06,0,1e-06,0,-3e-06,1e-06,0,1e-06,-2e-06,0,0,0,-1e-06,-1e-06,-1e-06,0,-3e-06,0,-1e-06,0,1e-06,-1e-06,0,-1e-06,-1e-06,-1e-06,-2e-06,0,1e-06,0,1e-06,-2e-06,0,1e-06,-1e-06,0,0,0,-1e-06,2e-06,-1e-06,-4e-06,-1e-06,0,0,-2e-06,0,0,-1e-06,-1e-06,1e-06,0,-2e-06,-1e-06,0,0,-1e-06,0,0,1e-06,0,1e-06,0,2e-06,3e-06,1e-06,0,2e-06,1e-06,0,1e-06,0,-3e-06,-1e-06,1e-06,0,0,1e-06,0,-1e-06,0,0,0,0,0,0,-1e-06,0
0,1e-06,2e-06,0,2e-06,-1e-06,0,-1e-06,1e-06,0,-1e-06,0,-1e-06,0,1e-06,0,-1e-06,-1e-06,-4e-06,-3e-06,0,3e-06,1e-06,-1e-06,2e-06,-1e-06,0,1e-06,0,-2e-06,0,-1e-06,-1e-06,1e-06,0,0,0,-3e-06,0,0,1e-06,3e-06,0,0,1e-06,2e-06,0,0,0,-3e-06,-1e-06,0,0,0,1e-06,0,-1e-06,-1e-06,0,1e-06,-1e-06,-2e-06,-1e-06,0,-2e-06,-1e-06,2e-06,-1e-06,1e-06,0,1e-06,1e-06,0,1e-06,-1e-06,-1e-06,1e-06,0,0,-1e-06,0,-2e-06,0,0,0,3e-06,1e-06,0,-2e-06,0,-1e-06,-2e-06,-1e-06,-1e-06,0,0,0,0,-1e-06,-1e-06,1e-06,1e-06,-2e-06,0,1e-06,2e-06,1e-06,2e-06,0,0,-1e-06,0,0,-1e-06,0,0,0,0,0,0,-1e-06
0,-3e-06,3e-06,0,0,0,0,0,0,-1e-06,0,-1e-06,-2e-06,-1e-06,1e-06,0,0,-1e-06,1e-06,1e-06,0,-1e-06,1e-06,-1e-06,4e-06,1e-06,0,0,0,-2e-06,0,-1e-06,-1e-06,0,0,-1e-06,0,-2e-06,0,1e-06,0,0,1e-06,0,0,0,-1e-06,0,0,0,-1e-06,1e-06,0,-1e-06,-1e-06,0,0,0,0,1e-06,1e-06,-1e-06,1e-06,0,0,0,2e-06,1e-06,0,0,0,0,-1e-06,0,-2e-06,0,-2e-06,0,0,0,0,-2e-06,0,1e-06,0,2e-06,0,0,-1e-06,0,1e-06,1e-06,1e-06,0,0,0,-1e-06,1e-06,1e-06,0,-1e-06,0,0,1e-06,0,-1e-06,-1e-06,1e-06,0,0,0,0,-1e-06,-1e-06,0,0,-1e-06,0,-1e-06,0,0
-1e-06,-1e-06,1e-06,0,-1e-06,-1e-06,-1e-06,1e-06,-2e-06,1e-06,1e-06,0,0,1e-06,-1e-06,0,0,0,3e-06,1e-06,1e-06,1e-06,-1e-06,-1e-06,3e-06,1e-06,0,-1e-06,0,-1e-06,0,-1e-06,0,-1e-06,0,-1e-06,-1e-06,-1e-06,-1e-06,-1e-06,1e-06,1e-06,0,0,0,1e-06,0,0,0,1e-06,0,-1e-06,0,0,-1e-06,0,0,0,0,-2e-06,0,1e-06,1e-06,-1e-06,1e-06,0,1e-06,1e-06,-1e-06,0,0,-1e-06,-1e-06,0,-2e-06,1e-06,2e-06,0,-1e-06,-1e-06,0,-2e-06,0,0,0,-1e-06,1e-06,0,-2e-06,0,-1e-06,0,-1e-06,0,-1e-06,1e-06,0,0,-1e-06,0,-2e-06,-1e-06,2e-06,-1e-06,0,0,-2e-06,-1e-06,0,0,1e-06,-1e-06,-1e-06,0,0,0,0,-1e-06,0,0,0
0,2e-06,-1e-06,0,0,0,0,1e-06,-2e-06,0,1e-06,0,-2e-06,-1e-06,-1e-06,-1e-06,1e-06,0,3e-06,-1e-06,1e-06,0,0,-1e-06,3e-06,1e-06,0,2e-06,-1e-06,0,0,1e-06,0,-1e-06,0,0,0,1e-06,-1e-06,0,1e-06,-1e-06,0,0,0,1e-06,0,0,0,2e-06,-1e-06,0,0,0,1e-06,0,0,0,0,0,0,2e-06,1e-06,-1e-06,2e-06,-1e-06,0,0,0,0,-1e-06,1e-06,-1e-06,-2e-06,0,1e-06,0,0,0,-1e-06,0,-1e-06,0,0,0,-1e-06,0,0,-1e-06,1e-06,1e-06,2e-06,1e-06,0,-1e-06,0,1e-06,0,0,0,-2e-06,-2e-06,0,1e-06,0,1e-06,0,-1e-06,0,0,-2e-06,0,-1e-06,0,0,0,0,1e-06,0,-1e-06,0
0,1e-06,-2e-06,0,1e-06,0,0,0,-2e-06,0,0,0,0,-1e-06,0,0,1e-06,0,-1e-06,-1e-06,0,-1e-06,0,-1e-06,1e-06,0,0,-2e-06,-1e-06,1e-06,0,-1e-06,1e-06,2e-06,0,0,0,2e-06,0,0,0,-2e-06,1e-06,0,0,-1e-06,0,0,0,1e-06,0,0,0,0,0,0,0,1e-06,0,1e-06,0,-1e-06,0,0,0,0,-1e-06,1e-06,0,0,-1e-06,-1e-06,0,0,0,0,0,0,0,1e-06,0,0,0,0,0,-1e-06,0,0,-1e-06,0,0,0,-1e-06,0,-1e-06,0,-1e-06,-2e-06,-1e-06,0,-2e-06,-2e-06,-1e-06,0,0,-1e-06,0,-1e-06,0,0,1e-06,0,-1e-06,0,0,0,0,0,0,0,-1e-06
0,-1e-06,-2e-06,0,0,1e-06,-1e-06,-1e-06,-1e-06,-1e-06,-3e-06,0,-2e-06,1e-06,0,0,0,0,-3e-06,1e-06,0,2e-06,1e-06,-1e-06,1e-06,0,0,1e-06,-1e-06,1e-06,0,-1e-06,0,0,0,1e-06,0,2e-06,0,-1e-06,0,0,0,0,0,-1e-06,0,0,0,-1e-06,0,-1e-06,0,0,0,0,-1e-06,1e-06,0,0,0,0,1e-06,0,-1e-06,0,-2e-06,0,-1e-06,0,0,-1e-06,0,1e-06,-1e-06,0,1e-06,0,-1e-06,-1e-06,0,1e-06,0,0,0,-1e-06,-1e-06,0,1e-06,0,0,-1e-06,1e-06,1e-06,-1e-06,0,0,-1e-06,0,0,-1e-06,-2e-06,0,0,0,0,-1e-06,0,0,0,0,0,0,0,0,0,0,0,0,0,0
-1e-06,-2e-06,0,-1e-06,-1e-06,0,0,0,0,0,-2e-06,0,0,-1e-06,0,0,0,0,-2e-06,0,-1e-06,-2e-06,0,-1e-06,-2e-06,0,0,0,0,1e-06,0,-1e-06,0,-1e-06,0,0,-1e-06,2e-06,1e-06,0,-1e-06,-1e-06,0,0,0,-1e-06,0,0,0,-2e-06,1e-06,0,0,0,0,0,-1e-06,0,0,-1e-06,0,0,0,0,-1e-06,-1e-06,-1e-06,0,0,0,0,0,0,1e-06,1e-06,0,-1e-06,0,-1e-06,0,0,1e-06,1e-06,0,0,0,-1e-06,0,0,0,0,-1e-06,-1e-06,0,-1e-06,0,1e-06,0,0,0,0,-1e-06,2e-06,0,0,0,-1e-06,1e-06,0,0,-1e-06,0,-1e-06,0,0,0,0,0,0,1e-06,0
0,2e-06,1e-06,0,0,0,0,0,0,0,-1e-06,0,-1e-06,-1e-06,0,0,-1e-06,0,1e-06,-2e-06,-1e-06,2e-06,-1e-06,-1e-06,-3e-06,-1e-06,0,-1e-06,0,1e-06,0,0,-1e-06,0,0,0,0,0,0,0,-1e-06,3e-06,0,0,0,-1e-06,0,0,0,-2e-06,0,0,0,1e-06,1e-06,0,0,0,0,1e-06,0,-1e-06,0,0,0,0,0,0,0,0,0,0,0,-2e-06,0,-1e-06,0,0,1e-06,1e-06,0,0,0,0,0,0,-1e-06,0,0,0,0,1e-06,1e-06,0,-1e-06,0,-1e-06,-1e-06,0,0,1e-06,0,0,0,0,-1e-06,0,1e-06,0,0,1e-06,0,0,0,0,0,0,0,0,-1e-06,0
0,1e-06,1e-06,0,0,0,0,0,1e-06,-1e-06,1e-06,0,-1e-06,1e-06,0,0,0,0,3e-06,1e-06,0,-2e-06,1e-06,-1e-06,-3e-06,-1e-06,0,0,0,1e-06,0,0,0,1e-06,0,-1e-06,0,-1e-06,0,0,-1e-06,0,0,0,0,0,0,0,0,-1e-06,0,0,0,0,0,0,0,-1e-06,0,0,0,0,-1e-06,0,1e-06,0,1e-06,-1e-06,0,0,1e-06,0,0,-1e-06,-1e-06,0,0,0,1e-06,-1e-06,0,-1e-06,0,0,0,3e-06,0,0,0,1e-06,0,0,-1e-06,0,0,0,0,0,0,0,2e-06,0,-1e-06,0,0,0,0,0,0,0,0,0,-1e-06,0,0,0,0,0,0,1e-06,0
0,-1e-06,0,0,0,0,0,0,2e-06,0,1e-06,0,-1e-06,-1e-06,0,0,0,0,1e-06,1e-06,0,1e-06,0,-1e-06,-2e-06,0,0,0,0,1e-06,0,-1e-06,0,0,0,0,0,-2e-06,0,0,-1e-06,1e-06,0,0,0,1e-06,0,0,0,0,0,0,0,0,0,0,0,-1e-06,0,-1e-06,0,1e-06,0,0,0,0,1e-06,-1e-06,0,0,0,1e-06,0,1e-06,0,1e-06,0,0,0,0,0,-1e-06,0,0,0,-1e-06,0,0,0,0,0,1e-06,0,-1e-06,0,0,1e-06,1e-06,0,0,2e-06,1e-06,0,-1e-06,0,1e-06,-1e-06,0,0,0,0,0,0,0,0,0,0,0,0,0,0
0,-2e-06,-1e-06,0,-1e-06,0,0,0,1e-06,0,0,0,-1e-06,-1e-06,0,0,1e-06,0,-1e-06,-1e-06,0,0,0,-1e-06,-2e-06,0,0,0,-1e-06,0,0,-1e-06,0,-1e-06,0,0,0,-2e-06,0,0,-1e-06,-1e-06,0,0,0,1e-06,0,0,0,1e-06,0,0,0,1e-06,0,0,0,0,0,0,0,0,0,0,-1e-06,0,1e-06,0,0,0,-1e-06,1e-06,0,1e-06,0,0,0,0,0,0,0,-1e-06,0,0,0,-1e-06,0,0,0,0,0,0,-1e-06,0,0,0,0,1e-06,0,0,2e-06,0,2e-06,0,0,-1e-06,-1e-06,0,0,0,0,0,0,0,0,0,0,0,0,0,0
0,0,-2e-06,0,0,0,0,0,1e-06,0,-1e-06,0,0,1e-06,0,0,0,0,-3e-06,-1e-06,0,-1e-06,0,-1e-06,0,0,0,1e-06,-1e-06,0,0,0,0,0,0,0,0,-1e-06,0,0,1e-06,-1e-06,0,0,0,0,0,0,0,1e-06,0,0,0,0,0,0,0,0,0,1e-06,0,-1e-06,0,0,-1e-06,0,0,-1e-06,0,0,0,0,-1e-06,-1e-06,-2e-06,0,0,0,0,-1e-06,0,-1e-06,0,0,0,-2e-06,0,0,-1e-06,0,0,-1e-06,0,0,0,0,-1e-06,0,-1e-06,0,0,0,0,0,0,1e-06,-1e-06,0,0,0,1e-06,0,-1e-06,0,0,0,0,0,0,0,0
0,2e-06,-1e-06,0,1e-06,0,0,0,0,0,0,0,-1e-06,-1e-06,0,0,0,0,-1e-06,1e-06,0,1e-06,0,-1e-06,1e-06,0,0,0,0,-1e-06,0,0,0,1e-06,0,0,0,0,0,0,0,1e-06,0,0,0,0,0,0,0,0,0,0,0,0,0,0,0,0,0,0,0,0,-1e-06,0,0,0,0,0,0,0,0,0,0,-1e-06,-1e-06,0,0,0,0,0,0,0,0,0,0,1e-06,0,0,0,0,0,-1e-06,-1e-06,0,1e-06,0,1e-06,0,0,0,-1e-06,-1e-06,-1e-06,1e-06,0,0,0,0,0,0,0,0,0,0,0,0,0,0,0,0,0
0,0,1e-06,0,0,0,0,0,-2e-06,0,1e-06,0,0,-1e-06,0,0,0,0,1e-06,0,0,-2e-06,0,-1e-06,3e-06,0,0,-1e-06,0,-1e-06,0,0,0,0,0,0,0,1e-06,0,0,1e-06,-1e-06,0,0,0,0,0,0,0,-1e-06,0,0,0,0,-1e-06,0,0,0,0,-1e-06,0,0,1e-06,0,1e-06,0,-1e-06,0,0,0,0,0,0,0,-1e-06,0,1e-06,0,0,0,0,0,0,0,0,0,-1e-06,0,0,0,0,0,0,0,1e-06,0,0,-1e-06,0,0,-2e-06,-1e-06,0,-1e-06,0,-1e-06,-1e-06,0,0,0,-1e-06,0,-1e-06,0,0,0,0,0,0,0,0
