2.4e-05,5e-06,9e-06,3.1e-05,1.8e-05,6e-06,3e-06,2.6e-05,3e-06,1.4e-05,3.7e-05,5e-06,7e-06,5e-06,5e-06,8e-06,9e-06,2e-06,2.4e-05,1.6e-05,3.2e-05,5e-06,3.2e-05,1.1e-05,1.4e-05,1.8e-05,2.7e-05,2e-06,1.3e-05,2e-05,6e-06,2.6e-05,1.1e-05,3.1e-05,1.4e-05,6e-06,2.6e-05,1.8e-05,1.4e-05,6e-06,9e-06,1.8e-05,7e-06,4e-06,1e-05,1e-06,7e-06,1e-06,7e-06,1.1e-05,9e-06,2.6e-05,1.2e-05,1.2e-05,1e-05,1.3e-05,0,2.1e-05,1.6e-05,1.8e-05,1e-06,2.5e-05,1e-05,2e-06,5e-06,3.4e-05,2.9e-05,6e-06,2e-05,1.6e-05,4.2e-05,3.6e-05,1.7e-05,4e-06,1.5e-05,1.6e-05,2e-06,2e-06,2.3e-05,1e-06,1.2e-05,1.2e-05,6e-06,1.7e-05,2.5e-05,2.2e-05,1.2e-05,2.1e-05,6e-06,3.3e-05,1e-06,3.5e-05,2.2e-05,1.3e-05,7e-06,1.1e-05,0,2.3e-05,1e-06,2.3e-05,1.6e-05,9e-06,6e-06,1.8e-05,1.5e-05,1e-06,2e-06,1.1e-05,6e-06,2e-06,0,2e-06,3e-06,4e-06,7e-06,1.8e-05,2.1e-05,1e-05,1.6e-05,4e-06,1.5e-05
4.4e-05,2.8e-05,9e-06,5.8e-05,5.3e-05,1.7e-05,2.7e-05,8.7e-05,5e-05,4.4e-05,8e-05,2.4e-05,2.4e-05,2.1e-05,2e-05,1.8e-05,1.3e-05,1.5e-05,6.2e-05,9.3e-05,4.8e-05,4.7e-05,8e-05,3.8e-05,6.9e-05,7.1e-05,6.9e-05,4.3e-05,2.5e-05,4.5e-05,1e-05,5.4e-05,5.4e-05,1.4e-05,4.3e-05,6.7e-05,2.2e-05,3.4e-05,4.2e-05,4.2e-05,5.4e-05,1.7e-05,1.2e-05,2.4e-05,5.4e-05,4.6e-05,2.7e-05,2.1e-05,4e-05,3.3e-05,3.4e-05,7.4e-05,3.1e-05,1.9e-05,2.8e-05,1.7e-05,3.3e-05,4.6e-05,4.5e-05,3.5e-05,2.8e-05,8.4e-05,3.3e-05,1.7e-05,6e-06,8.4e-05,4.7e-05,4.4e-05,1.2e-05,6.5e-05,7.4e-05,8e-05,2.8e-05,6.5e-05,4.8e-05,4.7e-05,2.5e-05,2.6e-05,5.9e-05,4.6e-05,4.3e-05,4.8e-05,2.6e-05,4.8e-05,7e-05,4.6e-05,1.9e-05,1.6e-05,4e-05,8.5e-05,4.1e-05,5.7e-05,6.1e-05,2.1e-05,6.7e-05,6.8e-05,2.9e-05,5.9e-05,2.2e-05,8.7e-05,4e-05,5.6e-05,2.1e-05,7.2e-05,4.8e-05,2.7e-05,4.9e-05,4.4e-05,2.9e-05,5e-06,2.4e-05,1.5e-05,1.5e-05,3.1e-05,2.1e-05,7.4e-05,6.9e-05,6.7e-05,4.7e-05,3.5e-05,4.1e-05
8.2e-05,4e-05,3.2e-05,7.1e-05,3.7e-05,2.5e-05,3.4e-05,7.6e-05,0.000119,1e-04,1e-04,8.2e-05,2.9e-05,3.7e-05,5.3e-05,4.6e-05,2.4e-05,4e-06,8.2e-05,6.3e-05,7.7e-05,4e-05,9.4e-05,6.2e-05,3.9e-05,4.5e-05,6.3e-05,2.9e-05,3.3e-05,4.1e-05,3.3e-05,5.2e-05,8.2e-05,6.9e-05,2.8e-05,7.3e-05,8.4e-05,5.9e-05,2.7e-05,3.3e-05,3.9e-05,6.1e-05,3.4e-05,4.6e-05,5.8e-05,6.7e-05,1.1e-05,1e-05,0.000102,9.6e-05,1.4e-05,5.2e-05,6.7e-05,8.3e-05,6.3e-05,6.9e-05,5.9e-05,8.1e-05,1.8e-05,5.7e-05,2.9e-05,9.6e-05,5.5e-05,2.7e-05,5.8e-05,0.000107,6.5e-05,1e-04,8e-05,8.3e-05,9.8e-05,7.5e-05,0.000109,0.000134,0.000113,6.9e-05,3.1e-05,4e-05,2.8e-05,5e-05,2.4e-05,1.1e-05,7e-06,7.1e-05,0.000105,0.000111,8.6e-05,4.9e-05,3e-05,6e-05,7.6e-05,9.6e-05,7.4e-05,8.1e-05,4.1e-05,6.4e-05,1.5e-05,3.9e-05,4.4e-05,6.6e-05,5.3e-05,4.8e-05,5.1e-05,9.7e-05,4.8e-05,7.9e-05,4.1e-05,3e-05,7.7e-05,6.6e-05,4.7e-05,3.8e-05,1.8e-05,3.6e-05,5.4e-05,0.000141,0.000118,0.000175,8.5e-05,1e-05,4e-05
4.8e-05,7.4e-05,7e-05,5.5e-05,0.000129,5.6e-05,5.9e-05,8.3e-05,6.2e-05,5.1e-05,7.5e-05,0.000132,0.000104,5e-05,5e-05,5.7e-05,9.6e-05,5.5e-05,0.000136,8.6e-05,1e-04,4.2e-05,0.000143,6.1e-05,9.9e-05,0.000173,0.000115,0.00011,0.000125,0.00013,0.000114,7.4e-05,9.6e-05,5.9e-05,5.6e-05,0.000109,1.3e-05,9.3e-05,0.00014,2.3e-05,4.7e-05,8.5e-05,8.4e-05,1.3e-05,7.6e-05,3e-05,5.6e-05,4.6e-05,0.000153,5.2e-05,6.1e-05,0.000101,9e-05,6.8e-05,7e-05,7.8e-05,7.3e-05,5.5e-05,0.000106,0.000105,0.000148,5.6e-05,3.3e-05,2.4e-05,6.8e-05,0.000191,5.9e-05,2.5e-05,1.2e-05,5.9e-05,0.000166,0.000122,8.2e-05,0.000136,6e-05,2e-05,4.4e-05,5.3e-05,7.8e-05,5.1e-05,6.5e-05,8.7e-05,6.1e-05,8.9e-05,0.000146,0.000117,2.3e-05,3.9e-05,1.3e-05,0.000158,9.4e-05,0.000102,9.2e-05,1.7e-05,4.9e-05,0.00012,5e-05,7.4e-05,7.1e-05,5.6e-05,7e-05,0.000136,0.000152,8.8e-05,5.4e-05,8.2e-05,9.8e-05,9.7e-05,0.000108,0.000104,0.000129,5.6e-05,5.3e-05,8e-06,7.5e-05,0.000183,4.8e-05,7.8e-05,2.9e-05,4.3e-05,2.9e-05
4.5e-05,2.6e-05,5.7e-05,5.9e-05,0.00016,0.000143,0.000126,0.000152,8.7e-05,4.8e-05,7e-05,0.000122,5.2e-05,4e-05,1.4e-05,0.000112,4.2e-05,4.6e-05,0.000126,5.7e-05,5e-06,8.9e-05,0.000159,0.000147,0.000122,0.000141,9e-05,9.8e-05,8.7e-05,9.1e-05,8.8e-05,0.000194,5.6e-05,0.000149,0.000158,0.000116,0.000105,6.6e-05,0.000118,0.000137,7.8e-05,7.6e-05,0.000102,8.7e-05,0.000114,7.8e-05,6.4e-05,5.2e-05,0.000108,8.5e-05,5.7e-05,9.9e-05,3.3e-05,6e-05,6.7e-05,0.000172,0.000126,5.8e-05,0.000118,0.000209,7.8e-05,5.6e-05,7.7e-05,5.7e-05,9.3e-05,0.000191,2.9e-05,1.8e-05,6.5e-05,0.000187,0.000238,0.000252,5.5e-05,1.7e-05,0.000131,0.000141,0.000116,0.000126,7.2e-05,9.7e-05,3.9e-05,7.4e-05,0.000108,8.8e-05,5.7e-05,1e-04,0.000162,0.000157,5e-05,0.00021,0.000127,3.8e-05,4.8e-05,4.1e-05,6.8e-05,6.4e-05,0.000102,9.4e-05,9.7e-05,9.6e-05,0.000128,0.000104,9.5e-05,7.2e-05,7.6e-05,0.000146,7.8e-05,4.3e-05,5.6e-05,7.1e-05,5.4e-05,5.3e-05,0.000143,0.000107,9.1e-05,3.3e-05,0.00012,8.1e-05,2.1e-05,2.6e-05,0.000103
6.2e-05,3.8e-05,7.8e-05,0.000102,0.000129,3.4e-05,2.6e-05,0.000111,8.9e-05,6e-05,1.1e-05,3.1e-05,9.4e-05,3.8e-05,2.6e-05,8.7e-05,0.000121,3.9e-05,6.6e-05,0.000138,5.1e-05,0.000126,7.3e-05,0.000172,0.000107,7.7e-05,2.2e-05,5.1e-05,0.000154,0.000245,8e-05,0.000179,0.00023,0.00017,5.2e-05,0.000129,9.9e-05,0.000189,0.000227,0.000229,0.000136,8.8e-05,3.9e-05,4.1e-05,6.6e-05,5.3e-05,2.8e-05,1.4e-05,0.000109,6.3e-05,8.2e-05,7.5e-05,0.00012,6.7e-05,9.2e-05,8.2e-05,0.000111,0.000143,7.5e-05,0.000262,0.000233,0.000195,0.000234,0.000102,8.1e-05,0.000165,0.000271,0.000115,0.000145,0.00027,0.000104,8.2e-05,0.00013,0.000108,0.000165,5.9e-05,3.4e-05,0.000156,0.000119,9.8e-05,4.2e-05,9.2e-05,2.1e-05,3.3e-05,2.1e-05,0.00011,0.000234,0.000122,0.000117,0.000212,0.000214,0.000175,2e-04,0.000169,3.7e-05,0.000104,0.000147,0.000118,0.000169,0.000191,0.000154,0.000101,7.7e-05,0.000228,0.000213,0.000199,0.000164,5.4e-05,0.000119,0.000116,0.000158,0.000154,8.9e-05,6.2e-05,0.000153,0.000144,0.000152,1.4e-05,5.9e-05,7.6e-05,0.000161
5.7e-05,5.5e-05,0.000126,2.6e-05,1e-04,0.00013,8.1e-05,8.1e-05,5.7e-05,4.2e-05,0.000137,0.000126,0.000101,0.000115,5.5e-05,4.6e-05,0.000106,0.000109,0.000103,0.000117,0.000158,0.00019,9.8e-05,7.4e-05,0.000136,0.000121,6.5e-05,4.1e-05,0.000148,0.000199,0.000155,5.9e-05,0.00012,6.8e-05,9.6e-05,8.6e-05,9.8e-05,0.00022,0.000102,0.000154,6.4e-05,5e-05,3.3e-05,4.5e-05,4e-05,1e-05,8.8e-05,6.9e-05,0.000144,0.000192,0.000225,0.000149,0.000121,4.2e-05,2.8e-05,3.8e-05,0.000104,0.000153,1.3e-05,0.000182,0.00016,0.000268,0.000268,0.00017,3.9e-05,8.6e-05,0.000313,0.000265,2.5e-05,7.6e-05,0.000112,7.4e-05,0.00014,0.00015,0.000145,0.000242,0.000146,0.000176,0.000132,0.000185,0.000233,0.000135,6.4e-05,0.000117,0.00014,0.000186,5.8e-05,0.000237,0.000188,0.00021,8.9e-05,6.2e-05,0.000132,4.3e-05,0.000133,0.000154,5.3e-05,0.00011,0.000179,0.00013,0.000182,0.000119,0.000103,0.000238,0.000157,0.000119,0.000124,8.6e-05,9.4e-05,8.5e-05,3.5e-05,1e-04,0.000191,0.00026,0.000242,8.9e-05,8.9e-05,2.4e-05,9.1e-05,0.000181,7.6e-05
3.7e-05,3.9e-05,5.1e-05,7.3e-05,9.6e-05,5.5e-05,2.7e-05,5.7e-05,2.3e-05,6.2e-05,0.00016,0.000147,0.000107,7.7e-05,5e-05,2.1e-05,6.7e-05,5.3e-05,6.1e-05,3.3e-05,0.000127,8e-05,5e-05,6e-05,0.000151,8.9e-05,6e-05,7.3e-05,4.9e-05,5.8e-05,7e-05,5.3e-05,6.6e-05,0.000109,1.2e-05,0.000141,0.000173,0.000188,8.6e-05,8.9e-05,0.000104,8e-05,5.1e-05,4.6e-05,9.1e-05,9.2e-05,4.2e-05,4.1e-05,4.9e-05,8.4e-05,0.000121,0.000101,6e-05,7.8e-05,0.000131,0.000158,9.2e-05,0.000108,0.000165,0.000143,0.000122,0.000145,9.2e-05,7.7e-05,8.2e-05,2.6e-05,0.000101,5.6e-05,5.9e-05,0.000111,5.1e-05,3.6e-05,0.000114,0.000194,0.000127,0.000174,0.000117,0.000255,9.6e-05,0.000113,0.000163,5.8e-05,9.6e-05,0.000177,7.2e-05,6.4e-05,0.000114,0.000111,0.000161,0.000222,0.000214,3e-05,9.6e-05,1.3e-05,0.000136,0.000107,4.3e-05,0.000134,7.8e-05,6.6e-05,5.5e-05,0.000131,6.4e-05,6.6e-05,4e-05,4.4e-05,8.6e-05,9.9e-05,6.5e-05,4.3e-05,7e-05,5.1e-05,7.6e-05,0.000128,1.5e-05,4e-05,0.000176,9e-06,8.3e-05,9.2e-05,4.4e-05
2.4e-05,1.6e-05,3.6e-05,8.3e-05,1.5e-05,4.7e-05,1.8e-05,1.7e-05,8.3e-05,6e-05,6.6e-05,3.3e-05,8.1e-05,4.2e-05,8e-06,4.1e-05,3e-05,3.9e-05,6e-06,8.3e-05,9e-05,7.1e-05,2.9e-05,1.2e-05,0.000136,6.3e-05,5.2e-05,5.1e-05,6.2e-05,1.8e-05,8.9e-05,0.000112,8.2e-05,6.6e-05,4.6e-05,0.000126,5.8e-05,7e-05,2.7e-05,2.5e-05,8.4e-05,8.6e-05,3.9e-05,7.6e-05,8.4e-05,4e-06,2.7e-05,0.000112,5e-05,1.7e-05,9.4e-05,0.000146,7.1e-05,0.000111,0.000281,4.7e-05,0.000136,4e-05,0.000141,7.9e-05,2.9e-05,0.000154,5e-05,7.8e-05,0.000114,0.00012,8.8e-05,0.000127,0.000108,0.000145,6.4e-05,0.000116,9.7e-05,0.000208,1e-04,2.7e-05,3.2e-05,9.5e-05,6.4e-05,2.8e-05,0.000201,1e-04,0.000115,9.8e-05,0.000114,0.000151,0.000102,0.000297,0.000325,0.000139,0.000216,0.000187,8.3e-05,0.00014,0.000167,6.5e-05,8.6e-05,0.000152,8e-06,0.000124,2.4e-05,0.000163,0.000123,0.000144,9.8e-05,3e-05,0.000176,8e-05,4e-05,5.3e-05,0.000189,0.000109,8.2e-05,0.000115,0.000132,8e-06,0.000257,0.000252,6.9e-05,4.6e-05,5.5e-05
2.5e-05,4.1e-05,7.8e-05,3.8e-05,5.3e-05,1.5e-05,5.3e-05,6.3e-05,6.9e-05,0.000154,0.000119,4.5e-05,9.8e-05,8.9e-05,7.1e-05,9.2e-05,6.7e-05,6.7e-05,1.3e-05,9.1e-05,3.3e-05,6.7e-05,5.2e-05,6.4e-05,0.000101,7.6e-05,4e-05,4.9e-05,5.1e-05,7.7e-05,7.5e-05,0.000131,0.00015,0.000144,0.000101,9.4e-05,7.8e-05,9.5e-05,0.000145,4.6e-05,4e-05,3.7e-05,3.9e-05,0.000118,4.5e-05,2.7e-05,4.6e-05,0.000197,0.000213,0.000172,0.000105,6.7e-05,6e-05,0.000112,0.000185,0.000332,0.000236,0.000185,0.000159,9.4e-05,4.6e-05,0.000269,0.000253,0.00011,9.2e-05,0.00011,0.00022,0.000255,0.000122,0.00014,0.000212,0.000245,8.8e-05,0.000247,0.000118,6.6e-05,9.1e-05,8.6e-05,0.000113,0.000154,8.5e-05,0.000147,7.1e-05,0.000114,0.000239,8e-06,7.1e-05,0.000284,0.000345,7.4e-05,0.000191,0.000104,0.000123,6e-06,7.6e-05,0.000111,0.000101,0.000133,0.000206,9.4e-05,0.000137,0.000237,0.000279,5.7e-05,0.000152,0.000169,0.000173,0.000225,0.000174,7.4e-05,0.000161,7.7e-05,5.8e-05,0.000131,0.000114,7.2e-05,0.000246,0.000279,0.000154,0.000138,9.6e-05
2.6e-05,2.1e-05,4e-05,0.000119,5.2e-05,2.5e-05,6.7e-05,2.9e-05,9.8e-05,3.2e-05,4.5e-05,4.8e-05,4.7e-05,6e-05,7e-06,5.9e-05,2.9e-05,4.8e-05,4.9e-05,5.4e-05,5.5e-05,5.8e-05,6.9e-05,3.4e-05,2.6e-05,4.1e-05,7.7e-05,9e-05,4.6e-05,9.1e-05,3.1e-05,0.000135,9e-06,0.000174,3.4e-05,7.5e-05,7.4e-05,0.000172,0.000172,0.000166,6e-05,2.1e-05,3.8e-05,7.2e-05,6.4e-05,8.3e-05,0.000131,0.000231,0.000185,6.2e-05,3.4e-05,1.6e-05,7.9e-05,1.7e-05,8.7e-05,0.00016,4.5e-05,0.000179,0.000105,6.3e-05,7.2e-05,0.000229,8.5e-05,0.000151,5.9e-05,0.00014,7.9e-05,1e-04,0.000129,0.000215,2e-04,0.000138,0.000215,2.6e-05,3.6e-05,7.7e-05,9.5e-05,0.000232,0.000269,0.000191,8.7e-05,0.000101,0.000121,3e-05,0.000157,0.000147,8.3e-05,0.00022,0.000135,0.000209,0.000103,0.000104,9.6e-05,7.5e-05,7.6e-05,3.5e-05,9.2e-05,8.6e-05,0.000213,0.000164,3.9e-05,8.4e-05,0.000108,0.000195,2.3e-05,4.7e-05,0.00016,1.4e-05,3.6e-05,4e-05,9.4e-05,0.000122,7.1e-05,0.000143,6.9e-05,0.000151,0.000235,4.2e-05,8.2e-05,7.6e-05,9.2e-05
1.8e-05,6.3e-05,4.4e-05,0.000128,5.6e-05,4.5e-05,9.9e-05,4.4e-05,4.9e-05,3.8e-05,1.6e-05,1.2e-05,1.4e-05,5.6e-05,2.3e-05,3.9e-05,4.6e-05,6.4e-05,2.5e-05,8.2e-05,4.3e-05,6.3e-05,3.2e-05,3.1e-05,2.2e-05,4.2e-05,2.3e-05,4.8e-05,4e-05,7.4e-05,4.6e-05,6.7e-05,9.2e-05,0.000152,9.7e-05,3.2e-05,7.1e-05,8.6e-05,2e-05,8.9e-05,8.8e-05,3.6e-05,0.000115,0.000164,0.000198,0.000127,0.000109,0.000164,1.2e-05,6.3e-05,9.7e-05,6.4e-05,4.1e-05,0.000138,0.000123,9.5e-05,0.000116,0.000102,0.000131,0.000106,3.4e-05,0.00014,1.3e-05,0.000123,0.000109,9.9e-05,0.000174,0.000107,7.7e-05,9.1e-05,0.000112,0.000151,9.6e-05,0.000155,7.6e-05,4.7e-05,0.000124,0.000133,0.000148,4.2e-05,0.00013,0.000125,4.2e-05,5.4e-05,4e-05,7.7e-05,1e-04,0.000103,0.00019,4.8e-05,3.7e-05,0.000124,6e-05,0.000169,2.8e-05,8.7e-05,0.000132,0.000133,8.9e-05,0.000107,0.000214,7e-05,5.4e-05,8e-06,0.000109,0.000119,8.9e-05,0.000107,9.4e-05,5.3e-05,5.2e-05,0.000171,4.8e-05,0.00019,1.8e-05,3e-04,0.000183,0.000157,0.000127,9.4e-05,0.000134
1.3e-05,5.5e-05,3e-05,9.2e-05,2.6e-05,6.3e-05,5.9e-05,6e-05,5e-05,3.7e-05,3e-05,3.5e-05,7.2e-05,5.3e-05,2.4e-05,5e-06,1e-05,8.4e-05,3.9e-05,0.000109,0.000112,4.6e-05,4e-05,3.6e-05,7.7e-05,2.9e-05,4.3e-05,1.2e-05,0.000119,8.1e-05,2.2e-05,4.8e-05,6.8e-05,0.000212,0.00016,0.000127,1.6e-05,0.000115,7.6e-05,3.9e-05,5.7e-05,3.8e-05,0.000175,8.4e-05,0.000174,0.000155,9e-05,8.6e-05,6e-05,0.000103,0.000108,3.9e-05,1.4e-05,0.00018,8.3e-05,0.00014,9.1e-05,0.000169,0.000134,9e-05,8.5e-05,9.6e-05,7.1e-05,0.000106,5.7e-05,0.000208,0.000282,0.000201,0.000123,2.3e-05,0.000105,8.4e-05,0.000108,9.7e-05,5.6e-05,0.000189,3e-05,0.000114,0.000312,0.000213,0.000278,0.000142,0.000151,9.2e-05,0.000113,0.000228,0.000194,0.000177,0.000273,0.000249,7.9e-05,0.000141,0.000167,0.00029,0.000241,0.000152,0.000259,0.000378,0.000297,0.000278,0.000507,0.000239,2.7e-05,0.000103,0.000142,0.00011,0.000129,9.9e-05,0.000117,0.00017,0.000158,0.000222,0.000209,0.000262,0.000201,0.000448,0.000401,0.000105,2.6e-05,0.000181,0.000264
6.4e-05,2.2e-05,4.1e-05,6.4e-05,7.2e-05,2.8e-05,9.3e-05,8.9e-05,8.4e-05,5.4e-05,7.8e-05,6.3e-05,6.4e-05,9.7e-05,9.7e-05,6.5e-05,3.2e-05,0.000109,8e-05,3.6e-05,8.4e-05,0.000113,3.9e-05,5.4e-05,0.000119,0.000149,9.7e-05,9.3e-05,0.000165,9.5e-05,3.4e-05,5.7e-05,6.5e-05,0.000142,0.000218,6.6e-05,0.000115,0.000157,5.3e-05,4.5e-05,0.000102,0.000108,0.000131,0.000278,0.000104,0.000201,0.000291,0.000301,0.000167,0.000147,0.000194,0.000195,9.4e-05,9.3e-05,0.000113,0.000297,0.000315,0.000319,0.000343,0.000183,0.000109,0.000254,0.000246,0.000142,0.000112,0.000315,0.000377,0.000192,0.000123,0.000147,0.000141,7.7e-05,4.5e-05,0.000168,0.000125,0.000279,0.000192,0.000122,0.000281,0.000205,0.00025,0.000116,0.000105,0.000152,7.8e-05,0.000369,0.000202,0.000238,0.000129,0.000504,0.000478,0.000428,0.000276,0.000227,0.000218,0.000204,0.000309,0.000497,0.000677,0.000413,0.000143,0.000254,0.000278,0.000288,0.000173,4.3e-05,0.000159,7.4e-05,9.8e-05,6.9e-05,2.8e-05,0.000161,0.000202,0.000281,0.000243,0.000257,0.000211,0.000198,0.00012,0.000182,0.000244
8.1e-05,0.00012,0.000121,0.000111,0.000107,0.000101,5e-05,3.5e-05,3.4e-05,0.000107,6.7e-05,3.2e-05,3.9e-05,5e-05,4.8e-05,2.9e-05,3.6e-05,6.4e-05,3.9e-05,2.6e-05,8.2e-05,0.000122,6.4e-05,7.4e-05,7e-05,0.000121,7.1e-05,7.3e-05,0.000105,8.7e-05,0.000119,9.2e-05,5.3e-05,0.000129,0.000175,0.000165,3.5e-05,3.3e-05,8.9e-05,8.7e-05,0.000173,0.000148,0.00023,0.000226,0.000239,0.000126,0.000114,9.6e-05,0.000162,6.9e-05,0.000153,0.00017,0.00015,0.000109,0.000171,0.00028,0.000146,0.00015,0.000286,0.000363,0.000201,0.000242,0.000266,0.000271,0.00025,0.000402,0.000169,0.000104,5.4e-05,0.000124,0.000135,0.000179,0.000148,8.1e-05,0.000196,6.4e-05,7e-05,0.000114,0.000169,0.000132,7.2e-05,0.000111,3.4e-05,8.3e-05,0.000198,0.000237,0.000146,0.000118,0.000177,0.000352,0.000127,0.00013,3.4e-05,0.000117,1e-04,9.5e-05,0.000132,0.000216,0.000224,8.6e-05,0.000125,0.000114,6.2e-05,1e-04,0.000111,0.000123,0.000203,0.000183,7.1e-05,5.6e-05,2.1e-05,0.000108,6.8e-05,0.000139,3e-05,0.000258,0.000113,4.2e-05,7.1e-05,0.000193,4.3e-05
4.9e-05,8.7e-05,5e-05,5.4e-05,4.6e-05,5.8e-05,6.1e-05,3.9e-05,2.6e-05,9.7e-05,7.7e-05,4.3e-05,3e-05,2.6e-05,1.7e-05,9e-06,2.9e-05,5.7e-05,4.6e-05,2.2e-05,4.2e-05,6.8e-05,6e-05,8.5e-05,0.000108,5.9e-05,8e-05,2.9e-05,4.8e-05,6.6e-05,0.000114,7.5e-05,0.000111,9.2e-05,0.000101,1.5e-05,6.3e-05,3e-05,5.5e-05,8.7e-05,4.9e-05,3.9e-05,8.8e-05,4.1e-05,8.1e-05,1.5e-05,0.000105,0.000138,4e-05,0.000124,4.3e-05,4.3e-05,3.2e-05,0.000127,2.9e-05,0.000106,0.000164,0.000116,0.000111,0.00012,0.00011,2.3e-05,8.8e-05,0.000182,0.000163,7.9e-05,3.8e-05,4.7e-05,6.6e-05,4.1e-05,0.000114,3.8e-05,6.5e-05,6.7e-05,0.000125,0.00013,4.2e-05,5.4e-05,0.000129,8.4e-05,6.8e-05,4.3e-05,5.2e-05,2.5e-05,7.1e-05,6.6e-05,6.8e-05,4.7e-05,0.000103,0.000166,8e-05,5e-05,2e-05,8.2e-05,7.5e-05,6.4e-05,4.1e-05,0.000124,9.3e-05,9.2e-05,0.000143,4.4e-05,7.2e-05,7.4e-05,0.000108,6e-06,9.3e-05,9e-06,1.3e-05,4.2e-05,5.8e-05,3.4e-05,5.2e-05,0.000109,4.2e-05,0.000144,2.8e-05,8.8e-05,0.000154,0.000103,1.4e-05
4.4e-05,5.1e-05,1.9e-05,6.1e-05,8.8e-05,1.1e-05,6.2e-05,5e-06,2.5e-05,6.1e-05,2.2e-05,7e-06,5.6e-05,2.9e-05,2.2e-05,1.8e-05,1.1e-05,4.5e-05,2.5e-05,6.3e-05,2.7e-05,4.7e-05,7.6e-05,4.5e-05,3.1e-05,8.7e-05,6e-05,3.9e-05,4.4e-05,5.3e-05,3.3e-05,3.3e-05,8.7e-05,6.4e-05,8.8e-05,6.3e-05,2e-05,2.7e-05,6.9e-05,4.5e-05,3e-05,4.2e-05,5.1e-05,6.8e-05,3.6e-05,8.3e-05,0.000136,3.9e-05,4.8e-05,9.5e-05,9.4e-05,0.000118,7.2e-05,0.000117,3.3e-05,2.3e-05,8.3e-05,0.000149,9.2e-05,3.4e-05,3e-05,3e-05,4e-05,0.000132,6.9e-05,0.000149,7.8e-05,7.4e-05,8.6e-05,8.5e-05,7.4e-05,6.3e-05,1.3e-05,2e-06,7.2e-05,2.6e-05,5.1e-05,2.5e-05,5.7e-05,6.9e-05,7.5e-05,1.6e-05,3.4e-05,2.1e-05,2e-05,2.6e-05,8.2e-05,0.000102,8.2e-05,0.000123,6.4e-05,5.4e-05,1.9e-05,5.7e-05,3.3e-05,7.6e-05,3.8e-05,0.000119,0.000106,8.3e-05,4.2e-05,3.4e-05,4.6e-05,0.000113,9.2e-05,0.000124,9.2e-05,8.5e-05,2.7e-05,2.6e-05,2.8e-05,5e-05,2.6e-05,2.2e-05,4e-05,8.9e-05,2.8e-05,7.4e-05,8.6e-05,3.3e-05,8.9e-05
8e-05,7.7e-05,3.6e-05,4.8e-05,2.8e-05,2e-05,4.8e-05,4.8e-05,4.3e-05,1.4e-05,4.7e-05,2.3e-05,4.5e-05,1.8e-05,2.3e-05,5e-05,6.6e-05,4.4e-05,5.5e-05,4.6e-05,2.4e-05,2.7e-05,2.5e-05,1.3e-05,5.2e-05,3.5e-05,7e-06,2.6e-05,3.1e-05,3.6e-05,4.5e-05,5.4e-05,4.3e-05,3.1e-05,3.3e-05,3.3e-05,3e-05,3e-05,3.7e-05,2.4e-05,3.8e-05,2.6e-05,2.8e-05,6.2e-05,2.3e-05,6.8e-05,7.1e-05,8.8e-05,8.6e-05,0.000152,6.2e-05,0.000113,5.3e-05,5.1e-05,3.9e-05,7.9e-05,5e-06,0.000125,2.7e-05,5.8e-05,5.3e-05,8.5e-05,2.7e-05,2.7e-05,4.8e-05,0.000122,6e-06,7.2e-05,4.3e-05,4.6e-05,6e-05,7.9e-05,5.5e-05,2.5e-05,1.4e-05,6.9e-05,6.6e-05,5.4e-05,1.4e-05,6.4e-05,9.6e-05,5.3e-05,5.8e-05,5e-06,6.5e-05,1.6e-05,5e-05,7.2e-05,2.5e-05,4.6e-05,4.5e-05,3.8e-05,1.8e-05,5.4e-05,1.6e-05,4.7e-05,0.000116,6.5e-05,0.000124,6.6e-05,9.7e-05,3.4e-05,4.2e-05,5.9e-05,0.000125,8.5e-05,7.8e-05,7.2e-05,5.4e-05,8.1e-05,8.6e-05,2.1e-05,3.4e-05,3.2e-05,3.6e-05,8.5e-05,2.4e-05,5.1e-05,4e-06,7.6e-05,4.6e-05
5.2e-05,2.8e-05,1.9e-05,3.6e-05,4.4e-05,1.4e-05,7e-06,1.5e-05,1.8e-05,2.1e-05,1.9e-05,1.5e-05,9e-06,2.9e-05,8e-06,6.9e-05,5.3e-05,2.9e-05,4.5e-05,7.9e-05,8.3e-05,6.8e-05,4.9e-05,3e-05,6.1e-05,6.3e-05,1.9e-05,2.1e-05,3.8e-05,2.8e-05,2.4e-05,3.2e-05,1.7e-05,1.8e-05,1.5e-05,3.1e-05,5.6e-05,4e-05,3.6e-05,3e-05,6e-05,4e-05,7.1e-05,3.2e-05,5.8e-05,2.6e-05,4.4e-05,7.4e-05,3.1e-05,7e-05,5.4e-05,3.9e-05,4e-05,9e-05,7.1e-05,6.7e-05,7.5e-05,3.5e-05,3e-05,7.6e-05,6.7e-05,2.1e-05,7.6e-05,3.7e-05,8.7e-05,3.6e-05,1.9e-05,6.5e-05,7.8e-05,5.4e-05,4.4e-05,4.9e-05,2.3e-05,1.9e-05,2.6e-05,4.3e-05,4.2e-05,5.1e-05,5.2e-05,4.6e-05,2.5e-05,3.2e-05,3.7e-05,3.6e-05,4.2e-05,4.6e-05,4.6e-05,9.7e-05,1e-04,0.000112,6.6e-05,1.5e-05,2.2e-05,4.6e-05,1.8e-05,3.6e-05,5.4e-05,2.4e-05,4.7e-05,6.8e-05,5e-05,7.5e-05,4.8e-05,2.9e-05,5.9e-05,3.4e-05,4.9e-05,1.1e-05,4.4e-05,6.6e-05,4.1e-05,6.1e-05,1.5e-05,3.3e-05,9e-06,9.5e-05,3.3e-05,4.7e-05,1.9e-05,6.4e-05,3e-05
8e-06,3.1e-05,8e-06,9e-06,2.1e-05,2.3e-05,2e-05,1.9e-05,1.4e-05,1e-06,3e-06,1.7e-05,1.3e-05,1.7e-05,1.9e-05,7.6e-05,2.5e-05,2.4e-05,2.4e-05,1e-05,3.5e-05,2.6e-05,2e-05,1.9e-05,3.4e-05,4.6e-05,3.7e-05,2.2e-05,3.7e-05,1.4e-05,2.4e-05,4.8e-05,1.5e-05,2.1e-05,2e-05,5.4e-05,6e-06,1.8e-05,2.8e-05,3.5e-05,1.7e-05,2.9e-05,1.7e-05,1.7e-05,2.6e-05,2.9e-05,2.5e-05,4.9e-05,1.6e-05,3.9e-05,1.9e-05,1.6e-05,4e-05,5.6e-05,3.1e-05,3.9e-05,4e-05,4.3e-05,3.9e-05,3.1e-05,2.7e-05,9e-06,7.8e-05,6.9e-05,3.1e-05,2.6e-05,3.6e-05,4.9e-05,2e-05,3.7e-05,4.9e-05,6e-05,4.9e-05,2.5e-05,7e-06,2.6e-05,3.4e-05,2.3e-05,3.4e-05,1.7e-05,4.1e-05,3e-06,7e-06,2.7e-05,5.3e-05,9e-05,7.5e-05,4.1e-05,5e-05,7.6e-05,3.4e-05,1.5e-05,2e-05,3.9e-05,3.3e-05,7e-06,5e-05,2.5e-05,2.3e-05,3.9e-05,5.2e-05,4.3e-05,3.7e-05,1.5e-05,4e-05,3e-05,4.3e-05,2.2e-05,3.1e-05,6.4e-05,1.9e-05,5e-05,5.1e-05,6e-05,5.2e-05,4.5e-05,4e-06,2.6e-05,2.4e-05,4.7e-05,3.2e-05
2.2e-05,1.4e-05,1.7e-05,6e-06,8e-06,2.5e-05,7e-06,1.7e-05,7e-06,1e-05,2.9e-05,3.7e-05,4.3e-05,2.6e-05,4.4e-05,2.8e-05,2.8e-05,2.2e-05,4.8e-05,3.2e-05,3e-05,2.3e-05,1.8e-05,2.9e-05,8e-06,1.9e-05,3.9e-05,3.6e-05,5.2e-05,3.9e-05,1.5e-05,5.1e-05,3.2e-05,1.7e-05,1.1e-05,3e-05,5.7e-05,2.3e-05,3.6e-05,2.5e-05,2.9e-05,2.1e-05,2.5e-05,3e-05,4.4e-05,1.6e-05,2.7e-05,4.7e-05,3.2e-05,1.9e-05,3.1e-05,5.3e-05,2.1e-05,5.9e-05,4.9e-05,2.2e-05,1.7e-05,6.6e-05,1.7e-05,4.8e-05,2.4e-05,2e-05,4.5e-05,4.2e-05,2e-05,6e-05,3.7e-05,4.5e-05,3.3e-05,3.6e-05,3.1e-05,1.7e-05,2e-05,2.5e-05,1.5e-05,4.6e-05,3e-05,4.6e-05,2e-05,3e-05,2.1e-05,3.2e-05,2.5e-05,2.5e-05,6.6e-05,4.3e-05,1.9e-05,3.6e-05,8.5e-05,5.1e-05,4.8e-05,1.5e-05,1.1e-05,3.7e-05,1.9e-05,1.6e-05,2.5e-05,6.4e-05,4.7e-05,4.6e-05,3.1e-05,5.6e-05,1.2e-05,2.1e-05,3.6e-05,4.8e-05,7.1e-05,3.7e-05,3.1e-05,6e-06,3.3e-05,3.2e-05,2e-05,4.6e-05,7e-06,4.5e-05,2.8e-05,4e-06,3.3e-05,1.7e-05,2.1e-05
6e-06,2.6e-05,1.3e-05,2.5e-05,2.3e-05,1.1e-05,2e-06,6e-06,4e-06,2.4e-05,4.4e-05,1.1e-05,2.2e-05,2e-06,4.2e-05,3.8e-05,2.2e-05,1.1e-05,4.8e-05,2.3e-05,1.8e-05,2.1e-05,1.7e-05,3.5e-05,2.6e-05,1.7e-05,2.3e-05,4e-06,8e-06,1.5e-05,2.3e-05,1.6e-05,2.7e-05,3.1e-05,1.3e-05,1.9e-05,2.9e-05,2.5e-05,1.8e-05,1.7e-05,5e-06,3.6e-05,2.5e-05,5e-05,5.7e-05,3.2e-05,8e-06,3.9e-05,2.6e-05,5e-06,3.5e-05,3.3e-05,5.2e-05,2.8e-05,5.6e-05,6.2e-05,3.5e-05,5.4e-05,6e-05,3.5e-05,2.2e-05,2.9e-05,3.4e-05,4.2e-05,6.2e-05,5.6e-05,2.1e-05,2e-05,4.2e-05,2.4e-05,1.5e-05,5.6e-05,6.7e-05,4.6e-05,4.7e-05,2.8e-05,3.3e-05,4.1e-05,2.6e-05,2.3e-05,5.2e-05,4.7e-05,3.6e-05,9e-06,8.4e-05,7.5e-05,5.7e-05,2.2e-05,4.7e-05,6.6e-05,5.7e-05,2.8e-05,2.3e-05,8e-06,2.9e-05,1.1e-05,5e-05,6.1e-05,6e-06,3.5e-05,2.5e-05,6.5e-05,5.2e-05,2.7e-05,2.8e-05,3.3e-05,2.2e-05,6.5e-05,2.1e-05,3.2e-05,3.4e-05,5.5e-05,1.1e-05,3.6e-05,3.8e-05,4.3e-05,4.4e-05,2.3e-05,5.6e-05,5.8e-05,8e-06
7e-06,1.8e-05,1.6e-05,3e-06,5e-06,5e-06,8e-06,2e-06,1e-06,1e-05,1.6e-05,2.3e-05,1.9e-05,8e-06,1.4e-05,1.1e-05,7e-06,3e-06,2.3e-05,9e-06,5e-06,6e-06,1.2e-05,1.6e-05,1.5e-05,2.6e-05,2.2e-05,2.3e-05,9e-06,1e-05,1.6e-05,1.5e-05,1.8e-05,2.1e-05,8e-06,8e-06,1.3e-05,1.2e-05,1.8e-05,1.7e-05,1.7e-05,5e-06,2e-05,1.9e-05,2.8e-05,6e-06,9e-06,1.4e-05,6e-06,2.1e-05,4e-06,1e-05,9e-06,3e-05,9e-06,3.3e-05,3.2e-05,2.7e-05,4e-06,2.3e-05,1e-05,1e-05,1.9e-05,4.2e-05,1e-05,3.6e-05,2e-05,1.2e-05,2e-05,1.7e-05,1.2e-05,4.5e-05,9e-06,1.6e-05,2.7e-05,3.6e-05,2e-05,4e-06,1.9e-05,1.7e-05,2.8e-05,4.1e-05,1.3e-05,7e-06,2.7e-05,5e-06,5e-06,2.2e-05,1.7e-05,4.2e-05,3.4e-05,6e-06,1e-05,1.7e-05,2.1e-05,1.8e-05,2.6e-05,2.8e-05,4.3e-05,1.5e-05,2e-06,1.7e-05,1.5e-05,1.4e-05,1.4e-05,7e-06,1.5e-05,2.3e-05,3.2e-05,1.2e-05,9e-06,7e-06,1.2e-05,6e-06,5e-06,2e-05,1.1e-05,1.9e-05,7e-06,1.2e-05,1.5e-05
8e-06,6e-06,1e-05,1.2e-05,7e-06,8e-06,1.5e-05,9e-06,5e-06,4e-06,9e-06,1.4e-05,4e-06,1e-05,1e-05,1.4e-05,8e-06,6e-06,9e-06,7e-06,9e-06,1.3e-05,1.9e-05,1.2e-05,1.5e-05,1.8e-05,1.6e-05,5e-06,1.9e-05,2.6e-05,1.8e-05,1.9e-05,3.1e-05,1.6e-05,8e-06,1.5e-05,1.2e-05,1.1e-05,2.6e-05,1.9e-05,9e-06,1e-05,2e-05,3e-05,1.9e-05,1.4e-05,2.6e-05,1.9e-05,9e-06,2.7e-05,1.8e-05,1.9e-05,4e-06,1.6e-05,2.5e-05,1.8e-05,1.7e-05,3.8e-05,4.5e-05,3.2e-05,1.1e-05,1.9e-05,5e-06,1.7e-05,1.1e-05,3.7e-05,1.2e-05,1.3e-05,2e-05,2.9e-05,1.5e-05,4e-05,3.7e-05,2e-05,3.2e-05,2.7e-05,3.9e-05,2.6e-05,2.4e-05,1.2e-05,3.1e-05,2.2e-05,2.2e-05,7e-06,1.4e-05,2e-05,8e-06,7e-06,2.5e-05,3.9e-05,2.3e-05,1.1e-05,4e-06,2.8e-05,1.1e-05,1.1e-05,1.8e-05,1.4e-05,2.5e-05,2.4e-05,1.2e-05,8e-06,1.8e-05,6e-06,4e-06,5e-06,2e-05,8e-06,1.7e-05,2.7e-05,2.6e-05,9e-06,6e-06,7e-06,2.1e-05,4e-05,1.3e-05,2.7e-05,1.1e-05,3.2e-05,3e-05
4e-06,6e-06,1.1e-05,1e-06,3e-06,4e-06,1e-05,1e-05,6e-06,2e-06,0,1.3e-05,1.8e-05,2e-05,1.9e-05,2.5e-05,1.8e-05,7e-06,9e-06,8e-06,1.3e-05,8e-06,6e-06,1e-05,2e-06,5e-06,2.2e-05,1.4e-05,1.6e-05,1.6e-05,1.3e-05,1.2e-05,2.5e-05,1.8e-05,9e-06,7e-06,1.1e-05,1.1e-05,2.2e-05,9e-06,1.6e-05,1.4e-05,1.1e-05,5e-06,1.5e-05,8e-06,1.2e-05,1.5e-05,4e-06,1.3e-05,2.7e-05,2.4e-05,1.9e-05,1e-05,9e-06,6e-06,2.8e-05,5e-06,2.6e-05,4e-06,3.3e-05,2.6e-05,2.1e-05,5e-06,1.7e-05,2.2e-05,1.5e-05,1e-05,1.6e-05,8e-06,1.1e-05,1.2e-05,1.3e-05,1.2e-05,3.2e-05,1.4e-05,3.9e-05,2.2e-05,4e-06,1.9e-05,5e-06,1.8e-05,2e-06,1e-05,9e-06,1.5e-05,4e-06,9e-06,1.8e-05,1.5e-05,1.3e-05,1.5e-05,1.3e-05,1.7e-05,2e-05,3e-05,1.4e-05,7e-06,2.7e-05,8e-06,1.3e-05,2.6e-05,1.2e-05,3e-06,2.9e-05,1e-05,4e-06,3.3e-05,2.9e-05,9e-06,1.9e-05,1.5e-05,2.7e-05,2e-06,2.5e-05,2.5e-05,2.6e-05,1.8e-05,1.3e-05,3.7e-05,8e-06
2e-06,5e-06,1.2e-05,1e-05,1e-05,3e-06,4e-06,1.1e-05,7e-06,3e-06,6e-06,1.6e-05,4e-06,1.5e-05,5e-06,1.5e-05,1.1e-05,7e-06,1.1e-05,2e-06,8e-06,6e-06,1.1e-05,1e-06,2e-06,6e-06,1.2e-05,8e-06,1e-05,2.4e-05,1.2e-05,2.4e-05,8e-06,4e-06,3e-06,1e-05,3e-06,2e-06,2.3e-05,2.6e-05,9e-06,6e-06,2e-06,1.2e-05,1.7e-05,1.5e-05,2.5e-05,2e-05,3e-06,4e-06,3.8e-05,1.7e-05,2.2e-05,9e-06,2.7e-05,1.2e-05,1.8e-05,8e-06,1.3e-05,1.6e-05,3.6e-05,1.4e-05,8e-06,1.1e-05,1.4e-05,2e-05,2.3e-05,1.3e-05,2.3e-05,1.6e-05,1e-05,7e-06,1e-05,1.3e-05,3.3e-05,2.6e-05,1.5e-05,1e-05,7e-06,2.3e-05,3.3e-05,1.2e-05,6e-06,1.1e-05,1.2e-05,9e-06,1.8e-05,1.1e-05,2.4e-05,2.8e-05,1e-05,1.7e-05,1.1e-05,1e-06,2.6e-05,1.6e-05,1.3e-05,8e-06,2.8e-05,2e-05,2.8e-05,2.5e-05,4e-06,2e-05,3.1e-05,4.1e-05,3.3e-05,5.1e-05,2.9e-05,1.6e-05,1.9e-05,1.9e-05,3.1e-05,3.2e-05,8e-06,9e-06,1e-05,4e-05,2.9e-05,2.2e-05,2.5e-05
4e-06,7e-06,1.1e-05,6e-06,8e-06,1.2e-05,1.3e-05,1.3e-05,1.2e-05,1.1e-05,1.8e-05,4e-06,1.5e-05,3e-06,1.1e-05,1e-05,4e-06,4e-06,8e-06,7e-06,3e-06,1.2e-05,6e-06,8e-06,0,8e-06,8e-06,1.1e-05,1.4e-05,1.3e-05,1.9e-05,1.6e-05,5e-06,8e-06,1e-05,1e-05,6e-06,1.2e-05,2.3e-05,6e-06,2.4e-05,2.4e-05,1.5e-05,7e-06,2.8e-05,3.2e-05,2.6e-05,3e-05,1.8e-05,1.4e-05,2.6e-05,2.3e-05,2.3e-05,7e-06,2.4e-05,2.1e-05,2.2e-05,2e-06,7e-06,1.4e-05,3.1e-05,3.2e-05,1.6e-05,1.4e-05,2.4e-05,2.7e-05,3.1e-05,2.1e-05,2.2e-05,1e-05,8e-06,2.2e-05,1.6e-05,7e-06,2e-05,7e-06,1.3e-05,1.9e-05,1.2e-05,2.7e-05,2.2e-05,2e-06,5e-06,1e-05,3e-06,1.6e-05,6e-06,1e-05,1.8e-05,1.8e-05,2.2e-05,1.9e-05,1.3e-05,2e-05,2.5e-05,3.9e-05,3.2e-05,2.7e-05,2.5e-05,1.4e-05,1.7e-05,2.3e-05,1.2e-05,1.7e-05,1.5e-05,3.7e-05,1.4e-05,2e-05,3e-06,1.2e-05,2.4e-05,3.1e-05,4.8e-05,3.2e-05,1.1e-05,7e-06,9e-06,3.9e-05,3.3e-05,2.3e-05,2e-06
4e-06,1e-05,1.7e-05,1e-05,5e-06,8e-06,7e-06,3e-06,1.2e-05,3e-06,1.4e-05,1.6e-05,4e-06,4e-06,1.6e-05,7e-06,6e-06,1.6e-05,1.2e-05,7e-06,2e-06,1.1e-05,5e-06,9e-06,1.1e-05,6e-06,1.1e-05,1.6e-05,5e-06,1e-05,1.1e-05,2e-05,9e-06,1e-05,4e-06,1.7e-05,2.5e-05,2.6e-05,9e-06,1.9e-05,1.5e-05,1.1e-05,8e-06,8e-06,1e-05,1.3e-05,2.6e-05,4e-06,1.1e-05,2.2e-05,1.6e-05,1e-05,1.5e-05,1.7e-05,1.7e-05,1.8e-05,3.8e-05,1.9e-05,4e-06,1.9e-05,3.8e-05,2e-05,1.4e-05,1.4e-05,1.8e-05,2.1e-05,9e-06,2.2e-05,2e-05,1e-05,4e-06,2.1e-05,1e-05,2.4e-05,1.3e-05,1.2e-05,1e-05,1.7e-05,1.3e-05,2e-05,3.4e-05,3e-05,1.7e-05,9e-06,9e-06,3e-05,1.7e-05,5e-06,1.5e-05,3e-05,9e-06,0,1.7e-05,1.6e-05,3.1e-05,2e-05,9e-06,2e-05,1.9e-05,1.1e-05,1.6e-05,1.8e-05,3e-05,3.1e-05,1.7e-05,9e-06,1.5e-05,1.6e-05,1.1e-05,2.3e-05,1.2e-05,2.1e-05,2.5e-05,4e-06,9e-06,8e-06,7e-06,2.1e-05,1.5e-05,2.8e-05,1.8e-05
7e-06,6e-06,1.7e-05,1.7e-05,5e-06,8e-06,2e-06,3e-06,1.2e-05,1.2e-05,1.2e-05,8e-06,1.5e-05,7e-06,9e-06,1.6e-05,5e-06,1.4e-05,1.1e-05,1e-05,4e-06,9e-06,1.2e-05,4e-06,4e-06,1e-06,1.1e-05,1.3e-05,1.9e-05,6e-06,1.1e-05,1e-06,4e-06,8e-06,7e-06,1.1e-05,2.3e-05,1e-05,9e-06,4e-06,2e-05,3e-06,9e-06,9e-06,1.2e-05,7e-06,2.7e-05,2e-05,1.3e-05,2.1e-05,1.1e-05,5e-06,5e-06,1.2e-05,9e-06,1.1e-05,1.7e-05,5e-06,1.4e-05,3.4e-05,2.1e-05,1.1e-05,1e-05,3e-06,1.2e-05,6e-06,3.3e-05,1.5e-05,9e-06,7e-06,7e-06,4e-06,6e-06,2.6e-05,1.6e-05,1.4e-05,1.9e-05,8e-06,3e-06,2e-05,2e-05,3e-06,2.4e-05,1.9e-05,1.8e-05,2e-05,1.1e-05,6e-06,2.3e-05,3.3e-05,1.5e-05,4e-06,8e-06,1.4e-05,2.1e-05,2.6e-05,2.7e-05,1.1e-05,2.1e-05,1.9e-05,1.9e-05,1.5e-05,1.1e-05,5e-06,1.9e-05,1.3e-05,1.3e-05,3e-05,1.2e-05,1.5e-05,4e-06,2e-05,1.6e-05,1.5e-05,4e-06,1.9e-05,1e-05,1e-05,9e-06,1.6e-05,1.4e-05
3e-06,7e-06,1.1e-05,4e-06,1.4e-05,1e-05,8e-06,5e-06,8e-06,6e-06,5e-06,6e-06,2e-05,7e-06,9e-06,1.5e-05,7e-06,1.1e-05,1e-06,9e-06,9e-06,7e-06,1.2e-05,3e-06,3e-06,5e-06,6e-06,1.5e-05,1.2e-05,1.2e-05,6e-06,1.2e-05,5e-06,8e-06,6e-06,9e-06,2e-06,7e-06,4e-06,5e-06,2.2e-05,1.3e-05,5e-06,1.3e-05,1e-05,1.5e-05,7e-06,9e-06,5e-06,1.1e-05,2.5e-05,1e-05,7e-06,1.5e-05,2e-05,1.4e-05,1.1e-05,3e-06,2.2e-05,1.8e-05,1.6e-05,5e-06,2.3e-05,1.6e-05,1.1e-05,8e-06,2.1e-05,1.2e-05,1.4e-05,9e-06,1.1e-05,6e-06,2e-06,1.3e-05,6e-06,1.4e-05,1.3e-05,2e-05,1.1e-05,1.7e-05,1.1e-05,1.2e-05,2.1e-05,1.8e-05,5e-06,1.1e-05,1.5e-05,6e-06,1.8e-05,3.3e-05,2.9e-05,1.4e-05,3e-06,1.4e-05,3e-06,7e-06,6e-06,2e-05,1.7e-05,8e-06,7e-06,2.5e-05,1.3e-05,1.8e-05,2.2e-05,1.3e-05,3.4e-05,5e-06,1.5e-05,1.3e-05,3e-06,1.4e-05,1.9e-05,2.6e-05,2.1e-05,2.9e-05,9e-06,1.7e-05,6e-06,5e-06,1.6e-05
7e-06,4e-06,7e-06,7e-06,1.8e-05,6e-06,7e-06,1e-05,7e-06,1e-05,4e-06,1e-05,6e-06,4e-06,1.2e-05,4e-06,5e-06,6e-06,7e-06,1e-05,1.4e-05,7e-06,5e-06,7e-06,1e-05,1.1e-05,1e-05,2e-06,1.4e-05,7e-06,3e-06,1.1e-05,7e-06,5e-06,4e-06,1.4e-05,1.4e-05,5e-06,1.1e-05,8e-06,1.7e-05,5e-06,9e-06,8e-06,2.4e-05,6e-06,6e-06,2e-05,1.4e-05,1.3e-05,1.7e-05,1.9e-05,1.6e-05,2e-05,1e-05,1.3e-05,2.6e-05,7e-06,1.7e-05,1.4e-05,1.3e-05,1.2e-05,2.4e-05,2.4e-05,1.3e-05,1.4e-05,2.5e-05,1.3e-05,1.1e-05,1e-05,1.6e-05,1.4e-05,6e-06,1.4e-05,6e-06,1.1e-05,4e-06,6e-06,9e-06,3e-06,2.6e-05,1.1e-05,1.9e-05,1e-05,1.3e-05,8e-06,1.2e-05,9e-06,9e-06,5e-06,5e-06,1.2e-05,8e-06,7e-06,8e-06,1e-06,4e-06,2.1e-05,1.3e-05,6e-06,6e-06,2e-05,1.3e-05,1.4e-05,1.6e-05,1.1e-05,3.3e-05,2e-05,2.5e-05,9e-06,1.2e-05,7e-06,4e-06,1.8e-05,1.1e-05,1.8e-05,2.1e-05,2e-05,7e-06,1.4e-05,1.2e-05
6e-06,7e-06,8e-06,3e-06,1.4e-05,1.3e-05,3e-06,1.2e-05,9e-06,5e-06,7e-06,7e-06,7e-06,0,7e-06,7e-06,6e-06,2e-06,1e-06,1e-05,3e-06,4e-06,1e-06,8e-06,5e-06,7e-06,5e-06,2e-06,8e-06,2e-06,2e-06,6e-06,5e-06,1e-06,7e-06,1.1e-05,2e-06,1e-05,5e-06,1.4e-05,5e-06,2e-06,1e-05,3e-06,1.8e-05,1.6e-05,9e-06,1.1e-05,2e-06,1.7e-05,1.1e-05,1.1e-05,8e-06,1.1e-05,1.6e-05,1e-05,1.4e-05,1.1e-05,1e-05,1e-05,2.6e-05,3e-05,4e-06,1.7e-05,2.3e-05,1.7e-05,2.5e-05,1.5e-05,8e-06,6e-06,1e-05,1.2e-05,3e-06,2e-05,1.7e-05,2.2e-05,1e-05,1.1e-05,1.7e-05,1.3e-05,2.9e-05,3.1e-05,3.7e-05,1.8e-05,3.2e-05,1.3e-05,1.9e-05,8e-06,1.7e-05,2.1e-05,1.4e-05,2e-05,1.3e-05,1e-05,1.9e-05,1.5e-05,3e-06,1.2e-05,2.2e-05,6e-06,1e-06,2.2e-05,2.1e-05,2.1e-05,2.5e-05,1.4e-05,2e-05,2.1e-05,1.3e-05,2e-05,1.1e-05,1e-05,6e-06,1.6e-05,2.8e-05,5e-06,1.9e-05,1.7e-05,2e-05,6e-06,1e-05
5e-06,3e-06,4e-06,5e-06,8e-06,5e-06,7e-06,7e-06,4e-06,3e-06,1e-05,8e-06,7e-06,1e-06,4e-06,7e-06,7e-06,7e-06,5e-06,5e-06,1e-06,7e-06,8e-06,7e-06,1.4e-05,8e-06,8e-06,7e-06,9e-06,6e-06,3e-06,1e-05,3e-06,5e-06,5e-06,7e-06,7e-06,8e-06,8e-06,1e-05,1e-05,4e-06,9e-06,9e-06,4e-06,8e-06,2e-06,1e-06,2e-06,1.1e-05,1e-05,6e-06,1e-06,9e-06,1.6e-05,1.8e-05,1e-05,4e-06,8e-06,4e-06,1.4e-05,1.7e-05,1.8e-05,1.7e-05,1.8e-05,9e-06,2e-05,2.5e-05,1.3e-05,1e-06,1.9e-05,6e-06,1e-05,2.6e-05,2.1e-05,8e-06,1.7e-05,1.5e-05,2.1e-05,1.7e-05,1.8e-05,1e-06,1.9e-05,7e-06,2.8e-05,2.2e-05,2e-05,8e-06,1.7e-05,1.4e-05,1.2e-05,1.1e-05,1.2e-05,6e-06,1.2e-05,7e-06,9e-06,4e-06,2e-06,1.2e-05,6e-06,2e-05,3e-06,1.8e-05,1.2e-05,1.3e-05,2.3e-05,3.3e-05,2.7e-05,2.1e-05,7e-06,9e-06,8e-06,9e-06,1.2e-05,2.3e-05,8e-06,1.1e-05,4e-06,1.3e-05,1e-06
4e-06,3e-06,3e-06,2e-06,3e-06,3e-06,5e-06,3e-06,4e-06,7e-06,9e-06,5e-06,1.5e-05,6e-06,5e-06,7e-06,3e-06,5e-06,3e-06,7e-06,4e-06,6e-06,3e-06,6e-06,1.1e-05,3e-06,5e-06,9e-06,3e-06,1e-06,9e-06,1e-05,8e-06,4e-06,9e-06,1.1e-05,5e-06,2e-06,6e-06,4e-06,1.6e-05,3e-06,7e-06,9e-06,1.1e-05,5e-06,3e-06,3e-06,6e-06,1.1e-05,4e-06,6e-06,2e-06,1.4e-05,1.3e-05,1.3e-05,4e-06,1.1e-05,1.3e-05,8e-06,5e-06,6e-06,6e-06,2.1e-05,1.2e-05,1.6e-05,8e-06,1e-05,6e-06,1.2e-05,1.8e-05,1.4e-05,7e-06,1.6e-05,8e-06,1e-06,1.4e-05,9e-06,1e-05,1.1e-05,8e-06,7e-06,1.2e-05,1e-05,1e-05,1.4e-05,1.4e-05,1.4e-05,1.6e-05,5e-06,1.7e-05,9e-06,1e-05,1e-05,6e-06,2e-06,1.2e-05,8e-06,3e-06,9e-06,1.7e-05,1.6e-05,2.1e-05,6e-06,1.1e-05,8e-06,6e-06,1.1e-05,6e-06,4e-06,9e-06,8e-06,1.7e-05,2.3e-05,1.5e-05,2.3e-05,6e-06,8e-06,9e-06,1.7e-05,1.9e-05
4e-06,6e-06,1e-06,3e-06,6e-06,4e-06,2e-06,1e-06,7e-06,3e-06,7e-06,8e-06,1.5e-05,6e-06,3e-06,3e-06,6e-06,2e-06,5e-06,2e-06,8e-06,2e-06,1.4e-05,7e-06,1.1e-05,9e-06,2e-06,1.1e-05,9e-06,8e-06,7e-06,7e-06,1.4e-05,6e-06,8e-06,4e-06,9e-06,1e-06,7e-06,3e-06,1.2e-05,1e-05,1.1e-05,1.2e-05,4e-06,8e-06,5e-06,6e-06,3e-06,1.2e-05,1e-05,1e-05,5e-06,1.2e-05,2.2e-05,8e-06,5e-06,8e-06,5e-06,7e-06,5e-06,2e-06,4e-06,1.3e-05,7e-06,6e-06,1.3e-05,9e-06,8e-06,1.4e-05,1e-05,1.1e-05,9e-06,6e-06,6e-06,1.8e-05,1.7e-05,1e-05,1.6e-05,5e-06,1.2e-05,1.8e-05,1.7e-05,7e-06,4e-06,1.6e-05,9e-06,5e-06,6e-06,1e-05,1.5e-05,1.9e-05,1.4e-05,4e-06,1.3e-05,1.3e-05,1.9e-05,1.4e-05,1.8e-05,1.6e-05,1.7e-05,1.2e-05,1.7e-05,1.4e-05,1.3e-05,1.4e-05,1.6e-05,6e-06,1.6e-05,5e-06,6e-06,1e-05,1.3e-05,1.6e-05,7e-06,1.5e-05,4e-06,5e-06,8e-06,1.6e-05,7e-06
3e-06,4e-06,3e-06,2e-06,4e-06,5e-06,4e-06,9e-06,8e-06,4e-06,2e-06,6e-06,8e-06,1e-06,3e-06,3e-06,6e-06,8e-06,6e-06,9e-06,5e-06,7e-06,1.5e-05,8e-06,7e-06,5e-06,4e-06,5e-06,4e-06,8e-06,3e-06,7e-06,1e-05,7e-06,7e-06,5e-06,5e-06,1.1e-05,4e-06,6e-06,2e-06,3e-06,7e-06,1.1e-05,7e-06,8e-06,3e-06,3e-06,1e-06,1e-05,1.1e-05,7e-06,2e-06,1.2e-05,8e-06,3e-06,2e-06,9e-06,8e-06,1.1e-05,4e-06,5e-06,3e-06,6e-06,1e-05,1.5e-05,3e-06,8e-06,1.1e-05,4e-06,1.5e-05,1e-05,4e-06,3e-06,9e-06,1.7e-05,2e-06,1.1e-05,9e-06,7e-06,4e-06,1e-05,4e-06,6e-06,1e-05,1e-05,1.1e-05,1.4e-05,9e-06,9e-06,9e-06,6e-06,1.2e-05,8e-06,1e-05,8e-06,5e-06,6e-06,1.1e-05,2e-06,5e-06,7e-06,1.5e-05,2e-06,9e-06,2e-05,1.3e-05,1e-05,1.5e-05,1.2e-05,7e-06,7e-06,7e-06,8e-06,8e-06,2.1e-05,1e-05,3e-06,1.1e-05,4e-06,7e-06
5e-06,9e-06,7e-06,7e-06,8e-06,1.4e-05,1.3e-05,5e-06,9e-06,6e-06,3e-06,6e-06,1.3e-05,6e-06,5e-06,2e-06,3e-06,9e-06,1.2e-05,1.4e-05,8e-06,9e-06,1.1e-05,6e-06,1.2e-05,9e-06,7e-06,8e-06,5e-06,1e-05,1.1e-05,7e-06,8e-06,1.2e-05,7e-06,7e-06,1e-05,1.6e-05,1e-05,5e-06,1.6e-05,1.2e-05,1.8e-05,2.9e-05,1.5e-05,1.6e-05,1.1e-05,1.3e-05,1.5e-05,1e-05,2.1e-05,2.6e-05,2e-05,1.7e-05,2.2e-05,3e-06,2e-06,1.9e-05,9e-06,2.2e-05,2.4e-05,1.6e-05,8e-06,4e-06,6e-06,1.7e-05,2.8e-05,1.4e-05,1.7e-05,1.8e-05,2.8e-05,2.3e-05,1.2e-05,9e-06,7e-06,3e-06,1.2e-05,1.6e-05,7e-06,5e-06,9e-06,7e-06,2e-06,8e-06,1.3e-05,9e-06,1e-05,3e-06,5e-06,9e-06,1.3e-05,2e-06,1.1e-05,8e-06,8e-06,3e-06,7e-06,6e-06,1e-05,2e-06,8e-06,8e-06,2.3e-05,1.9e-05,1.4e-05,1e-05,6e-06,7e-06,6e-06,6e-06,5e-06,1.1e-05,1.7e-05,6e-06,3e-06,2e-05,1.5e-05,1e-05,1.4e-05,1.7e-05,8e-06
4e-06,5e-06,4e-06,3e-06,3e-06,9e-06,1e-05,1.3e-05,1.4e-05,1.2e-05,1.1e-05,1.5e-05,1.7e-05,1.4e-05,1.1e-05,1.2e-05,1.4e-05,6e-06,5e-06,1.7e-05,1.5e-05,1.1e-05,6e-06,5e-06,8e-06,1e-05,4e-06,6e-06,4e-06,1.3e-05,1.2e-05,6e-06,8e-06,1.5e-05,1.6e-05,1.5e-05,7e-06,6e-06,6e-06,1.1e-05,2e-05,1.6e-05,1.4e-05,1e-05,9e-06,2.1e-05,2.2e-05,2.1e-05,4e-06,5e-06,9e-06,1e-05,9e-06,7e-06,1.8e-05,2.2e-05,1.6e-05,8e-06,1.9e-05,1.2e-05,1.8e-05,1.9e-05,1.2e-05,1e-05,1.1e-05,6e-06,2.1e-05,1.5e-05,2.7e-05,1.4e-05,1.4e-05,5e-06,5e-06,3e-06,7e-06,4e-06,6e-06,4e-06,9e-06,6e-06,8e-06,5e-06,4e-06,8e-06,6e-06,5e-06,2e-06,5e-06,7e-06,1.4e-05,1.2e-05,7e-06,4e-06,1.1e-05,1e-05,4e-06,1e-05,6e-06,3e-06,8e-06,1e-05,1e-05,6e-06,5e-06,1.5e-05,8e-06,6e-06,5e-06,9e-06,8e-06,3e-06,4e-06,1e-05,5e-06,8e-06,2e-05,1e-05,8e-06,1.2e-05,1.2e-05,8e-06
2e-06,7e-06,2e-06,3e-06,2e-06,8e-06,5e-06,2e-06,6e-06,3e-06,3e-06,7e-06,3e-06,2e-06,5e-06,9e-06,5e-06,5e-06,3e-06,6e-06,6e-06,4e-06,2e-06,5e-06,2e-06,5e-06,0,6e-06,3e-06,7e-06,4e-06,7e-06,7e-06,1.1e-05,6e-06,7e-06,2e-06,8e-06,6e-06,6e-06,8e-06,5e-06,8e-06,5e-06,1.1e-05,1.4e-05,8e-06,9e-06,2e-06,6e-06,6e-06,3e-06,5e-06,1e-06,5e-06,1e-05,6e-06,4e-06,1e-05,7e-06,5e-06,6e-06,3e-06,1.1e-05,7e-06,3e-06,1.3e-05,5e-06,1.5e-05,4e-06,7e-06,3e-06,2e-06,4e-06,5e-06,4e-06,5e-06,5e-06,5e-06,3e-06,6e-06,3e-06,2e-06,3e-06,7e-06,5e-06,4e-06,4e-06,9e-06,9e-06,5e-06,5e-06,5e-06,1.3e-05,4e-06,4e-06,2e-06,3e-06,9e-06,3e-06,8e-06,6e-06,4e-06,1.1e-05,6e-06,6e-06,5e-06,2e-06,9e-06,6e-06,6e-06,8e-06,7e-06,4e-06,6e-06,9e-06,4e-06,4e-06,2e-06,4e-06,6e-06
1e-06,7e-06,1e-06,2e-06,2e-06,4e-06,1e-06,2e-06,2e-06,2e-06,2e-06,5e-06,2e-06,1e-06,2e-06,5e-06,4e-06,1e-06,1e-06,7e-06,5e-06,3e-06,1e-06,2e-06,2e-06,3e-06,1e-06,5e-06,3e-06,3e-06,3e-06,5e-06,5e-06,8e-06,2e-06,6e-06,2e-06,7e-06,5e-06,1e-06,8e-06,5e-06,8e-06,3e-06,6e-06,6e-06,7e-06,7e-06,1e-06,7e-06,1e-06,3e-06,1e-06,3e-06,8e-06,5e-06,1e-05,1e-06,1.1e-05,7e-06,3e-06,4e-06,2e-06,9e-06,8e-06,3e-06,8e-06,1e-06,1.1e-05,4e-06,3e-06,3e-06,4e-06,0,8e-06,2e-06,3e-06,5e-06,6e-06,2e-06,6e-06,1e-06,1e-06,0,8e-06,1e-06,1e-06,2e-06,5e-06,1.1e-05,1e-06,2e-06,3e-06,7e-06,5e-06,3e-06,6e-06,1e-06,7e-06,5e-06,6e-06,8e-06,4e-06,1e-05,7e-06,4e-06,4e-06,5e-06,6e-06,7e-06,1e-06,5e-06,6e-06,2e-06,8e-06,1.2e-05,4e-06,2e-06,3e-06,3e-06,1e-06
1e-06,6e-06,1e-06,2e-06,1e-06,4e-06,0,2e-06,1e-06,3e-06,1e-06,4e-06,3e-06,1e-06,2e-06,5e-06,2e-06,2e-06,2e-06,6e-06,5e-06,2e-06,1e-06,1e-06,2e-06,2e-06,1e-06,4e-06,4e-06,1e-06,2e-06,5e-06,6e-06,6e-06,2e-06,4e-06,1e-06,4e-06,5e-06,1e-06,7e-06,5e-06,8e-06,2e-06,6e-06,7e-06,6e-06,6e-06,2e-06,4e-06,2e-06,2e-06,1e-06,3e-06,8e-06,5e-06,8e-06,1e-06,1.1e-05,4e-06,1e-06,1e-06,3e-06,8e-06,7e-06,2e-06,7e-06,0,9e-06,4e-06,4e-06,3e-06,3e-06,4e-06,7e-06,4e-06,2e-06,7e-06,6e-06,2e-06,6e-06,2e-06,1e-06,0,6e-06,0,2e-06,3e-06,6e-06,1.2e-05,0,1e-06,5e-06,7e-06,3e-06,0,6e-06,2e-06,9e-06,5e-06,3e-06,7e-06,2e-06,1.1e-05,6e-06,6e-06,4e-06,4e-06,5e-06,6e-06,2e-06,2e-06,5e-06,1e-06,6e-06,9e-06,3e-06,1e-06,3e-06,0,3e-06
0,6e-06,1e-06,2e-06,1e-06,3e-06,1e-06,2e-06,1e-06,3e-06,1e-06,5e-06,3e-06,1e-06,2e-06,5e-06,1e-06,2e-06,2e-06,5e-06,4e-06,2e-06,2e-06,1e-06,3e-06,3e-06,0,4e-06,3e-06,2e-06,3e-06,5e-06,4e-06,7e-06,1e-06,4e-06,1e-06,4e-06,6e-06,0,7e-06,4e-06,8e-06,2e-06,6e-06,6e-06,4e-06,6e-06,2e-06,5e-06,1e-06,1e-06,1e-06,4e-06,7e-06,5e-06,8e-06,1e-06,1.1e-05,3e-06,1e-06,1e-06,2e-06,7e-06,6e-06,3e-06,7e-06,0,9e-06,4e-06,2e-06,3e-06,2e-06,2e-06,7e-06,3e-06,2e-06,6e-06,6e-06,3e-06,3e-06,3e-06,1e-06,0,6e-06,2e-06,1e-06,3e-06,4e-06,1e-05,1e-06,2e-06,6e-06,6e-06,4e-06,1e-06,7e-06,1e-06,9e-06,3e-06,3e-06,8e-06,2e-06,9e-06,5e-06,5e-06,5e-06,6e-06,4e-06,6e-06,1e-06,2e-06,4e-06,1e-06,4e-06,9e-06,3e-06,1e-06,2e-06,3e-06,2e-06
