0.109592,0.11446,0.101378,0.097957,0.084021,0.075882,0.085931,0.084386,0.079242,0.074483,0.066894,0.073462,0.086353,0.080424,0.080978,0.086388,0.078678,0.068252,0.07527,0.080632,0.072478,0.064439,0.056584,0.052935,0.051828,0.057034,0.060493,0.055307
0.132877,0.139661,0.123723,0.117754,0.100808,0.090038,0.100179,0.099184,0.094715,0.090226,0.081173,0.088443,0.104685,0.096807,0.094871,0.101053,0.092822,0.081408,0.091678,0.098669,0.086095,0.075144,0.067465,0.064273,0.06414,0.070766,0.073939,0.066934
0.165765,0.176046,0.157281,0.146229,0.125899,0.111952,0.120309,0.120892,0.117645,0.112471,0.101616,0.109683,0.130985,0.120907,0.113321,0.119345,0.112075,0.100551,0.115326,0.124815,0.104558,0.089061,0.083614,0.081772,0.083234,0.091513,0.093736,0.084557
0.171281,0.183057,0.16815,0.154184,0.136633,0.123927,0.12669,0.129762,0.127444,0.119088,0.108572,0.115457,0.137235,0.129722,0.117352,0.120692,0.11845,0.109174,0.122364,0.131595,0.108043,0.090929,0.089024,0.089101,0.09147,0.099266,0.101038,0.093815
0.149305,0.157457,0.153006,0.145906,0.136845,0.12749,0.124825,0.12884,0.125586,0.113042,0.103818,0.10862,0.12758,0.126989,0.11488,0.116499,0.117837,0.10885,0.113199,0.118608,0.101129,0.0866,0.086508,0.086981,0.087656,0.09504,0.100965,0.101046
0.144843,0.139673,0.143358,0.15281,0.148539,0.137788,0.137028,0.140032,0.132146,0.120708,0.115924,0.121167,0.13864,0.145206,0.136841,0.135662,0.130364,0.117781,0.111026,0.111126,0.107375,0.097517,0.095997,0.093359,0.089617,0.097722,0.112587,0.12063
0.180435,0.166111,0.173699,0.191718,0.182851,0.174277,0.183467,0.180753,0.171449,0.170849,0.169949,0.169657,0.184156,0.197876,0.195271,0.188485,0.169776,0.150046,0.13862,0.144389,0.154439,0.141173,0.132409,0.124851,0.114153,0.122914,0.153386,0.170382
0.269181,0.236715,0.250091,0.271786,0.2499,0.261364,0.288318,0.263525,0.253563,0.277384,0.280808,0.257848,0.257244,0.285488,0.306191,0.290308,0.242576,0.209796,0.202452,0.236108,0.266581,0.234065,0.202737,0.187586,0.172415,0.180687,0.232635,0.263026
0.439924,0.365011,0.391901,0.418785,0.372617,0.423422,0.479541,0.418629,0.405554,0.467993,0.480337,0.415324,0.393824,0.457009,0.518479,0.482679,0.37513,0.313165,0.314704,0.405218,0.474258,0.399192,0.32494,0.302971,0.286873,0.291089,0.363011,0.415217
0.695996,0.548952,0.592837,0.632194,0.559459,0.665358,0.75612,0.656446,0.640433,0.742629,0.760339,0.638522,0.595957,0.717762,0.839082,0.767579,0.566882,0.462352,0.474802,0.649623,0.781573,0.637865,0.498214,0.474922,0.460958,0.45134,0.528584,0.626992
0.984451,0.739826,0.794903,0.869225,0.774149,0.925559,1.049458,0.917821,0.887761,1.013712,1.0323,0.857906,0.799286,0.993534,1.194059,1.070847,0.759436,0.614995,0.632092,0.898275,1.114032,0.898106,0.686032,0.670168,0.657337,0.616168,0.674341,0.840522
1.168768,0.841662,0.88532,1.008288,0.91138,1.066695,1.207161,1.069278,1.010732,1.123777,1.137825,0.951816,0.899185,1.143251,1.403543,1.241439,0.867685,0.706057,0.709017,1.017953,1.299742,1.070394,0.821394,0.806123,0.784279,0.704223,0.732619,0.956043
1.109985,0.789493,0.796587,0.92649,0.847684,0.95346,1.08114,0.982369,0.908268,0.971896,0.978294,0.843696,0.828052,1.055002,1.288742,1.129929,0.80814,0.683433,0.660054,0.906101,1.180623,1.02326,0.802859,0.772538,0.73419,0.637548,0.646237,0.874172
0.828765,0.629109,0.596774,0.670973,0.609787,0.636206,0.722108,0.68182,0.643721,0.6763,0.670686,0.604861,0.621463,0.768197,0.896932,0.799177,0.613463,0.542657,0.517191,0.645469,0.827648,0.763715,0.618317,0.569354,0.522047,0.451982,0.458303,0.622513
0.579672,0.50351,0.4699,0.507855,0.433296,0.376767,0.419613,0.411301,0.415983,0.450463,0.438463,0.412774,0.431189,0.489402,0.549521,0.559439,0.470133,0.404998,0.42089,0.46166,0.506029,0.48832,0.434102,0.399107,0.357243,0.322932,0.329156,0.384883
0.633958,0.566354,0.525864,0.585224,0.478523,0.340756,0.35641,0.355798,0.356053,0.388527,0.389676,0.404144,0.439721,0.476019,0.530438,0.586703,0.517952,0.437455,0.463699,0.45204,0.42807,0.42321,0.426681,0.422787,0.364384,0.34322,0.368592,0.341122
0.813975,0.725487,0.69758,0.795396,0.665253,0.450212,0.423664,0.425678,0.435824,0.471524,0.468827,0.533286,0.62112,0.635329,0.66168,0.740692,0.690347,0.593445,0.608011,0.583576,0.552685,0.542471,0.537703,0.550131,0.482582,0.469493,0.52965,0.459859
0.936789,0.859737,0.894392,1.046193,0.89514,0.604043,0.536137,0.566695,0.622716,0.648926,0.588906,0.668431,0.827714,0.835997,0.799461,0.885895,0.868339,0.767425,0.788575,0.771742,0.726397,0.681148,0.637187,0.657932,0.609591,0.632038,0.71281,0.584827
1.009923,0.951971,1.03842,1.266717,1.113251,0.730865,0.639173,0.725857,0.84259,0.858706,0.708497,0.762561,0.991027,1.0264,0.92618,1.010954,1.009793,0.915339,0.96645,0.936291,0.879366,0.771773,0.651577,0.679868,0.678142,0.759056,0.828202,0.645623
1.128108,1.058228,1.107729,1.354666,1.197425,0.744747,0.657135,0.822076,1.005439,1.028989,0.814846,0.83417,1.074315,1.13945,1.01905,1.088065,1.079108,0.997401,1.060879,0.985206,0.951987,0.800172,0.595274,0.622063,0.682389,0.805739,0.817965,0.629992
1.190757,1.048444,1.066107,1.31083,1.118012,0.649827,0.580682,0.798799,1.004633,1.050044,0.86125,0.840521,1.001643,1.076667,1.04529,1.089732,1.047847,1.021915,1.070172,0.956491,0.967681,0.814237,0.5585,0.544824,0.604528,0.708624,0.698268,0.577337
1.059375,0.85386,0.873417,1.079263,0.927655,0.573394,0.52492,0.710361,0.819084,0.874293,0.811032,0.770367,0.823932,0.869729,0.961055,0.978654,0.874311,0.964842,1.016913,0.857381,0.856086,0.731105,0.512158,0.458207,0.45579,0.487442,0.493523,0.497873
0.848326,0.635947,0.651356,0.78289,0.750177,0.552198,0.502368,0.612306,0.606636,0.678048,0.729592,0.660965,0.657377,0.688259,0.81946,0.801924,0.646887,0.78513,0.852908,0.685333,0.618258,0.532553,0.427099,0.366347,0.312834,0.315875,0.352021,0.43667
0.842226,0.665058,0.61921,0.665258,0.702766,0.577855,0.534716,0.610448,0.575189,0.635556,0.682013,0.585257,0.596437,0.644758,0.70046,0.64471,0.575202,0.679523,0.68776,0.561842,0.45763,0.402573,0.388851,0.358736,0.314183,0.317327,0.351709,0.416361
1.039302,0.838186,0.672153,0.689546,0.77745,0.660986,0.632637,0.690851,0.674849,0.74038,0.732643,0.611268,0.679125,0.722697,0.65335,0.615023,0.668225,0.728114,0.696449,0.620062,0.515077,0.442215,0.419711,0.437866,0.435882,0.409905,0.416968,0.443517
1.209861,0.943929,0.74292,0.855057,0.988377,0.804655,0.713479,0.721502,0.732471,0.85125,0.860785,0.768006,0.869221,0.812635,0.662645,0.72845,0.832744,0.847521,0.789242,0.729887,0.653017,0.587171,0.553174,0.604139,0.653494,0.615078,0.606894,0.588255
1.287597,0.991097,0.812085,1.115893,1.348472,1.008329,0.71048,0.665615,0.710529,0.895526,1.024923,1.024379,1.106521,0.884886,0.726087,0.910589,0.992375,0.942965,0.824701,0.76673,0.727016,0.726801,0.7402,0.784641,0.883772,0.872224,0.870509,0.777731
1.337734,1.08712,0.884032,1.30865,1.692241,1.199034,0.648513,0.565208,0.680161,0.957381,1.182054,1.234182,1.23785,0.892429,0.820466,1.070157,1.084853,1.001349,0.879668,0.77331,0.665373,0.768677,0.883601,0.887216,1.017608,1.050382,1.069763,0.896213
1.384167,1.152314,0.914286,1.306635,1.777884,1.255666,0.617535,0.541388,0.731241,1.000451,1.174165,1.25759,1.185151,0.833067,0.890065,1.146407,1.037231,0.906428,0.932602,0.81513,0.571074,0.769064,0.982471,0.931725,1.011148,1.021614,1.056792,0.871628
1.383074,1.088731,0.805081,1.078051,1.503201,1.11713,0.600708,0.539918,0.739309,0.896116,0.994762,1.139171,1.016314,0.735444,0.861123,1.033174,0.823041,0.68445,0.877215,0.828339,0.580212,0.8026,1.010492,0.945226,0.886167,0.784848,0.809457,0.717445
1.217398,0.880568,0.586335,0.76801,1.031954,0.854155,0.544528,0.499441,0.655648,0.661943,0.757042,0.931537,0.752507,0.584537,0.714345,0.801092,0.636282,0.604558,0.798321,0.728885,0.567436,0.729195,0.886059,0.874522,0.695117,0.514326,0.509126,0.505
0.840047,0.558634,0.334502,0.456908,0.583437,0.53132,0.409068,0.421807,0.512831,0.462306,0.597974,0.667771,0.453054,0.423752,0.533051,0.577937,0.540616,0.584274,0.629632,0.496518,0.445275,0.530109,0.620732,0.665258,0.506661,0.366485,0.360683,0.36622
0.449151,0.308597,0.187248,0.264265,0.352696,0.320265,0.273133,0.302115,0.345321,0.353627,0.475022,0.449191,0.278678,0.314459,0.421506,0.406982,0.430043,0.499279,0.404539,0.265261,0.282469,0.316569,0.382889,0.441164,0.372444,0.345516,0.325202,0.287641
0.223149,0.191772,0.138773,0.185799,0.244572,0.243475,0.230845,0.212645,0.217191,0.277494,0.335093,0.276718,0.191912,0.222359,0.313153,0.302357,0.316925,0.348722,0.248486,0.183972,0.210346,0.205898,0.275094,0.335528,0.293731,0.320621,0.291089,0.229065
0.127106,0.157397,0.148244,0.178956,0.181283,0.178206,0.197629,0.174928,0.189814,0.235959,0.219346,0.171433,0.122914,0.151179,0.2404,0.268691,0.234296,0.209352,0.173822,0.164383,0.170827,0.147248,0.1945,0.272593,0.287873,0.301643,0.247905,0.194119
0.1043,0.140404,0.140729,0.165079,0.152629,0.149751,0.180516,0.159859,0.184754,0.201394,0.171489,0.148059,0.126283,0.139309,0.181367,0.225988,0.201588,0.180539,0.167816,0.129334,0.125222,0.114967,0.130144,0.201526,0.251021,0.246805,0.188082,0.150777
0.096722,0.11302,0.104226,0.134569,0.146423,0.139437,0.162014,0.142163,0.159202,0.150846,0.123986,0.134134,0.157367,0.153078,0.140547,0.201964,0.227383,0.216254,0.179836,0.098019,0.080103,0.084615,0.111497,0.170128,0.187406,0.169366,0.145868,0.121961
0.085699,0.076383,0.062,0.102855,0.129497,0.112972,0.132107,0.130359,0.125497,0.105253,0.083553,0.119195,0.175378,0.172353,0.152943,0.213119,0.257488,0.255206,0.18751,0.085501,0.052263,0.055642,0.095769,0.133118,0.116549,0.112835,0.115929,0.102418
0.066203,0.055775,0.044707,0.085983,0.10557,0.08527,0.094891,0.102139,0.090335,0.075935,0.068528,0.110166,0.166729,0.166306,0.155335,0.199521,0.248354,0.255251,0.182906,0.088043,0.045575,0.042391,0.069487,0.082655,0.069914,0.092568,0.106696,0.093863
0.042234,0.042188,0.043983,0.070317,0.077173,0.063701,0.061574,0.063235,0.059451,0.057733,0.055532,0.08776,0.131797,0.129043,0.127438,0.150663,0.193464,0.205773,0.151978,0.08382,0.040162,0.036601,0.043194,0.039575,0.048331,0.081599,0.090379,0.079923
