3e-05,1e-06,-2.2e-05,-1e-06,-2.3e-05,-3.1e-05,1.9e-05,0.000111,9.3e-05,0.000118,6.9e-05,4e-06,1e-05,8e-05,7.6e-05,4e-05,8.8e-05,6.2e-05,-1.8e-05,-4.3e-05,-2.6e-05,4e-06,7.3e-05,8.4e-05,9.3e-05,8e-06,-2.7e-05,4.9e-05
0.000124,8.6e-05,6.4e-05,6.3e-05,5.7e-05,6.2e-05,0.000122,0.000177,0.000155,0.000194,0.000154,1e-04,5.7e-05,0.000121,0.000135,9.4e-05,0.000137,0.000133,0.000141,0.000104,6e-05,8.1e-05,0.000156,0.000177,0.000146,5.6e-05,3.7e-05,0.000104
8.7e-05,4.8e-05,2.9e-05,4.9e-05,4.4e-05,3.9e-05,9.4e-05,0.000151,0.000119,0.000144,0.000111,6.4e-05,2.9e-05,9.7e-05,0.000108,6.9e-05,0.000115,0.000104,0.000105,7.5e-05,2.2e-05,5.1e-05,0.000109,0.000134,0.00012,4.4e-05,2.2e-05,7.3e-05
9e-06,-1.4e-05,-3.5e-05,6e-06,-1.3e-05,-3e-05,1.2e-05,8.7e-05,6.6e-05,8.9e-05,5.6e-05,5e-06,2.2e-05,7.7e-05,6.6e-05,3.4e-05,7.4e-05,3.9e-05,-4.1e-05,-5.8e-05,-3.4e-05,-1.5e-05,2.2e-05,6.1e-05,7.7e-05,9e-06,-2.1e-05,3.9e-05
7.6e-05,5.2e-05,2.1e-05,3.1e-05,2.3e-05,2.3e-05,6.3e-05,0.000115,0.000108,0.000158,0.000113,5e-05,5.3e-05,0.000109,0.000104,7.1e-05,9.6e-05,7e-05,3.7e-05,2e-05,2.4e-05,3.3e-05,7e-05,0.000108,0.000101,3.7e-05,1.4e-05,7.4e-05
0.000109,8.1e-05,4.6e-05,6.3e-05,6.9e-05,6.5e-05,0.000107,0.000139,0.000114,0.000155,0.000135,8.7e-05,6.6e-05,0.000125,0.000127,7.8e-05,0.000108,9.6e-05,0.000125,0.000107,4.2e-05,6.4e-05,9.3e-05,0.000121,0.000109,5.7e-05,5.1e-05,9.8e-05
1.1e-05,-9e-06,-2.9e-05,1.4e-05,2e-06,-2e-05,1.8e-05,7.3e-05,4.3e-05,8e-05,5.8e-05,9e-06,2.1e-05,7.8e-05,6.2e-05,1.6e-05,4.4e-05,1.7e-05,-1.7e-05,-2.1e-05,-3.4e-05,-2.4e-05,-7e-06,3.8e-05,5.1e-05,7e-06,-1.6e-05,2.9e-05
1.7e-05,-1.3e-05,-2.6e-05,-2e-06,-1.5e-05,-1.7e-05,1.2e-05,7e-05,6.6e-05,0.000108,7.1e-05,2e-05,6e-06,6.4e-05,7.6e-05,2.6e-05,3e-05,0,-5.5e-05,-3.9e-05,1e-06,-8e-06,-7e-06,3.3e-05,3.8e-05,-6e-06,-2e-05,4.5e-05
4.9e-05,3e-05,1.9e-05,2.7e-05,4.2e-05,3.6e-05,6.6e-05,8.8e-05,7e-05,0.000107,9e-05,5.4e-05,1.5e-05,7.4e-05,9.5e-05,3.3e-05,4.3e-05,2.7e-05,5.5e-05,5.8e-05,2e-05,2.7e-05,2.2e-05,6.4e-05,5.6e-05,2.1e-05,1.9e-05,6e-05
4.2e-05,1.4e-05,0,3.4e-05,3.5e-05,1.4e-05,2.8e-05,5.6e-05,3.3e-05,7.1e-05,6.7e-05,4.2e-05,3.3e-05,7.4e-05,6.9e-05,1.7e-05,3.5e-05,1.5e-05,1.9e-05,2.9e-05,-9e-06,-2e-06,-9e-06,3.3e-05,4.2e-05,3e-05,1.8e-05,3.8e-05
0,-2.1e-05,-2.5e-05,1.5e-05,-8e-06,-2.2e-05,-5e-06,2.3e-05,2.9e-05,8.6e-05,6e-05,1.6e-05,2e-05,5.7e-05,5.6e-05,7e-06,-8e-06,-3.7e-05,-7.8e-05,-5.5e-05,-1.4e-05,-3.1e-05,-5.5e-05,-1.1e-05,0,-4e-06,-1e-05,3.6e-05
6.2e-05,3.8e-05,1.4e-05,1.8e-05,2.1e-05,1.9e-05,4.9e-05,5.7e-05,4.2e-05,0.000106,8.4e-05,2.6e-05,2.5e-05,7.7e-05,7.8e-05,1.5e-05,-4e-06,-2.1e-05,-1.6e-05,1e-05,1.1e-05,1.3e-05,-1e-05,1.2e-05,4e-06,8e-06,7e-06,3.9e-05
4.5e-05,3.9e-05,2.3e-05,3e-05,3.8e-05,2.3e-05,3.5e-05,3.4e-05,1e-05,6.9e-05,8e-05,4.3e-05,2.9e-05,8e-05,7e-05,5e-06,-1e-06,-1.2e-05,2.7e-05,4.5e-05,-3e-06,0,-9e-06,2e-05,1.5e-05,2.1e-05,2.2e-05,4e-05
1.5e-05,-2.7e-05,-2.3e-05,9e-06,-9e-06,-2.4e-05,-2e-05,-3e-06,3e-06,6.5e-05,4.5e-05,1.4e-05,1e-05,5.3e-05,3.8e-05,-2.1e-05,-4.1e-05,-5e-05,-6.3e-05,-3.4e-05,-1e-05,-2.7e-05,-5.5e-05,-3.5e-05,-3e-05,-1.4e-05,-1.2e-05,2e-05
1.5e-05,-1.9e-05,-1.7e-05,-9e-06,-1.5e-05,-1.5e-05,3e-06,5e-06,2e-06,6.4e-05,4.1e-05,-1e-06,2e-06,5.2e-05,5.4e-05,-2e-05,-5.3e-05,-5.8e-05,-7.6e-05,-4.2e-05,-2e-06,-2e-05,-5.1e-05,-4.8e-05,-5e-05,-2.8e-05,-1.9e-05,5e-06
3.9e-05,2.3e-05,2.3e-05,2.1e-05,3.3e-05,2.2e-05,4.5e-05,1.4e-05,-2e-05,4e-05,5.1e-05,2.5e-05,1.4e-05,5.7e-05,5.4e-05,-5e-06,-3.2e-05,-3.1e-05,5e-06,2.8e-05,4e-06,1.7e-05,5e-06,-4e-06,-2.3e-05,8e-06,1.8e-05,1.6e-05
2e-05,-5e-06,-4e-06,1.6e-05,7e-06,-2e-06,4e-06,-1.3e-05,-2.4e-05,3e-05,3.6e-05,2e-05,1e-05,4.2e-05,3.2e-05,-1.3e-05,-5.5e-05,-4.9e-05,-3.2e-05,-6e-06,4e-06,3e-06,-2.2e-05,-4.3e-05,-5e-05,-1e-06,7e-06,3e-06
1.9e-05,-5e-06,-1.8e-05,-7e-06,-2.8e-05,-2.6e-05,-1.2e-05,-2.2e-05,-2.2e-05,4.2e-05,2.2e-05,-1.1e-05,7e-06,3.9e-05,3.3e-05,-2e-05,-7.3e-05,-6.1e-05,-7.7e-05,-6.4e-05,-1.2e-05,-2.8e-05,-6.5e-05,-7.3e-05,-7.2e-05,-3.3e-05,-1.7e-05,-7e-06
2.7e-05,2.9e-05,1.3e-05,1e-06,8e-06,5e-06,3.3e-05,-8e-06,-4.7e-05,1.8e-05,2.9e-05,-9e-06,-6e-06,4.4e-05,3.7e-05,-1.9e-05,-7e-05,-4.5e-05,-3.2e-05,-1.3e-05,-1e-06,-2e-06,-2.6e-05,-5.4e-05,-6.4e-05,-1.8e-05,-7e-06,-1.2e-05
