-4.6e-05,-0.000273,6.1e-05,0.000159,-0.000472,0.000154,-0.000374,-0.000747,-0.000608,-0.000167,-0.000375,-0.000677,0.000202,-0.003468,-0.005279,-0.003288,-0.005458,-0.008052,-0.006075,-0.002823,-0.001139,-0.001709,-0.002322,-0.000192,-6.2e-05,-0.00036,-0.000599,0.010994,-0.002803,-0.018472,-0.019678,-0.019282,-0.016152,-0.011537,-0.015618,-0.007372,-0.013711,-0.014916,-0.014858,-0.016504,-0.014179,-0.019563,-0.018544,-0.017922,-0.010747,-0.0174,-0.012538,-0.014009,-0.015244,-0.006615,-0.016925,-0.012133,-0.012371,-0.011254,-0.007184,-0.014866,-0.010424,-0.008491,-0.00943,-0.010399,-0.005043,-0.004958,-0.006227,-0.003774,-0.004032,-0.004025,-0.0029,-0.004753,-0.002265,-0.000691,0.000444,-0.000951,-0.000627,-0.002471,-0.003315,-0.002824,-0.001391,-0.001218,-0.001397,-0.000723,-0.001023,-0.006245,-0.003568,0.001226,-0.003162,-0.000638,0.000187,-0.00279,-0.002726,-0.000896,-0.002199,-0.00076,0.000265,3.4e-05,-3.1e-05,-0.001341,-0.000742,-0.000281,0.000124,0.000175,0.000148,-4.2e-05,0.000225,-2.1e-05,-9.2e-05,-0.000154,-0.00054,0.000192,-0.000711,-0.00048,-0.000827,-0.001166,-0.000218,-3.1e-05,-0.001426,-0.001029,-0.000352,0.000155,-4.7e-05,-0.000356,-0.000353
-0.00042,-0.00025,0.00013,-0.00037,-0.000359,-3.9e-05,5.2e-05,2.7e-05,0.000296,0.000269,-7.6e-05,-0.000318,-0.000638,0.00286,0.001166,0.001157,0.000891,0.003612,0.003837,0.001754,0.000743,0.00097,0.000806,0.001193,0.000435,-6.5e-05,0.000754,-0.005438,-0.002438,-0.001596,-0.003596,0.009455,0.003637,0.00509,0.002893,0.000657,-0.006075,0.00048,0.00114,0.005776,0.002771,0.009486,0.000144,0.004703,0.004334,0.004205,0.000137,-0.001395,0.002033,0.002449,-0.00258,-0.003647,-0.001238,0.002798,-0.007377,-0.00558,-0.007893,-0.00718,-0.001432,-0.002747,-0.006497,-0.00213,-0.000228,0.000654,-0.001475,0.000629,-0.002398,-0.002528,-0.001526,-0.000216,-0.002194,-0.00147,0.000213,-0.000768,0.001796,-0.00029,-0.000254,-0.000233,-0.000245,-0.000892,-0.000484,-0.000584,0.000359,-0.004845,-0.003365,-0.000338,0.000347,0.001113,0.001267,-0.000221,0.001314,0.001281,0.00145,0.000415,5e-06,0.000436,0.000724,0.000629,-0.000453,-0.000173,-3.2e-05,-0.000219,0.000126,-0.001026,-0.000531,-8.4e-05,0.000266,0.000491,-0.000909,-0.000148,0.000112,0.000589,-0.000385,-0.00021,0.000558,0.000544,0.000529,1e-06,-0.000111,0.000466,0.000476
-0.000209,0.000131,3.5e-05,-0.000175,9.5e-05,0.000302,8.6e-05,6.9e-05,-3.6e-05,0.000155,0.000118,2.8e-05,0.000296,-0.002784,-0.001071,-0.001329,-6.4e-05,-0.00273,-0.003908,-0.002186,-0.000455,-0.00066,0.000114,0.000298,9.6e-05,-0.000243,-0.00082,-0.005252,-0.002887,-0.004749,-0.014404,-0.002089,0.000639,-0.003746,-0.006645,-0.002195,0.006248,0.000204,-0.007115,-0.003601,-0.004289,-0.006096,-0.001014,-0.004579,-0.005011,-0.00828,-0.005843,-0.005341,-0.004914,-0.005269,0.002883,0.006291,0.001015,5.5e-05,0.003299,0.00655,-0.000593,-0.000943,-0.002643,-0.001148,-0.001093,-0.000251,0.000822,-0.001458,-0.000659,-0.001996,-0.001236,-0.000115,9e-06,0.000248,-0.000947,-0.000154,-0.000509,0.000473,0.000146,0.000361,0.000328,-0.000262,-0.000162,-0.001193,-0.000755,0.000392,-0.000232,-0.000228,-0.001283,-0.001474,-0.000662,-0.001181,-0.000732,0.000162,-0.002575,-0.001457,-0.000956,-0.000202,-0.000128,-0.000361,-0.000675,-0.000272,-0.000262,-0.000606,-0.000462,-1.4e-05,-0.000343,-0.000113,-3.7e-05,-0.000323,-0.000161,-0.000572,5e-05,-0.000422,-0.000458,-0.000462,-0.00032,-5.1e-05,0.000293,0.000242,0.000159,-0.000113,-0.000182,-5e-04,-0.000138
0.000316,-2e-05,-0.000197,8.2e-05,7.1e-05,-0.000289,-0.000483,0.000106,0.000484,3.6e-05,-0.000461,-0.000337,-0.000305,-0.000861,-0.000556,0.00078,0.000154,0.002881,0.003487,0.002285,0.000277,0.000498,-0.000342,-0.001172,-0.000284,0.000111,-0.000295,-0.000248,-0.004834,0.003901,0.00326,-0.009625,-0.006144,-0.000456,0.002697,0.006398,-0.004904,-0.007556,0.002183,0.000204,0.001956,0.003295,0.003283,0.003051,-0.000187,0.006117,0.00247,0.004971,-0.00027,-0.00046,0.001416,-0.003063,0.000328,0.002843,-0.002234,-0.004116,-0.000544,0.001644,0.005165,0.000433,0.000844,-0.000461,-0.000878,-7e-05,0.000596,0.000283,0.001008,0.000722,0.000208,0.000239,0.00068,-1.4e-05,-8.7e-05,0.000387,-0.000295,-0.001215,-0.000909,0.000603,2.4e-05,-0.000148,-5.2e-05,0.000577,-0.00019,0.000138,0.002743,0.000905,0.000403,0.00014,0.000266,7.2e-05,0.001271,-0.000324,-0.00057,-0.000299,-8.9e-05,0.000243,0.000193,0.000218,0.000223,0.000613,3e-06,3.8e-05,-0.000233,0.00031,-6.4e-05,0.000224,3e-05,0.000347,0.000434,0.000693,-0.00014,-0.000339,5e-06,0.000101,-5.3e-05,-0.000404,9.9e-05,5.2e-05,-2.8e-05,-0.000118,0.000435
-0.000199,0.00019,4.2e-05,0.000225,-0.000173,-0.000264,7e-05,-0.000148,-0.000467,-0.000714,3.6e-05,0.000255,9.5e-05,0.000518,-0.000295,-0.000701,-4.6e-05,-0.001302,-0.002158,-0.001706,-6e-04,-0.000389,-0.000559,-0.001011,-5e-04,5.1e-05,-0.000142,-0.000579,-0.002776,0.003844,-0.004186,-0.001561,0.005087,0.004247,-0.000812,-0.005876,0.002412,0.001767,-0.003544,-0.003761,-0.004987,-0.008753,-0.005805,-0.005104,-0.004011,-0.003107,-0.003218,0.000808,0.001584,0.00032,0.000708,0.003482,-0.002775,-0.001511,0.001043,0.002289,-0.000121,0.00048,0.000324,0.003072,0.001341,-0.000507,-0.000112,0.00031,-0.000211,-0.000332,-0.000761,-0.000651,-5.1e-05,0.000637,0.000725,0.000848,0.000181,-0.000546,-0.000318,0.000173,0.000215,1.2e-05,6.4e-05,0.000155,-0.000219,-0.00035,0.000184,0.00061,-0.000265,-0.001454,-0.00044,0.000312,-2e-04,-0.000542,-0.000199,-0.000422,-0.000302,-0.000482,5.2e-05,-0.000138,-0.000194,-3.8e-05,-5.2e-05,0.000247,0.000125,0.000252,-7.2e-05,-6e-06,2.5e-05,0.000187,0.000356,-0.00057,-5.3e-05,2e-05,0.000196,0.000387,1.1e-05,-0.000323,-0.000184,0.000169,9.8e-05,-4e-05,4.4e-05,1.6e-05,-7e-05
0.000335,-0.000291,-8.4e-05,-0.000229,-0.000107,-7.6e-05,1.2e-05,0.000223,0.000364,0.000338,-5e-05,-1e-04,8.7e-05,7.8e-05,-0.000875,0.000424,4.3e-05,-0.000288,0.001489,0.001423,0.000228,5e-06,0.000857,-0.000527,-0.000758,-0.000611,0.00039,-0.001472,-0.002358,-0.002602,0.009215,-0.001587,-0.007373,0.003162,0.005937,0.002133,0.003698,-0.003114,0.003122,0.001125,0.00322,0.00025,0.001872,0.00566,-0.00046,0.001602,0.005377,-0.000487,0.001538,-0.000147,0.000882,0.000759,0.004069,-0.00106,-0.000754,0.000139,0.001882,0.000283,-0.001477,-0.002314,3.6e-05,0.001781,0.000489,0.00099,0.000188,0.000165,0.000583,-0.000165,-0.000133,0.000221,-0.00024,-0.000614,0.000293,9.5e-05,0.000435,-0.000496,-0.000144,-0.000402,-9e-06,0.000304,9e-05,0.000289,-0.000224,-4.1e-05,0.000149,0.001042,0.00021,-0.000326,0.000151,0.000161,0.000721,0.000809,0.000148,-1.8e-05,0.000239,1.1e-05,0.000321,-6.4e-05,-0.000178,0.000161,-0.00026,-4e-05,-0.000165,0.000104,0.000175,5.4e-05,-5.4e-05,0.000144,-0.000177,2.2e-05,-6e-06,9.4e-05,0.000296,4.4e-05,-0.000287,-0.000223,2.9e-05,-7.5e-05,0.000121,-1.9e-05,4.1e-05
-0.000135,-0.000156,0.000152,0.000105,0.000128,0.000116,-0.000106,-6.8e-05,-0.000386,-0.000329,-9.2e-05,0.000268,9.9e-05,-0.000186,0.00059,-2e-04,0.00026,0.000353,-0.000512,-0.000879,-0.000288,-0.000247,-9.7e-05,0.000255,-1e-06,-0.00014,3.1e-05,-0.000174,0.00121,-0.000413,-0.003057,-0.004563,-0.000402,-0.004513,-0.002617,-0.004968,-0.000736,0.004807,-1.4e-05,0.000753,-0.003451,-0.001072,-0.003544,-0.000917,-0.002429,-0.002663,-0.00413,-0.001257,0.001938,0.000494,-0.001738,-0.001776,-0.00219,6.3e-05,-0.000604,-0.002268,0.00076,0.004244,0.001829,0.001232,0.000759,-0.000421,-0.000577,-0.000801,-0.00024,0.000875,-0.000393,0.001015,0.000164,-0.00039,0.00011,-0.000167,-6.5e-05,-0.000173,-0.000383,9.4e-05,-0.000717,1e-06,-3e-05,4e-05,0.000493,-0.000116,-0.00034,-4.7e-05,-0.001872,-0.000834,-0.000777,1.2e-05,6.3e-05,-0.000242,-0.000222,-0.001857,-0.000879,-0.000487,-0.000512,-0.000193,-0.000463,5.3e-05,-0.00025,-0.00023,-0.000264,-9.1e-05,7.7e-05,-0.000339,-0.000306,-7.9e-05,-0.00021,-8.2e-05,-0.000489,-0.000214,3.1e-05,2.6e-05,-0.000225,-0.000104,-4.6e-05,2.8e-05,-0.00017,-0.000268,-0.00042,-0.000233,-5.7e-05
0.000129,4.7e-05,-0.000234,-0.00012,0.000218,-0.000259,1.4e-05,-4.5e-05,0.000208,0.000124,0.000193,-0.000111,-0.00042,2.3e-05,0.000141,-4.5e-05,-0.000439,9.3e-05,-0.000236,0.000659,0.000174,-0.000281,-0.000133,-0.000368,-0.00065,-3.4e-05,3.2e-05,-0.000359,0.000792,-0.000831,-0.000932,-0.000157,0.000632,-0.003366,0.001763,0.0028,0.000678,-0.002447,0.002303,-0.001482,0.004879,0.000324,0.003501,0.000412,0.001721,-0.001557,6e-05,-0.003052,-0.001605,6.4e-05,-0.001436,-0.001677,0.000444,0.001288,0.001228,-0.000874,-0.001309,-0.002268,-0.000901,-0.001342,-0.000379,-0.000704,0.000782,0.000888,0.000514,-0.000719,-0.000375,-5.3e-05,-0.000456,-0.000323,-0.000505,7.4e-05,-0.000187,0.000149,-6.4e-05,0.000317,-6e-06,-2.4e-05,-0.000303,1.2e-05,-0.000116,-5e-05,0.000176,0.000187,0.000137,-0.000255,-0.000487,0.000453,-0.000127,0.000387,1.1e-05,0.000287,0.000126,-0.000465,-0.000174,0.000159,0.000171,0.000125,4.4e-05,7.2e-05,-1.6e-05,7e-06,8.6e-05,9.4e-05,-6.4e-05,-0.000114,-0.000392,-6.8e-05,6.6e-05,8.3e-05,-0.000183,-7.7e-05,0.000163,0.000168,-2.6e-05,-0.000271,-0.000213,3e-06,-4.1e-05,-0.000146,-0.000199
-8e-06,9.7e-05,0.000312,-2.9e-05,-4e-06,0.000244,5.8e-05,0.000111,2e-06,1.9e-05,2e-05,-0.000104,0.000147,4.5e-05,0.000126,0.000258,0.000521,1.3e-05,0.000226,-0.000404,9.8e-05,-4.2e-05,-6.3e-05,0.000306,0.000274,-0.000241,2e-06,-1e-04,-0.001175,-0.002993,0.001714,0.002581,-0.00412,-0.002245,-0.003737,-0.000459,0.001471,0.001407,0.000781,-0.000963,-0.001456,-0.001261,-0.00019,-0.002304,0.002033,-0.001244,-0.000943,0.00018,-0.001519,-0.000595,-0.000945,0.000979,0.000928,-0.00086,0.000874,-0.000823,0.002506,0.000985,3.2e-05,0.000563,3.5e-05,0.000336,-0.000817,-1.3e-05,-0.000943,0.000509,0.000373,-0.000358,-0.000113,-0.000438,-8.7e-05,0.000564,1.5e-05,-6.2e-05,-0.00029,-0.000133,-0.000196,-5e-05,-7.3e-05,0.000188,-0.000138,-2.8e-05,1.6e-05,-0.000728,-0.000252,-0.000139,-5.9e-05,0.000274,-9e-06,-0.00034,0.000438,1.8e-05,-0.000474,-0.000303,-0.000329,-4.1e-05,-0.000307,-2e-04,-8.7e-05,-6.6e-05,8.9e-05,0.000147,1.2e-05,-5e-05,0.000156,-1e-06,0.000241,9.3e-05,-0.000268,-1.9e-05,0.000237,-0.00012,-0.000135,-4.9e-05,6.4e-05,-3.8e-05,-8e-06,-0.000105,7e-05,-1.1e-05,-4.3e-05
-6.2e-05,-0.000189,-2.8e-05,4e-05,-4.7e-05,-5.1e-05,-8e-05,-0.00018,7.8e-05,-3.6e-05,-0.000116,-8.4e-05,-2e-06,-0.000139,-0.000302,-0.000207,-0.000623,-0.000214,0.000222,5.8e-05,-0.000317,-4.2e-05,1.6e-05,-0.000269,9.3e-05,-0.000333,0.000226,4.4e-05,0.000176,-0.002552,-0.000542,-0.001151,0.002209,-0.000456,0.001681,0.002927,0.001235,-0.00072,-0.002219,0.001798,-0.001252,0.001495,0.002147,0.002345,-0.001028,0.001718,0.002016,0.001327,-0.001039,0.00271,0.002353,-0.000154,-0.000392,0.00035,0.000653,0.000804,-0.002487,-0.000638,-0.000442,-0.001183,-0.001038,-0.000577,6.3e-05,-0.000204,0.00089,0.000288,3.3e-05,0.000132,0.000313,-0.000123,-0.000171,-8.9e-05,-0.000105,-9.5e-05,0.000502,-0.000257,0.000252,-0.000239,0.000109,-0.000229,-1.9e-05,0.00022,-9.3e-05,0.000488,0.000276,-0.000126,-0.000124,-0.000101,-7.7e-05,0.00028,-0.000246,-6.7e-05,0.000567,1.8e-05,-4.3e-05,0.000114,0.00018,9.3e-05,-2.5e-05,-3.1e-05,6.5e-05,0.00019,-8.1e-05,-2.4e-05,5.3e-05,6e-05,-5e-06,-0.000245,0.000289,6e-05,-0.000104,2.4e-05,-0.000113,-4.6e-05,1.9e-05,-0.00013,-8.9e-05,-6.2e-05,6.2e-05,-1e-05,2.5e-05
-2e-06,0.00019,-7e-06,1.6e-05,-2.1e-05,-3.9e-05,3e-06,3e-05,-6e-05,1.9e-05,4.4e-05,6e-06,-5.9e-05,4.6e-05,0.000208,-0.000163,0.000347,0.000196,-0.000395,-0.000124,0.000157,-3.4e-05,4e-06,-0.000111,-0.000189,0.000375,8.1e-05,6.4e-05,-0.000153,0.001568,0.001115,0.002529,0.003155,-0.001701,-2.9e-05,-0.002353,-0.002677,-0.0024,0.001472,-0.000605,0.001384,0.000872,0.000422,-0.002067,-0.000749,-0.001706,0.000137,1.8e-05,0.000955,-0.001589,-0.00069,-0.001255,0.000254,-0.000237,-0.00022,0.000432,0.000483,-0.000566,-0.000213,0.00064,0.000678,0.000303,0.00016,-0.000332,-0.000781,-0.000288,3.9e-05,2.4e-05,-0.000118,-0.000216,-0.000435,-5.8e-05,0.000303,0.000169,-0.000312,0.000126,0.000124,9e-05,2.1e-05,0.000261,-3.6e-05,0.000171,6.7e-05,-0.000113,-6.4e-05,0.000261,5e-04,4.1e-05,-6.3e-05,-0.000524,-0.000106,0.000139,-0.000164,0.000315,-0.00014,9.3e-05,7.7e-05,-0.000163,7.3e-05,-9.5e-05,-0.000203,-9e-05,-4.9e-05,7.5e-05,-9.9e-05,-3.3e-05,3.5e-05,0.000121,-2.8e-05,-0.00015,0.000227,-4.8e-05,0.000147,3.2e-05,4.4e-05,-0.000122,0.000168,-7e-06,-8e-06,8e-06,-0.000125
-1.5e-05,-5.1e-05,-6e-06,-3.3e-05,-3.7e-05,-6e-06,9.9e-05,9.1e-05,3.1e-05,-5.1e-05,6.2e-05,-3.6e-05,0.000218,0.000104,-0.000122,0.00019,-0.000617,-0.000207,0.000185,-1.1e-05,-7e-06,0.000276,-0.000228,-0.000154,0.000288,0.00013,-9.1e-05,-0.000216,0.000373,0.0015,-0.00149,-0.001801,-0.001993,0.001323,-2.6e-05,-0.000554,-0.000117,-0.000911,-0.002183,4.9e-05,-0.000802,0.002053,-0.00016,0.000283,-0.00076,0.000515,0.00015,0.000841,-0.000134,0.001119,0.000472,-0.000531,-0.00037,-0.000703,-4.7e-05,-3.7e-05,0.00036,0.000311,-0.000791,0.000483,-0.000181,0.000124,-0.000451,0.000197,0.000387,-0.000275,-0.00028,-2.1e-05,0.000334,0.000392,2.1e-05,-5.1e-05,-0.000203,-5.3e-05,0.000266,0.000272,-9.4e-05,-6.2e-05,-9e-05,-5e-06,0.000215,-0.00016,7.3e-05,-0.000134,0.000184,0.000298,3.5e-05,0.00037,-3.3e-05,0.000316,5e-05,-7e-06,-5.5e-05,0.000341,0.000268,8.5e-05,-0.000102,0.000133,-4.9e-05,5e-05,7e-06,2.3e-05,5.4e-05,-3e-06,-6.1e-05,-0.000107,-9.5e-05,8.8e-05,0.000129,-7.6e-05,-7.8e-05,1.1e-05,-9e-06,-1.2e-05,-9.5e-05,-1.3e-05,-0.000154,-3.3e-05,6.6e-05,-7.1e-05,0.000111
-7e-06,-1.1e-05,2e-05,-3e-05,3.2e-05,1.4e-05,-0.000107,5e-05,-3.2e-05,-5e-06,-0.00011,4.3e-05,-0.000134,-8.7e-05,1.2e-05,-0.000126,0.000656,4.9e-05,8.7e-05,0.000201,-8.6e-05,-0.000194,-1.1e-05,0.000202,-9.8e-05,0.000197,8e-06,-6.1e-05,0.000125,0.000299,0.00059,-0.000998,0.001614,-0.000354,-0.000488,-0.002422,-0.00246,0.001131,0.001636,0.000378,0.001063,-0.000876,0.000654,-0.000445,0.000406,0.000976,0.001069,-2.1e-05,8e-05,-0.000563,0.000103,0.000209,0.000258,-0.000264,0.000381,0.000219,-0.000838,-0.000226,0.000182,-0.000121,0.000317,-0.000104,-0.000507,-0.000183,1e-05,-0.000272,0.00019,7.1e-05,-0.000366,-4e-05,2e-04,-0.000228,-0.000227,0.000135,-0.000141,-0.000112,-5.4e-05,-8.1e-05,-0.000186,-1.1e-05,-9.2e-05,-1.9e-05,-1.6e-05,-0.000119,-2.8e-05,-0.000204,-0.000416,-5.8e-05,3e-06,6.1e-05,-0.000133,0.000162,4.7e-05,-0.000248,-0.000139,-4.2e-05,9e-06,-5e-05,3.3e-05,-6.4e-05,8e-06,-3.6e-05,6.4e-05,4.5e-05,-6e-06,6.4e-05,6e-06,3.5e-05,-2.1e-05,-6.8e-05,-2e-06,-3.5e-05,1.9e-05,3e-06,8e-06,1.7e-05,-3e-06,2.7e-05,-2.3e-05,-2.8e-05,-7.6e-05
-6e-06,-2.8e-05,8e-05,8.3e-05,1.7e-05,-5.3e-05,5e-05,9.1e-05,-3.1e-05,1.5e-05,7.1e-05,6.1e-05,-1.3e-05,-1.7e-05,0.000155,-1.5e-05,-8.8e-05,0.000167,-8.8e-05,-0.000206,6.5e-05,0.000105,5.2e-05,-6e-05,-9.1e-05,7.3e-05,5.2e-05,-4e-06,-0.000359,0.000126,0.000319,4e-05,-0.002127,-0.000342,-0.00115,-0.000781,0.000768,-0.001116,-0.001481,-0.000463,-0.001604,0.001044,-0.000938,0.000652,0.000868,-0.000791,-0.000216,-0.000974,-0.000343,-0.000106,0.00036,0.000324,0.000287,-0.000709,4.3e-05,1e-06,0.000352,0.000548,0.000455,-0.000379,-0.000508,-9.9e-05,0.000774,-0.000213,-0.000411,0.00042,-6.6e-05,-7.9e-05,-0.000395,2.3e-05,4.6e-05,-7.5e-05,0.000154,-9.5e-05,6.6e-05,-0.000127,2e-06,0.000211,0.000202,-0.000133,-3.5e-05,-0.000106,1.9e-05,2.2e-05,-0.000255,1e-06,-5.5e-05,8.1e-05,8e-06,0.000165,9.7e-05,-0.000133,0.000107,6.4e-05,0.000115,5.2e-05,2e-05,5.9e-05,-7e-05,4.8e-05,-9e-06,2.1e-05,4.8e-05,-3.9e-05,1.3e-05,1.3e-05,2.9e-05,-5.3e-05,-8.3e-05,1.3e-05,5e-05,2.5e-05,-4.7e-05,2.5e-05,3.8e-05,3.4e-05,-5e-05,-7e-05,-9e-06,9.8e-05,3.9e-05
0,2.9e-05,-7.5e-05,-9.5e-05,-2.7e-05,-5.3e-05,-2e-06,-2.2e-05,7.5e-05,-1.2e-05,-3.6e-05,0.00013,1.3e-05,3.9e-05,-0.00024,3.3e-05,-0.000161,5e-06,3.7e-05,7.9e-05,-6.9e-05,-0.000142,-9.3e-05,7e-06,-2.4e-05,0.000131,-0.000154,-2.6e-05,9.2e-05,0.000258,-0.000716,0.001112,7.3e-05,0.001349,0.001161,0.000218,9.3e-05,0.000722,0.000123,-4.6e-05,0.000923,-0.000426,-0.000105,0.000641,-0.001184,-4.7e-05,2.9e-05,0.000622,-0.00079,0.00037,-0.000365,-4e-06,-0.000216,0.000432,-0.000296,0.000236,-8.4e-05,-0.000679,-5e-06,0.000364,0.000385,-0.000283,0.000101,0.000165,0.000169,-0.000229,7.3e-05,-6e-05,-7.1e-05,-0.000117,0.000142,2.7e-05,0.000163,-8.1e-05,-3.5e-05,7.8e-05,1.6e-05,-0.000221,-3.3e-05,9.6e-05,6.7e-05,7.7e-05,4e-05,0.000164,1.8e-05,-4.9e-05,0.00018,-0.000144,-5e-06,-0.000103,-1.5e-05,1e-06,-0.000177,-0.00025,3.9e-05,-2.1e-05,2.5e-05,-5.4e-05,5e-06,-2e-06,1.9e-05,-7.9e-05,4e-06,-2.2e-05,-2.2e-05,-7e-06,-6.2e-05,-2.9e-05,1.8e-05,2.5e-05,4e-05,-1e-06,-3.2e-05,-3.5e-05,-1.3e-05,-1e-06,2.5e-05,5.5e-05,-2.9e-05,1.7e-05,-5e-06
-1.6e-05,-3.3e-05,-6.5e-05,2.4e-05,-2.7e-05,1.1e-05,-1e-06,-3.9e-05,-3.7e-05,6e-06,3e-05,-3e-05,-3.7e-05,-1.9e-05,0.000187,-5.3e-05,-1e-04,-8.9e-05,-7.8e-05,-3.7e-05,0.000113,4.9e-05,2.7e-05,-9.4e-05,4.7e-05,-0.000176,-6.2e-05,-7.6e-05,2.9e-05,-0.000311,-0.00013,0.000437,9.9e-05,-0.000528,-0.000534,0.00054,-2.9e-05,-0.000551,0.000422,-0.000337,-0.000162,-0.000258,7.3e-05,-0.000257,0.000639,-0.000109,-2.4e-05,8.2e-05,0.000951,-0.000247,-0.000203,-0.000101,-8e-05,-4.9e-05,2.4e-05,-0.000219,0.000168,0.000353,0.00018,-0.000218,5e-06,0.000227,-0.000415,-1.3e-05,3.8e-05,0.000159,-2.4e-05,0.000116,0.000228,4.2e-05,2.1e-05,5e-06,-2.2e-05,2.2e-05,-5e-05,-6e-05,-3.5e-05,4e-05,2.6e-05,-4.4e-05,-7.8e-05,4.8e-05,-6.4e-05,-1.5e-05,-0.000151,4.2e-05,1e-05,-0.000176,-6e-06,-7.4e-05,-2.8e-05,5e-05,0.000114,8.5e-05,0.000217,-2e-06,-6e-05,-2.5e-05,2e-06,9e-06,4.1e-05,-3.6e-05,1e-05,-1.4e-05,7.6e-05,4e-06,2.9e-05,4.2e-05,-3.5e-05,5.1e-05,-3.3e-05,2e-06,1.9e-05,1.1e-05,2e-06,-2e-05,4e-05,-1.5e-05,1.3e-05,-1e-05,-1e-05
7e-06,2.8e-05,5.2e-05,-5e-06,-1.3e-05,4.5e-05,-2.6e-05,-2.9e-05,3.5e-05,-1.7e-05,-3e-05,3.9e-05,2.4e-05,-1.7e-05,-0.000122,5.9e-05,3.6e-05,2.9e-05,4.9e-05,1.6e-05,-0.000104,-4.2e-05,5.3e-05,6.3e-05,6.4e-05,-1e-05,-5.8e-05,9e-06,0.000141,-0.000504,-0.000227,-0.000611,0.000224,-0.000166,0.000239,-6.4e-05,3.1e-05,-5.3e-05,-0.001059,-0.00019,-0.000291,0.001359,4e-06,1.2e-05,-0.000222,-0.000199,0.000209,-0.000289,0.000263,7.3e-05,6.6e-05,9e-06,-0.000219,0.000191,-0.000119,-0.000121,0.000192,-0.000228,-2.3e-05,-0.000302,5.7e-05,5.6e-05,0.000177,-0.000135,2.4e-05,1.5e-05,-4.3e-05,4.1e-05,3.4e-05,9.8e-05,5.3e-05,-1e-05,-4.5e-05,-2e-06,3.6e-05,5e-05,2.8e-05,7.2e-05,-3e-06,-3.2e-05,4.4e-05,-5e-05,-5.8e-05,2.9e-05,4.6e-05,-1.7e-05,-0.000128,-0.000132,1.2e-05,3.5e-05,1e-06,-7.3e-05,-4.9e-05,3e-06,8e-06,9e-06,1.6e-05,7.6e-05,-2.2e-05,3e-06,-3.5e-05,-2.3e-05,2.3e-05,7e-06,-2e-06,-2e-06,2.8e-05,1.3e-05,5e-05,3.5e-05,0,3.8e-05,-1.5e-05,-1e-05,1.5e-05,2.9e-05,-1.5e-05,-3.3e-05,9e-06,6e-06,-1.2e-05
1e-06,9e-06,-1.4e-05,-1.9e-05,1.9e-05,-1.9e-05,3.4e-05,-1.9e-05,-9e-06,7e-06,3.3e-05,1.1e-05,-3e-06,3.2e-05,9.3e-05,-2.3e-05,-4.6e-05,-1.3e-05,-6e-06,1.8e-05,4.8e-05,4.2e-05,2.1e-05,-1.1e-05,4.1e-05,3.8e-05,-9e-06,-2.5e-05,-9.9e-05,-0.000311,0.000423,-0.000376,0.000422,-0.000526,-0.000157,-0.000261,0.000137,1e-06,0.000548,0.000213,0.000671,7e-06,-7.5e-05,0.000225,8e-05,3e-05,-0.000221,0.000566,-0.000104,-0.000523,-3.6e-05,-6.6e-05,7.5e-05,0.000165,5.7e-05,0.000151,-0.000376,0.000424,-0.000226,0.000368,1.1e-05,2.8e-05,0.00011,-2.5e-05,-3.8e-05,-0.000108,8.7e-05,1.4e-05,1e-05,-2.7e-05,-7e-06,-2e-06,-1e-05,2.2e-05,3.2e-05,-1.5e-05,1e-05,-6.4e-05,3.6e-05,-1.8e-05,-5.5e-05,1.3e-05,6.8e-05,-5.4e-05,3.2e-05,-2.3e-05,5.4e-05,3.3e-05,2e-06,-2.5e-05,1.1e-05,6.7e-05,5e-05,-2.9e-05,-5.5e-05,6e-06,-1.2e-05,-5.1e-05,2.2e-05,-1.1e-05,-3.2e-05,1.2e-05,1.5e-05,9e-06,-3e-06,-8e-06,-2e-05,4e-06,-1e-06,-4e-06,-1e-06,5e-06,6e-06,1.1e-05,-2.6e-05,-2.3e-05,1.2e-05,8e-06,-7e-06,1.1e-05,1.3e-05
3e-06,-1.1e-05,-7e-06,1.2e-05,1e-05,-1.2e-05,-1.7e-05,-3e-06,1.7e-05,-4e-06,-2.5e-05,6e-06,1e-06,-1.1e-05,-8.3e-05,-1.8e-05,8.7e-05,-2e-05,-4.4e-05,3e-06,-2.3e-05,2e-06,-1.5e-05,3.7e-05,-6.5e-05,-3.1e-05,-1.4e-05,-2.4e-05,-1.3e-05,-2e-06,-4.6e-05,-0.000137,-0.000115,0.000126,0.00015,-0.000458,0.000186,-4.8e-05,-0.000353,-7e-06,-0.000713,0.000263,-0.000255,0.00026,-9.8e-05,0.000131,0.000111,-0.000296,0.000218,0.000315,8.2e-05,-0.000241,-1e-04,-0.000221,-0.000342,9.2e-05,0.000386,-0.00039,-8.4e-05,-0.000188,-7.2e-05,-4.9e-05,-5.4e-05,5.1e-05,8.3e-05,-1.1e-05,-4e-05,-1.6e-05,1e-05,-6.2e-05,-0.000105,-5e-06,8e-06,-4e-06,-8e-06,8e-06,-6e-06,4.2e-05,2e-06,-1e-05,-2.1e-05,-4.8e-05,-6e-06,-2.4e-05,5.9e-05,4.7e-05,8.7e-05,-4.2e-05,1e-06,-1e-06,2.9e-05,-2.7e-05,-4e-06,0.000104,5e-06,-1.2e-05,-3e-06,2.7e-05,-3e-05,2e-06,1.7e-05,-2.7e-05,4e-06,2e-06,-1.7e-05,-1e-06,-9e-06,-1.2e-05,2.8e-05,0,-5e-06,-4e-06,1.2e-05,1e-06,-6e-06,-5e-05,5e-06,-1.3e-05,1.4e-05,-2.4e-05,-1.6e-05
4e-06,-8e-06,-7e-06,2e-06,4e-06,-2e-06,-1e-06,-6e-06,-2.1e-05,8e-06,-1e-06,-3.1e-05,2.4e-05,-1.6e-05,3.5e-05,2.7e-05,-1.7e-05,2.2e-05,4.4e-05,-1.4e-05,1.7e-05,1e-05,-2.4e-05,-3.4e-05,-5e-06,7.6e-05,-2.2e-05,8e-06,1.3e-05,0.000151,-3.3e-05,-0.000101,0.000128,0.000138,7e-06,-0.000225,-7.4e-05,0.00014,0.000143,-3.9e-05,0.000127,-0.000179,-0.000139,-0.000109,0.000184,0.000381,1.7e-05,-3.2e-05,-9.4e-05,-0.000302,-5.2e-05,3.8e-05,3.8e-05,4.2e-05,0.000125,-2.2e-05,-0.000116,0.000146,-8e-06,1.5e-05,5.2e-05,-0.000109,-0.000134,-1.4e-05,-0.000193,1.1e-05,-1e-06,-1.7e-05,-1.4e-05,-5.6e-05,-2.6e-05,-2.6e-05,6e-06,1e-05,-1.9e-05,-5.7e-05,6e-06,4e-06,-1.5e-05,-2e-05,1.5e-05,1.2e-05,-9e-06,7.3e-05,-1e-06,-1.6e-05,-0.000111,-4.6e-05,-3e-06,6e-06,-2.2e-05,2.3e-05,-3.5e-05,2.6e-05,-2.6e-05,-1.1e-05,-2e-06,-1.3e-05,1.1e-05,-1.9e-05,-7e-06,1.8e-05,-1e-06,9e-06,4e-06,-1e-05,1e-06,-7e-06,-3e-06,-1.7e-05,-2.6e-05,-8e-06,1e-06,-4e-06,1.2e-05,6e-06,-2.1e-05,8e-06,-2e-06,-4e-06,1.8e-05
-2e-06,5e-06,6e-06,-8e-06,-1e-05,6e-06,-2e-06,6e-06,1.3e-05,-5e-06,1.6e-05,9e-06,-4e-06,2.2e-05,6e-06,-2.9e-05,5.6e-05,4.9e-05,-7e-06,-2.3e-05,-3e-06,-2e-06,1.6e-05,1.2e-05,1.3e-05,4e-05,1.5e-05,-1.7e-05,3.1e-05,0.000281,0.00031,0.000161,-0.000434,-0.000149,-3.7e-05,0.000214,0.000227,8.2e-05,-0.000262,0.000215,-0.000174,-0.000244,-0.000188,-0.00017,-0.000139,-0.000123,-0.000145,-0.000153,-0.000123,0.000182,8e-05,0.000107,2.7e-05,-7.2e-05,-5.9e-05,-4.2e-05,-1.6e-05,7.4e-05,-2e-06,-3.5e-05,5.1e-05,0.000137,5.2e-05,3e-06,0.000145,-1e-05,2e-05,2.1e-05,-7.3e-05,4.3e-05,-9e-06,3e-06,3e-06,0,-1e-06,4.6e-05,-2.5e-05,-3.5e-05,-2.6e-05,-2e-06,-8e-06,-1.3e-05,1.1e-05,-3.5e-05,-3.3e-05,1.7e-05,-3e-05,-4e-06,-4e-06,-4.1e-05,1.7e-05,-2.1e-05,3e-05,-3.1e-05,9e-06,-4e-06,-1.7e-05,-2e-06,-2.1e-05,1e-05,5e-06,2e-06,-4e-06,-3e-06,0,6e-06,8e-06,1.7e-05,-1.3e-05,-1e-05,1.2e-05,9e-06,2e-06,7e-06,-8e-06,-3e-06,-8e-06,-1e-05,-9e-06,1.9e-05,-4e-06
3e-06,-8e-06,5e-06,5e-06,-4e-06,3e-06,1.6e-05,1.4e-05,1e-06,0,-9e-06,-1.4e-05,-8e-06,-2e-06,-2.4e-05,2e-05,-6e-06,-2.2e-05,-4.9e-05,2e-05,1.9e-05,-2e-05,1.8e-05,-3e-05,-2e-06,-1e-05,5e-06,-7e-06,3e-05,0.000259,6.6e-05,0.000113,0.000141,7.5e-05,-2e-06,7.2e-05,-2e-04,-0.000314,0.000356,-2e-05,0.000581,0.000299,-7.4e-05,3.3e-05,-1e-06,0.000106,-8.9e-05,-4.8e-05,-4.3e-05,-0.000108,1.4e-05,-9.2e-05,-6.1e-05,2.1e-05,-5.9e-05,9.1e-05,0.000172,-0.000153,4.4e-05,0.000139,-5e-05,-1.8e-05,-2e-06,1.4e-05,-3.9e-05,6.7e-05,1.4e-05,-2e-05,4.5e-05,0,-1.4e-05,3.9e-05,-9e-06,1.5e-05,-3e-06,3e-06,3e-06,-1.2e-05,3.4e-05,4e-06,2.8e-05,3.2e-05,-3e-06,-2.3e-05,-5.5e-05,-1.1e-05,-1e-06,-3e-06,-4e-06,1.8e-05,4e-06,-1.7e-05,-2e-06,-6.2e-05,2.7e-05,-1.7e-05,1.5e-05,6e-06,3e-06,-1.2e-05,-8e-06,7e-06,3e-06,-1e-06,0,6e-06,-3e-06,-6e-06,-6e-06,-5e-06,-2.4e-05,-1e-06,-1e-06,-1e-05,1.4e-05,-6e-06,-1e-05,0,-1e-05,3e-06,-3e-06
-3e-06,-1e-06,-2.2e-05,2e-06,8e-06,-6e-06,-1.8e-05,6e-06,-6e-06,-4e-06,-2e-06,2.1e-05,-1e-06,-1.4e-05,3.6e-05,-1e-05,7e-06,-2.3e-05,6.1e-05,4e-06,-3.5e-05,2e-06,-2.5e-05,2.9e-05,1e-06,1.8e-05,4e-06,-3e-06,-5.6e-05,1.7e-05,3.5e-05,-9.5e-05,-5.9e-05,0.00031,-3.3e-05,0.000307,0.000211,-0.000254,-9.4e-05,-6.3e-05,-0.000364,5.7e-05,-5.6e-05,7.3e-05,-7.2e-05,-8.9e-05,-4e-05,1e-06,-0.000112,5.3e-05,-3.3e-05,-0.000131,0.00011,-0.000123,2.8e-05,-2.3e-05,-0.000276,0.000133,-2e-05,-0.000178,3.4e-05,1.9e-05,2.1e-05,5.2e-05,4e-06,-7.1e-05,-1.6e-05,-1.2e-05,3.3e-05,6.4e-05,7.5e-05,9e-06,-7e-06,2e-06,2.6e-05,4e-06,2.1e-05,2.9e-05,1e-06,-9e-06,-6e-06,7e-06,-2.3e-05,-8e-06,-4.3e-05,-1.1e-05,-2e-06,-1.5e-05,-4e-06,-2.1e-05,-9e-06,4.6e-05,-1.3e-05,-3.6e-05,4.1e-05,-1.2e-05,-1e-06,1e-05,-4e-06,1e-05,6e-06,-2e-06,6e-06,-7e-06,7e-06,-7e-06,-4e-06,6e-06,-1.5e-05,-2e-06,7e-06,-4e-06,-4e-06,5e-06,-6e-06,1.3e-05,1.5e-05,1e-06,5e-06,-4e-06,3e-06
2e-06,1.5e-05,1.2e-05,-1e-05,1.1e-05,6e-06,5e-06,2e-06,1.2e-05,1e-06,-3e-06,0,2e-06,3e-06,-4.2e-05,2e-06,-3.7e-05,2.1e-05,5e-06,7e-06,1.2e-05,-8e-06,-7e-06,-7e-06,0,-1.8e-05,-3e-06,-1e-06,3.1e-05,-0.000162,-0.000154,-0.000249,3e-06,-2.3e-05,0.000102,-9.4e-05,-0.000363,5.7e-05,-0.000155,0.000102,-4.6e-05,-7.6e-05,0.000152,-9.7e-05,0.00015,-0.000155,-8e-06,0.000198,-7.6e-05,-4e-05,-8.8e-05,1.1e-05,-0.000113,5e-05,-3.3e-05,-0.000115,0.000112,-5.1e-05,-5e-06,9.5e-05,-8.9e-05,-4.9e-05,3.6e-05,-8e-06,3.4e-05,3e-06,-6e-06,-1.8e-05,-4.2e-05,-5e-05,-7e-06,5e-06,1e-05,-8e-06,-3.2e-05,-4.9e-05,0,-8e-06,-1e-06,1e-06,6e-06,-5e-06,1.7e-05,4.1e-05,6e-06,9e-06,4.3e-05,3.7e-05,-2e-06,3.5e-05,5e-06,-3.9e-05,-1.7e-05,3.1e-05,2.2e-05,1e-06,-4e-06,-1.3e-05,-6e-06,2e-06,-1.4e-05,2.3e-05,1e-06,-2e-06,-5e-06,1e-06,1.4e-05,-6e-06,1.2e-05,-4e-06,-7e-06,0,2e-06,-3e-06,-3e-06,-1.1e-05,8e-06,-7e-06,2e-06,3e-06,-4e-06
-2e-06,-4e-06,1.4e-05,5e-06,2e-06,-4e-06,7e-06,-1.3e-05,-1.5e-05,2e-06,1.2e-05,1.2e-05,1e-06,1.1e-05,2.3e-05,-1.5e-05,4e-06,-8e-06,-1.7e-05,-2.3e-05,6e-06,1.4e-05,1.3e-05,1.3e-05,-1e-05,-2.6e-05,1.2e-05,-1.1e-05,-1.2e-05,-0.000129,1.8e-05,-7.6e-05,0.000403,-0.000239,-0.000143,-0.000307,6.2e-05,-9.9e-05,0.000274,-4.9e-05,0.000209,-1.9e-05,0.000109,-5.2e-05,-8.5e-05,0.000109,-0.000129,-0.000159,9.8e-05,-0.000101,5.1e-05,0.000119,8.9e-05,-8e-05,6.6e-05,5.1e-05,-7e-05,-8.4e-05,2.6e-05,-4.4e-05,9.6e-05,-3.5e-05,2.1e-05,-3.4e-05,-6.7e-05,3.6e-05,1.6e-05,3.2e-05,4e-05,-1.9e-05,4.2e-05,-6e-06,-1.2e-05,-1e-05,4e-06,2.1e-05,-1.3e-05,-1e-06,-1.5e-05,1.6e-05,7e-06,-1.9e-05,1e-05,1.5e-05,-4e-06,-4e-06,2.1e-05,2.1e-05,-1e-06,6e-06,-1.5e-05,1.4e-05,4.6e-05,1.9e-05,3.4e-05,-6e-06,-1.4e-05,-3e-06,4e-06,0,-8e-06,0,-3e-06,0,2e-06,4e-06,-3e-06,-2e-06,5e-06,0,-1.3e-05,3e-06,-5e-06,2e-06,1e-06,4e-06,-5e-06,-4e-06,-2e-06,6e-06,3e-06
-1e-06,-4e-06,-1.4e-05,0,-6e-06,-1e-06,-5e-06,-1.1e-05,9e-06,-1e-06,-1.6e-05,2e-06,1e-06,-7e-06,-6e-06,1.7e-05,1.9e-05,-1.1e-05,1.7e-05,0,6e-06,-6e-06,-1e-06,-2.5e-05,5e-06,-4e-06,9e-06,4e-06,2.5e-05,-9.6e-05,7.4e-05,0.000129,-0.000369,9.7e-05,9.1e-05,-0.000163,-1.1e-05,0.000134,-0.000362,-2e-05,-0.000332,-3.5e-05,-3.3e-05,2.9e-05,1.6e-05,-5.8e-05,6e-05,0.00029,5.8e-05,0.000221,2.9e-05,8.5e-05,-2e-05,5.9e-05,-2.1e-05,8.2e-05,-1e-06,9.3e-05,7e-05,-2e-06,-7.2e-05,6.3e-05,2.6e-05,2.4e-05,1e-06,-3.2e-05,-6e-06,9e-06,3.5e-05,-2.3e-05,3e-05,-1.7e-05,-8e-06,-1e-05,6e-06,-5e-06,-2e-06,-3e-06,1.1e-05,-7e-06,-1e-06,-1.8e-05,-1.4e-05,-1.8e-05,2.3e-05,4e-06,-3.2e-05,5e-06,-2e-06,-4.2e-05,1.8e-05,6e-06,-3.7e-05,1.6e-05,-1e-05,-5e-06,1.5e-05,1.2e-05,-1e-05,3e-06,1.1e-05,8e-06,-1e-06,5e-06,-8e-06,-3e-06,-9e-06,7e-06,1e-05,1e-06,6e-06,1.2e-05,7e-06,-3e-06,-2e-06,3e-06,-4e-06,-3e-06,5e-06,2e-06,-2e-06
-1e-06,0,1e-06,-4e-06,-7e-06,0,-6e-06,-5e-06,-6e-06,2e-06,1.2e-05,9e-06,-8e-06,-3e-06,2e-06,-9e-06,1.9e-05,1.8e-05,-2.4e-05,1.6e-05,-8e-06,1.1e-05,-6e-06,1e-05,-1.1e-05,8e-06,-1e-06,-2e-06,-7e-06,-0.00012,-3.1e-05,8.8e-05,0.000189,-0.000166,-0.000111,6e-06,-9.9e-05,-7e-05,0.000231,8.4e-05,0.000323,-2e-06,6.4e-05,0.000112,-5.7e-05,-2.9e-05,-2.1e-05,-0.00021,-2.8e-05,-0.000203,-3.5e-05,-5.6e-05,-4e-06,4.7e-05,3e-06,1e-06,4e-05,-3.3e-05,-8e-06,-6.4e-05,3.3e-05,5e-06,-7e-06,-1e-05,3.4e-05,7e-06,4e-06,1e-06,-5.5e-05,3.5e-05,-4.3e-05,-2e-05,9e-06,5e-06,8e-06,2.2e-05,1.2e-05,-6e-06,1.1e-05,4e-06,-6e-06,1.9e-05,3e-06,-1.9e-05,0,-1e-06,-3.6e-05,2.1e-05,0,3.2e-05,-1.4e-05,-1e-05,2e-05,1e-05,-5e-06,3e-06,-4e-06,-1.8e-05,4e-06,-1e-06,1e-06,-5e-06,0,1e-06,6e-06,-2e-06,-2e-06,-6e-06,1e-06,5e-06,-5e-06,-2e-06,0,2e-06,1e-06,-1.7e-05,-5e-06,6e-06,3e-06,-1e-06,1e-06
-1e-06,0,2e-06,3e-06,1e-06,3e-06,9e-06,-2e-06,6e-06,-5e-06,-5e-06,-1.3e-05,2e-06,6e-06,1e-06,-1e-06,-7e-06,3e-06,1.2e-05,-7e-06,-1.2e-05,-1e-05,-1e-06,-5e-06,1e-05,-2e-06,-2e-06,-6e-06,-1e-05,1.8e-05,1.7e-05,-5.5e-05,-7.4e-05,-2.8e-05,9.9e-05,4.3e-05,2.8e-05,-0.000153,-0.000172,-6.7e-05,-0.000154,-9.2e-05,7e-06,-9.5e-05,3.2e-05,0.000107,-1.1e-05,4.8e-05,9.3e-05,0.000124,3.1e-05,-5.5e-05,4.3e-05,-1.5e-05,5.5e-05,-3.5e-05,-5.9e-05,-3.3e-05,-1.7e-05,6.5e-05,-2.1e-05,5e-06,-5.4e-05,-2.3e-05,-1.3e-05,1.7e-05,-5e-06,-2e-06,-3.3e-05,1.4e-05,0,-1.3e-05,-9e-06,6e-06,-1e-06,-2e-05,-1e-05,-1.1e-05,-5e-06,5e-06,-4e-06,5e-06,8e-06,-1e-06,-1.1e-05,0,4e-05,3.8e-05,0,-4.3e-05,-2e-06,8e-06,-8e-06,-1.3e-05,-1.7e-05,-2e-06,-9e-06,2.2e-05,-1e-05,-2e-06,-1e-05,4e-06,1e-06,1e-06,2e-06,2e-06,4e-06,4e-06,-7e-06,7e-06,3e-06,3e-06,-5e-06,0,4e-06,2e-06,4e-06,-5e-06,-6e-06,2e-06,1e-06
1e-06,-6e-06,9e-06,2e-06,4e-06,-4e-06,-1e-06,8e-06,-4e-06,1e-06,2e-06,-3e-06,1e-06,0,-4e-06,5e-06,-2e-06,-2e-05,1e-05,9e-06,1.7e-05,4e-06,1.1e-05,1.6e-05,4e-06,1.1e-05,5e-06,3e-06,1.2e-05,0.000179,-3.5e-05,-2.3e-05,-0.000168,0.000123,-4.5e-05,0.00018,-7.3e-05,-6.8e-05,-4.9e-05,-3.8e-05,7e-05,-0.000107,1.2e-05,-3.9e-05,1.7e-05,1.2e-05,1.8e-05,-0.000112,-3.6e-05,-8.2e-05,-7e-06,-2.3e-05,-5.8e-05,-1e-05,-2.6e-05,3e-06,6.2e-05,6.8e-05,-4.2e-05,-3e-05,-9e-06,-4.1e-05,-1e-05,0,-9e-06,1.7e-05,2e-06,-4e-06,1.9e-05,2e-06,-2e-05,-2e-06,-5e-06,4e-06,-8e-06,-5e-06,-1e-05,1.9e-05,1e-06,2e-06,-1e-05,1.1e-05,-8e-06,2.3e-05,-2.3e-05,5e-06,-7e-06,2e-06,1e-06,5.7e-05,8e-06,-1.4e-05,9e-06,-2e-06,5e-06,-1e-06,6e-06,-1.4e-05,1e-06,-1e-06,-1e-06,-8e-06,-2e-06,2e-06,0,0,1e-06,-2e-06,-3e-06,4e-06,-5e-06,1e-06,2e-06,1e-06,-5e-06,-2e-06,-1e-06,-1e-06,-4e-06,2e-06,2e-06
0,9e-06,-6e-06,-4e-06,2e-06,1e-06,-7e-06,1.1e-05,4e-06,-1e-06,-4e-06,-1.3e-05,2e-06,-6e-06,-2e-06,-1e-05,-2.4e-05,1e-06,-2.6e-05,-1.3e-05,-3e-06,-8e-06,2e-06,-1.2e-05,5e-06,1.1e-05,0,-2e-06,-7e-06,0.000127,0,-4e-05,0.000151,-2.1e-05,6e-06,-6.9e-05,9.7e-05,-1.2e-05,6.4e-05,6.5e-05,-0.000133,-2.3e-05,4.8e-05,4.6e-05,-2.4e-05,-0.000137,-3.5e-05,8.9e-05,-5e-06,6e-06,5e-06,-3.6e-05,4.9e-05,-4.8e-05,5.4e-05,-1e-06,2.7e-05,-0.00012,-3.6e-05,-2.3e-05,3e-05,-8e-06,4.7e-05,1.4e-05,3.3e-05,-2.9e-05,8e-06,1.7e-05,8e-06,-1.7e-05,-3.7e-05,-5e-06,1.2e-05,0,2e-06,-1.1e-05,1.3e-05,4e-06,2e-06,-1e-06,-2e-06,-9e-06,0,1e-06,-1.6e-05,-5e-06,-5.3e-05,5e-06,0,-4.5e-05,-7e-06,1.8e-05,-1e-05,-3.5e-05,-3e-06,2e-06,0,0,-3e-06,-2e-06,5e-06,-3e-06,-2e-06,-3e-06,-2e-06,0,-3e-06,0,-7e-06,1e-06,7e-06,3e-06,-2e-06,-1e-06,3e-06,-8e-06,3e-06,1e-06,3e-06,0,-2e-06
1e-06,0,-6e-06,2e-06,-4e-06,-1e-06,7e-06,8e-06,-3e-06,2e-06,7e-06,0,-4e-06,8e-06,7e-06,1.1e-05,-6e-06,9e-06,1.6e-05,3e-06,2e-06,1e-06,-1.3e-05,5e-06,4e-06,-2.1e-05,-6e-06,-2e-06,1.5e-05,2.3e-05,-2.2e-05,5e-06,-8.7e-05,5.5e-05,3.5e-05,-3.3e-05,2e-05,4e-06,-0.000188,-7.7e-05,0.000172,-5.1e-05,3.6e-05,8.9e-05,1.8e-05,2.6e-05,3e-05,-9.8e-05,7.1e-05,-4e-06,-2.6e-05,1e-05,-4.4e-05,9e-06,-5.4e-05,-1.8e-05,-7.4e-05,0.000176,-7e-06,1.6e-05,-2.8e-05,2.5e-05,3e-06,-1.6e-05,-5.4e-05,1e-06,-4e-06,-1e-05,-2e-06,-1.4e-05,2.9e-05,-8e-06,0,1e-06,1.1e-05,1.9e-05,5e-06,-2e-05,2e-06,2e-06,6e-06,-8e-06,8e-06,-1.2e-05,-8e-06,1e-06,4.4e-05,3e-06,0,3.5e-05,8e-06,-1e-05,8e-06,-1e-06,1e-06,4e-06,1e-06,6e-06,-2e-06,-2e-06,-1.2e-05,-4e-06,-2e-06,-2e-06,2e-06,0,3e-06,4e-06,3e-06,-4e-06,4e-06,-5e-06,2e-06,0,-2e-06,8e-06,4e-06,-3e-06,1e-06,0,0
0,0,9e-06,2e-06,-5e-06,4e-06,1e-06,1e-06,-2e-06,0,-5e-06,-8e-06,-2e-06,-2e-06,-8e-06,-8e-06,-4e-06,-5e-06,1.3e-05,-5e-06,-8e-06,-1e-06,3e-06,-1e-05,-2e-06,0,-3e-06,1e-06,-1.1e-05,7e-06,-2.3e-05,2e-06,0.000147,1.8e-05,-4.4e-05,-0.000118,9.8e-05,0.000107,0.000165,-1.5e-05,3.3e-05,5.4e-05,7.7e-05,-5e-05,-9e-06,-3.2e-05,8e-06,0.000194,-5.4e-05,-1.2e-05,-7e-06,3.9e-05,2.4e-05,2.5e-05,4.6e-05,-5e-06,1e-04,-0.000157,2.6e-05,-5e-06,2.2e-05,-1e-06,-4.3e-05,-7e-06,3.7e-05,2e-05,-5e-06,1e-06,6e-06,1.9e-05,-1.6e-05,-4e-06,-1.4e-05,0,-7e-06,-1e-06,-1e-05,1.2e-05,-2e-06,-1e-06,-6e-06,-2e-06,-6e-06,-1.1e-05,0,0,2.5e-05,-1.2e-05,0,-2.4e-05,-7e-06,-4e-06,-1.3e-05,1.9e-05,5e-06,5e-06,-5e-06,-4e-06,-1e-06,3e-06,3e-06,0,-1e-06,-2e-06,-3e-06,0,3e-06,-5e-06,4e-06,-4e-06,-3e-06,-3e-06,0,-1e-06,-1e-06,-5e-06,-1e-06,-1e-06,-1e-06,0,-3e-06
1e-06,-3e-06,-1e-06,-5e-06,-1e-06,-5e-06,-4e-06,-3e-06,4e-06,-1e-06,0,1e-06,1e-06,-4e-06,1e-05,3e-06,4e-06,3e-06,-3.1e-05,1.5e-05,3e-06,3e-06,9e-06,1e-05,-9e-06,-8e-06,1e-06,-1e-06,5e-06,-4.8e-05,1.8e-05,9e-06,-0.000115,2.3e-05,4.6e-05,-8.3e-05,-1.5e-05,-0.000124,-0.000118,5.4e-05,-0.000188,-3e-05,9e-06,-7.7e-05,-2.2e-05,-2.9e-05,-7e-06,-0.000161,-6.8e-05,5.8e-05,2e-06,3e-06,-1.7e-05,1.9e-05,-1.3e-05,7e-06,-8.2e-05,7.4e-05,7e-06,-2.3e-05,-1.1e-05,6e-06,7e-06,8e-06,-4e-06,-9e-06,1.1e-05,-3e-06,2e-06,8e-06,2.7e-05,0,6e-06,-1e-06,-7e-06,-7e-06,-1e-06,-8e-06,-4e-06,-2e-06,1.1e-05,0,-4e-06,8e-06,4e-06,-1e-06,-2e-05,-1.5e-05,-1e-06,7e-06,3e-06,1.3e-05,1.7e-05,1.4e-05,9e-06,4e-06,3e-06,3e-06,-3e-06,-2e-06,3e-06,-5e-06,0,2e-06,-1e-06,0,-5e-06,3e-06,5e-06,-4e-06,8e-06,1e-06,-1e-06,0,3e-06,0,-2e-06,-1e-06,1e-06,3e-06,1e-06
0,2e-06,-5e-06,5e-06,3e-06,1e-06,-1e-06,-5e-06,-5e-06,-1e-06,4e-06,-2e-06,3e-06,2e-06,-1.4e-05,-2e-06,1.5e-05,1e-05,1.4e-05,-3e-06,1e-06,1e-06,-3e-06,-5e-06,2e-06,-1.2e-05,-1e-06,-1e-06,-1e-06,-0.000141,2e-05,1e-06,5.3e-05,-1.5e-05,-5.9e-05,0.000135,6.8e-05,-6e-05,1e-05,-6.8e-05,0.000167,-0.000114,-3.1e-05,4.3e-05,4e-06,7.3e-05,1e-06,0.00011,-4e-06,-7.4e-05,1.2e-05,-2e-05,-6e-06,0,1.9e-05,2e-05,5.4e-05,3.4e-05,1.6e-05,-1.2e-05,-7e-06,-2.4e-05,2.9e-05,-2e-06,-1.3e-05,-1.1e-05,-2e-06,4e-06,-2.1e-05,1e-06,2.9e-05,-2e-06,1.4e-05,-5e-06,3e-06,-1.5e-05,5e-06,-5e-06,1e-06,-1e-06,-6e-06,1e-05,6e-06,1.6e-05,-4e-06,2e-06,-1.6e-05,-3e-06,-1e-06,4e-06,3e-06,-1.2e-05,-7e-06,1.2e-05,3e-06,4e-06,-4e-06,-5e-06,1e-06,4e-06,-4e-06,-2e-06,-1e-06,0,3e-06,1e-06,-2e-06,-3e-06,2e-06,-2e-06,1e-06,-1e-06,3e-06,1e-06,-1e-06,3e-06,-3e-06,2e-06,2e-06,1e-06,-1e-06
0,-4e-06,3e-06,-3e-06,3e-06,0,7e-06,-8e-06,5e-06,-1e-06,-4e-06,7e-06,0,3e-06,1.2e-05,0,-1e-06,-5e-06,8e-06,-9e-06,5e-06,-1e-06,-6e-06,7e-06,1e-06,6e-06,-5e-06,0,1e-06,-9.1e-05,3.1e-05,-1.1e-05,-1.1e-05,-8.3e-05,4.9e-05,5e-06,-8.9e-05,-8.6e-05,7e-06,4e-06,-0.000164,1.5e-05,-2.3e-05,3.8e-05,1.4e-05,-3e-06,2e-05,-0.000105,-1e-05,9.1e-05,4e-06,2e-06,2.2e-05,-3e-05,-2.7e-05,1e-05,-3.3e-05,-7.5e-05,-7e-06,2.5e-05,2.3e-05,8e-06,-1.3e-05,5e-06,1.3e-05,1e-05,-5e-06,0,-4e-06,-2.4e-05,-9e-06,7e-06,-2e-06,-4e-06,2e-06,8e-06,-3e-06,1.6e-05,6e-06,1e-06,5e-06,2e-06,0,-8e-06,-6e-06,-1e-06,1.4e-05,-1.2e-05,-1e-06,-8e-06,-6e-06,5e-06,-5e-06,-1.7e-05,0,2e-06,5e-06,7e-06,-4e-06,0,-5e-06,0,-1e-06,1e-06,0,-1e-06,2e-06,1e-06,-4e-06,0,0,-1e-06,-2e-06,-1e-06,0,-1e-05,-4e-06,-2e-06,-2e-06,-2e-06,2e-06
0,4e-06,2e-06,0,0,2e-06,-7e-06,-5e-06,-4e-06,1e-06,1e-06,-4e-06,-2e-06,-3e-06,-7e-06,0,3e-06,-7e-06,-1.6e-05,0,-7e-06,-1e-06,-2e-06,-8e-06,0,5e-06,1e-06,0,5e-06,2.2e-05,-2.1e-05,8e-06,-8.9e-05,1.7e-05,-3.2e-05,2.4e-05,-1.3e-05,-2.1e-05,2e-06,4.1e-05,0.00019,-3.7e-05,-2.3e-05,-5e-06,-5e-06,4e-06,1.2e-05,3.2e-05,1.2e-05,-8.5e-05,-1e-05,2.9e-05,-2.8e-05,-1.9e-05,9e-06,-1.1e-05,1e-05,6.5e-05,1.4e-05,-4.3e-05,-2.7e-05,1.9e-05,-2.1e-05,-5e-06,-9e-06,4e-06,5e-06,-5e-06,1.1e-05,-3e-06,1.1e-05,9e-06,-8e-06,-3e-06,5e-06,6e-06,-2e-06,-1e-06,-2e-06,-3e-06,2e-06,0,-4e-06,-8e-06,-1.4e-05,1e-06,-5e-06,-1.5e-05,-1e-06,1.8e-05,5e-06,0,1.4e-05,-1.2e-05,-3e-06,2e-06,-3e-06,-1.1e-05,-1e-06,1e-06,1e-06,0,-1e-06,0,-1e-06,0,2e-06,2e-06,-2e-06,1e-06,7e-06,2e-06,1e-06,1e-06,0,4e-06,7e-06,-1e-06,-3e-06,2e-06,0
-1e-06,1e-06,0,1e-06,-2e-06,-2e-06,1e-06,3e-06,2e-06,0,0,2e-06,0,1e-06,3e-06,1e-06,-2e-06,3e-06,1.1e-05,0,2e-06,-3e-06,6e-06,5e-06,1e-06,0,0,0,-6e-06,4e-05,-2.4e-05,-2e-05,0.000107,5e-05,2.9e-05,-1.2e-05,-4.2e-05,2.6e-05,2.1e-05,-5.2e-05,-0.000106,7e-06,-2.7e-05,-7.7e-05,1e-06,6.1e-05,-2.5e-05,-4.8e-05,6e-05,6.6e-05,1.1e-05,1.5e-05,2.4e-05,-4e-06,0,-1.2e-05,-2.2e-05,-1.7e-05,-5e-06,1.8e-05,2.8e-05,-4e-06,1.2e-05,9e-06,-4e-06,-5e-06,-3e-06,-5e-06,2e-06,9e-06,-9e-06,5e-06,-3e-06,3e-06,-7e-06,2e-06,3e-06,-1.5e-05,0,-2e-06,-8e-06,-9e-06,4e-06,-5e-06,-9e-06,0,-1.7e-05,-5e-06,-1e-06,-2.3e-05,-4e-06,-1e-06,-1.1e-05,-2e-06,-7e-06,1e-06,-2e-06,1.1e-05,-2e-06,0,1e-06,2e-06,0,0,1e-06,1e-06,-1e-06,-3e-06,-4e-06,2e-06,-6e-06,5e-06,1e-06,-1e-06,-1e-06,-2e-06,-4e-06,-1e-06,1e-06,2e-06,1e-06
0,1e-06,-5e-06,0,-1e-06,1e-06,3e-06,7e-06,-2e-06,1e-06,1e-06,-5e-06,2e-06,0,0,-1e-06,8e-06,0,-3e-06,8e-06,1e-06,1e-06,2e-06,-6e-06,-4e-06,2e-06,1e-06,0,5e-06,5.2e-05,8e-06,-2.7e-05,-7.2e-05,-3.7e-05,-1.6e-05,-8.3e-05,-3.5e-05,3.9e-05,-7.5e-05,1.6e-05,4.5e-05,5.6e-05,-1e-05,3.5e-05,-8e-06,-4e-05,1.9e-05,9.1e-05,-2.8e-05,-4e-05,-6e-06,-2.7e-05,-2.2e-05,1.7e-05,6e-06,0,-4e-06,-2.1e-05,1.1e-05,-1.6e-05,-2.8e-05,2e-06,-2e-06,4e-06,1.1e-05,-1.4e-05,2e-06,4e-06,-5e-06,1.5e-05,-3e-05,-1e-06,4e-06,4e-06,2e-06,-1.2e-05,1e-06,7e-06,-3e-06,2e-06,2e-06,-3e-06,-1e-06,1.1e-05,-5e-06,-1e-06,3e-05,-3e-06,-1e-06,1.4e-05,2e-06,0,5e-06,-5e-06,-4e-06,0,4e-06,-5e-06,0,-1e-06,-5e-06,1e-06,0,0,0,-1e-06,-1e-06,3e-06,2e-06,2e-06,6e-06,2e-06,-1e-06,0,0,-6e-06,5e-06,0,1e-06,0,0
0,-3e-06,4e-06,-2e-06,1e-06,-1e-06,1e-06,6e-06,1e-06,-1e-06,-3e-06,1e-06,4e-06,1e-06,-5e-06,-1e-06,4e-06,-2e-06,-5e-06,0,3e-06,-1e-06,-7e-06,7e-06,-4e-06,1e-06,-2e-06,0,-2e-06,0.000109,1.5e-05,2.4e-05,6.8e-05,1.6e-05,-4e-06,1.5e-05,2.8e-05,-7.8e-05,4.4e-05,4.5e-05,-5e-05,-2.2e-05,3.7e-05,5.4e-05,5e-06,-1.4e-05,5e-06,-7.2e-05,-1e-05,6e-06,-1.2e-05,-3e-05,1.5e-05,1e-05,-2.6e-05,3e-06,-1e-05,2.8e-05,-1.5e-05,1.9e-05,1.6e-05,-2.2e-05,-1.2e-05,-8e-06,-5e-06,1.1e-05,0,2e-06,7e-06,2e-06,5e-06,-1e-06,9e-06,3e-06,4e-06,-5e-06,-2e-06,-2e-06,5e-06,-1e-06,-9e-06,3e-06,-2e-06,9e-06,0,1e-06,-1.6e-05,-3e-06,0,-9e-06,-1e-06,-3e-06,-4e-06,8e-06,-7e-06,0,-1e-06,-3e-06,-3e-06,0,0,2e-06,0,-2e-06,-1e-06,0,1e-06,-2e-06,3e-06,2e-06,-5e-06,0,0,-1e-06,-1e-06,6e-06,-6e-06,-1e-06,0,0,-1e-06
0,2e-06,2e-06,2e-06,2e-06,1e-06,-7e-06,3e-06,0,-1e-06,4e-06,-4e-06,-3e-06,-3e-06,7e-06,1e-06,0,3e-06,1.6e-05,-7e-06,-2e-06,3e-06,1e-06,-6e-06,2e-06,-6e-06,2e-06,0,2e-06,6.8e-05,9e-06,1.8e-05,-1e-05,5.1e-05,1.2e-05,-1e-05,-3.6e-05,-6.1e-05,-5.4e-05,-4.9e-05,-3.7e-05,-9e-06,6e-06,-1.9e-05,4e-06,1.6e-05,-7e-06,0.000109,4.9e-05,2.8e-05,1e-06,-1e-06,-1e-06,9e-06,2e-06,1e-06,4e-05,1.3e-05,-7e-06,-4.6e-05,-2e-06,8e-06,1e-06,0,-7e-06,1.3e-05,-3e-06,-3e-06,0,-1.2e-05,-2.1e-05,-6e-06,-1e-06,0,0,3e-06,-2e-06,-1e-06,-2e-06,-1e-06,3e-06,6e-06,2e-06,-1.2e-05,1e-06,0,-2e-05,4e-06,0,9e-06,-1e-06,6e-06,6e-06,8e-06,-1e-06,-1e-06,-2e-06,7e-06,-1e-06,-1e-06,2e-06,0,0,0,2e-06,0,-1e-06,0,3e-06,1e-06,2e-06,0,0,1e-06,1e-06,-5e-06,1e-06,-2e-06,0,1e-06,0
0,-3e-06,-4e-06,0,1e-06,-1e-06,8e-06,0,-1e-06,0,-3e-06,2e-06,0,4e-06,-7e-06,-2e-06,-5e-06,1e-06,-9e-06,0,-3e-06,-1e-06,4e-06,5e-06,0,-3e-06,1e-06,0,1e-06,-5e-05,-7e-06,-8e-06,-4.8e-05,-2.9e-05,-2.8e-05,1.5e-05,4.4e-05,-7e-05,7e-06,2.5e-05,0.00015,3e-05,-1e-05,-5.8e-05,-7e-06,-2.3e-05,-1e-06,-7.4e-05,7e-06,-5.8e-05,-1e-06,9e-06,-9e-06,2e-06,4e-06,-3e-06,-4.6e-05,-5.6e-05,-1.4e-05,3.8e-05,-7e-06,1.2e-05,1.5e-05,2e-06,9e-06,-1.9e-05,5e-06,1e-06,-1e-05,-1.1e-05,7e-06,-7e-06,-1.4e-05,-3e-06,-7e-06,9e-06,1e-06,8e-06,0,1e-06,3e-06,5e-06,0,-8e-06,-4e-06,0,3.1e-05,8e-06,0,-1e-06,2e-06,-3e-06,-9e-06,7e-06,-4e-06,-3e-06,-1e-06,-7e-06,-2e-06,1e-06,-4e-06,1e-06,0,1e-06,-1e-06,0,-2e-06,1e-06,2e-06,0,-2e-06,1e-06,0,-1e-06,0,0,-1e-06,2e-06,1e-06,1e-06,0
0,1e-06,0,-1e-06,-1e-06,1e-06,-1e-06,-5e-06,3e-06,0,1e-06,-2e-06,0,-1e-06,8e-06,1e-06,-3e-06,-1e-06,-1e-05,-2e-06,4e-06,1e-06,-1e-06,-6e-06,2e-06,9e-06,2e-06,0,-2e-06,-7.5e-05,-7e-06,-1.3e-05,0.00011,-3.1e-05,3.7e-05,3.5e-05,-1.1e-05,-9e-06,5e-06,3.7e-05,-0.000154,2.1e-05,-6e-06,0,8e-06,-8e-06,1.3e-05,3.6e-05,-3.9e-05,8.8e-05,4e-06,1e-05,2e-05,-1.7e-05,0,0,5.1e-05,7.7e-05,1.4e-05,-3.7e-05,1.7e-05,-8e-06,0,-1e-06,-1.3e-05,-2e-06,-1e-06,-6e-06,-1e-06,1e-06,2e-05,-7e-06,0,-1e-06,3e-06,-4e-06,1e-06,-1e-06,-2e-06,0,-1e-06,-5e-06,-2e-06,3e-06,-8e-06,0,-3e-06,9e-06,0,-5e-06,-3e-06,-3e-06,1.3e-05,-3e-06,5e-06,-2e-06,3e-06,5e-06,0,0,-4e-06,-2e-06,0,1e-06,1e-06,0,1e-06,-2e-06,-4e-06,-2e-06,-4e-06,-1e-06,1e-06,1e-06,-1e-06,4e-06,2e-06,-1e-06,-1e-06,0,0
