-0.000302,-0.000263,-2e-04,-0.00022,-0.000402,-0.000412,-2e-04,-0.000214,-0.000158,-9.8e-05,-0.000156,-0.000271,-0.000422,-0.000267,-0.000236,-0.000339,-0.000203,-0.000205,-0.000335,-0.000292,-0.000236,-0.000248,-0.00016,-0.000212,-0.000394,-0.000531,-0.000443,-0.000242
-0.000327,-0.000317,-0.000222,-0.000223,-0.000341,-0.000348,-0.00015,-0.000189,-0.000138,-6e-05,-4.5e-05,-0.000154,-0.000361,-0.000246,-0.000155,-0.000281,-0.000199,-0.000221,-0.000264,-0.000244,-0.000211,-0.000249,-0.000156,-0.000175,-0.00034,-0.000522,-0.000475,-0.000189
-0.000159,-8e-05,-0.000108,-0.000156,-0.000127,-2.7e-05,-4e-05,-5.7e-05,-4.2e-05,0,2.5e-05,1.8e-05,-9.8e-05,-0.000131,-0.000102,-4.1e-05,-0.000111,-7.8e-05,-2.4e-05,-3.5e-05,-7.1e-05,-0.000179,-0.000164,-0.000138,-9.6e-05,-5.5e-05,-0.000107,-5.1e-05
0.000223,0.000266,0.000165,0.000117,0.000307,0.000342,0.000134,0.000145,0.000112,0.000128,0.000166,0.000234,0.000359,0.000207,9e-05,0.000222,6.3e-05,0.000106,0.000203,0.000186,0.000129,9.5e-05,1.4e-05,3e-05,0.000189,0.000405,0.000352,0.000134
0.00035,0.000294,0.000206,0.00023,0.000481,0.000306,0.000158,0.000174,0.000129,0.000135,0.000148,0.000219,0.000418,0.000274,0.000164,0.000205,0.000109,8.8e-05,0.000164,0.000164,0.000186,0.000261,0.000175,0.000177,0.000287,0.000376,0.000364,0.000176
-3.9e-05,-3.1e-05,-8.2e-05,-7.3e-05,-9.6e-05,-0.000263,-0.000141,-0.000123,-9.6e-05,-7.4e-05,-0.000129,-0.000208,-0.000206,-0.000167,-0.000121,-0.000125,-0.000149,-0.000135,-0.000133,-0.000157,-3.6e-05,2.4e-05,3.8e-05,2.8e-05,-3.6e-05,-0.000176,-0.000173,-0.000113
-0.00026,-0.00023,-0.000187,-0.000203,-0.000428,-0.000406,-0.000246,-0.00029,-0.000224,-0.000176,-0.000143,-0.000334,-0.000473,-0.000339,-0.000225,-0.000175,-0.000225,-0.000202,-0.000242,-0.000304,-0.000177,-0.000151,-9.3e-05,-5.9e-05,-0.000182,-0.000382,-0.000417,-0.000233
-0.00011,-0.000116,-1.6e-05,-1.8e-05,-9.1e-05,5.4e-05,-5e-06,-8.2e-05,-9.1e-05,-9e-05,8.2e-05,2.8e-05,-0.000107,-0.00013,-6.7e-05,5.5e-05,-1.5e-05,-3.5e-05,-3.7e-05,-9.3e-05,-9.1e-05,-0.000122,-9.3e-05,4.3e-05,9.2e-05,1.1e-05,-8.5e-05,1.2e-05
7.7e-05,0.000114,0.000144,0.000115,0.000165,0.000272,0.000113,0.000147,9.8e-05,1.5e-05,0.00012,0.000243,0.000228,8.1e-05,3.8e-05,8.7e-05,4.8e-05,8.3e-05,0.000146,0.000132,5.6e-05,-2.5e-05,-1.8e-05,3.7e-05,0.000162,0.000292,0.000245,0.000158
0.000199,0.000185,0.000142,0.000124,0.000202,0.000106,4e-06,0.000116,0.000113,3e-05,-1e-05,0.000118,0.000301,0.000215,7.6e-05,-6.1e-05,-2.3e-05,1.3e-05,5.5e-05,0.00013,0.000117,0.00011,7.5e-05,-4.8e-05,-3.3e-05,0.000145,0.000219,6.4e-05
8.9e-05,3.3e-05,4e-06,5.9e-05,0.000138,-0.000103,-9.1e-05,-4.5e-05,-1.7e-05,-4.1e-05,-8.3e-05,-7.8e-05,5.3e-05,0.000103,2.3e-05,-0.000102,1.3e-05,-7.1e-05,-0.00011,1e-06,1.9e-05,8.1e-05,5.3e-05,-2.4e-05,-8.9e-05,-0.000122,-1.7e-05,-4.2e-05
-0.000177,-0.000137,-0.000152,-8.4e-05,-0.000112,-0.000211,-8.2e-05,-0.000115,-7.9e-05,-9.2e-05,-6.8e-05,-0.000142,-0.000278,-0.000123,-4.7e-05,2.2e-05,0.00011,1.6e-05,-4e-05,-7.3e-05,-7.2e-05,-4.6e-05,-3e-06,2.3e-05,-6.2e-05,-0.000198,-0.000183,-6.9e-05
-0.000208,-0.000145,-0.000139,-0.000124,-0.000183,-1.7e-05,5.8e-05,6e-06,-1.4e-05,-5.5e-05,1.6e-05,2.7e-05,-0.000152,-5e-05,5.8e-05,0.000174,0.000192,0.000169,0.000109,5e-06,1.8e-05,-8e-06,-6e-06,2.7e-05,6e-06,-3.4e-05,-0.00014,-1.2e-05
-4.1e-05,-9e-06,4.4e-05,-1.5e-05,3.6e-05,0.000247,0.000184,0.000153,3.3e-05,-2e-05,8.3e-05,0.000206,0.000181,0.000124,0.000138,0.000138,0.000149,0.000155,8.2e-05,0.000106,0.000106,4.2e-05,-2.4e-05,3.4e-05,9.1e-05,0.000117,2.7e-05,8.2e-05
0.000117,0.000152,0.000149,4e-05,9.6e-05,0.00012,0.000117,0.000131,3.9e-05,-1.2e-05,-1.9e-05,0.00012,0.000213,0.000124,5.2e-05,-0.000104,-4.3e-05,2.8e-05,1.9e-05,0.000101,5.5e-05,1.6e-05,-1.1e-05,-1.6e-05,1.8e-05,9.9e-05,0.000119,0.000102
0.000217,0.00017,9.4e-05,4.6e-05,-8e-06,-0.000126,-1.6e-05,-1e-06,3.8e-05,2.5e-05,-9.8e-05,-4.5e-05,8.9e-05,8.5e-05,-1.6e-05,-0.000214,-0.00014,-7.1e-05,-9e-06,4.9e-05,-2e-06,7.6e-05,5.6e-05,-5.3e-05,-3.7e-05,4.7e-05,9.6e-05,3.3e-05
6.1e-05,-1.5e-05,-2e-05,7.4e-05,-2.1e-05,-0.000126,-5.3e-05,-0.000119,-2.6e-05,1.8e-05,4e-06,-9.3e-05,-9.4e-05,-3.4e-05,-4.7e-05,-4.6e-05,-6.4e-05,-0.000106,-6.9e-05,-2.2e-05,-4.2e-05,6.4e-05,5.4e-05,1.8e-05,3.3e-05,-1.5e-05,6.7e-05,3e-06
-0.000215,-0.000186,-0.000101,2.7e-05,-4e-05,-1.3e-05,-1.9e-05,-0.000109,-4.8e-05,-3e-05,4.9e-05,-7.8e-05,-0.000229,-0.000175,-9.7e-05,0.000112,2.4e-05,-3e-05,-3.4e-05,-8.3e-05,-7.7e-05,-8.2e-05,-4.2e-05,3.4e-05,1.1e-05,-9.4e-05,-4e-06,-2e-06
-0.000194,-0.000136,-7.7e-05,-7.3e-05,-8.3e-05,8.2e-05,5e-06,4e-06,2.3e-05,0,9e-06,1e-06,-4.4e-05,-0.000101,-6.3e-05,9.2e-05,0,4e-05,5.2e-05,-6.3e-05,-4.5e-05,-0.000118,-8e-05,-1.4e-05,-5.9e-05,-9e-05,-0.000131,-7.7e-05
