-8.1e-05,-0.000172,-6.3e-05,8.6e-05,-0.000162,-0.000135,-5.6e-05,-0.000225,-0.000567,-0.000412,-0.00063,-0.000441,-0.000145,-0.000285,-0.000244,-0.00037,-0.000228,-0.000292,-0.000275,-0.000267,-0.000849,-0.000661,-0.000382,-0.000351,-0.000398,-0.000513,-0.000661,-0.000718,-0.000891,-0.000681,-0.000666,-0.001035,-0.000756,-0.000373,-0.000717,-0.000621,-0.000741,-0.00041,-0.000581,-0.000656,-0.000582,-0.000655,-0.000602,-0.000902,-0.000937,-0.000613,-0.001296,-0.000676,-0.000611,-0.000645,-0.000781,-0.001008,-0.000512,-0.000748,-0.001075,-0.000872,-0.001282,-0.000702,-0.000419,-0.000777,-0.00096,-0.001066,-0.001368,-0.002005,-0.001469,-0.001334,-0.000858,-0.001072,-0.001158,-0.001164,-0.001499,-0.00118,-0.001327,-0.00132,-0.001078,-0.000779,-0.001334,-0.001614,-0.00229,-0.001311,-0.001764,-0.001661,-0.001513,-0.00218,-0.001736,-0.001742,-0.00162,-0.002697,-0.00201,-0.001228,-0.000804,-0.00214,-0.001445,-0.001274,-0.001496,-0.001894,-0.001926,-0.000956,-0.001945,-0.002453,-0.001814,-0.001385,-0.00213,-0.001656,-0.00112,-0.002329,-0.00121,-0.001243,-0.000971,-0.001021,-0.00126,-0.000996,-0.000853,-0.002031,-0.002383,-0.00212,-0.001472,-0.000835,-0.001369,-0.001086,-0.001545
5.8e-05,4.1e-05,-7.6e-05,-8.6e-05,0.000154,0.000223,0.000186,0.000199,3e-04,0.000184,0.000207,0.000167,0.000246,6.7e-05,-9e-06,6.3e-05,0.000177,7.6e-05,0,0.000102,0.00053,0.000332,2e-06,-1.4e-05,0.000189,0.000221,0.000254,0.000394,0.000332,0.000157,0.000276,0.000673,0.000447,0.000125,3.1e-05,9e-06,0.000437,0.000149,0.000127,-4.4e-05,8e-06,-9.3e-05,1.4e-05,0.000362,0.000303,0.000125,0.000151,9.8e-05,-2e-06,0.000225,0.000309,0.000354,0.000348,0.000163,0.000315,0.00031,0.000207,9.9e-05,9.4e-05,0.00048,0.000483,0.000264,0.000387,0.000104,0.00046,0.000322,-4.6e-05,0.000395,0.000629,0.000407,0.000478,0.000238,0.000518,0.000425,0.000159,3.7e-05,0.000627,0.000625,0.000959,0.000443,0.000546,0.000968,0.000613,0.001466,0.000883,0.000862,0.000409,0.001386,9e-04,0.000455,4.9e-05,0.001217,0.000393,0.000456,8.5e-05,0.001201,0.000934,0.000269,0.000946,0.000537,0.000645,0.000224,0.001135,0.001347,0.000407,0.001358,0.000909,0.000279,0.000405,-0.000339,0.000157,0.000313,0.000149,0.000611,0.001546,0.001601,0.001014,0.000284,0.000424,0.000409,0.000438
-3.3e-05,-1.5e-05,-9.6e-05,-1.8e-05,-0.000137,-0.000143,-5.1e-05,-6.3e-05,-0.000327,-0.000148,1.1e-05,-0.000165,-0.000108,-6.3e-05,-0.000104,-5.9e-05,-0.000157,-0.000222,-0.00021,-0.000382,-0.000348,-0.000274,-0.000472,-0.00023,-0.000286,-0.000136,-0.00021,-4e-04,-0.000396,-0.000205,-3.5e-05,-0.000314,-0.000373,-0.000106,3.2e-05,-0.000409,-0.000553,-0.000317,-0.000227,-6.4e-05,-2e-05,-3.3e-05,4.8e-05,-0.000229,-0.000246,-0.00013,0.000186,0.000124,-1.8e-05,-0.000165,-0.000279,-0.000325,-0.000364,-0.000319,-0.000123,-0.000118,0.000311,0.000194,0.000126,-0.000414,-0.000461,-0.000169,0.000149,0.000814,0.000498,-2.1e-05,-9.3e-05,-0.000126,4.9e-05,-0.000179,0.000279,-0.00011,3.3e-05,-0.000211,7e-06,2.8e-05,-0.000715,3e-05,-0.000471,-0.000308,-0.000366,-0.000362,-0.000253,-0.000661,-0.000805,-0.000311,-9.5e-05,-0.000227,-0.000194,0.000171,0.000117,-0.000653,7e-06,8.9e-05,0.000369,-0.000348,-0.000447,-0.000171,0.000211,0.000244,-9.4e-05,0.000126,-0.000497,-0.000586,-0.000244,-0.000694,-0.000503,-0.000161,-0.000355,0.000215,-0.000356,-0.000323,0.000178,-5.1e-05,-0.000898,-0.001433,-0.00094,-0.000502,0.000107,-0.000145,0.000171
1e-05,5.3e-05,0.000108,3.5e-05,1.7e-05,-3e-05,-3.5e-05,5e-05,0.000103,0.000184,-0.000281,0.000186,0.000131,-4.4e-05,-0.000165,3.6e-05,-0.000119,-6e-05,0.000196,6e-05,0.000159,3.3e-05,2.2e-05,-0.000108,-5.1e-05,1.5e-05,0.000171,-1.6e-05,0.000162,9.4e-05,-8.2e-05,3.3e-05,0.000187,0.00012,2e-06,2.9e-05,0.000126,-3.1e-05,7.8e-05,7.5e-05,8.6e-05,0.000108,-1.1e-05,-0.000197,0.000172,-0.000198,-0.000268,-0.000339,-0.000122,-0.000163,-0.000121,5.4e-05,-6.6e-05,0.000167,-0.000117,-0.000116,-0.000451,-0.000422,-0.000212,0.000125,0.000284,-0.000131,-9.1e-05,-0.000542,-0.000755,-0.00023,-8e-06,-0.000366,-0.000331,-0.000136,-0.000689,0.000147,-0.000276,-0.000115,-0.000116,-0.000207,0.000513,7.7e-05,0.000125,-7.2e-05,-0.000166,7.2e-05,0.000298,0.000422,0.000643,-3.5e-05,-0.000281,-0.000482,-0.000524,-0.000587,-0.00014,0.000184,-0.000294,-0.000236,-0.000199,-0.000322,2.6e-05,-2.7e-05,-0.000248,1.5e-05,-0.000273,-8.7e-05,-2.8e-05,0.000201,-0.00013,0.000113,-0.000275,-0.000133,-0.000105,-0.000138,0.000324,0.000306,-0.000238,0.00041,0.000383,0.00099,0.000541,0.000358,-0.000115,-5.1e-05,-0.000519
-4.2e-05,-8e-06,3e-06,6.7e-05,-6.9e-05,-8.9e-05,8e-06,-7.5e-05,-5.1e-05,-0.000236,6.1e-05,-9.6e-05,-4.9e-05,7.5e-05,8.8e-05,1.2e-05,1.8e-05,4e-06,0.000157,2e-05,-0.000145,-0.000181,-3e-06,1.1e-05,-7.1e-05,-5.3e-05,-0.00013,0.000202,-0.00016,-2.8e-05,8.8e-05,-5.1e-05,-0.000233,-0.000121,7.5e-05,2.3e-05,-2.1e-05,7.4e-05,3.7e-05,-5e-05,-1.4e-05,-7.1e-05,-6e-06,0.000149,-8.8e-05,0.000121,0.000123,0.000106,0.000115,0.000161,0.000228,-4.2e-05,-0.000112,-5.7e-05,0.000285,2e-05,0.000287,0.000252,-1.8e-05,-3.6e-05,-0.000124,0.000153,-6.9e-05,0.000169,-1.7e-05,0.000118,0.000223,0.000403,0.000304,-2.6e-05,0.000338,-0.000288,0.000174,0.000201,0.000435,0.000273,1e-05,-0.000239,5.3e-05,0.000161,0.000459,-0.000103,-0.000267,-0.000505,-0.000376,0.000247,0.00044,0.000249,0.000571,0.000327,1.7e-05,0.000235,4.9e-05,0.000205,-0.000137,0.00022,5.8e-05,-3.7e-05,0.000346,-0.000836,6.3e-05,-0.000267,0.000154,-0.000385,0.000111,4.5e-05,0.000271,-3e-05,0.000221,7.2e-05,-2.6e-05,-0.000347,5e-05,-0.000667,-0.000455,-0.000671,-0.00025,-9.8e-05,-9e-05,7.2e-05,0.000422
2.3e-05,1e-06,-2.5e-05,-5e-05,-3.9e-05,9e-05,-8.9e-05,6e-06,5.4e-05,0.000221,5e-05,3.2e-05,1.3e-05,1e-06,9e-05,-7.5e-05,-4.3e-05,1e-04,-9.2e-05,1.1e-05,0.000215,0.000293,0.000222,0.000191,0.000201,1.9e-05,4.5e-05,-0.000166,0.000226,0.000134,-2.4e-05,-4.6e-05,0.000175,0.000107,-4e-06,0.000252,5.5e-05,-1.2e-05,6.3e-05,6.2e-05,-3.2e-05,-1e-06,1.2e-05,6.9e-05,4.3e-05,7.3e-05,-7.3e-05,-0.000107,-0.000122,-0.000154,-0.000159,0.00016,0.000138,0.000337,-0.000107,0.000147,7.7e-05,-2.4e-05,-5.3e-05,2.1e-05,-1.9e-05,-7.9e-05,-5e-05,-0.000115,4.8e-05,0.000166,0.000124,-0.000101,2e-05,-1.2e-05,2.2e-05,0.000189,-0.000148,9e-05,-0.000189,-8e-06,-0.000112,0.000208,3.3e-05,0.000134,-0.000194,2.1e-05,0.000381,0.000421,0.000231,-0.000117,-0.000416,1.5e-05,-0.000305,-6.9e-05,4.4e-05,-0.000133,-7.2e-05,-0.000323,0.000188,-0.000472,6.3e-05,0.000255,-9.2e-05,0.000563,0.000114,0.000148,-0.000232,6.6e-05,0.000118,4.9e-05,-0.00039,0.000123,-8.2e-05,-6.2e-05,5e-06,0.000214,0.000235,0.000146,0.000185,0.000517,0.000228,0.000231,-9.2e-05,-0.000168,-0.000152
-0.000102,-2.8e-05,-5e-06,-4.2e-05,-5.2e-05,8.7e-05,-3.4e-05,-5.2e-05,-4.9e-05,-7.8e-05,4.8e-05,6.1e-05,-3.7e-05,-3.7e-05,-6.9e-05,-2.8e-05,4.4e-05,2.7e-05,-4.3e-05,-3.7e-05,-0.000153,-0.000222,-0.000134,6.4e-05,-2.5e-05,-4e-06,-0.000106,7.5e-05,-5.9e-05,-4.3e-05,1e-06,8.3e-05,-8.5e-05,-4e-06,-2.3e-05,-0.000183,-1e-05,-2e-06,-5.6e-05,-0.000178,-5.7e-05,-4.1e-05,6.8e-05,-0.000117,-0.000167,-0.000141,0.000202,1.5e-05,7e-05,7.6e-05,1.2e-05,-0.000242,2.8e-05,-0.000203,-0.000156,-0.000299,-9.2e-05,-6.9e-05,-0.000213,0,1e-06,0.000314,7.4e-05,-7.2e-05,0.00011,-0.000249,-0.000418,-0.000123,-0.000201,0.00034,-3.3e-05,-5.3e-05,-5.2e-05,-0.000115,-0.000139,-0.000149,-6.1e-05,-0.000205,-4.1e-05,-3e-04,9.7e-05,0.000133,-0.000304,-0.00035,-9.1e-05,-8.5e-05,0.000154,-0.000163,3.3e-05,-9.9e-05,-0.000117,-0.000336,3.9e-05,0.000253,-0.000204,0.00012,-5.4e-05,-0.000195,2e-05,-0.000219,7e-06,0.000162,4.9e-05,0.000178,-9.9e-05,-0.000146,0.000478,0.000181,-4.7e-05,9e-06,-3.4e-05,-0.000184,-0.00025,-5e-06,-2.3e-05,-0.000424,-0.000161,-0.00047,-3.7e-05,0.000148,0.000294
-1.6e-05,2.9e-05,4.1e-05,1.3e-05,-3.8e-05,1.4e-05,-6.7e-05,3.1e-05,3.5e-05,1.7e-05,3.2e-05,-0.000124,-4.2e-05,-0.00012,-5e-06,-5.7e-05,-6.7e-05,-2.1e-05,3e-05,-7.2e-05,-0.000136,9.6e-05,4.8e-05,-4e-05,-1e-06,6.1e-05,3.9e-05,-6e-06,5.2e-05,5.5e-05,-5e-05,-1.9e-05,2.7e-05,1.3e-05,-7e-05,4.9e-05,-5.5e-05,-1e-06,-8.2e-05,0.000136,0.000134,7.9e-05,-9.9e-05,2.4e-05,0.000118,2.1e-05,-0.00021,8.9e-05,-9e-05,1e-06,9e-06,0.00011,-0.000191,-1.5e-05,-9.9e-05,0.000192,0.000149,5.1e-05,0.000177,0.000152,-5.1e-05,-0.000241,-9.9e-05,-8e-06,-0.000282,0.000131,0.000339,-9e-06,0.000108,-0.000328,-1.2e-05,4e-05,0.000204,0.000171,0.000209,0.000178,0.000132,0.000353,9.1e-05,0.000481,-0.000146,-0.000194,0.000221,0.000135,-4.8e-05,-1.8e-05,0.000192,0.000151,0.000145,0.000168,-0.000258,0.000294,7.8e-05,0.000122,0.00017,0.000233,-3e-05,0.000124,-3.9e-05,-5.9e-05,-2e-06,-0.000336,-9.2e-05,-0.000241,-0.00021,0.000345,-0.000294,-3.9e-05,-7e-06,0.000233,7.1e-05,0.000179,0.000195,9.4e-05,-5.1e-05,0.000499,0.000112,0.000364,-0.000109,-2e-05,-0.000267
5e-06,-1e-05,-2.3e-05,-1e-05,-4.2e-05,-7e-06,0.000109,-3e-06,-1.2e-05,-6.4e-05,2e-06,0.000149,3.8e-05,-3e-06,3.6e-05,6.9e-05,6.7e-05,-1.1e-05,-2.2e-05,1.7e-05,-3.4e-05,-4e-06,-3.1e-05,-0.000138,-4.3e-05,-0.000154,-6e-06,3.4e-05,-0.000141,-0.000186,7.2e-05,-3.1e-05,-3.9e-05,-0.000102,4.4e-05,-5e-06,-2.7e-05,5e-05,3.1e-05,-4e-05,-5.6e-05,-7.5e-05,7.3e-05,-4.9e-05,1.2e-05,0.000144,0.000191,-8.2e-05,-7e-06,4.5e-05,-3.8e-05,-1e-06,1.2e-05,-6.1e-05,0.00013,5.5e-05,-0.000157,-7.5e-05,-9e-06,-3.8e-05,4.2e-05,0.000158,7.3e-05,3.6e-05,0.000195,-9.2e-05,-0.000114,-3.5e-05,-8.1e-05,0.000176,-9e-06,-2.8e-05,-0.000168,-0.00017,-0.00017,-8.6e-05,4.8e-05,-0.000295,-0.000219,-0.000387,3.5e-05,0.000159,-0.00014,3.2e-05,0.000228,0.000176,-0.000279,-0.000207,-0.000207,-2e-04,0.000279,-6.4e-05,-8.6e-05,-0.000144,-0.000128,-7.2e-05,-2.9e-05,-0.000212,0.000113,0.000178,0.000165,0.000106,2e-05,0.000205,0.000139,-0.000169,0.000143,1.3e-05,4.2e-05,-0.000278,-4.8e-05,-0.000105,-0.000164,-0.000179,-6.5e-05,-0.000632,-0.000177,-9.2e-05,0.000249,-7.2e-05,1.8e-05
-3e-06,4e-05,2.2e-05,7e-06,2.2e-05,2e-05,-1.8e-05,1.3e-05,2.8e-05,6.4e-05,-2.2e-05,-5.5e-05,-6e-05,-3.4e-05,4.9e-05,5.5e-05,2e-06,-5.2e-05,6.1e-05,5.4e-05,7e-06,1.3e-05,3.3e-05,7e-05,-2.8e-05,6.7e-05,-4e-06,-4.4e-05,6.5e-05,0.000132,-3.7e-05,5.1e-05,-8e-06,2.9e-05,-5.6e-05,7.6e-05,8e-05,9.4e-05,-1e-06,4.6e-05,2.6e-05,5.1e-05,-3e-05,3.8e-05,2.5e-05,-6.3e-05,2.3e-05,3.8e-05,8.4e-05,-2.9e-05,0.000105,1.7e-05,3.8e-05,-1.7e-05,-8.5e-05,-5.9e-05,6.3e-05,-6.8e-05,-8.5e-05,-8.3e-05,7.2e-05,-0.000171,-8e-06,-0.000105,-0.000152,9.6e-05,-7.6e-05,-1.7e-05,4.6e-05,-5e-06,0.000115,4.6e-05,0.000124,0.00012,9.3e-05,2.8e-05,-0.000215,7.3e-05,0.000112,0.000273,6.7e-05,-0.000282,3.1e-05,-0.000124,-6.9e-05,-0.000139,0.000249,0.000108,-9.8e-05,4.7e-05,-0.000154,-2.3e-05,-2e-06,4.1e-05,3.4e-05,-0.00026,4e-06,0.000226,-4.7e-05,-0.000147,-1.4e-05,0.000145,-5.6e-05,-0.000135,-7e-06,-7e-06,-9.9e-05,-7.3e-05,9.7e-05,0.000114,-5.8e-05,1.1e-05,0.00013,1.1e-05,0.000184,0.000286,0.000187,-6.7e-05,-0.000157,-4.6e-05,6.3e-05
-1e-06,-1.8e-05,-2e-05,-1.3e-05,0.000124,1e-05,4.4e-05,1.1e-05,-3.4e-05,-1.1e-05,-1.2e-05,7e-06,2.5e-05,5.9e-05,2.1e-05,-3.3e-05,8.5e-05,-4.1e-05,9e-06,-1.3e-05,7.6e-05,6.6e-05,-1.3e-05,-5.1e-05,2.9e-05,-8e-06,3.2e-05,2.9e-05,-4.3e-05,-5.8e-05,2.8e-05,2e-06,-9e-06,-1.4e-05,3.3e-05,1.9e-05,-1.6e-05,-9e-06,1.8e-05,8e-06,-4.5e-05,-8.1e-05,-9e-06,1.5e-05,1.9e-05,-1.4e-05,-3.5e-05,-2.9e-05,-8.7e-05,3e-05,3.3e-05,6.3e-05,5.4e-05,2.2e-05,5.4e-05,2.3e-05,-2.1e-05,4.2e-05,6.1e-05,4.7e-05,-6.7e-05,0.000136,9e-06,3.7e-05,6.3e-05,-4.3e-05,0.000142,9.1e-05,2.3e-05,-2.2e-05,-7.2e-05,-5.5e-05,-0.000159,-2.5e-05,-3e-05,2.8e-05,0.000111,8e-06,-2.9e-05,-0.000134,-9.4e-05,0.000181,2.9e-05,0.000111,-5.7e-05,9e-06,-0.000243,1.1e-05,0.00014,-6.9e-05,4.2e-05,-1.1e-05,5.4e-05,0.00013,0.000117,0.000314,6.8e-05,-0.000126,-0.000132,0.000112,-6.7e-05,-0.000154,3e-06,-0.000116,-5e-06,3.1e-05,9.1e-05,-3e-06,0,-0.000112,7.1e-05,-8.9e-05,-0.000175,0.000104,-5.1e-05,6.2e-05,-4.3e-05,9.1e-05,0.000102,4.3e-05,3.3e-05
-8e-06,-1.8e-05,2.3e-05,6e-06,-8.2e-05,-2e-05,-8.6e-05,-1.2e-05,-2.9e-05,2.3e-05,1.1e-05,8e-06,-3.3e-05,-5.2e-05,-1.5e-05,-1.5e-05,-1.9e-05,6.5e-05,-2.8e-05,-3.6e-05,-1.8e-05,-5.8e-05,-1.2e-05,5.4e-05,3.1e-05,3.7e-05,1.2e-05,-4.4e-05,1e-05,5.6e-05,-2.8e-05,3.2e-05,-4e-06,1.9e-05,1e-06,-4.8e-05,-1.2e-05,-2.3e-05,-6e-06,1.5e-05,3.2e-05,0.000115,-1e-05,-4.8e-05,-1.1e-05,-4.7e-05,-1.8e-05,2.3e-05,0.000112,5e-06,-6e-05,-5.3e-05,3.6e-05,-4.1e-05,-2.1e-05,-7e-05,3.8e-05,-6e-06,-6.4e-05,-1e-04,2.2e-05,-9.5e-05,-2.5e-05,6e-05,6.4e-05,8.2e-05,-7.9e-05,-3.7e-05,-0.000101,7e-05,-1.1e-05,1.6e-05,7.4e-05,3e-06,-3.1e-05,-2.4e-05,-1.1e-05,2.4e-05,1.4e-05,0.000124,-4e-05,1.5e-05,-7.9e-05,-4.3e-05,0.000125,6e-05,0.00014,-7.5e-05,9.6e-05,9.5e-05,8e-05,0.000109,8.4e-05,-0.000248,-0.000156,-7.7e-05,-1.3e-05,0.000108,0.000161,5e-06,-3.4e-05,-3e-06,2e-05,0.000136,5e-05,-4e-06,-0.00014,9.4e-05,-3.7e-05,7e-05,-4.1e-05,5e-05,5.3e-05,-1e-06,-1.3e-05,-0.000203,-6e-06,-7e-05,-8.6e-05,-4.9e-05,2e-06
1e-05,-1e-06,7e-06,-7e-06,-1.4e-05,-1.7e-05,-1.4e-05,-1.4e-05,-1.5e-05,-4.1e-05,-2.4e-05,-4.1e-05,-2e-06,2.1e-05,-3.7e-05,3e-06,-2.1e-05,-3.8e-05,-1.8e-05,8e-06,-4e-06,-5.7e-05,1.2e-05,-6.4e-05,-5e-06,-1.2e-05,-3.1e-05,1.5e-05,-2.4e-05,-3.1e-05,-1.1e-05,-1.3e-05,-4e-06,-3e-06,-1.2e-05,1.6e-05,1.2e-05,-6.7e-05,2e-05,5e-06,-3.1e-05,-6.5e-05,1.2e-05,-1.8e-05,-3.3e-05,3e-05,1.1e-05,1e-05,3e-06,1.9e-05,2.2e-05,-6e-06,-5e-05,5.4e-05,2e-05,4.3e-05,-6.9e-05,9e-06,2.8e-05,-2.4e-05,-1.6e-05,3.2e-05,4.1e-05,-6.4e-05,-4.9e-05,2.5e-05,-3.9e-05,-3.1e-05,1.1e-05,-3e-05,-4e-06,-4.1e-05,-3.7e-05,-6e-06,-4.7e-05,2.5e-05,-6.7e-05,2e-05,-1.6e-05,-0.000116,0.000141,-1e-05,-1e-05,-2.6e-05,-0.000139,-8.1e-05,-7.3e-05,0.000108,-9.9e-05,-0.000137,-9.5e-05,-2.3e-05,-0.000116,0.000117,3.4e-05,1.5e-05,3.1e-05,-0.000133,-0.000141,-0.000112,-1.7e-05,5.3e-05,2.5e-05,-6.4e-05,-1.1e-05,1e-05,6.4e-05,-0.00018,-5.5e-05,1e-05,7.3e-05,2.7e-05,3e-05,3.5e-05,1e-05,0.000109,-3.9e-05,3.7e-05,0.000167,4e-06,-1.9e-05
-2e-06,-7e-06,9e-06,4e-06,5e-06,-2.2e-05,-4e-06,6e-06,-2e-06,1.7e-05,7e-06,1.6e-05,2.9e-05,-3e-06,2e-06,-1.7e-05,1.9e-05,-9e-06,-7e-06,-7e-06,8e-06,1.3e-05,-2e-06,3.9e-05,-7e-06,-1.2e-05,2.1e-05,-1.8e-05,1.1e-05,-1.4e-05,3e-05,-7e-06,-1.2e-05,-2.2e-05,-2.1e-05,-2.3e-05,0,1.6e-05,2.3e-05,-1.3e-05,2.2e-05,1.7e-05,-1.4e-05,8e-06,4.2e-05,2.9e-05,-1e-06,2.9e-05,-7e-05,-2.7e-05,6e-06,2.4e-05,1.4e-05,-4.8e-05,-2.8e-05,-2.3e-05,1.6e-05,-1.9e-05,-2.5e-05,2.6e-05,-1.8e-05,-1.6e-05,-9e-06,6.7e-05,2.7e-05,-3.3e-05,3.9e-05,3.6e-05,-6e-06,-5e-05,-5e-05,8e-06,7.8e-05,-4.2e-05,2.1e-05,-3.5e-05,4.9e-05,-6.3e-05,-8e-06,-3.4e-05,-9.9e-05,-4.2e-05,8e-05,1.7e-05,1.8e-05,9e-06,7.6e-05,-6.4e-05,-5e-06,6e-05,8.9e-05,2.5e-05,3.2e-05,-5e-05,-2e-06,-2.6e-05,-2.1e-05,7.3e-05,0.000111,5.8e-05,-2e-05,-4.7e-05,-1.6e-05,-6.3e-05,-7e-06,7e-06,-5.6e-05,0.000103,1e-05,-4.6e-05,-4e-05,-5.3e-05,-3e-06,-8e-06,4.5e-05,-2.9e-05,4.3e-05,-2.8e-05,-7.6e-05,2.6e-05,4e-06
-1e-06,-1e-06,-3e-06,-5e-06,7e-06,-1.9e-05,-4e-06,-7e-06,-1.8e-05,1e-06,-4e-06,3e-06,-3.4e-05,3e-06,-3.3e-05,2.5e-05,-1.1e-05,1.2e-05,-4e-06,1.8e-05,-6e-06,-2e-05,7e-06,-2e-06,3e-06,-2e-06,-1.5e-05,5e-06,4e-05,2.4e-05,-2.3e-05,-2e-05,1.7e-05,1.8e-05,3.4e-05,1.4e-05,1e-06,-2e-05,2e-06,0,1e-05,-9e-06,1.4e-05,1.6e-05,1.2e-05,-2.1e-05,-8e-06,-3.7e-05,5.2e-05,-1.3e-05,-1e-05,-2.3e-05,7e-06,2.7e-05,4e-06,1.7e-05,1.2e-05,1.1e-05,6.1e-05,-2.9e-05,5e-06,-5e-06,-1e-05,-3.7e-05,3.9e-05,5.6e-05,-3e-06,-4.8e-05,2.8e-05,5.9e-05,3.2e-05,7e-06,-3e-05,4.5e-05,4e-06,3.2e-05,-4.3e-05,5e-05,2.3e-05,2.9e-05,6.9e-05,5e-06,-7.2e-05,-1.2e-05,-2e-06,-3e-05,-7e-05,4.1e-05,1.3e-05,-1.2e-05,-2.9e-05,4.5e-05,2.1e-05,3.7e-05,-4e-05,3.8e-05,1.3e-05,4.1e-05,-2.8e-05,1.3e-05,1e-05,-2.2e-05,1.3e-05,1.5e-05,2.5e-05,4.8e-05,7.1e-05,-1.5e-05,-3.1e-05,-3e-05,-5.6e-05,3.8e-05,-2.1e-05,-2.4e-05,-2.2e-05,5.5e-05,-6.6e-05,1.7e-05,4.9e-05,-3.3e-05,6e-06
-1.1e-05,-5e-06,-3e-06,0,2e-06,-6e-06,1e-05,3e-06,-6e-06,-2.4e-05,-3e-06,1e-06,2.3e-05,-1.7e-05,9e-06,5e-06,2.4e-05,2.4e-05,2.7e-05,-5e-06,7e-06,5e-06,7e-06,1.2e-05,-2e-06,-9e-06,1.3e-05,0,-4.3e-05,-2.2e-05,2.8e-05,4.8e-05,0,-1.6e-05,-2.2e-05,-1.1e-05,0,2.8e-05,-9e-06,5e-06,-2.5e-05,5e-06,-1.2e-05,-1.8e-05,-1.1e-05,1.1e-05,5e-06,9e-06,-1.3e-05,2e-05,-1.8e-05,1.7e-05,-1.3e-05,1.2e-05,4e-06,-1.6e-05,5e-06,-1e-06,-1.6e-05,3.2e-05,-1e-06,1e-06,2e-06,1.1e-05,-4e-05,-2.1e-05,-1.7e-05,2.2e-05,-2e-05,-2.2e-05,-4e-05,2.9e-05,-7e-06,-2.6e-05,-1e-06,-3.2e-05,1.9e-05,-4.3e-05,-2.1e-05,1e-06,-4.2e-05,1.5e-05,2.5e-05,3e-05,-5e-06,1.2e-05,2.6e-05,-2.8e-05,3.1e-05,7e-06,-1.3e-05,-4.1e-05,1.3e-05,-4e-05,1.4e-05,-3e-05,-3.2e-05,-3e-05,-1e-06,8e-06,-2.7e-05,3e-06,-1e-05,-1e-06,-5e-06,-8.6e-05,-4.4e-05,-3.8e-05,3e-06,4.8e-05,5.2e-05,-1.3e-05,-5e-06,1e-05,-2.7e-05,-2.3e-05,4e-05,2.3e-05,-3e-05,1.4e-05,4e-06
6e-06,-7e-06,-5e-06,-1e-06,-1.4e-05,7e-06,1.2e-05,7e-06,7e-06,5e-06,-1e-06,1.9e-05,-2e-06,9e-06,-1.7e-05,-1.5e-05,-1e-05,2e-06,2e-05,6e-06,-2.6e-05,-7e-06,2e-06,-1.6e-05,1e-06,1.7e-05,3e-06,0,2.1e-05,2e-06,-2.3e-05,-1.4e-05,-4e-06,7e-06,2.2e-05,2e-06,-4e-06,-2.2e-05,-1e-06,-7e-06,2e-06,-6e-06,-1e-06,2e-06,6e-06,-5e-06,-4e-06,3e-06,1.2e-05,-7e-06,1.3e-05,-1.4e-05,-2e-06,-1.3e-05,-1e-06,-1.3e-05,8e-06,0,-7e-06,-1.4e-05,4e-06,3.7e-05,-8e-06,-2.2e-05,2.9e-05,1e-06,-3.6e-05,-2.2e-05,8e-06,-8e-06,3.2e-05,5e-06,2e-05,-1.2e-05,7e-06,-1.1e-05,3e-06,3e-05,-1.7e-05,-1.5e-05,3e-05,3e-06,-1.4e-05,-3.1e-05,-2.2e-05,-1e-05,-1e-05,1.2e-05,-4.5e-05,-7e-06,2.6e-05,-4e-06,-2.6e-05,1.7e-05,1.8e-05,7e-06,-2e-06,4.9e-05,-3.3e-05,4e-06,1.6e-05,-4.2e-05,-1e-06,1e-06,3e-06,1e-05,2e-06,3e-05,2.3e-05,1.9e-05,-3.9e-05,-5e-06,-7e-06,-5e-06,1.8e-05,-1.4e-05,-4.3e-05,-5.8e-05,-2e-06,8e-06,1.1e-05
0,0,4e-06,1e-06,1.3e-05,-2e-06,-1.4e-05,-9e-06,-2e-06,-6e-06,-1e-06,-1.2e-05,-6e-06,-1e-06,1e-06,3e-06,1e-06,5e-06,-3e-06,1e-06,1.1e-05,1e-06,1e-06,3e-06,-7e-06,-5e-06,-5e-06,1e-06,-1.9e-05,-3e-06,1.3e-05,-1.3e-05,5e-06,-1e-06,-6e-06,-6e-06,6e-06,8e-06,-1.5e-05,1.1e-05,-4e-06,9e-06,-3e-06,3e-06,-3e-06,-8e-06,5e-06,2.4e-05,4e-06,-1.3e-05,3e-06,7e-06,2e-06,1.9e-05,-3e-06,-9e-06,-9e-06,6e-06,-4e-06,5e-06,8e-06,-2.6e-05,9e-06,1e-05,-3.8e-05,-2.7e-05,6.6e-05,1.4e-05,5e-06,-2.5e-05,-1.5e-05,-1.7e-05,-1.9e-05,7e-06,2e-06,2e-06,-7e-06,-7e-06,2.1e-05,-4e-06,-3.4e-05,-1.3e-05,1e-06,8e-06,4.6e-05,5e-06,-1.6e-05,-1.4e-05,2e-05,1.1e-05,-1e-05,-1.2e-05,-9e-06,-3.4e-05,2e-06,3.7e-05,2.3e-05,-1.7e-05,2.9e-05,-3e-05,4e-06,6.4e-05,-1.4e-05,3.5e-05,1.8e-05,1.8e-05,-2.3e-05,-2e-06,-9e-06,-1.4e-05,0,-1e-05,2.6e-05,-1e-06,-3e-06,2.5e-05,3.4e-05,5.6e-05,1.9e-05,7e-06,-2e-06
-4e-06,1e-06,-5e-06,-1e-06,1e-06,-1e-06,-3e-06,5e-06,3e-06,4e-06,4e-06,3e-06,7e-06,-1e-05,-3e-06,-9e-06,3e-06,3e-06,-1e-06,-4e-06,1.4e-05,3e-06,3e-06,6e-06,-5e-06,-5e-06,8e-06,9e-06,1.9e-05,8e-06,-1.4e-05,3e-06,0,-7e-06,1e-06,2e-06,2e-06,-8e-06,0,-5e-06,8e-06,-8e-06,6e-06,5e-06,-2e-06,8e-06,-7e-06,-2.2e-05,1e-06,8e-06,-7e-06,-2e-06,-6e-06,-2.2e-05,1e-05,-9e-06,4e-06,-1.1e-05,-3e-06,1.1e-05,3e-06,2.7e-05,7e-06,-1.1e-05,2.1e-05,1.9e-05,-4.2e-05,-4e-06,-4e-06,9e-06,-9e-06,-1.1e-05,1.6e-05,1e-06,-1.1e-05,-5e-06,2.2e-05,-1.7e-05,-4e-06,1.1e-05,2.7e-05,1.4e-05,1.5e-05,1e-06,-4.3e-05,3e-06,2.2e-05,9e-06,-5e-06,-3e-06,9e-06,2e-05,1.4e-05,1.6e-05,-7e-06,-1.7e-05,-5e-06,-4e-06,-2.1e-05,5e-06,-1e-05,-4.4e-05,-2e-06,-3.7e-05,0,-2e-05,3.9e-05,2e-06,-6e-06,1.3e-05,2.8e-05,1.8e-05,-1.8e-05,-1.6e-05,-1.5e-05,-3.8e-05,-2.3e-05,-2.7e-05,6e-06,-5e-06,2e-06
2e-06,1e-06,4e-06,0,0,5e-06,-5e-06,-5e-06,5e-06,0,-2e-06,-5e-06,-7e-06,9e-06,-1e-06,-1e-06,-3e-06,-2e-06,-1e-05,-5e-06,-3e-06,-7e-06,-5e-06,-4e-06,7e-06,5e-06,-4e-06,-3e-06,-1.5e-05,0,9e-06,3e-06,-8e-06,9e-06,-1e-06,-3e-06,-6e-06,-5e-06,-1e-06,1e-06,2e-06,3e-06,-4e-06,-1.2e-05,-1e-06,3e-06,0,1.5e-05,-1e-06,-3e-06,1e-06,-6e-06,2.1e-05,7e-06,-4e-06,1.5e-05,3e-06,0,7e-06,-1e-06,-4e-06,-1e-05,-6e-06,7e-06,2e-05,-6e-06,-5e-06,1.1e-05,-1e-05,-1.1e-05,-1e-05,1.1e-05,-1.6e-05,3e-06,1e-06,7e-06,-2.6e-05,1.6e-05,-7e-06,-4e-06,-2.8e-05,-1.1e-05,-1.7e-05,-8e-06,2e-05,5e-06,-1.3e-05,3e-06,-7e-06,-7e-06,1e-05,-2e-06,1e-05,3.9e-05,-2e-06,-1.8e-05,2e-06,1.8e-05,2.2e-05,1.7e-05,6e-06,-3e-06,1.6e-05,8e-06,6e-06,-5e-06,-3.3e-05,8e-06,-2e-06,-2.2e-05,-1.3e-05,-7e-06,2.4e-05,1.5e-05,6e-06,2.8e-05,1.7e-05,7e-06,1e-06,2e-06,4e-06
0,3e-06,-3e-06,-1e-06,-1.2e-05,4e-06,2e-06,4e-06,0,-1e-06,2e-06,-4e-06,5e-06,-2e-06,-3e-06,1.1e-05,-3e-06,1e-06,-9e-06,4e-06,2e-06,6e-06,1e-06,-5e-06,-5e-06,3e-06,-1e-06,2e-06,2e-06,7e-06,-5e-06,-5e-06,2e-06,-7e-06,-2e-06,-1e-06,3e-06,4e-06,0,-1e-06,-1e-06,-1e-06,5e-06,1e-06,6e-06,-5e-06,2e-06,-1.8e-05,-3e-06,-1e-06,-3e-06,8e-06,-2.6e-05,-3e-06,1e-06,2e-06,1e-06,4e-06,-5e-06,1e-06,3e-06,1e-06,4e-06,1e-06,-2.1e-05,0,1.8e-05,-9e-06,1e-06,1.4e-05,6e-06,-1.5e-05,8e-06,-3e-06,-8e-06,4e-06,7e-06,-1.6e-05,1e-06,-1.2e-05,2.1e-05,1.3e-05,2.3e-05,1.4e-05,7e-06,-1e-05,1.3e-05,-5e-06,1.2e-05,3e-06,-2e-05,-6e-06,-2e-06,-1.3e-05,-4e-06,1.8e-05,7e-06,-2.2e-05,-1.3e-05,-1.6e-05,8e-06,3e-06,-4e-06,1.2e-05,2e-06,2e-06,1.2e-05,-7e-06,7e-06,1.5e-05,-2e-06,-6e-06,-3.4e-05,1e-06,3e-06,2e-06,-1.3e-05,5e-06,9e-06,-6e-06,-5e-06
0,0,1e-06,0,-1e-06,4e-06,8e-06,-3e-06,-1e-06,-2e-06,0,8e-06,1e-06,2e-06,4e-06,-2e-06,1e-06,-5e-06,2e-06,2e-06,-3e-06,-1e-06,4e-06,-5e-06,3e-06,-2e-06,2e-06,2e-06,-4e-06,-5e-06,4e-06,7e-06,1e-06,4e-06,0,3e-06,3e-06,2e-06,8e-06,-4e-06,4e-06,0,-8e-06,6e-06,3e-06,3e-06,2e-06,1.6e-05,-3e-06,-4e-06,0,-9e-06,1e-05,-6e-06,-2e-06,-5e-06,-3e-06,-7e-06,1.8e-05,-1e-05,2e-06,7e-06,-5e-06,-1e-06,1e-05,-7e-06,-4e-06,0,1e-05,-1e-05,1.7e-05,1.1e-05,-8e-06,8e-06,1.1e-05,-1e-06,9e-06,1.4e-05,-6e-06,2e-05,-1e-05,-7e-06,-2.6e-05,-1.5e-05,-1.3e-05,7e-06,-1.1e-05,2e-06,4e-06,-1e-05,1.8e-05,5e-06,-1e-05,-8e-06,1e-06,1.2e-05,-8e-06,3e-06,8e-06,2.9e-05,4e-06,1e-05,-4e-06,-1.5e-05,0,-3e-06,-3e-06,9e-06,1e-06,-1.1e-05,8e-06,6e-06,2.6e-05,-4e-06,-2e-06,-1.8e-05,7e-06,-4e-06,-1.9e-05,6e-06,-3e-06
-5e-06,-1e-06,-2e-06,1e-06,1.3e-05,0,1e-06,4e-06,-2e-06,6e-06,2e-06,-5e-06,-2e-06,-3e-06,1e-06,0,-1e-06,-4e-06,6e-06,-4e-06,1e-06,3e-06,-4e-06,7e-06,-3e-06,-2e-06,-1e-06,0,2e-06,0,-2e-06,-6e-06,-5e-06,-1e-06,-1e-06,-3e-06,-4e-06,9e-06,-4e-06,2e-06,-9e-06,0,5e-06,-5e-06,-3e-06,-5e-06,-2e-06,-3e-06,3e-06,3e-06,-1e-06,4e-06,4e-06,8e-06,0,-1e-06,-4e-06,5e-06,-1.5e-05,1e-06,-2e-06,-8e-06,1e-06,-3e-06,-1.6e-05,4e-06,-9e-06,-1.1e-05,-3e-06,-7e-06,-1.7e-05,0,1.4e-05,1e-06,-9e-06,-1e-06,-9e-06,-1.2e-05,8e-06,-1.1e-05,-1e-06,-1.4e-05,1.8e-05,1e-05,8e-06,-3e-06,9e-06,0,-7e-06,1.4e-05,-6e-06,-1e-06,3e-06,1.6e-05,6e-06,-1.1e-05,-2e-06,1.6e-05,-1.1e-05,-2e-05,-3e-06,-2.2e-05,1e-05,1.2e-05,2e-06,-2e-06,0,1e-06,5e-06,2e-06,-1e-06,-5e-06,-1.3e-05,0,1e-06,5e-06,2e-06,1e-06,8e-06,-5e-06,-1e-06
2e-06,0,2e-06,-1e-06,-5e-06,1e-06,-2e-06,-3e-06,0,-5e-06,0,5e-06,3e-06,1e-06,2e-06,0,1e-06,3e-06,2e-06,2e-06,-4e-06,7e-06,1e-06,5e-06,3e-06,1e-06,1e-06,-3e-06,3e-06,3e-06,1e-06,-4e-06,7e-06,-3e-06,1e-06,2e-06,2e-06,-4e-06,4e-06,-3e-06,7e-06,-2e-06,-2e-06,-2e-06,-1e-06,8e-06,0,7e-06,-1.1e-05,1e-06,0,0,-8e-06,-4e-06,-2e-06,-5e-06,1.1e-05,-4e-06,4e-06,-7e-06,2e-06,0,2e-06,-3e-06,1.7e-05,-4e-06,8e-06,6e-06,-5e-06,2.1e-05,1.2e-05,-1e-06,-1.3e-05,1e-06,9e-06,0,0,4e-06,-1e-06,7e-06,-7e-06,1.1e-05,-6e-06,-5e-06,1.3e-05,-3e-06,-5e-06,2e-06,-8e-06,-1.2e-05,-5e-06,-4e-06,6e-06,-1.5e-05,-2e-06,-6e-06,-2e-06,-1.7e-05,7e-06,-1e-06,1e-06,1.1e-05,-8e-06,-5e-06,-1e-06,1.6e-05,0,-1.4e-05,6e-06,-1.2e-05,-8e-06,0,9e-06,-9e-06,-4e-06,1.5e-05,-5e-06,-3e-06,4e-06,1e-06,0
0,1e-06,-2e-06,0,-2e-06,2e-06,-6e-06,1e-06,-3e-06,1e-06,-1e-06,-3e-06,-3e-06,-4e-06,1e-06,-7e-06,-4e-06,-2e-06,2e-06,1e-06,-4e-06,-6e-06,-1e-06,-1.3e-05,1e-06,-2e-06,-1e-06,4e-06,-7e-06,-8e-06,-2e-06,8e-06,-4e-06,6e-06,1e-06,4e-06,2e-06,4e-06,-3e-06,2e-06,1e-06,2e-06,2e-06,-4e-06,-4e-06,-9e-06,-1e-06,-1.2e-05,1.3e-05,-3e-06,3e-06,-1e-06,4e-06,6e-06,2e-06,4e-06,-4e-06,3e-06,-2e-06,-2e-06,1e-06,0,-2e-06,7e-06,2e-06,-2e-05,-3e-06,-5e-06,0,2e-06,-1.3e-05,4e-06,9e-06,-2e-06,-4e-06,5e-06,3e-06,-1e-06,-8e-06,3e-06,2.4e-05,1e-05,3e-06,-5e-06,-2.2e-05,5e-06,-5e-06,-1e-06,8e-06,8e-06,8e-06,-2e-06,6e-06,1e-05,-1e-06,9e-06,-4e-06,1.1e-05,3e-06,1.5e-05,-4e-06,-1.5e-05,2e-06,-1.4e-05,0,-3e-06,3e-06,1.7e-05,-3e-06,3e-06,5e-06,-5e-06,-8e-06,9e-06,1e-06,-8e-06,6e-06,-2e-06,-1e-06,1e-06,0
-1e-06,0,2e-06,0,-2e-06,-1e-06,-1e-06,0,-3e-06,1e-06,-1e-06,-2e-06,1e-06,2e-06,1e-06,3e-06,2e-06,1e-06,-4e-06,0,6e-06,0,0,8e-06,-3e-06,3e-06,0,-2e-06,7e-06,4e-06,1e-06,3e-06,-2e-06,-5e-06,1e-06,-3e-06,-1e-06,-5e-06,-2e-06,-1e-06,0,-1e-06,-1e-06,1e-05,0,7e-06,1e-06,6e-06,-6e-06,1e-06,0,3e-06,1e-06,-2e-06,0,0,1e-06,-1e-06,5e-06,3e-06,-3e-06,-3e-06,2e-06,-1e-05,-1.1e-05,1.3e-05,7e-06,6e-06,2e-06,-1.3e-05,7e-06,-4e-06,-6e-06,4e-06,-2e-06,0,-2e-06,-3e-06,4e-06,-5e-06,-1.6e-05,-7e-06,-4e-06,1.2e-05,1.9e-05,-2e-06,1e-05,0,4e-06,-9e-06,-2e-06,6e-06,-1.2e-05,-6e-06,-2e-06,-3e-06,3e-06,-4e-06,-7e-06,-1.7e-05,1e-06,1e-05,-4e-06,2.1e-05,4e-06,-8e-06,-1e-05,-1.3e-05,-5e-06,-1e-06,4e-06,7e-06,-2e-06,2e-06,3e-06,-1.2e-05,-1.1e-05,1.2e-05,-4e-06,1e-06,0
0,0,-1e-06,1e-06,4e-06,-2e-06,1e-06,-1e-06,-1e-06,-2e-06,-1e-06,3e-06,-1e-06,-2e-06,0,3e-06,-4e-06,2e-06,-5e-06,-3e-06,3e-06,1e-06,1e-06,3e-06,1e-06,-1e-06,2e-06,-1e-06,-6e-06,-1e-06,1e-06,-9e-06,3e-06,3e-06,-1e-06,1e-06,0,3e-06,-1e-06,0,0,1e-06,1e-06,-7e-06,3e-06,-1e-06,0,-4e-06,2e-06,1e-06,0,-4e-06,-9e-06,0,1e-06,6e-06,-4e-06,0,-2e-06,0,0,-1e-06,-1e-06,1e-05,3e-06,-2e-06,-1.3e-05,-4e-06,0,1.4e-05,0,-4e-06,1e-06,-1e-06,3e-06,-1e-06,-3e-06,7e-06,4e-06,5e-06,5e-06,-7e-06,3e-06,-1.1e-05,-5e-06,-3e-06,-1.1e-05,-2e-06,-5e-06,9e-06,-1e-06,-3e-06,0,3e-06,-1e-06,3e-06,2e-06,-3e-06,6e-06,1.4e-05,-1e-06,0,-1e-06,-7e-06,-1e-06,8e-06,1e-05,-6e-06,-1e-06,1e-06,-1.1e-05,-5e-06,1e-05,-2e-06,-4e-06,1.6e-05,1.1e-05,-1.9e-05,0,-1e-06,0
0,-1e-06,1e-06,0,1e-06,-2e-06,2e-06,1e-06,-2e-06,3e-06,1e-06,-2e-06,-3e-06,1e-06,-1e-06,0,2e-06,4e-06,1e-06,2e-06,1e-06,-4e-06,-2e-06,-1e-06,0,-1e-06,-2e-06,1e-06,6e-06,-1e-06,-3e-06,-1e-06,-4e-06,-1e-06,1e-06,2e-06,0,-1e-06,-1e-06,0,-4e-06,-2e-06,-1e-06,-3e-06,1e-06,0,0,6e-06,1e-06,-1e-06,-2e-06,2e-06,1.5e-05,1e-06,0,-2e-06,1e-06,1e-06,-1e-06,1e-06,0,3e-06,1e-06,-1.1e-05,-1e-06,0,1.4e-05,2e-06,-3e-06,-1.1e-05,-4e-06,4e-06,5e-06,-5e-06,-1e-06,3e-06,2e-06,-4e-06,-6e-06,-1.3e-05,-7e-06,2e-06,-3e-06,9e-06,-1.2e-05,3e-06,1.3e-05,2e-06,-1e-05,-2e-06,5e-06,-1e-06,5e-06,-1.2e-05,-3e-06,0,2e-06,6e-06,-3e-06,-1e-06,-6e-06,-1.8e-05,4e-06,-1.1e-05,-1e-06,2e-06,-1e-06,1.3e-05,0,3e-06,5e-06,-3e-06,-1.2e-05,-2e-06,0,-9e-06,-8e-06,1.6e-05,-1e-06,2e-06,0
1e-06,-1e-06,-1e-06,0,-5e-06,0,2e-06,-1e-06,-1e-06,-1e-06,-2e-06,4e-06,3e-06,0,0,3e-06,0,1e-06,3e-06,1e-06,-1e-06,1e-06,0,-1e-06,0,1e-06,1e-06,0,-8e-06,3e-06,4e-06,5e-06,0,-1e-06,-1e-06,-1e-06,0,2e-06,-1e-06,-1e-06,4e-06,1e-06,2e-06,4e-06,0,-3e-06,0,-2e-06,-1e-06,0,1e-06,0,-1.1e-05,-3e-06,0,-5e-06,2e-06,-3e-06,3e-06,0,-1e-06,-5e-06,0,9e-06,2e-06,-9e-06,-6e-06,-3e-06,2e-06,8e-06,8e-06,-2e-06,-3e-06,2e-06,6e-06,-3e-06,3e-06,2e-06,3e-06,1.7e-05,8e-06,5e-06,7e-06,-6e-06,1.6e-05,-1e-06,-1.5e-05,0,1.3e-05,2e-06,-8e-06,1e-06,5e-06,3e-06,1e-06,-2e-06,1e-06,-3e-06,1e-06,-3e-06,1e-06,1.5e-05,0,1.6e-05,1e-06,1e-06,-6e-06,-1.2e-05,-2e-06,-6e-06,3e-06,4e-06,1.3e-05,-1e-06,3e-06,-5e-06,9e-06,-9e-06,1e-06,0,-1e-06
-3e-06,-1e-06,0,0,2e-06,-1e-06,-1e-06,2e-06,0,-1e-06,0,0,-3e-06,2e-06,-1e-06,-3e-06,-2e-06,2e-06,3e-06,0,-1e-06,-2e-06,0,-4e-06,1e-06,0,1e-06,-1e-06,2e-06,-2e-06,-5e-06,0,1e-06,2e-06,0,0,0,-1e-06,2e-06,0,-3e-06,-2e-06,-2e-06,-1e-06,-2e-06,3e-06,0,-1e-06,-4e-06,0,0,0,0,2e-06,-1e-06,0,-2e-06,1e-06,-5e-06,3e-06,2e-06,6e-06,-1e-06,-8e-06,5e-06,8e-06,-3e-06,0,3e-06,2e-06,-7e-06,3e-06,3e-06,-2e-06,-4e-06,4e-06,-5e-06,-1e-06,-1e-06,-1.8e-05,-8e-06,1e-06,-3e-06,-1e-06,-1.2e-05,-2e-06,1.7e-05,0,-3e-06,-2e-06,5e-06,2e-06,-3e-06,2e-06,1e-06,-4e-06,-2e-06,-4e-06,0,1.2e-05,2e-06,-6e-06,-2e-06,-1.2e-05,-1e-06,1e-06,3e-06,0,2e-06,8e-06,-8e-06,-2e-06,-1.1e-05,6e-06,-2e-06,1.2e-05,-1e-05,-2e-06,4e-06,-1e-06,0
0,-1e-06,0,0,1e-06,-1e-06,-2e-06,-3e-06,0,2e-06,-2e-06,-2e-06,1e-06,-3e-06,0,-4e-06,3e-06,-4e-06,3e-06,-1e-06,0,0,0,4e-06,-1e-06,1e-06,-1e-06,1e-06,-1e-06,0,3e-06,-1e-06,0,-3e-06,0,1e-06,-1e-06,0,0,0,4e-06,2e-06,1e-06,0,-2e-06,-2e-06,-1e-06,-4e-06,5e-06,1e-06,1e-06,1e-06,8e-06,-3e-06,0,1e-06,1e-06,-1e-06,3e-06,0,0,-5e-06,0,5e-06,-1e-05,2e-06,9e-06,-2e-06,-2e-06,-1e-05,4e-06,0,-7e-06,-1e-06,3e-06,-4e-06,2e-06,0,0,1.2e-05,6e-06,-1e-06,-2e-06,6e-06,-3e-06,1e-06,-1.6e-05,-1e-06,-2e-06,3e-06,-1e-06,-2e-06,-4e-06,-2e-06,1e-06,4e-06,-2e-06,7e-06,0,-1.4e-05,0,0,2e-06,1e-06,-1e-06,-3e-06,0,6e-06,0,-4e-06,3e-06,-2e-06,6e-06,-3e-06,-1e-06,-7e-06,7e-06,9e-06,-2e-06,-1e-06,1e-06
0,1e-06,0,0,2e-06,0,0,2e-06,0,-2e-06,2e-06,2e-06,0,1e-06,-1e-06,2e-06,-3e-06,2e-06,-2e-06,1e-06,-3e-06,0,-1e-06,0,2e-06,-1e-06,0,1e-06,-1e-06,1e-06,-3e-06,-2e-06,-3e-06,2e-06,1e-06,-1e-06,0,-1e-06,1e-06,0,-2e-06,-1e-06,-2e-06,-5e-06,0,3e-06,0,2e-06,-5e-06,0,0,-1e-06,-8e-06,1e-06,0,4e-06,-2e-06,0,1e-06,1e-06,-1e-06,5e-06,-1e-06,-3e-06,8e-06,-4e-06,-1e-05,-1e-06,-2e-06,2e-06,-5e-06,-2e-06,3e-06,-1e-06,-4e-06,1e-06,1e-06,3e-06,3e-06,-4e-06,-7e-06,-4e-06,0,-7e-06,1.4e-05,1e-06,1e-05,0,-2e-06,-3e-06,-3e-06,0,4e-06,2e-06,0,6e-06,-3e-06,-7e-06,-1e-06,5e-06,-1e-06,-8e-06,1e-06,1.3e-05,0,-3e-06,1e-06,-2e-06,-2e-06,6e-06,1e-06,1e-06,-2e-06,0,2e-06,-2e-06,-7e-06,-1e-05,0,1e-06,0
0,0,0,0,-5e-06,1e-06,-1e-06,-2e-06,1e-06,0,0,-4e-06,0,-1e-06,0,0,2e-06,-1e-06,-4e-06,-1e-06,0,-2e-06,0,-3e-06,0,1e-06,0,-1e-06,0,-1e-06,2e-06,-1e-06,2e-06,-1e-06,0,-1e-06,1e-06,0,1e-06,0,-2e-06,1e-06,2e-06,4e-06,1e-06,-5e-06,0,3e-06,3e-06,0,0,1e-06,3e-06,0,0,-1e-06,3e-06,1e-06,0,0,1e-06,-4e-06,0,2e-06,-3e-06,1e-06,7e-06,0,1e-06,4e-06,6e-06,-1e-06,-3e-06,0,-1e-06,-4e-06,-1e-06,-3e-06,-5e-06,-1e-06,8e-06,-2e-06,-3e-06,9e-06,-1.3e-05,-1e-06,-3e-06,0,4e-06,1e-06,5e-06,1e-06,2e-06,-1e-06,-2e-06,-7e-06,-1e-06,3e-06,3e-06,7e-06,0,8e-06,-4e-06,-1.5e-05,-1e-06,3e-06,-2e-06,0,0,-7e-06,-4e-06,1e-06,-1e-06,-2e-06,0,6e-06,7e-06,1.1e-05,-2e-06,0,-1e-06
-1e-06,0,0,0,-1e-06,1e-06,3e-06,2e-06,0,1e-06,1e-06,2e-06,1e-06,0,-1e-06,2e-06,-1e-06,-2e-06,-2e-06,0,1e-06,3e-06,0,-2e-06,0,1e-06,0,0,-2e-06,0,-1e-06,3e-06,-1e-06,-1e-06,1e-06,2e-06,-1e-06,0,-1e-06,0,2e-06,-1e-06,-1e-06,0,2e-06,5e-06,0,-1e-06,-1e-06,0,1e-06,0,4e-06,0,1e-06,-1e-06,0,0,-2e-06,-2e-06,0,4e-06,0,-2e-06,2e-06,4e-06,-6e-06,0,2e-06,-4e-06,1e-06,0,6e-06,1e-06,0,2e-06,1e-06,3e-06,1e-06,3e-06,-5e-06,6e-06,4e-06,-6e-06,4e-06,0,2e-06,0,-3e-06,1e-06,-3e-06,-1e-06,-2e-06,2e-06,0,-3e-06,4e-06,1e-06,-4e-06,-9e-06,2e-06,-7e-06,1e-06,3e-06,0,2e-06,2e-06,2e-06,0,3e-06,3e-06,-3e-06,3e-06,1e-06,-1e-06,0,-5e-06,-1e-05,1e-06,0,0
0,0,0,0,4e-06,0,1e-06,-1e-06,0,-1e-06,0,0,-1e-06,0,0,2e-06,0,1e-06,0,1e-06,2e-06,-2e-06,0,6e-06,-1e-06,-1e-06,0,1e-06,3e-06,2e-06,1e-06,2e-06,-2e-06,2e-06,-1e-06,-2e-06,0,0,0,0,-2e-06,0,1e-06,-3e-06,0,-3e-06,0,0,0,0,-2e-06,0,-9e-06,2e-06,0,-1e-06,0,0,-1e-06,-2e-06,-1e-06,-4e-06,1e-06,1e-06,-1e-06,2e-06,3e-06,1e-06,-2e-06,1e-06,-4e-06,0,-4e-06,0,-2e-06,-1e-06,-1e-06,-2e-06,3e-06,-7e-06,3e-06,3e-06,-4e-06,0,8e-06,1e-06,-2e-06,0,0,-2e-06,0,-1e-06,-4e-06,3e-06,-1e-06,4e-06,3e-06,-5e-06,2e-06,1e-05,1e-06,4e-06,1e-06,8e-06,0,-7e-06,-4e-06,-2e-06,0,-3e-06,0,1e-06,-6e-06,3e-06,0,-3e-06,2e-06,5e-06,0,1e-06,1e-06
1e-06,0,0,0,-1e-06,1e-06,-1e-06,1e-06,0,1e-06,2e-06,-1e-06,1e-06,0,0,-3e-06,1e-06,-1e-06,2e-06,0,1e-06,1e-06,0,-3e-06,1e-06,0,0,-1e-06,-2e-06,-1e-06,-1e-06,-3e-06,3e-06,-1e-06,0,0,1e-06,1e-06,-1e-06,0,4e-06,0,-1e-06,1e-06,-1e-06,2e-06,0,-4e-06,0,0,1e-06,0,9e-06,-1e-06,1e-06,-2e-06,0,0,2e-06,1e-06,0,4e-06,0,1e-06,-2e-06,-6e-06,0,-2e-06,-1e-06,-3e-06,3e-06,0,1e-06,1e-06,3e-06,0,1e-06,1e-06,-3e-06,1e-05,-5e-06,-6e-06,2e-06,4e-06,-1.4e-05,0,1e-06,-1e-06,2e-06,-1e-06,2e-06,1e-06,1e-06,0,2e-06,2e-06,1e-06,6e-06,0,-5e-06,0,-8e-06,-1e-06,-1.1e-05,0,-3e-06,6e-06,4e-06,1e-06,1e-06,1e-06,-1e-06,7e-06,-3e-06,0,1e-06,0,2e-06,2e-06,-1e-06,0
-2e-06,0,0,0,0,1e-06,-1e-06,0,-1e-06,-1e-06,1e-06,2e-06,0,0,0,0,-1e-06,0,3e-06,-1e-06,-1e-06,2e-06,-1e-06,0,-1e-06,0,1e-06,0,2e-06,1e-06,0,-2e-06,-3e-06,0,-1e-06,1e-06,0,0,0,0,-3e-06,0,1e-06,-1e-06,-1e-06,-1e-06,0,4e-06,-1e-06,-1e-06,0,-1e-06,-3e-06,1e-06,-1e-06,3e-06,1e-06,0,-1e-06,-1e-06,0,-5e-06,0,-2e-06,3e-06,6e-06,-4e-06,1e-06,1e-06,1e-06,-2e-06,2e-06,-1e-06,1e-06,-1e-06,0,-1e-06,-1e-06,0,-9e-06,8e-06,-3e-06,-1e-06,-6e-06,1e-05,-1e-06,1e-06,1e-06,-2e-06,-1e-06,-2e-06,1e-06,4e-06,4e-06,0,0,0,-3e-06,0,-3e-06,1e-06,3e-06,1e-06,8e-06,0,3e-06,-6e-06,-4e-06,2e-06,-1e-06,-2e-06,0,-6e-06,1e-06,0,3e-06,0,-6e-06,-3e-06,1e-06,-1e-06
0,0,0,0,-2e-06,0,-1e-06,0,0,-1e-06,0,-2e-06,0,0,0,0,1e-06,2e-06,0,0,0,-2e-06,0,0,1e-06,0,0,1e-06,-2e-06,1e-06,0,2e-06,1e-06,1e-06,1e-06,-1e-06,0,1e-06,1e-06,0,2e-06,0,0,3e-06,-1e-06,1e-06,0,-1e-06,0,1e-06,0,1e-06,-4e-06,-1e-06,1e-06,1e-06,1e-06,0,2e-06,0,0,5e-06,1e-06,3e-06,0,2e-06,4e-06,-2e-06,1e-06,-1e-06,4e-06,-1e-06,1e-06,0,2e-06,1e-06,0,0,1e-06,8e-06,-4e-06,4e-06,0,9e-06,2e-06,0,-5e-06,0,0,3e-06,1e-06,-1e-06,-1e-06,-5e-06,1e-06,-2e-06,-2e-06,-2e-06,1e-06,8e-06,0,3e-06,-1e-06,1e-06,0,-1e-06,3e-06,1e-06,-1e-06,-2e-06,2e-06,-1e-06,4e-06,-1e-06,0,-5e-06,1e-06,8e-06,3e-06,0,0
0,0,0,0,3e-06,0,1e-06,1e-06,0,1e-06,0,1e-06,0,0,0,-1e-06,-1e-06,0,-2e-06,0,-1e-06,2e-06,1e-06,0,-2e-06,1e-06,0,0,1e-06,-2e-06,0,2e-06,0,-1e-06,0,0,0,-1e-06,0,0,-1e-06,0,1e-06,-4e-06,1e-06,-1e-06,0,4e-06,2e-06,0,0,0,8e-06,-1e-06,-1e-06,0,-1e-06,-1e-06,-1e-06,-1e-06,0,-5e-06,-1e-06,-3e-06,0,-3e-06,-2e-06,1e-06,-2e-06,3e-06,-4e-06,1e-06,1e-06,0,-1e-06,0,1e-06,0,-2e-06,-4e-06,3e-06,2e-06,1e-06,-6e-06,-1e-05,1e-06,7e-06,0,0,-2e-06,0,0,-3e-06,1e-06,-1e-06,0,-2e-06,5e-06,-1e-06,-8e-06,-1e-06,-9e-06,0,-1.1e-05,0,0,-1e-06,3e-06,0,1e-06,-3e-06,-1e-06,0,2e-06,0,0,-3e-06,-4e-06,-2e-06,-1e-06,0
0,0,0,0,0,0,2e-06,-1e-06,-1e-06,-1e-06,0,0,0,-1e-06,0,3e-06,0,0,-2e-06,0,-1e-06,-1e-06,0,3e-06,1e-06,0,0,-1e-06,-1e-06,1e-06,1e-06,-1e-06,-2e-06,1e-06,1e-06,1e-06,0,1e-06,1e-06,0,0,0,-1e-06,0,2e-06,1e-06,1e-06,-6e-06,0,-1e-06,-1e-06,0,-6e-06,0,0,-2e-06,0,1e-06,-1e-06,1e-06,-1e-06,5e-06,1e-06,3e-06,-1e-06,-2e-06,-2e-06,-3e-06,0,-4e-06,0,-2e-06,-1e-06,0,-1e-06,0,-1e-06,-1e-06,2e-06,-1e-06,-6e-06,-2e-06,0,2e-06,1e-05,-1e-06,-6e-06,0,4e-06,1e-06,-1e-06,0,1e-06,3e-06,-1e-06,0,-1e-06,-5e-06,0,7e-06,0,3e-06,1e-06,1.1e-05,0,2e-06,3e-06,-6e-06,1e-06,-2e-06,1e-06,1e-06,-3e-06,0,0,4e-06,4e-06,-1e-06,4e-06,0,0
-1e-06,0,0,0,-3e-06,0,0,1e-06,0,0,0,-1e-06,0,1e-06,0,0,1e-06,0,-1e-06,0,0,-1e-06,0,-3e-06,0,-1e-06,0,1e-06,-1e-06,0,-1e-06,-3e-06,1e-06,0,0,0,0,0,0,0,2e-06,0,1e-06,3e-06,0,-3e-06,0,3e-06,0,0,0,0,0,0,0,-2e-06,0,-1e-06,0,-1e-06,0,-5e-06,0,-4e-06,0,4e-06,6e-06,2e-06,1e-06,1e-06,2e-06,0,1e-06,0,2e-06,-1e-06,0,0,-2e-06,3e-06,6e-06,-1e-06,-1e-06,2e-06,-2e-06,0,6e-06,0,-7e-06,-1e-06,1e-06,0,2e-06,-2e-06,0,3e-06,0,1e-06,1e-06,0,-1e-06,-2e-06,-2e-06,-2e-06,0,-2e-06,-5e-06,3e-06,-1e-06,4e-06,-1e-06,-2e-06,5e-06,-2e-06,0,-3e-06,-4e-06,5e-06,-2e-06,0,0
-1e-06,0,0,0,1e-06,-1e-06,-1e-06,-1e-06,0,1e-06,-1e-06,1e-06,0,0,0,-2e-06,-1e-06,-2e-06,1e-06,0,1e-06,1e-06,0,-1e-06,0,0,0,0,1e-06,-1e-06,2e-06,0,-1e-06,-1e-06,0,-1e-06,0,0,0,0,-3e-06,0,-1e-06,-2e-06,-1e-06,3e-06,0,-4e-06,1e-06,0,0,0,6e-06,0,1e-06,2e-06,0,0,0,1e-06,0,4e-06,-1e-06,4e-06,-1e-06,1e-06,-8e-06,-3e-06,0,2e-06,-3e-06,0,-4e-06,-1e-06,-3e-06,1e-06,0,0,-2e-06,-5e-06,-4e-06,1e-06,3e-06,-5e-06,-9e-06,1e-06,-6e-06,0,1e-06,3e-06,-2e-06,0,0,-1e-06,0,1e-06,1e-06,3e-06,-1e-06,-7e-06,-1e-06,2e-06,0,-7e-06,0,0,6e-06,2e-06,0,-4e-06,1e-06,0,-7e-06,1e-06,0,-1e-06,4e-06,-9e-06,3e-06,0,0
