-5e-06,-2.8e-05,-4.3e-05,4.2e-05,0.000208,8.4e-05,3.7e-05,-2.2e-05,3.4e-05,7e-05,-2.8e-05,-2.7e-05,5e-05,7e-06,1.2e-05,1.5e-05,5.5e-05,0.000124,8.6e-05,5.8e-05,6.2e-05,1.6e-05,3.9e-05,1.7e-05,-1.7e-05,-3.2e-05,8e-06,1.7e-05
6.8e-05,-2.4e-05,-8.6e-05,0.000106,0.000369,0.000209,7.2e-05,2.4e-05,2e-05,3.8e-05,-2.3e-05,-3.8e-05,-1e-05,-5e-05,6e-06,3e-06,1.8e-05,7.7e-05,4.4e-05,-1.7e-05,-8e-06,-3e-06,1.4e-05,-1e-06,-4.9e-05,-8.9e-05,-2.3e-05,-1.4e-05
-4.6e-05,-5.6e-05,-3.7e-05,5.5e-05,0.000186,0.000134,5.2e-05,1.8e-05,4.5e-05,4.1e-05,4e-06,-1e-06,-1.1e-05,-5.6e-05,-1.2e-05,-1.3e-05,-1.1e-05,4.2e-05,1.1e-05,-4.2e-05,-3.7e-05,3e-06,2.4e-05,1.3e-05,-1.1e-05,-3.9e-05,-2e-05,-2.5e-05
-8e-05,-1.7e-05,2.4e-05,2.3e-05,-3e-06,4.7e-05,6.3e-05,1.7e-05,4.8e-05,4.8e-05,3.2e-05,3.6e-05,2.3e-05,-1.1e-05,1.6e-05,1.9e-05,-1.3e-05,2e-05,-4e-06,-3.7e-05,-3.7e-05,2.1e-05,3.3e-05,2.1e-05,3.1e-05,3.3e-05,-3e-06,-1.9e-05
3.5e-05,3.8e-05,1.3e-05,8.7e-05,0.000153,0.000179,9e-05,2.9e-05,1.9e-05,2e-05,5.5e-05,4.6e-05,3.3e-05,3.2e-05,3.8e-05,5.5e-05,-4e-06,-4e-06,-1.8e-05,-5e-05,-5e-05,2.7e-05,1.9e-05,5e-06,1.5e-05,2.8e-05,5e-06,-7e-06
-9.6e-05,-0.000121,-0.000158,-8.8e-05,-4.4e-05,-3.3e-05,-0.000106,-5.1e-05,-5e-05,-6.1e-05,8e-06,-1.6e-05,-9e-06,1.9e-05,-2.9e-05,-3e-06,-4.1e-05,-5.7e-05,-5.9e-05,-0.000109,-9.6e-05,0,-1.2e-05,-1.9e-05,-3.6e-05,-3.4e-05,-2e-06,-3e-06
-0.000172,-0.000142,-0.00021,-0.00019,-0.000332,-0.00034,-0.000203,-3e-05,-4e-05,-6.6e-05,-2.3e-05,-5.6e-05,-4.4e-05,0,-4e-05,-2.7e-05,-6.6e-05,-9.2e-05,-5.9e-05,-0.000119,-1e-04,-1.7e-05,-2.3e-05,-1.3e-05,-4.4e-05,-4.8e-05,-5e-06,-5e-06
-1.7e-05,0,-8.1e-05,-1.9e-05,-0.000165,-0.000214,-0.00011,4.9e-05,2.2e-05,0,1.1e-05,-2.4e-05,-6e-05,-9e-06,1.1e-05,4e-06,-5.9e-05,-8.8e-05,-2.7e-05,-7.6e-05,-5.8e-05,-5e-06,-9e-06,1.3e-05,-8e-06,-1.1e-05,-1e-06,-8e-06
-7e-06,-3.8e-05,-2.8e-05,5.8e-05,-6.2e-05,-5.8e-05,-0.000106,-1.7e-05,2e-06,9e-06,8e-06,-1.3e-05,-7.6e-05,-1.6e-05,2.3e-05,-1e-06,-6.9e-05,-8.3e-05,-2.7e-05,-4.8e-05,-2.6e-05,8e-06,-6e-06,1.8e-05,1.9e-05,1.5e-05,-4e-06,-1.4e-05
-0.000116,-0.00011,-5.8e-05,-7e-06,-0.000221,-0.000171,-0.000138,-9.6e-05,-4.7e-05,-2.2e-05,-2.4e-05,-4e-05,-8.4e-05,-5e-06,2.9e-05,-1.1e-05,-7.6e-05,-8e-05,-3.3e-05,-1.9e-05,-6e-06,0,-1.8e-05,4e-06,1.1e-05,8e-06,-6e-06,-1.4e-05
-0.000111,-8.3e-05,-4.9e-05,1e-06,-0.000109,-0.000158,-0.000109,-6.9e-05,-3.2e-05,-4.5e-05,-1.8e-05,-3.6e-05,-7.6e-05,5e-06,1e-06,-2.7e-05,-5.8e-05,-7.3e-05,-2.1e-05,1e-05,9e-06,-2.2e-05,-2.2e-05,-2e-06,-1.3e-05,-2.1e-05,1e-06,-8e-06
-5.8e-05,-8.2e-05,-1e-05,7.3e-05,0.000165,2e-06,-8.5e-05,-2.1e-05,-2e-06,-4.9e-05,-1e-06,-1.3e-05,-5.1e-05,3e-06,-5.3e-05,-5.5e-05,-2.6e-05,-6e-05,-1.5e-05,1.2e-05,2.5e-05,-2.6e-05,-1e-05,3e-06,-9e-06,-1.4e-05,1.7e-05,6e-06
-5.5e-05,-9.7e-05,1.6e-05,8.1e-05,7.2e-05,-9.3e-05,-0.000119,-3.7e-05,-2e-05,-1.5e-05,-3e-06,-9e-06,-1.8e-05,3e-06,-5.2e-05,-4.7e-05,1.5e-05,-4.1e-05,-2.4e-05,1.9e-05,4.6e-05,-1.2e-05,2e-06,6e-06,2.3e-05,2.6e-05,2.2e-05,1.5e-05
-3.1e-05,-9.6e-05,2.6e-05,6.4e-05,-6.4e-05,-0.000183,-0.000135,-6.8e-05,-4.6e-05,2.2e-05,-5e-06,-6e-06,-5e-06,-2e-06,-3.7e-05,-2.7e-05,4.9e-05,-2.1e-05,-3.3e-05,4.8e-05,5.8e-05,-1e-06,3e-06,1e-06,3.7e-05,3.2e-05,6e-06,1e-05
2e-05,-6.5e-05,5.7e-05,0.000106,9.3e-05,1.8e-05,-1.3e-05,-2.1e-05,-3.5e-05,2.3e-05,1e-06,8e-06,-8e-06,-8e-06,-2.3e-05,-3e-06,6.1e-05,2e-06,-1.6e-05,8.1e-05,5.7e-05,6e-06,-6e-06,-7e-06,1.7e-05,0,-1e-05,-4e-06
-2e-06,2.4e-05,8.7e-05,5.5e-05,5.1e-05,5.3e-05,0.000124,3.6e-05,-2.7e-05,-1e-06,1e-05,1.8e-05,-4e-06,-4e-06,7e-06,1.8e-05,5.2e-05,2.5e-05,1.9e-05,9.5e-05,3.8e-05,-1e-06,-1.4e-05,-8e-06,-1.2e-05,-3.1e-05,-1.2e-05,-1.1e-05
-2.6e-05,8.2e-05,7.6e-05,-0.000107,-0.000178,-0.000112,0.000132,2.9e-05,-5e-05,-2.9e-05,1.3e-05,2.3e-05,1.2e-05,-5e-06,-6e-06,-8e-06,3.2e-05,3.5e-05,3.3e-05,5.9e-05,5e-06,-1.3e-05,-1.2e-05,-5e-06,-2.1e-05,-2.4e-05,-5e-06,-1.1e-05
4e-05,7.8e-05,7.8e-05,-0.000123,-0.000156,-8.9e-05,9.4e-05,8e-06,-5.7e-05,-3.2e-05,0,2.1e-05,3.8e-05,-4e-06,-3e-05,-4.2e-05,2.6e-05,3.9e-05,2.1e-05,-7e-06,-1.5e-05,-7e-06,0,-2e-06,4e-06,2.5e-05,6e-06,-4e-06
5.8e-05,7.7e-05,9.3e-05,-3.3e-05,-0.000136,-3e-05,7.6e-05,0,-2.8e-05,4e-06,-1.3e-05,5e-06,5.2e-05,8e-06,-8e-06,-3.6e-05,3.2e-05,3.9e-05,-5e-06,-3.6e-05,-2e-05,2e-06,9e-06,5e-06,3.5e-05,5.6e-05,6e-06,5e-06
