-0.000365,-0.000349,-0.000337,-0.000494,-0.000679,-0.00057,-0.000334,-0.000533,-0.000695,-0.000272,-0.000431,-0.000597,-0.000503,-0.000362,-0.000293,-0.000214,-0.000244,-0.000368,-0.000482,-0.000264,-0.000412,-0.000386,-0.000238,-0.000239,-0.000223,-0.000305,-0.000341,-0.000326
9e-05,3.1e-05,5.7e-05,7.7e-05,0.000218,0.000226,9.8e-05,0.00016,0.00026,0.000123,0.00024,0.000274,0.000192,0.000173,0.000151,5.9e-05,5.6e-05,0.00015,0.000261,0.000118,0.000183,0.000182,8.6e-05,7.9e-05,9.6e-05,0.000144,0.000131,0.000134
0.000155,1e-04,9.4e-05,0.000261,0.000398,0.000328,0.000178,0.000315,0.000455,0.000137,0.00026,0.000332,0.000238,0.000194,0.000176,7.1e-05,9.2e-05,0.000191,0.00031,0.000127,0.000235,0.000249,0.000139,0.00014,0.000146,0.000202,0.000211,0.000204
-0.000219,-0.000191,-0.000212,-0.00022,-0.000393,-0.000402,-0.000226,-0.000319,-0.000477,-0.000216,-0.000376,-0.000495,-0.000375,-0.000312,-0.000285,-0.000167,-0.000139,-0.000285,-0.000416,-0.000257,-0.000353,-0.000305,-0.000168,-0.000149,-0.00015,-0.000217,-0.000231,-0.000251
-1.8e-05,3e-06,1e-05,-0.000135,-0.000162,-0.000125,-0.000111,-0.000171,-0.000263,-4.8e-05,-0.000113,-0.000144,-5.7e-05,-7.8e-05,-0.000129,-1.2e-05,-9e-06,-9.2e-05,-0.000161,-9.2e-05,-0.000131,-0.000114,-8.9e-05,-7.8e-05,-7.9e-05,-8.5e-05,-0.000114,-0.000167
0.000213,0.000216,0.000223,0.000221,0.000453,0.000428,0.00018,0.000349,0.000528,0.000195,0.000375,0.000534,0.000401,0.000299,0.000236,0.000149,9.6e-05,0.000221,0.00038,0.000196,0.00034,0.00033,0.000168,0.000157,0.000139,0.000205,0.000222,0.000196
-6.8e-05,-2e-06,-4.4e-05,2.6e-05,3e-06,-5.7e-05,-3.3e-05,8e-06,2.2e-05,-8e-05,-6.5e-05,-3.9e-05,-7.8e-05,-7.1e-05,-2.9e-05,-5.4e-05,-9.1e-05,-8.5e-05,-4.7e-05,-2.7e-05,-4.5e-05,-4.9e-05,-7e-06,1.2e-05,0,-3.4e-05,-1e-06,3.7e-05
-0.000144,-0.000118,-0.000141,-0.000162,-0.000376,-0.000382,-0.00017,-0.000312,-0.000515,-0.000181,-0.000328,-0.000466,-0.000343,-0.000273,-0.00025,-0.000124,-9.7e-05,-0.00022,-0.000329,-0.000156,-0.000307,-0.000332,-0.000187,-0.000133,-0.000115,-0.000177,-0.000195,-0.000207
7.6e-05,-1.9e-05,2.8e-05,6.4e-05,0.000143,0.000136,7.6e-05,0.000131,0.000156,9.1e-05,0.000173,0.000181,0.000133,0.000122,6.2e-05,4.1e-05,8.8e-05,0.000126,0.000168,7.2e-05,0.000129,0.000132,3.4e-05,2.1e-05,3.8e-05,7.9e-05,4.7e-05,-2e-06
3.8e-05,1e-06,1.2e-05,9.4e-05,0.000235,0.000255,0.000126,0.000268,0.000415,6.8e-05,0.000217,0.000319,0.000191,0.000176,0.000188,5.4e-05,7.4e-05,0.000155,0.000234,0.000103,0.000221,0.000249,0.000142,8.2e-05,9.1e-05,0.000116,0.000145,0.000189
-0.000127,-8.5e-05,-0.000107,-0.000163,-0.000316,-0.000227,-0.000107,-0.000229,-0.000324,-0.000146,-0.000256,-0.000307,-0.000211,-0.000177,-0.000124,-7.2e-05,-6.9e-05,-0.000137,-0.000251,-8.5e-05,-0.000171,-0.00021,-7.2e-05,-6.2e-05,-6.7e-05,-0.000118,-8.1e-05,-2.7e-05
5.4e-05,3.6e-05,3.2e-05,-2.3e-05,-8.7e-05,-8.9e-05,-1.3e-05,-0.000156,-0.000266,-1e-05,-9.2e-05,-0.000143,-4.6e-05,-5.5e-05,-7.2e-05,2e-05,-1.1e-05,-4e-06,-9.6e-05,-6e-06,-5.6e-05,-0.000108,-7.7e-05,-3.9e-05,-5.2e-05,-4.1e-05,-5.5e-05,-0.000113
0.000163,0.00015,0.000154,0.000237,0.000396,0.000281,0.000186,0.000302,0.000434,0.000161,0.000297,0.000397,0.000259,0.00021,0.000189,9.9e-05,9e-05,0.000209,0.000281,0.000128,0.000246,0.000267,0.000123,9.1e-05,6.7e-05,0.000107,0.000102,9.5e-05
-1.2e-05,5.9e-05,3.9e-05,4.7e-05,2.3e-05,3.2e-05,2.7e-05,6.8e-05,0.000141,1.1e-05,-1.1e-05,1.4e-05,-1e-05,4e-06,5.9e-05,5e-06,4.2e-05,2.5e-05,1.6e-05,3e-06,-1e-06,9e-06,4.2e-05,2.4e-05,1.9e-05,-8e-06,3.2e-05,0.000124
-0.000141,-0.000103,-9.4e-05,-0.000245,-0.000386,-0.000238,-0.000149,-0.000325,-0.000441,-8.9e-05,-0.000273,-0.000404,-0.000226,-0.000169,-0.000159,-7.6e-05,-5e-05,-0.000165,-0.00026,-0.000122,-0.000233,-0.000257,-0.000128,-8.9e-05,-8e-05,-0.00011,-9.1e-05,-0.000103
1.7e-05,-3.6e-05,-2.8e-05,-5.5e-05,4.9e-05,6.3e-05,3.9e-05,2.5e-05,4.1e-05,5.8e-05,0.000119,9.1e-05,6.4e-05,7.9e-05,3e-05,1e-05,-2.6e-05,-4e-06,6.4e-05,1.5e-05,4.5e-05,7.9e-05,1.2e-05,3e-06,1.5e-05,6.1e-05,9e-06,-7.1e-05
8.7e-05,4e-05,1.9e-05,0.000152,0.000263,0.000153,7.4e-05,0.000256,0.000403,6e-05,0.000195,0.000281,0.000131,0.000122,0.000148,3.3e-05,-1.4e-05,6e-05,0.000188,7.4e-05,0.000134,0.000175,1e-04,5.7e-05,6.6e-05,6.8e-05,4.7e-05,8.3e-05
-4.1e-05,-5e-05,-2.2e-05,0,-0.000131,-0.000124,-9.6e-05,-0.000118,-0.000155,-4.6e-05,-0.000184,-0.000219,-0.000141,-0.000115,-5.6e-05,-2.6e-05,-3.7e-05,-8.1e-05,-0.000117,-4.7e-05,-0.000126,-0.000162,-5.3e-05,-2.2e-05,-2.3e-05,-7.3e-05,-5e-05,-1e-05
-6.9e-05,-6.2e-05,-1.7e-05,-0.000115,-0.000173,-0.000105,-7.2e-05,-0.000195,-0.000317,-9e-06,-9.6e-05,-0.000169,-7.9e-05,-6.5e-05,-0.000112,-1.9e-05,-1.3e-05,-7.1e-05,-0.00012,-5.1e-05,-8.1e-05,-0.000108,-7.4e-05,-4.4e-05,-6.1e-05,-3.6e-05,-4e-05,-0.000114
