1.1e-05,-1.1e-05,-0.000167,-0.009076,-0.022937,-0.010524,-0.008877,-0.03445,-0.062089,-0.145443,-0.203017,-0.194558,-0.167286,-0.156464,-0.156655,-0.117115,-0.041704,-0.015094,-0.007907,-0.005299,-0.000729,-0.001074,-0.001403,-0.000122,-2.1e-05,-1.2e-05,-6e-06,4e-06
6e-06,-3e-06,-7.3e-05,-0.002294,-0.007146,-0.006568,-0.006688,-0.020542,0.007816,0.10993,0.077393,0.110585,0.173849,0.168025,0.163893,0.121741,0.041976,0.01754,0.009408,0.00604,0.001187,0.000695,0.000315,4.5e-05,3.6e-05,0,0,4e-06
-2e-06,-6e-06,2e-05,0.00479,0.011876,0.001965,0.001614,0.013729,0.010321,0.011632,0.020616,0.015755,0.007876,0.001573,0.012491,-0.005136,-0.010139,-0.005094,-0.000946,-0.000361,-0.000343,-0.000108,-0.000408,-8.5e-05,1e-06,-6e-06,-2e-06,-2e-06
-3e-06,-4e-06,6.2e-05,0.002363,0.007975,0.006945,0.007305,0.028047,0.001026,-0.11467,-0.104497,-0.112654,-0.172373,-0.164278,-0.163378,-0.122856,-0.036548,-0.013254,-0.008652,-0.005513,-0.001204,-0.000747,-0.000811,-8.2e-05,-1.1e-05,-4e-06,-3e-06,-3e-06
-4e-06,5e-06,8.6e-05,-0.000208,-0.000187,0.004414,0.003987,0.004946,0.026189,0.086511,0.128395,0.142525,0.128269,0.117417,0.105184,0.097545,0.044666,0.01723,0.007027,0.004302,0.001087,0.00062,0.000467,0.000156,4e-05,1e-05,4e-06,3e-06
-5e-06,-1e-06,-2.5e-05,-0.002333,-0.00834,-0.004841,-0.00518,-0.026789,-0.017127,0.055381,0.080578,0.063502,0.07911,0.068312,0.076381,0.051908,0.00404,-0.001791,0.001903,0.000814,0.000335,-1.7e-05,-0.000305,-4e-06,7e-06,0,-2e-06,-1e-06
-1e-06,-8e-06,-0.000113,-0.002828,-0.007433,-0.005706,-0.00587,-0.014722,-0.036971,-0.118753,-0.184309,-0.198519,-0.175948,-0.147347,-0.139231,-0.118416,-0.043289,-0.014765,-0.007542,-0.004996,-0.000976,-0.000279,-0.000172,-7.9e-05,-1e-05,-6e-06,-5e-06,1e-06
1e-06,-3e-06,-2.6e-05,0.001651,0.006505,0.001942,0.00129,0.015802,0.022846,0.014126,-0.027056,0.012313,0.041061,0.039904,0.030229,0.036219,0.02025,0.009787,0.003253,0.001906,0.000106,0.000395,0.000788,5.6e-05,2.1e-05,1e-06,3e-06,8e-06
5e-06,5e-06,7.2e-05,0.003412,0.008763,0.003327,0.003943,0.013404,0.023136,0.08029,0.134663,0.146285,0.128432,0.093464,0.091947,0.079135,0.019351,0.004443,0.003652,0.001835,-0.000293,-0.000977,-0.000556,-5.4e-05,1e-06,-2e-06,5e-06,5e-06
8e-06,7e-06,5.5e-05,-0.000529,-0.002927,0.000219,0.001666,-0.002661,-0.012718,-0.058667,-0.049257,-0.073776,-0.115939,-0.097215,-0.086855,-0.080935,-0.022064,-0.006384,-0.0046,-0.002871,-0.000962,-0.001165,-0.000699,-5.7e-05,-6e-06,-3e-06,0,2e-06
6e-06,4e-06,-8e-06,-0.003525,-0.009797,-0.001581,-0.00143,-0.008962,-0.005937,-0.022313,-0.051342,-0.036426,-0.02122,-0.003158,-0.012859,-0.012815,0.005118,0.0038,0.000375,0.000787,0.000178,0.000354,0.00044,4.8e-05,1.8e-05,3e-06,0,2e-06
6e-06,3e-06,-4e-05,0.000286,0.001287,-0.001363,-0.002955,-0.005901,-0.003966,0.053806,0.075411,0.078202,0.118937,0.090975,0.079168,0.070998,0.01176,0.00031,0.003393,0.002299,0.000368,0.000369,0.000227,-3.1e-05,8e-06,7e-06,6e-06,4e-06
2e-06,-1e-06,-3.2e-05,0.002083,0.006783,0.00043,-0.000468,0.00443,-0.003508,-0.026102,-0.043469,-0.070967,-0.074226,-0.062446,-0.051077,-0.048022,-0.017424,-0.005801,-0.002204,-0.001351,-0.000506,-0.000637,-0.000343,-6.8e-05,-4e-06,3e-06,5e-06,5e-06
-3e-06,-4e-06,1e-05,0.000843,0.002568,0.001693,0.002343,0.006457,0.011463,-0.031817,-0.080275,-0.047502,-0.063448,-0.03962,-0.03293,-0.034752,-0.002418,0.001792,-0.001868,-0.001119,-0.000313,-0.000857,-0.000491,4e-06,7e-06,-2e-06,0,2e-06
-3e-06,1e-06,4.3e-05,-0.000985,-0.003946,-0.000275,0.00163,0.000478,0.005989,0.050143,0.087129,0.118966,0.110325,0.072209,0.068168,0.076034,0.019883,0.004219,0.002566,0.001514,-1.3e-05,-0.000313,-0.00013,-2.2e-05,-2e-06,-2e-06,-1e-06,-1e-06
-6e-06,0,1.5e-05,-0.000804,-0.002444,-0.000364,-2.5e-05,-0.000656,-0.005745,0.013053,0.053936,0.008762,-0.012028,-0.020448,-0.016567,-0.004805,-0.001969,-0.000666,0.001045,0.001038,-0.000152,5.9e-05,0.00034,-2.2e-05,-1.1e-05,-1e-06,0,-1e-06
-7e-06,-3e-06,-3.9e-05,-0.000586,-0.000443,-4.7e-05,-0.001676,-0.00321,-0.004299,-0.04387,-0.085502,-0.105451,-0.087564,-0.041072,-0.040267,-0.058929,-0.01758,-0.003653,-0.00226,-0.00143,-0.000182,-0.000243,-0.000168,-4e-06,-3e-06,-4e-06,-3e-06,-8e-06
-6e-06,-2e-06,-4e-05,0.001114,0.003071,-0.000208,-0.001622,-0.004504,-0.004224,0.006487,0.000163,0.023576,0.062996,0.049523,0.04014,0.034469,0.004848,0.00035,0.000195,-0.000534,7e-06,-0.000142,-0.000236,-2e-05,-1e-06,-1e-06,-4e-06,-1e-05
-6e-06,0,1.3e-05,0.001108,0.002289,9.4e-05,0.000959,0.00356,0.004563,0.029933,0.064998,0.04969,0.026753,-0.003368,-0.000699,0.017913,0.008359,0.002108,0.002155,0.00169,0.000221,0.000182,0.000318,-4e-06,-9e-06,3e-06,-1e-06,-6e-06
