5.5e-05,4e-06,3.7e-05,5.9e-05,3.2e-05,4.8e-05,0.000138,1.4e-05,3.4e-05,4e-06,2.9e-05,6.1e-05,1.3e-05,4.2e-05,2.9e-05,6e-06,8e-05,0.000147,6.6e-05,0.000105,2.6e-05,7e-06,2.6e-05,8.2e-05,6.8e-05,1.7e-05,7.3e-05,8.1e-05,6e-05,1.9e-05,2.8e-05,5.2e-05,1e-04,2.7e-05,2.8e-05,4.3e-05,2.5e-05,4.2e-05,1.4e-05,2.1e-05,3.8e-05,6.8e-05,3.8e-05,1.2e-05,5.1e-05,8.6e-05,4e-06,2e-05,1.1e-05,3.7e-05,1.1e-05,5.9e-05,1.9e-05,1.8e-05,3.5e-05,7.9e-05,2.1e-05,9.3e-05,8e-05,5.5e-05,4.5e-05,5.4e-05,4.5e-05,5.5e-05,0.000138,3.8e-05,6.4e-05,9.6e-05,2.7e-05,0,1e-06,8.2e-05,1.5e-05,2.5e-05,5e-06,3.1e-05,1e-06,6.1e-05,2.2e-05,3.5e-05,2e-05,1.5e-05,7e-06,5.7e-05,8e-05,4.1e-05,2.5e-05,6.6e-05,3.5e-05,1.6e-05,5.2e-05,5.7e-05,4.1e-05,2.7e-05,1.4e-05,3e-06,2.3e-05,1e-05,3.6e-05,7.3e-05,2e-05,8e-05,2.5e-05,1.6e-05,2.2e-05,5.3e-05,7.2e-05,3.7e-05,1.5e-05,3.8e-05,4.9e-05,5.4e-05,7e-06,1.8e-05,1e-05,2e-05,7.9e-05,0.000113,6.4e-05,5.2e-05,1.6e-05
0.000156,8.8e-05,0.000159,0.000252,7.8e-05,0.000148,0.000287,0.000314,0.00018,0.000106,0.000135,0.000108,0.000223,0.000245,0.000231,0.000151,0.000211,0.000406,0.000435,0.000388,0.000343,0.000155,0.000227,0.000134,0.000338,0.000128,0.00017,0.000208,0.000267,0.000203,0.000168,0.000219,0.000334,0.000271,0.000139,0.000201,0.000197,0.000135,5e-06,9.2e-05,4e-05,0.00012,0.000243,0.000177,0.000186,0.000245,0.000167,0.000113,4.2e-05,5.7e-05,8.2e-05,0.000209,9.4e-05,1e-05,9.1e-05,0.000209,6.1e-05,0.000323,0.000316,0.000269,0.000276,0.000105,0.000153,0.000196,0.000353,0.000266,0.000301,0.00036,0.000185,0.000106,0.000111,0.000193,0.000104,4.4e-05,0.000189,0.000192,0.000177,0.000146,0.000171,0.000162,9.8e-05,8.3e-05,8.7e-05,0.000204,0.000267,0.000192,6e-05,0.000141,0.000104,7e-05,0.000151,0.000135,0.000153,0.00015,0.000119,0.000125,3.7e-05,0.00016,0.000131,0.000242,0.000177,0.000221,0.000166,0.000181,8.4e-05,8.2e-05,0.00027,0.000183,9.2e-05,0.000154,6.5e-05,0.000156,0.000104,6.2e-05,3.4e-05,5.3e-05,0.000175,0.000316,0.000295,0.000294,0.000154
0.000213,0.000305,1e-04,0.000362,0.000275,0.000205,0.000171,0.000427,0.000425,0.000105,0.000209,0.00028,0.000473,0.000164,7.1e-05,8.9e-05,0.000173,0.00017,0.000415,0.000312,0.000252,0.000298,0.000299,0.000193,0.000458,0.000169,0.000242,9.6e-05,0.000187,3.5e-05,0.000254,0.000389,0.000214,2e-04,0.000243,0.000216,0.000214,2.4e-05,7.3e-05,0.00015,0.000116,8.3e-05,0.000406,0.000189,8.1e-05,0.000116,0.000326,7.6e-05,8.5e-05,7.4e-05,0.000178,0.000145,0.00026,0.000193,6.3e-05,0.000143,0.000277,0.000194,0.000164,5.3e-05,0.000146,0.000149,6.8e-05,5.9e-05,0.000124,0.000338,3.8e-05,0.000202,0.000208,0.000162,0.000156,0.000136,0.000223,9.3e-05,0.00027,0.000163,0.000211,0.000175,0.000216,8.5e-05,4.9e-05,0.000109,8.1e-05,0.000135,0.000192,0.000235,0.000268,8.9e-05,0.000172,6.5e-05,0.000146,0.000123,0.000151,0.000172,6.9e-05,0.000204,7.6e-05,0.00026,4.2e-05,0.000166,0.000251,0.000192,8.6e-05,9.5e-05,0.000232,0.000125,0.000344,0.000231,9.7e-05,0.000244,0.000266,0.000287,0.00019,5e-05,0.00015,4e-05,0.000151,0.000191,7.2e-05,0.000131,4.4e-05
9.2e-05,0.000285,0.000491,0.000146,0.000433,0.000379,0.000142,0.000393,0.000105,0.000228,0.000215,0.000129,0.000253,0.000129,0.000127,0.000188,0.000278,0.000213,0.000289,0.000165,0.000235,0.000144,0.000138,0.00013,0.000548,0.000451,0.000288,0.000261,0.000145,0.000288,0.000344,0.000253,2.9e-05,0.000179,0.000332,0.000308,6.1e-05,0.000118,9.3e-05,0.000203,6.1e-05,0.000103,0.000341,0.000194,0.000134,0.000103,0.000271,0.000242,0.000212,0.000149,0.000228,0.000266,0.000101,0.000145,0.000248,0.000224,0.000315,0.000338,0.000266,5.1e-05,0.000115,0.000171,0.000287,0.000185,0.000266,0.000389,0.000337,0.000221,5e-05,0.000234,0.000104,0.000189,0.000234,0.000198,0.000148,2.9e-05,0.000185,8.1e-05,9.6e-05,6.4e-05,0.000114,0.000117,0.000143,0.000161,0.00011,0.000107,0.000169,0.000193,0.000368,0.000271,0.000189,0.000134,6.7e-05,0.000171,5.2e-05,3e-04,0.000275,0.000304,0.000251,9.7e-05,9.3e-05,0.000229,0.000172,3.8e-05,0.000228,0.000278,3e-04,0.000258,8.2e-05,0.00028,0.000205,0.000151,0.000183,0.000162,0.000104,0.000135,7.9e-05,0.000141,0.000114,0.000144,0.000139
0.000264,7e-05,0.000369,0.000555,0.000279,3.4e-05,0.000354,0.000126,0.000157,0.000345,0.000184,0.000151,0.000276,0.000154,0.000151,0.000187,0.000161,0.000142,0.000138,8.3e-05,0.000127,0.000256,0.000401,0.000243,0.000153,0.000395,0.000225,0.000218,0.000238,0.000295,0.000127,0.000209,0.000219,0.000237,0.000166,0.000151,7.7e-05,2.6e-05,9.3e-05,8.9e-05,0.000164,0.000237,1e-04,0.000197,0.000364,0.00021,0.000171,8.4e-05,0.000141,0.000282,8.3e-05,0.000129,0.000329,0.000142,0.000114,0.000139,5.1e-05,8.8e-05,0.000271,0.000193,0.000147,9.6e-05,0.000285,0.000104,0.000206,0.000168,3.1e-05,7e-06,0.000254,0.000193,9.3e-05,0.00025,4.1e-05,9.2e-05,4.7e-05,2.7e-05,0.000198,0.000151,0.000148,8e-05,1e-04,0.000218,0.000116,9.8e-05,8.7e-05,6.5e-05,8.2e-05,0.000164,0.000243,9.7e-05,0.00016,0.000123,0.000126,0.000152,0.000183,0.00024,0.000109,0.000187,0.000208,0.000161,0.000301,0.00021,0.000247,0.000223,0.00016,0.000261,2e-04,0.000233,0.000124,0.000151,8.6e-05,0.000185,0.000139,0.000114,7e-06,2.7e-05,8.8e-05,0.000264,7.7e-05,0.000246,5.5e-05
0.000141,0.000142,0.00033,4e-05,0.000123,8.2e-05,0.000146,0.000307,0.000234,0.000138,0.000287,0.000182,5.6e-05,0.000225,0.00024,0.000165,0.00032,0.00016,7.1e-05,5.7e-05,0.000257,0.000307,0.000405,0.000147,0.00013,0.000234,0.000218,0.00031,0.000173,0.000232,0.000303,0.000161,0.000317,9.4e-05,0.000137,0.000273,5.9e-05,0.000207,4.9e-05,0.000267,0.000336,0.00012,0.000364,3e-04,0.000233,0.000283,0.000146,0.000282,7.3e-05,0.000222,0.00018,0.000196,0.000207,0.000133,1e-04,0.000211,0.000203,0.000196,0.000177,0.000202,0.00025,7.9e-05,0.000229,0.000396,0.000286,7.8e-05,5.4e-05,0.000196,0.000304,0.000271,6e-05,0.00029,0.000283,0.00014,0.000205,9.3e-05,0.000143,0.000141,0.000158,0.000245,0.000148,0.000279,0.000336,3.8e-05,6.8e-05,2.7e-05,0.000244,0.000272,0.000315,0.000158,0.00022,0.000413,0.000179,2e-04,0.000177,0.000216,0.000209,0.000107,0.000144,0.000187,0.000416,0.000173,0.000256,0.000114,0.000333,0.000458,0.000363,0.000468,0.000365,0.000239,0.000115,0.000146,1e-04,4.6e-05,0.000117,7.7e-05,6.9e-05,0.000105,0.000208,0.000385,0.000329
0.000186,0.000231,0.000224,0.000286,0.000116,0.000108,0.000222,0.000228,0.000126,0.00011,0.000378,0.000299,0.000191,0.00025,0.000167,0.000127,0.000319,3.7e-05,2.2e-05,5.8e-05,0.000245,0.000279,0.000165,0.000163,0.00018,0.000292,0.00017,3.8e-05,0.000194,0.000139,0.000333,0.000253,0.000364,0.000305,0.000192,0.000228,0.000196,0.000427,0.000246,0.000493,1.6e-05,0.000101,0.000403,0.000254,0.000244,0.000164,0.000448,0.000613,0.000349,0.000119,9.3e-05,0.000179,0.000167,0.000188,0.000142,0.000145,0.000283,0.000446,0.000205,0.000308,0.000209,0.00016,0.000378,0.000455,7.6e-05,1.5e-05,8.7e-05,0.000239,0.000142,0.00029,0.000222,0.00021,9.8e-05,0.000119,0.000188,0.000101,6.4e-05,4.7e-05,0.000295,0.000182,0.000157,0.000232,0.000359,0.000332,0.000174,2.9e-05,0.000458,1e-04,0.000316,0.000125,0.000114,0.000501,0.000215,0.000294,0.000125,0.000198,5.3e-05,6.3e-05,0.000283,0.000181,0.000294,0.000183,0.000182,0.000253,0.000309,4.2e-05,0.000166,0.000197,0.000223,0.000158,1e-04,0.000161,0.000173,0.00022,0.000123,0.000212,0.000159,0.000254,0.00033,5.4e-05,0.000107
0.000367,0.000179,0.000212,0.000161,0.000172,9.1e-05,3e-04,0.000323,0.000323,0.00023,0.000241,8.8e-05,8.8e-05,0.00015,0.000258,0.000213,0.000148,0.000303,0.000154,0.000111,0.000324,0.000217,0.000125,0.000206,0.000162,0.000488,0.000248,0.000109,0.000293,0.000141,0.000373,0.000241,0.000331,0.000702,0.000324,0.000219,0.000263,0.000269,0.000367,0.000225,0.000376,0.000258,0.000272,6e-05,0.000283,0.000355,0.000412,0.000134,0.000158,0.000343,0.000359,8.7e-05,0.000301,0.000441,0.000262,1e-04,0.00016,0.000317,0.000152,0.000266,0.000307,0.000215,0.000339,0.00011,0.000279,6.9e-05,0.000153,0.000121,6e-05,0.000335,0.000156,4.5e-05,6.4e-05,0.000173,0.000263,0.000202,0.000187,0.000132,0.000277,0.000135,0.000209,0.000257,0.000173,0.000129,5.1e-05,8.8e-05,0.000389,0.00034,0.000516,0.000273,0.000142,0.000427,0.000404,0.000367,0.000219,0.000298,0.000184,0.000128,0.000287,0.000163,0.00018,0.000105,0.000143,0.00016,0.000336,0.00029,0.000282,0.000321,0.000182,0.000441,0.000237,8.6e-05,0.000286,0.000316,0.000332,0.000355,0.000247,0.000348,0.000438,0.000409,0.000234
0.000328,0.000282,0.000217,0.000392,0.000375,0.000245,0.000449,0.000483,0.000363,0.000164,0.000154,0.000108,0.000125,4.1e-05,0.000137,0.000261,0.000214,0.000302,0.000381,0.000229,0.000277,5.8e-05,0.000199,0.000338,0.000222,0.000452,0.000381,0.000293,0.000332,0.000241,0.000198,0.00019,0.000338,0.000578,0.000445,0.000437,0.000298,0.000265,0.000215,0.000208,0.000224,5.7e-05,0.000187,0.000174,0.000393,0.000251,0.00023,0.000237,0.000115,0.00021,0.000223,0.000313,0.000589,0.000386,0.000179,0.00016,0.000136,0.000147,0.000115,0.000209,0.000146,2.2e-05,0.000363,0.000294,0.000244,0.000298,0.000181,0.000288,0.000133,0.000205,0.00033,0.000348,0.000357,0.000341,8.8e-05,0.000177,7.1e-05,0.000251,6e-05,4.6e-05,0.000182,0.000361,0.000263,0.000277,7.4e-05,9e-05,0.000197,0.000197,0.000309,0.00026,0.000217,0.00023,0.000503,0.000324,0.000278,0.000254,0.000134,0.000245,9.6e-05,2e-05,0.000109,0.000128,0.000237,0.000177,0.000191,0.000148,0.000269,0.000153,8.2e-05,0.000366,0.000252,0.000228,0.000425,0.000275,3.9e-05,0.000155,9.7e-05,0.000491,0.000154,0.000179,0.000197
0.000395,0.000444,0.000245,0.000298,0.000142,0.000127,0.000252,4.8e-05,0.00018,8.9e-05,0.000137,0.000172,0.000157,0.000158,0.000142,0.000283,0.000194,0.000176,0.000141,0.000313,0.000393,0.000395,0.000237,5.7e-05,8.1e-05,0.000159,0.000187,0.000116,0.000254,4.3e-05,0.00015,0.000241,0.00049,0.000241,0.000168,0.000279,0.000257,9.4e-05,0.000124,0.000154,0.000194,0.000145,0.000272,8.8e-05,0.000323,0.000315,0.000181,0.000124,6.9e-05,0.000116,0.000255,0.000334,0.000359,0.000282,0.000242,0.00043,0.000375,0.000219,0.000221,0.000235,0.000372,0.000239,0.000273,0.000265,0.000366,0.000417,0.000484,0.000654,0.000375,0.000215,0.000223,2.5e-05,0.000157,7e-05,0.000264,0.000385,0.000402,0.000307,0.000207,0.000142,0.000104,0.000317,0.000104,0.000157,0.000238,0.000126,6.1e-05,2.8e-05,0.000169,0.000108,0.000119,0.000166,0.000292,6.9e-05,0.000153,0.000156,1.6e-05,0.000271,0.000265,0.000106,0.00018,0.00023,0.00021,0.000129,0.000113,0.000108,0.000302,0.000325,3e-05,0.000288,0.000159,0.000263,0.000383,0.000324,0.000228,0.00025,0.000323,0.000135,0.000256,0.000102,0.000195
0.000204,0.000112,0.000129,0.000112,6.3e-05,8e-05,3.1e-05,6.4e-05,0.000146,0.000157,0.000246,0.000133,9e-05,4e-05,9.5e-05,0.000156,0.000124,0.000197,0.00015,0.000215,0.000219,9.7e-05,9e-05,9.6e-05,0.000161,6.5e-05,0.00015,0.000275,0.000197,0.000182,0.000237,0.00028,9.5e-05,0.000237,0.000118,0.000241,0.000111,3.4e-05,7.3e-05,0.00015,0.000126,6.4e-05,0.000148,0.00018,0.000181,0.000238,0.000181,0.000129,8.7e-05,5.5e-05,0.000163,8.4e-05,0.000303,0.000325,0.000157,0.000208,7e-05,5.2e-05,0.000151,0.000431,0.000387,0.000197,0.00014,0.000144,0.00011,0.000172,0.000309,0.000269,0.000296,0.000232,0.000147,0.000219,0.000118,0.00014,7.5e-05,0.000148,0.000156,3.2e-05,9.2e-05,0.00019,0.000149,9.7e-05,0.000124,9.9e-05,8.5e-05,5.4e-05,0.00011,0.000102,7e-05,8e-05,0.000173,0.000163,1.3e-05,0.000108,0.000158,5.6e-05,0.00011,0.000174,2.8e-05,8.2e-05,2.7e-05,0.000216,0.000107,7.8e-05,0.000139,0.000252,0.000191,0.000117,0.000187,0.000166,3.7e-05,0.000172,5.5e-05,0.000203,0.000148,8.9e-05,9.2e-05,0.000124,8.9e-05,1.1e-05,1e-04
9.6e-05,9.8e-05,8e-06,8.6e-05,6.5e-05,7.9e-05,4.8e-05,9.2e-05,2.5e-05,0.000123,5.6e-05,7.6e-05,7.1e-05,4.4e-05,9.1e-05,5e-05,4.1e-05,0.000125,3.7e-05,0.000148,4.2e-05,0.000154,5.3e-05,2.7e-05,6.1e-05,5.3e-05,8e-05,8.7e-05,8.4e-05,3e-05,0.000121,2.6e-05,0.00011,8.9e-05,4.7e-05,0.000115,2.6e-05,4.9e-05,5.3e-05,6e-05,6.5e-05,5e-05,4e-05,6.7e-05,0.000101,0.000121,2.7e-05,1.3e-05,3.7e-05,4.6e-05,7.9e-05,3.1e-05,8.2e-05,9.4e-05,3.1e-05,8.3e-05,8.3e-05,2.3e-05,0.000104,0.000216,5.7e-05,4.2e-05,8.6e-05,5.3e-05,8e-05,0.000105,0.000106,0.000144,0.000157,4.4e-05,1.2e-05,0.000152,8.7e-05,5.4e-05,9.1e-05,6.3e-05,0.000114,7.3e-05,2e-05,7.5e-05,5.1e-05,7.5e-05,6.8e-05,3.5e-05,3.9e-05,5.1e-05,8.6e-05,5.4e-05,1.9e-05,7.7e-05,5.9e-05,4.5e-05,4.8e-05,8.8e-05,0.000101,7.6e-05,9.4e-05,5.6e-05,4.5e-05,2.8e-05,2.2e-05,9.9e-05,3e-05,3.4e-05,8.1e-05,0.000131,4.1e-05,0.000106,5.2e-05,5.9e-05,3.8e-05,7.4e-05,5.3e-05,6.9e-05,5.2e-05,6.3e-05,7.4e-05,4.3e-05,3.8e-05,4.9e-05,8e-05
5.7e-05,5.6e-05,3.3e-05,8.5e-05,2.6e-05,4.7e-05,6e-05,3.9e-05,3.3e-05,5.9e-05,5.2e-05,2.4e-05,2.1e-05,5.9e-05,0.000118,3.2e-05,3.4e-05,3.9e-05,2.9e-05,8.1e-05,2.1e-05,0.000126,4.4e-05,3.9e-05,4.8e-05,3.6e-05,2.7e-05,9.3e-05,4.7e-05,1e-05,9e-05,6.7e-05,6.9e-05,7.5e-05,6.3e-05,0.000103,4.3e-05,4.1e-05,2.2e-05,3.5e-05,7e-05,6.2e-05,3.9e-05,6.1e-05,6.8e-05,0.000102,1.3e-05,3.4e-05,2.7e-05,2.1e-05,8.9e-05,2.8e-05,3.8e-05,9.3e-05,1.2e-05,3.5e-05,6.1e-05,6.9e-05,8.3e-05,0.000116,3.5e-05,5.2e-05,1.5e-05,8.9e-05,6.1e-05,3.2e-05,4.9e-05,8.6e-05,0.000155,5.6e-05,3.4e-05,6.3e-05,9.3e-05,1.4e-05,9.2e-05,7.8e-05,0.000117,3.1e-05,2e-05,9.2e-05,4e-05,4e-05,6.6e-05,7.2e-05,2.2e-05,3.8e-05,9.9e-05,5.2e-05,3.5e-05,4.7e-05,3.2e-05,6.6e-05,3.7e-05,4.9e-05,6.3e-05,9.4e-05,0.000114,7.2e-05,7.9e-05,2.9e-05,1.8e-05,2.8e-05,3.8e-05,4e-05,3.5e-05,7e-05,5.9e-05,5.6e-05,4.6e-05,8.4e-05,7.1e-05,2.1e-05,5.5e-05,7.9e-05,8.2e-05,4.6e-05,7.6e-05,3.2e-05,6.7e-05,5.4e-05,0.000102
2.4e-05,6.3e-05,0.000115,0.000168,0.000111,7.1e-05,6.1e-05,2.9e-05,7.3e-05,7e-05,9.6e-05,4.3e-05,3.8e-05,5.7e-05,0.000164,8.2e-05,1.2e-05,7.2e-05,0.000125,4.1e-05,1.5e-05,8e-05,9.5e-05,7.2e-05,9.3e-05,5.6e-05,3.5e-05,7.9e-05,3e-05,4.3e-05,0.000128,1.3e-05,4.4e-05,0.000117,9.4e-05,7.2e-05,3.9e-05,7.1e-05,6.3e-05,6.5e-05,9e-05,4.2e-05,6.9e-05,4.4e-05,4e-05,0.000135,8.3e-05,9.6e-05,9.6e-05,2.8e-05,0.000102,7.1e-05,7.9e-05,8.8e-05,6.5e-05,2e-05,7.4e-05,0.00011,0.000119,5.6e-05,1e-04,4.8e-05,9.1e-05,8.5e-05,0.000135,2.1e-05,3.9e-05,9.8e-05,0.000115,4.5e-05,4.9e-05,6.8e-05,6.4e-05,2.8e-05,3e-05,4.3e-05,0.000159,1.2e-05,2.9e-05,0.000105,6.5e-05,3.5e-05,7e-05,0.000146,8.9e-05,5.2e-05,6.4e-05,3.8e-05,8.8e-05,0.000118,3.8e-05,2e-05,9.3e-05,7.8e-05,3.8e-05,0.000108,0.000195,0.000115,3.7e-05,2e-05,5.5e-05,4.7e-05,9.3e-05,3.2e-05,9.4e-05,9.7e-05,9.9e-05,4.5e-05,7.2e-05,0.00011,8.1e-05,1.6e-05,6.6e-05,9.5e-05,2.3e-05,6e-06,6.4e-05,2.9e-05,7.4e-05,3.3e-05,0.000138
0.000197,0.000173,0.000117,4.7e-05,2.3e-05,9.3e-05,4.6e-05,2.2e-05,2.6e-05,6.5e-05,0.000102,0.000138,7.4e-05,8.7e-05,7.3e-05,7.4e-05,8.1e-05,7e-05,6.7e-05,9.8e-05,5.8e-05,5.3e-05,4.8e-05,2.2e-05,3e-05,4.7e-05,4.7e-05,9e-05,3.2e-05,4.5e-05,0.000117,8.3e-05,5.2e-05,9.9e-05,9e-05,0.000153,9.6e-05,4.8e-05,6e-05,8.4e-05,2.4e-05,4.5e-05,4.6e-05,9.8e-05,0.000151,0.000129,0.000124,2.6e-05,5.3e-05,3.8e-05,0.000125,7.4e-05,0.000119,9.8e-05,5.4e-05,3.4e-05,6.3e-05,0.000163,9.8e-05,0.000145,0.000169,6.7e-05,0.00013,7.9e-05,0.000127,0.000115,5.5e-05,2.5e-05,7.5e-05,7e-05,4.5e-05,7.2e-05,3e-05,8.2e-05,1.9e-05,6.6e-05,4.2e-05,0.000114,8.6e-05,6e-05,5.2e-05,2.8e-05,0.000153,0.000179,0.000184,0.000157,9.7e-05,9.2e-05,0.00012,0.000128,0.000138,9.5e-05,0.000174,2.6e-05,5.1e-05,0.000128,0.000154,0.000158,0.000111,6e-05,0.000104,9.9e-05,0.000177,0.000172,0.000101,4.4e-05,2.6e-05,0.000138,0.000105,6.3e-05,0.000111,1e-04,8.3e-05,9e-05,8.3e-05,5e-05,8.7e-05,2.9e-05,3.1e-05,8.7e-05,8.1e-05
0.000132,3.8e-05,3e-05,9.6e-05,5.9e-05,7.9e-05,7.3e-05,9.3e-05,8.9e-05,0.000146,1.9e-05,8.6e-05,8e-05,2.4e-05,3.1e-05,6.2e-05,4.3e-05,9.3e-05,2.6e-05,8.3e-05,7.3e-05,6.5e-05,6.1e-05,1.5e-05,6.9e-05,4.6e-05,3.8e-05,3.3e-05,1.9e-05,5.6e-05,7.1e-05,7.8e-05,3.5e-05,9e-05,2.9e-05,6.8e-05,2.9e-05,4e-05,5.8e-05,1e-05,2.6e-05,4e-05,2.3e-05,4.2e-05,0.000126,3.3e-05,7.7e-05,3.8e-05,4.8e-05,3.4e-05,0.000126,2e-05,4.1e-05,2.8e-05,9.3e-05,7.7e-05,9.9e-05,8e-05,2.9e-05,4.6e-05,7e-05,4.6e-05,6.3e-05,7.4e-05,5.8e-05,8.2e-05,4.6e-05,7.9e-05,3.1e-05,3.7e-05,8.1e-05,0.000114,5.5e-05,5.5e-05,6.1e-05,5.9e-05,4.5e-05,0.000117,3e-05,4e-05,8.2e-05,5.5e-05,0.000142,2.2e-05,0.000124,1.7e-05,2.9e-05,0.000101,4e-05,2e-05,7.6e-05,7.8e-05,7.2e-05,4.5e-05,4.8e-05,0.000142,7.2e-05,9.3e-05,5.6e-05,9e-06,9.6e-05,0.000123,7.2e-05,4.7e-05,1.7e-05,3.4e-05,1.8e-05,9.3e-05,4.7e-05,2e-05,6.5e-05,3.3e-05,0.000121,0.000108,6.8e-05,2.6e-05,6.8e-05,6.6e-05,3e-05,9.3e-05,0.000114
0.00013,2.3e-05,6.3e-05,0.000125,8.9e-05,7.5e-05,1e-04,0.000102,5.3e-05,0.000184,9.8e-05,8.3e-05,7.9e-05,5.8e-05,3.4e-05,8.1e-05,7.6e-05,4.5e-05,3.2e-05,0.00013,0.000116,0.000141,5.4e-05,7.1e-05,0.000116,7e-05,6.6e-05,7.2e-05,3.2e-05,8.7e-05,2.9e-05,4.3e-05,3e-05,0.000154,7.7e-05,1e-05,9.2e-05,5.7e-05,4.3e-05,1.9e-05,6.5e-05,7.9e-05,7.4e-05,9.5e-05,7.8e-05,9e-05,6e-06,8.6e-05,4.8e-05,2.9e-05,5.6e-05,5e-05,9.3e-05,4.7e-05,0.000141,0.000118,7.1e-05,9.1e-05,4.8e-05,6.1e-05,9.5e-05,1.2e-05,3.5e-05,8.2e-05,8.8e-05,0.000127,5.5e-05,0.000135,8.9e-05,5e-05,4.7e-05,5.8e-05,9.5e-05,7.5e-05,4.8e-05,4e-05,7.2e-05,7.3e-05,1.6e-05,6.3e-05,0.000121,7.4e-05,6.2e-05,5.2e-05,5.4e-05,2.3e-05,0.000122,0.000182,5.9e-05,5.2e-05,1.7e-05,3.5e-05,6.2e-05,4.9e-05,3.3e-05,9.7e-05,9.9e-05,6.9e-05,2.2e-05,3.4e-05,6.4e-05,7e-05,2e-05,7.4e-05,6.7e-05,9.3e-05,0.000115,9.4e-05,8.4e-05,9e-05,6.3e-05,3.9e-05,0.000124,0.000135,0.000112,3.5e-05,3.1e-05,9.1e-05,8.2e-05,8.6e-05,4.6e-05
0.00016,6.3e-05,6.5e-05,8.2e-05,4.4e-05,8.9e-05,0.000108,3.8e-05,0.000103,7.9e-05,5e-05,7.7e-05,6.2e-05,8.5e-05,8.2e-05,4e-05,3.2e-05,5.9e-05,1.5e-05,0.00012,0.000179,4.1e-05,4.3e-05,4.1e-05,7e-05,7.3e-05,0.000112,0.000112,8.6e-05,0.000106,0.000139,8.5e-05,2.2e-05,0.000132,6.4e-05,4.2e-05,4.3e-05,4.2e-05,8.3e-05,7.7e-05,7.7e-05,0.000158,8.2e-05,0.000121,0.000109,0.000121,6.2e-05,8.8e-05,6.1e-05,4.8e-05,2.8e-05,5.4e-05,0.000116,8.2e-05,4.7e-05,0.000102,0.000144,9.6e-05,6e-05,8.8e-05,5.3e-05,0.000111,7.6e-05,6.5e-05,1.6e-05,0.000116,0.000102,0.000163,8.6e-05,2.7e-05,2.4e-05,5.4e-05,8.5e-05,3e-05,4.4e-05,0.000104,5e-05,0.000186,8.7e-05,5.6e-05,0.000169,7.7e-05,1.7e-05,0.000128,0.000148,4.7e-05,0.000144,0.000199,0.000212,0.000176,5.3e-05,6e-05,0.000124,8.3e-05,0.000128,0.000133,8.1e-05,4.1e-05,6e-05,0.000121,9e-05,0.000129,3.7e-05,4.7e-05,0.000124,7.3e-05,0.00013,0.000149,2.5e-05,7.5e-05,4.3e-05,7.2e-05,4.3e-05,0.000106,5.3e-05,1e-04,7.8e-05,0.000122,1.8e-05,0.000124,4.5e-05
0.000199,0.000249,0.000162,0.000142,0.00015,5.5e-05,0.000205,0.000125,0.000111,7.4e-05,9.5e-05,0.000142,0.000171,0.000127,9.8e-05,7e-05,0.000106,6.6e-05,6.6e-05,4.8e-05,6.1e-05,0.00013,4.2e-05,4.3e-05,2.6e-05,7.3e-05,9.2e-05,4.3e-05,0.000142,8.4e-05,0.000159,7.3e-05,9.4e-05,8.4e-05,9.5e-05,6.7e-05,2.5e-05,9.5e-05,0.000141,5.3e-05,9.8e-05,0.000172,0.000234,9.2e-05,0.000166,6e-05,9.2e-05,0.000103,3.7e-05,5e-05,6.1e-05,9.7e-05,3e-05,8e-06,3.5e-05,8e-05,0.000128,0.000103,0.000107,3.2e-05,8.6e-05,0.000106,0.000112,0.000104,5.8e-05,6.7e-05,0.000115,8.2e-05,7.6e-05,8.3e-05,7.8e-05,9.5e-05,2.4e-05,6.8e-05,0.000103,7.4e-05,4e-05,0.000217,0.000177,0.00018,8.4e-05,0.000146,2.5e-05,0.000156,9.3e-05,0.000158,0.000196,0.000345,0.000258,0.000141,0.000108,1.4e-05,6.7e-05,7.5e-05,9e-05,4.4e-05,2.1e-05,8.7e-05,6.6e-05,0.000109,7.9e-05,1e-04,6.2e-05,4.2e-05,6e-05,0.000141,6.5e-05,0.000166,0.000185,9e-05,9.3e-05,9.8e-05,8.8e-05,0.000124,0.000248,0.00021,9.1e-05,8.9e-05,0.000156,0.000152,0.00017
2.3e-05,0.000138,1.6e-05,0.000116,6.2e-05,5.6e-05,0.000207,0.000136,0.000102,0.000137,0.000154,0.000265,0.000195,2.2e-05,0.000121,0.000101,8.6e-05,0.000154,0.000114,5.6e-05,5.6e-05,9.3e-05,6.7e-05,3.3e-05,8.4e-05,0.000123,0.000153,7.1e-05,0.000151,9.6e-05,0.000122,4.6e-05,9.7e-05,8.6e-05,0.000142,0.000128,0.000117,0.000145,0.000204,0.00013,0.000108,9.1e-05,7.8e-05,9.5e-05,0.000158,0.000178,0.000196,8.5e-05,4.6e-05,2.6e-05,4.3e-05,4.7e-05,0.000149,0.000111,9.9e-05,8.2e-05,0.000144,0.000202,0.000201,9.9e-05,9.2e-05,6.2e-05,3.1e-05,0.000133,0.000175,9.6e-05,0.000107,0.000114,0.000101,9.2e-05,6e-05,0.000135,0.00011,6.4e-05,4.4e-05,5e-05,0.000114,0.000281,0.000177,0.000185,0.000122,0.000217,0.00024,0.000211,0.000195,0.000125,3e-05,0.000181,9.8e-05,0.00017,0.00023,0.000209,0.000182,0.000106,0.000143,0.000119,0.000143,0.000181,0.000185,0.000198,0.000174,0.00025,0.000138,5.7e-05,2.3e-05,0.000155,0.000218,0.000106,7.3e-05,8e-05,4.9e-05,6.4e-05,6e-05,0.000114,0.000273,9.4e-05,5.1e-05,8.7e-05,0.000209,0.000123,0.000212
5.6e-05,5.4e-05,0.00012,2.5e-05,7.1e-05,3.8e-05,8.3e-05,8.9e-05,2.5e-05,0.000137,0.000122,0.000125,2.5e-05,9.8e-05,0.000162,3e-05,0.000101,0.000157,6.2e-05,4.5e-05,8.6e-05,5.9e-05,5.4e-05,5.6e-05,4.9e-05,4.9e-05,0.000118,0.000125,2.5e-05,1.3e-05,7e-05,6.6e-05,7.4e-05,4.5e-05,0.000101,9.3e-05,4.4e-05,0.000131,5.4e-05,4.3e-05,6.2e-05,2.9e-05,5.9e-05,2.1e-05,9.7e-05,0.000143,3.6e-05,6e-05,5.4e-05,9.9e-05,3.9e-05,5e-05,0.000135,9.6e-05,3.1e-05,0.000123,0.000155,8.4e-05,1.9e-05,3.5e-05,2.3e-05,5.6e-05,2.9e-05,0.000111,6.5e-05,8.8e-05,2.1e-05,3.8e-05,8e-05,9.2e-05,7.3e-05,6.8e-05,4.3e-05,3.4e-05,3.7e-05,5.3e-05,5.1e-05,0.000139,3.7e-05,8e-05,0.000141,6.2e-05,8.7e-05,0.000111,8.8e-05,0.000105,7.9e-05,3.1e-05,0.000134,0.000175,9.2e-05,0.000119,0.000145,6.1e-05,8e-05,0.00015,7.2e-05,4.9e-05,3.3e-05,7.2e-05,3.1e-05,0.00016,7.2e-05,2.2e-05,9.3e-05,9.3e-05,0.00015,8.2e-05,6e-05,8.1e-05,3.3e-05,3.4e-05,8.7e-05,0.000119,7.3e-05,1.5e-05,4.6e-05,7.2e-05,0.000163,5.2e-05,1e-04
3.1e-05,2.4e-05,4.5e-05,1.6e-05,1.3e-05,5e-05,2.5e-05,3.7e-05,2.6e-05,5.9e-05,2.5e-05,4e-05,4.2e-05,6.6e-05,2.7e-05,4.2e-05,6.5e-05,3.3e-05,1.2e-05,6.7e-05,5.4e-05,7e-05,5.5e-05,2.3e-05,4.7e-05,3e-05,2.9e-05,7.4e-05,6e-06,5.4e-05,8e-06,5.9e-05,3.4e-05,7.7e-05,3.1e-05,2.2e-05,5e-05,9.3e-05,5.2e-05,5.3e-05,6.3e-05,4.8e-05,8e-06,2.5e-05,4.3e-05,1.3e-05,6.3e-05,2.5e-05,2.6e-05,5.9e-05,2e-05,3.4e-05,0.000105,6.5e-05,1.6e-05,6.8e-05,3.4e-05,3.6e-05,2.2e-05,4.8e-05,7.1e-05,5.3e-05,8.3e-05,4e-05,4.3e-05,2.9e-05,2.7e-05,8.8e-05,0.000111,6e-06,6.1e-05,0.000112,7.7e-05,5.5e-05,4.7e-05,7.9e-05,5.8e-05,6.2e-05,6.2e-05,4e-05,5.8e-05,4.4e-05,7.8e-05,3.8e-05,3.6e-05,6.6e-05,3.2e-05,5.7e-05,9.8e-05,6.3e-05,4.4e-05,0.000138,1.8e-05,5.2e-05,6.7e-05,7.5e-05,8.7e-05,4.2e-05,1.2e-05,1.1e-05,3.4e-05,9e-05,5e-05,3.3e-05,7.6e-05,0.000125,2.6e-05,3e-05,9.6e-05,1.8e-05,0.000109,8.3e-05,1e-05,9e-05,5.5e-05,4.4e-05,5.2e-05,0.000141,2.9e-05,5.4e-05,6.2e-05
2.5e-05,2.5e-05,1.1e-05,3e-05,2.7e-05,1.5e-05,1.5e-05,3.5e-05,2.6e-05,3.5e-05,2.9e-05,2.9e-05,3.3e-05,2.1e-05,8e-06,8e-06,3.1e-05,3.6e-05,2.2e-05,2.8e-05,2.9e-05,3.1e-05,6e-06,2.8e-05,1.4e-05,1.5e-05,1.6e-05,2.3e-05,1.7e-05,3.5e-05,2.3e-05,1.9e-05,3.7e-05,4.4e-05,2.5e-05,1.2e-05,2e-05,4e-05,1.9e-05,1e-06,1.1e-05,1.9e-05,2.7e-05,3e-05,1.5e-05,9e-06,1.6e-05,2.2e-05,1.3e-05,2.4e-05,1.5e-05,2.8e-05,2.6e-05,3.6e-05,1.3e-05,6e-06,2.1e-05,2.4e-05,2.8e-05,4e-05,1.6e-05,1.7e-05,1.3e-05,6e-06,1e-05,2.5e-05,3.4e-05,3.2e-05,2.3e-05,8e-06,2.1e-05,2.8e-05,3.5e-05,2.2e-05,1.3e-05,2.5e-05,1.4e-05,9e-06,2e-05,1.2e-05,3e-06,3.3e-05,2.9e-05,7e-06,1.6e-05,1.8e-05,3e-06,3e-05,3.2e-05,3.5e-05,9e-06,4.7e-05,1.5e-05,4.4e-05,2e-06,2.6e-05,3.3e-05,1.8e-05,3e-06,2.5e-05,3.8e-05,3.1e-05,2e-05,2.3e-05,1.6e-05,1.1e-05,2.2e-05,1.5e-05,3.9e-05,1.9e-05,4.9e-05,3e-06,4e-06,4.9e-05,5.3e-05,3.6e-05,4.5e-05,4.8e-05,2.9e-05,2.9e-05,1.9e-05
1.8e-05,3.6e-05,1.8e-05,2.6e-05,4.9e-05,1.6e-05,7e-06,3.3e-05,1e-05,4.3e-05,1.1e-05,1.7e-05,4.4e-05,1.2e-05,3.9e-05,3.7e-05,1.1e-05,3.6e-05,2.8e-05,3.6e-05,2.6e-05,2.5e-05,2.1e-05,2.4e-05,5.1e-05,9e-06,2.4e-05,2.8e-05,1.9e-05,2.5e-05,1.7e-05,1.2e-05,3.3e-05,2e-05,1.6e-05,1.5e-05,4.1e-05,2.3e-05,4.9e-05,1.1e-05,2.3e-05,3.4e-05,2.8e-05,2.2e-05,8e-06,2.9e-05,1.6e-05,2.3e-05,7e-06,2.4e-05,1.1e-05,1.8e-05,1.6e-05,2.8e-05,3e-05,3.1e-05,2.6e-05,1.3e-05,1.3e-05,3.3e-05,1.7e-05,2.1e-05,2.6e-05,2e-05,1.6e-05,2.9e-05,3e-05,2.7e-05,3.1e-05,4e-06,1.8e-05,1.1e-05,3.3e-05,6e-06,8e-06,3e-06,1.9e-05,6e-06,2.7e-05,3.1e-05,3.8e-05,2.2e-05,1.8e-05,1.1e-05,8e-06,3.3e-05,8e-06,2.6e-05,9e-06,1.5e-05,3.1e-05,3.1e-05,3.9e-05,1.7e-05,3.6e-05,4.7e-05,3.3e-05,1.6e-05,1.7e-05,3.6e-05,9e-06,3e-05,2.2e-05,4e-06,2.3e-05,1.4e-05,2e-05,2.1e-05,3.3e-05,1.6e-05,2.7e-05,2.8e-05,1.2e-05,3.1e-05,1.5e-05,2.4e-05,1.9e-05,1.7e-05,1.7e-05,2.8e-05,4.3e-05
4.6e-05,2.2e-05,1.9e-05,1.4e-05,2e-05,1.3e-05,1.2e-05,2e-05,2.2e-05,3e-05,2.6e-05,1.5e-05,4.7e-05,6.7e-05,2.9e-05,3.2e-05,2.8e-05,3e-05,1e-05,3e-05,2.8e-05,2.1e-05,1.4e-05,2e-05,2.9e-05,2.6e-05,3.1e-05,1.7e-05,6e-06,1.8e-05,2.1e-05,3.3e-05,5.7e-05,2.2e-05,1.4e-05,2e-06,2.8e-05,2.5e-05,2.8e-05,3.1e-05,3.3e-05,2.9e-05,5.7e-05,4.7e-05,2.5e-05,1.7e-05,2.4e-05,4.2e-05,2.5e-05,3.7e-05,3.7e-05,2.4e-05,3.2e-05,1.6e-05,1.5e-05,9e-06,1e-05,2.1e-05,3e-06,1.9e-05,1.8e-05,1.1e-05,8e-06,2.6e-05,2.4e-05,1.5e-05,4.2e-05,4.8e-05,5.1e-05,1.2e-05,5e-06,1.6e-05,3.9e-05,4.4e-05,2.7e-05,3e-05,2.9e-05,2e-05,2e-05,1.7e-05,2.9e-05,1.2e-05,2.9e-05,2.7e-05,2.2e-05,3e-05,2.5e-05,2.7e-05,3.8e-05,2.9e-05,1.2e-05,1.4e-05,1.8e-05,2.6e-05,5.1e-05,5.4e-05,6.5e-05,3.1e-05,3.2e-05,2.7e-05,2.4e-05,3.2e-05,3.4e-05,3.5e-05,4.8e-05,3.4e-05,2.7e-05,4e-06,2.3e-05,3.6e-05,3.4e-05,3.1e-05,7e-06,2e-05,4.2e-05,2.3e-05,3.6e-05,2.4e-05,1.5e-05,2.9e-05,2.2e-05
1.9e-05,1.3e-05,1.2e-05,1.3e-05,2e-05,1.3e-05,9e-06,6e-06,1.8e-05,1e-05,8e-06,3e-06,3.5e-05,4.5e-05,2.3e-05,3.9e-05,2.3e-05,3.9e-05,3.3e-05,7e-06,2.4e-05,3.1e-05,2.6e-05,1.6e-05,1.3e-05,1.1e-05,1.4e-05,2.5e-05,1.2e-05,1.9e-05,3.1e-05,3.9e-05,4.9e-05,2e-05,1.7e-05,3e-06,2.1e-05,1.7e-05,2.4e-05,1.5e-05,9e-06,2.9e-05,3.2e-05,1.7e-05,4e-06,8e-06,6e-06,2.6e-05,1.2e-05,1.8e-05,2.9e-05,2e-05,2e-05,2.1e-05,3e-05,2.1e-05,2.6e-05,1.2e-05,2.3e-05,1.2e-05,2.3e-05,1.9e-05,1.9e-05,2.4e-05,1e-05,1.5e-05,1.6e-05,1.3e-05,3.1e-05,2.7e-05,1.5e-05,7e-06,3.6e-05,2.4e-05,2.2e-05,2.3e-05,5e-06,1.2e-05,8e-06,6e-06,1.3e-05,1.1e-05,2.6e-05,2.6e-05,2.4e-05,8e-06,2e-05,1e-05,2.3e-05,7e-06,1e-06,1e-05,2e-06,1.3e-05,3.2e-05,9e-06,1.7e-05,1e-05,2e-05,2e-06,8e-06,2.5e-05,4e-06,1.5e-05,2.7e-05,7e-06,1.4e-05,2.9e-05,1.5e-05,3.4e-05,3.8e-05,2.3e-05,2.9e-05,2.6e-05,3.8e-05,2.8e-05,9e-06,2e-06,3.7e-05,2.3e-05,2.3e-05
8e-06,5e-06,1.6e-05,2.4e-05,2.1e-05,6e-06,1.2e-05,1.5e-05,2.5e-05,1.9e-05,8e-06,1e-05,2.3e-05,2.3e-05,1.3e-05,2e-05,3.8e-05,2.4e-05,9e-06,1.4e-05,1.4e-05,3.3e-05,2.5e-05,1.2e-05,2.5e-05,2e-05,2.7e-05,2.9e-05,2e-06,1.5e-05,5e-06,1e-05,2e-05,8e-06,1.4e-05,1.3e-05,1.7e-05,9e-06,2.2e-05,2.5e-05,2.4e-05,2e-05,5e-06,1.8e-05,1.7e-05,3e-05,9e-06,3e-06,2.8e-05,4e-05,2.1e-05,4e-06,1.9e-05,2.2e-05,5e-06,1.8e-05,2.3e-05,8e-06,1.2e-05,9e-06,1.7e-05,1.9e-05,7e-06,1.2e-05,1.5e-05,1.3e-05,1.7e-05,9e-06,1.8e-05,7e-06,2.3e-05,3.8e-05,6e-06,1.4e-05,6e-06,1.8e-05,9e-06,9e-06,1e-05,7e-06,1e-05,1.3e-05,1.2e-05,1.3e-05,1.9e-05,2.2e-05,2.8e-05,1e-05,6e-06,1.8e-05,1.1e-05,4e-06,8e-06,1.9e-05,1.1e-05,1.1e-05,2.2e-05,1.8e-05,1e-05,1.3e-05,1.1e-05,1.9e-05,1.5e-05,2e-06,2.4e-05,1.8e-05,3e-06,2.5e-05,2.4e-05,2.7e-05,1.3e-05,1.7e-05,3.8e-05,2.2e-05,1.2e-05,1.5e-05,2.1e-05,1.2e-05,4e-05,2.8e-05,2.4e-05
1.1e-05,1.3e-05,1.2e-05,1.6e-05,1e-05,5e-06,1.5e-05,2.3e-05,1.7e-05,9e-06,9e-06,3.1e-05,1.4e-05,8e-06,3.2e-05,1.6e-05,2.4e-05,2.7e-05,1.1e-05,1.9e-05,1.6e-05,1.5e-05,1.9e-05,1.8e-05,3e-05,9e-06,1.3e-05,5e-06,1.4e-05,4e-06,1.2e-05,1.8e-05,1.5e-05,2e-05,1.4e-05,3e-06,1.2e-05,2.2e-05,2.4e-05,1.1e-05,1.5e-05,2.6e-05,1.7e-05,7e-06,2.2e-05,1.4e-05,1.2e-05,1.8e-05,2.6e-05,2.1e-05,7e-06,4e-06,2.1e-05,9e-06,8e-06,2.5e-05,1.5e-05,6e-06,4e-06,1.5e-05,1.2e-05,2.4e-05,2.5e-05,3e-06,1e-05,1.4e-05,3e-06,1.7e-05,3.6e-05,1.8e-05,1.9e-05,3.7e-05,1.5e-05,8e-06,1e-05,8e-06,2.4e-05,7e-06,8e-06,8e-06,9e-06,1.8e-05,2.1e-05,3e-06,1.1e-05,2.3e-05,1.4e-05,1.1e-05,1.5e-05,1.6e-05,9e-06,5e-06,3.3e-05,1.5e-05,7e-06,3e-06,1.6e-05,1.6e-05,1e-05,1.3e-05,4e-06,1.6e-05,1.7e-05,1.6e-05,1.6e-05,2.9e-05,3.4e-05,5e-06,1.7e-05,6e-06,1.3e-05,1.6e-05,1.6e-05,2.6e-05,4.1e-05,6e-06,5e-06,1.6e-05,2.6e-05,9e-06,1.8e-05
1.1e-05,2.6e-05,2.1e-05,1.9e-05,2.1e-05,2.5e-05,1e-06,1.5e-05,1.7e-05,4e-06,1.4e-05,2.8e-05,1.4e-05,7e-06,1.4e-05,1.5e-05,1.2e-05,1.2e-05,4e-06,1.6e-05,9e-06,2.1e-05,2.7e-05,1e-05,8e-06,2.1e-05,1.8e-05,9e-06,5e-06,6e-06,1.2e-05,1e-06,2.1e-05,2.2e-05,2.1e-05,8e-06,1.7e-05,2.2e-05,2e-05,2.8e-05,1.2e-05,1.8e-05,3.4e-05,1.5e-05,1.8e-05,1.4e-05,1.4e-05,1.3e-05,1.5e-05,2.6e-05,9e-06,1e-05,1.5e-05,1.1e-05,2e-05,2.4e-05,1.5e-05,1.3e-05,4e-06,8e-06,9e-06,2.1e-05,1e-05,6e-06,1.8e-05,8e-06,8e-06,2.3e-05,1.3e-05,1.4e-05,1.3e-05,1.8e-05,1.9e-05,5e-06,6e-06,2.7e-05,1.2e-05,1.6e-05,9e-06,6e-06,2.3e-05,2.4e-05,1.3e-05,2.5e-05,2.1e-05,1.8e-05,2.6e-05,2.4e-05,1.4e-05,8e-06,1.6e-05,2.1e-05,2.8e-05,2.5e-05,9e-06,1e-05,7e-06,1.6e-05,4e-06,9e-06,7e-06,1.8e-05,1.5e-05,6e-06,1.1e-05,3.5e-05,2.7e-05,2.9e-05,1.7e-05,1.2e-05,1.6e-05,4e-06,2.2e-05,1e-06,2.4e-05,1.4e-05,1.8e-05,1.2e-05,2e-05,1.7e-05,3e-06
2e-05,1.4e-05,9e-06,9e-06,1.6e-05,1.8e-05,2.6e-05,6e-06,7e-06,6e-06,2.5e-05,9e-06,6e-06,6e-06,1.4e-05,9e-06,1.1e-05,1.2e-05,1.6e-05,1.5e-05,2.2e-05,2.9e-05,1e-05,2.7e-05,4e-06,9e-06,2e-06,1.5e-05,9e-06,1e-05,1.2e-05,3e-06,3.5e-05,2.8e-05,8e-06,9e-06,2.5e-05,2.9e-05,1.8e-05,2.3e-05,6e-06,9e-06,2e-05,1.1e-05,1.9e-05,6e-06,9e-06,2.7e-05,1.6e-05,1.3e-05,8e-06,2.5e-05,1.2e-05,5e-06,2.1e-05,1.3e-05,5e-06,4e-06,1.1e-05,4e-06,1.5e-05,1.2e-05,8e-06,7e-06,1e-05,6e-06,1.1e-05,1.7e-05,8e-06,7e-06,1.8e-05,1.6e-05,2e-05,1.8e-05,8e-06,2.3e-05,1.4e-05,2.5e-05,9e-06,1e-05,3.3e-05,1.3e-05,1.3e-05,1.3e-05,2.4e-05,5e-06,1.1e-05,1e-05,1.3e-05,1.7e-05,2.2e-05,4e-06,1.2e-05,2.3e-05,1.5e-05,7e-06,1.2e-05,1.1e-05,5e-06,7e-06,7e-06,9e-06,1.3e-05,1.2e-05,1.1e-05,1.2e-05,2.8e-05,9e-06,4e-06,8e-06,1.2e-05,1.2e-05,1.1e-05,1.8e-05,9e-06,1.5e-05,1.9e-05,1.7e-05,2.7e-05,5e-06,1e-05
2e-05,2.2e-05,2e-05,1.1e-05,1e-05,9e-06,2.2e-05,2.2e-05,1.4e-05,3e-05,9e-06,1.2e-05,1e-05,1.7e-05,2e-05,1.4e-05,2.8e-05,1.9e-05,1.5e-05,5e-06,7e-06,2.5e-05,2e-06,1.4e-05,2e-05,1e-05,1.3e-05,7e-06,1e-05,8e-06,7e-06,1.6e-05,4.4e-05,9e-06,1.7e-05,7e-06,1.7e-05,2.7e-05,2.7e-05,1e-05,1.4e-05,1e-05,1.1e-05,6e-06,1.8e-05,1.6e-05,1.7e-05,1.6e-05,2.1e-05,1.5e-05,1.7e-05,1.5e-05,1e-05,0,1.3e-05,1.6e-05,1.1e-05,6e-06,1.4e-05,4e-06,1.1e-05,6e-06,6e-06,1.2e-05,1.6e-05,9e-06,7e-06,1.4e-05,2.6e-05,4e-06,1.6e-05,8e-06,1e-06,2e-06,1.2e-05,5e-06,8e-06,6e-06,1.4e-05,8e-06,2.6e-05,1.4e-05,7e-06,2e-05,3e-06,1.7e-05,6e-06,1.4e-05,1.2e-05,1.2e-05,1.3e-05,1.1e-05,1.1e-05,2e-05,2.1e-05,1.8e-05,1.1e-05,2.3e-05,1e-05,4e-06,4e-06,1.1e-05,1.5e-05,1.6e-05,9e-06,1.2e-05,1.6e-05,2.3e-05,1.1e-05,1.6e-05,1.5e-05,1.9e-05,6e-06,2e-05,1.4e-05,1.3e-05,1.7e-05,7e-06,2.5e-05,2.6e-05,1.8e-05
9e-06,3e-06,6e-06,3e-06,1.6e-05,1.1e-05,1.6e-05,5e-06,1.2e-05,2.5e-05,2.2e-05,4e-06,1.7e-05,1e-05,1.3e-05,4e-06,1.6e-05,1.2e-05,2e-05,1e-05,1e-05,1.8e-05,2e-06,3e-06,1.7e-05,4e-06,1.8e-05,2e-05,8e-06,1.4e-05,1.2e-05,1e-05,2.8e-05,1.6e-05,5e-06,8e-06,8e-06,3e-06,7e-06,6e-06,6e-06,6e-06,1.4e-05,7e-06,2.5e-05,3e-05,8e-06,1.2e-05,1.1e-05,7e-06,1.5e-05,5e-06,6e-06,9e-06,4e-06,1.3e-05,7e-06,5e-06,6e-06,8e-06,1e-05,8e-06,1.6e-05,1.4e-05,6e-06,1.1e-05,1.6e-05,4e-06,1.6e-05,1.7e-05,3e-06,1.1e-05,1e-05,8e-06,1.1e-05,1.4e-05,1e-05,2.2e-05,2.5e-05,1.7e-05,7e-06,1.3e-05,1.6e-05,6e-06,6e-06,1.3e-05,3e-06,9e-06,1e-05,1.4e-05,1e-06,3e-06,2e-05,5e-06,1.2e-05,9e-06,1.4e-05,1.9e-05,1.1e-05,8e-06,8e-06,1.8e-05,8e-06,8e-06,1.7e-05,6e-06,3e-06,1e-05,2.7e-05,8e-06,1.1e-05,7e-06,1.8e-05,9e-06,2e-05,9e-06,1.8e-05,1.1e-05,5e-06,5e-06,4e-06
1.4e-05,1e-06,1e-05,1.6e-05,2.3e-05,1e-05,2e-06,3e-06,1.4e-05,2.4e-05,3e-06,2e-06,2e-05,1.5e-05,1.3e-05,1e-06,1.2e-05,9e-06,1.9e-05,1.2e-05,1.5e-05,1.8e-05,2e-06,1.5e-05,1.1e-05,7e-06,2.2e-05,8e-06,1.7e-05,1e-05,3e-06,1.1e-05,4e-05,6e-06,1.8e-05,8e-06,4e-06,8e-06,9e-06,7e-06,7e-06,1.4e-05,1.5e-05,5e-06,2.6e-05,6e-06,9e-06,8e-06,5e-06,9e-06,1.3e-05,4e-06,6e-06,3e-06,1.1e-05,2e-06,1.4e-05,7e-06,1e-05,8e-06,6e-06,3e-06,1.7e-05,1.3e-05,1.4e-05,9e-06,1.3e-05,2e-06,3e-06,1e-05,7e-06,7e-06,1.4e-05,3e-06,1e-05,4e-06,1.5e-05,6e-06,8e-06,4e-06,2.8e-05,1.4e-05,1.5e-05,1e-05,4e-06,1e-06,9e-06,7e-06,7e-06,8e-06,1.1e-05,8e-06,1.1e-05,9e-06,6e-06,4e-06,1.9e-05,3e-06,3e-06,7e-06,1.2e-05,8e-06,1.2e-05,8e-06,7e-06,3e-06,1.2e-05,7e-06,1e-05,1.2e-05,1e-05,4e-06,1.1e-05,1.4e-05,1.8e-05,3e-06,1e-05,1.7e-05,1.6e-05,1e-05,5e-06
7e-06,9e-06,9e-06,2.3e-05,1.6e-05,2e-05,1.6e-05,2e-06,9e-06,1.4e-05,1.8e-05,4e-06,1.1e-05,1.1e-05,7e-06,1e-05,1.1e-05,1.2e-05,2.7e-05,1.3e-05,9e-06,1e-06,1.4e-05,1.5e-05,2.4e-05,9e-06,1.2e-05,2.3e-05,1.9e-05,1.2e-05,1.4e-05,1.8e-05,3.9e-05,2.3e-05,1.9e-05,1.5e-05,1e-05,3e-06,6e-06,7e-06,3e-06,1.4e-05,1.8e-05,1.5e-05,6e-06,1.1e-05,3e-06,9e-06,9e-06,1e-05,3e-06,1.9e-05,1e-05,1.1e-05,6e-06,1e-05,7e-06,6e-06,4e-06,8e-06,7e-06,1.4e-05,1e-05,7e-06,6e-06,3e-06,1.6e-05,5e-06,2e-05,2e-06,9e-06,1.6e-05,1.8e-05,1.4e-05,1.4e-05,1.8e-05,7e-06,6e-06,7e-06,7e-06,3.8e-05,1.1e-05,1.4e-05,1e-05,8e-06,7e-06,2e-06,1e-05,6e-06,7e-06,1.3e-05,1.4e-05,1e-05,1.3e-05,1.4e-05,1.7e-05,2.1e-05,7e-06,1.3e-05,3e-06,1.2e-05,2.3e-05,1.4e-05,6e-06,1.6e-05,8e-06,2e-05,4e-06,4e-06,1.7e-05,1.1e-05,1.5e-05,1.6e-05,1.2e-05,1.4e-05,9e-06,1.2e-05,2e-05,1e-05,1.7e-05,1.9e-05
1.7e-05,3.2e-05,2.7e-05,7e-06,1e-05,3e-06,1.3e-05,1.1e-05,4e-06,1e-06,4e-06,8e-06,4e-06,1.2e-05,6e-06,1.1e-05,2e-05,1.3e-05,3.8e-05,1.5e-05,1.1e-05,1.1e-05,1.6e-05,1.2e-05,5e-06,1.2e-05,3e-06,8e-06,2e-05,1e-05,6e-06,1.1e-05,8e-06,1.4e-05,1.3e-05,1e-05,1.2e-05,1.9e-05,1.3e-05,2e-05,1.2e-05,5e-06,4e-06,2.5e-05,2.7e-05,1.5e-05,1.5e-05,1.7e-05,1.2e-05,7e-06,1.1e-05,2e-05,1.7e-05,4e-06,8e-06,1.3e-05,5e-06,6e-06,9e-06,2e-06,8e-06,1e-05,1.9e-05,8e-06,3e-06,1e-06,2.2e-05,1.7e-05,9e-06,1e-05,1.9e-05,2.3e-05,1.6e-05,1e-05,8e-06,1e-05,9e-06,2e-05,1.4e-05,1e-06,3.3e-05,2e-05,6e-06,3e-06,1.4e-05,2.2e-05,1.2e-05,5e-06,6e-06,1.5e-05,3e-05,1.6e-05,1.3e-05,1.2e-05,1e-05,1.4e-05,2e-05,2e-05,2.7e-05,1.9e-05,1.3e-05,7e-06,3e-06,1.7e-05,2.3e-05,1.4e-05,2.4e-05,1.9e-05,9e-06,6e-06,1e-05,1.2e-05,5e-06,1.1e-05,1.7e-05,1.6e-05,1.5e-05,1e-05,1.7e-05,2.1e-05,1.1e-05
2e-05,3.2e-05,1.1e-05,1.6e-05,1e-05,9e-06,1.4e-05,1.1e-05,7e-06,1e-05,9e-06,9e-06,7e-06,1.3e-05,2e-05,1.8e-05,1.6e-05,2e-05,2.4e-05,1.3e-05,1.3e-05,7e-06,1e-05,6e-06,2e-06,1.5e-05,1.4e-05,1e-05,1.6e-05,8e-06,2e-06,1.4e-05,1.2e-05,1.4e-05,1.2e-05,8e-06,1.1e-05,1.8e-05,1.3e-05,6e-06,2e-06,2e-06,1.1e-05,2e-05,1.1e-05,6e-06,4e-06,1.4e-05,1e-05,7e-06,1.3e-05,6e-06,8e-06,2e-06,1e-05,1e-05,1.3e-05,4e-06,1.2e-05,6e-06,7e-06,1.2e-05,7e-06,9e-06,6e-06,1.2e-05,2.2e-05,1.1e-05,8e-06,5e-06,1.2e-05,4e-06,1.1e-05,1.1e-05,5e-06,5e-06,1.4e-05,1e-05,1.2e-05,1e-05,1.4e-05,1.5e-05,1e-05,5e-06,2e-05,8e-06,6e-06,1.1e-05,9e-06,1.2e-05,2e-05,2e-05,1.5e-05,5e-06,4e-06,9e-06,6e-06,1.7e-05,1.1e-05,7e-06,6e-06,5e-06,6e-06,2e-05,2.5e-05,1.3e-05,8e-06,1.6e-05,1.4e-05,3e-06,5e-06,8e-06,9e-06,8e-06,1.6e-05,1.5e-05,2.2e-05,1e-06,9e-06,6e-06,1.6e-05
5e-06,1.4e-05,1.8e-05,1.5e-05,1.9e-05,2.2e-05,7e-06,7e-06,8e-06,1.5e-05,1.3e-05,7e-06,1.1e-05,4e-06,1.3e-05,1e-05,8e-06,1.1e-05,2.6e-05,1.1e-05,1e-05,2.5e-05,1.2e-05,6e-06,9e-06,1e-05,5e-06,1.3e-05,1.3e-05,8e-06,8e-06,1.1e-05,1.2e-05,1.5e-05,1e-05,1.2e-05,1.5e-05,1.4e-05,1.6e-05,1.8e-05,1.2e-05,4e-06,9e-06,6e-06,1e-05,1.2e-05,6e-06,9e-06,9e-06,8e-06,6e-06,8e-06,1e-05,7e-06,1.1e-05,2e-06,1.5e-05,7e-06,1.1e-05,4e-06,6e-06,1.8e-05,2.2e-05,1.1e-05,1.6e-05,1.8e-05,4e-06,6e-06,4e-06,9e-06,1.2e-05,1.3e-05,6e-06,5e-06,7e-06,1.3e-05,1.7e-05,6e-06,1.6e-05,1.6e-05,8e-06,4e-06,1e-05,4e-06,1.8e-05,2.3e-05,1.9e-05,2.3e-05,1.2e-05,7e-06,1.8e-05,9e-06,9e-06,3e-06,5e-06,1.2e-05,1.3e-05,2e-06,1.7e-05,1e-05,1e-05,1e-05,2e-06,1.7e-05,1.1e-05,8e-06,1.2e-05,1.5e-05,5e-06,1.1e-05,5e-06,7e-06,1.2e-05,4e-06,7e-06,4e-06,1.9e-05,7e-06,1e-06,4e-06,1e-05
8e-06,1.3e-05,1.1e-05,1.5e-05,2.2e-05,1e-05,8e-06,2e-06,0,1.3e-05,4e-06,2e-06,7e-06,4e-06,2.2e-05,1e-05,8e-06,1.7e-05,2.2e-05,2e-06,1.2e-05,2.1e-05,3e-06,6e-06,4e-06,2e-06,1.1e-05,1.4e-05,1.2e-05,6e-06,5e-06,4e-06,1.2e-05,1.1e-05,1.4e-05,1.1e-05,4e-06,3e-06,1.7e-05,1.2e-05,4e-06,8e-06,1e-06,1.1e-05,5e-06,2e-06,6e-06,2e-06,8e-06,1.1e-05,8e-06,4e-06,1.4e-05,2.3e-05,1.6e-05,1.6e-05,1.4e-05,7e-06,5e-06,5e-06,1e-05,1.4e-05,1.8e-05,2e-05,1.2e-05,1.3e-05,8e-06,1.3e-05,1.3e-05,6e-06,2.5e-05,1.9e-05,1.8e-05,1e-05,1.2e-05,9e-06,1.7e-05,5e-06,1.2e-05,7e-06,2.1e-05,1.1e-05,4e-06,7e-06,6e-06,4e-06,1e-05,1.9e-05,1.2e-05,1.1e-05,1.2e-05,1.8e-05,1.4e-05,7e-06,3e-06,7e-06,1.3e-05,1.4e-05,1.7e-05,1.4e-05,6e-06,6e-06,8e-06,1e-05,1.6e-05,1e-05,1.2e-05,1.4e-05,9e-06,6e-06,7e-06,4e-06,9e-06,7e-06,9e-06,1.3e-05,1.4e-05,1.2e-05,1.6e-05,1e-06,8e-06
4e-06,5e-06,3e-06,3e-06,1.2e-05,1e-05,3e-06,4e-06,6e-06,1e-05,1.2e-05,9e-06,1e-05,1.6e-05,1.5e-05,1.1e-05,1.7e-05,4e-06,2e-05,1.1e-05,9e-06,1.8e-05,6e-06,7e-06,8e-06,2e-06,1.1e-05,4e-06,1.2e-05,5e-06,2e-06,5e-06,6e-06,1.4e-05,5e-06,1e-05,5e-06,1e-06,1.1e-05,1e-06,5e-06,3e-06,8e-06,1.1e-05,6e-06,3e-06,2e-06,2e-06,6e-06,4e-06,6e-06,5e-06,1e-05,8e-06,5e-06,8e-06,1.4e-05,3e-06,8e-06,6e-06,4e-06,5e-06,8e-06,1e-05,6e-06,9e-06,2e-06,5e-06,7e-06,6e-06,1.8e-05,1.2e-05,1.3e-05,9e-06,8e-06,1e-05,1.5e-05,6e-06,4e-06,7e-06,1.3e-05,5e-06,7e-06,1.1e-05,7e-06,1e-05,6e-06,1.6e-05,3e-06,8e-06,5e-06,7e-06,1.4e-05,5e-06,6e-06,3e-06,8e-06,7e-06,7e-06,4e-06,7e-06,1.4e-05,8e-06,2e-06,3e-06,8e-06,7e-06,9e-06,7e-06,8e-06,4e-06,3e-06,5e-06,7e-06,2e-05,2e-06,6e-06,1.2e-05,3e-06,4e-06,6e-06
7e-06,8e-06,2e-06,5e-06,1.3e-05,8e-06,3e-06,3e-06,5e-06,7e-06,8e-06,6e-06,6e-06,1e-05,1.6e-05,5e-06,8e-06,1e-05,7e-06,6e-06,3e-06,1.4e-05,3e-06,2e-06,6e-06,1e-06,8e-06,9e-06,1.2e-05,2e-06,3e-06,2e-06,9e-06,2e-06,5e-06,6e-06,3e-06,5e-06,8e-06,1e-06,3e-06,3e-06,8e-06,7e-06,7e-06,6e-06,1e-06,0,4e-06,7e-06,3e-06,3e-06,3e-06,7e-06,4e-06,4e-06,5e-06,1e-06,8e-06,6e-06,1e-05,5e-06,9e-06,6e-06,2e-06,6e-06,1e-06,2e-06,1.2e-05,4e-06,5e-06,9e-06,9e-06,7e-06,2e-06,9e-06,7e-06,2e-06,5e-06,7e-06,1.1e-05,6e-06,1e-05,4e-06,2e-06,7e-06,2e-06,8e-06,5e-06,4e-06,3e-06,1.1e-05,1e-05,4e-06,3e-06,2e-06,5e-06,5e-06,4e-06,1e-06,5e-06,8e-06,1e-05,1e-06,5e-06,9e-06,5e-06,6e-06,4e-06,8e-06,5e-06,4e-06,7e-06,4e-06,1.3e-05,2e-06,6e-06,6e-06,7e-06,6e-06,1e-05
4e-06,4e-06,0,5e-06,1e-05,8e-06,2e-06,0,5e-06,5e-06,6e-06,5e-06,4e-06,8e-06,1.3e-05,2e-06,6e-06,1.2e-05,1.2e-05,3e-06,2e-06,1.5e-05,3e-06,2e-06,7e-06,2e-06,8e-06,9e-06,1.1e-05,1e-06,1e-06,4e-06,1.1e-05,6e-06,2e-06,3e-06,4e-06,3e-06,8e-06,3e-06,2e-06,0,5e-06,1e-05,5e-06,5e-06,2e-06,1e-06,2e-06,6e-06,2e-06,1e-06,1e-06,4e-06,3e-06,5e-06,7e-06,0,8e-06,4e-06,7e-06,4e-06,8e-06,3e-06,4e-06,6e-06,3e-06,0,1e-05,2e-06,5e-06,9e-06,9e-06,5e-06,1e-06,1e-05,8e-06,2e-06,3e-06,7e-06,1.3e-05,8e-06,1e-05,4e-06,2e-06,8e-06,1e-06,7e-06,4e-06,2e-06,3e-06,1e-05,1e-05,1e-06,2e-06,3e-06,4e-06,4e-06,2e-06,1e-06,4e-06,9e-06,7e-06,1e-06,6e-06,1e-05,6e-06,6e-06,7e-06,4e-06,3e-06,3e-06,7e-06,4e-06,1.3e-05,2e-06,6e-06,4e-06,7e-06,3e-06,9e-06
4e-06,4e-06,0,6e-06,1.1e-05,7e-06,0,1e-06,5e-06,5e-06,7e-06,4e-06,4e-06,8e-06,1.3e-05,1e-06,4e-06,1.1e-05,1.2e-05,2e-06,1e-06,1.5e-05,2e-06,2e-06,7e-06,1e-06,6e-06,9e-06,9e-06,1e-06,1e-06,3e-06,1.2e-05,6e-06,2e-06,2e-06,2e-06,5e-06,9e-06,3e-06,1e-06,1e-06,4e-06,9e-06,6e-06,3e-06,2e-06,0,2e-06,6e-06,2e-06,1e-06,0,6e-06,3e-06,6e-06,6e-06,1e-06,8e-06,3e-06,7e-06,3e-06,8e-06,2e-06,3e-06,5e-06,2e-06,0,1e-05,2e-06,3e-06,8e-06,8e-06,3e-06,0,1e-05,8e-06,1e-06,2e-06,7e-06,1.3e-05,6e-06,8e-06,4e-06,1e-06,6e-06,0,7e-06,3e-06,3e-06,2e-06,1.1e-05,1.2e-05,1e-06,3e-06,2e-06,5e-06,5e-06,1e-06,1e-06,3e-06,9e-06,7e-06,2e-06,7e-06,1e-05,5e-06,3e-06,6e-06,4e-06,4e-06,2e-06,7e-06,3e-06,1.2e-05,2e-06,7e-06,5e-06,7e-06,3e-06,8e-06
