0.000112,6e-05,7.6e-05,5.4e-05,4.4e-05,0.000107,7.5e-05,4.9e-05,8e-06,4.2e-05,7e-05,6e-06,9.7e-05,9.8e-05,1.2e-05,6e-05,3.3e-05,2.3e-05,4.7e-05,4.6e-05,9.4e-05,5e-06,8.2e-05,2.5e-05,2.8e-05,1.4e-05,3.7e-05,7.4e-05,7.9e-05,2.5e-05,4e-06,7.4e-05,6.7e-05,4.4e-05,3.8e-05,9.2e-05,1.1e-05,1.2e-05,3.6e-05,2.8e-05,2e-05,3.8e-05,6e-06,1.4e-05,7.3e-05,7.1e-05,1e-06,4.8e-05,4e-06,1.8e-05,0.000108,8.4e-05,2.7e-05,0.000172,1e-05,5.3e-05,5.4e-05,1.7e-05,3e-06,5e-05,4.9e-05,3.2e-05,4.4e-05,0.00014,3.6e-05,0,4.3e-05,5e-06,2.2e-05,4e-06,1.4e-05,3.3e-05,4e-05,0.000105,6.6e-05,7.8e-05,2.3e-05,1.2e-05,0.000101,6.1e-05,3e-06,4.7e-05,5.3e-05,1.5e-05,8e-06,5.9e-05,6.7e-05,5.8e-05,6.6e-05,1e-05,2.9e-05,7.9e-05,2.5e-05,4.9e-05,1e-05,2.1e-05,3.5e-05,8.5e-05,1.9e-05,1.1e-05,1e-06,3.6e-05,1.4e-05,4e-06,4.6e-05,1.5e-05,1e-05,4.6e-05,1e-06,8.4e-05,8e-06,3.7e-05,2.8e-05,9e-06,1.1e-05,1.9e-05,1.8e-05,6.7e-05,3.5e-05,9.1e-05,7e-06
0.000295,0.000153,0.000116,0.000146,9e-05,0.000295,0.000163,0.000184,9.8e-05,2.8e-05,0.000123,3.5e-05,0.000195,0.000239,1.1e-05,0.000109,5.9e-05,3.8e-05,0.000129,0.000126,0.000122,0.00011,0.00022,8.5e-05,4.9e-05,6.2e-05,0.00012,0.000214,0.000119,8.1e-05,1.5e-05,0.000154,0.000153,0.000112,9.3e-05,0.000216,7e-06,6.5e-05,5.1e-05,9.9e-05,6.8e-05,0.000132,3.6e-05,7.3e-05,0.000116,0.00015,1.3e-05,7.4e-05,5.5e-05,6.9e-05,0.000223,0.000161,6.5e-05,0.00036,1.9e-05,0.000184,0.000148,1.3e-05,3e-05,0.000125,4.9e-05,0.000125,7.5e-05,0.000322,0.000116,3.6e-05,0.000112,7.2e-05,3.2e-05,1e-05,7.6e-05,8e-05,8.4e-05,0.000157,9.3e-05,0.000164,7.7e-05,0.000127,0.000221,0.000136,4.9e-05,0.000102,0.000141,8e-05,8e-05,0.000162,0.000149,7.5e-05,0.000109,7e-05,7.2e-05,0.000191,1.8e-05,9.5e-05,4.4e-05,4.2e-05,0.000107,0.000195,5.4e-05,5.2e-05,3.5e-05,5.9e-05,3e-06,2.1e-05,7.5e-05,8.7e-05,4.3e-05,5.7e-05,8.3e-05,0.000135,3.7e-05,2.4e-05,6e-05,4.6e-05,4.5e-05,7.8e-05,2.7e-05,0.000169,0.00011,0.000276,4e-05
0.000472,0.000162,0.000272,0.000196,1e-04,0.000291,4.8e-05,0.000328,6.5e-05,0.000157,0.000298,0.000134,0.000391,0.000256,0.000211,0.000247,0.000104,3.4e-05,0.000183,0.000121,0.000283,0.00016,0.000144,7.3e-05,0.000132,0.000146,0.000203,0.000243,0.000409,2.3e-05,4.7e-05,0.000168,6.6e-05,0.000192,0.000118,0.000231,7.3e-05,0.000219,9.6e-05,0.000203,0.000165,2e-04,0.000104,9.2e-05,2e-04,0.000232,7.3e-05,9.1e-05,0.000108,0.000242,0.000123,0.000235,8.5e-05,0.000343,6.1e-05,0.000212,9.4e-05,0.000131,3.4e-05,8.5e-05,0.000171,0.000162,0.000132,0.000521,0.000155,0.000145,0.000137,8.5e-05,8.8e-05,0.000106,0.000187,7e-05,8.9e-05,0.000126,0.000168,0.00014,0.000166,0.000343,0.000354,0.000105,0.000342,0.000105,0.000188,7.4e-05,0.000178,0.000122,0.000202,6.5e-05,0.000216,0.000123,6.7e-05,0.000247,0.000141,9.9e-05,0.000185,0.000152,0.000173,0.000271,0.000169,5.5e-05,1.6e-05,0.00016,5.5e-05,7.7e-05,4.7e-05,7.7e-05,0.000118,0.000178,8.6e-05,0.00011,9.4e-05,3.3e-05,8.6e-05,0.00015,0.00024,0.000122,2.4e-05,0.000236,0.00015,0.000289,0.000153
0.000644,0.000228,0.000266,0.000559,0.000281,0.000293,0.000318,0.000325,0.000208,0.000312,0.000234,0.000141,0.000636,0.00034,0.000129,0.000346,0.000273,5.9e-05,0.000351,0.000782,0.000685,0.000177,0.000231,0.000479,0.000323,0.000237,5.8e-05,0.000128,0.000382,0.000438,0.000314,0.00031,0.000184,0.000396,0.000355,0.000503,0.000263,0.00029,0.000476,0.000386,0.000351,0.000206,7.6e-05,0.000344,0.000523,0.000301,0.00027,0.000278,0.00023,0.000248,0.000456,0.000289,0.000226,0.000403,0.000152,5.7e-05,0.000299,0.000245,0.000302,0.000187,0.000559,0.000393,0.000524,0.000518,0.000398,0.000197,0.000359,0.000263,0.000208,0.000345,0.000137,0.000206,0.000168,0.000212,0.000332,0.000374,0.000365,0.000551,0.000309,0.000319,0.000748,0.000698,0.000534,0.000521,0.000252,0.000383,0.000499,0.00036,0.00027,0.000169,0.000246,0.000381,0.000382,0.000225,0.000342,0.000281,0.000274,3.1e-05,0.000242,0.000295,0.000171,0.00031,0.00024,0.000225,0.000197,0.000116,0.000202,0.00012,8.1e-05,0.000308,0.000133,0.000114,8e-05,0.000164,0.000362,0.000357,0.000197,0.000336,9e-05,0.000411,0.000611
0.000523,0.000689,0.000554,0.000492,0.000422,0.000477,0.000702,0.000393,0.000429,0.000533,0.000571,0.000299,0.00093,0.000688,0.00044,0.00035,0.000417,0.000219,0.000359,0.001566,0.001413,0.001079,0.000531,0.001025,0.000835,6e-04,0.000402,0.000408,0.000147,0.00044,0.000235,0.000151,0.000165,0.000374,0.000339,0.000684,0.000724,0.000674,0.000537,0.000144,0.000242,7.7e-05,0.000121,0.000419,0.000197,0.000662,0.000603,0.000285,0.000237,0.000374,0.000149,0.000412,0.000761,0.000609,0.00066,0.000439,0.000736,0.000714,0.000412,0.000213,0.00066,0.000464,0.000215,0.000818,0.000891,0.000457,0.000476,0.000365,6.2e-05,0.000375,0.000272,0.000537,0.00058,0.00066,0.000523,0.000671,0.000175,0.000467,0.000817,0.000775,0.000964,0.00073,0.000257,0.000409,0.00077,0.00052,0.000496,0.000342,0.000558,0.000387,7e-04,0.000144,0.000263,0.000238,0.000608,0.000794,0.000282,0.000233,0.00034,0.000266,0.000101,0.000321,0.000345,0.00057,0.000464,0.000482,9.1e-05,0.000242,0.000282,0.000235,0.000309,0.000262,0.000113,0.000194,0.000661,0.000681,0.000317,0.000246,0.000332,0.000507,0.000813
0.000343,0.00038,3.9e-05,0.000247,0.000584,0.000328,0.000286,0.000258,0.00041,0.000448,0.000279,0.000393,0.000723,0.00037,0.000169,0.00031,0.000172,0.000353,0.000307,0.001169,0.000767,0.000125,0.000493,0.00041,3.8e-05,0.00027,0.000501,0.000307,0.000445,7e-05,7e-06,7.5e-05,0.00014,0.00051,0.000263,0.000586,0.000201,0.000269,0.000175,0.000307,0.000258,0.000303,0.000296,0.00039,0.000444,0.000353,0.000279,0.000534,0.000229,0.000141,0.000303,0.000173,0.000587,0.000382,0.000225,9.3e-05,0.000509,0.000127,0.000242,9.5e-05,0.000539,0.000376,0.000168,0.00044,0.000449,0.000347,0.000788,0.000292,8.1e-05,0.000185,0.000211,0.000566,0.000572,0.000161,0.000523,0.000378,0.000334,0.000159,0.00064,0.000451,0.000266,0.000451,0.000187,0.000303,0.000466,1.9e-05,0.000242,0.000246,0.000379,0.00013,0.000531,0.000383,0.000217,0.000249,0.00065,0.000142,0.000167,0.000214,0.000137,0.000303,7.3e-05,3e-04,8.9e-05,0.000395,8.1e-05,0.000287,0.000338,0.000385,0.000345,0.000431,0.000444,0.000241,0.000185,0.000193,0.000549,0.000203,8.4e-05,0.000117,0.000244,0.000101,0.000515
0.000334,0.000375,0.000222,0.00057,0.000716,0.000613,9.2e-05,0.000108,0.000396,0.000391,9.8e-05,0.000314,0.000502,0.000217,0.000215,0.000154,0.00034,0.000573,0.000279,0.000829,0.000206,0.000266,0.000732,0.00049,0.00055,6.7e-05,0.000808,0.000128,0.000323,0.00046,0.000207,0.000212,0.000301,0.000382,0.000209,0.000326,0.000372,0.000165,0.00023,0.00017,0.000494,0.000385,0.000231,0.00017,0.000142,0.000384,0.000343,0.000408,0.000243,0.000177,0.00038,0.000223,0.000305,0.000479,0.000219,0.000156,0.000292,0.000386,0.000313,0.000247,0.000381,0.00011,9.2e-05,0.00033,0.000261,2.1e-05,0.000331,0.000286,0.000215,0.000129,0.000405,0.000546,0.000307,0.000205,0.000455,0.000193,0.000391,0.000338,0.000198,0.000532,0.000368,0.000299,0.000284,0.000264,0.000636,0.00052,0.000213,0.000221,0.000352,0.000398,7.3e-05,0.00025,0.000409,0.000116,0.000361,0.000321,0.000354,4e-04,0.000312,0.000437,0.000492,4.5e-05,5.2e-05,0.000123,0.000156,0.000228,0.000248,0.000226,0.000194,8.6e-05,0.000271,0.000551,0.000347,2e-04,0.000213,0.000103,0.000117,5.8e-05,0.000115,0.000171,0.000266
0.000437,7e-04,0.000947,0.000858,0.000389,0.000484,0.001146,0.000736,0.000253,0.000514,0.000421,0.000567,0.000584,0.000689,0.000442,0.000467,0.000576,0.00122,0.000782,0.001761,0.001106,0.000328,0.00041,0.000621,0.000751,0.000367,0.000989,0.000923,0.000915,6.1e-05,0.000386,0.000207,0.000111,0.000389,0.000521,0.000524,0.000836,4e-04,0.000342,0.000461,0.000484,0.000804,0.000774,0.000535,0.000504,0.00066,0.000553,0.000876,0.000321,0.000666,0.000514,0.000553,0.000657,0.001216,0.000812,0.000323,0.000176,0.000473,0.000382,0.000329,0.000293,0.000356,0.000195,0.000156,0.000425,0.000321,0.00052,0.000325,0.000202,0.000372,0.000441,0.000733,0.00092,0.000502,0.000192,0.000555,0.000567,0.000379,0.000281,0.000651,0.000324,0.000117,0.000204,0.000139,0.000376,0.000309,0.000589,0.000345,0.000733,0.00031,0.000386,0.000202,0.000268,0.00099,0.00052,0.000349,0.000527,0.000286,0.000552,0.000661,0.000142,0.000204,4.8e-05,0.000163,0.000255,0.000141,3.5e-05,0.000213,0.000129,0.000389,0.00024,0.000428,0.000135,8.7e-05,0.000604,0.000531,9e-05,0.000177,8.2e-05,0.000224,0.000379
0.001233,0.001237,0.001039,0.001284,0.001486,0.001562,0.001846,0.001017,0.000974,0.000482,0.000458,0.000122,0.000266,0.001245,0.000549,0.000482,0.000308,0.001132,0.001283,0.001559,0.001317,0.001464,0.001067,0.000797,0.000631,0.000467,0.00067,0.001396,0.000495,0.000684,0.000679,0.000536,0.000246,6.8e-05,0.000526,0.001278,0.000463,0.000376,0.000343,0.000652,0.000704,0.001046,0.000391,0.000647,0.000782,0.000699,0.000654,0.000231,0.00029,0.000851,0.000375,0.000706,0.000218,0.001521,0.002059,0.001432,0.000982,0.00049,0.000159,0.000513,0.000379,5.1e-05,0.000124,0.000548,0.000752,0.000267,0.000961,0.000443,7.5e-05,0.000345,0.000294,0.000318,0.00049,0.00044,0.000665,0.000948,0.001176,0.001264,0.000513,0.000663,0.001164,0.000463,0.000293,0.000225,4.5e-05,0.000295,0.000471,0.000652,0.000571,0.000616,0.000515,0.000941,0.000239,0.001256,0.000647,0.000625,0.000406,0.000566,0.000649,0.000746,0.000798,0.000572,0.000379,0.000283,0.000206,0.000166,0.000124,0.000101,0.000274,0.00085,0.000913,0.000505,0.000309,0.000497,0.000919,0.000414,0.000238,0.000285,0.000166,0.000309,0.000623
0.000224,0.000254,0.000624,0.000515,0.000781,0.000885,0.000835,0.000336,0.000707,0.000823,0.000871,0.000619,0.000443,0.001206,0.000781,0.00049,0.000373,0.000692,0.000111,0.000892,0.000481,0.000554,0.000577,0.00052,0.000716,0.000512,0.000507,0.000563,0.001153,0.000582,0.000714,0.000421,0.000399,0.000602,0.000256,8e-04,0.000613,0.000598,0.000744,0.001151,0.000433,0.000399,0.000182,0.000654,0.000653,0.000207,0.00075,0.000673,0.000363,0.00059,0.000737,0.000726,0.000646,0.000924,0.000758,7.8e-05,0.000654,0.000479,0.000375,0.000458,0.000383,7.6e-05,5.9e-05,0.000712,0.000746,0.000476,0.000804,0.000631,1e-04,0.000237,0.00043,0.000359,0.000706,0.000293,0.001024,0.000307,0.000266,0.000714,0.000195,0.000215,0.000672,0.000651,0.000518,0.00014,0.000118,0.000421,0.000325,0.000814,0.00048,0.000668,0.000177,0.000858,0.000604,0.0012,0.000738,0.000511,0.000782,0.00052,0.000489,0.000121,0.000338,0.000405,9.2e-05,0.000432,0.000353,9.6e-05,6.4e-05,0.00017,0.000255,0.00069,0.000149,0.000325,0.000692,0.000129,0.000776,0.000324,5.8e-05,0.00014,0.000429,0.000492,0.000446
0.001414,0.00089,0.000138,0.000501,0.000568,0.001078,0.001411,0.000886,0.000884,4.8e-05,0.000512,0.000622,0.00068,0.000484,0.000923,0.000559,0.000234,0.000599,0.000718,0.000553,0.000485,0.000336,0.000496,0.000429,0.00068,0.000905,0.00055,0.000345,0.000934,0.00071,0.000527,0.000316,0.000357,0.000259,0.000366,0.000335,0.000115,0.000375,0.00014,0.001096,0.001073,0.000793,0.000547,0.000254,0.00071,0.000604,0.000958,0.000516,0.000254,0.000322,0.000811,0.000694,0.000171,0.000644,0.000549,0.000317,0.000477,0.00066,0.000536,0.000554,0.000564,0.000428,8.6e-05,0.000508,4e-05,5e-05,0.000606,0.000937,0.000765,0.000437,0.000625,0.000345,0.000328,0.000206,0.000971,0.000888,0.000446,0.00086,0.000933,0.000512,0.000361,0.000692,0.000329,0.000363,7.3e-05,0.000402,0.000481,0.000275,0.000186,0.000359,0.000312,0.000552,0.000613,0.000311,0.000581,0.000298,0.000749,0.00083,0.000165,0.000108,0.000296,0.000185,0.000328,0.000311,0.000242,0.000252,4.6e-05,0.000111,0.00022,0.000736,0.000548,0.000111,0.000431,0.00061,0.000814,0.000622,0.000395,0.000284,0.000556,0.000424,0.000459
0.000249,0.000284,2.3e-05,0.000401,0.000508,0.000114,0.000303,0.000267,0.00026,0.000416,0.000289,0.000222,0.000144,0.000359,0.000397,0.000115,9.7e-05,0.000252,0.000252,0.000258,0.00048,0.000585,2e-04,0.00048,0.000204,0.000486,0.000172,0.000143,0.00067,0.000464,0.000449,0.000427,0.000117,0.000202,1.2e-05,0.000136,0.000171,0.000262,0.000285,0.000662,0.000257,0.00028,0.000224,0.00021,0.000321,0.000105,0.000636,0.000316,5.4e-05,0.000219,0.000479,0.000315,0.000173,9.5e-05,0.000263,0.000249,0.000322,9.3e-05,0.000109,0.000131,9.1e-05,0.000189,0.000268,0.000127,2.6e-05,5.8e-05,0.000145,0.000441,0.000228,0.000131,0.000269,0.000126,0.000219,0.000219,0.000581,0.000345,0.000168,0.000504,0.000372,0.000255,0.00043,0.000389,0.000297,0.000267,0.000187,0.00029,0.000135,0.000193,0.000378,0.000137,0.000206,0.000174,0.000156,0.000137,0.000248,0.000288,0.00075,0.000344,0.000331,0.000184,0.000174,0.000202,0.000184,6.6e-05,8.5e-05,6.5e-05,9.3e-05,5.5e-05,0.000198,0.000222,4.5e-05,0.000126,0.000249,0.000297,0.000265,0.000129,0.000165,0.000196,0.000271,0.000147,7.7e-05
0.000311,0.000175,0.000148,0.000299,0.000183,0.000135,0.000351,0.000254,6.3e-05,0.000188,0.000279,9.3e-05,0.000101,0.000146,0.000161,1.9e-05,0.000111,0.000135,0.000155,0.000201,0.000255,0.00019,8.4e-05,0.000222,9e-05,0.000148,0.000121,0.000241,0.000167,4.4e-05,0.00021,0.000192,7.2e-05,8.7e-05,0.000319,0.000128,0.000143,0.000242,0.000196,0.000219,0.000241,0.00024,2.6e-05,9.1e-05,0.000202,0.000201,0.000268,0.000178,9.2e-05,0.000139,0.000251,0.000111,0.000134,5.9e-05,0.000157,6.2e-05,6.5e-05,6.5e-05,4e-05,8e-05,5.5e-05,0.000157,4.6e-05,0.000128,0.000109,0.000148,0.000124,0.000119,9.7e-05,0.00013,0.000148,0.000156,1.5e-05,0.000206,0.000238,9.2e-05,0.000153,0.000311,0.000237,7.3e-05,0.000122,8.1e-05,5.4e-05,6.1e-05,8.7e-05,0.000107,0.000119,8.9e-05,0.000102,0.000145,0.000129,6.7e-05,9.9e-05,6.2e-05,0.000127,0.00013,0.000371,6.1e-05,0.000148,2e-06,9.6e-05,8.4e-05,4.7e-05,9.1e-05,8.5e-05,2.4e-05,9.5e-05,4.7e-05,0.000166,0.000145,0.000117,0.000144,0.000137,0.000135,5.7e-05,1.8e-05,0.000103,4.9e-05,0.000135,0.000105,8.9e-05
0.000325,0.000202,0.000187,0.000218,0.000179,0.00013,0.000308,0.000258,0.000134,0.000143,0.000163,2.6e-05,0.000267,0.000105,0.000158,8.9e-05,8.6e-05,9.6e-05,0.000154,0.000125,7.4e-05,0.000182,0.000119,0.000239,0.000206,0.000166,5.7e-05,0.000221,0.000181,0.000162,0.000248,5e-06,0.000143,5.1e-05,0.000368,0.000109,1e-04,9.5e-05,0.000212,0.000175,0.000216,0.000181,1.9e-05,9.9e-05,9.2e-05,0.000133,0.000114,0.000195,3.7e-05,7.2e-05,4.7e-05,0.00013,0.000124,2.2e-05,0.000105,6.9e-05,3.6e-05,6.7e-05,4.6e-05,4.6e-05,8e-06,0.000148,4.4e-05,0.000149,7.4e-05,0.000198,7.8e-05,9.1e-05,9.3e-05,0.000204,0.000188,8e-05,0.000181,0.000163,0.000135,7.7e-05,0.000134,0.000284,0.000204,2e-05,6.7e-05,8.7e-05,8.1e-05,1.2e-05,0.000152,0.000177,1.4e-05,0.000182,0.000166,6.5e-05,0.000143,4.1e-05,1e-04,4.3e-05,6.4e-05,8.1e-05,0.000226,4e-06,0.000106,4.2e-05,0.000149,3.6e-05,5.5e-05,0.000108,7e-05,5.6e-05,8.7e-05,6.5e-05,0.000185,0.00012,1.5e-05,0.00015,0.000101,7.5e-05,2.2e-05,5.3e-05,0.000104,4.8e-05,8e-05,0.000143,6.4e-05
0.000385,0.000137,0.000217,0.000109,0.000225,0.000165,0.000323,0.000135,0.000102,6.2e-05,9.6e-05,7.1e-05,0.000269,1.4e-05,0.000256,4.2e-05,0.000218,0.000149,0.000165,0.00016,0.000168,0.000327,0.000248,0.000308,0.000352,0.000191,0.00018,0.000198,0.000128,7.9e-05,0.00017,7.5e-05,0.000112,9.6e-05,0.000189,0.000188,0.000204,0.000385,0.000191,0.000236,0.000146,0.000214,4e-05,8e-05,0.00018,6.7e-05,0.000224,0.000354,6.5e-05,5.9e-05,7.2e-05,4.9e-05,0.00017,6.3e-05,7.3e-05,6.9e-05,3.6e-05,0.000121,4.8e-05,5.1e-05,7.2e-05,0.00011,0.000191,0.000182,7.7e-05,0.000133,0.000167,0.000294,9.8e-05,0.000391,0.000128,7.5e-05,0.000173,0.000156,0.000112,7.4e-05,0.000227,0.000219,0.000282,6.3e-05,0.000156,0.000137,7.4e-05,0.000152,5.9e-05,0.000125,0.000105,7.9e-05,0.000162,0.000157,0.000196,0.000192,6e-05,9.5e-05,6.5e-05,2.3e-05,0.000268,4.3e-05,8.3e-05,8.3e-05,0.000113,0.000101,5.5e-05,8.1e-05,0.000198,0.000134,0.00012,6.8e-05,0.000235,0.000133,0.000122,0.000192,6.4e-05,7.2e-05,8.4e-05,9.1e-05,0.000163,7.1e-05,8.2e-05,0.000131,0.00011
0.000256,0.000172,0.000251,0.000258,0.000132,0.000396,0.000256,0.000239,0.000267,8.5e-05,0.000228,0.000286,0.000272,0.000235,0.000398,0.000279,0.000453,0.000364,0.000516,0.000473,0.000133,0.000243,3.3e-05,0.000442,0.000458,0.000301,0.000178,0.000286,5.5e-05,0.000101,0.00014,0.000126,0.000242,0.00034,0.000316,8.7e-05,0.000107,0.000436,0.000194,0.000106,0.000294,0.000357,0.000216,0.000152,0.000317,0.000229,0.000152,0.000487,0.000227,0.00016,0.000265,0.000133,0.000224,2e-04,0.000236,7.7e-05,8.4e-05,0.000147,0.000121,0.000131,9.7e-05,0.000148,0.000128,0.000185,0.000315,0.000177,0.000122,6.7e-05,0.000111,0.000455,0.000237,4e-05,0.000209,0.000241,0.000328,0.000357,0.000201,0.000434,0.000358,0.000324,9e-05,0.000211,9.2e-05,9.1e-05,0.000161,0.000167,6.7e-05,0.000219,0.000247,0.000178,0.000134,6.7e-05,0.000111,4e-05,0.000264,0.000134,0.000368,0.000114,0.000292,0.000136,0.000226,0.000199,9.4e-05,0.000178,0.000127,0.000206,0.000162,7e-05,0.000245,0.00028,0.000199,0.000311,0.000335,0.000257,0.000157,3.1e-05,0.000138,1.9e-05,7.9e-05,0.000227,5.6e-05
0.000623,5.7e-05,0.000207,0.000355,0.000541,0.000506,0.001031,0.000971,0.000665,0.000766,0.000209,0.00036,0.000656,0.000259,0.000907,0.000187,0.000943,0.00044,0.000181,0.000535,0.000417,0.000414,0.000307,0.000316,0.001047,0.000866,0.000278,4.2e-05,0.000452,0.000483,0.000456,0.000354,0.000613,0.000403,0.000536,0.00047,0.000155,0.000473,0.000912,0.000545,0.000122,0.000298,0.000436,0.000238,0.00032,0.000743,0.000342,0.000897,0.000742,0.000581,0.00052,0.000231,0.000221,0.000213,0.000124,0.000283,0.00034,0.00028,0.000362,0.000173,6.6e-05,0.000184,0.000187,0.000337,0.000691,0.000352,6.7e-05,0.000141,0.000109,0.000401,0.000314,0.000315,0.00026,0.000273,0.000207,0.000451,0.00028,0.000402,0.000351,0.000304,0.000367,0.000159,0.000189,0.000269,0.000433,0.000373,0.000187,0.000576,0.000278,0.000245,6e-05,0.000501,0.000274,0.000522,0.000302,0.000156,0.000582,0.000278,0.000455,0.000173,0.000242,4.2e-05,0.000141,0.00037,0.000245,0.000213,0.000475,0.000261,0.000412,0.000358,0.000446,0.000587,4.7e-05,9.5e-05,0.000152,0.000263,7.1e-05,0.000138,8.1e-05,0.000289,0.000272
0.000494,0.000427,0.000253,0.000174,0.000506,0.000304,0.000859,0.001292,0.001322,0.000167,0.000756,0.001053,0.001335,0.001064,0.001317,0.001127,0.00149,0.001025,0.000286,0.00081,0.000653,0.000242,8.6e-05,8.3e-05,0.001038,0.001265,0.000993,0.000522,0.000719,0.000342,0.00044,0.000528,0.000895,0.000818,0.001074,0.001265,0.001128,0.001006,0.001362,0.000957,0.000398,0.000593,0.000547,0.000357,0.000507,0.000544,0.000677,0.000451,0.000587,0.000358,0.000736,0.000591,0.000771,0.000733,0.000533,0.000627,0.000488,0.000406,0.000259,0.000609,0.000549,0.00017,0.000543,0.000711,0.00084,0.001081,0.00094,0.000684,0.000494,0.000521,0.000668,0.00077,0.000693,0.000917,0.000553,0.000397,0.000583,0.000159,0.000511,0.000865,0.000813,0.000734,0.000721,0.000291,0.000851,0.000695,0.000457,0.000669,0.001089,0.001002,0.000385,0.000964,0.000492,0.00067,0.000881,0.000615,0.000717,0.000834,0.001044,0.000752,0.000353,0.000331,0.000388,0.000829,0.000864,0.000391,0.000465,0.000378,0.000541,0.000436,0.000634,0.000727,0.000642,0.000388,9.8e-05,0.000267,0.000358,0.000383,0.000304,0.000242,0.000202
0.000566,0.000539,0.000709,0.000613,0.000631,0.000638,0.000511,0.000319,0.00043,0.000658,0.000861,0.000505,0.000345,0.000743,0.00052,5e-04,0.000374,0.000596,0.000446,0.000646,0.000251,7e-05,0.000142,0.00034,0.000974,0.000291,0.000633,0.000247,0.000391,0.000412,0.000234,0.000232,0.00056,0.000906,0.000651,0.000174,0.000459,0.000253,0.000749,0.000232,0.000189,0.000551,0.000206,1e-04,0.000263,0.000236,0.000659,0.000829,0.000419,0.000581,0.000837,0.000665,0.000346,0.000589,0.000411,0.000116,0.000153,0.000368,0.000275,0.000639,0.000582,0.000706,0.000653,0.000697,0.000523,0.000748,0.000474,0.000144,0.000293,0.000613,0.000275,0.000414,3.8e-05,0.000617,0.000312,0.000598,0.000456,0.000424,0.000127,0.000639,0.000552,0.000463,0.000757,0.000841,0.000816,0.000302,0.000326,0.000789,0.00083,0.000514,0.000495,0.001072,0.000888,0.000272,0.000433,0.000157,0.00017,0.000475,0.000293,0.000285,0.000241,0.00021,7.1e-05,0.000574,0.000268,0.000177,0.000208,0.000215,0.000412,0.000206,0.000518,0.000957,0.000588,0.000145,0.000297,0.000316,5.7e-05,9.8e-05,0.000203,0.000207,0.000272
8.6e-05,0.000194,0.000517,0.000317,0.000446,9.8e-05,4e-05,0.000148,0.000314,0.000455,9.4e-05,0.000377,0.000353,0.00031,0.000393,0.000244,0.000356,0.000283,0.000231,0.000121,9.4e-05,0.000101,0.000222,0.000222,0.000375,0.000453,4.3e-05,0.000167,0.000213,0.000332,0.000214,0.000315,0.000584,0.000342,0.000514,0.000476,0.000118,0.000275,0.000134,0.000157,0.000194,0.000273,0.000372,0.000292,0.000105,0.000506,0.000503,0.000277,0.000211,0.000154,0.000383,0.000277,0.000446,0.00023,0.000203,0.00021,0.000201,0.000154,0.000133,0.000257,0.000236,0.000417,0.000227,0.000276,0.000521,0.000205,0.000197,9.2e-05,0.000362,0.000453,0.000412,7.6e-05,0.000402,0.000179,0.000284,0.000196,0.000211,0.000152,5.3e-05,0.000412,0.000244,0.000265,0.000341,0.000332,0.000151,0.000145,0.00041,0.000155,0.00024,0.000164,0.000173,0.000423,0.000146,0.00021,0.000283,0.000431,0.000386,9.6e-05,0.000175,0.000125,0.000121,0.000285,0.000229,0.000231,0.000208,0.000133,0.000134,6.9e-05,7.1e-05,0.000309,0.000137,0.000392,0.000156,0.000222,0.000134,7e-05,9.1e-05,5.4e-05,0.000119,0.000196,0.000183
0.000189,0.00014,0.000189,0.000131,0.000159,0.000245,0.000263,0.000299,0.00026,6.3e-05,0.000168,0.000104,0.000132,0.000219,0.000244,0.000294,5.8e-05,0.000223,0.000223,0.00038,0.000371,0.000284,0.00024,0.000285,0.000141,0.000204,0.000137,9.2e-05,0.000129,8.3e-05,3.1e-05,0.000223,0.000435,5.6e-05,7e-05,0.000312,0.000289,0.000144,0.000142,0.000263,0.000202,0.000107,0.000231,0.000128,0.000245,0.000345,1e-04,0.000381,0.000145,5.6e-05,0.00028,5.4e-05,0.000181,0.00033,0.00014,0.000129,8.2e-05,0.000111,0.000222,0.000116,0.00012,0.000166,0.000258,0.000175,0.000166,0.000193,0.000264,2.7e-05,0.00019,8.5e-05,0.000164,9.6e-05,0.000334,0.000325,0.000237,0.000256,0.000292,0.000329,0.000322,4.4e-05,0.000121,0.000296,0.000154,0.000128,5.5e-05,0.000232,4.6e-05,0.000108,0.000122,0.000142,0.000267,9.7e-05,0.000121,0.000181,9.6e-05,0.000112,0.000145,0.000145,0.000171,0.000125,0.000129,0.000178,8.5e-05,7.7e-05,0.000169,0.000119,9.1e-05,6.9e-05,0.000146,0.000112,0.000111,0.00014,7.4e-05,0.000147,9.2e-05,0.000118,0.000142,4.9e-05,1.5e-05,2e-04,0.00013
2.8e-05,8.9e-05,0.00013,0.000135,0.000123,0.000213,0.000102,0.000167,5.3e-05,4.1e-05,8.7e-05,0.00023,0.000175,5.4e-05,4.2e-05,0.000159,0.000297,7.8e-05,3.5e-05,0.000301,0.000167,4.4e-05,0.00011,0.000266,0.000255,6.3e-05,0.00013,0.000109,0.000192,5.2e-05,4.8e-05,0.000199,7.1e-05,0.000267,0.000225,0.000133,8.3e-05,0.000375,6.8e-05,0.000161,4.1e-05,6.1e-05,0.000208,0.000124,0.000174,0.000196,7.2e-05,0.000184,8.9e-05,0.000118,0.000101,4.4e-05,0.000161,0.000177,7.2e-05,8.2e-05,3e-05,0.000119,6.3e-05,5.5e-05,0.00011,0.00017,0.000176,7.4e-05,0.000103,0.000123,7.7e-05,0.000141,2.9e-05,6.6e-05,3.9e-05,9.7e-05,0.000109,0.000225,8e-05,0.00027,2.1e-05,0.000103,0.000174,0.00011,8e-05,5.9e-05,9.5e-05,0.000155,0.000185,6.3e-05,0.000199,7.6e-05,9.2e-05,4.7e-05,0.000109,0.000162,0.000129,0.000219,6.8e-05,7.8e-05,9e-05,3.8e-05,0.000159,0.000119,0.00012,6.7e-05,9.4e-05,0.000149,0.000121,2.4e-05,7.7e-05,3.7e-05,0.00014,9.4e-05,0.000129,8.1e-05,5e-05,5.7e-05,3.9e-05,0.000113,7.4e-05,7.8e-05,9.1e-05,0.000123,0.000144
6.1e-05,7e-06,2.3e-05,0.000104,6.8e-05,8.4e-05,8.1e-05,2.8e-05,3.4e-05,3.5e-05,4.7e-05,0.000102,5.9e-05,3.8e-05,2.6e-05,7.1e-05,0.000114,9.3e-05,4.7e-05,0.000105,0.000103,5.5e-05,2.4e-05,0.000141,5.5e-05,3.1e-05,4e-05,2.1e-05,4e-05,2.2e-05,3.6e-05,5e-05,2.9e-05,0.000128,3.2e-05,1.5e-05,5.9e-05,0.000123,9.4e-05,9.9e-05,1.7e-05,3.6e-05,9.1e-05,6e-05,6.1e-05,0.000106,1.9e-05,2.6e-05,7.2e-05,4.7e-05,0.000106,4.6e-05,7.8e-05,8.9e-05,6.6e-05,5.4e-05,4.7e-05,3.9e-05,2e-05,2.3e-05,6.5e-05,0.000101,6.2e-05,3e-05,3.3e-05,6e-05,3.8e-05,4.7e-05,3.3e-05,4.5e-05,2.2e-05,5.1e-05,0.000103,1.3e-05,3.9e-05,0.000105,3.3e-05,2.9e-05,3.9e-05,6.6e-05,4.5e-05,8.2e-05,8e-05,1.9e-05,7.8e-05,4.1e-05,0.000104,6.3e-05,4.4e-05,1.3e-05,4.2e-05,9.2e-05,4.9e-05,5.6e-05,1e-05,6.2e-05,5.3e-05,1.3e-05,4.7e-05,2.5e-05,3e-05,3.1e-05,6.2e-05,7.7e-05,1.9e-05,1.9e-05,3.3e-05,2.1e-05,1.7e-05,3.8e-05,6e-06,6.2e-05,3.2e-05,4.2e-05,2.7e-05,2.5e-05,9e-06,2.2e-05,2.9e-05,7.7e-05,3.6e-05
8e-06,3.2e-05,3e-05,8e-05,5.8e-05,5.6e-05,4.2e-05,1.8e-05,5.4e-05,5.6e-05,5e-06,0.000106,7.3e-05,4.9e-05,4e-05,3.4e-05,2.3e-05,6.4e-05,3.6e-05,3.1e-05,7.9e-05,3.8e-05,4.2e-05,0.000126,7.2e-05,3e-05,2.7e-05,4.1e-05,3.3e-05,3.8e-05,1.3e-05,3e-05,2.6e-05,6.5e-05,4.1e-05,3.8e-05,2.9e-05,7.3e-05,7e-05,3.1e-05,2.2e-05,2.3e-05,5.5e-05,1.8e-05,9.7e-05,5.5e-05,3.6e-05,9.3e-05,4.1e-05,7.3e-05,8e-06,1.1e-05,5.3e-05,4.4e-05,2.1e-05,4.5e-05,2.9e-05,4.7e-05,3.6e-05,2.4e-05,2.4e-05,8.1e-05,4.2e-05,1.5e-05,7.2e-05,1.3e-05,5e-05,7.6e-05,8.5e-05,4.1e-05,3.6e-05,5.6e-05,0.000105,7.2e-05,5.4e-05,1.9e-05,5.7e-05,2.8e-05,7.1e-05,2.2e-05,1.8e-05,0.000103,1.6e-05,2.9e-05,2e-05,3.3e-05,5.3e-05,2.1e-05,4.9e-05,2e-05,5.4e-05,7.4e-05,1.9e-05,8.5e-05,3.7e-05,3.7e-05,2.2e-05,1.4e-05,3.4e-05,2.4e-05,1.8e-05,1.5e-05,2.7e-05,4.7e-05,2.2e-05,8e-06,2.4e-05,1.9e-05,1.8e-05,4.2e-05,1.5e-05,4.2e-05,1.1e-05,2.3e-05,3.3e-05,2e-05,1e-05,2.1e-05,3.7e-05,5.1e-05,1e-06
1.3e-05,3.5e-05,3.3e-05,3.5e-05,2.5e-05,6.9e-05,1.5e-05,6e-05,4.1e-05,2e-05,2.1e-05,8.6e-05,2.1e-05,6.1e-05,2.2e-05,6e-06,5.2e-05,5.2e-05,8e-06,3e-06,3e-05,2.9e-05,1.3e-05,0.000111,2.1e-05,3.8e-05,9e-06,3.7e-05,2.7e-05,2.1e-05,1.4e-05,4.9e-05,5.8e-05,2.6e-05,3.1e-05,4.4e-05,4e-05,9.2e-05,2.1e-05,3.4e-05,1.2e-05,7e-06,4.5e-05,4.1e-05,5.8e-05,6.5e-05,3.1e-05,5.8e-05,1.3e-05,3.8e-05,2.4e-05,1.7e-05,3.9e-05,2.6e-05,1.5e-05,6.1e-05,1.4e-05,9e-06,2.4e-05,3.1e-05,2.2e-05,1.3e-05,5.6e-05,3.1e-05,5.5e-05,4.4e-05,3.8e-05,2.7e-05,2.8e-05,1e-05,2e-05,2.9e-05,4.1e-05,4.7e-05,2.8e-05,4.9e-05,3e-05,2.8e-05,5.3e-05,2.2e-05,4.1e-05,5.8e-05,1.3e-05,4.2e-05,1.8e-05,2.3e-05,1.7e-05,2.1e-05,4.9e-05,3.7e-05,4.4e-05,2.1e-05,1.7e-05,6.3e-05,4e-05,6.8e-05,3.8e-05,2.7e-05,1.5e-05,2.1e-05,1.7e-05,2.3e-05,2.8e-05,5.6e-05,3e-06,3.8e-05,1.1e-05,1.3e-05,2.9e-05,3.6e-05,2.3e-05,3.6e-05,5e-06,1.8e-05,1e-05,2.1e-05,1e-05,1.7e-05,3.9e-05,5.1e-05,3e-06
2.4e-05,9e-06,1.9e-05,1.9e-05,1.6e-05,3.9e-05,2e-05,5.1e-05,2.7e-05,1.2e-05,1.2e-05,5.8e-05,2.9e-05,1.9e-05,2.4e-05,2e-05,6.3e-05,2.1e-05,1.5e-05,1e-05,3.1e-05,1.7e-05,1.8e-05,8.2e-05,2.7e-05,1.4e-05,1e-05,2.4e-05,1.6e-05,1.6e-05,8e-06,2.7e-05,3e-05,2.1e-05,3e-05,4.6e-05,2.8e-05,6.5e-05,3.1e-05,2.9e-05,1.2e-05,8e-06,3.4e-05,2.2e-05,5.7e-05,4.9e-05,1e-05,4.2e-05,8e-06,2.6e-05,3.1e-05,3.3e-05,3e-05,2.6e-05,1.2e-05,2.2e-05,9e-06,1.1e-05,3e-06,2.1e-05,4.3e-05,2.2e-05,3.9e-05,1.8e-05,1.5e-05,7e-06,3.3e-05,1.6e-05,3e-06,2.2e-05,1.4e-05,2.3e-05,4.2e-05,3.2e-05,3.4e-05,3.9e-05,2.4e-05,1e-05,5e-05,1.9e-05,2.9e-05,5.1e-05,2.7e-05,3.9e-05,3.4e-05,1.5e-05,1.9e-05,1.2e-05,2.5e-05,2.6e-05,1.7e-05,3.5e-05,2.1e-05,3.4e-05,6e-06,4.1e-05,2.4e-05,2e-05,1.5e-05,1.3e-05,7e-06,1.7e-05,2.6e-05,4.6e-05,1.5e-05,3.2e-05,1.3e-05,1.6e-05,3.4e-05,1.5e-05,1e-05,2.8e-05,1.1e-05,8e-06,1.8e-05,7e-06,3e-06,1.2e-05,4.2e-05,3.9e-05,1.7e-05
2.4e-05,8e-06,1.6e-05,2.6e-05,3.3e-05,5.4e-05,1.7e-05,3.9e-05,2.9e-05,2.5e-05,3.3e-05,5.9e-05,2.4e-05,3.4e-05,2.1e-05,2.4e-05,3.6e-05,1.3e-05,1e-05,9e-06,1.8e-05,1.7e-05,3.1e-05,7.6e-05,1.2e-05,3.2e-05,2.2e-05,2e-05,6e-06,1.7e-05,1.1e-05,1.9e-05,1.1e-05,3.6e-05,2.2e-05,4.2e-05,1.3e-05,6.5e-05,1.2e-05,3e-05,3e-06,1.2e-05,1.7e-05,2.8e-05,4.9e-05,4.4e-05,2e-06,2.6e-05,1.1e-05,2.9e-05,4.8e-05,1e-05,1e-05,2.1e-05,1.6e-05,4.2e-05,4e-06,8e-06,2.1e-05,3.3e-05,3.6e-05,3.3e-05,3.5e-05,2.3e-05,4.4e-05,1.5e-05,4.2e-05,8e-06,1e-05,0,1.5e-05,1.3e-05,4.6e-05,2.7e-05,2.6e-05,4.3e-05,2.2e-05,1.2e-05,2.9e-05,1.1e-05,2.6e-05,5.8e-05,1.2e-05,3e-05,1.9e-05,1.9e-05,2.8e-05,2.4e-05,3.4e-05,2.1e-05,1e-05,2.7e-05,2.2e-05,3.2e-05,7e-06,3.2e-05,1.3e-05,9e-06,1.7e-05,7e-06,1.1e-05,8e-06,3.1e-05,3.4e-05,1.4e-05,1.6e-05,4e-06,1.8e-05,2.6e-05,2.8e-05,1.2e-05,2.1e-05,7e-06,9e-06,6e-06,6e-06,7e-06,7e-06,3e-05,3.1e-05,7e-06
7e-06,2.1e-05,2.5e-05,3e-05,3.5e-05,4.1e-05,8e-06,2.9e-05,4.1e-05,7e-06,1.7e-05,4.7e-05,2.4e-05,3.5e-05,2.8e-05,1.4e-05,3.1e-05,3.1e-05,9e-06,9e-06,1.4e-05,1.9e-05,2e-05,6.6e-05,1.9e-05,1.8e-05,2.3e-05,8e-06,2.1e-05,1.3e-05,1.1e-05,2.3e-05,2.6e-05,3.8e-05,1.7e-05,4.8e-05,7e-06,4.6e-05,2e-05,3e-05,1.4e-05,7e-06,1.5e-05,1.3e-05,5e-05,3.9e-05,6e-06,3e-05,1.5e-05,2.1e-05,2.9e-05,2.1e-05,1.8e-05,2.3e-05,1.4e-05,3.1e-05,4e-06,1.5e-05,3.2e-05,1.8e-05,1e-05,3.1e-05,1.6e-05,1.3e-05,3.7e-05,1.4e-05,3.7e-05,1.1e-05,1.6e-05,9e-06,1.5e-05,1.6e-05,2.1e-05,4e-05,1.7e-05,4e-05,1.8e-05,2.2e-05,3e-05,2e-05,2.5e-05,3.8e-05,1.1e-05,3.3e-05,2.4e-05,1.2e-05,2.9e-05,2.1e-05,1.6e-05,1.3e-05,1.7e-05,2.4e-05,1.4e-05,3.4e-05,1.2e-05,3.1e-05,2.3e-05,1e-05,1.6e-05,4e-06,9e-06,1.2e-05,2.3e-05,4.1e-05,5e-06,2.2e-05,1e-05,6e-06,2e-05,1.6e-05,1.8e-05,1.9e-05,5e-06,1.5e-05,1.1e-05,5e-06,4e-06,8e-06,3.3e-05,2.7e-05,8e-06
5e-06,2e-05,1.6e-05,2.3e-05,2e-05,3.7e-05,5e-06,2e-05,2.4e-05,4e-06,1.8e-05,4.8e-05,2.6e-05,1.9e-05,2.4e-05,1.2e-05,2.3e-05,8e-06,2.1e-05,1e-05,1.2e-05,2.6e-05,2e-05,7.4e-05,3.1e-05,9e-06,2.8e-05,2.3e-05,1.5e-05,1.1e-05,9e-06,2.1e-05,1.8e-05,3.1e-05,1.5e-05,2.6e-05,1.1e-05,5e-05,2.7e-05,3.5e-05,1.1e-05,7e-06,1.8e-05,8e-06,3.4e-05,5.1e-05,3e-06,3.2e-05,1.3e-05,2e-05,2.1e-05,1.4e-05,1.8e-05,1.3e-05,1.6e-05,2.6e-05,1.7e-05,1.1e-05,2.3e-05,2.4e-05,3e-05,3.3e-05,2.2e-05,2.6e-05,2.4e-05,1.6e-05,4.3e-05,6e-06,1.8e-05,1.2e-05,1.4e-05,1.9e-05,2.1e-05,2.8e-05,2.2e-05,3.7e-05,8e-06,1.5e-05,2.3e-05,1.2e-05,1.4e-05,4e-05,1.4e-05,1.7e-05,1.9e-05,1.7e-05,2.1e-05,9e-06,1.5e-05,2.5e-05,1.6e-05,2.9e-05,1e-05,3.9e-05,1e-06,3.1e-05,2.7e-05,1e-05,8e-06,6e-06,2e-06,1.4e-05,1.5e-05,3.1e-05,6e-06,2e-05,4e-06,1.2e-05,1.1e-05,3.5e-05,1e-05,2.4e-05,1.7e-05,3e-06,1.2e-05,5e-06,6e-06,6e-06,2.5e-05,1.8e-05,1e-06
2.2e-05,8e-06,2.3e-05,3.4e-05,2.6e-05,1.2e-05,2.2e-05,3.2e-05,2.4e-05,1.2e-05,9e-06,5.3e-05,2.4e-05,4e-05,1.4e-05,1.4e-05,3e-05,1.2e-05,2.7e-05,6e-06,1.7e-05,2.6e-05,1.8e-05,7.7e-05,1.9e-05,1e-05,1.4e-05,9e-06,5e-06,1.4e-05,2.1e-05,5e-06,1.6e-05,3.5e-05,1.7e-05,4.6e-05,8e-06,2.8e-05,3e-05,3.2e-05,1.7e-05,9e-06,1.2e-05,1.5e-05,4.6e-05,4.4e-05,1e-05,2.1e-05,1.6e-05,3e-05,2.1e-05,1.2e-05,1.8e-05,1.6e-05,2.3e-05,8e-06,2.1e-05,2.4e-05,1.4e-05,1.7e-05,2.8e-05,2.7e-05,5e-06,2.6e-05,2.8e-05,3.1e-05,2e-05,2.7e-05,2.6e-05,1.4e-05,1.3e-05,1.9e-05,2.3e-05,3.5e-05,1.2e-05,2.7e-05,5e-06,2e-05,3.1e-05,1.5e-05,2.9e-05,3.4e-05,1.8e-05,7e-06,3.5e-05,8e-06,1.8e-05,2.3e-05,2.2e-05,7e-06,1.6e-05,3.2e-05,2.2e-05,3.3e-05,1.5e-05,4.5e-05,2.7e-05,1.2e-05,5e-06,1.7e-05,1.5e-05,7e-06,2.8e-05,2.6e-05,1.3e-05,1.1e-05,6e-06,8e-06,1.5e-05,2.7e-05,2.3e-05,2.2e-05,2.1e-05,1.7e-05,2.5e-05,1.8e-05,1.5e-05,9e-06,2e-05,9e-06,1.6e-05
1.7e-05,1.3e-05,2.8e-05,1.4e-05,5.2e-05,5.1e-05,1.9e-05,1.1e-05,2.4e-05,1.5e-05,1.7e-05,4.4e-05,4.2e-05,1.4e-05,2.2e-05,8e-06,2.8e-05,1.2e-05,1.6e-05,1.8e-05,3.4e-05,4.2e-05,4.5e-05,5.4e-05,4.8e-05,6e-06,2.4e-05,1.5e-05,1.7e-05,1.8e-05,7e-06,2.3e-05,3.7e-05,3.7e-05,2.8e-05,3.2e-05,2.7e-05,3.3e-05,1.5e-05,1e-05,3e-06,2e-06,1.1e-05,7e-06,5.8e-05,3e-05,2.1e-05,1.1e-05,2e-06,2.4e-05,3.1e-05,1.3e-05,9e-06,2e-05,8e-06,1.9e-05,2.1e-05,1.3e-05,8e-06,2.7e-05,4.3e-05,2.5e-05,8e-06,7e-06,3.3e-05,9e-06,2.6e-05,4e-05,3.4e-05,3.5e-05,2e-05,2.8e-05,4.4e-05,2.8e-05,6e-06,3.6e-05,1.4e-05,2.4e-05,4.4e-05,2.2e-05,4.1e-05,4.7e-05,2.3e-05,3.1e-05,1.7e-05,3e-06,7e-06,2e-05,2.9e-05,1.7e-05,9e-06,1.5e-05,1.5e-05,2.8e-05,1.4e-05,3.2e-05,2.4e-05,1.2e-05,1.1e-05,1.9e-05,1.4e-05,1.8e-05,1.6e-05,3.4e-05,8e-06,2e-05,5e-06,3e-06,1.6e-05,2.1e-05,2e-05,8e-06,1e-05,1.2e-05,1.2e-05,2.4e-05,1.2e-05,4e-06,2.3e-05,1.6e-05,1.3e-05
7e-06,2.7e-05,3.7e-05,2.1e-05,2.2e-05,4.2e-05,3.8e-05,1.1e-05,3.4e-05,2.1e-05,4e-06,2.3e-05,4.4e-05,2.5e-05,1.2e-05,2.7e-05,3.1e-05,7e-06,3e-06,7e-06,2.9e-05,4e-06,3e-06,3.3e-05,3.7e-05,5.1e-05,1.3e-05,8e-06,1.2e-05,6e-06,2.4e-05,8e-06,3.9e-05,3.2e-05,2.5e-05,6.7e-05,3.9e-05,4.8e-05,2.9e-05,1.8e-05,1e-05,2.4e-05,2.4e-05,1.1e-05,3.4e-05,4.8e-05,1.2e-05,3.1e-05,5e-06,3.2e-05,1.4e-05,1.2e-05,1.3e-05,2.7e-05,1.9e-05,1.4e-05,3.8e-05,1.7e-05,6e-06,4e-06,4.3e-05,2.5e-05,4e-05,2e-05,1e-05,1.5e-05,3.6e-05,4.6e-05,9e-06,3.1e-05,1.1e-05,2.3e-05,1.7e-05,2.3e-05,1.6e-05,3e-05,2.2e-05,3.2e-05,2.7e-05,3.3e-05,1e-05,4.6e-05,2.7e-05,1.5e-05,3e-05,6e-06,2e-05,1.6e-05,3.2e-05,1.7e-05,2.9e-05,1.7e-05,1.3e-05,2e-05,2.2e-05,3e-05,2.5e-05,1.9e-05,2.1e-05,1.5e-05,2.8e-05,2.6e-05,2.2e-05,2.7e-05,1.2e-05,3.1e-05,1.3e-05,1.8e-05,1.4e-05,3e-05,1.8e-05,9e-06,7e-06,8e-06,1.4e-05,1.9e-05,5e-06,7e-06,2.4e-05,2.3e-05,5e-06
4.7e-05,7e-05,2.8e-05,3.5e-05,5.2e-05,7.8e-05,4.4e-05,5.5e-05,4.5e-05,7e-06,1.1e-05,4.7e-05,4.1e-05,2e-05,3.5e-05,4.9e-05,5.9e-05,1.5e-05,1.4e-05,1.5e-05,1.5e-05,1.2e-05,1.8e-05,4.1e-05,2.6e-05,4.7e-05,2.8e-05,1.3e-05,2.4e-05,3.1e-05,4e-05,3.8e-05,1.5e-05,5.1e-05,2.5e-05,2e-05,2e-05,4.9e-05,1.2e-05,2.7e-05,2.7e-05,1.8e-05,4.5e-05,2.9e-05,4e-06,8e-06,3.5e-05,4.3e-05,2e-05,3.4e-05,6.6e-05,3.8e-05,3.3e-05,2.6e-05,1e-05,3.2e-05,3.7e-05,3.4e-05,1.7e-05,8e-06,4.3e-05,2.8e-05,5e-05,2.7e-05,1.4e-05,9e-06,3.6e-05,3.2e-05,2.9e-05,1.7e-05,2.7e-05,3.1e-05,3.6e-05,3e-05,2.5e-05,2.8e-05,1.6e-05,5e-06,2.8e-05,3e-05,1e-05,8.5e-05,2.4e-05,1.1e-05,5e-05,3.5e-05,2.8e-05,1.1e-05,2.2e-05,7e-06,4.2e-05,1.3e-05,1.8e-05,2.6e-05,2.3e-05,3.4e-05,3.3e-05,3.5e-05,6e-06,3e-05,1.6e-05,1.1e-05,8e-06,2.6e-05,1.6e-05,3.7e-05,4.2e-05,1.7e-05,5e-06,1.4e-05,1.5e-05,2.3e-05,8e-06,7e-06,8e-06,1.1e-05,1e-05,6e-06,1.6e-05,1.2e-05,1.3e-05
2.9e-05,1.7e-05,6e-06,5.8e-05,3.6e-05,5.1e-05,9e-06,1.9e-05,2.3e-05,2.9e-05,2.5e-05,3.7e-05,4.9e-05,1.1e-05,3.9e-05,5.4e-05,3.4e-05,2.7e-05,2.8e-05,4e-05,5e-05,2.7e-05,3.7e-05,4.8e-05,3.5e-05,2.6e-05,1.2e-05,1.4e-05,3.9e-05,3.8e-05,1.2e-05,1.8e-05,1.9e-05,3.5e-05,5.9e-05,3.9e-05,2.8e-05,2.2e-05,8e-06,5.9e-05,3.6e-05,5.1e-05,1.7e-05,1.5e-05,2.8e-05,3.9e-05,9e-06,1.1e-05,2.5e-05,5e-05,3.5e-05,1e-05,1.3e-05,9e-06,1.3e-05,1.2e-05,3e-05,3.8e-05,3.4e-05,3.7e-05,1e-05,3.1e-05,4e-05,2.9e-05,4.6e-05,2.5e-05,2.7e-05,2.4e-05,3.7e-05,4.3e-05,1e-05,8e-06,1.2e-05,2.8e-05,3.4e-05,5e-06,2.7e-05,3.6e-05,4.2e-05,9e-06,6e-06,7.3e-05,4e-05,3e-06,3.3e-05,2.4e-05,1.8e-05,2.5e-05,3.1e-05,5.3e-05,1e-05,3.4e-05,2.5e-05,2.8e-05,3.2e-05,5.5e-05,3.7e-05,4e-05,3.9e-05,3.5e-05,3.1e-05,1.5e-05,1.2e-05,1.1e-05,3e-06,4.4e-05,3e-05,1.1e-05,1.3e-05,1e-05,7e-06,2.5e-05,1.3e-05,1.2e-05,2e-05,1.7e-05,8e-06,7e-06,1.1e-05,2.8e-05,6e-06
9e-06,6e-06,1.3e-05,4.3e-05,1.7e-05,2.5e-05,1.3e-05,1.8e-05,2.3e-05,2.3e-05,2.5e-05,3.7e-05,3.4e-05,3e-06,2.1e-05,1.8e-05,1e-05,2.8e-05,2.7e-05,3e-05,1.5e-05,2e-05,2.4e-05,3.5e-05,3.4e-05,3e-06,6e-06,1.8e-05,2.1e-05,1.2e-05,9e-06,1.1e-05,2.2e-05,1.1e-05,1.1e-05,1.5e-05,1e-05,3.6e-05,3e-05,4.3e-05,1.2e-05,2.3e-05,3.3e-05,2.5e-05,1.5e-05,3.6e-05,2.5e-05,1.1e-05,2e-05,2e-05,1.9e-05,1.6e-05,6e-06,1.3e-05,1.2e-05,1.6e-05,9e-06,2.1e-05,3e-06,2.9e-05,1.2e-05,2e-05,1.9e-05,1.1e-05,2.2e-05,1.5e-05,2.8e-05,1.1e-05,1.3e-05,1.1e-05,1.6e-05,9e-06,8e-06,1.9e-05,1.1e-05,2.4e-05,2e-05,1.2e-05,4.4e-05,1.2e-05,4e-06,4.1e-05,3e-05,2.7e-05,1.1e-05,7e-06,3e-05,1.5e-05,2.1e-05,2.5e-05,1e-05,4.6e-05,2.2e-05,2.7e-05,1.8e-05,4.2e-05,2.2e-05,1.2e-05,1.7e-05,1.3e-05,5e-06,1.3e-05,3.3e-05,3.9e-05,1.1e-05,3e-05,7e-06,1.5e-05,1.1e-05,5e-06,1.3e-05,1.8e-05,4e-06,5e-06,8e-06,1e-05,1e-05,1.4e-05,1.7e-05,2.7e-05,5e-06
6e-06,2.4e-05,1e-05,2.2e-05,1.4e-05,3e-05,3e-06,1.8e-05,1e-05,1.6e-05,9e-06,3.5e-05,1.4e-05,1.2e-05,4e-06,2.5e-05,3.5e-05,8e-06,2.3e-05,2.2e-05,2.3e-05,1.7e-05,1.1e-05,4.8e-05,1.9e-05,1.6e-05,1e-05,2e-06,2.1e-05,1.5e-05,9e-06,2e-06,1.1e-05,2e-05,1.2e-05,2.7e-05,7e-06,4.5e-05,1.5e-05,4.2e-05,1.3e-05,2.1e-05,1.3e-05,5e-06,1.8e-05,2.2e-05,1.6e-05,1.7e-05,2.6e-05,2.4e-05,9e-06,1.1e-05,3e-06,1.1e-05,9e-06,1.3e-05,5e-06,1.4e-05,1.2e-05,1.9e-05,9e-06,9e-06,2e-05,5e-06,2.1e-05,1.4e-05,1.5e-05,1e-05,1e-05,5e-06,5e-06,6e-06,1.5e-05,3.1e-05,1.6e-05,3.7e-05,1.7e-05,1.7e-05,3.6e-05,1.4e-05,6e-06,2.1e-05,8e-06,2.6e-05,1.4e-05,8e-06,2.3e-05,1.5e-05,2e-05,1.9e-05,1.9e-05,3.4e-05,1.3e-05,1.6e-05,8e-06,3.9e-05,1.3e-05,1.2e-05,1.2e-05,1.3e-05,1.3e-05,1.1e-05,2.6e-05,3.5e-05,7e-06,1.3e-05,6e-06,9e-06,1.4e-05,1.2e-05,1.3e-05,1.5e-05,5e-06,1.1e-05,1.2e-05,3e-06,1.2e-05,2e-06,2.2e-05,2.2e-05,2e-06
2e-05,1e-05,4e-06,3.8e-05,2.4e-05,3.5e-05,9e-06,1e-05,2.1e-05,1.9e-05,8e-06,2.2e-05,1.8e-05,1.3e-05,6e-06,1.4e-05,2.3e-05,9e-06,6e-06,1e-05,1.3e-05,1.4e-05,2e-06,2.3e-05,2.2e-05,1.3e-05,2.3e-05,1.7e-05,2.3e-05,1.8e-05,1.8e-05,5e-06,1.7e-05,2.3e-05,1e-06,1.6e-05,1.2e-05,3.9e-05,1.5e-05,3.2e-05,1.8e-05,1.5e-05,1.7e-05,2e-06,2.3e-05,3.6e-05,4e-06,1.9e-05,1.4e-05,1.9e-05,9e-06,1e-06,8e-06,2e-05,1.8e-05,1.9e-05,5e-06,1e-05,1.8e-05,1e-05,5e-06,2.5e-05,2.2e-05,1.7e-05,1.4e-05,8e-06,1.4e-05,1.3e-05,1.5e-05,1.5e-05,2e-05,1.1e-05,5e-06,2.1e-05,1.9e-05,1.5e-05,1.2e-05,5e-06,3.7e-05,2.7e-05,9e-06,1.5e-05,1.1e-05,1.6e-05,2.1e-05,6e-06,1.2e-05,1.4e-05,2.9e-05,1.3e-05,1.6e-05,2e-05,1.4e-05,3e-05,1e-06,2.6e-05,1.4e-05,1e-05,2.3e-05,7e-06,1e-06,9e-06,1.7e-05,2.2e-05,1e-05,1.2e-05,1.5e-05,1.6e-05,1.4e-05,1.1e-05,2e-06,1.7e-05,5e-06,1.6e-05,6e-06,4e-06,1.5e-05,1e-05,1.9e-05,2.6e-05,4e-06
2e-05,7e-06,5e-06,3.1e-05,1.5e-05,2.5e-05,4e-06,2.4e-05,3.9e-05,3.4e-05,1.6e-05,2.9e-05,3.1e-05,1.8e-05,1.1e-05,1.3e-05,2.4e-05,1.2e-05,2.3e-05,2.4e-05,2.6e-05,1.1e-05,2.2e-05,4.4e-05,4.5e-05,2.6e-05,1.6e-05,1.1e-05,2.9e-05,9e-06,1.8e-05,2.2e-05,1.2e-05,3.3e-05,1.8e-05,1.9e-05,2e-05,4.3e-05,1.3e-05,3e-05,1.3e-05,1.3e-05,2.4e-05,2e-06,3.3e-05,2.5e-05,1e-05,2.2e-05,9e-06,2e-05,1.6e-05,1.1e-05,2e-06,2.2e-05,1.3e-05,1.8e-05,6e-06,1.5e-05,1.3e-05,2.6e-05,2.4e-05,2.4e-05,2.4e-05,1.7e-05,2.7e-05,1.1e-05,1.8e-05,1e-05,2e-06,1e-05,6e-06,5e-06,1.4e-05,4e-05,8e-06,2.2e-05,3e-05,3.1e-05,2.7e-05,1.6e-05,4e-06,3.3e-05,8e-06,2.6e-05,1.8e-05,1.6e-05,2.3e-05,1.9e-05,1.2e-05,2.6e-05,9e-06,5e-06,6e-06,1.3e-05,1e-05,1.6e-05,1.2e-05,1.2e-05,2.1e-05,1.3e-05,1.2e-05,3e-06,8e-06,2.9e-05,2e-06,9e-06,1e-05,3e-06,1.4e-05,1.8e-05,1.9e-05,1.5e-05,7e-06,8e-06,1.8e-05,4e-06,1.2e-05,8e-06,1.5e-05,2.2e-05,1.3e-05
2.1e-05,2.3e-05,1.4e-05,3.8e-05,8e-06,2.5e-05,1e-06,2.4e-05,3.2e-05,1.1e-05,8e-06,2.7e-05,2.4e-05,1.7e-05,1.1e-05,6e-06,2.6e-05,1.5e-05,2e-05,1e-05,6e-06,9e-06,2.8e-05,4.8e-05,2e-05,2e-06,1.6e-05,4e-06,1.7e-05,9e-06,2.2e-05,1.5e-05,1.4e-05,2.5e-05,1.1e-05,3.3e-05,6e-06,3.7e-05,1e-05,1.9e-05,1.7e-05,1.1e-05,1.4e-05,3e-06,3.9e-05,3.2e-05,8e-06,6e-06,8e-06,2.1e-05,1.1e-05,1.1e-05,2e-06,1.4e-05,2e-06,1.3e-05,7e-06,2.2e-05,7e-06,1.5e-05,2e-05,2.2e-05,3.2e-05,2.1e-05,2e-05,1e-05,2.6e-05,8e-06,5e-06,7e-06,6e-06,4e-06,2.2e-05,1.4e-05,2.9e-05,4.2e-05,1.7e-05,2.1e-05,3.1e-05,1.4e-05,4e-06,3.3e-05,2e-06,2.4e-05,4e-06,8e-06,2.3e-05,7e-06,1.5e-05,9e-06,1.8e-05,1.3e-05,1.6e-05,2e-05,7e-06,2.1e-05,7e-06,8e-06,2e-05,4e-06,7e-06,5e-06,9e-06,2.4e-05,1.3e-05,1.6e-05,4e-06,5e-06,1.2e-05,1.4e-05,1.2e-05,7e-06,7e-06,1.1e-05,1.5e-05,3e-06,7e-06,7e-06,1.3e-05,1e-05,6e-06
7e-06,1.2e-05,1e-05,2.8e-05,9e-06,3e-05,9e-06,1.5e-05,2.2e-05,6e-06,1.6e-05,3.2e-05,2.2e-05,5e-06,6e-06,1.1e-05,2.1e-05,1.5e-05,1.9e-05,5e-06,1.9e-05,5e-06,1.7e-05,5.2e-05,1.3e-05,1.2e-05,8e-06,1e-06,1.7e-05,9e-06,3e-06,1.3e-05,1.8e-05,2e-05,1e-05,3.3e-05,1.1e-05,3.5e-05,1e-05,2.7e-05,1e-05,0,7e-06,3e-06,3.3e-05,2.7e-05,8e-06,1.1e-05,1e-05,1.2e-05,1.6e-05,1e-06,5e-06,1.2e-05,2e-06,1.2e-05,7e-06,1.4e-05,1.2e-05,1.6e-05,1.6e-05,1.7e-05,2.8e-05,9e-06,2.3e-05,3e-06,2e-05,5e-06,1e-05,2e-06,7e-06,3e-06,2.1e-05,1.1e-05,2.2e-05,3.2e-05,5e-06,2.4e-05,1.8e-05,8e-06,7e-06,3.2e-05,6e-06,1.9e-05,1.1e-05,8e-06,2.3e-05,4e-06,1.1e-05,1.5e-05,1.4e-05,1.1e-05,1.8e-05,1.8e-05,3e-06,1.6e-05,1.3e-05,2e-06,1.2e-05,5e-06,5e-06,2e-06,1.6e-05,1.5e-05,1e-06,1.4e-05,1e-06,7e-06,1.4e-05,7e-06,7e-06,1.2e-05,4e-06,4e-06,7e-06,5e-06,4e-06,1e-06,1.3e-05,1.5e-05,5e-06
5e-06,1.4e-05,7e-06,2.9e-05,1.2e-05,3.2e-05,4e-06,1.5e-05,2.4e-05,3e-06,1.1e-05,2.8e-05,2.6e-05,8e-06,8e-06,1e-05,2.5e-05,1.2e-05,1.8e-05,5e-06,1.6e-05,5e-06,1.7e-05,4.9e-05,1.2e-05,1e-05,4e-06,7e-06,2.1e-05,1e-06,5e-06,1.1e-05,1.4e-05,2e-05,1e-06,2.2e-05,7e-06,3.7e-05,1.1e-05,2.9e-05,7e-06,4e-06,1.3e-05,2e-06,3e-05,2.5e-05,2e-06,8e-06,6e-06,1.2e-05,8e-06,3e-06,2e-06,6e-06,5e-06,1.9e-05,3e-06,1.1e-05,5e-06,1.4e-05,1.8e-05,1.9e-05,2.5e-05,6e-06,2.4e-05,2e-06,2.1e-05,5e-06,8e-06,4e-06,8e-06,2e-06,1.9e-05,1.9e-05,2.1e-05,3.1e-05,4e-06,2e-05,2.4e-05,1.3e-05,8e-06,2.6e-05,4e-06,1.8e-05,1.2e-05,7e-06,1.9e-05,8e-06,1.2e-05,1.7e-05,1e-05,1.1e-05,1.8e-05,2.2e-05,1e-06,1.2e-05,1e-05,3e-06,1.3e-05,8e-06,3e-06,3e-06,1.9e-05,1.8e-05,5e-06,1.1e-05,2e-06,6e-06,1.3e-05,6e-06,7e-06,1.2e-05,3e-06,3e-06,9e-06,2e-06,1e-06,3e-06,1.5e-05,1.8e-05,3e-06
7e-06,1.3e-05,3e-06,2.9e-05,9e-06,2.7e-05,6e-06,1.5e-05,1.9e-05,5e-06,8e-06,2.9e-05,2.6e-05,1e-05,4e-06,1.3e-05,2.2e-05,1.1e-05,1.5e-05,6e-06,1.4e-05,1e-05,1.5e-05,5e-05,1.2e-05,1.1e-05,8e-06,1e-06,2.1e-05,3e-06,4e-06,1.3e-05,1.3e-05,2e-05,5e-06,2.4e-05,8e-06,3.4e-05,1.1e-05,2.6e-05,9e-06,3e-06,1.2e-05,1e-06,3e-05,2.5e-05,3e-06,9e-06,7e-06,1.2e-05,8e-06,6e-06,4e-06,7e-06,4e-06,1.5e-05,3e-06,1.4e-05,5e-06,1.4e-05,1.7e-05,1.6e-05,2.7e-05,8e-06,2.4e-05,2e-06,2e-05,7e-06,5e-06,1e-06,8e-06,1e-06,1.7e-05,1.8e-05,2.3e-05,3.2e-05,3e-06,1.8e-05,2.1e-05,1.3e-05,7e-06,2.5e-05,2e-06,1.9e-05,1.1e-05,6e-06,1.7e-05,7e-06,1.3e-05,1.6e-05,1.1e-05,1.4e-05,1.5e-05,2e-05,2e-06,1.9e-05,1.2e-05,2e-06,1.3e-05,5e-06,2e-06,1e-06,1.8e-05,2e-05,2e-06,1.2e-05,2e-06,7e-06,1.3e-05,6e-06,5e-06,1.2e-05,1e-06,3e-06,9e-06,2e-06,1e-06,3e-06,1.7e-05,1.7e-05,4e-06
