0.004915,0.004295,0.004319,0.004826,0.004912,0.004558,0.004252,0.004452,0.00502,0.005592,0.005745,0.005122,0.004453,0.004759,0.005092,0.004679,0.00476,0.005553,0.005007,0.003881,0.004051,0.004274,0.004183,0.004488,0.004807,0.00479,0.004445,0.004564
0.005869,0.005071,0.005216,0.00592,0.005997,0.005525,0.00513,0.005324,0.005982,0.006641,0.006845,0.006154,0.005386,0.005813,0.006209,0.005762,0.006001,0.006916,0.006103,0.004691,0.004862,0.005187,0.005149,0.005464,0.005847,0.005808,0.00539,0.005596
0.007355,0.006277,0.006636,0.007563,0.007625,0.007047,0.0066,0.006791,0.007506,0.008181,0.00842,0.007724,0.006871,0.00748,0.00796,0.007481,0.00804,0.009079,0.007789,0.00603,0.006225,0.006672,0.006696,0.006974,0.007439,0.007336,0.006861,0.00724
0.00834,0.007157,0.007503,0.008193,0.008297,0.00799,0.007775,0.007902,0.008353,0.008795,0.008993,0.00842,0.007703,0.008329,0.008674,0.008349,0.009317,0.010244,0.00868,0.006998,0.007156,0.007517,0.007547,0.007694,0.008233,0.008159,0.007751,0.008155
0.008807,0.007781,0.007734,0.007799,0.007942,0.008221,0.008435,0.008286,0.00826,0.008484,0.008688,0.008323,0.007782,0.00806,0.008101,0.008142,0.009337,0.01002,0.008697,0.007392,0.007237,0.007234,0.007295,0.007476,0.008281,0.008399,0.007967,0.008089
0.008869,0.008037,0.007892,0.007651,0.007551,0.008149,0.008582,0.008083,0.007718,0.007744,0.008014,0.008086,0.00773,0.00756,0.007324,0.007609,0.008635,0.009039,0.008417,0.007507,0.006756,0.006333,0.006554,0.007082,0.008157,0.008324,0.007677,0.007494
0.008363,0.00791,0.008311,0.008058,0.007477,0.007971,0.008363,0.007765,0.007207,0.00709,0.007613,0.00792,0.007688,0.007571,0.007258,0.00739,0.007874,0.008197,0.008208,0.007471,0.006379,0.005757,0.006154,0.007045,0.008091,0.007959,0.007236,0.007291
0.007888,0.007921,0.008795,0.008349,0.007584,0.008289,0.008594,0.007908,0.007167,0.006849,0.007557,0.007744,0.007527,0.007752,0.007525,0.007313,0.00724,0.007576,0.00772,0.007188,0.006484,0.005885,0.006117,0.007042,0.007938,0.007658,0.007287,0.007663
0.007814,0.007985,0.008919,0.008367,0.007669,0.008684,0.00943,0.008855,0.007563,0.006738,0.007328,0.007534,0.007356,0.007686,0.007737,0.007459,0.0072,0.007494,0.007251,0.006773,0.006762,0.006504,0.006367,0.007042,0.00797,0.007684,0.007708,0.008295
0.008105,0.008266,0.00903,0.008574,0.008097,0.009349,0.010506,0.009837,0.008224,0.007255,0.007466,0.007564,0.00733,0.007611,0.007967,0.007876,0.007917,0.008088,0.007298,0.006902,0.007242,0.007159,0.006651,0.007041,0.008023,0.007762,0.00804,0.008648
0.008806,0.008816,0.009381,0.009012,0.008998,0.010608,0.011456,0.010072,0.008704,0.008135,0.007916,0.007613,0.007407,0.00805,0.008708,0.008667,0.008889,0.008951,0.007789,0.007459,0.007959,0.0079,0.007141,0.007332,0.00813,0.007907,0.008409,0.008985
0.009627,0.009141,0.00942,0.009426,0.009916,0.011278,0.011257,0.009542,0.009048,0.009046,0.008491,0.007764,0.007641,0.008585,0.009259,0.009521,0.010194,0.010346,0.008883,0.008185,0.008911,0.008936,0.008105,0.007975,0.008499,0.008536,0.009008,0.009423
0.010076,0.009109,0.009213,0.009692,0.010294,0.010813,0.010665,0.009594,0.009748,0.010046,0.009296,0.008365,0.008182,0.008667,0.008976,0.010001,0.011377,0.011682,0.010168,0.008804,0.009353,0.009406,0.008827,0.008554,0.009105,0.009807,0.010258,0.00999
0.010342,0.009283,0.009146,0.009704,0.010398,0.010484,0.010927,0.010618,0.010715,0.010953,0.010285,0.009606,0.009048,0.008512,0.008597,0.010269,0.011693,0.012012,0.011056,0.009602,0.009693,0.009707,0.009179,0.008713,0.009594,0.010867,0.011199,0.010124
0.010379,0.010042,0.009498,0.009563,0.01044,0.010384,0.011153,0.011809,0.011737,0.011718,0.011694,0.011935,0.010786,0.008357,0.008144,0.010268,0.011061,0.011102,0.01132,0.011029,0.010689,0.010183,0.009255,0.008874,0.010034,0.010857,0.010856,0.009867
0.010248,0.010803,0.010065,0.009693,0.010573,0.010235,0.011059,0.012519,0.012182,0.011913,0.012763,0.013982,0.012261,0.008163,0.007801,0.010388,0.010692,0.010352,0.011456,0.01226,0.011679,0.010804,0.00932,0.009123,0.010629,0.010588,0.009984,0.009726
0.009818,0.010637,0.010323,0.009701,0.009933,0.009697,0.010469,0.011771,0.011462,0.011317,0.012463,0.014071,0.012101,0.007545,0.007096,0.009632,0.010307,0.010386,0.011204,0.011577,0.011078,0.010479,0.00892,0.009059,0.010521,0.00964,0.008908,0.009475
0.00969,0.010087,0.010035,0.009046,0.008339,0.00872,0.009508,0.010141,0.009971,0.009989,0.011124,0.012788,0.010694,0.006711,0.006621,0.008518,0.009695,0.010941,0.011132,0.009756,0.009176,0.009662,0.0088,0.00922,0.009811,0.007744,0.007511,0.009137
0.010277,0.010722,0.010685,0.009211,0.007832,0.008477,0.009173,0.009423,0.009117,0.009198,0.010482,0.012047,0.010247,0.007273,0.007689,0.00887,0.009741,0.011917,0.012,0.009061,0.00811,0.009438,0.009235,0.010416,0.010779,0.007353,0.007095,0.009688
0.010631,0.011021,0.010852,0.009516,0.008441,0.008991,0.009422,0.00972,0.00914,0.008808,0.010122,0.011977,0.011214,0.008996,0.008998,0.009629,0.009955,0.011921,0.012293,0.009585,0.008704,0.009998,0.009874,0.011431,0.01191,0.008584,0.008794,0.011087
0.010721,0.010701,0.010529,0.010208,0.009976,0.010043,0.009977,0.010116,0.009772,0.009496,0.010146,0.012128,0.012577,0.011155,0.010286,0.010034,0.010243,0.011436,0.011787,0.010646,0.010593,0.011491,0.011119,0.011945,0.01243,0.01057,0.011342,0.01228
0.013182,0.012737,0.012967,0.013768,0.013532,0.012311,0.011364,0.011388,0.012511,0.013542,0.013017,0.013806,0.014808,0.014374,0.012803,0.011906,0.013104,0.014778,0.014592,0.013929,0.014256,0.014835,0.014397,0.013534,0.013886,0.013873,0.015244,0.015227
0.017845,0.017554,0.018147,0.019385,0.018159,0.015239,0.013575,0.014084,0.016894,0.019025,0.01739,0.016927,0.018966,0.019651,0.017373,0.016094,0.018161,0.020715,0.020183,0.01915,0.019392,0.019976,0.019716,0.018063,0.018278,0.018599,0.020626,0.020836
0.020989,0.021026,0.021842,0.023151,0.021379,0.01757,0.01546,0.016258,0.020056,0.022669,0.020424,0.01935,0.022215,0.023563,0.020586,0.019066,0.021693,0.024914,0.0243,0.0228,0.022875,0.023777,0.023786,0.021674,0.021496,0.021697,0.024249,0.024826
0.019445,0.019803,0.020545,0.021509,0.019977,0.016425,0.014343,0.015213,0.018888,0.021122,0.018942,0.017776,0.020646,0.022183,0.019198,0.017688,0.020192,0.023392,0.022875,0.021138,0.021062,0.022231,0.022518,0.0204,0.019724,0.019721,0.022256,0.02314
0.013954,0.014483,0.01468,0.014981,0.01442,0.012178,0.010448,0.011168,0.013975,0.014952,0.013178,0.012398,0.014292,0.015682,0.013823,0.012413,0.014007,0.016573,0.016431,0.014779,0.014608,0.015619,0.015853,0.014266,0.013285,0.013117,0.015022,0.016044
0.0099,0.010282,0.010127,0.010274,0.010152,0.008795,0.007797,0.008734,0.010966,0.010413,0.009342,0.009412,0.009262,0.010395,0.010478,0.009116,0.009575,0.011472,0.011994,0.010457,0.010209,0.010533,0.010418,0.009422,0.008117,0.007635,0.008939,0.010195
0.011353,0.011572,0.011549,0.011836,0.011095,0.010294,0.010525,0.0113,0.012254,0.011178,0.011084,0.011711,0.010583,0.011422,0.011804,0.011111,0.011042,0.011757,0.012316,0.011473,0.011515,0.011705,0.012071,0.011212,0.009944,0.009504,0.010601,0.011451
0.018949,0.018615,0.018619,0.01894,0.018008,0.017857,0.018485,0.01795,0.017468,0.017439,0.017581,0.017506,0.016983,0.018619,0.018847,0.018452,0.018295,0.016416,0.015788,0.016367,0.01775,0.019049,0.019027,0.01834,0.017966,0.017126,0.016786,0.017357
0.031764,0.030697,0.030415,0.031053,0.029949,0.030048,0.030801,0.02925,0.027974,0.028493,0.028596,0.027808,0.027571,0.030697,0.030845,0.030018,0.030099,0.026209,0.024602,0.026355,0.029105,0.031548,0.030656,0.029924,0.030285,0.028834,0.025748,0.025906
0.046486,0.044539,0.04386,0.045099,0.0439,0.04384,0.04463,0.04246,0.040777,0.041408,0.041415,0.039787,0.03952,0.04436,0.044651,0.043317,0.043704,0.038052,0.035306,0.038268,0.042359,0.045887,0.044477,0.043394,0.04405,0.042124,0.036794,0.036374
0.055934,0.053223,0.052213,0.054125,0.053111,0.052505,0.053173,0.051029,0.049181,0.049646,0.049749,0.047362,0.046732,0.052735,0.053364,0.051717,0.052402,0.045778,0.041898,0.045896,0.050674,0.054788,0.053455,0.051892,0.052522,0.05063,0.044263,0.043046
0.052503,0.049553,0.048485,0.050709,0.050122,0.048926,0.049358,0.047981,0.046367,0.046469,0.046747,0.044122,0.042994,0.048852,0.049799,0.048168,0.049089,0.043034,0.038628,0.042903,0.047116,0.050918,0.050236,0.048345,0.048783,0.047581,0.042137,0.040331
0.036481,0.034128,0.033461,0.035141,0.034837,0.033532,0.033835,0.033421,0.032573,0.032433,0.032592,0.030499,0.0291,0.033434,0.03442,0.033065,0.034032,0.030052,0.02622,0.02958,0.032194,0.034902,0.034868,0.033241,0.033798,0.033482,0.031307,0.030304
0.018345,0.017417,0.017805,0.017526,0.016908,0.016149,0.016578,0.016669,0.017407,0.017924,0.016817,0.015636,0.014098,0.01653,0.01768,0.016282,0.016645,0.015505,0.013123,0.014502,0.015465,0.016854,0.016961,0.016624,0.018874,0.018957,0.020807,0.022714
0.010282,0.010604,0.010646,0.008102,0.006723,0.006778,0.007523,0.007434,0.00999,0.012006,0.010765,0.009738,0.006603,0.009073,0.012736,0.009158,0.006533,0.008302,0.008266,0.007173,0.006729,0.006602,0.006269,0.008869,0.01421,0.013285,0.016151,0.019839
0.010087,0.00843,0.008117,0.007298,0.006246,0.005312,0.004969,0.005444,0.008482,0.009984,0.009566,0.008353,0.004927,0.008361,0.013532,0.010028,0.005823,0.006549,0.007805,0.007437,0.006052,0.004888,0.004869,0.008496,0.011864,0.011872,0.017312,0.020594
0.008794,0.005678,0.006134,0.008112,0.007703,0.005909,0.004668,0.005624,0.008351,0.00871,0.007519,0.006877,0.004923,0.008023,0.013237,0.010828,0.00624,0.006229,0.008899,0.009681,0.006334,0.005357,0.00627,0.008708,0.008947,0.009805,0.016901,0.020423
0.006255,0.003911,0.005953,0.008964,0.008557,0.007097,0.006258,0.006402,0.007969,0.008613,0.005674,0.005486,0.00537,0.006597,0.011079,0.010325,0.005859,0.006543,0.011398,0.012605,0.007374,0.005913,0.007421,0.008805,0.007698,0.008212,0.014236,0.01798
0.004561,0.003602,0.007472,0.010352,0.009808,0.009281,0.010047,0.007972,0.008361,0.00909,0.004472,0.005378,0.006416,0.005396,0.008765,0.010432,0.006132,0.006958,0.01379,0.014482,0.009185,0.007029,0.00761,0.00892,0.00881,0.008278,0.01313,0.015099
