4.8e-05,5e-06,9e-05,7.1e-05,1e-06,1.8e-05,4.1e-05,6e-05,8.7e-05,2.8e-05,5.1e-05,1.5e-05,1e-05,7.6e-05,3e-06,1.1e-05,1.3e-05,5.3e-05,2e-06,3.2e-05,1.1e-05,4.4e-05,6e-06,2.8e-05,4.7e-05,5.8e-05,2.9e-05,7.5e-05,0.000142,0.000141,6.8e-05,2.6e-05,7e-06,1.8e-05,1.1e-05,0.000119,5.7e-05,7.4e-05,0.000135,2.7e-05,2.5e-05,4.6e-05,5.4e-05,7.6e-05,3.5e-05,1.7e-05,0,6e-05,2.2e-05,3.8e-05,5.1e-05,1.6e-05,5.2e-05,3.2e-05,6e-05,3.6e-05,7.9e-05,5.1e-05,1.9e-05,8e-05,4.8e-05,3.6e-05,2.1e-05,8.2e-05,5.3e-05,9e-05,2.5e-05,3.4e-05,2e-06,6.6e-05,4.8e-05,7.7e-05,0.000103,7.9e-05,1.2e-05,6e-06,3.4e-05,3.1e-05,5.2e-05,6.1e-05,7.1e-05,7.7e-05,1.8e-05,2.5e-05,3.4e-05,2e-06,3.6e-05,7e-06,1e-05,7.1e-05,1.7e-05,4.7e-05,6.5e-05,7.8e-05,9.9e-05,0.000125,2.8e-05,1e-06,6.4e-05,4e-06,6.1e-05,7.7e-05,2e-06,2e-05,2.5e-05,3e-06,3.5e-05,2.8e-05,3.1e-05,4.2e-05,4e-05,0.000112,6.5e-05,2.4e-05,1.4e-05,2.9e-05,6e-06,0,5.7e-05,3.8e-05,4.5e-05
0.000233,0.000183,0.000198,0.00024,0.000112,6.6e-05,0.000225,0.000172,0.000245,0.000223,0.000314,0.000144,0.000221,0.000321,3.9e-05,4.2e-05,4.6e-05,0.000132,6.6e-05,8.7e-05,1.4e-05,3.1e-05,4.4e-05,0.000169,0.000177,7e-05,9.3e-05,0.000208,0.000384,0.000497,0.000359,0.000245,0.000184,0.000139,0.000225,0.000324,0.000315,0.000388,0.000535,0.000197,0.000305,0.000254,0.000208,0.000229,9.4e-05,6e-05,0.000169,0.000315,0.000276,6.2e-05,0.000163,4.1e-05,8.8e-05,0.000122,0.000228,0.000183,0.000111,0.000216,0.000298,0.000243,0.000233,0.000198,0.000181,0.000121,0.000196,0.000259,0.000185,3.1e-05,0.000103,0.00012,0.000289,0.000302,0.000381,0.000332,0.000197,0.000196,0.000202,0.000351,0.000251,0.000237,0.00011,0.00018,1.1e-05,0.000136,4.8e-05,5.7e-05,0.000112,0.000119,0.000171,0.000244,0.000169,0.000144,0.000213,0.000294,0.000311,0.000375,0.000273,0.000216,0.000124,0.000203,0.000145,0.000238,0.000183,0.000214,0.000218,1.8e-05,7.3e-05,0.000175,0.000212,0.000222,0.000253,0.000289,0.000312,0.00015,0.000251,0.000145,8.3e-05,4.3e-05,0.000125,0.000167,0.000312
0.000281,1.4e-05,0.000153,9.9e-05,0.000146,2.4e-05,0.000313,4e-05,5e-05,0.000102,0.000154,9.3e-05,0.000183,0.00036,0.000312,0.000171,6.8e-05,0.000189,0.000179,0.000227,0.000151,0.000135,5.5e-05,0.000314,0.000125,0.00011,0.000154,0.000143,0.000101,0.000166,0.000165,6.9e-05,0.000275,2e-05,0.000261,6.3e-05,0.000316,0.000108,0.000216,0.000135,0.000285,0.000421,9.9e-05,0.000151,0.000225,0.000124,0.000375,0.000133,7.5e-05,0.000233,0.000205,0.000231,7.6e-05,0.000137,0.000301,0.000224,0.000175,0.000219,0.000154,0.000139,9.9e-05,4.5e-05,0.000147,0.000217,0.000252,0.000148,6.6e-05,0.000113,0.000166,0.000122,0.000234,0.000195,7.4e-05,4.4e-05,6.5e-05,0.000232,4.8e-05,0.000375,0.000124,9.1e-05,0.000248,9.6e-05,0.000125,0.000286,0.000232,4.4e-05,0.000191,5.2e-05,0.000197,0.00027,0.000145,0.000268,3e-06,0.000149,1.9e-05,0.000191,0.000232,7.4e-05,5.3e-05,0.000207,0.000222,0.000294,0.000491,8.9e-05,0.000185,0.000262,0.000119,0.000206,0.000196,0.000204,0.000318,0.000287,0.000213,0.000127,0.000232,0.000183,0.000155,4.6e-05,9.8e-05,0.000128,0.000437
0.000248,0.000311,0.000328,0.000176,0.00017,0.000164,0.000366,0.000356,0.000299,0.000206,0.000125,9.7e-05,0.000138,0.000103,0.000111,4.6e-05,0.000112,0.000224,7.9e-05,0.000115,0.000105,0.000239,0.00023,0.00047,0.00046,0.000301,0.000176,0.000145,0.000272,0.000385,0.000562,0.000329,0.000303,0.000262,0.00024,0.000311,0.000226,0.00024,0.000166,6e-06,0.000274,0.000173,0.000267,5.8e-05,0.000363,0.000199,0.000442,0.000289,0.000258,0.000432,0.000324,4.6e-05,0.000219,0.000272,5e-04,0.000663,0.000572,0.000212,2e-05,0.000137,0.000221,0.000246,0.000157,0.000229,0.000308,0.000125,0.000147,0.00011,0.00016,4.6e-05,0.000123,7.1e-05,0.000103,0.000233,7.4e-05,0.000246,0.000234,0.000123,0.000113,0.000168,0.000187,0.000284,0.000195,0.000392,0.000197,0.000204,0.000141,0.000212,0.00018,0.000302,0.000112,0.000466,0.000326,0.000155,0.000302,0.000334,0.000208,7.3e-05,0.000116,0.000171,0.000209,0.000186,0.000405,0.000348,0.000325,0.000338,0.000221,0.000295,0.000234,6.5e-05,0.000187,0.000268,0.000194,6.5e-05,0.000182,5.9e-05,0.000295,0.000236,0.000126,0.000311,0.00025
8.5e-05,0.000191,0.000194,0.000231,0.000136,0.000116,6.9e-05,0.00024,4.4e-05,0.000192,0.000293,9.5e-05,6.3e-05,0.00011,0.00019,0.000208,8.8e-05,0.000124,0.000168,0.000164,4.9e-05,0.000113,0.000169,0.000192,0.000135,0.000175,0.000164,0.000239,0.000432,0.000166,0.00053,0.000157,0.00025,0.000287,0.000205,9.9e-05,0.00024,0.000284,0.000223,0.000107,0.000246,0.00017,4.1e-05,9.4e-05,0.000382,0.00014,0.000199,0.00023,0.000171,0.000392,8.3e-05,0.000155,0.000254,0.000269,0.00054,1.7e-05,0.000281,0.000123,0.000319,0.000158,0.000249,0.000252,0.000308,5.1e-05,0.000148,0.000419,1.8e-05,0.000222,0.000198,0.000148,0.000169,0.000173,0.000124,0.000303,0.000318,0.000373,0.000205,0.000207,8.3e-05,0.000215,0.000235,0.000108,0.000325,0.000482,0.000125,6.9e-05,0.000259,0.00042,0.000157,0.000326,0.000226,0.000421,0.000531,0.000334,0.000149,0.000383,0.000142,0.000128,5.6e-05,8.3e-05,0.000216,0.000399,2.1e-05,0.000176,0.000285,4.6e-05,9.3e-05,0.000155,0.000242,0.000296,0.000299,0.000188,0.000257,0.000186,8.5e-05,2e-04,0.000488,0.000298,0.000198,0.000189,0.000249
0.000125,0.000188,4.9e-05,0.000162,4.8e-05,7.2e-05,8e-05,0.000184,0.000193,0.000235,0.000141,9.8e-05,0.000143,0.00015,0.000384,6.8e-05,0.000214,0.000301,0.000232,0.000187,0.00014,4.5e-05,0.000185,0.000285,0.000179,0.000302,0.000396,0.000489,0.000441,0.000501,0.000388,0.000363,5.5e-05,0.000134,0.000163,0.000121,0.00038,0.000537,0.000779,0.000482,9.3e-05,0.000295,0.000208,0.000157,0.000217,0.000182,0.000223,0.000273,9.6e-05,0.000255,0.000485,0.00039,0.000273,0.000523,0.00025,0.000618,0.000465,0.000428,0.00034,0.000329,0.00029,0.000382,0.000399,0.000224,8.5e-05,0.000332,0.000562,0.000221,0.000131,2.9e-05,4e-04,0.000236,0.000194,0.000184,0.000239,0.00012,0.000287,0.000222,0.00011,0.000194,0.000224,0.000197,0.000162,0.000286,0.000398,1e-04,0.000322,0.000162,0.000112,0.00029,0.000216,0.000457,0.000141,0.000105,0.000187,9e-05,0.000159,0.00027,0.000164,0.000185,0.000123,0.000364,0.000118,6e-05,0.000207,0.000298,0.000241,0.000123,0.000125,0.000119,0.000177,0.000207,3.8e-05,4.2e-05,0.000147,7.7e-05,0.000271,0.000113,0.000257,0.000246,0.00013
0.000143,0.000406,0.000203,0.000371,0.00033,0.000193,9.3e-05,3.6e-05,0.000219,3.1e-05,0.000161,0.000211,0.000277,0.000151,0.000404,0.000386,0.000319,0.000175,0.000288,0.000405,0.000171,0.000172,0.000168,0.000402,0.000393,0.000403,0.000421,0.000586,0.000773,0.000823,0.000619,0.000371,0.000141,0.000327,0.000458,0.000365,0.000246,0.000712,0.001302,0.001138,0.000836,0.000478,0.000414,0.000249,0.000611,0.000501,0.000914,0.000892,0.000708,0.000262,0.000455,0.001014,0.001151,0.001089,0.000989,0.000701,0.000921,0.000951,0.000705,0.000612,0.000667,0.000753,0.000328,0.000101,0.000189,0.00017,0.000625,0.00093,0.000864,0.000494,0.000616,2.6e-05,8.2e-05,0.000135,0.000128,0.000246,0.000417,0.000401,0.000397,0.000152,0.000306,0.000471,0.000272,0.000185,0.000623,0.000501,0.000319,0.000298,0.000104,0.000168,0.00027,0.000512,0.00037,0.000239,0.000319,0.000168,0.000237,0.000203,0.000201,0.00023,4.5e-05,0.000136,0.000328,5.9e-05,0.000215,0.000314,0.000217,0.000122,0.000106,0.00021,0.000253,0.000117,0.000167,0.000104,0.000265,0.000197,8e-05,7.1e-05,0.000359,0.000258,0.000256
1.5e-05,0.000438,0.000351,0.000235,0.000233,8e-05,0.000174,0.000238,0.000259,0.00021,0.00018,0.000222,0.000261,0.000439,0.000356,0.000109,0.000117,0.00019,0.000405,0.000165,0.000267,0.00033,0.000366,0.000508,0.00015,0.000145,0.00013,0.000232,0.000351,0.000304,0.000147,0.000152,0.000179,0.000435,0.000177,0.000134,0.000251,0.000268,0.000791,0.000341,0.000122,0.000326,0.000347,0.000537,0.00037,0.000574,0.000467,0.000497,0.000175,0.000302,0.000118,0.000683,0.000377,0.000258,0.00026,0.000207,0.000525,9.9e-05,0.000359,0.000228,6.3e-05,0.000428,0.000107,8e-05,0.000321,0.000301,0.000291,0.000464,0.000251,0.000273,0.000181,0.000459,0.000254,6e-05,0.000202,0.000127,0.000225,0.000165,0.000184,0.000165,0.000192,0.000228,0.000262,4.7e-05,0.00053,0.000571,0.000344,0.000172,0.000326,0.000114,0.000177,0.000439,0.000158,0.000111,0.000332,0.000442,0.000595,0.000189,0.000281,0.000128,0.000285,0.000247,0.000145,0.00031,0.000265,3e-04,0.000414,0.000381,0.000168,0.000239,0.000362,0.000349,0.000354,0.000179,0.000271,0.000157,9.1e-05,7.7e-05,0.000344,0.000357,0.000264
0.000272,0.000183,0.000381,0.000391,0.000215,1.1e-05,1e-04,0.000221,0.000376,0.000128,0.000253,0.000393,0.000549,0.000227,0.000189,0.000224,0.000266,8.5e-05,0.000597,0.000605,0.000395,0.000186,0.000259,0.000467,0.000228,7.6e-05,0.000181,0.000157,0.000334,0.000148,0.000147,0.000106,0.000337,0.000432,0.000296,9.9e-05,2.1e-05,0.000106,0.000501,0.000235,0.000121,0.00034,0.000204,0.000312,0.000785,0.000654,0.000563,0.000225,0.000202,0.000432,0.000372,0.000238,0.000624,0.000343,0.000153,0.000312,6e-05,7.5e-05,0.000249,0.000192,0.000243,0.000292,0.000263,0.000155,0.000248,0.000183,4.4e-05,0.000504,0.00036,0.000171,0.000279,0.000531,0.000271,0.000116,0.000224,0.000162,0.000107,0.000306,0.000356,8.5e-05,3e-05,5.9e-05,0.000213,0.000323,0.000199,0.000132,0.00022,0.000173,0.000325,0.000205,0.000124,0.000299,0.000302,7.1e-05,0.00019,0.000225,0.000353,0.000346,0.00054,0.000414,0.000494,0.000447,0.000363,0.000155,0.000134,0.000254,0.000147,0.000293,0.000278,7.1e-05,0.00022,5.1e-05,0.000255,0.00019,0.000309,0.000241,7.6e-05,0.000236,0.000209,0.000192,4.2e-05
0.000241,0.000193,0.000303,6.5e-05,0.000125,0.000163,0.000186,6.8e-05,0.000135,0.000168,0.000238,0.000127,0.000218,0.000224,0.000215,1.1e-05,0.000212,0.000193,0.000425,3.3e-05,0.000144,0.000213,0.000187,0.000215,0.000266,7.3e-05,0.000172,0.000119,0.000229,0.000141,4.9e-05,9.4e-05,0.000301,0.000102,0.000113,0.000181,0.000294,0.000349,0.000314,9.8e-05,0.00022,0.000437,0.000363,0.000208,0.000464,0.000159,0.000147,0.000102,0.000213,0.000361,0.000151,2e-05,0.000368,0.000407,0.000423,0.000547,0.000299,0.000308,0.000154,0.000155,0.000162,0.000389,0.000231,8.6e-05,0.000154,0.000322,0.000156,0.000362,0.000168,0.000197,0.000246,0.000256,0.000284,0.000397,0.000209,0.000281,0.000197,0.000327,0.00024,0.000236,0.00017,0.000269,0.00027,0.000117,0.000287,0.000125,0.000259,0.000348,0.000543,0.000457,0.000245,0.000302,0.000195,0.000174,0.000217,0.000231,0.000371,0.00032,0.000462,0.000368,0.00016,0.00018,0.000373,0.000456,0.000215,0.000272,3e-04,0.000159,7.3e-05,9.8e-05,0.000103,0.000144,0.000109,4e-05,0.000279,0.000258,0.000258,0.000262,0.000271,0.000199,0.000237
0.000202,4.5e-05,0.000183,0.000153,2.6e-05,1e-04,0.00015,0.000105,5.2e-05,0.000128,0.000217,0.000166,5e-05,0.000132,0.000106,5.6e-05,0.000114,0.000141,9e-05,0.000144,5.6e-05,0.000166,6.9e-05,0.000223,9e-05,0.000176,2.8e-05,2.5e-05,0.000129,3.6e-05,7.7e-05,0.00011,0.000215,7e-05,5.6e-05,8.5e-05,0.000137,0.000112,5.9e-05,9.6e-05,0.000159,0.000131,9.6e-05,4.4e-05,0.000208,0.000138,0.000193,8.5e-05,0.000314,0.000143,5.4e-05,0.000107,0.000193,3e-05,0.000302,6.1e-05,0.000255,8.5e-05,0.00013,0.000112,0.000236,0.00016,0.00013,8.3e-05,8.9e-05,0.000188,0.000115,0.000154,0.000169,0.000231,4.7e-05,0.00014,7.9e-05,0.000161,0.000108,0.000144,0.000128,0.000141,5.1e-05,5.9e-05,0.000128,0.000262,0.000102,7.1e-05,8.6e-05,3.5e-05,0.000184,0.00017,0.000178,0.00023,0.000119,9.4e-05,4.9e-05,0.000143,0.000134,0.000129,4.8e-05,0.000142,0.000204,5.1e-05,0.000149,0.000176,0.000256,2.3e-05,4.1e-05,0.000188,0.00019,0.000123,0.000155,0.000171,0.000154,4e-05,0.000109,0.000104,0.000174,9.2e-05,8e-06,0.000158,0.000161,1.5e-05,8.4e-05
9e-06,6.7e-05,4.3e-05,9e-05,0.000105,9.2e-05,1.3e-05,4.3e-05,9e-05,5e-06,8.3e-05,6.5e-05,8.4e-05,5.1e-05,3e-05,0.000108,7.1e-05,4.5e-05,6.5e-05,9.1e-05,2.4e-05,5.5e-05,7.7e-05,4.5e-05,6.4e-05,9e-05,0.000106,6.1e-05,4.8e-05,5.8e-05,5.4e-05,1.6e-05,1.5e-05,3.7e-05,0.000122,0.000103,0.000136,5.8e-05,9.8e-05,9.2e-05,7.7e-05,0.000107,3.3e-05,3.7e-05,0.000146,6.9e-05,9e-05,3.1e-05,0.000238,2.7e-05,2e-05,6.9e-05,4.8e-05,0.000112,0.000149,0.000136,0.000126,2.1e-05,3.1e-05,6.7e-05,6.6e-05,7.8e-05,4.2e-05,5.6e-05,0.000125,2.2e-05,3.1e-05,5.3e-05,9.9e-05,9.2e-05,8.2e-05,9.8e-05,8.6e-05,5.2e-05,0.000104,3.8e-05,5.4e-05,9.7e-05,3e-05,1.4e-05,0.000163,4.5e-05,5.9e-05,7.1e-05,3e-05,2.1e-05,8.1e-05,8.7e-05,0.000162,9.8e-05,4.3e-05,4.8e-05,7.4e-05,7.2e-05,8.5e-05,7.6e-05,7.5e-05,7.9e-05,0.000101,3.3e-05,6.1e-05,9.9e-05,5.9e-05,1e-04,0.000101,7.8e-05,8.5e-05,4e-05,0.000124,6e-06,7.4e-05,5e-05,3.6e-05,3.8e-05,6.4e-05,5.4e-05,2.9e-05,6.8e-05,0.000114,6.3e-05,3.2e-05
4e-05,7e-06,6e-06,8.6e-05,7.5e-05,2.3e-05,6.7e-05,1.7e-05,3.6e-05,5e-06,1.6e-05,4.5e-05,9.1e-05,3.3e-05,7.1e-05,0.000104,5.3e-05,9.7e-05,1.4e-05,9.4e-05,5e-05,8.5e-05,8.7e-05,5.9e-05,5.3e-05,9.8e-05,5.8e-05,3.1e-05,2.2e-05,5.8e-05,6.8e-05,4.7e-05,8.3e-05,6.8e-05,0.000104,9e-06,9.4e-05,5.8e-05,5.6e-05,2.5e-05,5.3e-05,0.000114,5.9e-05,2.2e-05,0.000162,5.7e-05,0.000109,7.2e-05,0.000137,5.7e-05,9e-06,5e-05,8e-06,5.1e-05,0.000136,0.000111,7.8e-05,6.9e-05,7.9e-05,2.4e-05,7e-05,6e-05,0.00011,5.2e-05,0.000111,4.2e-05,4.1e-05,8.1e-05,5e-05,4.3e-05,2.7e-05,3.9e-05,4.9e-05,3.2e-05,4.2e-05,7.5e-05,6e-05,7.6e-05,3.3e-05,1.8e-05,0.000144,6.2e-05,5e-05,4.6e-05,6.5e-05,3e-05,6.2e-05,4.5e-05,0.000107,6.3e-05,5.9e-05,4.5e-05,1.5e-05,3.4e-05,6e-05,8.4e-05,6e-05,7.4e-05,7.8e-05,5.3e-05,6e-05,6.3e-05,3.6e-05,5.8e-05,6.7e-05,6.9e-05,3.8e-05,3.7e-05,5.1e-05,4.7e-05,5.3e-05,2.7e-05,4.1e-05,2.2e-05,4.5e-05,5.2e-05,3.3e-05,2.7e-05,3.7e-05,4.3e-05,4.5e-05
1e-05,7.2e-05,8.4e-05,1e-04,6.4e-05,3.9e-05,3.1e-05,2.9e-05,3e-05,5.8e-05,4.2e-05,9.9e-05,8.3e-05,4.8e-05,0.000155,0.000172,5.4e-05,0.000156,9.3e-05,0.00016,0.000108,5.6e-05,0.000158,0.000109,0.000111,9.7e-05,0.000102,4.2e-05,4.2e-05,2.3e-05,0.000162,9.7e-05,3.1e-05,4e-05,5.1e-05,0.000119,5.7e-05,4.8e-05,8.5e-05,4.4e-05,7.2e-05,0.000102,5.1e-05,3e-05,0.000168,3.4e-05,0.000108,1.9e-05,9e-05,0.000116,7.8e-05,9.1e-05,5.9e-05,8.2e-05,0.000104,0.000118,0.000104,5.4e-05,0.000118,0.000134,8e-05,4.6e-05,0.000168,0.000137,0.000132,0.000102,2.9e-05,4.9e-05,8e-05,7.2e-05,4.1e-05,1.8e-05,3.7e-05,1.7e-05,5.6e-05,9.6e-05,6.8e-05,4.7e-05,1.5e-05,4.6e-05,0.000156,4.5e-05,7.7e-05,4.6e-05,5.9e-05,1.6e-05,6.2e-05,3.1e-05,9.1e-05,7.5e-05,0.000142,0.000103,0.000128,0.000122,5.5e-05,6.8e-05,7.9e-05,6.7e-05,0.00012,0.000128,0.000129,9.8e-05,7e-06,2.7e-05,5e-05,6.6e-05,6.3e-05,5.9e-05,8.4e-05,6e-05,8.3e-05,8.8e-05,6.8e-05,2.4e-05,3e-05,5.2e-05,5.1e-05,7.2e-05,5.3e-05,5e-05,6.8e-05
0.000121,0.000144,7.5e-05,7.4e-05,4.9e-05,5.2e-05,4.9e-05,1.7e-05,2e-05,1.2e-05,1.5e-05,0.000111,0.000124,0.00016,0.000191,0.000125,0.000108,0.00016,6.7e-05,0.000151,7.1e-05,5e-05,0.00015,0.000148,3.4e-05,0.000141,0.000194,0.000136,0.000101,2.7e-05,0.000208,0.000237,0.000133,7.3e-05,9.2e-05,0.000174,0.000134,9.8e-05,0.000224,0.000194,0.000115,2.9e-05,0.000103,0.000135,9.8e-05,6.2e-05,9.6e-05,0.000112,0.000104,0.000163,0.00013,6.8e-05,5e-05,7.6e-05,0.000207,0.000205,8e-05,9.7e-05,6.5e-05,0.000102,0.000106,3e-05,0.000194,8.8e-05,7.1e-05,0.000111,3e-05,5.9e-05,5.4e-05,0.000109,6.6e-05,4.7e-05,8.7e-05,6.7e-05,5.4e-05,7e-05,0.000158,0.000129,0.000102,6.2e-05,0.00014,0.000139,0.000146,0.000112,2.4e-05,5.6e-05,6.7e-05,6.5e-05,5.2e-05,2e-05,0.00011,8.1e-05,0.000161,2.2e-05,5.9e-05,4e-05,2.5e-05,9.8e-05,0.000112,0.000102,3.4e-05,5.3e-05,3.3e-05,9.2e-05,8.4e-05,3.7e-05,0.000133,5.9e-05,0.000134,4.7e-05,6.7e-05,7e-05,8.8e-05,7.6e-05,4.1e-05,0.000129,8e-05,7.3e-05,1.5e-05,7.1e-05,8e-05
8e-05,3.5e-05,1.2e-05,9.2e-05,2.1e-05,4.2e-05,2e-06,7.7e-05,3.7e-05,2.4e-05,1.7e-05,4e-05,8.9e-05,0.000103,5e-05,0.00011,1.2e-05,4.4e-05,6.4e-05,0.000139,5.5e-05,7.2e-05,8.4e-05,9.9e-05,6.4e-05,0.000151,9.3e-05,5.9e-05,7.7e-05,0.000111,0.000152,0.000108,0.000132,0.000158,1e-04,9.9e-05,2.9e-05,0.000138,0.000134,0.00012,0.00011,6e-05,8.6e-05,0.000206,0.000255,0.000142,7.5e-05,3.4e-05,0.00015,0.000136,9.2e-05,6.2e-05,0.000142,5.9e-05,0.000144,0.000103,3.8e-05,0.000167,8e-05,7.1e-05,5.3e-05,8.9e-05,0.000188,0.000158,5.9e-05,4.9e-05,0.000111,7.8e-05,4.7e-05,7.1e-05,4.1e-05,9.3e-05,9.9e-05,4.2e-05,6.6e-05,7.2e-05,0.000119,2.7e-05,7e-05,1.3e-05,4e-05,8.3e-05,0.000122,4.1e-05,0.000144,3.9e-05,9.3e-05,9.4e-05,8.2e-05,0.000107,8e-05,0.000125,3.3e-05,3.6e-05,0.000164,0.000101,6.2e-05,5.4e-05,6e-05,5.1e-05,3.1e-05,1.5e-05,8.4e-05,8.6e-05,2.5e-05,7.7e-05,3.7e-05,2e-05,9.3e-05,0.000114,5.4e-05,5.3e-05,3.3e-05,2e-05,1.1e-05,8.7e-05,7.4e-05,3.1e-05,3.5e-05,0.000147,9.5e-05
5.1e-05,3.4e-05,4.5e-05,8.8e-05,0.000129,2.7e-05,2.8e-05,9.5e-05,1e-04,3e-05,1.9e-05,4.5e-05,7.1e-05,6.7e-05,2.4e-05,0.000116,7.5e-05,7e-05,1.5e-05,0.000176,7.3e-05,0.000142,9.3e-05,0.000102,9.1e-05,8.9e-05,2.4e-05,3.6e-05,0.000107,1.1e-05,9.4e-05,4.5e-05,0.000166,2.2e-05,5e-05,0.000162,0.000136,0.000133,4.9e-05,0.000133,0.000152,5.2e-05,7.3e-05,0.000114,0.000166,7.4e-05,5.8e-05,5.9e-05,0.000133,7e-05,0.000122,0.000106,0.000119,7.8e-05,0.000108,3.9e-05,7.4e-05,0.000156,4.3e-05,0.000121,5.4e-05,5.7e-05,6.1e-05,0.000111,9.7e-05,8.6e-05,7.1e-05,5e-05,6.2e-05,0.000118,9.6e-05,5.7e-05,3e-05,2.9e-05,8.5e-05,8e-06,7.4e-05,9.5e-05,5.1e-05,7.2e-05,0.000129,7.1e-05,0.000121,0.000155,0.000286,0.000193,9.2e-05,8.7e-05,9.3e-05,0.000106,0.000113,7.7e-05,5.8e-05,8.2e-05,0.000135,8.3e-05,2.6e-05,9.8e-05,9.9e-05,0.000186,7.5e-05,6.3e-05,6.3e-05,7.3e-05,3e-05,8.6e-05,2e-05,3e-05,0.000104,0.000107,0.000129,0.000107,8.8e-05,7.1e-05,7.1e-05,5.2e-05,7.2e-05,7.2e-05,9e-05,0.000117,0.000119
3.3e-05,0.000144,0.000122,9e-05,0.000135,9e-05,8.9e-05,0.000116,5.9e-05,8.7e-05,7.4e-05,0.000135,0.000129,7.9e-05,8.1e-05,5.1e-05,1.2e-05,0.000107,9.4e-05,0.000185,0.000164,0.000211,0.000133,4.6e-05,6.7e-05,7.3e-05,4.7e-05,9.9e-05,0.000121,3.5e-05,2e-04,0.000222,4.6e-05,3.6e-05,0.000107,0.000261,7.2e-05,7.6e-05,7.9e-05,2.8e-05,7.8e-05,1.4e-05,9.8e-05,0.000209,0.00027,0.000189,0.000189,0.000171,0.000124,4.5e-05,0.000138,0.000177,0.000172,6.7e-05,0.000147,5.5e-05,0.000167,0.000233,0.000139,0.000205,0.000227,0.000125,9e-05,1.3e-05,0.000128,7e-05,4.6e-05,6.8e-05,0.000156,0.000154,4.2e-05,8.4e-05,0.000131,6.2e-05,8.9e-05,7.3e-05,6.9e-05,6.1e-05,6e-05,0.000134,0.000263,0.00017,8.2e-05,3.1e-05,0.000153,0.000103,7.8e-05,0.000103,7.2e-05,0.000146,0.000209,0.000136,8.9e-05,0.00014,0.000133,0.000152,0.000181,0.000233,6.8e-05,0.000141,0.000136,9.3e-05,5.2e-05,8.6e-05,9.3e-05,3.4e-05,8.5e-05,5.3e-05,0.000181,9.4e-05,0.000119,3.7e-05,1.6e-05,4e-05,5.7e-05,2e-05,1e-04,4.2e-05,7.7e-05,4.2e-05,0.000102
8.1e-05,0.000183,8.7e-05,7.3e-05,8.4e-05,0.000104,7.7e-05,6.7e-05,0.000167,3.8e-05,2.6e-05,6e-05,6.6e-05,9e-05,0.000141,0.000111,7.7e-05,9.9e-05,9.3e-05,0.000128,0.000106,0.000174,0.000132,0.000121,3.1e-05,0.000164,3.3e-05,6.9e-05,7e-06,8.6e-05,0.000275,0.000174,0.000165,2e-05,0.000128,0.000196,0.000259,0.000207,0.000272,0.000234,0.000149,0.000142,3.4e-05,0.000266,0.000304,0.000271,0.000288,0.000267,0.00011,0.000195,0.00013,0.00022,8.6e-05,3e-05,0.00012,0.000106,0.00024,0.000281,0.000425,0.000189,0.000144,0.000112,0.00023,0.000212,0.000155,0.000125,0.000134,0.00012,0.000184,0.000106,0.000104,0.000227,0.000195,0.000103,2.1e-05,0.000115,0.000132,3.7e-05,4.3e-05,0.000113,0.000106,0.000167,0.00011,2.9e-05,0.000148,0.000144,0.000192,0.000296,0.000195,0.000182,6.9e-05,8.5e-05,7e-05,8.8e-05,8.6e-05,0.000103,6.3e-05,7.9e-05,0.000143,9.8e-05,3.2e-05,2.2e-05,8.3e-05,5.9e-05,0.000243,0.000164,6.5e-05,6.3e-05,0.00015,2.7e-05,9e-05,9.7e-05,0.000101,7.4e-05,8.3e-05,8e-05,5.1e-05,9.1e-05,0.000129,8.2e-05,0.000103
0.000143,0.000225,7.5e-05,8.6e-05,0.000185,0.00013,9.6e-05,9.3e-05,0.000134,0.000122,3.9e-05,2.2e-05,7e-05,4.9e-05,0.000184,7.6e-05,7.7e-05,0.000152,2.4e-05,6.2e-05,5.7e-05,0.000163,0.000112,0.000204,0.000191,1e-04,0.000187,9.3e-05,5.4e-05,0.000108,0.000234,0.000196,6.9e-05,0.000141,0.000231,0.000105,0.000162,4e-05,5.7e-05,0.000326,0.000234,0.00024,8.6e-05,0.000291,0.000227,0.000142,0.000144,0.00026,0.000131,0.000229,0.000188,2e-04,0.000313,0.000152,0.000122,0.000185,0.000251,0.000112,0.000315,9.6e-05,5.2e-05,6.6e-05,0.000291,0.000246,0.000366,0.000191,3.4e-05,8.5e-05,0.000183,0.000192,0.000171,0.000101,0.000206,0.000125,0.000136,0.000148,7.3e-05,0.000127,0.000153,3.2e-05,7.2e-05,9.8e-05,7.1e-05,0.000118,0.000122,0.000181,0.000188,0.000184,0.000217,8.5e-05,5.6e-05,4.6e-05,2e-05,6e-05,0.000183,0.000123,0.000109,8.6e-05,8.5e-05,5.8e-05,3.8e-05,6.4e-05,0.000104,8.5e-05,0.00026,0.000168,7.6e-05,0.000102,0.000148,8.7e-05,0.000146,0.000165,0.000178,0.000135,0.000136,6.5e-05,4.1e-05,7.7e-05,0.000169,5e-05,6.1e-05
0.000102,4.5e-05,1.7e-05,9.2e-05,5.9e-05,5.9e-05,6.9e-05,9.4e-05,4.2e-05,4.5e-05,1.1e-05,4.7e-05,7.9e-05,0.000115,0.000133,0.000112,0.000126,9.8e-05,0.000113,0.000117,9.4e-05,8e-05,5.1e-05,0.00019,0.000263,0.000242,9.4e-05,0.000203,0.000219,6.8e-05,0.000182,0.00027,0.000307,0.000231,0.000127,0.000258,0.000142,9.3e-05,4.6e-05,0.000302,0.000174,0.000143,0.000163,0.000169,0.000174,1e-04,0.000162,0.000412,0.000534,0.000207,0.000172,0.000138,0.000364,0.000251,0.000265,0.000243,0.00039,9.6e-05,0.000277,0.000348,0.000255,0.000102,0.000253,9.4e-05,0.000277,0.000172,5.5e-05,0.000136,4.4e-05,9.2e-05,5.4e-05,6.1e-05,0.000226,0.000108,0.000126,0.000285,0.000236,0.000166,0.000213,0.000237,0.000221,0.000112,8.5e-05,0.000173,0.000106,0.000206,0.000183,0.000216,0.000218,0.000157,0.000162,0.000186,0.000192,0.000103,0.000145,8.7e-05,3.9e-05,7.8e-05,3.5e-05,0.000106,8.6e-05,5.2e-05,0.000111,7.3e-05,0.000187,0.000104,6.2e-05,0.000217,0.000113,7.9e-05,9.3e-05,0.000126,8.5e-05,7.9e-05,2.1e-05,0.000109,0.000183,0.000138,0.000141,8.1e-05,1.7e-05
5.3e-05,5.3e-05,4e-05,0.000102,9.4e-05,1.8e-05,4.3e-05,5.9e-05,3.4e-05,3e-05,5.1e-05,1.4e-05,4.8e-05,3.9e-05,3.4e-05,4.7e-05,5.6e-05,3.3e-05,4e-05,1.1e-05,2.3e-05,7.7e-05,4.7e-05,0.000111,0.000127,3.1e-05,0.000113,0.000117,0.000151,6.7e-05,0.000118,0.000124,0.00016,9.5e-05,0.000223,9.1e-05,4.5e-05,6e-06,0.00016,0.000114,0.000151,8.1e-05,9.5e-05,0.000139,6.2e-05,0.000112,0.000222,0.000375,0.000217,0.000177,0.000161,0.00017,0.00011,0.000145,0.000111,0.000351,0.000134,0.000231,0.000269,0.00024,0.000171,0.00011,0.00018,0.000213,9.6e-05,8e-05,0.000149,8.5e-05,0.000137,0.000103,0.000122,6.8e-05,0.000129,0.000148,0.000158,9.6e-05,6.9e-05,0.000144,0.000117,0.000164,0.000108,0.000106,9.2e-05,0.000144,3.2e-05,0.000171,5.4e-05,9.3e-05,0.000105,3e-05,0.00011,0.000184,8.7e-05,1.3e-05,7.4e-05,1.5e-05,4e-05,9.3e-05,6.6e-05,7.9e-05,5.2e-05,5.6e-05,2.4e-05,5.9e-05,7.3e-05,3.2e-05,7.4e-05,0.000129,0.000112,6.1e-05,0.000132,4.5e-05,7.5e-05,9.7e-05,7.2e-05,0.000106,8.7e-05,7.7e-05,8.2e-05,4.7e-05,8.9e-05
2.6e-05,3.9e-05,1.2e-05,3.3e-05,2.1e-05,9e-06,1.1e-05,3.2e-05,2.3e-05,3e-06,3.8e-05,1.4e-05,1.4e-05,2.3e-05,2.4e-05,3.1e-05,2e-05,1.4e-05,2.2e-05,2.9e-05,4.9e-05,1.8e-05,2.2e-05,3.7e-05,4.4e-05,2.8e-05,2.9e-05,3.2e-05,3e-05,3e-05,4.8e-05,9e-06,4.7e-05,2.2e-05,5e-05,2.7e-05,2.6e-05,3.4e-05,4.1e-05,1.7e-05,5.2e-05,3.6e-05,3.1e-05,5.1e-05,4.2e-05,5.1e-05,5.3e-05,5.1e-05,7.2e-05,3.7e-05,9e-06,6.8e-05,5.2e-05,2e-05,4.3e-05,4.3e-05,5.1e-05,8.8e-05,3.2e-05,3.3e-05,8.6e-05,2.5e-05,4.8e-05,4.2e-05,6.4e-05,2.3e-05,4.9e-05,3.3e-05,4.2e-05,6.8e-05,1.9e-05,2.4e-05,3.6e-05,2.9e-05,4.1e-05,1.4e-05,4.4e-05,2.5e-05,4.8e-05,3.1e-05,1.7e-05,2e-05,6e-06,2.9e-05,5.4e-05,7.6e-05,4e-05,2.3e-05,1.8e-05,1.4e-05,3.1e-05,5.8e-05,3.4e-05,2.3e-05,1.4e-05,3.8e-05,3e-05,3.2e-05,8e-06,3.9e-05,5.5e-05,3.7e-05,3.9e-05,1.5e-05,2.5e-05,5.1e-05,3.7e-05,5e-05,1.7e-05,1.1e-05,3.8e-05,2.4e-05,8e-06,1.9e-05,2.1e-05,5.1e-05,9e-06,3.2e-05,2.4e-05,2.4e-05,3e-05
1.2e-05,2.6e-05,3.1e-05,7e-06,2.2e-05,8e-06,3.8e-05,3.8e-05,9e-06,2.6e-05,1.7e-05,1.4e-05,9e-06,8e-06,3e-05,3.5e-05,2.2e-05,1.2e-05,1.7e-05,2.7e-05,6.7e-05,3.1e-05,1.4e-05,2e-05,3.4e-05,2.2e-05,4.2e-05,4.2e-05,6e-06,7e-06,2.9e-05,1.8e-05,4e-05,5.2e-05,4.9e-05,2.5e-05,3.2e-05,4.5e-05,4e-05,4e-05,5.2e-05,1.8e-05,3e-05,6.4e-05,1.9e-05,2.7e-05,4e-05,1e-05,3.2e-05,2.3e-05,2.4e-05,4.5e-05,1.6e-05,1.5e-05,9e-06,3.6e-05,4.7e-05,4.1e-05,8.8e-05,7.1e-05,7.6e-05,7.6e-05,6.3e-05,2.7e-05,3.5e-05,4.2e-05,4.5e-05,4.3e-05,5.2e-05,5.2e-05,7.5e-05,7.2e-05,5.2e-05,1.8e-05,2e-05,8e-06,7e-06,5.2e-05,5.6e-05,4.3e-05,8e-05,3e-05,3.8e-05,2.4e-05,4.3e-05,5.5e-05,3.4e-05,1.7e-05,1.2e-05,5e-05,3.5e-05,5.1e-05,4.6e-05,1.9e-05,3.3e-05,4.3e-05,2.8e-05,1.9e-05,2.2e-05,1.3e-05,5.9e-05,3.2e-05,2.3e-05,3.2e-05,1.7e-05,4.8e-05,2.2e-05,1.1e-05,4.2e-05,2.3e-05,3.8e-05,1.5e-05,2.5e-05,1.5e-05,1.6e-05,1.4e-05,1e-05,2.5e-05,2.5e-05,3.1e-05,1.8e-05
1.1e-05,4.3e-05,5.5e-05,3.3e-05,2e-05,3.2e-05,5.9e-05,2.2e-05,3.2e-05,3.9e-05,4.4e-05,4e-05,2e-05,2.3e-05,3.4e-05,5.3e-05,2.7e-05,1.6e-05,2.2e-05,3.2e-05,2.6e-05,4.5e-05,5e-05,3e-05,2.6e-05,3.1e-05,4.8e-05,4e-06,3.2e-05,2.2e-05,3e-05,5.9e-05,2.3e-05,3.4e-05,2.4e-05,5.4e-05,2.8e-05,2.3e-05,3e-05,3.4e-05,1.5e-05,2.2e-05,3.8e-05,6.6e-05,6.5e-05,3.1e-05,9e-06,2.4e-05,6e-05,3.5e-05,3.2e-05,2.3e-05,4.4e-05,2.4e-05,1.7e-05,5.7e-05,2.7e-05,7.4e-05,6.2e-05,8e-06,5.3e-05,1.8e-05,4.1e-05,2.9e-05,3.3e-05,1.4e-05,2.3e-05,3.3e-05,7e-06,2e-05,3.5e-05,1.2e-05,3.8e-05,3.1e-05,1.8e-05,4e-06,2.2e-05,6.2e-05,2.8e-05,1.8e-05,4.9e-05,2.6e-05,3.2e-05,4.7e-05,1.3e-05,3.7e-05,1.6e-05,3.5e-05,1.3e-05,5.2e-05,3.2e-05,2e-05,1.1e-05,3.9e-05,9.7e-05,6.3e-05,1.9e-05,2.4e-05,3.9e-05,4.3e-05,4e-05,2.7e-05,1.8e-05,5.1e-05,7.4e-05,3.6e-05,4.6e-05,5.1e-05,5.6e-05,4.1e-05,5.9e-05,4.2e-05,2.4e-05,3.8e-05,1.3e-05,3.2e-05,3.1e-05,2.6e-05,1.3e-05,2.3e-05,1.9e-05
1.4e-05,3.8e-05,2.3e-05,1.6e-05,3.8e-05,5.1e-05,2.5e-05,4e-05,4.6e-05,4.6e-05,8e-06,2.8e-05,2.2e-05,1.8e-05,2.8e-05,2.8e-05,2e-05,1.3e-05,2.7e-05,1.3e-05,8e-06,2.9e-05,2.9e-05,1e-05,2.9e-05,2.5e-05,2e-05,1.9e-05,2.4e-05,1.5e-05,3.5e-05,3.6e-05,3.8e-05,3.7e-05,1.4e-05,2.2e-05,1.8e-05,2.1e-05,2.5e-05,1.7e-05,1.4e-05,2.2e-05,6e-06,2.9e-05,1.8e-05,4.2e-05,4.4e-05,4.1e-05,2.5e-05,3.3e-05,2.6e-05,2.3e-05,3.4e-05,1.9e-05,2.1e-05,6.1e-05,2.7e-05,6.2e-05,3.7e-05,7e-06,2.4e-05,1e-05,2.2e-05,1e-05,5e-06,2e-05,1.9e-05,1.8e-05,4e-05,2.4e-05,2.2e-05,1e-05,3.1e-05,5.6e-05,4.2e-05,2.2e-05,1.4e-05,2.4e-05,3.6e-05,4e-06,1.4e-05,1.4e-05,1.9e-05,2e-05,2.6e-05,2.7e-05,4.2e-05,6.4e-05,5.3e-05,4.8e-05,2.7e-05,1.8e-05,4e-06,4.5e-05,5.1e-05,2e-05,2e-05,2.5e-05,3.5e-05,3.2e-05,3.3e-05,1e-05,2e-06,3.2e-05,3.8e-05,4e-05,4.5e-05,8e-06,1.6e-05,1.7e-05,3.2e-05,9e-06,2.9e-05,2.9e-05,5.1e-05,2.1e-05,1.9e-05,1.4e-05,2.5e-05,2.7e-05,5.7e-05
1.6e-05,2.5e-05,1.1e-05,1.7e-05,8e-06,2.5e-05,1.6e-05,3.6e-05,1.3e-05,1.2e-05,3.8e-05,3e-06,6e-06,2.3e-05,2.1e-05,2.2e-05,2.3e-05,2.2e-05,3e-05,1.5e-05,1.1e-05,2.4e-05,2e-06,1.4e-05,2e-05,1.9e-05,3.2e-05,2.8e-05,3.6e-05,1.1e-05,2.4e-05,5.1e-05,1.3e-05,2.7e-05,1.5e-05,1.1e-05,1.8e-05,2.6e-05,8e-06,2.5e-05,1.5e-05,2.4e-05,2.2e-05,2.1e-05,2.3e-05,4e-05,1.1e-05,9e-06,1.9e-05,1.8e-05,2.9e-05,4.2e-05,3.1e-05,3.6e-05,2.6e-05,6.3e-05,3.1e-05,7.6e-05,8.8e-05,5e-05,1.4e-05,2.4e-05,2.7e-05,1.2e-05,1e-05,4e-06,2.1e-05,3e-05,2.8e-05,2.7e-05,2.9e-05,2.6e-05,2e-05,2.8e-05,3.9e-05,2.8e-05,9e-06,2.4e-05,4.1e-05,3.6e-05,2.2e-05,2.1e-05,1.8e-05,1.9e-05,5e-06,1.6e-05,3.3e-05,1.1e-05,1.7e-05,2.1e-05,4e-06,4.6e-05,2.7e-05,2.5e-05,3.6e-05,1e-05,1.6e-05,2.1e-05,1.8e-05,7e-06,1.6e-05,9e-06,1.3e-05,1.5e-05,2.3e-05,4.6e-05,2.1e-05,2e-05,2e-05,7e-06,1.6e-05,1.1e-05,1.6e-05,1.5e-05,2.9e-05,2e-05,1.2e-05,2e-05,7e-06,3.2e-05,3e-05
2.1e-05,1.6e-05,1.6e-05,1.6e-05,2e-05,2.3e-05,7e-06,1.7e-05,8e-06,9e-06,2e-05,1.6e-05,1e-06,2.9e-05,7e-06,1.3e-05,7e-06,2.6e-05,1.7e-05,1.6e-05,1.7e-05,3.8e-05,1.8e-05,1.5e-05,2.1e-05,3e-06,2.7e-05,1.8e-05,5e-06,1e-05,4e-06,2e-05,1.5e-05,2.7e-05,2.5e-05,3e-06,2.4e-05,2e-05,3.6e-05,1.3e-05,3.6e-05,6e-06,7e-06,1.2e-05,1.8e-05,1.7e-05,1.8e-05,2.3e-05,3.9e-05,8e-06,1.5e-05,1.9e-05,2.3e-05,2e-05,3.6e-05,3.6e-05,3.1e-05,4e-05,3.6e-05,1.7e-05,2.4e-05,3.3e-05,2.8e-05,1e-05,1.4e-05,1.3e-05,1.6e-05,2.4e-05,4.5e-05,2.1e-05,8e-06,1.7e-05,7e-06,2e-05,2e-05,9e-06,8e-06,3.1e-05,2.2e-05,2.7e-05,2.9e-05,2.3e-05,2.2e-05,1.5e-05,1.9e-05,1.4e-05,4.6e-05,3.2e-05,2e-06,2.7e-05,9e-06,2.7e-05,2e-05,3.3e-05,1.3e-05,3e-06,1.3e-05,9e-06,2.5e-05,8e-06,1.6e-05,7e-06,2.3e-05,2.3e-05,1.7e-05,1.6e-05,1.5e-05,7e-06,1.5e-05,1.2e-05,1.8e-05,4e-06,1.4e-05,3e-06,1.5e-05,1.6e-05,1.8e-05,2.7e-05,2.7e-05,1.8e-05,3.8e-05
7e-06,2e-06,6e-06,1.3e-05,1.5e-05,3e-05,3.5e-05,1.9e-05,1.6e-05,1e-06,5e-06,3e-06,7e-06,6e-06,2.3e-05,4e-06,1.6e-05,2e-05,2.5e-05,4e-06,1.3e-05,1.4e-05,1.3e-05,2e-05,7e-06,1.7e-05,2.6e-05,1.1e-05,1.4e-05,1.3e-05,2.4e-05,8e-06,1.3e-05,1.7e-05,1.1e-05,1.3e-05,1.7e-05,1.5e-05,3.1e-05,1.2e-05,2e-05,1.9e-05,6e-06,7e-06,1.5e-05,9e-06,1.5e-05,1.2e-05,4.5e-05,1.7e-05,2.5e-05,2.4e-05,2e-05,1.6e-05,2.4e-05,1.7e-05,3e-05,4.4e-05,4e-05,1.6e-05,1.7e-05,2.8e-05,2e-06,5e-06,2.6e-05,2.1e-05,1.3e-05,2.4e-05,2.6e-05,3e-06,9e-06,3e-05,1.3e-05,3.3e-05,8e-06,2.9e-05,2.8e-05,2e-05,2.2e-05,1.6e-05,2.6e-05,2.4e-05,1.3e-05,3.2e-05,1.5e-05,1.1e-05,2.6e-05,6e-06,1.3e-05,1.6e-05,1.8e-05,5e-06,5e-06,2.2e-05,3.2e-05,1.4e-05,1.1e-05,2.1e-05,2.4e-05,1.8e-05,1.3e-05,2.6e-05,1.1e-05,1e-05,7e-06,4e-06,1.1e-05,8e-06,1.6e-05,1.3e-05,1.3e-05,1.5e-05,4e-06,1.7e-05,2.2e-05,8e-06,2.2e-05,4e-06,2e-05,9e-06,1.5e-05
5e-06,1.6e-05,4e-06,5e-06,1.2e-05,9e-06,2.8e-05,1.7e-05,1.3e-05,1.1e-05,6e-06,1e-05,1.5e-05,1.8e-05,2.2e-05,7e-06,9e-06,1.3e-05,1.5e-05,1.1e-05,3.3e-05,2.4e-05,2.4e-05,1.1e-05,6e-06,5e-06,1e-05,1.3e-05,1.1e-05,1.9e-05,2e-06,1.1e-05,1e-05,1e-05,2.9e-05,6e-06,1.2e-05,1.5e-05,2.6e-05,2.8e-05,1.8e-05,2e-05,9e-06,3e-06,1e-05,3e-06,1.3e-05,1.9e-05,3e-05,2.2e-05,1.9e-05,3.6e-05,1.3e-05,5e-06,1.6e-05,2.3e-05,2.4e-05,1.3e-05,2.3e-05,1.8e-05,3.7e-05,1.1e-05,1.7e-05,4e-06,3e-05,3e-05,1.8e-05,2.8e-05,4.3e-05,1.1e-05,1.8e-05,2.9e-05,3.5e-05,2.2e-05,3.6e-05,9e-06,2.2e-05,2.9e-05,1.8e-05,2.5e-05,2.6e-05,2e-05,1.7e-05,2.7e-05,2.3e-05,3.6e-05,2.4e-05,3.6e-05,2.8e-05,2.7e-05,1.6e-05,2.4e-05,7e-06,1.3e-05,2.9e-05,7e-06,1.7e-05,3.2e-05,1.1e-05,1.4e-05,9e-06,2.3e-05,1.5e-05,1.4e-05,1.8e-05,2.7e-05,3.1e-05,1.8e-05,1.1e-05,2e-05,1.2e-05,2.2e-05,2.1e-05,1.6e-05,2.2e-05,2e-06,1.9e-05,1.7e-05,1.9e-05,1e-05,2.3e-05
1.9e-05,1.6e-05,8e-06,1e-05,2e-05,2.1e-05,1.8e-05,2e-05,2.9e-05,1.5e-05,1.2e-05,1.6e-05,1e-05,1.3e-05,1e-05,1.5e-05,1.5e-05,1.2e-05,2.2e-05,2e-05,1.4e-05,1.3e-05,1.1e-05,1.8e-05,6e-06,1e-05,2.3e-05,2.2e-05,1.7e-05,1e-05,9e-06,5e-06,1.7e-05,1.5e-05,3.2e-05,2.6e-05,1.9e-05,2e-05,2.1e-05,3e-05,1.6e-05,1.5e-05,2.3e-05,1.5e-05,1.7e-05,1.9e-05,8e-06,1.3e-05,2.4e-05,1.5e-05,2e-05,6e-06,1e-05,2e-06,1.9e-05,3.7e-05,2.1e-05,1.6e-05,8e-06,2.4e-05,2.7e-05,1.5e-05,1.9e-05,1.2e-05,2.3e-05,1.1e-05,9e-06,1.2e-05,2.1e-05,2e-06,1.7e-05,6e-06,6e-06,4e-06,1.5e-05,1.1e-05,7e-06,2e-06,1.2e-05,1.7e-05,9e-06,1.3e-05,5e-06,1e-05,1.3e-05,2.4e-05,1.6e-05,2.5e-05,1.1e-05,1e-05,2.1e-05,1.8e-05,1e-05,4e-06,3.1e-05,1.4e-05,1.8e-05,1.4e-05,1.3e-05,1.4e-05,1.5e-05,2.6e-05,1.5e-05,2.3e-05,2.2e-05,1.6e-05,2.8e-05,1.6e-05,1.2e-05,6e-06,9e-06,3.6e-05,2e-05,1.8e-05,2.2e-05,1.4e-05,7e-06,2.1e-05,3.8e-05,2.8e-05,2e-05
1.2e-05,4e-06,7e-06,3e-06,1.7e-05,1.9e-05,7e-06,1.6e-05,1.5e-05,1.1e-05,1.8e-05,1.3e-05,1.8e-05,6e-06,5e-06,4e-06,1.1e-05,7e-06,1.4e-05,1e-05,1.9e-05,1.8e-05,1.7e-05,2.3e-05,2.8e-05,1.6e-05,1e-05,1.9e-05,1.9e-05,1e-05,1.1e-05,2.1e-05,1.5e-05,1.5e-05,1.7e-05,1.4e-05,2.4e-05,1.4e-05,1.1e-05,5e-06,5e-06,1.5e-05,1.1e-05,1.8e-05,2.2e-05,1.8e-05,1.3e-05,1.3e-05,2.4e-05,1.4e-05,9e-06,3.1e-05,2e-05,2.3e-05,2.9e-05,3.5e-05,2.3e-05,1.5e-05,3.7e-05,3.2e-05,1.4e-05,1.5e-05,1.9e-05,1.4e-05,2.2e-05,7e-06,1.2e-05,9e-06,7e-06,8e-06,8e-06,8e-06,3e-06,9e-06,2e-06,1.3e-05,4e-06,1.9e-05,1.4e-05,8e-06,1.5e-05,3e-06,6e-06,1.2e-05,1e-05,2.8e-05,8e-06,6e-06,1.1e-05,9e-06,1.2e-05,1e-06,1.4e-05,2e-06,1.4e-05,1.4e-05,2.1e-05,1.7e-05,1.7e-05,0,6e-06,5e-06,1e-06,1.9e-05,6e-06,1.3e-05,9e-06,2.3e-05,2.8e-05,8e-06,1.8e-05,1.6e-05,4e-06,3e-06,3e-06,6e-06,5e-06,1.1e-05,1.7e-05,2.2e-05,1.4e-05
1e-05,2e-05,1.3e-05,1.3e-05,1.7e-05,5e-06,8e-06,1.5e-05,1.9e-05,1.7e-05,1e-05,7e-06,1.1e-05,5e-06,1.1e-05,7e-06,1.3e-05,1.9e-05,1.3e-05,1.1e-05,9e-06,5e-06,7e-06,2e-05,1.5e-05,1.2e-05,1.8e-05,1e-05,1.2e-05,2.3e-05,1.3e-05,2e-05,2.5e-05,1.6e-05,1.8e-05,9e-06,2.8e-05,2.5e-05,1.8e-05,5e-06,4e-06,9e-06,1.3e-05,2.1e-05,1.9e-05,1.9e-05,1e-05,3.5e-05,3.5e-05,3.3e-05,4.3e-05,4.4e-05,4.4e-05,4.3e-05,4.5e-05,4.3e-05,1.1e-05,3e-05,3.6e-05,1.3e-05,9e-06,3e-05,1.2e-05,3e-05,4.4e-05,2e-05,1.3e-05,1.2e-05,3.8e-05,6e-06,1.5e-05,1.1e-05,2.1e-05,1.5e-05,2e-05,0,1.7e-05,2.7e-05,1.7e-05,2.3e-05,1.5e-05,5e-06,5e-06,2.5e-05,1e-05,3e-06,1.1e-05,1e-05,9e-06,1.8e-05,1e-05,1.2e-05,7e-06,1.1e-05,1.4e-05,5e-06,7e-06,1.4e-05,1.4e-05,1.7e-05,1.7e-05,1.3e-05,1.3e-05,1.3e-05,1.1e-05,9e-06,1e-05,1.9e-05,1e-05,2e-05,2.5e-05,1.7e-05,4e-06,6e-06,1.6e-05,8e-06,1.6e-05,1e-05,8e-06,3.4e-05,1.6e-05
1e-05,1.3e-05,3e-06,6e-06,3e-06,4e-06,1.2e-05,1.1e-05,1.6e-05,6e-06,5e-06,1.3e-05,8e-06,7e-06,1.5e-05,1.7e-05,1.5e-05,2e-05,1.6e-05,1.4e-05,1.6e-05,1e-05,1.8e-05,1.5e-05,1.2e-05,7e-06,1.3e-05,2e-06,1.3e-05,2.5e-05,4e-06,2.3e-05,7e-06,1.5e-05,5e-06,7e-06,2.3e-05,1.2e-05,2.5e-05,1.6e-05,8e-06,1.4e-05,2.1e-05,3.8e-05,1.5e-05,1.7e-05,2.5e-05,2.8e-05,2.6e-05,2.7e-05,4e-06,2.5e-05,5e-06,2.6e-05,3.4e-05,2e-06,6e-06,3.9e-05,1.6e-05,8e-06,2.4e-05,3.6e-05,4.4e-05,4.5e-05,1.4e-05,1.9e-05,1.3e-05,1.6e-05,4.3e-05,2.4e-05,3.5e-05,3.4e-05,1e-05,7e-06,8e-06,1.1e-05,1.7e-05,7e-06,1.9e-05,7e-06,6e-06,7e-06,1.3e-05,2.8e-05,4.2e-05,2.6e-05,1.7e-05,1.2e-05,1.9e-05,3.2e-05,2.3e-05,8e-06,8e-06,9e-06,2.6e-05,1.3e-05,1.8e-05,1.2e-05,2e-06,1.5e-05,2.2e-05,2.2e-05,9e-06,1.9e-05,6e-06,1.4e-05,5e-06,2.4e-05,3e-05,3.1e-05,1.3e-05,1.8e-05,6e-06,8e-06,5e-06,5e-06,1.8e-05,6e-06,7e-06,1.6e-05,8e-06
1.1e-05,1.1e-05,6e-06,1e-06,1.2e-05,3e-06,1.6e-05,1.5e-05,1.5e-05,4e-06,1e-06,7e-06,1.8e-05,9e-06,1.5e-05,1.2e-05,1.2e-05,5e-06,2e-06,6e-06,2e-06,2.8e-05,0,7e-06,1.2e-05,1.9e-05,6e-06,8e-06,1e-05,3.2e-05,2.7e-05,7e-06,1.2e-05,6e-06,1.4e-05,3e-06,1.9e-05,2.3e-05,2.4e-05,1.6e-05,2.9e-05,1.5e-05,3.2e-05,1e-05,1.2e-05,7e-06,1.6e-05,3.7e-05,2.2e-05,3e-05,2.3e-05,2.3e-05,3.2e-05,2.4e-05,3e-06,2.3e-05,1.1e-05,4.2e-05,2.4e-05,3e-05,3.6e-05,2.2e-05,5.9e-05,1.7e-05,1.3e-05,2.6e-05,2.6e-05,3e-05,4.6e-05,1.9e-05,1.1e-05,1e-05,2.5e-05,1.4e-05,1.1e-05,1e-05,1.8e-05,2.2e-05,1.5e-05,2.3e-05,7e-06,8e-06,1e-05,1e-05,2.6e-05,1.4e-05,8e-06,1.8e-05,2.9e-05,1.3e-05,1.6e-05,1.6e-05,8e-06,1.1e-05,8e-06,1.9e-05,2.3e-05,1.8e-05,1.3e-05,1e-05,3e-05,1.3e-05,7e-06,1.8e-05,1.8e-05,7e-06,1.1e-05,2.7e-05,3.5e-05,5e-06,1.1e-05,1.9e-05,1.1e-05,1.5e-05,1.2e-05,4e-06,1.4e-05,1.8e-05,1.9e-05,3.3e-05,2.6e-05
7e-06,1.4e-05,6e-06,5e-06,1.4e-05,1.7e-05,8e-06,1.1e-05,8e-06,1.2e-05,5e-06,3e-06,1.9e-05,6e-06,6e-06,2.1e-05,4e-06,7e-06,7e-06,1.1e-05,1.3e-05,2.1e-05,3e-05,7e-06,3e-06,1.8e-05,2.5e-05,7e-06,1e-05,1.5e-05,7e-06,5e-06,1.3e-05,1.4e-05,1.2e-05,1.8e-05,5e-06,2e-05,3e-05,1.6e-05,2.2e-05,5e-06,1.7e-05,2.1e-05,1.6e-05,1.3e-05,1.8e-05,4e-06,2.3e-05,3.4e-05,2e-06,2.7e-05,5e-06,1.9e-05,3e-06,9e-06,1.9e-05,1.2e-05,4.4e-05,4.2e-05,4.1e-05,5.8e-05,8e-06,1.5e-05,1.6e-05,2.7e-05,2.3e-05,1.4e-05,2.3e-05,3e-06,5e-06,1.4e-05,2.4e-05,6e-06,3e-06,9e-06,1.4e-05,1.4e-05,2.4e-05,2.1e-05,5e-06,1.5e-05,7e-06,6e-06,9e-06,1.5e-05,4e-06,1.9e-05,1.5e-05,1.3e-05,9e-06,1.6e-05,1.4e-05,4e-06,3e-06,7e-06,1.3e-05,1.5e-05,7e-06,1.3e-05,1.2e-05,1.4e-05,5e-06,1.3e-05,1.5e-05,6e-06,7e-06,2.2e-05,8e-06,1.6e-05,7e-06,1.2e-05,1.4e-05,1.6e-05,1.9e-05,7e-06,1.4e-05,6e-06,2.9e-05,1.1e-05,5e-06
3e-06,1.6e-05,5e-06,9e-06,3e-06,1.1e-05,2.2e-05,6e-06,6e-06,8e-06,1e-05,3e-06,1.7e-05,1.5e-05,1.5e-05,6e-06,1e-05,1e-06,7e-06,4e-06,1.4e-05,2.5e-05,1.2e-05,1.4e-05,6e-06,1.3e-05,1.8e-05,1e-05,6e-06,1.1e-05,1.7e-05,7e-06,1.8e-05,2.3e-05,9e-06,1.6e-05,1e-05,2e-05,1e-05,5e-06,7e-06,6e-06,7e-06,2.8e-05,2.2e-05,9e-06,1e-05,1.1e-05,3e-05,2.8e-05,2.5e-05,2.7e-05,2.7e-05,2.1e-05,3.6e-05,9e-06,2.2e-05,2.2e-05,3.3e-05,2.2e-05,5e-06,3.3e-05,3.2e-05,9e-06,1.9e-05,1.8e-05,9e-06,1.6e-05,1.9e-05,1.7e-05,9e-06,6e-06,1.2e-05,2.9e-05,1.9e-05,2.4e-05,1e-05,3e-06,2.1e-05,2e-06,1.6e-05,1.4e-05,1.9e-05,6e-06,7e-06,5e-06,7e-06,1.4e-05,7e-06,6e-06,5e-06,2.3e-05,3e-06,2e-06,6e-06,5e-06,3e-06,6e-06,1.4e-05,0,2e-06,1.3e-05,6e-06,2e-06,7e-06,6e-06,1.5e-05,4e-06,8e-06,1.8e-05,1.1e-05,2e-06,6e-06,8e-06,1.1e-05,3e-06,1.7e-05,2.5e-05,1.4e-05,1.5e-05,1e-06
9e-06,1.1e-05,1.2e-05,9e-06,1e-05,1.7e-05,1.5e-05,1.1e-05,4e-06,9e-06,6e-06,1.2e-05,7e-06,1.1e-05,1.8e-05,1.7e-05,1.8e-05,1.1e-05,8e-06,1.3e-05,1e-06,1.6e-05,9e-06,9e-06,1e-05,3e-06,7e-06,2e-05,1e-05,1.3e-05,1.5e-05,6e-06,1.1e-05,2e-06,1.1e-05,1.3e-05,1.1e-05,9e-06,8e-06,5e-06,2.6e-05,1e-05,8e-06,2.6e-05,1.7e-05,6e-06,1e-05,1.4e-05,4e-05,3.4e-05,1.6e-05,1.5e-05,2.6e-05,8e-06,1.4e-05,2.9e-05,1.8e-05,4e-05,4.2e-05,9e-06,9e-06,4e-06,2e-05,3.6e-05,4.4e-05,1.6e-05,8e-06,5e-06,1.5e-05,2.7e-05,1e-05,1e-05,1.1e-05,1.3e-05,1.1e-05,2e-05,1.7e-05,8e-06,1.9e-05,6e-06,1.5e-05,2.2e-05,8e-06,9e-06,6e-06,9e-06,1.1e-05,4e-06,2e-06,6e-06,1.3e-05,2.7e-05,1.2e-05,3e-06,1e-05,1.3e-05,1.2e-05,4e-06,1.9e-05,2.3e-05,1.3e-05,1.4e-05,1e-05,1e-05,9e-06,1.1e-05,1.4e-05,1.9e-05,8e-06,1.7e-05,6e-06,7e-06,9e-06,1e-05,1.4e-05,1.5e-05,1.9e-05,8e-06,2.3e-05,2e-05,2.7e-05
4e-06,1.1e-05,6e-06,5e-06,1.3e-05,2e-06,7e-06,5e-06,4e-06,8e-06,8e-06,1.4e-05,1.6e-05,6e-06,1.2e-05,4e-06,6e-06,4e-06,1.4e-05,8e-06,1e-05,1.6e-05,1.1e-05,5e-06,6e-06,4e-06,1.1e-05,1.1e-05,6e-06,8e-06,8e-06,9e-06,8e-06,1.4e-05,3e-06,4e-06,1.7e-05,1.9e-05,4e-06,1e-05,1.9e-05,1.3e-05,1.2e-05,7e-06,1.7e-05,1.4e-05,6e-06,2e-05,1.7e-05,1.2e-05,1.1e-05,7e-06,2.1e-05,1.1e-05,1.1e-05,3.3e-05,9e-06,3.3e-05,2.2e-05,7e-06,1.3e-05,1.7e-05,1.6e-05,3e-05,6e-06,8e-06,1.2e-05,1.5e-05,1.4e-05,1.3e-05,1.7e-05,4e-06,1.1e-05,2.2e-05,7e-06,1.2e-05,1.1e-05,1e-05,1.3e-05,8e-06,9e-06,4e-06,1.1e-05,7e-06,7e-06,4e-06,4e-06,3e-06,3e-06,7e-06,1.5e-05,8e-06,0,2e-06,1.1e-05,9e-06,5e-06,1e-05,1.3e-05,5e-06,1e-06,6e-06,2e-06,1.2e-05,0,1.3e-05,4e-06,1.3e-05,1.4e-05,8e-06,7e-06,5e-06,6e-06,2e-06,1.6e-05,3e-06,1e-05,3e-06,2e-05,1.2e-05,1.4e-05
2e-06,7e-06,4e-06,3e-06,8e-06,7e-06,6e-06,3e-06,3e-06,5e-06,7e-06,7e-06,1.3e-05,7e-06,7e-06,5e-06,5e-06,3e-06,1e-05,2e-06,8e-06,1.2e-05,6e-06,3e-06,1e-05,1e-06,1.4e-05,7e-06,2e-06,4e-06,9e-06,6e-06,8e-06,1.3e-05,6e-06,5e-06,1.5e-05,1.2e-05,5e-06,1e-05,7e-06,3e-06,2e-06,5e-06,1.9e-05,7e-06,6e-06,1.6e-05,1.8e-05,5e-06,4e-06,1e-05,7e-06,6e-06,1.6e-05,2.2e-05,1.3e-05,2.5e-05,2.9e-05,2e-06,8e-06,1.4e-05,2e-06,1e-05,3e-06,2e-06,3e-06,1e-05,1.1e-05,3e-06,1e-05,8e-06,7e-06,1.4e-05,7e-06,6e-06,9e-06,8e-06,7e-06,4e-06,3e-06,8e-06,2e-06,3e-06,4e-06,5e-06,3e-06,5e-06,2e-06,6e-06,4e-06,1.1e-05,2e-06,3e-06,1.1e-05,4e-06,2e-06,4e-06,2e-06,5e-06,2e-06,2e-06,4e-06,4e-06,4e-06,1.1e-05,5e-06,5e-06,8e-06,1.1e-05,6e-06,9e-06,1e-06,5e-06,1.2e-05,4e-06,3e-06,1e-06,2.1e-05,7e-06,1.6e-05
5e-06,5e-06,1e-06,1e-06,6e-06,5e-06,4e-06,2e-06,3e-06,4e-06,6e-06,6e-06,9e-06,5e-06,8e-06,4e-06,6e-06,0,9e-06,1e-06,6e-06,8e-06,8e-06,2e-06,7e-06,2e-06,1.2e-05,7e-06,3e-06,2e-06,8e-06,6e-06,5e-06,1e-05,5e-06,2e-06,1.4e-05,1.3e-05,4e-06,8e-06,6e-06,1e-06,1e-06,1.1e-05,1.1e-05,3e-06,8e-06,1.4e-05,1.9e-05,5e-06,7e-06,1e-05,8e-06,4e-06,1.7e-05,2e-05,1.6e-05,2.2e-05,2.5e-05,1e-06,5e-06,1.2e-05,1e-06,8e-06,3e-06,3e-06,3e-06,9e-06,1.3e-05,2e-06,5e-06,4e-06,7e-06,1.1e-05,6e-06,3e-06,7e-06,1.1e-05,7e-06,2e-06,1e-06,7e-06,4e-06,1e-06,3e-06,3e-06,3e-06,7e-06,7e-06,4e-06,3e-06,1.3e-05,2e-06,4e-06,6e-06,2e-06,3e-06,1e-06,1e-06,4e-06,2e-06,4e-06,3e-06,1e-06,3e-06,9e-06,2e-06,5e-06,6e-06,1.2e-05,6e-06,9e-06,1e-06,4e-06,1.1e-05,2e-06,3e-06,1e-06,1.9e-05,6e-06,1.4e-05
4e-06,8e-06,2e-06,1e-06,6e-06,5e-06,4e-06,3e-06,2e-06,4e-06,6e-06,6e-06,9e-06,5e-06,7e-06,5e-06,7e-06,1e-06,8e-06,1e-06,7e-06,7e-06,8e-06,2e-06,7e-06,1e-06,1.3e-05,7e-06,2e-06,2e-06,9e-06,6e-06,4e-06,1.1e-05,4e-06,3e-06,1.3e-05,1.3e-05,4e-06,7e-06,7e-06,0,0,1.1e-05,1.3e-05,5e-06,6e-06,1.4e-05,2e-05,6e-06,6e-06,1.2e-05,6e-06,4e-06,1.6e-05,1.9e-05,1.5e-05,2.1e-05,2.4e-05,2e-06,6e-06,1e-05,2e-06,7e-06,4e-06,1e-06,3e-06,7e-06,1.4e-05,2e-06,5e-06,2e-06,6e-06,1.1e-05,7e-06,1e-06,8e-06,9e-06,8e-06,3e-06,2e-06,9e-06,2e-06,1e-06,4e-06,2e-06,1e-06,4e-06,4e-06,4e-06,4e-06,1.2e-05,1e-06,2e-06,6e-06,5e-06,3e-06,1e-06,1e-06,3e-06,1e-06,4e-06,4e-06,0,4e-06,8e-06,3e-06,5e-06,6e-06,1e-05,9e-06,8e-06,2e-06,2e-06,1.1e-05,2e-06,3e-06,0,1.8e-05,6e-06,1.4e-05
