1.7e-05,1.5e-05,8e-06,3e-05,1.1e-05,8e-06,1.4e-05,1e-06,9e-06,1e-06,6e-06,2.3e-05,2.9e-05,7e-06,6e-06,5e-06,1.4e-05,4.1e-05,9e-06,1.5e-05,4e-06,1.9e-05,8e-06,1.1e-05,3.1e-05,2e-06,1.1e-05,1.3e-05,1.5e-05,1.6e-05,1e-06,2.9e-05,1.9e-05,2.6e-05,4e-06,1.1e-05,1.2e-05,2e-06,4e-05,2e-06,4.6e-05,4e-06,1.1e-05,3.4e-05,3.2e-05,3e-06,3.9e-05,3.4e-05,6.1e-05,1.9e-05,8e-06,7e-06,5.3e-05,3.3e-05,2.9e-05,4.3e-05,1.7e-05,8e-06,4.1e-05,3.1e-05,5e-06,4.3e-05,1.4e-05,5e-06,1e-06,1.8e-05,6e-06,1e-06,2.8e-05,3.3e-05,4.3e-05,8e-06,7e-06,1.2e-05,2.3e-05,1e-05,1.2e-05,3e-06,4.8e-05,3.7e-05,1.4e-05,2.5e-05,1.8e-05,2e-06,6e-06,1.3e-05,1e-05,6e-06,8e-06,4e-06,1e-06,3e-06,9e-06,7e-06,1.6e-05,1.7e-05,3e-06,1.1e-05,1.9e-05,1.2e-05,2e-06,6e-06,1e-05,1.1e-05,1.4e-05,2.7e-05,1.2e-05,1.9e-05,5e-06,1.6e-05,8e-06,1.1e-05,1.4e-05,8e-06,1.3e-05,1e-05,1.2e-05,0,1.6e-05,2.5e-05,1e-06
3.5e-05,6.3e-05,2.2e-05,5.9e-05,1.2e-05,2e-06,2.6e-05,2.9e-05,3e-05,5.3e-05,3.6e-05,4.8e-05,9e-05,6.1e-05,3.8e-05,1.4e-05,3e-05,0.000106,4.3e-05,3.5e-05,4.6e-05,6.2e-05,5.6e-05,4.1e-05,7.7e-05,4.8e-05,6.9e-05,2.9e-05,4.8e-05,7.6e-05,2.2e-05,6.8e-05,9.6e-05,0.000164,0.00016,0.00016,3.6e-05,0.000178,0.000243,6.4e-05,8.7e-05,0.000346,0.000178,0.000128,0.000358,0.000379,0.000254,0.00021,0.000235,0.00011,8.1e-05,3.3e-05,6.2e-05,0.000149,0.000178,8.2e-05,0.00013,9.9e-05,0.000101,0.000106,8.9e-05,7.1e-05,7.8e-05,6.6e-05,1.5e-05,7.6e-05,4.6e-05,5.5e-05,7.1e-05,0.000106,0.000177,7.3e-05,1.2e-05,0.000103,9.5e-05,4.5e-05,9.3e-05,5.9e-05,9e-05,1e-04,6.2e-05,5.3e-05,6.8e-05,3.5e-05,2.2e-05,5e-05,5.7e-05,9e-06,2.9e-05,2.1e-05,4.5e-05,4.2e-05,2.6e-05,3.2e-05,4.4e-05,4e-05,2.2e-05,1.5e-05,5.2e-05,3.9e-05,3.4e-05,3.4e-05,3.4e-05,1e-05,2.3e-05,6.1e-05,5.3e-05,9.3e-05,3.8e-05,1.8e-05,2.5e-05,1.3e-05,1.4e-05,1.7e-05,1.8e-05,9e-06,1e-05,1.4e-05,3.6e-05,8.1e-05,2.8e-05
6e-05,9.1e-05,5.5e-05,6.3e-05,2.9e-05,1.9e-05,1.6e-05,6e-05,1.3e-05,6.6e-05,3.3e-05,2.6e-05,5.3e-05,1.3e-05,5.3e-05,6.4e-05,3.1e-05,9.3e-05,4.6e-05,3.6e-05,7.3e-05,5.2e-05,4.4e-05,5.5e-05,7e-06,4.4e-05,3e-05,7.2e-05,3.5e-05,7.2e-05,8.6e-05,1e-05,8.1e-05,0.000152,1.7e-05,0.000186,0.000214,0.000336,0.00034,0.000234,0.000255,0.000416,0.000392,0.000429,0.000439,0.000296,0.000116,0.000137,9.6e-05,0.000224,0.000176,8.2e-05,3.7e-05,0.000121,8.8e-05,1.7e-05,0.000112,4.4e-05,1.8e-05,6.2e-05,6.5e-05,2.6e-05,5e-05,2.3e-05,6.6e-05,4.9e-05,3.9e-05,6.3e-05,2.1e-05,1.4e-05,1e-04,8.8e-05,4.4e-05,0.000156,7.1e-05,0.000121,1.7e-05,2e-05,0.000103,8.4e-05,0.000106,1.4e-05,1.1e-05,7.6e-05,2.9e-05,8.5e-05,4.7e-05,0.000116,3.5e-05,5e-06,6.3e-05,6.1e-05,2.7e-05,5.7e-05,1.1e-05,9.8e-05,5.6e-05,1.3e-05,3.7e-05,1e-04,9.5e-05,2e-05,8.3e-05,2.8e-05,1.3e-05,4.5e-05,1.8e-05,6.6e-05,4.9e-05,8.5e-05,2.2e-05,2.7e-05,5.9e-05,3.5e-05,6.1e-05,3.7e-05,6.3e-05,5.7e-05,2.2e-05,8e-05,7.8e-05
0.000137,0.000155,5.8e-05,9.4e-05,0.000144,0.000103,5.2e-05,8e-05,4.5e-05,7e-05,4.1e-05,6.1e-05,4.4e-05,7.2e-05,0.000123,4.3e-05,2.2e-05,9e-05,9.4e-05,6.3e-05,4.5e-05,4.5e-05,5.4e-05,5.5e-05,1.4e-05,9e-05,7.4e-05,7.4e-05,7.1e-05,7.5e-05,5.1e-05,5.8e-05,8.8e-05,0.000211,0.000169,0.000162,3.7e-05,0.00022,0.000122,8.4e-05,0.000187,0.000336,0.000218,0.000102,0.00017,0.000106,8.8e-05,4.8e-05,0.000139,0.000181,5.6e-05,3.5e-05,0.000144,9.5e-05,0.000139,0.000165,1.7e-05,5.5e-05,6.6e-05,1.7e-05,0.000108,4.9e-05,0.000132,8.1e-05,6.3e-05,9.8e-05,5.7e-05,5e-05,3.2e-05,0.00012,5.1e-05,7.3e-05,0.000116,0.000153,0.000105,0.000142,9.4e-05,9.8e-05,8.1e-05,5.5e-05,0.000108,7.8e-05,6.8e-05,0.000116,0.000113,0.000101,0.000125,0.000205,0.000115,3.7e-05,6.4e-05,5.1e-05,4.1e-05,8.1e-05,8.4e-05,0.000137,7.3e-05,5.8e-05,5.8e-05,6.1e-05,3.6e-05,4.9e-05,0.000137,9.3e-05,2.4e-05,0.000103,9e-05,7.1e-05,3.2e-05,0.000145,3.2e-05,4.1e-05,8.4e-05,6.3e-05,8.5e-05,6.8e-05,0.000124,5.9e-05,6.9e-05,1e-04,7.9e-05
8.1e-05,0.000171,0.000136,0.000132,0.000227,8e-05,8.6e-05,0.000119,6.7e-05,7.9e-05,3.8e-05,4.9e-05,7e-05,0.000166,0.000119,6.5e-05,3.4e-05,0.000111,0.000143,4.5e-05,6.2e-05,7.6e-05,3.3e-05,6e-05,0.000111,0.000167,0.000125,0.000126,5.2e-05,0.000104,8.1e-05,3.8e-05,0.000121,0.000141,6.8e-05,0.000188,7.6e-05,0.000256,0.00023,0.000143,0.000165,0.000198,0.000249,0.000184,0.000151,0.000236,0.000114,0.000167,0.000209,0.00014,0.000116,6.1e-05,0.000196,0.000215,0.000161,0.000237,8.7e-05,0.000116,6.7e-05,4.7e-05,8e-05,0.00011,0.000142,0.000186,0.000182,3.6e-05,8.8e-05,8e-05,3.3e-05,0.000156,0.000193,0.000169,2.4e-05,5.4e-05,2.6e-05,6.6e-05,0.000129,6.1e-05,0.000131,0.000173,5.9e-05,6.3e-05,0.000111,7.3e-05,0.000119,0.000139,0.000117,0.000142,9.8e-05,3.6e-05,4.4e-05,8.2e-05,7.3e-05,0.000132,5.2e-05,6e-05,3.9e-05,0.00011,2.4e-05,2.9e-05,5.1e-05,4.9e-05,6.8e-05,0.000143,1e-04,0.00011,0.000138,4.6e-05,3.1e-05,0.000121,0.000149,9.1e-05,0.000129,9.7e-05,0.000159,8.5e-05,0.000126,0.000175,4.3e-05,0.000109,8.1e-05
5.1e-05,8.7e-05,4.4e-05,8.5e-05,9.7e-05,0.000135,5.2e-05,7.5e-05,4.5e-05,6.8e-05,5.1e-05,3.1e-05,8.1e-05,0.000161,8.5e-05,6.1e-05,5.1e-05,5.2e-05,0.000116,7.6e-05,5.7e-05,5.6e-05,8.4e-05,0.000104,6.5e-05,6.1e-05,2.3e-05,2.9e-05,6.5e-05,1.8e-05,6.5e-05,6.4e-05,7.1e-05,7e-05,9.5e-05,8.9e-05,0.000295,0.000362,0.00014,0.000176,0.000325,0.000272,0.000303,0.000118,2.8e-05,0.000197,0.00027,0.000254,0.000144,0.000315,0.000156,0.000139,0.000118,0.000151,2.8e-05,0.000152,0.000178,0.000197,0.000126,1.5e-05,2.8e-05,7.7e-05,0.000102,6.8e-05,1.9e-05,9e-05,0.000114,0.000183,9.3e-05,0.000174,6.3e-05,2.7e-05,5.5e-05,5e-05,0.000113,7.9e-05,0.000101,8.4e-05,6e-05,7.5e-05,7.6e-05,3e-05,0.000118,7e-05,0.000118,8.4e-05,0.000122,2.9e-05,2e-05,1.6e-05,8.9e-05,2.3e-05,2.9e-05,4.8e-05,2.5e-05,5.1e-05,6.7e-05,8.8e-05,9.3e-05,0.000105,1.7e-05,7.4e-05,4.7e-05,7.9e-05,8.7e-05,0.000161,3.3e-05,5.5e-05,5.8e-05,7.8e-05,0.000139,7.3e-05,8.4e-05,1.6e-05,9.8e-05,1.7e-05,0.000129,0.000118,9.9e-05,3.2e-05,5.5e-05
0.000116,6.4e-05,4.3e-05,7.6e-05,9.7e-05,9.5e-05,0.000106,7.2e-05,4e-05,9.5e-05,2.5e-05,2.3e-05,0.000119,2.7e-05,6.7e-05,8.8e-05,1.6e-05,5.1e-05,9e-05,7.4e-05,2.3e-05,6.1e-05,0.000117,3e-05,4.9e-05,4.2e-05,6.6e-05,2.5e-05,2.1e-05,6.3e-05,4.3e-05,3.6e-05,4.6e-05,9.2e-05,0.000152,9.6e-05,5e-04,0.000419,0.000268,0.000223,0.000105,0.000404,2.7e-05,0.000144,0.00015,0.000124,0.000322,5.8e-05,6.4e-05,0.000257,0.00017,0.000111,0.000195,0.000159,0.00015,8.7e-05,0.000215,7.5e-05,0.000153,0.000113,0.000114,2.5e-05,5.2e-05,5.4e-05,4.4e-05,7.5e-05,4.6e-05,0.000181,0.000119,6.9e-05,5.6e-05,6.9e-05,6.6e-05,3.9e-05,0.000118,7.5e-05,8.3e-05,6.9e-05,7.6e-05,9.6e-05,5.7e-05,9.3e-05,0.000107,2.3e-05,5.8e-05,9.2e-05,3.6e-05,4.8e-05,2.2e-05,6.8e-05,0.000162,1e-04,7.9e-05,4.1e-05,7.3e-05,0.000126,9e-05,0.000132,0.000123,5e-05,6.2e-05,0.000134,0.00012,0.000112,1.3e-05,6.3e-05,4.1e-05,5e-05,5.4e-05,8.4e-05,6.8e-05,2.8e-05,0.000107,6.7e-05,2.8e-05,0.000106,8.9e-05,2.8e-05,3.4e-05,5.6e-05,2.8e-05
2.6e-05,4e-05,3.7e-05,2e-05,6.6e-05,1.8e-05,6e-05,2.5e-05,8.7e-05,5.7e-05,6.1e-05,4.3e-05,0.000113,0.000101,7.3e-05,0.000118,7.7e-05,3.2e-05,1.6e-05,4.5e-05,0.00013,8.8e-05,3.3e-05,6e-05,2.1e-05,6.7e-05,6e-05,0.000126,9.8e-05,0.000111,9.1e-05,6.4e-05,9.3e-05,9e-05,5.8e-05,6e-05,0.000545,0.000436,0.000405,0.000277,0.000237,0.000234,0.000465,0.000389,3.7e-05,0.00028,0.000486,0.000468,0.000239,0.000218,0.000333,0.000198,0.00015,0.000104,0.000233,0.000151,7.3e-05,0.000154,0.000212,0.000289,0.000248,0.00019,0.000206,8.2e-05,8.9e-05,3e-05,7.4e-05,0.000213,0.000166,0.000115,0.000161,0.000157,7.7e-05,8.8e-05,0.000181,0.000187,0.000112,0.000142,0.000145,0.000177,0.000181,0.000168,9.3e-05,3.6e-05,4.9e-05,0.000106,3.7e-05,5.6e-05,6.2e-05,6.9e-05,0.000139,0.000115,3.9e-05,8.7e-05,9.5e-05,0.000179,8.7e-05,9e-05,7.1e-05,8.6e-05,5.7e-05,5.9e-05,7.5e-05,2.9e-05,2e-05,2.6e-05,4.2e-05,1.4e-05,2.8e-05,7e-05,8.8e-05,6.7e-05,0.000146,0.000128,6.7e-05,7.7e-05,8.9e-05,5.6e-05,7.5e-05,4.8e-05,5.4e-05
6.2e-05,1e-04,0.000128,9.2e-05,7.7e-05,3.1e-05,5.2e-05,8.9e-05,9.5e-05,4.6e-05,8.7e-05,5.7e-05,5.4e-05,5.4e-05,7.1e-05,0.000185,0.000149,0.000119,7.2e-05,3.5e-05,0.000148,0.000174,0.000112,1.3e-05,6.8e-05,8e-05,7e-05,0.00014,0.000118,3.6e-05,7.3e-05,4.1e-05,0.000156,6.9e-05,2.3e-05,8.6e-05,0.000405,0.000217,7.5e-05,2e-04,0.000177,0.000124,0.000278,0.000126,0.000186,0.000215,0.000208,0.000153,0.000161,0.000214,0.000265,0.00022,8.5e-05,0.000231,0.000102,0.000133,3e-05,0.000101,8.8e-05,8.5e-05,7.1e-05,6.3e-05,0.000113,6.3e-05,5.2e-05,6.4e-05,2.3e-05,9.7e-05,7.9e-05,5.8e-05,8.9e-05,2.6e-05,2.1e-05,1.2e-05,0.000114,8.3e-05,5.1e-05,0.000133,8e-05,0.000147,0.000119,1.8e-05,3.7e-05,1.8e-05,4.6e-05,0.000131,0.000132,8.7e-05,6.6e-05,6.6e-05,0.000172,9e-05,1e-04,0.000114,0.000147,6.3e-05,8.3e-05,1.9e-05,8.8e-05,5.8e-05,5.2e-05,1.8e-05,4.8e-05,5.4e-05,6.8e-05,3.9e-05,4.6e-05,3e-05,3.9e-05,8.1e-05,0.000123,9.6e-05,9.4e-05,3e-05,3.7e-05,8.7e-05,3.9e-05,3.8e-05,4.2e-05,0.000105,9.5e-05
7.3e-05,3.1e-05,4.8e-05,6.7e-05,3.7e-05,4.2e-05,6.1e-05,3.7e-05,4.6e-05,4.9e-05,4.5e-05,2.7e-05,5.3e-05,4e-05,6.3e-05,9.3e-05,5.8e-05,1.7e-05,7.9e-05,8.6e-05,7.2e-05,8.5e-05,5.6e-05,3.8e-05,6.2e-05,1.4e-05,5e-06,7.7e-05,2.1e-05,3.3e-05,6.3e-05,5.9e-05,0.000112,4.2e-05,2e-05,9.2e-05,0.000374,0.000121,8.2e-05,0.000102,0.00017,0.000248,0.000379,0.000194,7e-05,0.000206,0.000143,0.000118,5.3e-05,0.000116,8.4e-05,0.000191,0.00019,0.000171,0.000157,0.000178,0.000123,5.2e-05,8.8e-05,2.8e-05,4.4e-05,2.5e-05,7.6e-05,0.000119,0.000123,8.2e-05,4e-05,2.3e-05,7.2e-05,3.9e-05,4.1e-05,2.5e-05,2.9e-05,3e-05,7.6e-05,2.4e-05,6.9e-05,5e-05,5.7e-05,6.6e-05,5.7e-05,4.4e-05,3e-06,2.7e-05,8e-06,6.4e-05,9.6e-05,7.7e-05,2.2e-05,3e-06,9.4e-05,2.6e-05,8e-05,2.4e-05,5e-05,8.3e-05,2e-05,6.7e-05,2.9e-05,3e-05,4e-05,3.4e-05,4.9e-05,4e-05,2.8e-05,1.2e-05,7e-05,7.1e-05,2.2e-05,7.2e-05,5.5e-05,3.7e-05,3.2e-05,4.7e-05,6.6e-05,2.8e-05,5.9e-05,4.2e-05,3.3e-05,6.8e-05,1.6e-05
3.3e-05,5.7e-05,3.1e-05,5.4e-05,2.7e-05,3.6e-05,6.9e-05,7.2e-05,1e-04,2.3e-05,4.8e-05,2.5e-05,3.9e-05,5.7e-05,9.1e-05,6.9e-05,1.2e-05,3.5e-05,7.5e-05,6.5e-05,6.9e-05,2.8e-05,1.5e-05,1.6e-05,7.2e-05,9e-06,2.6e-05,1e-05,2.2e-05,4e-06,4e-05,1.8e-05,5.7e-05,5.3e-05,1.7e-05,7.2e-05,0.000162,0.000132,9.8e-05,0.000104,0.000124,8.6e-05,9.9e-05,0.000165,0.000177,0.000299,0.000199,0.000176,8.1e-05,5.7e-05,4.8e-05,0.000127,0.000143,0.000139,0.000153,0.00011,7.6e-05,0.000112,0.00018,0.000165,8.6e-05,1.6e-05,2.9e-05,5.9e-05,2.7e-05,4.4e-05,4.8e-05,8e-05,6e-06,3.8e-05,6.8e-05,9.9e-05,6.9e-05,9.6e-05,0.000138,9.4e-05,4e-05,6.1e-05,1.8e-05,6.1e-05,8.6e-05,5e-05,4.8e-05,5.4e-05,4.9e-05,3e-05,5.3e-05,1.4e-05,1.2e-05,3.8e-05,5.5e-05,5.1e-05,9.1e-05,5.9e-05,6.1e-05,2.4e-05,3e-05,9.2e-05,8.1e-05,4.5e-05,2.1e-05,3.1e-05,2.1e-05,5e-06,3.1e-05,6.3e-05,9.2e-05,4.5e-05,4.5e-05,6.3e-05,1.5e-05,1.8e-05,5e-06,3.3e-05,3.2e-05,3.8e-05,1.3e-05,7e-06,3.1e-05,2.1e-05,3.7e-05
2.4e-05,4.3e-05,4.2e-05,9e-06,5.5e-05,2.1e-05,4.4e-05,1e-05,5.8e-05,2.2e-05,1.9e-05,1.4e-05,4.7e-05,2.9e-05,2.9e-05,3.7e-05,2.1e-05,6e-05,3.3e-05,2e-05,5.4e-05,2.9e-05,3.6e-05,1.6e-05,4.4e-05,3.2e-05,1.2e-05,2.6e-05,2.4e-05,3e-05,3.1e-05,2.7e-05,1.2e-05,2.6e-05,5e-05,5.5e-05,0.000113,4.2e-05,4.9e-05,7.1e-05,4.3e-05,1.4e-05,3.1e-05,5.2e-05,8.6e-05,0.000145,2e-06,7.4e-05,3e-06,4.1e-05,4.8e-05,4.2e-05,2.8e-05,6.2e-05,4.5e-05,4.2e-05,2.3e-05,7.6e-05,5e-05,5.9e-05,1.8e-05,1.2e-05,1e-05,2.6e-05,5.6e-05,1.2e-05,3.3e-05,4.6e-05,1.5e-05,5.8e-05,3.6e-05,3.7e-05,2.4e-05,4.8e-05,4.4e-05,2e-05,2e-05,2.6e-05,2.5e-05,2e-05,3.9e-05,2.8e-05,2.6e-05,2.6e-05,1.9e-05,2.3e-05,4.6e-05,3.3e-05,2.5e-05,2.1e-05,1.9e-05,1.8e-05,5.4e-05,2.4e-05,3.4e-05,2.8e-05,1.2e-05,5.1e-05,1.1e-05,2.1e-05,1.3e-05,1.8e-05,1.9e-05,1.7e-05,2.1e-05,5.6e-05,1.2e-05,2.9e-05,2.7e-05,1.2e-05,1.9e-05,1.5e-05,1.5e-05,2.5e-05,1.2e-05,1.5e-05,3e-05,2.7e-05,4.5e-05,1.1e-05,1e-05
6e-06,3.4e-05,1.4e-05,5e-06,3.4e-05,1.5e-05,1.4e-05,2.7e-05,2.3e-05,1.5e-05,1e-05,1.9e-05,2.2e-05,1.1e-05,9e-06,6e-06,1.1e-05,3.7e-05,3.2e-05,1.4e-05,4.6e-05,2.4e-05,2e-05,1.4e-05,2.3e-05,7e-06,2.6e-05,1.8e-05,1e-05,1.8e-05,1e-05,1.3e-05,3.6e-05,2.3e-05,2.8e-05,2.3e-05,7.2e-05,4e-06,2.7e-05,4.7e-05,4.8e-05,3.2e-05,1.9e-05,3.8e-05,6.6e-05,8.6e-05,3e-05,4.7e-05,1.9e-05,4.8e-05,2.6e-05,2.9e-05,3.8e-05,2.3e-05,4.1e-05,3.1e-05,3e-05,4.5e-05,4e-05,2.1e-05,4e-06,1.7e-05,1.4e-05,1.3e-05,2.5e-05,2.4e-05,2.5e-05,3.8e-05,6e-06,2.4e-05,3.7e-05,1.4e-05,2e-05,1.8e-05,3.3e-05,1.3e-05,1e-05,1.6e-05,1.5e-05,3.2e-05,1.2e-05,1.9e-05,1.3e-05,3.3e-05,1.1e-05,9e-06,3.1e-05,2.2e-05,8e-06,3e-06,2.4e-05,1.1e-05,3.5e-05,2.4e-05,9e-06,1.5e-05,2.7e-05,1.4e-05,1e-06,1e-05,6e-06,1.4e-05,1.4e-05,2e-05,1.7e-05,2.4e-05,3.5e-05,2.1e-05,2.2e-05,2.6e-05,1.3e-05,9e-06,1.6e-05,1.2e-05,1.7e-05,1.3e-05,1.5e-05,1.6e-05,1.7e-05,2.6e-05,1.8e-05
2.9e-05,2e-06,1.2e-05,2e-06,3.2e-05,2.3e-05,2.3e-05,2.9e-05,7e-06,1e-05,2.2e-05,2.1e-05,2.1e-05,1.7e-05,2.4e-05,2.1e-05,1.5e-05,3.2e-05,6e-06,2.2e-05,1.5e-05,1e-05,2e-05,1.2e-05,1.5e-05,2.5e-05,2.8e-05,1.7e-05,1.5e-05,1.2e-05,2.4e-05,2.9e-05,1.4e-05,3e-06,2.5e-05,9e-06,6.6e-05,1.2e-05,2.1e-05,4.1e-05,3.9e-05,5e-05,3.3e-05,4.1e-05,6.1e-05,9.4e-05,2e-05,5.4e-05,2.4e-05,2.9e-05,3.7e-05,3e-05,3.5e-05,1.5e-05,4.4e-05,1.3e-05,2.8e-05,2.9e-05,3.5e-05,4.1e-05,2.7e-05,3.6e-05,2.8e-05,2.9e-05,1.7e-05,1e-06,9e-06,5e-05,4e-06,1.4e-05,4.8e-05,1.5e-05,2.2e-05,2.7e-05,1.2e-05,5e-06,3.1e-05,2.6e-05,2e-05,2e-05,1.7e-05,1.6e-05,1.8e-05,2.6e-05,1e-05,1.2e-05,2.4e-05,4e-06,2.2e-05,1.3e-05,1.8e-05,1.2e-05,2.3e-05,3.1e-05,1.4e-05,2.6e-05,1.2e-05,3.4e-05,9e-06,1e-05,1.2e-05,1.4e-05,1.1e-05,3.3e-05,2.1e-05,1.7e-05,2.8e-05,3.3e-05,3.2e-05,1.4e-05,1.6e-05,1.9e-05,1.8e-05,1.8e-05,9e-06,1.2e-05,1.9e-05,2e-05,1.1e-05,9e-06,2.4e-05
1.4e-05,1.2e-05,3e-06,1.7e-05,3.7e-05,4.7e-05,1.6e-05,1.2e-05,2.8e-05,2.1e-05,1.8e-05,3e-05,1.1e-05,6e-06,2e-05,1.2e-05,2.1e-05,3.3e-05,3e-05,3.4e-05,3.4e-05,1.1e-05,1.7e-05,1.1e-05,2.1e-05,3.8e-05,3.8e-05,2.5e-05,1.9e-05,1.7e-05,3.2e-05,4.9e-05,4.2e-05,6e-06,2e-05,6e-06,7.7e-05,1.7e-05,5e-06,5.7e-05,3.9e-05,5.2e-05,3.8e-05,3.6e-05,1.8e-05,0.00011,5.3e-05,5e-05,5.4e-05,6.7e-05,5.6e-05,2.9e-05,3.3e-05,8.2e-05,5.3e-05,3.3e-05,2.2e-05,1.8e-05,3.9e-05,1.8e-05,3.5e-05,2.9e-05,2e-05,3.8e-05,1.8e-05,3.1e-05,1.2e-05,4.5e-05,5.1e-05,7e-06,4e-05,3.4e-05,2.7e-05,1.1e-05,1e-05,9e-06,4e-05,1.5e-05,3e-05,1.8e-05,2.7e-05,8e-06,9e-06,2.2e-05,3.2e-05,1e-05,2.2e-05,6e-06,2e-05,3.2e-05,9e-06,5e-06,1.5e-05,9e-06,1.8e-05,8e-06,4e-06,4.4e-05,3.9e-05,2.9e-05,1.6e-05,6e-06,1.5e-05,2e-05,7e-06,2.2e-05,8e-06,2.8e-05,5.1e-05,4.6e-05,1.4e-05,1.9e-05,6e-06,9e-06,1.6e-05,1.1e-05,2e-05,2.5e-05,3e-05,2.5e-05,1.5e-05
2.9e-05,2.1e-05,1.9e-05,1.6e-05,3e-05,4e-06,3e-06,1.7e-05,2.7e-05,1.4e-05,1.6e-05,2.1e-05,2.4e-05,2.7e-05,1.4e-05,1.4e-05,4e-06,3.8e-05,4e-06,1.6e-05,2.4e-05,2e-05,2.4e-05,6e-06,5e-06,2.3e-05,2.8e-05,7e-06,1.6e-05,4e-06,2.5e-05,4e-05,8e-06,2.6e-05,3.3e-05,4.3e-05,8.4e-05,2.6e-05,3.4e-05,9e-05,0.000109,6.6e-05,4.7e-05,5.5e-05,6.5e-05,4.7e-05,5e-06,2.3e-05,2e-05,6.1e-05,2.2e-05,1.5e-05,2.1e-05,6.5e-05,2.9e-05,5.4e-05,4e-05,2.6e-05,2.7e-05,8e-06,8e-06,2.7e-05,1.8e-05,8e-06,2.1e-05,3.8e-05,6e-06,2.6e-05,1.8e-05,1.7e-05,2.3e-05,1.5e-05,4.4e-05,2.7e-05,2.8e-05,1.9e-05,2.7e-05,3.2e-05,3e-05,1.5e-05,3.2e-05,2.9e-05,2e-05,2e-05,3.3e-05,2.3e-05,8e-06,2.8e-05,1e-05,1.5e-05,1e-05,1.5e-05,1.5e-05,1.3e-05,1.3e-05,1e-05,1e-05,3.1e-05,1.9e-05,1.3e-05,2.8e-05,1.9e-05,2.6e-05,2.2e-05,2.1e-05,1.9e-05,1.7e-05,1.4e-05,1.1e-05,1.1e-05,2.1e-05,2.4e-05,1.6e-05,1.7e-05,7e-06,2.5e-05,1.4e-05,1.5e-05,2.7e-05,2e-05,1.8e-05
1e-05,1e-05,1e-06,1.3e-05,1.6e-05,1.1e-05,9e-06,2.1e-05,2.9e-05,7e-06,1.3e-05,1e-05,9e-06,2.8e-05,2.7e-05,6e-06,1.4e-05,2e-05,2.1e-05,1.2e-05,1.8e-05,2.7e-05,1e-05,1.5e-05,1.1e-05,1.6e-05,5.2e-05,2.6e-05,1e-05,2.4e-05,1.7e-05,2.2e-05,2.7e-05,2.5e-05,2.9e-05,9e-06,9.1e-05,3.5e-05,4.4e-05,4.7e-05,4.9e-05,3.3e-05,3.8e-05,7.8e-05,4.2e-05,8.7e-05,3.5e-05,1.4e-05,3.7e-05,2.2e-05,2.4e-05,5e-06,2.5e-05,1.2e-05,1.5e-05,3.4e-05,8e-06,1.1e-05,8e-06,1.6e-05,2.6e-05,2.2e-05,1.5e-05,1.3e-05,2.6e-05,2.8e-05,2.9e-05,1.7e-05,2.3e-05,2.4e-05,3.4e-05,2.1e-05,2.8e-05,1.4e-05,5e-05,3.1e-05,1.5e-05,2.5e-05,1.5e-05,1.1e-05,2.7e-05,1.3e-05,2.1e-05,2.9e-05,2.5e-05,1e-06,6e-06,3.5e-05,3.7e-05,5e-06,1.6e-05,8e-06,7e-06,2.7e-05,3e-06,1.4e-05,1e-05,1.5e-05,8e-06,1.3e-05,2.5e-05,8e-06,1.7e-05,3e-06,1.8e-05,2.1e-05,1.1e-05,6e-06,1e-05,2.1e-05,1e-05,3e-06,1.7e-05,1.1e-05,5e-06,1.8e-05,2.5e-05,2.5e-05,2.2e-05,1.2e-05,1.2e-05
2e-05,6e-06,5e-06,5e-06,1.5e-05,1.4e-05,1e-05,1.7e-05,1e-05,6e-06,1.9e-05,1.2e-05,2.2e-05,1.6e-05,2e-06,1.3e-05,2.2e-05,1.7e-05,9e-06,8e-06,9e-06,6e-06,6e-06,2.4e-05,3e-06,2.1e-05,3e-05,3e-06,6e-06,2e-05,1.7e-05,3.6e-05,0,2.7e-05,2.8e-05,1e-05,0.000128,8e-05,2.4e-05,5.1e-05,7.5e-05,6.1e-05,4.2e-05,1.6e-05,2.7e-05,8.7e-05,6.7e-05,3.5e-05,1.7e-05,3.6e-05,5.2e-05,5.3e-05,6.8e-05,5.3e-05,2.6e-05,4e-06,1e-05,1.5e-05,1.1e-05,8e-06,3.4e-05,3.1e-05,2.3e-05,2.9e-05,2.8e-05,1.2e-05,2.5e-05,5e-05,2.2e-05,3.3e-05,2.1e-05,3.9e-05,2.6e-05,1.2e-05,5.6e-05,1e-05,8e-06,1.7e-05,1.7e-05,1.7e-05,8e-06,1.8e-05,1.1e-05,2.1e-05,3.9e-05,3.4e-05,1.2e-05,8e-06,1.4e-05,2.5e-05,2e-05,7e-06,2e-05,3.4e-05,3e-05,3e-06,2e-05,3.6e-05,1.7e-05,1.2e-05,2.7e-05,3.2e-05,2.1e-05,2.1e-05,1.3e-05,2.1e-05,1.6e-05,6e-06,1.6e-05,1.4e-05,2.6e-05,1.4e-05,1e-05,1.9e-05,2.1e-05,2.3e-05,2.8e-05,1.2e-05,8e-06,1.9e-05,3.8e-05
1.2e-05,6e-06,2.4e-05,2.1e-05,3e-05,1e-05,3.1e-05,3.7e-05,3.3e-05,1.6e-05,2.1e-05,9e-06,2.4e-05,3e-05,1.8e-05,8e-06,2e-05,2.7e-05,2.4e-05,1.7e-05,2.1e-05,1.4e-05,8e-06,2.6e-05,3.4e-05,2.1e-05,4.1e-05,3.5e-05,9e-06,2.2e-05,2.7e-05,5e-05,6.6e-05,2.5e-05,1.3e-05,1.9e-05,0.000134,0.000116,1e-04,9.5e-05,0.000145,6.5e-05,5.7e-05,3.7e-05,7e-05,3.7e-05,1.4e-05,2.8e-05,7.7e-05,6.1e-05,4.6e-05,3e-06,7.6e-05,3e-05,2.5e-05,5.9e-05,2.8e-05,2.7e-05,2.5e-05,4.6e-05,4.7e-05,1.7e-05,3.8e-05,3.5e-05,3.4e-05,3.2e-05,3.9e-05,7e-05,5.4e-05,2.8e-05,1.1e-05,1.1e-05,4.1e-05,2.1e-05,5.1e-05,4.3e-05,3.3e-05,4.9e-05,2.3e-05,1e-05,1e-06,2.1e-05,3.2e-05,1.3e-05,2.7e-05,3.7e-05,4.6e-05,2.2e-05,2.6e-05,2.4e-05,2.4e-05,1.6e-05,3e-05,1.2e-05,2e-06,8e-06,8e-06,1.1e-05,1.9e-05,2e-05,3.7e-05,1.6e-05,1.4e-05,2.9e-05,3.3e-05,7e-06,7e-06,3e-06,1e-05,3.5e-05,1.8e-05,1.9e-05,1.8e-05,1.7e-05,2.1e-05,8e-06,4.7e-05,4.3e-05,2.3e-05,2.7e-05,5.3e-05
3.1e-05,2.4e-05,3.9e-05,3.4e-05,1.4e-05,9e-06,4.2e-05,3.2e-05,1e-05,1.1e-05,3.4e-05,3.2e-05,3.8e-05,4.5e-05,1.8e-05,1.6e-05,4e-06,1.3e-05,2.3e-05,1.6e-05,1.9e-05,2.4e-05,1.5e-05,2.6e-05,6e-06,8e-06,3.5e-05,3.3e-05,2.5e-05,1.3e-05,1.1e-05,4.1e-05,4.8e-05,3.7e-05,2.5e-05,1.6e-05,0.000104,5.6e-05,4.8e-05,1e-04,4.9e-05,3.9e-05,7.5e-05,8.5e-05,5.8e-05,8e-06,3.6e-05,3e-05,6.9e-05,1.9e-05,3.4e-05,4e-05,6e-05,4.6e-05,9e-06,4.1e-05,1.7e-05,1e-05,2.3e-05,3.5e-05,2.1e-05,3e-05,1.2e-05,2.8e-05,7e-05,3.4e-05,3.4e-05,7.2e-05,2.9e-05,3.4e-05,1.2e-05,1.9e-05,2e-05,1.9e-05,1.2e-05,1.5e-05,1.1e-05,3.9e-05,3.2e-05,2.5e-05,5e-06,1.6e-05,1.9e-05,2.1e-05,1.9e-05,2.5e-05,2.6e-05,7e-06,3e-05,3.3e-05,4.2e-05,3.7e-05,4.8e-05,2.2e-05,1.2e-05,1.1e-05,2.2e-05,1.8e-05,3.1e-05,4.5e-05,2.7e-05,2.6e-05,3e-05,2.1e-05,2.2e-05,2.2e-05,7e-06,1.2e-05,3e-06,3.2e-05,3.8e-05,4.2e-05,1.9e-05,3.4e-05,5e-06,8e-06,4.3e-05,1.7e-05,2.5e-05,3.1e-05,1.4e-05
1.5e-05,1.2e-05,1.8e-05,9e-06,1.2e-05,1.1e-05,3e-05,1.4e-05,1.5e-05,1.2e-05,1.5e-05,2e-06,1.7e-05,1.3e-05,8e-06,1.4e-05,1.1e-05,1.9e-05,2e-06,2.1e-05,4e-06,1.7e-05,9e-06,1e-05,1.6e-05,7e-06,1.2e-05,7e-06,1.4e-05,2.6e-05,1.9e-05,2.1e-05,1e-05,8e-06,1e-06,2.6e-05,5.7e-05,3.8e-05,7e-05,2.7e-05,5.1e-05,2.4e-05,9.9e-05,4e-05,1.6e-05,2.4e-05,5e-06,4.4e-05,4e-05,3.2e-05,3.8e-05,1.2e-05,1.2e-05,2e-06,3.1e-05,1.4e-05,1e-05,1.6e-05,1.9e-05,2.4e-05,6e-06,6e-06,2e-06,3.5e-05,4.1e-05,5.5e-05,3.1e-05,3.8e-05,2.8e-05,5.2e-05,2.7e-05,1e-05,2.7e-05,1.9e-05,1.2e-05,1e-05,2.1e-05,2.6e-05,8e-06,1.8e-05,1.4e-05,2e-05,7e-06,1e-05,1.8e-05,1.9e-05,1e-05,1.1e-05,3.1e-05,1e-05,2.6e-05,2.4e-05,5e-06,5e-06,1.3e-05,1.8e-05,2.6e-05,4e-06,2.8e-05,4.4e-05,3e-05,2.4e-05,1.4e-05,2e-06,3.3e-05,1.3e-05,8e-06,1.5e-05,2e-06,2.2e-05,2.4e-05,1.5e-05,7e-06,2.7e-05,2.6e-05,8e-06,2.7e-05,2.6e-05,2e-05,1.3e-05,6e-06
1.6e-05,8e-06,2e-06,3e-06,8e-06,5e-06,1.4e-05,1.5e-05,1e-05,1.3e-05,1.5e-05,1.3e-05,7e-06,6e-06,8e-06,1.2e-05,6e-06,8e-06,1.2e-05,9e-06,7e-06,1.3e-05,7e-06,8e-06,1.7e-05,1e-05,1.1e-05,6e-06,1.8e-05,1e-05,1.2e-05,2.7e-05,2.1e-05,1.4e-05,1.7e-05,4.2e-05,1.6e-05,1.5e-05,3e-05,4.4e-05,6.2e-05,2.3e-05,7.1e-05,5.9e-05,9e-06,4.1e-05,1.2e-05,3.2e-05,3.1e-05,4.3e-05,3.5e-05,3.7e-05,1.2e-05,1.5e-05,3.1e-05,2.7e-05,1.6e-05,1.6e-05,3.3e-05,9e-06,1.7e-05,9e-06,1.6e-05,2e-05,1.5e-05,1e-05,2e-06,1.7e-05,1.6e-05,1.7e-05,1.4e-05,1.5e-05,2.4e-05,1.1e-05,1.4e-05,1.1e-05,5e-06,1.6e-05,2.4e-05,1.6e-05,2e-05,2.5e-05,1.5e-05,3e-06,2.1e-05,2.7e-05,2.9e-05,5e-06,8e-06,1.6e-05,4e-06,1.2e-05,1.6e-05,1.2e-05,1.2e-05,1e-05,2e-06,6e-06,2.1e-05,1.1e-05,4e-06,1.1e-05,2.8e-05,3e-06,2.2e-05,1.9e-05,1.2e-05,1.5e-05,1.6e-05,5e-06,1.5e-05,2e-06,1.4e-05,9e-06,8e-06,1.2e-05,2.5e-05,2e-05,1.5e-05,1.2e-05,8e-06
1.4e-05,1.5e-05,8e-06,5e-06,4e-06,3e-06,8e-06,4e-06,7e-06,1e-06,6e-06,6e-06,1.1e-05,5e-06,9e-06,3e-06,3e-06,4e-06,4e-06,9e-06,3e-06,3e-06,2e-06,5e-06,5e-06,1.1e-05,1e-06,2e-06,1.1e-05,9e-06,5e-06,5e-06,1.1e-05,4e-06,1.1e-05,2.2e-05,2.7e-05,9e-06,1.9e-05,9e-06,5e-06,1.5e-05,2.6e-05,3e-06,1e-05,1.6e-05,9e-06,1.1e-05,8e-06,5e-06,7e-06,8e-06,4e-06,9e-06,1.9e-05,7e-06,7e-06,9e-06,1.5e-05,1.6e-05,8e-06,7e-06,3e-06,1.1e-05,8e-06,1.3e-05,8e-06,5e-06,2e-06,5e-06,5e-06,5e-06,9e-06,3e-06,7e-06,7e-06,3e-06,2e-06,8e-06,5e-06,7e-06,5e-06,1e-06,8e-06,8e-06,8e-06,1.3e-05,5e-06,4e-06,1.1e-05,8e-06,4e-06,1e-05,1e-06,2e-06,3e-06,5e-06,5e-06,8e-06,2e-06,6e-06,1e-06,1e-05,1e-05,7e-06,4e-06,4e-06,4e-06,5e-06,4e-06,2e-06,1e-06,6e-06,4e-06,3e-06,3e-06,8e-06,3e-06,6e-06,4e-06,7e-06
1.3e-05,4e-06,2e-06,3e-06,2e-06,4e-06,0,4e-06,8e-06,2e-06,7e-06,3e-06,1.3e-05,6e-06,7e-06,1e-05,5e-06,1e-06,3e-06,6e-06,4e-06,2e-06,4e-06,7e-06,4e-06,9e-06,8e-06,6e-06,3e-06,2e-06,3e-06,2e-06,5e-06,7e-06,8e-06,1.6e-05,7e-06,1.5e-05,7e-06,1.5e-05,1.3e-05,1.3e-05,1.4e-05,1e-05,1.9e-05,1.8e-05,1e-06,1.2e-05,1.3e-05,1.3e-05,9e-06,4e-06,5e-06,1.5e-05,1.1e-05,1e-05,8e-06,1.1e-05,1.8e-05,2.2e-05,1.6e-05,5e-06,6e-06,5e-06,5e-06,1.2e-05,4e-06,4e-06,5e-06,1.1e-05,6e-06,1e-06,1.2e-05,7e-06,4e-06,9e-06,5e-06,2e-06,6e-06,5e-06,6e-06,8e-06,2e-06,6e-06,1.1e-05,3e-06,7e-06,2e-06,3e-06,5e-06,3e-06,2e-06,6e-06,7e-06,2e-06,7e-06,6e-06,1e-06,6e-06,1e-06,9e-06,7e-06,3e-06,4e-06,5e-06,5e-06,3e-06,5e-06,1e-06,2e-06,4e-06,3e-06,1e-06,2e-06,4e-06,4e-06,1e-06,3e-06,2e-06,6e-06,1e-05
8e-06,1.2e-05,8e-06,4e-06,1e-06,5e-06,5e-06,4e-06,7e-06,5e-06,7e-06,8e-06,8e-06,0,7e-06,2e-06,3e-06,2e-06,2e-06,4e-06,4e-06,4e-06,4e-06,3e-06,2e-06,7e-06,3e-06,7e-06,1e-06,6e-06,3e-06,2e-06,5e-06,3e-06,6e-06,9e-06,1e-05,1e-05,1.6e-05,2e-05,3.5e-05,3.9e-05,2.1e-05,3e-06,2.5e-05,2.4e-05,2e-05,2.3e-05,1.6e-05,9e-06,1.2e-05,6e-06,6e-06,1.7e-05,3e-06,1.6e-05,1.1e-05,9e-06,1.2e-05,1.6e-05,4e-06,1.8e-05,5e-06,4e-06,5e-06,4e-06,6e-06,1e-05,1e-05,2e-06,7e-06,6e-06,1.3e-05,2e-06,9e-06,3e-06,6e-06,5e-06,1e-06,2e-06,3e-06,2e-06,2e-06,4e-06,8e-06,5e-06,5e-06,6e-06,0,1e-06,2e-06,5e-06,2e-06,5e-06,9e-06,4e-06,1.2e-05,8e-06,6e-06,4e-06,4e-06,4e-06,3e-06,6e-06,7e-06,6e-06,6e-06,7e-06,8e-06,4e-06,7e-06,3e-06,2e-06,4e-06,7e-06,7e-06,7e-06,3e-06,2e-06,7e-06,4e-06
1.6e-05,1.7e-05,9e-06,1.3e-05,7e-06,8e-06,1.2e-05,1.1e-05,9e-06,8e-06,6e-06,7e-06,8e-06,1e-05,9e-06,8e-06,7e-06,6e-06,7e-06,1.3e-05,3e-06,6e-06,1.2e-05,9e-06,8e-06,7e-06,8e-06,1.4e-05,1e-05,8e-06,5e-06,6e-06,1e-05,3e-06,8e-06,1e-05,1e-06,1e-05,1.2e-05,1.4e-05,2.2e-05,3.4e-05,2.4e-05,1.5e-05,1.6e-05,9e-06,1e-05,2.3e-05,2.5e-05,1.5e-05,3e-06,0,7e-06,1.8e-05,1.1e-05,1.9e-05,2.1e-05,1.6e-05,6e-06,1.5e-05,3e-06,1.5e-05,1e-05,1.3e-05,1.1e-05,5e-06,6e-06,1.3e-05,1.5e-05,2.1e-05,1.6e-05,1e-05,1.5e-05,7e-06,1e-05,2e-06,8e-06,1e-05,1e-06,3e-06,2e-06,2e-06,2e-06,1e-05,4e-06,7e-06,1e-05,1.2e-05,9e-06,3e-06,5e-06,9e-06,8e-06,5e-06,6e-06,5e-06,8e-06,6e-06,8e-06,7e-06,0,4e-06,4e-06,7e-06,7e-06,4e-06,3e-06,6e-06,8e-06,1.2e-05,1.5e-05,9e-06,5e-06,7e-06,7e-06,8e-06,1e-06,4e-06,9e-06,9e-06,1e-05
1e-05,4e-06,6e-06,4e-06,5e-06,4e-06,3e-06,5e-06,8e-06,2e-06,8e-06,3e-06,2e-06,5e-06,6e-06,3e-06,3e-06,6e-06,2e-06,7e-06,8e-06,2e-06,9e-06,6e-06,4e-06,8e-06,7e-06,5e-06,7e-06,6e-06,2e-06,6e-06,3e-06,6e-06,4e-06,0,1.1e-05,6e-06,9e-06,1.1e-05,2e-05,1.7e-05,9e-06,1.4e-05,2e-05,8e-06,1.4e-05,2.3e-05,2.2e-05,2.3e-05,1.3e-05,5e-06,1.3e-05,5e-06,1.2e-05,9e-06,2.3e-05,1.3e-05,1.2e-05,1.3e-05,1.7e-05,8e-06,7e-06,5e-06,6e-06,6e-06,7e-06,2e-06,1.2e-05,1.8e-05,1.1e-05,3e-06,9e-06,6e-06,2e-06,3e-06,7e-06,4e-06,7e-06,4e-06,3e-06,4e-06,6e-06,6e-06,8e-06,2e-06,2e-06,6e-06,4e-06,5e-06,5e-06,6e-06,7e-06,5e-06,4e-06,1e-06,4e-06,7e-06,6e-06,3e-06,4e-06,4e-06,3e-06,4e-06,3e-06,2e-06,2e-06,4e-06,2e-06,4e-06,9e-06,3e-06,4e-06,2e-06,1e-06,7e-06,9e-06,5e-06,5e-06,4e-06,1e-06
8e-06,5e-06,3e-06,6e-06,1e-06,3e-06,3e-06,2e-06,4e-06,3e-06,6e-06,2e-06,3e-06,3e-06,3e-06,6e-06,2e-06,3e-06,1e-06,2e-06,3e-06,2e-06,2e-06,5e-06,6e-06,6e-06,2e-06,3e-06,4e-06,2e-06,4e-06,5e-06,2e-06,4e-06,1e-06,5e-06,1.6e-05,2e-06,1e-05,8e-06,1.1e-05,2e-05,1.6e-05,9e-06,1.7e-05,9e-06,9e-06,2.1e-05,1.5e-05,9e-06,5e-06,7e-06,1.3e-05,1.2e-05,1e-05,1e-06,1.2e-05,8e-06,6e-06,1.1e-05,5e-06,3e-06,2e-06,3e-06,4e-06,2e-06,3e-06,3e-06,6e-06,9e-06,1e-05,3e-06,8e-06,4e-06,1e-05,1e-06,4e-06,2e-06,4e-06,3e-06,2e-06,5e-06,3e-06,6e-06,3e-06,3e-06,6e-06,3e-06,1e-06,1e-06,1e-06,3e-06,4e-06,4e-06,4e-06,1e-06,2e-06,1e-06,7e-06,2e-06,1e-06,3e-06,4e-06,3e-06,2e-06,2e-06,2e-06,3e-06,2e-06,1e-06,4e-06,3e-06,5e-06,2e-06,2e-06,5e-06,5e-06,2e-06,4e-06,3e-06,2e-06
9e-06,4e-06,5e-06,7e-06,6e-06,7e-06,4e-06,4e-06,7e-06,2e-06,4e-06,3e-06,4e-06,3e-06,1e-06,3e-06,2e-06,5e-06,3e-06,5e-06,1e-06,4e-06,5e-06,5e-06,8e-06,9e-06,5e-06,2e-06,4e-06,1e-06,2e-06,4e-06,6e-06,5e-06,2e-06,4e-06,1.2e-05,2e-06,7e-06,5e-06,2.2e-05,1.1e-05,4e-06,9e-06,1.2e-05,3e-06,2e-06,9e-06,6e-06,1e-05,6e-06,9e-06,6e-06,2e-06,4e-06,8e-06,3e-06,6e-06,9e-06,1e-05,8e-06,4e-06,1e-06,1e-06,5e-06,2e-06,2e-06,3e-06,7e-06,1e-05,1e-05,2e-06,1e-05,2e-06,8e-06,3e-06,0,1e-06,4e-06,3e-06,3e-06,4e-06,5e-06,4e-06,1e-06,4e-06,7e-06,3e-06,3e-06,2e-06,6e-06,7e-06,4e-06,3e-06,3e-06,2e-06,4e-06,1e-06,2e-06,5e-06,1e-06,2e-06,4e-06,3e-06,2e-06,2e-06,1e-06,2e-06,3e-06,3e-06,3e-06,2e-06,3e-06,2e-06,1e-06,1e-06,7e-06,3e-06,2e-06,4e-06,4e-06
5e-06,2e-06,4e-06,5e-06,4e-06,5e-06,2e-06,3e-06,6e-06,0,2e-06,1e-06,3e-06,3e-06,3e-06,3e-06,1e-06,4e-06,3e-06,3e-06,2e-06,4e-06,2e-06,3e-06,7e-06,6e-06,5e-06,2e-06,1e-06,5e-06,1e-06,2e-06,8e-06,5e-06,1e-06,3e-06,1.6e-05,5e-06,4e-06,4e-06,2.5e-05,1.6e-05,9e-06,1.1e-05,1.4e-05,9e-06,1e-05,1.1e-05,5e-06,1.2e-05,6e-06,3e-06,7e-06,6e-06,1e-06,1e-06,2e-06,6e-06,6e-06,6e-06,4e-06,1e-06,3e-06,4e-06,4e-06,3e-06,3e-06,2e-06,4e-06,1.1e-05,6e-06,4e-06,4e-06,3e-06,5e-06,4e-06,6e-06,4e-06,1e-06,1e-06,0,3e-06,4e-06,4e-06,2e-06,4e-06,3e-06,2e-06,2e-06,1e-06,5e-06,4e-06,4e-06,0,1e-06,2e-06,3e-06,3e-06,2e-06,3e-06,3e-06,1e-06,3e-06,4e-06,3e-06,2e-06,0,1e-06,2e-06,1e-06,1e-06,2e-06,6e-06,2e-06,2e-06,3e-06,5e-06,2e-06,1e-06,2e-06,1e-06
4e-06,2e-06,6e-06,3e-06,2e-06,4e-06,3e-06,3e-06,5e-06,2e-06,2e-06,2e-06,3e-06,2e-06,2e-06,1e-06,1e-06,4e-06,1e-06,1e-06,3e-06,1e-06,1e-06,2e-06,7e-06,7e-06,4e-06,1e-06,1e-06,1e-06,3e-06,1e-06,7e-06,3e-06,1e-06,2e-06,1.6e-05,9e-06,9e-06,3e-06,1.4e-05,5e-06,1e-06,1.4e-05,2.2e-05,5e-06,1.6e-05,8e-06,1.4e-05,9e-06,3e-06,6e-06,5e-06,5e-06,5e-06,5e-06,7e-06,7e-06,2e-06,6e-06,4e-06,1e-06,2e-06,1e-06,3e-06,2e-06,2e-06,4e-06,6e-06,9e-06,8e-06,4e-06,6e-06,1e-06,5e-06,1e-06,6e-06,1e-06,3e-06,1e-06,3e-06,3e-06,1e-06,4e-06,3e-06,4e-06,5e-06,4e-06,1e-06,2e-06,4e-06,6e-06,2e-06,1e-06,1e-06,1e-06,2e-06,2e-06,2e-06,1e-06,1e-06,1e-06,4e-06,1e-06,1e-06,2e-06,2e-06,1e-06,2e-06,1e-06,3e-06,3e-06,3e-06,1e-06,1e-06,1e-06,1e-06,2e-06,2e-06,2e-06,2e-06
7e-06,2e-06,4e-06,4e-06,1e-06,2e-06,2e-06,2e-06,4e-06,2e-06,2e-06,1e-06,3e-06,1e-06,3e-06,4e-06,2e-06,5e-06,2e-06,5e-06,2e-06,1e-06,4e-06,5e-06,8e-06,7e-06,4e-06,3e-06,5e-06,7e-06,6e-06,3e-06,6e-06,4e-06,2e-06,2e-06,1.2e-05,1e-06,5e-06,2e-06,1.2e-05,4e-06,1e-06,1.1e-05,1.7e-05,3e-06,4e-06,4e-06,1.2e-05,8e-06,7e-06,7e-06,8e-06,8e-06,3e-06,6e-06,1e-06,6e-06,6e-06,4e-06,3e-06,4e-06,4e-06,5e-06,3e-06,2e-06,3e-06,4e-06,4e-06,6e-06,6e-06,4e-06,8e-06,5e-06,7e-06,3e-06,4e-06,4e-06,5e-06,3e-06,1e-06,2e-06,4e-06,4e-06,4e-06,4e-06,3e-06,2e-06,3e-06,1e-06,1e-06,5e-06,3e-06,2e-06,2e-06,2e-06,3e-06,5e-06,1e-06,4e-06,5e-06,3e-06,2e-06,1e-06,2e-06,2e-06,3e-06,2e-06,1e-06,1e-06,2e-06,5e-06,5e-06,1e-06,2e-06,2e-06,3e-06,2e-06,2e-06,1e-06,2e-06
9e-06,4e-06,3e-06,3e-06,1e-06,5e-06,3e-06,1e-06,5e-06,2e-06,2e-06,2e-06,3e-06,2e-06,0,3e-06,1e-06,4e-06,4e-06,2e-06,4e-06,2e-06,5e-06,2e-06,3e-06,6e-06,3e-06,3e-06,5e-06,4e-06,1e-06,1e-06,5e-06,4e-06,4e-06,1e-06,5e-06,8e-06,7e-06,5e-06,1.4e-05,1.4e-05,1.1e-05,1e-05,9e-06,1.6e-05,3e-06,5e-06,5e-06,1.3e-05,9e-06,4e-06,0,7e-06,2e-06,3e-06,1e-06,7e-06,0,7e-06,4e-06,4e-06,3e-06,1e-06,2e-06,2e-06,3e-06,1e-05,7e-06,5e-06,8e-06,1e-06,6e-06,4e-06,1e-06,4e-06,3e-06,2e-06,2e-06,2e-06,1e-06,3e-06,5e-06,6e-06,2e-06,3e-06,3e-06,2e-06,4e-06,3e-06,3e-06,4e-06,3e-06,2e-06,2e-06,3e-06,0,2e-06,2e-06,2e-06,2e-06,3e-06,4e-06,1e-06,1e-06,1e-06,1e-06,2e-06,1e-06,0,2e-06,4e-06,3e-06,1e-06,2e-06,3e-06,3e-06,2e-06,2e-06,0,2e-06
6e-06,2e-06,3e-06,1e-06,2e-06,4e-06,4e-06,2e-06,2e-06,3e-06,1e-06,3e-06,3e-06,2e-06,1e-06,2e-06,1e-06,5e-06,4e-06,2e-06,3e-06,2e-06,5e-06,3e-06,5e-06,4e-06,5e-06,2e-06,4e-06,5e-06,2e-06,2e-06,4e-06,4e-06,5e-06,3e-06,9e-06,5e-06,3e-06,6e-06,1.5e-05,1.1e-05,3e-06,7e-06,1.6e-05,7e-06,8e-06,6e-06,6e-06,8e-06,1e-06,3e-06,3e-06,5e-06,7e-06,3e-06,3e-06,4e-06,4e-06,2e-06,6e-06,5e-06,2e-06,0,2e-06,2e-06,1e-06,5e-06,5e-06,8e-06,8e-06,3e-06,6e-06,2e-06,4e-06,1e-06,4e-06,2e-06,2e-06,2e-06,2e-06,1e-06,4e-06,3e-06,2e-06,3e-06,4e-06,3e-06,3e-06,3e-06,3e-06,2e-06,1e-06,2e-06,1e-06,1e-06,1e-06,3e-06,1e-06,1e-06,3e-06,2e-06,3e-06,1e-06,1e-06,2e-06,2e-06,3e-06,2e-06,2e-06,4e-06,2e-06,4e-06,1e-06,2e-06,4e-06,4e-06,1e-06,1e-06,2e-06,2e-06
5e-06,4e-06,2e-06,3e-06,2e-06,1e-06,4e-06,3e-06,6e-06,3e-06,0,5e-06,6e-06,4e-06,3e-06,2e-06,2e-06,4e-06,2e-06,6e-06,3e-06,2e-06,7e-06,5e-06,1e-06,3e-06,4e-06,5e-06,4e-06,1e-06,2e-06,2e-06,4e-06,7e-06,2e-06,4e-06,1.1e-05,6e-06,7e-06,5e-06,1.3e-05,1e-05,6e-06,1.2e-05,1.7e-05,6e-06,3e-06,1.4e-05,7e-06,1.6e-05,8e-06,8e-06,3e-06,5e-06,3e-06,7e-06,3e-06,9e-06,8e-06,2e-06,4e-06,1e-06,5e-06,4e-06,3e-06,3e-06,2e-06,3e-06,4e-06,6e-06,5e-06,2e-06,8e-06,4e-06,4e-06,2e-06,5e-06,4e-06,1e-06,3e-06,4e-06,4e-06,3e-06,2e-06,3e-06,3e-06,3e-06,3e-06,4e-06,4e-06,6e-06,5e-06,2e-06,2e-06,3e-06,3e-06,1e-06,3e-06,1e-06,2e-06,1e-06,2e-06,2e-06,1e-06,2e-06,2e-06,3e-06,3e-06,2e-06,1e-06,3e-06,5e-06,2e-06,0,2e-06,3e-06,4e-06,1e-06,0,1e-06,1e-06
5e-06,5e-06,3e-06,2e-06,2e-06,3e-06,2e-06,4e-06,4e-06,0,3e-06,2e-06,1e-06,1e-06,1e-06,3e-06,3e-06,2e-06,2e-06,2e-06,1e-06,0,3e-06,2e-06,6e-06,2e-06,4e-06,2e-06,3e-06,3e-06,1e-06,4e-06,3e-06,5e-06,2e-06,4e-06,1.3e-05,5e-06,7e-06,3e-06,1e-05,1.7e-05,6e-06,3e-06,2e-05,2e-06,1e-05,1e-05,1.4e-05,9e-06,5e-06,6e-06,7e-06,3e-06,1e-06,6e-06,6e-06,6e-06,4e-06,2e-06,3e-06,5e-06,3e-06,2e-06,1e-06,1e-06,2e-06,4e-06,3e-06,6e-06,5e-06,1e-06,8e-06,3e-06,5e-06,3e-06,4e-06,2e-06,1e-06,1e-06,2e-06,1e-06,4e-06,3e-06,5e-06,1e-06,4e-06,1e-06,3e-06,3e-06,4e-06,2e-06,3e-06,2e-06,3e-06,2e-06,0,1e-06,3e-06,3e-06,3e-06,2e-06,2e-06,1e-06,2e-06,2e-06,1e-06,2e-06,1e-06,1e-06,3e-06,1e-06,3e-06,2e-06,2e-06,2e-06,3e-06,1e-06,1e-06,1e-06,1e-06
5e-06,2e-06,4e-06,1e-06,1e-06,3e-06,3e-06,1e-06,1e-06,2e-06,4e-06,4e-06,2e-06,1e-06,2e-06,2e-06,0,5e-06,2e-06,2e-06,2e-06,1e-06,3e-06,1e-06,6e-06,4e-06,2e-06,3e-06,3e-06,1e-06,1e-06,5e-06,3e-06,4e-06,3e-06,2e-06,1e-05,5e-06,4e-06,4e-06,1.4e-05,3e-06,7e-06,9e-06,2.8e-05,1.7e-05,6e-06,4e-06,1e-05,4e-06,5e-06,3e-06,5e-06,2e-06,1e-06,9e-06,2e-06,5e-06,4e-06,5e-06,1e-06,2e-06,2e-06,3e-06,1e-06,1e-06,2e-06,4e-06,4e-06,6e-06,5e-06,1e-06,8e-06,1e-06,2e-06,1e-06,1e-06,5e-06,0,1e-06,2e-06,2e-06,2e-06,3e-06,5e-06,2e-06,4e-06,1e-06,2e-06,1e-06,4e-06,4e-06,3e-06,1e-06,3e-06,1e-06,2e-06,2e-06,1e-06,3e-06,2e-06,2e-06,1e-06,1e-06,1e-06,2e-06,2e-06,1e-06,2e-06,2e-06,1e-06,3e-06,3e-06,1e-06,2e-06,2e-06,3e-06,1e-06,2e-06,2e-06,1e-06
5e-06,3e-06,4e-06,4e-06,3e-06,2e-06,3e-06,3e-06,5e-06,4e-06,2e-06,3e-06,2e-06,3e-06,4e-06,4e-06,5e-06,5e-06,6e-06,4e-06,4e-06,4e-06,7e-06,4e-06,8e-06,2e-06,4e-06,4e-06,5e-06,7e-06,1e-06,4e-06,7e-06,6e-06,4e-06,3e-06,9e-06,7e-06,1e-05,5e-06,1.2e-05,1e-05,9e-06,8e-06,3.4e-05,1.3e-05,5e-06,6e-06,6e-06,5e-06,3e-06,2e-06,5e-06,5e-06,3e-06,9e-06,5e-06,1e-06,1e-05,6e-06,2e-06,3e-06,1e-06,3e-06,3e-06,2e-06,1e-06,4e-06,4e-06,5e-06,6e-06,1e-06,7e-06,1e-06,3e-06,0,3e-06,3e-06,2e-06,3e-06,3e-06,2e-06,3e-06,2e-06,2e-06,2e-06,4e-06,3e-06,1e-06,1e-06,5e-06,4e-06,2e-06,1e-06,3e-06,1e-06,3e-06,2e-06,2e-06,1e-06,3e-06,1e-06,3e-06,2e-06,2e-06,3e-06,1e-06,1e-06,1e-06,2e-06,2e-06,0,3e-06,2e-06,1e-06,1e-06,3e-06,2e-06,1e-06,2e-06,2e-06
2e-06,1e-06,1e-06,1e-06,1e-06,3e-06,2e-06,0,7e-06,1e-06,1e-06,3e-06,3e-06,1e-06,2e-06,2e-06,4e-06,2e-06,2e-06,4e-06,4e-06,4e-06,0,2e-06,2e-06,6e-06,1e-06,2e-06,2e-06,2e-06,4e-06,1e-06,5e-06,5e-06,3e-06,1e-06,1e-05,5e-06,3e-06,5e-06,1e-06,2e-06,3e-06,1.3e-05,1.6e-05,7e-06,5e-06,2e-06,4e-06,5e-06,4e-06,5e-06,5e-06,2e-06,1e-06,6e-06,4e-06,6e-06,5e-06,4e-06,3e-06,2e-06,3e-06,2e-06,1e-06,3e-06,2e-06,3e-06,3e-06,7e-06,3e-06,2e-06,8e-06,3e-06,3e-06,1e-06,4e-06,3e-06,1e-06,1e-06,1e-06,2e-06,2e-06,2e-06,0,1e-06,4e-06,1e-06,1e-06,2e-06,5e-06,2e-06,3e-06,1e-06,4e-06,1e-06,2e-06,2e-06,1e-06,0,1e-06,1e-06,3e-06,1e-06,1e-06,2e-06,0,0,2e-06,2e-06,1e-06,2e-06,2e-06,1e-06,1e-06,1e-06,3e-06,2e-06,1e-06,2e-06,1e-06
3e-06,1e-06,2e-06,1e-06,1e-06,3e-06,1e-06,1e-06,5e-06,1e-06,2e-06,1e-06,2e-06,1e-06,0,1e-06,1e-06,2e-06,2e-06,2e-06,4e-06,2e-06,1e-06,2e-06,3e-06,4e-06,2e-06,1e-06,2e-06,3e-06,3e-06,1e-06,4e-06,5e-06,2e-06,1e-06,1.1e-05,1e-06,2e-06,4e-06,3e-06,2e-06,3e-06,1.2e-05,1.5e-05,6e-06,2e-06,4e-06,6e-06,2e-06,1e-06,3e-06,2e-06,2e-06,1e-06,6e-06,1e-06,4e-06,6e-06,3e-06,3e-06,1e-06,1e-06,1e-06,2e-06,2e-06,1e-06,3e-06,4e-06,8e-06,5e-06,2e-06,6e-06,2e-06,4e-06,0,2e-06,2e-06,1e-06,0,1e-06,2e-06,2e-06,2e-06,1e-06,0,3e-06,1e-06,1e-06,1e-06,4e-06,3e-06,2e-06,0,3e-06,1e-06,1e-06,3e-06,2e-06,0,2e-06,1e-06,2e-06,1e-06,2e-06,2e-06,0,0,1e-06,1e-06,1e-06,2e-06,2e-06,1e-06,1e-06,1e-06,3e-06,2e-06,1e-06,1e-06,0
4e-06,0,1e-06,1e-06,0,3e-06,1e-06,1e-06,4e-06,0,1e-06,0,1e-06,1e-06,0,0,1e-06,2e-06,1e-06,3e-06,3e-06,2e-06,1e-06,1e-06,3e-06,4e-06,2e-06,1e-06,1e-06,3e-06,2e-06,0,3e-06,4e-06,2e-06,2e-06,1.2e-05,2e-06,4e-06,4e-06,3e-06,1e-06,2e-06,1.1e-05,1.4e-05,6e-06,1e-06,5e-06,5e-06,4e-06,1e-06,4e-06,2e-06,1e-06,1e-06,6e-06,2e-06,4e-06,6e-06,2e-06,3e-06,1e-06,1e-06,1e-06,1e-06,1e-06,1e-06,4e-06,3e-06,7e-06,4e-06,2e-06,7e-06,1e-06,3e-06,1e-06,2e-06,2e-06,1e-06,1e-06,1e-06,2e-06,3e-06,2e-06,2e-06,0,4e-06,1e-06,0,1e-06,3e-06,3e-06,2e-06,0,2e-06,1e-06,1e-06,2e-06,1e-06,0,1e-06,2e-06,2e-06,0,1e-06,2e-06,0,0,1e-06,0,1e-06,1e-06,2e-06,0,1e-06,1e-06,3e-06,2e-06,0,1e-06,1e-06
4e-06,0,1e-06,0,1e-06,2e-06,0,1e-06,5e-06,0,2e-06,0,2e-06,1e-06,1e-06,0,1e-06,2e-06,0,3e-06,3e-06,2e-06,2e-06,1e-06,3e-06,4e-06,2e-06,1e-06,1e-06,2e-06,2e-06,0,3e-06,4e-06,2e-06,1e-06,1.2e-05,1e-06,5e-06,3e-06,2e-06,2e-06,1e-06,1.1e-05,1.5e-05,7e-06,0,5e-06,6e-06,3e-06,0,3e-06,1e-06,1e-06,1e-06,5e-06,1e-06,3e-06,5e-06,3e-06,2e-06,1e-06,1e-06,1e-06,1e-06,1e-06,1e-06,4e-06,3e-06,7e-06,4e-06,2e-06,7e-06,1e-06,3e-06,0,2e-06,2e-06,1e-06,1e-06,2e-06,2e-06,2e-06,2e-06,1e-06,0,4e-06,1e-06,0,1e-06,3e-06,3e-06,2e-06,0,2e-06,1e-06,1e-06,2e-06,2e-06,1e-06,1e-06,1e-06,2e-06,0,1e-06,2e-06,0,0,1e-06,0,1e-06,2e-06,3e-06,1e-06,0,1e-06,3e-06,2e-06,1e-06,1e-06,0
