0.005457,0.008679,0.019025,0.039981,0.136827,0.31343,0.50647,0.542261,0.485014,0.366412,0.219368,0.154102,0.074842,0.039342,0.059581,0.077436,0.098681,0.125892,0.090293,0.148283,0.322721,0.306419,0.176816,0.100265,0.052619,0.034521,0.021145,0.017567
0.006709,0.010216,0.021595,0.050313,0.174374,0.383619,0.601358,0.629052,0.552373,0.419771,0.256322,0.181405,0.089721,0.048515,0.070721,0.090021,0.116666,0.150407,0.108778,0.179876,0.383228,0.359167,0.205993,0.117819,0.062897,0.041546,0.025422,0.021286
0.00873,0.012472,0.02457,0.06794,0.240382,0.495036,0.737254,0.754001,0.650371,0.499583,0.3141,0.220713,0.112118,0.063215,0.086133,0.105551,0.146512,0.197211,0.143488,0.229842,0.471339,0.432005,0.245597,0.143626,0.08069,0.054077,0.032246,0.026735
0.010007,0.013767,0.024599,0.082654,0.296012,0.561996,0.783092,0.812686,0.722766,0.559635,0.351874,0.236948,0.124245,0.072803,0.090214,0.104448,0.175393,0.25983,0.184657,0.258738,0.506823,0.449417,0.250335,0.15495,0.096261,0.064906,0.0366,0.029333
0.010436,0.014491,0.02384,0.091694,0.324025,0.571334,0.756455,0.86,0.845659,0.634584,0.365017,0.231998,0.126238,0.076436,0.083956,0.088342,0.199302,0.326584,0.223104,0.260088,0.48092,0.402487,0.215083,0.152052,0.112443,0.075157,0.039066,0.029625
0.010874,0.015892,0.026053,0.100179,0.34127,0.598746,0.783272,1.025652,1.162018,0.810242,0.365523,0.210528,0.119822,0.07769,0.076003,0.068813,0.207997,0.363169,0.243903,0.271576,0.478586,0.372184,0.187326,0.155712,0.132988,0.085877,0.042425,0.031509
0.011868,0.018653,0.031986,0.11206,0.380271,0.700242,0.933146,1.424552,1.846561,1.246496,0.433473,0.206868,0.124942,0.085194,0.074692,0.059241,0.199279,0.354706,0.250648,0.332457,0.578191,0.444365,0.222508,0.190976,0.169102,0.102628,0.047953,0.037039
0.01364,0.022003,0.039788,0.13136,0.462795,0.874991,1.183308,2.191522,3.222703,2.218954,0.701105,0.285986,0.180097,0.118099,0.091344,0.067334,0.192176,0.335626,0.261888,0.43814,0.768572,0.599349,0.29278,0.243713,0.226691,0.134093,0.057733,0.045303
0.016589,0.025297,0.045409,0.14887,0.574535,1.111768,1.536757,3.454899,5.493509,3.849532,1.219973,0.46415,0.295012,0.183917,0.123297,0.087331,0.207104,0.34656,0.288408,0.574301,1.035304,0.810942,0.370382,0.293471,0.290221,0.172302,0.068171,0.055027
0.021369,0.029869,0.048574,0.164986,0.709603,1.370053,1.9258,5.078278,8.442049,6.011907,1.970279,0.716649,0.445396,0.27084,0.162558,0.1136,0.230349,0.361771,0.312522,0.687598,1.269209,1.002249,0.435524,0.333383,0.344512,0.202431,0.073275,0.0617
0.025872,0.033925,0.049661,0.194991,0.874991,1.6119,2.29071,6.640216,11.288896,8.188724,2.778648,0.967685,0.577268,0.345874,0.194546,0.140627,0.240856,0.347266,0.313231,0.716591,1.359846,1.117336,0.491831,0.36396,0.377395,0.221133,0.077527,0.06465
0.026295,0.032763,0.045348,0.227964,1.010215,1.761316,2.476915,7.256767,12.497266,9.280839,3.240026,1.092348,0.623341,0.367435,0.19934,0.151096,0.241296,0.327063,0.295552,0.642274,1.26906,1.124907,0.529255,0.360955,0.356859,0.212675,0.077916,0.064492
0.021718,0.026074,0.035743,0.244293,1.053012,1.733446,2.317938,6.247651,10.728968,8.171385,2.934684,0.982176,0.543552,0.317204,0.172058,0.135629,0.224733,0.300523,0.263248,0.519415,1.062214,1.02228,0.520459,0.312462,0.280394,0.17373,0.07197,0.059952
0.016899,0.01987,0.027002,0.243105,1.00896,1.603134,1.98291,4.184244,6.780336,5.241409,1.945803,0.695546,0.383936,0.229236,0.140582,0.111023,0.200233,0.282414,0.234259,0.4773,0.998482,0.962283,0.486933,0.254929,0.204856,0.132623,0.06313,0.051502
0.015026,0.017868,0.023947,0.263066,1.029807,1.552622,1.694598,2.503374,3.382135,2.463866,0.93325,0.419405,0.241789,0.164676,0.12716,0.095102,0.203998,0.313628,0.245846,0.557725,1.206412,1.104094,0.501503,0.235897,0.180453,0.115777,0.05561,0.043267
0.015386,0.020089,0.029356,0.356725,1.306035,1.707535,1.5663,1.854025,1.854013,1.092568,0.450107,0.291562,0.178531,0.140256,0.124974,0.095994,0.233903,0.371655,0.293718,0.739144,1.6616,1.503965,0.628905,0.25529,0.18707,0.125142,0.060957,0.04286
0.018344,0.025879,0.041367,0.520193,1.843402,2.126695,1.706447,1.898054,1.592001,0.850676,0.397604,0.280632,0.187041,0.149467,0.142444,0.117729,0.255789,0.408235,0.343348,0.906306,2.108114,1.966052,0.823773,0.311879,0.229218,0.157603,0.075754,0.050554
0.023413,0.036294,0.060903,0.74678,2.670256,2.968964,2.256921,2.388943,1.821805,0.972636,0.446715,0.278094,0.211628,0.170394,0.172524,0.150139,0.27772,0.444545,0.416243,1.034632,2.410641,2.406601,1.102166,0.404191,0.293167,0.198692,0.092273,0.060783
0.028048,0.050452,0.085818,0.9677,3.5136,3.884524,2.894198,2.989113,2.167141,1.154259,0.520419,0.281978,0.227136,0.177913,0.190488,0.176659,0.338822,0.547601,0.516618,1.163726,2.654866,2.85617,1.4542,0.500498,0.346883,0.228547,0.100447,0.066007
0.029234,0.061526,0.107894,1.088808,3.963583,4.353337,3.240532,3.423434,2.445172,1.281176,0.616202,0.325313,0.236173,0.169629,0.187473,0.186426,0.412301,0.679262,0.599526,1.32918,3.02834,3.295179,1.701983,0.550937,0.375878,0.240382,0.098691,0.066866
0.026989,0.063209,0.114382,1.040296,3.724221,4.090843,3.090777,3.3909,2.490395,1.337151,0.720312,0.388173,0.24536,0.159339,0.16517,0.173464,0.460364,0.766808,0.637981,1.5629,3.493255,3.514602,1.68038,0.535438,0.368123,0.229941,0.087703,0.061431
0.025981,0.055422,0.098458,0.844927,2.897364,3.256241,2.636009,2.942228,2.346237,1.459491,0.839397,0.429939,0.249139,0.152689,0.144056,0.155512,0.443694,0.737548,0.630719,1.794984,3.796506,3.430042,1.508618,0.527215,0.356884,0.210933,0.071411,0.05173
0.031306,0.045573,0.071959,0.628827,2.040295,2.366254,2.111013,2.478723,2.22285,1.55615,0.881821,0.408886,0.226355,0.141923,0.133125,0.145373,0.359969,0.58103,0.560598,1.908385,3.975349,3.43247,1.445418,0.528712,0.350554,0.200745,0.05562,0.041037
0.035868,0.038048,0.05311,0.469195,1.510677,1.780498,1.641507,2.123883,2.191011,1.60228,0.823845,0.340526,0.183505,0.120005,0.119733,0.130272,0.25422,0.384932,0.432821,1.74687,3.744777,3.234039,1.331557,0.491153,0.315909,0.187061,0.052286,0.037851
0.035759,0.036613,0.046674,0.321211,1.038859,1.302184,1.314143,1.942921,2.210442,1.526338,0.660504,0.252219,0.147871,0.09783,0.094745,0.103293,0.178889,0.252009,0.304529,1.410089,3.177211,2.746319,1.081701,0.409837,0.262419,0.160801,0.05379,0.038687
0.036182,0.036064,0.042812,0.203668,0.652486,0.96984,1.216264,1.829924,1.975388,1.213339,0.473369,0.213887,0.136851,0.08462,0.073288,0.080346,0.128642,0.16325,0.197155,1.018726,2.391117,2.133177,0.866067,0.33225,0.205923,0.124348,0.053286,0.039752
0.039034,0.036277,0.04289,0.178029,0.528927,0.823446,1.247195,1.850187,1.696541,0.868066,0.332978,0.198497,0.130347,0.080408,0.06591,0.07543,0.114102,0.12293,0.145294,0.722438,1.730022,1.632016,0.740972,0.292894,0.157362,0.095152,0.054605,0.040948
0.041598,0.035161,0.041055,0.177161,0.511418,0.765638,1.258457,2.001894,1.705959,0.750089,0.289258,0.173762,0.118541,0.076055,0.05459,0.069607,0.115118,0.108903,0.119941,0.626895,1.492167,1.386828,0.678116,0.307979,0.125127,0.073409,0.052319,0.03762
0.042244,0.03748,0.037639,0.166766,0.507212,0.807898,1.378803,2.129206,1.695107,0.683673,0.251707,0.132822,0.099825,0.066435,0.046108,0.061629,0.105093,0.098433,0.110953,0.625754,1.483624,1.329968,0.694179,0.37783,0.124855,0.063906,0.044719,0.033367
0.043974,0.043656,0.042861,0.155053,0.484726,0.856992,1.518974,2.227598,1.637241,0.586714,0.214177,0.112397,0.0936,0.057654,0.045741,0.058888,0.093741,0.095087,0.112887,0.65523,1.529283,1.376106,0.795193,0.472612,0.149813,0.069426,0.046983,0.040507
0.051036,0.052224,0.05446,0.147639,0.448471,0.84446,1.521649,2.290058,1.708781,0.546458,0.187677,0.106392,0.093804,0.056304,0.052013,0.068144,0.097143,0.098824,0.115428,0.606901,1.398932,1.386735,0.957656,0.554917,0.160326,0.073179,0.056694,0.056373
0.057329,0.058629,0.061712,0.15722,0.440833,0.817978,1.66826,2.715817,2.047851,0.619076,0.171124,0.104,0.092956,0.057111,0.059299,0.080477,0.102224,0.098856,0.109935,0.477283,1.061899,1.190424,1.011092,0.575547,0.149001,0.0756,0.065573,0.067686
0.052994,0.053953,0.055803,0.156766,0.432719,0.782001,1.902566,3.416392,2.594675,0.717966,0.159744,0.110952,0.092325,0.054077,0.059025,0.079539,0.092241,0.086511,0.105411,0.419373,0.836011,0.931086,0.933153,0.569584,0.137637,0.076365,0.062435,0.064649
0.037316,0.037898,0.038286,0.146205,0.438403,0.722105,1.893509,3.809217,3.035079,0.858841,0.199562,0.12132,0.094678,0.054481,0.051864,0.064079,0.075809,0.076856,0.102841,0.389083,0.741492,0.795327,0.84925,0.543851,0.128797,0.07369,0.049401,0.047809
0.020212,0.021011,0.020721,0.140238,0.453121,0.619691,1.522576,3.513178,3.00589,0.902287,0.245494,0.12096,0.095849,0.054937,0.045944,0.052515,0.069646,0.087394,0.112801,0.317749,0.621089,0.734763,0.783888,0.498657,0.125846,0.069406,0.036175,0.033955
0.013631,0.015439,0.013347,0.131864,0.443844,0.504591,0.971699,2.652462,2.442301,0.766959,0.269289,0.117598,0.088015,0.051442,0.039854,0.051144,0.080433,0.104341,0.114622,0.225103,0.511251,0.673635,0.662124,0.43161,0.131333,0.074954,0.032156,0.03157
0.011215,0.01266,0.010927,0.120299,0.417395,0.424379,0.540429,1.740778,1.672401,0.519132,0.253433,0.113837,0.077109,0.046027,0.032987,0.045268,0.087663,0.11411,0.104114,0.174823,0.446654,0.560302,0.517935,0.377214,0.151896,0.084724,0.028386,0.02903
0.010573,0.011697,0.01236,0.105034,0.37894,0.389934,0.378109,1.181203,1.12863,0.334365,0.206715,0.11038,0.076512,0.043959,0.026896,0.033049,0.080928,0.112059,0.090234,0.132359,0.358158,0.465051,0.459614,0.358217,0.174969,0.088259,0.022519,0.024868
0.013558,0.015049,0.015416,0.091899,0.335566,0.377941,0.368349,0.939201,0.85246,0.269972,0.171608,0.094897,0.076237,0.049171,0.026933,0.023024,0.067247,0.10276,0.071617,0.092015,0.276202,0.355653,0.389408,0.351371,0.185102,0.084408,0.022309,0.024988
0.018534,0.022938,0.023188,0.088283,0.295017,0.330532,0.455874,0.984918,0.7503,0.216959,0.147021,0.076732,0.067825,0.054212,0.033365,0.024388,0.068527,0.104087,0.063162,0.082764,0.241209,0.258509,0.298826,0.316612,0.17147,0.079442,0.028295,0.028443
