3e-06,-2.9e-05,-0.001678,-0.004979,-0.003446,-0.006683,-0.023967,-0.155865,-0.245709,-0.187855,-0.153434,-0.155057,-0.15992,-0.123326,-0.063324,-0.025685,-0.01152,-0.005054,-0.003673,-0.0061,-0.009173,-0.016058,-0.004777,0.000516,0.00031,-1.4e-05,-0.000497,-0.000506
0,-1.1e-05,0.000358,0.000284,-0.001522,-0.002883,0.012855,-0.030298,-0.115137,0.098347,0.14373,0.076116,0.127685,0.128008,0.067676,0.02523,0.010028,0.004968,0.003917,0.004973,-0.002985,-0.014457,-0.007145,5.4e-05,-4e-05,2e-05,-0.000452,-0.000467
0,1e-05,0.000436,0.000935,-3e-05,0.000782,-0.002792,-0.046401,-0.084782,-0.008034,-0.020004,-0.041369,-0.000975,0.002647,-0.003149,-0.001761,0.000104,-0.000422,0.000161,0.000789,0.00167,-0.00375,-0.004622,-0.000195,5e-05,1.7e-05,9.4e-05,0.000126
2e-06,2.3e-05,-0.000107,0.000159,0.001651,0.002928,-0.015813,-0.021143,-0.002322,-0.144562,-0.139854,-0.102222,-0.148379,-0.130183,-0.067307,-0.026277,-0.011203,-0.005098,-0.003846,-0.005472,0.001159,0.003061,2.9e-05,-0.000277,-0.000202,1.8e-05,0.000497,0.00052
3e-06,1e-06,0.00037,0.001402,0.001484,0.002555,0.018351,0.160813,0.273467,0.147799,0.141432,0.14775,0.110307,0.097947,0.059802,0.024918,0.010375,0.0054,0.003038,0.003966,0.003789,0.006738,0.00413,0.00122,0.000497,4.5e-05,0.000272,0.000236
-1e-06,-3e-05,-0.000405,-0.001499,-0.001815,-0.003728,0.002332,0.062049,0.150279,0.125329,0.055081,0.06476,0.086601,0.061401,0.028482,0.011529,0.005396,0.00129,0.001242,0.002772,-4e-06,0.000416,0.00185,-0.001303,-0.000515,-5e-06,-0.000289,-0.00033
-2e-06,-6e-06,-0.000708,-0.002405,-0.001456,-0.000825,-0.02367,-0.153743,-0.226936,-0.17971,-0.158158,-0.135211,-0.136556,-0.131378,-0.074858,-0.028024,-0.012327,-0.005382,-0.00352,-0.005904,-0.00537,-0.004461,-0.001338,0.000669,0.000288,-2.1e-05,-0.000395,-0.000404
1e-06,2.1e-05,0.000174,0.000509,0.000802,0.001297,-0.000385,-0.078472,-0.187337,-0.053031,0.03763,-0.008975,-0.008644,0.02219,0.018655,0.004634,0.001529,0.001638,0.00107,0.000754,-0.000402,0.000348,-0.001282,-0.000122,-5e-05,0,-2e-06,3e-05
3e-06,9e-06,0.00038,0.001216,0.000574,-0.00097,0.007645,0.029761,0.02622,0.107757,0.083247,0.046891,0.091314,0.090944,0.044798,0.015875,0.007962,0.002917,0.002136,0.004044,0.003046,0.000308,-0.001215,-0.000447,-0.000156,0,0.000336,0.000376
4e-06,-6e-06,5.7e-05,0.000286,0.000116,0.000141,-0.007445,0.010341,0.04494,-0.057095,-0.089945,-0.037489,-0.046309,-0.075422,-0.046892,-0.014247,-0.006622,-0.002957,-0.002347,-0.003893,-0.001719,-0.003759,-0.001175,0.000507,0.000149,8e-06,0.000229,0.000216
3e-06,-1.1e-05,-0.000298,-0.000877,-0.000322,-0.001072,0.001178,0.071825,0.122193,-0.02152,0.007071,0.024876,-0.029558,-0.018359,-3.2e-05,-0.000719,-0.000865,0.000569,-0.000167,-0.000853,-0.00159,-0.000647,0.000788,-0.000159,-5.9e-05,5e-06,-0.000191,-0.00023
2e-06,5e-06,-0.000264,-0.001031,-0.00068,0.002126,0.012135,0.075818,0.139823,0.128802,0.091401,0.065463,0.066847,0.081279,0.048219,0.015484,0.007318,0.002016,0.002313,0.005006,0.001676,0.001343,0.001307,-0.000176,-5.5e-05,-1.2e-05,-0.000291,-0.00031
4e-06,2e-05,0.000248,0.000557,-8.4e-05,-0.001224,-0.01068,-0.074605,-0.108184,-0.038481,-0.065945,-0.038096,-0.016897,-0.048587,-0.035109,-0.009407,-0.004537,-0.002296,-0.001103,-0.002253,-0.001576,-0.002309,-0.000946,0.00012,3.4e-05,-4e-06,-5e-06,5e-06
3e-06,5e-06,0.000292,0.001074,0.000573,-0.000979,-0.008025,-0.099272,-0.206865,-0.132039,-0.052504,-0.05705,-0.064534,-0.054507,-0.027622,-0.011428,-0.004958,-0.000767,-0.00148,-0.00376,-0.001852,-7e-04,-0.001268,5.5e-05,7.9e-05,5e-06,0.000218,0.000243
-1e-06,-1.2e-05,5.3e-05,0.000443,0.000377,0.001478,0.00825,0.014779,0.000832,0.058783,0.085415,0.034293,0.042517,0.077427,0.046681,0.013093,0.006623,0.002329,0.001721,0.004259,0.002516,0.0021,0.000186,-0.000267,-0.000136,-8e-06,0.00018,0.000185
-3e-06,-7e-06,-0.000102,-0.000192,0.000284,0.000966,-0.00046,0.038108,0.108102,0.069647,-0.00019,0.027302,0.047266,0.009786,-0.003553,0.002943,0.000761,-0.000236,0.000358,0.00112,-0.00012,-0.002442,-0.000249,0.000408,0.000161,4e-06,-4.3e-05,-7.3e-05
-2e-06,4e-06,-0.000176,-0.000632,-0.000117,-0.002125,-0.003894,0.027814,0.056987,-0.059138,-0.071306,-0.035071,-0.044041,-0.059413,-0.032249,-0.009676,-0.005307,-0.001312,-0.001701,-0.004282,-0.003772,-0.004787,-0.001101,-0.00039,-0.000169,-5e-06,-0.000223,-0.00024
0,3e-06,0.000143,0.00028,-0.000273,0.0015,0.01101,0.037186,0.033568,0.014561,0.048049,0.006061,-0.011108,0.034722,0.028617,0.005441,0.002804,0.000582,0.000527,0.00149,0.000976,0.001139,0.000218,0.000193,0.000112,-1.6e-05,-0.00011,-1e-04
3e-06,-4e-06,7.6e-05,0.000317,-4.2e-05,-4.1e-05,0.000317,-0.037006,-0.05413,0.042248,0.024535,0.024214,0.032945,0.020852,0.006682,0.003691,0.001898,-0.000182,0.000867,0.002415,0.003354,0.005591,0.001348,-0.000162,-8.4e-05,-9e-06,0.000142,0.00016
