-0.002177,-0.004231,-0.00435,-0.002763,-0.004189,-0.006916,-0.003258,-0.005114,-0.005435,-0.003634,-0.005422,-0.00555,-0.007474,-0.008048,-0.004891,-0.004815,-0.005341,-0.005829,-0.005029,-0.003046,-0.00666,-0.006169,-0.002566,-0.007069,-0.006383,-0.002944,-0.004053,-0.004578,-0.004724,-0.00716,-0.005317,-0.008598,-0.006698,-0.005476,-0.004878,-0.003609,-0.008173,-0.006098,-0.006977,-0.003655,-0.005594,-0.009833,-0.00759,-0.008619,-0.007204,-0.006086,-0.004198,-0.004927,-0.008902,-0.009027,-0.005435,-0.004665,-0.001161,-0.003825,-0.002953,-0.003297,-0.006133,-0.003389,-0.006777,-0.004512,-0.004338,-0.003743,-0.003702,-0.003789,-0.009169,-0.006229,-0.004349,-0.00422,-0.002676,-0.002957,-0.002029,-0.002211,-0.005232,-0.004205,-0.002925,-0.00398,-0.004948,-0.005424,-0.002967,-0.004648,-0.005794,-0.006362,-0.005305,-0.008387,-0.006219,-0.007038,-0.005359,-0.005024,-0.001718,-0.003803,-0.003286,-0.002249,-0.005683,-0.00539,-0.004811,-0.002137,-0.005849,-0.005514,-0.002322,-0.00236,-0.00701,-0.007309,-0.00447,-0.005016,-0.006816,-0.007977,-0.008284,-0.00783,-0.005205,-0.00633,-0.00636,-0.004372,-0.003011,-0.003311,-0.003116,-0.004217,-0.005214,-0.006195,-0.006779,-0.003662,-0.005364
-0.002621,-0.001453,-0.001323,-0.002883,0.000128,0.000579,0.000834,0.000934,-0.001179,-0.00256,-0.002019,0.000525,-0.001392,0.00078,-0.00066,-0.000598,0.000628,0.001995,-0.000675,-0.000167,0.001952,0.001821,-0.002661,0.000115,0.002327,0.000312,0.001428,-0.00145,-0.000946,0.002488,-0.000575,-6e-06,0.00027,0.000282,-0.000526,-0.001194,0.002656,0.001778,0.000267,-0.001115,0.001069,0.004618,0.003732,0.002039,0.001993,0.003164,-0.001748,-0.001671,-0.00161,0.00269,0.000865,4e-04,-0.003129,-0.002469,-0.002827,-0.000786,-0.001047,-0.002207,0.001318,-0.000547,-0.001028,-0.000681,0.000132,-0.001956,0.003427,0.001862,0.002908,0.000619,-0.000279,0.000165,-0.000537,-0.001194,0.001665,-0.000286,-0.000438,-0.000383,-0.000811,-0.000147,0.000726,-0.00015,-0.000178,0.001082,0.001705,0.003429,0.001563,-0.001008,-0.00075,0.000627,-0.000447,-0.000723,-0.000863,-0.000375,-0.000216,0.002726,0.001523,0.000604,0.003333,0.002712,0.000951,-0.00064,0.00307,0.004256,0.000136,0.000875,-0.000459,0.00187,-0.000171,0.001499,0.000135,0.001274,0.001957,0.001548,0.000273,-0.002355,0.000162,0.00096,-0.002674,-0.001074,0.00018,-0.003082,-0.003012
0.001271,0.000468,0.002726,0.001683,-0.00171,-0.000879,-0.002127,-0.001311,0.002615,-4.2e-05,0.002747,-9.3e-05,0.003132,0.001994,-0.001565,0.001282,-2e-06,-0.001027,0.001251,-0.001601,-0.001832,-0.002367,0.000559,-7e-06,-0.000168,-0.000157,-0.002411,-0.00108,0.000344,-0.002187,0.001228,0.001521,-0.001113,-0.001554,-0.000869,-0.000471,-0.001248,-0.000649,0.000517,0.001933,-0.001275,-0.003779,-0.000804,-0.003003,-0.000692,-0.004056,-0.002005,0.000426,0.00042,-0.005032,-0.000364,-0.000491,0.000761,0.003171,0.000774,-0.000121,0.000839,-0.000102,0.00023,0.000491,0.002306,0.001362,-0.000112,-0.000703,-0.003474,-0.001265,-0.002375,-0.001432,-0.000201,-0.000326,-0.00057,-0.001731,-0.002664,-0.000829,0.000416,-0.000635,-0.000369,6.4e-05,-0.000839,0.001018,0.001181,-6.8e-05,-0.002048,-0.003935,-0.001104,-0.000277,-0.001774,-0.000753,0.000321,0.00103,0.000215,-0.000674,0.001855,-0.002242,-0.001428,-0.001654,-0.001767,-0.0021,-0.001557,0.000272,-0.002635,-0.004228,0.00096,-0.000229,0.000766,-0.003389,-0.00044,-0.002227,-0.001166,-0.000227,-0.002873,-0.000282,-0.001427,0.000421,-0.001012,-0.000581,0.000801,-0.000224,0.000231,0.001332,0.000802
0.000653,-7e-06,-0.001401,0.001432,0.001056,0.001565,0.001454,0.001339,-0.00292,0.000799,-0.002428,0.000141,-0.001206,-0.002372,0.002924,-0.000386,0.000485,0.001097,-0.000291,0.001916,0.001222,0.000504,0.001759,0.002701,0.000372,0.000691,0.002308,0.004572,0.001578,0.000785,0.000808,0.000145,0.003112,0.00151,-0.000155,0.000398,-0.000264,0.001416,-2.9e-05,-0.002492,0.000513,0.002955,-0.000675,0.003913,0.002042,0.003533,0.002176,0.002408,0.001515,0.005304,0.00167,0.002104,0.000901,-0.000679,0.002958,0.001629,0.001376,0.001211,-0.000434,-0.000204,-0.000633,0.000118,-0.001774,0.002359,0.001311,-0.00036,0.001242,0.002093,0.001293,-0.000702,0.000381,0.002229,0.001505,0.002176,-0.000164,0.000634,0.00278,0.000624,-0.000612,-0.002142,-0.001313,0.001497,0.002644,0.002139,0.001879,0.002445,0.002314,0.000774,-2.2e-05,0.000312,0.000366,0.00075,-0.000236,0.001245,0.001606,0.001002,0.001482,0.000998,0.000554,-0.001199,0.001078,0.00357,0.001015,0.000425,0.000258,0.001787,0.003586,0.004215,0.002043,0.000667,0.000741,-0.001275,-0.000236,-0.000616,0.001154,0.001314,0.003557,0.003132,0.000234,0.001124,0.001729
-0.000299,0.000309,0.000114,-0.000414,-0.001313,-0.000531,-0.000355,-0.001953,0.000268,0.000234,0.001919,-0.000783,-0.000908,0.001727,-0.001824,-0.000639,-0.001096,-0.002093,0.000175,-0.000951,0.000351,0.001486,-0.001567,-0.002255,-0.001862,-0.001038,-0.001907,-0.003431,-0.00235,-0.001611,-0.000838,-0.000177,-0.001702,-0.001181,0.001769,0.00085,0.001582,-0.000502,0.000217,5e-04,-0.000295,-0.002965,-0.002469,-0.003258,-0.003371,-0.001643,-0.000457,-0.002501,-0.001785,-0.002947,-0.002583,-0.00271,-0.000954,-0.001586,-0.002533,-0.000931,-0.000982,-5.8e-05,0.000586,0.000834,-0.000822,-0.000822,0.00145,-0.001668,-0.000915,0.001585,-6e-06,-0.001993,-0.000303,0.000598,0.000313,0.00068,-0.000569,-0.000696,0.00108,0.001327,-0.002595,-0.000549,-0.000236,0.002619,0.001941,-0.001827,-0.002176,-8.6e-05,-0.001923,-0.001619,-0.000585,-0.000855,-0.000579,-0.000721,-0.000224,-0.000424,-0.000627,0.000243,-0.000706,-6.7e-05,-0.000644,-0.00065,-0.000552,-2.7e-05,-0.00034,-0.001505,-0.001586,-6.3e-05,-0.002099,0.001729,-0.003101,-0.003816,-0.001516,0.000404,-0.001035,0.000473,0.001441,0.00142,-0.001171,-0.00109,-0.003853,-0.002758,-0.00098,-0.001057,-0.002075
-0.001508,-0.000836,0.000549,0.000511,0.001467,0.000454,0.001213,0.001874,0.001611,-0.001156,9.9e-05,0.002268,0.001734,0.000484,0.001115,0.00133,0.001145,0.001709,-0.000344,-0.000485,-0.001899,-0.001228,0.001459,0.000352,0.002607,0.000173,0.000557,0.000741,0.001486,0.000791,0.000437,-0.000365,-0.000693,0.001297,-0.000447,0.000571,-0.000252,-0.001457,0.000652,0.000936,0.000286,0.001068,0.003981,0.003351,0.002133,0.001347,0.001235,0.001154,0.000281,0.001237,0.00216,0.001966,0.001686,0.002193,0.00175,-0.000662,-4.7e-05,0.000153,0.000519,-0.001371,3.7e-05,0.000336,0.000341,0.000962,0.002401,-0.000194,0.000612,0.000155,-0.00096,-0.000371,0.000499,-8.4e-05,0.000582,0.001108,-0.000896,-0.001647,0.000825,1.1e-05,0.001881,-0.0012,-0.001185,0.000804,0.001993,-0.000303,0.00038,-9.6e-05,0.001374,0.001225,0.000922,0.000304,-0.000538,0.000108,0.000722,0.000798,0.000155,-0.000836,-0.000906,0.000139,-0.000294,0.000781,-3.2e-05,7.5e-05,8.5e-05,-0.000291,0.000939,-0.001393,0.002016,0.001619,0.001168,-0.000595,0.002023,0.000562,0.00056,-0.001437,0.001444,0.000188,0.001632,0.001027,0.000742,0.000959,0.001216
0.002206,0.000829,-0.000631,-1e-04,0.000603,-0.000955,5.5e-05,-0.000938,0.000198,0.000876,-0.00064,-0.001356,-0.000971,-0.00116,0.000422,1.3e-05,-0.000528,-0.000692,0.000523,0.001395,0.001152,0.000709,0.001001,0.001107,-0.000863,0.000902,0.000416,0.000636,0.000147,0.001353,-0.000301,0.000931,0.001414,-0.000335,-0.000467,-0.000448,-1.9e-05,0.002058,-0.000557,0.000311,-0.00124,0.000364,-0.001638,-0.002564,-0.000742,-0.001332,-0.001743,-4.3e-05,0.00105,3.4e-05,-0.000906,-0.000234,-0.001645,-0.000421,-0.000716,-0.000375,9e-04,0.000753,-0.000129,0.001007,0.000733,0.000282,0.000109,-0.000496,-0.001744,-0.000411,-0.001031,0.000597,0.000264,0.000458,5e-05,-0.000517,0.000689,-0.00122,-0.000226,0.001105,6e-06,0.000692,-0.001119,-1.6e-05,0.000422,0.000459,-0.001131,0.000124,-0.000241,0.001387,-0.001919,-0.001073,-0.000206,-0.000163,0.001044,0.000151,-0.000368,-0.001469,-0.000566,0.00066,-9e-06,0.000573,0.000802,0.000223,0.000793,9.6e-05,0.000863,0.00088,-0.000413,-0.000912,-0.002434,-2.2e-05,-0.000777,9.9e-05,-0.000932,0.000479,-0.001261,0.000512,-1.3e-05,-0.00014,-0.001099,0.00046,-0.000199,0.00014,0.001314
0.000108,-0.000454,0.001189,-0.000703,-0.002151,0.000932,-0.001059,-0.000448,-0.000997,-0.001241,-0.000494,-0.001048,0.000194,-0.000226,-0.001038,-0.000984,-0.000186,0.000365,-0.001148,-0.00065,-0.000588,-0.001162,-0.001766,-0.001597,-0.000223,-0.00152,-0.000533,0.000821,-0.001271,-0.001516,0.000963,-0.001109,-0.001071,-0.00014,0.000558,-9e-04,5.3e-05,-0.001998,0.000599,-0.000301,0.00118,4e-05,0.001231,0.000409,-0.000211,0.001037,0.001623,0.000699,-0.000863,-0.000886,0.000242,-0.000456,0.000192,-0.000699,-0.001168,0.00195,-0.000137,-0.00167,-0.000434,0.000266,-0.000529,-0.001296,2.5e-05,0.000533,5.5e-05,-0.000422,0.000147,0.000209,0.001059,3e-06,-0.000818,0.00048,-0.00119,-0.000362,0.001039,-0.000695,0.000233,-3.4e-05,-5.9e-05,-0.000417,-0.000596,-0.00103,0.000243,9.3e-05,-0.000137,-0.001294,0.001054,0.000543,-0.000252,0.00028,-0.000651,-0.000942,0.000137,0.001203,0.000927,-6.3e-05,0.001084,-0.000315,-0.000356,-9.8e-05,-9.3e-05,0.000275,0.000502,-0.001884,0.000675,0.001177,0.001743,0.000201,0.000951,-0.000248,-0.00039,-4e-05,0.000214,0.00032,-0.001214,0.000207,0.000443,-0.000142,-3e-05,9e-05,-0.001962
-0.001125,-5.4e-05,-0.000393,0.000224,0.000609,-0.00041,0.000329,0.00051,0.001243,0.001056,3e-05,0.001102,-0.000189,0.000923,-4.3e-05,-2.2e-05,0.001228,0.000234,0.001102,-0.000107,0.000518,0.000637,0.000439,0.001026,0.000716,0.001247,0.000232,-0.000845,0.000395,0.000466,-0.000405,0.000301,-1.1e-05,-0.000581,8e-05,0.000772,0.000387,0.00124,-0.000954,-0.000238,0.000509,-0.00039,-0.001696,0.000758,-0.000131,-0.000116,-0.00129,-0.001244,6.8e-05,0.000412,-0.001554,7.2e-05,0.000235,0.000532,0.000848,-0.001779,-0.000803,0.000492,0.000253,-0.000964,0.000436,0.000844,0.000116,0.000331,0.000413,-0.000656,0.000517,-0.000291,-0.001465,-0.000627,0.000607,-0.000368,-0.000396,0.000524,-0.001184,9e-06,-0.000631,-0.000727,-0.00055,0.000725,0.000957,0.000841,4.9e-05,0.000818,0.000469,0.000303,-0.00033,0.000245,0.000404,0.000104,1.3e-05,0.001303,-0.000266,-0.000411,-0.000384,0.000188,-0.000371,0.000181,0.000677,-6.2e-05,-6.8e-05,-0.000703,-0.00065,0.000873,-0.001237,-0.000627,0.000146,-0.001084,-0.000556,0.000396,0.000187,0.000527,0.000414,0.000237,0.000678,0.000355,-5.2e-05,-0.000985,-0.00059,-0.000814,0.00096
6e-04,0.000315,-0.000549,-0.000104,0.000214,-0.000223,0.000173,-9.9e-05,-0.001149,-0.000185,0.000996,-0.000477,0.000611,-0.000442,0.000858,0.000804,-0.001801,-0.00062,-0.00047,-2.3e-05,-0.000169,-3.4e-05,-0.000767,-0.000385,-0.000901,-0.000576,0.000152,0.000366,0.000862,-0.000166,0.000192,0.000137,0.00026,0.000794,-0.000872,0.000419,-0.00054,-0.000423,0.000252,-0.000136,-0.001318,0.000191,0.00114,0.000237,0.000831,-0.000468,0.000743,-8.8e-05,0.000782,1e-04,0.001989,0.000816,0.000285,-0.00033,-7.9e-05,0,0.000577,0.00026,0.00018,-0.000147,-0.000309,-0.000123,2e-05,-0.00084,-6e-05,0.000378,-0.000374,0.000231,0.001259,0.000248,-0.000411,0.000472,0.000387,-0.000651,-0.000115,-7.3e-05,0.000277,0.00063,0.000731,-0.000249,-0.000435,-0.000792,0.000187,-0.000621,9.7e-05,-0.000394,0.000342,-0.00029,-0.000455,-0.000165,6.2e-05,-0.000266,8.5e-05,-0.000668,-0.000419,-0.000881,-0.000363,-9.1e-05,-0.000675,4.8e-05,-0.000231,0.000543,0.000285,-9.8e-05,0.000816,-0.000558,-0.001361,0.001031,0.000234,0.000128,0.000123,-0.001373,-0.00056,-0.000856,-0.000193,-0.000162,0.000535,0.001587,0.00055,8.6e-05,-0.000737
-3.5e-05,0.000115,0.000513,0.000238,-0.000163,0.000659,-0.000157,0.000158,0.000801,0.00028,-0.001231,0.000252,-0.000888,0.000317,-0.000859,-0.00074,0.000616,0.000153,9.2e-05,0.000225,0.000444,-0.000396,0.000863,-0.000193,9.3e-05,0.000198,-0.00033,-0.000175,-0.000996,-0.000284,-0.00075,0.000249,-9.6e-05,-6.8e-05,0.00064,-0.000473,-0.000474,3.7e-05,0.000133,0.000283,0.001304,0.000362,-0.000619,-0.001025,-0.000737,0.000246,-0.000446,-0.000181,-0.000768,-0.00012,-0.000454,-0.000698,-0.000697,0.000455,-6.3e-05,-0.000154,-0.000183,-0.000251,-7.4e-05,0.000767,-0.000227,0.000151,0.000292,1e-06,-0.000518,0.000679,0.000127,4.6e-05,-0.000527,0.00025,-6.5e-05,-0.000565,-9.9e-05,0.000572,0.000156,0.000258,3.3e-05,-0.000396,-0.00032,9.3e-05,-1e-05,0.000433,-0.000394,0.000189,-0.000223,0.00038,-0.000463,-0.000396,0.000407,6.6e-05,0.00021,-0.000485,9.2e-05,0.000775,1.8e-05,0.000978,0.000498,-0.000287,0.000319,8.4e-05,-0.000581,-8.7e-05,-0.000229,0.000373,-0.000418,0.000905,0.001536,-0.00049,-0.000208,-0.000795,0.000265,0.000898,0.000247,0.000386,1e-05,-0.000334,5.1e-05,-0.000887,-4.6e-05,4e-06,0.000623
0.000123,8e-06,-0.000293,8.5e-05,0.000188,-0.000639,7e-06,0.000189,-0.000526,0.000199,0.00049,2e-05,0.000856,-0.00026,0.000673,0.000353,3e-05,0.000249,-0.000133,-0.000113,-0.000431,0.000533,-0.00021,0.000147,9.8e-05,1.8e-05,0.000446,-0.000272,0.000161,-4.5e-05,3.7e-05,-0.000381,-0.000108,-0.000449,-0.000207,0.000166,0.000443,0.000269,-0.000103,-0.000381,-0.001056,-0.000116,-0.000192,0.00016,0.000513,7.4e-05,3.7e-05,0.000809,5.2e-05,0.000328,-0.000498,0.000356,0.000592,-0.000228,-0.000173,0.000472,-6.7e-05,0.000147,-0.000401,-6e-06,0.000521,9.9e-05,-0.00117,-0.00026,0.000233,-0.000516,9.2e-05,1.7e-05,0.000209,-0.000302,0.000294,0.000102,5.5e-05,1.2e-05,-8.8e-05,0.000237,-2.7e-05,0.000139,-0.000222,2e-06,0.000133,1.3e-05,-5.5e-05,6.5e-05,-2.8e-05,0.000347,0.000109,0.000339,-1e-04,-5e-06,-0.000268,0.000556,8.4e-05,-0.000394,0.000248,-0.000616,-0.000274,0.000197,-0.000287,-0.000113,0.000572,-9.6e-05,0.000337,-0.000584,0.00014,-0.000232,-0.000829,0.000376,0.000385,0.000508,-0.000395,-0.000413,0.000371,-2e-04,-0.000345,-0.000209,-0.000711,0.000323,0.000117,-5.3e-05,0.000106
-4.8e-05,-0.000398,0.00013,-0.000439,-0.000123,-0.000113,-0.000545,-0.000111,0.000485,-0.000368,-0.000204,-0.000232,-0.000244,0.000129,-0.00032,1.7e-05,0.000138,-4.8e-05,0.000413,0.000136,-8.1e-05,-7.5e-05,-0.000416,-8.9e-05,-0.00012,0.000438,-0.000199,0.000171,0.000261,0.000454,0.00021,2.4e-05,0.00021,0.000261,-0.000114,-0.000149,0.00014,-0.000227,0.000468,0.00016,-9e-05,-0.000134,6.8e-05,0.000202,-0.000727,-0.000251,0.000238,-0.000372,7.8e-05,-0.000187,9e-05,-0.000454,-0.000484,-8.7e-05,6.7e-05,-0.000207,-0.000117,-9.2e-05,0.000567,-0.000185,-0.000259,-4e-04,0.000895,0.000629,0.000177,-0.000101,-0.000634,4.5e-05,-0.000424,0.000206,-0.000101,-0.000224,7.1e-05,-0.000367,0.000616,-0.000531,0.000244,-0.000309,0.000256,-0.000142,5.3e-05,3.2e-05,0.00047,-0.000207,0.00024,-0.000394,0.000195,0.000125,0.000131,-0.000124,9e-05,-0.000138,-7.2e-05,-0.000197,-0.000206,0.000346,-4.9e-05,0.000233,0.000329,8.3e-05,-5.5e-05,2.6e-05,-0.000443,0.000295,0.000505,0.000181,0.000204,-0.00024,-0.000243,0.00014,0.000149,0.000333,-0.000465,0.00032,0.000184,0.000338,0.00041,-0.000124,-4.7e-05,4.4e-05,-5e-05
-0.000244,0.000357,-0.000311,0.000118,1.7e-05,0.000396,0.000428,0.000166,-0.000859,-0.000135,0.000221,5.6e-05,-9.2e-05,-0.000106,-6.3e-05,-4.7e-05,-6.3e-05,-0.000219,-0.000454,-0.000148,0.00022,1.9e-05,0.000151,0.000394,6.1e-05,-0.000171,0.000111,6.4e-05,0.000466,-0.000252,-0.000101,3e-05,-0.000122,-2.7e-05,6.6e-05,1e-05,-1.2e-05,-6.8e-05,-0.000578,4.6e-05,0.000344,-0.000107,0.000387,-0.000162,0.000549,5.5e-05,-0.000411,1.8e-05,0.000341,-8e-06,3e-05,0.000345,0.000151,-9e-05,0.000119,0.000416,-2.6e-05,0.000201,-0.000791,8.6e-05,6.7e-05,0.000221,-0.00052,-0.000166,0.000185,0.000426,0.000234,-0.000155,8e-05,-0.000193,-3.8e-05,0.000268,0.000142,-2.1e-05,-3e-05,0.000348,-0.000405,0.000104,0.000166,0.000234,-4.2e-05,-0.000337,-0.000175,8.1e-05,-7.6e-05,0.000499,-0.000247,-0.000189,-0.000364,8.2e-05,6.2e-05,-0.000184,-0.000169,0.000284,-1.9e-05,-0.000247,0.000108,-0.000129,-0.000401,-5.4e-05,-0.000109,-0.000281,-6e-06,0.000153,-0.00036,0.000189,-9.3e-05,-0.000429,-9.6e-05,-5e-05,0.000148,-3e-04,-8e-05,-6.7e-05,0.000179,0.000387,-0.000301,-0.000202,6e-06,2.4e-05,-0.000261
-6.1e-05,2.3e-05,0.000213,4.6e-05,0.000127,-3.6e-05,-0.000171,-0.000181,0.000551,0.00022,-0.000232,7.9e-05,0.000167,0,0.000157,2.6e-05,-9.3e-05,0.000213,0.000258,6.3e-05,-0.000225,0.000106,6.2e-05,-7.1e-05,-0.000119,-0.000227,-0.000148,-1.7e-05,-0.000372,-0.000135,-0.000146,0.000223,7.2e-05,-0.000103,0.000292,-6.6e-05,-0.000127,0.000176,0.000676,0.000102,4.1e-05,8.4e-05,-0.000165,0.000212,-1.8e-05,5e-05,0.000166,-3.4e-05,-0.000323,3.4e-05,0.00025,-0.000284,-0.000132,0.000264,-0.000104,-0.000318,1e-06,-0.000179,0.000559,1e-06,0.000152,-9.7e-05,-3.6e-05,7.9e-05,-0.000351,-0.000254,0.000187,1.1e-05,3.2e-05,0.000213,-5e-05,-0.000117,8.2e-05,1.3e-05,-0.000258,-8.2e-05,0.000402,0.000194,-0.000383,-1e-06,0.00015,0.000125,-0.000278,0.000215,1.2e-05,-0.000511,0.000277,-7.1e-05,0.000333,-8.2e-05,-7.9e-05,0.000106,0.000129,-0.000106,0.000262,0.000177,8.5e-05,-0.000202,0.000426,5e-05,0.000199,8.4e-05,-1.3e-05,-0.000435,-2.2e-05,-0.000169,-0.000267,0.000473,0.000197,-0.000247,-0.000102,3.4e-05,-1.5e-05,0.000133,4.4e-05,-0.000512,0.000185,0.000138,-0.000181,7.1e-05,0.000232
0.000179,-3.5e-05,-0.000254,-3.1e-05,-0.000266,-0.000188,-1.5e-05,9.4e-05,-0.000136,-0.000119,0.000265,-2e-06,-0.000294,0.000145,-4.6e-05,-5.4e-05,0.000134,2e-06,-9.1e-05,4.3e-05,0.000219,9.9e-05,5.8e-05,-0.000128,0.000181,4.8e-05,-1.1e-05,-0.000149,7.8e-05,0,2.3e-05,-1.1e-05,0.000153,0.000112,-9.7e-05,0.000139,-5e-05,1.9e-05,-0.000442,-4.4e-05,-1e-05,1.3e-05,1.6e-05,0.000131,0.000227,3.3e-05,2.7e-05,0.000182,-0.000116,-7.5e-05,-0.000304,0.000135,0.000259,-9.5e-05,-2.7e-05,-9.7e-05,9.9e-05,-0.000173,-0.000347,5e-05,-0.000227,7.8e-05,0.000256,7.3e-05,0.000115,-0.000164,-1e-05,0.000109,5.6e-05,-0.000162,0.000175,0.000127,-0.00011,0.000161,8.1e-05,0.000206,-0.000312,-7.4e-05,9.6e-05,-2e-05,-0.000325,3.7e-05,0.000194,-0.000169,3.7e-05,0.000296,-2.9e-05,0.000128,-3.4e-05,4e-05,3.1e-05,8.4e-05,5.2e-05,2.2e-05,-0.000247,2e-06,-0.000114,0.000184,-0.000326,-1.9e-05,-0.000205,3.3e-05,9e-05,5.1e-05,-3.1e-05,-1.4e-05,0.000388,5.6e-05,-6.8e-05,0.000237,2e-06,-9.7e-05,-7.1e-05,-0.000278,-0.00026,0.000214,0.000116,1.2e-05,0.00024,-0.000129,-0.000214
-6.8e-05,-1.4e-05,0.000239,0.000102,0.000127,0.000111,0.000159,-2.3e-05,0.000219,8.1e-05,6.7e-05,-0.000188,0.000249,-0.000117,9.8e-05,2.6e-05,-0.000184,-1.5e-05,1e-04,5e-06,-7e-05,-0.000255,-5e-05,4.8e-05,8.9e-05,3.4e-05,7.3e-05,7.8e-05,-0.000101,0.000117,3.6e-05,-5.3e-05,-0.000212,-0.000205,-0.000176,-9.1e-05,8.4e-05,-0.000111,0.000129,-3.9e-05,1e-05,8.8e-05,-0.000122,-0.000211,-0.000332,-3.2e-05,8.3e-05,0.000148,7.4e-05,5e-06,0.000149,-1.5e-05,-0.000166,-0.000125,-8e-06,0.000245,-5.7e-05,0.000191,0.000235,-5e-06,-4.8e-05,-4e-06,-0.000173,-1.7e-05,4.4e-05,0.000113,-7.6e-05,7.5e-05,5.2e-05,-2.6e-05,-6.3e-05,0.000127,-0.000105,-4.9e-05,1.8e-05,-0.000104,0.000132,-2.2e-05,0.000157,3e-06,0.00015,-2.8e-05,0.000101,-7.9e-05,-0.000123,-0.000222,7e-05,-2e-05,-2.9e-05,-4.3e-05,2.7e-05,-8.4e-05,-2.8e-05,-5.1e-05,0.000167,5.7e-05,8.5e-05,5.1e-05,0.000161,1.3e-05,7.4e-05,7e-05,6e-05,-2.4e-05,0.000189,0.000195,-0.000242,-4.5e-05,-5.9e-05,-0.000126,-6.6e-05,0.000266,0.000258,9.3e-05,2.7e-05,-1.1e-05,-0.000218,-5.6e-05,-3.2e-05,6.9e-05,0.00019
6e-06,1e-05,2.6e-05,-3.6e-05,0.000105,2.5e-05,-0.000109,2.2e-05,-0.000234,3.6e-05,-0.000129,0.00023,-0.000145,1.5e-05,-0.000166,2e-06,8.3e-05,-7.3e-05,-0.000157,6.7e-05,-2.8e-05,0.000171,5.1e-05,-5.2e-05,-8.6e-05,-7e-06,-0.000103,6.7e-05,0.000179,9.2e-05,8.2e-05,-1.6e-05,5.3e-05,0.000193,0.000124,0.000141,6.8e-05,3e-05,-7e-05,3.7e-05,-6.6e-05,-9.6e-05,0.000212,0.000179,2.6e-05,9e-05,-0.000145,-0.000191,8.6e-05,3.1e-05,5.7e-05,-4.4e-05,-1.8e-05,2.5e-05,1.9e-05,-9.9e-05,-5e-06,-2.3e-05,-4.7e-05,6e-06,0.000162,-1e-05,7.4e-05,6.2e-05,-0.000133,3.3e-05,3.3e-05,-6.9e-05,-0.00018,3e-05,-0.000157,-0.000178,4.9e-05,7.8e-05,4.6e-05,-1e-06,-8e-06,-7.6e-05,-6.7e-05,7.6e-05,-9.4e-05,8.7e-05,-0.000173,0.000105,7.3e-05,0.000113,-6.4e-05,-7.6e-05,-3e-06,2.7e-05,-7e-05,1e-06,9e-06,0.000127,1.7e-05,-0.000166,-7.5e-05,-9.4e-05,-4.7e-05,7e-06,3.9e-05,2.2e-05,-0.000115,0.000264,-0.000116,-0.000162,0.000264,-0.000114,1.1e-05,-9e-06,9.6e-05,-0.000148,-0.00014,-1.2e-05,0.000233,9e-06,0.000158,9e-05,-7.2e-05,-1e-05,-0.000178
-9.7e-05,-3.2e-05,-0.000101,5.1e-05,-0.00014,-0.000143,6.5e-05,4.7e-05,0.000138,-1.6e-05,7e-06,-5.5e-05,0.000131,-4.1e-05,0.000163,2.3e-05,0.00012,1e-05,0.000142,-5.3e-05,2.4e-05,1.6e-05,-4.4e-05,5.2e-05,2.6e-05,-6.4e-05,5.9e-05,-5e-06,-0.000229,-0.000117,9e-06,-2.9e-05,0.000166,-0.000112,-7.7e-05,-0.000163,-3.5e-05,-8.8e-05,-1e-04,-1.8e-05,1.3e-05,2.2e-05,-1.4e-05,-0.000197,-3.2e-05,-0.000127,0.000112,-5e-06,-4.5e-05,3.5e-05,4.2e-05,0.000153,6.2e-05,7.7e-05,1e-05,0.000123,5.4e-05,-6.9e-05,-1.7e-05,-6.2e-05,-9.1e-05,4e-05,7.1e-05,-5.3e-05,6.6e-05,2e-06,-8e-05,-7.7e-05,0.000153,4.9e-05,0.000148,0.00018,-2.5e-05,9.5e-05,-5e-05,-0.000137,-3.7e-05,8.6e-05,-2.6e-05,-0.000163,1.7e-05,-0.000219,9.4e-05,-4.5e-05,2.8e-05,-6.2e-05,-6.4e-05,0.000102,-2.8e-05,1e-06,6e-06,-2.5e-05,-3.3e-05,-0.000178,-8.3e-05,0.000188,2.9e-05,-3.9e-05,4.3e-05,-6e-06,-4.5e-05,-8e-06,-4e-06,-0.000175,4.6e-05,-4.3e-05,-0.000133,3.9e-05,3.6e-05,1.9e-05,-6.1e-05,8.5e-05,0.000119,9e-05,-0.000214,7.4e-05,-0.000193,-6e-05,1.4e-05,1.3e-05,1.5e-05
-5.3e-05,6.3e-05,8.9e-05,2e-06,4.6e-05,9.1e-05,-7.7e-05,-6.9e-05,-9e-06,9e-06,7.1e-05,-4.5e-05,-8.3e-05,5.5e-05,-0.000115,-5.5e-05,-0.000164,9.1e-05,-0.000126,-6.4e-05,-2.1e-05,-5e-05,0.000134,2.9e-05,-2.8e-05,5.3e-05,-3.5e-05,3.2e-05,0.000172,-1.5e-05,3.8e-05,-6.2e-05,-0.000141,2.6e-05,1.8e-05,6.2e-05,-4.7e-05,0.000141,0.000113,-2.1e-05,6e-05,3.7e-05,-0.000166,0.000103,0.000183,0,6e-06,-6.9e-05,-3e-05,2e-05,-0.000149,-0.000237,-4.2e-05,-2.4e-05,-9e-06,-0.000137,2e-06,3e-06,2e-06,5e-05,5.7e-05,-0.000115,-0.000103,2.3e-05,1.2e-05,5.3e-05,1e-04,-9e-06,-0.000114,5e-06,-4e-05,-0.000144,-4e-05,-0.000142,6.3e-05,9.9e-05,8.2e-05,-2.1e-05,-2.8e-05,0.000132,6.8e-05,0.000149,-5.8e-05,-2e-05,-3.7e-05,6.3e-05,0,-1.3e-05,2.2e-05,-3e-06,4.6e-05,8.7e-05,3.6e-05,9.7e-05,6.6e-05,-0.000166,3.9e-05,6.4e-05,-6.7e-05,-2e-05,-4e-06,-2.5e-05,0,-1e-06,-8.2e-05,0.000169,-2.5e-05,5.6e-05,-2.4e-05,7.5e-05,4e-06,-0.000167,-0.00011,-5.8e-05,-1.3e-05,-9.2e-05,0.000118,-2.2e-05,-3e-06,-4e-06,4.8e-05
0.000225,-5.7e-05,-5e-06,-4e-05,-1.1e-05,2.3e-05,2.1e-05,5.8e-05,9.8e-05,-0.000101,-7e-05,-1.9e-05,-2e-06,-3.4e-05,3.1e-05,2.8e-05,1e-04,-5.5e-05,9.8e-05,0.000117,-2.1e-05,-2e-05,-5.3e-05,-7.2e-05,2.2e-05,-3.1e-05,1.4e-05,-4.1e-05,-2.1e-05,6.6e-05,-3.3e-05,3.3e-05,4.9e-05,-3.2e-05,3.8e-05,5.2e-05,-2e-05,-7e-06,-9.5e-05,-4.1e-05,-2.6e-05,-3.4e-05,0.000105,6.8e-05,-0.000126,6.1e-05,-7.6e-05,0.000139,-3.2e-05,-3.9e-05,1.3e-05,0.000234,3.5e-05,-6.7e-05,4.5e-05,-2.3e-05,5e-06,4e-05,-3e-05,-4.5e-05,-3.3e-05,7.1e-05,0.000123,-7.9e-05,1.7e-05,-5.3e-05,-8.3e-05,1.2e-05,6.1e-05,-5.1e-05,-3.3e-05,4.1e-05,2.6e-05,-3.3e-05,-0.000144,-5.7e-05,-1e-04,4e-06,6.9e-05,-6.8e-05,-0.000123,3e-05,-2e-06,2.4e-05,2.6e-05,3.8e-05,3.2e-05,-6.4e-05,-4.1e-05,1.9e-05,-4.3e-05,-0.000108,-7e-06,5.9e-05,-6.4e-05,0.00016,-4.7e-05,-1.4e-05,-2e-06,-2e-06,-4e-05,-1.4e-05,6.7e-05,9e-06,7.4e-05,-0.000131,8.9e-05,-1.8e-05,5e-06,-6.6e-05,-5e-06,0.00016,8.4e-05,3.7e-05,0.000105,-1.5e-05,2e-06,6.1e-05,5.1e-05,-3.6e-05,3.2e-05
-0.000107,3.6e-05,3.1e-05,-9e-06,1.3e-05,-6.4e-05,1.1e-05,-7.3e-05,-0.000139,5.6e-05,-4.8e-05,8e-06,3.4e-05,1.7e-05,2.1e-05,7e-06,-2.9e-05,0,-7.8e-05,-6.3e-05,5e-05,0.000101,-7.4e-05,6.8e-05,-1.4e-05,4.2e-05,1.1e-05,-1.5e-05,0.000101,-5.9e-05,-9.1e-05,2.7e-05,4.7e-05,3.8e-05,3.8e-05,-9.2e-05,1.2e-05,-2.9e-05,8.7e-05,2.9e-05,-1e-06,1.9e-05,-4.2e-05,-0.000127,3.9e-05,-1.3e-05,9.3e-05,-2.3e-05,1e-06,1.9e-05,7.8e-05,-0.000153,-3e-05,1.5e-05,-2.6e-05,5.7e-05,-3.9e-05,3.5e-05,3.4e-05,-3e-06,-5e-05,-3.1e-05,-3.3e-05,-2.7e-05,-4.1e-05,0,7.1e-05,6e-06,2e-05,4.2e-05,5.2e-05,-2.7e-05,4.6e-05,9e-06,0.000169,4.8e-05,8.3e-05,-2e-05,6e-06,4.5e-05,7.9e-05,-7.2e-05,5.1e-05,1.5e-05,-1.8e-05,-3.7e-05,-2.2e-05,4e-06,1.6e-05,-8e-06,-3e-06,2.2e-05,-9e-06,-0.000148,2.6e-05,-0.000107,2.1e-05,1e-06,3.9e-05,1e-06,2.4e-05,-7e-06,-1e-05,4.1e-05,1.4e-05,3e-06,-0.000194,6e-06,-8e-06,-3.7e-05,1.4e-05,-3.8e-05,-9.5e-05,-3.1e-05,-2.4e-05,7.9e-05,-1e-05,-4.1e-05,-2.9e-05,2.7e-05,-8.3e-05
-3.9e-05,-2.1e-05,-3.1e-05,-2.4e-05,4.4e-05,7e-05,-2e-05,2e-05,5.7e-05,1.1e-05,3.3e-05,0.000126,-4.5e-05,-1e-06,-4e-06,-1.1e-05,-3.2e-05,-9e-06,8.2e-05,-3.2e-05,-3.1e-05,-8.8e-05,0.000116,-8.3e-05,-9e-05,-9.1e-05,-1.1e-05,1.6e-05,-0.000225,2.8e-05,1.4e-05,3.9e-05,-0.000105,9e-06,-5.2e-05,1.2e-05,2.9e-05,-2.2e-05,-7.3e-05,9e-06,2.7e-05,-1e-05,8.7e-05,0.000102,-2.5e-05,-2.6e-05,-6e-05,-4.4e-05,2.3e-05,7e-06,-2.6e-05,6.6e-05,5.4e-05,5.5e-05,-7e-06,4.6e-05,-4e-06,-6.7e-05,5e-06,-3e-06,9.1e-05,2.8e-05,-2.5e-05,5.3e-05,2.8e-05,4e-05,2.6e-05,-3e-05,-4e-05,-1.5e-05,-7e-06,-1e-05,3.1e-05,-7e-06,-2.9e-05,8e-06,-7.1e-05,2e-05,-6.1e-05,-4.5e-05,-6.9e-05,8.6e-05,-4.7e-05,-4.6e-05,-2.2e-05,2.3e-05,1e-05,6.3e-05,2.5e-05,7e-06,3.2e-05,7.5e-05,-1.5e-05,0.000117,-2.8e-05,5.5e-05,-9e-06,-1.6e-05,-4.7e-05,-1e-06,1.4e-05,0,-2.6e-05,-0.000105,-1.8e-05,4.9e-05,0.000182,-7.2e-05,-4e-06,3.4e-05,1.8e-05,3.7e-05,3e-06,3e-05,2e-05,-6.2e-05,6.5e-05,3.2e-05,-2.9e-05,-3e-06,7.2e-05
5.6e-05,2.9e-05,0,2.8e-05,-9.8e-05,-6e-06,1.3e-05,-5e-06,-2.9e-05,-4.7e-05,4.1e-05,-0.000178,5.4e-05,2.1e-05,-5.3e-05,-2e-06,6e-06,1.1e-05,-8.2e-05,6.2e-05,3e-06,2.7e-05,-0.000109,5e-05,2.4e-05,9.1e-05,2e-06,3.8e-05,9.5e-05,6e-06,2.6e-05,-9e-06,7.7e-05,-3.5e-05,-2e-06,6.7e-05,1.2e-05,3.1e-05,9.9e-05,-6e-06,-4.9e-05,-2e-06,-0.000124,-9.4e-05,3.8e-05,3.6e-05,3.2e-05,-2.6e-05,-2e-05,-3.6e-05,-8e-06,-2e-06,-6e-05,-2.2e-05,-9e-06,-2.7e-05,1.5e-05,1.2e-05,-2e-06,1.9e-05,-2.4e-05,2.1e-05,-7e-06,-3.8e-05,2e-05,-8.4e-05,-0.000108,-3.8e-05,3.2e-05,1.5e-05,1.4e-05,-1.8e-05,-5e-06,3.8e-05,-3e-05,-2.2e-05,6.4e-05,2e-06,6e-06,2.6e-05,5.2e-05,-0.000124,3.2e-05,1.9e-05,3.7e-05,-6.7e-05,5e-06,-2e-06,-2.1e-05,-4e-06,-1.3e-05,-4.1e-05,-5e-06,-3.2e-05,3.2e-05,-3.3e-05,-3.2e-05,1.5e-05,5.4e-05,-4e-06,-1.4e-05,4.2e-05,-1e-05,9.3e-05,4e-06,-3.5e-05,-6.8e-05,3.9e-05,2.5e-05,2.3e-05,-4.8e-05,-9.2e-05,9.3e-05,-2.4e-05,-8.4e-05,4.8e-05,-0.000111,0,1.7e-05,7e-06,-8.4e-05
-1.8e-05,-4.5e-05,-1.4e-05,1.1e-05,3.3e-05,-6.1e-05,-8e-06,-2.7e-05,5.1e-05,9e-05,-7.4e-05,6.2e-05,-4.8e-05,-5.3e-05,9.4e-05,7e-06,-2.2e-05,1.7e-05,8.2e-05,-3.6e-05,-2e-06,8e-06,6.9e-05,4e-06,3.6e-05,-6.8e-05,1e-05,-2.6e-05,2.1e-05,-1.3e-05,2.3e-05,-4.7e-05,9e-06,2.4e-05,-1.2e-05,-4.6e-05,-1.2e-05,-4.7e-05,-3.9e-05,-1.7e-05,-1e-05,6e-06,3.3e-05,-4e-05,-1.7e-05,-5e-06,-3.6e-05,3.8e-05,2.9e-05,7e-06,-3.4e-05,-5.3e-05,4.5e-05,-1.7e-05,-5e-06,-4.9e-05,-2.3e-05,2.9e-05,-1.1e-05,-9e-06,-4.9e-05,-6.5e-05,6.7e-05,3.8e-05,-1.8e-05,-1.3e-05,5e-05,3e-06,-2.9e-05,-4.5e-05,-4.2e-05,1.5e-05,-3.1e-05,3.3e-05,2.3e-05,8e-06,-6.7e-05,-1.6e-05,6.5e-05,-5e-06,-7e-06,8e-05,-2.7e-05,1.1e-05,-1e-06,4e-05,-9e-06,-4.7e-05,1e-06,0,-1.8e-05,-5.5e-05,3.6e-05,-7e-06,6e-06,5.3e-05,3.8e-05,-1.5e-05,-1.9e-05,6e-06,1.6e-05,-1.6e-05,2.2e-05,-3.3e-05,-3.1e-05,-1.7e-05,9e-06,7.7e-05,3e-06,-5e-06,4.2e-05,5.7e-05,-8.2e-05,2.3e-05,6.5e-05,1.2e-05,8e-05,5e-06,2.4e-05,-1e-05,6.4e-05
3.2e-05,2.8e-05,-2.1e-05,2e-06,4.7e-05,2.7e-05,0,4.5e-05,-3e-05,-2.7e-05,3.8e-05,7.3e-05,2.9e-05,3.6e-05,-8.1e-05,-6e-06,7.7e-05,-3.1e-05,-7.3e-05,2e-06,0,3e-06,-1.7e-05,-2.3e-05,1e-05,4.6e-05,-1.6e-05,-2.5e-05,4.1e-05,1.9e-05,-5.8e-05,2.5e-05,-3.8e-05,-6e-06,1.1e-05,-1.8e-05,-2.6e-05,5.8e-05,-1.8e-05,1.8e-05,3.5e-05,-3e-06,6e-05,9e-05,-6.1e-05,-2.8e-05,3.7e-05,5.8e-05,5e-06,1.3e-05,6.4e-05,9.2e-05,-2.9e-05,2e-06,1.5e-05,2.2e-05,-1.2e-05,-3.4e-05,-1.2e-05,8e-06,5.9e-05,5.7e-05,-0.000109,-2e-05,-9e-06,9.7e-05,2.5e-05,3.9e-05,9e-06,3.7e-05,3.4e-05,1e-05,-7e-06,1.1e-05,-2.6e-05,-1e-05,5e-05,-2e-06,-4.5e-05,-1.3e-05,7e-06,2.6e-05,1.7e-05,-6e-06,-1.6e-05,-4.5e-05,3.3e-05,2.7e-05,-1e-05,-2e-06,3.2e-05,7.9e-05,-3e-06,-1.7e-05,-2.3e-05,-6.1e-05,1e-05,6e-06,1e-06,5e-06,-3e-06,8e-06,2.1e-05,6.6e-05,3.3e-05,6.3e-05,4.8e-05,-9.4e-05,-1.6e-05,-2.1e-05,-1.5e-05,-5.3e-05,6.3e-05,-1.4e-05,3.2e-05,-5.9e-05,-6.3e-05,-8e-06,-1.2e-05,0,0
2e-06,-2.5e-05,2.9e-05,1.2e-05,-5.1e-05,2.5e-05,7e-06,-4.7e-05,-3.1e-05,-2.6e-05,4e-06,-7.5e-05,-2.1e-05,-6e-06,2.8e-05,5e-06,-6.4e-05,2.6e-05,6.1e-05,2.4e-05,-4e-06,-4.7e-05,-5.4e-05,3.9e-05,-2e-06,-3.2e-05,1.3e-05,1.6e-05,-8.4e-05,-3.5e-05,1.3e-05,-1.6e-05,4.2e-05,8e-06,1.3e-05,4.3e-05,-7e-06,-2.8e-05,2.3e-05,1e-05,1.2e-05,-6e-06,-2.2e-05,-1e-05,4.7e-05,1.7e-05,-1.5e-05,-2.8e-05,-1.7e-05,6e-06,-3e-06,-9.9e-05,3.2e-05,2e-05,-1e-05,-1.5e-05,1.2e-05,9e-06,2.4e-05,-2e-05,-2.9e-05,-4.1e-05,5.7e-05,4e-06,2.1e-05,-2.1e-05,-3.2e-05,-5e-06,-2.5e-05,-8e-06,-3e-06,-1e-06,-1.9e-05,-2.8e-05,-2e-06,4e-06,-2.7e-05,1e-06,-2.8e-05,2.2e-05,7e-06,-7e-05,-2.5e-05,-6e-06,1.4e-05,5.3e-05,-5.4e-05,1.6e-05,9e-06,1e-06,-1.4e-05,-2.4e-05,-7e-06,3.4e-05,3.4e-05,5.5e-05,-3.4e-05,1.2e-05,-1e-05,-2e-06,-1.2e-05,-9e-06,-9e-06,-9.7e-05,-1.4e-05,-6.6e-05,-8.8e-05,4e-06,-1.1e-05,3e-05,2e-06,0.000107,-7.1e-05,1e-06,-6.5e-05,1.1e-05,3.8e-05,1.1e-05,-2.4e-05,9e-06,-1.6e-05
-5.5e-05,2.9e-05,-3.7e-05,-1.3e-05,1.8e-05,-2.9e-05,-1.2e-05,3.1e-05,1e-05,9e-06,3.3e-05,9e-06,1.1e-05,8e-06,3.6e-05,0,2.5e-05,-1.3e-05,-6.2e-05,-3e-05,1.2e-05,5e-05,8.1e-05,-4.4e-05,-1.8e-05,3.6e-05,-4e-06,-1.2e-05,3.3e-05,1.2e-05,2.8e-05,1.7e-05,-2.9e-05,-5e-06,1.4e-05,-2.9e-05,3e-05,3e-06,-5.3e-05,-1e-06,-4e-05,-3e-06,-2.6e-05,-6e-06,2.6e-05,1.4e-05,-2.5e-05,-2.7e-05,-1.3e-05,-3e-06,-3.3e-05,6.9e-05,-4.4e-05,-5e-06,1.4e-05,3.7e-05,0,-7e-06,-3.2e-05,7e-06,-1.2e-05,1.5e-05,6e-06,4e-06,-6e-06,-4e-05,4e-06,-2.8e-05,4.1e-05,1.4e-05,-4.6e-05,3.3e-05,-2e-05,-2.6e-05,4.5e-05,2e-06,5e-06,1.6e-05,5.1e-05,-2.8e-05,-7e-06,4.6e-05,4.1e-05,1.9e-05,-1.3e-05,-3.6e-05,5.3e-05,-2e-05,1.7e-05,1e-06,-1.2e-05,-2e-05,-8e-06,-7e-06,-1.1e-05,-6.4e-05,1.5e-05,-2e-06,6e-06,0,2.3e-05,-2.4e-05,-1.4e-05,9e-06,2.5e-05,1.6e-05,6.4e-05,3.2e-05,1.6e-05,-2.4e-05,-4e-06,-8.8e-05,6.6e-05,1e-06,-3e-06,9e-06,2.4e-05,-1.8e-05,1.6e-05,-4e-06,0
3.3e-05,-3.4e-05,1.6e-05,-4e-06,-4e-06,6e-06,1e-05,-1.4e-05,5e-06,-2.6e-05,-5.3e-05,0,7e-06,-2.1e-05,-8.5e-05,-7e-06,2e-06,-7e-06,5.9e-05,2.1e-05,-4e-06,-1.6e-05,-5.8e-05,3e-05,3.6e-05,-2.5e-05,-5e-06,2.1e-05,-1.1e-05,2.5e-05,2.9e-05,-1e-05,-8e-06,-1.5e-05,-3e-05,8e-06,2e-05,1.2e-05,4.4e-05,-1.4e-05,3e-05,9e-06,-6e-06,1e-05,1e-05,-2.8e-05,4.3e-05,-1e-05,2.7e-05,-4e-06,-1.2e-05,-3.4e-05,3.8e-05,-1.6e-05,-3e-06,1.8e-05,8e-06,6e-06,4.5e-05,9e-06,4e-05,9e-06,-5.6e-05,-6e-06,-5e-06,4.5e-05,2.5e-05,0,-2.5e-05,-2.5e-05,4.1e-05,-8e-06,1.7e-05,-1e-06,-4.3e-05,6e-06,2.4e-05,-1.3e-05,-6e-06,3.3e-05,1.4e-05,-3.7e-05,-1.1e-05,-1e-05,-6e-06,4.9e-05,-3e-05,3e-06,-2e-06,-3e-06,2.3e-05,8e-06,3e-06,-3.7e-05,-1e-05,5.5e-05,8e-06,-1.9e-05,-2e-06,0,-1.3e-05,9e-06,-4e-06,4.5e-05,-3.1e-05,3.8e-05,-5.2e-05,-2e-05,-2e-06,0,-5e-06,3e-05,-6.3e-05,7e-06,3.1e-05,1.1e-05,-4.8e-05,1.2e-05,1.1e-05,3e-06,1.1e-05
2e-05,2.5e-05,1e-06,1e-06,-3e-06,1.7e-05,5e-06,-1.7e-05,3.3e-05,2.6e-05,3.1e-05,4.7e-05,-1.5e-05,1.8e-05,0.000103,9e-06,-3.2e-05,1.8e-05,-5.4e-05,-1.1e-05,-7e-06,-5e-06,1.7e-05,-2e-06,2.3e-05,1.5e-05,1.4e-05,-1e-06,3e-06,-2.3e-05,-2e-05,-9e-06,3.4e-05,2e-05,9e-06,-6e-06,-2.7e-05,-2e-05,-3.7e-05,4e-06,-2e-06,-5e-06,2.9e-05,-1.3e-05,-6.2e-05,1.5e-05,-3.2e-05,3.2e-05,0,7e-06,3.6e-05,2e-06,-2.6e-05,4e-06,-5e-06,-4.9e-05,1e-06,1e-05,-4.5e-05,4e-06,-3.4e-05,-2.6e-05,5.7e-05,1.3e-05,7e-06,-7e-06,-2.3e-05,1.6e-05,7e-06,1.7e-05,-7e-06,7e-06,2.7e-05,4e-06,1.3e-05,-1.4e-05,-4.7e-05,0,-3e-05,-3.7e-05,-1.4e-05,2.5e-05,-4.7e-05,-2e-06,2.4e-05,-3.7e-05,2e-06,1.9e-05,-4e-06,-1e-06,-6e-06,3.1e-05,9e-06,6.6e-05,1.2e-05,-4.8e-05,-2.5e-05,4e-06,-8e-06,2e-06,-5e-06,1.1e-05,1.6e-05,-3.4e-05,1.1e-05,-4.2e-05,3.3e-05,3.8e-05,3e-06,9e-06,1.9e-05,-4.8e-05,1.6e-05,2e-06,2.8e-05,7e-06,5.2e-05,0,-6e-06,-5e-06,-2.4e-05
-4.2e-05,-2.7e-05,5e-06,-6e-06,2.2e-05,-2.8e-05,-1.5e-05,2.6e-05,-4.3e-05,-1.6e-05,1.8e-05,-4.8e-05,1.3e-05,0,-8.7e-05,-5e-06,4.4e-05,-8e-06,4.9e-05,-6e-06,1.3e-05,-3e-06,8e-06,-1.2e-05,-3e-05,-1.9e-05,-1.6e-05,-1.2e-05,2e-06,9e-06,-5e-06,-7e-06,-2e-05,-1.1e-05,-1.7e-05,7e-06,-3.2e-05,-6e-06,2.7e-05,3e-06,-3.3e-05,-1e-06,1e-05,-1.5e-05,1.8e-05,1.1e-05,1.2e-05,9e-06,-1.9e-05,-9e-06,6e-06,2.2e-05,1.9e-05,1.3e-05,2e-06,1e-05,-8e-06,-1.8e-05,3.3e-05,-1.3e-05,7e-06,4e-05,-2e-05,-2.4e-05,5e-06,-4.1e-05,5e-06,1.9e-05,9e-06,-4e-06,-3e-06,-1.6e-05,1e-05,6e-06,-2e-05,1.5e-05,4.8e-05,-7e-06,6e-06,3.5e-05,1.4e-05,1.6e-05,5.6e-05,7e-06,-1.3e-05,2.6e-05,5e-06,-1.3e-05,-1.9e-05,-1e-06,-1.6e-05,-3.6e-05,-8e-06,-6e-05,-7e-06,4.7e-05,2.3e-05,1.7e-05,1.3e-05,0,5e-06,2e-06,5e-06,9e-06,3e-06,-1.4e-05,1.9e-05,-3.1e-05,3e-06,1.4e-05,-2.2e-05,7.4e-05,4.3e-05,-5e-06,-6e-05,-2.5e-05,-6.1e-05,-6e-06,-7e-06,2e-06,5e-05
3.7e-05,2.2e-05,1.3e-05,6e-06,-3.5e-05,3e-06,1.5e-05,-4e-05,2.3e-05,1.3e-05,-3.1e-05,2e-06,-1.8e-05,-1.4e-05,5.1e-05,0,-1.1e-05,-2e-06,-4.9e-05,2.8e-05,-1.3e-05,3e-05,-1.6e-05,2.6e-05,-2.4e-05,2.4e-05,1.4e-05,-2e-06,1.7e-05,-5e-06,-5e-06,3e-06,-6e-06,-2e-06,1.7e-05,9e-06,7e-06,2.2e-05,-3e-06,-3e-06,3.6e-05,3e-06,-4.1e-05,3.3e-05,1.5e-05,-2.3e-05,-2e-06,-2e-05,4e-06,-6e-06,-3.2e-05,-4e-05,-1.5e-05,0,-9e-06,2e-06,1.2e-05,8e-06,-2.1e-05,7e-06,1.6e-05,-3.4e-05,-2.5e-05,1e-05,-6e-06,1.3e-05,-1e-05,1.2e-05,-3.9e-05,4e-06,1.2e-05,1.3e-05,1e-06,1.8e-05,3.4e-05,-1.6e-05,-4.5e-05,8e-06,2.6e-05,-3.4e-05,-1.6e-05,-3.2e-05,-1.4e-05,2e-06,-1e-05,-3.2e-05,-1.8e-05,-1.6e-05,1.9e-05,-1e-06,1.7e-05,8e-06,-4e-06,2.1e-05,-1.3e-05,-4.6e-05,3e-06,1e-06,-4e-06,-1e-06,-6e-06,4e-06,-1.1e-05,1e-06,3e-06,5.3e-05,-2.7e-05,-2.4e-05,-8e-06,-2.9e-05,1.2e-05,-3.4e-05,-5.4e-05,5e-06,1.7e-05,-5e-06,3.6e-05,-3e-06,-2e-06,0,-4.5e-05
-3.9e-05,-2.3e-05,5e-06,1e-06,1.2e-05,1.8e-05,-1.2e-05,3.2e-05,-2.7e-05,3.3e-05,-1e-06,2.9e-05,1.9e-05,4e-06,-2.1e-05,1e-06,7e-06,-8e-06,5.4e-05,-3.1e-05,6e-06,-3.5e-05,1.7e-05,-3.2e-05,-7e-06,-1.9e-05,-8e-06,3e-06,5e-06,-8e-06,-8e-06,1e-06,1.6e-05,3e-06,-8e-06,-1.5e-05,3.3e-05,-1.5e-05,4e-06,-7e-06,-8e-06,-5e-06,1.6e-05,-2.1e-05,3.3e-05,8e-06,5e-06,-1.8e-05,8e-06,6e-06,2e-06,4.4e-05,9e-06,-9e-06,8e-06,2.1e-05,3e-06,4e-06,9e-06,0,-2.5e-05,1.8e-05,6.4e-05,-6e-06,-3e-06,7e-06,2.3e-05,-9e-06,4.7e-05,-6e-06,-8e-06,-4.3e-05,-8e-06,1.2e-05,-3.4e-05,1.4e-05,3.6e-05,1e-06,-1.1e-05,3.1e-05,5e-06,2e-06,-1.6e-05,-8e-06,1.4e-05,6e-06,3e-05,1.6e-05,-3e-06,2e-06,-1e-06,7e-06,1e-06,1.8e-05,1.6e-05,4.4e-05,-2.4e-05,-2e-05,1e-06,1e-06,9e-06,-1e-06,-1e-05,2.5e-05,2e-06,-3.5e-05,3.1e-05,3.8e-05,1e-06,2e-06,-2e-06,2.1e-05,5.5e-05,-8e-06,1.4e-05,1.6e-05,-5e-06,-4e-06,1e-05,-1e-06,9e-06
1.3e-05,2.1e-05,-3e-06,3e-06,2.2e-05,-1.1e-05,6e-06,-1.2e-05,6.1e-05,-4.2e-05,2e-06,-9e-06,-1e-05,1e-05,5e-06,-1e-06,-1.8e-05,9e-06,-5.2e-05,6e-06,5e-06,6e-06,0,1.4e-05,1.4e-05,8e-06,2e-06,1.6e-05,-4.4e-05,1.7e-05,-4e-06,2.5e-05,-1.1e-05,-9e-06,2.7e-05,-3e-06,8e-06,1e-05,1.3e-05,4e-06,-1e-05,5e-06,1.3e-05,2e-06,-5.1e-05,1.3e-05,-1.2e-05,1e-05,0,-1e-06,1.6e-05,-2.5e-05,-2e-06,-5e-06,-3e-06,-3e-06,-5e-06,-3e-06,4e-06,0,1.7e-05,-8e-06,-5.1e-05,2e-06,8e-06,-4e-06,-6e-06,-4e-06,-3.1e-05,2e-06,1.4e-05,3.4e-05,-7e-06,-1.7e-05,2.8e-05,-6e-06,-2e-05,-6e-06,-2.1e-05,-2.5e-05,2e-06,1.6e-05,1.4e-05,4e-06,-1e-05,0,-2.7e-05,9e-06,5e-06,1e-06,-1.5e-05,7e-06,8e-06,-2.6e-05,-7e-06,-3.5e-05,1.8e-05,4e-06,5e-06,0,-5e-06,-1.4e-05,4e-06,-1e-06,-7e-06,-1.2e-05,-3.5e-05,1e-06,1e-06,1e-05,1e-06,-5.7e-05,-5e-05,7e-06,9e-06,6e-06,-6e-06,0,-1e-06,1e-06,6e-06
2.9e-05,-2.1e-05,-7e-06,0,-3.1e-05,4e-06,1e-06,0,-6.1e-05,9e-06,2.4e-05,-8e-06,3e-06,-3e-06,-6e-06,1e-06,-1.2e-05,7e-06,4.2e-05,2.6e-05,-5e-06,1.4e-05,-9e-06,-5e-06,4e-06,0,3e-06,-1.1e-05,1.5e-05,-1e-05,2e-05,-3e-06,-1.3e-05,1.4e-05,-2e-05,2.2e-05,-2.5e-05,6e-06,-1.8e-05,6e-06,9e-06,0,-9e-06,2.4e-05,-1e-06,-1.6e-05,8e-06,1.7e-05,-1e-06,2e-06,6e-06,-2e-06,-5e-06,8e-06,2e-06,-1.6e-05,1e-06,-3e-06,-1.1e-05,-2e-06,7e-06,-8e-06,9e-06,6e-06,-2e-06,2.1e-05,-2.5e-05,2e-05,2.2e-05,4e-06,-2.9e-05,-2.9e-05,-9e-06,-1.3e-05,-1.8e-05,2e-06,5e-06,3e-06,1.3e-05,1.7e-05,-1.2e-05,-6e-06,3e-06,-2e-06,4e-06,-3e-06,1.9e-05,-1.4e-05,-1e-05,1e-06,1.2e-05,-2.3e-05,4e-06,1.4e-05,-1e-06,3e-05,1e-06,1.1e-05,-1.6e-05,0,2e-06,3e-06,7e-06,-3e-05,2e-06,2.6e-05,1.1e-05,-1.8e-05,2e-06,5e-06,0,4.9e-05,3.3e-05,-9e-06,-1.1e-05,-4e-06,2.7e-05,-6e-06,-7e-06,-1e-06,-4e-06
-3.9e-05,1.9e-05,3e-06,-5e-06,1.2e-05,6e-06,-6e-06,2.2e-05,4.6e-05,2e-06,-4.7e-05,-1.4e-05,0,-1e-05,1.4e-05,0,2.3e-05,-1e-05,-3.7e-05,-3.6e-05,2e-06,-2e-06,5e-06,-9e-06,-1.8e-05,-5e-06,-4e-06,-1e-06,-1e-06,4e-06,8e-06,-1e-06,2.7e-05,-1.7e-05,4e-06,-2e-05,-1.6e-05,-2.5e-05,1.8e-05,-1e-06,-4e-06,-4e-06,-1e-06,-5.3e-05,7e-06,1e-06,8e-06,-1e-06,-2e-06,1e-06,-2e-05,2.2e-05,1e-05,4e-06,4e-06,-1e-05,-6e-06,-5e-06,1e-05,3e-06,-2.5e-05,2.6e-05,2.7e-05,-6e-06,-6e-06,-6e-06,3.2e-05,9e-06,-1.1e-05,-4e-06,9e-06,1.2e-05,-1.2e-05,3e-06,-6e-06,1e-06,3e-06,0,2.1e-05,-9e-06,2e-05,0,-2.1e-05,-1e-06,1.4e-05,1.9e-05,-5e-06,-5e-06,-5e-06,-1e-06,3e-06,1.6e-05,-8e-06,-1e-05,8e-06,-2.8e-05,-1.5e-05,-3e-06,1.7e-05,-2e-06,2e-06,2e-06,-3e-06,-4e-06,1e-06,-1e-06,2e-06,2e-06,1e-06,-7e-06,-8e-06,-2.3e-05,-2.6e-05,1.5e-05,-4.1e-05,-1.4e-05,-3.7e-05,5e-06,0,2e-06,5e-06
1.3e-05,-1.8e-05,1e-06,0,7e-06,-1.2e-05,1e-05,-3.1e-05,-6.5e-05,-1.9e-05,2.9e-05,3.6e-05,-6e-06,8e-06,-2e-05,-1e-06,-2.1e-05,-2e-06,4.2e-05,1.3e-05,1e-06,-2.3e-05,1.9e-05,2.3e-05,3e-06,1.1e-05,4e-06,2e-06,3.9e-05,2e-06,-2.1e-05,-1.6e-05,-1e-05,1.1e-05,-1.5e-05,-1e-06,1.3e-05,1.7e-05,-2.6e-05,-5e-06,-3e-06,4e-06,-1.1e-05,3.1e-05,3.1e-05,1.4e-05,-2.3e-05,-1.2e-05,-6e-06,0,2e-06,-3.3e-05,-1.1e-05,-6e-06,-5e-06,7e-06,-2e-06,1.1e-05,-1e-05,-4e-06,2e-05,-2.9e-05,-3e-05,8e-06,2e-06,-1.3e-05,-7e-06,-1e-05,0,-1e-06,1.5e-05,1.5e-05,1e-06,-5e-06,2.1e-05,-3e-06,-2e-06,2e-06,-1.8e-05,2e-06,-2.3e-05,5e-06,2.3e-05,-2e-06,-1.7e-05,-1.4e-05,-4e-06,9e-06,6e-06,0,-1.5e-05,5e-06,-2e-06,2.1e-05,-8e-06,2.9e-05,1.7e-05,-3e-06,-2.2e-05,1e-06,-4e-06,2e-06,-6e-06,2.1e-05,4e-06,-1.6e-05,-5e-06,0,1e-06,0,1.3e-05,4.4e-05,2.2e-05,-1.6e-05,6.5e-05,1.1e-05,2.8e-05,-3e-06,5e-06,-2e-06,3e-06
1.3e-05,1.7e-05,-1.5e-05,-1e-06,-9e-06,2e-06,-1e-05,2.8e-05,7.7e-05,1.7e-05,4e-06,-3.1e-05,1e-05,2e-06,1.3e-05,0,2.8e-05,2e-06,-4.9e-05,1.6e-05,-4e-06,2.9e-05,-3.3e-05,-2.3e-05,2.1e-05,-1.7e-05,-2e-06,-5e-06,-4.9e-05,-1.2e-05,-8e-06,-8e-06,-1.9e-05,-6e-06,3e-06,1.7e-05,1.8e-05,1e-06,1.2e-05,2e-06,1e-06,-1e-06,2.7e-05,7e-06,-2.2e-05,-1.1e-05,1.9e-05,-2e-06,4e-06,-1e-06,9e-06,3.4e-05,9e-06,-1e-06,4e-06,1.8e-05,2e-06,-2e-06,7e-06,1e-06,0,2.5e-05,-2e-06,-9e-06,8e-06,1.8e-05,-2.4e-05,-4e-06,-6e-06,-2e-06,-2.6e-05,-1e-05,1.2e-05,1e-06,-1.1e-05,0,2e-06,-3e-06,-2e-05,4e-06,1.7e-05,-2.3e-05,-5e-06,4e-06,-2e-06,1.6e-05,5e-06,-1e-06,5e-06,-1e-06,1.1e-05,-9e-06,2e-06,-2.7e-05,9e-06,-3.6e-05,-6e-06,1e-06,2.4e-05,0,5e-06,5e-06,-1e-06,-2.7e-05,-9e-06,1.3e-05,1.7e-05,4e-06,-3e-06,4e-06,-9e-06,-5.7e-05,-1.2e-05,1.5e-05,-1.6e-05,7e-06,-2.5e-05,0,1e-06,1e-06,-2.3e-05
-2.3e-05,-1.6e-05,-6e-06,2e-06,1e-05,8e-06,8e-06,-2.1e-05,-6.5e-05,-6e-06,-3e-06,6e-06,-7e-06,-3e-06,4e-06,1e-06,-1.6e-05,8e-06,4.5e-05,-2.7e-05,4e-06,-7e-06,3.3e-05,1.8e-05,1.3e-05,1.9e-05,0,8e-06,3.3e-05,9e-06,1e-05,6e-06,2.6e-05,4e-06,2e-06,-1.2e-05,-2e-06,-5e-06,-5e-06,5e-06,7e-06,-1e-06,-1.6e-05,-2.5e-05,-1.4e-05,-4e-06,-4e-06,8e-06,0,-4e-06,2e-06,-2.5e-05,-1.3e-05,5e-06,-5e-06,-6e-06,-5e-06,-9e-06,-2e-06,1e-06,-1.6e-05,-1.7e-05,3e-05,7e-06,-7e-06,-1e-05,2.3e-05,-1e-06,6e-06,5e-06,2.2e-05,2.1e-05,1.1e-05,1.4e-05,-4e-06,-1e-06,-5e-06,-1e-06,2.7e-05,-1e-05,-9e-06,3.3e-05,-1.7e-05,-3e-06,1e-05,-2e-05,-8e-06,-3e-06,1e-06,1e-06,5e-06,-9e-06,5e-06,1.5e-05,-1e-05,3.9e-05,-1.3e-05,-1e-06,-2.1e-05,0,0,-2e-06,3e-06,2.8e-05,6e-06,-1e-06,-1.4e-05,6e-06,0,-9e-06,2e-06,2.4e-05,-4e-06,-1.4e-05,-3e-05,-1e-05,1.5e-05,5e-06,-3e-06,0,2.9e-05
2.2e-05,2e-05,2e-06,3e-06,-1.6e-05,-5e-06,-2e-06,4e-06,6.2e-05,2.1e-05,-1.7e-05,1.1e-05,4e-06,-7e-06,-2.4e-05,-1e-06,-9e-06,-6e-06,-3.7e-05,1.6e-05,0,-1.6e-05,-1.8e-05,-6e-06,-4e-06,-1.7e-05,0,-2e-06,-3e-05,-1e-06,1.3e-05,8e-06,-1.4e-05,-1e-06,1.4e-05,-3e-06,-1.5e-05,6e-06,-2e-06,-2e-06,-8e-06,2e-06,-2e-06,3.2e-05,5e-06,1.4e-05,-9e-06,3e-06,-3e-06,1e-06,-4e-06,4e-06,1.6e-05,0,1e-06,-5e-06,3e-06,6e-06,-1e-06,1e-06,1.9e-05,2e-06,-3.4e-05,0,-2e-06,-2.5e-05,4e-06,0,7e-06,-3e-06,3e-06,-1.1e-05,1e-05,6e-06,1.1e-05,2e-06,8e-06,2e-06,1.1e-05,1.6e-05,-1e-06,-1.5e-05,2.4e-05,0,-1e-05,1e-05,8e-06,2e-06,-2e-06,0,-1.4e-05,2.6e-05,-2e-06,2e-06,7e-06,-3.9e-05,2e-05,-1e-06,2.4e-05,0,-4e-06,-4e-06,2e-06,-7e-06,-3e-06,2e-06,2e-06,-9e-06,0,3e-06,0,-2.1e-05,2.9e-05,1.6e-05,1.2e-05,2e-06,5e-06,-4e-06,0,0,-1.9e-05
-3e-06,-1.7e-05,9e-06,-1e-06,8e-06,3e-06,-3e-06,1.3e-05,-7.5e-05,-4e-06,1.8e-05,-1.5e-05,-3e-06,1.3e-05,4.1e-05,0,9e-06,-4e-06,3.5e-05,2e-06,0,1.2e-05,-1e-05,-8e-06,-1.5e-05,1.5e-05,1e-06,-5e-06,3.2e-05,0,-1.3e-05,4e-06,-3e-06,-2e-06,-3e-06,8e-06,-8e-06,-4e-06,7e-06,-5e-06,2e-06,-1e-06,8e-06,-1.6e-05,2.5e-05,-8e-06,1e-05,-4e-06,5e-06,-1e-06,-5e-06,2e-05,-1.6e-05,-6e-06,2e-06,-1.4e-05,5e-06,2e-06,3e-06,-2e-06,-7e-06,1.3e-05,1.3e-05,-4e-06,8e-06,2.1e-05,-1.5e-05,5e-06,-1.7e-05,1e-06,-1.2e-05,1.1e-05,1e-06,-4e-06,-2e-05,-2e-06,-1.4e-05,2e-06,-2.9e-05,-2e-05,1.4e-05,-1.2e-05,-1.3e-05,1e-06,8e-06,-1.3e-05,-5e-06,-1e-06,-7e-06,1e-06,8e-06,-1.9e-05,-5e-06,-1.3e-05,1e-06,3.3e-05,-6e-06,5e-06,-2.4e-05,0,1e-06,-1e-06,0,1.6e-05,3e-06,-6e-06,-2e-06,-3e-06,2e-06,8e-06,-1e-06,5.3e-05,-3.8e-05,-1.6e-05,1.2e-05,3e-06,-1.4e-05,2e-06,1e-06,1e-06,8e-06
-2.7e-05,1.7e-05,7e-06,-1e-06,1.3e-05,2e-06,6e-06,-2.2e-05,7.1e-05,-2.1e-05,1e-05,1.9e-05,0,-5e-06,-5.1e-05,0,-1.1e-05,5e-06,-4.2e-05,-1.4e-05,0,1.4e-05,3.6e-05,1.8e-05,-4e-06,-1.5e-05,-2e-06,1e-06,-4.1e-05,6e-06,2e-06,1e-06,1.6e-05,4e-06,-5e-06,0,6e-06,-1.2e-05,-1.1e-05,0,7e-06,0,-7e-06,-1.4e-05,-7e-06,-7e-06,-1e-06,-2e-06,1e-06,-1e-06,4e-06,-3.4e-05,1.6e-05,0,-3e-06,7e-06,-1e-06,-2e-06,-4e-06,1e-06,-1.1e-05,-2.4e-05,1.7e-05,6e-06,-1e-06,1.2e-05,5e-06,-6e-06,2.9e-05,-3e-06,8e-06,-2e-05,-1e-05,-5e-06,1.7e-05,4e-06,2e-05,-2e-06,-3e-06,2.3e-05,-2.1e-05,2.7e-05,-4e-06,1e-06,6e-06,1.2e-05,0,0,5e-06,-2e-06,6e-06,-2e-06,2e-06,2.3e-05,-1.2e-05,-2.5e-05,-1.1e-05,0,2.4e-05,0,2e-06,2e-06,1e-06,-6e-06,3e-06,0,-5e-06,4e-06,2e-06,2e-06,7e-06,-4.4e-05,2.5e-05,1.5e-05,1.4e-05,-3e-06,2.3e-05,9e-06,0,-1e-06,3e-06
