-1.9e-05,-0.004993,-0.011293,-0.006126,-0.011257,-0.104455,-0.221542,-0.216642,-0.17162,-0.166477,-0.152297,-0.114637,-0.067961,-0.024498,-0.00609,-0.002664,-0.003133,-0.002549,-0.001264,-0.001273,-0.001884,-0.000631,-0.000467,-0.00108,-0.001057,-0.000438,-6.4e-05,0
-3e-06,-0.00212,-0.004244,0.002391,0.012608,0.002927,-0.07909,-0.038305,0.064996,0.070189,0.103068,0.093368,0.053971,0.019804,0.004917,0.002995,0.003519,0.001833,0.000238,-0.000501,-0.000452,0.000116,0.000841,0.002427,0.001943,0.000801,3.6e-05,1.8e-05
5e-06,0.002318,0.00491,0.000415,0.002308,-0.004071,-0.061711,-0.082651,-0.067258,-0.05552,-0.030715,-0.004665,-0.001866,-0.0027,-0.00137,-0.00011,0.000415,-0.000166,-0.000245,-0.00048,4.3e-05,0.000148,-0.000452,-0.001621,-0.001133,-0.000439,-1.5e-05,4e-06
3e-06,0.002999,0.006906,-3e-06,-0.007933,-0.051275,-0.065814,-0.090716,-0.125556,-0.131637,-0.131068,-0.108705,-0.062643,-0.023621,-0.006897,-0.003262,-0.003797,-0.001187,0.000262,0.000199,0.00024,-0.000121,-0.000284,-0.000307,-0.000412,-0.000223,1.1e-05,2e-06
4e-06,8.6e-05,0.001141,0.003961,0.010325,0.080547,0.183848,0.221693,0.190167,0.167625,0.157418,0.103893,0.061247,0.024312,0.005865,0.002534,0.002193,0.001433,0.000559,0.001012,0.000862,0.000205,0.000747,0.001806,0.001545,0.000709,6e-05,1.7e-05
-8e-06,-0.003842,-0.009369,-0.002619,0.001944,0.071414,0.16553,0.16645,0.11291,0.120569,0.091786,0.063691,0.036625,0.01242,0.004236,0.001738,0.002225,0.00066,-0.00034,-0.000387,-0.000668,-0.000314,-0.000506,-0.00162,-0.001265,-0.000508,-7e-05,-1e-06
-9e-06,-0.001934,-0.004903,-0.003892,-0.01937,-0.11854,-0.140508,-0.165465,-0.150923,-0.134013,-0.15829,-0.127685,-0.076901,-0.028122,-0.006343,-0.003053,-0.003404,-0.001874,-0.000581,-0.001099,-0.001484,-0.000533,-0.000277,0.000203,-0.000223,-0.000231,-4.6e-05,-7e-06
8e-06,0.003023,0.007598,0.002652,-0.012884,-0.110041,-0.136521,-0.090943,-0.019291,-0.030414,0.003398,0.011113,0.007116,0.004597,0.000828,0.000579,3.6e-05,-0.000126,-9.1e-05,-0.000274,-2.2e-05,0.000294,0.000546,0.001091,0.001282,0.000643,6.2e-05,1.5e-05
1.1e-05,0.002545,0.005696,0.002141,-0.000247,0.013964,0.011497,0.033519,0.023911,0.027283,0.064207,0.07818,0.047897,0.015325,0.003394,0.001921,0.002617,0.001598,0.000305,0.000277,0.001019,0.000274,-0.00033,-0.001339,-0.000977,-0.000367,2e-06,6e-06
7e-06,-0.001219,-0.003315,-0.001016,-0.001962,-0.010224,-0.034018,-0.06079,-0.087207,-0.088395,-0.107106,-0.069214,-0.040571,-0.015683,-0.003971,-0.002079,-0.002061,-0.001023,-0.000144,0.000534,0.000593,-0.000196,-7.6e-05,0.00072,-5.8e-05,-0.000171,-6e-06,-2e-06
-5e-06,-0.002635,-0.005753,-0.001249,-0.006734,-0.009672,0.042404,0.068244,0.065665,0.026977,0.023047,-0.002586,-0.002447,0.001486,-0.000607,-0.000315,-0.001079,-0.000416,8.3e-05,0.000197,-0.000292,-0.000179,0.000227,0.000295,0.000799,0.000476,3e-06,7e-06
2e-06,-0.000458,-0.001163,-0.001009,1e-04,0.060619,0.161451,0.174357,0.126776,0.136219,0.131678,0.081795,0.048128,0.015651,0.004039,0.00206,0.00255,0.00152,0.000268,-0.000279,-1e-04,8.6e-05,-0.000254,-0.000966,-0.000744,-0.000336,-3.2e-05,2e-06
5e-06,0.002175,0.004884,0.000227,-0.001537,-0.012869,-0.028291,-0.065476,-0.057371,-0.016785,-0.068306,-0.057677,-0.033927,-0.01342,-0.001881,-0.001084,-0.00062,-0.000827,-0.000466,-0.000334,0.000337,0.000198,3.7e-05,0.000941,0.000177,-6.2e-05,2.3e-05,0
5e-06,0.001654,0.004196,0.001352,-0.007493,-0.083673,-0.16945,-0.149041,-0.064666,-0.085572,-0.078293,-0.052734,-0.032288,-0.008375,-0.00313,-0.001195,-0.001675,-0.001173,-0.000266,-0.000319,-0.000318,-1.9e-05,8.3e-05,-0.000273,0.000405,0.000368,3.2e-05,6e-06
-3e-06,-0.001458,-0.003549,-0.000313,0.002984,0.021376,-0.011597,0.014253,0.012431,0.006988,0.067407,0.071722,0.040857,0.013767,0.002056,0.00151,0.001617,0.001284,0.000448,-0.000176,-0.000504,-0.000115,-0.000123,-0.00059,-0.000608,-0.000322,-3.6e-05,-5e-06
-3e-06,-0.001595,-0.003922,-0.000972,0.009087,0.084194,0.062756,0.005209,-0.039576,-0.011584,-0.019414,0.001524,0.000556,-0.002063,0.000347,-0.000141,0.00027,0.000428,0.000237,-5.1e-05,-0.000127,-0.000136,7.9e-05,0.000967,0.000271,-3.6e-05,-1.8e-05,-1.2e-05
-4e-06,0.000448,0.001471,-2e-04,-0.001137,0.023576,0.021154,-0.002653,-0.002388,-0.040088,-0.050073,-0.046204,-0.025947,-0.006406,-0.001509,-0.001095,-0.00158,-0.001121,-0.000255,-0.00035,-0.000544,-0.000134,-7e-05,-0.000568,0.000208,0.000264,1e-06,-5e-06
3e-06,0.001288,0.003115,7.8e-05,-0.001493,0.01385,0.077764,0.111496,0.081546,0.060294,0.086661,0.04063,0.025278,0.00797,0.001415,0.00103,0.000809,0.000366,-0.000101,-0.000198,-0.000356,6.1e-05,-7e-06,-0.000278,-0.000401,-0.00023,-7e-06,-5e-06
5e-06,0.000579,0.00085,-2.3e-05,0.001438,0.0134,0.045341,0.032921,0.002832,0.057199,0.023685,0.007646,0.006016,-0.000782,0.001685,0.00037,0.000719,0.000476,-4.6e-05,0.000274,0.000313,2.7e-05,0.000107,0.000838,0.000213,-1.2e-05,1.7e-05,-6e-06
