-0.000248,-0.000247,-0.000201,-0.000189,-0.000188,-0.000161,-0.000286,-0.000278,-0.000266,-0.000175,-0.000232,-0.000101,-0.000198,-0.000221,-0.000132,-0.000444,-0.00025,-0.000234,-0.000148,-0.000197,-4.6e-05,-0.00015,-0.00011,-0.000232,-2e-04,-5.6e-05,-5.8e-05,-0.000199,-3.7e-05,-3.3e-05,-3.1e-05,-0.00013,-7e-06,-0.000118,3.6e-05,-4e-06,-0.000199,-2e-04,-5.6e-05,-3e-06,1e-06,-0.000151,-0.000218,-0.000232,-0.000107,-0.000189,-0.000234,-8.8e-05,-8.8e-05,1e-06,-0.000104,-0.000278,-0.000163,-7e-06,4.1e-05,-9.5e-05,-3.5e-05,-5e-05,-7.6e-05,-5.3e-05,-0.000149,-0.000138,-0.000159,-0.000121,-4e-05,3.3e-05,-0.000119,-0.000223,-0.000224,-6.4e-05,-7.4e-05,9.8e-05,-6e-05,3e-05,-0.000132,-6.9e-05,-0.000219,-7.8e-05,-1.7e-05,9.3e-05,-0.000129,-0.00017,-9.1e-05,-0.000129,-7.5e-05,-8.3e-05,-1.6e-05,-6.7e-05,6.6e-05,-0.000111,-6e-05,-0.000119,-1.8e-05,-0.000185,0.000136,-1.2e-05,-0.000134,3e-06,6e-06,-2.2e-05,-5.4e-05,-0.000142,1.1e-05,-0.000164,-7.4e-05,-0.000167,-0.000103,-0.000203,-0.000157,-0.000141,-0.000143,-5.1e-05,1e-06,-6.5e-05,-6.6e-05,-0.000211,-6.3e-05,5e-05,-0.000121,-0.000175,-0.000138
-9.7e-05,-0.000238,-0.000261,-0.000362,-0.000308,-0.000136,3e-06,-0.000126,3e-06,-0.000159,-0.000232,-5.8e-05,-0.000144,-0.00016,-0.000256,4.6e-05,-9e-05,-0.000103,-0.000155,-0.000225,-3.9e-05,-0.000147,-0.000167,2.6e-05,-3e-06,-0.000173,-0.000133,-7.4e-05,6e-06,-0.000118,-0.000133,-0.000202,-0.000122,-7.2e-05,-0.000187,-0.000143,-2.5e-05,-7.5e-05,-0.000104,-0.000172,-0.000118,-0.000149,-9.7e-05,-1.4e-05,6.5e-05,-0.000231,-0.000168,-0.000156,-4.5e-05,-8.8e-05,-0.000137,0.000105,-8.7e-05,-5.3e-05,-0.000145,-0.000144,-0.000132,-0.000213,-4.1e-05,-9.9e-05,-4.5e-05,-0.000259,-0.000186,-8.3e-05,-3.4e-05,-4.5e-05,-2.6e-05,-3.2e-05,-0.000109,-0.000127,-1.2e-05,-4.1e-05,-0.000113,1.1e-05,3.6e-05,1.8e-05,2e-06,-0.000148,-0.000153,-0.00011,-0.000151,3e-05,-0.000249,1e-05,-9.8e-05,-4.9e-05,-0.000203,-0.000258,-0.000166,-0.000152,-0.000188,-0.000246,-8.9e-05,-0.000125,-0.000159,-7.7e-05,2e-05,-0.000254,-0.000202,-0.000184,-0.000261,-6e-05,-8.9e-05,-0.000156,-0.000232,-9.9e-05,-0.000108,-3.7e-05,1.5e-05,-0.000218,-6.9e-05,-0.000128,-0.000132,-0.000233,-0.000129,-0.000165,-9.3e-05,-3.8e-05,-9e-06,9e-06,-9.3e-05
4.5e-05,0.000185,-6e-06,0.00017,0.00028,0.000112,-2e-05,1.5e-05,-6.7e-05,-6.3e-05,6.3e-05,6.7e-05,8.6e-05,3e-05,0.000113,8.4e-05,-2.8e-05,2.4e-05,2.3e-05,8.8e-05,4.8e-05,-0.000141,-8.3e-05,-0.000185,-0.000202,-5.7e-05,5.6e-05,5.4e-05,-2.6e-05,-3.1e-05,-0.000109,-6.7e-05,-0.000149,-7.1e-05,-4.2e-05,6.3e-05,-4.4e-05,6.9e-05,-8.9e-05,-5e-06,1e-05,0.000218,1.7e-05,-0.000109,1.7e-05,0.000304,0.000195,-5.8e-05,-4.1e-05,-0.000145,-5.9e-05,-0.000114,-6.7e-05,-0.000116,1.6e-05,0.000109,4.9e-05,-1.8e-05,-0.000101,-2.8e-05,-7.1e-05,6e-06,3.8e-05,4.1e-05,-1.7e-05,-7.1e-05,-9.4e-05,-4e-05,3.3e-05,-0.000194,-7.6e-05,-0.00018,-8.7e-05,-5e-06,-8.3e-05,1.7e-05,-6.7e-05,-1.4e-05,-8.4e-05,-0.000127,-7.4e-05,-6.3e-05,-7.2e-05,-0.000131,-3.5e-05,-1.6e-05,-0.000154,-4.3e-05,0,-1e-05,0.000196,0.000108,-2.8e-05,3.1e-05,-0.000117,-0.000199,-0.000241,-0.000124,-7e-05,-3.8e-05,-6.4e-05,2.6e-05,3.8e-05,5.1e-05,4.3e-05,6.5e-05,-2.2e-05,-0.000151,-3e-05,-5.7e-05,2.1e-05,-7e-06,-7.2e-05,-3.6e-05,-0.000131,-5.3e-05,7e-06,-5.2e-05,-5.9e-05,1.2e-05,3.2e-05
3.8e-05,-4.1e-05,-7.7e-05,-0.000167,-0.000293,-0.000165,-1.3e-05,-0.000212,-2.7e-05,6e-06,-8.8e-05,-9.8e-05,-0.000236,-0.000226,-0.000103,-0.000126,-0.000247,-9e-05,-2.1e-05,-6.7e-05,-0.000282,-0.00019,-0.000134,3.5e-05,-0.000102,-0.000203,-0.000162,-0.000123,-9.3e-05,-7.7e-05,0.00012,-4.5e-05,-5.1e-05,-9.7e-05,-0.000132,2.1e-05,1.3e-05,-0.000149,-9.1e-05,-6.9e-05,-6.6e-05,-0.000151,1.2e-05,-3.3e-05,-3.1e-05,-0.00023,-0.000257,-8.3e-05,-2.1e-05,-6.8e-05,-1e-05,0.000102,0.000182,4.3e-05,-0.000156,-0.000135,-0.000111,-1.6e-05,-0.000143,-1.1e-05,-8.7e-05,2.8e-05,-0.000146,-0.000258,-0.000105,-0.000106,1.8e-05,-4.7e-05,-9.2e-05,-9.7e-05,-2.8e-05,5.6e-05,-6.4e-05,3.3e-05,-8.3e-05,-1.1e-05,-2.6e-05,-7e-06,-7.6e-05,3.5e-05,-1.1e-05,-0.000132,-4e-05,2.6e-05,-0.000121,-0.000132,7.6e-05,-2.8e-05,1.4e-05,9e-06,-0.000115,-0.000194,-0.000117,-3.9e-05,-5.7e-05,2e-05,5.4e-05,-3.5e-05,-4.9e-05,-0.000113,4.1e-05,-6e-06,-9.2e-05,-0.000212,-3.7e-05,-8.7e-05,-8.6e-05,-2.8e-05,-2.8e-05,-4.3e-05,-8.6e-05,-5.8e-05,-9.5e-05,5.8e-05,-7.4e-05,-3.6e-05,-0.000105,2.4e-05,-6.8e-05,-9.2e-05,0.000127
-8.5e-05,6e-06,-4.9e-05,0.000173,5.1e-05,3.8e-05,2e-05,5.5e-05,-0.000103,-6e-06,0.000174,0.000174,3.7e-05,0.00026,1e-04,-3.9e-05,0.000299,6.5e-05,0.000108,0.000126,0.000241,0.00029,0.000248,2.4e-05,0.00016,5.3e-05,0.000114,0.000129,1.1e-05,5.3e-05,0.000129,3e-05,-2e-06,4.5e-05,4.8e-05,9.8e-05,0.000113,0.000151,6.1e-05,1.1e-05,0.000101,-5e-06,1.2e-05,8.9e-05,-5e-06,7.6e-05,0.000158,0.000116,9.7e-05,4.3e-05,3.7e-05,-7.8e-05,-0.000126,1.2e-05,5e-05,7.5e-05,-1.7e-05,0.000138,6.3e-05,5.9e-05,-2.4e-05,-3.2e-05,2e-05,0.00018,0.000203,5.7e-05,4.6e-05,0.000117,8.6e-05,0.000181,5.7e-05,3.9e-05,0.000173,3.4e-05,4.6e-05,0.000145,-2.5e-05,8.7e-05,-2e-05,8.9e-05,0.000116,0.000184,3e-05,4e-05,7.5e-05,1.6e-05,-2e-06,7.3e-05,0,-4.4e-05,9e-06,0.000166,0.000186,0.000101,-3.5e-05,4e-06,7e-06,7.5e-05,0.000136,6.4e-05,3.8e-05,6e-05,-1.4e-05,7.1e-05,0.000116,0.000139,0.000111,2.2e-05,4.3e-05,0.000114,0.000172,1e-04,-6.4e-05,5.3e-05,1e-06,7.4e-05,0.000151,3.3e-05,7.7e-05,4.4e-05,1e-05
0.000116,-1.4e-05,9.4e-05,3.1e-05,0.000148,0.000102,-3.4e-05,-1.9e-05,4e-05,-7.4e-05,-3.7e-05,3.3e-05,-1.8e-05,-5.5e-05,-0.000102,6.7e-05,-0.000211,-4.1e-05,-3.1e-05,-3.2e-05,-0.00012,-0.00012,-5.1e-05,6.1e-05,-6.8e-05,3.7e-05,-4.9e-05,-3e-05,5.3e-05,-1.6e-05,4.8e-05,0.000132,2e-06,5.3e-05,4e-06,-8.2e-05,-9.5e-05,-9e-06,-3.8e-05,2.8e-05,8e-05,7.9e-05,-0.00013,-3.6e-05,3.5e-05,-2.3e-05,-8e-05,-7.3e-05,7.5e-05,5.7e-05,-5.8e-05,1.5e-05,2.9e-05,5.5e-05,1.3e-05,0.000154,0.000102,-2.6e-05,-2e-06,-4e-06,3.9e-05,-1.2e-05,2.7e-05,-7.8e-05,-0.000106,2.1e-05,4.5e-05,-9e-05,-2e-05,-6.1e-05,2.6e-05,1.5e-05,-2.8e-05,1.5e-05,-5e-06,-6.9e-05,-3e-06,-0.000116,8e-05,-1.2e-05,-2e-06,-5.8e-05,-4.2e-05,-4e-05,4.5e-05,8.6e-05,2.8e-05,-3.1e-05,6.9e-05,5.7e-05,9e-06,-1.8e-05,-1e-06,2.1e-05,-4.8e-05,3.6e-05,1.6e-05,7e-06,-6.1e-05,7.2e-05,5.1e-05,4e-05,9e-06,-3.5e-05,-9.9e-05,-7.8e-05,-1.2e-05,3.8e-05,-2.4e-05,-6.2e-05,-7.2e-05,-5e-05,6.2e-05,2.5e-05,5.7e-05,2.3e-05,-0.000119,2.3e-05,6.9e-05,-4.3e-05,2.9e-05
2.5e-05,-0.000149,2e-06,-0.000103,-0.000169,-0.000122,-1.7e-05,-2e-06,-6.6e-05,7e-05,-4e-05,-3.7e-05,5.7e-05,-2.2e-05,1.7e-05,-5e-06,4e-05,7.4e-05,-6.4e-05,-5.6e-05,9e-05,5.9e-05,-2.3e-05,-1.7e-05,9e-05,-8.1e-05,-3.2e-05,2.3e-05,-1.5e-05,5.5e-05,-8.7e-05,-0.000104,-8.7e-05,-4.1e-05,-3e-05,1.8e-05,5.2e-05,1.9e-05,6.1e-05,-2.7e-05,-6.9e-05,-7.6e-05,7.2e-05,-1.4e-05,-7.4e-05,9.5e-05,2.2e-05,-1.2e-05,-3.4e-05,-1e-04,1.3e-05,0,-8.5e-05,-9.5e-05,-9.5e-05,-0.000103,-2.4e-05,1.7e-05,1.7e-05,-5.9e-05,-3e-05,4e-06,-7.3e-05,2.3e-05,2e-05,7.1e-05,-1.1e-05,7e-06,7.6e-05,5.3e-05,7.8e-05,-0.000108,7e-06,2e-06,1e-06,2e-05,1.8e-05,-5.2e-05,3.8e-05,3.2e-05,-8e-06,-2.1e-05,6.9e-05,-3.2e-05,7.6e-05,-3.4e-05,1.6e-05,-7.5e-05,1.8e-05,1.9e-05,-3e-06,-7.2e-05,2e-05,7e-06,5e-05,3.1e-05,7e-06,-4.1e-05,-8.5e-05,-4.6e-05,-5.1e-05,1e-05,4.8e-05,3.7e-05,-2.9e-05,1.6e-05,3e-05,-5.7e-05,-1.3e-05,2.9e-05,7.3e-05,-1e-05,1.8e-05,5e-06,-3.8e-05,-2.9e-05,-2.1e-05,6.1e-05,1e-05,3.1e-05,6.1e-05
-1.6e-05,6.8e-05,-7.7e-05,-0.000101,-4e-05,1.3e-05,-3.2e-05,-1.5e-05,-8.7e-05,-5.5e-05,-7.6e-05,-8.5e-05,-7.7e-05,-5e-05,1e-05,-0.000121,-0.000158,-0.000202,2.8e-05,-2.7e-05,-8.1e-05,-3.1e-05,-2.7e-05,-8.9e-05,-0.000122,-4.8e-05,-4.8e-05,-4.4e-05,-7.7e-05,-3.3e-05,1.5e-05,1e-05,-5.3e-05,-2.7e-05,-3.1e-05,-5.5e-05,-0.00015,-7.4e-05,-5.3e-05,-0.000106,1e-05,9e-06,-8.8e-05,-3.1e-05,5.4e-05,3.7e-05,-2.4e-05,-2.5e-05,-6.7e-05,4.4e-05,-5.2e-05,5.6e-05,0.000156,4.7e-05,-6e-05,-5.5e-05,2.5e-05,-8e-06,-8.3e-05,-2.2e-05,-2.4e-05,-0.000142,3.3e-05,-5.9e-05,-3.6e-05,-3.6e-05,-4.1e-05,-5.8e-05,-7.4e-05,-5.4e-05,-8.6e-05,4e-06,-6.1e-05,-8e-05,-6.8e-05,-9e-06,-5.8e-05,-1.5e-05,-6.2e-05,-4.6e-05,-3.4e-05,-6.6e-05,-0.000121,-5.3e-05,-7.6e-05,-3.6e-05,-1.4e-05,-2.9e-05,-7.9e-05,-6e-05,-4.1e-05,-5.6e-05,-0.000107,-3.6e-05,-4.4e-05,1e-05,-6.4e-05,-5.9e-05,-4.6e-05,-3.2e-05,0,-2.6e-05,-6.8e-05,-7e-06,-2.5e-05,-1.6e-05,-9.1e-05,-1.8e-05,-6.9e-05,-3.4e-05,-4.1e-05,-6.9e-05,-9.1e-05,-1.9e-05,-8.6e-05,-2.7e-05,-2.7e-05,-7.4e-05,-2.1e-05,-5.4e-05,-5.8e-05
5.4e-05,3e-06,-2.6e-05,9.2e-05,3.9e-05,-1.9e-05,-5.1e-05,7e-06,0.000129,3.9e-05,4.1e-05,-3.8e-05,4e-05,0,-5.1e-05,9.4e-05,3.2e-05,0.000104,-6.2e-05,-4.3e-05,-0.000146,-4e-05,-3.8e-05,2e-05,3.9e-05,2.4e-05,-3.5e-05,-7.1e-05,0.000102,-1e-05,5e-06,5.8e-05,-2.4e-05,-1.4e-05,-3e-06,-2.8e-05,-1.1e-05,4.1e-05,-3e-06,8e-06,-2.6e-05,-6.4e-05,-3.1e-05,3.9e-05,-4.1e-05,-1e-06,5e-06,-2e-05,-1.4e-05,-4e-06,2.1e-05,1.9e-05,-7e-06,7e-06,4e-06,2e-06,-5.3e-05,-5.6e-05,-2.8e-05,6.9e-05,8e-06,5.5e-05,5.9e-05,-8.2e-05,-3.8e-05,1.8e-05,2e-06,4.7e-05,-7e-06,9e-06,-3e-06,-4.5e-05,5.8e-05,5.6e-05,-1.1e-05,1.7e-05,1.6e-05,-2e-06,0,-2.8e-05,3.4e-05,1.8e-05,8.7e-05,9.3e-05,2.2e-05,-4e-05,-5e-05,5.5e-05,-4.6e-05,1.2e-05,2.9e-05,6e-06,3.6e-05,1.7e-05,5e-06,-1.8e-05,-2.7e-05,1e-05,-9e-06,1.7e-05,-6.2e-05,-5.7e-05,8.2e-05,1.4e-05,-4.5e-05,-1.9e-05,2.2e-05,-1.7e-05,-3.7e-05,3.8e-05,1e-05,1.2e-05,-2e-06,-9e-06,2.5e-05,-3.5e-05,-2.4e-05,-1e-06,3.5e-05,-3e-06,-7e-06
-1.6e-05,2.2e-05,4.2e-05,-3.2e-05,6.2e-05,-2.3e-05,9e-06,0,-2.6e-05,2.2e-05,-1.3e-05,2.5e-05,9.7e-05,1.1e-05,3.1e-05,-5.3e-05,-4.5e-05,-5e-06,4.6e-05,4.8e-05,5.9e-05,5.2e-05,4.9e-05,-1.7e-05,-1.1e-05,5.1e-05,2.2e-05,2.2e-05,-1.5e-05,-1.8e-05,-6e-06,5.5e-05,4.7e-05,4.4e-05,2.5e-05,1.8e-05,2.9e-05,3e-05,1.4e-05,2.6e-05,-1.6e-05,-4e-06,3.4e-05,-2.1e-05,-4.3e-05,-2.3e-05,1.7e-05,8.2e-05,0,5.2e-05,3.7e-05,-9.6e-05,-1.4e-05,-2.7e-05,1.5e-05,-8e-06,2e-06,3.6e-05,4.7e-05,5e-06,3.8e-05,1e-06,-1.7e-05,2.1e-05,3.2e-05,-5e-06,-3e-06,-5e-06,3.2e-05,2e-05,-7e-06,3.4e-05,5e-06,4e-06,3e-06,2.4e-05,1e-05,-1.3e-05,-5.4e-05,1.8e-05,2e-05,3.2e-05,-1.2e-05,8e-06,-2e-05,-3e-06,3.8e-05,-7e-06,-3e-06,3.5e-05,-2e-06,2.4e-05,2.1e-05,2.9e-05,6.1e-05,1e-05,3.7e-05,2.3e-05,7e-06,6.7e-05,3.5e-05,2.2e-05,-3.6e-05,-9e-06,9.4e-05,-8e-06,-3e-06,4e-05,4.5e-05,8e-06,-1e-05,2.2e-05,5.9e-05,2.4e-05,6.9e-05,4e-06,-2.5e-05,-3e-05,-4.4e-05,-1.1e-05,2.1e-05
1e-06,-4.5e-05,1.2e-05,2.8e-05,3e-06,2.2e-05,1.1e-05,2e-06,4.4e-05,-7e-06,8e-06,-1.7e-05,1.2e-05,-1.5e-05,1e-06,6.4e-05,2.8e-05,-2.6e-05,-1e-05,-2.1e-05,2.7e-05,1.8e-05,-2.9e-05,4.7e-05,4.2e-05,3.2e-05,-1.7e-05,3e-06,3.2e-05,4.3e-05,-1.9e-05,1.2e-05,1.2e-05,-2.9e-05,4.1e-05,-1.9e-05,1e-06,-1.8e-05,4e-06,3.5e-05,2.3e-05,2e-05,-3.5e-05,-2e-06,3.2e-05,1.8e-05,1.8e-05,-8.8e-05,-1.3e-05,1.8e-05,-2.8e-05,-6e-06,3.5e-05,-2.7e-05,9e-06,-3e-05,8.5e-05,0,-1.2e-05,6.2e-05,9e-06,2.1e-05,-2e-06,1.4e-05,2e-06,5.8e-05,4.6e-05,3e-06,1.3e-05,1e-06,2.3e-05,1.1e-05,-3.1e-05,2.8e-05,3.2e-05,-8e-06,0,2.6e-05,2.2e-05,1.9e-05,2.4e-05,1.1e-05,-6e-06,1.8e-05,2e-05,1.8e-05,-6e-06,2.3e-05,3e-05,2e-06,-3e-06,3e-06,-3.1e-05,-3.6e-05,7e-06,7e-06,2.7e-05,0,1.7e-05,-9e-06,1.6e-05,1.8e-05,2.5e-05,-5e-06,-1.3e-05,-4e-05,1.9e-05,-3.5e-05,-9e-06,-2.4e-05,-6e-06,-3e-06,-3.4e-05,1.4e-05,8e-06,3.3e-05,3.3e-05,3.2e-05,1e-05,-1.7e-05,-8e-06
3.7e-05,2.2e-05,1.6e-05,5.7e-05,5e-06,3e-06,-7.7e-05,1.8e-05,-1.2e-05,-2.7e-05,-1e-06,3.3e-05,4e-05,-3e-06,0,-5.1e-05,-4.1e-05,1.4e-05,1.9e-05,3.2e-05,-8e-06,8e-06,2.5e-05,-1e-05,-2.5e-05,3e-06,-2.4e-05,-1e-06,-1.4e-05,-3.8e-05,-2.5e-05,2e-06,-3.2e-05,4e-06,0,3.1e-05,-5.3e-05,-1e-06,-1.3e-05,-3.6e-05,-2.5e-05,-4e-06,-1.9e-05,2.5e-05,4e-06,-4.5e-05,-1e-06,8e-05,2.3e-05,-9e-06,-5e-06,-1.8e-05,-4e-06,3e-06,-3.4e-05,-2.2e-05,-7e-06,-1.5e-05,7e-06,-2.8e-05,-1.6e-05,-8e-06,3.7e-05,5e-06,-2.2e-05,-3.1e-05,-1e-05,1e-06,-4e-06,3e-06,-1.3e-05,-1.3e-05,-2.1e-05,1e-06,-3e-05,-4.3e-05,-2.7e-05,5e-06,-4.3e-05,-1.2e-05,1.6e-05,5e-06,6e-06,-3.9e-05,-1e-06,-7e-06,-1.3e-05,-1e-06,-1.8e-05,1.9e-05,8e-06,-1.1e-05,1.7e-05,1.2e-05,-3e-06,-3.4e-05,-1.6e-05,-3e-05,-2.1e-05,-4.1e-05,-1.4e-05,1.5e-05,2.9e-05,1.2e-05,-3e-06,1.9e-05,-2.6e-05,1.1e-05,-5e-06,-2.8e-05,3e-06,-3.6e-05,5.4e-05,1e-06,-2.3e-05,-3.1e-05,-1.2e-05,-2.3e-05,3e-06,2.8e-05,-7e-06
-1.6e-05,-3.1e-05,-2.7e-05,-2e-05,-4.8e-05,-9e-06,4.5e-05,1e-06,-2.1e-05,2.8e-05,1.8e-05,-8e-06,-2.6e-05,-1e-05,1.1e-05,-3e-06,3.5e-05,-4.4e-05,-4.4e-05,-3.1e-05,1.3e-05,-4.3e-05,-7e-06,-3.1e-05,2.6e-05,1e-05,-9e-06,-9e-06,-9e-06,-1e-06,-1.2e-05,-1e-06,9e-06,1.6e-05,-2.2e-05,-1.4e-05,-1.1e-05,-3.2e-05,-1.2e-05,3.6e-05,-9e-06,-9e-06,2e-05,-3e-06,5.5e-05,5.1e-05,8e-06,-3.5e-05,-2.7e-05,-1.3e-05,-2e-06,3.9e-05,-1.5e-05,9e-06,-1.4e-05,-7e-06,-2.3e-05,3.2e-05,-5e-06,-3e-05,-1.5e-05,5e-06,-2.5e-05,1.5e-05,-1.2e-05,-6e-06,1.5e-05,5e-06,-1.3e-05,-9e-06,-2e-05,-3.4e-05,1.7e-05,-3e-06,-5e-06,-1.6e-05,-1.1e-05,-2e-05,-1.9e-05,0,-1.8e-05,-1e-05,-3.6e-05,-1.4e-05,-3.4e-05,1.5e-05,8e-06,-1.5e-05,-2.5e-05,-1e-05,2.1e-05,2e-06,-3.2e-05,-1.3e-05,0,-5e-06,4e-06,4e-06,-1.3e-05,-6e-06,0,-3e-06,-2.3e-05,-2e-05,9e-06,-2.1e-05,-1.9e-05,-7e-06,-2e-06,0,1.1e-05,-1e-05,-4.2e-05,-4e-06,-7e-06,-2.3e-05,-1e-05,-4.5e-05,-1.1e-05,1.5e-05,-1.7e-05
-2e-06,2.7e-05,2.1e-05,-9e-06,1.5e-05,1.3e-05,-1.8e-05,-2.2e-05,-4e-06,-1.9e-05,-1.5e-05,1.2e-05,-3e-06,2.1e-05,-1.1e-05,8e-06,-3e-06,-7e-06,3.8e-05,-3e-06,-6e-06,-8e-06,1e-06,3.2e-05,-3e-05,-1.7e-05,1.3e-05,-6e-06,1.3e-05,1.4e-05,-2.3e-05,2.9e-05,1.5e-05,-1e-05,-8e-06,4e-06,3.4e-05,-1.2e-05,-1e-06,-2.1e-05,-4e-06,5e-06,-1.9e-05,-1e-05,-2.5e-05,-3.1e-05,-2e-06,2e-06,3e-05,-8e-06,-5e-06,5e-06,7e-06,-1.4e-05,1.1e-05,7e-06,-1.4e-05,-2.6e-05,1.5e-05,-3e-06,-9e-06,1e-05,1e-05,-9e-06,-1.4e-05,-8e-06,-7e-06,-1.6e-05,3e-06,4e-06,1.4e-05,-1.3e-05,-2.3e-05,3e-06,5e-06,-7e-06,8e-06,9e-06,1e-05,-5e-06,-3e-06,1.5e-05,4.1e-05,-3e-06,1e-06,-1e-05,-2.1e-05,-1.1e-05,6e-06,9e-06,-1.9e-05,3e-06,0,7e-06,-1e-06,-1.1e-05,0,-4e-06,-3e-06,-1e-06,5e-06,-1.9e-05,-2.1e-05,6e-06,-1e-05,3e-06,3e-06,-1.6e-05,1e-05,3e-06,-1.1e-05,-7e-06,1.2e-05,-1.2e-05,1.2e-05,2e-05,-9e-06,8e-06,4e-06,-1.1e-05,1.5e-05
-1.8e-05,-1.7e-05,1.6e-05,2.1e-05,-5e-06,8e-06,-5e-06,7e-06,-2e-05,6e-06,1.7e-05,-2e-06,8e-06,1e-06,-1.4e-05,-7e-06,1e-06,1.2e-05,-1.6e-05,-8e-06,1.2e-05,1e-05,-1.3e-05,-1.7e-05,2e-06,-1e-06,5e-06,5e-06,-3.1e-05,-1.1e-05,1.5e-05,-1.4e-05,9e-06,-4e-06,4e-06,6e-06,8e-06,-7e-06,-5e-06,-9e-06,1.3e-05,5e-06,2.4e-05,1.7e-05,-1.5e-05,-9e-06,2e-06,1.4e-05,0,1.2e-05,-2e-06,-1.2e-05,1.2e-05,-1e-06,-1.9e-05,-6e-06,5e-06,9e-06,-1e-05,0,3e-06,5e-06,3e-06,-9e-06,0,3e-06,0,3e-06,6e-06,2e-06,2e-06,1.8e-05,-3e-06,-1.7e-05,-1e-05,2e-06,-2e-06,6e-06,-8e-06,-8e-06,2e-06,6e-06,-7e-06,7e-06,3.1e-05,3e-06,1.4e-05,1e-05,2.4e-05,-2e-06,6e-06,-1e-06,7e-06,5e-06,1.6e-05,-2e-06,-1.1e-05,7e-06,3e-06,-1e-05,2e-06,-1e-06,1.6e-05,-6e-06,-2e-06,1.1e-05,1.2e-05,2.3e-05,-1e-06,1.7e-05,1.3e-05,6e-06,-2e-06,1e-05,-2e-06,0,-6e-06,7e-06,-1e-06,-5e-06,-3e-06
-1.1e-05,1.1e-05,-3e-06,-7e-06,-4e-06,-8e-06,4.2e-05,-2e-06,2.4e-05,1e-06,-1.2e-05,-3e-06,-2e-06,-4e-06,1e-06,1.5e-05,1e-05,-2.5e-05,4e-06,8e-06,7e-06,-6e-06,1.4e-05,3e-06,9e-06,9e-06,-6e-06,8e-06,1.5e-05,6e-06,1.1e-05,3e-06,2e-06,-4e-06,-1.5e-05,-3e-06,-6e-06,5e-06,7e-06,6e-06,-1e-06,-4e-06,2e-06,1e-06,0,-1.1e-05,3e-06,0,-1e-05,-7e-06,-3e-06,-3e-06,2e-06,9e-06,2e-06,1e-05,-4e-06,1.4e-05,0,9e-06,0,-6e-06,2e-06,2.1e-05,5e-06,3e-06,-2e-06,8e-06,-9e-06,2e-06,-7e-06,-1.2e-05,1.2e-05,3e-06,2e-06,7e-06,-1e-06,-7e-06,-3e-06,-2e-06,-1.5e-05,-4e-06,-8e-06,1.2e-05,1e-06,-4e-06,-9e-06,-8e-06,-2e-06,-5e-06,3e-06,5e-06,-4e-06,-6e-06,5e-06,-3e-06,-6e-06,1.2e-05,-6e-06,-5e-06,-3e-06,-6e-06,8e-06,1e-06,7e-06,-5e-06,-1e-06,-1.7e-05,-1.6e-05,3e-06,6e-06,-3e-06,-7e-06,-1.2e-05,-2e-06,-6e-06,-1.2e-05,3e-06,9e-06,3e-06,5e-06
0,-8e-06,-6e-06,5e-06,1e-06,-9e-06,-1.9e-05,-2e-06,-1.6e-05,-8e-06,1e-06,-7e-06,-3e-06,3e-06,3e-06,-1.2e-05,-4e-06,1.6e-05,-2e-06,-8e-06,-7e-06,-2e-06,-7e-06,1e-06,-2e-06,1e-06,8e-06,-6e-06,-2e-06,5e-06,7e-06,-3e-06,6e-06,1e-06,2e-06,-6e-06,3e-06,-7e-06,-1e-06,4e-06,-4e-06,-7e-06,-1.4e-05,-4e-06,8e-06,1.1e-05,4e-06,-1.3e-05,3e-06,4e-06,-5e-06,-5e-06,-4e-06,-3e-06,-1e-05,-1e-06,-7e-06,-1.8e-05,-3e-06,-8e-06,5e-06,3e-06,-7e-06,-2.1e-05,7e-06,-1.3e-05,-3e-06,-1e-05,1e-06,-4e-06,5e-06,1.4e-05,-3e-06,4e-06,-5e-06,3e-06,3e-06,-2e-06,-5e-06,-1.5e-05,-1e-06,1e-06,6e-06,-2e-06,-8e-06,1e-06,-1e-06,6e-06,-7e-06,2e-06,4e-06,-5e-06,6e-06,3e-06,-1e-06,8e-06,1e-06,-2e-06,1e-05,4e-06,-1e-06,-1e-06,3e-06,-1e-06,-6e-06,0,6e-06,1.1e-05,0,7e-06,-5e-06,0,1e-06,-3e-06,1.6e-05,5e-06,8e-06,2e-06,-6e-06,-2e-06,-6e-06
4e-06,5e-06,0,-3e-06,1e-05,3e-06,-5e-06,3e-06,7e-06,8e-06,2e-06,1e-05,1e-06,-4e-06,-2e-06,0,-1e-05,3e-06,5e-06,-2e-06,-5e-06,1.8e-05,0,0,-4e-06,4e-06,2e-06,-3e-06,-1e-05,-4e-06,5e-06,0,1e-06,7e-06,-4e-06,4e-06,-4e-06,0,-2e-06,3e-06,9e-06,-7e-06,9e-06,5e-06,3e-06,6e-06,2e-06,1.3e-05,0,-7e-06,4e-06,1.4e-05,-1.3e-05,-1e-06,9e-06,1e-06,-7e-06,4e-06,5e-06,5e-06,-1e-06,-2e-06,-1e-06,-1.2e-05,0,3e-06,2e-06,2e-06,0,3e-06,-5e-06,-3e-06,-5e-06,-5e-06,-3e-06,0,-1e-06,8e-06,1.5e-05,3e-06,2e-06,6e-06,-7e-06,-4e-06,6e-06,3e-06,6e-06,0,1e-06,-5e-06,-2e-06,-4e-06,4e-06,0,5e-06,-3e-06,5e-06,-1e-06,4e-06,6e-06,-2e-06,4e-06,-7e-06,1e-06,1e-06,8e-06,9e-06,-8e-06,2e-06,2e-06,-1e-06,-1e-06,2e-06,0,1e-05,2e-06,-2e-06,-6e-06,1e-06,3e-06,-3e-06
7e-06,-7e-06,3e-06,8e-06,4e-06,-1e-06,8e-06,2e-06,-1e-05,0,7e-06,-7e-06,-5e-06,-5e-06,2e-06,3e-06,2e-06,-6e-06,-1.2e-05,2e-06,8e-06,-1e-05,-2e-06,1.3e-05,1.1e-05,2e-06,-8e-06,-1e-06,5e-06,3e-06,3e-06,-1.4e-05,4e-06,-8e-06,-2e-06,-6e-06,-1e-06,5e-06,2e-06,-1e-06,-1e-06,1e-05,-6e-06,4e-06,-1.4e-05,2e-06,0,-1.6e-05,-5e-06,-3e-06,-6e-06,-1e-06,-9e-06,2e-06,-1.2e-05,-5e-06,0,2e-06,-4e-06,-5e-06,1e-06,6e-06,3e-06,1.1e-05,0,8e-06,1e-06,3e-06,1e-06,2e-06,4e-06,-4e-06,0,3e-06,2e-06,2e-06,-1e-06,-5e-06,7e-06,5e-06,-2e-06,-6e-06,4e-06,-5e-06,2e-06,-6e-06,-4e-06,1e-06,7e-06,1e-06,-3e-06,2e-06,-4e-06,-3e-06,-1e-06,4e-06,5e-06,1e-06,-1e-06,-5e-06,2e-06,3e-06,1e-06,-1e-06,2e-06,-3e-06,4e-06,3e-06,2e-06,0,1e-06,-3e-06,-7e-06,-1e-06,-1e-06,-1e-06,1e-06,6e-06,4e-06,3e-06,0
0,6e-06,1e-06,-2e-06,-1.1e-05,-2e-06,-9e-06,0,-9e-06,-6e-06,-2e-06,4e-06,-5e-06,-1e-06,1e-06,-6e-06,-1e-06,5e-06,9e-06,-3e-06,3e-06,6e-06,7e-06,-8e-06,-9e-06,-4e-06,-1e-06,-3e-06,-6e-06,-2e-06,-5e-06,-6e-06,-1e-06,5e-06,-1e-06,2e-06,-1.2e-05,1e-06,-1e-06,6e-06,-3e-06,4e-06,-7e-06,-1e-06,1.1e-05,-3e-06,-1e-06,1e-05,0,-3e-06,2e-06,-6e-06,-2e-06,-1e-06,1e-06,-3e-06,6e-06,-4e-06,0,-1.1e-05,-1e-06,-2e-06,-2e-06,0,0,-2e-06,0,-4e-06,-2e-06,0,2e-06,-2e-06,7e-06,-4e-06,-3e-06,-1e-06,-2e-06,0,-1.5e-05,0,1e-06,-4e-06,1e-06,-5e-06,-6e-06,1e-06,2e-06,-6e-06,-4e-06,-5e-06,0,-1e-06,1e-06,3e-06,-1e-06,4e-06,-2e-06,-2e-06,0,-4e-06,0,6e-06,3e-06,-2e-06,-3e-06,-3e-06,-4e-06,-4e-06,-1e-06,-2e-06,-3e-06,-4e-06,1.4e-05,-2e-06,-4e-06,1e-06,-2e-06,-1e-06,-3e-06,-1e-06,-3e-06
3e-06,-2e-06,-5e-06,2e-06,1e-06,0,-3e-06,-1e-06,3e-06,7e-06,1e-06,-1e-06,-9e-06,1e-06,-2e-06,4e-06,-4e-06,-6e-06,-5e-06,2e-06,-6e-06,5e-06,-6e-06,-1e-06,4e-06,-1e-06,1e-06,-1e-06,4e-06,0,-7e-06,-1e-06,3e-06,3e-06,-2e-06,1e-06,-2e-06,-1e-06,-3e-06,-2e-06,0,-1e-06,7e-06,-3e-06,-7e-06,0,0,-6e-06,4e-06,3e-06,-1e-06,-5e-06,3e-06,-5e-06,-5e-06,0,-3e-06,3e-06,4e-06,2e-06,-1e-06,4e-06,-4e-06,-4e-06,-3e-06,-5e-06,2e-06,-1e-06,0,-2e-06,-6e-06,-1e-06,-7e-06,1e-06,-4e-06,3e-06,-2e-06,3e-06,3e-06,3e-06,1e-06,3e-06,-6e-06,5e-06,-3e-06,1e-06,1e-06,0,-6e-06,-1e-06,1e-06,-3e-06,-4e-06,-1e-06,3e-06,0,-3e-06,0,-4e-06,6e-06,-4e-06,2e-06,-6e-06,3e-06,-3e-06,-2e-06,-1e-06,1e-06,2e-06,3e-06,-1e-06,-2e-06,-1.4e-05,2e-06,4e-06,-1e-06,-3e-06,-3e-06,1e-06,5e-06,1e-06
4e-06,3e-06,1e-06,-1e-06,3e-06,5e-06,6e-06,-1e-06,-9e-06,-2e-06,0,4e-06,-3e-06,2e-06,2e-06,-3e-06,4e-06,3e-06,-4e-06,-2e-06,2e-06,-4e-06,4e-06,1e-06,-3e-06,-4e-06,1e-06,-1e-06,-2e-06,-1e-06,-2e-06,-2e-06,6e-06,-6e-06,-2e-06,-1e-06,1e-05,3e-06,2e-06,-1e-06,1e-06,-1e-06,-3e-06,3e-06,8e-06,4e-06,-2e-06,0,3e-06,0,-1e-06,0,-1e-06,3e-06,1e-06,-3e-06,-5e-06,3e-06,-5e-06,3e-06,1e-06,0,4e-06,2e-06,-1e-06,0,-1e-06,3e-06,0,2e-06,3e-06,-2e-06,2e-06,-1e-06,3e-06,3e-06,2e-06,-2e-06,-4e-06,-1e-06,0,2e-06,1e-05,3e-06,-1e-06,0,0,1e-06,0,-2e-06,0,1e-06,3e-06,1e-06,-3e-06,3e-06,0,0,-4e-06,1e-06,2e-06,-3e-06,3e-06,-3e-06,3e-06,-4e-06,1e-06,-4e-06,3e-06,0,0,1e-06,6e-06,1e-06,3e-06,-1e-06,-7e-06,-1e-06,1e-06,-3e-06,3e-06
-1e-06,-4e-06,2e-06,-1e-06,0,-1e-06,-4e-06,-1e-06,6e-06,-2e-06,1e-06,-2e-06,1e-06,0,-1e-06,4e-06,-1e-06,0,6e-06,0,1e-06,3e-06,-1e-06,-5e-06,-1e-06,3e-06,-1e-06,1e-06,1e-06,2e-06,-3e-06,-6e-06,2e-06,0,1e-06,5e-06,3e-06,6e-06,-3e-06,1e-06,-1e-06,1e-06,0,0,-2e-06,2e-06,0,5e-06,-1e-06,-2e-06,0,6e-06,-1e-06,0,-5e-06,0,3e-06,-3e-06,0,5e-06,1e-06,0,1e-06,-3e-06,2e-06,5e-06,0,-2e-06,0,0,0,1e-06,-2e-06,-2e-06,0,-1e-06,0,-1e-06,-2e-06,-3e-06,2e-06,-3e-06,-7e-06,4e-06,3e-06,1e-06,-2e-06,0,5e-06,-1e-06,0,2e-06,0,1e-06,2e-06,1e-06,-1e-06,1e-06,1e-06,0,-1e-06,-3e-06,-3e-06,1e-06,0,-1e-06,1e-06,2e-06,-3e-06,-5e-06,0,-1e-06,0,0,-2e-06,1e-06,3e-06,1e-06,0,1e-06,0
2e-06,2e-06,0,-3e-06,-5e-06,-3e-06,-1e-06,1e-06,-2e-06,4e-06,-4e-06,0,-1e-06,0,-2e-06,-1e-06,2e-06,-7e-06,-4e-06,-1e-06,0,-1e-06,2e-06,6e-06,4e-06,-1e-06,-2e-06,-1e-06,6e-06,-1e-06,0,0,-1e-06,2e-06,-1e-06,-3e-06,-2e-06,0,0,-1e-06,-1e-06,2e-06,5e-06,-4e-06,-3e-06,-2e-06,-1e-06,-5e-06,1e-06,3e-06,0,3e-06,1e-06,-3e-06,-1e-06,0,3e-06,4e-06,1e-06,2e-06,0,0,-4e-06,0,-1e-06,-1e-06,-2e-06,1e-06,-1e-06,0,0,2e-06,3e-06,3e-06,-3e-06,-4e-06,-2e-06,2e-06,-5e-06,0,0,0,0,1e-06,-2e-06,-1e-06,4e-06,0,1e-06,0,0,-2e-06,-4e-06,-1e-06,-1e-06,-1e-06,-2e-06,2e-06,0,1e-06,1e-06,-2e-06,3e-06,-1e-06,3e-06,1e-06,-3e-06,-1e-06,-6e-06,0,0,0,-3e-06,1e-06,1e-06,1e-06,-2e-06,2e-06,-2e-06,0,1e-06
-1e-06,-1e-06,-1e-06,2e-06,4e-06,1e-06,6e-06,0,-4e-06,-3e-06,0,-3e-06,-3e-06,1e-06,1e-06,-3e-06,-2e-06,4e-06,1e-06,1e-06,1e-06,-5e-06,-4e-06,-3e-06,-2e-06,0,1e-06,-1e-06,-5e-06,-1e-06,0,2e-06,3e-06,2e-06,0,0,2e-06,-2e-06,1e-06,4e-06,2e-06,-4e-06,-6e-06,1e-06,1e-06,-1e-06,0,0,0,-1e-06,-1e-06,-3e-06,-1e-06,0,-1e-06,2e-06,-1e-06,-2e-06,1e-06,-2e-06,-1e-06,1e-06,1e-06,0,1e-06,-3e-06,-1e-06,0,0,0,0,-3e-06,-7e-06,-1e-06,-1e-06,-3e-06,-1e-06,0,-4e-06,0,1e-06,3e-06,1e-06,-4e-06,-2e-06,0,-4e-06,2e-06,-4e-06,0,-1e-06,-1e-06,3e-06,0,-2e-06,-1e-06,2e-06,-3e-06,0,3e-06,-1e-06,0,-1e-06,1e-06,-1e-06,2e-06,0,-3e-06,0,1e-06,0,0,4e-06,2e-06,2e-06,-2e-06,-1e-06,-2e-06,2e-06,-1e-06,0
-1e-06,0,-1e-06,-3e-06,0,2e-06,-7e-06,0,1e-06,0,0,1e-06,0,0,0,1e-06,2e-06,-1e-06,-1e-06,0,-2e-06,2e-06,4e-06,2e-06,-2e-06,1e-06,-2e-06,1e-06,2e-06,0,3e-06,-2e-06,1e-06,-2e-06,-1e-06,1e-06,0,-2e-06,-2e-06,-2e-06,-1e-06,-2e-06,3e-06,0,-3e-06,-2e-06,-1e-06,3e-06,-3e-06,1e-06,0,-3e-06,3e-06,2e-06,-1e-06,-2e-06,-1e-06,-2e-06,-1e-06,-2e-06,0,-1e-06,1e-06,-5e-06,0,2e-06,0,0,0,0,-3e-06,1e-06,4e-06,0,1e-06,-3e-06,0,-3e-06,4e-06,-1e-06,1e-06,-1e-06,-2e-06,-2e-06,1e-06,0,2e-06,-1e-06,0,1e-06,0,1e-06,-1e-06,0,1e-06,0,1e-06,2e-06,-1e-06,-1e-06,1e-06,1e-06,1e-06,-1e-06,-2e-06,0,2e-06,3e-06,3e-06,-1e-06,0,-1e-06,-5e-06,1e-06,-1e-06,1e-06,1e-06,-2e-06,0,0,-1e-06
0,0,1e-06,2e-06,1e-06,-2e-06,3e-06,0,-5e-06,1e-06,1e-06,-1e-06,2e-06,-1e-06,-1e-06,-1e-06,-1e-06,-3e-06,2e-06,0,1e-06,1e-06,-2e-06,1e-06,2e-06,-3e-06,-2e-06,1e-06,0,1e-06,1e-06,-1e-06,1e-06,-1e-06,1e-06,-2e-06,0,0,1e-06,2e-06,1e-06,1e-06,2e-06,-3e-06,7e-06,1e-06,-1e-06,-4e-06,-1e-06,-1e-06,0,-1e-06,2e-06,-1e-06,-3e-06,2e-06,0,0,-1e-06,-2e-06,0,2e-06,-1e-06,4e-06,-1e-06,2e-06,1e-06,-1e-06,0,0,3e-06,-1e-06,0,0,-2e-06,0,0,2e-06,-4e-06,2e-06,0,-2e-06,5e-06,-1e-06,2e-06,0,1e-06,0,3e-06,0,0,-1e-06,-1e-06,0,-1e-06,-3e-06,0,-2e-06,-1e-06,-3e-06,-2e-06,1e-06,-3e-06,0,1e-06,0,-1e-06,-5e-06,0,1e-06,0,0,2e-06,0,-4e-06,0,-1e-06,2e-06,-2e-06,1e-06,0
-1e-06,1e-06,0,0,-4e-06,-2e-06,4e-06,0,2e-06,-2e-06,0,0,0,-1e-06,1e-06,1e-06,1e-06,2e-06,-3e-06,0,1e-06,-3e-06,1e-06,-4e-06,-1e-06,2e-06,0,-2e-06,0,1e-06,1e-06,2e-06,0,1e-06,0,0,-3e-06,-2e-06,0,-2e-06,1e-06,3e-06,-5e-06,0,-4e-06,1e-06,-1e-06,1e-06,0,1e-06,-1e-06,4e-06,2e-06,-1e-06,-2e-06,-1e-06,2e-06,0,1e-06,2e-06,1e-06,-1e-06,0,2e-06,0,1e-06,0,0,-1e-06,1e-06,0,0,1e-06,-1e-06,-1e-06,2e-06,-1e-06,0,-1e-06,-1e-06,0,1e-06,-4e-06,2e-06,1e-06,1e-06,-3e-06,-1e-06,0,1e-06,0,-1e-06,1e-06,0,-1e-06,0,-1e-06,1e-06,-1e-06,1e-06,0,1e-06,1e-06,0,-2e-06,0,2e-06,3e-06,0,2e-06,0,-2e-06,1e-06,1e-06,0,0,-4e-06,0,1e-06,-1e-06,-1e-06
-1e-06,0,-1e-06,2e-06,3e-06,2e-06,-5e-06,0,0,1e-06,1e-06,2e-06,1e-06,0,-1e-06,-1e-06,-3e-06,-2e-06,2e-06,1e-06,-2e-06,0,-1e-06,3e-06,-1e-06,-2e-06,1e-06,-1e-06,0,-1e-06,1e-06,3e-06,1e-06,-1e-06,-1e-06,1e-06,-1e-06,-2e-06,-2e-06,1e-06,-1e-06,1e-06,3e-06,1e-06,2e-06,0,-1e-06,2e-06,0,0,1e-06,0,1e-06,2e-06,0,1e-06,1e-06,-4e-06,0,2e-06,1e-06,0,1e-06,-1e-06,0,-3e-06,0,0,0,0,-2e-06,0,-4e-06,1e-06,-1e-06,2e-06,0,0,1e-06,0,0,1e-06,0,1e-06,0,-1e-06,3e-06,0,-3e-06,0,0,1e-06,0,0,1e-06,-1e-06,0,-1e-06,1e-06,0,1e-06,1e-06,0,0,-1e-06,1e-06,-1e-06,-3e-06,1e-06,1e-06,0,0,-3e-06,1e-06,1e-06,0,2e-06,0,1e-06,1e-06,0
-2e-06,-2e-06,0,-1e-06,1e-06,1e-06,4e-06,0,0,1e-06,0,0,2e-06,0,0,0,2e-06,2e-06,-3e-06,1e-06,1e-06,2e-06,1e-06,-2e-06,2e-06,0,0,0,-2e-06,1e-06,0,0,0,-1e-06,0,0,2e-06,-1e-06,1e-06,-1e-06,0,-2e-06,-1e-06,-1e-06,-3e-06,-1e-06,-1e-06,-5e-06,1e-06,1e-06,-1e-06,-1e-06,0,-1e-06,-2e-06,-2e-06,-2e-06,4e-06,-1e-06,2e-06,-1e-06,0,0,0,0,1e-06,0,0,0,-1e-06,1e-06,1e-06,3e-06,-1e-06,-1e-06,1e-06,0,0,1e-06,0,0,-1e-06,1e-06,0,-2e-06,1e-06,-2e-06,0,-1e-06,1e-06,0,-1e-06,1e-06,0,-2e-06,-1e-06,0,2e-06,1e-06,-1e-06,-1e-06,-2e-06,2e-06,0,1e-06,0,1e-06,1e-06,1e-06,1e-06,0,-1e-06,3e-06,-1e-06,-1e-06,0,-2e-06,-1e-06,-1e-06,1e-06,0
-1e-06,1e-06,0,-1e-06,0,0,0,0,2e-06,-2e-06,0,-1e-06,3e-06,0,1e-06,1e-06,-1e-06,-1e-06,2e-06,-1e-06,0,-1e-06,-1e-06,0,-2e-06,1e-06,-1e-06,0,3e-06,1e-06,-1e-06,1e-06,1e-06,0,0,1e-06,1e-06,0,0,-1e-06,0,0,-3e-06,-1e-06,2e-06,-1e-06,0,5e-06,1e-06,0,0,-3e-06,1e-06,-1e-06,-1e-06,0,-1e-06,-3e-06,0,0,-1e-06,0,-1e-06,0,0,1e-06,-1e-06,-1e-06,0,1e-06,-1e-06,0,0,0,1e-06,1e-06,0,1e-06,1e-06,-1e-06,0,0,-1e-06,0,1e-06,-1e-06,1e-06,1e-06,2e-06,0,0,0,0,0,0,1e-06,0,-1e-06,0,-1e-06,0,-3e-06,-2e-06,-1e-06,1e-06,-1e-06,1e-06,-1e-06,-3e-06,-1e-06,0,0,0,0,-2e-06,0,-2e-06,0,0,-1e-06,-1e-06
0,-1e-06,0,0,-2e-06,0,-4e-06,0,-3e-06,2e-06,0,0,1e-06,0,-1e-06,-1e-06,0,-2e-06,-2e-06,0,1e-06,1e-06,1e-06,1e-06,1e-06,-2e-06,0,0,-2e-06,-1e-06,-2e-06,2e-06,-1e-06,2e-06,0,0,-1e-06,0,-1e-06,2e-06,0,0,3e-06,1e-06,2e-06,1e-06,0,-4e-06,1e-06,-1e-06,-1e-06,0,-1e-06,1e-06,-2e-06,-1e-06,2e-06,2e-06,2e-06,-3e-06,0,0,0,-2e-06,0,0,0,1e-06,-1e-06,0,1e-06,-1e-06,-1e-06,1e-06,-1e-06,0,0,-1e-06,-4e-06,0,-1e-06,1e-06,1e-06,-1e-06,1e-06,0,0,0,0,1e-06,-1e-06,0,0,0,0,0,-1e-06,1e-06,1e-06,1e-06,-1e-06,-1e-06,1e-06,0,0,-1e-06,0,0,-2e-06,-1e-06,0,0,-2e-06,0,1e-06,0,1e-06,1e-06,1e-06,1e-06,1e-06
0,1e-06,0,-2e-06,1e-06,0,2e-06,0,1e-06,0,0,-1e-06,1e-06,1e-06,0,-1e-06,-1e-06,2e-06,2e-06,-1e-06,-1e-06,0,0,-2e-06,0,2e-06,1e-06,0,0,0,-1e-06,2e-06,1e-06,0,0,-1e-06,1e-06,1e-06,1e-06,-1e-06,0,0,-2e-06,0,-3e-06,0,0,2e-06,0,0,0,3e-06,0,1e-06,0,0,1e-06,1e-06,-1e-06,-2e-06,0,1e-06,1e-06,1e-06,0,-2e-06,0,0,0,-1e-06,0,1e-06,0,-1e-06,-1e-06,1e-06,0,0,1e-06,0,-1e-06,0,-1e-06,-1e-06,-2e-06,1e-06,-1e-06,0,-2e-06,0,-1e-06,0,1e-06,0,-1e-06,1e-06,1e-06,-1e-06,0,0,0,0,0,-1e-06,1e-06,-1e-06,0,-1e-06,1e-06,1e-06,0,-1e-06,3e-06,-1e-06,0,0,0,-1e-06,0,-1e-06,0
1e-06,-1e-06,0,0,1e-06,-1e-06,-1e-06,0,-2e-06,-2e-06,0,0,1e-06,0,0,-1e-06,2e-06,0,-3e-06,1e-06,1e-06,-1e-06,0,3e-06,1e-06,-1e-06,0,0,1e-06,0,-2e-06,0,0,-2e-06,-1e-06,1e-06,1e-06,0,-1e-06,1e-06,0,-1e-06,0,-1e-06,2e-06,0,-1e-06,0,-1e-06,0,0,1e-06,0,-1e-06,-2e-06,-1e-06,-2e-06,0,0,-1e-06,1e-06,0,-1e-06,-1e-06,0,0,0,-1e-06,0,0,-1e-06,-1e-06,1e-06,1e-06,1e-06,0,0,0,0,-1e-06,0,0,0,0,0,-1e-06,0,0,0,0,0,-1e-06,-1e-06,0,0,0,1e-06,1e-06,-1e-06,-1e-06,-1e-06,1e-06,0,0,0,0,-1e-06,0,2e-06,0,0,0,-4e-06,-1e-06,-2e-06,0,-2e-06,0,0,0,0
1e-06,1e-06,0,2e-06,-1e-06,-1e-06,-1e-06,0,1e-06,2e-06,0,0,1e-06,0,0,2e-06,-1e-06,-1e-06,2e-06,0,0,1e-06,0,-2e-06,-1e-06,0,0,0,0,-1e-06,0,1e-06,0,1e-06,0,-1e-06,0,0,0,0,1e-06,0,3e-06,0,-3e-06,-1e-06,0,-1e-06,-1e-06,1e-06,0,-1e-06,-1e-06,0,0,1e-06,-1e-06,-1e-06,0,1e-06,0,0,0,-1e-06,0,1e-06,0,0,1e-06,0,1e-06,0,0,-1e-06,-1e-06,0,0,-1e-06,-2e-06,0,-1e-06,0,2e-06,1e-06,1e-06,0,1e-06,0,2e-06,0,0,0,0,0,0,1e-06,0,-1e-06,0,0,1e-06,1e-06,0,0,0,0,-1e-06,0,0,-1e-06,0,-1e-06,4e-06,0,-2e-06,0,1e-06,0,1e-06,1e-06,0
1e-06,-1e-06,0,1e-06,0,0,3e-06,0,0,-2e-06,1e-06,0,0,0,0,0,0,1e-06,0,0,0,1e-06,-1e-06,-1e-06,1e-06,1e-06,0,0,1e-06,0,1e-06,1e-06,-1e-06,1e-06,0,1e-06,-1e-06,2e-06,0,1e-06,-1e-06,1e-06,-3e-06,1e-06,4e-06,0,0,1e-06,-1e-06,-1e-06,0,-2e-06,0,1e-06,-2e-06,1e-06,1e-06,2e-06,1e-06,2e-06,0,0,1e-06,1e-06,0,0,0,0,0,0,0,0,-2e-06,0,-1e-06,-1e-06,0,0,-1e-06,1e-06,0,0,-2e-06,1e-06,0,0,-1e-06,0,1e-06,0,1e-06,0,0,0,-1e-06,0,-1e-06,2e-06,-1e-06,1e-06,-1e-06,1e-06,0,0,0,0,2e-06,-1e-06,0,0,0,0,-2e-06,0,1e-06,0,-1e-06,0,0,0,0
1e-06,1e-06,0,1e-06,1e-06,1e-06,-1e-06,0,-1e-06,0,0,1e-06,0,0,0,-1e-06,0,-1e-06,0,0,0,0,0,2e-06,-2e-06,-1e-06,0,0,-1e-06,1e-06,1e-06,0,0,0,0,0,0,2e-06,-1e-06,-1e-06,0,1e-06,1e-06,0,-2e-06,0,0,1e-06,0,0,0,0,-1e-06,0,0,0,1e-06,-3e-06,0,1e-06,0,0,0,0,0,-1e-06,0,0,0,0,0,0,2e-06,0,0,-1e-06,0,0,-2e-06,0,0,0,0,0,0,0,0,0,-2e-06,0,0,0,0,0,0,0,0,-2e-06,-1e-06,0,0,1e-06,0,0,0,0,-1e-06,0,1e-06,0,0,0,0,0,1e-06,0,-2e-06,0,-1e-06,0,0
0,-1e-06,0,-1e-06,1e-06,0,-1e-06,0,1e-06,1e-06,0,0,0,0,0,0,0,0,1e-06,0,-1e-06,-1e-06,0,-2e-06,2e-06,1e-06,-1e-06,0,1e-06,-1e-06,1e-06,-1e-06,-1e-06,-1e-06,0,0,0,0,0,1e-06,0,-1e-06,1e-06,0,1e-06,0,0,-3e-06,0,0,0,1e-06,0,-1e-06,-1e-06,1e-06,0,2e-06,-1e-06,0,0,0,-1e-06,0,0,0,0,0,0,0,0,0,-1e-06,0,0,-1e-06,0,0,1e-06,0,0,0,0,0,0,0,1e-06,0,0,-1e-06,0,0,0,0,0,0,0,2e-06,-1e-06,0,0,-1e-06,0,0,0,0,1e-06,-1e-06,0,0,0,0,2e-06,0,-1e-06,0,0,0,1e-06,0,0
0,1e-06,0,-1e-06,-2e-06,0,2e-06,0,-3e-06,-1e-06,-1e-06,-1e-06,0,0,0,0,0,-1e-06,0,0,1e-06,0,0,2e-06,-2e-06,-1e-06,0,0,-1e-06,0,1e-06,0,0,1e-06,0,1e-06,0,-1e-06,0,0,0,-1e-06,-2e-06,1e-06,-1e-06,0,1e-06,3e-06,1e-06,0,0,1e-06,0,1e-06,-1e-06,-1e-06,-1e-06,-1e-06,0,-1e-06,0,0,0,0,0,1e-06,0,0,0,0,0,0,1e-06,0,0,0,0,0,-2e-06,0,0,0,0,-1e-06,0,0,-1e-06,0,1e-06,0,0,0,0,0,0,0,0,-2e-06,0,0,0,-2e-06,0,0,0,0,-1e-06,1e-06,-2e-06,0,0,0,-2e-06,0,-1e-06,0,0,0,0,-1e-06,0
0,0,0,-1e-06,1e-06,0,-2e-06,0,-1e-06,1e-06,0,0,0,0,0,0,0,0,1e-06,0,0,0,-1e-06,-1e-06,1e-06,0,0,0,0,1e-06,0,0,0,0,0,0,-1e-06,0,-1e-06,0,0,1e-06,2e-06,0,-1e-06,0,1e-06,-2e-06,1e-06,0,0,-1e-06,0,1e-06,-2e-06,1e-06,0,1e-06,0,-1e-06,0,-1e-06,0,0,0,0,0,0,0,0,1e-06,0,-2e-06,0,0,0,0,1e-06,-1e-06,-1e-06,0,0,1e-06,0,0,0,1e-06,0,0,0,0,-1e-06,0,0,0,0,0,2e-06,0,0,0,-1e-06,-1e-06,0,0,0,1e-06,-1e-06,-1e-06,0,0,0,1e-06,0,1e-06,0,-1e-06,0,0,0,0
-1e-06,0,0,0,0,0,0,0,0,0,0,0,-1e-06,0,0,-1e-06,0,0,0,0,-1e-06,0,1e-06,-1e-06,-1e-06,0,0,0,1e-06,-1e-06,-1e-06,-1e-06,0,-1e-06,0,0,0,0,0,0,0,1e-06,-1e-06,0,2e-06,0,1e-06,1e-06,0,0,0,-1e-06,0,-1e-06,-1e-06,-1e-06,1e-06,-1e-06,0,0,0,0,-1e-06,0,0,-1e-06,0,0,0,0,-1e-06,0,3e-06,0,0,1e-06,0,0,1e-06,0,0,0,-1e-06,0,0,0,0,0,-1e-06,-1e-06,0,0,0,0,0,-1e-06,0,-2e-06,1e-06,-1e-06,0,0,0,0,1e-06,0,0,0,1e-06,0,0,0,1e-06,0,1e-06,0,0,0,0,0,0
0,-1e-06,0,1e-06,1e-06,0,1e-06,0,-2e-06,-1e-06,1e-06,-1e-06,-1e-06,0,0,0,0,0,1e-06,0,0,0,-1e-06,2e-06,1e-06,-1e-06,0,0,-1e-06,0,-1e-06,-1e-06,-1e-06,0,0,0,0,-1e-06,0,0,0,0,-2e-06,0,-2e-06,0,0,1e-06,-1e-06,0,0,0,0,0,-1e-06,1e-06,0,2e-06,0,1e-06,0,0,0,0,0,0,0,0,0,0,0,0,-2e-06,0,0,0,0,0,-1e-06,0,0,0,0,0,0,0,-1e-06,0,0,0,0,0,0,0,0,0,0,2e-06,0,-1e-06,0,1e-06,-1e-06,0,0,0,0,0,1e-06,0,0,0,-3e-06,1e-06,0,0,-1e-06,0,0,-1e-06,0
