3.5e-05,1e-05,2.9e-05,4.2e-05,1.9e-05,1.7e-05,1.5e-05,2.2e-05,4.4e-05,4.7e-05,0.000111,9.1e-05,0.00013,8.4e-05,1e-06,0.000129,4.2e-05,0.000194,0.000188,3.6e-05,8.3e-05,5.1e-05,0.000132,9.4e-05,0.000273,0.000569,0.000284,0.000104,0.000103,0.00048,0.000198,1.5e-05,0.000438,9.4e-05,0.000203,8e-06,0.000384,0,0.000151,0.000347,0.000177,0.000112,5.5e-05,3.5e-05,8.7e-05,0.000208,0.000121,1.3e-05,7.4e-05,0.000321,8.7e-05,0.000552,0.000153,0.00018,0.000267,1.6e-05,0.000192,0.000134,0.000312,0.000111,0.000332,0.000252,3.2e-05,0.000332,0.000289,0.000549,9.8e-05,7.5e-05,7e-05,0.000143,0.000232,0.000144,0.000294,0.000162,0.000411,5.3e-05,0.000214,0.000107,0.000207,8.8e-05,5.3e-05,0.00043,2.5e-05,0.000211,0.000376,0.00022,0.000132,0.000302,3.3e-05,5.5e-05,7.8e-05,1.5e-05,5.3e-05,0.000113,0.000177,0.000187,6e-06,3.5e-05,3.6e-05,0.000286,2e-06,0.000378,3.5e-05,4e-05,1.2e-05,2.7e-05,5e-05,2.9e-05,3.6e-05,6.3e-05,0.000109,0.000142,1.5e-05,0.000386,0.000374,8.3e-05,0.000213,0.000258,1e-06,4.6e-05,0.000202
4.9e-05,2.7e-05,5.4e-05,5e-05,0.000133,7.3e-05,1.7e-05,9.3e-05,0.00016,0.000186,0.000214,0.00022,2e-04,0.000137,5.1e-05,0.00027,6.5e-05,0.00038,0.000245,0.000118,0.000201,0.000199,0.00029,0.000203,0.000791,0.00082,0.000681,0.000394,0.000219,0.001171,0.000734,0.000198,0.00082,0.000597,0.000186,0.000397,0.000843,0.000121,0.000391,0.000909,0.000189,0.000601,0.000591,0.000277,0.000741,0.00062,0.000385,0.000415,0.000289,0.001398,0.000513,0.001748,0.00073,0.000317,0.000354,0.000121,0.000806,0.000629,0.000764,0.000444,0.000705,0.000686,0.000135,0.000354,0.000663,0.001123,0.000481,0.00041,0.00021,0.000485,0.000416,0.000324,0.000437,0.000189,0.000805,0.000543,0.000482,0.000507,0.000802,0.000258,0.000205,0.000713,0.000383,4.9e-05,0.000998,0.000821,0.000327,0.00035,0.000383,0.000278,0.000429,0.000521,0.000122,0.00038,0.000665,0.000364,0.000344,0.000302,0.000318,0.000226,0.00038,0.000571,0.000488,0.000322,8.4e-05,0.000379,0.000223,0.00065,0.000273,0.000234,0.000268,0.000404,7e-05,0.001113,0.000554,0.000283,0.000908,0.000536,0.000157,0.000297,0.000442
2.9e-05,3.5e-05,8.8e-05,4.9e-05,0.000174,0.000179,6.9e-05,0.000133,0.000161,0.000175,0.000159,0.000141,0.000313,0.00028,7.3e-05,0.000375,0.000171,0.000336,0.000404,0.000165,0.000513,0.000662,0.000372,0.000213,0.000656,0.002048,0.000655,0.000629,0.000347,0.000995,0.000328,0.000294,0.00048,0.000599,0.000485,0.000854,0.000873,0.000496,0.000362,0.000685,0.000597,0.000184,0.000249,0.000975,0.000723,9.3e-05,0.000649,0.000514,0.000179,0.001549,0.000964,0.002254,0.000433,0.000556,0.000109,0.000546,0.001282,0.000364,0.000552,0.000359,0.000708,0.000728,0.000294,0.001044,0.000301,0.001859,0.000532,0.000805,0.000516,0.000328,0.000789,0.000716,0.000637,0.000566,0.001055,0.000949,0.000649,0.000431,0.000746,0.000404,0.000352,0.000201,0.000476,0.000232,0.000679,0.00119,0.000448,0.000337,0.000437,0.000423,0.000522,0.000865,0.000694,0.000541,0.000961,0.00113,0.000512,0.000391,0.00061,0.000476,0.000536,0.000831,0.001009,0.000412,0.000284,0.000309,0.000454,0.000521,0.000284,0.000396,3.5e-05,0.000209,0.000944,0.001756,0.000785,0.000371,0.000462,0.000487,0.000418,0.000243,0.000401
5.3e-05,4.2e-05,0.000142,7e-05,0.000171,0.00017,0.000162,0.000185,0.000333,0.000106,0.000403,0.000302,0.000229,0.00015,0.000273,0.000425,6.2e-05,0.00039,5.4e-05,0.000223,0.000572,0.000256,7.5e-05,0.000523,0.000401,0.002686,0.001068,0.001696,0.000905,0.000359,0.000951,0.000982,0.001131,0.001302,0.001031,0.000302,0.001493,0.001031,0.000802,0.0011,0.001165,0.000344,0.000707,0.0016,0.002039,0.00077,0.000163,0.000546,0.000405,0.001994,0.000725,0.001145,0.000926,0.000368,0.000609,0.000329,0.001043,0.001652,0.001658,0.002114,0.001032,0.000923,0.002096,0.00083,0.000823,0.002979,0.00207,0.002053,0.002069,0.001229,0.00039,0.000701,0.001393,0.000916,0.001511,0.000938,0.001126,0.000824,0.000694,0.000257,0.000279,0.000895,0.000209,0.000901,0.000938,0.000528,0.000555,0.000485,0.000599,0.000318,0.000641,0.000698,0.001132,0.000749,6.8e-05,0.000542,0.000986,0.001099,0.000625,6.3e-05,0.000314,0.000117,0.000161,0.000223,0.001228,0.000419,0.000456,0.000492,0.000224,0.000468,0.000536,0.000763,0.001205,0.001059,0.000139,0.000248,0.000463,0.000338,0.00049,0.000735,0.001323
8.8e-05,9.3e-05,6.7e-05,0.000153,0.000202,0.000139,5.4e-05,0.000152,0.00025,0.000134,0.000578,0.000567,0.000681,0.000197,0.000479,0.000869,0.000554,0.000296,0.000928,0.00027,0.000796,0.000894,0.000288,0.000447,0.000619,0.002584,0.002458,0.002359,0.00235,0.002155,0.001255,0.000519,0.001882,0.001042,0.001051,0.001135,0.001175,0.00147,0.001665,0.002207,0.00241,0.002241,0.001257,0.000927,0.001751,0.001439,0.000822,0.001141,0.001081,0.002084,0.000898,0.001786,0.00075,0.001216,0.002501,0.001873,0.001766,0.001671,0.002648,0.001382,0.002139,0.001876,0.00294,0.00239,0.003998,0.004877,0.004216,0.001249,0.00033,0.000354,0.001532,0.001268,0.000655,0.000102,0.00178,0.000222,0.001358,0.00071,0.001224,0.001742,0.001332,0.001545,0.000677,0.001073,0.001953,0.000535,0.000472,0.000796,0.001484,0.000833,0.001743,0.000613,0.000974,0.000279,0.00043,0.001148,0.001102,0.000652,0.001201,0.000826,0.000209,0.000499,0.00101,0.000887,0.001852,0.002495,0.001286,0.000545,0.00036,0.000873,0.000418,0.001264,0.002356,0.002115,0.00168,0.000805,0.001544,0.000935,0.000737,0.001195,0.001662
6e-05,2e-05,8.5e-05,0.000144,8.7e-05,0.000292,0.000408,0.000151,0.000205,0.000125,0.000452,0.000501,0.000427,0.00068,0.00057,0.000576,0.000721,0.000464,0.001057,0.000449,0.00124,0.001243,0.001285,0.000725,0.000752,0.002694,0.004235,0.005408,0.002402,0.001194,0.000706,0.000526,0.001843,0.000404,0.001208,0.000611,0.001501,0.000895,0.001145,0.001471,0.001462,0.000698,0.002201,0.00157,0.000882,0.000959,0.002205,0.000452,0.000467,0.002668,0.001996,0.001801,0.001757,0.002167,0.002788,0.001602,0.00156,0.001215,0.001792,0.002537,0.003902,0.001689,0.002292,0.003637,0.001702,0.002172,0.000798,0.001854,0.000909,0.000744,0.001563,0.001382,0.00093,0.00101,0.001633,0.000397,0.000709,0.001841,0.001441,0.001316,0.001643,0.001422,0.000335,0.001062,0.001402,0.001641,0.001048,0.001141,0.000586,0.000432,0.00113,0.001006,0.000796,0.001438,0.001216,0.001415,0.000485,0.001461,0.001153,0.000591,0.001151,0.00032,0.00143,0.001302,0.002137,0.00114,0.001416,0.001255,0.000968,0.001311,0.001057,0.001427,0.00141,0.001021,0.00172,0.001674,0.001148,0.001008,0.000811,0.000345,0.001159
8e-05,8.4e-05,5.8e-05,0.000198,6.5e-05,0.000227,0.000507,0.000461,0.000369,0.000323,0.000283,0.00031,0.000507,0.000357,0.000372,0.000738,0.000462,0.000327,0.000206,0.000312,0.001252,0.000614,0.000127,0.000721,0.000579,0.002072,0.00267,0.003038,0.002909,0.00191,0.002131,0.00019,0.000629,0.001376,0.002035,0.000799,0.001134,0.000603,0.001555,0.000166,0.000541,0.000918,0.000875,0.00072,0.002343,0.000478,0.001698,0.001641,0.000319,0.00174,0.00086,0.002165,0.000705,0.001549,0.001515,0.001163,0.001938,0.002099,0.001942,0.003936,0.001372,0.002893,0.004115,0.004701,0.003744,0.004904,0.002937,0.003713,0.002697,0.002033,0.004774,0.001423,0.002528,0.00208,0.003793,0.001257,0.000523,0.001346,0.002097,0.001571,0.00132,0.00161,0.00045,0.00107,0.002108,0.000825,0.000116,0.001532,0.001582,0.00155,0.000861,0.00093,0.00181,0.001523,0.00082,0.001007,0.001343,0.000973,0.000804,0.000417,0.001773,0.001756,0.001364,0.001177,0.001212,0.000782,0.0014,0.000654,0.000493,0.000789,0.000625,0.00147,0.000436,0.001631,0.000637,0.001174,0.001706,0.001203,0.000971,0.000396,0.001353
8.2e-05,0.000186,0.000198,0.000208,0.000227,0.000335,0.000582,0.000377,0.000121,0.000514,0.000248,0.000251,0.000699,0.000913,0.000507,0.001126,0.001672,0.000754,0.001286,0.000305,0.00128,0.001617,0.000857,0.00116,0.000888,0.004064,0.001409,0.005819,0.00721,0.003045,0.002738,0.001554,0.000995,0.003218,0.000561,0.000372,0.001094,0.00198,0.001943,0.001893,0.000861,0.000694,0.001519,0.000219,0.004429,0.000857,0.002636,0.000917,0.002907,0.005015,0.001103,0.004728,0.002527,0.002808,0.001079,0.002695,0.002461,0.004584,0.006514,0.006151,0.005315,0.00405,0.003328,0.00059,0.002084,0.003678,0.004292,0.004554,0.003915,0.003195,0.003265,0.006022,0.002788,0.003323,0.005335,0.004823,0.003337,0.002417,0.003476,0.004159,0.004512,0.005448,0.004834,0.003836,0.003257,0.002573,0.000623,0.001671,0.002169,0.002708,0.001461,0.001636,0.001886,0.002873,0.002873,0.003427,0.00207,0.001183,0.001522,0.000885,0.002144,0.000569,0.003168,0.003067,0.002033,0.00152,0.002905,0.000723,0.000951,0.002387,0.001313,0.002016,0.002786,0.004558,0.003086,0.00153,0.003768,0.004214,0.003097,0.001501,0.001799
0.000155,0.000142,0.000114,0.000417,0.000472,4.4e-05,0.000858,0.001356,0.001132,0.000788,0.000517,0.000564,0.000972,0.001682,0.001441,0.000908,0.002743,0.002089,0.001444,0.001912,0.002007,0.00271,0.002254,0.001914,0.00237,0.004157,0.004257,0.004774,0.008466,0.00644,0.005466,0.004137,0.003991,0.005802,0.004583,0.001844,0.001654,0.003447,0.00425,0.004223,0.004406,0.002169,0.003076,0.002129,0.006081,0.005628,0.002628,0.003554,0.005671,0.002907,0.005914,0.003386,0.009703,0.008989,0.001689,0.003259,0.005095,0.010641,0.007579,0.007875,0.004396,0.002652,0.005521,0.005782,0.005613,0.007067,0.002731,0.002713,0.000533,0.001548,0.004315,0.005164,0.00478,0.003073,0.005352,0.005306,0.00301,0.001648,0.001605,0.002178,0.00268,0.001587,0.004562,0.004984,0.006565,0.005331,0.004564,0.003582,0.005007,0.006285,0.007318,0.006497,0.0055,0.001454,0.003377,0.003509,0.003222,0.002264,0.00081,0.000848,0.001207,0.002194,0.00334,0.005426,0.002962,0.000412,0.002538,0.00262,0.002036,0.001739,0.001563,0.002647,0.002494,0.002027,0.004922,0.003486,0.005453,0.006835,0.002833,0.001023,0.001293
9.5e-05,3.8e-05,0.000215,0.000238,0.000136,0.000221,0.000665,0.000944,0.000584,0.001129,0.000694,0.000571,0.00066,0.000661,0.000398,0.001519,0.001633,0.000785,0.002194,0.002476,0.000601,0.001895,0.001469,0.000256,0.001344,0.004594,0.002961,0.008023,0.004143,0.001246,0.003488,0.004275,0.000708,0.003397,0.000647,0.00106,0.001664,0.003632,0.004033,0.000541,0.002834,0.002354,0.001605,0.001471,0.005055,0.008301,0.008899,0.007839,0.006209,0.009359,0.008969,0.008642,0.009751,0.008582,0.008789,0.007237,0.00563,0.006057,0.003345,0.004024,0.001197,0.003463,0.002086,0.002832,0.001923,0.002504,0.000779,0.00099,0.001739,0.002061,0.002971,0.000871,0.003005,0.001885,0.003098,0.003531,0.002209,0.001339,0.000645,0.001548,0.001774,0.002536,0.002267,0.00262,0.001752,0.000453,0.001942,0.000567,0.002388,0.001912,0.002912,0.002296,0.002252,0.003942,0.001768,0.002739,0.004077,0.003569,0.003274,0.002181,0.000791,0.00182,0.001436,0.002967,0.001363,0.001063,0.00303,0.002418,0.000961,0.002529,0.002281,0.003077,0.002484,0.001835,0.003024,0.002373,0.002346,0.00221,0.003152,0.003446,0.001362
5.9e-05,4.8e-05,0.000114,0.00012,4.8e-05,9.3e-05,0.000526,0.000107,0.000512,0.000318,0.000182,0.00053,0.000345,0.000295,0.000197,0.00088,0.00014,0.00032,0.001028,0.00081,0.000998,0.000973,0.000885,0.001157,0.000352,0.002196,0.001495,0.005789,0.003758,0.002083,0.002152,0.001001,0.002026,0.00131,0.001834,0.001143,0.001205,0.001601,0.00282,0.002684,0.001119,0.001513,0.000444,0.001711,0.001776,0.004892,0.002526,0.00243,0.005764,0.005956,0.00131,0.003055,0.004511,0.002094,0.003502,0.002029,0.001327,0.004767,0.004291,0.002019,0.000304,0.00276,0.002151,0.002013,0.002414,0.001782,0.001309,0.001894,0.002388,0.001862,0.001742,0.001267,0.001594,0.000426,0.002131,0.001193,0.00217,0.001076,0.000341,0.000663,0.000906,0.000418,0.001749,0.00285,0.001725,0.000797,0.001383,0.00165,0.001614,0.001309,0.001188,0.000917,0.000616,0.001371,0.000312,0.001247,0.001883,0.000192,0.001116,0.000999,0.001017,0.001347,0.001653,0.001716,0.001492,0.001533,0.000624,0.000296,0.000278,0.001827,0.001988,0.000352,0.002264,0.001617,0.002411,0.001909,0.000766,0.00186,0.001636,0.00119,0.001468
4.1e-05,3.1e-05,5.8e-05,8.5e-05,8.2e-05,8e-06,0.000287,0.000108,0.000208,0.000157,0.000112,0.000177,0.000202,0.000215,8.8e-05,0.000695,0.000414,0.000217,0.000311,0.00056,0.000354,0.000631,0.00089,0.00127,0.000862,0.001364,0.001463,0.002007,0.002391,0.001788,0.001715,0.000523,0.001569,0.000552,0.000978,0.000366,0.000348,0.000918,0.001899,0.001187,0.00102,0.001737,0.000852,0.000896,0.002716,0.00127,0.00254,0.001592,0.001926,0.002386,0.000205,0.001307,0.00246,0.002652,0.000531,0.001616,0.000809,0.001664,0.001195,0.001049,0.001855,0.000384,0.000638,0.000137,0.001185,0.001591,0.001306,0.001384,0.000813,0.001029,0.002322,0.001951,0.000795,0.000387,0.000875,0.000841,0.001345,0.000548,0.000721,6.6e-05,0.000197,0.000575,0.000424,0.00068,0.000812,0.000345,0.000688,0.000618,0.000164,0.000449,0.00065,0.000476,0.000311,0.000711,0.00017,0.000925,0.001047,0.000387,0.000579,0.000918,0.000729,0.000687,0.000464,0.000514,0.00067,0.00053,0.000672,0.000399,0.000447,0.000639,0.000868,0.001138,0.00074,0.001039,0.000693,0.001256,0.001369,0.001131,0.000824,0.000818,0.000447
2.5e-05,1.8e-05,9e-05,2.3e-05,6.1e-05,6.6e-05,0.000185,0.000113,0.000101,0.00015,0.000171,0.000176,0.00016,0.000191,0.000108,0.000534,0.000149,0.000316,0.000325,0.000189,7.7e-05,0.000333,0.000405,0.000402,4.8e-05,0.000925,0.000456,0.001607,0.001611,0.000135,0.000688,0.000528,0.000812,0.000289,0.000272,0.000285,0.000507,3.3e-05,0.00026,0.000868,0.000328,0.000811,0.000124,0.000268,0.001951,0.000492,0.001587,0.000837,0.001095,0.001054,0.000288,0.000966,0.00121,0.000854,0.000465,0.001674,0.000237,0.001603,0.000312,0.000517,0.000684,0.000459,0.000888,0.000184,0.000207,0.00035,0.000392,0.000831,0.000319,0.000295,0.001093,0.000877,0.000497,0.000609,0.001002,0.000302,0.000515,0.000225,0.000287,0.000404,9.3e-05,0.000359,0.00034,0.000983,0.000546,0.000385,0.00027,9e-05,0.000441,0.000387,0.000681,0.000303,0.000141,0.000723,0.000291,0.000482,0.000675,0.000287,0.000317,0.00086,0.000212,0.000218,0.000234,0.000341,0.000573,0.000114,0.000724,0.000335,0.000294,0.000668,9.1e-05,0.000502,0.000374,0.00087,0.000514,0.000511,0.00047,0.00023,0.000657,0.000439,0.000345
2.1e-05,2.2e-05,7.2e-05,8.8e-05,2.8e-05,7.5e-05,0.000202,0.000105,0.000127,7.4e-05,0.00015,7.2e-05,6.9e-05,0.00024,0.00016,0.000401,0.000159,0.000263,0.00023,0.000112,0.00011,0.000206,0.000134,0.000267,0.000372,0.00088,0.001131,0.00079,0.000861,0.000337,0.000409,5e-04,0.000536,0.000211,0.000225,0.000239,0.000663,0.000406,0.000322,0.000392,0.000415,0.000675,0.000168,0.000626,0.001093,0.000521,0.001477,0.000677,0.000728,0.000733,0.000477,0.000913,0.001035,0.000911,0.000244,0.000868,0.000179,0.000916,0.000485,0.000365,0.000461,6e-04,0.000603,0.000561,0.000438,0.00026,0.000232,0.000451,0.000183,0.000236,0.00083,0.000735,0.000192,0.000604,0.000533,0.000364,0.00072,0.000122,0.000431,0.000318,0.000173,0.000714,0.000953,0.001032,0.00013,0.000577,0.000659,0.000428,0.000137,0.000291,0.000219,0.000557,0.000208,0.000519,0.000224,0.000357,0.000734,0.000352,0.000263,0.000792,0.000296,0.000273,0.000263,0.000409,0.000652,0.000141,0.000244,0.000526,0.000382,0.000543,0.000196,0.000287,0.000145,0.000815,0.000384,0.000105,0.00048,7.9e-05,0.000627,0.000328,0.000177
4.5e-05,3e-05,3.4e-05,0.000115,8.1e-05,6e-05,0.000111,6.4e-05,0.000149,5.2e-05,5.9e-05,9e-05,1e-04,0.000227,6.9e-05,0.000282,2.3e-05,0.000259,0.000394,7.2e-05,0.000205,0.000299,0.000263,0.000457,0.000526,0.000375,0.000968,0.001356,0.000778,0.000719,0.00053,0.000341,0.00099,0.000506,0.000313,0.00014,0.000559,0.000483,0.000599,0.000637,8.6e-05,0.000336,0.000416,0.000665,0.001821,0.000738,0.000688,4.6e-05,0.000729,0.001123,0.000133,0.000651,0.001293,0.000775,0.000503,0.001325,0.000639,0.001078,0.000477,0.000266,0.000137,0.00049,0.00083,0.00067,0.000697,0.00024,0.000719,0.000308,0.00036,0.000333,0.00121,0.000877,0.000415,0.000348,0.000637,0.000171,0.000234,0.000733,0.001266,0.00072,0.000356,0.000728,0.000551,0.000458,0.000718,0.000588,0.000354,0.000418,0.000353,0.000272,0.000451,0.000649,0.000499,0.000248,0.000413,0.000814,0.001334,0.000182,0.000392,0.000731,0.000935,0.000254,0.000521,0.000364,0.000611,0.000468,0.000409,0.000615,0.000398,0.000639,0.000451,0.000199,0.000231,0.000661,0.000206,0.000442,0.000465,0.000468,0.000592,0.000875,0.000329
5.1e-05,1.7e-05,4e-05,9.3e-05,3.9e-05,8e-05,0.000131,0.00013,0.000154,4e-05,1e-04,0.000103,8.6e-05,0.000271,0.000256,0.000283,3.3e-05,0.000268,0.00038,0.000128,0.000298,0.000448,0.000465,0.00031,0.000518,0.000376,0.000486,0.000813,0.001144,0.000639,0.000692,0.000469,0.000794,0.000209,0.000736,0.00051,0.000549,0.000537,0.000696,0.001214,0.00025,0.000466,0.000235,0.000612,0.00148,6e-04,0.000881,0.000517,0.00125,0.000925,0.000198,0.001013,0.001538,0.000807,0.000429,0.001107,0.000367,0.000994,0.000857,0.000191,7.8e-05,0.000835,0.000846,0.000857,0.00035,0.000712,0.000866,0.000754,0.000844,1e-04,0.000859,0.001209,0.000278,0.000695,0.00059,0.000771,0.001028,0.000276,0.000736,0.000787,0.00025,0.000166,0.000989,0.001503,0.000853,0.000348,0.000946,0.001118,0.000734,0.000446,0.000101,0.001072,0.000226,0.000546,0.000499,0.000717,0.000967,0.001821,0.001026,0.000345,0.000267,0.000699,0.000565,0.000927,0.001033,0.001455,0.001514,0.001775,0.001908,0.001014,0.000154,0.00073,0.001137,0.001231,7e-04,0.000766,0.000232,0.000638,0.001597,0.001697,0.00132
5.6e-05,2.5e-05,6.4e-05,0.000116,0.000142,0.000132,4.2e-05,0.00014,0.000291,7.4e-05,5.9e-05,0.000195,0.000184,0.000196,0.000156,0.000194,0.000211,0.000674,7.5e-05,0.000446,0.000237,0.000349,0.000112,0.000679,0.00093,0.000378,0.00215,0.000375,0.002246,0.001643,0.000423,0.001098,0.000751,0.000741,0.000914,0.001259,0.000744,0.000883,0.000844,0.001791,0.000942,0.001367,0.000753,0.001307,0.001739,0.001192,0.000713,0.000767,0.000953,0.000993,0.001473,0.001392,0.002711,0.000835,0.000764,0.001623,0.00073,0.000236,0.000896,0.001152,0.000419,0.001595,4e-04,0.00033,0.000821,0.00063,0.000315,0.000491,0.000253,0.001045,0.000966,0.001185,0.001456,0.002068,0.000972,0.001193,0.002442,0.001876,0.001328,0.00192,0.002125,0.000785,0.000608,0.001773,0.000957,0.000889,0.001913,0.001861,0.001214,0.002001,0.002604,0.002424,0.002246,0.001839,0.000458,0.000811,0.001891,0.002688,0.002281,0.000841,0.000465,0.000844,0.001093,0.002276,0.001023,0.001627,6.3e-05,0.001303,0.002282,0.001477,0.000433,0.001477,0.001234,0.000886,0.001345,0.002194,0.001781,0.001415,0.002337,0.001161,0.000499
9e-05,8.2e-05,3.7e-05,9.5e-05,0.000113,0.000113,0.000112,0.00012,0.000383,0.000295,0.000141,0.000183,0.000297,0.000358,0.000428,0.000208,0.00054,0.000812,0.000461,0.000854,0.000581,0.000535,0.000928,0.001106,0.000966,0.001378,0.003954,0.001437,0.003439,0.000417,0.00128,0.001476,0.000991,0.001336,0.000594,0.001782,0.001641,0.000885,0.000431,0.001548,0.00094,0.001613,0.001393,0.002211,0.003599,0.00266,0.002725,0.000953,0.000226,0.002858,0.001096,0.000705,0.002311,0.002862,0.002335,0.003607,0.002494,0.002778,0.00158,0.001054,0.001651,0.001209,0.001129,0.001656,0.001739,0.000987,0.001787,0.00226,0.002325,0.000469,0.001976,0.002039,0.002833,0.00087,0.002632,0.003109,0.002022,0.000904,0.000308,0.001487,0.001512,0.001084,0.000713,0.000894,0.001919,0.000565,0.0019,0.000335,0.000489,0.001424,0.001817,0.000802,0.001148,0.000484,0.000955,0.000654,0.001783,0.001616,0.001209,0.001207,0.00133,0.001862,0.001582,0.002511,0.002335,0.000957,0.001263,0.000118,0.001517,0.001454,0.001859,0.001484,0.001041,0.001522,0.00115,0.000852,0.000351,0.001292,0.001152,0.001181,0.000729
5.7e-05,9.9e-05,4.9e-05,8.5e-05,8.9e-05,0.000195,5.5e-05,0.000157,0.000519,0.000586,0.000345,0.000166,0.000145,0.000473,0.001087,0.000827,0.000258,0.00136,0.000641,0.00054,0.000595,0.000859,0.001324,0.000468,0.00168,0.003905,0.007399,0.006001,0.005555,0.005484,0.00298,0.002064,0.003263,0.001076,0.001414,0.0018,0.001803,0.002237,0.002148,0.00097,0.00268,0.000478,0.002611,0.004256,0.005014,0.003101,0.001193,0.00142,0.001185,0.004068,0.004854,0.003298,0.003404,0.00358,0.003497,0.004719,0.004699,0.002991,0.002653,0.001709,0.002142,0.003253,0.002971,0.003761,0.001782,0.000244,0.00274,0.00455,0.003537,0.002859,0.000287,0.000764,0.001718,0.001275,0.002282,0.001523,0.000822,0.000283,0.000325,0.001432,0.001259,0.001649,0.002108,0.001018,0.001477,0.001171,0.000922,0.001125,0.001119,0.000484,0.001167,0.00074,0.001254,0.001148,0.001158,0.000745,0.001604,0.000767,0.00153,0.000728,0.000426,0.001201,0.001503,0.00045,0.00072,0.000369,0.000856,0.00088,0.000824,4e-04,0.000679,0.000687,0.000798,0.000375,0.000222,0.000751,0.000527,0.001213,0.000613,0.000901,0.00024
6e-05,7.9e-05,3.4e-05,8.8e-05,0.00018,0.000328,0.000343,0.000211,0.000853,0.00057,0.000196,0.000269,0.00025,0.000311,0.000958,0.00146,0.001606,0.00222,0.001544,0.001144,0.00082,0.001558,0.000482,0.000977,0.001016,0.004587,0.00427,0.003548,0.001757,0.004363,0.003493,0.003095,0.001569,0.001703,0.001699,0.000744,0.00063,0.001666,0.003278,0.004182,0.003134,0.00246,0.003252,0.004327,0.001398,0.000628,0.002353,0.002507,0.002558,0.002805,0.003531,0.000838,0.001471,0.000868,0.001971,0.001617,0.000571,0.001627,0.002628,0.002263,0.001157,0.001308,0.00059,0.001706,0.001382,0.001666,0.001626,0.001319,0.001443,0.00076,0.000843,0.000489,0.001054,0.000118,0.000872,0.000505,0.000208,9.4e-05,0.000647,0.000569,0.001093,0.000703,0.000652,5e-04,0.000471,0.000173,0.00058,0.000335,0.000591,0.001281,0.001428,0.000904,0.00046,0.000669,0.000301,0.000223,0.000758,0.000286,0.00076,0.000405,0.000172,0.000463,0.00054,0.000669,9.8e-05,0.000316,0.000274,0.000405,0.000536,0.000522,0.000309,0.000346,6.5e-05,0.000362,0.000339,0.000184,0.000144,0.00078,0.00061,0.000155,0.00016
2.4e-05,4.8e-05,6.6e-05,0.000112,0.000132,0.000149,0.000148,0.000331,0.000589,0.000345,0.000238,0.000355,0.00016,0.000353,0.000319,0.000819,0.000334,0.000887,0.000551,0.000184,0.000578,0.001133,0.001244,0.001149,0.001671,0.002924,0.001041,0.002793,0.001692,0.003436,0.00128,0.000648,0.000505,0.000808,0.00044,0.000603,0.000555,0.001498,0.000903,0.001837,0.001034,0.00067,0.001554,0.000827,0.000286,0.000993,0.001138,0.000319,0.000876,0.001407,0.000692,0.001318,0.000332,0.000295,0.000636,0.001143,0.001095,0.00071,0.000538,0.000646,0.000922,0.000349,0.000464,0.000642,0.000652,0.000496,0.001052,0.000895,0.000889,0.000383,0.000199,0.000316,0.000372,0.000769,0.000212,0.00019,0.000252,0.000238,0.000434,0.000323,0.000378,0.000537,8e-06,0.000229,0.000363,0.000325,0.000522,3e-04,0.000616,0.000749,0.000596,0.000166,0.000197,0.000455,0.00018,0.000142,0.000783,0.000293,0.000312,0.000249,0.000441,0.000225,0.000361,0.000202,0.000246,0.000277,0.000354,4.8e-05,0.000184,0.000239,0.000157,0.000287,5.6e-05,0.000372,0.000172,0.000195,2.6e-05,0.000603,5e-05,0.000252,0.000224
2.4e-05,1.2e-05,7.6e-05,8.1e-05,6.2e-05,4.7e-05,1e-04,0.000263,0.000216,9.1e-05,0.000131,0.000127,7.5e-05,0.000233,0.000352,0.000315,0.000407,0.000357,6.5e-05,0.000112,0.000287,0.000585,0.000174,0.000335,0.000933,0.001305,0.000343,0.00119,0.001295,0.000367,0.000688,0.000308,0.000151,0.000217,0.000197,0.000346,0.000491,0.00028,0.00058,0.000597,0.000545,0.000676,0.000735,0.000984,6.5e-05,0.000142,0.000997,0.000734,0.000746,0.000831,0.000321,0.000758,0.000495,0.000378,0.00062,0.000258,0.00039,0.000324,0.00065,0.000354,0.000722,0.000531,0.000422,5e-04,0.000335,0.00022,0.000792,0.001063,0.000524,0.000147,0.000161,0.000316,0.000209,0.000277,0.000159,0.000235,0.000222,0.000109,0.000128,7.4e-05,0.000191,0.000419,0.000209,0.00017,0.000158,0.000185,0.000291,0.000197,0.000588,0.00039,0.000647,0.000281,9.8e-05,0.000236,0.000119,0.000169,0.000551,0.000213,0.000189,0.000271,0.000202,7.5e-05,0.000199,0.000369,0.000162,0.000168,0.000242,0.000247,0.000121,0.000135,0.000145,0.000102,1.1e-05,0.000282,0.000212,0.000251,0.000254,0.000318,0.000103,0.000154,0.000192
4e-06,1e-06,2.5e-05,3e-05,2.3e-05,3.2e-05,3e-05,7.4e-05,7.7e-05,5e-05,4.1e-05,5.4e-05,2.3e-05,6.6e-05,9.3e-05,0.000105,0.000126,0.000105,6.8e-05,7.4e-05,0.000107,0.000104,0.000128,2.6e-05,0.000317,0.000469,0.000201,0.000423,0.000798,0.000391,0.000313,3.3e-05,9e-05,0.000118,9.2e-05,0.000156,0.000119,0.000161,0.000227,7e-05,0.000148,0.000251,0.000192,0.000444,7.8e-05,0.000154,0.000221,0.000307,0.000134,0.000196,0.000125,0.000329,3.4e-05,0.000271,7.7e-05,0.000119,0.000277,0.000264,0.000373,0.000171,0.000239,0.000106,0.000174,0.000261,0.000123,0.000128,0.000342,0.000296,9.6e-05,1e-04,5.3e-05,1.5e-05,4.2e-05,0.000108,8.9e-05,0.000141,6.8e-05,0.000101,2.6e-05,7e-06,2.4e-05,0.000166,7.9e-05,6.5e-05,8e-05,7.4e-05,5.2e-05,4.1e-05,0.000214,0.000188,0.000271,0.000114,8.7e-05,0.000168,7.2e-05,6.2e-05,0.000233,2.6e-05,0.000129,8e-06,0.000108,5.5e-05,3.3e-05,0.000113,4.5e-05,6e-05,9.4e-05,9.8e-05,4.1e-05,4.8e-05,8.3e-05,9.4e-05,2.7e-05,5.4e-05,1.6e-05,1.6e-05,9e-05,0.000134,4.2e-05,5.6e-05,0.000109
7e-06,6e-06,1.1e-05,1.9e-05,1.1e-05,2.2e-05,1.9e-05,5.8e-05,4.2e-05,4.1e-05,4.4e-05,2.5e-05,2.5e-05,5e-05,7.2e-05,9.7e-05,0.000124,4.3e-05,8.1e-05,3.3e-05,7e-05,8.3e-05,9.1e-05,3.8e-05,0.000221,0.000224,0.000207,0.000422,0.000319,0.000287,0.000124,0.000123,4.6e-05,0.000139,7.1e-05,4.8e-05,4.8e-05,0.000126,0.000191,0.000123,0.000166,0.000137,0.000197,0.000349,0.00018,0.000121,0.000292,0.000168,0.000179,9.7e-05,0.000105,0.000274,5.9e-05,0.000152,7.6e-05,4e-05,0.000219,0.000236,0.000201,0.000138,0.000254,1e-04,0.000175,0.000251,3.2e-05,0.000131,0.000251,0.000267,4.4e-05,9.4e-05,5.4e-05,7.9e-05,4.8e-05,0.000155,4.4e-05,0.000144,7.8e-05,5.7e-05,6.6e-05,4.8e-05,6.7e-05,0.000158,1.6e-05,0.00011,5.5e-05,9.4e-05,6.1e-05,4.3e-05,0.000165,0.000227,0.000214,6.9e-05,3.6e-05,0.000141,8e-05,4.5e-05,0.000213,5.5e-05,0.000115,3e-05,6.2e-05,2.4e-05,6.7e-05,0.000132,8.1e-05,7.9e-05,5e-05,3.4e-05,5.2e-05,2.5e-05,7.4e-05,6.9e-05,2.9e-05,9.6e-05,1.7e-05,3.9e-05,4.4e-05,0.000135,3.9e-05,7.8e-05,0.000107
1e-05,5e-06,2.4e-05,2.1e-05,1.5e-05,2.1e-05,3e-05,5e-05,3.2e-05,3.2e-05,4.6e-05,3.6e-05,3.1e-05,3.9e-05,7.5e-05,0.000106,8.4e-05,5.2e-05,5.6e-05,1.7e-05,5e-05,0.000112,4.3e-05,6.6e-05,0.000171,0.000343,0.000402,0.000442,0.000375,0.000178,4.7e-05,5.9e-05,9.5e-05,4.3e-05,9.2e-05,0.000148,2e-05,2.1e-05,0.000128,0.000108,9.4e-05,7.9e-05,0.000141,0.000319,0.00015,6.2e-05,0.000303,0.000199,1e-04,0.000113,5.9e-05,0.000197,9.1e-05,9.4e-05,0.000158,5.6e-05,0.000289,0.000296,0.000212,9.1e-05,0.000136,3.8e-05,0.000205,0.000235,0.000124,0.000159,0.00015,0.000339,5.2e-05,0.000131,0.000106,0.000103,2.6e-05,5.7e-05,6.4e-05,0.00022,4e-05,4.7e-05,1.7e-05,0.000123,2.1e-05,0.000156,4e-05,0.000118,7.8e-05,7.5e-05,8.6e-05,1.3e-05,0.000127,0.000141,0.000139,3.5e-05,3.8e-05,0.000127,7.4e-05,3.4e-05,0.000236,2.5e-05,0.00014,1.8e-05,1.7e-05,8.2e-05,2.9e-05,0.000142,3.2e-05,6.9e-05,0.000101,8.2e-05,5.3e-05,6e-05,2.6e-05,3.1e-05,8.4e-05,6.4e-05,3.7e-05,4.1e-05,7.7e-05,0.000122,2.1e-05,8.8e-05,1.2e-05
3e-06,5e-06,1.7e-05,7e-06,1.3e-05,2.9e-05,3.3e-05,4.1e-05,1.9e-05,3.2e-05,1.2e-05,6e-06,4.6e-05,3.2e-05,6.1e-05,9.5e-05,7.8e-05,5.4e-05,6.1e-05,2.2e-05,4.5e-05,9.8e-05,8.9e-05,7e-05,0.000157,0.000367,0.000278,0.000385,0.000379,0.000125,0.000141,7.6e-05,4.1e-05,6.3e-05,0.000103,0.000102,4.5e-05,0.000107,0.000222,0.000175,0.000106,0.000111,0.000183,0.000229,7.2e-05,3.3e-05,0.000178,0.000107,9.1e-05,9.4e-05,0.00012,0.000182,5.8e-05,9.8e-05,0.000117,0.000123,0.000296,0.000224,8.6e-05,7.8e-05,0.000123,0.000105,0.000146,0.000196,7.3e-05,5.1e-05,0.000169,0.000217,0.000143,5e-05,4.4e-05,5.9e-05,0.000129,0.000113,1e-04,6.9e-05,2e-05,5e-05,2.9e-05,0.000118,5.5e-05,0.000138,4.4e-05,8.3e-05,2.3e-05,6.5e-05,6.2e-05,7.8e-05,0.00016,0.00017,0.000171,7.8e-05,9e-06,0.00011,8.5e-05,3.5e-05,0.000154,2.6e-05,0.000104,3.4e-05,2.4e-05,3e-05,3.1e-05,4.2e-05,4e-06,2.1e-05,7.7e-05,7.9e-05,5.6e-05,4.4e-05,7.3e-05,5.5e-05,6.4e-05,0.000101,3.6e-05,4.4e-05,4.8e-05,0.000107,2.6e-05,9.7e-05,0.000102
7e-06,8e-06,7e-06,9e-06,1.9e-05,1.7e-05,1.9e-05,5e-05,2.8e-05,5e-05,3.1e-05,1.5e-05,2.8e-05,1.7e-05,4.4e-05,9e-05,9.1e-05,3.5e-05,5.8e-05,3.5e-05,7.4e-05,5e-05,5.1e-05,6e-05,0.000107,0.000333,0.000165,0.000492,0.000188,0.000173,0.000187,7.8e-05,6e-05,9.7e-05,7e-05,9e-05,4.7e-05,8.6e-05,0.000183,7.4e-05,0.000121,0.00021,0.000109,0.000194,0.000163,0.000177,0.000197,0.000135,7e-05,0.00014,9.4e-05,0.000194,7.5e-05,0.000103,4.1e-05,0.000164,0.00025,0.00025,0.000186,0.000119,0.000128,8.5e-05,0.000198,0.000175,9.4e-05,3.6e-05,0.000133,0.000268,0.000147,9.1e-05,8.4e-05,5.7e-05,0.000134,0.000127,5e-05,8.5e-05,5.1e-05,7.8e-05,3.8e-05,4.7e-05,1.5e-05,9.9e-05,3.8e-05,8.2e-05,5.7e-05,0.000109,6.4e-05,6e-05,0.000177,0.000171,0.000203,6.6e-05,3.4e-05,8.5e-05,9.7e-05,3.8e-05,0.000143,1.7e-05,0.000128,3.2e-05,5.5e-05,1.3e-05,3.5e-05,6.5e-05,6.5e-05,4.8e-05,9.3e-05,7.3e-05,4.5e-05,5.4e-05,1.8e-05,6.2e-05,2.6e-05,8.4e-05,6.1e-05,1.7e-05,6.8e-05,8.5e-05,5.6e-05,4.1e-05,4.6e-05
3e-06,1e-06,1.2e-05,1.7e-05,8e-06,1e-05,1.4e-05,3.6e-05,2.8e-05,2.7e-05,7e-06,1.4e-05,2.7e-05,3.1e-05,5.5e-05,9.2e-05,8e-05,4.6e-05,4.7e-05,2.6e-05,1.2e-05,5.2e-05,4.7e-05,3.3e-05,0.000115,0.000425,0.000136,0.000371,0.000295,0.000156,0.000174,8.2e-05,5.9e-05,0.00012,9.8e-05,3e-05,1.5e-05,5.9e-05,9.3e-05,0.000141,7.1e-05,0.000134,4.8e-05,0.000135,0.000168,6.1e-05,0.000166,5.4e-05,0.000164,0.000262,0.000156,0.000197,6.5e-05,4.1e-05,7.2e-05,0.000103,0.000109,6.7e-05,0.000101,8e-05,0.000131,6.6e-05,0.000164,7e-05,6.8e-05,6.3e-05,0.000181,0.000232,8.4e-05,1.9e-05,2.5e-05,6e-05,7e-06,3.3e-05,1.6e-05,8.8e-05,7.1e-05,5.3e-05,4.9e-05,1.1e-05,2.1e-05,0.00012,2.1e-05,2.2e-05,8.4e-05,6.3e-05,7.3e-05,2.8e-05,0.000148,0.000164,0.000182,5.8e-05,4.1e-05,7.7e-05,2.6e-05,4.4e-05,9.7e-05,7.3e-05,8.3e-05,5.8e-05,1.4e-05,4.3e-05,1.7e-05,9.3e-05,3.2e-05,1.3e-05,8e-05,5.1e-05,1.4e-05,6.5e-05,3.5e-05,3.4e-05,5.7e-05,5.2e-05,4.7e-05,3.9e-05,8.2e-05,7.6e-05,5.8e-05,6.6e-05,4.2e-05
3e-06,3e-06,8e-06,2.5e-05,8e-06,6e-06,2.9e-05,3.5e-05,2e-05,1.7e-05,2.2e-05,7e-06,2e-05,2.6e-05,4.7e-05,7.8e-05,7.1e-05,2.6e-05,3.8e-05,3e-06,2.7e-05,6.6e-05,8.4e-05,5e-05,0.000103,0.000395,0.000329,0.000187,0.000532,0.000107,0.000216,7.1e-05,1.3e-05,5.4e-05,3.9e-05,4.4e-05,2.8e-05,8.1e-05,7.5e-05,5.8e-05,6e-05,0.000144,4e-05,0.000219,7.4e-05,5.6e-05,0.000105,0.000128,0.00014,0.000254,0.000164,0.000193,4.1e-05,4.3e-05,5.5e-05,5.1e-05,0.000171,7.6e-05,0.000112,0.000105,9.5e-05,9.5e-05,0.000137,7.7e-05,1.2e-05,5.2e-05,0.00017,0.000191,7.2e-05,3.1e-05,6.9e-05,7.6e-05,6.8e-05,5.5e-05,4.3e-05,0.000111,3.4e-05,5.8e-05,3.4e-05,7.8e-05,3e-06,5.6e-05,5.1e-05,6.6e-05,9e-05,6.2e-05,3e-05,6.2e-05,0.000146,0.000177,0.000103,0.000112,4.3e-05,8.4e-05,4.3e-05,3e-05,8.3e-05,4.1e-05,0.000102,4.3e-05,3.7e-05,1.2e-05,2e-05,0.000104,2.9e-05,2.4e-05,9.3e-05,6.8e-05,4.9e-05,7.6e-05,1.2e-05,6.5e-05,4e-05,6.5e-05,7.4e-05,4.7e-05,3e-05,7e-05,1.6e-05,7.3e-05,7.2e-05
8e-06,4e-06,1.8e-05,1.6e-05,8e-06,8e-06,1.7e-05,3.4e-05,2.6e-05,6e-06,1e-05,1.2e-05,2.7e-05,1.5e-05,4.1e-05,7.9e-05,7.5e-05,3.7e-05,6.2e-05,1.6e-05,3e-05,4.8e-05,9.6e-05,8.1e-05,0.000193,0.000141,0.00013,0.000216,0.000267,0.000171,0.000154,8.1e-05,3e-05,6.3e-05,6e-06,1.2e-05,5.7e-05,6.5e-05,4.6e-05,9.1e-05,4.6e-05,0.000143,6.3e-05,0.000183,0.00012,5.8e-05,0.000152,0.000106,9.5e-05,0.000268,0.000162,0.000256,7.6e-05,1e-05,0.000136,3.9e-05,0.000184,0.000146,0.000133,0.000118,0.000112,7.5e-05,0.000178,7.1e-05,3.4e-05,3.8e-05,0.000133,0.000236,0.00012,3.4e-05,0.000108,0.000116,6e-05,6.4e-05,4.5e-05,7.7e-05,1.1e-05,4.3e-05,1.1e-05,8.1e-05,5.1e-05,0.000103,1.3e-05,0.000101,8.1e-05,8.4e-05,4.6e-05,2.1e-05,0.000131,0.000184,0.000133,7.2e-05,3.3e-05,8.1e-05,4.1e-05,1.9e-05,0.000105,4.2e-05,6.8e-05,1e-05,3.1e-05,2.3e-05,3.4e-05,0.000116,1.9e-05,3.1e-05,5.7e-05,8.4e-05,8e-05,5.2e-05,4.3e-05,4e-06,3.2e-05,2.4e-05,6e-05,2.6e-05,3.8e-05,4.8e-05,3.2e-05,3.7e-05,7.7e-05
8e-06,1.1e-05,1.5e-05,2e-06,7e-06,1.4e-05,2.3e-05,1.5e-05,7e-06,6e-06,2.4e-05,2e-05,3.9e-05,2.8e-05,4.3e-05,6e-05,3.6e-05,1.9e-05,5.5e-05,2.9e-05,9e-06,4.4e-05,6.8e-05,3.3e-05,0.000123,0.000189,0.000141,0.000191,0.000272,0.000243,0.00015,9.4e-05,2.9e-05,5.6e-05,2.3e-05,1.4e-05,5.1e-05,3.5e-05,8e-06,0.000101,0.000118,0.00018,8.6e-05,9.7e-05,0.000106,8.3e-05,6.5e-05,0.000103,0.000117,0.000203,9.6e-05,0.000203,7.7e-05,1.5e-05,9.9e-05,5.8e-05,0.00017,0.000213,0.000106,3.3e-05,6.2e-05,0.000139,3.8e-05,8e-05,2.6e-05,7.5e-05,0.000102,0.000253,8.1e-05,6.1e-05,9e-05,3.2e-05,6e-05,7.1e-05,4e-06,1e-04,2.5e-05,2.5e-05,5.2e-05,3.7e-05,1.4e-05,9.3e-05,4.5e-05,7e-05,6.5e-05,0.000119,5.8e-05,4.3e-05,9e-05,0.000124,0.000129,8.8e-05,5.2e-05,9.1e-05,1.7e-05,5.3e-05,9.1e-05,4.7e-05,8.2e-05,1.4e-05,4.1e-05,4.8e-05,8e-06,9.8e-05,3.6e-05,3.4e-05,5.2e-05,5.2e-05,2.1e-05,0.000104,5.3e-05,4.7e-05,2.9e-05,1.7e-05,4.9e-05,3e-05,5.9e-05,0.000113,4.3e-05,9.5e-05,7e-05
4e-06,2e-06,8e-06,2.6e-05,1.6e-05,1.4e-05,1.9e-05,2.4e-05,1.5e-05,1.6e-05,1e-05,1.9e-05,3.5e-05,2.9e-05,1.5e-05,8.1e-05,6e-06,5e-05,4.1e-05,7e-06,3.8e-05,7.8e-05,4.6e-05,1.2e-05,9.3e-05,0.000238,0.000178,0.000108,0.000407,0.000126,1e-04,7.8e-05,1.5e-05,5.3e-05,3.6e-05,3.1e-05,3e-05,5.1e-05,3.8e-05,4.1e-05,8.6e-05,9.2e-05,5.7e-05,0.000156,6.3e-05,8.1e-05,5e-05,0.00016,0.000147,3.4e-05,5.2e-05,0.000136,2.4e-05,0.000113,6.9e-05,8e-05,0.000166,0.000216,8e-05,7.2e-05,5.9e-05,6.6e-05,0.000106,7.5e-05,2.1e-05,6.7e-05,0.000139,0.00018,5.7e-05,3.7e-05,2.2e-05,9.3e-05,8.7e-05,2.2e-05,3.3e-05,8.4e-05,4e-05,2.4e-05,3.3e-05,3.4e-05,3.6e-05,9.9e-05,5.8e-05,0.000109,1.2e-05,6.1e-05,2.7e-05,8e-06,0.000139,0.00015,0.000145,3e-05,5e-06,7.3e-05,5.5e-05,5.6e-05,8.6e-05,1.2e-05,4.4e-05,3.1e-05,2.2e-05,2.1e-05,2.6e-05,0.000114,6.1e-05,3.4e-05,4.1e-05,5.6e-05,4e-05,9e-05,2.5e-05,8.5e-05,3e-05,4.6e-05,5.3e-05,2.8e-05,6e-05,0.000101,3e-05,0.000115,8.2e-05
7e-06,7e-06,2.6e-05,1e-05,1e-05,6e-06,1.5e-05,2.3e-05,7e-06,1.9e-05,1e-06,1e-05,3.7e-05,8e-06,2.2e-05,7e-05,4.8e-05,2.6e-05,2.1e-05,3.1e-05,4.8e-05,6.5e-05,4e-06,2.3e-05,7.4e-05,0.000211,0.000168,0.000165,0.000189,0.000133,0.000137,5.8e-05,1.6e-05,4.4e-05,4.9e-05,1.9e-05,3e-05,5e-05,8.8e-05,6.9e-05,5.4e-05,9.3e-05,5.7e-05,0.000171,0.000131,5.1e-05,0.000117,2e-05,1.9e-05,7.8e-05,3.5e-05,0.000171,8.9e-05,5.2e-05,8.8e-05,8.5e-05,0.000136,0.000164,6.8e-05,2.4e-05,0.000105,8e-05,0.00012,8.6e-05,3.5e-05,2.5e-05,0.000125,0.000206,4.7e-05,6.1e-05,2.7e-05,6.6e-05,8.4e-05,5.8e-05,3.2e-05,5.6e-05,4.4e-05,2.2e-05,2.8e-05,3.9e-05,5.4e-05,0.000113,6.3e-05,7.5e-05,3.3e-05,4.9e-05,3.2e-05,4e-06,8.7e-05,0.00013,0.000156,4.5e-05,2.6e-05,7.4e-05,6.4e-05,7.2e-05,0.000115,3.3e-05,7.5e-05,1e-05,1.4e-05,4.1e-05,4e-05,6.3e-05,5.9e-05,4.4e-05,6.1e-05,4.8e-05,3.5e-05,6e-05,3.9e-05,5.9e-05,2.5e-05,4.2e-05,3.5e-05,3.1e-05,4.5e-05,0.000103,3.5e-05,5.8e-05,5.9e-05
4e-06,2e-06,4.4e-05,2.4e-05,1.6e-05,2.6e-05,2.2e-05,2e-05,1e-05,1e-05,3.1e-05,3.6e-05,2.4e-05,2.6e-05,4.1e-05,6.4e-05,5e-05,1.3e-05,3e-05,5e-05,5.2e-05,4.4e-05,4.1e-05,9e-06,7.6e-05,0.000188,0.000183,0.000135,0.000163,7.8e-05,0.000145,1.2e-05,3.5e-05,4.5e-05,6.8e-05,4.4e-05,2e-05,5.5e-05,8.6e-05,6.1e-05,0.000106,7.4e-05,7.3e-05,0.000136,8.1e-05,0.000105,0.000127,6.6e-05,1.3e-05,8.9e-05,8.3e-05,0.000123,6.5e-05,7.3e-05,0.000114,0.000103,0.00015,0.000211,4.9e-05,8e-05,9.1e-05,4.2e-05,0.000149,6.4e-05,4.5e-05,4.1e-05,0.000112,0.000217,4.8e-05,3.4e-05,5.4e-05,8.3e-05,5.2e-05,2.8e-05,1e-05,6.7e-05,2.2e-05,4.9e-05,1.3e-05,5.4e-05,5.7e-05,6.4e-05,1.3e-05,4.4e-05,5.3e-05,5.4e-05,9e-06,1.4e-05,0.000105,0.000111,0.000136,5.4e-05,2.4e-05,7.2e-05,8.5e-05,5.2e-05,0.000116,1.6e-05,4.8e-05,1.6e-05,3.4e-05,1.2e-05,1.7e-05,8.2e-05,3.7e-05,2.8e-05,7.7e-05,1.5e-05,3.4e-05,5.6e-05,6.9e-05,8.9e-05,3.8e-05,2.1e-05,5.2e-05,2.8e-05,7.5e-05,8e-05,5.8e-05,4.9e-05,7.8e-05
5e-06,3e-06,4.8e-05,5.3e-05,3.2e-05,1.7e-05,2.5e-05,3.2e-05,1e-05,6e-06,3.1e-05,4e-06,2.9e-05,2.5e-05,1.8e-05,7.9e-05,2.2e-05,3.1e-05,1.3e-05,3.3e-05,6.2e-05,3.2e-05,1.2e-05,4.7e-05,0.000133,0.000142,8.1e-05,0.000179,7.7e-05,0.000148,5e-05,4.7e-05,2.7e-05,4.3e-05,2e-05,1e-05,9.4e-05,4.7e-05,5.5e-05,4.9e-05,4.6e-05,0.00013,4.2e-05,0.000156,5.8e-05,9.5e-05,0.000141,8.6e-05,8e-05,0.000106,0.000154,0.000175,8.1e-05,4.8e-05,3.8e-05,7.1e-05,8.6e-05,0.000129,0.00012,8.5e-05,9e-05,3.4e-05,0.000109,0.000107,2.1e-05,0.000118,0.000179,0.000236,7.4e-05,4.9e-05,2.7e-05,5e-05,6.9e-05,6e-05,1.3e-05,6.9e-05,2.7e-05,2.7e-05,2e-05,5e-05,2.9e-05,2.9e-05,7.1e-05,2.8e-05,6.5e-05,5.5e-05,5.5e-05,4.6e-05,9.8e-05,0.000136,0.00012,7.6e-05,3.2e-05,1e-04,1e-04,9.5e-05,7.5e-05,5.3e-05,8.3e-05,3e-05,7.2e-05,6.3e-05,4.8e-05,8.1e-05,3.2e-05,1.8e-05,5.7e-05,5.7e-05,6.2e-05,4.3e-05,8.5e-05,3.5e-05,3.1e-05,8.3e-05,4.2e-05,8e-05,8e-05,8.5e-05,5.7e-05,3.3e-05,6.9e-05
1e-05,7e-06,3.7e-05,1.6e-05,7e-06,1.5e-05,2.7e-05,2.2e-05,6e-06,5e-06,2.4e-05,1.2e-05,2.1e-05,3.7e-05,1.1e-05,7.1e-05,3.6e-05,5.3e-05,1.6e-05,4e-05,4.2e-05,4.3e-05,3e-05,5e-05,0.000102,0.000198,0.000109,0.000317,0.000274,0.000158,7.6e-05,5e-05,0.000108,3.8e-05,0.000102,6.2e-05,0.000145,2.3e-05,0.000124,1.8e-05,3.5e-05,0.000131,7.3e-05,7.8e-05,4.6e-05,0.000119,0.000217,9.2e-05,0.000117,0.000184,0.000172,0.000146,0.000123,9e-05,7.5e-05,6.9e-05,6.9e-05,0.00016,1.1e-05,4.6e-05,0.000118,0.000113,0.000176,6.9e-05,3.2e-05,0.000138,0.000123,2e-04,7.5e-05,0.000139,5e-05,6.9e-05,6.6e-05,4.6e-05,3.5e-05,7.3e-05,2.3e-05,5.1e-05,6.8e-05,4.2e-05,2.1e-05,6.8e-05,5.6e-05,9.1e-05,5e-05,6e-05,0.000101,8.5e-05,9.9e-05,0.000149,0.000123,5e-05,3.9e-05,5.6e-05,4.4e-05,1.8e-05,0.000126,3.1e-05,0.000101,5.2e-05,7.5e-05,3.3e-05,5.3e-05,3.9e-05,5.6e-05,1.5e-05,2e-05,2.8e-05,2.1e-05,3e-05,4.1e-05,2.4e-05,3.4e-05,6.4e-05,4.6e-05,4.1e-05,2.5e-05,9.7e-05,1.7e-05,2.5e-05,3.4e-05
1.1e-05,4e-06,1.7e-05,4.2e-05,1.5e-05,1.6e-05,9e-06,2.6e-05,1.4e-05,2.4e-05,9e-06,8e-06,2.1e-05,3.4e-05,6.8e-05,0.000102,9.1e-05,0.000102,4.8e-05,1e-05,7.8e-05,4e-05,6.9e-05,5.5e-05,5.7e-05,0.000109,2.2e-05,0.000478,0.000275,0.000175,0.000189,9.3e-05,0.000218,0.000244,0.000147,3.4e-05,6.9e-05,0.000171,6.7e-05,0.000156,0.000101,0.000202,0.000158,0.00018,7.1e-05,0.000124,0.000174,0.000302,0.000208,0.000214,0.000104,0.000227,6.1e-05,5.3e-05,0.000162,4.6e-05,0.000152,0.000278,0.000153,7.1e-05,0.000153,4.1e-05,0.000268,0.000173,0.00015,0.00017,0.000315,0.000301,0.000124,0.000222,0.000296,6.4e-05,0.000107,7e-05,4.7e-05,0.00012,0.000115,8.7e-05,9.9e-05,0.000117,5.4e-05,7.5e-05,3.2e-05,0.000101,4e-05,4.3e-05,6.9e-05,0.000138,8e-06,0.000205,4e-05,5.5e-05,5.5e-05,9.1e-05,4.6e-05,4.5e-05,0.000145,5.5e-05,9.3e-05,2.4e-05,3.3e-05,3.4e-05,6.8e-05,6.5e-05,3.4e-05,4.6e-05,3.5e-05,4.3e-05,2.3e-05,3e-05,4.7e-05,2.2e-05,6e-06,5.8e-05,5.5e-05,3.8e-05,4.7e-05,0.000107,2.4e-05,3.9e-05,4.2e-05
2e-06,6e-06,1.4e-05,1e-05,1.2e-05,1.2e-05,1.9e-05,3e-05,2.8e-05,1.5e-05,2.8e-05,1.5e-05,3e-06,1.9e-05,6.5e-05,0.000101,0.000138,3e-05,3.7e-05,6.5e-05,0.000104,0.000131,8.5e-05,9.8e-05,0.000128,9.3e-05,0.00023,0.00054,0.000235,6.8e-05,0.000188,9.6e-05,0.000134,0.000242,0.000129,2.3e-05,1.5e-05,0.000111,0.000145,0.000169,0.000114,0.000123,6.5e-05,0.000102,1e-04,0.000107,0.000105,0.00015,6.5e-05,0.000231,5.4e-05,0.000181,8e-05,0.000105,0.000199,0.000237,0.000328,6.7e-05,8.9e-05,2.4e-05,0.000125,3.7e-05,0.00019,9.8e-05,7.5e-05,1.5e-05,0.000154,3.9e-05,0.000132,1.2e-05,0.000154,0.000211,5.4e-05,4.5e-05,3.7e-05,0.000124,0.000115,8.3e-05,0.000104,7.9e-05,7.6e-05,0.00013,2.8e-05,0.000104,4.7e-05,3.7e-05,6.4e-05,3.8e-05,0.000133,0.00013,0.000115,1.1e-05,2.9e-05,6.4e-05,4.3e-05,5.2e-05,0.000176,3.3e-05,7.6e-05,2.7e-05,1.2e-05,4.3e-05,1.1e-05,7.9e-05,2.4e-05,2.1e-05,2e-05,4.8e-05,1.7e-05,6.4e-05,4.7e-05,2.2e-05,2.2e-05,7.4e-05,1.3e-05,3.2e-05,5.9e-05,7.5e-05,2.1e-05,3e-05,5.7e-05
9e-06,6e-06,1.1e-05,1.5e-05,9e-06,9e-06,1.6e-05,1.7e-05,1.8e-05,2.1e-05,3.7e-05,1.6e-05,2.1e-05,7e-06,2.6e-05,6.4e-05,8.2e-05,3.6e-05,6.5e-05,4.6e-05,6.3e-05,1.3e-05,2.4e-05,5.1e-05,6.2e-05,0.000153,0.000162,0.000446,0.000147,4e-05,9.7e-05,6.9e-05,0.000117,7.2e-05,4.4e-05,7.1e-05,6.1e-05,3.7e-05,4.4e-05,6.8e-05,4.1e-05,0.000122,1.5e-05,0.000168,0.000171,7e-05,0.000116,4.6e-05,3.9e-05,0.000143,7.9e-05,0.000124,5e-05,9.2e-05,9e-05,5.1e-05,0.000204,0.000119,7.4e-05,0.000131,0.000111,2.7e-05,0.000174,9e-05,5.2e-05,2.3e-05,7.9e-05,0.000123,5.1e-05,6.1e-05,3.7e-05,0.000114,3.5e-05,1.1e-05,2.5e-05,0.000115,3.9e-05,3.2e-05,3.5e-05,1.6e-05,4e-05,5.1e-05,3e-05,7.1e-05,3.9e-05,5.9e-05,2e-05,3.8e-05,0.000129,0.00014,0.000105,4e-06,2e-05,5.8e-05,3.1e-05,3.5e-05,0.000137,5.1e-05,4.3e-05,8e-06,3.3e-05,8e-06,9e-06,7.7e-05,2.4e-05,2.9e-05,2.6e-05,4.2e-05,1e-05,5e-05,4.9e-05,3.1e-05,3e-06,6.3e-05,5e-06,1.8e-05,4e-05,7.1e-05,1.8e-05,2.1e-05,3.3e-05
2e-06,2e-06,8e-06,1e-05,2e-06,1e-05,1.2e-05,2.2e-05,1.5e-05,2e-05,2e-05,1e-05,2.1e-05,6e-06,2.5e-05,5.4e-05,6.6e-05,1.1e-05,3.7e-05,2.2e-05,2.1e-05,3.2e-05,2.5e-05,5.4e-05,8.3e-05,0.000167,0.000124,0.000358,6.6e-05,6.8e-05,0.000115,3.5e-05,4.3e-05,8.2e-05,8e-06,4.7e-05,2.3e-05,2.2e-05,5.2e-05,1.1e-05,4.4e-05,0.000131,1.3e-05,0.000168,9.8e-05,5.6e-05,9.4e-05,7.8e-05,4.7e-05,5.2e-05,1.6e-05,0.000109,6.1e-05,6.1e-05,6.4e-05,4.3e-05,0.000228,8.1e-05,2.3e-05,5e-05,9.8e-05,4e-06,0.000159,9.3e-05,3.7e-05,9e-06,7.9e-05,0.00014,4.9e-05,4.3e-05,5.5e-05,9.3e-05,1.8e-05,3.2e-05,8e-06,9.6e-05,1.3e-05,3.3e-05,1.7e-05,1.6e-05,3e-05,5.7e-05,1.3e-05,6.4e-05,1.9e-05,4.7e-05,1.4e-05,4.7e-05,0.000105,0.000113,0.00012,1.9e-05,2.1e-05,5.4e-05,4.8e-05,4e-06,0.000104,2.4e-05,6.5e-05,3e-06,3.6e-05,2.1e-05,7e-06,7.4e-05,1.8e-05,9e-06,3.7e-05,2.5e-05,2.1e-05,5.9e-05,2.4e-05,5.5e-05,3e-05,7.3e-05,7e-06,1.2e-05,4.6e-05,7.5e-05,1.7e-05,3.2e-05,2.9e-05
2e-06,2e-06,8e-06,1.4e-05,2e-06,9e-06,1.3e-05,2.2e-05,1.1e-05,1e-05,1.5e-05,9e-06,1.3e-05,5e-06,2.2e-05,5.5e-05,5.5e-05,3e-06,3.4e-05,1.6e-05,1.3e-05,4.4e-05,5e-06,3.5e-05,8.5e-05,0.000178,7.8e-05,0.000303,7.9e-05,5.4e-05,0.000102,2.4e-05,5.1e-05,7.6e-05,2.3e-05,2.5e-05,1.7e-05,2.9e-05,2.7e-05,8e-06,3.7e-05,0.000128,5e-06,0.000152,9.4e-05,3.4e-05,0.000101,3.7e-05,3.5e-05,6e-05,2.2e-05,0.000117,5.6e-05,5e-06,7e-06,4e-05,0.00019,9.9e-05,3e-06,4.9e-05,9.5e-05,1.9e-05,0.000153,8.5e-05,1.8e-05,1e-05,8.4e-05,0.000169,2.3e-05,2.2e-05,4.5e-05,8.1e-05,2.8e-05,4.4e-05,1e-05,8.9e-05,7e-06,3.1e-05,8e-06,5e-06,2.7e-05,7.5e-05,1.5e-05,8.3e-05,3.2e-05,4.9e-05,1.6e-05,3.2e-05,0.00011,0.000119,0.000113,2.9e-05,2e-06,5.5e-05,2.7e-05,4e-06,8.8e-05,3.3e-05,5.8e-05,1.4e-05,2.5e-05,1.6e-05,6e-06,7.5e-05,6e-06,1.6e-05,2.2e-05,3.1e-05,2.1e-05,5.3e-05,4e-05,5.3e-05,2.2e-05,6.2e-05,1.6e-05,6e-06,4.9e-05,6.6e-05,2.8e-05,3e-05,2.9e-05
2e-06,1e-06,7e-06,1.4e-05,3e-06,1e-05,1.2e-05,2.1e-05,1.1e-05,1.1e-05,1.6e-05,1.2e-05,1.4e-05,4e-06,2.4e-05,6.2e-05,5.4e-05,1e-06,3e-05,1.6e-05,1.4e-05,3.9e-05,2e-06,3.8e-05,7.8e-05,0.000157,0.000144,0.000326,8.7e-05,6.2e-05,8.9e-05,3.3e-05,4.2e-05,6e-05,1.7e-05,2.9e-05,5e-06,3.7e-05,2.9e-05,3e-06,3.3e-05,0.000118,6e-06,0.000145,8.1e-05,4.5e-05,0.000114,6.4e-05,3.1e-05,5.6e-05,2.3e-05,0.000126,5.7e-05,3.3e-05,2.8e-05,3.7e-05,0.000172,9.2e-05,8e-06,4.8e-05,1e-04,1.5e-05,0.000154,8.2e-05,1.7e-05,4e-06,8.2e-05,0.000146,4e-05,8e-06,4.6e-05,7.7e-05,3e-05,4.3e-05,7e-06,8e-05,8e-06,3e-05,9e-06,1.8e-05,1.4e-05,7.2e-05,8e-06,5.8e-05,2.5e-05,4.3e-05,1.6e-05,2.4e-05,0.000107,0.00011,0.000112,2.6e-05,5e-06,6.3e-05,3.1e-05,6e-06,0.000104,2e-05,5.4e-05,2e-05,2.2e-05,1.9e-05,6e-06,7e-05,8e-06,1.8e-05,1.8e-05,3.4e-05,2.3e-05,5.1e-05,4e-05,4.3e-05,2.5e-05,5.4e-05,1.3e-05,3e-06,4.7e-05,6.1e-05,1.9e-05,2.3e-05,3.9e-05
