-4.4e-05,-0.000533,-0.000372,-0.000431,-0.000462,-0.000763,-0.000659,-0.000325,-0.000911,-0.00062,-0.001064,-0.000939,-0.001013,-0.000742,-0.001235,-0.00139,-0.001444,-0.001185,-0.001053,-0.000651,-0.000632,-0.000888,-0.000924,-0.000791,-0.001099,-0.000437,-0.000947,-0.001448,-0.000755,-0.000836,-0.000199,-0.001181,-0.001479,-0.001354,-0.001166,-0.000329,-0.000962,-0.000675,-0.000384,-0.00021,-0.000194,-0.000794,-0.001442,-0.001019,-0.000692,-0.000369,-0.000199,-0.000216,-0.000576,-0.00028,-0.000495,-0.001054,-0.00058,-0.000913,-0.000589,-0.000319,-0.001037,-0.000911,-0.001057,-0.000602,-0.001126,-0.000636,-0.000818,-0.000491,-0.001034,-0.001583,-0.000872,-0.000449,-0.000977,-0.000939,-0.000851,-0.00022,-0.000799,-0.000403,-0.000843,-0.001084,-0.000904,-0.000253,-0.000394,-0.000202,-0.000692,-0.00071,-0.000403,-0.000321,-0.001018,-0.000796,-0.000554,-0.001145,-0.000615,-0.000332,-0.000668,-0.000774,-0.000505,-0.00065,-0.001046,-0.000678,-0.000571,-0.000174,9.3e-05,-0.000464,0.000141,-0.000285,-0.000142,-0.000314,-8e-06,-0.000625,-0.000785,-0.001076,-0.000607,-0.000965,-0.00122,1.3e-05,-8.8e-05,-0.000563,-0.000509,-0.000566,-0.00081,-0.000758,-0.000732,-0.00075,-0.000151
-0.000205,-7e-05,-0.000166,-0.000103,-8.6e-05,0.000185,-0.000295,-0.000266,-0.000215,0.000126,-0.000118,-0.000334,-0.00018,-0.000165,0.000183,0.000121,-0.000553,-0.000244,-0.000108,-0.000319,-0.000466,-0.000177,-0.000845,-0.000436,-0.000203,-5.1e-05,-0.000876,-0.000905,-0.000291,-0.000256,-5e-06,0.000161,-0.000555,-0.000737,-0.000128,0.000193,-0.000266,0.000196,3.8e-05,-0.000675,-0.000488,0.000349,0.000308,-0.00056,-8.9e-05,-0.00057,-0.000771,-0.000319,5.9e-05,-0.000289,9.8e-05,7.2e-05,-0.000179,0.000104,-0.000104,-0.000147,0.000241,-8.4e-05,0.000225,-0.001041,-0.000574,-0.000865,-0.000691,-0.000236,-0.000411,-0.000653,-0.000624,-0.000874,-0.000364,-0.000431,-0.000152,-0.000839,-0.000382,-0.000333,-0.000938,-7e-05,-0.000679,-0.000448,-0.000363,-9.8e-05,-8e-05,-0.000596,-0.000689,0.000106,-0.000163,-0.000473,-0.000213,-0.000193,-0.000466,-0.000532,-0.000167,-0.000476,-0.000683,-0.000547,-0.000155,-0.000611,-3e-05,-0.000241,-0.000298,-0.000131,-0.000346,-5.3e-05,-0.000145,-0.000373,-0.00036,-0.000316,-0.000618,0.000266,-0.000602,-0.000562,-0.000164,-0.000154,-0.000256,-0.000635,-0.000831,-0.000382,-0.000255,-0.000194,0.000121,-5e-05,0.000174
-0.00012,-0.000181,2.2e-05,-2.6e-05,-1.3e-05,-0.000299,-1.6e-05,4e-05,0.000232,8.8e-05,-0.000252,-0.000119,-0.000187,-0.000293,1.9e-05,1.5e-05,7e-05,-0.000325,4.8e-05,-0.00023,7.1e-05,9.8e-05,0.000269,0.000168,-6.9e-05,-0.000476,-0.000276,4.4e-05,-0.000229,-0.000448,-0.000119,-0.000762,0.000221,0.000202,-0.000406,8.2e-05,-0.000362,0.000135,-0.000621,-0.000519,0.000199,-3.8e-05,-0.000149,-1e-05,-0.000457,-1.5e-05,4.8e-05,-0.000351,-0.000143,0.000256,0.000225,-0.000261,-0.000161,0.000279,-0.000419,-0.000127,-0.000422,-0.000498,-5.6e-05,-9.9e-05,0.000151,0.00046,0.00015,-0.000505,-0.000114,-2.2e-05,-0.000389,0.000265,2e-05,0.000136,-0.000218,-0.000757,0,5e-05,-8e-06,-0.000235,-0.00017,-0.000322,-0.000441,-0.000528,-0.000255,-0.000129,-0.000189,0.000142,-0.000115,0.000172,1.1e-05,0.000351,-0.000456,-0.000289,0.000209,-0.000185,-0.00031,0.000504,-0.000463,0.000278,0.000138,5.4e-05,0.000294,-6e-06,-5e-04,-0.000578,-0.000423,-0.000256,-0.000453,-0.000864,8.7e-05,-0.00028,-0.000373,-7.7e-05,-0.000553,-0.00016,-0.000563,0.000389,0.000229,0.00073,-0.00035,-3.4e-05,-0.000299,-0.000418,-0.000534
6.3e-05,-0.000126,-0.000137,-0.000151,-0.000213,5.6e-05,3.4e-05,2.1e-05,-0.000205,-5.1e-05,-0.00015,-0.000101,0.000393,-0.00028,-0.000179,-0.000101,0.000212,8.3e-05,5.9e-05,0.000176,-4e-04,-1e-05,-0.00011,8.7e-05,-0.000415,6.8e-05,0.000171,4.5e-05,-0.000331,-0.000574,0.000161,1.1e-05,6.7e-05,-0.000446,-0.000105,-0.000335,7e-06,0.000165,-0.001205,-0.001042,-0.000573,2.1e-05,-0.000403,0.000209,-0.00043,-0.000122,0.000271,0.000423,-5.8e-05,-0.000324,-0.000721,0.00013,-8.6e-05,-0.000453,-0.000237,-0.000699,4.2e-05,-0.000182,-0.000423,-0.000278,-0.000816,-8.5e-05,0.000152,-0.000386,-0.000473,-0.000115,-0.000217,-0.000312,-0.000285,2.4e-05,-0.000389,-0.000382,-0.000349,-0.000383,2.5e-05,-6e-05,0.000125,6.6e-05,-0.000196,5.9e-05,-0.00032,-5e-05,-0.00052,-0.000481,-0.00056,-0.000604,-0.000486,-0.000587,-8.8e-05,0.000155,-0.00011,-0.000189,-2e-05,-0.000472,-7.8e-05,0.000154,0.000319,0.000149,0.000314,-0.00028,-7.9e-05,-0.000306,9.4e-05,-0.000233,-7e-06,-0.00019,-0.000188,-0.000416,0.000139,0.000194,0.000252,0.00036,-0.00038,-0.000522,-0.000505,-0.000652,0.00016,-0.000557,-0.00079,-0.000379,-0.000541
0.000131,-0.000131,1.3e-05,2.5e-05,0.000154,-5.7e-05,-0.000104,-1.3e-05,0.000209,-3.2e-05,-4.6e-05,0.000139,0.000139,3.6e-05,5.6e-05,8.9e-05,0.000233,-0.000126,-0.000408,0.000232,-0.000189,-0.000242,-0.000112,-0.000166,0.000117,0.000107,0.000302,0.000178,-0.000344,2.6e-05,0.00031,-0.000424,-7e-05,-0.000345,-0.000135,0.000298,0.000103,0.000268,-5.7e-05,0.000983,0.00035,8.7e-05,5.9e-05,-3.6e-05,-0.00031,-0.000223,-0.000208,0.000165,1.5e-05,-0.000289,0.000277,5.4e-05,0.000414,-1.7e-05,-0.000585,-0.000209,-9.6e-05,0.000198,0.000226,-0.000123,0.000182,-0.00028,0.000163,0.000147,-0.000428,-0.000315,-0.000447,-0.000216,0.00051,-0.000458,9e-06,6e-05,-0.00023,-0.000257,0.000168,0.000256,-0.000224,-0.000219,-0.000126,-0.00021,0.000111,0.00019,0.000388,0.000328,6.4e-05,0.000489,-2.2e-05,8.9e-05,0.000306,-0.000104,-0.000122,6.9e-05,9.8e-05,1e-04,0.000294,-0.000151,-0.000133,-6e-06,-0.000209,5.5e-05,0.000415,0.000234,1e-04,-0.000361,4.2e-05,0.000212,0.000134,0.000526,0.000117,-1.1e-05,0.000124,-0.000167,-8.7e-05,1.2e-05,0.000421,-0.000176,0.000311,-0.000113,0,9.3e-05,4.3e-05
-0.000138,4.7e-05,-6.6e-05,-4.8e-05,-1.3e-05,5.1e-05,2.7e-05,-6e-05,-2.9e-05,-7e-05,0.000131,6.3e-05,-0.000323,-7.5e-05,-1.6e-05,-0.000114,-0.000248,-4.3e-05,0.000171,-0.000113,0.000165,-0.000107,-1e-04,-0.000165,-1.1e-05,-5.6e-05,9e-06,-8.8e-05,8.9e-05,5.2e-05,-0.000287,5.7e-05,0.000101,0.000202,8e-06,-9.2e-05,-0.000204,-4.4e-05,0.000175,0.000321,0.000247,-0.000355,-0.000144,0.000276,0.000141,-0.00024,-0.00032,-0.000354,9e-06,0.000311,-0.000264,-0.000303,0.000137,0.000354,-0.000122,4e-05,-0.000135,-0.000304,0.00025,0.000185,0.000452,0.000228,-1e-04,-0.000193,0.000393,-0.000187,-0.000126,-0.000179,-0.000253,-0.000293,-0.000528,9e-06,0.000149,-0.000238,1.3e-05,-7.4e-05,-0.000206,-0.000414,0.000412,2.5e-05,0.000256,-8.3e-05,0.000492,-0.000185,4e-06,0.000308,-0.000218,-0.00025,-9.3e-05,-0.000265,-7.8e-05,8.3e-05,-0.000336,0.000147,-0.000221,4.6e-05,-0.000248,-0.000295,-0.000155,0.000209,-0.000158,0.000185,-0.000255,-0.000123,3e-06,0.000181,-8e-06,-0.000156,-0.000219,0.000106,-2e-04,7.9e-05,0.000328,6.8e-05,-1.3e-05,-7.3e-05,-0.000133,-0.000351,-0.000125,-0.000137,0.000183
-2.5e-05,-5e-05,4e-06,3.1e-05,1.3e-05,-5e-06,3.3e-05,-0.000149,-9.6e-05,9e-06,2.4e-05,-4.8e-05,-0.000129,1.4e-05,-0.000125,1.1e-05,0.000101,0.000204,0.000181,4e-06,0.000229,0.000136,4.8e-05,-0.000124,-6.2e-05,-0.000151,-0.000222,-2.6e-05,-0.00061,-0.000171,-9.7e-05,0.000135,0.000144,0.000728,0.000264,-0.000319,0.00011,-2.3e-05,-0.000331,0.000142,-0.000255,-0.000255,0.000455,-0.000316,-7.6e-05,-9.1e-05,0.000162,1.3e-05,-0.000333,-7.7e-05,-0.000425,-0.000184,-0.000329,-0.000205,-0.000338,0.000178,-3.8e-05,0.000113,-0.000338,-0.000173,-0.000235,-0.000338,0.00027,1.2e-05,-0.000148,0.000423,-2.7e-05,4.6e-05,8.7e-05,0.000142,0.000184,0.000162,0.000356,0.000306,3.2e-05,-0.000303,0.000284,6.9e-05,0.000352,-4e-05,0.000131,2.3e-05,-0.000118,0.000105,3.9e-05,-0.000524,-0.000112,-7.4e-05,5.2e-05,-0.000261,-9e-05,-0.000205,-0.000102,0.000176,-4.3e-05,0.000202,0.000286,0.00018,-3.2e-05,-0.000271,0.000142,3.2e-05,-0.000113,0.000325,8e-06,-8.3e-05,-0.000355,-0.000134,0.000255,-0.000303,4.8e-05,-0.000227,-0.000287,-0.000163,-0.000191,-0.000119,0.000258,0.000372,0.000174,-0.000124,-5.1e-05
-2e-06,1e-05,-5.5e-05,-9e-06,6e-06,2.4e-05,2e-06,4.2e-05,-3.2e-05,0.000173,9.5e-05,0.000146,8.4e-05,-2.6e-05,-7.5e-05,-5.9e-05,-4.2e-05,-0.000172,-0.000184,-7.3e-05,-0.000179,-0.000105,-1.4e-05,0.000174,5.9e-05,0.000104,-1.6e-05,9e-06,0.000449,6.1e-05,6.7e-05,-0.000399,-0.000255,-0.000219,6e-06,-9e-06,1e-06,-0.000245,0.000157,-3.8e-05,-0.000177,8.4e-05,-0.000211,6.9e-05,-0.000131,9.8e-05,-3.4e-05,0.000121,-2.9e-05,-6.5e-05,2.5e-05,-0.000398,7.9e-05,-0.000111,0.000171,0.000341,0.000308,1.5e-05,0.000228,-6e-05,-0.000329,0,-0.000116,4.3e-05,0.000139,-0.000205,-4.4e-05,-0.000153,-0.000101,0,-5.4e-05,-3.1e-05,-3.8e-05,-7.2e-05,-0.000179,0.000111,-0.000386,-6.1e-05,-0.00035,-0.000248,-0.000302,-0.000164,-9.2e-05,0.000147,0.000266,-0.00031,0.000125,-0.000104,-5.5e-05,6.5e-05,5.4e-05,0.000103,0.000362,-0.000239,0.000204,-8e-06,-0.000112,-0.000134,4.6e-05,9.7e-05,-0.00051,-0.000356,-0.000303,-0.000217,-0.000114,-0.000165,-0.000178,0.000199,-0.000354,-9.4e-05,9.2e-05,1.9e-05,1.8e-05,0.000116,8.8e-05,0.000113,0.000121,-0.000169,-0.000105,-0.00013,8.9e-05
-1.2e-05,3.9e-05,-4.3e-05,2.2e-05,3.1e-05,8.7e-05,-1.8e-05,0.000105,-7.1e-05,-0.000119,-0.000113,-1e-04,6e-05,6.5e-05,-7.9e-05,-0.000106,5.3e-05,2.1e-05,8e-06,9.4e-05,-3.2e-05,-5.5e-05,0.00012,-3.3e-05,-9.5e-05,2.5e-05,-2.5e-05,0.000203,-1.9e-05,0.000176,0.00013,-4e-05,9.6e-05,-0.000244,-0.00014,0.000111,9.6e-05,0.000224,-1.5e-05,-0.000146,-8.3e-05,-0.000207,0.000247,-0.000195,-5e-05,-0.000177,3.5e-05,1.9e-05,-5e-05,0.00011,3.3e-05,0.00029,6e-06,-0.000126,2e-04,7.1e-05,-8.8e-05,5.5e-05,0.000119,0.000219,0.000295,0.000203,-0.00015,-9e-06,0.000171,0,0.000396,-7.8e-05,-7e-05,-1.3e-05,-0.000114,0.000206,-0.000187,-7e-05,7.2e-05,7.7e-05,0.00027,-1.2e-05,0.000104,7.1e-05,7.9e-05,0.000164,-3e-06,6.9e-05,-9.9e-05,0.000149,4.9e-05,-0.000157,6.8e-05,0.000206,-7.7e-05,0.000194,-0.000139,-0.000189,-0.000305,-2.9e-05,-0.000315,-9.6e-05,-0.000111,1e-04,8e-06,-0.00047,-1.4e-05,-7.5e-05,-0.000244,0.000152,0.000263,-0.000103,-8e-06,0.000299,8.1e-05,8.7e-05,-0.000141,0.000181,3.2e-05,-0.000159,-0.000209,-0.000259,-3.4e-05,1.8e-05,1.6e-05
1.5e-05,-4e-06,4.7e-05,1.7e-05,5.7e-05,-0.000134,-2.1e-05,-2.4e-05,8e-06,4.9e-05,7.3e-05,0.000173,6.5e-05,-6e-06,0.000114,0.000113,-0.000119,-4e-06,8e-06,2.1e-05,7.2e-05,9.3e-05,8e-06,-2.1e-05,0.000141,6.4e-05,0.000128,-1.5e-05,-0.000214,-2e-05,0.000178,9e-05,-0.000124,0.000102,3.5e-05,0.000124,-0.000122,-0.00033,0.000145,5.4e-05,0.000202,2e-06,-3.5e-05,0.000125,-9.1e-05,1e-04,0.000228,-3e-06,2e-05,-8.1e-05,0.000138,-3e-05,0.000215,2.8e-05,-0.00026,5.1e-05,0.000153,0.000176,3.8e-05,-0.000147,4.3e-05,-0.000133,0.000118,4e-06,-0.000144,0.000275,-6.1e-05,-0.000111,-2.7e-05,-0.000147,0.000166,-1.5e-05,-0.00011,0.000153,8.3e-05,-4.8e-05,-0.000214,4.7e-05,-0.000172,0.000143,1.7e-05,-4e-05,0.000181,-0.000115,-4e-06,0.00012,-0.000169,0.000122,0.000119,-6.7e-05,-7.3e-05,-0.000259,-0.000146,3.5e-05,0.000162,-0.000128,1e-05,-8.3e-05,-0.000168,-2.3e-05,-6e-06,1.4e-05,0.000125,1.3e-05,1.3e-05,-2.7e-05,8.5e-05,5.6e-05,2e-06,-3.1e-05,-7.5e-05,0.000109,0.000194,0.000189,6.6e-05,0.000163,-1.7e-05,2e-05,-5.1e-05,-3.4e-05,1.8e-05
-5.1e-05,-1.8e-05,5.3e-05,2.3e-05,-2.1e-05,7e-06,6.6e-05,2.5e-05,-1.1e-05,-2.1e-05,2.3e-05,-0.000164,-9.8e-05,1.7e-05,-8e-06,-5.3e-05,0.00011,0.000102,0.00016,-0.000139,-8.8e-05,7.8e-05,-8.5e-05,4.4e-05,5.2e-05,6e-06,-2.2e-05,-0.000105,-0.000169,1e-06,2.4e-05,0.000112,-2.5e-05,6.6e-05,3.1e-05,-0.000122,7.2e-05,0.000159,-3.4e-05,-4.6e-05,-9.2e-05,0.00015,-4.2e-05,3.6e-05,6.6e-05,0.000261,7.2e-05,3e-05,4e-06,-3.1e-05,-6.7e-05,-3.4e-05,-6e-05,-5.9e-05,9.9e-05,0.00012,-1.3e-05,-0.000116,-1e-05,-2e-05,-5.9e-05,0.000178,-1.3e-05,-7.9e-05,-1.6e-05,-0.000122,0.000126,0.000135,-1.9e-05,0.000118,0.000155,-8.1e-05,-0.000161,-7.2e-05,0.000106,3.1e-05,2e-04,0.000121,0.000242,-9e-06,-0.000121,-0.000129,-9.6e-05,-0.000129,-3.2e-05,7.1e-05,2.3e-05,-1.6e-05,-6.5e-05,6e-06,5.3e-05,-0.000156,-2.3e-05,-2.4e-05,-5.5e-05,5.7e-05,8.7e-05,6.2e-05,2.1e-05,-8.4e-05,-2.9e-05,6.6e-05,-4.7e-05,0.000149,-3.5e-05,-4e-05,2.1e-05,-3.9e-05,4.6e-05,-3.6e-05,-5.1e-05,-4.5e-05,-0.000143,0.000133,-3.7e-05,-3.3e-05,-0.000144,3.2e-05,2.2e-05,0.000319,0.000101
2.2e-05,-6.3e-05,-1.1e-05,-4.9e-05,-3.4e-05,4.2e-05,-3.4e-05,4e-06,3.5e-05,-4.3e-05,4e-05,6.5e-05,6.4e-05,2.9e-05,0.000116,8.5e-05,-6.9e-05,-5.1e-05,-0.000129,2.5e-05,9e-06,-2.5e-05,8e-06,-2e-06,-4.4e-05,-8e-06,0.000109,-2.8e-05,0.000106,-0.000156,-7.6e-05,-6.3e-05,2.6e-05,4e-06,-4.2e-05,2.5e-05,7.4e-05,9.6e-05,7.5e-05,-0.000118,-2.1e-05,-5.8e-05,-1.5e-05,-0.000158,-0.00016,-0.000177,0.000255,-1.2e-05,4.4e-05,-3.7e-05,-2.1e-05,0.000138,-0.000116,0.000114,-4.8e-05,-6.1e-05,-0.000205,2.6e-05,3.7e-05,-3.8e-05,2.1e-05,-0.000233,-5.5e-05,2.7e-05,3.5e-05,6e-06,-0.000168,9.6e-05,5.9e-05,3e-05,-0.000183,0.000173,3.3e-05,-0.000176,8.4e-05,-0.000118,9.2e-05,-8.2e-05,-0.000338,2.7e-05,7.9e-05,-0.000252,-1.5e-05,-8.6e-05,-7.6e-05,-2.1e-05,6.7e-05,7.3e-05,-5.8e-05,-4.9e-05,3.2e-05,1.1e-05,-9.6e-05,-0.000152,-0.000109,8.8e-05,-2.9e-05,-3.4e-05,1.1e-05,1e-05,5.3e-05,3.5e-05,-9.5e-05,0.000106,6.9e-05,9e-06,-4e-05,1e-05,2.8e-05,7e-06,4.2e-05,-0.000191,0.000108,-0.000187,-7.6e-05,-6.8e-05,-8e-06,3.1e-05,1.6e-05,-0.000114,-0.000124
2e-06,4.7e-05,1.8e-05,1.4e-05,1.6e-05,-2.5e-05,-8e-06,-3.4e-05,-1.4e-05,-6e-06,-2.9e-05,-7e-06,-1.2e-05,-3.6e-05,-7.6e-05,-1.5e-05,-3.4e-05,2.6e-05,-1.9e-05,2.4e-05,-4e-06,-6.4e-05,9e-06,-3.5e-05,-6e-06,-4e-05,-0.000149,-3.4e-05,0.000177,6.4e-05,-7.9e-05,-0.000128,-4.2e-05,9.7e-05,-6.6e-05,-4.3e-05,6e-06,0.000136,1.8e-05,6.4e-05,-7.8e-05,-9.9e-05,-9.6e-05,5.1e-05,5.3e-05,-5.8e-05,-2.1e-05,-5.3e-05,-5.7e-05,-6.2e-05,-0.000168,-1e-06,-6e-05,-7.6e-05,0,-0.00014,-3.6e-05,-5.2e-05,-4.2e-05,1.1e-05,2.3e-05,-5.9e-05,0.000129,3.2e-05,7.2e-05,-3.2e-05,-5.2e-05,-2.7e-05,3.2e-05,8.1e-05,3e-06,-5.2e-05,-1.2e-05,-3e-06,-1.5e-05,-6.9e-05,-0.00011,2.9e-05,3.9e-05,-7.1e-05,-0.000114,-5.3e-05,1.2e-05,6.6e-05,0.000119,9e-06,5.1e-05,-3.9e-05,-8e-05,-6.5e-05,-3.2e-05,-5e-06,-5e-05,6.7e-05,1.1e-05,4e-06,8.8e-05,-0.000121,-6.4e-05,1.7e-05,4.3e-05,-0.000216,-5.9e-05,-2.4e-05,-1.7e-05,2.8e-05,-0.000135,-0.000109,-9.6e-05,-8.9e-05,-4.8e-05,7.6e-05,-6.9e-05,-6.3e-05,7e-06,8e-06,1.8e-05,-1.8e-05,2.4e-05,1.4e-05,9e-06
1.1e-05,-1.4e-05,1e-06,-6e-06,-1.6e-05,1.8e-05,-7e-06,-2.8e-05,-4.1e-05,-1.9e-05,-9e-06,-1.3e-05,-3.6e-05,5.5e-05,-6e-05,1.3e-05,4.4e-05,-4e-06,1.1e-05,1.4e-05,1.6e-05,1.9e-05,3.3e-05,1.6e-05,3.6e-05,-7.9e-05,1.7e-05,4.8e-05,-6.1e-05,3.8e-05,-5.3e-05,2.1e-05,7.9e-05,-2.1e-05,6.6e-05,4.3e-05,2.8e-05,3.8e-05,2.1e-05,-2.6e-05,-5.1e-05,5.1e-05,1.1e-05,-0.000189,3e-06,3.8e-05,-9e-06,-2.5e-05,-2.3e-05,-7e-06,-1.4e-05,4.7e-05,1.3e-05,4.7e-05,7.9e-05,3e-06,-0.00011,2.9e-05,-6.8e-05,5.4e-05,1.8e-05,3.2e-05,-7.7e-05,-2.5e-05,-8.3e-05,-6.2e-05,-7e-06,-2e-05,-9e-06,4.6e-05,0,-0.000113,9e-06,0.000109,3.2e-05,4.5e-05,2e-06,-2.3e-05,1.8e-05,-4e-06,4.5e-05,7.1e-05,3.3e-05,1.7e-05,-4.2e-05,1.3e-05,7.1e-05,4e-06,3.6e-05,2e-05,-3.5e-05,-5e-06,0.000101,1.4e-05,5e-05,-1.4e-05,3e-05,7.6e-05,2.9e-05,-8e-06,-0.000123,7.1e-05,-1.6e-05,3e-05,2.2e-05,-4.5e-05,5.4e-05,1.6e-05,2.3e-05,-2.5e-05,1.8e-05,1.9e-05,2e-06,1.1e-05,0.00011,3.5e-05,-9.7e-05,3.4e-05,1.1e-05,5e-06,-3.4e-05
2e-05,3.4e-05,-1e-06,-3e-06,-1e-06,-4e-06,-1.7e-05,7e-06,3e-05,-1.5e-05,-1.9e-05,-2.7e-05,1.9e-05,-1.4e-05,-2e-06,4e-06,-4e-05,-6e-06,-1.5e-05,-2.6e-05,4.6e-05,-5.5e-05,3.5e-05,6.2e-05,2.2e-05,3.4e-05,3e-05,-1.2e-05,-4.2e-05,-1.8e-05,-5.1e-05,2.9e-05,-1.9e-05,-5.1e-05,5.2e-05,2.7e-05,-8e-06,-8.3e-05,-2.3e-05,-2.8e-05,1.6e-05,3.7e-05,-3e-05,4.8e-05,-6.7e-05,-2.2e-05,-7.3e-05,-1e-06,-2.8e-05,-3.2e-05,6.5e-05,-7.7e-05,-1.2e-05,-4e-05,-2.6e-05,-2.5e-05,2.3e-05,1e-05,-0.000101,-2.2e-05,-3.6e-05,8.7e-05,-2.4e-05,-2.9e-05,-4.5e-05,5.8e-05,2.6e-05,6e-06,6e-06,-6.4e-05,7.2e-05,7.5e-05,-1e-05,1.8e-05,3.8e-05,2e-05,-1.2e-05,-7e-06,4.7e-05,1.4e-05,3.5e-05,7.2e-05,-1e-05,-3.9e-05,2.4e-05,-9.4e-05,-0.000122,-1.5e-05,-6.6e-05,2.3e-05,-1.6e-05,1e-05,-4.4e-05,-4e-05,-4e-05,-5e-06,-5.4e-05,6.4e-05,-6e-06,-5.8e-05,4.4e-05,-7e-06,7.7e-05,8.2e-05,1e-05,-1.1e-05,-1.3e-05,-4e-06,7e-06,4e-06,3.8e-05,-3e-06,8e-06,-2.8e-05,9.7e-05,-2.7e-05,8.6e-05,5.2e-05,1e-06,-6.9e-05,-2.2e-05
-9e-06,-2.2e-05,-2e-05,-8e-06,-9e-06,1.3e-05,1.9e-05,1.4e-05,2.3e-05,1.8e-05,1.5e-05,-1e-05,-3.9e-05,-2.7e-05,2.6e-05,-9e-06,3.2e-05,-1.6e-05,3.2e-05,-7e-06,-2.7e-05,1.1e-05,2.3e-05,-2.3e-05,-2e-05,1e-05,-3.5e-05,5e-06,-2.4e-05,-6.3e-05,3.8e-05,2.8e-05,-3e-06,7.6e-05,-1.7e-05,2.7e-05,3.3e-05,-3.1e-05,-8e-06,3.9e-05,-2.7e-05,-3.8e-05,-5.6e-05,-7.2e-05,-4e-06,3.9e-05,-4e-05,-4.4e-05,-2.4e-05,2e-06,2.4e-05,-1.6e-05,-2.7e-05,1.3e-05,2e-05,-3.7e-05,1.7e-05,-1.2e-05,2.4e-05,3.1e-05,-2.8e-05,3e-05,-8e-06,-3e-06,-1.3e-05,2.8e-05,1e-05,1.8e-05,4.4e-05,3.3e-05,6.6e-05,1.3e-05,3.6e-05,-1.4e-05,-4e-05,3.7e-05,-6e-06,3.8e-05,6e-06,-5.6e-05,-1.4e-05,-4.2e-05,-1.7e-05,-3.1e-05,8e-06,-1e-06,-2.6e-05,-1.5e-05,-4.5e-05,-9e-06,3.8e-05,4.1e-05,4.6e-05,-5.3e-05,6e-06,-1e-05,-8e-06,-4e-05,-5e-06,5.2e-05,2e-06,-1.7e-05,2.6e-05,1.4e-05,-2e-06,1.9e-05,1.8e-05,-9e-06,-2.9e-05,4.7e-05,2e-05,4e-06,3.2e-05,-5.5e-05,4.1e-05,-5e-06,1.5e-05,-2.3e-05,1.4e-05,-4.1e-05,-5e-06
-7e-06,-1.2e-05,-4e-06,1.2e-05,6e-06,-5e-06,0,1e-06,8e-06,1.2e-05,-1.9e-05,1.7e-05,-4e-06,-9e-06,-2.1e-05,-1.1e-05,-7e-06,1.3e-05,-8e-06,-2.8e-05,-7e-06,1.8e-05,5e-06,-2.6e-05,-4e-06,-8e-06,2.8e-05,-1.5e-05,-3.8e-05,3.2e-05,-2e-05,-8e-06,1.2e-05,-1.1e-05,2.3e-05,-9e-06,-7e-06,1.2e-05,2.5e-05,2.8e-05,5.4e-05,-1.6e-05,1e-06,6.3e-05,-2e-05,2.2e-05,5.8e-05,-1e-06,-1e-06,3.3e-05,-6e-06,4.3e-05,9.3e-05,6e-06,-5.1e-05,-2.8e-05,7e-06,-1.7e-05,3.3e-05,-2.6e-05,3e-05,-4e-06,-3.5e-05,-1.7e-05,-6e-06,-4.9e-05,2.5e-05,-5.1e-05,-1.4e-05,-1.2e-05,-5.9e-05,-2.6e-05,1.8e-05,-2e-06,-4.7e-05,2.1e-05,4e-05,-1.6e-05,-1.5e-05,2.2e-05,-2e-06,5.3e-05,-4.1e-05,-1.7e-05,2e-05,7e-06,4.8e-05,6.3e-05,3.8e-05,-3.5e-05,1.5e-05,4.8e-05,-6e-06,0,2.9e-05,3.8e-05,-3.3e-05,1.8e-05,-2e-06,1.2e-05,-3.2e-05,-4.4e-05,1.1e-05,2.9e-05,2.2e-05,1e-06,3.4e-05,-2e-06,3.3e-05,-8e-06,-4e-05,-2.8e-05,-2.8e-05,8e-06,-3e-06,-3e-06,-2.2e-05,0,9e-06,2.8e-05,-2e-05
1.3e-05,7e-06,7e-06,-1.1e-05,7e-06,-8e-06,8e-06,0,-1.4e-05,-1.2e-05,-1.7e-05,-7e-06,1.7e-05,1.2e-05,1.2e-05,-3e-06,-4e-06,1.3e-05,-3e-05,-3e-06,-7e-06,-8e-06,-2.1e-05,2.5e-05,-4e-06,-1.2e-05,-2.8e-05,-7e-06,1.1e-05,5e-06,4e-05,-4.1e-05,-1.8e-05,-3.9e-05,-1.7e-05,-7e-06,-7e-06,-2.1e-05,1.7e-05,-1.5e-05,2.4e-05,6e-06,1e-06,2.6e-05,0,-1e-05,-9e-06,-1.6e-05,-1.2e-05,-1.7e-05,2.1e-05,-2.5e-05,2.7e-05,-5e-06,3.1e-05,-5.1e-05,-3.9e-05,3.7e-05,1.5e-05,0,-1e-06,3.8e-05,6.6e-05,3.6e-05,6e-06,3.3e-05,-6e-06,-1.1e-05,-2.5e-05,3.6e-05,-3.1e-05,2.4e-05,1.6e-05,-2.2e-05,6e-06,6e-06,-2.8e-05,-1.6e-05,7.3e-05,-1e-06,9e-06,-2.1e-05,-1.4e-05,8e-06,-2.4e-05,3.8e-05,-1e-06,-3.7e-05,1.4e-05,-1.2e-05,-3.5e-05,-2.3e-05,6e-06,2.1e-05,-3.5e-05,-1.5e-05,-7e-06,-1.2e-05,-1e-06,-1.6e-05,5e-06,5e-06,-3.4e-05,9e-06,6e-06,-2.3e-05,2e-05,5e-06,-3.9e-05,-2.4e-05,5.6e-05,2.4e-05,-1e-06,-4e-05,-2.7e-05,-1.7e-05,4.2e-05,-3.4e-05,-1e-06,6.8e-05,1.5e-05
-1.1e-05,0,6e-06,3e-06,-5e-06,2.4e-05,-2e-06,-2e-06,7e-06,-7e-06,1.6e-05,9e-06,2e-06,-5e-06,1e-05,-2e-06,1e-06,1e-06,1e-05,-2e-06,1e-06,1.5e-05,-3e-06,-4e-06,1.8e-05,1e-06,1e-05,0,7.1e-05,-2.7e-05,-4e-06,2.9e-05,3e-06,2.1e-05,-1e-05,-9e-06,-2.2e-05,2.8e-05,-1.3e-05,1.9e-05,2.3e-05,2e-06,2.8e-05,-7e-06,-1.9e-05,1e-06,-2.8e-05,5e-06,1.9e-05,-4e-06,-2.9e-05,5e-05,1e-05,9e-06,2e-06,-1.2e-05,1.9e-05,-1.7e-05,7e-06,3e-06,-2.9e-05,-5.1e-05,2.7e-05,-1.2e-05,1e-06,1e-06,5e-06,3e-06,8e-06,2e-06,2.4e-05,-9e-06,-1e-05,-8e-06,-4e-06,-2.3e-05,2.5e-05,1.1e-05,1.4e-05,5e-06,-1e-05,-9e-06,-2e-05,1.1e-05,-8e-06,2.2e-05,1.8e-05,-7e-06,4e-06,-5e-06,1.2e-05,-1e-05,8e-06,6e-06,2.2e-05,-2.5e-05,2.3e-05,-2.9e-05,4e-06,-1.8e-05,-1.5e-05,6e-06,-2e-06,6e-06,1.1e-05,0,-1.8e-05,2e-05,8e-06,8e-06,-4.4e-05,-2.9e-05,1.4e-05,4e-06,1e-06,2.2e-05,2e-06,-2e-06,-3e-06,-3.1e-05,-2e-06
8e-06,9e-06,3e-06,2e-06,-5e-06,-1.7e-05,-7e-06,7e-06,4e-06,2e-06,-7e-06,-1.5e-05,1.8e-05,-5e-06,-1e-06,2e-06,5e-06,-5e-06,8e-06,5e-06,4e-06,4e-06,1.6e-05,2e-06,-6e-06,1e-06,-1e-06,0,-3.2e-05,3.5e-05,-2.4e-05,-5e-06,0,-2.1e-05,1.5e-05,-1.6e-05,-1.2e-05,-2.9e-05,1.4e-05,-1e-05,-4.3e-05,1e-06,2.2e-05,2.8e-05,1.7e-05,-1.4e-05,-1.4e-05,5e-06,0,8e-06,-4e-06,1.7e-05,1.3e-05,-7e-06,-1e-05,2e-06,3e-06,5e-06,-2.9e-05,2e-06,1.3e-05,1.7e-05,-2e-05,-3e-06,-2e-06,-1.9e-05,-3.3e-05,-3e-06,2e-06,-8e-06,-8e-06,-6e-06,7e-06,2.2e-05,1e-05,-3e-06,-9e-06,-7e-06,-3.3e-05,3e-06,1.4e-05,1.4e-05,-9e-06,-8e-06,-8e-06,1e-06,-9e-06,1.5e-05,8e-06,4e-06,1.3e-05,0,1.1e-05,-1.5e-05,0,6e-06,1.4e-05,2.5e-05,-8e-06,2.1e-05,-5e-06,4e-06,-2.9e-05,2.7e-05,-6e-06,1.6e-05,-1.2e-05,-7e-06,1.6e-05,-1.7e-05,1.6e-05,1e-05,-4e-06,-1.2e-05,8e-06,-1.3e-05,-8e-06,4.7e-05,4e-06,-3e-06,5e-06
-3e-06,-1e-06,-1e-06,7e-06,6e-06,-1e-05,1e-06,-5e-06,4e-06,-2e-06,-2e-06,1.4e-05,-4e-06,-6e-06,-1e-05,-7e-06,0,0,4e-06,-1e-05,-1.3e-05,-4e-06,1e-06,-1e-06,-8e-06,-9e-06,4e-06,1e-06,-4e-05,-5e-06,-1.7e-05,-2.6e-05,-1.2e-05,-4e-06,1.8e-05,5e-06,3e-06,3.2e-05,0,4e-06,-9e-06,8e-06,6e-06,-1.7e-05,-4e-06,-8e-06,-3.1e-05,5e-06,-1.2e-05,-8e-06,-2e-06,-3.1e-05,3e-06,-5e-06,1.2e-05,1.8e-05,1e-06,6e-06,5e-06,2e-06,1e-05,1e-06,-2e-06,6e-06,-1.1e-05,2e-05,4.8e-05,9e-06,-4e-06,4e-06,-6e-06,8e-06,-2.5e-05,7e-06,9e-06,2e-05,2e-06,-7e-06,-4e-06,-6e-06,-2e-06,7e-06,4e-06,-3e-06,-1.5e-05,-8e-06,-4.3e-05,3e-06,6e-06,1.2e-05,-1.2e-05,-1.1e-05,-2.9e-05,1.9e-05,-2.1e-05,5e-06,8e-06,-5e-06,-4e-06,5e-06,1.6e-05,-2.3e-05,1e-05,-1e-06,1e-06,-9e-06,-9e-06,-5e-06,-2.6e-05,-1e-06,-1e-05,1.7e-05,-4e-06,2.2e-05,-7e-06,0,-3e-06,-1.5e-05,1e-06,-8e-06,0
-4e-06,-2e-06,-2e-06,-6e-06,-1e-06,1.1e-05,-2e-06,-1.3e-05,0,1.4e-05,-1e-06,-6e-06,-8e-06,8e-06,-1.1e-05,2e-06,0,-2e-06,1e-06,5e-06,7e-06,7e-06,-1.2e-05,6e-06,2e-06,2.7e-05,2e-06,0,-1e-05,-7e-06,2.9e-05,4e-06,7e-06,1.4e-05,-1.2e-05,2.6e-05,7e-06,2e-06,9e-06,8e-06,-1.8e-05,-9e-06,1e-05,7e-06,1e-06,1.2e-05,-1.7e-05,2e-06,-1e-05,1.4e-05,1.5e-05,-2e-06,-4e-06,1.2e-05,-1.5e-05,-7e-06,2.5e-05,-4e-06,3e-06,-6e-06,-1e-06,1.7e-05,-9e-06,-5e-06,9e-06,-1.1e-05,8e-06,3e-06,3e-06,-7e-06,6e-06,0,5e-06,-1e-06,-1.5e-05,-2e-06,1.7e-05,7e-06,-3e-06,1e-06,-1.4e-05,-8e-06,-3e-06,0,1.9e-05,-2.4e-05,3.4e-05,-1.4e-05,1.5e-05,3e-06,8e-06,-8e-06,1e-06,2.4e-05,1.9e-05,2e-06,-1.1e-05,-1.9e-05,-3e-06,-1.7e-05,-2e-06,-2.4e-05,1.8e-05,-1e-05,-7e-06,-3e-06,2e-05,6e-06,2.2e-05,1.8e-05,6e-06,-2e-06,-2e-06,5e-06,-4e-06,-4e-06,-3.5e-05,-2.6e-05,0,-2.8e-05,-3e-06
4e-06,-5e-06,-2e-06,3e-06,-1e-06,-4e-06,5e-06,-5e-06,1e-06,1e-06,-5e-06,-3e-06,1e-06,-2e-06,-4e-06,-3e-06,-1e-05,5e-06,-1.6e-05,0,3e-06,-1.6e-05,0,-6e-06,9e-06,6e-06,-5e-06,0,4e-05,-1.4e-05,-6e-06,-9e-06,1e-06,-1e-05,2e-06,-1.5e-05,-1e-06,1.6e-05,-3e-06,-1.7e-05,1.3e-05,0,9e-06,-2.2e-05,7e-06,1.2e-05,-1.7e-05,4e-06,-5e-06,-6e-06,7e-06,-1.3e-05,-2.4e-05,-6e-06,8e-06,1.1e-05,-1.2e-05,3e-06,2.3e-05,0,-1e-05,1e-05,1.6e-05,-1.4e-05,3e-06,-2e-06,-1.4e-05,-1e-05,6e-06,2.3e-05,-1e-05,4e-06,-2e-05,-1e-05,-1.7e-05,3e-06,-2.3e-05,-3e-06,2.6e-05,2e-06,1.5e-05,-1.9e-05,1e-06,-3e-06,-2e-06,-2e-06,1.2e-05,-3e-06,1.5e-05,-7e-06,-1.4e-05,-3e-06,-1.5e-05,-9e-06,1e-05,3e-06,-1.6e-05,1.7e-05,0,3e-06,-1.4e-05,2.5e-05,1e-06,-2.2e-05,0,6e-06,2e-06,1e-05,-9e-06,5e-06,-1.2e-05,-5e-06,9e-06,9e-06,-1.9e-05,1.3e-05,8e-06,2.2e-05,-1e-06,2e-06,1e-05
-5e-06,0,-4e-06,0,-4e-06,1e-06,3e-06,1e-05,3e-06,-2e-06,1.1e-05,8e-06,-1e-05,-1e-06,1.1e-05,3e-06,1.8e-05,-3e-06,-1e-06,1e-06,-2e-06,-2e-06,1e-06,-3e-06,-5e-06,-7e-06,3e-06,-3e-06,-1e-06,1.2e-05,1.9e-05,1e-05,0,-2.2e-05,3e-06,-5e-06,-4e-06,-2.5e-05,5e-06,-7e-06,-3e-06,-1e-06,5e-06,2e-05,-1e-05,-1e-06,2e-06,-1.1e-05,1e-06,-8e-06,7e-06,1.1e-05,-4e-06,1e-05,-6e-06,2.6e-05,1e-06,-5e-06,-1.1e-05,0,2e-06,-1.8e-05,-8e-06,1.8e-05,-7e-06,1.5e-05,-4e-06,4e-06,4e-06,-4e-06,1.3e-05,-6e-06,-7e-06,-1.6e-05,-1.3e-05,9e-06,2e-05,-5e-06,-5.3e-05,-1.2e-05,-1.2e-05,-9e-06,1.1e-05,1.1e-05,1e-06,2e-06,-1e-05,1.6e-05,-1.9e-05,-1e-05,8e-06,8e-06,3e-06,-1.7e-05,-2.2e-05,-1e-05,1.5e-05,1e-06,6e-06,1.4e-05,1e-05,-9e-06,2e-06,-7e-06,0,8e-06,8e-06,-1e-05,-5e-06,-3e-06,5e-06,-5e-06,-1.1e-05,0,-7e-06,-7e-06,-8e-06,8e-06,-1e-06,1.6e-05,-7e-06
1e-06,2e-06,-2e-06,2e-06,3e-06,-2e-06,0,9e-06,1e-06,-6e-06,6e-06,1e-06,-4e-06,0,4e-06,3e-06,-2e-05,-2e-06,1.3e-05,-1e-06,-4e-06,5e-06,-4e-06,2e-06,-2e-06,4e-06,0,-1e-06,-1.7e-05,2e-06,4e-06,1e-06,5e-06,1.4e-05,-9e-06,3e-06,0,-8e-06,-4e-06,5e-06,2e-05,-3e-06,-1.3e-05,-7e-06,2e-06,-7e-06,-4e-06,6e-06,5e-06,5e-06,-1.4e-05,8e-06,-1e-05,-6e-06,6e-06,1e-05,-7e-06,7e-06,-1.5e-05,-2e-06,7e-06,-1e-06,-2.4e-05,-7e-06,-1e-06,-3e-06,1.3e-05,1e-06,2e-06,8e-06,-3e-06,0,0,0,-9e-06,-1.2e-05,-1.1e-05,5e-06,6e-06,8e-06,5e-06,-1.2e-05,6e-06,-7e-06,-8e-06,0,-5e-06,-1.6e-05,5e-06,-2e-06,-2e-06,-3e-06,-1e-06,0,1e-05,1e-06,-2.3e-05,-3e-06,-1e-06,-4e-06,-1.1e-05,-8e-06,-5e-06,-4e-06,0,-1e-05,-5e-06,-1e-06,1e-05,-5e-06,-3e-06,5e-06,7e-06,1.1e-05,1.2e-05,-2e-06,-1.8e-05,-9e-06,1e-06,1.5e-05,6e-06
4e-06,3e-06,1e-06,-4e-06,1e-06,3e-06,0,-1e-06,2e-06,0,2e-06,-3e-06,7e-06,0,1e-06,-1e-06,1.4e-05,3e-06,-2e-06,4e-06,-1e-06,-3e-06,2e-06,0,-1e-06,-6e-06,-1e-06,1e-06,7e-06,1e-06,-8e-06,-1.4e-05,-2e-06,-1.4e-05,3e-06,7e-06,1e-05,-1e-06,6e-06,-6e-06,2e-06,-7e-06,-1.4e-05,-2e-06,-8e-06,-1e-06,1.1e-05,-1e-06,3e-06,-5e-06,-1e-06,4e-06,1e-06,-1e-06,2e-06,1e-05,-5e-06,-4e-06,-2e-06,1e-06,-6e-06,-1.7e-05,2e-06,3e-06,-4e-06,-8e-06,-1.8e-05,-7e-06,-1e-05,0,-2.6e-05,1.1e-05,-6e-06,1.7e-05,-3e-06,-7e-06,6e-06,-4e-06,1.4e-05,-2e-06,-3e-06,1.1e-05,-3e-06,4e-06,-4e-06,1.5e-05,-1.3e-05,1.1e-05,2e-06,-6e-06,-1e-06,-5e-06,1.2e-05,8e-06,2e-06,6e-06,2e-06,0,-4e-06,-1.2e-05,4e-06,-9e-06,-1.2e-05,-9e-06,6e-06,1e-06,-7e-06,3e-06,-1.2e-05,0,4e-06,-4e-06,-4e-06,1e-05,2e-06,-4e-06,2.2e-05,-5e-06,1e-06,-2e-06,1e-06
-7e-06,1e-06,3e-06,3e-06,-2e-06,2e-06,-3e-06,-2e-06,-2e-06,-4e-06,-2e-06,-1e-06,-3e-06,5e-06,0,-3e-06,-3e-06,-1e-06,6e-06,1e-06,9e-06,1.3e-05,6e-06,-3e-06,1e-06,-6e-06,-1e-06,2e-06,-1.9e-05,-7e-06,-1.7e-05,3e-06,0,-8e-06,-3e-06,-1.5e-05,5e-06,2e-06,4e-06,-4e-06,-1.5e-05,1.1e-05,0,1e-06,-1e-06,0,-8e-06,-3e-06,0,1e-06,-5e-06,1.4e-05,-4e-06,2e-06,-9e-06,0,-5e-06,6e-06,-6e-06,-3e-06,-7e-06,1.5e-05,1.2e-05,-1e-06,1.1e-05,7e-06,-1.1e-05,5e-06,5e-06,-7e-06,6e-06,-1e-05,1e-06,-3e-06,4e-06,1.2e-05,6e-06,-1e-06,8e-06,-2e-06,1e-06,1.6e-05,7e-06,0,-2e-06,1e-06,7e-06,2e-06,-1.7e-05,-1e-06,-4e-06,8e-06,-1.2e-05,-1.1e-05,-1.9e-05,-1e-06,1.7e-05,-2e-06,-2e-06,6e-06,6e-06,1.4e-05,-2e-06,-1.3e-05,2e-06,8e-06,-1.1e-05,-8e-06,6e-06,-2e-06,-1.7e-05,3e-06,4e-06,1e-05,5e-06,-2e-06,6e-06,-4e-06,-1e-06,-6e-06,-2e-06
6e-06,-2e-06,0,-1e-06,-2e-06,-6e-06,-1e-06,-5e-06,-2e-06,4e-06,0,1e-06,5e-06,-3e-06,-5e-06,-3e-06,-2e-06,-1e-06,-5e-06,-5e-06,-3e-06,-4e-06,1e-06,3e-06,1e-06,5e-06,-5e-06,1e-06,9e-06,3e-06,3e-06,-1e-06,-1e-06,1.1e-05,3e-06,7e-06,-3e-06,-2e-06,-3e-06,1.1e-05,-1.1e-05,8e-06,-8e-06,-6e-06,-5e-06,0,1.2e-05,-2e-06,-2e-06,3e-06,3e-06,-1.5e-05,-1e-06,-3e-06,5e-06,9e-06,1.1e-05,-6e-06,1e-05,1e-06,1e-05,3e-06,-1e-06,-2e-06,4e-06,-9e-06,8e-06,3e-06,3e-06,8e-06,2e-05,-1e-06,1e-06,-8e-06,7e-06,4e-06,-7e-06,5e-06,-5e-06,2e-06,0,-8e-06,1e-06,4e-06,2e-06,5e-06,1.4e-05,-7e-06,-3e-06,0,5e-06,9e-06,3e-06,-8e-06,1.6e-05,-1e-06,-1e-06,-2e-06,2e-06,7e-06,-1e-06,-5e-06,1.3e-05,-7e-06,5e-06,0,3e-06,-1e-06,0,1e-06,1.8e-05,2e-06,-1e-05,-1e-06,-5e-06,4e-06,-5e-06,1e-05,-1e-06,-1.3e-05,1e-06
-3e-06,-2e-06,0,1e-06,1e-06,7e-06,0,-7e-06,-1e-06,3e-06,6e-06,0,0,0,-3e-06,-2e-06,2e-06,2e-06,2e-06,0,-2e-06,-9e-06,-5e-06,1e-06,-1e-06,6e-06,3e-06,1e-06,5e-06,4e-06,-3e-06,-2e-06,-4e-06,-4e-06,-3e-06,7e-06,-3e-06,2.1e-05,-3e-06,-6e-06,-6e-06,-9e-06,-7e-06,3e-06,-1e-06,1e-06,-5e-06,3e-06,-3e-06,-6e-06,5e-06,-1e-05,1.7e-05,2e-06,-1e-06,2e-06,-5e-06,-2e-06,4e-06,-1e-06,4e-06,2e-06,5e-06,-5e-06,-1e-06,2e-06,1.3e-05,-3e-06,-4e-06,-2e-06,-8e-06,1e-05,-1e-06,0,9e-06,2e-06,5e-06,-2e-06,-1.4e-05,-6e-06,4e-06,1.1e-05,2e-06,2e-06,5e-06,-1.4e-05,-3e-06,-2e-06,-1.1e-05,-3e-06,-2e-06,-1e-06,5e-06,0,1e-06,-3e-06,1e-05,4e-06,0,-5e-06,-1e-05,-1e-06,-3e-06,-1.4e-05,-1e-06,-5e-06,2e-06,6e-06,-7e-06,8e-06,-5e-06,-2e-06,1e-05,2e-06,-1e-05,0,1.5e-05,9e-06,0,-9e-06,-5e-06
2e-06,0,-1e-06,-3e-06,1e-06,-2e-06,1e-06,0,1e-06,2e-06,2e-06,0,1e-06,0,-1e-06,-1e-06,-2e-06,1e-06,5e-06,2e-06,-5e-06,8e-06,0,-5e-06,-2e-06,0,0,-1e-06,7e-06,-3e-06,1.2e-05,-2e-06,1e-06,-1e-05,7e-06,0,-1e-06,-1.1e-05,2e-06,5e-06,1.8e-05,-4e-06,-5e-06,-1e-05,0,0,4e-06,-3e-06,-2e-06,6e-06,1e-06,0,1e-06,1e-06,2e-06,1e-06,-4e-06,0,5e-06,0,-5e-06,-1e-06,-2.2e-05,7e-06,-3e-06,6e-06,-1.7e-05,-1e-06,0,6e-06,-2e-06,-9e-06,5e-06,-1e-06,3e-06,5e-06,-2e-06,-2e-06,2.8e-05,2e-06,-5e-06,-5e-06,1e-06,1e-06,0,-5e-06,-7e-06,5e-06,0,-5e-06,2e-06,-5e-06,-3e-06,6e-06,-1.1e-05,-2e-06,3e-06,0,4e-06,-6e-06,1.5e-05,-9e-06,6e-06,-1e-05,1e-06,4e-06,1.2e-05,3e-06,7e-06,0,-4e-06,1e-06,-3e-06,-7e-06,-5e-06,2e-06,-2e-06,-1.4e-05,1e-06,9e-06,3e-06
0,2e-06,0,2e-06,-2e-06,-4e-06,1e-06,7e-06,-2e-06,0,-4e-06,-1e-06,1e-06,5e-06,0,1e-06,0,-1e-06,-8e-06,3e-06,4e-06,-5e-06,4e-06,1e-06,1e-06,1e-06,1e-06,0,-8e-06,-3e-06,0,-6e-06,0,1.1e-05,-3e-06,-1e-05,2e-06,2e-06,3e-06,4e-06,3e-06,0,-3e-06,1e-05,-3e-06,1e-06,1.1e-05,-1e-06,-1e-06,-1e-06,0,-1e-06,9e-06,-3e-06,0,-1.1e-05,2e-06,1e-05,-1.6e-05,0,2e-06,-9e-06,-9e-06,-2e-06,-3e-06,-8e-06,5e-06,0,4e-06,-4e-06,-7e-06,0,-2e-06,-2e-06,-2e-06,-1e-06,-6e-06,3e-06,-7e-06,0,1e-06,-3e-06,-4e-06,-4e-06,3e-06,0,-1e-05,2e-06,6e-06,-4e-06,7e-06,-1e-06,2e-06,-7e-06,1e-05,5e-06,-2.1e-05,-6e-06,-4e-06,7e-06,-6e-06,6e-06,-7e-06,-6e-06,-3e-06,2e-06,-3e-06,-5e-06,-6e-06,-3e-06,8e-06,-3e-06,2e-06,-7e-06,-1e-05,-6e-06,-3e-06,-8e-06,0,5e-06,-1e-06
0,2e-06,0,-1e-06,0,4e-06,0,3e-06,-2e-06,-3e-06,-4e-06,0,-4e-06,-2e-06,5e-06,0,0,0,3e-06,-3e-06,1e-06,-3e-06,0,3e-06,1e-06,-3e-06,-1e-06,0,-1.2e-05,1e-06,0,3e-06,0,-3e-06,-4e-06,4e-06,1e-06,-8e-06,-2e-06,-1e-06,6e-06,3e-06,9e-06,-5e-06,3e-06,-2e-06,8e-06,2e-06,0,-1e-06,-4e-06,8e-06,2e-06,0,-2e-06,-1.1e-05,-5e-06,-6e-06,8e-06,0,4e-06,1e-06,1.8e-05,2e-06,5e-06,1e-06,6e-06,-1e-06,1e-06,-2e-06,-1e-06,8e-06,-1e-06,6e-06,-2e-06,-8e-06,1.2e-05,-3e-06,-2e-06,-2e-06,2e-06,4e-06,0,1e-06,-5e-06,4e-06,8e-06,-7e-06,-6e-06,0,-7e-06,1e-06,1e-06,-1e-06,-3e-06,0,-2e-06,1e-06,-1e-06,3e-06,2e-06,-3e-06,-3e-06,-4e-06,0,-4e-06,-3e-06,0,3e-06,0,2e-06,2e-06,-4e-06,-6e-06,-2e-06,2e-06,-1e-06,1.6e-05,-1e-06,6e-06,1e-06
0,0,0,1e-06,1e-06,-2e-06,0,1e-06,0,-2e-06,-1e-06,1e-06,-1e-06,-2e-06,5e-06,-1e-06,-2e-06,0,-1e-06,3e-06,-1e-06,4e-06,-2e-06,0,-1e-06,-4e-06,0,0,9e-06,1e-06,-6e-06,-2e-06,1e-06,-1e-06,2e-06,5e-06,-1e-06,8e-06,-3e-06,0,-7e-06,-1e-06,4e-06,3e-06,-5e-06,0,1.5e-05,0,1e-06,2e-06,-1e-06,3e-06,7e-06,0,3e-06,-3e-06,6e-06,1e-06,0,1e-06,-2e-06,-3e-06,-7e-06,-3e-06,-1e-06,4e-06,0,3e-06,-1e-06,1e-06,1.3e-05,-7e-06,-1e-06,1e-06,1e-06,5e-06,-1.1e-05,0,-9e-06,5e-06,-2e-06,1e-06,3e-06,-1e-06,-1e-06,5e-06,8e-06,5e-06,2e-06,1e-06,2e-06,-7e-06,-1e-05,4e-06,-1.2e-05,-3e-06,3e-06,3e-06,-1e-06,-6e-06,2e-06,-2e-06,0,-4e-06,0,-3e-06,-8e-06,3e-06,1e-06,0,-7e-06,0,3e-06,-3e-06,0,-4e-06,-1.1e-05,4e-06,-1e-06,3e-06,0
0,-2e-06,0,-2e-06,1e-06,2e-06,-1e-06,-1e-06,2e-06,-2e-06,1e-06,-3e-06,2e-06,0,-2e-06,0,3e-06,1e-06,5e-06,2e-06,-3e-06,-3e-06,1e-06,-1e-06,-2e-06,0,1e-06,1e-06,2e-06,-2e-06,-5e-06,-3e-06,1e-06,1e-05,0,-7e-06,-1e-06,-6e-06,2e-06,1e-06,-1e-06,2e-06,-2e-06,1e-06,1e-06,2e-06,-3e-06,0,1e-06,-3e-06,-3e-06,6e-06,-2e-06,0,-3e-06,-7e-06,3e-06,6e-06,4e-06,0,-6e-06,1.1e-05,5e-06,1e-06,-1e-06,-5e-06,-6e-06,-2e-06,1e-06,-3e-06,-7e-06,1e-06,-6e-06,-7e-06,6e-06,6e-06,7e-06,3e-06,2e-06,-1e-06,4e-06,-4e-06,-5e-06,5e-06,-1e-06,1e-06,-3e-06,-1e-06,9e-06,-1e-06,-1e-06,-4e-06,-1e-06,5e-06,1.3e-05,-1e-06,-2e-06,-1e-06,2e-06,-2e-06,-3e-06,-4e-06,4e-06,-3e-06,2e-06,3e-06,-2e-06,-1e-06,-7e-06,0,4e-06,0,-1e-06,-3e-06,-2e-06,3e-06,3e-06,-1e-05,0,-5e-06,-2e-06
-1e-06,-1e-06,1e-06,2e-06,-1e-06,-3e-06,0,-4e-06,1e-06,2e-06,-3e-06,1e-06,-2e-06,3e-06,-4e-06,0,-1e-06,0,-2e-06,2e-06,1e-06,3e-06,1e-06,1e-06,1e-06,-2e-06,-1e-06,0,-3e-06,0,-3e-06,0,0,-5e-06,1e-06,1e-06,1e-06,3e-06,2e-06,-5e-06,-1.2e-05,1e-06,4e-06,-2e-06,-4e-06,-4e-06,7e-06,-1e-06,-3e-06,3e-06,6e-06,-4e-06,-9e-06,1e-06,2e-06,-5e-06,0,-7e-06,-7e-06,0,1e-06,0,5e-06,-3e-06,-1e-06,1e-06,4e-06,-1e-06,0,5e-06,-8e-06,4e-06,0,-1e-06,7e-06,-3e-06,-4e-06,-2e-06,9e-06,1e-06,-3e-06,-4e-06,-2e-06,-2e-06,1e-06,1e-06,0,-1e-06,2e-06,-3e-06,1e-06,6e-06,2e-06,-5e-06,-2e-06,0,8e-06,0,2e-06,6e-06,-3e-06,4e-06,-1e-06,-2e-06,3e-06,-1e-06,2e-06,0,7e-06,1e-06,0,0,0,-2e-06,1e-06,-1e-06,-2e-06,-4e-06,0,-7e-06,2e-06
2e-06,1e-06,1e-06,-1e-06,-1e-06,0,0,-3e-06,0,2e-06,-4e-06,1e-06,1e-06,-1e-06,-2e-06,0,-1e-06,-1e-06,-6e-06,-2e-06,2e-06,1e-06,-4e-06,0,1e-06,4e-06,0,0,-1e-06,1e-06,1.1e-05,-4e-06,0,-5e-06,-1e-06,3e-06,4e-06,-3e-06,-2e-06,1e-06,3e-06,-1e-06,6e-06,2e-06,0,-1e-06,-2e-06,2e-06,0,0,-2e-06,-1.2e-05,1e-06,-1e-06,1e-06,-9e-06,-1e-06,2e-06,6e-06,0,3e-06,0,-1e-06,1e-06,2e-06,2e-06,4e-06,2e-06,2e-06,-3e-06,1e-05,-4e-06,-5e-06,-2e-06,4e-06,1e-06,1e-06,0,-1.5e-05,0,2e-06,3e-06,0,-2e-06,3e-06,-2e-06,-1.1e-05,1e-06,3e-06,-5e-06,-3e-06,3e-06,-2e-06,2e-06,-9e-06,3e-06,2e-06,1e-06,0,1e-06,1.1e-05,2e-06,2e-06,0,2e-06,-5e-06,6e-06,3e-06,-3e-06,1e-06,1e-06,-1e-06,1e-06,-2e-06,-1e-06,1e-06,-5e-06,5e-06,0,-2e-06,-1e-06
-2e-06,1e-06,0,1e-06,1e-06,3e-06,1e-06,0,1e-06,2e-06,-1e-06,-1e-06,2e-06,-2e-06,-1e-06,0,3e-06,0,-4e-06,1e-06,1e-06,0,1e-06,-2e-06,-2e-06,4e-06,-1e-06,-1e-06,-2e-06,0,1e-06,1e-06,-1e-06,1.1e-05,3e-06,1e-06,1e-06,6e-06,-2e-06,0,7e-06,-1e-06,4e-06,-1e-06,-3e-06,3e-06,3e-06,0,-2e-06,-2e-06,5e-06,0,-1.1e-05,0,-2e-06,1e-06,1e-06,3e-06,-1e-06,0,-2e-06,-4e-06,9e-06,3e-06,2e-06,-3e-06,-3e-06,0,-1e-06,0,0,2e-06,-3e-06,1e-06,3e-06,1e-06,4e-06,1e-06,5e-06,-1e-06,-1e-06,-5e-06,-1e-06,-2e-06,2e-06,-3e-06,4e-06,0,1e-06,-3e-06,0,-3e-06,3e-06,5e-06,1.1e-05,0,3e-06,-3e-06,-3e-06,-4e-06,-1e-05,-7e-06,1e-06,2e-06,1e-06,1e-06,4e-06,-1e-06,-1e-06,-1e-06,-2e-06,1e-06,-1e-06,0,3e-06,-1e-06,1e-05,5e-06,-1e-06,4e-06,1e-06
0,1e-06,0,-2e-06,1e-06,-5e-06,1e-06,3e-06,2e-06,-1e-06,-1e-06,0,0,1e-06,1e-06,0,-4e-06,1e-06,4e-06,1e-06,-2e-06,0,3e-06,0,1e-06,-3e-06,1e-06,0,2e-06,-1e-06,1e-06,-1e-06,-1e-06,-1e-06,-3e-06,-5e-06,-1e-06,-2e-06,1e-06,-2e-06,3e-06,0,-1e-06,2e-06,-1e-06,0,-6e-06,-1e-06,-1e-06,1e-06,-5e-06,1e-06,1e-06,0,1e-06,0,-2e-06,-4e-06,-3e-06,0,-1e-06,-4e-06,2e-06,0,-1e-06,3e-06,-4e-06,-1e-06,-1e-06,-4e-06,-5e-06,1e-06,-2e-06,4e-06,-2e-06,-8e-06,-8e-06,-1e-06,-3e-06,2e-06,0,5e-06,0,-3e-06,0,-1e-06,1.1e-05,0,0,-2e-06,-1e-06,0,-3e-06,3e-06,-5e-06,-2e-06,-1e-06,3e-06,0,-1e-06,2e-06,2e-06,-4e-06,6e-06,-1e-06,2e-06,1e-06,-3e-06,4e-06,-2e-06,1e-06,-1e-06,1e-06,-1e-06,8e-06,-1e-06,3e-06,-1e-06,0,0,1e-06
0,-1e-06,0,2e-06,-1e-06,4e-06,-1e-06,3e-06,1e-06,-1e-06,2e-06,0,1e-06,1e-06,3e-06,-1e-06,4e-06,-1e-06,2e-06,-1e-06,-1e-06,-6e-06,-1e-06,2e-06,0,-1e-06,0,0,-1e-06,1e-06,-2e-06,-3e-06,0,-5e-06,1e-06,1e-06,-1e-06,3e-06,2e-06,1e-06,-2e-06,-1e-06,-4e-06,-1e-06,0,-1e-06,1e-06,0,1e-06,-1e-06,3e-06,3e-06,-6e-06,0,-1e-06,2e-06,1e-06,-1e-06,6e-06,0,4e-06,4e-06,-1.2e-05,-3e-06,-2e-06,1e-06,5e-06,0,3e-06,-1e-06,0,-3e-06,-2e-06,0,-4e-06,1e-06,4e-06,1e-06,6e-06,-1e-06,0,3e-06,0,3e-06,-3e-06,1e-06,-6e-06,-1e-06,6e-06,0,1e-06,5e-06,1e-06,-6e-06,-7e-06,-1e-06,-8e-06,1e-06,-2e-06,4e-06,2e-06,-1e-06,1e-06,4e-06,-1e-06,-2e-06,-5e-06,1e-06,-6e-06,0,3e-06,0,-3e-06,1e-06,0,0,-1e-06,-9e-06,0,2e-06,-1e-06
-1e-06,-1e-06,-1e-06,-1e-06,0,0,0,1e-06,-1e-06,-2e-06,1e-06,0,-1e-06,0,3e-06,0,-4e-06,0,1e-06,0,2e-06,3e-06,-1e-06,-1e-06,0,-1e-06,1e-06,1e-06,2e-06,-2e-06,-5e-06,0,-1e-06,9e-06,1e-06,4e-06,1e-06,-9e-06,-1e-06,1e-06,-9e-06,2e-06,0,1e-06,-1e-06,-1e-06,-2e-06,1e-06,-1e-06,0,-6e-06,6e-06,0,0,1e-06,3e-06,3e-06,7e-06,-4e-06,0,2e-06,1e-06,4e-06,3e-06,-1e-06,-2e-06,0,0,0,2e-06,-4e-06,3e-06,-1e-06,-7e-06,-4e-06,6e-06,-1e-06,1e-06,1e-06,1e-06,0,-4e-06,-1e-06,1e-06,-2e-06,3e-06,0,2e-06,-5e-06,-1e-06,0,1e-06,0,0,1e-05,1e-06,-3e-06,-3e-06,3e-06,0,-4e-06,2e-06,-1e-06,4e-06,-2e-06,-2e-06,-5e-06,2e-06,4e-06,0,-6e-06,0,5e-06,1e-06,1e-06,-2e-06,3e-06,1e-06,0,1e-06,0
1e-06,-1e-06,0,1e-06,1e-06,-2e-06,0,-2e-06,-1e-06,0,-1e-06,-1e-06,0,-2e-06,1e-06,0,4e-06,0,-3e-06,-1e-06,0,1e-06,1e-06,0,0,-3e-06,0,0,0,1e-06,-4e-06,-2e-06,0,-6e-06,-2e-06,-4e-06,1e-06,5e-06,-2e-06,-1e-06,6e-06,0,2e-06,-1e-06,-2e-06,-1e-06,-4e-06,-1e-06,1e-06,1e-06,4e-06,2e-06,8e-06,0,0,1e-06,-1e-06,-4e-06,0,0,-3e-06,3e-06,1e-06,-3e-06,1e-06,1e-06,-2e-06,1e-06,-2e-06,-2e-06,9e-06,-1e-06,1e-06,3e-06,-4e-06,-2e-06,-2e-06,-1e-06,-1e-05,0,0,3e-06,2e-06,1e-06,-1e-06,2e-06,-5e-06,-2e-06,-5e-06,-2e-06,-2e-06,-5e-06,2e-06,3e-06,-4e-06,1e-06,-2e-06,0,0,-3e-06,1e-06,-7e-06,4e-06,7e-06,0,4e-06,-1e-06,-1e-06,1e-06,-1e-06,2e-06,0,-5e-06,3e-06,-1e-06,2e-06,-1e-06,1e-05,0,-2e-06,-1e-06
0,0,0,-1e-06,0,3e-06,0,-1e-06,-1e-06,0,2e-06,1e-06,1e-06,1e-06,-2e-06,0,-3e-06,0,0,1e-06,1e-06,-2e-06,1e-06,0,1e-06,2e-06,0,0,-5e-06,-1e-06,5e-06,-2e-06,1e-06,-3e-06,1e-06,0,-1e-06,-3e-06,-1e-06,1e-06,-2e-06,1e-06,-3e-06,-1e-06,0,0,-5e-06,-1e-06,-1e-06,-2e-06,-4e-06,-3e-06,0,0,-1e-06,8e-06,0,0,-6e-06,0,-1e-06,-3e-06,-6e-06,-1e-06,0,1e-06,-2e-06,0,0,0,2e-06,-2e-06,-3e-06,1e-06,-1e-06,-3e-06,5e-06,0,1e-05,-1e-06,0,-1e-06,2e-06,-1e-06,2e-06,-2e-06,-3e-06,1e-06,1e-06,-2e-06,3e-06,-2e-06,-3e-06,0,-7e-06,0,2e-06,1e-06,-1e-06,0,5e-06,3e-06,-3e-06,7e-06,0,1e-06,3e-06,-1e-06,-4e-06,0,3e-06,1e-06,4e-06,3e-06,-1e-06,-2e-06,-3e-06,0,0,-1e-06,1e-06
