-0.002471,-0.002146,-0.002881,-0.002199,-0.001853,-0.002453,-0.003252,-0.004345,-0.003658,-0.002954,-0.00371,-0.003456,-0.002597,-0.002731,-0.00397,-0.002866,-0.003175,-0.002519,-0.002554,-0.00184,-0.000848,-0.001307,-0.001058,-0.000997,-0.00136,-0.002073,-0.002717,-0.001856
-0.001899,-0.000778,-0.000737,-0.000987,-0.00124,-0.001911,-0.001946,-0.001182,-0.000932,-0.000348,-7.6e-05,-0.000567,0.000321,-0.000422,-0.002494,-0.001558,8e-05,0.000176,-0.00011,-0.000264,-0.000905,-0.000802,-0.000193,-0.000269,7.7e-05,-0.001125,-0.001717,-0.000629
-0.000296,0.000203,0.000621,7.2e-05,0.000213,0.00072,0.000751,0.000737,0.000342,0.000466,0.000998,0.000994,0.000382,-3.6e-05,-0.000274,-0.000351,-8.2e-05,0.000249,0.000285,-0.000563,-0.000708,2.1e-05,-0.000135,4.4e-05,5.7e-05,3e-05,-0.000121,0.000147
0.000753,-4.6e-05,0.000296,-8.9e-05,0.000641,0.001682,0.001468,8.8e-05,-0.000569,-0.000341,-4e-06,0.000403,-0.000887,-0.000212,0.001239,-9.1e-05,-0.001592,-0.001029,-0.000669,-0.001325,-0.000659,-3e-06,-0.000586,-0.000203,-0.000515,0.000461,0.000827,7e-06
0.000933,1.8e-05,0.000239,-0.000222,0.000143,0.000193,0.000653,0.001209,0.000373,0.000603,0.001191,0.000807,0.000928,0.001685,0.00213,0.000588,0.001055,0.000603,0.000598,0.000384,-0.000467,-0.000331,-0.00012,-5.1e-05,0.000437,0.000792,0.001453,0.000517
-0.001162,-0.000953,-0.00124,-0.001027,-0.000953,-0.001643,-0.001348,-0.000514,-0.000666,-0.000457,-0.000596,-0.000812,0.000227,9e-06,-0.001401,-0.001151,0.000301,0.000128,-0.000162,3.6e-05,-0.000711,-0.000938,-0.000351,-0.000471,-4.7e-05,-0.000664,-0.000763,-0.000347
-0.002031,-0.000928,-0.001033,-0.00026,-0.000745,-0.001152,-0.001651,-0.002827,-0.001628,-0.001437,-0.002431,-0.001996,-0.001873,-0.002479,-0.00364,-0.00198,-0.002282,-0.00131,-0.001363,-0.001048,-0.000276,-0.000552,-0.000516,-0.000522,-0.000928,-0.00163,-0.002522,-0.001285
0.000918,0.001497,0.001932,0.00201,0.000913,0.00096,0.001017,0.001113,0.002009,0.001465,0.00128,0.001038,0.000471,0.000175,0.000874,0.001553,0.001238,0.001131,0.001159,0.001238,0.001171,0.001034,0.000693,0.000634,0.000564,0.000476,0.000259,0.000406
0.002616,0.001642,0.001313,0.001164,0.001125,0.001444,0.001936,0.003545,0.002877,0.001874,0.0023,0.001901,0.001598,0.001812,0.003745,0.002969,0.002974,0.001552,0.001587,0.001871,0.0014,0.00126,0.00089,6e-04,0.000924,0.001681,0.002457,0.001378
0.001008,-0.000587,-0.001452,-0.001018,-4.6e-05,0.000175,-3.9e-05,-0.000411,-0.000872,-0.001271,-0.001607,-0.000971,-0.000876,-9.6e-05,0.001219,0.000455,-0.000997,-0.001423,-0.001189,-0.000459,0.000466,4.3e-05,-0.000171,-0.000522,-0.00066,0.000268,0.000903,7e-05
-0.000529,-0.000581,-0.000392,-0.00039,-0.000389,-0.000593,-0.000813,-0.001723,-0.001227,-0.00093,-0.001095,-0.000658,-0.00024,-2.9e-05,-0.000667,-0.000392,-0.000949,-0.000561,-0.000445,-0.000255,0.000105,-0.000293,-7.2e-05,-0.000319,-3e-04,-0.000385,-0.000405,-0.000204
-0.001275,0.000435,0.000978,0.000341,-0.000246,-0.000399,-0.000262,0.00034,0.000554,0.001038,0.001769,0.001281,0.001444,0.000443,-0.001398,-0.000307,0.001478,0.001557,0.001309,0.000542,-7.4e-05,0.000242,0.000504,0.000455,0.000722,-2.1e-05,-0.000661,0.000263
-0.001585,-0.000399,-0.000445,-0.000763,-0.000481,-0.000187,-0.000648,-0.001058,-0.001189,-0.000379,-0.000123,-0.000417,-0.000865,-0.001375,-0.002133,-0.001614,-0.001223,-0.000597,-7e-04,-0.001336,-0.000726,-5e-06,-0.000183,0.000126,-0.000203,-0.000451,-0.001339,-0.000715
-3.7e-05,-0.000732,-0.000626,-0.00082,-0.000219,-7e-06,-0.000296,-0.001297,-0.001672,-0.001053,-0.001482,-0.001494,-0.001572,-0.00094,-4e-05,-0.000938,-0.002154,-0.001511,-0.00134,-0.001317,-0.000891,-0.000533,-0.000642,-0.000107,-0.000483,-0.000319,-0.000269,-0.000691
0.001448,0.000148,0.000328,0.00023,0.000389,0.000205,0.001105,0.002096,0.001081,0.000635,0.000601,0.000575,0.001053,0.00129,0.001879,0.000796,0.001321,0.000799,0.000772,0.000826,-0.000465,-0.000503,-0.000107,0.000219,0.000339,0.000429,0.001611,0.000877
0.000269,3.8e-05,2e-05,0.000704,0.000441,0.000161,0.000652,0.001331,0.001201,0.000437,0.000538,0.000981,0.000834,0.000624,8.4e-05,2e-05,0.00074,0.000615,0.00055,0.000437,-0.000233,-0.000441,-4.2e-05,0.000108,3.7e-05,1.3e-05,0.000531,0.000578
-0.000939,-0.000116,0.000189,0.000829,0.000186,-8.1e-05,-0.000889,-0.001801,-0.000264,-0.000273,-0.000461,-0.000218,-0.000679,-0.00054,-0.001059,-0.000592,-0.001306,-0.000537,-0.000408,-0.000378,4.2e-05,-0.000202,-0.000241,-6.6e-05,-0.000123,-0.00047,-0.001357,-0.000811
-0.000146,0.00055,0.000444,0.000111,-0.000184,-0.000244,-7e-04,-0.000284,0.000342,0.000538,0.000602,-9.9e-05,0.000207,0.000191,0.000346,0.000569,0.000899,0.000525,0.000394,0.000608,0.000424,0.000437,0.00019,-2e-06,0.000362,-6.2e-05,-0.000763,-0.000519
0.000771,0.000366,-0.000611,-0.000903,-0.000441,-4.6e-05,0.000437,0.001362,0.000518,8.1e-05,-1.9e-05,-0.000319,0.000234,0.000145,0.000846,0.000792,0.001284,0.000303,-2.2e-05,0.000362,0.000462,0.000513,0.000367,-0.000188,-0.000207,0.000122,0.000414,0.000156
