0.000253,0.000656,0.000207,0.00012,0.000677,0.000412,0.000393,2.9e-05,0.000298,0.00012,6.7e-05,0.000154,0.000192,0.000399,0.000267,0.000233,0.00029,0.000115,0.000208,6.8e-05,0.000111,0.000566,0.000129,0.000295,0.000225,0.000254,0.000254,0.000221,0.000188,0.00016,1.2e-05,0.00012,0.000171,1.7e-05,0.000172,6.3e-05,6.6e-05,4.8e-05,0.000252,1.1e-05,9.5e-05,7e-06,1e-06,6e-05,7.5e-05,7.7e-05,4.3e-05,1e-06,4.2e-05,1.6e-05,4.7e-05,3.1e-05,4.1e-05,0.000126,6.7e-05,1.4e-05,6.3e-05,9.6e-05,4e-06,5.8e-05,8e-05,2e-05,0.000118,0.000116,5.5e-05,6.6e-05,8.8e-05,4e-06,6.7e-05,7.7e-05,0.000118,1.5e-05,8.6e-05,0.000105,1.4e-05,4.7e-05,7.9e-05,2.1e-05,8.6e-05,7.1e-05,4.2e-05,0.000102,9.5e-05,1.4e-05,6.7e-05,3.5e-05,8.3e-05,2.1e-05,4e-05,6.1e-05,4.3e-05,5.6e-05,7e-05,7.2e-05,6.3e-05,7.6e-05,2e-05,6.5e-05,8.1e-05,5e-06,1.7e-05,7.4e-05,0.000142,5.6e-05,2e-06,6.2e-05,2.6e-05,4.2e-05,9.5e-05,8e-06,3.3e-05,2.8e-05,4e-05,2e-05,0.000287,0.000431,5.9e-05,0.000596,0.000339,8.7e-05,0.000979
0.000667,0.001362,0.000353,0.000444,0.001349,0.000734,0.001027,0.000155,0.000432,0.000382,0.000433,0.00027,0.000595,0.000854,0.000463,0.000555,0.000641,0.000221,0.000376,5e-05,0.000178,0.001329,0.000473,0.000678,0.000275,0.000387,0.000616,0.000248,0.000231,0.000312,0.000147,0.000372,0.00041,5.9e-05,0.000161,0.000254,0.000105,0.000227,0.000391,0.000155,0.000156,0.000233,4.4e-05,1e-04,5.2e-05,5.5e-05,0.000227,0.000312,0.000122,4e-05,3.4e-05,6.9e-05,0.000115,0.000184,6.5e-05,2.8e-05,0.000129,0.000156,0.000198,0.000192,0.000195,0.000151,7.4e-05,8.4e-05,5.8e-05,0.000127,0.000155,0.000136,7.6e-05,3e-05,0.000124,9.3e-05,0.000111,4.2e-05,0.000133,0.000148,3.5e-05,7.8e-05,0.000124,9.1e-05,4.5e-05,0.000181,4.6e-05,8.5e-05,0.000108,0.00011,8.9e-05,0.000103,9.9e-05,5.8e-05,4.5e-05,0.000113,8.8e-05,2.3e-05,0.000168,0.000166,8.1e-05,1e-04,8.5e-05,7.8e-05,7.2e-05,0.000113,0.000198,0.000119,0.000127,0.000138,0.000114,8.2e-05,0.000151,0.000141,4.3e-05,8.7e-05,6.3e-05,9.4e-05,0.000445,0.001012,0.000435,0.001391,0.000764,0.000513,0.002694
0.000657,0.001699,0.000267,0.000624,0.001597,0.001016,0.001232,0.000311,0.000507,0.000551,0.000811,0.000403,0.000794,0.001102,0.000717,0.000669,0.00067,0.000335,0.000316,0.000197,0.000191,0.001453,0.000489,0.000719,0.00027,0.000476,0.000547,0.000339,0.000303,0.000279,9.9e-05,0.00031,0.000494,0.000107,0.000263,0.000212,0.000213,0.000304,0.000269,8e-05,4.8e-05,0.00017,6.8e-05,8.2e-05,1e-04,0.000206,0.000408,0.000217,0.000136,6.2e-05,5.8e-05,8.3e-05,0.000207,8e-05,0.000142,0.000132,9e-05,0.000101,0.000174,8.5e-05,0.000141,0.000101,0.000137,2.1e-05,0.000107,9.2e-05,8.7e-05,0.000101,5.3e-05,6.9e-05,7.9e-05,8.7e-05,5.5e-05,9.5e-05,0.000111,7.9e-05,8.6e-05,6.4e-05,7.6e-05,2.4e-05,4.9e-05,0.000111,7e-05,8.1e-05,0.000116,7e-05,9.9e-05,3.6e-05,8.5e-05,3.5e-05,4.4e-05,5.3e-05,0.00013,5.5e-05,0.000103,6.3e-05,8.8e-05,6.5e-05,7.4e-05,5.5e-05,0.000159,5.5e-05,0.000205,9.4e-05,1.2e-05,6.2e-05,6e-05,0.000157,5.1e-05,0.000103,0.000132,0.000109,1.2e-05,0.000127,0.000472,0.000892,0.001151,0.001957,0.001899,0.000862,0.002976
0.001615,0.001922,7e-05,0.001107,0.001812,0.001213,0.002548,5.3e-05,0.000522,0.001164,0.002085,0.000718,0.000818,0.001748,0.000904,0.000707,0.001112,0.000879,0.000522,0.000362,0.000215,0.001741,0.000177,0.000698,9.3e-05,0.000298,0.000683,0.000243,0.000416,0.000423,0.000294,0.000566,0.000257,0.000675,0.000484,0.000202,0.000193,0.000408,0.000478,0.000271,0.00014,0.000214,5.4e-05,5.4e-05,0.000144,0.000312,0.000263,1e-04,0.000115,0.000342,0.000122,6.9e-05,0.000184,8e-06,9.3e-05,0.00023,0.000148,4e-05,0.000165,0.000195,0.000122,0.000189,0.000215,0.000161,0.000103,2.6e-05,5.6e-05,9.6e-05,9.3e-05,5.9e-05,0.000146,0.00018,4.2e-05,0.000126,8.4e-05,6.9e-05,8.5e-05,0.000103,6.5e-05,7.7e-05,8e-06,0.000147,0.000123,8.3e-05,0.00011,0.000119,6.5e-05,0.00011,0.000102,0.000103,5.9e-05,0.000146,0.000189,0.000106,0.000102,0.000174,0.000153,0.000168,0.000142,0.000167,0.000107,3.3e-05,0.000233,0.000137,0.000108,3.3e-05,0.000224,0.000232,7.6e-05,3.3e-05,9.3e-05,7.9e-05,0.000151,0.000151,0.000393,0.001939,0.002828,0.00188,0.003457,0.003505,0.00284
0.001633,0.005041,0.002436,0.003848,0.002307,0.003883,0.004256,0.003235,0.001228,0.001353,0.001486,0.002149,0.002446,0.003522,0.00239,0.002385,0.00248,0.000473,0.001114,0.000228,0.000587,0.002062,0.002445,0.00108,0.00095,0.000732,0.000853,0.001247,0.001265,0.001563,0.000847,0.001057,0.000987,0.000764,0.000725,0.000496,0.000338,0.000855,0.00115,0.00062,0.000319,4.3e-05,0.000168,0.000259,0.000227,0.000248,0.000387,0.000534,0.000465,0.000233,3e-04,0.00016,7.2e-05,0.000304,0.000301,0.000163,8.2e-05,8e-05,0.000392,0.000459,9.9e-05,0.00026,0.000501,0.000756,0.000507,3e-04,5.1e-05,2.6e-05,9.1e-05,0.000125,0.000111,0.000313,0.000194,0.000241,0.000212,0.000111,0.000116,0.000206,8e-05,0.000151,0.000119,0.000175,9.9e-05,4.5e-05,0.000262,0.000156,0.000228,0.000275,0.000227,5.4e-05,0.000142,0.00019,7.7e-05,9.3e-05,0.000121,0.000244,0.000126,0.000183,0.000117,0.000172,0.00012,0.000142,0.000316,0.000169,0.000218,0.000115,0.000239,0.000145,4.6e-05,7e-05,9.1e-05,0.000127,0.000111,5.9e-05,0.000534,0.002842,0.008108,0.004396,0.004759,0.00798,0.004541
0.00347,0.007954,0.007704,0.003843,0.003709,0.004122,0.002168,0.001418,0.002008,0.001339,0.002549,0.003594,0.003506,0.003999,0.002549,0.00117,0.001925,0.00154,0.00271,0.001405,0.001857,0.00121,0.002698,0.002538,0.002022,0.001644,0.000872,0.001741,0.001187,2.5e-05,0.001384,0.000754,0.000604,0.001336,0.000888,0.000568,0.000534,0.001114,0.00076,0.000534,0.000341,0.000397,0.000505,0.000806,0.000562,0.000165,0.000226,0.000387,0.000715,0.000785,0.000654,0.000388,0.000293,0.000467,0.000346,0.000421,0.000144,0.000124,0.000502,0.000222,0.000376,0.00024,0.000118,0.000842,0.000521,0.000179,0.000148,0.000176,0.000294,0.000408,0.000274,0.000291,0.000323,7.6e-05,0.000203,2.7e-05,0.000196,0.000135,3.9e-05,0.000229,0.00024,0.000216,0.000196,7.5e-05,0.000375,0.000329,0.000294,0.000134,0.000147,0.000272,0.000187,0.000354,0.000352,0.000224,0.000211,0.000312,0.000272,0.000293,0.000171,0.000172,0.000251,0.000202,0.000517,0.000172,0.000144,0.000243,0.000261,0.000225,0.000135,7.1e-05,0.000119,0.00016,0.000228,0.000124,0.000575,0.002217,0.009352,0.010534,0.00778,0.007181,0.013654
0.004722,0.005239,0.003946,0.003944,0.003852,0.002779,0.002068,0.00124,0.00133,0.001297,0.001303,0.002238,0.000809,0.001201,0.00127,0.000922,0.001877,0.00045,0.002374,0.001124,0.001712,8e-04,0.000637,0.001016,0.000849,0.000591,0.001366,0.00181,0.000944,0.001311,0.001919,0.00045,0.0014,0.001134,0.001371,0.000611,0.00082,0.00106,0.001296,0.000608,0.000649,0.000918,0.000941,0.000808,0.000733,0.000512,0.000538,3.9e-05,0.000465,0.000242,0.000127,0.000322,0.000241,0.000446,0.000351,0.000313,0.000351,0.000363,0.000264,0.000237,0.000283,0.000451,0.000556,0.000562,0.000369,2.9e-05,0.000297,0.000254,0.000386,0.000248,7.4e-05,0.000116,4.9e-05,0.000341,0.00011,0.000228,0.000179,0.00016,0.000237,0.000255,0.000124,0.000283,0.000156,8e-05,0.000246,0.000358,3.4e-05,5.6e-05,0.000131,0.000263,0.000406,5.5e-05,0.00019,0.000106,0.000112,0.000105,0.000203,0.000219,0.000254,0.000116,0.00042,0.000351,0.000758,0.000478,0.000308,0.00011,6.1e-05,0.000395,0.000115,8.3e-05,8.5e-05,0.00019,0.000169,0.000112,0.00031,0.001037,0.006999,0.006487,0.007438,0.014929,0.013705
0.010209,0.011684,0.005678,0.006804,0.00553,0.004452,0.007734,0.006651,0.002955,0.00308,0.001778,0.002878,0.000739,0.003051,0.003305,0.001527,0.004665,0.003202,0.003409,0.003214,0.001894,0.004176,0.002728,0.000586,0.001023,0.002019,0.003252,0.003033,0.001748,0.001896,0.002,0.001177,0.001831,0.002834,0.000614,0.001542,0.001446,0.000933,0.001921,0.002493,0.000845,0.001491,0.001646,0.000995,0.001249,0.001356,0.001642,0.001245,0.000177,0.000497,0.000737,0.000482,0.000173,0.000427,0.000176,0.000568,0.000889,0.000206,0.000153,0.000584,0.000249,0.000667,0.000266,0.000791,0.000599,0.000436,0.000331,0.000154,0.000398,0.000391,0.000299,0.000226,0.000231,0.00024,0.000104,0.000335,4e-04,0.000382,6.6e-05,9.9e-05,0.000112,0.000206,0.000281,0.000341,0.000118,0.000349,0.000351,0.000138,0.00019,0.000222,0.000145,0.000297,0.000169,0.00026,0.000128,0.000151,0.000308,0.000139,0.000342,0.00057,0.000586,0.000369,0.000567,0.000678,0.000321,0.000307,0.000238,0.000675,0.00045,0.000153,0.000131,0.000224,0.000258,0.000333,0.000511,0.000537,0.004857,0.002038,0.005035,0.009129,0.003081
0.003905,0.006212,0.002629,0.012311,0.016557,0.014763,0.001913,0.008105,0.006602,0.003092,0.004787,0.00744,0.008765,0.007487,0.002718,0.001048,0.005482,0.00488,0.002718,0.002021,0.001652,0.004554,0.006562,0.005883,0.004518,0.004018,0.003391,0.004195,0.005741,0.005987,0.005363,0.003941,0.004192,0.004189,0.004085,0.003095,0.002811,0.00328,0.004101,0.003727,0.002196,0.002212,0.002827,0.002494,0.000725,0.001076,0.001579,0.001761,0.001334,0.001332,0.001205,0.000725,0.000136,5e-04,0.000919,0.001273,0.001439,0.001364,0.000779,0.000882,0.000835,0.001263,0.000923,0.00072,5.3e-05,0.000365,0.000661,0.000685,0.000764,0.000514,0.000428,0.000756,0.000356,0.000381,0.000522,0.000632,0.00045,0.000584,0.000636,0.00037,0.000253,0.000293,0.000408,0.000452,0.000481,0.000522,0.000471,0.000347,0.000373,0.000202,0.000107,1e-04,0.000203,0.00029,0.000397,0.000347,0.000464,0.000535,0.000683,0.000801,0.000321,0.00043,0.000756,0.000689,0.000607,0.000461,0.00022,0.000593,0.000511,0.000583,0.000384,0.000286,0.000135,0.000217,0.000215,0.000433,0.002696,0.002933,0.006616,0.009128,0.006908
0.005517,0.00108,0.002895,0.011981,0.010258,0.003396,0.008507,0.004223,0.002271,0.003352,0.005972,0.002113,0.004778,0.001256,0.000227,0.001273,0.003827,0.000341,0.000452,0.001434,0.001825,0.001649,0.002702,0.00075,0.001432,0.001572,0.00052,0.001938,0.002346,0.001259,0.000842,0.000773,0.001277,0.00093,0.001519,0.000195,0.001294,0.001224,0.001297,0.000792,0.000284,0.001011,0.000966,0.000387,8e-04,0.000128,0.000664,0.00053,0.000227,0.00058,0.000613,0.000759,0.000802,9.2e-05,0.000666,0.000376,0.000502,0.000413,0.000515,0.000578,0.000346,0.000658,0.000612,0.000403,0.000124,5e-04,0.000519,0.000245,0.000166,0.000102,0.000231,0.000444,0.000306,0.000278,0.000241,0.000134,0.000171,0.000236,0.000194,0.000191,0.000147,0.000225,5.8e-05,0.000236,0.000261,0.000328,0.000115,0.000149,9.8e-05,0.000107,4e-05,3e-05,0.000131,0.00013,0.000223,7.4e-05,0.000355,0.000259,0.000203,0.000269,8e-05,0.000272,0.000209,0.000264,0.000327,3.4e-05,0.00011,0.000346,3e-05,0.000276,8.8e-05,0.00012,0.000306,0.000171,0.000126,0.000402,0.0028,0.004032,0.00705,0.005041,0.009618
0.001607,0.001892,0.002741,0.004462,0.002264,0.001684,0.004446,0.002599,0.000428,0.003105,0.001261,0.0019,0.001295,0.000778,0.000842,0.000908,0.000653,0.000991,0.000857,0.000815,0.000995,0.001661,0.000436,0.001219,0.000176,0.001105,0.000891,0.000102,0.001005,0.000333,0.00044,0.000216,0.000621,0.000482,0.001291,0.001153,0.000168,0.000949,0.000395,0.000316,0.000344,0.00037,0.000353,0.00057,0.000289,0.000187,6.9e-05,0.000191,0.000411,0.000101,0.000387,0.000324,0.000369,0.000421,0.000195,0.000542,9.9e-05,0.000431,0.000228,0.000156,0.000254,0.000301,4.9e-05,1.9e-05,0.00013,0.000283,5.9e-05,0.000117,0.000194,0.000144,0.00012,0.00019,0.000181,0.000137,0.000179,0.000114,0.000195,9.6e-05,5.3e-05,1e-04,4e-05,0.000158,0.000136,0.000114,5e-05,0.000183,6.3e-05,8.3e-05,0.000111,5.4e-05,2.1e-05,2.1e-05,7e-05,9.7e-05,0.000211,0.000145,0.00016,6.3e-05,0.000182,9.9e-05,3e-05,0.000171,0.000297,5.2e-05,8.3e-05,0.00013,0.000144,8e-05,0.00011,9.3e-05,6.5e-05,6.2e-05,1e-04,5.1e-05,0.000183,0.000375,0.001481,0.002612,0.001846,0.000874,0.00351
0.000688,0.000811,0.001803,0.002482,0.001159,0.000933,0.002207,0.00162,0.001661,0.001293,0.002044,0.00209,0.002052,0.001231,0.00058,0.001243,0.000809,0.000681,0.000773,0.000387,0.00108,0.001315,0.000414,0.000665,0.000242,0.000669,0.000903,0.000718,0.001081,0.000805,0.000828,0.000577,0.00058,0.000281,0.000744,0.000467,0.000295,0.000707,0.000538,0.000253,0.000275,0.000381,0.000152,0.00021,0.000175,0.000356,0.000234,0.000177,3e-04,0.000157,0.000326,0.000106,0.000179,8.2e-05,0.00013,0.000191,3.1e-05,0.00018,2e-05,7.7e-05,0.000167,0.000106,5.2e-05,0.000136,0.000136,0.000113,6.7e-05,2.3e-05,5.9e-05,3.9e-05,6.5e-05,2.9e-05,9.9e-05,8.6e-05,0.000148,8.4e-05,5.5e-05,4.3e-05,5.7e-05,3.7e-05,8e-06,7.2e-05,5.3e-05,8e-05,4.8e-05,4.1e-05,6.7e-05,5e-05,8.9e-05,8.5e-05,2.6e-05,1.9e-05,4.3e-05,2.2e-05,0.000112,5.7e-05,8.7e-05,5.4e-05,0.000144,9.1e-05,4e-05,8.1e-05,0.000145,0.000104,8.2e-05,7.1e-05,7.5e-05,4.5e-05,3e-05,1.7e-05,2.7e-05,2.1e-05,2.7e-05,6.4e-05,0.000129,0.000297,0.001215,0.001368,0.001492,0.001072,0.003413
0.00043,0.000808,0.001027,0.002171,0.001244,0.000874,0.001217,0.000971,0.000771,0.000843,0.001119,0.001273,0.001271,0.000409,0.000129,0.00089,0.00025,0.000236,0.000149,0.000192,0.000654,0.000642,0.000238,0.000262,0.000223,0.000744,0.000618,0.000239,0.00083,0.000416,0.000364,0.000182,0.000366,0.000182,0.000379,0.000195,7.7e-05,0.000499,0.000342,0.000168,0.000141,0.000218,0.000116,2.8e-05,5.4e-05,0.000227,0.000133,0.000149,0.000175,0.000147,0.000229,0.00014,0.000108,0.000106,5.2e-05,0.000159,6.9e-05,7.4e-05,5.9e-05,7e-05,0.000173,8.5e-05,2.9e-05,8.4e-05,6.1e-05,0.000128,4.3e-05,2.2e-05,2.9e-05,5.1e-05,4.5e-05,4.4e-05,2.5e-05,8e-06,8e-05,2.2e-05,3.7e-05,2.9e-05,7.2e-05,2.9e-05,2.2e-05,4.9e-05,3.3e-05,7.3e-05,5.4e-05,4.9e-05,5e-05,7.3e-05,6.2e-05,5.3e-05,2.2e-05,1.5e-05,5.4e-05,3.7e-05,0.000107,2.2e-05,8.2e-05,4e-05,0.000113,7.9e-05,1.8e-05,5.2e-05,0.000103,8.1e-05,6.5e-05,3.1e-05,4.1e-05,5.8e-05,3.1e-05,6.1e-05,6e-06,9e-06,3.6e-05,4e-05,0.000132,0.000241,0.000979,0.000917,0.001232,0.001126,0.003431
0.000887,0.001226,0.000927,0.00206,0.001071,0.000983,0.001513,0.000812,0.0014,0.000919,0.001367,0.000876,0.000885,0.000591,0.000533,0.00053,0.00045,0.000494,0.000274,0.000276,0.000502,0.000497,0.00034,0.000361,9.4e-05,0.000476,0.000371,2.4e-05,0.000439,0.000322,0.000626,0.000581,0.000476,0.00016,0.000377,0.000396,0.000311,0.00042,0.000447,0.000187,0.000203,0.000278,0.000175,5.9e-05,0.000121,0.000136,0.000125,0.000111,0.00019,9.3e-05,0.000249,4.4e-05,0.000185,0.000152,5.3e-05,9e-05,5.6e-05,1e-04,7.1e-05,9.2e-05,0.000164,0.000147,6.9e-05,2e-05,6.8e-05,0.000193,9e-05,6.3e-05,8e-05,0.000102,9.5e-05,7.2e-05,9.4e-05,6.2e-05,7.5e-05,5.7e-05,6.3e-05,1.9e-05,3.4e-05,6.2e-05,4.3e-05,2.4e-05,2.2e-05,5.7e-05,5.4e-05,7.6e-05,6.8e-05,8.7e-05,7.8e-05,9e-05,5e-06,3.8e-05,3e-05,5.6e-05,9.5e-05,3.4e-05,7.5e-05,4.6e-05,6.5e-05,4.8e-05,4.4e-05,5.8e-05,5.5e-05,9.4e-05,6.6e-05,2e-05,3.6e-05,3.9e-05,2e-05,4.3e-05,1.7e-05,4e-06,2.1e-05,3.8e-05,0.00013,0.000157,0.000958,0.000714,0.001112,0.002731,0.001792
0.00117,0.001211,0.001507,0.001629,0.001026,0.00149,0.002255,0.001665,0.001025,0.001348,0.001213,0.000931,0.00078,0.000752,0.000728,0.000949,0.001211,0.000711,0.001096,0.000832,0.000356,0.000204,0.000944,0.000875,0.000243,0.000119,0.000514,0.000367,0.001009,0.000326,0.000528,0.000358,0.000133,0.000325,0.000539,0.000413,0.000344,0.000391,0.00038,0.000399,0.000283,0.000177,0.000188,8.2e-05,0.000291,0.000372,0.000161,0.000165,0.000212,1e-05,0.000144,2e-04,0.000268,8.5e-05,6e-05,0.000163,0.000125,8e-05,3e-05,0.000127,0.000194,0.000128,0.000101,3.5e-05,4.6e-05,0.000118,6.6e-05,0.000119,0.000102,3e-05,7.6e-05,0.000155,7.7e-05,5.8e-05,0.000116,6.6e-05,0.000128,0.000109,0.000164,9.7e-05,1.8e-05,3e-05,6.8e-05,0.000171,6e-05,0.000138,6.3e-05,0.000114,7.5e-05,4.8e-05,6.2e-05,7.1e-05,6.9e-05,8.5e-05,6.8e-05,7.8e-05,3.1e-05,5.9e-05,9.1e-05,3.4e-05,5.9e-05,0.000121,6.1e-05,1.5e-05,7.1e-05,4.6e-05,4.9e-05,4.7e-05,8e-05,5.9e-05,3.6e-05,1.7e-05,1.2e-05,6.6e-05,0.000106,0.000184,0.000837,0.000165,0.001057,0.001829,0.003487
0.001381,0.000394,0.00132,0.001189,0.001111,0.000933,0.000383,0.000243,0.000296,0.000609,0.001448,0.000663,0.001057,0.000217,0.000985,0.000695,0.000211,0.000357,0.000752,0.000645,0.000751,0.000624,0.000392,7e-05,0.000274,0.000386,0.000348,0.000702,0.000813,0.000631,0.000331,0.000395,0.000214,0.000197,0.000292,0.000393,0.000174,0.000561,7.9e-05,9.5e-05,7.2e-05,1.8e-05,0.000255,0.00033,0.000206,6.2e-05,0.000191,1e-04,0.00027,0.000303,0.000146,0.000243,0.000202,0.000157,0.000146,0.000218,8.7e-05,9.2e-05,5.8e-05,8.5e-05,3.6e-05,8.5e-05,3.9e-05,7.6e-05,1e-05,5.9e-05,8.5e-05,7.3e-05,1.6e-05,2.3e-05,0.000102,0.000121,0.000187,0.000117,0.000142,0.000141,0.000153,6.1e-05,8e-05,0.000127,0.000153,9e-05,0.000133,5.8e-05,0.000132,5.6e-05,8.3e-05,6.9e-05,7.3e-05,2.4e-05,8.7e-05,2.5e-05,5e-05,7.5e-05,9.2e-05,6.9e-05,0.000127,3.3e-05,5.5e-05,4.3e-05,0.000113,0.000131,0.000101,1.8e-05,0.00011,1.9e-05,1.7e-05,7e-05,1.3e-05,3.3e-05,5.3e-05,4.1e-05,3.1e-05,5.7e-05,8.6e-05,0.000202,0.000643,0.000223,0.000661,0.00193,0.002614
0.000752,0.000982,0.000294,0.001437,0.000705,0.000276,0.000841,0.000635,0.000282,0.000248,0.00088,0.000893,0.00147,0.000509,0.000389,6e-05,4e-04,0.000588,0.000274,0.000523,0.000125,0.000271,0.000173,7.4e-05,0.000153,0.000249,0.000336,0.000607,0.000377,0.000291,0.000114,0.000199,0.000146,0.000342,0.000304,0.000254,0.000198,0.000229,0.000174,6.9e-05,7.7e-05,0.000117,8e-05,0.00015,0.000237,0.000171,9.6e-05,8.5e-05,0.000103,0.000163,0.00011,0.000157,5.7e-05,8.4e-05,5.4e-05,9.9e-05,0.000106,0.000108,0.000109,4.7e-05,9.8e-05,2.1e-05,3.9e-05,7.4e-05,5.6e-05,3.8e-05,5.4e-05,4.7e-05,8.2e-05,7.3e-05,9.7e-05,9e-05,2.8e-05,3.5e-05,0.000105,4e-05,4.5e-05,8.2e-05,2.2e-05,5.8e-05,6.9e-05,4.8e-05,8.2e-05,5.1e-05,6e-05,4.9e-05,7.8e-05,2.1e-05,2.7e-05,2e-05,5.4e-05,6.8e-05,5.2e-05,9.3e-05,1.3e-05,2.7e-05,0.000128,9.6e-05,3.3e-05,6.9e-05,0.00012,3.2e-05,5.6e-05,1.6e-05,9.9e-05,7e-05,2.1e-05,0.000112,9.8e-05,6.6e-05,2.6e-05,4.6e-05,5.5e-05,4.4e-05,9.3e-05,0.000184,0.000674,0.00061,0.001116,0.001059,0.002966
0.000622,0.000477,0.000122,0.001343,0.000433,0.000193,0.000546,0.000375,0.000378,0.000193,0.000661,0.000892,0.000693,0.000459,0.000176,0.000222,0.000406,0.000201,0.000234,3e-04,0.000346,0.000328,0.000459,0.000136,7.2e-05,0.000354,0.00029,0.000235,0.000228,0.000251,8.1e-05,7.7e-05,0.000197,0.000117,0.000134,0.000324,0.000156,0.000262,9.1e-05,0.000191,2.4e-05,0.000165,0.000109,7.6e-05,0.000153,6.5e-05,9.6e-05,0.000105,5.2e-05,0.000135,4.6e-05,2.3e-05,8e-05,9.7e-05,0.000127,0.000158,9.6e-05,4.4e-05,9.3e-05,4.3e-05,0.000153,0.000102,1.5e-05,7.6e-05,5e-05,5.5e-05,6.8e-05,0.00011,1e-05,5.7e-05,8.4e-05,8.4e-05,3.1e-05,4e-05,7e-05,8.2e-05,3.4e-05,6.9e-05,6.5e-05,1.8e-05,0.000101,3.1e-05,4.7e-05,3.5e-05,7.3e-05,6.7e-05,7.1e-05,7.7e-05,8.6e-05,3.4e-05,5.6e-05,4.5e-05,3.7e-05,0.000107,0.000157,5.6e-05,0.000144,2.1e-05,6.9e-05,9.9e-05,0.000136,0.000134,0.000115,2.8e-05,8.6e-05,8.1e-05,0.000105,7.4e-05,4.6e-05,4.6e-05,6.8e-05,5.6e-05,0.000142,5.8e-05,0.000116,0.000154,0.000555,0.000772,0.000461,0.001784,0.003245
0.000693,0.000337,0.000406,0.001033,0.000641,0.000287,0.000923,0.000111,0.000396,0.000334,0.000682,0.000768,0.000902,0.000573,0.000252,0.000229,6.3e-05,0.00013,0.000268,0.000116,0.00044,0.000519,0.000377,0.000287,0.000332,0.000357,0.000446,0.000312,8e-05,0.000292,0.000273,0.000143,4.5e-05,8.5e-05,4.9e-05,0.000281,0.000264,0.000181,0.000199,8.5e-05,0.000157,7.8e-05,0.00012,0.000111,6e-06,7.9e-05,0.000126,0.000151,0.00017,0.000133,9.7e-05,4e-05,7.4e-05,0.000114,0.000193,0.00012,7.3e-05,0.000124,0.000121,2.3e-05,0.000135,6.5e-05,0.000103,9.3e-05,2.3e-05,4.7e-05,8.4e-05,4.3e-05,4.5e-05,9.1e-05,0.000112,6e-05,8e-05,4.4e-05,8.4e-05,6.6e-05,6.3e-05,0.000106,3.8e-05,5.8e-05,3.2e-05,8.9e-05,2.3e-05,5.4e-05,0.000124,6.7e-05,2.8e-05,7.1e-05,9.9e-05,9.8e-05,3.7e-05,3.2e-05,3.9e-05,0.000107,5.2e-05,4.7e-05,6.9e-05,7.3e-05,6.7e-05,6.3e-05,1.9e-05,5.6e-05,1.4e-05,7e-05,1.5e-05,7.2e-05,4.6e-05,1.9e-05,7.6e-05,0.000125,0.000177,0.000115,0.000191,0.000121,0.000103,3.3e-05,0.00091,0.000438,0.000734,0.002284,0.001413
0.000721,0.000139,0.000904,0.001374,0.000418,3.4e-05,0.000933,4.3e-05,0.000347,0.000433,0.000458,0.000289,0.000571,0.000672,0.000461,0.000516,0.000144,0.000132,0.000127,0.000554,0.000338,0.00049,0.000463,0.000371,0.00014,0.00046,0.00046,0.000202,0.000162,0.000131,0.000126,2.2e-05,0.000157,0.000358,0.000284,6e-06,8.8e-05,0.000259,0.000314,0.000103,0.000118,0.00024,9.7e-05,5.7e-05,3.3e-05,0.000142,0.000116,0.000172,1e-04,4.6e-05,0.000166,0.000118,3.9e-05,2.8e-05,0.000165,0.000131,6.7e-05,0.000147,0.000123,7.6e-05,0.000105,6.1e-05,0.000132,0.000119,8.2e-05,0.000103,0.000147,7.1e-05,6.6e-05,6.5e-05,3.4e-05,5e-05,5.4e-05,1.8e-05,6e-05,8.8e-05,8.5e-05,0.00011,7.9e-05,9.8e-05,5.7e-05,9.8e-05,6.6e-05,4.9e-05,3e-05,2.4e-05,2.6e-05,5.7e-05,6.4e-05,8.8e-05,9.7e-05,2.9e-05,0.000116,0.000132,1e-04,4.5e-05,3.8e-05,2.6e-05,4.9e-05,5.3e-05,2.5e-05,3.3e-05,4e-05,6.7e-05,6.2e-05,9.2e-05,8.3e-05,2.7e-05,6.7e-05,9e-05,8.6e-05,0.000154,3e-05,8.9e-05,0.000161,0.000142,0.001055,0.000761,0.002543,0.001762,0.001905
0.000943,0.000846,0.001427,0.000213,0.001072,0.000554,0.000398,0.000582,0.000639,0.000335,0.000518,9.5e-05,0.001116,0.000197,0.00032,0.000134,0.000441,0.000155,6.1e-05,0.000458,0.000363,0.000165,0.000337,4.5e-05,0.000183,0.000301,0.000242,0.000166,0.000292,3.2e-05,6.1e-05,8.8e-05,0.000179,0.000223,0.000143,8.4e-05,9.3e-05,0.000256,0.000173,0.000148,0.000161,0.00017,0.000107,7.3e-05,7.6e-05,9.3e-05,0.000166,0.000135,0.000131,8.8e-05,0.000136,9.8e-05,0.000143,8.8e-05,0.000202,0.000174,0.000178,8e-05,3.5e-05,4e-05,8.5e-05,2.6e-05,7.6e-05,9.5e-05,2.9e-05,8.7e-05,8e-05,4.9e-05,4e-05,2.2e-05,4.2e-05,3.3e-05,4.4e-05,3.1e-05,6.1e-05,6.3e-05,3.2e-05,0.000106,3.6e-05,6.3e-05,6.4e-05,6.9e-05,8.6e-05,2.4e-05,4.7e-05,4.6e-05,3.3e-05,2e-05,2.7e-05,7.3e-05,4.6e-05,4.9e-05,9.8e-05,6e-05,5.7e-05,3.3e-05,3.6e-05,8.3e-05,4e-05,3.4e-05,1e-05,3e-05,6e-05,6.4e-05,6e-06,1e-04,6.4e-05,8e-05,7.5e-05,1.8e-05,0.000102,4.3e-05,8.4e-05,6.1e-05,3.9e-05,9.7e-05,0.000695,0.000844,0.002628,0.002813,0.001311
0.000445,0.000537,0.000351,0.00053,0.00086,0.000201,0.000285,5.6e-05,7e-04,0.000716,0.001005,0.000366,0.000497,0.00015,0.000225,2.6e-05,0.000259,0.000216,5e-05,0.000383,0.000316,0.000143,0.000308,0.000149,8.7e-05,0.000178,0.000159,0.000229,4.7e-05,0.000147,0.000144,0.00015,0.000107,0.00019,0.000271,0.00019,8.5e-05,0.000184,0.000104,6.1e-05,7.8e-05,0.000127,6.1e-05,2.6e-05,5.4e-05,4.1e-05,5e-06,8.3e-05,5.6e-05,8.7e-05,0.000131,4.5e-05,0.000126,6.4e-05,0.000115,0.000181,1.3e-05,3.8e-05,8e-06,1.6e-05,7.6e-05,4.8e-05,2.3e-05,0.000125,7.1e-05,8.5e-05,1.4e-05,3.2e-05,3.8e-05,4.7e-05,4.6e-05,4.3e-05,3e-05,1.9e-05,6.8e-05,0.000128,4.9e-05,4.7e-05,4.7e-05,3.1e-05,2.3e-05,2.3e-05,3e-05,2.3e-05,3.9e-05,4.4e-05,4.7e-05,3.5e-05,2.2e-05,6.4e-05,6e-05,2.6e-05,6.7e-05,7.6e-05,6.8e-05,1.9e-05,1e-05,5.5e-05,0.000111,6.7e-05,1.9e-05,3.9e-05,2.8e-05,1.9e-05,1.1e-05,3.2e-05,1.8e-05,2.8e-05,3.5e-05,3.2e-05,9.8e-05,5.6e-05,7.2e-05,2.8e-05,4.5e-05,0.000212,0.000225,0.000412,0.002091,0.001764,0.00165
0.000176,0.000183,0.000179,0.000201,0.000109,0.000112,3e-04,4.5e-05,0.000106,0.000101,0.000281,1e-04,0.000347,0.000204,6.5e-05,5.4e-05,6.1e-05,7.4e-05,3.3e-05,0.000157,6.5e-05,0.000104,2.9e-05,9.2e-05,1.1e-05,0.000111,4.4e-05,7e-05,9.2e-05,3.8e-05,3.1e-05,5.9e-05,5.9e-05,9.9e-05,8.1e-05,6.7e-05,6.5e-05,0.00011,1.9e-05,1.2e-05,1.3e-05,7e-05,1.7e-05,1.7e-05,1.3e-05,6.4e-05,5.6e-05,8e-06,2.8e-05,3.4e-05,5.4e-05,4.1e-05,1.7e-05,3.6e-05,2.9e-05,8.5e-05,3e-05,2.1e-05,1.9e-05,2.6e-05,1.5e-05,1.8e-05,1.7e-05,4.5e-05,1.4e-05,3.6e-05,6e-06,1.3e-05,1.2e-05,2e-05,3.8e-05,1e-05,1.4e-05,1e-05,2.5e-05,3.3e-05,1.7e-05,5e-06,2.6e-05,8e-06,7e-06,1.1e-05,1.1e-05,2.3e-05,2.2e-05,1.8e-05,3.4e-05,8e-06,5e-06,1.7e-05,2.4e-05,2.5e-05,6e-06,4e-06,1e-05,3e-05,1.2e-05,1.2e-05,3.6e-05,1.7e-05,1e-05,9e-06,1.5e-05,3.1e-05,7e-06,2.6e-05,2.2e-05,2.9e-05,4.3e-05,1e-05,3.3e-05,9e-06,2.7e-05,1.9e-05,3.9e-05,4.9e-05,0.000129,0.000305,0.000822,0.000467,0.000854
0.00012,0.00019,5.4e-05,0.000334,0.000132,0.000133,0.000385,0.000221,0.000203,9.3e-05,0.000303,0.000126,0.000356,0.000205,3.4e-05,7.4e-05,6.1e-05,0.000123,6.8e-05,0.00015,4.4e-05,8.4e-05,3.2e-05,6.3e-05,8.7e-05,4e-05,8.6e-05,4.8e-05,0.000128,8.3e-05,5.7e-05,6.6e-05,8.6e-05,3.7e-05,8e-05,9.4e-05,2.6e-05,9.6e-05,1.5e-05,1.9e-05,5e-05,7.2e-05,3.7e-05,1e-06,1.1e-05,4.8e-05,5.7e-05,1.3e-05,1.9e-05,1.8e-05,4.1e-05,2.2e-05,1.8e-05,2.7e-05,3.1e-05,5.4e-05,1.9e-05,1.2e-05,4e-06,2.6e-05,1.1e-05,3.3e-05,4.7e-05,3.7e-05,9e-06,3.2e-05,1.7e-05,2e-05,6e-06,1e-05,2.9e-05,3.4e-05,9e-06,2.1e-05,2.5e-05,1.3e-05,1.1e-05,1.9e-05,6e-06,1.6e-05,2.5e-05,1.4e-05,2.6e-05,1.4e-05,7e-06,9e-06,1.1e-05,1.7e-05,2e-05,9e-06,1.7e-05,2e-06,9e-06,7e-06,7e-06,1.7e-05,1.9e-05,1.5e-05,3.7e-05,4e-05,1e-05,1.5e-05,3e-06,3.3e-05,3.8e-05,2.3e-05,1.4e-05,2.6e-05,1.5e-05,1.8e-05,1.2e-05,2.9e-05,1.6e-05,2e-05,5e-05,1.9e-05,0.000174,0.000229,0.00035,0.000346,0.000651
0.000236,7.5e-05,7.6e-05,0.000205,0.000127,0.000104,0.000217,0.000137,0.000152,5.6e-05,0.000216,0.000172,0.000133,8.1e-05,2.6e-05,0.000127,0.000127,3.2e-05,4.5e-05,0.000123,2.3e-05,0.00012,8.7e-05,5.1e-05,7.1e-05,9.9e-05,6.5e-05,4.3e-05,7.1e-05,5.6e-05,3.2e-05,4.6e-05,4e-05,2.4e-05,5.1e-05,6.4e-05,3.6e-05,9.5e-05,3.2e-05,1.5e-05,3.1e-05,6.6e-05,7e-06,2.8e-05,4.6e-05,2.6e-05,2.5e-05,1e-05,9e-06,1.9e-05,1.1e-05,1.3e-05,1e-05,2.8e-05,6e-06,4.1e-05,2e-05,2e-06,1.5e-05,3.1e-05,1.6e-05,6e-06,2.3e-05,3.3e-05,2.3e-05,2.5e-05,9e-06,1.6e-05,1.6e-05,1.5e-05,3e-05,3.6e-05,3.5e-05,2.7e-05,2.1e-05,8e-06,7e-06,1.5e-05,1.1e-05,1.8e-05,1.2e-05,1.7e-05,2e-06,1.1e-05,1.9e-05,1.5e-05,3e-06,1.5e-05,2e-06,8e-06,9e-06,1.9e-05,1.6e-05,2.1e-05,1.6e-05,1e-05,6e-06,1.8e-05,2e-06,9e-06,8e-06,2.3e-05,2.7e-05,6e-06,2.2e-05,5e-06,2.5e-05,1.3e-05,8e-06,1.1e-05,2.5e-05,1.9e-05,2.7e-05,9e-06,2.8e-05,4.2e-05,0.000142,8.9e-05,0.000251,0.000409,0.000385
2e-05,0.000127,0.000103,0.00034,2e-04,6.7e-05,0.000193,9.3e-05,0.000131,9.5e-05,0.000254,0.000241,0.000274,0.000136,3.5e-05,0.000116,1.6e-05,3.2e-05,4.1e-05,0.000111,6.2e-05,6.2e-05,6.2e-05,2.3e-05,4.5e-05,6.4e-05,7.6e-05,5.2e-05,8.9e-05,1.1e-05,5.9e-05,2.3e-05,4e-05,5.6e-05,5.4e-05,4.9e-05,6e-06,9.6e-05,1.9e-05,2.7e-05,3e-05,2.4e-05,2.8e-05,3.5e-05,3.2e-05,3.1e-05,3.6e-05,1.7e-05,8e-06,4.6e-05,3.6e-05,1.7e-05,1.7e-05,3e-05,1.7e-05,4.7e-05,1.8e-05,1.2e-05,2.2e-05,3.1e-05,1.2e-05,9e-06,1.3e-05,2.6e-05,1.4e-05,1.6e-05,2.8e-05,7e-06,2.2e-05,2.2e-05,1.5e-05,1.6e-05,1.4e-05,6e-06,1.6e-05,1.9e-05,1.2e-05,2.4e-05,9e-06,1e-06,1.7e-05,2.2e-05,4e-05,3e-05,6e-06,2e-05,1.6e-05,1.2e-05,1.4e-05,4e-06,6e-06,3e-06,1.9e-05,1e-05,2.3e-05,1.7e-05,1.6e-05,2.4e-05,4e-06,2.2e-05,1.1e-05,2e-05,1.1e-05,4e-06,2.4e-05,2.5e-05,3.3e-05,2.4e-05,2.2e-05,3.1e-05,5.5e-05,1.8e-05,1.7e-05,2e-05,2.6e-05,4.9e-05,0.000154,0.000137,0.000178,0.000311,0.000182
7e-05,5.9e-05,0.000113,0.000442,5.3e-05,2.3e-05,0.00021,9.6e-05,0.00012,9.4e-05,0.000235,0.000198,0.000295,8.3e-05,4.3e-05,0.000102,5.5e-05,2.8e-05,3.9e-05,8.6e-05,5.9e-05,7.4e-05,2.3e-05,5.1e-05,6e-06,7.7e-05,6e-05,8e-05,5.5e-05,2.4e-05,3.3e-05,2e-05,5.1e-05,4.3e-05,4.8e-05,4.6e-05,2.1e-05,7e-05,2e-05,3e-05,2.4e-05,3.5e-05,6e-06,2.1e-05,1.7e-05,3.8e-05,1.6e-05,2.1e-05,8e-06,3.4e-05,2.2e-05,1.2e-05,2.4e-05,2.1e-05,1.3e-05,4e-05,6e-06,1.1e-05,3.1e-05,3.1e-05,1e-05,8e-06,2.3e-05,2.7e-05,8e-06,1.6e-05,1.7e-05,1e-05,1.4e-05,6e-06,1.5e-05,1e-05,6e-06,9e-06,1.4e-05,2.4e-05,6e-06,1.2e-05,1e-05,1.2e-05,1.1e-05,9e-06,3.4e-05,3e-06,1.2e-05,1.3e-05,9e-06,8e-06,1e-05,7e-06,1.1e-05,1.2e-05,1.3e-05,1.4e-05,2.5e-05,1.3e-05,6e-06,2.7e-05,2.5e-05,1.4e-05,1.7e-05,5e-06,2.2e-05,9e-06,2.2e-05,1.6e-05,3.1e-05,2.5e-05,3.1e-05,3.6e-05,5e-05,5.2e-05,5.4e-05,2.3e-05,3.9e-05,5.4e-05,0.000177,0.000121,0.000138,0.000459,2.1e-05
3.5e-05,0.000101,0.000128,0.000441,0.000187,0.000139,0.000169,9.7e-05,9.8e-05,9.1e-05,0.000237,0.000161,0.000276,0.000147,8.5e-05,6.5e-05,1.5e-05,1.6e-05,1.1e-05,0.000109,3.2e-05,9e-05,3.3e-05,5e-05,7e-06,7.7e-05,4.6e-05,3.3e-05,6.3e-05,7e-05,4.7e-05,3.9e-05,4e-05,3.7e-05,4.4e-05,6.2e-05,2.9e-05,6.9e-05,3.1e-05,3e-05,5.1e-05,5e-05,1.9e-05,8e-06,2.4e-05,3.2e-05,1.2e-05,3.1e-05,2.3e-05,3.2e-05,9e-06,1.1e-05,2.3e-05,2.5e-05,1.7e-05,3.5e-05,9e-06,1.6e-05,2.1e-05,1e-05,3e-06,1e-06,2.2e-05,1.9e-05,9e-06,1.4e-05,2.4e-05,1.3e-05,9e-06,7e-06,4e-06,5e-06,3e-06,2e-05,9e-06,6e-06,5e-06,7e-06,1.6e-05,7e-06,2.1e-05,5e-06,2.5e-05,9e-06,1.4e-05,1e-05,5e-06,7e-06,5e-06,8e-06,1.3e-05,3.1e-05,2.1e-05,1.4e-05,2.2e-05,7e-06,1.4e-05,9e-06,1e-06,1.1e-05,2e-05,1e-05,1.7e-05,5e-06,6e-06,8e-06,1.6e-05,1.5e-05,3.5e-05,9e-06,7.4e-05,8.2e-05,3.9e-05,4.3e-05,3.4e-05,9.3e-05,0.000187,0.000133,0.000108,0.000587,0.000246
8.8e-05,3.8e-05,0.00015,0.000323,3.1e-05,0.000117,0.000227,0.000152,8.3e-05,8.6e-05,0.000233,0.000143,0.00028,7.1e-05,3.7e-05,6.9e-05,2.9e-05,8e-06,2.2e-05,9.3e-05,1.5e-05,7.4e-05,3.2e-05,4.6e-05,4.2e-05,5.7e-05,3.6e-05,6.4e-05,8.1e-05,4.2e-05,2.3e-05,1.8e-05,3.8e-05,3e-05,8e-05,3.7e-05,2.6e-05,8.1e-05,2.3e-05,7e-06,1.8e-05,3.3e-05,1.2e-05,2.5e-05,2.6e-05,3e-05,1.1e-05,1.6e-05,2.8e-05,2.6e-05,1.4e-05,3e-06,2.2e-05,2e-05,1.5e-05,4e-05,8e-06,1.6e-05,1.7e-05,3.1e-05,1e-05,1.2e-05,1.3e-05,2.9e-05,1.8e-05,1.8e-05,1.4e-05,1.1e-05,1e-05,1.2e-05,3e-06,4e-06,1.2e-05,9e-06,9e-06,1.5e-05,6e-06,1.2e-05,1.2e-05,2e-05,1.4e-05,2.5e-05,1.6e-05,1.3e-05,1.4e-05,8e-06,9e-06,2e-05,1.1e-05,1.4e-05,1e-06,1.3e-05,5e-06,1e-05,2.2e-05,8e-06,1.7e-05,1e-06,1.6e-05,1.4e-05,1.2e-05,6e-06,1.1e-05,1.8e-05,1.9e-05,7e-06,1.4e-05,3.9e-05,3.1e-05,4.4e-05,6.5e-05,3e-05,6.2e-05,3.6e-05,5.9e-05,6.8e-05,0.000185,0.000152,5.7e-05,0.000286,0.000337
9.4e-05,6.4e-05,9.9e-05,0.000294,6.9e-05,7.6e-05,0.000203,0.000134,3.9e-05,9.9e-05,0.000235,0.000123,0.000234,4.6e-05,4.7e-05,6.8e-05,2.2e-05,9e-06,4.3e-05,8e-05,3.3e-05,8.4e-05,5.8e-05,1.9e-05,2.5e-05,9e-05,3.8e-05,4.8e-05,8.6e-05,4.2e-05,3.7e-05,3.6e-05,6.7e-05,3.9e-05,6.7e-05,4.1e-05,5e-06,8.8e-05,4.8e-05,2.2e-05,2.4e-05,4.9e-05,2.2e-05,1.5e-05,3.1e-05,4.8e-05,2.4e-05,1.1e-05,2.7e-05,3.7e-05,2.2e-05,3e-06,1.1e-05,3.1e-05,5e-06,3.9e-05,4e-06,1e-05,6e-06,9e-06,9e-06,1.7e-05,1.5e-05,1.6e-05,1.3e-05,8e-06,5e-06,1.2e-05,1.4e-05,3e-06,8e-06,1.3e-05,1.8e-05,1e-05,1.3e-05,1.5e-05,5e-06,1.7e-05,9e-06,1.6e-05,2.2e-05,2.5e-05,3.4e-05,1.9e-05,7e-06,8e-06,1.4e-05,1.5e-05,1.2e-05,9e-06,8e-06,9e-06,8e-06,1e-05,1.7e-05,1.9e-05,7e-06,1.1e-05,1e-05,6e-06,2e-05,8e-06,7e-06,1.9e-05,1.9e-05,3.6e-05,1.6e-05,5.3e-05,6.4e-05,3.3e-05,6.9e-05,0.000117,9.2e-05,6.9e-05,6.8e-05,5.3e-05,0.000155,0.000112,0.000166,0.000268,0.000374
6.4e-05,9.1e-05,8.3e-05,0.000301,0.000116,7.7e-05,0.000131,7.2e-05,9.8e-05,5.7e-05,0.000181,0.000125,0.000294,0.000114,3.9e-05,3.2e-05,2e-05,1.6e-05,1e-05,8.4e-05,4.6e-05,4.7e-05,2.8e-05,1.1e-05,8e-06,7.6e-05,4.1e-05,4.2e-05,7.5e-05,3e-05,2.2e-05,4e-05,2.6e-05,2.3e-05,6.1e-05,5.3e-05,7e-06,7.1e-05,3.5e-05,1.8e-05,1.7e-05,3.5e-05,8e-06,6e-06,6e-06,2.3e-05,2e-05,1e-06,1e-05,1.7e-05,1e-05,4e-06,5e-06,2.3e-05,1.3e-05,3.5e-05,1.1e-05,9e-06,2.1e-05,1e-05,1.4e-05,1.2e-05,1.2e-05,1.5e-05,6e-06,2.5e-05,1.6e-05,2e-06,9e-06,7e-06,1.4e-05,6e-06,7e-06,9e-06,9e-06,1.3e-05,5e-06,1.8e-05,7e-06,2e-06,7e-06,4e-06,2.2e-05,8e-06,7e-06,4e-06,1e-05,9e-06,8e-06,7e-06,7e-06,9e-06,1.4e-05,1.1e-05,9e-06,1.5e-05,9e-06,3e-06,2.5e-05,1.8e-05,8e-06,1.2e-05,8e-06,1.3e-05,3.1e-05,5.5e-05,3.8e-05,4.3e-05,1.7e-05,9.2e-05,7.5e-05,0.000131,0.000115,9.6e-05,8.1e-05,6e-05,0.000155,7.5e-05,7.1e-05,0.000268,0.000214
2.5e-05,9.3e-05,0.000102,0.000272,8.9e-05,6.8e-05,0.000196,6.1e-05,7.3e-05,7.4e-05,0.000173,0.000169,0.000243,9.4e-05,1.9e-05,5.1e-05,2.5e-05,1.5e-05,2.3e-05,7.1e-05,4.2e-05,4.2e-05,4.3e-05,3.4e-05,5e-06,6e-05,4.8e-05,5.7e-05,5.9e-05,3.4e-05,1.6e-05,2.3e-05,2.8e-05,3.1e-05,6.6e-05,3.3e-05,2.4e-05,6e-05,4.2e-05,2.2e-05,1.6e-05,2.7e-05,4e-06,1.1e-05,1.9e-05,1.9e-05,3e-05,1e-05,1.1e-05,1.9e-05,2e-05,7e-06,8e-06,2.3e-05,7e-06,3.2e-05,6e-06,1.6e-05,9e-06,1.8e-05,1e-05,5e-06,1.1e-05,1.5e-05,5e-06,1.5e-05,1.5e-05,4e-06,5e-06,9e-06,7e-06,1.1e-05,1e-06,7e-06,3e-06,1.8e-05,1.2e-05,8e-06,1.1e-05,9e-06,3e-06,3e-06,5e-06,9e-06,7e-06,1e-05,2e-06,5e-06,4e-06,1.2e-05,3e-06,8e-06,7e-06,1.6e-05,8e-06,7e-06,8e-06,2e-05,2e-05,1.5e-05,1.7e-05,1.3e-05,1.5e-05,2.4e-05,3.9e-05,4.8e-05,6.7e-05,1.5e-05,3.2e-05,9.2e-05,0.000118,6.9e-05,4.9e-05,4.1e-05,1.4e-05,3.9e-05,0.000214,3.6e-05,0.000157,0.000202,0.000255
6e-06,5.3e-05,0.000118,0.000303,8.3e-05,2.7e-05,0.000187,9e-05,5e-05,7.7e-05,0.000185,0.000129,0.000217,9.2e-05,2.8e-05,6.7e-05,2.3e-05,1.5e-05,2.4e-05,7.4e-05,4.2e-05,3.3e-05,2.6e-05,3.9e-05,3.6e-05,8.7e-05,4.2e-05,6.2e-05,8.8e-05,4.3e-05,1.5e-05,1.3e-05,3.3e-05,3.1e-05,6.4e-05,4.1e-05,1.8e-05,6.4e-05,3.3e-05,4e-06,1.7e-05,3e-05,2e-06,1.5e-05,2.9e-05,2.2e-05,1e-05,2.4e-05,1.8e-05,2.4e-05,2.4e-05,7e-06,1e-05,2e-05,6e-06,3.3e-05,1.1e-05,8e-06,8e-06,1.5e-05,1.3e-05,5e-06,1.3e-05,9e-06,4e-06,1.5e-05,1.5e-05,5e-06,1.3e-05,1e-06,4e-06,6e-06,6e-06,1.1e-05,1.2e-05,6e-06,6e-06,8e-06,7e-06,5e-06,5e-06,5e-06,1.4e-05,8e-06,4e-06,1e-06,1e-05,3e-06,7e-06,7e-06,1e-06,1.3e-05,1.2e-05,1.3e-05,1.8e-05,3e-06,7e-06,3.3e-05,2.8e-05,1.5e-05,2.5e-05,3e-05,2.7e-05,2.7e-05,2.7e-05,6.7e-05,2.1e-05,6.3e-05,7.4e-05,6.3e-05,6.9e-05,7.3e-05,2.4e-05,4.2e-05,7e-06,1.7e-05,0.000185,6.3e-05,0.000107,0.000266,0.000119
2.6e-05,9.1e-05,0.000115,0.000317,7.1e-05,1.9e-05,0.000185,6e-05,7.4e-05,7e-05,0.000172,0.000166,0.000243,8.4e-05,7e-06,6.2e-05,4e-05,2e-05,1.4e-05,7.8e-05,3.3e-05,2.8e-05,3.8e-05,1.9e-05,2.6e-05,5.7e-05,4.2e-05,4.5e-05,6.7e-05,1.9e-05,1.8e-05,3.2e-05,2.9e-05,4.2e-05,6.2e-05,4.1e-05,1.4e-05,5.2e-05,3.2e-05,1.5e-05,1.9e-05,3e-05,5e-06,1e-05,7e-06,2.2e-05,2e-05,1.3e-05,1e-05,2.8e-05,2.1e-05,1.5e-05,1.2e-05,2.4e-05,1.1e-05,3.8e-05,1.2e-05,6e-06,8e-06,1.7e-05,1.1e-05,5e-06,1.4e-05,2.5e-05,5e-06,2.3e-05,1.3e-05,9e-06,1.5e-05,8e-06,8e-06,6e-06,1e-05,1e-06,1.5e-05,4e-06,1.3e-05,1e-05,1e-05,8e-06,3e-06,6e-06,1e-05,5e-06,9e-06,7e-06,9e-06,9e-06,1e-06,6e-06,1e-06,1.4e-05,9e-06,4e-06,1.4e-05,1.3e-05,7e-06,3.3e-05,2e-05,5.2e-05,4.9e-05,4.8e-05,7e-06,6e-06,2.1e-05,4.3e-05,6.8e-05,2.4e-05,1.8e-05,2.7e-05,6.7e-05,9.6e-05,5.4e-05,6.2e-05,5.3e-05,4e-06,0.00017,6.5e-05,0.000117,0.000299,7.8e-05
7.5e-05,7.3e-05,4.7e-05,0.000317,0.000131,3e-05,0.000193,8.3e-05,9.4e-05,7.4e-05,0.000195,0.00012,0.000267,6.3e-05,7e-06,3e-05,1.7e-05,2.1e-05,1.2e-05,6.7e-05,3.7e-05,5.8e-05,1.2e-05,2.3e-05,2e-05,6.7e-05,4.4e-05,2.8e-05,5.8e-05,2.3e-05,1.3e-05,2.9e-05,2.6e-05,3.7e-05,5.7e-05,5.3e-05,1.7e-05,5.9e-05,1.6e-05,1.4e-05,1.3e-05,1.9e-05,1e-05,1.5e-05,1.8e-05,2.6e-05,1.1e-05,1.1e-05,7e-06,1.7e-05,2.4e-05,1e-05,1.1e-05,4e-05,1.8e-05,3.1e-05,1.4e-05,4e-06,1e-05,1.6e-05,8e-06,1e-05,7e-06,1.1e-05,5e-06,2.2e-05,9e-06,7e-06,7e-06,9e-06,2e-06,7e-06,1.2e-05,4e-06,1.7e-05,1e-05,5e-06,9e-06,7e-06,1e-05,8e-06,2e-06,8e-06,0,5e-06,7e-06,4e-06,7e-06,1.4e-05,6e-06,6e-06,6e-06,5e-06,5e-06,1e-05,5e-06,9e-06,2.2e-05,1.1e-05,3.3e-05,4.3e-05,8e-06,1.9e-05,1.2e-05,1.9e-05,2.7e-05,1.1e-05,2.5e-05,2.3e-05,5.8e-05,4.4e-05,8.5e-05,7.4e-05,5.2e-05,8.5e-05,5.5e-05,0.000128,7.9e-05,0.000229,0.000352,0.00016
1.9e-05,8.4e-05,7.8e-05,0.000264,8.6e-05,1.2e-05,0.000183,8.5e-05,7e-05,6.5e-05,0.000178,0.000103,0.000251,1e-04,4.3e-05,5.3e-05,2e-06,2.7e-05,1.7e-05,7e-05,4.6e-05,5e-05,1.7e-05,2.3e-05,1.3e-05,7.1e-05,5.2e-05,4.3e-05,6.5e-05,3.2e-05,3e-06,8e-06,4.4e-05,4e-05,5.2e-05,4.8e-05,1.5e-05,7.2e-05,3.4e-05,6e-06,2.8e-05,2.9e-05,1e-05,8e-06,1.5e-05,3.3e-05,1.4e-05,1.7e-05,1.7e-05,1.8e-05,2.1e-05,4e-06,1.8e-05,2e-05,1.2e-05,3.6e-05,5e-06,1.2e-05,1.5e-05,1.8e-05,6e-06,7e-06,6e-06,1e-05,5e-06,1.6e-05,5e-06,3e-06,2e-06,1.2e-05,1e-05,8e-06,1e-05,1.2e-05,1.4e-05,4e-06,3e-06,7e-06,2e-06,7e-06,4e-06,6e-06,1.9e-05,9e-06,8e-06,1.1e-05,0,1e-05,1e-05,2e-06,9e-06,1.7e-05,1.3e-05,1.2e-05,1.1e-05,3e-06,9e-06,7e-06,2.2e-05,5e-06,1.8e-05,1.4e-05,2e-05,1.7e-05,2e-06,2.4e-05,1.7e-05,1.7e-05,2.7e-05,1.7e-05,3.8e-05,5e-05,1.5e-05,4.1e-05,3.5e-05,4e-05,0.000143,5.7e-05,0.000209,0.000149,0.000238
7e-05,6.5e-05,7.2e-05,0.000293,4.5e-05,3.8e-05,0.00021,4.5e-05,5.6e-05,6.7e-05,0.000153,0.000188,0.000224,7.7e-05,3.3e-05,5.6e-05,2.5e-05,2.5e-05,4.6e-05,7.9e-05,3.3e-05,3.9e-05,3.2e-05,9e-06,2.9e-05,5.9e-05,4e-05,4e-05,7.6e-05,1.7e-05,2.5e-05,1.1e-05,2.8e-05,3.6e-05,5.1e-05,4.1e-05,2.2e-05,5.9e-05,3.7e-05,1.6e-05,2.5e-05,1.6e-05,2e-06,5e-06,2.4e-05,1.7e-05,1.1e-05,8e-06,1.3e-05,2.7e-05,2.1e-05,4e-06,8e-06,1.6e-05,8e-06,2.6e-05,5e-06,7e-06,1.7e-05,8e-06,8e-06,1e-05,7e-06,1.4e-05,1e-06,1e-05,1.1e-05,2e-06,6e-06,8e-06,4e-06,4e-06,1.1e-05,2e-06,3e-06,9e-06,3e-06,6e-06,7e-06,5e-06,1.1e-05,4e-06,1.7e-05,6e-06,1.1e-05,1e-05,7e-06,9e-06,1e-05,2e-06,8e-06,1.3e-05,3e-06,1.5e-05,4e-06,3e-06,1e-05,3e-06,2.6e-05,8e-06,6e-06,8e-06,1.9e-05,1.3e-05,1e-05,2.9e-05,1.6e-05,3.3e-05,4e-06,1.1e-05,3.6e-05,2.4e-05,9e-06,2.6e-05,3.1e-05,3.7e-05,0.000159,7.1e-05,0.00012,0.000191,0.000372
4.3e-05,6.6e-05,7.2e-05,0.000229,0.000101,5.7e-05,0.000199,0.000114,4.4e-05,5.1e-05,0.000169,0.000149,0.000246,0.000102,1.7e-05,4.1e-05,1.1e-05,2.4e-05,3.2e-05,5.3e-05,4e-05,5.2e-05,2.4e-05,1.4e-05,5e-06,6.6e-05,3.1e-05,3e-05,6.7e-05,2.2e-05,2.2e-05,2e-05,2.9e-05,3.3e-05,5.9e-05,3.6e-05,2.2e-05,6.3e-05,2.7e-05,1.3e-05,2.2e-05,2.6e-05,9e-06,3e-06,1.3e-05,2.3e-05,1e-05,2e-05,1.4e-05,1.8e-05,1.7e-05,7e-06,1.1e-05,2.1e-05,1.2e-05,2.2e-05,6e-06,4e-06,9e-06,1.4e-05,1.2e-05,3e-06,2e-06,1.4e-05,4e-06,1.5e-05,1.3e-05,1e-05,7e-06,2e-06,7e-06,6e-06,5e-06,5e-06,7e-06,7e-06,2e-06,8e-06,7e-06,5e-06,7e-06,4e-06,1e-05,1e-05,1e-05,3e-06,2e-06,5e-06,2e-06,4e-06,7e-06,1.4e-05,8e-06,6e-06,1.1e-05,5e-06,4e-06,6e-06,1.9e-05,1.6e-05,1.4e-05,5e-06,2e-05,5e-06,3e-06,2.1e-05,2e-05,4e-05,2.4e-05,2.5e-05,8.1e-05,4.2e-05,1.9e-05,1.8e-05,8e-06,2.1e-05,0.000169,9.4e-05,0.000128,0.000293,0.000409
2.1e-05,6e-05,8.2e-05,0.000241,6.6e-05,3.4e-05,0.000158,5.9e-05,4.8e-05,5.9e-05,0.000182,0.000144,0.000223,7.2e-05,1.4e-05,2.9e-05,1.7e-05,2.7e-05,2e-05,6.6e-05,3.8e-05,3.7e-05,1.5e-05,3.3e-05,1.4e-05,7.2e-05,3.5e-05,3.5e-05,6.1e-05,1.6e-05,6e-06,1.2e-05,3e-05,3.2e-05,4.9e-05,4e-05,2e-05,6.2e-05,2.4e-05,9e-06,1.4e-05,2.9e-05,2e-06,5e-06,1.7e-05,2.6e-05,1.1e-05,1.6e-05,1.8e-05,2.5e-05,1e-05,9e-06,4e-06,2.5e-05,1.3e-05,2.5e-05,2e-06,1e-06,8e-06,1.7e-05,1.3e-05,8e-06,5e-06,1.6e-05,4e-06,7e-06,1e-06,3e-06,4e-06,5e-06,4e-06,6e-06,1e-06,7e-06,1e-05,9e-06,3e-06,1e-05,3e-06,4e-06,3e-06,7e-06,1.6e-05,7e-06,5e-06,3e-06,4e-06,5e-06,9e-06,3e-06,3e-06,1.3e-05,1e-05,9e-06,9e-06,8e-06,6e-06,0,9e-06,6e-06,8e-06,6e-06,2e-05,4e-06,2e-06,9e-06,8e-06,2.2e-05,1.6e-05,4e-05,5.4e-05,2.5e-05,4e-05,3.4e-05,2.4e-05,2.2e-05,0.00017,7.6e-05,0.000115,0.000328,0.000339
2.7e-05,7.1e-05,9.8e-05,0.00025,5.3e-05,3.2e-05,0.000146,9.1e-05,7.4e-05,6.7e-05,0.000176,0.000146,0.000213,6.9e-05,2.2e-05,2.9e-05,1e-05,2.2e-05,1.9e-05,7.3e-05,4.3e-05,4.2e-05,2.6e-05,2.5e-05,1.3e-05,6.3e-05,3.9e-05,3e-05,6.7e-05,1.6e-05,7e-06,1.3e-05,2.9e-05,3e-05,5.6e-05,3.6e-05,1.7e-05,5.8e-05,2.1e-05,6e-06,1.8e-05,3.1e-05,6e-06,4e-06,2.2e-05,1.8e-05,1.4e-05,1.6e-05,1.3e-05,2.3e-05,1.3e-05,5e-06,3e-06,1.7e-05,9e-06,3.1e-05,4e-06,4e-06,1e-05,1.2e-05,1.4e-05,5e-06,5e-06,1.3e-05,4e-06,7e-06,9e-06,3e-06,7e-06,4e-06,4e-06,7e-06,1e-06,5e-06,7e-06,8e-06,1e-06,1e-05,2e-06,3e-06,6e-06,4e-06,9e-06,6e-06,8e-06,3e-06,3e-06,2e-06,6e-06,2e-06,3e-06,1.1e-05,7e-06,8e-06,9e-06,7e-06,9e-06,2e-06,1.8e-05,5e-06,5e-06,8e-06,1.4e-05,2e-06,5e-06,1e-06,1e-05,1.2e-05,9e-06,1.2e-05,3.7e-05,7e-06,1.6e-05,5e-06,6e-06,2.1e-05,0.000159,5.2e-05,0.000118,0.00029,0.000192
1e-05,5.5e-05,8.8e-05,0.000247,7e-05,2.6e-05,0.000154,8.1e-05,5e-05,5.8e-05,0.000178,0.000135,0.000225,8.1e-05,2e-05,3.4e-05,9e-06,2.1e-05,1.6e-05,6.9e-05,4.1e-05,3.8e-05,1.8e-05,1.5e-05,9e-06,6.6e-05,4.1e-05,3.4e-05,5.9e-05,1.5e-05,7e-06,1.2e-05,3.3e-05,3.1e-05,5.7e-05,3.9e-05,1.9e-05,6.6e-05,2.3e-05,6e-06,1.5e-05,2.9e-05,2e-06,2e-06,1.6e-05,2.4e-05,1.4e-05,1.6e-05,1.6e-05,2.1e-05,1.5e-05,3e-06,8e-06,1.8e-05,8e-06,3.2e-05,1e-06,4e-06,1.2e-05,1.2e-05,1.1e-05,7e-06,3e-06,1.4e-05,1e-06,9e-06,8e-06,3e-06,5e-06,2e-06,4e-06,6e-06,2e-06,5e-06,8e-06,8e-06,1e-06,1e-05,2e-06,3e-06,6e-06,3e-06,9e-06,5e-06,7e-06,4e-06,2e-06,1e-06,5e-06,2e-06,1e-06,1e-05,7e-06,7e-06,1e-05,4e-06,9e-06,3e-06,1.4e-05,5e-06,7e-06,4e-06,1.2e-05,3e-06,6e-06,1e-06,1e-05,4e-06,5e-06,7e-06,3e-05,3e-06,6e-06,8e-06,5e-06,2e-05,0.000151,5.2e-05,0.000107,0.000256,0.00019
2.1e-05,6.1e-05,9.4e-05,0.000228,6.3e-05,3.9e-05,0.000157,6.6e-05,4.9e-05,6.3e-05,0.000182,0.000138,0.000211,7.2e-05,1.4e-05,3.3e-05,5e-06,1.9e-05,1.9e-05,6.6e-05,3.9e-05,3.7e-05,1.2e-05,2.4e-05,1.1e-05,6.3e-05,4e-05,3.3e-05,6.2e-05,1.9e-05,8e-06,1.7e-05,3e-05,2.6e-05,5.2e-05,3.9e-05,1.7e-05,5.8e-05,1.9e-05,5e-06,1.5e-05,2.7e-05,2e-06,4e-06,1.3e-05,2.5e-05,1.4e-05,1.4e-05,1.6e-05,2.1e-05,1.3e-05,5e-06,6e-06,1.8e-05,9e-06,3.1e-05,2e-06,3e-06,1.1e-05,1.3e-05,1.1e-05,7e-06,1e-06,1.6e-05,0,8e-06,7e-06,2e-06,6e-06,1e-06,3e-06,6e-06,2e-06,5e-06,8e-06,7e-06,1e-06,1e-05,1e-06,2e-06,7e-06,2e-06,1e-05,6e-06,7e-06,4e-06,2e-06,2e-06,5e-06,3e-06,2e-06,1.1e-05,7e-06,6e-06,8e-06,4e-06,9e-06,3e-06,1.4e-05,6e-06,6e-06,5e-06,1.1e-05,2e-06,6e-06,0,9e-06,2e-06,6e-06,5e-06,2.8e-05,2e-06,5e-06,7e-06,5e-06,2e-05,0.000153,5.3e-05,0.000131,0.000229,0.000145
