-0.000461,-0.000801,-0.000592,-0.00034,-0.000102,-3.7e-05,-3.3e-05,-8e-06,1e-06,5e-06,2.6e-05,3e-05,1.6e-05,1.2e-05,7e-06,3e-06,4e-06,8e-06,-0.000166,-0.000981,-0.000712,-0.000262,-5.2e-05,-3.2e-05,-4e-05,-1.1e-05,-7e-06,-2e-06
-0.000101,-0.000235,-0.000406,-0.000246,-9.7e-05,-3.9e-05,-4.7e-05,-1.7e-05,-6e-06,-1e-06,2.2e-05,2.8e-05,1.4e-05,1.7e-05,1.9e-05,7e-06,3e-06,6e-06,-1e-06,-0.000125,-0.000126,-0.000167,-4.6e-05,-2.8e-05,-4e-05,-5e-06,-6e-06,-3e-06
2.4e-05,-0.000171,-6e-05,7e-06,-3e-05,-3.6e-05,-3.7e-05,-1.1e-05,-4e-06,-4e-06,1.4e-05,1.3e-05,0,-7e-06,-1.7e-05,-5e-06,1e-06,4e-06,-0.000101,-0.000622,-0.000437,-0.000124,-4.9e-05,-2.3e-05,-9e-06,-5e-06,-9e-06,-8e-06
0.000164,0.000298,0.000435,0.000245,7.9e-05,2.9e-05,1.9e-05,1.7e-05,1.3e-05,8e-06,2.1e-05,1.9e-05,5e-06,5e-06,4e-06,2e-06,6e-06,9e-06,6.7e-05,0.000343,0.000274,0.000179,6.1e-05,2.9e-05,3.6e-05,1.9e-05,3e-06,0
0.000169,0.000472,0.000336,0.000155,8.5e-05,5.1e-05,3.3e-05,2.1e-05,1.6e-05,1.2e-05,2.3e-05,1.6e-05,1e-06,3e-06,0,2e-06,7e-06,8e-06,0.000192,0.00102,0.000699,0.000251,0.00011,5.9e-05,2.4e-05,1.3e-05,2e-06,2e-06
-0.000139,-0.000102,-0.000223,-0.000154,-2.2e-05,-1e-05,-5e-06,0,4e-06,1e-06,1.2e-05,3e-06,-5e-06,-6e-06,-1.5e-05,-5e-06,1e-06,0,-7.6e-05,-0.00047,-0.000398,-0.000128,1.3e-05,1e-05,-2.8e-05,-2.1e-05,-1.3e-05,-7e-06
-9.4e-05,-0.000197,-0.000285,-0.000168,-4.9e-05,-1.6e-05,-1.5e-05,-9e-06,5e-06,-2e-06,1.1e-05,9e-06,2e-06,5e-06,5e-06,1e-06,0,0,-8.2e-05,-0.000479,-0.000313,-0.000164,-3e-05,-2.2e-05,-3.3e-05,-1.2e-05,-7e-06,-5e-06
0.000103,-4.3e-05,6e-06,4.5e-05,-1e-05,1e-06,-1e-06,-4e-06,1.1e-05,3e-06,1.4e-05,1.2e-05,3e-06,6e-06,-2e-06,0,1e-06,5e-06,2.1e-05,0.000107,0.000179,2.2e-05,-1.5e-05,-8e-06,8e-06,1e-05,5e-06,4e-06
8.2e-05,8.8e-05,0.000213,0.000122,-2e-06,-1.7e-05,3e-06,5e-06,1.4e-05,9e-06,1.6e-05,7e-06,3e-06,7e-06,0,-3e-06,0,9e-06,5e-06,-4.1e-05,-4.8e-05,5.8e-05,1.1e-05,1e-06,3.1e-05,1e-05,0,2e-06
-4.2e-05,6.4e-05,7.8e-05,2e-05,-1e-06,-1.7e-05,1e-05,1.1e-05,9e-06,1.3e-05,1.9e-05,9e-06,1e-06,1e-05,9e-06,-1e-06,3e-06,1.3e-05,0.000105,0.000487,0.000245,0.000101,2e-05,-1e-06,1.8e-05,5e-06,-4e-06,-1e-06
-0.000176,-0.000214,-0.000203,-9.8e-05,6e-06,-1e-06,1.8e-05,1e-05,1e-06,8e-06,1.5e-05,7e-06,-5e-06,6e-06,0,-2e-06,3e-06,1e-05,7.3e-05,0.000318,0.000158,1.4e-05,1e-06,1.2e-05,1e-06,-1e-06,1e-06,3e-06
-1.8e-05,-8.7e-05,-0.000151,-4.2e-05,7e-06,-1e-06,1.5e-05,7e-06,-3e-06,0,7e-06,7e-06,-6e-06,2e-06,5e-06,0,1e-06,7e-06,-7.4e-05,-5e-04,-0.000357,-0.00012,4e-06,1.9e-05,-1e-06,-5e-06,5e-06,6e-06
0.000229,0.000211,0.000109,0.000105,1e-06,-1e-06,5e-06,5e-06,2e-06,0,5e-06,1.7e-05,5e-06,4e-06,5e-06,3e-06,3e-06,7e-06,-4.4e-05,-0.000276,-8.2e-05,-1.3e-05,8e-06,0,4e-06,4e-06,9e-06,7e-06
1.2e-05,-7e-05,0.000109,3.2e-05,-3.6e-05,-1.3e-05,-1.5e-05,-2e-06,8e-06,5e-06,4e-06,1.3e-05,7e-06,2e-06,0,3e-06,2e-06,5e-06,0,-1e-05,6.2e-05,7.1e-05,8e-06,-5e-06,-2e-06,1e-06,3e-06,3e-06
-0.000207,-0.000306,-8.5e-05,-9.7e-05,-4.5e-05,-3e-05,-2.8e-05,-9e-06,7e-06,1.1e-05,7e-06,8e-06,6e-06,-1e-06,2e-06,2e-06,-1e-06,1e-06,1.6e-05,7.2e-05,1e-06,4.4e-05,8e-06,-6e-06,-1.3e-05,-9e-06,-6e-06,-6e-06
8e-06,8.7e-05,-6.5e-05,-8e-06,1.9e-05,-7e-06,-8e-06,-4e-06,6e-06,1.4e-05,1.2e-05,1.4e-05,1.5e-05,3e-06,-1e-06,3e-06,1e-06,1e-06,8.3e-05,0.000473,0.000308,8.1e-05,-7e-06,-1.1e-05,-2e-06,-1e-06,-1e-06,-8e-06
9.4e-05,0.00018,-3e-06,4.8e-05,4.5e-05,1.3e-05,1.7e-05,4e-06,5e-06,7e-06,8e-06,1e-05,1.1e-05,1e-06,-4e-06,1e-06,-1e-06,-3e-06,2.3e-05,0.00014,9.3e-05,1e-05,0,9e-06,1.5e-05,3e-06,0,-6e-06
-2.4e-05,-0.000117,-4.2e-05,-1.7e-05,-8e-06,-1e-06,2e-05,9e-06,2e-06,-2e-06,2e-06,8e-06,9e-06,-2e-06,-2e-06,1e-06,0,-3e-06,-8e-05,-0.000481,-0.000344,-0.000104,9e-06,1e-05,1e-05,-2e-06,-1e-05,-6e-06
-2.6e-05,-6.9e-05,2.9e-05,-4.7e-05,-4.9e-05,-3e-06,9e-06,7e-06,0,-3e-06,0,6e-06,8e-06,-1e-06,-6e-06,-1e-06,1e-06,0,-3.6e-05,-0.00025,-0.000177,-4.3e-05,3e-06,-1.5e-05,-7e-06,-2e-06,-1e-05,-3e-06
