1e-06,4e-06,1e-05,1.1e-05,5e-06,5e-06,5e-06,4e-06,1e-05,6e-06,0,4e-06,3e-06,4e-06,0,8e-06,1.4e-05,4e-06,2e-06,5.2e-05,2e-06,6e-06,1e-05,0.00013,0.000122,0.000107,2.7e-05,3.4e-05,0.000219,0.000138,6.5e-05,5.1e-05,9.1e-05,3.5e-05,1e-06,0.000418,2.2e-05,0.000264,0.000533,0.000395,0.000302,1.5e-05,0.00021,0.000157,0.000205,0.000393,0.00011,0.000368,0.000205,0.000274,0.000543,0.000239,0.000327,0.000196,0.000313,0.000755,0.000204,0.000175,0.000338,5e-04,0.000165,0.000154,0.000101,0.000382,0.000564,0.000368,0.00049,0.000604,3.1e-05,3.6e-05,0.000194,0.000164,5.6e-05,4e-05,0.000112,5.2e-05,5e-06,1.8e-05,8.8e-05,3.9e-05,9e-06,2e-06,6.2e-05,5e-06,1.6e-05,2.4e-05,1.8e-05,1e-06,7.5e-05,1.5e-05,3.9e-05,2.9e-05,2.7e-05,3e-06,2e-06,1.2e-05,2e-06,3.4e-05,2.6e-05,2e-06,1.6e-05,5e-06,1.6e-05,4e-06,1.1e-05,1.5e-05,7e-06,2.4e-05,1.1e-05,1.8e-05,5e-06,9e-06,9e-06,2e-06,3e-06,5e-06,0,4e-06,3e-06,2e-06,1.2e-05
8e-06,4e-06,1e-05,3.9e-05,2.7e-05,1.4e-05,5e-06,9e-06,1.7e-05,1.5e-05,1.5e-05,9e-06,6e-06,1.4e-05,2.3e-05,1.8e-05,1.7e-05,1.8e-05,2.4e-05,0.000146,6.7e-05,6.5e-05,1.4e-05,0.000341,0.000387,0.000153,0.000168,0.000192,0.000489,0.000321,3e-05,0.000138,0.000117,2.7e-05,5.6e-05,0.0018,0.001464,0.000617,0.000447,0.001395,0.001123,0.001427,0.000945,0.000784,0.000667,0.000899,0.000156,0.000541,0.001031,0.001799,0.000557,0.000219,0.000757,0.001127,0.000599,0.001112,0.000209,0.000371,0.000806,0.001698,0.001582,0.000627,0.000657,0.000651,0.001432,6.6e-05,0.001051,0.001091,0.000303,0.000191,0.000398,0.000535,0.000128,0.000233,0.000328,9.3e-05,8.7e-05,0.000126,0.000224,0.00024,6.2e-05,4e-05,0.000137,4.4e-05,6.7e-05,3.1e-05,8.4e-05,3.4e-05,0.000142,4e-05,6.5e-05,4.2e-05,3.6e-05,1.7e-05,2.8e-05,2.4e-05,4.1e-05,9.1e-05,1.9e-05,3.5e-05,2.1e-05,3e-05,3e-06,1.4e-05,2.4e-05,5.4e-05,5e-05,4.2e-05,1.2e-05,2.8e-05,1.2e-05,1.2e-05,1.8e-05,1.3e-05,2e-05,1.2e-05,1.1e-05,2.5e-05,1.2e-05,2e-06,2.3e-05
2.4e-05,1.9e-05,2.4e-05,3.4e-05,4e-06,1.2e-05,8e-06,2.5e-05,2.4e-05,1.3e-05,1.9e-05,2.4e-05,1e-05,2.3e-05,1.7e-05,5e-06,2.3e-05,9e-06,3.6e-05,0.000176,8.8e-05,1.2e-05,3.5e-05,0.000493,0.000493,0.000309,6.7e-05,7.2e-05,0.000485,0.000643,0.00013,0.00019,0.000309,3.5e-05,7.2e-05,0.002905,0.002117,0.001393,0.000531,0.00209,0.001662,0.000973,0.001211,0.000427,0.000569,3.6e-05,0.001173,0.000759,0.001217,0.000675,0.002175,0.000871,0.000366,0.000766,0.001252,0.001985,0.000936,0.001149,0.001109,0.000571,0.000222,0.001534,0.000539,0.000587,0.000819,0.000807,0.000811,0.000769,0.00071,0.000235,0.000327,0.000604,0.000584,8.6e-05,0.000114,0.000332,0.000194,7e-05,0.000118,0.000112,0.000123,0.000111,0.000164,4.2e-05,0.000132,0.000157,0.000128,1.5e-05,0.000164,0.000162,0.000129,0.000143,9e-05,9.1e-05,5.6e-05,7.2e-05,6.9e-05,0.000108,4.7e-05,2.9e-05,3.7e-05,5.1e-05,8e-05,6.6e-05,4.8e-05,3.5e-05,1.1e-05,5.6e-05,1.2e-05,3.7e-05,2.1e-05,2e-05,1.9e-05,5e-06,1.4e-05,1.8e-05,4.1e-05,2e-06,3e-06,2e-06,1.1e-05
1.8e-05,6e-06,3.4e-05,3.5e-05,3e-05,3.5e-05,3.6e-05,3.4e-05,2.3e-05,3.4e-05,3.8e-05,2.3e-05,3.1e-05,2.7e-05,3.8e-05,2.3e-05,1.7e-05,2.6e-05,4.7e-05,0.000263,4.3e-05,3.1e-05,6.1e-05,0.000614,0.000151,0.000158,0.000234,5.1e-05,0.000524,0.000534,0.000357,0.00039,7.2e-05,0.000224,0.000158,0.003486,0.001844,0.001262,0.000946,0.00185,0.000915,0.002369,0.000948,0.000677,0.001064,0.001006,0.000946,0.001809,0.00326,0.002136,0.003025,0.001635,0.001044,0.000693,0.001016,0.002187,0.001128,0.000376,0.00102,0.000657,0.001224,0.001696,0.001542,0.000373,0.001749,0.00128,0.000988,0.001627,0.001087,0.001495,0.001175,0.000564,5.2e-05,0.000282,0.00034,0.000346,0.000203,0.000151,0.000123,0.000224,0.000155,0.000122,7.2e-05,0.000174,6.2e-05,7.7e-05,0.00014,0.000141,0.000119,0.00019,9.8e-05,0.000115,5.8e-05,0.000137,3.9e-05,9.3e-05,8.3e-05,4.3e-05,3.6e-05,2.8e-05,1.2e-05,5e-05,6.3e-05,6e-05,1.4e-05,2.8e-05,3.5e-05,3.1e-05,5e-05,8e-05,5.6e-05,4.8e-05,3.1e-05,3.1e-05,1.8e-05,3.8e-05,5.9e-05,5.4e-05,3.2e-05,2.8e-05,1.8e-05
2.8e-05,2e-05,2.4e-05,1e-05,6e-06,2.1e-05,1.6e-05,1.9e-05,7.4e-05,6.9e-05,4.3e-05,9e-06,3.6e-05,8e-06,1.9e-05,7e-06,1e-06,1.7e-05,2.9e-05,0.000248,0.000102,3.6e-05,7.2e-05,0.000651,0.000499,0.00034,0.000268,0.000311,0.000442,0.000281,0.000291,0.000269,0.00023,0.000216,8.4e-05,0.00326,0.002022,0.001803,0.000233,0.000868,0.000468,0.00255,0.001843,0.000512,0.000976,0.001725,0.001759,0.001458,0.002142,0.00058,0.00239,0.000995,0.000167,0.001104,0.001155,0.003,0.000862,0.001055,0.00045,0.00151,0.002075,0.002197,0.000764,0.000893,0.002305,0.000839,0.001582,0.001818,0.000426,0.001271,0.000438,0.000889,0.00073,0.000524,0.000334,9.6e-05,8.4e-05,0.000252,6.6e-05,9.1e-05,3.6e-05,0.00015,8.1e-05,0.00015,0.000152,0.000111,6.9e-05,0.000112,0.000163,0.000198,7.1e-05,9.3e-05,6.1e-05,2.4e-05,7e-05,9.5e-05,4.5e-05,4.3e-05,4.5e-05,2.5e-05,1.9e-05,2.1e-05,8.7e-05,0.000104,8.5e-05,8e-05,4.2e-05,3.6e-05,5.4e-05,9e-06,2e-05,1.2e-05,2.2e-05,1e-05,1.5e-05,2.3e-05,2.9e-05,6e-06,2.6e-05,2.2e-05,1e-05
1.2e-05,1.2e-05,1.9e-05,1.3e-05,2.9e-05,1.8e-05,3.3e-05,4.2e-05,9.1e-05,2.4e-05,1e-05,2.5e-05,5e-05,3.1e-05,2.4e-05,2.6e-05,1.9e-05,4e-06,4e-05,0.000256,0.000305,0.000175,0.000134,0.000787,0.000487,0.000381,0.000275,0.000304,0.000374,0.000536,0.000262,0.00023,4.6e-05,0.00014,3.9e-05,0.002783,0.003015,0.001275,0.000833,0.001366,0.000298,0.002334,0.002618,0.001846,0.001192,0.001906,0.000325,0.001891,0.00285,0.001806,0.000672,0.00081,0.000518,0.001267,0.002061,0.001472,0.001736,0.001315,0.001547,0.002072,0.000286,0.000833,0.000634,0.001384,0.003288,0.001574,0.001243,0.000835,0.001419,0.000798,0.001256,0.000883,0.000421,0.000213,2.8e-05,0.000296,0.000274,0.000478,0.000442,0.00019,0.000149,0.000307,0.000149,7.2e-05,3.9e-05,8.6e-05,7.2e-05,8.9e-05,0.000128,8.3e-05,0.000116,0.000145,6e-05,1.2e-05,7.9e-05,9e-06,2.6e-05,4.3e-05,4.6e-05,3e-05,5.4e-05,5.5e-05,0.000134,0.000102,4e-05,5.4e-05,3e-06,5e-05,3.4e-05,1e-05,5e-05,4.9e-05,2.7e-05,2.2e-05,2.2e-05,5e-06,2.1e-05,3.1e-05,2.5e-05,4.4e-05,3.6e-05
1.3e-05,9e-06,2.6e-05,1.5e-05,3.6e-05,3.2e-05,4.1e-05,4.9e-05,9.2e-05,0.000139,0.000117,7.5e-05,3.4e-05,3.9e-05,1.5e-05,1.8e-05,9e-06,2.8e-05,6.5e-05,0.00033,0.00071,0.000344,0.00018,0.000943,0.000715,0.000407,0.000516,0.000114,0.000217,0.000295,0.000411,0.000316,7.7e-05,0.000294,0.000153,0.002328,0.000952,0.000778,0.001337,0.002714,0.003261,0.003881,0.001154,0.00082,0.000436,0.000729,0.000623,0.001344,0.000874,0.000719,0.00161,0.000698,0.000788,0.001667,0.000955,0.002313,0.002288,0.003188,0.000623,0.000585,0.000647,0.001687,0.001901,0.002098,0.003716,0.002404,0.001676,0.001819,0.002469,0.001385,0.000912,0.001099,0.001092,0.000173,0.000198,0.000247,0.000207,0.000316,8.4e-05,0.000283,0.000184,0.000221,0.000197,6.5e-05,7.7e-05,9e-05,0.000104,6.1e-05,0.000156,7.1e-05,0.000115,1e-05,0.000132,0.000157,0.000169,0.000118,2.7e-05,9.7e-05,0.000114,3.7e-05,5e-06,0.000102,0.000102,0.000102,3.7e-05,1.1e-05,2.6e-05,1.3e-05,5e-05,1.2e-05,6.3e-05,1e-05,3.9e-05,4e-05,3e-05,1.3e-05,1.9e-05,2e-05,1e-05,3e-05,8e-06
2.4e-05,2.2e-05,3.4e-05,1.9e-05,3.1e-05,1.3e-05,2.5e-05,9e-06,0.000101,0.000258,9.1e-05,4.6e-05,2.2e-05,3.8e-05,9e-06,2.9e-05,1.3e-05,3.7e-05,0.000114,0.000246,0.000767,0.000398,4.7e-05,0.000897,0.000374,0.00029,0.000617,0.000716,0.000482,0.00042,0.000186,0.00027,0.000289,9.1e-05,2.6e-05,0.00201,0.00146,0.000367,0.001008,0.003577,0.003162,0.002057,0.003819,0.002714,0.001264,0.002163,0.000978,0.002931,0.001925,0.003039,0.0022,0.00124,0.000949,0.001556,0.003338,0.002016,0.001023,0.001219,0.00172,0.001834,0.000806,0.001732,0.000383,0.001337,0.002876,0.003761,0.000572,0.00154,0.002027,0.002177,0.000719,0.000227,0.000825,0.000633,0.000442,0.000132,0.000202,0.000337,0.000473,0.000538,0.000258,0.000119,0.000335,0.000245,2e-04,3e-05,0.000105,0.000154,0.000166,0.000178,7.5e-05,9.8e-05,0.000141,6.6e-05,7.1e-05,5.6e-05,9.1e-05,0.000106,7.8e-05,0.000138,0.000169,0.000137,0.00022,0.000237,0.000146,2.6e-05,6e-05,1.5e-05,8.7e-05,6e-05,5.8e-05,5.5e-05,4.1e-05,1.9e-05,3.1e-05,3.2e-05,2e-05,1.6e-05,1.4e-05,2.6e-05,2.8e-05
1.4e-05,1.2e-05,3e-05,1.9e-05,2.4e-05,1.7e-05,6e-06,9e-06,0.000117,0.000346,0.00017,8.9e-05,5.3e-05,1.1e-05,3.1e-05,5.9e-05,3.3e-05,3.7e-05,0.000103,0.000298,0.000472,0.000297,0.000103,0.000864,0.001219,0.001075,0.000537,0.000737,0.000745,0.000512,0.000356,2.3e-05,0.000272,0.00013,0.000121,0.001443,0.001109,0.000669,0.002676,0.002622,0.002854,0.001351,0.004479,0.002238,0.001636,0.000889,0.001316,0.002096,0.00401,0.003935,0.00359,0.001481,0.000877,0.001248,0.002987,0.001742,0.001143,0.0014,0.001945,0.002458,0.001179,0.001704,0.001153,0.001413,0.002924,0.000282,0.000897,0.000624,0.000826,0.001635,0.001644,0.001209,0.000303,0.000301,0.000637,0.000847,0.000352,0.000169,0.000205,0.000256,0.000151,0.000162,3.7e-05,6.7e-05,9e-05,0.000119,0.000139,0.000206,0.000163,8.6e-05,8.1e-05,7.6e-05,0.00017,0.000115,4.7e-05,0.000122,2.7e-05,7.8e-05,0.000116,0.000159,6.9e-05,4.4e-05,0.000195,0.00011,4e-05,3.7e-05,5.2e-05,5.2e-05,6.3e-05,2.1e-05,2e-05,5.6e-05,1.9e-05,2.8e-05,1.3e-05,1.5e-05,4.5e-05,1.5e-05,1.6e-05,1.2e-05,1.2e-05
3e-06,5e-06,2e-05,1e-05,2.6e-05,2.1e-05,1e-05,1.3e-05,0.000127,0.000339,0.000239,0.000126,2.3e-05,4.3e-05,5.7e-05,3.1e-05,2.2e-05,2.3e-05,9.4e-05,0.000139,0.000206,0.000132,0.000122,0.000781,0.000588,0.000698,0.001176,0.000757,0.000136,0.000475,0.000447,0.00043,0.000553,0.000108,0.000133,0.000294,0.00084,0.001249,0.002063,0.000281,0.001872,0.003731,0.002237,0.00272,0.001182,0.000718,0.000695,0.001837,0.003451,0.000922,0.000857,0.000626,0.001178,0.000645,0.001122,0.000376,0.000973,0.000953,0.001447,0.002758,0.001669,0.001934,0.000822,0.001617,0.000606,9.7e-05,0.000705,0.000808,0.000864,0.001019,0.000313,0.000524,0.000405,0.000172,0.000475,0.000364,0.000189,7.4e-05,0.000224,2.7e-05,3.8e-05,0.000121,0.000149,9.5e-05,6.4e-05,0.000103,0.000223,3.3e-05,0.000156,9.5e-05,6.7e-05,5.9e-05,6.7e-05,0.00013,7.5e-05,0.000124,8.3e-05,9.2e-05,8.5e-05,5.8e-05,2.4e-05,7e-05,9.2e-05,1e-05,2.1e-05,3.1e-05,4.2e-05,9e-06,2.5e-05,1.6e-05,2.9e-05,5.3e-05,2.6e-05,9e-06,8e-06,1e-06,5e-05,4.4e-05,1.6e-05,1.9e-05,1.5e-05
1.1e-05,2e-06,2.4e-05,2.6e-05,1.4e-05,7e-06,1.4e-05,9e-06,1e-04,0.000379,0.000231,8.4e-05,1e-05,4.8e-05,2e-06,5.3e-05,2.8e-05,4.3e-05,3e-05,8.9e-05,0.000106,0.000158,7.6e-05,0.000771,0.002362,0.00185,0.001062,0.001069,0.000536,0.000662,0.000668,0.000624,0.00083,0.000236,0.000228,0.000807,0.000406,0.00146,0.003376,0.001504,0.000923,0.002984,0.00473,0.00218,0.000852,0.000561,0.001037,0.001282,0.000314,0.000911,0.000551,0.001335,0.000278,0.00097,0.000367,0.001325,0.001638,0.000471,0.001197,0.000189,0.000955,0.000688,0.000565,0.00087,0.000607,0.001158,6e-04,0.000776,0.000102,0.000643,0.000645,0.000308,0.000411,0.000117,0.000141,0.000166,9.9e-05,0.000138,3.4e-05,3.1e-05,8.5e-05,0.000149,0.000119,8.7e-05,5.1e-05,9.7e-05,0.00017,8.8e-05,7.7e-05,6.1e-05,8.8e-05,4.5e-05,3e-05,9.6e-05,8.7e-05,3.2e-05,6.3e-05,8.4e-05,8.3e-05,5.8e-05,4.3e-05,1.9e-05,0.000101,2e-06,2.4e-05,3e-05,1.5e-05,4.1e-05,6e-05,5.2e-05,2.5e-05,5.9e-05,2.1e-05,1.4e-05,1.3e-05,7e-06,4.6e-05,1e-05,1.2e-05,1.2e-05,1.1e-05
4e-06,4e-06,2.6e-05,1.1e-05,1.8e-05,1.2e-05,1.8e-05,2.6e-05,4.7e-05,0.000234,8.4e-05,2.3e-05,3.1e-05,1.5e-05,2.5e-05,4.3e-05,2.8e-05,4.4e-05,5e-05,0.000104,0.000105,4.4e-05,3.6e-05,0.000708,0.004508,0.001622,0.00174,0.001335,0.000846,0.000668,0.001002,0.001977,0.002392,0.001452,0.00078,0.001104,0.000844,0.002251,0.003366,0.002319,0.001561,0.001181,0.001832,0.000508,0.001791,0.000988,0.000503,0.001339,0.002054,0.001571,0.001937,0.001523,0.000926,0.001035,0.000792,0.000509,0.000996,0.001874,0.001879,0.00177,0.002164,0.001248,0.001061,0.000498,0.001707,0.001786,0.00101,0.000383,0.000327,0.00063,0.000643,0.000239,0.000263,0.000105,0.000163,0.00024,9e-05,6.6e-05,0.000216,8.8e-05,6e-05,0.000104,0.000144,5.6e-05,9.3e-05,0.000108,0.000112,3.2e-05,4e-05,2.8e-05,5.3e-05,2.3e-05,4e-05,4.6e-05,6.4e-05,5.4e-05,6.3e-05,9.1e-05,6.2e-05,5.5e-05,8.9e-05,6.1e-05,7.5e-05,8.3e-05,3.8e-05,1.9e-05,1e-05,1.7e-05,3.2e-05,3.2e-05,1.7e-05,4.8e-05,4.7e-05,1.1e-05,9e-06,1.3e-05,2.6e-05,3.2e-05,1.3e-05,1.5e-05,1.4e-05
8e-06,5e-06,1.8e-05,2.9e-05,1.9e-05,1.8e-05,1.6e-05,6e-06,2.3e-05,2.2e-05,1.6e-05,1e-05,2.7e-05,3.4e-05,1.3e-05,6e-06,1.1e-05,3.8e-05,3.1e-05,5.2e-05,5.9e-05,4.5e-05,2e-05,0.000584,0.004617,0.003389,0.002287,0.000555,0.00045,0.000674,0.001086,0.001857,0.001597,0.001458,0.000545,0.000126,0.001595,0.002789,0.003438,0.002812,0.001158,0.000665,0.001778,0.00252,0.001947,0.001184,0.001268,0.002046,0.001008,0.00182,0.000442,0.000823,0.001703,0.001154,0.000386,0.000358,0.002245,0.002866,0.001143,0.001842,0.000947,0.000639,0.001125,0.000744,0.0017,0.001163,0.001647,0.000375,0.000637,0.001116,0.000282,7.2e-05,0.000281,6.4e-05,0.000361,0.000247,5.7e-05,0.000104,0.000269,5.9e-05,8.1e-05,0.000108,0.000185,1.4e-05,7.7e-05,0.000125,9e-05,7.8e-05,1e-04,5.8e-05,8.4e-05,7.9e-05,6.1e-05,3.8e-05,7.6e-05,6.7e-05,5.4e-05,0.00016,9.3e-05,4.7e-05,0.000106,2.3e-05,4.5e-05,5e-05,7e-06,6e-05,2.9e-05,2.7e-05,4.5e-05,3.8e-05,1.5e-05,4.4e-05,3.1e-05,7e-06,2.2e-05,2.6e-05,1.5e-05,1.8e-05,1.7e-05,1.3e-05,1.3e-05
9e-06,3e-06,1.1e-05,5e-06,1.3e-05,1.1e-05,3.2e-05,2.1e-05,3.5e-05,7.6e-05,1.5e-05,2.6e-05,1.8e-05,7e-06,9e-06,1.4e-05,1.8e-05,3.6e-05,3.6e-05,0.000101,4e-05,1.2e-05,5e-05,0.000489,0.003274,0.00197,0.001139,0.000586,0.000664,0.000735,0.000714,0.000633,0.000312,0.000701,4e-04,0.001429,0.001122,0.004259,0.004849,0.002091,0.004418,0.004139,0.003981,0.001426,0.003401,0.00364,0.001325,0.003627,0.001899,0.000279,0.000813,0.00099,0.001937,0.001101,0.001441,0.00139,0.000731,0.001192,0.000694,0.001171,0.001185,0.001219,0.001975,0.000826,0.003043,0.002698,0.000197,0.001338,0.000473,0.001021,0.001281,0.000472,0.000479,0.00038,0.000265,0.000411,0.000257,0.00025,0.000395,0.000109,0.000149,0.000294,0.000225,6.7e-05,9.9e-05,0.000111,7.9e-05,9.9e-05,9.2e-05,7e-05,2.8e-05,0.000119,9.1e-05,0.000207,5.7e-05,0.000101,0.000232,0.000175,0.000135,7.3e-05,0.000152,5.8e-05,5.1e-05,5.8e-05,6.7e-05,7.1e-05,4.7e-05,7.5e-05,6.4e-05,4.3e-05,1.9e-05,4.6e-05,6.5e-05,1e-05,4.4e-05,1e-05,1.1e-05,1.7e-05,3.1e-05,2e-05,3.1e-05
1.8e-05,1.6e-05,1.4e-05,4e-06,9e-06,2e-06,2.9e-05,1.8e-05,7.3e-05,6.2e-05,4.8e-05,3e-05,3.5e-05,2.5e-05,1.4e-05,1.3e-05,4.5e-05,1e-05,2.9e-05,8e-05,1.2e-05,2.9e-05,5e-05,0.000379,0.001466,0.001206,0.000864,0.001344,0.000928,0.001136,9.8e-05,0.000254,0.000253,0.00034,0.000402,0.003083,0.001833,0.004945,0.004179,0.002717,0.005169,0.004088,0.002614,0.002001,0.00281,0.003354,0.001758,0.0029,0.003078,0.002462,0.003088,0.002315,0.003515,0.002591,0.004487,0.003529,0.001549,0.003261,0.002898,0.002069,0.00042,0.001118,0.004258,0.003559,0.002812,0.002545,0.003128,0.002275,0.001733,0.001063,0.001237,0.000352,0.000597,0.000388,0.000526,0.000245,0.000141,0.000457,0.000154,0.000135,0.000271,0.000773,3e-04,0.000154,5.3e-05,0.00019,0.000239,0.000289,0.000304,0.000142,0.000142,3e-05,0.000116,0.000321,0.00016,8e-06,0.000192,0.000319,0.000165,0.000161,0.000142,8e-06,3e-05,4.7e-05,9.1e-05,6.8e-05,5.4e-05,7e-05,5.1e-05,0.000103,5e-05,7.1e-05,6.5e-05,8.4e-05,3.7e-05,9e-06,1.7e-05,3.7e-05,2.9e-05,8e-06,2.7e-05
9e-06,1.4e-05,2e-06,1.6e-05,1e-05,6e-06,2.6e-05,5.4e-05,0.000126,0.000111,5.9e-05,3.5e-05,5.5e-05,5.5e-05,5e-05,2.6e-05,3.3e-05,8.3e-05,1.7e-05,9.4e-05,5.6e-05,2.2e-05,3e-05,0.000376,0.000205,0.001565,0.001374,0.00254,0.000602,0.001178,0.000787,0.000381,0.000146,0.000121,0.000873,0.004094,0.001045,0.005787,0.010839,0.011896,0.009941,0.004052,0.00508,0.003712,0.003679,0.005911,0.002219,0.00474,0.001661,0.004499,0.003893,0.002073,0.005285,0.003031,0.005132,0.002595,0.004499,0.00354,0.003014,0.002011,0.004765,0.002059,0.005091,0.001148,0.006255,0.008399,0.001872,0.002416,0.002346,0.001195,0.002514,0.000432,0.001346,0.00011,0.000791,0.000714,0.000644,5.9e-05,0.000565,0.000304,0.000172,0.000863,0.00093,0.000151,0.000381,0.000574,0.000485,0.00022,0.000115,4.9e-05,0.000128,0.00011,0.000284,0.000278,1.6e-05,0.000247,0.000125,0.000138,0.00029,0.000212,0.000297,0.000252,0.000102,6.3e-05,0.000124,8e-05,0.000102,0.000129,0.000136,0.000147,8.6e-05,0.000239,0.000123,9.3e-05,8.2e-05,8.2e-05,2.6e-05,3.3e-05,1.8e-05,3.7e-05,2e-05
8e-06,1.6e-05,1.8e-05,7e-06,8e-06,8e-06,2.9e-05,3.9e-05,9.9e-05,0.000165,7.3e-05,3.2e-05,5.6e-05,1.3e-05,1.7e-05,5e-06,3.3e-05,7.9e-05,7.4e-05,0.000158,5.5e-05,2e-05,3e-05,0.000338,0.000955,0.002554,0.000928,0.001708,0.004492,0.003626,0.002314,0.00117,0.000253,0.000174,0.001043,0.005947,0.007579,0.003298,0.008165,0.006299,0.006499,0.009067,0.002289,0.008187,0.009473,0.011941,0.007435,0.008405,0.002743,0.005715,0.010013,0.00992,0.009219,0.006135,0.005117,0.010286,0.012677,0.008332,0.004938,0.001772,0.005717,0.005455,0.004656,0.006025,0.007695,0.007881,0.010997,0.010283,0.002715,0.002864,0.005711,0.004861,0.002797,0.001892,0.001849,0.000593,0.000661,0.000329,0.000591,0.001026,0.000532,0.000729,0.001138,0.001216,0.001077,0.000203,0.001043,0.000952,0.000703,0.000377,0.000253,0.000438,0.000569,0.000861,0.000522,0.000576,0.000561,0.000347,0.000586,0.000509,0.000196,0.000472,0.000321,0.000292,5.4e-05,0.000169,0.000224,0.000197,0.000271,5.5e-05,6.2e-05,0.000326,0.00022,0.000113,7.9e-05,0.00018,0.000138,5.4e-05,8.4e-05,8.6e-05,7.7e-05
2.9e-05,2e-05,1.8e-05,1.3e-05,2.5e-05,6e-06,2.4e-05,7e-06,0.000123,0.000151,7.5e-05,1.8e-05,6e-05,3.2e-05,3.6e-05,2.5e-05,3.1e-05,2.1e-05,2.5e-05,0.000155,8.1e-05,5.1e-05,4.6e-05,0.000246,0.000639,0.001667,0.001891,0.000925,0.003753,0.000858,0.000887,0.000925,0.000442,8.4e-05,0.000813,0.005557,0.005255,0.008463,0.001663,0.003919,0.001546,0.003678,0.006865,0.010226,0.010172,0.004844,0.004296,0.002997,0.006793,0.00514,0.00818,0.009003,0.009146,0.009355,0.010941,0.007768,0.003143,0.006472,0.002772,0.001843,0.006361,0.010866,0.011706,0.010411,0.00324,0.004147,0.008446,0.008204,0.008449,0.009302,0.004951,0.003448,0.002,0.002194,0.001396,0.001504,0.000686,0.000758,0.000659,0.001011,0.00058,0.000731,0.000411,0.001217,0.001131,0.00137,0.000762,0.000613,0.000371,0.000453,0.000455,0.000696,0.000719,0.000263,0.000344,0.000269,0.000431,0.000442,0.00064,0.000397,0.000347,0.000614,0.00031,0.000323,0.00012,0.000244,0.000365,5.7e-05,0.000191,0.000331,0.00034,0.000244,0.000205,0.000176,1e-04,0.000161,0.00013,0.000102,0.000188,0.000104,6.1e-05
2.2e-05,6e-06,1.2e-05,1.2e-05,2.4e-05,2.2e-05,2e-05,1.4e-05,0.000124,0.000138,5.7e-05,5e-05,6.2e-05,3.6e-05,4.4e-05,4.1e-05,4.8e-05,5.8e-05,3.7e-05,0.000155,0.000103,4e-05,6.4e-05,0.000165,0.000356,0.001193,0.000397,0.000559,0.002612,0.004247,0.002458,0.000417,0.00038,0.000422,0.000855,0.003225,0.004437,0.00471,0.002868,0.000882,0.003096,0.001322,0.006954,0.000435,0.003494,0.001644,0.001805,0.004266,0.007377,0.001565,0.001493,0.003517,0.000973,0.006384,0.002031,0.003618,0.003232,0.00408,0.007908,0.005023,0.004424,0.005308,0.003071,0.003079,0.001448,0.003536,0.00305,0.003624,0.002392,0.003799,0.003751,0.001924,0.001335,0.001249,0.000691,0.001038,0.000773,0.000966,0.000901,0.000333,0.000138,0.000773,0.00072,0.001408,0.000886,0.000756,0.000598,0.000597,6e-05,0.000409,0.00018,0.000227,0.000253,0.000544,0.000406,0.000456,0.000623,0.00025,0.00023,0.000293,0.000694,5.8e-05,0.000291,0.000284,0.000327,0.000182,0.000177,0.000353,0.000185,0.000179,0.000321,0.00027,8.5e-05,0.000118,6.4e-05,0.000141,8.3e-05,8.9e-05,0.000134,3.5e-05,0.000104
8e-06,1.1e-05,3e-06,1.4e-05,6e-06,2e-05,1.6e-05,2.2e-05,9.5e-05,9.9e-05,8.6e-05,4.5e-05,1.8e-05,1.7e-05,2.9e-05,2.6e-05,2.7e-05,4.9e-05,8.3e-05,6.5e-05,3.7e-05,7.4e-05,9e-06,0.00011,0.000609,0.000433,0.000613,0.000227,0.000953,0.003156,0.002254,0.001085,0.000349,0.000262,0.000711,0.002624,0.006284,0.004844,0.001338,0.003412,0.000739,0.004721,0.002983,0.002946,0.001007,0.001501,0.004795,0.004585,0.003882,0.0071,0.005592,0.003443,0.002392,0.003246,0.002367,0.001894,0.002772,0.003898,0.006375,0.007474,0.006996,0.003831,0.002343,0.000721,0.002804,0.003767,0.002149,0.00111,0.001999,0.001284,0.001175,0.00052,0.000143,0.000955,3e-04,9.1e-05,0.000359,0.000272,0.000467,0.000351,0.000222,0.000874,0.000866,0.000334,0.000718,0.000401,0.000272,0.000413,0.00047,0.000242,0.000319,0.00013,0.000201,0.000145,0.000216,9.1e-05,0.000495,0.000758,0.000504,0.000506,0.000324,0.000271,0.000454,0.000416,0.000451,0.000245,0.000223,0.000393,0.000245,4e-05,0.000204,9.7e-05,3.6e-05,0.00013,0.000123,3.9e-05,1.9e-05,3e-05,8.9e-05,8.9e-05,0.000101
2.4e-05,1.8e-05,1.6e-05,1.8e-05,1.5e-05,7e-06,1.6e-05,8e-06,7.1e-05,4.5e-05,4e-05,5.2e-05,3.3e-05,2.5e-05,3.4e-05,1.9e-05,3.2e-05,5.5e-05,5.6e-05,0.000137,8.5e-05,8.8e-05,7.6e-05,0.000142,0.000619,0.000377,0.000692,0.000249,0.000527,0.002189,0.000838,0.000351,0.000138,4.6e-05,0.000533,0.001364,0.00333,0.001622,0.001846,0.002064,0.002765,0.004256,0.002502,0.001795,0.000364,0.002107,0.005293,0.003557,0.00422,0.006604,0.001265,0.002051,0.000782,0.001134,0.001889,0.002191,0.001246,0.000264,0.003849,0.003514,0.000867,0.000928,0.001735,0.002069,0.003001,0.000886,0.001767,0.000712,0.001479,0.000446,0.001198,0.000895,0.000745,0.00061,0.000838,0.00069,0.000408,0.00023,0.000266,0.000462,0.000314,0.000716,0.00011,0.000311,0.000166,0.000189,8.2e-05,0.000451,7e-05,0.000118,0.00015,0.000139,0.000245,0.000406,0.000213,5.6e-05,0.000242,0.000311,6.7e-05,0.000159,0.000189,0.000124,0.00026,0.000487,0.000269,0.000212,0.000221,0.000129,4.7e-05,7.2e-05,9.8e-05,0.000156,0.000164,3.2e-05,5.7e-05,7.3e-05,6e-06,5e-05,2.3e-05,6.2e-05,3.1e-05
2e-05,7e-06,1.4e-05,1.1e-05,1.5e-05,8e-06,4e-06,8e-06,3.7e-05,3.6e-05,2.7e-05,3.6e-05,3.1e-05,1.5e-05,1.5e-05,1.6e-05,7e-06,3.6e-05,1.4e-05,0.000105,9.4e-05,4.5e-05,3.2e-05,7.9e-05,0.000684,0.000758,0.000477,0.000389,0.000569,0.000624,2e-04,0.000118,0.00014,8.6e-05,0.000363,0.000803,0.001171,0.002457,0.000773,0.000817,0.002615,0.000422,0.001994,0.000228,0.000604,0.000956,0.004564,0.002895,0.00327,0.001717,0.001813,0.00212,0.00149,0.000613,0.000918,0.001492,0.000634,0.001727,0.000472,0.003285,0.002099,0.000778,0.000959,0.001394,0.000599,0.0014,0.00041,0.001191,0.000863,0.000788,0.000456,0.000856,0.000483,0.000297,0.000821,0.000422,0.000269,0.000272,0.000253,0.000475,0.000113,0.000284,0.000204,5.9e-05,0.000199,0.000237,0.000191,0.000112,0.000145,5.8e-05,6.4e-05,0.000267,0.00028,0.000154,7.3e-05,6e-05,5.7e-05,0.000193,0.000118,9.9e-05,0.000103,0.000147,0.000114,0.000278,6.5e-05,5.8e-05,7.4e-05,0.000141,0.000163,9.4e-05,9.9e-05,5.6e-05,4e-05,3.2e-05,5.3e-05,3e-05,4.1e-05,2.7e-05,2.9e-05,2.5e-05,2.5e-05
4e-06,2e-06,6e-06,5e-06,5e-06,5e-06,6e-06,5e-06,1.3e-05,2.1e-05,7e-06,1e-05,8e-06,3e-06,4e-06,7e-06,5e-06,1.6e-05,1.3e-05,2.8e-05,1.3e-05,6e-06,2.2e-05,6.2e-05,0.000289,0.000102,9.7e-05,0.000159,0.000226,0.000221,6.1e-05,3.1e-05,8.9e-05,2.2e-05,0.000184,0.000605,0.001158,0.000812,0.000535,0.000539,0.000886,0.000206,0.001067,0.000585,0.000556,0.000662,0.001937,0.001749,0.000837,0.000845,0.000736,0.000594,0.000481,0.000571,0.000878,0.000723,0.000386,0.001095,0.000147,0.001143,0.00047,0.000284,0.000228,0.000415,0.00069,0.000966,0.000712,0.000417,0.000162,5.4e-05,0.000185,0.000108,0.000184,6e-05,0.000293,0.000159,0.000164,6.3e-05,0.000144,2.3e-05,7.2e-05,0.000197,7.1e-05,8.5e-05,8.5e-05,2.5e-05,7.7e-05,6.6e-05,2.7e-05,2.5e-05,2.4e-05,7.9e-05,1.9e-05,8.8e-05,5e-05,5.8e-05,1.9e-05,4.3e-05,3.8e-05,7e-05,5.6e-05,1.4e-05,3.9e-05,1.1e-05,2.3e-05,4.3e-05,1.7e-05,3.3e-05,4.3e-05,2.3e-05,1.9e-05,2.9e-05,1.3e-05,1.2e-05,9e-06,1e-05,1.6e-05,1.6e-05,1e-05,1.3e-05,7e-06
4e-06,4e-06,2e-06,4e-06,5e-06,1e-06,5e-06,7e-06,9e-06,1.4e-05,9e-06,1.2e-05,4e-06,7e-06,5e-06,1.3e-05,6e-06,1.2e-05,6e-06,9e-06,5e-06,1.5e-05,5e-06,4.7e-05,0.000121,0.000213,3.1e-05,0.000125,0.000169,0.000203,3.5e-05,4.3e-05,0.000101,9.2e-05,0.000132,0.000455,0.000793,0.000153,0.000335,0.000739,0.000439,0.00035,0.000597,0.000443,0.000424,0.000303,0.001197,0.000525,0.000488,0.000607,0.000498,0.000375,0.000415,0.000422,8e-04,0.000124,0.000286,0.000266,0.000718,0.001283,0.001093,0.000441,0.00037,0.000172,0.000437,0.000239,0.000285,0.000177,0.000333,0.000317,6e-05,0.000127,7.7e-05,6.4e-05,0.00013,7.9e-05,8.9e-05,4.4e-05,7.2e-05,5.3e-05,3e-05,0.000142,7.2e-05,9e-06,4.6e-05,7e-06,5.6e-05,1.8e-05,4.5e-05,2.2e-05,1.6e-05,5.2e-05,1.7e-05,4.9e-05,3e-05,5e-06,2.7e-05,4.9e-05,4.5e-05,2.9e-05,1.8e-05,1.5e-05,3.7e-05,4.8e-05,2.1e-05,3.6e-05,1.7e-05,2.6e-05,1.4e-05,1.8e-05,7e-06,8e-06,1.4e-05,1.1e-05,1e-05,1.6e-05,3e-06,8e-06,6e-06,3e-06,6e-06
3e-06,3e-06,3e-06,2e-06,4e-06,3e-06,4e-06,5e-06,4e-06,4e-06,5e-06,1e-05,7e-06,1e-06,4e-06,1.6e-05,8e-06,1.5e-05,8e-06,1.6e-05,7e-06,8e-06,1e-05,4.5e-05,3.6e-05,6.4e-05,0.00014,0.000164,0.000102,0.000131,9.5e-05,3.1e-05,1.7e-05,2.9e-05,0.000128,0.000153,0.000346,0.000434,0.000252,0.000688,0.000521,0.000593,0.00034,0.00033,0.000527,0.000408,0.000701,0.000612,0.000635,0.000815,0.000558,0.000408,0.000336,0.000481,0.000362,0.000433,7.1e-05,0.000168,0.00041,0.000751,0.00033,0.000573,0.000216,0.000146,0.000205,0.000315,0.000107,0.000209,0.00033,6.4e-05,8.7e-05,1e-04,6.6e-05,3.3e-05,5.6e-05,4.4e-05,6.4e-05,2.2e-05,6.2e-05,3.6e-05,1.2e-05,7.8e-05,2.8e-05,9e-06,5.1e-05,8e-06,4e-05,1.7e-05,3.1e-05,2.1e-05,1.3e-05,5.4e-05,1.2e-05,2.8e-05,1.4e-05,0,1.8e-05,3.8e-05,5.1e-05,2.2e-05,1.4e-05,1.5e-05,1.7e-05,2.9e-05,6e-06,1.9e-05,6e-06,1.3e-05,1.7e-05,1.3e-05,4e-06,1e-05,1e-05,4e-06,4e-06,1.1e-05,7e-06,1.4e-05,4e-06,4e-06,3e-06
3e-06,2e-06,2e-06,2e-06,1e-06,1e-06,4e-06,3e-06,8e-06,1e-06,6e-06,4e-06,5e-06,4e-06,2e-06,1.5e-05,1.2e-05,2.3e-05,9e-06,3.1e-05,6e-06,1e-06,5e-06,3.2e-05,4.8e-05,0.000184,0.00018,0.000111,7e-05,0.000128,0.000124,6.6e-05,8.6e-05,3.2e-05,8.9e-05,0.000265,0.000685,0.000583,0.000277,0.000541,0.000334,0.000193,0.000118,0.000299,0.000411,0.000102,0.00028,0.000446,0.000158,0.000421,0.000284,9.3e-05,0.000414,0.000502,0.000221,0.000235,0.000258,0.000361,0.000322,0.000583,0.000599,0.000658,0.000322,0.000218,0.000416,0.000322,0.000256,0.000193,0.000334,0.000113,0.000106,5e-05,6.6e-05,3e-05,6e-05,4.5e-05,5.2e-05,2.3e-05,5.6e-05,3e-05,2.8e-05,7.9e-05,3e-05,1.5e-05,4e-05,1e-05,4e-05,2e-05,1.5e-05,4e-06,8e-06,1.9e-05,1.6e-05,2.6e-05,8e-06,8e-06,8e-06,2.4e-05,2.9e-05,1.3e-05,2.1e-05,1.5e-05,2.4e-05,3e-05,1e-05,1.7e-05,1e-05,3e-06,1.2e-05,8e-06,4e-06,9e-06,1e-06,8e-06,7e-06,6e-06,5e-06,4e-06,2e-06,4e-06,2e-06
4e-06,2e-06,2e-06,2e-06,1e-06,3e-06,4e-06,2e-06,8e-06,4e-06,4e-06,4e-06,3e-06,5e-06,3e-06,5e-06,1.2e-05,9e-06,6e-06,2.9e-05,6e-06,8e-06,2e-06,3.2e-05,0.00011,0.000116,2.4e-05,7.8e-05,0.000131,0.000105,7.5e-05,3.4e-05,7e-05,2.1e-05,9e-05,0.000487,0.000554,0.000335,0.000283,0.000412,0.000315,0.000378,0.000244,0.000179,0.000231,0.000257,8.8e-05,0.000339,0.000587,0.000162,0.000135,0.00034,0.000314,0.000494,0.000167,0.000612,0.000473,0.000159,5.5e-05,0.000282,0.000218,0.000516,5.4e-05,0.000181,0.00018,0.000155,0.000227,0.000265,0.000206,0.000106,8.7e-05,4.3e-05,5.7e-05,2.2e-05,5.3e-05,5.5e-05,7e-06,1.3e-05,4.9e-05,2.6e-05,3.8e-05,5.9e-05,4.6e-05,9e-06,3.5e-05,3e-06,3.2e-05,1.1e-05,1.6e-05,1.4e-05,1.3e-05,1.9e-05,8e-06,2.1e-05,1.1e-05,1.4e-05,2.4e-05,2.1e-05,3e-05,3e-06,2.1e-05,1.6e-05,1.8e-05,2.1e-05,8e-06,1.4e-05,3e-06,1.1e-05,7e-06,6e-06,8e-06,4e-06,9e-06,4e-06,5e-06,5e-06,7e-06,9e-06,1e-06,6e-06,2e-06
3e-06,2e-06,3e-06,1e-06,1e-06,3e-06,3e-06,2e-06,5e-06,6e-06,5e-06,5e-06,4e-06,1e-06,6e-06,8e-06,3e-06,7e-06,4e-06,2.8e-05,7e-06,1.4e-05,6e-06,3.1e-05,8.7e-05,0.000118,7e-05,9.2e-05,0.000135,0.00011,8e-05,4e-05,3.9e-05,1.9e-05,7.7e-05,0.000491,0.000198,0.00032,0.000273,0.000483,0.000216,0.000117,0.000297,0.000339,0.000118,9.8e-05,0.000229,0.00044,0.000417,0.000298,0.000264,0.000269,0.000363,0.000478,0.000376,0.000367,0.000211,0.000599,0.000266,0.000446,0.000439,0.00032,0.000232,0.000259,0.000465,0.000122,4.1e-05,6.2e-05,0.000252,7.2e-05,5.4e-05,1.6e-05,4.3e-05,1.1e-05,5e-05,2.4e-05,2.9e-05,7e-06,4.4e-05,3.3e-05,3e-05,5.1e-05,2e-05,1.2e-05,2.7e-05,1e-05,2.5e-05,1.4e-05,8e-06,9e-06,2e-06,2.5e-05,1.6e-05,1.2e-05,9e-06,1e-05,2e-05,2.5e-05,2.9e-05,1e-05,9e-06,3e-06,6e-06,2.1e-05,1e-05,1.1e-05,6e-06,1e-05,4e-06,1e-05,1e-05,1.3e-05,7e-06,5e-06,5e-06,4e-06,5e-06,5e-06,1e-06,4e-06,2e-06
1e-06,2e-06,1e-06,1e-06,0,3e-06,2e-06,2e-06,9e-06,1e-06,4e-06,2e-06,3e-06,5e-06,7e-06,8e-06,1.1e-05,8e-06,9e-06,2.9e-05,1.5e-05,9e-06,4e-06,3.4e-05,2e-05,0.000102,6.7e-05,9.4e-05,7.3e-05,6.5e-05,9.9e-05,7.8e-05,2.7e-05,2.2e-05,9.1e-05,0.000315,0.000199,0.000326,0.000224,0.000337,8.4e-05,0.000338,0.000456,0.000273,0.000198,7.7e-05,0.000201,0.00047,0.000134,0.000497,9e-05,0.000262,0.000285,0.000502,7.3e-05,0.000131,0.000194,0.000385,0.000554,0.00032,0.000132,0.000132,0.000232,0.000231,0.000164,0.000424,0.000178,0.000115,0.000225,6.8e-05,6.4e-05,6.7e-05,4.7e-05,2.5e-05,7.5e-05,1.5e-05,4e-05,3.9e-05,1.2e-05,3.1e-05,2.6e-05,4.5e-05,2.4e-05,1.6e-05,1.3e-05,2.5e-05,3.7e-05,1.2e-05,3.7e-05,2e-05,1.4e-05,2.6e-05,2e-05,2e-05,1.5e-05,1.3e-05,1.8e-05,2.2e-05,1.1e-05,1.3e-05,1e-06,2e-06,1.1e-05,1.4e-05,1.8e-05,2e-05,6e-06,8e-06,7e-06,9e-06,8e-06,8e-06,5e-06,7e-06,6e-06,5e-06,2e-06,7e-06,3e-06,1e-06,2e-06
2e-06,3e-06,2e-06,1e-06,1e-06,2e-06,2e-06,2e-06,7e-06,5e-06,2e-06,4e-06,5e-06,2e-06,5e-06,2e-06,7e-06,4e-06,1.1e-05,1.2e-05,1.3e-05,9e-06,7e-06,4.6e-05,7.8e-05,0.000109,0.000247,0.000294,0.000195,0.000126,0.000127,2.8e-05,3.1e-05,1.6e-05,6.6e-05,0.000164,0.000288,0.000157,0.000207,0.000118,0.000263,0.000111,0.000221,0.000297,7.8e-05,0.000116,0.000211,0.000171,0.000124,0.000307,0.000265,0.000278,0.00023,0.000379,0.000227,0.000103,0.000121,0.000134,0.000431,0.000162,0.000227,0.000319,0.000125,6.4e-05,0.000113,0.000174,0.000284,0.000162,0.000227,6.1e-05,4e-05,8e-05,5.8e-05,3.6e-05,3.9e-05,5.6e-05,1.3e-05,3.8e-05,4.1e-05,6.6e-05,5.4e-05,8e-05,6e-05,4e-05,4.7e-05,1.6e-05,5e-06,1.6e-05,5.4e-05,3.6e-05,2.4e-05,1.1e-05,3e-06,1.1e-05,2.3e-05,2.3e-05,1.8e-05,1.9e-05,3.6e-05,2.7e-05,2e-05,7e-06,7e-06,2.9e-05,3.5e-05,2.2e-05,2.2e-05,1.6e-05,1.2e-05,8e-06,7e-06,4e-06,1e-06,6e-06,5e-06,9e-06,1.1e-05,1.1e-05,1.2e-05,1e-05,3e-06
2e-06,2e-06,1e-06,1e-06,1e-06,0,2e-06,2e-06,7e-06,8e-06,9e-06,2e-06,4e-06,4e-06,6e-06,7e-06,5e-06,6e-06,7e-06,9e-06,7e-06,4e-06,6e-06,4.2e-05,7e-05,0.000105,4.9e-05,0.000262,0.000112,6.1e-05,6.7e-05,3.5e-05,3.4e-05,2.8e-05,5.6e-05,0.000148,0.00013,0.000122,0.000198,0.000369,0.000224,0.000268,0.000126,0.000252,0.000149,0.000104,0.000221,0.000155,0.000264,0.000118,7.5e-05,0.000148,0.000242,0.000258,9.4e-05,4.8e-05,0.00013,0.000347,0.000459,7.2e-05,0.000216,0.000356,0.000129,5.6e-05,4.7e-05,0.000153,0.000158,0.00019,0.000181,7.4e-05,3.2e-05,4.9e-05,7.6e-05,4.4e-05,4.6e-05,6.7e-05,7.5e-05,1.7e-05,5e-06,6.6e-05,6.5e-05,1.5e-05,4.4e-05,2.5e-05,3.7e-05,1.4e-05,3.1e-05,3.9e-05,4.6e-05,1.8e-05,2e-06,4e-06,1.7e-05,3e-05,6e-06,2.2e-05,2.7e-05,2.5e-05,3.7e-05,1e-05,1.5e-05,2.1e-05,1.4e-05,2.9e-05,2.9e-05,7e-06,5e-06,1.3e-05,1.7e-05,1.3e-05,1.1e-05,1.1e-05,1.2e-05,4e-06,7e-06,7e-06,5e-06,4e-06,4e-06,4e-06,5e-06
1e-06,1e-06,3e-06,3e-06,2e-06,1e-06,4e-06,2e-06,6e-06,6e-06,3e-06,5e-06,8e-06,5e-06,1e-05,8e-06,1.2e-05,4e-06,1.3e-05,7e-06,1e-06,9e-06,5e-06,5.1e-05,0.000264,7.5e-05,0.000146,0.000269,1e-04,5.2e-05,6.4e-05,3.8e-05,3.3e-05,2.8e-05,5.4e-05,0.000172,0.000165,0.000296,0.000271,0.000317,0.000349,1.8e-05,0.000319,0.00016,0.000128,5.2e-05,0.000237,0.000149,0.000343,3.9e-05,0.000145,0.000268,0.000216,0.000255,0.000284,0.00018,0.000139,0.000204,0.000198,9.7e-05,5.5e-05,8.4e-05,0.000135,2.8e-05,6.8e-05,0.000112,0.000151,0.000191,0.000234,4.4e-05,8.4e-05,7.5e-05,2.7e-05,1.3e-05,2.7e-05,3.9e-05,4.8e-05,6.5e-05,4.6e-05,5.2e-05,1.7e-05,7.1e-05,2.7e-05,1.9e-05,3.5e-05,1.7e-05,3.3e-05,1.8e-05,9e-06,2.2e-05,1.8e-05,1.2e-05,1.4e-05,2.1e-05,2.7e-05,2.2e-05,2.1e-05,1.6e-05,2.6e-05,6e-06,3e-05,4e-06,3.3e-05,3.6e-05,2e-06,1.5e-05,7e-06,1.3e-05,1.1e-05,3e-06,4e-06,7e-06,1.3e-05,1e-05,3e-06,4e-06,6e-06,7e-06,8e-06,7e-06,8e-06
2e-06,4e-06,4e-06,2e-06,2e-06,1e-06,4e-06,4e-06,8e-06,2e-06,3e-06,1e-06,6e-06,7e-06,7e-06,5e-06,2e-06,7e-06,8e-06,2.6e-05,1.3e-05,9e-06,5e-06,4.8e-05,0.000337,0.000293,0.000113,8.6e-05,0.000224,0.000128,0.000152,9e-05,9.8e-05,3.6e-05,9.9e-05,0.000162,0.000259,0.000245,0.000301,0.000279,0.000189,0.000293,0.000366,0.000276,0.000125,9.7e-05,0.00019,8.2e-05,0.000467,0.00048,0.000284,0.000134,0.000205,0.000267,0.000317,7.8e-05,0.000108,0.000145,0.000128,0.000148,0.000125,0.000191,8.3e-05,8.5e-05,0.000214,0.000138,0.00021,0.000206,0.00019,3.8e-05,7.3e-05,6.1e-05,2.3e-05,2.3e-05,3.5e-05,2.6e-05,2.7e-05,3.1e-05,2.2e-05,2.1e-05,5.8e-05,8e-05,3.3e-05,2.5e-05,3.1e-05,3.6e-05,1.1e-05,2.1e-05,2.3e-05,3.4e-05,1.1e-05,2.4e-05,2.1e-05,5e-06,1.2e-05,2e-06,1.9e-05,2.6e-05,5.3e-05,3.5e-05,1.7e-05,1.7e-05,2.8e-05,3.3e-05,5e-06,6e-06,8e-06,1.3e-05,9e-06,4e-06,3e-06,7e-06,3e-06,6e-06,6e-06,7e-06,3e-06,9e-06,4e-06,8e-06,6e-06
0,5e-06,1e-06,1e-06,2e-06,1e-06,3e-06,4e-06,5e-06,4e-06,7e-06,8e-06,8e-06,4e-06,9e-06,1e-05,1.5e-05,1.4e-05,9e-06,1.4e-05,6e-06,7e-06,1.2e-05,4.5e-05,0.000218,0.000163,0.000167,0.000161,0.000246,0.000208,7.5e-05,0.000111,8.4e-05,8.7e-05,0.000114,0.000158,0.000241,0.000226,0.000332,6.3e-05,0.00032,0.000238,0.000132,0.000201,9.9e-05,6.1e-05,0.000175,6.3e-05,0.000587,0.000466,0.000153,0.000174,0.000214,0.000251,0.000162,0.00011,0.000179,0.000302,0.000117,4.6e-05,0.000227,0.000322,0.000152,0.000188,0.00013,0.000126,0.000192,0.000158,0.000194,7.1e-05,9.4e-05,6.1e-05,4.7e-05,5.2e-05,4.3e-05,4.6e-05,4.8e-05,2.4e-05,1.4e-05,2.6e-05,6.7e-05,5.2e-05,2.3e-05,1.8e-05,2.7e-05,1.7e-05,2.1e-05,2.3e-05,1.1e-05,1.5e-05,2.3e-05,3.4e-05,3e-06,2.2e-05,1.6e-05,1.8e-05,1.1e-05,2.3e-05,4.2e-05,1.3e-05,8e-06,1.3e-05,9e-06,1.6e-05,1.4e-05,7e-06,5e-06,1.1e-05,9e-06,1e-05,7e-06,7e-06,7e-06,4e-06,3e-06,0,1.1e-05,7e-06,4e-06,1e-06,8e-06
1e-06,3e-06,4e-06,0,2e-06,2e-06,3e-06,3e-06,6e-06,8e-06,3e-06,8e-06,5e-06,6e-06,1.1e-05,1e-05,1.7e-05,8e-06,1e-05,5e-06,2.3e-05,1.8e-05,2e-06,2.5e-05,0.000202,0.000196,0.000115,6.1e-05,0.000113,4.2e-05,5.1e-05,5.4e-05,9.3e-05,7.4e-05,4.5e-05,0.000179,0.000124,0.000342,0.000328,0.00039,0.000128,0.000271,8e-05,0.000209,8.4e-05,3.2e-05,0.000228,4.1e-05,0.000395,7.1e-05,9.2e-05,0.000235,0.000178,0.00023,0.000213,5.3e-05,2e-04,0.000204,0.000222,0.000144,0.000217,0.000227,4.7e-05,0.00019,0.00013,0.000154,0.000129,7.4e-05,0.000221,0.000113,0.000104,4.6e-05,3.1e-05,4.1e-05,4.4e-05,5.8e-05,5.7e-05,5e-06,2.5e-05,3.3e-05,3.6e-05,4.5e-05,6.1e-05,2.9e-05,2.3e-05,2.2e-05,1e-05,1.2e-05,1e-05,1.2e-05,1.8e-05,8e-06,7e-06,3e-05,2.8e-05,1.2e-05,2e-06,1.7e-05,2.4e-05,2.2e-05,1.5e-05,1.2e-05,2e-06,2.3e-05,1.1e-05,1.1e-05,4e-06,1e-05,1e-05,4e-06,2e-06,7e-06,6e-06,3e-06,4e-06,7e-06,6e-06,2e-06,3e-06,1e-06,1.2e-05
2e-06,2e-06,2e-06,2e-06,1e-06,3e-06,6e-06,4e-06,5e-06,7e-06,2e-06,8e-06,2e-06,5e-06,6e-06,1e-05,1.1e-05,5e-06,1.1e-05,1.8e-05,1.7e-05,8e-06,1e-05,3.1e-05,0.000363,0.000685,0.00047,0.000194,0.000131,4.8e-05,4.6e-05,5.3e-05,4.9e-05,4.6e-05,6.7e-05,0.000101,8e-05,0.00017,0.000302,0.000389,0.000265,0.000222,0.000483,0.00031,0.000126,6e-06,0.000199,0.000176,0.000262,9.4e-05,0.00018,0.00013,0.000206,0.000192,0.000164,3.5e-05,4.8e-05,0.000224,2e-04,9.9e-05,0.000136,0.000175,6.9e-05,0.000111,5.5e-05,7.3e-05,0.000202,9.3e-05,0.00033,6.5e-05,7.8e-05,4.4e-05,5.2e-05,4.5e-05,9e-06,1.5e-05,1.8e-05,1.4e-05,1.8e-05,1.5e-05,1.7e-05,2.9e-05,5.9e-05,1.8e-05,2.3e-05,1.9e-05,8e-06,1.3e-05,4e-06,1.4e-05,3.4e-05,1.5e-05,8e-06,2e-05,2.6e-05,1.8e-05,1.5e-05,1e-05,2.5e-05,1.7e-05,1.6e-05,7e-06,2e-06,2.4e-05,1.2e-05,4e-06,6e-06,1.4e-05,1.2e-05,5e-06,5e-06,3e-06,3e-06,5e-06,7e-06,3e-06,4e-06,5e-06,3e-06,3e-06,7e-06
2e-06,1e-06,1e-06,2e-06,2e-06,4e-06,2e-06,1e-06,5e-06,1e-06,1e-06,7e-06,5e-06,7e-06,5e-06,5e-06,1.3e-05,7e-06,3e-06,1.5e-05,1.1e-05,8e-06,7e-06,2.7e-05,0.000529,0.000833,0.000338,0.000303,0.000257,8.7e-05,8.5e-05,9.1e-05,0.000172,0.000214,0.000118,0.000138,0.000182,0.000221,0.000277,0.000175,0.000148,0.000156,0.000379,5.7e-05,0.000111,9.2e-05,0.000153,0.000159,0.000352,0.000149,0.000224,0.000278,0.000214,0.000186,0.000104,0.000115,0.000124,0.000162,0.000266,2.2e-05,0.000163,0.000217,7.4e-05,4e-05,0.000102,3.5e-05,0.000168,3.6e-05,0.000286,0.000151,0.000101,8.5e-05,1.1e-05,3e-05,2.5e-05,8e-05,6.9e-05,2.9e-05,3.2e-05,3.2e-05,2.6e-05,4.2e-05,6.5e-05,4.2e-05,2.1e-05,3.7e-05,4e-05,1.9e-05,5e-06,1.7e-05,3.7e-05,3e-05,2.1e-05,2.1e-05,3.1e-05,3.4e-05,1.8e-05,1.4e-05,4.8e-05,1.3e-05,1.7e-05,1.6e-05,3e-06,2.6e-05,1.3e-05,1.1e-05,1.3e-05,3e-06,3e-06,5e-06,5e-06,4e-06,4e-06,6e-06,6e-06,9e-06,4e-06,2e-06,9e-06,8e-06,6e-06
1e-06,2e-06,1e-06,1e-06,1e-06,2e-06,2e-06,1e-06,6e-06,5e-06,5e-06,2e-06,2e-06,4e-06,2e-06,7e-06,5e-06,3e-06,3e-06,1.5e-05,6e-06,6e-06,7e-06,3.4e-05,0.000565,0.000283,0.000435,0.000412,0.00023,0.000281,0.000323,0.000279,0.000102,7.1e-05,0.000125,0.000143,0.000138,0.000133,1e-04,6.3e-05,0.000325,0.000101,0.00028,0.000267,9.8e-05,0.00014,4.8e-05,0.000197,0.000252,0.000316,0.000133,0.000192,0.000237,0.000122,7.3e-05,0.000195,0.000229,0.000111,0.00017,8.3e-05,0.00027,0.000187,0.000131,0.000143,0.000137,0.000107,0.000169,0.000166,0.000279,0.000148,3.2e-05,0.000124,0.000129,6.8e-05,1.9e-05,0.000135,0.000123,0.000103,7.6e-05,4.7e-05,4.2e-05,3.3e-05,4.4e-05,2e-05,3.1e-05,1.9e-05,2.5e-05,2.5e-05,1.1e-05,2e-05,2.7e-05,2.7e-05,1.1e-05,1.2e-05,8e-06,1.9e-05,2.6e-05,1.1e-05,4.7e-05,4.3e-05,1.9e-05,1.3e-05,1.2e-05,2.8e-05,2e-05,1.5e-05,1.7e-05,1.5e-05,1.8e-05,5e-06,3e-06,1e-05,6e-06,9e-06,1.1e-05,7e-06,4e-06,3e-06,1.1e-05,8e-06,6e-06
2e-06,2e-06,3e-06,2e-06,1e-06,0,2e-06,1e-06,6e-06,6e-06,3e-06,5e-06,5e-06,2e-06,1e-06,3e-06,9e-06,3e-06,6e-06,1.7e-05,4e-06,2e-06,5e-06,2.8e-05,0.000433,6.9e-05,0.000219,0.000189,8.5e-05,0.000304,0.00034,0.000111,0.000103,0.000131,0.000127,0.000186,1.6e-05,9e-05,0.000125,0.000238,0.000267,0.000283,3.3e-05,0.000143,0.000116,6e-06,0.000144,9.7e-05,9.2e-05,8.3e-05,6.8e-05,0.000177,0.000172,0.000152,0.000257,0.000108,0.000204,0.000125,0.00021,0.000101,0.000209,0.000199,6.6e-05,0.00016,0.000225,8.1e-05,0.000132,0.000122,0.000107,5e-06,5.1e-05,0.000126,0.000105,6.5e-05,1.1e-05,9.4e-05,2.6e-05,9e-05,6.2e-05,1e-05,2.8e-05,4e-05,2e-05,1.6e-05,4.6e-05,2.1e-05,2.5e-05,2.8e-05,2e-05,2.1e-05,2.6e-05,2.2e-05,4.3e-05,2.2e-05,1.5e-05,8e-06,7e-06,1.7e-05,2.3e-05,1e-05,1.3e-05,1.2e-05,5e-06,2.5e-05,1e-05,8e-06,1e-05,5e-06,1.1e-05,1.3e-05,9e-06,1.4e-05,8e-06,1e-06,3e-06,6e-06,1e-06,1e-06,7e-06,1e-06,3e-06
1e-06,1e-06,1e-06,1e-06,1e-06,1e-06,2e-06,0,6e-06,4e-06,2e-06,4e-06,1e-06,2e-06,2e-06,1e-06,4e-06,1e-06,4e-06,1.4e-05,5e-06,3e-06,5e-06,1.9e-05,0.000313,9.5e-05,0.000125,0.000132,3.2e-05,0.000168,6.8e-05,5e-05,2e-05,5.3e-05,4.7e-05,0.000195,2.9e-05,0.000199,8.2e-05,0.000269,0.000159,8.3e-05,9.8e-05,0.000233,8.8e-05,0.00013,0.000123,9.9e-05,0.000141,6.9e-05,9.7e-05,0.000213,0.000194,0.000166,0.000276,0.000196,2.4e-05,0.000106,0.00022,2.3e-05,8.4e-05,0.000198,0.000115,9.8e-05,0.000124,7.9e-05,0.000158,0.00014,0.00017,2.9e-05,7.6e-05,6.8e-05,3.4e-05,3.1e-05,1.7e-05,2.7e-05,3.8e-05,2.3e-05,3.3e-05,2.2e-05,5e-06,2.3e-05,1.1e-05,4e-06,3.5e-05,1e-05,1.1e-05,1.6e-05,9e-06,3e-06,1.2e-05,2.7e-05,1.4e-05,6e-06,1.1e-05,9e-06,8e-06,7e-06,1.7e-05,6e-06,2e-06,9e-06,3e-06,1.8e-05,5e-06,1.1e-05,9e-06,5e-06,7e-06,3e-06,2e-06,8e-06,5e-06,4e-06,3e-06,4e-06,2e-06,3e-06,2e-06,0,1e-06
1e-06,1e-06,1e-06,1e-06,1e-06,1e-06,2e-06,0,6e-06,3e-06,1e-06,2e-06,2e-06,1e-06,1e-06,1e-06,3e-06,1e-06,4e-06,1.3e-05,3e-06,1e-06,3e-06,1.7e-05,0.000213,4.5e-05,0.000118,7.1e-05,3.3e-05,9.9e-05,7.1e-05,4.8e-05,9e-06,4.7e-05,4.3e-05,0.000132,5.9e-05,0.000208,8.6e-05,0.000184,8.1e-05,0.000118,0.00024,0.000111,7.9e-05,0.000119,0.00019,5e-05,0.000122,0.000137,7.5e-05,0.000142,0.00018,0.000187,0.00025,4.8e-05,6.8e-05,0.000164,0.000213,3.1e-05,2e-04,0.000176,0.000101,0.000106,9e-05,4.1e-05,0.000132,0.000153,0.000126,4e-05,5.3e-05,1.9e-05,2.8e-05,1e-05,8e-06,4.2e-05,1.8e-05,1.8e-05,3e-05,1.6e-05,4e-06,2.7e-05,1.7e-05,4e-06,2.6e-05,6e-06,5e-06,8e-06,3e-06,1e-06,8e-06,1.9e-05,9e-06,4e-06,5e-06,3e-06,5e-06,7e-06,1.5e-05,6e-06,8e-06,6e-06,1e-06,1.3e-05,2e-06,7e-06,3e-06,3e-06,4e-06,2e-06,2e-06,5e-06,5e-06,2e-06,3e-06,4e-06,3e-06,3e-06,2e-06,2e-06,2e-06
1e-06,1e-06,0,0,1e-06,1e-06,1e-06,0,6e-06,4e-06,0,2e-06,2e-06,2e-06,1e-06,0,4e-06,1e-06,3e-06,1.3e-05,2e-06,2e-06,1e-06,1.4e-05,0.000168,5.4e-05,0.000124,7e-05,2.8e-05,8.3e-05,6.4e-05,4.8e-05,5e-06,4.2e-05,5.1e-05,9.6e-05,2.2e-05,0.000217,0.000152,0.000234,6.8e-05,0.000101,0.000221,6.5e-05,5e-05,5.2e-05,0.000141,4.7e-05,0.000147,0.000185,4.7e-05,0.000188,2e-04,0.000203,0.000231,0.000119,6.5e-05,0.000137,0.000159,2e-05,0.00022,0.000202,7.2e-05,9e-05,6.6e-05,6e-05,0.000128,0.000103,0.000151,3.2e-05,5.9e-05,2.3e-05,3.1e-05,1.9e-05,1.2e-05,3.8e-05,1.3e-05,1.9e-05,2.4e-05,1.7e-05,3e-06,3e-05,2e-05,4e-06,2.6e-05,5e-06,5e-06,4e-06,2e-06,2e-06,7e-06,2e-05,9e-06,3e-06,7e-06,2e-06,6e-06,9e-06,1.8e-05,9e-06,5e-06,6e-06,1e-06,1.4e-05,2e-06,2e-06,3e-06,2e-06,5e-06,1e-06,1e-06,4e-06,4e-06,3e-06,2e-06,3e-06,2e-06,2e-06,3e-06,1e-06,0
