0.541632,0.408323,0.17859,0.225139,0.318316,0.211875,0.281868,0.382086,0.197338,0.057669,0.034356,0.128094,0.249366,0.302917,0.248155,0.114609,0.054723,0.045764,0.181906,0.515111,0.593329,0.288612,0.075484,0.043472,0.041677,0.175593,0.484947,0.543173
0.626713,0.474166,0.20716,0.265953,0.374052,0.252396,0.350643,0.468776,0.237611,0.068706,0.041546,0.155046,0.298126,0.356384,0.293564,0.138134,0.064825,0.05424,0.215559,0.625075,0.738596,0.361311,0.088698,0.051716,0.049669,0.209492,0.57755,0.63489
0.761823,0.572605,0.244691,0.325476,0.458675,0.320241,0.4665,0.607588,0.300906,0.086505,0.052906,0.195571,0.368656,0.42777,0.355606,0.173552,0.079133,0.066544,0.2671,0.815275,1.000734,0.490775,0.10954,0.064772,0.06175,0.258657,0.700904,0.74862
0.892964,0.642486,0.250978,0.35694,0.519887,0.382141,0.565214,0.716505,0.351075,0.101382,0.06108,0.217782,0.400936,0.440337,0.366157,0.18965,0.085358,0.074016,0.305245,1.001512,1.271459,0.615837,0.125408,0.07622,0.070129,0.288547,0.746866,0.76652
1.04434,0.713028,0.251019,0.411439,0.624887,0.468122,0.649245,0.805437,0.405809,0.125371,0.070691,0.248192,0.448226,0.451555,0.361372,0.194349,0.085436,0.080141,0.346467,1.191197,1.541419,0.740114,0.149599,0.097908,0.081971,0.326093,0.820017,0.817555
1.254914,0.846352,0.295173,0.592631,0.934661,0.676873,0.801069,0.983426,0.524072,0.177711,0.088303,0.340837,0.621068,0.582782,0.431352,0.223449,0.092184,0.095534,0.448826,1.524525,1.967435,0.946984,0.201796,0.138672,0.104114,0.409451,1.070106,1.069204
1.598242,1.11507,0.401654,0.91523,1.49576,1.050844,1.100078,1.353806,0.747811,0.262977,0.116568,0.515093,0.96385,0.869505,0.604387,0.299716,0.117313,0.132134,0.647558,2.139343,2.726992,1.309421,0.281454,0.19328,0.136766,0.538345,1.454661,1.477285
2.145623,1.546685,0.554302,1.322373,2.223016,1.540165,1.538592,1.922839,1.070176,0.368811,0.156314,0.735094,1.412128,1.263009,0.849946,0.41377,0.160531,0.18813,0.932565,3.077778,3.896348,1.843267,0.368005,0.245399,0.173806,0.708022,1.916629,1.970022
2.659445,1.963308,0.70044,1.700253,2.877948,1.989476,1.978435,2.503005,1.394376,0.459973,0.194209,0.919704,1.805293,1.615311,1.059735,0.514953,0.206041,0.241836,1.297914,4.362028,5.442769,2.487,0.433502,0.273671,0.200745,0.901692,2.425932,2.50253
2.960224,2.21004,0.787229,1.871057,3.1013,2.133122,2.185918,2.818687,1.599418,0.514083,0.217153,0.958824,1.904873,1.713592,1.12114,0.564127,0.234527,0.265347,1.618227,5.489025,6.669583,2.918925,0.448614,0.260957,0.196244,1.03615,2.801731,2.891078
3.124619,2.266336,0.781857,1.725003,2.727705,1.846333,2.066715,2.746081,1.59645,0.513337,0.212607,0.815448,1.626039,1.485775,0.989875,0.522798,0.222959,0.241909,1.681789,5.719601,6.737785,2.810785,0.392695,0.218535,0.169416,1.032443,2.825605,2.881837
3.137714,2.15132,0.699016,1.412766,2.133294,1.401708,1.629936,2.198242,1.322425,0.446885,0.180652,0.624058,1.252972,1.178555,0.793019,0.416852,0.175123,0.186774,1.386541,4.864086,5.761171,2.362525,0.293634,0.166117,0.134615,0.864499,2.41121,2.437379
2.965502,1.97405,0.607177,1.082896,1.594956,1.048521,1.2098,1.607063,1.019979,0.378978,0.145948,0.493387,1.007585,0.971299,0.632915,0.308249,0.129876,0.148247,0.932986,3.514512,4.485093,1.962063,0.223988,0.123065,0.102986,0.669595,1.901305,1.941661
2.691217,1.754033,0.518698,0.872512,1.258475,0.835685,0.980922,1.286479,0.833543,0.316887,0.117338,0.408076,0.871932,0.878896,0.557478,0.250182,0.112108,0.14293,0.618038,2.382726,3.323188,1.609969,0.197759,0.095126,0.081563,0.518912,1.457293,1.509536
2.751912,1.726523,0.456365,0.752928,1.127867,0.796387,0.905913,1.103912,0.680015,0.260981,0.096552,0.339073,0.760785,0.800221,0.510804,0.227939,0.119235,0.162089,0.544705,1.82681,2.601843,1.394243,0.235732,0.099752,0.079146,0.503267,1.249511,1.207461
3.850617,2.402369,0.547087,0.738073,1.2233,0.97437,1.023249,1.103283,0.593666,0.214356,0.093143,0.348689,0.808459,0.864508,0.560218,0.263754,0.144154,0.183566,0.565062,1.997385,3.146045,1.873219,0.359526,0.141138,0.101296,0.692274,1.584248,1.324676
5.591015,3.503437,0.768115,0.957434,1.633518,1.339237,1.344306,1.365568,0.67508,0.238653,0.113276,0.471428,1.100081,1.129301,0.693282,0.331422,0.175195,0.210248,0.638651,2.634864,4.517696,2.789194,0.525259,0.202266,0.140613,1.067724,2.393172,1.829729
7.335272,4.523635,0.98096,1.25265,2.094375,1.6848,1.673955,1.682039,0.826537,0.312232,0.142221,0.636668,1.473455,1.458588,0.859176,0.404832,0.207639,0.248905,0.720393,3.250029,5.758314,3.560203,0.643551,0.249681,0.173304,1.482199,3.310382,2.424474
8.591737,5.033062,1.063399,1.490439,2.37837,1.832143,1.886369,1.972789,1.002469,0.393914,0.168347,0.78524,1.749775,1.64487,0.955889,0.45958,0.228748,0.280416,0.824978,3.622151,6.178315,3.679278,0.627214,0.248303,0.177229,1.74761,3.901017,2.779622
8.691861,4.74762,1.029263,1.557848,2.306582,1.677492,1.838657,2.066377,1.117094,0.455045,0.185796,0.853148,1.811853,1.625051,0.980043,0.504801,0.234505,0.294277,0.996147,3.950935,6.041182,3.286526,0.506975,0.199991,0.154083,1.714562,3.774285,2.627468
7.345254,3.885448,1.004403,1.442485,1.991136,1.373469,1.57129,1.913621,1.113847,0.489339,0.198639,0.826506,1.737109,1.545229,0.971999,0.533913,0.242061,0.296921,1.105886,4.541872,6.545533,3.234597,0.409809,0.163034,0.124022,1.375479,2.975672,2.082787
5.162971,2.841994,1.018916,1.385838,1.928207,1.293212,1.309754,1.676959,1.091375,0.546243,0.202644,0.706723,1.565764,1.489718,0.994607,0.556402,0.254504,0.289153,1.061869,4.981627,7.339151,3.509128,0.371095,0.161025,0.108842,0.942039,2.012165,1.50519
3.776049,2.221972,1.023484,1.453378,1.986087,1.255574,1.055507,1.387426,1.07498,0.618493,0.201261,0.544775,1.291081,1.312927,0.922842,0.525696,0.241393,0.261931,0.897129,4.591165,6.95444,3.337073,0.339703,0.159767,0.099655,0.622988,1.384028,1.158763
3.402089,1.926662,0.898364,1.447556,1.90233,1.120448,0.957329,1.330531,1.077668,0.609953,0.187793,0.379431,0.890222,0.935271,0.693869,0.411093,0.203203,0.217207,0.766957,3.592303,5.341644,2.584618,0.287121,0.144414,0.084413,0.510058,1.23998,1.076585
2.772775,1.512597,0.700978,1.272564,1.699986,0.982152,0.957956,1.38352,1.002332,0.492089,0.157621,0.257814,0.528366,0.559636,0.439262,0.271829,0.150674,0.154012,0.662395,2.633201,3.85597,1.978149,0.249008,0.114004,0.066155,0.450714,1.175989,1.026571
2.271489,1.323495,0.547525,1.014264,1.479561,0.875762,0.862465,1.250663,0.787292,0.32825,0.115598,0.229037,0.398401,0.359874,0.263064,0.168624,0.105925,0.108029,0.584936,2.07463,2.922921,1.513102,0.20297,0.085871,0.053962,0.377802,1.01867,0.921637
1.992815,1.28082,0.460658,0.878851,1.328536,0.758881,0.698998,1.008514,0.575058,0.207097,0.081935,0.227167,0.37523,0.296123,0.215315,0.150175,0.089288,0.083728,0.521221,1.761703,2.25485,1.072506,0.153826,0.07588,0.052574,0.382601,0.975448,0.853689
2.0017,1.25224,0.425743,0.842179,1.208695,0.64622,0.607,0.896388,0.514045,0.17504,0.071018,0.226384,0.387506,0.30885,0.235818,0.174741,0.085197,0.065361,0.504453,1.477381,1.648989,0.743668,0.154729,0.086935,0.060643,0.437514,1.112639,0.925748
1.840046,1.087761,0.389237,0.771517,1.026912,0.51517,0.583829,0.89053,0.514353,0.171835,0.075695,0.234802,0.468682,0.434714,0.348915,0.254676,0.101199,0.059372,0.517921,1.497357,1.649167,0.736036,0.176854,0.105468,0.073011,0.473017,1.287785,1.090066
1.689377,0.914504,0.331474,0.733816,0.953129,0.45912,0.542023,0.813229,0.458847,0.157402,0.084137,0.264338,0.598536,0.605444,0.497488,0.361844,0.129668,0.055995,0.513763,1.550336,1.722064,0.755286,0.179623,0.109095,0.080981,0.46086,1.361091,1.212082
1.681855,0.829612,0.274804,0.675446,0.916012,0.472952,0.461254,0.657298,0.377927,0.153704,0.097298,0.289704,0.692674,0.722816,0.604622,0.450488,0.159757,0.05501,0.4558,1.358229,1.495874,0.672557,0.165996,0.09394,0.080289,0.380988,1.242583,1.209861
1.613436,0.778151,0.248919,0.549529,0.794512,0.46695,0.36361,0.52326,0.334465,0.15926,0.109556,0.285354,0.671039,0.692856,0.59565,0.465714,0.166654,0.051135,0.364536,0.992599,1.131708,0.594848,0.151823,0.078381,0.07394,0.272416,0.970545,1.051764
1.462085,0.699032,0.233341,0.456886,0.64747,0.391829,0.273804,0.413149,0.288133,0.152184,0.106621,0.240649,0.525545,0.53085,0.482743,0.396306,0.14266,0.04309,0.292076,0.853422,1.106738,0.645351,0.137776,0.071983,0.06444,0.202968,0.691058,0.779852
1.352444,0.666007,0.208175,0.398537,0.504143,0.275899,0.233483,0.344818,0.240269,0.137645,0.088761,0.178338,0.354656,0.405737,0.413891,0.305985,0.103128,0.032063,0.243905,0.896636,1.33067,0.764554,0.138963,0.075262,0.058276,0.18211,0.478518,0.496082
1.238003,0.660118,0.211504,0.416137,0.477943,0.206569,0.210914,0.30328,0.218276,0.128836,0.071394,0.131271,0.262244,0.344672,0.342866,0.215043,0.069136,0.028747,0.219095,0.939652,1.50349,0.852719,0.155351,0.094405,0.071175,0.190934,0.362257,0.326888
1.045856,0.604457,0.230275,0.439406,0.494275,0.191861,0.188935,0.278447,0.22194,0.145076,0.071676,0.109419,0.217186,0.282305,0.240925,0.133343,0.047584,0.034255,0.220279,1.01962,1.590377,0.875649,0.17018,0.105529,0.079899,0.205125,0.370832,0.289392
0.804189,0.478814,0.224353,0.405741,0.461121,0.1811,0.1661,0.254571,0.21929,0.150851,0.065931,0.082492,0.155033,0.198668,0.169959,0.090623,0.038623,0.03533,0.205286,0.981911,1.467465,0.770762,0.151361,0.093676,0.071183,0.200949,0.37953,0.270418
0.670299,0.380741,0.188064,0.316812,0.358961,0.153584,0.167241,0.23191,0.189101,0.134351,0.051357,0.056654,0.105345,0.164136,0.156851,0.072778,0.030714,0.029259,0.169219,0.794123,1.149487,0.567392,0.10312,0.062898,0.047559,0.171737,0.366092,0.277342
0.635218,0.349303,0.149872,0.216745,0.232831,0.121041,0.176548,0.207938,0.147408,0.108518,0.039091,0.051459,0.094135,0.174569,0.162148,0.062133,0.025394,0.023828,0.140735,0.576287,0.791021,0.365426,0.05929,0.032224,0.023965,0.147073,0.343562,0.268129
0.56263,0.292183,0.121994,0.147524,0.136785,0.083056,0.178807,0.208421,0.139442,0.090933,0.035069,0.049111,0.083841,0.188043,0.194622,0.079629,0.034691,0.028433,0.146844,0.526075,0.578017,0.223329,0.051164,0.026117,0.019227,0.140132,0.325862,0.236582
