6.3e-05,7.2e-05,3e-06,7.6e-05,3.2e-05,1.4e-05,8e-06,1.7e-05,6.1e-05,5e-06,8.9e-05,2.1e-05,2.6e-05,4.6e-05,4e-05,4.2e-05,3.1e-05,5.2e-05,2.4e-05,3.1e-05,4.3e-05,5.9e-05,6e-05,2.7e-05,4.9e-05,1.2e-05,2.9e-05,2.3e-05,6.8e-05,8.3e-05,6.2e-05,8.2e-05,6e-06,1.5e-05,1.4e-05,6.2e-05,3.6e-05,5.3e-05,1.2e-05,1e-06,5.2e-05,3.6e-05,3.7e-05,2.2e-05,7e-06,5.2e-05,1.5e-05,9.2e-05,1e-06,9.8e-05,7.1e-05,8.3e-05,3.9e-05,2.2e-05,2e-06,4.2e-05,4e-06,3.7e-05,3.9e-05,2e-05,3e-06,3.3e-05,7e-06,2.6e-05,4e-05,9.6e-05,1.9e-05,5.5e-05,6e-06,0.00011,1.3e-05,9.3e-05,4.3e-05,3.2e-05,2.7e-05,5.6e-05,2.7e-05,4.4e-05,3.2e-05,1e-06,5e-06,3.9e-05,1e-06,9e-06,2e-06,5.1e-05,1e-06,6e-05,6.2e-05,5.3e-05,3e-06,1.8e-05,8e-06,6.6e-05,2.9e-05,4e-05,4.8e-05,7e-06,6e-06,2.1e-05,2.5e-05,2.4e-05,8.5e-05,8e-06,2.5e-05,2.4e-05,3.8e-05,1.1e-05,7.5e-05,9.8e-05,2.5e-05,7.3e-05,8e-06,1.6e-05,2.2e-05,5.4e-05,6.6e-05,2.1e-05,5.2e-05,8.9e-05,9.3e-05
9.7e-05,0.000249,0.00018,0.000172,0.000203,0.000134,0.000118,4.5e-05,0.00013,8.7e-05,0.000156,0.000203,0.000167,0.000178,0.000102,0.000213,9.5e-05,0.000193,0.000167,0.000121,0.000155,0.000218,0.000253,0.000217,9.5e-05,0.000103,0.000121,6.7e-05,9.6e-05,0.000265,0.000272,0.000327,0.000173,0.000179,0.000203,0.000117,0.000144,3e-06,8.9e-05,3.8e-05,1e-04,0.000138,0.000161,9.5e-05,6.1e-05,0.000137,0.000142,0.000177,0.00026,7.8e-05,0.00027,0.000174,0.000219,0.000108,5.5e-05,7.9e-05,0.000167,0.000219,0.000198,0.000131,0.00018,0.000156,8.7e-05,9.3e-05,0.000133,0.000127,0.000206,3.6e-05,9.1e-05,0.000221,0.000247,0.000118,0.000282,0.000398,0.00019,0.000168,6.7e-05,0.000128,8.2e-05,5.2e-05,8.9e-05,5.6e-05,8e-05,0.000159,8.3e-05,9.1e-05,0.000128,1e-04,0.000228,3.4e-05,4.3e-05,9.4e-05,4.7e-05,0.000122,0.000171,4.9e-05,0.00014,9.5e-05,4.8e-05,7.2e-05,7.9e-05,6.4e-05,0.000206,0.000143,3.9e-05,0.000106,0.000255,0.000235,0.000115,0.000222,0.000258,3.8e-05,0.000163,8.2e-05,0.000131,0.000201,0.000281,8.6e-05,8.9e-05,0.000258,0.000331
4.7e-05,0.000177,0.000184,0.000322,0.000282,0.000209,9.8e-05,5.7e-05,0.000141,0.000156,0.000204,0.00018,8.8e-05,0.000215,0.000141,0.000127,8.9e-05,0.000257,0.000205,0.000262,0.000226,8.9e-05,7.3e-05,0.000108,7.4e-05,8.4e-05,7.5e-05,8.2e-05,7.7e-05,0.000134,0.000152,0.000102,0.000199,0.00025,0.000335,0.000205,0.000217,0.000216,0.000236,8.9e-05,1e-04,0.000143,9.6e-05,0.000168,9.8e-05,0.00017,0.000135,0.000118,0.000252,0.000315,0.00014,6.1e-05,0.000137,0.000101,3.9e-05,0.000132,9.7e-05,0.000202,0.000104,5.9e-05,0.00014,0.000257,0.000128,7.7e-05,0.000171,0.000243,0.000407,0.000272,0.000144,4.6e-05,0.000252,0.000265,0.000176,0.000322,0.00021,5.8e-05,0.000147,0.000265,0.000177,0.000125,0.000165,0.000108,9.3e-05,0.000193,0.000156,4.4e-05,0.000113,0.000101,0.000196,0.000252,0.00015,0.000152,0.00011,0.000159,0.000132,0.000114,0.000118,9e-05,7.8e-05,0.000133,0.000149,0.000188,0.000289,0.000209,0.00019,0.000187,0.00019,0.000305,0.000173,0.000232,6e-05,0.000199,0.000238,0.000114,0.000191,7.3e-05,0.000143,0.000143,0.000114,0.000207,0.000216
0.000118,5.1e-05,3.7e-05,0.00021,8.5e-05,0.000174,0.000196,0.000124,0.000217,0.000111,5e-05,4.8e-05,0.000129,9.1e-05,9.1e-05,0.000138,9.2e-05,0.000182,3.3e-05,9.7e-05,8.5e-05,0.000147,1e-04,8.2e-05,5.9e-05,6.2e-05,9.4e-05,5.6e-05,7.2e-05,0.000104,6.8e-05,0.000112,7.7e-05,0.000185,9.2e-05,6.2e-05,0.000159,0.000101,0.000139,0.000122,0.000116,8.3e-05,8.9e-05,0.000124,5.4e-05,0.000179,0.000247,0.000151,0.000229,8.5e-05,0.000169,0.000141,0.000106,4.7e-05,7.3e-05,0.000149,0.000197,6e-05,0.000117,0.000118,2e-05,0.000165,0.000124,5.8e-05,7.4e-05,0.000178,0.000239,0.000106,0.000167,5.1e-05,0.000143,6.2e-05,0.000109,0.000174,0.000148,0.000139,8.1e-05,0.000155,6.5e-05,8e-05,0.000134,0.000133,0.000219,0.00028,0.000159,0.000149,6.8e-05,0.000108,0.000121,8.5e-05,0.000164,0.000171,9.5e-05,0.000116,1.4e-05,5.9e-05,0.000104,0.000111,1.3e-05,8.1e-05,0.000176,7.5e-05,9.9e-05,8.1e-05,6.6e-05,0.000124,0.000289,0.000141,0.00011,0.000147,9.7e-05,0.000179,2.5e-05,6.6e-05,0.000133,0.000117,0.000163,0.000215,0.000187,0.000122,0.000105
0.000113,0.000123,6.3e-05,4.7e-05,7.4e-05,8.8e-05,6.5e-05,3.8e-05,0.000117,4.5e-05,5.5e-05,7e-05,8.4e-05,8.9e-05,0.000147,7.3e-05,6e-05,1.6e-05,3.7e-05,1.9e-05,8.6e-05,5.2e-05,5.3e-05,2.7e-05,2.2e-05,4.5e-05,7.1e-05,0.000118,0.000119,5.4e-05,7.4e-05,3.4e-05,2.6e-05,0.000148,8.2e-05,5.2e-05,8.8e-05,7e-06,0.000105,6.8e-05,3.1e-05,1e-05,7.4e-05,5.9e-05,4.2e-05,0.000149,8.4e-05,9.7e-05,9.3e-05,5e-05,9.5e-05,7.7e-05,2.3e-05,0.000123,0.000202,0.000106,1.3e-05,8.7e-05,6.1e-05,2.1e-05,5.4e-05,0.000109,0.000114,3.7e-05,4.7e-05,7.2e-05,0.000153,6.1e-05,0.000103,0.000151,0.000112,0.000103,9.3e-05,0.000138,9.7e-05,1.1e-05,0.000197,8.3e-05,0.000149,9.5e-05,0.000139,3.2e-05,0.000139,8.1e-05,3.7e-05,0.000106,5e-05,0.000108,2e-05,1.9e-05,0.000129,0.000152,5.2e-05,9.7e-05,1e-04,6e-05,4.5e-05,5.5e-05,7.5e-05,8.4e-05,0.000104,0.000123,9.5e-05,8.6e-05,6.8e-05,0.000152,0.000104,6.9e-05,1e-05,8.5e-05,6.5e-05,8e-05,9.7e-05,6.2e-05,6.3e-05,0.000106,0.000143,0.000109,2.9e-05,7.1e-05,9.9e-05
0.000127,8.3e-05,2.6e-05,4.7e-05,0.000118,0.000151,0.000109,9.7e-05,6.8e-05,2.5e-05,8.8e-05,2.4e-05,0.000104,8.7e-05,5.5e-05,9.7e-05,9.8e-05,4.7e-05,4.1e-05,5.3e-05,3e-05,7e-06,3.3e-05,4e-06,1.8e-05,6.4e-05,4e-05,8.7e-05,4e-05,3.7e-05,7.8e-05,4.5e-05,4.6e-05,7.2e-05,8.5e-05,5.1e-05,6.4e-05,4.2e-05,6.3e-05,3.1e-05,1.8e-05,2e-05,6.3e-05,3e-05,2.8e-05,8.8e-05,0.000119,7.5e-05,0.000119,9.4e-05,8.7e-05,8.7e-05,4.4e-05,6.4e-05,0.000121,4.4e-05,5.3e-05,4.4e-05,0.000121,5.4e-05,8.5e-05,2.8e-05,7.3e-05,6.3e-05,2.2e-05,5.6e-05,6.7e-05,6.8e-05,6.3e-05,0.000138,0.000136,4e-05,5e-05,0.000118,6.1e-05,1.9e-05,0.000162,0.00012,0.000152,7.9e-05,8.5e-05,2.9e-05,4.2e-05,9.1e-05,2.2e-05,8e-05,0.000112,2.7e-05,3.1e-05,6.7e-05,0.000126,0.000122,9.7e-05,7.3e-05,0.000136,7.7e-05,1.9e-05,6.9e-05,7.8e-05,2e-05,8.8e-05,9e-05,0.000123,3e-05,3e-05,7e-05,9.2e-05,0.000106,6.3e-05,1.5e-05,4.6e-05,6.6e-05,6.5e-05,2.4e-05,0.000123,0.000142,5.2e-05,0.00011,8.9e-05,7.3e-05,0.000143
0.000103,6.6e-05,3.2e-05,7.6e-05,7e-05,3.4e-05,6e-05,5.7e-05,4.5e-05,3.7e-05,0.000121,9.2e-05,4.7e-05,4.8e-05,9.7e-05,2.6e-05,8e-06,9.5e-05,7e-06,4.7e-05,2.2e-05,2.4e-05,5.2e-05,4e-06,2e-06,6.5e-05,3e-05,4.2e-05,3.8e-05,1.3e-05,5e-05,1.4e-05,5.3e-05,9.1e-05,5.1e-05,2.5e-05,5.8e-05,4.7e-05,2.5e-05,2.1e-05,7.9e-05,3.8e-05,6.2e-05,3e-06,2.9e-05,1.5e-05,2e-05,3.8e-05,5e-05,4.4e-05,0.000121,5.4e-05,4e-05,1.8e-05,6.2e-05,7.6e-05,9.7e-05,2.5e-05,0.000116,0.000145,0.000112,6.5e-05,5.1e-05,0.000138,8.9e-05,8.3e-05,9.2e-05,6.8e-05,8.9e-05,7e-05,7.1e-05,0.000111,6.5e-05,0.000123,6.2e-05,6.8e-05,8.6e-05,5e-05,9.1e-05,0.000102,0.000118,1.2e-05,5.8e-05,1.4e-05,2.2e-05,5.9e-05,0.000137,0.000106,6.6e-05,6.6e-05,3.7e-05,3.2e-05,4.4e-05,0.000123,4.2e-05,6.9e-05,2.5e-05,6.1e-05,4.8e-05,4.2e-05,7.2e-05,0.000128,6e-05,6.6e-05,3.8e-05,7e-05,9.4e-05,3.2e-05,5.3e-05,8.7e-05,5.3e-05,2.6e-05,2.1e-05,2.7e-05,0.000104,4.7e-05,8e-05,6.8e-05,5.3e-05,8.1e-05,3.2e-05
6.8e-05,8.4e-05,1.8e-05,3.7e-05,6.2e-05,4.4e-05,5.8e-05,9e-05,7e-06,3.2e-05,9.4e-05,1.6e-05,5e-06,2.7e-05,8.5e-05,4.7e-05,3.9e-05,6.7e-05,6.2e-05,7.6e-05,3.2e-05,2.1e-05,4.3e-05,3.8e-05,2.8e-05,5.1e-05,3.4e-05,1.5e-05,3.4e-05,5.1e-05,2.8e-05,4.5e-05,5e-06,2.7e-05,5.6e-05,5.3e-05,9e-06,1.3e-05,1.9e-05,1.1e-05,7.3e-05,3.8e-05,2.6e-05,3.2e-05,4.7e-05,3.6e-05,6.7e-05,2e-06,3.1e-05,4.8e-05,8.6e-05,8e-06,4.1e-05,0.000107,8.3e-05,6.1e-05,2.8e-05,3e-05,8.5e-05,6.8e-05,9.6e-05,8.7e-05,7.7e-05,0.000187,9.6e-05,9.5e-05,0.000103,5.6e-05,5.7e-05,6.8e-05,6.4e-05,0.000117,7.7e-05,5.2e-05,7.1e-05,0.000111,0.000108,8e-06,8.3e-05,3.5e-05,7.9e-05,0.000119,4.2e-05,0.000136,7.4e-05,5.1e-05,4.8e-05,3e-06,1.2e-05,2.7e-05,5.6e-05,6.8e-05,4.1e-05,7.4e-05,9.1e-05,2.8e-05,4.2e-05,4.9e-05,0.000141,0.000106,7.2e-05,8.9e-05,0.000141,0.000121,0.000153,0.00011,0.000114,3.3e-05,1e-04,0.000189,0.00011,7.1e-05,6.7e-05,6.2e-05,6.9e-05,5.2e-05,5.7e-05,4.4e-05,9.1e-05,3.1e-05,5e-05
2.1e-05,2.6e-05,3.3e-05,2e-05,1.7e-05,1e-05,4.8e-05,6.4e-05,5.2e-05,4e-05,5.8e-05,5.7e-05,1.7e-05,6e-05,2e-05,8e-06,3.2e-05,1.4e-05,9e-06,4.1e-05,4.2e-05,1.4e-05,3.3e-05,4.2e-05,2.7e-05,6e-06,1.7e-05,3.6e-05,3e-05,3e-05,2.3e-05,3.1e-05,3.1e-05,5.1e-05,4e-05,1e-06,1.5e-05,1.6e-05,1e-05,2e-05,2e-05,2.9e-05,4.2e-05,3.6e-05,9e-06,5e-06,3.4e-05,5.6e-05,1.1e-05,4.7e-05,3.9e-05,6.1e-05,4.8e-05,7.1e-05,7.1e-05,8.6e-05,8.3e-05,4.8e-05,6.7e-05,2.1e-05,0.000163,7.6e-05,7.3e-05,0.000143,7.5e-05,5.2e-05,7e-06,8.4e-05,5.5e-05,8.9e-05,6.6e-05,7.8e-05,9.2e-05,8e-05,8e-06,8.8e-05,4.4e-05,5.8e-05,4.4e-05,4.9e-05,5.5e-05,5.5e-05,0.000119,0.00015,9.4e-05,5.5e-05,2.6e-05,4.7e-05,1.5e-05,7.5e-05,0.000123,9.9e-05,7.2e-05,3e-05,2.7e-05,2.6e-05,8e-05,0.000109,0.000137,0.000134,7e-05,1.5e-05,7.4e-05,0.000114,0.000146,3.7e-05,4.3e-05,3.9e-05,4e-05,9.5e-05,3.1e-05,4.7e-05,9.4e-05,3.1e-05,9e-05,4.7e-05,3.9e-05,5.4e-05,4.4e-05,5.5e-05,0.000105
5e-05,2.7e-05,9e-06,2.7e-05,2.4e-05,5.8e-05,6e-06,1e-06,2.1e-05,2.2e-05,3.8e-05,4.2e-05,7.3e-05,1.1e-05,1.7e-05,1.2e-05,3.5e-05,4.1e-05,1.6e-05,3.4e-05,8.4e-05,6.2e-05,4.2e-05,6e-06,2.2e-05,2.5e-05,1.3e-05,2.6e-05,6e-06,1e-05,5e-06,1e-05,1.5e-05,4.7e-05,1.8e-05,1e-05,1.5e-05,1.9e-05,2.9e-05,1.5e-05,1.4e-05,1.8e-05,2.7e-05,1.5e-05,6e-06,9e-06,1.4e-05,2.6e-05,4.6e-05,2.4e-05,3.4e-05,3.5e-05,1.5e-05,2.7e-05,7e-05,2.3e-05,4.3e-05,1.2e-05,3.7e-05,2.4e-05,0.000105,8.2e-05,7e-06,0.000118,4.5e-05,5.7e-05,3.7e-05,6.4e-05,9e-06,5.1e-05,6.3e-05,1.3e-05,3.1e-05,6e-05,4.2e-05,2.4e-05,8.3e-05,5.2e-05,9.3e-05,5.5e-05,1.2e-05,2.7e-05,3.3e-05,2.7e-05,3.2e-05,1.1e-05,6.4e-05,6.3e-05,7.7e-05,2.7e-05,5e-05,1e-05,2e-05,3.3e-05,3.1e-05,2.6e-05,7.3e-05,9e-06,1e-04,7.4e-05,9e-06,3.2e-05,6.9e-05,0.000132,3.1e-05,3.1e-05,9.1e-05,6.2e-05,5.2e-05,3.4e-05,3.2e-05,3.1e-05,6.1e-05,5.3e-05,6.7e-05,5.2e-05,8.4e-05,5.5e-05,6.9e-05,6.4e-05,5e-05
4.8e-05,3.9e-05,1.7e-05,3.7e-05,1.5e-05,5.7e-05,4.5e-05,1.5e-05,1.4e-05,2.3e-05,3.3e-05,1.7e-05,4.7e-05,2.6e-05,1.5e-05,2.8e-05,1.8e-05,3e-05,1.8e-05,1.1e-05,5.2e-05,5.3e-05,2.5e-05,7e-06,1.6e-05,2.8e-05,1.8e-05,2.1e-05,1.8e-05,1.6e-05,7e-06,1.1e-05,9e-06,4.7e-05,2.1e-05,2.3e-05,1.5e-05,1.2e-05,1.1e-05,5e-06,2.9e-05,1.2e-05,3.2e-05,2.9e-05,1.5e-05,1.4e-05,1e-05,2.5e-05,5.9e-05,5.3e-05,5.4e-05,4.3e-05,7e-06,3.3e-05,2.9e-05,3.5e-05,3e-05,3e-05,6.2e-05,5.2e-05,7.2e-05,7.4e-05,7.2e-05,8.6e-05,7.6e-05,7.3e-05,8.4e-05,5.1e-05,6.1e-05,4.8e-05,5.2e-05,4e-05,7e-05,1.7e-05,2.9e-05,3.8e-05,6.5e-05,2.2e-05,5.8e-05,4.9e-05,3.6e-05,2.4e-05,1.5e-05,2.6e-05,2.9e-05,2.7e-05,5.8e-05,1.7e-05,3.9e-05,5.8e-05,4e-05,2.5e-05,2.9e-05,5.6e-05,3.1e-05,3.9e-05,5.6e-05,4.2e-05,5.4e-05,2.1e-05,1e-05,3.8e-05,3e-05,4.9e-05,1.1e-05,2.6e-05,8.1e-05,2.4e-05,7.1e-05,8.7e-05,4.4e-05,2.1e-05,6.2e-05,6.5e-05,6.2e-05,3.9e-05,7.1e-05,3.8e-05,4.7e-05,4.2e-05,7.7e-05
3.8e-05,4e-06,1.3e-05,2.7e-05,8e-06,2.4e-05,1.3e-05,1e-05,6e-06,2.9e-05,1.2e-05,4e-06,4.9e-05,1e-05,3e-05,2.4e-05,2.4e-05,1.7e-05,1.8e-05,6e-06,2.9e-05,2.6e-05,9e-06,3e-06,1e-05,1e-05,6e-06,1.5e-05,1.5e-05,6e-06,1.6e-05,7e-06,1.4e-05,4.4e-05,2.5e-05,9e-06,1.7e-05,4e-06,4e-06,1.5e-05,7e-06,8e-06,3.2e-05,8e-06,8e-06,2.2e-05,3.4e-05,2.6e-05,3.5e-05,4.6e-05,1.8e-05,8e-06,2.3e-05,3.5e-05,8e-06,2e-05,8e-06,5e-06,2.6e-05,2e-05,1.7e-05,9.2e-05,5e-05,1e-05,1.8e-05,1.5e-05,4.9e-05,4.4e-05,3.9e-05,2.1e-05,8e-06,4.6e-05,2.9e-05,2.3e-05,3e-05,3.1e-05,1.9e-05,1.9e-05,2.2e-05,5.1e-05,7e-06,1.2e-05,2.4e-05,3.9e-05,1.1e-05,8e-06,4.3e-05,1.7e-05,1.8e-05,2.7e-05,2.6e-05,2.6e-05,2.7e-05,1.9e-05,1.5e-05,1.6e-05,4.5e-05,3e-05,2.4e-05,2.1e-05,3e-05,1.8e-05,2.7e-05,2.5e-05,3e-05,1.8e-05,3.8e-05,1.3e-05,6.3e-05,6.5e-05,3.8e-05,1.9e-05,3.6e-05,4e-05,4.9e-05,2.7e-05,2.8e-05,2.7e-05,4.8e-05,4.3e-05,2.3e-05
2.5e-05,1.5e-05,1.2e-05,1.8e-05,1.1e-05,1.6e-05,1.3e-05,7e-06,8e-06,1e-05,3e-06,3e-06,3.6e-05,1.9e-05,2.7e-05,1.7e-05,7e-06,1.4e-05,9e-06,1.4e-05,2.3e-05,4e-06,1.3e-05,4e-06,1.3e-05,1.7e-05,1.3e-05,1.6e-05,1e-05,1.3e-05,1.5e-05,1.3e-05,1.2e-05,3.4e-05,1.8e-05,1.8e-05,1.8e-05,5e-06,1.6e-05,3e-06,9e-06,1.2e-05,1.1e-05,4e-06,7e-06,2.1e-05,1.9e-05,3e-05,3.2e-05,3.1e-05,9e-06,6e-06,1.6e-05,4.3e-05,7e-06,1.5e-05,9e-06,4e-06,1.1e-05,5e-06,2.7e-05,3.7e-05,9e-06,1.2e-05,1.6e-05,2.6e-05,1.9e-05,2.1e-05,1.3e-05,1.4e-05,2.3e-05,1.5e-05,1.9e-05,1.3e-05,7e-06,2.4e-05,1.4e-05,2e-05,9e-06,2.4e-05,1.2e-05,1.1e-05,3e-05,1.6e-05,6e-06,1e-05,4.3e-05,6e-06,1.7e-05,1.7e-05,2.1e-05,1.3e-05,1.3e-05,2.5e-05,1.5e-05,2.2e-05,2.1e-05,1.8e-05,1.6e-05,4.1e-05,1.3e-05,2.3e-05,3.1e-05,1.3e-05,1.5e-05,8e-06,3.3e-05,1.8e-05,3.8e-05,2.8e-05,1.5e-05,2e-06,2e-05,2.5e-05,2.5e-05,3.5e-05,2.3e-05,1.6e-05,3.8e-05,1.6e-05,3e-05
3.3e-05,1.3e-05,1.6e-05,2.7e-05,2.6e-05,2.8e-05,3.2e-05,9e-06,6e-06,1.2e-05,7e-06,1.1e-05,4e-05,2.3e-05,3.8e-05,1.6e-05,1.1e-05,1.3e-05,1.6e-05,3e-05,2.3e-05,2e-05,3.3e-05,3e-05,1.2e-05,1.6e-05,1.1e-05,2.3e-05,2.7e-05,2.2e-05,3.4e-05,2.4e-05,2.5e-05,3.7e-05,1.8e-05,1e-05,2.6e-05,1.4e-05,1.7e-05,1.2e-05,1.2e-05,5e-06,1.1e-05,7e-06,1.5e-05,1.8e-05,2.4e-05,2.1e-05,1.9e-05,2.9e-05,1e-05,1.6e-05,6e-06,5.7e-05,2.1e-05,2.7e-05,1.3e-05,1.2e-05,1.2e-05,8e-06,3.5e-05,2.4e-05,2.4e-05,2.9e-05,2.9e-05,2.2e-05,1.1e-05,1.8e-05,3.2e-05,3.2e-05,1.8e-05,2.8e-05,4e-05,3.9e-05,5e-06,2.6e-05,2.3e-05,2.1e-05,2.2e-05,1e-05,1.3e-05,1.1e-05,2.6e-05,1.2e-05,5e-06,1.9e-05,3.4e-05,1.3e-05,2.6e-05,1.6e-05,1.8e-05,5e-06,1.5e-05,2e-05,3.1e-05,2.5e-05,2.2e-05,2.6e-05,3.9e-05,3.1e-05,2.6e-05,2.6e-05,1.5e-05,4.6e-05,1e-05,2.5e-05,2.4e-05,1.6e-05,1.6e-05,2.2e-05,2.4e-05,1.9e-05,6e-06,2.5e-05,3.3e-05,4.3e-05,1.1e-05,2.5e-05,3.9e-05,1.5e-05,4e-05
1.7e-05,1.6e-05,3.6e-05,2.2e-05,2.4e-05,6e-06,1.3e-05,1.9e-05,1.8e-05,3.2e-05,3e-05,2.9e-05,1.7e-05,1.3e-05,4.3e-05,2.2e-05,2.1e-05,2.5e-05,3e-05,3.5e-05,1.8e-05,4.3e-05,4.4e-05,2.3e-05,2.8e-05,2.9e-05,3.5e-05,1.8e-05,2.8e-05,1.2e-05,2.3e-05,3e-06,1.3e-05,3.7e-05,1.6e-05,2.4e-05,2.8e-05,4.4e-05,2.9e-05,2.3e-05,1.9e-05,1.7e-05,9e-06,2e-06,1.9e-05,1.4e-05,1.7e-05,2.3e-05,4.1e-05,4.5e-05,1.7e-05,3.7e-05,3.1e-05,7.4e-05,1.3e-05,2.1e-05,2.5e-05,3.5e-05,2.8e-05,8e-06,1.6e-05,3.7e-05,3.4e-05,1.2e-05,3.7e-05,4.8e-05,1.8e-05,3e-05,2.3e-05,2.6e-05,3.8e-05,5.6e-05,4.8e-05,3.3e-05,4.3e-05,5.3e-05,6.8e-05,6.8e-05,6.3e-05,4.7e-05,3.3e-05,2.4e-05,2.2e-05,2.4e-05,1.8e-05,3.6e-05,3.9e-05,5.1e-05,4.1e-05,5e-05,4.1e-05,2.1e-05,2.3e-05,3.4e-05,3.1e-05,7.6e-05,7.1e-05,0.000102,7e-05,6.4e-05,1.9e-05,3.3e-05,3.5e-05,5.6e-05,5e-05,1.7e-05,0.000127,7e-05,4.1e-05,3.4e-05,1.5e-05,3.4e-05,1.1e-05,4.5e-05,8e-06,4.4e-05,5.1e-05,4.3e-05,5.1e-05,7e-05,2.3e-05
2.2e-05,1e-05,2e-05,1.1e-05,1.1e-05,8e-06,9e-06,4e-06,1.5e-05,2.8e-05,3e-05,3.8e-05,5.1e-05,9e-06,2.5e-05,3.2e-05,4e-06,5e-06,3.7e-05,3e-06,1.7e-05,2.1e-05,1.5e-05,1e-05,1.5e-05,2.9e-05,8e-06,1.3e-05,1.4e-05,6e-06,1.3e-05,6e-06,1e-05,5.3e-05,3.1e-05,7e-06,8e-06,2.5e-05,8e-06,3.8e-05,1.1e-05,7e-06,1.8e-05,1.4e-05,1.1e-05,1.8e-05,1.8e-05,2.3e-05,3.8e-05,4.6e-05,2.2e-05,2.5e-05,2.2e-05,2.5e-05,6.9e-05,2.4e-05,2.6e-05,1.9e-05,1.1e-05,1.9e-05,3.1e-05,2.7e-05,6e-06,2.7e-05,7e-06,7.6e-05,3.9e-05,3.1e-05,3.7e-05,6.8e-05,2.4e-05,4.4e-05,4.3e-05,3.5e-05,4.1e-05,2.3e-05,2.4e-05,2.7e-05,1.5e-05,1.2e-05,3.5e-05,2.4e-05,2e-05,3.5e-05,2.4e-05,3.7e-05,7.6e-05,7.9e-05,4e-05,3.7e-05,6e-06,1e-05,5.1e-05,2.4e-05,4.2e-05,7.9e-05,4.9e-05,6.8e-05,3.8e-05,3.2e-05,3.6e-05,4.8e-05,3.2e-05,2.2e-05,1.5e-05,5e-05,0.000159,6.7e-05,8e-05,3.7e-05,2.9e-05,2.5e-05,4.7e-05,8.7e-05,7e-05,1e-05,1.9e-05,7e-06,2.3e-05,5e-05,3.5e-05
1.6e-05,1.7e-05,2e-05,3.4e-05,1.9e-05,1.1e-05,7e-06,9e-06,3.6e-05,2e-06,1.5e-05,1.8e-05,2.6e-05,1.6e-05,1.9e-05,8e-06,1.5e-05,2.2e-05,2.6e-05,1.9e-05,9e-06,4e-06,9e-06,2e-05,4e-05,2.2e-05,1.3e-05,1.1e-05,6e-06,7e-06,6e-06,6e-06,3e-06,2.4e-05,3.2e-05,3.2e-05,1.9e-05,1.4e-05,2.2e-05,4e-05,4.3e-05,2.6e-05,1.2e-05,2.3e-05,9e-06,1.3e-05,1.8e-05,8e-06,2.7e-05,5.5e-05,5e-05,2.7e-05,2.1e-05,1.1e-05,5.3e-05,4.4e-05,3.3e-05,2.4e-05,2.2e-05,4.2e-05,1.5e-05,2.2e-05,1.8e-05,1.8e-05,2.3e-05,9.3e-05,0.00011,9.1e-05,9.6e-05,5.5e-05,3.6e-05,6.2e-05,2.8e-05,2.1e-05,1.4e-05,4.8e-05,3.8e-05,1.1e-05,2e-05,2.7e-05,1.8e-05,1.3e-05,4e-05,3.9e-05,2.3e-05,2.1e-05,8e-05,9e-05,2.3e-05,2.7e-05,7e-06,1.5e-05,4e-05,3.8e-05,4.4e-05,3e-05,1.3e-05,4.1e-05,6.2e-05,8.2e-05,4.4e-05,5.4e-05,2.7e-05,1.7e-05,1.5e-05,6e-05,0.000239,0.000221,4.1e-05,3e-05,4.6e-05,7.9e-05,0.000121,0.000119,4.3e-05,4.1e-05,2.6e-05,1.8e-05,1e-05,1.7e-05,1.8e-05
1.7e-05,2.1e-05,1e-05,3.3e-05,7e-06,1.4e-05,6e-06,1.5e-05,3.2e-05,2.2e-05,1.8e-05,1.3e-05,2.8e-05,1.8e-05,1.8e-05,1.2e-05,1.6e-05,1.6e-05,6e-06,1.1e-05,1.5e-05,1.1e-05,1e-05,1.4e-05,2.8e-05,1.6e-05,9e-06,1e-05,3e-06,9e-06,1.1e-05,1e-05,1e-05,7e-06,2.4e-05,2e-05,5e-06,1.8e-05,1.1e-05,3.8e-05,6e-05,2.7e-05,2e-06,2e-05,2.2e-05,1.2e-05,1.1e-05,7e-06,1.3e-05,2.8e-05,1.3e-05,1.6e-05,1e-05,2.6e-05,4.6e-05,1.4e-05,1.5e-05,2.1e-05,2e-05,3.5e-05,8e-06,4.5e-05,1.3e-05,2e-06,2e-05,7.8e-05,5.7e-05,1.2e-05,6.1e-05,7.4e-05,5.9e-05,3.4e-05,6.2e-05,4.8e-05,2.2e-05,3.3e-05,1.4e-05,2.4e-05,6e-06,1.9e-05,1.3e-05,7e-06,3.2e-05,1.3e-05,2.8e-05,3e-05,5.5e-05,2.9e-05,2.6e-05,3.9e-05,1e-06,1.6e-05,2.4e-05,1.6e-05,5.1e-05,3.4e-05,1.9e-05,3.1e-05,2.7e-05,3e-05,3e-05,2.8e-05,2.8e-05,2.5e-05,1.8e-05,5.7e-05,0.00018,7.7e-05,3.6e-05,1.9e-05,3.1e-05,4e-05,6.6e-05,8e-06,7e-06,3e-05,9e-06,3.5e-05,9e-06,9e-06,1.8e-05
1.5e-05,1.2e-05,6e-06,1.7e-05,1.5e-05,1.1e-05,1.2e-05,8e-06,1.8e-05,1.2e-05,2e-06,7e-06,2e-06,2.7e-05,3.1e-05,2.6e-05,4e-06,8e-06,1.8e-05,2e-06,1.1e-05,1.6e-05,1.2e-05,8e-06,2.5e-05,1.5e-05,8e-06,5e-06,5e-06,3e-06,8e-06,5e-06,8e-06,1.2e-05,2.5e-05,3.2e-05,1.7e-05,2.3e-05,1.2e-05,2.8e-05,2.2e-05,2.1e-05,1.9e-05,1.8e-05,3.1e-05,2.1e-05,1.5e-05,1e-05,1.4e-05,1.4e-05,3.1e-05,6e-06,5e-06,1.1e-05,1.7e-05,2.9e-05,1.6e-05,3.3e-05,5.2e-05,2.3e-05,2.9e-05,6.8e-05,4.9e-05,2.2e-05,2.4e-05,6.3e-05,4.5e-05,3.1e-05,3.2e-05,6.1e-05,2.7e-05,3.4e-05,4e-05,2.1e-05,2.8e-05,3.6e-05,1e-05,2.6e-05,2.6e-05,2.9e-05,1.1e-05,5e-06,2.5e-05,2.8e-05,4e-05,1.7e-05,4.6e-05,3.6e-05,3.6e-05,3.3e-05,3.1e-05,1.9e-05,5e-06,2.8e-05,3.3e-05,1.8e-05,1.9e-05,1.8e-05,1.7e-05,3.9e-05,3.7e-05,5e-06,5e-06,2.8e-05,1.2e-05,2.8e-05,0.000121,4e-05,3.1e-05,1.5e-05,1.5e-05,3.7e-05,1.5e-05,1.5e-05,3.7e-05,2.1e-05,1.3e-05,3.4e-05,3.2e-05,2.3e-05,2.2e-05
2.6e-05,6e-06,5e-06,1.6e-05,7e-06,2e-05,1.9e-05,6e-06,2.2e-05,1.3e-05,1.1e-05,9e-06,2.4e-05,3.3e-05,1.6e-05,1e-05,6e-06,1e-05,8e-06,1.2e-05,9e-06,6e-06,3e-06,2e-06,1.3e-05,1.1e-05,1.6e-05,4e-06,2e-06,4e-06,7e-06,2e-06,9e-06,1.6e-05,3e-05,1.5e-05,1.4e-05,1.6e-05,1.5e-05,4e-06,1.8e-05,6e-06,5e-06,8e-06,1.4e-05,1e-05,1.1e-05,1e-05,1.6e-05,8e-06,9e-06,1.1e-05,3e-06,7e-06,1.5e-05,3.1e-05,1.9e-05,2.9e-05,2.6e-05,1.4e-05,5.9e-05,2.7e-05,2.2e-05,1.1e-05,7e-06,1.3e-05,2.4e-05,1.4e-05,4e-05,8e-06,2.1e-05,2.4e-05,3.2e-05,1.3e-05,2.1e-05,1.5e-05,1.3e-05,1.9e-05,1.3e-05,6e-06,1.3e-05,7e-06,3.1e-05,9e-06,3.9e-05,2.3e-05,1e-05,1.1e-05,1e-05,2.5e-05,1.4e-05,1.6e-05,1.7e-05,3.4e-05,5e-06,9e-06,1.6e-05,2.6e-05,1.7e-05,1.6e-05,8e-06,1.3e-05,6e-06,3.9e-05,2.9e-05,2.3e-05,5.3e-05,4.4e-05,2.5e-05,1.3e-05,1.1e-05,4.3e-05,2.2e-05,2.6e-05,4.2e-05,1.8e-05,1.3e-05,2.5e-05,1.6e-05,6e-06,2.9e-05
6e-06,1.3e-05,7e-06,6e-06,1e-05,1.8e-05,3e-06,1e-05,2.8e-05,1.1e-05,6e-06,3e-06,2.7e-05,8e-06,9e-06,1.2e-05,1.1e-05,2.1e-05,7e-06,8e-06,6e-06,2.3e-05,1.2e-05,3e-06,7e-06,1.3e-05,1e-06,7e-06,3e-06,4e-06,6e-06,6e-06,6e-06,2e-05,1.3e-05,2e-06,1.6e-05,9e-06,1.2e-05,2.2e-05,2.2e-05,1.1e-05,6e-06,9e-06,8e-06,6e-06,1.3e-05,6e-06,6e-06,6e-06,1e-05,8e-06,2e-06,1.3e-05,5e-06,9e-06,1e-05,6e-06,1.1e-05,1.2e-05,5.2e-05,1.3e-05,1.9e-05,8e-06,1e-05,2.5e-05,5e-06,6e-06,2.4e-05,1.7e-05,2.4e-05,4.4e-05,5.4e-05,1.6e-05,1.1e-05,9e-06,5e-06,1.6e-05,7e-06,5e-06,6e-06,3e-06,2.5e-05,2e-05,3.4e-05,1.4e-05,1.3e-05,1.5e-05,4e-06,2.5e-05,2e-05,2.8e-05,2.4e-05,1.6e-05,5e-06,1.6e-05,4e-06,2e-05,1.3e-05,1.3e-05,1.9e-05,5e-06,2.6e-05,1.7e-05,1.4e-05,1.9e-05,4e-06,2.5e-05,4.8e-05,2.9e-05,2.7e-05,1.9e-05,9e-06,1.8e-05,3.4e-05,2.1e-05,1e-05,1.6e-05,8e-06,5e-06,2.8e-05
1.3e-05,1.8e-05,7e-06,7e-06,9e-06,9e-06,5e-06,1e-06,1.8e-05,9e-06,6e-06,4e-06,1.9e-05,1e-05,1.1e-05,1.1e-05,1.2e-05,3.2e-05,2e-05,8e-06,5e-06,2.3e-05,1.5e-05,3e-06,7e-06,1.3e-05,9e-06,9e-06,3e-06,3e-06,6e-06,4e-06,2e-06,2.1e-05,8e-06,1.3e-05,1.6e-05,7e-06,1.4e-05,4e-06,1.1e-05,1.5e-05,1.7e-05,1e-05,1.2e-05,7e-06,9e-06,1.2e-05,8e-06,9e-06,1.5e-05,6e-06,8e-06,1e-05,1.3e-05,1.2e-05,3e-06,1.2e-05,7e-06,7e-06,6.3e-05,2.5e-05,2.3e-05,6e-06,9e-06,2.7e-05,2.2e-05,7e-06,1.6e-05,1.2e-05,2.6e-05,3.6e-05,2.4e-05,1.6e-05,1.3e-05,6e-06,1.1e-05,1.8e-05,1.7e-05,5e-06,9e-06,5e-06,2.7e-05,1.6e-05,3.3e-05,2e-05,1e-05,6e-06,5e-06,2e-05,2.6e-05,7e-06,1.8e-05,2.8e-05,1.3e-05,2.1e-05,1.6e-05,2.1e-05,2.1e-05,1.4e-05,1.8e-05,4e-06,3.3e-05,3.9e-05,1.5e-05,1.7e-05,2.4e-05,2.3e-05,1.8e-05,6e-06,1.3e-05,1.9e-05,1.7e-05,8e-06,8e-06,1.2e-05,8e-06,5e-06,6e-06,1e-05,2.6e-05
8e-06,2e-06,2e-06,5e-06,2e-06,4e-06,2e-06,3e-06,3e-06,3e-06,2e-06,5e-06,7e-06,1e-06,4e-06,3e-06,8e-06,5e-06,3e-06,7e-06,2e-06,6e-06,2e-06,4e-06,4e-06,3e-06,2e-06,1e-06,1e-06,4e-06,4e-06,3e-06,3e-06,1e-05,4e-06,6e-06,4e-06,4e-06,1e-06,3e-06,3e-06,3e-06,5e-06,2e-06,1e-06,3e-06,4e-06,6e-06,5e-06,1e-05,6e-06,5e-06,8e-06,4e-06,5e-06,4e-06,3e-06,6e-06,6e-06,3e-06,2.3e-05,2.8e-05,9e-06,2e-06,2e-06,1.4e-05,1.3e-05,6e-06,7e-06,6e-06,8e-06,8e-06,1.8e-05,5e-06,4e-06,3e-06,4e-06,3e-06,2e-06,5e-06,4e-06,5e-06,9e-06,1e-06,8e-06,6e-06,1e-05,4e-06,1e-06,2e-06,7e-06,4e-06,4e-06,6e-06,3e-06,2e-06,4e-06,1.1e-05,5e-06,5e-06,5e-06,3e-06,1.2e-05,1.3e-05,9e-06,4e-06,1.3e-05,9e-06,7e-06,6e-06,9e-06,7e-06,6e-06,7e-06,1.2e-05,3e-06,6e-06,5e-06,4e-06,4e-06,7e-06
3e-06,4e-06,2e-06,7e-06,2e-06,5e-06,4e-06,2e-06,5e-06,1e-06,1e-06,2e-06,8e-06,2e-06,4e-06,1e-06,3e-06,4e-06,3e-06,4e-06,2e-06,3e-06,2e-06,1e-06,4e-06,5e-06,2e-06,1e-06,0,2e-06,2e-06,2e-06,1e-06,1e-05,3e-06,2e-06,2e-06,2e-06,2e-06,2e-06,2e-06,1e-06,3e-06,3e-06,3e-06,4e-06,4e-06,5e-06,7e-06,5e-06,4e-06,4e-06,2e-06,5e-06,8e-06,3e-06,1e-06,1e-06,3e-06,5e-06,1.3e-05,1.9e-05,1.1e-05,2e-06,4e-06,9e-06,1.3e-05,6e-06,6e-06,7e-06,5e-06,6e-06,1.5e-05,5e-06,2e-06,4e-06,7e-06,5e-06,1e-06,5e-06,2e-06,1e-06,8e-06,4e-06,7e-06,4e-06,3e-06,5e-06,2e-06,5e-06,2e-06,7e-06,2e-06,4e-06,5e-06,4e-06,3e-06,6e-06,6e-06,3e-06,6e-06,2e-06,6e-06,4e-06,5e-06,6e-06,1.1e-05,7e-06,1e-06,5e-06,3e-06,7e-06,4e-06,7e-06,6e-06,5e-06,2e-06,3e-06,2e-06,5e-06,3e-06
7e-06,3e-06,3e-06,5e-06,2e-06,4e-06,5e-06,4e-06,3e-06,2e-06,3e-06,2e-06,9e-06,2e-06,4e-06,2e-06,1e-06,2e-06,1e-06,5e-06,1e-06,2e-06,1e-06,1e-06,3e-06,4e-06,2e-06,2e-06,1e-06,1e-06,3e-06,1e-06,1e-06,9e-06,1e-06,2e-06,2e-06,2e-06,2e-06,1e-06,1e-06,1e-06,3e-06,3e-06,2e-06,1e-06,5e-06,5e-06,6e-06,4e-06,1e-06,4e-06,0,7e-06,3e-06,3e-06,6e-06,3e-06,3e-06,5e-06,5e-06,4e-06,4e-06,4e-06,6e-06,3e-06,8e-06,5e-06,3e-06,7e-06,7e-06,6e-06,1.2e-05,4e-06,2e-06,1e-06,7e-06,2e-06,3e-06,5e-06,2e-06,2e-06,7e-06,5e-06,3e-06,3e-06,2e-06,2e-06,1e-06,4e-06,6e-06,2e-06,4e-06,7e-06,3e-06,2e-06,1e-06,6e-06,7e-06,2e-06,8e-06,4e-06,7e-06,3e-06,5e-06,7e-06,1.2e-05,2e-06,9e-06,2e-06,2e-06,6e-06,6e-06,3e-06,9e-06,6e-06,2e-06,4e-06,3e-06,1e-06,8e-06
6e-06,2e-06,1e-06,3e-06,1e-06,4e-06,3e-06,2e-06,3e-06,1e-06,2e-06,2e-06,7e-06,4e-06,4e-06,1e-06,0,3e-06,2e-06,3e-06,1e-06,2e-06,2e-06,1e-06,3e-06,2e-06,1e-06,4e-06,1e-06,2e-06,3e-06,1e-06,1e-06,7e-06,3e-06,3e-06,2e-06,2e-06,3e-06,3e-06,1e-06,0,4e-06,2e-06,2e-06,2e-06,4e-06,5e-06,6e-06,4e-06,2e-06,3e-06,2e-06,3e-06,3e-06,2e-06,4e-06,2e-06,2e-06,3e-06,7e-06,1e-06,3e-06,4e-06,3e-06,3e-06,3e-06,0,3e-06,3e-06,8e-06,5e-06,1.4e-05,2e-06,2e-06,1e-06,5e-06,3e-06,3e-06,4e-06,0,2e-06,5e-06,4e-06,2e-06,3e-06,3e-06,2e-06,2e-06,5e-06,6e-06,2e-06,1e-06,5e-06,2e-06,3e-06,3e-06,3e-06,6e-06,1e-06,6e-06,3e-06,2e-06,6e-06,2e-06,5e-06,1e-05,4e-06,7e-06,4e-06,5e-06,5e-06,7e-06,2e-06,9e-06,5e-06,3e-06,1e-06,3e-06,3e-06,9e-06
5e-06,3e-06,1e-06,5e-06,1e-06,2e-06,3e-06,3e-06,5e-06,1e-06,3e-06,1e-06,5e-06,2e-06,2e-06,0,1e-06,2e-06,2e-06,4e-06,2e-06,1e-06,2e-06,0,3e-06,3e-06,1e-06,4e-06,2e-06,1e-06,2e-06,1e-06,1e-06,8e-06,2e-06,2e-06,2e-06,2e-06,1e-06,1e-06,3e-06,1e-06,3e-06,1e-06,2e-06,1e-06,5e-06,3e-06,6e-06,4e-06,2e-06,3e-06,2e-06,4e-06,2e-06,2e-06,4e-06,3e-06,4e-06,2e-06,9e-06,1e-06,2e-06,1e-06,4e-06,2e-06,2e-06,2e-06,2e-06,5e-06,5e-06,5e-06,1.4e-05,1e-06,2e-06,4e-06,4e-06,0,2e-06,7e-06,3e-06,0,5e-06,4e-06,4e-06,2e-06,4e-06,0,3e-06,4e-06,3e-06,4e-06,4e-06,5e-06,1e-06,0,2e-06,5e-06,5e-06,1e-06,4e-06,5e-06,6e-06,4e-06,2e-06,3e-06,1.1e-05,5e-06,5e-06,3e-06,3e-06,7e-06,5e-06,3e-06,6e-06,2e-06,2e-06,3e-06,4e-06,1e-06,6e-06
4e-06,3e-06,2e-06,4e-06,1e-06,2e-06,3e-06,2e-06,5e-06,1e-06,1e-06,2e-06,7e-06,1e-06,4e-06,1e-06,1e-06,1e-06,2e-06,4e-06,2e-06,1e-06,1e-06,1e-06,3e-06,3e-06,1e-06,1e-06,1e-06,2e-06,3e-06,2e-06,2e-06,8e-06,2e-06,3e-06,2e-06,1e-06,2e-06,1e-06,1e-06,1e-06,3e-06,2e-06,1e-06,1e-06,4e-06,4e-06,6e-06,6e-06,2e-06,3e-06,1e-06,5e-06,4e-06,2e-06,3e-06,3e-06,1e-06,3e-06,9e-06,1e-06,3e-06,2e-06,1e-06,1e-06,1e-06,2e-06,1e-06,4e-06,5e-06,5e-06,1.1e-05,2e-06,3e-06,3e-06,2e-06,4e-06,2e-06,5e-06,2e-06,2e-06,5e-06,4e-06,3e-06,2e-06,5e-06,2e-06,1e-06,5e-06,3e-06,4e-06,2e-06,5e-06,0,1e-06,2e-06,4e-06,5e-06,2e-06,3e-06,3e-06,1e-06,3e-06,2e-06,3e-06,7e-06,4e-06,8e-06,3e-06,2e-06,4e-06,5e-06,3e-06,8e-06,2e-06,3e-06,3e-06,1e-06,0,8e-06
4e-06,2e-06,3e-06,5e-06,1e-06,4e-06,3e-06,2e-06,4e-06,1e-06,0,2e-06,8e-06,3e-06,5e-06,2e-06,1e-06,3e-06,2e-06,4e-06,2e-06,1e-06,2e-06,1e-06,3e-06,2e-06,1e-06,2e-06,1e-06,1e-06,2e-06,2e-06,1e-06,8e-06,1e-06,0,3e-06,1e-06,1e-06,3e-06,1e-06,1e-06,4e-06,2e-06,1e-06,2e-06,2e-06,3e-06,6e-06,4e-06,1e-06,1e-06,2e-06,3e-06,4e-06,2e-06,4e-06,2e-06,3e-06,4e-06,9e-06,2e-06,3e-06,2e-06,2e-06,1e-06,1e-06,3e-06,1e-06,3e-06,6e-06,5e-06,1.1e-05,2e-06,2e-06,3e-06,1e-06,1e-06,1e-06,5e-06,1e-06,3e-06,5e-06,5e-06,2e-06,2e-06,3e-06,2e-06,1e-06,3e-06,4e-06,3e-06,3e-06,5e-06,1e-06,2e-06,1e-06,3e-06,4e-06,0,4e-06,4e-06,5e-06,3e-06,3e-06,4e-06,9e-06,3e-06,8e-06,2e-06,3e-06,7e-06,3e-06,2e-06,7e-06,3e-06,3e-06,4e-06,2e-06,2e-06,8e-06
4e-06,2e-06,3e-06,4e-06,1e-06,2e-06,3e-06,3e-06,3e-06,2e-06,1e-06,1e-06,7e-06,2e-06,3e-06,3e-06,1e-06,3e-06,3e-06,3e-06,3e-06,3e-06,2e-06,0,2e-06,1e-06,0,2e-06,1e-06,1e-06,2e-06,1e-06,1e-06,6e-06,2e-06,2e-06,4e-06,1e-06,5e-06,1e-06,1e-06,1e-06,3e-06,1e-06,1e-06,2e-06,4e-06,4e-06,6e-06,5e-06,0,2e-06,1e-06,3e-06,2e-06,3e-06,5e-06,1e-06,2e-06,5e-06,7e-06,2e-06,3e-06,3e-06,3e-06,3e-06,3e-06,2e-06,2e-06,3e-06,7e-06,4e-06,1.1e-05,1e-06,0,3e-06,3e-06,3e-06,2e-06,7e-06,2e-06,2e-06,4e-06,6e-06,2e-06,0,3e-06,2e-06,0,4e-06,2e-06,2e-06,1e-06,5e-06,0,2e-06,1e-06,3e-06,2e-06,1e-06,4e-06,2e-06,5e-06,3e-06,3e-06,3e-06,1.1e-05,3e-06,7e-06,1e-06,3e-06,9e-06,6e-06,1e-06,8e-06,1e-06,3e-06,3e-06,1e-06,3e-06,8e-06
4e-06,3e-06,2e-06,4e-06,0,3e-06,2e-06,0,2e-06,1e-06,2e-06,1e-06,4e-06,3e-06,3e-06,0,1e-06,3e-06,1e-06,2e-06,3e-06,3e-06,2e-06,2e-06,2e-06,2e-06,1e-06,2e-06,0,1e-06,1e-06,1e-06,1e-06,7e-06,1e-06,2e-06,2e-06,1e-06,6e-06,5e-06,0,1e-06,3e-06,1e-06,1e-06,1e-06,2e-06,2e-06,6e-06,4e-06,0,2e-06,2e-06,3e-06,2e-06,1e-06,4e-06,1e-06,2e-06,5e-06,9e-06,3e-06,3e-06,3e-06,2e-06,2e-06,1e-06,2e-06,1e-06,5e-06,4e-06,5e-06,9e-06,0,0,2e-06,4e-06,2e-06,2e-06,5e-06,1e-06,0,5e-06,4e-06,1e-06,2e-06,3e-06,0,1e-06,3e-06,4e-06,4e-06,1e-06,5e-06,0,1e-06,1e-06,3e-06,4e-06,2e-06,5e-06,3e-06,4e-06,4e-06,2e-06,1e-06,6e-06,2e-06,5e-06,2e-06,2e-06,6e-06,3e-06,1e-06,7e-06,4e-06,2e-06,2e-06,4e-06,2e-06,6e-06
2e-06,2e-06,1e-06,3e-06,1e-06,4e-06,1e-06,1e-06,3e-06,1e-06,1e-06,0,6e-06,2e-06,3e-06,1e-06,1e-06,1e-06,3e-06,3e-06,2e-06,2e-06,2e-06,2e-06,1e-06,2e-06,1e-06,1e-06,0,1e-06,1e-06,1e-06,1e-06,8e-06,1e-06,1e-06,2e-06,1e-06,4e-06,1e-06,2e-06,2e-06,3e-06,1e-06,2e-06,2e-06,3e-06,5e-06,7e-06,3e-06,0,5e-06,1e-06,3e-06,2e-06,2e-06,3e-06,1e-06,4e-06,2e-06,7e-06,1e-06,3e-06,1e-06,1e-06,4e-06,4e-06,2e-06,3e-06,4e-06,4e-06,3e-06,1.1e-05,4e-06,3e-06,3e-06,3e-06,1e-06,2e-06,5e-06,1e-06,2e-06,6e-06,5e-06,3e-06,2e-06,6e-06,3e-06,2e-06,3e-06,4e-06,3e-06,2e-06,5e-06,1e-06,2e-06,1e-06,3e-06,3e-06,1e-06,7e-06,2e-06,4e-06,4e-06,2e-06,4e-06,6e-06,6e-06,6e-06,1e-06,0,5e-06,6e-06,1e-06,4e-06,3e-06,3e-06,2e-06,3e-06,3e-06,7e-06
5e-06,3e-06,1e-06,4e-06,2e-06,3e-06,2e-06,2e-06,1e-06,1e-06,1e-06,1e-06,8e-06,1e-06,3e-06,1e-06,1e-06,2e-06,1e-06,4e-06,3e-06,2e-06,2e-06,1e-06,3e-06,2e-06,1e-06,1e-06,1e-06,1e-06,2e-06,1e-06,1e-06,7e-06,1e-06,1e-06,3e-06,0,2e-06,3e-06,3e-06,2e-06,4e-06,0,1e-06,2e-06,3e-06,5e-06,5e-06,4e-06,2e-06,5e-06,3e-06,2e-06,3e-06,3e-06,5e-06,1e-06,2e-06,2e-06,6e-06,1e-06,2e-06,3e-06,1e-06,3e-06,3e-06,2e-06,3e-06,3e-06,3e-06,7e-06,9e-06,4e-06,0,3e-06,2e-06,1e-06,1e-06,3e-06,1e-06,1e-06,5e-06,4e-06,2e-06,3e-06,4e-06,4e-06,1e-06,4e-06,3e-06,1e-06,1e-06,3e-06,2e-06,2e-06,3e-06,2e-06,2e-06,1e-06,5e-06,4e-06,2e-06,3e-06,2e-06,3e-06,9e-06,4e-06,4e-06,2e-06,2e-06,4e-06,5e-06,1e-06,6e-06,4e-06,2e-06,1e-06,2e-06,1e-06,6e-06
5e-06,4e-06,3e-06,6e-06,2e-06,3e-06,2e-06,2e-06,1e-06,1e-06,2e-06,0,5e-06,3e-06,3e-06,1e-06,1e-06,1e-06,3e-06,3e-06,3e-06,0,1e-06,1e-06,3e-06,4e-06,2e-06,2e-06,1e-06,1e-06,2e-06,2e-06,0,6e-06,1e-06,1e-06,2e-06,1e-06,1e-06,3e-06,1e-06,1e-06,3e-06,1e-06,1e-06,0,4e-06,3e-06,5e-06,4e-06,2e-06,4e-06,0,3e-06,1e-06,3e-06,4e-06,1e-06,1e-06,4e-06,7e-06,2e-06,2e-06,1e-06,2e-06,5e-06,1e-06,0,2e-06,4e-06,3e-06,5e-06,1.2e-05,1e-06,2e-06,1e-06,2e-06,1e-06,2e-06,5e-06,1e-06,1e-06,5e-06,5e-06,1e-06,2e-06,2e-06,2e-06,1e-06,4e-06,1e-06,3e-06,1e-06,4e-06,1e-06,1e-06,2e-06,4e-06,3e-06,3e-06,3e-06,0,2e-06,2e-06,0,4e-06,7e-06,3e-06,7e-06,1e-06,3e-06,3e-06,5e-06,1e-06,9e-06,5e-06,2e-06,1e-06,2e-06,1e-06,7e-06
5e-06,3e-06,0,6e-06,1e-06,3e-06,3e-06,3e-06,1e-06,1e-06,1e-06,1e-06,4e-06,2e-06,1e-06,0,1e-06,1e-06,3e-06,3e-06,3e-06,2e-06,1e-06,1e-06,2e-06,2e-06,2e-06,1e-06,2e-06,1e-06,1e-06,0,1e-06,6e-06,1e-06,1e-06,2e-06,1e-06,3e-06,1e-06,3e-06,0,2e-06,2e-06,1e-06,0,5e-06,4e-06,6e-06,6e-06,1e-06,4e-06,2e-06,5e-06,1e-06,2e-06,5e-06,2e-06,1e-06,4e-06,5e-06,5e-06,4e-06,1e-06,1e-06,3e-06,1e-06,1e-06,1e-06,3e-06,4e-06,6e-06,1e-05,1e-06,2e-06,3e-06,2e-06,1e-06,0,5e-06,0,2e-06,5e-06,3e-06,3e-06,2e-06,2e-06,2e-06,1e-06,4e-06,2e-06,3e-06,1e-06,4e-06,1e-06,2e-06,1e-06,3e-06,5e-06,3e-06,5e-06,3e-06,7e-06,3e-06,5e-06,1e-06,8e-06,5e-06,6e-06,3e-06,0,3e-06,5e-06,3e-06,6e-06,4e-06,1e-06,0,2e-06,2e-06,7e-06
2e-06,2e-06,2e-06,5e-06,1e-06,2e-06,2e-06,3e-06,3e-06,0,1e-06,1e-06,6e-06,2e-06,3e-06,2e-06,3e-06,4e-06,4e-06,2e-06,1e-06,2e-06,2e-06,1e-06,2e-06,1e-06,1e-06,1e-06,1e-06,1e-06,1e-06,2e-06,2e-06,7e-06,1e-06,1e-06,1e-06,1e-06,5e-06,3e-06,2e-06,0,2e-06,1e-06,1e-06,1e-06,5e-06,4e-06,3e-06,3e-06,0,4e-06,2e-06,3e-06,2e-06,1e-06,4e-06,1e-06,1e-06,1e-06,1e-05,2e-06,4e-06,1e-06,1e-06,2e-06,1e-06,1e-06,1e-06,3e-06,6e-06,3e-06,1e-05,0,1e-06,3e-06,0,3e-06,1e-06,3e-06,1e-06,2e-06,3e-06,4e-06,1e-06,1e-06,2e-06,2e-06,1e-06,3e-06,3e-06,1e-06,1e-06,3e-06,1e-06,2e-06,2e-06,2e-06,3e-06,2e-06,4e-06,3e-06,4e-06,4e-06,2e-06,2e-06,7e-06,5e-06,8e-06,3e-06,3e-06,5e-06,4e-06,1e-06,6e-06,4e-06,1e-06,1e-06,1e-06,1e-06,5e-06
3e-06,1e-06,1e-06,4e-06,2e-06,2e-06,3e-06,1e-06,3e-06,0,1e-06,1e-06,6e-06,1e-06,3e-06,2e-06,2e-06,2e-06,2e-06,2e-06,2e-06,2e-06,0,0,3e-06,3e-06,1e-06,1e-06,1e-06,0,1e-06,2e-06,1e-06,6e-06,1e-06,1e-06,2e-06,2e-06,5e-06,1e-06,2e-06,1e-06,2e-06,0,1e-06,2e-06,3e-06,4e-06,3e-06,3e-06,1e-06,2e-06,2e-06,3e-06,0,3e-06,2e-06,2e-06,1e-06,2e-06,1e-05,1e-06,4e-06,3e-06,2e-06,2e-06,1e-06,1e-06,0,4e-06,5e-06,4e-06,9e-06,2e-06,2e-06,3e-06,4e-06,0,3e-06,5e-06,0,2e-06,4e-06,4e-06,1e-06,3e-06,4e-06,1e-06,1e-06,4e-06,3e-06,3e-06,2e-06,4e-06,1e-06,0,1e-06,3e-06,4e-06,1e-06,4e-06,3e-06,4e-06,3e-06,2e-06,1e-06,1.1e-05,4e-06,8e-06,1e-06,2e-06,5e-06,1e-06,2e-06,5e-06,2e-06,1e-06,0,1e-06,1e-06,5e-06
5e-06,1e-06,1e-06,4e-06,1e-06,1e-06,3e-06,3e-06,2e-06,1e-06,1e-06,2e-06,4e-06,1e-06,2e-06,2e-06,1e-06,2e-06,2e-06,2e-06,2e-06,2e-06,1e-06,1e-06,2e-06,1e-06,1e-06,2e-06,1e-06,1e-06,1e-06,2e-06,2e-06,6e-06,1e-06,1e-06,1e-06,0,5e-06,5e-06,2e-06,1e-06,2e-06,0,1e-06,2e-06,5e-06,3e-06,5e-06,4e-06,1e-06,2e-06,2e-06,3e-06,1e-06,1e-06,3e-06,0,2e-06,3e-06,8e-06,2e-06,4e-06,1e-06,2e-06,3e-06,0,2e-06,1e-06,3e-06,3e-06,6e-06,1e-05,2e-06,1e-06,3e-06,3e-06,1e-06,2e-06,3e-06,1e-06,3e-06,3e-06,4e-06,2e-06,2e-06,4e-06,2e-06,1e-06,5e-06,2e-06,2e-06,1e-06,5e-06,1e-06,1e-06,1e-06,2e-06,2e-06,2e-06,4e-06,3e-06,3e-06,2e-06,2e-06,1e-06,1e-05,2e-06,7e-06,2e-06,2e-06,5e-06,4e-06,1e-06,6e-06,1e-06,3e-06,1e-06,1e-06,0,8e-06
4e-06,2e-06,1e-06,4e-06,1e-06,2e-06,4e-06,3e-06,2e-06,1e-06,1e-06,1e-06,5e-06,1e-06,2e-06,1e-06,0,1e-06,2e-06,2e-06,1e-06,1e-06,2e-06,1e-06,1e-06,2e-06,1e-06,2e-06,0,1e-06,1e-06,1e-06,1e-06,6e-06,1e-06,1e-06,1e-06,0,3e-06,3e-06,1e-06,1e-06,2e-06,0,1e-06,0,3e-06,4e-06,5e-06,4e-06,2e-06,2e-06,2e-06,4e-06,2e-06,1e-06,2e-06,1e-06,2e-06,2e-06,7e-06,4e-06,2e-06,1e-06,1e-06,3e-06,2e-06,2e-06,0,2e-06,5e-06,3e-06,1e-05,1e-06,0,1e-06,3e-06,2e-06,1e-06,4e-06,0,2e-06,5e-06,3e-06,2e-06,2e-06,3e-06,2e-06,0,4e-06,2e-06,1e-06,1e-06,5e-06,2e-06,1e-06,1e-06,3e-06,3e-06,1e-06,2e-06,2e-06,4e-06,3e-06,2e-06,2e-06,8e-06,3e-06,4e-06,3e-06,4e-06,5e-06,4e-06,1e-06,5e-06,3e-06,1e-06,1e-06,2e-06,1e-06,6e-06
4e-06,2e-06,2e-06,4e-06,1e-06,2e-06,3e-06,2e-06,2e-06,0,2e-06,1e-06,7e-06,2e-06,2e-06,2e-06,0,2e-06,2e-06,2e-06,1e-06,2e-06,1e-06,1e-06,2e-06,2e-06,0,2e-06,1e-06,1e-06,1e-06,1e-06,1e-06,6e-06,1e-06,1e-06,1e-06,0,3e-06,1e-06,1e-06,0,2e-06,0,0,0,3e-06,3e-06,4e-06,4e-06,1e-06,2e-06,1e-06,4e-06,2e-06,1e-06,3e-06,0,2e-06,2e-06,7e-06,2e-06,1e-06,2e-06,1e-06,3e-06,2e-06,1e-06,1e-06,2e-06,4e-06,4e-06,1e-05,1e-06,1e-06,2e-06,2e-06,1e-06,1e-06,4e-06,0,1e-06,4e-06,4e-06,1e-06,2e-06,3e-06,2e-06,0,4e-06,3e-06,1e-06,0,5e-06,0,0,0,3e-06,2e-06,0,3e-06,2e-06,3e-06,3e-06,2e-06,2e-06,8e-06,3e-06,6e-06,2e-06,1e-06,5e-06,3e-06,0,6e-06,3e-06,2e-06,1e-06,2e-06,1e-06,5e-06
4e-06,2e-06,1e-06,4e-06,0,2e-06,2e-06,2e-06,2e-06,0,1e-06,1e-06,6e-06,0,2e-06,1e-06,0,2e-06,2e-06,3e-06,1e-06,1e-06,1e-06,0,1e-06,2e-06,0,1e-06,0,1e-06,1e-06,1e-06,1e-06,6e-06,0,1e-06,2e-06,0,2e-06,2e-06,1e-06,0,2e-06,0,1e-06,1e-06,4e-06,3e-06,4e-06,4e-06,2e-06,2e-06,1e-06,3e-06,1e-06,1e-06,3e-06,0,2e-06,2e-06,7e-06,1e-06,2e-06,2e-06,1e-06,3e-06,0,1e-06,0,2e-06,5e-06,5e-06,9e-06,1e-06,0,3e-06,2e-06,1e-06,1e-06,4e-06,0,1e-06,4e-06,3e-06,2e-06,2e-06,3e-06,1e-06,0,4e-06,3e-06,1e-06,1e-06,4e-06,1e-06,0,0,3e-06,3e-06,1e-06,4e-06,2e-06,3e-06,2e-06,3e-06,2e-06,7e-06,4e-06,5e-06,1e-06,1e-06,4e-06,3e-06,1e-06,5e-06,3e-06,1e-06,1e-06,2e-06,1e-06,6e-06
3e-06,2e-06,1e-06,4e-06,1e-06,2e-06,2e-06,2e-06,2e-06,0,1e-06,1e-06,5e-06,1e-06,2e-06,1e-06,0,2e-06,2e-06,2e-06,2e-06,1e-06,1e-06,1e-06,1e-06,2e-06,0,1e-06,0,0,1e-06,1e-06,1e-06,6e-06,1e-06,1e-06,1e-06,0,2e-06,2e-06,1e-06,0,2e-06,0,0,0,3e-06,3e-06,5e-06,4e-06,1e-06,2e-06,1e-06,3e-06,1e-06,0,3e-06,0,1e-06,2e-06,7e-06,0,2e-06,2e-06,0,2e-06,1e-06,1e-06,0,2e-06,5e-06,4e-06,1e-05,1e-06,0,2e-06,2e-06,1e-06,1e-06,4e-06,0,1e-06,4e-06,4e-06,1e-06,2e-06,3e-06,1e-06,0,4e-06,3e-06,2e-06,1e-06,4e-06,0,0,0,3e-06,2e-06,1e-06,3e-06,2e-06,3e-06,3e-06,2e-06,1e-06,7e-06,3e-06,5e-06,1e-06,1e-06,4e-06,3e-06,0,5e-06,3e-06,1e-06,1e-06,2e-06,1e-06,5e-06
