1.4e-05,7e-06,6.1e-05,4.5e-05,8e-06,4.3e-05,3e-06,2.6e-05,6.8e-05,3.7e-05,3.4e-05,0.000109,4.3e-05,7.9e-05,8e-05,0.000163,9e-05,0.000174,0.000103,6e-05,2.9e-05,1.8e-05,0.000118,5.3e-05,0.000137,4.9e-05,3e-05,7.5e-05,2.5e-05,3e-05,5e-06,3e-05,5.3e-05,3.9e-05,1.8e-05,1.5e-05,6.4e-05,1.4e-05,5.1e-05,2.4e-05,7e-06,2.2e-05,4.9e-05,4e-06,1.2e-05,8.5e-05,3.3e-05,2.5e-05,1.3e-05,0.000102,4.8e-05,2e-05,4e-06,5e-06,9.7e-05,4.4e-05,5.8e-05,1.1e-05,5.8e-05,9e-05,7.8e-05,4.7e-05,5.1e-05,5.5e-05,2.2e-05,7.7e-05,0.000107,1.9e-05,1e-05,5.1e-05,1.8e-05,5.5e-05,4.5e-05,2.2e-05,0.000157,4.1e-05,4.8e-05,3.8e-05,3e-05,3.8e-05,3.8e-05,6.8e-05,3.1e-05,7e-05,2.8e-05,9.5e-05,0.000116,1.1e-05,1.5e-05,3.7e-05,1e-06,3.3e-05,5.3e-05,5.5e-05,3.1e-05,4.9e-05,2.2e-05,1.8e-05,2.7e-05,9.2e-05,6e-05,0.000113,7e-06,9.3e-05,4.5e-05,8e-06,2.9e-05,1.8e-05,6.6e-05,7.3e-05,4.4e-05,3e-06,5.6e-05,2.4e-05,3e-06,4.6e-05,1.2e-05,7.3e-05,4.4e-05,1.7e-05,1.1e-05
9.9e-05,0.000118,0.000171,0.000193,0.000111,3e-05,4.6e-05,6.5e-05,0.00018,0.000102,0.000125,0.000279,4.1e-05,0.000243,0.000382,0.000492,0.000322,0.00024,0.000236,9.9e-05,0.000149,0.000145,0.000135,0.000188,0.000382,0.000214,0.000144,3.8e-05,5.4e-05,0.000281,0.00022,0.000132,0.000139,0.000113,7.5e-05,0.000128,9.9e-05,0.00017,0.000132,0.00011,7.1e-05,9.5e-05,8.5e-05,2.4e-05,2.9e-05,0.00022,0.000162,0.000116,9.9e-05,0.00026,5e-05,6.4e-05,7.4e-05,0.000219,0.000406,0.000168,0.000196,6.2e-05,3e-05,0.000169,0.000195,1.8e-05,0.000117,0.000114,8.4e-05,0.000194,0.000204,8.5e-05,4.2e-05,0.000112,4e-05,0.000186,0.000217,6.4e-05,0.000373,2.7e-05,0.000174,9.9e-05,2.9e-05,8.5e-05,5.6e-05,0.000159,8e-05,0.000123,7.3e-05,0.000193,0.000283,0.00012,8.6e-05,0.00013,7.2e-05,2.6e-05,0.000213,0.000217,0.000112,0.000107,4.5e-05,3.8e-05,5.1e-05,0.000208,0.00011,0.000263,0.000157,7.8e-05,0.000108,2.4e-05,6.5e-05,6.7e-05,0.000152,0.000138,7.2e-05,0.000112,0.000165,0.000152,0.000175,0.000186,2e-05,0.000109,9e-05,5.2e-05,2.9e-05
9.4e-05,6.2e-05,0.000105,3.9e-05,0.000145,0.000116,0.000114,2e-04,4.1e-05,0.000217,0.000185,0.000295,9.1e-05,0.000156,0.000157,0.000371,0.000228,0.000347,0.000132,0.000283,0.000174,0.000219,0.000367,0.00023,0.000243,0.000288,0.000232,0.000261,0.000181,0.000341,0.000264,3e-05,0.000153,7.8e-05,0.000144,0.000269,0.000327,0.000151,0.000176,0.000125,0.000151,7.1e-05,0.000247,0.000127,0.000193,0.000262,0.000213,7e-05,6.1e-05,0.000203,0.000157,7.8e-05,0.000189,0.000313,0.000372,0.000203,3.4e-05,0.000185,0.000195,0.000317,0.000317,7.8e-05,0.000123,0.000256,0.000166,0.000209,0.000252,0.000135,5.2e-05,0.000123,0.000242,0.000199,0.00017,0.000114,0.000239,0.000164,0.000278,0.000266,0.000193,0.00018,0.000131,0.000138,0.000135,0.000237,4.4e-05,9.8e-05,0.000258,0.000161,0.00015,5.7e-05,0.00016,0.000195,0.00032,0.000308,0.000183,7.2e-05,2e-05,0.000133,4.1e-05,0.00028,8.4e-05,0.000262,7.6e-05,0.000232,0.000146,1e-05,7.1e-05,0.000136,0.00024,0.00017,7.9e-05,0.000123,0.000216,8.3e-05,9.2e-05,0.000113,2.3e-05,4.5e-05,7.5e-05,0.000153,6.7e-05
0.000138,1.4e-05,3.7e-05,6.4e-05,0.000129,0.000171,2e-04,0.000122,0.000122,0.000429,0.000167,0.000549,0.000487,0.000261,0.000357,0.000591,0.00017,0.000265,0.000594,0.000501,0.000258,0.000282,0.000358,0.000236,0.000369,0.000243,0.000142,0.000271,0.000119,0.000375,3.9e-05,0.000235,0.000285,0.000156,0.000237,0.000351,8.6e-05,0.000324,0.000171,0.000229,3.3e-05,2e-04,0.000201,0.000123,0.000234,0.000308,0.000109,0.000311,6.2e-05,0.000319,0.000402,0.000195,0.000215,6.3e-05,0.000556,0.000257,0.000236,0.00027,0.000118,0.000638,0.000545,0.000183,0.000162,0.000296,0.000539,8.1e-05,0.000477,0.000202,0.000111,0.000504,0.000125,0.00018,0.000245,0.000242,0.000365,0.000168,0.000159,0.000315,0.000148,0.000274,0.000223,0.000171,0.000191,0.000157,0.000233,0.000242,0.000519,0.000422,3.8e-05,0.000248,0.000287,0.000122,0.000462,0.000256,0.000381,0.000441,0.000171,0.000207,0.000116,0.000246,0.000314,0.000267,0.000213,0.000382,0.000447,0.000222,8.6e-05,0.000299,0.000528,0.00021,0.000162,0.000104,0.000177,0.000265,0.000214,0.000262,0.000153,0.000222,0.000199,0.000393,0.000375
0.000341,1.9e-05,8.6e-05,0.000188,0.00014,3.8e-05,0.000181,0.000146,0.000317,0.00074,0.000634,0.001007,0.000971,0.001251,0.001196,0.000949,0.000804,5.4e-05,0.000706,0.00084,0.000448,0.000561,0.000776,0.000306,0.00021,0.000288,0.000194,0.000456,0.000535,0.000709,0.000593,0.000514,0.000175,0.000191,0.000409,0.000389,0.000575,0.00074,0.000642,0.00045,0.000484,0.000411,0.000336,0.000108,7.4e-05,0.000356,0.000352,0.000487,0.00057,0.000612,0.000721,0.00055,0.000274,3.6e-05,0.000455,0.000562,0.000814,0.000715,0.000327,0.000647,0.001157,0.001078,0.000676,0.000706,0.001016,0.001205,0.001057,0.000725,0.00034,0.000931,0.000919,0.000628,0.000351,0.000745,5.1e-05,0.000163,0.000124,0.000163,0.000373,0.000533,0.000316,7.1e-05,0.000354,0.000393,0.000777,0.000866,0.001057,0.00059,0.000517,0.000716,0.000377,0.000388,0.000641,0.000982,0.001046,0.000637,0.000404,0.000279,0.000274,0.00014,0.000367,0.000691,0.000669,0.000332,0.000798,0.00054,0.000401,0.000109,0.000704,0.00075,0.000625,0.000567,0.000627,0.000673,0.000666,0.000723,0.000341,4.9e-05,0.000328,0.000898,0.000537
0.000567,0.000446,0.000286,0.000315,0.000369,0.000109,0.000263,0.000423,0.000322,0.000445,0.000109,0.000564,0.000336,0.000736,0.000935,0.000639,0.000617,0.000374,0.000427,0.000184,6.1e-05,0.000413,0.000149,0.00022,0.000292,0.000191,0.000272,0.000355,0.000459,0.000105,0.000334,0.000156,0.000311,0.000315,0.000125,0.000341,0.000653,0.000432,0.000603,0.000312,0.00029,0.000195,0.000151,9.4e-05,0.000113,0.000644,0.000703,0.000615,0.000715,0.000564,0.000548,0.00014,8.1e-05,0.000265,0.000312,0.000154,5e-04,0.000296,0.00019,0.000376,0.000675,0.000449,0.000169,0.000589,0.000463,0.000461,0.000452,0.000388,0.00022,0.000803,0.000516,0.000495,0.000534,0.000732,0.000808,0.000205,5.1e-05,0.000198,0.000418,0.000422,0.000419,0.000208,0.000193,0.000181,0.000692,0.00068,5.6e-05,0.000128,0.000491,0.000376,8.6e-05,0.00025,0.000443,0.000995,0.00063,0.000443,0.000462,0.000357,0.000276,0.000586,0.000455,0.000437,2e-04,0.000172,0.000583,0.000272,0.00025,0.000421,0.000325,8.7e-05,0.000345,0.000604,0.000937,0.000499,0.000424,0.000354,0.000224,0.000194,0.000191,0.000586,0.000124
0.000551,0.000149,0.00014,0.000534,0.000407,0.000486,0.000358,0.000521,0.000519,0.000268,0.000371,0.000603,0.000422,0.000254,0.000686,0.000792,0.000181,0.000216,0.000387,0.000361,4.1e-05,0.000408,0.000273,5.4e-05,0.000621,0.000407,0.000108,0.000192,0.000352,0.000186,0.000208,0.000109,0.00015,0.000169,0.000175,0.000626,0.000173,0.000439,0.000538,0.000318,0.000254,0.000216,0.000436,0.000136,0.00026,0.000611,0.000309,0.000216,0.000371,4.6e-05,0.000202,0.000157,0.000321,0.00022,0.000277,0.000379,0.000236,0.000114,0.000284,0.000222,0.000232,0.00016,0.000256,0.00028,0.000635,0.000602,0.000139,0.000595,0.000383,0.000344,0.000395,0.000464,0.000257,0.00031,0.000114,0.000648,0.000226,0.00029,0.000207,0.000365,0.000444,0.000113,0.000221,0.000252,0.000268,0.000343,0.000273,0.000416,0.000164,0.000298,0.000184,0.000295,0.000249,0.000563,0.000477,0.000236,0.000305,0.000157,0.000396,0.000787,0.000244,0.00032,0.000529,0.000386,0.000289,0.000261,0.00038,0.000268,0.000452,0.000426,0.000326,0.000131,0.000931,5.9e-05,0.000302,0.000181,0.000301,0.000401,0.000154,0.000476,0.00018
0.000895,0.000618,0.000121,0.000305,6.5e-05,0.00035,0.000756,0.000983,0.00062,0.000317,0.000218,0.000596,0.001079,0.000494,0.000594,0.000604,0.000782,0.001196,0.000661,0.000708,0.000655,0.000484,0.000579,0.000131,0.000695,6.2e-05,0.00026,0.000416,0.000671,0.000449,0.000369,0.000442,0.000318,0.000245,0.000131,0.000512,0.000539,0.00069,0.000714,0.000646,0.000498,0.000191,0.000917,0.000551,0.000391,0.000429,0.000764,0.000414,0.000276,8.9e-05,0.000217,1e-05,0.000411,0.000333,0.00027,0.000834,0.00062,0.000492,0.000727,0.000661,0.000369,0.000487,0.000629,0.000345,0.000807,9.7e-05,8.4e-05,0.000789,0.001209,0.00126,0.000726,0.000521,0.000661,0.00044,0.000501,0.001121,0.000706,0.000468,0.000415,0.000506,0.000857,0.000612,0.000506,0.000639,0.00041,0.000399,0.000416,0.000612,0.000478,0.000534,0.000733,0.000885,0.000556,0.000387,0.000189,0.000466,0.000225,9.7e-05,0.000435,0.001299,0.001053,0.000251,0.000452,0.000409,0.000579,0.000211,0.000563,0.000881,0.000153,0.000247,9e-04,0.000334,0.00069,0.000889,0.000303,0.000392,0.00055,0.001194,0.000783,0.000996,0.000813
0.001128,0.000562,0.000472,0.000389,0.000358,0.000351,0.000305,0.000682,0.000888,0.000484,0.000457,0.000628,0.001224,0.001118,0.000585,0.001138,0.00116,0.001269,0.001263,0.000415,0.000495,0.000184,0.000741,0.000883,0.000977,0.000903,0.000599,0.000249,0.000913,0.000527,0.00038,0.000653,0.000853,0.000775,0.000318,0.000207,0.000306,0.000187,0.000257,0.000462,0.000258,0.00033,0.001,0.000795,0.000256,0.000732,0.001161,0.000998,0.000573,0.000189,0.000369,0.000359,0.000587,0.000455,0.000548,0.000575,0.000734,0.000296,0.000855,0.000701,6.4e-05,0.000389,0.000682,0.000532,0.000432,0.000884,0.000627,0.000402,0.000617,0.001272,0.000718,0.000424,0.000327,0.00024,0.000472,0.001004,0.000763,0.000261,0.000381,0.000638,0.000522,0.00054,0.000508,0.001193,0.000588,0.000239,0.000239,0.000322,0.000202,0.000798,0.000689,0.000544,0.000744,0.000431,9.2e-05,7e-04,0.000707,0.000338,0.000531,0.001096,0.000688,0.000609,0.000725,0.001264,0.001405,0.000971,0.000217,0.000569,0.000791,0.000583,0.000457,0.000669,0.000435,0.000805,0.000636,0.000483,0.000635,0.000753,0.000555,0.000646,0.001144
0.000614,0.000377,0.000488,0.000188,0.000303,0.000105,9e-05,0.000174,0.000552,0.000359,0.00014,0.000506,0.000618,0.000805,0.000864,0.00101,0.00047,0.001198,0.000468,0.000262,0.000411,0.000454,0.000369,0.000891,0.000339,0.000457,0.000188,0.000494,0.00047,0.000398,0.000447,0.000659,0.00035,0.000321,0.000358,0.000214,0.000162,0.000221,0.000629,0.000122,0.000412,0.000614,0.000534,0.000135,5.6e-05,0.000922,0.00062,9.4e-05,0.00054,0.000625,0.000414,0.000221,0.000296,0.000185,0.000288,0.000185,0.000336,0.000625,0.001231,0.000838,0.000465,0.000145,0.000432,0.00031,0.000638,0.00037,0.000252,0.000606,0.000387,0.00091,0.000665,0.000423,0.00042,0.000385,0.000297,0.000634,0.00034,0.00025,0.000536,0.00072,0.000301,0.00042,0.000373,0.000989,0.000897,0.000718,0.000746,0.000523,0.000313,0.000474,0.000216,0.000184,0.000416,0.000172,0.000373,0.000577,0.000585,0.000413,0.000336,0.000149,0.000185,0.000224,0.000267,0.000902,0.000316,4.3e-05,0.000185,0.00044,0.000265,0.000382,0.000624,0.000876,0.00057,0.000404,0.000336,0.00045,0.000126,0.000793,0.000439,0.00048,0.00045
0.000285,0.000335,7.2e-05,0.000151,0.000364,0.000366,0.000344,0.000413,0.000143,0.000106,0.000189,7.6e-05,0.000573,0.000364,0.000697,0.000463,0.000501,0.000358,0.000403,0.000224,0.000467,0.000504,0.000582,0.000359,0.000113,0.000137,0.000211,0.000603,0.000648,0.000628,0.000444,0.000308,0.000427,0.000689,0.000857,0.000673,0.000373,0.000228,0.000618,0.000583,0.000205,0.000235,0.000349,0.000238,0.000148,0.000736,0.000275,0.000116,0.000309,0.000128,0.000312,0.000355,0.000315,0.000336,0.000448,0.000466,0.000389,0.000505,0.000613,0.001093,0.000919,0.00049,0.000544,0.000276,0.000342,0.000166,0.000135,0.000334,0.00023,0.00034,0.000386,0.000387,0.000116,0.000264,0.000146,0.000774,5e-04,0.000347,0.000481,5.1e-05,0.000161,0.000443,0.000171,0.000543,0.000375,0.000277,0.000229,0.000335,0.000128,0.000313,0.000204,4e-05,0.000341,0.000246,0.000742,0.000419,0.00032,0.000135,0.000481,0.00049,0.000193,0.000325,0.000367,0.000431,0.00072,0.000639,0.000407,0.000433,0.000527,0.000305,0.000554,0.000955,0.000514,0.000282,0.000162,0.000231,0.000209,0.000447,0.000474,0.000352,0.00019
0.000306,0.000151,0.000335,0.000364,0.00015,0.000198,0.000484,0.000309,0.000241,0.000126,6.8e-05,0.000139,0.000211,0.000314,8.5e-05,0.000336,0.000309,0.000313,0.000361,0.000388,0.000384,5.8e-05,0.000123,0.000156,0.000199,0.000112,0.000162,0.000239,0.000341,7.4e-05,0.000145,0.000222,0.000459,0.00049,0.000166,9.8e-05,6.9e-05,0.000105,0.000348,6.3e-05,0.000164,9e-05,0.000177,0.000305,0.000207,0.00019,2.7e-05,0.000109,0.000191,0.000173,0.000227,0.000128,2.9e-05,0.00022,0.00011,0.00023,0.000336,7.3e-05,0.00022,0.000413,0.000155,0.000163,0.000256,0.000345,0.000244,0.000164,4.6e-05,0.000198,0.000427,0.000316,0.000176,0.000197,0.000262,0.000271,0.00036,0.000479,0.000553,0.000521,0.000285,0.000147,0.000174,0.00021,0.000303,0.000126,0.00016,0.000201,0.000179,8.3e-05,4.4e-05,0.000196,0.000268,0.000131,0.000318,0.000101,0.000491,0.000559,0.000296,0.000193,0.000224,0.000215,0.000165,0.000214,3.4e-05,0.000245,0.000347,0.000209,0.000275,0.000366,0.000159,0.000196,0.000294,0.000521,0.000409,0.000251,7.5e-05,5.3e-05,2.8e-05,0.00015,3.8e-05,0.000177,0.000196
6.7e-05,0.000162,0.000246,0.000132,0.000104,0.000182,0.000105,0.000171,0.000101,4.1e-05,8.8e-05,8.8e-05,8.6e-05,6.3e-05,0.000123,0.000264,0.000153,7.8e-05,5.9e-05,0.000216,0.000109,4.2e-05,0.000108,5.8e-05,3.7e-05,6.3e-05,0.000131,6.3e-05,0.000152,0.000107,9.3e-05,9.9e-05,0.000152,7.7e-05,0.00021,9e-06,4.5e-05,0.000138,0.00015,0.000152,7.1e-05,6.1e-05,0.000182,0.000139,3.8e-05,0.000107,8.3e-05,0.000168,2.2e-05,0.000124,0.000175,4.2e-05,6.1e-05,6.6e-05,0.000135,0.000173,0.00013,3.5e-05,4.7e-05,0.000127,0.000102,0.000124,0.000136,9.1e-05,0.000115,0.000152,8e-05,0.000102,0.000265,0.000163,2.9e-05,0.00015,0.000243,4.1e-05,0.000162,0.000214,0.00023,0.000137,0.000108,0.000131,9.4e-05,0.000137,0.000195,0.000108,8.7e-05,3e-05,0.000107,2.6e-05,5.2e-05,0.000186,0.000112,7.3e-05,0.000161,9.6e-05,0.000236,0.000213,0.000165,1e-05,0.000202,3.3e-05,4.8e-05,5.5e-05,0.000156,7.3e-05,0.000168,0.000181,0.000173,4.2e-05,0.000137,8.5e-05,0.000123,0.000221,2.5e-05,0.000168,7.7e-05,0.000103,0.00011,3.3e-05,0.000111,0.000165,7.5e-05
9e-05,0.000133,0.000159,0.000121,8.9e-05,6.7e-05,4.2e-05,0.000124,3.8e-05,6.1e-05,9.6e-05,0.00011,8.7e-05,0.000166,0.000132,0.000113,9e-05,4.4e-05,0.000122,0.000183,0.000118,7e-05,0.000134,3e-06,5e-05,9.7e-05,7.2e-05,0.000142,0.000118,0.00012,8.6e-05,3.7e-05,0.000129,0.000114,0.000188,2.3e-05,7e-05,0.000102,7.2e-05,9e-05,3.6e-05,3.5e-05,0.000116,0.000137,1e-04,0.000137,0.000105,0.000129,0.000105,0.000137,0.000132,0.000105,7.3e-05,0.000143,0.000196,0.000185,2e-04,1.3e-05,0.000132,0.000194,0.000131,0.000132,8.1e-05,0.000177,0.00014,0.000158,0.000114,0.000108,0.000296,0.000124,8.7e-05,0.000155,0.000143,9.8e-05,4.6e-05,0.000179,0.000155,8.6e-05,9.7e-05,0.000122,5.1e-05,0.00017,0.000105,0.000173,8.5e-05,8.3e-05,0.000161,5.4e-05,8.5e-05,0.000164,0.000111,4e-05,0.000159,0.000124,0.00014,0.000179,0.000173,9.4e-05,0.000134,0.000116,7e-05,3e-05,8.9e-05,0.000105,6.1e-05,0.000193,0.000166,0.000144,8e-05,5.5e-05,0.000178,0.000105,4.2e-05,0.000211,0.000104,0.000123,8.4e-05,0.000128,2e-04,0.000147,0.000128
9.6e-05,0.000246,0.000279,5.9e-05,5e-05,7.7e-05,5.1e-05,0.000108,0.00018,7.1e-05,9.7e-05,0.000166,0.000151,0.000144,0.000143,9.7e-05,7e-05,7.8e-05,5.9e-05,0.000104,0.000199,9.1e-05,9.4e-05,0.000176,0.000114,0.000188,0.000207,0.000149,7.8e-05,8.4e-05,6.6e-05,1.8e-05,9.4e-05,0.00015,0.000295,4.3e-05,8.3e-05,3.6e-05,8.2e-05,0.000171,0.000138,8.7e-05,0.00015,0.000197,0.000101,0.000104,5.7e-05,0.000161,0.00022,0.00029,0.000123,0.000188,0.000184,0.000287,0.000237,0.000201,0.000329,9.3e-05,0.000119,0.000166,0.000118,0.000157,0.000196,7.4e-05,3e-04,0.000203,0.000174,0.000115,0.000262,0.000125,3.2e-05,0.000246,0.000209,0.000121,0.000177,0.000166,0.000123,6.3e-05,0.000111,8.8e-05,6.1e-05,0.00025,0.000185,0.000295,9.5e-05,2.2e-05,0.00011,6.2e-05,0.000219,0.000105,0.000196,2e-05,0.000103,0.000199,2.9e-05,0.000127,9.4e-05,3.8e-05,0.00022,0.000132,0.000183,0.000195,0.000152,9.1e-05,0.000138,0.000248,0.000207,0.00014,0.000169,0.000147,0.00032,0.00022,0.000225,0.000254,4.7e-05,5.3e-05,0.000256,0.000256,0.00014,0.000196,0.00021
0.000154,0.000316,8.1e-05,0.000143,8e-05,8.3e-05,0.00018,9.1e-05,0.000364,1e-04,8.9e-05,2.7e-05,0.000101,0.000217,0.000357,0.000207,2.7e-05,1e-04,0.000196,4.3e-05,0.000274,0.000307,0.000103,0.000459,0.00025,0.000305,0.000113,0.000219,0.000464,0.000275,0.000323,5.2e-05,6.8e-05,0.000255,0.000179,0.000315,0.000168,8e-05,4.9e-05,0.000258,0.000306,0.000162,0.000318,7.8e-05,0.000143,0.000133,0.000142,0.000361,7.4e-05,0.000359,0.000304,0.000307,0.000244,0.00023,0.000596,0.000382,0.000638,0.000378,9.9e-05,0.00014,0.000274,0.000312,0.000299,0.000243,0.000264,0.00022,0.000466,0.000101,3e-04,0.000292,8.1e-05,0.000337,0.000273,0.000291,0.000298,0.000201,0.000355,6.9e-05,0.000227,8.3e-05,0.00022,0.000419,0.000214,0.000265,0.000207,0.00021,0.000244,0.000203,0.000228,0.000399,0.000444,0.000313,0.000268,0.000155,0.000164,0.000139,0.000478,0.000256,0.000283,0.000315,0.00017,0.000348,6.4e-05,0.000251,0.00019,0.000202,0.000238,0.000315,0.000219,0.000473,0.000332,7.8e-05,7.8e-05,0.000289,0.000198,0.000223,0.000388,0.000225,0.00054,0.000428,0.000414
0.000324,0.000536,0.000567,0.000289,0.000289,0.000268,0.000313,0.000523,0.00074,0.000684,0.00032,0.000176,3.2e-05,0.000389,0.000681,0.000291,0.000239,0.00015,0.000222,0.000204,0.00021,0.000172,0.000321,0.000708,0.000917,0.000875,0.000668,0.00045,0.000418,0.000132,0.000459,0.000292,9e-05,0.000367,0.000417,0.000456,0.00044,0.000183,6.5e-05,0.000169,0.000527,0.000496,0.000427,0.00031,0.000299,0.00023,0.000233,0.000553,0.000515,0.000231,0.000228,0.000489,0.000571,0.000447,0.000776,0.000835,0.000559,0.00075,0.000648,0.000447,0.000433,0.000127,0.000186,7.5e-05,0.000364,0.000442,0.00035,0.000792,0.000694,0.000621,0.00033,0.000408,0.000204,0.000309,0.000577,7e-04,0.000539,0.000236,0.00023,0.000275,0.000207,0.000487,0.00052,0.000646,0.000424,0.000261,0.000395,0.000359,0.000511,0.000534,0.000657,0.000222,0.000234,0.00015,3e-05,0.000363,0.000363,0.000552,0.000371,0.000566,0.000754,0.000827,0.000756,0.000695,0.000378,3.9e-05,0.000455,0.000443,0.000322,0.000608,0.00057,0.000292,0.000164,0.000392,0.000257,9.7e-05,0.00014,0.000448,0.000751,0.00081,0.000332
0.000253,0.000228,0.000275,0.00052,0.000183,0.000137,0.000192,0.000337,0.000274,0.00045,0.000376,0.00037,0.000234,0.000444,0.000513,0.000683,0.000499,0.000253,0.000313,0.000235,0.000228,0.000143,0.000276,0.000351,0.000301,0.000726,0.000537,0.000199,0.00056,0.000399,0.000369,0.000549,0.000274,0.000326,0.000418,0.000291,7.9e-05,0.000221,0.000283,0.000273,0.00034,9.1e-05,0.000303,0.000298,0.000135,2e-04,0.000156,0.000428,0.000419,0.000261,0.00017,0.000129,0.000189,0.000254,0.000553,0.000163,0.000254,0.00037,0.000472,0.000227,8.4e-05,6.9e-05,0.000196,0.000207,0.000378,0.000332,0.000489,0.000763,0.000399,0.000147,0.00046,0.000185,1e-04,0.000332,2e-04,0.000375,0.00041,0.000224,0.000103,9.1e-05,0.000152,0.000114,0.000102,0.000353,0.000174,0.000155,0.000165,0.000145,0.000176,0.000149,0.000218,0.00026,0.000133,0.000347,0.000296,0.000551,0.000389,0.000436,0.000142,0.000464,0.000224,0.000198,0.000349,0.000197,0.000192,0.000118,0.000425,0.000196,0.000269,0.00057,0.000236,0.000162,0.000295,0.000517,0.000307,8.3e-05,0.000155,0.000502,0.000342,0.000241,0.000424
0.000116,5.9e-05,0.000155,0.000282,0.000201,0.000225,0.00018,9.8e-05,0.000225,0.000202,1.4e-05,0.000155,8.2e-05,0.00025,0.000148,0.000346,0.000159,0.000118,0.000235,0.000133,8.2e-05,0.000112,9.7e-05,0.000191,0.000182,0.00035,9.4e-05,0.00014,0.000252,0.000251,0.000263,0.000177,0.000243,0.000302,0.000136,7e-05,0.000132,0.000126,0.00018,0.000134,6.2e-05,0.000159,0.000137,5.7e-05,0.000167,0.000339,0.00013,0.000177,4.1e-05,1.6e-05,9.6e-05,6.1e-05,0.000147,7.5e-05,0.000212,0.000179,0.000142,8.4e-05,0.000229,0.000274,0.000158,0.000112,0.000125,0.000123,6.3e-05,0.000121,0.000164,0.00036,0.000228,9e-05,0.000234,0.000147,8e-05,0.00018,0.000353,0.000374,5.4e-05,0.000112,0.000154,0.000104,4.5e-05,1e-04,0.000128,0.000215,9.7e-05,0.000148,0.000213,0.000139,1.2e-05,9.6e-05,5.7e-05,6.5e-05,8.1e-05,0.000187,0.000127,0.000219,4.6e-05,0.00014,9.4e-05,0.000266,0.00019,4.7e-05,0.000303,0.000349,0.000192,0.000285,5.2e-05,5.4e-05,0.00028,2.2e-05,0.000154,6.2e-05,0.000183,0.000346,0.000201,0.00018,0.000115,0.000244,6.7e-05,0.000197,0.000141
0.000134,6.8e-05,9.7e-05,0.000107,9.3e-05,0.000133,0.000103,6e-05,0.000134,6.5e-05,0.000107,0.000122,7.8e-05,7.8e-05,6.7e-05,0.000277,7e-05,0.000112,0.000109,6e-05,0.000118,8.1e-05,6.3e-05,0.000167,0.000218,0.000158,0.000138,7.8e-05,1.5e-05,0.000115,5.8e-05,0.000124,0.000142,0.000109,0.000107,0.00015,0.000206,0.000167,9.6e-05,0.000101,0.000162,7.7e-05,6.8e-05,0.000128,9e-05,7.2e-05,8.5e-05,0.000133,5.8e-05,3.6e-05,8.9e-05,0.000169,0.000231,0.000285,0.000177,0.000255,9.7e-05,4.7e-05,9.5e-05,7.2e-05,0.000141,8.5e-05,0.000143,0.000111,0.000147,9.8e-05,0.000197,0.000249,0.000163,0.000154,3.2e-05,8.4e-05,3.9e-05,9.3e-05,0.000193,0.000207,0.000195,0.000183,0.000106,8.3e-05,7.4e-05,2e-04,0.000182,0.000147,4.8e-05,2.3e-05,0.000132,0.000107,0.000132,7.9e-05,5.2e-05,3.3e-05,0.000101,3.5e-05,0.000162,0.000116,5.4e-05,1.6e-05,6.3e-05,6.7e-05,0.000157,0.000143,0.000171,0.000184,3.7e-05,8.6e-05,0.000104,1.5e-05,0.000147,9.8e-05,5.1e-05,9.5e-05,0.000177,0.000105,3.5e-05,7e-06,0.000158,0.000168,0.000178,0.000158,0.000124
5.4e-05,2.2e-05,3.2e-05,0.000122,4.2e-05,2.7e-05,0.00014,8.3e-05,9.5e-05,2e-05,3.2e-05,5.5e-05,2.9e-05,0.000117,0.000105,0.000233,4.4e-05,0.000103,1.7e-05,7.9e-05,8.4e-05,9.2e-05,6.6e-05,0.000133,0.000107,0.000155,1e-04,8.6e-05,7.2e-05,7.6e-05,5.1e-05,6e-05,0.000108,0.00013,9.3e-05,2.8e-05,0.000143,0.000105,6.7e-05,0.00013,9.2e-05,4e-05,5e-05,7.9e-05,4.9e-05,8.9e-05,4.8e-05,0.000118,3e-05,4.4e-05,8.1e-05,6e-05,0.000131,0.000141,8.1e-05,8.9e-05,4.9e-05,0.000127,7e-05,7.9e-05,6.3e-05,5.9e-05,1.8e-05,6.1e-05,0.000106,7.1e-05,0.000157,0.000165,4e-06,7.4e-05,0.000107,5e-05,5.6e-05,9.1e-05,4.4e-05,9.7e-05,6.7e-05,7e-05,0.000112,7.9e-05,6.5e-05,0.00012,8.2e-05,9.7e-05,3.3e-05,6.3e-05,7.2e-05,6.5e-05,7.3e-05,4.3e-05,5.7e-05,8e-05,1e-04,2.3e-05,0.000144,0.000125,0.000122,4e-05,6.2e-05,0.000118,0.000129,4.6e-05,9.3e-05,0.000113,6.4e-05,8.2e-05,3.6e-05,2.8e-05,1.8e-05,0.000177,5.4e-05,2.5e-05,8.9e-05,9.1e-05,1.1e-05,7.5e-05,9.3e-05,0.000214,9e-06,0.000136,7.1e-05
1.6e-05,2.4e-05,4.6e-05,0.000118,6.8e-05,3.7e-05,6.7e-05,7.5e-05,0.000101,1.8e-05,1.1e-05,8.7e-05,3.7e-05,7.9e-05,7.4e-05,0.000158,5.9e-05,0.000105,3.5e-05,7.3e-05,3.1e-05,8e-05,8.7e-05,8.8e-05,1e-04,0.000116,2.7e-05,6.9e-05,4.3e-05,2.2e-05,4e-05,0.000101,8.1e-05,3.5e-05,1.4e-05,2.6e-05,0.00012,0.000113,5e-05,7.2e-05,4.2e-05,2.9e-05,3.6e-05,6.6e-05,0.000102,3e-05,1.1e-05,9.6e-05,5.9e-05,3.3e-05,2.4e-05,5.5e-05,9.3e-05,3.4e-05,9.9e-05,7e-06,3.9e-05,5.3e-05,7.5e-05,1.7e-05,3.4e-05,1.9e-05,2.2e-05,3.3e-05,1.3e-05,1.5e-05,0.000105,5e-05,8e-05,0.000129,4.3e-05,3.9e-05,2.1e-05,5.1e-05,4.8e-05,8.1e-05,8.1e-05,1.9e-05,6.3e-05,3.1e-05,5.9e-05,0.000117,0.000148,2.3e-05,3.8e-05,5.2e-05,5e-05,4.9e-05,7e-05,4.5e-05,5.5e-05,3.5e-05,5.3e-05,5e-06,0.000166,8.2e-05,7.5e-05,2.3e-05,3.6e-05,9.3e-05,0.000114,6.7e-05,6.8e-05,0.000145,3.1e-05,7.2e-05,8.4e-05,8.4e-05,4.6e-05,0.000148,7.2e-05,1.9e-05,8.6e-05,9.7e-05,1.6e-05,0.000132,0.000133,0.000104,2.9e-05,0.000121,7.1e-05
1.4e-05,4e-06,2.1e-05,3.4e-05,1e-05,2.5e-05,3.8e-05,1.8e-05,3.3e-05,1.1e-05,1.1e-05,4.2e-05,4.2e-05,4.7e-05,3.1e-05,7.3e-05,2.2e-05,4e-05,1.4e-05,1.8e-05,1e-05,9e-06,2.1e-05,3.6e-05,2.7e-05,3.9e-05,1.2e-05,2.5e-05,1.4e-05,2.1e-05,1.9e-05,3.1e-05,1.5e-05,2.8e-05,9e-06,2.1e-05,4.6e-05,7.4e-05,2.6e-05,2.5e-05,2.5e-05,1.9e-05,1.2e-05,3.2e-05,4.1e-05,2.1e-05,8e-06,2.5e-05,9e-06,3e-05,1.7e-05,3.3e-05,4.9e-05,2.2e-05,2.7e-05,2.1e-05,2.1e-05,2.6e-05,1e-05,1.7e-05,8e-06,6e-06,2e-05,7e-06,2.1e-05,4e-06,2.8e-05,2.2e-05,4.5e-05,1.9e-05,1.8e-05,1.3e-05,1.1e-05,1.5e-05,4.4e-05,1.6e-05,1.9e-05,1.2e-05,2e-05,8e-06,2.2e-05,4.4e-05,4.6e-05,1.9e-05,3.6e-05,2.5e-05,1.7e-05,7e-06,3e-05,1e-06,1.4e-05,1.6e-05,2.6e-05,3.2e-05,6e-05,2.8e-05,3.7e-05,1.1e-05,2e-05,3.7e-05,3.9e-05,1.1e-05,3.2e-05,5.2e-05,4e-06,1.1e-05,3.4e-05,3.6e-05,3.1e-05,7.3e-05,2.8e-05,2.9e-05,1.2e-05,4.3e-05,2.5e-05,4.7e-05,1.8e-05,6.2e-05,7e-06,3.7e-05,3.3e-05
2e-06,1.6e-05,2.8e-05,3.2e-05,1.1e-05,2.2e-05,4.5e-05,1.3e-05,4.6e-05,1.1e-05,5e-06,3.2e-05,1.8e-05,4.7e-05,3.5e-05,6.8e-05,5e-06,4.1e-05,1.7e-05,2.6e-05,1.2e-05,2.3e-05,1.7e-05,4.6e-05,4e-05,4.4e-05,9e-06,1.6e-05,1e-05,2e-05,1.4e-05,6e-06,3.4e-05,5e-06,1e-05,2.2e-05,3.4e-05,1.1e-05,1.5e-05,1.5e-05,2.5e-05,1.6e-05,1.5e-05,3.5e-05,4e-06,4.8e-05,3.1e-05,4.4e-05,1.3e-05,3.4e-05,2.2e-05,2.2e-05,3.4e-05,2.9e-05,4.1e-05,3.9e-05,2.1e-05,2e-05,2.8e-05,1.3e-05,1.6e-05,9e-06,1e-05,1.7e-05,3.6e-05,3.4e-05,4e-06,3.8e-05,3.9e-05,4e-05,2.8e-05,2.4e-05,2.8e-05,2e-05,3.9e-05,5e-05,1.8e-05,1.8e-05,1.2e-05,2.4e-05,3.4e-05,2.3e-05,5.6e-05,1.9e-05,3.5e-05,1.5e-05,3.3e-05,1e-05,3.5e-05,2.7e-05,2.5e-05,1.7e-05,4.8e-05,1.7e-05,5.7e-05,4e-05,3.9e-05,7e-06,2e-05,3e-05,4.7e-05,3.2e-05,3.1e-05,8.4e-05,3.7e-05,2.9e-05,3.1e-05,4.4e-05,4.6e-05,2.6e-05,1.4e-05,6e-06,3e-05,2.7e-05,2.6e-05,4.3e-05,4.7e-05,4.7e-05,3.1e-05,4.4e-05,4.1e-05
1.6e-05,9e-06,1.3e-05,2.5e-05,5e-06,2.7e-05,3.7e-05,1.9e-05,4e-05,1.3e-05,4e-06,1.4e-05,3.7e-05,4.2e-05,9e-06,5.9e-05,9e-06,1.3e-05,9e-06,6e-06,7e-06,3.2e-05,3.2e-05,2.8e-05,2.4e-05,5.4e-05,1.4e-05,1.6e-05,4e-06,1.9e-05,1.6e-05,1.2e-05,1.1e-05,1.8e-05,7e-06,1.3e-05,4.1e-05,3.9e-05,1.9e-05,2.3e-05,2.7e-05,3.5e-05,8e-06,1.2e-05,3e-06,3.4e-05,3e-05,1.5e-05,1.8e-05,6e-06,2.7e-05,3.2e-05,2.5e-05,3e-05,3e-05,3.1e-05,2.9e-05,2.7e-05,1.8e-05,1.4e-05,1e-05,1.4e-05,7e-06,1.1e-05,1e-05,1.4e-05,1.2e-05,2.5e-05,2.8e-05,3e-05,1.2e-05,1.3e-05,1.4e-05,7e-06,1.6e-05,2.3e-05,1.6e-05,2e-06,5e-06,1.8e-05,1.4e-05,2.5e-05,3.6e-05,2e-05,9e-06,1.1e-05,2.3e-05,3e-06,1.6e-05,1e-05,2.3e-05,3.3e-05,3.1e-05,1.5e-05,3.8e-05,4.6e-05,1.4e-05,1e-05,1.8e-05,2.9e-05,2.4e-05,1.8e-05,6e-06,4.8e-05,2.7e-05,8e-06,3.1e-05,2.9e-05,1.3e-05,4.7e-05,3.2e-05,3e-06,4e-05,3.2e-05,1.6e-05,1.9e-05,2.9e-05,5.5e-05,3.4e-05,3.1e-05,2.5e-05
2.4e-05,1e-05,1.6e-05,2.8e-05,1e-05,1.7e-05,2.7e-05,1.6e-05,2.4e-05,9e-06,6e-06,1.7e-05,3e-05,4.2e-05,2.9e-05,5.6e-05,1.3e-05,2.4e-05,1.1e-05,1.2e-05,1.2e-05,1.7e-05,7e-06,1.6e-05,4e-06,3.7e-05,1.5e-05,2.6e-05,7e-06,2e-05,1.5e-05,1.7e-05,6e-06,1e-05,4e-06,1.6e-05,4.1e-05,1.8e-05,9e-06,2.3e-05,2.5e-05,3.1e-05,1.3e-05,2.8e-05,3e-06,9e-06,2.6e-05,1.7e-05,2.5e-05,1.9e-05,1.2e-05,2.7e-05,1.9e-05,2.3e-05,3.1e-05,1.8e-05,1.3e-05,3.6e-05,6e-06,3.1e-05,1.8e-05,3e-06,6e-06,1e-05,8e-06,1.4e-05,3.1e-05,2.7e-05,2.9e-05,1.7e-05,1.4e-05,1.7e-05,2e-05,1e-06,1e-05,2.9e-05,1.1e-05,2e-06,5e-06,1.9e-05,2.4e-05,1.4e-05,3e-05,1e-05,5e-06,5e-06,2.5e-05,2e-06,1e-05,6e-06,1.3e-05,1.9e-05,3.9e-05,1.7e-05,3.4e-05,4.3e-05,2.8e-05,2.1e-05,1.1e-05,2.6e-05,2.5e-05,2e-05,1.3e-05,3.3e-05,2.5e-05,1.4e-05,2.4e-05,2.5e-05,2.4e-05,3.6e-05,2.7e-05,2.8e-05,2.6e-05,3.7e-05,1.5e-05,2.3e-05,1.6e-05,4.7e-05,3e-06,3e-05,1.5e-05
1.6e-05,8e-06,1.2e-05,2.2e-05,6e-06,5e-06,3.2e-05,1.2e-05,3.1e-05,1.4e-05,8e-06,2.4e-05,3.6e-05,2.6e-05,1.6e-05,5.3e-05,2.3e-05,1.8e-05,1.1e-05,5e-06,7e-06,1.8e-05,3e-05,3e-06,5e-06,4.3e-05,1.1e-05,2.3e-05,1.4e-05,1.9e-05,1.6e-05,1.6e-05,9e-06,6e-06,9e-06,4e-06,2.2e-05,4.9e-05,1.2e-05,2.2e-05,2.1e-05,1.9e-05,1.1e-05,1.7e-05,1.4e-05,2.2e-05,2e-06,1.9e-05,1.4e-05,8e-06,1.8e-05,3.1e-05,1.2e-05,2.2e-05,2e-05,1.9e-05,9e-06,2.7e-05,9e-06,1.4e-05,1.2e-05,7e-06,4e-06,2e-06,5e-06,5e-06,3.1e-05,1.3e-05,9e-06,1e-06,2.1e-05,1.9e-05,1.5e-05,7e-06,2e-06,1.6e-05,8e-06,6e-06,1e-05,1.3e-05,1.5e-05,1.5e-05,3.5e-05,2e-06,4e-06,8e-06,2.3e-05,4e-06,6e-06,2e-06,1.9e-05,1e-05,3.5e-05,1.4e-05,3.2e-05,4.6e-05,2.7e-05,1.2e-05,4e-06,3.5e-05,2.3e-05,1.6e-05,1.5e-05,2.6e-05,1.8e-05,1.3e-05,9e-06,7e-06,2.1e-05,3.1e-05,1.2e-05,1.2e-05,1.6e-05,2.7e-05,4e-06,1.5e-05,9e-06,4.4e-05,1.9e-05,2.5e-05,1.2e-05
2e-06,0,1e-05,2.9e-05,7e-06,9e-06,2.9e-05,1e-05,2.1e-05,7e-06,3e-06,2e-05,3.2e-05,2.5e-05,2e-05,4.5e-05,2.2e-05,2.3e-05,9e-06,1e-05,1e-06,2.6e-05,1.7e-05,1.9e-05,1.2e-05,2.9e-05,6e-06,1.5e-05,1.4e-05,2.6e-05,1.8e-05,1.6e-05,5e-06,4e-06,8e-06,1.2e-05,2.5e-05,3e-05,1.2e-05,9e-06,1.7e-05,7e-06,8e-06,1.8e-05,1.6e-05,2.8e-05,1e-05,1.6e-05,1.1e-05,2e-05,1.5e-05,2.5e-05,1.7e-05,7e-06,1.6e-05,1.9e-05,7e-06,2e-05,3e-06,3e-06,9e-06,6e-06,7e-06,5e-06,9e-06,1e-05,2.5e-05,1.6e-05,2.1e-05,1.9e-05,1.4e-05,1.2e-05,1.8e-05,1e-05,1e-05,2.9e-05,2e-05,4e-06,3e-06,9e-06,1.4e-05,1.7e-05,2e-05,6e-06,1e-05,6e-06,2.3e-05,5e-06,1.4e-05,1.5e-05,9e-06,6e-06,3.8e-05,1.9e-05,3.3e-05,4.1e-05,2e-05,1.4e-05,1.2e-05,2.6e-05,1.5e-05,1.1e-05,1.6e-05,3.8e-05,2.2e-05,9e-06,9e-06,1.8e-05,8e-06,3.3e-05,1.2e-05,1.5e-05,2.8e-05,1.8e-05,1.3e-05,1.7e-05,1.1e-05,4.7e-05,1.6e-05,2.9e-05,7e-06
1.8e-05,4e-06,1.4e-05,2.8e-05,4e-06,6e-06,2.7e-05,5e-06,2.8e-05,2e-06,6e-06,2e-05,2.6e-05,1.2e-05,1.3e-05,5.3e-05,1.8e-05,2e-05,1.1e-05,1.4e-05,1.5e-05,1.4e-05,1.8e-05,1.4e-05,1.2e-05,3e-05,9e-06,1.6e-05,1e-05,1.7e-05,1e-05,1.2e-05,3e-06,1e-05,1e-05,3e-06,2.3e-05,2.8e-05,2.3e-05,1.8e-05,2.3e-05,6e-06,1.2e-05,1.8e-05,1.3e-05,1.8e-05,1.2e-05,1.7e-05,1e-05,1.8e-05,1.1e-05,2.3e-05,1.4e-05,1.2e-05,2.6e-05,5e-06,5e-06,2.7e-05,1e-05,4e-06,7e-06,4e-06,6e-06,8e-06,1.9e-05,1e-05,1.4e-05,1.3e-05,2.9e-05,1.1e-05,7e-06,1.1e-05,1.8e-05,1.4e-05,1.3e-05,1.9e-05,1.9e-05,1.5e-05,7e-06,1e-05,1.4e-05,1.2e-05,2.8e-05,1.7e-05,3e-06,4e-06,1.2e-05,7e-06,1.8e-05,8e-06,1.2e-05,5e-06,3.8e-05,1.2e-05,3.3e-05,3.2e-05,2.2e-05,7e-06,1.4e-05,1.9e-05,2.9e-05,8e-06,1.7e-05,3.9e-05,8e-06,6e-06,1.4e-05,1e-05,1.1e-05,3.2e-05,2.1e-05,2e-05,3e-05,2e-05,5e-06,1.7e-05,6e-06,4.5e-05,7e-06,2e-05,1.2e-05
1.4e-05,9e-06,1.6e-05,3.4e-05,1.6e-05,1.6e-05,3.3e-05,9e-06,2.4e-05,1.4e-05,1e-05,1.6e-05,2e-05,1.7e-05,2.6e-05,4.5e-05,1.2e-05,2.5e-05,4e-06,2e-05,3e-06,1.1e-05,1.2e-05,1.3e-05,2e-06,2.9e-05,6e-06,2.1e-05,5e-06,1.4e-05,3e-06,2.2e-05,1e-05,8e-06,2e-05,9e-06,2.2e-05,4.5e-05,3e-06,6e-06,1.4e-05,1.5e-05,8e-06,1e-05,8e-06,1.7e-05,1e-05,1.4e-05,1.3e-05,2.1e-05,1.2e-05,1.8e-05,1.7e-05,1.8e-05,2.6e-05,1.7e-05,2.1e-05,3.1e-05,1.7e-05,1.8e-05,1.1e-05,1.3e-05,2.1e-05,2e-05,1.7e-05,4e-06,3e-06,1.3e-05,2.2e-05,5e-06,1.9e-05,2e-05,1.4e-05,1.2e-05,1.5e-05,2.4e-05,9e-06,9e-06,1.2e-05,7e-06,1.3e-05,1.1e-05,2.7e-05,2.3e-05,2.3e-05,4e-06,1.1e-05,1.1e-05,1.8e-05,6e-06,1.9e-05,1.2e-05,4e-05,9e-06,4.3e-05,4.2e-05,4e-06,6e-06,1e-05,2.5e-05,2.4e-05,1.7e-05,9e-06,3e-05,1.5e-05,1.1e-05,1.9e-05,2.5e-05,2.3e-05,3.2e-05,4e-06,1.5e-05,2.2e-05,1.3e-05,1.4e-05,1.6e-05,4e-06,4.2e-05,1.2e-05,1.8e-05,3e-06
1.8e-05,1.2e-05,7e-06,3.5e-05,1e-05,1.8e-05,4.3e-05,1.8e-05,1e-05,1.7e-05,1.3e-05,1.6e-05,1.2e-05,1.3e-05,1.9e-05,4.9e-05,5e-06,2.6e-05,5e-06,1.3e-05,1.1e-05,1.4e-05,6e-06,1.1e-05,1.3e-05,2.7e-05,8e-06,1.9e-05,1.4e-05,2.1e-05,7e-06,2e-05,5e-06,1.9e-05,2.4e-05,2.7e-05,3e-05,1.1e-05,1e-05,1.2e-05,2.5e-05,1.8e-05,1.1e-05,4e-06,2.1e-05,2.4e-05,1e-05,1.4e-05,1.2e-05,2.5e-05,2.8e-05,1.4e-05,5e-06,1.8e-05,2.1e-05,2.4e-05,2.9e-05,1.4e-05,1.1e-05,8e-06,2.5e-05,9e-06,1.2e-05,3e-06,1.1e-05,1.7e-05,2.3e-05,1.4e-05,2.2e-05,4e-06,1.1e-05,2.2e-05,3e-06,2.3e-05,3e-06,2.7e-05,4e-06,1.2e-05,1.2e-05,1.7e-05,1.3e-05,6e-06,2.6e-05,1.3e-05,1.3e-05,1.3e-05,4e-06,1.3e-05,3e-06,1.7e-05,1.4e-05,6e-06,2.9e-05,4e-06,3.4e-05,1.3e-05,1.6e-05,9e-06,1.1e-05,2.7e-05,2.5e-05,6e-06,1e-05,4.3e-05,2.3e-05,4e-06,1e-05,3.5e-05,1.8e-05,3.2e-05,1.6e-05,1.6e-05,2.2e-05,1.8e-05,6e-06,2.2e-05,7e-06,3.7e-05,1.3e-05,2e-05,2.8e-05
1.3e-05,5e-06,1.5e-05,1.7e-05,4e-06,1.8e-05,3.2e-05,1.4e-05,2.9e-05,1.1e-05,1e-05,1.7e-05,3.6e-05,1e-05,3.1e-05,2.7e-05,2.1e-05,1.4e-05,1.4e-05,7e-06,1.1e-05,1.3e-05,1.4e-05,1.5e-05,1.1e-05,2.5e-05,7e-06,1.7e-05,2e-06,1.1e-05,1.7e-05,3e-05,6e-06,2.3e-05,9e-06,1.2e-05,2.9e-05,4e-05,1.9e-05,1.8e-05,2.1e-05,1.1e-05,1.5e-05,1.4e-05,2.3e-05,9e-06,1.1e-05,1e-06,6e-06,2.1e-05,1.2e-05,2.1e-05,1.3e-05,1.7e-05,2.3e-05,3.2e-05,1.8e-05,3.5e-05,6e-06,1.3e-05,2.6e-05,1.7e-05,8e-06,9e-06,1.5e-05,6e-06,1.2e-05,2.1e-05,2e-05,1.2e-05,1.6e-05,2e-05,3.2e-05,1.8e-05,2.1e-05,1.8e-05,8e-06,1.7e-05,1.8e-05,1e-05,8e-06,1.6e-05,2.6e-05,1.9e-05,9e-06,2e-06,1.4e-05,5e-06,1e-05,1e-05,2.1e-05,1.1e-05,3.5e-05,1.5e-05,1.6e-05,1.9e-05,2.4e-05,6e-06,1.7e-05,4.8e-05,1.5e-05,1.6e-05,2.4e-05,3.4e-05,1.6e-05,1e-06,2.5e-05,3.7e-05,2.4e-05,4e-05,2e-05,3.1e-05,2.1e-05,1.4e-05,8e-06,1.5e-05,1e-05,2.8e-05,3e-06,3.5e-05,3e-06
3e-06,1e-05,9e-06,2.9e-05,1.5e-05,2.2e-05,3.3e-05,1.8e-05,2.8e-05,1e-05,1e-06,3.1e-05,2.4e-05,3.5e-05,2.3e-05,4.8e-05,2e-05,1.5e-05,3e-06,8e-06,2.5e-05,3e-05,2.1e-05,3e-06,1e-05,1.9e-05,1.2e-05,1.1e-05,2e-05,2e-05,1.5e-05,2.2e-05,4e-06,1.8e-05,1.6e-05,1.7e-05,3.2e-05,2e-05,3e-06,1.3e-05,2.1e-05,8e-06,1e-05,4e-06,1.9e-05,2.1e-05,1e-05,2e-05,1.7e-05,1.2e-05,1.3e-05,5e-06,9e-06,2.8e-05,5e-06,1.5e-05,3.6e-05,2.8e-05,1.6e-05,9e-06,1.7e-05,2.2e-05,4e-06,1.2e-05,2.5e-05,6e-06,4e-06,2.3e-05,3.1e-05,2e-06,1.6e-05,7e-06,2.2e-05,2.1e-05,1.4e-05,3.3e-05,1.8e-05,1.7e-05,1.8e-05,1.4e-05,3e-06,6e-06,1.5e-05,2.9e-05,3.4e-05,2.8e-05,1.9e-05,1.1e-05,1.1e-05,1.5e-05,1.8e-05,2e-06,3.5e-05,2.1e-05,4.3e-05,3.3e-05,2.4e-05,2.1e-05,6e-06,3.7e-05,3.3e-05,2.9e-05,3.6e-05,2.6e-05,1.3e-05,1.5e-05,2.5e-05,9e-06,1.8e-05,3e-05,1.8e-05,1.3e-05,2.7e-05,2e-05,1.4e-05,6e-06,4e-06,2.4e-05,1.3e-05,2.9e-05,2e-05
1.5e-05,9e-06,1.4e-05,2.4e-05,1.3e-05,1.7e-05,2.6e-05,1.7e-05,2e-05,1e-05,1e-05,3.9e-05,4.2e-05,3.9e-05,3.9e-05,3.6e-05,1.3e-05,1.5e-05,1.2e-05,1.3e-05,3.8e-05,1.8e-05,1.5e-05,2.5e-05,3e-06,2.6e-05,1.7e-05,1.8e-05,2e-05,1.4e-05,1.8e-05,1.9e-05,2.1e-05,1.7e-05,1.2e-05,2e-06,2.5e-05,3e-05,6e-06,1.4e-05,1.1e-05,1.6e-05,9e-06,1.6e-05,1.1e-05,5e-06,1e-05,1e-05,1.1e-05,1.1e-05,1e-05,2.4e-05,1.4e-05,3e-05,3.1e-05,1.1e-05,2.6e-05,2.7e-05,7e-06,5e-06,1.8e-05,9e-06,1.8e-05,1.6e-05,1.9e-05,2.6e-05,3.4e-05,1.9e-05,2.3e-05,1.8e-05,1e-05,8e-06,8e-06,2.8e-05,1.8e-05,3.1e-05,6e-06,7e-06,5e-06,1e-05,1.9e-05,1.5e-05,2.3e-05,2.1e-05,1.5e-05,1.2e-05,1.8e-05,7e-06,2.2e-05,2.4e-05,1.8e-05,1.5e-05,1.6e-05,3.9e-05,1.9e-05,3e-05,2.7e-05,1.5e-05,4e-06,2.1e-05,1.3e-05,8e-06,1.6e-05,1.9e-05,4.2e-05,9e-06,6e-06,3e-06,1.5e-05,3.2e-05,1.3e-05,1.5e-05,1.7e-05,3.4e-05,8e-06,6e-06,7e-06,1.8e-05,7e-06,2.9e-05,2.2e-05
5e-06,4e-06,3e-06,2.2e-05,8e-06,1e-05,3.5e-05,1.1e-05,1e-05,1.1e-05,9e-06,3.7e-05,3.4e-05,5e-06,1.6e-05,3.9e-05,3.6e-05,1.6e-05,1e-05,1.1e-05,2.2e-05,1.6e-05,1.8e-05,1.7e-05,1.5e-05,1.8e-05,1.8e-05,1.3e-05,1.3e-05,1.8e-05,6e-06,7e-06,1.6e-05,8e-06,1e-06,6e-06,1.8e-05,1.4e-05,6e-06,2e-05,1.6e-05,1.2e-05,2e-06,2.3e-05,1.8e-05,1.6e-05,7e-06,1.2e-05,5e-06,9e-06,7e-06,1.4e-05,9e-06,2.2e-05,9e-06,1.2e-05,1.3e-05,1.3e-05,2.6e-05,3e-05,1.1e-05,4e-06,7e-06,1.5e-05,3e-06,1.2e-05,1.9e-05,1.5e-05,2.9e-05,1.5e-05,1e-06,2e-06,1.4e-05,1.9e-05,2.1e-05,2.1e-05,6e-06,1.2e-05,3e-06,1.3e-05,1.9e-05,1.2e-05,2.4e-05,1.6e-05,8e-06,3e-06,1.5e-05,7e-06,2.6e-05,3e-06,6e-06,1.9e-05,4.1e-05,1.9e-05,2e-05,3.3e-05,3e-05,2.1e-05,1.2e-05,1.4e-05,2.1e-05,9e-06,2e-05,2.8e-05,2.4e-05,1.3e-05,1.7e-05,1.8e-05,2.2e-05,3.2e-05,2e-05,2.2e-05,2.8e-05,2.3e-05,5e-06,1.2e-05,6e-06,2.6e-05,1e-05,3.7e-05,1.1e-05
1.6e-05,4e-06,1.1e-05,2.5e-05,1.1e-05,5e-06,2.1e-05,8e-06,1.6e-05,4e-06,4e-06,2.6e-05,2.9e-05,1.4e-05,2.1e-05,2.6e-05,1.7e-05,1.7e-05,9e-06,7e-06,7e-06,1.6e-05,8e-06,1.1e-05,6e-06,1.7e-05,7e-06,7e-06,9e-06,1.5e-05,4e-06,1.3e-05,1e-05,2e-06,8e-06,1.5e-05,2.8e-05,2.6e-05,1e-05,8e-06,1e-05,6e-06,1e-05,1.3e-05,1e-05,1.8e-05,1.3e-05,8e-06,2e-06,1.1e-05,5e-06,1.3e-05,8e-06,5e-06,2e-05,1.1e-05,5e-06,1.2e-05,1.8e-05,1.6e-05,1.1e-05,4e-06,8e-06,1.5e-05,1.4e-05,1.3e-05,2.2e-05,1.2e-05,1.5e-05,1e-05,1.1e-05,2e-06,1.5e-05,1.5e-05,9e-06,1.1e-05,1e-05,1.1e-05,7e-06,9e-06,1e-05,1.5e-05,1.5e-05,1e-05,1.3e-05,8e-06,1.7e-05,1.2e-05,1.8e-05,1e-05,4e-06,1.6e-05,2.8e-05,9e-06,2.6e-05,2.9e-05,1.9e-05,1.7e-05,8e-06,1.7e-05,1.2e-05,4e-06,1.6e-05,2.4e-05,5e-06,6e-06,1.7e-05,1e-05,1.2e-05,2.4e-05,8e-06,1.9e-05,1.1e-05,2.9e-05,6e-06,1.5e-05,9e-06,1.7e-05,1.8e-05,2.5e-05,2.1e-05
5e-06,5e-06,1.3e-05,2.5e-05,1.3e-05,9e-06,2.6e-05,1e-05,1.8e-05,5e-06,4e-06,3e-05,3.5e-05,4e-06,2e-05,3.1e-05,1.8e-05,2.1e-05,4e-06,1.3e-05,1.9e-05,1.9e-05,9e-06,1.4e-05,1e-06,2.3e-05,7e-06,9e-06,1e-05,1.5e-05,3e-06,1.1e-05,1.1e-05,1.3e-05,5e-06,1.4e-05,2e-05,3.9e-05,1.4e-05,8e-06,1.3e-05,1.4e-05,1.1e-05,8e-06,9e-06,2.4e-05,4e-06,8e-06,1e-05,1e-05,1e-05,2e-05,1.1e-05,1.8e-05,2.1e-05,2.2e-05,1.8e-05,2.9e-05,1.1e-05,1.8e-05,1.1e-05,1.5e-05,1.4e-05,3e-06,3e-06,2e-06,1.9e-05,1.1e-05,2e-05,5e-06,5e-06,1.1e-05,1.7e-05,7e-06,1.3e-05,1.5e-05,1.7e-05,7e-06,8e-06,1.1e-05,1.1e-05,1.2e-05,2.8e-05,1.4e-05,1.1e-05,1.6e-05,1.4e-05,9e-06,2.2e-05,5e-06,1.3e-05,1.1e-05,2.7e-05,1.3e-05,1.8e-05,2.6e-05,1.3e-05,6e-06,1.2e-05,8e-06,1.1e-05,8e-06,7e-06,3.4e-05,8e-06,1.2e-05,2.1e-05,1.7e-05,1.3e-05,1.8e-05,1.8e-05,1.5e-05,1.3e-05,2.2e-05,6e-06,1.2e-05,8e-06,2.4e-05,1.2e-05,2.8e-05,1.8e-05
1.3e-05,7e-06,1.1e-05,3.4e-05,6e-06,6e-06,2.1e-05,9e-06,1.9e-05,3e-06,2e-06,2.7e-05,2.2e-05,1.5e-05,1.6e-05,4.5e-05,1.7e-05,1.4e-05,1.8e-05,8e-06,1.5e-05,1.3e-05,1.3e-05,1e-05,5e-06,2.2e-05,4e-06,1.7e-05,8e-06,1.6e-05,4e-06,1.2e-05,1.2e-05,7e-06,3e-06,5e-06,2.1e-05,8e-06,1.1e-05,1.3e-05,1.3e-05,1.6e-05,1e-05,4e-06,4e-06,1.3e-05,9e-06,1e-06,9e-06,4e-06,7e-06,7e-06,9e-06,1.6e-05,5e-06,7e-06,4e-06,1.3e-05,1.1e-05,1.2e-05,1.1e-05,1.6e-05,1.7e-05,4e-06,1e-05,9e-06,1.8e-05,4e-06,1.4e-05,6e-06,1.1e-05,1.5e-05,1.4e-05,6e-06,2e-06,1.9e-05,7e-06,1e-06,3e-06,9e-06,1.1e-05,3e-06,2.3e-05,8e-06,5e-06,1.6e-05,8e-06,5e-06,1.4e-05,6e-06,9e-06,1.3e-05,3.1e-05,8e-06,1.9e-05,2.4e-05,9e-06,3e-06,1.1e-05,1.6e-05,8e-06,7e-06,1.2e-05,2.6e-05,1.5e-05,4e-06,1.9e-05,6e-06,7e-06,2.2e-05,1.7e-05,1.2e-05,8e-06,2.6e-05,1e-06,1.5e-05,3e-06,2.1e-05,2e-06,3e-05,1e-05
5e-06,2e-06,8e-06,2.3e-05,2e-06,1e-05,2.2e-05,3e-06,1.7e-05,3e-06,2e-06,2.3e-05,3.1e-05,1.9e-05,1.5e-05,3.1e-05,8e-06,9e-06,8e-06,5e-06,1.1e-05,9e-06,1.3e-05,9e-06,9e-06,2.9e-05,1.1e-05,4e-06,2e-06,2.3e-05,6e-06,1.6e-05,8e-06,1.2e-05,5e-06,1.3e-05,2.6e-05,3.3e-05,1.3e-05,7e-06,1e-05,1.3e-05,7e-06,6e-06,1e-05,1.4e-05,5e-06,6e-06,6e-06,8e-06,8e-06,1.4e-05,1.2e-05,1.2e-05,1.2e-05,7e-06,8e-06,9e-06,5e-06,9e-06,8e-06,3e-06,1.1e-05,7e-06,8e-06,3e-06,1.2e-05,6e-06,2e-05,8e-06,1.5e-05,8e-06,1e-05,1e-06,8e-06,1.9e-05,9e-06,4e-06,4e-06,1.1e-05,1.4e-05,3e-06,2e-05,1e-05,1e-06,1.1e-05,1.3e-05,3e-06,1.5e-05,7e-06,7e-06,1.2e-05,2.4e-05,1.3e-05,1.8e-05,2.9e-05,1.3e-05,8e-06,6e-06,1.6e-05,1.9e-05,8e-06,1e-05,2.8e-05,2e-05,1.3e-05,1.5e-05,1e-05,7e-06,1.4e-05,1.7e-05,7e-06,9e-06,2.6e-05,6e-06,1.1e-05,7e-06,2e-05,6e-06,2.1e-05,1.4e-05
1.1e-05,2e-06,3e-06,3.2e-05,3e-06,7e-06,2.2e-05,1e-05,1.6e-05,1e-06,1e-06,1.9e-05,2.4e-05,1e-05,1.3e-05,3.2e-05,8e-06,1.4e-05,4e-06,4e-06,1e-05,1.2e-05,8e-06,1.1e-05,6e-06,2.6e-05,9e-06,1e-05,1e-06,1.4e-05,5e-06,1.4e-05,6e-06,7e-06,5e-06,1.4e-05,2.1e-05,2.3e-05,2e-06,5e-06,1.3e-05,1.4e-05,6e-06,4e-06,1.5e-05,1e-05,5e-06,1e-05,6e-06,1e-05,3e-06,1.3e-05,1.1e-05,8e-06,1.1e-05,6e-06,7e-06,7e-06,3e-06,8e-06,2e-06,2e-06,1e-05,7e-06,5e-06,3e-06,1.1e-05,6e-06,2.4e-05,4e-06,1.1e-05,4e-06,1.1e-05,3e-06,5e-06,2e-05,1.1e-05,7e-06,5e-06,6e-06,9e-06,5e-06,1.8e-05,9e-06,5e-06,1e-05,1.5e-05,8e-06,2e-05,2e-06,5e-06,1.5e-05,3.1e-05,1.2e-05,2.2e-05,2.6e-05,1.4e-05,5e-06,4e-06,2.1e-05,1.3e-05,6e-06,1.5e-05,2.3e-05,2.4e-05,2e-06,1.1e-05,1.3e-05,2e-06,2.2e-05,1.7e-05,1.2e-05,1.1e-05,1.8e-05,3e-06,7e-06,3e-06,2.4e-05,1.2e-05,3e-05,1.2e-05
8e-06,2e-06,2e-06,2.7e-05,5e-06,7e-06,2e-05,8e-06,1.8e-05,1e-06,2e-06,1.8e-05,2.5e-05,1.2e-05,1.2e-05,3.6e-05,1.4e-05,1.1e-05,1e-06,6e-06,8e-06,1.6e-05,1.5e-05,1.4e-05,7e-06,2.5e-05,1.1e-05,8e-06,2e-06,1.3e-05,1e-06,1.2e-05,7e-06,7e-06,4e-06,7e-06,2.2e-05,3e-05,7e-06,5e-06,9e-06,1.3e-05,8e-06,4e-06,9e-06,1.2e-05,4e-06,1.1e-05,4e-06,8e-06,3e-06,1.3e-05,9e-06,7e-06,1.1e-05,2e-06,3e-06,1.1e-05,1e-06,7e-06,5e-06,2e-06,9e-06,6e-06,3e-06,1e-06,1.3e-05,6e-06,2.3e-05,2e-06,1e-05,6e-06,1.3e-05,3e-06,2e-06,1.7e-05,1e-05,3e-06,4e-06,9e-06,8e-06,3e-06,2e-05,1.1e-05,2e-06,5e-06,1.2e-05,4e-06,1.6e-05,4e-06,8e-06,1.3e-05,3.1e-05,1.3e-05,2.1e-05,2.4e-05,1.2e-05,6e-06,3e-06,1.8e-05,1e-05,3e-06,1.6e-05,2.6e-05,1.8e-05,4e-06,1.2e-05,1.1e-05,3e-06,1.8e-05,1.1e-05,1.3e-05,9e-06,2.1e-05,6e-06,1e-05,2e-06,2.2e-05,1.2e-05,2.3e-05,1e-05
7e-06,2e-06,3e-06,2.4e-05,3e-06,8e-06,2.2e-05,7e-06,1.7e-05,1e-06,1e-06,1.9e-05,2.3e-05,1e-05,1.5e-05,3.4e-05,1.1e-05,1.2e-05,1e-06,4e-06,1e-05,1.5e-05,1.1e-05,6e-06,5e-06,2.5e-05,1e-05,7e-06,3e-06,1.5e-05,3e-06,1e-05,3e-06,5e-06,1e-06,7e-06,2.1e-05,1.3e-05,9e-06,8e-06,1.1e-05,1.3e-05,6e-06,6e-06,1.1e-05,1.2e-05,5e-06,9e-06,2e-06,9e-06,3e-06,1.2e-05,1.1e-05,9e-06,1e-05,1e-06,4e-06,1.2e-05,1e-06,9e-06,2e-06,1e-06,8e-06,6e-06,2e-06,3e-06,1.2e-05,5e-06,2.3e-05,3e-06,1.1e-05,5e-06,1.2e-05,1e-06,4e-06,1.8e-05,1e-05,3e-06,1e-06,8e-06,8e-06,3e-06,1.9e-05,8e-06,2e-06,7e-06,1.3e-05,0,1.5e-05,5e-06,7e-06,1.2e-05,3.1e-05,1.3e-05,2.2e-05,2.3e-05,1.6e-05,6e-06,4e-06,1.8e-05,9e-06,3e-06,1.5e-05,2.7e-05,1.9e-05,4e-06,1.3e-05,9e-06,3e-06,2.1e-05,1.4e-05,1e-05,1.1e-05,2.1e-05,6e-06,9e-06,3e-06,2.1e-05,9e-06,2.8e-05,1.2e-05
