-0.000252,-0.000385,0.000403,-4.4e-05,0.000266,0.000337,-0.003275,-0.003162,-0.001201,-5.7e-05,-0.008034,-0.005293,-0.00255,-0.000886,-0.001,-0.002417,-0.001186,-0.001033,-0.002024,-0.003495,0.005235,-0.00124,-0.017038,-0.015404,-0.024557,-0.02381,-0.012156,-0.007707,-0.012543,-0.009328,-0.016973,-0.020411,-0.011053,-0.015845,-0.014248,-0.017225,-0.013224,-0.008654,-0.010428,-0.013042,-0.010187,-0.017099,-0.017985,-0.014693,-0.00927,-0.01417,-0.010406,-0.008794,-0.007278,-0.00979,-0.010768,-0.011177,-0.0109,-0.006078,-0.006678,-0.007093,-0.003657,-0.001885,-0.005688,-0.00348,-0.005266,-0.003879,-0.002313,-0.001391,-0.000583,-0.000289,-0.005544,-0.003399,-0.006302,-0.005749,-0.004039,-0.001803,-0.00101,-0.00271,-0.00195,-0.001208,-0.000753,-0.000174,-0.002557,-0.00291,-0.00026,-0.001213,-0.001071,0.000442,0.002196,0.000951,0.001093,0.000166,-0.001708,-0.000634,0.001343,-0.014122,-0.008895,-0.003471,-0.000605,-8e-05,-0.000262,4.6e-05,1e-04,-0.000288,-0.000444,9.7e-05,0.000148,0.000277,0.000617,0.000206,-0.000302,-0.000352,9e-05,-1e-06,0.00025,-0.000181,0.000124,-0.004766,-0.004009,-0.001812,-0.000419,-0.000106,0.000151,0.000126,0.000116
1.8e-05,-0.000111,-0.00034,-4.8e-05,0.000168,0.000113,-6e-04,0.00028,-0.000186,-0.000277,0.001575,0.002381,0.001138,0.000502,0.000272,0.001964,0.000872,0.000529,0.000914,0.004074,0.004342,-0.010574,-0.006436,-0.00042,-0.000518,0.001769,0.005471,-0.002153,0.002473,-0.001577,0.011069,0.001955,0.001375,-0.008439,-0.010949,-0.000147,-0.00349,-0.001509,-0.008116,-0.003324,-0.006219,-0.001751,5e-06,0.005216,-0.006202,-0.00217,-0.006152,-0.005228,-0.0034,-0.006321,-0.000374,0.003653,-0.002445,-0.004344,-0.001367,6.2e-05,-0.003306,-0.002145,-0.000148,-0.001922,-0.000292,0.000485,0.000631,-0.001516,-0.001013,0.000409,0.003844,0.003117,0.000974,0.001377,0.001543,0.000797,0.000743,0.000309,0.000579,-0.000332,0.000278,0.000634,0.001043,0.001472,0.003486,0.001712,0.000639,0.002511,0.004335,0.002173,0.000761,0.000469,0.000749,0.001028,-0.003486,0.004665,0.005535,0.003584,0.000557,0.000136,-0.000337,-0.000323,-2e-04,0.000574,0.000378,-0.000432,0.000135,-0.000108,-0.000386,-0.000351,-0.000405,-1e-06,0.000247,8.9e-05,-0.000195,0.000429,-4e-05,0.001965,0.002847,0.001238,0.000267,-0.000109,-0.000467,-0.000525,-6.7e-05
-0.000222,-4.8e-05,-0.000264,-9.8e-05,-0.000252,4.9e-05,-9.5e-05,-0.000915,-0.000752,-0.000167,-0.005057,-0.004226,-0.001314,-0.000962,-0.000196,-0.000265,0.000308,8e-06,-2e-05,-0.001335,-0.000939,-0.007236,-0.000874,0.01065,-0.000153,0.004885,0.001067,-0.009768,-0.000529,0.003377,-0.007887,-0.002102,0.005431,-0.001756,0.000802,-0.003621,-0.004879,0.000376,-0.003871,-0.004405,-0.004944,-0.000384,-0.003264,-0.003229,-0.000567,-0.001601,-0.001972,-0.002171,-0.0026,-0.000185,-0.001297,-0.00314,-0.002562,-0.000317,0.000189,0.00141,0.000147,0.000319,-0.00093,-0.001084,0.00129,0.000562,-0.000715,-0.001186,-0.000155,0.000242,0.000422,-0.001325,0.000594,-0.000609,-0.001279,-0.000476,-0.000371,7.2e-05,-0.000753,-0.000863,-0.000594,0.000158,-0.002382,-0.002018,-0.000471,0.000595,-0.001531,0.001406,0.000471,0.000594,0.000397,4.4e-05,-0.000367,-0.000393,0.001259,-0.004362,-0.003256,-0.000994,-0.000455,-0.000396,7.3e-05,-0.000546,-0.000833,-0.000612,-7.8e-05,-0.000523,-0.000166,-5.5e-05,-0.000102,0.000176,-0.000148,-0.000446,-0.000672,-0.000227,2e-05,-0.000329,-0.000101,0.000147,-0.001234,-0.00072,-0.000453,-0.000191,-0.000199,-0.000108,-0.000425
5.1e-05,2.9e-05,0.000273,0.000167,0.000342,-4e-06,-0.000285,0.000742,0.000574,-9.7e-05,0.000441,0.001088,7e-05,-0.000247,-4e-04,-0.000454,-0.000104,-0.000295,-0.001768,-0.000956,-0.000484,-0.001425,-0.002461,0.002269,0.006724,0.001511,-0.00387,-0.005535,-0.022893,-0.004204,0.002358,-0.004001,0.001366,-0.000334,0.000368,0.003256,0.000855,0.00043,-0.000986,0.005236,0.005303,0.000494,-0.002484,-0.002884,-0.000409,-0.004033,4.7e-05,0.002493,0.001822,0.000956,0.002223,0.003145,0.003566,0.001034,0.001958,0.000385,-0.002,-0.000843,0.00132,0.002327,-0.00118,-0.000901,-0.001604,-0.001679,-0.001167,-0.000667,-0.001158,-0.000712,0.000451,0.000325,0.000313,0.00014,-0.000413,-0.000656,0.000238,0.000884,0.000341,-0.000373,-0.001256,0.000906,0.001526,9.7e-05,0.00095,-0.001636,-0.000769,-0.000424,-4.9e-05,0.000409,6.4e-05,0.00062,-0.000701,-0.002981,-0.00227,-0.000243,0.000528,0.000289,0.000538,-0.000182,0.000282,6.8e-05,0.000129,8.6e-05,0.00024,-8.7e-05,0.000146,3e-06,0.000414,-6e-05,0.000106,0.000323,0.00039,0.000476,0.000254,7.8e-05,7.5e-05,-0.000191,-0.000146,5.5e-05,0.000336,0.000533,0.000195
-0.000221,7.2e-05,0.000129,-0.000376,-0.000631,-0.000528,-0.000312,0.000105,0.000353,8.5e-05,0.000126,-0.002035,-0.000922,0.00062,8.5e-05,-0.000332,-0.00044,6.7e-05,-4e-06,0.000416,-0.00157,-0.003423,-0.004705,-0.009339,-0.003164,-0.003903,0.001252,-0.00151,0.004159,0.009335,-0.002212,0.001009,-0.004605,0.005742,-0.001029,-0.011417,-0.004857,-0.001688,0.001325,-0.000663,-0.001311,0.003379,0.003546,-0.00192,0.004884,0.000877,-0.001705,-0.002958,0.000544,-0.001724,0.000491,0.000338,-0.001211,-0.000785,-0.001006,-0.002387,0.000395,0.000791,-0.000816,-0.003024,-0.001236,-0.000206,0.000763,0.001514,0.000271,-0.000231,-0.000457,-0.000635,-0.001014,-7e-05,0.000461,0.000554,-0.000293,0.000234,-0.000353,-6.4e-05,-0.000405,-0.00027,-0.000651,-7e-04,-0.001152,-0.000708,-0.001191,0.00064,-0.001217,-0.000388,0.000629,-4.9e-05,0.000108,0.000213,-0.000171,0.002574,0.00125,0.000961,8e-05,-0.00021,-0.000432,0.000235,0.000174,-0.000369,-0.000303,0.000118,0.000262,-0.00026,-0.000165,-0.000358,-0.000272,0.000223,-5.3e-05,4.9e-05,9.5e-05,0.000133,-6.4e-05,-0.000311,0.000495,-9.5e-05,0.000135,-0.000363,-0.00043,-0.000116,-0.00019
0.000145,-0.000329,-0.000338,-0.000392,-0.000135,-0.000216,-0.000218,-0.000644,-0.000301,-0.000116,-0.00084,0.000984,0.000508,-0.000118,-0.000618,-0.000267,0.000162,-0.00073,0.000179,-0.000795,0.00042,-0.002494,-0.002734,0.009736,-0.00429,-0.005158,0.000998,-5.9e-05,-0.000768,-0.005205,-0.000476,-0.002164,-0.002103,0.002079,-0.002513,0.002604,0.002131,0.000273,0.000927,6.7e-05,0.002543,-0.003203,0.000165,0.002947,-0.00432,0.001921,-0.001533,-0.003613,0.002365,-0.000526,0.000573,-0.002709,0.000257,0.000944,0.001534,0.002264,0.000803,9.4e-05,-0.000369,0.001563,0.00152,-0.000758,-0.00049,-0.000366,-9.8e-05,0.000179,-0.00012,-0.000218,0.000119,-0.001201,-0.000267,-7.5e-05,-1e-04,0.000304,-0.000292,-0.000113,0.000788,-0.000308,0.000503,-0.000476,-0.000849,-0.000906,-1.5e-05,0.001008,-0.000899,-0.000766,-0.000189,-8e-05,-0.000146,-0.000127,0.000108,-0.001713,-0.001238,-0.000412,-0.00023,4.4e-05,0.000118,-0.00027,0.000118,3.3e-05,-6.6e-05,-4.4e-05,-0.000305,-0.000248,0.000209,-3e-04,-0.00023,-0.000159,7.1e-05,9.1e-05,3.5e-05,-0.00037,-0.000478,2e-05,-0.000732,-0.000778,-0.000397,0.000373,-7e-05,-0.000563,-0.000174
-4.6e-05,-4.2e-05,4e-05,5.4e-05,-0.000126,0.000175,0.000364,5.1e-05,6e-06,-0.000231,0.000745,-1.1e-05,-0.000154,-0.000192,7e-05,-0.000352,-0.000418,4.4e-05,-0.000482,-0.000804,-0.000244,0.000376,0.006752,-0.00792,0.000311,-0.002772,-0.005975,0.001958,0.007377,0.002228,-0.001502,-0.001705,0.001599,-5.4e-05,0.001563,0.000857,-0.000193,-0.001689,0.002317,0.003751,0.00034,0.000227,0.001262,-0.002992,0.000111,-0.000115,0.00399,0.00296,-0.002307,0.001192,-0.000932,0.002162,-0.000527,-0.000661,-0.001498,-0.001296,-0.000459,-8.1e-05,-1e-06,-0.000558,-0.000528,-1e-05,1.1e-05,0.000882,0.00079,5.4e-05,-0.000148,-5e-06,-0.000749,0.000224,-2.8e-05,0.000178,0.000188,0.000107,-0.000501,-0.000178,-0.000289,0.000233,-0.000117,-0.00134,-0.001708,-0.000589,-0.000839,-0.000209,-0.000971,-0.000419,-0.000261,-5.9e-05,6.6e-05,2e-06,4.4e-05,-0.000303,-0.000811,-0.000213,-0.000185,0.000347,-0.000137,2e-06,-0.00017,-0.00022,-0.000127,-5e-05,-0.00024,6.1e-05,0.000415,0.000217,0.000264,4e-06,-0.000174,-0.000319,0.000153,-1.6e-05,-0.000141,-0.000112,-6.9e-05,0.000391,0.000126,0.000184,7.7e-05,0.000164,7.5e-05
0.000156,0.000163,-8.2e-05,0.000197,7.4e-05,0.000116,4.1e-05,-9.1e-05,-0.000203,0.000547,-0.000161,0.000147,0.000374,-0.00013,0.000186,0.000336,-0.000332,2e-05,-0.000139,0.000464,-0.001395,0.000498,0.004237,-5.5e-05,-2.4e-05,0.001992,0.002479,-0.000944,-0.003315,0.001416,0.001498,-0.001009,-0.003661,-0.003671,0.006556,0.002827,0.002078,0.000102,0.001251,-0.002912,-0.000246,0.000202,-0.002804,0.003807,-0.000295,-0.000373,-0.001941,-0.001174,0.000458,0.000636,0.004724,-0.000577,-0.000762,-0.001197,-0.000332,0.001189,0.000107,-0.001399,0.000105,0.000426,0.001085,0.001372,0.00091,-8.1e-05,0.000226,0.000156,-0.000238,7.2e-05,0.000461,-0.000396,-0.000324,-0.000392,-2.3e-05,-0.000391,0.000257,6e-05,0.000212,-0.000164,0.000258,-0.000223,0.000152,-0.000429,-0.000979,-0.000253,-0.000198,-7.8e-05,-0.000173,-0.000126,0.000128,0,0.000374,0.000586,-0.000264,-0.001162,-0.000326,-0.000148,-6.7e-05,0.00023,-7.4e-05,1.7e-05,-3.1e-05,0.000206,4.3e-05,-9.4e-05,-2.6e-05,0.000152,-8.6e-05,-3.4e-05,-0.000177,-5.3e-05,7.7e-05,-5e-05,-0.000108,-0.000271,0.000121,9.1e-05,0.000211,0.000137,6.5e-05,5e-05,0.000219
-0.000178,-0.000101,1e-06,-5e-05,-4.9e-05,-0.000123,0.000155,-0.000185,0.000389,9.4e-05,-0.000279,-0.00014,0.000317,-0.000196,0.000157,-0.000146,6.6e-05,4.9e-05,-0.000144,-0.000148,0.000126,0.001478,-0.003919,-0.000881,-0.006273,-0.002289,-0.004384,0.001463,0.002093,-5.1e-05,-0.003914,-0.002332,0.009093,1e-06,-0.006958,-0.001249,-0.001178,-0.000636,-0.001352,0.000217,-0.001773,0.000476,-0.001136,-0.000807,0.001166,-0.000974,0.001862,0.001864,7.1e-05,-0.000542,-0.00335,-0.002789,0.001619,0.001889,0.00139,-0.000109,0.000264,0.001169,0.000111,-0.000387,-0.000187,-0.001364,-0.000881,-0.000264,-0.000174,-6e-05,-7.4e-05,-4.1e-05,-0.000959,0.000684,0.000572,0.000168,-0.00012,-0.000146,0.000241,3.6e-05,-0.000382,8.7e-05,2.9e-05,0.000613,-0.000784,-0.001083,6.7e-05,0.000591,7e-05,-4.9e-05,-0.000752,4e-05,-3.2e-05,-6.2e-05,3.3e-05,-0.000635,0.001076,0.000803,0.000185,-0.000286,-0.00021,9e-05,-1.5e-05,3e-05,6.9e-05,5.4e-05,7.7e-05,-1e-04,-1.1e-05,-0.000151,-9.4e-05,4.2e-05,-8.2e-05,-0.000142,-0.000126,-0.000103,7.9e-05,-0.000144,-8.5e-05,-1e-05,0.000237,-9.9e-05,-4.4e-05,3e-06,3.2e-05
0.000168,0.000106,-0.000102,-0.000165,6.2e-05,0.000153,0.00022,5.1e-05,-0.000403,-0.000213,0.000243,-0.000276,-2.5e-05,0.000185,-0.000379,-4.2e-05,6.2e-05,-0.000152,0.000101,0.00028,-0.000125,-4.1e-05,-0.004389,0.001941,0.004871,0.003172,0.00414,0.002943,-0.001162,-0.001331,-0.001665,0.000127,-0.00559,-0.002226,0.003119,0.000812,-0.00106,-0.000377,0.001067,-0.000783,0.001735,-0.002182,8e-04,-0.001817,0.000989,0.003172,0.003052,-0.000262,0.000701,-0.002004,0.000159,0.001319,0.000933,-0.000377,-0.000993,0.000368,-0.000388,0.000592,0.000398,0.001111,-0.000159,0.000982,0.00109,-0.000113,-0.000119,-0.000577,0.000303,0.000103,0.000967,-0.000503,-0.000122,-0.000168,-8e-06,-0.000376,-0.000153,-0.000548,0.000233,5.2e-05,5.6e-05,0.000448,0.000567,0.000257,0.000174,4.8e-05,-0.000237,-8.6e-05,-0.000327,-0.000188,-0.000138,1e-05,0.000109,-0.000259,-0.000341,-0.000793,-0.000487,-1e-04,4.2e-05,-0.000229,-0.000181,7.5e-05,1.1e-05,-2.4e-05,6e-05,-0.000143,-5.5e-05,-7.8e-05,-4.2e-05,0.000122,0.000153,5.9e-05,-7.4e-05,-0.000113,-0.000149,0.000189,7.9e-05,-5.4e-05,-6.1e-05,-1e-04,0.000134,9.8e-05,-0.000105
-3e-05,4e-06,1.1e-05,5e-06,0.000178,5e-06,6.6e-05,0.000132,5.2e-05,-8.2e-05,-1.1e-05,0.000425,-9.9e-05,-9.3e-05,5.6e-05,0.000221,-2.4e-05,-3.6e-05,-3.1e-05,-0.000176,0.000133,0.001103,-0.002107,0.001493,-0.000961,-0.001042,-0.000383,-0.001158,0.002382,-0.002092,0.002275,-0.001306,0.002593,0.002031,-0.00256,0.001553,0.002247,0.002613,0.00029,-0.000886,-0.000545,0.001976,0.000807,0.000284,-0.000254,-0.003217,-0.003132,0.000662,-0.002243,0.00067,6.1e-05,-0.000703,-0.000966,0.000628,-0.000645,-0.000671,-0.000276,-0.000289,-0.000629,-0.000544,-0.000358,-0.000527,-0.000659,-0.000306,-6e-05,5.6e-05,4.2e-05,7.6e-05,-0.000611,0.000356,-9.2e-05,1.4e-05,4.4e-05,0.000108,-0.000173,0.000251,-5e-06,-0.000112,7.6e-05,3.6e-05,-0.000181,-0.000192,0.000213,-2.7e-05,-0.000102,0.000146,-0.000421,-0.00013,-2.3e-05,1.5e-05,-1.2e-05,0.000524,-0.00041,0.000203,4.5e-05,2e-06,6.9e-05,0.000181,3.7e-05,-0.000227,-9.2e-05,-1e-05,7.1e-05,0.000128,-9.4e-05,-7.9e-05,3.8e-05,-4e-05,-2.5e-05,-3.5e-05,1.3e-05,4.4e-05,-1.5e-05,0.000195,0.000145,-2.7e-05,3.6e-05,0.000115,-0.000179,4e-05,5.3e-05
-6.5e-05,-3.6e-05,2.6e-05,5.5e-05,1.2e-05,8.5e-05,-0.000161,2.7e-05,5.2e-05,2.4e-05,0.000108,-0.000166,-0.000398,0.000346,-0.000101,-7.5e-05,-7.1e-05,0.000184,-9.1e-05,-7.5e-05,6e-05,0.00026,0.000859,-0.003582,-0.001584,0.000369,-4.4e-05,-0.000546,-0.001352,-0.002665,-0.003376,0.000662,-0.000111,-0.000165,0.000218,0.000166,-0.00019,-0.000673,-0.000485,0.00125,-0.000397,-0.000759,-0.000599,0.000123,0.001057,0.002215,0.001056,-0.000801,0.000499,0.001657,-0.001331,0.001036,0.00109,-0.00101,0.000216,0.000134,9.3e-05,0.000266,0.000448,-8.2e-05,0.000403,-0.000321,0.000479,2.1e-05,3.9e-05,-9.6e-05,-6.1e-05,4.5e-05,0.000419,0.000204,-0.000238,0.000187,7e-05,-0.000158,-0.000104,9.6e-05,-5.7e-05,-0.000223,-0.00025,-6.9e-05,-0.000229,0.000734,0.000332,0.000187,-0.000201,-0.000463,-0.000221,6.4e-05,-5.1e-05,2.9e-05,0.000272,-2e-04,0.000359,-0.000263,-0.00017,-0.000101,-0.000122,1e-06,1e-05,-1.1e-05,8e-06,-2.5e-05,-3.8e-05,8.3e-05,-0.000117,-0.000183,3e-05,7.3e-05,1.1e-05,4e-06,2.1e-05,-6e-05,3.1e-05,-0.000109,-5.6e-05,1.9e-05,0.000112,-8.6e-05,-5.1e-05,-7.1e-05,-0.000113
-2.9e-05,-5.9e-05,1.7e-05,5.3e-05,-4.3e-05,-3.4e-05,1.1e-05,3.9e-05,-0.000123,0.000295,-1.4e-05,2.9e-05,0.000346,-0.000192,0.000238,4.5e-05,3.4e-05,-0.000193,0.000282,-4.4e-05,-0.000126,0.000609,8e-05,0.002693,0.001823,-0.000747,0.001886,-0.001153,0.000377,0.000174,0.000133,-1.1e-05,0.001004,0.000814,0.0013,-0.002367,-0.001504,0.000575,0.000107,-0.000699,-0.000499,-0.000355,0.000248,0.001261,-0.000652,-0.001289,0.000673,0.000389,0.000528,-0.001202,-0.000254,-0.00124,-0.000561,0.001418,0.000225,0.00031,0.000319,-2.6e-05,0.000347,9.5e-05,-0.000136,0.000246,-0.000344,0.000182,7.7e-05,-1.2e-05,-4.8e-05,-2.8e-05,0.000195,-1.6e-05,0.000102,8.8e-05,-0.000111,9.7e-05,5.2e-05,-3.8e-05,-8.1e-05,2e-04,8.6e-05,-0.000232,0.000257,-0.000281,0.000218,-0.000292,-0.000296,0.000229,-4.3e-05,-3.4e-05,-0.000125,-1.1e-05,-0.000116,-0.000123,-8.1e-05,-0.000107,0.00031,-0.000191,1.7e-05,-2.2e-05,6.2e-05,9.9e-05,3.5e-05,-7.9e-05,-7.7e-05,-9.3e-05,-7.7e-05,5.2e-05,-1.5e-05,-2e-05,-8.1e-05,-3.3e-05,-2.1e-05,1e-06,-3.2e-05,5.8e-05,-2.2e-05,4.4e-05,-0.000369,-7.5e-05,-7.4e-05,3.7e-05,5e-05
-1.6e-05,5e-05,0,-8e-06,-4.2e-05,-3e-06,1.1e-05,3.1e-05,-1e-06,-0.000146,-0.000141,9.2e-05,-7.5e-05,0.000274,-4.4e-05,-0.000133,8.1e-05,0.00016,4.1e-05,0.000193,0.000162,0.000661,-0.000895,-0.001197,-0.000597,0.000953,0.000202,-2.6e-05,-0.000555,0.00011,-0.002161,-0.000289,0.000525,1.5e-05,0.000375,0.002249,0.00087,-0.001471,-0.000817,0.000297,-0.000867,0.000243,2e-06,-0.000495,-0.001266,0.000421,9.1e-05,0.000139,-0.000268,0.000236,0.000431,-0.000253,-0.00021,-0.000806,-3.2e-05,0.000363,-0.000149,-2e-04,-0.000287,-3.9e-05,-0.000183,0.000108,0.00016,-0.000282,-0.000119,0.00013,-0.000101,-1.9e-05,-0.000169,2e-05,-3.4e-05,-6.3e-05,0.000108,1.5e-05,9.5e-05,0.000102,3.9e-05,-7.5e-05,-0.000135,-0.000106,2.6e-05,7.6e-05,0.000413,1.7e-05,5e-05,6.2e-05,7.6e-05,6.7e-05,-0.000157,-4e-06,0.000142,0.000194,-0.000147,0.000288,-8.2e-05,8.9e-05,-3.3e-05,-7.6e-05,3.3e-05,0,-9e-06,-4.1e-05,-4.1e-05,-8e-06,-2e-05,2.8e-05,-2.4e-05,-1.7e-05,7.5e-05,1.4e-05,-2.5e-05,-2.1e-05,3.4e-05,6.8e-05,5.8e-05,4.7e-05,9.8e-05,1e-05,3.6e-05,-2.8e-05,-2.3e-05
7e-06,-4e-06,3.1e-05,-1.8e-05,5.7e-05,-5e-06,1.1e-05,-4.4e-05,5.2e-05,-2.1e-05,8e-05,-0.000151,-0.000143,-0.000267,2.3e-05,2e-05,-2.9e-05,-2.4e-05,-1.2e-05,-7.4e-05,-0.000134,0.00016,-0.000967,-0.000129,-0.001027,-0.000193,0.000293,0.000344,0.000407,0.002411,0.000785,0.000579,-0.001109,-0.000144,-0.000862,-0.001118,0.000174,-0.000525,0.000261,0.000514,0.000821,0.000686,-0.000279,-3.7e-05,0.000179,-0.000677,-0.000347,-0.000921,0.000759,0.000578,0.000118,0.000694,-0.000327,0.000804,8.1e-05,4.3e-05,9e-06,-0.000207,-0.000265,-2.9e-05,-6.8e-05,-0.000225,-2.5e-05,0.000232,8e-06,5.4e-05,0.000131,1.6e-05,8.5e-05,1.2e-05,-8.5e-05,-0.000116,-3.5e-05,2e-05,0.000134,-6.9e-05,1.7e-05,7e-05,6.3e-05,0.000113,2.4e-05,-0.000176,5.1e-05,-0.000215,5.1e-05,-7.5e-05,5e-05,-2.6e-05,-0.000121,-2.7e-05,-4.7e-05,-2.6e-05,0.000134,0.000212,-2e-06,-2.6e-05,-4e-06,4e-06,-1.2e-05,5e-06,-3.9e-05,-3e-05,-2.4e-05,-6e-05,-3.3e-05,-1.8e-05,3e-06,-2.2e-05,6e-06,-9e-06,-4.3e-05,-1.2e-05,-2.7e-05,8.8e-05,-4e-06,-0.000124,-0.000149,0.000113,6e-05,0,-7e-06
-5.6e-05,-1.9e-05,-4.7e-05,-1.3e-05,2.3e-05,-1.8e-05,-5e-05,-5.3e-05,5e-06,-0.000168,2e-05,0.000152,2e-05,-3.4e-05,-6.9e-05,7.2e-05,-8e-06,0,-3.5e-05,3.6e-05,-1.3e-05,0.000339,0.000902,-0.001312,0.000732,0.000987,-0.001872,-0.000416,-0.000188,3.8e-05,0.00129,-0.000104,0.000325,-0.000412,4.6e-05,0.001315,-0.000231,0.000802,-0.00055,-0.000135,-0.000211,-0.000651,7.2e-05,3.6e-05,0.000477,0.000448,-0.000507,0.000466,-0.000191,-0.000107,-8.7e-05,-5.5e-05,-4.5e-05,-0.000135,0.000215,-0.000458,-6e-06,6.2e-05,-0.000111,-0.000256,-7.9e-05,0.000139,-4e-06,-1.5e-05,3.3e-05,8e-06,8.1e-05,4.7e-05,-0.000116,-6.6e-05,5.3e-05,9e-05,-9.3e-05,1.3e-05,-2.9e-05,-2.3e-05,-0.000104,-5e-05,-3.7e-05,7.3e-05,-0.000112,4.2e-05,0.000141,3.2e-05,-9.9e-05,6e-05,2.6e-05,-2.9e-05,-1.2e-05,-2.8e-05,-1.7e-05,-0.000123,6.8e-05,-0.000131,-8.5e-05,8.5e-05,-2.4e-05,-1e-04,1e-06,-2.3e-05,1.7e-05,-6e-06,2.5e-05,3.7e-05,-9e-06,-9e-06,-1.3e-05,4e-06,-4.3e-05,-2e-06,3.4e-05,0,4e-05,-4.7e-05,-2.9e-05,2.6e-05,0.000102,3e-06,-4e-05,2.9e-05,1e-05
-2e-06,1.6e-05,1.1e-05,1.2e-05,3e-06,2.3e-05,2.1e-05,-6e-06,2e-06,0.000181,-1.7e-05,-3.1e-05,-0.000106,-0.000119,-4.4e-05,-1.4e-05,-2.8e-05,-1.8e-05,6e-05,9e-06,-3.2e-05,0.000152,0.001107,-0.000296,-0.000372,-0.000314,0.001449,-0.00065,0.000343,1.8e-05,-0.000106,0.000118,-0.000434,-0.000887,0.000464,-0.000948,4e-05,0.000405,0.000261,0.000297,0.000197,0.000239,-1.9e-05,-0.000434,0.000226,-0.00027,-6e-06,-0.000577,6.8e-05,-5e-06,-0.000133,0.000377,0.000431,0.000184,9.6e-05,7e-06,6.7e-05,0.000195,8.3e-05,0.000135,-6e-06,-3.5e-05,-0.000139,8.1e-05,-1.1e-05,-5.1e-05,-4.2e-05,1.2e-05,0.000127,-2.7e-05,4e-05,-3.8e-05,0.000105,3e-06,-4.6e-05,-4.9e-05,1.5e-05,-3.1e-05,1.1e-05,5.3e-05,-6e-05,-9.5e-05,0.000143,-1.6e-05,-0.000142,-2.4e-05,-2.3e-05,3.3e-05,4e-06,-1.5e-05,4.5e-05,0.000183,-0.000117,2.1e-05,1e-06,-3.5e-05,-2e-05,-3.1e-05,-1.4e-05,1.3e-05,4e-06,4e-06,1.4e-05,3e-06,1.5e-05,-5e-06,1.3e-05,9e-06,1e-06,-1.2e-05,9e-06,1e-06,-3.7e-05,-3.4e-05,2e-05,-2.2e-05,-6.3e-05,-7e-06,1.1e-05,2.6e-05,-9e-06
4e-06,-1e-05,-5e-06,2.8e-05,-7e-06,-1.4e-05,-2.4e-05,1.1e-05,8e-06,-9e-06,3.6e-05,-5.4e-05,1.9e-05,5.5e-05,6.1e-05,2.7e-05,4.1e-05,2.4e-05,-3e-06,-2.7e-05,-1.1e-05,6.4e-05,0.000386,0.001696,-2.3e-05,0.000218,-0.000278,7e-04,-0.000229,-0.000224,0.000231,0.000243,-0.000443,-5e-04,-0.000534,0.000237,-0.000204,-0.000714,0.000149,-0.000247,0.000253,-2.3e-05,-3.6e-05,0.000609,0.000223,0.000445,0.000154,0.000269,-0.000293,-0.000191,-0.000354,8.1e-05,-0.000387,0.000135,-0.000339,0.000196,-7.2e-05,0.000133,0.00013,-4.1e-05,2.8e-05,-0.000113,0.000105,-1.6e-05,2e-05,6.2e-05,1.7e-05,-1.7e-05,-4.9e-05,1.8e-05,1.2e-05,-5.3e-05,-4.4e-05,1.6e-05,-5.1e-05,6.3e-05,-2.6e-05,-1e-05,-1.1e-05,-4.3e-05,-1.6e-05,-3.1e-05,7.2e-05,-5.7e-05,-8e-06,-1.5e-05,-7e-05,-2.4e-05,-3e-06,0,-8.5e-05,-6.3e-05,-3.7e-05,-5.3e-05,2e-06,-2.4e-05,2.4e-05,1.5e-05,-2.1e-05,-2.2e-05,-7e-06,1.3e-05,7e-06,-3e-05,4.9e-05,3e-06,-3e-06,-1.5e-05,1.1e-05,5e-06,-4e-06,-1.7e-05,1.3e-05,3.4e-05,-6e-06,3.7e-05,2.4e-05,3.6e-05,-1e-05,-1.4e-05,0
1.7e-05,0,-1e-06,-2e-06,-1.5e-05,-3e-06,-2e-06,2.2e-05,2.4e-05,1.6e-05,-2.5e-05,7.5e-05,2e-06,4.2e-05,1.1e-05,-5.2e-05,-6e-06,-1e-06,-5.1e-05,-4.1e-05,5.7e-05,8.9e-05,-0.00053,-0.00061,0.000567,-0.00013,-0.000439,-0.000165,-1.4e-05,0.000139,-0.000833,3.6e-05,0.00064,8.2e-05,0.000914,0.000521,9.3e-05,0.000522,8.5e-05,-0.000238,4.8e-05,-0.00013,-0.000173,-8.9e-05,-0.000258,-0.000497,-0.000392,-8.3e-05,0,-0.000241,0.000317,-0.000462,-3.1e-05,-0.000239,0.00015,8e-06,2.9e-05,-0.000152,-2.6e-05,0.00015,1.7e-05,0.000128,-6.9e-05,3e-05,-3.1e-05,-2.5e-05,-1e-05,-1.3e-05,9.4e-05,9.4e-05,1.1e-05,-1.9e-05,1.1e-05,-1.9e-05,2.5e-05,-4.9e-05,6.7e-05,4.3e-05,-6e-06,-6.3e-05,3.1e-05,7e-05,9.6e-05,1.4e-05,1.2e-05,2e-06,-7.5e-05,1.6e-05,-2e-06,4e-06,6.4e-05,-8.3e-05,0.000117,-4.1e-05,5.5e-05,1.1e-05,-7e-06,-2.9e-05,1e-06,-3e-06,3e-06,7e-06,-8e-06,-2e-06,3.7e-05,1.6e-05,-7e-06,1.3e-05,-5e-06,-1e-05,-3e-06,5e-06,-3e-06,1.9e-05,-1.1e-05,-2.7e-05,-7.4e-05,-1.9e-05,3e-06,1.7e-05,9e-06
-9e-06,0,1e-06,-1.6e-05,1.8e-05,-9e-06,-1e-05,2.4e-05,-4.9e-05,-2.2e-05,-2.1e-05,-5e-05,4.6e-05,-3e-05,-1.7e-05,9e-06,-3e-06,6.6e-05,3e-05,5e-05,-3e-05,3.3e-05,-0.000363,0.000148,-0.000459,0.000102,0.000817,-0.000447,0.000115,-0.000231,0.000611,-0.000105,-4.1e-05,1.7e-05,-0.000854,-0.000404,9.7e-05,-0.000101,0.000122,5.9e-05,5.7e-05,7.1e-05,4.7e-05,-0.000195,-0.00025,5e-06,0.000166,-8.2e-05,-7.1e-05,0.00014,0.000193,8.5e-05,7.7e-05,0.000261,2e-05,-1.3e-05,6.8e-05,1e-04,-1e-05,-7.5e-05,-1.5e-05,-4.8e-05,-2.7e-05,-6e-06,-2e-06,-2.5e-05,-4e-06,1.6e-05,-3.9e-05,-2.8e-05,-8e-06,3.5e-05,-7e-06,-1.7e-05,8.4e-05,-3e-05,-3.9e-05,-1.3e-05,0,-1.1e-05,6.9e-05,-8e-06,5.1e-05,-2.5e-05,-2.7e-05,6.1e-05,-5.6e-05,2e-06,-8e-06,1e-05,-4.2e-05,0.000105,-3.4e-05,-5e-05,1.7e-05,1.2e-05,1.5e-05,-3.2e-05,-1.3e-05,2.2e-05,-6e-06,1e-05,-2.4e-05,-5e-06,1.1e-05,-4e-06,3e-06,-1.4e-05,-1.9e-05,-2e-06,-1e-06,-1e-06,-7e-06,-1.2e-05,5e-06,4e-06,3.2e-05,3e-05,7e-06,-2.4e-05,-4e-06
-1e-06,1e-06,7e-06,-6e-06,-4e-06,7e-06,0,1e-05,2e-05,-2.1e-05,2.4e-05,3.1e-05,1e-06,7.7e-05,-2.4e-05,5e-06,-1e-05,-7.9e-05,2.1e-05,1.3e-05,-2e-06,0,0.000224,-0.000326,5e-06,0.000152,-0.000178,0.000323,4.2e-05,-0.000127,-0.000569,0.000162,-0.000277,0.000234,-5.8e-05,0.000235,6.5e-05,-0.000293,0.000187,-0.000164,-0.000216,0.000342,0.000132,-0.000245,6.8e-05,0.000118,7.6e-05,-8.8e-05,-0.000259,0.000137,-1e-05,1e-04,-0.000201,-0.000245,-6.2e-05,-0.000104,-8e-06,-0.000134,-4.7e-05,9.3e-05,-2e-05,-7.9e-05,8.3e-05,1.8e-05,1e-05,-2.5e-05,9e-06,1.8e-05,5e-06,-3.6e-05,-1.3e-05,6e-06,-7e-06,1.1e-05,9e-06,7.8e-05,-3e-06,2.4e-05,-7e-06,1.2e-05,-2e-05,5.4e-05,8.6e-05,6e-05,-7e-06,-3e-05,-7.4e-05,-1.7e-05,6e-06,3e-06,9e-06,-1.8e-05,-9e-05,5.6e-05,-4.6e-05,-4.8e-05,-1.8e-05,1.5e-05,9e-06,-9e-06,1e-06,1.3e-05,-1.1e-05,1.5e-05,1.1e-05,-2.1e-05,0,-3e-06,5e-06,3e-06,6e-06,-4e-06,1.2e-05,-7e-06,-7e-06,-1.7e-05,3.1e-05,-2e-05,1e-06,6e-06,3e-06
7e-06,1e-06,-9e-06,9e-06,0,-5e-06,5e-06,-9e-06,1e-05,-3e-06,-3e-06,2e-06,-4.4e-05,-3e-06,-1.4e-05,1e-05,1.1e-05,2.3e-05,-1.6e-05,-1e-05,-8e-06,9e-06,0.000304,0.000258,0.000272,9.7e-05,8e-06,-0.000131,-5.6e-05,-0.000276,0.000133,3.8e-05,0.000251,0.00023,0.000241,-0.000445,-7.7e-05,-5.8e-05,1.4e-05,5.6e-05,0.000194,-0.000257,3.4e-05,0.000291,-3.5e-05,-8e-05,-0.000183,8.4e-05,-4.1e-05,6.3e-05,-0.000209,-0.000276,0.000104,0.000137,9e-06,-1.9e-05,-9e-06,-4.4e-05,-2.5e-05,-4e-05,8e-06,8.4e-05,-6.2e-05,-5.4e-05,1.5e-05,-1.3e-05,1.5e-05,2e-06,-1.2e-05,1e-04,4e-06,9e-06,2.7e-05,-4e-06,-1.8e-05,-4.8e-05,2e-05,-4e-05,0,2.9e-05,1.5e-05,-5.2e-05,8.1e-05,-4.1e-05,-1.3e-05,-4.7e-05,1.4e-05,9e-06,-2e-06,-3e-06,9e-06,-6.3e-05,8e-05,6.9e-05,-1e-06,-1.4e-05,-7e-06,-1.7e-05,0,-2e-05,-1e-06,1.1e-05,8e-06,-1.5e-05,-4e-06,-5e-06,-1e-06,-8e-06,4e-06,-4e-06,-1e-06,-2e-06,-6e-06,1.1e-05,-2e-06,2e-06,1.8e-05,-3.4e-05,-2e-06,1.1e-05,-4e-06
2e-06,1e-06,1e-05,1.4e-05,-1e-06,1e-06,1e-06,-1.6e-05,-2.9e-05,3.1e-05,6e-06,-1.9e-05,5.5e-05,-5.8e-05,1.2e-05,-1e-06,3e-06,3.2e-05,-9e-06,-5e-06,-7e-06,-5.5e-05,-0.000293,-0.000242,-0.000139,7e-05,-0.000364,7.2e-05,-0.000135,-0.000344,7.7e-05,2.5e-05,-0.000424,0.000123,0.000118,0.000132,-6.2e-05,-0.000289,-2.4e-05,4.2e-05,-0.00017,-1.2e-05,-1e-04,5e-05,0.000231,0.000141,7.4e-05,-0.000121,0.000336,-7.5e-05,0.000115,0.000192,-3.3e-05,-8.9e-05,-2.8e-05,2.5e-05,1.7e-05,-6.9e-05,4.5e-05,4e-06,2e-05,-6.6e-05,2.8e-05,2e-05,-5e-06,1.4e-05,1.6e-05,-1.5e-05,-3.1e-05,-0.000122,1.3e-05,-1.4e-05,-3.2e-05,-1e-06,-3.8e-05,2.9e-05,7e-06,-3e-06,-1e-06,1.1e-05,-6.9e-05,1.2e-05,-2e-06,3.9e-05,-2.6e-05,4.5e-05,-1e-06,-1e-06,-3e-06,-3e-06,-2.2e-05,7.3e-05,3.5e-05,-7.4e-05,-8e-06,2e-06,-4e-06,-8e-06,5e-06,4e-06,-4e-06,6e-06,1e-05,-1.3e-05,-7e-06,-2e-06,0,-5e-06,2e-06,4e-06,-4e-06,0,4e-06,6e-06,6e-06,2e-05,-5e-06,5e-06,-7e-06,3e-06,6e-06
5e-06,0,-7e-06,3e-06,0,-2e-06,-2e-06,-1.1e-05,1.3e-05,-1.3e-05,3e-06,1.5e-05,5e-06,3e-05,1.4e-05,-1.3e-05,-3e-06,-2.2e-05,1.3e-05,-3e-06,1.6e-05,-2.1e-05,-0.000524,-0.000127,-1.7e-05,-7.7e-05,0.000373,0.000195,0.00013,-9e-05,-0.000337,0.000117,0.000513,-3.5e-05,-0.000106,0.000156,0.00013,0.000199,7.8e-05,4.2e-05,0.000164,7.7e-05,-9e-06,-0.000162,8.2e-05,-0.000172,-6e-06,0.000105,-6.9e-05,-0.000102,-9.5e-05,9.1e-05,4.4e-05,2.3e-05,3.4e-05,1.4e-05,1e-06,0.000138,-2.1e-05,-2.3e-05,-1e-06,1.8e-05,-4.1e-05,-2e-05,-1.9e-05,4e-06,1e-06,-2e-06,2.8e-05,5.4e-05,-3e-05,2.6e-05,2.1e-05,4e-06,-5e-06,-9e-06,2e-06,1e-05,-5e-06,-7e-06,-2.3e-05,-5e-05,2.7e-05,-2.9e-05,-1.5e-05,-3.6e-05,2.7e-05,-3e-06,-1.5e-05,-7e-06,1.2e-05,-1.2e-05,-8.1e-05,1.6e-05,1.5e-05,-1e-06,-7e-06,1.1e-05,5e-06,1.6e-05,6e-06,5e-06,1.5e-05,0,-2e-05,3e-06,-4e-06,1e-06,-1.3e-05,-7e-06,-6e-06,-6e-06,-4e-06,-8e-06,-3e-06,-1.1e-05,3.2e-05,-5e-06,-7e-06,0,-6e-06
-1.1e-05,-3e-06,2e-06,-1.2e-05,4e-06,-2e-06,4e-06,-4e-06,0,-3e-06,-2.1e-05,-3e-06,1.5e-05,-5.1e-05,0,1.4e-05,-8e-06,1.8e-05,8e-06,-2e-06,-1.4e-05,-7.8e-05,-9.9e-05,0.000234,0.000148,-1.3e-05,-0.000396,-0.000103,-3e-06,0.000363,0.000594,4.3e-05,-0.000428,-0.000147,6.1e-05,-5.3e-05,-6.2e-05,-0.000163,-5e-06,0.000148,-0.00015,-4.7e-05,8.4e-05,0.000183,-5.4e-05,4.2e-05,4.9e-05,-8.3e-05,8.5e-05,0.000185,6.6e-05,-0.00017,4e-05,2.5e-05,-0.000117,4.6e-05,1e-05,1.8e-05,-2e-06,-1.8e-05,3.5e-05,3.8e-05,4.2e-05,6e-06,7e-06,2.4e-05,-2.1e-05,1.1e-05,-9e-06,-1.6e-05,6e-06,-1.7e-05,-2.3e-05,-1e-06,2.6e-05,-1.9e-05,-2.9e-05,2e-05,2e-06,-5e-06,5e-05,6.3e-05,1.5e-05,3.3e-05,4e-06,2.8e-05,1.2e-05,7e-06,-2.2e-05,0,-6e-06,-4.9e-05,4e-06,2.8e-05,-6e-06,1.3e-05,1e-06,1e-06,-9e-06,-1e-05,-4e-06,-4e-06,1e-06,5e-06,-2.2e-05,-2e-06,1e-06,-5e-06,3e-06,3e-06,3e-06,2e-06,2e-06,-9e-06,-3e-06,-8e-06,-2.1e-05,2e-06,4e-06,0,2e-06
7e-06,4e-06,-1e-06,-7e-06,-8e-06,4e-06,4e-06,6e-06,-8e-06,-1.4e-05,7e-06,1.4e-05,8e-06,2.5e-05,-1.4e-05,-1e-05,5e-06,3e-06,-1.7e-05,3e-06,9e-06,-5.7e-05,0.000425,0.000166,-0.00019,-7.9e-05,0.000261,-2.7e-05,3.7e-05,0.000178,-0.000457,2.1e-05,0.000202,-0.000196,-0.000163,-7.5e-05,4.5e-05,0.000394,-6.6e-05,-3.4e-05,8.3e-05,-3.5e-05,9e-06,-0.000177,-0.000107,-0.000112,9.4e-05,2.3e-05,3.6e-05,-3.3e-05,8.4e-05,0.000223,-6.6e-05,-8.7e-05,4.3e-05,-6.4e-05,1e-06,1.7e-05,4e-06,3.3e-05,-9e-06,-3.2e-05,-3.1e-05,-1.1e-05,8e-06,-2e-06,-1.2e-05,7e-06,2.4e-05,4e-06,2.1e-05,-8e-06,1.9e-05,-6e-06,1.9e-05,1.5e-05,2.3e-05,-1e-05,1e-06,-1.2e-05,1e-06,-7e-05,-2e-05,-1.5e-05,4e-06,4e-06,4e-06,-6e-06,-2.2e-05,1e-06,5e-06,5.5e-05,5.8e-05,-8e-06,-1.4e-05,-2.6e-05,0,-1.4e-05,2e-06,-4e-06,0,-2e-06,-1.2e-05,-2e-06,-1e-05,-4e-06,0,5e-06,2e-06,-3e-06,0,0,-2e-06,7e-06,4e-06,-9e-06,6e-06,-1.5e-05,1e-06,-1.2e-05,0
-5e-06,-2e-06,-1e-06,9e-06,1e-06,-2e-06,2e-06,1.3e-05,5e-06,4e-06,1.1e-05,-1.7e-05,-2.7e-05,-7e-06,-1.6e-05,6e-06,2e-06,-1.4e-05,-1e-06,1e-05,-1e-06,-7.3e-05,0.000352,-0.000187,7.1e-05,0.000121,7e-05,4e-06,-0.000141,0.00026,0.000197,9.5e-05,-0.000131,-0.000104,-7e-06,-0.000142,-6.6e-05,-0.000364,-2.1e-05,3.4e-05,-4e-06,0.000133,-3.5e-05,4e-06,-4.2e-05,0.000154,-0.000113,2e-06,-5.4e-05,-0.000146,-0.000109,-0.000137,7.3e-05,5.6e-05,5.6e-05,-1.2e-05,9e-06,-7.5e-05,2.2e-05,-3.2e-05,-3.6e-05,3e-06,1.8e-05,1.6e-05,2e-06,-1.6e-05,1.5e-05,-6e-06,-1.4e-05,-1.1e-05,-1.2e-05,-1e-05,1e-06,0,1.8e-05,-1.8e-05,-2e-06,1e-06,0,-7e-06,3e-05,2.8e-05,9e-06,7e-06,-6e-06,-1.9e-05,-2.1e-05,-3e-06,-2.4e-05,6e-06,-5e-06,-1e-06,-2.9e-05,-1.5e-05,0,8e-06,3e-06,1.5e-05,-3e-06,6e-06,-3e-06,-9e-06,-1.3e-05,-4e-06,-9e-06,-7e-06,0,-3e-06,-2e-06,-1e-06,1e-06,-3e-06,1e-06,4e-06,-2e-06,8e-06,3e-06,1.1e-05,1e-06,5e-06,-2e-06
0,1e-06,-1e-06,6e-06,-2e-06,2e-06,2e-06,1e-05,3e-06,1.7e-05,-5e-06,1e-05,1.4e-05,3.5e-05,1.3e-05,-4e-06,2e-06,9e-06,1e-05,-4e-06,2e-06,-7.5e-05,-0.000162,-0.000283,4.1e-05,-3.9e-05,-0.000506,-7.6e-05,0.000112,-5.3e-05,-4.9e-05,0.000134,-2.7e-05,2.8e-05,0.000278,0.000221,-3.2e-05,0.000225,-3.7e-05,-6e-05,-4e-05,-8.1e-05,-1.7e-05,3.4e-05,-1.4e-05,-0.000107,8.1e-05,2.2e-05,4.7e-05,5.6e-05,-4.1e-05,-5e-05,-3e-06,-8.9e-05,9e-06,-1e-05,6e-06,2.1e-05,2.9e-05,4.2e-05,4e-06,1.3e-05,-3.9e-05,-1e-06,-6e-06,2.9e-05,1.6e-05,-7e-06,3e-06,8e-06,-7e-06,1e-05,-6e-06,4e-06,-1.3e-05,2.1e-05,0,-2e-05,-1e-06,6e-06,-2.8e-05,1.8e-05,-1.2e-05,1e-06,-4e-06,-1e-06,-3.4e-05,2e-06,-1.7e-05,2e-06,1.1e-05,-4.4e-05,-3.4e-05,-1.4e-05,0,8e-06,-1e-06,2e-06,-4e-06,-3e-06,1e-06,-7e-06,-3e-06,-8e-06,3e-06,4e-06,-1e-06,3e-06,-2e-06,0,0,1e-06,-3e-06,-5e-06,-2e-06,4e-06,8e-06,1.1e-05,1e-06,2e-06,3e-06
-6e-06,1e-06,4e-06,2e-06,4e-06,-4e-06,3e-06,1e-06,5e-06,-1.3e-05,2e-06,3e-06,-1.4e-05,-1.4e-05,2e-06,-4e-06,-7e-06,6e-06,-1e-06,2e-06,1e-06,-6.4e-05,-0.000319,0.000347,-0.000112,0.000104,0.00066,4.6e-05,-2e-05,-2.2e-05,8.9e-05,3.1e-05,6.6e-05,7.7e-05,-0.000148,3.4e-05,9.5e-05,-3.2e-05,-1.4e-05,-0.000117,9.3e-05,-5.2e-05,3e-06,0.000152,4.4e-05,0.000119,4.8e-05,2.7e-05,-0.000219,2e-06,4.5e-05,0.000106,-2.4e-05,1e-05,4e-06,1.9e-05,-5e-06,-5.8e-05,-2.7e-05,-3e-05,2.8e-05,-2.3e-05,4.9e-05,1.5e-05,-8e-06,-2.5e-05,-1e-06,3e-06,-1e-05,9e-06,6e-06,8e-06,-5e-06,-4e-06,-2e-05,-1.9e-05,-1.6e-05,1.2e-05,-1e-06,1.1e-05,-2.6e-05,-2.8e-05,-1e-05,-2.1e-05,-1.3e-05,0,-1.5e-05,2e-06,-1.3e-05,-1e-06,-1.6e-05,3.8e-05,4.2e-05,1.8e-05,1.1e-05,7e-06,-1e-06,-1.1e-05,2e-06,-6e-06,1e-06,-7e-06,7e-06,2e-06,6e-06,1e-06,0,-2e-06,-2e-06,-1e-06,0,0,6e-06,-4e-06,2e-06,4e-06,-3e-05,2e-06,-5e-06,0,-1e-06
1e-06,-1e-06,-6e-06,-7e-06,0,3e-06,0,-5e-06,-7e-06,2.8e-05,-5e-06,-1.2e-05,5e-06,2.6e-05,1.3e-05,1.2e-05,0,-8e-06,-8e-06,-8e-06,-1.1e-05,-6.3e-05,4.9e-05,-7.7e-05,7.6e-05,-0.000118,-2e-04,3.8e-05,4.7e-05,-9.3e-05,5.5e-05,3.2e-05,9.7e-05,0.00014,-4.9e-05,-0.000242,-1.9e-05,5e-06,5e-06,2.9e-05,-8.6e-05,9.4e-05,1.5e-05,-0.000184,8.3e-05,-0.000179,-7.5e-05,-2.7e-05,0.000152,-4e-06,-2.2e-05,-1.1e-05,4e-05,-4.2e-05,2.1e-05,4.3e-05,-6e-06,5e-06,-2.9e-05,3.8e-05,1.4e-05,1e-05,-3.2e-05,-5e-06,6e-06,5e-06,-1.6e-05,8e-06,-9e-06,-1.2e-05,6e-06,6e-06,-3e-06,-1e-06,-5e-06,8e-06,8e-06,7e-06,0,7e-06,7e-06,3.1e-05,-9e-06,2e-05,-7e-06,1.7e-05,-3.6e-05,2e-06,-9e-06,-1e-06,1.5e-05,4e-06,7e-06,-3e-06,3e-06,-2.6e-05,-7e-06,1e-06,-1e-06,3e-06,-1e-06,-6e-06,1.1e-05,3e-06,1.2e-05,2e-06,-1e-06,2e-06,4e-06,1e-06,2e-06,-3e-06,-7e-06,2e-06,0,-8e-06,1.2e-05,3e-06,1e-06,2e-06,0
1e-06,0,6e-06,-7e-06,-2e-06,1e-06,1e-06,-8e-06,4e-06,-4.8e-05,-4e-06,2e-05,3e-06,-2.4e-05,-1.8e-05,-7e-06,3e-06,2.5e-05,1e-06,0,8e-06,-5.7e-05,0.000354,0.000108,-2.2e-05,4.9e-05,-0.000283,3.6e-05,-0.000102,-9.9e-05,-0.000128,7.2e-05,-4.4e-05,0.000132,-3e-06,0.000145,-3.5e-05,0.000156,9e-06,-5.2e-05,0.000109,-2e-06,-3.6e-05,-1.4e-05,1e-06,0.000101,9.6e-05,4.5e-05,-0.000142,3.9e-05,2.1e-05,-2e-06,-2e-05,-3.5e-05,-2e-06,-3.4e-05,1.3e-05,1.8e-05,-3e-06,-3.1e-05,-1.8e-05,3.1e-05,6e-06,4e-06,5e-06,-1e-05,-8e-06,-1e-06,4e-06,-1.7e-05,1e-06,-2.1e-05,1.8e-05,4e-06,1.6e-05,6e-06,5e-06,5e-06,-1e-06,-6e-06,6e-06,-2.1e-05,-2.6e-05,-1.9e-05,1.2e-05,-7e-06,4e-06,-4e-06,-4e-06,-3e-06,-1e-05,-3.5e-05,-4.2e-05,-1.9e-05,-2e-06,4e-06,0,1e-06,2e-06,7e-06,0,-1e-06,4e-06,-5e-06,1.4e-05,-5e-06,0,3e-06,-1e-06,0,1e-06,2e-06,7e-06,3e-06,0,-1e-06,-8e-06,-1e-05,1e-06,-2e-06,1e-06
-3e-06,1e-06,-4e-06,4e-06,0,-1e-06,-1e-06,-8e-06,3e-06,3e-05,9e-06,-1.8e-05,-1.8e-05,-1e-05,3e-06,4e-06,2e-06,-2.7e-05,7e-06,6e-06,7e-06,-4.5e-05,0.000135,-0.000286,-4.6e-05,-7.8e-05,0.000179,-2.7e-05,5.5e-05,-4.4e-05,0.000117,5.6e-05,8.5e-05,2.3e-05,4e-06,-8.8e-05,-1.8e-05,-2e-05,-2.4e-05,2.4e-05,-8e-05,-7.2e-05,1e-06,0.00015,2.3e-05,-3.9e-05,-2.7e-05,-6.3e-05,0.000117,-8.3e-05,2.4e-05,2e-05,-8e-06,3.8e-05,-2.1e-05,-2.1e-05,0,4.5e-05,1.4e-05,2.2e-05,-6e-06,-3.4e-05,1.5e-05,-2e-06,1e-06,6e-06,9e-06,-8e-06,5e-06,3.1e-05,-3e-06,1.2e-05,-1.2e-05,0,2.3e-05,-8e-06,-5e-06,-8e-06,2e-06,-1e-05,2e-05,9e-06,-1.1e-05,2.4e-05,8e-06,1.1e-05,1e-06,-1e-06,-4e-06,-1e-06,1e-06,2.9e-05,1.7e-05,2.3e-05,-1e-06,1e-06,-4e-06,-1.1e-05,-1e-06,-7e-06,-1e-06,-1e-06,-4e-06,-1e-06,8e-06,-2e-06,0,1e-06,-4e-06,-1e-06,0,0,-5e-06,-2e-06,0,1e-06,-1e-05,1.2e-05,0,-4e-06,-2e-06
2e-06,-1e-06,2e-06,7e-06,-1e-06,1e-06,0,-1e-06,-9e-06,-8e-06,2e-06,2e-06,0,-5e-06,-7e-06,-6e-06,-1e-06,3e-06,-3e-06,3e-06,-5e-06,-3.6e-05,-0.000287,0.000192,4.5e-05,6.1e-05,0.000111,1.9e-05,0,-2e-06,-0.000241,-3e-06,-0.000139,-8.5e-05,2.9e-05,9.1e-05,4.3e-05,-4.5e-05,2.1e-05,6.5e-05,6.2e-05,4.9e-05,1.5e-05,-0.000119,-0.000121,7.4e-05,-1.9e-05,4.8e-05,3.4e-05,9e-06,-3e-05,-6.5e-05,-4e-06,-8.9e-05,-6e-06,-1.5e-05,0,3e-06,2.2e-05,-1.9e-05,0,1.8e-05,-2e-06,-2e-06,-7e-06,-1e-05,9e-06,0,4e-06,-3.6e-05,1e-06,-1e-06,1e-06,-1e-06,-2e-06,2e-06,-3e-06,-3e-06,-1e-06,-3e-06,-1e-06,-1e-05,-2e-05,-2.9e-05,-1.4e-05,-1.4e-05,1.5e-05,2e-06,-4e-06,-1e-06,1e-05,6e-06,2.9e-05,-3e-06,-1.2e-05,-1e-06,2e-06,-1e-06,1e-06,-6e-06,1e-06,4e-06,-1e-05,-5e-06,7e-06,-3e-06,0,6e-06,2e-06,0,-2e-06,-2e-06,4e-06,-3e-06,-1e-06,7e-06,-3e-06,-4e-06,0,2e-06,1e-06
-3e-06,0,0,1e-06,2e-06,-1e-06,-1e-06,6e-06,5e-06,9e-06,-2e-06,1.3e-05,-1e-05,-3e-06,1.1e-05,2e-06,-2e-06,1.5e-05,-5e-06,-5e-06,-5e-06,-2.5e-05,-0.000312,0.000104,-2.5e-05,-2.7e-05,-0.000167,-3.3e-05,3e-05,-0.000124,0.000215,7.6e-05,7.4e-05,-0.000146,7.2e-05,-6.8e-05,-2.8e-05,9e-05,4e-05,2e-06,-6.1e-05,3e-06,1.1e-05,8.2e-05,2e-06,-5.2e-05,2.9e-05,-6.1e-05,4e-06,5e-05,-1.7e-05,-1.8e-05,-2.4e-05,9.1e-05,1.3e-05,2.7e-05,0,-1.9e-05,4e-06,6e-06,2e-06,9e-06,-6e-06,-2e-06,-2e-06,9e-06,-3e-06,6e-06,3e-06,1.2e-05,5e-06,-2e-06,-1e-06,3e-06,-1.8e-05,-2e-06,-3e-06,-5e-06,0,4e-06,-1e-05,2.1e-05,-2.2e-05,1.8e-05,-4e-06,-7e-06,1.2e-05,-1e-06,-3e-06,2e-06,-1.7e-05,-3.1e-05,-3.1e-05,1.2e-05,1.5e-05,-2e-06,1e-06,0,1e-06,7e-06,-1e-06,4e-06,-6e-06,6e-06,-1e-06,3e-06,-1e-06,-1e-06,2e-06,-1e-06,1e-06,2e-06,-1e-06,2e-06,0,-1e-06,1.4e-05,-7e-06,0,-1e-06,0
5e-06,1e-06,-1e-06,-6e-06,-2e-06,1e-06,-1e-06,7e-06,-1e-06,-1e-06,-3e-06,-1.5e-05,1.4e-05,1.9e-05,-1e-06,3e-06,2e-06,-3e-06,4e-06,2e-06,1e-06,-1.1e-05,6.8e-05,-0.000281,-2.7e-05,3.1e-05,-4e-05,-5e-05,-6.5e-05,-7e-06,-0.000102,4.7e-05,-5.9e-05,-0.000133,-0.000109,1.1e-05,-6e-06,-3.1e-05,9e-06,7.4e-05,3.2e-05,-4e-05,1.5e-05,-5e-05,3e-06,3e-06,-6.7e-05,2.2e-05,5.1e-05,-2.5e-05,3.9e-05,3.7e-05,1.1e-05,-9.4e-05,-7e-06,1.4e-05,-2e-06,-6e-06,-1.9e-05,-6e-06,1.7e-05,-2e-05,3e-06,-1e-06,5e-06,2e-06,-7e-06,3e-06,-4e-06,8e-06,-3e-06,-7e-06,-2e-06,1e-06,-1.3e-05,-3e-06,1.3e-05,1e-05,0,7e-06,-1.7e-05,-2.6e-05,-6e-06,-9e-06,6e-06,2e-05,7e-06,2e-06,-3e-06,2e-06,1.9e-05,2.3e-05,-1.1e-05,-1.9e-05,-7e-06,-7e-06,-2e-06,-1e-05,-4e-06,1e-06,0,5e-06,2e-06,-3e-06,-6e-06,-1e-06,0,4e-06,-3e-06,0,-1e-06,-1e-06,-1e-06,2e-06,1e-06,-7e-06,-1.3e-05,-1e-06,-2e-06,1e-06,0
-3e-06,-1e-06,0,-4e-06,1e-06,0,-1e-06,5e-06,-2e-06,-1.2e-05,-4e-06,9e-06,1e-06,-1.2e-05,1e-06,-2e-06,0,-7e-06,3e-06,-1e-06,3e-06,-2e-06,0.000285,0.000205,3.9e-05,-3e-05,0.000367,7.6e-05,3.4e-05,8.7e-05,-3.6e-05,-5e-06,-1.5e-05,-4.6e-05,-1e-06,6.7e-05,3.5e-05,-0.000205,-2e-06,-1.5e-05,-7e-06,2.6e-05,-5e-06,3.3e-05,4.5e-05,-2.4e-05,2.5e-05,-2.5e-05,-3.4e-05,1.7e-05,-6e-06,1.9e-05,-2e-06,8.5e-05,-2.3e-05,-1.8e-05,4e-06,-2.2e-05,-1.1e-05,-2e-06,1.1e-05,1.5e-05,3e-06,-4e-06,1e-06,2e-06,0,-6e-06,-6e-06,-1.3e-05,-7e-06,1e-06,1e-05,-3e-06,5e-06,2e-06,-6e-06,1e-06,0,1e-06,2e-06,5e-06,-2e-05,1.1e-05,-4e-06,-1.1e-05,-4e-06,0,-5e-06,0,-1.6e-05,9e-06,3.5e-05,0,5e-06,2e-06,4e-06,-3e-06,1e-06,-6e-06,-1e-06,6e-06,7e-06,-2e-06,-8e-06,0,0,-2e-06,-1e-06,0,1e-06,-2e-06,3e-06,-1e-06,-1e-06,-1e-06,1e-05,-4e-06,0,2e-06,0
2e-06,0,2e-06,2e-06,0,1e-06,0,1e-06,2e-06,1.6e-05,4e-06,-4e-06,-1.2e-05,2.4e-05,-9e-06,3e-06,0,7e-06,-3e-06,-1e-06,-1e-06,8e-06,6.6e-05,-0.000188,-2.7e-05,-1.9e-05,-0.000507,-1.2e-05,1e-05,0.000103,0.000106,3.9e-05,6.4e-05,5.7e-05,3.4e-05,-8.9e-05,-3.9e-05,0.000121,1.3e-05,-4e-05,1e-06,3.1e-05,3e-06,-8e-05,3.7e-05,1.9e-05,6e-06,2e-06,2.8e-05,-3.1e-05,6e-06,1.9e-05,-1.7e-05,-5.7e-05,5e-06,6e-06,-2e-06,1.1e-05,-2e-06,9e-06,-1.1e-05,-4e-06,-4e-06,3e-06,0,-5e-06,4e-06,-4e-06,-2e-06,1e-05,3e-06,-4e-06,-7e-06,-1e-06,1.6e-05,-3e-06,-2e-06,-1e-06,0,-3e-06,1.6e-05,-4e-06,-1.2e-05,-5e-06,-2e-06,3e-06,-1.5e-05,-3e-06,-7e-06,0,9e-06,-2.8e-05,-7e-06,1e-05,-1.2e-05,1.2e-05,-7e-06,3e-06,-1e-06,1e-06,0,3e-06,7e-06,-3e-06,-1.2e-05,-5e-06,0,2e-06,1e-06,0,0,2e-06,-4e-06,-2e-06,-1e-06,2e-06,8e-06,1.1e-05,1e-06,-2e-06,0
-1e-06,-1e-06,-4e-06,6e-06,1e-06,-2e-06,0,-5e-06,-1e-06,-1.1e-05,4e-06,-4e-06,1.3e-05,-1.8e-05,3e-06,-4e-06,-2e-06,-2e-06,-2e-06,1e-06,1e-06,1.5e-05,-0.000227,0.000271,-4e-06,-3e-06,0.00032,-4e-06,7e-06,4.8e-05,-8e-05,6e-05,-6.7e-05,0.000106,1.3e-05,7.7e-05,7e-06,-9.7e-05,8e-06,-5e-06,1.2e-05,-5e-05,-2.2e-05,7.6e-05,7e-06,4.3e-05,-4.7e-05,4e-06,-9e-05,-1e-06,0,-1.5e-05,2.4e-05,4.6e-05,-2e-06,-2e-05,-2e-06,-1.6e-05,1.3e-05,-7e-06,-2.1e-05,-7e-06,3e-06,-2e-06,-5e-06,1e-05,-1e-06,3e-06,0,-1e-05,0,1.2e-05,1e-06,2e-06,1.1e-05,8e-06,-1e-06,-6e-06,-1e-06,-3e-06,5e-06,1.2e-05,-3e-06,-3e-06,5e-06,-1e-05,-1.4e-05,1e-06,-9e-06,-1e-06,0,1.7e-05,-3.2e-05,-1.3e-05,9e-06,-3e-06,3e-06,-9e-06,-2e-06,4e-06,0,4e-06,1e-06,0,-7e-06,0,0,-1e-06,1e-06,1e-06,0,-1e-06,4e-06,1e-06,0,4e-06,-7e-06,-6e-06,0,-1e-06,0
0,1e-06,4e-06,2e-06,0,0,0,-7e-06,3e-06,9e-06,-2e-06,7e-06,-7e-06,-5e-06,-3e-06,3e-06,1e-06,-3e-06,4e-06,2e-06,-2e-06,2.4e-05,-0.000152,-0.000223,3.3e-05,-5e-06,7e-05,5.6e-05,-3.4e-05,8.5e-05,4e-05,3.4e-05,8.8e-05,0.000106,2.2e-05,-0.000111,2.2e-05,7e-06,2e-06,-7.7e-05,-2.4e-05,1.1e-05,-1e-06,2.5e-05,-3.4e-05,-3e-05,4.6e-05,-5e-06,-5e-06,6.5e-05,-8e-06,1e-05,-2.8e-05,4e-06,0,6e-06,6e-06,4.6e-05,8e-06,1e-05,1e-05,7e-06,-1.1e-05,2e-06,-2e-06,-7e-06,-3e-06,6e-06,3e-06,1.4e-05,-3e-06,0,-3e-06,-2e-06,-3e-06,-8e-06,6e-06,1e-06,0,0,3e-06,-5e-06,-1.7e-05,7e-06,-2e-06,1e-06,-1.7e-05,0,-8e-06,0,-6e-06,1e-05,2e-05,4e-06,-1e-06,-1.3e-05,-4e-06,-3e-06,1e-06,-4e-06,-1e-06,0,-6e-06,2e-06,-5e-06,-1e-06,-1e-06,-1e-06,-2e-06,-1e-06,1e-06,-1e-06,-4e-06,2e-06,0,1e-06,1e-06,-2e-06,-1e-06,1e-06,-1e-06
1e-06,-1e-06,-3e-06,-5e-06,-1e-06,1e-06,0,-5e-06,-3e-06,-4e-06,-1e-06,-6e-06,3e-06,3e-06,8e-06,-1e-06,0,2e-06,1e-06,-2e-06,-2e-06,2.7e-05,0.000159,1e-05,-2.9e-05,3.2e-05,-0.000375,-7.7e-05,8e-06,-6.9e-05,-8e-06,4e-06,-4e-05,7.6e-05,-3e-05,3.1e-05,-1.4e-05,6.1e-05,-5e-06,6e-06,4.4e-05,3.1e-05,-1e-06,-9.8e-05,-5.9e-05,2.2e-05,-3.2e-05,-1e-06,-2.2e-05,-4.7e-05,-1.2e-05,-3.6e-05,7e-06,-4e-06,3e-06,1.2e-05,-4e-06,-1.4e-05,-7e-06,-1.5e-05,1.5e-05,-1e-06,2e-05,1e-06,3e-06,4e-06,1e-06,-3e-06,4e-06,-1.6e-05,4e-06,4e-06,4e-06,-1e-06,-1.6e-05,5e-06,0,2e-06,0,2e-06,-1.9e-05,1e-05,-5e-06,-1e-05,-6e-06,4e-06,-1.1e-05,0,-8e-06,-1e-06,8e-06,-2.6e-05,2.2e-05,2e-06,1e-06,1.1e-05,-1e-06,5e-06,1e-06,-3e-06,0,-1e-06,-8e-06,-3e-06,0,3e-06,0,1e-06,0,0,0,2e-06,3e-06,0,0,-4e-06,8e-06,3e-06,0,-1e-06,0
-3e-06,0,2e-06,-5e-06,1e-06,0,0,0,1e-06,-9e-06,-3e-06,-1e-06,1e-05,-6e-06,-5e-06,-1e-06,2e-06,3e-06,-4e-06,-1e-06,4e-06,3.5e-05,0.000221,0.000266,3e-06,-2.2e-05,0.000315,0,1.5e-05,-5.9e-05,-7e-06,6.2e-05,3.1e-05,-1.7e-05,-2.9e-05,0.000106,-9e-06,-4.1e-05,-1.3e-05,1.6e-05,-4.4e-05,-2.5e-05,0,7e-05,1e-05,-6.6e-05,-9e-06,2e-06,1.8e-05,-1.4e-05,1.8e-05,2e-05,7e-06,5.4e-05,1e-05,5e-06,-3e-06,2.3e-05,-7e-06,1.2e-05,-5e-06,0,-1.8e-05,0,2e-06,-7e-06,3e-06,-5e-06,2e-06,8e-06,-1e-06,-1.2e-05,0,1e-06,-1.1e-05,3e-06,-9e-06,6e-06,1e-06,1e-06,-8e-06,-3e-06,-5e-06,1.7e-05,-1e-06,1e-06,5e-06,1e-06,-8e-06,0,-8e-06,1.5e-05,-3e-05,1e-06,-3e-06,-1e-06,2e-06,-4e-06,-1e-06,5e-06,1e-06,-3e-06,-3e-06,-1e-06,5e-06,-2e-06,0,-4e-06,1e-06,0,0,-1e-06,-1e-06,-2e-06,0,-4e-06,-2e-06,1e-06,-1e-06,1e-06,0
2e-06,0,0,3e-06,-1e-06,0,0,4e-06,3e-06,1.4e-05,0,1e-06,-6e-06,1e-06,5e-06,3e-06,-1e-06,6e-06,0,1e-06,1e-06,3.5e-05,-5.2e-05,-0.000276,3.1e-05,2.5e-05,-4.3e-05,5.9e-05,3e-06,-2.3e-05,-2.6e-05,4.6e-05,-2.3e-05,-9.4e-05,-1.1e-05,-5.4e-05,6e-06,3.6e-05,-1.1e-05,1e-06,3.4e-05,-1.5e-05,9e-06,-3.4e-05,-7e-06,6e-05,3.8e-05,-5e-06,8e-06,3.4e-05,-1.2e-05,6e-06,-8e-06,-3.5e-05,6e-06,6e-06,2e-06,-3.7e-05,1e-06,-1.2e-05,-7e-06,-2e-06,7e-06,0,-1e-06,1e-05,-1e-06,0,-6e-06,8e-06,-1e-06,2e-06,-3e-06,1e-06,8e-06,-1.3e-05,3e-06,-4e-06,-1e-06,0,1.1e-05,-1.2e-05,-1e-05,-1.8e-05,0,8e-06,4e-06,-1e-06,-8e-06,1e-06,6e-06,1.2e-05,-8e-06,5e-06,0,-2e-06,-5e-06,-3e-06,0,1e-06,-1e-06,-5e-06,5e-06,-2e-06,7e-06,1e-06,0,1e-06,-1e-06,0,-1e-06,-1e-06,0,0,0,2e-06,-1.1e-05,3e-06,-1e-06,1e-06,0
