0.010349,0.009702,0.018965,0.232812,0.458311,0.360842,0.477336,1.020305,1.127109,0.819555,0.778959,0.860066,0.833908,0.809511,0.763834,0.619142,0.440405,0.265708,0.221735,0.197284,0.123026,0.119269,0.222858,0.218875,0.101517,0.061229,0.040195,0.032055
0.012903,0.012078,0.023505,0.270031,0.526851,0.42526,0.563947,1.179257,1.28254,0.904574,0.852036,0.968746,0.973124,0.942811,0.878227,0.722638,0.522404,0.311241,0.255366,0.227423,0.14385,0.143506,0.264798,0.255766,0.116737,0.070546,0.046622,0.037164
0.017903,0.016746,0.031149,0.313448,0.607781,0.52175,0.716696,1.445325,1.514469,1.010886,0.955186,1.141326,1.203414,1.148291,1.035262,0.872401,0.650186,0.378837,0.299384,0.267778,0.174041,0.181118,0.326411,0.306843,0.1353,0.082013,0.055014,0.043881
0.024103,0.022527,0.037124,0.318642,0.627078,0.582559,0.855111,1.678011,1.693781,1.093985,1.069726,1.311031,1.390324,1.276085,1.090418,0.929598,0.721432,0.413839,0.308969,0.27832,0.188737,0.204251,0.352414,0.321048,0.135783,0.083339,0.056946,0.045147
0.033318,0.03023,0.041486,0.309247,0.639053,0.627035,0.964801,1.888687,1.918083,1.306477,1.29793,1.503982,1.528754,1.35859,1.073781,0.868253,0.702086,0.415746,0.297887,0.265487,0.188447,0.211048,0.340789,0.300251,0.124764,0.082146,0.060041,0.047476
0.048262,0.041802,0.046491,0.30199,0.665186,0.672432,1.044557,2.093871,2.211688,1.621824,1.612365,1.752563,1.735686,1.530396,1.075745,0.756712,0.617796,0.388378,0.295686,0.253123,0.179359,0.21318,0.334767,0.289905,0.126393,0.093683,0.076586,0.062231
0.070245,0.059509,0.057694,0.320315,0.732344,0.771127,1.258441,2.534877,2.731416,2.148006,2.1721,2.294559,2.411803,2.215695,1.362388,0.790648,0.619533,0.39159,0.342434,0.280619,0.179532,0.225843,0.360523,0.318343,0.156268,0.124618,0.108712,0.090183
0.095164,0.081091,0.076724,0.383348,0.889906,1.001299,1.742497,3.379659,3.811333,3.429553,3.559799,3.73134,4.121937,3.885598,2.292506,1.257407,0.961107,0.54528,0.444464,0.350047,0.206205,0.271509,0.449626,0.404353,0.209491,0.168058,0.148008,0.124016
0.112897,0.099132,0.097753,0.475782,1.10661,1.308222,2.489376,4.93666,6.064611,6.026066,6.189164,6.283466,6.870842,6.596677,3.986781,2.186338,1.621693,0.826258,0.57832,0.443441,0.242699,0.322887,0.565311,0.517748,0.265733,0.206364,0.181556,0.153478
0.11874,0.107828,0.110217,0.561255,1.301893,1.563335,3.298214,7.062123,9.52393,10.029416,10.069316,9.746891,10.160407,9.854088,6.229066,3.482855,2.501485,1.176658,0.742557,0.559598,0.273314,0.353085,0.64449,0.599619,0.303545,0.228021,0.197575,0.166635
0.114114,0.10438,0.10762,0.586204,1.356142,1.651274,3.900202,9.053904,13.276684,14.671153,14.459332,13.237304,12.785946,12.414729,8.326752,4.81273,3.340547,1.499851,0.962203,0.719014,0.307706,0.358651,0.644321,0.603616,0.303688,0.227689,0.192145,0.157397
0.094166,0.086858,0.093515,0.534028,1.225565,1.52576,4.135934,10.219418,15.698968,17.86227,17.334943,14.936725,13.129304,12.72775,9.183326,5.483027,3.654836,1.622179,1.140137,0.84924,0.329467,0.327047,0.545631,0.521922,0.277373,0.20561,0.165584,0.13242
0.064832,0.063543,0.076225,0.476748,1.103286,1.39675,3.95432,9.833584,14.986453,17.139426,16.469793,13.522751,10.855549,10.303933,7.959069,4.859319,3.096802,1.441163,1.134919,0.824895,0.30558,0.266552,0.402841,0.404194,0.241282,0.168981,0.128878,0.105217
0.042248,0.044623,0.061836,0.516607,1.195141,1.355076,3.221322,7.661927,11.11614,12.419501,11.789785,9.531445,7.497408,6.70809,5.141366,3.13294,1.946226,1.050046,0.913423,0.63673,0.259829,0.215645,0.280548,0.290235,0.18955,0.128722,0.096253,0.078015
0.031595,0.035065,0.060299,0.740909,1.6444,1.485609,2.408421,5.298563,6.89017,6.901846,6.279402,5.315108,4.505297,3.570036,2.395277,1.456901,0.962142,0.689109,0.65619,0.45121,0.247993,0.196186,0.188905,0.191657,0.135998,0.097652,0.073044,0.058959
0.030294,0.033286,0.068414,1.173275,2.50011,1.907469,1.957512,4.061085,4.630349,3.790085,3.313364,3.07804,2.759313,1.916497,1.104296,0.695244,0.562651,0.560433,0.600695,0.446366,0.296352,0.217801,0.168001,0.162367,0.122496,0.101421,0.075964,0.059351
0.034321,0.035514,0.082769,1.766074,3.703603,2.608818,1.896523,3.914586,4.298711,3.030799,2.68145,2.79133,2.43896,1.493691,0.851104,0.619225,0.551132,0.562769,0.605127,0.483906,0.359424,0.255804,0.187822,0.180747,0.142317,0.128184,0.099573,0.074402
0.040724,0.040037,0.095465,2.353993,4.952239,3.398957,2.183709,4.725009,5.307018,3.420037,3.048187,3.446778,2.826245,1.67292,1.044201,0.773016,0.670962,0.633849,0.638631,0.536702,0.413365,0.28191,0.205861,0.195938,0.161573,0.15444,0.124385,0.090529
0.046312,0.044557,0.101325,2.646752,5.631495,3.922646,2.463472,5.571043,6.619083,4.297161,3.779416,4.478734,3.63446,2.136751,1.39767,0.958987,0.812395,0.731828,0.688083,0.611892,0.446247,0.276844,0.198036,0.186067,0.166117,0.161315,0.132665,0.096917
0.051256,0.049414,0.102195,2.430484,5.285937,3.884071,2.537592,5.826471,7.380078,5.032309,4.455776,5.329248,4.240413,2.606805,1.802681,1.083372,0.884377,0.80316,0.710568,0.639633,0.428444,0.243059,0.165039,0.156355,0.154974,0.143271,0.12117,0.095681
0.055173,0.056949,0.096802,1.782458,4.024196,3.297659,2.560979,5.755046,7.455469,5.277422,4.810566,5.507695,4.344092,3.073287,2.199969,1.174061,0.913645,0.835157,0.664369,0.568659,0.367496,0.205866,0.128816,0.128471,0.134784,0.109422,0.096249,0.089477
0.056249,0.064312,0.090601,1.061177,2.463516,2.360608,2.529756,5.672196,7.115139,5.059228,4.68984,4.916186,4.047988,3.370207,2.308201,1.186323,0.922285,0.833489,0.607084,0.458295,0.292046,0.168419,0.094184,0.102048,0.107586,0.078506,0.07159,0.078611
0.055215,0.066263,0.086047,0.580959,1.350091,1.516452,2.304753,5.117655,6.159997,4.553084,4.382352,4.322135,3.764729,3.250042,1.960027,1.011299,0.795577,0.721222,0.561373,0.394022,0.239358,0.136663,0.075213,0.089168,0.089383,0.060942,0.054338,0.065857
0.053642,0.061752,0.079717,0.409259,0.887695,1.014644,2.033611,4.628292,5.253687,3.781273,3.722933,3.815723,3.435206,2.692462,1.442572,0.810519,0.607337,0.554792,0.520144,0.361342,0.19908,0.109639,0.069092,0.088772,0.086844,0.059915,0.049322,0.059602
0.047716,0.050207,0.069522,0.293429,0.594819,0.756975,1.983177,4.430754,4.761021,3.090226,2.703998,3.094547,2.983346,2.12461,1.205055,0.796931,0.535912,0.463639,0.49826,0.354852,0.169942,0.089743,0.062931,0.081887,0.083777,0.06249,0.046768,0.052244
0.043482,0.042713,0.058361,0.232085,0.465807,0.726436,2.107076,4.326147,4.622922,2.865389,1.883751,2.251887,2.394755,1.805701,1.181652,0.806898,0.563134,0.476887,0.505983,0.364093,0.163477,0.086763,0.060743,0.070613,0.070909,0.058536,0.043731,0.04419
0.049326,0.04834,0.054936,0.245026,0.49848,0.782105,2.240288,4.008817,4.053859,2.684321,1.729985,1.881213,1.932531,1.627501,1.186314,0.752092,0.544305,0.521999,0.534662,0.359891,0.155245,0.087299,0.070845,0.071839,0.059906,0.051226,0.041126,0.041742
0.063987,0.06611,0.065534,0.297901,0.590213,0.794233,2.070521,3.20354,2.993146,2.364789,1.799988,1.698583,1.608891,1.531445,1.200666,0.698498,0.508952,0.541206,0.535806,0.319879,0.127602,0.079358,0.08266,0.077273,0.050925,0.044309,0.044295,0.049377
0.087163,0.091511,0.079738,0.325709,0.628386,0.761844,1.775386,2.571063,2.286618,1.975192,1.675797,1.489626,1.371939,1.411888,1.185901,0.715703,0.495518,0.513559,0.547806,0.329139,0.122417,0.073215,0.08985,0.081854,0.052955,0.04735,0.052382,0.062186
0.107872,0.111788,0.088986,0.30894,0.58444,0.709863,1.560428,2.408252,2.163379,1.625685,1.450462,1.430121,1.248104,1.19882,1.088386,0.72353,0.448082,0.474508,0.636781,0.429626,0.155508,0.086766,0.093307,0.084385,0.06355,0.056613,0.06352,0.073136
0.114258,0.113046,0.08924,0.267541,0.514993,0.719006,1.678891,2.743742,2.311916,1.369022,1.290605,1.364937,1.088264,0.955197,0.897207,0.632989,0.382635,0.479024,0.732377,0.514199,0.186781,0.113219,0.112075,0.097956,0.080265,0.072454,0.078897,0.08023
0.10477,0.095829,0.082514,0.230821,0.464734,0.713292,1.816372,3.022281,2.361326,1.194474,1.14709,1.238564,0.949213,0.783975,0.726089,0.495969,0.305098,0.474121,0.733151,0.508038,0.191129,0.130647,0.132934,0.111717,0.08992,0.084671,0.088243,0.082095
0.089495,0.077716,0.070374,0.200651,0.434585,0.693749,1.85597,2.869311,2.030039,1.011212,0.970913,1.027449,0.777229,0.664898,0.588298,0.386088,0.267907,0.430173,0.607513,0.419609,0.178971,0.127352,0.131671,0.104492,0.081523,0.082077,0.08225,0.074831
0.075169,0.061787,0.063112,0.175333,0.35372,0.578712,1.655829,2.312313,1.503023,0.801177,0.851518,0.950678,0.727355,0.62816,0.506799,0.306923,0.255707,0.414942,0.494962,0.317974,0.160933,0.11211,0.106447,0.080385,0.062578,0.070848,0.071031,0.06799
0.077066,0.060336,0.067367,0.157004,0.258524,0.440775,1.284389,1.81256,1.328737,0.731004,0.758909,0.858731,0.672024,0.589456,0.47791,0.310345,0.266649,0.437921,0.513838,0.319163,0.151318,0.086859,0.07307,0.058912,0.054377,0.077237,0.081051,0.071845
0.08222,0.066398,0.067276,0.154294,0.23632,0.360554,1.028602,1.681618,1.369165,0.68531,0.583773,0.709123,0.666254,0.587,0.462078,0.331051,0.283473,0.441236,0.542457,0.375988,0.164063,0.069323,0.061897,0.056023,0.060291,0.092275,0.099058,0.085663
0.080115,0.069601,0.058562,0.15382,0.262775,0.361274,0.964046,1.64256,1.435257,0.729767,0.44895,0.537987,0.663417,0.620049,0.423186,0.301542,0.291375,0.501326,0.619977,0.439868,0.183754,0.075623,0.074751,0.069884,0.069924,0.095729,0.104173,0.092648
0.073933,0.071132,0.051127,0.153438,0.285046,0.369254,0.872304,1.367131,1.307214,0.813582,0.396003,0.372907,0.56701,0.57993,0.333846,0.223181,0.278624,0.589901,0.722647,0.462712,0.188813,0.087556,0.095551,0.0989,0.07924,0.080291,0.089868,0.087371
0.080209,0.088145,0.056831,0.146546,0.281322,0.331915,0.675073,0.914221,0.989493,0.851525,0.426639,0.288417,0.407101,0.475284,0.272021,0.176746,0.272939,0.629402,0.752671,0.414334,0.174385,0.093465,0.110841,0.128442,0.082225,0.055404,0.065554,0.08547
0.090156,0.10604,0.07294,0.154206,0.276954,0.333155,0.529317,0.553148,0.645997,0.79064,0.440056,0.253107,0.300879,0.373222,0.280068,0.181452,0.257144,0.601664,0.694144,0.330052,0.158641,0.08691,0.111497,0.145108,0.08494,0.045894,0.051811,0.08551
