-0.00735,-0.001527,-0.002727,-0.005732,-0.00226,0.000846,-0.002615,-0.005035,-0.006123,-0.001844,-0.004979,-0.007508,-0.001957,0.001086,-0.003026,-0.003616,-0.003225,-0.003127,-0.002994,-0.011312,-0.008072,-0.006039,-0.006166,-0.007795,-0.012163,-0.010353,-0.008133,-0.006261,-0.004215,-0.005426,-0.005591,-0.010777,-0.011027,-0.006388,-0.004635,-0.009337,-0.004357,-0.005709,-0.006805,-0.007919,-0.007092,-0.006705,-0.002557,-0.005279,-0.006209,-0.006431,-0.006728,-0.002852,-0.00615,-0.004784,-0.003414,-0.002579,-0.001351,-0.00634,-0.003753,-0.002153,-0.001229,-0.005465,-0.002998,-0.002222,-0.005905,-0.005308,-0.003075,-0.006304,-0.006205,-0.005824,-0.001918,-0.001163,-0.000996,-0.005031,-0.002023,-0.00669,-0.00871,-0.005992,-0.004598,0.000189,-0.002685,-0.009409,-0.007294,-0.005941,-0.00465,-0.004468,-0.006192,-0.004765,-0.002543,-0.004792,-0.005834,-0.005816,-0.005047,-0.003692,-0.005607,-0.006225,-0.008307,-0.005539,-0.006483,-0.003742,-0.002238,-0.006663,-0.004314,-0.007264,-0.008615,-0.008602,-0.007077,-0.005914,-0.005002,-0.000931,-0.004099,-0.00113,-0.003903,-0.001201,-0.004421,-0.005935,-0.004591,-0.002997,-0.002331,-0.002708,-0.005371,-0.001845,-0.003105,-0.003386,-0.002863
-0.002466,-0.000335,-0.005366,-0.003215,-0.001181,-0.003242,-0.007637,-0.0068,-0.002589,-0.007684,0.000338,-0.00396,-0.010706,-0.010054,-0.001269,0.000926,0.002096,-0.004592,0.00042,0.007568,0.004067,0.002066,-0.004136,0.002245,0.007966,0.004305,0.002485,-0.001999,-0.003083,-0.005366,-0.000647,0.003176,0.004088,0.000416,-0.00427,-0.001184,-0.005896,-0.00302,0.001156,0.003112,-0.000425,0.001319,-0.001926,-0.001765,0.001957,0.002373,0.000838,0.000509,-0.001109,0.001972,-0.000898,-0.001371,-0.000806,-0.003159,0.000307,-0.001373,-0.001507,-0.000622,-0.001286,-0.002024,-0.000421,0.000316,0.001972,0.000253,0.002042,0.000539,-0.003046,-0.002615,-0.001906,0.000342,0.0011,0.00456,0.005048,-0.000487,-0.003413,-0.00369,0.002125,0.000425,0.000438,0.001517,0.001336,5e-06,0.000663,-0.001005,2.9e-05,0.000493,7.2e-05,0.000565,0.001184,-0.002895,0.000912,0.000721,-0.000992,0.001286,0.003528,0.001398,-0.003614,0.00065,0.000695,0.001829,0.002433,0.003834,0.002726,0.001522,-0.001042,-0.003357,-0.002565,-0.002564,-0.000748,-0.000936,-0.001117,-0.001013,-0.002268,-0.00228,-0.002842,-0.003056,9.8e-05,-0.00392,-0.002827,0.000151,6.7e-05
-0.001503,-0.004824,-0.000994,-0.001876,-0.004782,-0.002965,-0.00191,0.00073,-0.006975,-0.003147,-0.007502,-0.007379,-0.004139,-0.002651,-0.005983,-0.005845,-0.005242,-0.006394,-0.006828,-0.006747,-0.005443,-0.00318,0.000302,-0.002587,-0.006248,-0.001221,-0.000382,-0.00122,-0.002296,-0.001618,-0.004053,-0.004946,-0.004549,-0.010461,-0.005409,-0.001857,-0.001687,-0.00244,-0.002955,-0.005213,-0.001366,-0.001457,-0.002394,0.000797,-0.002779,-0.002794,-0.003211,-0.001859,-0.001512,-0.003541,-0.002764,-0.00192,-0.000547,-3.6e-05,-0.002824,-0.000182,-0.002574,0.000455,0.000587,-0.000357,0.001749,-0.002217,-0.003586,-0.00221,-0.001846,-0.001004,-0.002232,-0.001104,-0.000469,-0.001251,0.000204,-0.005503,-0.004249,-0.003429,-0.004734,-0.001953,-0.004025,-0.005761,-0.003628,-0.00213,-0.001528,-0.001739,-0.001585,0.000872,0.000301,-0.001749,0.000112,-0.000326,-0.000637,-0.001691,-0.003107,-0.004484,-0.000891,-0.002561,-0.002816,-0.001336,0.000415,-0.003587,0.000257,-0.004306,-0.000995,-0.000655,-0.001453,-0.000895,-0.000186,-0.000943,0.000265,-0.00304,-0.004938,-0.002145,-0.001621,-0.004285,-0.001676,0.000805,-0.000843,0.001551,-0.001121,-0.000595,0.000405,-0.002395,-0.004659
0.004121,0.003491,0.003185,0.005116,0.006734,0.006389,0.005153,0.002963,0.008587,0.006064,0.005943,0.00785,0.005266,0.00447,0.005432,0.001779,-0.000304,0.004603,0.003088,0.002448,0.003691,-0.000294,0.001168,-0.001133,0.003405,0.000248,0.00136,0.003277,0.002838,0.006085,0.002758,0.002355,0.0026,0.00942,0.008052,0.002972,0.000605,0.005431,0.000338,0.002973,0.002977,0.000768,0.001211,0.000775,0.002102,0.001237,0.001971,0.001978,0.001674,0.002054,0.004327,0.002013,0.000212,0.001626,0.002086,0.000103,0.000768,-0.000727,-0.000792,0.001162,-0.001517,0.002429,-0.000212,0.002443,-9e-05,0.001494,0.002151,0.000355,0.000915,0.001853,-0.000424,0.003353,-1e-05,0.004192,0.003932,0.001874,0.001126,0.006303,0.003682,8.1e-05,0.001756,0.001841,0.000281,-0.000798,-0.001287,0.000798,-0.000205,-0.002172,0.000679,0.000839,0.000288,0.002938,0.002006,0.000728,0.000525,-0.000168,0.001471,0.004838,0.000892,0.003652,-8e-06,0.000794,0.000325,0.001081,-0.001337,0.000743,0.00058,0.000914,0.002059,0.000183,0.001453,0.003864,0.00222,0.002188,0.000497,0.002303,0.000384,0.000567,0.001623,0.001922,0.002163
-5.9e-05,3e-06,-0.000722,-0.001289,-0.002332,-0.004479,-0.001708,-0.000746,-0.002282,-0.001165,0.00108,-0.000626,6.5e-05,0.002608,0.002289,0.001893,-0.000975,-0.000302,0.001935,0.000498,-0.00286,0.003325,-0.000692,0.001035,-0.002854,-0.001471,-0.004664,-2.7e-05,-0.001662,-0.003303,-0.000405,-0.00303,-0.001645,-0.005745,-0.001471,-0.001665,0.001276,-0.002532,0.000634,-0.000519,-0.000845,-0.000636,0.000334,-0.001254,-0.001102,-0.00036,-0.003339,-0.002828,-0.00341,-0.002582,-0.002859,1e-05,0.001199,-0.000352,-4e-04,-0.000258,0.000271,-0.000107,0.001791,-0.001015,7.9e-05,-0.001513,0.001586,-0.00178,-0.000783,-0.00208,-0.001653,-0.003242,-0.000223,-0.001993,-0.001267,-0.001523,-0.000465,-0.003425,2.5e-05,0.000378,-0.00026,-0.001969,-0.001358,-0.000418,-0.000994,-0.000643,-0.001245,-0.000555,0.001442,-5.3e-05,-6.3e-05,-0.000881,-0.002184,0.000352,0.000994,-0.001694,-0.000735,-0.001133,-0.000434,0.000829,0.002606,2.1e-05,0.000311,-0.001016,-0.001026,-0.003562,0.000921,0.001282,-0.000922,-0.000287,0.000726,0.000868,0.000854,-6e-04,-0.001033,-0.002248,-0.002246,-0.003627,0.000122,-0.001913,-0.001028,-0.001564,-0.000606,-0.001036,-0.000874
-0.003324,-0.002123,-0.001769,-0.001645,-0.000264,-0.000769,-0.000705,-0.00185,-0.000794,-0.00161,-0.0035,0.000351,-0.001514,-0.004244,-0.003302,0.001621,0.003493,0.001167,0.000483,0.001491,0.000956,-0.001024,-0.000128,0.001863,0.001239,0.004001,0.003128,-0.000491,-0.003239,0.000514,0.003276,0.004225,0.001723,0.001859,-0.002089,-0.000305,-0.001197,-4.9e-05,-0.00273,-6e-05,-0.001079,0.00015,7.7e-05,-0.000818,-0.000265,-0.000883,0.001481,0.001493,0.000743,0.002435,0.000764,-0.001356,-0.001348,-0.000265,-0.000154,-0.000614,0.00045,-0.000472,-0.002522,-0.000352,0.000515,8.9e-05,-0.001979,0.001164,-0.000213,0.000915,0.002174,0.001841,-0.001372,-0.000184,-0.000758,-0.000739,0.001314,0.002637,-0.000668,-0.000658,0.000945,0.000724,0.001062,-0.00034,8.5e-05,-8e-06,0.000989,0.002226,-0.000856,-0.000199,-0.001624,0.000933,0.000517,0.000423,-0.000111,0.001404,-0.001878,0.001609,0.000946,0.00144,-0.000564,-0.002157,-0.001426,0.000249,0.001403,0.002487,0.000566,-0.001149,-0.000466,0.001341,-0.000648,-0.00036,0.000283,0.001749,-0.000215,0.000767,0.003457,0.000956,-0.000754,-0.000109,0.001302,0.000262,-0.001643,0.000987,0.002173
0.001613,0.001124,0.001319,0.001928,0.001145,0.001157,-0.000577,0.000146,-2.3e-05,-0.000168,-0.000584,-0.001443,-0.001174,0.000549,-0.000307,-0.002474,-0.002273,-0.000404,-0.002671,-0.001704,-0.001167,0.001123,0.000148,8.5e-05,0.001126,-0.004538,-0.003185,0.002044,0.002808,0.001558,-0.002822,-0.000103,-0.000608,0.00045,0.000721,0.002902,0.000996,2e-05,0.00166,0.000298,0.001094,-0.000541,0.001327,0.000967,7.5e-05,0.002526,0.001192,6.2e-05,0.00056,-0.001109,-0.000996,0.001163,0.000264,-3.8e-05,0.000715,0.00106,-0.000396,0.00051,0.000534,0.000236,0.000507,0.001564,0.000574,-0.000863,0.00037,0.000758,-0.001077,0.001174,0.000165,7.6e-05,0.001081,0.001332,-0.000624,-0.002556,0.000558,-0.001417,-0.000342,-0.000884,-0.001017,-0.000376,0.000566,0.00058,0.000175,-0.001148,-0.000678,-0.001746,0.000142,-0.001707,-0.000244,-0.000673,0.000496,-0.000656,0.001067,-0.000267,-0.000278,0.000246,-0.000854,0.000814,3.5e-05,0.000658,-0.002157,-0.001537,-0.000391,4.6e-05,0,-0.001042,-0.001453,-0.000186,-0.001386,-0.000123,0.000376,-0.000361,-0.001353,0.001067,0.001283,0.000475,-0.001088,-9.2e-05,-0.00021,-0.002565,-0.001703
0.001444,0.001218,0.000111,0.000913,0.000792,0.000277,0.001266,0.002302,0.002554,0.002266,0.00304,0.000734,0.001918,0.001841,0.002986,0.00111,-0.000551,-0.001617,-0.00046,-0.000281,0.00081,-0.000781,-0.000489,-0.002255,-3e-04,0.001903,-0.000324,-0.002023,-0.000315,-0.000432,-0.000606,-0.000503,-0.001413,0.000225,0.00089,-0.001119,0.000338,0.000445,-0.00019,-0.001559,-0.000437,0.000408,-6.8e-05,0.001572,0.000739,-0.001478,-0.000457,0.001212,2.2e-05,0.001053,0.000196,0.000427,0.00039,-0.00042,-0.00053,-0.000483,0.001205,0.000647,0.00093,4.8e-05,-0.001547,-0.002092,0.000482,0.000332,0.000558,-0.000412,-0.001137,0.00035,-0.000261,0.000366,-0.000484,0.000121,-0.000915,0.000744,-0.000988,0.000544,-0.000779,-0.000843,-0.000291,0.00049,-0.000213,-0.000145,0.000898,0.001186,0.001292,0.001543,0.001162,0.001092,-0.000472,0.000307,0.000306,-0.00073,-9.6e-05,-0.000353,-0.000911,0.000389,-0.000214,0.000264,0.000101,4.7e-05,0.000914,-0.000798,-1.9e-05,-2.9e-05,0.000644,0.000687,0.000122,0.000782,-0.000631,-0.000776,-0.000985,0.001349,-0.000875,-0.000545,0.000404,0.000358,-4.7e-05,-0.00018,0.000395,0.00039,0.000697
-0.001423,-0.001409,0.000906,-0.001212,-0.000943,-0.000384,-0.002087,-0.001479,-0.00145,-0.000349,-0.000143,0.001393,0.001255,0.000459,-0.000377,0.001382,-0.000279,0,0.000977,0.000307,-0.000425,0.001314,-0.001227,0.00159,-0.000361,-0.001712,0.000316,0.000487,0.000106,-0.000166,0.001571,0.00025,0.0018,-0.000619,0.000315,-0.001374,-0.000935,7e-04,-0.000501,0.00014,0.000548,0.000265,0.000488,-0.001161,-0.000441,0.00044,0.000254,-0.000539,-0.000192,3e-06,0.000586,-0.000617,6.1e-05,0.000896,0.000569,0.000772,-0.000729,-0.000179,0.000147,-0.000579,0.000901,0.000988,0.000949,0.000234,0.001047,-4.9e-05,0.000147,-0.00135,9.2e-05,-0.000305,0.000247,0.000782,0.000963,0.001521,0.00122,0.002726,0.000418,0.000924,0.000315,0.001316,0.000161,-0.000323,-0.001414,-0.000167,0.000104,-0.000714,-0.00086,-0.000122,0.000746,-0.000583,-0.001486,0.000194,0.000956,0.000895,-0.000576,-6.2e-05,-0.000119,0.000771,-0.000117,-0.000165,-3e-06,0.000283,-0.000304,-0.000382,-0.001205,-0.001118,0.001589,0.000254,0.00099,-0.001758,-0.000638,-0.000473,0.000543,-0.000244,-0.00089,5.3e-05,0.001431,0.001108,5.1e-05,0.000277,0.000371
0.000707,-0.000127,-0.000963,-6.7e-05,-0.001119,-0.000918,0.000792,-0.000365,-0.000283,-0.000662,-0.001983,-0.001924,-0.001245,-0.000289,-0.001102,-0.001221,0.000925,0.002218,0.000519,-0.000186,0.000796,-0.001737,0.000742,-0.001474,-0.000336,0.000577,0.000701,-4e-04,-0.001686,-0.00029,7.7e-05,-0.001271,-0.000383,0.000457,8.3e-05,0.001097,0.00034,-0.001119,0.000676,0.000653,-0.00036,-0.000891,-0.000204,0.000651,-0.000347,-0.000572,-0.000378,0.000596,0.000175,-0.001346,-0.000298,-0.000749,-0.000172,-0.000948,0.00028,-0.001593,-7.6e-05,-0.000157,-0.00063,0.000146,-6.1e-05,-6.5e-05,3e-05,-0.001002,-0.001918,-0.001003,0.000476,0.000952,0.001043,-0.000521,-0.000156,-0.000412,-0.000113,-0.0013,-0.000859,-0.001714,0.000344,0.000785,0.000623,-0.002051,-0.000923,-0.000219,0.000118,0.000179,-0.000875,-0.000198,-0.000219,0.000264,0.000212,-6.9e-05,0.000957,6.9e-05,-0.000924,-0.000197,0.001416,-9.9e-05,-0.000261,-0.000526,0.000386,0.000371,-0.000376,0.000434,0.000481,0.000473,0.001243,3.1e-05,-0.000759,0.000703,-7.1e-05,0.000906,0.000967,0.000123,0.000515,-0.000126,-0.000343,-0.001167,-5.5e-05,-0.000473,7.3e-05,0.000111,0.000161
-0.001194,0.000388,0.000704,0.000458,0.000788,0.000743,0.000479,4.2e-05,0.000548,3.1e-05,0.001325,-9.7e-05,0.00025,0.00015,-0.000231,-0.000483,0.000332,-0.000821,-0.000139,0.000765,-0.001312,1.7e-05,0.00071,0.000721,9.7e-05,-0.000502,-0.00114,-9.3e-05,0.000357,0.001702,-0.000716,0.00097,0.000275,0.000624,0.000402,-7.9e-05,0.001204,0.000484,-0.00045,0.000493,0.000466,0.000915,-0.00087,-0.000881,0.000544,0.000614,7.8e-05,-0.00031,-0.000466,-0.000428,-0.000273,0.000578,-6.6e-05,-5.1e-05,-7.6e-05,0.000874,0.000341,-0.000488,0.000237,0.000524,8.8e-05,-0.000302,-0.000179,-1.6e-05,0.000519,0.000507,-0.000311,-0.000618,0.000457,0.000672,0.000462,0.000149,-0.000574,0.000712,0.000103,-7.2e-05,-0.000652,-0.000767,-0.000598,0.000666,-0.000399,0.000382,0.000766,-0.00057,0.00033,0.000262,0.000358,7.8e-05,-0.000671,2.3e-05,1.6e-05,0.000871,0.000324,-0.000153,-0.000437,-0.000123,0.000117,1.5e-05,-0.000368,0.000582,-0.000233,0.000215,-0.000625,-0.000795,-0.000687,0.00019,-0.001244,-0.00081,-0.000688,0.000373,-0.000183,-0.000219,-0.000607,-5e-05,0.000811,0.000794,-0.000624,-0.000412,0.000275,-0.000657,-0.000274
0.000754,0.000778,-0.000363,-0.000207,1.5e-05,-0.000195,-0.000197,6.1e-05,0.000216,0.000361,-0.000397,0.00064,-0.000259,1.2e-05,4.1e-05,0.00101,-0.000561,0.000257,8.1e-05,-5e-04,0.000756,-0.000406,-0.000329,-0.000709,0.000141,0.000206,0.000179,-0.001205,0.000787,-0.000249,0.000626,0.000329,-0.000219,-0.000767,-0.000498,0.000165,-0.000271,0.000256,-0.000373,-3.6e-05,-0.000538,-0.000799,0.000592,0.000132,8.6e-05,-0.000198,2.4e-05,-0.000468,0.000292,0.00078,0.000562,2.8e-05,0.000196,0.000666,-6.3e-05,0.000285,-0.000238,0.000512,0.000133,-0.000366,-0.000208,-7e-05,0.000316,0.000532,3e-04,-2e-05,-3.7e-05,0.001025,-0.000699,0.000142,-0.000112,-0.000794,0.00059,-0.000502,-0.000364,0.000101,-0.00016,-0.000367,-5.1e-05,1e-05,0.000557,0.000204,-0.000235,-2.4e-05,-0.000769,0.00025,0.000789,-2e-04,0.000534,0.00015,-0.000491,-0.000429,-0.000895,-0.000355,0.000326,-0.000168,-0.000521,-0.000557,-0.000624,-0.000271,2.5e-05,0.000316,4.8e-05,0.000313,0.000428,2e-04,0.000664,0.000358,0.000593,-4.1e-05,0.000336,-0.000356,2.3e-05,0.000498,-1.2e-05,-0.000545,0.000252,0.000515,-0.00019,-0.00017,-0.000221
-0.000434,-0.000706,2.5e-05,-8.6e-05,-0.000602,-0.000229,0.000231,-1e-04,-0.000255,-0.000379,0.00039,-0.00037,0.00021,0.000159,0.000589,-0.000317,0.000384,-0.000207,-3.5e-05,-0.000441,3.9e-05,0.000732,0.000563,0.000457,0.000184,0.000926,-0.00012,0.000916,-0.000348,-0.000463,0.000314,-0.000415,-0.000708,0.000742,-0.000404,-0.000946,-0.001055,-0.000912,6e-04,0,0.000389,0.000226,-0.000452,-4.7e-05,-0.000128,-0.000299,0.000394,5.5e-05,-0.00028,-0.000154,-0.000402,0.00041,-0.000303,-0.000329,-6.7e-05,-0.000126,0.000421,-0.000185,-0.000287,7.6e-05,7.6e-05,0.000124,-0.000252,-0.000281,0.000339,-0.000268,-4.9e-05,-0.000258,-0.000262,0.000122,0.000122,0.000365,0.000148,0.00039,0.000466,-0.000245,0.000404,0.000471,4.4e-05,0.000254,0.000184,-0.000421,0.000177,-0.000208,0.000121,-0.000268,-0.000508,0.000243,-3.9e-05,1e-06,0.000403,-0.000125,0.000754,0.000379,-0.000611,-0.000164,0.000124,0.000212,-7e-05,-0.000105,-8.1e-05,-0.000533,0.000804,-7.8e-05,-0.000637,-0.000123,-0.000638,0.000141,-0.000165,-0.000353,-8e-04,0.000111,0.000513,0.000565,-0.000497,0.000176,0.000382,0.000223,0.000169,0.000874,-0.000146
0.000133,-0.00029,-0.000117,5e-05,0.000251,0.000243,-0.00045,0.000367,-0.000298,0.000479,-0.000456,3.6e-05,7.4e-05,0.000261,-0.000293,0.000405,-0.00011,2.7e-05,-0.000329,-0.000148,-0.000243,-0.000821,-0.000146,-0.000257,-0.000517,-0.000971,-0.000158,-0.000652,0.000385,-0.000325,-0.000434,-0.000434,-0.000132,-0.000635,0.000171,0.000715,0.000762,0.000576,0.000349,0.000777,0.000155,0.000109,-4.7e-05,0.000259,0.000329,-0.000234,-0.000314,-4e-06,0.000418,2.1e-05,-0.000104,-2.1e-05,-6.7e-05,0.000139,-7.3e-05,-0.000453,-0.000347,0.000111,-0.000248,-7.8e-05,5.7e-05,-0.00026,0.000175,0.000236,-0.000499,0.000154,-6.7e-05,-0.000276,-0.000129,-8e-05,-0.000302,0.000192,0.000309,-8.3e-05,-9.8e-05,-1.5e-05,2.8e-05,-0.000271,0.000133,-0.000232,-0.000255,-0.000293,-5.4e-05,0.000244,3.8e-05,0.000141,0.000387,-0.00012,-0.000129,0.000292,-0.000216,2.1e-05,-0.000134,-0.000115,0.000225,-0.00015,-0.000357,-2.7e-05,0.000199,-5e-04,-0.00039,-4.1e-05,-0.000122,0.000329,0.000506,7.3e-05,0.000704,2e-06,1.7e-05,3e-06,0.000566,0.000141,8.1e-05,-0.00056,0.000107,-2e-05,0.000235,-0.000413,-0.000185,-0.000405,9e-06
0.000189,0.000207,0.000229,-0.000347,-8.5e-05,-0.000238,0.000392,-0.000241,0.00027,-3e-04,0.000312,0.000228,-0.000186,-0.000544,-0.000277,-0.000113,0.000195,0.000347,0.000503,0.000277,-0.000431,0.000666,0.000424,-3.3e-05,0.000243,0.000443,0.000445,0.000721,-3.5e-05,6e-05,-0.000226,0.000121,0.000254,-0.000158,1e-06,4e-05,-4.8e-05,0.000113,-0.000387,-0.000163,-0.000343,-6.9e-05,-0.000246,-0.000499,-0.000221,0.000594,5.5e-05,1e-04,-0.000318,5.9e-05,8.4e-05,-0.000257,-8.9e-05,-9e-06,-6e-05,0.000166,0.000106,-0.000147,0.000168,-6.3e-05,-2.8e-05,0.000185,2.5e-05,0.00017,-6.5e-05,2.2e-05,-1.6e-05,0.000202,0.00017,-0.000503,0.000207,-0.00024,-0.000399,-0.000131,8.2e-05,0.000437,0.00033,1.7e-05,-6.4e-05,0.000145,6.2e-05,0.000236,0.00018,-0.000246,-0.00012,-0.000225,-8.5e-05,0.000156,0.000167,0.00015,-0.000102,-2.3e-05,2.5e-05,-0.000104,2.2e-05,-0.000276,0.000251,0.000146,-0.000413,0.000438,0.000295,0.000364,-1.6e-05,-7.2e-05,0.000137,0.000104,0.000426,-0.000103,-3e-05,0.000317,9.4e-05,-5.6e-05,-0.00031,-0.000204,4e-06,9.7e-05,-0.000301,-6.5e-05,-0.000139,4.4e-05,-0.000277
-4.2e-05,4.6e-05,-5.2e-05,0.000377,4.6e-05,0.000346,-0.000107,2.3e-05,-0.000305,0.000134,-0.000361,-0.000107,0.000143,0.000217,-0.000164,-9.7e-05,-4.5e-05,-5.2e-05,0.000131,0.000142,0.000386,-0.000132,-0.000404,0.000444,-2.5e-05,-0.000306,-0.000214,-0.000106,-0.000168,-6.3e-05,0.000701,0.000355,0.000162,0.000444,9e-05,0.000244,-7.4e-05,-0.000163,0.000227,-0.000425,7.9e-05,-6e-06,0.000164,0.000411,-2.9e-05,-0.000313,-3e-05,9.1e-05,0.00023,-7.6e-05,0.000444,9.5e-05,0.000212,-5.9e-05,-4.4e-05,-7.4e-05,-0.000133,-2.7e-05,0.00014,0.000115,-0.000101,-0.000181,7.5e-05,6e-06,-1.2e-05,-0.000158,-4e-05,-9.1e-05,0.00022,2.1e-05,1.4e-05,-0.000111,0.000296,0.000387,3e-06,-0.000294,-5e-05,2.6e-05,5.5e-05,-0.000268,0.000187,1.8e-05,2.5e-05,0.000159,-7.8e-05,0.000149,-0.000273,-8.4e-05,-0.000193,-0.000228,0.000235,4e-05,-5.1e-05,8.3e-05,-6.8e-05,0.00025,-8.5e-05,-2e-05,0.000324,-5.2e-05,4.4e-05,7.4e-05,-3.4e-05,2.6e-05,-0.000108,6.4e-05,3.5e-05,-0.000143,1.4e-05,3.4e-05,-0.00025,-0.000114,-5.2e-05,-4.9e-05,0.000338,-0.000216,-3e-06,-7e-06,0.000119,0.000321,-5.2e-05
-2.4e-05,0.000117,-2.3e-05,-5.2e-05,0.000129,-0.000152,0.000108,5.1e-05,8.3e-05,0,0.000153,-9e-06,-8.5e-05,-0.000384,2.1e-05,-9.3e-05,-0.000145,5.9e-05,-5.6e-05,-1.8e-05,5e-06,0.00018,4e-05,2e-05,3.5e-05,2.5e-05,9e-05,3.3e-05,4.8e-05,-0.000162,-4.3e-05,-0.000288,0.000183,-1e-04,1.6e-05,-0.000237,5e-05,6.4e-05,-0.000124,7e-06,-0.000394,-5.8e-05,-0.000209,-0.000268,5.4e-05,-5e-05,0.000226,-0.000172,-0.000109,0.000103,-0.000193,3.6e-05,-9e-06,-6.7e-05,9e-06,0.000227,0.00011,-1.7e-05,0.000177,-5.3e-05,0.00011,3.5e-05,-0.000297,3.7e-05,-4.8e-05,0.000157,0.000254,0.000271,-7e-05,0.00018,-0.000131,3.3e-05,-0.000168,-0.000353,-6e-06,-5.5e-05,-0.000256,0.00014,-9.3e-05,0.000177,-9.4e-05,-1e-05,-8e-05,-0.000141,0.000187,3.8e-05,0.000178,-9.5e-05,0.00012,9.5e-05,-0.000236,-7.9e-05,-7e-05,-2.1e-05,-0.000358,-7e-06,0.000215,-0.000175,-0.000241,-0.000314,-0.000273,-0.000219,-0.000154,-0.000162,-0.00011,-5.8e-05,-8.2e-05,-0.000127,2.4e-05,-0.000297,8.1e-05,-4.5e-05,4.3e-05,0.000192,-0.000196,-2.8e-05,0.000116,0.000148,5.8e-05,-0.000217,-7.5e-05
-7.6e-05,0.000104,-8e-06,-3.9e-05,-0.000152,0.000102,5.1e-05,-9.7e-05,5e-05,-5.4e-05,0.00014,6.6e-05,4.2e-05,0.000256,0.000193,0.000102,0.000365,0.000185,-1.6e-05,4.4e-05,0.000168,-6e-06,0.00019,-9.8e-05,5.5e-05,5.8e-05,-5.4e-05,7e-06,0.000278,-4.1e-05,-0.000276,-3.1e-05,-0.000169,3.8e-05,-0.000177,7.6e-05,-7.2e-05,-0.000162,7.3e-05,0.00017,0.00014,-4e-06,0.000203,8.9e-05,-5e-05,9.1e-05,-8e-05,9.8e-05,2e-06,6.9e-05,8.8e-05,-1.3e-05,9.9e-05,5e-05,1.9e-05,-0.000118,-8.6e-05,3.6e-05,-0.000138,5e-05,-6.1e-05,5.4e-05,8.6e-05,-0.00013,0.00012,-0.000202,-0.000149,-0.000275,-0.000161,4.2e-05,-4.7e-05,1.9e-05,-2e-06,9.9e-05,9.7e-05,7.1e-05,0.00016,-0.000105,4.9e-05,-3.8e-05,1.1e-05,3e-06,3.8e-05,9.6e-05,-1.5e-05,1.6e-05,6.6e-05,7.2e-05,3.4e-05,4.4e-05,0.000106,0.000161,-0.000133,-7e-06,0.000335,0.000115,3e-06,-5e-06,0.000149,8.5e-05,0.00017,0.000123,-1.3e-05,-7e-05,-8e-05,9.6e-05,-0.000273,-8.4e-05,-9.4e-05,-4e-06,-2.5e-05,3.2e-05,-6.1e-05,0.000153,-4.8e-05,0.000147,-0.000246,-9.3e-05,1e-06,-0.000262,5e-05
9e-06,-0.000264,-0.000136,3.6e-05,4e-06,-8.5e-05,-7.3e-05,5.5e-05,-0.00019,-6.9e-05,-0.00018,-2e-06,3.4e-05,-8.6e-05,2.6e-05,-3.3e-05,-0.000202,-0.000299,3.2e-05,-1.2e-05,-0.000218,0.000195,-9.5e-05,0.000115,-0.000135,-0.000183,-0.000242,-0.000175,-0.000148,-7.9e-05,0.000217,3.5e-05,-7.3e-05,1e-06,-2e-05,3.4e-05,-1.9e-05,6.4e-05,6.8e-05,4.9e-05,1.8e-05,-1.3e-05,-8e-06,0.000131,-4.4e-05,0.00012,-5.5e-05,-7.5e-05,6.7e-05,-0.000102,-0.000111,-1.2e-05,-8.4e-05,-3.1e-05,-6e-06,4.8e-05,-2.5e-05,7e-06,-5.9e-05,-9e-06,6.4e-05,-7.2e-05,-4.8e-05,6.4e-05,-1.2e-05,0.000102,1.6e-05,1.2e-05,-1e-04,5.3e-05,7.1e-05,8.7e-05,-6.5e-05,-3e-05,-2.4e-05,-1.9e-05,-8.9e-05,-3.1e-05,-6.3e-05,0.000154,-0.00012,3.8e-05,-1.4e-05,-3.1e-05,-9.5e-05,7.7e-05,-1e-05,-3e-06,-0.000103,-0.000114,0.000128,7e-06,0.000265,-2.9e-05,-5.8e-05,6.5e-05,-8e-05,5.2e-05,4e-06,-0.000125,-3e-06,0.00012,-1e-05,0.000156,0.000113,-6.6e-05,8.7e-05,-8e-06,1.7e-05,0.000268,6.2e-05,7.2e-05,-0.000157,-0.000187,0.000126,-5.2e-05,1.2e-05,-6.2e-05,-1.3e-05,0.000207,4.2e-05
4e-06,8.3e-05,0.000183,-1.5e-05,-1.2e-05,7.5e-05,0.000172,6e-06,0.000127,5.9e-05,3e-06,-8.4e-05,-2.4e-05,6.7e-05,-1.3e-05,7e-06,5.9e-05,8e-05,-0.000106,-6e-05,-0.000161,-0.000274,9.7e-05,-9.9e-05,2e-05,0.000283,3.9e-05,-3.8e-05,6.4e-05,1.5e-05,2.4e-05,1e-04,-5.5e-05,-2.1e-05,-7e-06,-5e-06,2.4e-05,4.5e-05,9e-06,-4.3e-05,4e-05,-6e-06,-5e-05,-0.000112,4.2e-05,-9.7e-05,-2.6e-05,-1e-06,-0.000157,-7.8e-05,-2.1e-05,-5e-05,2.9e-05,2.5e-05,3.5e-05,-0.000143,5.4e-05,-3.4e-05,-4.4e-05,9.1e-05,-7.7e-05,1.4e-05,-8.8e-05,5e-06,-0.000152,-4.3e-05,0.000107,1e-05,-2e-05,-7.5e-05,-2.7e-05,-4.2e-05,0.000139,-8.1e-05,6e-06,1.7e-05,-8e-06,0.000104,-2.5e-05,-0.000255,-5.8e-05,6.7e-05,7.8e-05,9.9e-05,0.00012,-6.4e-05,-4.9e-05,2.6e-05,9e-05,2.3e-05,-0.000104,-1.9e-05,-4.9e-05,4e-06,0.000125,5.2e-05,1.7e-05,2.5e-05,1.2e-05,-7e-05,-8.7e-05,-6.3e-05,1.5e-05,-0.000116,-4.8e-05,-7.6e-05,-4e-06,-1.8e-05,6.7e-05,-1.8e-05,-3e-05,4.6e-05,0.000191,5e-06,-2e-05,7.7e-05,7.2e-05,3.9e-05,-2.8e-05,7e-05,1.5e-05
4.9e-05,0.000167,-0.000115,-2.4e-05,1.9e-05,-1.7e-05,-0.000115,-6e-06,-6.2e-05,-1.4e-05,0.000122,-1.7e-05,-1e-05,-0.000128,-0.000126,-6e-05,1.6e-05,-4.1e-05,-3.8e-05,-4.9e-05,0.000117,-2.8e-05,-1e-04,8.9e-05,9e-05,-0.00021,4.6e-05,-4.9e-05,-0.000198,-6.1e-05,-0.000226,7.1e-05,7e-06,2.7e-05,7e-06,-0.000144,9.7e-05,-7.2e-05,1.3e-05,4.2e-05,2.2e-05,4.2e-05,0.000158,0.000114,1.6e-05,8e-06,2.4e-05,0.000128,0.000156,1.1e-05,1.9e-05,8.6e-05,-4.6e-05,2.1e-05,-4e-06,0.00014,-6.6e-05,-5e-06,6.3e-05,-0.000104,2.7e-05,2.4e-05,0.00014,-3.7e-05,-7e-06,3.2e-05,-0.000123,0.000113,-4e-05,-5.6e-05,5.5e-05,2.1e-05,-9.8e-05,8.4e-05,2.9e-05,-2e-05,7.8e-05,-8.1e-05,1.8e-05,0.000141,0.000156,-5.2e-05,-0.000104,-1.8e-05,-9.1e-05,4.2e-05,4.6e-05,-5.9e-05,-5.4e-05,3.1e-05,4.7e-05,-2e-05,6.5e-05,7.5e-05,-0.000283,2.4e-05,-0.000148,8.5e-05,-0.000114,0.000155,1.3e-05,-5.5e-05,6.3e-05,8.7e-05,7.9e-05,1.4e-05,-9.8e-05,4.2e-05,-5.3e-05,-0.000114,4.4e-05,0,5.9e-05,-3e-06,-9.9e-05,-0.000121,-2.7e-05,-0.000108,-3.3e-05,-0.00019,8.9e-05
-0.000122,-0.000147,0.000123,6.3e-05,2.8e-05,1e-06,8.9e-05,-5.2e-05,1.5e-05,0,-0.000142,5.1e-05,1.7e-05,5.4e-05,4.5e-05,6.4e-05,-4e-06,-6.3e-05,0.00012,2e-06,-2.3e-05,-4e-06,-3.2e-05,-0.000111,-3e-05,0.000126,0,-3.8e-05,0.000219,-3e-05,-6.4e-05,-0.000143,8.3e-05,1e-05,5.8e-05,-4.2e-05,-0.000191,0.000114,0,0.000115,2e-05,-6.8e-05,-9.1e-05,-4.1e-05,-2.9e-05,-5e-05,3.7e-05,-0.00016,-0.000125,5.2e-05,6.8e-05,6.2e-05,6.3e-05,7e-06,-7e-06,-9e-06,1.3e-05,2.2e-05,1e-06,-3e-06,1.5e-05,-3.7e-05,-0.000124,3.7e-05,0.000117,3.5e-05,2.1e-05,-9.4e-05,0.000155,1.5e-05,-6.3e-05,4.8e-05,1.9e-05,-5.8e-05,-9.3e-05,7.1e-05,-5.2e-05,1e-05,8e-06,-1e-05,-9e-05,-2.9e-05,-4.4e-05,-2e-06,2.3e-05,-5.8e-05,4.2e-05,9e-06,1e-06,-1.9e-05,7.6e-05,-5e-05,-8.5e-05,-7.7e-05,0.000119,-2.4e-05,6.3e-05,-3.1e-05,8e-05,-9e-05,5e-06,-2.4e-05,2.2e-05,-4.2e-05,-8.1e-05,6.9e-05,0.000146,-5.1e-05,-1.4e-05,-5.7e-05,-1.6e-05,2.4e-05,-1.6e-05,0.000107,9.2e-05,-1.7e-05,-0.000119,7.3e-05,-2.6e-05,0.000103,-7e-06
0.000117,2.2e-05,-0.000117,-4.4e-05,-6.1e-05,-3e-05,-2.4e-05,5e-06,-1.3e-05,0,2.7e-05,-1.1e-05,-2.1e-05,-8.7e-05,2.2e-05,-5.3e-05,6e-05,4.7e-05,1e-06,4.6e-05,7.6e-05,-0.000123,-2.3e-05,7.8e-05,-4.2e-05,-3.1e-05,1.3e-05,-2.2e-05,6.8e-05,4.9e-05,0.000189,-2.9e-05,3.9e-05,-4.3e-05,1e-05,9.9e-05,0.000174,-7.1e-05,-2e-05,-5.9e-05,-0.000146,5e-05,0.000129,-7e-06,1e-05,9.7e-05,-3.2e-05,0.00014,6.9e-05,2e-06,-5.3e-05,-2.5e-05,-1.8e-05,2.5e-05,2e-05,-2.5e-05,2.8e-05,2.3e-05,3.3e-05,7.5e-05,-6e-06,3.2e-05,1.7e-05,5e-06,4e-05,-4e-05,-2.3e-05,-1.6e-05,-3e-06,1.1e-05,-3.1e-05,-4.3e-05,4e-06,3.5e-05,8.4e-05,-9.4e-05,3.6e-05,3.3e-05,4.2e-05,7e-06,2.4e-05,6e-06,3.1e-05,-1.8e-05,1.5e-05,4.9e-05,-8.2e-05,4.3e-05,3.7e-05,-3.8e-05,-0.000124,6.7e-05,-2.8e-05,2.1e-05,2.9e-05,-5.2e-05,-6.1e-05,-5.7e-05,-0.000128,-3e-06,-8e-06,0.000112,-3.3e-05,4e-05,1e-04,-4e-05,-4e-05,7.3e-05,1.9e-05,9.7e-05,4.9e-05,-9e-06,-2.9e-05,1e-06,-2.5e-05,5.7e-05,-1.4e-05,-4.6e-05,3.9e-05,6.9e-05,6.5e-05
-5.8e-05,3.1e-05,9.5e-05,-2e-05,2.9e-05,2.4e-05,-1e-06,7.6e-05,1.5e-05,-2e-06,8.6e-05,1.6e-05,1.6e-05,0.00013,2.7e-05,-4.4e-05,-9.6e-05,-3.7e-05,-4.7e-05,2e-06,-8.1e-05,5.6e-05,-9.3e-05,9e-06,1.2e-05,-8.5e-05,-2.3e-05,0.000118,-4.4e-05,6.9e-05,-4.2e-05,6.8e-05,-7e-06,4e-05,-2.2e-05,4e-06,-6.3e-05,-2.7e-05,4.4e-05,-0.000171,0.000157,-2.8e-05,-6.1e-05,-3.1e-05,6e-06,-5.2e-05,-2.5e-05,-0.000117,-7e-06,-8e-06,8.3e-05,-4.7e-05,1.3e-05,-3.3e-05,-3e-06,-8.7e-05,-2.4e-05,-3.1e-05,-5.6e-05,-7.6e-05,-2.2e-05,3e-06,-1e-05,1.7e-05,-9.6e-05,2.5e-05,3e-05,-2.1e-05,2.9e-05,-1.7e-05,4.8e-05,4.9e-05,4.6e-05,-6e-06,-8.9e-05,-1.9e-05,-2.4e-05,-5e-06,-2.4e-05,-2.1e-05,-3e-06,-3.7e-05,2e-05,-4e-06,1.1e-05,-5.6e-05,5.8e-05,-2e-05,-4.7e-05,5e-05,5.1e-05,-2.4e-05,2.9e-05,3.4e-05,-7e-05,-3e-05,6.9e-05,-4.4e-05,0.000101,0.000148,-5.5e-05,1.8e-05,3.2e-05,-4.2e-05,-0.000103,3.7e-05,-0.000121,1.2e-05,-1.7e-05,4.7e-05,-1.1e-05,1e-05,4.1e-05,-5.6e-05,-5.8e-05,4e-06,9.8e-05,3.5e-05,1.9e-05,-6.8e-05,-4e-05
-2.6e-05,-7e-05,-9.4e-05,3.2e-05,-4e-06,-1.1e-05,4.7e-05,-4.3e-05,3.3e-05,1.2e-05,-6.8e-05,2.8e-05,-1.1e-05,-8.9e-05,-1e-06,0.000109,9.5e-05,-4.3e-05,3.2e-05,-1e-06,2.2e-05,9e-06,4.3e-05,-4.6e-05,-7e-06,9.1e-05,-8.1e-05,-4.7e-05,-2.6e-05,6.7e-05,-0.000119,6.1e-05,-3.6e-05,5.7e-05,-5e-06,3e-06,-1.5e-05,5.5e-05,2.6e-05,-4.5e-05,-0.000161,-8e-06,1.9e-05,3.5e-05,-4.2e-05,-7e-06,-1.2e-05,4e-05,-3.6e-05,9e-06,-1.3e-05,3.3e-05,-6e-06,-1.1e-05,-1e-06,6.8e-05,-5e-06,8e-06,-4e-06,4.5e-05,2.7e-05,-1e-06,1.7e-05,-2e-06,1.1e-05,5e-06,-1.4e-05,2.2e-05,-7.1e-05,1.9e-05,2.5e-05,3.1e-05,-6.4e-05,-2.1e-05,0,7.7e-05,1e-06,-2e-06,-1.3e-05,4e-05,6.5e-05,-2e-06,-1.3e-05,-1e-06,-5.9e-05,6.7e-05,-1.6e-05,-7e-06,1.5e-05,-7e-06,3.1e-05,-6e-06,7.1e-05,-3.7e-05,1.3e-05,-4e-05,7e-06,1.5e-05,-4e-05,-5.1e-05,4.4e-05,-5e-05,-2.1e-05,2.7e-05,5.1e-05,2.8e-05,0.00019,1.4e-05,9e-06,-6.5e-05,-2e-05,-5e-06,-8e-06,-7.2e-05,7e-05,1.8e-05,-7.2e-05,-5.4e-05,-1.1e-05,-2.1e-05,1.1e-05
5.9e-05,9.5e-05,9.4e-05,-2.1e-05,0,7.7e-05,-3.3e-05,-5e-06,-7e-06,-2.6e-05,-2.7e-05,-2e-05,9e-06,9.8e-05,-7.3e-05,-6.4e-05,-4.9e-05,4.2e-05,2.1e-05,1.1e-05,-7.9e-05,7.5e-05,-4.3e-05,5.2e-05,3.8e-05,-0.000119,7e-06,0.000117,4.4e-05,1.8e-05,9.6e-05,-6.8e-05,-5.7e-05,-8.4e-05,-5e-06,-4.4e-05,-9e-06,-2.1e-05,-7e-05,4.5e-05,0.000177,1.8e-05,-6.1e-05,-5.3e-05,1.2e-05,-5e-06,8e-06,4.5e-05,5.4e-05,-1.2e-05,-7.8e-05,-2.6e-05,-4e-06,-4e-06,4e-06,-7e-06,3.6e-05,-1.5e-05,0,-1.3e-05,-1.5e-05,5e-06,-1.3e-05,-9e-06,0,-3.1e-05,2e-05,7e-05,-6e-05,2.2e-05,-4.4e-05,-6e-05,7e-06,2.5e-05,3.3e-05,-2.9e-05,1.8e-05,1e-06,-6e-06,-8.6e-05,-2.6e-05,7e-06,-7e-05,-1.9e-05,5.7e-05,-3.6e-05,-5e-05,0,2.1e-05,-5.2e-05,-8.4e-05,2.7e-05,-1.7e-05,2.1e-05,3.9e-05,-3e-06,6e-06,4.1e-05,7e-06,1.7e-05,-3e-06,-2.9e-05,-6e-05,-1.6e-05,-5.9e-05,-1.6e-05,-2.1e-05,4.7e-05,-6e-06,-4.8e-05,2.1e-05,-1e-05,-8.7e-05,6.9e-05,1.5e-05,-3e-05,-2.5e-05,1.8e-05,2.6e-05,5.8e-05,-2e-05
-2.2e-05,-1.2e-05,-7.3e-05,8e-06,1.6e-05,-9.3e-05,2.4e-05,-1e-05,3e-06,2.3e-05,9.1e-05,0,-1e-05,-5e-05,1.3e-05,-3.4e-05,-3e-06,-5.4e-05,-7.2e-05,-2e-05,0.000119,-3.8e-05,5.5e-05,3e-06,-3e-06,0.000117,-7e-06,-4.5e-05,-0.000102,1.7e-05,8.1e-05,-8.2e-05,-4e-06,-1e-05,1e-05,7.4e-05,4.6e-05,1e-06,6.3e-05,-2.9e-05,-0.00012,-1.1e-05,5.4e-05,4.5e-05,9e-06,2.5e-05,5e-06,-8.6e-05,-5.9e-05,3e-06,4.4e-05,1.1e-05,-2e-06,-1.6e-05,-8e-06,3.6e-05,-1.7e-05,2e-05,3.4e-05,-1e-05,2e-05,1.3e-05,3e-05,8e-06,7e-06,3.7e-05,-2.7e-05,-0.000109,1.6e-05,-1.1e-05,1e-05,-5e-06,2.9e-05,-3e-06,-5.4e-05,-4.1e-05,-1.7e-05,-8e-06,-3e-06,6.3e-05,2.9e-05,4e-06,1.5e-05,3e-06,-2e-05,3.1e-05,2.3e-05,-6e-06,-4e-05,2.6e-05,5.8e-05,1e-06,6e-06,-7e-06,-1.4e-05,-2.4e-05,2.7e-05,4e-06,-2.1e-05,7.3e-05,-5.3e-05,3.1e-05,1e-05,-2e-05,6e-05,-7e-06,4.9e-05,-8e-06,6e-06,6.5e-05,4e-06,-7e-06,1.6e-05,3.3e-05,-4.8e-05,-2.3e-05,5.8e-05,-3e-05,-4.4e-05,-1.1e-05,-2.1e-05
-3e-06,-9.2e-05,5.7e-05,9e-06,-2.3e-05,8.1e-05,0,3e-06,-3.9e-05,-1.1e-05,-5.2e-05,1.6e-05,7e-06,2e-05,1.2e-05,8.1e-05,2.7e-05,-1.8e-05,1.2e-05,-2e-05,-9.8e-05,0.000138,6e-06,1e-06,-5.1e-05,-5.9e-05,1e-06,-2e-06,0.000129,1.1e-05,-0.000108,7.3e-05,3e-05,3.8e-05,2.1e-05,-5e-06,-3.3e-05,-1.3e-05,-3.1e-05,-6.5e-05,6.4e-05,-1e-06,-6e-05,-2.9e-05,-1.2e-05,-1.3e-05,-6e-06,9.2e-05,3.8e-05,2.8e-05,0,-1.1e-05,0,1.7e-05,-3e-06,-4.1e-05,1.2e-05,9e-06,-1.5e-05,1.7e-05,-2.9e-05,-7e-06,-1.3e-05,-1e-05,4.6e-05,-3.3e-05,-2e-05,5.6e-05,6.5e-05,1.4e-05,-4e-06,9e-06,-1.1e-05,-6e-06,3.4e-05,8.7e-05,1.1e-05,6e-06,-1.1e-05,-1e-06,-7.9e-05,9e-06,4e-05,-2.4e-05,-1.2e-05,-2.9e-05,4.9e-05,5e-06,3.8e-05,6e-06,-1e-06,-1e-06,-5e-05,5e-06,2.4e-05,6e-06,-4.4e-05,-1.1e-05,2.8e-05,-5.9e-05,4e-05,1e-05,4e-06,3.2e-05,8e-06,-3e-06,-2.6e-05,2.4e-05,0,3.8e-05,1.7e-05,-2e-05,1.2e-05,3.4e-05,-2e-06,1.6e-05,-3e-06,3.9e-05,-4e-06,-5.4e-05,-1.6e-05
2.9e-05,7.9e-05,-4.8e-05,-1e-05,2.2e-05,-6.7e-05,-8e-06,2.3e-05,1.7e-05,1.7e-05,-4.1e-05,-1.4e-05,-7e-06,2e-06,1.9e-05,-2.8e-05,-4.3e-05,3.4e-05,4.4e-05,1.4e-05,5.9e-05,-4.8e-05,-4e-06,-1.2e-05,2.4e-05,8e-06,4.7e-05,-4.2e-05,2.2e-05,8e-06,-2.2e-05,3.1e-05,3.1e-05,-1.3e-05,4e-06,-3e-06,-4e-06,2.3e-05,-2e-06,5.4e-05,-6.5e-05,-2e-06,9e-06,1.5e-05,1.7e-05,1e-05,-9e-06,-6.8e-05,-1.3e-05,-1.8e-05,1e-06,6e-06,5e-06,1.4e-05,-6e-06,1e-06,2e-06,-8e-06,6e-06,-1.7e-05,2e-05,5e-06,7e-06,-1.6e-05,-3e-05,-1e-06,6.6e-05,-4.2e-05,1.9e-05,-1.8e-05,1.4e-05,-3.2e-05,-2.4e-05,1.1e-05,-1e-05,-7e-05,-1e-06,2e-06,7e-06,1.7e-05,3.9e-05,0,-4e-06,2.5e-05,2.3e-05,1.4e-05,-2.8e-05,-7e-06,-2.1e-05,-2.6e-05,-6.9e-05,-2.5e-05,-2e-06,6e-06,-2.1e-05,1e-05,2.1e-05,-2.2e-05,-5.5e-05,3.7e-05,0,-2.2e-05,4e-06,-3.3e-05,-1.8e-05,2e-06,-9.9e-05,5e-06,-1.4e-05,-4.6e-05,-1.7e-05,1e-06,2.2e-05,-5.6e-05,2.7e-05,2e-05,-2.8e-05,-3.6e-05,1.1e-05,1.2e-05,-4.6e-05
-3.8e-05,-7e-06,3.5e-05,2e-06,-6e-06,3e-05,2.3e-05,-3.2e-05,-7e-06,-2.6e-05,6.2e-05,-1.1e-05,5e-06,9e-06,-1.2e-05,-3.9e-05,5.5e-05,-3.6e-05,-2.4e-05,2.3e-05,-4.8e-05,1.9e-05,2.3e-05,-3e-06,1.9e-05,5.3e-05,-5.8e-05,-2e-06,-4.1e-05,-4e-06,7.4e-05,-1.2e-05,1.9e-05,-1.2e-05,-8e-06,-4.7e-05,4.3e-05,1.5e-05,2.8e-05,4.6e-05,6.8e-05,1e-06,-8e-06,-2.6e-05,1e-06,-2.3e-05,-8e-06,2.2e-05,-1.2e-05,-2.7e-05,5e-06,-4e-06,-8e-06,-1e-06,-3e-06,-1.2e-05,8e-06,-1.9e-05,-6e-06,2.5e-05,-6e-06,7e-06,1.1e-05,1.3e-05,-2e-05,1.3e-05,-6.8e-05,5.6e-05,3e-06,-1.7e-05,7e-06,1e-05,2e-05,-8e-06,-5e-06,5e-06,-1.6e-05,-6e-06,-7e-06,-5.4e-05,-5e-05,5e-06,-3.5e-05,-1.6e-05,-2e-06,-1.1e-05,-2.8e-05,9e-06,-4e-06,1.1e-05,7.8e-05,1.1e-05,1.8e-05,-2.8e-05,-4.6e-05,2.9e-05,-3e-05,-1.5e-05,3.5e-05,1.2e-05,-2.7e-05,-7e-06,2.4e-05,3e-05,-2e-06,-3.4e-05,3.7e-05,-1e-06,5e-06,-3.2e-05,1.3e-05,-7e-06,-1.8e-05,-1.9e-05,-3e-06,2e-06,1.8e-05,8e-06,-1e-05,2.7e-05,7e-06
-2e-06,-3e-05,-3.1e-05,9e-06,-2e-06,6e-06,-3.6e-05,1.7e-05,2e-05,1.5e-05,-5e-06,0,-5e-06,-1.3e-05,-1e-06,5.3e-05,-5.7e-05,1.8e-05,-1.9e-05,0,3.8e-05,-9.6e-05,-2.5e-05,2.7e-05,-7e-06,-8.3e-05,-2.4e-05,-6.4e-05,-6.9e-05,-1.2e-05,-2.4e-05,-4.4e-05,-2e-05,2.4e-05,-5e-06,1.3e-05,-6e-05,-3.8e-05,-1.9e-05,-5.1e-05,-8.4e-05,-3e-06,-4.7e-05,3.4e-05,-1e-05,2.1e-05,1.6e-05,2.3e-05,2.6e-05,1e-05,1e-05,5e-06,1.3e-05,9e-06,-3e-06,3.2e-05,-5e-06,1e-06,9e-06,-3.3e-05,7e-06,-1.2e-05,-1.1e-05,-2e-06,-1.6e-05,-2e-05,3.4e-05,-1.4e-05,-4.2e-05,1.5e-05,-1.6e-05,5e-06,1.8e-05,-9e-06,2.6e-05,3e-05,1.7e-05,8e-06,1.2e-05,3.3e-05,2.2e-05,-3e-06,-1.3e-05,3e-05,-2.1e-05,0,2.3e-05,-7e-06,2.2e-05,2.6e-05,-2.6e-05,2e-06,2.3e-05,2.6e-05,5.3e-05,2.5e-05,6e-06,3.1e-05,-8e-06,-5e-05,7e-06,1.5e-05,7e-06,-8e-06,-2.8e-05,1.8e-05,-7.2e-05,-4e-06,1e-06,2.3e-05,1e-06,7e-06,4e-05,1.5e-05,-1.3e-05,-2e-05,5.6e-05,1e-06,1.9e-05,-7e-06,-1.4e-05
2.5e-05,4.7e-05,2.5e-05,-6e-06,1.3e-05,-3.1e-05,3.2e-05,4e-06,-5e-06,-1e-06,-4.4e-05,-1e-06,8e-06,1e-05,0,-1.1e-05,3e-05,2.3e-05,2.9e-05,-1.4e-05,-1.8e-05,6.8e-05,2.8e-05,-3.3e-05,-4e-06,7.4e-05,7e-06,6.2e-05,6.4e-05,-1e-05,-6.8e-05,1e-05,-2.8e-05,9e-06,-5e-06,-2e-06,5.6e-05,-3e-06,-1.9e-05,-5.5e-05,0.000114,1e-06,7.2e-05,-2.8e-05,-2e-06,1e-06,1e-06,-4.2e-05,-3.3e-05,1.2e-05,-2e-05,-1.4e-05,-1.4e-05,-3e-06,3e-06,-2e-06,6e-06,1e-05,-1.9e-05,3e-05,-9e-06,2e-06,1.8e-05,0,5.4e-05,1.4e-05,-1.6e-05,-2.9e-05,-4e-05,6e-06,-1.2e-05,-1.9e-05,-2.4e-05,2.3e-05,-1.9e-05,-1e-05,-1.4e-05,-6e-06,-9e-06,-1.5e-05,8e-06,3e-06,4.1e-05,-1.8e-05,2e-05,1.1e-05,1e-06,1e-06,-2.4e-05,-9e-06,-4.2e-05,1e-06,-8e-06,-6e-06,-1.7e-05,1.4e-05,6e-06,2e-05,7e-06,5e-06,1e-05,2.5e-05,1e-06,3e-05,3.1e-05,6e-06,6.6e-05,-1e-05,-2e-06,3.6e-05,7e-06,1e-06,1.6e-05,3.7e-05,-7e-06,2e-06,-1.3e-05,-2.3e-05,1.1e-05,-2.4e-05,4e-06
-4.2e-05,-4.3e-05,-1.9e-05,0,-1.6e-05,4e-05,-1.6e-05,-1.9e-05,-1.1e-05,3e-06,4.5e-05,0,-6e-06,-1e-06,2e-06,-2.2e-05,2e-06,-2.6e-05,-1.3e-05,-4e-06,1.6e-05,-0.000125,-2.9e-05,2e-06,-1.2e-05,-6.4e-05,-2.8e-05,-5.3e-05,2.1e-05,-2e-05,3.3e-05,4e-05,-9e-06,-2.5e-05,4e-06,0,-3.3e-05,2.9e-05,2.9e-05,3e-06,-0.000136,3e-06,-5.1e-05,2.8e-05,6e-06,-3e-06,-2e-06,4.4e-05,2.4e-05,2e-06,1.3e-05,9e-06,9e-06,-1.1e-05,0,-2.1e-05,9e-06,1e-06,7e-06,-9e-06,6e-06,3e-06,-9e-06,4e-06,-1.8e-05,-1.1e-05,-5e-06,1.6e-05,3.2e-05,3e-06,2.6e-05,7e-06,0,-2.4e-05,4e-06,-1.3e-05,4e-06,-1e-06,-6e-06,1.4e-05,1e-05,1e-05,1.3e-05,2e-05,-1e-06,-1.1e-05,-1e-05,8e-06,1.4e-05,-7e-06,7.1e-05,3e-06,-1.6e-05,-1.4e-05,2.3e-05,1.1e-05,-1.3e-05,6e-06,1.1e-05,-1.1e-05,-9e-06,-2.8e-05,-4e-06,-3e-05,-1.7e-05,9e-06,5.1e-05,-2.4e-05,4e-06,-1.7e-05,-8e-06,0,-3.5e-05,-1.4e-05,3.2e-05,-1.4e-05,-2.5e-05,3.2e-05,-2.1e-05,3.9e-05,-5e-06
2.9e-05,0,1.6e-05,2e-06,1.4e-05,-1.8e-05,0,1.5e-05,7e-06,-1.1e-05,-3e-06,1e-06,3e-06,-2e-05,1.7e-05,6e-06,-2.2e-05,1.7e-05,-1.7e-05,3e-06,-2.5e-05,3.7e-05,5e-06,4e-06,5e-06,2.9e-05,2.5e-05,7.2e-05,3.1e-05,-2.5e-05,4.4e-05,-6e-06,6e-06,1e-06,9e-06,-1.7e-05,1.7e-05,-9e-06,-1.6e-05,1.3e-05,0.000117,-9e-06,3.6e-05,-3e-06,0,-1.1e-05,-9e-06,-2.9e-05,-1.1e-05,-4e-06,-3e-05,-1.1e-05,-1.2e-05,-2e-06,1e-06,-1.1e-05,-2.4e-05,0,1e-06,-1.7e-05,-1e-06,-1.2e-05,6e-06,0,-8e-06,-3e-06,2.9e-05,4e-06,1.6e-05,4e-06,-8e-06,1.3e-05,1.2e-05,1.9e-05,1e-06,2.6e-05,1.1e-05,-2e-06,-1e-06,-5e-06,-1e-06,0,-2.2e-05,-1e-05,-1.5e-05,1.1e-05,4e-06,-1.2e-05,3e-06,1.5e-05,-3.5e-05,-1e-06,-1.7e-05,1.6e-05,-3e-05,-3e-06,2.8e-05,-2.3e-05,-1.8e-05,-3.2e-05,-1.8e-05,-1.7e-05,-2.2e-05,2e-06,2.9e-05,-8e-06,-5.8e-05,-3e-06,-4e-06,-2.9e-05,3e-06,9e-06,-1.4e-05,-7e-06,-2.1e-05,3.1e-05,4.5e-05,-3.4e-05,5e-06,8e-06,1.6e-05
1.1e-05,4.2e-05,-9e-06,-4e-06,-3e-06,-4e-06,1.2e-05,-4e-06,-1.5e-05,1e-05,-3.9e-05,5e-06,-2e-06,1.8e-05,-1.2e-05,2.2e-05,2.7e-05,5e-06,1.8e-05,-1e-06,3e-06,-2.8e-05,9e-06,-4e-06,1.7e-05,1e-05,5e-06,-1.9e-05,-7e-05,-2.4e-05,-2.5e-05,-1.6e-05,1.7e-05,-2e-06,2e-06,1.1e-05,-2.7e-05,-5e-06,-9e-06,-2.4e-05,-0.000113,6e-06,-2.1e-05,-1.8e-05,-1e-06,9e-06,7e-06,-2e-06,-7e-06,-2e-06,2e-05,-9e-06,8e-06,-7e-06,2e-06,1.9e-05,2.9e-05,-9e-06,9e-06,3e-05,2e-06,8e-06,-5e-06,3e-06,-1.1e-05,8e-06,-3.6e-05,1.8e-05,1.7e-05,-9e-06,-6e-06,1.2e-05,5e-06,-5e-06,-1.2e-05,-2.8e-05,-9e-06,2e-06,-1e-06,1.5e-05,1.7e-05,-9e-06,-1.7e-05,8e-06,1.3e-05,-1.3e-05,1.1e-05,3e-06,-1.3e-05,-1.1e-05,-1.5e-05,7e-06,5e-06,-1.1e-05,2.6e-05,-1.5e-05,-2.7e-05,-1.6e-05,-1.5e-05,6e-06,2.4e-05,1.9e-05,-4e-06,-6e-06,-1.9e-05,8e-06,4.9e-05,-2e-05,0,1e-05,1.1e-05,4e-06,-1.6e-05,-2.5e-05,-2.5e-05,-8e-06,7e-06,1.8e-05,-4e-06,-5.3e-05,2.4e-05
-3.2e-05,-4.4e-05,-1e-06,1e-06,-4e-06,1.5e-05,-2.6e-05,4e-06,2.1e-05,0,2.4e-05,-2e-06,1e-06,-1.9e-05,-1e-06,-1.6e-05,-3.3e-05,-2.4e-05,7e-06,-1e-06,1.6e-05,7.5e-05,-2.7e-05,4e-06,-9e-06,-4.4e-05,-2.2e-05,3.4e-05,1.6e-05,-2.4e-05,-6e-06,-1.4e-05,8e-06,4e-06,-1e-06,1.7e-05,3.8e-05,1.2e-05,2.3e-05,-1.2e-05,0.000104,-3e-06,2.9e-05,1.8e-05,3e-06,3e-06,4e-06,3.3e-05,2e-05,-1e-06,1.9e-05,0,-4e-06,1e-06,1e-06,1e-05,-2.3e-05,-3e-06,-8e-06,-2.3e-05,-7e-06,-6e-06,3e-06,-6e-06,1e-05,-1.4e-05,3.2e-05,-2.4e-05,-5e-06,-4e-06,4e-06,1e-05,-2.2e-05,-1.2e-05,4e-06,2.3e-05,2e-06,-1e-06,-1e-06,-3.3e-05,4e-06,-7e-06,2.2e-05,-1e-05,0,1.2e-05,-2.2e-05,-1e-06,1.1e-05,-1.5e-05,5.7e-05,-9e-06,1.3e-05,5e-06,-1.7e-05,-1.8e-05,2.8e-05,-2e-06,1.2e-05,-4e-06,-9e-06,1.1e-05,6e-06,-4e-06,1e-05,-1e-06,-1.2e-05,-8e-06,-1e-06,2.2e-05,-1.1e-05,7e-06,1.3e-05,3.2e-05,3.4e-05,-9e-06,-2.5e-05,-1.5e-05,-8e-06,1.4e-05,7e-06
2.7e-05,1.4e-05,8e-06,2e-06,9e-06,-2.2e-05,3e-05,1e-06,-9e-06,-4e-06,2e-05,2e-06,0,1.3e-05,-8e-06,-1.9e-05,3.1e-05,2.4e-05,-1.9e-05,6e-06,-1.6e-05,-6.1e-05,1.2e-05,-4e-06,-1e-05,6.7e-05,-1e-05,-2.9e-05,-1.4e-05,-8e-06,2.3e-05,1.8e-05,-5e-06,1.3e-05,-3e-06,2e-06,-2.8e-05,-1.1e-05,-2.2e-05,4.3e-05,-7.5e-05,-1e-06,-6e-06,-1.1e-05,-3e-06,-2e-06,2e-06,-4.9e-05,-2.9e-05,6e-06,-1.7e-05,1e-05,5e-06,4e-06,1e-06,-7e-06,7e-06,5e-06,4e-06,8e-06,7e-06,-4e-06,-8e-06,-1e-06,-2e-06,3e-06,-4.3e-05,3e-06,-2.1e-05,0,-5e-06,-1.4e-05,1.2e-05,2.4e-05,-1e-05,-1.8e-05,1e-06,-2e-06,-4e-06,2.2e-05,-1.6e-05,-3e-06,2.8e-05,2e-06,-1.1e-05,-1.3e-05,6e-06,3e-06,-3e-06,6e-06,-4.9e-05,0,4e-06,2e-06,8e-06,-1.3e-05,-2.1e-05,1.1e-05,1e-06,-1.8e-05,-1.9e-05,-9e-06,-2e-06,1.2e-05,-2e-05,-1.5e-05,-2.5e-05,-2e-06,-3e-06,-4e-06,1.1e-05,0,-1.3e-05,1e-06,4e-06,1e-06,1e-05,2e-06,1.4e-05,3.1e-05,1e-05
-4e-06,1.6e-05,-1.4e-05,-1e-06,-1e-05,1.5e-05,-2.8e-05,-1.5e-05,5e-06,-2e-06,-2.8e-05,-1e-06,3e-06,-2.5e-05,-1e-06,3e-05,-1.9e-05,-1e-06,1.1e-05,3e-06,2.4e-05,0.000118,-1.8e-05,9e-06,7e-06,-5.9e-05,-1.5e-05,1.8e-05,3.2e-05,-2e-06,-8e-06,9e-06,-6e-06,-1.4e-05,-4e-06,0,5e-06,-1e-05,-1e-06,3e-05,8.3e-05,0,1.1e-05,6e-06,2e-06,-9e-06,-5e-06,4.8e-05,2.6e-05,0,-9e-06,-1e-06,-4e-06,5e-06,0,-6e-06,-1e-06,5e-06,-7e-06,-2e-06,-5e-06,9e-06,9e-06,2e-06,1.3e-05,-1e-06,2.8e-05,-3e-06,-1.5e-05,-5e-06,4e-06,-1e-06,6e-06,-2.9e-05,-8e-06,1.1e-05,-7e-06,5e-06,-3e-06,-6e-06,-4e-06,0,-1.7e-05,-6e-06,8e-06,1e-05,2.1e-05,-4e-06,-9e-06,3e-06,4e-06,2e-06,-3e-06,-8e-06,-2.3e-05,-8e-06,1.2e-05,2e-05,-9e-06,1.3e-05,2.3e-05,-1e-05,1e-05,-2e-06,2e-06,8e-06,4.7e-05,-1.2e-05,2e-06,-1.6e-05,-3e-06,2e-06,2e-05,-5e-06,-2.6e-05,-4e-06,1.4e-05,-1e-06,2e-06,-3.9e-05,5e-06
-2e-05,-3.3e-05,2.2e-05,-1e-06,8e-06,-2e-06,1.4e-05,1.4e-05,-1e-06,4e-06,4e-06,-3e-06,-3e-06,3.4e-05,3e-06,0,2e-06,-8e-06,6e-06,-4e-06,-3.5e-05,-3.7e-05,9e-06,-1e-05,4e-06,3.6e-05,-7e-06,-4.7e-05,6e-06,4e-06,-2.2e-05,-1.5e-05,-8e-06,3e-06,2e-06,-7e-06,1.7e-05,1.5e-05,1e-05,-1.7e-05,-9e-05,0,-1.2e-05,3e-06,5e-06,8e-06,-2e-06,-3.1e-05,-1.8e-05,-5e-06,2.3e-05,-5e-06,4e-06,5e-06,3e-06,-1e-05,-2e-06,-4e-06,4e-06,3e-06,3e-06,-9e-06,-1e-05,-4e-06,-1.5e-05,-3e-06,8e-06,2.2e-05,1.5e-05,0,7e-06,7e-06,-5e-06,2.2e-05,1.6e-05,6e-06,7e-06,-1e-06,0,1.1e-05,-3.2e-05,-2e-06,-2.5e-05,-1e-06,7e-06,-9e-06,-1.3e-05,1e-06,1.7e-05,-3e-06,4.6e-05,1e-06,-6e-06,1.2e-05,3.4e-05,-1e-05,-4e-06,-5e-06,2e-05,-1e-06,-8e-06,6e-06,1.6e-05,6e-06,4e-06,-2e-06,-6.1e-05,9e-06,-1e-06,0,-2e-06,0,2.1e-05,-1.8e-05,1.5e-05,5e-06,-1.4e-05,-5e-06,-6e-06,-2e-06,1e-05
3.1e-05,3.2e-05,-2.7e-05,3e-06,-5e-06,-9e-06,-2e-06,-2e-06,-8e-06,5e-06,1.9e-05,0,2e-06,-3.9e-05,0,-3.5e-05,9e-06,2.1e-05,-7e-06,-3e-06,2.9e-05,4.1e-05,-4e-06,1e-06,-1e-06,-8e-06,1.7e-05,2.3e-05,9e-06,1.3e-05,6e-06,-4e-06,0,1e-05,3e-06,1e-05,-3.1e-05,1e-05,-8e-06,0,8.2e-05,-2e-06,-5e-06,-6e-06,-4e-06,2e-06,4e-06,4e-06,2e-06,-3e-06,-2.1e-05,2e-06,-4e-06,2e-06,-1e-06,1e-05,-1e-06,1e-06,-2e-06,-3e-06,-4e-06,3e-06,4e-06,1e-06,7e-06,7e-06,-2.6e-05,-1.2e-05,3e-06,1.2e-05,-1.3e-05,-9e-06,-1.2e-05,-7e-06,-9e-06,-1.7e-05,-3e-06,-2e-06,-1e-06,-1.7e-05,2.6e-05,4e-06,9e-06,-1e-06,-1.6e-05,9e-06,-1.3e-05,5e-06,-1.3e-05,3e-06,-5.6e-05,2e-06,1e-06,-9e-06,-3e-05,-3e-06,-7e-06,-1.4e-05,-2.4e-05,4e-06,-1.1e-05,5e-06,-1e-06,-5e-06,7e-06,-9e-06,8e-06,0,0,9e-06,5e-06,-1e-06,2e-06,6e-06,1.3e-05,6e-06,-2.3e-05,2e-06,4e-06,4.6e-05,-6e-06
-8e-06,-8e-06,3.2e-05,-2e-06,-3e-06,1.9e-05,-1.4e-05,-4e-06,7e-06,-1.1e-05,-2.2e-05,0,-2e-06,3.9e-05,0,2.8e-05,-1.3e-05,-3e-06,-3e-06,0,-3.2e-05,-5.9e-05,0,1.2e-05,-5e-06,-2.4e-05,-4e-06,-2.1e-05,-8e-05,1.4e-05,9e-06,5e-06,3e-06,-1.7e-05,0,-8e-06,3.3e-05,-1.9e-05,0,3.3e-05,-0.000103,0,3e-05,-1.1e-05,-2e-06,-5e-06,3e-06,2.4e-05,1.3e-05,3e-06,-4e-06,9e-06,1e-06,-1e-06,0,7e-06,-7e-06,-3e-06,1e-05,-3e-06,3e-06,5e-06,4e-06,1e-06,-1.3e-05,-2e-06,1.9e-05,-1.2e-05,1.4e-05,6e-06,4e-06,8e-06,1.8e-05,-1.2e-05,2e-06,3e-06,2e-06,0,-5e-06,1.4e-05,-1.8e-05,4e-06,2.7e-05,0,1.1e-05,-8e-06,1.1e-05,-5e-06,2e-06,5e-06,1.6e-05,-3e-06,1e-06,1e-06,2.7e-05,9e-06,1.4e-05,-1.2e-05,1.7e-05,1.3e-05,1.2e-05,-5e-06,-2e-06,1e-05,1.2e-05,3e-06,3e-06,1e-05,0,2e-06,-1e-06,-2e-06,-3e-06,4e-06,-2.5e-05,-6e-06,1.4e-05,-8e-06,-4e-06,-3.2e-05,-1.5e-05
-2.5e-05,-2.4e-05,-3.4e-05,0,8e-06,-2e-05,2.2e-05,7e-06,-5e-06,6e-06,-6e-06,2e-06,2e-06,-2.6e-05,-3e-06,1.7e-05,1.9e-05,-1.3e-05,8e-06,1e-06,4e-05,4.7e-05,2.5e-05,-4e-06,-1e-06,4.8e-05,-1.8e-05,2e-05,2.8e-05,1.7e-05,0,6e-06,1e-06,-3e-06,-3e-06,5e-06,-2.7e-05,-5e-06,7e-06,1.1e-05,0.00011,2e-06,-4.4e-05,2.1e-05,2e-06,-2e-06,1e-06,-4.3e-05,-2.6e-05,2e-06,1.3e-05,2e-06,1e-06,-4e-06,-1e-06,6e-06,2e-05,0,-6e-06,1.5e-05,0,-4e-06,-1.6e-05,0,2.1e-05,0,-1.8e-05,8e-06,-4e-06,-8e-06,4e-06,3e-06,-3e-06,2.5e-05,2.2e-05,2.1e-05,3e-06,3e-06,1e-06,-1.1e-05,2.7e-05,1e-06,-3e-06,5e-06,1e-06,5e-06,6e-06,1e-06,6e-06,-3e-06,3.1e-05,1e-06,8e-06,8e-06,-1.7e-05,1.5e-05,-1.9e-05,8e-06,-6e-06,7e-06,-1e-06,-2e-06,-6e-06,-1.1e-05,-1.4e-05,8e-06,-3e-05,1.5e-05,-1e-06,-3e-06,1e-06,-5e-06,-2e-05,8e-06,-1e-06,-4e-06,3e-06,4e-06,-4e-06,-2.2e-05,-9e-06
