0.000315,0.000189,0.000193,0.000268,9.7e-05,2.5e-05,-3.4e-05,0.000291,2.8e-05,0.000298,-6e-06,3.3e-05,1.2e-05,-7.9e-05,-0.000104,-0.00042,-0.000439,-0.006805,-0.010354,-0.006207,-0.003018,-0.004158,-0.012078,-0.009228,-0.004912,-0.007714,-0.003478,-0.004062,-0.006417,-0.01694,-0.007919,-0.002192,-0.008291,-0.001908,-0.014169,-0.018008,-0.011486,-0.009988,-0.008479,-0.02155,-0.02219,-0.032922,-0.022589,-0.016133,-0.013188,-0.007277,-0.008478,-0.006528,-0.006,-0.006289,-0.012667,-0.010019,-0.006231,-0.01743,-0.015036,-0.009002,-0.01944,-0.005904,-0.015553,-0.010775,-0.014373,-0.012505,-0.008856,-0.005549,-0.002421,-0.006653,-0.00846,-0.004416,-0.00549,-0.00432,-0.004088,-0.003958,-0.003298,-0.002937,-0.000403,0.000251,0.00019,-0.000303,-0.001766,-0.002777,-0.003843,-0.002635,-0.001498,-0.000797,-0.00095,-0.00042,-0.000604,0.001523,0.000746,-0.000207,-8.1e-05,-0.003028,-0.000146,-0.002031,-0.000872,-1.7e-05,-2.1e-05,-3e-05,6.2e-05,-0.000103,-0.000195,7.7e-05,0.000271,0.000368,0.000218,0.000126,0.000224,0.000201,0.000218,0.000372,0.000197,0.000179,0.000306,0.000632,0.000504,0.000341,0.000205,0.00042,0.000308,0.000395,0.000382
-3e-05,-8.6e-05,-8.6e-05,-8.4e-05,-0.00012,4.2e-05,-0.000106,-7.4e-05,-5.7e-05,-9.4e-05,-4.2e-05,-6e-06,0.000275,-1.7e-05,-4.1e-05,7.9e-05,-8.9e-05,0.006484,0.008488,0.004428,0.002091,0.000392,0.003665,0.002861,0.001636,0.006092,0.003631,0.00339,-0.00064,0.009594,0.006323,0.003123,0.003396,0.003162,-0.001719,-0.001399,-0.005323,0.006615,0.000688,0.005204,0.004669,0.015466,0.014467,-0.002926,-0.004426,0.001571,-0.005593,-0.006101,-0.00822,-0.006556,-0.005913,-0.007037,0.001644,-0.000118,-0.001055,-0.00486,0.002546,-0.005776,-0.002776,-0.004326,-0.001542,0.000695,-0.000465,-0.001015,-0.000873,-0.003043,-0.003305,-0.001729,0.000604,0.001333,-0.001067,-0.00026,-0.001937,-0.001446,-0.002254,-0.001754,-0.001432,-0.000513,-0.000334,-0.00278,-0.00135,-0.002809,-0.001479,-0.000337,-0.000314,-9e-05,0.000386,0.000502,0.002095,0.002692,0.001395,-0.000316,-0.001691,-0.001999,-0.000541,0.000305,-0.000147,9.5e-05,-0.00012,-0.000116,2.7e-05,9.1e-05,0.000202,0.000564,0.000473,0.000321,0.000165,0.000179,2e-04,0.000158,-2e-06,9.4e-05,9e-05,0.000376,8.8e-05,0.000203,0.000131,0.000226,4.4e-05,4.6e-05,3.9e-05
-0.000215,-0.000108,0.000121,-0.000148,-5.3e-05,-7.5e-05,6.3e-05,-7e-05,0.00012,-0.000161,-0.000117,-7e-05,-5.4e-05,-2e-06,-0.000236,-0.000209,-0.000177,-0.003087,-0.007314,-0.004279,-0.001148,0.000137,-0.001194,-0.00072,-0.000481,-0.003722,-0.002269,-0.001756,-0.004507,-0.00452,-0.002456,-0.000241,-0.000866,-0.001892,-0.00382,-0.003368,-0.00683,-0.009772,-0.007831,-0.006537,-0.006236,-0.013681,-0.013092,-0.006202,0.002377,-0.004345,-0.000342,-0.000998,-0.001098,-0.002161,-0.001548,-0.002384,-0.005006,-0.001885,-0.00122,-0.000962,-0.000994,-0.001558,-0.006168,-0.000107,-0.003029,-0.003026,-0.001257,0.001257,-0.001221,0.000462,-0.000637,-0.001579,-0.001198,0.000723,0.000796,-0.000747,-0.003925,-0.001303,-0.001616,0.000214,-0.001007,-0.000392,-0.000532,-0.002135,-0.001746,2.6e-05,-0.000825,-5e-04,-0.000262,-0.000727,-0.000259,-0.001637,-0.001103,-0.000954,-0.000596,0.000343,0.000343,-0.000448,-0.000375,-0.000204,-0.000164,-0.00027,-6.7e-05,-0.00012,-2.6e-05,-0.00031,9.1e-05,-9.6e-05,-0.000139,0.000158,-0.000189,-3e-06,-1e-06,9.4e-05,0.000197,0.000143,2e-06,0.000221,-5e-06,0.000132,-5.8e-05,-0.000147,2.9e-05,-1.9e-05,-5.5e-05
-8.1e-05,-5.9e-05,2.4e-05,1.9e-05,2e-06,-6.4e-05,-4.1e-05,-6.1e-05,3.8e-05,-0.00017,-6e-05,0.000144,8e-05,-9e-05,-3.4e-05,-3.9e-05,7e-05,0.000659,0.001105,0.000194,-1.6e-05,0.000861,-0.000815,-0.001178,0.000741,0.001799,0.002036,0.000402,0.002725,0.00093,-0.000572,-0.00012,0.002038,-8e-06,0.001243,0.001669,0.002782,0.000935,0.000898,-0.000453,0.000432,0.000798,0.000109,0.004477,0.001485,-0.001071,0.000224,-0.000975,-0.000495,0.001363,0.000536,0.00255,0.001425,-0.002006,0.001531,-0.002653,-2.8e-05,0.000628,0.001464,7e-06,0.001029,0.001569,-0.000737,-0.003024,-0.00159,-0.001626,0.000121,0.000515,0.000148,-0.001554,0.000526,0.000227,0.00128,0.000343,0.001301,0.000543,1.2e-05,0.000195,0.000567,0.000814,0.001373,0.001517,0.000523,0.00034,-0.000439,2.3e-05,0.000114,-0.000703,-0.00094,0.000154,-9.9e-05,-0.001107,-5.3e-05,-0.001133,-0.000515,-0.00019,-0.000178,-0.000117,-0.000106,3.2e-05,-3e-05,-0.000212,-8e-05,0.00016,-0.000109,5.5e-05,-5.2e-05,0.000112,-8.7e-05,7.1e-05,-1.7e-05,0.000227,-3.7e-05,0.000161,5.9e-05,0.000134,4.3e-05,-8.1e-05,0.000125,0.000245,-2.9e-05
8.2e-05,2.1e-05,-4.7e-05,-0.000112,3.6e-05,5.2e-05,1.6e-05,8.1e-05,-3.9e-05,-2e-06,2.7e-05,-4.8e-05,-9.9e-05,-7.5e-05,9.8e-05,9.2e-05,0.00017,0.000437,-0.002112,0.000362,0.000531,-0.000272,-9.4e-05,0.001918,0.00076,-0.000628,-0.001337,-0.000484,0.000375,-0.001096,0.000801,-0.000208,0.000782,-0.002252,-0.005032,0.001684,-0.004048,-0.007106,-0.003078,-0.000249,0.001745,-0.002436,-0.003235,-0.002262,-0.000816,-0.002754,-0.004403,0.000339,0.001935,0.000468,-0.001676,-0.000755,0.001005,0.003361,-0.000112,-0.004804,0.002661,-0.001318,0.006145,0.004626,0.002618,-0.0031,0.000625,-0.001594,0.001107,0.000591,0.000986,0.000978,0.000175,0.000508,-0.000985,-0.000844,6e-04,-0.001127,0.000445,0.000174,-0.000102,7e-06,0.000188,0.000374,0.000343,0.000348,0.000389,-0.000304,0.000148,-4.5e-05,0.00056,-0.000656,-0.001047,-0.001043,-0.000577,-0.000533,-0.000196,-0.000765,-0.000534,-0.000197,9.3e-05,0.000215,0.000105,7.8e-05,2.3e-05,-1.7e-05,-0.000142,1.8e-05,-0.000261,-1.8e-05,-9.2e-05,-1.3e-05,-0.000182,-0.000102,-0.000131,0.00022,-0.000136,7.2e-05,2.6e-05,6.3e-05,-8.4e-05,-0.000108,5.1e-05,0.000155,-3.5e-05
-3e-06,-9e-05,7e-05,-2e-05,-9e-05,-4e-06,2.6e-05,-6e-06,5.4e-05,-4.5e-05,-1.8e-05,-2.2e-05,-3.4e-05,-0.000143,-2e-06,0.000148,5.9e-05,-0.000447,0.001303,0.000292,-0.000747,0.000456,0.000618,-0.003978,-0.000963,-0.000104,0.000633,0.000546,0.000916,-0.000312,-0.000763,-0.00032,0.000459,0.001595,-0.000836,-0.007697,0.001363,0.002571,0.000618,0.001762,-0.003002,0.005295,0.003422,0.004722,-0.000152,-0.002424,0.000477,-0.000643,0.000818,0.000106,0.002261,0.002826,0.002441,-0.001577,-0.002249,0.004077,-0.000706,0.000986,-0.004056,-0.005237,-0.00522,0.002582,0.002584,0.00148,5.4e-05,-0.000776,0.001238,0.00044,-0.000327,-0.000739,5.9e-05,0.000521,0.000567,0.000955,-0.000273,-0.001079,5e-05,0.00036,9.9e-05,8.1e-05,-0.002069,-0.000348,-5.6e-05,0.000143,-0.000282,0.000244,0.00039,-0.000272,-0.002737,-0.000549,0.000454,-0.00025,0.000282,0.000217,-0.000184,-0.000125,-0.000395,-1.5e-05,6.5e-05,9.9e-05,8e-05,-9.2e-05,-2.2e-05,-0.000132,-0.000184,4.9e-05,-5.3e-05,-7.4e-05,-5.6e-05,-4e-05,-0.000132,4.3e-05,-1.1e-05,-3.4e-05,-0.000185,1.2e-05,-5.8e-05,5.3e-05,-7.7e-05,-6.2e-05,2.1e-05
-5.2e-05,-0.00018,-4e-06,-3e-06,-0.000124,-3.8e-05,-8.4e-05,-9.5e-05,-3.6e-05,-5.5e-05,-0.000127,-1.6e-05,-6.6e-05,9e-06,4.9e-05,-6.2e-05,-0.000193,0.000267,-4.2e-05,0.000728,0.000824,-0.000975,-7.1e-05,0.003433,0.001152,-0.000504,-0.000962,-0.000324,-0.002124,-0.001081,0.000582,3.9e-05,0.000393,-0.000113,-0.001706,0.002467,-0.000513,-0.000593,-0.002239,-0.000503,-0.0027,-0.004719,0.000985,-0.000883,0.002631,-0.000297,-0.001589,-0.001594,0.001703,-0.001874,-0.003152,0.001344,0.000859,0.00012,-0.001637,0.002032,-0.000522,0.001441,0.001182,0.002888,0.001444,6.4e-05,-0.002139,-0.001131,0.000671,0.002376,0.000237,0.00049,0.000402,0.000562,-0.000136,-0.000698,-0.000244,0.000531,-0.00038,-0.000306,-0.00017,0.00026,-0.000135,0.000117,0.000611,-0.000575,-0.000235,-0.000358,0.000117,-0.00026,-0.000368,-0.000301,-0.001028,-0.000651,-4.4e-05,-0.000137,-0.00086,-0.000273,-0.00074,-0.000344,0.000275,1.5e-05,0.000148,-8.6e-05,-0.000111,-7.3e-05,-0.000111,-0.000102,-0.000123,2.6e-05,-8e-05,-0.000147,-0.000129,-0.000165,-0.000158,-0.000106,3.5e-05,-5.6e-05,-0.000207,9e-06,-0.00011,-0.000126,-0.000163,-0.000213,-0.000101
-1.8e-05,-1e-05,-4.8e-05,1.1e-05,-3.7e-05,2e-05,-2e-05,-2e-06,-0.000136,-5.1e-05,-2.6e-05,-2.7e-05,-6.8e-05,-5.7e-05,7.8e-05,-8.9e-05,9.9e-05,-9e-06,-0.000378,-0.000393,-0.000267,-7e-06,0.000117,-0.003169,-5.3e-05,0.001168,0.001063,0.000909,0.001257,0.002,-0.000184,-0.000486,0.000157,-0.000929,-3.2e-05,-0.002425,0.001968,-0.000108,-0.002211,0.001748,-0.001193,-0.000837,0.001152,0.000535,0.001845,-0.002256,-0.001391,-0.001915,-0.000447,-0.001605,-0.000649,-0.001902,-0.001886,-0.001997,0.001643,0.000477,-0.00117,-0.000501,-7e-05,-0.001368,-0.001348,-0.000954,0.000104,0.000235,0.001162,-0.000175,-0.000904,-0.000572,-0.00029,0.000395,-0.000889,0.000673,0.000132,0.000836,0.000397,0.00038,0.000512,0.000112,0.000243,-0.000422,0.000254,-0.000486,-0.000511,0.000248,0.000189,-7.4e-05,-2.5e-05,0.000147,-0.000493,-0.000259,0.000264,0.000209,-0.000569,-0.000664,-0.000727,-0.000291,-4.7e-05,-2.1e-05,3.8e-05,-0.000145,-1.3e-05,-2.1e-05,1.6e-05,-5.2e-05,-3.1e-05,-4.5e-05,-2e-06,-8e-05,-3.9e-05,-0.000101,-0.000182,-6.3e-05,-2.2e-05,-7e-05,-0.00011,-0.000143,-0.000133,-0.000116,-7.8e-05,-6.9e-05,-9.2e-05
-3.7e-05,4.2e-05,-3.5e-05,-8.7e-05,5.6e-05,5e-05,-7e-05,3.8e-05,-0.000106,-4.5e-05,1e-06,4.2e-05,5.5e-05,3.8e-05,-3.8e-05,-1.8e-05,-9.8e-05,-0.000257,-1e-05,-0.000734,4.6e-05,-0.000409,-0.000202,0.001856,0.000584,-0.000917,-0.000699,-0.000594,-0.000914,-0.000636,-0.000604,-0.000514,-5.8e-05,-0.000795,-0.000626,0.001183,0.001248,-0.001852,0.000317,-0.001293,0.001336,-0.000125,-0.001182,-0.001337,-0.000728,0.002185,-0.001029,0.001054,-0.001547,0.002028,0.000393,-0.002402,-0.001651,0.002019,0.000355,-0.000738,-0.000687,0.001173,-0.000705,3.1e-05,-0.000273,-0.001408,-0.001097,-0.001046,-0.002476,0.00031,0.000853,0.000158,-0.000527,-0.000399,-5.9e-05,-8.9e-05,0,-0.000921,-0.000754,-0.000344,-0.000252,2.1e-05,5.1e-05,-4.1e-05,0.000411,0.000476,-0.000296,0.000267,3.6e-05,-0.000292,-0.000141,-0.000345,0.000809,1.3e-05,-0.00027,-5.8e-05,3e-06,6.2e-05,0.000657,0.000468,0.000139,-0.000151,-0.000122,2.2e-05,6.8e-05,1.8e-05,2.8e-05,-0.000143,-9.5e-05,-5.6e-05,-0.000113,-4.2e-05,-1.6e-05,-3.6e-05,-4.1e-05,-3.2e-05,-0.000109,-0.000129,-0.000129,-0.00013,-6.2e-05,-9.8e-05,-6.5e-05,-0.000108,-3.5e-05
8e-06,8.8e-05,-3.3e-05,5e-06,2.9e-05,2.6e-05,3.6e-05,-2.9e-05,-2.9e-05,-5.8e-05,-3e-06,-2.5e-05,-2.2e-05,-3e-06,-3.4e-05,1.6e-05,0.00011,0.000181,0.000314,0.000181,-0.001172,0.000197,4.6e-05,0.000323,-0.00067,0.000939,0.000441,0.000773,0.00023,-4.6e-05,-0.000644,-0.000614,0.000121,0.000108,0.000851,0.000171,-0.003164,0.000896,0.001286,0.001339,0.000757,-0.000195,-0.000464,-0.00333,-0.000329,-0.00014,0.00016,-0.001966,-0.001129,-0.000631,0.000548,0.001691,0.000544,-0.001132,0.000591,0.000569,0.000474,-0.003269,0.001646,-0.001385,0.000786,0.000587,-0.001164,-0.000877,6.6e-05,-0.000307,-0.000738,-0.000261,-0.000511,-0.000221,0.000604,-0.000916,5e-06,-0.000151,7.9e-05,1.4e-05,5.5e-05,5e-06,7.9e-05,0.000358,-2.5e-05,-0.000305,0.000461,0.00011,2.6e-05,5.1e-05,5.2e-05,-0.000103,0.000188,0.000594,-0.000336,-0.000127,0.000657,0.000604,0.00068,0.000551,-7e-05,4.1e-05,8e-06,-3.3e-05,-8.5e-05,5.6e-05,1.7e-05,-8.8e-05,-9e-05,-0.00011,-2.5e-05,0,-4.8e-05,-1.5e-05,4.3e-05,-8.3e-05,-0.000109,-3.8e-05,-8.1e-05,1.5e-05,-1e-05,-1.1e-05,8e-05,-3.1e-05,-5e-05
-2e-05,7e-06,-1.4e-05,0,-1.2e-05,1.7e-05,1.9e-05,-1.2e-05,8e-06,2.7e-05,1e-05,-8e-05,-2.5e-05,5.3e-05,1.4e-05,1.7e-05,1.9e-05,5.2e-05,-7e-06,0.000283,0.000345,-0.00015,2.9e-05,-0.000553,0.00019,-0.000541,-2e-05,-0.000768,0.000182,-0.000664,0.000159,0.000662,0.000267,-0.000122,-0.0011,0.00022,0.002203,0.000735,-6.1e-05,0.000941,0.000346,0.000526,0.000262,0.002841,-0.001122,0.000901,0.000248,0.001334,-2.3e-05,-0.000462,-0.000139,-0.000836,0.001393,0.000269,-0.002078,0.00153,0.000836,0.002533,-0.00033,0.00031,-0.000694,0.000191,0.001205,9e-05,-0.000597,-0.000608,-3e-05,7.3e-05,0.000136,0.000262,1.2e-05,0.000326,-0.000263,0.000368,0.000206,0.000112,0.00016,-0.000467,-8.5e-05,-0.000112,-8.7e-05,-0.00086,-0.000253,-0.000109,-4.8e-05,-7.4e-05,-0.000165,-0.000143,-0.000631,-0.000535,-0.000634,6.6e-05,0.000386,-0.000209,-0.000182,-2.1e-05,-0.000173,-0.000176,-3e-06,1.9e-05,1e-05,0,1.3e-05,-5e-06,-1.3e-05,-6.4e-05,-0.000121,1.2e-05,-3.6e-05,3.4e-05,-2e-06,1.5e-05,-5.3e-05,4.3e-05,-3.8e-05,-3.4e-05,-9e-06,3e-05,-3e-06,-2.7e-05,-4.6e-05
-1.9e-05,-1.3e-05,-2.4e-05,3e-06,2.2e-05,5e-06,4e-06,-1.3e-05,3.2e-05,3.9e-05,1.6e-05,-3.4e-05,-6e-06,-2.1e-05,-6.6e-05,-3.6e-05,-7.2e-05,-6.5e-05,-0.000194,-0.000222,-0.000218,-9e-05,-0.000136,-0.000444,-0.000678,0.00061,-0.000163,0.000402,-0.000106,0.000278,-1.1e-05,-0.000672,-9.3e-05,-0.000414,-0.000296,-8.9e-05,0.001586,-7.7e-05,0.001276,-0.001682,-0.00021,0.001238,6e-04,-0.001625,0.00014,-0.000371,-0.000506,-0.00119,0.000456,-0.000445,0.000543,0.000717,-0.000866,-0.000849,0.000284,-0.001313,-0.000964,-0.002256,-0.00049,0.001454,0.001129,0.000218,2e-06,0.000447,-0.000695,-0.00041,0.000513,-8e-06,0.000246,0.000362,3.7e-05,-0.000215,-0.000383,6e-06,0.000128,-0.000129,-0.000156,-0.000301,0.000127,1.4e-05,-0.000178,8.2e-05,6.5e-05,-0.000124,-9e-06,-9.3e-05,2.4e-05,6.2e-05,-5.3e-05,0.000136,-0.000144,-0.000238,0.000126,1e-04,-2.3e-05,0.000114,7e-05,3.7e-05,4.3e-05,9e-06,-1.8e-05,4.4e-05,-4e-06,4e-06,-3e-06,-5.1e-05,-2.7e-05,1.4e-05,1.3e-05,3.2e-05,-2.2e-05,-1.3e-05,6e-06,-5e-06,-4.5e-05,-3.9e-05,-2.2e-05,-2.2e-05,-2e-06,-1.5e-05,7e-06
-1.2e-05,-3e-06,-1.4e-05,5e-06,-1.8e-05,-7e-06,-5e-06,-8e-06,-6e-05,-7e-06,-1.1e-05,1.2e-05,-8e-06,-3.1e-05,-3e-06,4.2e-05,-1.5e-05,-1e-06,5.5e-05,-0.000246,-9.1e-05,0.000518,-8.5e-05,0.000327,0.000945,0.000125,-2.9e-05,-0.000117,3.4e-05,8.3e-05,0.000724,-0.000111,-0.000243,-4.1e-05,0.000139,0.000188,-0.000107,-0.000287,-0.001277,-0.000709,-0.001353,0.00011,-0.000664,0.000635,7e-05,-0.000911,0.00021,7.8e-05,1.7e-05,0.000246,-2.2e-05,-0.000146,2e-04,0.00031,0.000336,0.000644,-0.000575,0.000819,0.000653,-0.000679,-0.00107,0.000805,-3.8e-05,0.000247,0.000366,0.000257,1.6e-05,3.6e-05,7.7e-05,-0.000431,-0.000391,8.9e-05,0.000467,0.000209,-0.000161,-0.00013,0.000154,1.5e-05,-6.8e-05,-0.000143,-9.7e-05,0.000234,-1.4e-05,6.9e-05,1.2e-05,0.000271,-4e-05,-2.7e-05,-0.000344,-0.000487,-0.000241,0.00014,6.6e-05,-0.000138,7.6e-05,0.000104,0.000136,4e-06,-3.2e-05,1.4e-05,-1.4e-05,-1.4e-05,1.1e-05,4.2e-05,-3e-06,1.2e-05,-3.4e-05,-2.1e-05,5e-05,2.3e-05,-1.2e-05,-4.9e-05,-2.3e-05,-3.1e-05,-1.6e-05,-2.3e-05,0,6e-06,-2.8e-05,4e-06,1.1e-05
1.9e-05,0,1.6e-05,-7e-06,-3.5e-05,-2e-06,-9e-06,-1e-06,3.3e-05,2e-06,4e-06,4.8e-05,8e-06,7e-06,-2.3e-05,-8e-06,-4e-06,1.7e-05,0.000119,0.000371,0.000659,-0.000271,3.9e-05,-9.8e-05,-0.001343,-0.000103,7e-06,2.7e-05,-0.000102,4.2e-05,-0.000289,0.000484,-0.000541,-8e-05,3.6e-05,-0.000309,-0.000555,0.000517,-0.000359,-0.002267,0.000142,-0.000847,0.000144,0.000517,0.001094,-4.1e-05,-0.000267,0.00029,-2.5e-05,-0.000298,0.000775,-0.00055,0.000362,0.000347,-7.3e-05,-0.001119,0.000536,0.000321,-0.000777,-0.00029,8.2e-05,-0.000869,-0.000294,0.000355,-0.000167,0.000234,-8.6e-05,-1.8e-05,-8.6e-05,0.000146,7.3e-05,0.000218,-0.00014,-0.000211,2.1e-05,0.000239,-9.5e-05,-4.7e-05,4.4e-05,-5.4e-05,5.5e-05,0.00034,0.000232,0.00011,-6e-05,2.2e-05,-1.6e-05,-6e-06,0.000172,-9e-06,7.6e-05,2.9e-05,-2.5e-05,-8.2e-05,9e-06,-0.000221,-3.7e-05,3.8e-05,-2.6e-05,-3.6e-05,2.6e-05,-2e-05,1.3e-05,5.6e-05,-1e-06,1e-05,1.6e-05,-2.6e-05,7e-06,-1e-06,4e-06,-4e-06,-5.4e-05,-3.6e-05,-1.2e-05,-3e-06,-1e-05,4.5e-05,-1.4e-05,1e-05,5e-06
5e-06,2.1e-05,3.5e-05,4e-06,8e-06,-1e-05,-2e-06,1.7e-05,2e-06,1e-05,0,3e-05,1e-05,1.4e-05,-4e-06,-2.3e-05,9e-06,-1.9e-05,-5.5e-05,-0.000137,-0.000152,0.000127,-3.3e-05,-1.2e-05,0.000121,0.000217,-5.2e-05,-5e-06,-1e-04,4.7e-05,-8.3e-05,-0.000308,-9.9e-05,-1e-04,-1.8e-05,0.000159,0.000415,-0.000339,0.000462,-1.9e-05,-0.000225,0.000283,-0.000539,-0.001546,-0.000681,7.4e-05,0.000218,0.001198,-0.000622,-0.000199,0.000164,0.000827,-0.000871,0.000557,-0.000527,0.000679,-2.9e-05,-0.001119,0.000433,7.8e-05,0.000719,0.000518,0.000421,-0.000141,-3.9e-05,-0.000114,-0.000198,-1.5e-05,-0.000236,-0.000106,-0.000113,7.9e-05,-3.8e-05,-0.000119,-0.000103,-2e-06,-2e-06,-8.3e-05,-7.5e-05,-1.9e-05,0.000121,-0.000223,4.5e-05,5.4e-05,-4.1e-05,-4.7e-05,-3.4e-05,-4.9e-05,0.000122,0.000308,-5.3e-05,0.000154,-0.000115,3.9e-05,-1e-06,7.4e-05,-1.3e-05,8e-06,-3e-06,-3.7e-05,-2e-06,2.2e-05,-1.2e-05,-1.9e-05,-1e-06,-1.3e-05,-9e-06,-5e-06,-4.4e-05,-3e-06,-9e-06,2.5e-05,2e-06,-2.8e-05,7e-06,8e-06,-6e-06,2.1e-05,2e-05,6e-06,-5e-06
-5e-06,2.1e-05,2.6e-05,8e-06,2.2e-05,-3e-06,-1.9e-05,6e-06,-1.1e-05,0,-2e-06,-8e-06,-1e-06,-4e-06,5e-06,-1.8e-05,6e-06,3.5e-05,-6.1e-05,2.9e-05,-6e-05,-0.000189,-2e-05,0.000147,0.000529,-0.000202,-7.3e-05,-4.5e-05,-3.7e-05,-0.000105,-8.2e-05,-8e-06,5.4e-05,-6.5e-05,-2.1e-05,-0.000384,-0.000765,-0.000322,6.4e-05,0.000101,0.000388,-7.3e-05,-5.3e-05,0.000962,0.000336,0.000358,-0.000502,-0.000508,-0.000144,0.000721,-0.000207,0.000154,8.8e-05,-0.000426,0.001181,0.000626,1.9e-05,0.00044,-0.000281,-0.000433,0.000682,-0.000472,-0.000101,0.000349,0.000129,-0.00011,-6.2e-05,-6e-06,0.000195,-0.000134,5.8e-05,-0.000137,4.8e-05,6e-05,0.000211,-9.2e-05,1.8e-05,-9e-06,-1.3e-05,-4.5e-05,-3.6e-05,0.000136,1.9e-05,-7.2e-05,8.3e-05,8e-06,7.6e-05,3.1e-05,3e-05,-5.8e-05,0.000192,0.000116,-7.4e-05,-5.6e-05,8.9e-05,-0.000101,3e-06,1.5e-05,5e-06,-1.5e-05,-4e-06,2e-05,1.5e-05,-2.2e-05,-4e-06,1.6e-05,1.7e-05,-6e-06,-6e-06,1e-05,4e-06,-3e-06,1.2e-05,1e-06,-8e-06,-1.2e-05,-8e-06,4e-06,-2e-06,-2e-06,1e-05
4e-06,1.6e-05,-3e-06,-1e-06,0,3e-06,-2e-06,-8e-06,-2.8e-05,-3e-06,5e-06,-2e-06,2e-06,0,3e-06,4e-06,3e-06,-1.2e-05,5.2e-05,-4.5e-05,0.00016,0.00015,-1.9e-05,-0.000113,-0.000184,0.000188,6e-06,5.4e-05,-4.3e-05,-0.000106,8.6e-05,-0.000136,-0.000134,-6.5e-05,-0.000112,0.000473,0.000366,-0.000247,-0.000271,-0.000448,-0.000297,0.000103,-0.000265,-0.000599,-0.000569,-0.00021,0.000134,-2e-05,8.2e-05,-0.000116,0.000104,-7.5e-05,0.000442,-0.000171,-0.001309,-0.000765,0.000262,3.9e-05,-5.8e-05,-0.00021,-0.000258,0.000549,-0.000249,-9.5e-05,0.000129,-0.000107,-8.9e-05,1.9e-05,0.000135,-1.7e-05,2.2e-05,-2.3e-05,4.3e-05,-2.7e-05,-3.1e-05,-0.000111,1.7e-05,7.9e-05,-3e-05,-3.3e-05,-8e-06,-0.000114,2.4e-05,-9.8e-05,2.5e-05,6e-06,-2.7e-05,2e-06,-0.000176,-6.5e-05,7.1e-05,3.2e-05,6e-05,-2.7e-05,1e-04,0.000134,2.1e-05,-1.1e-05,0,2e-06,-3e-06,-6e-06,-9e-06,1e-06,-4e-06,5e-06,-1e-05,3e-06,1e-05,5e-06,-1e-06,-4e-06,9e-06,9e-06,-1.9e-05,-2e-05,-6e-06,8e-06,1.1e-05,-1.1e-05,1e-06
2e-06,1e-06,-5e-06,-4e-06,5e-06,-3e-06,-3e-06,2e-06,-1e-05,3e-06,2e-06,-9e-06,0,-2e-06,7e-06,6e-06,1.4e-05,-9e-06,4.3e-05,7.8e-05,-0.000111,0.000143,3.2e-05,9e-05,9e-05,-0.000176,-3.4e-05,-3.3e-05,7.5e-05,1e-04,-4.6e-05,9.5e-05,0.000221,8.3e-05,5.3e-05,-2e-04,-0.000298,4.6e-05,0.000516,0.000149,-4.4e-05,0.000131,6.2e-05,0.000848,0.000333,8.8e-05,0.000172,9.3e-05,-0.000231,-5.5e-05,-0.000221,1.5e-05,-1e-05,0.000244,0.000696,-0.000258,0.000236,0.000351,5.9e-05,0.000392,6.7e-05,0.000225,-1.3e-05,0.000224,-4.4e-05,4.6e-05,-0.000157,1.4e-05,-4.3e-05,5.1e-05,5.3e-05,7.2e-05,0,-3.9e-05,8.5e-05,-4.4e-05,-3.8e-05,5.5e-05,8e-06,6e-06,-6e-06,-0.00015,-2e-06,2e-05,-3.5e-05,-1.1e-05,4.8e-05,1.4e-05,-0.000136,1e-05,0.000132,7.8e-05,5.2e-05,1.2e-05,-4e-06,1.3e-05,2e-06,1e-06,-3e-06,-1.4e-05,0,1.7e-05,7e-06,-1.6e-05,-9e-06,3e-06,-1e-05,1.3e-05,3e-06,6e-06,0,1.4e-05,-8e-06,-2e-06,-1.6e-05,1.2e-05,-2e-06,7e-06,7e-06,-1.3e-05,-7e-06
-4e-06,-1e-06,-3e-06,2e-06,-3e-06,-5e-06,6e-06,0,8e-06,2e-06,-2e-06,-4e-06,1e-06,-1e-06,4e-06,-1.1e-05,-1.2e-05,4e-06,-4.1e-05,-6.6e-05,1.4e-05,-0.000106,-1.5e-05,-0.00029,0.000104,5.9e-05,3e-05,-2e-06,-2.6e-05,4.8e-05,-4.1e-05,-3.3e-05,0.000105,-4.7e-05,-4.1e-05,-4e-06,-0.000222,0.000126,-0.000553,0.000112,-6.7e-05,-8e-06,-0.000165,-0.000814,0.000213,-0.000101,-0.000415,-2.1e-05,-8.9e-05,0.000192,0.000128,-0.00022,9.3e-05,-4.8e-05,-0.000173,7.4e-05,2e-06,-0.000445,0.000182,-0.000373,-0.000498,-0.000223,9.6e-05,-0.000231,0.000175,-0.000171,0.000189,-2.6e-05,-3.7e-05,2.9e-05,1.6e-05,-2.3e-05,6e-06,3e-06,-6.6e-05,1.6e-05,-4.3e-05,2.6e-05,1.9e-05,-3.2e-05,-2.2e-05,1.9e-05,3.7e-05,-9e-06,-2.1e-05,-3e-06,-1.7e-05,-5e-06,-1.5e-05,-6.5e-05,-2.9e-05,3.4e-05,1.7e-05,-2.7e-05,-4.2e-05,-0.000101,3e-06,-7e-06,0,6e-06,-1e-06,2e-06,-1e-06,4e-06,-1e-05,-1.4e-05,-5e-06,2e-06,-5e-06,6e-06,-5e-06,-6e-06,-1.3e-05,1e-06,-1.7e-05,-3e-06,-5e-06,4e-06,-5e-06,-5e-06,-1e-06
-1e-06,0,-4e-06,0,-8e-06,0,1e-06,-4e-06,4e-06,1e-06,0,4e-06,2e-06,1e-06,4e-06,5e-06,0,-5e-06,-2.7e-05,7.7e-05,-5.6e-05,2.5e-05,-3e-06,0.000318,-7.1e-05,-7e-05,0,1.4e-05,2.6e-05,-6.9e-05,7.8e-05,9.6e-05,6.6e-05,-4.8e-05,3.2e-05,0.000204,0.000137,-0.000152,0.000419,5.2e-05,3.5e-05,0.000126,0.000274,0.000466,-0.000257,8.3e-05,0.000184,-0.000148,-0.000128,-0.00014,-7.8e-05,6.2e-05,-5.6e-05,-0.000137,-3.8e-05,0.000279,-0.000205,0.000477,-0.000352,0.000162,0.000384,-0.000204,-6e-05,0.000152,-0.000232,2.7e-05,-3.7e-05,7e-06,2.4e-05,-0.000101,-0.000109,-3e-05,1.4e-05,2.5e-05,4.9e-05,8.7e-05,4.2e-05,4.6e-05,-1.1e-05,-1.2e-05,-4.1e-05,5e-05,-1e-06,2.4e-05,8e-06,-3e-06,1.2e-05,-4e-06,6.1e-05,-1.5e-05,-6.4e-05,4.2e-05,-1.2e-05,-1.7e-05,1.1e-05,-5.5e-05,-1.5e-05,-1.9e-05,6e-06,1.3e-05,-4e-06,2e-06,2e-06,7e-06,-1e-06,-1e-05,-1.3e-05,-5e-06,-4e-06,2e-06,-6e-06,-1.1e-05,-1e-06,5e-06,-9e-06,-8e-06,-4e-06,-1e-06,-9e-06,0,-1e-06
2e-06,7e-06,-3e-06,1e-06,-9e-06,-1e-06,-3e-06,0,-2e-06,4e-06,3e-06,-1e-06,-1e-06,1e-06,3e-06,7e-06,-8e-06,-2e-06,3.5e-05,-0.000105,-0.00012,5.8e-05,1.9e-05,-0.000221,9.8e-05,-4e-05,-1.5e-05,-3.4e-05,-8e-06,5e-06,-0.000107,-0.000119,2.6e-05,2e-06,-2.9e-05,-0.000321,-3.7e-05,1.5e-05,-0.000347,-0.000182,0.000238,-2.6e-05,-3.5e-05,4.1e-05,0.000128,-0.000245,-0.000249,0.000357,4e-05,0.000106,0.000106,5.4e-05,-4.1e-05,0.000145,0.000259,-0.000148,-0.000223,-0.000189,0.00022,0.000164,-7.5e-05,3.6e-05,2.6e-05,-0.000103,-3.6e-05,-8.4e-05,-1.1e-05,1.7e-05,-0.000124,8.4e-05,5e-06,-1.7e-05,2.3e-05,-4.4e-05,-0.000123,-3e-06,-1e-06,6.3e-05,-4e-06,3e-06,2.9e-05,6.4e-05,1.1e-05,-4e-05,1.6e-05,1e-05,-1.4e-05,3e-06,3.6e-05,5.1e-05,-1.2e-05,4.1e-05,-2.3e-05,0,3e-05,-1.5e-05,-7e-06,-3e-06,7e-06,1e-06,2e-06,-1e-06,0,0,1e-06,-6e-06,-3e-06,-7e-06,-1e-06,2e-06,-6e-06,1e-06,1e-06,-7e-06,-4e-06,-3e-06,-4e-06,2e-06,-7e-06,3e-06,0
-1e-06,1e-05,-2e-06,0,6e-06,-1e-06,-2e-06,5e-06,-1e-06,4e-06,-1e-06,-1e-06,0,1e-06,-2e-06,4e-06,7e-06,4e-06,1.8e-05,5.2e-05,0.000182,-6.3e-05,-1.1e-05,0.000219,-7.2e-05,-2.7e-05,0,3.4e-05,-2e-05,6e-06,0.000106,2e-06,-1.7e-05,1e-06,-1e-05,5.3e-05,0.00021,2.4e-05,2.5e-05,0.000299,0.000147,-1.9e-05,1.2e-05,1.4e-05,-0.000208,-2.1e-05,0.000102,-0.000229,-0.000142,4.5e-05,5.9e-05,-0.000204,0.000117,-0.000187,-0.000204,-0.000111,-1.9e-05,0.000115,4.2e-05,-7.5e-05,9e-06,0.000169,0.000119,7e-05,1.1e-05,0.000107,7.2e-05,-1.5e-05,-4.2e-05,-9.3e-05,-4.4e-05,4.9e-05,-1.8e-05,-2.4e-05,2.2e-05,-5.7e-05,3e-06,-3e-05,-1.2e-05,-3.4e-05,4.7e-05,-2.9e-05,1.4e-05,1.4e-05,7e-06,2e-05,2e-06,4e-06,-3.6e-05,-2e-05,-5.6e-05,1.8e-05,-1.8e-05,-2.3e-05,1e-06,-9e-06,-1.3e-05,-8e-06,-2e-06,-9e-06,3e-06,9e-06,-3e-06,4e-06,-5e-06,0,-1.2e-05,-1e-06,-1e-06,-2e-06,2e-06,-5e-06,-3e-06,-6e-06,-5e-06,1e-06,-3e-06,8e-06,4e-06,8e-06,-2e-06
0,8e-06,2e-06,-1e-06,8e-06,1e-06,-6e-06,-3e-06,4e-06,-5e-06,-1e-06,-5e-06,1e-06,-1e-06,1e-06,-7e-06,1e-06,-3e-06,-2.9e-05,1.8e-05,-0.00012,3.2e-05,2e-06,-0.000196,4.5e-05,-1e-05,2e-06,-3.1e-05,1.3e-05,-4.1e-05,-4e-06,-3.6e-05,-2.4e-05,-1.5e-05,-1.5e-05,2.1e-05,-0.000511,2.4e-05,-5e-05,0.000141,8.1e-05,-9.3e-05,1.3e-05,0.000107,0.000138,0.000153,-0.000321,0.000151,1.3e-05,4.7e-05,8.7e-05,1e-04,-5.4e-05,-0.000129,7.7e-05,-2.2e-05,0.000151,-3.8e-05,-0.000202,-6.1e-05,-0.000223,-4.9e-05,-8.2e-05,-2.3e-05,-7.4e-05,-7e-05,-2.5e-05,1.7e-05,6e-05,3.1e-05,-3.7e-05,-8.2e-05,-2.4e-05,-2e-06,-3e-05,-1.2e-05,-1.6e-05,-6.8e-05,-1.3e-05,5e-06,-7e-06,-1.3e-05,9e-06,-7e-06,-1.2e-05,-9e-06,-1.2e-05,-3e-06,-6.8e-05,5.1e-05,-5e-05,2.7e-05,-5e-06,-6e-06,6e-06,-7e-06,2.2e-05,1.2e-05,-1e-06,-6e-06,-5e-06,-5e-06,1e-06,4e-06,-6e-06,3e-06,-1e-06,-3e-06,4e-06,0,3e-06,-1e-06,-1e-05,-1e-06,-5e-06,1e-06,-3e-06,5e-06,3e-06,1e-06,3e-06
0,3e-06,4e-06,1e-06,2e-06,2e-06,-2e-06,-1e-06,-2e-06,4e-06,2e-06,4e-06,-1e-06,3e-06,-5e-06,1e-06,-2e-06,0,-1.1e-05,-1e-05,0.000162,-2.1e-05,-7e-06,0.00011,-3.7e-05,-1.3e-05,1.7e-05,2.5e-05,-1.6e-05,3.6e-05,-3e-06,0.000106,-4e-05,-2.1e-05,-9e-06,-4e-06,-6e-06,-0.000122,0.000161,4e-05,-0.000134,-8.3e-05,7.1e-05,-6.3e-05,7.6e-05,8.5e-05,8.1e-05,-2e-06,-1.5e-05,-4.6e-05,1.2e-05,5.6e-05,-0.000142,0.000198,5.7e-05,9.7e-05,-2.5e-05,3.4e-05,7.4e-05,6.3e-05,0.000143,5e-06,1.7e-05,8.2e-05,-4.2e-05,3.5e-05,-1e-06,0,4.8e-05,4.8e-05,6.6e-05,9.5e-05,1.6e-05,4.8e-05,8e-06,2.5e-05,-1e-06,-1e-05,6e-06,-1.4e-05,-1.2e-05,-2e-06,1e-05,-2.4e-05,-1.5e-05,4e-06,1e-06,0,-7.9e-05,-6.5e-05,-6.1e-05,1.7e-05,-4e-06,-2e-06,2.2e-05,3.8e-05,0,-1e-06,-1e-06,-8e-06,0,9e-06,0,-1e-06,-3e-06,-1e-06,-7e-06,4e-06,2e-06,0,-3e-06,6e-06,-5e-06,0,-6e-06,-2e-06,-2e-06,-2e-06,7e-06,-2e-06,0
0,-2e-06,3e-06,1e-06,0,0,-3e-06,3e-06,-7e-06,2e-06,0,5e-06,0,-3e-06,-3e-06,0,0,2e-06,2.4e-05,-5e-05,-3.5e-05,2.5e-05,4e-06,-0.000149,-2.8e-05,-3.7e-05,-2.2e-05,-8e-06,1.3e-05,2.6e-05,-4.7e-05,-0.000127,-1.4e-05,-2e-06,-3e-06,-6.6e-05,0.000146,-9.3e-05,-0.000106,-1.4e-05,-9.7e-05,2e-05,-2.7e-05,-0.000201,-3.6e-05,-0.000114,8.9e-05,0.00021,9e-06,-1.8e-05,2.3e-05,-1e-06,0.000103,2.5e-05,-0.000105,0.000174,-0.000165,-0.000116,1.2e-05,-9.9e-05,-0.000169,-0.000126,-4.6e-05,-1.6e-05,4.2e-05,-7.1e-05,-3.5e-05,-7e-06,-7e-05,-5e-06,-2.7e-05,0,1.5e-05,4e-05,2.6e-05,1.6e-05,1e-05,-1.9e-05,1.9e-05,-6e-06,-1.2e-05,-1.6e-05,1.2e-05,1.2e-05,1.6e-05,2e-06,4e-06,1e-06,9e-06,-2.5e-05,2.3e-05,2e-05,1e-05,-1.3e-05,-6e-06,-1.9e-05,-1.1e-05,1e-05,3e-06,-5e-06,4e-06,-1e-06,0,-5e-06,-2e-06,3e-06,1e-06,4e-06,-8e-06,1e-06,-3e-06,6e-06,2e-06,1e-06,-6e-06,-6e-06,-3e-06,1e-06,-1e-06,-4e-06,0
1e-06,-1e-06,1e-06,0,-3e-06,0,2e-06,0,-1e-05,-2e-06,0,2e-06,0,0,-2e-06,-6e-06,-1e-06,-2e-06,6e-06,6.2e-05,-5.3e-05,3e-06,3e-06,0.000197,-3.4e-05,2.1e-05,2e-06,0,-1.3e-05,-4e-05,1e-05,6.7e-05,-2.4e-05,-1e-06,-5e-06,0.000147,-4e-05,3.2e-05,4.3e-05,-0.000333,-9.1e-05,6.1e-05,4e-06,0.00029,-6.7e-05,-0.000128,-0.000185,-0.000176,-5e-05,3.8e-05,9e-06,0.000101,8.1e-05,3.8e-05,1.2e-05,-0.000248,4e-05,0.000106,-4.2e-05,-2.8e-05,0.000119,0.000107,-2.3e-05,8.8e-05,-3e-06,5.5e-05,2.8e-05,-1e-06,-2.7e-05,-1.6e-05,2.4e-05,-3.8e-05,-3.8e-05,-4.8e-05,6e-06,1.1e-05,-1e-06,-4.8e-05,1.4e-05,-7e-06,-2.7e-05,-3.3e-05,-4e-06,8e-06,5e-06,-1.1e-05,2e-06,1e-06,4.9e-05,2.4e-05,1.4e-05,1.8e-05,1e-05,1e-06,-1.6e-05,1.7e-05,-5e-06,-1e-06,-2e-06,-2e-06,-3e-06,4e-06,1e-06,0,-2e-06,3e-06,-6e-06,2e-06,-3e-06,2e-06,-1e-06,-2e-06,3e-06,4e-06,-6e-06,4e-06,-2e-06,4e-06,-2e-06,-6e-06,0
0,1e-06,1e-06,-1e-06,-6e-06,1e-06,1e-06,-1e-06,5e-06,1e-06,0,0,0,0,-3e-06,-3e-06,1e-06,0,-1.9e-05,-1.4e-05,9e-06,-1.7e-05,-8e-06,-0.000194,1.1e-05,-2.7e-05,-4e-06,6e-06,9e-06,-1.4e-05,1.4e-05,-3.6e-05,-2.6e-05,-2e-06,-2e-06,-0.000155,3.3e-05,7e-05,-0.000139,-0.000145,4.7e-05,3.4e-05,-8.5e-05,-0.000408,4.5e-05,7e-05,6.2e-05,0.000205,-3.6e-05,-4.2e-05,-8e-06,-1.4e-05,-8.5e-05,2e-05,6e-05,7e-06,1.8e-05,-4.3e-05,0.000114,5.4e-05,-6.7e-05,2e-06,-1.2e-05,2.7e-05,-1.6e-05,-8e-06,1.4e-05,-3e-06,1.5e-05,1e-05,-1.6e-05,2e-06,2.4e-05,-2.8e-05,-5e-06,-4e-06,-4e-06,-1.1e-05,2e-05,-9e-06,-1e-06,7e-06,1.4e-05,1.5e-05,-1.3e-05,1e-06,3e-06,-1e-06,1e-06,-8e-06,4.8e-05,1e-05,2e-06,-3e-06,-2e-06,-8.5e-05,7e-06,4e-06,-3e-06,4e-06,0,-1e-06,-2e-06,-2e-06,-3e-06,-1e-06,-2e-06,-4e-06,4e-06,0,-2e-06,0,-3e-06,-3e-06,-5e-06,1e-06,-2e-06,1e-06,-4e-06,-3e-06,0
-1e-06,3e-06,0,1e-06,-3e-06,0,0,1e-06,1e-06,3e-06,1e-06,-4e-06,0,2e-06,1e-06,1e-06,-2e-06,1e-06,-3e-06,-1.5e-05,6.6e-05,3.3e-05,3e-06,0.000161,1e-05,1.8e-05,4e-06,-9e-06,-3e-06,2.5e-05,-2.1e-05,6.2e-05,-1.3e-05,-7e-06,-6e-06,2.6e-05,2.2e-05,-3.3e-05,8.6e-05,-0.000125,8.1e-05,2.2e-05,4e-06,0.000357,-8.7e-05,8.6e-05,-7.1e-05,-5.2e-05,2.1e-05,3.3e-05,-2.2e-05,-8e-06,1e-05,-2.2e-05,-0.000177,0.000126,-4.6e-05,3e-05,-9.5e-05,2.8e-05,0.000113,-5e-05,4e-06,8.7e-05,7.1e-05,4e-05,-2.9e-05,9e-06,3.9e-05,1.5e-05,-4.8e-05,-3e-06,1e-05,3e-06,2e-05,-2.4e-05,-2e-06,4e-06,-1e-06,-7e-06,4.8e-05,-5e-06,2e-05,-1.5e-05,-4e-06,-2e-06,-4e-06,0,-3.7e-05,2.9e-05,1.3e-05,1.1e-05,-7e-06,-9e-06,1.1e-05,6e-05,-4e-06,-8e-06,0,5e-06,1e-06,3e-06,2e-06,-1e-06,-4e-06,1e-06,-4e-06,-1e-06,3e-06,0,-2e-06,1e-06,-4e-06,-1e-06,-3e-06,-3e-06,-2e-06,-2e-06,-3e-06,1e-06,0
1e-06,3e-06,-2e-06,0,6e-06,0,-1e-06,0,3e-06,-1e-06,0,-3e-06,0,-1e-06,0,5e-06,0,-1e-06,1.6e-05,4e-06,-0.000108,-2.2e-05,-5e-06,-8.7e-05,-8.7e-05,-5e-06,1e-06,9e-06,1e-06,-3e-06,1.7e-05,-8.7e-05,-1e-05,0,0,-5.2e-05,-9e-06,-3.5e-05,-8.2e-05,-0.000164,6.9e-05,3.2e-05,5.1e-05,-0.000449,0.000119,-3.9e-05,-1e-06,2.9e-05,-1.6e-05,-1.1e-05,-6.2e-05,-2.2e-05,2e-05,-0.000101,0.000193,1.9e-05,8.9e-05,-6.6e-05,-6.3e-05,-3.5e-05,2.2e-05,6.1e-05,4.5e-05,5e-06,-1.5e-05,-3.6e-05,3.6e-05,-7e-06,1.9e-05,-3.6e-05,-1.1e-05,1.5e-05,-6e-06,4.3e-05,5e-06,4e-06,4e-06,1e-05,3e-06,-5e-06,6e-06,-1.7e-05,-9e-06,3e-06,4e-06,-4e-06,3e-06,0,-5.3e-05,-3e-06,3.2e-05,4e-06,-2e-06,2e-06,2e-06,8e-06,6e-06,1e-06,1e-06,-1e-06,-1e-06,-1e-06,-1e-06,4e-06,-2e-06,-3e-06,-4e-06,-2e-06,-3e-06,0,1e-06,-5e-06,0,0,-5e-06,-1e-06,-2e-06,1e-06,3e-06,3e-06,-1e-06
0,1e-06,-2e-06,0,4e-06,1e-06,-3e-06,-1e-06,-3e-06,1e-06,0,0,0,0,1e-06,-2e-06,2e-06,0,1e-06,7e-06,7.8e-05,7e-06,4e-06,1.2e-05,0.000126,1.5e-05,-3e-06,-9e-06,1e-06,-1e-05,-1.4e-05,5.7e-05,1.4e-05,-3e-06,-5e-06,6.2e-05,-4e-06,7.2e-05,6.1e-05,-0.000142,-3e-06,-2.2e-05,-3.1e-05,0.000345,1e-05,-0.000111,-0.000193,-7.8e-05,1.7e-05,-1.4e-05,-2e-06,-6.5e-05,-2.1e-05,4.5e-05,-0.000115,-4.3e-05,9.6e-05,6.3e-05,0.000116,9e-05,3.6e-05,-2.5e-05,-4.5e-05,4e-06,8e-06,-9e-06,-4e-06,-1e-06,4e-06,4.2e-05,-6e-06,-2.3e-05,1e-06,2e-05,-4e-06,7e-06,-4e-06,-4e-06,-1.9e-05,-7e-06,-1.4e-05,-2e-06,6e-06,-5e-06,2e-06,1e-05,-3e-06,0,-2.1e-05,-3.3e-05,-1.6e-05,4e-06,-4e-06,0,-5e-06,2e-06,-5e-06,-8e-06,1e-06,-3e-06,1e-06,3e-06,1e-06,-1e-06,0,-3e-06,-3e-06,0,-3e-06,0,0,-1e-06,1e-06,-1e-06,-3e-06,1e-06,-2e-06,2e-06,2e-06,3e-06,1e-06
-1e-06,-1e-06,-1e-06,0,1e-06,0,-2e-06,0,2e-06,2e-06,1e-06,1e-06,0,0,1e-06,-1e-06,1e-06,0,-1.3e-05,-3e-06,-9e-05,-1.7e-05,2e-06,-2.6e-05,-1.8e-05,1.3e-05,3e-06,8e-06,-6e-06,1.7e-05,1.5e-05,-5.1e-05,2.1e-05,-8e-06,-2e-06,-9e-05,1.5e-05,5.4e-05,-1.2e-05,-6.6e-05,-4.3e-05,-1.3e-05,-4.5e-05,-0.000296,-9.8e-05,5.4e-05,3.5e-05,0.000159,-2.8e-05,1e-06,-2.2e-05,3.6e-05,2.3e-05,3.6e-05,0.000108,-6.8e-05,4.8e-05,-5.6e-05,-3.8e-05,0,-8.7e-05,0,1.2e-05,-4e-06,-1e-05,-1.3e-05,-1.1e-05,4e-06,-3.1e-05,-7e-06,6e-06,2.2e-05,8e-06,-2.5e-05,8e-06,6e-06,0,2.1e-05,-6e-06,-9e-06,-2e-05,1.3e-05,5e-06,4e-06,1e-06,0,4e-06,0,5e-06,1.7e-05,7e-06,2e-06,0,-3e-06,1e-06,1.8e-05,-2e-06,1e-06,-1e-06,-2e-06,-1e-06,-3e-06,-1e-06,0,-2e-06,0,-4e-06,1e-06,0,0,-1e-06,1e-06,0,-2e-06,-4e-06,1e-06,-2e-06,0,3e-06,2e-06,-1e-06
0,-2e-06,0,0,-2e-06,0,-2e-06,1e-06,0,-1e-06,0,1e-06,0,0,1e-06,2e-06,-1e-06,-1e-06,1e-06,4e-06,6.3e-05,1.2e-05,-2e-06,4.8e-05,-1.7e-05,6e-06,-3e-06,-5e-06,3e-06,-1e-05,1e-06,5e-05,2.8e-05,-3e-06,-2e-06,8.7e-05,2.7e-05,-4.6e-05,-4.6e-05,3.5e-05,-2.8e-05,-3e-06,2.5e-05,0.000211,7.6e-05,5.6e-05,-1e-05,-8.8e-05,2.7e-05,-4.1e-05,2.8e-05,8e-06,-1.9e-05,-1.8e-05,-0.000106,2.9e-05,2e-06,5.8e-05,-5.5e-05,-6.9e-05,4.3e-05,-2.5e-05,2.2e-05,1e-06,-1.4e-05,-7e-06,4e-06,-2e-06,7e-06,-2.4e-05,1.2e-05,-1e-06,0,-3.3e-05,-5e-06,3e-06,5e-06,5e-05,-1.1e-05,-2e-06,-1.2e-05,9e-06,-1.3e-05,1.8e-05,-3e-06,-5e-06,-5e-06,0,2.7e-05,-7e-06,-2.5e-05,-1e-06,3e-06,-2e-06,-2e-06,1e-06,2e-06,0,0,-5e-06,1e-06,4e-06,-1e-06,1e-06,-3e-06,0,-2e-06,3e-06,0,0,-2e-06,0,-4e-06,2e-06,-4e-06,-1e-06,-1e-06,-1e-06,-1e-06,0,1e-06
0,-2e-06,1e-06,0,-3e-06,0,-1e-06,-1e-06,-2e-06,0,0,0,0,0,1e-06,-1e-06,-2e-06,0,1e-05,-7e-06,-5e-06,3e-06,1e-06,-2.6e-05,4e-05,1.3e-05,6e-06,2e-06,-2e-06,-1.6e-05,-8e-06,-1.9e-05,2.7e-05,5e-06,-5e-06,-2.3e-05,3.6e-05,-6.6e-05,2.4e-05,-6.6e-05,1.3e-05,-3.9e-05,1.1e-05,-0.000102,-8.9e-05,1.3e-05,-9.4e-05,0.000118,-1.9e-05,2.9e-05,-2e-06,-5.3e-05,-1.2e-05,-1.8e-05,8.7e-05,4.5e-05,-6.5e-05,1.4e-05,6.5e-05,3.8e-05,-2.1e-05,4.1e-05,-2.7e-05,1e-05,7e-06,5e-06,-1.1e-05,-1e-06,1e-06,5e-06,1e-05,-3.4e-05,1e-06,-6e-06,-1.3e-05,2e-06,1e-06,5e-06,1e-06,-1.1e-05,0,-1.1e-05,1.1e-05,-8e-06,0,6e-06,4e-06,0,-1e-06,-5e-06,-2e-05,0,4e-06,-4e-06,-6e-06,-1e-05,-1e-06,1e-06,1e-06,-2e-06,0,-2e-06,0,-1e-06,-2e-06,1e-06,-4e-06,0,1e-06,0,-3e-06,1e-06,-2e-06,0,-3e-06,-3e-06,-2e-06,0,-3e-06,-3e-06,-1e-06
0,0,1e-06,0,-4e-06,0,0,0,-4e-06,1e-06,0,0,0,1e-06,0,-2e-06,1e-06,0,-1e-06,-7e-06,-7e-06,-7e-06,-1e-06,-4e-06,-2.8e-05,1.1e-05,-9e-06,1e-06,2e-06,1.3e-05,4e-06,-1.1e-05,8e-06,0,-3e-06,-4.2e-05,-2.5e-05,5e-06,-4.1e-05,4e-06,4.8e-05,-1.7e-05,-2.3e-05,1.6e-05,8.6e-05,-8e-05,4.7e-05,-4.1e-05,9e-06,1.1e-05,2.1e-05,4.3e-05,3.6e-05,1.6e-05,-0.000121,1e-05,-6.9e-05,-2.6e-05,-3.9e-05,-1.6e-05,5.1e-05,-8e-06,-1e-05,-1.6e-05,-1.5e-05,-2e-05,5e-06,3e-06,3e-06,1.4e-05,-1.3e-05,3.3e-05,-5e-06,2.9e-05,-3e-06,-1.1e-05,-3e-06,-2.3e-05,6e-06,0,3.3e-05,1e-05,-7e-06,-8e-06,0,-3e-06,-4e-06,0,-3.8e-05,2.2e-05,-3e-05,-4e-06,-1e-06,-2e-06,-3e-06,-7e-06,4e-06,2e-06,1e-06,1e-06,-2e-06,0,0,-1e-06,-1e-06,0,-2e-06,-1e-06,1e-06,0,-1e-06,2e-06,1e-06,0,-4e-06,1e-06,-1e-06,1e-06,-2e-06,-2e-06,1e-06
0,0,1e-06,0,1e-06,0,1e-06,1e-06,-1e-06,0,0,0,0,0,0,-2e-06,1e-06,0,-9e-06,2e-05,4.2e-05,8e-06,3e-06,2.8e-05,1.9e-05,1e-05,1e-06,-2e-06,-1e-06,8e-06,-1.5e-05,-7e-06,-6e-06,-4e-06,-2e-06,1.1e-05,3e-05,1.6e-05,3.6e-05,5.4e-05,1.7e-05,2.4e-05,-1.2e-05,3e-05,-1.2e-05,-1.9e-05,-4e-05,7.2e-05,1e-06,-8e-06,-2e-06,1.5e-05,-1.4e-05,-6.6e-05,9.7e-05,-8.6e-05,3e-05,4.3e-05,1e-05,-3.8e-05,-4.4e-05,-1.1e-05,1.3e-05,1.7e-05,-1e-06,4e-06,-1.1e-05,-5e-06,-1.4e-05,-1.7e-05,-1.4e-05,4e-06,0,9e-06,4e-06,-4e-06,-1e-06,-1e-06,9e-06,-9e-06,1.3e-05,-2e-05,-7e-06,3e-06,2e-06,-1e-06,3e-06,0,-3.8e-05,-1.2e-05,-3e-06,-3e-06,0,-1e-06,2e-06,-1e-06,-1e-06,3e-06,0,2e-06,2e-06,-1e-06,1e-06,0,-1e-06,0,-4e-06,-1e-06,-2e-06,0,1e-06,0,1e-06,0,-3e-06,2e-06,-1e-06,0,-1e-06,-2e-06,0
0,-1e-06,1e-06,0,4e-06,0,0,-1e-06,2e-06,-1e-06,0,1e-06,0,0,-1e-06,2e-06,0,0,1e-06,-1e-05,-4.7e-05,-9e-06,-3e-06,-5.5e-05,-2.5e-05,-2e-06,0,2e-06,-1e-06,-1.2e-05,1.3e-05,-4e-06,-1.7e-05,-4e-06,-3e-06,2.8e-05,3e-06,-4e-06,-8.3e-05,7.8e-05,-1.9e-05,3.7e-05,-5e-06,0,-1.1e-05,6.7e-05,-1.7e-05,-7.8e-05,5e-06,9e-06,-4e-06,2.6e-05,-2.6e-05,5.5e-05,-1.8e-05,1.5e-05,1e-05,-4.7e-05,4.6e-05,9e-06,-2.6e-05,-3.6e-05,0,-1.1e-05,0,-2.1e-05,8e-06,5e-06,-1.1e-05,-2e-06,-9e-06,-8e-06,6e-06,-6e-06,-2.6e-05,4e-06,5e-06,-6e-06,4e-06,-3e-06,-1.1e-05,-7e-06,2e-06,6e-06,0,4e-06,-2e-06,0,-5e-06,3e-06,1.2e-05,-4e-06,-2e-06,-5e-06,0,2.1e-05,-4e-06,0,0,3e-06,-1e-06,1e-06,-1e-06,0,-2e-06,1e-06,-2e-06,-1e-06,-3e-06,0,0,-1e-06,-2e-06,0,-3e-06,-2e-06,-1e-06,-1e-06,3e-06,-1e-06,0
0,-2e-06,0,0,3e-06,0,-1e-06,0,1e-06,1e-06,1e-06,1e-06,0,0,-1e-06,-1e-06,0,0,7e-06,-7e-06,-4e-06,7e-06,1e-06,6.1e-05,2e-06,9e-06,4e-06,-2e-06,1e-06,-1e-06,-4e-06,4.7e-05,-2.1e-05,1e-06,1e-06,-6e-05,-2.2e-05,-1.4e-05,8.8e-05,5.9e-05,-4.1e-05,-9e-06,1.7e-05,1.2e-05,-5e-06,3.8e-05,-9.4e-05,0.000141,-9e-06,2e-06,-1.6e-05,-6e-06,2.6e-05,4.3e-05,-5e-06,6.2e-05,-6e-05,5.4e-05,-5.3e-05,3.5e-05,-4.5e-05,3.7e-05,-4e-06,2.8e-05,8e-06,1.9e-05,6e-06,-1e-06,-7e-06,1.9e-05,-1.3e-05,-8e-06,-7e-06,-2e-05,3.1e-05,5e-06,-2e-06,-1.9e-05,-2e-06,-6e-06,-2.8e-05,-2e-06,-8e-06,-1.1e-05,0,-5e-06,2e-06,0,1.9e-05,-8e-06,1.2e-05,-6e-06,-2e-06,-3e-06,-3e-06,1.6e-05,2e-06,-2e-06,0,-1e-06,-1e-06,-3e-06,0,-1e-06,-2e-06,0,-3e-06,0,1e-06,0,-1e-06,0,-2e-06,-2e-06,-3e-06,-1e-06,-1e-06,0,1e-06,2e-06,0
0,-2e-06,-1e-06,0,0,0,-1e-06,1e-06,0,0,0,0,0,0,0,0,0,0,-1e-06,3e-06,3e-05,-5e-06,1e-06,-7.4e-05,-4e-06,-3e-06,-1e-06,2e-06,-1e-06,6e-06,9e-06,-5.8e-05,-1.7e-05,4e-06,-1e-06,5.7e-05,3.3e-05,2e-06,-8.9e-05,-1.1e-05,-2e-06,-2e-05,-1e-06,3.5e-05,-2.3e-05,-4.7e-05,1.8e-05,-9e-05,-1.2e-05,5e-06,-1.9e-05,-3.9e-05,-2e-06,6e-06,5.5e-05,-2.3e-05,1.2e-05,-6.9e-05,-6e-06,-2.7e-05,1.4e-05,2.1e-05,1.4e-05,-5e-06,7e-06,-2.8e-05,-1.3e-05,0,3e-06,-2.4e-05,7e-06,5e-06,-2e-06,-9e-06,-1.9e-05,2e-06,-1e-06,-1.6e-05,-7e-06,-6e-06,-7e-06,1e-06,-5e-06,1.1e-05,0,2e-06,-2e-06,0,7e-06,-1e-05,1.9e-05,-4e-06,2e-06,-1e-06,-3e-06,-2.4e-05,4e-06,0,0,-3e-06,1e-06,2e-06,-1e-06,1e-06,-1e-06,-1e-06,-2e-06,1e-06,3e-06,0,0,-1e-06,0,2e-06,-3e-06,0,-1e-06,1e-06,1e-06,1e-06,0
0,-2e-06,-1e-06,0,-3e-06,0,-2e-06,0,-1e-06,0,0,-1e-06,0,0,-1e-06,1e-06,1e-06,0,-6e-06,1.2e-05,-3.9e-05,0,-1e-06,9.2e-05,-1e-05,-3e-06,-2e-06,-1e-06,1e-06,-4e-06,-8e-06,3.9e-05,-8e-06,0,-1e-06,5e-06,-3.5e-05,3.3e-05,7.4e-05,-2.9e-05,3.4e-05,-1e-06,-7e-06,-7e-05,3e-05,-5.5e-05,-5.3e-05,7.3e-05,1.1e-05,-1.2e-05,-5e-06,2.7e-05,-2.2e-05,-3.6e-05,-8.7e-05,-3.7e-05,4e-06,7e-05,4.4e-05,1.8e-05,-1e-06,-3.9e-05,7e-06,4e-05,5e-06,2.2e-05,8e-06,-1e-06,3e-06,2e-06,1.2e-05,-2e-06,7e-06,9e-06,1.2e-05,-3e-06,-2e-06,2e-06,-1e-05,-4e-06,7e-06,8e-06,2e-06,0,-1e-06,5e-06,1e-06,0,-1.2e-05,1.8e-05,1e-06,-7e-06,2e-06,-1e-06,-1e-06,1.5e-05,-5e-06,-5e-06,0,-3e-06,-1e-06,-2e-06,0,0,-1e-06,-1e-06,-3e-06,1e-06,0,0,-1e-06,-1e-06,1e-06,0,-3e-06,1e-06,-1e-06,0,-2e-06,2e-06,0
0,-2e-06,-1e-06,0,-3e-06,0,-1e-06,-1e-06,2e-06,0,0,-1e-06,0,0,0,1e-06,-1e-06,0,1e-06,-1.5e-05,-1e-05,2e-06,-1e-06,-0.000101,-3e-06,-5e-06,4e-06,0,-1e-06,-2e-06,3e-06,-4.6e-05,1e-06,-2e-06,0,-3.2e-05,8e-06,1.7e-05,-9.6e-05,-8e-05,4.9e-05,5e-06,-1.2e-05,9.9e-05,-9e-06,4e-05,-9.3e-05,-4.3e-05,-1.2e-05,9e-06,-1.4e-05,-1.2e-05,1.7e-05,2e-06,4.5e-05,1.3e-05,-5.7e-05,-5.7e-05,-4.7e-05,2.3e-05,2.3e-05,3e-06,-1e-05,-1.9e-05,-1.8e-05,-2.8e-05,0,0,-5e-06,1.8e-05,2e-06,-7e-06,-2e-06,1.2e-05,0,-5e-06,1e-06,-1e-06,-4e-06,-7e-06,2.6e-05,1e-06,-1e-05,-1e-05,1e-06,-4e-06,-1e-06,0,-3.2e-05,-6e-06,1.3e-05,-6e-06,-1e-06,-1e-06,-1e-06,-2.2e-05,3e-06,2e-06,0,-4e-06,1e-06,0,0,0,-2e-06,-1e-06,-3e-06,0,-3e-06,0,-2e-06,0,-1e-06,0,-2e-06,0,-1e-06,-1e-06,-2e-06,1e-06,0
0,-1e-06,0,0,-2e-06,0,-1e-06,0,-1e-06,0,0,0,0,0,0,-1e-06,-1e-06,0,6e-06,8e-06,3.6e-05,-3e-06,-1e-06,9.9e-05,-2e-06,-5e-06,-1e-06,1e-06,0,7e-06,6e-06,6.1e-05,7e-06,-2e-06,-2e-06,2.4e-05,5e-06,-2.4e-05,7.8e-05,-7.5e-05,2.1e-05,-1e-06,1.8e-05,-0.00014,1.4e-05,6.5e-05,5.4e-05,8.1e-05,0,4e-06,6e-06,-9e-06,-1e-06,-4.3e-05,-2.5e-05,3.1e-05,1e-06,3.8e-05,3.1e-05,-1.1e-05,-1e-06,7e-06,1.1e-05,1.7e-05,1.2e-05,2.6e-05,-4e-06,0,5e-06,-8e-06,3e-06,1.5e-05,-2e-06,8e-06,3e-06,-4e-06,1e-06,-1.2e-05,-1e-06,-2e-06,1.1e-05,1e-06,-5e-06,6e-06,0,1e-06,2e-06,0,-2.4e-05,-1e-06,-9e-06,-6e-06,1e-06,-2e-06,-3e-06,-1e-05,-3e-06,-2e-06,0,-1e-06,0,-1e-06,0,0,-2e-06,0,-2e-06,0,0,0,-1e-06,0,-2e-06,0,-3e-06,-1e-06,-1e-06,0,0,-1e-06,1e-06
0,-2e-06,0,0,2e-06,0,0,0,0,0,0,1e-06,0,0,0,-2e-06,0,0,0,-4e-06,-4.5e-05,2e-06,2e-06,-0.000103,3.3e-05,-7e-06,2e-06,-2e-06,0,1e-06,-9e-06,-6.1e-05,1.1e-05,0,-2e-06,1.9e-05,-2.3e-05,-1.4e-05,-9.7e-05,-8.7e-05,-2.7e-05,-4e-06,-1.3e-05,0.000145,-1.3e-05,1e-06,-6.7e-05,-6.8e-05,-1.6e-05,-1.1e-05,-8e-06,1.1e-05,-1.2e-05,1.8e-05,-8e-06,-2e-06,5.3e-05,-1.6e-05,1.5e-05,-4.2e-05,1.2e-05,9e-06,6e-06,-3.5e-05,9e-06,-2.8e-05,4e-06,3e-06,4e-06,-7e-06,-1.1e-05,3e-06,1e-06,-7e-06,-1.1e-05,4e-06,0,1.3e-05,1.1e-05,-8e-06,-8e-06,-1.3e-05,3e-06,-2e-06,1e-06,2e-06,-1e-06,0,-1e-06,8e-06,-4e-06,-7e-06,0,-1e-06,0,9e-06,0,3e-06,0,2e-06,-1e-06,0,0,0,-1e-06,0,-3e-06,-1e-06,1e-06,0,1e-06,0,0,1e-06,-3e-06,0,-1e-06,0,0,-1e-06,0
