0.015738,0.015803,0.016354,0.016526,0.017952,0.018221,0.015835,0.013295,0.012971,0.01295,0.011922,0.009962,0.009885,0.011218,0.011635,0.011183,0.010684,0.011935,0.011452,0.009021,0.008285,0.00851,0.009319,0.009213,0.008691,0.009031,0.009616,0.009256
0.020867,0.021405,0.022451,0.022545,0.024413,0.024606,0.02122,0.017926,0.01755,0.017583,0.015994,0.013092,0.012855,0.014482,0.015108,0.014656,0.013973,0.015293,0.014598,0.011726,0.010916,0.011216,0.012291,0.012157,0.011307,0.011689,0.01238,0.011751
0.030978,0.032582,0.03446,0.034327,0.037063,0.037186,0.031986,0.027283,0.02678,0.027141,0.024788,0.019952,0.018947,0.020813,0.021647,0.021451,0.020766,0.021738,0.020477,0.017194,0.016293,0.016688,0.018254,0.018134,0.016515,0.016872,0.017713,0.016473
0.042895,0.045679,0.047317,0.046552,0.050541,0.050747,0.043733,0.037473,0.036923,0.038269,0.036025,0.029325,0.026719,0.028434,0.028671,0.028828,0.029425,0.029444,0.027142,0.024197,0.023203,0.023647,0.025418,0.024969,0.02237,0.022889,0.024,0.021905
0.056744,0.061369,0.059389,0.055712,0.060554,0.060942,0.053446,0.045973,0.045192,0.048918,0.048666,0.040815,0.035936,0.037138,0.035587,0.035897,0.040008,0.039862,0.036242,0.033982,0.032605,0.032628,0.033664,0.031934,0.028897,0.030538,0.032036,0.028742
0.075482,0.083739,0.074594,0.064403,0.068043,0.067659,0.061006,0.053351,0.052034,0.058076,0.060865,0.053575,0.047479,0.047951,0.043242,0.042468,0.051,0.05317,0.049131,0.046599,0.044196,0.042753,0.042059,0.03859,0.036122,0.040549,0.042576,0.037358
0.093814,0.107807,0.092947,0.0764,0.077804,0.07599,0.069048,0.060415,0.058791,0.065574,0.070207,0.065195,0.059811,0.059242,0.05015,0.046174,0.057878,0.064048,0.060574,0.057251,0.054098,0.050576,0.047745,0.043152,0.041932,0.049081,0.052118,0.045819
0.100761,0.11926,0.10312,0.083269,0.083455,0.080887,0.07185,0.063932,0.063084,0.068231,0.07374,0.071476,0.066651,0.065054,0.054958,0.048064,0.05763,0.065103,0.063119,0.060503,0.057636,0.052618,0.048403,0.043283,0.042798,0.050347,0.054187,0.049807
0.094301,0.111921,0.099922,0.082195,0.083687,0.084224,0.072472,0.063597,0.062394,0.065925,0.072163,0.070463,0.064434,0.061353,0.054599,0.048967,0.054386,0.058822,0.056196,0.055247,0.053561,0.049799,0.046587,0.041752,0.040331,0.044721,0.048761,0.048104
0.087848,0.10545,0.100883,0.084388,0.083093,0.086294,0.076559,0.067218,0.064916,0.067001,0.070278,0.066744,0.059704,0.054984,0.052097,0.049929,0.053072,0.05511,0.051827,0.050877,0.048724,0.048814,0.048275,0.043496,0.040757,0.041275,0.044911,0.045238
0.08911,0.108534,0.11221,0.094591,0.085466,0.084209,0.076924,0.072365,0.073079,0.073238,0.071592,0.069004,0.062065,0.056326,0.05504,0.055738,0.060466,0.06341,0.060872,0.055118,0.049003,0.050979,0.053469,0.050351,0.046566,0.046299,0.050181,0.046961
0.09279,0.113465,0.124394,0.108395,0.094018,0.08506,0.076468,0.078804,0.085129,0.084412,0.077476,0.074545,0.067786,0.061879,0.060372,0.06266,0.070235,0.074268,0.072834,0.06337,0.054709,0.056386,0.060019,0.05837,0.054361,0.05446,0.056758,0.050064
0.09671,0.112041,0.125422,0.113606,0.100413,0.090774,0.077888,0.082569,0.094839,0.092053,0.081018,0.07784,0.071,0.064905,0.063889,0.065922,0.073279,0.078216,0.077392,0.068642,0.062087,0.061339,0.062918,0.062155,0.058597,0.058583,0.057428,0.048651
0.101635,0.10439,0.114954,0.114501,0.106167,0.096613,0.078303,0.081323,0.098411,0.093637,0.08146,0.076721,0.066809,0.062111,0.067005,0.06868,0.068515,0.070341,0.069931,0.066094,0.065192,0.061751,0.059784,0.060098,0.056959,0.054219,0.049407,0.041713
0.111806,0.106902,0.120034,0.135792,0.12369,0.10452,0.084807,0.082761,0.097983,0.095568,0.085156,0.07956,0.069915,0.065704,0.074639,0.077817,0.069713,0.066364,0.065847,0.066033,0.070402,0.06866,0.061983,0.057971,0.053347,0.046304,0.041157,0.038284
0.146504,0.139559,0.16268,0.18897,0.161724,0.133622,0.118014,0.109674,0.116566,0.112422,0.104439,0.102961,0.098686,0.096116,0.108781,0.110442,0.09361,0.087693,0.086368,0.085982,0.095811,0.102531,0.092843,0.078193,0.063827,0.050631,0.049867,0.052018
0.227199,0.213217,0.248981,0.281838,0.237513,0.203751,0.189275,0.175877,0.178531,0.166987,0.152179,0.148817,0.146268,0.148633,0.174333,0.174439,0.14597,0.138372,0.132342,0.12322,0.137801,0.162356,0.155635,0.126514,0.093704,0.071413,0.0764,0.081187
0.34248,0.315346,0.359523,0.387522,0.332538,0.302866,0.287646,0.271151,0.267831,0.245122,0.215014,0.20134,0.195577,0.205149,0.256032,0.256807,0.216968,0.213359,0.195155,0.162318,0.175959,0.228127,0.242654,0.201741,0.139886,0.10665,0.119104,0.123307
0.466182,0.427874,0.466148,0.455139,0.397416,0.394783,0.391831,0.382741,0.365186,0.325263,0.277664,0.246741,0.228756,0.242234,0.323823,0.33152,0.286637,0.295389,0.261441,0.190871,0.193355,0.276911,0.333115,0.285392,0.1865,0.146312,0.171883,0.173294
0.559513,0.517457,0.545477,0.47783,0.412974,0.444143,0.462478,0.470701,0.439742,0.379302,0.319942,0.275152,0.238017,0.247663,0.35263,0.374175,0.330431,0.360212,0.316791,0.204641,0.194922,0.300739,0.391764,0.339802,0.213554,0.177588,0.221012,0.217719
0.577982,0.546436,0.565711,0.472568,0.402384,0.451844,0.471624,0.474301,0.438098,0.381759,0.341459,0.290825,0.233219,0.228232,0.331326,0.366807,0.329003,0.383715,0.349989,0.21406,0.198966,0.300653,0.380658,0.325686,0.206781,0.183889,0.239329,0.237247
0.492946,0.495419,0.507536,0.421565,0.36508,0.424907,0.420905,0.3785,0.346829,0.346847,0.353011,0.284544,0.212709,0.201927,0.269868,0.294717,0.285317,0.359861,0.344261,0.227446,0.204014,0.265431,0.301406,0.253324,0.176402,0.164731,0.215865,0.223541
0.367129,0.357472,0.370762,0.323645,0.309323,0.357583,0.324855,0.262977,0.242319,0.30643,0.34433,0.254526,0.188754,0.182519,0.198136,0.187092,0.218233,0.312348,0.308191,0.22879,0.194371,0.215118,0.229848,0.189808,0.142796,0.14019,0.177074,0.182559
0.276022,0.217626,0.24087,0.243333,0.266681,0.283062,0.227727,0.197599,0.195834,0.265583,0.302752,0.219075,0.172958,0.168588,0.15206,0.118041,0.155405,0.240405,0.249321,0.214848,0.183191,0.173002,0.182447,0.149573,0.114184,0.119208,0.129604,0.124416
0.224799,0.164731,0.182264,0.207993,0.241927,0.215232,0.145351,0.143514,0.149376,0.189432,0.213699,0.160887,0.13838,0.136837,0.115641,0.088017,0.110245,0.173828,0.192384,0.187155,0.170356,0.148542,0.149394,0.120775,0.098284,0.106672,0.09575,0.086138
0.182846,0.147645,0.153465,0.193243,0.218975,0.162808,0.095683,0.098239,0.101206,0.112289,0.130333,0.109116,0.094283,0.093559,0.081854,0.066225,0.073197,0.110678,0.132567,0.142324,0.13938,0.134555,0.135328,0.102131,0.092003,0.102131,0.07924,0.06828
0.148007,0.137152,0.142873,0.182151,0.181266,0.128388,0.086221,0.084398,0.083806,0.086222,0.100936,0.089853,0.071597,0.065109,0.063679,0.058054,0.060824,0.079615,0.096389,0.107798,0.108746,0.115949,0.113705,0.083842,0.088668,0.097873,0.069512,0.059228
0.11465,0.116874,0.119224,0.140371,0.132033,0.107627,0.087385,0.077133,0.073385,0.072075,0.080299,0.074029,0.061519,0.052417,0.051308,0.051051,0.059027,0.073024,0.07431,0.077279,0.084542,0.089018,0.084184,0.068815,0.077391,0.083362,0.061895,0.053734
0.084649,0.090057,0.082216,0.084897,0.090675,0.092004,0.086627,0.074596,0.066198,0.063694,0.062753,0.057263,0.05684,0.048405,0.040731,0.044125,0.054726,0.064254,0.055536,0.050583,0.060263,0.062374,0.060508,0.057105,0.061348,0.068403,0.061951,0.053824
0.066515,0.070104,0.061046,0.057579,0.065781,0.071492,0.076938,0.068758,0.060534,0.063862,0.053883,0.044556,0.057942,0.058472,0.045261,0.045026,0.054898,0.057389,0.043114,0.041291,0.051065,0.055625,0.055192,0.048699,0.052016,0.068636,0.069567,0.058035
0.055205,0.061942,0.070634,0.060329,0.052594,0.061514,0.06907,0.062344,0.058368,0.063358,0.056975,0.050693,0.066584,0.073628,0.058087,0.051416,0.066404,0.070639,0.047033,0.043415,0.053972,0.061241,0.05955,0.049903,0.052962,0.077751,0.077371,0.06122
0.054042,0.066489,0.086752,0.069407,0.044444,0.055264,0.064729,0.055989,0.050679,0.051399,0.055534,0.062266,0.07681,0.082698,0.065912,0.056821,0.077275,0.084473,0.055227,0.046326,0.057121,0.066509,0.062762,0.053037,0.059798,0.085061,0.076089,0.058637
0.058094,0.065797,0.089958,0.071773,0.037217,0.047282,0.060762,0.051626,0.041143,0.037819,0.049173,0.065844,0.074536,0.074751,0.060089,0.051723,0.073766,0.083515,0.055576,0.043448,0.053847,0.062027,0.055769,0.046824,0.057769,0.078275,0.067121,0.054279
0.059405,0.054758,0.074993,0.061294,0.02923,0.039037,0.049831,0.043199,0.036744,0.033423,0.044086,0.058008,0.05734,0.052597,0.044748,0.0398,0.055968,0.066805,0.048602,0.037216,0.044827,0.050107,0.040587,0.033414,0.04525,0.05745,0.049968,0.046995
0.053782,0.042068,0.05347,0.047364,0.025784,0.036085,0.038441,0.036235,0.035933,0.031939,0.041302,0.045958,0.039496,0.035873,0.033686,0.035831,0.043093,0.050629,0.044938,0.033151,0.038781,0.041944,0.032254,0.02887,0.03701,0.038235,0.031356,0.034384
0.044014,0.032622,0.037592,0.039153,0.027813,0.034601,0.032663,0.032276,0.034928,0.029947,0.037861,0.039192,0.034104,0.030847,0.03085,0.038969,0.037684,0.038106,0.041587,0.035484,0.037912,0.037755,0.034234,0.030789,0.037294,0.037218,0.027487,0.025031
0.038045,0.031072,0.035365,0.038132,0.03363,0.034663,0.028703,0.029098,0.031279,0.026057,0.03237,0.033376,0.034905,0.036665,0.036538,0.040263,0.032687,0.030875,0.037229,0.038849,0.033697,0.029789,0.034699,0.035427,0.040642,0.039503,0.028567,0.02333
0.037599,0.033888,0.0366,0.034751,0.036982,0.034734,0.026689,0.025387,0.024966,0.022353,0.026341,0.026204,0.032948,0.039246,0.038934,0.036329,0.025443,0.022507,0.030529,0.037774,0.025424,0.019046,0.029114,0.035954,0.039623,0.034806,0.024623,0.022857
0.03702,0.035657,0.035219,0.026223,0.034252,0.036994,0.028917,0.019833,0.019133,0.025184,0.02695,0.024142,0.030819,0.034599,0.034531,0.033878,0.022045,0.014826,0.027324,0.033885,0.017285,0.012566,0.021351,0.030069,0.031593,0.025626,0.018892,0.020311
0.039858,0.037434,0.032441,0.018767,0.027049,0.03455,0.028874,0.015373,0.014409,0.028019,0.032055,0.027571,0.027416,0.02491,0.025171,0.031676,0.022747,0.013922,0.030671,0.030329,0.011971,0.012572,0.019866,0.022705,0.020307,0.019638,0.020105,0.020045
