2.5e-05,-0.000321,-0.000723,-0.000399,3.6e-05,-4e-04,-0.00112,-0.00038,-0.000645,0.000835,0.000339,-3.8e-05,-7.8e-05,0.000269,-0.000238,-0.000605,-0.001152,-0.00092,-0.000222,0.00013,-0.000622,-0.000357,0.000165,-8.3e-05,2.8e-05,-0.001023,-0.001066,0.000309,0.000344,0.000226,-0.000377,-0.000277,5.9e-05,4.5e-05,-5.7e-05,-0.000557,-0.00078,-0.000579,-0.000373,-0.000556,-0.000435,-0.000749,-0.000457,-0.000356,-0.000356,-1e-05,0.000307,-0.001286,-0.001093,-7.3e-05,-0.000515,-0.000169,-0.000734,-0.000677,0.000162,-0.000803,-0.00062,-5.8e-05,-2.2e-05,-0.001526,-0.001003,-0.000484,-0.000692,-0.001115,-0.000695,-0.000559,-0.000663,-0.000796,-0.000913,-0.000218,-0.000361,-0.000956,-1.4e-05,0.000853,0.000656,-0.000272,-0.000547,-0.000993,-0.000616,-0.000476,-0.00082,1.9e-05,-9.1e-05,0.000156,-0.000369,-0.000333,-0.000699,-0.000704,-0.00066,-0.000547,-0.000633,-0.000157,-0.000294,-0.00087,-0.000822,-0.000394,-0.000273,-0.000417,-0.000261,-0.000811,-0.000658,-0.001163,-0.001357,-0.000439,8.5e-05,0.000151,0.000417,0.000105,-0.000175,-0.000527,-0.001068,-0.000427,-0.00019,-0.00023,-0.001057,-0.000925,-0.000119,-0.00045,-0.000406,3.9e-05,-0.000435
-9e-04,-0.000125,-0.000497,0.000265,5.1e-05,-0.000146,0.000614,0.000867,-0.000266,-0.000954,-0.001235,-0.00045,-0.000436,-0.00059,0.000192,0.000472,0.000353,0.00021,0.000295,-0.001166,-0.000403,-0.000472,-0.000497,-2.7e-05,-0.000558,0.000456,0.000462,-6e-04,0.000767,5e-06,0.000232,0.000307,0.000624,0.000385,2.5e-05,0.000203,0.000353,0.000396,-0.00026,0.000656,0.000397,0.000507,0.000155,-0.000315,-0.000802,-0.000623,-0.00081,0.000424,0.000313,0.00012,2.2e-05,-0.000144,-0.001086,7e-06,-0.000218,1.6e-05,0.00038,0.000374,-0.000238,0.000776,0.000249,-0.000515,-0.000345,0.000553,9.1e-05,0.000435,0.000189,-0.000269,-0.00026,-0.000907,-0.000345,0.000635,-0.001015,-0.001307,-0.000536,-0.000104,0.000206,0.000169,-0.001124,-0.000433,-0.000127,-0.000776,-0.000616,-0.000416,-0.000524,-0.000301,0.000358,0.000286,0.000352,-0.000133,0.000269,-0.000148,-0.000107,0.00035,-0.000108,-3.3e-05,0.000545,-0.000197,-2.9e-05,-0.000237,-5.4e-05,0.000757,0.001142,0.000604,-0.000173,-0.000488,-0.000163,0.000183,0.000179,0.000457,0.000388,-0.000169,-0.00024,-0.000743,-0.000352,1.1e-05,-0.001001,0.000106,-0.000631,-0.000332,-0.000165
-0.000413,-0.00027,0.00058,0.00016,-4e-06,0.000262,-0.000377,-0.000204,0.000248,-0.000535,0.000312,0.00019,0.000641,0.000861,-0.000147,-0.000219,-0.000572,-0.000443,-0.000349,0.000117,0.000796,0.000546,-0.000306,-0.00048,7e-04,4.8e-05,-0.000779,-0.000285,-0.000835,-0.000367,-0.00067,-0.000662,-0.00051,-0.000706,-0.000572,-0.000564,-0.000377,-0.000632,0.000179,-0.00078,-0.000672,-0.000177,-0.00072,0.000311,-0.000212,-0.000342,-0.000855,-0.000855,-0.000107,0.000418,0.000247,4.7e-05,0.000873,-0.000242,-0.00023,-0.000873,-0.00055,-0.000528,-0.000828,-0.000407,-0.000802,0.00018,5.2e-05,-0.000561,-0.000197,-7e-04,-0.000479,-0.000543,1.6e-05,0.000145,0.000163,-0.00086,-0.000218,-0.001256,-0.000883,-0.000455,-6.9e-05,-0.000289,7.5e-05,0.000202,0.00043,7e-06,0.000214,-4.1e-05,7e-05,0.000557,0.000209,-0.000188,-0.000446,0.000561,0.000121,0.000353,-0.000465,-0.00055,0.000564,0.000572,-0.00024,4.8e-05,-0.000177,0.000202,0.000267,-0.000538,-0.000402,5.1e-05,0.00015,-0.000219,-0.000626,-0.000305,0.000118,-4.4e-05,7.4e-05,-3.9e-05,-0.000364,0.00018,0.000679,1.6e-05,-0.000139,-0.000701,-0.000389,-3.1e-05,-0.000385
-0.000106,0.000199,1.6e-05,0.000534,-8.6e-05,-0.000754,-6.9e-05,0.000144,4.5e-05,-7.2e-05,-0.000313,-0.00024,-0.000132,-0.001016,-0.000807,-0.000192,-0.000594,3.4e-05,-0.000511,9.6e-05,-0.000687,-0.000925,-0.000273,-0.000283,-0.000303,-0.000644,0.000458,0.00039,0.000498,2.2e-05,-0.000222,-0.000675,-0.000626,0.000407,0.00076,4.3e-05,-9.9e-05,0.000193,-0.000163,0.000431,0.000303,0.000171,-0.000116,-0.000342,0.000224,0.000652,0.000654,0.000272,-0.000138,-0.000331,-6.5e-05,0.000179,0.000155,-0.000265,-0.000238,0.000371,5e-06,-0.000538,0.000228,0.000265,0.000576,8.4e-05,0.000293,0.000228,0.000277,3e-05,9.4e-05,0.000714,-1.7e-05,-0.000144,-0.000115,2.4e-05,0.000328,0.000571,0.000123,-3.8e-05,4.2e-05,0.000556,0.000807,0.000496,-0.000266,-0.000248,-0.000216,-5.6e-05,0.001098,0.000566,0.00015,0.00014,-0.00033,-0.000539,-0.000621,0.000269,-0.000141,-0.000313,-0.000382,-0.000646,-0.000315,0.000232,0.000268,9.1e-05,-0.000551,0.000202,0.000354,0.000752,0.000369,-0.000174,-0.000178,-0.000583,-0.000483,-0.000167,-0.00046,0.000107,-0.000326,-0.000352,-3e-06,0.000133,2e-04,0.000164,0.000407,-5e-06,-0.000281
0.000624,0.000609,0.000298,-7e-05,-0.000262,0.000194,0.000413,-0.000232,-0.000203,-8.8e-05,-0.000925,-0.000591,0.000173,0.000353,9.6e-05,-0.000139,0.000448,-7.7e-05,-9.6e-05,-0.000713,0.000442,0.000362,8.2e-05,0.000341,0.000173,0.000304,-0.000324,0.000246,-9.9e-05,-4e-06,-2.8e-05,6.4e-05,-0.000235,-0.000491,-0.000266,0.000533,-3.6e-05,-0.000459,0.00023,-0.00072,-0.000751,-3e-06,-0.000218,-0.00031,0.000202,0.000273,0.000844,0.000282,0.000103,-0.000151,-0.000204,-0.000238,-0.000514,-0.000122,-0.000207,-7.9e-05,7.1e-05,-0.000128,4.2e-05,-0.000314,-0.000294,-0.000141,-3.9e-05,-0.000354,1.1e-05,-9e-05,-0.000229,-0.000475,8.6e-05,-0.00044,0.000213,0.000104,-2.6e-05,-2.9e-05,0.000688,-0.000156,-0.000124,-0.000373,-0.000366,-0.000557,-0.000286,-9.6e-05,-0.000124,-0.000889,-0.001166,-0.000941,-0.000542,-0.000161,0.000131,4.9e-05,0.000318,-0.000127,-0.000188,4.4e-05,0.000179,0.000103,9.8e-05,0.000154,0.000254,-0.000258,7.4e-05,-0.000433,6.9e-05,0.000169,-0.000227,-0.000286,0.000117,-0.000461,7.6e-05,-0.000688,0.000279,1.6e-05,-0.000257,-0.000341,-0.000241,-0.000102,-0.000275,9.9e-05,0.000358,-0.000155,-0.000146
-0.000592,-0.000287,-0.000338,-0.000758,9.9e-05,-0.000212,-0.000294,-2.6e-05,-0.000337,-0.000236,-0.000236,-0.000199,6.8e-05,-1.6e-05,-3.4e-05,0.00017,4.5e-05,7.4e-05,0.000145,-0.000107,-0.000568,-0.000385,-0.000264,3.7e-05,-0.000244,-0.000453,-6.3e-05,1.4e-05,-0.000195,-0.000388,-0.000223,-0.000146,-0.00012,-0.000229,-0.000244,-5e-06,-0.00048,-0.000424,-0.000622,-0.000405,-0.000249,4.5e-05,-1.4e-05,-0.000409,-0.000252,-0.000216,-0.000348,-0.000254,-0.000233,-5.3e-05,-0.000127,-2.3e-05,-0.000326,0.000442,-0.000127,-0.000236,9.8e-05,-0.000169,9.3e-05,0.000347,0.000206,0.000312,-5.1e-05,0.000158,-0.000486,6.3e-05,0.000127,0.000153,-0.000363,0.000143,-0.000143,-0.000218,-5.7e-05,-0.000799,-0.000421,-0.000322,-0.000413,0.000356,-0.000201,-9.7e-05,7.4e-05,-0.000133,-0.000571,-7.5e-05,-2.3e-05,0.000344,-3.3e-05,0.000144,-0.000117,-0.000215,-0.000279,-1e-06,0.000212,-5.1e-05,-0.00022,-0.000149,-0.000132,3.3e-05,0.000252,5.8e-05,9.9e-05,-0.000134,-5.3e-05,-0.000591,-0.00038,-0.000238,0.000387,0.000198,0.000116,-0.000111,-0.000483,-0.000118,0.000313,0.00028,-0.000107,-0.000117,-0.000224,0.000288,-0.000173,-7.7e-05,0.000348
0.000186,-0.000969,-0.000143,0.000157,-0.000531,0.000234,0.000215,-0.000149,3.7e-05,-0.000147,0.000268,-0.000154,-0.000124,-0.000303,9e-06,-0.000115,-0.00018,4e-05,-0.000133,-2e-05,-0.000434,-0.000316,-0.000483,0.000164,-5e-06,-0.000188,-0.000141,-7.5e-05,-0.000207,0.000298,0.000248,0.000507,0.000122,-0.000462,-0.000352,-5.6e-05,0.000534,0.000242,-0.000347,-0.000335,-0.000325,-0.00025,-3.5e-05,0.000467,0.000479,-0.000425,-0.000227,-0.000515,-1e-05,0.000173,-2.9e-05,-0.000113,-0.000164,-0.000393,-0.000131,0.000153,0.000276,0.000132,0.000364,0.00034,8.5e-05,0.000221,-3e-06,0.000233,0.000267,1e-05,0,-0.000138,-0.000268,-6.9e-05,-0.000345,3.3e-05,6.2e-05,7.1e-05,-0.000538,-2e-06,0.000337,-0.000266,-9.6e-05,0.000443,4e-06,0.000308,0.000417,-3.2e-05,-0.000136,-0.000102,8e-05,-0.000195,0.000183,0,-0.000106,0.000148,-0.000122,0.000192,0.000101,-0.000113,-0.000488,-0.000184,-0.000529,-2.5e-05,0.000253,0.000298,-0.00015,0.000128,-8.6e-05,0.000227,-2.3e-05,0.000281,-3e-06,6.6e-05,-6.7e-05,-4.6e-05,0.000241,0.000215,0.000399,0.000394,3e-05,2.9e-05,9.1e-05,0.000412,-6e-05
-0.000316,0.000317,1.8e-05,0.000215,0.000359,-0.000148,-0.000224,-0.000114,-0.000297,0.000151,0.000235,0.000284,0.000189,-1.1e-05,-2.9e-05,-0.000134,0.000125,-2.9e-05,-0.000114,-5e-06,0.000316,0.000329,0.000348,5.2e-05,-0.000288,0.000116,8.7e-05,0.000101,3e-06,-0.000202,4.4e-05,-0.000249,0.000215,0.000231,0.000102,-0.000468,-0.000299,-0.000329,-0.000342,0.000174,0.000463,5.3e-05,-5.4e-05,7.2e-05,-0.000371,3.1e-05,-0.000192,0.00018,5.1e-05,-0.000135,-0.000444,-0.000112,1.8e-05,-0.000234,0.000215,6.9e-05,-0.000274,9e-05,5.9e-05,-0.000472,-0.000175,-1e-04,-0.000108,-4.4e-05,-0.000102,2.3e-05,0.000124,1.1e-05,0.000217,6.5e-05,0.000303,-0.000303,6.7e-05,-0.000105,-0.000392,9e-06,-0.000295,-0.000139,-7.4e-05,-0.000295,-0.000281,-0.000229,0.000129,-0.000404,-0.000279,-0.000524,-0.000251,-6e-05,-0.000153,-0.000287,6.5e-05,-2.4e-05,-0.000249,0.000295,-0.00021,0.000111,6.6e-05,0.000139,-0.000159,-5.1e-05,-0.000278,-0.000284,3.1e-05,-0.000402,-0.000147,0.000264,-0.000274,-7.7e-05,-0.000714,-0.000317,-0.000157,0.000284,-0.000216,-4.2e-05,-0.000144,-0.000446,0.000177,-0.000398,-0.000385,-0.000125,-0.000108
-8.4e-05,-5.2e-05,2e-05,-0.000342,-0.000159,-7.9e-05,0.00024,0.000168,0.000313,-0.000131,-0.000116,6.8e-05,-0.000312,7e-05,-2.3e-05,0.000325,-0.000145,2e-05,2.1e-05,0.000286,0.000341,0.000149,-3e-06,-0.000176,-3.6e-05,-0.000136,-0.000253,-5.8e-05,0.000188,-0.00018,0.000474,0.000256,0.000219,0.000155,-7.5e-05,0.000262,-0.000325,0.000124,0.000407,-0.00012,-0.00022,5.9e-05,0.000187,0.000141,7.9e-05,0.000345,0.000473,0.000363,-1.5e-05,-4.9e-05,4.2e-05,-6.1e-05,3e-05,8.1e-05,0.000408,0.000174,-0.000131,-2.6e-05,-0.000156,-0.000193,0.000201,-0.000427,-0.000121,4.9e-05,0.000229,8.9e-05,-0.000256,-6.8e-05,0.000119,-0.000132,8e-05,0.000233,0.000188,0.000304,0.000386,-1.4e-05,0,-0.000268,-3.9e-05,2.1e-05,-6.1e-05,0.000192,0.000171,-0.000185,0.000207,-8.6e-05,-0.000142,-8.3e-05,1.2e-05,-5.4e-05,-0.00013,-0.00032,-7.9e-05,0.000132,-3.4e-05,-1e-05,-9.1e-05,-0.000178,6.1e-05,-6.6e-05,0.00012,0.000177,-0.000215,7.7e-05,-2.4e-05,5.8e-05,-8.4e-05,-0.000158,-2.4e-05,0.000309,8e-05,-0.000355,-0.000136,-3.6e-05,-0.000174,9.8e-05,-0.000126,1.3e-05,9.6e-05,-0.000179,0.000139
0.000291,0.000265,-0.000209,2.4e-05,5.2e-05,-2.1e-05,9.5e-05,-0.000176,-0.000191,-0.000325,-0.000174,-2.4e-05,0.000207,-4.5e-05,-1.6e-05,0.000332,8.7e-05,-1.3e-05,-5.5e-05,-7.7e-05,-8e-05,-2e-06,1e-06,1.7e-05,0.000121,0.000119,0.000605,-0.000274,-0.000277,-0.000189,-0.000141,-0.000357,-0.000136,0.000175,-5.6e-05,-0.000273,-0.000124,0.000126,-0.000292,-4.5e-05,4.5e-05,-0.000282,-5.9e-05,1e-05,-0.00021,-0.000175,-0.000484,-4.3e-05,5e-06,-0.000239,6.1e-05,8.6e-05,-0.000218,5.9e-05,-0.000216,-4.7e-05,-8.7e-05,-0.00015,-0.000125,0.000218,-7e-06,0.000414,0.000166,-8.5e-05,-0.000152,0.00014,-3.8e-05,5.2e-05,-0.000176,3.7e-05,-0.000156,0.000111,-9.4e-05,-0.000174,0.000183,2.9e-05,0.000257,-2.6e-05,-1e-06,-0.000109,0.000215,8.3e-05,-0.000115,0.000247,-3.3e-05,9.1e-05,-6.3e-05,0.000198,0.000123,-4.1e-05,4.5e-05,-5.8e-05,4.1e-05,-3.7e-05,6.8e-05,-4.5e-05,-6.3e-05,-1e-05,-2.5e-05,-0.000223,7e-06,3.2e-05,0.000211,-5.7e-05,-0.00018,-2.6e-05,6e-05,1.5e-05,5e-06,-0.000236,5.9e-05,1e-04,0.000226,0.000111,8.4e-05,0.000161,0.000169,1.8e-05,0.000125,-1.6e-05,-0.000104
-3.3e-05,-0.000151,-3e-05,7.4e-05,-4.1e-05,0.000162,-2e-04,5.6e-05,7.7e-05,0.000152,0.000196,0.000129,-0.000199,-4.9e-05,5.1e-05,-5.6e-05,-0.000139,-4.1e-05,-1.2e-05,3.7e-05,8e-05,-4.1e-05,0.000122,-2.7e-05,0.000117,3.7e-05,-0.000146,0.000206,-2.3e-05,0.000205,9.2e-05,6.8e-05,2.6e-05,0.000119,7e-06,1.9e-05,5.7e-05,2e-05,0.000379,3.1e-05,7.4e-05,-1.5e-05,2.5e-05,-0.000166,-1.4e-05,1e-05,0.000104,-2e-06,1.5e-05,0.00018,0.000153,4.3e-05,0.000294,-5.4e-05,0.000234,-4.1e-05,0.00011,-3.2e-05,-0.000174,0.000175,-0.000197,-0.000262,2.5e-05,0.000104,6.2e-05,-4.6e-05,-0.000131,-1.3e-05,3.6e-05,0.000144,0.000305,-7.7e-05,-9.7e-05,0.000178,-8.1e-05,-6.6e-05,-1.1e-05,7.6e-05,-0.000151,5e-06,-0.000186,-4.2e-05,-9e-05,7.5e-05,-3.3e-05,-2.8e-05,0.000154,3e-05,5.8e-05,0.000116,-9.6e-05,-0.000208,5.2e-05,-5.2e-05,0.000169,-5.1e-05,0.000132,-4e-05,-6.7e-05,2e-06,-1.2e-05,-0.000188,-2.8e-05,-9.3e-05,0.00017,6.9e-05,-0.00017,3.9e-05,1e-06,-5.8e-05,0.000222,-0.000119,-8.7e-05,-0.000215,1e-05,-8e-05,9.6e-05,-3.9e-05,4.3e-05,2.6e-05,-0.000109
-0.000137,0.000153,0.000103,-1.6e-05,6e-06,-0.000175,2.6e-05,-8.8e-05,-8.3e-05,9e-06,1.1e-05,-3e-06,-0.000278,2.8e-05,3e-06,8.5e-05,2.6e-05,3.2e-05,0.000283,-4.9e-05,6.9e-05,1.5e-05,-4.7e-05,-0.000217,3.3e-05,3.3e-05,-9.4e-05,-0.000208,0.000141,0.000168,-0.000186,-1e-06,-0.000239,-0.000102,0.000177,-9.2e-05,0.000156,-0.000156,-3.6e-05,5e-05,-5.1e-05,-9.7e-05,-4.7e-05,0.000161,9.7e-05,-5e-06,-7.6e-05,-0.000158,9.6e-05,-0.000137,-8e-05,-1.9e-05,-9.5e-05,-3.7e-05,-0.00035,-7.6e-05,2.8e-05,0.000136,-2.7e-05,2.9e-05,-3.8e-05,0.000198,-8.9e-05,4.8e-05,-3.7e-05,2e-05,0.000136,5.9e-05,-8e-06,4.9e-05,-2.1e-05,6.4e-05,0.000102,-5.5e-05,0.000265,0.000237,-0.000132,-0.000105,-1.7e-05,3.8e-05,4.3e-05,2.1e-05,2.6e-05,-9.2e-05,2.3e-05,2.5e-05,-0.00014,-7.4e-05,-0.000112,0.000108,6.4e-05,9.1e-05,-5e-05,3.2e-05,4.6e-05,0.000215,-3.6e-05,4.9e-05,-5.4e-05,0.000165,-9e-05,5.2e-05,-0.000197,-1e-06,-0.000105,-7e-06,6e-06,2.5e-05,0.000266,5.5e-05,6.4e-05,-9.8e-05,7.4e-05,0.000164,0.00011,-3.5e-05,-2e-04,-0.000116,-0.000152,0.000176,8.9e-05
6.9e-05,-7.7e-05,0.000285,0.000126,0.000185,7.9e-05,-0.000119,4.9e-05,4.9e-05,4.7e-05,3.8e-05,2.9e-05,7.8e-05,5.1e-05,-1.5e-05,-0.000217,-3.9e-05,-1.9e-05,-6e-05,0.000114,-0.000116,-6.1e-05,6.9e-05,7e-05,-0.000226,-1.9e-05,0.000137,0.00033,-6.1e-05,-7.4e-05,-7.8e-05,-7.1e-05,0.000189,-7.9e-05,3.1e-05,0.000142,-3.4e-05,5e-06,-5.3e-05,0.000119,6.6e-05,0.000211,0.00016,-3.6e-05,4.3e-05,-7.3e-05,4.9e-05,0.000124,-7.8e-05,0.000144,-5e-06,-1e-06,7.6e-05,0.000143,0.000258,0.000106,-9e-06,5e-06,9e-06,2.7e-05,7.5e-05,-0.000132,7e-05,-0.000113,-0.000121,-3.4e-05,3.2e-05,-0.000115,4e-06,-9.1e-05,-5e-05,-7.3e-05,-2.7e-05,2.1e-05,0.000141,8e-06,-2.7e-05,0.000235,3.3e-05,-1e-06,0.000129,-1.5e-05,5.5e-05,0.000228,-0.000119,-3.2e-05,0.000182,0.000161,3.7e-05,-0.000106,2.5e-05,1.7e-05,0.000242,2.4e-05,0.000135,6e-06,6.8e-05,-9.4e-05,5e-06,-8e-06,9e-05,1.8e-05,0.000142,4.1e-05,0.000151,7e-06,0.000185,4.9e-05,0.000111,0.000192,-5.3e-05,2.4e-05,-0.000114,1.2e-05,1.2e-05,-8.2e-05,0.000153,0.000142,3.7e-05,-5.9e-05,0.00011
-2.2e-05,-0.000144,-4.2e-05,-1.8e-05,-0.000173,-4.1e-05,-9.6e-05,5.9e-05,-6.7e-05,0.000124,2.6e-05,-3.8e-05,0.000225,-4e-06,-5e-06,6e-06,0.000135,6e-06,-6.9e-05,-9e-05,-5e-06,4.1e-05,-4.6e-05,-3.6e-05,-0.000112,-3.6e-05,-5.7e-05,-3.1e-05,-2.4e-05,-5.1e-05,-7.6e-05,-5.3e-05,-1.9e-05,-4.8e-05,9e-06,-0.000107,2.4e-05,9.3e-05,4.3e-05,-4.7e-05,4e-06,-8.2e-05,3.4e-05,5e-06,8e-06,-3.2e-05,0.000114,-0.000111,-6e-06,-8e-05,-7.2e-05,-1e-05,-5.7e-05,2.3e-05,5.9e-05,-0.000116,5e-05,-7e-06,-5e-06,-1.9e-05,2.2e-05,3.7e-05,-9.8e-05,-9e-06,5.5e-05,1.4e-05,-4.1e-05,-1e-06,2.4e-05,-1e-05,-5.9e-05,-3.3e-05,-2.4e-05,0,-8.3e-05,-5.9e-05,4.8e-05,-7.8e-05,3.6e-05,-4.4e-05,-5.9e-05,7.7e-05,3.2e-05,8.1e-05,0.000168,2.3e-05,4.4e-05,-1e-05,-1.1e-05,-5e-05,4e-06,-5.7e-05,-6.1e-05,-6.4e-05,-0.000113,-0.000136,-4.1e-05,4.4e-05,3.4e-05,-3.7e-05,-5e-06,-1.1e-05,-5.5e-05,-4.5e-05,-0.000108,-3.2e-05,9.7e-05,-7e-05,-3.9e-05,7.7e-05,7e-06,6.2e-05,0.000123,-5.9e-05,-5e-05,8.8e-05,-3.9e-05,5.5e-05,5.4e-05,-5.3e-05,-6.6e-05
-5.1e-05,0.000171,0,-4.9e-05,7.9e-05,7.1e-05,3e-05,-0.000121,3.9e-05,-1.6e-05,9e-06,3.2e-05,-8e-06,5.3e-05,2.4e-05,-2e-05,1e-05,-5e-06,-4.9e-05,0.000177,6.5e-05,-2.4e-05,-1.4e-05,2.2e-05,5.9e-05,3.4e-05,1.4e-05,4.2e-05,9.1e-05,-3e-06,2.6e-05,9.7e-05,1.2e-05,9e-06,-2.7e-05,6.9e-05,-7.9e-05,8.4e-05,-8e-06,-1.5e-05,-1.7e-05,6.9e-05,-7e-06,-6.2e-05,5.2e-05,8.2e-05,-2.8e-05,5.9e-05,1e-06,5.9e-05,5e-05,-2.1e-05,9e-06,-6.1e-05,-8.4e-05,6.5e-05,2.9e-05,1.5e-05,5.2e-05,-2.5e-05,-5e-06,7.1e-05,7.8e-05,2e-06,2.1e-05,3.1e-05,1.5e-05,-1.1e-05,1.4e-05,3.5e-05,4.5e-05,1.7e-05,-1.3e-05,-2.7e-05,-6.7e-05,-3.1e-05,8.3e-05,6.3e-05,2.1e-05,2e-06,-0.000132,-0.000128,-1.6e-05,-0.000149,-0.000101,5.3e-05,-5.8e-05,3e-05,-6e-06,4.1e-05,1.6e-05,9.4e-05,-4.9e-05,-6.3e-05,4.5e-05,4.3e-05,-3.8e-05,2.4e-05,-2e-05,-3.6e-05,-0.000123,-9e-06,8e-06,6.2e-05,7.6e-05,-2.3e-05,-3.4e-05,4.5e-05,-0.000122,-4.3e-05,-1.7e-05,1.2e-05,-1.2e-05,-2.6e-05,-2e-05,5e-06,2.3e-05,9e-06,-5.4e-05,-4.3e-05,-6.6e-05
7.7e-05,-3.6e-05,-9.1e-05,6.6e-05,-1.2e-05,-4e-05,6.5e-05,2.4e-05,-2.4e-05,-4e-06,8e-06,3e-06,6.9e-05,-7e-06,-1e-06,-4.6e-05,4.3e-05,-1e-06,6.2e-05,-0.000128,-5e-06,-1e-06,-4.9e-05,4.4e-05,6.5e-05,-9e-06,2.1e-05,-7.6e-05,-6.7e-05,7.3e-05,1.3e-05,2.1e-05,-2.7e-05,1.9e-05,-8.1e-05,-1e-05,0.000117,-3e-06,-4.3e-05,-3.9e-05,-1.1e-05,4.9e-05,-4.9e-05,-8e-06,-2.7e-05,4.4e-05,1.8e-05,6.6e-05,6e-06,-1.3e-05,-1e-05,1.2e-05,-1.9e-05,-1e-05,-6.6e-05,-4.8e-05,-5e-06,-4.1e-05,2.2e-05,-9.9e-05,8e-06,5e-06,-7e-05,-1.5e-05,2.3e-05,-3.2e-05,4.1e-05,0,-2.9e-05,4.6e-05,-3.6e-05,-1.8e-05,-2.8e-05,-4e-06,6.2e-05,1.6e-05,-1e-06,1.3e-05,-1e-06,2.4e-05,0.000118,3.8e-05,-5.2e-05,-7.1e-05,5.7e-05,-3.1e-05,2.5e-05,-2.2e-05,-1.3e-05,-1.9e-05,-3.1e-05,-8e-06,4.4e-05,-6.3e-05,-5.6e-05,-8e-06,1e-05,-4.6e-05,2.9e-05,4.3e-05,-2e-05,-2.6e-05,1.8e-05,-4.7e-05,-3.6e-05,-2.1e-05,2.6e-05,4.8e-05,-3.6e-05,-1.8e-05,4.7e-05,3.1e-05,-5.6e-05,1.9e-05,-2e-05,-3e-05,7e-06,-1.2e-05,3.3e-05,7.3e-05,6.9e-05
-2.4e-05,2.1e-05,-2.7e-05,-2.3e-05,1e-05,1.2e-05,1.9e-05,7e-06,3.7e-05,1.5e-05,2.3e-05,4e-06,4.6e-05,-7e-06,-1e-05,4.4e-05,2.6e-05,3e-06,-2.6e-05,3.5e-05,-4.6e-05,-2.1e-05,6.9e-05,1e-06,1.1e-05,1.6e-05,2e-06,-2.9e-05,-3e-06,-3.2e-05,-3.8e-05,-2.3e-05,-1.3e-05,7.2e-05,5e-06,5.4e-05,-3.6e-05,-2.9e-05,3.2e-05,1e-05,1.6e-05,-3.5e-05,5e-06,3e-06,2.9e-05,-1.1e-05,-2.6e-05,-4.3e-05,1.7e-05,-1e-06,1.1e-05,4e-06,3.2e-05,3.9e-05,3e-06,-1.3e-05,-1.9e-05,2.2e-05,4.9e-05,-6e-05,-1.8e-05,-7e-05,4.8e-05,-1e-06,-5.2e-05,1.8e-05,2.8e-05,2e-05,-6e-06,-3.9e-05,-1.1e-05,2.1e-05,2.1e-05,2.5e-05,-3.8e-05,-4e-06,-6e-05,-7.2e-05,8e-06,-3e-06,-2.1e-05,-2.7e-05,-5e-06,5.1e-05,-1.9e-05,-1.7e-05,2.2e-05,0,9e-06,-2.7e-05,8e-06,1e-05,-2.6e-05,-4.3e-05,-1e-05,-2.5e-05,2.2e-05,5.3e-05,1.1e-05,1.3e-05,4.2e-05,1.6e-05,1.1e-05,2.7e-05,2.1e-05,-2.3e-05,1.4e-05,-2.7e-05,2e-06,-2e-05,6.7e-05,4.1e-05,1e-05,1.2e-05,-1.6e-05,1.1e-05,-1.9e-05,4.9e-05,4e-05,7e-06,-7e-06
-2e-06,-1e-06,6e-06,-4.6e-05,-8e-06,-1.8e-05,5e-06,1e-05,-4.2e-05,-6e-06,7e-06,-9e-06,-4.8e-05,-2.7e-05,1.4e-05,-3.4e-05,-3.9e-05,0,-2.3e-05,-2.5e-05,3.8e-05,-2e-06,-2.7e-05,2.1e-05,2.2e-05,7e-06,-5e-06,-2.3e-05,-1.6e-05,-1.1e-05,-2.6e-05,-5e-06,2.4e-05,-3.3e-05,1.6e-05,-4.9e-05,3e-06,-1e-06,1.5e-05,-3e-06,3e-06,-5e-06,-1.4e-05,2.1e-05,-4.9e-05,6e-06,-1.3e-05,-3.8e-05,-9e-06,1.6e-05,4.1e-05,5e-06,1.5e-05,-1.2e-05,-2.5e-05,7e-06,-3.6e-05,4e-06,5e-06,2.4e-05,-1.8e-05,-8e-06,-2.4e-05,-1.1e-05,1.6e-05,-1.1e-05,-1.7e-05,-5e-06,-3e-06,8e-06,3.5e-05,1e-06,9e-06,-2.4e-05,-1.1e-05,1.2e-05,1.9e-05,-2e-06,-3.1e-05,2e-05,3.7e-05,-1e-06,3.6e-05,2.5e-05,-2.1e-05,3e-06,2.2e-05,1.9e-05,1.1e-05,9e-06,-6e-06,0,1.4e-05,-1.8e-05,4.2e-05,3.6e-05,7e-06,-3.8e-05,-1e-05,0,2.5e-05,8e-06,-1.7e-05,8e-06,1.2e-05,-1.6e-05,-7e-06,-2.6e-05,4e-06,1.8e-05,-6e-06,-4.1e-05,-1e-05,0,1.7e-05,-1.4e-05,2.9e-05,-1.4e-05,6e-06,-7e-06,-1.7e-05
1.8e-05,4.9e-05,3e-05,3e-05,6e-06,2.3e-05,-2.6e-05,8e-06,2.1e-05,0,0,-8e-06,-2.3e-05,1.7e-05,4e-06,-5.7e-05,1.5e-05,-6e-06,3.3e-05,1.9e-05,-2.5e-05,-1.2e-05,1.2e-05,3.6e-05,-4e-06,-2e-06,2.5e-05,-5e-06,3.8e-05,-4e-06,7e-06,4.1e-05,1.2e-05,-3.3e-05,1.6e-05,2.6e-05,-7.3e-05,1.1e-05,4.1e-05,1.2e-05,-1.9e-05,-1e-05,5e-06,-1.6e-05,-7e-06,-1.3e-05,-8e-06,1e-05,8e-06,-1.4e-05,-2e-06,0,-1.4e-05,-3.1e-05,-1.1e-05,-1.2e-05,-5e-06,-1.2e-05,1.7e-05,4.3e-05,-2e-06,1e-05,2.4e-05,9e-06,-2.9e-05,-1.3e-05,-5e-06,-2e-06,-2e-06,-1.7e-05,-3.7e-05,-2.4e-05,-6e-06,1.8e-05,6e-05,-1.1e-05,1.2e-05,-5.3e-05,-1.9e-05,-3.4e-05,-6.4e-05,-6e-06,1.4e-05,1.1e-05,1.9e-05,2.8e-05,5e-06,-2.2e-05,-2.4e-05,7e-06,7e-06,-2.8e-05,-2.3e-05,-1.8e-05,1e-06,-1e-06,-3.6e-05,2.1e-05,-8e-06,-4.6e-05,-5.5e-05,-2.5e-05,-1.1e-05,-1.7e-05,-2.1e-05,-1.8e-05,-3.7e-05,7e-06,3e-06,3.3e-05,5e-06,2.8e-05,2.7e-05,-1.3e-05,-1e-06,1e-05,-1.9e-05,-5.2e-05,2.1e-05,-3.3e-05,-9e-06
-2.8e-05,-8.8e-05,1e-06,-1.8e-05,1.7e-05,-6e-06,1.7e-05,-1.6e-05,-2.8e-05,5e-06,8e-06,1e-05,-2e-05,1.2e-05,-1.1e-05,-1e-05,1e-06,2e-06,-8e-06,-1e-06,-3.8e-05,1.2e-05,-1.7e-05,-2e-05,-2e-06,1e-05,-6.6e-05,-1.4e-05,-4.4e-05,1.2e-05,1.2e-05,-1.2e-05,3e-06,1e-06,2.3e-05,-2.7e-05,5.4e-05,9e-06,-3e-05,-1e-06,3.2e-05,-4e-06,-6e-06,-2.5e-05,-1.7e-05,-2.9e-05,-6e-06,7e-06,-1.4e-05,5e-06,-2.7e-05,-5e-06,-9e-06,2.3e-05,3.6e-05,3e-06,1.1e-05,2e-06,-1.5e-05,8e-06,-1e-06,-5e-06,-1.8e-05,6e-06,2.8e-05,-1e-05,-1.8e-05,-6e-06,8e-06,5.3e-05,-1.6e-05,2e-06,6e-06,-1.5e-05,1.7e-05,-8e-06,-2e-05,3.5e-05,-1e-06,4e-06,1.5e-05,-7e-06,-1.9e-05,-4e-06,-3.2e-05,-2e-06,-1e-05,1e-05,-2e-06,8e-06,-5e-06,-1.3e-05,2.4e-05,-8e-06,1.7e-05,-5.1e-05,3.7e-05,-2e-05,-1.8e-05,6e-06,2.5e-05,1.3e-05,2e-06,5e-06,2.8e-05,-1e-05,-9e-06,2.1e-05,6.4e-05,1e-06,-1.7e-05,-1.3e-05,-4e-05,-1.4e-05,1e-06,-1.1e-05,2.6e-05,1.3e-05,-3e-05,1.4e-05,1.6e-05
5e-06,1.8e-05,1.6e-05,3e-06,-4.3e-05,-5e-06,8e-06,3e-06,2.2e-05,2.6e-05,6e-06,-1.2e-05,-1.4e-05,-1.9e-05,5e-06,-2.8e-05,-5e-06,1e-06,-1.9e-05,7e-06,2.6e-05,-8e-06,1e-05,-1.1e-05,-2.4e-05,-2e-06,3.1e-05,1.9e-05,5e-06,3e-05,1.8e-05,-1.7e-05,-5e-06,-1.2e-05,-2e-06,1.4e-05,1e-06,7e-06,7e-06,-2.3e-05,-2.4e-05,-1.1e-05,-8e-06,-4e-06,1.9e-05,1.6e-05,3e-06,-7e-06,1.2e-05,1e-06,-4e-06,-1e-06,1e-06,2.6e-05,-3.7e-05,6e-06,-5e-06,-2.4e-05,-9e-06,0,3e-06,7e-06,0,5e-06,-5e-06,1e-06,1.3e-05,-1.3e-05,1.1e-05,-2.4e-05,1.4e-05,-1.3e-05,1e-06,7e-06,-3.3e-05,-7e-06,1.1e-05,1.6e-05,-6e-06,2e-06,3e-05,3e-06,-3e-06,-2e-06,4.4e-05,-1.7e-05,-2e-06,-2e-06,1.3e-05,-2.4e-05,1e-06,1e-05,1.4e-05,1e-06,4e-06,2.5e-05,-1.9e-05,8e-06,-6e-06,3e-06,1.3e-05,-6e-06,0,6e-06,-1.8e-05,-8e-06,3.9e-05,-6e-06,3.2e-05,-2.2e-05,-1.3e-05,-1.1e-05,-1.3e-05,2e-05,1.5e-05,-1.2e-05,-2.4e-05,-1e-06,-1.2e-05,2.7e-05,-1e-06
1.8e-05,1.2e-05,7e-06,3.2e-05,4.4e-05,-6e-06,-7e-06,-9e-06,-1.7e-05,-2e-05,7e-06,8e-06,9e-06,1.2e-05,5e-06,3.1e-05,2e-06,-3e-06,3.6e-05,-1e-05,1.7e-05,1.1e-05,-1e-05,1e-06,-5e-06,0,9e-06,-2e-06,4e-05,-1.4e-05,1.3e-05,1.6e-05,-1.2e-05,2.1e-05,-9e-06,-2.4e-05,1.8e-05,1.1e-05,-8e-06,1e-05,-7e-06,-3e-06,-1e-05,4e-06,-1.1e-05,1e-05,1.5e-05,2.6e-05,-7e-06,-3e-06,-1.3e-05,-1e-06,-8e-06,-2.1e-05,-2.5e-05,-1.1e-05,1.1e-05,3.7e-05,-2.4e-05,9e-06,-9e-06,-1.4e-05,-1e-06,0,2.1e-05,1e-06,4e-06,-2e-06,-9e-06,8e-06,-6e-06,8e-06,-4e-06,0,-3.1e-05,0,1e-05,1.8e-05,1.2e-05,7e-06,-1.8e-05,-2e-06,-6e-06,1.5e-05,-1.3e-05,1.6e-05,4.4e-05,1e-06,-5e-06,-1.6e-05,3e-06,-1.9e-05,-1.6e-05,9e-06,-3.2e-05,1.9e-05,-1e-05,2e-06,0,3.4e-05,-3e-06,0,1.3e-05,-1.7e-05,2e-05,-4e-06,-2e-05,-1.1e-05,-2.8e-05,7e-06,-1e-06,-1e-06,1.6e-05,-5e-06,3e-06,2.2e-05,1.9e-05,5e-06,1e-05,-4e-06,-2e-05
-1.9e-05,9e-06,5e-06,-2.4e-05,-2.2e-05,1.5e-05,1.9e-05,5e-06,1.6e-05,2e-05,1e-06,-8e-06,-1.5e-05,4e-06,-3e-06,2.9e-05,4e-06,4e-06,-3.4e-05,-4e-06,-2.4e-05,-2.5e-05,-3e-06,-2.6e-05,1.4e-05,4e-06,-2.8e-05,2.2e-05,-5.1e-05,-1.2e-05,4e-06,-1.7e-05,9e-06,1.9e-05,-6e-06,2.4e-05,-3.1e-05,4e-06,-1.9e-05,-1.7e-05,2.5e-05,2.9e-05,-4e-06,2.2e-05,2.8e-05,-3e-06,-1e-05,7e-06,3e-06,6e-06,1.6e-05,2e-06,1.9e-05,-1.2e-05,3.2e-05,1.1e-05,1.2e-05,-2e-05,-1.2e-05,2e-06,-8e-06,2.7e-05,-2e-06,-1e-06,-2.9e-05,-1e-05,-3e-06,4e-06,-7e-06,-7e-06,-1.2e-05,0,3e-06,-7e-06,1.5e-05,-2e-06,1e-06,1.8e-05,-1e-06,-1.1e-05,-1.3e-05,-7e-06,3e-06,-1.2e-05,-5e-06,1e-05,-1.3e-05,2e-06,-6e-06,-6e-06,-4e-06,1.6e-05,6e-06,1.6e-05,4e-06,-1.1e-05,1.6e-05,-1.3e-05,1.1e-05,-1.4e-05,-1.7e-05,0,-1.5e-05,1.9e-05,-1.1e-05,2e-06,-5e-06,-2e-06,-3.4e-05,2e-06,1.2e-05,4e-06,3e-06,0,-7e-06,-2e-06,-9e-06,-2e-06,-2e-05,-3e-05,1.6e-05
8e-06,4e-06,-9e-06,-8e-06,1.1e-05,-2e-06,-5e-06,9e-06,-1.8e-05,3e-06,1e-06,-4e-06,1e-06,-4e-06,1e-06,-6e-06,0,-4e-06,2e-06,0,2e-06,8e-06,1.5e-05,-7e-06,2e-05,2e-06,1.6e-05,-1.2e-05,1.6e-05,-1e-06,-2e-06,3e-06,-4e-06,-3e-06,-1.1e-05,-1.1e-05,1.8e-05,-9e-06,2.9e-05,1.4e-05,-1.9e-05,-9e-06,-4e-06,-1.4e-05,-9e-06,4e-06,3.1e-05,-2.4e-05,-3e-06,-1e-06,1.7e-05,-2e-06,-2e-06,2e-05,-3.3e-05,-2e-06,-1e-06,7e-06,-9e-06,-2.4e-05,1.1e-05,6e-06,2e-06,9e-06,6e-06,3e-06,5e-06,-6e-06,3e-06,2.2e-05,1.7e-05,-1.1e-05,1e-06,1.2e-05,-1.3e-05,-1.1e-05,-5e-06,-1.1e-05,4e-06,3e-06,1.3e-05,5e-06,2.1e-05,-1e-05,4e-06,-5e-06,3e-06,-1.2e-05,8e-06,1.6e-05,5e-06,3e-06,1e-06,1.7e-05,-2.9e-05,-2.6e-05,-7e-06,1.8e-05,1.2e-05,-9e-06,1.9e-05,-1e-05,1.2e-05,-3e-06,4e-06,2e-06,2.5e-05,1.4e-05,-1.3e-05,1.9e-05,1.5e-05,-5e-06,-2.1e-05,-3e-06,-7e-06,-1.2e-05,-5e-06,1e-05,1.5e-05,9e-06,7e-06
7e-06,7e-06,-1.2e-05,1.4e-05,-9e-06,-8e-06,-3.2e-05,-7e-06,1.2e-05,-1.1e-05,-2e-06,-5e-06,2.5e-05,-3e-06,2e-06,2.9e-05,1e-06,0,0,3e-06,9e-06,-6e-06,-1.6e-05,4e-06,1e-06,1e-06,-2e-06,1.2e-05,2.1e-05,1.4e-05,-2e-06,2e-06,1e-05,-1.6e-05,1e-06,1e-05,-9e-06,2e-06,-4e-06,-1.2e-05,1e-05,2.2e-05,-3e-06,-2e-06,1.8e-05,-3e-06,-2.5e-05,-1.1e-05,1e-06,-3e-06,-5e-06,1e-06,1e-06,5e-06,3.9e-05,2e-06,1e-06,-1.2e-05,6e-06,-2.7e-05,4e-06,-5e-06,1e-06,2e-06,-9e-06,-7e-06,-2e-06,4e-06,0,-1e-06,5e-06,1.3e-05,0,-9e-06,-1.7e-05,-3e-06,-1.9e-05,2e-06,1e-06,-9e-06,-2e-06,6e-06,-9e-06,8e-06,-1.2e-05,-1.4e-05,-6e-06,6e-06,-3e-06,-4e-06,-5e-06,-1e-06,-5e-06,1.4e-05,2e-05,2.4e-05,-3e-06,-1.5e-05,-4e-06,-1.3e-05,-5e-06,1.4e-05,2e-06,-5e-06,6e-06,4e-06,-3e-06,3e-06,-3e-06,-5e-06,-1e-06,7e-06,4e-06,0,-2e-06,8e-06,1.4e-05,1.4e-05,1e-05,3e-06,-1.3e-05
-1.5e-05,3e-06,-1.8e-05,-1.3e-05,3e-06,3e-06,0,3e-06,-1.5e-05,1.9e-05,4e-06,2e-06,2.9e-05,9e-06,-2e-06,-2.4e-05,5e-06,1e-06,1.6e-05,-3e-06,-1.8e-05,1e-05,1.1e-05,-4e-06,-1e-05,-1e-06,-1.5e-05,-2e-05,-2.2e-05,-1e-06,5e-06,4e-06,-9e-06,-3e-06,2e-06,-6e-06,2e-05,8e-06,6e-06,2e-06,-3e-06,-9e-06,-9e-06,-1.1e-05,-1.1e-05,-6e-06,2.5e-05,9e-06,3e-06,5e-06,4e-06,2e-06,-5e-06,-1.9e-05,-9e-06,2e-06,-4e-06,6e-06,4e-06,1.7e-05,-2e-06,-1.1e-05,2e-06,-3e-06,8e-06,9e-06,1.2e-05,-5e-06,2e-06,-4e-06,-1.9e-05,-1.2e-05,-1e-06,1e-06,1.9e-05,2e-06,8e-06,-3e-05,-3e-06,1e-05,3e-06,-3e-06,-1.6e-05,1e-05,9e-06,1e-06,8e-06,-7e-06,1e-06,-3e-06,1e-06,1.3e-05,-5e-06,9e-06,1e-06,-8e-06,3e-06,1.1e-05,0,1.7e-05,-3e-06,-9e-06,-1.8e-05,4e-06,-8e-06,4e-06,-8e-06,-1.3e-05,-1e-06,-1.7e-05,-9e-06,1.1e-05,-1e-05,3e-06,4e-06,-9e-06,-2e-05,-6e-06,1e-06,1.8e-05,-2e-06
9e-06,-4.1e-05,2e-06,5e-06,8e-06,2e-06,-1e-06,-6e-06,1.2e-05,-1.3e-05,0,-2e-06,-5e-06,-9e-06,0,1.2e-05,0,-2e-06,-9e-06,5e-06,3e-06,-7e-06,-8e-06,9e-06,-1.1e-05,1e-06,7e-06,6e-06,3e-06,-6e-06,-3e-06,-1.4e-05,-3e-06,-1e-06,6e-06,1.2e-05,-1.6e-05,8e-06,1e-06,-6e-06,-2e-06,3e-06,-2e-06,1.4e-05,1e-06,1e-06,-2.6e-05,8e-06,-6e-06,-5e-06,-6e-06,-1e-06,-2e-06,-1e-06,-1.1e-05,-3e-06,-8e-06,-1e-06,1.1e-05,2.8e-05,3e-06,7e-06,0,0,4e-06,-8e-06,-1e-06,-8e-06,1e-06,-3e-06,1.5e-05,-7e-06,-2e-06,3e-06,1.1e-05,-1e-06,2e-05,-2e-06,1e-06,2e-06,-9e-06,2e-06,5e-06,-9e-06,0,1.8e-05,3e-06,1e-06,-4e-06,-7e-06,-1e-06,-9e-06,3e-06,9e-06,1e-05,5e-06,8e-06,-5e-06,-1e-06,1e-06,-8e-06,-6e-06,1.2e-05,-4e-06,1.1e-05,6e-06,-6e-06,-4e-06,2e-05,0,-1.8e-05,-8e-06,2.2e-05,3e-06,4e-06,8e-06,1.8e-05,-8e-06,4e-06,-1.6e-05,9e-06
0,1.9e-05,9e-06,1e-05,-1.4e-05,3e-06,4e-06,8e-06,-1.2e-05,9e-06,0,-5e-06,-1e-06,7e-06,4e-06,1.4e-05,1e-06,3e-06,-1.2e-05,-1e-05,2e-05,8e-06,4e-06,9e-06,1e-06,0,-3e-06,-1.3e-05,4e-06,-3e-06,-2e-06,9e-06,2e-06,-1e-06,6e-06,-1e-05,-4e-06,-1e-06,-4e-06,-1e-06,-1e-06,-8e-06,-1e-06,7e-06,-1.3e-05,4e-06,1e-05,1e-06,7e-06,6e-06,-1e-05,-1e-06,-4e-06,1.5e-05,3e-06,3e-06,-1e-06,2e-06,1.4e-05,5e-06,-3e-06,-1.2e-05,-3e-06,-1e-06,4e-06,6e-06,-2e-06,2e-06,-3e-06,1.2e-05,0,1.5e-05,2e-06,-4e-06,-2.1e-05,-3e-06,-1e-05,-4e-06,-7e-06,-4e-06,1e-05,-5e-06,3e-06,2e-06,2e-06,0,3e-06,2e-06,5e-06,9e-06,2e-06,-2e-06,8e-06,6e-06,2e-06,0,-1.6e-05,1e-06,-6e-06,-3e-06,1.1e-05,1.3e-05,-1e-06,-4e-06,-1.2e-05,4e-06,2e-06,9e-06,2.5e-05,3e-06,-1e-05,8e-06,-2.1e-05,-2e-06,0,-2e-06,-1.7e-05,7e-06,-5e-06,-8e-06,2e-06
-9e-06,-1e-06,1.4e-05,-1.5e-05,1.4e-05,-4e-06,1.1e-05,-1e-06,1e-05,-8e-06,0,3e-06,-1.2e-05,-7e-06,-2e-06,2e-06,-1e-06,-1e-06,1.6e-05,7e-06,-4e-06,-1.3e-05,-6e-06,0,5e-06,1e-06,-7e-06,1.1e-05,8e-06,5e-06,-2e-06,4e-06,-1e-06,1.5e-05,0,4e-06,-1e-06,-5e-06,-9e-06,-1e-06,1e-06,-4e-06,0,-1e-06,3e-06,3e-06,-1e-05,6e-06,-8e-06,-8e-06,6e-06,-1e-06,6e-06,1e-06,4e-06,2e-06,-2e-06,-5e-06,5e-06,-6e-06,-4e-06,1.3e-05,0,0,-5e-06,4e-06,-3e-06,-4e-06,-3e-06,-5e-06,-8e-06,-1.2e-05,1e-06,2e-06,-2e-06,-3e-06,-7e-06,4e-06,-1e-06,-1e-06,-6e-06,7e-06,2e-06,8e-06,7e-06,-1e-05,-6e-06,-4e-06,-4e-06,-6e-06,1e-06,-1e-06,-8e-06,0,-9e-06,2e-06,1e-05,0,-2e-06,-1.6e-05,-4e-06,-9e-06,-3e-06,7e-06,1e-05,1e-06,3e-06,4e-06,4e-06,4e-06,3e-06,-2e-06,0,-5e-06,-1e-06,-8e-06,8e-06,-8e-06,-3e-06,2e-06,-8e-06
1e-05,1.3e-05,3e-06,5e-06,-9e-06,1e-06,0,-4e-06,-1.1e-05,7e-06,-1e-06,-5e-06,-1.7e-05,5e-06,-2e-06,1.3e-05,-5e-06,-1e-06,-2e-06,-6e-06,-1e-05,7e-06,8e-06,7e-06,3e-06,0,1.7e-05,-4e-06,-1.6e-05,7e-06,-7e-06,-1e-06,5e-06,-3e-06,-2e-06,-4e-06,1.5e-05,0,7e-06,-4e-06,7e-06,1e-06,-1e-06,-7e-06,-1.1e-05,-2e-06,3e-06,-4e-06,7e-06,8e-06,-1e-06,-1e-06,0,-1.4e-05,8e-06,-7e-06,-1e-06,4e-06,3e-06,-2e-06,3e-06,-2.1e-05,-3e-06,-4e-06,-8e-06,0,1e-06,1e-06,2e-06,5e-06,5e-06,-3e-06,-2e-06,-1e-06,7e-06,-2e-06,3e-06,1.9e-05,-3e-06,2e-06,-5e-06,-4e-06,9e-06,-4e-06,-1.8e-05,3e-06,3e-06,4e-06,7e-06,-6e-06,0,-7e-06,3e-06,-4e-06,-2e-06,-1.5e-05,2e-06,-1e-06,-3e-06,8e-06,-2e-06,2e-06,2e-06,-3e-06,-4e-06,2e-06,-1.1e-05,-5e-06,-1.6e-05,5e-06,8e-06,-4e-06,7e-06,7e-06,-2e-06,1.1e-05,-5e-06,-4e-06,0,1.5e-05,0
-2e-06,-4e-06,-3e-06,6e-06,4e-06,-2e-06,1e-06,1e-06,7e-06,-2e-06,-1e-06,0,-2e-06,0,2e-06,-6e-06,0,1e-06,-9e-06,6e-06,8e-06,-6e-06,-4e-06,3e-06,3e-06,0,-1.2e-05,8e-06,8e-06,-4e-06,-4e-06,-9e-06,-3e-06,-6e-06,-5e-06,2e-06,-3e-06,1e-06,-5e-06,3e-06,-1.4e-05,-7e-06,0,-6e-06,1e-05,-1e-06,1e-06,-1.5e-05,-5e-06,-8e-06,7e-06,1e-06,3e-06,4e-06,-6e-06,6e-06,7e-06,-7e-06,-6e-06,3e-06,0,1.7e-05,4e-06,-3e-06,6e-06,2e-06,3e-06,0,2e-06,-8e-06,9e-06,8e-06,0,0,-9e-06,0,0,2e-06,0,1e-06,6e-06,1e-06,-1.2e-05,-4e-06,1.4e-05,8e-06,1e-06,-4e-06,-6e-06,-8e-06,0,2e-06,0,-7e-06,-8e-06,1.1e-05,-1e-05,2e-06,2e-06,8e-06,-5e-06,1e-06,0,4e-06,0,3e-06,1e-06,-5e-06,-1.2e-05,-8e-06,2e-06,0,0,-3e-06,1e-06,-7e-06,-3e-06,-1e-06,-1e-06,-8e-06,6e-06
-5e-06,1.1e-05,-7e-06,-1e-05,-3e-06,7e-06,-2e-06,-1e-06,-9e-06,-3e-06,-1e-06,0,0,-3e-06,0,-1.4e-05,-1e-06,-1e-06,7e-06,-4e-06,-1e-06,7e-06,-3e-06,-8e-06,1e-06,0,-2e-06,-2e-06,1.3e-05,-5e-06,2e-06,1.1e-05,-1e-06,0,-3e-06,-3e-06,-6e-06,2e-06,1.3e-05,-7e-06,1.2e-05,9e-06,0,8e-06,-3e-06,-1e-06,3e-06,-1e-06,3e-06,8e-06,4e-06,1e-06,1e-06,1.2e-05,9e-06,-1e-06,3e-06,1e-05,-4e-06,-1.2e-05,-2e-06,-5e-06,-2e-06,1e-06,-1e-06,0,-3e-06,-5e-06,0,1e-05,-1e-05,-8e-06,0,3e-06,-3e-06,0,2e-06,1e-05,1e-06,2e-06,1e-06,-1e-06,-3e-06,0,-1e-05,-4e-06,1e-06,3e-06,4e-06,9e-06,-2e-06,3e-06,1e-06,-7e-06,2e-06,1e-05,8e-06,-5e-06,4e-06,8e-06,7e-06,-5e-06,-3e-06,-1e-06,4e-06,1e-06,1.2e-05,4e-06,-9e-06,-2e-06,-2e-06,1e-06,0,1e-06,1e-06,0,5e-06,4e-06,1e-06,-4e-06,-2e-06
7e-06,-1.8e-05,-3e-06,7e-06,3e-06,-7e-06,-4e-06,2e-06,7e-06,1.1e-05,-1e-06,0,7e-06,2e-06,-1e-06,0,0,0,-1e-06,3e-06,-7e-06,-6e-06,6e-06,2e-06,-2e-06,0,1.1e-05,2e-06,-2.3e-05,0,1e-06,-4e-06,0,-4e-06,1e-06,2e-06,1e-06,0,-9e-06,3e-06,-4e-06,2e-06,0,2e-06,9e-06,-1e-06,2e-06,1.1e-05,-2e-06,-5e-06,-7e-06,0,-4e-06,-7e-06,-1.4e-05,-5e-06,-2e-06,-9e-06,-9e-06,-1.6e-05,1e-06,1.1e-05,4e-06,1e-06,6e-06,6e-06,2e-06,0,0,-2e-06,2e-06,0,0,-5e-06,8e-06,0,-3e-06,-1e-05,0,-2e-06,0,1e-06,8e-06,4e-06,6e-06,-9e-06,0,-1e-06,-3e-06,1e-06,1e-06,-3e-06,-3e-06,-8e-06,5e-06,-1.1e-05,-1e-06,6e-06,0,-1.2e-05,1e-06,6e-06,3e-06,-2e-06,-9e-06,-2e-06,-7e-06,4e-06,-7e-06,3e-06,-8e-06,-4e-06,-8e-06,-1e-06,-3e-06,2e-06,-1.1e-05,5e-06,-1e-06,-5e-06,-4e-06
-4e-06,-8e-06,-3e-06,-1e-06,1e-06,3e-06,8e-06,0,-8e-06,-1.3e-05,-1e-06,-2e-06,3e-06,0,1e-06,-1.9e-05,0,0,0,-4e-06,7e-06,4e-06,-4e-06,-6e-06,-5e-06,0,-8e-06,-3e-06,1.1e-05,6e-06,0,-1e-06,0,2e-06,3e-06,1e-06,2e-06,-1e-06,9e-06,-4e-06,-5e-06,1e-06,0,3e-06,-1e-06,2e-06,2e-06,4e-06,-1e-06,2e-06,0,0,-3e-06,-9e-06,5e-06,3e-06,0,8e-06,-5e-06,7e-06,-1e-06,-8e-06,-3e-06,1e-06,-2e-06,-4e-06,-1e-06,-2e-06,-2e-06,0,7e-06,2e-06,1e-06,6e-06,3e-06,-1e-06,0,-7e-06,2e-06,-4e-06,-8e-06,0,-1e-06,-1e-06,3e-06,2e-06,-1e-06,-2e-06,4e-06,-3e-06,0,6e-06,-1e-06,-7e-06,0,-5e-06,-4e-06,-5e-06,3e-06,-7e-06,-4e-06,-3e-06,0,0,1.2e-05,-2e-06,-2e-06,-2e-06,4e-06,0,-9e-06,2e-06,6e-06,-2e-06,0,-5e-06,1.1e-05,-4e-06,1e-06,9e-06,2e-06
-3e-06,6e-06,0,-6e-06,-6e-06,-2e-06,1e-06,-1e-06,7e-06,1.1e-05,0,1e-06,4e-06,-3e-06,0,8e-06,1e-06,-1e-06,-3e-06,2e-06,5e-06,-7e-06,0,-5e-06,-2e-06,0,0,0,8e-06,-3e-06,1e-06,-1e-06,2e-06,5e-06,1e-06,0,5e-06,0,-1.1e-05,1e-06,9e-06,5e-06,1e-06,-9e-06,4e-06,2e-06,-1e-06,-2e-06,3e-06,0,-4e-06,0,1e-06,8e-06,7e-06,-1e-06,-2e-06,-1.1e-05,-3e-06,1.8e-05,0,1e-06,2e-06,0,0,4e-06,3e-06,-3e-06,-2e-06,-1e-06,-9e-06,-4e-06,-1e-06,-4e-06,-5e-06,0,7e-06,-9e-06,-1e-06,3e-06,6e-06,-3e-06,-1e-06,0,-5e-06,1.1e-05,-4e-06,3e-06,-7e-06,-6e-06,0,-1e-06,2e-06,-6e-06,8e-06,9e-06,2e-06,2e-06,-2e-06,2e-06,-2e-06,-1e-06,-4e-06,0,-1.2e-05,-1e-06,5e-06,-5e-06,1.9e-05,6e-06,1e-06,2e-06,2e-06,1e-06,3e-06,7e-06,-1.3e-05,3e-06,-4e-06,4e-06,2e-06
7e-06,5e-06,0,7e-06,7e-06,5e-06,-6e-06,2e-06,-7e-06,-8e-06,0,1e-06,-1e-06,3e-06,-1e-06,-1e-06,-1e-06,1e-06,5e-06,-1e-06,-9e-06,5e-06,-2e-06,3e-06,3e-06,0,8e-06,-3e-06,-1.3e-05,0,2e-06,3e-06,-1e-06,0,2e-06,0,-7e-06,-2e-06,3e-06,-3e-06,-7e-06,-3e-06,0,-1e-06,-5e-06,0,-1e-06,0,-3e-06,-1e-06,2e-06,0,-1e-06,6e-06,-7e-06,-2e-06,-2e-06,1.2e-05,3e-06,6e-06,3e-06,2e-06,-3e-06,1e-06,-7e-06,-2e-06,1e-06,1e-06,1e-06,-3e-06,1e-06,0,0,0,0,0,-3e-06,-7e-06,-1e-06,0,3e-06,1e-06,4e-06,1e-06,6e-06,1e-06,2e-06,-3e-06,7e-06,1e-06,0,0,-1e-06,-5e-06,-5e-06,2e-06,4e-06,-1e-06,-1e-06,9e-06,5e-06,0,5e-06,-1e-06,1.1e-05,-1e-06,0,2e-06,1.3e-05,-5e-06,4e-06,-2e-06,-3e-06,2e-06,2e-06,-3e-06,1.1e-05,3e-06,0,-6e-06,-2e-06
-5e-06,7e-06,3e-06,-2e-06,-4e-06,-5e-06,-1e-06,-2e-06,5e-06,4e-06,-1e-06,-2e-06,5e-06,1e-06,0,-9e-06,0,0,-1e-06,0,-4e-06,-5e-06,6e-06,-2e-06,4e-06,0,-6e-06,2e-06,4e-06,-3e-06,0,-3e-06,0,-3e-06,-1e-06,0,2e-06,0,-3e-06,1e-06,3e-06,2e-06,0,1e-06,2e-06,-1e-06,-1e-06,-6e-06,3e-06,0,5e-06,0,4e-06,-8e-06,4e-06,2e-06,1e-06,-1e-05,4e-06,-8e-06,-2e-06,-2e-06,1e-06,1e-06,5e-06,2e-06,-1e-06,-3e-06,1e-06,2e-06,7e-06,2e-06,0,2e-06,3e-06,0,-6e-06,5e-06,-2e-06,1e-06,-5e-06,1e-06,-8e-06,-1e-06,-1.1e-05,-8e-06,1e-06,3e-06,-3e-06,2e-06,0,1e-06,-1e-06,-3e-06,3e-06,-9e-06,-7e-06,2e-06,1e-06,1e-06,0,-1e-06,-2e-06,2e-06,-1e-05,-2e-06,-2e-06,6e-06,-3e-06,-2e-06,6e-06,3e-06,-4e-06,-2e-06,0,-2e-06,-8e-06,-4e-06,1e-06,-4e-06,-1e-06
-1e-06,1e-06,3e-06,-3e-06,2e-06,4e-06,-3e-06,2e-06,-7e-06,-1e-06,-1e-06,2e-06,-2e-06,-3e-06,1e-06,6e-06,0,-1e-06,-7e-06,0,5e-06,7e-06,-5e-06,2e-06,0,0,1e-06,-2e-06,3e-06,3e-06,1e-06,1e-06,-1e-06,-1e-06,-1e-06,1e-06,-4e-06,0,5e-06,-2e-06,-3e-06,-9e-06,0,5e-06,-9e-06,0,-5e-06,-7e-06,-2e-06,0,-2e-06,0,0,-4e-06,-6e-06,-1e-06,-1e-06,1e-05,5e-06,-4e-06,0,1e-06,-1e-06,0,-2e-06,-2e-06,0,-2e-06,0,-6e-06,-5e-06,-1e-06,-1e-06,-3e-06,-3e-06,-1e-06,3e-06,5e-06,-1e-06,-2e-06,-1e-06,0,3e-06,2e-06,9e-06,0,-1e-06,-2e-06,2e-06,-1e-06,0,-3e-06,2e-06,0,-6e-06,1e-05,4e-06,-3e-06,-3e-06,-8e-06,-6e-06,3e-06,-3e-06,-1e-06,7e-06,-1e-06,-3e-06,-2e-06,-1e-05,4e-06,2e-06,0,3e-06,-1e-06,-1e-06,5e-06,4e-06,-2e-06,-1e-06,3e-06,2e-06
4e-06,-1e-06,2e-06,5e-06,-1e-06,-4e-06,-3e-06,0,5e-06,-1e-06,-1e-06,0,-6e-06,5e-06,0,-1e-05,-1e-06,1e-06,7e-06,0,-2e-06,-7e-06,1e-06,5e-06,-2e-06,0,5e-06,4e-06,2e-06,3e-06,1e-06,0,1e-06,0,-1e-06,-2e-06,1.1e-05,1e-06,-3e-06,-2e-06,4e-06,2e-06,1e-06,1e-06,3e-06,0,5e-06,6e-06,1e-06,-2e-06,2e-06,0,-2e-06,8e-06,0,0,-1e-06,-1e-05,5e-06,4e-06,2e-06,-1e-05,1e-06,0,3e-06,-1e-06,-1e-06,0,-1e-06,1e-06,-2e-06,-3e-06,0,2e-06,-1e-06,0,3e-06,1.1e-05,-1e-06,0,2e-06,-2e-06,5e-06,-2e-06,-5e-06,8e-06,0,0,-6e-06,-4e-06,-1e-06,-1e-06,-1e-06,2e-06,0,-8e-06,3e-06,0,0,-3e-06,5e-06,-5e-06,3e-06,0,-3e-06,0,2e-06,-5e-06,-8e-06,-1e-06,-3e-06,-1e-06,1e-06,2e-06,-2e-06,-5e-06,1e-06,0,6e-06,7e-06,-1e-06
-5e-06,-1.5e-05,-1e-06,-4e-06,1e-06,5e-06,4e-06,0,-6e-06,3e-06,-1e-06,-1e-06,-2e-06,-4e-06,-1e-06,6e-06,0,-1e-06,1e-06,0,-1e-06,5e-06,2e-06,-2e-06,-2e-06,0,-9e-06,-2e-06,-1e-05,-2e-06,-1e-06,0,1e-06,-1e-06,-2e-06,2e-06,-8e-06,-1e-06,8e-06,1e-06,-3e-06,-1e-06,0,-6e-06,-6e-06,0,-8e-06,9e-06,0,2e-06,-3e-06,0,-1e-06,3e-06,4e-06,2e-06,3e-06,7e-06,2e-06,-7e-06,-2e-06,1.1e-05,0,0,-2e-06,2e-06,1e-06,-2e-06,0,-2e-06,6e-06,2e-06,0,-1e-06,6e-06,0,0,5e-06,-1e-06,0,2e-06,1e-06,-5e-06,-1e-06,2e-06,-1e-06,-2e-06,1e-06,7e-06,1e-06,0,0,0,3e-06,1e-06,0,-7e-06,3e-06,-1e-06,6e-06,2e-06,2e-06,-1e-06,-1e-06,-1e-06,0,3e-06,0,-8e-06,2e-06,-6e-06,1e-06,1e-06,-2e-06,0,3e-06,-4e-06,0,-1e-06,-4e-06,-1e-06
2e-06,3e-06,-1e-06,0,0,-4e-06,3e-06,-1e-06,5e-06,-6e-06,0,2e-06,-3e-06,2e-06,0,2e-06,0,0,-5e-06,0,5e-06,-7e-06,-3e-06,1e-06,0,0,4e-06,3e-06,5e-06,-3e-06,0,0,-1e-06,2e-06,1e-06,-2e-06,4e-06,-2e-06,-7e-06,-4e-06,-1e-06,-2e-06,0,-2e-06,6e-06,1e-06,1e-05,-1e-06,-1e-06,-3e-06,-1e-06,0,-1e-06,-9e-06,-4e-06,-1e-06,0,-5e-06,-1e-06,-1e-05,1e-06,-8e-06,0,1e-06,1e-06,-4e-06,0,-1e-06,0,-1e-06,-4e-06,-2e-06,0,-1e-06,-1e-06,0,-3e-06,-2e-06,0,2e-06,-1e-06,0,1e-06,2e-06,2e-06,-8e-06,2e-06,-2e-06,-7e-06,4e-06,0,-1e-06,-1e-06,4e-06,0,3e-06,4e-06,-4e-06,0,8e-06,-4e-06,1e-06,-1e-06,0,4e-06,-1e-06,-4e-06,4e-06,-6e-06,-1e-06,-1e-06,-1e-06,-6e-06,2e-06,2e-06,0,9e-06,-2e-06,0,-5e-06,0
3e-06,1e-06,-1e-06,4e-06,-2e-06,4e-06,0,-1e-06,-6e-06,8e-06,0,1e-06,4e-06,-1e-06,0,1e-06,0,1e-06,1e-06,0,2e-06,6e-06,1e-06,1e-06,1e-06,0,4e-06,-4e-06,8e-06,0,0,1e-06,1e-06,1e-06,1e-06,2e-06,-8e-06,0,6e-06,1e-06,7e-06,4e-06,0,-1e-06,-3e-06,0,-1e-05,-4e-06,2e-06,3e-06,3e-06,0,0,-1e-06,5e-06,0,-1e-06,5e-06,-5e-06,6e-06,1e-06,1.2e-05,0,0,-3e-06,2e-06,0,-1e-06,0,0,-4e-06,-3e-06,0,3e-06,-2e-06,0,-1e-06,-3e-06,0,-2e-06,-4e-06,1e-06,4e-06,0,-4e-06,1e-06,-1e-06,2e-06,4e-06,-3e-06,0,3e-06,1e-06,5e-06,3e-06,9e-06,1e-06,3e-06,2e-06,-3e-06,-4e-06,-3e-06,0,1e-06,-6e-06,1e-06,-1e-06,0,8e-06,-2e-06,5e-06,-1e-06,2e-06,1e-06,0,-4e-06,-9e-06,0,1e-06,0,0
