0.000146,0.000115,0.000152,0.000115,5.8e-05,6.4e-05,6.7e-05,2.2e-05,6.3e-05,6e-05,2.2e-05,5.7e-05,1.3e-05,9.9e-05,4e-05,8.5e-05,2.3e-05,0.000138,3e-06,9.4e-05,2.3e-05,1e-06,9.8e-05,3.1e-05,0.000186,1.4e-05,9e-05,2.7e-05,1.6e-05,2.6e-05,4.3e-05,3.2e-05,5.7e-05,5.4e-05,3.3e-05,7.6e-05,0.000105,0.000118,2.3e-05,3e-06,1.4e-05,2.5e-05,4.8e-05,8e-06,1.7e-05,7.9e-05,8e-06,9e-05,1.7e-05,5.2e-05,4.5e-05,1e-05,1.5e-05,3.5e-05,1.8e-05,5e-06,2.1e-05,7e-06,5e-06,2.5e-05,5.3e-05,7e-06,8.1e-05,0,1.4e-05,2.9e-05,3e-06,3.5e-05,0,6e-05,4e-05,4.1e-05,5.5e-05,3.3e-05,2.3e-05,7.8e-05,7.6e-05,8.3e-05,5.2e-05,6e-05,3.5e-05,4.3e-05,7e-06,3.5e-05,2.2e-05,9e-06,7.6e-05,8e-06,7.2e-05,1.4e-05,2.4e-05,9e-06,2.2e-05,4.3e-05,5.8e-05,6.2e-05,0.000143,4.1e-05,9.5e-05,4e-06,4e-06,5e-05,6e-05,6.6e-05,7.8e-05,8.1e-05,5e-06,9.9e-05,9e-06,2.5e-05,8.4e-05,8e-06,6.6e-05,0.000112,2.2e-05,0.000145,6e-06,0.000103,2.5e-05,5.8e-05,3.8e-05
0.000124,0.000343,0.000267,0.000415,0.00035,0.000276,8.3e-05,1.1e-05,0.000103,9.2e-05,0.000113,6.8e-05,7.1e-05,0.00017,0.000279,0.000246,0.000213,0.000149,0.000208,0.00017,0.00021,0.000166,0.000192,0.000201,0.000341,0.000351,0.000269,0.000146,7e-06,4.1e-05,5.4e-05,7.9e-05,0.000177,0.000218,0.000192,0.000196,0.000183,0.000369,0.000273,0.000129,3e-05,6.6e-05,0.000131,0.000131,5.9e-05,0.000107,0.000124,0.000178,0.000217,0.000158,0.000174,0.000147,0.000118,0.000111,0.000119,0.000134,0.000121,5e-05,1.6e-05,3.3e-05,6e-05,9.3e-05,0.000166,0.000155,1e-04,9.7e-05,0.000102,3.4e-05,8.9e-05,0.000132,7.3e-05,0.000105,0.000149,0.000185,0.000178,0.000168,0.000273,0.00016,0.000199,0.00015,0.000137,9.9e-05,8.5e-05,9e-06,8.2e-05,9.2e-05,0.000151,0.000159,0.000141,0.000177,0.000115,8.3e-05,5.5e-05,9.2e-05,0.000108,0.000189,0.000104,0.000281,0.00027,0.000204,0.000106,9.3e-05,0.000199,0.000166,0.000218,0.000132,9.9e-05,0.000143,0.000167,7.1e-05,7.7e-05,0.000118,0.000107,8.9e-05,0.000184,0.000203,0.000234,0.000169,0.00014,9.3e-05,4.7e-05
3.3e-05,0.000147,0.000102,0.000112,0.000142,9.8e-05,7.9e-05,4.1e-05,3.5e-05,5.3e-05,3.5e-05,1.5e-05,4.9e-05,0.000104,0.000157,5.7e-05,7.2e-05,5e-05,5.6e-05,3.4e-05,6.4e-05,6.4e-05,5.8e-05,0.000108,5.6e-05,0.000104,9e-05,6.7e-05,2.6e-05,1.7e-05,7.2e-05,7.1e-05,6e-05,0.000112,4.3e-05,0.000113,9.8e-05,0.000106,5e-05,2.5e-05,2.7e-05,7.8e-05,2.9e-05,6e-05,5.8e-05,6e-05,3.4e-05,4.9e-05,6.9e-05,5.1e-05,1.3e-05,4.8e-05,5.3e-05,4.6e-05,4.3e-05,8.9e-05,4.5e-05,4.9e-05,3.2e-05,5.2e-05,8.7e-05,4.8e-05,5.4e-05,2.7e-05,1.8e-05,3.2e-05,5.8e-05,5.1e-05,8e-05,4.2e-05,3.2e-05,0.000112,0.000121,8.6e-05,0.000133,9.2e-05,0.000109,5.8e-05,0.000107,5.2e-05,4.4e-05,6.4e-05,3.4e-05,3.1e-05,3.4e-05,3.9e-05,1.4e-05,4.2e-05,5.8e-05,6.8e-05,6e-05,2.8e-05,3.1e-05,5.5e-05,5.3e-05,3.3e-05,8.2e-05,0.000171,0.000117,9e-06,5.5e-05,3.5e-05,8.9e-05,8.6e-05,8e-05,3.1e-05,1.5e-05,8.8e-05,2.6e-05,5.1e-05,3e-05,5.4e-05,5.2e-05,6.2e-05,5.6e-05,5.1e-05,6.1e-05,2.4e-05,5.2e-05,2.3e-05,4e-06
2.6e-05,8.9e-05,6.7e-05,3.4e-05,0.000124,3.4e-05,4.5e-05,3.9e-05,6.3e-05,5.3e-05,3.7e-05,3.4e-05,5.2e-05,9.2e-05,3.9e-05,4.3e-05,7.6e-05,3.9e-05,9.1e-05,3.3e-05,2.4e-05,0.000101,9.6e-05,4.9e-05,5.1e-05,4.2e-05,9.9e-05,8.3e-05,7.5e-05,5.7e-05,5e-05,5e-05,3.5e-05,5e-05,5e-06,3.2e-05,6.6e-05,6.2e-05,4.1e-05,4.8e-05,3.7e-05,4e-05,6.3e-05,7.1e-05,3.3e-05,6.9e-05,6.4e-05,5.1e-05,3.1e-05,7.6e-05,4.6e-05,2e-05,6.6e-05,7.2e-05,6.8e-05,5.6e-05,6.5e-05,5.2e-05,1.8e-05,3.5e-05,1.2e-05,6.2e-05,5.5e-05,5.7e-05,3.4e-05,2e-05,4.1e-05,6.2e-05,4.2e-05,7.3e-05,7.6e-05,0.000143,2.2e-05,6.4e-05,9.8e-05,3e-05,3.2e-05,1.9e-05,4.9e-05,6.4e-05,6.9e-05,3.5e-05,3.8e-05,2.9e-05,1.7e-05,4.8e-05,4.5e-05,7e-06,3.9e-05,8.3e-05,9e-06,2.4e-05,3.7e-05,1.6e-05,5.5e-05,5.3e-05,8.4e-05,4.8e-05,9.1e-05,7.1e-05,7.9e-05,3.1e-05,3e-05,5.8e-05,0.000103,6.2e-05,5.7e-05,2.8e-05,3.5e-05,5.8e-05,6.8e-05,5e-05,5.1e-05,7.3e-05,0.000104,4e-05,1.6e-05,2.2e-05,6.5e-05,6.4e-05,5.2e-05
2e-05,7.5e-05,5.3e-05,0.000119,8.7e-05,8e-06,1.1e-05,3.4e-05,6.2e-05,1.2e-05,1.4e-05,2.9e-05,2.7e-05,3.8e-05,3.8e-05,1.2e-05,4.1e-05,4.7e-05,4.2e-05,1.5e-05,2.8e-05,3.4e-05,4.9e-05,5.8e-05,7.9e-05,9.8e-05,0.000106,3.3e-05,1.7e-05,3.4e-05,2e-05,1e-06,3.1e-05,5.8e-05,5.9e-05,2.8e-05,2.1e-05,1.5e-05,1.2e-05,5.8e-05,6e-06,2.8e-05,2e-05,1.2e-05,1.1e-05,2.2e-05,2.6e-05,6.2e-05,6.6e-05,2.7e-05,2.9e-05,2.6e-05,3.3e-05,2e-05,4.3e-05,2.4e-05,1.2e-05,5.6e-05,3e-05,3e-05,1.8e-05,6.3e-05,1.4e-05,1.9e-05,2.2e-05,4.9e-05,2.9e-05,3.1e-05,4.6e-05,3.1e-05,3e-06,7.5e-05,2e-06,1.3e-05,6.1e-05,4.5e-05,9e-06,1.4e-05,3.5e-05,2.9e-05,4.5e-05,7e-05,3.3e-05,3.7e-05,1.6e-05,2.4e-05,2.1e-05,1.2e-05,2.2e-05,2.9e-05,3.4e-05,5e-06,3e-05,5.2e-05,5.3e-05,1.9e-05,4.2e-05,5.2e-05,5.3e-05,1.7e-05,1.6e-05,1e-05,3.7e-05,3.7e-05,7.8e-05,5.4e-05,1.8e-05,3.7e-05,3e-05,1.1e-05,4.9e-05,3.9e-05,1.3e-05,2.8e-05,6.3e-05,2e-05,2.3e-05,2.7e-05,4.8e-05,2.6e-05,8e-06
4.8e-05,6.1e-05,4.2e-05,0.000118,9.4e-05,4.8e-05,1.5e-05,2.7e-05,7.2e-05,8.5e-05,3.4e-05,2.9e-05,5.9e-05,8.5e-05,2.1e-05,3.1e-05,3.8e-05,6.9e-05,2.4e-05,2.3e-05,2.6e-05,9.3e-05,5.8e-05,2e-05,5e-05,4.3e-05,5.1e-05,6.4e-05,6.4e-05,6e-05,5.2e-05,4.1e-05,4.6e-05,7.5e-05,0.000127,0.000121,5.2e-05,2.3e-05,4.9e-05,3.1e-05,4.1e-05,2.6e-05,3.4e-05,5e-05,1.8e-05,2.5e-05,3.2e-05,5.9e-05,5.8e-05,1.4e-05,6.7e-05,1.7e-05,3.5e-05,1.7e-05,3.6e-05,5.8e-05,5.6e-05,7.5e-05,5.6e-05,6.6e-05,5.2e-05,5.8e-05,2.1e-05,3.3e-05,2.9e-05,2.8e-05,4.5e-05,7e-05,3.8e-05,2.5e-05,1.4e-05,7.3e-05,6.5e-05,7.1e-05,7.6e-05,5.5e-05,0.000109,7.7e-05,1.1e-05,3.4e-05,7.1e-05,6e-05,4e-05,3.4e-05,4.2e-05,2.6e-05,1.5e-05,3.7e-05,2.9e-05,3e-05,2.1e-05,3.5e-05,1.9e-05,2.9e-05,1.5e-05,1e-05,1.1e-05,2e-05,2e-05,1.2e-05,5.1e-05,3.2e-05,7.4e-05,9.9e-05,7.9e-05,3.8e-05,5.2e-05,6.5e-05,7.5e-05,3.6e-05,2.9e-05,4.3e-05,4e-05,2.6e-05,2.9e-05,4.4e-05,3.5e-05,5.4e-05,4.4e-05,2.3e-05,1.6e-05
6.5e-05,8.9e-05,5.9e-05,2.4e-05,0.000137,5.4e-05,4.7e-05,4.4e-05,5e-05,5.4e-05,4.8e-05,8e-06,3.4e-05,0.00011,0.000118,2.4e-05,4.7e-05,6.6e-05,8.7e-05,1.5e-05,3.6e-05,0.000131,7.1e-05,2.5e-05,8.2e-05,3.8e-05,6.3e-05,2.2e-05,2.9e-05,3.5e-05,1e-05,8.9e-05,5.8e-05,6.1e-05,0.000114,8.5e-05,7.2e-05,8.3e-05,9.9e-05,6.4e-05,5.9e-05,5.8e-05,3.2e-05,4.9e-05,5.3e-05,5.3e-05,3.2e-05,3.2e-05,7.2e-05,7.5e-05,6.9e-05,8.8e-05,8.3e-05,3.4e-05,1.2e-05,4.6e-05,5.8e-05,6.3e-05,4.4e-05,6e-05,9e-05,5.7e-05,9e-05,6.7e-05,6e-05,3e-06,8.8e-05,0.000164,9.7e-05,1.4e-05,4.7e-05,6.4e-05,0.000121,0.000106,1.5e-05,8e-05,6.3e-05,8.2e-05,1e-04,4.5e-05,6.2e-05,2.5e-05,1.9e-05,2.2e-05,7.2e-05,9.4e-05,7.7e-05,9.3e-05,1e-04,6.2e-05,5.1e-05,8.1e-05,6.7e-05,4e-05,4.7e-05,7.1e-05,5.1e-05,3.3e-05,5.2e-05,3e-05,0.000103,6.3e-05,4.9e-05,9.5e-05,0.00015,9.8e-05,2.4e-05,7.7e-05,6.6e-05,9.8e-05,9.2e-05,5e-05,8e-05,8.2e-05,0.000104,7.8e-05,0.000121,0.000109,5.1e-05,8e-05,5e-05
3e-05,8.4e-05,2.2e-05,3.2e-05,9.7e-05,4.1e-05,2.9e-05,2.3e-05,1.2e-05,5.7e-05,3.4e-05,1.2e-05,1e-05,6.8e-05,3.6e-05,3.1e-05,3.4e-05,9.8e-05,0.00011,8e-05,3.3e-05,8.6e-05,0.000102,0.000102,0.000128,7.8e-05,9.5e-05,7e-05,2e-05,4.3e-05,3.8e-05,9.8e-05,8.5e-05,3.2e-05,5.8e-05,3.6e-05,6.9e-05,4.5e-05,9.4e-05,1.1e-05,4.1e-05,5.8e-05,3e-05,1.4e-05,2.8e-05,1.7e-05,1.6e-05,6.4e-05,6.6e-05,5.4e-05,7.9e-05,5.5e-05,6e-05,4.1e-05,4.4e-05,5.8e-05,8.1e-05,5.4e-05,8.3e-05,4e-05,2.3e-05,2.6e-05,7.7e-05,4.2e-05,5.4e-05,8.4e-05,0.000139,0.00017,6.6e-05,2.2e-05,4e-05,5.8e-05,8.3e-05,3.8e-05,4.2e-05,2.8e-05,6.3e-05,3.8e-05,3.5e-05,9e-06,2.6e-05,3.4e-05,6.1e-05,3.3e-05,3.8e-05,0.000113,6.3e-05,1.6e-05,6e-05,2.2e-05,7.3e-05,5.9e-05,3.1e-05,2.8e-05,5.4e-05,4.9e-05,6.6e-05,2.5e-05,3.9e-05,7.5e-05,8.3e-05,1.9e-05,3.5e-05,3.6e-05,7.4e-05,2e-05,5.5e-05,3.2e-05,3.6e-05,5.2e-05,9e-05,8.1e-05,4e-05,6.2e-05,4.9e-05,1.2e-05,6.1e-05,2.1e-05,2.2e-05,7e-05,3.1e-05
1.7e-05,3.2e-05,1.9e-05,4.1e-05,2.3e-05,2.8e-05,1.6e-05,2.5e-05,1.3e-05,1.6e-05,2.6e-05,3e-05,1.3e-05,1.8e-05,2.4e-05,3e-06,5e-06,4e-05,3.2e-05,3.3e-05,2e-05,1.9e-05,4.7e-05,3.5e-05,7.6e-05,3.4e-05,4.7e-05,2.3e-05,3.5e-05,3.8e-05,3e-05,2.3e-05,3.3e-05,4e-06,1.7e-05,3e-05,4e-05,6.6e-05,2.3e-05,4.2e-05,4.5e-05,4.2e-05,5.8e-05,3.7e-05,2.8e-05,1.7e-05,2.9e-05,6.6e-05,1.3e-05,1.7e-05,1.1e-05,3.3e-05,4.6e-05,1.6e-05,7.6e-05,3.3e-05,3e-05,6.4e-05,4.6e-05,4.3e-05,1.7e-05,2.9e-05,4.8e-05,3.8e-05,9.2e-05,1.9e-05,8.2e-05,3.8e-05,4.9e-05,3.3e-05,1.5e-05,1.7e-05,6.5e-05,2e-05,2.6e-05,1.3e-05,3.1e-05,2.4e-05,2.3e-05,2.4e-05,4e-05,4.6e-05,3e-05,2.3e-05,1.2e-05,5.7e-05,6e-06,6e-06,3.7e-05,3.7e-05,5.8e-05,2.6e-05,3.1e-05,5e-06,5.9e-05,1.6e-05,3.6e-05,4.9e-05,2.4e-05,6.9e-05,1.3e-05,3.6e-05,2e-05,3.5e-05,2.3e-05,1.2e-05,3.8e-05,8e-06,1.3e-05,3.2e-05,3.2e-05,1.8e-05,2.3e-05,5.2e-05,3.8e-05,1.9e-05,4.2e-05,2.1e-05,8e-06,3.6e-05,2.7e-05
2e-05,1.4e-05,1.6e-05,3.2e-05,6.3e-05,2.8e-05,1.5e-05,3.4e-05,3.3e-05,1.5e-05,3.6e-05,5e-06,5.1e-05,5.4e-05,4.9e-05,3.1e-05,4.4e-05,9e-06,2.9e-05,2.1e-05,7e-06,1.6e-05,3.1e-05,5.5e-05,4.6e-05,7e-06,4.1e-05,3.3e-05,2.5e-05,2.4e-05,6e-06,2.2e-05,3e-06,1.9e-05,3.5e-05,2.4e-05,1e-05,8.2e-05,6.2e-05,1.8e-05,2.6e-05,2.5e-05,3e-05,1.1e-05,2.2e-05,1.7e-05,5.5e-05,4.7e-05,3.2e-05,8e-06,1.4e-05,1.5e-05,2.5e-05,3.7e-05,4.5e-05,3.1e-05,8e-06,5.1e-05,7e-05,3e-06,2.6e-05,1.7e-05,4e-05,1.5e-05,4.7e-05,4.7e-05,4.4e-05,2.9e-05,3.4e-05,1.8e-05,1.4e-05,1.5e-05,2.9e-05,3.6e-05,2.5e-05,1.2e-05,4e-05,3.8e-05,3.7e-05,2.8e-05,4.9e-05,9e-06,3.8e-05,3.1e-05,4e-06,2.8e-05,2.5e-05,2.5e-05,2.1e-05,2.9e-05,8e-06,3.1e-05,3.4e-05,3.2e-05,4.1e-05,3.1e-05,6e-06,3.3e-05,3.1e-05,9e-06,2.4e-05,1e-05,2.1e-05,8e-06,2e-05,1.4e-05,5e-05,8e-06,1.8e-05,1.6e-05,1.1e-05,2.2e-05,1.1e-05,5.9e-05,2.4e-05,3e-05,3.9e-05,5e-06,2.7e-05,4.5e-05,1.8e-05
4.7e-05,5e-05,6e-06,3.1e-05,6e-05,4.7e-05,3.9e-05,1.5e-05,1.7e-05,3.1e-05,4.1e-05,4.3e-05,8e-05,2.9e-05,4.4e-05,6.9e-05,7.6e-05,8e-05,4.5e-05,3.3e-05,3.7e-05,2e-05,2.3e-05,4.2e-05,2.5e-05,5.5e-05,5.8e-05,4.8e-05,4.5e-05,1.8e-05,2e-05,1.7e-05,1.8e-05,2.1e-05,2.5e-05,6.8e-05,1.3e-05,6.6e-05,2.1e-05,5.7e-05,1.4e-05,3.5e-05,2.1e-05,2e-05,1e-05,2.5e-05,5.4e-05,4.1e-05,4.3e-05,5.2e-05,4e-05,1.7e-05,1.3e-05,5.6e-05,8.6e-05,5.8e-05,5.6e-05,3.7e-05,6e-06,4e-05,3e-05,4.3e-05,5e-05,3e-05,4.4e-05,4.2e-05,3.5e-05,3.6e-05,5.3e-05,3e-05,1.6e-05,1.9e-05,3.9e-05,1e-05,1.9e-05,3.3e-05,5.4e-05,3.2e-05,4.1e-05,1.1e-05,4.8e-05,1.8e-05,5.4e-05,8e-06,4e-05,8.8e-05,8.8e-05,5.8e-05,4.1e-05,2.7e-05,7e-06,4e-05,2.7e-05,2.8e-05,3.8e-05,3.4e-05,2.3e-05,3e-05,1.6e-05,6.9e-05,6e-06,2.7e-05,3.4e-05,4.1e-05,1.6e-05,3.7e-05,2.4e-05,1.2e-05,2.6e-05,2.8e-05,3e-05,2.8e-05,2e-05,7.8e-05,7.9e-05,5.2e-05,7e-05,5.5e-05,4e-05,1.9e-05,3.4e-05
4.5e-05,4.3e-05,4e-05,5.7e-05,2.8e-05,2.2e-05,2.2e-05,3.7e-05,3.2e-05,1.8e-05,2.8e-05,1.8e-05,3.4e-05,4.4e-05,6.5e-05,0.000113,5.3e-05,7.6e-05,5.5e-05,1.4e-05,4.3e-05,4.5e-05,2.6e-05,3.9e-05,2.6e-05,1.6e-05,5e-05,3.3e-05,2.3e-05,2.6e-05,4.4e-05,3e-05,2.2e-05,2.9e-05,2.5e-05,5.1e-05,3.6e-05,4.5e-05,4.9e-05,8.5e-05,6.6e-05,7.1e-05,5.8e-05,2.1e-05,2.1e-05,3e-05,2.8e-05,3e-05,3.7e-05,1.5e-05,4.6e-05,2.8e-05,4.3e-05,7e-05,2.8e-05,2e-05,3.4e-05,4.8e-05,8e-06,2.4e-05,3.5e-05,1.9e-05,1e-05,1.1e-05,5.3e-05,0.000104,5.1e-05,5.3e-05,4.4e-05,2.7e-05,4.2e-05,4.2e-05,3.7e-05,3.3e-05,1e-05,4.9e-05,1.3e-05,3.4e-05,1.8e-05,3.1e-05,1.6e-05,2.1e-05,2.8e-05,2e-05,5.6e-05,6.4e-05,3e-05,4.2e-05,4e-05,2.7e-05,1.4e-05,4.3e-05,8e-06,4.7e-05,2.1e-05,3.6e-05,2.7e-05,3.3e-05,3.5e-05,9.9e-05,6.6e-05,4.5e-05,1.8e-05,3e-05,3.6e-05,3.3e-05,3.8e-05,1.7e-05,1.6e-05,3.5e-05,1.7e-05,4.9e-05,6.9e-05,1.9e-05,3.2e-05,2.4e-05,2.8e-05,4e-05,5.3e-05,1.4e-05,5.1e-05
6.2e-05,2.3e-05,1.4e-05,3.9e-05,2e-05,8.1e-05,1.9e-05,3.8e-05,1.5e-05,5.4e-05,4e-05,5.2e-05,2.6e-05,1.1e-05,3.7e-05,4.6e-05,8.2e-05,2.4e-05,1.9e-05,1.7e-05,4.3e-05,9.6e-05,5.7e-05,1.9e-05,6e-05,3e-06,5e-05,2.4e-05,3.4e-05,2.5e-05,3.7e-05,2.6e-05,1.9e-05,2.8e-05,4e-05,5.9e-05,1.9e-05,2.3e-05,1.5e-05,3.4e-05,2.9e-05,8e-06,4.4e-05,1.9e-05,2.9e-05,5.4e-05,7e-06,1.6e-05,3.7e-05,1.1e-05,2e-05,3e-05,9e-06,3.5e-05,1.7e-05,1.2e-05,4.1e-05,4.9e-05,5.2e-05,3.2e-05,5e-05,3.3e-05,1.8e-05,1.4e-05,2.9e-05,6.1e-05,4.1e-05,4.2e-05,1.9e-05,1.9e-05,7.6e-05,1e-06,4.1e-05,3.8e-05,4.1e-05,4.9e-05,4.7e-05,4.2e-05,2.1e-05,2.2e-05,4.2e-05,5.5e-05,4.7e-05,1.4e-05,2.1e-05,4.3e-05,5.9e-05,0.000101,4.2e-05,1.3e-05,3.1e-05,3.9e-05,4.7e-05,5.4e-05,3.9e-05,3.4e-05,6e-06,7.2e-05,6.9e-05,3.9e-05,2.2e-05,8e-05,2.6e-05,3.2e-05,2.8e-05,1.4e-05,6.7e-05,1.3e-05,3e-05,4.6e-05,2.4e-05,4.6e-05,5.2e-05,7e-06,3.6e-05,1e-06,3e-05,5e-05,5.1e-05,5.7e-05,6.8e-05
2.1e-05,0.000111,9.2e-05,8.4e-05,2.3e-05,5.8e-05,8e-05,1.8e-05,2.9e-05,4.2e-05,3.4e-05,6.7e-05,3.9e-05,5e-05,5.2e-05,8.8e-05,3e-05,1.7e-05,2.9e-05,3.7e-05,4.3e-05,6.8e-05,3.9e-05,8.8e-05,6.4e-05,9e-05,8e-06,0.000101,2.6e-05,5.9e-05,1.7e-05,4.3e-05,2.3e-05,5.4e-05,6.4e-05,9.8e-05,0.000119,9.6e-05,9.9e-05,3e-05,7e-05,7.2e-05,5.9e-05,2.7e-05,6e-05,5.7e-05,5.1e-05,3e-05,1.9e-05,8e-05,1.1e-05,4.5e-05,5.1e-05,4.3e-05,4.3e-05,7e-06,5e-05,7.5e-05,6e-06,7.2e-05,1.4e-05,4.4e-05,5.9e-05,7e-06,1.6e-05,1.9e-05,4.2e-05,7.1e-05,4.2e-05,4.7e-05,3.6e-05,0.000135,7.7e-05,7.3e-05,2.1e-05,5e-05,2.3e-05,3.7e-05,2.9e-05,9e-06,5e-05,7.4e-05,9.4e-05,6.3e-05,3.3e-05,3.3e-05,3.8e-05,6.3e-05,2.4e-05,2.6e-05,1.1e-05,3.5e-05,5.8e-05,7e-05,4.5e-05,1.9e-05,4.3e-05,7e-05,2.9e-05,6.9e-05,7.7e-05,8.7e-05,8e-05,6e-05,5e-06,2.9e-05,8.9e-05,3.6e-05,2.3e-05,9.2e-05,0.000111,4.1e-05,4.1e-05,4.5e-05,5.8e-05,1.4e-05,1.4e-05,6.7e-05,2e-05,0.000119,1.7e-05
5.6e-05,0.00015,0.000103,8.1e-05,0.000118,9.7e-05,6.1e-05,7.2e-05,6.9e-05,6e-05,3.9e-05,3.6e-05,5.1e-05,9.2e-05,0.000112,7.3e-05,0.000144,7.8e-05,3.6e-05,7.1e-05,2.6e-05,9.8e-05,0.000112,0.000199,0.000216,0.00016,9.2e-05,0.00013,0.00014,8.8e-05,0.00012,1e-04,6.9e-05,5.8e-05,6.2e-05,6.5e-05,0.000172,0.000117,4e-05,4.5e-05,6.8e-05,4.2e-05,3.3e-05,5.6e-05,5.7e-05,2.3e-05,6.2e-05,3.6e-05,7.2e-05,0.000148,0.000172,7.8e-05,5.8e-05,1e-04,0.000114,9.9e-05,1.3e-05,9.8e-05,0.000128,9.6e-05,6.1e-05,8.2e-05,7.9e-05,9.9e-05,0.000101,6.8e-05,7e-05,0.000104,0.000113,6.5e-05,3.4e-05,0.000151,0.000111,6.1e-05,8.9e-05,7.7e-05,9.7e-05,0.000101,0.000112,4.3e-05,4.6e-05,0.000132,9.6e-05,7.7e-05,5.2e-05,7e-05,0.000113,5.7e-05,6.7e-05,3.1e-05,4.2e-05,3.8e-05,7.5e-05,9.1e-05,5.1e-05,3.9e-05,2.1e-05,1e-04,3.4e-05,6.4e-05,0.000143,0.000128,0.000115,7.8e-05,2.7e-05,4.5e-05,9.6e-05,0.000111,6.3e-05,9.7e-05,8.1e-05,0.000113,8.6e-05,7.5e-05,0.000117,9.7e-05,4.6e-05,0.000147,0.00015,0.000204,0.000169
1.3e-05,0.000128,9.9e-05,0.000137,8.2e-05,9e-06,5e-06,8.7e-05,0.000119,7.9e-05,3.1e-05,3.9e-05,8.1e-05,0.000105,3e-06,0.000101,8.7e-05,0.000114,1e-04,6.5e-05,6.1e-05,0.000134,0.000131,0.000152,0.000159,4.6e-05,4.8e-05,0.000126,0.000104,6.6e-05,0.000147,4.5e-05,0.000111,0.000153,0.000136,9.9e-05,4.5e-05,4.3e-05,5.2e-05,2.3e-05,8.1e-05,0.000118,7e-05,0.000109,9.2e-05,7.4e-05,0.000123,6.4e-05,0.000135,0.000186,1.5e-05,7.7e-05,5.7e-05,9.4e-05,2.1e-05,4.2e-05,2.3e-05,8.1e-05,7.1e-05,0.000107,8.7e-05,0.000139,3.8e-05,6.5e-05,6.8e-05,3.7e-05,9e-05,4.3e-05,6.4e-05,4.3e-05,4.7e-05,0.000118,0.000129,8.4e-05,8.8e-05,4.4e-05,5.2e-05,5.1e-05,7.4e-05,8.7e-05,5.9e-05,0.000131,7e-05,3.4e-05,3.6e-05,3.3e-05,0.000134,6.3e-05,6.7e-05,0.000133,8e-05,1e-04,0.000113,0.000105,0.000101,0.000103,7.7e-05,3.7e-05,3.8e-05,5.9e-05,9e-05,0.000135,5.2e-05,6.3e-05,8.3e-05,0.000101,7.7e-05,5e-05,5.1e-05,7.4e-05,6.1e-05,9.2e-05,9.9e-05,3.7e-05,5.7e-05,5.8e-05,5e-05,0.000137,0.000159,6.2e-05,7e-05
6e-06,6.9e-05,4.7e-05,4.1e-05,5.6e-05,4.9e-05,5.4e-05,8.2e-05,5.4e-05,2.7e-05,3.2e-05,4.7e-05,5.7e-05,4.5e-05,3.6e-05,8.8e-05,0.000177,6.6e-05,2.6e-05,9.2e-05,6.6e-05,5e-05,2.7e-05,8.4e-05,8.2e-05,3.5e-05,6.2e-05,8.2e-05,5.1e-05,3.7e-05,9e-05,0.000137,8.6e-05,2.8e-05,6.7e-05,5.1e-05,1.5e-05,5.5e-05,3.6e-05,2.6e-05,8.4e-05,7.4e-05,6.1e-05,5.8e-05,4.3e-05,5.3e-05,6.5e-05,3.9e-05,0.00013,2.5e-05,9.5e-05,5.2e-05,1.3e-05,3e-05,9.4e-05,4.8e-05,2.4e-05,2.4e-05,5.7e-05,0.000125,0.000105,6.9e-05,7.4e-05,9.8e-05,4.2e-05,4.5e-05,4.9e-05,3.9e-05,4.5e-05,5.3e-05,8.3e-05,2.5e-05,5.9e-05,9.1e-05,5.9e-05,9e-06,1.6e-05,6e-05,1.4e-05,8.2e-05,1.7e-05,4.9e-05,1.6e-05,4.8e-05,3.2e-05,3.1e-05,6.9e-05,9.8e-05,6.6e-05,5.8e-05,3.2e-05,7e-05,5.3e-05,5.1e-05,2.6e-05,7.3e-05,3.4e-05,4.5e-05,5.2e-05,3.5e-05,6.9e-05,2e-06,1.8e-05,6.3e-05,7.7e-05,4.4e-05,7.7e-05,7.7e-05,4e-05,1.7e-05,2.9e-05,8.5e-05,1.7e-05,3.7e-05,3.3e-05,2.8e-05,3.5e-05,0.000128,5.3e-05,5.7e-05,5.1e-05
5.1e-05,4.2e-05,5.6e-05,8.6e-05,5.3e-05,4.2e-05,9.9e-05,0.000135,5.5e-05,1.5e-05,1.8e-05,7e-05,2.8e-05,2.3e-05,3.9e-05,7.8e-05,7.8e-05,8.7e-05,6e-05,5.3e-05,3.6e-05,2.4e-05,5.4e-05,5e-05,0.000102,7.6e-05,6.5e-05,7.2e-05,7e-05,5.1e-05,5.4e-05,5.5e-05,9.4e-05,8.1e-05,5.7e-05,9.5e-05,8e-06,3.7e-05,4.3e-05,5e-05,7.2e-05,2.1e-05,3.7e-05,8.3e-05,9.5e-05,3.4e-05,3.1e-05,4.8e-05,0.000106,8.4e-05,7.8e-05,5.2e-05,1.6e-05,3.2e-05,0.00011,8.4e-05,8.9e-05,8.9e-05,0.000106,4.8e-05,1.2e-05,8.5e-05,7.1e-05,3.7e-05,6e-05,7.1e-05,8.6e-05,4.4e-05,3.9e-05,7e-05,8e-05,6.6e-05,1.9e-05,5.1e-05,1.1e-05,3.4e-05,3.8e-05,2.4e-05,4e-05,0.000108,9e-05,6.4e-05,2.6e-05,6.8e-05,1.9e-05,6.3e-05,4.9e-05,0.000105,5.7e-05,3.3e-05,2.1e-05,3.9e-05,6.8e-05,2.7e-05,1.4e-05,3.6e-05,4.8e-05,2.9e-05,3.9e-05,6e-05,5.1e-05,6.8e-05,5.3e-05,6e-05,8.9e-05,0.000104,6.7e-05,6.8e-05,1.1e-05,2.1e-05,3.2e-05,3.2e-05,8.3e-05,7.8e-05,2.9e-05,3e-05,2.9e-05,8.5e-05,4.6e-05,4e-05,4.1e-05
9.6e-05,4.7e-05,5.2e-05,2.6e-05,5.6e-05,5.5e-05,7.6e-05,2.6e-05,1.8e-05,1.7e-05,3.1e-05,6.4e-05,3.7e-05,2.8e-05,1.8e-05,2.6e-05,7e-06,7.2e-05,3.8e-05,4.1e-05,2.5e-05,3.4e-05,5.1e-05,2.6e-05,4.6e-05,3.3e-05,8.2e-05,8.9e-05,5.6e-05,4.5e-05,6e-05,2.6e-05,8.1e-05,9.2e-05,0.000101,7e-06,7.7e-05,4.2e-05,6.4e-05,2e-05,2.6e-05,3.9e-05,2.2e-05,5.7e-05,4.6e-05,1.6e-05,3e-05,4.5e-05,4.6e-05,7.5e-05,4e-05,2.4e-05,3.4e-05,5.3e-05,5.9e-05,1.4e-05,4.4e-05,6.4e-05,6.7e-05,1e-04,7e-05,7.5e-05,3.6e-05,5e-05,2.3e-05,2e-05,6.4e-05,3e-05,4e-05,3.7e-05,3.9e-05,1.7e-05,4e-06,3.1e-05,3e-05,4.6e-05,1.6e-05,7.1e-05,4.1e-05,4.5e-05,5.9e-05,3.6e-05,4.9e-05,2.2e-05,7.1e-05,6.3e-05,3.7e-05,2.7e-05,2.7e-05,4.5e-05,2.9e-05,2.7e-05,6.5e-05,2.6e-05,1.5e-05,3.2e-05,1.3e-05,4.5e-05,5e-05,9.5e-05,8e-05,1.7e-05,1.6e-05,5.2e-05,7.5e-05,8e-05,1e-05,7.2e-05,6.4e-05,3.6e-05,8e-06,4.2e-05,9.8e-05,5.4e-05,5.7e-05,4.1e-05,8.3e-05,3.2e-05,3.7e-05,1.5e-05,3.5e-05
1.9e-05,2.3e-05,2e-05,1e-05,2.7e-05,2.7e-05,2.6e-05,4e-05,2.7e-05,4.5e-05,1.7e-05,3.7e-05,7e-06,2.7e-05,2.5e-05,6.1e-05,3.1e-05,3.8e-05,3.2e-05,6e-06,1.7e-05,3e-05,7.8e-05,6e-05,3.2e-05,5.6e-05,7.4e-05,2.6e-05,2.2e-05,4.7e-05,6.4e-05,6.2e-05,3.1e-05,1.4e-05,3.9e-05,4.2e-05,4.7e-05,2.6e-05,4.8e-05,5.6e-05,4.5e-05,1.1e-05,3.1e-05,1e-06,3.9e-05,3.9e-05,6.9e-05,7e-06,5.3e-05,2.7e-05,7.1e-05,4.8e-05,6.2e-05,1.2e-05,6.4e-05,7.1e-05,2.4e-05,5.2e-05,8e-06,4.8e-05,5e-05,1.5e-05,2.2e-05,4.8e-05,2.4e-05,2.3e-05,7.1e-05,4.6e-05,2.4e-05,4.5e-05,4.3e-05,1.2e-05,2e-05,2.8e-05,8e-06,1.8e-05,4.2e-05,5.9e-05,2.2e-05,1.9e-05,1.8e-05,5.7e-05,1e-05,2.3e-05,4.9e-05,3.2e-05,2.4e-05,2.3e-05,4.4e-05,7.1e-05,2.1e-05,1.8e-05,1.6e-05,1.4e-05,2.4e-05,2e-05,6.3e-05,1.5e-05,1.3e-05,5.9e-05,3e-05,2e-05,1.9e-05,5.8e-05,3.1e-05,6.2e-05,5.1e-05,3.7e-05,1.9e-05,1.7e-05,8e-06,4.1e-05,6.7e-05,4.1e-05,5.4e-05,9.8e-05,7.6e-05,4.4e-05,2.3e-05,1.7e-05,1.9e-05
5.1e-05,2.7e-05,4.6e-05,3.6e-05,1.9e-05,4.7e-05,5e-05,4.2e-05,4.3e-05,1.8e-05,2.2e-05,3.5e-05,1.9e-05,3.5e-05,2e-05,5.4e-05,4.4e-05,3.9e-05,5.7e-05,3.9e-05,1.7e-05,4.8e-05,3.4e-05,1.2e-05,5.5e-05,5.9e-05,4.3e-05,5.7e-05,3.6e-05,5.3e-05,2.8e-05,2.5e-05,4.6e-05,4.2e-05,1.2e-05,1.6e-05,4.4e-05,2.7e-05,2.6e-05,1.9e-05,1.9e-05,2.1e-05,3e-05,3e-05,2.3e-05,3.8e-05,5.7e-05,7.2e-05,1.3e-05,1.9e-05,7.1e-05,6.6e-05,2.1e-05,4.5e-05,5.9e-05,2.6e-05,6e-06,1.8e-05,3.1e-05,4.7e-05,4.2e-05,2.6e-05,2.3e-05,1e-05,5.1e-05,5e-05,6.6e-05,4.1e-05,2.4e-05,4.2e-05,1e-05,2.9e-05,8e-06,4.8e-05,4.8e-05,3.2e-05,4.1e-05,5.9e-05,2.3e-05,1e-05,1e-05,3e-05,4.3e-05,1.9e-05,1e-05,5.1e-05,3.3e-05,4.8e-05,4.4e-05,5.9e-05,5.8e-05,4.1e-05,1.6e-05,2.9e-05,2.4e-05,3.5e-05,0.000103,7.7e-05,5.8e-05,2.8e-05,4.7e-05,2.7e-05,1.6e-05,6e-06,4.6e-05,5.2e-05,5e-05,3.6e-05,1.1e-05,7e-06,7e-06,1.8e-05,7.3e-05,4.4e-05,4.7e-05,7.2e-05,2.6e-05,1.9e-05,5.3e-05,4.6e-05,3.7e-05
3.8e-05,3e-05,1.6e-05,1.3e-05,2.9e-05,6.8e-05,1.6e-05,2.3e-05,3.2e-05,2.8e-05,3.8e-05,5.4e-05,3.9e-05,5.2e-05,3.4e-05,1.4e-05,3.7e-05,1.8e-05,4.5e-05,4.9e-05,3.4e-05,3.8e-05,3.6e-05,1.9e-05,4.1e-05,1.6e-05,5.3e-05,4e-06,1.2e-05,3.2e-05,3.8e-05,2.7e-05,4.1e-05,4e-05,3e-06,1.9e-05,8.7e-05,5.5e-05,3.5e-05,7e-06,1.8e-05,4e-05,1.1e-05,3.8e-05,2.3e-05,4e-05,8.1e-05,4e-05,4.1e-05,6e-06,5.5e-05,1.1e-05,2e-05,6e-05,1.2e-05,5.7e-05,7e-05,6.1e-05,4.3e-05,2.1e-05,4.6e-05,2.5e-05,2.8e-05,5.6e-05,2.5e-05,1.1e-05,2e-05,1.9e-05,8e-06,4.4e-05,4.6e-05,1.7e-05,1.2e-05,4.9e-05,2.5e-05,4.6e-05,1.1e-05,2.3e-05,1.4e-05,1.1e-05,3e-05,4.5e-05,4.2e-05,6.4e-05,6.6e-05,4.8e-05,2.3e-05,5.6e-05,3.8e-05,4.4e-05,1e-05,2.3e-05,3e-05,2.7e-05,4.1e-05,2.6e-05,5.4e-05,3.8e-05,4e-05,3.1e-05,2.1e-05,1.4e-05,9e-06,4e-05,2e-05,1e-05,4.6e-05,5.7e-05,4.5e-05,2.2e-05,2e-06,1.4e-05,3.4e-05,4.1e-05,7.3e-05,6.4e-05,2.1e-05,4.8e-05,4.8e-05,2.5e-05,2e-05
2.2e-05,5e-06,1.5e-05,4e-06,1.5e-05,1.2e-05,2.4e-05,3.4e-05,1.5e-05,1e-05,1.1e-05,1.1e-05,3e-06,1.9e-05,1.2e-05,3e-06,1.7e-05,1.4e-05,1.6e-05,1.3e-05,1.4e-05,1.2e-05,3e-06,1.2e-05,7e-06,2e-06,1.6e-05,2.9e-05,1.2e-05,7e-06,1.6e-05,1.1e-05,2e-05,1.5e-05,7e-06,9e-06,2.4e-05,4e-06,1.4e-05,1.7e-05,3e-06,1.6e-05,1.3e-05,1.1e-05,8e-06,2.2e-05,1.7e-05,1.6e-05,2.1e-05,1.7e-05,1.2e-05,8e-06,1.7e-05,2e-05,2.1e-05,3.3e-05,3.5e-05,7e-06,1.1e-05,1.4e-05,1.6e-05,1.3e-05,2.7e-05,3e-05,2.6e-05,1.5e-05,1.3e-05,2.1e-05,2.1e-05,1e-05,6e-06,7e-06,1.1e-05,7e-06,1.1e-05,1.1e-05,9e-06,2.8e-05,2e-05,2.1e-05,1.6e-05,3.4e-05,2.6e-05,2e-05,2.1e-05,1.5e-05,1.7e-05,1e-05,6e-06,2.1e-05,1.8e-05,1.4e-05,1e-05,2e-05,2.2e-05,2.6e-05,3e-06,1e-05,1.7e-05,2e-05,9e-06,7e-06,6e-06,2.1e-05,1.5e-05,1.3e-05,1.6e-05,2.2e-05,1e-05,5e-06,9e-06,6e-06,8e-06,2e-05,1e-06,2.2e-05,1.3e-05,2.6e-05,1.4e-05,1.4e-05,5e-06
1.4e-05,1.6e-05,1.6e-05,1e-05,6e-06,1.4e-05,5e-06,9e-06,1.3e-05,4e-06,5e-06,1e-05,1.3e-05,7e-06,1e-05,1.6e-05,1.1e-05,2.1e-05,1e-05,1.9e-05,1.8e-05,1.9e-05,6e-06,1e-05,2e-05,1.7e-05,1e-05,1.8e-05,1.8e-05,8e-06,7e-06,1.5e-05,2.9e-05,2.7e-05,1.4e-05,1e-05,9e-06,4e-06,1.5e-05,5e-06,8e-06,4e-06,7e-06,1.1e-05,7e-06,1.8e-05,1.5e-05,1e-05,3e-06,9e-06,2.8e-05,1.4e-05,2.3e-05,2.2e-05,1.7e-05,9e-06,2e-05,1e-05,8e-06,4e-06,1e-06,1e-05,1.7e-05,1.3e-05,9e-06,4e-06,1e-05,2.1e-05,1.6e-05,8e-06,8e-06,1.3e-05,8e-06,8e-06,1.4e-05,1.1e-05,5e-06,2.6e-05,3e-06,1.8e-05,4e-06,2.2e-05,4e-06,1.7e-05,2.8e-05,2.6e-05,1.4e-05,1.3e-05,9e-06,1.5e-05,2e-06,1.3e-05,1.5e-05,1.7e-05,5e-06,1.1e-05,3e-06,8e-06,9e-06,1.5e-05,2.1e-05,2e-06,8e-06,1e-05,5e-06,1.1e-05,6e-06,1.8e-05,2.1e-05,1.5e-05,5e-06,1.2e-05,3e-06,1.7e-05,8e-06,1.7e-05,5e-06,1.2e-05,1.5e-05,1e-05,5e-06
3e-06,8e-06,1.2e-05,1.9e-05,1.8e-05,1e-06,1.1e-05,1.7e-05,6e-06,1.1e-05,6e-06,1e-05,1.4e-05,1e-05,4e-06,1.3e-05,2.1e-05,1.2e-05,2e-06,1.3e-05,1.2e-05,9e-06,2e-06,1e-05,8e-06,5e-06,1.3e-05,3e-06,1.3e-05,2.2e-05,7e-06,8e-06,2.8e-05,1.4e-05,1.6e-05,1.8e-05,1.5e-05,2.3e-05,1.3e-05,6e-06,7e-06,7e-06,7e-06,2.4e-05,1.3e-05,1.2e-05,5e-06,1.1e-05,1.7e-05,1.1e-05,2.5e-05,2.3e-05,4e-06,7e-06,1.3e-05,3e-06,2.1e-05,5e-06,1.4e-05,1.1e-05,4e-06,9e-06,2e-05,2.1e-05,1.5e-05,1e-05,4e-06,1.1e-05,1.4e-05,3e-06,1.2e-05,1.1e-05,7e-06,9e-06,1.3e-05,1e-05,1e-06,2.4e-05,1.3e-05,1.1e-05,1.3e-05,2e-05,2.4e-05,1.5e-05,1.7e-05,1.1e-05,2.3e-05,1.3e-05,1e-06,6e-06,1.5e-05,1e-05,1.5e-05,1.2e-05,5e-06,1.2e-05,3e-06,9e-06,1.5e-05,4e-06,1.8e-05,1.7e-05,1.4e-05,3e-06,1.2e-05,1.5e-05,1.7e-05,2.6e-05,1.6e-05,5e-06,1.4e-05,1.3e-05,3e-06,3e-06,1.5e-05,4e-06,9e-06,2e-06,1.3e-05,5e-06,2e-06
2e-06,1.8e-05,1.8e-05,2.8e-05,1.1e-05,1.5e-05,1.3e-05,9e-06,5e-06,1.2e-05,2e-06,6e-06,1.8e-05,1.3e-05,7e-06,1.5e-05,1.7e-05,2e-05,1.4e-05,1e-06,1.8e-05,1.4e-05,1.7e-05,1e-05,1.3e-05,3e-06,1.7e-05,6e-06,1.3e-05,5e-06,1.1e-05,2.2e-05,1e-05,2e-06,1.2e-05,1.9e-05,2.4e-05,2.7e-05,2.7e-05,1.4e-05,7e-06,7e-06,4e-06,2.6e-05,1.5e-05,1.5e-05,1e-05,1.4e-05,1.5e-05,1.3e-05,2.3e-05,2.6e-05,1.8e-05,1.7e-05,1.4e-05,1.7e-05,1.5e-05,1e-06,7e-06,1e-06,6e-06,1.1e-05,1.4e-05,7e-06,1.2e-05,2.2e-05,7e-06,1.1e-05,1.1e-05,1.5e-05,9e-06,8e-06,7e-06,1.4e-05,1.1e-05,1.2e-05,7e-06,2.1e-05,1.2e-05,8e-06,2e-05,7e-06,2.1e-05,1.6e-05,1.1e-05,9e-06,2.2e-05,1.6e-05,1.7e-05,1.4e-05,6e-06,1.4e-05,2.4e-05,3.8e-05,1.3e-05,1e-05,6e-06,1.1e-05,6e-06,1.4e-05,2e-06,5e-06,8e-06,1.9e-05,5e-06,2e-06,1.8e-05,1.1e-05,1.4e-05,1e-06,1.9e-05,2.6e-05,2.3e-05,1e-05,1.7e-05,1.4e-05,8e-06,1e-05,1.2e-05,5e-06,1.2e-05
1.6e-05,1.8e-05,1.1e-05,2.1e-05,1.6e-05,1.4e-05,6e-06,1.4e-05,4e-06,1e-05,1.1e-05,3e-06,1.5e-05,1.3e-05,7e-06,1.7e-05,1.5e-05,2.5e-05,1.4e-05,1e-05,1.9e-05,1.5e-05,5e-06,1.1e-05,3.3e-05,2.2e-05,3.4e-05,2.9e-05,2e-06,2.1e-05,2e-05,2.3e-05,2.2e-05,1.8e-05,6e-06,1e-05,9e-06,3.6e-05,2e-05,1.1e-05,5e-06,5e-06,1.9e-05,2.6e-05,2.7e-05,2.1e-05,1.4e-05,8e-06,5e-06,1.1e-05,1.4e-05,1.8e-05,2e-06,2.2e-05,2.3e-05,2.7e-05,2.8e-05,1.3e-05,6e-06,5e-06,5e-06,1e-06,1e-05,2e-05,6e-06,7e-06,1.1e-05,7e-06,1.4e-05,1.5e-05,1e-05,2e-06,1e-05,6e-06,7e-06,4e-06,3e-06,1e-05,2.3e-05,8e-06,1.1e-05,7e-06,1.7e-05,1e-06,1.2e-05,2e-05,2.6e-05,8e-06,1e-05,1.6e-05,1.1e-05,1.9e-05,2.1e-05,3.4e-05,3.3e-05,1.3e-05,2e-06,1.2e-05,1.3e-05,9e-06,1.1e-05,9e-06,1.7e-05,2.9e-05,2.2e-05,1.4e-05,9e-06,1.4e-05,1.4e-05,1.3e-05,1.5e-05,1.1e-05,1.9e-05,1.6e-05,2.1e-05,9e-06,1.3e-05,8e-06,1e-05,1.5e-05,5e-06
5e-06,1.1e-05,5e-06,2.1e-05,2.2e-05,1.4e-05,1.2e-05,8e-06,1.3e-05,1.4e-05,1.1e-05,5e-06,1.1e-05,2e-06,1.2e-05,1e-06,1.7e-05,1.8e-05,1.2e-05,7e-06,8e-06,2e-05,1.5e-05,4e-06,2.6e-05,6e-06,1.8e-05,6e-06,1.2e-05,1.4e-05,1.7e-05,1.2e-05,8e-06,8e-06,1.4e-05,1.4e-05,3.4e-05,1.1e-05,2.1e-05,1.8e-05,1.6e-05,2e-06,2.3e-05,1.5e-05,1.2e-05,1.3e-05,8e-06,1.6e-05,2.4e-05,2.1e-05,2e-05,2.3e-05,1.7e-05,2.4e-05,2.4e-05,9e-06,2.3e-05,2.1e-05,8e-06,7e-06,5e-06,1.3e-05,1.6e-05,2.9e-05,2.3e-05,7e-06,9e-06,9e-06,1.6e-05,6e-06,8e-06,1.1e-05,1.7e-05,1.2e-05,8e-06,1.5e-05,1.1e-05,6e-06,1.8e-05,1.6e-05,7e-06,9e-06,7e-06,1.1e-05,2e-05,3.9e-05,1.4e-05,1.9e-05,1.1e-05,2.1e-05,6e-06,1.2e-05,2.2e-05,1.2e-05,1.8e-05,1.6e-05,1.9e-05,1.2e-05,1.3e-05,1.9e-05,1.3e-05,2.1e-05,2.7e-05,1.5e-05,1.8e-05,1.7e-05,1.3e-05,1.2e-05,1.8e-05,1.1e-05,1.1e-05,9e-06,1.6e-05,7e-06,8e-06,2e-06,9e-06,1.5e-05,1e-05,2.7e-05,2.4e-05
1e-05,1.2e-05,7e-06,1.7e-05,1e-05,7e-06,7e-06,4e-06,7e-06,1e-05,1.2e-05,1.4e-05,8e-06,9e-06,1.8e-05,1.6e-05,2.7e-05,1.9e-05,6e-06,5e-06,1.8e-05,2.3e-05,9e-06,4e-06,1.9e-05,1.8e-05,1.2e-05,3e-06,1e-05,1e-05,2.8e-05,8e-06,1.3e-05,8e-06,1.1e-05,9e-06,3.4e-05,2.8e-05,2.6e-05,4e-06,6e-06,1.4e-05,2.8e-05,1.4e-05,1e-06,6e-06,2e-06,2.9e-05,7e-06,1.1e-05,1.7e-05,2.5e-05,2.5e-05,1.3e-05,1.2e-05,8e-06,2e-05,2.6e-05,1.5e-05,5e-06,2.1e-05,1.3e-05,1e-05,2.1e-05,2.4e-05,2.4e-05,6e-06,1.2e-05,1e-05,1.6e-05,2e-06,1.7e-05,1.9e-05,1.1e-05,6e-06,1.9e-05,1.1e-05,2e-05,3e-06,6e-06,2.3e-05,2.8e-05,3.3e-05,2.5e-05,2e-06,2.3e-05,2.3e-05,2.2e-05,5e-06,1.1e-05,5e-06,8e-06,6e-06,4e-06,5e-06,1e-05,1.9e-05,1.4e-05,2e-05,2.8e-05,1.7e-05,6e-06,8e-06,7e-06,5e-06,1.5e-05,6e-06,1.2e-05,2e-05,7e-06,1.3e-05,1.2e-05,8e-06,2.3e-05,1.4e-05,4e-06,8e-06,1.5e-05,1.5e-05,2.1e-05,8e-06
4e-06,1.3e-05,1.1e-05,1e-05,8e-06,2.1e-05,7e-06,1.3e-05,9e-06,7e-06,1e-05,1.9e-05,1.6e-05,6e-06,1.7e-05,2e-06,1.9e-05,1.4e-05,1.6e-05,1.3e-05,1.5e-05,1.3e-05,1.1e-05,9e-06,1.8e-05,9e-06,1.6e-05,1.3e-05,1.4e-05,2.3e-05,2.3e-05,3.1e-05,5e-06,1.8e-05,8e-06,1.2e-05,2.6e-05,2e-05,1.4e-05,9e-06,3e-06,9e-06,1e-05,6e-06,1.4e-05,1.5e-05,8e-06,2.1e-05,1.4e-05,4e-06,1.3e-05,4e-06,1.1e-05,1.4e-05,1.4e-05,4e-06,7e-06,1.2e-05,1.2e-05,1.3e-05,2.8e-05,3.6e-05,3.1e-05,1.7e-05,2e-05,2.8e-05,2e-05,2.1e-05,1.2e-05,1.4e-05,1.7e-05,1.3e-05,1.4e-05,1.9e-05,1.2e-05,1.6e-05,1e-05,1.5e-05,2e-05,9e-06,2.2e-05,2.1e-05,1.3e-05,6e-06,8e-06,1.4e-05,1.9e-05,3e-06,1.3e-05,6e-06,1e-06,3e-06,7e-06,7e-06,7e-06,2e-05,8e-06,3e-06,2.2e-05,1.2e-05,1.4e-05,1.4e-05,4e-06,2e-05,5e-06,1.2e-05,5e-06,1.4e-05,2.2e-05,1.8e-05,9e-06,8e-06,1.9e-05,6e-06,1.1e-05,3e-06,2e-05,4e-06,9e-06,3e-06,1.3e-05
1.3e-05,1.6e-05,1.3e-05,1e-06,1.1e-05,2.5e-05,2.8e-05,2.3e-05,9e-06,7e-06,8e-06,6e-06,6e-06,1e-05,2.2e-05,1.8e-05,1.1e-05,1.1e-05,9e-06,7e-06,1.8e-05,6e-06,3e-06,1.3e-05,1e-05,1.7e-05,2.2e-05,9e-06,1e-05,2.2e-05,3e-06,2.6e-05,3e-05,3.4e-05,2.2e-05,1.3e-05,1.5e-05,1.2e-05,5e-06,5e-06,8e-06,4e-06,1.3e-05,8e-06,2e-05,2.7e-05,1.8e-05,1.3e-05,1.1e-05,7e-06,1.4e-05,1.9e-05,2e-05,5e-06,1.3e-05,2.4e-05,1.8e-05,2e-05,1.3e-05,5e-06,1.3e-05,1e-05,2.1e-05,2.6e-05,9e-06,2.4e-05,1.7e-05,1.3e-05,5e-06,1e-05,1.5e-05,2.1e-05,9e-06,2.6e-05,1.9e-05,3e-06,9e-06,1.5e-05,1.1e-05,1.3e-05,2.4e-05,1e-05,1.7e-05,1e-05,1.1e-05,8e-06,1.8e-05,1.9e-05,2e-05,1.5e-05,8e-06,4e-06,4e-06,1.3e-05,1e-05,2.2e-05,2e-05,1.7e-05,1.8e-05,8e-06,1.1e-05,2.2e-05,1.9e-05,3e-05,2.3e-05,2e-05,1.3e-05,6e-06,1.2e-05,5e-06,1.3e-05,8e-06,1.4e-05,1.4e-05,2.2e-05,9e-06,1.8e-05,8e-06,9e-06,5e-06,1.2e-05
5e-06,2.4e-05,2e-06,2e-06,7e-06,1.4e-05,1.8e-05,3.3e-05,2.9e-05,1.8e-05,9e-06,7e-06,2e-06,1e-05,8e-06,8e-06,2.6e-05,2.9e-05,2.4e-05,1.7e-05,1.4e-05,2e-06,5e-06,1.2e-05,1.6e-05,2.4e-05,1.1e-05,8e-06,8e-06,1.9e-05,2.2e-05,2.1e-05,5e-06,2.2e-05,1.2e-05,6e-06,1.6e-05,1e-05,2.3e-05,2e-06,1.4e-05,1e-05,4e-06,2e-06,2.6e-05,5e-06,8e-06,9e-06,1.8e-05,1.2e-05,6e-06,1.1e-05,3e-06,1.5e-05,8e-06,9e-06,6e-06,1.1e-05,7e-06,3e-06,1.1e-05,8e-06,1e-05,6e-06,1.3e-05,5e-06,1.3e-05,2e-06,2.3e-05,1.5e-05,2.5e-05,2.6e-05,1.9e-05,2.1e-05,5e-06,7e-06,1.5e-05,1.9e-05,9e-06,4e-06,2.3e-05,1.9e-05,1e-05,3e-06,4e-06,9e-06,2.1e-05,1e-05,9e-06,1.9e-05,7e-06,6e-06,8e-06,2e-06,2.8e-05,2.7e-05,1.4e-05,6e-06,1e-05,2.5e-05,1.8e-05,1.2e-05,9e-06,1.7e-05,4e-06,3e-06,1.5e-05,9e-06,4e-06,9e-06,2e-06,1.1e-05,4e-06,6e-06,5e-06,7e-06,3e-06,1.3e-05,4e-06,4e-06,1.1e-05
1.3e-05,1.1e-05,1.5e-05,1.2e-05,1.6e-05,9e-06,9e-06,1e-05,1.3e-05,1.8e-05,5e-06,4e-06,7e-06,1.3e-05,9e-06,1.8e-05,3.5e-05,1.1e-05,5e-06,7e-06,8e-06,7e-06,3e-06,1.1e-05,1.7e-05,3e-05,1.5e-05,9e-06,5e-06,8e-06,7e-06,1.2e-05,1.3e-05,1.7e-05,1.3e-05,6e-06,2.6e-05,1.8e-05,3.1e-05,2.7e-05,1.5e-05,1.5e-05,9e-06,5e-06,1.6e-05,1.4e-05,1.1e-05,1.5e-05,8e-06,1.1e-05,9e-06,1.4e-05,2.3e-05,2.6e-05,1.6e-05,5e-06,1.3e-05,1.3e-05,1.6e-05,6e-06,9e-06,1.6e-05,1.4e-05,8e-06,8e-06,1.1e-05,1.1e-05,1.6e-05,3.3e-05,1.7e-05,1.8e-05,7e-06,5e-06,1.6e-05,1.4e-05,2e-06,1.6e-05,1.2e-05,1.2e-05,1.2e-05,1.4e-05,8e-06,1.2e-05,1.2e-05,1e-05,4e-06,3e-06,1.2e-05,1.9e-05,3.9e-05,2.1e-05,2e-06,1.9e-05,1e-05,2.7e-05,1.7e-05,1.9e-05,1e-05,1e-06,1.8e-05,1.9e-05,1.7e-05,1.3e-05,2e-06,3e-06,1e-05,1.5e-05,1.3e-05,9e-06,7e-06,1.1e-05,1.2e-05,2.1e-05,7e-06,3e-06,6e-06,1e-05,1.9e-05,1.1e-05,5e-06,1e-05
6e-06,1e-05,1.3e-05,3e-05,3.4e-05,1.3e-05,1e-05,9e-06,1.3e-05,6e-06,1.4e-05,2e-05,1.7e-05,1.1e-05,1.2e-05,2e-05,1.4e-05,1.1e-05,6e-06,3e-06,4e-06,1.1e-05,7e-06,5e-06,2.6e-05,6e-06,2e-05,1.8e-05,2e-05,1.8e-05,8e-06,5e-06,7e-06,1.4e-05,1.5e-05,5e-06,2.1e-05,1.2e-05,9e-06,1e-06,9e-06,1.2e-05,9e-06,9e-06,1.5e-05,7e-06,1.7e-05,2.2e-05,1.9e-05,1.6e-05,1.4e-05,1.1e-05,2.1e-05,9e-06,2.1e-05,2.1e-05,7e-06,6e-06,9e-06,1.1e-05,1.1e-05,1.8e-05,3e-06,1.1e-05,1.5e-05,2.1e-05,2.7e-05,1.2e-05,1e-05,9e-06,6e-06,1e-05,6e-06,1.1e-05,4e-06,1e-05,2.3e-05,1e-05,1.3e-05,1.3e-05,1.6e-05,7e-06,9e-06,7e-06,1.3e-05,7e-06,8e-06,1.6e-05,9e-06,2.2e-05,1.3e-05,9e-06,1.3e-05,1.5e-05,2.7e-05,1.2e-05,1.8e-05,2.3e-05,2e-05,2e-05,1.2e-05,6e-06,1.2e-05,1e-05,3e-06,1.4e-05,4e-06,5e-06,3e-06,7e-06,6e-06,1.9e-05,1.2e-05,1e-05,2e-06,9e-06,1.6e-05,1.8e-05,1.1e-05,1.1e-05,1.2e-05
6e-06,9e-06,1e-05,1.5e-05,7e-06,1.7e-05,1e-05,3e-06,4e-06,8e-06,1e-05,2.3e-05,1.3e-05,9e-06,1e-05,1.4e-05,2.6e-05,1.8e-05,1.1e-05,1e-05,5e-06,1.1e-05,4e-06,6e-06,2.3e-05,1.9e-05,1.8e-05,1.7e-05,9e-06,8e-06,2.4e-05,1.4e-05,1.4e-05,1.3e-05,2.2e-05,1.7e-05,1.1e-05,5e-06,1.5e-05,7e-06,5e-06,3e-06,4e-06,1.5e-05,1.6e-05,1.9e-05,6e-06,1.5e-05,1e-05,1.2e-05,6e-06,9e-06,1.5e-05,2.3e-05,9e-06,3e-06,1.1e-05,1e-05,7e-06,7e-06,1e-05,4e-06,4e-06,4e-06,5e-06,1.2e-05,1e-05,2.9e-05,2.7e-05,9e-06,9e-06,1.3e-05,1.8e-05,2.7e-05,1.8e-05,1.3e-05,3.4e-05,1.6e-05,2e-05,6e-06,1.3e-05,9e-06,1e-05,1.2e-05,4e-06,5e-06,4e-06,6e-06,3e-06,1.3e-05,1.7e-05,1.3e-05,1.3e-05,4e-06,1e-05,1.4e-05,6e-06,1.1e-05,1.2e-05,1.2e-05,1.3e-05,1.2e-05,1.2e-05,2.2e-05,1.7e-05,9e-06,1.6e-05,9e-06,2e-06,6e-06,9e-06,7e-06,1e-06,5e-06,6e-06,7e-06,1.5e-05,8e-06,8e-06,5e-06,3e-06
3e-06,1.1e-05,3e-06,8e-06,9e-06,8e-06,9e-06,1.3e-05,9e-06,7e-06,9e-06,1.4e-05,1.3e-05,1.2e-05,1.6e-05,1e-05,1.3e-05,1.8e-05,1.4e-05,9e-06,1.1e-05,9e-06,5e-06,1e-05,1.6e-05,9e-06,1e-06,8e-06,6e-06,1.2e-05,2.4e-05,1.5e-05,7e-06,8e-06,5e-06,3e-06,1.5e-05,1e-05,1.4e-05,1.8e-05,1.3e-05,4e-06,3e-06,1e-05,5e-06,5e-06,1.6e-05,1.2e-05,2e-05,6e-06,1.1e-05,1.8e-05,1.4e-05,1.9e-05,2e-05,9e-06,7e-06,1e-05,4e-06,1e-06,1.5e-05,2e-05,1.3e-05,8e-06,8e-06,1.2e-05,9e-06,1.5e-05,7e-06,1.1e-05,1.7e-05,5e-06,2.2e-05,1e-05,1.3e-05,1e-05,1.4e-05,1.3e-05,1e-05,1.1e-05,9e-06,1.5e-05,4e-06,1.3e-05,3e-06,7e-06,1.5e-05,1e-05,7e-06,4e-06,1.3e-05,7e-06,6e-06,1e-05,2.1e-05,2.8e-05,1.9e-05,1.1e-05,1.4e-05,2.5e-05,1.6e-05,4e-06,1.2e-05,1.6e-05,4e-06,9e-06,1.6e-05,1.2e-05,1.4e-05,1e-05,6e-06,1.3e-05,3e-06,5e-06,9e-06,5e-06,4e-06,5e-06,8e-06,1e-05,1.2e-05
1.5e-05,1.1e-05,4e-06,1.3e-05,9e-06,1.6e-05,1.8e-05,1e-05,1.5e-05,1.1e-05,8e-06,1e-05,9e-06,1.5e-05,6e-06,3e-06,1.1e-05,1.1e-05,5e-06,1.1e-05,1.5e-05,8e-06,5e-06,9e-06,1.1e-05,7e-06,2e-06,9e-06,1.5e-05,1.9e-05,3e-06,4e-06,4e-06,7e-06,4e-06,6e-06,4e-06,1e-06,1e-05,5e-06,4e-06,1e-06,3e-06,2e-06,7e-06,5e-06,1.2e-05,1.4e-05,4e-06,5e-06,1.3e-05,5e-06,2e-06,5e-06,8e-06,4e-06,1.2e-05,9e-06,8e-06,7e-06,1.1e-05,8e-06,6e-06,1.4e-05,1.3e-05,1.2e-05,1.8e-05,1.6e-05,5e-06,1.1e-05,8e-06,1e-05,1.6e-05,1.1e-05,7e-06,2e-06,9e-06,4e-06,1.2e-05,9e-06,7e-06,1e-05,9e-06,1e-05,1.2e-05,7e-06,1.9e-05,1.2e-05,4e-06,8e-06,6e-06,7e-06,6e-06,1e-06,1.6e-05,1.2e-05,7e-06,9e-06,8e-06,6e-06,3e-06,5e-06,8e-06,1.3e-05,1.1e-05,8e-06,1.1e-05,4e-06,1e-05,4e-06,5e-06,1.4e-05,1.3e-05,9e-06,1.4e-05,1.3e-05,1.4e-05,3e-06,6e-06,4e-06,5e-06
9e-06,1.1e-05,1.2e-05,9e-06,1.4e-05,3e-06,5e-06,1e-05,4e-06,4e-06,6e-06,4e-06,3e-06,8e-06,6e-06,1e-06,2e-06,6e-06,3e-06,5e-06,1e-06,2e-06,3e-06,2e-06,4e-06,5e-06,5e-06,2e-06,1.2e-05,6e-06,7e-06,7e-06,8e-06,1e-05,9e-06,7e-06,1.4e-05,7e-06,8e-06,5e-06,6e-06,5e-06,8e-06,8e-06,3e-06,3e-06,1e-06,3e-06,0,7e-06,1e-05,1e-05,1e-05,7e-06,5e-06,3e-06,8e-06,2e-06,5e-06,2e-06,1e-06,4e-06,8e-06,7e-06,1.1e-05,1e-05,9e-06,9e-06,4e-06,5e-06,1.3e-05,6e-06,8e-06,7e-06,4e-06,1e-06,6e-06,7e-06,7e-06,1e-06,5e-06,9e-06,7e-06,9e-06,7e-06,1.4e-05,1.1e-05,1.5e-05,1.1e-05,7e-06,7e-06,1e-06,3e-06,4e-06,6e-06,5e-06,7e-06,7e-06,3e-06,3e-06,3e-06,1e-06,3e-06,4e-06,5e-06,4e-06,1e-06,7e-06,4e-06,2e-06,5e-06,3e-06,5e-06,9e-06,1e-06,5e-06,8e-06,7e-06,2e-06,1e-06,7e-06
5e-06,1.2e-05,3e-06,8e-06,8e-06,8e-06,3e-06,5e-06,1.1e-05,3e-06,5e-06,4e-06,2e-06,3e-06,2e-06,6e-06,8e-06,6e-06,2e-06,1e-06,3e-06,2e-06,1e-06,5e-06,3e-06,3e-06,2e-06,3e-06,7e-06,3e-06,2e-06,2e-06,1e-05,7e-06,5e-06,1e-06,1.2e-05,6e-06,8e-06,4e-06,6e-06,3e-06,3e-06,3e-06,3e-06,1e-06,4e-06,2e-06,7e-06,3e-06,2e-06,1e-06,5e-06,7e-06,6e-06,4e-06,4e-06,3e-06,4e-06,4e-06,7e-06,9e-06,5e-06,4e-06,6e-06,1e-05,2e-06,7e-06,2e-06,4e-06,8e-06,2e-06,6e-06,2e-06,3e-06,2e-06,1e-06,6e-06,3e-06,2e-06,4e-06,3e-06,1e-06,4e-06,6e-06,6e-06,5e-06,1.1e-05,4e-06,3e-06,3e-06,3e-06,6e-06,3e-06,5e-06,8e-06,4e-06,7e-06,1e-06,4e-06,5e-06,3e-06,3e-06,7e-06,1e-06,5e-06,4e-06,8e-06,5e-06,4e-06,2e-06,3e-06,2e-06,3e-06,7e-06,2e-06,3e-06,2e-06,3e-06,2e-06,4e-06
3e-06,1e-05,3e-06,4e-06,3e-06,3e-06,2e-06,4e-06,7e-06,3e-06,3e-06,2e-06,2e-06,3e-06,2e-06,4e-06,5e-06,5e-06,4e-06,1e-06,2e-06,0,1e-06,4e-06,7e-06,3e-06,1e-06,3e-06,5e-06,2e-06,3e-06,0,6e-06,3e-06,2e-06,2e-06,8e-06,2e-06,5e-06,3e-06,3e-06,4e-06,1e-06,4e-06,4e-06,1e-06,4e-06,4e-06,5e-06,1e-06,2e-06,3e-06,4e-06,3e-06,3e-06,4e-06,4e-06,3e-06,1e-06,0,5e-06,6e-06,4e-06,1e-06,5e-06,4e-06,1e-06,8e-06,4e-06,5e-06,1.1e-05,3e-06,6e-06,3e-06,2e-06,1e-06,1e-06,2e-06,3e-06,1e-06,1e-06,2e-06,1e-06,4e-06,4e-06,7e-06,2e-06,6e-06,4e-06,2e-06,2e-06,0,4e-06,2e-06,7e-06,5e-06,1e-06,6e-06,2e-06,3e-06,2e-06,0,2e-06,7e-06,2e-06,3e-06,2e-06,3e-06,2e-06,1e-06,1e-06,2e-06,4e-06,2e-06,3e-06,3e-06,2e-06,3e-06,2e-06,0,3e-06
2e-06,9e-06,1e-06,3e-06,2e-06,4e-06,2e-06,2e-06,6e-06,2e-06,3e-06,3e-06,1e-06,1e-06,0,3e-06,5e-06,4e-06,2e-06,1e-06,1e-06,0,1e-06,4e-06,5e-06,1e-06,1e-06,3e-06,4e-06,2e-06,2e-06,1e-06,5e-06,2e-06,2e-06,2e-06,7e-06,1e-06,3e-06,3e-06,2e-06,2e-06,1e-06,4e-06,4e-06,1e-06,3e-06,3e-06,5e-06,2e-06,1e-06,3e-06,3e-06,2e-06,4e-06,4e-06,3e-06,1e-06,0,1e-06,4e-06,6e-06,2e-06,2e-06,4e-06,2e-06,1e-06,6e-06,2e-06,1e-06,9e-06,2e-06,7e-06,2e-06,1e-06,2e-06,3e-06,3e-06,3e-06,2e-06,1e-06,2e-06,1e-06,4e-06,4e-06,7e-06,2e-06,8e-06,5e-06,2e-06,0,0,4e-06,2e-06,5e-06,6e-06,1e-06,7e-06,2e-06,3e-06,1e-06,2e-06,1e-06,5e-06,1e-06,2e-06,1e-06,1e-06,2e-06,2e-06,1e-06,1e-06,3e-06,1e-06,4e-06,3e-06,1e-06,3e-06,2e-06,1e-06,3e-06
1e-06,8e-06,0,3e-06,3e-06,3e-06,2e-06,1e-06,6e-06,2e-06,4e-06,2e-06,1e-06,2e-06,0,3e-06,4e-06,3e-06,1e-06,1e-06,2e-06,0,0,4e-06,3e-06,3e-06,1e-06,3e-06,4e-06,3e-06,2e-06,1e-06,5e-06,2e-06,1e-06,1e-06,8e-06,1e-06,3e-06,2e-06,2e-06,3e-06,1e-06,4e-06,4e-06,0,3e-06,2e-06,6e-06,1e-06,1e-06,3e-06,3e-06,1e-06,3e-06,4e-06,3e-06,2e-06,1e-06,2e-06,4e-06,5e-06,1e-06,1e-06,4e-06,2e-06,0,7e-06,2e-06,1e-06,1e-05,2e-06,6e-06,3e-06,2e-06,1e-06,3e-06,3e-06,2e-06,1e-06,1e-06,2e-06,1e-06,3e-06,4e-06,7e-06,1e-06,6e-06,5e-06,2e-06,0,1e-06,4e-06,1e-06,5e-06,6e-06,1e-06,6e-06,2e-06,2e-06,1e-06,2e-06,2e-06,5e-06,1e-06,2e-06,2e-06,1e-06,2e-06,2e-06,0,1e-06,3e-06,1e-06,3e-06,3e-06,1e-06,3e-06,2e-06,0,3e-06
