-0.000351,-0.000433,-0.000537,-0.000448,-0.000264,-0.000332,-0.000534,-0.000369,-0.000367,-0.00027,-0.000222,-0.000221,-0.000186,-0.000198,-0.00028,-0.000208,-0.000187,-0.000121,-0.000144,-0.000143,-0.000178,-0.00017,-0.00013,-0.000194,-0.000184,-0.000112,-5.8e-05,-6.2e-05
-0.000357,-0.000331,-0.000397,-0.000351,-0.000212,-0.000285,-0.000452,-0.000319,-0.000293,-0.000194,-0.000164,-0.000174,-0.000169,-0.000184,-0.000195,-0.000148,-0.00015,-8.3e-05,-0.000108,-0.000103,-0.000167,-0.000162,-0.000127,-0.000202,-0.000186,-8.1e-05,-5e-05,-5.4e-05
-9e-06,0.000126,0.000232,0.000151,2.6e-05,3.5e-05,0.000122,4.6e-05,5.7e-05,6.8e-05,-1e-06,-2.9e-05,-4.7e-05,5e-06,7.1e-05,-5e-06,-1.1e-05,-1e-06,-1.4e-05,4e-06,2.3e-05,1.1e-05,1e-06,-1.2e-05,-6e-06,2.2e-05,-2e-06,-9e-06
0.000359,0.000413,0.000525,0.000453,0.000257,0.000334,0.000569,0.000366,0.000326,0.000247,0.000177,0.000195,0.00019,0.000191,0.000241,0.000177,0.000162,9e-05,0.000116,0.000119,0.000179,0.00016,0.000114,0.000192,0.000175,9.1e-05,5.2e-05,5.7e-05
0.000214,0.000106,3.1e-05,6.7e-05,0.000116,0.000139,0.000167,0.000175,0.000144,5e-05,8.4e-05,0.000129,0.000129,8.6e-05,7.2e-05,0.000126,0.000116,5.6e-05,7.6e-05,6.6e-05,9.8e-05,9.9e-05,6.7e-05,0.000126,0.000109,1.3e-05,2.2e-05,3.1e-05
-0.00014,-0.00031,-0.000458,-0.00035,-0.000137,-0.000189,-0.000399,-0.000214,-0.000206,-0.000193,-0.000105,-8.8e-05,-5.9e-05,-1e-04,-0.000179,-9e-05,-7.6e-05,-4.1e-05,-3.9e-05,-6.5e-05,-0.000104,-8.4e-05,-5.2e-05,-7.6e-05,-7.7e-05,-7.7e-05,-2.9e-05,-2.4e-05
-0.000251,-0.000248,-0.00025,-0.00023,-0.00018,-0.000203,-0.000316,-0.000256,-0.00021,-0.000116,-8.5e-05,-0.000122,-0.000112,-0.000111,-0.000152,-0.000163,-0.000142,-6.3e-05,-6.4e-05,-7.4e-05,-0.000145,-0.000127,-7.5e-05,-0.000127,-0.000123,-3.6e-05,-3e-05,-3e-05
-6.4e-05,0.000127,0.000275,0.000155,-2.8e-05,6e-06,0.000124,1.2e-05,4.8e-05,0.000103,3.3e-05,-4.6e-05,-8.6e-05,1.1e-05,7.9e-05,-2.9e-05,-2.5e-05,-7e-06,-4.5e-05,-5e-06,0,-4e-06,1e-06,-4.2e-05,-2.7e-05,4.4e-05,1e-06,-1e-05
0.000141,0.000268,0.00037,0.000312,0.000172,0.000188,0.000342,0.000216,0.000182,0.000157,8.9e-05,9.1e-05,7.7e-05,0.000105,0.000167,0.000133,0.000118,4.5e-05,3e-05,4.8e-05,0.000114,8.6e-05,4.3e-05,6.1e-05,7.9e-05,6e-05,2.4e-05,1.5e-05
0.000156,1.7e-05,-8.3e-05,2e-05,0.000131,8.9e-05,4.4e-05,9.3e-05,2.9e-05,-4e-05,-1.4e-05,8.1e-05,0.000108,3.8e-05,-1.6e-05,7.7e-05,7.8e-05,2.3e-05,4.1e-05,2.5e-05,6.8e-05,4.7e-05,1e-05,5.7e-05,5.1e-05,-2.1e-05,5e-06,1.4e-05
-5.5e-05,-0.000226,-0.000383,-3e-04,-0.000113,-0.000139,-0.000289,-0.000133,-0.000122,-0.000178,-0.000126,-6.5e-05,-3.4e-05,-7.9e-05,-0.000146,-6.6e-05,-5.9e-05,-2.3e-05,-1.4e-05,-4.1e-05,-6e-05,-4.8e-05,-3e-05,-6e-06,-2.7e-05,-6.8e-05,-1.7e-05,-1e-05
-7e-05,-5.1e-05,-5.8e-05,-9e-05,-0.000117,-7.9e-05,-7.9e-05,-8.3e-05,-3.3e-05,6e-06,2.8e-05,-1.3e-05,-1.9e-05,-3.3e-05,-4e-06,-4.5e-05,-6e-05,-5e-06,2.7e-05,2e-06,-8e-05,-4.8e-05,5e-06,1e-05,-3e-06,1.7e-05,9e-06,1.2e-05
-2.4e-05,0.00013,0.000275,0.000163,-8e-06,4.2e-05,0.00016,3.4e-05,5.8e-05,0.000138,0.000124,1.7e-05,-4.4e-05,1.4e-05,8.9e-05,-3.3e-05,-3.3e-05,-3e-06,-5e-06,1.6e-05,3e-06,1.8e-05,2.6e-05,-4e-06,1e-06,5.4e-05,1e-05,1e-06
2e-06,8.7e-05,0.000184,0.000148,8.2e-05,8e-05,0.000138,7.6e-05,4.8e-05,6.6e-05,2e-05,-1.5e-05,-1.9e-05,2.9e-05,3.1e-05,9e-06,2.7e-05,-1e-06,-4.7e-05,-1.6e-05,5.7e-05,4.1e-05,-1e-06,-4.1e-05,-1.8e-05,6e-06,-1e-06,-1.3e-05
2.8e-05,-6.9e-05,-0.000153,-5.5e-05,9.5e-05,2.9e-05,-7.4e-05,1.8e-05,-2.3e-05,-8e-05,-8.1e-05,1e-06,4.8e-05,1.7e-05,-5e-05,7.4e-05,7.8e-05,1e-06,-1e-05,-4e-06,2.8e-05,2e-06,-2.6e-05,-3.3e-05,-1e-05,-3e-05,-6e-06,-3e-06
-2e-05,-0.000136,-0.000248,-0.000171,-3.8e-05,-8.2e-05,-0.000211,-8.6e-05,-6.2e-05,-0.00014,-0.000104,-2.3e-05,-1.3e-05,-3.7e-05,-6.7e-05,-2e-06,-1.1e-05,-1e-05,4e-06,-1.8e-05,-3.8e-05,-4.4e-05,-3.3e-05,-1e-05,-1.1e-05,-3.5e-05,-1.7e-05,-1.3e-05
5.3e-05,6.8e-05,8.1e-05,4.2e-05,-7e-05,-2.4e-05,6e-05,-1.4e-05,1.3e-05,2.9e-05,3.5e-05,3.8e-05,3.5e-05,7e-06,5e-05,-3e-05,-4.8e-05,2.9e-05,5.7e-05,1.9e-05,-2.8e-05,-1.5e-05,1.8e-05,6.7e-05,3.2e-05,2.3e-05,9e-06,2.3e-05
1.5e-05,0.000133,0.000221,0.000108,-5.4e-05,1.7e-05,0.000184,5e-05,3.9e-05,0.000132,0.000124,4.3e-05,8e-06,1.1e-05,7.7e-05,-1.1e-05,-1.3e-05,5e-06,1.6e-05,3.2e-05,2.6e-05,4e-05,4.1e-05,6.1e-05,3.7e-05,4e-05,1.3e-05,1.6e-05
-4.9e-05,-2.4e-05,2e-06,-4e-06,1.6e-05,1.7e-05,1.9e-05,3.1e-05,0,3.8e-05,2.3e-05,-3.8e-05,-4.3e-05,2e-06,-2.1e-05,-1.1e-05,1.6e-05,-2.9e-05,-5.7e-05,-1.5e-05,2.4e-05,3.4e-05,8e-06,-4.4e-05,-2.7e-05,-1.9e-05,-6e-06,-1.5e-05
