1e-06,1.4e-05,4e-06,7e-06,2e-06,7e-06,1.2e-05,8e-06,1e-06,2.3e-05,1.3e-05,5e-06,4e-06,4e-06,3e-06,1.1e-05,8e-06,6e-06,0,4e-06,5e-06,2.2e-05,1e-06,1e-05,1.1e-05,1.8e-05,6e-06,2e-06,1.3e-05,3e-06,3e-06,1.4e-05,7e-06,1.6e-05,1e-06,1.5e-05,2e-06,5e-06,2e-06,1e-05,5e-06,2.2e-05,6e-06,8e-06,2.1e-05,7e-06,2e-06,1.2e-05,2e-06,1.2e-05,1.9e-05,1.2e-05,5e-06,0,5e-06,0,1.8e-05,2e-06,2.9e-05,4e-06,2e-06,2e-06,1.1e-05,1.5e-05,1e-06,9e-06,6e-06,3e-06,1e-06,1.2e-05,8e-06,5e-06,1.5e-05,8e-06,3e-06,2e-06,3e-06,2e-06,3e-06,4e-06,8e-06,1e-05,1e-06,5e-06,3e-06,7e-06,5e-06,1.4e-05,7e-06,1e-05,0,5e-06,5e-06,3e-06,5e-06,0,8e-06,4e-06,9e-06,7e-06,3e-06,5e-06,9e-06,7e-06,2.8e-05,5e-06,9e-06,2e-06,1e-05,9e-06,1.1e-05,8e-06,9e-06,2e-06,0,3e-06,2.2e-05,0,1.3e-05,0,2e-06
7e-06,4.2e-05,3e-06,2.9e-05,1.1e-05,2.7e-05,1.9e-05,1.9e-05,1.3e-05,3.8e-05,1.5e-05,3.9e-05,1.5e-05,1.6e-05,1.1e-05,2.2e-05,1.9e-05,1.1e-05,6e-06,8e-06,2.2e-05,6.5e-05,1.4e-05,3.2e-05,2.9e-05,4.3e-05,3e-06,6e-06,1.6e-05,2.5e-05,1.9e-05,4.4e-05,1.5e-05,3.8e-05,1.4e-05,2.2e-05,1e-05,5e-06,2.5e-05,3.2e-05,1.5e-05,6.3e-05,2.3e-05,1.4e-05,4.3e-05,2.3e-05,7e-06,3.7e-05,8e-06,2.2e-05,3.9e-05,3.8e-05,3.2e-05,2e-05,1.2e-05,1.2e-05,3.7e-05,8e-06,6.2e-05,1.3e-05,6e-06,1.2e-05,2.7e-05,3.8e-05,8e-06,1.4e-05,1.4e-05,1.5e-05,1e-05,2.5e-05,1.8e-05,6e-06,4e-05,3.1e-05,1.4e-05,1.7e-05,1.6e-05,1.4e-05,1.1e-05,1e-05,1e-05,2.2e-05,1.6e-05,2e-05,1.4e-05,2.1e-05,1.2e-05,4.1e-05,1e-05,3.1e-05,1.1e-05,1.1e-05,2.4e-05,1.2e-05,1.2e-05,5e-06,1.5e-05,9e-06,2e-05,1.1e-05,2.3e-05,1e-05,2e-06,2.9e-05,5.8e-05,2e-05,2.7e-05,1.4e-05,2.4e-05,4.2e-05,3.1e-05,1.5e-05,2.1e-05,6e-06,1.6e-05,1.4e-05,3e-05,1.9e-05,1.3e-05,1.4e-05,9e-06
1.3e-05,8.1e-05,6.7e-05,4.1e-05,2.8e-05,3.5e-05,5.6e-05,2.4e-05,3.9e-05,4.8e-05,6e-05,4.2e-05,2.2e-05,3.6e-05,4e-05,3.8e-05,5.6e-05,4.5e-05,3.4e-05,2.6e-05,2.2e-05,3.4e-05,4.1e-05,3.9e-05,6e-05,4e-05,1.6e-05,7e-06,2.8e-05,2.9e-05,1.7e-05,4.3e-05,4.2e-05,3.5e-05,5.2e-05,8e-06,2.3e-05,2.6e-05,6.9e-05,2.9e-05,3.6e-05,7.8e-05,7.7e-05,5.1e-05,8.8e-05,4.9e-05,4.2e-05,5.7e-05,3.6e-05,1.1e-05,6e-05,4.3e-05,7.4e-05,3.8e-05,1.6e-05,2.2e-05,2.4e-05,4.7e-05,0.00012,5.1e-05,3.9e-05,5.1e-05,2.4e-05,4.2e-05,4.5e-05,3.2e-05,2.6e-05,4.1e-05,4.8e-05,4.8e-05,1.9e-05,3.1e-05,2.9e-05,2.4e-05,3.5e-05,2.9e-05,1.3e-05,4.3e-05,2e-05,3.3e-05,1.9e-05,2.9e-05,2.5e-05,5.6e-05,2.2e-05,2e-05,4.8e-05,6.5e-05,7e-05,4.3e-05,2.2e-05,2.4e-05,3.5e-05,1.4e-05,1.9e-05,6e-06,2.9e-05,9e-06,1.3e-05,5.1e-05,6e-05,3.1e-05,4.4e-05,2.7e-05,6.4e-05,5.6e-05,3.3e-05,1.4e-05,3.6e-05,9.6e-05,5.1e-05,2e-05,1.3e-05,1.6e-05,5.3e-05,3.9e-05,3.3e-05,2.8e-05,3.1e-05,4.4e-05,2.9e-05
2.9e-05,8.7e-05,0.000105,8e-05,7.9e-05,8.5e-05,7.3e-05,6.4e-05,4.2e-05,2.9e-05,3.9e-05,3.7e-05,5.4e-05,6e-06,3.8e-05,1.5e-05,5.9e-05,4.4e-05,6.3e-05,1.1e-05,5.1e-05,5.4e-05,2.5e-05,5e-05,9.9e-05,0.000152,0.00011,6.6e-05,1e-04,4.1e-05,2.2e-05,5.6e-05,8.2e-05,4.7e-05,3.9e-05,3.5e-05,5.9e-05,3.8e-05,9.5e-05,9.4e-05,6.1e-05,2.6e-05,4.5e-05,4.1e-05,7.4e-05,0.000109,3.6e-05,9e-05,5.5e-05,1e-06,6.7e-05,6.1e-05,6.1e-05,3.9e-05,1.8e-05,4.6e-05,4.1e-05,8.6e-05,9.6e-05,5.3e-05,1.8e-05,6.9e-05,4.1e-05,1.6e-05,3.8e-05,2.1e-05,3.8e-05,3.1e-05,5.2e-05,1.6e-05,7.7e-05,8.5e-05,3.4e-05,5.6e-05,5.1e-05,2.4e-05,1.7e-05,3.7e-05,6.4e-05,3.5e-05,2e-05,5.3e-05,1.6e-05,8.3e-05,4.7e-05,4.1e-05,2.6e-05,4.4e-05,4.9e-05,2e-05,4.3e-05,4.8e-05,1.8e-05,2.8e-05,5.8e-05,1e-05,4.6e-05,4.2e-05,9e-06,8.5e-05,8.4e-05,5.7e-05,1e-04,8.7e-05,0.000115,0.000117,5.8e-05,1e-05,2.7e-05,8.9e-05,0.00012,8.6e-05,0.000108,5.1e-05,5.4e-05,6.9e-05,8.3e-05,8.5e-05,5.5e-05,6.4e-05,3e-05
4.4e-05,1.9e-05,5.4e-05,3.5e-05,3.5e-05,4.1e-05,2.7e-05,1.6e-05,4.1e-05,6.1e-05,4.6e-05,6e-05,9.8e-05,4.2e-05,8e-06,6.1e-05,5.6e-05,4.2e-05,5.8e-05,5.6e-05,8e-05,7.5e-05,1.3e-05,9.9e-05,2.9e-05,7.2e-05,7e-06,4e-05,8.1e-05,5.9e-05,5.7e-05,6e-05,1.8e-05,1.9e-05,4.5e-05,7.6e-05,9e-05,0.000111,0.000152,2.5e-05,3.3e-05,0.000117,5.6e-05,4.3e-05,1.6e-05,8.6e-05,6.7e-05,8.3e-05,3.3e-05,1.9e-05,5.6e-05,1.9e-05,1.3e-05,1.2e-05,3e-06,6.8e-05,4.3e-05,8.4e-05,0.000146,7.5e-05,2.4e-05,0.00011,6.9e-05,4.8e-05,7e-06,4.2e-05,4.3e-05,2.7e-05,4.5e-05,4.3e-05,9.2e-05,4.2e-05,6.3e-05,7.9e-05,1.7e-05,3.7e-05,2.1e-05,2.7e-05,4.5e-05,5.8e-05,2.6e-05,6.4e-05,3.4e-05,9.3e-05,7e-05,4.9e-05,2.9e-05,5.2e-05,3.1e-05,6.7e-05,4.5e-05,3.2e-05,3.4e-05,2.5e-05,6.1e-05,7.3e-05,7.5e-05,9e-05,6.8e-05,8.6e-05,5.1e-05,2e-05,4.4e-05,1.5e-05,3.9e-05,6.7e-05,3.8e-05,7e-06,2.1e-05,4.1e-05,5.7e-05,4.7e-05,0.000105,9.2e-05,9.3e-05,4.4e-05,6.5e-05,6e-05,2.2e-05,7.1e-05,5e-05
4.8e-05,6.9e-05,4.2e-05,1.2e-05,5.9e-05,6.8e-05,2.7e-05,4.7e-05,5.4e-05,0.000129,9.2e-05,3.8e-05,0.000108,0.00012,9e-05,5.1e-05,0.000111,0.00011,1e-04,0.000116,1.9e-05,8.8e-05,6.2e-05,8.6e-05,8.1e-05,5.2e-05,7.6e-05,5.9e-05,5.4e-05,0.000109,0.000114,5.1e-05,5.8e-05,7e-06,8e-06,0.000104,0.000109,2.2e-05,4.6e-05,8.9e-05,2.4e-05,0.000104,5.5e-05,0.000172,6.2e-05,7e-05,4.8e-05,5e-06,3e-05,9e-06,4.3e-05,0.000104,5.2e-05,7.4e-05,5.2e-05,0.000104,5.1e-05,5.1e-05,8e-05,7.3e-05,0.000129,0.000105,2e-05,5.7e-05,5.4e-05,5.6e-05,4.1e-05,6.7e-05,5.1e-05,6.4e-05,6.6e-05,5.8e-05,4.8e-05,4.3e-05,7.7e-05,9e-05,1.5e-05,3.8e-05,3.5e-05,4.2e-05,3.2e-05,6.4e-05,8.5e-05,6.4e-05,6.1e-05,1.4e-05,4.1e-05,2.9e-05,5.8e-05,2.8e-05,4.5e-05,4.6e-05,0.000106,8.9e-05,4.4e-05,8.1e-05,1e-05,4e-05,1.3e-05,1.8e-05,2.8e-05,3.2e-05,4.7e-05,6.4e-05,7.1e-05,2.6e-05,2.4e-05,4e-06,4.1e-05,5.6e-05,7.5e-05,3.7e-05,4e-05,2.8e-05,1.1e-05,4e-05,4.6e-05,4.2e-05,2.5e-05,0.000104,2e-05
3.7e-05,4.4e-05,2.1e-05,3.8e-05,7.6e-05,3e-05,3.7e-05,0.000101,7.9e-05,8.9e-05,4.3e-05,9.3e-05,4.2e-05,8.1e-05,5.2e-05,0.000106,2.4e-05,0.000122,7.2e-05,0.000104,9.9e-05,3.3e-05,4.8e-05,9e-05,4.1e-05,0.000119,0.000158,0.000189,8.1e-05,6.5e-05,3.5e-05,4e-06,9.8e-05,7.7e-05,3.4e-05,0.000101,0.000126,0.000113,0.000115,0.000102,6.5e-05,7.4e-05,8.4e-05,0.000226,0.000157,5.1e-05,1.9e-05,2.8e-05,6.1e-05,9.4e-05,5.7e-05,0.000117,2.9e-05,0.000129,1.9e-05,9.7e-05,8.2e-05,5.4e-05,0.00013,4.5e-05,9.9e-05,0.000156,0.000135,6.5e-05,3e-05,3.4e-05,3e-06,8.4e-05,2.1e-05,6.8e-05,6.3e-05,7e-05,1.2e-05,2.1e-05,8.8e-05,0.000108,9.4e-05,9.5e-05,5.8e-05,5.8e-05,8.9e-05,7.6e-05,6.2e-05,0.000109,2.1e-05,1.7e-05,5.4e-05,1e-05,7.3e-05,6.9e-05,7.1e-05,5.6e-05,8.4e-05,4e-05,2.8e-05,2.8e-05,8.7e-05,6.3e-05,2.1e-05,3.7e-05,2.6e-05,4.1e-05,8.2e-05,9.2e-05,0.000139,0.000129,8.3e-05,4.3e-05,8.9e-05,3.6e-05,9.9e-05,0.000142,8.4e-05,2.4e-05,4.4e-05,5.6e-05,0.000107,7.7e-05,4.8e-05,0.000115,0.000123
6.3e-05,1.8e-05,4e-05,6e-06,9.9e-05,6.8e-05,8.9e-05,8.5e-05,0.000112,0.000161,6.3e-05,7.8e-05,5.6e-05,2.6e-05,6.5e-05,6.7e-05,5.2e-05,5.7e-05,8e-05,2.5e-05,9.6e-05,9e-05,8.8e-05,0.000131,0.000138,0.000105,2e-06,7.5e-05,0.000143,0.000171,0.000158,9.9e-05,9.7e-05,9.2e-05,7.7e-05,7.7e-05,8.5e-05,5.8e-05,0.000129,9.1e-05,5.7e-05,5.9e-05,0.000139,0.000299,0.000163,8.5e-05,0.000113,0.000101,5.2e-05,0.000101,4.4e-05,0.000108,0.000134,9.5e-05,0.000145,0.000116,0.000131,0.000133,0.000131,0.000183,6.2e-05,1.4e-05,4.1e-05,0.000107,8.8e-05,2.3e-05,6.9e-05,7.3e-05,0.000123,4.9e-05,3.9e-05,1.3e-05,4.6e-05,4.1e-05,5.2e-05,1.3e-05,9e-05,0.00012,6.9e-05,9.6e-05,4.9e-05,4.7e-05,9.9e-05,4e-05,9.5e-05,6.5e-05,2.3e-05,7.2e-05,9.6e-05,0.00012,8.7e-05,4.9e-05,5.4e-05,2.9e-05,3.3e-05,3.6e-05,0.000105,4.3e-05,3.5e-05,1.8e-05,3.4e-05,6.3e-05,0.000121,0.000102,8.9e-05,0.000101,0.000157,4.8e-05,0.000103,9.4e-05,7e-05,4.5e-05,6.3e-05,3.5e-05,4.8e-05,7.5e-05,5.3e-05,6e-05,5.2e-05,6.8e-05,7e-05
0.000105,7.8e-05,2.6e-05,3e-05,7.4e-05,4.1e-05,7.6e-05,0.000155,2.6e-05,7e-05,2.9e-05,9.3e-05,2.2e-05,4.9e-05,9.9e-05,0.000104,2.2e-05,2.9e-05,3.1e-05,2.6e-05,1e-04,5.5e-05,0.000139,7.3e-05,0.000186,9.8e-05,7.3e-05,4.6e-05,0.000111,7.8e-05,0.000101,4.2e-05,0.000104,7.9e-05,6.5e-05,7e-05,9.6e-05,4.6e-05,0.000105,8.9e-05,9.9e-05,0.000102,8.3e-05,0.00017,0.000113,4.7e-05,7.6e-05,0.000151,0.000146,0.000126,0.000145,0.000138,6.6e-05,0.000162,0.000106,0.000108,2.9e-05,6.1e-05,8.5e-05,0.000121,0.00011,8.8e-05,3.3e-05,0.000145,0.000196,0.000162,8.9e-05,0.000156,0.000187,0.000139,2.8e-05,5.3e-05,8.1e-05,0.000137,9.7e-05,2.9e-05,9.8e-05,7.5e-05,4e-05,4.9e-05,4.1e-05,3.8e-05,4.5e-05,1.2e-05,8.3e-05,5.6e-05,5.6e-05,3.7e-05,5e-06,8.9e-05,2.7e-05,3.7e-05,1.8e-05,7e-06,2.1e-05,1e-05,0.00012,0.000141,4.5e-05,3.7e-05,5.4e-05,4.9e-05,4.9e-05,0.000116,0.000143,7.5e-05,0.000102,9.7e-05,9.8e-05,6.6e-05,4.8e-05,3.2e-05,4.4e-05,2.6e-05,2e-06,8.3e-05,8.2e-05,7.2e-05,0.000116,1.8e-05,2.9e-05
0.000104,7.4e-05,8.7e-05,0.000101,5.7e-05,0.000101,5.3e-05,0.000149,0.000121,6.8e-05,7.8e-05,9.9e-05,0.000136,7.1e-05,0.000138,7.6e-05,0.000105,3.8e-05,6.7e-05,8e-05,9.3e-05,6.2e-05,0.000158,0.000149,7.7e-05,3.6e-05,8.5e-05,0.000134,0.000155,0.000185,9e-06,4.3e-05,3e-05,6.2e-05,6.9e-05,4.6e-05,9.5e-05,7.9e-05,7.8e-05,5.6e-05,7.7e-05,4.4e-05,0.000103,0.000214,0.000152,0.000122,9.4e-05,0.000181,5.3e-05,6.3e-05,0.000104,4.4e-05,0.000142,0.000119,2.6e-05,8.8e-05,0.000101,2.1e-05,2.2e-05,6.6e-05,4.4e-05,0.00013,0.000169,0.000113,0.000114,8.7e-05,1e-04,0.000112,4e-05,6.6e-05,7.7e-05,0.000112,3.6e-05,0.000124,9.1e-05,7.1e-05,7.9e-05,4.3e-05,4.4e-05,2.3e-05,6.9e-05,0.000106,6.6e-05,6.6e-05,9.4e-05,6.4e-05,6.1e-05,6e-05,6.3e-05,3.3e-05,5.5e-05,6.8e-05,4.4e-05,1.9e-05,4.4e-05,2.6e-05,8.9e-05,0.00016,0.000117,2.2e-05,4.2e-05,6.4e-05,0.000117,4.5e-05,5.7e-05,3.2e-05,0.000114,0.000129,2e-05,3.5e-05,6.5e-05,8.4e-05,4.4e-05,5.4e-05,9.3e-05,0.000108,6.2e-05,6.9e-05,6.5e-05,9.4e-05,0.00011
0.000196,1e-04,6.1e-05,5e-05,8e-05,7.9e-05,6.7e-05,7.5e-05,8e-05,4.2e-05,0.000115,0.00018,9.7e-05,7.8e-05,0.000133,0.000195,0.000183,0.000147,0.000107,5.4e-05,3.8e-05,5.6e-05,9.9e-05,2.7e-05,2.8e-05,6.3e-05,0.000143,9.9e-05,3.2e-05,7.3e-05,6.7e-05,1.9e-05,5.8e-05,6.2e-05,6.9e-05,1.7e-05,4e-06,7.3e-05,0.000107,6.6e-05,2e-05,3.2e-05,4.1e-05,0.000133,5.7e-05,0.000118,6.4e-05,0.000124,8.8e-05,2.1e-05,3.6e-05,4.1e-05,5.7e-05,8.8e-05,0.000131,9.7e-05,1.8e-05,8.8e-05,8.1e-05,7.2e-05,4.1e-05,0.000107,6.4e-05,8e-06,9.7e-05,4e-05,3e-05,5.6e-05,9e-05,0.000147,5.4e-05,4.4e-05,1.7e-05,0.000131,4.8e-05,6.8e-05,2.8e-05,4.8e-05,3.7e-05,7.7e-05,7.2e-05,7.2e-05,7.4e-05,4.5e-05,7.1e-05,7.7e-05,4.6e-05,3.5e-05,2.4e-05,5.7e-05,4.8e-05,7e-05,2.8e-05,3.6e-05,3.7e-05,2.8e-05,4.5e-05,5.7e-05,3.3e-05,3.5e-05,1.5e-05,4.1e-05,7.3e-05,9.8e-05,3.1e-05,3.7e-05,0.000113,2.3e-05,4.9e-05,5.9e-05,6.2e-05,7.6e-05,4.8e-05,7.5e-05,7.5e-05,3.3e-05,5e-05,3.8e-05,9.2e-05,3.2e-05,7.1e-05
9.3e-05,3e-05,3.7e-05,5.2e-05,9e-06,4.9e-05,4.3e-05,7.1e-05,5.3e-05,4.5e-05,8.3e-05,3.2e-05,2.6e-05,5.1e-05,8.1e-05,0.000142,3e-05,4.1e-05,7e-05,9e-05,7.4e-05,3.6e-05,9.5e-05,3.4e-05,3.3e-05,7.8e-05,4.8e-05,5.2e-05,3.8e-05,5e-05,4.1e-05,3e-06,8.5e-05,1.6e-05,5.9e-05,4.9e-05,3.8e-05,4.6e-05,3.1e-05,5.6e-05,4.7e-05,1.5e-05,2.6e-05,4.8e-05,1.2e-05,8.1e-05,1.6e-05,8e-06,1.9e-05,3.6e-05,2.6e-05,3.7e-05,4.8e-05,7.9e-05,7e-05,8e-06,2.6e-05,7e-05,8e-05,4.4e-05,4.1e-05,4.6e-05,0.000122,5.8e-05,3.2e-05,6.3e-05,0.000108,0.000108,6e-05,6.4e-05,6.3e-05,3e-05,3.1e-05,0.000104,5.9e-05,6.1e-05,1.6e-05,4.6e-05,3.5e-05,6.6e-05,0.00011,2.3e-05,7.9e-05,6.3e-05,7.9e-05,5.2e-05,3.4e-05,8e-06,1.7e-05,5.7e-05,4e-05,8.2e-05,7.2e-05,4.2e-05,3.6e-05,6.5e-05,5e-05,3.5e-05,3.6e-05,5.2e-05,6.2e-05,4.2e-05,7.8e-05,7.5e-05,6.3e-05,3.9e-05,6.4e-05,6.2e-05,2.6e-05,6e-06,5.6e-05,1.9e-05,3.3e-05,6.3e-05,6.8e-05,2.7e-05,2.8e-05,6.3e-05,7e-05,5.2e-05,4.7e-05
3e-05,5.8e-05,1.7e-05,2.7e-05,0.000104,3.8e-05,4e-06,5.6e-05,2.4e-05,6.5e-05,7.6e-05,8.7e-05,3.9e-05,4.5e-05,3.5e-05,4.8e-05,3.5e-05,5.4e-05,8.3e-05,0.000106,7.5e-05,3.4e-05,2.1e-05,5.1e-05,2.7e-05,3.2e-05,1e-04,2.3e-05,2.2e-05,1.8e-05,2.8e-05,1.9e-05,5.5e-05,2.7e-05,4.3e-05,6.9e-05,9.8e-05,5.4e-05,4e-05,1.7e-05,5.7e-05,7.4e-05,3.8e-05,2.9e-05,4.3e-05,3.2e-05,4.7e-05,8.5e-05,3.9e-05,3.5e-05,6.6e-05,1.9e-05,6.2e-05,5.1e-05,1.6e-05,3.7e-05,4.7e-05,4.1e-05,3.5e-05,6.9e-05,6e-05,8.4e-05,0.000139,6e-05,2.8e-05,3.9e-05,6.7e-05,1.6e-05,4e-05,2.4e-05,3.2e-05,2.7e-05,8.2e-05,3.6e-05,3.5e-05,5.4e-05,3.6e-05,1.4e-05,6.2e-05,1.7e-05,9.2e-05,8.4e-05,5.9e-05,8e-06,5.3e-05,3e-05,1.1e-05,4.1e-05,1.6e-05,4e-05,5.7e-05,2.1e-05,4.4e-05,2.9e-05,3e-06,5.1e-05,2.4e-05,9e-06,3e-05,5.2e-05,2.9e-05,3.5e-05,5.6e-05,1.6e-05,1.9e-05,1.4e-05,4.2e-05,4.3e-05,3.3e-05,4.2e-05,5.5e-05,4.7e-05,6e-05,2.4e-05,2.6e-05,4.4e-05,5.6e-05,1.5e-05,4.1e-05,2e-06,4.5e-05
1.4e-05,3.3e-05,3e-05,3e-05,9.7e-05,4.5e-05,2.4e-05,8e-05,6.5e-05,7.2e-05,6e-05,7.2e-05,3.4e-05,5.5e-05,3e-05,1.7e-05,2.7e-05,3.7e-05,5.1e-05,2.1e-05,5.4e-05,5.3e-05,1.2e-05,3.3e-05,6.8e-05,2.8e-05,8.3e-05,9.3e-05,6.1e-05,3.8e-05,3.3e-05,4.6e-05,9e-06,3e-05,2.2e-05,5.1e-05,4.2e-05,6.4e-05,5.1e-05,1.6e-05,1.6e-05,6.9e-05,7.3e-05,4.1e-05,2.7e-05,8e-06,4.3e-05,7e-05,0.000102,3.5e-05,8.3e-05,0.000125,9.8e-05,8.5e-05,2.2e-05,5.3e-05,8.1e-05,4.1e-05,3.3e-05,8.8e-05,4.2e-05,9.7e-05,3.7e-05,7.3e-05,4.2e-05,4.1e-05,6.1e-05,4.4e-05,3.7e-05,6.5e-05,4.1e-05,5.4e-05,7.4e-05,6.4e-05,6.6e-05,8.3e-05,5.6e-05,2.5e-05,7.6e-05,3.3e-05,5.6e-05,2e-05,3.1e-05,6.3e-05,3.7e-05,7.1e-05,2.3e-05,5.6e-05,4.2e-05,3.5e-05,3.2e-05,4e-05,3e-05,3.6e-05,6.6e-05,5.6e-05,5.4e-05,2.7e-05,5.6e-05,5.9e-05,3.2e-05,4.8e-05,5.6e-05,3.6e-05,1.4e-05,1.9e-05,1.1e-05,2.8e-05,1.2e-05,4.3e-05,3e-05,2.8e-05,4e-05,5.8e-05,7.7e-05,3.8e-05,5.1e-05,3.8e-05,1.2e-05,2.9e-05,4.4e-05
6e-05,5.6e-05,1.6e-05,4.1e-05,7.9e-05,0.000128,0.000123,8.1e-05,5.2e-05,2.2e-05,6.5e-05,8e-06,3.6e-05,4.2e-05,4.9e-05,6.3e-05,6e-06,2.5e-05,7.7e-05,0.000117,6e-05,2.5e-05,3.3e-05,2.7e-05,7.6e-05,6.8e-05,2.2e-05,0.000113,9.4e-05,5.3e-05,6.5e-05,2.6e-05,2.8e-05,1.8e-05,4.4e-05,8.2e-05,6.9e-05,6.2e-05,4.8e-05,3.9e-05,6.3e-05,5.1e-05,7.5e-05,6.6e-05,7.9e-05,5e-05,4.3e-05,9.6e-05,4.8e-05,6.9e-05,4.8e-05,3.8e-05,8.6e-05,5.6e-05,5.3e-05,6e-05,2.4e-05,3.2e-05,4e-05,7.9e-05,7.3e-05,5e-05,9e-05,7.2e-05,0.000113,8e-05,7.5e-05,2.8e-05,5.6e-05,2.8e-05,4e-05,9e-06,3.4e-05,2.2e-05,9e-05,8.5e-05,9.9e-05,3.4e-05,7.7e-05,6.6e-05,3.5e-05,5.1e-05,5.2e-05,6.4e-05,7.5e-05,6.1e-05,3.4e-05,4.2e-05,4e-06,4.6e-05,2.7e-05,8.3e-05,6.2e-05,2.9e-05,4.7e-05,5.5e-05,1.8e-05,9e-06,4.9e-05,6.5e-05,2.4e-05,5.6e-05,4.2e-05,2.3e-05,2.4e-05,4.1e-05,4.8e-05,4.2e-05,2e-05,1.8e-05,1.6e-05,3.5e-05,5.7e-05,7.3e-05,3e-05,4.1e-05,3e-06,7e-05,6.6e-05,8.1e-05,2.2e-05
1.6e-05,5.8e-05,3.5e-05,5.4e-05,9.1e-05,0.000122,1.4e-05,8.4e-05,0.000136,0.000111,7.3e-05,2.6e-05,6e-05,5.6e-05,7.9e-05,0.000124,6.7e-05,7.4e-05,9.5e-05,9.8e-05,8e-05,5e-05,6.9e-05,4.6e-05,4.4e-05,6.9e-05,7.5e-05,7.9e-05,0.000109,7.4e-05,3.9e-05,5.4e-05,6.8e-05,7.5e-05,6.8e-05,6.8e-05,5e-05,3.7e-05,4.9e-05,3e-05,6.4e-05,7.5e-05,7.3e-05,8.2e-05,2.9e-05,9.1e-05,8.7e-05,6.1e-05,5.4e-05,4e-05,3.5e-05,1.8e-05,4.7e-05,5.9e-05,7.1e-05,5.6e-05,5.8e-05,4.1e-05,5e-05,4e-05,2.4e-05,4.6e-05,1.3e-05,4.6e-05,0.000126,7.1e-05,2.6e-05,7.4e-05,9.5e-05,8.8e-05,4e-06,3.1e-05,6e-06,2.8e-05,6.4e-05,3.5e-05,0.00012,0.000108,4.3e-05,3.1e-05,3.1e-05,5.4e-05,7.7e-05,0.000109,9.5e-05,5.8e-05,5.4e-05,4.2e-05,1.2e-05,7.3e-05,3.5e-05,7e-05,4.7e-05,5.2e-05,6e-05,7.5e-05,8.7e-05,6.3e-05,2.7e-05,2.8e-05,4.3e-05,5e-05,5.3e-05,6.8e-05,0.000101,2.9e-05,4.5e-05,5.4e-05,2.4e-05,6.1e-05,1.1e-05,4.3e-05,1.4e-05,3e-05,8e-05,3.1e-05,2.3e-05,8.3e-05,3e-05,6.8e-05,6e-06
9.9e-05,7.3e-05,8.3e-05,1.9e-05,5.5e-05,2.5e-05,0.000101,1.4e-05,5.9e-05,3.4e-05,1.9e-05,3.9e-05,5.8e-05,4.2e-05,8.7e-05,1.5e-05,3.4e-05,3.5e-05,7.7e-05,3.7e-05,4.7e-05,4.7e-05,9.8e-05,4.2e-05,4.1e-05,2.2e-05,5.1e-05,4.8e-05,5.8e-05,5.4e-05,1e-04,7.2e-05,2.8e-05,4.2e-05,5.5e-05,6.4e-05,8e-06,7e-06,2.8e-05,7.3e-05,6.6e-05,0.000122,7.9e-05,2.8e-05,5.2e-05,5.4e-05,1.7e-05,3.5e-05,9.4e-05,7e-05,6.1e-05,0.000121,3.3e-05,6.7e-05,3.2e-05,5.2e-05,2.7e-05,5e-05,2.3e-05,4.1e-05,1.7e-05,2.5e-05,3.5e-05,5.7e-05,6.8e-05,5.2e-05,1.2e-05,4.4e-05,7.6e-05,1.2e-05,3.8e-05,6.9e-05,6.6e-05,6.4e-05,2.5e-05,2.6e-05,9e-05,4.4e-05,5.3e-05,8.4e-05,6.6e-05,1.1e-05,4.9e-05,3.1e-05,2.7e-05,3.5e-05,8.4e-05,4.7e-05,2.4e-05,7.4e-05,5.7e-05,3.2e-05,3.6e-05,2.8e-05,3.2e-05,2.2e-05,7.7e-05,4.3e-05,6e-06,2.4e-05,6.4e-05,6.1e-05,4.4e-05,2.6e-05,9e-05,0.000106,6e-05,4.5e-05,1.7e-05,0.000101,9.9e-05,7.2e-05,4.6e-05,2.2e-05,6.5e-05,1.9e-05,1.4e-05,6.7e-05,5.1e-05,8.7e-05,6.7e-05
0.00011,0.000105,1.1e-05,8.4e-05,0.000102,7.5e-05,0.000132,0.000122,0.000122,0.000109,8.9e-05,5.3e-05,7e-05,3.3e-05,8.1e-05,7.6e-05,0.000105,6.4e-05,6.4e-05,7.1e-05,6.6e-05,7.1e-05,1.6e-05,6.4e-05,0.000116,0.000117,1.1e-05,7.5e-05,6.4e-05,3.8e-05,6.4e-05,1.4e-05,5.8e-05,6.5e-05,0.000106,4.4e-05,8.7e-05,3.7e-05,7e-06,0.000108,0.000104,5.1e-05,8.6e-05,4.9e-05,6.8e-05,0.000101,9.9e-05,8.8e-05,8.8e-05,7.3e-05,0.000106,0.000133,7.9e-05,0.000153,0.00014,0.000132,0.000118,3.9e-05,3.2e-05,3.3e-05,3.1e-05,9.8e-05,0.000114,4.6e-05,5.7e-05,8e-05,3.2e-05,2.7e-05,5.4e-05,5.9e-05,1e-06,7.9e-05,9.6e-05,0.000102,7.9e-05,2.2e-05,4.3e-05,2.8e-05,2.9e-05,5.5e-05,8.7e-05,9.2e-05,4.8e-05,6.4e-05,8e-05,3.7e-05,0.00011,0.000171,9.1e-05,7.4e-05,9e-05,8.9e-05,6.7e-05,6e-05,6.1e-05,3.7e-05,6.7e-05,7.4e-05,7e-05,3.7e-05,6.1e-05,1.8e-05,3.1e-05,4.7e-05,6.8e-05,0.000102,7.8e-05,6.5e-05,6.9e-05,0.000129,0.000143,7.9e-05,4.8e-05,2.4e-05,2e-05,4.3e-05,3.1e-05,1e-05,1.4e-05,7e-05,0.000118
6e-06,7.8e-05,8.6e-05,2.5e-05,2.1e-05,4.2e-05,7.1e-05,1.9e-05,0.000121,6.9e-05,1.9e-05,4.2e-05,0.000131,6e-05,5.8e-05,5.2e-05,8.8e-05,0.000101,7.3e-05,0.000121,5.1e-05,4.7e-05,4.7e-05,6.2e-05,0.000112,7.3e-05,7e-05,3.5e-05,4.3e-05,6.8e-05,9.2e-05,7.9e-05,7.9e-05,3.2e-05,5.9e-05,0.000134,0.000111,9.9e-05,6.1e-05,9.2e-05,9.9e-05,6.2e-05,5.1e-05,2.8e-05,6e-05,8.6e-05,5.3e-05,9.8e-05,6.2e-05,6.4e-05,6.8e-05,0.000123,9.5e-05,0.000146,0.000151,3.1e-05,6.2e-05,2.3e-05,5.9e-05,8e-05,3.4e-05,0.000103,3e-05,4.6e-05,6.8e-05,9.2e-05,7.6e-05,7.1e-05,4.1e-05,5.4e-05,6.8e-05,6.9e-05,7.9e-05,3.1e-05,4e-05,5.9e-05,3e-05,6.4e-05,2.1e-05,5.4e-05,6.9e-05,2.3e-05,5.1e-05,3.6e-05,4e-05,0.000103,8.8e-05,7.5e-05,5.3e-05,2.7e-05,4e-05,5.1e-05,6e-05,3.2e-05,3.4e-05,2.8e-05,5e-05,2.1e-05,6e-05,4e-05,2.1e-05,4.3e-05,1.3e-05,1.9e-05,7.2e-05,1.2e-05,6.8e-05,9.7e-05,7.3e-05,5e-05,4.7e-05,2e-06,4.2e-05,5.7e-05,4.3e-05,6.4e-05,2.3e-05,3.5e-05,2.8e-05,5.3e-05,6.8e-05
1.2e-05,6.9e-05,7e-05,6.6e-05,6.9e-05,1.6e-05,4.5e-05,6.5e-05,6.1e-05,4.9e-05,4e-05,6e-05,0.000108,8.3e-05,9e-05,3.2e-05,1.4e-05,8.2e-05,8.8e-05,7.9e-05,5.5e-05,1.8e-05,2.1e-05,2.7e-05,7.4e-05,9e-05,3.4e-05,2.9e-05,7.4e-05,5.2e-05,4.3e-05,2.2e-05,5.7e-05,2.9e-05,2.6e-05,5.5e-05,1.8e-05,6.8e-05,2.6e-05,6.4e-05,0.000123,4e-05,2.7e-05,5.9e-05,4.4e-05,5.4e-05,8.1e-05,4.3e-05,3.3e-05,7.2e-05,2.3e-05,5.8e-05,4.3e-05,8.1e-05,4.3e-05,1.2e-05,2.9e-05,4.7e-05,4.9e-05,3.4e-05,3e-05,6.5e-05,4.9e-05,7.7e-05,1.9e-05,5.8e-05,3.3e-05,8.3e-05,5.3e-05,4.7e-05,1.9e-05,2.9e-05,7.2e-05,2.5e-05,2.7e-05,4.5e-05,1.1e-05,6.8e-05,5.7e-05,6.4e-05,2.8e-05,5.8e-05,1.2e-05,3e-05,4.1e-05,9.7e-05,5.3e-05,6.8e-05,5.1e-05,2.5e-05,4.2e-05,7.7e-05,4.4e-05,2.1e-05,1.1e-05,2.1e-05,1.4e-05,3.5e-05,1.7e-05,2.6e-05,2.5e-05,4.1e-05,3.3e-05,2.5e-05,2.8e-05,3.2e-05,5.5e-05,3.7e-05,3.6e-05,4.9e-05,7e-06,3.4e-05,6.3e-05,3.8e-05,2.2e-05,3.9e-05,5e-06,3.3e-05,9e-06,3.2e-05,1.1e-05
3.5e-05,2.1e-05,2.5e-05,1.2e-05,2.2e-05,1.9e-05,1.6e-05,4.6e-05,2e-05,3.1e-05,3.2e-05,5e-06,5.4e-05,4.3e-05,1.6e-05,4.3e-05,2.7e-05,6.7e-05,8.4e-05,1.1e-05,4.1e-05,4e-05,1.2e-05,3.8e-05,2.9e-05,2.2e-05,8e-06,1.9e-05,3.7e-05,1.3e-05,4.4e-05,4.1e-05,6.2e-05,2.4e-05,3e-05,3.8e-05,3.8e-05,5.7e-05,3e-05,4.7e-05,4.2e-05,3.6e-05,1.7e-05,3.6e-05,5.2e-05,2.7e-05,4.9e-05,4.8e-05,4.6e-05,7.9e-05,3.2e-05,3.2e-05,8e-06,5.8e-05,2e-05,4.8e-05,1.2e-05,3.4e-05,1.3e-05,2.6e-05,1.5e-05,1.7e-05,3.9e-05,3.2e-05,4.1e-05,3.9e-05,4.9e-05,3.2e-05,1.4e-05,3.8e-05,3.8e-05,2.8e-05,3.4e-05,2.6e-05,4.6e-05,1.2e-05,9e-06,5.5e-05,4.8e-05,4.6e-05,1.5e-05,1.7e-05,1.1e-05,9e-06,2.4e-05,3.7e-05,3.2e-05,7e-05,4.9e-05,2.6e-05,1.8e-05,1.5e-05,2.6e-05,1.9e-05,2.8e-05,2.6e-05,2.2e-05,2.9e-05,2e-05,2.9e-05,2.2e-05,1e-05,2.7e-05,1.5e-05,1.6e-05,1.4e-05,4.2e-05,2.9e-05,2.3e-05,1.8e-05,2e-05,3e-05,8e-06,1.4e-05,1.3e-05,3.6e-05,1.8e-05,2.9e-05,1.2e-05,2.2e-05,2.2e-05
4.7e-05,3.6e-05,1e-05,2.5e-05,2.8e-05,2.7e-05,1.3e-05,2.6e-05,1.7e-05,3.1e-05,2.9e-05,2.4e-05,5.1e-05,1.4e-05,2e-05,2.1e-05,1.4e-05,2.3e-05,2.4e-05,3.5e-05,4.1e-05,1.1e-05,2.2e-05,4.3e-05,1.2e-05,1.9e-05,1.8e-05,1.5e-05,3.8e-05,3.5e-05,6e-06,9e-06,5.6e-05,2.1e-05,3.3e-05,3.4e-05,2.1e-05,4e-06,2.4e-05,2.7e-05,5.9e-05,3.6e-05,1.5e-05,3.1e-05,2.7e-05,2.8e-05,5e-05,3.1e-05,4e-06,2.4e-05,2.5e-05,3e-06,1e-05,5.3e-05,1.4e-05,4.6e-05,2.4e-05,3e-05,8e-06,1.9e-05,2.7e-05,3.4e-05,2e-05,3.1e-05,2.4e-05,3.1e-05,3.4e-05,6e-06,2.3e-05,3.5e-05,2.3e-05,3.7e-05,7e-06,1.7e-05,3.1e-05,8e-06,1.7e-05,2.6e-05,1.9e-05,2.5e-05,1.9e-05,1.6e-05,6e-06,1.6e-05,3e-05,2.7e-05,2.1e-05,3.2e-05,2.2e-05,2.4e-05,8e-06,1.9e-05,3e-06,6e-06,2.9e-05,1.6e-05,2.4e-05,2.6e-05,1e-05,1.1e-05,2.4e-05,1.5e-05,1e-05,4e-06,1.2e-05,1.2e-05,2e-05,1.7e-05,1.9e-05,1.9e-05,2.3e-05,2.2e-05,3.5e-05,1e-05,2e-05,7e-06,1.3e-05,8e-06,5e-06,2.6e-05,5e-06
1.8e-05,5e-06,1.1e-05,4e-06,9e-06,4e-06,5e-06,5e-06,1.6e-05,4e-06,1.2e-05,2e-06,1.6e-05,8e-06,4e-06,1e-06,5e-06,6e-06,6e-06,1.9e-05,6e-06,1.9e-05,1.3e-05,2.2e-05,1.4e-05,5e-06,1e-05,1.8e-05,1e-05,1.2e-05,1.2e-05,6e-06,1.4e-05,7e-06,1.1e-05,2.3e-05,5e-06,1.1e-05,5e-06,1e-05,1.7e-05,6e-06,7e-06,1e-05,1.2e-05,1.5e-05,2.5e-05,4e-06,8e-06,7e-06,2e-06,7e-06,1.1e-05,1.7e-05,1e-05,1.2e-05,1.3e-05,1.4e-05,1.2e-05,1.4e-05,7e-06,2e-05,1.7e-05,5e-06,6e-06,2e-06,2e-05,7e-06,6e-06,9e-06,1.3e-05,4e-06,1.7e-05,1.2e-05,4e-06,1e-05,6e-06,1.3e-05,4e-06,1.4e-05,5e-06,9e-06,1.2e-05,1.2e-05,9e-06,5e-06,3e-06,7e-06,1.4e-05,4e-06,2e-06,1.2e-05,3e-06,5e-06,1.3e-05,8e-06,8e-06,6e-06,1.3e-05,8e-06,9e-06,4e-06,5e-06,4e-06,9e-06,2e-06,9e-06,3e-06,1e-05,5e-06,6e-06,2e-06,8e-06,5e-06,1.7e-05,6e-06,4e-06,1e-05,6e-06,9e-06,8e-06
2.5e-05,2.5e-05,1.5e-05,9e-06,6e-06,1.1e-05,5e-06,1.4e-05,1.7e-05,1e-06,1e-05,8e-06,1e-06,6e-06,4e-06,6e-06,1.1e-05,3e-06,1.5e-05,4e-06,9e-06,1.3e-05,8e-06,7e-06,9e-06,1.1e-05,1.6e-05,8e-06,1.6e-05,8e-06,1e-05,6e-06,1.1e-05,1.7e-05,1.3e-05,1.1e-05,7e-06,1e-05,5e-06,6e-06,1.1e-05,6e-06,6e-06,1.3e-05,7e-06,2.1e-05,1.4e-05,9e-06,9e-06,2e-06,6e-06,1.4e-05,9e-06,1.6e-05,3e-06,6e-06,1.2e-05,8e-06,5e-06,8e-06,1.4e-05,1.2e-05,8e-06,3e-06,1e-05,1.2e-05,1.9e-05,1e-05,2e-05,1.1e-05,1.4e-05,4e-06,1.3e-05,2.2e-05,1.7e-05,1.2e-05,8e-06,1.3e-05,1.3e-05,1.6e-05,2e-06,1e-05,1e-05,1.1e-05,8e-06,1e-06,7e-06,9e-06,6e-06,1.5e-05,1e-05,8e-06,7e-06,8e-06,7e-06,7e-06,1.1e-05,6e-06,2e-06,9e-06,8e-06,3e-06,6e-06,8e-06,3e-06,7e-06,6e-06,4e-06,4e-06,2e-06,9e-06,9e-06,7e-06,5e-06,8e-06,1.1e-05,9e-06,1.4e-05,3e-06,3e-06,7e-06
1.2e-05,3e-06,6e-06,2e-06,1.7e-05,7e-06,4e-06,1.6e-05,6e-06,1.8e-05,1.4e-05,7e-06,6e-06,8e-06,7e-06,1e-05,1e-05,1.3e-05,1.3e-05,1e-06,2e-06,3e-06,2.1e-05,2.2e-05,1.1e-05,8e-06,2e-05,2.3e-05,1.7e-05,1.2e-05,5e-06,1e-06,1.2e-05,5e-06,5e-06,5e-06,1.3e-05,1.2e-05,1.6e-05,5e-06,1.6e-05,9e-06,1.3e-05,1.5e-05,1.9e-05,2.3e-05,1.5e-05,2e-06,7e-06,8e-06,1.1e-05,7e-06,1.5e-05,1.4e-05,9e-06,2e-06,2e-05,1.7e-05,7e-06,5e-06,1.1e-05,1.9e-05,9e-06,1e-05,1.4e-05,1.7e-05,6e-06,1.2e-05,2e-05,9e-06,7e-06,1.1e-05,5e-06,1.1e-05,1e-06,2e-06,4e-06,2.2e-05,7e-06,9e-06,1.3e-05,1.4e-05,6e-06,1.2e-05,5e-06,6e-06,1e-05,1.1e-05,7e-06,1.7e-05,1e-05,1e-05,4e-06,9e-06,9e-06,2e-06,2e-06,5e-06,1.4e-05,1.7e-05,1.1e-05,6e-06,4e-06,3e-06,1e-06,4e-06,1.3e-05,3e-06,7e-06,3e-06,1.2e-05,3e-06,1.3e-05,6e-06,1e-05,1.1e-05,1.6e-05,1.3e-05,1.3e-05,8e-06,1.1e-05
1.1e-05,9e-06,6e-06,1e-05,2.4e-05,1.8e-05,1e-05,6e-06,4e-06,1e-05,1e-06,6e-06,1.3e-05,9e-06,5e-06,5e-06,6e-06,1.3e-05,1.5e-05,1.3e-05,2e-06,5e-06,2.1e-05,1.3e-05,1.4e-05,7e-06,1.5e-05,4e-06,1.8e-05,1.5e-05,4e-06,4e-06,6e-06,1e-06,6e-06,3e-06,7e-06,8e-06,2.3e-05,2.2e-05,2.2e-05,2.1e-05,1e-06,9e-06,5e-06,7e-06,2.4e-05,1.2e-05,5e-06,1.2e-05,6e-06,7e-06,2e-06,1.8e-05,1e-05,1.1e-05,2.1e-05,2e-06,1.6e-05,1.1e-05,1.2e-05,2.2e-05,7e-06,9e-06,9e-06,4e-06,8e-06,1.2e-05,1.7e-05,1e-05,9e-06,2e-06,4e-06,4e-06,4e-06,9e-06,6e-06,2.4e-05,1.8e-05,8e-06,1.4e-05,9e-06,4e-06,3e-06,8e-06,7e-06,4e-06,5e-06,5e-06,1.1e-05,6e-06,8e-06,3e-06,8e-06,9e-06,7e-06,4e-06,5e-06,1.3e-05,1.1e-05,1.6e-05,1.3e-05,5e-06,3e-06,8e-06,8e-06,1.1e-05,1e-05,7e-06,2e-06,9e-06,1.3e-05,1.2e-05,6e-06,7e-06,7e-06,6e-06,9e-06,1e-05,3e-06,1.1e-05
4e-06,5e-06,6e-06,1.7e-05,8e-06,1.2e-05,8e-06,1.9e-05,6e-06,3e-06,4e-06,1.2e-05,1.6e-05,3e-06,9e-06,3e-06,6e-06,1.7e-05,1.7e-05,1e-05,7e-06,1e-05,9e-06,2e-06,9e-06,2e-06,4e-06,7e-06,7e-06,2e-05,1.3e-05,5e-06,1.4e-05,4e-06,1e-05,9e-06,6e-06,5e-06,1.5e-05,1.6e-05,1.2e-05,1.8e-05,1.5e-05,9e-06,3e-06,1e-06,1.5e-05,1.5e-05,1.9e-05,2.5e-05,2.4e-05,2e-06,2e-06,7e-06,4e-06,7e-06,9e-06,1e-05,1.6e-05,2e-06,7e-06,5e-06,1.8e-05,7e-06,8e-06,5e-06,1.1e-05,1.2e-05,1.4e-05,1.9e-05,3e-06,4e-06,1e-05,2e-06,4e-06,3e-06,1.4e-05,1.1e-05,1.2e-05,1.3e-05,4e-06,1.2e-05,1.4e-05,1.8e-05,1e-05,7e-06,1.3e-05,1.1e-05,0,3e-06,1.5e-05,1.4e-05,1.4e-05,6e-06,1.7e-05,2e-06,6e-06,4e-06,2e-06,1.3e-05,1.1e-05,3e-06,7e-06,7e-06,5e-06,5e-06,2e-06,5e-06,9e-06,6e-06,1.3e-05,9e-06,5e-06,5e-06,2e-06,6e-06,5e-06,3e-06,6e-06,1.7e-05,7e-06
5e-06,4e-06,3e-06,2.4e-05,2.8e-05,8e-06,1.3e-05,9e-06,1.3e-05,1e-05,1.5e-05,2e-05,2.7e-05,2e-05,9e-06,1e-05,1.4e-05,2e-06,1.8e-05,2e-06,1.2e-05,5e-06,4e-06,6e-06,1.4e-05,1.6e-05,1.2e-05,1.2e-05,3e-06,1e-05,3e-06,1.1e-05,4e-06,2e-06,1.7e-05,1.7e-05,6e-06,3e-06,1.6e-05,7e-06,1.3e-05,1.7e-05,1.3e-05,1.3e-05,1.1e-05,9e-06,1.6e-05,1.1e-05,5e-06,1e-05,1.7e-05,1.9e-05,1e-05,2e-06,7e-06,6e-06,2e-06,3e-06,1.1e-05,1.1e-05,7e-06,6e-06,1.6e-05,1.3e-05,1.5e-05,1.3e-05,3e-06,7e-06,4e-06,6e-06,1.3e-05,1.1e-05,3e-06,9e-06,7e-06,1e-05,1.4e-05,2.5e-05,5e-06,5e-06,1.1e-05,6e-06,1.7e-05,5e-06,9e-06,2.1e-05,1.2e-05,4e-06,6e-06,4e-06,1.5e-05,6e-06,1.1e-05,8e-06,9e-06,1.3e-05,1.1e-05,5e-06,6e-06,9e-06,4e-06,1.1e-05,1.3e-05,7e-06,2e-06,5e-06,5e-06,9e-06,3e-06,2e-06,9e-06,7e-06,1.7e-05,1.1e-05,5e-06,1.1e-05,1e-06,5e-06,3e-06,1.6e-05,1.2e-05
8e-06,3e-06,1e-06,1.7e-05,1.8e-05,2.7e-05,1.5e-05,1.5e-05,1.1e-05,1e-05,1.2e-05,1.3e-05,1.3e-05,6e-06,9e-06,9e-06,7e-06,1e-06,1.8e-05,1.7e-05,1.9e-05,1.7e-05,8e-06,1.2e-05,1.3e-05,2e-06,9e-06,4e-06,8e-06,9e-06,7e-06,7e-06,4e-06,6e-06,1.2e-05,7e-06,6e-06,6e-06,1.6e-05,2.2e-05,1.6e-05,8e-06,9e-06,3e-06,3e-06,5e-06,2.4e-05,7e-06,5e-06,3e-06,1e-05,3e-06,1e-05,1.3e-05,8e-06,1.6e-05,1.6e-05,4e-06,8e-06,6e-06,1.6e-05,1.5e-05,2.1e-05,1.3e-05,2e-06,8e-06,6e-06,1.3e-05,7e-06,4e-06,6e-06,3e-06,9e-06,1.1e-05,9e-06,7e-06,3e-06,1.2e-05,3e-06,7e-06,4e-06,6e-06,1e-05,6e-06,7e-06,1e-05,7e-06,8e-06,1e-05,5e-06,4e-06,2e-06,7e-06,1.1e-05,9e-06,1.1e-05,5e-06,6e-06,4e-06,3e-06,3e-06,7e-06,7e-06,7e-06,1e-06,3e-06,9e-06,4e-06,2e-06,3e-06,9e-06,8e-06,8e-06,9e-06,1e-05,1.4e-05,1.4e-05,7e-06,7e-06,6e-06,6e-06
0,5e-06,7e-06,1.1e-05,6e-06,1.3e-05,2e-06,7e-06,4e-06,1.8e-05,2e-06,9e-06,6e-06,1e-05,8e-06,3e-06,3e-06,6e-06,8e-06,3e-06,9e-06,4e-06,3e-06,1.2e-05,8e-06,8e-06,3e-06,2e-06,5e-06,5e-06,5e-06,3e-06,1.1e-05,5e-06,3e-06,1.3e-05,8e-06,1.2e-05,6e-06,1.3e-05,1.3e-05,7e-06,1.1e-05,6e-06,8e-06,1.1e-05,1.8e-05,1.3e-05,2e-06,7e-06,8e-06,1e-05,4e-06,9e-06,8e-06,8e-06,6e-06,6e-06,1e-06,1.2e-05,1e-05,2e-06,9e-06,5e-06,2e-06,8e-06,1.1e-05,2e-06,9e-06,5e-06,7e-06,1e-05,1e-05,5e-06,5e-06,1.2e-05,1e-05,1.1e-05,3e-06,5e-06,5e-06,1.1e-05,1.3e-05,5e-06,2e-06,5e-06,3e-06,1e-05,1.2e-05,1.1e-05,2e-06,5e-06,4e-06,4e-06,4e-06,2e-06,7e-06,3e-06,5e-06,9e-06,3e-06,4e-06,8e-06,3e-06,6e-06,4e-06,4e-06,5e-06,6e-06,5e-06,1.7e-05,6e-06,7e-06,7e-06,1e-05,2e-06,6e-06,5e-06,7e-06,9e-06,1.1e-05
4e-06,6e-06,8e-06,1.3e-05,6e-06,7e-06,8e-06,8e-06,3e-06,1.5e-05,1.1e-05,8e-06,9e-06,2e-06,6e-06,6e-06,5e-06,5e-06,3e-06,4e-06,3e-06,9e-06,1.2e-05,1e-05,1e-05,6e-06,4e-06,1.3e-05,1.3e-05,2e-06,7e-06,8e-06,1.5e-05,1e-05,6e-06,1.4e-05,4e-06,2e-06,5e-06,1.3e-05,7e-06,5e-06,9e-06,7e-06,6e-06,8e-06,7e-06,4e-06,4e-06,7e-06,3e-06,4e-06,1e-05,1.1e-05,1e-05,1.1e-05,9e-06,4e-06,3e-06,1.4e-05,1.6e-05,8e-06,4e-06,2e-06,8e-06,1.1e-05,5e-06,4e-06,6e-06,5e-06,3e-06,6e-06,1e-05,9e-06,3e-06,6e-06,5e-06,6e-06,8e-06,4e-06,8e-06,6e-06,7e-06,1.3e-05,9e-06,1.1e-05,3e-06,8e-06,6e-06,7e-06,8e-06,4e-06,4e-06,0,4e-06,5e-06,4e-06,4e-06,2e-06,9e-06,1e-06,4e-06,2e-06,1.1e-05,1.2e-05,3e-06,4e-06,3e-06,1e-06,8e-06,7e-06,5e-06,4e-06,3e-06,6e-06,4e-06,1.2e-05,8e-06,5e-06,3e-06,1.1e-05
5e-06,8e-06,2e-06,1e-05,1.7e-05,9e-06,3e-06,3e-06,1.2e-05,1.1e-05,1e-05,1e-06,7e-06,4e-06,9e-06,1e-06,1e-05,3e-06,5e-06,3e-06,4e-06,8e-06,1.1e-05,1.2e-05,1.1e-05,5e-06,5e-06,1.3e-05,8e-06,7e-06,3e-06,7e-06,2e-06,3e-06,1e-05,8e-06,1e-06,5e-06,3e-06,1e-05,1.2e-05,2e-06,9e-06,2e-06,3e-06,1.2e-05,8e-06,0,6e-06,9e-06,5e-06,7e-06,7e-06,7e-06,5e-06,7e-06,6e-06,4e-06,8e-06,5e-06,1e-05,1.2e-05,8e-06,1e-06,1e-05,5e-06,9e-06,4e-06,3e-06,5e-06,1.2e-05,7e-06,1e-05,4e-06,5e-06,4e-06,6e-06,1.1e-05,1e-05,5e-06,8e-06,4e-06,1e-05,1.1e-05,8e-06,5e-06,8e-06,3e-06,6e-06,1.3e-05,7e-06,7e-06,3e-06,4e-06,3e-06,2e-06,4e-06,3e-06,5e-06,5e-06,4e-06,4e-06,6e-06,1.3e-05,3e-06,4e-06,8e-06,5e-06,4e-06,8e-06,9e-06,3e-06,5e-06,4e-06,2e-06,5e-06,1e-05,1.4e-05,7e-06,2e-06,6e-06
6e-06,1e-05,7e-06,3e-06,1.1e-05,1.3e-05,3e-06,0,9e-06,8e-06,4e-06,8e-06,1e-05,8e-06,3e-06,6e-06,8e-06,1.4e-05,1.5e-05,1.1e-05,8e-06,1.1e-05,9e-06,1e-06,7e-06,5e-06,2e-06,1e-05,1.1e-05,1.2e-05,7e-06,4e-06,9e-06,5e-06,6e-06,1.7e-05,7e-06,5e-06,1.3e-05,1.4e-05,4e-06,7e-06,1e-05,2e-06,2e-06,7e-06,6e-06,1e-06,1e-05,9e-06,2e-06,8e-06,1.2e-05,1.3e-05,7e-06,1e-05,1.7e-05,1e-05,4e-06,5e-06,9e-06,8e-06,7e-06,8e-06,4e-06,5e-06,7e-06,1.1e-05,1.2e-05,5e-06,1.3e-05,1.3e-05,1.2e-05,3e-06,5e-06,1e-06,4e-06,1.3e-05,8e-06,1.1e-05,5e-06,2e-06,4e-06,7e-06,5e-06,5e-06,5e-06,9e-06,1e-05,1.3e-05,9e-06,6e-06,3e-06,6e-06,7e-06,1e-06,3e-06,2e-06,3e-06,5e-06,1e-06,4e-06,8e-06,7e-06,8e-06,5e-06,6e-06,5e-06,7e-06,2e-06,5e-06,6e-06,1e-06,9e-06,2e-06,4e-06,9e-06,2e-06,5e-06,6e-06,8e-06
4e-06,1.1e-05,6e-06,5e-06,1.2e-05,1.8e-05,1.2e-05,7e-06,4e-06,1.5e-05,7e-06,9e-06,1.4e-05,4e-06,2e-06,8e-06,8e-06,1.3e-05,5e-06,5e-06,1e-05,4e-06,8e-06,5e-06,2e-06,9e-06,5e-06,4e-06,1e-06,7e-06,9e-06,8e-06,1.8e-05,8e-06,1.1e-05,9e-06,2e-06,1e-06,9e-06,4e-06,1.2e-05,1.4e-05,1.3e-05,7e-06,6e-06,4e-06,1.4e-05,7e-06,7e-06,1e-05,1.3e-05,5e-06,5e-06,8e-06,1.8e-05,1.6e-05,1.7e-05,1e-05,6e-06,1.4e-05,7e-06,1.4e-05,1.1e-05,7e-06,1e-06,1e-06,1.4e-05,1.2e-05,2e-06,4e-06,1.3e-05,1.3e-05,2e-06,6e-06,6e-06,6e-06,4e-06,1e-05,5e-06,9e-06,4e-06,4e-06,7e-06,9e-06,7e-06,2e-06,4e-06,1.2e-05,8e-06,1.1e-05,3e-06,5e-06,1e-06,7e-06,4e-06,4e-06,5e-06,3e-06,1e-05,8e-06,1.1e-05,2e-06,1.2e-05,8e-06,6e-06,4e-06,6e-06,2e-06,5e-06,2e-06,5e-06,6e-06,1.1e-05,3e-06,1e-06,5e-06,5e-06,4e-06,8e-06,7e-06,5e-06
5e-06,1e-05,5e-06,5e-06,1.3e-05,8e-06,3e-06,5e-06,5e-06,9e-06,8e-06,4e-06,7e-06,9e-06,5e-06,4e-06,8e-06,1e-06,7e-06,5e-06,1e-05,9e-06,8e-06,7e-06,6e-06,7e-06,8e-06,6e-06,6e-06,5e-06,8e-06,4e-06,1.4e-05,6e-06,9e-06,9e-06,6e-06,3e-06,1e-06,8e-06,4e-06,6e-06,2e-06,6e-06,9e-06,9e-06,8e-06,5e-06,5e-06,2e-06,5e-06,7e-06,1e-05,3e-06,1.3e-05,5e-06,5e-06,3e-06,5e-06,3e-06,8e-06,1.5e-05,7e-06,6e-06,6e-06,7e-06,1.1e-05,1.3e-05,3e-06,2e-06,1.1e-05,5e-06,7e-06,3e-06,2e-06,2e-06,7e-06,1.2e-05,9e-06,7e-06,4e-06,9e-06,1e-06,5e-06,2e-06,2e-06,3e-06,8e-06,5e-06,4e-06,3e-06,2e-06,2e-06,7e-06,9e-06,6e-06,7e-06,2e-06,6e-06,6e-06,3e-06,6e-06,6e-06,5e-06,8e-06,5e-06,7e-06,5e-06,5e-06,5e-06,6e-06,4e-06,7e-06,3e-06,2e-06,5e-06,6e-06,7e-06,8e-06,8e-06,6e-06
3e-06,6e-06,4e-06,2e-06,4e-06,1e-06,2e-06,2e-06,3e-06,2e-06,2e-06,4e-06,1e-06,4e-06,4e-06,2e-06,4e-06,4e-06,3e-06,6e-06,3e-06,6e-06,2e-06,3e-06,4e-06,6e-06,3e-06,2e-06,4e-06,3e-06,6e-06,5e-06,8e-06,2e-06,3e-06,9e-06,3e-06,1e-06,3e-06,3e-06,8e-06,3e-06,7e-06,4e-06,3e-06,2e-06,3e-06,1e-06,1e-06,3e-06,2e-06,4e-06,5e-06,3e-06,5e-06,3e-06,2e-06,2e-06,3e-06,4e-06,4e-06,8e-06,1e-06,4e-06,2e-06,5e-06,5e-06,5e-06,2e-06,1e-06,6e-06,6e-06,6e-06,4e-06,2e-06,1e-06,4e-06,5e-06,2e-06,3e-06,4e-06,6e-06,6e-06,3e-06,2e-06,2e-06,2e-06,5e-06,3e-06,2e-06,2e-06,3e-06,3e-06,4e-06,3e-06,4e-06,6e-06,4e-06,1e-06,5e-06,3e-06,4e-06,2e-06,1e-06,8e-06,3e-06,3e-06,4e-06,2e-06,4e-06,1e-06,2e-06,6e-06,4e-06,1e-06,5e-06,4e-06,0,1e-06,6e-06,0
3e-06,1e-06,1e-06,3e-06,4e-06,3e-06,5e-06,2e-06,6e-06,3e-06,4e-06,6e-06,2e-06,1e-06,4e-06,6e-06,5e-06,2e-06,4e-06,1e-06,2e-06,4e-06,5e-06,2e-06,4e-06,2e-06,5e-06,1e-06,3e-06,4e-06,8e-06,0,1.2e-05,1e-06,6e-06,4e-06,3e-06,1e-06,2e-06,3e-06,5e-06,6e-06,5e-06,1e-06,1e-06,3e-06,4e-06,1e-06,3e-06,6e-06,4e-06,2e-06,7e-06,2e-06,3e-06,1e-06,3e-06,2e-06,4e-06,4e-06,4e-06,3e-06,0,3e-06,3e-06,4e-06,6e-06,5e-06,2e-06,1e-06,4e-06,5e-06,9e-06,2e-06,4e-06,4e-06,1e-06,5e-06,2e-06,3e-06,3e-06,4e-06,3e-06,2e-06,6e-06,0,0,6e-06,2e-06,3e-06,6e-06,6e-06,2e-06,3e-06,2e-06,1e-06,5e-06,1e-06,3e-06,5e-06,2e-06,2e-06,3e-06,4e-06,3e-06,1e-06,1e-06,3e-06,3e-06,4e-06,4e-06,2e-06,6e-06,3e-06,2e-06,5e-06,2e-06,0,3e-06,4e-06,1e-06
2e-06,3e-06,2e-06,2e-06,2e-06,5e-06,5e-06,6e-06,9e-06,9e-06,3e-06,3e-06,2e-06,3e-06,6e-06,2e-06,3e-06,5e-06,2e-06,3e-06,2e-06,2e-06,3e-06,1e-06,1e-06,2e-06,2e-06,2e-06,1e-06,5e-06,3e-06,5e-06,8e-06,8e-06,4e-06,9e-06,2e-06,2e-06,6e-06,2e-06,1e-05,6e-06,6e-06,2e-06,3e-06,6e-06,3e-06,3e-06,2e-06,4e-06,4e-06,3e-06,7e-06,6e-06,5e-06,5e-06,6e-06,3e-06,2e-06,5e-06,6e-06,7e-06,2e-06,1e-06,1e-06,2e-06,8e-06,1.1e-05,4e-06,2e-06,3e-06,4e-06,5e-06,5e-06,4e-06,4e-06,2e-06,5e-06,1e-06,5e-06,3e-06,2e-06,2e-06,7e-06,7e-06,5e-06,4e-06,7e-06,3e-06,3e-06,3e-06,5e-06,2e-06,3e-06,1e-06,4e-06,1e-06,5e-06,3e-06,5e-06,4e-06,4e-06,1e-06,4e-06,5e-06,1e-06,1e-06,4e-06,7e-06,2e-06,5e-06,2e-06,6e-06,3e-06,2e-06,2e-06,1e-06,3e-06,4e-06,1e-06,5e-06
1e-06,3e-06,3e-06,3e-06,3e-06,4e-06,0,4e-06,6e-06,6e-06,3e-06,1e-06,2e-06,0,3e-06,4e-06,2e-06,4e-06,2e-06,5e-06,2e-06,3e-06,2e-06,3e-06,3e-06,4e-06,1e-06,2e-06,5e-06,3e-06,6e-06,6e-06,6e-06,5e-06,2e-06,6e-06,4e-06,2e-06,3e-06,5e-06,1.1e-05,5e-06,8e-06,1e-06,2e-06,4e-06,5e-06,1e-06,1e-06,3e-06,5e-06,4e-06,2e-06,4e-06,1e-06,3e-06,2e-06,1e-06,0,3e-06,3e-06,4e-06,2e-06,3e-06,3e-06,2e-06,7e-06,8e-06,2e-06,2e-06,5e-06,4e-06,4e-06,2e-06,2e-06,2e-06,1e-06,5e-06,1e-06,6e-06,2e-06,4e-06,2e-06,6e-06,1e-06,2e-06,3e-06,1e-06,1e-06,2e-06,1e-06,5e-06,2e-06,4e-06,4e-06,2e-06,1e-06,2e-06,2e-06,5e-06,3e-06,2e-06,1e-06,3e-06,2e-06,2e-06,2e-06,2e-06,3e-06,4e-06,6e-06,2e-06,7e-06,1e-06,3e-06,3e-06,1e-06,1e-06,1e-06,3e-06,4e-06
1e-06,2e-06,1e-06,1e-06,2e-06,1e-06,1e-06,3e-06,2e-06,3e-06,2e-06,1e-06,1e-06,1e-06,1e-06,1e-06,1e-06,1e-06,2e-06,3e-06,1e-06,2e-06,2e-06,2e-06,3e-06,4e-06,1e-06,2e-06,3e-06,1e-06,3e-06,1e-06,3e-06,3e-06,1e-06,5e-06,2e-06,3e-06,3e-06,2e-06,7e-06,4e-06,5e-06,1e-06,2e-06,2e-06,4e-06,1e-06,1e-06,1e-06,3e-06,2e-06,2e-06,2e-06,1e-06,3e-06,2e-06,1e-06,1e-06,3e-06,1e-06,2e-06,1e-06,3e-06,1e-06,3e-06,4e-06,6e-06,1e-06,2e-06,3e-06,4e-06,5e-06,2e-06,1e-06,1e-06,2e-06,6e-06,1e-06,5e-06,1e-06,4e-06,2e-06,6e-06,2e-06,1e-06,2e-06,2e-06,1e-06,2e-06,2e-06,4e-06,1e-06,2e-06,3e-06,3e-06,3e-06,1e-06,2e-06,4e-06,2e-06,3e-06,2e-06,0,4e-06,0,2e-06,2e-06,1e-06,1e-06,4e-06,1e-06,6e-06,2e-06,4e-06,3e-06,1e-06,1e-06,1e-06,3e-06,4e-06
1e-06,2e-06,0,1e-06,1e-06,1e-06,1e-06,2e-06,2e-06,3e-06,1e-06,1e-06,1e-06,1e-06,1e-06,2e-06,1e-06,2e-06,1e-06,2e-06,1e-06,1e-06,2e-06,1e-06,3e-06,3e-06,2e-06,2e-06,3e-06,1e-06,2e-06,0,6e-06,3e-06,1e-06,5e-06,2e-06,3e-06,3e-06,1e-06,6e-06,5e-06,6e-06,1e-06,2e-06,2e-06,3e-06,0,1e-06,2e-06,2e-06,2e-06,1e-06,3e-06,2e-06,2e-06,1e-06,1e-06,1e-06,4e-06,2e-06,3e-06,1e-06,3e-06,1e-06,2e-06,5e-06,5e-06,2e-06,1e-06,3e-06,3e-06,6e-06,1e-06,1e-06,1e-06,1e-06,6e-06,1e-06,4e-06,1e-06,3e-06,3e-06,4e-06,1e-06,1e-06,1e-06,3e-06,0,1e-06,2e-06,3e-06,2e-06,1e-06,3e-06,2e-06,3e-06,1e-06,2e-06,3e-06,2e-06,3e-06,2e-06,1e-06,4e-06,0,1e-06,1e-06,1e-06,2e-06,3e-06,0,6e-06,2e-06,3e-06,3e-06,1e-06,1e-06,1e-06,3e-06,3e-06
0,2e-06,1e-06,1e-06,2e-06,1e-06,0,2e-06,1e-06,2e-06,0,0,1e-06,1e-06,2e-06,2e-06,1e-06,2e-06,2e-06,1e-06,1e-06,2e-06,1e-06,1e-06,3e-06,3e-06,1e-06,2e-06,3e-06,1e-06,2e-06,0,5e-06,4e-06,1e-06,5e-06,2e-06,2e-06,3e-06,1e-06,6e-06,3e-06,5e-06,1e-06,2e-06,2e-06,3e-06,1e-06,1e-06,1e-06,1e-06,1e-06,2e-06,2e-06,1e-06,2e-06,2e-06,1e-06,1e-06,3e-06,1e-06,3e-06,1e-06,3e-06,1e-06,1e-06,4e-06,5e-06,2e-06,1e-06,3e-06,3e-06,6e-06,1e-06,1e-06,1e-06,1e-06,7e-06,1e-06,4e-06,0,2e-06,2e-06,4e-06,1e-06,1e-06,1e-06,2e-06,1e-06,1e-06,1e-06,3e-06,1e-06,2e-06,3e-06,2e-06,3e-06,1e-06,1e-06,3e-06,2e-06,2e-06,1e-06,1e-06,3e-06,0,0,1e-06,1e-06,2e-06,3e-06,1e-06,6e-06,1e-06,2e-06,3e-06,0,0,1e-06,2e-06,3e-06
