3e-05,5e-05,1.7e-05,2.3e-05,2.3e-05,1.3e-05,2.2e-05,2.4e-05,4.6e-05,4.2e-05,7.4e-05,4.9e-05,6.1e-05,1.1e-05,0,1e-05,4.7e-05,3.1e-05,3e-06,2.5e-05,9e-06,6e-06,2.2e-05,1.2e-05,1.4e-05,3.5e-05,2e-05,8e-06,1.9e-05,2.4e-05,3e-05,1.2e-05,1.9e-05,6e-06,2e-06,2e-06,3.2e-05,4.4e-05,3.2e-05,9.5e-05,1.8e-05,1e-06,1.8e-05,5e-06,1e-05,1.8e-05,2e-06,2.1e-05,6e-06,8e-06,4.9e-05,8e-06,2e-06,1e-05,4.3e-05,2.5e-05,3.6e-05,5.9e-05,7e-06,4e-05,3e-06,2e-06,3.8e-05,5e-06,3.5e-05,1.9e-05,6.4e-05,4.1e-05,5.5e-05,1.6e-05,1.4e-05,2.6e-05,2.4e-05,2.6e-05,1.2e-05,3.2e-05,4.6e-05,1.8e-05,5e-06,1.2e-05,2e-05,2.2e-05,4e-05,1.8e-05,2.9e-05,4.5e-05,4.3e-05,2.7e-05,7.7e-05,2e-05,4.2e-05,2e-05,4.7e-05,2e-06,5e-05,4.4e-05,4.2e-05,1.9e-05,3.6e-05,1e-06,4e-05,5.4e-05,3.4e-05,5e-06,8e-05,2.4e-05,7.8e-05,1.4e-05,4.1e-05,4e-06,3.1e-05,2.6e-05,2.2e-05,1.1e-05,6.7e-05,1.3e-05,1e-06,4e-06,1.3e-05,2.3e-05,4.2e-05
0.000153,0.000168,9.9e-05,5.8e-05,7e-05,4.9e-05,5.2e-05,9.4e-05,0.000144,0.000182,0.000248,0.000229,0.000286,0.000105,3.5e-05,9e-05,0.000164,0.000109,2.5e-05,3.4e-05,3.8e-05,5.9e-05,0.000101,5.2e-05,5.5e-05,6.7e-05,5.8e-05,5.5e-05,9.1e-05,0.000187,4.4e-05,9.8e-05,0.000153,5.7e-05,4.3e-05,3.9e-05,0.000108,0.000115,9.7e-05,0.000217,0.000148,0.000168,9.1e-05,8.8e-05,2.2e-05,2.3e-05,4.7e-05,4.7e-05,3.3e-05,3.4e-05,0.000153,0.000159,0.000144,0.000151,0.000131,7.3e-05,0.000182,0.000205,0.000241,0.000194,0.000198,0.000209,0.000168,8.1e-05,2.6e-05,0.000163,0.00023,0.000153,0.000195,0.000154,0.000138,0.000106,0.000114,0.000152,9.8e-05,0.000129,0.000153,3.2e-05,5.4e-05,1.8e-05,4.1e-05,6.3e-05,8e-05,4e-06,7.9e-05,0.000126,0.000167,7.3e-05,0.000169,7.5e-05,7.6e-05,7.3e-05,5.4e-05,7.2e-05,0.000162,5.6e-05,0.000129,0.00019,0.000199,8.4e-05,8.5e-05,0.000177,6.6e-05,8.5e-05,0.000236,0.000123,0.000279,0.00013,2e-05,3.6e-05,4.6e-05,4.8e-05,7.8e-05,3.8e-05,0.000104,5.3e-05,5.1e-05,5.8e-05,3.2e-05,6.7e-05,0.000102
0.000177,0.000211,0.000234,0.000288,0.00011,5e-05,0.000105,0.000153,4.7e-05,0.000184,0.000103,7.7e-05,0.000186,0.000105,0.000181,0.000178,0.000231,0.000136,3e-05,2.6e-05,8.2e-05,2.8e-05,0.000148,0.000107,4.9e-05,0.000114,0.000172,0.000192,0.000163,0.000228,0.000243,0.00019,0.000126,7.8e-05,0.000129,7.5e-05,9.8e-05,0.000111,8.9e-05,0.000119,0.000149,0.000234,0.00014,0.000107,1.4e-05,0.000142,0.000132,0.000119,5.7e-05,2e-05,0.000167,0.000112,0.000228,0.000108,7e-05,9.4e-05,0.000207,0.000173,0.000267,0.000109,0.000264,0.000259,9.8e-05,7.8e-05,0.000162,0.000117,0.000118,0.000241,4.2e-05,4.4e-05,0.000114,4.4e-05,4.4e-05,0.000186,7.5e-05,0.000149,0.00014,0.000252,8.1e-05,1.6e-05,7e-05,7e-05,7.4e-05,0.000268,0.00011,0.000142,0.000206,0.000163,1.4e-05,0.000145,6.8e-05,6.1e-05,7.6e-05,0.000122,0.000303,0.000319,6e-05,0.000169,0.000182,0.000166,0.000153,0.000195,3e-04,0.000164,0.000371,0.000392,8.6e-05,0.000136,8.8e-05,0.000155,6.7e-05,6.6e-05,0.000185,0.000197,0.000218,5.8e-05,7.7e-05,0.000201,0.000161,0.000143,0.000205
0.000182,8e-05,0.00015,0.000341,0.000228,6.3e-05,0.000103,7.7e-05,9.1e-05,0.000132,0.00015,6.5e-05,0.000261,0.00022,0.000333,0.000183,0.00018,0.000352,0.000144,0.000116,0.000112,8.7e-05,0.000113,0.000126,0.000128,0.000129,0.000223,1.5e-05,0.000257,0.000189,0.000277,0.000113,0.000199,0.00011,0.000182,5.6e-05,0.000131,0.000327,0.000181,0.00033,0.000158,0.00033,2.8e-05,1.5e-05,9.4e-05,0.000186,0.000207,2.6e-05,3.9e-05,0.000129,0.000236,0.000232,0.000239,0.000395,0.000209,0.000135,0.000282,0.000156,3e-04,0.000169,0.000323,0.000201,0.00013,0.000194,0.000342,0.000178,0.000181,0.000231,0.00034,0.000196,0.000225,0.000165,9.7e-05,0.000171,0.000144,0.000155,0.000131,0.000298,0.00014,2.4e-05,9.9e-05,0.000219,0.000112,0.000431,0.000213,0.000245,8.9e-05,0.000381,0.000351,0.00034,0.000202,0.000245,0.000192,0.000194,0.000223,0.000198,0.000257,0.00035,4e-04,0.000361,0.000208,0.000188,0.000118,0.000255,0.000225,0.000374,0.000279,0.000385,0.000395,0.000377,0.000331,5.9e-05,0.000245,0.000105,9.8e-05,0.000138,0.000126,0.000382,0.000323,0.000209,0.000125
4.5e-05,0.000202,0.000247,0.000102,0.000177,0.00024,0.000216,0.000158,0.000155,0.000161,4e-06,0.000144,0.000268,0.000123,3e-04,0.000323,0.000346,0.000299,0.000264,0.000288,0.000217,0.000173,0.000104,0.000138,0.00012,5.6e-05,6.3e-05,9.6e-05,0.000242,0.000269,4.2e-05,8.9e-05,0.000289,0.000193,0.000149,0.000209,0.000224,0.000164,0.000102,0.000271,0.000233,0.000161,0.000405,0.000312,0.000121,0.000241,0.000411,0.00025,4.2e-05,0.000193,1.3e-05,0.000239,9.8e-05,0.000282,0.000212,7e-05,8.5e-05,1e-05,0.000183,0.000136,0.000288,0.000245,4.2e-05,0.000225,0.000165,2.1e-05,0.000318,0.000137,0.000377,0.000283,0.000265,0.000224,0.000159,9.4e-05,8e-05,0.000253,0.000281,8.9e-05,0.000201,6.6e-05,0.000126,0.000186,0.000195,0.000251,0.000127,0.000152,0.000307,0.000512,9.1e-05,0.000174,4e-05,0.000186,0.000125,0.000155,0.000138,0.000396,0.000514,1e-04,0.000339,0.000384,0.000164,9e-05,0.000177,4.6e-05,0.000262,0.000153,0.000164,0.000348,0.000218,0.00021,9e-05,0.000169,9e-05,0.000206,0.000263,0.000392,0.000315,0.000368,0.000236,0.000158,0.000133
0.000101,0.000283,0.00024,0.000132,0.000162,0.000346,0.000123,0.000114,0.000131,8.8e-05,0.000169,0.000201,0.000106,5e-05,0.000197,0.000133,0.000142,4.1e-05,0.000246,0.000127,8.4e-05,0.000144,0.000199,0.000147,8.5e-05,0.000184,0.000219,0.000139,0.000152,0.000249,0.000221,0.000157,0.000112,0.000134,0.000295,8.2e-05,5.9e-05,0.000226,0.000105,0.00013,8.3e-05,0.000184,0.000295,6.5e-05,0.00015,5.2e-05,0.000201,0.000168,0.000167,0.00014,0.00016,0.000137,0.00012,8.4e-05,0.000253,0.000184,6.8e-05,6.5e-05,0.000127,0.00022,4.3e-05,6.5e-05,0.000169,0.000217,0.000257,0.000319,0.000209,0.000203,0.000332,8.7e-05,0.000274,5e-06,0.000177,0.000133,2.7e-05,0.000197,9e-05,3.5e-05,0.000148,0.000239,0.00016,8.7e-05,0.000148,0.000113,0.000229,8e-05,0.000346,0.00011,0.000135,0.000183,5.6e-05,9e-05,0.000403,0.000143,3.2e-05,0.000304,0.000154,8.9e-05,0.000202,0.000137,0.00014,0.000142,3.5e-05,6.7e-05,8.8e-05,0.000274,0.000138,0.000151,0.000131,0.000105,0.000115,0.00012,7.5e-05,0.000246,0.000108,0.000346,0.00013,0.000375,0.000504,0.000248,0.000206
0.000164,0.000397,0.00034,9.4e-05,0.000162,0.000175,0.000166,0.000141,0.000287,0.000166,0.000305,0.000173,0.000147,6.1e-05,0.000133,0.000298,0.00024,0.000192,0.000278,0.000193,7.2e-05,0.000231,0.000193,0.000105,0.000225,0.000284,0.000159,0.00014,0.000149,9.3e-05,0.000128,0.000221,5.5e-05,8.6e-05,0.000191,0.000207,4.8e-05,0.000178,8.7e-05,0.000172,2.6e-05,4.5e-05,0.000284,0.000317,0.000167,0.000196,2.3e-05,0.000193,0.000287,0.000327,9.3e-05,0.000164,3.8e-05,0.000165,0.000155,0.000153,0.000219,0.000166,0.000144,0.000206,3.4e-05,8.6e-05,0.000315,0.000291,0.000128,0.000303,0.000406,9.6e-05,0.000388,0.000421,8.7e-05,0.000264,0.00029,0.000108,0.000148,7.7e-05,0.000214,6e-05,4.5e-05,0.000332,0.000265,0.000286,0.000207,0.000218,0.000319,0.000197,0.000233,0.000188,0.000116,0.000328,0.000169,0.000114,0.000467,0.000275,0.000127,0.000267,0.000366,3.5e-05,0.000131,3.5e-05,0.000172,3.2e-05,8.1e-05,7.1e-05,0.000174,0.000141,0.000113,0.000256,0.000164,0.000209,0.000222,0.000234,0.000194,0.000266,0.00015,0.000273,0.000193,0.000217,0.00061,0.000441,0.00031
9.1e-05,0.000237,0.000182,7.7e-05,0.000144,0.000267,3.2e-05,0.000137,8.4e-05,0.00014,0.000339,0.00011,0.000136,0.000153,0.000229,0.000105,0.000257,0.00035,0.000282,0.000253,0.000164,0.00021,8.8e-05,0.000334,0.000232,0.000173,0.00044,0.000375,0.000223,0.000163,7e-05,0.000243,0.000281,0.00019,8.6e-05,0.00018,0.000133,0.000101,0.000184,0.000101,0.000288,6.5e-05,7.8e-05,0.000206,0.000148,0.000208,1e-04,0.000267,0.000417,0.000164,0.000108,0.000264,0.000241,0.000338,0.000373,0.000166,0.000315,0.000375,0.000118,0.000269,0.000444,0.000282,0.000357,0.000397,0.000327,0.000507,0.000193,0.000128,0.000208,0.000179,0.000308,0.000406,0.000279,0.000119,0.000217,0.000246,9e-05,0.000158,8.2e-05,0.000362,0.000379,0.000112,8.1e-05,0.00016,8.5e-05,0.000173,0.000136,8.4e-05,0.000166,0.000469,0.000293,0.000278,0.000293,0.000372,0.000373,0.000499,0.000441,0.000549,0.000243,0.000285,0.000152,0.000127,0.000116,0.000187,0.000248,0.000254,0.000131,0.00012,1.9e-05,0.000135,0.000125,0.000285,0.000218,0.000136,7.5e-05,0.000255,0.00021,2.6e-05,0.000386,3e-04,8e-05
9.9e-05,7.4e-05,0.000141,0.000195,0.000157,0.000163,0.000225,0.000233,0.000255,0.000216,0.000287,0.000257,0.000155,0.000179,9.4e-05,0.000123,0.000281,4.9e-05,0.000258,0.000244,9.3e-05,0.000113,0.00018,0.00021,0.00019,0.000221,3e-04,9e-05,9.4e-05,0.000371,0.000283,0.000367,0.000229,0.000156,0.000207,2.2e-05,6.3e-05,0.000161,0.000208,0.000247,0.000474,0.000324,5.6e-05,0.000135,7.8e-05,0.000147,0.000203,0.000146,0.000162,0.000218,6.5e-05,0.000172,0.000101,0.000275,4e-05,0.000165,0.000224,0.000239,0.000382,7e-05,0.000368,0.000234,0.000265,5.4e-05,0.000122,0.000246,0.000215,0.000296,0.000222,0.000128,9e-05,2e-04,5.2e-05,0.000118,0.000287,4.1e-05,0.000207,0.000231,0.000194,0.000424,0.000102,0.000229,0.000158,0.000129,9.8e-05,0.000282,0.000298,6.1e-05,7.7e-05,0.000201,0.000181,0.000298,8.5e-05,0.000222,0.000287,0.000214,0.000434,0.00041,0.000278,0.000612,0.000443,0.000147,0.000105,0.000178,0.000296,0.000272,0.000106,7.2e-05,9.5e-05,7.5e-05,3.3e-05,0.000285,0.000296,0.000126,7.7e-05,0.000239,0.000236,0.00041,0.000442,0.000246,0.000102
7.9e-05,0.000122,0.000161,6.1e-05,0.000201,0.000171,0.000271,0.000163,0.000131,9.7e-05,0.000212,0.000173,0.000116,0.000229,0.000238,0.000343,9.7e-05,7.6e-05,0.000227,4.3e-05,0.000169,0.000142,0.000191,0.000234,0.000157,0.000138,0.000257,0.000111,6.8e-05,0.00036,0.000175,0.000231,7.4e-05,9.3e-05,7.6e-05,4.1e-05,2.5e-05,0.000175,0.000196,0.000183,0.000302,0.000309,0.000248,0.000261,9.2e-05,0.000152,5.5e-05,0.000149,4.6e-05,0.000109,0.000276,0.000223,0.000172,0.000105,0.00021,0.000251,0.000252,0.000227,0.000281,0.000344,0.000219,0.000295,0.000309,0.000193,0.000156,8.3e-05,7.9e-05,0.000132,0.000214,0.00015,6.1e-05,0.00016,0.000195,6.1e-05,0.000153,0.00019,0.000208,0.000117,0.000172,0.000176,0.000133,0.000165,0.000227,0.000262,0.00032,0.000123,0.000295,0.000293,0.00019,0.00019,5.5e-05,0.000174,0.00021,1.9e-05,0.000263,0.000235,0.000291,5.9e-05,0.000143,0.000339,0.000314,0.000294,0.000137,0.000133,0.000202,3.3e-05,4.3e-05,0.000138,0.000115,0.000304,0.000231,0.000105,2.1e-05,7e-05,9.3e-05,0.000232,7e-05,0.000291,0.000253,0.000173,0.00014
0.000165,8.4e-05,2.7e-05,9.4e-05,0.000131,0.000121,0.00016,5.1e-05,8.7e-05,2.1e-05,6.4e-05,0.000117,4.9e-05,0.000137,0.000239,0.000325,0.000194,4.4e-05,6.7e-05,0.00017,6.5e-05,6.3e-05,7.4e-05,2.1e-05,0.000142,4.9e-05,5e-05,0.000119,8.5e-05,0.000262,2e-04,0.000116,0.000116,8.6e-05,0.000116,0.000114,6.9e-05,0.000154,6.7e-05,0.000118,9.3e-05,0.000137,0.000139,0.000215,0.00017,4.7e-05,8.1e-05,6e-05,5.2e-05,6.1e-05,0.000197,0.000107,0.000228,8.8e-05,0.000184,6e-05,8e-06,8.8e-05,0.000226,0.000281,0.000179,0.00016,0.000143,9.3e-05,0.000139,0.000193,0.000194,9.5e-05,0.000227,0.000155,5.7e-05,0.000137,0.000141,0.00015,2.9e-05,7.7e-05,2e-05,0.000119,0.000171,0.000262,0.000168,5.3e-05,0.000142,7.8e-05,0.000112,0.000196,0.000138,8.1e-05,0.000108,0.000197,0.000267,0.000314,0.000171,0.00011,0.000271,0.000253,0.000247,0.000136,9.2e-05,0.000127,3.1e-05,0.000147,8.2e-05,9.2e-05,7.5e-05,0.000107,9.6e-05,3.3e-05,0.000128,0.000214,7.3e-05,8.4e-05,2.8e-05,4.6e-05,3.5e-05,0.000122,0.000107,0.000139,6.6e-05,6.2e-05,0.000104
7e-05,5.2e-05,2.5e-05,6.1e-05,3e-05,5e-05,2.3e-05,3.1e-05,5.5e-05,2.8e-05,2.3e-05,6.5e-05,1.8e-05,0.000116,9.9e-05,0.00011,1e-05,8.2e-05,3.2e-05,6.5e-05,6.6e-05,1.1e-05,5.8e-05,4e-05,8.9e-05,6.8e-05,3e-06,0.000104,0.000159,9.2e-05,1.8e-05,3.1e-05,7.9e-05,5.8e-05,9e-05,8.8e-05,6.7e-05,2e-05,2.7e-05,1e-04,8.4e-05,2.3e-05,8.5e-05,7.2e-05,4.7e-05,1.1e-05,3e-05,4.7e-05,5.4e-05,6.4e-05,8.3e-05,4.6e-05,0.000104,3.4e-05,7.1e-05,6.1e-05,7.4e-05,5.1e-05,0.000173,6.9e-05,2.4e-05,5e-05,2.6e-05,4.4e-05,7.5e-05,3.8e-05,4.8e-05,9.6e-05,8.6e-05,4.3e-05,3e-05,5.2e-05,3.3e-05,7.6e-05,3.6e-05,5.7e-05,4.1e-05,3.6e-05,0.000109,4e-05,4.1e-05,3.1e-05,8.9e-05,7e-05,7.1e-05,0.000152,5.1e-05,7.4e-05,0.000136,7.6e-05,0.000135,8.9e-05,8.3e-05,0.000102,0.000125,6.8e-05,8.2e-05,6e-06,6e-05,6.2e-05,4.2e-05,6.7e-05,7.5e-05,9e-06,1.8e-05,2.4e-05,3.3e-05,3.4e-05,3.3e-05,9.5e-05,7.2e-05,5.9e-05,4.8e-05,5e-05,4.8e-05,0.000124,9.2e-05,0.000128,4.2e-05,6.3e-05,5.1e-05
6.3e-05,4e-05,7e-06,2.6e-05,4.5e-05,3.3e-05,1.6e-05,1.6e-05,0.000113,3.7e-05,3e-05,2.6e-05,1.9e-05,7.5e-05,5.8e-05,6.6e-05,1.7e-05,8.4e-05,4.4e-05,2.3e-05,3.4e-05,3.9e-05,1.1e-05,1.2e-05,5.2e-05,9.2e-05,5.3e-05,9.8e-05,6.6e-05,8.1e-05,5.9e-05,6.3e-05,3.7e-05,7e-06,5e-05,3.8e-05,5.5e-05,3.9e-05,4.4e-05,9.9e-05,1.2e-05,1.8e-05,0.000118,7.5e-05,3.5e-05,3.3e-05,2.9e-05,5e-05,4.3e-05,2.6e-05,9.1e-05,2.5e-05,5.5e-05,6.8e-05,6.5e-05,6.4e-05,4.9e-05,6e-06,0.000106,6e-05,5.2e-05,2.5e-05,1.6e-05,9e-06,4.7e-05,1.1e-05,1.3e-05,0.000104,6.6e-05,1.9e-05,3.9e-05,2e-05,4.1e-05,6.3e-05,2.6e-05,1.4e-05,5.2e-05,9.3e-05,4.6e-05,5.2e-05,9e-06,4.7e-05,7.9e-05,2.7e-05,6.4e-05,9.3e-05,5.6e-05,5.4e-05,2.6e-05,5.9e-05,1.2e-05,5.8e-05,4.9e-05,1.1e-05,7.1e-05,3.9e-05,6.1e-05,3.8e-05,5.6e-05,5.4e-05,1.5e-05,2.9e-05,3.7e-05,4e-05,5.4e-05,3.7e-05,5e-05,0.000116,5.7e-05,4.5e-05,7.5e-05,3.8e-05,7e-05,1e-05,2.6e-05,0.000118,1.9e-05,7.3e-05,1.8e-05,4.4e-05,2.2e-05
6.1e-05,3.8e-05,7.7e-05,4.8e-05,0.000107,5e-05,5.1e-05,4.6e-05,9.2e-05,2e-05,2.2e-05,5.1e-05,3.8e-05,4.5e-05,7e-05,7.9e-05,1.1e-05,5.6e-05,9.2e-05,8.1e-05,9.7e-05,7.4e-05,6.3e-05,0.000104,6.8e-05,0.000121,5.7e-05,2.9e-05,6e-05,3.6e-05,1.5e-05,6.5e-05,0.000103,5.4e-05,5e-05,0.000137,0.000106,7.9e-05,1.1e-05,4.4e-05,4.2e-05,2.5e-05,8.4e-05,5.3e-05,6.6e-05,5.5e-05,7.8e-05,6.2e-05,7.8e-05,5.2e-05,7.8e-05,5.9e-05,0.000134,0.000113,6.2e-05,9.1e-05,5.6e-05,2.5e-05,9.5e-05,3.9e-05,1.1e-05,1.5e-05,2.4e-05,6.6e-05,2e-06,9.1e-05,8.3e-05,4.7e-05,5.6e-05,3.8e-05,4.4e-05,3.8e-05,1.9e-05,4.6e-05,6.6e-05,5.1e-05,5.4e-05,0.000137,0.00011,2.5e-05,7.3e-05,8e-05,1.6e-05,1.1e-05,1e-04,0.000141,4.8e-05,1e-04,9e-05,7.5e-05,4.1e-05,0.000106,6e-05,7.5e-05,0.000113,2.7e-05,7.3e-05,3.6e-05,8.8e-05,3.8e-05,3.8e-05,2.7e-05,4.6e-05,2.5e-05,7.1e-05,3.3e-05,5.2e-05,0.000144,0.000117,2.8e-05,9.5e-05,8.7e-05,7.1e-05,8.9e-05,5.2e-05,7.5e-05,7.9e-05,6e-05,8e-06,1.2e-05,2.1e-05
8.3e-05,9.9e-05,2.3e-05,3.8e-05,9.7e-05,5.9e-05,9.7e-05,8.9e-05,0.00014,7e-05,4.6e-05,5e-06,3.7e-05,2.3e-05,0.000116,9.5e-05,3.7e-05,4e-06,3.9e-05,5.3e-05,2.4e-05,2.9e-05,3e-05,0.000122,0.00018,5.6e-05,6.6e-05,6.5e-05,4.8e-05,2.4e-05,4.7e-05,6.5e-05,8.8e-05,4.8e-05,8.1e-05,0.000112,4.6e-05,1.2e-05,4.2e-05,3.4e-05,0.000122,9.4e-05,6.1e-05,6.2e-05,7.4e-05,2.3e-05,4.9e-05,6.3e-05,6.2e-05,5.9e-05,5.4e-05,0.000106,9.2e-05,0.000114,0.000121,5.2e-05,5.1e-05,7.4e-05,0.000148,3.9e-05,6.6e-05,3.4e-05,3.3e-05,8.2e-05,3.8e-05,3.6e-05,4.7e-05,7.5e-05,7.8e-05,3.5e-05,1.7e-05,4.2e-05,7e-05,0.000102,7.7e-05,8.1e-05,0.000135,4.8e-05,4.9e-05,0.000109,9.7e-05,4.5e-05,5e-05,7e-05,2.2e-05,7.2e-05,2.3e-05,2.7e-05,7.1e-05,6.6e-05,3e-05,0.000145,6.5e-05,4.9e-05,4.7e-05,4.2e-05,7.1e-05,1.7e-05,0.00013,1.9e-05,6.7e-05,6.9e-05,7e-05,2.7e-05,6.5e-05,2.3e-05,3.7e-05,5.3e-05,0.000109,7e-05,6.7e-05,3.8e-05,2.5e-05,3.8e-05,5.1e-05,4.5e-05,2.2e-05,2e-05,9.8e-05,0.000101,9.4e-05
7.7e-05,6.3e-05,2.4e-05,9.1e-05,5.1e-05,3.3e-05,6.1e-05,7.1e-05,4.9e-05,9.2e-05,7e-05,5.5e-05,3.9e-05,2e-05,6.1e-05,2.1e-05,3.9e-05,4.2e-05,2.1e-05,8.7e-05,6.3e-05,6.6e-05,9.8e-05,3.1e-05,5.2e-05,1e-04,7.4e-05,2.9e-05,2.6e-05,9.1e-05,0.000117,9.1e-05,0.000108,4.9e-05,7.8e-05,0.00017,4.3e-05,1.5e-05,8.3e-05,7.5e-05,1e-04,8.1e-05,2.2e-05,4.1e-05,9.4e-05,9.7e-05,6e-05,3e-05,1.7e-05,3.8e-05,1.8e-05,4.6e-05,8.1e-05,7.5e-05,9.3e-05,3.9e-05,4.6e-05,3.9e-05,7.3e-05,2e-05,5.3e-05,8.6e-05,3.9e-05,8.1e-05,5.6e-05,4.3e-05,4.4e-05,4.7e-05,3.4e-05,5.5e-05,8.4e-05,7.3e-05,0.000126,7.6e-05,7.2e-05,5.3e-05,8.7e-05,0.000102,0.000104,8.7e-05,7.2e-05,3.2e-05,4.5e-05,0.000118,7.2e-05,0.000101,2.9e-05,2.7e-05,1.6e-05,4.5e-05,4.5e-05,0.00016,5.2e-05,7.3e-05,0.000101,3e-05,4.6e-05,7.7e-05,0.000125,9e-05,8e-05,5.5e-05,5.8e-05,5.6e-05,8.3e-05,7.2e-05,5.5e-05,8.2e-05,5.8e-05,9.6e-05,7.5e-05,8.3e-05,3.8e-05,3.5e-05,9.1e-05,4.1e-05,9.2e-05,0.000103,5.2e-05,0.000101,9e-06
0.000111,3.7e-05,4.9e-05,0.00013,7.2e-05,7.3e-05,7.8e-05,3.7e-05,1.5e-05,9e-06,4.5e-05,0.000113,9.4e-05,0.000102,9.9e-05,8e-06,3.2e-05,5.2e-05,3.3e-05,7.3e-05,0.000111,0.000124,5.9e-05,2.7e-05,1.6e-05,0.000104,4.9e-05,2.1e-05,4.9e-05,5.9e-05,3.1e-05,8.7e-05,9.8e-05,7.8e-05,9.5e-05,6.3e-05,9e-05,4e-06,0.000129,6.2e-05,3.7e-05,4.8e-05,4.3e-05,3e-05,0.000101,0.000102,7.3e-05,9e-05,2.9e-05,2.8e-05,8.9e-05,6.8e-05,0.00013,1.9e-05,0.000103,7.9e-05,3.8e-05,5e-05,7.2e-05,6.4e-05,1e-04,4.5e-05,9.7e-05,1.7e-05,1e-06,0.00011,7.2e-05,8.6e-05,5.1e-05,5.6e-05,8.2e-05,9.1e-05,8.4e-05,7.2e-05,5.2e-05,2.9e-05,8.9e-05,4.5e-05,0.000119,0.000189,0.000124,0.000127,8e-05,4.6e-05,1.5e-05,7.5e-05,2.5e-05,3e-05,5.3e-05,2.7e-05,3.5e-05,0.000117,3e-05,0.000115,4.2e-05,0.000119,2.3e-05,6.4e-05,5.1e-05,3.1e-05,2.3e-05,1.9e-05,9.2e-05,3.7e-05,9.2e-05,3.2e-05,3.5e-05,9.8e-05,4.8e-05,0.000103,4.7e-05,4.9e-05,6.4e-05,1.9e-05,4.3e-05,6.7e-05,0.000126,2.4e-05,2.9e-05,9.9e-05,5.4e-05
3.7e-05,6e-05,2.2e-05,0.000124,9.9e-05,0.000102,6.5e-05,3.5e-05,7e-05,4.9e-05,3.3e-05,6.4e-05,5.4e-05,0.000125,3.3e-05,2.2e-05,1.3e-05,9e-05,5.9e-05,8.3e-05,8.6e-05,0.00012,0.000114,3.3e-05,1.7e-05,9.4e-05,0.000126,4.2e-05,2.3e-05,3.6e-05,3.9e-05,0.000154,0.00013,2.9e-05,9.9e-05,3e-05,0.000109,9e-05,9e-05,4.6e-05,0.000162,6.1e-05,0.000112,4.6e-05,8.9e-05,2.9e-05,2.6e-05,4.8e-05,5.1e-05,0.000105,0.000116,0.000144,4.6e-05,6.9e-05,3.8e-05,5.7e-05,6.4e-05,5.5e-05,0.00011,6.6e-05,0.000114,0.000107,1.7e-05,6.9e-05,8.2e-05,7.9e-05,0.000117,0.000101,0.000142,9.5e-05,9.7e-05,0.000101,4.2e-05,0.000134,0.00011,1.8e-05,3.2e-05,8.6e-05,6.6e-05,0.000139,0.000185,5.1e-05,5.2e-05,8.4e-05,6.2e-05,2.9e-05,5.3e-05,5.1e-05,9.4e-05,4.3e-05,7.4e-05,0.000116,0.000108,0.000152,2.5e-05,0.000134,6.4e-05,0.000127,0.000156,2.7e-05,6.2e-05,8.8e-05,0.000103,7.9e-05,0.000109,9.6e-05,6e-05,0.000142,0.000113,0.000151,7.7e-05,3e-05,0.000106,4.9e-05,6.9e-05,8.4e-05,0.000148,0.000166,6.7e-05,0.000149,0.000148
8.9e-05,8.9e-05,4.5e-05,0.00015,0.000215,0.000246,0.000182,6e-05,0.000108,0.000103,3.6e-05,1.6e-05,6.9e-05,7.2e-05,7.4e-05,9.4e-05,0.000134,0.000163,0.000128,3.9e-05,0.000135,0.000247,0.000254,0.000171,9.9e-05,6.6e-05,0.000101,0.000115,8.3e-05,0.000122,0.00011,0.000177,0.000243,0.000215,0.000164,0.000241,0.000243,0.000118,3.9e-05,0.00014,0.000117,7.5e-05,0.000121,0.000105,0.000148,9.4e-05,3.2e-05,3.5e-05,0.000105,6.2e-05,9.9e-05,0.000159,0.000198,0.000147,4.5e-05,8.2e-05,4.4e-05,4e-05,6.8e-05,8.4e-05,0.000152,0.000127,0.00012,0.000108,9.9e-05,0.000116,4.2e-05,0.000138,0.000117,3.8e-05,6.9e-05,0.000121,0.000101,0.000205,2.1e-05,0.000124,0.000119,3.4e-05,6.7e-05,0.000142,0.000243,0.000212,0.000145,0.000162,0.000229,0.000147,2.2e-05,9.2e-05,0.00016,9.8e-05,0.000114,0.000196,0.000269,6.8e-05,0.000158,0.000202,0.000119,0.000162,0.000231,0.000148,0.000181,3.2e-05,8.5e-05,8.4e-05,7.7e-05,0.000123,5e-05,0.000153,4.6e-05,0.000113,0.000118,0.000155,0.000205,0.000161,7.6e-05,0.000127,9.9e-05,0.000128,0.000149,0.000148,0.000223
0.000168,0.000155,0.00019,0.000114,0.000145,5.7e-05,0.000126,0.00026,0.000289,0.00022,0.000123,6.6e-05,8.4e-05,0.000125,9.9e-05,6.9e-05,5.8e-05,6.7e-05,7.6e-05,6e-05,0.000109,0.000132,6.2e-05,8.7e-05,3.8e-05,0.000144,0.000186,3.7e-05,8.3e-05,3.2e-05,0.000122,0.000231,9.9e-05,4.4e-05,0.000135,0.000168,0.000161,0.000116,0.000128,0.000163,0.00014,0.000101,1.4e-05,9.8e-05,3.6e-05,3.1e-05,1.8e-05,4.8e-05,0.000139,0.000159,8.1e-05,6.7e-05,0.000108,8.8e-05,5.7e-05,6.3e-05,0.000109,0.000107,1.4e-05,0.00013,0.000129,7.7e-05,0.00017,0.00013,0.000148,0.000115,0.000122,0.000158,3.6e-05,5.7e-05,6.9e-05,6e-05,8e-06,0.000136,0.000241,0.000103,7e-05,0.000142,1e-04,0.000115,7.6e-05,6.5e-05,5.7e-05,6.3e-05,0.000169,0.000205,0.000186,3.1e-05,7.2e-05,6.9e-05,0.000147,7.3e-05,8.2e-05,9.5e-05,0.000216,0.000195,0.000153,9e-05,0.000113,8.7e-05,0.000126,0.000151,0.000162,0.000145,2.7e-05,8.1e-05,0.000137,8.5e-05,0.000145,5.5e-05,7.9e-05,0.000162,7.1e-05,6.8e-05,0.000175,7e-05,4e-05,0.000106,0.000108,0.000179,0.000134
5e-05,0.000102,0.000107,7.2e-05,3.3e-05,6.9e-05,4.6e-05,0.000155,4.7e-05,3.1e-05,8e-06,7.3e-05,6.1e-05,3.7e-05,1.4e-05,7.9e-05,5.2e-05,7.9e-05,4.9e-05,5.5e-05,9.4e-05,6.7e-05,3.8e-05,3.6e-05,8.8e-05,0.000134,2.8e-05,7e-05,1.2e-05,9e-06,8.3e-05,6.1e-05,6.7e-05,7.4e-05,6.1e-05,0.000112,1.5e-05,0.000107,8.2e-05,6.4e-05,6.1e-05,2.9e-05,7e-06,0.00011,0.000102,6e-05,2.3e-05,6.3e-05,0.000104,7.6e-05,6.3e-05,4.4e-05,0.000115,1.1e-05,2e-05,6.9e-05,7.1e-05,5.9e-05,7.7e-05,8.2e-05,5.2e-05,2.1e-05,0.000105,7.9e-05,4.4e-05,2.1e-05,5.1e-05,1e-05,1.2e-05,8.3e-05,6.4e-05,4.1e-05,2.8e-05,0.000112,0.000113,0.000144,7.1e-05,0.000104,7.4e-05,0.000157,1e-04,5.7e-05,9.8e-05,5.5e-05,0.000141,4.9e-05,7e-05,8.1e-05,4.7e-05,5.2e-05,1.8e-05,6.5e-05,5.9e-05,5.7e-05,8.2e-05,4.8e-05,3.3e-05,3.3e-05,4.8e-05,7.6e-05,0.00012,0.000104,0.00013,0.00011,0.000161,4.1e-05,8.4e-05,4.9e-05,7.4e-05,8.7e-05,9.9e-05,6.5e-05,6.3e-05,3.5e-05,8.2e-05,8.9e-05,0.000147,8.3e-05,5.7e-05,5e-05,8.5e-05
3.2e-05,4.4e-05,4.9e-05,3.7e-05,2.1e-05,2e-06,3.8e-05,7.9e-05,8.5e-05,2.8e-05,2.1e-05,5.5e-05,3.7e-05,4.4e-05,6.1e-05,0.000122,7.7e-05,6.8e-05,9.6e-05,7.5e-05,0.000125,8e-05,2.6e-05,2.2e-05,0.000122,4.1e-05,4.6e-05,3.2e-05,6.4e-05,2.8e-05,3.8e-05,4.8e-05,4.8e-05,6.3e-05,5.5e-05,6.8e-05,6.6e-05,0.000113,0.000124,6.3e-05,7.4e-05,1.9e-05,5.5e-05,8.1e-05,4.8e-05,4.1e-05,3.5e-05,5.9e-05,3.4e-05,2.7e-05,4.9e-05,1.8e-05,7.6e-05,7.9e-05,3.7e-05,4.4e-05,9.9e-05,8e-05,0.000105,3.3e-05,1.9e-05,3.4e-05,1.2e-05,8.8e-05,0.000125,9.2e-05,4e-05,2.1e-05,3.2e-05,7.1e-05,7.6e-05,7e-05,6.4e-05,1.3e-05,8.6e-05,7.1e-05,5.2e-05,0.000105,5.4e-05,0.000116,5.8e-05,2.1e-05,7e-05,7.1e-05,0.000124,5e-05,8e-06,5e-06,4.1e-05,3.2e-05,4.1e-05,7.2e-05,5.1e-05,8e-05,0.000104,6.1e-05,5.5e-05,7.3e-05,8.6e-05,5.2e-05,3.3e-05,4.6e-05,5.5e-05,4.1e-05,9e-05,5.9e-05,3.4e-05,5.5e-05,2.7e-05,9.9e-05,5.1e-05,7.3e-05,5.8e-05,1.9e-05,3.9e-05,4.4e-05,7.2e-05,6.6e-05,7.1e-05,3.9e-05,2.3e-05
2.8e-05,2.7e-05,2.2e-05,1.5e-05,1.6e-05,1.1e-05,1e-05,9e-06,1e-05,3.1e-05,2.5e-05,2.4e-05,1.2e-05,2.3e-05,6e-06,3.2e-05,4.2e-05,2.8e-05,2.4e-05,1.1e-05,1.9e-05,1.4e-05,2.6e-05,2.2e-05,5.9e-05,2.7e-05,1.8e-05,7e-06,5.1e-05,3.8e-05,1.8e-05,1e-05,1.9e-05,3e-05,1.2e-05,2e-05,3.5e-05,2.5e-05,2.9e-05,3.6e-05,9e-06,1e-05,4.1e-05,5.1e-05,4.8e-05,3.8e-05,4e-05,4.2e-05,1.9e-05,1.6e-05,4e-05,3.6e-05,2.4e-05,2e-05,1.7e-05,2e-05,3.1e-05,2e-05,1.8e-05,1.7e-05,2.4e-05,4.1e-05,5.9e-05,2.3e-05,3.4e-05,1.3e-05,2.7e-05,2.1e-05,2.4e-05,6e-06,2.7e-05,7e-06,2.1e-05,3.4e-05,1.6e-05,1.9e-05,5e-06,3.1e-05,4.4e-05,2.6e-05,1.1e-05,5e-06,2.7e-05,2.8e-05,1.2e-05,4.3e-05,5.2e-05,1.2e-05,1.9e-05,1.3e-05,5.6e-05,6.5e-05,3.8e-05,1.6e-05,2.1e-05,8e-06,4e-06,4.6e-05,6e-06,1.9e-05,1e-05,1.8e-05,2.1e-05,1.3e-05,3.7e-05,2.2e-05,1.2e-05,3.7e-05,1.1e-05,4.2e-05,2.4e-05,3.2e-05,1.9e-05,3.7e-05,2.4e-05,3.4e-05,1.7e-05,1.6e-05,7e-06,2.8e-05,3e-05
2.1e-05,1.9e-05,1e-05,1.7e-05,2.3e-05,3.5e-05,2.2e-05,3.3e-05,1.1e-05,2.5e-05,3.1e-05,9e-06,9e-06,2.8e-05,1.3e-05,1.8e-05,2.9e-05,6e-06,1.5e-05,2.9e-05,2e-05,2.6e-05,1.6e-05,2.4e-05,6e-06,2e-05,3.8e-05,1.2e-05,4.5e-05,3.7e-05,2.9e-05,2.3e-05,1.3e-05,2.3e-05,1.7e-05,2.5e-05,2.2e-05,3.5e-05,2e-05,1.1e-05,1.6e-05,4e-06,2.5e-05,9e-06,3.4e-05,5e-06,1.6e-05,1.2e-05,2e-05,2.1e-05,1.9e-05,2.3e-05,1.8e-05,2e-05,2.1e-05,1.3e-05,2.9e-05,1.4e-05,2.1e-05,1.3e-05,3.6e-05,4.9e-05,2.1e-05,2.2e-05,2.8e-05,1.7e-05,2.8e-05,2.3e-05,1.8e-05,1.7e-05,7e-06,4e-06,3.2e-05,3.4e-05,3.3e-05,3.6e-05,1.4e-05,2.4e-05,2.4e-05,2.2e-05,1.7e-05,3e-06,1.7e-05,3.1e-05,1.2e-05,3.3e-05,3.4e-05,3.3e-05,2.1e-05,2.2e-05,4.1e-05,8e-06,1.1e-05,1.2e-05,7e-06,6e-06,5e-06,1.2e-05,1.1e-05,8e-06,2.4e-05,2.4e-05,2.5e-05,1.1e-05,3.5e-05,1.8e-05,3.2e-05,2.5e-05,3.7e-05,2.9e-05,1.1e-05,2.9e-05,2.9e-05,1.4e-05,3.3e-05,3.2e-05,3.1e-05,1.4e-05,1.5e-05,2.7e-05,3.3e-05
2.4e-05,2.2e-05,1.9e-05,1e-05,1.4e-05,2e-05,9e-06,3.2e-05,4.6e-05,4.7e-05,1.1e-05,9e-06,1.2e-05,2.5e-05,1.6e-05,2.6e-05,6e-06,2.6e-05,2.2e-05,2.8e-05,2e-05,2.1e-05,1.4e-05,1.9e-05,3.4e-05,1.7e-05,4.4e-05,4.1e-05,3.2e-05,3.8e-05,3.2e-05,4.1e-05,4e-05,1.3e-05,5e-06,2.8e-05,1.5e-05,6e-06,3e-05,3e-05,1.2e-05,1.1e-05,2.6e-05,1.9e-05,4e-06,2e-05,6e-06,5e-06,2.9e-05,2e-05,2e-05,4.1e-05,6.1e-05,2.8e-05,1.5e-05,8e-06,2.2e-05,3.4e-05,2.8e-05,6e-06,3.4e-05,3.1e-05,3.1e-05,1.9e-05,6e-06,2.6e-05,1.4e-05,1.6e-05,2.2e-05,5e-06,1.8e-05,5e-06,3.7e-05,6.3e-05,4.7e-05,9e-06,3.1e-05,3.1e-05,5.3e-05,4.2e-05,3.3e-05,2.6e-05,1.8e-05,2.2e-05,5.2e-05,4e-05,9e-06,2e-05,1.4e-05,2.7e-05,9e-06,2.7e-05,2.1e-05,1.7e-05,2.5e-05,1.9e-05,1.7e-05,2.5e-05,1e-05,2.6e-05,1.1e-05,2.6e-05,6e-06,2.3e-05,6e-06,1.1e-05,1.2e-05,3.8e-05,1.2e-05,3.5e-05,4.6e-05,3.8e-05,2.4e-05,1.2e-05,2.2e-05,4.1e-05,2.6e-05,2.1e-05,2.2e-05,2.6e-05,2.5e-05
2e-05,1.3e-05,2.3e-05,1.9e-05,1.1e-05,1.3e-05,1.2e-05,3.8e-05,2.8e-05,1.5e-05,2.9e-05,3.2e-05,2.4e-05,3e-05,3.3e-05,2.2e-05,4.6e-05,4.4e-05,2.4e-05,1.9e-05,1.4e-05,1.6e-05,1.9e-05,1.3e-05,1.9e-05,2.1e-05,4e-06,1.2e-05,3.3e-05,3.4e-05,1.6e-05,3.1e-05,2.1e-05,2.3e-05,2.9e-05,2.6e-05,1.6e-05,4.3e-05,3.3e-05,1.2e-05,8e-06,1.4e-05,3.9e-05,2.9e-05,6e-06,2.5e-05,1.4e-05,1.6e-05,2.7e-05,3.1e-05,1.3e-05,2.5e-05,2.3e-05,1e-05,1.5e-05,1.6e-05,1.5e-05,1.6e-05,3.8e-05,2.3e-05,1.9e-05,3.4e-05,1.7e-05,1.7e-05,2e-06,3.3e-05,2.6e-05,2.6e-05,1.5e-05,1.5e-05,1.7e-05,3.9e-05,2.9e-05,4.8e-05,2.8e-05,1.7e-05,3.2e-05,4.8e-05,1.1e-05,3.2e-05,3.2e-05,8e-06,1.2e-05,4e-06,3.9e-05,8e-06,1.5e-05,1.9e-05,1.7e-05,1.3e-05,1.3e-05,1.7e-05,6e-06,1.7e-05,3.8e-05,1e-06,1.3e-05,1.3e-05,8e-06,3.1e-05,2.6e-05,2.4e-05,9e-06,3e-06,1.9e-05,1e-05,4e-06,2.1e-05,4.3e-05,1e-06,3.8e-05,1.2e-05,3e-06,2.2e-05,1.6e-05,4.4e-05,4.7e-05,1.2e-05,1.4e-05,1.7e-05,1.9e-05
2.3e-05,1.6e-05,1.9e-05,1.4e-05,1.6e-05,1.7e-05,1.6e-05,4.2e-05,3.1e-05,2.2e-05,5e-06,1.4e-05,1.2e-05,1.5e-05,1.6e-05,2.1e-05,1.8e-05,1.5e-05,1.4e-05,2.2e-05,5e-06,4e-06,2.9e-05,2.3e-05,3.6e-05,3.5e-05,2.1e-05,2.9e-05,1.5e-05,1.7e-05,1.4e-05,1e-05,1e-05,1.4e-05,8e-06,7e-06,1.5e-05,3.6e-05,1.9e-05,9e-06,2.7e-05,7e-06,3.2e-05,1.6e-05,2.5e-05,2e-05,2e-05,1.7e-05,1.4e-05,5e-06,1.7e-05,1.2e-05,1e-05,1.4e-05,1.7e-05,2.3e-05,1e-05,7e-06,1.3e-05,5e-06,2.6e-05,2.2e-05,2.3e-05,3.7e-05,1.7e-05,2.2e-05,1.3e-05,2.3e-05,1.3e-05,1.1e-05,1.4e-05,4.2e-05,4.8e-05,2.2e-05,1.7e-05,2.5e-05,3.2e-05,1.1e-05,2.3e-05,8e-06,9e-06,5e-06,1.3e-05,1.5e-05,1.6e-05,2e-05,1.3e-05,2e-05,8e-06,6e-06,5e-06,1.4e-05,1.5e-05,8e-06,1.3e-05,1.9e-05,3.5e-05,2.5e-05,6e-06,2e-05,1.4e-05,1.5e-05,1.7e-05,2.3e-05,3.1e-05,2.5e-05,6e-06,9e-06,1.1e-05,1.6e-05,1.4e-05,2.7e-05,8e-06,2.8e-05,3.3e-05,1.2e-05,1.5e-05,1.6e-05,1.7e-05,1.7e-05,7e-06
2e-05,1.7e-05,1.3e-05,8e-06,2e-05,1.1e-05,1.1e-05,1.3e-05,2.3e-05,6e-06,4e-06,1.4e-05,1.8e-05,1.8e-05,1.4e-05,3.4e-05,1.7e-05,1.5e-05,5e-06,1.6e-05,5e-06,4e-06,1.8e-05,1.2e-05,2.6e-05,1.6e-05,4e-06,2.6e-05,1e-05,2.2e-05,5e-06,2e-06,9e-06,6e-06,9e-06,9e-06,2.7e-05,2e-05,2.1e-05,1.2e-05,1.1e-05,5e-06,1.2e-05,5e-06,1.4e-05,7e-06,1.6e-05,2.2e-05,1.5e-05,3e-06,1.4e-05,9e-06,2e-05,1.9e-05,1.1e-05,2.3e-05,1.9e-05,1e-05,1.4e-05,1.4e-05,9e-06,1.4e-05,3.3e-05,1.7e-05,1.1e-05,2.1e-05,2e-06,6e-06,1e-05,2.3e-05,2.2e-05,1.7e-05,2.2e-05,1e-05,1.3e-05,2.5e-05,4e-06,1.2e-05,2e-05,2.2e-05,2.1e-05,1e-05,1.6e-05,8e-06,1.2e-05,2.4e-05,8e-06,1.1e-05,1e-05,1e-05,1.3e-05,8e-06,1.6e-05,1e-06,2.3e-05,2.4e-05,2.2e-05,1.2e-05,2.2e-05,3.3e-05,2e-05,1.8e-05,1.4e-05,1.8e-05,4e-06,7e-06,1.4e-05,2e-06,1.1e-05,1.1e-05,2.6e-05,2.3e-05,1.5e-05,1.2e-05,1.5e-05,2.2e-05,1.9e-05,1.3e-05,1.2e-05,2.7e-05,4e-06
1.8e-05,1.7e-05,1.5e-05,1.6e-05,8e-06,4e-06,5e-06,7e-06,2.3e-05,9e-06,7e-06,6e-06,8e-06,1.6e-05,1.3e-05,3.6e-05,6e-06,2e-06,5e-06,1.7e-05,1.3e-05,1e-05,9e-06,6e-06,1e-05,2.2e-05,1.1e-05,1.4e-05,2.5e-05,2.2e-05,8e-06,4e-06,7e-06,5e-06,1.9e-05,1.7e-05,5e-06,1.5e-05,1.7e-05,1.9e-05,5e-06,1.1e-05,1.2e-05,5e-06,1.6e-05,8e-06,5e-06,6e-06,1.2e-05,1.1e-05,6e-06,2e-05,9e-06,1e-05,1.2e-05,2.2e-05,1e-05,1.7e-05,2.5e-05,1.7e-05,8e-06,7e-06,2.1e-05,2.5e-05,2.9e-05,1.2e-05,6e-06,9e-06,7e-06,1.4e-05,1e-05,3e-06,1.9e-05,3e-06,8e-06,2e-05,1e-05,3e-06,8e-06,1.3e-05,1.4e-05,2e-06,1.3e-05,5e-06,1.2e-05,3e-05,1e-05,7e-06,1.8e-05,6e-06,1.7e-05,1.1e-05,1.8e-05,1.3e-05,2.6e-05,1.5e-05,2e-05,8e-06,2.3e-05,1.5e-05,1e-06,1e-05,5e-06,1e-05,1.2e-05,1e-06,1.1e-05,1e-05,1.6e-05,1.4e-05,2e-05,3e-06,1e-05,1.4e-05,0,1.3e-05,2e-05,1.2e-05,1.3e-05,2e-06,2e-05
2e-05,5e-06,8e-06,1.1e-05,5e-06,1e-06,4e-06,1.6e-05,2.4e-05,1.8e-05,5e-06,9e-06,8e-06,1.1e-05,2e-06,2.8e-05,1.7e-05,6e-06,1.6e-05,7e-06,4e-06,2e-06,1.9e-05,1.7e-05,9e-06,1.5e-05,1.1e-05,1.8e-05,2.7e-05,1.6e-05,1.7e-05,1.5e-05,9e-06,2e-06,2.9e-05,6e-06,2.1e-05,9e-06,7e-06,2.7e-05,1.2e-05,4e-06,9e-06,5e-06,1.9e-05,1.5e-05,1e-05,1.2e-05,2.5e-05,1.3e-05,4e-06,5e-06,2.3e-05,6e-06,8e-06,1.9e-05,2.4e-05,9e-06,2.8e-05,1.5e-05,2.3e-05,9e-06,2.6e-05,1.4e-05,9e-06,1.7e-05,4e-06,3e-06,7e-06,1.2e-05,2.7e-05,1.5e-05,2e-06,5e-06,2e-06,1.4e-05,1.1e-05,1e-05,7e-06,1.2e-05,1.6e-05,8e-06,1.5e-05,1.2e-05,3e-06,1.7e-05,1.9e-05,9e-06,2.4e-05,1.9e-05,2.3e-05,8e-06,7e-06,1.4e-05,1.3e-05,8e-06,1.5e-05,1.2e-05,1.4e-05,2.6e-05,1.8e-05,1e-06,1e-06,1.3e-05,1.3e-05,1.1e-05,1.3e-05,1.4e-05,1.3e-05,1.5e-05,2.4e-05,2.1e-05,1.3e-05,1.5e-05,1.4e-05,2.4e-05,5e-06,8e-06,1.3e-05,1.3e-05,1.7e-05
2.1e-05,1.7e-05,4e-06,1.5e-05,2.8e-05,1.5e-05,1.5e-05,1.7e-05,1.2e-05,9e-06,1.5e-05,1.3e-05,1.5e-05,2.3e-05,1.7e-05,1.1e-05,1.3e-05,1.4e-05,2.6e-05,2.3e-05,9e-06,3e-06,1.6e-05,7e-06,7e-06,1.2e-05,7e-06,2.1e-05,1.2e-05,2.7e-05,1.7e-05,6e-06,9e-06,1.4e-05,1.5e-05,1.6e-05,2.5e-05,2.6e-05,2.1e-05,1.8e-05,4e-06,8e-06,3e-06,4e-06,2.2e-05,1.1e-05,1.9e-05,9e-06,1.4e-05,2.7e-05,2.3e-05,7e-06,2.4e-05,1.1e-05,9e-06,8e-06,1.6e-05,2e-05,1.2e-05,1.6e-05,1.4e-05,1.1e-05,1.4e-05,1.3e-05,7e-06,1.1e-05,8e-06,1.5e-05,1e-05,1.2e-05,2.1e-05,8e-06,1.8e-05,1.9e-05,1.6e-05,1.5e-05,1.4e-05,4e-06,9e-06,8e-06,2.3e-05,1e-05,2.6e-05,1.9e-05,1.9e-05,1.2e-05,1.5e-05,1.8e-05,1.8e-05,3e-06,2.3e-05,2.7e-05,2.1e-05,1.7e-05,2.2e-05,1.3e-05,1.5e-05,1.4e-05,8e-06,5e-06,5e-06,1.5e-05,1e-05,8e-06,1.5e-05,1.5e-05,2.6e-05,2.4e-05,2.6e-05,1.1e-05,3e-05,1e-05,1.6e-05,2.2e-05,3.3e-05,2.8e-05,2.8e-05,1e-05,1.2e-05,2.8e-05,1e-05
1.2e-05,4e-06,1.2e-05,7e-06,1.4e-05,7e-06,4e-06,9e-06,1.3e-05,7e-06,1.2e-05,9e-06,1.6e-05,1.5e-05,5e-06,4e-06,5e-06,1.5e-05,1.1e-05,1.1e-05,2e-06,4e-06,1e-05,1e-05,1.6e-05,1.1e-05,4e-06,1.1e-05,1e-05,1.4e-05,1.2e-05,6e-06,7e-06,1e-05,1.6e-05,1e-05,1.6e-05,1.3e-05,1.2e-05,6e-06,1.4e-05,2e-06,6e-06,7e-06,1e-05,1.6e-05,1.3e-05,6e-06,8e-06,1.1e-05,6e-06,1.4e-05,1.1e-05,4e-06,1.9e-05,4e-06,3e-06,5e-06,3e-06,9e-06,6e-06,7e-06,1.1e-05,5e-06,5e-06,1.8e-05,1.2e-05,1.3e-05,2e-06,2e-05,3e-06,1.5e-05,1.3e-05,7e-06,7e-06,8e-06,4e-06,4e-06,5e-06,7e-06,9e-06,1.2e-05,2.4e-05,6e-06,1.2e-05,9e-06,9e-06,7e-06,5e-06,1.2e-05,1.1e-05,1.6e-05,7e-06,2e-06,5e-06,2e-06,9e-06,7e-06,7e-06,5e-06,5e-06,1.3e-05,6e-06,1.2e-05,1.3e-05,1.1e-05,1.5e-05,9e-06,3e-05,9e-06,1.1e-05,1.3e-05,5e-06,4e-06,1.7e-05,1.3e-05,6e-06,9e-06,2e-06,1.5e-05,2e-05
4e-06,1.3e-05,6e-06,2e-06,6e-06,6e-06,1e-05,9e-06,1e-05,1.1e-05,1.5e-05,1.1e-05,9e-06,4e-06,1.3e-05,4e-06,8e-06,1.3e-05,1.5e-05,7e-06,1.2e-05,5e-06,1e-05,1e-06,2e-05,4e-06,5e-06,2.4e-05,1.5e-05,1.8e-05,9e-06,9e-06,1e-05,7e-06,1.1e-05,2e-06,2.2e-05,9e-06,4e-06,4e-06,1.4e-05,1.5e-05,1.3e-05,1.6e-05,1e-05,1.7e-05,2.5e-05,1.2e-05,5e-06,5e-06,4e-06,1.3e-05,8e-06,1.4e-05,1.4e-05,1.3e-05,1e-05,4e-06,7e-06,1.1e-05,1.3e-05,1.5e-05,1.4e-05,5e-06,1.5e-05,1.6e-05,3e-06,1.2e-05,8e-06,2.5e-05,1.8e-05,2.1e-05,2.4e-05,1e-05,1.3e-05,1.3e-05,3e-06,8e-06,9e-06,4e-06,3e-06,5e-06,1.7e-05,2.1e-05,5e-06,1.2e-05,6e-06,7e-06,9e-06,1.4e-05,4e-06,1.6e-05,6e-06,5e-06,1.6e-05,6e-06,2.1e-05,4e-06,8e-06,9e-06,1.4e-05,1.5e-05,6e-06,1.5e-05,7e-06,9e-06,1.1e-05,1e-05,1.6e-05,6e-06,3e-06,3e-06,4e-06,7e-06,8e-06,1.6e-05,1.5e-05,4e-06,6e-06,1.3e-05,1.5e-05
1.1e-05,8e-06,1.6e-05,1.2e-05,1.3e-05,1.4e-05,1e-05,1.6e-05,1.7e-05,7e-06,5e-06,1.2e-05,2e-06,6e-06,1.6e-05,1.9e-05,1e-05,7e-06,6e-06,1e-05,5e-06,7e-06,7e-06,3e-06,1.6e-05,2e-06,7e-06,1.2e-05,1.7e-05,1.3e-05,4e-06,1.2e-05,1.5e-05,1.3e-05,2.4e-05,1.5e-05,2.7e-05,4e-06,7e-06,9e-06,8e-06,1.2e-05,1.3e-05,9e-06,9e-06,9e-06,1.4e-05,1.4e-05,7e-06,9e-06,8e-06,1.1e-05,1.7e-05,8e-06,2e-05,1.1e-05,7e-06,1e-05,1.5e-05,9e-06,1.4e-05,8e-06,1e-05,9e-06,1.6e-05,1e-05,8e-06,4e-06,6e-06,1.9e-05,9e-06,1.2e-05,1.1e-05,7e-06,1.4e-05,2.2e-05,1.7e-05,2.2e-05,5e-06,1.4e-05,1.2e-05,1.1e-05,7e-06,2.2e-05,1.2e-05,1.7e-05,1.4e-05,1.6e-05,6e-06,6e-06,1.2e-05,1.8e-05,5e-06,1e-05,1.1e-05,3e-06,1.9e-05,6e-06,7e-06,6e-06,1.2e-05,7e-06,1.3e-05,6e-06,1.5e-05,7e-06,9e-06,1e-05,2.8e-05,2.3e-05,1.6e-05,1e-05,6e-06,1.1e-05,1e-05,7e-06,7e-06,7e-06,3e-06,5e-06,1e-05
1.1e-05,1.4e-05,1.3e-05,1e-05,7e-06,8e-06,1.4e-05,1.9e-05,2.1e-05,6e-06,1.1e-05,1.6e-05,1.4e-05,1.7e-05,2.5e-05,1.6e-05,1.2e-05,7e-06,8e-06,3e-06,1e-06,1.1e-05,1.2e-05,1.5e-05,1.3e-05,1.2e-05,1e-05,3e-06,2.1e-05,2e-05,1.6e-05,1.4e-05,5e-06,1.1e-05,1.8e-05,1.2e-05,2.3e-05,3.1e-05,1e-05,1.8e-05,2.3e-05,4e-06,6e-06,9e-06,1.3e-05,9e-06,9e-06,1.4e-05,8e-06,7e-06,6e-06,1.4e-05,5e-06,2e-06,2.8e-05,1.9e-05,5e-06,1.9e-05,8e-06,1.6e-05,1.4e-05,1.4e-05,1.9e-05,1.4e-05,2e-05,8e-06,4e-06,1.3e-05,7e-06,1.9e-05,1.5e-05,8e-06,1.9e-05,3.1e-05,1.9e-05,1.4e-05,9e-06,9e-06,6e-06,2.1e-05,1.2e-05,7e-06,1.3e-05,4.3e-05,3e-05,3e-06,2.1e-05,1.3e-05,2e-05,2.1e-05,4e-06,1.1e-05,5e-06,1e-05,1.5e-05,1.2e-05,2.9e-05,6e-06,1.2e-05,1.4e-05,1.3e-05,1.1e-05,2e-05,6e-06,1e-05,1.4e-05,1e-05,1e-06,2.4e-05,3e-06,1.9e-05,2e-05,1.8e-05,1.7e-05,2.4e-05,1.7e-05,2e-05,2.5e-05,1.8e-05,1.3e-05,1.9e-05
7e-06,1e-05,1.3e-05,1.6e-05,1.6e-05,5e-06,2.2e-05,2.1e-05,1.4e-05,1.3e-05,9e-06,1.5e-05,1e-06,1.2e-05,9e-06,3.5e-05,5e-06,3e-06,1.1e-05,1.6e-05,9e-06,1.1e-05,1.9e-05,9e-06,1.3e-05,6e-06,1e-05,2.2e-05,1.6e-05,1.3e-05,6e-06,1e-05,4e-06,1.8e-05,1.6e-05,2e-06,1.2e-05,1.7e-05,6e-06,1.6e-05,1.9e-05,1.5e-05,6e-06,1.4e-05,6e-06,7e-06,1.4e-05,9e-06,1.4e-05,1.5e-05,1.7e-05,5e-06,1.4e-05,1.8e-05,1.7e-05,1.7e-05,1e-05,1.5e-05,1.9e-05,1.6e-05,1.4e-05,1.3e-05,1e-05,4e-06,3e-06,1e-05,4e-06,2e-05,1.5e-05,7e-06,1e-05,2.2e-05,1.2e-05,1.6e-05,1.8e-05,1e-06,1.5e-05,7e-06,4e-06,1.5e-05,1e-05,5e-06,1.5e-05,2.4e-05,3.1e-05,2.3e-05,9e-06,1.6e-05,2.1e-05,6e-06,2e-06,5e-06,9e-06,8e-06,3e-06,9e-06,1.7e-05,1.7e-05,8e-06,9e-06,1.6e-05,1.2e-05,1.4e-05,2.1e-05,6e-06,3e-06,4e-06,8e-06,7e-06,1.8e-05,1.3e-05,1.6e-05,1.5e-05,1.1e-05,1.2e-05,3e-06,1e-05,1.5e-05,2e-05,1.6e-05,1.4e-05
1.5e-05,7e-06,9e-06,8e-06,8e-06,7e-06,2.4e-05,8e-06,1.2e-05,6e-06,1.2e-05,1.2e-05,6e-06,1.5e-05,5e-06,2.2e-05,1.3e-05,1.3e-05,2.3e-05,1.3e-05,5e-06,8e-06,1.9e-05,1.6e-05,1.4e-05,4e-06,1e-05,2e-05,8e-06,3e-06,1.1e-05,1e-05,2e-06,1.7e-05,7e-06,5e-06,3e-06,2e-05,4e-06,1.8e-05,1.1e-05,4e-06,1.8e-05,1e-05,1.3e-05,1.1e-05,1.1e-05,1.6e-05,8e-06,8e-06,1.3e-05,1.6e-05,1.2e-05,1.1e-05,6e-06,6e-06,9e-06,1.1e-05,5e-06,1.5e-05,1.9e-05,2.1e-05,1.6e-05,2e-06,4e-06,9e-06,4e-06,1.2e-05,1e-05,9e-06,7e-06,1.9e-05,1.2e-05,7e-06,2e-05,1e-05,1.3e-05,2.5e-05,1.5e-05,1.4e-05,1.1e-05,6e-06,2e-05,1.8e-05,6e-06,2.5e-05,8e-06,3e-06,1.4e-05,6e-06,4e-06,1.2e-05,1.6e-05,1.6e-05,1.7e-05,9e-06,5e-06,9e-06,9e-06,1.5e-05,2e-06,1e-05,8e-06,1.8e-05,1.8e-05,1e-05,8e-06,1.3e-05,1.4e-05,1.7e-05,1.1e-05,2.8e-05,1.1e-05,1.8e-05,1.5e-05,6e-06,7e-06,1.2e-05,7e-06,4e-06,8e-06
2e-06,1.3e-05,1.3e-05,6e-06,8e-06,6e-06,1.4e-05,2e-05,1.4e-05,5e-06,4e-06,1.2e-05,6e-06,1.7e-05,5e-06,1.4e-05,3e-06,7e-06,1.2e-05,8e-06,9e-06,1.7e-05,1.4e-05,1.6e-05,1.8e-05,1.4e-05,2e-06,1.4e-05,2.3e-05,1.2e-05,7e-06,6e-06,6e-06,1.3e-05,2e-06,8e-06,5e-06,1.5e-05,1.3e-05,2.4e-05,1.2e-05,1.1e-05,1.3e-05,2.2e-05,1.4e-05,1.7e-05,5e-06,1.5e-05,1.2e-05,1.5e-05,1e-05,1.1e-05,1.9e-05,5e-06,1.3e-05,1e-05,3e-06,4e-06,9e-06,1.3e-05,3e-05,8e-06,1e-05,1e-05,9e-06,1.7e-05,6e-06,7e-06,1.3e-05,8e-06,1e-05,9e-06,7e-06,3e-06,1.6e-05,1.8e-05,2e-05,1e-05,9e-06,1.1e-05,1.4e-05,1.5e-05,1.8e-05,3e-06,7e-06,1.1e-05,2e-06,1.1e-05,7e-06,1.5e-05,1.2e-05,8e-06,1e-05,6e-06,1.5e-05,2e-06,1e-05,2e-06,4e-06,0,8e-06,1.2e-05,6e-06,7e-06,7e-06,5e-06,1.2e-05,1.1e-05,1e-05,7e-06,3e-06,1.8e-05,6e-06,1.4e-05,1.4e-05,6e-06,1e-06,3e-06,2e-06,5e-06,1.1e-05
3e-06,5e-06,3e-06,8e-06,3e-06,4e-06,1.1e-05,1.6e-05,1.7e-05,8e-06,5e-06,9e-06,5e-06,1.8e-05,9e-06,8e-06,5e-06,6e-06,1.1e-05,8e-06,1.1e-05,3e-06,1.1e-05,2e-06,1.8e-05,5e-06,6e-06,1.3e-05,1.8e-05,3e-06,1e-06,9e-06,6e-06,7e-06,1e-06,8e-06,6e-06,1.7e-05,1.2e-05,7e-06,3e-06,7e-06,4e-06,9e-06,7e-06,2e-06,4e-06,8e-06,8e-06,4e-06,3e-06,7e-06,1e-05,1e-05,7e-06,6e-06,5e-06,5e-06,1.4e-05,6e-06,1.7e-05,3e-06,5e-06,8e-06,5e-06,6e-06,2e-06,8e-06,8e-06,4e-06,5e-06,7e-06,3e-06,5e-06,7e-06,1.3e-05,6e-06,7e-06,3e-06,1.4e-05,1.3e-05,1.1e-05,1.9e-05,8e-06,1.4e-05,1.9e-05,4e-06,1.2e-05,5e-06,1.1e-05,7e-06,1.5e-05,1e-06,1.1e-05,9e-06,7e-06,7e-06,5e-06,6e-06,1.1e-05,1.3e-05,3e-06,2e-06,3e-06,1e-06,1e-05,1.2e-05,6e-06,6e-06,1.4e-05,4e-06,6e-06,4e-06,1.3e-05,5e-06,1e-05,9e-06,1.3e-05,1e-05,6e-06,1.4e-05
2e-06,3e-06,3e-06,4e-06,2e-06,4e-06,7e-06,1.3e-05,1.1e-05,3e-06,3e-06,7e-06,5e-06,9e-06,8e-06,1.5e-05,2e-06,3e-06,4e-06,4e-06,5e-06,8e-06,2e-06,6e-06,1.3e-05,3e-06,2e-06,1e-05,1.8e-05,7e-06,4e-06,8e-06,1e-06,6e-06,3e-06,7e-06,7e-06,1.1e-05,1e-06,1.2e-05,3e-06,7e-06,2e-06,5e-06,6e-06,1e-06,3e-06,1e-06,5e-06,2e-06,4e-06,3e-06,1.4e-05,6e-06,6e-06,2e-06,8e-06,4e-06,1.2e-05,3e-06,1.2e-05,5e-06,2e-06,3e-06,6e-06,8e-06,2e-06,3e-06,2e-06,3e-06,3e-06,1e-06,2e-06,7e-06,8e-06,6e-06,4e-06,4e-06,2e-06,8e-06,6e-06,6e-06,1.2e-05,9e-06,1e-05,2e-05,1e-06,7e-06,3e-06,9e-06,2e-06,1.4e-05,0,8e-06,9e-06,5e-06,1.1e-05,8e-06,7e-06,6e-06,6e-06,3e-06,4e-06,2e-06,5e-06,5e-06,6e-06,6e-06,3e-06,9e-06,4e-06,1e-05,2e-06,1.1e-05,1.2e-05,3e-06,7e-06,5e-06,5e-06,6e-06,7e-06
3e-06,2e-06,4e-06,5e-06,3e-06,2e-06,6e-06,1e-05,1.1e-05,2e-06,3e-06,6e-06,2e-06,1e-05,8e-06,1.3e-05,2e-06,1e-06,4e-06,5e-06,6e-06,8e-06,2e-06,3e-06,1.5e-05,4e-06,2e-06,8e-06,1.6e-05,8e-06,1e-06,7e-06,1e-06,5e-06,3e-06,5e-06,8e-06,9e-06,2e-06,1.4e-05,1e-06,9e-06,1e-06,5e-06,5e-06,2e-06,1e-06,1e-06,2e-06,2e-06,4e-06,4e-06,1.3e-05,4e-06,6e-06,1e-06,9e-06,4e-06,1.1e-05,1e-06,1.1e-05,3e-06,5e-06,4e-06,3e-06,9e-06,1e-06,3e-06,3e-06,0,3e-06,1e-06,1e-06,7e-06,5e-06,5e-06,3e-06,6e-06,1e-06,8e-06,6e-06,3e-06,1.2e-05,6e-06,1e-05,1.7e-05,1e-06,7e-06,2e-06,8e-06,2e-06,1.1e-05,2e-06,7e-06,9e-06,4e-06,1.1e-05,4e-06,8e-06,5e-06,3e-06,2e-06,4e-06,2e-06,5e-06,5e-06,5e-06,7e-06,2e-06,1e-05,5e-06,9e-06,4e-06,7e-06,9e-06,2e-06,4e-06,5e-06,3e-06,7e-06,3e-06
4e-06,1e-06,4e-06,3e-06,1e-06,2e-06,5e-06,1e-05,1e-05,1e-06,3e-06,5e-06,2e-06,1e-05,6e-06,1.4e-05,0,2e-06,4e-06,6e-06,6e-06,6e-06,3e-06,2e-06,1.3e-05,3e-06,1e-06,9e-06,1.7e-05,8e-06,1e-06,7e-06,1e-06,6e-06,3e-06,4e-06,8e-06,9e-06,1e-06,1.2e-05,1e-06,8e-06,1e-06,5e-06,4e-06,2e-06,1e-06,1e-06,2e-06,1e-06,5e-06,3e-06,1.4e-05,5e-06,6e-06,1e-06,8e-06,4e-06,1e-05,2e-06,1.1e-05,4e-06,4e-06,4e-06,3e-06,8e-06,1e-06,1e-06,3e-06,1e-06,4e-06,1e-06,0,6e-06,4e-06,3e-06,4e-06,5e-06,1e-06,8e-06,5e-06,3e-06,1.1e-05,6e-06,1.1e-05,1.9e-05,1e-06,6e-06,2e-06,8e-06,0,1.1e-05,1e-06,6e-06,9e-06,4e-06,1e-05,3e-06,8e-06,5e-06,3e-06,2e-06,4e-06,3e-06,3e-06,3e-06,5e-06,8e-06,3e-06,9e-06,5e-06,1e-05,2e-06,7e-06,9e-06,2e-06,4e-06,5e-06,4e-06,6e-06,5e-06
