-3.6e-05,-6.1e-05,-0.00013,-0.00032,-0.000402,-0.000537,-0.001102,-0.001113,-0.001486,-0.001236,-0.001305,-0.002965,-0.002952,-0.002324,-0.002269,-0.002177,-0.004241,-0.004342,-0.002409,-0.003248,-0.004003,-0.002101,-0.001892,-0.001821,-0.00132,-0.001673,-0.001858,-0.002859
-3.4e-05,-5.3e-05,-0.000108,-0.00031,-0.000427,-0.000539,-0.001158,-0.001459,-0.002233,-0.001385,-0.001362,-0.00337,-0.00303,-0.002183,-0.002202,-0.00228,-0.004668,-0.004309,-0.002257,-0.003961,-0.004966,-0.001935,-0.001959,-0.001975,-0.001171,-0.00152,-0.001806,-0.002598
5e-06,5e-06,-1.1e-05,6e-06,-4e-06,-2.3e-05,2e-05,-0.000321,-0.000733,-0.00019,1.1e-05,1e-06,0.000165,0.000219,0.000135,-8.9e-05,0.000374,0.000892,0.000308,-0.000429,-0.000195,0.000394,0.00021,0.000201,0.000287,0.000289,0.000345,0.000764
3.3e-05,4.6e-05,1e-04,0.000308,0.00041,0.000494,0.001089,0.001043,0.001413,0.001119,0.001238,0.003004,0.002807,0.002072,0.00203,0.00201,0.004706,0.004765,0.002353,0.003476,0.004612,0.001943,0.001839,0.001981,0.001216,0.001684,0.001929,0.00286
1.7e-05,3.6e-05,0.000108,0.000243,0.000324,0.000401,0.000795,0.001186,0.001909,0.001012,0.000843,0.002119,0.001964,0.001358,0.001435,0.00172,0.003062,0.002364,0.001298,0.003149,0.00369,0.000989,0.000955,0.001066,0.000465,0.000857,0.000888,0.001074
-2.2e-05,-1.7e-05,-4.5e-05,-0.000166,-0.000174,-0.000211,-0.000447,9.2e-05,0.000482,-9.7e-05,-0.000405,-0.001033,-0.001152,-0.000922,-0.000785,-0.000605,-0.002244,-0.002941,-0.00134,-0.000877,-0.001422,-0.000939,-0.00076,-0.000878,-0.000617,-0.001018,-0.001093,-0.00183
-3.1e-05,-4.9e-05,-0.00012,-0.000327,-0.000434,-0.000462,-0.00098,-0.000997,-0.001329,-0.001033,-0.000946,-0.002269,-0.002337,-0.00179,-0.001924,-0.001961,-0.004446,-0.004145,-0.001935,-0.003598,-0.004762,-0.001639,-0.001282,-0.001595,-0.000805,-0.001456,-0.001531,-0.002093
1e-06,-1.5e-05,-1.8e-05,-3.2e-05,-0.000113,-8.5e-05,-0.000261,-0.000846,-0.001524,-0.000624,-0.000336,-7e-04,-0.000446,-0.000212,-0.000375,-0.000606,-0.000803,0.000152,0.000105,-0.001743,-0.00214,-0.000148,-9.1e-05,-0.000198,8.7e-05,0.000115,8.2e-05,0.00049
2.8e-05,3.6e-05,6.3e-05,0.000229,0.000289,0.000257,0.000585,0.000149,-0.000196,0.00044,0.000435,0.000979,0.001239,0.001048,0.001283,0.000932,0.003251,0.003703,0.001495,0.001778,0.002786,0.001235,0.000788,0.001104,0.000567,0.00125,0.001268,0.001984
1.6e-05,3.6e-05,6.7e-05,0.000192,0.000286,0.000239,0.000628,0.000721,0.000995,0.000706,0.000558,0.001075,0.001003,0.000797,0.001025,0.001025,0.002859,0.002289,0.000863,0.002982,0.00411,0.000921,0.000394,0.000812,0.00022,0.000692,0.000704,0.000644
-1.3e-05,-1.3e-05,1.2e-05,-3.6e-05,-8e-06,1.7e-05,2.5e-05,0.000484,0.001096,0.00021,0.000129,0.000186,-3e-05,5.2e-05,-0.000251,0.000258,-0.00076,-0.00167,-0.00055,0.00076,6e-04,-0.000388,-0.000224,-0.00026,-0.000152,-0.000466,-0.000435,-0.001173
-1.9e-05,-3.7e-05,-7.9e-05,-0.000239,-0.000281,-0.000221,-0.000537,-0.000114,2e-04,-0.000454,-0.000319,-0.000346,-0.000514,-0.000641,-0.001078,-0.000695,-0.003127,-0.003346,-0.001317,-0.002367,-0.003418,-0.001038,-0.000359,-0.000879,-0.000271,-0.001088,-0.001004,-0.001305
2e-06,-8e-06,-5.9e-05,-0.000142,-0.000199,-0.000154,-0.000441,-0.000435,-0.000636,-0.000361,-0.000273,-0.000218,-0.000271,-0.000643,-0.000435,-0.000712,-0.001385,-0.000674,-0.000228,-0.002296,-0.003059,-0.000203,0.000132,-0.000241,-1.4e-05,-0.000318,-0.000259,0.000307
1.8e-05,2.3e-05,4.6e-05,0.000158,0.000134,9e-05,0.000131,-0.000317,-0.000814,6.9e-05,-7.2e-05,-0.000374,-0.000153,-3.2e-05,0.000622,8.3e-05,0.001824,0.002604,0.001084,0.000469,0.000666,0.000553,0.00021,0.000483,3.5e-05,0.000776,0.000651,0.001249
6e-06,1.3e-05,5.3e-05,0.000211,0.000248,0.000139,0.000466,2.9e-05,-0.000355,0.000163,9.1e-05,-0.000516,-0.000281,0.000411,0.000615,0.000414,0.002338,0.002299,0.000687,0.00216,0.003262,0.000372,-0.000179,4e-04,6e-06,0.000781,0.000591,0.000446
-1e-05,-1e-06,2e-05,3.4e-05,6.9e-05,7e-05,0.000307,0.000297,0.00042,0.000223,0.000291,0.000237,0.000238,0.000637,2.4e-05,0.000309,9e-06,-0.000716,-0.000392,0.001367,0.002141,4.8e-05,-0.000157,-4.6e-05,0.000138,-2.5e-05,-1.5e-05,-0.00068
-1.2e-05,-1e-05,-1.7e-05,-0.00016,-0.000174,-5.2e-05,-0.000184,0.000187,0.000689,-1e-05,8.6e-05,0.000984,0.000821,0.000284,-0.000479,4.5e-05,-0.002063,-0.002577,-0.000796,-0.000806,-0.001342,-0.000195,1.9e-05,-0.000423,7.3e-05,-0.000761,-0.000565,-0.000934
-2e-06,-1.3e-05,-6.4e-05,-0.000185,-0.000194,-0.000137,-0.000476,-2.8e-05,0.000368,-0.000207,-0.000221,0.000601,0.000329,-0.000623,-0.000454,-0.000233,-0.001381,-0.001248,-0.000332,-0.001944,-0.003106,-0.000348,0.000142,-0.000159,-7.7e-05,-0.00059,-0.000416,-7.1e-05
7e-06,-3e-06,-2.8e-05,1.2e-05,9e-06,-6.2e-05,-0.000185,-0.000102,-0.000214,-0.000109,-0.000172,-0.000614,-0.000728,-0.000853,0.000164,-0.000287,0.000981,0.00154,0.000542,-0.000714,-0.001283,-0.00019,0.000129,0.000307,-0.000142,0.000278,0.000176,0.000852
