-0.003661,-0.003604,-0.002377,-0.002672,-0.002548,-0.004138,-0.0029,-0.002902,-0.003592,-0.00182,-0.002359,-0.002301,-0.001444,-0.002096,-0.00359,-0.003518,-0.002135,-0.001622,-0.001308,-0.002158,-0.003319,-0.003838,-0.00278,-0.000588,0,-0.001728,-0.001102,-0.002004,-0.001743,-0.003725,-0.003462,-0.001708,-0.00229,-0.001898,0.00021,-0.000659,-0.002628,-0.00244,-0.002453,-0.002453,-0.00181,-0.002426,-0.001484,-0.001094,-0.001645,-0.001372,-0.000483,-0.000649,-0.0014,-0.00263,-0.001628,-0.001389,-0.001046,-0.00138,-0.001937,-0.00101,-0.001539,-0.001333,-0.002172,-0.002888,-0.001771,-0.002031,-0.001362,-0.001976,-0.001548,-0.001498,-0.004339,-0.00262,-0.001431,-0.001356,-0.001789,-0.002593,-0.002347,-0.00216,-0.001757,-0.001775,-0.001534,-0.002009,-0.001042,-0.001097,-0.001418,-0.001225,-0.001442,-0.000212,-0.000774,-0.001847,-0.000828,-0.000214,-0.001595,-0.000748,-0.000827,-0.000806,-0.001928,-0.002564,-0.001928,-0.001021,-0.001417,-0.001984,-0.002122,-0.000683,-0.000652,-0.00085,-0.001609,-0.001303,-0.001122,-0.001382,-0.000961,-0.000756,-0.002112,-0.001286,-0.001411,-0.002803,-0.001954,-0.001397,-0.001746,-0.002028,-0.001296,-0.001459,-0.001131,-0.001958,-0.001566
-0.000593,-0.000252,-0.001138,-0.000416,-0.000275,0.000148,-0.000214,8e-06,-0.00056,0.000733,-7.2e-05,-0.00039,-0.000796,-0.001145,0.001511,0.001131,-0.000802,-0.001176,-0.000692,0.000576,0.000139,0.001589,-4.1e-05,-0.001283,-0.002429,-0.001329,-0.001166,-0.001281,-0.001159,0.001352,0.000572,-0.000226,5.6e-05,-0.000263,-0.000891,-0.000742,0.000344,-0.001334,-0.000821,-0.00025,-0.000479,9e-04,-0.000798,-0.002007,-0.000773,-0.000136,0.000163,-0.001897,-0.000824,0.001046,-0.000779,-0.000382,-0.000229,-0.000716,-0.000671,-0.001064,-7e-04,-0.000215,0.000265,0.000744,0.00057,0.00042,-0.00064,0.000145,0.000682,0.001504,0.002302,0.000316,-0.000973,-0.000427,0.000547,0.000409,-3.8e-05,0.000627,-0.000354,-1.3e-05,0.000556,0.000574,-0.000391,-0.001197,-0.000411,-0.000155,0.000803,-0.000615,-0.000669,-0.001034,-0.000158,-0.001186,-0.000939,-0.001412,0.000119,-5.7e-05,0.000489,0.001094,0.000405,0.000407,-0.000228,-0.000621,-0.000893,-0.000612,-0.000566,-0.000429,0.000443,0.000502,0.000356,-2.4e-05,-0.001264,-0.001202,0.001275,0.000596,0.000605,0.000657,0.00038,1e-05,0.000342,0.000335,-3e-04,0.000414,-0.000134,0.00086,-7.5e-05
0.000304,0.00034,6.8e-05,0.000185,0.000994,0.000841,0.000196,-0.000131,0.000127,-0.001684,-0.001539,-0.000841,-0.000765,-0.001341,-0.002286,-0.002166,-0.001133,-0.001017,1.7e-05,-0.000663,0.000872,-0.000983,-0.000833,-0.000245,-0.00122,-0.001189,-0.000258,0.000946,0.00043,-0.000319,-0.001198,-0.000994,-0.000642,-4e-06,-0.000353,-0.000801,6e-05,0.000609,0.000351,0.000395,-0.000378,-0.001955,-0.000551,0.000169,-0.000126,-0.000293,0.000592,-0.000302,-0.001189,-0.001689,-5.1e-05,-0.001251,-0.001128,-3e-05,0.000133,-0.000299,-0.000699,-0.001244,-0.000388,-0.000563,-0.001382,-0.000807,-0.000252,-0.001752,-0.001537,-0.001272,-0.001287,-0.001205,-0.000246,-7.2e-05,-0.000216,-0.000543,-0.000189,-0.000629,-0.000537,-0.000537,-0.000373,0.000168,0.000299,0.000146,-0.000288,9.2e-05,-0.000648,-0.001329,0.000472,-0.000345,-0.000994,-0.000225,0.000404,0.000365,-0.000361,-0.000602,-0.000162,-0.00029,-0.000675,-0.001616,-0.000838,0.000186,-0.001227,-0.000512,-0.000438,-0.000235,0.000175,-0.000614,-0.000416,0.000529,-0.00018,8.3e-05,-0.00137,-0.000873,-0.001034,-0.000964,-0.00067,-1e-04,-0.000932,-0.000207,-0.000573,-0.000171,-0.000297,-0.000982,-0.000871
2.7e-05,2.7e-05,0.000443,0.000292,-0.000287,8.1e-05,0.000213,-0.00089,0.000896,0.001591,0.001522,0.001747,0.000896,0.001901,0.000287,0.001824,0.001782,0.001305,-0.000306,-5e-06,-0.000859,0.001108,0.000737,0.000364,0.001147,0.002079,0.000644,0.000339,8.1e-05,-0.000844,0.00143,0.000867,0.000992,2.2e-05,-0.000174,-0.000592,-0.000763,0.00045,0.00154,-0.000236,4.6e-05,0.001205,0.000346,0.000918,0.001228,1.2e-05,-0.001016,0.000998,0.001778,0.001052,0.001243,0.00122,0.001109,0.00043,0.000234,0.000256,0.000919,0.000743,-0.000326,0.000472,0.000414,0.000836,0.000764,0.001392,0.001257,0.000586,0.001116,0.0014,0.001258,0.000193,0.000438,0.000708,0.000402,0.000178,2.6e-05,0.000566,0,-0.000153,0.000515,0.000267,0.000447,0.000464,0.000385,0.000871,0.000215,0.000635,0.000848,-6.2e-05,0.000186,0.000112,0.000689,-1.6e-05,-0.000464,-0.000735,-0.000298,0.000743,0.001221,0.000533,0.001288,3.4e-05,0.00063,0.00048,8.6e-05,0.000485,-2e-05,-0.001813,0.000585,0.001134,0.000846,0.00079,0.000105,0.000381,0.000442,-6e-05,-0.000445,-0.00049,0.000721,0.00021,0.000382,0.000699,0.000461
-0.000916,-0.00063,0,0.000417,-7.2e-05,-0.000267,-0.000897,0.000723,-0.001623,-0.000721,-0.000122,-0.000895,-0.000774,-0.000114,4.6e-05,-0.000876,-0.001316,-0.000407,0.00033,-0.000416,0.000449,-0.000542,-0.000159,-0.00038,0.000605,-0.000311,-0.000594,-0.000995,-0.000665,-7.4e-05,-0.001631,7.4e-05,-0.000564,-0.000236,-0.000108,9.7e-05,0.000201,-0.000596,-0.00088,-0.000228,-0.000676,0.00034,-0.000383,0.000122,-0.000696,0.000288,-0.000328,-0.000471,-0.000197,0.000189,-0.000842,-2.6e-05,0.000107,-0.000217,2.9e-05,0.00015,-0.000163,-8.6e-05,0.000611,-0.000443,-0.000108,-0.000292,-0.000684,-0.000228,-0.000242,-0.000263,-0.001203,-0.000933,-0.000634,-0.000222,-0.000512,-0.000637,-0.000835,-0.000196,9.3e-05,-0.000157,0.00019,-0.000798,-0.001058,-0.000168,-0.000692,-0.000682,-0.000691,-0.000103,-7.5e-05,-8e-05,-6.1e-05,0.000113,-0.000311,-0.00013,-0.000307,-1.8e-05,0.000336,0.000688,0.000511,0.000158,-0.000674,-0.001224,-0.000279,-0.000166,-0.000252,-0.000289,-0.000238,-0.000495,-0.000351,0.000799,-0.000373,-0.000307,0.00014,-0.001193,8.1e-05,-4.5e-05,-0.000257,-6.2e-05,0.000843,0.00031,-0.000224,-0.000242,-0.000375,-0.000605,4.9e-05
0.000978,0.000507,-1e-06,-0.000755,2e-05,0.000426,0.000283,2.2e-05,0.000539,0.000243,-0.000199,-4.9e-05,0.00041,-0.000416,0.000324,-7e-06,0.00062,-2.2e-05,0.000235,0.000358,-0.000144,0.000385,0.000237,9.3e-05,-0.000124,-0.000371,0.000137,0.000635,0.000627,0.000208,0.000832,0.000229,0.00033,0.000287,0.000189,0.001059,0.000202,0.000319,0.00022,0.000112,0.000909,-0.00021,0.000182,-0.001046,-0.000481,-0.000708,0.000356,0.00049,-0.000853,-0.000248,0.000219,-0.00041,-0.000713,-0.000358,-5.6e-05,0.000198,-3e-06,0.00016,-0.000195,0.000608,-0.000369,0.000463,-2.4e-05,-0.000462,0.000134,-4e-04,0.000655,0.00088,-8e-06,6.5e-05,2e-04,0.000522,0.00077,0.000418,-9e-06,-0.000109,5.4e-05,0.000772,0.000432,-0.000285,0.000696,0.000277,-3e-06,0.000109,-0.000277,-5.1e-05,2e-04,5e-04,4.5e-05,-0.000295,-0.000569,-0.000342,-7.2e-05,-1.2e-05,4.6e-05,8.9e-05,-0.000276,0.000442,0.000115,0.000528,0.000389,0.000217,-3.6e-05,0.000358,-2.2e-05,0.000381,0.000123,-0.000718,-0.000388,0.000461,9e-06,0.000606,0.000201,0.000134,-0.000217,0.000972,0.000329,2.2e-05,0.000194,-4.4e-05,-0.000218
-0.000335,-0.000409,-8e-06,0.000127,-0.000513,-0.000365,-8.6e-05,0.000206,0.000101,-0.000631,1e-05,9e-06,0.000268,-0.00024,0.000207,0.00054,0.000492,0.000341,2.1e-05,0.000589,0.000235,-0.000814,-0.000263,-6.6e-05,-8e-06,-1e-05,0.000585,8.5e-05,0.000569,0.000539,-0.000397,-0.00018,0.000316,-0.00013,0.000681,-5.8e-05,-7.3e-05,-3.3e-05,-0.000431,0.000312,-0.000281,-0.000209,0.000612,0.00034,-0.000134,0.00085,3.3e-05,-9.4e-05,-8.5e-05,0.000172,-5.1e-05,0.000268,3.8e-05,-0.000103,-0.000132,-0.000159,-0.000148,6.4e-05,-0.000119,-0.000489,0.000299,0.000137,0.000539,0.000244,-0.000469,0.000445,-8.9e-05,-0.000228,0.000137,-0.000183,-0.000337,-0.000423,-0.000279,-9e-05,-0.000309,2.7e-05,0.000225,-0.000297,1.6e-05,0.000689,0.000322,0.000266,0.000443,0.000226,0.000264,0.000428,-0.000173,0.000179,0.000244,0.000241,9.3e-05,0.000189,0.00017,8e-06,0.000102,-0.000136,-0.000168,-3.1e-05,0.00019,-0.000138,-0.000259,0.000423,0.000307,-0.000368,0.000702,0.000266,-4.7e-05,0.000389,0.000172,-0.000107,0.000315,-0.000811,6e-06,-7.2e-05,0.000297,-0.000787,-0.000235,0.000171,-0.000547,0.000165,0.000468
-0.000261,0.000653,0.000143,0.000354,0.000728,-7e-05,-0.000285,-0.000381,-4.1e-05,-4.5e-05,0.000301,0.000352,0.000223,-0.000172,-0.000806,-0.000408,-0.000597,-0.000313,-0.000853,-1.6e-05,-0.000471,0.00058,0.000263,0.00029,4.6e-05,8.4e-05,-0.00024,2.9e-05,-0.00058,-0.000336,-0.000465,-0.000228,-0.000551,-6e-06,-0.000543,-0.00026,-7.7e-05,0.000336,0.000407,-0.000592,-6.3e-05,-0.000165,-0.000657,-2.7e-05,0.000409,-0.000237,0.000535,-0.000552,0.000536,-0.000289,0.000201,0.000361,0.00036,0.000255,3.3e-05,0.000404,6.6e-05,-5.9e-05,-0.000165,0.000154,-0.000186,-0.000515,-0.00026,0.000115,0.00021,-0.000471,0.000145,3e-06,-0.000171,0.00028,0.000177,0.000223,0.000216,8.7e-05,0.000532,5.5e-05,-0.000225,9.4e-05,-4.8e-05,-0.000211,-0.000194,0.000157,-0.000202,-0.000162,0.000261,-7e-05,-3.8e-05,-0.000134,0.000125,0.000171,0.000484,0.000259,-0.000221,-0.00011,-7.3e-05,-0.000313,0.000527,0.000422,7.9e-05,-0.000249,-0.000453,-0.000401,-0.000301,-3.4e-05,-0.000178,-0.000241,-0.000161,0.00016,-3e-06,0.000116,-0.000383,5.4e-05,-0.000262,0.000165,-0.000135,-2.3e-05,-0.000293,-0.00027,0.000228,-3.5e-05,-0.00019
0.000369,-0.000134,-4.3e-05,-0.000309,-0.00028,2e-06,0.000599,-0.000106,0.00047,0.000434,2.6e-05,0.000113,-0.000354,0.00051,0.000547,0.000634,0.000245,-0.000114,0.000376,-8.3e-05,-0.000182,0.000277,-0.000262,-0.00011,-0.000416,-0.000101,-0.00059,-0.000363,2.6e-05,-9.8e-05,0.000665,0.000527,8.3e-05,-0.000393,-0.000467,-3.6e-05,0.000564,-0.000505,-0.000202,0.000432,0.000217,8.3e-05,7.3e-05,-0.000294,-3.4e-05,-0.00023,-0.000331,0.000174,1.4e-05,0.000519,0.000411,5.3e-05,-5.1e-05,0.000301,5e-06,-9.9e-05,0.000137,0.00023,0.000419,0.000412,0.000178,-4.3e-05,0.000421,0.00022,8.7e-05,0.000341,0.000175,-5.5e-05,-9.1e-05,8.5e-05,0.000177,-2.3e-05,-0.00033,-0.000125,-0.000511,-0.000261,6.9e-05,-0.000167,0.000177,0.000162,-0.000161,-0.000343,-7.5e-05,-0.000158,6e-06,-0.000397,-2.1e-05,-0.000207,0.000109,-0.00026,-5.9e-05,-0.000176,0.00011,3.2e-05,-8e-06,-1.1e-05,-0.00023,-0.000489,-0.000272,-0.000185,7.9e-05,-0.000208,7e-05,0.000137,-0.000122,-1.6e-05,0.000354,-0.000142,0.000278,-0.000102,-5e-06,0.000147,-6.9e-05,2.5e-05,-6.1e-05,0.000314,6.2e-05,0.000165,-0.000126,-0.000216,4.2e-05
-0.000325,0.000153,4e-06,-0.00015,-0.00033,-0.000161,-2e-06,0.000334,-0.000323,-0.000284,-5.4e-05,-0.000476,-3e-05,-0.000315,0.000144,-9.7e-05,-9.1e-05,-0.000105,0.000271,-0.000174,8.7e-05,-0.000678,3.4e-05,-0.000257,-1e-06,-4e-05,0.000508,0.000237,0.000237,0.000139,8.8e-05,-0.000338,-0.000303,0.000338,0.000116,0.000152,-3.9e-05,0.000289,5.5e-05,4.3e-05,2e-06,-7.3e-05,0.00027,0.000633,-5.2e-05,-4e-06,-0.000212,0.00013,-3.8e-05,-0.000398,-0.000446,-0.000686,-7.6e-05,-0.000403,6.8e-05,-0.000164,-0.000166,5e-05,-0.000146,-0.00043,-0.000224,-8e-05,-0.000126,-0.000388,-6.4e-05,-2.1e-05,-0.000271,-0.000107,0.000168,0.000159,5e-05,2e-05,0.00019,0.000131,7.6e-05,0.000226,-1.3e-05,-8.5e-05,0.00021,-0.000222,-1.7e-05,1.1e-05,4.8e-05,-7e-05,-0.000311,0.000165,6.8e-05,8.6e-05,-2.7e-05,2.2e-05,-0.000153,-0.000153,-0.000271,-6.3e-05,-0.000203,0.000161,2.3e-05,0.000253,-1.9e-05,0.000154,0.000339,0.00017,0.000132,-0.00013,0.000143,0.000142,0.000243,0.000196,-0.000295,-9.9e-05,-0.000244,-0.000172,2.7e-05,0.000137,-2.9e-05,-0.000111,0.000238,0.000153,0.000257,0.000311,-0.000389
0.000209,-0.000194,0.000117,0.000277,0.00015,0.000304,-0.000309,-0.00026,-0.000177,-1.5e-05,-0.000234,0.000222,0.00022,0.000455,-0.000162,-0.00044,0.000246,0.000162,-0.000165,0.000184,0.000164,0.000224,-6e-06,0.000213,-1e-05,7.4e-05,0.000369,-2.1e-05,-0.00022,5.7e-05,-0.000189,0.000204,0.000652,9e-06,0.000139,0.000147,-0.000467,0.000172,6.2e-05,-0.000265,-8.6e-05,0.000369,0.000214,-0.000185,-8.8e-05,0.000106,0.000149,6.9e-05,-0.000133,-6.1e-05,-0.000196,0.000558,0.000163,5.6e-05,-0.000166,-4.1e-05,2.2e-05,-0.000283,-3e-05,0.00012,2e-04,0.000112,4e-06,0.000201,-4.5e-05,0.000194,-4e-06,2.8e-05,-0.000188,-0.000272,-0.000153,-0.000125,1e-06,-0.000139,1.2e-05,-0.000194,3.7e-05,0.000127,-0.000279,0.000159,0.000119,-1.6e-05,1.6e-05,8.4e-05,8e-05,0.000133,0.000108,0.000207,-0.000223,0.000119,9.7e-05,6.9e-05,0.000184,0.000104,0.000152,-7e-05,-0.000246,0.000106,2e-05,0.000247,-5e-05,8.2e-05,-8e-05,3e-05,-9e-06,-0.000249,-6.2e-05,-0.000215,-4.9e-05,0.000258,0.000342,7.2e-05,0.000146,-0.000179,0.000106,1.8e-05,-0.000218,0.000172,-8.8e-05,-0.000129,0.000203
7e-06,0.00024,0.000335,-0.000276,0.000355,9.2e-05,7.3e-05,0.000219,9e-06,0.000173,-0.000178,5.2e-05,-4.7e-05,-0.00011,-1.4e-05,-6.1e-05,-0.00029,-3.6e-05,-0.000105,1.2e-05,-0.000123,3.7e-05,7e-05,-9.5e-05,5.2e-05,0.000189,-0.000363,-0.000148,-5.3e-05,-9.6e-05,-5.8e-05,-0.000197,-0.000255,1e-05,4.8e-05,-0.000276,0.000119,1.8e-05,-0.000127,2.9e-05,0.000113,-8e-06,-8.8e-05,0.000114,1e-04,-2.7e-05,0.000202,0.000184,-0.000119,4.9e-05,0.000194,-0.000209,-0.000111,0.000187,0.000193,6.6e-05,0.000195,1.4e-05,5.5e-05,-9.7e-05,-0.000229,-0.000141,-0.000175,-1.3e-05,0.000147,-0.000391,-6.9e-05,0.000109,0.000126,0.000157,4.9e-05,5.4e-05,3.1e-05,0.000118,0.000163,0.000183,-2.7e-05,-0.000101,-0.000136,-9.8e-05,-5.4e-05,-0.000147,-0.000172,-2.9e-05,-0.000104,9.3e-05,-0.000113,7.5e-05,-6e-05,-0.000145,-2e-06,-6e-06,-7e-06,0.000132,1.4e-05,0.000168,2.4e-05,6.8e-05,1.3e-05,-0.000321,-0.000124,-0.000123,5.5e-05,0.00014,-4.5e-05,4.9e-05,-0.000224,-0.000137,1.2e-05,8.1e-05,-0.000194,9.2e-05,4e-06,4.3e-05,-8.2e-05,-0.000188,-1.3e-05,-0.000326,-0.000246,7.7e-05,-1.5e-05
-9.3e-05,-1.4e-05,-0.000474,0.000224,-0.000219,-6.4e-05,-7e-06,-0.000143,0.000108,6e-06,3.3e-05,-1.8e-05,6e-06,-7.8e-05,-7.3e-05,9.7e-05,-7e-05,-4.5e-05,1.7e-05,6.1e-05,0.000151,-3.3e-05,-0.000116,-5e-05,6e-05,-8.9e-05,-0.00029,4e-06,-4.1e-05,0.00016,-5e-05,-8e-05,-0.000187,-4.4e-05,-4.2e-05,0.000152,5.4e-05,-1e-06,-0.000187,8.7e-05,-0.000137,-0.000173,-0.00013,-0.000233,-2.2e-05,-7.3e-05,-0.000173,-0.000252,0.000108,0.000192,2.7e-05,-1.4e-05,0.00012,-0.000142,7e-06,0.000102,-0.000144,0.000128,6.8e-05,7.7e-05,0.000172,3e-05,5.7e-05,-0.000145,-7.5e-05,0.000122,7.9e-05,2.9e-05,-1.5e-05,-9.6e-05,5.9e-05,-5e-06,-5.8e-05,-9.2e-05,-0.000121,-0.00013,-0.000165,9.6e-05,7e-06,5e-06,2.8e-05,0.000218,5.9e-05,-7.3e-05,0.000186,-0.000145,1.5e-05,-0.000333,-2.5e-05,3.2e-05,-1.9e-05,-4.8e-05,-0.000132,6.5e-05,-2.6e-05,-8.6e-05,0.000254,-0.000182,-5e-05,0.000215,9.4e-05,-2.9e-05,-4.9e-05,-0.000136,7.3e-05,0.000111,3.9e-05,0.000209,0.000181,-0.000167,0.000131,-5.5e-05,-1.1e-05,9.5e-05,0,0.000221,0.000109,-4.3e-05,0.000265,4.1e-05,-6.1e-05
-3.4e-05,-8.4e-05,-6.9e-05,-0.000126,-4e-06,-5.2e-05,8e-06,0.000163,0.000136,7e-06,1.6e-05,8.9e-05,-0.000117,-0.000171,0.000157,9.3e-05,-3e-06,8e-05,0.000101,-0.000171,-3.9e-05,-0.000112,-7.2e-05,0.000154,-1.2e-05,5.3e-05,0.000203,0.000219,2.8e-05,-2.6e-05,2.7e-05,5e-06,0.000122,-7.6e-05,1e-06,-7.2e-05,1e-06,-0.000255,0.000227,5.5e-05,-5.4e-05,4.1e-05,-5e-05,5e-05,-0.000101,-5.1e-05,-4.9e-05,4.7e-05,4.6e-05,-8.7e-05,-5.6e-05,-7.6e-05,-5e-05,0.000101,-1.7e-05,-4.4e-05,-0.000114,-4.2e-05,-9.7e-05,4.4e-05,-2.3e-05,0.000145,-3.7e-05,1e-04,5e-05,4.4e-05,-0.000108,1.1e-05,-6.3e-05,0.000116,-6.9e-05,5.3e-05,-1.8e-05,5.5e-05,-2e-06,1.4e-05,-1e-06,-8.9e-05,1e-05,3.9e-05,0,4.5e-05,3e-05,0.000113,3.6e-05,4e-06,-2e-06,5.4e-05,0.000118,-8.2e-05,3.6e-05,6.3e-05,0.000168,-5.5e-05,4.6e-05,-6e-06,-9.8e-05,9e-06,3.3e-05,-5.4e-05,-6.3e-05,-0.000116,-1e-05,4.6e-05,-7.8e-05,-3.4e-05,-6.8e-05,-0.000121,-6.1e-05,5.4e-05,-6.3e-05,-0.00011,-1.2e-05,5e-06,-4e-06,-7.9e-05,-8.7e-05,9.4e-05,-6.6e-05,-8.5e-05,8e-05
3.4e-05,2.7e-05,5.1e-05,-1.6e-05,5.2e-05,-3e-06,1.2e-05,-5.5e-05,-3.2e-05,0,-3e-05,-1.4e-05,3e-05,6.4e-05,-8e-05,-8.4e-05,4e-05,1.2e-05,-0.000155,-6.9e-05,-2.2e-05,-3e-06,0.000151,-0.000123,-2.1e-05,-3e-06,0.000157,-0.000203,4e-05,3.4e-05,3.1e-05,5e-05,0.00011,0.000133,8e-05,-7e-05,-5.8e-05,2.6e-05,-7.1e-05,-5.8e-05,7.1e-05,-0.000104,6.3e-05,-4.7e-05,0.000141,8.8e-05,5.2e-05,-9e-06,0.000105,2.5e-05,1.8e-05,1e-06,-9.8e-05,-9.7e-05,-3e-06,-7.2e-05,4.5e-05,4.3e-05,6.5e-05,-3.7e-05,-0.000118,5.3e-05,1.2e-05,-0.000108,-3.7e-05,0.000103,1e-06,1e-06,5.4e-05,-5.9e-05,-8.7e-05,-5.4e-05,3.2e-05,-2.5e-05,6e-05,-1.2e-05,7.3e-05,3.1e-05,9.2e-05,1.2e-05,9.8e-05,-0.000137,2.9e-05,3.2e-05,-6.2e-05,-1.6e-05,-7e-05,0.000113,-4.3e-05,-4.6e-05,1e-06,-3.9e-05,-3.3e-05,-5.1e-05,-3.5e-05,-5.5e-05,8.9e-05,5.6e-05,4.9e-05,-5.8e-05,3.8e-05,3.4e-05,-4.9e-05,-4.2e-05,-5.7e-05,3e-05,1.7e-05,-2.6e-05,-1.5e-05,7.6e-05,3.8e-05,0.000129,-4.4e-05,-2.5e-05,-3.5e-05,-6.4e-05,5.6e-05,-1.6e-05,-4.8e-05,1.9e-05,4.9e-05
-6e-06,-0.000177,0.00011,4.8e-05,-2.2e-05,-2.3e-05,-3.2e-05,1.9e-05,-0.000124,-7.6e-05,4.7e-05,-4e-05,8.5e-05,-1e-05,-0.000109,4e-06,5.6e-05,0,8.9e-05,-3.7e-05,-1.4e-05,2e-05,-1.2e-05,0.000118,5.9e-05,-6.3e-05,2.3e-05,3.1e-05,-3.8e-05,4.4e-05,1.1e-05,-6.2e-05,-0.000168,-0.000111,-3.7e-05,-1.4e-05,4.2e-05,3e-06,3.5e-05,3.9e-05,-2.5e-05,-1.5e-05,6e-06,1.2e-05,-5.1e-05,8.3e-05,3.1e-05,-4.8e-05,3e-05,-4.2e-05,1.7e-05,-1.1e-05,4.3e-05,4.5e-05,-1e-05,3.9e-05,3.8e-05,-5e-06,-1e-05,-2.8e-05,8.9e-05,-0.000116,-1.9e-05,-4e-06,-4.2e-05,-0.000159,4.3e-05,-4e-05,-1.3e-05,-5.1e-05,5.1e-05,2e-05,9e-06,-3.3e-05,-8.6e-05,4e-06,-3.7e-05,1e-05,-5.4e-05,-4.3e-05,-3.3e-05,4.9e-05,-2.4e-05,-7e-06,2e-06,4e-05,6e-05,-3.3e-05,4e-06,5.5e-05,-9e-06,-2.9e-05,-2.2e-05,-3e-05,5.6e-05,3.5e-05,-5.3e-05,4.4e-05,4e-06,-1.3e-05,-5.5e-05,7.2e-05,4.5e-05,-3e-05,5.4e-05,9e-06,8.9e-05,5.2e-05,-3e-06,-5.2e-05,-1e-06,-7.8e-05,-1e-06,-2.6e-05,2e-06,7.7e-05,-3.3e-05,-7e-06,-8.6e-05,5.6e-05,-7e-05
2.5e-05,8.4e-05,-5.5e-05,-0.000102,-4e-06,2.3e-05,4.9e-05,1e-05,-2.3e-05,-7.1e-05,-3e-06,-3e-06,-5.2e-05,2.8e-05,8.3e-05,2e-06,7e-05,1.2e-05,2.7e-05,0.000156,-2.7e-05,7.7e-05,1.6e-05,-3.7e-05,-4.2e-05,9e-06,-0.000165,-5e-06,3.2e-05,-4.1e-05,6e-05,9e-06,1.8e-05,8.5e-05,2.9e-05,1.2e-05,-1.3e-05,9.1e-05,-8e-06,-5.4e-05,-1.6e-05,1.9e-05,-3.5e-05,1.1e-05,-1.2e-05,-8.5e-05,-8.4e-05,3e-05,-0.000129,1e-05,-5e-06,3.5e-05,5.9e-05,-6e-05,-1e-05,2.3e-05,4.8e-05,-2.8e-05,-1.1e-05,1.5e-05,-5e-06,2.5e-05,-4.6e-05,0.000126,2.6e-05,3e-05,3e-05,-2e-06,-2.6e-05,-5.3e-05,-1.3e-05,6e-06,-3e-05,5.5e-05,2.1e-05,6e-06,-1e-06,1.9e-05,-4.4e-05,1.6e-05,-3.4e-05,-5e-05,-1.9e-05,2e-05,-5.1e-05,-2.7e-05,-7e-06,-2.1e-05,-6.2e-05,6e-06,-1.2e-05,2.7e-05,-5.3e-05,1.9e-05,1e-05,-1.3e-05,-9.5e-05,1.3e-05,2.8e-05,-1.7e-05,1.1e-05,-1.1e-05,1e-06,4.5e-05,-4.5e-05,9.2e-05,-4.5e-05,-6e-05,-3.4e-05,-2.1e-05,0,-5e-06,-1.4e-05,1.4e-05,-4e-05,-3e-05,-8e-06,3.9e-05,5e-05,-1.1e-05,5.7e-05
-1.8e-05,7e-05,-5.9e-05,8.3e-05,2.4e-05,1e-06,1e-06,-3.6e-05,7.4e-05,0.000125,4.1e-05,-3e-06,4.7e-05,4.8e-05,3.5e-05,-8e-06,-9.3e-05,-9e-06,2e-05,-5.6e-05,1e-05,-3.2e-05,-1.9e-05,5e-06,-1e-06,-2e-05,-1.7e-05,8e-06,5e-06,-2e-06,-2e-05,2.8e-05,-2e-05,-2.5e-05,-7e-06,-1.4e-05,-4.9e-05,-3.4e-05,-6.9e-05,5.6e-05,1.9e-05,4e-05,2.7e-05,-3.5e-05,-2e-06,7e-06,3.5e-05,1.2e-05,2e-06,-4e-05,1e-06,4.7e-05,-6.4e-05,6.1e-05,-4e-06,0,-1.3e-05,1.8e-05,-1.4e-05,-2e-06,-3.5e-05,-1.3e-05,-1e-05,-4e-05,-3.6e-05,0,-2.7e-05,-3e-06,1.6e-05,1.3e-05,6e-06,-4e-06,9e-06,-3.2e-05,-1.7e-05,-9e-06,5e-06,-9e-06,2e-05,5e-06,2.3e-05,5.7e-05,-1.1e-05,-1.7e-05,6e-05,5e-06,-1.2e-05,-2.2e-05,3.2e-05,-7e-06,8e-06,8e-06,4.1e-05,-5.1e-05,-6e-06,-2.4e-05,9.4e-05,-0.000101,-1.2e-05,3.9e-05,6.1e-05,1e-06,-1.4e-05,-3.1e-05,-1.1e-05,-8.2e-05,-1.8e-05,6.1e-05,1.1e-05,-2.9e-05,-2.8e-05,1.3e-05,-5e-06,-4.7e-05,1.2e-05,1.3e-05,3.3e-05,-4.8e-05,3.7e-05,-5e-06,-2.7e-05
-2e-06,-3.2e-05,6.4e-05,-1.2e-05,-1e-05,6e-06,-6.7e-05,1.1e-05,-1.8e-05,1.6e-05,1.7e-05,1.4e-05,-6.5e-05,-1e-06,-4.2e-05,6.4e-05,4.6e-05,-1.7e-05,-9.9e-05,-9.2e-05,3.5e-05,-2e-05,-5e-06,4e-06,1.3e-05,-2.7e-05,9.3e-05,3.1e-05,-1.6e-05,3.7e-05,-6.9e-05,7e-06,4e-05,3e-05,-1.5e-05,1.1e-05,3.5e-05,2e-06,4.5e-05,-6.1e-05,3.2e-05,2.1e-05,2.1e-05,1.5e-05,-1e-05,-1.4e-05,7e-06,2.1e-05,2.9e-05,5.3e-05,2.7e-05,4e-06,1e-05,-1.8e-05,1.6e-05,-3.6e-05,-6.1e-05,-5e-06,2.8e-05,2e-06,4.9e-05,-3e-06,9e-06,-3e-06,4.8e-05,2.7e-05,-3e-06,-2e-05,-6e-06,8e-05,1.5e-05,1.2e-05,-9e-06,4e-06,2.9e-05,1.1e-05,0,6e-06,-1.7e-05,-1.2e-05,1.2e-05,-1.2e-05,3.8e-05,4e-06,-1.1e-05,-9e-06,-4e-06,2.2e-05,1.3e-05,9e-06,3e-05,-2.4e-05,-6e-06,-1e-06,3.8e-05,6.7e-05,-1.4e-05,1.6e-05,-1e-06,2.2e-05,-2.3e-05,2.5e-05,-3.2e-05,2.9e-05,3.2e-05,1.8e-05,-2.3e-05,3.8e-05,3.8e-05,5e-05,3.4e-05,3.2e-05,3.4e-05,1e-06,-2e-06,-2.1e-05,-4.1e-05,-3.9e-05,-1.1e-05,7e-06,9e-06
9e-06,-3.6e-05,-1.3e-05,-2e-06,-5.6e-05,1.8e-05,3.3e-05,-1.3e-05,6.9e-05,-6.3e-05,2e-06,-3.8e-05,3.6e-05,-7.5e-05,-7e-06,8e-06,-2.2e-05,3e-06,5.9e-05,4.2e-05,1.6e-05,4.1e-05,1.4e-05,3.7e-05,-1e-05,4e-05,-1.3e-05,-6.4e-05,1.8e-05,-4.6e-05,4.2e-05,-5e-06,4.5e-05,-7e-06,8e-06,1.2e-05,4.3e-05,4.7e-05,-9e-06,6.5e-05,-3.3e-05,-2.1e-05,-1.2e-05,-3.1e-05,2.8e-05,4.6e-05,-5.2e-05,-6e-06,9e-06,-1.1e-05,-3.6e-05,-6.8e-05,2.9e-05,-2e-06,-1e-06,-1e-05,1e-06,-1.9e-05,-1e-06,3.3e-05,-1.3e-05,-3e-05,0,3.5e-05,-1.3e-05,-2e-05,-4e-06,3e-06,-1.8e-05,-3.5e-05,-1.6e-05,-2e-05,2.1e-05,8e-06,-2.8e-05,-1.7e-05,2.1e-05,-2e-05,4.3e-05,-3e-06,-2e-05,-3.2e-05,-1.6e-05,1e-05,-5e-06,9e-06,0,3.7e-05,3.2e-05,-1.3e-05,-4e-06,1.6e-05,1e-06,-3e-06,-2.6e-05,-2.9e-05,5.2e-05,2.3e-05,-1e-06,-4.7e-05,-1.8e-05,8e-06,1.8e-05,-2e-05,-2.6e-05,-2.7e-05,-9e-06,-4.4e-05,-2.6e-05,1.4e-05,-2.8e-05,-5e-05,-2e-06,5.8e-05,1.5e-05,4.1e-05,1.6e-05,2e-06,-2e-06,-1.7e-05,-5e-06
-8e-06,6e-06,-2.5e-05,-3e-06,6.7e-05,-1.3e-05,1.8e-05,1e-06,-6.5e-05,6.3e-05,-2.5e-05,1e-05,-1.6e-05,4.1e-05,1.3e-05,7e-06,-1.1e-05,-6e-06,5e-06,3.4e-05,-4e-06,-3.3e-05,-4e-06,-5e-05,-2.9e-05,-4e-06,-7.4e-05,3.9e-05,-1.6e-05,4e-06,-2.1e-05,2.5e-05,-2.2e-05,-2.3e-05,9e-06,-1.8e-05,-3.9e-05,-5.1e-05,3.8e-05,-2.8e-05,1.3e-05,5e-06,-7e-06,2.8e-05,-1.7e-05,-2.3e-05,7.5e-05,-6e-06,2.4e-05,0,-4e-06,5e-05,-4.7e-05,-3e-05,9e-06,2.2e-05,-6e-06,1.7e-05,2e-06,-3.8e-05,-2.9e-05,2.7e-05,3.2e-05,-2.3e-05,1.6e-05,1.4e-05,1.8e-05,7e-06,2.1e-05,-2.8e-05,-8e-06,8e-06,-4e-06,-1.2e-05,3.5e-05,6e-06,-2.1e-05,6e-06,3e-06,-6e-06,-4.6e-05,-2.8e-05,-2.3e-05,-4e-06,-3.1e-05,-5e-06,1.4e-05,-2.2e-05,-2e-06,-8e-06,-8e-06,-1.2e-05,-9e-06,7e-06,1.9e-05,1.1e-05,-7e-05,2e-06,-1.8e-05,2.2e-05,1.7e-05,-1.3e-05,9e-06,1e-05,1.6e-05,4.9e-05,-1e-06,1.5e-05,-1.8e-05,-2e-06,2.7e-05,2.2e-05,-3e-06,-6e-05,-7e-06,-2e-06,1e-05,2.4e-05,-1e-05,2.2e-05,-2e-06
2e-06,-3e-06,9e-06,2.1e-05,-3.3e-05,-8e-06,4e-06,2.3e-05,-2.5e-05,-2.8e-05,1.8e-05,6e-06,1.5e-05,-4.2e-05,1.6e-05,-5.1e-05,1.1e-05,-1.3e-05,0,1.1e-05,4e-06,6e-06,3e-06,5e-05,2.8e-05,1.3e-05,1e-06,-2.9e-05,1.2e-05,2e-06,1.4e-05,-1.2e-05,-1.3e-05,1.9e-05,-2.4e-05,2.9e-05,-6e-06,-2e-06,-3e-06,1e-06,8e-06,-1.5e-05,-4e-06,2e-06,-2e-06,-1.4e-05,-4.1e-05,-4e-06,-1e-06,-4e-06,0,4e-06,5e-06,3.2e-05,-3e-06,7e-06,7e-06,-1.5e-05,5e-06,1.1e-05,1.7e-05,1.3e-05,-9e-06,1.8e-05,-2.2e-05,-2e-06,-1e-06,-5e-06,-6e-06,-2.4e-05,6e-06,-5e-06,-8e-06,7e-06,-5e-06,-2.1e-05,-7e-06,3e-06,-2.7e-05,1.1e-05,1.6e-05,5.1e-05,1.7e-05,-5e-06,1.2e-05,-8e-06,-2.6e-05,-2.7e-05,-1.7e-05,1.2e-05,-5e-06,7e-06,7e-06,-1e-05,1e-06,2e-06,-6e-06,1e-06,-2e-06,3e-06,-6e-06,-2.7e-05,-1e-05,-2e-06,-3e-06,-5.6e-05,1.9e-05,-8e-06,0,-1.6e-05,-1.6e-05,1.5e-05,4e-06,3.9e-05,2e-06,-4.9e-05,-1.6e-05,1.6e-05,1.3e-05,1.1e-05,-5e-06
6e-06,1.2e-05,3.7e-05,-4.3e-05,-1e-06,-1.6e-05,-1e-05,2e-06,1.5e-05,-3.6e-05,-5e-06,-1.1e-05,-1.2e-05,-2e-06,-3.5e-05,-3e-05,0,-4e-06,-3.5e-05,5e-06,-1.9e-05,-2e-06,-1e-06,-2.8e-05,-4e-06,6e-06,6.4e-05,2.8e-05,-9e-06,-1.5e-05,3.1e-05,-9e-06,-3e-06,-1.8e-05,2.4e-05,-2.2e-05,2.6e-05,-2e-06,-1.5e-05,-1.6e-05,-1.3e-05,-3.2e-05,1.2e-05,5e-06,1.2e-05,-2.9e-05,-1.1e-05,-1.7e-05,-4e-05,5e-06,1.2e-05,-1e-05,2.7e-05,-1.1e-05,3e-06,-9e-06,1.1e-05,-7e-06,3e-06,-1e-05,9e-06,5e-06,8e-06,2e-06,1.5e-05,2.6e-05,-5e-06,1e-05,-9e-06,3.1e-05,1.8e-05,7e-06,2e-06,1e-06,-1.7e-05,9e-06,1.7e-05,-1.2e-05,-4e-06,-2.1e-05,1.4e-05,-1.2e-05,9e-06,7e-06,-6e-06,-1e-06,1.3e-05,1e-05,-4e-06,-6e-06,5e-06,3e-06,-9e-06,0,-1.2e-05,-1.6e-05,2.9e-05,-2.5e-05,-5e-06,-1.7e-05,-1.2e-05,-9e-06,0,-1.4e-05,-8e-06,1.1e-05,2.5e-05,-1.9e-05,1.6e-05,-1.5e-05,9e-06,-2.9e-05,-1.4e-05,-4e-05,-1e-05,4.7e-05,9e-06,8e-06,-2e-05,-3e-05,6e-06
-7e-06,1.8e-05,-1.1e-05,2.5e-05,6e-06,0,-1.2e-05,-1.2e-05,3e-06,4.5e-05,-1.4e-05,1.5e-05,5e-06,3.5e-05,-3e-06,3.4e-05,0,3e-06,3.3e-05,-4.2e-05,-1e-05,2.3e-05,1e-06,4e-06,2e-06,-1.8e-05,7e-06,-1.5e-05,-2e-06,2e-05,-4.1e-05,9e-06,2.9e-05,2.5e-05,-5e-06,1.8e-05,-7e-06,1.6e-05,9e-06,2e-05,-3e-06,1.7e-05,7e-06,9e-06,-9e-06,6.3e-05,3e-06,2e-05,-1e-05,-2e-06,-6e-06,-1.9e-05,-2e-05,-1.4e-05,-1.1e-05,-6e-06,0,9e-06,-1.8e-05,1e-05,-2.6e-05,-5e-06,-4e-06,6e-06,-2.1e-05,-4e-05,-5e-06,-1e-06,1.4e-05,7e-06,-7e-06,-6e-06,-2e-06,-1.3e-05,1.1e-05,-1.1e-05,3e-06,1.4e-05,-6e-06,1.7e-05,3e-06,1.5e-05,-1.1e-05,1.3e-05,4.4e-05,5e-06,5e-06,2.9e-05,-7e-06,-2e-06,6e-06,-6e-06,2.5e-05,0,1.2e-05,-3e-06,-1.8e-05,7e-06,0,6e-06,5e-06,1.9e-05,3e-06,9e-06,1.3e-05,4e-06,-2.6e-05,3.4e-05,3e-06,3e-05,-5e-06,0,-7e-06,3.3e-05,8e-06,-7e-06,2e-06,-8e-06,1e-06,1.2e-05,7e-06
6e-06,-5.2e-05,-1e-05,-2e-06,1e-06,1.4e-05,5e-06,3e-06,3.4e-05,-2.5e-05,-1.4e-05,-1.1e-05,-9e-06,5e-06,3.2e-05,1.5e-05,4e-06,-2e-06,1e-05,1e-05,-9e-06,-6e-06,-2e-06,2.1e-05,1e-05,2e-06,-4.8e-05,3e-06,3e-06,-1.1e-05,2e-05,2e-06,-4.2e-05,-2.5e-05,-1.6e-05,-1.7e-05,-1.1e-05,7e-06,-1.9e-05,-7e-06,4e-06,1.6e-05,-1e-05,-2.8e-05,-1.3e-05,-2.2e-05,2.3e-05,-1.5e-05,1.3e-05,6e-06,4e-06,2.1e-05,6e-06,3.7e-05,-2e-06,1.1e-05,-1.2e-05,-3e-06,-5e-06,1.3e-05,1.7e-05,1e-06,1.6e-05,-5e-06,7e-06,3e-06,-6e-06,-5e-06,-8e-06,2.6e-05,-1.1e-05,-1e-06,5e-06,7e-06,-8e-06,7e-06,-1.7e-05,-2.1e-05,1e-05,-5e-06,-2.1e-05,-1.2e-05,-4e-06,1e-06,-4e-05,1e-06,-1.8e-05,-9e-06,1.4e-05,2e-06,-6e-06,-3e-06,-2e-05,5e-06,-1.9e-05,1.2e-05,4.2e-05,1.4e-05,8e-06,0,-2e-06,-6e-06,7e-06,-4e-06,3e-06,9e-06,1.1e-05,-9e-06,-8e-06,-3e-06,5e-06,2.1e-05,3e-06,-9e-06,1e-06,-1.1e-05,-8e-06,-2.2e-05,1.5e-05,1e-05,1.2e-05
-6e-06,1.1e-05,2e-06,-1.3e-05,-3e-06,7e-06,4e-06,3e-06,-1.4e-05,-9e-06,1.8e-05,-3e-06,1.3e-05,-1e-06,-2e-06,-1.6e-05,-1e-05,0,-3.2e-05,4.2e-05,8e-06,-3e-05,7e-06,-4.1e-05,-5e-06,-1.2e-05,-1.7e-05,-3e-06,0,-1e-05,-1.4e-05,-2.4e-05,-2.4e-05,1.4e-05,2e-05,1.5e-05,9e-06,2.1e-05,1e-05,6e-06,1.5e-05,1.1e-05,-2e-06,1.5e-05,1.7e-05,-1.1e-05,-8e-06,1e-05,1.5e-05,-1e-05,-2e-06,-2.5e-05,1e-05,-4.5e-05,-2e-06,2e-06,-1e-06,3e-06,1.2e-05,-1.8e-05,-2e-06,-3e-06,1e-06,4e-06,2e-06,1.7e-05,9e-06,4e-06,-6e-06,-1.4e-05,3e-06,3e-06,-5e-06,2e-06,1e-05,0,3e-06,2.1e-05,2.1e-05,2e-06,4e-06,-1.5e-05,-1e-06,0,2.3e-05,-1e-06,1.3e-05,-1.3e-05,-5e-06,-6e-06,3e-06,4e-06,-6e-06,7e-06,1.4e-05,-4e-06,-3.6e-05,-9e-06,4e-06,7e-06,1.1e-05,-9e-06,-5e-06,4e-06,-7e-06,-1.8e-05,-1.5e-05,-1.1e-05,2e-06,-2.3e-05,-8e-06,-9e-06,0,4e-06,2e-06,0,5e-06,6e-06,3e-06,-1.2e-05,-7e-06
-2e-06,2.8e-05,2.2e-05,1.1e-05,2e-06,7e-06,-5e-06,-7e-06,-2.9e-05,3.9e-05,-8e-06,4e-06,-1.4e-05,-6e-06,-2.1e-05,-3e-06,6e-06,3e-06,7e-06,-6e-06,1e-05,2e-05,2e-06,4.2e-05,-1.2e-05,-3e-06,4e-05,0,-5e-06,1.5e-05,-1.7e-05,1.2e-05,4.1e-05,-6e-06,-8e-06,-1.3e-05,1.2e-05,-9e-06,7e-06,0,-1.2e-05,-5e-06,7e-06,-2.8e-05,-2e-06,-6e-06,-2.1e-05,9e-06,1.7e-05,5e-06,-3e-06,5e-06,-1.6e-05,2.3e-05,0,-6e-06,-2e-06,0,-3e-06,1e-05,-2e-05,-1.2e-05,9e-06,-4e-06,0,4e-06,1e-06,-4e-06,1.1e-05,-8e-06,-3e-06,-2e-06,0,-9e-06,-1.3e-05,-5e-06,3e-06,-1.1e-05,-1.1e-05,-7e-06,1.8e-05,1e-05,9e-06,5e-06,-3.3e-05,0,3e-06,-1.2e-05,9e-06,0,-1e-06,-7e-06,1.3e-05,8e-06,0,3e-06,-1e-06,-3e-06,8e-06,-4e-06,3e-06,1e-06,-5e-06,-1e-06,4e-06,3e-06,4e-06,7e-06,-3e-06,2e-06,9e-06,-1.4e-05,4e-06,4e-06,-6e-06,1.2e-05,-2e-06,1.6e-05,-9e-06,1e-05,6e-06
3e-06,0,-3.8e-05,-1e-06,5e-06,-7e-06,7e-06,1.2e-05,-4e-06,-1.2e-05,-4e-06,-2e-06,1e-05,-7e-06,-4e-06,-1e-05,1e-06,-3e-06,7e-06,-2.5e-05,1.6e-05,-2e-06,-3e-06,-3.8e-05,1.2e-05,9e-06,1.6e-05,1e-06,3e-06,-7e-06,3.1e-05,1e-06,2.1e-05,2e-06,-6e-06,1.1e-05,-1.7e-05,-2.4e-05,-1e-05,-6e-06,2e-06,3e-06,-2e-06,2.5e-05,-9e-06,1.5e-05,1.7e-05,-1.9e-05,-2.6e-05,-4e-06,2e-06,1.6e-05,3e-06,-6e-06,4e-06,1e-06,3e-06,-1e-06,5e-06,-1.7e-05,1.9e-05,2e-06,-6e-06,-6e-06,1.4e-05,-1.8e-05,-5e-06,0,-8e-06,1.4e-05,-2e-06,2e-06,2e-06,6e-06,1.3e-05,-1e-06,3e-06,7e-06,-1e-05,1.5e-05,-3e-06,1e-05,1e-06,-3e-06,2.9e-05,0,-1e-06,2.7e-05,-1.7e-05,0,-8e-06,4e-06,-3e-06,6e-06,-8e-06,2e-06,0,0,5e-06,-3e-06,-9e-06,1e-05,3e-06,2e-06,2e-06,1.7e-05,2.2e-05,-1.8e-05,-4e-06,1e-05,-7e-06,2.3e-05,8e-06,-1.1e-05,3e-06,5e-06,-4e-06,0,-3e-06,-8e-06,-9e-06
-4e-06,5e-06,6e-06,-1.2e-05,-8e-06,-7e-06,3e-06,-1.9e-05,1.8e-05,-1.3e-05,1.1e-05,8e-06,-8e-06,-1.1e-05,1.5e-05,1e-05,2e-06,0,1.6e-05,-3e-06,0,0,-3e-06,2.5e-05,0,-1e-06,-2.9e-05,7e-06,-2e-06,-4e-06,-1.3e-05,-1e-05,-2.4e-05,0,1.3e-05,-9e-06,-5e-06,7e-06,8e-06,2e-06,-5e-06,-8e-06,-3e-06,-9e-06,9e-06,3e-06,-3e-06,2e-05,-6e-06,2e-06,4e-06,-3e-06,1.3e-05,8e-06,2e-06,0,0,2e-06,-2e-06,1.2e-05,-3e-06,-4e-06,-7e-06,1.2e-05,-1e-05,1e-06,-1e-06,1e-06,-2e-06,7e-06,3e-06,-1e-06,1e-06,-1e-06,-8e-06,-6e-06,-5e-06,1e-06,-7e-06,-1.2e-05,-6e-06,-7e-06,-1e-05,1e-06,-6e-06,2e-06,-3e-06,-3e-06,3e-06,-3e-06,4e-06,0,-8e-06,-1e-06,9e-06,0,5e-06,3e-06,0,1e-06,2e-06,6e-06,3e-06,-3e-06,1e-06,-7e-06,-7e-06,1.3e-05,1e-05,8e-06,5e-06,-5e-06,0,6e-06,0,-2.8e-05,8e-06,4e-06,-1e-06,-8e-06,2e-06
2e-06,-1.4e-05,1.8e-05,1.7e-05,6e-06,-5e-06,-5e-06,1.4e-05,1.6e-05,5e-06,-3e-06,-4e-06,8e-06,4e-06,2e-06,1.1e-05,3e-06,5e-06,-3.1e-05,7e-06,-3e-06,-2e-06,2e-06,-1.4e-05,-1e-05,1.1e-05,-1e-05,2e-06,4e-06,1e-06,0,8e-06,5e-06,-5e-06,-1.2e-05,3e-06,1.6e-05,-7e-06,-1.2e-05,-6e-06,5e-06,-2e-05,2e-06,2e-05,-5e-06,-7e-06,5e-06,-1.6e-05,6e-06,0,0,-1.4e-05,-1.4e-05,-1e-05,2e-06,1e-06,2e-06,4e-06,2e-06,4e-06,-1.4e-05,8e-06,-3e-06,-4e-06,9e-06,3e-06,-1e-06,-1e-06,1e-05,2e-06,3e-06,-1e-06,1e-06,-2e-06,4e-06,-3e-06,-1e-06,-7e-06,-1e-06,7e-06,-6e-06,-3e-06,1e-06,1e-06,2e-06,0,4e-06,-1.5e-05,-4e-06,2e-06,4e-06,-4e-06,4e-06,0,-9e-06,-6e-06,2.7e-05,6e-06,0,4e-06,2e-06,-4e-06,-2e-06,0,2e-06,-8e-06,2e-06,1.3e-05,2e-06,-5e-06,-4e-06,-1.4e-05,-4e-06,1e-06,3e-06,1.9e-05,-7e-06,0,1e-05,1.7e-05,-3e-06
0,-6e-06,-4e-06,-9e-06,0,-1e-06,-6e-06,-4e-06,-2e-06,-7e-06,-2e-06,-2e-06,-3e-06,1.5e-05,-1.5e-05,6e-06,-4e-06,-3e-06,1.7e-05,8e-06,-1e-05,7e-06,3e-06,4e-06,8e-06,5e-06,1.9e-05,-1.5e-05,-2e-06,-8e-06,1.3e-05,3e-06,-5e-06,1.1e-05,0,-5e-06,-2e-06,1e-06,2e-06,1.3e-05,-1e-06,1.1e-05,-1e-06,-6e-06,1e-06,-1.5e-05,-3e-06,3e-06,-2e-06,1e-06,-2e-06,6e-06,2e-06,9e-06,-3e-06,-4e-06,5e-06,-5e-06,-1.2e-05,-1e-06,1.1e-05,2e-06,-1e-06,-5e-06,-1.7e-05,1.2e-05,4e-06,1e-06,-8e-06,-1e-05,-2e-06,2e-06,-2e-06,5e-06,-1e-06,1e-06,2e-06,1e-05,1.4e-05,-3e-06,1.1e-05,-5e-06,7e-06,-5e-06,-7e-06,-1e-06,-1e-06,2e-06,1.4e-05,1e-06,-1e-06,1e-06,5e-06,0,8e-06,4e-06,-2e-05,-7e-06,-6e-06,-2e-06,-9e-06,-6e-06,1e-06,-3e-06,-7e-06,3e-06,-8e-06,-1e-05,-9e-06,-7e-06,3e-06,1e-05,-3e-06,3e-06,-3e-06,8e-06,2e-06,-1.6e-05,-4e-06,-6e-06,-1e-06
-2e-06,7e-06,-6e-06,1e-06,1e-06,6e-06,3e-06,1e-06,-1.8e-05,4e-06,1.1e-05,6e-06,2e-06,-7e-06,4e-06,-1e-06,1e-06,-5e-06,-1e-06,4e-06,-7e-06,6e-06,-2e-06,-1e-06,-3e-06,-5e-06,9e-06,1.7e-05,-2e-06,6e-06,-2.1e-05,-6e-06,-3e-06,-9e-06,1.1e-05,8e-06,-1e-05,7e-06,4e-06,-8e-06,-3e-06,1e-05,3e-06,-5e-06,0,1.2e-05,-1e-06,8e-06,1.8e-05,-2e-06,0,1.4e-05,1.2e-05,-1.4e-05,-1e-06,-1e-06,0,0,4e-06,0,-1e-06,1e-06,-2e-06,1.3e-05,9e-06,-1e-05,-1e-06,1e-06,0,-1e-06,-1e-06,-2e-06,1e-06,-5e-06,-2e-06,-1e-06,4e-06,-1.1e-05,6e-06,4e-06,-1e-06,-1e-06,-4e-06,0,-2e-06,-1e-06,-1e-05,3e-06,-2e-06,-2e-06,-2e-06,3e-06,-4e-06,-3e-06,-2e-06,-1e-06,1e-06,-3e-06,-4e-06,-5e-06,3e-06,1e-05,-2e-06,4e-06,4e-06,6e-06,2e-06,4e-06,0,5e-06,-3e-06,7e-06,-4e-06,5e-06,-1e-06,-1.4e-05,3e-06,-7e-06,-7e-06,-1.1e-05,0
2e-06,9e-06,-1.1e-05,8e-06,-7e-06,4e-06,3e-06,-1e-06,-1.3e-05,7e-06,-8e-06,-6e-06,-1e-06,9e-06,9e-06,-1.4e-05,1e-06,2e-06,4e-06,-2.2e-05,-2e-06,-1e-05,-1e-06,0,-5e-06,2e-06,-1.5e-05,-1.4e-05,3e-06,2e-06,8e-06,6e-06,-2e-06,9e-06,-1.2e-05,-9e-06,6e-06,7e-06,-3e-06,3e-06,-3e-06,-2e-06,-1e-06,-3e-06,-4e-06,1.1e-05,-1.2e-05,-1.3e-05,4e-06,1e-06,-2e-06,-9e-06,-1.1e-05,1.4e-05,-3e-06,5e-06,-7e-06,2e-06,-1e-06,-9e-06,-1e-05,0,2e-06,-4e-06,-1.2e-05,0,-2e-06,-1e-06,7e-06,-1.2e-05,1e-06,0,0,3e-06,3e-06,0,-4e-06,9e-06,-6e-06,-6e-06,-5e-06,1.6e-05,-5e-06,2e-06,5e-06,0,1.1e-05,9e-06,0,0,-4e-06,-4e-06,0,-3e-06,-5e-06,-4e-06,-1.3e-05,5e-06,-4e-06,4e-06,2e-06,0,1e-06,-1e-06,-1e-06,-4e-06,-5e-06,-7e-06,4e-06,2e-06,3e-06,-1.5e-05,-1e-06,-1.6e-05,0,-1e-06,-6e-06,8e-06,7e-06,1e-05,1e-06
-2e-06,-3e-06,2.3e-05,-9e-06,1e-05,4e-06,0,3e-06,1.6e-05,-3e-06,-4e-06,7e-06,-1e-06,-3e-06,-7e-06,-3e-06,-3e-06,-1e-06,-1.9e-05,-3e-06,6e-06,-5e-06,0,-1e-06,8e-06,-9e-06,-1.1e-05,2.2e-05,-1e-06,-8e-06,4e-06,3e-06,-1e-06,-8e-06,5e-06,1.1e-05,5e-06,-3e-06,7e-06,-7e-06,4e-06,6e-06,-3e-06,-1.2e-05,6e-06,-1.4e-05,2.3e-05,1.2e-05,-1.3e-05,0,0,-3e-06,-2e-06,-1.4e-05,1e-06,-2e-06,-4e-06,-1e-06,4e-06,7e-06,1e-05,-1e-06,-8e-06,-1e-06,1e-05,4e-06,1e-06,0,-8e-06,2e-06,-2e-06,1e-06,0,1e-06,-4e-06,0,0,-9e-06,-6e-06,4e-06,3e-06,-3e-06,3e-06,1e-06,3e-06,0,-1e-06,-6e-06,-5e-06,0,4e-06,1e-06,0,-1e-06,4e-06,9e-06,9e-06,1e-06,-3e-06,2e-06,0,-5e-06,-1e-06,3e-06,-1e-06,-9e-06,3e-06,-2e-06,1e-06,-1e-06,-3e-06,3e-06,3e-06,1.4e-05,2e-06,9e-06,4e-06,8e-06,-3e-06,-3e-06,-1e-06
0,-4e-06,-1.6e-05,4e-06,-7e-06,-3e-06,3e-06,-6e-06,1e-05,-3e-06,1e-05,-4e-06,3e-06,-1e-05,-6e-06,8e-06,3e-06,-4e-06,1.5e-05,1.5e-05,9e-06,4e-06,-1e-06,4e-06,0,-2e-06,1.5e-05,-1.9e-05,1e-06,5e-06,-1.1e-05,-5e-06,-2e-06,8e-06,7e-06,-1.1e-05,-5e-06,-2e-06,-6e-06,8e-06,6e-06,1e-06,3e-06,1.1e-05,-2e-06,1e-06,-8e-06,-5e-06,-1e-05,0,1e-06,1.2e-05,9e-06,1.4e-05,0,-3e-06,1e-06,-2e-06,-4e-06,-2e-06,-3e-06,-2e-06,0,5e-06,-2e-06,-1e-06,0,0,1e-06,2e-06,-2e-06,-1e-06,0,-2e-06,6e-06,-4e-06,2e-06,5e-06,-5e-06,0,5e-06,-7e-06,5e-06,-2e-06,-1e-06,0,-5e-06,-8e-06,-1e-06,-1e-06,3e-06,1e-06,-1e-06,1e-06,-6e-06,-4e-06,1.2e-05,1e-06,2e-06,-4e-06,2e-06,-6e-06,0,-1e-06,-1e-06,1.2e-05,4e-06,1.3e-05,-1e-06,-6e-06,3e-06,1.2e-05,4e-06,-9e-06,0,5e-06,-2e-06,1e-06,5e-06,-1e-06,3e-06
1e-06,-1e-06,-4e-06,1e-06,2e-06,-4e-06,-3e-06,3e-06,7e-06,0,-6e-06,-1e-06,-2e-06,2e-06,3e-06,8e-06,-1e-06,1e-06,4e-06,1e-06,8e-06,7e-06,4e-06,-1e-06,-3e-06,0,1e-05,6e-06,-1e-06,4e-06,1.3e-05,-1e-06,1.3e-05,-5e-06,-1.4e-05,1.3e-05,-2e-06,-2e-06,1e-06,-5e-06,-5e-06,-1e-05,0,-7e-06,-5e-06,-3e-06,-4e-06,-3e-06,1e-06,0,2e-06,-1.6e-05,-5e-06,-7e-06,3e-06,1e-06,4e-06,2e-06,7e-06,9e-06,-8e-06,-3e-06,-2e-06,-1e-06,6e-06,-2e-06,2e-06,-1e-06,5e-06,3e-06,1e-06,2e-06,-1e-06,1e-06,-5e-06,-2e-06,2e-06,-4e-06,3e-06,-1e-06,4e-06,-3e-06,-2e-06,0,-6e-06,0,6e-06,6e-06,2e-06,1e-06,-2e-06,-2e-06,1e-06,0,4e-06,-1e-06,-1.1e-05,-4e-06,2e-06,6e-06,-1e-06,1e-06,1e-06,-2e-06,-1e-06,-1e-06,-9e-06,-5e-06,0,0,-2e-06,-1.1e-05,3e-06,9e-06,-1e-06,-1.8e-05,-1e-06,-2e-06,-7e-06,6e-06,0
-1e-06,2e-06,1.3e-05,-3e-06,2e-06,-4e-06,-2e-06,0,-1e-05,3e-06,-5e-06,2e-06,3e-06,-3e-06,6e-06,-7e-06,0,0,-7e-06,-3e-06,1e-06,-6e-06,-2e-06,-4e-06,4e-06,-1e-06,-1.3e-05,1e-06,0,-2e-06,-3e-06,4e-06,7e-06,1e-06,7e-06,-1.3e-05,5e-06,-8e-06,2e-06,4e-06,-2e-06,-8e-06,-1e-06,1.1e-05,5e-06,1.2e-05,-6e-06,6e-06,7e-06,1e-06,1e-06,5e-06,-3e-06,-6e-06,1e-06,3e-06,3e-06,0,-7e-06,-8e-06,9e-06,1e-06,4e-06,2e-06,-2e-06,-1e-06,0,1e-06,-7e-06,-8e-06,2e-06,-2e-06,1e-06,1e-06,3e-06,-2e-06,-3e-06,2e-06,8e-06,-1e-06,-9e-06,2e-06,-6e-06,1e-06,5e-06,0,-3e-06,6e-06,0,0,0,1e-06,3e-06,1e-06,-1e-06,2e-06,8e-06,-1e-06,4e-06,-5e-06,-2e-06,4e-06,-3e-06,2e-06,1e-06,-1e-06,7e-06,-2e-06,0,8e-06,2e-06,-5e-06,0,-7e-06,-1e-06,7e-06,2e-06,-8e-06,4e-06,-9e-06,0
0,8e-06,4e-06,-2e-06,-3e-06,0,0,-2e-06,-1.6e-05,-2e-06,5e-06,-3e-06,-3e-06,5e-06,-1e-06,-9e-06,1e-06,-3e-06,-4e-06,-6e-06,-5e-06,0,-1e-06,1e-05,-4e-06,7e-06,-6e-06,-3e-06,1e-06,1e-06,-9e-06,-4e-06,-1.2e-05,-1e-06,4e-06,1.4e-05,1e-06,7e-06,-3e-06,-2e-06,1e-06,7e-06,1e-06,-4e-06,1e-06,-6e-06,1e-05,-8e-06,5e-06,-1e-06,0,5e-06,5e-06,1.3e-05,0,0,-2e-06,-1e-06,2e-06,0,-2e-06,1e-06,0,0,-3e-06,1e-06,-1e-06,0,2e-06,-8e-06,0,1e-06,0,0,-1e-06,-2e-06,1e-06,0,1e-06,2e-06,2e-06,2e-06,-1e-06,-2e-06,-6e-06,-1e-06,-1e-06,-6e-06,4e-06,-1e-06,-1e-06,1e-06,-6e-06,0,-3e-06,-2e-06,-2e-05,4e-06,4e-06,3e-06,2e-06,0,1e-06,-4e-06,2e-06,-7e-06,-9e-06,1e-06,-1e-06,-1e-06,-2e-06,1.2e-05,-2e-06,5e-06,1e-06,1.1e-05,-2e-06,-4e-06,-1e-06,2e-06,-2e-06
0,-3e-06,-1e-05,5e-06,2e-06,4e-06,0,6e-06,5e-06,-4e-06,1e-06,4e-06,4e-06,0,-7e-06,3e-06,-2e-06,1e-06,4e-06,-1e-06,-8e-06,3e-06,0,-1.2e-05,-4e-06,2e-06,1e-05,9e-06,0,0,1.2e-05,-1e-06,-9e-06,-1e-06,-8e-06,-1.4e-05,-5e-06,6e-06,5e-06,2e-06,4e-06,4e-06,-1e-06,1e-06,-5e-06,-3e-06,6e-06,5e-06,-3e-06,1e-06,-1e-06,2e-06,-1e-06,-1.4e-05,-1e-06,-3e-06,-3e-06,0,-4e-06,-1e-06,-7e-06,2e-06,3e-06,1e-06,1e-06,7e-06,0,0,4e-06,-1e-06,0,0,0,0,0,1e-06,0,-2e-06,-2e-06,0,5e-06,8e-06,5e-06,0,1.3e-05,0,-1e-06,-3e-06,-6e-06,0,-2e-06,-2e-06,2e-06,0,2e-06,0,8e-06,0,2e-06,-3e-06,-2e-06,-6e-06,1e-06,4e-06,-2e-06,1.1e-05,0,-8e-06,0,-3e-06,2e-06,-4e-06,-4e-06,-4e-06,1e-06,-1.2e-05,1e-06,5e-06,0,9e-06,0
-1e-06,-5e-06,-9e-06,-6e-06,-1e-06,4e-06,4e-06,-6e-06,1.2e-05,5e-06,-4e-06,-2e-06,-4e-06,4e-06,2e-06,5e-06,0,2e-06,9e-06,6e-06,-6e-06,-2e-06,0,1.1e-05,7e-06,2e-06,2e-06,-1.3e-05,0,1e-06,-1.1e-05,3e-06,8e-06,4e-06,9e-06,1.3e-05,1e-06,0,-2e-06,-2e-06,-4e-06,-1e-06,1e-06,1e-06,2e-06,-5e-06,-1.2e-05,-1e-06,-7e-06,-1e-06,-1e-06,-1.1e-05,-4e-06,1.3e-05,-1e-06,0,-3e-06,-2e-06,7e-06,1e-06,1e-05,0,-3e-06,-2e-06,-8e-06,-5e-06,0,0,-6e-06,6e-06,0,-1e-06,0,0,1e-06,-1e-06,1e-06,4e-06,-6e-06,-2e-06,-2e-06,-1.3e-05,3e-06,0,-1.5e-05,1e-06,4e-06,1e-06,2e-06,-1e-06,2e-06,1e-06,3e-06,0,-1e-06,2e-06,8e-06,-1e-06,1e-06,0,0,4e-06,0,-1e-06,1e-06,-2e-06,6e-06,9e-06,3e-06,1e-06,-2e-06,-1e-05,-3e-06,-2e-06,-1e-06,-4e-06,0,1e-05,2e-06,-9e-06,-1e-06
0,-4e-06,1.6e-05,4e-06,2e-06,1e-06,0,4e-06,1.2e-05,1e-06,3e-06,-1e-06,5e-06,0,4e-06,2e-06,0,-3e-06,-1.7e-05,4e-06,1e-06,-5e-06,1e-06,-6e-06,0,0,-6e-06,8e-06,1e-06,1e-06,0,-2e-06,-3e-06,-6e-06,-6e-06,-1.2e-05,3e-06,2e-06,-1e-06,-1e-06,-3e-06,7e-06,0,-6e-06,0,1.4e-05,5e-06,-3e-06,-4e-06,0,-1e-06,3e-06,2e-06,-1.1e-05,0,3e-06,-1e-06,2e-06,-6e-06,8e-06,-5e-06,1e-06,1e-06,0,9e-06,-2e-06,0,0,3e-06,1.2e-05,-1e-06,1e-06,0,0,-3e-06,-1e-06,-2e-06,-5e-06,-3e-06,3e-06,-6e-06,1e-06,-4e-06,-2e-06,1.3e-05,1e-06,-1e-06,4e-06,-6e-06,0,2e-06,0,-3e-06,0,2e-06,-1e-06,-2e-06,-2e-06,-2e-06,1e-06,1e-06,4e-06,-2e-06,1e-06,1e-06,-3e-06,-1e-06,2e-06,-2e-06,3e-06,2e-06,9e-06,0,7e-06,-1e-06,1e-05,0,0,-3e-06,1e-06,0
0,1e-06,0,1e-06,-4e-06,-3e-06,-4e-06,-1e-06,-4e-06,-3e-06,0,2e-06,-5e-06,-6e-06,-2e-06,0,-1e-06,-1e-06,8e-06,-1e-06,6e-06,-1e-06,2e-06,1e-06,-3e-06,-5e-06,0,-8e-06,-1e-06,-1e-06,1.1e-05,-1e-06,-2e-06,6e-06,-5e-06,1.3e-05,-1e-06,-3e-06,2e-06,0,2e-06,-1e-06,-1e-06,7e-06,-2e-06,-8e-06,-8e-06,5e-06,3e-06,0,1e-06,8e-06,1e-06,1e-05,0,0,2e-06,1e-06,4e-06,-8e-06,-4e-06,-1e-06,1e-06,1e-06,-7e-06,3e-06,0,0,3e-06,-2e-06,-1e-06,-1e-06,1e-06,1e-06,4e-06,-1e-06,1e-06,7e-06,3e-06,-1e-06,-3e-06,1e-06,-1e-06,0,-1.5e-05,0,-4e-06,2e-06,8e-06,0,-1e-06,-1e-06,-2e-06,0,1e-06,-1e-06,9e-06,0,-4e-06,1e-06,0,-1e-06,0,0,-1e-06,-4e-06,3e-06,-7e-06,-2e-06,0,-2e-06,4e-06,3e-06,-5e-06,0,3e-06,0,-3e-06,5e-06,5e-06,1e-06
