0.081014,0.082803,0.098614,0.098724,0.079073,0.070831,0.078178,0.08672,0.077615,0.062792,0.059975,0.069911,0.072716,0.065142,0.061058,0.066931,0.073598,0.065848,0.056708,0.055292,0.060799,0.066815,0.059658,0.050146,0.051803,0.050464,0.048878,0.048777
0.110008,0.11213,0.134095,0.134831,0.106983,0.095378,0.106551,0.119212,0.106451,0.085185,0.080775,0.095418,0.100418,0.089949,0.084095,0.091719,0.100386,0.090315,0.078145,0.075594,0.083243,0.092252,0.082399,0.069048,0.070489,0.066509,0.064136,0.065467
0.16117,0.163515,0.196784,0.199048,0.157015,0.139324,0.156783,0.177214,0.158796,0.127559,0.12067,0.142724,0.152753,0.137867,0.12793,0.13784,0.149271,0.135326,0.118573,0.113635,0.124638,0.139164,0.126395,0.10671,0.107466,0.099502,0.094344,0.09664
0.199025,0.199614,0.241177,0.247512,0.197528,0.175772,0.196145,0.220904,0.200469,0.171315,0.166526,0.189553,0.207179,0.190342,0.173849,0.184287,0.193566,0.176662,0.156676,0.146936,0.16087,0.1806,0.174727,0.155972,0.153939,0.143018,0.130969,0.12932
0.212762,0.208642,0.252321,0.274243,0.234251,0.207393,0.219706,0.237048,0.219196,0.216379,0.2271,0.244444,0.275501,0.261329,0.232684,0.235727,0.227609,0.209862,0.189494,0.170131,0.190156,0.213848,0.231739,0.228781,0.220709,0.208075,0.186414,0.180048
0.244976,0.235866,0.289235,0.349252,0.32332,0.272882,0.271247,0.272284,0.254576,0.294123,0.330467,0.352271,0.412939,0.397536,0.34273,0.322891,0.276533,0.258924,0.243631,0.211948,0.243932,0.275668,0.329297,0.348159,0.335276,0.318764,0.28317,0.279673
0.326477,0.318959,0.395166,0.49429,0.467435,0.38435,0.363679,0.348401,0.334622,0.414124,0.47468,0.511406,0.606155,0.583853,0.497189,0.449746,0.36512,0.345655,0.331159,0.287452,0.337426,0.38253,0.470772,0.505097,0.483688,0.460415,0.410555,0.413609
0.398152,0.39264,0.481769,0.604768,0.579941,0.473863,0.440166,0.420269,0.41074,0.507586,0.582293,0.632509,0.74441,0.717518,0.61008,0.545549,0.442627,0.420185,0.406778,0.356361,0.413271,0.468959,0.580085,0.619448,0.585637,0.558525,0.507745,0.521202
0.40025,0.395933,0.473097,0.586634,0.575296,0.480814,0.459218,0.443951,0.427419,0.504789,0.574679,0.626195,0.715088,0.694379,0.600682,0.535014,0.445334,0.424981,0.41115,0.368587,0.420503,0.470034,0.566181,0.597054,0.559114,0.538959,0.507242,0.531617
0.35325,0.3525,0.399031,0.469917,0.476005,0.430806,0.450062,0.44138,0.40414,0.434456,0.477014,0.50489,0.534426,0.533867,0.491789,0.442396,0.393603,0.382212,0.360472,0.337825,0.391606,0.418287,0.445083,0.454534,0.430473,0.418067,0.406072,0.437149
0.339789,0.325405,0.344228,0.393792,0.411313,0.395306,0.436469,0.43869,0.414924,0.433098,0.435351,0.407334,0.378981,0.385837,0.397105,0.380244,0.365264,0.354835,0.333057,0.333029,0.370812,0.359204,0.328876,0.32978,0.332931,0.321493,0.305821,0.336622
0.358445,0.331904,0.337994,0.384383,0.398409,0.380374,0.408436,0.409967,0.424807,0.4713,0.445868,0.376975,0.341134,0.348132,0.366966,0.356084,0.362256,0.359682,0.345298,0.347356,0.348013,0.319978,0.286724,0.287827,0.300061,0.291447,0.288791,0.328612
0.3598,0.352154,0.359799,0.408042,0.426077,0.385342,0.373255,0.362373,0.403204,0.48105,0.461718,0.384065,0.363088,0.365042,0.359129,0.343661,0.365654,0.374545,0.378091,0.370786,0.322932,0.294688,0.298395,0.308239,0.299421,0.2912,0.315404,0.363349
0.330323,0.340326,0.351533,0.393141,0.418808,0.385043,0.346972,0.307629,0.343385,0.428675,0.42827,0.377847,0.377044,0.359118,0.336017,0.334757,0.349041,0.352365,0.38025,0.370245,0.290684,0.267734,0.308127,0.332415,0.312431,0.309246,0.357633,0.403407
0.288588,0.288954,0.304479,0.330921,0.359951,0.349089,0.304868,0.257678,0.285266,0.346716,0.346149,0.337114,0.34312,0.307877,0.292056,0.306583,0.306019,0.3026,0.336023,0.320952,0.255044,0.246378,0.290235,0.321605,0.30088,0.295494,0.350826,0.384136
0.264639,0.254709,0.282056,0.309877,0.347937,0.336513,0.277398,0.263671,0.299131,0.322613,0.290932,0.29558,0.3066,0.305013,0.313404,0.312641,0.298815,0.275776,0.289893,0.279616,0.248774,0.257783,0.292889,0.334965,0.324549,0.304321,0.33846,0.338277
0.329671,0.31711,0.365167,0.427653,0.464202,0.411212,0.331381,0.360091,0.419604,0.418539,0.362761,0.371108,0.369148,0.398848,0.437512,0.415118,0.378769,0.333242,0.363017,0.377854,0.347196,0.357855,0.386492,0.449025,0.463462,0.439287,0.460412,0.394824
0.453232,0.418635,0.475822,0.588317,0.612456,0.528537,0.455053,0.501037,0.578005,0.556407,0.488176,0.525512,0.509967,0.533831,0.591663,0.561109,0.497139,0.443659,0.508173,0.542845,0.503933,0.515874,0.543693,0.624789,0.660415,0.632967,0.638313,0.514546
0.585068,0.505286,0.536777,0.694427,0.714326,0.629952,0.58494,0.617195,0.682194,0.652315,0.600566,0.669442,0.633843,0.629896,0.702823,0.677289,0.585085,0.528249,0.613704,0.663855,0.629973,0.6448,0.674236,0.756273,0.807988,0.783595,0.747728,0.600465
0.721434,0.599482,0.55409,0.693143,0.727202,0.702884,0.696561,0.675579,0.683955,0.666097,0.666224,0.738643,0.670979,0.624068,0.712643,0.724553,0.630533,0.566964,0.613127,0.648898,0.639969,0.663039,0.695332,0.760569,0.814451,0.79756,0.714269,0.592347
0.835191,0.682143,0.566578,0.624888,0.654779,0.70024,0.744285,0.669782,0.616362,0.600213,0.638212,0.706112,0.642674,0.555979,0.619971,0.696709,0.646688,0.56625,0.529297,0.512567,0.526158,0.55569,0.590681,0.65206,0.6989,0.697327,0.629682,0.560664
0.901945,0.702715,0.58292,0.628983,0.650483,0.652339,0.735989,0.688708,0.565722,0.506177,0.556142,0.628204,0.625621,0.533242,0.521353,0.627928,0.628908,0.537776,0.466737,0.400416,0.389859,0.410347,0.470445,0.553873,0.579298,0.58116,0.562628,0.538734
0.888305,0.644648,0.601759,0.711176,0.701404,0.583178,0.651933,0.687016,0.549721,0.433037,0.47096,0.532283,0.571525,0.508809,0.453796,0.524525,0.52049,0.44145,0.40973,0.359853,0.338489,0.363246,0.46136,0.532921,0.477306,0.454767,0.485294,0.497255
0.741478,0.505275,0.535984,0.683786,0.671326,0.516333,0.536937,0.604644,0.488693,0.351895,0.362168,0.423907,0.491159,0.446386,0.385202,0.411559,0.376573,0.31084,0.323242,0.325141,0.334316,0.363344,0.439652,0.452286,0.36908,0.358279,0.403554,0.417716
0.504169,0.35247,0.400626,0.508789,0.493271,0.381405,0.380119,0.438882,0.370605,0.273574,0.256358,0.297895,0.355528,0.330978,0.305292,0.315786,0.278842,0.216595,0.221279,0.263384,0.298908,0.312551,0.336062,0.315141,0.26414,0.266968,0.303326,0.314874
0.277309,0.228461,0.259291,0.285122,0.271224,0.243536,0.248396,0.274593,0.246541,0.195219,0.189468,0.225788,0.238822,0.220177,0.218363,0.21814,0.195373,0.16059,0.152409,0.20233,0.247794,0.235626,0.208331,0.203342,0.202539,0.191421,0.206489,0.22002
0.180773,0.154884,0.169216,0.157718,0.161824,0.183768,0.201525,0.222859,0.184102,0.136521,0.160876,0.195417,0.177926,0.164564,0.168879,0.159643,0.144113,0.131373,0.124099,0.172601,0.215896,0.176294,0.132701,0.150773,0.169648,0.159848,0.179961,0.184573
0.143253,0.112297,0.116553,0.129268,0.145617,0.157762,0.17872,0.197112,0.150753,0.117981,0.148109,0.167923,0.15325,0.14647,0.148854,0.136397,0.13163,0.138897,0.125665,0.15251,0.185959,0.134778,0.095038,0.125112,0.152797,0.159515,0.178879,0.165054
0.10254,0.079845,0.087409,0.118315,0.136192,0.145719,0.16446,0.165743,0.127807,0.10841,0.120779,0.132154,0.130617,0.135526,0.145605,0.132952,0.129881,0.143176,0.12569,0.13371,0.155936,0.108835,0.069266,0.100597,0.142266,0.160086,0.157987,0.137739
0.078962,0.069178,0.079679,0.106945,0.115422,0.125508,0.135708,0.121141,0.105741,0.104393,0.104925,0.115542,0.112308,0.119854,0.141735,0.127016,0.122706,0.130393,0.111459,0.106986,0.111575,0.087708,0.068615,0.090912,0.127149,0.145534,0.130755,0.11089
0.073248,0.070599,0.079033,0.097808,0.102903,0.103028,0.092067,0.075707,0.082667,0.096734,0.097207,0.10556,0.105486,0.111247,0.129057,0.107562,0.098399,0.103578,0.098586,0.0916,0.07395,0.066762,0.072554,0.094276,0.117405,0.121917,0.11705,0.101035
0.080016,0.072747,0.072549,0.093332,0.100863,0.082853,0.057804,0.055121,0.072347,0.086897,0.089798,0.087578,0.08825,0.094975,0.103967,0.083592,0.075971,0.086245,0.089632,0.084238,0.064622,0.062065,0.073247,0.103651,0.118959,0.106304,0.10823,0.098145
0.079958,0.068188,0.062751,0.080121,0.091183,0.070972,0.044916,0.045912,0.065978,0.080531,0.079517,0.068824,0.067644,0.07612,0.086643,0.071125,0.067804,0.083088,0.079076,0.069111,0.059798,0.059275,0.063182,0.095516,0.116654,0.100986,0.095252,0.088259
0.06838,0.057859,0.052013,0.066296,0.078105,0.066262,0.042232,0.036803,0.053858,0.072917,0.072833,0.058514,0.052414,0.057369,0.066376,0.055487,0.057237,0.075943,0.066714,0.053059,0.049497,0.046649,0.04561,0.072081,0.098059,0.091675,0.07544,0.066372
0.055907,0.047183,0.047647,0.058473,0.074579,0.070313,0.046217,0.040445,0.049527,0.066809,0.066292,0.050932,0.04688,0.045847,0.047504,0.041947,0.046481,0.06495,0.06439,0.059271,0.047556,0.03067,0.036055,0.059337,0.075178,0.075015,0.061818,0.055528
0.047818,0.035488,0.046137,0.059266,0.079727,0.073825,0.047576,0.048404,0.056965,0.063905,0.053302,0.045229,0.044378,0.043844,0.046493,0.037503,0.039462,0.059423,0.073772,0.076656,0.048693,0.020495,0.033201,0.058619,0.058777,0.053639,0.05326,0.060627
0.044853,0.031829,0.043463,0.0607,0.085306,0.072439,0.046214,0.050648,0.067759,0.065049,0.043721,0.041492,0.038872,0.044738,0.049332,0.033264,0.035678,0.05991,0.083342,0.086428,0.049014,0.017164,0.029596,0.061165,0.054201,0.035453,0.045774,0.063381
0.050813,0.034538,0.042777,0.059723,0.078734,0.06362,0.042717,0.043124,0.068822,0.06996,0.045029,0.037719,0.034984,0.04918,0.054149,0.033995,0.032636,0.052556,0.078028,0.082234,0.047579,0.017615,0.025939,0.058039,0.050393,0.024094,0.038429,0.056995
0.059405,0.037339,0.042897,0.057786,0.060613,0.04618,0.03362,0.029441,0.057337,0.069227,0.045459,0.030066,0.029246,0.049653,0.062264,0.040536,0.026997,0.037151,0.0572,0.065024,0.045359,0.019729,0.023777,0.048926,0.044956,0.022761,0.032011,0.041771
0.061709,0.035304,0.036745,0.048046,0.042095,0.028482,0.022488,0.019224,0.039477,0.057395,0.040181,0.027754,0.031406,0.048777,0.066215,0.043341,0.019239,0.023332,0.033014,0.041965,0.038737,0.020207,0.020956,0.035632,0.034299,0.022402,0.027379,0.027576
