0.043057,0.042937,0.043532,0.050383,0.053053,0.057039,0.063173,0.062672,0.063838,0.067152,0.068894,0.063758,0.05177,0.047334,0.047261,0.041144,0.041355,0.04359,0.043531,0.045957,0.049486,0.049389,0.041515,0.037353,0.039924,0.045395,0.047902,0.045845
0.050441,0.04899,0.050563,0.05963,0.062341,0.065683,0.072137,0.07283,0.074643,0.078616,0.080977,0.075378,0.063239,0.057765,0.055743,0.047915,0.048109,0.050557,0.050439,0.054136,0.058548,0.05773,0.04875,0.044688,0.047727,0.053084,0.056779,0.05547
0.061624,0.057574,0.061554,0.074196,0.076974,0.078822,0.084721,0.087772,0.090325,0.095247,0.098829,0.093202,0.082387,0.074613,0.068476,0.058384,0.059337,0.061846,0.060572,0.067278,0.074989,0.072602,0.060497,0.056456,0.060007,0.064155,0.070087,0.071038
0.070433,0.063954,0.071073,0.087053,0.090617,0.090837,0.094739,0.098016,0.09962,0.105086,0.109002,0.104946,0.097548,0.086732,0.076734,0.067281,0.070395,0.072999,0.069385,0.078492,0.090322,0.086102,0.070403,0.066155,0.069164,0.070895,0.079451,0.083972
0.087707,0.076992,0.08623,0.106817,0.113281,0.113903,0.114798,0.113366,0.11386,0.117404,0.117668,0.115166,0.108193,0.095672,0.089689,0.084206,0.085663,0.087132,0.083375,0.093515,0.105607,0.102222,0.087362,0.081854,0.081956,0.08174,0.093391,0.100049
0.134062,0.111466,0.122678,0.153231,0.161475,0.159691,0.158307,0.151886,0.155318,0.155602,0.147501,0.144903,0.132677,0.120583,0.128085,0.130799,0.125639,0.118378,0.114057,0.123086,0.133912,0.139653,0.130278,0.121399,0.117965,0.121209,0.136279,0.139772
0.227217,0.183502,0.19683,0.247825,0.26144,0.24721,0.242276,0.238325,0.250319,0.251349,0.231519,0.230444,0.211969,0.196506,0.218004,0.226973,0.213505,0.191926,0.182923,0.186009,0.196851,0.224054,0.223422,0.204898,0.195588,0.211649,0.234144,0.223253
0.366393,0.301012,0.319847,0.39496,0.421361,0.393796,0.386419,0.386552,0.404426,0.415763,0.391776,0.396006,0.365409,0.331093,0.359655,0.373803,0.360238,0.325255,0.30932,0.303663,0.309143,0.357898,0.363197,0.335218,0.323967,0.365576,0.400727,0.359245
0.534423,0.457239,0.4798,0.565918,0.612042,0.588391,0.59539,0.59105,0.593471,0.629087,0.623398,0.649837,0.59766,0.516574,0.532944,0.547797,0.557479,0.513549,0.487814,0.474726,0.463257,0.523119,0.527253,0.492841,0.486015,0.571427,0.629584,0.542749
0.707728,0.63225,0.64118,0.704747,0.772476,0.797755,0.855623,0.822917,0.771579,0.850346,0.898183,0.980443,0.893789,0.720642,0.689937,0.698538,0.768156,0.726031,0.685722,0.669138,0.635267,0.698079,0.68949,0.647582,0.650391,0.793762,0.881469,0.736894
0.861329,0.789844,0.772021,0.781711,0.846217,0.966288,1.116402,1.025963,0.891927,1.018751,1.140495,1.323008,1.206483,0.888511,0.767242,0.776396,0.933711,0.899073,0.843831,0.830233,0.781969,0.849685,0.81592,0.761087,0.77183,0.970298,1.084837,0.877542
0.942517,0.884006,0.843552,0.790227,0.810635,1.013216,1.262352,1.111092,0.91115,1.066614,1.227431,1.516696,1.421242,0.9675,0.728799,0.747681,0.973623,0.948608,0.891562,0.882266,0.829708,0.900969,0.844455,0.768852,0.78087,1.031126,1.175843,0.904897
0.852034,0.8302,0.787716,0.687355,0.647119,0.860292,1.146473,0.984951,0.778423,0.912644,1.063585,1.390984,1.355741,0.9,0.611776,0.619994,0.823481,0.819879,0.78714,0.770003,0.734944,0.799999,0.726696,0.635867,0.645178,0.914955,1.062625,0.774752
0.612368,0.616809,0.589137,0.502193,0.453789,0.59382,0.786628,0.669606,0.527591,0.601668,0.714113,0.963683,0.970256,0.656915,0.428831,0.429664,0.549052,0.568755,0.578721,0.563012,0.543465,0.585372,0.521666,0.434652,0.429645,0.634441,0.737986,0.526983
0.376079,0.37395,0.366617,0.340458,0.329638,0.372681,0.422595,0.377776,0.336644,0.350034,0.401597,0.515759,0.50935,0.36282,0.27384,0.289071,0.329852,0.359222,0.385272,0.389887,0.380444,0.372675,0.336887,0.297922,0.284078,0.361563,0.398939,0.308649
0.272517,0.257694,0.27477,0.311316,0.357947,0.341299,0.297575,0.316928,0.34265,0.33205,0.34318,0.345418,0.297258,0.236077,0.256579,0.271148,0.268606,0.322562,0.352933,0.379799,0.370929,0.30732,0.27467,0.295161,0.291556,0.280329,0.281014,0.259342
0.321603,0.294716,0.33574,0.403501,0.48212,0.466165,0.386492,0.425995,0.480902,0.44962,0.448314,0.403461,0.324565,0.271337,0.319371,0.341236,0.33211,0.413575,0.449182,0.471113,0.44529,0.359261,0.336662,0.385676,0.39122,0.365858,0.349624,0.328704
0.382932,0.371174,0.441675,0.513071,0.60585,0.618952,0.513622,0.546448,0.637382,0.594978,0.601025,0.556941,0.437156,0.353271,0.398747,0.427753,0.400832,0.480916,0.521669,0.524671,0.496804,0.435912,0.427916,0.471667,0.479796,0.454961,0.428978,0.41318
0.426546,0.4388,0.535423,0.604443,0.684813,0.720084,0.620688,0.630384,0.728298,0.687114,0.714154,0.686571,0.520983,0.406779,0.451701,0.486683,0.430141,0.472624,0.509367,0.494312,0.498838,0.522512,0.533535,0.532441,0.527986,0.49814,0.468003,0.481741
0.471005,0.508711,0.593277,0.644573,0.696546,0.729313,0.666743,0.662641,0.749069,0.732084,0.757859,0.727741,0.549562,0.430657,0.472873,0.519693,0.44667,0.427138,0.461681,0.461493,0.516426,0.623357,0.646187,0.580817,0.547474,0.510079,0.488849,0.527345
0.504641,0.570579,0.620095,0.642735,0.673868,0.663033,0.61153,0.642932,0.766785,0.783054,0.784027,0.734921,0.556956,0.440748,0.47506,0.528914,0.48128,0.445038,0.463288,0.447098,0.526824,0.673715,0.682101,0.582381,0.561479,0.541585,0.520702,0.544826
0.530284,0.597022,0.630125,0.626857,0.61842,0.560948,0.504782,0.612927,0.80759,0.807933,0.753265,0.703416,0.539449,0.446259,0.501855,0.527774,0.513446,0.521725,0.494486,0.432584,0.504205,0.619564,0.590994,0.510058,0.555813,0.599416,0.576222,0.553583
0.540971,0.56357,0.585583,0.598204,0.556672,0.522315,0.512594,0.633748,0.861085,0.808552,0.664018,0.629936,0.491039,0.418721,0.498609,0.497581,0.515351,0.59696,0.526425,0.420675,0.467545,0.523291,0.498783,0.472747,0.554524,0.63679,0.617031,0.551544
0.5502,0.506283,0.499995,0.56317,0.503009,0.498203,0.55766,0.671092,0.881303,0.802648,0.640345,0.615261,0.463382,0.372735,0.452699,0.450323,0.489881,0.62366,0.529212,0.409999,0.461582,0.503394,0.492889,0.506728,0.55589,0.593913,0.607485,0.548185
0.54775,0.448899,0.410585,0.548361,0.514105,0.515761,0.604909,0.697951,0.83195,0.739056,0.689005,0.721641,0.545901,0.403592,0.424993,0.43586,0.47277,0.592262,0.490639,0.376948,0.473598,0.522203,0.489995,0.520278,0.515,0.490799,0.541206,0.508395
0.490593,0.396057,0.356157,0.533151,0.554418,0.535807,0.602703,0.657888,0.693272,0.623935,0.727429,0.81186,0.641606,0.520077,0.496566,0.4777,0.491199,0.561367,0.446431,0.348226,0.503975,0.562209,0.484874,0.490094,0.4629,0.46444,0.51699,0.447237
0.377102,0.31623,0.352204,0.550654,0.593473,0.5384,0.545605,0.570442,0.573181,0.557813,0.712977,0.780388,0.647058,0.595314,0.560689,0.516111,0.556135,0.580933,0.419981,0.327531,0.503351,0.594244,0.488083,0.418257,0.386429,0.473462,0.530244,0.404842
0.36087,0.305088,0.375785,0.526235,0.581548,0.563184,0.520642,0.552699,0.598652,0.570512,0.645789,0.70782,0.621276,0.595673,0.577949,0.527838,0.601444,0.6227,0.436149,0.296874,0.429593,0.590156,0.482414,0.364956,0.367491,0.492734,0.55994,0.40851
0.441642,0.37114,0.446426,0.524288,0.555555,0.587188,0.529048,0.605686,0.667309,0.573896,0.622149,0.677277,0.570026,0.542059,0.573928,0.521922,0.566996,0.599525,0.43756,0.289256,0.357721,0.557257,0.475886,0.339513,0.396614,0.555326,0.613174,0.42973
0.577931,0.478646,0.541115,0.603775,0.582031,0.608963,0.575827,0.685368,0.696612,0.563059,0.652753,0.656683,0.525869,0.488677,0.551361,0.511031,0.469625,0.48686,0.38455,0.306286,0.348306,0.506345,0.458033,0.341141,0.444436,0.642769,0.637987,0.41134
0.668579,0.594196,0.635129,0.710668,0.68767,0.663419,0.656598,0.76758,0.719387,0.587381,0.694151,0.67559,0.538218,0.486516,0.513599,0.501135,0.432626,0.444789,0.38117,0.35197,0.41544,0.502318,0.451477,0.369074,0.492145,0.680566,0.617846,0.400766
0.646404,0.649753,0.721611,0.796502,0.75632,0.68303,0.675067,0.775425,0.741616,0.644082,0.691348,0.664617,0.519971,0.441245,0.419376,0.467869,0.468166,0.485535,0.448174,0.414452,0.464671,0.489825,0.456544,0.404742,0.486703,0.612932,0.573253,0.428933
0.552181,0.631893,0.738131,0.771202,0.717929,0.671924,0.638423,0.720151,0.778312,0.689688,0.622741,0.569184,0.422667,0.329329,0.316925,0.468597,0.561571,0.589383,0.55275,0.454357,0.466198,0.497824,0.511717,0.467466,0.438935,0.454807,0.46037,0.438381
0.431574,0.528661,0.637853,0.653845,0.66827,0.679882,0.626903,0.632533,0.705256,0.684572,0.60902,0.568094,0.425201,0.292568,0.294431,0.481499,0.610066,0.644201,0.627104,0.49178,0.480974,0.524334,0.558095,0.500278,0.382319,0.352031,0.345956,0.397232
0.346809,0.391865,0.479192,0.551904,0.615788,0.637257,0.6652,0.61318,0.588841,0.606139,0.566675,0.637166,0.557693,0.358553,0.336095,0.459076,0.544274,0.57114,0.606488,0.504384,0.488572,0.497812,0.517177,0.496871,0.37504,0.388013,0.357364,0.366725
0.371397,0.317894,0.401483,0.476342,0.515276,0.610035,0.709816,0.60837,0.580831,0.589918,0.48237,0.638769,0.686864,0.430779,0.35501,0.37367,0.385995,0.38815,0.497627,0.485495,0.461888,0.46079,0.451119,0.469088,0.382255,0.445567,0.455345,0.398494
0.389572,0.248265,0.378895,0.504462,0.479127,0.607069,0.713052,0.627194,0.606034,0.542387,0.390469,0.586925,0.756592,0.491823,0.330363,0.28624,0.274189,0.240068,0.414446,0.486298,0.444902,0.463847,0.410396,0.445676,0.433475,0.505695,0.529432,0.413381
0.424545,0.245923,0.388602,0.627209,0.586504,0.643711,0.634669,0.61076,0.579305,0.445373,0.388226,0.563854,0.725282,0.49199,0.274997,0.265751,0.286275,0.276214,0.461003,0.547265,0.523122,0.572365,0.43809,0.448953,0.50828,0.55249,0.525454,0.358309
0.472172,0.30544,0.414798,0.71501,0.711543,0.697828,0.533063,0.534953,0.547052,0.376751,0.384224,0.498795,0.588351,0.425768,0.209221,0.25106,0.304893,0.368831,0.567872,0.619546,0.595934,0.659449,0.448587,0.421142,0.525501,0.520471,0.452883,0.277651
0.513482,0.380228,0.431279,0.71687,0.744862,0.734465,0.489496,0.444403,0.499054,0.354021,0.360077,0.397314,0.43413,0.381195,0.183863,0.275213,0.363944,0.491911,0.671006,0.622631,0.572915,0.639103,0.462884,0.386945,0.454697,0.417586,0.38603,0.270025
