3e-06,6e-06,3e-06,1e-06,4e-06,6e-06,-0.009816,-0.042942,-0.015636,-0.00771,-0.087403,-0.222598,-0.214514,-0.198955,-0.169636,-0.181448,-0.186199,-0.117184,-0.052277,-0.009663,-0.002672,-0.001918,-0.000436,-0.002444,-0.000751,-0.000293,-0.000231,-0.000216
0,-1e-06,-2e-06,-4e-06,-1e-06,3e-06,-0.008042,-0.03541,-0.011198,-0.000657,0.009532,-0.022665,0.035757,0.02212,0.086618,0.008681,0.031685,0.06863,0.040407,0.009596,0.002108,0.001114,0.000161,-0.002835,-0.00127,-0.000184,5.8e-05,0.000571
-1e-06,-2e-06,-1e-06,-2e-06,-1e-06,-1e-06,0.003992,0.016116,0.004518,-0.002747,-0.012417,0.012258,0.006328,-0.007968,0.00069,-0.014352,0.014278,0.012683,0.003848,-0.000536,-0.000522,0.000108,-0.000111,-0.001448,-0.00043,0.00013,-5e-05,-0.000409
1e-06,3e-06,5e-06,4e-06,3e-06,1e-06,0.009172,0.041767,0.013755,-0.00273,-0.034256,-0.001625,-0.061034,-0.059348,-0.110425,-0.047718,-0.050937,-0.07602,-0.047807,-0.009935,-0.002253,-0.001229,2.5e-05,0.001558,0.00064,0.000191,0.000142,-2.5e-05
1e-06,6e-06,9e-06,7e-06,5e-06,7e-06,0.003228,0.013867,0.004613,0.002947,0.060658,0.158473,0.166874,0.163105,0.132993,0.150325,0.119691,0.080976,0.041675,0.008742,0.002647,0.001492,0.000554,0.002619,0.000967,3.5e-05,0.000145,0.000407
-4e-06,2e-06,6e-06,2e-06,1e-06,2e-06,-0.007942,-0.034083,-0.010539,-0.002428,0.014509,0.03588,0.0799,0.060434,0.072575,0.0611,0.036934,0.0386,0.030209,0.004001,0.000747,0.000278,-0.000458,-0.000175,5.1e-05,-0.000131,-0.000186,-0.000353
-4e-06,-2e-06,1e-06,-4e-06,-2e-06,-1e-06,-0.006952,-0.030937,-0.00976,-0.005742,-0.087539,-0.219284,-0.211115,-0.195374,-0.160743,-0.167144,-0.152855,-0.11166,-0.057516,-0.010413,-0.002984,-0.002364,-0.001053,-0.00181,-0.000722,-8e-05,-7.2e-05,-3.2e-05
-3e-06,-4e-06,-1e-06,-4e-06,-1e-06,3e-06,0.003554,0.013689,0.003316,0.00172,-0.003781,-0.051142,-0.053816,-0.038456,-0.008277,-0.040039,0.004332,0.018733,-0.002497,0.00175,0.000812,0.000345,-0.000351,-0.001641,-0.000712,1.6e-05,9.4e-05,0.000316
-2e-06,-2e-06,1e-06,0,2e-06,4e-06,0.007209,0.032518,0.010223,0.003347,0.058059,0.161786,0.152342,0.118394,0.09662,0.088445,0.094634,0.079968,0.043161,0.005577,0.000845,0.001322,0.00018,-0.000452,-0.000118,3.4e-05,-6e-06,-0.000203
0,1e-06,4e-06,6e-06,5e-06,7e-06,0.00175,0.009584,0.003741,-3e-04,-0.009433,0.029013,-0.006031,-0.022073,-0.058481,0.005024,-0.038411,-0.061594,-0.022701,-0.004556,-0.00131,-0.001127,-0.000281,0.000765,0.00036,4.1e-05,5.3e-05,-4.1e-05
1e-06,2e-06,4e-06,8e-06,5e-06,9e-06,-0.004969,-0.022268,-0.006714,-0.00047,-0.010256,-0.041561,-0.036155,-0.020283,-0.007412,0.020094,0.001925,-0.013645,-0.013244,-0.000244,6e-04,-0.000458,-0.001065,-0.000188,0.000221,4.5e-05,7.4e-05,0.000225
1e-06,1e-06,2e-06,4e-06,3e-06,5e-06,-0.004737,-0.022543,-0.007078,0.001919,0.025148,0.016204,0.064143,0.057078,0.07719,0.01794,0.045546,0.070567,0.034618,0.004571,0.001199,0.000902,-0.000628,-0.000848,-0.000165,-8e-06,-8.8e-05,-0.000175
0,-2e-06,-1e-06,-1e-06,1e-06,1e-06,0.000743,0.003987,0.001204,0.001141,-0.016994,-0.061144,-0.068078,-0.055776,-0.060625,-0.091607,-0.073548,-0.046288,-0.015289,-0.00259,-0.000919,-0.000612,-0.000221,-0.00062,-0.000408,-9.8e-05,-4.8e-05,0
-2e-06,-4e-06,-3e-06,-2e-06,2e-06,2e-06,0.005779,0.024982,0.007102,-0.001613,-0.02175,-0.054612,-0.089967,-0.05614,-0.049668,-0.033701,-0.036764,-0.048901,-0.031482,-0.002872,-0.000385,-0.000503,-0.000653,-0.001072,-0.000366,-4e-05,4.4e-05,0.000147
-2e-06,-4e-06,-2e-06,1e-06,2e-06,-1e-06,0.00144,0.007487,0.002519,-0.000597,0.035112,0.11381,0.125041,0.102047,0.088911,0.093392,0.083852,0.074115,0.030318,0.003295,0.000877,0.000911,-0.000188,-9.9e-05,8.8e-05,0.000117,5e-05,-0.000119
0,-1e-06,2e-06,6e-06,2e-06,-3e-06,-0.003027,-0.01356,-0.003746,0.000136,0.006724,0.071621,0.083353,0.043467,0.006793,0.038023,0.020935,0.01237,0.017388,0.001152,-0.000479,-0.000309,-2.5e-05,0.000829,0.000444,0.000125,5.9e-05,-8e-06
1e-06,0,2e-06,6e-06,1e-06,-3e-06,-0.003205,-0.014365,-0.004531,-0.001441,-0.045852,-0.102329,-0.10171,-0.081277,-0.06714,-0.03342,-0.041665,-0.062739,-0.030243,-0.002338,-0.000559,-0.000682,-0.000499,-0.000247,0.000123,-3.5e-05,-2e-05,8.6e-05
1e-06,-2e-06,-1e-06,1e-06,1e-06,-3e-06,0.000657,0.002316,0.000342,0.001679,0.010814,-0.042263,-0.024717,0.001349,0.035961,-0.015989,0.001232,0.024686,0.00396,0.000168,0.000344,0.000679,1.2e-05,-0.000684,-0.00023,-8.2e-05,-7.8e-05,-4.8e-05
0,-4e-06,-4e-06,-4e-06,1e-06,-2e-06,0.002274,0.010953,0.003103,0.002087,0.037235,0.048709,0.046048,0.042472,0.021683,-0.033621,-0.011141,0.02366,0.018297,0.001065,2.7e-05,0.000312,0.000274,-0.000399,-0.000314,-3.5e-05,-1e-05,-2.7e-05
