-5.5e-05,-0.000101,-1e-05,-3.8e-05,-0.002494,-0.005987,-0.00395,-0.020855,-0.132321,-0.221263,-0.216855,-0.164247,-0.136988,-0.111802,-0.108764,-0.114204,-0.051909,-0.015728,-0.005588,-0.003354,-0.00053,-0.001089,-0.000766,-0.000255,-0.000446,-0.000563,-0.000332,-0.001059
9.6e-05,0.000211,6e-05,5.2e-05,0.000552,-0.002427,-0.003453,-0.008529,0.025748,0.026512,0.063789,0.135197,0.128757,0.109789,0.059257,0.090402,0.051721,0.016829,0.005715,0.003885,0.000868,-0.000335,0.00063,0.000715,-0.000175,-0.000226,-0.000139,-0.000555
-3.1e-05,-8.6e-05,-6e-06,1.7e-05,-0.000275,-0.000223,-4.5e-05,-0.025364,-0.02731,0.02093,0.006971,-0.014977,-0.01321,-0.005613,-0.018584,0.00027,0.00222,-0.00128,-0.000929,-0.000272,-0.000882,-0.000291,-0.000815,-0.000408,0.000154,0.000203,0.00015,0.000558
-3.9e-05,-6.8e-05,2e-06,-2e-06,-9.3e-05,0.002809,0.002286,-0.030496,-0.096452,-0.066591,-0.104409,-0.148021,-0.141989,-0.122762,-0.082756,-0.112889,-0.061257,-0.017427,-0.00619,-0.004237,-0.000892,0.000443,-5.7e-05,-0.000438,0.000207,0.000274,0.000228,0.000864
9.1e-05,0.000182,5.5e-05,6.3e-05,0.002254,0.004561,0.002344,0.0137,0.072465,0.127317,0.153042,0.140132,0.119718,0.099288,0.107083,0.095479,0.042578,0.015939,0.005821,0.003092,0.000369,0.000673,0.001801,0.001187,0.000111,0.00014,3.3e-05,-3.2e-05
-3.1e-05,-8.3e-05,-1.3e-05,8e-06,-0.000843,-0.002591,-0.00155,0.015401,0.050463,0.06625,0.099912,0.077484,0.071641,0.067201,0.058216,0.072841,0.03701,0.007407,0.001769,0.001451,-0.000673,-0.000872,-0.001445,-0.000938,-0.000233,-0.000268,-0.000276,-0.000987
-3.9e-05,-5.2e-05,-9e-06,-3.5e-05,-0.002382,-0.004995,-0.002476,-0.012852,-0.108276,-0.186247,-0.194651,-0.159425,-0.136779,-0.119481,-0.107586,-0.123456,-0.060446,-0.019669,-0.006936,-0.004477,-0.000665,-0.000816,-0.000452,-5e-05,-0.000193,-0.000322,-0.000134,-0.000316
5e-05,0.00011,3.3e-05,3.9e-05,0.001141,0.001222,0,0.002408,-0.007465,-0.047665,-0.04927,0.023756,0.028026,0.021543,0.006578,0.009064,0.006231,0.004834,0.001387,0.001041,2.7e-05,8.1e-05,0.00076,0.000657,0.00017,0.000203,0.000242,0.000843
-1.2e-05,-5.4e-05,-5e-06,2.9e-05,0.001052,0.002591,0.001935,0.014813,0.094942,0.149952,0.138122,0.095368,0.084884,0.077055,0.05046,0.09188,0.049116,0.011538,0.003304,0.002885,0.000253,0.000371,-0.000431,-0.000409,0.00018,0.000322,0.000153,0.00046
-9e-06,1e-06,2e-06,-1.6e-05,-0.000385,0.000543,0.001068,-0.006911,-0.016202,0.010164,-0.021477,-0.087377,-0.086763,-0.086752,-0.068934,-0.086282,-0.042927,-0.013244,-0.003775,-0.003039,0.000449,0.000503,7.2e-05,-0.000211,-9.2e-05,-0.000105,-0.000125,-0.000451
2.1e-05,4.8e-05,1.1e-05,-3e-06,0.000272,-0.00016,-0.000973,-0.006351,-0.037589,-0.057583,-0.035024,-0.011167,-0.01429,-0.010108,0.009584,-0.026683,-0.018425,0.000282,0.000737,-0.00011,0.000108,-0.000253,0.000635,0.000595,-0.000111,-0.000209,-0.00014,-0.000513
-1.4e-05,-5.4e-05,-1.6e-05,1e-05,-0.000133,-0.00125,-0.001212,0.003294,0.024507,0.032559,0.079963,0.086957,0.080836,0.092994,0.084581,0.112615,0.054518,0.013838,0.003736,0.00339,0.000285,-0.000489,-0.000879,-0.000509,9e-06,1.3e-05,3e-06,4.2e-05
6e-06,2.8e-05,2e-06,-1.5e-05,-0.001372,-0.001537,0.000232,-0.008235,-0.027163,-0.026344,-0.044838,-0.056191,-0.048054,-0.045396,-0.043065,-0.042146,-0.019025,-0.009626,-0.00277,-0.00205,0.000215,0.000321,9.6e-05,3.2e-05,4.9e-05,7.9e-05,0.000124,0.000518
-4e-06,-1e-06,-3e-06,6e-06,0.000679,0.001649,0.000934,-0.005374,-0.040944,-0.070424,-0.092796,-0.052487,-0.044304,-0.050103,-0.0451,-0.07882,-0.040723,-0.008015,-0.00199,-0.001713,-0.000497,8.3e-05,0.00038,0.000253,4.7e-05,7.2e-05,7.4e-05,0.00022
-1e-05,-4e-05,-1.1e-05,8e-06,0.000915,0.001203,0.000305,0.014349,0.056182,0.065611,0.078526,0.081839,0.073301,0.070601,0.051363,0.08612,0.04471,0.012558,0.003426,0.003186,4e-05,-0.000214,-0.000358,-0.000191,-1.1e-05,6e-06,-0.000103,-0.000438
2.2e-05,6.1e-05,7e-06,-1.8e-05,-0.000235,-0.000722,-0.000368,0.009366,0.055032,0.077343,0.055833,0.012279,0.008781,-0.007248,-0.01621,0.009272,0.009405,-0.001071,0.000242,-0.000533,0.000275,0.000113,-4.8e-05,-4.4e-05,-6.8e-05,-0.000127,-9.7e-05,-0.000298
-2.1e-05,-4.8e-05,-2.1e-05,-2.1e-05,-0.000295,-0.000607,-0.000774,-0.004178,-0.02995,-0.07173,-0.08124,-0.063128,-0.053679,-0.059618,-0.04561,-0.089824,-0.047181,-0.009424,-0.002211,-0.002346,-0.000574,-0.000298,0.000175,0.000191,-1.1e-05,-5.5e-05,4.5e-05,0.000268
-1.3e-05,-3.6e-05,-1.6e-05,2e-06,-0.000118,-2.8e-05,4.2e-05,0.002282,-0.017622,-0.042865,-7.5e-05,0.025828,0.023339,0.04849,0.05318,0.056607,0.024619,0.009139,0.001957,0.002422,0.000229,-7.9e-05,-7.7e-05,-5.5e-05,6.9e-05,0.000132,6.6e-05,0.000246
1.7e-05,6.7e-05,8e-06,-4e-06,-0.000364,-0.000229,0.000498,0.002641,0.027481,0.06542,0.053859,0.027915,0.02198,0.024741,0.02432,0.05142,0.028745,0.00321,0.000532,0.000293,0.000216,0.000249,-0.000164,-0.000221,1e-05,4.6e-05,-3e-06,-6.4e-05
