1.956468,2.033702,2.084727,1.992043,2.02558,2.19019,2.002035,1.775166,1.860107,1.805825,1.825926,1.971008,1.995492,2.054307,2.293039,2.310252,1.869781,1.685402,1.811638,1.991885,2.026203,2.015365,2.029014,1.665563,1.242563,1.131848,1.193331,1.184962
2.417305,2.497164,2.534571,2.4339,2.463227,2.63802,2.444766,2.184409,2.235311,2.181246,2.290895,2.406797,2.333311,2.424296,2.679763,2.71649,2.280285,2.028133,2.12776,2.300581,2.339145,2.384796,2.404852,1.965918,1.446717,1.304121,1.390658,1.372142
3.253417,3.34538,3.364544,3.246249,3.214635,3.385913,3.21291,2.890151,2.857094,2.798237,3.073428,3.126506,2.855795,3.004404,3.266017,3.340177,2.970436,2.613038,2.633103,2.745971,2.804909,2.972226,2.972383,2.394078,1.733928,1.555835,1.697092,1.678152
4.025124,4.130802,4.072611,3.914724,3.771989,3.931822,3.801753,3.412139,3.282226,3.190325,3.566475,3.592388,3.162126,3.334797,3.599391,3.667956,3.386638,3.018585,2.951779,2.954362,3.040397,3.274252,3.182887,2.517213,1.852521,1.70685,1.919904,1.951332
4.300341,4.422372,4.261858,4.049325,3.827937,4.027321,3.928778,3.48038,3.306132,3.191384,3.515026,3.623418,3.226018,3.309965,3.58158,3.589371,3.289853,3.03131,2.949477,2.862106,2.967088,3.105624,2.917614,2.343783,1.864169,1.849181,2.118955,2.201309
3.823592,3.873713,3.661203,3.511942,3.30862,3.472417,3.434798,3.104437,2.945946,2.888027,3.061176,3.187075,3.018866,2.999348,3.172312,3.071318,2.749397,2.63799,2.608598,2.510556,2.596851,2.601984,2.500897,2.27165,2.082236,2.223994,2.443155,2.490041
3.249235,3.121211,2.921476,3.084877,2.98828,2.819252,2.931519,3.008098,2.805442,2.864948,2.987061,2.925417,2.962245,2.90338,2.847211,2.651923,2.459304,2.521737,2.61031,2.493348,2.401649,2.309046,2.427292,2.567001,2.570755,2.823844,2.981104,2.969941
3.696803,3.281279,3.036973,3.556787,3.513727,2.975848,3.357954,3.881636,3.559742,3.714482,3.934101,3.685813,3.777566,3.743717,3.467057,3.078503,3.008582,3.299633,3.457969,3.184592,2.955455,2.779818,2.972877,3.397697,3.407881,3.682062,3.959212,4.021455
4.949222,4.216423,3.919005,4.733193,4.687537,3.933937,4.49387,5.21123,4.768042,5.061351,5.421266,5.054275,5.122442,5.12896,4.730444,4.055262,3.937169,4.496855,4.753753,4.279311,3.928222,3.62632,3.868524,4.669493,4.767678,5.159607,5.62508,5.770349
6.159996,5.211454,4.874288,5.903766,6.055081,5.233728,5.547158,6.140316,5.742507,6.21666,6.601966,6.092516,6.131786,6.316932,5.980071,5.19136,5.011578,5.709233,6.041149,5.469775,5.026317,4.58166,4.939164,6.232229,6.662716,7.312649,7.774752,7.94626
6.759929,5.999532,5.661601,6.695363,7.135515,6.300664,5.930534,6.234328,6.1529,6.688311,6.998684,6.392102,6.282317,6.765083,6.659874,5.990086,5.927869,6.54099,6.944537,6.587106,6.157986,5.673203,6.278724,8.060399,8.993965,9.868901,10.052185,10.197246
6.622305,6.534943,6.31752,7.040042,7.50473,6.656829,5.735016,5.968898,6.194518,6.411735,6.870205,6.550294,6.127293,6.598519,6.549607,6.17724,6.368098,6.767237,7.41919,7.609851,7.300515,6.797593,7.730173,9.965123,11.528386,12.333807,11.767244,11.68168
5.874737,6.50531,6.633597,6.95424,7.032434,6.175168,5.383669,5.841262,6.03917,5.993499,6.856259,6.858246,6.144934,6.169573,5.769574,5.658027,6.06783,6.300157,7.10641,7.836699,7.9321,7.551886,8.609829,11.280492,13.663501,14.06841,12.788321,12.151268
5.180885,5.756123,6.082508,6.158207,5.902022,5.285252,4.944292,5.442064,5.526235,5.51559,6.392972,6.370423,5.562478,5.194253,4.712795,4.793739,5.266497,5.508573,6.112767,7.18286,7.831794,7.612412,8.399586,11.003599,13.8851,13.920833,12.581299,11.508743
4.448276,4.553736,4.799585,4.996853,4.84307,4.655075,4.781097,4.992023,4.857213,4.993554,5.425048,5.09852,4.574019,4.364914,4.114342,4.059784,4.473879,5.13413,5.487042,6.151078,6.751892,6.684114,7.009273,8.702283,11.059904,10.911143,10.109175,9.203746
4.46059,4.10452,4.081638,4.583487,5.146927,5.312803,5.797955,5.848481,5.052879,4.741708,4.575398,4.202022,4.408001,4.663449,4.378867,4.056724,4.471379,5.590132,5.948216,5.870663,5.822823,5.850289,5.557646,5.927897,7.14139,6.94236,6.977877,6.747404
5.557973,5.035627,4.925455,5.500876,6.26272,6.399453,7.096699,7.196104,5.960152,5.165301,4.706995,4.522455,5.232539,5.921959,5.716133,5.147732,5.302591,6.518221,6.775072,6.333667,6.210672,6.168035,5.093908,4.888254,5.643807,5.462489,6.087775,6.096313
6.682168,6.34848,6.335282,6.664648,6.930224,6.768904,7.585486,7.77017,6.600765,5.839421,5.363273,5.514903,6.400628,7.048895,7.225509,6.68815,6.157662,7.015598,7.310767,6.859122,7.007701,6.804404,5.356528,5.542598,6.331799,5.802349,6.512949,6.541319
7.577166,7.660325,7.94675,7.469606,6.893342,6.698941,7.601131,7.746343,7.058138,6.890303,6.462825,7.049907,8.148211,8.174052,8.44636,8.330246,7.091856,7.028928,7.162516,6.714033,7.400234,7.640957,6.291643,6.742386,7.138333,6.142676,6.965755,7.402164
8.842497,9.221218,9.747946,8.071955,7.224263,7.465195,8.212068,8.201204,7.499965,7.969568,7.581329,8.42386,10.012875,9.428284,9.00984,9.184155,8.186145,7.778891,7.232549,6.195177,7.437605,8.796202,8.025135,8.090386,7.581357,6.271256,7.31896,8.077637
10.286266,10.518539,10.879656,8.162391,7.870028,8.75011,9.00211,8.662439,7.604996,8.508669,8.237398,8.960589,10.690655,9.767915,8.360324,8.546826,8.467508,8.231698,7.091803,5.615438,7.018273,9.27149,9.432613,9.078306,7.715229,6.154053,7.25575,8.062192
11.825716,11.462897,10.854615,7.9352,8.262798,9.177598,9.014652,8.432316,7.149285,8.191455,8.175798,8.527725,9.633859,8.778487,7.418555,7.568844,7.802336,7.932143,7.014076,5.24717,6.294843,9.15544,9.952706,8.877815,7.001367,5.826299,6.993233,7.718106
12.357814,11.872943,9.986571,7.414049,7.645129,7.791236,7.306828,6.813715,6.328214,7.642666,7.699568,8.265596,8.777164,7.510617,6.685377,6.97926,6.923219,7.227978,6.921489,5.302106,5.985045,8.795931,9.446278,7.494825,5.833,5.923109,6.898186,6.931283
11.258945,11.143786,8.477761,6.553911,6.259106,5.72645,4.946527,4.748062,5.586867,7.097311,7.159148,8.054239,8.374374,6.435544,5.281554,5.735282,5.951995,6.197181,6.199168,5.485517,6.010792,7.878345,8.023214,6.253682,5.449176,6.102409,6.42576,5.783081
8.899601,9.66719,7.147285,5.437929,4.782329,4.469485,3.799098,3.735115,5.015687,6.021666,5.794982,6.724568,7.559394,5.441898,3.676665,4.332509,4.95344,4.850518,4.925937,5.591721,5.991315,6.847897,7.009531,5.655973,5.402167,5.793352,5.458832,5.000015
5.958147,7.348657,6.197922,4.686118,3.838226,3.937085,3.738827,4.03072,5.005742,5.121264,4.459807,4.934482,6.166269,4.679052,3.198045,4.088335,4.253826,3.377693,3.642026,5.403294,5.680645,5.848172,6.204715,4.953047,4.864645,5.485404,5.032833,4.978906
3.823673,4.63808,4.756193,4.081302,3.483525,3.630099,3.425824,4.076541,5.020599,4.727445,3.969193,3.906857,4.645151,3.841863,3.23684,4.12988,3.787842,2.774527,3.088987,4.807861,4.929521,4.531503,4.836205,4.430737,4.629747,5.314437,4.989662,5.040082
3.012739,3.231105,3.332248,3.218521,3.043055,3.242324,2.991466,3.526919,4.496296,4.278202,3.323431,2.754786,2.881541,2.653947,2.91746,3.826495,3.412885,2.589,2.850986,3.846812,4.125125,3.874998,3.689965,4.008181,4.574498,4.618126,4.325969,4.53354
2.682109,2.642361,2.294258,2.071451,2.191865,2.656981,2.673237,2.769465,3.290165,3.207121,2.380214,2.02896,1.965246,1.786018,2.549788,3.778055,3.586812,2.855882,2.805572,2.80702,3.157543,3.521968,3.278851,3.651278,3.978123,3.279909,3.077414,3.549757
2.0006,1.835663,1.590984,1.356098,1.590953,2.129834,2.182095,2.057581,1.99626,1.9113,1.702631,1.779253,1.746363,1.522698,2.357519,3.734344,3.626821,2.871136,2.560619,2.383954,2.657359,2.924785,2.675507,2.782572,3.02835,2.294034,2.020139,2.73283
1.323657,1.195076,1.127084,1.075565,1.501018,1.958426,1.736227,1.610675,1.293108,1.096656,1.255992,1.51125,1.62663,1.342411,1.874024,3.011944,2.949493,2.267704,1.926494,2.061505,2.27175,2.121079,1.836719,1.730103,2.098898,1.87827,1.50442,1.926201
1.014614,1.048179,1.064809,1.130475,1.721193,1.993488,1.54187,1.288723,0.887164,0.767407,0.954333,1.164421,1.383402,1.176712,1.392417,1.954461,1.870876,1.493349,1.249099,1.520014,1.97651,1.915135,1.613939,1.375467,1.637695,1.619071,1.220508,1.351865
0.909541,0.910424,1.004264,1.218833,1.807536,1.912064,1.397417,0.970832,0.621455,0.643624,0.737509,0.84901,1.007225,0.912801,1.155231,1.430598,1.244988,1.096684,1.045785,1.180249,1.697578,1.835859,1.587128,1.400478,1.543936,1.6883,1.364135,1.279875
1.048875,0.955036,0.984036,1.283864,1.618523,1.579105,1.239498,0.763078,0.418986,0.47628,0.578973,0.667314,0.647709,0.576743,0.962214,1.301988,1.196813,1.036807,1.075758,1.179346,1.530351,1.544603,1.359187,1.368983,1.48744,1.774793,1.459714,1.196056
1.276697,1.185728,0.976549,1.171932,1.294729,1.176469,1.018541,0.666942,0.35665,0.331194,0.463601,0.513517,0.400163,0.395024,0.787969,1.116876,1.306808,1.317094,1.345434,1.3975,1.408653,1.216391,1.111636,1.241616,1.284455,1.621141,1.386919,0.96318
1.439172,1.396237,0.940263,1.029877,1.14372,1.064114,0.846189,0.518222,0.330068,0.298128,0.454125,0.471964,0.367936,0.411988,0.690476,1.042333,1.385793,1.560821,1.574763,1.433522,1.145508,0.918897,0.98811,1.166153,1.041346,1.330816,1.305448,0.726525
1.614967,1.438079,0.832086,1.03181,1.207116,1.082333,0.768774,0.36374,0.313324,0.330039,0.488459,0.491567,0.462192,0.479928,0.617946,0.944003,1.232768,1.549147,1.604656,1.206795,0.917208,0.791961,0.85813,1.041744,0.91657,1.192508,1.212866,0.613671
1.826206,1.272579,0.677931,1.051004,1.233086,0.987996,0.71299,0.321801,0.30957,0.355109,0.488281,0.458634,0.565253,0.626085,0.682561,0.832727,0.872677,1.222835,1.399315,0.925604,0.66505,0.636336,0.630513,0.800469,0.9123,1.321332,1.160602,0.664011
1.930142,1.098169,0.557155,1.014134,1.167115,0.852625,0.612365,0.31905,0.310267,0.381077,0.491447,0.451215,0.684107,0.856686,0.791957,0.765668,0.599999,0.761092,1.073064,0.790932,0.459528,0.446898,0.436999,0.590696,1.021845,1.668344,1.342842,0.742584
1.851816,1.024965,0.508156,0.848723,1.079569,0.822788,0.491977,0.313468,0.351506,0.490087,0.606872,0.567735,0.84587,1.051112,0.827965,0.687807,0.528983,0.470036,0.728704,0.704392,0.402292,0.355151,0.336168,0.463445,1.188401,2.004865,1.67915,0.930824
