3e-06,6e-06,1.3e-05,5e-06,0,1e-05,0,1.2e-05,1.3e-05,6e-06,7e-06,2e-06,5e-06,4e-06,7e-06,1.2e-05,2.5e-05,5e-06,4.5e-05,2e-06,2.8e-05,7e-06,3.4e-05,3.6e-05,1.7e-05,2.1e-05,5.4e-05,0.000177,9.9e-05,0.000706,5.5e-05,8.7e-05,8.2e-05,4e-06,6.6e-05,7.2e-05,8e-05,2.8e-05,0.000114,0.000292,0.000149,0.000157,0.000755,0.00055,0.000313,0.000305,0.000365,0.000431,0.000789,0.000112,0.000712,0.00048,0.000567,0.000926,0.000129,3.1e-05,4.5e-05,0.000733,0.000481,4.8e-05,0.000291,7.4e-05,0.000113,0.000394,0.000102,5.9e-05,0.000255,6.1e-05,0.000122,4.3e-05,0.000179,0.000267,2e-04,0.00019,3e-06,1.6e-05,9e-05,0.000136,0.00011,5.2e-05,0.000157,0.000134,5.5e-05,8.1e-05,0.000247,8e-05,0.000197,2e-06,0.000106,3e-06,1.6e-05,5.7e-05,6.3e-05,4e-05,0.000174,5.5e-05,2.7e-05,8.7e-05,9e-06,5.3e-05,2.6e-05,1.4e-05,5e-06,4e-06,9e-06,1.1e-05,8e-06,1e-05,1.5e-05,1.2e-05,3.7e-05,1e-05,5.9e-05,1.8e-05,3e-06,7e-06,1.5e-05,2e-06,5e-06,1.4e-05,5e-06
4.9e-05,4.3e-05,2.1e-05,1.7e-05,1.3e-05,2.3e-05,1.7e-05,1.1e-05,1.1e-05,1.9e-05,5.1e-05,3.7e-05,2e-05,2.1e-05,2.4e-05,3.9e-05,3.1e-05,4e-05,4.1e-05,5.5e-05,6.3e-05,4.7e-05,6.2e-05,4.1e-05,6.4e-05,5.5e-05,0.000129,0.000493,0.000143,0.001591,0.000185,2.9e-05,0.000201,0.000267,0.000352,0.000309,0.000297,0.000355,0.000311,0.001092,0.000544,0.000646,0.000727,0.00141,0.001695,0.001084,0.00134,0.000892,0.001164,0.001401,0.000696,0.001582,0.000576,0.001385,0.000487,0.000785,0.000685,0.001297,0.000789,0.000691,0.000778,0.000265,0.000301,0.001267,0.001021,0.000942,0.000317,0.000256,0.000216,0.000434,0.00045,0.000545,0.000189,0.000409,0.000311,0.000398,0.000191,0.000448,0.000267,0.000129,0.000384,0.000244,0.00027,0.000224,0.000484,0.000151,0.000394,0.000324,0.000374,0.000344,0.000189,8.5e-05,0.000153,0.000489,5e-04,0.000148,8.2e-05,1.2e-05,5.7e-05,0.000114,0.000151,6.9e-05,5.3e-05,3.4e-05,2.1e-05,2e-05,3.1e-05,6e-05,5.2e-05,5.1e-05,3.4e-05,1.9e-05,5e-05,6.2e-05,5.2e-05,6.2e-05,5.6e-05,6.8e-05,3.1e-05,1.2e-05,2.1e-05
2.9e-05,3.3e-05,3.3e-05,8e-06,2.9e-05,1.7e-05,1.4e-05,1.4e-05,1.6e-05,7e-06,5.4e-05,1.1e-05,2.6e-05,1.9e-05,1.6e-05,1.6e-05,1.9e-05,1.5e-05,1.2e-05,3.1e-05,3.8e-05,8.3e-05,4.2e-05,1.9e-05,6e-06,4.8e-05,0.000141,0.000593,0.000378,0.00161,0.000138,0.000187,0.000111,9.4e-05,0.00054,0.000168,0.000362,9.4e-05,0.000112,0.002455,0.00291,0.002377,0.002003,0.001043,0.00012,0.000999,0.000516,0.001787,0.002179,0.001914,0.001657,0.001114,0.001554,0.001791,0.000664,3e-04,0.000183,0.001306,0.000412,0.000291,0.000732,0.000474,0.000387,0.001256,0.000619,0.000901,0.000676,0.000682,0.000717,0.000972,0.000649,0.000349,7.4e-05,0.000157,0.000439,0.000443,0.000326,0.000541,0.000199,0.00031,0.000497,0.000218,0.000185,0.000136,0.000389,0.000137,0.000307,0.000252,0.000438,0.000143,5.2e-05,1.8e-05,0.000191,0.00058,0.000316,0.000127,6.9e-05,0.000139,0.000116,2.6e-05,4.4e-05,3e-05,3.3e-05,5e-06,3e-05,4.1e-05,2e-05,5.2e-05,3.3e-05,1.4e-05,4e-05,3.2e-05,0.000133,8.9e-05,4.9e-05,1.7e-05,3.7e-05,4.7e-05,2.9e-05,2.3e-05,3.2e-05
4.3e-05,4.1e-05,6e-05,6.1e-05,5.9e-05,4.9e-05,2.3e-05,3.8e-05,4.1e-05,5.7e-05,4e-05,6.3e-05,3.9e-05,2.9e-05,2.9e-05,4.9e-05,5.1e-05,3.4e-05,4.9e-05,3.3e-05,5.2e-05,5.7e-05,6.8e-05,5.6e-05,5.4e-05,5.5e-05,6.6e-05,0.000624,0.000107,0.00142,0.00054,8.3e-05,7.8e-05,0.000103,0.000748,0.000557,0.000348,0.000457,0.000217,0.003592,0.005789,0.003069,0.001268,0.002313,0.002298,0.002762,0.001808,0.0023,0.000367,0.001825,0.003414,0.002242,0.000922,0.002837,0.001159,0.000827,0.001302,0.001411,0.001567,0.000243,0.000835,0.000347,0.000182,0.000599,0.00054,0.00178,0.001583,0.000732,0.000656,0.001303,0.001977,0.001025,0.000451,0.000585,0.000867,0.000494,0.000175,0.000353,0.000295,0.000272,0.000864,0.000555,0.000334,8e-06,0.000684,0.000289,0.000102,0.000848,0.000541,0.000292,6e-05,7e-05,0.000255,0.000621,0.000518,0.000463,0.000211,0.000277,0.000101,5.8e-05,3.5e-05,2.4e-05,1.2e-05,2.9e-05,6.6e-05,3e-05,1.9e-05,3.9e-05,7.6e-05,7.3e-05,7.6e-05,9e-05,0.000155,8.4e-05,4.3e-05,2.2e-05,1.1e-05,3.9e-05,6.1e-05,4.7e-05,2.5e-05
1.4e-05,1.4e-05,2.5e-05,1e-05,2.6e-05,1.3e-05,2.4e-05,2.3e-05,3.1e-05,4e-05,1.6e-05,4.3e-05,3e-05,2.9e-05,2.5e-05,5.1e-05,1.8e-05,3.1e-05,6.2e-05,1.1e-05,1.5e-05,6.1e-05,7.4e-05,3.8e-05,1.9e-05,2.7e-05,0.000128,0.000441,0.001201,0.000882,0.001269,0.000831,0.000454,0.000164,0.000285,9.1e-05,0.00015,0.000228,3.7e-05,0.004237,0.005026,0.005405,0.003081,0.003344,0.001721,0.003854,0.001459,0.003252,0.002086,0.002754,0.005954,0.003235,0.001524,0.000362,0.001677,0.000864,0.001334,0.00215,0.001857,0.001769,0.000669,0.000941,0.001154,0.001104,0.000809,0.002167,0.000932,0.000213,0.000716,0.002341,0.00114,0.000933,0.000879,0.000321,0.000402,0.000311,0.000559,0.000446,0.000667,3.9e-05,0.000617,0.000261,2.4e-05,0.000153,0.000491,0.000215,0.000141,0.000944,0.000357,0.000169,5.8e-05,1.4e-05,0.000187,0.000196,4e-05,0.00014,7.5e-05,0.000253,0.000176,0.000115,4.5e-05,2.5e-05,8e-06,3.9e-05,4.4e-05,1.6e-05,2e-05,1.8e-05,4.6e-05,1.3e-05,3.4e-05,6.5e-05,0.000137,5.4e-05,2.4e-05,4.2e-05,1.1e-05,2.9e-05,6e-05,1.8e-05,9e-06
1.3e-05,2.6e-05,1.3e-05,2.6e-05,2.9e-05,2.2e-05,1.8e-05,2.1e-05,2.5e-05,6.4e-05,3.6e-05,2.7e-05,3.9e-05,1.9e-05,4e-06,4e-05,3.2e-05,4.5e-05,2.6e-05,4.3e-05,2.2e-05,0.000114,9.9e-05,5e-05,3.2e-05,1e-05,0.000109,0.000216,0.00134,0.001922,0.001108,0.000395,0.000168,0.000193,0.000296,5e-05,0.000292,0.000303,0.000226,0.004726,0.002633,0.002967,0.000958,0.002184,0.004308,0.00278,0.002453,0.002444,0.000436,0.006682,0.003023,0.00292,0.001189,0.004275,0.001904,0.002608,0.002774,0.00185,0.001459,0.000929,0.002206,0.001637,0.001761,0.001381,0.000708,0.001985,0.001314,0.00014,0.001319,0.001229,0.000334,0.000684,0.000625,0.000565,0.000219,0.000901,0.000929,8.1e-05,0.001101,0.000946,7e-04,0.000308,0.000206,0.000354,0.000505,0.000164,0.000134,0.000749,4e-04,0.000508,0.000189,0.000148,0.000263,0.000511,0.000622,0.000315,8.9e-05,0.000176,0.00014,4.5e-05,9.4e-05,0.000119,5.4e-05,5.1e-05,6.9e-05,4.1e-05,4.6e-05,2.8e-05,4.3e-05,6e-05,7.7e-05,6.7e-05,0.000192,2.3e-05,1.5e-05,4.5e-05,7.5e-05,1.6e-05,2.1e-05,2.4e-05,1.7e-05
4.3e-05,1.8e-05,2.6e-05,6.9e-05,4.9e-05,1.3e-05,1.6e-05,1.8e-05,2.8e-05,5.1e-05,1.2e-05,1.2e-05,5e-05,3e-05,1e-05,3.9e-05,3e-05,4.2e-05,8e-05,7.2e-05,4.1e-05,0.000157,2.5e-05,2.5e-05,4.6e-05,3.2e-05,0.000116,0.000301,0.000208,0.002728,0.001734,0.00082,0.000135,0.000276,0.000614,0.000549,0.000623,0.000252,6.3e-05,0.004557,0.003286,0.002429,0.007083,0.003728,0.00289,0.004981,0.003846,0.005445,0.004477,0.011326,0.010434,0.005461,0.003004,0.006265,0.003552,0.000725,0.002135,0.00292,0.002717,0.002584,0.001552,0.001657,0.004616,0.00073,0.001252,0.001919,0.001291,0.000452,0.001329,0.0019,0.001051,0.00167,0.001165,0.001467,0.000807,0.000736,0.000267,0.001027,0.000717,0.000491,0.00019,0.000614,0.000478,0.000432,0.000671,7e-06,4.5e-05,0.000675,0.00021,0.000591,0.000124,0.000176,0.000274,0.000708,0.000338,0.000209,0.000265,0.000234,0.000169,0.000133,6.9e-05,9.6e-05,0.000104,6.8e-05,5.9e-05,7e-05,2.6e-05,3.2e-05,2.9e-05,4.1e-05,9.6e-05,0.000103,0.000126,9.2e-05,2.7e-05,2.6e-05,7.8e-05,0.000101,5.6e-05,2.4e-05,4.2e-05
5e-06,3.9e-05,1.7e-05,6.2e-05,2.1e-05,9e-06,1.6e-05,2.8e-05,4.1e-05,2.3e-05,4.1e-05,3e-05,4.4e-05,4.4e-05,1.5e-05,4.1e-05,3.3e-05,2.8e-05,3.8e-05,8e-06,1.1e-05,0.000126,0.000179,9e-05,8.1e-05,6.3e-05,0.000159,0.000946,0.002433,0.003678,0.004648,0.002903,0.001276,0.000491,0.00065,0.00108,0.000329,2.2e-05,0.000195,0.003917,0.002172,0.004834,0.011462,0.006827,0.004377,0.008313,0.004389,0.004927,0.006452,0.006988,0.011976,0.006486,0.004736,0.008102,0.005623,0.002162,0.001191,0.001593,0.002643,0.003543,0.001837,0.001769,0.004096,0.005015,0.004409,0.001336,0.00147,0.001036,0.001779,0.000926,0.002557,0.000874,0.000256,0.000664,0.001502,0.001469,0.000885,0.001554,0.001529,0.000996,0.000513,0.000868,0.00097,0.000543,0.001249,0.00082,0.000471,0.000716,0.000644,0.00059,0.000377,9.4e-05,0.000164,0.000658,0.000866,8.5e-05,0.000213,0.000173,0.000477,0.000141,0.000114,3.8e-05,8.6e-05,4.2e-05,1e-06,2.2e-05,7.4e-05,6.4e-05,1.2e-05,6.6e-05,7.6e-05,8.6e-05,0.000884,0.000396,0.00017,4.1e-05,4.7e-05,2.4e-05,2.7e-05,2.5e-05,2.3e-05
1.2e-05,2.9e-05,3.7e-05,3.6e-05,2.5e-05,2.6e-05,1e-05,3e-05,1.2e-05,2.7e-05,3.9e-05,2.4e-05,1.6e-05,2e-06,1.5e-05,3e-05,2.6e-05,1.4e-05,2.5e-05,2.7e-05,2.2e-05,0.000134,0.000217,0.000158,6.2e-05,6.8e-05,0.000198,0.001667,0.004229,0.006152,0.00929,0.003926,0.00127,0.000363,0.000881,0.00031,0.000256,7.9e-05,0.000172,0.003316,0.002522,0.006024,0.007117,0.003344,0.005277,0.008291,0.004112,0.001287,0.003053,0.007946,0.003001,0.001691,0.003319,0.004745,0.001405,0.001893,0.000767,0.001007,0.001712,0.003643,0.001975,0.000403,0.002013,0.003421,0.002011,0.000948,0.001296,0.001251,0.001508,0.00139,0.001902,0.002062,0.001152,0.000541,0.000743,0.000141,0.000278,0.00087,0.000329,0.000613,0.00034,0.000725,0.000364,0.000115,0.001458,0.00141,0.000579,0.000343,0.000641,0.000846,0.000728,0.000439,0.000164,0.000622,0.000559,0.00086,0.000325,0.000253,0.000722,0.00046,0.000142,4.1e-05,9.2e-05,8.3e-05,2e-05,4.3e-05,8.4e-05,0.000121,9.9e-05,8e-05,0.000115,0.000187,0.00159,0.000902,0.00038,6.1e-05,2.5e-05,2.5e-05,8e-06,2.7e-05,3.8e-05
1.7e-05,2.8e-05,3e-05,2e-05,1.6e-05,2.6e-05,2e-05,1.2e-05,2.2e-05,2.1e-05,1.2e-05,3e-06,1.1e-05,1.1e-05,2.3e-05,3e-05,4.2e-05,3.1e-05,2.9e-05,2.9e-05,1.5e-05,0.000153,4.7e-05,0.000193,0.000151,8.8e-05,0.000214,0.001676,0.006615,0.001542,0.006283,0.003565,0.001018,0.000461,0.001184,0.001006,0.000423,4.8e-05,0.000122,0.002735,0.00231,0.003526,0.000975,0.001405,0.005162,0.000896,0.002153,0.002363,0.002146,0.002092,0.002616,0.002247,0.001905,0.002431,0.001041,0.001588,0.00099,0.001068,0.001131,0.001926,0.001139,0.000974,0.000716,0.002095,0.000681,0.000744,0.000972,0.000824,0.000933,0.000431,0.000353,0.000764,0.000329,0.000309,0.000279,0.00022,0.000294,0.000511,0.000302,0.000405,0.000453,0.000365,0.000222,0.000131,0.001368,0.001051,0.000487,0.000202,0.000343,0.000798,0.000521,0.000321,0.000235,0.000343,0.00029,0.000725,0.000408,0.000279,0.000607,0.000389,0.00014,6.8e-05,0.000115,8.1e-05,8.2e-05,6.7e-05,0.000117,2.7e-05,3.7e-05,5e-05,5.3e-05,0.00022,0.001778,0.000998,0.000325,3.9e-05,8e-06,3.3e-05,3.4e-05,2.7e-05,4.6e-05
2.7e-05,3.4e-05,2.1e-05,2.4e-05,4e-06,1.6e-05,2e-06,1.3e-05,1e-05,2.2e-05,2.1e-05,1.7e-05,1.7e-05,2.2e-05,1e-06,1e-05,7e-06,7e-06,2.4e-05,2e-05,1.3e-05,0.000158,0.000229,0.00024,9.5e-05,1e-04,0.000283,0.000744,0.004089,0.004485,0.002444,0.001639,0.000692,0.000151,0.000845,0.000536,0.000111,0.000253,7.1e-05,0.002266,0.001034,0.003866,0.002955,0.001873,0.003387,0.002555,0.001071,0.001684,0.002079,0.001224,0.001369,0.000291,0.000725,0.001138,0.000998,9e-04,0.000715,0.000658,0.00088,0.001816,0.001516,0.002149,0.001269,0.000795,0.00085,0.001162,0.000774,0.001022,0.000691,0.000154,0.000882,0.000215,0.000593,0.000422,3e-05,0.00016,0.000259,0.000224,0.000179,0.000177,5.6e-05,0.000203,0.000218,5.7e-05,0.00122,0.00095,0.000509,0.000167,0.000181,0.000542,0.000374,0.00024,0.000249,0.000321,0.000279,0.000635,0.000338,0.000247,0.000309,0.000177,0.000132,6.6e-05,5.2e-05,2.7e-05,4.5e-05,2.9e-05,9.3e-05,0.000105,4.2e-05,6.6e-05,9.9e-05,0.00022,0.001281,0.000719,0.000249,7.2e-05,1.5e-05,2.4e-05,3e-05,4.1e-05,3.1e-05
7e-06,3.9e-05,1.4e-05,1.4e-05,1.1e-05,7e-06,1e-05,1.3e-05,1.4e-05,1.3e-05,1.4e-05,1.3e-05,1.6e-05,1.4e-05,2.3e-05,6e-06,1.5e-05,8e-06,1.5e-05,1.9e-05,1.2e-05,0.000169,0.000248,4.2e-05,3e-05,5.6e-05,0.000247,0.000817,0.000823,0.000799,0.000699,4.3e-05,0.000107,0.000253,0.000306,0.00028,0.000386,0.000224,0.000142,0.002051,0.002104,0.003809,0.00245,0.000528,0.003288,0.001438,0.001,0.000604,0.003451,0.00313,0.001624,0.001374,0.000487,0.001803,0.000537,0.001676,0.001493,0.00067,0.002134,0.000937,0.000227,0.000106,0.000648,0.001512,0.000538,0.000837,0.000665,0.001168,0.000797,0.000309,0.000544,0.000488,0.000565,0.000225,9.2e-05,0.000289,0.000169,0.000391,0.000148,0.000171,0.00031,0.000395,0.000103,0.000103,0.000855,0.000501,0.000216,5.6e-05,0.000118,0.000492,0.000227,0.000149,0.000115,0.000116,0.000523,0.000525,0.000186,0.000132,0.000209,7.5e-05,6.2e-05,4.2e-05,5.8e-05,4.7e-05,5.4e-05,9.5e-05,4.1e-05,2.7e-05,3.3e-05,6.7e-05,8.5e-05,0.000302,0.00054,0.000195,6.2e-05,2.2e-05,1.4e-05,1e-05,3.1e-05,7e-06,2.7e-05
1e-05,3e-05,9e-06,1.3e-05,3e-06,7e-06,5e-06,8e-06,6e-06,1.2e-05,1.2e-05,8e-06,4e-06,1.6e-05,1.9e-05,1.1e-05,1.4e-05,1.5e-05,1.9e-05,1e-05,2.1e-05,0.000181,0.000102,7.1e-05,1e-05,5e-06,0.000223,0.001103,0.002178,0.001634,0.00122,0.000374,1.3e-05,0.000239,0.000367,0.000473,0.000173,0.000209,0.000117,0.002016,0.003528,0.000309,0.001458,0.002319,0.002686,0.00285,0.001469,6e-04,0.003587,0.002192,0.001425,0.001195,0.000665,0.00198,0.001263,0.002013,0.000711,0.00104,0.001381,0.001585,0.00067,0.001281,0.001682,0.001551,0.000575,0.00201,0.000592,0.000962,0.000855,0.000945,0.000821,4e-04,0.000638,0.000414,8.5e-05,0.000228,0.000243,0.000352,0.000266,0.000113,0.000625,0.000253,8.8e-05,0.000177,0.000459,9.6e-05,3.3e-05,9.3e-05,7.1e-05,0.000231,9.8e-05,0.000125,0.000148,0.000106,0.000577,0.000388,0.000208,0.000131,0.00012,6.6e-05,7e-05,1.5e-05,4.1e-05,2.2e-05,5.8e-05,0.000112,2.9e-05,2.5e-05,2.8e-05,7.5e-05,2.6e-05,0.000194,0.000171,0.000153,9.3e-05,4.7e-05,2.8e-05,6e-06,1.3e-05,2e-05,1.4e-05
5e-06,2e-05,1.8e-05,3e-06,1.4e-05,1.8e-05,1.5e-05,1.9e-05,3.5e-05,1.6e-05,2.6e-05,2.4e-05,6e-06,1.7e-05,2.4e-05,1.8e-05,1.9e-05,1.1e-05,1e-05,2e-05,2.2e-05,0.000181,0.000344,0.00013,2.3e-05,2.4e-05,0.000249,0.001048,0.001793,0.000935,0.000666,0.000457,8.9e-05,0.000232,0.00047,0.000341,7.7e-05,0.000231,9e-05,0.001944,0.004396,0.003572,0.002167,0.002189,0.003074,0.001338,0.001541,0.000749,0.002668,0.004054,0.000934,0.000613,0.000683,0.00038,0.00092,0.000594,0.001556,0.003065,0.000458,0.002106,0.001334,0.002119,0.002261,0.000879,0.001141,0.002305,0.002195,0.001945,0.000675,0.002155,0.00172,0.000808,0.000449,0.000479,2e-04,0.000203,0.000138,0.000845,0.000447,0.000259,0.000752,0.000513,0.000211,0.000216,6.5e-05,0.000169,0.000137,0.00025,8.2e-05,8.4e-05,7.8e-05,0.000175,0.000183,0.000134,0.000446,0.000292,0.000131,2.7e-05,0.000101,5.7e-05,1.7e-05,1.9e-05,2.5e-05,4e-05,4.1e-05,0.000154,5.3e-05,1.8e-05,6e-06,3.7e-05,2.6e-05,0.000211,0.000147,4.6e-05,2.9e-05,5e-06,2.5e-05,3.6e-05,1.7e-05,1.4e-05,1.3e-05
3.6e-05,3.7e-05,1.4e-05,5e-06,1.4e-05,9e-06,7e-06,1.9e-05,4.1e-05,6e-05,2.8e-05,2e-06,1.8e-05,2.2e-05,1.4e-05,1.4e-05,1.8e-05,1.4e-05,2.6e-05,4.4e-05,2.8e-05,0.000212,0.000303,0.00017,6.5e-05,5.1e-05,0.000217,0.001267,0.000712,0.003347,0.002013,0.00074,0.000223,0.000214,0.000527,0.000514,0.000442,9.7e-05,0.000143,0.001635,0.004182,0.003702,0.004467,0.000835,0.005489,0.001429,0.002889,0.002759,0.002903,0.005185,0.003502,0.001195,0.000301,0.003197,0.001013,0.00295,0.002838,0.000904,0.003681,0.002771,0.003764,0.006656,0.005593,0.001974,0.001744,0.000724,0.000986,0.00191,0.002537,0.002426,0.001821,0.002892,0.001391,0.000956,0.000314,0.000381,7.2e-05,0.001311,0.001208,0.000574,0.001042,0.000728,0.000808,0.000496,5.3e-05,0.000165,0.000103,0.00031,0.000171,0.000232,0.000119,0.00023,0.000141,7.5e-05,0.000316,5.8e-05,6e-05,8.9e-05,0.000177,0.000189,0.000131,2.3e-05,5.2e-05,3.9e-05,2.7e-05,0.000176,8.5e-05,5.1e-05,1.9e-05,2.6e-05,9e-06,0.000226,0.000264,0.000127,9.3e-05,1.5e-05,3.1e-05,3e-05,2.8e-05,5e-06,2.1e-05
6.4e-05,4.7e-05,1.7e-05,3.1e-05,1.5e-05,1.9e-05,1.9e-05,3e-05,4.2e-05,2.8e-05,3e-05,2.6e-05,2.5e-05,1e-05,6e-05,4e-05,3.1e-05,3.6e-05,3.9e-05,4.8e-05,1.8e-05,0.000209,0.000116,2.1e-05,7.3e-05,0.000109,0.000177,0.001177,0.000975,0.003158,0.001677,0.001031,0.000469,0.000142,0.000549,0.00023,0.000278,0.000302,0.000171,0.001536,0.00387,0.004294,0.00343,0.005982,0.008293,0.007441,0.004631,0.004169,0.008179,0.004041,0.004558,0.003466,0.000747,0.005131,0.00461,0.004635,0.005461,0.001586,0.003284,0.006453,0.001423,0.005747,0.001943,0.006656,0.002464,0.004165,0.002853,0.001836,0.002726,0.002164,0.002386,0.003277,0.001622,0.001774,0.001808,9e-04,0.000584,0.001503,0.000356,0.000508,0.001582,0.001915,0.000957,0.000459,0.000638,0.000486,0.00016,0.000289,2e-04,0.00028,6.4e-05,0.000275,0.000545,0.00049,0.000317,8.8e-05,8e-05,5.8e-05,0.000143,0.00017,0.000114,4.5e-05,0.000121,3.5e-05,4.1e-05,0.000158,0.000112,6.2e-05,8e-06,3.5e-05,2.3e-05,0.000235,0.00038,0.000261,1e-04,4.6e-05,3.3e-05,2.8e-05,4e-05,3.3e-05,4.6e-05
5.2e-05,1.9e-05,1.1e-05,3.8e-05,4.6e-05,6e-06,1.4e-05,2.2e-05,5.6e-05,3.9e-05,5.1e-05,1.8e-05,4e-06,2.3e-05,9.9e-05,7.6e-05,5.7e-05,4.8e-05,3.7e-05,4e-05,2.6e-05,0.000147,0.000301,0.000169,0.000175,0.000184,0.000321,0.000931,0.00233,0.004608,0.002123,0.001156,0.00054,0.000442,0.00032,0.000496,0.000419,0.000202,0.000106,0.001327,0.004453,0.004803,0.006111,0.010283,0.00276,0.004393,0.010087,0.013181,0.00789,0.005348,0.005251,0.009055,0.007244,0.002138,0.003417,0.008607,0.009994,0.008654,0.004614,0.003409,0.007983,0.007154,0.009964,0.012802,0.007148,0.006064,0.00967,0.006734,0.002328,0.002651,0.005588,0.008369,0.008002,0.006374,0.004401,0.002847,0.001296,0.001989,0.003076,0.002313,0.002071,0.003237,0.002461,0.001022,0.001387,0.00082,0.000345,0.00025,0.00033,0.000109,7.4e-05,0.00033,0.000602,0.000188,3.8e-05,3.8e-05,0.000176,0.000186,0.000149,0.000412,0.000352,0.000218,0.000307,0.000193,0.000108,0.000251,0.00022,0.000109,4.6e-05,0.000114,0.000121,0.000303,0.000618,0.00054,0.000248,5.7e-05,6.7e-05,3.4e-05,7e-05,4.1e-05,3.1e-05
6.8e-05,4.9e-05,1.8e-05,2.4e-05,5.3e-05,5.3e-05,4.1e-05,2.1e-05,3e-05,8e-06,2.3e-05,2.8e-05,2.1e-05,3.9e-05,5.5e-05,5.5e-05,4e-06,1.1e-05,4.3e-05,3.8e-05,2.2e-05,8.2e-05,0.000313,0.000257,5e-05,9.2e-05,0.000187,0.000972,0.002636,0.001768,0.001718,0.000777,0.000346,0.000237,0.000123,0.000322,0.000114,0.000134,3.6e-05,0.001174,0.003579,0.00376,0.000362,0.005606,0.001285,0.003707,0.00732,0.004505,0.001081,0.005446,0.007145,0.008018,0.009816,0.009089,0.008004,0.005488,0.005263,0.004636,0.007147,0.002654,0.008077,0.008427,0.004177,0.002211,0.007102,0.006259,0.005467,0.00364,0.004678,0.005683,0.001591,0.003909,0.002227,0.00248,0.000917,0.001468,0.001459,0.002152,0.004012,0.001838,0.00153,0.001956,0.001074,0.000822,0.001379,0.000314,5.3e-05,0.000228,0.000284,0.00034,0.000279,0.000143,0.000175,0.000169,0.00013,0.000377,4.7e-05,7.9e-05,0.00019,0.000303,6.8e-05,4.4e-05,0.000237,0.00021,0.000114,0.000227,0.000101,5.5e-05,4.1e-05,0.000116,7.7e-05,0.000266,0.000427,0.000193,9.6e-05,4.1e-05,7e-06,4.2e-05,6e-05,2e-05,2.4e-05
2.5e-05,1.1e-05,1.3e-05,1.9e-05,3.2e-05,3.5e-05,7e-06,1.9e-05,1.7e-05,1.9e-05,1e-05,2.3e-05,5e-06,3.1e-05,5e-05,9e-06,3.6e-05,2e-05,2.9e-05,1.6e-05,2.9e-05,0.000122,0.000234,1.6e-05,5.9e-05,9.3e-05,0.000223,0.000698,0.002618,0.00455,0.002483,0.000872,0.000221,0.000182,0.000101,0.000321,0.000366,0.000112,9.2e-05,0.001031,0.002875,0.004823,0.001291,0.002826,0.003784,0.004045,0.001217,0.001871,0.002576,0.00345,0.000432,0.003764,0.003606,0.002142,0.006102,0.007339,0.002782,0.004094,0.004151,0.00527,0.003812,0.001036,0.004782,0.004001,0.006342,0.004958,0.001953,0.001907,0.003882,0.002507,0.002158,0.001256,0.001707,0.000324,0.000753,0.000154,0.000905,0.000613,0.002054,0.001057,0.000879,0.000884,0.001613,0.001154,0.000469,0.000516,0.00019,0.000411,0.000206,0.00017,0.000189,0.000215,0.000173,9.6e-05,8.4e-05,0.000946,0.000565,0.000313,0.000185,0.000288,0.000195,6.4e-05,0.000203,3.7e-05,9.4e-05,0.000191,0.000185,5.1e-05,4.1e-05,0.000116,8.5e-05,0.000183,0.000132,5.2e-05,3.8e-05,2.4e-05,3.1e-05,3.9e-05,4.4e-05,2.8e-05,3.2e-05
2.4e-05,1.8e-05,1.2e-05,1.7e-05,2.4e-05,6e-06,9e-06,5e-06,1.3e-05,2.5e-05,7e-06,3.2e-05,3e-05,1e-05,1.2e-05,4e-06,3.7e-05,1.1e-05,6e-06,1.2e-05,1.3e-05,0.000106,0.000327,0.000247,0.000118,9.4e-05,0.000162,0.000398,0.002113,0.00199,0.001671,0.000903,0.000195,0.000104,0.000154,0.000614,0.000493,0.000339,0.000185,0.001112,0.004142,0.004873,0.005789,0.004858,0.004861,0.004467,0.002757,0.001916,0.003193,0.001301,0.002192,0.001124,0.001868,0.003587,0.005345,0.002552,0.001379,0.001253,0.005781,0.004988,0.002525,0.002804,0.00158,0.00142,0.003322,0.004175,0.003595,0.002332,8.9e-05,0.001544,0.001787,0.00192,0.002067,0.002258,0.001305,0.000808,0.000734,0.00119,0.000237,0.000356,0.000617,0.000633,0.000479,0.000304,0.000819,7e-04,0.000425,0.000726,0.00049,0.000157,5.3e-05,0.000207,0.000251,0.000143,0.000139,0.001533,0.000946,0.000408,0.000134,0.000264,0.000154,7.4e-05,9.7e-05,0.000117,0.000123,9.6e-05,0.000277,0.000221,0.000172,5.9e-05,4.3e-05,0.000191,0.000366,0.000287,0.000125,4.4e-05,3.7e-05,3.4e-05,6.6e-05,4.7e-05,4.7e-05
1.5e-05,1.5e-05,1.2e-05,1.5e-05,2.6e-05,2.6e-05,1.7e-05,1.1e-05,1e-05,1.2e-05,2.7e-05,9e-06,4e-06,1.2e-05,2.7e-05,3.4e-05,1.5e-05,1.7e-05,9e-06,1.5e-05,9e-06,7.3e-05,0.000469,0.000252,3.7e-05,7.6e-05,0.000255,0.000553,0.000593,0.002001,0.000867,0.000358,5e-06,8.5e-05,0.000337,0.000893,0.000377,0.00022,6.2e-05,0.000871,0.003695,0.000619,0.002155,0.001033,0.001252,0.00134,0.00063,0.001733,0.002984,0.001706,0.001821,0.00243,0.002203,0.001256,0.003991,0.003294,0.001216,0.001281,0.002639,0.002355,0.003315,0.002846,0.001123,0.001574,0.0025,0.001082,0.001133,0.001836,0.001905,0.000431,0.002068,0.000643,0.000752,0.001555,9e-04,0.000957,0.000139,0.000538,0.000287,0.000486,0.000954,0.000462,0.000312,0.000109,0.000488,0.00027,0.000106,0.000616,0.000396,0.000223,8.2e-05,0.000263,8.4e-05,0.000129,6.1e-05,0.001595,0.000769,0.000303,9.5e-05,7.4e-05,4.5e-05,4.4e-05,4.5e-05,7.7e-05,0.000104,0.000333,0.000353,0.000147,8e-05,3.5e-05,3.6e-05,0.000168,0.000332,6e-05,4.4e-05,3.5e-05,2.4e-05,3e-06,3.1e-05,2e-06,2.8e-05
1.3e-05,5e-06,7e-06,6e-06,1.5e-05,1e-05,3e-06,8e-06,1.8e-05,2.3e-05,2e-06,2e-05,2.7e-05,2.6e-05,1.1e-05,1.9e-05,1e-05,7e-06,2e-06,1.5e-05,1.5e-05,6e-05,0.000415,0.000198,5.6e-05,5.1e-05,0.000151,0.000423,0.000953,0.001207,0.000467,0.000258,7.5e-05,0.000152,0.000283,0.000442,0.000337,0.000123,0.000103,0.000741,0.00202,0.001478,0.001895,0.001631,0.001506,0.001715,0.001113,0.001507,0.001975,0.000463,0.002475,6.3e-05,0.001608,0.001854,0.00277,0.000569,0.000506,0.000969,0.002346,0.002211,0.000664,0.000363,0.001349,0.000933,0.001828,0.001117,0.000793,0.001801,0.000931,0.000917,0.000945,0.000928,0.001028,0.000371,0.000297,0.000237,0.000362,8.9e-05,0.000519,0.000442,0.000809,0.000375,0.000223,7.7e-05,0.000468,0.000236,0.000101,0.000452,0.000173,4.5e-05,2.6e-05,0.000198,0.000278,0.000136,0.000235,0.001045,0.000549,0.000217,3.4e-05,6.6e-05,5.1e-05,1e-05,6.3e-05,4.7e-05,1.6e-05,0.000266,0.000124,5.5e-05,3.8e-05,4.1e-05,2.6e-05,0.000197,0.000155,0.00017,5.8e-05,4.1e-05,2.5e-05,4e-06,1.6e-05,1.9e-05,1.7e-05
2e-06,2e-06,2e-06,4e-06,4e-06,5e-06,4e-06,5e-06,8e-06,5e-06,6e-06,7e-06,9e-06,3e-06,1.4e-05,5e-06,4e-06,1e-06,5e-06,4e-06,8e-06,2e-05,9.6e-05,4.5e-05,1.2e-05,1.6e-05,0.000107,4.9e-05,0.000347,0.000521,0.00026,0.000131,5.4e-05,8e-06,7.3e-05,0.000179,8e-05,4.5e-05,5e-05,0.000189,0.000638,0.00069,0.00023,0.00051,0.000643,0.000504,7.3e-05,0.000664,0.00074,0.000241,0.000906,0.000534,0.000548,0.000804,0.000751,0.000414,0.000549,0.001076,0.000309,0.000625,0.00057,0.000427,6e-04,0.000304,0.000351,0.000239,0.000181,0.000214,0.000332,0.000257,0.00023,0.000159,0.000432,0.000145,0.000166,0.000167,0.000181,9.8e-05,5.1e-05,8e-06,0.000299,7.6e-05,8.6e-05,5.8e-05,0.000183,8.4e-05,3.6e-05,0.000146,4.6e-05,1.1e-05,2e-05,8.6e-05,9.5e-05,5.1e-05,0.000125,0.000328,0.000189,7.2e-05,1.8e-05,1.3e-05,1.2e-05,2e-06,2.7e-05,5.7e-05,4.9e-05,7.5e-05,4.1e-05,1.9e-05,2.3e-05,3e-05,3e-05,0.000101,9.5e-05,4.8e-05,1.3e-05,1.8e-05,1.1e-05,1.1e-05,5e-06,7e-06,7e-06
3e-06,2e-06,4e-06,6e-06,5e-06,6e-06,7e-06,2e-06,3e-06,5e-06,3e-06,1e-06,5e-06,5e-06,1e-05,4e-06,7e-06,4e-06,9e-06,0,5e-06,2e-05,3.9e-05,1.6e-05,4e-06,9e-06,9.8e-05,0.000181,0.000154,0.000508,0.000339,0.000131,3.9e-05,2.2e-05,5.1e-05,0.000107,4.3e-05,3.6e-05,1.8e-05,0.000193,0.000665,0.000705,0.00062,0.000328,1.8e-05,0.000501,0.000556,0.000434,0.000525,0.000686,0.000894,8e-05,0.000345,0.000148,0.000396,0.000598,0.000686,0.000953,0.000699,0.000266,0.000688,0.000112,0.000116,0.000447,0.000344,0.000228,5.1e-05,0.000416,0.00039,0.000148,0.000205,0.000214,0.000283,0.000186,0.000112,0.000164,5.1e-05,9.8e-05,5.9e-05,3e-05,2e-04,4.6e-05,6.2e-05,1.8e-05,0.000177,9.6e-05,2.3e-05,6.7e-05,5.9e-05,3.6e-05,1.4e-05,5.2e-05,7e-06,5e-06,8.9e-05,0.000331,0.000146,4e-05,1.7e-05,2e-05,9e-06,8e-06,1.2e-05,4.3e-05,8e-06,9.3e-05,3.8e-05,1.6e-05,1.7e-05,2.2e-05,5e-06,9.4e-05,6.5e-05,9e-06,9e-06,8e-06,8e-06,2e-06,5e-06,4e-06,9e-06
2e-06,1e-06,3e-06,3e-06,1e-06,5e-06,3e-06,3e-06,3e-06,4e-06,3e-06,3e-06,4e-06,1e-06,1e-05,5e-06,5e-06,5e-06,4e-06,5e-06,3e-06,2e-05,5.2e-05,2.8e-05,9e-06,4e-06,8.2e-05,0.000178,0.000318,0.000359,0.000256,6.9e-05,2e-06,4e-05,4.9e-05,0.00011,3.9e-05,2.4e-05,2.6e-05,0.000241,0.000513,0.000597,0.000415,0.000361,0.000175,0.000596,0.000483,0.000347,0.000447,0.000327,0.000287,3e-04,0.000305,0.000646,0.000291,0.00045,0.000605,0.000408,0.000141,0.000578,0.000406,0.00032,0.000196,0.000355,0.000313,0.000165,0.000111,0.000232,0.000299,7.6e-05,0.000143,0.000129,0.000199,0.000112,8.9e-05,0.000151,5.6e-05,8.4e-05,2.2e-05,9e-06,0.000171,3.4e-05,4.1e-05,3.5e-05,0.000113,6.5e-05,9e-06,1.5e-05,2e-06,1.4e-05,1.8e-05,5.2e-05,3.6e-05,1.4e-05,5.9e-05,0.000214,0.000112,2.7e-05,6e-06,1.1e-05,3e-06,1.1e-05,1.5e-05,2e-05,3.2e-05,8.4e-05,3.1e-05,1.4e-05,9e-06,2.4e-05,1.6e-05,9.8e-05,3.8e-05,2e-06,1.1e-05,6e-06,8e-06,1.2e-05,5e-06,7e-06,0
4e-06,1e-06,2e-06,5e-06,5e-06,4e-06,6e-06,4e-06,5e-06,5e-06,8e-06,2e-06,6e-06,4e-06,6e-06,6e-06,4e-06,1e-06,2e-06,4e-06,4e-06,2.1e-05,3.8e-05,2.8e-05,1.1e-05,1.1e-05,8.6e-05,7.9e-05,2.3e-05,0.00017,0.000151,7.6e-05,2e-05,4.6e-05,2.2e-05,0.000128,4e-05,1.9e-05,2e-05,0.000251,0.000188,0.000629,0.000741,0.000267,0.000294,0.000632,0.000468,0.000323,0.000584,6.8e-05,0.000432,6e-05,0.000442,0.000413,0.000698,0.000237,0.000781,0.000335,0.000409,0.000421,0.000454,0.000178,0.000111,0.000335,0.000251,0.000238,0.000192,0.000144,0.000231,9e-06,0.000128,9.7e-05,0.000181,0.000128,6.5e-05,0.00016,4.7e-05,6.1e-05,9.3e-05,3.9e-05,0.000136,1.6e-05,5.8e-05,2.6e-05,9.2e-05,8.1e-05,3.2e-05,2.4e-05,1.7e-05,2.5e-05,3e-06,4.4e-05,2.7e-05,1.3e-05,5e-05,9.7e-05,5.2e-05,1.8e-05,9e-06,7e-06,5e-06,9e-06,6e-06,2.4e-05,1.3e-05,4.4e-05,1.3e-05,1.4e-05,1.2e-05,2.2e-05,4e-06,8.9e-05,3.5e-05,9e-06,1.3e-05,5e-06,7e-06,1e-05,4e-06,4e-06,2e-06
5e-06,3e-06,5e-06,4e-06,4e-06,7e-06,5e-06,1e-06,1e-06,4e-06,6e-06,6e-06,6e-06,8e-06,7e-06,5e-06,3e-06,6e-06,4e-06,7e-06,8e-06,2.2e-05,3.8e-05,4e-06,4e-06,1.5e-05,6.5e-05,0.000173,0.000375,0.000241,0.000211,0.000107,2.3e-05,4e-05,5.1e-05,0.000178,6.3e-05,3e-05,1.3e-05,0.000249,7.1e-05,0.000119,0.000761,0.000236,0.00041,0.000203,0.000256,0.000159,3.5e-05,9.3e-05,9.6e-05,0.000335,0.000496,0.000659,0.000584,0.000235,0.000466,0.000538,0.000343,0.000504,0.000288,0.000361,0.000237,0.000237,0.000327,0.000222,0.000146,0.000197,0.000282,8e-05,0.000144,0.000103,0.000149,0.00011,0.000144,0.000125,5e-05,9.8e-05,4.4e-05,4.9e-05,3.4e-05,6.7e-05,7.4e-05,3.3e-05,5.4e-05,3.8e-05,3.6e-05,3.6e-05,2.7e-05,4e-06,1e-05,4.1e-05,3e-05,2.2e-05,8e-05,0.000154,6.7e-05,2.1e-05,9e-06,4e-06,1e-05,1.1e-05,5e-06,1.4e-05,1.9e-05,3.2e-05,6e-06,2e-06,7e-06,1.3e-05,8e-06,7.9e-05,3e-05,6e-06,4e-06,1.1e-05,2e-06,1e-06,5e-06,2e-06,2e-06
5e-06,6e-06,5e-06,4e-06,2e-06,2e-06,4e-06,4e-06,5e-06,4e-06,2e-06,4e-06,7e-06,6e-06,4e-06,2e-06,3e-06,7e-06,1e-06,7e-06,1e-05,2.9e-05,2.9e-05,2.1e-05,2e-06,1.6e-05,7.6e-05,0.000184,0.00028,0.000421,0.000226,0.000118,2.8e-05,3.7e-05,2.1e-05,0.000117,0.000109,6.1e-05,4.2e-05,0.000237,0.000243,0.000124,0.00105,0.000719,0.000325,0.000241,0.000433,0.000314,0.000249,0.000473,0.000367,0.00016,0.00043,0.000476,0.000518,0.000153,0.000288,0.000346,0.000292,0.000394,0.000304,0.00033,0.00026,0.000313,0.000242,0.000137,0.000197,0.000119,0.000246,0.000174,2.8e-05,3.8e-05,0.000198,0.000132,8.9e-05,8.6e-05,5.9e-05,5.2e-05,6e-05,0.000129,0.000201,4.6e-05,5.5e-05,2.2e-05,6.4e-05,5e-05,1.8e-05,4e-05,2.4e-05,2.1e-05,1.2e-05,3.2e-05,5.3e-05,3.5e-05,0.000113,0.000182,9.6e-05,3.4e-05,1.5e-05,9e-06,3e-06,1.2e-05,1.2e-05,9e-06,1.1e-05,1.4e-05,1e-05,9e-06,8e-06,1.2e-05,2e-06,7.2e-05,3e-06,2.1e-05,2.2e-05,1.6e-05,1e-05,6e-06,6e-06,6e-06,5e-06
9e-06,5e-06,4e-06,5e-06,1e-06,2e-06,6e-06,3e-06,5e-06,9e-06,7e-06,8e-06,2e-06,6e-06,2e-06,2e-06,3e-06,4e-06,5e-06,6e-06,6e-06,2.5e-05,4.6e-05,1.8e-05,6e-06,1e-05,6.6e-05,0.000157,7.7e-05,0.000259,0.00022,9.7e-05,3.7e-05,4.7e-05,6.2e-05,0.00011,0.000113,5.5e-05,2.7e-05,0.000318,0.000567,0.000409,0.000484,0.000273,0.000311,0.000218,0.000311,0.000296,0.000482,0.00047,0.000738,0.000253,0.000152,2.8e-05,0.000376,8.3e-05,0.000299,0.000288,0.000467,0.000279,0.000223,0.000263,0.000267,0.000176,0.000166,8.9e-05,0.000151,0.000434,0.000305,9.7e-05,0.000267,5.4e-05,0.000246,3.1e-05,9.7e-05,0.000136,3.5e-05,2.6e-05,0.000149,6.4e-05,0.000281,0.000163,9.2e-05,5.8e-05,4.4e-05,2.9e-05,3.3e-05,6.4e-05,5e-05,2.6e-05,1.2e-05,2.8e-05,3.1e-05,2e-05,9.2e-05,0.000186,8.3e-05,1.6e-05,7e-06,2.3e-05,1.3e-05,1.1e-05,1.4e-05,1.7e-05,3e-06,3e-06,1.5e-05,1e-05,6e-06,1.2e-05,2.1e-05,6.3e-05,4.5e-05,2.6e-05,2.2e-05,3e-06,4e-06,8e-06,5e-06,2e-06,4e-06
6e-06,4e-06,3e-06,7e-06,7e-06,6e-06,1e-06,2e-06,2e-06,4e-06,3e-06,8e-06,4e-06,3e-06,3e-06,3e-06,6e-06,2e-06,3e-06,4e-06,3e-06,3.3e-05,4.6e-05,3.1e-05,1.2e-05,6e-06,7.2e-05,0.000225,0.00025,0.000288,0.000144,2.7e-05,3.9e-05,1.9e-05,5e-05,0.000223,4.5e-05,4.3e-05,2.9e-05,0.000387,0.000421,0.000293,0.000135,0.000135,0.000343,0.000428,7.2e-05,0.00022,0.000558,0.000377,0.000274,0.000422,8.4e-05,0.000116,0.00036,0.000337,0.00023,0.000533,0.000141,0.000374,0.000222,0.000186,0.000292,0.000167,0.000247,0.000347,0.000135,0.000328,0.000118,0.000175,0.000117,0.000119,0.000101,7.7e-05,0.000167,7.3e-05,0.000104,0.00011,7.9e-05,0.000109,0.000336,9.2e-05,7.8e-05,1.3e-05,0.000109,6.2e-05,1.2e-05,4.8e-05,4.7e-05,2e-05,6e-06,3.5e-05,2.8e-05,3.1e-05,5.9e-05,0.000161,0.00011,4.9e-05,1e-05,4.3e-05,4.7e-05,3.4e-05,3.7e-05,2.5e-05,3.1e-05,1.4e-05,1.2e-05,5e-06,1.2e-05,1.9e-05,7e-06,8.6e-05,6.6e-05,1.9e-05,1.6e-05,1.1e-05,1.1e-05,4e-06,6e-06,5e-06,3e-06
3e-06,6e-06,3e-06,1e-06,4e-06,5e-06,4e-06,3e-06,2e-06,6e-06,4e-06,8e-06,8e-06,2e-06,3e-06,2e-06,5e-06,2e-06,4e-06,6e-06,2e-06,3.5e-05,3.2e-05,1.3e-05,1.3e-05,1.7e-05,6.3e-05,0.000171,7.1e-05,0.000411,0.000223,0.000121,2.4e-05,3e-05,3.1e-05,0.000251,0.00016,6.6e-05,4.1e-05,0.000394,0.000259,0.000448,0.000476,0.00029,0.000139,0.000617,0.000284,0.000133,0.00057,0.000459,0.000408,0.000113,1.7e-05,9.7e-05,0.000222,0.000279,0.000296,5.3e-05,0.000247,0.000438,0.000257,0.000128,2.3e-05,0.000179,0.000194,0.000185,0.000135,0.000241,0.000259,7.1e-05,1.8e-05,0.000137,0.000152,0.000217,0.000177,3.7e-05,0.000102,7.8e-05,0.00013,8.9e-05,0.000178,0.000155,8.1e-05,0.000103,9.5e-05,4.1e-05,1.7e-05,4.4e-05,3.7e-05,1.4e-05,4e-06,3.1e-05,5.1e-05,2.2e-05,5.9e-05,0.00011,7.1e-05,3.4e-05,4e-06,4.9e-05,2.2e-05,6e-06,2.6e-05,3e-05,7e-06,2.4e-05,1.7e-05,1.3e-05,1e-05,1.4e-05,1.4e-05,8.7e-05,7e-06,0,6e-06,7e-06,3e-06,2e-06,6e-06,8e-06,8e-06
3e-06,2e-06,3e-06,4e-06,6e-06,3e-06,1e-06,4e-06,3e-06,7e-06,6e-06,5e-06,1e-06,4e-06,2e-06,4e-06,2e-06,3e-06,1e-06,1e-06,2e-06,3.2e-05,3e-05,2.3e-05,1.4e-05,7e-06,5.6e-05,0.000136,0.000208,0.000332,0.000133,9.2e-05,3.6e-05,2.9e-05,2.3e-05,0.000169,0.000127,3.9e-05,1.6e-05,0.000414,0.000403,0.000481,0.000354,0.000291,0.000259,0.000491,0.000343,0.000181,0.000434,7.9e-05,0.000333,0.000156,2.7e-05,4.4e-05,0.000178,7.4e-05,0.000113,0.000345,0.000243,0.000365,0.000127,0.000174,0.000214,5.3e-05,0.000196,0.000149,1e-04,0.000184,0.000306,0.000143,0.000203,7.2e-05,4.1e-05,0.000282,0.000154,1e-04,3.1e-05,7.1e-05,0.000129,0.000121,1.7e-05,5.9e-05,7.6e-05,6.7e-05,0.000121,4.7e-05,3e-05,3.8e-05,2.5e-05,2e-05,2e-05,1.5e-05,2.8e-05,1.8e-05,6.6e-05,3e-05,6e-06,1.4e-05,7e-06,3.6e-05,3.5e-05,1.9e-05,1.8e-05,4e-06,1.2e-05,3e-05,5e-06,1.3e-05,8e-06,1.8e-05,9e-06,7.5e-05,9.3e-05,4.1e-05,1.9e-05,3e-06,5e-06,2e-06,7e-06,1.1e-05,4e-06
4e-06,1e-06,4e-06,5e-06,0,1e-06,1e-06,5e-06,3e-06,3e-06,4e-06,1e-06,2e-06,2e-06,3e-06,2e-06,5e-06,1e-06,1e-06,3e-06,3e-06,3.2e-05,3.5e-05,1.2e-05,8e-06,6e-06,6e-05,0.000198,0.000161,0.000139,0.000173,9.1e-05,4.6e-05,6.3e-05,3.9e-05,4.9e-05,6.1e-05,4.1e-05,1e-05,0.000363,0.000136,0.000169,0.000258,0.000304,0.000502,0.000275,0.000164,0.000269,0.000294,0.000202,0.000252,0.000126,4.7e-05,6.7e-05,0.000187,0.00027,0.000158,0.000116,0.00015,0.000129,1e-04,0.000187,0.000322,0.000135,0.000226,0.00035,0.000298,0.000271,0.000171,8.9e-05,0.000169,0.000149,0.000195,9.9e-05,3.5e-05,8.9e-05,3.8e-05,5.3e-05,4.6e-05,0.000168,0.000166,6.3e-05,0.00011,8e-05,0.000162,7.1e-05,1.7e-05,2.6e-05,2.1e-05,1.9e-05,1.1e-05,2.9e-05,2.7e-05,1.1e-05,6.2e-05,0.000161,8.9e-05,2.7e-05,7e-06,1.9e-05,1.4e-05,8e-06,1.3e-05,7e-06,1.4e-05,2.4e-05,5e-06,8e-06,5e-06,1.7e-05,7e-06,4.7e-05,8.3e-05,3.7e-05,2e-05,9e-06,9e-06,3e-06,5e-06,2e-06,4e-06
2e-06,3e-06,2e-06,2e-06,1e-06,1e-06,2e-06,2e-06,3e-06,3e-06,3e-06,2e-06,3e-06,2e-06,1e-06,1e-06,4e-06,1e-06,1e-06,2e-06,2e-06,3.6e-05,5e-05,2.9e-05,1e-05,7e-06,6.2e-05,0.000134,0.000158,4.2e-05,0.000162,9.7e-05,4.9e-05,2.3e-05,1.5e-05,6.6e-05,5.7e-05,3e-05,8e-06,0.000296,0.00031,0.000191,0.000389,0.000183,0.000221,0.000405,0.00038,0.000253,4.3e-05,0.000115,0.000343,0.000128,3.2e-05,0.000214,6.1e-05,8.1e-05,0.000123,0.000106,8.4e-05,0.000293,0.000124,0.000118,3.7e-05,5.7e-05,0.000185,0.000185,3.9e-05,0.000181,0.000143,4.1e-05,3.3e-05,8.5e-05,0.000188,0.000109,0.000101,0.000101,4.4e-05,7e-05,6.5e-05,0.000166,2.8e-05,0.000146,6.2e-05,6.1e-05,0.000142,5.8e-05,4.6e-05,1.3e-05,1.3e-05,3e-05,2.3e-05,1e-05,2.6e-05,2.3e-05,7.3e-05,0.000272,0.000187,8e-05,3e-05,1e-05,7e-06,1.1e-05,7e-06,7e-06,8e-06,3.6e-05,6e-06,5e-06,3e-06,8e-06,6e-06,4.7e-05,2.7e-05,9e-06,1.5e-05,1.2e-05,5e-06,9e-06,9e-06,4e-06,2e-06
2e-06,4e-06,4e-06,3e-06,2e-06,1e-06,4e-06,3e-06,4e-06,5e-06,3e-06,0,3e-06,3e-06,4e-06,3e-06,3e-06,2e-06,1e-06,1e-06,2e-06,3.6e-05,5.4e-05,3.1e-05,1.5e-05,1e-06,5.8e-05,0.00013,0.000351,0.000294,0.00024,0.000138,5.6e-05,1.8e-05,2.5e-05,0.000157,3.8e-05,6e-06,2e-05,0.000296,0.000278,0.000206,0.000268,2e-04,0.000139,0.000232,9.8e-05,0.000427,0.00024,0.000192,0.000561,9.1e-05,3e-05,0.000337,0.000239,0.000109,2.6e-05,0.000144,6.2e-05,0.000231,7e-05,6.2e-05,0.000149,5.7e-05,9.6e-05,2.7e-05,0.000172,0.000224,2e-04,0.000111,2.8e-05,0.000105,0.000154,0.000113,2.4e-05,0.000116,5.2e-05,3.9e-05,6.4e-05,0.000117,6.8e-05,0.000136,3.6e-05,7e-05,0.000171,0.000119,7.3e-05,6.1e-05,1.7e-05,2.2e-05,1.8e-05,1.5e-05,1e-05,2.3e-05,7.4e-05,0.000338,0.000204,9e-05,2.8e-05,1.6e-05,1.3e-05,1.5e-05,7e-06,4e-06,1.6e-05,3.9e-05,1.9e-05,1e-05,6e-06,1.3e-05,6e-06,4.6e-05,6e-05,2.4e-05,1.6e-05,9e-06,7e-06,1e-05,6e-06,1.1e-05,7e-06
1e-06,1e-06,5e-06,2e-06,1e-06,1e-06,3e-06,0,1e-06,2e-06,2e-06,1e-06,1e-06,2e-06,3e-06,3e-06,3e-06,2e-06,2e-06,1e-06,1e-06,3.4e-05,4e-05,2.4e-05,6e-06,2e-06,5e-05,0.000214,0.000283,3.6e-05,0.00022,0.00014,5.2e-05,1.8e-05,4.4e-05,0.000236,0.00018,9.8e-05,5.1e-05,0.000292,0.000139,0.000365,0.000326,0.000186,0.000311,0.000429,0.000263,0.000465,0.000174,0.000371,0.000258,0.000211,5.9e-05,0.000232,0.000301,0.000133,5.5e-05,4.5e-05,0.000201,0.000102,0.000107,0.000128,7.2e-05,0.000184,0.000207,0.00014,0.000237,0.000175,0.000284,4.9e-05,0.000157,9.3e-05,0.000201,9.9e-05,4e-05,6.2e-05,7e-05,4.3e-05,6.4e-05,0.000118,0.000123,0.000203,7.8e-05,6.7e-05,0.000109,0.000128,4.7e-05,2.9e-05,5e-05,2.3e-05,2.1e-05,3.9e-05,3.9e-05,3.2e-05,7.8e-05,0.000559,0.000229,8.5e-05,2.6e-05,1.9e-05,3e-06,1.2e-05,9e-06,6e-06,2e-05,2e-05,2e-06,9e-06,6e-06,1.5e-05,1.2e-05,2.7e-05,3.5e-05,3.6e-05,1e-05,7e-06,7e-06,1e-06,2e-06,5e-06,6e-06
1e-06,1e-06,4e-06,7e-06,1e-06,1e-06,1e-06,1e-06,1e-06,3e-06,4e-06,3e-06,2e-06,2e-06,2e-06,1e-06,3e-06,2e-06,3e-06,1e-06,1e-06,3.3e-05,1.3e-05,3e-06,1e-05,6e-06,5.3e-05,0.000199,0.000251,0.000218,0.000444,0.000188,7.1e-05,2.5e-05,3.2e-05,0.000272,0.000252,0.00012,2.9e-05,0.000209,7.9e-05,0.000391,0.000589,0.000465,0.000505,0.000887,0.000279,0.000361,0.000239,0.000761,0.000558,0.000203,0.000211,0.000491,0.000198,8e-05,8.2e-05,9e-05,0.000139,0.000131,0.000116,0.000207,0.00026,0.000181,5.2e-05,0.000255,7.3e-05,0.000185,0.000131,0.000259,0.000291,0.000219,0.000313,0.000237,9.9e-05,0.000167,0.000118,0.000101,4.8e-05,5.8e-05,0.000283,0.000122,0.000235,0.000155,7.1e-05,0.000104,5.6e-05,3.3e-05,4.1e-05,1.6e-05,1.4e-05,2.6e-05,6.4e-05,9.2e-05,4.1e-05,0.000579,0.000348,0.000171,6.4e-05,5.2e-05,3.3e-05,1.7e-05,2e-05,1.1e-05,1e-05,2.1e-05,2.6e-05,7e-06,3e-06,1e-06,4e-06,2.8e-05,2.1e-05,2.2e-05,2.1e-05,1e-05,4e-06,3e-06,3e-06,1e-06,3e-06
3e-06,3e-06,2e-06,4e-06,4e-06,2e-06,1e-06,1e-06,1e-06,4e-06,2e-06,1e-06,2e-06,3e-06,0,3e-06,5e-06,2e-06,2e-06,3e-06,1e-06,3.1e-05,7e-06,1e-06,3e-06,3e-06,4.8e-05,0.000148,0.000174,0.000109,0.000364,0.000318,0.000145,3.6e-05,2.5e-05,0.000255,0.000226,9.9e-05,3.4e-05,0.000184,0.000108,0.000252,0.000425,0.000257,0.000327,0.000273,0.000255,0.000198,0.000375,0.000415,0.000291,0.000339,0.00028,0.000551,0.000329,0.000233,0.000121,7e-05,0.000166,0.00019,0.000102,0.00018,4e-04,0.000195,4.3e-05,0.000276,0.000242,0.00031,0.000261,0.000371,3e-05,0.000145,1.1e-05,0.000249,0.000273,0.000272,0.000161,0.000104,5.3e-05,4e-05,0.000224,0.000277,0.000366,0.000226,6.5e-05,0.00016,9.1e-05,3.1e-05,2e-05,7e-06,8e-06,2.2e-05,5.8e-05,4.3e-05,5.2e-05,0.000528,0.000392,0.000175,6.3e-05,2.3e-05,1.3e-05,4e-06,1.1e-05,1.1e-05,1.3e-05,1.2e-05,2.7e-05,2.6e-05,9e-06,9e-06,5e-06,2.7e-05,3.9e-05,1.6e-05,3e-06,8e-06,5e-06,6e-06,6e-06,9e-06,5e-06
1e-06,2e-06,3e-06,1e-06,3e-06,1e-06,0,2e-06,1e-06,4e-06,1e-06,2e-06,4e-06,1e-06,3e-06,1e-06,3e-06,1e-06,2e-06,0,1e-06,2.7e-05,9e-06,8e-06,1.1e-05,5e-06,5.1e-05,0.000143,6.1e-05,0.000175,0.000343,0.000188,6.6e-05,2.3e-05,2.1e-05,0.000184,0.000151,8.4e-05,3.3e-05,0.000195,0.00012,0.000246,0.000213,0.000173,0.000316,0.000233,0.000246,7.6e-05,0.00032,0.000357,0.000222,7.6e-05,0.000237,0.00025,0.000216,0.000134,4.3e-05,0.000139,8.7e-05,6e-05,0.000138,0.000213,9.1e-05,0.000111,0.000107,6.6e-05,7.7e-05,4.3e-05,0.000136,0.000116,0.00016,8.9e-05,0.000112,0.000129,7.3e-05,0.000153,3.8e-05,0.000107,0.000156,0.000114,0.000139,4.9e-05,0.000207,0.00019,0.000171,8.3e-05,3.6e-05,1.9e-05,1.8e-05,1.2e-05,8e-06,1.2e-05,4.3e-05,2.1e-05,1.3e-05,0.000327,0.000211,7.9e-05,3e-05,1.2e-05,9e-06,3e-06,1.1e-05,8e-06,1.1e-05,2e-06,1.3e-05,7e-06,6e-06,5e-06,1e-06,2.7e-05,2.4e-05,1e-05,8e-06,1e-05,9e-06,1e-05,2e-06,6e-06,4e-06
2e-06,2e-06,2e-06,1e-06,1e-06,0,0,1e-06,1e-06,3e-06,0,2e-06,3e-06,0,3e-06,1e-06,2e-06,0,1e-06,1e-06,0,2.6e-05,8e-06,8e-06,6e-06,5e-06,5.1e-05,0.000121,6e-06,0.000147,0.000105,9e-06,1.3e-05,3e-06,1.1e-05,0.000105,4.1e-05,3.2e-05,1.2e-05,0.000166,0.000108,0.000234,0.000305,0.000189,0.000462,0.000302,9.7e-05,0.000201,0.000122,6.7e-05,0.00022,8.7e-05,0.000175,0.000219,0.000241,0.00014,6.6e-05,0.000183,0.000138,8.4e-05,1.7e-05,6.7e-05,0.000234,0.000214,0.000181,0.000129,2.3e-05,0.000126,0.000175,8.2e-05,5.3e-05,0.000116,5.2e-05,5.6e-05,3.7e-05,0.000151,1.4e-05,9.7e-05,7.5e-05,4e-05,6.1e-05,2.4e-05,0.000125,3.3e-05,9.5e-05,1.4e-05,1e-05,2e-05,1.3e-05,3e-06,4e-06,1.6e-05,2.1e-05,1.5e-05,1.6e-05,0.000145,5.8e-05,3.2e-05,1.9e-05,1e-05,1e-06,2e-06,1e-05,4e-06,1e-05,1e-05,7e-06,1e-06,5e-06,5e-06,4e-06,2.7e-05,9e-06,1e-06,7e-06,9e-06,4e-06,4e-06,3e-06,1e-06,1e-06
1e-06,2e-06,1e-06,0,1e-06,0,1e-06,0,0,3e-06,1e-06,2e-06,3e-06,0,2e-06,1e-06,2e-06,1e-06,0,2e-06,0,2.5e-05,8e-06,4e-06,5e-06,6e-06,5.1e-05,0.000113,6.1e-05,0.000114,7.1e-05,3.8e-05,9e-06,3e-06,1.1e-05,6.1e-05,1e-05,8e-06,4e-06,0.000167,0.000211,8.7e-05,0.000223,3.1e-05,0.000312,0.000382,0.000244,0.000257,0.000168,8.1e-05,0.00031,4.2e-05,7.1e-05,0.000182,0.000117,0.000164,9.3e-05,0.000197,9.2e-05,0.000129,9e-06,5.3e-05,0.000223,0.000172,5.9e-05,9e-05,7.7e-05,0.000118,0.000107,5.1e-05,4.3e-05,0.000102,7e-05,4.7e-05,4.9e-05,0.000133,3.1e-05,6.4e-05,5.1e-05,3.2e-05,4.8e-05,3.4e-05,6.7e-05,2e-05,5.6e-05,5e-06,7e-06,2e-05,1.1e-05,6e-06,1e-06,1e-05,1.6e-05,8e-06,9e-06,5.6e-05,1.3e-05,1.2e-05,5e-06,8e-06,4e-06,4e-06,3e-06,5e-06,7e-06,8e-06,6e-06,2e-06,3e-06,3e-06,2e-06,2.5e-05,1.6e-05,1e-06,6e-06,4e-06,1e-06,4e-06,2e-06,1e-06,1e-06
1e-06,2e-06,1e-06,1e-06,0,0,1e-06,1e-06,1e-06,3e-06,0,1e-06,3e-06,1e-06,2e-06,1e-06,2e-06,1e-06,1e-06,1e-06,0,2.3e-05,3e-06,4e-06,3e-06,4e-06,4.9e-05,0.000107,5.6e-05,9.4e-05,2.9e-05,2.5e-05,1.1e-05,1e-06,9e-06,3.3e-05,8e-06,1.1e-05,3e-06,0.000176,0.000192,9e-05,0.000256,6.5e-05,0.000229,0.000161,2.7e-05,0.000221,0.000115,7.7e-05,0.000237,5.2e-05,0.000108,7.9e-05,0.000177,0.000165,3.9e-05,0.000192,6.6e-05,0.00016,3.9e-05,2.3e-05,0.000114,9.4e-05,8.7e-05,3e-05,7.2e-05,0.000135,9.4e-05,2.7e-05,8e-06,9.2e-05,8.2e-05,4.6e-05,4e-05,0.000116,2.5e-05,6.4e-05,4.9e-05,1.8e-05,4.4e-05,2.9e-05,5.8e-05,2e-05,4.8e-05,5e-06,6e-06,1.7e-05,9e-06,3e-06,4e-06,8e-06,1.5e-05,9e-06,8e-06,3.9e-05,5e-06,7e-06,1e-05,6e-06,5e-06,4e-06,6e-06,3e-06,5e-06,8e-06,5e-06,2e-06,2e-06,3e-06,3e-06,2.5e-05,1.4e-05,1e-06,2e-06,4e-06,2e-06,5e-06,0,1e-06,1e-06
