0.000136,9e-05,1e-05,1e-06,0.000172,0.000103,0.00011,3.6e-05,0.000215,4.9e-05,3.5e-05,0.000248,0.000107,6.3e-05,1.1e-05,1.6e-05,0.000104,9.9e-05,6e-05,1.9e-05,7e-06,7e-05,5e-06,0.000121,1.3e-05,2e-05,0.000104,7.8e-05,8.2e-05,5e-05,9.1e-05,6.3e-05,0.000124,0.000178,2.2e-05,1.7e-05,0.000119,5.1e-05,5e-06,0.00012,4.3e-05,1.3e-05,1.2e-05,6.2e-05,0.000169,4.1e-05,0.000205,0.00013,7.5e-05,2.7e-05,3e-05,4.3e-05,5.5e-05,4.9e-05,2.1e-05,7.5e-05,2.9e-05,3e-05,5.2e-05,7.7e-05,4.4e-05,6.2e-05,2e-06,7.8e-05,0,4.3e-05,0.00016,8e-06,6.2e-05,0.00013,2.8e-05,0.000128,5.9e-05,6.1e-05,8.8e-05,2.7e-05,4.4e-05,0.00013,2.5e-05,5.8e-05,0.000148,0.000193,5.9e-05,0.000141,3.1e-05,4.5e-05,0.000148,5.2e-05,4.6e-05,1.2e-05,0.000128,2e-05,7.9e-05,0.000128,1.9e-05,0.000201,0.000129,1.7e-05,3.4e-05,5.4e-05,1.3e-05,7.8e-05,2.5e-05,2.4e-05,6e-06,2.4e-05,3e-06,0.000106,6.1e-05,7.4e-05,7.9e-05,8.6e-05,4.3e-05,7e-05,0.00013,3.4e-05,7e-05,9.5e-05,6.7e-05,5.5e-05,4.7e-05
0.000257,0.000293,0.000196,0.000121,0.000319,0.000221,0.000233,0.000213,0.000498,8.5e-05,6e-05,0.000519,0.000211,0.000171,7e-05,8.8e-05,0.000186,0.000223,6.9e-05,8.7e-05,7.5e-05,0.000241,7.8e-05,0.00029,6.8e-05,0.000145,0.000216,0.000201,0.000222,0.000104,0.000188,5.6e-05,0.000278,3e-04,9.8e-05,0.000143,0.000257,9.5e-05,9.3e-05,0.000183,0.000118,7.8e-05,7.4e-05,0.000176,0.000419,0.000192,0.000487,0.000298,0.000108,0.000114,0.000141,0.000128,0.000196,8.5e-05,8e-05,0.00018,5e-05,5.6e-05,0.000107,0.000193,5.2e-05,0.000117,3.2e-05,0.000194,5.2e-05,5.7e-05,0.000332,0.000123,0.000136,0.000349,1e-04,0.000255,0.000107,0.000164,0.00014,4.4e-05,0.000128,0.000253,4.2e-05,0.000157,0.000294,0.000398,0.000129,0.000295,0.000111,9.2e-05,0.000307,0.00015,6.8e-05,9.9e-05,0.000313,2.9e-05,0.000142,0.000233,0.000102,0.000408,0.000307,4e-05,8.7e-05,0.000144,8.5e-05,0.000227,9.5e-05,3e-05,5.3e-05,0.000118,7.9e-05,0.000193,0.000159,0.000174,0.000178,0.000194,7.1e-05,0.000177,0.000266,0.000115,0.000132,0.000167,0.000192,9.3e-05,0.000158
0.000707,9.2e-05,4.7e-05,3.9e-05,0.000439,0.000243,0.000259,0.000189,0.000516,0.000252,0.000147,0.000605,0.00048,0.000383,0.00021,0.000304,0.000415,0.000402,0.000336,0.000162,0.000241,0.000318,0.000294,0.000503,0.000461,0.000419,0.000198,0.000177,0.000223,9.3e-05,2.3e-05,0.000138,0.000446,0.000413,0.000269,2e-04,0.000276,8.4e-05,0.000138,0.000273,0.000106,9e-05,0.000111,0.000291,0.000467,0.000305,0.00056,0.000254,4e-04,0.000239,0.000461,0.000145,3.9e-05,0.000288,4.7e-05,0.000313,0.000172,4e-05,0.000104,0.000336,0.000154,0.000207,0.000107,0.000231,0.00012,0.000162,0.000287,0.000125,0.000321,0.000105,0.000494,0.00042,0.000344,0.000208,0.000222,7.6e-05,0.000132,0.000561,0.00024,0.000252,0.000199,0.000318,0.00028,0.000324,9.3e-05,0.000364,0.000484,0.00019,0.000376,0.00025,0.000353,0.000177,0.000427,0.000362,0.000148,0.000583,0.000215,3.5e-05,0.000114,0.000202,0.000157,0.000388,7.8e-05,0.000126,0.000124,4.2e-05,0.000266,0.000348,0.00023,0.000509,0.000201,0.00032,0.000118,0.000224,0.000655,0.000189,0.000292,0.000227,0.000113,0.00026,0.000169
0.000474,0.000489,8e-04,0.000359,0.000731,0.000265,0.00064,0.000424,0.000376,0.000771,0.000285,0.000506,0.000472,0.000299,0.000119,0.000493,0.000176,0.000353,0.000217,0.000207,0.000483,0.000577,0.000257,0.000293,0.000364,0.000614,0.000612,8.6e-05,0.000448,0.000301,0.000223,0.000195,0.000307,0.00078,0.000294,0.000353,0.00072,6.4e-05,0.000369,0.000346,0.000137,0.000296,0.000325,0.000523,0.000217,0.000729,0.000269,0.000346,0.000339,0.000332,0.000332,0.000329,0.00012,0.000408,0.000539,0.000621,0.000477,0.000318,0.000136,0.000692,3.9e-05,0.000277,0.000154,0.000188,0.00045,0.000205,3.1e-05,0.000506,0.000332,0.000217,0.000757,0.000247,0.001165,0.000433,0.000203,0.000215,0.000109,0.000702,0.00033,0.000227,0.000294,0.000419,0.000585,0.000625,0.000383,0.000632,0.000391,0.000442,0.000267,0.000439,0.000427,0.00031,0.00053,0.000405,0.000497,0.000562,0.00075,0.000206,0.000291,0.000222,0.000508,9.4e-05,0.00068,0.000606,0.000558,0.000418,0.000318,8.5e-05,0.000539,0.000847,0.000884,0.000555,0.000447,0.000214,0.000813,0.000761,0.000502,9.4e-05,0.000454,0.000431,0.00055
0.000614,0.000755,0.001009,0.000898,0.000361,0.000722,0.001516,0.002134,0.001881,0.001622,0.001807,0.001118,0.001035,0.001051,0.000642,0.000758,0.000417,0.000884,0.000726,0.000581,0.000369,0.000466,0.000482,0.000584,0.000877,0.001037,0.000722,0.000643,0.000948,0.001274,0.000521,0.000486,0.00042,0.000968,0.000783,0.000302,0.001522,0.001568,0.000993,0.000548,0.000175,0.000372,0.000571,0.000997,0.000975,0.000992,0.000819,0.000308,0.000472,0.000678,0.000462,0.000523,0.000505,0.000166,0.000645,0.000255,0.000433,0.000331,0.000309,0.000605,0.000628,5.9e-05,0.000714,0.000857,0.001047,0.00077,0.000412,0.000972,0.000406,0.000712,0.001076,0.001153,0.002157,0.002483,0.001346,0.00088,0.000211,0.000775,0.000464,0.000375,0.000681,0.000597,0.000812,0.000947,0.000779,0.001222,0.000907,0.001044,0.000568,0.00036,0.000711,0.000107,0.000113,0.000436,0.000688,0.000327,0.000634,0.000245,0.00065,0.000473,0.000591,0.00076,0.00123,0.00037,0.000701,0.000231,0.00063,0.000765,0.000807,0.001734,0.002417,0.001606,0.001141,0.000877,0.000418,0.001172,0.001169,0.000976,0.000619,0.00092,0.000509
0.000208,0.00066,0.001732,0.000783,0.000519,0.00088,0.00074,0.001112,0.000652,0.000806,0.001151,0.00145,0.000789,0.001309,0.001002,0.000401,0.000498,0.001277,0.001438,0.000261,0.000526,0.000331,0.000653,0.000642,0.000686,0.000119,4.6e-05,0.000147,0.000417,0.000726,0.001432,0.000466,0.001026,0.000598,0.000401,0.000221,0.001194,0.001767,0.001367,0.001013,4.2e-05,0.000494,0.000656,0.001302,0.000291,0.000212,0.001146,0.000463,0.000509,0.00092,0.000687,0.000255,0.000642,0.000601,0.000209,0.000321,0.000439,0.000497,0.000506,0.001002,0.000861,0.00089,0.000781,0.000465,0.000957,0.000494,0.000399,0.001011,0.001541,0.000522,0.000805,0.001051,0.001598,0.001298,0.000792,0.000295,0.000749,0.000765,0.00034,8.6e-05,0.000867,0.000959,0.000736,0.000913,0.000777,0.000216,0.000746,0.000767,0.000563,0.000694,0.000106,0.000711,0.001063,0.000827,0.000564,0.00035,0.000779,0.000164,0.000583,0.000407,0.000436,0.000696,0.000635,0.000613,0.000896,0.000883,0.000956,0.000572,0.00065,0.001516,0.00133,0.001008,0.00036,0.000164,0.000642,0.000899,0.000215,0.000277,0.000826,0.000723,9.9e-05
0.000938,0.000882,0.001014,0.000289,0.000355,0.000658,0.000789,0.000611,0.001705,0.00068,0.000841,0.001923,0.00169,0.000337,0.000565,0.00091,0.000397,0.001306,0.000878,0.000642,0.000181,0.000832,0.001137,0.002034,0.000811,0.001113,0.000861,0.000376,0.000245,0.000652,0.000854,0.000319,0.00127,0.000884,0.000209,0.000207,0.000557,0.001056,0.000323,0.000729,0.000978,0.001013,0.000813,0.000664,0.000711,0.000884,0.001353,0.000413,0.00132,0.000755,0.000765,0.001275,0.000341,0.000624,0.000952,0.000978,0.000532,0.00016,0.000674,0.000747,0.001051,0.000101,0.000773,0.000416,0.000572,0.000143,0.000446,0.000489,0.001459,0.000294,0.000483,0.001357,0.002066,0.001494,0.00098,0.000951,0.000425,0.001017,0.000836,0.000558,0.001089,0.000136,0.000831,0.00086,0.000139,0.000626,0.000804,0.000375,0.000258,0.000567,0.000249,0.000699,0.000893,0.000996,0.000743,0.00096,0.000892,0.001196,0.000339,0.000719,0.000304,0.000816,0.000264,8.3e-05,0.00076,0.000761,0.000173,0.000307,0.000412,0.001156,0.000506,0.000358,0.000514,3.5e-05,0.000366,0.000902,0.000614,0.00027,9.2e-05,6.5e-05,0.000637
0.002155,0.001548,0.001202,0.001462,0.000383,0.000937,0.001502,0.001294,0.00198,0.001677,0.001612,0.00321,0.001345,0.001049,0.000495,0.001315,0.001125,0.002108,0.000902,0.00109,0.001266,0.001349,0.000805,0.001486,0.001709,0.000567,0.001534,0.000732,0.000405,0.000291,0.001258,0.001062,0.000991,0.001152,0.001049,0.001118,0.001087,0.001829,0.000942,0.001008,0.00095,0.001168,0.002333,0.001396,0.00087,0.000339,0.001999,0.001814,0.001607,0.002072,0.000711,0.001641,0.001583,0.001707,0.00073,0.002228,0.001134,0.000758,0.000923,0.001407,0.001254,0.000974,0.00068,0.000721,0.000156,0.000328,0.000837,0.000989,0.001184,0.001906,0.00024,0.002111,0.001219,0.000836,0.000523,6e-05,0.001066,0.000721,0.001445,0.001446,0.001077,0.002095,0.002494,0.001401,0.000361,0.001161,0.001451,5e-04,0.000464,0.000703,0.000654,0.000739,0.001424,0.00203,0.002858,0.003168,0.002511,0.00278,0.001168,0.000603,0.000454,0.000681,0.000536,0.000716,0.001136,0.000722,0.000375,0.000382,0.000401,0.000424,0.000578,0.000747,0.001069,0.000765,0.000656,0.001146,9e-04,0.001043,0.000961,0.000687,0.000501
0.000366,0.000289,0.000163,0.001301,0.001297,0.001023,0.000984,0.00137,0.000529,0.000385,0.001443,0.002467,0.001963,0.001908,0.001561,0.000817,0.001008,0.002063,0.001681,0.001401,0.000607,0.001049,0.000909,0.002044,0.001733,0.001912,0.002633,0.002001,0.001065,0.000357,0.001669,0.001745,0.001219,0.00067,0.000951,0.001162,0.000642,0.001572,0.000615,0.00157,0.000374,0.000536,0.002122,0.001518,8e-04,0.00079,0.001509,0.001914,0.001544,0.000838,0.001069,0.002246,0.000759,0.000672,0.002141,0.003753,0.003349,0.001294,0.001041,0.001074,0.000889,0.000397,0.000901,0.000395,0.000818,9.8e-05,0.000711,0.001354,0.00129,0.002459,0.002165,0.002633,0.001145,0.00093,0.000873,0.000795,0.001102,0.000891,0.000868,0.001128,0.001289,0.002662,0.001312,0.001074,0.000928,0.001046,0.000614,0.000938,0.001223,0.001346,0.001851,0.001172,0.001369,0.000481,0.001464,0.001982,0.001246,0.001323,0.001194,0.000185,0.000456,0.000322,0.001292,0.001463,0.001003,0.001721,0.001189,0.001006,0.000508,0.000751,0.001325,0.001154,0.001117,0.001035,0.000154,0.000712,0.000342,0.000968,0.001677,0.000607,0.000216
0.000898,0.000672,0.000763,0.00183,0.000857,0.00054,0.001278,0.001034,0.000791,0.00096,0.001222,0.001752,0.00136,0.000416,0.001124,0.000633,0.000649,0.001336,0.000329,0.000762,0.000604,8.8e-05,0.000731,0.00151,0.000913,0.00043,0.001158,0.000467,5e-04,0.00061,0.001536,0.001074,0.000625,0.001399,0.000929,0.000122,0.000768,0.001621,0.001079,0.001059,0.000605,0.00048,0.001223,0.000798,0.001012,0.000849,0.00109,0.001062,0.00114,0.00044,0.001035,0.001376,0.001499,0.001094,0.000935,0.001636,0.002261,0.001525,0.001093,0.000584,0.001134,0.001286,0.001058,0.000404,0.001268,0.001119,0.000865,0.000447,0.000623,0.001305,0.000347,0.000275,0.000614,0.001078,0.000138,0.001149,0.001346,0.000757,0.001008,0.000791,0.001373,0.000965,0.001684,0.000262,0.000534,0.000415,0.000421,0.000571,0.000704,0.000434,0.000906,0.001333,0.000293,0.000526,0.001124,0.000202,0.000686,0.001073,0.00061,0.000925,0.001009,0.000913,0.000919,0.000485,0.001333,0.001362,0.000568,0.000369,0.000412,0.000998,0.000175,0.000589,0.001438,0.000597,0.000617,0.000348,0.000466,0.000778,0.000859,0.001262,0.000518
0.000633,0.000824,0.000483,0.001379,0.000993,0.000291,0.000873,0.001584,0.001254,0.001578,0.001979,0.002441,0.001406,0.00049,0.000241,0.000534,0.000467,0.001028,0.000992,0.000604,0.000409,0.000242,0.000467,0.001083,0.000542,0.000483,0.000825,0.001139,0.000903,0.000573,0.001219,0.001178,0.001652,0.000416,0.000325,0.000131,0.000258,0.000987,0.001012,0.00133,0.001,0.001266,0.00035,0.000586,0.000605,0.001468,0.001916,0.000983,0.000112,0.000294,0.000473,0.000957,0.000654,0.000376,0.000846,0.001402,0.000915,0.000925,0.000833,0.000856,0.0012,0.000586,0.000468,0.000984,0.001126,0.000743,0.000492,0.000294,0.00035,0.000849,0.001482,0.001244,0.001399,0.001225,0.001107,0.000471,0.000256,0.000709,0.000573,5.6e-05,0.000651,0.00093,0.001227,0.000934,0.000432,0.000494,0.000149,0.000701,0.000884,0.000625,0.000605,0.00033,0.000436,0.000539,0.000954,0.000439,0.000762,0.000444,0.000622,8.7e-05,0.000509,0.000176,0.000289,0.000595,0.000341,4e-04,0.000211,0.000221,0.00053,0.000326,0.000156,0.000495,0.000512,0.000249,0.000421,0.000427,0.000296,0.000406,0.000983,0.001051,0.001126
4e-04,0.000255,0.000495,0.000427,0.000328,0.000329,0.000268,0.000482,0.000596,0.000611,0.000522,0.000432,0.000663,0.000419,0.000395,0.000157,0.000226,0.000268,0.00033,0.000246,0.000209,0.00012,0.000175,0.000853,0.000478,0.000124,9.1e-05,0.000642,0.000292,0.000116,0.000615,0.00046,0.000468,0.000146,0.000229,6e-05,8e-06,0.000584,0.000439,0.000207,0.000359,0.000571,0.000253,0.000254,0.000205,0.000799,0.000614,0.000107,0.000234,0.000347,0.000106,0.000343,0.000424,0.000306,0.000355,0.000586,0.000589,0.000228,0.00034,0.000285,0.000588,0.000372,0.000141,0.000677,5.3e-05,0.000315,0.000261,3.6e-05,0.000186,0.00035,0.000826,0.000417,0.000593,0.000361,0.000318,0.000459,0.000325,0.000329,0.000225,0.00027,0.00021,0.000461,0.000214,0.000334,0.000218,0.000275,0.000191,0.000416,0.000123,9.3e-05,0.000279,0.000116,0.000333,0.000172,0.00045,0.000208,0.000481,0.000361,0.000205,0.000237,8.8e-05,0.000299,0.000164,0.000187,0.000392,0.000215,0.000163,0.000136,0.000161,0.000251,0.000173,7.6e-05,0.00036,0.000201,9.7e-05,0.000196,3.2e-05,4.5e-05,0.000552,0.000185,0.000457
0.000251,8.3e-05,0.000149,0.000336,5e-05,9.6e-05,0.000165,0.000314,0.000414,0.000216,0.00017,0.000301,0.000432,0.000226,0.00033,0.000123,0.000172,0.000114,0.000278,0.000109,0.000158,9.4e-05,0.000225,0.000486,0.000264,2.2e-05,0.000178,0.000349,0.000119,4.6e-05,0.000275,0.000322,0.000279,0.000147,0.000105,7.6e-05,0.000138,0.000399,0.000263,0.000184,0.000158,0.000361,0.000327,0.000136,3.8e-05,0.000459,0.000313,0.000176,0.00032,9.2e-05,0.000114,0.000238,0.000366,9.2e-05,0.000241,0.000589,0.000233,0.000205,0.000194,0.000355,0.000264,0.00025,0.000264,0.000417,0.000118,0.00014,0.00027,4.5e-05,0.000194,0.00012,0.000574,0.000243,0.00036,0.000267,0.00041,0.000379,0.000223,0.000211,0.000185,1.5e-05,7.6e-05,0.000246,0.000329,0.000171,0.000197,0.000372,0.000194,0.000122,0.00022,0.000177,0.000208,0.000145,0.00026,0.000183,0.000379,0.000189,0.000287,0.000152,0.000178,0.000208,0.000126,0.000209,0.000147,0.000145,0.00031,0.000202,8.9e-05,0.000191,0.000246,0.000334,0.000165,8.7e-05,0.000264,7.7e-05,6.9e-05,6.9e-05,5.9e-05,5.1e-05,0.000389,9.1e-05,0.000299
0.000222,0.00016,0.000134,0.000316,3.9e-05,6.9e-05,0.000271,0.000226,0.000304,0.000108,7.2e-05,0.00013,0.000445,0.000335,0.000315,0.00028,8.9e-05,0.000285,0.000194,6.9e-05,0.000144,0.000107,0.000146,0.000464,0.000322,4e-05,0.000186,0.000206,6.6e-05,0.000133,9e-05,0.000261,0.000273,9.9e-05,0.000147,9.8e-05,0.000209,0.000314,0.000293,0.000216,9.6e-05,0.000295,0.000343,0.000264,6.9e-05,0.000396,0.000252,0.00021,0.000183,7e-05,0.000114,0.000258,0.000385,0.000135,0.000144,0.000489,0.000157,0.000171,0.000197,0.000366,0.000111,0.000332,0.00029,0.000378,2.5e-05,6.9e-05,0.000279,5.6e-05,0.000156,0.000238,0.000448,0.000249,0.000306,0.000259,0.000291,0.000462,0.000187,0.000156,0.000106,0.000166,0.000217,0.000362,0.000372,0.000176,0.000293,0.000358,0.000214,0.000165,9.7e-05,0.000204,0.000128,0.000177,0.000306,8.4e-05,0.000295,0.000154,0.000285,0.000188,0.00016,0.000266,7e-05,0.00014,0.00013,9.4e-05,0.000272,0.000113,9e-05,0.000107,0.000327,0.000356,0.000222,3.1e-05,0.00035,5.1e-05,0.00013,4.7e-05,0.000109,6.4e-05,0.00027,7.2e-05,0.000298
9.4e-05,0.000166,9.2e-05,0.000431,0.000298,0.000228,0.000361,0.000284,0.000118,0.000174,9.1e-05,0.000273,0.000563,0.000299,0.000242,0.000171,0.000403,0.000379,5.6e-05,8.6e-05,0.000109,0.000295,3.2e-05,0.000315,0.000316,0.000125,0.000142,0.000293,0.000323,0.000295,0.000177,0.000343,0.000261,1.7e-05,0.000279,0.000338,0.000173,0.000576,0.000385,0.000288,4.9e-05,0.000237,0.000477,0.000301,0.000188,0.000103,0.000198,0.000264,0.000334,0.00021,0.000167,0.00026,0.000534,0.000299,9.4e-05,0.000302,0.000318,0.000383,0.000236,0.000315,0.000362,0.000374,0.000638,0.000578,0.000163,0.000193,0.000496,0.000222,0.000483,0.000366,0.00042,0.000348,0.000218,0.00042,0.000581,0.000415,0.00043,2e-04,0.000219,0.000185,0.000278,0.000461,0.000481,0.000376,0.000341,0.000447,9e-05,0.000295,0.000425,0.000297,0.000175,0.000318,0.000352,6.5e-05,0.000297,0.000286,0.000229,0.000206,0.000118,0.000232,0.000128,0.000231,0.00019,4.9e-05,0.000183,7.5e-05,0.000101,0.000112,0.000215,0.000356,0.000317,0.000212,0.000567,0.000124,0.000139,4.5e-05,0.000104,6.9e-05,0.000122,6.5e-05,0.000235
0.000614,0.000274,0.000412,0.000326,0.000507,0.00062,0.000439,0.000558,0.000418,0.000586,0.000184,0.000603,0.000323,0.000205,0.00035,0.000824,0.000591,0.000303,0.00045,0.000336,0.000283,0.000563,0.00033,0.000235,0.001043,0.000363,0.000624,0.000367,0.000482,0.000244,0.000375,9.6e-05,0.000231,0.000254,0.000434,0.000345,0.000721,0.000497,0.000451,0.000393,0.000453,0.000368,0.000939,0.000396,0.000249,0.000625,0.000382,0.000829,0.000376,0.000377,0.000461,0.000274,0.000377,0.000279,7.3e-05,0.000586,0.000289,0.000556,6.2e-05,0.000274,0.000175,0.000578,0.000642,0.001084,0.000279,0.000392,0.000603,0.000183,0.001164,0.00024,0.000704,0.000617,0.000344,0.000124,0.000655,0.000648,0.000873,0.000318,0.000572,0.000175,0.000494,0.000575,0.000986,0.000338,0.000389,0.000766,0.000399,0.000297,0.000444,0.000401,0.000324,0.000534,0.000484,0.000161,0.000246,0.000215,0.000207,0.000387,0.000321,3e-04,3e-04,0.000486,0.000335,0.000489,6.3e-05,0.000138,0.000218,0.000347,0.000472,0.000565,0.000479,0.000155,0.000873,0.000365,0.000389,1e-04,0.000144,0.000142,0.000152,0.000315,5e-04
0.000735,0.000719,0.000746,0.000861,0.001367,0.001772,0.00173,0.001659,0.000943,0.000349,0.000369,0.000864,0.001671,0.000811,0.000884,0.00076,0.001242,0.001307,0.001154,0.000444,0.000335,0.000895,0.000695,0.00046,0.001502,0.00167,0.001064,0.000789,0.001334,0.000694,0.000339,0.000843,0.000573,0.000461,0.000181,8.1e-05,0.000504,0.000529,0.000712,0.000728,0.001132,0.000982,0.001588,0.001786,0.000815,0.001012,0.001057,0.001981,0.001852,0.001209,0.000487,0.000813,0.001191,0.001027,0.00081,0.000801,0.000745,0.0013,0.001019,0.000559,0.000519,0.000661,0.000438,0.001185,0.001574,0.00088,0.000969,0.001352,0.002176,0.00188,0.001491,0.00094,0.001468,0.00107,0.000491,0.001721,0.002376,0.001652,0.001106,0.000531,0.00097,0.001927,0.002441,0.002312,0.001954,0.001735,0.001353,0.000613,0.000837,0.001089,0.000498,0.000941,0.00149,0.001268,0.000506,0.000197,0.000189,0.00048,0.000808,0.000754,0.000657,0.00118,0.000975,0.000329,0.000629,0.000338,0.000225,0.000382,0.000734,0.001326,0.001127,0.001124,0.001557,0.001504,0.000573,0.000587,0.000412,0.00048,0.000839,5.3e-05,0.00103
0.001076,0.000888,5e-04,0.000487,0.001587,0.001117,0.00074,0.000592,0.000421,0.000906,0.001253,0.000178,0.001782,0.00131,0.000404,0.001099,0.002229,0.001484,0.000239,0.000394,0.000699,0.000867,0.00104,0.00044,0.001371,0.001128,0.000774,0.000467,0.000809,0.000463,0.001047,0.001337,0.000568,0.000458,0.000322,0.000481,9.8e-05,0.000621,0.000933,0.000968,0.001047,0.001092,0.000992,0.00095,0.000757,0.000675,0.000708,0.001067,0.000862,0.000457,0.000478,0.001189,0.00124,0.000652,0.000603,0.00105,0.000484,0.000688,0.001039,0.000882,0.000992,0.000796,0.00104,0.001419,0.000527,0.000481,0.00108,0.001969,0.001229,0.000544,0.000134,0.000297,0.000974,0.001053,0.001251,0.001403,0.000825,0.00107,0.001695,0.001643,0.001018,0.001465,0.002115,0.00165,0.000647,0.001346,0.000668,0.000279,0.000581,0.000757,0.000575,0.001178,0.001462,0.000884,0.000506,0.000624,0.000483,0.000322,0.000384,0.000941,0.000457,0.000798,0.000657,0.000834,0.000118,0.000186,0.000366,0.000837,0.001423,0.00135,0.000456,0.000647,0.000645,0.000856,0.000895,0.000691,0.000409,0.000369,0.000531,0.00066,0.000943
0.001229,0.000362,0.000543,0.000265,0.001287,0.000476,0.000542,0.000435,0.001021,0.000992,0.00028,0.000721,0.001134,0.001106,0.001351,0.000608,0.001481,0.000489,0.000485,0.000202,0.000771,0.000206,0.001182,0.000602,0.000853,0.000403,0.000287,0.000138,0.000623,0.000468,0.001633,0.001157,0.00055,0.000597,0.00145,0.000477,0.000682,0.000109,0.000475,0.000113,0.000856,0.000595,0.000496,0.000133,0.000536,0.000933,0.00064,0.00046,9.1e-05,0.000469,0.000558,0.000619,0.000747,0.000386,0.00043,0.000275,0.000269,0.000841,0.000375,0.000308,0.000832,0.00066,0.000151,0.000158,0.000512,0.000645,0.000375,0.001301,0.001229,0.000289,0.000351,0.000398,0.00069,0.000397,0.000609,0.000267,0.001265,0.000456,0.001262,0.000144,0.000651,0.000727,0.000661,0.001128,0.000711,0.00046,0.000327,0.000153,0.000378,0.000206,0.000456,0.000847,0.000213,7e-05,0.000372,0.000311,0.000331,0.000293,0.000289,0.000583,0.000566,0.000676,0.000495,0.000408,0.00061,0.000168,6.4e-05,0.000641,0.000473,7.4e-05,9.8e-05,0.000506,0.00057,0.000287,0.000214,0.000227,0.000205,0.000421,0.000622,0.000308,0.000562
0.000962,0.000717,0.000866,0.000825,0.000748,0.000359,0.000561,0.000545,0.000938,0.000507,0.000308,0.000272,0.000927,0.000324,0.000644,0.000773,0.000153,0.000239,0.001011,0.000878,0.000544,0.000154,0.001037,0.000888,0.000341,0.000513,0.000815,0.000558,0.000234,0.00022,0.001035,0.000698,0.000529,0.000548,0.001275,0.001291,0.001041,0.000715,0.000659,0.000498,0.000388,0.000628,0.000569,0.000519,0.000741,0.00021,0.000374,0.000431,8.9e-05,0.000576,0.000141,0.000305,0.00047,0.000286,0.000291,0.000172,0.000334,0.000687,0.000544,0.000302,0.000438,0.000585,0.000259,0.000607,0.000865,0.00014,0.000507,0.001238,0.000698,0.000453,0.000612,0.000917,0.000208,0.000535,0.000686,0.000941,0.000683,0.000454,0.000411,0.000326,0.00051,0.000692,0.000103,0.00045,0.000574,0.000246,0.000301,0.000384,5.4e-05,0.000165,0.000306,0.000181,0.000104,0.000265,0.000262,0.000184,0.000444,0.000315,0.000188,0.00037,0.000148,0.000204,0.00034,0.000466,0.000335,0.00038,0.000248,0.000337,0.000374,8.7e-05,9.2e-05,0.000168,0.000159,0.000112,0.000245,0.000435,0.000146,0.000148,0.000243,0.000329,0.000412
0.000779,0.000588,0.00039,0.000626,0.000534,0.000523,0.000642,0.001078,0.000446,0.000141,0.000175,0.000309,0.000543,0.000251,0.000357,0.000266,0.000163,0.000537,0.000722,0.000432,0.000384,0.000224,0.000635,0.000432,0.000233,0.000584,0.000198,0.000187,0.000451,0.000575,0.00035,0.000538,0.000447,0.000465,0.000707,0.000984,0.000443,0.000548,0.000553,3.7e-05,0.000395,0.000299,0.000433,0.000303,0.000478,0.000461,0.000147,0.000243,0.000298,0.000272,0.000512,0.000114,0.000351,0.000428,0.00026,0.000362,0.000358,0.000988,0.000838,0.000453,0.000476,0.000528,0.000639,0.000735,0.000634,0.00064,0.000667,0.000961,0.001255,0.000819,0.000881,0.000521,0.00063,0.000767,0.000456,0.000603,0.000965,0.000982,0.000324,0.000307,0.000393,0.000402,0.000209,0.000363,0.000204,0.000116,0.00026,0.00024,9.6e-05,0.000126,0.000308,0.000332,0.000122,0.000298,0.000415,0.000294,0.000105,8.4e-05,9.6e-05,1.7e-05,0.000161,5.2e-05,5.8e-05,0.000269,0.000155,0.000188,6.3e-05,0.000193,1.4e-05,0.000244,0.000122,3e-05,0.00028,0.000126,0.000301,0.000322,0.000173,4e-05,0.000102,0.000269,0.000142
0.000429,0.000388,0.000721,0.000395,0.000471,0.000553,0.000313,0.000403,0.000537,7e-05,0.000226,0.000195,0.000497,0.000324,0.000416,0.000362,0.00029,0.000278,0.000164,0.000136,3.6e-05,8.3e-05,0.000262,0.000174,0.00051,8.1e-05,0.000305,0.000177,0.000357,0.000394,0.000618,0.00014,0.000417,0.000174,0.000194,0.000578,0.000331,0.000207,0.000132,0.000219,0.000289,0.00021,0.000218,0.000115,0.00029,0.000213,0.000104,0.000136,0.000278,0.000363,0.000284,0.000317,0.000488,0.000271,0.000198,0.000382,0.000339,0.000363,0.000142,0.000127,2.5e-05,0.000448,0.000172,0.000425,7.5e-05,9.3e-05,2e-04,0.000526,0.000425,0.000479,0.000207,0.000255,0.000242,0.00051,0.000129,0.000399,0.000229,0.00052,0.000117,0.00025,0.00035,0.000643,0.000497,0.000362,0.000475,0.000289,0.000121,6.8e-05,0.000307,0.000133,0.000215,0.000229,0.000281,0.000115,0.000122,1.6e-05,8.6e-05,0.000152,0.000155,0.000136,8.2e-05,7.1e-05,5.1e-05,0.000128,8.9e-05,8.5e-05,0.000101,0.000128,0.000193,0.000147,2.9e-05,6.5e-05,0.000166,7e-05,0.000282,0.000101,6.3e-05,6.4e-05,0.000127,0.000181,0.000234
6.2e-05,0.000121,0.000189,2.8e-05,3.4e-05,0.000126,7.9e-05,3.7e-05,0.000107,4.5e-05,5.5e-05,8.5e-05,8.3e-05,6.1e-05,0.000104,0.000106,0.000195,0.00014,9.3e-05,9.9e-05,7.6e-05,6.3e-05,5.4e-05,4e-05,0.000155,8.7e-05,9.8e-05,3.5e-05,9.8e-05,8.2e-05,0.000243,9.3e-05,8.9e-05,8.9e-05,0.000152,0.000144,4.5e-05,2.6e-05,6.4e-05,0.000105,3.5e-05,5.7e-05,6.7e-05,5.6e-05,7.8e-05,6.5e-05,6.3e-05,2.3e-05,1.6e-05,4.1e-05,8.9e-05,0.000123,0.000107,5.6e-05,5e-05,9.4e-05,6.9e-05,8.5e-05,6.8e-05,1.6e-05,3.8e-05,8.6e-05,6.9e-05,0.000119,3.6e-05,1.7e-05,0.000104,0.000152,0.000103,0.000123,0.000116,1.4e-05,0.000165,0.000111,6e-05,2.3e-05,5.7e-05,0.000167,7.4e-05,2.5e-05,0.000123,2.5e-05,5e-05,9.3e-05,1.1e-05,4.1e-05,2.2e-05,2.1e-05,0.000136,7e-05,5.4e-05,8.4e-05,9.7e-05,4.6e-05,6.9e-05,2.2e-05,3.8e-05,3.7e-05,4.3e-05,8.1e-05,1.9e-05,3.9e-05,1.5e-05,2.2e-05,6.4e-05,8e-05,3.2e-05,2e-05,8e-06,7.5e-05,4.1e-05,2.9e-05,1.1e-05,4.1e-05,6.2e-05,6.7e-05,3.6e-05,3e-05,4.6e-05,5.5e-05,3.6e-05
3e-05,5e-05,0.000148,2.8e-05,5.9e-05,7.8e-05,5.4e-05,2.7e-05,9.3e-05,3.2e-05,3.7e-05,6.2e-05,8.9e-05,4e-05,7.1e-05,6.3e-05,0.000125,9e-05,3.6e-05,4.5e-05,4.5e-05,2.5e-05,6.6e-05,4.8e-05,0.000117,5.3e-05,4.7e-05,1.3e-05,7.3e-05,5.1e-05,0.000188,5.3e-05,5e-05,7.1e-05,0.000121,8.9e-05,5.5e-05,3.6e-05,5.4e-05,5.2e-05,6.8e-05,7.2e-05,5.9e-05,3.7e-05,0.000102,6.4e-05,7.3e-05,1e-05,1.9e-05,3.6e-05,6.8e-05,9.4e-05,9.3e-05,4.5e-05,5.3e-05,0.000103,3.8e-05,6.5e-05,2.7e-05,3.3e-05,3e-05,8.3e-05,4.5e-05,7.8e-05,4.3e-05,2.9e-05,8.2e-05,0.000138,7.4e-05,0.000109,0.000117,2.6e-05,0.000166,0.000112,6.9e-05,4.7e-05,2.5e-05,0.000113,7e-05,1.9e-05,5.1e-05,8.8e-05,2.8e-05,7.8e-05,9.1e-05,4e-05,1.1e-05,3.6e-05,6.4e-05,6.2e-05,6.4e-05,3.1e-05,4.3e-05,6.2e-05,7.4e-05,4.6e-05,5.6e-05,6.8e-05,2.7e-05,6.3e-05,6.8e-05,7.2e-05,1.5e-05,3e-05,0.000112,2.4e-05,4.9e-05,3.4e-05,4.1e-05,7.4e-05,1.3e-05,5e-06,4.4e-05,6.2e-05,0.000104,3.7e-05,2.9e-05,5e-05,2.4e-05,1.8e-05,7.9e-05
1.1e-05,2.5e-05,0.000112,2.9e-05,5.9e-05,7.8e-05,3.8e-05,1.6e-05,7.5e-05,3.2e-05,3.6e-05,7.1e-05,5.2e-05,2.8e-05,4.2e-05,4.6e-05,0.000122,6.4e-05,2.4e-05,3.5e-05,3.1e-05,1.7e-05,4e-05,2.5e-05,8.4e-05,3.9e-05,4.3e-05,3.6e-05,5.6e-05,5.2e-05,0.00018,6.5e-05,4.6e-05,5.1e-05,9.7e-05,7.8e-05,6.8e-05,2.6e-05,3.3e-05,4.4e-05,3.3e-05,5.6e-05,5.2e-05,3.9e-05,8.5e-05,4.5e-05,7.5e-05,2.2e-05,9e-06,1.4e-05,7.8e-05,8.7e-05,6.5e-05,2.2e-05,5.3e-05,8.1e-05,2.4e-05,4.5e-05,2e-05,4.1e-05,1.5e-05,6.7e-05,5.4e-05,5.3e-05,4.6e-05,2.1e-05,7.6e-05,9.8e-05,5.1e-05,8.2e-05,8.2e-05,2.1e-05,0.00013,9.6e-05,5.8e-05,3.3e-05,2e-05,0.000114,5.8e-05,4.3e-05,2.2e-05,6.2e-05,4e-05,4.8e-05,4.2e-05,2.3e-05,2.9e-05,6e-05,4.7e-05,2.6e-05,1.7e-05,5e-05,7.9e-05,4.4e-05,6.6e-05,3.3e-05,1.4e-05,4.4e-05,4.2e-05,3.5e-05,4e-05,5.7e-05,4.8e-05,1.5e-05,6.3e-05,3.9e-05,3.8e-05,2.6e-05,5.2e-05,7.2e-05,6.1e-05,3.6e-05,4.3e-05,3.8e-05,2.2e-05,5e-05,1.2e-05,2.8e-05,3.7e-05,3.4e-05,6.2e-05
1.5e-05,2e-05,0.000109,2e-05,2.8e-05,6.4e-05,3.8e-05,1e-05,5.3e-05,1.2e-05,3.6e-05,5.2e-05,6.3e-05,3.1e-05,4e-05,3.2e-05,0.000102,3.5e-05,1.5e-05,3.2e-05,3.7e-05,9e-06,2.4e-05,3.3e-05,7.8e-05,4.4e-05,6.4e-05,3.1e-05,4.4e-05,4.6e-05,0.000159,5.9e-05,6.1e-05,3.8e-05,8.5e-05,7.8e-05,5.2e-05,1.3e-05,2.8e-05,3e-05,3e-05,5.5e-05,3.7e-05,3.4e-05,6.3e-05,5.9e-05,5.5e-05,2.1e-05,1.5e-05,1.4e-05,5.7e-05,6.5e-05,6e-05,2.2e-05,5.3e-05,7.5e-05,1.9e-05,4.8e-05,2.3e-05,2.6e-05,1.5e-05,5.7e-05,4.6e-05,6.1e-05,4.3e-05,1.4e-05,6.6e-05,0.000115,5.7e-05,6.1e-05,8.7e-05,4.1e-05,0.000124,7.7e-05,4.2e-05,1.6e-05,2.1e-05,0.000111,3.8e-05,3.4e-05,3.3e-05,7.6e-05,4.5e-05,6.8e-05,2.7e-05,1.5e-05,2.4e-05,4.2e-05,2.8e-05,2.4e-05,2.6e-05,2.9e-05,6.1e-05,2e-05,6.3e-05,1e-05,9e-06,3.9e-05,9e-06,3.5e-05,2.7e-05,2.8e-05,1.5e-05,2.9e-05,5.4e-05,4.5e-05,1.3e-05,1.3e-05,3e-05,3.6e-05,4.3e-05,1.1e-05,5.5e-05,3e-05,2.4e-05,5.5e-05,1e-05,1.2e-05,3.2e-05,6e-06,5.3e-05
7e-06,9e-06,8.9e-05,6e-06,4.7e-05,5.4e-05,2.5e-05,1.7e-05,6.9e-05,1.7e-05,4.9e-05,4.8e-05,3.8e-05,5e-05,5.3e-05,5.3e-05,9.7e-05,3e-05,1.6e-05,9e-06,2.3e-05,1.7e-05,2.1e-05,3.1e-05,8e-05,5.6e-05,4.4e-05,2.6e-05,3.2e-05,1.9e-05,0.000159,4.2e-05,3.9e-05,4.2e-05,8.4e-05,6.3e-05,4.4e-05,1.3e-05,2.9e-05,2.2e-05,3.4e-05,6.1e-05,2.9e-05,1.8e-05,6.3e-05,3.7e-05,4.8e-05,4.3e-05,2.8e-05,1.9e-05,3.7e-05,5.5e-05,6.5e-05,2.3e-05,6.2e-05,8.1e-05,1e-05,5e-05,1.8e-05,2.9e-05,1.7e-05,5.5e-05,2.2e-05,5e-05,4.8e-05,1.2e-05,5.4e-05,8.4e-05,1.4e-05,4.7e-05,6.3e-05,3.6e-05,0.000115,7e-05,4.5e-05,1.6e-05,1.2e-05,0.000103,3.9e-05,4e-05,3.2e-05,6e-05,4.4e-05,4e-05,2.7e-05,1.9e-05,2.4e-05,2.3e-05,1.8e-05,3.2e-05,1.9e-05,3.1e-05,3.4e-05,1.9e-05,4.8e-05,3e-06,2.6e-05,4.4e-05,3.2e-05,3.8e-05,4e-05,3.1e-05,1.5e-05,1.9e-05,4.8e-05,3.9e-05,1.8e-05,2.2e-05,2.9e-05,6.4e-05,3e-05,2.5e-05,3.2e-05,9e-06,2.9e-05,4.8e-05,9e-06,1.5e-05,3.8e-05,2.8e-05,4.3e-05
4e-06,1.4e-05,8.1e-05,6e-06,2.2e-05,5e-05,2.5e-05,1.1e-05,5e-05,3e-05,4.3e-05,2.1e-05,4.8e-05,4.3e-05,2e-06,4.9e-05,8.4e-05,2.8e-05,1e-05,1.6e-05,1.1e-05,2.3e-05,2.1e-05,4.3e-05,7.1e-05,5.1e-05,4.3e-05,4e-05,4.8e-05,2e-05,0.000144,5.6e-05,4.3e-05,3.1e-05,6.7e-05,5.7e-05,5.5e-05,1.7e-05,1.5e-05,2.8e-05,3.5e-05,4.6e-05,4e-05,2.4e-05,4.1e-05,4.9e-05,3.8e-05,1.7e-05,1.2e-05,9e-06,4.4e-05,6.5e-05,6.3e-05,2.3e-05,6.6e-05,8.2e-05,1.3e-05,3.1e-05,2.3e-05,2.2e-05,2e-06,4.4e-05,1.8e-05,4.1e-05,5.5e-05,2.1e-05,5.1e-05,6.5e-05,4.2e-05,5.1e-05,8.4e-05,2.9e-05,9.7e-05,9.4e-05,5.9e-05,1.8e-05,1.7e-05,9.1e-05,2.4e-05,1.5e-05,2.6e-05,5.8e-05,1.5e-05,4.6e-05,1.8e-05,3.3e-05,8e-06,3.7e-05,1.4e-05,8e-06,2.4e-05,3.1e-05,4.1e-05,3e-05,5.1e-05,9e-06,1.9e-05,2.6e-05,2.4e-05,4.6e-05,3.9e-05,3e-05,1.5e-05,2.5e-05,6e-05,2.6e-05,2.7e-05,7e-06,2.1e-05,5.3e-05,4.2e-05,2.4e-05,2.7e-05,1.9e-05,2.4e-05,3.1e-05,4e-06,1.4e-05,4.9e-05,8e-06,3.5e-05
3.4e-05,3.3e-05,7.6e-05,7e-06,3.7e-05,6.2e-05,4.8e-05,1.3e-05,5.7e-05,2.5e-05,3.5e-05,2.8e-05,3.5e-05,1.5e-05,3.7e-05,2.8e-05,6.9e-05,3.8e-05,1.5e-05,1.1e-05,2.9e-05,4.9e-05,1.5e-05,4.7e-05,4.8e-05,2.6e-05,4.7e-05,6e-05,2.5e-05,2.5e-05,0.000132,2.4e-05,3.9e-05,5.8e-05,5.3e-05,5e-05,3.3e-05,4.5e-05,4.7e-05,3.3e-05,5.2e-05,5.9e-05,3.6e-05,2.5e-05,4e-05,3.2e-05,3.5e-05,4.3e-05,1.6e-05,9e-06,4.6e-05,6.4e-05,7.8e-05,2.3e-05,4.8e-05,7.7e-05,7e-06,4.6e-05,3.7e-05,1e-05,2.9e-05,4.7e-05,2e-05,5.1e-05,3.7e-05,1.3e-05,4.7e-05,4.6e-05,4.1e-05,3.7e-05,6.7e-05,2.5e-05,0.000115,6.3e-05,4.7e-05,3e-05,2e-05,8.1e-05,1.9e-05,4.3e-05,5.4e-05,4e-05,6e-05,6.3e-05,1.6e-05,2.6e-05,2.3e-05,3.5e-05,1.7e-05,2.9e-05,2.4e-05,2.4e-05,3.6e-05,2.3e-05,6.7e-05,2e-05,2e-05,2.7e-05,1e-05,4e-05,3.9e-05,2.3e-05,3e-06,1e-05,5.2e-05,4.2e-05,3.5e-05,2.3e-05,6e-06,3.3e-05,1.7e-05,1.4e-05,3.7e-05,3.3e-05,4e-05,3.4e-05,8e-06,3e-06,4.7e-05,2.1e-05,4.8e-05
4.1e-05,1.9e-05,8.1e-05,5e-06,3.9e-05,3.3e-05,4.3e-05,3.6e-05,8.9e-05,1.2e-05,1.5e-05,1.3e-05,6e-05,4.1e-05,3.5e-05,1.6e-05,0.000121,3.3e-05,2.2e-05,1.6e-05,6.8e-05,1.2e-05,4.8e-05,4.7e-05,7.6e-05,4.3e-05,2e-05,5.3e-05,7.2e-05,3.8e-05,0.000142,5.7e-05,3e-05,7.3e-05,0.000105,3.3e-05,1.6e-05,5.8e-05,1.8e-05,4.8e-05,6.2e-05,1.5e-05,5.2e-05,3.4e-05,3.1e-05,3.9e-05,6e-06,3.3e-05,4.5e-05,2e-05,7.3e-05,7.6e-05,7.5e-05,3.2e-05,7.7e-05,9.9e-05,2.7e-05,4.7e-05,3e-05,4.5e-05,3.9e-05,7.5e-05,1.4e-05,2.3e-05,4.1e-05,3.7e-05,9e-06,0.000105,5.3e-05,3.9e-05,0.000105,2.5e-05,0.000101,4.6e-05,6.6e-05,6.3e-05,7.2e-05,4.5e-05,6.7e-05,5.3e-05,5.3e-05,0.000106,0.000113,8e-05,1.3e-05,3.9e-05,3.8e-05,1.9e-05,4.4e-05,9e-06,3.1e-05,2.6e-05,4.7e-05,2.4e-05,6.5e-05,1.6e-05,2.5e-05,2.4e-05,1.6e-05,4.6e-05,3e-05,3.5e-05,1.8e-05,2.1e-05,4.1e-05,5.8e-05,2.9e-05,1.5e-05,2.3e-05,4.2e-05,4.1e-05,3.6e-05,1.5e-05,3.5e-05,6e-06,5.8e-05,3.5e-05,3.3e-05,4.2e-05,2.4e-05,3.1e-05
1.1e-05,2.5e-05,8.8e-05,1.8e-05,2.7e-05,3.6e-05,2.5e-05,2.8e-05,5.9e-05,4e-05,4.3e-05,1.8e-05,4.2e-05,2.6e-05,2.2e-05,3.2e-05,0.000127,2.6e-05,5e-06,4e-05,2.4e-05,7e-06,4.5e-05,3.6e-05,6.5e-05,4.5e-05,1.8e-05,6e-06,2.9e-05,1.3e-05,0.000113,4.7e-05,1.6e-05,2.8e-05,5.8e-05,5.9e-05,2.6e-05,1.8e-05,3.6e-05,6.7e-05,1.7e-05,4.8e-05,3.2e-05,2.7e-05,4.2e-05,1.9e-05,3.8e-05,3.6e-05,1e-05,1.1e-05,7.5e-05,9.5e-05,3.5e-05,2.2e-05,5.4e-05,7e-05,2.7e-05,1.5e-05,1.6e-05,4.4e-05,2e-06,6.2e-05,5.3e-05,4e-05,2.5e-05,3.7e-05,2e-05,0.000118,2.4e-05,3e-06,7.5e-05,3.4e-05,6.9e-05,7.3e-05,1.5e-05,1.4e-05,3.4e-05,0.000104,1.6e-05,2.2e-05,4.7e-05,3.3e-05,6.9e-05,0.000117,0.000115,0.000111,5e-05,5.3e-05,8.2e-05,6.5e-05,6.9e-05,8.2e-05,8.7e-05,2.1e-05,3.5e-05,5e-05,2.3e-05,2.2e-05,8e-06,4.6e-05,2.6e-05,3.3e-05,4.6e-05,6.4e-05,7.8e-05,4.7e-05,5.4e-05,1.6e-05,1e-05,4.9e-05,4.7e-05,1.8e-05,2.2e-05,4.6e-05,2.9e-05,3e-05,3.7e-05,9e-06,4.5e-05,3.2e-05,1e-05
1.2e-05,1.9e-05,6.4e-05,7e-06,4.2e-05,3.2e-05,1.8e-05,1.9e-05,5e-05,2.4e-05,2.3e-05,3.5e-05,4.3e-05,1.6e-05,2.8e-05,2.2e-05,9.5e-05,5e-06,4e-06,2.7e-05,2.3e-05,3e-06,1.4e-05,3.7e-05,5e-05,2.8e-05,3.7e-05,1.6e-05,3.4e-05,1.6e-05,9.8e-05,3.7e-05,1.4e-05,3.3e-05,6.2e-05,6e-05,2.9e-05,1.6e-05,1.7e-05,3.5e-05,1.9e-05,4.2e-05,3.4e-05,1e-05,5.3e-05,2.3e-05,2.4e-05,9e-06,2.2e-05,2e-06,6.1e-05,6.2e-05,3.8e-05,2.3e-05,3e-05,9.7e-05,3e-05,3.4e-05,1.9e-05,4.9e-05,1.5e-05,5.2e-05,1.7e-05,3.2e-05,1.5e-05,1.8e-05,2.6e-05,8.3e-05,5e-06,1.5e-05,6.2e-05,2.4e-05,8.3e-05,7.5e-05,8e-06,2e-05,2.5e-05,7.8e-05,1.8e-05,4.6e-05,1.6e-05,1.8e-05,7.3e-05,4.1e-05,5.4e-05,4.1e-05,2.6e-05,3.9e-05,8e-05,2.2e-05,3.6e-05,8.9e-05,3.3e-05,8.2e-05,6.1e-05,4.2e-05,5.1e-05,6.7e-05,5.1e-05,5.9e-05,4.1e-05,2.1e-05,5e-05,4.8e-05,6.6e-05,3.4e-05,5.3e-05,4.9e-05,9e-06,3.4e-05,3.9e-05,2.3e-05,1.7e-05,4.5e-05,2.8e-05,3.8e-05,4.5e-05,2.2e-05,2.8e-05,1.7e-05,3.2e-05
2e-05,2.8e-05,5.8e-05,1.8e-05,4.5e-05,3.3e-05,2.3e-05,1.2e-05,5.8e-05,3.3e-05,2.2e-05,2.9e-05,2.9e-05,2e-05,1.3e-05,1.2e-05,8.2e-05,1.3e-05,5e-06,1.5e-05,3.7e-05,1.5e-05,1.4e-05,2.6e-05,4.2e-05,3.2e-05,4.4e-05,3.3e-05,4.2e-05,1.5e-05,9.2e-05,3.1e-05,1.8e-05,2.2e-05,5.5e-05,4.7e-05,2.7e-05,1.1e-05,1.2e-05,1.9e-05,1e-05,4.3e-05,2.8e-05,2.5e-05,3.1e-05,4.2e-05,3.2e-05,1.1e-05,6e-06,1.7e-05,4.5e-05,5.3e-05,4.1e-05,1.8e-05,3.8e-05,8.2e-05,3.9e-05,1.2e-05,1.7e-05,2.6e-05,2e-06,3.1e-05,3.5e-05,2.9e-05,1.6e-05,1.8e-05,2.4e-05,6e-05,3e-05,2.3e-05,4.9e-05,1.5e-05,8.4e-05,7.2e-05,2e-05,7e-06,8e-06,1e-04,9e-06,3.1e-05,8e-06,4.4e-05,6.4e-05,4e-05,4.8e-05,4e-06,2.4e-05,4e-05,4.6e-05,2.9e-05,2.2e-05,5.5e-05,4.7e-05,4.6e-05,6.9e-05,6.6e-05,5.9e-05,2.6e-05,1.7e-05,5.1e-05,2e-05,3.2e-05,4.2e-05,1.2e-05,3e-05,2.7e-05,2.7e-05,2.6e-05,4.4e-05,5.1e-05,6e-05,3.6e-05,1.8e-05,2.9e-05,4.9e-05,8.2e-05,8e-06,2.6e-05,2.8e-05,3.9e-05,2.9e-05
2.7e-05,1.8e-05,4.9e-05,1.2e-05,3e-05,3.5e-05,2.7e-05,1.4e-05,4.7e-05,3.4e-05,1.5e-05,2e-05,1.6e-05,1.7e-05,1.7e-05,2.4e-05,8.5e-05,9e-06,5e-06,2.5e-05,2.3e-05,1.5e-05,1.2e-05,2.8e-05,5e-05,2.4e-05,2.7e-05,2.6e-05,3.5e-05,1.4e-05,0.000103,4.9e-05,2.1e-05,1.8e-05,5.7e-05,4.2e-05,3.6e-05,5e-06,1e-05,6e-06,8e-06,5e-05,2.3e-05,3.2e-05,2.8e-05,3.2e-05,3.4e-05,1.3e-05,9e-06,1.3e-05,4.7e-05,5e-05,5.6e-05,5e-06,4.1e-05,6.4e-05,1.9e-05,2.2e-05,1.3e-05,2.5e-05,3e-06,2.9e-05,2.5e-05,2.3e-05,1.1e-05,1.3e-05,1.7e-05,5.9e-05,2.4e-05,5e-05,7.3e-05,1.5e-05,8.9e-05,5.9e-05,1.4e-05,8e-06,8e-06,8.5e-05,1.6e-05,4.8e-05,8e-06,3.5e-05,3.7e-05,3.3e-05,4.7e-05,7e-06,2.8e-05,1.6e-05,2.1e-05,7e-06,2.5e-05,1.8e-05,2.1e-05,2.8e-05,5.5e-05,4.3e-05,3.2e-05,1.5e-05,2.6e-05,3.1e-05,1.5e-05,1.8e-05,2.5e-05,1.5e-05,3.5e-05,2.5e-05,2.5e-05,2e-06,3.4e-05,4.1e-05,2.6e-05,2.1e-05,1.6e-05,8e-06,1.8e-05,2.8e-05,2.4e-05,4.4e-05,2.7e-05,2.2e-05,1.4e-05
1.5e-05,2.6e-05,5.6e-05,1e-06,4.5e-05,2.2e-05,2.3e-05,1.3e-05,3.7e-05,1.1e-05,1.7e-05,2.1e-05,2.7e-05,2.8e-05,2.2e-05,3.2e-05,9.1e-05,0,5e-06,2.4e-05,2.5e-05,1.7e-05,2.2e-05,4.1e-05,3.7e-05,1.9e-05,2.1e-05,3.5e-05,2.6e-05,2e-06,0.000114,2.2e-05,3e-05,1.9e-05,5.7e-05,3.9e-05,3.2e-05,1e-05,1.3e-05,1e-05,2.1e-05,6.3e-05,1.9e-05,3.2e-05,2e-05,4.5e-05,1.9e-05,2.6e-05,1.4e-05,1.3e-05,4.1e-05,4.6e-05,4.3e-05,5e-06,5e-05,6.1e-05,1.3e-05,2.4e-05,1.8e-05,3e-05,6e-06,3e-05,1.2e-05,1.9e-05,1.5e-05,1.2e-05,2.4e-05,7.1e-05,1.4e-05,1.9e-05,4.9e-05,5e-06,9.1e-05,5e-05,2e-06,1.2e-05,1.1e-05,5.7e-05,3.4e-05,3e-05,4e-06,3.7e-05,3.9e-05,1e-05,5.8e-05,4e-06,3e-05,2.8e-05,1.1e-05,1.5e-05,1.9e-05,2.1e-05,1.5e-05,3.9e-05,5.1e-05,2.8e-05,2.4e-05,1.2e-05,1.3e-05,2.2e-05,9e-06,1.8e-05,2.7e-05,2.1e-05,3.9e-05,2.5e-05,6e-06,1.1e-05,2.9e-05,3.6e-05,6e-06,2.1e-05,5e-06,1.4e-05,1e-05,2.1e-05,7e-06,2.2e-05,4.1e-05,3.6e-05,2.7e-05
4e-06,1.7e-05,5.8e-05,7e-06,5.2e-05,4.8e-05,1.3e-05,1.6e-05,3.4e-05,6e-06,3.2e-05,1.3e-05,7e-06,2.8e-05,3.3e-05,1.3e-05,9.1e-05,1.3e-05,1e-06,2.9e-05,2.4e-05,2.3e-05,5e-06,2.4e-05,3.1e-05,2.5e-05,2.4e-05,2.3e-05,2.7e-05,4e-06,0.000123,7.1e-05,3.1e-05,1.5e-05,3.7e-05,5e-05,3.1e-05,1.1e-05,1.3e-05,1.5e-05,2.5e-05,3.7e-05,2.4e-05,2.6e-05,2.4e-05,4.4e-05,1.8e-05,1.1e-05,1.1e-05,1.5e-05,5.7e-05,5.4e-05,3e-05,1.6e-05,4.5e-05,7.7e-05,2e-05,2.3e-05,5e-06,3.1e-05,6e-06,2e-05,1.5e-05,1.8e-05,1.7e-05,1.5e-05,3e-05,6.3e-05,1.4e-05,7e-06,4.8e-05,1.4e-05,7.6e-05,5.8e-05,6e-06,1e-05,2.8e-05,7.4e-05,2.4e-05,3.7e-05,8e-06,4e-05,4.2e-05,2.7e-05,3.9e-05,2.6e-05,4.1e-05,5e-06,1.2e-05,2e-06,3.1e-05,1.4e-05,2.2e-05,2.8e-05,5.1e-05,1.5e-05,1.6e-05,2.2e-05,1.7e-05,2.2e-05,1.3e-05,1.1e-05,1.9e-05,8e-06,4.5e-05,2.7e-05,9e-06,1.1e-05,1.7e-05,3.2e-05,2.3e-05,2.5e-05,9e-06,1.3e-05,6e-06,2e-05,6e-06,1.9e-05,3.6e-05,1.6e-05,2.1e-05
1.3e-05,1.3e-05,5.2e-05,1e-05,4.8e-05,1.8e-05,9e-06,1.4e-05,2.8e-05,1.1e-05,3.9e-05,2.8e-05,2.4e-05,1.2e-05,2.5e-05,1.4e-05,7e-05,1e-05,4e-06,2.8e-05,3.2e-05,9e-06,1.7e-05,2.8e-05,4.5e-05,2.2e-05,2.4e-05,2.7e-05,2e-05,4e-06,0.000116,4.2e-05,4e-05,5e-06,4.9e-05,3e-05,1.8e-05,1.2e-05,1.8e-05,1.6e-05,3.3e-05,5.3e-05,3.2e-05,6e-06,4e-05,3.9e-05,1.1e-05,7e-06,1.4e-05,1.5e-05,4.6e-05,4.8e-05,3.2e-05,1.9e-05,3.1e-05,7.2e-05,1.4e-05,1.5e-05,1.4e-05,3.5e-05,6e-06,1.7e-05,7e-06,2e-05,2.6e-05,2.1e-05,2.1e-05,4.3e-05,1.5e-05,1.2e-05,4.9e-05,9e-06,8.2e-05,5.5e-05,3e-06,1.5e-05,1.5e-05,7e-05,1.2e-05,4e-05,3e-06,2.8e-05,3.7e-05,4e-05,3e-05,1e-05,2.1e-05,2.2e-05,1.7e-05,3e-06,2.1e-05,1.1e-05,1.6e-05,3e-05,4.9e-05,1.6e-05,2.1e-05,2.6e-05,1.5e-05,1.5e-05,1.2e-05,1.4e-05,1.9e-05,8e-06,3.9e-05,3.1e-05,2e-06,1e-05,1.1e-05,4e-05,2e-05,1.9e-05,1.4e-05,1.9e-05,1.6e-05,2.7e-05,4e-06,1.7e-05,2.6e-05,1.2e-05,1.7e-05
5e-06,2.2e-05,5.9e-05,1.5e-05,3.6e-05,2.1e-05,1e-05,1.4e-05,4.3e-05,1.6e-05,2.6e-05,1.4e-05,1.4e-05,3e-06,1.2e-05,1.6e-05,7.4e-05,1.6e-05,2e-06,2.2e-05,1.8e-05,5e-06,1.5e-05,3.9e-05,5.3e-05,3e-05,2e-05,2.7e-05,2.4e-05,1.5e-05,0.000111,1.2e-05,2.2e-05,1e-05,5.1e-05,3.6e-05,3.5e-05,8e-06,1.4e-05,7e-06,1.7e-05,4.2e-05,3e-05,3.1e-05,3.7e-05,4.5e-05,1.4e-05,9e-06,1.6e-05,0,4.3e-05,4.9e-05,2.7e-05,3e-06,4.2e-05,6.7e-05,1.6e-05,1.1e-05,8e-06,2.5e-05,6e-06,1.2e-05,1.3e-05,1.6e-05,9e-06,1.9e-05,1.7e-05,3.3e-05,1.5e-05,1.9e-05,5.5e-05,5e-06,7.5e-05,5.3e-05,9e-06,8e-06,1.5e-05,9.3e-05,2.3e-05,2.2e-05,1.3e-05,1e-05,2.9e-05,3.5e-05,2.1e-05,1.3e-05,1.6e-05,2.3e-05,1.7e-05,9e-06,2.1e-05,1.5e-05,1.5e-05,2.1e-05,5.9e-05,1.5e-05,9e-06,1.4e-05,1.8e-05,2.3e-05,1.9e-05,1.8e-05,1e-05,5e-06,4.3e-05,3.5e-05,2.1e-05,1.1e-05,2.7e-05,2.2e-05,2.4e-05,1.4e-05,1.4e-05,1.4e-05,5e-06,3.4e-05,1.6e-05,1.7e-05,3.3e-05,1.8e-05,1.9e-05
1.1e-05,2e-05,5.2e-05,2.2e-05,3.8e-05,3.5e-05,1.4e-05,6e-06,4.1e-05,3e-06,8e-06,9e-06,1.1e-05,1.8e-05,1.5e-05,1.8e-05,7.4e-05,6e-06,9e-06,1.4e-05,2.6e-05,1.4e-05,1e-05,2.3e-05,4.5e-05,3.3e-05,3.7e-05,3.6e-05,2.5e-05,4e-06,0.00011,3.9e-05,1.4e-05,1.9e-05,6.6e-05,3.3e-05,3.8e-05,1.1e-05,1.1e-05,1.5e-05,2e-06,4.5e-05,2.3e-05,3.2e-05,4.4e-05,4e-05,2e-06,1.8e-05,4e-06,7e-06,3.6e-05,3.4e-05,4.1e-05,6e-06,3.8e-05,6.8e-05,7e-06,1.6e-05,6e-06,2.1e-05,9e-06,1.8e-05,4e-06,2.5e-05,1.6e-05,1.8e-05,1.1e-05,5.4e-05,2e-06,2.5e-05,4.8e-05,6e-06,7.9e-05,4.7e-05,1e-05,5e-06,1e-06,8.2e-05,3.1e-05,2.7e-05,4e-06,1.1e-05,3.6e-05,3.7e-05,2.7e-05,1.4e-05,2.6e-05,1.4e-05,1.1e-05,8e-06,2e-05,1.6e-05,2.6e-05,3.1e-05,5.4e-05,4e-06,1.1e-05,1.8e-05,2.2e-05,2.4e-05,1.6e-05,1.7e-05,1.6e-05,3e-06,3.2e-05,2e-05,1.5e-05,8e-06,2.6e-05,2.7e-05,2.3e-05,2.1e-05,7e-06,3e-06,6e-06,2.7e-05,8e-06,1.6e-05,2.9e-05,1.6e-05,1.6e-05
4e-06,1.4e-05,5.3e-05,1.2e-05,4e-05,3e-05,1.3e-05,5e-06,3.6e-05,1.3e-05,1.4e-05,4e-06,2.6e-05,2e-06,2e-05,2e-05,7.7e-05,2e-06,3e-06,1.3e-05,2e-05,1.4e-05,1.2e-05,3.2e-05,4.1e-05,3.7e-05,2.6e-05,2.5e-05,2.9e-05,1e-05,0.000104,3.6e-05,2.5e-05,2.2e-05,5e-05,4.1e-05,4e-05,8e-06,1.5e-05,1.6e-05,1.4e-05,4.7e-05,2.6e-05,2.4e-05,2.9e-05,2.8e-05,1.9e-05,1.1e-05,4e-06,5e-06,3.1e-05,3.7e-05,3.7e-05,3e-06,4.1e-05,6.2e-05,1.2e-05,1.8e-05,1e-05,2.5e-05,4e-06,2.3e-05,9e-06,2.3e-05,1.3e-05,1.1e-05,1.6e-05,5.4e-05,1e-06,1.6e-05,4.9e-05,1.1e-05,8.4e-05,5.8e-05,6e-06,1e-06,6e-06,6.7e-05,1.6e-05,4.2e-05,6e-06,1.3e-05,4.2e-05,2.9e-05,3.1e-05,1.2e-05,2.4e-05,2.2e-05,1.1e-05,6e-06,1.4e-05,1e-05,2.6e-05,2.7e-05,4.2e-05,1.3e-05,1.1e-05,1.7e-05,1.5e-05,2.2e-05,1.7e-05,1.7e-05,1.7e-05,6e-06,3.2e-05,2.7e-05,5e-06,3e-06,1.8e-05,3.8e-05,2.8e-05,1.1e-05,1.2e-05,6e-06,2e-06,2.7e-05,5e-06,1.4e-05,2.8e-05,1.6e-05,2.1e-05
6e-06,1.4e-05,5e-05,5e-06,3.8e-05,3e-05,4e-06,8e-06,3.8e-05,1.6e-05,2.3e-05,3e-06,1.7e-05,1e-05,2e-05,1.9e-05,7.2e-05,1e-05,5e-06,1.7e-05,2.5e-05,8e-06,4e-06,2.5e-05,3.6e-05,3.1e-05,2.9e-05,2.7e-05,2.9e-05,8e-06,0.000105,3.2e-05,1.7e-05,1.5e-05,5.3e-05,3.5e-05,3.7e-05,1.4e-05,3e-06,1.2e-05,1e-05,4.8e-05,1.7e-05,2.4e-05,3.2e-05,3.1e-05,1.9e-05,6e-06,5e-06,3e-06,4.4e-05,3.3e-05,4.9e-05,6e-06,4e-05,6.2e-05,1.2e-05,1.4e-05,7e-06,2.8e-05,1e-06,2.1e-05,7e-06,2e-05,1.5e-05,1.4e-05,2.2e-05,5e-05,3e-06,2.2e-05,4.6e-05,1.6e-05,8.2e-05,4.9e-05,9e-06,3e-06,4e-06,7.5e-05,1.1e-05,3e-05,5e-06,1.5e-05,3e-05,3.4e-05,2.4e-05,6e-06,1.8e-05,2e-05,1.6e-05,5e-06,2.1e-05,1.3e-05,2.2e-05,2.5e-05,4.2e-05,4e-06,1e-05,1.6e-05,1.1e-05,2.6e-05,1.3e-05,2e-05,1.6e-05,3e-06,3.9e-05,3e-05,9e-06,4e-06,1.9e-05,3.4e-05,2.3e-05,1.7e-05,1.5e-05,7e-06,6e-06,2.5e-05,3e-06,1.2e-05,3.2e-05,1.3e-05,2.2e-05
6e-06,1.1e-05,5.2e-05,8e-06,4e-05,2.9e-05,7e-06,6e-06,4e-05,1.4e-05,2e-05,5e-06,1.8e-05,1.4e-05,1.6e-05,2.1e-05,7.6e-05,9e-06,3e-06,2e-05,2.4e-05,7e-06,3e-06,2.9e-05,3.9e-05,2.5e-05,2.7e-05,2.2e-05,2.7e-05,8e-06,0.000102,3.4e-05,2.3e-05,1.6e-05,5.2e-05,3.5e-05,3.1e-05,4e-06,1e-05,1.2e-05,1.1e-05,4.4e-05,2.2e-05,2.6e-05,3e-05,3.3e-05,1.7e-05,2e-06,4e-06,1e-06,4.1e-05,3.5e-05,3.7e-05,2e-06,3.8e-05,6.4e-05,1.3e-05,1e-05,1.1e-05,2.6e-05,1e-06,2.5e-05,5e-06,2.1e-05,1.6e-05,1.6e-05,2.3e-05,5.2e-05,3e-06,2.3e-05,5e-05,1.2e-05,8.1e-05,4.4e-05,4e-06,1e-06,4e-06,7.5e-05,1.6e-05,3.4e-05,5e-06,2.4e-05,3.3e-05,2.8e-05,2.3e-05,1e-05,1.8e-05,2e-05,1.1e-05,6e-06,2.2e-05,1.4e-05,1.9e-05,2.7e-05,4.3e-05,1e-05,7e-06,1.7e-05,1.6e-05,2.4e-05,1.4e-05,1.7e-05,1.2e-05,2e-06,3.4e-05,2.7e-05,6e-06,4e-06,1.6e-05,2.8e-05,2e-05,1.6e-05,1.5e-05,2e-06,2e-06,2.4e-05,2e-06,1.2e-05,3.2e-05,1.2e-05,2.1e-05
