0.062692,0.059853,0.054193,0.050229,0.051352,0.056021,0.055761,0.054522,0.056125,0.057911,0.060401,0.055826,0.049956,0.053536,0.058432,0.055405,0.066266,0.090188,0.090334,0.07346,0.05932,0.051742,0.0529,0.054645,0.054416,0.06061,0.064682,0.062411
0.082381,0.078817,0.06943,0.063826,0.067289,0.075688,0.07518,0.072199,0.074229,0.077619,0.082101,0.075815,0.06763,0.072655,0.078623,0.073514,0.087439,0.119267,0.119079,0.097478,0.07737,0.064787,0.068423,0.072659,0.072127,0.080602,0.086585,0.084448
0.117872,0.113323,0.097463,0.089432,0.09745,0.112165,0.110735,0.104317,0.107926,0.114987,0.123332,0.113515,0.101008,0.108844,0.116855,0.108391,0.127333,0.172683,0.172004,0.14284,0.112081,0.090712,0.099698,0.107717,0.106092,0.120137,0.130508,0.128395
0.144464,0.14035,0.121187,0.112238,0.124577,0.14314,0.139529,0.130242,0.136525,0.147949,0.160017,0.146881,0.131326,0.142566,0.152231,0.14184,0.166771,0.224315,0.222656,0.185933,0.145351,0.117286,0.130937,0.140668,0.138284,0.158607,0.172745,0.170609
0.146956,0.144462,0.131766,0.127176,0.139258,0.152321,0.145854,0.137522,0.145324,0.159196,0.172931,0.160584,0.148263,0.161094,0.169158,0.160772,0.200341,0.271364,0.264076,0.212906,0.165251,0.13863,0.151801,0.158857,0.155258,0.176877,0.190305,0.186494
0.143617,0.138262,0.141924,0.150829,0.157323,0.155375,0.148881,0.14744,0.15213,0.16513,0.175956,0.167454,0.167674,0.173924,0.171618,0.174854,0.238979,0.319439,0.301819,0.234194,0.183762,0.162222,0.165301,0.167642,0.163093,0.1791,0.186892,0.17805
0.192746,0.179623,0.201494,0.225011,0.22661,0.21247,0.202711,0.203931,0.206426,0.222734,0.229399,0.221601,0.23116,0.225412,0.209603,0.224075,0.306449,0.394262,0.378113,0.308085,0.255493,0.233237,0.225163,0.221027,0.215378,0.236702,0.241512,0.218986
0.322574,0.299304,0.334815,0.364854,0.356982,0.324272,0.307362,0.315896,0.325839,0.356187,0.364386,0.354014,0.346452,0.323233,0.315008,0.342927,0.431648,0.533292,0.525119,0.460722,0.408453,0.37582,0.369795,0.365321,0.358461,0.40333,0.404696,0.354392
0.542356,0.496527,0.552647,0.58183,0.539549,0.470438,0.449374,0.479614,0.517395,0.575016,0.584922,0.580001,0.522214,0.456711,0.475996,0.533985,0.644643,0.775285,0.753051,0.677114,0.626836,0.575234,0.582866,0.587811,0.593512,0.68961,0.688845,0.596066
0.83125,0.754162,0.853844,0.883345,0.774757,0.649257,0.628858,0.678903,0.761249,0.862321,0.870571,0.886387,0.760292,0.624898,0.67238,0.785954,0.952356,1.115549,1.05595,0.952598,0.890037,0.808436,0.837379,0.870092,0.919251,1.09341,1.088103,0.933086
1.097682,0.995635,1.161597,1.187574,0.99939,0.819754,0.797561,0.845934,0.970503,1.119367,1.134242,1.189499,1.008075,0.795928,0.841435,1.019071,1.278915,1.460669,1.343056,1.222241,1.134942,1.010765,1.059826,1.13673,1.253217,1.510081,1.502263,1.26878
1.185569,1.079507,1.298763,1.314007,1.070747,0.865006,0.839806,0.867878,1.007119,1.179236,1.213992,1.306722,1.116827,0.877606,0.890273,1.095341,1.42299,1.591846,1.425403,1.301957,1.204456,1.05973,1.112929,1.226293,1.402105,1.701528,1.693221,1.39793
0.99694,0.920875,1.129293,1.131186,0.908364,0.728024,0.695242,0.693374,0.804647,0.952681,1.006654,1.099322,0.954349,0.76948,0.748879,0.918897,1.21397,1.352822,1.204101,1.081552,0.994692,0.8844,0.931679,1.037213,1.210149,1.470616,1.458792,1.167966
0.656765,0.64122,0.757814,0.738794,0.615568,0.508406,0.472967,0.471796,0.536063,0.602827,0.643368,0.695593,0.615557,0.531321,0.524349,0.621335,0.763917,0.841387,0.781726,0.689941,0.629529,0.595339,0.63163,0.679685,0.768695,0.92003,0.930655,0.742229
0.534723,0.599095,0.575704,0.497294,0.480881,0.461997,0.43812,0.484495,0.532943,0.476942,0.486297,0.546986,0.479129,0.426426,0.460666,0.511513,0.491382,0.464411,0.462265,0.454075,0.445893,0.44761,0.481165,0.50605,0.496252,0.556589,0.690804,0.653082
0.761627,0.895457,0.794405,0.631983,0.648092,0.683284,0.667983,0.739621,0.797018,0.661617,0.685355,0.824073,0.693996,0.564076,0.635448,0.726966,0.631424,0.487663,0.48394,0.559908,0.589067,0.59207,0.666311,0.717286,0.653779,0.731807,0.986338,0.970191
1.080529,1.27594,1.129934,0.892769,0.93103,0.998211,0.985697,1.052385,1.117769,0.946041,0.976504,1.205106,1.023478,0.766415,0.844929,1.035028,0.918576,0.67587,0.686895,0.785973,0.796074,0.807962,0.957561,1.059111,0.954935,1.053806,1.363678,1.331318
1.299248,1.561964,1.423461,1.178341,1.248207,1.310781,1.282977,1.307059,1.347245,1.179584,1.223183,1.517687,1.313828,0.929223,0.993245,1.290597,1.190658,0.884617,0.91279,0.984835,0.939577,0.98157,1.216376,1.346914,1.219322,1.346509,1.624882,1.564298
1.341119,1.695712,1.618788,1.454095,1.590878,1.626499,1.540551,1.485645,1.453208,1.322743,1.398706,1.667503,1.486765,1.072467,1.077569,1.387331,1.331346,1.054456,1.096466,1.117066,1.022094,1.115037,1.427791,1.549045,1.407592,1.554837,1.74974,1.698362
1.303436,1.73141,1.708568,1.610715,1.803509,1.85386,1.689238,1.541991,1.454259,1.387907,1.481042,1.646525,1.556608,1.237529,1.144159,1.331177,1.293843,1.136395,1.199129,1.210677,1.174597,1.349945,1.677839,1.713456,1.527611,1.662003,1.784579,1.75652
1.249122,1.635437,1.626955,1.549824,1.706438,1.7639,1.54231,1.381668,1.36332,1.348937,1.331296,1.330497,1.369495,1.271012,1.161271,1.244166,1.233738,1.16842,1.165978,1.17435,1.290315,1.556951,1.797166,1.722154,1.539799,1.586072,1.589357,1.582278
1.083307,1.302131,1.28149,1.223896,1.280769,1.35876,1.253421,1.163227,1.173171,1.147223,1.002939,0.874476,0.963615,1.077512,1.059466,1.126043,1.2159,1.170243,0.993715,0.960322,1.233165,1.54137,1.577965,1.41173,1.348415,1.370379,1.252443,1.187306
0.877732,0.952409,0.868042,0.802793,0.808747,0.907431,1.030065,1.048282,0.950846,0.877839,0.743932,0.611075,0.644385,0.796279,0.830258,0.858452,1.010901,1.017436,0.794587,0.70902,0.977779,1.221465,1.147008,1.001781,1.034038,1.042913,0.897376,0.790737
0.780223,0.727247,0.566329,0.490485,0.51661,0.627292,0.801888,0.876078,0.763021,0.648097,0.568499,0.532827,0.539322,0.599264,0.643448,0.66659,0.721918,0.708045,0.581193,0.530892,0.709254,0.81761,0.756084,0.743973,0.789209,0.768989,0.715239,0.641774
0.908887,0.694636,0.521727,0.465837,0.505202,0.555923,0.583723,0.634247,0.629172,0.557291,0.513256,0.586527,0.637996,0.58109,0.622919,0.713273,0.625331,0.49762,0.474947,0.521629,0.665789,0.712184,0.648395,0.692194,0.672235,0.594708,0.625101,0.63399
1.173245,0.841137,0.701584,0.67593,0.733731,0.716928,0.558166,0.519903,0.597841,0.633783,0.66009,0.724332,0.75957,0.691745,0.758487,0.879848,0.74342,0.546426,0.546505,0.637104,0.775259,0.831557,0.793841,0.815441,0.665028,0.552694,0.644519,0.689055
1.38671,0.978764,0.896409,0.935094,1.020833,0.957457,0.687314,0.559014,0.652877,0.735329,0.845719,0.835665,0.787721,0.786423,0.891147,0.993132,0.857804,0.671115,0.677782,0.752413,0.834401,0.879094,0.874112,0.860573,0.661302,0.585044,0.721228,0.799804
1.401966,0.983092,0.981214,1.136108,1.224689,1.107983,0.829091,0.612128,0.671782,0.76682,0.932515,0.833719,0.711582,0.79619,0.935434,0.94968,0.80009,0.705241,0.724877,0.751966,0.778356,0.799085,0.780757,0.73639,0.591722,0.58825,0.723876,0.826936
1.205707,0.830733,0.891899,1.182554,1.227846,1.076998,0.880093,0.635459,0.634013,0.701345,0.87096,0.748968,0.600525,0.722715,0.872773,0.764283,0.576605,0.60888,0.660456,0.666068,0.709391,0.682234,0.579765,0.524326,0.529885,0.592948,0.643926,0.706146
0.831644,0.578237,0.675318,0.996087,1.014593,0.894917,0.770462,0.56256,0.544922,0.594002,0.727771,0.64465,0.47685,0.579143,0.73553,0.607417,0.394349,0.435315,0.497313,0.523495,0.601851,0.550644,0.416239,0.358625,0.45484,0.537388,0.495495,0.493422
0.49056,0.424898,0.519314,0.682679,0.65124,0.599514,0.56959,0.451601,0.420984,0.464055,0.542575,0.475058,0.357557,0.423758,0.520819,0.463502,0.32812,0.30275,0.340446,0.399828,0.432673,0.398272,0.322497,0.28644,0.390073,0.423876,0.362724,0.349634
0.351284,0.350193,0.381292,0.404329,0.366866,0.376056,0.406399,0.363773,0.301187,0.348106,0.385367,0.324658,0.283029,0.305743,0.326678,0.336227,0.281771,0.210219,0.249525,0.313626,0.286853,0.259932,0.248736,0.233428,0.303984,0.308297,0.253155,0.25067
0.272217,0.296166,0.296138,0.313434,0.281672,0.27724,0.309916,0.29844,0.231442,0.234941,0.242859,0.227299,0.213811,0.200614,0.195079,0.228896,0.205668,0.163018,0.220084,0.240612,0.20611,0.190353,0.176634,0.177872,0.203648,0.195467,0.170508,0.175313
0.195984,0.246074,0.237644,0.235358,0.238126,0.225422,0.247222,0.288324,0.218277,0.150423,0.151618,0.153265,0.151234,0.148817,0.138478,0.151968,0.139802,0.139418,0.187288,0.184472,0.166994,0.166403,0.14522,0.145691,0.143531,0.13231,0.140875,0.14289
0.140921,0.179636,0.168237,0.142853,0.185563,0.212986,0.256006,0.317126,0.222297,0.115163,0.116747,0.097465,0.096441,0.118336,0.111241,0.121694,0.121994,0.12328,0.141198,0.13253,0.137188,0.149557,0.12485,0.127709,0.124482,0.110187,0.117937,0.109295
0.106914,0.110933,0.110628,0.102783,0.13812,0.173502,0.243253,0.311251,0.220323,0.104159,0.10142,0.077869,0.068192,0.08933,0.095152,0.115379,0.110627,0.107403,0.129731,0.120356,0.133691,0.141956,0.098912,0.099753,0.106194,0.093493,0.088637,0.084038
0.079502,0.061818,0.083857,0.094287,0.09414,0.111616,0.184354,0.24706,0.202145,0.100146,0.090601,0.078444,0.052089,0.063429,0.071391,0.094048,0.089897,0.094936,0.130331,0.125634,0.143146,0.130912,0.092463,0.085888,0.075901,0.064616,0.060105,0.073276
0.053424,0.042168,0.07805,0.099079,0.07532,0.075115,0.117552,0.153415,0.163911,0.101684,0.095334,0.093026,0.056049,0.05627,0.047507,0.062692,0.07544,0.09094,0.114567,0.110459,0.13377,0.119965,0.097863,0.082657,0.050409,0.037014,0.04305,0.072085
0.041399,0.039289,0.070389,0.098641,0.081381,0.071832,0.072175,0.082796,0.125056,0.108352,0.110057,0.109237,0.061993,0.049562,0.028296,0.036583,0.066358,0.092408,0.088684,0.075689,0.101288,0.11124,0.108362,0.084003,0.048014,0.031852,0.037187,0.067806
0.045351,0.03871,0.055175,0.082473,0.081537,0.065533,0.051948,0.075163,0.113641,0.104083,0.114753,0.113363,0.059644,0.04476,0.023697,0.029343,0.060385,0.086252,0.071148,0.044508,0.06014,0.090776,0.105281,0.078463,0.055145,0.041022,0.034819,0.058464
