0.044674,0.047329,0.044767,0.046239,0.045128,0.039429,0.037857,0.040228,0.0392,0.038052,0.037905,0.041107,0.045702,0.046955,0.050917,0.05081,0.044538,0.044116,0.051876,0.052235,0.041743,0.035111,0.038825,0.045022,0.048413,0.055421,0.054324,0.047372
0.053587,0.056659,0.055042,0.057381,0.056037,0.04847,0.045701,0.048777,0.048194,0.047212,0.047221,0.050324,0.055735,0.057911,0.062192,0.061208,0.053466,0.053037,0.062297,0.062751,0.050144,0.041756,0.045945,0.054037,0.058558,0.066293,0.065879,0.058052
0.068735,0.071752,0.071473,0.07479,0.073802,0.064119,0.059366,0.064484,0.065165,0.063291,0.063021,0.065599,0.072148,0.07634,0.080372,0.0771,0.067286,0.067157,0.078691,0.079486,0.063917,0.053213,0.05793,0.068428,0.07466,0.082592,0.083275,0.074722
0.082505,0.082473,0.081809,0.085548,0.087549,0.078478,0.072144,0.080657,0.082807,0.077921,0.07638,0.077315,0.083857,0.090104,0.092679,0.085887,0.075366,0.076666,0.090526,0.093043,0.076156,0.06441,0.06831,0.079937,0.086494,0.09004,0.091878,0.085777
0.100246,0.094011,0.089655,0.093226,0.100961,0.095949,0.087245,0.097709,0.100631,0.093072,0.090841,0.089115,0.093982,0.100368,0.102442,0.093907,0.082815,0.085249,0.100929,0.107433,0.091682,0.079166,0.081264,0.095608,0.099599,0.092864,0.09714,0.097522
0.128077,0.113389,0.10473,0.10485,0.118283,0.121455,0.109747,0.117955,0.121205,0.11464,0.113738,0.108827,0.11005,0.114014,0.116918,0.110892,0.101201,0.103821,0.116668,0.126746,0.115075,0.102374,0.10456,0.12406,0.122932,0.10186,0.111714,0.122361
0.156105,0.137548,0.127162,0.118351,0.13435,0.151191,0.142777,0.145294,0.149501,0.148849,0.14783,0.137152,0.137271,0.140991,0.140595,0.135372,0.132222,0.140998,0.147923,0.155956,0.14809,0.134422,0.137173,0.159644,0.153707,0.125117,0.140208,0.157937
0.175654,0.164711,0.153741,0.130236,0.146757,0.179951,0.183391,0.178351,0.186492,0.195835,0.185807,0.16838,0.177779,0.184514,0.171039,0.161946,0.168185,0.188009,0.191138,0.191528,0.185655,0.172338,0.173598,0.190607,0.180134,0.154842,0.171229,0.193644
0.191062,0.19443,0.185296,0.145029,0.162922,0.208977,0.227962,0.219218,0.232001,0.250291,0.221979,0.199783,0.231899,0.241956,0.200837,0.189296,0.207925,0.232259,0.235045,0.226431,0.222765,0.215464,0.210474,0.214036,0.20196,0.185432,0.200069,0.227796
0.20014,0.21343,0.211916,0.160991,0.180654,0.231053,0.261619,0.257687,0.272575,0.290947,0.244883,0.220797,0.274656,0.288965,0.223884,0.215952,0.241107,0.256665,0.261154,0.250989,0.254578,0.255035,0.239903,0.234601,0.228464,0.216832,0.226328,0.256093
0.188874,0.208501,0.218476,0.168037,0.184944,0.229157,0.265015,0.2756,0.284827,0.286441,0.238613,0.222509,0.281191,0.297103,0.229898,0.226478,0.248162,0.251921,0.253401,0.241099,0.25307,0.265118,0.250057,0.244411,0.241669,0.224755,0.224809,0.251144
0.160997,0.174396,0.192512,0.159713,0.172869,0.209699,0.238059,0.255548,0.258331,0.23948,0.207849,0.203857,0.242538,0.256745,0.213575,0.211268,0.22169,0.215554,0.203788,0.190849,0.211422,0.230293,0.224788,0.229266,0.223747,0.193809,0.188462,0.205282
0.136882,0.136364,0.16133,0.15474,0.165833,0.193741,0.201518,0.208018,0.208994,0.183263,0.167872,0.16617,0.175218,0.194014,0.186828,0.181821,0.181911,0.170817,0.151682,0.14886,0.169623,0.17847,0.178833,0.195963,0.187127,0.148352,0.147674,0.15802
0.126329,0.121121,0.152165,0.155863,0.159221,0.179465,0.180654,0.177038,0.174189,0.150359,0.140836,0.136281,0.13363,0.154595,0.163381,0.159931,0.150336,0.136635,0.133455,0.139867,0.142849,0.138856,0.144467,0.174458,0.169382,0.130162,0.130313,0.135602
0.122992,0.123278,0.144922,0.14941,0.148216,0.16076,0.167274,0.163394,0.151347,0.134567,0.137683,0.129548,0.126602,0.137839,0.136592,0.142895,0.138441,0.129681,0.138336,0.142232,0.133812,0.123146,0.128666,0.166251,0.170258,0.135971,0.13112,0.132219
0.148051,0.152763,0.15295,0.158462,0.164239,0.174977,0.189063,0.182649,0.155534,0.15075,0.170923,0.15776,0.155309,0.154915,0.133357,0.143325,0.164412,0.170076,0.167543,0.156883,0.153472,0.150991,0.155887,0.196956,0.203675,0.170893,0.161338,0.155175
0.216636,0.228171,0.219213,0.222709,0.231645,0.247248,0.264814,0.24294,0.197142,0.20459,0.23884,0.214341,0.2149,0.217498,0.187798,0.199319,0.240807,0.247744,0.219388,0.19675,0.203814,0.211614,0.219206,0.272675,0.282914,0.23883,0.224225,0.212745
0.301706,0.326038,0.322147,0.313571,0.313902,0.340609,0.35487,0.306221,0.2565,0.281904,0.310206,0.267342,0.280327,0.297439,0.276964,0.294195,0.344402,0.340153,0.286094,0.253834,0.264701,0.278257,0.292952,0.366862,0.38543,0.322491,0.300213,0.28632
0.360613,0.405519,0.423659,0.391226,0.371922,0.409053,0.410949,0.347243,0.320649,0.358853,0.364012,0.30526,0.331255,0.367525,0.370079,0.390186,0.433206,0.412661,0.347249,0.318255,0.328189,0.341541,0.364764,0.441061,0.461991,0.396211,0.36565,0.350295
0.369504,0.442021,0.487967,0.4252,0.385317,0.426483,0.418868,0.374018,0.383445,0.41047,0.401375,0.346991,0.371534,0.422296,0.440195,0.445223,0.471191,0.441274,0.378882,0.374579,0.390337,0.391039,0.413017,0.460665,0.478564,0.434504,0.385859,0.38505
0.357845,0.444767,0.488499,0.415306,0.376309,0.42129,0.402976,0.370558,0.402948,0.405451,0.397606,0.373112,0.389941,0.440364,0.463751,0.449888,0.467364,0.444371,0.377718,0.407733,0.439707,0.427176,0.444458,0.444125,0.450839,0.425172,0.348281,0.380257
0.379723,0.441246,0.439582,0.384259,0.364836,0.412656,0.400571,0.358549,0.377863,0.358163,0.369614,0.388853,0.400147,0.443559,0.474303,0.443561,0.448402,0.440817,0.375164,0.437874,0.494705,0.475281,0.462865,0.418643,0.403082,0.369242,0.284678,0.33213
0.439295,0.448069,0.397496,0.383943,0.401794,0.431726,0.407678,0.361871,0.362215,0.325529,0.355412,0.395225,0.403108,0.433302,0.451966,0.434486,0.443486,0.433878,0.362944,0.420097,0.475953,0.456493,0.431262,0.368314,0.32153,0.274077,0.225513,0.270522
0.480849,0.447681,0.378959,0.412617,0.468534,0.471778,0.420311,0.369698,0.348698,0.306347,0.338073,0.367046,0.377428,0.400871,0.405034,0.396603,0.402856,0.387164,0.325715,0.358891,0.376907,0.364704,0.364305,0.31511,0.275772,0.231269,0.220327,0.281801
0.473722,0.438703,0.395408,0.436681,0.474793,0.450535,0.393942,0.381756,0.353809,0.29098,0.305129,0.335086,0.351734,0.348225,0.35234,0.344512,0.325066,0.312265,0.28293,0.320222,0.319258,0.300583,0.309955,0.278582,0.278537,0.274137,0.279419,0.331078
0.400103,0.403815,0.411176,0.399285,0.385197,0.373523,0.334537,0.381475,0.394638,0.291267,0.272608,0.326978,0.329802,0.302495,0.302557,0.283298,0.254065,0.266458,0.27298,0.319845,0.343371,0.308317,0.278526,0.26753,0.313929,0.349881,0.343635,0.341855
0.305233,0.370787,0.411896,0.323628,0.267499,0.290287,0.291527,0.382031,0.425811,0.288679,0.236115,0.319623,0.314961,0.281039,0.288668,0.265825,0.228391,0.258529,0.293323,0.324621,0.354061,0.298943,0.231172,0.253378,0.352553,0.413636,0.365107,0.301387
0.233715,0.329227,0.389851,0.30598,0.266305,0.284198,0.289201,0.384579,0.415502,0.283327,0.222873,0.298213,0.301046,0.275601,0.293612,0.272859,0.242156,0.274896,0.292855,0.303946,0.319888,0.240455,0.166197,0.221261,0.337888,0.398114,0.327715,0.263198
0.228901,0.284362,0.312506,0.28544,0.291874,0.28328,0.291103,0.350226,0.325759,0.245581,0.21485,0.258331,0.262127,0.279192,0.333797,0.299124,0.252007,0.254706,0.238663,0.23989,0.249848,0.17718,0.115677,0.177684,0.263958,0.293906,0.256944,0.257461
0.233813,0.251043,0.232209,0.247409,0.28238,0.267118,0.287471,0.2898,0.215673,0.199518,0.218315,0.245158,0.256756,0.302277,0.375583,0.331558,0.25682,0.204159,0.174937,0.202654,0.216781,0.160876,0.12714,0.187059,0.205809,0.180309,0.18403,0.236466
0.226635,0.234123,0.200817,0.226339,0.239761,0.224701,0.255659,0.2405,0.166802,0.190747,0.224215,0.237532,0.275908,0.313526,0.370627,0.356901,0.275346,0.179844,0.147915,0.207603,0.218929,0.161252,0.158691,0.212773,0.193527,0.132378,0.148605,0.203844
0.207953,0.226586,0.20395,0.201432,0.181022,0.175228,0.217573,0.218229,0.15845,0.185024,0.199844,0.195438,0.264076,0.29695,0.319137,0.350052,0.305375,0.198208,0.171307,0.234072,0.218277,0.172622,0.189753,0.207654,0.174179,0.122294,0.134543,0.167452
0.168257,0.197842,0.205543,0.174463,0.121094,0.128895,0.171443,0.180335,0.146984,0.161449,0.173895,0.175229,0.230276,0.242511,0.229193,0.280378,0.283879,0.197084,0.184013,0.233532,0.188842,0.178714,0.209411,0.171617,0.133939,0.12051,0.141274,0.154751
0.131911,0.170277,0.202267,0.16363,0.106979,0.11613,0.132433,0.130394,0.12996,0.147212,0.173016,0.197084,0.205523,0.16841,0.144497,0.185733,0.217377,0.180481,0.180686,0.207903,0.157433,0.172761,0.223027,0.162677,0.116677,0.135944,0.185102,0.186008
0.124935,0.156061,0.171113,0.143243,0.119624,0.136691,0.142619,0.125821,0.120262,0.140019,0.17873,0.218144,0.20365,0.129356,0.095065,0.12787,0.173415,0.174761,0.159308,0.160808,0.130756,0.151019,0.208414,0.169717,0.125724,0.154559,0.221604,0.214698
0.123172,0.131073,0.123009,0.119413,0.138132,0.163174,0.156995,0.127341,0.100093,0.112426,0.156423,0.209048,0.193174,0.118105,0.080625,0.101045,0.14221,0.154026,0.121036,0.107895,0.104826,0.117019,0.157606,0.148417,0.115481,0.150508,0.219653,0.204137
0.115961,0.112412,0.093625,0.113748,0.166269,0.179289,0.143298,0.11206,0.083538,0.081917,0.126188,0.188789,0.16701,0.116869,0.108127,0.109531,0.110972,0.115381,0.090792,0.077901,0.077644,0.081927,0.104319,0.105228,0.09247,0.133249,0.175658,0.152422
0.113904,0.098794,0.089306,0.124087,0.191921,0.184036,0.114327,0.093549,0.083878,0.070702,0.120995,0.188249,0.161457,0.13302,0.150817,0.130442,0.094651,0.098236,0.085681,0.069272,0.075138,0.095335,0.103749,0.087911,0.091751,0.120678,0.11956,0.093944
0.12038,0.086127,0.113134,0.150828,0.193753,0.18267,0.09798,0.088887,0.099967,0.079363,0.133493,0.179828,0.17728,0.178959,0.187996,0.157078,0.108987,0.098718,0.084071,0.074285,0.101106,0.144353,0.14101,0.121963,0.11172,0.101315,0.089998,0.069794
0.120546,0.08706,0.146614,0.175656,0.174397,0.163654,0.089129,0.102843,0.110996,0.083705,0.141923,0.179645,0.210346,0.227217,0.196058,0.169129,0.131452,0.093645,0.082424,0.091583,0.143831,0.206111,0.200456,0.170215,0.124532,0.082308,0.081841,0.064274
