-0.000282,6.6e-05,-0.001045,-0.000532,-0.000248,-0.000347,-0.000581,-0.000243,-0.000624,-0.000528,-0.00049,1.3e-05,-0.000231,-0.000291,-9e-06,-0.000222,4e-06,-0.000446,-0.000305,-0.000542,-0.000406,-0.000213,-0.000408,-3.6e-05,-0.000215,-0.000201,-0.000143,-0.000601,-0.00039,-0.000141,-0.000286,-0.000167,4e-06,-0.000168,-0.000147,-0.000277,-0.000641,-0.000271,-0.00021,-0.000182,-0.000136,-0.000174,-0.000494,-0.00022,-0.000195,-8.2e-05,-7.9e-05,-0.000387,-0.000398,-0.000404,-0.000155,-0.000243,-0.000329,0.000206,-0.000113,-0.00023,-0.000193,-0.000143,8.4e-05,-0.000155,-0.000358,-0.000281,6e-06,-0.000343,-0.000209,-0.000127,-7.3e-05,-0.00018,-0.00035,-0.000354,-0.000191,-0.000264,-0.000339,-0.000145,-0.000272,-0.000433,-0.000474,-0.000413,-0.000301,-0.000397,-0.000435,-9.3e-05,-0.000267,-0.000412,-0.000499,-0.000386,-0.000239,-0.00036,-0.000305,-0.00032,-0.000277,-0.000379,-0.000186,-0.000223,-0.000343,-0.000178,-0.00012,3.7e-05,-5.3e-05,-0.000171,7.7e-05,1.8e-05,4e-05,-4.6e-05,-2.2e-05,4.3e-05,-0.000127,-4.9e-05,-0.000322,-2e-04,-0.000119,-0.000335,-0.000227,-0.000181,-0.000319,-0.000231,0.000255,6.7e-05,-0.000158,-8.6e-05,-0.000224
-0.000447,-4.2e-05,0.000453,6.9e-05,-0.000349,-0.000448,2e-04,0.000262,-0.000397,8e-05,0.000229,0.000517,-2.4e-05,7.8e-05,0.000157,-7.9e-05,-0.000266,0.00015,-0.000184,-0.000127,0.000332,8.5e-05,-1.7e-05,0.000352,-4.9e-05,-0.000461,-0.000265,8.6e-05,-6e-06,1.1e-05,-0.000208,-0.000355,-0.000528,-4.7e-05,4e-06,-7.1e-05,0.000146,1e-04,-5.7e-05,0.000176,0.000222,0.00011,0.000272,-4.4e-05,3.3e-05,0.000143,-7.5e-05,0.000174,-0.000308,-5.5e-05,-1.4e-05,-6.3e-05,3.3e-05,-0.000411,-0.000187,-0.000107,-1.4e-05,1.4e-05,-0.000115,-6.4e-05,6.5e-05,-0.000355,-3.8e-05,-0.000193,-0.000131,0.000171,-0.000119,4e-06,-0.000127,-5.6e-05,-0.000142,-4.7e-05,-6.9e-05,-8e-05,-0.00013,-0.000182,0.000254,0.000249,-0.00025,0.000106,0.000181,0.000364,7.1e-05,-9.6e-05,0.000148,0.000128,-3.2e-05,-0.000233,-0.000302,-0.000184,-0.000224,9.2e-05,0.000119,-0.000111,4.3e-05,-0.000227,-0.000308,-0.000423,-0.000286,-0.000121,2.9e-05,-0.00036,-0.000154,9.6e-05,-6.5e-05,-7.9e-05,-7.7e-05,-9.4e-05,0.000162,0.000131,-3.8e-05,0.000189,1e-05,-0.000469,-0.000214,-4.9e-05,-0.000115,-0.000155,5e-05,-3.5e-05,3.6e-05
8.3e-05,-0.000221,-0.000146,-0.000193,-0.000168,0.000248,0.000203,0.000125,0.000321,0.000254,-9.6e-05,-0.000481,-0.000125,6.1e-05,9.9e-05,0.000133,4e-05,-0.000165,0.000179,0.000337,-0.000115,-1.7e-05,0.000226,-0.000107,-0.000121,-0.000109,-3.5e-05,-4.3e-05,9.8e-05,-0.000133,0.000241,-1.5e-05,0.000184,0.00035,0.000218,0.00012,1.1e-05,0.000359,0.000293,0.000191,8e-06,0.000127,-5e-06,-0.000177,-0.000349,-7e-05,-0.000201,-0.000301,3.7e-05,-5.5e-05,0.000136,5.4e-05,-6.7e-05,-2.1e-05,-0.00021,5.1e-05,5.7e-05,6e-06,-0.000301,-0.000111,-3.3e-05,0.000145,6.6e-05,0.000221,0.000139,-6.5e-05,0.000108,0.000231,0.000102,5e-06,0.000389,0.000116,0.000124,8.5e-05,0.000236,0.000123,-7.5e-05,2.8e-05,0.000203,6.3e-05,-7e-05,1.8e-05,-0.000228,0.000216,3e-06,-0.000141,2.1e-05,6e-06,0.000179,0.000178,-2.7e-05,-7.7e-05,-0.000182,-0.000171,6.1e-05,0.000195,0.000158,0.000148,2e-05,-0.000125,-0.000205,9.3e-05,7.2e-05,6.5e-05,8e-06,8.2e-05,0.000188,1.3e-05,-0.000328,-3.1e-05,5.7e-05,-1.1e-05,-0.000154,-2.5e-05,0.000111,-0.000121,1.3e-05,-1.3e-05,-9.3e-05,-0.000102,-0.000151
-0.000339,-5e-06,-0.000241,-0.000214,-5.3e-05,-2.7e-05,7e-06,-0.000491,-7.6e-05,-0.000513,-0.000194,-0.000126,-0.000543,-0.000231,-8.7e-05,-2.5e-05,-0.000295,-0.000359,-0.000455,-0.000216,4.5e-05,-0.000227,-0.000127,-2e-04,3.7e-05,-0.000182,-5.9e-05,-9.9e-05,-0.00048,-0.000404,-0.000459,-0.000549,-0.000497,-0.000473,-2e-04,-0.000195,-0.000232,-0.000215,-0.000183,-0.000201,-9.6e-05,-7.1e-05,-0.000129,-0.000195,2.1e-05,6.6e-05,0.000194,0.000135,3.4e-05,4.7e-05,-8.4e-05,0.000244,4.6e-05,-5.7e-05,-1.9e-05,-0.000185,-0.000212,-0.000189,4.8e-05,-0.000216,-0.000226,2.7e-05,-0.000277,-0.000348,-0.000217,-0.000157,-7.7e-05,-6.4e-05,-4e-06,7e-05,-0.000304,-0.000195,-0.000412,-0.000195,-7.7e-05,-0.000385,-0.000226,-0.000182,-0.000209,-8.7e-05,-9.2e-05,-0.000126,-7.3e-05,-0.00028,-0.000261,-0.000116,-0.00023,-9.6e-05,-0.000171,-0.000241,-4e-04,-0.000225,-5.3e-05,9.9e-05,4.5e-05,-0.00016,-0.000371,-0.000247,-0.000275,-1.4e-05,1e-05,0.000157,-5.6e-05,-0.000108,-0.000225,-0.000314,-0.000316,-1.2e-05,-2.7e-05,-4e-06,-0.000102,-9.9e-05,-0.000341,-7.6e-05,-0.000248,-0.000109,-0.000261,-0.000126,0.000103,1.4e-05,-7e-06
0.000107,0.000208,0.000111,0.000557,0.000368,2.9e-05,-0.000139,0.000211,0.00015,6e-04,9.5e-05,-0.00015,-1.9e-05,3.2e-05,-0.000127,-0.000139,-0.00015,-7.9e-05,0.000181,5.9e-05,1.2e-05,-7.1e-05,0.000212,9.8e-05,-2e-04,9.2e-05,7e-06,8.6e-05,0.000181,0.000148,6.9e-05,0.000379,0.000271,-4e-06,4.1e-05,6.7e-05,0.000192,0.000138,-0.00012,0.000133,0.000129,1.7e-05,-0.00018,4.1e-05,-8e-06,0.000139,-0.000152,8e-05,0.000239,-8.8e-05,2.9e-05,-0.000106,-0.000298,-0.000238,-7e-05,0.000142,0.000174,-7.5e-05,-3.7e-05,0.000204,0.000328,0.000119,0.000146,0.000195,0.000282,-0.000115,-5.8e-05,0.000165,-0.00013,-6e-06,-4.6e-05,0.000138,0.000209,-2e-04,-0.000136,0.000224,5.1e-05,0.000148,2e-05,0.000215,-0.000155,0.000273,0.000139,0.000158,0.000186,0.000322,0.000116,2.4e-05,4.3e-05,2e-04,0.000368,5.5e-05,0.000124,-1.4e-05,-1.5e-05,-4.3e-05,0.000191,0,8.1e-05,1.9e-05,-0.000196,-7e-06,-6e-05,-0.00011,0.000148,-6.6e-05,-0.000141,-7.9e-05,-7.7e-05,-9.2e-05,-0.000101,-1e-05,9.9e-05,0.000253,0.000195,5.7e-05,-0.000167,-0.000217,-0.000106,-9.8e-05,3e-05
0.000357,-0.00012,-0.000151,-0.000399,-6.2e-05,-0.000146,-3.8e-05,-0.000135,-9.3e-05,0.000113,0.000114,-4.8e-05,0.000248,-1e-05,2.4e-05,-8.5e-05,-7e-06,-3.2e-05,-0.000184,-0.000221,7e-05,0.00018,-0.00014,-4.7e-05,-9.1e-05,2e-06,0.000173,2.4e-05,-3.2e-05,-3.2e-05,8.7e-05,-5.7e-05,4.4e-05,1.5e-05,-2e-04,-0.000106,-7.9e-05,-0.000162,0.000142,-0.000118,-5.6e-05,0.000231,0.00012,-0.000121,0.00014,-2e-05,-1.4e-05,7.8e-05,-0.000144,0.000161,-5.6e-05,-0.000112,1e-04,-3.1e-05,0.000181,-1e-06,-7.1e-05,3.5e-05,6.7e-05,0.000167,-6e-06,-0.000149,6.1e-05,-9.4e-05,2.5e-05,0.000165,0.000112,-8.5e-05,4.6e-05,-7.4e-05,-8.1e-05,-0.000251,6.6e-05,0.000139,0.00018,-8e-06,-0.000168,-0.000199,-9e-05,-7.8e-05,0.000229,-3e-06,-6.7e-05,0.000124,6.5e-05,-0.000174,-7.4e-05,2.9e-05,-7.6e-05,-0.000105,-4.1e-05,-6.3e-05,-0.000189,-0.000182,-0.00011,9.9e-05,9.5e-05,0.000194,0.000158,0.000175,5.6e-05,7.1e-05,4.1e-05,4.1e-05,2.7e-05,0.000115,-1e-06,0.000126,-4.5e-05,4e-06,-0.000132,-2.9e-05,-2.3e-05,-8.2e-05,9.5e-05,-4.8e-05,0.00013,-4.9e-05,-6e-05,3.5e-05,6.7e-05
-9.5e-05,-8.2e-05,0.000119,0.000176,-2.6e-05,0.000111,-0.000189,-0.000235,-0.000244,-0.00024,-0.000205,-7.9e-05,1e-04,-0.000163,-0.000195,-0.00043,-5.9e-05,-9.6e-05,-0.000184,-2.4e-05,4.4e-05,-0.000312,2.1e-05,2.8e-05,-4.8e-05,-1e-05,-0.000188,-4.8e-05,0,5.8e-05,-0.000202,-2.5e-05,0.000156,0,-0.000186,0.00013,9.8e-05,8.9e-05,-0.000263,-6.4e-05,-5e-05,-8.4e-05,-0.000137,-8e-05,0,0.000136,3e-06,-9.2e-05,3.5e-05,5e-06,-3.9e-05,-5.8e-05,7.1e-05,2.3e-05,0.00015,1.5e-05,-6e-06,8e-05,6.4e-05,9.4e-05,2e-06,-5.8e-05,-0.000182,0.000234,-4.8e-05,-9.1e-05,-0.000261,-4.9e-05,-0.000146,3.9e-05,-1.2e-05,2.2e-05,-5.3e-05,-2e-05,8e-06,-1e-06,4e-06,5.7e-05,0.000131,0.00011,-0.000221,8.4e-05,7.1e-05,-3.7e-05,-0.000133,2.6e-05,6.9e-05,3e-05,0.000118,0.000159,-4.6e-05,7e-06,9e-06,-4.2e-05,-9.2e-05,-8.7e-05,-8.7e-05,-0.000152,-0.000113,-3.9e-05,3.2e-05,-9e-05,4.4e-05,1.1e-05,0.000108,-3.6e-05,-4.8e-05,3e-06,9.4e-05,2.3e-05,1.9e-05,-0.000109,8.3e-05,0.00016,1.7e-05,-2.9e-05,2.7e-05,8.7e-05,4.1e-05,7e-05,6.1e-05
7.9e-05,7e-06,-0.000191,-0.000223,-0.000221,-1.6e-05,-3.2e-05,-1.3e-05,0.000236,-1.5e-05,-1.3e-05,-0.000187,7.4e-05,-3.4e-05,-0.00015,6.4e-05,-0.000127,0.000117,-5.9e-05,5e-05,-0.000112,2.8e-05,0.000125,9e-06,-5.9e-05,8.6e-05,-5.3e-05,0.000147,1.7e-05,5e-05,-6.6e-05,3.7e-05,7.1e-05,0.000171,0.000125,-0.000252,-8.7e-05,-5.2e-05,-9.3e-05,-9e-06,-6.1e-05,0.000117,-2.1e-05,-0.000116,-0.000166,-0.00012,-6.6e-05,-5.3e-05,-1.2e-05,-0.000144,-6e-06,-5e-05,-0.000208,-2.5e-05,-0.000113,-6.2e-05,-1e-05,-6.1e-05,-0.000149,-9.8e-05,-0.000214,6e-06,4.6e-05,7e-05,7.3e-05,-6.9e-05,-8.4e-05,6.2e-05,5e-05,7e-06,6.1e-05,6.4e-05,0.000123,8.7e-05,-3e-06,-4.7e-05,6e-06,0.000119,-2.2e-05,-1.6e-05,0.000126,-7.9e-05,-5.8e-05,-2.3e-05,-0.000151,-9.8e-05,1.4e-05,2.4e-05,-0.000108,-0.000193,6.1e-05,0.000155,-0.000168,-6.3e-05,3.2e-05,0.000142,5e-06,-3.5e-05,4.5e-05,3.6e-05,-2e-06,-9.9e-05,0.000107,1.6e-05,6.6e-05,9.4e-05,0.000104,-9e-05,-5.3e-05,-3.1e-05,3.2e-05,2.4e-05,4.1e-05,-0.000153,-0.000145,0.000148,-1.9e-05,-6.8e-05,7.2e-05,-3.5e-05,-7.5e-05
-0.000271,-5.3e-05,3.6e-05,3e-05,0.000219,5.4e-05,0.000131,-9.6e-05,2e-05,-6.2e-05,-2.8e-05,-2e-06,-5.1e-05,0.000173,8.8e-05,-1.8e-05,-7.7e-05,-1.1e-05,7.5e-05,5e-06,0.000199,-8.2e-05,1.7e-05,-8.9e-05,-6.3e-05,9.6e-05,9.6e-05,0.000106,4e-06,-1e-04,7e-06,-8e-05,-0.000252,-0.000123,-9.6e-05,3.4e-05,5e-06,3.2e-05,4.9e-05,4e-05,-0.000168,-3.4e-05,2.6e-05,0.000137,-4.9e-05,-9e-06,-4.3e-05,8.3e-05,2e-05,2.7e-05,9.2e-05,-4.5e-05,-2.6e-05,4.4e-05,-4e-06,4.6e-05,3.4e-05,0.00011,1.8e-05,2.5e-05,7.5e-05,2e-05,-4e-05,-8.9e-05,-7.9e-05,7.8e-05,-3e-05,-0.000141,1e-06,-3e-05,-4.4e-05,-9.5e-05,4e-06,-6.8e-05,-2.2e-05,3e-06,-0.000127,-1.6e-05,4.9e-05,-2.5e-05,-0.000159,-8.8e-05,-9.5e-05,-9.3e-05,2.8e-05,-3e-06,-2e-05,-6.5e-05,0.000154,2.6e-05,-1.2e-05,-0.000117,2e-06,-9e-06,-1.1e-05,-1.4e-05,2.3e-05,-8e-06,1.7e-05,-0.000105,-7.9e-05,2.3e-05,2.6e-05,4.2e-05,4.2e-05,-7.5e-05,2e-05,-1.1e-05,-1.9e-05,-4.6e-05,-5.9e-05,-4e-06,-4.8e-05,-3.9e-05,1.1e-05,-7.2e-05,-8e-05,1.9e-05,-4.4e-05,-2.9e-05,-1.7e-05
-7e-06,9.7e-05,9.4e-05,-7.8e-05,-5.8e-05,-3.2e-05,-5.5e-05,4.9e-05,9.1e-05,9e-05,-9.5e-05,1e-06,3.8e-05,4.6e-05,-1.8e-05,3.9e-05,-6.1e-05,5.2e-05,0.000103,-3.7e-05,-6.6e-05,0.000101,-5.9e-05,-5.2e-05,7.9e-05,2.8e-05,-7.2e-05,-6.8e-05,0.000105,9.5e-05,0.000113,-2.7e-05,1.6e-05,1e-05,4e-06,-1.9e-05,-7.9e-05,-9.2e-05,-7.6e-05,-6.7e-05,1.7e-05,1.4e-05,-3.7e-05,3.1e-05,6.3e-05,-2.3e-05,-2.1e-05,-0.000108,6.2e-05,-1.4e-05,-3.5e-05,1e-06,-2.9e-05,6.1e-05,3.2e-05,-2.2e-05,1.9e-05,-5.5e-05,-3.1e-05,-4.9e-05,5.5e-05,2.8e-05,-2.3e-05,-2.7e-05,2.9e-05,-0.00011,-3.7e-05,-3.3e-05,1.1e-05,5.4e-05,0.00014,4.3e-05,5.2e-05,-4.3e-05,3e-06,-2.5e-05,0.000186,9.8e-05,2.4e-05,4e-05,4.7e-05,-1.5e-05,9.5e-05,-1.8e-05,9e-06,-8e-06,3.9e-05,0,5.3e-05,9e-05,2.6e-05,3e-06,8e-05,5.5e-05,-2.5e-05,8.1e-05,-4.4e-05,-9.9e-05,-6.2e-05,-3.1e-05,-3e-05,-3e-06,-2.8e-05,-8.1e-05,-6.6e-05,-0.00012,3.8e-05,-4.5e-05,-2.4e-05,4.4e-05,7e-06,2.1e-05,1.2e-05,0.000108,5.4e-05,5.2e-05,-1.9e-05,1.2e-05,-2.8e-05,-6e-06,-1e-05
5.3e-05,6.5e-05,-4.4e-05,0.000107,1e-05,-5.3e-05,-5.6e-05,-1.7e-05,0.000112,-6e-06,5.8e-05,5.7e-05,-2.2e-05,6.4e-05,-6e-06,7e-06,0.000175,3e-06,-3.1e-05,-2.1e-05,-7e-05,-0.000102,2.1e-05,-4.2e-05,-5.3e-05,1.1e-05,-1.4e-05,-9e-06,-1.9e-05,-1e-05,0.000117,1.6e-05,8e-06,-3.2e-05,7.4e-05,-0.000117,-7.5e-05,2.1e-05,6.7e-05,9e-06,-6.1e-05,1.4e-05,-3.8e-05,2.1e-05,-9.6e-05,2.2e-05,-1e-06,1e-06,-3.4e-05,1.5e-05,2.2e-05,-1.1e-05,1e-05,-4.7e-05,-0.000128,3.4e-05,-7e-06,1.6e-05,1.6e-05,-2e-06,-4.7e-05,-2.9e-05,7.5e-05,4.8e-05,5e-06,9.6e-05,5e-06,7.4e-05,-1.1e-05,-6.5e-05,-0.000127,-2e-06,-7.2e-05,9e-06,-5.9e-05,6.9e-05,5e-06,-3.4e-05,-4.3e-05,-3.1e-05,9e-06,1.7e-05,-8.9e-05,-2e-05,3.2e-05,-1e-06,-1.3e-05,1.4e-05,-5.5e-05,-2.7e-05,-4.8e-05,-3.2e-05,-5.2e-05,-1.4e-05,1.9e-05,-7e-06,1.8e-05,0.000133,7.2e-05,8.6e-05,-4e-06,1.1e-05,8e-06,0,9e-06,4e-05,8e-06,-2.4e-05,4.5e-05,3.7e-05,4.6e-05,-1.5e-05,4.1e-05,5e-06,-3.6e-05,-4.2e-05,6.1e-05,-1.8e-05,-2.8e-05,1.1e-05,1.6e-05
-6e-05,-5e-05,1.1e-05,7.4e-05,-1.4e-05,6e-06,8e-05,4.8e-05,-0.000108,-0.000103,-1e-05,6.2e-05,-4.8e-05,-2.7e-05,6e-06,-9e-06,2.4e-05,6.5e-05,2.1e-05,-4e-06,-1.7e-05,2.5e-05,-3.3e-05,-5.4e-05,4.6e-05,-5e-05,5.5e-05,-1.1e-05,-8e-05,-1.8e-05,-7e-06,-7.5e-05,4e-05,-6.9e-05,1e-06,5.2e-05,-2.8e-05,-1.7e-05,-6.1e-05,-3.3e-05,-1.8e-05,-3.7e-05,-2e-06,2.7e-05,4.1e-05,4e-06,2.7e-05,-4e-06,-3.8e-05,-2.6e-05,-6.6e-05,6e-06,3.3e-05,5.4e-05,2e-06,-1.2e-05,-3e-05,2.8e-05,5e-06,-5.3e-05,-1.8e-05,-5e-06,-3.2e-05,-1.1e-05,8e-05,-2.7e-05,2.1e-05,-0.000119,-6.4e-05,4e-06,8.4e-05,-2.1e-05,-2e-05,-7e-06,1.3e-05,-1.6e-05,-2.6e-05,3.8e-05,4.4e-05,-8e-06,-9e-05,-4.6e-05,7.1e-05,-2.6e-05,-1.5e-05,1.7e-05,-1.3e-05,-1.9e-05,-2.5e-05,-3.7e-05,6.7e-05,1.5e-05,8.2e-05,1.7e-05,-6e-06,-5e-06,-5e-06,-6.9e-05,-9e-06,-1.4e-05,4.6e-05,-1.7e-05,5e-05,2.1e-05,-2e-05,1e-05,-2.7e-05,1.9e-05,1.8e-05,-2.5e-05,1.1e-05,2.3e-05,-2.5e-05,3.7e-05,2.5e-05,-5.8e-05,-4.2e-05,-1e-06,-3.4e-05,6e-06,-2.1e-05
-3.2e-05,-7.1e-05,-8e-06,1.6e-05,-8.1e-05,5e-05,1.2e-05,-5.8e-05,1e-06,-2.8e-05,-4.5e-05,-2.5e-05,-1.7e-05,-3.4e-05,-1.5e-05,-2e-05,-5e-06,-2.2e-05,-1.7e-05,3e-05,1.9e-05,2.3e-05,1.6e-05,-4e-05,-8.7e-05,-8e-06,1e-06,-9e-06,5e-06,-4e-06,2.2e-05,1.9e-05,-3.3e-05,5.2e-05,-2.6e-05,-5.1e-05,2.4e-05,-1e-06,4.1e-05,4.6e-05,1e-05,-2.2e-05,-2.2e-05,-4.8e-05,-7e-06,-4.6e-05,-3.6e-05,-3e-06,-2.1e-05,-2.7e-05,-5e-06,5e-06,-4e-05,2.8e-05,-4.6e-05,-7.1e-05,-1.1e-05,-3.3e-05,1.4e-05,6e-06,-2.1e-05,-2.1e-05,1.7e-05,1.8e-05,-3.4e-05,-1.5e-05,-3.9e-05,5.1e-05,7.9e-05,3.7e-05,2.8e-05,2e-06,5e-06,-3.3e-05,-1.4e-05,-1e-05,1e-06,-6.7e-05,-5.1e-05,-3.1e-05,4.7e-05,1.1e-05,-4e-06,2e-05,-1.6e-05,-7.4e-05,4.1e-05,2.8e-05,-2.4e-05,2.2e-05,-4.7e-05,-2e-06,2.9e-05,2.5e-05,9e-06,-5.6e-05,1.3e-05,7e-06,2e-06,8e-06,-4e-06,1e-05,7e-06,-6.5e-05,-2e-06,1.2e-05,2.7e-05,2.1e-05,-1.4e-05,-1.3e-05,-1.4e-05,3e-06,-6e-06,4.5e-05,-4e-06,2.5e-05,-3.3e-05,-7e-06,1.6e-05,-2e-06,3.9e-05
-6e-06,-2.6e-05,-1.8e-05,-4.1e-05,7.2e-05,-2.2e-05,-3e-06,3.1e-05,-2.4e-05,-2e-05,-1e-06,-1.5e-05,-5e-05,-3.7e-05,5.9e-05,1.7e-05,-1e-05,4.1e-05,-2.7e-05,2e-06,-1.5e-05,-7.3e-05,-2.1e-05,-1.9e-05,4e-06,-4.4e-05,1.1e-05,-1e-06,-4.3e-05,-8e-06,1.4e-05,-6e-06,-3.9e-05,-1.1e-05,-6e-05,1.7e-05,7e-06,-2.7e-05,-4.8e-05,6e-06,3.2e-05,-3.3e-05,1.9e-05,-4e-06,1.1e-05,-2.9e-05,1.3e-05,8e-06,2.2e-05,3.1e-05,2.2e-05,-2.3e-05,2.9e-05,3.9e-05,3.9e-05,1.5e-05,1.7e-05,1.1e-05,-7e-06,8e-06,-2.9e-05,3.1e-05,-3e-06,-0.000117,-2.5e-05,1e-05,1.6e-05,-2.1e-05,-1e-05,-3.2e-05,1.1e-05,2.7e-05,-5.5e-05,-2.3e-05,2.2e-05,-1.5e-05,3e-06,4.4e-05,7e-06,-3e-06,-5.1e-05,1e-06,-1.2e-05,-2.8e-05,-1.9e-05,2.8e-05,1.9e-05,-2.1e-05,4e-06,4.2e-05,-7e-06,-8e-06,-7.5e-05,-5e-06,1.2e-05,2.8e-05,-8e-06,-7e-06,-2e-06,4e-06,-2.1e-05,-3.2e-05,-1.1e-05,-1e-06,-2.2e-05,-1.7e-05,3.3e-05,4.8e-05,2.4e-05,8e-06,-4e-06,-1e-06,3e-06,-3.6e-05,1.5e-05,2.6e-05,1.9e-05,-5e-06,1e-06,1.9e-05,6e-06
5.5e-05,2.3e-05,4e-06,4.2e-05,-8.5e-05,1.2e-05,-6.6e-05,-4e-06,1.2e-05,-2.5e-05,-5e-06,3e-06,-2e-05,-1e-06,6e-06,-7e-06,3.5e-05,-8e-06,2e-05,-9e-06,-2.4e-05,5e-06,-2e-05,-7e-06,3.5e-05,1.8e-05,-1.2e-05,-2.5e-05,-1e-06,-5e-06,-4e-05,2.2e-05,-3e-06,1.2e-05,1.2e-05,4.7e-05,-3e-06,4.5e-05,2.4e-05,-2.4e-05,-3e-05,-3e-05,-1.6e-05,1.1e-05,1.6e-05,2.6e-05,-3.8e-05,7e-06,-2e-05,-2.4e-05,-4e-06,-8e-06,-6e-06,-1.3e-05,-1.7e-05,3.8e-05,4e-06,-2.3e-05,2e-06,-1.1e-05,5e-06,2e-06,1.4e-05,1.8e-05,-2e-06,-1.4e-05,-2.8e-05,-5e-06,-3e-06,-7e-06,-5e-06,-2.2e-05,-2.1e-05,1e-06,-1e-06,4e-06,2e-06,1.1e-05,2.1e-05,-1.6e-05,2.3e-05,5e-06,-1e-05,3.2e-05,-2.8e-05,1.9e-05,-1.8e-05,-2.6e-05,6e-06,-3.7e-05,1.3e-05,3e-06,-1e-05,1.9e-05,-4e-06,-9e-06,2.7e-05,1.5e-05,1e-05,1.5e-05,4e-06,1e-05,-3.9e-05,3.2e-05,1e-05,1.7e-05,-1.3e-05,1.1e-05,-1.9e-05,7e-06,-1.8e-05,1e-06,-7e-06,-1.4e-05,3e-06,8e-06,7e-06,2.5e-05,1.3e-05,2.4e-05,-5e-06
-3.9e-05,1e-05,-2e-06,-3.3e-05,8e-05,-2.5e-05,3.2e-05,0,-2.2e-05,-1.3e-05,1.2e-05,2.2e-05,3e-06,1.9e-05,-4.2e-05,-2e-06,-2e-06,7e-06,8e-06,4e-06,1.5e-05,-1e-06,-6e-06,-1.7e-05,-9e-06,-1.5e-05,-8e-06,-9e-06,-7e-06,4e-06,2e-06,-1.3e-05,3.3e-05,-2.8e-05,1e-06,-4.6e-05,1.5e-05,-1.9e-05,-8e-06,6e-06,1.2e-05,3e-06,-1.3e-05,1.7e-05,1.4e-05,-3e-06,-2e-06,2e-06,2.5e-05,1.3e-05,2e-06,1.6e-05,6e-06,1e-06,2.5e-05,-2.2e-05,1.1e-05,1.4e-05,6e-06,0,8e-06,-6e-06,-1e-06,3e-05,5e-06,-2e-06,-2e-06,1.2e-05,-1.5e-05,-6e-06,-1.2e-05,-1.3e-05,2.5e-05,3.9e-05,-1.8e-05,-1.6e-05,3.4e-05,-4.3e-05,3e-06,1.7e-05,-3.9e-05,5e-06,3.5e-05,-3e-06,9e-06,-1e-05,-1.7e-05,2.1e-05,-1e-06,-3e-06,1.1e-05,-1.5e-05,-1.2e-05,8e-06,-2e-06,-2.2e-05,2.2e-05,-2.4e-05,-2e-06,-1.8e-05,-5e-06,-1.2e-05,-1.8e-05,-2.3e-05,-1.2e-05,-6e-06,1.8e-05,1e-06,-6e-06,-1e-06,1.4e-05,1e-06,1.9e-05,-1.7e-05,-8e-06,-3e-05,8e-06,-2.3e-05,-1.7e-05,-1.9e-05,1.1e-05
2.9e-05,-4e-06,4e-06,-3e-06,2e-06,5e-06,-1.4e-05,-6e-06,0,2.7e-05,-2.2e-05,-4e-06,-4.2e-05,1.6e-05,-1.1e-05,1.1e-05,7e-06,5e-06,-2e-06,-1.3e-05,3e-06,-1e-06,4e-06,2.6e-05,-2e-06,-4e-06,-1.5e-05,0,5e-06,2e-06,2e-05,1.7e-05,-1.7e-05,2.7e-05,2.1e-05,2.2e-05,1.4e-05,3e-06,-2e-06,2e-06,-2e-05,-9e-06,-1e-06,-3e-06,-6e-06,-6e-06,5e-06,-9e-06,-4e-06,-1.8e-05,4e-06,-1.4e-05,-7e-06,6e-06,1.1e-05,2e-06,7e-06,1.3e-05,-8e-06,1.2e-05,1.4e-05,-3e-06,-8e-06,-3e-06,-2.2e-05,-1.6e-05,-1.3e-05,2.3e-05,1.3e-05,1e-06,1.5e-05,1.6e-05,-1e-06,-1.4e-05,1.3e-05,1.2e-05,-2.1e-05,-9e-06,0,8e-06,1.5e-05,-2e-05,-3.3e-05,4e-06,6e-06,3e-06,1.5e-05,-1.3e-05,-8e-06,4e-06,-2.9e-05,2e-05,1.3e-05,-3e-06,-2e-06,-1e-06,-3e-06,-7e-06,-9e-06,-7e-06,-1.2e-05,9e-06,1e-06,-9e-06,5e-06,8e-06,-3e-06,-1e-06,4e-06,-3e-06,-5e-06,8e-06,-1e-05,-2.1e-05,5e-06,1.8e-05,-1.3e-05,4e-06,0,-1e-06,1e-05
-1.9e-05,1e-06,4e-06,-6e-06,-2.1e-05,-2e-06,2e-05,-2e-06,-8e-06,2.1e-05,-9e-06,1e-05,1.2e-05,-1.1e-05,1e-06,-8e-06,-4e-06,4e-06,-1e-06,9e-06,1e-06,-4e-06,4e-06,-6e-06,3e-06,-2e-05,-5e-06,1.5e-05,-7e-06,-3e-06,7e-06,6e-06,-2e-05,-6e-06,9e-06,3e-06,-4e-06,-4e-06,6e-06,-1e-05,-1e-05,1e-06,-1e-06,2e-06,-5e-06,1.2e-05,-2e-06,6e-06,1.1e-05,4e-06,-2e-06,-8e-06,-4e-06,7e-06,1.5e-05,3.2e-05,-1.6e-05,-1.2e-05,-2e-06,1e-06,1.7e-05,5e-06,4e-06,-9e-06,8e-06,2.1e-05,1e-06,-2.9e-05,-9e-06,1.2e-05,8e-06,-1.1e-05,-7e-06,-5e-06,-4e-06,-3e-06,-7e-06,1.3e-05,5e-06,9e-06,-5e-06,9e-06,1.2e-05,-7e-06,5e-06,9e-06,-1.2e-05,8e-06,1e-06,-4e-06,1.6e-05,-1.1e-05,1e-05,-2.3e-05,3e-06,-1.9e-05,-3e-06,1.3e-05,8e-06,-4e-06,2e-06,-2e-06,2e-06,4e-06,-8e-06,-4e-06,7e-06,-1.2e-05,-1e-05,-1e-06,1.2e-05,-5e-06,9e-06,-3e-06,7e-06,-1.7e-05,-7e-06,3e-06,1.1e-05,2e-06,-9e-06
2e-05,-1.1e-05,-2e-06,2.1e-05,3.1e-05,2e-05,-1e-06,1e-05,-2.4e-05,3e-06,9e-06,-1e-06,2e-06,-1e-05,-6e-06,-2e-06,1e-05,-2e-06,-1.2e-05,2e-06,2e-06,-9e-06,2e-06,-1.4e-05,-3e-06,-1e-06,6e-06,-1e-06,-1e-06,0,3e-06,4e-06,1.2e-05,1e-06,-4e-06,-2.4e-05,3e-06,1e-05,-8e-06,6e-06,-9e-06,3e-06,-1e-06,-2e-06,4e-06,8e-06,0,-1e-05,-1.4e-05,-6e-06,-9e-06,1e-06,2e-06,0,5e-06,5e-06,4e-06,-2e-06,4e-06,0,1e-06,-1e-06,-5e-06,3e-06,0,-4e-06,-2e-06,4e-06,1e-06,-7e-06,-6e-06,-5e-06,1.4e-05,-7e-06,1.1e-05,4e-06,1.9e-05,-1.1e-05,-7e-06,5e-06,-7e-06,-1.2e-05,1e-06,2e-06,0,-1.6e-05,8e-06,-1.3e-05,-1.9e-05,2e-06,1e-06,6e-06,-4e-06,2e-05,3e-06,7e-06,4e-06,-1.1e-05,0,-1.3e-05,-4e-06,8e-06,-6e-06,1.1e-05,1.2e-05,-5e-06,4e-06,-4e-06,0,7e-06,-8e-06,2e-06,-8e-06,8e-06,-5e-06,9e-06,8e-06,-3e-06,-1e-06,-2e-06,1e-06
-1e-06,-1.5e-05,2e-06,-1e-05,-3.5e-05,-8e-06,0,-1.5e-05,-2e-06,-9e-06,-9e-06,7e-06,1.9e-05,-1.8e-05,1.2e-05,-3e-06,9e-06,1e-06,-8e-06,-1e-06,0,-1e-06,2e-06,2e-06,-4e-06,-3e-06,3e-06,-6e-06,-5e-06,4e-06,-5e-06,-5e-06,9e-06,2e-06,-1.7e-05,4e-06,-2e-06,-5e-06,1.2e-05,4e-06,1e-06,5e-06,-5e-06,5e-06,-1e-05,6e-06,-9e-06,-1.1e-05,9e-06,-6e-06,3e-06,0,3e-06,-1e-06,6e-06,-1.4e-05,3e-06,1e-06,-3e-06,7e-06,-1.2e-05,1e-06,5e-06,1.4e-05,0,-2e-06,-5e-06,-4e-06,7e-06,-9e-06,-7e-06,6e-06,1.7e-05,1.5e-05,-1.5e-05,-5e-06,-1.3e-05,-4e-06,1.5e-05,3e-06,-3e-06,1.2e-05,-3e-06,-9e-06,-3e-06,6e-06,-1.4e-05,3e-06,7e-06,-2e-06,-3e-06,-1.4e-05,9e-06,-1e-06,2e-06,-5e-06,4e-06,1.3e-05,-1e-06,1.1e-05,-3e-06,-4e-06,-1.4e-05,-7e-06,1e-06,0,2e-06,-6e-06,2e-06,-3e-06,2e-06,1e-06,1.5e-05,-4e-06,3e-06,3e-06,7e-06,7e-06,0,-2e-06,0
-2.6e-05,4e-06,1e-06,2.1e-05,3.3e-05,-6e-06,-5e-06,1e-05,-5e-06,1e-06,-3e-06,4e-06,1e-06,-4e-06,5e-06,3e-06,9e-06,-1e-06,-5e-06,-1e-06,5e-06,3e-06,-4e-06,-3e-06,3e-06,5e-06,-5e-06,5e-06,0,-6e-06,-2e-06,-1e-06,-6e-06,-1e-06,-3e-06,-1.9e-05,-6e-06,-3e-06,-1.1e-05,-8e-06,-3e-06,8e-06,1e-06,-1.1e-05,5e-06,-1.1e-05,5e-06,6e-06,-3e-06,3e-06,1.2e-05,-2e-06,-1.1e-05,6e-06,-8e-06,1e-06,-6e-06,3e-06,4e-06,1e-06,-7e-06,9e-06,0,1.7e-05,4e-06,2e-06,-3e-06,0,-3e-06,7e-06,-2e-06,-8e-06,-9e-06,-6e-06,-1e-06,3e-06,-4e-06,-2e-06,5e-06,0,-9e-06,-1.2e-05,0,-2e-06,-3e-06,-1.2e-05,4e-06,-1e-06,3e-06,3e-06,-6e-06,1.3e-05,1e-06,8e-06,1e-06,2e-06,-8e-06,-1.3e-05,-1e-06,-2e-06,0,0,2e-06,-4e-06,5e-06,0,-1e-05,0,-4e-06,-5e-06,0,2e-06,-1e-05,1.3e-05,0,-1e-06,-1.4e-05,-7e-06,-8e-06,-3e-06,-1e-06
1e-06,1.3e-05,-1e-06,-5e-06,-3.2e-05,2e-06,-1.3e-05,-3e-06,5e-06,-1e-06,-6e-06,6e-06,1e-05,3e-06,-1.2e-05,1e-06,-2e-06,0,-3e-06,-4e-06,-1.2e-05,-1e-05,3e-06,0,-4e-06,2e-06,3e-06,4e-06,6e-06,3e-06,1e-06,-5e-06,-8e-06,0,5e-06,1e-05,-4e-06,2e-06,3e-06,4e-06,-2e-06,0,-1e-06,9e-06,-3e-06,0,-8e-06,3e-06,1e-06,-6e-06,-6e-06,-5e-06,9e-06,-5e-06,4e-06,1.1e-05,6e-06,2e-06,-3e-06,-7e-06,-4e-06,1e-06,2e-06,-5e-06,3e-06,-7e-06,-6e-06,-1e-05,2e-06,0,5e-06,-4e-06,1e-05,2e-06,3e-06,0,9e-06,1e-06,-3e-06,1e-06,1.2e-05,7e-06,4e-06,-4e-06,-3e-06,5e-06,-3e-06,-5e-06,3e-06,2e-06,1.1e-05,-5e-06,-1.3e-05,6e-06,-3e-06,1e-06,1e-06,1.2e-05,-1e-06,-2e-06,-2e-06,-5e-06,6e-06,5e-06,0,2e-06,2e-06,7e-06,4e-06,2e-06,2e-06,0,3e-06,-1.2e-05,0,-2e-06,-1e-06,-2e-06,-5e-06,-2e-06,-2e-06
1e-06,-1e-06,1e-06,-7e-06,1.9e-05,-1e-06,1.2e-05,3e-06,4e-06,-5e-06,-4e-06,-4e-06,4e-06,1.3e-05,7e-06,3e-06,-1e-06,-4e-06,7e-06,0,2e-06,5e-06,1e-06,-7e-06,2e-06,1e-06,0,2e-06,1e-06,-1e-06,-7e-06,1e-06,3e-06,0,-3e-06,4e-06,0,3e-06,-3e-06,-2e-06,6e-06,4e-06,-1e-06,1e-06,4e-06,-7e-06,-3e-06,-4e-06,-2e-06,3e-06,-6e-06,3e-06,-1e-06,3e-06,-1.1e-05,-8e-06,4e-06,-9e-06,1e-06,-6e-06,1e-06,-5e-06,-3e-06,-1.2e-05,-6e-06,6e-06,-4e-06,1.5e-05,-5e-06,-1e-06,-5e-06,8e-06,7e-06,-9e-06,-1e-06,0,-3e-06,-1e-06,4e-06,-5e-06,-1.7e-05,-2e-06,-5e-06,0,-7e-06,-6e-06,-5e-06,8e-06,2e-06,-6e-06,-5e-06,4e-06,-2e-06,-1.2e-05,1e-06,8e-06,1e-06,-9e-06,-1e-06,2e-06,1e-06,-1e-06,9e-06,-1e-05,4e-06,-7e-06,0,5e-06,-4e-06,4e-06,-2e-06,1e-06,2e-06,-1e-06,1e-06,-5e-06,4e-06,5e-06,-1e-06,6e-06,1e-06
3e-06,2e-06,0,-6e-06,-4e-06,3e-06,6e-06,-5e-06,3e-06,-4e-06,2e-06,2e-06,7e-06,6e-06,-1.1e-05,-2e-06,4e-06,-1e-06,-3e-06,2e-06,7e-06,-9e-06,2e-06,1e-06,0,3e-06,-5e-06,5e-06,-2e-06,0,-1e-06,1e-06,2e-06,7e-06,8e-06,-7e-06,3e-06,-9e-06,1e-06,2e-06,-1e-06,-1e-06,-2e-06,-1e-06,-1e-06,8e-06,-3e-06,-2e-06,1e-06,-5e-06,3e-06,1e-06,1e-06,-4e-06,-4e-06,-3e-06,-8e-06,6e-06,2e-06,0,1e-06,1e-06,0,-1e-06,-3e-06,-6e-06,-7e-06,-1e-05,6e-06,0,6e-06,-7e-06,1e-06,0,2e-06,-1e-06,-1e-06,-1e-06,-4e-06,-4e-06,5e-06,6e-06,4e-06,1e-06,1e-06,2e-06,6e-06,-8e-06,-6e-06,-2e-06,-3e-06,-7e-06,3e-06,8e-06,1e-06,-1e-06,3e-06,1e-06,-2e-06,7e-06,-5e-06,1e-06,1e-06,5e-06,-3e-06,4e-06,-2e-06,6e-06,-1e-06,-1e-06,-1e-06,0,-3e-06,-5e-06,0,6e-06,3e-06,-5e-06,5e-06,-3e-06,3e-06
-1.7e-05,-4e-06,-1e-06,5e-06,-7e-06,4e-06,-5e-06,2e-06,-1e-06,2e-06,-7e-06,-1e-06,-5e-06,-3e-06,2e-06,-2e-06,5e-06,-2e-06,0,1e-06,-7e-06,8e-06,-3e-06,-2e-06,3e-06,4e-06,-2e-06,0,2e-06,-1e-06,7e-06,3e-06,3e-06,-8e-06,5e-06,5e-06,0,8e-06,2e-06,1e-06,-2e-06,-2e-06,-1e-06,1e-06,7e-06,-6e-06,-3e-06,1.1e-05,-1e-06,1e-06,3e-06,-3e-06,-5e-06,2e-06,-2e-06,-2e-06,1e-06,3e-06,-2e-06,-1e-06,3e-06,0,3e-06,7e-06,6e-06,4e-06,-1e-06,6e-06,-2e-06,-2e-06,-7e-06,-3e-06,-1e-05,9e-06,-6e-06,1e-06,2e-06,3e-06,2e-06,-2e-06,-9e-06,-4e-06,-2e-06,1e-06,1e-06,4e-06,-3e-06,0,0,7e-06,2e-06,1e-06,-2e-06,-4e-06,1e-06,0,-1e-06,2e-06,2e-06,-3e-06,-1e-06,3e-06,-2e-06,3e-06,0,1e-06,-2e-06,2e-06,1e-06,-3e-06,-2e-06,0,2e-06,0,0,-5e-06,-1e-06,5e-06,0,-2e-06,2e-06
1.2e-05,-2e-06,1e-06,-8e-06,8e-06,-5e-06,-4e-06,2e-06,-2e-06,-1e-06,0,-1e-06,4e-06,-8e-06,4e-06,0,1e-06,-2e-06,-4e-06,0,3e-06,-1e-05,1e-06,-2e-06,-1e-05,4e-06,0,-8e-06,-4e-06,2e-06,-4e-06,-2e-06,-6e-06,3e-06,-6e-06,-3e-06,-1e-06,-3e-06,-6e-06,-2e-06,-5e-06,-1e-06,-2e-06,-1e-06,-4e-06,3e-06,2e-06,-2e-06,-4e-06,2e-06,0,0,-2e-06,-4e-06,0,2e-06,1e-06,-1e-06,1e-06,-2e-06,4e-06,1e-06,-1e-06,-1e-06,-2e-06,1e-06,-4e-06,1e-06,2e-06,3e-06,4e-06,5e-06,-1e-06,-4e-06,4e-06,2e-06,-9e-06,2e-06,2e-06,-3e-06,5e-06,-1e-06,-2e-06,2e-06,2e-06,1e-06,3e-06,0,1e-06,-1e-06,4e-06,1e-06,5e-06,5e-06,1e-06,0,1e-06,-5e-06,-1e-06,-6e-06,2e-06,1e-06,3e-06,-8e-06,-3e-06,2e-06,-5e-06,-1e-06,-2e-06,0,7e-06,0,-2e-06,1e-06,-1e-06,5e-06,-5e-06,-3e-06,-3e-06,1e-06,-1e-06
-3e-06,-1e-06,0,5e-06,-7e-06,0,0,-3e-06,1e-06,-3e-06,-3e-06,1e-06,-8e-06,-4e-06,-5e-06,2e-06,1e-06,-4e-06,0,-2e-06,-1e-06,3e-06,-4e-06,4e-06,5e-06,2e-06,1e-06,-2e-06,-1e-06,-2e-06,-1e-06,1e-06,1e-06,1e-06,-5e-06,0,2e-06,2e-06,7e-06,-1e-06,1e-06,-2e-06,-2e-06,2e-06,3e-06,-2e-06,-4e-06,-4e-06,4e-06,-3e-06,-2e-06,0,4e-06,-1e-06,1e-06,-1e-06,0,0,-2e-06,1e-06,-2e-06,1e-06,0,-7e-06,-1e-06,-2e-06,0,-4e-06,-3e-06,0,-6e-06,-5e-06,0,-4e-06,1e-06,-2e-06,6e-06,2e-06,-2e-06,-3e-06,-7e-06,1e-06,3e-06,0,-2e-06,-6e-06,-4e-06,-3e-06,2e-06,-4e-06,-4e-06,1e-06,-1e-06,0,0,2e-06,-1e-06,6e-06,-1e-06,4e-06,-1e-06,0,5e-06,1e-06,1e-06,0,-5e-06,-2e-06,1e-06,2e-06,-6e-06,0,3e-06,1e-05,-2e-06,-5e-06,3e-06,0,0,-2e-06,-2e-06
1.3e-05,1e-06,0,4e-06,6e-06,-2e-06,5e-06,2e-06,3e-06,-2e-06,-4e-06,3e-06,-1e-06,-1e-06,4e-06,3e-06,3e-06,-1e-06,-2e-06,-1e-06,-1e-06,2e-06,2e-06,2e-06,-2e-06,2e-06,0,3e-06,-2e-06,0,-2e-06,-1e-06,1e-06,-2e-06,1e-06,0,1e-06,-3e-06,-7e-06,1e-06,-6e-06,-2e-06,0,-3e-06,-1e-06,6e-06,-1e-06,1e-06,-3e-06,1e-06,3e-06,-2e-06,1e-06,0,1e-06,3e-06,2e-06,-5e-06,1e-06,4e-06,-6e-06,2e-06,0,-7e-06,1e-06,2e-06,-5e-06,-1e-06,1e-06,-3e-06,4e-06,-4e-06,-8e-06,-2e-06,0,0,2e-06,-1e-06,-3e-06,1e-06,-4e-06,-1e-06,-2e-06,0,-3e-06,6e-06,4e-06,3e-06,2e-06,0,1e-06,1e-06,5e-06,-3e-06,0,1e-06,1e-06,-6e-06,0,-3e-06,-2e-06,-2e-06,6e-06,4e-06,-3e-06,-2e-06,0,-5e-06,0,0,1e-06,0,-7e-06,1e-06,2e-06,3e-06,3e-06,2e-06,-1e-06,1e-06,0
-9e-06,0,0,1e-06,-2e-06,4e-06,-2e-06,-3e-06,1e-06,1e-06,1e-06,-2e-06,-1.1e-05,6e-06,-2e-06,1e-06,1e-06,-4e-06,3e-06,0,0,-8e-06,-1e-06,-3e-06,0,-1e-06,1e-06,-1e-06,1e-06,1e-06,1e-06,2e-06,1e-06,-2e-06,-1e-06,-8e-06,-2e-06,5e-06,5e-06,0,1e-06,-1e-06,0,2e-06,-2e-06,-5e-06,-3e-06,-2e-06,4e-06,-3e-06,-2e-06,-2e-06,-4e-06,-1e-06,4e-06,-3e-06,0,3e-06,1e-06,0,0,-3e-06,1e-06,5e-06,3e-06,-4e-06,0,5e-06,0,2e-06,0,4e-06,-2e-06,7e-06,0,0,-6e-06,-2e-06,2e-06,3e-06,2e-06,2e-06,-1e-06,-1e-06,-2e-06,-4e-06,0,-4e-06,1e-06,3e-06,2e-06,-5e-06,-6e-06,4e-06,0,-1e-06,-1e-06,5e-06,-1e-06,2e-06,0,-1e-06,-2e-06,1e-06,0,1e-06,-3e-06,-2e-06,-1e-06,-2e-06,-2e-06,0,9e-06,6e-06,-1e-06,-2e-06,-3e-06,-3e-06,4e-06,-1e-06,-1e-06
-3e-06,-2e-06,0,-3e-06,0,-2e-06,-2e-06,3e-06,3e-06,2e-06,-4e-06,4e-06,-2e-06,6e-06,-1e-06,0,1e-06,-1e-06,-3e-06,1e-06,-2e-06,6e-06,1e-06,-1e-06,-1e-06,0,1e-06,-1e-06,-2e-06,-1e-06,0,0,-3e-06,2e-06,3e-06,4e-06,-2e-06,-2e-06,-3e-06,0,-1e-06,0,0,1e-06,1e-06,1e-06,-2e-06,-3e-06,-2e-06,1e-06,-4e-06,1e-06,-1e-06,0,2e-06,3e-06,-1e-06,1e-06,-1e-06,1e-06,3e-06,-1e-06,0,6e-06,-3e-06,3e-06,-5e-06,-6e-06,-1e-06,0,-2e-06,-3e-06,-1e-06,-1e-06,-2e-06,1e-06,3e-06,3e-06,-4e-06,3e-06,-4e-06,-3e-06,2e-06,-1e-06,0,1e-06,-1e-06,0,-5e-06,1e-06,-2e-06,4e-06,-4e-06,-2e-06,1e-06,1e-06,-1e-06,-4e-06,0,0,-1e-06,-3e-06,-3e-06,-6e-06,-1e-06,-1e-06,-5e-06,-1e-06,1e-06,0,2e-06,0,-8e-06,-2e-06,-2e-06,0,-1e-06,1e-06,-1e-06,-1e-06,-3e-06
7e-06,0,1e-06,2e-06,2e-06,3e-06,4e-06,-2e-06,-3e-06,1e-06,-1e-06,1e-06,-4e-06,2e-06,3e-06,-2e-06,0,-1e-06,1e-06,0,3e-06,-8e-06,-1e-06,1e-06,1e-06,-2e-06,-1e-06,1e-06,-1e-06,0,-2e-06,1e-06,1e-06,0,6e-06,0,0,-2e-06,1e-06,0,0,0,-1e-06,0,-1e-06,-1e-06,0,-1e-06,4e-06,-1e-06,2e-06,1e-06,0,-2e-06,1e-06,4e-06,-1e-06,-1e-06,1e-06,2e-06,1e-06,1e-06,0,-3e-06,1e-06,0,-2e-06,3e-06,2e-06,-1e-06,-1e-06,-4e-06,3e-06,1e-06,1e-06,-1e-06,1e-06,3e-06,2e-06,2e-06,1e-06,3e-06,0,-1e-06,-1e-06,-2e-06,1e-06,-1e-06,2e-06,-2e-06,0,-2e-06,6e-06,4e-06,0,-2e-06,-1e-06,1e-06,1e-06,0,0,2e-06,-2e-06,3e-06,1e-06,1e-06,-2e-06,1e-06,-1e-06,2e-06,0,1e-06,4e-06,-3e-06,1e-06,2e-06,0,0,0,2e-06,0
-9e-06,1e-06,0,-4e-06,-1e-06,-4e-06,-5e-06,2e-06,0,2e-06,-3e-06,-2e-06,1e-06,-5e-06,-2e-06,-1e-06,1e-06,-1e-06,-4e-06,0,0,7e-06,1e-06,0,-3e-06,-1e-06,0,-1e-06,-2e-06,0,3e-06,-1e-06,-1e-06,-5e-06,-3e-06,-3e-06,-1e-06,1e-06,2e-06,0,-1e-06,0,-1e-06,-1e-06,0,3e-06,-2e-06,4e-06,-4e-06,-2e-06,4e-06,-1e-06,2e-06,1e-06,0,0,0,0,-1e-06,2e-06,0,0,1e-06,-4e-06,-1e-06,0,-4e-06,-2e-06,-2e-06,1e-06,1e-06,3e-06,-5e-06,-5e-06,-1e-06,2e-06,-4e-06,-3e-06,-1e-06,2e-06,-8e-06,-3e-06,-2e-06,-1e-06,-1e-06,-1e-06,-1e-06,-1e-06,-3e-06,-2e-06,1e-06,5e-06,-2e-06,-2e-06,0,-1e-06,0,2e-06,1e-06,1e-06,0,-1e-06,1e-06,4e-06,0,-2e-06,-1e-06,3e-06,0,0,-1e-06,0,-1e-06,-3e-06,1e-06,-3e-06,2e-06,-2e-06,-2e-06,-1e-06,1e-06
2e-06,0,-1e-06,-2e-06,-4e-06,0,4e-06,-2e-06,-3e-06,1e-06,-2e-06,1e-06,-1e-06,-5e-06,0,1e-06,-1e-06,-1e-06,0,-1e-06,-1e-06,-5e-06,-1e-06,0,1e-06,-3e-06,0,-1e-06,0,0,1e-06,0,1e-06,5e-06,-4e-06,2e-06,-1e-06,2e-06,-4e-06,-1e-06,2e-06,1e-06,0,2e-06,0,0,-1e-06,0,3e-06,1e-06,0,-1e-06,-1e-06,-2e-06,0,-4e-06,1e-06,-1e-06,1e-06,-1e-06,1e-06,-1e-06,-1e-06,1e-06,0,0,-1e-06,2e-06,2e-06,0,4e-06,-2e-06,7e-06,0,0,-1e-06,3e-06,0,-2e-06,2e-06,5e-06,3e-06,2e-06,0,0,1e-06,4e-06,2e-06,3e-06,1e-06,0,-5e-06,-3e-06,0,0,-3e-06,1e-06,-4e-06,-1e-06,1e-06,-1e-06,3e-06,0,-4e-06,1e-06,0,-2e-06,2e-06,0,-2e-06,0,0,2e-06,-1e-06,-1e-06,2e-06,0,2e-06,-1e-06,0,0
-8e-06,-2e-06,0,2e-06,7e-06,1e-06,-1e-06,1e-06,1e-06,-1e-06,2e-06,-2e-06,3e-06,-3e-06,1e-06,2e-06,0,0,-1e-06,0,1e-06,0,1e-06,0,-1e-06,0,0,2e-06,1e-06,-1e-06,-1e-06,0,0,0,1e-06,-3e-06,1e-06,-2e-06,5e-06,1e-06,-2e-06,1e-06,-1e-06,-1e-06,2e-06,-1e-06,-1e-06,2e-06,-2e-06,-2e-06,-3e-06,1e-06,-2e-06,1e-06,-2e-06,3e-06,1e-06,2e-06,0,-1e-06,0,1e-06,1e-06,6e-06,0,-1e-06,-2e-06,-3e-06,-2e-06,0,-2e-06,-2e-06,2e-06,4e-06,0,1e-06,-1e-06,0,0,0,-5e-06,-2e-06,-1e-06,0,0,-1e-06,-4e-06,-3e-06,-1e-06,1e-06,-2e-06,2e-06,6e-06,2e-06,0,-1e-06,-1e-06,5e-06,0,0,0,-2e-06,-3e-06,1e-06,1e-06,1e-06,-1e-06,2e-06,-1e-06,0,0,0,-4e-06,-1e-06,-1e-06,-3e-06,-2e-06,-2e-06,2e-06,1e-06,0
5e-06,2e-06,0,1e-06,-9e-06,1e-06,2e-06,0,0,-1e-06,-4e-06,-2e-06,3e-06,2e-06,-2e-06,1e-06,0,-1e-06,1e-06,1e-06,-1e-06,2e-06,0,-1e-06,-1e-06,-3e-06,0,1e-06,0,1e-06,-1e-06,1e-06,0,-1e-06,-1e-06,3e-06,1e-06,0,-5e-06,0,-1e-06,0,-1e-06,1e-06,-2e-06,0,-2e-06,3e-06,1e-06,1e-06,-1e-06,0,0,-1e-06,0,1e-06,0,0,-1e-06,0,-2e-06,1e-06,0,2e-06,2e-06,1e-06,-2e-06,3e-06,2e-06,0,0,2e-06,2e-06,-1e-06,-1e-06,-1e-06,-1e-06,0,-1e-06,-2e-06,0,2e-06,1e-06,1e-06,-1e-06,1e-06,3e-06,0,0,-1e-06,2e-06,-2e-06,-3e-06,-2e-06,0,0,0,-6e-06,0,-5e-06,-1e-06,1e-06,-3e-06,1e-06,0,0,0,0,0,1e-06,0,0,4e-06,3e-06,0,3e-06,0,0,0,0,2e-06
-2e-06,1e-06,0,0,9e-06,0,-4e-06,-1e-06,1e-06,-1e-06,-3e-06,2e-06,4e-06,4e-06,2e-06,0,1e-06,-1e-06,1e-06,0,-1e-06,-3e-06,0,0,1e-06,0,1e-06,0,0,-1e-06,0,0,-1e-06,1e-06,0,-1e-06,0,2e-06,4e-06,-1e-06,0,1e-06,-1e-06,-1e-06,1e-06,0,0,-4e-06,-1e-06,-1e-06,2e-06,-1e-06,0,1e-06,-2e-06,-4e-06,-1e-06,-2e-06,1e-06,0,-2e-06,-1e-06,0,-4e-06,-1e-06,-1e-06,-2e-06,-2e-06,-1e-06,-2e-06,-2e-06,-1e-06,-1e-06,-3e-06,1e-06,1e-06,4e-06,0,-1e-06,-3e-06,-5e-06,-1e-06,0,0,-1e-06,0,-2e-06,-1e-06,0,-1e-06,-1e-06,3e-06,-2e-06,2e-06,0,1e-06,0,6e-06,0,2e-06,0,-3e-06,-2e-06,-2e-06,0,0,0,-1e-06,-1e-06,0,2e-06,0,-1e-06,0,1e-06,-3e-06,2e-06,0,1e-06,0,0
2e-06,-1e-06,0,1e-06,-7e-06,0,0,0,-1e-06,-1e-06,-1e-06,-1e-06,2e-06,4e-06,1e-06,-1e-06,0,1e-06,1e-06,0,0,4e-06,0,0,-1e-06,-3e-06,0,1e-06,0,0,0,0,1e-06,3e-06,4e-06,-5e-06,0,0,-2e-06,1e-06,-1e-06,0,0,1e-06,-1e-06,2e-06,-3e-06,0,0,0,-1e-06,0,0,0,1e-06,-2e-06,0,0,-1e-06,-2e-06,1e-06,0,0,-3e-06,-1e-06,1e-06,-2e-06,1e-06,0,1e-06,1e-06,-2e-06,3e-06,-1e-06,-1e-06,-2e-06,-4e-06,0,1e-06,-2e-06,1e-06,1e-06,0,0,-1e-06,-1e-06,1e-06,-1e-06,-2e-06,0,0,-1e-06,2e-06,-1e-06,0,0,1e-06,-5e-06,1e-06,-1e-06,0,1e-06,1e-06,0,0,-1e-06,2e-06,-1e-06,0,-1e-06,-2e-06,0,-2e-06,1e-06,-1e-06,2e-06,0,-1e-06,-2e-06,0,-1e-06
-2e-06,-1e-06,0,1e-06,5e-06,-1e-06,3e-06,0,0,0,-1e-06,1e-06,3e-06,0,-2e-06,-1e-06,-1e-06,0,0,0,1e-06,-5e-06,0,1e-06,0,2e-06,0,1e-06,-1e-06,0,0,0,0,-2e-06,-1e-06,2e-06,1e-06,-2e-06,1e-06,0,-1e-06,0,0,0,1e-06,-2e-06,0,0,0,0,-1e-06,0,0,0,-1e-06,2e-06,-1e-06,0,1e-06,0,2e-06,1e-06,0,3e-06,1e-06,0,-2e-06,0,0,1e-06,1e-06,2e-06,1e-06,3e-06,1e-06,1e-06,-1e-06,0,0,-2e-06,-1e-06,0,-1e-06,0,0,0,-1e-06,2e-06,1e-06,1e-06,-1e-06,-2e-06,-1e-06,0,0,0,0,3e-06,1e-06,0,-1e-06,-1e-06,1e-06,2e-06,0,0,1e-06,-2e-06,0,0,1e-06,0,4e-06,-2e-06,-1e-06,-2e-06,0,0,0,0,0
5e-06,0,1e-06,-3e-06,-1e-06,0,-1e-06,1e-06,-1e-06,0,-1e-06,2e-06,1e-06,-4e-06,2e-06,0,-1e-06,1e-06,-1e-06,0,0,3e-06,0,-1e-06,-1e-06,-2e-06,0,-1e-06,0,1e-06,0,0,0,0,-2e-06,-1e-06,0,2e-06,0,0,-1e-06,-1e-06,0,-1e-06,-1e-06,2e-06,-2e-06,-2e-06,-1e-06,-1e-06,2e-06,-1e-06,0,1e-06,1e-06,0,0,2e-06,0,1e-06,0,0,0,3e-06,0,0,-3e-06,0,0,-2e-06,0,0,-2e-06,1e-06,0,-1e-06,4e-06,1e-06,-1e-06,-2e-06,-5e-06,0,1e-06,0,-1e-06,1e-06,0,-1e-06,0,0,1e-06,1e-06,1e-06,0,0,0,0,0,0,0,-1e-06,2e-06,0,-1e-06,0,0,1e-06,-1e-06,-1e-06,1e-06,0,0,-2e-06,-1e-06,1e-06,-1e-06,-1e-06,0,0,1e-06,0
0,0,0,1e-06,-4e-06,0,-1e-06,-1e-06,1e-06,0,-3e-06,-2e-06,-1e-06,-4e-06,-2e-06,0,0,1e-06,0,0,0,-1e-06,0,-1e-06,1e-06,3e-06,0,-1e-06,0,-1e-06,1e-06,0,0,3e-06,0,0,0,1e-06,-2e-06,1e-06,1e-06,0,0,1e-06,0,-2e-06,-1e-06,-2e-06,2e-06,0,0,-1e-06,0,0,0,-2e-06,1e-06,0,0,0,1e-06,-1e-06,-1e-06,-2e-06,-1e-06,0,-1e-06,-1e-06,1e-06,1e-06,0,-3e-06,1e-06,-1e-06,-1e-06,1e-06,-3e-06,0,1e-06,0,0,0,-1e-06,0,0,-2e-06,1e-06,-1e-06,2e-06,-1e-06,-1e-06,-1e-06,0,0,0,0,0,-2e-06,-1e-06,1e-06,0,0,-1e-06,-2e-06,0,0,3e-06,0,0,0,0,0,1e-06,-2e-06,1e-06,2e-06,1e-06,0,1e-06,0,0
-7e-06,-1e-06,-1e-06,-1e-06,8e-06,1e-06,0,0,0,0,-1e-06,1e-06,-2e-06,-1e-06,0,0,0,1e-06,-2e-06,0,1e-06,-2e-06,0,0,-2e-06,-1e-06,0,0,0,1e-06,0,0,1e-06,-3e-06,-2e-06,-1e-06,0,-2e-06,2e-06,0,-1e-06,0,0,-1e-06,0,4e-06,0,2e-06,-2e-06,-1e-06,-3e-06,1e-06,0,1e-06,1e-06,2e-06,0,-2e-06,0,-1e-06,0,0,0,-5e-06,0,-1e-06,-3e-06,2e-06,-1e-06,0,-1e-06,1e-06,-2e-06,-3e-06,0,-1e-06,0,-1e-06,-1e-06,2e-06,-3e-06,-1e-06,1e-06,0,0,1e-06,-2e-06,-1e-06,-1e-06,-1e-06,1e-06,4e-06,0,0,0,0,1e-06,4e-06,0,2e-06,0,1e-06,0,3e-06,0,-1e-06,2e-06,1e-06,0,-1e-06,0,0,-2e-06,1e-06,-1e-06,-2e-06,1e-06,0,1e-06,0,0
5e-06,1e-06,0,1e-06,-1.1e-05,-2e-06,0,0,2e-06,0,0,1e-06,-3e-06,2e-06,1e-06,0,0,0,0,0,-1e-06,2e-06,-1e-06,0,1e-06,4e-06,0,0,-1e-06,-1e-06,-1e-06,0,0,0,0,-2e-06,0,0,-3e-06,-1e-06,1e-06,-1e-06,0,0,0,-3e-06,-3e-06,3e-06,2e-06,0,0,0,0,-1e-06,0,1e-06,-1e-06,1e-06,0,1e-06,-1e-06,0,0,1e-06,1e-06,1e-06,-1e-06,-2e-06,1e-06,-1e-06,1e-06,0,1e-06,0,-1e-06,1e-06,2e-06,0,1e-06,2e-06,2e-06,1e-06,0,0,-1e-06,-2e-06,2e-06,-1e-06,1e-06,0,-1e-06,-4e-06,0,0,0,0,-1e-06,-5e-06,0,-1e-06,-1e-06,-1e-06,2e-06,1e-06,0,0,1e-06,1e-06,0,0,-1e-06,0,5e-06,0,0,2e-06,0,-1e-06,-1e-06,0,1e-06
