0.129365,0.12743,0.133608,0.123763,0.130993,0.130697,0.125224,0.129636,0.135372,0.127449,0.099748,0.089782,0.106844,0.122463,0.126341,0.127701,0.116715,0.115699,0.116404,0.102619,0.08983,0.082793,0.088544,0.093001,0.095167,0.098225,0.088096,0.078148
0.159724,0.15912,0.167104,0.149952,0.159526,0.16549,0.159832,0.161137,0.165858,0.15987,0.129025,0.115234,0.136214,0.155791,0.16196,0.165571,0.148337,0.141382,0.141552,0.128719,0.115374,0.10496,0.110522,0.11833,0.120205,0.120776,0.109011,0.095542
0.209027,0.211722,0.223521,0.195303,0.21063,0.22766,0.218253,0.210241,0.213468,0.214849,0.180459,0.159027,0.186078,0.211482,0.221198,0.22931,0.201787,0.184019,0.182118,0.171964,0.161246,0.14622,0.150075,0.165007,0.165907,0.159166,0.14393,0.122424
0.237759,0.245847,0.263125,0.233832,0.256215,0.276786,0.253558,0.230998,0.234029,0.248378,0.21812,0.192815,0.221376,0.245958,0.257981,0.271585,0.239,0.21269,0.206116,0.199624,0.198835,0.184861,0.185117,0.205891,0.202549,0.184157,0.167785,0.139061
0.245975,0.257599,0.277518,0.261033,0.284849,0.291002,0.246921,0.213286,0.218836,0.244372,0.22438,0.204946,0.237167,0.253153,0.259476,0.277642,0.24755,0.217481,0.205586,0.204479,0.217922,0.211998,0.210257,0.227303,0.211631,0.1825,0.173091,0.145089
0.244516,0.25854,0.278981,0.275357,0.287067,0.268377,0.215222,0.187385,0.202656,0.233704,0.213849,0.199047,0.245691,0.258814,0.253273,0.267492,0.234981,0.206148,0.198037,0.204082,0.223562,0.226007,0.22898,0.227966,0.191631,0.161909,0.164507,0.14218
0.251899,0.262488,0.284941,0.283966,0.274776,0.237175,0.192125,0.177364,0.201751,0.240952,0.219083,0.197671,0.247684,0.262348,0.253846,0.259072,0.21927,0.201422,0.202077,0.203868,0.215171,0.221427,0.230372,0.212371,0.17054,0.151885,0.157098,0.136406
0.296547,0.298877,0.314527,0.314161,0.295871,0.260969,0.22688,0.211588,0.23697,0.295919,0.274788,0.22329,0.251503,0.265518,0.27318,0.293344,0.251373,0.232187,0.237688,0.228559,0.224619,0.228671,0.23826,0.215884,0.187861,0.179636,0.176301,0.149279
0.457958,0.455601,0.448269,0.445244,0.440892,0.41999,0.38873,0.362304,0.394008,0.493158,0.449485,0.332588,0.319271,0.320533,0.369777,0.440925,0.390693,0.345463,0.349996,0.338229,0.335483,0.34434,0.348927,0.305269,0.275706,0.267237,0.255984,0.216765
0.79387,0.769977,0.715301,0.719457,0.741106,0.725846,0.691901,0.653891,0.712978,0.878827,0.776163,0.551094,0.48085,0.456863,0.587511,0.746711,0.655642,0.551975,0.560915,0.560087,0.576069,0.597262,0.590859,0.507906,0.459598,0.438138,0.413039,0.34166
1.298488,1.224204,1.091946,1.119092,1.164077,1.142125,1.116365,1.081913,1.196103,1.455095,1.262796,0.871501,0.708964,0.653184,0.915754,1.218631,1.055585,0.841452,0.862838,0.897221,0.940315,0.964968,0.938912,0.809313,0.729018,0.676567,0.627152,0.508737
1.883586,1.737372,1.515062,1.566048,1.601075,1.552194,1.54574,1.53835,1.726904,2.067293,1.777483,1.212256,0.952878,0.885384,1.290683,1.747488,1.518439,1.175517,1.210551,1.289672,1.350702,1.35378,1.289661,1.121434,1.009199,0.921208,0.839198,0.666554
2.27264,2.065228,1.798117,1.85839,1.844338,1.753551,1.747511,1.778332,2.023894,2.369086,2.02671,1.388362,1.082419,1.047769,1.528513,2.053604,1.813317,1.407071,1.453466,1.552756,1.607741,1.561735,1.43657,1.259259,1.137451,1.028975,0.922082,0.720047
2.139492,1.920866,1.692459,1.739682,1.69393,1.588162,1.539669,1.590028,1.825739,2.063645,1.76153,1.241842,0.982635,0.999147,1.41203,1.845209,1.671761,1.335403,1.387599,1.463532,1.499545,1.412828,1.227777,1.081621,0.992837,0.900275,0.796455,0.62583
1.52472,1.366191,1.260266,1.269778,1.220703,1.152183,1.050838,1.06956,1.243361,1.348239,1.14944,0.86258,0.72288,0.778509,0.987565,1.195488,1.126424,0.96777,1.018835,1.046182,1.061429,0.978038,0.804751,0.739759,0.718318,0.654684,0.572469,0.475891
1.063909,0.984063,1.009207,0.947864,0.847315,0.814525,0.7175,0.665168,0.812176,0.908796,0.8114,0.663355,0.570805,0.6492,0.67414,0.685767,0.677768,0.621897,0.660053,0.759558,0.808904,0.738506,0.668956,0.681484,0.670484,0.589496,0.500562,0.44191
1.154728,1.103899,1.158864,1.03772,0.877268,0.836038,0.725606,0.62438,0.808726,0.966428,0.913715,0.784923,0.665594,0.745253,0.735512,0.741498,0.753698,0.619549,0.626138,0.825378,0.928734,0.850053,0.803182,0.828361,0.801976,0.711601,0.607437,0.52835
1.312406,1.293963,1.299872,1.127899,0.97354,0.91299,0.788541,0.719216,0.91622,1.029323,0.97802,0.889577,0.791466,0.858706,0.886092,0.986372,0.976262,0.718259,0.718796,0.937392,1.025707,0.972581,0.940015,0.950691,0.929212,0.869867,0.740878,0.59366
1.335937,1.349244,1.333119,1.129062,0.999157,0.921381,0.813658,0.827427,1.049571,1.083875,0.954313,0.864455,0.849285,0.935263,1.032901,1.268559,1.21596,0.821289,0.811723,0.990338,1.019369,1.059279,1.105005,1.09877,1.070895,1.010632,0.868999,0.676281
1.320681,1.383024,1.341977,1.102156,0.995649,0.941753,0.890312,0.958816,1.210778,1.175351,0.905877,0.789498,0.909028,1.068558,1.172423,1.465689,1.376575,0.89387,0.911506,1.059114,1.005413,1.130045,1.270606,1.248497,1.211091,1.136159,1.009488,0.789621
1.200329,1.341178,1.329933,1.055225,0.971194,0.987555,0.932461,0.961919,1.166493,1.075033,0.777223,0.724367,0.95583,1.150405,1.185661,1.411671,1.326675,0.884283,0.927988,1.072364,0.982786,1.125893,1.33578,1.281083,1.203667,1.150505,1.085858,0.845484
1.028598,1.169314,1.168454,0.858032,0.793209,0.884879,0.845347,0.824951,0.89734,0.7826,0.600434,0.6545,0.899385,1.026502,0.959346,1.045885,0.999343,0.739936,0.78503,0.915662,0.85437,0.943624,1.138869,1.093136,1.021128,0.988533,0.96477,0.754074
0.820805,0.895582,0.874713,0.58083,0.54188,0.640235,0.665548,0.707657,0.693813,0.575509,0.491695,0.579304,0.728137,0.730368,0.63615,0.611185,0.57648,0.516093,0.546248,0.655801,0.685993,0.693121,0.777133,0.786152,0.780578,0.755066,0.703442,0.538641
0.645962,0.611217,0.575555,0.378255,0.360152,0.406164,0.461695,0.57282,0.548409,0.459857,0.462013,0.549491,0.577326,0.518369,0.475708,0.406832,0.367162,0.392229,0.39902,0.482189,0.5635,0.537834,0.538756,0.538035,0.562691,0.569544,0.493762,0.359042
0.577969,0.480331,0.459334,0.367581,0.381469,0.383305,0.366673,0.438029,0.477016,0.451931,0.461741,0.5199,0.520762,0.477278,0.45368,0.379127,0.357603,0.40225,0.401908,0.458971,0.516147,0.486232,0.467579,0.449288,0.462498,0.466017,0.397617,0.293537
0.613237,0.560077,0.528485,0.502841,0.51575,0.449212,0.366684,0.416241,0.533629,0.532998,0.474102,0.465663,0.503535,0.532941,0.51207,0.428208,0.401199,0.443184,0.442563,0.471465,0.511237,0.490565,0.482154,0.487446,0.491385,0.412686,0.30786,0.276252
0.725223,0.739098,0.676682,0.681847,0.663731,0.517998,0.387953,0.434917,0.621518,0.659198,0.547105,0.445592,0.50202,0.627486,0.6415,0.567064,0.489541,0.473444,0.468082,0.458367,0.489205,0.49082,0.504839,0.551859,0.553042,0.392492,0.24884,0.270002
0.870656,0.910246,0.825214,0.821444,0.738068,0.548518,0.419129,0.431643,0.613707,0.695645,0.572082,0.438222,0.542728,0.700643,0.722898,0.696731,0.564261,0.4492,0.43066,0.416397,0.442751,0.46591,0.537948,0.613774,0.587581,0.405607,0.264513,0.271283
0.924161,1.050973,0.956273,0.835395,0.713359,0.544978,0.458342,0.43487,0.517616,0.6108,0.522148,0.409416,0.598618,0.74626,0.710234,0.716542,0.568722,0.396869,0.387555,0.407006,0.398575,0.421586,0.555585,0.624609,0.562965,0.416193,0.292715,0.248056
0.871872,1.091755,1.039753,0.742314,0.5927,0.519561,0.519239,0.466498,0.392252,0.475343,0.487877,0.419211,0.673589,0.814776,0.681466,0.633326,0.509599,0.362649,0.352302,0.39192,0.341185,0.335763,0.473077,0.526839,0.475213,0.406967,0.304912,0.229117
0.804541,0.992097,1.001179,0.677419,0.546233,0.53157,0.580873,0.484794,0.293311,0.365845,0.491197,0.521239,0.754748,0.795925,0.60928,0.546089,0.450886,0.353535,0.356005,0.388535,0.297903,0.262176,0.361985,0.41938,0.419355,0.38708,0.278999,0.20265
0.703266,0.771522,0.814035,0.609782,0.522188,0.488788,0.562597,0.486011,0.283117,0.319773,0.454689,0.581631,0.742729,0.632662,0.463263,0.500043,0.447209,0.339382,0.350193,0.367099,0.254777,0.226222,0.352831,0.40642,0.384706,0.338714,0.231448,0.19241
0.560538,0.542792,0.618963,0.538572,0.453026,0.381071,0.450983,0.461703,0.285701,0.243493,0.338555,0.519963,0.61218,0.437623,0.34485,0.423155,0.40991,0.325337,0.306214,0.296267,0.214806,0.228155,0.374891,0.389974,0.298499,0.24204,0.172559,0.1909
0.406284,0.398632,0.513429,0.477395,0.381725,0.292324,0.316342,0.3716,0.26207,0.18055,0.213049,0.351862,0.432397,0.31848,0.261607,0.294843,0.301075,0.264923,0.221477,0.217982,0.193732,0.218076,0.338265,0.321973,0.206687,0.161344,0.131344,0.167159
0.283209,0.289526,0.384827,0.414168,0.311419,0.21946,0.214646,0.244888,0.204945,0.138708,0.127181,0.178252,0.25818,0.222735,0.17179,0.169923,0.172756,0.177267,0.156259,0.164512,0.171494,0.183287,0.243363,0.212073,0.132692,0.120214,0.109385,0.123118
0.187676,0.208232,0.2557,0.322479,0.23724,0.153079,0.155503,0.139511,0.125911,0.097495,0.091061,0.090558,0.128413,0.12905,0.107981,0.10391,0.093504,0.126637,0.129032,0.118555,0.132576,0.148079,0.145827,0.111807,0.089531,0.105034,0.101896,0.087709
0.119757,0.140407,0.176723,0.235906,0.178014,0.11058,0.107387,0.071492,0.066322,0.072719,0.076522,0.073605,0.077732,0.096708,0.100691,0.072216,0.066298,0.112907,0.123539,0.097552,0.104146,0.105423,0.075443,0.059368,0.075747,0.103409,0.097527,0.070191
0.091611,0.091895,0.112761,0.154243,0.121227,0.085141,0.077383,0.050053,0.041734,0.053595,0.067,0.067091,0.063303,0.097596,0.100023,0.056452,0.058062,0.096003,0.106742,0.082155,0.08536,0.074882,0.045072,0.040603,0.062523,0.086053,0.080677,0.054389
0.079223,0.067754,0.07763,0.095732,0.08042,0.068217,0.057428,0.042921,0.031501,0.040184,0.066156,0.069559,0.054381,0.086852,0.091918,0.046462,0.051037,0.084082,0.085622,0.059837,0.063241,0.062553,0.044726,0.032651,0.044132,0.057735,0.054624,0.039662
0.068018,0.061238,0.061539,0.074363,0.070335,0.064697,0.05414,0.044116,0.033253,0.032256,0.059037,0.067845,0.042016,0.064573,0.074357,0.03896,0.04585,0.082114,0.074402,0.044799,0.041627,0.046987,0.043308,0.02514,0.030973,0.041297,0.042318,0.041024
