-9e-05,-2.4e-05,-1e-05,3e-06,5e-06,5e-06,3e-06,1e-06,3e-06,4e-06,3e-06,5e-06,7e-06,5e-06,4e-06,-2.2e-05,-0.00014,-9.8e-05,-0.000147,-0.000144,-3.8e-05,-1e-05,1e-06,9e-06,7e-06,2e-06,4e-06,6e-06
-3.9e-05,9e-06,-2e-06,5e-06,5e-06,5e-06,3e-06,1e-06,1e-06,2e-06,1e-06,3e-06,4e-06,4e-06,4e-06,-9e-06,-0.000108,-9.7e-05,6.7e-05,8e-05,2.6e-05,1e-05,5e-06,7e-06,7e-06,1e-06,1e-06,2e-06
-0.00013,-4.4e-05,-2.5e-05,-7e-06,-5e-06,-3e-06,-1e-06,-3e-06,-2e-06,2e-06,2e-06,3e-06,3e-06,3e-06,2e-06,1.1e-05,2.4e-05,-1e-05,-0.000197,-0.000217,-6.8e-05,-3.3e-05,-1.2e-05,-1e-06,0,-1e-06,-2e-06,-1e-06
4.5e-05,1.1e-05,9e-06,5e-06,1e-06,1e-06,3e-06,-1e-06,-1e-06,2e-06,4e-06,5e-06,3e-06,3e-06,2e-06,1.9e-05,0.00011,8.3e-05,-1.7e-05,-1.8e-05,1e-06,-2e-06,3e-06,5e-06,4e-06,2e-06,-2e-06,-1e-06
0.00015,5.2e-05,3.4e-05,1.2e-05,3e-06,3e-06,4e-06,0,-2e-06,0,2e-06,4e-06,3e-06,3e-06,2e-06,2e-06,4.5e-05,6.3e-05,0.000197,0.00021,6.3e-05,1.8e-05,1.1e-05,7e-06,6e-06,3e-06,-1e-06,-2e-06
0,-1.7e-05,-2e-06,-2e-06,-7e-06,-5e-06,-2e-06,-4e-06,-4e-06,-4e-06,-2e-06,1e-06,0,0,0,-2.2e-05,-9e-05,-4.9e-05,-7.3e-05,-7.6e-05,-3.1e-05,-1.5e-05,-4e-06,0,0,1e-06,-1e-06,-4e-06
-3.3e-05,-1.6e-05,-7e-06,1e-06,-3e-06,-3e-06,-2e-06,-2e-06,-2e-06,-2e-06,-2e-06,0,-1e-06,0,0,-8e-06,-7.2e-05,-6.7e-05,2.1e-05,1.9e-05,-6e-06,5e-06,3e-06,1e-06,1e-06,0,-1e-06,-4e-06
-5.1e-05,-1.7e-05,-8e-06,4e-06,1e-06,-1e-06,-1e-06,1e-06,0,1e-06,1e-06,0,0,1e-06,1e-06,1.6e-05,3.8e-05,4e-06,0.000106,9.5e-05,1.7e-05,1e-05,6e-06,2e-06,2e-06,1e-06,1e-06,-1e-06
-7.2e-05,-2.9e-05,-2e-05,-2e-06,-4e-06,-3e-06,-3e-06,0,1e-06,2e-06,1e-06,-1e-06,-1e-06,0,0,7e-06,4.9e-05,3.7e-05,-0.000126,-0.000129,-2.9e-05,-3e-06,3e-06,-1e-06,-2e-06,-1e-06,1e-06,2e-06
1.8e-05,1.7e-05,3e-06,0,-3e-06,-1e-06,-2e-06,1e-06,1e-06,0,0,-2e-06,-1e-06,-1e-06,-1e-06,-6e-06,1.1e-05,2.3e-05,-3.5e-05,-1.5e-05,1.2e-05,1.2e-05,5e-06,-1e-06,-2e-06,-2e-06,2e-06,4e-06
4.3e-05,7e-06,5e-06,-6e-06,-4e-06,0,-2e-06,1e-06,1e-06,-2e-06,-2e-06,-2e-06,-1e-06,-2e-06,-1e-06,-4e-06,-4e-06,-7e-06,3.7e-05,5.2e-05,1.8e-05,2e-06,-4e-06,-4e-06,-4e-06,-2e-06,1e-06,3e-06
6e-06,-1.6e-05,-1e-05,-1.2e-05,-5e-06,-3e-06,-2e-06,1e-06,1e-06,-1e-06,-1e-06,-1e-06,-2e-06,-3e-06,-1e-06,-1e-06,-1.7e-05,-2.5e-05,-6.8e-05,-8.3e-05,-3e-05,-1.6e-05,-1.2e-05,-7e-06,-6e-06,-3e-06,0,1e-06
-7e-06,7e-06,2e-06,-5e-06,0,0,0,2e-06,1e-06,0,-1e-06,-1e-06,-3e-06,-3e-06,-1e-06,2e-06,-1.2e-05,-7e-06,8.2e-05,6e-05,6e-06,-3e-06,-9e-06,-6e-06,-5e-06,-2e-06,-1e-06,-1e-06
-2.1e-05,-7e-06,-5e-06,-7e-06,0,0,-1e-06,0,-1e-06,-2e-06,-2e-06,-4e-06,-5e-06,-3e-06,-2e-06,-3e-06,-1e-05,6e-06,6e-05,5.6e-05,1.1e-05,-2e-06,-8e-06,-8e-06,-7e-06,-3e-06,-3e-06,-2e-06
-2.9e-05,-1e-05,-1.5e-05,-9e-06,-4e-06,-4e-06,-5e-06,-2e-06,-3e-06,-6e-06,-5e-06,-7e-06,-8e-06,-5e-06,-4e-06,-1.2e-05,-1.8e-05,-9e-06,-0.00011,-0.000102,-2.2e-05,-7e-06,-7e-06,-1.1e-05,-1.1e-05,-5e-06,-4e-06,-4e-06
-2e-06,1.5e-05,1e-06,-4e-06,-2e-06,-2e-06,-5e-06,-2e-06,-5e-06,-7e-06,-7e-06,-8e-06,-8e-06,-6e-06,-5e-06,-1e-06,2.4e-05,-6e-06,3.6e-05,5.2e-05,1.2e-05,1e-05,-2e-06,-1.1e-05,-9e-06,-4e-06,-4e-06,-6e-06
3.7e-05,-1e-06,-2e-06,-8e-06,-4e-06,-2e-06,-3e-06,-2e-06,-4e-06,-6e-06,-6e-06,-6e-06,-7e-06,-6e-06,-5e-06,4e-06,3.2e-05,1e-06,1.3e-05,2.1e-05,-8e-06,-1e-06,-4e-06,-1.1e-05,-9e-06,-4e-06,-5e-06,-9e-06
-1e-05,-1.4e-05,-8e-06,-1e-05,-8e-06,-5e-06,-2e-06,-2e-06,-3e-06,-5e-06,-4e-06,-5e-06,-6e-06,-6e-06,-4e-06,-1.1e-05,-3.5e-05,-9e-06,-8e-05,-8.8e-05,-3.1e-05,-9e-06,-6e-06,-1.1e-05,-8e-06,-3e-06,-5e-06,-9e-06
-3.3e-05,4e-06,6e-06,-5e-06,-6e-06,-3e-06,-1e-06,-2e-06,-2e-06,-4e-06,-4e-06,-4e-06,-5e-06,-5e-06,-4e-06,-1.3e-05,-4.3e-05,-5e-06,6.3e-05,5.7e-05,9e-06,5e-06,-2e-06,-7e-06,-4e-06,-2e-06,-4e-06,-7e-06
