1e-05,1.3e-05,4e-05,1.8e-05,5e-06,9e-06,9e-06,3.5e-05,1.9e-05,1.5e-05,1.8e-05,3e-06,6e-06,1.8e-05,2.8e-05,4.1e-05,2e-05,3.2e-05,2.8e-05,2e-06,3e-06,4.4e-05,3.3e-05,4.5e-05,2e-06,2.5e-05,2.8e-05,4.4e-05,3.1e-05,1.5e-05,4e-06,7.9e-05,2.7e-05,5e-06,6.8e-05,0.000137,0.000129,0.00032,0.000988,6.6e-05,0.000751,3.2e-05,0.001296,0.000862,0.000208,0.000696,0.000238,0.000414,0.000355,0.00067,0.000345,0.000402,0.000383,0.000134,0.000286,6.1e-05,0.00083,0.000742,0.000167,0.000226,7.9e-05,0.000189,0.00049,0.000462,3e-06,0.000228,0.000101,0.000144,0.000247,0.000151,0.000117,0.000317,0.000456,2e-05,2.4e-05,0.000286,5.1e-05,0.000117,7.5e-05,0.000124,0.000157,2.2e-05,0.000158,0.000107,3.3e-05,9.5e-05,9.4e-05,5e-06,0.000155,0.00013,7.8e-05,0.000124,1.7e-05,2.1e-05,3.6e-05,7.5e-05,9.6e-05,2.8e-05,5e-05,0.000172,0.000302,0.000108,2e-05,0.000243,6.2e-05,0.000173,3.1e-05,0.000183,4e-06,0.000109,7.1e-05,3.4e-05,7.1e-05,3.5e-05,5.1e-05,7.7e-05,3.1e-05,8.5e-05,7.1e-05,4e-06,9.7e-05
3.1e-05,5.6e-05,5.2e-05,8.3e-05,8.8e-05,6.4e-05,4.8e-05,9.6e-05,0.000107,3.6e-05,3.2e-05,5.2e-05,4.9e-05,7e-05,9.2e-05,2.7e-05,9.3e-05,6.1e-05,9.4e-05,7.2e-05,4.9e-05,8.7e-05,0.000142,5.8e-05,6.1e-05,0.000137,6.7e-05,0.000161,0.000171,8.8e-05,8.9e-05,0.000113,0.000104,0.000233,0.00028,0.000296,6.8e-05,0.000581,0.002219,0.00128,0.00195,0.000932,0.001492,0.002705,0.002359,0.001712,0.002042,0.000754,0.001721,0.002121,0.000803,0.001538,0.000528,0.000939,0.000205,0.000177,0.001849,0.001018,0.000515,0.000232,0.000707,0.000948,0.000828,0.000502,0.000201,0.000605,0.000457,0.000422,0.000361,0.000306,0.000628,0.000486,0.001079,0.000701,0.000415,0.000702,0.000592,0.000496,0.000486,0.000369,0.00053,0.000473,4e-04,0.000583,0.000476,0.000401,0.000417,0.000371,0.000353,0.000536,0.000356,0.000386,0.00038,0.000326,0.000156,0.00013,0.000291,0.000255,0.000225,0.000864,0.001263,0.000994,0.000489,0.000627,0.000475,0.000412,0.000379,0.000253,0.000314,0.000342,0.000355,0.000286,0.000239,0.000262,0.000214,0.000238,0.000161,0.000175,0.00029,0.000253,0.000235
3.6e-05,3.5e-05,3.7e-05,6e-05,2.1e-05,2.8e-05,2.6e-05,5.3e-05,4.3e-05,6.1e-05,3.3e-05,6.9e-05,2.3e-05,5.9e-05,1.7e-05,2.3e-05,8.1e-05,2.9e-05,3.4e-05,4.6e-05,1.1e-05,3.5e-05,4.5e-05,5.7e-05,3.8e-05,0.000134,0.000249,0.000166,8.5e-05,5.1e-05,5.7e-05,0.000193,0.00033,0.000236,0.000312,0.000396,0.000466,0.000458,0.001962,0.002212,0.003452,0.002187,0.001539,0.000352,0.000995,0.000396,0.000633,0.001012,0.001495,0.001529,0.001338,0.001293,0.000908,0.000477,0.000838,0.000529,0.002384,0.002411,0.000418,0.000495,0.00023,0.001717,0.001834,0.000315,6e-04,0.000838,0.001072,0.000799,0.001024,0.000441,0.000381,0.000304,0.000116,0.000172,0.000191,0.000601,0.000373,0.000248,0.00032,0.000137,0.000207,8.7e-05,0.000165,0.000247,0.00012,0.000119,0.000174,0.00023,0.000121,0.00021,6.4e-05,0.000106,0.000124,0.000128,0.00012,0.000156,5.2e-05,0.000251,0.000643,0.001007,0.000667,0.000273,0.000164,0.000496,0.000221,1.1e-05,0.000135,3e-05,9.7e-05,0.000174,3.8e-05,0.000143,4e-05,0.000112,9.5e-05,5.6e-05,5.2e-05,4.4e-05,0.000101,9.6e-05,1.9e-05
1.3e-05,5.8e-05,7.2e-05,6.9e-05,6.8e-05,4.8e-05,2.8e-05,6.6e-05,2.9e-05,3.4e-05,2.3e-05,2.5e-05,4.7e-05,8.8e-05,9e-05,7.2e-05,6.3e-05,7e-05,5.7e-05,4.7e-05,5.5e-05,3.7e-05,6.4e-05,6.7e-05,2.6e-05,0.000159,0.000474,0.000226,0.00012,4.1e-05,6.7e-05,0.000231,0.000425,0.00038,0.000307,9.9e-05,0.000116,0.000233,0.002691,0.002863,0.001229,0.001252,0.001131,0.000591,0.00073,0.000696,0.000501,0.001737,0.000505,9.2e-05,0.000813,0.000963,0.000755,0.000286,0.000302,0.000227,0.001814,0.001635,0.000312,0.000468,0.000935,0.001328,0.000839,0.001711,0.000497,0.000284,0.000254,0.000444,0.00084,0.000447,0.000185,0.000143,0.000819,0.000239,0.000586,0.00057,0.000322,0.000322,0.000612,0.000379,0.000218,0.000193,7.5e-05,0.000158,3e-04,0.000168,0.000123,1.8e-05,4.4e-05,2.5e-05,0.000156,8e-05,4.7e-05,7.4e-05,7.5e-05,5.7e-05,5.9e-05,0.000301,0.000366,0.000717,0.000223,0.00031,9.9e-05,0.000313,0.000337,0.000142,0.000121,6.8e-05,1.5e-05,7.3e-05,6.7e-05,9.9e-05,2.7e-05,3.3e-05,8.6e-05,7.2e-05,4e-05,4e-05,5.2e-05,8.4e-05,3e-05
1.1e-05,5e-05,2.8e-05,1.8e-05,2.3e-05,2.1e-05,1.9e-05,5.4e-05,8e-06,4.4e-05,2.3e-05,2.4e-05,1e-05,6.4e-05,6.4e-05,4e-06,1.1e-05,2.3e-05,2.8e-05,5.2e-05,1.8e-05,3.8e-05,4.6e-05,3.7e-05,2.5e-05,0.000178,4e-04,0.000154,8.9e-05,1.1e-05,3.1e-05,0.000112,0.000461,0.000247,1e-04,9.2e-05,0.000189,0.000235,0.003349,0.000949,0.001635,0.002821,0.002806,0.000651,0.000834,0.000295,0.00052,0.002669,0.001592,0.000953,0.000954,0.002704,0.00116,0.001301,0.000463,0.001104,0.001401,0.003287,0.000728,0.001359,0.001377,0.000852,0.000206,0.000834,0.000729,0.000445,0.001034,0.000319,0.000842,0.000352,0.000658,0.000119,0.001066,0.000701,0.000979,0.001126,0.000814,0.000608,0.000372,0.000131,9.6e-05,0.000253,9.6e-05,4.7e-05,0.000212,0.000161,0.000179,4.5e-05,0.000137,5e-05,0.00012,1.7e-05,8.4e-05,5.5e-05,4.7e-05,5.2e-05,9.4e-05,0.000237,0.000352,0.000732,4e-04,0.000107,0.000168,0.000215,0.000312,0.000134,7.3e-05,3.4e-05,3e-06,9.4e-05,6.3e-05,6e-05,9e-06,2.2e-05,5e-06,3.4e-05,5.9e-05,1.8e-05,2.8e-05,8e-05,1.3e-05
4.4e-05,5e-05,7.4e-05,4.7e-05,2.7e-05,5e-05,4.1e-05,9e-05,5.8e-05,9.4e-05,0.000115,0.000105,2.7e-05,6.3e-05,0.000123,9.6e-05,5.6e-05,4.3e-05,6.5e-05,9.5e-05,7.4e-05,9.5e-05,0.000123,0.000117,0.000102,0.000229,0.000227,0.000168,0.00014,8.5e-05,7.6e-05,0.000421,0.000353,0.000354,0.000268,0.000195,0.000264,0.000262,0.004242,0.002462,0.001904,0.002085,0.001472,3.2e-05,0.000319,0.002043,0.001123,0.004431,0.00133,0.000192,0.001197,0.002823,0.00153,0.001753,0.002017,0.000851,0.001924,0.003041,0.003155,0.001014,0.000803,0.002234,0.001183,0.001672,0.001419,0.001478,0.002449,0.002164,0.00025,0.000328,0.001033,0.001087,0.00037,9.2e-05,0.001351,0.000406,0.000175,0.00023,0.000262,0.000173,0.000112,0.000307,0.000252,0.000232,1.5e-05,0.000201,0.000165,0.000128,0.000194,0.000217,0.000156,9.6e-05,0.000101,8.3e-05,7.9e-05,9.6e-05,0.000144,0.000195,8.4e-05,0.000381,0.000258,0.000346,0.000191,5.4e-05,4.6e-05,3.3e-05,5.7e-05,1e-05,2.3e-05,8.7e-05,2.7e-05,5.7e-05,1.1e-05,3.2e-05,2.4e-05,3.7e-05,5.7e-05,2.3e-05,5.7e-05,8.5e-05,7e-05
6.2e-05,5.3e-05,6.3e-05,7.7e-05,7.4e-05,6.6e-05,2.3e-05,8.8e-05,7e-05,0.000119,0.000118,6.9e-05,0.000147,0.000155,0.000178,0.000134,6.5e-05,5.6e-05,7.3e-05,0.000101,7.2e-05,5.1e-05,9e-05,6.6e-05,9.6e-05,8.9e-05,0.000537,0.000231,5.6e-05,7e-05,2.9e-05,0.00072,0.000719,0.000756,0.000624,0.000198,0.000128,0.000159,0.004918,0.002362,0.003553,0.002343,0.005378,0.002289,0.000836,0.0032,0.000471,0.005442,0.002435,0.001111,0.000388,0.002803,0.002514,0.000859,0.000704,0.001503,0.00378,0.002591,0.003749,0.003061,0.001841,0.00457,0.004113,0.004258,0.000747,0.001034,0.001082,0.00167,0.001071,0.000659,0.000692,0.000972,0.001397,0.000791,0.000806,0.000194,9.3e-05,0.000268,0.00011,0.000262,0.000234,0.000144,6.8e-05,0.000201,0.000204,0.000141,0.000137,2.1e-05,0.00013,0.000279,0.00016,5.5e-05,8.9e-05,6.7e-05,4.1e-05,5.1e-05,6.3e-05,0.000106,0.000187,0.000193,0.000168,0.000205,0.000129,0.000165,0.000195,0.000137,0.000108,1.7e-05,5.1e-05,5.9e-05,1.9e-05,3.6e-05,7e-06,2.3e-05,4.5e-05,2.9e-05,2.2e-05,6.7e-05,5.9e-05,2e-05,5.7e-05
0.000139,6.8e-05,6.3e-05,2.6e-05,4.3e-05,3.9e-05,3.9e-05,4e-05,8e-06,7.3e-05,3e-06,2e-05,0.000141,3e-05,5.4e-05,9.1e-05,4.2e-05,1.9e-05,6.5e-05,1.5e-05,2.5e-05,5.4e-05,6.2e-05,3.5e-05,4.6e-05,0.000125,0.000553,0.000239,0.000146,6.2e-05,3.8e-05,0.000816,0.001994,0.000656,0.000192,0.000542,0.000359,0.000275,0.005175,0.003191,0.004425,0.002546,0.003278,0.005652,0.003979,0.00391,0.004361,0.00339,0.006241,0.00496,0.001652,0.003161,0.003469,0.003996,0.003882,0.003517,0.002675,0.004142,0.003828,0.002177,0.001175,0.003266,0.003772,0.003903,0.005101,0.002501,0.00154,0.001071,0.001123,0.000311,0.001125,0.000361,0.000652,0.000216,0.000658,0.001648,0.001099,0.000513,0.000142,0.00038,0.000147,0.000227,0.00017,0.000215,2e-05,9.7e-05,5.4e-05,0.000147,0.000132,0.000269,7.9e-05,3e-05,3.7e-05,0.000106,7.2e-05,3.8e-05,0.000138,0.000216,0.000244,0.000157,4e-05,0.000252,0.000101,0.000215,0.000177,1.9e-05,4.9e-05,5.7e-05,5.4e-05,0.000257,0.000125,1.8e-05,2.2e-05,5.4e-05,1.9e-05,5.1e-05,5.3e-05,0.00015,0.000104,2.7e-05,4.1e-05
0.000378,0.000144,8.1e-05,4.9e-05,8.1e-05,9e-06,3.4e-05,3.5e-05,3.8e-05,2.1e-05,1.1e-05,3.3e-05,0.000111,8.1e-05,9.4e-05,0.000113,8.8e-05,5.8e-05,6.5e-05,3.1e-05,2.5e-05,6.5e-05,4.8e-05,4.2e-05,3.3e-05,8.4e-05,4e-04,0.000685,0.000484,0.000285,0.000161,0.000621,0.002224,0.001831,0.000813,0.000174,9.4e-05,0.000105,0.005474,0.007905,0.004374,0.004648,0.004641,0.004368,0.000663,0.007504,0.005618,0.006444,0.007837,0.004087,0.001488,0.003281,0.001109,0.002378,0.001774,0.000713,0.003494,0.005852,0.002974,0.001091,0.000818,0.003069,0.000994,0.001896,0.003326,0.002914,0.002631,0.001936,0.002844,0.001682,0.000532,0.001241,0.00062,0.000116,0.000552,0.000625,0.000461,0.001079,0.000848,0.000625,0.00045,0.000368,0.000179,0.000142,0.00025,0.000194,0.000262,4.8e-05,1.4e-05,0.000337,0.000211,0.000109,0.000197,6.7e-05,0.000145,5.3e-05,0.000169,9.3e-05,0.000158,0.000429,0.000206,0.000442,5.9e-05,0.000286,0.000403,0.000277,0.000141,3.8e-05,5.5e-05,0.000256,0.000185,9.2e-05,7.1e-05,9.4e-05,3e-05,2.2e-05,2.7e-05,0.000147,8.2e-05,8.1e-05,4.1e-05
0.000479,0.000354,9.3e-05,1.8e-05,4.2e-05,5e-05,4.3e-05,2.3e-05,4e-05,3.6e-05,1.3e-05,2.7e-05,0.000126,8.6e-05,0.000115,0.000183,0.000198,6.4e-05,5.4e-05,7.7e-05,3.8e-05,6.3e-05,5.7e-05,9e-06,1.8e-05,9.4e-05,0.00061,0.00094,0.000438,0.000209,5.8e-05,0.000412,0.001407,0.000652,0.000626,0.000609,0.000147,0.00028,0.005816,0.008786,0.002945,0.003562,0.000802,0.002323,0.002751,0.008299,0.004018,0.004043,0.003298,0.001109,0.001588,0.000828,0.001043,0.002259,0.001709,0.001662,0.00214,0.002492,0.002317,0.002275,0.002209,0.003001,0.002272,0.001762,0.001011,0.001406,0.002313,0.001329,0.001298,0.000896,0.001208,0.000631,0.000812,0.000335,0.000399,0.00032,0.000873,0.001616,0.000673,0.000278,0.000283,0.000138,0.000103,0.000101,0.000313,0.000244,0.000194,0.000341,0.000234,0.000326,0.000217,5.1e-05,0.000233,0.000178,5.9e-05,8.8e-05,0.000131,0.000257,0.000572,0.000524,0.000333,0.000447,0.000471,0.000497,0.00079,0.000365,0.00013,8.2e-05,0.000132,3.8e-05,7e-05,8.7e-05,1.9e-05,4.3e-05,7.6e-05,6.1e-05,5.3e-05,0.000145,0.000181,6.6e-05,3.7e-05
0.000363,0.00012,8.6e-05,5.8e-05,3.6e-05,3.3e-05,2.1e-05,4.7e-05,1.6e-05,2.2e-05,1.9e-05,1.9e-05,0.000138,0.000141,2.9e-05,0.000125,5.5e-05,7.9e-05,4.6e-05,5.4e-05,3.7e-05,6.4e-05,5.4e-05,5.2e-05,2.8e-05,8.1e-05,0.000677,0.000524,0.000261,0.000113,4.5e-05,0.000285,0.000689,0.000323,0.001365,0.001473,0.001158,0.000863,0.004817,0.005937,0.005088,0.002342,0.004482,0.004598,0.002795,0.00508,0.003989,0.001855,0.001955,0.000718,0.001084,0.001849,0.000917,0.002054,0.002397,0.002028,0.001649,0.001871,0.00122,0.001056,0.00083,0.002386,0.001809,0.000179,0.00048,0.000627,0.001109,0.001125,0.000301,0.000192,3e-05,0.000234,0.000924,0.000106,0.000354,0.000463,0.000673,0.000961,0.000576,0.000278,4.3e-05,0.000199,3.1e-05,0.000234,0.000196,0.000149,8.5e-05,0.000204,8e-05,0.000113,0.000142,0.000139,0.000279,0.000215,7.9e-05,5.8e-05,0.000136,0.000268,0.000545,0.000938,0.000712,0.000494,0.000515,0.00021,0.000549,0.000321,0.000156,4.3e-05,8.1e-05,0.000157,0.00013,5.4e-05,5.3e-05,2.6e-05,4.2e-05,1.2e-05,2.2e-05,0.000144,0.000114,1e-04,7.2e-05
8.2e-05,6.6e-05,3.9e-05,1.2e-05,3e-06,1.5e-05,7e-06,2.2e-05,1.1e-05,9e-06,2e-05,3.8e-05,0.000124,1.9e-05,2.9e-05,3.2e-05,4.1e-05,1.6e-05,8e-06,2.8e-05,8e-06,3.4e-05,6e-06,1.3e-05,2.4e-05,3.6e-05,0.00046,9.1e-05,8.1e-05,3e-05,5.2e-05,0.000337,0.000278,0.001044,0.000853,0.000468,0.000123,0.000107,0.003894,0.003643,0.001765,0.001375,0.001436,0.000469,0.000974,0.001811,0.00161,0.000931,4e-04,0.000691,0.000634,0.001099,0.001169,0.000848,0.001118,0.001371,0.001958,0.000995,0.001416,0.001787,0.001689,0.00236,0.001393,0.001704,0.001213,0.001515,0.001214,0.001121,0.000792,0.000107,0.000424,0.000188,0.000526,0.000442,0.000607,0.000309,0.000733,0.000352,0.000134,0.000174,0.000146,7.4e-05,0.000159,0.000262,6.7e-05,8.7e-05,5.5e-05,0.000129,8.8e-05,0.000119,7e-05,6.4e-05,0.000136,1.9e-05,3.8e-05,4.9e-05,8.9e-05,8.6e-05,0.000224,0.00035,3.5e-05,0.000346,0.000142,0.000167,9.4e-05,5.6e-05,4e-05,1.9e-05,4.8e-05,0.000121,3.3e-05,2.5e-05,3.4e-05,3.8e-05,1.7e-05,2.1e-05,8e-06,7e-05,1.3e-05,4.4e-05,2.6e-05
0.00012,4.4e-05,1.3e-05,8e-06,1.2e-05,6e-06,9e-06,8e-06,5e-06,6e-06,2.1e-05,2.4e-05,2.3e-05,2.6e-05,4.1e-05,4.6e-05,3.1e-05,7e-06,1.3e-05,1.9e-05,1e-05,1.3e-05,8e-06,8e-06,1.6e-05,2.2e-05,9.7e-05,0.000107,9e-06,1.5e-05,4.4e-05,0.000247,0.000569,0.000657,0.000409,0.000247,0.000261,0.000213,0.003426,0.001003,0.002051,0.000634,0.001558,0.00228,0.0011,0.001847,0.001981,0.002581,0.002826,0.000399,0.000593,0.001106,0.00233,0.001185,0.001703,0.001383,0.000199,0.0013,0.001712,0.002173,0.000622,0.00161,0.001871,0.001516,0.001769,0.000269,0.001168,0.000869,0.001035,7.5e-05,0.00053,0.000312,0.000697,0.000355,0.000878,0.000434,0.000954,0.000733,7.5e-05,2.8e-05,0.000151,7.5e-05,0.000185,0.000244,7.8e-05,8.1e-05,0.000106,9.5e-05,6.8e-05,4.3e-05,4.6e-05,5.4e-05,4.5e-05,3.6e-05,4.4e-05,3.1e-05,8e-05,0.000105,0.00021,6.2e-05,2.6e-05,0.000206,4e-05,0.000157,0.000134,6.7e-05,1.7e-05,1.9e-05,5.6e-05,1e-05,6e-05,2.4e-05,9e-06,1e-05,1.3e-05,5e-06,1e-05,1.8e-05,2.9e-05,3e-05,1.9e-05
2.2e-05,4.1e-05,1.8e-05,7e-06,9e-06,8e-06,7e-06,2e-05,3e-06,6e-06,5e-06,2.7e-05,5.3e-05,3.9e-05,3.8e-05,3.7e-05,3e-05,4.8e-05,3.6e-05,1.9e-05,1e-05,1.3e-05,9e-06,2.4e-05,1.2e-05,3.1e-05,0.00028,0.000146,3.3e-05,1.2e-05,3.4e-05,5.4e-05,0.001052,0.001189,0.000309,0.000385,2e-04,0.000241,0.002889,0.003339,0.004019,0.001559,0.002555,0.001992,0.002131,0.002737,0.005649,0.002245,0.004868,0.00204,0.000419,0.001217,0.000985,0.001835,0.002736,0.003785,0.003156,0.001588,0.001783,0.0016,0.001341,0.000672,0.001554,0.001935,0.00198,0.002011,0.001051,0.001103,0.001009,0.00011,0.00046,0.00065,0.001047,0.000444,0.000802,0.001133,0.000911,0.000315,0.000352,4.5e-05,0.000267,7.7e-05,0.000254,0.000318,0.000211,0.000101,0.000136,0.000131,7.7e-05,0.000159,6.7e-05,2.7e-05,3.9e-05,4.4e-05,6.4e-05,6.5e-05,5.7e-05,7e-05,0.000215,2e-04,4.1e-05,0.000462,0.000214,0.000143,0.000102,3e-05,5e-05,3.8e-05,2e-05,8.1e-05,4.3e-05,1.2e-05,1.7e-05,1.8e-05,1.2e-05,8e-06,6e-06,3.8e-05,3e-05,2.4e-05,1.9e-05
5.7e-05,4.4e-05,1e-05,4e-06,7e-06,1.1e-05,1.1e-05,2.9e-05,1.4e-05,7e-06,2.2e-05,2.2e-05,3.7e-05,3.2e-05,4.1e-05,3.5e-05,1.4e-05,2.4e-05,1e-05,1.5e-05,1.8e-05,2.1e-05,2.3e-05,2.7e-05,2.4e-05,3.4e-05,0.000234,7.8e-05,2.4e-05,1e-05,2.4e-05,0.00011,0.001076,0.00134,0.00065,0.00019,0.000156,8.6e-05,0.002062,0.00302,0.003246,0.002811,0.003488,0.004715,0.003413,0.002658,0.006985,0.004574,0.005924,0.003713,0.000983,0.002151,0.004777,0.005743,0.004037,0.002764,0.003887,0.002828,0.002339,0.003348,0.001545,0.002889,0.003282,0.004715,0.004531,0.001495,0.001887,0.001609,0.001179,0.000829,0.000738,0.000979,0.001371,0.000115,0.00079,0.00141,0.000896,7e-04,0.00039,0.000122,0.000246,0.000137,0.000268,0.000279,0.000183,0.000214,0.000246,0.00017,4.7e-05,0.000148,0.000103,8.9e-05,5.8e-05,7.3e-05,7.9e-05,4e-05,0.000127,3.8e-05,0.000259,0.000102,7e-05,0.000735,0.000357,0.000209,5e-05,4.7e-05,2.4e-05,3.3e-05,7.9e-05,8.7e-05,3.6e-05,2.1e-05,7e-06,1.4e-05,1.9e-05,4e-06,1.2e-05,3.1e-05,2.5e-05,2.3e-05,6e-06
7.4e-05,4.8e-05,2.9e-05,2.6e-05,1.8e-05,2.2e-05,1.1e-05,3.1e-05,3.1e-05,1.7e-05,1.7e-05,2.8e-05,7.7e-05,3.4e-05,5.4e-05,7.9e-05,2.5e-05,4.3e-05,8e-06,4.2e-05,7e-06,6e-06,1.2e-05,7e-06,1.1e-05,3.9e-05,5e-05,7.3e-05,5.1e-05,5.4e-05,3.6e-05,0.000148,0.001259,0.002473,0.00224,0.000798,0.000308,0.000293,0.001138,0.003518,0.004281,0.001797,0.005015,0.007547,0.00535,0.001833,0.005926,0.003592,0.002755,0.002255,0.004802,0.001888,0.00841,0.0045,0.001791,0.004215,0.00937,0.00488,0.005372,0.002352,0.006419,0.004707,0.008917,0.006401,0.00332,0.005998,0.002449,0.004885,0.004544,0.000715,0.000793,0.001737,0.002327,0.000329,0.001051,0.002754,0.00281,0.00178,0.001382,0.000105,0.000596,0.000526,0.000211,0.000629,0.000791,0.000727,0.000103,0.000465,0.000129,0.000276,0.000163,0.000135,0.00011,0.000329,0.000174,4.4e-05,0.000268,0.00016,0.000377,0.000238,0.000105,0.000966,0.000564,0.000276,2.3e-05,3.9e-05,6e-05,1.9e-05,0.000117,6.2e-05,3.2e-05,3.6e-05,4.2e-05,3.1e-05,3.9e-05,4.1e-05,8e-06,2.2e-05,3.4e-05,3e-05,2.7e-05
7.4e-05,4e-06,1.1e-05,1.9e-05,5e-06,9e-06,9e-06,2.5e-05,2.1e-05,1.1e-05,7e-06,2.9e-05,0.000139,5.6e-05,6e-05,5.9e-05,6.9e-05,0.000107,2.9e-05,5.6e-05,3.3e-05,1.5e-05,8e-06,5e-06,8e-06,5.6e-05,0.00016,9.2e-05,1.8e-05,4.7e-05,9e-05,6.7e-05,0.0017,0.001001,0.000374,0.000567,0.00052,0.000446,0.000837,0.003552,0.008483,0.008972,0.005947,0.004896,0.011135,0.008031,0.003148,0.00632,0.001582,0.007378,0.009386,0.008143,0.004031,0.011053,0.012709,0.009545,0.008453,0.010984,0.007255,0.004906,0.007173,0.006167,0.004315,0.004105,0.005246,0.009819,0.010898,0.011203,0.012573,0.009592,0.003662,0.002686,0.005013,0.00439,0.00065,0.004579,0.006566,0.00381,0.002922,0.002167,0.000314,0.000947,0.000879,1.8e-05,0.000895,0.00056,0.000776,0.001103,0.000751,0.000256,0.000584,0.00059,0.00024,0.000476,0.000497,0.00036,0.000447,0.000208,0.000216,0.000147,0.000111,0.001076,0.000835,0.000431,5.1e-05,4.9e-05,8.8e-05,3.3e-05,7.4e-05,6.9e-05,7.9e-05,5.7e-05,2.8e-05,1.2e-05,3.8e-05,1.8e-05,1.9e-05,3.3e-05,5e-06,2.7e-05,2.8e-05
0.000118,5.6e-05,3.5e-05,2.7e-05,1.6e-05,8e-06,7e-06,2.9e-05,2.9e-05,1.9e-05,1.4e-05,2.1e-05,0.000121,0.000104,8.8e-05,6e-05,2.5e-05,8.1e-05,7.9e-05,9.2e-05,4.6e-05,2.1e-05,8e-06,1.3e-05,1.7e-05,3.6e-05,0.000171,4.9e-05,8e-06,4e-05,5e-05,4.4e-05,0.0022,0.001566,0.001231,0.001168,5e-04,0.000396,0.001105,0.001322,0.006524,0.009073,0.009252,0.010352,0.005274,0.005684,0.003185,0.005729,0.009001,0.009552,0.009587,0.008149,0.008982,0.004637,0.004721,0.002399,0.003694,0.005134,0.005747,0.00787,0.009307,0.006716,0.006171,0.003605,0.007477,0.006411,0.002461,0.005101,0.003804,0.005777,0.004042,0.000575,0.004608,0.005625,0.006411,0.00686,0.002388,0.003138,0.001152,0.000683,0.001055,0.000938,0.000578,0.00035,0.000426,0.000399,0.000634,0.000451,0.000381,0.000616,0.00069,0.000305,0.000145,0.000369,0.000259,9.2e-05,0.000335,0.000338,0.000227,5.1e-05,0.00013,0.000898,0.000497,0.000301,0.000122,4e-05,6.9e-05,6.3e-05,3.3e-05,0.000121,6.5e-05,2e-05,5.7e-05,1.4e-05,5e-05,5.4e-05,3.9e-05,3.1e-05,1.6e-05,1.4e-05,6e-06
9.5e-05,5.2e-05,3.7e-05,1.9e-05,1.5e-05,6e-06,1.1e-05,3.3e-05,3.4e-05,1.9e-05,2.1e-05,1.4e-05,7.3e-05,3.5e-05,6e-05,5.6e-05,3.6e-05,5.1e-05,5.3e-05,2.7e-05,2.9e-05,2.3e-05,3.2e-05,4e-05,4.4e-05,6.8e-05,0.000105,3.7e-05,2.5e-05,5.9e-05,4.9e-05,4.8e-05,0.002139,0.000584,0.002122,0.001519,0.000668,0.000314,0.001707,0.001239,0.004647,0.002752,0.002645,0.001261,0.002898,0.00203,0.002395,0.0046,0.002723,0.004781,0.000958,0.004415,0.001085,0.000398,0.003963,0.005718,0.004298,0.001297,0.005523,0.004196,0.003145,0.00399,0.001757,0.003993,0.002745,0.001254,0.00197,0.000484,0.003696,0.000813,0.000413,0.00071,0.002936,0.00062,0.0028,0.000569,0.001529,0.00106,0.001245,0.000111,0.00036,8.7e-05,0.000433,0.000301,0.000233,0.000149,9.2e-05,0.00061,0.000312,0.000687,0.000105,5.9e-05,6.4e-05,0.000245,9.3e-05,5.2e-05,0.000133,0.000207,0.000303,0.000277,0.000112,0.000755,0.000346,0.000157,0.000126,3.3e-05,3.9e-05,9e-06,6.3e-05,7e-05,3.8e-05,9e-06,7.2e-05,8.6e-05,5.6e-05,2e-05,3.2e-05,4.3e-05,3.2e-05,2.5e-05,1.9e-05
6e-06,1.7e-05,1.3e-05,3.2e-05,1.7e-05,1.3e-05,7e-06,1.9e-05,1e-05,1.8e-05,1.2e-05,3.7e-05,2.5e-05,1.7e-05,9.2e-05,3.9e-05,1.3e-05,1.4e-05,1.4e-05,4.8e-05,2.4e-05,9e-06,2.1e-05,2.1e-05,2.1e-05,4.7e-05,4.1e-05,1e-05,3.2e-05,4.9e-05,5.7e-05,6.6e-05,0.001651,0.001532,0.002363,0.00111,3e-04,9.7e-05,0.001385,0.001324,0.000889,0.002435,0.000479,0.00117,0.001054,0.000852,0.000793,0.001466,0.001747,0.003275,0.002368,0.00237,0.003183,0.002382,0.001116,0.004697,0.002481,0.000764,0.002825,0.001082,0.001904,0.002999,0.001728,0.002309,0.003173,0.002499,0.002242,0.001631,0.002077,0.001131,0.001173,0.001924,0.000845,0.000755,0.001493,0.001476,0.001545,0.000976,0.000899,0.000651,0.000741,0.000619,3.1e-05,9.7e-05,0.000171,0.000208,0.000231,0.000623,0.000426,0.000297,0.000186,0.000112,0.000145,3.7e-05,9.9e-05,5e-05,0.000126,7.8e-05,0.000306,8.5e-05,6.9e-05,0.000601,0.000288,4e-05,2.7e-05,8.2e-05,6.3e-05,7.7e-05,1.9e-05,6.2e-05,6.7e-05,4.7e-05,0.000107,9.7e-05,5.3e-05,9e-06,3e-05,4e-05,5e-06,1.8e-05,5e-06
3.3e-05,1.8e-05,1.6e-05,1.2e-05,5e-06,2e-06,5e-06,8e-06,1.2e-05,6e-06,1e-05,3.2e-05,2.8e-05,2.3e-05,7e-05,4e-05,2.9e-05,1.5e-05,2.2e-05,2e-05,2.3e-05,8e-06,2.1e-05,1.2e-05,1.7e-05,5e-05,6.2e-05,3.4e-05,1e-05,5.5e-05,3e-05,4.7e-05,0.000961,0.000315,0.001177,0.000314,5.7e-05,6.7e-05,0.000939,0.001005,0.000524,0.001495,0.00109,0.001383,0.000539,0.000367,0.002608,0.001733,0.000543,0.000947,0.001822,0.002271,0.000607,0.002032,0.000846,0.003585,0.001676,0.00087,0.00065,0.001458,0.002073,0.002843,0.001862,0.000479,0.002181,0.000577,0.001031,0.001146,0.000862,0.000712,0.001174,0.001624,0.000185,0.000714,0.001422,0.000984,0.000463,0.000837,9.6e-05,0.000197,0.000158,0.000311,0.000238,0.000227,0.000327,0.000165,0.000314,0.000279,0.000114,0.000134,0.000206,0.000159,0.000201,0.000183,4.3e-05,5.2e-05,0.000146,7.6e-05,0.000225,0.000132,8.8e-05,0.000465,0.000275,0.000135,5.7e-05,9.7e-05,8e-05,6.7e-05,5.8e-05,6e-05,1e-05,1.4e-05,7.6e-05,3.8e-05,2.5e-05,1.3e-05,3e-05,2.3e-05,6e-06,9e-06,6e-06
3.3e-05,2.2e-05,2.6e-05,1.5e-05,6e-06,3e-06,1.2e-05,8e-06,9e-06,1.9e-05,1.4e-05,1e-05,2.9e-05,8e-06,1.6e-05,4.1e-05,2.2e-05,3.8e-05,2e-05,2.5e-05,1.9e-05,9e-06,1.4e-05,4e-06,1.5e-05,5e-05,8.2e-05,2.2e-05,1.3e-05,2.9e-05,3.2e-05,5.3e-05,0.000701,0.000716,0.000627,0.000323,0.000243,5.8e-05,0.000553,0.001046,0.000486,0.001424,0.000587,0.00072,0.000654,0.000195,0.0028,0.000328,0.000937,0.001078,0.001622,0.00195,0.001825,0.000321,0.001358,0.000699,0.001578,0.000745,0.00177,0.001916,0.000521,0.000884,0.001242,0.001409,0.001248,0.000846,0.000463,0.000374,0.00085,0.000675,0.000718,0.001708,0.002259,0.000569,0.001154,0.000415,0.000376,0.00037,0.000382,0.000127,0.000205,0.000185,3.3e-05,0.000247,4.6e-05,9.7e-05,0.000149,0.000239,6.6e-05,6.9e-05,0.000196,3.4e-05,7.6e-05,7.4e-05,9.4e-05,0.000106,5.3e-05,1.3e-05,4.6e-05,4.2e-05,7.1e-05,3e-04,0.000185,0.000153,9e-05,8e-06,5e-05,3e-05,2.3e-05,5.7e-05,4.4e-05,1.3e-05,4.8e-05,3.7e-05,5e-06,2.5e-05,6e-06,1.6e-05,1.4e-05,1.2e-05,2.1e-05
1.3e-05,2e-06,7e-06,3e-06,2e-06,2e-06,5e-06,2e-06,6e-06,8e-06,2e-06,5e-06,2e-06,8e-06,1.3e-05,1.1e-05,6e-06,7e-06,2e-06,3e-06,8e-06,4e-06,2e-06,2e-06,4e-06,2.7e-05,2.8e-05,1.2e-05,1.2e-05,1.3e-05,1.2e-05,2.9e-05,0.000367,0.000202,0.000305,0.000132,0.000127,0.000106,0.000406,0.000132,0.000281,0.000359,0.000345,0.000267,0.000338,0.00018,0.000608,0.000467,0.000953,0.000841,0.000854,0.000825,0.000548,0.000255,0.00066,0.000232,0.001336,0.000656,0.000497,0.001484,0.000747,0.000345,0.000385,0.000729,0.000177,0.000424,0.000569,0.000545,0.000541,0.000374,0.00024,0.000175,0.000562,0.000399,0.000397,0.000313,0.000243,4.1e-05,4.6e-05,3.9e-05,8.3e-05,3.7e-05,6.6e-05,1e-04,8.1e-05,4.3e-05,2.7e-05,4.3e-05,4.4e-05,3e-05,4.7e-05,4e-05,1.1e-05,2.9e-05,4e-06,3.2e-05,5.3e-05,3.7e-05,6.1e-05,4.7e-05,4e-06,6.9e-05,5e-05,2.1e-05,1e-05,8e-06,2.2e-05,1.9e-05,2.6e-05,1.6e-05,8e-06,1e-05,2.6e-05,9e-06,7e-06,1.1e-05,9e-06,5e-06,4e-06,2e-06,8e-06
8e-06,3e-06,3e-06,3e-06,1e-06,1e-06,3e-06,1e-06,4e-06,5e-06,2e-06,6e-06,3e-06,7e-06,1.5e-05,8e-06,3e-06,4e-06,3e-06,7e-06,1e-06,2e-06,2e-06,2e-06,2e-06,1.9e-05,1.8e-05,4e-06,4e-06,1.2e-05,6e-06,2.4e-05,0.000311,0.000281,8.1e-05,0.000185,9.3e-05,9.3e-05,0.000488,0.000847,0.000289,0.000624,0.000223,0.000585,0.00015,0.000505,0.000619,0.000607,0.000714,0.000497,0.000427,0.000596,0.000433,0.000619,0.000535,0.000875,0.000239,0.00053,4.9e-05,0.000746,0.000371,0.000261,0.000104,0.000389,0.000375,0.000222,0.000559,0.000148,0.000384,4.2e-05,0.000243,0.000106,0.000324,7.6e-05,0.000289,0.000158,0.000207,3.5e-05,6.7e-05,1.2e-05,7.5e-05,1.8e-05,1.2e-05,8.8e-05,2.6e-05,6.1e-05,1.9e-05,4.8e-05,5.4e-05,4.1e-05,2.3e-05,4e-06,1.8e-05,9e-06,3.1e-05,3e-05,4.6e-05,1e-05,4.7e-05,3.3e-05,3.3e-05,5.7e-05,3.8e-05,3.8e-05,7e-06,1.3e-05,1.8e-05,7e-06,9e-06,5e-06,9e-06,4e-06,1.6e-05,1.2e-05,7e-06,3e-06,4e-06,5e-06,3e-06,1e-06,4e-06
5e-06,5e-06,4e-06,2e-06,2e-06,1e-06,2e-06,3e-06,3e-06,5e-06,3e-06,5e-06,3e-06,1e-05,6e-06,5e-06,1e-06,6e-06,3e-06,5e-06,4e-06,5e-06,2e-06,2e-06,2e-06,1.7e-05,2.2e-05,6e-06,6e-06,7e-06,4e-06,5e-06,0.000184,8e-05,2e-05,0.000104,8.9e-05,4.2e-05,0.000502,0.000471,0.000139,0.000439,0.00022,0.000244,0.000332,0.000504,0.000553,0.000231,0.000319,0.000315,0.000172,0.000622,0.000222,0.000582,0.000674,0.000928,0.000501,0.000623,0.000196,0.000425,0.000259,0.000175,0.000211,0.000396,0.000522,0.000462,0.000389,0.000286,3.6e-05,0.000184,0.000123,5.7e-05,0.000166,0.000142,0.000186,0.000168,0.000179,0.000112,3.5e-05,1.9e-05,8e-05,5.4e-05,2.3e-05,6e-05,1e-05,2.5e-05,3.2e-05,2.9e-05,2.8e-05,2e-06,2.1e-05,9e-06,2.1e-05,3.1e-05,6e-06,1.9e-05,5e-06,5e-05,1.2e-05,1.9e-05,3.5e-05,2.8e-05,3.5e-05,7e-06,1.5e-05,5e-06,7e-06,5e-06,8e-06,1e-05,7e-06,4e-06,1.6e-05,1.4e-05,3e-06,3e-06,3e-06,3e-06,1e-06,4e-06,5e-06
1.2e-05,3e-06,1e-06,3e-06,4e-06,1e-06,2e-06,2e-06,1e-06,5e-06,2e-06,6e-06,5e-06,6e-06,1e-05,1.1e-05,8e-06,8e-06,4e-06,5e-06,2e-06,3e-06,1e-06,2e-06,2e-06,1.7e-05,2.2e-05,3e-06,3e-06,2e-06,1.4e-05,2.8e-05,4.9e-05,3.9e-05,1e-04,5.6e-05,4.6e-05,3e-05,0.000375,0.000465,0.000226,0.000438,0.000523,0.000352,0.000666,0.000469,0.000537,0.000424,0.000192,0.000468,0.000349,0.000532,0.000583,0.000774,0.000511,0.000413,8e-05,0.000328,0.000565,0.000442,0.00017,0.000216,7.8e-05,0.00012,0.000327,0.000406,0.000281,0.000207,0.000191,0.000143,0.000121,0.000117,0.000138,0.000126,0.000163,0.000163,0.000175,0.000107,2.3e-05,2.9e-05,7.3e-05,3e-05,1.2e-05,4.5e-05,1.2e-05,2.4e-05,4.1e-05,3.1e-05,2.4e-05,1.5e-05,3e-05,1.9e-05,2.4e-05,2.8e-05,8e-06,1.5e-05,9e-06,3.7e-05,1.1e-05,2.9e-05,2.9e-05,1.6e-05,1.6e-05,2.1e-05,2e-05,3e-06,6e-06,6e-06,8e-06,9e-06,3e-06,6e-06,1.7e-05,1e-05,7e-06,1e-06,1e-06,7e-06,4e-06,5e-06,1e-06
4e-06,7e-06,1e-06,3e-06,4e-06,3e-06,2e-06,2e-06,3e-06,2e-06,3e-06,5e-06,8e-06,8e-06,2e-06,7e-06,4e-06,3e-06,3e-06,2e-06,2e-06,3e-06,2e-06,2e-06,1e-06,2e-05,3e-05,4e-06,6e-06,1e-06,9e-06,4.1e-05,4.5e-05,0.000141,4e-05,6.7e-05,5.9e-05,5.6e-05,0.000299,0.000173,0.000373,0.000295,0.000245,0.000392,0.000427,0.000431,0.000424,0.000161,0.000725,0.000337,0.000484,0.000287,0.000414,0.000297,0.000129,0.000215,0.000186,0.00018,6.7e-05,0.00039,0.000348,0.00032,0.000313,0.000235,0.000436,0.00025,0.000246,0.00026,0.000143,0.00015,0.000147,8.9e-05,9.8e-05,0.000142,0.000197,0.000151,0.000145,9.7e-05,4.4e-05,1.7e-05,6.7e-05,5.9e-05,1.7e-05,1.5e-05,2.3e-05,5.1e-05,2.1e-05,8e-06,2e-05,1.7e-05,3.4e-05,1.9e-05,7e-06,1.7e-05,3.1e-05,7e-06,1.3e-05,3.3e-05,8e-06,9e-06,1.2e-05,2.8e-05,9e-06,1.6e-05,2.4e-05,4e-06,1.1e-05,8e-06,8e-06,4e-06,4e-06,5e-06,2e-05,1.5e-05,7e-06,2e-06,1e-06,3e-06,3e-06,2e-06,2e-06
5e-06,7e-06,6e-06,2e-06,1e-06,2e-06,3e-06,4e-06,1e-06,3e-06,5e-06,9e-06,1.2e-05,4e-06,1e-05,4e-06,6e-06,5e-06,0,5e-06,2e-06,1e-06,2e-06,2e-06,0,2e-05,2.1e-05,8e-06,9e-06,6e-06,6e-06,2.4e-05,4.3e-05,0.000151,0.000165,0.000116,4.6e-05,9.9e-05,0.000144,0.000534,0.00052,0.000512,0.000146,0.000498,0.000285,0.000485,8.3e-05,0.00022,0.000476,0.000317,0.000197,2.2e-05,0.000338,0.000364,0.000202,0.000267,0.000181,3.8e-05,0.000422,0.000168,0.000368,0.00014,0.000295,0.000291,0.000382,0.000271,0.000234,0.000301,0.000268,0.000112,0.000123,5.9e-05,0.000226,0.000174,0.00018,0.000173,0.000157,6.8e-05,2.8e-05,2.1e-05,5.4e-05,4.9e-05,2.5e-05,2.4e-05,2.3e-05,4.7e-05,3.9e-05,2.3e-05,2.3e-05,7e-06,1.6e-05,1.5e-05,2.4e-05,1.7e-05,9e-06,1.2e-05,1.3e-05,4e-05,1.3e-05,1.8e-05,2.4e-05,2.8e-05,2.9e-05,6e-06,1.4e-05,3e-06,9e-06,8e-06,1e-05,8e-06,5e-06,4e-06,1.8e-05,5e-06,3e-06,2e-06,2e-06,5e-06,3e-06,2e-06,2e-06
1.4e-05,7e-06,5e-06,2e-06,2e-06,1e-06,2e-06,2e-06,2e-06,3e-06,4e-06,4e-06,6e-06,5e-06,1e-05,1.1e-05,5e-06,8e-06,5e-06,2e-06,2e-06,6e-06,2e-06,3e-06,2e-06,2e-05,1.9e-05,6e-06,9e-06,5e-06,8e-06,7e-06,6.4e-05,0.000102,0.000191,8.2e-05,3.4e-05,3.8e-05,0.000172,0.000666,7.3e-05,0.000307,0.000318,0.000139,0.000226,0.00036,0.000616,0.000324,0.000114,0.000282,0.000217,9.6e-05,0.000462,0.000281,0.000229,0.000331,4.3e-05,0.000225,0.00052,0.000519,0.000103,7.4e-05,7.8e-05,0.000203,0.00011,0.00028,0.000244,0.000204,0.000203,0.000136,0.000118,0.000131,0.00025,7.4e-05,0.000126,2.8e-05,0.000101,0.000107,5e-05,5.8e-05,4.6e-05,4.2e-05,3e-05,4.1e-05,4.9e-05,4.7e-05,6e-06,2.5e-05,3.4e-05,2.3e-05,2.8e-05,1.6e-05,2.6e-05,4.3e-05,2.8e-05,5e-06,7e-06,3.1e-05,1.9e-05,2.6e-05,2.6e-05,2.2e-05,2.8e-05,2.1e-05,2.6e-05,3e-06,5e-06,6e-06,1.6e-05,6e-06,9e-06,2e-06,1.4e-05,1e-05,3e-06,3e-06,1e-06,6e-06,6e-06,5e-06,4e-06
1.6e-05,8e-06,1e-05,7e-06,3e-06,2e-06,2e-06,5e-06,5e-06,4e-06,5e-06,5e-06,9e-06,1e-05,4e-06,1e-06,9e-06,4e-06,2e-06,3e-06,1e-06,7e-06,7e-06,2e-06,3e-06,2.1e-05,2.6e-05,1.1e-05,1e-05,5e-06,1e-06,7e-06,0.000132,0.000167,6.8e-05,5.7e-05,1e-05,0.000104,0.000157,0.000433,0.000263,0.000171,0.000138,0.000173,0.00018,0.000216,0.00048,0.000516,0.000141,0.000283,0.00029,6.6e-05,0.000102,0.000251,0.000336,0.000377,0.000134,0.000259,0.000218,0.000142,0.000171,9.9e-05,0.00018,0.000538,0.00053,0.000248,7.4e-05,0.00025,5.7e-05,6.8e-05,9.1e-05,0.000261,0.000107,0.000109,6.8e-05,0.000165,9e-05,0.000191,8e-05,5.4e-05,7.1e-05,8e-05,2.3e-05,2.8e-05,2.5e-05,5.9e-05,6.9e-05,3.4e-05,5.3e-05,4.4e-05,4.2e-05,2.9e-05,8e-06,2.3e-05,2.3e-05,1.6e-05,1.2e-05,3e-05,2.5e-05,1.1e-05,1.1e-05,7e-06,2.5e-05,4e-06,2.2e-05,5e-06,3e-06,6e-06,2.9e-05,5e-06,9e-06,1.2e-05,5e-06,3e-06,8e-06,3e-06,1e-06,4e-06,5e-06,6e-06,2e-06
9e-06,1e-06,4e-06,1e-06,2e-06,1e-06,0,7e-06,2e-06,4e-06,6e-06,6e-06,8e-06,3e-06,5e-06,2e-06,4e-06,2e-06,2e-06,5e-06,5e-06,3e-06,3e-06,2e-06,4e-06,1.9e-05,2e-05,4e-06,1.5e-05,9e-06,1e-06,1.2e-05,0.000172,7.6e-05,2.3e-05,5.2e-05,5.1e-05,9.2e-05,0.000145,0.000226,0.000227,0.000206,0.000157,0.000217,0.000127,0.000376,0.000305,0.000145,0.00033,0.000329,0.00033,7e-05,0.000344,0.000188,0.000111,0.000329,5.9e-05,0.000284,0.000138,0.000147,0.000131,7.7e-05,0.000354,0.000585,0.000611,7.5e-05,0.000276,0.000339,7.3e-05,2.7e-05,0.000104,0.000127,6.9e-05,8.3e-05,0.000117,0.000205,0.000164,0.000135,0.000102,4.4e-05,0.000146,6.9e-05,3.3e-05,1.9e-05,2.8e-05,8.7e-05,9.2e-05,5.4e-05,6.6e-05,4.8e-05,5.7e-05,1.9e-05,2.5e-05,8e-06,2e-05,6e-06,4e-06,3.3e-05,1.6e-05,2e-05,7e-06,2e-05,1.9e-05,8e-06,1.7e-05,7e-06,4e-06,1.1e-05,1.7e-05,2e-05,7e-06,5e-06,6e-06,5e-06,8e-06,3e-06,2e-06,5e-06,2e-06,4e-06,2e-06
9e-06,4e-06,3e-06,1e-06,2e-06,1e-06,1e-06,6e-06,3e-06,5e-06,3e-06,5e-06,3e-06,3e-06,4e-06,4e-06,4e-06,3e-06,3e-06,2e-06,3e-06,4e-06,5e-06,3e-06,4e-06,2.3e-05,2e-05,4e-06,1.1e-05,7e-06,0,3.3e-05,0.000116,0.000109,0.000111,9.8e-05,9.6e-05,9.7e-05,0.000146,7.1e-05,9.2e-05,0.000214,4.3e-05,8.5e-05,0.000126,0.000533,0.000863,0.000531,0.000182,0.00021,0.000319,0.000158,0.000333,0.000273,0.000132,0.000404,8.2e-05,0.000328,8.7e-05,0.000266,0.00013,0.000144,2.3e-05,0.000456,0.000223,0.000346,0.000303,9.4e-05,0.000311,0.000126,0.000226,6.5e-05,5.2e-05,0.000144,0.000146,9.5e-05,9e-05,6e-06,6.4e-05,8.4e-05,9e-05,7.4e-05,7.8e-05,5e-05,3.8e-05,3.2e-05,3.7e-05,3.1e-05,6.9e-05,4.8e-05,5.7e-05,2.6e-05,2.5e-05,1.9e-05,1e-05,5e-06,9e-06,2.4e-05,1.2e-05,2.7e-05,2.7e-05,2.9e-05,2.1e-05,1.7e-05,1.3e-05,1.5e-05,1.1e-05,4e-06,7e-06,1.7e-05,1e-05,9e-06,6e-06,5e-06,3e-06,3e-06,1e-06,3e-06,3e-06,2e-06,1e-06
5e-06,2e-06,4e-06,2e-06,2e-06,1e-06,1e-06,4e-06,3e-06,2e-06,2e-06,5e-06,8e-06,7e-06,5e-06,4e-06,5e-06,4e-06,4e-06,3e-06,2e-06,4e-06,4e-06,1e-06,2e-06,1.8e-05,1.5e-05,2e-06,1.2e-05,1.3e-05,3e-06,4.5e-05,0.000188,2.6e-05,0.000239,0.000156,3.9e-05,2.7e-05,8.2e-05,0.000232,0.000185,0.000185,0.000101,0.000226,9.9e-05,0.000483,0.000564,0.000221,0.000327,0.00026,0.000184,0.000261,0.000237,0.000309,0.000113,0.000146,0.000178,0.000319,0.000296,0.000262,0.000232,0.000161,0.000212,0.00039,0.000317,0.000244,0.000222,5.3e-05,8.9e-05,0.000108,0.000257,0.000144,7.7e-05,7.2e-05,0.00016,4.7e-05,4.6e-05,2.9e-05,7.3e-05,7.5e-05,0.000114,2.8e-05,5.1e-05,2.9e-05,2.1e-05,5.4e-05,3.7e-05,2.7e-05,6.2e-05,1.8e-05,4e-05,2e-05,3e-05,3.2e-05,1.7e-05,1.5e-05,9e-06,2.5e-05,4e-06,2.3e-05,9e-06,4e-05,5e-06,1.9e-05,1e-05,3e-06,9e-06,1.1e-05,1e-05,1.2e-05,8e-06,2e-06,6e-06,6e-06,3e-06,5e-06,1e-06,2e-06,5e-06,3e-06,2e-06
9e-06,1e-06,2e-06,2e-06,2e-06,2e-06,0,3e-06,4e-06,2e-06,2e-06,5e-06,1.3e-05,4e-06,3e-06,3e-06,6e-06,8e-06,2e-06,4e-06,4e-06,1e-06,4e-06,1e-06,2e-06,1.4e-05,1.2e-05,6e-06,1.2e-05,6e-06,1.7e-05,5.6e-05,0.000268,0.000212,0.000394,0.000125,4.1e-05,4.9e-05,4.8e-05,0.000156,9.4e-05,0.000136,0.000177,9.4e-05,0.000121,0.000408,0.000123,0.000154,0.00012,0.000153,0.00017,0.000229,0.000356,0.000189,7.6e-05,0.000105,0.000162,0.000222,0.000243,0.000186,0.000207,0.000205,0.000371,3.6e-05,0.000379,0.000169,7.8e-05,0.000182,0.000208,0.000165,0.00029,0.000251,9e-05,0.000218,8.5e-05,7.5e-05,5.5e-05,8.3e-05,9.4e-05,2.4e-05,4.7e-05,3.7e-05,3.1e-05,2.7e-05,2.9e-05,8.6e-05,5.6e-05,2e-06,2.8e-05,2.5e-05,2.3e-05,1.7e-05,3.4e-05,2.2e-05,2.8e-05,1.6e-05,1.6e-05,2.5e-05,3e-05,1.8e-05,1e-05,1.7e-05,2.3e-05,2.4e-05,2.3e-05,1.5e-05,2e-06,1.4e-05,1.8e-05,1.2e-05,1.5e-05,2e-06,1.1e-05,4e-06,3e-06,7e-06,4e-06,6e-06,5e-06,4e-06,5e-06
2e-06,5e-06,2e-06,2e-06,1e-06,2e-06,3e-06,2e-06,2e-06,7e-06,4e-06,3e-06,1.1e-05,3e-06,6e-06,5e-06,4e-06,3e-06,2e-06,7e-06,6e-06,4e-06,5e-06,2e-06,2e-06,1.9e-05,2.2e-05,5e-06,6e-06,1.5e-05,2.4e-05,3.2e-05,0.00038,0.000219,0.000463,0.000272,0.000173,4.2e-05,6.2e-05,0.00038,0.00019,8.3e-05,5.1e-05,0.000168,0.000127,0.000619,0.000384,3.7e-05,0.000161,0.000145,0.000279,0.000327,3.6e-05,0.00021,8.8e-05,9.7e-05,0.000119,0.000126,0.000286,0.00014,0.000252,0.000314,0.000261,4.4e-05,0.000289,0.000358,0.000194,0.000213,9.3e-05,0.000116,0.000186,0.000234,0.000163,0.000196,0.000104,8.4e-05,0.000143,0.000103,2e-05,3.9e-05,5.2e-05,7e-05,6.1e-05,5.4e-05,5.5e-05,0.000103,4.6e-05,3.8e-05,3.7e-05,2.5e-05,2.2e-05,2.2e-05,2.7e-05,3.7e-05,2e-05,1.8e-05,4e-06,2.4e-05,7.5e-05,4.3e-05,2.6e-05,1.9e-05,1.1e-05,1.4e-05,7e-06,1.7e-05,1.3e-05,1.6e-05,9e-06,2.4e-05,4e-06,8e-06,1.3e-05,3e-06,7e-06,3e-06,3e-06,5e-06,5e-06,5e-06,1e-06
1e-05,2e-06,7e-06,4e-06,0,1e-06,2e-06,2e-06,3e-06,4e-06,3e-06,6e-06,6e-06,5e-06,8e-06,2e-06,4e-06,4e-06,2e-06,9e-06,7e-06,2e-06,1e-06,1e-06,3e-06,1.5e-05,2.4e-05,1e-06,4e-06,5e-06,1e-06,3.5e-05,0.000287,0.000212,0.00026,0.000217,8e-05,0.000155,4.1e-05,4e-04,7.3e-05,0.000252,0.000133,0.000112,0.000149,0.000499,0.000425,0.000261,0.000181,0.000172,0.000274,0.000404,0.000384,0.000201,8.5e-05,0.000329,0.000106,0.000177,0.00032,0.000272,0.000153,0.000218,0.000311,5.2e-05,6.8e-05,0.000229,0.000169,0.000281,0.000204,8.7e-05,4.3e-05,0.000126,2.4e-05,8.1e-05,0.000137,5.5e-05,7.6e-05,4e-05,4.6e-05,2.2e-05,1.2e-05,3.3e-05,1.8e-05,3e-05,2.4e-05,3.9e-05,2.2e-05,1.7e-05,1.8e-05,1.6e-05,1.5e-05,2.7e-05,2.1e-05,4.1e-05,1.4e-05,1.9e-05,1.9e-05,2.2e-05,7.3e-05,6.6e-05,1.4e-05,3.9e-05,1e-05,2.2e-05,1.9e-05,1.7e-05,1.5e-05,2e-06,1.9e-05,2.4e-05,2e-05,1.8e-05,9e-06,6e-06,7e-06,4e-06,3e-06,3e-06,3e-06,1e-06,0
6e-06,5e-06,6e-06,3e-06,1e-06,3e-06,2e-06,3e-06,4e-06,1e-06,4e-06,6e-06,3e-06,6e-06,1e-05,6e-06,3e-06,4e-06,3e-06,7e-06,1e-06,0,2e-06,2e-06,5e-06,1.9e-05,1.9e-05,5e-06,3e-06,5e-06,1.7e-05,3e-05,0.000205,9.7e-05,0.000257,0.000319,0.00015,0.000184,0.000123,0.000332,0.000207,0.000386,0.000264,4.8e-05,0.000158,0.000252,0.000311,1e-04,0.000211,9.3e-05,0.000237,0.000339,8.5e-05,0.000244,0.000139,0.000325,0.000247,0.000158,0.000102,0.000185,0.000142,0.000176,0.000211,0.000178,0.000214,0.00023,0.000222,0.000265,7.7e-05,0.000167,0.000135,0.000109,6.3e-05,0.00012,0.000177,0.000102,0.000148,0.000127,1.7e-05,4e-06,2.4e-05,3.5e-05,3.5e-05,4.1e-05,3.6e-05,8.9e-05,3.1e-05,1.9e-05,3.1e-05,1e-05,4.2e-05,3.7e-05,2e-05,5.1e-05,3.6e-05,3.5e-05,2.6e-05,2.4e-05,3e-05,4.5e-05,2.7e-05,4.9e-05,2.2e-05,2.3e-05,4e-06,8e-06,1.4e-05,1.6e-05,1.5e-05,1.5e-05,1.2e-05,1.2e-05,1.3e-05,1.4e-05,6e-06,2e-06,1e-06,3e-06,1e-06,1e-06,2e-06
7e-06,5e-06,4e-06,2e-06,3e-06,3e-06,4e-06,1e-06,2e-06,4e-06,4e-06,6e-06,1e-06,2e-06,2e-06,3e-06,4e-06,2e-06,2e-06,5e-06,3e-06,1e-06,2e-06,3e-06,1e-06,1.9e-05,1.9e-05,6e-06,7e-06,5e-06,1.6e-05,4.2e-05,0.000123,0.000172,0.000406,0.000306,0.000128,0.000181,0.000141,0.000433,0.000327,0.000202,0.000264,0.000267,7.9e-05,0.000191,0.000309,0.000417,8.2e-05,0.000207,0.000142,0.000417,0.000368,0.000331,0.000123,2e-04,0.000239,0.000278,0.000177,0.00026,0.000232,0.000122,0.000279,3.6e-05,0.000237,0.000126,0.000222,0.000225,0.000193,0.000142,5.9e-05,0.000137,0.000175,0.000152,8.9e-05,7.7e-05,0.000211,0.000293,0.000195,0.000107,7.4e-05,5.2e-05,4.3e-05,2e-05,3.9e-05,7.5e-05,7.9e-05,3.7e-05,4.1e-05,2.5e-05,2.7e-05,4.5e-05,1e-05,2.9e-05,1.5e-05,2.8e-05,2.5e-05,2.8e-05,4.4e-05,6.6e-05,2.3e-05,4.2e-05,4.7e-05,5.4e-05,4.2e-05,3.1e-05,3.9e-05,4.3e-05,7e-06,6e-06,1e-05,1e-05,1.3e-05,1.7e-05,6e-06,2e-06,1e-06,5e-06,4e-06,4e-06,3e-06
6e-06,2e-06,2e-06,2e-06,2e-06,1e-06,1e-06,1e-06,2e-06,2e-06,2e-06,5e-06,1e-06,1e-06,2e-06,2e-06,3e-06,1e-06,1e-06,3e-06,0,0,2e-06,0,2e-06,1.7e-05,2.1e-05,3e-06,4e-06,6e-06,3e-06,3e-05,0.000159,0.000177,0.000211,0.000185,0.000102,0.000108,8.2e-05,0.000367,0.000104,9.4e-05,0.000227,6.5e-05,5.6e-05,0.000308,0.000439,0.000103,0.000181,0.000256,0.000105,0.000396,0.000382,0.000242,0.000148,0.000171,0.000235,0.000216,6.2e-05,0.000241,0.000202,0.000128,0.000125,0.000123,0.000201,0.000269,0.000311,0.000158,0.000134,0.000105,5.6e-05,9.4e-05,3.5e-05,6.4e-05,2.3e-05,0.000106,0.00011,0.000171,7.3e-05,9e-06,2.3e-05,2.8e-05,1.1e-05,4.3e-05,1.4e-05,1.6e-05,2.9e-05,2.4e-05,3.7e-05,3.3e-05,2.6e-05,9e-06,1.8e-05,1.3e-05,2e-05,5e-06,1.1e-05,1.4e-05,3.2e-05,6e-05,5.4e-05,2.7e-05,2.3e-05,2.2e-05,7e-06,1.4e-05,2e-05,1.2e-05,2.1e-05,6e-06,8e-06,1.5e-05,2e-06,9e-06,7e-06,2e-06,1e-06,6e-06,3e-06,3e-06,2e-06
6e-06,1e-06,0,1e-06,0,1e-06,1e-06,0,1e-06,2e-06,3e-06,4e-06,3e-06,1e-06,2e-06,3e-06,2e-06,1e-06,1e-06,1e-06,2e-06,2e-06,1e-06,1e-06,2e-06,1.6e-05,1.5e-05,2e-06,1e-06,2e-06,8e-06,1.7e-05,0.000129,3.8e-05,0.000131,4.3e-05,1.5e-05,4.2e-05,3e-05,0.00024,0.000168,9.7e-05,0.000233,0.000345,0.000232,0.000286,0.000236,0.000111,0.00017,0.000111,0.000231,0.000332,9e-05,0.000361,0.00013,0.00015,0.000179,0.000108,4.8e-05,0.000145,0.000109,0.000102,0.000142,9.9e-05,0.000204,0.000297,5.8e-05,0.000207,7.4e-05,5.6e-05,8e-06,1.9e-05,6.8e-05,7.5e-05,6.8e-05,8e-05,7.1e-05,3.7e-05,2.2e-05,2.9e-05,6e-06,1.5e-05,7e-06,3.4e-05,2.3e-05,3.7e-05,1e-06,5e-06,1.1e-05,1e-05,1.3e-05,7e-06,9e-06,1.6e-05,8e-06,3e-06,8e-06,5e-06,1.5e-05,1.2e-05,1.2e-05,1.9e-05,1.1e-05,1.2e-05,9e-06,1e-05,1.1e-05,5e-06,1.8e-05,5e-06,8e-06,4e-06,4e-06,1e-06,2e-06,1e-06,0,6e-06,1e-06,1e-06,1e-06
6e-06,2e-06,1e-06,1e-06,0,1e-06,2e-06,0,1e-06,2e-06,2e-06,4e-06,3e-06,1e-06,4e-06,2e-06,1e-06,1e-06,1e-06,1e-06,1e-06,1e-06,1e-06,0,1e-06,1.6e-05,1.7e-05,2e-06,4e-06,2e-06,8e-06,1.3e-05,7.1e-05,8.8e-05,8.3e-05,4.5e-05,1.2e-05,1.3e-05,4.8e-05,0.000197,0.000121,2e-04,0.000216,2e-04,9.7e-05,0.000123,0.000294,0.000101,3.2e-05,0.000216,0.000229,0.000258,0.000176,0.000205,0.000131,0.000189,9.9e-05,0.000134,7.9e-05,0.000192,8.9e-05,4.8e-05,0.000103,0.000113,0.000227,0.000208,0.000156,0.00016,0.000115,7e-05,1.4e-05,1e-05,6.6e-05,3.4e-05,6.7e-05,4.9e-05,1.8e-05,4.6e-05,3.7e-05,3e-06,1e-05,1.2e-05,5e-06,3e-05,1.2e-05,1.6e-05,1.3e-05,4e-06,3e-06,8e-06,4e-06,2e-06,2e-06,1.7e-05,8e-06,4e-06,4e-06,6e-06,7e-06,3e-06,1.7e-05,8e-06,1.2e-05,2e-06,1e-05,8e-06,4e-06,5e-06,1.4e-05,2e-06,1e-06,5e-06,4e-06,1e-06,2e-06,1e-06,1e-06,5e-06,1e-06,2e-06,1e-06
6e-06,0,1e-06,1e-06,0,1e-06,1e-06,1e-06,0,3e-06,2e-06,5e-06,2e-06,1e-06,3e-06,3e-06,1e-06,1e-06,1e-06,1e-06,1e-06,1e-06,1e-06,0,1e-06,1.6e-05,1.7e-05,1e-06,3e-06,2e-06,7e-06,1.2e-05,3.6e-05,6.8e-05,5.3e-05,3.4e-05,6e-06,7e-06,5.6e-05,0.000132,8.2e-05,0.000104,0.000161,0.000129,5.2e-05,0.000177,0.000272,0.000154,8.5e-05,0.000148,0.000137,0.000191,0.000145,0.000196,0.000132,0.000174,3.5e-05,6.2e-05,5.5e-05,0.000159,6.6e-05,1.5e-05,0.000148,0.000103,0.000186,0.000118,0.000167,0.000191,0.000133,8.6e-05,2.5e-05,1e-05,5.3e-05,2e-05,6.7e-05,4.4e-05,1.6e-05,4.9e-05,3.2e-05,7e-06,1.2e-05,1.3e-05,1e-06,3e-05,5e-06,1.2e-05,1.1e-05,3e-06,5e-06,6e-06,8e-06,4e-06,0,1.4e-05,5e-06,2e-06,3e-06,5e-06,5e-06,4e-06,1.5e-05,4e-06,8e-06,5e-06,6e-06,4e-06,5e-06,3e-06,1.3e-05,1e-06,0,5e-06,3e-06,2e-06,2e-06,1e-06,0,5e-06,1e-06,1e-06,1e-06
