-4e-06,-2e-06,-0.000127,-0.002106,-0.018512,-0.016576,-0.014917,-0.048601,-0.14013,-0.162547,-0.129709,-0.054971,-0.02269,-0.00452,-0.002555,-0.000912,-0.00072,-0.000717,-0.000627,-0.000221,0.000306,-0.004996,-0.012928,-0.013229,-0.004139,-0.000541,-6.8e-05,-0.00023
-3e-06,-2e-06,-3e-06,4.4e-05,-0.001938,-0.004562,-0.007659,0.01871,0.069699,0.096375,0.12153,0.04108,0.010375,0.002731,-0.000637,0.000426,0.001034,0.000631,-0.000117,-8.2e-05,-0.012175,-0.021423,-0.003225,-0.000537,-0.002361,-0.000519,2.7e-05,-4.1e-05
1e-06,0,7e-06,0.00046,0.005309,0.003339,0.00743,0.002507,-0.016134,-0.027436,-0.014173,-0.004417,-0.002044,-0.000201,0.000955,0.000207,1.3e-05,-8.6e-05,-0.000201,-0.000308,-0.015778,-0.023339,-0.002783,-0.004639,-0.001403,2.1e-05,4.4e-05,-8e-06
2e-06,1e-06,-3.6e-05,-0.000423,0.001617,0.005523,0.006059,-0.021512,-0.08607,-0.122842,-0.130197,-0.044366,-0.010733,-0.002395,0.001052,-0.000186,-0.000888,-0.000591,6.3e-05,-0.000388,-0.012021,-0.012269,0.002856,0.003317,0.001863,0.000308,3.6e-05,8.5e-05
-1e-06,0,4.7e-05,0.000486,0.005031,0.00764,0.003057,0.034052,0.122503,0.151902,0.116811,0.049947,0.022112,0.004469,0.00108,0.000727,0.000849,0.000855,0.000832,0.00018,0.00014,0.007302,0.005751,0.009922,0.003195,0.000141,4.1e-05,0.000116
-6e-06,-2e-06,4.5e-05,6e-04,-0.000311,-0.00406,-0.006644,-0.005885,0.045867,0.081015,0.054536,0.020226,0.004648,0.000425,-0.000924,-2.5e-05,0.00038,0.000256,1.3e-05,-0.000134,0.00524,0.01154,-0.010991,-0.012686,-0.003206,-0.000475,-4.4e-05,-0.000201
-3e-06,-2e-06,-4.2e-05,-0.000769,-0.009683,-0.011545,-0.007741,-0.053681,-0.146805,-0.157769,-0.136036,-0.057234,-0.024103,-0.004739,-0.001596,-0.000818,-0.000979,-0.000929,-0.000728,-0.000443,0.003198,0.004973,-0.014808,-0.01647,-0.003846,-0.000537,-4.8e-05,-0.000239
2e-06,0,-2.3e-05,-0.000479,-0.001448,0.00039,0.001169,0.010534,0.001659,0.008471,0.04695,0.011924,0.003794,0.001948,0.000947,0.000457,0.000426,0.000295,6.7e-05,0.000187,0.000821,-0.002007,-0.004725,-0.002695,0.00031,-1.2e-05,5.5e-05,5e-05
3e-06,1e-06,1.1e-05,0.000577,0.008609,0.008877,0.007993,0.02566,0.061662,0.073759,0.084181,0.031781,0.011182,0.002362,0.00138,0.000537,0.000609,0.000469,0.000204,0.000143,-0.003862,-0.010095,0.00104,0.002127,0.001109,0.000304,4.3e-05,0.000158
1e-06,1e-06,-8e-06,0.000308,0.004328,0.004042,0.000728,-0.024358,-0.055732,-0.077511,-0.100218,-0.030647,-0.008773,-0.002695,-0.000677,-0.000556,-0.000834,-0.000588,-5.4e-05,-2.3e-05,-0.003736,-0.009325,0.0049,0.009511,0.00227,0.000299,-1.8e-05,0.000118
-1e-06,0,0,-0.000417,-0.005671,-0.003937,-0.00607,-0.008231,0.008386,0.018922,0.000473,0.002145,0.004618,0.000939,-0.000375,3.3e-05,9.1e-05,0.000187,0.000294,0.000215,0.00093,0.000845,-0.000723,0.002064,0.001708,0.000245,-6e-06,1.6e-05
1e-06,0,2.7e-05,-0.000117,-0.005629,-0.006276,-0.004259,0.004793,0.050167,0.095598,0.08191,0.025777,0.008409,0.001963,0.000459,0.000448,0.000737,0.000542,7.5e-05,0.000158,0.006005,0.010433,-0.003402,-0.008578,-0.001369,5.6e-05,8e-06,-6.2e-05
3e-06,1e-06,1.1e-05,0.000407,0.00285,-0.000516,0.001499,-0.015647,-0.051126,-0.06605,-0.069936,-0.023576,-0.01206,-0.002559,-0.000363,-0.000371,-0.000618,-0.000572,-0.000384,-0.000236,0.003301,0.008431,0.001619,-0.001549,-0.000871,-0.000119,1e-05,2e-05
2e-06,1e-06,-9e-06,9e-06,0.004199,0.005574,0.002541,0.00391,-0.027268,-0.072652,-0.028846,-0.00806,-0.004401,-0.000541,-0.000328,-0.000203,-0.000254,-0.000145,2.3e-05,-6e-05,-0.000161,0.001521,0.0021,0.003079,0.00015,-8.1e-05,2.8e-05,5.7e-05
-1e-06,0,-1.5e-05,-0.000307,-0.000502,0.002462,-1.5e-05,0.014449,0.043081,0.063812,0.088535,0.026542,0.00954,0.002029,0.000497,0.000352,0.000687,0.000564,0.000192,2.8e-05,-0.00269,-0.004912,0.002029,0.00221,-0.000533,-4.6e-05,-2e-06,1e-06
-3e-06,-2e-06,-1.2e-05,4.8e-05,-0.001029,-0.002195,-7.6e-05,-0.009703,-0.007101,0.008725,-0.025331,-0.007099,-0.000775,-0.001024,6.8e-05,-0.000114,-0.000336,-0.000318,-0.000127,-6.1e-05,-0.002767,-0.006382,0.002939,0.00457,0.000261,-8.2e-05,-4.4e-05,-2.9e-05
-3e-06,-2e-06,2e-06,-2.3e-05,-0.002197,-0.003158,-0.000842,-0.004733,-0.012742,-0.033914,-0.055534,-0.01501,-0.002753,-0.000628,-0.000266,-0.000219,-0.000461,-0.000315,-1.3e-05,0.000114,-5.1e-05,-0.002072,-0.001059,-0.000731,-2.5e-05,-0.000123,-2.2e-05,-8.8e-05
-1e-06,-1e-06,2.1e-05,2.6e-05,-0.000975,-0.00089,-0.002057,0.010815,0.029902,0.053424,0.056135,0.010463,0.004048,0.00151,-4e-05,0.000172,0.000553,0.00044,3.1e-05,6.3e-05,0.002786,0.004147,-0.001766,-0.006219,-0.001272,-0.000106,1.2e-05,-7.8e-05
0,0,6e-06,0.000242,0.003241,0.002372,-0.000955,0.00521,0.011238,0.010154,0.004338,-0.000233,-0.002843,-0.000861,-0.000425,-0.000161,-6.5e-05,-0.000157,-0.000186,-0.000113,0.00301,0.006498,0.00404,0.002094,-7.5e-05,-8.1e-05,-1.1e-05,6e-06
