-0.044628,-0.05419,-0.10067,-0.149423,-0.16392,-0.152342,-0.148368,-0.142928,-0.142277,-0.104914,-0.053078,-0.014448,-0.004666,-0.004309,-0.002817,-0.001226,-0.000874,-0.000594,-0.000511,-0.000305,-0.000151,-0.000139,-0.000613,-0.000765,-0.000351,-0.000754,-0.003553,-0.003356
-0.012179,0.018691,0.120557,0.186733,0.167113,0.161277,0.18524,0.16829,0.15464,0.127875,0.061678,0.01365,0.002319,0.004278,0.003138,0.001267,0.000923,0.000681,0.000334,-4.3e-05,5.5e-05,3.4e-05,-0.000524,-0.000399,9e-06,-0.00037,-0.002913,-0.004708
0.006302,0.010988,-0.010286,-0.02171,-0.021433,-0.036495,-0.018199,-0.011025,-0.012703,-0.021844,-0.019643,-0.00568,-0.002085,-0.001983,-0.000744,-0.00049,-0.000452,-0.000404,-0.000432,-0.000425,-0.000258,-0.000224,-0.000252,-4.9e-05,-0.000113,-0.00016,-2.1e-05,-0.001269
0.022294,-0.01408,-0.121878,-0.163886,-0.157723,-0.136374,-0.161228,-0.147375,-0.143434,-0.114753,-0.053267,-0.012585,-0.002289,-0.003899,-0.002941,-0.000917,-0.000649,-0.000377,-0.000144,6e-05,5.8e-05,0.000101,0.000469,0.000368,2.7e-05,0.000258,0.002082,0.0019
0.015163,0.009977,0.077955,0.146273,0.153761,0.157658,0.146481,0.127172,0.13195,0.115036,0.067271,0.018439,0.005487,0.005336,0.002791,0.001279,9e-04,0.000669,0.000655,0.000509,0.000219,0.00014,0.00047,0.000291,0.00018,0.000387,0.001727,0.001052
-0.024102,-0.009776,0.037409,0.04165,0.056119,0.032235,0.044934,0.049109,0.0543,0.032607,0.010205,0.003095,0.000769,0.001047,0.001176,0.000291,0.000364,0.000201,0.000267,0.000208,4.6e-05,4.7e-05,6.3e-05,4.8e-05,0.000171,0.000221,0.000273,-0.001092
-0.01297,-0.017973,-0.100963,-0.157214,-0.163503,-0.148871,-0.166261,-0.149804,-0.155302,-0.121934,-0.060408,-0.016932,-0.005124,-0.004659,-0.003031,-0.001254,-0.000989,-0.000621,-0.000517,-0.00021,-4.8e-05,-5.3e-05,-0.000318,-0.000241,-0.000146,-0.000203,-0.00115,-0.002399
0.010002,0.01162,0.038386,0.080116,0.056318,0.065441,0.074707,0.057211,0.055146,0.060706,0.034598,0.00789,0.001028,0.002236,0.000882,0.000376,0.000259,0.000139,-9.7e-05,-0.000168,-4.9e-05,-8.4e-05,-0.000365,-0.000272,-0.000214,-0.000419,-0.00194,-0.002421
0.003841,0.006727,0.059697,0.071324,0.072927,0.054609,0.085807,0.078189,0.086138,0.054059,0.014787,0.004188,0.001327,0.00093,0.001606,0.000514,0.000524,0.000274,6.9e-05,-0.000236,-0.000109,-2e-05,-7.9e-05,-2.7e-05,5e-05,-0.000214,-0.001012,-0.001289
0.007503,-0.007017,-0.076508,-0.124247,-0.114216,-0.102566,-0.131614,-0.106317,-0.114525,-0.102723,-0.050387,-0.012312,-0.001641,-0.003698,-0.002249,-0.000698,-0.000772,-0.00044,-0.000281,-9.4e-05,-3.5e-05,-1.5e-05,0.00027,0.000152,6.1e-05,0.000167,0.001338,0.000232
-0.001795,0.001631,0.002393,0.036306,0.031785,0.033209,0.018932,0.010806,0.01276,0.029251,0.028439,0.008913,0.002871,0.00249,0.000128,0.000331,0.000294,0.000196,0.000399,0.000411,0.000141,0.000113,0.000434,0.000298,-3e-06,0.000449,0.002465,0.001706
-0.011924,0.005932,0.064259,0.082693,0.098445,0.079203,0.105659,0.089301,0.101504,0.077373,0.033037,0.008499,0.001477,0.002411,0.002079,0.000429,0.000569,0.000408,0.000381,0.000184,2.8e-05,-7e-06,-6.2e-05,0.000107,9.1e-05,0.000238,0.000609,0.001277
-0.000618,-0.00952,-0.048796,-0.09513,-0.085804,-0.072725,-0.093768,-0.069258,-0.082499,-0.078896,-0.043937,-0.01325,-0.003917,-0.003252,-0.001255,-0.000629,-0.000645,-0.000393,-0.000367,-5e-05,3.2e-05,-2e-05,-0.000353,-0.000256,3.3e-05,-0.000314,-0.002016,-0.000279
0.002175,-0.006955,-0.021456,-0.005872,-0.038191,-0.029213,-0.033394,-0.039326,-0.041529,-0.014279,0.001281,0.000298,-0.000671,0.000366,-0.000909,-5.4e-05,-9.2e-05,-0.000196,-0.00022,-0.000149,-2.7e-05,-1.9e-05,-0.000219,-0.000361,-0.000189,-0.000479,-0.001997,-0.001024
0.008165,0.019479,0.0628,0.084477,0.079632,0.065786,0.106768,0.083693,0.09646,0.076228,0.030696,0.007915,0.001867,0.001727,0.001598,0.000467,0.000586,0.000366,4.1e-05,-0.000284,-0.000127,-8.4e-05,4.3e-05,2.8e-05,-7.2e-05,2.4e-05,0.000537,-0.000653
0.010977,0.007365,-0.020842,-0.053782,-0.029059,-0.025194,-0.045275,-0.019851,-0.031524,-0.048757,-0.030673,-0.008307,-0.000771,-0.002053,-8.2e-05,-7.8e-05,-0.00028,-0.000113,-7.4e-05,5e-06,2e-05,8.5e-05,0.000379,0.000411,0.000165,0.000369,0.001921,-0.000201
-0.013655,-0.022721,-0.044456,-0.032875,-0.04209,-0.037631,-0.063929,-0.056656,-0.057123,-0.032826,-0.004462,0.001121,0.000723,0.000367,-0.001279,-0.000217,-0.000355,-0.00021,0.000164,0.000182,3.4e-05,6e-06,0.000119,0.000105,1.6e-05,5.3e-05,0.000447,-0.000535
-0.012869,-0.001218,0.039059,0.066246,0.06778,0.062063,0.091744,0.061329,0.078715,0.077325,0.039476,0.010035,0.001503,0.001754,0.000787,0.000139,0.000511,0.000356,0.000303,0.000192,3.2e-05,-2e-06,-0.000238,-0.000229,-7.6e-05,-8.6e-05,-0.000755,-0.00012
0.006858,0.011244,0.003017,-0.023119,0.000976,0.001272,-0.00428,0.012106,-0.005727,-0.021512,-0.019032,-0.007155,-0.002097,-0.001593,0.000622,-3e-06,-0.000146,-4e-05,-0.000144,5.6e-05,4.4e-05,3.6e-05,-0.000165,-0.000139,2.4e-05,1.1e-05,-0.000511,0.001051
