0.023444,0.022602,0.024891,0.027404,0.02752,0.024682,0.022634,0.022698,0.02253,0.023042,0.025309,0.028362,0.029588,0.026681,0.022032,0.020761,0.021275,0.022115,0.023872,0.024075,0.022575,0.021342,0.02037,0.019855,0.018461,0.01602,0.016534,0.018734
0.029182,0.02825,0.030909,0.034397,0.03439,0.030489,0.028462,0.028643,0.027516,0.027571,0.030491,0.034239,0.035219,0.031733,0.027082,0.025591,0.025664,0.0263,0.028138,0.02842,0.026874,0.025851,0.024578,0.023678,0.022333,0.019841,0.020438,0.022809
0.039446,0.038519,0.041676,0.046813,0.046456,0.04063,0.039184,0.039345,0.03586,0.034997,0.03904,0.043678,0.043703,0.039204,0.035027,0.033402,0.032576,0.032567,0.034203,0.034508,0.033168,0.033068,0.031291,0.029505,0.028651,0.026561,0.027095,0.029458
0.049832,0.049576,0.052705,0.058404,0.057592,0.050597,0.051221,0.050589,0.043693,0.042023,0.045807,0.049897,0.04902,0.044063,0.040717,0.039669,0.038233,0.036911,0.037776,0.037762,0.036589,0.038022,0.036346,0.033819,0.034154,0.033234,0.033182,0.034845
0.063139,0.064413,0.067955,0.073212,0.069893,0.061164,0.066026,0.064477,0.05465,0.052746,0.052855,0.054381,0.054941,0.052377,0.048866,0.047956,0.047065,0.044924,0.045835,0.044507,0.040893,0.042186,0.042189,0.040291,0.041502,0.041819,0.040922,0.041136
0.084057,0.085627,0.088726,0.093431,0.085705,0.073194,0.082068,0.080544,0.070555,0.069717,0.064186,0.062945,0.066291,0.068009,0.064703,0.064522,0.064492,0.059621,0.061641,0.058824,0.050339,0.050762,0.052849,0.05171,0.053061,0.054976,0.053418,0.050351
0.107467,0.108131,0.109329,0.114514,0.104102,0.086766,0.096204,0.094623,0.087988,0.089932,0.078653,0.074188,0.078703,0.084695,0.083225,0.084979,0.085643,0.077269,0.080343,0.075819,0.064253,0.065241,0.066764,0.064936,0.067464,0.072192,0.069975,0.062817
0.126904,0.12988,0.128354,0.130446,0.118144,0.099476,0.108472,0.106434,0.102653,0.106387,0.092949,0.087526,0.090987,0.098306,0.098416,0.100039,0.100515,0.09265,0.096255,0.08966,0.078945,0.082102,0.079942,0.075763,0.080314,0.087767,0.087102,0.080036
0.146334,0.154638,0.153939,0.15154,0.131887,0.113287,0.122508,0.123477,0.118569,0.11644,0.106244,0.107074,0.10934,0.110837,0.108573,0.108762,0.110332,0.106581,0.108728,0.101115,0.094401,0.098909,0.09273,0.087116,0.091762,0.098766,0.103599,0.103112
0.182137,0.189897,0.190178,0.189918,0.159577,0.138783,0.149107,0.152136,0.141824,0.129919,0.123025,0.133025,0.136994,0.130306,0.124522,0.125298,0.128417,0.127634,0.12697,0.118343,0.112473,0.11502,0.109947,0.10863,0.109323,0.110219,0.121957,0.132974
0.230387,0.229568,0.227382,0.239174,0.199929,0.16933,0.181111,0.187024,0.175093,0.15867,0.151832,0.166936,0.172591,0.159415,0.151186,0.155265,0.15803,0.156055,0.151606,0.140848,0.135254,0.134756,0.131587,0.135171,0.132841,0.129591,0.144216,0.164584
0.263324,0.249457,0.246702,0.275498,0.235832,0.192746,0.202837,0.212422,0.201516,0.189894,0.185111,0.195923,0.199646,0.189617,0.181404,0.183213,0.180329,0.173095,0.170131,0.165669,0.161568,0.150136,0.143448,0.150635,0.14913,0.151908,0.16564,0.183081
0.272113,0.245354,0.236538,0.273235,0.247432,0.207147,0.214139,0.222549,0.219168,0.222746,0.219446,0.219886,0.219039,0.215501,0.205924,0.197045,0.187795,0.17592,0.173672,0.18373,0.186435,0.157201,0.139523,0.147848,0.152044,0.169219,0.182554,0.190169
0.278752,0.249856,0.227605,0.250868,0.237907,0.21528,0.220576,0.221727,0.22829,0.246429,0.240345,0.231805,0.228303,0.22461,0.216382,0.204784,0.190361,0.179457,0.181973,0.202559,0.205524,0.157428,0.126729,0.137204,0.155801,0.185222,0.194489,0.193789
0.266054,0.255117,0.236343,0.241341,0.225199,0.213572,0.218427,0.208861,0.216114,0.235407,0.21937,0.207995,0.215629,0.215535,0.210604,0.202548,0.183263,0.176482,0.192578,0.216215,0.214114,0.168627,0.128564,0.130773,0.162503,0.194066,0.195683,0.185444
0.238478,0.253617,0.248656,0.240926,0.221428,0.218193,0.228464,0.212733,0.204774,0.208539,0.183515,0.170538,0.19466,0.209157,0.209521,0.204091,0.181877,0.172158,0.192262,0.21686,0.219494,0.194135,0.145012,0.127815,0.163622,0.195201,0.197382,0.178525
0.225455,0.26485,0.268069,0.258414,0.234114,0.227029,0.237332,0.223264,0.200695,0.186658,0.16773,0.164959,0.207649,0.24007,0.241016,0.22939,0.201183,0.18223,0.184439,0.207107,0.237805,0.231109,0.164131,0.128868,0.165279,0.201177,0.207904,0.184936
0.260438,0.309289,0.300346,0.292571,0.264256,0.238313,0.234037,0.22478,0.207457,0.191447,0.180221,0.183635,0.238968,0.281496,0.282271,0.269202,0.238857,0.215954,0.189323,0.196361,0.255631,0.263588,0.183642,0.143063,0.176601,0.21102,0.220438,0.201567
0.311878,0.354482,0.32894,0.320325,0.289111,0.24662,0.233272,0.23008,0.223295,0.217096,0.202672,0.205482,0.262506,0.301102,0.305968,0.301087,0.276322,0.253712,0.20876,0.204284,0.277985,0.293752,0.214937,0.179994,0.198023,0.210793,0.217448,0.210392
0.351982,0.376853,0.342031,0.332949,0.299796,0.243157,0.228362,0.234788,0.233765,0.235782,0.213759,0.215708,0.269951,0.309384,0.335382,0.341272,0.300907,0.257948,0.21066,0.224992,0.307416,0.319314,0.262445,0.231869,0.217057,0.207183,0.212301,0.206173
0.396753,0.413767,0.364237,0.331812,0.317359,0.262592,0.222634,0.234614,0.251426,0.250441,0.223754,0.230149,0.279118,0.324836,0.375305,0.388336,0.311354,0.229701,0.195822,0.255341,0.349859,0.344965,0.31089,0.285069,0.237893,0.213761,0.218939,0.208009
0.467536,0.483757,0.3887,0.301945,0.310884,0.271246,0.204443,0.226845,0.276228,0.267608,0.226197,0.239861,0.277963,0.309686,0.364873,0.383345,0.294311,0.210619,0.200706,0.267959,0.358022,0.338373,0.319793,0.308415,0.243068,0.212383,0.218965,0.210653
0.50608,0.500134,0.367569,0.258903,0.271518,0.237618,0.174953,0.20886,0.273096,0.254732,0.200351,0.227266,0.26088,0.258503,0.298516,0.317262,0.242541,0.198835,0.21064,0.240137,0.301798,0.281479,0.268084,0.265573,0.203089,0.176445,0.180554,0.176323
0.445516,0.405675,0.293984,0.210257,0.203179,0.18061,0.15196,0.175747,0.223813,0.215691,0.161232,0.18635,0.229554,0.212047,0.226995,0.227193,0.17954,0.192756,0.216188,0.199384,0.225322,0.219289,0.197398,0.193904,0.158685,0.142952,0.134689,0.126989
0.313276,0.25375,0.193493,0.159581,0.151431,0.148279,0.135058,0.12473,0.144949,0.156275,0.12527,0.136116,0.167732,0.155936,0.15695,0.145436,0.121892,0.162818,0.190178,0.156228,0.152602,0.151063,0.137507,0.151961,0.142009,0.125406,0.113872,0.104672
0.210262,0.174566,0.151586,0.148604,0.135701,0.126279,0.114595,0.084899,0.088423,0.101683,0.096712,0.103242,0.115556,0.111216,0.111003,0.097633,0.083046,0.117213,0.138791,0.109636,0.088634,0.090913,0.095885,0.11917,0.121193,0.105496,0.103533,0.101753
0.156913,0.147014,0.141686,0.151472,0.125916,0.104062,0.103871,0.083625,0.077014,0.070046,0.076774,0.098996,0.107336,0.103589,0.101952,0.089064,0.075211,0.082486,0.09242,0.082489,0.061461,0.060938,0.071563,0.090432,0.092939,0.07734,0.089237,0.1004
0.106922,0.11143,0.114446,0.13103,0.108061,0.088622,0.10168,0.094721,0.082079,0.067328,0.07702,0.096546,0.09774,0.099118,0.105792,0.095521,0.076272,0.071349,0.07882,0.078099,0.059828,0.052858,0.063962,0.081827,0.078804,0.05729,0.073252,0.089283
0.077738,0.080927,0.083596,0.096786,0.090002,0.083814,0.099059,0.099033,0.084097,0.070412,0.082123,0.090853,0.086031,0.090866,0.098156,0.093382,0.071437,0.065174,0.081305,0.086007,0.065983,0.055007,0.065803,0.076946,0.074051,0.058486,0.068217,0.080033
0.066607,0.071376,0.07749,0.089761,0.095918,0.094868,0.09395,0.087344,0.074005,0.07245,0.093808,0.095817,0.083785,0.080995,0.076159,0.075715,0.061778,0.056614,0.075299,0.085832,0.072988,0.065917,0.072769,0.070863,0.070965,0.068509,0.080348,0.087916
0.063298,0.067602,0.074486,0.089953,0.112878,0.108551,0.0851,0.072626,0.059677,0.0765,0.116159,0.109819,0.091027,0.082045,0.06018,0.060468,0.058955,0.052843,0.067405,0.085579,0.083101,0.079287,0.074424,0.059599,0.063087,0.077048,0.105777,0.111116
0.059827,0.06591,0.069556,0.075863,0.115043,0.118518,0.086794,0.075514,0.05871,0.081422,0.134429,0.115964,0.088764,0.089989,0.067074,0.063111,0.064042,0.054085,0.063914,0.09372,0.097749,0.084688,0.068082,0.047674,0.051474,0.077698,0.126258,0.133531
0.053646,0.06338,0.061549,0.054373,0.098519,0.11512,0.095596,0.088044,0.068094,0.084573,0.13332,0.113865,0.082806,0.088265,0.079771,0.073714,0.069111,0.065608,0.074621,0.104588,0.107252,0.080529,0.057465,0.048025,0.053808,0.072038,0.124506,0.136808
0.040606,0.051713,0.054398,0.048827,0.079002,0.093586,0.095541,0.095728,0.079005,0.079414,0.108808,0.103602,0.076901,0.074553,0.083593,0.078743,0.067034,0.079016,0.085371,0.098304,0.102375,0.075559,0.050457,0.054536,0.058968,0.058653,0.097736,0.112066
0.029046,0.037254,0.046352,0.048547,0.058534,0.063879,0.081875,0.089465,0.083429,0.069839,0.073367,0.077797,0.063747,0.060913,0.077856,0.077655,0.064457,0.090333,0.089322,0.075133,0.083502,0.070256,0.056803,0.064963,0.060437,0.049241,0.06741,0.075269
0.024785,0.033531,0.042542,0.044369,0.048646,0.050167,0.060812,0.069681,0.078974,0.07179,0.053433,0.049674,0.046385,0.047287,0.063802,0.065558,0.060851,0.098751,0.091279,0.061714,0.073294,0.067304,0.063485,0.068477,0.054217,0.045873,0.0537,0.056647
0.030049,0.036296,0.045871,0.043814,0.05423,0.055271,0.045771,0.050562,0.065798,0.072386,0.046815,0.03804,0.035975,0.037586,0.054477,0.052502,0.060336,0.105404,0.087941,0.054271,0.066011,0.060668,0.063285,0.061293,0.046906,0.046044,0.042766,0.047678
0.038974,0.041939,0.050571,0.043618,0.062183,0.064751,0.04219,0.039064,0.048868,0.064862,0.051601,0.042729,0.034669,0.031433,0.047487,0.049285,0.061084,0.104501,0.081236,0.041874,0.049627,0.053219,0.0601,0.046527,0.036272,0.046039,0.036112,0.038102
0.043611,0.048227,0.054822,0.045918,0.064571,0.070186,0.043408,0.032073,0.032847,0.052576,0.054764,0.04607,0.036018,0.027695,0.036709,0.045236,0.064437,0.0973,0.07376,0.029548,0.030883,0.046627,0.055672,0.034716,0.025826,0.041973,0.029489,0.027492
0.039571,0.047661,0.052283,0.042467,0.0564,0.064145,0.039296,0.030527,0.028755,0.042829,0.050751,0.042153,0.03624,0.026368,0.027775,0.038163,0.06227,0.080455,0.059163,0.021654,0.022111,0.038104,0.046742,0.03024,0.021575,0.033862,0.023274,0.021025
