4e-06,1.1e-05,1e-06,1.5e-05,2e-06,2.2e-05,1.5e-05,6e-06,8e-06,1e-05,2e-06,2.7e-05,6.2e-05,7.5e-05,5.6e-05,6.4e-05,8.7e-05,2e-06,3e-05,1.7e-05,2.5e-05,7.6e-05,5.6e-05,3.3e-05,3.7e-05,3.5e-05,3.2e-05,2.4e-05,2e-06,3.1e-05,5e-05,5.3e-05,1.4e-05,6.7e-05,8.2e-05,1.5e-05,1.6e-05,3.2e-05,2e-06,8e-06,1.4e-05,2.1e-05,6e-06,1e-06,6e-06,1.7e-05,3.7e-05,1.2e-05,1.8e-05,4.4e-05,9e-06,3.9e-05,3.1e-05,6.9e-05,3.3e-05,9.7e-05,9.1e-05,0.00014,7.5e-05,2.1e-05,1.2e-05,5e-05,2.7e-05,3.1e-05,8e-06,1.7e-05,1.5e-05,1e-05,1.3e-05,3e-06,4.6e-05,1.4e-05,2.8e-05,3.5e-05,2e-05,4e-05,3.1e-05,4e-06,1.7e-05,4e-06,2e-05,1.5e-05,3.2e-05,1.6e-05,1.1e-05,4.5e-05,3.1e-05,2.4e-05,6.1e-05,4e-06,7.4e-05,1.9e-05,7e-06,4.2e-05,2.6e-05,3e-06,2.5e-05,1.4e-05,5e-06,2.7e-05,2e-06,4.2e-05,1.6e-05,5.7e-05,6.6e-05,2.8e-05,1e-05,2.6e-05,3.5e-05,3.6e-05,6.3e-05,9.4e-05,6.8e-05,4e-05,5e-05,7.9e-05,8.6e-05,0.000116,2.8e-05,2.8e-05,5.3e-05
0.000107,4.8e-05,7.9e-05,8.3e-05,7e-06,6.4e-05,8.3e-05,8.1e-05,0.000124,0.000121,6.9e-05,0.000167,0.000244,0.000159,0.000165,0.000219,0.00033,0.000157,7.9e-05,0.000189,0.000219,0.000176,0.000219,0.000218,0.000154,0.000114,0.000149,2e-04,0.000147,0.000149,0.00018,0.000226,0.000144,0.000162,0.000249,9.9e-05,0.000127,9.9e-05,5.7e-05,9.6e-05,7.8e-05,8.4e-05,8e-05,3e-05,5.7e-05,8.7e-05,0.000139,6.8e-05,0.000105,0.000217,0.00011,0.000153,0.00019,0.000289,0.000161,0.000269,0.000337,0.000488,0.00039,0.000261,0.000137,0.000125,0.000196,0.000229,0.00019,7.1e-05,4.5e-05,5.3e-05,3.6e-05,0.00017,0.000165,0.000166,0.000154,3.5e-05,4.5e-05,0.000179,9.5e-05,2.9e-05,5.6e-05,6.7e-05,0.000144,0.000236,0.000239,0.000105,0.000154,0.000222,0.000108,7.4e-05,0.000241,0.000136,0.00026,7e-05,5e-05,0.000133,3.4e-05,4.3e-05,3.4e-05,2.1e-05,0.000103,7.7e-05,7.1e-05,9.6e-05,6.2e-05,0.000171,0.000264,0.000245,0.000216,0.000112,0.000122,0.000231,0.000242,0.000382,0.00037,0.000384,0.00028,0.000335,0.000339,0.000437,0.000278,0.000236,3.3e-05
0.000169,0.000159,0.000194,3.9e-05,5.6e-05,6e-05,0.000158,0.000188,2.6e-05,0.000125,0.000139,0.000182,0.000208,0.000373,0.000212,6.9e-05,0.000208,0.000201,8.8e-05,0.000198,0.000204,0.00014,0.000174,0.000161,0.000116,2.9e-05,7.3e-05,0.000141,8.1e-05,0.000171,0.000128,7.2e-05,0.000116,0.000131,0.00023,0.000164,0.000152,0.000223,7.1e-05,0.000156,3e-05,7.8e-05,2.2e-05,4.8e-05,8.9e-05,7e-05,9.9e-05,0.000168,8.1e-05,0.000221,0.000263,0.000227,0.000101,0.000259,5.4e-05,0.000141,0.000196,0.000125,0.000143,3.1e-05,8.7e-05,7.2e-05,0.000297,0.000108,3.8e-05,0.000196,0.000127,0.000109,5.8e-05,0.000213,8e-05,8.9e-05,4.6e-05,0.000101,5.6e-05,0.000273,0.000157,0.000111,2.9e-05,0.000137,0.000277,0.00035,0.000327,0.000138,0.000169,0.000321,0.000196,6.7e-05,0.000237,9.8e-05,0.000226,8e-05,9.2e-05,6.7e-05,0.000156,0.000147,8.1e-05,1e-05,0.000151,0.000144,8.9e-05,0.000135,0.000112,0.000224,0.000227,0.000227,4.6e-05,0.000209,0.000104,0.000219,6.8e-05,0.000252,0.000102,0.000268,0.000205,0.000147,0.000234,0.000158,0.000283,0.000186,0.000169
0.000182,8.2e-05,0.000152,0.000177,0.000138,0.000161,0.000147,0.000179,0.000146,4.7e-05,0.000293,0.000416,0.000197,0.000317,0.000314,9.7e-05,0.00024,0.000168,0.000285,0.000304,0.000274,0.000245,9.9e-05,0.000125,0.000201,0.000221,0.000155,0.000202,4.7e-05,0.000226,0.000117,0.000119,0.00023,0.00033,0.000193,0.000146,8.5e-05,9.5e-05,0.000294,0.000133,0.000104,3.4e-05,0.000149,0.000157,4.7e-05,0.000174,0.000198,0.000167,0.000184,0.000345,0.000258,0.000367,0.000262,0.000368,0.000383,0.000194,0.000157,7.3e-05,0.000126,3.2e-05,9.5e-05,6.2e-05,0.000327,0.000351,0.000219,0.000298,0.000136,7.2e-05,4.7e-05,0.00019,0.000233,4.3e-05,0.000173,0.000199,0.000294,0.000151,0.000126,8.6e-05,0.000113,0.000128,0.000123,0.000119,0.00024,0.000224,3.7e-05,0.000171,0.000239,9.8e-05,0.000145,0.000152,0.000129,0.000224,0.000318,0.000142,0.000252,0.000404,0.000526,0.00032,0.000233,0.000102,0.000152,0.000219,0.000307,0.000278,9.5e-05,0.000154,0.000272,0.000425,0.000259,0.000325,0.000237,0.000205,0.000323,0.000337,0.000239,0.000316,0.000237,0.00032,0.000142,0.000285,4.4e-05
0.000194,0.000116,0.000137,9.6e-05,0.000137,4e-05,0.000128,0.000361,0.000282,0.000186,0.000244,0.000267,7.4e-05,0.000233,0.000183,0.000258,6.8e-05,6.7e-05,0.000259,0.000195,0.000104,0.00012,0.00013,0.00011,0.000129,5.4e-05,0.000112,8e-05,6e-05,0.000187,7.5e-05,0.000105,0.000337,3.1e-05,0.000104,0.000198,0.000193,8.4e-05,0.000291,7.3e-05,6.1e-05,0.00015,0.000141,0.000197,5.2e-05,0.00019,0.000194,0.000203,0.000198,0.000205,6.8e-05,0.000322,0.00014,0.00032,0.000408,0.000174,8.6e-05,0.000134,0.000184,0.000145,5.8e-05,0.000166,0.000269,0.000283,0.000154,0.000318,0.000166,8.6e-05,0.000159,0.000153,0.000208,0.000382,4.3e-05,6.3e-05,0.000266,0.000164,0.000151,4.8e-05,6.3e-05,1e-04,0.000308,0.000286,7.7e-05,0.00023,0.00019,3.9e-05,9.8e-05,0.000133,0.000145,0.000201,0.000236,0.000321,0.000257,0.000161,0.000252,0.000151,0.000372,0.000149,3e-05,9.5e-05,0.000237,5.1e-05,0.000184,5.4e-05,0.000117,0.000208,0.000266,0.000147,0.000135,8.1e-05,0.000135,0.000309,0.000249,0.000611,0.000359,0.000157,0.000441,0.000183,0.000129,0.000238,0.000373
0.000377,0.000231,0.000124,0.000178,7.1e-05,7.9e-05,0.000195,0.000464,9.8e-05,0.000107,0.000321,0.000206,8.5e-05,0.000166,3e-05,0.000217,0.000229,0.00015,0.000138,5.7e-05,9.1e-05,7.9e-05,0.000125,3.8e-05,6.4e-05,0.000136,0.000192,0.000204,0.00028,0.000269,0.000216,6.8e-05,0.000207,0.000316,0.000315,0.000338,0.000131,3.3e-05,0.000292,0.00047,0.000316,0.000102,0.000241,9.5e-05,0.00016,0.000183,0.000142,0.000114,7e-05,0.000299,0.000302,0.000278,9.3e-05,0.000109,0.00011,0.000182,0.000181,0.000209,9e-05,0.000133,0.000202,0.00036,0.000207,2.9e-05,0.00013,0.000278,0.000242,8.9e-05,0.000184,6.8e-05,0.000248,0.000209,0.000282,8.7e-05,0.000207,0.000185,7.6e-05,0.000127,4.9e-05,0.000154,0.000328,0.000194,7.3e-05,0.000289,0.000268,0.000142,9.4e-05,0.00014,0.000179,9.5e-05,0.000142,0.000294,0.000144,9.7e-05,0.000231,0.000164,0.000157,0.000151,0.000169,0.000242,0.000325,0.000246,3.6e-05,0.000184,0.000113,0.000199,0.000388,0.000167,9.6e-05,4.8e-05,0.000148,0.000284,0.000357,0.000276,0.000179,0.000168,0.000288,0.000158,9.3e-05,0.000239,0.00029
0.000348,8.1e-05,7.7e-05,9.4e-05,6.4e-05,6e-05,0.000184,0.000161,0.000186,0.000137,0.00027,0.000222,6.5e-05,0.000203,9.9e-05,0.000223,0.00041,0.000274,0.000227,5.7e-05,0.000117,1.9e-05,0.000141,6.2e-05,0.000116,0.000284,7.4e-05,0.000127,0.000304,0.000165,9e-05,0.000255,0.000108,0.000198,0.000287,0.000225,0.00021,0.00016,0.000317,0.000273,0.000204,0.000328,0.000152,0.000138,0.000183,0.000165,0.000305,0.000221,6.3e-05,0.000201,0.000208,0.00032,0.000261,0.000141,0.000153,0.000157,0.000197,0.000303,0.000478,0.00045,0.000158,0.000158,0.000227,0.000157,0.000236,0.000107,8.6e-05,0.000206,0.000337,0.000298,0.000304,0.000306,0.000168,0.000163,0.00021,0.000157,6.2e-05,0.000129,7e-05,0.000414,2.9e-05,2.4e-05,0.000297,0.000137,0.000503,0.000176,0.000342,6.3e-05,0.000196,0.000378,0.000493,0.000408,0.00038,7.2e-05,0.000279,0.000281,0.000158,0.000156,0.00017,0.000153,0.000125,0.000149,0.000261,0.000231,0.000476,0.000277,0.000302,0.000146,0.00025,0.000139,6.5e-05,0.000172,0.000301,0.000306,0.000341,0.000112,0.000183,0.000271,0.000119,0.000229,0.000137
0.000196,0.000204,3.6e-05,1e-04,0.000109,4.8e-05,0.000197,7.7e-05,0.000121,6e-05,0.000156,0.000147,0.000189,0.000185,0.000216,0.000176,0.000361,0.000234,0.00019,0.000259,0.000151,0.000111,2.4e-05,9.8e-05,0.000251,0.00026,0.00022,0.000165,0.00017,0.000181,0.000203,0.00037,0.000342,8.2e-05,0.000142,0.000314,2.3e-05,5.2e-05,0.000266,0.000553,0.000192,0.00026,0.000587,0.000305,0.000129,0.000218,0.000327,0.000261,4.8e-05,0.00014,0.000149,0.000261,9e-05,3.8e-05,0.000186,0.000187,8.6e-05,0.000139,0.000297,0.000383,0.000484,0.000436,0.000218,0.000113,0.000207,0.000122,6.8e-05,9.9e-05,0.000292,0.000121,0.000104,0.000206,0.000267,0.000108,0.000302,0.000486,0.000315,5.7e-05,0.000116,0.000539,0.000598,0.000344,0.000288,0.000381,0.000267,0.000259,0.000508,0.000417,0.000243,0.000361,0.000263,0.000178,0.000281,0.00052,0.000398,0.000416,0.000427,0.000361,0.000212,0.000282,0.000289,0.000438,0.000402,0.000349,0.000576,0.000331,0.000197,0.000118,0.000374,0.000419,0.000269,0.000318,0.000425,0.00028,0.000196,0.000135,0.000276,0.000387,0.000194,0.000304,0.000412
0.00023,0.000137,0.000122,0.000192,0.000172,0.000228,0.000238,2e-04,4.6e-05,0.000178,9.2e-05,0.000245,0.000369,0.000414,0.000153,0.000273,0.000282,0.000262,3e-04,0.000209,0.000195,7.8e-05,0.000209,0.000233,0.00029,0.000439,0.000277,0.000113,0.000122,2.7e-05,0.000184,0.00032,0.000442,0.000526,0.000344,0.00031,0.000232,0.000111,0.000158,0.00026,0.000313,0.000156,0.000591,0.000582,0.000243,0.00034,0.000212,0.000352,0.000395,0.000284,0.000362,3.4e-05,9e-05,0.00016,0.000198,0.000179,0.000253,0.000124,0.000224,0.000147,0.000344,0.000219,0.000198,0.00014,0.00029,8.4e-05,0.000172,0.00022,0.000174,0.000235,7.7e-05,0.000316,0.000346,0.000367,6.1e-05,0.000264,0.000295,0.00026,0.000187,0.000375,0.000143,7.9e-05,0.000226,0.00019,0.000421,0.000413,0.000261,0.000246,0.00032,0.000485,0.000377,0.000244,0.000431,0.000359,0.000316,9.9e-05,0.000329,0.000458,0.000311,0.000318,0.000317,0.000234,7.8e-05,0.000334,0.000378,0.000504,0.000394,0.000179,0.000214,0.000399,0.000223,0.000164,0.000497,5e-06,0.000113,0.00011,0.000209,0.000163,0.000201,0.000262,0.000196
0.000403,0.000219,0.000164,0.000263,0.000243,0.000313,0.000319,0.000273,0.000279,0.000367,0.00029,0.000157,0.000177,0.000354,0.000179,0.000128,0.00012,6.1e-05,0.000233,0.000424,0.000186,5.3e-05,0.00026,0.000213,0.000232,7.4e-05,4.6e-05,0.000203,0.000271,0.000217,6.3e-05,0.000158,0.000186,0.000298,0.000203,7.6e-05,0.000165,7.6e-05,8.1e-05,0.000262,0.000164,3.2e-05,0.000327,0.000448,0.000358,0.000176,0.000191,0.000227,0.000229,6.9e-05,0.000203,0.000186,0.000136,0.000167,0.000269,0.000171,0.000132,0.000181,0.000164,0.00016,0.000136,0.000351,0.000312,0.000151,0.000316,0.00032,0.000335,0.000224,0.000145,0.000128,0.000136,0.000334,9.6e-05,0.000187,0.000165,0.000248,9.5e-05,2.4e-05,0.000165,0.000184,0.000225,0.00015,8.9e-05,1e-04,0.00022,0.000245,0.000319,8.7e-05,0.000256,0.000142,0.000238,0.000149,0.000189,0.000238,0.000143,0.000231,0.000335,0.000155,0.000206,0.000117,0.000109,0.000243,0.00014,0.00024,0.000303,0.000194,6.2e-05,0.000109,8.8e-05,0.000113,4.2e-05,0.000227,0.000407,0.000511,0.000491,0.00013,0.000164,0.000101,0.000195,0.000123,0.000228
0.000166,3e-05,6.8e-05,0.000177,0.000181,7.4e-05,8.6e-05,0.000102,0.000141,0.000179,0.000199,0.000226,0.000376,0.000241,0.000224,8.4e-05,0.000157,0.000165,5.5e-05,0.000204,0.000169,0.000134,0.000144,9e-05,4e-05,5.6e-05,4.1e-05,0.000201,5e-05,4.7e-05,1e-04,0.000141,5.9e-05,0.000202,0.000141,6.2e-05,9.5e-05,5.4e-05,2.9e-05,0.000165,7.7e-05,8.4e-05,8.4e-05,0.00029,0.000154,0.000114,0.000109,0.000142,8.8e-05,0.000144,0.000109,0.000101,8.9e-05,0.000247,0.000167,0.000102,0.000134,0.000154,0.000136,8.9e-05,0.000106,0.000102,9.5e-05,0.000107,0.000157,0.000288,0.000208,0.000117,3.3e-05,0.000131,1.5e-05,0.000129,0.000133,0.000223,0.000167,0.000115,2.4e-05,2.6e-05,8.1e-05,8e-05,0.000131,0.000135,0.00015,6e-05,0.000184,0.000142,4.2e-05,4.1e-05,0.000154,0.000112,5.5e-05,0.000177,0.00013,0.000111,7.6e-05,8.7e-05,0.000181,0.000332,0.000162,0.000157,4.5e-05,8.3e-05,5e-05,0.000142,0.000158,0.000194,7.7e-05,0.000139,0.000151,0.000136,8.3e-05,0.000213,0.000117,0.000168,0.000226,0.000239,0.000206,0.000104,0.000111,1e-04,0.000195
4.3e-05,3.6e-05,8.9e-05,6.6e-05,5.8e-05,5.5e-05,2.7e-05,5.6e-05,2.4e-05,0.000108,4.8e-05,8e-05,0.000137,3.6e-05,8.2e-05,0.000109,7.3e-05,5.2e-05,3.7e-05,4.2e-05,4.5e-05,4.3e-05,8.9e-05,5e-05,5.4e-05,6.1e-05,2.9e-05,8.1e-05,7.5e-05,4e-05,5.2e-05,7.8e-05,7.1e-05,3.8e-05,6e-05,6.5e-05,1.7e-05,6.4e-05,7.6e-05,8e-06,9e-06,0.000115,0.000111,0.000129,2.7e-05,2.3e-05,5.7e-05,4.5e-05,5.7e-05,0.000104,0.000109,2.9e-05,3.4e-05,0.00013,4.7e-05,2.6e-05,9.8e-05,8.3e-05,3.6e-05,5.1e-05,8e-05,8.7e-05,7.9e-05,4e-05,0.000116,0.000111,4.2e-05,0.000104,3.5e-05,6.6e-05,5.4e-05,7.2e-05,0.000135,9.1e-05,7e-06,6.5e-05,4e-05,1.8e-05,3.6e-05,4.5e-05,9.3e-05,3.3e-05,7.3e-05,1.1e-05,6.2e-05,6.4e-05,1.6e-05,6.2e-05,7.1e-05,2.9e-05,4.8e-05,0.00014,6.3e-05,4.9e-05,2.4e-05,3.8e-05,7.9e-05,0.00012,5.7e-05,3.6e-05,2.8e-05,5.5e-05,7.9e-05,5.1e-05,5.9e-05,9.6e-05,6.4e-05,4.2e-05,5.1e-05,4.1e-05,2e-05,0.00015,4.2e-05,0.00012,4.2e-05,5.5e-05,1.7e-05,2.2e-05,2e-05,7.6e-05,0.000125
4.1e-05,5.4e-05,6.1e-05,3.5e-05,9.1e-05,3.7e-05,4.3e-05,6.7e-05,6.6e-05,6.8e-05,6.6e-05,2.6e-05,6.6e-05,8e-06,9.3e-05,0.000115,2.2e-05,4.7e-05,5.2e-05,9.5e-05,1.3e-05,6.7e-05,8.4e-05,6.7e-05,4.5e-05,0.000113,4.3e-05,6e-05,1.6e-05,4.3e-05,9.8e-05,7.5e-05,3.7e-05,5.7e-05,7.7e-05,5e-05,5e-06,3.4e-05,1.9e-05,7.5e-05,6e-06,7.4e-05,9.3e-05,0.000103,3e-05,2e-05,5.2e-05,5.1e-05,6.2e-05,6.5e-05,5.1e-05,3.7e-05,3.5e-05,6.7e-05,6.5e-05,2.4e-05,9e-05,1.3e-05,2.2e-05,4.5e-05,6e-05,5e-05,2.7e-05,7.7e-05,9.6e-05,0.000107,4.8e-05,7e-05,2.8e-05,7e-05,4.9e-05,7.7e-05,5.2e-05,8.9e-05,4.9e-05,5.4e-05,2.3e-05,4.4e-05,5.6e-05,7.5e-05,7.2e-05,2.3e-05,8.3e-05,1.9e-05,1.3e-05,2.4e-05,3.7e-05,4.4e-05,4.2e-05,4.1e-05,6.1e-05,0.000115,8.2e-05,5e-05,8e-06,7.6e-05,4.1e-05,0.000134,3.7e-05,6.5e-05,1.8e-05,1.5e-05,4.7e-05,7.3e-05,9.8e-05,7.4e-05,4.5e-05,6e-05,1.5e-05,1.9e-05,4.6e-05,0.000106,3.6e-05,6.3e-05,6.8e-05,2.7e-05,2.8e-05,7.2e-05,7.3e-05,6e-05,3.7e-05
6.3e-05,5.6e-05,5.1e-05,5.5e-05,0.000177,0.000102,5.2e-05,3.8e-05,0.000107,2.4e-05,5.1e-05,4.8e-05,0.000166,8.1e-05,0.000121,0.000189,0.000125,9.3e-05,9.1e-05,6.7e-05,5.5e-05,2.3e-05,0.00011,8.8e-05,7.8e-05,0.000104,4.7e-05,0.000123,0.000103,9.9e-05,8.1e-05,7e-05,2.2e-05,5.5e-05,6.7e-05,0.00015,9.2e-05,5e-05,1.6e-05,0.00012,0.000133,3.3e-05,2.6e-05,9.2e-05,6.2e-05,5.5e-05,5.6e-05,1.9e-05,5.7e-05,9.6e-05,7.1e-05,2.4e-05,6.9e-05,0.000102,8.7e-05,5.5e-05,9.4e-05,6.8e-05,7.1e-05,6.9e-05,2.7e-05,6.9e-05,5.3e-05,6.8e-05,2.1e-05,4.3e-05,3.4e-05,8.2e-05,6.9e-05,0.000122,3.2e-05,0.000103,3.1e-05,2.5e-05,5.5e-05,5.2e-05,4.9e-05,5.5e-05,0.000114,7.8e-05,0.00014,1.6e-05,0.000105,6.9e-05,5.4e-05,4.2e-05,2.9e-05,6.4e-05,7.5e-05,2.2e-05,3.8e-05,8e-05,7.7e-05,0.000131,7.6e-05,9.7e-05,1.2e-05,8.3e-05,7.1e-05,0.000131,3.1e-05,8.5e-05,6.1e-05,0.000111,8.8e-05,0.000106,8.8e-05,4.7e-05,2.4e-05,7.5e-05,6.4e-05,5.9e-05,2.2e-05,7.4e-05,9.3e-05,7.4e-05,1.8e-05,9.6e-05,0.000112,0.000134,3.7e-05
5.3e-05,6e-05,2.7e-05,9.6e-05,0.000121,0.000114,0.000114,5.2e-05,4.2e-05,5.8e-05,6e-05,9.4e-05,0.000128,2.8e-05,8.3e-05,0.000113,9.2e-05,5.9e-05,2.7e-05,4.1e-05,6.3e-05,0.00012,0.000153,6.5e-05,8.2e-05,4.3e-05,2.9e-05,0.00015,8.8e-05,0.000102,7.8e-05,6.5e-05,7.7e-05,0.000141,1.9e-05,0.000122,5e-05,0.000111,6.4e-05,0.000108,0.000106,8.9e-05,7.5e-05,1.5e-05,9.8e-05,7.6e-05,9.2e-05,5.3e-05,9.3e-05,8.3e-05,5.2e-05,1.1e-05,8.5e-05,5.1e-05,3.8e-05,3.7e-05,9.3e-05,8.9e-05,7.7e-05,4.8e-05,8e-05,1.3e-05,7.8e-05,5.4e-05,6e-05,5.6e-05,9e-05,6.1e-05,6.3e-05,0.000154,9.6e-05,1e-04,9.1e-05,6.2e-05,7.6e-05,2.8e-05,4e-05,5.4e-05,4.3e-05,0.000158,5.4e-05,0.000142,0.000111,0.000134,6.5e-05,9.6e-05,1e-04,9e-05,0.000142,0.000115,9.3e-05,0.000106,0.000131,0.000181,9.6e-05,2.7e-05,0.000102,6.7e-05,6.1e-05,8.1e-05,8.1e-05,0.000159,0.000129,0.000149,0.000117,0.000152,0.000109,0.000118,8.7e-05,4.3e-05,7e-06,8.2e-05,2.2e-05,1.9e-05,0.000143,8.9e-05,3.2e-05,7.4e-05,5.3e-05,3.3e-05,0.000137
6.5e-05,2.2e-05,5.1e-05,6.9e-05,4.2e-05,6.4e-05,5.1e-05,9e-05,6e-06,2.2e-05,6.6e-05,3.4e-05,0.000106,5.5e-05,0.000151,3.1e-05,6.7e-05,5.8e-05,9.5e-05,2.7e-05,2e-05,0.000113,8.4e-05,0.000147,3.7e-05,3.9e-05,6.6e-05,0.000119,6.2e-05,7.3e-05,9e-06,9.5e-05,0.000108,4.8e-05,4.5e-05,8.9e-05,3.8e-05,9e-05,1.1e-05,5.9e-05,3.3e-05,1.7e-05,7e-05,1.9e-05,6e-05,2.7e-05,5.3e-05,9.9e-05,7.4e-05,1.7e-05,4.7e-05,2e-06,3.9e-05,5.7e-05,0.000105,3.1e-05,9.6e-05,3.9e-05,8e-05,2.2e-05,7.2e-05,0.000129,9.6e-05,9.8e-05,5.5e-05,5.9e-05,6.9e-05,0.000146,2.1e-05,7.8e-05,3.9e-05,1e-05,4.8e-05,1.4e-05,3.1e-05,4.8e-05,5.4e-05,1.5e-05,5.5e-05,8.4e-05,5.4e-05,0.000123,0.000107,7.8e-05,4.5e-05,8.3e-05,4.9e-05,3.3e-05,0.000101,0.000117,5e-05,0.000152,8.3e-05,2.6e-05,0.000108,0.000145,6.5e-05,5.1e-05,2.1e-05,4.4e-05,0.000117,0.000128,7.5e-05,6.2e-05,7.6e-05,6.6e-05,5.6e-05,0.000126,2.7e-05,9.3e-05,8.1e-05,4.7e-05,3.3e-05,2.8e-05,7.8e-05,2.2e-05,4e-06,7.8e-05,7.6e-05,1.5e-05,9.4e-05
8.8e-05,4.8e-05,4.5e-05,3.8e-05,8.9e-05,5.1e-05,5.2e-05,8.4e-05,6e-05,8e-05,5.3e-05,7.4e-05,7.8e-05,5.7e-05,0.000124,0.000118,6e-05,6.8e-05,6.4e-05,0.000104,8.9e-05,8.8e-05,8.6e-05,7.6e-05,5.1e-05,8e-06,4.4e-05,0.000137,0.000135,8.3e-05,3.5e-05,5.9e-05,8.1e-05,5.1e-05,6.4e-05,5.3e-05,5.6e-05,1.7e-05,5.4e-05,0.000106,5.4e-05,4.1e-05,7.7e-05,5.6e-05,2e-05,3.2e-05,6e-05,4.1e-05,7.8e-05,0.00011,8.5e-05,1.8e-05,3.9e-05,6.7e-05,7.8e-05,7.9e-05,0.000118,1e-05,0.000107,5.4e-05,2.9e-05,6.8e-05,5.1e-05,7.5e-05,5.3e-05,9.9e-05,1.9e-05,7.9e-05,5.4e-05,8.3e-05,9e-05,8.7e-05,6.3e-05,4e-05,2.4e-05,4.2e-05,3.1e-05,1.5e-05,2.8e-05,6.1e-05,5.1e-05,1.2e-05,7.5e-05,1.3e-05,3.9e-05,9.3e-05,0.000135,0.000115,6.7e-05,5.2e-05,2.5e-05,7.9e-05,0.000116,0.000117,0.000157,6e-05,8.5e-05,0.00014,4.2e-05,3.9e-05,0.000115,9.6e-05,8e-05,4.7e-05,0.000108,7.8e-05,0.000131,5.4e-05,2.9e-05,0.000112,4.8e-05,5.2e-05,5.6e-05,9e-06,3e-05,7.1e-05,2.8e-05,5.2e-05,6.4e-05,1.8e-05,9.1e-05
4.6e-05,1.5e-05,3.8e-05,0.000112,5e-05,6.8e-05,2.7e-05,5.5e-05,5.1e-05,0.000115,0.000101,9.5e-05,0.000168,8.7e-05,0.000147,9.4e-05,6.6e-05,0.000111,8e-05,9.4e-05,0.000146,0.000119,0.000118,0.000198,0.00013,8.8e-05,4.3e-05,5.7e-05,7.8e-05,9.3e-05,3.3e-05,5.1e-05,0.000123,8e-06,9.2e-05,4.6e-05,8.2e-05,1.5e-05,4.9e-05,3.6e-05,1.4e-05,5.4e-05,9e-05,0.000141,6.1e-05,8.3e-05,2.9e-05,5.6e-05,6.9e-05,8e-05,4.4e-05,6.1e-05,0.000106,3.1e-05,0.000106,0.000111,0.000158,9.1e-05,8.6e-05,5.9e-05,5.6e-05,6.3e-05,0.000131,0.000106,7.1e-05,0.000176,7e-05,5.5e-05,8.4e-05,3.7e-05,3.2e-05,7.4e-05,9.3e-05,0.000125,1e-04,1.4e-05,6.7e-05,8.8e-05,3.7e-05,8.8e-05,0.000105,7.3e-05,6.2e-05,9.5e-05,4.2e-05,6.8e-05,7.6e-05,2.9e-05,5.5e-05,3.9e-05,2.6e-05,6e-05,9.6e-05,5e-05,2.8e-05,6e-06,1.5e-05,9e-05,0.000144,0.000143,5.4e-05,6e-05,4.3e-05,7.4e-05,5.2e-05,6.5e-05,6.9e-05,0.000134,0.000105,3.6e-05,2.5e-05,3.3e-05,2.3e-05,4.6e-05,2.2e-05,7e-05,6.6e-05,4.6e-05,0.000102,7.4e-05,0.000128
0.000124,9.9e-05,4e-05,9.1e-05,7e-05,6.3e-05,0.000113,5.1e-05,0.000122,8e-05,2.1e-05,7.1e-05,0.000153,9.4e-05,8.2e-05,4.2e-05,0.000109,6.4e-05,7.1e-05,3.4e-05,0.000152,1.3e-05,3.6e-05,0.00014,2.3e-05,9.2e-05,7.6e-05,0.000138,0.000225,8.3e-05,6.8e-05,5.4e-05,8.4e-05,0.000113,0.000121,9.6e-05,8.7e-05,9.5e-05,5e-05,5.8e-05,8.2e-05,3.9e-05,0.000123,0.000132,0.000134,7.6e-05,0.000105,0.000134,0.000105,4.9e-05,0.000111,9.3e-05,8.5e-05,0.000133,0.000141,0.000143,0.000266,9.9e-05,0.000127,1e-06,0.000109,1e-04,2e-04,7.5e-05,4.1e-05,0.000136,0.000106,0.000111,0.000181,6.9e-05,8.2e-05,9.9e-05,7.2e-05,0.000109,0.000202,0.000155,3.4e-05,5.6e-05,1.3e-05,5.9e-05,5e-05,0.000156,0.000149,0.000218,8.8e-05,8.5e-05,7.7e-05,6.1e-05,7.1e-05,6.2e-05,0.000102,0.000205,7.2e-05,0.000109,7.3e-05,4.2e-05,5.2e-05,4.1e-05,0.000185,8.4e-05,3.5e-05,6.1e-05,8.2e-05,8.8e-05,6.6e-05,7.8e-05,0.000102,0.000101,2e-05,8.4e-05,3e-05,9.1e-05,0.000105,1.4e-05,8.7e-05,6e-05,3e-05,6.3e-05,0.000117,0.000127,3.2e-05
7.3e-05,8.4e-05,0.00011,8.2e-05,6.6e-05,9.4e-05,0.000157,0.000167,0.00021,0.00022,0.000155,0.000108,9.7e-05,0.000133,0.000102,4.6e-05,9e-05,0.000121,0.000212,0.000156,0.000112,0.000158,8.5e-05,0.000131,0.000149,0.000158,8.7e-05,0.000142,0.000276,0.000133,9.5e-05,7.3e-05,6.6e-05,4.9e-05,0.000203,0.000135,7.8e-05,2.8e-05,3.1e-05,2.6e-05,6.4e-05,0.000104,8.7e-05,4.2e-05,5.5e-05,0.000123,0.000128,0.000102,0.000189,9.3e-05,0.000162,0.000129,0.000126,7.3e-05,0.000116,0.000154,0.000145,0.000101,0.000211,0.000147,7.8e-05,5.9e-05,0.000187,0.000139,7.6e-05,7e-05,0.000119,4e-05,0.000145,0.00016,0.000201,0.00017,0.000142,0.000182,0.000123,1.6e-05,8.6e-05,0.000147,0.000127,0.000177,0.000169,0.000245,9.5e-05,0.000146,0.000169,0.000129,0.000109,6e-05,9.3e-05,4.2e-05,0.000103,0.000119,0.000127,0.000126,6.4e-05,3.9e-05,4.1e-05,9.9e-05,0.000202,0.00013,1.6e-05,6.1e-05,7.5e-05,6.9e-05,8.8e-05,7.5e-05,9.3e-05,0.000116,0.000156,0.00016,9.2e-05,0.000162,0.000103,6.1e-05,0.000147,0.000179,0.000187,5.3e-05,7.3e-05,5.2e-05,0.000114
0.000112,5.6e-05,7.9e-05,0.000124,0.000158,0.000125,0.000118,0.000121,5.4e-05,9.9e-05,9.9e-05,1.7e-05,4.8e-05,7.1e-05,2.7e-05,8.2e-05,0.000106,0.000121,9e-05,4.3e-05,2e-06,0.000112,6.7e-05,7.1e-05,0.000142,0.00012,5.1e-05,0.000115,6e-05,7.4e-05,6.5e-05,8.5e-05,2.7e-05,4.6e-05,0.000107,0.000107,7.8e-05,7.1e-05,3.7e-05,5e-05,9.5e-05,7.3e-05,3.4e-05,7e-05,5.8e-05,6.8e-05,2.7e-05,4.8e-05,0.000162,0.000111,0.000115,6.8e-05,2e-06,5.9e-05,0.000107,8.7e-05,0.000205,0.000195,9.2e-05,8.8e-05,5.6e-05,0.000108,9.1e-05,5.2e-05,5.4e-05,5e-05,6.4e-05,0.000119,3.4e-05,6e-05,0.000108,3.5e-05,3.7e-05,0.000129,6.2e-05,4e-05,1e-06,9.5e-05,0.000121,7.9e-05,8e-05,5.1e-05,6.6e-05,0.000116,5.6e-05,2.8e-05,1.5e-05,3.9e-05,8.7e-05,2.9e-05,4.4e-05,4.7e-05,4.1e-05,3.7e-05,9.5e-05,0.000135,9.8e-05,3.7e-05,9.7e-05,0.000121,0.000117,6.6e-05,0.000109,8.2e-05,4.7e-05,7.6e-05,4.1e-05,4.8e-05,0.000151,3.4e-05,3.6e-05,0.000167,3.3e-05,1.4e-05,0.000134,0.000102,6.9e-05,5.7e-05,8.7e-05,5.9e-05,4.8e-05
8.6e-05,5.7e-05,5.6e-05,9.3e-05,8.1e-05,8e-06,9.6e-05,3.5e-05,3.6e-05,0.000154,5.7e-05,2.8e-05,6.9e-05,5.7e-05,5.4e-05,7.3e-05,0.000102,5.4e-05,1e-04,5e-05,9.4e-05,5e-05,4.6e-05,4.9e-05,3.2e-05,3.4e-05,1.4e-05,5.7e-05,6.9e-05,0.000118,6e-05,3.4e-05,7.6e-05,6.9e-05,2e-05,5.5e-05,3.1e-05,5.7e-05,1.3e-05,8.5e-05,4e-05,3.3e-05,0.000105,8.4e-05,4e-05,3.1e-05,2.6e-05,2.1e-05,9.4e-05,5.6e-05,3.6e-05,3.2e-05,9e-06,4.5e-05,1e-05,9.3e-05,4e-05,3.9e-05,6.1e-05,5.7e-05,0.000104,5.6e-05,4.9e-05,2e-05,4.6e-05,2.1e-05,6.6e-05,7.4e-05,0.000147,7.1e-05,7.5e-05,1.7e-05,4.7e-05,2.9e-05,0.000114,5.6e-05,5.5e-05,5.3e-05,2.3e-05,0.000108,2.9e-05,5.1e-05,5.3e-05,6.5e-05,4.9e-05,5.1e-05,1.3e-05,1.7e-05,6.2e-05,5.9e-05,4.1e-05,2.7e-05,4.1e-05,7e-06,4.9e-05,7.9e-05,4.5e-05,5.4e-05,5.1e-05,6.3e-05,3.4e-05,8.6e-05,3.5e-05,2.6e-05,8.1e-05,6.1e-05,2.6e-05,7.5e-05,0.000122,0.000114,9e-05,0.000142,4.6e-05,2.8e-05,8.4e-05,5e-05,1.6e-05,2.9e-05,7.7e-05,4e-05,4.7e-05
2.1e-05,1e-05,3.3e-05,3.5e-05,1.2e-05,1.3e-05,3.8e-05,3e-05,5e-06,5.5e-05,5.4e-05,3.8e-05,3.7e-05,3.7e-05,4.5e-05,4.3e-05,1.4e-05,1e-05,2.6e-05,1.9e-05,4.8e-05,5.7e-05,4.9e-05,2.8e-05,2.7e-05,2e-06,1.7e-05,1.5e-05,1.4e-05,3.6e-05,1.5e-05,8e-06,2e-05,4e-05,2.1e-05,1.2e-05,1.2e-05,1.7e-05,2.7e-05,3.4e-05,1.5e-05,2e-05,3e-05,2.1e-05,3.6e-05,2.4e-05,1.5e-05,1.2e-05,3.3e-05,3.1e-05,5.1e-05,5.7e-05,4.6e-05,1.2e-05,3.4e-05,1.7e-05,1.9e-05,2.1e-05,3.7e-05,1.8e-05,2.7e-05,2.3e-05,2.8e-05,1.6e-05,7e-06,1.5e-05,3e-05,2.4e-05,6e-05,6.1e-05,5.1e-05,1.7e-05,2.3e-05,6e-06,5.5e-05,2.6e-05,4.6e-05,2.6e-05,1.9e-05,3.2e-05,2e-05,5.4e-05,2.1e-05,2e-06,5e-06,2.1e-05,3e-05,2.6e-05,1.8e-05,3.9e-05,4.9e-05,1.4e-05,1.4e-05,1.3e-05,3e-05,1.8e-05,1.3e-05,1.2e-05,2.7e-05,1.6e-05,3.1e-05,3.4e-05,3.5e-05,3.3e-05,1.7e-05,2.7e-05,2.3e-05,4.2e-05,1.3e-05,2.5e-05,5e-06,3.3e-05,3.4e-05,4.1e-05,1.3e-05,1e-05,2.3e-05,8e-06,1.8e-05,2.4e-05,1.5e-05
2.6e-05,2.7e-05,1.4e-05,4.8e-05,2.9e-05,8e-06,3.2e-05,3.8e-05,1.5e-05,3e-05,1e-05,4.9e-05,1.6e-05,1.4e-05,1.6e-05,6.1e-05,5.5e-05,1.8e-05,1.5e-05,3.1e-05,3.7e-05,4.1e-05,3.8e-05,2.3e-05,3.5e-05,1.2e-05,3.4e-05,5.1e-05,5.4e-05,9e-06,6e-06,1.3e-05,2.9e-05,2.6e-05,2.5e-05,1.9e-05,1.3e-05,1.4e-05,3.3e-05,4e-05,6e-06,2e-05,1.6e-05,1.7e-05,6e-05,1.4e-05,3.3e-05,2.4e-05,2.8e-05,1.7e-05,3.7e-05,4.4e-05,1e-05,3.5e-05,3.1e-05,3.5e-05,1.7e-05,1.8e-05,4.3e-05,2.6e-05,1e-05,4e-06,3.5e-05,1.3e-05,2e-05,7e-06,2.2e-05,1.8e-05,2.3e-05,3.8e-05,7e-06,2.3e-05,1.8e-05,2.2e-05,2.1e-05,1.7e-05,5.1e-05,2.6e-05,3.6e-05,1.8e-05,1.9e-05,3.8e-05,2.1e-05,9e-06,2.7e-05,2e-05,2.7e-05,1.6e-05,1.8e-05,8e-06,2e-05,2e-06,2.5e-05,2.2e-05,2.3e-05,1.7e-05,4.4e-05,2.5e-05,5.5e-05,4.9e-05,2.4e-05,5e-05,1.1e-05,8e-06,1.4e-05,1.1e-05,1.8e-05,1.2e-05,3e-05,2.3e-05,3e-05,3.3e-05,2.8e-05,1.5e-05,4e-06,5e-06,4.5e-05,2.6e-05,2e-06,1.1e-05,1.1e-05
3.3e-05,1.4e-05,7e-06,5.7e-05,8e-06,1.6e-05,2.2e-05,6e-05,3e-05,1e-05,1.5e-05,5.3e-05,3.9e-05,1e-05,1.8e-05,1.8e-05,2e-05,2.3e-05,2e-06,2.2e-05,2.1e-05,2.7e-05,1.9e-05,2.6e-05,4.2e-05,3e-05,4.8e-05,1.3e-05,3.6e-05,4.6e-05,2.8e-05,3.5e-05,4.7e-05,3e-05,1.7e-05,2.7e-05,2.7e-05,3e-05,3.3e-05,2.1e-05,2.4e-05,1.3e-05,5e-06,2e-05,2.5e-05,2.6e-05,3.1e-05,2.5e-05,2.8e-05,2.5e-05,2.8e-05,3.8e-05,5.1e-05,2e-05,4.9e-05,4.7e-05,2.6e-05,2.1e-05,2e-05,2.3e-05,1.5e-05,1.8e-05,1.3e-05,1.4e-05,3.3e-05,3.2e-05,2.8e-05,3.2e-05,2.7e-05,2.9e-05,2.3e-05,8e-06,2.2e-05,7e-06,1.9e-05,7e-06,4e-05,3.8e-05,1.1e-05,3.5e-05,3.9e-05,2.2e-05,1.3e-05,2.5e-05,6e-06,3.2e-05,2.9e-05,3.3e-05,3.6e-05,4e-06,3.2e-05,9e-06,3e-05,2e-06,1e-05,1.1e-05,3.5e-05,4.4e-05,1.2e-05,2.4e-05,4.6e-05,2e-05,2.6e-05,1.9e-05,2.3e-05,8e-06,1.1e-05,3.1e-05,3.2e-05,3.9e-05,2.5e-05,6.8e-05,4.6e-05,3.7e-05,1.7e-05,1e-05,3e-05,2.7e-05,3.1e-05,1.6e-05,2.3e-05
4e-06,2e-06,1.9e-05,2.2e-05,4.6e-05,3.9e-05,1.6e-05,2.5e-05,2.8e-05,1.6e-05,2e-05,6e-05,3.5e-05,1.8e-05,2.1e-05,3.8e-05,2e-05,5e-06,6e-06,7e-06,3.2e-05,1.8e-05,1.9e-05,1.8e-05,1.2e-05,5e-06,2.8e-05,1.9e-05,2.3e-05,1.6e-05,1.4e-05,2.2e-05,2.2e-05,1.7e-05,2.9e-05,7e-06,2.3e-05,9e-06,2.3e-05,7e-06,2.4e-05,2.7e-05,2.8e-05,8e-06,7e-06,1.2e-05,8e-06,1.7e-05,1.6e-05,2e-06,2.6e-05,2.3e-05,2.2e-05,2.8e-05,1.1e-05,2.2e-05,8e-06,1.9e-05,2.2e-05,3.2e-05,3.2e-05,1.3e-05,2.2e-05,8e-06,2.4e-05,2.5e-05,2.7e-05,2e-06,1.4e-05,3.2e-05,4.2e-05,4e-05,1.2e-05,2.3e-05,1e-05,2.9e-05,4.3e-05,2.2e-05,9e-06,9e-06,2.6e-05,1.7e-05,1.5e-05,2.4e-05,3.7e-05,2.5e-05,1.6e-05,2.1e-05,4.7e-05,5.5e-05,3.5e-05,4.1e-05,3.6e-05,1.8e-05,1.2e-05,1.8e-05,8e-06,4.2e-05,2.7e-05,1.9e-05,2.9e-05,1.5e-05,3.5e-05,2.5e-05,2.7e-05,7e-06,1.6e-05,2.9e-05,1.1e-05,6e-06,3.2e-05,3e-05,2.9e-05,5e-06,3e-06,5e-06,1.6e-05,8e-06,2.1e-05,1.1e-05,9e-06
7e-06,1.4e-05,8e-06,1.1e-05,1.8e-05,4e-06,1.1e-05,1.1e-05,1.1e-05,5e-06,2.3e-05,1.5e-05,1.5e-05,1e-06,2.1e-05,3.5e-05,2.3e-05,7e-06,4e-06,2e-06,1.6e-05,1e-06,9e-06,1.6e-05,1.8e-05,8e-06,1.3e-05,1.2e-05,1.2e-05,1.3e-05,2.2e-05,1.1e-05,9e-06,1.2e-05,1.6e-05,1.6e-05,2.3e-05,2.6e-05,1.9e-05,2.6e-05,1.2e-05,1.3e-05,3.2e-05,1.9e-05,1.7e-05,1.9e-05,3e-05,2.8e-05,2.1e-05,1.1e-05,3.4e-05,1.4e-05,5e-06,2.2e-05,1e-05,2e-05,1.1e-05,1.8e-05,2.4e-05,7e-06,2.4e-05,1.2e-05,1.9e-05,1.1e-05,1.3e-05,2.8e-05,2.1e-05,2.3e-05,9e-06,7e-06,2.9e-05,3e-06,8e-06,1.8e-05,1.1e-05,3.9e-05,3.2e-05,7e-06,8e-06,1.2e-05,1e-05,9e-06,1.2e-05,1.1e-05,2.6e-05,1.7e-05,2.5e-05,6e-06,2.5e-05,1.2e-05,2.2e-05,2.5e-05,1e-05,1.5e-05,3.4e-05,1.6e-05,2.3e-05,8e-06,1e-05,1.5e-05,3e-06,5e-06,2.9e-05,2e-06,8e-06,1.8e-05,1.5e-05,1e-05,2.9e-05,2.2e-05,2.6e-05,3.9e-05,2.9e-05,2.9e-05,2.4e-05,1.3e-05,1e-05,2.1e-05,2e-05,1e-05,5e-06
1.3e-05,8e-06,1.2e-05,2.4e-05,1.2e-05,8e-06,1.9e-05,1e-05,1.5e-05,2.3e-05,2.2e-05,1.8e-05,6e-06,1.4e-05,7e-06,1e-05,1.3e-05,1.7e-05,1.9e-05,1.2e-05,7e-06,8e-06,5e-06,1.1e-05,1.5e-05,2e-05,2.4e-05,8e-06,1.6e-05,1.8e-05,2.6e-05,1.5e-05,2.2e-05,4e-06,1.7e-05,6e-06,1.5e-05,5e-06,2.6e-05,1.9e-05,1.9e-05,2.4e-05,1.5e-05,9e-06,1.3e-05,6e-06,2.4e-05,2.1e-05,1.4e-05,9e-06,2.7e-05,1.6e-05,9e-06,1.3e-05,1.6e-05,1.1e-05,1.4e-05,5e-06,2e-05,1.4e-05,2.6e-05,2.3e-05,2e-05,3.2e-05,1.9e-05,2.1e-05,1.7e-05,1.4e-05,9e-06,2.3e-05,1.2e-05,1.2e-05,6e-06,2.3e-05,8e-06,2.8e-05,1e-05,1.8e-05,1.4e-05,2.3e-05,1.4e-05,1.7e-05,4e-06,1.2e-05,1.5e-05,1.5e-05,1.6e-05,2.5e-05,9e-06,8e-06,2.1e-05,8e-06,2.3e-05,6e-06,2.5e-05,2.6e-05,1.7e-05,1.3e-05,8e-06,1e-06,3e-06,2e-06,1.8e-05,3e-06,4e-06,9e-06,1.2e-05,7e-06,2e-05,1.5e-05,1.3e-05,1.4e-05,2.1e-05,1.4e-05,3e-06,7e-06,1.1e-05,1e-06,2.1e-05,8e-06,1.5e-05
2.7e-05,1.9e-05,9e-06,2.6e-05,2e-05,1e-05,1.4e-05,3e-06,1.1e-05,1.1e-05,6e-06,1e-05,8e-06,1.9e-05,1.7e-05,2e-05,1.9e-05,1e-05,9e-06,1.2e-05,8e-06,5e-06,9e-06,1.5e-05,4e-06,1e-05,1.4e-05,1.4e-05,2.9e-05,1.8e-05,6e-06,5e-06,1.2e-05,1.5e-05,7e-06,1.1e-05,5e-06,1.1e-05,1.5e-05,1.7e-05,1.7e-05,1.1e-05,1.5e-05,1.1e-05,2.8e-05,9e-06,7e-06,1.7e-05,1.6e-05,1.6e-05,2e-05,1.6e-05,1.4e-05,6e-06,1.6e-05,1.4e-05,1.7e-05,1.8e-05,1.4e-05,7e-06,7e-06,1.2e-05,9e-06,3.2e-05,9e-06,6e-06,9e-06,1.1e-05,8e-06,2.1e-05,2.5e-05,4e-06,3e-06,2.6e-05,2.4e-05,5e-06,5e-06,1.9e-05,2.7e-05,1.4e-05,1.7e-05,2.6e-05,1.7e-05,1e-05,1.4e-05,1.5e-05,6e-06,1e-05,1.2e-05,9e-06,2e-05,1.3e-05,4e-06,1.2e-05,1.7e-05,1.6e-05,1.3e-05,1.9e-05,7e-06,6e-06,1.2e-05,5e-06,2.9e-05,9e-06,6e-06,1.6e-05,1.1e-05,4e-06,6e-06,1.3e-05,7e-06,1.4e-05,1.4e-05,1.2e-05,5e-06,9e-06,9e-06,4e-06,1.4e-05,5e-06,1.4e-05
5e-06,1e-05,1.8e-05,1.6e-05,5e-06,8e-06,7e-06,1.5e-05,1.5e-05,1.9e-05,2.4e-05,1e-05,1.6e-05,1.6e-05,5e-06,1.4e-05,2e-05,1.8e-05,1.4e-05,1.8e-05,7e-06,7e-06,1e-05,1.1e-05,1.6e-05,6e-06,3e-06,1.5e-05,9e-06,8e-06,1.7e-05,5e-06,1.4e-05,2e-05,1.5e-05,2e-05,1.7e-05,1.9e-05,1.4e-05,4e-06,7e-06,6e-06,1.7e-05,1.2e-05,1.2e-05,1.3e-05,2.1e-05,2.1e-05,1.3e-05,2.6e-05,3e-05,1e-05,6e-06,5e-06,4e-06,1.4e-05,1e-05,1.9e-05,1.6e-05,6e-06,1.3e-05,5e-06,1e-05,2.4e-05,2e-05,2.1e-05,4e-06,1.3e-05,1.8e-05,1.3e-05,1.5e-05,4e-06,5e-06,2.7e-05,1.2e-05,7e-06,1e-05,5e-06,2e-06,1.4e-05,2e-06,1e-05,9e-06,1.2e-05,6e-06,1e-05,8e-06,1.4e-05,8e-06,1.3e-05,1e-05,1.5e-05,1e-05,2.1e-05,1.9e-05,7e-06,2.4e-05,2.9e-05,1.6e-05,1.1e-05,1.5e-05,1.5e-05,3.1e-05,1.8e-05,5e-06,7e-06,1.2e-05,4e-06,6e-06,1.3e-05,1e-05,1.6e-05,1.7e-05,2.1e-05,1.3e-05,1.7e-05,1.6e-05,1.8e-05,1.2e-05,9e-06,9e-06
2e-05,1.7e-05,1.8e-05,1.3e-05,4e-06,5e-06,1.2e-05,9e-06,1.2e-05,5e-06,1.5e-05,7e-06,4e-06,7e-06,5e-06,1.1e-05,1.1e-05,1.2e-05,2.4e-05,1.5e-05,1.1e-05,1.1e-05,5e-06,1.3e-05,1.8e-05,1.6e-05,2.4e-05,2.6e-05,2e-05,2e-05,3e-06,9e-06,1e-05,9e-06,1.7e-05,1.7e-05,2.1e-05,6e-06,1.7e-05,1.1e-05,3e-06,6e-06,1.6e-05,1.3e-05,2e-06,3e-06,2e-05,1.6e-05,1.8e-05,1e-06,2.6e-05,1.6e-05,1.4e-05,8e-06,1.4e-05,2.1e-05,2.8e-05,1.5e-05,1.3e-05,2e-05,1.5e-05,1.6e-05,1.2e-05,1.4e-05,7e-06,1.2e-05,1.7e-05,1.1e-05,2.3e-05,2.1e-05,1.7e-05,1.2e-05,7e-06,1.4e-05,1e-05,6e-06,6e-06,2e-06,1e-05,1.7e-05,1.9e-05,1.6e-05,5e-06,1.3e-05,1.4e-05,6e-06,1.7e-05,1.7e-05,8e-06,1.4e-05,9e-06,1e-05,2.6e-05,1.3e-05,1.3e-05,1.5e-05,2.2e-05,1.2e-05,9e-06,1.6e-05,1.1e-05,1.5e-05,6e-06,6e-06,8e-06,1e-05,3e-06,6e-06,1.4e-05,3e-06,9e-06,1.8e-05,2.2e-05,5e-06,1.1e-05,1.2e-05,9e-06,7e-06,4e-06,1e-05,8e-06
7e-06,9e-06,2.3e-05,2.5e-05,1.3e-05,9e-06,1e-05,4e-06,7e-06,1.5e-05,1.6e-05,1.2e-05,1.3e-05,5e-06,3e-06,1.6e-05,5e-06,6e-06,1.6e-05,5e-06,1.1e-05,1.4e-05,7e-06,9e-06,1.2e-05,2.6e-05,3e-06,1.4e-05,1.7e-05,1.6e-05,7e-06,9e-06,2e-06,8e-06,9e-06,9e-06,1.5e-05,1.5e-05,1.5e-05,7e-06,6e-06,3e-06,1.1e-05,1.5e-05,8e-06,1.2e-05,1.5e-05,1.1e-05,9e-06,9e-06,1.6e-05,1.6e-05,8e-06,1.2e-05,2.4e-05,1e-05,1.3e-05,7e-06,5e-06,1.5e-05,1.1e-05,8e-06,1.1e-05,1e-05,1.3e-05,7e-06,2e-05,2.7e-05,4e-06,2.1e-05,1.2e-05,1.8e-05,5e-06,2.3e-05,1.7e-05,5e-06,2e-06,1.1e-05,1.3e-05,2.3e-05,1.3e-05,1e-06,6e-06,7e-06,3e-06,9e-06,8e-06,7e-06,4e-06,4e-06,2e-05,1.2e-05,2.7e-05,2e-06,1.1e-05,1.6e-05,6e-06,2.9e-05,7e-06,1.3e-05,2e-06,6e-06,1.7e-05,6e-06,1.2e-05,9e-06,1.1e-05,3e-06,1.2e-05,9e-06,8e-06,1.8e-05,1.8e-05,1.6e-05,7e-06,2.1e-05,9e-06,1.5e-05,3e-06,5e-06,6e-06
6e-06,1.1e-05,1.7e-05,5e-06,1.6e-05,1e-06,1.8e-05,1.3e-05,6e-06,1.1e-05,1.2e-05,1.3e-05,6e-06,8e-06,5e-06,1.2e-05,7e-06,8e-06,1.1e-05,5e-06,5e-06,8e-06,1e-05,9e-06,2.1e-05,1.6e-05,8e-06,1.1e-05,2e-06,1.2e-05,1.2e-05,1.3e-05,2.3e-05,3e-05,1.7e-05,9e-06,1.1e-05,2e-06,1.6e-05,1.2e-05,5e-06,1.3e-05,1.3e-05,1.8e-05,1.7e-05,1e-06,2.1e-05,1.5e-05,4e-06,9e-06,2.2e-05,1.5e-05,1.2e-05,1.4e-05,1.2e-05,5e-06,4e-06,8e-06,1e-05,1.6e-05,2.4e-05,7e-06,1.8e-05,1.1e-05,7e-06,1.7e-05,1.4e-05,9e-06,9e-06,1.3e-05,1.1e-05,4e-06,4e-06,2.1e-05,7e-06,8e-06,1.2e-05,7e-06,1e-05,6e-06,1.4e-05,1.2e-05,4e-06,7e-06,5e-06,1.5e-05,1.1e-05,9e-06,1.3e-05,4e-06,2e-06,2.4e-05,2.5e-05,1.1e-05,2e-05,8e-06,2e-06,1.5e-05,8e-06,4e-06,9e-06,1.5e-05,2.3e-05,1.8e-05,5e-06,1.5e-05,5e-06,6e-06,6e-06,9e-06,1e-05,7e-06,1.3e-05,3e-06,1.1e-05,2.8e-05,1.2e-05,1.8e-05,1.4e-05,1.1e-05,8e-06
1.4e-05,1.5e-05,1.2e-05,7e-06,2.4e-05,1.5e-05,2.5e-05,1.9e-05,3e-06,1.1e-05,9e-06,1.6e-05,1.1e-05,1.5e-05,2e-05,2.4e-05,5e-06,4e-06,1.2e-05,1e-06,8e-06,1.2e-05,1.3e-05,2.8e-05,1.4e-05,1.6e-05,9e-06,9e-06,1e-05,9e-06,9e-06,1e-06,1.9e-05,2.4e-05,8e-06,1.1e-05,1.1e-05,1.5e-05,1.4e-05,1.4e-05,1e-05,2.2e-05,1.9e-05,1.6e-05,7e-06,0,1.7e-05,2.5e-05,1.6e-05,1.8e-05,3e-05,7e-06,1.1e-05,7e-06,3e-06,1.4e-05,1.8e-05,6e-06,3e-06,7e-06,2.1e-05,2.9e-05,1.7e-05,3e-06,1.6e-05,6e-06,9e-06,1.3e-05,6e-06,2e-05,1.5e-05,7e-06,2e-06,1.6e-05,1.4e-05,9e-06,8e-06,9e-06,5e-06,6e-06,1.3e-05,1.2e-05,1.4e-05,7e-06,1.4e-05,2.6e-05,1.5e-05,1.5e-05,1.6e-05,2.3e-05,2.4e-05,1.3e-05,2.6e-05,3.4e-05,2.2e-05,1.6e-05,5e-06,1.9e-05,8e-06,1.5e-05,1.4e-05,1.5e-05,2.9e-05,2.1e-05,3e-06,1.4e-05,5e-06,3e-06,3e-06,7e-06,1.6e-05,2.2e-05,1.7e-05,2.2e-05,1.3e-05,1e-05,2e-05,6e-06,2.1e-05,7e-06,9e-06
1.7e-05,2e-06,8e-06,1.6e-05,2.2e-05,1.6e-05,2.4e-05,9e-06,1.2e-05,5e-06,8e-06,2e-05,1.2e-05,1.9e-05,1.8e-05,5e-06,1.3e-05,1e-05,1.1e-05,1.6e-05,1.7e-05,1.9e-05,7e-06,2.1e-05,1.8e-05,1.7e-05,1.9e-05,1.9e-05,8e-06,1.2e-05,8e-06,5e-06,1.7e-05,3e-05,1.4e-05,1.3e-05,7e-06,1.3e-05,6e-06,1.4e-05,1.7e-05,1e-05,6e-06,1.7e-05,1e-05,1e-05,2e-06,2.6e-05,3e-06,2e-05,2e-06,9e-06,1.2e-05,1.6e-05,1.6e-05,2e-05,7e-06,8e-06,9e-06,1.1e-05,6e-06,1.2e-05,8e-06,1.4e-05,2e-05,1.6e-05,1e-05,1.8e-05,1.2e-05,1.2e-05,1.4e-05,1.2e-05,1.5e-05,6e-06,3e-06,9e-06,5e-06,7e-06,9e-06,1.9e-05,3e-05,1.8e-05,1.9e-05,1.9e-05,8e-06,1.8e-05,2.5e-05,8e-06,1.9e-05,1e-05,5e-06,2e-05,1.4e-05,2e-05,1.9e-05,1.5e-05,2.2e-05,1.1e-05,6e-06,1.8e-05,4e-06,9e-06,1.2e-05,1.1e-05,2.8e-05,1e-05,1.1e-05,9e-06,6e-06,1.1e-05,9e-06,7e-06,8e-06,2e-05,1.5e-05,1e-06,1.1e-05,6e-06,2.6e-05,9e-06,1.8e-05
8e-06,3e-06,1.5e-05,8e-06,1.3e-05,2.1e-05,7e-06,2e-05,2e-05,7e-06,1e-06,1.3e-05,1.1e-05,1.1e-05,9e-06,1.6e-05,5e-06,1.3e-05,8e-06,2e-05,1.4e-05,1.1e-05,1e-05,8e-06,1.8e-05,4e-06,4e-06,1e-05,1.8e-05,6e-06,8e-06,1e-06,1.3e-05,1.6e-05,8e-06,8e-06,7e-06,6e-06,8e-06,1.5e-05,1.1e-05,3e-06,1.2e-05,1.1e-05,4e-06,6e-06,7e-06,1.2e-05,1.4e-05,8e-06,1e-05,8e-06,7e-06,1.1e-05,6e-06,1.3e-05,1.3e-05,4e-06,5e-06,7e-06,4e-06,6e-06,1.2e-05,1.6e-05,6e-06,7e-06,2.3e-05,1e-05,1.1e-05,1e-06,2.3e-05,7e-06,7e-06,1.3e-05,5e-06,1e-05,9e-06,9e-06,1.1e-05,2e-05,1.6e-05,1.9e-05,6e-06,3e-06,3e-06,9e-06,9e-06,1.4e-05,1.5e-05,2.3e-05,1.2e-05,9e-06,7e-06,1.3e-05,2e-05,2.1e-05,1e-05,2e-05,5e-06,2.3e-05,1.9e-05,1.2e-05,1.1e-05,1e-05,1.3e-05,2.4e-05,1.5e-05,3e-06,7e-06,1.3e-05,8e-06,1.3e-05,7e-06,1.1e-05,1.2e-05,1.2e-05,5e-06,1.5e-05,1.6e-05,2e-05,7e-06
9e-06,4e-06,1.8e-05,9e-06,1.2e-05,9e-06,1e-06,1.1e-05,4e-06,1e-05,9e-06,1.3e-05,1.1e-05,1e-05,1e-05,1.5e-05,2e-06,1e-05,5e-06,1.4e-05,9e-06,4e-06,1e-05,1.3e-05,2.5e-05,1.7e-05,1.2e-05,1.7e-05,1.9e-05,1.5e-05,5e-06,7e-06,7e-06,1.2e-05,7e-06,5e-06,1e-05,1e-05,1e-06,1.6e-05,1.9e-05,1.7e-05,2.6e-05,8e-06,1e-05,9e-06,2e-06,1.2e-05,5e-06,9e-06,1.8e-05,2e-06,1.1e-05,1.7e-05,1e-05,7e-06,2.2e-05,1.6e-05,1.3e-05,1.3e-05,5e-06,4e-06,1.1e-05,2.4e-05,1.2e-05,3e-06,1.4e-05,8e-06,1.8e-05,1.4e-05,1.8e-05,1.6e-05,1.8e-05,7e-06,3e-06,1e-05,1.1e-05,3e-06,1.9e-05,3.4e-05,2e-05,7e-06,6e-06,1e-06,1.2e-05,1e-05,1.1e-05,1e-05,8e-06,1.7e-05,9e-06,7e-06,1e-05,9e-06,6e-06,1.4e-05,1.6e-05,1.1e-05,1.3e-05,2e-05,1.4e-05,4e-06,1.2e-05,3e-06,9e-06,1.5e-05,1.2e-05,6e-06,1e-05,9e-06,8e-06,1.3e-05,1.5e-05,1e-05,1.3e-05,5e-06,6e-06,7e-06,1.7e-05,9e-06,1.1e-05
1.3e-05,1.1e-05,7e-06,1.1e-05,1e-05,6e-06,3e-06,9e-06,1.1e-05,3e-06,5e-06,1.6e-05,7e-06,6e-06,3e-06,1.2e-05,1.2e-05,1.4e-05,1.3e-05,1.4e-05,1.2e-05,1e-05,2.2e-05,1.4e-05,1.5e-05,6e-06,8e-06,1.1e-05,1.2e-05,1.1e-05,1e-05,1.4e-05,1.5e-05,2e-05,1.4e-05,7e-06,3e-06,5e-06,1.1e-05,1.5e-05,1.5e-05,4e-06,1.6e-05,9e-06,4e-06,1.1e-05,4e-06,7e-06,1.1e-05,5e-06,1.1e-05,7e-06,1.1e-05,1e-05,6e-06,8e-06,9e-06,1.4e-05,3e-06,5e-06,1e-05,4e-06,1e-05,1.1e-05,1.8e-05,1.6e-05,6e-06,8e-06,7e-06,1.2e-05,8e-06,7e-06,1.1e-05,2.3e-05,6e-06,1.4e-05,1.2e-05,9e-06,1e-05,7e-06,6e-06,6e-06,9e-06,7e-06,6e-06,2e-06,1.5e-05,8e-06,9e-06,2e-06,7e-06,1.1e-05,1e-05,4e-06,1.1e-05,1.2e-05,1.8e-05,1.6e-05,1e-05,6e-06,1.1e-05,6e-06,1.9e-05,9e-06,1.8e-05,2e-06,9e-06,3e-06,1.1e-05,1.4e-05,3e-06,1.5e-05,1.4e-05,3e-06,6e-06,9e-06,6e-06,4e-06,4e-06,7e-06,1.5e-05
4e-06,9e-06,1.6e-05,7e-06,6e-06,6e-06,2e-06,9e-06,8e-06,4e-06,4e-06,8e-06,5e-06,8e-06,1.1e-05,1e-05,8e-06,5e-06,8e-06,5e-06,4e-06,2e-06,1.4e-05,4e-06,1e-06,3e-06,1.1e-05,5e-06,2e-06,8e-06,6e-06,6e-06,4e-06,7e-06,7e-06,3e-06,1e-06,3e-06,5e-06,3e-06,1.7e-05,1e-05,1.1e-05,9e-06,3e-06,6e-06,1e-05,4e-06,1e-05,1.5e-05,1.1e-05,1e-06,1e-05,1e-05,5e-06,1.1e-05,6e-06,2e-06,7e-06,4e-06,1.2e-05,1e-05,6e-06,8e-06,9e-06,4e-06,8e-06,2e-06,3e-06,1e-05,1e-06,8e-06,8e-06,1.1e-05,6e-06,1.1e-05,7e-06,4e-06,4e-06,1.4e-05,6e-06,3e-06,5e-06,1e-06,6e-06,3e-06,1.6e-05,1e-05,2e-06,8e-06,8e-06,8e-06,1.3e-05,0,7e-06,7e-06,1.6e-05,1.2e-05,7e-06,1.7e-05,8e-06,1.1e-05,1.3e-05,7e-06,1.1e-05,2e-06,7e-06,8e-06,1e-06,1.6e-05,9e-06,2.6e-05,3e-06,8e-06,4e-06,3e-06,5e-06,8e-06,6e-06,2e-06,1.5e-05
3e-06,6e-06,1.3e-05,9e-06,5e-06,3e-06,4e-06,9e-06,4e-06,6e-06,3e-06,8e-06,7e-06,5e-06,3e-06,6e-06,1e-06,6e-06,1e-06,8e-06,3e-06,3e-06,8e-06,3e-06,6e-06,2e-06,1.1e-05,2e-06,5e-06,3e-06,3e-06,5e-06,2e-06,1.1e-05,4e-06,3e-06,2e-06,5e-06,6e-06,3e-06,8e-06,4e-06,1.3e-05,6e-06,9e-06,4e-06,6e-06,5e-06,4e-06,9e-06,1.4e-05,2e-06,5e-06,9e-06,3e-06,4e-06,3e-06,3e-06,5e-06,2e-06,7e-06,3e-06,3e-06,2e-06,8e-06,7e-06,6e-06,5e-06,5e-06,2e-06,1e-05,7e-06,1e-06,1.3e-05,5e-06,4e-06,2e-06,5e-06,6e-06,1.1e-05,6e-06,3e-06,2e-06,3e-06,6e-06,2e-06,9e-06,2e-06,4e-06,7e-06,1e-05,3e-06,1e-05,2e-06,4e-06,1.1e-05,7e-06,1.6e-05,1e-05,1e-05,5e-06,6e-06,1.3e-05,5e-06,5e-06,7e-06,4e-06,4e-06,4e-06,7e-06,1e-06,2.1e-05,1e-06,5e-06,4e-06,3e-06,4e-06,7e-06,7e-06,6e-06,9e-06
3e-06,5e-06,1e-05,9e-06,6e-06,2e-06,5e-06,6e-06,2e-06,4e-06,0,7e-06,4e-06,3e-06,4e-06,7e-06,1e-06,2e-06,1e-06,6e-06,1e-06,2e-06,6e-06,3e-06,4e-06,3e-06,8e-06,2e-06,4e-06,4e-06,1e-06,3e-06,4e-06,9e-06,3e-06,1e-06,2e-06,4e-06,5e-06,2e-06,6e-06,5e-06,1.2e-05,7e-06,8e-06,5e-06,6e-06,6e-06,2e-06,8e-06,1.4e-05,2e-06,5e-06,6e-06,1e-06,4e-06,3e-06,2e-06,2e-06,1e-06,6e-06,3e-06,1e-06,3e-06,5e-06,9e-06,6e-06,4e-06,7e-06,1e-06,1.1e-05,8e-06,1e-06,1.1e-05,8e-06,3e-06,3e-06,4e-06,4e-06,1.2e-05,7e-06,1e-06,1e-06,3e-06,7e-06,1e-06,7e-06,1e-06,2e-06,9e-06,9e-06,7e-06,1.2e-05,2e-06,6e-06,1e-05,7e-06,1.3e-05,9e-06,8e-06,5e-06,5e-06,1.3e-05,7e-06,7e-06,7e-06,5e-06,3e-06,4e-06,7e-06,0,1.8e-05,2e-06,5e-06,3e-06,1e-06,5e-06,5e-06,5e-06,6e-06,6e-06
3e-06,5e-06,1e-05,8e-06,4e-06,2e-06,5e-06,6e-06,1e-06,4e-06,2e-06,6e-06,5e-06,2e-06,3e-06,8e-06,2e-06,1e-06,0,5e-06,0,1e-06,7e-06,5e-06,6e-06,4e-06,8e-06,2e-06,5e-06,4e-06,2e-06,3e-06,5e-06,1e-05,3e-06,2e-06,1e-06,4e-06,4e-06,3e-06,4e-06,4e-06,1.2e-05,8e-06,8e-06,5e-06,7e-06,6e-06,1e-06,9e-06,1.3e-05,1e-06,5e-06,6e-06,1e-06,4e-06,5e-06,4e-06,3e-06,1e-06,6e-06,3e-06,2e-06,2e-06,6e-06,8e-06,5e-06,4e-06,8e-06,1e-06,1e-05,7e-06,1e-06,1.1e-05,7e-06,1e-06,1e-06,4e-06,2e-06,1.2e-05,7e-06,1e-06,1e-06,1e-06,5e-06,3e-06,4e-06,0,1e-06,8e-06,9e-06,8e-06,1.2e-05,2e-06,4e-06,1e-05,7e-06,1.3e-05,8e-06,7e-06,5e-06,5e-06,1.2e-05,7e-06,8e-06,7e-06,6e-06,4e-06,6e-06,7e-06,1e-06,1.7e-05,1e-06,5e-06,2e-06,2e-06,5e-06,6e-06,5e-06,5e-06,6e-06
