-0.002872,-0.004281,-0.002675,-0.003641,-0.00242,-0.002882,-0.003778,-0.002063,-0.003453,-0.002544,-0.002778,-0.002673,-0.003784,-0.004267,-0.003099,-0.005016,-0.003642,-0.002331,0.000492,-0.00108,-0.002226,-0.001713,-0.002574,-0.007191,-0.005224,-0.003187,-0.00268,-0.003225,-0.000174,-0.002297,-0.005241,-0.005882,-0.006304,-0.00376,-0.003103,-0.002707,-0.00319,-0.003051,-0.004405,-0.005135,-0.005144,-0.003689,-0.003916,-0.002625,-0.002424,-0.005329,-0.004776,-0.00399,-0.005867,-0.004426,-0.001084,-0.002353,-0.002653,-0.007033,-0.005247,-0.003351,-0.00341,-0.005239,-0.001742,-0.004683,-0.00373,-0.005908,-0.006233,-0.004957,-0.005831,-0.004987,-0.003973,-0.00274,-0.004651,-0.004309,-0.001863,-0.003603,-0.003743,-0.003365,-0.003034,-0.002474,-0.002552,-0.003189,-0.004407,-0.002971,-0.00328,-0.006053,-0.006883,-0.003776,-0.004406,-0.003084,-0.002777,-0.002425,-0.004341,-0.004968,-0.007257,-0.005248,-0.002481,-0.003097,-0.004214,-0.003657,-0.002014,-0.001768,-0.005123,-0.008641,-0.005416,-0.004917,-0.010392,-0.005853,-0.011897,-0.007921,-0.002245,-0.003389,-0.006247,-0.004298,-0.002835,-0.001894,-0.00286,-0.001792,-0.005146,-0.003982,-0.007221,-0.005084,-0.005312,-0.006629,-0.004702
-0.001655,0.001525,6.3e-05,0.000656,-0.00124,-0.002157,0.000256,4.5e-05,-0.002226,-0.001876,-0.00197,-0.001619,0.000374,-0.001603,0.000398,0.00082,0.00027,0.000572,-0.003046,-0.002265,-0.00057,-0.00072,-0.003972,-0.001225,0.000454,-0.002135,-0.000996,-0.000922,-0.001153,-0.002781,0.000213,0.004129,0.001487,-0.000323,-0.003079,-0.001997,-0.001837,-0.000213,-0.000882,0.000886,0.000886,-0.001846,-0.001228,-0.001411,-0.000199,0.002275,0.001596,0.001727,-0.000982,-0.000187,0.000228,-0.00225,0.002039,0.002588,0.002161,0.000563,-0.000773,-0.00182,-0.001747,-0.001457,-0.000398,0.000551,-0.000437,0.000891,-0.000493,-0.000318,-0.001042,0.000252,0.000476,0.00047,-0.000285,-0.001595,-0.000487,0.000814,-0.000204,-0.000876,-0.001311,-0.000152,-0.000139,-0.000426,0.000696,0.002431,0.002732,0.000818,-0.000727,0.001868,-0.001597,-0.000621,0.001521,0.001877,0.002889,0.00164,0.001466,-0.002674,0.00051,0.000434,-0.001357,-0.003316,-0.000649,0.003093,0.001145,0.000378,0.000656,0.001025,0.00312,0.002543,0.001611,-0.001236,-0.001922,-0.001668,-0.001952,-0.002343,-0.001605,0.000214,-0.000664,0.000526,0.001111,-0.001152,-0.002274,0.000925,-0.00061
0.000116,-0.000798,-7e-06,0.001798,0.000113,0.000819,-0.001751,-0.002545,-0.00056,9.2e-05,0.000382,0.000383,0.000309,-0.001888,-0.002735,-0.002114,-0.000432,-0.000391,-0.001,-2.7e-05,-0.000825,-0.001771,-1.3e-05,0.000102,-0.000687,-0.000287,-0.00051,-0.000536,-0.001105,0.000283,-0.001352,-0.004077,-0.003746,-0.001442,0.001724,0.000775,-0.001514,-0.001396,-0.001084,-0.001456,-0.000174,9e-06,0.000432,0.000588,-0.000529,-0.001015,0.000256,-0.000847,0.002511,0.000374,-0.000831,-0.001717,-0.002453,-0.00324,-0.0021,2.3e-05,-0.001244,-0.000668,-0.002233,-0.000695,-0.000646,-0.001032,0.000452,-0.002975,-0.000924,0.000978,-0.001661,-0.001762,-0.001228,-0.000709,-0.000528,0.000678,0.000433,-0.00082,-0.00069,0.00031,0.000588,-0.001417,-7e-06,-0.001903,-0.002222,-0.002211,-0.001886,-0.00195,-0.000803,-0.001475,-0.00094,-0.00013,-0.001349,-0.001615,-0.00279,-0.001407,-0.002801,-1.2e-05,-0.000342,-0.001293,-0.000629,-0.001061,0.000123,-0.002213,-0.002631,-0.002253,-0.001627,-0.002209,-0.002242,-0.003497,-0.002081,0.001136,-0.000671,-0.002018,-0.00026,-0.00148,-0.000914,-0.002517,-0.002996,-0.002851,-0.00254,-0.001498,0.000219,-0.002562,-0.001162
0.000698,0.000684,0.00031,-0.001913,0.001155,0.001299,0.001269,0.002401,0.000375,0.00067,0.000655,3e-06,-0.000956,0.003265,0.001188,0.000108,-0.000965,0.000131,0.001817,0.002377,0.001465,0.000336,0.001863,0.001421,0.001369,0.001011,0.000293,0.000225,0.000325,0.001234,0.003151,0.003583,0.003091,0.001329,0.001279,0.001457,0.00224,0.002266,9.5e-05,0.000755,0.00053,0.00047,0.00023,0.00047,0.00108,0.000434,-0.000334,-0.001465,-0.001999,-0.000473,-0.000182,0.001664,0.000969,0.003233,0.001432,0.000934,0.000795,0.001512,0.002127,0.000333,-0.000674,0.001142,0.001527,0.002614,0.00055,-0.000993,0.000774,0.000379,0.000501,0.001306,0.00073,0.000175,0.000562,0.000589,0.001808,-0.000148,0.001274,0.000292,0.000706,0.002157,0.002726,0.000917,-0.000975,0.000576,0.00165,0.00061,0.002086,0.000968,0.001401,0.001516,0.002151,0.00223,0.002299,0.000682,-0.000469,4.5e-05,0.000162,0.00132,0.000408,0.001093,0.000953,0.000282,0.000381,0.001787,0.001878,0.002868,0.000837,-0.000852,0.001732,0.003992,-0.00019,0.001815,0.000995,0.000838,0.003401,0.003008,0.002049,0.003239,0.000442,0.001878,0.000448
-0.000296,-4.8e-05,-0.000185,0.000319,-0.000489,-0.002546,-0.000868,-0.000833,0.001154,0.001122,-0.000695,-0.000444,0.001224,-0.000794,0.000689,0.000351,0.001048,-0.000132,-0.000413,-0.001663,-0.000587,0.001501,0.000664,-0.000436,-3.5e-05,9.3e-05,0.000519,0.001397,0.000602,0.000359,-0.002233,-0.001944,-0.000962,-0.000525,-0.000429,-0.000985,0.000797,-0.000857,0.000729,-0.000628,-0.000765,-0.000542,0.000408,0.000585,-0.00078,-0.000564,-0.000194,0.001825,-0.000328,0.000275,0.000795,0.000194,0.00021,-0.001689,-0.001067,-0.001845,0.000748,0.000697,0.000228,0.000804,0.000892,-8.5e-05,-0.002702,-0.001297,0.001444,0.00039,-0.000202,0.001073,-0.000556,-0.000181,1e-04,9.7e-05,-0.000106,-0.000848,-0.000642,-0.000517,-0.001068,0.000165,0.000545,-0.001107,-0.000642,-0.000186,0.000761,1.2e-05,-0.000151,-0.000239,-0.000445,-0.001379,-0.001081,-0.002257,-0.00051,-0.001345,-0.000794,0.000253,0.001011,8e-06,-0.000459,0.001455,0.001336,0.000311,0.000698,0.00106,0.002047,-0.001587,0.000463,0.00027,0.000103,-0.000652,-0.00106,-0.001173,0.001038,0.000354,0.000491,-0.000301,-0.000781,-0.00125,-0.001038,-0.00065,-0.000848,0.000611,0.000273
-0.000333,-0.000233,-7e-06,0.000358,0.001156,0.000586,0.001185,-0.000675,-0.000811,-0.001026,-0.000284,0.000591,-0.000558,2.8e-05,9.5e-05,0.00153,0.000515,0.000887,0.000333,-0.000219,-0.000803,-0.00026,-0.000308,0.000242,-0.000858,-0.000778,0.000524,-0.001312,-0.001128,-0.001299,-5.1e-05,0.000258,0.000362,0.000624,-0.000825,-0.000623,-0.001172,-0.000126,-0.000424,0.000461,0.000705,0.000713,-0.000547,-0.000723,0.000204,0.000638,0.000871,-0.000891,0.000545,-0.000202,-3.1e-05,7.3e-05,0.000101,7.7e-05,0.001048,0.001146,-0.000317,-0.001593,-0.000682,0.000561,0.000289,-7.4e-05,0.001675,0.001221,0.00044,0.000499,0.000571,-0.000435,0.000932,0.000113,-0.000194,-0.000139,-0.000598,0.000498,-0.000247,0.000879,-0.000566,-0.000286,-0.001039,0.000617,-0.000458,-0.000333,0.000823,0.001722,0.000676,-0.000149,0.000214,0.000553,0.000112,0.001352,0.000219,-3.6e-05,-1.7e-05,-0.00028,-0.000372,0.000615,0.00141,-0.001243,-0.000273,-0.000512,7.3e-05,-0.000214,0.000351,0.003144,-0.001051,-0.001503,-0.000478,0.000422,0.000275,0.000396,0.000367,0.000201,-0.001044,0.000931,-0.000506,-0.000648,0.000371,-0.001552,0.001064,-0.00062,0.000157
0.000134,-0.000165,0.000148,-0.000355,-0.000468,0.000991,-0.00057,0.000239,-0.00063,-0.000559,0.000676,0.000658,-7.5e-05,-0.000739,-0.000857,-0.000651,-0.001057,-0.00061,-0.000238,0.00021,0.001266,-0.000502,-0.000794,-2e-05,0.001445,0.001014,-0.001162,0.000106,0.000573,0.000209,0.001397,-0.000799,-0.000834,-0.000499,0.000407,0.001262,-9.4e-05,-0.001267,-2.2e-05,0.000938,-0.000369,0.000208,0.000307,-2.2e-05,-0.000173,0.000122,-0.001486,-4.1e-05,-0.000859,-0.000235,-0.000366,0.000175,-0.000731,-9e-06,-0.000482,-2.8e-05,-0.00038,0.000251,-0.000299,-0.00138,-2.6e-05,3e-05,-0.000194,-0.000908,-0.001291,-4.2e-05,0.000346,0.000111,-0.000455,0.000114,0.000313,0.000373,0.000394,-0.000795,-0.000431,-0.000266,0.000811,-0.000512,-8.5e-05,-0.000224,-0.00044,-0.000158,-0.001083,-0.001569,-0.00088,0.00031,-0.000779,-0.000123,-0.000274,0.000139,0.000315,-1.6e-05,-0.00056,0.000208,-2.4e-05,-0.000208,-0.000859,-7.8e-05,-0.001052,-0.000405,0.00042,0.000441,-0.000939,-0.003216,4.1e-05,0.001172,0.000804,0.000662,0.000999,-0.000745,-0.000756,-0.00022,0.000945,-0.001012,-0.000164,0.000254,9.8e-05,0.001323,0.000768,0.000419,0.00023
0.00036,0.000154,-0.000195,-0.00025,-0.001124,-0.000576,-0.000342,0.000133,0.001104,0.00033,-0.000175,-0.001325,-9.5e-05,6.8e-05,-0.000155,-0.000676,0.000116,-0.000215,0.000269,0.000784,-0.000334,0.000134,0.000137,5.2e-05,-0.000424,-0.0015,0.000619,0.000474,-0.000339,9.1e-05,-0.000727,0.000951,0.000751,-0.000142,8.4e-05,-0.000512,0.000828,0.000816,0.000509,-0.000229,2.1e-05,-0.001001,-0.000131,0.000301,-0.000337,-7.1e-05,0.000906,0.000417,0.000944,0.000107,-8.8e-05,-0.000376,0.000318,0.000556,-8.7e-05,0.000453,-7.4e-05,0.000547,0.000537,-0.001012,-0.000806,-0.000609,0.00109,0.00047,-2e-04,-0.000983,-0.000157,-0.000218,-0.000508,-0.000776,-0.000553,-0.000481,0.000688,0.000664,0.000355,-3e-04,-0.00031,0.001096,0.001331,1.4e-05,0.001325,0.00058,0.001098,0.000826,-2e-05,-9e-04,-0.000183,0.000195,-1e-06,-0.000186,-0.000379,0.000532,0.001039,0.000336,0.001076,-8.9e-05,5.6e-05,0.000194,-0.000412,0.00017,-0.00064,-0.000429,0.000204,0.000956,0.000498,-0.000146,-9.5e-05,0.000592,-0.001078,0.000566,-0.000355,-0.00087,-0.000289,0.000516,-0.000582,0.000836,0.000459,-0.000122,-0.000661,-0.000199,0.00053
0.000549,-3e-04,0.000121,0.000355,0.000596,-9.2e-05,0.000337,0.000649,-0.000666,0.000623,0.000511,0.000573,0.000107,0.000355,0.000675,0.000118,0.000182,4.6e-05,-0.000569,-8.6e-05,-0.000189,0.000336,0.000621,2e-06,-0.000661,0.00065,2e-06,0.000324,0.000812,0.000519,-0.00018,-8.3e-05,-0.000356,0.000568,-0.000295,-0.000252,-0.000584,0.000674,6.7e-05,-0.000218,-0.000372,0.000414,-8.6e-05,0.000185,0.000563,-0.000396,-0.000192,0.000131,0.00022,0.00017,0.000929,0.000376,0.000155,1.2e-05,-0.000217,-0.001049,-0.000473,-0.000323,-6.1e-05,0.001286,0.000657,0.000718,-0.000918,-0.00023,0.000722,0.001083,0.000123,0.000811,0.000957,0.000283,-0.000189,8.3e-05,-0.000667,-0.000151,0.000339,0.000419,3.2e-05,-0.000437,-0.000837,0.000128,-0.000534,-0.000172,-0.000829,-0.000752,-0.000332,0.00063,1.3e-05,-0.000159,-8.5e-05,0.000303,-0.000244,-0.000482,6.6e-05,-0.000343,-0.000363,0.000174,-0.000122,-0.000275,0.000921,-0.000187,0.000381,0.001035,0.000333,0.000376,0.000502,-0.000126,-0.000587,-0.000969,0.000187,5e-05,0.000695,0.00074,-0.000177,0.000356,0.000108,0.000406,-0.000353,-0.000108,-0.001196,-0.000313,-0.000927
-0.001018,0.000169,0.000205,-0.000119,0.000121,0.000125,-0.000328,9.9e-05,0.000212,-0.000123,-0.000338,0.000212,-8e-05,0.000843,1.4e-05,0.000105,0.000476,0.000349,0.000487,-0.000293,5.6e-05,0.000214,-0.000769,0.000147,0.00014,0.000152,-0.000669,-0.000342,-0.000552,-8.6e-05,5.4e-05,8.9e-05,0.000158,0.000251,0.000593,-6.1e-05,-0.000565,-0.000557,-0.000393,0.000155,0.000157,-3e-05,0.000248,-0.000795,-0.000252,0.000298,0.000418,-0.000532,-0.000467,-0.000134,-0.001091,-0.000287,0.000484,-0.00015,0.000651,0.000364,0.000545,-0.000279,-0.000355,0.000273,0.000269,0.000246,3.8e-05,-0.000293,-0.000337,-0.000464,-0.000112,-0.000603,-0.00021,-3.7e-05,0.00034,0.000439,-3.7e-05,-0.000279,-0.000183,-1.9e-05,0.000128,-0.000158,0.000397,-7.9e-05,0.000452,-8.3e-05,0.000454,1.3e-05,0.000871,2e-04,0.000585,0.00068,0.00084,-2.9e-05,-6.2e-05,0.000238,-0.00076,-0.000368,-0.000945,-0.000305,0.000369,0.000404,0.000149,-0.000278,9.9e-05,-0.00104,-0.000499,-0.000526,-0.001682,-0.000518,0.000213,0.000258,-7e-05,-0.000512,0.000254,4e-06,-0.000495,-0.000474,0.000557,-0.000841,-0.000703,-0.000183,0.000601,0.000308,-4e-04
0.000572,-0.000319,-0.000555,1.8e-05,-0.000321,-0.000186,0.000179,-0.000209,-0.000289,-0.000116,-5.5e-05,0.000173,0.000181,-0.00087,-0.000427,5e-05,-1.1e-05,-0.000115,-9.7e-05,-0.000294,0.000178,-0.000449,0.000444,-0.000221,0.000423,-0.000559,0.000364,-4e-06,-0.000214,-8.5e-05,0.000173,-0.000369,-0.000255,-0.000544,-0.000941,0.000103,0.000375,-6.7e-05,-0.000404,-0.00024,-9e-05,3.5e-05,-0.000246,0.000272,2.5e-05,-0.000201,-0.000365,0.000303,0.000205,0.00015,-0.000202,4.7e-05,-0.000352,-0.000144,-4.3e-05,0.000245,-3e-06,0.000536,3.2e-05,-0.000554,-2e-06,-0.000731,6e-06,4.8e-05,-0.000383,-0.000117,-2.1e-05,0.00053,-2.9e-05,2e-05,0.000286,-0.000201,-0.000125,0.000386,-6e-05,0.000193,-0.000188,-8e-06,-0.000297,-0.000309,-0.00072,-0.000183,-5.9e-05,-4.3e-05,-0.000758,-0.000164,5.1e-05,-0.000703,-0.000711,-3e-05,0.000424,0.000349,0.000549,0.000407,0.000351,0.000623,-0.000325,0.000107,-0.000704,0.00062,-0.000553,0.00055,-0.00012,0.00051,0.000823,0.000245,-2.2e-05,-0.000283,6.4e-05,0.000272,-0.000528,-0.000624,0.000141,-0.000338,-0.000239,4.2e-05,0.000546,7.3e-05,0.000876,0.000196,0.000836
-9e-06,0.000521,0.000279,-0.000284,0.000381,0.000186,-3.5e-05,-0.000505,0.000236,-0.000119,-7.2e-05,-0.000492,-0.00033,0,0.000117,-0.000376,-5e-05,8.8e-05,-0.000334,9e-05,-0.000245,0.000175,-0.000505,2.1e-05,-0.000309,0.000276,-8.8e-05,-0.000181,0.000306,5.9e-05,-3.8e-05,0.000156,0.000392,1.9e-05,0.000441,9.2e-05,0.000368,-4.9e-05,0.000638,0.000185,0.000101,0.000174,2.4e-05,3.5e-05,4.5e-05,8e-06,-5.3e-05,-7.8e-05,-0.000155,-1.4e-05,0.000482,-0.00019,-0.000356,0.000295,-6.4e-05,3.8e-05,-7.2e-05,-0.00029,0.000121,-0.00049,-0.000176,0.000192,-2e-06,0.000205,0.000343,-0.000238,-0.000237,-0.000346,-0.000104,-4.1e-05,-0.000525,-2.8e-05,5.4e-05,8.3e-05,0.000299,-0.000203,6e-06,0.000495,4.5e-05,0.000253,5.7e-05,0.000245,-0.000201,0.000411,0.000505,-0.000224,-0.000387,4.1e-05,-0.000194,-0.000247,-0.000113,-0.00059,-0.000531,-0.000216,0.000169,-0.000255,0.000322,-0.00046,4.6e-05,0.00012,0.000131,-0.000563,0.000306,-0.000238,-0.000309,-0.000106,0.000364,0.000309,0.000195,-0.000289,-0.000307,0.000316,0.000204,0.000244,0.000353,0.000316,-7.1e-05,-0.00024,-0.000884,-0.000127,0.000265
-0.000336,-0.000182,0.00029,0.000366,-2.6e-05,0.000337,0.000244,3e-04,-2e-06,-0.00011,7.3e-05,0.000318,2.5e-05,0.00015,-0.000103,0.000377,-0.000264,-0.000354,0.000198,0.000156,0.000332,0.000285,0.000224,7.9e-05,7.7e-05,0.000215,8e-06,0.000208,-0.000171,-0.000154,-0.000279,8e-05,-0.000214,0.00014,9.7e-05,4.9e-05,-0.000528,-0.000295,-6.9e-05,-0.000258,-0.000157,-0.000287,0.000242,7.2e-05,0.00012,5.6e-05,0.000182,0.000189,0.000139,5.1e-05,-7.6e-05,0.000343,0.00021,4.4e-05,-0.000113,-0.000167,6.3e-05,-0.000259,-7e-05,0.000803,0.000304,1.7e-05,0.000109,5e-05,5e-05,0.000443,0.000403,1e-05,0.000137,2.5e-05,-0.000104,-0.000222,3e-04,-0.000109,-0.00017,-0.00011,0.000151,-0.000286,-9.5e-05,4.1e-05,0.00034,-1e-05,2e-05,-0.000198,-0.000231,0.000158,0.000462,-0.000208,0.000424,-0.000164,-5.6e-05,0.000382,4.3e-05,0.000148,-2.1e-05,-0.00035,-0.000211,0.000265,0.000157,-0.000288,9.4e-05,-5.1e-05,0.000235,0.00024,0.000445,0.000309,-0.000576,-1e-04,-0.000112,-0.000135,0.000729,0.000191,5.9e-05,0.000416,-0.000155,9.7e-05,0.00013,8.4e-05,0.000246,4.9e-05,-0.000252
0.000563,0.000194,-0.000112,-0.000185,2.5e-05,-0.000349,1.1e-05,0.000216,4e-06,0.000147,0,6.5e-05,0.000185,-0.000152,3.2e-05,2.1e-05,-0.000131,0.000103,0.000194,9.3e-05,-8.4e-05,-0.000423,4.4e-05,-7.1e-05,5e-06,-0.000175,0.000188,-0.000124,0.000212,0.000282,-9.2e-05,-0.000425,-2.1e-05,-0.000194,3.4e-05,-8.7e-05,0.000337,0.000286,-0.000109,0.000103,0.00025,0.000351,-0.00023,0,-0.000155,-3.3e-05,-0.000222,-0.000245,-7e-05,-3.7e-05,-0.000187,-0.000152,1.8e-05,-0.000237,0.000107,-0.000159,9.4e-05,0.000411,4.8e-05,-0.000202,-0.000327,-1e-04,-0.000133,5.2e-05,-1.5e-05,-0.000252,-6.3e-05,-0.000126,-0.000303,6.9e-05,0.000182,0.000307,-0.000149,-3.3e-05,-0.000112,0.000145,-0.000113,1.3e-05,5.6e-05,7.4e-05,-1.5e-05,9.8e-05,9.6e-05,6.4e-05,4e-06,-3.9e-05,-0.00029,1e-04,7.7e-05,0.00017,3.1e-05,-4.4e-05,0.000121,-0.00011,7.8e-05,0.00025,5e-06,-0.00022,8.3e-05,-0.000159,-0.000196,0.000331,-0.000328,-3.1e-05,-0.000317,-0.00024,-0.000102,3.5e-05,-3.4e-05,9.2e-05,-0.000436,-1e-05,2.3e-05,-0.00033,-0.000114,0.000166,-0.000229,-8.1e-05,-0.000243,-5.4e-05,-0.000135
-0.000323,-9.7e-05,-0.000197,0.000109,8.7e-05,-6.3e-05,-0.000173,-9.6e-05,0.000106,-9.7e-05,2.8e-05,-0.000119,-5.1e-05,0.000159,0.00011,-0.000184,8.9e-05,0.000112,-0.000123,-0.000148,-3.4e-05,9e-06,-0.000172,0.000231,7e-06,1e-05,-1e-04,0.000156,-2e-05,-0.00019,0.000217,6.8e-05,-2.3e-05,-0.00019,-0.000144,-2e-05,-9.8e-05,7.7e-05,-0.000151,-4.2e-05,6.8e-05,-0.000323,9.5e-05,0.000126,3.4e-05,4.3e-05,0.000198,0.00022,7.1e-05,-6.5e-05,0.000255,-0.000107,-1.6e-05,6.9e-05,-9.2e-05,0.000184,-7e-05,-0.000125,-4.4e-05,-0.000181,9.4e-05,0.000297,-0.000188,-0.000122,-0.000131,0.000214,-8.8e-05,0.000159,0.000214,-8.6e-05,0.000152,-0.000248,-1.9e-05,-0.000119,8.5e-05,3e-06,-8e-06,8.6e-05,-1.5e-05,-5.1e-05,-0.000138,-7.5e-05,3.7e-05,9.8e-05,0.000121,0.000145,-4e-06,0.000302,-0.000271,-5.1e-05,4.1e-05,-0.000117,6.9e-05,0.000133,-0.000135,9.6e-05,0.000173,0.00012,-4.6e-05,4.2e-05,-2e-06,-0.000122,4.5e-05,-5.3e-05,0.000131,-1.4e-05,0.000383,2.2e-05,4.5e-05,6e-05,0.000139,-0.000115,-0.000266,-0.00011,-0.000146,-0.000142,9e-06,1.7e-05,0.000433,-7.5e-05,-5.7e-05
0.000127,-6.8e-05,0.000329,-0.000146,-0.000237,0.000147,3.8e-05,-1.2e-05,-0.000215,0.000262,3.5e-05,-0.000158,-0.000134,8.8e-05,-1.5e-05,0.000124,-3.9e-05,-3.9e-05,3.6e-05,-2e-06,-3.6e-05,0.000133,0.000108,-0.000234,0.000122,4.6e-05,3.3e-05,-3.3e-05,-0.000114,0.000132,0.000161,0.00019,0.000102,9.9e-05,-6.4e-05,2e-06,-5.4e-05,-2.1e-05,0.000107,6.1e-05,-0.000253,0.000298,0,-0.00017,-9.1e-05,-4e-05,-0.000143,-3.6e-05,-5.7e-05,6e-06,3.6e-05,0.000183,1.4e-05,-2.8e-05,-8.1e-05,0.000145,7.1e-05,5.7e-05,-1.8e-05,7.9e-05,-6.8e-05,-0.000145,0.000322,9e-05,0.000201,-0.000122,-1.3e-05,-0.000133,-1e-06,0.000106,-7.6e-05,3.6e-05,2e-05,0.000129,3.6e-05,-5.9e-05,-6.2e-05,-0.000152,-5.7e-05,6.7e-05,6e-06,1.2e-05,-0.000226,-0.000118,-4.2e-05,-0.00014,1e-06,-0.000224,0.000101,-1.9e-05,-3.1e-05,-2.2e-05,-5e-06,-9.9e-05,-8e-06,-7.6e-05,-0.00018,4.2e-05,7.5e-05,6.3e-05,8.3e-05,4.7e-05,-0.000107,9e-05,1.2e-05,9.2e-05,-5.1e-05,-4e-05,-0.000167,2.9e-05,-2.8e-05,-0.000141,0.000139,6.1e-05,9e-05,-0.000345,4.9e-05,2.4e-05,-0.000171,6.8e-05,0.000221
-0.000131,4e-06,-0.000224,8.6e-05,0.000138,-8.6e-05,2.4e-05,-6.7e-05,0.000115,-0.000164,-8.5e-05,3.9e-05,0.000135,-6.1e-05,-2.1e-05,2.9e-05,0.000148,6.7e-05,-2.7e-05,4.3e-05,-3.9e-05,2.4e-05,-7e-05,6e-06,2.8e-05,-8.7e-05,-0.000112,-5.5e-05,3.6e-05,-9.1e-05,-0.000181,-5.2e-05,-0.000135,5.3e-05,8e-05,6.2e-05,4.2e-05,0.000105,-2.1e-05,-0.000101,5.6e-05,-0.000122,-3.7e-05,1.7e-05,1.6e-05,-1.3e-05,7.1e-05,-0.000125,3.1e-05,-2.1e-05,-4.2e-05,-0.000162,3.4e-05,-3.3e-05,4.8e-05,-0.000208,-5.8e-05,-9.9e-05,2e-05,0.000129,8.7e-05,-8.4e-05,1.6e-05,-5.8e-05,-7.7e-05,7e-05,-4.3e-05,8.7e-05,3.8e-05,-6.3e-05,2.3e-05,-6e-06,5.3e-05,-6e-06,-6.4e-05,6.8e-05,4e-05,4.6e-05,1.5e-05,-3.9e-05,4.1e-05,-9.9e-05,9e-05,6.7e-05,0.000106,5.7e-05,-3.6e-05,0.000144,0.000116,3.7e-05,-8.8e-05,-3e-05,-8.9e-05,5.6e-05,3.9e-05,-6.7e-05,0.000163,7.1e-05,-2.3e-05,-5.8e-05,5.1e-05,-3.3e-05,0.000132,1.1e-05,-3.8e-05,2.8e-05,-0.00019,3.6e-05,7.9e-05,9.2e-05,-6.2e-05,0.000114,4.3e-05,8.5e-05,8.3e-05,0.000226,5.3e-05,-4.5e-05,-0.000135,-7.8e-05,-7.5e-05
-1e-06,-2.8e-05,1.3e-05,8e-06,-9.4e-05,9.6e-05,-3.1e-05,-2e-06,-4.3e-05,1.8e-05,4.1e-05,0.000104,-1.8e-05,-5e-05,2.9e-05,-2.8e-05,2.7e-05,-7.3e-05,-1.4e-05,3.5e-05,8e-05,-9.9e-05,6.3e-05,-2.1e-05,-0.000185,7.6e-05,6e-05,0,-2e-06,0,-3.8e-05,1.9e-05,0.000106,-2.6e-05,-1.7e-05,-4.5e-05,5.7e-05,-0.000135,3.4e-05,8e-06,1e-06,6.2e-05,4e-05,4.7e-05,4.9e-05,8e-05,2.4e-05,7.5e-05,-7.5e-05,5.5e-05,-2e-06,2.7e-05,-3.7e-05,8.6e-05,2.6e-05,-2.1e-05,1e-06,8.7e-05,1.6e-05,-7.4e-05,-4.1e-05,4.3e-05,-9.5e-05,2.3e-05,1.5e-05,-0.000105,7e-05,-5e-05,-5e-05,-1.4e-05,-1.2e-05,4e-06,3.3e-05,-1.1e-05,4e-05,-3.7e-05,9e-06,6.4e-05,-6.3e-05,-6e-06,-3.6e-05,9.6e-05,2.5e-05,-6.8e-05,-8e-05,-0.000106,0.000107,-0.000157,-7.7e-05,-3.2e-05,2e-05,4.6e-05,0.000153,-2.9e-05,1.5e-05,2e-05,-0.000114,-0.000106,2e-06,2.7e-05,-4.5e-05,-7e-06,-9.6e-05,5e-06,3e-06,-7.8e-05,8.6e-05,1.1e-05,-2.3e-05,-0.000154,-5.7e-05,-5.3e-05,-2.6e-05,-9.4e-05,2.4e-05,8.1e-05,-4e-06,-8e-06,0.000105,3.3e-05,-0.000188
-1e-05,1.7e-05,5.5e-05,1.1e-05,1.9e-05,-4e-05,-7.9e-05,3e-06,5e-06,0,2e-05,-1.1e-05,-3.4e-05,1.6e-05,-2.7e-05,-6e-05,-4.8e-05,4e-06,2.2e-05,5.5e-05,-6.4e-05,6.8e-05,-4.6e-05,7.6e-05,4.9e-05,-5.7e-05,5.2e-05,7.9e-05,-1.7e-05,3.5e-05,4.7e-05,2.4e-05,-1.5e-05,-1.4e-05,8.5e-05,2e-05,-7.8e-05,-2.6e-05,2.4e-05,3.3e-05,-1e-06,-6.6e-05,-1.8e-05,-9e-06,-7.2e-05,-2e-06,-2.7e-05,3.9e-05,7.4e-05,1e-06,3.4e-05,8.2e-05,-2.2e-05,-4.4e-05,-1.2e-05,7.6e-05,-6e-06,-0.000137,2e-05,-7.9e-05,-3.7e-05,-4.3e-05,8.7e-05,-4.6e-05,0,-5.9e-05,2e-06,6.9e-05,2e-05,5e-06,2e-05,4e-05,-2.7e-05,3.3e-05,-1.8e-05,2e-06,8e-06,-5.2e-05,5.7e-05,2.2e-05,6.4e-05,-1.5e-05,-4.4e-05,6.5e-05,4.1e-05,4.3e-05,-1.6e-05,2.5e-05,-7e-06,5.1e-05,-1.3e-05,7.6e-05,-7e-05,9e-06,-1.3e-05,7.4e-05,4e-06,9.6e-05,-5.2e-05,-4.7e-05,9.1e-05,1.8e-05,5.1e-05,0,0.000122,3.1e-05,2.6e-05,9e-06,1.4e-05,2.5e-05,4.8e-05,-3.9e-05,-1.1e-05,3.8e-05,-1e-06,-7.9e-05,-2e-05,2.1e-05,-5.4e-05,-3.4e-05,2.4e-05
0.000101,2.2e-05,-4.7e-05,-2.5e-05,7.6e-05,-6.3e-05,7.5e-05,-7.3e-05,-2e-06,-5.9e-05,-3.8e-05,-4.9e-05,1.4e-05,-9.2e-05,-6e-06,-3.1e-05,-2.1e-05,-2e-06,0,-7.4e-05,5e-06,1.5e-05,5.2e-05,2.8e-05,0.00011,-1.3e-05,-0.000108,-8.5e-05,8.1e-05,-2.2e-05,-7e-06,-9.5e-05,-2e-05,-1.5e-05,-6.3e-05,-4.1e-05,-3.9e-05,5e-05,-5.1e-05,-3.2e-05,5e-06,2e-05,-2.8e-05,-3.7e-05,5.5e-05,-6.8e-05,4.2e-05,-1.9e-05,-4e-05,-3e-06,-8e-06,-8.7e-05,-1e-06,-1.6e-05,4.3e-05,2.4e-05,0,7.4e-05,-3e-06,0.000108,5e-06,4.6e-05,-0.000174,2.4e-05,9e-06,0.000161,-4e-05,-4.7e-05,-1.7e-05,2e-06,-3.6e-05,-8.3e-05,-5.2e-05,-5.8e-05,1.5e-05,-1.7e-05,3.5e-05,-2.7e-05,-1e-06,-6.1e-05,-6.3e-05,3.5e-05,4.1e-05,-4.2e-05,-6.2e-05,2.8e-05,8e-06,8.8e-05,0.000132,2.3e-05,1.6e-05,-3.9e-05,-3.6e-05,-4e-05,-1.8e-05,-2.8e-05,-2.6e-05,-9.7e-05,5.7e-05,8.8e-05,-2.1e-05,6.4e-05,2.2e-05,-5.8e-05,-4.8e-05,6e-06,2e-06,-5.8e-05,5.2e-05,2.9e-05,3.4e-05,0.000111,-3e-06,4.5e-05,-5e-06,4.5e-05,-2.7e-05,2.5e-05,0.000125,7.2e-05,0.000113
-0.000113,1.4e-05,1.4e-05,2.3e-05,-1.7e-05,7.7e-05,6e-05,3.1e-05,2.1e-05,3e-05,6.6e-05,3.2e-05,2.2e-05,0.000137,3e-05,7.4e-05,-2.9e-05,-5.5e-05,-1e-05,-2.5e-05,-9e-06,-7.3e-05,-1.1e-05,-2.8e-05,-4.1e-05,-3e-06,8.5e-05,7.5e-05,-4.9e-05,-2.7e-05,5.6e-05,2.9e-05,3.8e-05,3.1e-05,9e-06,2.3e-05,9.5e-05,-2.6e-05,-1.8e-05,2.7e-05,-3.1e-05,1.8e-05,4.4e-05,4.2e-05,2.1e-05,1.4e-05,-5.2e-05,-4.6e-05,4e-05,-2.5e-05,-5.5e-05,2.8e-05,2.3e-05,-5e-06,-2.4e-05,-2e-05,-1e-05,7.2e-05,-1.1e-05,6.3e-05,2.3e-05,9.2e-05,0.000113,7e-06,-3.6e-05,3e-06,-3.1e-05,2.8e-05,-3.4e-05,-7e-06,1e-06,5.5e-05,-1.5e-05,4.1e-05,-5.6e-05,2.8e-05,-4.9e-05,5.9e-05,1.7e-05,3.5e-05,1.8e-05,-6.8e-05,-5.3e-05,2.5e-05,-4.6e-05,2.5e-05,-2.4e-05,-3.7e-05,-8.9e-05,-3.4e-05,1.6e-05,-1.7e-05,8.5e-05,5.5e-05,3.8e-05,-2.1e-05,3.2e-05,2.5e-05,4.2e-05,2.2e-05,-6.5e-05,-4e-05,-2.4e-05,-3.4e-05,-2.7e-05,-1.6e-05,-4e-06,1e-06,-3.1e-05,-9.6e-05,-1.8e-05,-3.6e-05,-2e-06,-4.2e-05,-4.5e-05,-6.2e-05,4e-05,-1e-06,-0.00016,5e-06,3.2e-05
2.6e-05,-8e-06,-4.2e-05,-2.1e-05,3e-06,1.7e-05,-8.8e-05,2.9e-05,-2e-06,4.8e-05,-3.3e-05,2.5e-05,-3.8e-05,4e-06,-1.4e-05,-1.3e-05,2.1e-05,3.8e-05,5e-06,-1.1e-05,2.2e-05,2e-05,1e-06,-3.6e-05,-2.7e-05,-1e-06,-4.7e-05,-1.4e-05,4.1e-05,2.6e-05,-6e-06,8e-06,-3.5e-05,-2.4e-05,-4.8e-05,1e-06,-7.3e-05,7.1e-05,2.6e-05,-1.8e-05,-1.2e-05,-1.7e-05,-2e-05,-3.4e-05,-7.3e-05,2.8e-05,7.3e-05,8.4e-05,-4.1e-05,-1.3e-05,5.2e-05,1.4e-05,7e-06,-3e-06,-7e-06,-8.3e-05,4.5e-05,-5.3e-05,1.2e-05,-0.000123,-5.3e-05,-0.00011,8e-06,-3e-05,3.1e-05,-5.6e-05,3e-05,-2.1e-05,2.8e-05,3.1e-05,1.6e-05,-3.5e-05,1.9e-05,-1e-06,6.3e-05,1.5e-05,5e-06,-7.5e-05,7e-06,-3.5e-05,1e-05,2.1e-05,5.6e-05,-8e-06,6.3e-05,-2.6e-05,-3.1e-05,3.3e-05,-9e-05,1.2e-05,1.5e-05,1e-05,-4.1e-05,-4.5e-05,-8e-05,-2.4e-05,-1e-05,3.3e-05,-2.7e-05,-2.8e-05,5.6e-05,4e-05,3.7e-05,8.2e-05,-3.2e-05,8e-06,-3.1e-05,2.5e-05,-7e-06,0.000116,-4.4e-05,-9e-06,1.1e-05,1.3e-05,8e-06,-2.1e-05,5e-06,1.7e-05,1.7e-05,-2e-05,-3.5e-05
-2e-06,1.9e-05,6.9e-05,1.8e-05,2.3e-05,-4.8e-05,4e-05,-2.7e-05,-1.1e-05,-7e-05,-1.4e-05,-2.9e-05,1.9e-05,-3.3e-05,-9e-06,-4.5e-05,4e-06,3.4e-05,1.9e-05,3.7e-05,0,4.6e-05,-1.5e-05,7e-06,3.7e-05,-1.5e-05,-1.6e-05,-2.3e-05,-5.3e-05,-1.5e-05,-5.5e-05,-1.2e-05,3.7e-05,2e-05,-5e-06,-8e-06,1.1e-05,-2e-05,4.1e-05,8e-06,7.4e-05,-3e-06,-3.1e-05,2.3e-05,4.8e-05,1e-05,-9.3e-05,-5.2e-05,1.3e-05,2e-06,-8e-06,-1.9e-05,-1.1e-05,1.9e-05,4.1e-05,6.2e-05,-3.1e-05,8e-06,-1.6e-05,2.6e-05,4.3e-05,-6e-06,-5.8e-05,4.2e-05,-9e-06,-4.5e-05,3.1e-05,2.2e-05,9e-06,-1.5e-05,2.8e-05,6.6e-05,-4e-06,-2.1e-05,-1.6e-05,-2.2e-05,1.7e-05,1e-05,-2.5e-05,4e-06,-6.1e-05,-6e-06,-2.9e-05,5e-06,-5.1e-05,-2e-06,2.1e-05,-3.3e-05,8.6e-05,1e-05,-1.6e-05,-4.5e-05,-4e-06,2.5e-05,5.6e-05,3.5e-05,-2e-06,-4.7e-05,-3.6e-05,-6.4e-05,-2e-05,-0.000133,2e-06,-5.8e-05,6.1e-05,1.6e-05,2.7e-05,1e-06,5e-06,-1.7e-05,6.6e-05,3e-05,-3.1e-05,-1.6e-05,-1.5e-05,6.9e-05,-8e-06,-1.6e-05,9.2e-05,9e-06,-6.5e-05
5e-06,-3.2e-05,-6.1e-05,-2.9e-05,-6.2e-05,3.7e-05,3.8e-05,-8e-06,3.5e-05,6.3e-05,2.8e-05,-1.8e-05,-1.7e-05,3e-06,0,4.1e-05,3.8e-05,-1.5e-05,-1.9e-05,4.4e-05,1e-05,-1.2e-05,1.2e-05,2.6e-05,-4e-05,2.6e-05,5.4e-05,-2.1e-05,2.8e-05,9e-06,3.2e-05,-1.3e-05,-4.1e-05,7.9e-05,5e-05,4e-06,4.7e-05,-3.7e-05,-3.8e-05,9e-06,-3e-05,1e-06,5.8e-05,4e-06,0,-3.6e-05,3.5e-05,0,-4e-06,9e-06,-4.9e-05,3e-06,9e-06,3e-06,-4.6e-05,3.9e-05,1.4e-05,-8e-06,7e-06,3.8e-05,-1.9e-05,9e-06,6.1e-05,-3.4e-05,-1.6e-05,8e-06,-1.6e-05,-2.5e-05,1e-05,5e-06,-3.6e-05,-5.8e-05,1e-05,2e-05,-2.1e-05,1e-06,-3e-05,2.3e-05,1.4e-05,2.6e-05,5.5e-05,3.1e-05,1.2e-05,-7e-06,5.8e-05,1e-06,-1e-06,-2.9e-05,3.4e-05,-1e-06,3e-06,4.5e-05,6e-06,-1e-05,2.9e-05,1.5e-05,3.4e-05,3.6e-05,-1.3e-05,5e-06,-3.5e-05,0.000121,-2e-06,7.6e-05,-3.3e-05,-1.9e-05,3.1e-05,-9e-06,-2.3e-05,-3.4e-05,-4.2e-05,-2.8e-05,1e-06,3.9e-05,-2.4e-05,7e-06,-1e-06,7e-06,-8.8e-05,-1e-06,4e-06
3.9e-05,3e-06,4.8e-05,3.9e-05,1.8e-05,-4.4e-05,-3.8e-05,1.8e-05,-4.1e-05,-3.8e-05,-2.5e-05,2e-05,-1.8e-05,-3.3e-05,-3e-06,7e-06,1.6e-05,-5e-06,5e-06,-3.2e-05,-3.2e-05,-4.2e-05,-2.8e-05,1.2e-05,3e-06,-1.9e-05,-4.4e-05,4.7e-05,-1.6e-05,0,1.9e-05,2.7e-05,4.5e-05,-2.1e-05,-4.1e-05,-2e-06,-3.2e-05,1.7e-05,-1.7e-05,-5e-06,-1.4e-05,3e-05,-6.1e-05,2.6e-05,-2e-06,-1e-06,7e-06,-2e-05,1e-05,-1e-06,5.5e-05,7e-06,-1.8e-05,-7e-06,7e-06,-2.3e-05,1.4e-05,2e-05,8e-06,-4.2e-05,1.1e-05,-4.3e-05,-6.6e-05,1.1e-05,2.5e-05,3.9e-05,-4e-06,2.9e-05,-1.6e-05,-4e-06,-1.1e-05,3e-05,-1e-05,-2.3e-05,2.3e-05,8e-06,2.3e-05,-4e-06,4e-06,-1.9e-05,2.1e-05,-1.2e-05,-1e-05,-1e-06,8e-06,3e-06,8e-06,1e-05,-7.2e-05,5e-06,-4e-06,1.5e-05,-1.7e-05,4e-06,-1.2e-05,-4.1e-05,-5.1e-05,1e-06,1.4e-05,3.2e-05,3.8e-05,-6.7e-05,-1.7e-05,-6e-05,2.4e-05,2.2e-05,-3.7e-05,-3.5e-05,1.7e-05,2.2e-05,2.1e-05,7e-06,1.2e-05,-4.4e-05,5.4e-05,-4.9e-05,-3e-06,-1.1e-05,1e-04,2.1e-05,7.3e-05
-2.9e-05,-8e-06,-3.7e-05,-2.9e-05,-2e-06,9e-06,-4.6e-05,-2e-05,1.8e-05,-2.2e-05,2.3e-05,1.5e-05,2.9e-05,-3e-06,0,-1.3e-05,-2e-05,-1.5e-05,4e-06,-1.9e-05,2.4e-05,2.8e-05,1.7e-05,-3e-06,4.4e-05,2.4e-05,2.7e-05,-3.5e-05,1.6e-05,-1.9e-05,-3e-06,6.2e-05,-3.5e-05,-5.5e-05,5.4e-05,1e-06,-8e-06,-1.9e-05,4e-06,6e-06,2.2e-05,-4e-05,2.6e-05,-4e-05,-4e-06,3e-05,-7e-06,6.6e-05,0,1e-06,-2e-05,0,-2e-06,1e-06,2.6e-05,-2.6e-05,-3e-05,-3.3e-05,-7e-06,-4.2e-05,2e-06,7.8e-05,3.2e-05,-3e-06,-7e-06,2.6e-05,-5e-06,-2.7e-05,3.2e-05,-1.3e-05,2.3e-05,-1.2e-05,-2e-06,2.3e-05,-4e-06,-4e-06,2e-06,-5.6e-05,8e-06,1.4e-05,-3.4e-05,-9e-06,1.2e-05,5e-06,-3.5e-05,-9e-06,-1e-06,1.8e-05,1.8e-05,-1.6e-05,-9e-06,-1.7e-05,4e-06,-1.2e-05,-2.9e-05,6e-06,3.8e-05,-3e-05,5e-06,-4e-06,-1.6e-05,5.4e-05,3e-06,-1.9e-05,-1.3e-05,-1e-05,2e-05,3.5e-05,-2e-06,-1.6e-05,-4.9e-05,-2.6e-05,-6e-06,1.1e-05,-3e-06,-2e-06,9e-06,2e-05,-0.000136,-2.3e-05,-4e-06
3.7e-05,7e-06,1.4e-05,2.1e-05,-2.5e-05,4.4e-05,4e-05,0,-9e-06,4.2e-05,5e-06,-2.5e-05,8e-06,3.6e-05,1e-06,-7e-06,-1.8e-05,-7e-06,-2e-06,-1.2e-05,-3e-06,1.2e-05,-1e-05,-2.3e-05,-3.9e-05,-7e-06,-1.3e-05,1.2e-05,1e-06,2.8e-05,-3e-06,-5.9e-05,3.9e-05,2.6e-05,-6.6e-05,8e-06,2.3e-05,1.6e-05,1.3e-05,7e-06,-1.4e-05,4e-05,9e-06,1.6e-05,-9e-06,-1.7e-05,4.4e-05,-6e-05,-5e-06,-3e-06,-1.4e-05,-1.9e-05,1.1e-05,-1e-06,-3.7e-05,-2.6e-05,1.6e-05,4.6e-05,8e-06,6.4e-05,-9e-06,-7e-06,1.1e-05,-5e-06,-1.5e-05,-1.4e-05,7e-06,2e-05,-2.2e-05,-9e-06,7e-06,1.7e-05,1.6e-05,-2e-06,-9e-06,-5e-06,-2.4e-05,6.2e-05,-3e-06,-4e-06,-2e-06,-1.1e-05,1.6e-05,-1.9e-05,3.4e-05,1.7e-05,9e-06,-6e-06,2.2e-05,1.2e-05,-1.3e-05,1.9e-05,-2e-06,1.8e-05,1.3e-05,2.3e-05,-2.4e-05,2e-05,-1e-05,-1.9e-05,-7e-06,-3.7e-05,7e-06,7.1e-05,8e-06,-2e-06,-1e-05,1e-06,-1e-06,1.1e-05,8.2e-05,-1.3e-05,-4e-06,7e-06,1.6e-05,7e-06,6e-06,-1.9e-05,9.7e-05,-4e-06,-5.6e-05
-2.6e-05,8e-06,6e-06,-2.2e-05,5.5e-05,-3.5e-05,2.3e-05,7e-06,3e-06,-3.9e-05,-1.6e-05,4e-06,-2.3e-05,7e-06,1e-06,1.8e-05,-2.1e-05,2.7e-05,-6e-06,2.2e-05,-4e-06,-2.5e-05,6e-06,1e-06,-2.3e-05,0,-1.3e-05,0,-4e-06,-1.8e-05,-7e-06,-2.3e-05,-3.8e-05,2.3e-05,5.7e-05,-7e-06,-7e-06,2.7e-05,-3e-06,-9e-06,9e-06,-4.9e-05,-2.6e-05,-1e-05,1.1e-05,-1e-05,-5.2e-05,2.3e-05,3e-06,-1e-06,2.7e-05,3e-05,0,-2e-06,1.5e-05,6.4e-05,5e-06,-5e-06,-1e-06,2.5e-05,1.1e-05,-3.9e-05,-3.1e-05,1.5e-05,0,-1.1e-05,6e-06,-1.6e-05,0,6e-06,-1.2e-05,-4e-06,1e-06,-1.9e-05,8e-06,7e-06,2.4e-05,-2.6e-05,-2e-06,3e-06,-1.1e-05,5e-06,-3.2e-05,2.5e-05,-4.1e-05,-8e-06,-6e-06,1.4e-05,-2.2e-05,-8e-06,1.5e-05,-1.7e-05,2.9e-05,-8e-06,-1.6e-05,-4e-06,2.3e-05,7e-06,-4e-06,2e-06,2e-05,-1e-05,-6e-06,-7.9e-05,-1.7e-05,1.6e-05,-7e-06,8e-06,1e-05,-1e-05,-4.7e-05,5.1e-05,7e-06,4e-06,-1.6e-05,2e-06,-1e-06,3e-06,3e-06,-5e-06,-1.8e-05
1.7e-05,0,-2.6e-05,2.3e-05,-2.6e-05,-1e-05,-5.5e-05,-1.5e-05,0,4.3e-05,5e-06,1.2e-05,5e-06,-2.1e-05,3e-06,-8e-06,8e-06,-2e-05,6e-06,2.2e-05,-4e-06,5e-06,-1e-05,2e-06,4.3e-05,-8e-06,3.4e-05,2e-06,-3e-06,1.2e-05,2e-05,4.1e-05,3.4e-05,-2.4e-05,-2.5e-05,4e-06,-1.4e-05,-2.4e-05,8e-06,9e-06,-8e-06,4.8e-05,1.9e-05,3e-06,2e-06,1.7e-05,3.5e-05,-4e-06,-8e-06,-4e-06,-2e-06,-2.1e-05,4e-06,7e-06,1.8e-05,1.2e-05,-1.9e-05,-1.5e-05,-2e-06,-3.8e-05,3e-06,3e-05,4.4e-05,-1.8e-05,1.7e-05,-5.4e-05,-1.5e-05,1.1e-05,1e-05,-1e-06,5e-06,-2e-05,-4e-06,1.5e-05,0,-4e-06,-5e-06,-2.7e-05,-1.1e-05,-7e-06,1.8e-05,1.2e-05,2.6e-05,-1.8e-05,2e-05,-5e-06,-1.2e-05,-8e-06,1.1e-05,-4e-06,4e-06,-1.8e-05,-3.4e-05,-1e-06,2e-05,-1.4e-05,-8e-06,-3e-05,1.2e-05,1.6e-05,-9e-06,1.3e-05,1e-06,9.1e-05,4e-06,-7e-06,4.5e-05,-2.4e-05,-7e-06,2.2e-05,-1.6e-05,-1.6e-05,-4e-06,1e-06,-3.7e-05,2.1e-05,-6e-06,-6e-06,-4.8e-05,1.4e-05,4.3e-05
-1.1e-05,-4e-06,3.3e-05,-1.8e-05,1.3e-05,2.1e-05,2.8e-05,2.1e-05,4e-06,-2.3e-05,0,7e-06,1.2e-05,1.8e-05,-3e-06,-1.7e-05,8e-06,3e-06,-1e-06,-2e-05,5e-06,1.2e-05,1.8e-05,1.2e-05,-1.2e-05,1.2e-05,-3e-05,-2.9e-05,6e-06,-1.1e-05,1.5e-05,-4.3e-05,-2.7e-05,1.7e-05,2.3e-05,-3e-06,8e-06,4e-06,-1.5e-05,-4e-06,-1.5e-05,-3.7e-05,-5e-06,-2e-06,-1.4e-05,5e-06,-3.2e-05,1.9e-05,6e-06,-6e-06,-1.7e-05,-5e-06,-4e-06,-4e-06,-3.3e-05,-5.6e-05,1.6e-05,0,1e-06,-6e-06,-1.6e-05,-1.6e-05,-3.2e-05,9e-06,-2e-05,4.5e-05,-1e-06,-6e-06,0,1.1e-05,-2e-06,1.6e-05,-6e-06,-1.1e-05,4e-06,1.3e-05,-1e-05,3.6e-05,-2e-06,0,2.2e-05,1e-06,-5e-06,1.4e-05,0,6e-06,3e-06,-2.8e-05,5e-06,9e-06,1e-06,2.3e-05,1e-06,-2e-06,6e-06,-5e-06,-7e-06,3.3e-05,-5e-06,1.7e-05,-3e-06,3.4e-05,-9e-06,-6.7e-05,2.4e-05,-1.5e-05,-4e-05,1e-06,1e-06,-1.8e-05,4.4e-05,0,-8e-06,-1.5e-05,8e-06,6e-06,-2e-06,3e-06,5.2e-05,-1e-05,3.9e-05
2.1e-05,-3e-06,-1.5e-05,1e-05,2e-06,-6e-06,3.4e-05,3e-06,3e-06,4e-06,1e-06,-1.8e-05,-7e-06,-2.9e-05,0,6e-06,1.1e-05,1.3e-05,-4e-06,-6e-06,-5e-06,-8e-06,-2.5e-05,1e-06,-2.2e-05,-1.8e-05,2.1e-05,2.7e-05,-2.3e-05,8e-06,-3.4e-05,0,2e-05,-2e-06,-2e-06,1e-06,9e-06,-2e-06,-1e-05,5e-06,2.1e-05,3e-05,-1.2e-05,1.2e-05,1e-06,-1.4e-05,2e-05,-4.1e-05,0,-1e-06,0,2.3e-05,-2e-06,-4e-06,2e-05,-3e-06,-1e-06,1.5e-05,-2e-06,2.6e-05,1.8e-05,5e-06,8e-06,2e-06,1e-06,6e-06,1.2e-05,3e-06,0,9e-06,0,-1.4e-05,-3e-06,9e-06,-1e-05,-2.1e-05,9e-06,4e-06,1.5e-05,6e-06,-2.7e-05,-1e-06,-1e-06,-8e-06,3e-06,4e-06,1e-06,3.1e-05,-2e-06,-4e-06,0,-9e-06,2.6e-05,8e-06,-3e-06,1.1e-05,1.3e-05,-1.2e-05,-5e-06,-2.1e-05,1.2e-05,-4.6e-05,0,5e-06,-1.3e-05,1.7e-05,-2.1e-05,8e-06,2e-06,0,-1.4e-05,1.2e-05,1.8e-05,1.4e-05,8e-06,-4.6e-05,5e-06,-9e-06,-7.3e-05,6e-06,-2.3e-05
-3.3e-05,-3e-06,4e-06,-7e-06,-2.3e-05,7e-06,-2.4e-05,-1.4e-05,-8e-06,-7e-06,6e-06,-5e-06,2e-06,-1e-06,2e-06,1.4e-05,3e-06,-1.5e-05,7e-06,-8e-06,1e-05,-7e-06,2.9e-05,-9e-06,2.7e-05,1e-05,-1e-06,-6e-06,3.5e-05,-3e-06,-2e-06,4.9e-05,-1.2e-05,-2e-05,-1.8e-05,4e-06,-1.7e-05,-1.4e-05,1.3e-05,5e-06,6e-06,-3.3e-05,2e-05,-1.5e-05,2.4e-05,-7e-06,-5e-06,3.2e-05,4e-06,4e-06,2.1e-05,-2e-05,-2e-06,3e-06,7e-06,3e-05,-1.4e-05,-1.2e-05,-1e-06,-1.4e-05,-7e-06,4e-05,1.3e-05,-2e-06,9e-06,2.6e-05,-1e-06,-3e-06,4e-06,-2e-06,0,2.1e-05,5e-06,3e-06,2e-06,1.1e-05,-9e-06,-3.4e-05,-5e-06,-1.6e-05,-6e-06,-1.4e-05,-6e-06,7e-06,1e-06,-5e-06,7e-06,-2.2e-05,6e-06,0,4e-06,-8e-06,-1.9e-05,-1.3e-05,-1.2e-05,3e-06,-1.3e-05,-1.4e-05,5e-06,-2.6e-05,-5e-06,2.6e-05,-2e-06,3.4e-05,-9e-06,-5e-06,3.4e-05,1e-05,-6e-06,8e-06,-2e-06,-2.6e-05,-7e-06,-6e-06,8e-06,1e-05,0,1.3e-05,9e-05,-7e-06,-5.1e-05
3.8e-05,2e-06,-1e-05,7e-06,4e-06,3e-06,-1.9e-05,-6e-06,9e-06,5e-06,-2e-06,9e-06,6e-06,2e-05,-2e-06,-7e-06,-2e-06,9e-06,-4e-06,1.3e-05,-9e-06,1.5e-05,-2.2e-05,-5e-06,-3e-06,-9e-06,-2.1e-05,-3e-06,-2.5e-05,3e-06,3.1e-05,-2.4e-05,6e-06,-1.2e-05,2.3e-05,-5e-06,1.1e-05,2.1e-05,1.1e-05,-9e-06,-2.2e-05,1.9e-05,-8e-06,9e-06,-2.1e-05,1.5e-05,-3e-06,1e-06,-5e-06,3e-06,-1.3e-05,4e-06,2e-06,-4e-06,-2.4e-05,2.4e-05,1.7e-05,9e-06,3e-06,-3.1e-05,-5e-06,-2.8e-05,-3.3e-05,-1e-06,3e-06,-3.9e-05,-9e-06,6e-06,3e-06,0,-4e-06,-3e-05,5e-06,-1.3e-05,1.2e-05,-4e-06,-3e-06,1.7e-05,3e-06,1.2e-05,1.1e-05,6e-06,1e-06,-6e-06,-5e-06,2e-06,1e-06,1.9e-05,-1.1e-05,5e-06,-3e-06,2.5e-05,-1e-06,1.3e-05,-4e-06,-2e-06,6e-06,2.3e-05,1.3e-05,-4e-06,-7e-06,-1.5e-05,3e-06,-5.6e-05,-1e-06,-1.2e-05,7e-06,-2e-06,3e-06,-1.9e-05,-6e-06,2e-06,-1.1e-05,8e-06,1.5e-05,3.5e-05,-2e-06,-1.1e-05,-5.9e-05,1e-05,1.2e-05
-5.4e-05,2e-06,1.7e-05,-7e-06,3e-06,-2.4e-05,2.1e-05,1e-06,-6e-06,-1e-06,-5e-06,9e-06,-7e-06,-1e-06,2e-06,-1e-05,-4e-06,-9e-06,-3e-06,9e-06,3e-06,-2e-06,1e-05,2e-06,-1.8e-05,-7e-06,2.8e-05,-9e-06,6e-06,-5e-06,-1.3e-05,-3e-06,-1e-06,-1e-06,-3e-05,3e-06,6e-06,-7e-06,-3e-06,8e-06,1e-05,-4e-06,-1.6e-05,-4e-06,-5e-06,5e-06,2e-05,-1.1e-05,0,0,-1.3e-05,9e-06,5e-06,0,1.7e-05,-3e-05,-7e-06,4e-06,0,2.4e-05,1.1e-05,-8e-06,4e-05,-1e-06,-9e-06,0,3e-06,-6e-06,-5e-06,-7e-06,5e-06,2.6e-05,-2e-06,9e-06,-1.7e-05,1e-05,6e-06,2.4e-05,-1e-06,-4e-06,-4e-06,0,9e-06,2e-06,-4e-06,0,-4e-06,9e-06,-5e-06,-1e-05,-7e-06,-1.4e-05,6e-06,-5e-06,3e-06,-4e-06,-6e-06,-1.3e-05,-1e-06,1.9e-05,1.1e-05,1.2e-05,1e-06,7.2e-05,1.2e-05,5e-06,-3.4e-05,-2.2e-05,-2e-06,2.3e-05,4e-06,9e-06,3e-06,-1.3e-05,-1.6e-05,-1.9e-05,-2e-06,5e-06,1e-06,0,5.2e-05
4.2e-05,-1e-06,-1.2e-05,7e-06,-1e-05,7e-06,6e-06,5e-06,0,8e-06,1e-06,-1.1e-05,1e-06,-1e-06,-2e-06,5e-06,-9e-06,4e-06,5e-06,-1e-05,2e-06,-1.2e-05,4e-06,8e-06,2.5e-05,-4e-06,-1.7e-05,1.8e-05,1.4e-05,3e-06,-9e-06,1.9e-05,-3e-06,5e-06,3.6e-05,-3e-06,-1e-05,-1e-06,-1.2e-05,-1e-06,1.2e-05,-1e-06,3.1e-05,8e-06,2e-05,-1.3e-05,-3.4e-05,-9e-06,1e-06,-4e-06,2.7e-05,-1.1e-05,-1e-06,2e-06,-2e-06,-2.9e-05,-5e-06,-3e-06,2e-06,2.8e-05,-1.4e-05,1e-05,-2.3e-05,4e-06,6e-06,-4e-06,2e-06,4e-06,-3e-06,-9e-06,7e-06,-1.8e-05,-3e-06,-5e-06,1.3e-05,-1e-05,-2e-06,-3.5e-05,-5e-06,-2e-06,3e-06,1.1e-05,-1.3e-05,0,-2e-06,-2e-06,3e-06,-3.2e-05,1.9e-05,1e-05,-2e-06,-8e-06,6e-06,-1e-06,1.2e-05,1e-06,1.3e-05,-9e-06,-1.3e-05,4e-06,-6e-06,1.3e-05,-1e-06,-5.6e-05,1e-06,-2e-06,7e-06,5e-06,1e-06,-6e-06,8e-06,-1.1e-05,2e-06,7e-06,0,-1e-06,0,-1e-06,3.9e-05,3e-06,-2e-06
-1.5e-05,4e-06,0,-7e-06,1.8e-05,1.9e-05,-3.5e-05,9e-06,0,-7e-06,3e-06,2e-06,-1e-06,5e-06,-1e-06,1.3e-05,3e-06,1.1e-05,-1e-06,-3e-06,-4e-06,4e-06,-1.6e-05,1e-06,-3e-06,2e-05,8e-06,-1.9e-05,-2.5e-05,1e-06,1.1e-05,-2.9e-05,6e-06,5e-06,-3.4e-05,3e-06,5e-06,6e-06,-2e-06,2e-06,-4e-06,2e-06,-3e-05,-1.1e-05,-1.4e-05,-4e-06,3.4e-05,1.8e-05,1e-06,-3e-06,-9e-06,2e-06,2e-06,-3e-06,-1.5e-05,3e-05,1.1e-05,-9e-06,-1e-06,-2.6e-05,1e-05,-2.9e-05,-2e-06,-8e-06,5e-06,1.4e-05,-3e-06,-3e-06,2e-06,-3e-06,-7e-06,1.7e-05,0,4e-06,-1e-06,7e-06,0,1.6e-05,4e-06,1e-05,8e-06,-8e-06,6e-06,-2e-06,9e-06,-1e-06,-3e-06,2.4e-05,-1e-05,-5e-06,0,1.7e-05,-6e-06,-2e-06,1.1e-05,4e-06,-1.4e-05,2.5e-05,-4e-06,-1.9e-05,-9e-06,-3.2e-05,4e-06,1.7e-05,0,-3e-06,6e-06,9e-06,3e-06,-9e-06,-2.4e-05,1.9e-05,0,3e-06,-3e-06,6e-06,2e-06,3e-06,-6.1e-05,-4e-06,-4.4e-05
-1.3e-05,-1e-06,9e-06,8e-06,-2e-06,-1.2e-05,1.5e-05,-6e-06,0,6e-06,-2e-06,4e-06,-4e-06,-1.6e-05,0,-1e-05,5e-06,-6e-06,-4e-06,-7e-06,2e-06,6e-06,2.2e-05,-2e-06,-2.4e-05,-1e-05,7e-06,6e-06,1.1e-05,-1e-06,-1.5e-05,-6e-06,-1e-05,-1.5e-05,2.1e-05,-2e-06,0,-1e-05,5e-06,0,-1.2e-05,-1.2e-05,1.2e-05,9e-06,7e-06,1.1e-05,-2.8e-05,-3e-06,2e-06,-1e-06,-1.7e-05,5e-06,-6e-06,0,1.9e-05,2.4e-05,-8e-06,9e-06,-1e-06,-3e-06,-3e-06,2.1e-05,2e-05,8e-06,-5e-06,3e-06,2e-06,2e-06,0,3e-06,-1e-06,-1.2e-05,0,4e-06,-5e-06,-1e-05,0,1.7e-05,7e-06,-9e-06,-6e-06,2e-06,-1e-06,1e-06,-3e-06,-1e-06,-1e-06,-1.7e-05,-1.4e-05,0,2e-06,-2e-05,-1e-05,8e-06,-2.3e-05,-5e-06,8e-06,-2.2e-05,1.2e-05,-2e-06,1.4e-05,1.1e-05,2e-06,1.1e-05,1e-06,3e-06,8e-06,1.2e-05,-2e-06,1.3e-05,2e-05,-1.1e-05,-1e-06,-4e-06,-1.1e-05,-2.1e-05,0,-3e-06,7.6e-05,-4e-06,-1.2e-05
3.4e-05,1e-06,-9e-06,-8e-06,-8e-06,-4e-06,2e-05,1e-06,0,-9e-06,4e-06,0,2e-06,-2e-06,-1e-06,-9e-06,5e-06,-5e-06,4e-06,1.1e-05,-2e-06,-5e-06,-2.4e-05,-4e-06,2.3e-05,-3e-06,-2e-05,5e-06,6e-06,1e-06,-2e-06,1.7e-05,1.4e-05,-1e-06,-1.6e-05,1e-06,-1e-06,6e-06,6e-06,-4e-06,2e-06,1.6e-05,9e-06,-1e-05,-8e-06,1e-06,2.1e-05,-1.7e-05,-4e-06,1e-06,2.1e-05,-2e-06,1e-06,2e-06,-6e-06,-1.5e-05,-3e-06,2e-06,1e-06,1.8e-05,-5e-06,9e-06,-3.3e-05,-6e-06,-1e-06,6e-06,-2e-06,-2e-06,-2e-06,4e-06,3e-06,2e-06,1e-06,-1.1e-05,2e-06,1.3e-05,-3e-06,-2.2e-05,2e-06,8e-06,-6e-06,-8e-06,5e-06,-2e-06,9e-06,4e-06,1e-06,7e-06,1.8e-05,3e-06,3e-06,1e-06,1.5e-05,-8e-06,-4e-06,-2e-06,-4e-06,7e-06,1e-06,9e-06,-6e-06,1e-06,2e-06,-2.7e-05,-1e-06,-6e-06,-1.3e-05,-1.8e-05,1e-06,-6e-06,-1.4e-05,-4e-06,-4e-06,-2e-06,6e-06,1.9e-05,-1e-06,6e-06,-6.7e-05,0,3.4e-05
-4.2e-05,-3e-06,2e-06,7e-06,1.1e-05,5e-06,-1.2e-05,7e-06,0,7e-06,-4e-06,-7e-06,4e-06,1.5e-05,-1e-06,9e-06,-1e-06,6e-06,1e-06,4e-06,2e-06,0,2e-05,1e-06,7e-06,-3e-06,2e-05,5e-06,-1.3e-05,-3e-06,2e-05,-2e-06,-1.7e-05,1.3e-05,1e-06,-1e-06,-2e-06,2e-06,1e-06,3e-06,8e-06,-1.5e-05,-2.3e-05,5e-06,1e-06,-6e-06,-4e-06,1.6e-05,4e-06,2e-06,-4e-06,-7e-06,1e-06,-2e-06,-1.3e-05,-3.2e-05,1.1e-05,-6e-06,-1e-06,-1.4e-05,8e-06,-2.6e-05,3.4e-05,4e-06,2e-06,-1.4e-05,2e-06,1e-06,0,8e-06,-2e-06,8e-06,-1e-06,7e-06,-1e-06,-1.2e-05,1e-06,-7e-06,-4e-06,-3e-06,-3e-06,7e-06,-6e-06,4e-06,-7e-06,-2e-06,-1e-06,1.4e-05,-2e-06,-4e-06,1e-06,1.7e-05,-7e-06,3e-06,3e-06,4e-06,-1e-06,8e-06,-1.1e-05,1.3e-05,-7e-06,2.1e-05,0,3.8e-05,-7e-06,2e-06,-1.1e-05,-1e-05,-1e-06,-1.4e-05,1.5e-05,1.5e-05,-1e-06,3e-06,-2e-06,1.2e-05,-1e-06,-2e-06,3.7e-05,4e-06,2.5e-05
3.5e-05,-3e-06,2e-06,-6e-06,-1.7e-05,-8e-06,-8e-06,-1e-05,3e-06,1e-06,0,2e-06,-4e-06,-7e-06,0,2e-06,-2e-06,-4e-06,-4e-06,-5e-06,0,4e-06,-1.2e-05,3e-06,-2.6e-05,1.1e-05,-1.1e-05,-1.9e-05,1.1e-05,5e-06,-8e-06,5e-06,1.8e-05,-1.1e-05,1.5e-05,2e-06,3e-06,-4e-06,-5e-06,-3e-06,-4e-06,1.8e-05,2.2e-05,-2e-06,1.3e-05,0,-1.4e-05,1e-06,-4e-06,2e-06,-9e-06,1.1e-05,0,2e-06,1.7e-05,1.1e-05,-1.1e-05,9e-06,0,-1.1e-05,-4e-06,1.6e-05,-1.6e-05,-1e-06,0,2e-06,5e-06,-1e-06,4e-06,4e-06,0,-1.2e-05,-2e-06,-2e-06,0,1.2e-05,0,3.2e-05,-1e-06,0,3e-06,-2e-06,-4e-06,-6e-06,-2e-06,-1e-06,4e-06,-1.7e-05,-2e-05,3e-06,1e-06,-1.2e-05,-1e-06,1e-06,1.1e-05,2e-06,6e-06,-9e-06,-1e-06,-1.6e-05,1.3e-05,-2.4e-05,-1e-06,-2.8e-05,6e-06,8e-06,2.6e-05,7e-06,-1e-06,1.9e-05,-1.6e-05,-1.3e-05,3e-06,7e-06,1.2e-05,-2.7e-05,1e-06,0,-4e-06,-3e-06,-2.1e-05
-2e-05,-1e-06,1e-06,6e-06,3e-06,1.2e-05,1.5e-05,-1e-06,-3e-06,-1e-05,1e-06,5e-06,-2e-06,9e-06,0,-7e-06,0,-3e-06,2e-06,-4e-06,0,-5e-06,3e-06,1e-06,1.3e-05,-9e-06,-2e-06,1.7e-05,1e-06,-4e-06,-1.3e-05,8e-06,-1.9e-05,1.1e-05,-2.1e-05,-3e-06,0,2e-06,-8e-06,-3e-06,-6e-06,-2.4e-05,-9e-06,6e-06,-1.5e-05,4e-06,1.8e-05,-5e-06,5e-06,1e-06,9e-06,-4e-06,3e-06,0,-7e-06,3.3e-05,4e-06,-1e-05,-1e-06,1.1e-05,-4e-06,-7e-06,-9e-06,-3e-06,-3e-06,-8e-06,-5e-06,0,-6e-06,-1e-06,0,1.4e-05,0,0,4e-06,-1.2e-05,1e-06,-2.1e-05,-5e-06,3e-06,1.5e-05,7e-06,1e-05,6e-06,-1e-06,1e-06,0,7e-06,2e-05,2e-06,2e-06,7e-06,4e-06,-1e-06,0,-2e-06,-7e-06,-5e-06,1e-05,-1.2e-05,-5e-06,6e-06,-1e-06,2e-06,2e-06,-5e-06,-1e-05,1.4e-05,1e-06,-4e-06,9e-06,2e-06,-1e-06,-1.1e-05,6e-06,7e-06,1e-06,-2e-06,-2.8e-05,-6e-06,-3.3e-05
8e-06,3e-06,-5e-06,-6e-06,6e-06,5e-06,6e-06,6e-06,1e-06,2e-05,-1e-06,1e-06,3e-06,1e-06,1e-06,0,-2e-06,6e-06,1e-06,-3e-06,-3e-06,-2e-06,5e-06,-1e-06,1e-05,0,1.3e-05,-3e-06,-1.1e-05,6e-06,6e-06,-6e-06,2e-05,6e-06,2.9e-05,4e-06,-4e-06,0,2e-06,0,4e-06,2e-05,-7e-06,-8e-06,-2e-06,2e-06,-2e-05,-1.2e-05,-5e-06,-1e-06,0,-9e-06,-3e-06,-2e-06,-9e-06,-8e-06,5e-06,8e-06,0,5e-06,1.1e-05,-8e-06,2.6e-05,8e-06,2e-06,1.3e-05,-2e-06,-1e-06,0,-5e-06,-1e-06,-2.1e-05,2e-06,5e-06,-8e-06,1e-05,-1e-06,-9e-06,0,-6e-06,-2e-06,-7e-06,-4e-06,-5e-06,-2e-06,1e-06,-3e-06,0,9e-06,-7e-06,-2e-06,7e-06,-5e-06,-5e-06,3e-06,-1e-06,9e-06,2.3e-05,2e-06,-2e-06,-6e-06,-1.4e-05,-2e-06,1.2e-05,5e-06,-2e-06,-6e-06,-3e-06,0,-1.7e-05,6e-06,7e-06,0,3e-06,-1e-05,1.2e-05,0,3e-06,6e-05,3e-06,7e-06
