3.3e-05,2.3e-05,3e-05,3.2e-05,5e-06,1.7e-05,3.1e-05,3.8e-05,2.4e-05,4.5e-05,1e-05,3.4e-05,1e-06,0.000102,1.1e-05,2e-05,4e-06,1.4e-05,1.5e-05,0.000167,3.9e-05,0.000158,0.000104,4.9e-05,4.1e-05,0.000174,5.9e-05,5.7e-05,0.000136,8.2e-05,6.3e-05,0.000104,2.1e-05,0.000131,0.000242,1.8e-05,1.1e-05,2.2e-05,0.000108,0.000114,1.6e-05,3.6e-05,3.7e-05,0.000111,6.7e-05,0.000154,2.6e-05,3.4e-05,9.2e-05,4.7e-05,1.5e-05,4.5e-05,0.000134,6.5e-05,0.000116,8e-05,5e-05,1e-05,2.5e-05,7.4e-05,7.6e-05,1.8e-05,6.6e-05,9.6e-05,5.8e-05,3.2e-05,6.5e-05,6.2e-05,4.5e-05,8.7e-05,8e-06,1.2e-05,0.000221,9.1e-05,6e-05,5.2e-05,4.5e-05,9.5e-05,4e-06,1e-06,3.2e-05,0.000159,8.9e-05,5.4e-05,5.7e-05,2.2e-05,4.7e-05,0.000133,7.5e-05,0.000125,3.3e-05,6.5e-05,9e-06,5.1e-05,8.3e-05,0.000296,0.000137,9e-06,5e-06,1.8e-05,2.7e-05,6.5e-05,6.6e-05,0.00016,5.8e-05,8.4e-05,7.2e-05,0.000126,0.00012,2e-06,3e-05,7.8e-05,8.2e-05,5e-05,5.6e-05,2.1e-05,0.000236,6e-06,5.5e-05,4.7e-05,8.2e-05
7.4e-05,4.3e-05,7.1e-05,0.00011,3.3e-05,5.1e-05,7.4e-05,9.8e-05,0.000124,9.6e-05,3.7e-05,4.8e-05,6.1e-05,0.000295,9.2e-05,1.7e-05,3.2e-05,0.000125,0.000129,0.000276,0.000104,0.000281,0.000335,8e-05,0.000131,0.000342,0.00021,7e-05,0.000272,0.000226,0.00015,0.000291,0.000113,0.000248,0.00044,0.000139,8e-05,7.2e-05,0.000177,0.00019,8e-05,0.000219,0.000197,8.1e-05,3e-04,0.000289,0.000224,9e-05,0.000174,0.000141,5.8e-05,0.000103,0.000394,0.000109,0.000209,0.000202,6.9e-05,0.000171,6.2e-05,0.000242,0.000184,0.000151,0.000236,0.000262,7.7e-05,7.2e-05,0.000155,0.000139,7.5e-05,0.000312,0.000149,1.1e-05,0.000432,0.00025,0.000245,0.000191,7e-05,0.00034,0.000108,6.8e-05,0.000198,0.000484,0.000237,0.000258,0.000254,0.000133,0.000182,0.000425,9.1e-05,0.000288,0.000112,6.2e-05,9.6e-05,9.7e-05,0.000282,0.000624,0.000282,0.000115,0.000132,7.3e-05,4e-05,0.00011,0.000206,0.000417,9.7e-05,7.9e-05,0.000149,0.00022,0.00023,3.2e-05,5.2e-05,0.000101,0.000131,0.000146,0.000207,0.000193,0.000457,9e-05,9.9e-05,0.000165,6.9e-05
0.00018,9.8e-05,9.8e-05,7.1e-05,8.6e-05,0.000105,0.000133,7.5e-05,0.000148,0.000241,5e-05,0.00011,0.000118,0.000265,0.000188,0.00015,3.6e-05,0.000191,0.000279,0.000181,0.000215,0.000162,0.000292,0.000267,0.000149,0.00024,0.000234,0.000307,0.000309,0.000407,0.000377,0.000316,0.000185,0.000416,0.00061,0.00028,5.7e-05,0.000145,0.000185,0.000211,0.00018,0.00053,0.000316,8.9e-05,0.00024,0.000236,0.000345,0.000117,0.000125,0.000189,0.000105,0.00033,0.00034,0.000369,0.000295,0.000162,0.000148,9.7e-05,7.3e-05,0.000344,5.1e-05,0.000128,0.000205,0.000171,0.000321,0.000245,0.00038,0.000225,0.000315,0.000156,7.1e-05,8.7e-05,0.000479,0.000155,0.000271,4.3e-05,0.000361,0.000158,3.3e-05,0.00019,0.000158,0.000462,0.000219,0.000485,0.000225,0.000111,0.000138,0.000372,0.000416,0.000505,3e-04,0.000122,0.00013,0.000332,0.000638,0.00071,8.5e-05,0.000108,0.000371,0.000104,0.000117,0.000291,0.000421,0.00019,0.000384,0.000285,8.7e-05,0.000419,0.000303,0.000173,0.000295,0.000205,0.000293,0.000119,0.000317,0.000376,0.000395,0.000378,0.00035,0.000173,0.000205
0.000107,9.5e-05,0.000196,0.000215,0.000131,0.000206,0.000136,0.000177,0.00016,0.000243,3e-04,0.000318,0.000164,0.000233,0.000236,0.000104,0.000183,9.9e-05,0.000187,0.000397,0.00043,0.000485,0.000322,0.000207,0.000209,0.00086,0.000374,0.000143,0.000477,0.00022,0.000227,0.000217,0.000739,0.000186,0.001008,0.000362,0.000328,0.00022,0.000436,0.000483,0.000277,0.000792,0.000439,0.000361,0.000693,0.000446,0.000198,0.000454,0.000291,0.000874,0.000525,0.000563,0.000416,0.000526,0.000546,0.000234,0.000296,0.000373,0.000518,0.000528,0.000603,0.000332,0.000289,0.000201,0.000417,0.000795,3.3e-05,0.000103,0.000514,0.000215,8.9e-05,0.000427,0.000635,0.000772,0.00032,0.000369,0.000429,0.000408,0.000346,0.000307,0.000104,0.000638,0.000498,0.000727,0.001104,0.000681,0.000265,0.000431,0.000555,0.000211,0.000566,0.000431,0.000301,0.000435,0.000241,0.000711,0.000717,0.000413,0.000838,0.000758,0.000145,0.000618,0.000642,0.000557,0.000626,0.000427,0.00023,0.000513,0.000584,0.000523,0.000303,0.000306,0.000636,0.000288,0.000295,8.8e-05,0.001239,0.000477,0.000298,0.000677,0.00055
0.000126,7.3e-05,0.000222,0.000345,0.000159,0.000138,0.000126,0.000384,0.000239,0.000144,0.000266,0.000291,2.4e-05,0.000249,0.000152,0.00011,0.000386,0.000288,0.000229,0.000262,0.000417,0.000484,0.000558,0.000921,0.00094,0.00182,0.000883,0.000559,0.000923,0.000849,0.000591,0.000463,0.000738,0.00096,0.001158,0.001427,0.001187,0.000877,0.000671,8e-04,0.001082,0.001699,0.001603,0.00149,0.001795,0.002006,0.000683,0.000337,0.000954,0.00111,0.001378,0.00171,0.001964,0.000381,0.000598,0.000849,0.000237,0.000367,0.000555,0.00047,0.000862,0.001281,0.001342,0.000981,0.000704,0.000511,0.000765,0.00067,0.000558,5e-04,0.000533,0.001152,0.000624,0.000546,0.00063,0.000274,0.000615,0.000224,0.000647,0.000931,0.000949,0.001371,0.001612,0.000394,0.001805,0.00206,0.001082,0.000305,0.000134,0.000539,0.000689,0.000175,0.000443,0.000483,0.000898,0.001277,0.001876,0.001939,0.000425,0.000842,0.000896,0.001455,0.00028,0.000669,0.000433,0.000755,0.001169,0.000473,0.000741,0.001762,0.001872,0.000919,0.000464,0.001241,0.000797,0.000722,0.002064,0.001764,0.001752,0.001838,0.001062
0.000236,0.000126,0.000295,0.000108,5.9e-05,0.000116,0.000242,0.000553,0.000342,0.000306,0.00041,0.000113,0.000229,0.000284,0.000146,0.000106,0.000318,0.00011,0.000198,0.000382,7.2e-05,0.000426,0.000579,0.000775,0.000347,0.000921,0.000852,6e-04,0.000965,0.00123,0.000588,5e-04,0.000657,0.000522,0.000414,0.000972,2e-04,0.000405,0.000325,0.000539,0.000911,0.000627,0.000771,0.000242,0.001195,0.001243,0.001121,0.000519,0.001044,0.002207,0.001386,0.000436,0.000541,0.001448,0.001772,0.000384,0.000698,0.000561,0.001152,0.001489,0.000958,0.000119,0.00037,0.00015,0.00065,0.001087,0.000983,0.00069,0.000844,0.000409,0.000606,0.001114,0.001288,0.001198,0.000955,0.000957,0.000824,0.000431,0.000916,0.000577,0.000507,0.001408,0.002094,0.002185,0.001482,0.00067,0.000859,0.001202,0.000783,0.000397,0.000433,0.000387,0.000405,0.000667,0.000976,0.000458,0.001133,0.001614,0.001627,0.000906,0.00036,0.001333,0.00104,0.001998,0.00082,0.000672,0.001279,0.000575,0.000672,0.001719,0.000561,0.001298,0.001447,0.000758,0.00061,0.000738,0.001929,0.001021,0.000699,0.001768,0.001043
0.000114,8.9e-05,0.000153,0.000284,0.00011,0.000332,0.000159,0.000334,0.000172,0.000476,0.000137,7.3e-05,0.000216,0.000334,0.000531,0.000266,0.000364,0.000113,9.6e-05,0.000637,0.000797,0.000374,0.000711,0.000616,0.000338,0.00012,0.000185,0.000768,0.000453,0.000789,0.000486,7e-04,0.000228,0.00051,0.000967,0.00018,0.000796,0.000148,0.000721,0.000682,0.00107,0.001472,0.000731,0.000875,0.000351,0.000267,0.00013,0.000924,0.000428,0.001276,0.000412,0.000459,0.000827,0.001218,0.000599,0.000633,0.000619,0.000808,0.001199,0.000433,0.000317,0.000697,0.000763,0.00019,0.001037,0.001261,0.000822,0.001258,0.000355,0.00028,0.000864,0.001554,7e-04,0.000497,0.000356,0.000688,0.000526,0.000704,0.000344,0.000537,0.000171,0.000883,0.000955,0.000865,0.001575,0.000982,0.000573,0.000569,0.000484,0.000651,0.000891,0.000299,0.000353,0.00047,0.000495,0.000913,0.000819,0.000609,0.000495,0.000294,0.000707,0.000599,0.000418,0.00179,0.001005,0.001214,0.000725,0.001153,0.000275,0.001007,0.001243,0.001901,0.000395,0.000992,0.00047,0.000843,0.000718,0.000681,0.001298,0.001171,0.000825
0.000333,0.000261,0.000199,0.000134,0.00034,0.000231,0.00045,0.00077,0.000659,0.000239,0.000522,0.000199,0.000431,0.000207,0.000389,0.000299,0.000421,0.000304,0.000246,0.00096,0.000913,0.001202,0.001531,8e-04,0.00034,0.000511,0.000499,0.000937,0.001202,0.001825,0.00214,0.002412,0.001502,0.001166,0.001839,0.002313,0.002249,0.000804,0.000573,0.0012,0.00019,0.000881,0.001426,0.000666,0.001165,0.001793,0.001566,0.002038,0.001543,0.001027,0.000333,0.000396,0.001573,0.000602,0.000895,0.000589,0.000579,0.000673,0.000393,0.00113,0.000967,0.001437,0.001061,0.00096,0.001577,0.001269,0.00041,0.000821,0.000167,0.000671,0.001366,0.001953,0.002363,0.000926,0.000536,0.001239,0.001562,0.001023,0.001098,0.00084,0.000875,0.00035,0.001128,0.001869,0.002105,0.001788,0.002313,0.001907,0.001158,0.000978,0.000265,0.001101,0.000362,0.000622,0.000713,0.001958,0.001471,6e-04,0.000743,0.000737,0.000375,0.000556,0.00075,0.001433,0.002993,0.0029,0.000715,0.001579,0.001338,0.000453,0.000314,0.001043,0.000914,0.001037,0.001859,0.001144,0.001369,0.001513,0.000591,0.000415,0.000571
0.000377,0.000299,0.000432,0.000417,0.000291,0.000442,0.000391,0.000664,0.00056,0.000405,0.000384,0.000363,5e-04,0.000671,0.000565,0.000145,0.00028,0.000107,0.000322,0.00089,0.000331,0.001457,0.0016,0.001396,0.001005,0.001429,0.00132,0.001285,8.1e-05,0.001296,0.0021,0.001448,0.001133,0.000538,0.001186,0.001878,0.001504,0.001442,0.000771,0.000737,0.000992,0.001512,0.001258,0.000874,0.001225,0.001094,0.001163,0.000609,0.000579,0.002105,0.001277,0.000571,0.001912,0.001831,0.001963,0.001429,0.001659,0.00139,0.001421,0.001921,0.001782,0.000999,0.000704,0.000329,0.000885,0.00137,0.000811,0.000332,0.000968,0.001104,0.000411,0.000565,0.000912,0.001263,0.001596,0.000122,0.001302,0.000372,0.00083,0.000615,0.000801,0.000941,0.000562,0.00038,0.000233,0.000236,0.001465,0.000946,0.001865,0.001233,0.000881,0.001162,0.001961,0.001543,0.002267,0.002303,0.001334,0.000339,0.001195,0.001682,0.001447,0.000568,0.000312,0.000358,0.002543,0.001974,0.001632,0.001409,0.000413,0.00069,0.000239,0.000411,0.000341,0.000334,0.001897,0.001569,0.000869,0.000781,0.001974,0.002452,0.000941
0.000132,0.000172,0.000315,0.000147,0.000239,0.000192,0.000414,0.000388,0.000276,0.000178,0.000578,0.000381,0.00057,0.000358,0.000132,8.8e-05,0.000112,0.000157,0.000268,0.000604,0.00089,0.000817,0.00079,0.000261,0.000229,0.000528,0.000392,0.000519,0.000533,0.001047,0.000577,0.00062,0.00047,0.000817,0.00112,0.000399,0.000815,0.000604,0.000936,0.000759,0.000684,0.000886,0.000286,0.000444,0.000796,0.000703,0.000915,0.001231,0.001794,0.001947,0.001346,0.000848,0.001217,0.000554,0.000864,0.001332,0.000319,0.00041,0.00069,0.001159,0.000792,0.001551,0.000551,0.000441,0.000515,0.000473,0.000476,0.000355,0.000659,0.000696,0.000883,0.000182,0.001084,0.001512,0.000301,0.001313,0.000368,0.000565,0.000868,0.001178,5.6e-05,0.000198,0.000322,0.000269,0.000554,0.000138,0.001184,0.000903,0.001484,0.000294,0.000655,0.000907,0.001575,0.000718,0.001601,0.00129,0.000395,0.000304,0.000799,0.001104,0.000308,0.000658,0.000431,0.000871,0.001279,0.000542,0.001058,0.001467,0.001962,0.001531,0.001405,0.001594,0.001058,0.000595,0.00183,0.00072,0.000888,0.000388,0.001432,0.001319,0.001537
1.8e-05,0.000178,6.5e-05,0.000123,1.1e-05,0.000133,0.000195,0.000501,0.000159,4e-05,0.000423,0.000362,0.000664,0.000349,0.000187,0.000172,0.000139,0.000194,0.000143,0.00019,0.000529,0.000691,0.000962,0.000818,0.000406,0.000438,0.000405,0.000528,0.000663,0.000744,0.000706,0.000331,0.000552,0.001227,0.001382,0.000624,0.000198,0.000761,0.00052,0.00052,0.000978,0.001721,0.00158,0.000973,0.000835,0.000673,0.001072,0.000295,0.00093,0.001006,0.000744,7.9e-05,9e-04,0.000696,0.000277,0.000619,0.000951,0.00062,0.000758,0.001206,0.001295,0.001732,0.001489,0.000829,0.000509,0.000212,0.000496,0.000579,0.000716,0.000951,0.001227,0.000683,0.000722,0.000565,0.000577,0.001209,0.000853,0.000795,0.000729,0.000609,0.000971,0.000738,0.000208,0.001002,0.001343,0.000854,0.001,0.000926,0.000117,0.000515,0.000578,0.000993,0.00213,0.001685,0.001127,0.00127,0.001017,0.000832,0.00022,0.001351,0.001254,0.001056,0.001266,0.00092,0.000627,0.000372,0.001063,0.000881,0.001646,0.001852,0.000675,0.001191,0.00149,0.000552,0.000947,0.000865,0.000839,0.000656,0.000672,0.001706,0.001125
9.6e-05,0.000147,0.000123,0.000146,0.000143,0.00011,0.000194,0.000165,8.7e-05,4.1e-05,0.000224,0.000132,0.000156,0.000164,4.9e-05,9.6e-05,0.00012,4.4e-05,9.6e-05,0.000153,0.000226,0.000219,0.000347,0.000381,0.000421,0.000553,0.000449,0.000339,0.000383,0.000187,0.000228,0.000491,0.000447,0.000477,0.000274,0.000562,0.000227,0.000218,0.000673,0.000533,0.000224,0.000817,0.000696,0.000596,0.000204,0.00026,0.000283,0.00052,0.000322,0.000494,4.9e-05,0.000225,0.000577,0.000484,0.000478,0.000184,0.000146,0.000463,0.000534,0.000188,0.00048,0.000627,0.000336,0.00026,0.000504,0.000335,0.000581,0.000155,0.000244,0.000221,0.000574,0.000498,0.000878,0.00036,0.000535,0.000353,6.1e-05,0.000236,0.000186,0.000179,0.000374,0.000224,3e-04,0.00078,0.000294,8.8e-05,0.000272,0.000491,0.000264,0.000232,0.00014,0.000685,0.000622,0.000303,0.000493,0.000579,0.000189,0.000241,0.000264,0.000547,0.00028,0.000558,0.000653,0.000154,0.000452,0.000835,0.000367,0.000529,0.000423,0.000425,0.000259,0.000968,0.000365,0.000565,6.1e-05,0.000229,0.000272,0.000382,4.6e-05,0.000562,7.1e-05
4.6e-05,0.000113,0.000104,3.7e-05,9.5e-05,1e-05,0.000104,0.000112,4.2e-05,2.4e-05,8.7e-05,0.000107,7.4e-05,4.2e-05,2.7e-05,8.4e-05,5.7e-05,2.9e-05,3.9e-05,0.000144,0.000102,0.000144,0.000246,8e-05,0.000249,0.000219,0.000195,0.00015,0.000324,0.000149,0.000205,0.000313,0.000144,0.000227,0.000313,0.000392,0.000155,0.000192,0.000473,0.000198,0.000251,0.000302,0.000162,0.000246,0.000217,6e-05,8.4e-05,0.000414,0.000262,0.000316,0.000183,0.000329,0.00038,0.000211,0.00028,4.5e-05,9.2e-05,0.000338,0.000186,0.000226,0.000404,0.000346,0.000167,0.000261,9.7e-05,0.000152,0.000147,0.000151,6.8e-05,0.000199,0.000192,0.000148,0.000329,0.000157,0.000268,0.000154,8.3e-05,0.000148,6.8e-05,6.4e-05,0.000228,0.000122,0.000125,0.000494,9.2e-05,3.6e-05,0.000234,0.000288,0.000189,0.00011,9.1e-05,0.00033,0.000278,0.000255,0.000384,0.000326,0.000127,0.000201,0.000314,0.00025,0.000138,0.000379,0.00045,0.00025,0.000374,0.000291,0.000153,0.000186,0.000137,0.000434,0.000515,0.000393,0.000205,0.000323,0.000102,0.000232,2.2e-05,0.000373,5.1e-05,0.000385,0.000156
2.8e-05,6.8e-05,8.6e-05,4.9e-05,8.8e-05,2.3e-05,7.1e-05,9.4e-05,3.9e-05,3.1e-05,8.1e-05,8.5e-05,4.5e-05,6.4e-05,4.1e-05,8.4e-05,1.9e-05,3e-06,3.3e-05,8.3e-05,0.000107,3.7e-05,9.1e-05,1e-04,0.000176,0.000127,0.000154,0.000144,0.000318,0.00014,0.000229,0.000229,9.2e-05,0.000211,0.000318,0.000283,8.8e-05,0.000183,0.000377,0.000193,0.000101,0.000264,0.000107,0.000233,0.000156,2.6e-05,6.1e-05,0.000337,0.000152,0.000186,0.000208,0.000287,0.000306,0.000223,0.00018,6.6e-05,2.9e-05,0.000303,0.000136,0.00013,0.00025,0.000279,7.2e-05,0.000215,0.000123,1.5e-05,0.000213,0.000198,0.000101,0.000224,0.000207,0.000118,0.000161,0.00015,0.000103,0.000279,4.8e-05,0.000172,0.000145,8.6e-05,0.000249,7.8e-05,4e-05,0.00032,4.8e-05,8.6e-05,0.000158,0.000162,0.000289,0.000153,7.6e-05,0.000305,0.000196,0.000218,0.000336,0.000273,0.000176,0.000114,0.000244,0.000301,0.00022,0.000176,0.000363,0.000276,0.000198,0.000195,7.3e-05,0.000149,0.000132,0.000401,0.000529,0.000332,0.000276,0.000414,0.000186,0.000325,4.9e-05,0.000314,0.000176,0.000271,0.000196
2.7e-05,6.7e-05,5.8e-05,3.8e-05,5.7e-05,1.6e-05,7.7e-05,0.000123,5e-05,3.7e-05,9e-05,3.5e-05,6.3e-05,6.5e-05,7e-05,8.3e-05,5.3e-05,5.2e-05,9.6e-05,0.000123,0.000107,0.000215,0.000135,4.6e-05,0.000238,0.000126,0.000216,0.000176,0.000318,0.000112,0.000189,0.000173,3.5e-05,0.000264,0.000359,0.000277,0.000164,0.000182,0.000333,0.000122,0.000238,0.000277,2.5e-05,0.000223,0.000235,3.3e-05,5.9e-05,0.000166,0.000141,0.000163,0.000183,0.000343,0.000212,0.000253,0.000308,0.000188,0.000133,0.000155,0.000112,0.000213,0.000241,2e-04,0.000233,7.8e-05,0.000275,0.000115,0.000297,0.000192,0.000113,2.2e-05,0.000252,0.000167,0.000139,0.000217,0.000352,0.000175,3.1e-05,0.000252,0.000122,0.000117,3.5e-05,0.000127,3.1e-05,0.000129,4.3e-05,0.000159,0.00016,0.000232,0.000209,0.000135,0.000159,0.000278,0.000178,0.000269,0.000481,0.000294,0.000273,0.000113,0.000339,0.000145,0.000217,0.000262,0.000447,0.000348,0.000137,0.000447,0.000106,0.000111,0.00028,0.000587,0.000569,0.000527,0.000505,0.000266,0.000182,0.000231,0.000222,0.000479,0.000269,0.000144,0.000215
2.8e-05,7e-05,2.4e-05,5.1e-05,0.000112,4.2e-05,8.5e-05,8.2e-05,4.9e-05,6.1e-05,2.7e-05,0.000104,7.4e-05,8.3e-05,8.5e-05,0.000128,3.7e-05,7.5e-05,9e-05,0.000128,1.9e-05,0.000107,0.00026,0.000145,0.000249,0.000103,0.000325,0.000157,0.000602,0.000163,0.000121,0.000113,8.2e-05,0.000168,0.000487,0.000421,0.000112,0.000359,0.000419,2.8e-05,6e-05,0.000333,0.000198,0.000176,0.000251,9.6e-05,0.00013,0.000259,0.000245,0.000225,0.000384,0.000582,0.000353,0.000235,0.000387,7.4e-05,0.000167,0.000181,0.000171,0.000155,0.000184,0.000199,0.000344,0.000301,0.000562,0.000306,0.000359,0.000447,3e-04,0.000238,0.000215,0.000328,0.000246,0.000433,0.000338,0.000307,0.000187,0.000328,0.000294,0.000217,0.000184,0.000268,0.000187,0.00026,0.00016,0.000252,0.000144,0.000187,0.000428,0.000343,1e-04,0.000261,9.3e-05,0.000223,0.00051,0.000591,0.000632,0.000396,0.00019,0.000651,8.4e-05,0.000315,0.000396,0.000277,0.000151,0.000378,9e-05,1e-05,0.000367,0.001051,0.000671,0.000306,0.000365,0.000567,0.000282,0.000187,0.000336,0.000353,0.000684,0.000428,0.000484
2.6e-05,9.4e-05,6.5e-05,5.7e-05,5e-05,6.5e-05,6.8e-05,9.6e-05,9.3e-05,3.1e-05,0.000106,0.000185,0.000152,0.000111,8.1e-05,0.000111,0.000188,9.1e-05,0.000267,2.9e-05,0.000227,0.000424,0.000425,0.000433,0.000335,0.000251,0.000515,0.000651,0.000699,0.000516,0.000179,0.000433,3.7e-05,0.000416,0.000586,0.000645,0.000326,0.000394,0.000743,0.000245,0.000118,0.000271,0.000165,0.000264,0.000629,0.000456,0.000488,0.000537,0.000833,0.000577,0.000838,0.001497,0.00065,0.000326,0.000737,0.000608,0.000432,0.000575,0.000473,0.000166,8.4e-05,0.00025,0.000348,0.000104,0.000726,0.000784,0.001186,0.001212,0.000911,0.001054,0.000673,0.00097,0.00081,0.000936,0.000864,0.000742,0.000732,0.000916,0.000606,0.000386,0.000475,0.00044,0.000301,0.000684,0.000525,0.000438,0.00024,0.000309,0.000516,0.000914,0.000747,0.000222,0.000687,0.000858,0.000514,0.000331,0.001016,0.000972,0.000472,0.001178,0.001072,0.000588,0.000209,0.000635,0.00013,0.000755,0.000315,0.000506,0.000273,0.001683,0.001103,0.000209,0.000449,0.000918,0.000987,0.000525,0.000827,0.001017,0.001161,0.001117,0.000594
2.8e-05,0.000146,0.000153,6.7e-05,0.000142,0.000151,0.000126,0.000143,0.000154,0.000223,0.00024,8.1e-05,0.000159,0.000297,0.000351,0.000196,3.9e-05,0.000174,0.000411,0.000365,0.000572,0.000996,0.000789,0.000953,0.000576,0.000481,0.000355,0.000833,0.00115,0.001055,0.000571,0.000623,0.000528,0.000743,0.001284,0.001692,0.000725,0.000577,0.001128,0.000662,0.000333,0.000224,0.000532,0.000724,0.000189,0.001066,0.000134,0.000396,0.001157,0.000823,0.000522,0.001313,0.001698,0.000803,0.000444,0.000749,0.000463,0.000433,0.000169,0.000408,0.000587,0.00055,0.000184,0.000326,0.000704,0.000592,0.000526,0.001711,0.00186,0.000667,0.000527,0.001067,0.001146,0.00023,0.000509,0.000356,0.00094,0.000759,0.000461,0.000211,0.000297,0.000517,0.000248,0.000482,0.000793,0.000332,0.000141,0.000359,0.000729,0.000982,0.000825,0.000923,0.001385,0.001748,0.000764,0.000607,0.00121,0.001111,0.001395,0.001629,0.001176,0.000895,0.000795,0.000963,0.001043,0.001375,0.001468,0.000252,0.000511,0.001749,0.002031,0.001899,0.001352,0.001413,0.000139,0.000191,0.000456,0.001147,0.001488,0.000515,0.001259
7.6e-05,0.000156,0.000321,0.000236,8.4e-05,0.000148,0.000156,7.2e-05,7.4e-05,0.000136,0.000146,0.000163,4.6e-05,0.000204,1e-04,3.9e-05,5.2e-05,5.9e-05,0.000327,0.000317,0.000427,0.000634,0.000582,0.000717,0.000929,0.000559,0.000726,0.00061,0.000446,0.00051,0.000238,0.00048,0.000156,0.000448,0.001199,0.00105,0.001243,0.000633,0.000219,0.000346,0.000267,0.000449,0.000708,0.000375,0.000911,0.001348,0.001266,0.001253,0.001077,0.000152,0.000696,0.000649,0.000485,0.000462,0.000541,0.000142,0.00023,0.000109,0.000369,0.000416,0.000669,0.001186,0.000927,0.000889,0.000873,0.000491,0.000256,0.001006,0.000683,0.000806,0.000671,0.000366,0.000313,0.000432,0.00039,0.000121,0.000761,0.000511,0.000384,0.000254,0.000463,0.000728,0.000322,0.000404,0.000557,0.000441,0.00023,0.000611,0.000695,0.00016,0.000434,0.000494,0.001116,0.000487,0.000621,0.000631,0.000781,0.000391,0.000643,0.00067,0.000765,0.000118,0.000196,0.000502,0.000993,0.000502,0.001124,0.001307,0.000982,0.000656,0.000675,0.000619,0.000294,0.000784,0.00066,0.000327,0.000343,0.001142,0.00042,0.000174,0.001364
6.7e-05,3.3e-05,0.000144,3e-05,0.000109,4.7e-05,6.2e-05,0.000117,1.9e-05,0.000107,5.5e-05,4.4e-05,9.6e-05,0.000122,0.000103,3e-05,0.000121,0.00012,0.000149,6.8e-05,0.000389,0.00013,0.000579,0.000273,0.000592,0.000152,0.000452,0.000239,0.000403,4.1e-05,3.6e-05,0.00028,0.000276,0.000295,0.000521,7.1e-05,0.00055,0.000378,0.000263,0.000144,0.000249,0.000333,0.000122,0.000417,0.00043,0.000652,0.000476,0.000399,0.000111,0.000525,9.3e-05,0.000524,0.000593,0.000515,1.7e-05,0.000278,0.00031,0.000205,0.00043,0.000102,0.000651,0.000449,0.000101,0.000458,0.000326,0.000476,0.000374,0.000551,0.000127,0.000354,0.000219,0.000387,0.000172,0.000297,0.000149,0.000271,0.000209,0.000435,0.000309,0.000114,0.000346,0.000185,0.000222,0.000379,0.00048,0.000376,0.000443,0.000561,0.000254,0.000218,0.000114,0.000393,0.000174,0.000781,0.000299,0.000369,0.000712,0.000326,0.000503,0.000195,0.000407,0.000393,0.000388,0.000281,0.000169,0.000719,3e-04,0.000477,0.001371,9e-04,0.000463,0.000288,0.000392,0.00032,0.000185,0.00034,0.000649,0.000146,3.7e-05,0.000264,0.000717
3.7e-05,5.3e-05,4.3e-05,1.1e-05,4.4e-05,1.7e-05,2.3e-05,0.000113,6.5e-05,4.4e-05,0.00011,6.8e-05,2.4e-05,0.000116,8.6e-05,7.5e-05,0.00011,9.6e-05,0.000103,3.3e-05,0.000139,0.000188,0.000267,0.000116,0.000147,0.000226,0.000408,0.000123,7.8e-05,9e-05,5.8e-05,0.000161,0.000112,0.000205,0.000245,2.1e-05,0.000258,0.000279,0.000195,0.000217,0.000226,0.000397,0.000304,4e-04,0.000387,0.000294,0.000264,0.000299,0.000114,0.000471,0.000333,0.000141,0.000453,0.000167,0.000179,0.000148,0.000228,0.000148,0.00031,0.000219,0.000262,0.00045,0.000405,0.00029,0.000663,0.000138,0.000339,0.000675,0.000381,5e-05,0.000157,0.000389,0.00024,0.000127,0.000232,0.000304,0.000193,0.000178,0.000203,0.000276,0.000248,0.000194,0.000165,0.000372,0.000359,0.000132,0.000197,0.000204,0.000204,0.000206,0.000296,0.000408,0.000484,0.000326,0.000255,0.000344,0.000402,3.8e-05,0.00019,0.000241,0.000428,8.9e-05,0.000357,0.000328,0.000302,0.000644,0.000372,0.000182,0.000518,0.00013,0.000246,0.000323,0.000554,0.000396,0.000223,0.000223,0.000479,0.000116,0.000303,0.000118,0.000443
1.1e-05,7e-05,0.000136,7.2e-05,2.9e-05,2.3e-05,2.1e-05,3.8e-05,1.3e-05,2.2e-05,3.4e-05,6.2e-05,3.8e-05,4.2e-05,3.2e-05,4.1e-05,2.3e-05,1e-04,2.8e-05,2e-06,8.2e-05,7.3e-05,0.000319,9.3e-05,6.1e-05,5.6e-05,0.000158,0.000253,0.000167,5.9e-05,0.000126,0.000148,0.000103,0.000214,0.000186,0.000141,9.9e-05,9.5e-05,0.000146,0.000126,5.7e-05,0.000184,0.00011,0.000175,0.000294,0.000119,8.6e-05,0.000103,0.000172,0.000289,1.1e-05,6.7e-05,0.000342,0.00028,0.000282,0.000209,4e-05,0.000238,0.000335,0.000269,0.000446,0.00027,0.000109,0.000319,0.000475,0.000279,0.000274,0.000396,7.3e-05,0.000158,7.9e-05,0.000244,0.000172,0.000306,0.00024,2.1e-05,0.000145,4.4e-05,0.000352,0.000575,0.000224,0.000113,9.1e-05,0.000231,0.000409,0.000214,5.5e-05,0.000205,0.000182,0.000162,0.000338,0.000273,0.000413,0.000444,9.4e-05,0.000137,0.000277,0.000127,0.000481,0.000313,0.000525,0.00039,0.000153,7.5e-05,0.000223,0.000423,0.000224,0.00037,0.00041,0.000218,0.00037,0.000344,0.000204,0.000283,0.000185,0.000191,0.000468,0.000675,0.000337,0.000176,6.7e-05
6e-06,2e-05,3.4e-05,4e-06,1.6e-05,1.7e-05,1.6e-05,2.7e-05,5e-06,1.5e-05,1.3e-05,2.5e-05,3.7e-05,2.4e-05,2.2e-05,1.8e-05,2.2e-05,3.3e-05,4.6e-05,2.8e-05,1.2e-05,6e-05,0.000169,5.8e-05,3.3e-05,4.7e-05,1.7e-05,6.1e-05,8.8e-05,4.7e-05,4.9e-05,6.4e-05,5.2e-05,8.2e-05,5.1e-05,1.2e-05,3.3e-05,3.9e-05,9.9e-05,8e-05,5.8e-05,3.8e-05,4.7e-05,7.1e-05,0.000133,3.4e-05,6.8e-05,7.5e-05,0.000108,0.000133,8.7e-05,7.3e-05,8.2e-05,3.4e-05,6.8e-05,0.000131,6.2e-05,8.3e-05,9e-05,6.3e-05,9.3e-05,7.5e-05,6.8e-05,8.5e-05,0.000203,9.9e-05,5.8e-05,0.000145,4.3e-05,5.3e-05,4.3e-05,8.7e-05,7.2e-05,7e-05,9.7e-05,2.4e-05,4.8e-05,1.2e-05,0.000126,6.6e-05,2.9e-05,5.8e-05,5.8e-05,0.000151,4.5e-05,6.7e-05,0.00015,0.000118,8.6e-05,7.4e-05,0.000125,0.000217,0.000171,0.00015,0.000145,7.6e-05,0.000109,9.4e-05,0.000123,8.9e-05,0.000114,0.000165,0.000162,0.000126,9.3e-05,8.9e-05,4.8e-05,0.000133,0.000128,0.000105,7.5e-05,0.000165,0.000239,3.2e-05,3.6e-05,8.3e-05,0.000125,0.000316,0.00016,9.1e-05,8.1e-05
7e-06,4e-06,2.5e-05,7e-06,1.1e-05,1e-05,5e-06,1.6e-05,8e-06,1.7e-05,1.4e-05,3e-06,1.8e-05,3.6e-05,2.2e-05,6e-06,1.4e-05,1.5e-05,2.6e-05,2.2e-05,5.3e-05,7.6e-05,0.00012,7.1e-05,7.1e-05,4.6e-05,7.3e-05,6e-05,0.000103,5.6e-05,1.8e-05,1e-04,8.3e-05,6.4e-05,0.000103,3.4e-05,3.9e-05,3.9e-05,2.9e-05,1.9e-05,2.5e-05,9.1e-05,0.000108,0.000112,0.000141,4e-05,1.4e-05,5.9e-05,0.000102,6.8e-05,3.4e-05,2.6e-05,7.3e-05,0.00011,9.3e-05,4.3e-05,7.2e-05,3e-05,7.6e-05,7.5e-05,6.1e-05,6.8e-05,3.5e-05,2e-05,4.4e-05,2.7e-05,7.4e-05,0.000142,3.1e-05,7e-06,1.8e-05,7e-05,3.9e-05,1.6e-05,6.3e-05,2.3e-05,4.4e-05,3.6e-05,7.8e-05,7.1e-05,2.7e-05,4.2e-05,4.7e-05,7.5e-05,7.6e-05,4.6e-05,7.4e-05,3.5e-05,2.5e-05,2.8e-05,4.8e-05,0.000142,0.000153,2.7e-05,1.5e-05,3.1e-05,0.000152,1e-04,8e-05,6.2e-05,4.1e-05,2.9e-05,5.1e-05,6.5e-05,0.000109,8.6e-05,5e-05,7.1e-05,0.00011,3.6e-05,2.7e-05,7.3e-05,4.9e-05,2.2e-05,2.8e-05,1e-04,1.9e-05,0.00016,3.7e-05,4.9e-05,9.7e-05
7e-06,7e-06,2e-05,2e-06,8e-06,4e-06,1e-05,2.4e-05,4e-06,1.2e-05,5e-06,3e-06,5e-06,2.7e-05,9e-06,1.4e-05,6e-06,1.8e-05,1.3e-05,2.4e-05,5.2e-05,3.7e-05,0.000104,4.6e-05,5.5e-05,2.8e-05,5.2e-05,4.1e-05,3.8e-05,1.4e-05,3.1e-05,6.9e-05,3.5e-05,5.8e-05,7.8e-05,6.3e-05,6e-06,2.3e-05,2.4e-05,3.5e-05,6.1e-05,5.3e-05,3.5e-05,5.6e-05,0.000103,3.2e-05,3.4e-05,1.1e-05,8.3e-05,6.6e-05,4.8e-05,4.7e-05,2.5e-05,7.2e-05,3.5e-05,2.2e-05,4.9e-05,4.3e-05,7e-05,7.4e-05,6.6e-05,5.7e-05,2.9e-05,3.1e-05,4.9e-05,2.8e-05,5.8e-05,7.9e-05,1.6e-05,1.1e-05,2.3e-05,6.7e-05,3.2e-05,1.2e-05,7e-05,1.8e-05,5.3e-05,4.5e-05,4e-05,5e-05,4.2e-05,6e-06,3.1e-05,5.4e-05,6.4e-05,3.3e-05,6.8e-05,3.6e-05,1.5e-05,6e-06,5.2e-05,8.2e-05,0.000119,3e-06,2e-05,3.7e-05,0.000118,6.5e-05,3.5e-05,5.3e-05,7e-06,3.2e-05,7e-05,2.6e-05,0.000114,5e-05,2.1e-05,4.4e-05,3.4e-05,3.4e-05,5.1e-05,7e-05,0.000104,2.4e-05,4.9e-05,4.8e-05,4e-05,0.000121,5.3e-05,6.8e-05,9.4e-05
7e-06,5e-06,1.9e-05,4e-06,8e-06,1.2e-05,1e-05,1.5e-05,3e-06,1.3e-05,1e-05,6e-06,1.4e-05,1.8e-05,5e-06,1.5e-05,7e-06,1.7e-05,1.5e-05,1.2e-05,5.8e-05,4e-05,9.2e-05,4.1e-05,3.4e-05,2.4e-05,5.8e-05,4.6e-05,5.3e-05,1.2e-05,4.6e-05,5.8e-05,4.9e-05,2.6e-05,6.1e-05,1.7e-05,1.3e-05,6e-06,3.5e-05,3.8e-05,3.4e-05,4.9e-05,2.7e-05,5.4e-05,0.000106,3.6e-05,4.2e-05,3e-06,7.3e-05,8.1e-05,5.4e-05,3.4e-05,4.2e-05,6.9e-05,3.1e-05,1.2e-05,4.1e-05,3.8e-05,6.5e-05,8.2e-05,6.2e-05,5.3e-05,2.4e-05,1.6e-05,3.5e-05,2.1e-05,5.4e-05,7.2e-05,2.5e-05,1.2e-05,2.7e-05,5.4e-05,2.1e-05,1.4e-05,5.7e-05,2.8e-05,2.2e-05,2.4e-05,5e-05,4.2e-05,4.2e-05,2.3e-05,4.1e-05,4.1e-05,5e-05,4.2e-05,6.2e-05,1.4e-05,3e-05,3e-05,5.3e-05,8.3e-05,0.00011,2.9e-05,2.9e-05,3.7e-05,8e-05,3.1e-05,2.4e-05,5.6e-05,1.5e-05,1e-05,3.3e-05,3.1e-05,0.000115,6.2e-05,2.3e-05,5.2e-05,6.7e-05,9.4e-05,0.000103,9.1e-05,7.7e-05,3.4e-05,9.1e-05,3.5e-05,3.4e-05,0.000102,2.9e-05,4.3e-05,5.4e-05
5e-06,2e-06,2e-05,4e-06,2e-06,4e-06,1.1e-05,1.8e-05,5e-06,1.2e-05,1e-05,1.1e-05,9e-06,1.9e-05,5e-06,7e-06,7e-06,1.7e-05,1.8e-05,2.3e-05,4.5e-05,2.6e-05,8.9e-05,3.9e-05,3.9e-05,9e-06,4.1e-05,1e-05,4.8e-05,8e-06,4.2e-05,4.8e-05,6.8e-05,6.3e-05,5.7e-05,5.6e-05,1.6e-05,2.1e-05,2.9e-05,2.3e-05,3e-05,3.4e-05,2.9e-05,3.9e-05,8.4e-05,7e-06,4.6e-05,2.8e-05,7.8e-05,7.1e-05,2.2e-05,4.6e-05,2.7e-05,5.8e-05,3.8e-05,6e-06,3.1e-05,3e-05,4.3e-05,8.5e-05,4.7e-05,5.6e-05,3.5e-05,8e-06,2.1e-05,2.3e-05,4.5e-05,9.2e-05,3e-05,2.4e-05,2.1e-05,4.9e-05,3.5e-05,4e-06,2.9e-05,3e-05,3.3e-05,2.5e-05,3.5e-05,2.3e-05,3.1e-05,1.3e-05,2.3e-05,3.8e-05,6.4e-05,4.2e-05,5.9e-05,2.4e-05,3.3e-05,2e-05,4.3e-05,6.9e-05,0.00011,2.1e-05,5.7e-05,3.4e-05,9.5e-05,5.8e-05,2.3e-05,4.5e-05,3.1e-05,2.2e-05,5.4e-05,3e-05,8.2e-05,3.8e-05,9e-06,5.4e-05,8.5e-05,0.000134,7e-05,0.00013,0.00018,9.7e-05,4.4e-05,5.3e-05,5.1e-05,3.8e-05,4.1e-05,2.1e-05,5.8e-05
4e-06,6e-06,1.9e-05,3e-06,3e-06,4e-06,8e-06,1.2e-05,5e-06,9e-06,3e-06,4e-06,1.1e-05,1.2e-05,5e-06,3e-06,6e-06,1.3e-05,2.4e-05,1.6e-05,4.8e-05,3e-05,7.9e-05,3.6e-05,2.8e-05,1.3e-05,3.5e-05,2.2e-05,3e-05,1.6e-05,4.3e-05,4.8e-05,6.9e-05,4.8e-05,2.2e-05,3.5e-05,1.2e-05,1.7e-05,3.3e-05,3e-06,1.8e-05,3.5e-05,3.5e-05,2.9e-05,8.3e-05,2.3e-05,6e-05,1.4e-05,6.8e-05,4.9e-05,2.5e-05,2e-05,1.9e-05,5.2e-05,3.5e-05,1.5e-05,4.2e-05,2.6e-05,4.1e-05,5e-05,3.7e-05,6.8e-05,6.4e-05,8e-06,2.6e-05,2.1e-05,4e-05,9.4e-05,3.3e-05,2.3e-05,2.6e-05,2.8e-05,3.3e-05,2.2e-05,6.2e-05,3.1e-05,1.4e-05,1.3e-05,2.6e-05,2.8e-05,4.2e-05,1e-05,4.6e-05,5.3e-05,4.6e-05,1.4e-05,4e-05,4e-05,1.6e-05,2.3e-05,3e-05,9.4e-05,8.6e-05,2.5e-05,3.1e-05,5.8e-05,9e-05,4.5e-05,1.3e-05,5.2e-05,4.1e-05,4.2e-05,6.9e-05,3e-06,8.6e-05,3.2e-05,4e-05,5.3e-05,0.000175,3.7e-05,0.000109,0.000106,2.8e-05,3.2e-05,9.5e-05,0.00014,3.8e-05,4.8e-05,3.7e-05,9e-06,5.9e-05
5e-06,5e-06,1.5e-05,3e-06,4e-06,4e-06,8e-06,2e-05,1.2e-05,1.2e-05,8e-06,1e-06,6e-06,1.1e-05,8e-06,1.1e-05,7e-06,8e-06,9e-06,1.7e-05,3.2e-05,4.4e-05,6.6e-05,3.8e-05,2.5e-05,1e-05,4.2e-05,2e-05,1.4e-05,1.6e-05,4.3e-05,3.8e-05,6.3e-05,6.6e-05,2.3e-05,4.5e-05,1.9e-05,1.6e-05,2.8e-05,9e-06,2.3e-05,2.4e-05,2.2e-05,2.5e-05,8.2e-05,7e-06,5.2e-05,2.7e-05,8e-05,5.9e-05,2.7e-05,3.5e-05,2.2e-05,6.7e-05,5.2e-05,7e-06,3.7e-05,4.3e-05,6.9e-05,7.3e-05,5.1e-05,2.6e-05,3.7e-05,6.3e-05,4.6e-05,3e-05,4.1e-05,7.3e-05,3.9e-05,3.8e-05,5.7e-05,3.7e-05,2.7e-05,3.4e-05,6.7e-05,5.6e-05,5.6e-05,1.8e-05,5.3e-05,5.2e-05,5.1e-05,1.8e-05,4.5e-05,9.3e-05,6.3e-05,1.2e-05,8.6e-05,2.4e-05,4.5e-05,2.9e-05,1.1e-05,3.9e-05,5.4e-05,7e-06,4.4e-05,6.4e-05,9.5e-05,2e-05,3.4e-05,0.000114,3.9e-05,3.4e-05,4.4e-05,5e-06,6.6e-05,1.6e-05,5.8e-05,9.5e-05,1e-04,4.9e-05,9.6e-05,3.3e-05,3.9e-05,4.2e-05,4.9e-05,6.8e-05,8.2e-05,0.00011,2.8e-05,4.6e-05,5.1e-05
3e-06,6e-06,1.9e-05,9e-06,1e-06,5e-06,1e-05,1.7e-05,1.6e-05,1.9e-05,5e-06,5e-06,1.1e-05,1.6e-05,6e-06,4e-06,1.3e-05,2.5e-05,3e-06,5e-06,5e-05,3.3e-05,5.7e-05,6.6e-05,1.1e-05,3.6e-05,4.9e-05,1.5e-05,1.9e-05,2.8e-05,2.2e-05,2.4e-05,9.6e-05,0.000104,0.000105,4.4e-05,3.4e-05,2.3e-05,3.8e-05,1.1e-05,7e-06,3.9e-05,4e-06,3.5e-05,0.000113,3.4e-05,2.1e-05,1.5e-05,8e-05,7.1e-05,2.6e-05,5.2e-05,5.6e-05,2.2e-05,8.4e-05,6e-05,6.4e-05,8.3e-05,0.000105,0.000125,3.4e-05,6.2e-05,4.2e-05,7.6e-05,6.6e-05,9e-06,8e-06,0.000116,4.9e-05,2.4e-05,4.5e-05,3.1e-05,6.7e-05,5.4e-05,1.9e-05,1.5e-05,2.8e-05,6.3e-05,7.1e-05,2.8e-05,6e-05,1.6e-05,2.7e-05,8e-05,5.1e-05,2.5e-05,5.6e-05,2e-05,4.2e-05,1.7e-05,3.7e-05,4.2e-05,8.9e-05,1.7e-05,2.6e-05,1.7e-05,5.6e-05,4.8e-05,1e-05,6.5e-05,2.7e-05,1.8e-05,3.2e-05,9e-06,7.7e-05,1.9e-05,2.6e-05,3.6e-05,0.000136,8.1e-05,7e-05,8.4e-05,6.9e-05,4.7e-05,7.5e-05,4e-05,7.6e-05,2.3e-05,9e-05,1.7e-05,1.6e-05
3e-06,1e-05,1.8e-05,5e-06,7e-06,3e-06,7e-06,1.7e-05,1.7e-05,1.3e-05,8e-06,4e-06,5e-06,1.4e-05,5e-06,5e-06,1e-05,2e-06,9e-06,5e-06,3.9e-05,1.9e-05,6.6e-05,4.8e-05,7.6e-05,1.2e-05,1.4e-05,2.7e-05,3.9e-05,4.6e-05,4.3e-05,1.4e-05,0.000101,9.7e-05,9.8e-05,3.4e-05,4.2e-05,3.9e-05,1.7e-05,3.7e-05,2.4e-05,2.7e-05,2.5e-05,4.5e-05,4.8e-05,7.7e-05,5.3e-05,4.7e-05,1.6e-05,3.6e-05,3.8e-05,3.3e-05,3.4e-05,8.8e-05,6e-05,3.8e-05,7.6e-05,4e-05,2e-05,2.2e-05,0.000102,2.4e-05,6.3e-05,3.7e-05,3e-05,4.1e-05,6e-05,7.5e-05,3.5e-05,9e-06,2.5e-05,5.3e-05,3.6e-05,2.7e-05,3.7e-05,2.7e-05,3.1e-05,1.2e-05,1.4e-05,2.4e-05,4.1e-05,1.9e-05,1.1e-05,6.6e-05,3.7e-05,2.4e-05,5.3e-05,1.4e-05,2.3e-05,1e-05,1.8e-05,5.9e-05,7.7e-05,1.2e-05,2.4e-05,1.6e-05,7.6e-05,3.4e-05,6e-06,3.4e-05,8e-06,1.3e-05,2.6e-05,2.1e-05,8.3e-05,3e-05,1.8e-05,5.5e-05,0.000109,2.9e-05,0.000104,6.4e-05,2.2e-05,1.2e-05,6.2e-05,6.3e-05,6.5e-05,6.6e-05,3.5e-05,2.5e-05,2.1e-05
2e-06,6e-06,2.2e-05,3e-06,1e-06,2e-06,3e-06,1.4e-05,1.8e-05,2.1e-05,3e-06,7e-06,1e-05,9e-06,3e-06,1e-05,9e-06,1.2e-05,1.2e-05,7e-06,2.4e-05,2.1e-05,6.4e-05,1.7e-05,4.1e-05,1.5e-05,1.4e-05,2.3e-05,2.7e-05,1.4e-05,2.4e-05,1.8e-05,4.4e-05,3e-05,3.7e-05,5.6e-05,1.9e-05,3.2e-05,3.1e-05,1.7e-05,4.4e-05,3.1e-05,2.1e-05,5.6e-05,5.8e-05,1.6e-05,3.4e-05,3.2e-05,7.8e-05,2.2e-05,2.5e-05,2.9e-05,4.3e-05,7.6e-05,2.6e-05,3.1e-05,4.5e-05,8e-06,3.3e-05,4.1e-05,7.4e-05,3.7e-05,2.3e-05,2.5e-05,2.9e-05,2.9e-05,3.4e-05,5e-05,7e-06,1.7e-05,1.2e-05,4e-05,2.6e-05,2.2e-05,2.8e-05,1.2e-05,1.7e-05,9e-06,1.8e-05,3.4e-05,3.2e-05,1.4e-05,2e-06,5.8e-05,3.5e-05,8e-06,4.8e-05,1e-05,7e-06,4e-06,2.6e-05,6.2e-05,6.4e-05,3e-06,2.9e-05,3.4e-05,7.2e-05,3.4e-05,8e-06,5.1e-05,2.5e-05,1.2e-05,2.3e-05,1.5e-05,6.7e-05,2.4e-05,2.3e-05,5.7e-05,6.5e-05,4.4e-05,0.000103,3.6e-05,2.2e-05,3.1e-05,4.5e-05,2.5e-05,5.6e-05,1.5e-05,1.3e-05,3e-06,2.9e-05
1e-06,4e-06,2.2e-05,4e-06,4e-06,5e-06,5e-06,1.5e-05,1.5e-05,1.3e-05,2e-06,4e-06,8e-06,1.3e-05,2e-06,5e-06,1e-05,1.3e-05,9e-06,9e-06,2.5e-05,1.8e-05,6.3e-05,1.6e-05,3.3e-05,1.1e-05,2.3e-05,1.5e-05,5e-06,2.6e-05,4e-05,4.3e-05,3.7e-05,3.2e-05,1.5e-05,2.2e-05,2e-05,1.9e-05,1.2e-05,5e-06,2.1e-05,3.1e-05,6e-06,5.8e-05,6.5e-05,7e-06,1.4e-05,3.7e-05,6.9e-05,4.6e-05,2.2e-05,7e-06,3.7e-05,7.3e-05,2.4e-05,1.4e-05,4.1e-05,1.6e-05,2.4e-05,3.5e-05,5.3e-05,4.3e-05,3e-06,1.3e-05,2.8e-05,3.4e-05,2.8e-05,5.2e-05,5e-06,1.3e-05,1.9e-05,2.5e-05,1.7e-05,1.7e-05,3.8e-05,3e-06,1.7e-05,4e-06,1e-05,2.9e-05,1.7e-05,5e-06,6e-06,5.4e-05,2.2e-05,1.4e-05,4.4e-05,1.4e-05,1.4e-05,1.6e-05,3e-05,5.8e-05,7.4e-05,1.9e-05,1.4e-05,2.4e-05,7.4e-05,2.8e-05,1.3e-05,6.1e-05,1e-05,1e-05,3.2e-05,1e-06,7.4e-05,3.5e-05,1e-05,3.1e-05,6e-05,2.3e-05,6.4e-05,3.5e-05,6.1e-05,1.9e-05,1.5e-05,9e-06,7e-06,6.9e-05,1.6e-05,1.5e-05,3.3e-05
3e-06,6e-06,1.6e-05,3e-06,4e-06,5e-06,4e-06,1e-05,5e-06,1.3e-05,0,1e-06,8e-06,1.5e-05,5e-06,6e-06,7e-06,1.3e-05,1.1e-05,3e-06,2.3e-05,2.3e-05,6.4e-05,1.9e-05,3.2e-05,1.1e-05,2.6e-05,1.7e-05,9e-06,1e-05,3.7e-05,3.7e-05,2.1e-05,1.8e-05,9e-06,3.5e-05,1.1e-05,1.1e-05,3e-05,1e-05,2.6e-05,3e-05,1.8e-05,4.9e-05,5.9e-05,2.1e-05,2.7e-05,2.4e-05,6.9e-05,2.8e-05,1.2e-05,3e-06,2.7e-05,5.4e-05,3e-06,1.8e-05,4.9e-05,2.6e-05,2.9e-05,3.2e-05,4.4e-05,3.9e-05,1.4e-05,1e-05,2.7e-05,2.8e-05,2.1e-05,4.1e-05,5e-06,1.4e-05,8e-06,2.3e-05,1e-05,5e-06,3.4e-05,4e-06,2.2e-05,2e-06,1.2e-05,2.4e-05,1.7e-05,9e-06,1.1e-05,4.1e-05,2.7e-05,1.7e-05,4.7e-05,5e-06,1.2e-05,1.6e-05,3.9e-05,5.6e-05,9e-05,1.2e-05,2.6e-05,1.4e-05,7.4e-05,2.8e-05,6e-06,5.8e-05,1.7e-05,1.5e-05,4.3e-05,2e-05,3.6e-05,2.2e-05,8e-06,1.4e-05,4e-05,2.5e-05,6e-05,4.2e-05,6.9e-05,4.5e-05,4.6e-05,1.2e-05,9e-06,5.6e-05,2.1e-05,3.2e-05,1.5e-05
2e-06,3e-06,1.6e-05,4e-06,4e-06,3e-06,4e-06,1.2e-05,4e-06,1.7e-05,6e-06,3e-06,1.2e-05,1.5e-05,0,8e-06,6e-06,8e-06,1e-05,8e-06,2.5e-05,1.3e-05,6.7e-05,1.3e-05,4.4e-05,8e-06,1.8e-05,2.3e-05,9e-06,1.2e-05,3.1e-05,3.1e-05,2.7e-05,2.5e-05,1e-05,1.7e-05,9e-06,1e-05,2.9e-05,5e-06,2.2e-05,2.5e-05,1e-05,4.9e-05,6.8e-05,2.1e-05,2.9e-05,2e-05,5.9e-05,5.4e-05,3.1e-05,1.3e-05,2.3e-05,4.4e-05,1.5e-05,7e-06,3.8e-05,2e-05,1.5e-05,3.6e-05,4.9e-05,4.2e-05,2.3e-05,7e-06,2.5e-05,9e-06,3.8e-05,4.1e-05,1.6e-05,2e-06,1.1e-05,2.1e-05,1.4e-05,3e-06,4.1e-05,7e-06,2.1e-05,1e-05,1.6e-05,2.4e-05,1.6e-05,5e-06,1.3e-05,5.3e-05,3.2e-05,1.6e-05,4e-05,4e-06,7e-06,8e-06,3.2e-05,4.9e-05,6.2e-05,1e-06,2.3e-05,1.4e-05,6.2e-05,1.7e-05,1.2e-05,3.7e-05,1e-05,5e-06,4.4e-05,1.2e-05,4.9e-05,4e-05,6e-06,7e-06,4.8e-05,1.4e-05,6.7e-05,8.5e-05,3.1e-05,2.4e-05,4.8e-05,6.1e-05,3.1e-05,3.6e-05,3.9e-05,9e-06,1.3e-05
0,2e-06,1.7e-05,3e-06,5e-06,1e-06,5e-06,1.4e-05,6e-06,1.6e-05,9e-06,2e-06,9e-06,1.2e-05,4e-06,8e-06,3e-06,1.2e-05,1.3e-05,9e-06,3.1e-05,1.6e-05,5.6e-05,2.6e-05,3.5e-05,1.3e-05,2.6e-05,1.6e-05,1.4e-05,1.8e-05,3.7e-05,3.8e-05,2.8e-05,2e-05,1.1e-05,3.4e-05,6e-06,6e-06,2.6e-05,6e-06,2.5e-05,1.8e-05,2.3e-05,3.8e-05,6.8e-05,1.2e-05,3.3e-05,1.3e-05,5.8e-05,4.7e-05,2.1e-05,5e-06,2.9e-05,3.9e-05,9e-06,1.1e-05,4.1e-05,2.3e-05,2.8e-05,3.7e-05,5.3e-05,3.4e-05,2.6e-05,1e-05,2e-05,1.5e-05,2.9e-05,4.3e-05,1.6e-05,6e-06,5e-06,3.4e-05,3e-06,4e-06,2.9e-05,1e-06,1.5e-05,9e-06,7e-06,1.9e-05,1.7e-05,5e-06,7e-06,4.9e-05,1.8e-05,1.8e-05,3.7e-05,9e-06,7e-06,5e-06,2e-05,5e-05,6.8e-05,1e-05,2.4e-05,1.8e-05,5.2e-05,3.3e-05,3e-06,2.8e-05,2.1e-05,7e-06,3.7e-05,8e-06,5e-05,4.3e-05,1.3e-05,1.7e-05,7.4e-05,3.2e-05,5.4e-05,5.9e-05,6.3e-05,9.1e-05,3.9e-05,3e-05,3.8e-05,2.7e-05,1.7e-05,3.7e-05,1.9e-05
2e-06,5e-06,1.5e-05,4e-06,4e-06,5e-06,5e-06,1.6e-05,1e-05,1.1e-05,5e-06,4e-06,9e-06,1e-05,6e-06,8e-06,2e-06,9e-06,1.1e-05,1e-05,3.2e-05,1.6e-05,5.7e-05,2.5e-05,3.8e-05,1.1e-05,2.5e-05,2.1e-05,3e-06,1.1e-05,3.2e-05,3.1e-05,2.9e-05,3e-05,1.5e-05,3.1e-05,3e-06,1.1e-05,2.3e-05,4e-06,1.6e-05,1.7e-05,1.2e-05,4.1e-05,6.5e-05,2.6e-05,2.4e-05,1.5e-05,4.8e-05,4.7e-05,1.9e-05,2e-06,3.2e-05,4.8e-05,1.6e-05,2.4e-05,4e-05,3e-05,2.8e-05,4.1e-05,6e-05,5e-05,1.7e-05,8e-06,2e-05,1.6e-05,2.8e-05,4.4e-05,1.3e-05,1.5e-05,5e-06,3e-05,9e-06,1e-06,3.2e-05,6e-06,1.1e-05,6e-06,8e-06,1.9e-05,1.4e-05,3e-06,8e-06,4.9e-05,2.6e-05,1.5e-05,4.1e-05,6e-06,2e-06,9e-06,3.3e-05,4.3e-05,6.7e-05,1.4e-05,3.5e-05,3.3e-05,5.3e-05,1.9e-05,8e-06,3.3e-05,7e-06,8e-06,4.2e-05,1e-05,5.7e-05,2.8e-05,7e-06,8e-06,7.9e-05,3.9e-05,8e-06,1.1e-05,7.1e-05,8.8e-05,5.8e-05,2.4e-05,1.4e-05,4.8e-05,3.1e-05,1.5e-05,2.2e-05
2e-06,6e-06,1.4e-05,2e-06,7e-06,4e-06,7e-06,1.5e-05,1e-05,1.1e-05,2e-06,5e-06,6e-06,1.4e-05,3e-06,8e-06,6e-06,1e-05,6e-06,2e-06,3.4e-05,1.6e-05,4.8e-05,2.7e-05,3.2e-05,3e-06,2.2e-05,1.4e-05,1.3e-05,5e-06,3.1e-05,2.7e-05,3.5e-05,2.7e-05,8e-06,3.4e-05,1.1e-05,1.3e-05,3.3e-05,8e-06,1.6e-05,1e-05,1.8e-05,4.6e-05,7.1e-05,1.6e-05,2.4e-05,1.6e-05,4.5e-05,3.8e-05,2.2e-05,1.1e-05,3.7e-05,5.5e-05,9e-06,1.1e-05,2.5e-05,2.4e-05,3.4e-05,4e-05,5.9e-05,4.2e-05,1.1e-05,1.2e-05,1.7e-05,6e-06,2.7e-05,4.6e-05,2e-06,6e-06,1e-05,2.2e-05,3e-06,6e-06,2.7e-05,1.4e-05,1.4e-05,9e-06,7e-06,2.9e-05,2.2e-05,4e-06,7e-06,5.5e-05,2.6e-05,1.4e-05,4.8e-05,9e-06,6e-06,1.2e-05,1.9e-05,3.8e-05,6.3e-05,8e-06,2.6e-05,1e-05,5.5e-05,2.9e-05,8e-06,4.2e-05,1.6e-05,6e-06,4.1e-05,7e-06,6.7e-05,2.5e-05,6e-06,3e-06,7.9e-05,1.9e-05,2e-05,3e-06,5.1e-05,6e-06,2.7e-05,3.2e-05,3e-05,3e-05,3.5e-05,2.5e-05,3.2e-05
1e-06,4e-06,1.3e-05,2e-06,5e-06,3e-06,4e-06,1.6e-05,1.2e-05,2.1e-05,8e-06,4e-06,1e-05,1.2e-05,4e-06,9e-06,5e-06,8e-06,7e-06,5e-06,3.3e-05,2.3e-05,5.8e-05,2.4e-05,3.6e-05,5e-06,1.7e-05,9e-06,3e-06,1e-05,3.6e-05,4.1e-05,2e-05,2.4e-05,8e-06,3.4e-05,1.2e-05,1.7e-05,2e-05,4e-06,1.3e-05,7e-06,2e-05,4.5e-05,6.1e-05,1.4e-05,2.8e-05,2.1e-05,6.3e-05,4.7e-05,1.5e-05,6e-06,3e-05,4.3e-05,4e-06,1.7e-05,3e-05,1.8e-05,3.1e-05,3.8e-05,5e-05,5.2e-05,1.5e-05,3e-06,2.2e-05,2.2e-05,3.4e-05,3.9e-05,1e-05,8e-06,5e-06,2.5e-05,8e-06,1.7e-05,3.9e-05,6e-06,1.3e-05,2e-06,5e-06,2.5e-05,2.1e-05,7e-06,3e-06,4.6e-05,2.9e-05,1.3e-05,4.3e-05,6e-06,9e-06,8e-06,3e-05,2.2e-05,6.3e-05,9e-06,2e-05,2.2e-05,5.3e-05,3e-05,5e-06,3.8e-05,2e-05,1.6e-05,4.5e-05,6e-06,6.3e-05,2.5e-05,2e-06,1.2e-05,7.8e-05,3e-06,9e-06,2e-05,5e-06,1.3e-05,1.5e-05,2.2e-05,2.4e-05,4.6e-05,1.7e-05,9e-06,2e-05
1e-06,4e-06,1.4e-05,3e-06,1e-06,1e-06,5e-06,1.4e-05,1e-05,4e-06,5e-06,3e-06,8e-06,1.1e-05,1e-06,8e-06,3e-06,8e-06,6e-06,4e-06,3.2e-05,2.4e-05,5.4e-05,2.2e-05,3.5e-05,4e-06,2.1e-05,1e-05,6e-06,9e-06,3.3e-05,3.8e-05,2.3e-05,1.7e-05,1e-05,2.5e-05,1e-06,1e-05,2.9e-05,3e-06,1.9e-05,1.5e-05,1.9e-05,4.4e-05,6.2e-05,2.3e-05,1.6e-05,1.2e-05,5.3e-05,4.7e-05,2e-05,4e-06,2.4e-05,5.4e-05,5e-06,1.9e-05,3.3e-05,2e-05,3.3e-05,3.6e-05,4.1e-05,3.6e-05,1.7e-05,1.3e-05,1.7e-05,1.9e-05,3e-05,3.4e-05,5e-06,7e-06,1.2e-05,3e-05,1.3e-05,8e-06,3.2e-05,7e-06,1.8e-05,3e-06,7e-06,2.4e-05,2.2e-05,3e-06,7e-06,4.3e-05,2.4e-05,1.2e-05,3.7e-05,6e-06,3e-06,6e-06,3e-05,3.7e-05,6e-05,7e-06,1e-05,1.9e-05,5.3e-05,2.9e-05,4e-06,3.3e-05,9e-06,1.1e-05,4e-05,1.1e-05,5.9e-05,2.5e-05,3e-06,1.3e-05,5.8e-05,1.5e-05,2e-05,9e-06,1.5e-05,2.1e-05,1.9e-05,1.7e-05,1.5e-05,3.7e-05,2e-06,1.7e-05,1.2e-05
1e-06,5e-06,1.3e-05,2e-06,4e-06,2e-06,4e-06,1.5e-05,6e-06,9e-06,2e-06,3e-06,6e-06,1.1e-05,3e-06,8e-06,4e-06,9e-06,8e-06,5e-06,3.2e-05,2.3e-05,5.7e-05,1.8e-05,3.3e-05,4e-06,2.3e-05,8e-06,8e-06,7e-06,3.1e-05,3.1e-05,2.4e-05,2.3e-05,8e-06,3.2e-05,8e-06,9e-06,2.5e-05,1e-06,2e-05,1.3e-05,1.9e-05,3.7e-05,7.1e-05,1.3e-05,1.8e-05,7e-06,5.7e-05,5.1e-05,1.4e-05,1e-06,2.9e-05,5.2e-05,2e-06,1.9e-05,3.8e-05,1.8e-05,2.9e-05,3.4e-05,4.9e-05,4.2e-05,1.8e-05,9e-06,2.6e-05,1.3e-05,2.9e-05,3.8e-05,8e-06,4e-06,1e-06,2.8e-05,9e-06,7e-06,3.5e-05,7e-06,1.4e-05,4e-06,1e-05,2.5e-05,2.1e-05,2e-06,6e-06,4.6e-05,2.3e-05,1.6e-05,3.8e-05,2e-06,2e-06,2e-06,3e-05,3.8e-05,6.4e-05,8e-06,2.2e-05,2e-05,5.6e-05,3.2e-05,5e-06,3.2e-05,1.2e-05,7e-06,3.8e-05,1e-05,5.6e-05,2.6e-05,4e-06,1.2e-05,5.7e-05,8e-06,1.4e-05,6e-06,2.2e-05,4e-06,1e-05,1.8e-05,1e-05,3.7e-05,1.8e-05,2.2e-05,1.5e-05
1e-06,4e-06,1.4e-05,1e-06,3e-06,2e-06,6e-06,1.4e-05,5e-06,7e-06,1e-06,2e-06,6e-06,1e-05,1e-06,6e-06,5e-06,9e-06,8e-06,5e-06,3.1e-05,1.9e-05,5.5e-05,1.9e-05,3.3e-05,4e-06,2.1e-05,9e-06,9e-06,1.1e-05,3.5e-05,3e-05,2.6e-05,2.1e-05,1e-05,3.3e-05,9e-06,7e-06,2.6e-05,1e-06,2e-05,1.3e-05,1.1e-05,4.4e-05,6.6e-05,1.5e-05,2.9e-05,1e-05,5e-05,4.5e-05,1.6e-05,1e-06,2.7e-05,5.1e-05,4e-06,2.1e-05,3.3e-05,2e-05,3e-05,3.6e-05,4.5e-05,4.3e-05,1.9e-05,6e-06,2.4e-05,1.2e-05,2.7e-05,4e-05,8e-06,4e-06,7e-06,2.7e-05,6e-06,4e-06,3.4e-05,4e-06,1.6e-05,3e-06,6e-06,2.6e-05,2.3e-05,2e-06,3e-06,4.7e-05,2.5e-05,1.5e-05,3.8e-05,2e-06,3e-06,1e-06,2.9e-05,3.5e-05,6.2e-05,0,2.3e-05,2.1e-05,5.9e-05,2.5e-05,5e-06,3.4e-05,8e-06,8e-06,3.9e-05,7e-06,6e-05,2.6e-05,3e-06,7e-06,5.4e-05,4e-06,1.7e-05,7e-06,1.3e-05,0,1.2e-05,2.1e-05,1.2e-05,3.7e-05,1.2e-05,1.2e-05,1.5e-05
