8.7e-05,4.2e-05,-3.5e-05,-0.000115,-0.000104,3e-06,-1.5e-05,-4e-06,3.2e-05,-2.7e-05,0.00017,0.000113,-9.4e-05,-2.8e-05,-0.000131,-0.000204,-0.000102,8.6e-05,-1.6e-05,7.6e-05,5.4e-05,-2.9e-05,9.5e-05,-0.000179,-0.000155,5e-06,-0.00012,0.000114,-0.000172,-0.000215,-3.2e-05,-1.7e-05,5.3e-05,-1.8e-05,0.000157,6e-05,0.000132,0.000144,9.4e-05,0.000158,4.8e-05,-0.000116,-0.000196,-0.000389,-0.000512,-0.000343,-0.000364,-0.000373,-0.000256,-9.6e-05,-0.000252,-0.000131,-0.000248,-0.00017,9e-05,-3e-05,-0.000213,-0.000194,-0.000237,-0.000175,-0.000273,-0.000164,4e-06,3.7e-05,1.5e-05,5.9e-05,-5.1e-05,-1.6e-05,-0.000142,-9e-05,4.9e-05,7e-06,-1.9e-05,5.9e-05,-0.000168,3e-06,-0.000109,8.1e-05,-5.5e-05,-9.8e-05,-7.7e-05,-0.000122,-9.6e-05,-3.9e-05,-3.8e-05,-0.000107,-0.000179,-0.000121,-0.000157,-8.3e-05,0.000128,-7.3e-05,-6.5e-05,-0.000128,-0.000251,-0.000162,-5.9e-05,-0.000197,-0.000248,-0.000237,-0.000255,-0.000223,-0.000304,-0.000342,-0.000314,-0.000182,-2e-06,-0.000107,-0.000206,-0.000309,-9.4e-05,-8.9e-05,-0.000143,-0.00011,4e-05,-0.00015,8.9e-05,-8.4e-05,-0.000135,-0.000164,-5e-05
-7e-05,-6.3e-05,-3.1e-05,1.5e-05,5.6e-05,7.1e-05,-1.3e-05,-8.5e-05,-5e-06,5.2e-05,-6.2e-05,-0.000118,5.2e-05,3.5e-05,0.000183,7.4e-05,9.1e-05,-0.000129,-0.000116,-0.000265,-0.000174,-0.000131,2.1e-05,0.000111,9.7e-05,1.3e-05,9e-06,0.000121,7.8e-05,0.000263,7.8e-05,0.000132,3.4e-05,-0.000111,-6.4e-05,3.6e-05,-1.9e-05,-6.1e-05,-6.1e-05,-0.000275,-0.000334,0.000144,-5.5e-05,8.6e-05,0.000245,1e-05,9.4e-05,0.00018,0.000197,3.7e-05,0.000127,-2e-06,-5.3e-05,0.000135,8e-05,0.000234,0.000169,9.7e-05,0.000154,3.3e-05,0.000144,0.000235,-1.8e-05,-0.000218,-0.000161,-0.000169,9e-06,0.000109,0.000175,0.000114,1.8e-05,0.00016,1.7e-05,-3e-06,3.7e-05,-0.000105,-7.3e-05,5.9e-05,-0.000183,-0.000104,0.000115,2.9e-05,-7e-05,-7.7e-05,9.9e-05,-4.5e-05,0.000185,6e-06,2.9e-05,-9.4e-05,-0.000295,-8.4e-05,0.000226,0.000212,0.000198,0.000113,8.7e-05,0.000173,0.000152,5e-06,-3.6e-05,-0.000207,0.000199,0.000155,-5.9e-05,-4.8e-05,-5e-06,1.8e-05,3.6e-05,0.000228,7.5e-05,-3.5e-05,-0.000156,-6.1e-05,-0.000138,7.5e-05,2.8e-05,0.000147,9.9e-05,4.7e-05,-0.000142
-4.2e-05,4.6e-05,-1.6e-05,-1.7e-05,-0.00012,-7.3e-05,5.2e-05,-3.1e-05,5.2e-05,-4.4e-05,-0.000196,-0.000287,-0.000155,-7.3e-05,-0.000196,-0.000164,-0.000302,-0.000369,-0.00019,-3.9e-05,-0.000169,-8.9e-05,-0.000111,-0.000153,1.5e-05,-0.000262,-0.000232,-0.000195,-0.000373,-0.000314,-0.000313,-0.000176,-7.8e-05,-0.000116,-0.000264,-0.000139,1.3e-05,-0.000173,-0.000306,-0.000143,-0.000153,-0.000219,-0.000267,-0.000499,-0.000303,-9.1e-05,-0.000458,-0.000611,-0.00037,-0.000342,-0.000303,-0.000121,-0.000157,-0.000188,-0.000239,-0.000228,-0.000296,-0.000387,-0.000347,-0.000267,-0.000234,-0.000154,-0.000111,-8.2e-05,-0.000156,-2e-04,-0.00021,-0.000111,-6.3e-05,8e-05,-2e-05,-7.5e-05,3.8e-05,-1.9e-05,-1.6e-05,-0.000116,-0.000227,-0.000245,-0.000166,-9.5e-05,-0.000116,-5.2e-05,4e-06,-3e-04,-0.000293,-8.3e-05,-8.2e-05,-0.000174,-0.000158,-2.8e-05,-0.000161,-0.000221,-0.000418,-0.000319,-0.000163,-0.000136,-1e-06,-0.000199,-0.000244,9.4e-05,8e-06,-2e-05,-0.000149,-0.000262,3.4e-05,5.6e-05,7.3e-05,-5.7e-05,-0.00017,-0.000175,-0.000358,-0.000214,-5.9e-05,-4.9e-05,-0.000111,-0.000121,-0.000308,-0.000168,-0.000207,-0.000262,-6.9e-05
-0.000112,-0.000181,-6.6e-05,1.7e-05,-2.2e-05,-3.6e-05,-3.7e-05,-1.1e-05,-1.5e-05,-2.7e-05,-0.000109,-2.3e-05,2.1e-05,0.000114,-3.4e-05,6.3e-05,7.6e-05,-5e-06,3.4e-05,-8.2e-05,-0.000209,-3.1e-05,1.3e-05,-0.000177,-1e-04,-4.2e-05,2.8e-05,-0.000102,4.9e-05,9e-05,9.2e-05,-6.7e-05,8.8e-05,4.4e-05,3.1e-05,-0.000179,-6.5e-05,7e-05,3.8e-05,8.1e-05,-4.3e-05,3e-06,0.000155,0.000341,0.000174,2.1e-05,-1e-05,0.000259,0.000268,-2.7e-05,0.000169,1.9e-05,0.000202,0.000247,-6.8e-05,-0.00014,0.000184,0.00033,0.000149,0.000269,0.000208,6.3e-05,4.6e-05,-4.1e-05,2e-05,0.000192,0.000189,0.000146,8.6e-05,-5e-06,7e-06,-1.5e-05,-2e-05,-1.3e-05,1.2e-05,3.5e-05,8e-05,3e-06,4.5e-05,1.9e-05,-7e-05,-8.3e-05,2e-05,-2.3e-05,-2.7e-05,1.3e-05,6.2e-05,3.2e-05,3.7e-05,-4.6e-05,-4.6e-05,1.8e-05,-8.4e-05,5e-05,3.7e-05,0.000112,4.3e-05,7e-06,6.7e-05,3.3e-05,-3e-05,6.8e-05,0.000129,0.000117,-3.4e-05,-0.000105,-0.000138,-1.3e-05,0.000145,5.8e-05,0.000133,1.9e-05,0.00015,9.7e-05,0,9.5e-05,-6e-06,-1e-05,0.000108,8.7e-05,0.000185
2.7e-05,-8e-06,6.8e-05,-4.7e-05,4.8e-05,-0.000144,4.1e-05,4.9e-05,-1.5e-05,6.1e-05,1.2e-05,2.4e-05,-7e-06,1.3e-05,5.7e-05,3.1e-05,-2.6e-05,-6e-06,0.00011,8.4e-05,0.000166,0.000136,7e-05,0.000143,0.000139,4.7e-05,4.4e-05,5.7e-05,5.1e-05,-7e-05,3.8e-05,5.4e-05,-2e-06,5.4e-05,0.000106,7.9e-05,7.4e-05,0.000177,9.5e-05,0.000112,0.00015,9e-05,6.2e-05,8e-06,-0.000151,2e-06,0.000266,4.3e-05,-1.9e-05,-7e-06,-0.000153,0.000198,9.8e-05,4.9e-05,-7e-05,-5.6e-05,-1.9e-05,-2.9e-05,-8.8e-05,2.7e-05,-3.5e-05,-8.9e-05,1.1e-05,0.000136,-8e-05,0.000145,3e-05,3e-05,1.3e-05,-0.000115,4.6e-05,2.5e-05,2.6e-05,-2.5e-05,-4.2e-05,1e-06,9.1e-05,-1.5e-05,6.5e-05,7e-05,3.8e-05,2.3e-05,9.8e-05,4.5e-05,0.000114,-7.7e-05,-0.000106,-3.9e-05,5e-05,3.9e-05,9.1e-05,0.000216,-4.7e-05,-0.000217,-0.000188,-0.000104,7.3e-05,-8.7e-05,2e-05,-6.6e-05,-1.9e-05,5e-06,-7.9e-05,-0.000187,1.7e-05,0.000124,-1.5e-05,-3e-05,-7.8e-05,-0.00014,-0.000151,0.000183,-5.3e-05,-6e-06,4e-05,-2.8e-05,-0.000141,3.9e-05,-0.000114,-5.1e-05,-0.000167
2.1e-05,-1.6e-05,-0.000132,3.5e-05,1e-06,5e-05,0,-5.1e-05,1e-06,1e-05,1.9e-05,7.9e-05,4.6e-05,1.8e-05,3.2e-05,9.3e-05,6.3e-05,0.000138,4.6e-05,1.3e-05,6.9e-05,-3.5e-05,2.9e-05,4.4e-05,-3.7e-05,5.2e-05,6.9e-05,-1e-06,4.1e-05,0.000155,0.000144,5.4e-05,-3.9e-05,6.7e-05,2.4e-05,8.7e-05,2.5e-05,3.1e-05,-3e-06,-4.4e-05,4.2e-05,5.1e-05,6e-05,-0.000112,0.000126,-0.000129,-6.1e-05,0.000117,0.000176,8.3e-05,4.6e-05,-5.2e-05,-9.3e-05,-0.000159,9.9e-05,0.000119,4e-05,4.2e-05,9.9e-05,-5e-06,5.5e-05,9.5e-05,-9.8e-05,-8.1e-05,-4e-05,-9e-06,3.5e-05,2.7e-05,6.6e-05,1e-05,6e-06,-3e-06,1.2e-05,-2.6e-05,5e-05,-2.8e-05,5.4e-05,0.000147,8.3e-05,0.000121,5.8e-05,0.000109,-5.4e-05,5.1e-05,0.000125,-2.3e-05,3.6e-05,7.4e-05,6.2e-05,4.7e-05,3.1e-05,4.7e-05,0.000125,8.4e-05,9.7e-05,9.3e-05,4e-06,6e-06,6e-05,4.5e-05,9e-06,6.1e-05,-9.2e-05,0.000165,-9.1e-05,-0.000139,-2.8e-05,-3.1e-05,-0.00011,2.8e-05,6.2e-05,-4.1e-05,-4.5e-05,1.5e-05,-8e-06,-3.8e-05,6.7e-05,0.000107,-2.4e-05,0.000127,0.000129
-4.9e-05,7.7e-05,5.4e-05,-2.3e-05,-1.5e-05,-2.7e-05,1.4e-05,2.5e-05,-5e-05,1.1e-05,-7.7e-05,2.2e-05,-6.1e-05,-3.9e-05,-6e-06,-7.4e-05,-0.000127,-4.6e-05,-0.000107,-8.2e-05,-5e-05,-7.5e-05,-6.3e-05,-2.1e-05,1.1e-05,3.1e-05,-1.5e-05,-6.2e-05,5e-06,-7.2e-05,-8.4e-05,7.2e-05,-1.1e-05,-2.3e-05,-6.2e-05,-4.6e-05,-6e-06,1.9e-05,-3.8e-05,-6.4e-05,-0.000101,2.2e-05,-3.4e-05,-6.9e-05,-2.6e-05,8.7e-05,-5.2e-05,-0.000126,-0.000243,-6.8e-05,5e-05,4.7e-05,2e-05,-3.7e-05,-2.6e-05,1.3e-05,-0.000141,-0.000122,6.9e-05,-3.7e-05,-5.1e-05,-9.1e-05,-1.5e-05,1.7e-05,0.000112,-6.9e-05,-4.8e-05,-8.3e-05,1e-05,-3.1e-05,6.9e-05,-4e-06,4.1e-05,-9e-06,-3.9e-05,-2.3e-05,-7.8e-05,-0.000118,-5.6e-05,-0.000137,-1e-06,-3.9e-05,1.2e-05,-7.9e-05,-5.4e-05,1.4e-05,1.9e-05,-2.9e-05,-7.4e-05,-7.3e-05,-3.5e-05,-1.9e-05,-0.000122,9e-06,-1.3e-05,-6.8e-05,-7.3e-05,-7.4e-05,-8.9e-05,3.3e-05,3.4e-05,-9.6e-05,2.7e-05,-4.1e-05,5.7e-05,2.9e-05,1.6e-05,-0.000105,1.8e-05,-3.1e-05,-7.1e-05,-3.4e-05,1.3e-05,-6.6e-05,-4.4e-05,-0.000101,-7.9e-05,7e-06,7.1e-05,-2.8e-05,-3.4e-05
3e-06,2.9e-05,2e-05,-1.3e-05,2.1e-05,4.7e-05,3.4e-05,4e-06,-3e-06,-3e-06,-9e-06,-3e-06,-1.1e-05,-2.3e-05,2.7e-05,-1e-05,3.8e-05,-8e-06,3.7e-05,-5e-06,-2e-05,-2.4e-05,-2.4e-05,-4.9e-05,-5e-05,2.6e-05,-2.8e-05,-9.1e-05,-1.5e-05,-5.6e-05,2.1e-05,-3.2e-05,-2.9e-05,4.1e-05,-2.1e-05,-2e-05,-4.1e-05,1.3e-05,-9.9e-05,-1.4e-05,-1.8e-05,-7e-06,9.6e-05,0.000108,0.000188,-9.5e-05,-1.9e-05,-3.9e-05,1.1e-05,0,8.1e-05,-5.7e-05,-4.9e-05,0.000101,4.2e-05,5.8e-05,-5.6e-05,2.5e-05,-7.2e-05,-2.8e-05,-1.5e-05,8.7e-05,-1.1e-05,9e-06,9.5e-05,2.2e-05,5e-06,-3.5e-05,1.1e-05,7e-06,5.9e-05,-4e-05,1e-06,-1.6e-05,4.5e-05,4.7e-05,-4.6e-05,-6.4e-05,-3e-06,-4.3e-05,1.6e-05,3.6e-05,-3.4e-05,4.5e-05,0,4e-05,6.6e-05,5.5e-05,2e-05,-7e-06,1.4e-05,-8.7e-05,-8.7e-05,1.5e-05,0.000141,8.1e-05,3.6e-05,-2e-05,-1.6e-05,-7.8e-05,-1.7e-05,3e-05,-2.7e-05,0.000112,3e-05,2.6e-05,2.7e-05,7.5e-05,2e-05,4.9e-05,7.4e-05,-9.7e-05,8.6e-05,5.3e-05,-2.6e-05,8.4e-05,1.4e-05,-8.7e-05,1.1e-05,5e-06,9.3e-05
3e-05,-4.6e-05,-6.1e-05,-2e-05,-3.3e-05,-4.1e-05,-3.2e-05,-7e-06,2.9e-05,9e-06,-6.3e-05,-9e-06,-6.6e-05,-4e-05,-3e-06,3e-06,-4.7e-05,0,-1.3e-05,5e-05,9e-06,6.5e-05,5.1e-05,1e-06,1.1e-05,3e-05,1.6e-05,4.1e-05,1.3e-05,-4e-05,-4.3e-05,-1.6e-05,2.5e-05,7.3e-05,2e-05,-1.3e-05,-0.000162,-3.3e-05,1e-06,0.000103,5.2e-05,-1.8e-05,-0.000179,6.7e-05,-0.000115,2e-05,4e-06,1.5e-05,-1.3e-05,-2.6e-05,-0.000125,9e-06,8.4e-05,-3.6e-05,1.1e-05,-5.7e-05,-4.5e-05,-3.7e-05,-2e-05,3.3e-05,3.2e-05,-6.7e-05,4e-06,-1.1e-05,-0.000102,-6.3e-05,4e-05,-7e-06,0,7e-06,6e-06,-8e-06,-2.7e-05,2.1e-05,5.5e-05,2e-06,2e-05,1.7e-05,-4.9e-05,2.9e-05,-7.3e-05,-6.5e-05,-1.3e-05,-4e-06,-5e-05,3.6e-05,-3.1e-05,-3e-06,-1.3e-05,2.2e-05,-9e-06,-3e-06,-3.9e-05,2.1e-05,-0.000106,2.3e-05,1.7e-05,3.3e-05,-2.5e-05,-1.3e-05,1e-06,-5.1e-05,-4.8e-05,-9.5e-05,1.7e-05,3.2e-05,-8e-06,-3.5e-05,2.7e-05,-8e-06,4.3e-05,5.9e-05,2e-05,-6e-06,-5e-06,3.4e-05,5.4e-05,-6.4e-05,-3.8e-05,9e-06,-1.9e-05
2.5e-05,-9e-06,9e-06,2.1e-05,2.6e-05,1.1e-05,-4.4e-05,2.9e-05,3.6e-05,1.2e-05,2.9e-05,3.5e-05,3.5e-05,1.7e-05,3.2e-05,-2e-06,6.1e-05,3.3e-05,6.8e-05,4.7e-05,8e-06,2.7e-05,2.3e-05,-2.3e-05,8.1e-05,-2.4e-05,-1.4e-05,2.8e-05,-2e-06,1.9e-05,8e-06,3e-06,1.5e-05,-1e-06,9e-06,9e-06,-5.2e-05,3e-06,3e-05,5.6e-05,7e-06,1.9e-05,-2.5e-05,-8e-06,1e-06,2.1e-05,7.1e-05,-1.1e-05,0.000112,9.8e-05,-2.7e-05,-9.6e-05,-3.6e-05,2e-06,5.7e-05,1.4e-05,1.2e-05,4.1e-05,1.3e-05,-1.8e-05,-3e-06,-1.4e-05,1.2e-05,5e-06,-3.6e-05,-7e-06,2.8e-05,7.4e-05,1.8e-05,-3.5e-05,-3.2e-05,-1.4e-05,-2.8e-05,-4.6e-05,-1.1e-05,-2e-06,-9e-06,4.8e-05,6.2e-05,3.7e-05,5e-05,3.5e-05,0.000107,3.9e-05,2.3e-05,-1e-05,2.3e-05,-1.2e-05,1.6e-05,2.9e-05,1.1e-05,1.5e-05,9.6e-05,5.7e-05,0.000102,7.7e-05,-3e-05,1.3e-05,-2.3e-05,-1e-05,-2e-06,6.6e-05,6.7e-05,2.5e-05,-3.6e-05,-3.3e-05,3.6e-05,1.2e-05,2.4e-05,5.6e-05,-1.3e-05,-7.1e-05,-7.7e-05,-2.6e-05,3.8e-05,6e-06,-7e-06,-3e-05,-3.3e-05,-2.1e-05,-2.7e-05
-1.2e-05,-2.8e-05,-1e-05,1.3e-05,-2.7e-05,-2.4e-05,-1.8e-05,5e-06,-4e-06,4e-06,1.2e-05,-8e-06,3.4e-05,1.6e-05,2.5e-05,6e-06,2e-05,-6e-06,-1.3e-05,-3.8e-05,-1.6e-05,4.4e-05,-1.2e-05,0,1.3e-05,5.8e-05,-1.6e-05,3.4e-05,1.6e-05,4.9e-05,1.2e-05,9e-06,3e-06,-2.3e-05,2.3e-05,-9e-06,4.7e-05,2.4e-05,-1.5e-05,1.8e-05,-3.6e-05,-4e-05,-5e-06,1.7e-05,2.4e-05,8.1e-05,-7.2e-05,2.6e-05,-4.9e-05,-3e-05,-4.8e-05,2e-05,1.5e-05,-4.1e-05,1.6e-05,-2.4e-05,4.2e-05,-3.4e-05,7.1e-05,4.2e-05,2.5e-05,6e-06,-1e-06,-5.2e-05,1.9e-05,4e-06,2.6e-05,-2.8e-05,-1.4e-05,-2.8e-05,-1e-06,-1.5e-05,-1.5e-05,3e-06,-1.3e-05,-2.6e-05,-1e-05,1.2e-05,-3.2e-05,-1.5e-05,1.3e-05,-8e-06,-5.6e-05,-5e-06,-3.4e-05,-6.5e-05,-6e-06,-1.1e-05,4e-06,1.8e-05,9e-06,-1e-06,9e-06,-2.2e-05,-6.3e-05,-4.6e-05,-9e-06,7e-06,-2e-05,2.3e-05,4.6e-05,-5.4e-05,-1.2e-05,2.4e-05,1e-06,-4e-06,-6.9e-05,1.1e-05,-2.2e-05,-8.7e-05,1e-05,6.6e-05,-1.3e-05,-7e-06,-1.6e-05,0,-3.5e-05,5e-06,-1.7e-05,-6e-06,-2.9e-05
1e-05,1e-05,1.5e-05,-1.3e-05,3.3e-05,1.3e-05,1e-06,3e-05,-5.2e-05,-1.8e-05,-1.6e-05,1.2e-05,2.2e-05,-1.4e-05,-4e-06,-1.8e-05,-2e-05,-3e-06,1.4e-05,-3.9e-05,-1.4e-05,-2.9e-05,-5.5e-05,-1.3e-05,-2.7e-05,-1e-05,-1.4e-05,-2.9e-05,-2.1e-05,1.3e-05,1e-06,4.5e-05,-3.8e-05,-4.3e-05,1.7e-05,1e-05,3.6e-05,-8e-06,-9e-06,-2.1e-05,-2e-05,2e-06,3.6e-05,-1.3e-05,2.1e-05,-4.7e-05,3.5e-05,-3.3e-05,0,2.4e-05,4.9e-05,3.8e-05,-2.8e-05,-1e-06,-3.3e-05,2.1e-05,3.3e-05,6e-06,-2.6e-05,-4e-06,-2.7e-05,2e-06,-6e-06,1.9e-05,3.5e-05,6.3e-05,-3e-06,-5.2e-05,-8e-06,-2e-06,-2.3e-05,-1.4e-05,1e-05,-3.1e-05,1.1e-05,-3.2e-05,-2e-06,-2.3e-05,-1e-05,1e-05,2e-05,5e-06,-7e-06,1.2e-05,6e-06,2e-05,-1.4e-05,3e-05,-1.5e-05,-4.7e-05,-1.5e-05,8e-06,-2.1e-05,2.1e-05,-2.4e-05,-1e-06,-1.9e-05,-2.3e-05,-1.7e-05,9e-06,-3e-06,1.8e-05,2.6e-05,-2e-05,-2.9e-05,-2e-06,-1e-06,-3e-05,2e-05,7e-06,-4.3e-05,-1.1e-05,8e-06,1.4e-05,-4.4e-05,-2.1e-05,1e-06,-1.1e-05,-1.2e-05,-2.1e-05,-2e-06
3.3e-05,5e-06,-9e-06,1.2e-05,-9e-06,1.1e-05,1.9e-05,0,2.6e-05,-1.1e-05,1.8e-05,-1e-05,-1.3e-05,-3.4e-05,-2e-06,-9e-06,-1.8e-05,-3e-06,-2e-05,-3e-06,-1e-05,-2.1e-05,4e-06,2e-06,-3.8e-05,-2.1e-05,1e-05,-1.8e-05,-1.5e-05,-1.6e-05,-2.5e-05,-4.1e-05,-1.6e-05,3e-06,1.4e-05,-1e-05,0,-3e-05,1.2e-05,-1.5e-05,-9e-06,2.1e-05,7e-06,-5.5e-05,-3e-05,6e-06,3.4e-05,1.5e-05,-4e-06,-4.4e-05,-2.1e-05,2.2e-05,4e-06,-6e-06,1.4e-05,-3.2e-05,-9e-06,-1.8e-05,4e-06,-4.3e-05,1e-05,1.2e-05,-8e-06,-2.9e-05,9e-06,1.4e-05,-3e-05,1.9e-05,-1.2e-05,4e-06,-1.1e-05,-3e-05,3e-06,-8e-06,-1e-06,7e-06,2.4e-05,-2.1e-05,-1.8e-05,-4e-06,-1.3e-05,4e-06,-2.8e-05,-1.8e-05,-2e-05,7e-06,-3.3e-05,-1.3e-05,1e-05,3e-06,-1e-05,2.3e-05,-2.2e-05,1.8e-05,1.1e-05,-1.9e-05,-1e-06,-8e-06,3e-06,-2.1e-05,-8e-06,1.6e-05,-1.3e-05,-1.7e-05,5e-06,1e-06,3e-05,1.8e-05,7e-06,-9e-06,1.5e-05,4.8e-05,5.6e-05,2.8e-05,4.4e-05,1.7e-05,-1.1e-05,2e-06,7.9e-05,4.3e-05,2e-05
1.8e-05,-2.2e-05,-1e-05,-1.5e-05,-1.8e-05,-1.5e-05,4e-06,-3e-06,-1.3e-05,4e-06,2e-06,-5e-06,-9e-06,1.6e-05,3e-06,6e-06,0,-5e-06,4e-06,1.6e-05,6e-06,2.1e-05,-7e-06,-4e-06,-2.6e-05,1.4e-05,-2.4e-05,-7e-06,-2e-06,9e-06,-1e-06,2.7e-05,6e-06,-1.3e-05,2.3e-05,-3e-06,-1.4e-05,-3e-05,-1.1e-05,7e-06,3e-06,-1.7e-05,-1.6e-05,1.6e-05,-3.9e-05,-2e-05,-5e-06,1e-05,-2.1e-05,2.8e-05,-2e-06,-5e-05,-3e-05,2.1e-05,2.6e-05,-2.1e-05,-1.6e-05,1e-06,-1e-06,-1.3e-05,-1.5e-05,-2.9e-05,-3e-06,9e-06,-2.7e-05,-3.5e-05,-5e-06,3e-06,-4e-06,-1.4e-05,-9e-06,2.7e-05,-1e-06,0,-1.6e-05,2e-06,6e-06,4e-06,5e-06,-6e-06,-2.3e-05,-1e-06,7e-06,5e-06,2e-05,4.2e-05,-1.3e-05,1e-05,-1.5e-05,1e-05,1e-05,2e-06,-1.2e-05,7e-06,-2.2e-05,-1.9e-05,-5e-06,2.3e-05,2.3e-05,-2.7e-05,-1.2e-05,-3.1e-05,-1.9e-05,-2.8e-05,-5e-06,4e-06,-1e-05,-8e-06,-7e-06,2e-06,9e-06,-1.5e-05,4e-06,-2.8e-05,-1.4e-05,0,1e-06,2.9e-05,-6e-06,-1e-06,-1e-05
4e-06,-1.1e-05,-7e-06,3e-06,2.4e-05,1e-06,-1e-06,-6e-06,-1e-06,7e-06,1e-06,-1e-06,-1.5e-05,1.9e-05,-9e-06,-6e-06,1.1e-05,5e-06,-7e-06,1.6e-05,4e-06,-1.6e-05,8e-06,0,-5e-06,-5e-06,6e-06,2e-06,-8e-06,-5e-06,-2e-06,-1.3e-05,1.4e-05,7e-06,2e-06,6e-06,-1.1e-05,-1.7e-05,-6e-06,3e-06,1e-06,4e-06,1e-06,5e-06,1.9e-05,2e-05,-6e-06,-2.1e-05,1e-05,1e-06,-2.5e-05,3e-06,9e-06,-2.3e-05,-9e-06,1.5e-05,-3.7e-05,4e-06,2.4e-05,7e-06,4e-06,-9e-06,6e-06,-6e-06,-4e-06,1.2e-05,-1.5e-05,-9e-06,0,6e-06,-5e-06,-2.6e-05,0,1e-06,7e-06,-6e-06,-6e-06,-7e-06,4e-06,-1.1e-05,2e-06,0,1e-06,1.9e-05,-8e-06,-1.3e-05,1.5e-05,1e-05,-4e-06,7e-06,6e-06,-5e-06,1.6e-05,-5e-06,9e-06,6e-06,9e-06,-2.5e-05,1.1e-05,-1e-06,5e-06,7e-06,3e-06,2e-06,1.4e-05,-1e-06,-2e-05,-2e-06,2.3e-05,-1.4e-05,-1e-06,1e-05,-7e-06,2e-06,-1.4e-05,1.7e-05,-2e-06,1.3e-05,-1e-05,-9e-06,3e-06
6e-06,1.1e-05,4e-06,-5e-06,1e-06,1e-06,-3e-06,-6e-06,1e-06,-2e-06,-4e-06,-7e-06,-7e-06,4e-06,-2e-06,-4e-06,-5e-06,-3e-06,-4e-06,6e-06,-4e-06,1.7e-05,9e-06,-3e-06,7e-06,1.5e-05,0,8e-06,-6e-06,-1.7e-05,1e-05,7e-06,-1e-06,0,-5e-06,-8e-06,8e-06,-5e-06,5e-06,-5e-06,6e-06,3e-06,-5e-06,-5e-06,1.4e-05,-2e-06,3.9e-05,1.2e-05,-8e-06,-5e-06,2.1e-05,-1.1e-05,1e-05,5e-06,-9e-06,0,-2e-06,1.7e-05,2e-06,-7e-06,1e-06,9e-06,1.3e-05,7e-06,9e-06,-2.1e-05,5e-06,-7e-06,6e-06,2e-06,-2e-06,0,2e-06,8e-06,-1.2e-05,1e-06,8e-06,-4e-06,-4e-06,3e-06,2.1e-05,6e-06,1.6e-05,-1e-06,9e-06,-8e-06,1.1e-05,1e-06,0,1e-06,5e-06,0,-1.9e-05,-5e-06,1e-06,1.5e-05,-1.2e-05,1.7e-05,5e-06,-1e-06,3e-06,-1.1e-05,1e-05,4e-06,-7e-06,2e-06,1.5e-05,-7e-06,-1.3e-05,4e-06,1.2e-05,-2.5e-05,-1.4e-05,-3e-06,1.2e-05,-7e-06,0,-1e-06,-1.5e-05,1.8e-05,-4e-06
6e-06,1e-05,-1e-06,3e-06,3e-06,0,6e-06,-2e-06,-2e-06,-1e-06,5e-06,-3e-06,-5e-06,7e-06,-3e-06,1e-06,1e-05,1e-06,-4e-06,5e-06,-3e-06,2e-06,-3e-06,-3e-06,1e-06,-1.3e-05,-7e-06,6e-06,3e-06,-5e-06,-2e-06,-9e-06,-4e-06,-7e-06,2e-06,2e-06,-1.1e-05,7e-06,-5e-06,-4e-06,1e-06,-4e-06,1.2e-05,1e-05,1e-05,4e-06,-2e-05,1e-06,2.2e-05,1.5e-05,2.1e-05,1e-06,1.2e-05,-9e-06,-8e-06,2e-06,-1e-06,-2e-06,-1.8e-05,4e-06,3e-06,6e-06,-6e-06,-6e-06,1.5e-05,-6e-06,7e-06,4e-06,-4e-06,-3e-06,8e-06,7e-06,6e-06,-7e-06,-5e-06,0,-1.2e-05,9e-06,5e-06,0,-1.2e-05,-3e-06,-5e-06,0,-1e-06,0,-1e-06,-6e-06,-1e-06,1e-06,-2e-06,-4e-06,1.1e-05,1e-06,-1.4e-05,6e-06,6e-06,4e-06,-1e-06,1e-06,-2e-06,8e-06,-2e-06,7e-06,-4e-06,-3e-06,2e-06,6e-06,1e-06,2e-06,-1.1e-05,0,-8e-06,0,-4e-06,-3e-06,-2e-06,-1.5e-05,7e-06,-1e-06,1e-06
-3e-06,-4e-06,-2e-06,5e-06,4e-06,-3e-06,2e-06,-1e-06,-2e-06,3e-06,-5e-06,-3e-06,2e-06,-8e-06,-1e-06,1e-06,-3e-06,0,2e-06,-5e-06,3e-06,9e-06,3e-06,-1e-06,8e-06,8e-06,5e-06,4e-06,-2e-06,4e-06,8e-06,2e-06,-2e-06,4e-06,-3e-06,1e-06,-1.5e-05,8e-06,3e-06,-1e-05,-3e-06,5e-06,-5e-06,-1.8e-05,-4e-06,2e-06,-8e-06,-1e-06,-1e-06,-1e-05,-4e-06,-6e-06,-3e-06,5e-06,8e-06,-1.5e-05,4e-06,4e-06,-1e-06,3e-06,3e-06,1e-06,0,4e-06,-9e-06,5e-06,2e-06,8e-06,4e-06,-1e-06,4e-06,-5e-06,-1e-06,0,-5e-06,-3e-06,0,1e-06,-2e-06,0,-8e-06,3e-06,0,4e-06,2e-06,4e-06,-1.5e-05,2e-06,0,4e-06,3e-06,-7e-06,5e-06,3e-06,-4e-06,-1e-05,7e-06,-6e-06,-6e-06,2e-06,-4e-06,-9e-06,3e-06,-1.1e-05,3e-06,4e-06,-2e-06,5e-06,7e-06,3e-06,4e-06,-1.3e-05,5e-06,1e-06,-2e-06,0,-6e-06,0,3e-06,4e-06,3e-06
0,-4e-06,-2e-06,-3e-06,2e-06,2e-06,-5e-06,-1e-06,-1.2e-05,-1e-06,3e-06,-2e-06,5e-06,-4e-06,-8e-06,0,-3e-06,-2e-06,-4e-06,-3e-06,-3e-06,-1.2e-05,-3e-06,-2e-06,3e-06,-9e-06,-2e-06,-4e-06,-2e-06,8e-06,1e-06,-1e-06,-6e-06,-2e-06,-2e-06,2e-06,-1e-06,1e-05,-6e-06,-1.2e-05,0,0,-7e-06,-6e-06,-8e-06,1e-06,9e-06,5e-06,-2e-06,1.1e-05,-7e-06,9e-06,5e-06,-1e-06,-9e-06,1.1e-05,1.5e-05,-4e-06,6e-06,2e-06,-1e-06,-9e-06,-1e-06,-3e-06,-9e-06,3e-06,4e-06,-6e-06,5e-06,-3e-06,4e-06,-2e-06,-4e-06,-2e-06,0,2e-06,-2e-06,1e-06,5e-06,5e-06,1.4e-05,1e-06,-3e-06,3e-06,-3e-06,9e-06,0,1e-06,1e-06,-1e-05,0,-1e-06,-2e-06,-1e-06,1.3e-05,-6e-06,-6e-06,-1e-06,-6e-06,4e-06,-2e-06,6e-06,2e-06,4e-06,2e-06,0,2e-06,-1.1e-05,-7e-06,-2e-06,-1e-06,9e-06,4e-06,3e-06,1e-06,-2e-06,3e-06,-9e-06,4e-06,3e-06,-1e-06
3e-06,0,-3e-06,0,-4e-06,-2e-06,-4e-06,-2e-06,4e-06,-1e-06,3e-06,-1e-06,2e-06,-5e-06,1e-06,-2e-06,3e-06,3e-06,-1e-06,1e-06,-2e-06,-2e-06,-2e-06,-2e-06,-1.1e-05,0,3e-06,0,2e-06,-3e-06,-1e-06,-2e-06,1e-06,9e-06,0,0,8e-06,1e-05,-2e-06,-6e-06,1e-06,-4e-06,-3e-06,1e-06,8e-06,-1e-06,-1.2e-05,-1e-06,-5e-06,-1.3e-05,-1e-05,-1e-06,-6e-06,1.2e-05,-3e-06,4e-06,3e-06,-1e-05,-5e-06,-5e-06,-3e-06,1e-06,-2e-06,3e-06,-3e-06,5e-06,-3e-06,-4e-06,2e-06,2e-06,4e-06,1e-06,-3e-06,-1e-06,0,0,3e-06,-6e-06,-5e-06,4e-06,2e-06,-1e-06,-5e-06,-5e-06,0,-3e-06,9e-06,-7e-06,3e-06,2e-06,0,2e-06,-9e-06,-5e-06,1e-06,3e-06,3e-06,1e-06,-5e-06,8e-06,-2e-06,-4e-06,-2e-06,1e-05,5e-06,3e-06,-4e-06,1e-05,5e-06,6e-06,2e-06,0,-1e-05,-3e-06,-2e-06,6e-06,0,-5e-06,-1.3e-05,-1e-06,-1e-06
1e-06,5e-06,1e-06,-3e-06,3e-06,0,-4e-06,-1e-06,5e-06,2e-06,-2e-06,-1e-06,-3e-06,-5e-06,-1e-06,3e-06,-5e-06,-2e-06,-1e-06,3e-06,-1e-06,1e-06,1e-06,-1e-06,-6e-06,0,-3e-06,-3e-06,0,-2e-06,-1e-06,2e-06,1e-06,2e-06,1e-06,-2e-06,7e-06,1e-06,3e-06,0,-1e-06,3e-06,0,3e-06,1e-05,-1e-06,0,2e-06,-1e-06,6e-06,8e-06,4e-06,-3e-06,-9e-06,1e-06,-3e-06,-4e-06,5e-06,-7e-06,-3e-06,-1e-06,3e-06,2e-06,-5e-06,6e-06,8e-06,-2e-06,6e-06,0,-1e-06,2e-06,-2e-06,0,0,-2e-06,-1e-06,0,3e-06,3e-06,-3e-06,-6e-06,2e-06,3e-06,2e-06,0,-1e-06,4e-06,0,-1e-06,-2e-06,-1e-06,1e-06,-1e-06,1e-06,-1e-06,6e-06,1e-06,-1e-06,0,-7e-06,0,2e-06,1e-06,-2e-06,0,-2e-06,3e-06,-8e-06,0,3e-06,3e-06,1e-05,-4e-06,-1e-06,2e-06,2e-06,-1e-06,-7e-06,-3e-06,3e-06,-3e-06
-5e-06,2e-06,0,1e-06,0,2e-06,2e-06,-3e-06,2e-06,0,4e-06,1e-06,-4e-06,3e-06,-2e-06,-1e-06,4e-06,1e-06,0,1e-06,1e-06,-4e-06,3e-06,-1e-06,7e-06,-5e-06,1e-06,3e-06,2e-06,1e-06,-1e-06,-3e-06,3e-06,2e-06,-1e-06,3e-06,-2e-06,0,-5e-06,2e-06,0,-2e-06,4e-06,6e-06,-1e-06,-1e-06,1e-06,0,-6e-06,-2e-06,-2e-06,6e-06,1e-06,-1e-06,1e-06,-4e-06,-6e-06,-6e-06,-5e-06,-1e-06,-1e-06,0,0,3e-06,4e-06,0,0,3e-06,-2e-06,0,0,1e-06,1e-06,-2e-06,3e-06,0,3e-06,2e-06,-3e-06,-3e-06,-2e-06,-2e-06,0,1e-06,-5e-06,-8e-06,0,-1e-06,1e-06,5e-06,3e-06,3e-06,4e-06,-1e-06,1e-06,4e-06,-1e-06,1e-06,2e-06,-2e-06,-2e-06,-2e-06,-4e-06,5e-06,-2e-06,0,-1e-06,1e-06,-4e-06,-8e-06,-2e-06,0,-2e-06,4e-06,-1e-06,-1e-06,0,1e-05,7e-06,-3e-06,1e-06
-2e-06,-3e-06,-3e-06,-2e-06,-3e-06,-2e-06,3e-06,-2e-06,-4e-06,-1e-06,0,1e-06,-3e-06,5e-06,1e-06,-2e-06,-2e-06,1e-06,2e-06,-2e-06,-2e-06,4e-06,-2e-06,-1e-06,6e-06,2e-06,-1e-06,-1e-06,0,0,0,3e-06,0,1e-06,-2e-06,-3e-06,-3e-06,-3e-06,-1e-06,1e-06,0,0,-3e-06,0,-9e-06,2e-06,-3e-06,0,3e-06,1e-06,-4e-06,-4e-06,0,0,-3e-06,2e-06,-7e-06,7e-06,4e-06,0,1e-06,0,1e-06,-4e-06,-6e-06,-5e-06,1e-06,-8e-06,1e-06,-2e-06,-1e-06,-3e-06,0,-1e-06,1e-06,-2e-06,5e-06,-5e-06,-1e-06,0,1e-06,1e-06,4e-06,-2e-06,3e-06,5e-06,-8e-06,-2e-06,1e-06,-3e-06,0,2e-06,-3e-06,-2e-06,-3e-06,1e-06,-4e-06,2e-06,3e-06,-7e-06,-3e-06,-1e-06,3e-06,-4e-06,-3e-06,-2e-06,-1e-06,0,3e-06,5e-06,1e-06,2e-06,6e-06,-3e-06,-5e-06,-3e-06,-2e-06,4e-06,3e-06,-1e-06,0
0,-2e-06,-1e-06,1e-06,2e-06,1e-06,1e-06,0,-1e-06,0,1e-06,1e-06,-2e-06,4e-06,2e-06,1e-06,1e-06,-1e-06,1e-06,-1e-06,-1e-06,2e-06,0,0,2e-06,-3e-06,-3e-06,2e-06,1e-06,-4e-06,-1e-06,-4e-06,-2e-06,-3e-06,-1e-06,1e-06,0,-4e-06,1e-06,0,-2e-06,2e-06,0,2e-06,0,3e-06,1e-06,1e-06,7e-06,2e-06,-6e-06,-6e-06,1e-06,0,-3e-06,2e-06,-3e-06,-1e-06,2e-06,4e-06,2e-06,-4e-06,-1e-06,3e-06,-5e-06,-3e-06,4e-06,3e-06,-3e-06,0,-3e-06,0,0,-1e-06,2e-06,-1e-06,-2e-06,4e-06,-1e-06,-1e-06,3e-06,-2e-06,-2e-06,-1e-06,-2e-06,2e-06,1e-06,-1e-06,-1e-06,0,0,0,-1e-06,0,5e-06,-1e-06,4e-06,-3e-06,4e-06,5e-06,4e-06,3e-06,2e-06,3e-06,2e-06,3e-06,2e-06,1e-06,-3e-06,1e-06,-1e-06,-6e-06,5e-06,2e-06,4e-06,0,0,5e-06,3e-06,2e-06,1e-06
-4e-06,1e-06,0,0,-1e-06,-1e-06,-2e-06,-1e-06,2e-06,0,1e-06,2e-06,0,-1e-06,0,-1e-06,0,1e-06,3e-06,-1e-06,0,-1e-06,0,-1e-06,-1e-06,2e-06,-1e-06,-1e-06,-1e-06,-1e-06,0,5e-06,-1e-06,0,0,1e-06,-1e-06,-4e-06,-2e-06,0,-1e-06,-3e-06,2e-06,-1e-06,3e-06,-3e-06,-2e-06,1e-06,-1e-06,-4e-06,1e-06,-1e-06,0,1e-06,2e-06,-1e-06,4e-06,1e-06,-6e-06,3e-06,1e-06,1e-06,1e-06,-5e-06,0,-4e-06,0,2e-06,-2e-06,0,-4e-06,0,1e-06,-2e-06,1e-06,0,1e-06,0,-2e-06,-1e-06,1e-06,1e-06,1e-06,0,1e-06,0,2e-06,0,1e-06,-1e-06,0,-1e-06,-2e-06,-1e-06,2e-06,-4e-06,-2e-06,1e-06,2e-06,-1e-06,1e-06,-3e-06,-1e-06,1e-06,0,-1e-06,0,0,0,-2e-06,0,-2e-06,-2e-06,-1e-06,-1e-06,0,-1e-06,-3e-06,-4e-06,-2e-06,-1e-06
-4e-06,2e-06,-1e-06,1e-06,1e-06,1e-06,0,2e-06,-4e-06,0,1e-06,1e-06,2e-06,-2e-06,0,0,-1e-06,0,0,1e-06,0,-3e-06,-1e-06,0,-2e-06,-2e-06,0,1e-06,0,2e-06,0,-5e-06,0,-3e-06,-3e-06,0,-3e-06,-3e-06,-2e-06,0,-1e-06,1e-06,0,-1e-06,0,0,0,0,2e-06,4e-06,4e-06,2e-06,-3e-06,2e-06,2e-06,-1e-06,5e-06,-2e-06,-2e-06,-1e-06,0,3e-06,-1e-06,4e-06,4e-06,1e-06,0,-2e-06,-1e-06,1e-06,-2e-06,1e-06,2e-06,2e-06,2e-06,-1e-06,-2e-06,0,1e-06,1e-06,-6e-06,-1e-06,-2e-06,-1e-06,-2e-06,0,1e-06,0,-1e-06,1e-06,0,-1e-06,6e-06,-1e-06,-7e-06,-2e-06,0,1e-06,1e-06,2e-06,-2e-06,1e-06,1e-06,-2e-06,1e-06,1e-06,-3e-06,-1e-06,2e-06,-3e-06,-1e-06,-4e-06,-3e-06,0,-3e-06,1e-06,0,4e-06,-5e-06,-1e-06,1e-06
-2e-06,0,0,1e-06,-1e-06,0,1e-06,0,3e-06,0,0,1e-06,1e-06,0,2e-06,0,2e-06,0,3e-06,1e-06,-1e-06,0,1e-06,-1e-06,-3e-06,2e-06,-2e-06,-2e-06,-1e-06,1e-06,1e-06,3e-06,1e-06,0,0,-1e-06,-3e-06,-3e-06,0,2e-06,0,1e-06,0,6e-06,-5e-06,0,2e-06,1e-06,-3e-06,-6e-06,3e-06,-2e-06,1e-06,-2e-06,-1e-06,-3e-06,3e-06,1e-06,4e-06,-1e-06,-1e-06,0,1e-06,-3e-06,1e-06,2e-06,-1e-06,0,0,0,-1e-06,-2e-06,0,-2e-06,0,-1e-06,-1e-06,-2e-06,-2e-06,3e-06,2e-06,1e-06,-1e-06,-1e-06,3e-06,-4e-06,-3e-06,0,-1e-06,-1e-06,0,0,-6e-06,0,2e-06,1e-06,1e-06,-2e-06,-1e-06,-2e-06,1e-06,-2e-06,1e-06,-4e-06,-1e-06,-1e-06,3e-06,3e-06,-4e-06,3e-06,1e-06,0,-2e-06,-1e-06,1e-06,2e-06,0,-3e-06,3e-06,1e-06,0
-1e-06,-2e-06,-1e-06,-2e-06,0,0,1e-06,2e-06,2e-06,0,1e-06,1e-06,0,-2e-06,0,0,-3e-06,0,-1e-06,1e-06,0,-2e-06,-2e-06,0,-3e-06,0,0,1e-06,-1e-06,0,-1e-06,-1e-06,1e-06,-2e-06,0,-1e-06,1e-06,0,-2e-06,3e-06,0,-2e-06,-1e-06,0,-4e-06,-1e-06,-6e-06,0,-1e-06,4e-06,-2e-06,2e-06,-1e-06,-2e-06,-1e-06,3e-06,0,-2e-06,1e-06,-3e-06,-1e-06,-2e-06,0,3e-06,-3e-06,3e-06,-2e-06,-1e-06,0,-1e-06,0,-1e-06,-1e-06,0,0,0,-1e-06,-1e-06,2e-06,0,3e-06,-1e-06,2e-06,-1e-06,-2e-06,0,-1e-06,1e-06,0,1e-06,0,-1e-06,-1e-06,0,2e-06,1e-06,0,2e-06,-2e-06,2e-06,1e-06,2e-06,-2e-06,-2e-06,0,0,0,-5e-06,3e-06,-1e-06,0,3e-06,2e-06,2e-06,0,-1e-06,-1e-06,-3e-06,2e-06,-1e-06,1e-06
-3e-06,-1e-06,-1e-06,1e-06,2e-06,0,-1e-06,0,1e-06,0,1e-06,0,-1e-06,0,0,1e-06,3e-06,0,2e-06,0,0,1e-06,1e-06,-1e-06,0,0,0,0,-1e-06,-1e-06,0,0,0,-1e-06,0,1e-06,3e-06,0,-1e-06,1e-06,0,1e-06,-1e-06,1e-06,2e-06,0,1e-06,0,-2e-06,-3e-06,-4e-06,0,1e-06,3e-06,1e-06,0,-3e-06,2e-06,-2e-06,-2e-06,0,-2e-06,0,-3e-06,-2e-06,2e-06,0,2e-06,1e-06,0,1e-06,3e-06,-1e-06,-1e-06,1e-06,-1e-06,0,3e-06,-1e-06,-2e-06,-2e-06,1e-06,0,-1e-06,2e-06,2e-06,2e-06,0,-1e-06,0,0,0,1e-06,0,-3e-06,0,0,1e-06,-2e-06,-1e-06,0,-1e-06,0,1e-06,0,-1e-06,-1e-06,4e-06,-1e-06,-1e-06,-1e-06,1e-06,3e-06,0,-2e-06,-1e-06,0,-6e-06,0,-1e-06,1e-06
-1e-06,1e-06,0,-1e-06,-2e-06,0,-2e-06,1e-06,-3e-06,1e-06,0,0,-2e-06,1e-06,1e-06,-1e-06,-2e-06,-1e-06,0,-1e-06,0,1e-06,1e-06,0,4e-06,1e-06,-1e-06,1e-06,-1e-06,1e-06,0,0,-1e-06,0,0,-1e-06,2e-06,2e-06,0,1e-06,0,0,-1e-06,0,3e-06,1e-06,4e-06,0,1e-06,2e-06,1e-06,1e-06,3e-06,-2e-06,2e-06,-1e-06,-3e-06,-1e-06,0,1e-06,0,2e-06,0,2e-06,1e-06,-1e-06,0,0,1e-06,0,1e-06,-2e-06,-1e-06,-1e-06,-1e-06,0,1e-06,-2e-06,1e-06,0,-1e-06,0,0,-1e-06,-1e-06,1e-06,0,0,0,1e-06,0,1e-06,1e-06,0,1e-06,-2e-06,1e-06,-3e-06,-1e-06,-1e-06,2e-06,0,1e-06,-2e-06,1e-06,1e-06,0,-2e-06,-2e-06,0,0,3e-06,-1e-06,-1e-06,1e-06,-1e-06,0,2e-06,-1e-06,-1e-06,-1e-06
-1e-06,1e-06,0,0,0,1e-06,0,0,-2e-06,0,1e-06,0,-1e-06,0,0,0,1e-06,0,0,0,0,2e-06,-1e-06,-1e-06,2e-06,1e-06,0,0,-1e-06,-1e-06,1e-06,0,-1e-06,0,0,1e-06,-1e-06,3e-06,-2e-06,-1e-06,0,-1e-06,1e-06,-4e-06,0,-1e-06,-5e-06,1e-06,2e-06,-1e-06,2e-06,-1e-06,0,2e-06,-1e-06,-2e-06,-2e-06,-1e-06,2e-06,1e-06,1e-06,1e-06,0,-2e-06,2e-06,-1e-06,1e-06,-2e-06,1e-06,0,2e-06,-1e-06,1e-06,0,-1e-06,0,1e-06,-1e-06,0,0,-1e-06,0,0,-1e-06,1e-06,-2e-06,0,1e-06,0,-2e-06,0,1e-06,-1e-06,0,-2e-06,-2e-06,0,1e-06,0,-1e-06,0,0,0,0,1e-06,0,1e-06,-1e-06,3e-06,2e-06,0,-1e-06,-1e-06,1e-06,-1e-06,1e-06,0,1e-06,-2e-06,0,1e-06
-1e-06,0,-1e-06,0,2e-06,-1e-06,1e-06,1e-06,2e-06,0,0,0,0,0,0,0,0,0,0,0,0,-3e-06,0,0,-2e-06,1e-06,0,0,0,-1e-06,0,1e-06,0,2e-06,0,0,-1e-06,2e-06,0,0,0,1e-06,0,0,-2e-06,1e-06,1e-06,1e-06,1e-06,-1e-06,0,1e-06,0,-1e-06,0,1e-06,0,1e-06,3e-06,2e-06,1e-06,0,0,1e-06,0,-2e-06,1e-06,1e-06,1e-06,0,2e-06,2e-06,0,-1e-06,-1e-06,0,1e-06,1e-06,0,-1e-06,0,0,0,0,-1e-06,0,-2e-06,1e-06,0,1e-06,0,0,-3e-06,0,0,-1e-06,-1e-06,1e-06,1e-06,0,-1e-06,1e-06,0,-1e-06,0,0,0,2e-06,-2e-06,-1e-06,1e-06,0,-1e-06,-1e-06,-1e-06,1e-06,0,2e-06,1e-06,-1e-06,-1e-06
-2e-06,-1e-06,0,0,-2e-06,0,1e-06,1e-06,0,0,0,-1e-06,0,0,0,-1e-06,-2e-06,0,-1e-06,0,0,1e-06,0,-1e-06,-2e-06,0,0,0,0,0,0,-2e-06,0,0,0,0,0,2e-06,-1e-06,0,0,-1e-06,0,-1e-06,1e-06,0,4e-06,-1e-06,-1e-06,2e-06,-4e-06,-3e-06,-1e-06,0,1e-06,2e-06,2e-06,-2e-06,-1e-06,1e-06,0,-1e-06,0,-1e-06,-2e-06,-2e-06,-1e-06,1e-06,0,0,1e-06,-1e-06,0,1e-06,0,0,0,0,0,0,3e-06,0,-1e-06,0,0,-2e-06,2e-06,0,0,-1e-06,0,0,3e-06,1e-06,2e-06,1e-06,1e-06,-1e-06,2e-06,3e-06,1e-06,-1e-06,-1e-06,2e-06,-1e-06,0,0,-1e-06,0,-1e-06,-1e-06,-4e-06,1e-06,1e-06,0,0,0,0,4e-06,-1e-06,1e-06
0,0,-1e-06,0,0,0,0,0,0,0,1e-06,-1e-06,1e-06,0,0,1e-06,2e-06,0,-1e-06,0,0,-1e-06,0,0,0,0,0,0,0,1e-06,0,1e-06,1e-06,1e-06,0,0,0,1e-06,-1e-06,-1e-06,0,0,0,-1e-06,3e-06,-1e-06,-2e-06,1e-06,-1e-06,-3e-06,-1e-06,-1e-06,-2e-06,-1e-06,0,-2e-06,2e-06,1e-06,-1e-06,-1e-06,0,-1e-06,0,0,-1e-06,1e-06,0,-1e-06,0,0,0,-1e-06,0,-1e-06,-1e-06,0,0,0,-1e-06,1e-06,-3e-06,0,1e-06,0,-1e-06,1e-06,1e-06,0,0,1e-06,0,-1e-06,-1e-06,0,-2e-06,2e-06,0,1e-06,2e-06,-1e-06,0,-1e-06,1e-06,1e-06,0,0,0,0,2e-06,2e-06,0,1e-06,2e-06,0,0,0,0,3e-06,-1e-06,0,-1e-06
1e-06,1e-06,0,0,2e-06,0,0,0,0,0,0,-1e-06,0,1e-06,-1e-06,0,-2e-06,-1e-06,-1e-06,0,0,0,0,-1e-06,0,0,-1e-06,0,0,1e-06,0,-1e-06,0,0,1e-06,0,-1e-06,-1e-06,0,0,0,1e-06,1e-06,0,1e-06,0,-1e-06,0,0,3e-06,1e-06,1e-06,1e-06,2e-06,0,-1e-06,0,0,2e-06,-1e-06,0,1e-06,0,0,1e-06,1e-06,0,0,-1e-06,0,-1e-06,0,1e-06,0,0,0,0,-1e-06,0,0,-3e-06,0,0,0,0,2e-06,0,0,0,-1e-06,0,-1e-06,-1e-06,0,-1e-06,1e-06,-1e-06,0,1e-06,0,-1e-06,1e-06,0,1e-06,0,0,0,-2e-06,-3e-06,0,1e-06,-4e-06,0,0,-1e-06,-1e-06,0,1e-06,-2e-06,0,1e-06
0,1e-06,0,0,-2e-06,0,0,0,1e-06,0,0,-1e-06,0,1e-06,0,0,2e-06,0,-1e-06,0,0,1e-06,0,0,1e-06,0,0,0,0,-1e-06,0,1e-06,0,0,0,1e-06,-1e-06,-1e-06,-1e-06,-1e-06,0,-1e-06,0,-2e-06,-2e-06,0,2e-06,0,-1e-06,-3e-06,2e-06,1e-06,0,-1e-06,0,1e-06,-1e-06,0,1e-06,-1e-06,0,1e-06,0,0,1e-06,1e-06,0,1e-06,-1e-06,0,-1e-06,0,0,0,0,0,-1e-06,1e-06,-1e-06,0,3e-06,0,0,0,1e-06,-1e-06,-2e-06,0,0,1e-06,0,0,-2e-06,0,2e-06,0,0,-1e-06,0,-1e-06,0,0,-1e-06,0,0,0,0,2e-06,2e-06,-1e-06,-1e-06,4e-06,-1e-06,0,1e-06,0,0,-1e-06,0,0,-1e-06
1e-06,0,-1e-06,0,0,0,0,0,-2e-06,0,1e-06,0,0,0,0,0,-2e-06,0,0,0,0,1e-06,0,-1e-06,1e-06,0,-1e-06,0,0,0,0,-1e-06,0,0,0,-1e-06,0,-2e-06,0,-1e-06,0,0,-1e-06,0,-2e-06,0,0,0,1e-06,3e-06,0,-1e-06,0,1e-06,0,2e-06,-1e-06,0,-1e-06,0,0,0,0,0,-1e-06,1e-06,0,0,-1e-06,0,-2e-06,0,0,0,0,0,0,1e-06,0,0,0,0,0,0,-1e-06,0,-1e-06,0,1e-06,-1e-06,0,0,2e-06,0,0,-1e-06,1e-06,1e-06,-1e-06,0,0,0,1e-06,0,0,0,0,-3e-06,0,0,1e-06,-2e-06,-1e-06,0,-2e-06,1e-06,0,-3e-06,-1e-06,0,0
1e-06,-1e-06,0,1e-06,1e-06,0,0,0,-1e-06,0,1e-06,0,-1e-06,-1e-06,0,0,1e-06,0,0,0,0,0,0,0,1e-06,0,-1e-06,0,0,0,0,1e-06,0,-1e-06,0,0,1e-06,-2e-06,0,0,0,1e-06,0,-1e-06,1e-06,0,-1e-06,0,1e-06,-1e-06,-2e-06,0,1e-06,-1e-06,0,-1e-06,-1e-06,1e-06,-1e-06,1e-06,0,-1e-06,0,0,-1e-06,0,0,0,-1e-06,0,-1e-06,-1e-06,-1e-06,0,0,0,0,-1e-06,-1e-06,0,-2e-06,0,0,0,1e-06,-1e-06,2e-06,0,0,1e-06,0,0,0,0,-1e-06,0,-1e-06,0,-2e-06,-1e-06,0,-1e-06,1e-06,1e-06,0,0,0,2e-06,-2e-06,1e-06,-1e-06,4e-06,0,0,0,1e-06,0,-1e-06,2e-06,0,0
1e-06,0,0,0,-1e-06,0,-1e-06,0,2e-06,0,0,0,-1e-06,-1e-06,0,0,0,0,0,0,0,-1e-06,0,-1e-06,-1e-06,0,0,0,0,0,0,0,0,0,0,0,1e-06,-1e-06,-1e-06,0,0,-1e-06,-1e-06,1e-06,1e-06,0,0,0,0,0,-1e-06,0,-2e-06,0,0,-1e-06,0,-1e-06,0,0,0,0,0,0,0,-1e-06,0,0,0,0,-1e-06,0,0,0,0,0,0,1e-06,0,-1e-06,0,0,0,0,0,0,1e-06,0,0,0,0,1e-06,-2e-06,0,1e-06,1e-06,0,-1e-06,-1e-06,1e-06,0,1e-06,-1e-06,0,0,0,0,0,2e-06,-1e-06,1e-06,-2e-06,1e-06,0,0,0,0,-1e-06,1e-06,1e-06,0
1e-06,0,-1e-06,0,0,0,0,0,1e-06,0,1e-06,0,0,-1e-06,0,0,-1e-06,0,0,0,0,1e-06,0,0,-2e-06,0,0,-1e-06,0,0,0,-1e-06,0,0,0,0,0,0,-1e-06,0,0,1e-06,0,1e-06,-1e-06,-1e-06,0,0,0,1e-06,1e-06,0,0,-1e-06,0,1e-06,0,1e-06,0,1e-06,0,1e-06,0,0,1e-06,-1e-06,0,0,0,0,0,0,0,0,0,0,0,0,0,0,0,0,0,1e-06,0,1e-06,-1e-06,0,0,1e-06,0,0,0,0,-1e-06,1e-06,1e-06,1e-06,-1e-06,0,0,0,0,0,0,0,0,-2e-06,-2e-06,0,0,3e-06,0,1e-06,-1e-06,-1e-06,0,0,-3e-06,0,1e-06
1e-06,0,0,0,0,0,0,0,-1e-06,0,1e-06,0,0,0,0,0,1e-06,0,0,0,0,-2e-06,0,-1e-06,-1e-06,0,0,0,-1e-06,0,0,1e-06,0,0,0,0,-1e-06,0,0,0,0,0,0,1e-06,-2e-06,1e-06,0,0,0,-2e-06,1e-06,0,0,1e-06,1e-06,1e-06,0,0,-1e-06,0,0,1e-06,0,0,1e-06,0,0,0,0,0,1e-06,0,0,0,0,0,0,0,0,1e-06,2e-06,0,0,0,-1e-06,1e-06,-2e-06,0,0,0,0,0,0,0,1e-06,0,0,0,1e-06,1e-06,0,-1e-06,1e-06,-1e-06,0,0,0,2e-06,0,1e-06,-1e-06,-4e-06,0,-1e-06,0,0,0,-1e-06,-1e-06,0,-1e-06
1e-06,0,0,-1e-06,0,0,0,0,-1e-06,0,0,1e-06,0,1e-06,0,0,-2e-06,0,1e-06,0,0,1e-06,0,0,1e-06,0,0,0,0,0,0,-1e-06,0,0,0,-1e-06,0,1e-06,-1e-06,0,0,-1e-06,0,1e-06,0,0,0,1e-06,0,3e-06,-1e-06,0,0,0,0,0,0,0,-1e-06,-1e-06,0,0,0,0,0,1e-06,0,0,0,0,1e-06,0,0,0,0,0,0,1e-06,1e-06,0,1e-06,0,0,0,1e-06,-1e-06,1e-06,0,0,0,0,0,1e-06,0,1e-06,-1e-06,0,0,1e-06,0,0,0,0,-1e-06,0,0,0,-1e-06,2e-06,0,0,3e-06,0,0,0,0,0,2e-06,1e-06,1e-06,1e-06
