0.000127,0.000134,0.000307,0.000102,-5.2e-05,0.00031,-0.005204,-0.017265,-0.01081,-0.004258,-0.000455,-0.000452,-0.004506,-0.003182,-0.018121,-0.017561,-0.009654,-0.008692,-0.010997,0.000168,0.009715,-0.003532,-0.01325,-0.019221,-0.020036,-0.017044,-0.019286,-0.001744,-0.004848,-0.005716,-0.013887,-0.008514,-0.010966,-0.00993,-0.005432,-0.002741,-0.01342,-0.007065,-0.013165,-0.003377,-0.008321,-0.012311,-0.008612,-0.011873,-0.010095,-0.005849,-0.003909,-0.004811,-0.006399,-0.005949,-0.004663,-0.000786,-0.002661,-0.002435,-0.003674,-0.003595,-0.001019,-0.000436,0.000302,-0.000937,-0.001132,-0.001615,-0.001761,-0.001103,-0.000537,0.000133,-0.000169,-0.000275,-0.000292,-0.000142,-0.001384,-0.001521,-0.000928,-0.002139,-0.002777,-0.001929,0.000742,-0.003285,-0.001519,-0.000448,-0.001047,0.000517,-0.00631,-0.003935,-0.001871,0.000125,0.000548,0.000233,0.000153,0.000615,0.000794,0.000612,0.000338,-0.000231,-0.000452,-0.000417,-0.00069,-0.000249,0.000196,0.000482,0.000549,-0.002238,-0.003062,-0.001545,-0.001474,-0.000689,-0.000116,-3.6e-05,5.4e-05,0.00024,-0.001198,-0.000826,-0.000117,6.6e-05,0.00081,0.000525,0.000256,-0.000572,-0.001722,-0.015993,-0.010866
7.4e-05,0.000258,0.000144,0.00015,0.000214,0.000193,0.000484,0.01298,0.008085,0.003193,0.000364,0.000536,-0.000547,-4.8e-05,0.010914,0.009986,0.005702,0.003219,0.006893,0.001626,0.002337,-0.003386,-0.002083,0.004813,0.003461,0.005775,-0.001069,0.000883,-0.004868,0.001446,0.001811,-0.002182,0.000282,0.002042,-0.009542,-0.006826,0.003561,-0.005823,-0.004902,-0.007902,-0.005668,-0.003513,-0.004166,0.000891,0.000769,0.000822,-0.001791,-0.001847,-0.001234,0.001408,0.001068,0.000954,0.000941,-0.00017,-2.2e-05,-0.001206,-0.001703,-0.000489,0.000299,0.000321,0.000181,-0.000353,8.2e-05,0.00027,-0.000575,-0.00025,0.001107,0.000669,0.000399,-0.000151,-0.001006,-0.000689,-0.000806,-0.001256,0.002258,0.003168,-0.001814,-0.00271,-0.00028,-0.000465,-0.000686,-5.7e-05,0.001057,0.003463,0.002146,0.00124,-0.000173,-0.000105,-3.1e-05,0.000457,0.000176,0.000469,-7e-06,0.000304,0.000135,0.000127,0.000381,0.000759,0.000395,0.000751,0.000352,0.000585,0.000583,0.000333,0.000664,0.000165,0.000244,-0.000272,-0.000433,0.000181,0.000737,0.000601,0.000465,0.000369,0.000402,0.000241,0.000313,-0.001022,0.000531,5e-04,0.00219
1e-05,-2e-06,2.4e-05,-2.9e-05,-9.8e-05,-0.000203,-0.000508,-0.009484,-0.006174,-0.002565,-0.000334,4.9e-05,0.000393,0.000328,-0.000819,-0.005973,-0.002969,-0.001392,-0.005967,-0.007581,7e-06,0.000376,-0.003466,-0.002359,-0.006429,-0.006788,-0.001046,-0.002286,-0.003863,-0.004066,-0.001807,-0.005237,-0.004115,-0.002885,6.3e-05,0.002501,-0.002248,-0.003675,-0.001198,0.000289,-0.001794,-7e-04,-1.8e-05,-0.00559,-0.005238,-0.001601,-0.000889,-0.001723,-0.001915,-0.001091,-0.002405,-0.003564,-0.001716,-0.00067,-2.4e-05,0.000336,-0.00109,-0.000578,0.000309,0.00079,0.001238,-0.000924,-0.001149,-0.000793,0.000148,0.000179,0.000298,0.000244,0.000349,0.00033,0.000179,-0.001206,-0.000646,-0.000834,0.000741,-0.001054,-0.002007,-0.001696,-0.002125,-0.001265,-0.000652,-0.000653,-0.00355,-0.002089,-0.000874,0.000258,0.000181,0.000349,0.000194,0.000379,-0.000156,0.000245,-3.4e-05,6e-06,-4.7e-05,-0.000129,-0.000227,-0.000129,-4.5e-05,0.000417,9.2e-05,0.000255,0.000713,0.000283,-0.000394,-0.00028,-0.000167,-0.000603,-0.000645,-0.000227,-0.000231,-0.000492,-4.2e-05,0.000112,3.6e-05,6.5e-05,-1.9e-05,0.000291,-0.00011,0.001063,-0.000648
0.00019,0.000226,0.000115,-5e-06,6.4e-05,-0.000204,0.000413,0.00229,0.00166,0.00082,0.000469,-0.000158,-6.1e-05,0.00018,-0.003498,0.00096,0.000427,0.002255,0.001798,0.000198,-0.000326,0.007819,0.004591,-0.000163,0.003011,0.003912,0.009141,-0.004583,-0.003112,0.001983,-1.6e-05,-0.002968,0.005222,0.00361,-0.001096,0.004676,-0.000156,-0.001035,0.002786,0.00141,-0.001019,-0.000501,0.003013,0.004868,0.005731,0.001561,0.000691,0.002249,0.001311,0.000848,0.001324,0.001278,0.000748,-0.000259,-0.00018,9.8e-05,-0.00062,-0.000616,-3e-04,-0.000313,0.000304,-0.000513,0.000807,0.000768,0.000438,-0.000417,0.000149,0.000298,0.000361,0.000402,-0.000265,0.000693,0.00051,0.00126,0.002062,-0.001311,-0.000608,5.4e-05,0.000288,-0.000178,0.000557,0.000511,0.0028,0.000601,0.000359,0.000328,-4.9e-05,-0.000544,-0.000213,0.000142,-1.8e-05,0.000196,0.000126,0.000108,5.6e-05,3.7e-05,1e-04,0.000119,-0.000263,5.7e-05,0.000134,-7e-05,-0.000513,-0.000261,-0.000201,-2.8e-05,-0.000169,-2.1e-05,0.000191,0.000207,-4e-05,0.00011,5.1e-05,-7.6e-05,-1.4e-05,1.6e-05,0.000136,0.000194,-2.9e-05,0.000544,0.002412
3.3e-05,1e-05,4e-05,6e-05,-4.7e-05,9e-06,-4e-05,-7e-04,-0.000608,-0.000462,-0.000378,0.000165,0.000161,-0.000204,0.000325,0.00109,0.000842,-0.000588,-0.004018,-0.001812,0.001871,-8.4e-05,-0.011484,-0.002207,-0.001745,-0.002864,-0.004604,-0.001415,-0.001224,-0.000319,-0.002864,0.000235,-0.005853,-0.004725,0.000502,0.00345,-0.000349,0.006571,0.001185,1.7e-05,-0.001651,-0.001846,-0.001067,0.000754,-0.004999,-0.002207,-0.001218,0.001352,0.001474,-7.8e-05,-0.00182,-5e-04,-0.00047,-0.000184,-0.001648,-8.9e-05,0.000681,0.00068,-3.2e-05,-0.000185,2.8e-05,0.000662,3.6e-05,0.000153,-0.000191,2e-06,-9e-06,4.9e-05,0.000611,0.000251,-0.000122,0.000175,0.00018,-2e-06,-0.000517,2.3e-05,-0.000782,0.001925,0.000597,0.000131,0.000479,-0.000118,-0.000694,-0.000505,-0.000251,-0.000131,-0.000138,-1.2e-05,0.000267,4.8e-05,-0.000163,0.000171,0.000146,7e-06,9.8e-05,0.000106,1e-06,-0.000106,-1.7e-05,9.9e-05,-0.000202,0.000383,0.000305,6.8e-05,-0.000246,0.000601,0.000217,-4.1e-05,0.000543,6.9e-05,9e-05,2.5e-05,-1e-04,6.6e-05,7.4e-05,3e-05,0.000162,0.000106,0.000257,0.000104,0.002495
5.2e-05,-8e-06,1e-05,-7.9e-05,3.8e-05,-5e-06,-6e-06,0.000268,0.001032,0.000372,-1e-05,-0.000341,-8.7e-05,0.000158,0.001524,-0.000686,-0.00107,0.000214,6.4e-05,-0.000253,0.002504,-0.004143,0.00467,0.001552,-0.001499,0.001056,-1e-04,0.003521,-0.000195,0.001864,-0.000879,-0.005816,0.003802,0.002738,0.000209,-0.005476,-0.002051,-0.001992,-0.005905,0.000785,0.006833,0.003666,0.003826,-0.000499,0.001597,0.000685,0.000938,0.000206,-0.00035,-0.00076,0.001056,0.001046,0.000714,0.000504,-0.000183,-0.001672,-0.000699,-3.6e-05,-0.000312,9e-06,0.000462,-0.00014,-2e-06,0.000147,-7.4e-05,-0.000138,-3.1e-05,-0.00064,-3.1e-05,-0.000353,-7.7e-05,0.000348,0.000181,-0.000159,-0.000741,-0.001793,-2e-06,-0.001421,0.000702,0.000485,-0.00043,0.00049,0.000559,0.00024,0.000142,-0.00011,-7.8e-05,-0.000296,-0.000199,-0.00016,-0.000161,2.4e-05,-3.7e-05,0.000167,0.000101,1.1e-05,0.000155,-6e-06,-8.8e-05,0.000144,-9.6e-05,0.000344,-1e-06,0.000121,0.000224,2.6e-05,-0.000145,-8e-05,-0.000164,-0.000112,-0.000141,-0.000136,-5.7e-05,-5.3e-05,3.5e-05,-0.000122,6.4e-05,-2.9e-05,-0.000107,-0.000477,-0.007911
-3.1e-05,-0.000162,-1.5e-05,-7.5e-05,3.7e-05,-0.000131,-0.000105,0.001984,-0.000187,-0.000719,-0.000176,2e-06,-0.000562,-0.000272,-0.000235,0.000511,0.000947,-0.000227,-0.000352,-0.002398,0.000586,-0.001707,0.002234,0.001628,0.005815,-0.001094,0.000493,-0.000297,-0.000494,-0.000327,-0.004831,1.2e-05,0.003174,-0.003776,0.001866,0.002718,-0.002071,-0.000469,0.000171,-0.000207,-0.002007,2.7e-05,-0.001263,-0.000257,-0.000243,-0.002228,-0.000265,-0.000739,-0.000943,-0.000554,-0.001305,-0.002165,-0.001221,-0.000724,-0.000665,0.000425,0.000207,0.001281,4.3e-05,-0.00053,-0.000585,-6e-04,-0.000192,2.1e-05,0.00012,-0.000333,-4.8e-05,-0.000349,0.000125,-0.000311,0.000154,-5.9e-05,-0.000557,0.000386,0.000175,-6.5e-05,0.000949,-0.000803,-0.000246,-0.000751,-0.000544,-0.000451,0.000603,0.000134,0.000513,-0.000178,-0.000263,-0.000238,-8e-05,-6e-05,-0.000159,-0.000194,-9.5e-05,-0.000103,-0.000127,-4.2e-05,-0.000111,4.3e-05,-0.000317,-0.000148,-0.000448,0.000171,-0.000107,-8.2e-05,-7.6e-05,-4.3e-05,-6.9e-05,-0.00022,0.000139,-2.5e-05,3.4e-05,1.1e-05,3.2e-05,-2.2e-05,-0.00012,-0.000307,-0.000105,-5.9e-05,-0.00012,-0.000308,0.004279
-2.5e-05,-6.5e-05,-5.6e-05,-0.000123,6.3e-05,7.8e-05,-0.000211,-0.000395,0.000197,0.00045,3e-06,-5.5e-05,2e-05,-0.000207,-0.000922,-0.000267,6e-05,0.000375,0.000145,-0.00021,-0.004029,-0.002904,0.001138,0.000234,-0.003483,-0.002233,-0.002217,-0.002843,0.000301,0.000143,0.002668,-0.002502,-0.000981,-0.000576,-0.000775,-0.000372,0.000961,-0.002182,0.000726,-0.003723,-0.000147,-0.002157,0.00109,0.000247,0.00058,0.000245,-0.000486,-0.000872,4e-06,-0.000188,-0.000465,0.000788,0.000755,6e-04,0.000668,-2.8e-05,-0.000184,-0.000525,-0.000569,-0.000401,-0.000162,2e-04,-0.000262,-4.4e-05,-0.000138,-5.4e-05,-3e-06,-0.000183,-5.9e-05,-5e-04,-0.000193,-0.000108,-5.7e-05,-7.5e-05,0.000301,-0.000208,0.001231,-0.000253,-0.000761,-0.000388,-0.000168,-0.000705,-0.000826,-0.000583,-0.000542,-0.000195,-0.000195,-6.6e-05,-0.000306,-0.000111,-0.000224,-0.000165,-7.6e-05,-0.000171,6.6e-05,2.3e-05,-3.4e-05,-1.3e-05,-4.3e-05,-0.000198,-0.000176,2.4e-05,-0.00017,-0.000129,-4.5e-05,-7.5e-05,-0.000231,-0.000116,-0.000164,-0.000122,0.000128,-3.2e-05,-2.9e-05,-6.7e-05,-0.000201,-0.000141,-0.000119,-5.3e-05,8.5e-05,0.000405,-0.000214
3e-06,9e-06,-1.6e-05,-8.3e-05,2.6e-05,-3.9e-05,-0.000123,-0.000535,-0.000861,0.000414,0.000411,-0.000155,-0.000306,0.000108,-7.2e-05,-0.000413,-0.000794,-0.000669,0.000212,0.000196,-0.000725,-0.000245,0.00175,-4.5e-05,0.002414,0.001848,0.001515,0.000641,0.00227,0.001236,0.001219,0.001513,-0.000386,-0.001021,0.00361,0.00052,0.001429,-0.001074,0.000461,0.002102,-0.000734,-0.001395,-0.000762,-0.001117,-8.7e-05,0.000676,0.000859,0.000434,-9.9e-05,0.000182,-1.9e-05,-0.00075,-0.000656,-0.000308,0.000473,-0.000388,5.9e-05,0.000226,-1.9e-05,-2.8e-05,-6.2e-05,0.000264,-0.00096,-0.000469,-0.000306,-7.1e-05,-0.000361,-0.00046,7.2e-05,0.000155,0.000341,-0.000334,0.00012,-9.5e-05,-0.000232,-8e-06,0.001135,0.000172,0.000382,0.000301,-6.8e-05,0.000489,7.7e-05,-0.000376,-0.000267,-7.3e-05,-0.000114,6.2e-05,-7.2e-05,-6.6e-05,-0.000192,-0.00015,-7.2e-05,-1.6e-05,5.4e-05,2.7e-05,-3.3e-05,-7.3e-05,-0.00015,-8.2e-05,-0.000195,-3.6e-05,-1.1e-05,3.8e-05,6.1e-05,1.1e-05,-6.9e-05,-0.000128,-9.3e-05,0.000183,3.1e-05,1.6e-05,0.000104,4.2e-05,-7.7e-05,0,-8.9e-05,-7.8e-05,5e-05,-0.000263,-0.001158
6.5e-05,-6.9e-05,-5e-06,1.4e-05,1.9e-05,4.2e-05,-4.4e-05,0.000449,0.000282,-0.000497,-0.000226,-0.000199,-4.9e-05,-0.000243,0.000132,0.000454,-0.000437,0.000747,-0.000205,0.000845,-0.000585,0.001633,0.003676,0.000103,6.1e-05,-2.1e-05,-0.000109,0.002279,-0.002014,0.000761,-0.001113,-0.000961,-0.004623,0.000656,-0.000858,0.000462,-0.001978,-0.00185,-0.00011,0.00133,0.000763,0.000892,0.000158,4e-04,-0.000864,-4e-04,-0.000106,0.000507,0.000544,0.000725,-0.000206,-0.000653,0.000256,0.000379,-0.00064,0.000207,-0.000178,-0.000272,0.000207,-5.7e-05,-0.000201,-0.000112,0.000513,-7.8e-05,-0.00021,-0.000251,-3.8e-05,-0.000142,-0.000122,-0.000118,0.000205,-0.000195,-5.2e-05,-0.000352,-0.000325,-0.000431,-9.3e-05,-4.1e-05,0.000393,0.000236,0.000363,0.000269,-1e-05,0.00022,-0.000383,-2.7e-05,6.6e-05,-3e-05,9.2e-05,-3.4e-05,-8.1e-05,-8.5e-05,-1e-04,-3.7e-05,-9.5e-05,-5.2e-05,1e-05,-5.9e-05,-2.6e-05,-0.000118,-4.5e-05,1.1e-05,4e-06,4e-06,0.000111,0.000103,-1.4e-05,2.5e-05,-7.3e-05,-9.8e-05,3.1e-05,0,-0.000112,-6e-06,-7.5e-05,-1.1e-05,-8.3e-05,2.7e-05,4.6e-05,0.000277,0.000291
1.3e-05,-5e-06,-1.7e-05,-2e-05,-1.2e-05,2e-05,-2.3e-05,0.000125,-0.000181,0.000332,0.000166,5.4e-05,-7.4e-05,2e-06,-0.000372,0.000141,0.000904,-0.000731,-1.4e-05,-0.000234,0.000252,-0.000426,-0.000126,-9.9e-05,-0.001455,-0.000443,-0.000855,-0.001113,0.001491,-0.00093,-0.000965,0.003051,0.000943,-0.000131,0.001077,-0.000822,0.000796,0.000514,-0.000945,-0.002645,0.000313,-0.001468,-0.001155,-0.001017,-0.000571,0.000546,-9.5e-05,-0.000735,-8.3e-05,-0.000379,0.000509,0.000154,4.5e-05,-0.000439,-0.000299,3e-05,0.000146,0.000136,0.000153,-0.000142,-1.7e-05,0.00022,8.2e-05,5.8e-05,9.4e-05,-7.1e-05,-9.8e-05,-4.7e-05,-0.000119,-6.6e-05,1e-04,0.000185,4e-06,0.00016,0.000382,-7e-06,0.000324,0.000655,-1.1e-05,0.000654,-5.5e-05,-0.000168,-5.1e-05,-0.000301,-0.000371,-0.000308,-7e-05,4e-06,-4.8e-05,-0.000104,-7.3e-05,-3.5e-05,-0.00011,-3.5e-05,-2e-05,2e-05,-9e-06,4.3e-05,-5e-06,-5.4e-05,-0.000101,-0.000142,-1.5e-05,3.8e-05,-0.000197,-5.3e-05,5e-06,4.2e-05,-8.2e-05,-4.7e-05,6.1e-05,1.4e-05,9e-05,4e-05,-4.7e-05,-4.3e-05,-7.4e-05,-4.5e-05,1.2e-05,-8e-06,0.000314
-3e-06,-5.5e-05,-1.1e-05,-1.5e-05,8e-06,-1.3e-05,-2.5e-05,1.6e-05,-9.8e-05,-0.000368,-0.000167,0.000174,-1.2e-05,-6.8e-05,0.00019,3.5e-05,-0.000761,0.00022,2.8e-05,0.000399,-0.000389,0.000254,-0.001358,-0.000582,7.1e-05,0.001541,0.000448,0.002142,-0.000501,-0.001616,-0.001054,-0.0013,-0.001123,0.000613,0.000104,-0.000999,-0.000699,-0.000287,-0.000475,-2.7e-05,-0.00034,0.002207,-0.000383,-0.000109,-0.000271,0.000299,-0.000386,0.000485,-0.000133,-0.000574,-0.000262,-0.000111,-0.00012,-0.000461,0.000143,-6.1e-05,-0.000135,-0.000263,0.000175,0.000105,-0.00011,-3e-06,-2.7e-05,0.000157,0.000153,4e-05,-8e-06,3.7e-05,-0.000246,-0.000122,1.3e-05,-1.8e-05,3.6e-05,7.5e-05,-0.000176,-6.4e-05,-0.000309,0.000639,7e-06,-6e-05,0.000116,1.4e-05,0.000221,0.000242,0.000257,1.5e-05,3.1e-05,7.1e-05,3.3e-05,6e-06,2.9e-05,9e-06,-8.7e-05,-7.9e-05,-2.8e-05,-3.5e-05,2.5e-05,3.1e-05,-1.4e-05,-8e-06,-9.1e-05,-6.6e-05,-4.1e-05,1e-06,6.6e-05,7e-06,8.4e-05,-0.000115,-5.8e-05,-9.9e-05,3.7e-05,5e-05,6e-06,-2e-06,-4.3e-05,-1.4e-05,-8.1e-05,-4.7e-05,2.8e-05,-8.6e-05,-0.000485
1.6e-05,-1.4e-05,0,-2.4e-05,-1e-05,-1e-06,2.4e-05,-0.00012,0.00016,1.7e-05,0.000185,-7.7e-05,8e-05,-4e-05,0.000212,1.2e-05,0.000246,0.000284,4.5e-05,-0.00043,0.00051,-0.000184,-0.000184,-0.001351,0.000708,-0.002787,-0.00084,-0.000786,2e-06,-0.001108,0.000312,0.000267,0.00054,0.001447,0.000405,-0.000482,-0.000918,0.001404,0.001251,0.000981,0.000193,-0.000887,0.000937,0.000116,0.000181,-0.000764,0.000542,-0.000126,-0.000141,0.000261,0.000634,2.6e-05,-7.7e-05,1.2e-05,-0.000189,8.2e-05,9e-05,-0.000332,-0.000325,-2.2e-05,-1e-06,3.9e-05,8.5e-05,-0.000127,8.6e-05,0,5.4e-05,-9.5e-05,-6.9e-05,-7.8e-05,-0.000132,0.000121,-0.000206,0.000235,-5.4e-05,0.000111,0.000155,9.4e-05,0.000116,-0.00027,-9.5e-05,0.000111,-0.000332,-0.000122,0.000179,-6.7e-05,6.5e-05,1e-04,0.000107,-4.8e-05,-3.5e-05,-2e-05,-1.6e-05,-4e-06,-4.3e-05,-5e-06,2.7e-05,-4e-06,-2e-06,-1.4e-05,-2.3e-05,-0.00021,-1.4e-05,3.1e-05,6.7e-05,4e-06,-5.7e-05,-7.8e-05,-2.9e-05,-5e-06,8.9e-05,2.5e-05,-2e-06,-4.1e-05,1.3e-05,-4.5e-05,-7.9e-05,-3.8e-05,-5e-05,6.5e-05,0.000619
-1.1e-05,-1.7e-05,-2e-06,2e-06,-1.8e-05,-2.2e-05,-1.6e-05,-0.00032,-2.3e-05,0.000134,-0.000183,3.7e-05,-2.6e-05,6.2e-05,2.6e-05,-9e-06,0.00068,-0.000811,-8.1e-05,-2.7e-05,0.000212,-9e-06,0.00041,0.000166,0.000134,0.001574,0.001219,0.000852,0.000374,0.000273,-0.000693,-0.000741,0.000136,-0.001041,-0.001286,-0.000516,0.00047,0.000379,0.001254,0.001222,-0.001594,0.000131,-0.000402,-1.9e-05,0.000486,4e-05,-0.000402,-2.1e-05,-5e-05,-1.2e-05,-0.000298,-1.8e-05,-0.000128,0.000127,0.000208,-0.000342,-0.00016,8.6e-05,-0.000133,1.6e-05,-4.3e-05,9.1e-05,9e-05,-1.1e-05,-6.6e-05,-6.6e-05,-4e-05,-3.2e-05,-7.5e-05,-5.9e-05,8.6e-05,5.1e-05,2.7e-05,-5.6e-05,8e-05,-1.9e-05,-0.000342,-0.000474,-9.7e-05,-0.000329,0.000177,-3.8e-05,0.000187,-2.2e-05,0.000133,-0.000189,1.9e-05,3.3e-05,-1.1e-05,2.3e-05,-1e-06,-1.1e-05,3.3e-05,-6e-06,1.2e-05,-9e-06,1.1e-05,1.4e-05,-2.5e-05,1e-05,-4e-05,-6.5e-05,-1.3e-05,3.6e-05,-6e-06,-2.3e-05,-3.3e-05,8.8e-05,1.8e-05,-2.1e-05,-8.6e-05,2.1e-05,4e-06,2.5e-05,-2e-06,-9e-06,1.3e-05,-2.6e-05,-5e-06,2.6e-05,-0.000243
-9e-06,1.8e-05,-4e-06,-2.5e-05,-5.2e-05,3e-06,5e-06,0.000189,0.000121,9.4e-05,5.6e-05,-6e-05,-7.6e-05,-4.7e-05,-9.2e-05,-3.6e-05,-0.000623,0.001061,4.6e-05,-0.000115,0.000698,5.1e-05,0.001002,-0.000891,0.000297,-0.000573,-0.000882,0.000178,0.000213,0.000203,-0.000403,0.000613,-0.000363,0.000437,0.000992,-0.000203,0.00026,0.00059,9.3e-05,-0.001082,0.001496,3e-05,0.000155,-0.000242,0.000249,0.000489,0.000382,-3.9e-05,1.9e-05,0.000272,-0.000295,4.3e-05,-9.3e-05,-1.7e-05,-0.000143,5.4e-05,8.9e-05,6.1e-05,-0.000368,4.8e-05,-1.5e-05,5.8e-05,-2.5e-05,-5.6e-05,0,2e-05,4e-06,-1.3e-05,-6e-06,-1e-06,-2.5e-05,0.000111,0.000138,-5e-06,-0.000171,-1.1e-05,-0.000118,-0.000215,-7.9e-05,0.000528,5.3e-05,5.3e-05,0.000113,3.4e-05,-6.3e-05,4e-05,-4.6e-05,5.3e-05,-4.5e-05,9.7e-05,-3e-05,-1.9e-05,4.2e-05,-2.6e-05,2.5e-05,-2e-06,2.7e-05,-2.5e-05,-1.5e-05,-4e-06,-5e-06,-8.9e-05,6e-06,3.8e-05,-6.3e-05,-1.7e-05,-5.6e-05,-2e-06,9e-06,3e-06,-6.8e-05,2.9e-05,0,-1.4e-05,-6e-06,3.5e-05,1.9e-05,-1e-06,2.8e-05,1.2e-05,1.5e-05
-3e-06,5e-06,3e-06,-8e-06,-3.7e-05,-8e-06,-5e-06,1.8e-05,0.000146,8.8e-05,4.4e-05,-9e-06,7e-05,-3e-06,-3.2e-05,9.5e-05,-1.5e-05,-0.000855,-9.1e-05,0.000124,-0.000501,0.000185,-0.001204,3.3e-05,-3e-06,0.000216,0.000285,-0.000342,-0.001263,-5.1e-05,0.000138,-0.000509,5e-04,-0.000476,-0.000581,0.000618,-0.000165,0.000367,-0.000163,-0.000371,-0.000588,-0.000567,-0.000108,0.000137,-2.1e-05,6.3e-05,-0.000337,0,-4.3e-05,-0.000106,8.3e-05,6e-06,-8e-05,-6.6e-05,1e-04,0.00011,-3.7e-05,5.5e-05,0.00022,-6.8e-05,2.1e-05,2.5e-05,6.8e-05,5.8e-05,-5e-05,5e-06,9e-06,-2.5e-05,4.4e-05,0,-5.2e-05,7.6e-05,4.4e-05,-6.3e-05,-1.9e-05,-3.8e-05,-0.000313,4.9e-05,-2e-05,-6.2e-05,2.7e-05,-6.8e-05,-4.7e-05,-0.000103,2e-05,4.8e-05,2.3e-05,3.1e-05,-2e-06,-3.6e-05,-4e-06,-1.1e-05,2.6e-05,-1.6e-05,-3e-06,1.7e-05,1.8e-05,-3e-06,-1.7e-05,-6e-06,-2e-05,1.2e-05,-5e-06,1.3e-05,7e-06,9e-06,-7e-06,6e-06,3.3e-05,2.1e-05,-1.9e-05,2e-06,-2.6e-05,1e-05,0,4e-06,-5e-06,1.9e-05,4e-06,-1.8e-05,-1e-05
-1e-05,-1.2e-05,1e-06,-7e-06,-1e-06,1e-06,-9e-06,-0.000249,-8.5e-05,-0.000152,-6.5e-05,0,-1.2e-05,1.5e-05,0.000149,-8.1e-05,0.00027,0.000308,-3.8e-05,-3.2e-05,0.000236,1e-05,-0.0011,-0.000103,-0.000128,-7.4e-05,0.000387,-9.5e-05,0.000902,0.00037,-0.000374,0.000761,0.001018,0.000168,-0.00042,-0.000268,-5.4e-05,-0.000767,-0.000183,2.5e-05,-0.00016,0.000631,-0.000143,1.1e-05,-0.000154,8.5e-05,0.000143,-2.9e-05,9.8e-05,-0.000104,-3.9e-05,-6.6e-05,9.2e-05,-3.7e-05,0.000104,6e-06,3e-05,-1.8e-05,0.000136,2.2e-05,-2.9e-05,1.6e-05,-7e-05,1.8e-05,2.9e-05,-3.4e-05,-2.1e-05,6e-06,4.9e-05,3.1e-05,-8.1e-05,-6e-05,-4.4e-05,1.9e-05,1.2e-05,-6e-06,-0.000194,-0.000111,2.4e-05,-0.000104,-2.5e-05,4.6e-05,4.9e-05,3.1e-05,-2.3e-05,-5e-05,-5e-05,2e-05,-5e-06,-1e-05,-9e-06,-1.2e-05,4e-06,-2e-06,3e-06,-7e-06,-2e-05,7e-06,-5e-06,5e-06,-3e-05,8e-06,6e-06,3e-06,2.6e-05,-1.3e-05,-2.6e-05,8e-06,5e-06,-9e-06,8.8e-05,1.5e-05,1.1e-05,1e-06,-5e-06,-1e-06,6e-06,1.7e-05,-1.5e-05,1.2e-05,-9.8e-05
1e-05,-1.3e-05,0,-4e-06,-2e-06,0,-3e-06,4.3e-05,-1.4e-05,-1.2e-05,-2e-06,2e-05,1.8e-05,-2.4e-05,1.8e-05,4.5e-05,-0.000141,-8.6e-05,3.1e-05,-7e-06,-0.000314,8.1e-05,-0.000447,0.000361,0.000132,0.000141,5.3e-05,-7.7e-05,-2.1e-05,1.9e-05,4.3e-05,-0.000154,0.000125,0.000287,-0.000474,0.000199,0.000105,-0.000253,-1.2e-05,0.000297,0.000194,-0.000365,0.000274,-1.8e-05,-0.000118,9e-05,-5.1e-05,2.2e-05,2.9e-05,1.7e-05,7.8e-05,0.000106,-6e-06,4.1e-05,6e-05,4.7e-05,-1.5e-05,1.8e-05,6e-06,-4.8e-05,2.4e-05,8e-06,-3.7e-05,-3e-05,3.1e-05,-1.7e-05,-4.4e-05,-2.8e-05,3.9e-05,-1.8e-05,-3e-05,-1.1e-05,-2.3e-05,3.8e-05,8e-06,-2.6e-05,-0.000103,0.000101,-8e-06,0.000132,3e-06,1.8e-05,-2.7e-05,1.2e-05,-1.2e-05,4.1e-05,4.4e-05,2.3e-05,1e-06,7e-06,-1.1e-05,-2e-06,-6e-06,-4e-06,8e-06,-8e-06,1.3e-05,1.1e-05,-7e-06,-8e-06,-1.9e-05,3.6e-05,2e-06,-3e-06,1.1e-05,7e-06,1.7e-05,-1.3e-05,0,-1.3e-05,-1.5e-05,3e-06,-4e-06,5e-06,-6e-06,0,2e-06,1.6e-05,-4e-06,2.3e-05,9.2e-05
-2e-06,-9e-06,0,-4e-06,-3e-06,-5e-06,-3e-06,5.1e-05,6.4e-05,6.1e-05,5.3e-05,-4.9e-05,-2.6e-05,1e-06,-5.7e-05,1.6e-05,-0.000128,0.000115,-1.2e-05,-2.3e-05,0.000131,-3.8e-05,-0.000106,-0.00018,-6.1e-05,-0.000307,-1.1e-05,0.000407,-0.000237,0.000223,1e-05,0.000368,4.1e-05,-0.000339,0.000202,-2.1e-05,-0.000204,0.000355,0.000192,-0.000124,-0.000186,-0.000145,-0.000226,2.5e-05,-0.000133,-0.000111,1.1e-05,4.3e-05,1e-06,3.7e-05,-4.1e-05,-4.6e-05,-5.1e-05,-3.9e-05,-2e-06,-0.000105,9e-06,8.4e-05,-5.1e-05,-1.3e-05,-4.7e-05,-1.6e-05,0.000148,-2.8e-05,-4e-06,-5e-06,2.1e-05,-4.5e-05,-2e-06,-1.5e-05,-3.3e-05,-2.9e-05,-1.1e-05,-1.6e-05,2.6e-05,2.9e-05,-9.2e-05,7.9e-05,-4.4e-05,8.9e-05,-1.4e-05,-6.8e-05,-4.5e-05,-3.6e-05,-8e-05,-3.6e-05,-2.9e-05,2.4e-05,2e-06,-1.6e-05,-9e-06,6e-06,-2e-05,-7e-06,-2e-06,-3e-06,-5e-06,-1e-05,-1e-05,-8e-06,-2.8e-05,4.8e-05,-6e-06,6e-06,-2.2e-05,1e-06,-2e-06,-3e-06,-8e-06,-9e-06,-2.1e-05,-3e-06,3e-06,-3e-06,-6e-06,-1.2e-05,-2.2e-05,1.3e-05,-1.4e-05,1.5e-05,-3e-06
3e-06,-9e-06,-1e-06,-8e-06,-2e-06,6e-06,-1e-06,-3e-06,-6e-05,-3.2e-05,-7.4e-05,1.6e-05,-1.2e-05,-1.1e-05,4e-06,-4e-05,6.3e-05,-7.2e-05,4e-06,-7.4e-05,-0.000246,-7.3e-05,0.000243,0.000361,-0.000137,4e-06,-1.1e-05,-0.000535,0.000141,0.00026,4.7e-05,-0.000295,-0.000484,0.000491,-0.000214,4.8e-05,-7.8e-05,-0.000324,0.000453,6.7e-05,0.000538,9.5e-05,0.00023,-0.000118,0.000127,-0.000101,-0.000137,1.8e-05,-1e-05,-8.4e-05,2.6e-05,-8.3e-05,6.1e-05,2.1e-05,-2.2e-05,3.3e-05,-9e-06,5.6e-05,-1.2e-05,1.4e-05,-8e-06,-2.1e-05,-1.3e-05,5.9e-05,1e-06,-5e-06,2e-06,-1.5e-05,4e-06,-2.8e-05,-3.7e-05,5e-06,-9e-06,-1.6e-05,1e-05,-1.1e-05,-7.3e-05,5.2e-05,-6e-06,-0.000115,1e-06,3.4e-05,5e-05,3e-05,-5.5e-05,-2.3e-05,2.3e-05,2e-05,1.4e-05,8e-06,-4e-06,-6e-06,-1e-05,-1.1e-05,5e-06,3e-06,-7e-06,-5e-06,1e-06,-7e-06,-2.9e-05,2.9e-05,-4e-06,8e-06,3e-06,9e-06,6e-06,-4e-06,-1.5e-05,9e-06,-1e-06,9e-06,-7e-06,-3e-06,-9e-06,-1.2e-05,-2.4e-05,-5e-06,-1.2e-05,7e-06,-0.00015
-2e-06,6e-06,-1e-06,-6e-06,7e-06,-8e-06,0,4.3e-05,0,4.2e-05,6.9e-05,1.5e-05,4e-06,-1.3e-05,6.7e-05,1.4e-05,2.2e-05,5.8e-05,-1.5e-05,-8e-06,4.2e-05,6.3e-05,-0.000309,-0.000222,-5.6e-05,-6.7e-05,-0.000278,0.000103,-5.2e-05,0.000114,-0.000146,0.000284,1.2e-05,-4.7e-05,2.6e-05,0.000252,0.000252,0.000215,-0.000265,-3.7e-05,-0.000454,-0.00017,-0.000102,2.3e-05,2.2e-05,0.000112,6.7e-05,-1e-06,-1.7e-05,8.4e-05,1.6e-05,6.9e-05,-3.3e-05,2.5e-05,-5e-06,-5.3e-05,2e-05,-8.2e-05,-5.3e-05,1.5e-05,-2.2e-05,1.2e-05,4.7e-05,0,-1.2e-05,-2.5e-05,2.1e-05,-4e-06,-2.3e-05,-1.3e-05,-2.9e-05,1e-05,1.2e-05,-4e-06,-1.4e-05,-1e-06,-3.6e-05,-8.8e-05,-5e-06,-8.7e-05,3.3e-05,1e-05,-5.9e-05,-3.3e-05,5e-06,-4e-06,-8e-06,1.4e-05,2.3e-05,6e-06,-1.1e-05,0,-1.7e-05,6e-06,5e-06,0,0,4e-06,-7e-06,2e-06,-3e-06,1.6e-05,-3e-06,8e-06,8e-06,-4e-06,-1.2e-05,-2e-06,-1.4e-05,-3e-06,-2.1e-05,0,-3e-06,3e-06,6e-06,3e-06,-1e-05,-1.8e-05,1.1e-05,1e-06,0.000119
1e-06,6e-06,0,-4e-06,9e-06,5e-06,0,-7.4e-05,1.6e-05,1.4e-05,-5.9e-05,5e-06,-1.1e-05,1.6e-05,-3e-05,1.1e-05,-9e-06,1.3e-05,-1.3e-05,-5.8e-05,0.000107,-1.9e-05,-0.000138,0.000339,9.6e-05,0.000243,0.000101,6.8e-05,-0.000289,-1.6e-05,-0.000285,-0.000217,-0.000244,-6e-06,-0.000197,0.000195,-3.6e-05,5.2e-05,-2.6e-05,0.000199,0.000319,0.000245,-0.000225,3e-05,-5.6e-05,8.2e-05,-5.7e-05,-1.8e-05,-6e-06,7e-05,-4.7e-05,-4e-05,-3.6e-05,5e-06,-1.6e-05,5.6e-05,-1.5e-05,5.3e-05,3e-06,-2e-06,-5e-06,-5e-06,5e-06,-3e-06,1e-05,1e-05,-1.2e-05,-1e-05,-1.8e-05,0,3e-06,-1.2e-05,1.6e-05,-9e-06,-1.4e-05,-2.2e-05,8.3e-05,-0.000132,-1.8e-05,7.2e-05,5e-06,-2.8e-05,2.7e-05,-1e-06,5.8e-05,1.3e-05,7e-06,1.1e-05,-1.6e-05,-3e-06,-4e-06,-2e-06,-4e-06,-5e-06,-1.3e-05,4e-06,5e-06,4e-06,-8e-06,-1e-06,-1.8e-05,-6e-06,1e-06,0,-1e-05,1e-06,-1.2e-05,3e-06,-1.3e-05,4e-06,-1e-06,5e-06,7e-06,-7e-06,-2e-06,1e-05,-2e-06,-1.2e-05,1.2e-05,-1e-06,1.2e-05
-5e-06,2e-06,0,-5e-06,1e-05,-3e-06,0,3.8e-05,-1.7e-05,-5.1e-05,4.2e-05,-7e-06,8e-06,-1.7e-05,-8e-05,-1.7e-05,-3e-06,-0.000124,-2e-06,5.4e-05,9.3e-05,3e-05,-5e-05,0.000124,-0.000147,-0.000115,-0.000165,-4.2e-05,0.000235,-0.000188,4.7e-05,0.000253,-0.000262,8e-06,0.000144,-9.6e-05,-0.000133,0.000178,7e-05,-0.000324,-0.000113,3.5e-05,0.000126,-0.000147,-3.6e-05,2.4e-05,7.1e-05,1.6e-05,-3.3e-05,-0.000121,4.6e-05,2.2e-05,5e-06,-6.1e-05,6.4e-05,-4.5e-05,6e-06,-6.3e-05,-2.3e-05,-3e-06,1.9e-05,-1.8e-05,1e-06,-2.6e-05,4e-06,-1.3e-05,-1.8e-05,-7e-06,-2.5e-05,9e-06,-7e-06,2.9e-05,4e-06,4e-06,2.8e-05,2e-06,8.7e-05,-4.9e-05,9e-06,2.1e-05,2.1e-05,1.9e-05,8e-06,3.1e-05,3.7e-05,-2.1e-05,-7e-06,1e-05,-2.4e-05,4e-06,-5e-06,-2e-06,-1e-06,-7e-06,-2e-06,0,0,-3e-06,-3e-06,5e-06,-7e-06,-1.6e-05,-1e-06,-1e-06,-1e-06,2e-06,-5e-06,1e-06,-5e-06,-1e-05,1e-05,3e-06,-3e-06,1e-05,-2e-06,-1e-06,-3e-06,-4e-06,-3e-06,-3e-06,-8.4e-05
3e-06,-6e-06,0,-7e-06,4e-06,2e-06,0,9.5e-05,7.1e-05,-1.3e-05,-7e-06,-1.7e-05,-4e-06,0,2.8e-05,-3e-06,0.000125,0.000129,-1.2e-05,-7.6e-05,-8.1e-05,4.2e-05,-5.7e-05,3.8e-05,9e-05,-1e-06,0.000132,7.2e-05,4.2e-05,-0.00017,-5.6e-05,-6.8e-05,9.3e-05,-0.00017,-0.000159,-2.2e-05,1e-04,0.000214,8e-06,0.000123,3.5e-05,-0.00027,2.4e-05,-6.7e-05,-8.5e-05,5e-05,-6.1e-05,-1.1e-05,1.3e-05,2e-05,-3.3e-05,9e-06,1e-05,-5.6e-05,-4e-06,9e-06,-8e-06,6e-06,4.7e-05,-2e-05,1e-06,-2e-06,-1.2e-05,7e-06,-2e-06,-1.1e-05,7e-06,4e-06,-1.4e-05,-2e-06,2e-06,1.2e-05,-2.7e-05,5e-06,-1.5e-05,-4e-06,4.4e-05,-2.7e-05,7e-06,1.3e-05,-1.9e-05,2e-06,-1.6e-05,-2.4e-05,2.4e-05,-6e-06,-8e-06,9e-06,7e-06,-8e-06,-9e-06,-5e-06,7e-06,-3e-06,2e-06,-4e-06,6e-06,2e-06,-3e-06,1e-06,-1.6e-05,-2.6e-05,2e-06,-2e-06,-1.4e-05,-1e-06,-1.3e-05,1e-06,0,3e-06,0,-7e-06,1e-06,-8e-06,1e-06,-3e-06,0,0,-2e-06,1e-06,8.5e-05
-1e-06,-6e-06,0,0,1e-06,0,0,-6.9e-05,1.6e-05,9e-06,-2.5e-05,-2e-06,0,4e-06,3.8e-05,-5e-06,-0.000145,-7.7e-05,-9e-06,2e-05,9.3e-05,-3.4e-05,0.000246,-0.000241,2.8e-05,0.000134,-5.1e-05,-0.000197,-0.000176,-9.8e-05,-0.000121,0.000244,0.000113,0.000101,0.000183,-0.000131,-3.2e-05,-8.5e-05,0.000326,-1e-06,-6e-06,0.000105,-2.3e-05,0.000111,7.7e-05,7e-06,6.6e-05,-5.2e-05,-1.6e-05,-1.9e-05,1.9e-05,1.6e-05,1.1e-05,1.7e-05,1e-06,0,1e-05,-2.5e-05,1.6e-05,-1e-05,1.5e-05,1e-06,2.1e-05,1.5e-05,-6e-06,-3e-06,-3e-06,-1e-06,-5e-06,-7e-06,4e-06,1e-06,1.5e-05,-7e-06,-1.2e-05,7e-06,6.8e-05,1.8e-05,-2e-06,-3.6e-05,-6e-06,-4e-06,2.7e-05,1.1e-05,-4e-06,1e-05,1.1e-05,3e-06,2e-06,0,1e-06,-1e-06,8e-06,0,1e-06,-4e-06,-2e-06,-2e-06,1e-06,-2e-06,-1.5e-05,-2.8e-05,0,-2e-06,2.9e-05,-4e-06,1e-06,-3e-06,7e-06,-5e-06,-4e-06,-1e-06,1e-06,9e-06,1e-06,1e-06,4e-06,6e-06,0,1e-06,6e-06
3e-06,-3e-06,0,-4e-06,0,-1e-06,0,-1e-05,-3.2e-05,2.5e-05,3.1e-05,-1e-06,1e-06,-7e-06,-1.8e-05,1e-06,8.3e-05,1e-06,-1.2e-05,-6.4e-05,-9.3e-05,6e-06,0.000318,0.000149,3.8e-05,-0.000211,0.000122,0.000102,2e-06,-2e-05,-5.3e-05,-9.4e-05,0.000219,-0.000132,7e-06,-0.000121,-1e-04,-0.000104,-3.5e-05,2.3e-05,-0.000124,-0.000167,-4.3e-05,-1.1e-05,4.2e-05,-8.3e-05,9e-06,5.7e-05,9e-06,4.7e-05,-2.2e-05,4e-06,5e-06,1.2e-05,-2.7e-05,3e-06,-1.2e-05,-2.2e-05,-6e-06,1e-05,-8e-06,-1e-05,-4.8e-05,-5e-06,4e-06,1e-06,6e-06,-1.6e-05,1.1e-05,-1e-05,1.9e-05,-1e-06,-1.6e-05,-8e-06,1.2e-05,0,7.7e-05,5.7e-05,-3e-06,2.5e-05,-1.5e-05,3e-06,-2.7e-05,-9e-06,-1.3e-05,-8e-06,-1e-05,1e-06,-6e-06,7e-06,-6e-06,3e-06,7e-06,-1e-06,-3e-06,1e-06,0,-2e-06,-6e-06,0,-1.1e-05,-2.2e-05,-1e-06,-3e-06,-3e-06,6e-06,-3e-06,-3e-06,8e-06,-1e-06,5e-06,-3e-06,-6e-06,-8e-06,0,-4e-06,4e-06,8e-06,-4e-06,0,-6.3e-05
0,1e-06,0,-3e-06,0,2e-06,0,2.9e-05,3.6e-05,-4e-06,-1.5e-05,2.1e-05,-6e-06,4e-06,-3.1e-05,0,-8.6e-05,8.5e-05,-7e-06,2.3e-05,9.1e-05,-6e-06,0.00021,-0.000159,8e-05,8.9e-05,2.7e-05,-3.7e-05,5.3e-05,-1e-06,-9.4e-05,0.000138,5.8e-05,0.00018,0.000123,0.000132,9.3e-05,9.2e-05,-0.000234,-5.8e-05,0.000197,0.000105,6.5e-05,-2.2e-05,3.1e-05,-2.1e-05,2e-06,-2e-06,-1.5e-05,2.4e-05,2e-06,-4e-05,2e-05,5e-06,5e-06,1.4e-05,7e-06,-1.2e-05,-1.4e-05,-1e-06,-8e-06,-1.3e-05,5e-05,-9e-06,7e-06,-1.1e-05,-1e-06,-1.9e-05,6e-06,-6e-06,1.5e-05,-1.5e-05,9e-06,3e-06,-5e-06,5e-06,5.9e-05,4.4e-05,9e-06,-3.3e-05,3e-06,-5e-06,1.7e-05,-1.6e-05,-7e-06,-1.3e-05,7e-06,1e-06,8e-06,-3e-06,-1e-06,-2e-06,2e-06,-6e-06,3e-06,2e-06,2e-06,1e-06,0,-1e-06,-1.1e-05,-1.2e-05,-3e-06,-3e-06,-2e-05,-3e-06,3e-06,2e-06,7e-06,5e-06,8e-06,-5e-06,1e-06,4e-06,-2e-06,-5e-06,-2e-06,2e-06,2e-06,0,2.2e-05
0,3e-06,0,-4e-06,-1e-06,-3e-06,0,-1.5e-05,6e-06,-3e-06,1.2e-05,-1.4e-05,2e-06,-6e-06,2.6e-05,-4e-06,3.3e-05,-0.000115,-2e-06,-4.7e-05,-9.6e-05,-1.7e-05,-2.5e-05,-9.8e-05,-6.6e-05,-8.5e-05,-9.3e-05,7.3e-05,-1.9e-05,5.5e-05,-1.8e-05,-0.000124,-0.000113,-4e-06,-1e-06,-3.8e-05,3e-05,-0.000137,1.3e-05,5e-06,-0.00029,9.4e-05,-1.8e-05,5.5e-05,2.2e-05,5.4e-05,4.5e-05,-2.8e-05,1.3e-05,-1.6e-05,1.5e-05,4.8e-05,-4e-06,-1.7e-05,1.8e-05,-3.1e-05,-1e-05,2.4e-05,-2.4e-05,1.2e-05,-1.2e-05,4e-06,2.7e-05,-1.3e-05,-5e-06,-7e-06,-4e-06,-9e-06,1.8e-05,0,9e-06,-1e-06,1.4e-05,7e-06,5e-06,-6e-06,5.1e-05,-1e-05,1e-05,-1.7e-05,8e-06,-3e-06,6e-06,1.2e-05,-2.2e-05,5e-06,0,1e-06,1.2e-05,2e-06,-4e-06,1e-06,-2e-06,0,7e-06,1e-06,-4e-06,2e-06,-2e-06,-3e-06,-9e-06,0,-1e-06,-3e-06,1.6e-05,-1e-06,-6e-06,-2e-06,-2e-06,-3e-06,-4e-06,-1e-06,6e-06,-2e-06,-2e-06,7e-06,-8e-06,0,8e-06,-1e-06,1.4e-05
-1e-06,2e-06,0,-2e-06,-5e-06,2e-06,0,2.4e-05,-3e-05,-1.5e-05,-1.9e-05,-2e-06,-5e-06,-3e-06,2.1e-05,-1e-06,4e-06,8.5e-05,-2e-06,1.9e-05,1e-06,2.2e-05,-0.000103,-6e-05,-0.000164,0.000115,-2e-06,-0.000129,-3.5e-05,6e-05,-0.000111,0.000125,0.000185,-1.6e-05,7.5e-05,4.3e-05,-8.3e-05,-0.00012,-5.1e-05,-5.5e-05,0.000184,-0.000161,-6e-06,3.6e-05,-6.6e-05,4e-06,-2.5e-05,3e-05,-9e-06,-5.7e-05,-1.7e-05,-1.8e-05,4e-06,-1e-05,1.7e-05,4.1e-05,5e-06,-5e-06,-5e-06,-5e-06,-9e-06,2e-06,-2.1e-05,1.8e-05,9e-06,-1e-06,1e-06,-5e-06,7e-06,2e-06,8e-06,-9e-06,-7e-06,2e-06,-1e-06,-3e-06,-6e-06,-5.1e-05,-7e-06,1.7e-05,7e-06,9e-06,-2.1e-05,-1e-06,-1.8e-05,9e-06,0,0,1e-06,-2e-06,-3e-06,-1e-06,-6e-06,1e-06,-8e-06,-1e-06,-3e-06,-2e-06,-6e-06,5e-06,-9e-06,1e-05,0,-2e-06,-5e-06,4e-06,0,-1e-06,0,-2e-06,-8e-06,-5e-06,-1e-06,0,2e-06,1e-06,-2e-06,0,2e-06,-2e-06,-2.4e-05
-1e-06,-3e-06,0,-4e-06,-6e-06,-1e-06,0,-3.4e-05,6e-06,-2e-05,2.2e-05,-2e-06,0,7e-06,-1.5e-05,-1e-06,-1.4e-05,-2.9e-05,-3e-06,-3.3e-05,2.9e-05,3e-06,4.2e-05,-2.9e-05,8.9e-05,-0.000121,3.3e-05,7.5e-05,2.5e-05,6.1e-05,-9e-06,-6e-06,8e-05,9.1e-05,-1.1e-05,-8.6e-05,1.8e-05,0.000122,0.000105,9.8e-05,-0.000121,0.000112,5e-05,6e-06,-3.3e-05,2.7e-05,2e-05,-1e-06,6e-06,4.2e-05,1.4e-05,-1e-06,-1.8e-05,-1e-05,4e-06,-2.1e-05,0,1.7e-05,1e-05,-6e-06,3e-06,-8e-06,1.9e-05,1.1e-05,-1e-05,-3e-06,1e-06,-4e-06,7e-06,2e-06,9e-06,-3e-06,0,3e-06,-6e-06,-4e-06,-1.2e-05,-1.8e-05,-5e-06,-2.9e-05,3e-06,-1.3e-05,1.9e-05,0,-7e-06,-7e-06,-1e-06,-1e-06,-9e-06,-5e-06,-1e-06,0,-6e-06,-3e-06,0,-1e-06,1e-06,-1e-06,0,-4e-06,-8e-06,1.7e-05,1e-06,-3e-06,6e-06,-2e-06,-5e-06,2e-06,-5e-06,3e-06,-3e-06,-1e-06,-2e-06,2e-06,-1e-06,-3e-06,0,-2e-06,-4e-06,-1e-06,-9e-06
-1e-06,-4e-06,0,-2e-06,-5e-06,0,0,-2.9e-05,-2e-05,1.1e-05,-1.3e-05,1.1e-05,1e-06,-7e-06,-2e-06,1e-06,-3e-06,-1.9e-05,-8e-06,2e-06,-1.2e-05,-5e-06,0.00019,-3.3e-05,4.1e-05,9.3e-05,3e-06,4e-06,-4e-06,4.5e-05,-1.9e-05,7.2e-05,-7.2e-05,-0.000172,2.1e-05,-6.6e-05,3.2e-05,5.9e-05,9.2e-05,-3.8e-05,2.8e-05,-5.9e-05,-1.8e-05,-2.4e-05,-4.3e-05,3.1e-05,3e-06,3e-06,-6e-06,-9e-06,-1.8e-05,1e-05,-3e-06,-4e-06,-5e-06,2.5e-05,-2e-06,1.6e-05,1.8e-05,-8e-06,0,0,-1.1e-05,-1.6e-05,0,-7e-06,-1e-06,-1e-06,-5e-06,-1e-06,4e-06,3e-06,-1.4e-05,-2e-06,3e-06,6e-06,-1.6e-05,3e-06,4e-06,3.6e-05,-9e-06,3e-06,-4e-06,1e-05,1.2e-05,-2e-06,2e-06,-1e-06,-7e-06,5e-06,-4e-06,-2e-06,-3e-06,-1e-06,4e-06,-2e-06,-1e-06,2e-06,-1e-06,0,-1e-05,1.9e-05,0,-2e-06,-6e-06,-2e-06,-1e-06,-3e-06,-3e-06,-4e-06,9e-06,-1e-06,-3e-06,-1e-06,-1e-06,2e-06,-7e-06,-1e-06,-1e-06,0,1.5e-05
0,-1e-06,0,-3e-06,0,1e-06,0,5.2e-05,-2e-06,1.8e-05,8e-06,-7e-06,-3e-06,1e-06,2.2e-05,-2e-06,3.6e-05,2.7e-05,-6e-06,-2.1e-05,6e-06,1.1e-05,5.5e-05,0,5e-06,-4.8e-05,2e-05,-5.5e-05,-7.5e-05,7e-06,-0.000116,-6.2e-05,-0.000205,9.3e-05,-2.4e-05,-4.3e-05,-6.3e-05,-4.8e-05,-9.1e-05,-2e-05,5.7e-05,2.5e-05,-2.1e-05,-5.5e-05,2.3e-05,-4.3e-05,-5.5e-05,-2.3e-05,2e-06,3e-06,8e-06,-1.5e-05,1e-06,1e-05,-5e-06,-1.3e-05,0,2.3e-05,3e-06,1e-06,1e-05,2e-06,-1e-05,-8e-06,2e-06,-1e-06,1e-06,-4e-06,-9e-06,-3e-06,0,1e-06,9e-06,-4e-06,4e-06,-1e-06,-3e-05,4e-06,3e-06,3e-06,-5e-06,1.2e-05,-1.3e-05,-1.9e-05,2.2e-05,-8e-06,-3e-06,-3e-06,2e-06,1e-06,-3e-06,-1e-06,-2e-06,-1e-06,-4e-06,0,-1e-06,1e-06,2e-06,2e-06,-9e-06,1.6e-05,0,-1e-06,-6e-06,3e-06,-5e-06,1e-06,-4e-06,3e-06,5e-06,-4e-06,3e-06,1e-06,-1e-06,0,-3e-06,1e-06,-1e-06,0,1.9e-05
1e-06,1e-06,0,-2e-06,0,-1e-06,0,-1.5e-05,3.1e-05,-1e-05,-1e-05,0,2e-06,0,6e-06,0,-2.1e-05,-5e-06,-6e-06,-6e-06,2.4e-05,-1.3e-05,-0.000122,1.5e-05,3.3e-05,4e-06,-2.1e-05,5.4e-05,6.3e-05,-2e-05,-4.4e-05,7.6e-05,-0.000205,-1e-04,-3.2e-05,0.000103,1.6e-05,5.3e-05,-4.5e-05,-9e-06,-0.000105,7.5e-05,-6e-06,-8e-06,4.2e-05,-3.2e-05,5.2e-05,9e-06,-6e-06,2.5e-05,6e-06,1.4e-05,-1e-06,6e-06,1e-06,1e-06,0,1e-06,-7e-06,1e-06,2e-06,-1e-06,8e-06,7e-06,-3e-06,-3e-06,1e-06,-5e-06,-8e-06,-4e-06,-4e-06,8e-06,-4e-06,1e-06,-2e-06,-1e-06,-5.3e-05,2.9e-05,3e-06,-2.8e-05,-1.2e-05,-1.2e-05,1.6e-05,8e-06,1.2e-05,6e-06,1e-06,-3e-06,-3e-06,-1e-06,-1e-06,1e-06,3e-06,1e-06,1e-06,1e-06,2e-06,-2e-06,-4e-06,-3e-06,-8e-06,9e-06,-1e-06,-1e-06,9e-06,-2e-06,0,1e-06,-4e-06,-1e-06,-2e-06,-1e-06,1e-06,-2e-06,1e-06,-4e-06,4e-06,-1e-06,-2e-06,-1e-06,-2.3e-05
0,2e-06,0,-2e-06,0,1e-06,0,-2.2e-05,-1.9e-05,-9e-06,1.5e-05,-5e-06,-2e-06,-2e-06,-2.7e-05,0,3e-05,-1.3e-05,-5e-06,-6e-06,-3.5e-05,-3e-06,-0.000163,1.1e-05,-3.8e-05,-2.6e-05,-7e-06,-4.9e-05,5.2e-05,-4e-05,-3.9e-05,-2e-06,0.000111,3.7e-05,-4.5e-05,3.6e-05,5.3e-05,1.9e-05,1e-05,2e-06,0.000138,-0.000139,1.9e-05,1.9e-05,2e-05,1.7e-05,-7e-05,1.3e-05,-1e-06,-2.3e-05,-2e-06,-8e-06,-1e-06,-1.3e-05,6e-06,-3e-06,2e-06,-1e-05,-7e-06,7e-06,2e-06,-2e-06,-2e-06,5e-06,5e-06,-6e-06,2e-06,-2e-06,-8e-06,-2e-06,-3e-06,-2e-06,8e-06,3e-06,-4e-06,-4e-06,-5.3e-05,3.1e-05,-2e-06,-7e-06,4e-06,4e-06,-1.4e-05,4e-06,3e-06,0,0,-3e-06,-3e-06,1e-06,-4e-06,-1e-06,3e-06,-2e-06,-3e-06,2e-06,-1e-06,1e-06,-2e-06,2e-06,-7e-06,0,-1e-06,-1e-06,3e-06,-1e-06,-2e-06,-2e-06,-2e-06,-3e-06,-3e-06,-2e-06,1e-06,1e-06,-1e-06,1e-06,3e-06,-2e-06,3e-06,-1e-06,3e-06
0,1e-06,0,-3e-06,0,-1e-06,0,1.7e-05,-7e-06,-5e-06,-1.4e-05,1e-06,0,4e-06,-4e-06,-1e-06,-4.9e-05,1e-05,-5e-06,-1.8e-05,4.5e-05,7e-06,-0.000152,0.000129,-1.7e-05,5.4e-05,4e-06,5e-05,-9.9e-05,-4.2e-05,-2.2e-05,-2e-06,9.8e-05,6e-05,-7e-05,7.1e-05,-5e-05,-2e-05,4.2e-05,1.7e-05,-7.5e-05,1.9e-05,-1.1e-05,-5.3e-05,1e-06,3e-06,4.2e-05,-7e-06,-2e-06,-8e-06,5e-06,7e-06,3e-06,-2e-05,-1e-06,1e-06,2e-06,-9e-06,-1e-06,-1e-06,-1e-06,2e-06,-1.2e-05,6e-06,-3e-06,-1e-06,-3e-06,-2e-06,-2e-06,0,-4e-06,0,0,-1e-06,3e-06,3e-06,-3.6e-05,0,-4e-06,7e-06,0,6e-06,8e-06,-5e-06,1e-06,-8e-06,1e-06,-2e-06,9e-06,-3e-06,-1e-06,2e-06,3e-06,-1e-06,1e-06,-1e-06,1e-06,1e-06,0,1e-06,-9e-06,-9e-06,0,-1e-06,-1.2e-05,2e-06,-1e-06,1e-06,1e-06,5e-06,-2e-06,-1e-06,-1e-06,0,0,3e-06,-3e-06,-1e-06,3e-06,0,3.5e-05
-1e-06,-2e-06,0,-3e-06,2e-06,1e-06,0,-1.2e-05,2.8e-05,-4e-06,1e-05,8e-06,0,-4e-06,1.2e-05,2e-06,3e-05,8e-06,-5e-06,-1e-06,-4.7e-05,-5e-06,-3e-06,-1.8e-05,1.1e-05,-4.9e-05,-4e-05,-6e-06,5.9e-05,-2e-05,-5.6e-05,-3.2e-05,2.7e-05,-6.5e-05,-3.2e-05,-1.9e-05,-6e-06,-1.4e-05,4e-05,7e-06,9.1e-05,-1.6e-05,5e-06,-1e-06,-3.2e-05,1.6e-05,-2.8e-05,-1.9e-05,-2e-06,1e-06,-1.7e-05,-1e-06,3e-06,-8e-06,1e-06,3e-06,-2e-06,-1.5e-05,-1e-05,-2e-06,-5e-06,2e-06,3e-05,-1.2e-05,2e-06,-2e-06,-1e-06,-4e-06,0,1e-06,-6e-06,-1e-06,-4e-06,-1e-06,1e-06,0,-3.3e-05,-2.3e-05,-3e-06,6e-06,7e-06,-5e-06,-1e-06,8e-06,-6e-06,6e-06,-2e-06,-3e-06,7e-06,0,-2e-06,0,1e-06,1e-06,3e-06,-1e-06,0,-1e-06,-1e-06,-2e-06,-7e-06,-1.4e-05,1e-06,-1e-06,4e-06,-1e-06,-2e-06,0,3e-06,-4e-06,-2e-06,0,-2e-06,0,-1e-06,-1e-06,0,-1e-06,-2e-06,0,-2.7e-05
0,-2e-06,0,-2e-06,3e-06,-1e-06,0,2.3e-05,-1.3e-05,5e-06,-1.2e-05,0,-2e-06,-1e-06,-6e-06,-1e-06,-2.6e-05,-2.4e-05,-3e-06,-2e-05,1.4e-05,5e-06,8e-06,6.8e-05,-3.5e-05,1.4e-05,2.5e-05,-1.3e-05,-1.2e-05,4e-06,-6.8e-05,5.3e-05,-8e-06,0.000112,-5.7e-05,-6.2e-05,3.8e-05,-5.2e-05,-3.9e-05,-3.2e-05,-5.8e-05,-3.3e-05,1.1e-05,6.8e-05,-4e-06,2.2e-05,9e-06,2.3e-05,0,-1e-06,5e-06,-9e-06,-7e-06,8e-06,-3e-06,-5e-06,2e-06,-4e-06,1.4e-05,-4e-06,0,0,-1.8e-05,-5e-06,-1e-06,-2e-06,2e-06,-4e-06,6e-06,1e-06,-5e-06,-5e-06,-5e-06,0,0,1e-06,-1.6e-05,-1.3e-05,2e-06,-3e-06,1e-06,-1e-06,-3e-06,-9e-06,-7e-06,-2e-06,3e-06,-2e-06,-5e-06,1e-06,-2e-06,0,0,-2e-06,-2e-06,0,-1e-06,-1e-06,0,2e-06,-9e-06,-1.6e-05,1e-06,0,8e-06,-1e-06,-2e-06,-1e-06,4e-06,0,2e-06,-1e-06,0,1e-06,2e-06,-2e-06,3e-06,0,-3e-06,0,-1.9e-05
0,-2e-06,0,-2e-06,2e-06,0,0,4e-06,-8e-06,1.3e-05,1.9e-05,-6e-06,1e-06,3e-06,-1.3e-05,0,1.9e-05,2.4e-05,-3e-06,5e-06,8e-06,2e-06,2.8e-05,-5e-06,3e-05,-4e-06,-2.9e-05,-3.4e-05,-6e-06,1.5e-05,-1.9e-05,-1.1e-05,-3.6e-05,-0.000104,-1e-06,1.7e-05,-3.3e-05,3.8e-05,-8.7e-05,2e-06,4.7e-05,0.000123,-3.6e-05,1.1e-05,-1.2e-05,-1.2e-05,6e-06,1e-05,0,7e-06,3e-06,1e-05,-4e-06,3e-06,3e-06,4e-06,-1e-06,-1.5e-05,0,-1e-06,-5e-06,2e-06,-6e-06,1.1e-05,1e-06,-6e-06,-1e-06,-3e-06,6e-06,0,-2e-06,1e-06,1e-06,-1e-06,0,-1e-06,-1.3e-05,2e-06,4e-06,-5e-06,-2e-06,0,7e-06,-3e-06,-9e-06,-2e-06,-3e-06,-2e-06,-5e-06,0,0,-1e-06,-2e-06,0,2e-06,-1e-06,0,1e-06,-2e-06,-1e-06,-6e-06,-1.4e-05,0,1e-06,-8e-06,1e-06,-2e-06,1e-06,2e-06,2e-06,1e-06,1e-06,4e-06,0,0,2e-06,-3e-06,4e-06,0,0,3.7e-05
1e-06,1e-06,0,-3e-06,1e-06,0,0,-3.7e-05,1e-06,1e-06,-1.8e-05,-6e-06,-2e-06,-3e-06,5e-06,3e-06,-1.8e-05,-7e-06,-3e-06,-2.3e-05,-1.5e-05,-6e-06,-1.3e-05,6.9e-05,5.2e-05,-6e-06,6.7e-05,5.8e-05,3.4e-05,2.5e-05,-6.8e-05,-1.3e-05,0.000122,3.3e-05,-2.6e-05,6e-06,-1.2e-05,-9e-06,-1.7e-05,4.9e-05,-4e-06,-8.2e-05,8e-06,-1.4e-05,1.8e-05,-2.3e-05,2e-06,-2.6e-05,-3e-06,2.7e-05,3e-06,-9e-06,-2e-06,-7e-06,0,-5e-06,2e-06,-1e-05,7e-06,2e-06,2e-06,1e-06,9e-06,6e-06,-1e-06,0,3e-06,-6e-06,6e-06,-1e-06,-1e-06,-5e-06,4e-06,0,-2e-06,1e-06,3e-06,0,-4e-06,1.4e-05,-3e-06,-3e-06,-9e-06,4e-06,-9e-06,5e-06,0,-2e-06,2e-06,1e-06,-3e-06,0,-2e-06,-1e-06,0,0,2e-06,-1e-06,0,-1e-06,-8e-06,-8e-06,-1e-06,1e-06,2e-06,0,-2e-06,-1e-06,1e-06,-3e-06,-1e-06,2e-06,0,0,-1e-06,0,-4e-06,3e-06,0,0,-1.3e-05
-1e-06,2e-06,0,-1e-06,-1e-06,0,0,2.7e-05,-2.1e-05,-1.6e-05,1e-05,8e-06,0,1e-06,6e-06,-1e-06,3.4e-05,-1.1e-05,-4e-06,7e-06,8e-06,2e-06,-8.3e-05,-9.8e-05,-4.1e-05,-1.6e-05,-2.5e-05,-1.8e-05,-1.1e-05,1.1e-05,-4.2e-05,-2.1e-05,7.1e-05,-2.5e-05,4.1e-05,7.7e-05,4.1e-05,-3.8e-05,3.1e-05,-3.2e-05,-2.2e-05,2.2e-05,1.5e-05,2.4e-05,1.3e-05,-1.2e-05,-1e-06,6e-06,3e-06,-4.3e-05,-1e-06,3e-06,0,-1.1e-05,1e-06,4e-06,-2e-06,3e-06,-1.1e-05,2e-06,-1e-06,0,-1.7e-05,-6e-06,0,-2e-06,-2e-06,-7e-06,2e-06,-2e-06,0,1e-06,-2e-06,2e-06,1e-06,-3e-06,2.6e-05,6e-06,-2e-06,-3e-06,-6e-06,4e-06,8e-06,-1e-06,0,-1.1e-05,1e-06,-3e-06,-1e-06,-1e-06,0,0,-2e-06,0,2e-06,1e-06,-2e-06,-1e-06,-2e-06,2e-06,-8e-06,0,-1e-06,1e-06,-5e-06,0,0,1e-06,-1e-06,3e-06,1e-06,1e-06,-2e-06,0,-1e-06,-3e-06,-1e-06,1e-06,1e-06,0,-3.1e-05
1e-06,1e-06,0,-2e-06,-1e-06,1e-06,0,1e-05,1.4e-05,0,-4e-06,-1e-06,0,-1e-06,-8e-06,0,-3.1e-05,2.1e-05,-5e-06,-2.6e-05,9e-06,-1e-06,-1e-05,4.3e-05,-2.6e-05,-1e-05,2e-05,-1.4e-05,-2.5e-05,0,-1.7e-05,3.8e-05,-4e-06,-4e-05,3e-06,-1.8e-05,-2.1e-05,4.5e-05,4.9e-05,-7e-06,3.3e-05,5e-06,-9e-06,4e-06,-2e-06,2e-06,1.4e-05,1.1e-05,-4e-06,9e-06,-7e-06,4e-06,-1e-06,-7e-06,-3e-06,-3e-06,-2e-06,1.3e-05,-2e-06,0,0,1e-06,4e-06,-8e-06,1e-06,-3e-06,-1e-06,-2e-06,-1e-06,-1e-06,1e-06,3e-06,5e-06,-1e-06,2e-06,-1e-06,2.9e-05,1.1e-05,3e-06,-1.4e-05,2e-06,-2e-06,-1e-06,5e-06,4e-06,8e-06,-2e-06,-2e-06,-6e-06,-1e-06,-2e-06,-1e-06,0,0,-2e-06,1e-06,1e-06,2e-06,-2e-06,0,-6e-06,8e-06,0,1e-06,5e-06,1e-06,-3e-06,0,-1e-06,1e-06,2e-06,1e-06,-2e-06,0,1e-06,3e-06,1e-06,0,3e-06,0,3e-05
-1e-06,-1e-06,0,-2e-06,-2e-06,-1e-06,0,-1.8e-05,1e-05,9e-06,7e-06,2e-06,-2e-06,-2e-06,4e-06,1e-06,1e-05,-2.2e-05,-4e-06,1e-05,-2.3e-05,-2e-06,8.8e-05,-0.000103,1.2e-05,4.8e-05,-2.9e-05,4.3e-05,5.2e-05,-1e-05,-6e-05,-2.1e-05,-6.5e-05,9.2e-05,6.9e-05,-1e-06,-2e-05,3.1e-05,-2.2e-05,-2e-06,-9.9e-05,-9.4e-05,2e-06,-3e-05,3e-06,1e-05,-2.3e-05,-1e-06,2e-06,1e-06,7e-06,-8e-06,3e-06,2e-06,2e-06,2e-06,0,-8e-06,0,-1e-06,5e-06,1e-06,7e-06,2e-06,-3e-06,-3e-06,2e-06,0,-6e-06,0,2e-06,-2e-06,-4e-06,-1e-06,-1e-06,0,4.2e-05,-6e-06,0,1.3e-05,0,-4e-06,-8e-06,0,6e-06,4e-06,1e-06,-2e-06,2e-06,1e-06,-2e-06,1e-06,1e-06,-1e-06,-3e-06,-1e-06,0,0,0,-1e-06,-1e-05,1.3e-05,0,1e-06,7e-06,0,1e-06,-1e-06,-2e-06,-4e-06,0,2e-06,1e-06,0,-1e-06,1e-06,1e-06,-2e-06,-1e-06,0,1.2e-05
