0.000103,0.000153,3.9e-05,2.2e-05,7.7e-05,5.5e-05,5.9e-05,3.2e-05,0.000126,2.7e-05,7e-06,2.7e-05,4.9e-05,8e-06,2e-05,4.5e-05,0.000138,4.3e-05,5.1e-05,0.000129,0.000128,9.6e-05,0.000163,0.000118,0.000104,8.9e-05,8.9e-05,0.000105,0.000131,0.000162,7.2e-05,5.2e-05,5.7e-05,6.3e-05,5.9e-05,3.1e-05,3.3e-05,0.000107,8.1e-05,2.8e-05,4.7e-05,5.4e-05,8.3e-05,5.4e-05,9.7e-05,3.9e-05,0.000149,8.8e-05,7.4e-05,8.3e-05,0.000131,6.7e-05,1e-05,5.5e-05,-7e-06,2.1e-05,4.7e-05,2.6e-05,-5e-06,5e-06,-6e-06,3.6e-05,5.3e-05,8e-05,4.5e-05,5.5e-05,1.7e-05,3e-05,9e-05,0.000121,9.9e-05,0.000148,8.2e-05,4.6e-05,-0.000176,-6.1e-05,-2e-05,5.5e-05,4.8e-05,1e-05,6.7e-05,9e-06,-1.4e-05,3.8e-05,3.5e-05,-7e-06,4e-06,3.5e-05,6.4e-05,5.8e-05,1e-05,2.6e-05,5.2e-05,7.7e-05,0.000139,9.1e-05,0.000145,0.000112,4.4e-05,4e-05,6.5e-05,0.000111,0.000141,7.4e-05,5.2e-05,0.000108,4.9e-05,5e-06,-2.2e-05,1.9e-05,4.9e-05,7.2e-05,6.9e-05,0.000106,6.1e-05,7.8e-05,9.1e-05,0.000141,4.2e-05,4.9e-05,4.6e-05
-4.9e-05,-2.9e-05,4e-06,3.9e-05,9.7e-05,-1e-06,-4.1e-05,-8.5e-05,-3.2e-05,-4.8e-05,1.9e-05,-2.1e-05,-5.2e-05,-3.9e-05,-2.4e-05,-7e-05,-4.7e-05,-5.3e-05,-8.3e-05,-0.000105,-3.9e-05,-6.7e-05,-7.1e-05,-0.000177,-0.000138,-2.3e-05,-0.00017,-0.000195,-0.000194,1.3e-05,-7.3e-05,-0.000108,-7.2e-05,-0.000106,-8.5e-05,-2.5e-05,-2.4e-05,-9.5e-05,-2.7e-05,-3.6e-05,2.6e-05,-9.7e-05,-7e-05,-0.000115,-6.8e-05,-3.9e-05,-5.5e-05,-7.4e-05,-5.9e-05,-6.1e-05,-0.000108,-5.9e-05,-0.000101,-8.8e-05,-0.000125,-4.4e-05,-3e-05,-2.2e-05,6.4e-05,-2.7e-05,-3.9e-05,-7.2e-05,-7.8e-05,-9.5e-05,-9.6e-05,-4.7e-05,-6e-05,2.9e-05,2e-06,-6.6e-05,-9e-05,-3.9e-05,-0.000103,-4e-05,-1.8e-05,4.5e-05,-1e-06,-1.7e-05,-7.7e-05,-7e-05,-6.6e-05,-0.000115,-6.7e-05,-3e-05,6.7e-05,3.6e-05,1.3e-05,3.8e-05,3.6e-05,4.6e-05,-5.5e-05,-5.2e-05,-8.7e-05,-0.000158,-6.3e-05,-5.3e-05,-0.000108,-4e-05,-9e-05,-2.1e-05,-7e-06,-4.4e-05,-0.000102,-6.3e-05,-5.2e-05,-5.4e-05,-4e-05,-6e-05,-5.3e-05,-7.2e-05,-4.7e-05,-8e-05,-9.4e-05,-6.3e-05,-5.9e-05,-9.6e-05,-6.8e-05,-3.1e-05,-3.9e-05,-4.5e-05,-7.5e-05
-5.9e-05,-0.000136,-1.6e-05,-3.6e-05,-5.7e-05,-7.3e-05,-2.1e-05,-6.3e-05,-8.7e-05,-6.1e-05,-2.1e-05,-6.1e-05,-0.000104,-5.2e-05,-5.9e-05,-5e-05,-9e-05,-1.6e-05,-4e-05,-0.000165,-0.000106,-0.000141,-0.000133,-0.000121,-3.5e-05,-3.7e-05,-2.6e-05,-0.000137,-0.000192,-9.8e-05,-8.8e-05,-5.8e-05,-7.4e-05,-4.6e-05,-1.7e-05,-1.7e-05,-3.3e-05,-8.9e-05,-7.3e-05,-9.5e-05,-5.8e-05,-1.7e-05,-7.3e-05,-0.00011,-5.8e-05,-4e-05,-9.6e-05,-0.000101,-6.2e-05,-7.8e-05,-0.000114,-7.5e-05,-3.7e-05,-1.9e-05,1e-05,-2.9e-05,-6e-06,-1.2e-05,-2.1e-05,-6.1e-05,-4.6e-05,-5.6e-05,-0.000118,-6.5e-05,-6.1e-05,-8.5e-05,-4.5e-05,-3.8e-05,-9e-06,-0.000109,-0.000119,-0.000147,-9.2e-05,3e-06,-2.3e-05,-0.000116,-6e-05,-5.5e-05,-7.8e-05,-1e-06,-1.8e-05,-1.5e-05,2.9e-05,-2.1e-05,-4.7e-05,-3.9e-05,8e-06,0,-4.5e-05,-5.4e-05,-1.9e-05,-4.5e-05,-4.5e-05,-8.6e-05,-0.000113,-8.8e-05,-7.8e-05,-4.7e-05,6e-06,-6.7e-05,-7.1e-05,-7.5e-05,-0.000144,-4.8e-05,-3.1e-05,-4.8e-05,-6.9e-05,-1.6e-05,-1.1e-05,-0.000112,-6.7e-05,-6.8e-05,-5.2e-05,-9.5e-05,-0.000103,-8.3e-05,-0.000108,-0.000119,-7.5e-05,-1.9e-05,-6e-05
4.2e-05,-9.5e-05,-5.6e-05,-1.2e-05,2.6e-05,-2e-06,3.1e-05,-5e-06,-2.7e-05,-3.8e-05,-1.4e-05,4e-06,-5e-06,-8.9e-05,2.5e-05,4.3e-05,-9.2e-05,-6.8e-05,1e-05,-2.2e-05,2.1e-05,-4.2e-05,-1.3e-05,1.9e-05,6e-06,-0.000106,4e-05,-2.6e-05,5.3e-05,4.2e-05,-1e-05,-4e-05,1.2e-05,1e-05,2.7e-05,3.8e-05,4e-06,-9e-06,-6e-06,3e-05,-1.7e-05,3.7e-05,-7.2e-05,2.8e-05,3.3e-05,3.4e-05,-1.4e-05,-2.4e-05,-4.1e-05,-2.2e-05,3.7e-05,4e-06,1.1e-05,-2e-06,4.8e-05,-1.2e-05,-1.6e-05,-2.3e-05,-9e-06,2e-06,3.1e-05,-5.5e-05,7e-06,-1.9e-05,-1.4e-05,-1.9e-05,8e-06,8e-06,-3.8e-05,-1.5e-05,-1.9e-05,-4.7e-05,-1.6e-05,-1.8e-05,-2.3e-05,-3.4e-05,1.8e-05,-1.6e-05,1.8e-05,-2.4e-05,-1.1e-05,-2.6e-05,-5.8e-05,-2.3e-05,7e-06,-1.3e-05,-4.1e-05,4e-06,1.3e-05,-2.1e-05,4.2e-05,-5e-06,-4.2e-05,3.2e-05,-1.4e-05,-9.2e-05,-1.6e-05,-2e-06,2.8e-05,-3e-05,1e-06,-1.7e-05,-3e-05,-9e-05,-7.6e-05,-2.1e-05,5.3e-05,-1.5e-05,-3.7e-05,2.1e-05,-4e-06,1e-05,-4.5e-05,-6.1e-05,-1.9e-05,-7e-06,-2.8e-05,-4.8e-05,-6.1e-05,-5.2e-05,2e-05
7.7e-05,0,2.5e-05,3.1e-05,-1.5e-05,6e-06,3.5e-05,5.8e-05,3.7e-05,-3e-06,-1.4e-05,-2.7e-05,3.5e-05,7.5e-05,4.5e-05,4.4e-05,-5e-06,3.1e-05,9e-05,4.8e-05,0.000114,3.1e-05,6.8e-05,4.9e-05,4.4e-05,1.3e-05,-1.2e-05,2.7e-05,7.8e-05,3.9e-05,5.7e-05,3.9e-05,5.7e-05,1.9e-05,4.5e-05,2.8e-05,7.6e-05,2.6e-05,5.3e-05,1.9e-05,4.5e-05,5.4e-05,6.7e-05,3.3e-05,1.9e-05,4e-06,-2.1e-05,4.8e-05,2.5e-05,6.4e-05,8.1e-05,5.4e-05,2.3e-05,-5e-06,5e-06,-1.5e-05,3e-05,3e-05,7e-05,1e-05,5e-06,3.5e-05,2.3e-05,0.000106,0.000101,4.2e-05,5.6e-05,2.7e-05,-7.8e-05,-7e-06,5.2e-05,7.4e-05,6.2e-05,3.9e-05,6.7e-05,1.6e-05,2.5e-05,2.4e-05,5.9e-05,5.5e-05,7e-06,5e-05,4.3e-05,3.3e-05,8e-06,-2.2e-05,-2.3e-05,1e-05,-1.4e-05,3.8e-05,2.9e-05,3.1e-05,4.3e-05,7.7e-05,4.2e-05,2.5e-05,3.1e-05,8.1e-05,8.6e-05,1.7e-05,1.9e-05,5e-05,8.1e-05,9.5e-05,6.6e-05,6.7e-05,2.1e-05,-1.6e-05,4e-06,4.1e-05,7.9e-05,6e-05,5.9e-05,6e-06,3.3e-05,7.5e-05,8.4e-05,5.1e-05,5.5e-05,7.3e-05,1.2e-05
-5e-06,3.6e-05,3.7e-05,-3.2e-05,-6.2e-05,-1.7e-05,4e-05,-1.3e-05,2.3e-05,5e-06,-1.9e-05,-1e-05,1.2e-05,3.2e-05,1.8e-05,1.5e-05,4.1e-05,3.7e-05,-9e-06,2e-06,2.3e-05,5e-05,5.3e-05,2.5e-05,1.3e-05,1.5e-05,-5e-06,8.4e-05,4.2e-05,2e-05,3.4e-05,3.1e-05,2.5e-05,2.7e-05,-1.3e-05,1e-05,2.1e-05,3e-06,4.1e-05,3.5e-05,0,1.5e-05,6e-06,4.2e-05,4.7e-05,-2.6e-05,-1.1e-05,1.6e-05,1.1e-05,2e-05,5.2e-05,5e-05,2.5e-05,5.4e-05,-1.3e-05,2.8e-05,-3e-05,8e-06,3.8e-05,0,-1e-06,1.7e-05,5.2e-05,6e-06,6e-06,2.6e-05,-2.9e-05,-1.2e-05,-9e-06,-1.6e-05,3.6e-05,5.4e-05,4.4e-05,8e-06,7e-06,3.8e-05,-3e-06,2e-06,-8e-06,3e-05,3.7e-05,-3e-06,3.4e-05,-5e-06,-3.3e-05,-4.6e-05,2e-06,-1.8e-05,-1.8e-05,4.4e-05,4.4e-05,2.5e-05,3.3e-05,6e-06,3.6e-05,3.5e-05,1.4e-05,4.9e-05,3e-06,2.7e-05,5.2e-05,-3.2e-05,2.6e-05,4.6e-05,-4e-06,-2.4e-05,-7e-06,2e-06,4.4e-05,-2.5e-05,-2.7e-05,2.4e-05,7e-05,8.2e-05,4.6e-05,-1.3e-05,2e-06,-8e-06,6.5e-05,6.1e-05,1.3e-05
-3.3e-05,-7e-06,-7e-06,8e-06,-5.4e-05,-1.7e-05,-3e-05,-1.8e-05,-4.5e-05,6e-06,3.3e-05,0,-1.7e-05,-1.2e-05,-2.9e-05,-4.2e-05,-1.5e-05,-1.3e-05,-4e-05,-3.3e-05,-4.1e-05,-1.3e-05,1.2e-05,-2.6e-05,-8.8e-05,5e-06,-4.4e-05,-9e-06,-2.8e-05,-5e-05,0,1.7e-05,-2.4e-05,-2.2e-05,-3.4e-05,1.9e-05,-6e-06,-3.2e-05,-5.4e-05,-2e-05,-1e-06,-3.5e-05,0,-2.3e-05,3.4e-05,1e-06,-1.6e-05,-5.8e-05,-6.1e-05,-6.4e-05,-1.7e-05,-1.5e-05,-1.5e-05,-5e-06,5e-06,6e-06,-1.2e-05,-3.6e-05,-8e-06,-2.4e-05,-2.6e-05,7e-06,-4.6e-05,-5.2e-05,-1e-05,-5e-06,-3.4e-05,-1.5e-05,-2e-06,7e-06,-3.9e-05,-1.4e-05,-1.5e-05,-1e-05,-5e-06,-3.2e-05,-1e-05,-1.5e-05,1e-06,-1.6e-05,-1.8e-05,-2.2e-05,-1.4e-05,-8e-06,-2.7e-05,1.1e-05,1.9e-05,-1e-05,-4e-05,-2e-06,-2.6e-05,2e-06,-4.4e-05,-3.4e-05,-8.7e-05,0,-4.9e-05,-5.2e-05,-1.2e-05,-3.1e-05,-1e-06,-3.8e-05,-1.7e-05,-1e-06,-1.5e-05,-3.6e-05,-6e-05,-8e-06,-1.3e-05,-1.1e-05,-3.8e-05,-1.8e-05,-1.8e-05,-2.8e-05,1.1e-05,-1.6e-05,-2.1e-05,-6.5e-05,-7e-06,9e-06,-1e-05
-3e-05,-1.1e-05,-2e-05,-3.1e-05,1.4e-05,-4.2e-05,-6e-06,2e-06,-4.5e-05,2e-06,2.4e-05,2.3e-05,-5.1e-05,-4.2e-05,-4.5e-05,-7e-06,-3.4e-05,-1.1e-05,2.2e-05,-2.9e-05,-7.5e-05,-4.5e-05,-7.3e-05,-2.4e-05,-3.1e-05,4.2e-05,-2.9e-05,-4.3e-05,-3.3e-05,-6.2e-05,-2e-06,-5e-05,-2.2e-05,-3.1e-05,-1.5e-05,-4.6e-05,-5e-06,-1.8e-05,-6.9e-05,-1.9e-05,-4.1e-05,-3.2e-05,-3.7e-05,-2e-05,-9.4e-05,-2.5e-05,-2.6e-05,7e-06,-2.1e-05,-2.5e-05,-2e-05,-3.8e-05,-2.8e-05,-4.3e-05,-7e-06,-2.9e-05,-3.8e-05,-2.3e-05,-6e-06,-1.5e-05,-2.1e-05,-3.7e-05,-1.6e-05,-3.6e-05,-3.4e-05,-4.9e-05,-1.7e-05,-2.1e-05,-3.6e-05,6e-06,-7.7e-05,-2.4e-05,-4.1e-05,-2.4e-05,1.2e-05,9e-06,-5e-06,-1.1e-05,-2.3e-05,-3.8e-05,-2.3e-05,8e-06,-1.6e-05,-6e-06,-1.2e-05,-1.4e-05,-3.1e-05,-5.6e-05,-1.9e-05,-5e-06,-3e-06,-3.7e-05,-1.4e-05,-5e-06,-1.4e-05,-1.4e-05,-4.2e-05,-2.4e-05,-3.7e-05,-4.1e-05,-1e-05,-2.9e-05,-3e-05,-3.6e-05,-1.2e-05,8e-06,-1.8e-05,-1.4e-05,1.4e-05,-2e-06,-1.6e-05,-1.7e-05,-2e-05,-3.4e-05,-3.5e-05,-7.7e-05,-1.3e-05,-1.2e-05,-1.5e-05,-2e-05,-5.4e-05
-5e-06,-8e-06,-2.5e-05,-2.1e-05,0,-1.7e-05,6e-06,7e-06,2.4e-05,5e-06,1e-06,-4e-06,-2e-06,-1.7e-05,2e-06,1.6e-05,2e-06,-2.3e-05,-5e-06,8e-06,-6e-06,1.9e-05,3e-06,-7e-06,4.4e-05,-2.4e-05,5e-06,2.5e-05,-2.6e-05,1.2e-05,1.4e-05,-4.1e-05,-1.6e-05,-2.1e-05,1e-06,-3.8e-05,1.6e-05,-5e-06,-8e-06,-2.9e-05,1.2e-05,-1e-05,1.8e-05,-1.4e-05,-8e-06,-2e-06,-1.9e-05,1.1e-05,2.5e-05,-2.9e-05,-2.7e-05,4e-06,-1e-05,-1.5e-05,-1.3e-05,-1.2e-05,2e-06,-5e-06,-3e-05,-4e-06,5.9e-05,4e-05,-2.4e-05,4e-06,1.2e-05,1.1e-05,2.1e-05,1.3e-05,1.8e-05,-7e-06,1.6e-05,-1.4e-05,-2.1e-05,-3e-06,-8e-06,-1.5e-05,3.2e-05,1.7e-05,-1.4e-05,8e-06,2.3e-05,-6e-06,-2e-05,-1.1e-05,2e-05,2.5e-05,-1.4e-05,5e-06,-1.9e-05,-3e-06,-9e-06,-1e-05,-2.7e-05,-3.1e-05,2.3e-05,-5e-06,-2.8e-05,-1e-05,3e-06,1.6e-05,-2.4e-05,7e-06,-2.9e-05,-2.9e-05,-3.4e-05,-2.4e-05,2.4e-05,2.9e-05,5e-06,-1.2e-05,3e-06,-8e-06,3e-06,-3e-06,-3.1e-05,3.3e-05,-5e-06,2.1e-05,-1.2e-05,-3.2e-05,2.2e-05
2.6e-05,2.7e-05,1e-06,2e-06,1.4e-05,1.9e-05,2.4e-05,6e-06,7e-06,0,-9e-06,-2e-06,-1e-06,2.4e-05,1.6e-05,1.1e-05,1.7e-05,0,8e-06,2e-05,-1e-06,3.6e-05,-2.2e-05,1.5e-05,2.8e-05,1.1e-05,2.2e-05,3.3e-05,2.1e-05,5.5e-05,3.4e-05,3.6e-05,8e-06,1.7e-05,4e-06,1.4e-05,-1e-06,8e-06,5e-06,2.5e-05,1.2e-05,1.2e-05,6e-05,4e-06,1.6e-05,-6e-06,3e-05,1e-06,4.3e-05,1e-06,2.4e-05,2.8e-05,2.2e-05,1.3e-05,2.4e-05,2.5e-05,2.1e-05,-5e-06,-6e-06,0,9e-06,5e-06,-7e-06,1e-06,2.1e-05,1.6e-05,3e-06,6e-06,5e-06,-1e-06,9e-06,1.6e-05,4e-06,4.7e-05,5e-06,-2e-06,-4e-06,5e-06,9e-06,8e-06,-2e-06,-1e-06,1.3e-05,1.7e-05,6e-06,0,-1.9e-05,1e-05,4e-06,-7e-06,1.1e-05,2e-05,9e-06,2.6e-05,2.3e-05,7e-06,1.6e-05,2e-06,2.6e-05,3e-06,9e-06,1.4e-05,1.6e-05,1e-06,5e-05,2e-05,1.5e-05,2.4e-05,-1.6e-05,2.1e-05,4e-06,2.6e-05,1.6e-05,-4e-06,1e-05,2.8e-05,2.2e-05,4.3e-05,2e-06,-2e-06,-2e-06
6e-06,2.4e-05,1.2e-05,1.7e-05,-1e-05,-1.9e-05,-2e-06,8e-06,7e-06,7e-06,-1.4e-05,4e-06,-5e-06,-1.9e-05,3e-06,-1.7e-05,9e-06,8e-06,4e-06,-1.5e-05,1.1e-05,3.4e-05,2.9e-05,1.3e-05,-1.1e-05,1.7e-05,3.1e-05,-2.8e-05,-1e-06,1.5e-05,-3e-06,-3e-06,8e-06,2.5e-05,7e-06,1e-05,1e-05,3e-06,-3e-06,8e-06,2.1e-05,3e-06,-8e-06,7e-06,1.2e-05,7e-06,1.5e-05,1.4e-05,3e-05,7e-06,-1.1e-05,1.5e-05,5e-06,1.1e-05,-1e-05,6e-06,2e-06,-1.5e-05,5e-06,7e-06,6e-06,0,2e-05,1.2e-05,-3e-06,1.8e-05,2.1e-05,-1e-06,2.1e-05,6e-06,2e-05,6e-06,3e-06,0,9e-06,1e-06,1.4e-05,-1.3e-05,-1.3e-05,-4e-06,2.3e-05,1.1e-05,1e-05,5e-06,-6e-06,4e-06,-5e-06,-3e-06,-2e-05,-1.4e-05,-1e-06,-7e-06,-3e-06,1e-06,-1e-05,3.3e-05,3.3e-05,-8e-06,-4e-06,4e-06,-3e-06,1e-06,-1.4e-05,1e-06,4.9e-05,-2e-06,-1.3e-05,2e-06,7e-06,9e-06,-3e-06,-4e-06,3e-06,1.9e-05,-4e-06,6e-06,-7e-06,1.1e-05,-9e-06,2.2e-05,6e-06
-2.1e-05,-1.1e-05,3e-06,1.1e-05,5e-06,-6e-06,-8e-06,-1.2e-05,-5e-06,-8e-06,-1.3e-05,-7e-06,7e-06,1e-06,-4e-06,4e-06,-9e-06,7e-06,-3.6e-05,1e-06,3e-06,-9e-06,3e-06,0,-8e-06,-1e-06,-2e-06,0,3e-06,-3.3e-05,-2.3e-05,0,-1e-06,-3.3e-05,-1.2e-05,-2e-05,-1e-06,-1.6e-05,5e-06,-9e-06,-2e-06,0,-1.2e-05,-1.9e-05,-1e-06,-7e-06,-1.5e-05,1.6e-05,-4e-05,-1.5e-05,-1.7e-05,1e-06,-1e-05,1e-06,-4e-06,-1e-05,-5e-06,-8e-06,-1.4e-05,-2e-06,-1.1e-05,-1e-05,3e-06,-1e-05,-1.7e-05,-7e-06,-1.7e-05,0,-1.8e-05,-4e-06,1.7e-05,-3e-06,-3e-06,-1.5e-05,-6e-06,2e-06,-2.3e-05,-2.2e-05,-2e-06,-5e-06,-7e-06,-1.2e-05,-4e-06,2e-06,-5e-06,-1e-06,5e-06,-2e-06,-9e-06,-1.3e-05,-2e-06,-8e-06,9e-06,-7e-06,-1.1e-05,-1.8e-05,1e-05,-6e-06,-1.7e-05,-1e-05,-1e-06,-1.2e-05,-1.8e-05,-8e-06,1e-05,-7e-06,1.2e-05,-1.1e-05,2e-06,-8e-06,2e-06,-2.4e-05,-1e-06,4e-06,-1e-06,-1.1e-05,1e-06,-1.5e-05,-1.7e-05,3e-06,1.3e-05
-8e-06,-1e-06,6e-06,5e-06,-1.3e-05,4e-06,-2.3e-05,4e-06,2e-06,1.8e-05,1e-06,-3e-06,1.4e-05,-9e-06,-7e-06,-1.9e-05,2e-06,-1e-05,-1e-05,7e-06,1.2e-05,-1e-05,-6e-06,3e-06,-3e-06,-7e-06,-2e-05,-1.7e-05,3e-06,-3e-06,-1.3e-05,-9e-06,-2e-06,-2e-06,-3e-06,-9e-06,-1.1e-05,8e-06,2e-06,-6e-06,2e-06,0,1.3e-05,0,-3e-06,1e-06,-6e-06,-9e-06,-2e-06,0,-5e-06,3e-06,-8e-06,-5e-06,1e-06,-6e-06,4e-06,8e-06,-5e-06,-2e-06,-8e-06,-4e-06,-4e-06,-3e-06,-1e-06,1e-06,-5e-06,3e-06,-3e-06,-3e-06,1.8e-05,-1.2e-05,-1e-06,-1.8e-05,-1.7e-05,0,1e-05,2e-06,0,0,-7e-06,2e-06,4e-06,-8e-06,-3e-06,5e-06,-2e-06,-4e-06,7e-06,-1.2e-05,-2e-06,-1e-06,-2e-06,6e-06,4e-06,-6e-06,-2e-06,-4e-06,3e-06,0,-8e-06,-4e-06,-1e-06,-1e-06,-2e-05,-2e-06,-3e-06,-8e-06,-3e-06,8e-06,2e-06,6e-06,0,-4e-06,0,-7e-06,-1.1e-05,-3e-06,-8e-06,-6e-06,-1.6e-05
-7e-06,9e-06,-4e-06,-8e-06,8e-06,6e-06,-1.9e-05,0,7e-06,-1.2e-05,0,-3e-06,0,-2e-06,-1e-06,8e-06,0,3e-06,-5e-06,-1e-06,6e-06,-2e-06,6e-06,-9e-06,-7e-06,-1e-05,-6e-06,-8e-06,9e-06,-7e-06,2e-06,7e-06,-5e-06,0,-1e-06,1e-06,-1.5e-05,-3e-06,8e-06,1e-06,-4e-06,7e-06,-6e-06,6e-06,-8e-06,9e-06,6e-06,5e-06,-3e-06,1.1e-05,-1.1e-05,1e-06,3e-06,1e-06,-3e-06,6e-06,-9e-06,-4e-06,-6e-06,1e-06,0,-2e-06,3e-06,-5e-06,-7e-06,1e-06,3e-06,-5e-06,3e-06,0,4e-06,-1.7e-05,-1e-06,-1.3e-05,-1e-06,-6e-06,-1e-05,4e-06,4e-06,-1e-06,-6e-06,-3e-06,7e-06,-1e-06,5e-06,3e-06,7e-06,-6e-06,-4e-06,-1e-06,-1e-06,-8e-06,-7e-06,3e-06,-1e-05,6e-06,-1.3e-05,-9e-06,-5e-06,-1e-06,-1e-06,-1.2e-05,-2e-06,-1e-06,-7e-06,5e-06,-2e-06,-3e-06,-1.4e-05,-7e-06,-5e-06,-5e-06,-4e-06,2e-06,-5e-06,-1.1e-05,4e-06,-5e-06,2e-06,0,-3e-06
1e-06,-2e-06,8e-06,-1e-06,7e-06,0,-8e-06,3e-06,-4e-06,0,0,5e-06,0,-9e-06,-6e-06,4e-06,1e-05,5e-06,8e-06,5e-06,-2e-06,-1e-06,8e-06,1e-06,1e-06,-1.2e-05,-6e-06,2e-06,2e-06,-2e-06,-2e-06,1e-06,4e-06,-2e-06,2e-06,6e-06,5e-06,-1e-06,-9e-06,-1e-06,4e-06,-2e-06,-9e-06,2e-06,8e-06,-3e-06,2e-06,5e-06,-4e-06,6e-06,2e-06,-9e-06,-3e-06,1e-06,-1e-06,4e-06,2e-06,3e-06,1e-06,-1e-06,-6e-06,7e-06,7e-06,-2e-06,-3e-06,2e-06,-1e-06,0,8e-06,1e-06,-1.4e-05,9e-06,0,1e-06,1.4e-05,3e-06,8e-06,0,3e-06,-6e-06,8e-06,0,-1e-06,-2e-06,-2e-06,-4e-06,0,-3e-06,1.1e-05,-2e-06,-2e-06,5e-06,6e-06,2e-06,-1e-06,8e-06,-3e-06,6e-06,0,-5e-06,6e-06,2e-06,7e-06,-3e-06,-3e-06,1.1e-05,2e-06,1.1e-05,1.3e-05,-6e-06,4e-06,6e-06,2e-06,2e-06,2e-06,3e-06,-1e-06,2e-06,4e-06,3e-06,2e-06
-1e-06,-1e-06,1e-06,0,1e-06,-2e-06,-2e-06,1e-06,3e-06,1e-06,-3e-06,0,-3e-06,4e-06,-2e-06,1e-06,-5e-06,0,1.2e-05,3e-06,-4e-06,-7e-06,5e-06,-4e-06,7e-06,7e-06,2e-06,-4e-06,-2e-06,5e-06,-3e-06,1e-06,-4e-06,2e-06,3e-06,1e-06,-2e-06,2e-06,-1e-06,-4e-06,-5e-06,-2e-06,5e-06,2e-06,-1e-05,-3e-06,1e-06,3e-06,-2e-06,-2e-06,0,-1e-06,-2e-06,1e-06,-1e-06,-4e-06,3e-06,3e-06,3e-06,-1e-06,3e-06,-2e-06,-9e-06,4e-06,1e-06,1e-06,3e-06,1e-06,0,1e-06,-4e-06,-8e-06,-2e-06,5e-06,-1e-06,0,-1e-06,7e-06,-1e-06,-2e-06,3e-06,-1e-06,-4e-06,1e-06,4e-06,1e-06,1e-06,-1e-06,-7e-06,-3e-06,-4e-06,-4e-06,1e-06,7e-06,9e-06,-8e-06,-2e-06,7e-06,0,3e-06,-3e-06,4e-06,4e-06,0,2e-06,3e-06,1e-06,-2e-06,8e-06,6e-06,2e-06,-7e-06,-2e-06,4e-06,-1e-06,3e-06,1e-06,-2e-06,7e-06,-5e-06,-5e-06
5e-06,4e-06,-5e-06,-1e-06,-2e-06,-2e-06,4e-06,2e-06,4e-06,-1e-06,-1e-06,-1e-06,-1e-06,1e-06,1e-06,3e-06,1e-06,-4e-06,1.1e-05,-4e-06,-5e-06,-1e-06,-1e-06,1e-06,5e-06,4e-06,3e-06,8e-06,-1e-06,9e-06,1e-06,-6e-06,0,0,0,-4e-06,-5e-06,1e-06,1e-06,2e-06,5e-06,-4e-06,-2e-06,-1e-06,1e-06,-1e-06,2e-06,-7e-06,1e-05,-6e-06,2e-06,-5e-06,-1e-06,-1e-06,-1e-06,0,-2e-06,-1e-06,-1e-06,0,-4e-06,1e-06,3e-06,2e-06,1e-06,-1e-06,1e-06,-1e-06,-7e-06,0,2e-06,-1e-06,-2e-06,4e-06,-3e-06,1e-06,2e-06,-5e-06,-1e-06,2e-06,-5e-06,0,-2e-06,-1e-06,0,2e-06,-2e-06,5e-06,-1e-06,4e-06,-1e-06,-1e-06,-5e-06,4e-06,0,1e-06,-2e-06,4e-06,3e-06,0,2e-06,1e-06,0,-2e-06,-2e-06,2e-06,3e-06,-1e-06,-3e-06,0,-3e-06,6e-06,-1e-06,-4e-06,-1e-06,5e-06,-3e-06,5e-06,5e-06,-7e-06,4e-06
2e-06,-1e-06,0,0,0,0,6e-06,-2e-06,0,1e-06,2e-06,0,-2e-06,2e-06,2e-06,-2e-06,4e-06,1e-06,0,1e-06,-1e-06,2e-06,-3e-06,0,-2e-06,-7e-06,3e-06,-1e-06,-2e-06,6e-06,1e-06,3e-06,1e-06,3e-06,1e-06,1e-06,2e-06,-2e-06,-5e-06,1e-06,-1e-06,-2e-06,1e-06,3e-06,2e-06,-1e-06,0,6e-06,0,-4e-06,4e-06,1e-06,2e-06,1e-06,3e-06,2e-06,2e-06,-3e-06,-2e-06,0,-4e-06,1e-06,-3e-06,3e-06,2e-06,2e-06,2e-06,1e-06,1e-06,0,-3e-06,5e-06,-1e-06,5e-06,1e-06,-2e-06,-4e-06,1e-06,0,1e-06,4e-06,0,2e-06,2e-06,-6e-06,-2e-06,1e-06,1e-06,-1e-06,3e-06,1e-06,2e-06,-1e-06,0,-3e-06,3e-06,0,0,3e-06,-2e-06,0,-1e-06,2e-06,1e-06,2e-06,-2e-06,-2e-06,-2e-06,-1e-06,-2e-06,2e-06,-1e-06,0,3e-06,1e-06,3e-06,6e-06,-1e-06,3e-06,-3e-06,-2e-06
-1e-06,-1e-06,4e-06,2e-06,-2e-06,-2e-06,5e-06,0,-1e-06,-1e-06,4e-06,-1e-06,-1e-06,0,1e-06,1e-06,0,3e-06,-1e-06,0,0,-1e-06,3e-06,1e-06,-3e-06,-2e-06,0,-1e-06,-2e-06,-5e-06,0,0,2e-06,1e-06,-1e-06,2e-06,4e-06,2e-06,2e-06,3e-06,0,-1e-06,-6e-06,-2e-06,3e-06,2e-06,1e-06,0,-4e-06,-5e-06,4e-06,-2e-06,1e-06,3e-06,0,2e-06,0,-2e-06,3e-06,0,-7e-06,-1e-06,1e-06,-1e-06,2e-06,0,-5e-06,0,2e-06,0,4e-06,2e-06,-1e-06,-3e-06,1e-06,2e-06,0,0,-2e-06,0,-2e-06,0,-1e-06,0,2e-06,3e-06,-3e-06,-2e-06,-3e-06,0,0,-1e-06,2e-06,3e-06,0,3e-06,5e-06,1e-06,1e-06,0,2e-06,0,1e-06,-1e-06,3e-06,-1e-06,1e-06,-3e-06,2e-06,4e-06,1e-06,1e-06,0,3e-06,0,-3e-06,-4e-06,-4e-06,0,2e-06,2e-06
-2e-06,0,0,1e-06,1e-06,-2e-06,1e-06,0,1e-06,0,1e-06,3e-06,3e-06,-1e-06,-1e-06,-3e-06,-2e-06,-1e-06,0,-2e-06,1e-06,-4e-06,-3e-06,-1e-06,-1e-06,4e-06,-4e-06,3e-06,-1e-06,-7e-06,0,-1e-06,-1e-06,-3e-06,-2e-06,-4e-06,-2e-06,-2e-06,1e-06,-2e-06,-1e-06,0,-3e-06,0,1e-06,0,-1e-06,-2e-06,-4e-06,-3e-06,-1e-06,0,-2e-06,-1e-06,0,-3e-06,-2e-06,-1e-06,0,0,-2e-06,0,1e-06,1e-06,0,-3e-06,-1e-06,0,-1e-06,0,4e-06,-2e-06,-1e-06,-6e-06,-2e-06,-1e-06,-1e-06,-1e-06,-2e-06,1e-06,-1e-06,1e-06,0,0,1e-06,-2e-06,0,-1e-06,1e-06,1e-06,2e-06,-1e-06,-1e-06,-2e-06,2e-06,-4e-06,1e-06,-3e-06,-2e-06,-2e-06,-1e-06,-2e-06,-4e-06,0,-1e-06,-1e-06,0,-3e-06,1e-06,-1e-06,-3e-06,-3e-06,-1e-06,0,0,0,1e-06,-1e-06,-1e-06,1e-06,1e-06
-2e-06,-2e-06,-3e-06,0,4e-06,2e-06,-1e-06,0,1e-06,0,-1e-06,-1e-06,2e-06,1e-06,-1e-06,0,0,0,-5e-06,2e-06,5e-06,-3e-06,-2e-06,1e-06,-2e-06,-1e-06,-3e-06,0,0,-1e-06,3e-06,-2e-06,0,-2e-06,0,-3e-06,1e-06,1e-06,3e-06,-1e-06,0,2e-06,4e-06,-2e-06,-2e-06,0,-1e-06,-1e-06,0,0,1e-06,0,-1e-06,0,1e-06,-1e-06,0,-1e-06,-2e-06,0,1e-06,0,0,-3e-06,1e-06,0,-1e-06,0,0,0,3e-06,3e-06,-1e-06,-3e-06,-1e-06,0,1e-06,1e-06,1e-06,2e-06,-1e-06,-1e-06,1e-06,-1e-06,-2e-06,0,-1e-06,-1e-06,-2e-06,0,1e-06,0,-2e-06,0,-3e-06,0,-1e-06,-4e-06,0,1e-06,-1e-06,-2e-06,0,0,-8e-06,0,-1e-06,0,-3e-06,-2e-06,0,3e-06,-1e-06,0,0,-3e-06,0,-1e-06,-2e-06,-1e-06,-3e-06
0,2e-06,1e-06,-1e-06,-2e-06,0,0,-1e-06,-1e-06,0,-1e-06,1e-06,0,-3e-06,-1e-06,1e-06,2e-06,0,0,-1e-06,1e-06,1e-06,1e-06,0,1e-06,-1e-06,-3e-06,0,0,2e-06,3e-06,2e-06,0,1e-06,0,1e-06,3e-06,0,-2e-06,1e-06,-1e-06,1e-06,-2e-06,0,1e-06,1e-06,1e-06,3e-06,1e-06,1e-06,-1e-06,-1e-06,0,-1e-06,-1e-06,2e-06,0,-1e-06,0,0,1e-06,1e-06,2e-06,0,0,0,0,0,-1e-06,0,-2e-06,-1e-06,0,3e-06,0,0,1e-06,1e-06,-1e-06,-2e-06,-1e-06,0,3e-06,0,2e-06,1e-06,0,-1e-06,2e-06,-1e-06,1e-06,-1e-06,0,0,0,1e-06,-3e-06,0,-1e-06,-2e-06,0,0,0,0,-5e-06,1e-06,1e-06,2e-06,0,2e-06,1e-06,-1e-06,1e-06,0,-1e-06,0,0,0,-2e-06,2e-06,2e-06
0,-1e-06,2e-06,-1e-06,1e-06,-1e-06,0,0,0,-1e-06,0,-1e-06,1e-06,0,-1e-06,-1e-06,0,1e-06,-1e-06,0,0,0,-1e-06,-1e-06,3e-06,2e-06,1e-06,0,1e-06,0,1e-06,0,-1e-06,0,1e-06,1e-06,0,-1e-06,0,-1e-06,1e-06,0,-5e-06,0,1e-06,-1e-06,1e-06,-4e-06,1e-06,1e-06,-3e-06,0,0,1e-06,-1e-06,1e-06,-1e-06,1e-06,0,0,2e-06,0,-2e-06,0,-1e-06,-1e-06,3e-06,0,3e-06,0,-4e-06,-1e-06,-1e-06,3e-06,1e-06,0,0,-3e-06,1e-06,-2e-06,3e-06,0,-1e-06,0,-1e-06,0,0,0,-2e-06,-2e-06,0,0,0,0,3e-06,2e-06,-1e-06,0,-1e-06,-1e-06,0,0,-2e-06,0,1e-06,1e-06,1e-06,1e-06,-1e-06,-1e-06,-1e-06,-1e-06,0,2e-06,0,2e-06,-1e-06,0,-2e-06,3e-06,-1e-06
1e-06,-2e-06,0,0,0,0,0,0,1e-06,1e-06,1e-06,0,0,-1e-06,0,0,-2e-06,0,-1e-06,1e-06,-1e-06,-1e-06,2e-06,1e-06,1e-06,0,2e-06,0,0,3e-06,0,1e-06,0,0,0,0,-1e-06,1e-06,1e-06,0,0,-1e-06,5e-06,-1e-06,-3e-06,0,0,1e-06,1e-06,-1e-06,0,0,-1e-06,0,0,-1e-06,2e-06,0,0,0,2e-06,-1e-06,2e-06,0,0,-1e-06,1e-06,0,-2e-06,0,-1e-06,1e-06,-1e-06,3e-06,0,-1e-06,-1e-06,1e-06,0,0,-2e-06,-1e-06,-1e-06,0,-1e-06,1e-06,1e-06,1e-06,0,-1e-06,-1e-06,0,-2e-06,1e-06,0,-3e-06,-1e-06,0,1e-06,1e-06,0,0,1e-06,-1e-06,2e-06,0,0,-2e-06,-1e-06,0,0,0,0,-2e-06,0,1e-06,2e-06,1e-06,-1e-06,0,0
0,1e-06,-1e-06,0,-1e-06,0,0,0,0,-1e-06,0,0,0,1e-06,1e-06,1e-06,1e-06,0,-1e-06,-1e-06,-2e-06,1e-06,-1e-06,-1e-06,-1e-06,0,1e-06,0,0,2e-06,0,-1e-06,0,0,0,-1e-06,1e-06,-1e-06,-2e-06,0,1e-06,-1e-06,1e-06,1e-06,1e-06,0,0,1e-06,1e-06,-1e-06,-2e-06,1e-06,0,-1e-06,0,-1e-06,-1e-06,-1e-06,0,0,-1e-06,0,-2e-06,1e-06,-1e-06,0,-1e-06,0,-1e-06,0,-2e-06,-1e-06,-1e-06,-1e-06,-1e-06,0,1e-06,0,0,-1e-06,1e-06,0,-1e-06,0,1e-06,-1e-06,0,1e-06,0,0,0,0,0,1e-06,-2e-06,0,1e-06,0,1e-06,-1e-06,0,0,0,0,0,0,0,-2e-06,0,2e-06,1e-06,-1e-06,0,1e-06,0,0,-1e-06,0,0,-2e-06,1e-06
0,0,0,0,0,-1e-06,-1e-06,0,-1e-06,0,-1e-06,-1e-06,0,-2e-06,0,-1e-06,1e-06,0,0,0,-2e-06,1e-06,1e-06,1e-06,-1e-06,1e-06,0,-1e-06,-1e-06,-3e-06,-1e-06,1e-06,0,0,0,0,-1e-06,0,-1e-06,1e-06,0,-1e-06,-2e-06,0,-1e-06,0,0,-1e-06,-1e-06,-1e-06,0,0,0,1e-06,0,1e-06,0,0,0,0,1e-06,0,1e-06,0,-1e-06,0,-1e-06,0,0,0,-1e-06,0,-1e-06,-2e-06,0,1e-06,-2e-06,0,1e-06,-1e-06,-1e-06,0,0,0,0,0,0,-1e-06,-1e-06,-1e-06,-1e-06,0,0,0,0,0,1e-06,2e-06,0,0,1e-06,-1e-06,0,0,1e-06,0,0,0,0,-1e-06,0,1e-06,0,0,0,1e-06,1e-06,0,1e-06,-1e-06,-1e-06
-1e-06,-1e-06,1e-06,0,2e-06,-1e-06,-2e-06,0,0,0,-1e-06,1e-06,0,0,0,1e-06,0,0,1e-06,0,-1e-06,0,-1e-06,-1e-06,-1e-06,-1e-06,-2e-06,-1e-06,0,-2e-06,-1e-06,0,0,0,0,1e-06,-2e-06,0,0,-1e-06,0,0,1e-06,1e-06,1e-06,0,0,-1e-06,-2e-06,-2e-06,0,1e-06,0,0,0,1e-06,0,0,0,0,1e-06,0,-1e-06,0,0,0,-1e-06,0,1e-06,0,2e-06,1e-06,-1e-06,-2e-06,1e-06,-1e-06,2e-06,1e-06,0,0,0,0,-1e-06,0,1e-06,1e-06,0,-1e-06,0,0,0,0,-1e-06,0,1e-06,2e-06,1e-06,0,0,-1e-06,0,-1e-06,1e-06,0,1e-06,0,0,0,-2e-06,0,0,-2e-06,0,0,0,-3e-06,0,0,1e-06,0,1e-06
0,0,0,0,-1e-06,0,-2e-06,0,1e-06,0,0,-1e-06,0,0,0,0,-1e-06,0,2e-06,-1e-06,1e-06,0,0,0,0,0,-2e-06,0,-1e-06,-1e-06,-1e-06,0,0,-1e-06,0,-1e-06,0,0,2e-06,0,0,0,1e-06,0,0,0,0,1e-06,0,-1e-06,1e-06,0,-1e-06,1e-06,0,-1e-06,0,0,0,0,2e-06,0,0,-1e-06,0,0,0,0,0,0,1e-06,-1e-06,-1e-06,-2e-06,1e-06,0,-1e-06,0,-1e-06,1e-06,1e-06,0,-1e-06,0,0,-1e-06,0,0,-1e-06,1e-06,0,0,-1e-06,0,-1e-06,-2e-06,0,-1e-06,0,0,0,0,0,0,0,0,0,1e-06,0,1e-06,0,1e-06,0,0,0,1e-06,0,0,1e-06,0,0
0,1e-06,-1e-06,0,0,0,-1e-06,0,0,0,1e-06,1e-06,1e-06,0,0,1e-06,0,-1e-06,2e-06,0,1e-06,0,0,0,1e-06,1e-06,-1e-06,-1e-06,0,1e-06,-1e-06,-1e-06,0,0,0,-1e-06,0,0,-1e-06,0,0,1e-06,1e-06,0,-1e-06,0,0,-1e-06,2e-06,-1e-06,1e-06,1e-06,0,-1e-06,0,-1e-06,0,-1e-06,0,0,1e-06,0,0,0,0,0,1e-06,0,-1e-06,0,1e-06,0,-1e-06,2e-06,0,0,1e-06,0,0,1e-06,-1e-06,0,1e-06,0,-1e-06,1e-06,0,0,1e-06,0,1e-06,0,0,-1e-06,0,0,-1e-06,1e-06,0,0,0,0,-1e-06,0,-1e-06,0,0,1e-06,1e-06,-1e-06,0,0,0,-1e-06,0,-1e-06,0,1e-06,1e-06,-1e-06,-1e-06
0,0,0,0,0,0,0,0,0,0,1e-06,0,0,0,0,0,0,0,0,0,1e-06,1e-06,0,0,1e-06,0,0,0,0,2e-06,-1e-06,1e-06,0,0,0,0,-1e-06,0,0,0,0,1e-06,-1e-06,0,1e-06,0,0,-1e-06,0,0,1e-06,0,0,0,0,1e-06,1e-06,0,0,0,-1e-06,0,0,-1e-06,1e-06,0,1e-06,0,0,0,-1e-06,0,0,3e-06,0,0,-1e-06,0,0,-1e-06,1e-06,0,1e-06,0,0,-1e-06,0,0,-2e-06,0,1e-06,0,-1e-06,0,1e-06,0,-1e-06,0,0,-1e-06,0,0,1e-06,0,0,0,0,0,0,0,0,1e-06,0,1e-06,0,0,0,0,0,0,1e-06
0,0,1e-06,0,0,-1e-06,1e-06,0,0,0,0,0,1e-06,0,0,0,0,0,0,0,1e-06,0,0,0,1e-06,0,1e-06,0,0,0,-1e-06,0,0,0,0,1e-06,0,0,1e-06,0,0,0,0,-1e-06,0,0,0,1e-06,0,0,0,0,0,0,0,0,-1e-06,0,0,0,0,0,1e-06,0,0,0,0,0,1e-06,0,-1e-06,0,0,1e-06,0,0,0,-1e-06,0,0,-1e-06,0,0,0,0,0,0,0,1e-06,0,0,0,-1e-06,0,0,1e-06,-1e-06,-1e-06,0,0,0,0,-1e-06,0,2e-06,0,0,0,-1e-06,0,0,0,0,-1e-06,0,1e-06,0,0,0,1e-06,-1e-06
0,0,0,0,0,0,1e-06,0,0,0,-1e-06,0,0,1e-06,0,0,0,0,-1e-06,0,0,0,1e-06,0,-1e-06,0,0,0,0,0,0,0,0,0,0,0,1e-06,0,0,-1e-06,0,0,2e-06,0,-1e-06,0,0,0,0,0,0,-1e-06,0,0,0,-1e-06,1e-06,-1e-06,0,0,-2e-06,0,-1e-06,0,1e-06,0,0,0,0,0,-1e-06,0,0,-1e-06,0,0,-1e-06,0,1e-06,0,1e-06,0,0,0,0,0,0,0,-1e-06,0,0,0,0,0,-1e-06,-2e-06,0,0,0,-1e-06,0,0,0,0,2e-06,0,0,0,1e-06,-1e-06,0,0,0,0,0,0,0,0,0,0,0
0,0,-1e-06,0,0,0,1e-06,0,0,0,0,0,0,-1e-06,0,-1e-06,0,0,-2e-06,0,-1e-06,0,-1e-06,0,-1e-06,0,0,0,0,0,1e-06,0,0,0,0,0,0,0,-1e-06,0,0,0,0,0,1e-06,0,0,-1e-06,0,0,0,0,0,0,0,0,0,0,0,0,0,0,1e-06,0,0,0,-1e-06,0,0,0,-1e-06,0,0,-2e-06,0,0,0,0,0,0,-1e-06,0,0,0,0,-1e-06,0,0,-1e-06,0,0,0,0,0,0,0,0,1e-06,0,0,0,0,0,0,1e-06,0,0,0,1e-06,1e-06,0,0,0,0,0,0,0,0,-1e-06,-1e-06,0
0,0,0,0,0,0,0,0,0,0,0,0,0,0,0,0,0,0,-1e-06,0,-1e-06,0,1e-06,0,0,0,-1e-06,0,0,-1e-06,1e-06,0,0,0,0,0,0,0,0,0,0,0,-2e-06,0,-1e-06,0,0,0,-1e-06,-1e-06,-1e-06,-1e-06,0,0,0,0,0,0,0,0,-1e-06,0,-1e-06,0,0,0,-1e-06,0,0,0,1e-06,0,0,-1e-06,0,0,0,0,0,0,0,0,0,0,0,1e-06,0,0,1e-06,0,0,0,0,0,1e-06,0,0,-1e-06,0,0,0,0,0,0,0,0,0,1e-06,-1e-06,0,0,0,0,-1e-06,0,0,0,0,0,0,-1e-06
0,0,1e-06,0,0,0,0,0,0,0,1e-06,-1e-06,0,0,0,0,0,0,0,0,-1e-06,0,0,0,0,0,-1e-06,0,0,-1e-06,1e-06,0,0,0,0,0,1e-06,0,0,0,0,0,1e-06,0,1e-06,0,0,1e-06,0,-1e-06,0,0,0,0,0,0,0,0,0,0,0,0,1e-06,0,0,0,0,0,1e-06,0,1e-06,0,0,0,0,0,0,0,0,0,1e-06,0,-1e-06,0,0,0,0,0,-2e-06,0,0,0,0,0,0,1e-06,0,0,0,0,0,0,0,0,0,0,0,0,0,-1e-06,0,0,0,0,0,-1e-06,1e-06,0,0,0,1e-06
0,0,0,0,0,0,0,0,0,0,0,1e-06,0,0,0,0,0,0,0,0,0,0,0,0,0,0,-1e-06,0,0,1e-06,1e-06,0,0,0,0,0,0,0,0,0,0,0,1e-06,0,0,0,0,-1e-06,1e-06,-1e-06,-1e-06,0,0,0,0,0,0,0,0,0,0,0,-1e-06,0,0,0,1e-06,0,0,0,0,-1e-06,0,2e-06,0,0,0,0,0,0,-1e-06,0,0,0,0,0,0,0,1e-06,0,0,0,0,0,0,-1e-06,0,1e-06,0,0,0,0,0,0,0,0,0,0,0,0,0,0,0,0,0,0,-1e-06,0,0,0,0
0,1e-06,-1e-06,0,0,0,0,0,0,0,-1e-06,0,0,-1e-06,0,0,0,0,0,0,1e-06,0,0,0,1e-06,0,0,0,0,0,1e-06,0,0,0,0,0,0,0,0,0,0,0,-1e-06,0,-1e-06,0,0,0,0,-1e-06,0,0,0,0,0,0,0,0,0,0,-1e-06,0,0,0,0,0,1e-06,0,0,0,0,1e-06,0,2e-06,0,0,0,0,0,0,1e-06,0,1e-06,0,0,0,0,0,-1e-06,0,0,0,0,0,0,0,0,0,0,-1e-06,0,0,0,0,0,0,0,0,0,0,0,0,0,0,0,0,1e-06,0,0,0,0
0,0,0,0,0,0,0,0,0,0,-1e-06,0,0,0,0,0,0,0,1e-06,0,1e-06,0,-1e-06,0,0,1e-06,0,0,0,0,0,0,0,0,0,0,1e-06,0,0,0,0,0,-1e-06,0,1e-06,0,0,1e-06,0,0,0,0,0,0,0,0,0,0,0,0,0,0,0,0,0,0,0,0,0,0,-1e-06,0,0,0,0,0,0,0,0,0,-1e-06,0,1e-06,0,0,-1e-06,0,0,0,0,0,0,0,0,0,0,0,-1e-06,0,0,0,0,0,0,0,0,0,0,0,0,0,0,0,0,0,0,-1e-06,0,0,0,0
0,-1e-06,1e-06,0,0,0,0,0,0,0,0,0,0,0,0,0,0,0,0,0,1e-06,0,0,0,0,0,0,0,0,0,0,0,0,0,0,0,0,0,0,0,0,0,1e-06,0,0,0,0,0,0,0,0,0,0,0,0,0,0,-1e-06,0,0,0,0,0,0,0,0,-1e-06,0,1e-06,0,0,-1e-06,0,-1e-06,0,0,0,0,0,0,0,0,0,0,0,1e-06,0,0,0,0,0,0,0,0,0,1e-06,0,0,0,0,0,0,0,0,1e-06,0,0,0,0,1e-06,0,0,0,0,0,1e-06,1e-06,0,0,1e-06,0
0,0,0,0,0,0,0,0,0,0,0,0,0,0,0,0,0,0,0,0,0,0,0,0,-1e-06,0,0,0,0,-1e-06,0,0,0,0,0,0,-1e-06,0,0,0,0,0,0,0,0,0,0,-1e-06,0,0,0,0,0,0,0,0,0,0,0,0,1e-06,0,1e-06,0,0,0,-1e-06,0,0,0,-1e-06,1e-06,0,-2e-06,0,0,0,0,0,0,0,0,0,0,0,0,0,0,0,0,0,0,0,0,0,-1e-06,0,0,0,0,0,0,0,0,0,0,0,0,0,0,0,0,0,0,0,-1e-06,-1e-06,0,0,0,0
0,0,-1e-06,0,0,0,0,0,0,0,0,0,0,0,0,0,0,0,0,0,0,0,0,0,0,0,0,0,0,0,-1e-06,0,0,0,0,0,0,0,0,0,0,0,-1e-06,0,0,0,0,1e-06,0,-1e-06,0,0,0,0,0,0,0,0,0,0,1e-06,0,-1e-06,0,0,0,0,0,0,0,0,0,0,-1e-06,0,0,0,0,0,0,-1e-06,0,0,0,0,0,0,0,0,0,0,0,0,0,0,0,0,-1e-06,0,0,0,0,0,0,0,0,0,0,0,0,0,0,0,0,0,0,1e-06,0,0,0,0
0,0,0,0,0,0,0,0,0,0,0,0,0,0,0,0,0,0,0,0,-1e-06,0,0,0,0,0,-1e-06,0,0,0,-1e-06,0,0,0,0,0,0,0,0,0,0,0,0,0,0,0,0,0,0,-1e-06,0,1e-06,0,0,0,0,0,0,0,0,0,0,1e-06,0,0,0,0,0,0,0,1e-06,0,0,1e-06,0,0,0,0,0,0,1e-06,0,0,0,0,0,0,0,-1e-06,0,0,0,0,0,0,-1e-06,0,0,0,0,0,0,0,0,-1e-06,0,0,0,0,0,0,0,0,0,0,0,-1e-06,0,0,0,0
