-0.000287,-0.000123,-0.000118,-0.000134,-0.000147,-0.000178,-0.000276,-0.000468,-0.000357,-0.000263,-0.000141,-0.000103,-0.000103,-0.000146,-0.00015,-0.000137,-0.00022,-0.000243,-0.000217,-0.000203,-0.000144,-0.000155,-0.000194,-0.000215,-0.000234,-0.000195,-0.000146,-0.000129
-0.000348,-0.000159,-0.000125,-0.000156,-0.000191,-0.000211,-0.000314,-0.000587,-0.000437,-0.000285,-0.000149,-0.000109,-0.000108,-0.000161,-0.000148,-0.000111,-0.000239,-0.000252,-0.000223,-0.000173,-9.8e-05,-0.000131,-0.000202,-0.000251,-0.000277,-0.000229,-0.000153,-9.6e-05
-3.3e-05,-6.5e-05,-2.6e-05,-3.6e-05,-6.6e-05,-3.9e-05,-2.3e-05,-7.9e-05,-0.000118,-8e-05,-8.2e-05,-5.9e-05,-4.1e-05,-6.2e-05,-5.7e-05,-6.5e-05,-6.6e-05,-3.3e-05,-2.4e-05,1.4e-05,2e-06,-2e-05,-5.7e-05,-8.1e-05,-6e-05,-5.5e-05,-7e-05,-2.7e-05
0.000302,8.1e-05,7.4e-05,1e-04,0.00011,0.00015,0.000258,0.000513,0.000369,0.000247,0.000111,6.5e-05,5.9e-05,9.5e-05,0.000121,0.000104,0.000188,0.000219,0.000171,0.00017,0.00011,0.000123,0.000169,0.000172,0.000202,0.000172,0.000112,8.4e-05
0.000224,1e-04,6.6e-05,0.000102,0.000138,0.000132,0.000189,0.000455,0.000373,0.000223,0.000125,0.000109,9.3e-05,0.00013,0.000133,0.000108,0.000185,0.000169,0.000131,7e-05,5.2e-05,0.000109,0.000175,0.000205,0.000202,0.000179,0.000134,7.4e-05
-0.000116,2.4e-05,2e-06,-1.9e-05,-3e-06,-3.9e-05,-0.000113,-0.000163,-6.5e-05,-5.8e-05,-2.4e-05,1.3e-05,3.1e-05,3.3e-05,-2.2e-05,-5e-05,-7.4e-05,-0.000106,-6.6e-05,-0.000109,-7.7e-05,-5.9e-05,-6.2e-05,-4.5e-05,-5.7e-05,-3.1e-05,-2.3e-05,-6.6e-05
-0.000253,-2.3e-05,-1.7e-05,-9.3e-05,-0.000114,-0.000117,-0.000222,-0.000515,-0.000315,-0.000161,-6.7e-05,-6.8e-05,-4.8e-05,-3.9e-05,-8.6e-05,-6.9e-05,-0.000189,-0.000194,-0.000126,-8.8e-05,-5.8e-05,-0.000116,-0.000182,-0.000216,-0.000206,-0.000156,-8.7e-05,-8.7e-05
-8.2e-05,-5.6e-05,-2.3e-05,-4.5e-05,-7e-05,-4.2e-05,-4e-05,-0.000234,-0.00022,-0.000125,-6.8e-05,-8.1e-05,-7.8e-05,-8.1e-05,-7.4e-05,-4.3e-05,-7.1e-05,-4.9e-05,-3.5e-05,1e-05,-2e-06,-4.2e-05,-0.000103,-0.000139,-9.7e-05,-9.2e-05,-6.3e-05,-1.1e-05
0.000168,-4.2e-05,-1.4e-05,5.5e-05,5.6e-05,6.8e-05,0.000167,0.000315,0.000139,6.5e-05,1.7e-05,1e-06,-2.3e-05,-5.2e-05,2.4e-05,5.7e-05,0.00015,0.000161,7.5e-05,7.2e-05,5.4e-05,8.2e-05,9.9e-05,9.7e-05,0.000125,7.1e-05,3.4e-05,7.1e-05
0.000171,4e-06,1e-06,7.4e-05,8.9e-05,6.9e-05,0.000147,0.000461,0.000307,0.000163,7.4e-05,7.2e-05,2.9e-05,1.6e-05,8.8e-05,9.9e-05,0.000178,0.00017,7.6e-05,3.9e-05,4.2e-05,0.000108,0.000184,0.000226,0.000198,0.000128,7.4e-05,6.8e-05
-4.4e-05,3.2e-05,1.2e-05,8e-06,1.7e-05,-1.2e-05,-3.4e-05,3.7e-05,5.6e-05,2.5e-05,1.6e-05,4.2e-05,4.2e-05,5.2e-05,1.5e-05,-3.9e-05,-3.3e-05,-4.4e-05,-3e-06,-2.4e-05,-3.9e-05,-3e-05,2e-05,7e-05,1.8e-05,1.4e-05,-1.1e-05,-3.5e-05
-0.00016,5.3e-05,3.6e-05,-4.9e-05,-5.2e-05,-4.2e-05,-0.000136,-0.000395,-0.000181,-5.3e-05,1e-05,-1e-06,4.9e-05,6.8e-05,-2.3e-05,-5.7e-05,-0.000145,-0.000156,-1.9e-05,6e-06,-1.3e-05,-9.9e-05,-0.000121,-0.000131,-0.000164,-7.3e-05,-1.7e-05,-4.7e-05
-6.2e-05,2.9e-05,2.3e-05,-5.5e-05,-6.3e-05,-1.3e-05,-7.4e-05,-0.000347,-0.000206,-9.9e-05,-2.7e-05,-4.5e-05,-8e-06,9e-06,-3.9e-05,-1.6e-05,-9.5e-05,-8.4e-05,-1.1e-05,-3e-06,1.6e-05,-2.9e-05,-0.000101,-0.00015,-0.000134,-5.5e-05,-1e-06,1.2e-05
0.000115,-2.8e-05,-2.4e-05,1e-06,0,2.3e-05,5.1e-05,9.9e-05,-1.3e-05,-6.7e-05,-4.8e-05,-5e-05,-6.4e-05,-7.4e-05,-3.3e-05,0,2.9e-05,6.2e-05,-1.6e-05,-4.3e-05,-7e-06,5e-05,2.3e-05,-8e-06,3.3e-05,2.2e-05,6e-06,4.1e-05
0.000136,-6.1e-05,-4.6e-05,5e-05,4.7e-05,1.3e-05,9.4e-05,0.000405,0.000212,8.3e-05,1.5e-05,1.7e-05,-3.4e-05,-7.6e-05,2.8e-05,6e-05,0.000132,0.000142,-2e-06,-7e-06,7e-06,6.8e-05,0.00013,0.000142,0.000143,6.9e-05,4.2e-05,4.4e-05
-2.7e-05,-3.2e-05,-2e-05,2.9e-05,1.4e-05,-3.3e-05,1.8e-05,0.000212,0.000142,0.000103,5e-06,3.4e-05,1e-05,-2.3e-05,9e-06,-1e-06,5.1e-05,2.9e-05,-5e-06,3.4e-05,2e-06,-1e-05,4.7e-05,0.00011,8.4e-05,0,-2.4e-05,-2.4e-05
-0.000147,3.2e-05,4.3e-05,-9e-06,-2.7e-05,-3.5e-05,-6.5e-05,-0.000199,-6.3e-05,2.7e-05,3e-06,8e-06,3.3e-05,5.1e-05,-1.3e-05,-4.5e-05,-6.9e-05,-0.000101,-5e-06,4.5e-05,7e-06,-6.7e-05,-8.4e-05,-4.2e-05,-5.1e-05,-7.3e-05,-5.9e-05,-6.2e-05
-9.9e-05,4e-05,5.6e-05,-1.6e-05,-2.3e-05,1.1e-05,-5.9e-05,-0.000341,-0.000166,-7.7e-05,1.9e-05,-2e-06,2.8e-05,6.8e-05,5e-06,1.9e-05,-5.4e-05,-8.3e-05,1.1e-05,-1.6e-05,6e-06,-2.4e-05,-8.7e-05,-0.000124,-0.000108,-3.9e-05,8e-06,-1e-05
6.9e-05,8e-06,-1e-06,-4e-06,2.2e-05,5.4e-05,2.2e-05,-7.2e-05,-9.2e-05,-0.00011,-3e-06,-1.1e-05,-4e-06,-2e-06,-1.2e-05,1e-05,7e-06,2.2e-05,1.8e-05,-8.1e-05,-3.5e-05,2.6e-05,-2.1e-05,-9.3e-05,-4.8e-05,3.9e-05,2.4e-05,2.1e-05
