-8e-06,-1.4e-05,-3e-05,-2e-05,-3.8e-05,-4.3e-05,-4.7e-05,-6.2e-05,-0.000119,-0.000284,-0.000512,-0.000672,-0.00075,-0.000757,-0.000856,-0.001014,-0.001025,-0.001074,-0.000967,-0.001096,-0.001231,-0.001816,-0.001224,-0.000907,-0.001023,-0.001472,-0.00086,-0.000608
6e-06,-2e-06,-1e-06,2.4e-05,3.4e-05,5.6e-05,6.2e-05,-3.9e-05,-0.000142,-0.000324,-0.000443,-0.000573,-0.000744,-0.000664,-0.000715,-0.000843,-0.000822,-0.001015,-0.00085,-0.00094,-0.001004,-0.001358,-0.001091,-0.000996,-0.00103,-0.001403,-0.000818,-0.000706
-8e-06,-5e-06,-1.6e-05,-4.8e-05,-4.9e-05,-7.8e-05,-0.000125,-6e-05,-5.6e-05,-2.9e-05,9.9e-05,2.5e-05,-7.9e-05,3.2e-05,0.000146,0.000261,0.00037,0.000237,0.000231,0.000338,0.000445,0.000939,0.000434,6e-05,0.00018,0.000428,0.000129,-7.6e-05
5e-06,1.3e-05,4.1e-05,4.3e-05,3.3e-05,4.9e-05,8.8e-05,6.7e-05,7.8e-05,0.000231,0.000446,0.000446,0.000434,0.000525,0.000682,0.000866,0.000919,0.001022,0.000862,0.000996,0.001068,0.001691,0.00122,0.000925,0.001054,0.00159,0.000817,0.000558
5e-06,3e-06,1.3e-05,2.5e-05,4.9e-05,6.4e-05,9.1e-05,6.4e-05,0.000106,0.000147,0.000152,0.000281,0.000441,0.000394,0.000349,0.000345,0.000175,0.000452,0.000395,0.000342,0.000258,-5e-06,0.000291,0.000586,0.000532,0.000618,0.000442,0.000522
-1.8e-05,-1.8e-05,-3.7e-05,-4.2e-05,-4.8e-05,-8.4e-05,-0.000144,-5.2e-05,1e-06,-7.8e-05,-0.000292,-0.000141,4.7e-05,-0.000175,-0.000356,-0.000571,-0.00074,-0.000613,-0.000537,-0.000698,-0.000815,-0.001618,-0.000968,-0.000456,-0.000652,-0.001157,-0.000519,-0.000116
-2e-06,-1e-05,-1.8e-05,-1.3e-05,-3.6e-05,-1.5e-05,3.2e-05,-2e-05,-5.1e-05,-0.000115,-0.000259,-0.000207,-0.000219,-0.00039,-0.000492,-0.000602,-0.000497,-0.000729,-0.000672,-0.00073,-0.000753,-0.00082,-0.000757,-0.000788,-0.000841,-0.001256,-0.000681,-0.000555
5e-06,9e-06,1.8e-05,1.1e-05,2.7e-05,4.2e-05,2.4e-05,-7e-06,-2.4e-05,2.5e-05,0.000138,3.4e-05,-0.000129,-1.4e-05,4.2e-05,0.000237,0.000448,8.7e-05,0.000101,0.000252,0.000344,0.001172,0.000514,-5.1e-05,0.000149,0.000399,0.000152,-0.00026
-3e-06,8e-06,2.3e-05,1e-05,1.3e-05,-2.1e-05,-5.4e-05,5e-06,0,5.2e-05,0.000225,1.2e-05,-0.000115,0.000182,0.000368,0.000562,0.000572,0.000545,0.000559,0.000776,0.000886,0.001305,0.000876,0.000584,0.000763,0.001313,0.000619,0.000264
6e-06,-3e-06,-6e-06,7e-06,4e-06,3.4e-05,9.9e-05,4.7e-05,3e-06,-3.9e-05,-4.8e-05,-0.000148,-0.000144,3e-06,0.000136,2.6e-05,-0.000173,0.000261,0.000199,0.000168,0.000156,-0.000512,-6.4e-05,0.000343,0.00025,0.000377,0.000172,0.00036
-3e-06,-3e-06,-1.7e-05,-1.3e-05,1e-06,-1e-05,-5.8e-05,-2.4e-05,-1.1e-05,-9.1e-05,-0.000182,-3.7e-05,5.5e-05,-9.5e-05,-2e-04,-0.000414,-0.000505,-0.000146,-0.000267,-0.000602,-0.000691,-0.001419,-0.000779,-0.000267,-5e-04,-0.00095,-0.00043,5.8e-05
-2e-06,-2e-06,-7e-06,1e-06,-1.7e-05,-4.1e-05,-3.8e-05,-2.8e-05,6e-06,3.8e-05,-3e-06,0.000231,0.000329,4.6e-05,-0.000141,-0.000191,-1e-05,-0.000245,-0.000243,-0.00041,-0.000403,-9.3e-05,-0.000261,-0.000388,-0.000469,-9e-04,-0.000421,-0.00024
1.1e-05,1.1e-05,1.2e-05,-6e-06,-1.3e-05,3e-05,1e-04,2e-05,2.6e-05,0.000137,0.000177,0.000281,0.000304,0.000152,7.5e-05,0.000237,4e-04,-0.000157,6e-06,0.000316,0.000371,0.001239,0.000583,4.7e-05,0.000195,0.00034,0.000163,-0.000211
0,8e-06,2.7e-05,3.1e-05,3.5e-05,1e-05,-5.7e-05,-1.3e-05,1.4e-05,5.4e-05,7.3e-05,-9.7e-05,-0.00013,1.4e-05,6.3e-05,0.000261,0.000122,-2.3e-05,0.000132,0.00047,0.000407,0.000591,0.000495,0.000361,0.000552,0.001055,0.000542,6.6e-05
-6e-06,-9e-06,-1.6e-05,-1.3e-05,1e-06,0,6e-06,2.4e-05,-1.1e-05,-9.1e-05,-0.000133,-0.000399,-0.00045,-0.000175,-4.8e-05,-8.5e-05,-0.00031,0.000149,9.1e-05,-3.1e-05,-9.4e-05,-0.000867,-0.000315,9.7e-05,7.7e-05,0.000271,0.000155,0.000217
4e-06,-8e-06,-2.6e-05,-1.8e-05,-1.9e-05,-4e-06,1.4e-05,1.4e-05,-2.9e-05,-0.000124,-0.000118,-0.000156,-0.000237,-0.000141,-3.6e-05,-0.000244,-0.000215,0.000262,-7e-06,-0.000396,-0.000271,-0.000903,-0.000594,-0.000313,-0.000508,-0.000825,-0.000417,0.000105
-5e-06,-1e-06,7e-06,7e-06,-4e-06,-2.9e-05,-7.2e-05,-3.2e-05,-1.2e-05,-1.3e-05,6.2e-05,0.000252,0.000205,9.1e-05,8.9e-05,0,0.00024,0.000106,-4.7e-05,-0.000192,-4.8e-05,0.000409,3.7e-05,-0.00022,-0.000301,-0.000697,-0.000394,-0.000115
-1e-06,4e-06,1e-05,-1e-06,9e-06,2e-05,6.8e-05,8e-06,2.1e-05,8.1e-05,0.000116,0.000262,0.000334,0.000171,6.2e-05,0.000153,0.000285,-0.00028,-5.2e-05,0.000204,7.9e-05,0.000975,0.000553,0.00019,0.000315,0.000322,8.5e-05,-0.000212
-1e-06,2e-06,1e-05,5e-06,-1.1e-05,1e-05,1.1e-05,-2e-05,1.7e-05,5.7e-05,-3.7e-05,-6.5e-05,0.000103,2.3e-05,-0.000113,1.1e-05,-0.000187,-0.000383,-6e-05,0.000289,2.7e-05,2.4e-05,0.000196,0.000305,0.000437,0.000827,0.00041,-7e-05
