-0.049168,-0.0905,-0.105383,-0.091778,-0.184173,-0.191202,-0.175672,-0.160898,-0.125135,-0.089934,-0.044932,-0.015025,-0.008666,-0.002692,-0.0011,-0.000768,-0.002738,-0.005436,-0.009703,-0.004464,-0.001031,-0.000259,-6.4e-05,-5.1e-05,-4.5e-05,-4.7e-05,-0.000503,-0.000508
-0.02114,-0.0718,-0.106662,0.041668,0.147664,0.140608,0.146546,0.123883,0.105051,0.089534,0.044213,0.016103,0.009336,0.002838,0.00108,0.000341,-0.003578,-0.007599,-0.012239,-0.00464,-0.000983,0.000316,0.000155,-7.6e-05,-6.1e-05,-5.1e-05,-0.000322,-0.000325
0.016158,0.021374,0.011669,0.006136,0.032837,0.032391,0.020692,-0.003161,-0.016754,-0.001414,-0.000667,-0.001381,-0.00041,-6.2e-05,-0.000128,-0.00014,-0.002436,-0.003015,-0.000735,0.000624,-6.2e-05,-0.000527,-0.000235,-3.3e-05,-3e-05,-4.4e-05,-5.6e-05,-0.000118
0.033417,0.083297,0.100748,-0.057743,-0.183223,-0.176318,-0.172364,-0.138592,-0.108897,-0.09636,-0.046778,-0.016344,-0.010041,-0.00314,-0.001171,-0.000619,0.000607,0.003791,0.009815,0.004003,0.00088,0.000188,2e-06,4.7e-05,3.4e-05,4e-06,0.00011,2.7e-05
0.005841,0.033704,0.065308,0.051179,0.094111,0.105582,0.115601,0.137292,0.121477,0.076319,0.03927,0.014442,0.008222,0.002436,0.001086,0.000725,0.00391,0.006669,0.008029,0.002964,0.000932,0.000602,0.000252,9.3e-05,8.2e-05,6e-05,0.00024,0.000238
-0.038506,-0.060574,-0.04818,0.030398,0.126433,0.127397,0.115548,0.083775,0.049015,0.046884,0.021621,0.006201,0.004679,0.00159,0.000526,0.000402,0.002375,0.001898,-0.003041,-0.001801,-0.000291,-0.000563,-0.000225,-1e-06,1.7e-05,1.8e-05,3.8e-05,8.2e-05
-0.010792,-0.050324,-0.090859,-0.08509,-0.163156,-0.169903,-0.173048,-0.177423,-0.134541,-0.095803,-0.050163,-0.018137,-0.010984,-0.003307,-0.00123,-0.000721,-0.001627,-0.00412,-0.009081,-0.00405,-0.000902,0.000164,0.000115,-6.6e-05,-5e-05,-3.2e-05,-0.000146,-9.4e-05
0.030316,0.022476,-0.019433,-0.021467,-0.039128,-0.02606,-0.004199,0.006665,0.027903,0.020857,0.011327,0.005346,0.002859,0.000719,0.000449,0.000161,-0.002327,-0.004054,-0.003304,-0.000419,-0.000306,3.7e-05,4.5e-05,-2.9e-05,-1.3e-05,-8e-06,-5.5e-05,-1e-06
0.012244,0.041876,0.063648,0.058555,0.143918,0.140707,0.134951,0.106629,0.05766,0.058315,0.031347,0.010003,0.007118,0.002325,0.000734,0.000438,-0.000836,-9.9e-05,0.004396,0.001804,0.000266,-0.000285,-0.000138,2.2e-05,2.8e-05,1.3e-05,1.8e-05,1.7e-05
-0.011855,0.010431,0.053456,-0.001453,-0.049476,-0.075175,-0.101829,-0.09209,-0.075396,-0.062902,-0.029822,-0.011528,-0.008213,-0.002344,-0.000901,-0.000577,0.000437,0.002363,0.004959,0.002101,0.00068,0.000323,8.1e-05,2.4e-05,2.1e-05,1.5e-05,2.1e-05,-2.8e-05
-0.024901,-0.032009,-0.01678,-0.027911,-0.071836,-0.050415,-0.040844,0.002683,0.028672,-0.001947,-0.001262,0.000932,-0.000264,-0.000289,6.2e-05,-8.1e-05,0.001316,0.001786,-0.000642,-0.000143,0.000202,6.1e-05,1.5e-05,-3e-06,2e-06,1.4e-05,8e-06,-4.3e-05
-0.004948,-0.02441,-0.050391,0.012273,0.099182,0.128467,0.142128,0.11018,0.067994,0.062058,0.029198,0.011497,0.008701,0.002564,0.000789,0.000594,0.001061,-1.1e-05,-0.004048,-0.001505,-0.000385,-0.000331,-0.000124,-4.4e-05,-2.3e-05,-5e-06,-5.2e-05,-0.000106
0.027143,0.017701,-0.021327,-0.001945,-0.006378,-0.036758,-0.051726,-0.080175,-0.071233,-0.04206,-0.022634,-0.008551,-0.005701,-0.001598,-0.00057,-0.000169,-0.001083,-0.00185,-0.002363,-0.001938,-0.000611,0.000111,7.4e-05,-4.6e-05,-2.9e-05,-2.7e-05,-4.4e-05,-3.3e-05
0.011513,0.019541,0.022883,-0.023009,-0.105411,-0.114137,-0.106623,-0.067096,-0.023796,-0.02903,-0.013927,-0.005317,-0.004551,-0.001515,-0.000218,-0.000214,-0.001429,-0.001335,0.001953,0.000847,-6.4e-05,-0.000133,-5.5e-05,5e-06,0,-1.3e-05,6.8e-05,0.000144
-0.018962,-0.007508,0.031751,0.023423,0.054295,0.08372,0.101782,0.095442,0.056837,0.052955,0.028778,0.010792,0.008025,0.002384,0.000675,0.000321,0.000247,0.000531,0.002529,0.001477,0.000399,4.5e-05,2e-05,3.5e-05,2.5e-05,1.4e-05,5.1e-05,8.7e-05
-0.011949,-0.010627,0.00802,0.039043,0.069732,0.044929,0.026353,-0.001094,-0.027697,-0.012057,-0.005093,-0.002497,-0.001573,-0.000213,-0.000327,-0.00019,0.000699,0.000738,-0.000459,0.000541,0.00043,0.000202,8.7e-05,9e-06,1e-05,2.4e-05,-1e-05,-1.4e-05
0.004944,0.001263,-0.016199,-0.019219,-0.064859,-0.08783,-0.097374,-0.062047,-0.018476,-0.035308,-0.01886,-0.007255,-0.005942,-0.001831,-0.000384,-0.000278,0.000205,-6.8e-05,-0.00238,-0.000841,-1e-04,-0.000157,-6.7e-05,-3.6e-05,-1.9e-05,3e-06,-1.9e-05,-3e-05
0.014652,0.009278,-0.01793,-0.027253,-0.007815,0.038975,0.057063,0.058433,0.055639,0.04086,0.016383,0.00739,0.006081,0.00159,0.000485,0.000424,1.2e-05,-0.000305,-0.000929,-0.00121,-0.000449,-1.5e-05,5e-06,-4.4e-05,-2.2e-05,-1.1e-05,-0.000101,-0.000164
0.000589,-0.002873,-0.005532,0.017018,0.05504,0.060896,0.051729,0.00704,-0.010305,0.008063,0.001436,0.00059,0.001341,0.000506,-6e-05,0.000102,-0.00051,-0.000295,0.001429,-4.2e-05,-0.000239,-6.5e-05,-4.2e-05,-1.5e-05,-1e-06,-7e-06,-8e-05,-0.000138
