0.001051,0.000518,0.000366,-0.000466,0.00011,0.000102,-0.000434,0.000656,0.000113,-0.000378,-0.000431,0.000646,9e-05,-0.00062,-0.000644,0.00044,-0.000209,-0.000816,-0.001523,-0.000642,0.000368,-5.8e-05,-2.9e-05,0.000666,0.000208,9.8e-05,0.000359,-0.000107,-0.000208,-0.000513,-0.000343,-0.000579,-0.000334,0.000323,-0.000738,-0.001113,-0.000574,-0.000603,-0.00103,-0.001742,-0.001739,-0.001068,-0.000719,-0.001132,-9.1e-05,-0.000133,0.000493,0.00023,-9.4e-05,0.000253,0.002479,0.000597,-8.7e-05,-0.000905,-0.001341,-0.000641,-0.000443,-0.001951,0.000518,-0.000536,0.00093,0.000389,-0.000605,-0.001172,2.1e-05,-0.000353,0.000212,-0.00014,0.001137,0.001482,0.0012,0.00131,-0.001272,0.000556,0.000238,0.001015,0.000654,0.000703,0.001539,1e-05,-0.000429,-8.5e-05,0.001005,4.7e-05,0.001306,0.001096,0.000694,-0.001081,-0.001464,-0.000721,-0.000358,-0.000338,0.000206,-0.000675,0.000824,0.000369,8.5e-05,0.000109,0.000316,2.7e-05,0.000611,-0.000138,-4.7e-05,3.8e-05,0.001046,0.000327,-7.3e-05,0.00017,-0.000399,-0.000549,-0.000626,0.000163,-0.000458,-0.000236,-0.001548,-0.000432,-0.000225,-0.000371,0.000204,0.000195,-0.000384
-0.000524,-0.000107,0.000785,0.001077,0.001078,0.001293,0.001066,0.001012,0.000773,0.001834,0.001177,0.000325,0.000606,0.001172,0.000812,0.000146,6.5e-05,0.000195,0.000874,0.000833,0.000731,0.000637,0.001039,0.001363,0.000149,-5.4e-05,0.000319,0.001004,-0.000132,-0.000372,-0.000456,-0.000886,5.5e-05,-0.000304,0.00018,-0.000207,-0.000627,-0.000523,6e-05,0.000801,0.000186,0.001752,0.000222,0.001001,-0.000584,-0.001071,-0.000995,-0.000849,2.4e-05,-0.000929,-0.001308,-0.001277,-0.00065,0.000261,0.000733,0.000602,-0.000731,0.000344,0.000707,0.00036,0.000214,1.5e-05,-0.000695,0.00033,0.000368,0.000245,0.000639,0.001016,0.001403,0.001189,0.000698,0.001163,0.001346,-1.6e-05,0.00163,0.000862,0.001741,-0.00127,-0.000554,0.00081,0.001492,0.001126,0.000583,0.000559,-0.000181,-0.001055,-0.000446,0.001387,0.001878,0.000691,-0.000148,-0.000439,0.000474,0.000913,0.000381,0.000609,0.000148,0.000466,0.000937,0.000766,-0.000483,0.000229,0.000621,-0.00098,-0.000653,0.000967,-0.000584,-0.000206,0.000383,-0.000328,-0.000307,-0.001784,-0.000495,-0.000882,-0.000445,-0.000351,-0.000217,-0.001238,-0.000649,-0.00073,0.000161
0.000134,-0.000833,0.000182,0.000569,-1e-04,-0.000251,-0.000233,-0.000514,-0.000536,-0.001883,-0.000135,-0.002605,-0.002198,-0.001915,-0.000465,-0.001733,-0.000689,-0.000515,0.000655,0.001006,0.000297,-0.000605,-0.000501,-9.3e-05,4.5e-05,-0.000178,0.00077,0.000454,-0.000434,0.000288,0.000111,-0.00032,-0.000676,-0.000228,-0.000269,-0.000885,-1e-06,-0.00029,-0.000434,-0.000333,-0.00032,-0.001445,-0.001222,-1.6e-05,-0.000335,-0.000465,-0.000322,-0.001016,-0.000746,-0.00062,-0.0013,-0.000823,0.000194,-0.000568,-0.000717,-0.001162,5.7e-05,0.000228,-0.000484,-0.000977,-0.00015,0.000203,0.000537,-0.000351,-0.001096,-0.001064,-0.000893,-0.000563,-0.000127,6.5e-05,-0.000577,-0.000638,-0.001648,-0.001054,0.000176,-0.001137,-0.001276,-0.001965,-0.00033,-0.000563,-0.00057,0.000332,-0.00141,-0.000427,-0.001353,-0.001289,-0.000934,-0.000873,-0.000823,-0.000862,-0.000653,-0.000669,-0.000446,-0.000373,-3.2e-05,-0.00021,7e-06,-9.1e-05,-0.001015,-0.000417,0.000203,-0.000325,-0.00083,0.00013,-0.001158,-0.001015,-0.000437,-0.001313,-0.000585,-0.00012,-0.000482,-0.000126,-0.000652,6e-05,0.001082,-9.7e-05,-0.000152,-0.00026,0.001077,0.00033,-9.2e-05
0.000159,0.000128,0.000143,-0.000625,0.000868,-0.000728,-9.4e-05,-0.000554,-0.00057,-0.000632,6e-06,-0.000155,0.000749,-0.000346,-0.000142,-0.000781,-9e-04,-0.000389,-0.001444,-0.000834,-0.000935,-0.000967,-4.3e-05,-0.000474,-0.000381,-0.000189,-0.000661,0.000175,0.001248,0.000254,0.00045,0.000532,-0.000179,-0.000232,-0.000793,-0.000395,-0.000589,-0.000293,-5.9e-05,-0.000383,0.000129,0.000359,0.00011,-0.000449,0.00036,0.000998,-8.6e-05,-0.001182,-0.000104,-0.001083,0.000316,-0.001447,-0.0014,-0.001097,-0.000722,9.3e-05,-0.000282,-0.000618,-0.001098,-8e-04,-0.000617,-0.000231,-0.000218,0.000462,-0.000357,-0.000238,-0.000885,0.000309,0.000343,-0.00052,-0.001348,-0.000553,0.000946,-0.00013,3e-04,-0.001324,0.000811,0.000889,0.000242,-0.00048,-3.8e-05,-0.000236,-0.000546,-0.000362,-0.000716,-0.000744,-0.000563,0.000162,-0.001356,-0.000744,0.000272,0.00018,0.000108,0.000169,-7.2e-05,-0.000824,-0.000708,-2.7e-05,-0.000566,-0.001061,0.000367,0.000398,-0.000613,3e-04,0.000546,-3.6e-05,-0.000179,-0.000703,-0.000942,0.000183,-0.000298,-0.000597,-0.000569,0.000228,-0.000506,0.000165,-0.00107,0.000335,-0.000351,2.1e-05,0.000307
-0.001776,2.2e-05,0.000606,-0.000534,-0.000556,-0.000846,-0.000956,-0.000456,0.000577,-0.000165,-0.000787,-0.000289,-0.00012,0.000188,0.000822,-9.2e-05,0.000715,-0.000683,0.000625,8e-06,0.000117,-0.000123,7.9e-05,-0.000816,-0.001065,-0.00025,-0.001587,-0.000601,-0.000375,-0.000895,-0.000132,-0.000215,-0.000368,-6.4e-05,-0.000223,0.000614,-0.000845,0.000932,-0.00033,0.000583,0.000874,-0.000113,-0.000797,-0.000578,-0.000516,-0.000394,0.000833,0.000544,-0.000698,0.000553,0.000761,0.000639,0.000605,0.000252,0.000687,-0.000801,-0.000175,8.5e-05,6.1e-05,0.00032,-0.000283,-0.000685,-0.000682,-0.000507,-0.000623,0.000159,-0.001234,0.000301,9.5e-05,-0.000914,-0.000899,0.000647,-0.000326,-0.000162,-6.5e-05,-0.000504,-0.000347,0.000502,-0.000577,-0.00102,-2.7e-05,0.000844,-0.000389,0.00043,-0.000275,0.000332,0.000484,-0.000259,-6e-06,-2.1e-05,-0.00042,-0.000532,-0.000592,-0.000343,-0.000642,-0.000457,0.000412,-1e-04,0.000216,-0.000509,-3.6e-05,-6.8e-05,-2.5e-05,-0.00107,-0.000358,-0.000835,0.000677,0.00112,0.00063,-7.4e-05,0.000615,0.001081,0.000893,0.000333,5e-05,-0.000366,-0.000527,-5.1e-05,0.000748,0.000264,-0.000439
-0.00044,-0.000779,-0.001116,-0.000381,-0.001022,0.000143,0.000125,-0.000458,0.000359,0.000252,0.000211,-0.000624,0.000738,0.000386,-3e-06,-0.000363,-0.000328,-0.000305,-0.000827,-0.000674,-0.000268,-0.00129,0.000296,-0.000738,-0.000975,-0.00094,0.000134,0.000943,0.000208,0.000313,-0.000299,-0.000534,0.000349,-0.000126,2e-05,0.000567,0.000726,-5.5e-05,-0.000306,0.00015,-0.00104,-0.00011,0.000146,-0.000231,-8.1e-05,-0.000517,-9.8e-05,5.1e-05,-0.000362,0.000403,1e-05,0.000139,0.000585,2.6e-05,-0.000203,-0.000264,5.9e-05,0.000476,0.000134,-2e-06,0.000516,-0.000192,8e-05,-0.000247,0.000236,-0.00043,0.000343,-0.000284,-0.001057,-0.000956,-0.000931,-0.000732,-0.001023,-0.000633,-0.000393,-0.000473,0.000596,0.000132,-0.000228,-4.2e-05,-0.000688,-0.000186,-0.000305,-1.1e-05,0.000322,0.000794,0.000464,-0.000325,-0.000477,-0.000335,0.000112,-8.4e-05,-0.000343,-0.000428,-0.000165,-0.00049,-0.000569,-3.6e-05,-0.000349,-0.000298,-0.000109,0.000489,0.000189,-0.000153,-0.00039,-0.000622,-0.00022,-0.000172,-0.001027,-0.000405,-0.000358,-0.000305,-0.000751,-0.000554,-0.000579,0.000346,0.000129,-0.000487,-0.000335,-0.001046,-0.000113
-0.000533,-0.001136,-0.000711,-0.000564,-0.000161,-0.000773,-0.001354,-0.000476,4.5e-05,-0.000484,-0.000512,0.000266,-0.000293,-0.000357,-0.000106,0.000345,1.2e-05,0.000156,0.000165,0.000751,-0.000719,-0.000342,-0.000187,0.000304,0.000106,-0.000455,-0.000358,-6e-06,-0.000327,-5.5e-05,-4e-04,0.000396,0.000224,-0.000342,0.000462,-0.000541,0.000259,0.000148,-0.00014,-0.000192,0.000443,0,-0.000514,-0.000579,-0.00056,-0.000348,-0.000576,0.00017,-7.2e-05,-0.000425,-0.000619,0.000207,-0.000904,-9.1e-05,0.000228,0.00021,-0.000112,-4.5e-05,0.000103,0.000284,-0.000755,-0.000948,-1.4e-05,-0.000436,-0.000377,-0.000651,-6.6e-05,-2e-05,-0.000108,7.9e-05,0.000304,-0.000723,-0.000327,-5.2e-05,1e-05,-0.000328,-0.000294,-0.001076,-0.000147,-0.000179,-0.000361,2.2e-05,0.000122,-0.000783,-0.000445,5e-06,-0.000222,-0.00014,0.000389,0.001062,-0.000534,0.000557,0.00047,-0.000143,-4.4e-05,-0.000145,-0.000355,-0.000495,-0.000488,-0.000216,-0.000338,-0.001109,-0.000506,-0.000612,-0.000912,-5e-04,0.000562,-0.000768,0.000199,0.000257,-2e-06,-4.4e-05,0.000196,0.00015,6e-05,-0.000164,-0.000327,0.000231,-0.00061,0.000219,7.2e-05
-0.000304,0.000175,6e-06,7.2e-05,-0.000713,9e-06,5.6e-05,7.7e-05,2.3e-05,-0.000297,0.00011,-0.000342,-0.000241,-0.00014,-0.000799,-0.000401,-0.000771,3.9e-05,-0.000279,-0.00075,0.000479,0.000358,-0.000802,-0.000117,-0.000131,-0.000119,-0.00012,0.00017,-0.000373,-0.000521,0.000521,0.000188,-0.00036,-0.000173,-0.000271,-6.5e-05,6.6e-05,0.000268,0.000529,-4.9e-05,-0.00051,-0.000405,0.000795,5.2e-05,-0.000264,0.000201,6.2e-05,-0.00035,0.001601,0.00058,-0.000236,-0.000676,-0.000337,4.2e-05,-0.000512,-0.000126,-0.000934,-0.000339,-2.9e-05,-5.6e-05,-0.000128,-4.4e-05,6.8e-05,0.000283,5.8e-05,-0.000249,-5.9e-05,-0.000428,-0.000112,-9.8e-05,9.9e-05,-0.000352,-0.000406,-7.8e-05,-0.000296,-0.00048,-0.001286,2.7e-05,-0.000445,0.000234,-0.00063,-0.00049,-0.000388,-0.000261,-0.000201,-0.00029,-0.000278,-0.000353,-9.7e-05,-0.000183,-0.000299,5.7e-05,0.00051,0.000394,-0.000353,0.000238,-0.000458,-1.3e-05,-0.000117,0.000231,-0.000666,-0.000419,-0.000376,7e-06,0.000214,0.000139,-2e-06,0.000103,2e-06,-0.000232,0.000313,-0.000229,-0.000124,0.000109,-6.9e-05,-0.000557,0.000683,-0.000199,-4.2e-05,-0.000156,-0.000755
0.000454,-0.000335,-3.5e-05,-0.000617,-0.000163,-0.000777,8.2e-05,-0.000107,-1.4e-05,-0.000326,-0.000265,0.000276,-0.000211,-0.000663,-0.000281,-0.000324,-9.3e-05,-0.000351,0.000202,-0.000109,-0.000344,3.7e-05,-4.9e-05,-0.000176,0.000138,-2.8e-05,0.000233,-4.8e-05,-0.000441,-0.000379,-0.000607,-8.9e-05,-0.000234,0.000134,-9e-05,-0.000266,-0.000481,-0.000539,-0.000445,4.1e-05,1.6e-05,0.00022,-0.000356,-6.1e-05,5.2e-05,-0.000199,0.000249,-4.6e-05,-0.000366,-0.000389,-9e-05,-8e-06,-0.000313,-8.7e-05,-0.000131,0.00016,0.000165,5.7e-05,-0.00034,-9.1e-05,-0.00017,0.000415,0.000124,-0.000353,9e-06,8e-06,-2e-05,-0.000437,2e-06,-0.000285,4.1e-05,-0.000598,-3e-05,-0.000377,-0.000269,0.000134,-0.000351,-0.000335,-0.000356,0.000195,0.00022,-0.000243,-9.6e-05,-0.000305,-0.000407,-0.000318,-0.00035,-0.000114,-2e-06,0.000185,0.000101,-0.000125,-0.000549,-0.000138,-0.000234,-0.000395,-0.000424,-0.000192,3.1e-05,0.000137,-0.000173,4.2e-05,-0.000175,0.000358,-0.000175,0.000513,0.000187,-0.000209,0.000148,9.2e-05,7.3e-05,-7.9e-05,1.3e-05,0.000216,-8.9e-05,0.000366,-0.000456,7.7e-05,0.000336,-0.000172,-0.000105
-0.000131,-0.000466,1.1e-05,0.000335,0.000416,0.000541,3.4e-05,-0.000121,-3e-04,0.000138,-0.000147,0.00018,-0.000129,0.000397,-7.9e-05,2.5e-05,-0.000162,-0.000457,-0.000219,3.5e-05,0.000146,0.000467,-0.000318,-0.000144,-0.000111,-1.7e-05,0.000169,-0.00065,0.000253,0.000224,0.000408,3.5e-05,9.8e-05,0.000369,0.000324,-0.000113,3.4e-05,-0.000243,0.000143,-0.000468,0.000233,3.6e-05,0.000128,0.000306,8e-06,9.7e-05,-0.000267,9.2e-05,0.000167,-0.000344,0.000298,0.000395,0.000325,0.00027,-0.000308,-0.000263,7.5e-05,0.000121,0.000316,-6e-06,0.000215,0.000249,0.000243,-0.000158,5.6e-05,0.000339,-9.1e-05,-0.000174,-0.000287,0.000135,0.000276,0.000294,0.000124,-0.000567,-0.000228,0.000334,-0.000378,0.000167,-0.000394,-0.000504,-0.000184,-0.000595,1.2e-05,0.000224,0.000303,1.4e-05,-0.000196,0.000115,0.000243,-8.9e-05,-0.000205,-0.000314,-6.9e-05,-9.5e-05,0.000297,0.000381,0.000103,3e-05,6.5e-05,-0.000168,8e-05,3.8e-05,2.8e-05,-0.000134,-0.000213,5e-06,-0.000274,-5.5e-05,-0.000151,-0.000156,-0.00016,0.000177,-5e-05,-0.000125,9e-06,-0.000175,0.000165,-3.5e-05,-0.000115,0.000372,0.000185
-0.000165,0.00047,-0.000247,0.000251,7.3e-05,-0.000142,0.000216,0.000245,7.3e-05,0.00011,0.000145,0.000358,0.000103,0.000283,0.000269,0.000348,1e-04,-5.5e-05,8.9e-05,-0.000144,-0.000387,-0.000259,1e-06,-4.6e-05,5.8e-05,0.000412,0.000223,-0.000157,-0.000133,0.000127,0.000125,-0.000108,3e-05,-5.4e-05,0.000197,0.000208,9.5e-05,0.000289,-0.000577,-0.000145,-2e-04,5.9e-05,-0.000163,-0.000158,8e-06,-4.2e-05,-0.000218,0.00024,-0.000231,-0.000277,-1.5e-05,-3.9e-05,5e-04,4.3e-05,0.000236,-6.5e-05,0.000301,8e-05,-0.000286,0.000125,0.000323,-0.000271,-0.000274,9.1e-05,2e-06,0.000165,0.000325,0.000471,-0.000247,2.1e-05,0.000198,0.000286,-4.6e-05,7.7e-05,0.00025,5.3e-05,0.000288,6.3e-05,0.000555,-5e-05,0.000234,0.00014,0.000172,3e-06,0.000284,9e-05,8.9e-05,0.000289,0.000145,-0.000103,0.000518,0.000146,-9.4e-05,0.000242,0.00031,-7.6e-05,0.000278,-4.2e-05,0.000124,2.9e-05,2.6e-05,-6.6e-05,0.000248,5.8e-05,0.000138,-0.000201,-0.000347,0.000139,-0.000105,1.9e-05,-0.000141,-0.000129,0.000126,-0.000526,8.1e-05,-6.6e-05,-0.000152,-7.9e-05,-0.000199,-0.000457,0.000175
-2.5e-05,0.000248,0.000144,8.3e-05,0.00019,0.000312,2.1e-05,0.000144,-0.000308,3e-06,3.8e-05,0.000179,-0.000126,0.00014,0.000183,0.000189,8.1e-05,0.000449,-2.3e-05,0.000376,0.000507,3.3e-05,-6.9e-05,0,-4.6e-05,0.000102,-0.000169,-7.8e-05,3.2e-05,0.000169,7e-06,0.000141,-0.000183,4.6e-05,-0.000216,0.00016,0.000308,-0.000267,0.000494,-4.9e-05,5.4e-05,-0.000119,1.9e-05,0.000167,0.000203,0.000113,9.6e-05,-0.000205,-0.00022,4.3e-05,-9.4e-05,-0.000187,0.000275,5e-05,0.00022,-6e-06,-3.7e-05,2.6e-05,0.000181,-9e-06,-8.6e-05,3.7e-05,5.6e-05,0.000204,1.3e-05,-0.000112,7.4e-05,-2e-06,-1.7e-05,0.000235,-7.5e-05,0.000345,5.7e-05,0.000279,-0.000253,4.7e-05,0.000168,0.000169,6e-05,0.000147,0.00012,-1.2e-05,4.9e-05,0.000155,0.000177,-3.6e-05,6.8e-05,2.2e-05,0.000169,9.7e-05,-0.000102,8.3e-05,-0.000147,-7.5e-05,-1.1e-05,0.000188,0.000151,9.6e-05,-8.3e-05,0.000122,0.000354,3.5e-05,0.000159,-0.000113,0.000182,3.4e-05,-0.000337,1e-06,0.000115,0.000325,0.000295,9.2e-05,-0.000133,0.000335,0.000137,5e-06,0.000297,0.00039,0.000137,8.5e-05,6.8e-05
0.000199,-7.9e-05,7.7e-05,-5.6e-05,-0.000124,2e-06,-9.3e-05,0.000237,2.1e-05,0.000181,3e-06,0.000223,0.000136,-0.000115,4.9e-05,-4.3e-05,8.8e-05,0.000178,9.1e-05,-1.2e-05,-0.000252,8e-06,0.000366,0.00017,-4e-06,5e-05,0.000154,5.3e-05,4.7e-05,-5.6e-05,-0.000106,-6.9e-05,9.6e-05,-0.000183,2.7e-05,0.000129,-0.000176,0.000156,2e-06,0.000425,0.000133,5.7e-05,0.000218,1.1e-05,0.000108,-2.7e-05,7.8e-05,-2e-06,0.000312,0.000293,0.000121,0.00013,-0.00026,0.000101,-0.000229,8.6e-05,0.000243,-5.6e-05,4.1e-05,-6.1e-05,5.2e-05,-2.6e-05,-7.5e-05,3.5e-05,9e-06,4.2e-05,-5.5e-05,0.000203,0.00013,-0.000199,-3.7e-05,7.6e-05,-2.1e-05,0.000193,0.000232,-4.6e-05,0.000147,-0.000146,0.000111,0.000282,0.000125,-5.1e-05,0.000127,1.4e-05,-1.3e-05,3.2e-05,3.7e-05,-0.000347,-2.4e-05,-4.2e-05,0.000165,-4.9e-05,7.7e-05,-1.8e-05,-6.4e-05,-0.000124,6.3e-05,2.2e-05,4.5e-05,0.000104,9.2e-05,0.000193,-0.000166,3.8e-05,3.7e-05,0.000389,2.2e-05,0.000218,2.5e-05,-9e-05,-0.000195,0.000119,3.8e-05,-5.1e-05,-7.4e-05,3.5e-05,-6.8e-05,2.6e-05,-6.8e-05,0.000205,-2.1e-05
0.000223,0.000164,-9.6e-05,-0.000125,-3.1e-05,-2.1e-05,3.6e-05,5.9e-05,4.9e-05,-2.6e-05,4e-06,-0.000174,8.8e-05,6.3e-05,5.4e-05,-4.9e-05,-0.000121,8.1e-05,-0.000107,-4.6e-05,3e-05,-4.8e-05,0.000303,0.000136,4.1e-05,1.8e-05,0.000227,-9e-06,-0.000133,-8.5e-05,0.000197,3e-05,6.8e-05,9.3e-05,1e-06,-0.00011,-1e-06,6e-05,3.9e-05,-0.000175,-8.7e-05,6.7e-05,-0.000177,-4.6e-05,-1e-05,0.000289,-4.7e-05,0.000137,7.9e-05,-1e-05,-0.000189,-9.8e-05,-0.000122,-0.000185,0.000194,1.8e-05,3.3e-05,-0.000128,-5.6e-05,0.000135,-0.00014,0.000133,-3.8e-05,6.9e-05,0.000227,1e-05,-6.7e-05,-3.9e-05,0.000106,8.1e-05,0.000147,8.1e-05,3.2e-05,-3.5e-05,-0.000122,3.7e-05,0.000267,2.5e-05,-4.1e-05,-7.7e-05,-0.000274,9.3e-05,-7e-06,-1.4e-05,1e-05,8.6e-05,0.000123,-1e-04,3.4e-05,-5.8e-05,-0.000142,-9e-05,3.4e-05,-1.9e-05,-2.5e-05,0.000109,-4.6e-05,3e-06,1.6e-05,-1.8e-05,3.7e-05,-0.000111,8.4e-05,0.00012,7.9e-05,0,0.000132,-2.6e-05,-1.4e-05,-4.3e-05,0.000113,5.4e-05,6.6e-05,0.000105,6.2e-05,0.000114,-8e-06,-0.000239,8.6e-05,-0.000109,8.6e-05
-0.000103,-0.000118,5.8e-05,0.000127,8e-05,8.8e-05,1.4e-05,-7.4e-05,-1.6e-05,-1.6e-05,-4.8e-05,-2.4e-05,1.3e-05,5.8e-05,-7e-05,-3.9e-05,6.4e-05,-9.1e-05,4e-05,5.1e-05,0.000148,3.9e-05,2.6e-05,5.5e-05,1.5e-05,-7.5e-05,-5.6e-05,0.000166,0.000126,3.5e-05,-2.2e-05,2.4e-05,1.1e-05,5.9e-05,3e-05,4.8e-05,-5.1e-05,-9e-05,-2.6e-05,0.000121,-2.3e-05,-5.8e-05,6.5e-05,-7e-05,-3.5e-05,-0.00021,6e-05,3.1e-05,-0.000109,7e-05,-6.5e-05,1.3e-05,0.000107,1e-05,-5.6e-05,-8e-06,-0.000139,1.8e-05,-2.2e-05,-2.4e-05,6e-06,4.7e-05,3e-05,-3.9e-05,-0.000242,-9e-05,-2.5e-05,-9e-05,0.000157,-1.9e-05,4.9e-05,-8.4e-05,-2.4e-05,-9.2e-05,0.000118,-5.3e-05,5.3e-05,0.000149,4.2e-05,-0.000179,1.2e-05,0.000137,-1e-06,4.1e-05,-7.9e-05,-2.4e-05,3.7e-05,0.000132,-3.4e-05,9e-06,-4.5e-05,-0.000127,3e-05,-7e-06,-4e-05,-5.5e-05,-7.8e-05,3e-05,-2.8e-05,-8.2e-05,-9.3e-05,3.3e-05,4.3e-05,6.1e-05,-1.1e-05,-0.000108,2.2e-05,6.1e-05,1.2e-05,-8.5e-05,-3.7e-05,-2.4e-05,-6.8e-05,-4e-06,-5.2e-05,-7.6e-05,1.9e-05,0.000152,0.000107,3.9e-05,-2.1e-05
2.7e-05,-0.00017,0.000135,8.5e-05,-2e-05,-8.8e-05,0.000178,4e-06,-1.2e-05,-2.6e-05,5.4e-05,-3.8e-05,7.5e-05,-0.000137,2.8e-05,3e-05,-2.5e-05,4e-06,-4e-06,-5.2e-05,-0.000131,0.000109,4.4e-05,-0.000107,-6e-05,2.5e-05,-0.000104,0.000124,-5.2e-05,1.2e-05,-6.6e-05,-7.1e-05,-4.3e-05,4.7e-05,0,3e-06,9.1e-05,0.000109,1e-05,-6.9e-05,6.6e-05,0.000111,-0.000123,5e-05,1.1e-05,0.000159,9.1e-05,-0.000108,-0.000199,2.4e-05,-3e-06,3e-06,-1.3e-05,-5.8e-05,-7.5e-05,-3e-05,-4.1e-05,-3.7e-05,0.000112,-6.3e-05,-6.4e-05,-2.3e-05,-2e-06,-8.9e-05,4.8e-05,2.1e-05,6.6e-05,-3.1e-05,-3.9e-05,0.000153,-4e-05,-0.000127,2e-06,3.5e-05,-9.5e-05,4.8e-05,-3.5e-05,-9.5e-05,3e-05,1.5e-05,-1.9e-05,0.000105,1.9e-05,-6.7e-05,4.7e-05,0.000117,-2.5e-05,6.6e-05,5e-06,2e-06,-4.9e-05,6.6e-05,2.7e-05,0.000103,-3.4e-05,6e-06,-9.6e-05,-1.9e-05,1.6e-05,3.3e-05,-1e-04,5.2e-05,9e-06,-8e-06,-0.000108,0.000142,5.2e-05,-9.3e-05,1.8e-05,-1.1e-05,-8.1e-05,-6e-06,7e-06,-3.3e-05,-3.1e-05,4.4e-05,-7e-05,-9.7e-05,0.000106,3e-05,-5e-05
-0.000121,6.8e-05,-0.000128,-3.4e-05,7.5e-05,4.4e-05,-8.6e-05,-4e-06,0.000117,4e-06,3.2e-05,2.4e-05,4e-06,1e-06,-8.8e-05,-3.5e-05,-1.7e-05,1.9e-05,6.9e-05,8.9e-05,3.4e-05,-8.2e-05,-0.00013,6.4e-05,3.4e-05,3.6e-05,-9e-05,2.9e-05,3.4e-05,-1.6e-05,0.000115,3.4e-05,-4.7e-05,-6e-06,-5.1e-05,-8.2e-05,-3e-06,2.4e-05,-0.000124,8.1e-05,8e-06,-7e-05,9.9e-05,7e-05,-2.9e-05,-5.6e-05,-5e-05,1.6e-05,2.3e-05,-1.3e-05,4.1e-05,-4.2e-05,-0.000118,-1.9e-05,2.5e-05,-1e-05,8e-06,-6e-06,-5.1e-05,5.1e-05,2.9e-05,1e-06,3e-06,2.4e-05,1.5e-05,1.2e-05,-1.7e-05,1.1e-05,-0.000104,-2.4e-05,-2e-05,-2.6e-05,-7e-06,1e-05,6.5e-05,-2.4e-05,-8e-05,0.000167,-1.5e-05,3.5e-05,2.3e-05,1.6e-05,2e-06,2.5e-05,-1.6e-05,2e-06,-3.2e-05,5.8e-05,1e-05,4.1e-05,2.5e-05,1.4e-05,4.5e-05,-3.2e-05,1.6e-05,1.2e-05,-3.4e-05,-1e-06,2.1e-05,3.4e-05,-1.8e-05,-1e-05,-9.5e-05,-4.9e-05,8e-06,-3.9e-05,7.2e-05,-1.8e-05,-8.3e-05,5.3e-05,-4.9e-05,2.5e-05,1.7e-05,-7.7e-05,-2.6e-05,9e-06,1e-04,3.5e-05,-0.000103,-7.6e-05,-3.7e-05
3.2e-05,6e-05,1.3e-05,-3.5e-05,4.1e-05,-2.6e-05,5.8e-05,3.5e-05,3.3e-05,-1.4e-05,-3.4e-05,-1.5e-05,-2e-05,1.5e-05,3.7e-05,2.4e-05,-5.4e-05,5.2e-05,-4.3e-05,-0.000111,2.4e-05,-1.4e-05,2.5e-05,5.2e-05,-2.3e-05,4.8e-05,0.000118,-1e-05,2.8e-05,-1e-05,-0.000113,3e-06,7.1e-05,2.9e-05,7e-06,-5.1e-05,-0.000128,-1.8e-05,0.000114,-9.4e-05,4.2e-05,3.3e-05,-2.5e-05,-2.2e-05,1.2e-05,-4.6e-05,2e-06,4.1e-05,8e-06,-1e-06,3.3e-05,4.9e-05,0.000124,3e-06,-6.6e-05,1.9e-05,7.3e-05,4e-06,4.3e-05,1.2e-05,4.7e-05,-0.000104,-2.5e-05,1.7e-05,1.3e-05,2.3e-05,-4.7e-05,-6.2e-05,-8e-06,-3.4e-05,3.6e-05,5.5e-05,-2.9e-05,-1.6e-05,6e-06,5.3e-05,-0.00011,-3.9e-05,2.3e-05,8.1e-05,4.4e-05,-7e-05,-3e-06,1.4e-05,2.4e-05,2.1e-05,-5.4e-05,-1.2e-05,9e-06,-1.4e-05,2e-05,8e-06,-1e-05,5e-05,4.1e-05,-3e-06,4.3e-05,-1.1e-05,-1.3e-05,-5e-06,1.5e-05,-1.1e-05,9.4e-05,-1.6e-05,4.9e-05,-6e-05,9.3e-05,4e-05,8.1e-05,1e-05,-2.4e-05,-2.2e-05,-6e-05,9.5e-05,4.2e-05,-3.4e-05,-2e-05,-3e-06,-3.1e-05,2.1e-05,3.2e-05
6e-05,-5.3e-05,3.3e-05,1e-05,-3.6e-05,8.1e-05,6e-06,1.9e-05,-2.8e-05,4e-06,2.2e-05,-9e-06,9e-06,4.6e-05,-8e-06,9e-06,4.2e-05,-6e-06,1.6e-05,1.7e-05,4.7e-05,4.1e-05,-0.000116,-4.3e-05,1.3e-05,4e-05,4e-06,-1.1e-05,-4.3e-05,6.5e-05,5.9e-05,-3e-05,-2e-05,-2.7e-05,4.4e-05,2.8e-05,6.1e-05,-6e-05,1e-06,2.7e-05,-3.9e-05,-1.4e-05,-1e-06,0,2.9e-05,7.1e-05,4.9e-05,-8e-06,0.000125,-1.3e-05,-1.1e-05,-1.2e-05,0.000163,9e-06,-8e-06,3e-06,6.8e-05,2.6e-05,-7e-06,-3.5e-05,-1.4e-05,2.5e-05,-8e-06,-4.3e-05,-4.7e-05,-9e-06,-1.2e-05,4.3e-05,1.8e-05,3e-06,4e-05,2.6e-05,1.1e-05,-3.3e-05,-3e-06,-2.4e-05,2.8e-05,3.7e-05,-1.2e-05,-1.8e-05,7.2e-05,-1.8e-05,1.4e-05,4.2e-05,3.2e-05,-2.8e-05,-2.9e-05,-1.8e-05,-8e-06,7e-06,2.2e-05,-4.1e-05,2.7e-05,-3e-05,1.9e-05,-6e-06,3.5e-05,4e-06,1.4e-05,7e-06,5.1e-05,-1e-06,3.2e-05,2.2e-05,-1.7e-05,6.8e-05,9e-06,-5.2e-05,-3.2e-05,-2.2e-05,-4.4e-05,6e-06,3.2e-05,-2.5e-05,3e-06,2.2e-05,9e-06,1.9e-05,-5.2e-05,4.8e-05,6e-05
2.5e-05,5.6e-05,-3.1e-05,6.1e-05,2.7e-05,-1.5e-05,-4.6e-05,1.2e-05,1.9e-05,2.1e-05,-1.9e-05,-1.4e-05,-1.7e-05,1.4e-05,9.1e-05,1.4e-05,-1.6e-05,-4.9e-05,-2.6e-05,5e-05,-9.8e-05,-3.5e-05,1.9e-05,-2e-06,1.1e-05,-1e-06,-2e-05,-4.1e-05,5.1e-05,5.9e-05,4e-06,4e-05,-3.6e-05,-8e-06,-3.6e-05,2e-05,-1.3e-05,5.4e-05,-5.9e-05,-2.8e-05,9e-06,-6e-06,1.8e-05,-2e-05,2.6e-05,-1.7e-05,-2.3e-05,-3.6e-05,-4.8e-05,-1.5e-05,2.9e-05,-2.6e-05,-5.3e-05,-2.4e-05,3.3e-05,-1.6e-05,2e-05,2.1e-05,1.2e-05,8e-06,2.4e-05,4.3e-05,1.6e-05,1.5e-05,2e-05,1e-06,3.6e-05,6.8e-05,2.4e-05,3.1e-05,-9e-06,6.8e-05,4e-06,-2.2e-05,-1e-05,6e-06,2.9e-05,1e-05,1.6e-05,-5.6e-05,-3.9e-05,-5.4e-05,-5e-06,-9e-06,-1e-06,3.6e-05,4e-06,-1.2e-05,-4e-06,1.9e-05,2.8e-05,8e-06,1.6e-05,-5e-06,-1.9e-05,1.1e-05,5e-05,3e-06,-2e-06,-6e-06,6.5e-05,5.2e-05,-1e-05,3.1e-05,2.3e-05,5.6e-05,2.4e-05,4.4e-05,1.8e-05,1.8e-05,-1.1e-05,-9e-06,-4e-06,4.1e-05,2.2e-05,-4e-06,-6.1e-05,2e-06,1.8e-05,-5.3e-05,2.6e-05
5e-06,3.4e-05,1.3e-05,-9e-06,-4.5e-05,6e-06,4.6e-05,5e-06,3e-06,0,2e-05,-3.2e-05,0,-1.4e-05,-2.4e-05,-1e-06,1.4e-05,3.6e-05,2e-05,6e-06,8.4e-05,2.9e-05,5.3e-05,7e-06,-1.9e-05,1e-06,-3.4e-05,-3.9e-05,-3.6e-05,-2.6e-05,6e-06,-2.7e-05,1e-06,5e-06,-2.8e-05,-6e-06,5.6e-05,-5.6e-05,2.6e-05,-2.4e-05,-2e-06,1.3e-05,-7e-05,9e-06,9e-06,2.8e-05,-2.2e-05,2e-05,-6e-05,-3.8e-05,-2.4e-05,1e-05,-8e-05,-1.4e-05,6e-06,-3e-06,5.2e-05,-1.8e-05,2.5e-05,1.4e-05,-4.8e-05,3.7e-05,1e-05,3e-05,1.8e-05,-2.4e-05,-9e-06,3e-06,2.5e-05,3.8e-05,-2.8e-05,5e-06,-2.2e-05,3.9e-05,1e-05,-9e-06,5.3e-05,-1e-06,2e-05,-2.6e-05,-3.3e-05,5e-06,2.3e-05,1e-05,7e-06,-2.5e-05,5e-06,-6.7e-05,-8e-06,4e-06,-4.6e-05,1.9e-05,-4.4e-05,2.8e-05,-2e-05,1e-06,-1.3e-05,1.2e-05,-7e-06,-1.4e-05,3e-05,-2.8e-05,-2.5e-05,2.1e-05,3.1e-05,-6e-05,-4.6e-05,6e-06,-9e-06,-2.3e-05,1.6e-05,2e-05,-2.3e-05,-4.9e-05,-2.2e-05,2e-05,4.6e-05,-1.2e-05,-7e-06,4e-05,-1.5e-05
-5.4e-05,-5.4e-05,3.1e-05,-3.2e-05,-3e-06,-3e-06,9e-06,-1.4e-05,-2.3e-05,1e-06,7e-06,-2.4e-05,1e-06,-1.3e-05,2.5e-05,0,-1.6e-05,6.4e-05,-5e-06,-6e-06,-3e-05,2.4e-05,6.3e-05,1.4e-05,4e-06,-1.4e-05,-1e-05,-2.6e-05,-7e-06,-4.5e-05,-4.4e-05,0,2.3e-05,1.8e-05,1.4e-05,1.2e-05,-5.6e-05,-1.3e-05,-2.6e-05,-1e-06,-2.3e-05,-7e-06,6.2e-05,0,-3e-06,1.7e-05,2.3e-05,1.2e-05,-3.4e-05,1.7e-05,6e-06,4e-06,-1.8e-05,-5e-06,-4e-06,-1.1e-05,-2.3e-05,-1e-05,-2.6e-05,-1.3e-05,1.5e-05,-1.2e-05,-2e-06,3e-06,-2.7e-05,-6e-06,-2.5e-05,-1e-06,-3.4e-05,-2.8e-05,1.4e-05,-2.4e-05,1.4e-05,2.7e-05,-8e-06,1.5e-05,7.2e-05,2e-05,-6e-06,3.2e-05,-2.6e-05,4e-06,-5e-06,5e-06,-1.7e-05,4e-06,1.1e-05,-3e-06,-6e-06,1e-06,2.4e-05,2.6e-05,2.5e-05,-1.9e-05,-4e-06,-2e-05,-2.5e-05,-3e-06,6e-06,9e-06,-2.9e-05,-4e-06,4.1e-05,1e-06,-3.1e-05,-3.3e-05,-3.3e-05,2e-06,-2e-06,2.2e-05,-1.5e-05,-2e-06,1.7e-05,-9e-06,-5e-06,-8e-06,2.2e-05,-2e-06,6.8e-05,-2.3e-05,-4e-06
-4e-06,-4e-06,-7e-06,-6e-06,4.6e-05,7e-06,5.3e-05,3e-06,-2.8e-05,-5e-06,-1.9e-05,-9e-06,1.4e-05,1.2e-05,-2.6e-05,-1.4e-05,1.4e-05,3.2e-05,1.8e-05,-1.2e-05,1.2e-05,-3.5e-05,3.2e-05,6e-06,-6e-06,4e-06,-6e-06,-1e-05,2.6e-05,1e-06,4.7e-05,2e-05,1.3e-05,5e-06,1.9e-05,3e-06,1e-06,4.5e-05,4.8e-05,6e-05,1.7e-05,9e-06,-3.9e-05,8e-06,0,9e-06,7e-06,-9e-06,4.4e-05,1.9e-05,-3.3e-05,-1.8e-05,8e-06,-1.2e-05,-1.5e-05,7e-06,-2.5e-05,1e-05,8e-06,-6e-06,-1e-05,-4.2e-05,4e-06,5e-06,-1.6e-05,2e-06,-1.8e-05,-7e-06,-9e-06,-8e-06,2.3e-05,-2.6e-05,-1.3e-05,-1.2e-05,1.8e-05,-1.4e-05,2e-05,-1.7e-05,-1e-05,5.4e-05,3e-06,3.1e-05,-1.2e-05,-1.7e-05,1.1e-05,0,2.2e-05,5.7e-05,-5e-06,1.4e-05,-4.8e-05,-2.3e-05,-1.8e-05,1.4e-05,1.4e-05,1.9e-05,-4.2e-05,-3e-06,1e-06,1.9e-05,-1.8e-05,1.6e-05,-7e-06,-2e-05,-2e-06,3.2e-05,-5.1e-05,4e-06,8e-06,-1e-05,7e-06,-7e-06,-7e-06,0,-1.8e-05,-9e-06,-4e-05,1.9e-05,-1e-05,-1.1e-05,-5e-06
2.9e-05,1.9e-05,-1.2e-05,3.3e-05,-3e-06,1.2e-05,-2.5e-05,-6e-06,9e-06,1e-06,1.3e-05,-2.4e-05,1.1e-05,-1e-06,-2.6e-05,0,-2.9e-05,-2.8e-05,-2.1e-05,-1.2e-05,-2.5e-05,6e-06,-8e-06,1e-05,-5e-06,2e-05,-9e-06,1.1e-05,-1.5e-05,2.7e-05,-2.6e-05,-2.4e-05,-3.5e-05,-1e-06,-1e-05,-1e-05,4e-06,-3.4e-05,-2.1e-05,2.3e-05,2.9e-05,-1.6e-05,3.2e-05,4e-06,-6e-06,-5e-06,-1.6e-05,-1.1e-05,4.7e-05,-2e-06,4e-05,2e-06,-2.3e-05,-2e-06,1.8e-05,6e-06,-2e-05,8e-06,1.8e-05,1.9e-05,7e-06,-1.6e-05,-6e-06,-5e-06,3.4e-05,-1e-06,1.7e-05,-3.7e-05,2.1e-05,1e-05,-1e-05,-1e-05,-1.7e-05,-1.7e-05,-1.7e-05,1.3e-05,-1e-06,4.5e-05,4e-06,-2.3e-05,-9e-06,4.9e-05,1.2e-05,8e-06,-1.6e-05,1.4e-05,1.4e-05,4.7e-05,-7e-06,-2.1e-05,2e-05,-6e-06,9e-06,0,-3e-06,-1e-05,-2.2e-05,-2e-06,-3e-06,-8e-06,-5.3e-05,1.2e-05,-3e-06,-3e-06,1.9e-05,2e-05,-1e-06,-1.1e-05,-2e-06,-1.9e-05,1.5e-05,8e-06,-1.7e-05,2.5e-05,9e-06,1.9e-05,1.4e-05,-4e-05,-1.8e-05,3.3e-05,-2.1e-05
3e-06,-4.1e-05,-7e-06,1.9e-05,2e-05,-1.9e-05,2e-06,-4e-06,-1e-06,-2e-06,-4e-06,-6e-06,3e-06,-2.7e-05,-1.2e-05,1.2e-05,1e-06,-1.9e-05,3e-06,2e-05,4.2e-05,9e-06,1.6e-05,-1.2e-05,8e-06,5e-06,1e-05,4e-05,1e-05,3e-06,-2.2e-05,1.7e-05,8e-06,-8e-06,-1.6e-05,-1.6e-05,8e-06,2.1e-05,1.8e-05,-1.6e-05,-1.7e-05,1.3e-05,-3e-05,7e-06,0,2e-06,1.1e-05,1.2e-05,5e-06,1.9e-05,-2.6e-05,0,3.4e-05,3e-06,-1.7e-05,-9e-06,7e-06,-4e-06,-1.6e-05,-1.8e-05,1e-05,8e-06,-4e-06,-3.6e-05,-3.1e-05,5e-06,1e-05,-1.3e-05,5e-06,2.2e-05,-1.2e-05,-2.2e-05,1e-05,-5e-06,1.5e-05,-2e-06,-4.2e-05,-2.1e-05,-5e-06,-3.2e-05,2.6e-05,2.8e-05,-1e-06,-6e-06,1.2e-05,-1e-05,-1.2e-05,6e-06,0,1.7e-05,-5e-06,-6e-06,1.3e-05,0,1e-06,4e-06,-1.3e-05,2e-06,3e-06,-1.7e-05,0,-2e-05,-2e-06,1.1e-05,-1.8e-05,-2.7e-05,-1.3e-05,6e-06,-4e-06,7e-06,1.2e-05,-2e-06,1.5e-05,5e-06,7e-06,-9e-06,4e-06,1.9e-05,-2.4e-05,-1.3e-05,-5e-06
1.8e-05,1.7e-05,1.3e-05,-2.5e-05,-1e-05,1.5e-05,1e-05,4e-06,2e-06,-5e-06,6e-06,9e-06,3e-06,1.3e-05,0,-5e-06,-1.2e-05,1.7e-05,4e-06,4e-06,-3.1e-05,-1.8e-05,-3.3e-05,-6e-06,1e-06,1.5e-05,1.9e-05,2.7e-05,6e-06,-1.1e-05,3.6e-05,-5e-06,1.2e-05,-3e-06,2e-06,-2e-06,2.6e-05,3.4e-05,-4.5e-05,-2e-06,1.6e-05,-5e-06,-6e-06,-1.5e-05,9e-06,2e-05,1.5e-05,3e-06,-2e-05,-3e-06,2.7e-05,-2e-06,2.2e-05,4e-06,-3.2e-05,-4e-06,3.4e-05,7e-06,-4e-06,1e-06,-1e-05,2e-05,8e-06,-4e-06,-4e-06,2e-06,-1.2e-05,1.6e-05,1e-05,-7e-06,2e-06,2.2e-05,-1.5e-05,7e-06,-1.1e-05,2e-06,-3.6e-05,1.7e-05,9e-06,-1.3e-05,3.2e-05,-1.2e-05,-9e-06,1.4e-05,-3e-06,9e-06,-7e-06,-6.4e-05,-5e-06,-7e-06,3e-06,1.8e-05,-1.3e-05,-9e-06,9e-06,-5e-06,2.8e-05,3e-06,7e-06,1e-05,1.1e-05,0,1.6e-05,1.5e-05,2e-06,-3e-06,2.1e-05,-1.9e-05,1.1e-05,3e-06,-3e-06,-4e-06,-6e-06,2e-06,2e-06,5e-06,-1.4e-05,2e-06,1.6e-05,-9e-06,1.4e-05
-3.3e-05,3e-05,-2e-06,-1.7e-05,-3.1e-05,1e-06,-2.7e-05,0,-3e-06,4e-06,4e-06,-2.2e-05,-2e-06,1.1e-05,2.3e-05,-4e-06,4e-06,8e-06,6e-06,-1.6e-05,6e-06,2.5e-05,-4.4e-05,7e-06,-1.4e-05,-1e-06,-4.3e-05,4e-06,-7e-06,1.4e-05,-2.7e-05,-6e-06,1e-06,-2e-06,1.7e-05,-4e-06,-5.6e-05,-2.4e-05,3.4e-05,9e-06,-1e-06,-5e-06,2.1e-05,-1e-06,6e-06,-2.2e-05,-1.2e-05,-6e-06,-4.7e-05,3e-06,-1.1e-05,0,7e-06,5e-06,2.4e-05,0,1.2e-05,1e-05,2.5e-05,9e-06,1.8e-05,2.1e-05,-7e-06,2.1e-05,1.2e-05,-1e-05,-1.5e-05,0,-6e-06,-1.2e-05,6e-06,1.9e-05,-2e-06,-1e-06,1.2e-05,-4e-06,-1.1e-05,-4e-06,-1e-05,2.3e-05,-1e-05,-1.6e-05,1.3e-05,-1e-06,4e-06,1e-06,-8e-06,-3e-05,-1e-06,-2e-06,3.2e-05,-6e-06,5e-06,7e-06,2e-06,1e-05,1.4e-05,-6e-06,-6e-06,7e-06,2.1e-05,2.5e-05,-3e-06,8e-06,1.6e-05,1e-05,5e-06,1.6e-05,-1e-05,8e-06,1.9e-05,-1e-05,-1.1e-05,-2.4e-05,0,-4e-06,2.4e-05,0,-2e-06,1.8e-05,1.9e-05
0,-1.8e-05,-8e-06,1.5e-05,1e-05,1.1e-05,3.2e-05,-2e-06,1.3e-05,3e-06,-1.1e-05,1.1e-05,-5e-06,-1e-06,2e-06,6e-06,-1.4e-05,2e-06,-7e-06,-3e-06,9e-06,-3e-06,-8e-06,6e-06,9e-06,-8e-06,-8e-06,-1e-06,3e-06,2.6e-05,9e-06,8e-06,-1.4e-05,3e-06,0,1e-06,2.8e-05,2e-06,-2.7e-05,-2.7e-05,-1.9e-05,1.1e-05,-3e-05,1.2e-05,5e-06,2e-05,-3e-06,-3e-06,3e-05,-1e-06,0,-8e-06,3e-06,1e-06,-1.6e-05,-4e-06,2.1e-05,-5e-06,-2.8e-05,-7e-06,-1.9e-05,-8e-06,8e-06,-1e-06,-1.3e-05,-4e-06,5e-06,1.9e-05,-2.2e-05,1e-06,4e-06,1e-06,1e-06,-4e-06,-8e-06,4e-06,-3e-06,0,1.1e-05,2.8e-05,-2.6e-05,-2.6e-05,-5e-06,6e-06,5e-06,1e-06,-1.2e-05,2.4e-05,-2e-06,0,-3.9e-05,-7e-06,6e-06,0,-8e-06,-1.4e-05,9e-06,3e-06,-4e-06,-6e-06,3.2e-05,-1.2e-05,3e-06,-6e-06,-5e-06,-1e-05,2.8e-05,-4e-06,-4e-06,4e-06,-1e-06,1.2e-05,1e-05,1e-06,-1e-06,-2e-06,-6e-06,-5e-06,8e-06,-1.3e-05,1e-05
2e-06,-3e-06,1.4e-05,1.6e-05,-5e-06,-1.2e-05,6e-06,-3e-06,9e-06,-2e-06,8e-06,-3e-06,-2e-06,-4e-06,2.8e-05,2e-06,8e-06,2e-06,-1e-06,8e-06,-1e-06,-1.8e-05,9e-06,2e-06,-6e-06,-2e-06,6e-06,-2e-06,0,-4e-06,-2e-06,-6e-06,-7e-06,3e-06,-1.7e-05,8e-06,3e-06,5e-06,3.9e-05,-1.1e-05,7e-06,-1e-05,3.3e-05,-6e-06,1e-06,5e-06,1e-05,4e-06,2e-05,-7e-06,-1e-06,2e-06,-3.1e-05,-1e-06,0,2e-06,5e-06,-1.2e-05,1.6e-05,-2e-06,8e-06,-2.2e-05,-3e-06,-4e-06,1.2e-05,1e-06,8e-06,1.4e-05,5e-06,1e-05,-1.2e-05,4e-06,-1e-05,-2e-06,3e-06,-2e-06,2.6e-05,0,-4e-06,-1.3e-05,-2e-06,-4e-06,-3e-06,-6e-06,-9e-06,-7e-06,-3e-06,1.4e-05,0,-4e-06,2.7e-05,-1.1e-05,2e-06,-5e-06,-3e-06,1.5e-05,-6e-06,2e-06,7e-06,-3e-06,1e-06,-9e-06,-1e-06,-7e-06,-4e-06,-1.8e-05,1.2e-05,-8e-06,1.4e-05,-1.4e-05,-1e-06,-7e-06,-3e-06,1e-05,-4e-06,6e-06,-1.3e-05,1e-06,4e-06,1e-06,-8e-06
1.4e-05,1.7e-05,0,-6e-06,1.3e-05,-2e-06,5e-06,-2e-06,-3e-06,-2e-06,-1e-06,-6e-06,3e-06,-1e-06,-2e-05,-5e-06,-8e-06,-1.3e-05,2e-06,1.5e-05,-1e-05,1.7e-05,2.4e-05,-1.1e-05,-1e-06,-3e-06,3.9e-05,-1.1e-05,-5e-06,-2.7e-05,4e-06,3e-06,1.8e-05,-3e-06,4e-06,7e-06,1.4e-05,-1.5e-05,-3.1e-05,-2e-06,-4e-06,5e-06,-3.3e-05,-2e-06,0,-2e-05,-3e-06,1e-06,1.4e-05,3e-06,-1.1e-05,0,-3.4e-05,2e-06,1e-05,-2e-06,-1.8e-05,-2e-06,-6e-06,7e-06,-1.1e-05,-8e-06,-5e-06,7e-06,-1.8e-05,-5e-06,-2e-06,-7e-06,6e-06,7e-06,-2e-06,-6e-06,-1e-06,1e-06,-1e-06,0,2.2e-05,-5e-06,4e-06,-1.6e-05,-7e-06,-2.4e-05,6e-06,-3e-06,3e-06,5e-06,5e-06,1.5e-05,1e-06,0,-2.5e-05,6e-06,-4e-06,9e-06,-1e-06,-1.3e-05,-1.7e-05,2e-06,-1e-06,3e-06,-8e-06,9e-06,-3e-06,1e-06,1.2e-05,2.5e-05,1.4e-05,1.9e-05,-8e-06,6e-06,4e-06,-2e-06,-1e-05,7e-06,-4e-06,-5e-06,-6e-06,-1e-06,-1e-05,9e-06,-8e-06
1.4e-05,-2.2e-05,-1.5e-05,-1.5e-05,1.9e-05,9e-06,-8e-06,-2e-06,-7e-06,3e-06,-1e-06,1.2e-05,-1.1e-05,0,1e-06,0,-4e-06,8e-06,-1e-06,-6e-06,3e-06,-7e-06,6e-06,4e-06,3e-06,3e-06,-1.4e-05,-1.5e-05,3e-06,-9e-06,-2.1e-05,0,-8e-06,1e-06,1.4e-05,-1e-06,-1.9e-05,-8e-06,9e-06,9e-06,3e-06,0,1.5e-05,6e-06,-2e-06,3e-05,-9e-06,-2e-06,-1.9e-05,-1e-05,1.8e-05,-5e-06,1.6e-05,-1e-06,-8e-06,-3e-06,-1.6e-05,2e-06,3e-06,-4e-06,4e-06,7e-06,6e-06,-6e-06,9e-06,-2e-06,-1.2e-05,-1.6e-05,6e-06,-1.4e-05,1.1e-05,-1.6e-05,-4e-06,6e-06,2e-06,1e-06,2.1e-05,9e-06,-1e-06,-1.6e-05,-3e-06,5e-06,-5e-06,4e-06,-7e-06,-8e-06,4e-06,4e-06,-1e-06,2e-06,0,3e-06,2e-06,-4e-06,5e-06,7e-06,-2.5e-05,-4e-06,-4e-06,-1e-06,-2.2e-05,8e-06,5e-06,5e-06,-6e-06,4e-06,-6e-06,-1.2e-05,3e-06,-3e-06,-1e-06,3e-06,9e-06,1e-06,2e-06,4e-06,2.3e-05,-1e-06,-1.1e-05,-1.4e-05,-3e-06
-2e-05,-7e-06,1e-05,3e-06,-1.4e-05,-1e-06,-7e-06,0,8e-06,0,4e-06,0,8e-06,1e-06,-2.5e-05,1e-06,-7e-06,1.5e-05,3e-06,-1.6e-05,1.3e-05,-6e-06,1.3e-05,-4e-06,-4e-06,3e-06,-2.3e-05,-1e-05,0,1.8e-05,2.4e-05,-2e-06,-4e-06,-6e-06,-3e-06,-4e-06,-6e-06,7e-06,-7e-06,-9e-06,1.1e-05,-5e-06,-9e-06,1e-06,-3e-06,-2.2e-05,6e-06,-2e-06,-2.1e-05,8e-06,-1.6e-05,-2e-06,2.8e-05,0,-4e-06,1e-06,-1.4e-05,-1e-06,0,-3e-06,6e-06,2e-05,-5e-06,-4e-06,-4e-06,4e-06,0,-1e-06,7e-06,0,-2e-06,-3e-06,-6e-06,0,-2e-06,1e-06,5e-06,-1e-05,0,1.8e-05,2e-05,1.5e-05,-1e-06,-6e-06,4e-06,2e-06,2e-06,2e-06,0,-5e-06,1.2e-05,0,-4e-06,-5e-06,1e-06,-4e-06,-8e-06,1e-06,4e-06,-2e-06,-1.8e-05,-1.4e-05,0,9e-06,-7e-06,-2.3e-05,-6e-06,5e-06,-2e-06,1e-06,-1.1e-05,1e-06,-3e-06,-1.1e-05,0,-3e-06,-1.7e-05,-6e-06,3e-06,9e-06,-7e-06
-6e-06,1.7e-05,5e-06,1.1e-05,-4e-06,-3e-06,8e-06,-1e-06,-1e-06,-3e-06,-7e-06,-1e-06,3e-06,-2e-06,6e-06,0,2e-06,3e-06,-3e-06,7e-06,-2e-05,2e-05,9e-06,5e-06,-3e-06,1e-06,-4e-06,-3e-06,1e-06,1.3e-05,-1.3e-05,6e-06,0,1e-06,-1e-05,2e-06,1.5e-05,0,1e-05,2.1e-05,-3e-06,5e-06,-1e-06,-8e-06,2e-06,8e-06,3e-06,0,-5e-06,1e-06,1.9e-05,2e-06,-4e-06,1e-06,0,-1e-06,4e-06,-2e-06,-1e-06,3e-06,-6e-06,0,3e-06,4e-06,0,-2e-06,6e-06,-1e-05,-1.3e-05,-1e-06,-1e-05,4e-06,-1e-06,-3e-06,0,0,-1.9e-05,9e-06,-1e-06,1.7e-05,1.8e-05,2.2e-05,5e-06,4e-06,-2e-06,-2e-06,4e-06,-1e-05,1e-06,4e-06,-1.3e-05,-7e-06,-1e-06,4e-06,-2e-06,6e-06,1e-06,2e-06,1e-06,5e-06,-8e-06,-1e-06,-4e-06,-1e-06,1e-05,-3e-06,-1.6e-05,-5e-06,4e-06,2e-06,-3e-06,-3e-06,-8e-06,-4e-06,3e-06,-1e-06,-9e-06,9e-06,1.5e-05,3e-06,-1e-06
-3e-06,-4e-06,-8e-06,0,-1e-05,-2e-06,-1e-05,-2e-06,-1.2e-05,1e-06,5e-06,1.1e-05,-8e-06,-5e-06,-8e-06,0,-8e-06,-1.4e-05,3e-06,4e-06,1.2e-05,-1.1e-05,-1.8e-05,6e-06,4e-06,-1e-06,1.4e-05,3e-06,2e-06,-8e-06,-1e-06,-6e-06,5e-06,0,1e-06,-3e-06,-8e-06,-5e-06,-2e-06,1.4e-05,1e-06,-3e-06,1.2e-05,4e-06,1e-06,-1e-06,-6e-06,2e-06,1.9e-05,0,-1.9e-05,-2e-06,-4e-06,0,-4e-06,-2e-06,1e-05,4e-06,-4e-06,2e-06,8e-06,-1e-05,1e-06,-7e-06,-3e-06,-4e-06,0,3e-06,-4e-06,1.2e-05,3e-06,-2e-06,-7e-06,-2e-06,0,-1e-06,-1.4e-05,-7e-06,1e-06,-4e-06,-9e-06,1e-05,-4e-06,-3e-06,1e-06,0,0,-3.5e-05,0,-2e-06,2.2e-05,0,9e-06,2e-06,0,-8e-06,6e-06,-1e-06,-3e-06,-1e-06,1.7e-05,1.4e-05,-1e-06,-4e-06,-3e-06,1.5e-05,-9e-06,3e-06,-3e-06,-8e-06,-4e-06,-3e-06,9e-06,2e-06,0,4e-06,1.8e-05,-6e-06,0,-9e-06,7e-06
1.1e-05,-5e-06,4e-06,-9e-06,-7e-06,7e-06,1.3e-05,0,2e-06,1e-06,0,-5e-06,1.1e-05,8e-06,1.7e-05,0,-2e-06,-1.1e-05,-4e-06,8e-06,-1e-06,-6e-06,-1.5e-05,-6e-06,-4e-06,-4e-06,1e-05,8e-06,-4e-06,-7e-06,9e-06,2e-06,0,1e-06,9e-06,-3e-06,1.8e-05,1.8e-05,0,1e-06,0,1e-06,-2.5e-05,-1e-06,2e-06,-7e-06,0,-1e-06,1.3e-05,5e-06,1.5e-05,-2e-06,1.3e-05,0,-8e-06,1e-06,7e-06,1e-06,1.1e-05,-3e-06,-1.2e-05,-1.1e-05,-4e-06,-6e-06,-4e-06,0,-5e-06,1.1e-05,7e-06,-5e-06,4e-06,1e-05,-1e-06,-1e-06,2e-06,1e-06,-2e-05,4e-06,-1e-06,-1.2e-05,-1e-05,7e-06,0,6e-06,1e-06,-1e-06,-3e-06,-1e-06,1e-06,1e-06,-1.9e-05,2e-06,-1e-05,-3e-06,1e-06,6e-06,1.3e-05,-1e-06,0,-5e-06,1.1e-05,-5e-06,8e-06,-3e-06,-2e-06,-1e-06,-6e-06,0,1e-06,7e-06,-1e-05,7e-06,-4e-06,1.1e-05,2e-06,-2e-06,-2.1e-05,-1e-06,3e-06,7e-06,7e-06
1.1e-05,1.1e-05,2e-06,-2e-06,1.7e-05,-2e-06,2e-06,0,6e-06,0,-2e-06,4e-06,-6e-06,2e-06,8e-06,0,-2e-06,1.2e-05,7e-06,-1.1e-05,1e-06,1.5e-05,-1.4e-05,-4e-06,1e-06,-2e-06,-3e-06,7e-06,3e-06,9e-06,-5e-06,3e-06,-1.2e-05,0,1e-06,1e-06,-2.5e-05,-5e-06,-3e-06,-1.3e-05,-1.1e-05,-2e-06,2.2e-05,1e-06,2e-06,1e-06,5e-06,-1e-06,-8e-06,-3e-06,-1.3e-05,-1e-06,-1.3e-05,0,-1e-06,-3e-06,1e-05,-3e-06,-1.4e-05,1e-06,1e-05,-2e-06,2e-06,6e-06,3e-06,-2e-06,-4e-06,6e-06,-3e-06,-5e-06,-3e-06,5e-06,-6e-06,3e-06,-2e-06,-2e-06,-5e-06,-3e-06,0,-1.3e-05,-5e-06,-7e-06,4e-06,-5e-06,-3e-06,-2e-06,-4e-06,3e-05,0,3e-06,1.4e-05,4e-06,4e-06,2e-06,-4e-06,0,1e-06,0,1e-06,1e-06,1.9e-05,-8e-06,-4e-06,0,5e-06,-9e-06,-1e-06,-5e-06,1e-06,2e-06,-2e-06,-6e-06,-8e-06,-2e-06,-4e-06,1e-06,1.5e-05,2e-06,-9e-06,-2e-06,6e-06
-1.3e-05,-1e-06,-3e-06,8e-06,6e-06,-3e-06,-6e-06,0,-4e-06,-1e-06,3e-06,3e-06,-2e-06,-6e-06,2e-06,-1e-06,-2e-06,3e-06,-6e-06,-7e-06,-1e-05,-1.3e-05,9e-06,1e-06,0,-3e-06,-3e-06,4e-06,-2e-06,8e-06,-2e-06,-7e-06,7e-06,0,-1e-05,2e-06,6e-06,-4e-06,-8e-06,1e-06,5e-06,3e-06,-2.2e-05,3e-06,-1e-06,-6e-06,-3e-06,1e-06,-9e-06,4e-06,7e-06,-1e-06,-2.7e-05,-2e-06,5e-06,-1e-06,-7e-06,-2e-06,5e-06,2e-06,-6e-06,1.2e-05,0,3e-06,2e-06,-3e-06,3e-06,0,4e-06,-2e-06,-1e-06,-4e-06,-4e-06,1e-06,1e-06,2e-06,9e-06,0,-2e-06,1.4e-05,-7e-06,-4e-06,-5e-06,1e-06,3e-06,4e-06,-3e-06,2.6e-05,1e-06,-4e-06,-1.3e-05,-3e-06,-1e-06,1e-06,0,-5e-06,-4e-06,2e-06,1e-06,3e-06,1e-06,4e-06,-2e-06,5e-06,-1e-06,5e-06,5e-06,1e-05,2e-06,-2e-06,0,1e-06,9e-06,-2e-06,-1e-06,-2e-06,-4e-06,1e-06,-2e-06,-1e-06,-4e-06
-3e-06,-8e-06,-3e-06,1e-06,0,-1e-06,-1e-06,1e-06,-4e-06,1e-06,-3e-06,-4e-06,2e-06,1e-06,-2e-06,0,-6e-06,-8e-06,4e-06,1.1e-05,1.4e-05,2e-06,1e-06,3e-06,-3e-06,-1e-06,-6e-06,3e-06,-3e-06,-9e-06,2e-06,4e-06,1e-06,-2e-06,0,2e-06,6e-06,8e-06,1.7e-05,-5e-06,0,-1e-06,1.5e-05,-3e-06,-1e-06,2e-06,-2e-06,2e-06,-1e-05,-7e-06,-1e-06,-1e-06,9e-06,-2e-06,-7e-06,0,-9e-06,2e-06,7e-06,-4e-06,3e-06,9e-06,-3e-06,-4e-06,-1.2e-05,1e-06,1e-06,0,0,4e-06,-2e-06,-2e-06,0,-2e-06,-1e-06,-2e-06,9e-06,1e-06,0,9e-06,-3e-06,-2e-05,1e-06,-1e-06,-3e-06,-5e-06,1e-06,0,1e-06,4e-06,3e-06,-2e-06,1e-06,-4e-06,0,6e-06,-1.2e-05,0,-1e-06,-2e-06,-1.4e-05,8e-06,-1e-06,3e-06,-2e-06,4e-06,5e-06,-9e-06,-6e-06,4e-06,-4e-06,2e-06,-5e-06,-9e-06,0,1e-06,-1e-06,-3e-06,-1e-05,4e-06,-6e-06
-5e-06,3e-06,3e-06,-4e-06,-2e-06,3e-06,-3e-06,-1e-06,8e-06,0,4e-06,4e-06,-4e-06,3e-06,-1.3e-05,0,-1e-06,1e-06,-6e-06,7e-06,-7e-06,1.2e-05,1e-05,0,0,1e-06,-6e-06,2e-06,4e-06,-1.3e-05,4e-06,0,0,1e-06,9e-06,0,5e-06,-8e-06,-1.4e-05,-1.1e-05,-2e-06,-1e-06,-6e-06,0,-2e-06,-1.1e-05,2e-06,-2e-06,6e-06,2e-06,-4e-06,-2e-06,1.6e-05,-1e-06,-3e-06,-1e-06,-1.8e-05,1e-06,-1.2e-05,2e-06,0,0,4e-06,0,1e-05,-1e-06,-1e-06,-8e-06,-8e-06,6e-06,2e-06,-1e-06,-9e-06,-1e-06,1e-06,2e-06,2.1e-05,-3e-06,0,2e-06,1.3e-05,-7e-06,3e-06,-1e-06,2e-06,3e-06,0,-3.3e-05,-1e-06,-2e-06,2e-06,-1e-06,2e-06,1e-06,2e-06,-4e-06,-1e-05,-2e-06,0,-2e-06,-1.1e-05,-8e-06,5e-06,-1e-06,1e-06,-8e-06,8e-06,5e-06,3e-06,-9e-06,0,0,-5e-06,3e-06,2e-06,1e-06,-8e-06,2e-06,1.3e-05,-4e-06,-1e-06
9e-06,-2e-06,2e-06,-2e-06,-1.5e-05,0,3e-06,1e-06,1e-06,-1e-06,-1e-06,-2e-06,0,-3e-06,-3e-06,-1e-06,-2e-06,2e-06,7e-06,-6e-06,-5e-06,-1.5e-05,9e-06,-1e-06,0,-1e-06,1e-05,-3e-06,-3e-06,5e-06,-9e-06,-3e-06,-4e-06,-1e-06,0,1e-06,-6e-06,-3e-06,1.4e-05,-6e-06,8e-06,1e-06,-6e-06,2e-06,-1e-06,2e-06,1e-06,-1e-06,1.1e-05,0,8e-06,-1e-06,6e-06,-2e-06,6e-06,-1e-06,-9e-06,1e-06,7e-06,2e-06,-2e-06,-1.2e-05,-3e-06,-3e-06,-2e-06,-3e-06,-3e-06,-8e-06,6e-06,-7e-06,3e-06,-8e-06,1e-06,1e-06,-1e-06,-3e-06,6e-06,2e-06,0,-1.1e-05,1.6e-05,-9e-06,-4e-06,2e-06,-1e-06,-2e-06,-1e-06,-1.3e-05,0,1e-06,-5e-06,2e-06,-1e-06,3e-06,1e-06,3e-06,-1.3e-05,0,2e-06,2e-06,-1.7e-05,-5e-06,-5e-06,-4e-06,1e-06,-2e-06,1e-06,2e-06,3e-06,4e-06,6e-06,-1e-06,8e-06,3e-06,0,-1e-06,7e-06,0,2e-06,1e-06,-4e-06
9e-06,-2e-06,-2e-06,2e-06,-2e-06,-2e-06,-1e-06,0,-3e-06,0,-2e-06,-1e-06,1e-06,-1e-06,-8e-06,0,-4e-06,-4e-06,-6e-06,-9e-06,6e-06,4e-06,1e-06,0,-1e-06,-1e-06,1.2e-05,-6e-06,1e-06,1.4e-05,1e-05,3e-06,-2e-06,0,-8e-06,-1e-06,-1.2e-05,3e-06,-2.1e-05,8e-06,-2e-06,-1e-06,1.1e-05,-1e-06,0,-3e-06,-3e-06,3e-06,5e-06,-4e-06,-1.1e-05,0,0,-1e-06,-8e-06,0,-2e-06,0,-1e-06,-2e-06,7e-06,-8e-06,-1e-06,-2e-06,-7e-06,0,1e-06,0,0,-1e-06,-5e-06,4e-06,-4e-06,3e-06,0,3e-06,-3e-06,-4e-06,1e-06,-1.1e-05,-6e-06,9e-06,1e-06,-3e-06,-1e-06,0,2e-06,8e-06,0,-1e-06,9e-06,1e-06,-1e-06,-2e-06,-1e-06,-6e-06,3e-06,1e-06,-1e-06,0,2e-06,1e-05,1e-06,-2e-06,-2e-06,1.1e-05,2e-06,-6e-06,-4e-06,2e-06,0,1e-06,-4e-06,7e-06,2e-06,0,3e-06,1e-06,6e-06,2e-06,-2e-06
-8e-06,3e-06,-3e-06,1e-06,8e-06,0,-2e-06,1e-06,-2e-06,0,3e-06,1e-06,1e-06,2e-06,1.6e-05,0,-5e-06,-2e-06,6e-06,2e-06,2e-06,9e-06,-3e-06,0,0,-2e-06,-1e-06,-2e-06,3e-06,-1e-06,-4e-06,1e-06,5e-06,1e-06,0,-2e-06,1.5e-05,0,1.8e-05,6e-06,-6e-06,1e-06,-1.9e-05,-4e-06,0,-1.2e-05,0,1e-06,-7e-06,4e-06,1.4e-05,0,-4e-06,0,-2e-06,-2e-06,4e-06,0,-1e-06,-1e-06,-8e-06,5e-06,4e-06,0,0,0,0,6e-06,-3e-06,-4e-06,-2e-06,4e-06,-6e-06,-2e-06,0,-2e-06,-7e-06,2e-06,0,8e-06,-7e-06,7e-06,3e-06,4e-06,2e-06,0,1e-06,6e-06,0,1e-06,-1.1e-05,-1e-06,-1e-06,-1e-06,-1e-06,9e-06,2e-06,0,-1e-06,-1e-06,1e-05,0,-2e-06,2e-06,0,1e-06,-7e-06,6e-06,-1e-06,-5e-06,2e-06,3e-06,-6e-06,-6e-06,-1e-06,0,-1.7e-05,-2e-06,-1e-05,-2e-06,5e-06
