-4e-05,-9.9e-05,-0.000166,-0.000291,-0.000457,-0.000401,-0.000383,-0.000409,-0.000389,-0.000471,-0.000598,-0.000454,-0.000383,-0.000292,-0.00029,-0.000275,-0.00025,-0.000179,-0.000176,-0.000157,-0.000196,-0.000164,-0.000146,-0.000168,-0.000187,-0.000244,-0.00017,-0.000119
-1.2e-05,-8e-06,1e-06,-3.1e-05,-0.000177,-0.000288,-0.000277,-0.000249,-0.000262,-0.00026,-0.000191,-0.000215,-0.00028,-0.000205,-0.000151,-0.000109,-0.00013,-9e-05,-5e-05,-6.3e-05,-9.8e-05,-9.2e-05,-0.000121,-0.00014,-0.000127,-0.000187,-0.000144,-4.4e-05
-2.8e-05,-6.3e-05,-8.7e-05,-8e-05,-0.00011,-5.7e-05,-1.1e-05,7.7e-05,5e-06,0.000125,0.000262,0.000159,9.5e-05,2.6e-05,6.4e-05,2.7e-05,-5e-06,-2e-05,3e-06,2.1e-05,4.8e-05,0,-1.5e-05,-8e-06,1e-06,4e-06,-5.6e-05,-2.8e-05
-6e-06,3e-06,1e-05,9e-06,1.7e-05,0.000177,0.000222,0.000225,0.000249,0.000315,0.000342,0.000289,0.000293,0.000198,0.000194,9.9e-05,9.4e-05,9e-05,7.3e-05,7.2e-05,0.000103,8.7e-05,0.000106,0.000121,0.000117,0.00018,9.3e-05,3.2e-05
3.5e-05,0.000106,0.000184,0.000271,0.000377,0.00024,0.00018,0.000102,0.000198,5.6e-05,-2.5e-05,5.6e-05,0.000117,0.000123,8.5e-05,9.7e-05,0.000109,0.000116,7.4e-05,4.8e-05,3.1e-05,6.7e-05,0.000104,0.000114,0.000107,0.000129,0.000121,6.9e-05
-5e-06,-2.5e-05,-2.3e-05,3.2e-05,0.000204,3e-06,-9.7e-05,-0.000128,-0.000135,-0.000324,-0.000436,-0.00027,-0.000196,-0.000114,-0.00017,-6.3e-05,-3.6e-05,-3.4e-05,-5.2e-05,-4.8e-05,-7.7e-05,-4.7e-05,-3.6e-05,-4.4e-05,-5.9e-05,-0.000104,-8e-06,7e-06
-1.7e-05,-4.7e-05,-9.8e-05,-0.000208,-0.000229,-0.000122,-0.000113,-0.000101,-0.000197,-0.000117,-8.3e-05,-0.000146,-0.000209,-0.000153,-0.00014,-0.000107,-7.4e-05,-9.2e-05,-5.6e-05,-6.2e-05,-5.8e-05,-6.2e-05,-0.000106,-0.000125,-0.000123,-0.000135,-5.5e-05,-3.2e-05
1.6e-05,3.4e-05,-6e-06,-8.5e-05,-0.00028,-9.5e-05,-2e-06,5.1e-05,2e-06,0.00025,0.000386,0.000161,4.5e-05,-1.2e-05,7.3e-05,-1e-06,-5e-06,-4.9e-05,-6e-06,-1e-06,2.5e-05,-2.6e-05,-5.4e-05,-4.4e-05,-1.4e-05,6e-06,-4.3e-05,-5.8e-05
6e-06,-1.1e-05,-3.5e-05,3.7e-05,-5.7e-05,-6.9e-05,1e-06,4.7e-05,0.000124,0.000173,0.000124,0.000136,0.000193,0.000122,0.00014,6.6e-05,1.8e-05,2.5e-05,2.5e-05,5.2e-05,5.5e-05,2.1e-05,3.8e-05,6.5e-05,8.2e-05,7.5e-05,-1e-05,5e-06
-6e-06,3e-06,5.8e-05,0.000109,0.000147,3.2e-05,4e-05,-3.2e-05,7.6e-05,-9.9e-05,-0.000279,-8.7e-05,6.9e-05,1e-04,2.2e-05,3.8e-05,1.2e-05,7.8e-05,1.8e-05,1.7e-05,-4e-06,3.7e-05,7.4e-05,7.6e-05,5.7e-05,4e-05,3.5e-05,6.5e-05
-5e-06,2.6e-05,9.4e-05,8.4e-05,0.000166,0.000118,4.3e-05,-3.4e-05,-5.5e-05,-0.000198,-0.000195,-0.000152,-0.00013,-6.2e-05,-0.000123,-3.5e-05,7e-06,1.8e-05,-2.3e-05,-4.2e-05,-5.8e-05,-5e-06,2.3e-05,-1e-06,-2.6e-05,-2.4e-05,1.9e-05,-1e-05
-1.2e-05,-4e-05,-6e-05,-6e-05,6.6e-05,9.2e-05,-2.6e-05,5.3e-05,-5.7e-05,-9e-06,0.000185,5.3e-05,-0.000118,-0.000104,-7.6e-05,-2.2e-05,1.8e-05,-3.4e-05,3.1e-05,7e-06,1.8e-05,1.9e-05,-2.2e-05,-5.1e-05,-5.1e-05,-2.6e-05,1.9e-05,-1.5e-05
-2e-06,-2.1e-05,-6.7e-05,-0.000106,-5.4e-05,-2.1e-05,-5.1e-05,3.7e-05,-2e-05,0.000132,0.00025,0.000157,3.2e-05,-1.3e-05,7e-05,2e-05,-1.4e-05,-3.1e-05,2.4e-05,3.1e-05,6.2e-05,2.2e-05,-3.5e-05,-4.9e-05,-2.7e-05,1e-05,6e-06,8e-06
1e-05,2.7e-05,1.1e-05,-2.1e-05,-0.000158,-0.000148,-5.7e-05,-7.9e-05,-1.5e-05,1e-05,-0.000113,-2.8e-05,8.9e-05,4.5e-05,8.2e-05,-1.5e-05,-7.2e-05,-2.8e-05,-6.2e-05,-1.6e-05,-2.1e-05,-5e-05,-2.8e-05,-1.1e-05,1.3e-05,1.7e-05,-4.6e-05,-3.3e-05
6e-06,1e-06,-8e-06,4.4e-05,-0.000134,-0.000143,-2.2e-05,-6.1e-05,4.3e-05,-6.4e-05,-0.000266,-0.000152,1e-05,3.7e-05,-1.2e-05,-3e-05,-2.3e-05,1.6e-05,-2.4e-05,-2.8e-05,-5.5e-05,-3.5e-05,6e-06,4e-05,3.4e-05,-2e-05,-4e-05,0
3e-06,1.7e-05,3.2e-05,5.7e-05,6.6e-05,7.6e-05,0.000123,8.1e-05,7.1e-05,3e-05,4.6e-05,-1.3e-05,-2.6e-05,3.3e-05,-5.5e-05,3.9e-05,8.7e-05,5.5e-05,3.2e-05,-1e-06,1.2e-05,4.2e-05,4.3e-05,6.1e-05,2.7e-05,-2.3e-05,2.2e-05,4.2e-05
-4e-06,2e-05,7.1e-05,4.2e-05,0.000215,0.000243,0.000144,9.2e-05,1.2e-05,8.2e-05,0.000267,0.000151,1.8e-05,1.4e-05,-1.3e-05,6.4e-05,9.9e-05,2.7e-05,4e-05,3.6e-05,3.8e-05,4.6e-05,3.6e-05,2.1e-05,8e-06,3.9e-05,6.4e-05,1.8e-05
-9e-06,-4.1e-05,-3e-05,-3.4e-05,9.4e-05,7.3e-05,-6.9e-05,-4.3e-05,-6.8e-05,-1.6e-05,5.4e-05,7.9e-05,-6e-06,-6.8e-05,1.2e-05,-1.2e-05,-1.3e-05,-3.4e-05,2.4e-05,1.9e-05,-1.4e-05,-2.3e-05,-2.4e-05,-4.9e-05,-3.5e-05,2.5e-05,2.2e-05,-2.6e-05
1e-06,-2.5e-05,-7.5e-05,-8.3e-05,-0.000129,-0.000191,-0.000197,-9.2e-05,-6.6e-05,-0.00013,-0.000235,-0.00012,-5e-05,-7.5e-05,1.4e-05,-5.4e-05,-0.000128,-7e-05,-5.7e-05,-3.4e-05,-3.2e-05,-5.4e-05,-5e-05,-5.5e-05,-4.2e-05,-3.7e-05,-4.6e-05,-5e-05
