0.000437,0.000298,0.000939,0.001445,0.005187,0.003156,0.001733,0.000764,0.004606,0.003158,0.003698,0.002327,0.002169,0.000952,0.001419,0.000728,0.000467,0.000348,0.000277,0.000261,-0.00033,-0.000421,-0.000423,-0.001185,-0.001501,-0.002268,-0.001143,-0.000827,-0.000465,-0.000312,-0.000287,-5.7e-05,-0.000128,0.000113,0.000296,0.000451,-1e-06,-0.000323,-9.1e-05,-0.000177,-0.000588,-0.003246,-0.003488,-0.002374,-0.001335,-0.000901,-0.00056,-0.000466,-0.000538,-0.000513,-0.000296,-0.000844,-0.000618,-0.000117,-0.000483,-6.5e-05,0.000157,-0.000111,0.000683,0.000254,6e-05,-0.000202,-0.000149,4.4e-05,-0.000334,-0.000106,3.9e-05,2e-06,-0.000133,-0.00014,0.000356,-7.6e-05,-0.000143,-0.000257,-0.001357,-0.002209,-0.001013,1.7e-05,-0.00716,-0.024387,-0.016327,-0.007614,-0.002154,7.8e-05,0.000212,0.000402,0.00028,-0.000122,-0.000225,-0.003463,-0.018381,-0.016376,-0.010626,-0.004346,-0.001066,-2.5e-05,0.000314,-8.7e-05,0.000287,5.2e-05,-0.000206,-0.000181,-0.000125,-0.000167,-5.4e-05,7.2e-05,-0.000214,-0.000167,-6.1e-05,-8.9e-05,-0.000102,-0.000326,-0.000948,0.000469,-0.027672,-0.017866,-0.007815,-0.002187,-0.010618,-0.004964,-0.001884
0.000311,0.000356,0.000351,0.001338,0.001506,0.001666,0.000787,0.000273,0.000403,0.001293,0.001552,0.001449,0.001497,0.000714,0.000806,0.000273,0.000347,8.2e-05,5.1e-05,0.000561,0.000339,0.000479,0.000751,0.001052,0.000611,0.001838,0.000857,0.000441,0.000269,0.000169,0.000232,0.000353,5.5e-05,-8e-06,0.000296,0.000214,1.7e-05,1.3e-05,0.000102,0.000272,0.000269,-0.000112,-9e-06,0.000324,0.000846,0.000699,0.000274,0.000214,0.000671,0.000329,0.000267,0.000166,0.00036,0.000272,0.000369,-5.3e-05,5.4e-05,0.00016,0.000679,0.000361,0.000574,-1.2e-05,0.000185,0.000272,0.000293,0.000388,-3.8e-05,0.000319,0.000368,0.000457,0.000268,7.5e-05,0.000113,6.1e-05,-0.000627,0.000692,0.000489,0.00019,0.003026,0.012468,0.010132,0.005701,0.001655,0.000211,-0.000173,1.4e-05,-0.000666,-0.000271,-0.000244,0.000588,0.011309,0.010739,0.006368,0.002514,0.000547,-0.000281,-0.000135,-0.000144,-5.1e-05,-0.000316,0.000102,-3e-06,-9e-06,2.9e-05,0.000201,-5.9e-05,-7.5e-05,-0.00023,-0.000231,-8.8e-05,7e-06,0.000151,0.000205,-0.003087,0.015637,0.010724,0.00522,0.001082,0.003541,0.003152,0.001717
-0.000292,-0.000591,-0.000438,0.001146,-5.6e-05,-0.000481,-0.000395,0.000158,-0.00139,-0.000976,-0.000667,0.000268,0.000446,0.000342,4.6e-05,0.000209,0.000202,-0.000199,-0.000205,0,5e-06,-9.2e-05,8.7e-05,-0.000126,-0.000534,-0.000381,7.4e-05,0.000114,0.000207,-0.000202,1.9e-05,-4.2e-05,3.6e-05,0.000243,-0.000245,-0.000272,-0.000101,-7.4e-05,0.000252,-0.00017,-0.000101,-0.00064,0.001762,0.000539,-0.000107,-0.000251,-0.000304,-6.5e-05,-7.5e-05,-0.000142,-0.000119,-0.000385,-0.000706,-0.000102,-0.000283,-0.000309,-0.000101,-2.9e-05,0.000276,6.7e-05,-6.5e-05,-8.3e-05,-0.000115,-0.000266,-0.000122,-1.1e-05,5.7e-05,-5.2e-05,-0.000185,-9e-06,-0.00013,-0.00015,-0.000105,-0.000165,0.001033,-0.000315,-0.000365,-0.000332,0.000739,-0.01057,-0.012372,-0.007388,-0.002443,-0.000432,8.9e-05,-0.000128,-6.3e-05,-0.000393,-0.000179,-0.000288,-0.00801,-0.006429,-0.003048,-0.001298,-0.000577,-0.000392,0.000137,0.00028,0.000298,1.8e-05,0.00011,3.3e-05,1.8e-05,1.2e-05,-1.3e-05,-5.8e-05,-5e-06,7.3e-05,-0.000117,-0.000198,-4.5e-05,-0.000315,9e-05,0.000479,-0.008606,-0.004896,-0.00161,0.000133,-0.001048,-0.001933,-0.001054
-0.001139,0.000632,-0.000158,0.000658,-0.001736,-0.001348,-0.000625,-0.000222,-0.001116,-0.001381,-0.00127,-9e-04,-0.000295,-0.000138,-0.000118,-0.000125,-2.9e-05,-2.9e-05,1.5e-05,0.000232,-0.000228,0.00029,-0.000141,-0.000441,0.000391,-0.000145,-4e-04,-0.000337,-9.2e-05,-7.1e-05,-0.000474,-4.3e-05,0.000125,9.4e-05,-0.000135,-4e-05,1.8e-05,0.000104,-0.000141,9.9e-05,-6.5e-05,-0.000109,-0.002658,-0.001333,-0.000529,8.5e-05,8e-06,0.000161,7e-06,-0.000212,2e-04,0.000185,9.4e-05,-9e-06,0.000102,0.000337,5.5e-05,9.5e-05,6.2e-05,0.000111,0.00042,0.000226,0.000169,-8.2e-05,-3.3e-05,0.000174,0.000198,0.000293,-2.5e-05,0.000367,-9.3e-05,7.4e-05,-3.2e-05,6e-05,-0.000279,0.000217,0.000141,0.000114,3.9e-05,-0.002201,0.001306,0.002484,0.001256,0.000208,0.000332,4e-05,0.000161,0.00034,0.000345,0.000191,0.001665,0.003092,0.004141,0.001872,0.000643,0.000309,0.000456,-0.000108,8.3e-05,0.000154,7.5e-05,-0.000151,-0.000148,0.000111,4.9e-05,7.3e-05,0.000126,0.000206,0.000169,5.5e-05,-8.5e-05,0.00015,-0.000107,-0.000324,0.00175,0.00119,0.000484,-0.000264,-0.001452,-0.000756,0.000599
-0.000757,-0.000356,-0.000615,0.000368,-0.000931,-0.001937,-0.000613,2.4e-05,-0.000434,-0.00194,-0.000966,-0.001044,-1.4e-05,-0.000174,0.000209,0.000147,-6.7e-05,-9.2e-05,1e-05,-5.3e-05,1.8e-05,-2e-05,-0.000188,0.000102,-0.000218,0.000321,0.000237,0.000104,4e-05,0.000168,-0.000207,-0.000335,-0.000157,-2e-06,-0.000125,-0.000168,7.4e-05,0,-4.4e-05,-8.4e-05,-0.00013,0.000147,0.001174,0.000193,-2.7e-05,2.2e-05,0.000227,-0.000222,0.000198,8.9e-05,2.8e-05,8e-06,-4.2e-05,0.00026,0.000208,0.000358,0.000187,4e-06,-0.000108,-0.000214,0.000211,0.000237,0.000297,-0.000114,-2.3e-05,-1e-04,-8e-05,0.000155,-5.9e-05,-3e-05,-2.1e-05,2e-05,8.3e-05,6.2e-05,-0.000113,-0.000167,1.9e-05,5.8e-05,-0.000208,0.001223,-0.005032,-0.001962,0.000318,0.000359,0.000266,3.4e-05,3.3e-05,0.000119,-5.5e-05,7e-05,-0.000495,-0.005091,-0.004993,-0.001838,-0.000375,0.000111,0.000162,8.8e-05,0.000207,0.000271,0.000104,2.7e-05,7.2e-05,7.5e-05,-0.000163,-8.9e-05,-2.2e-05,-1.8e-05,6.5e-05,8e-06,-5.5e-05,-0.000102,1.3e-05,-0.000105,-0.001392,-0.002207,-0.001451,-0.000287,-0.000836,-0.001244,-0.000921
-0.000478,9.3e-05,0.000166,0.000191,-6.5e-05,-0.001334,-0.00117,-2.8e-05,-0.000334,-0.000902,-0.000759,-0.001196,-0.000441,-0.000557,0.000182,-4e-06,-7.5e-05,6e-06,-2.4e-05,-0.000145,-0.000142,0.000177,5e-06,0.000164,0.000366,-0.00032,7.1e-05,-6.6e-05,0.000161,-6.1e-05,-0.000245,-0.00029,-0.000356,-0.000155,-5e-05,-7.5e-05,0.000132,-4.1e-05,-2.1e-05,1.8e-05,-0.000162,-0.000146,-0.000538,8.4e-05,0.000187,-0.000182,7.1e-05,4.9e-05,-4.8e-05,-0.000107,6e-05,-5.5e-05,0.000343,0.000158,0.000108,-0.000151,-6.5e-05,-6e-06,-5.7e-05,-0.000298,0.000113,-6.7e-05,-2.7e-05,2.4e-05,-3.5e-05,6.6e-05,2.4e-05,4.9e-05,4e-06,6.8e-05,2.1e-05,-0.00021,-0.000142,2e-06,0.000118,2.3e-05,-9e-06,8.9e-05,-3.8e-05,0.002011,0.00222,0.001879,0.000854,-1.5e-05,-0.000142,-0.000156,-6.5e-05,9e-06,-9e-06,-1e-04,-0.000873,0.003628,0.003592,0.001032,0.000161,-3.6e-05,-0.00027,-3.1e-05,-3.3e-05,-4.1e-05,0.00015,-0.000133,2.8e-05,3.8e-05,2.1e-05,-9e-06,7e-06,3.1e-05,-0.000123,7.3e-05,-5.6e-05,-1.3e-05,0.000218,-0.00018,0.001136,0.002058,0.001455,0.000722,0.000266,0.00107,0.000658
-0.000184,-0.000215,6e-06,-0.000512,-0.000493,-0.000359,-0.000875,-7.9e-05,-0.000191,-0.000513,-0.000584,-0.000792,-0.000522,-0.000216,0.000163,-9e-05,6e-05,7.9e-05,-0.000216,-0.000134,-0.000211,-0.000166,4.5e-05,2.2e-05,-0.00011,6.5e-05,-0.000153,-0.000328,-0.000151,-4e-05,0.000145,-2.2e-05,-9.5e-05,0.000175,-7e-06,-2.5e-05,-9.6e-05,5.1e-05,-5.4e-05,-0.000248,8e-06,0.00011,0.000243,-8.6e-05,-0.000333,2.2e-05,-4.8e-05,5.8e-05,-0.000175,-1.6e-05,3.2e-05,-3e-06,-0.000226,-0.000129,5.8e-05,2.6e-05,3.5e-05,0.000143,-4.1e-05,-0.000284,-0.000266,-0.000112,-0.000153,-0.000105,9.8e-05,3.8e-05,-0.000157,-6.2e-05,-0.000112,-0.00015,-0.000186,-0.000169,-6.4e-05,-8.8e-05,2.6e-05,-8.8e-05,9e-06,-7.3e-05,-0.000237,-0.001506,0.002873,-0.00091,-0.001131,-0.000631,-0.000134,-0.000123,-0.000233,-0.000242,-0.000149,-2e-06,0.000155,-0.003617,-0.002438,-0.001597,-0.000672,-0.000116,-0.000133,-6.9e-05,5e-06,-0.000107,-0.000281,-0.000127,-8.4e-05,-4.2e-05,-9.5e-05,-0.000117,0,6.2e-05,-3.1e-05,-7e-05,4e-05,-1.6e-05,9.6e-05,3.6e-05,-0.001041,-0.000633,-0.000419,-0.000523,-0.000179,-0.001633,-0.001756
-0.000174,0.000297,0.00017,-0.000125,-0.000721,-0.000325,-0.000231,1.1e-05,-0.000197,0.000176,7.2e-05,-9e-06,-0.000527,-0.000298,0.000139,-0.000358,-0.00016,0.00014,-0.000105,-0.000131,-0.000109,-0.000153,-0.000251,0.000193,-0.000174,-0.000119,-4.2e-05,2.6e-05,-5.8e-05,-6.8e-05,2e-05,-0.00017,-4.6e-05,0.000116,-0.000226,1.3e-05,0.000119,4.1e-05,8.5e-05,-0.000128,-8.7e-05,0.000115,-0.000634,-6.2e-05,-0.000364,-0.000258,5.8e-05,0.000196,-0.000174,-0.000102,2.5e-05,-0.00013,0.000111,-0.000145,-0.000122,-0.000106,2.5e-05,0.000111,-3.6e-05,-0.000123,1.3e-05,-7e-05,7e-06,-4.3e-05,-0.000121,2e-05,-5e-05,2.4e-05,8e-06,-2.8e-05,-2.6e-05,-0.000195,-0.00014,-5.7e-05,4.8e-05,9.4e-05,-0.000228,5e-06,-8.2e-05,0.001032,0.001539,-0.000426,-0.000459,-4.3e-05,-2.6e-05,-3e-06,-0.000123,8.2e-05,0.000123,0.000111,0.00032,-0.001279,0.001262,0.000821,-0.000136,-0.000138,0.000105,-6e-05,-0.000157,-7.4e-05,1.9e-05,5e-06,-9.9e-05,-9.2e-05,2.3e-05,-0.000117,-5.9e-05,-5.1e-05,5.3e-05,-4.6e-05,2.5e-05,-2.1e-05,-2.1e-05,-0.000133,-0.000752,-0.000279,-0.000869,-0.000123,-9.7e-05,0.001329,0.000671
-2.8e-05,-0.000115,-0.000485,-0.000396,-0.00047,-0.00025,3.8e-05,-0.000211,-3e-05,3.3e-05,0.00052,0.000445,-0.000256,-0.000289,5.1e-05,-0.000265,-0.000137,0.000156,1e-04,-1.7e-05,-0.000282,-9.4e-05,-2.1e-05,0.000128,0.000107,0.000209,-4e-06,9.8e-05,0.000306,-0.00011,-0.000167,-1.6e-05,-6e-06,5.2e-05,4.1e-05,-1.1e-05,2e-06,-4.1e-05,-9.7e-05,-0.000124,4.6e-05,0.000144,0.00024,-4.1e-05,0.000174,2.9e-05,-0.000203,-4.5e-05,9.2e-05,7.7e-05,5e-06,-0.000146,-2.6e-05,-5e-05,4.1e-05,-1.3e-05,-5e-05,-1.8e-05,-2.9e-05,-0.000123,-8.2e-05,3.4e-05,6.9e-05,-5.1e-05,-6e-05,8.6e-05,-0.000121,4.7e-05,-0.000134,-7.7e-05,-0.000165,-7.1e-05,3e-05,0.000134,-4.2e-05,-7.9e-05,-7.2e-05,-1e-05,4e-05,-0.000457,-0.000529,-0.00042,0.000196,2.1e-05,3e-05,-2.5e-05,-2.7e-05,6.3e-05,5.1e-05,-2.8e-05,-0.000147,0.001726,-0.001291,-0.000662,0.000125,0.000165,2.6e-05,-0.000141,-2e-05,1.2e-05,-3e-06,-3.6e-05,-0.000102,6.7e-05,-2.2e-05,-9.3e-05,4e-06,8e-06,1.1e-05,-7e-06,1.8e-05,9.4e-05,-7.5e-05,0.000216,0.000802,0.000958,0.001371,2.3e-05,2.3e-05,-0.000235,-0.000479
2.7e-05,-0.00042,-8.6e-05,-0.000408,-0.000354,-5.5e-05,0.000319,-0.000399,-6.8e-05,-0.000115,0.000945,0.000513,4.4e-05,-0.000133,-4.4e-05,-9.1e-05,-0.000139,8.8e-05,7.4e-05,1.5e-05,1.9e-05,-6.3e-05,-5.9e-05,9.8e-05,3.5e-05,-0.00024,7.3e-05,-0.00013,-0.00015,-1e-04,-3.6e-05,0.000128,-7.7e-05,-2.3e-05,5.3e-05,-9.2e-05,6.6e-05,-3.3e-05,4.6e-05,8.3e-05,-1.3e-05,-5.5e-05,-0.000147,4.8e-05,-0.000405,2.2e-05,9.2e-05,3.2e-05,-6.2e-05,9e-06,-0.000148,-5.9e-05,3.9e-05,9.2e-05,-4.2e-05,-3.7e-05,-1.3e-05,2.7e-05,5.6e-05,-2e-06,-0.000146,-6.5e-05,8e-06,-2.5e-05,-0.000168,-1e-06,4.5e-05,3e-06,-1.8e-05,-4e-06,-2.2e-05,6.2e-05,3.9e-05,4e-06,-4.4e-05,-9e-06,2.1e-05,-1.7e-05,0.000113,0.000108,-0.001218,-0.000846,0.000202,5.9e-05,-3.9e-05,-0.000139,-4e-06,-5.3e-05,-7.6e-05,-4e-05,-5.3e-05,0.000402,-0.000209,7.8e-05,-0.000106,-2e-05,2.3e-05,-1.6e-05,-2.2e-05,-6e-05,4e-06,4.6e-05,1.9e-05,-1.1e-05,-5.9e-05,-2.9e-05,-5.7e-05,2.7e-05,-3.4e-05,6.3e-05,-4.8e-05,3.1e-05,1.3e-05,-0.000117,-3e-06,-0.000423,-0.000101,0.000166,-0.000349,-0.000208,-0.000438
7e-05,-0.000148,-0.000285,-0.000126,-0.00026,-1e-04,0.000204,-0.000159,-0.000196,-0.000171,0.00038,5.2e-05,0.000283,-0.000196,-0.000207,5.2e-05,-9.6e-05,1.7e-05,5.1e-05,-6e-06,-3.2e-05,-3.2e-05,-0.000117,-1.7e-05,-5.4e-05,1.2e-05,5e-05,0.000229,9.2e-05,6.5e-05,-2.5e-05,4.3e-05,0.000135,7.4e-05,3e-06,-9e-06,-2.9e-05,-4e-05,-2e-05,-8.6e-05,5.8e-05,0.000119,0.00021,-6.3e-05,0.00046,1.7e-05,-2.7e-05,-2.7e-05,1.9e-05,1.2e-05,-4.1e-05,6.6e-05,-2.1e-05,2.3e-05,8.8e-05,-3.7e-05,-2.5e-05,0.000122,7e-06,2.1e-05,-7.7e-05,2.2e-05,-8e-06,5e-06,2.3e-05,3e-06,-8.5e-05,-2.2e-05,1.6e-05,-1.3e-05,-6.5e-05,2.1e-05,-1.8e-05,8.7e-05,3.1e-05,4.1e-05,5e-06,6.6e-05,-6.7e-05,-0.000187,0.000916,0.000727,-0.000385,-0.000326,-0.000118,-0.000131,-7.3e-05,-5.4e-05,-3.8e-05,3e-06,1.5e-05,0.000186,-0.000146,-0.000158,6.9e-05,-5.4e-05,-4.6e-05,5.3e-05,-0.000107,1.2e-05,-8.9e-05,-9e-06,7.3e-05,-6.5e-05,-1.5e-05,-1.3e-05,9e-06,6e-06,2.8e-05,1.2e-05,2.2e-05,-7e-06,-3.8e-05,3.3e-05,-4.8e-05,-0.000281,-0.000787,-0.000387,-3.5e-05,-0.00017,-1.2e-05
6.3e-05,-1.1e-05,2e-06,0.000209,-9.9e-05,-5.4e-05,5e-06,-0.000129,-0.00015,-1.3e-05,9e-05,-7.6e-05,0.000224,5.4e-05,-0.000217,3e-06,-3.4e-05,6.1e-05,5.7e-05,-5.2e-05,4.9e-05,2.3e-05,-8e-06,-2.2e-05,0.000151,-1.6e-05,-6.5e-05,6.6e-05,-8.9e-05,1e-05,8.3e-05,2.5e-05,-4.7e-05,-3.8e-05,-5.3e-05,2e-05,4.7e-05,4.8e-05,1.6e-05,-7e-06,3e-05,-6.4e-05,-0.000197,4.4e-05,-4.6e-05,-2.6e-05,-4.2e-05,1.8e-05,3.2e-05,3.3e-05,-3.8e-05,-1.7e-05,-7.5e-05,1.6e-05,-4.2e-05,-6.8e-05,3e-06,1.6e-05,-4.1e-05,-4.9e-05,-6.5e-05,-7.7e-05,-0.000145,-4.2e-05,3.8e-05,-4.8e-05,7e-06,-4.6e-05,-1.3e-05,-2.3e-05,-4.9e-05,-1.5e-05,5e-06,-1e-05,2.5e-05,1.4e-05,-8e-05,-0.000189,-3.5e-05,9.2e-05,0.000963,0.000827,9.6e-05,-0.000162,-8.7e-05,-4.8e-05,8.6e-05,-6.2e-05,3.4e-05,0.000113,4.3e-05,-0.000277,-1e-06,-0.00035,-0.000179,-0.000179,-3.7e-05,1.6e-05,2.2e-05,3e-06,-9.6e-05,-8.5e-05,-2.9e-05,-1.4e-05,1.3e-05,2.5e-05,-2.8e-05,-6e-06,-2.3e-05,-3.7e-05,-1.4e-05,-1.9e-05,-2e-05,-0.000138,-0.000289,0.001483,0.000672,0.000213,0.00017,0.000237,0.000162
3.5e-05,0.000114,-0.000129,0.000255,-0.000108,1.1e-05,-0.000221,-7.6e-05,-5.7e-05,6.2e-05,-9.6e-05,-2.9e-05,6.2e-05,-1.6e-05,-0.000119,-2.5e-05,6e-06,1.8e-05,1.3e-05,1.8e-05,-5e-06,4e-06,2.9e-05,2e-06,-4.8e-05,1.6e-05,-1.4e-05,-1.9e-05,-3.5e-05,-4.8e-05,-1.7e-05,-4.6e-05,-1.5e-05,-6.3e-05,-3.3e-05,9e-06,-2.3e-05,3.3e-05,-4.8e-05,5.3e-05,-8e-06,-9.7e-05,0.00012,3.5e-05,-6e-06,3.4e-05,5.1e-05,2.6e-05,4.5e-05,-9e-06,-3.9e-05,-1.5e-05,2e-06,-4.6e-05,-5e-06,-6.4e-05,-1.9e-05,-2.3e-05,-3.5e-05,-2.6e-05,-3e-05,5.7e-05,-1.6e-05,1e-05,-1.4e-05,-5.1e-05,-1e-05,-6.4e-05,-8.6e-05,-4e-06,-1e-06,-1.7e-05,0,9e-06,-1.4e-05,-7e-06,0.000111,8.6e-05,-1.7e-05,2.3e-05,-0.000523,1.6e-05,-0.000178,-5.1e-05,5.7e-05,-5e-06,4.8e-05,-2.2e-05,-1.9e-05,-5.1e-05,4.9e-05,-0.000505,0.000395,9.2e-05,0.000216,3.3e-05,3e-06,-2.5e-05,-6e-06,-4.7e-05,3e-06,-5e-06,4.7e-05,-1.3e-05,1.3e-05,2e-05,-1.4e-05,-2.2e-05,-1.3e-05,2.3e-05,3e-05,-2.6e-05,-1.5e-05,-1e-06,-4.5e-05,-0.000622,-0.000552,3.8e-05,-0.000122,-0.000275,-0.00024
5e-05,7e-05,7.5e-05,-0.000138,0.000106,-1e-05,-8.2e-05,-5.1e-05,5.9e-05,-2.2e-05,3.4e-05,2e-05,-0.000101,-6.6e-05,-7.7e-05,-2.6e-05,2.2e-05,-3e-06,-1.2e-05,1.5e-05,-3.6e-05,-2e-06,-1.9e-05,-0.000114,-7.6e-05,3e-05,-1.4e-05,4.9e-05,0,4.5e-05,2e-06,-5.4e-05,5e-06,-3.6e-05,2.1e-05,-4.4e-05,-2.6e-05,8e-06,9e-06,-5.2e-05,-1e-06,-5.6e-05,-3.5e-05,-3e-05,4.1e-05,-3.3e-05,-4.6e-05,2.4e-05,-5.1e-05,1.4e-05,1.3e-05,-0.000104,-6.5e-05,2.5e-05,-5.2e-05,2.1e-05,1.4e-05,-3e-06,-1.9e-05,-2.1e-05,-7e-06,-2.8e-05,-6.6e-05,-6.3e-05,-3.6e-05,-3e-05,-4e-06,-1.3e-05,9e-06,0,-3e-06,-3.4e-05,-2.6e-05,1e-05,-1.6e-05,-1.8e-05,-4.7e-05,-9.3e-05,-8e-06,-0.000109,-0.000142,-0.000167,-8e-05,0.000154,5.1e-05,-1.6e-05,-2.4e-05,-2.5e-05,-9e-06,-4.4e-05,-8.4e-05,-1e-06,-0.000405,-0.00021,-1e-05,-6.7e-05,5.2e-05,-1.6e-05,-6.5e-05,4.4e-05,-4.4e-05,2e-05,3.6e-05,1.8e-05,-2e-06,-2.4e-05,-1.6e-05,-7e-06,1.7e-05,2.6e-05,1.6e-05,2.4e-05,6e-06,-1.6e-05,0.000115,0.000223,7.3e-05,2.1e-05,-0.000255,0.000136,8.3e-05
2.7e-05,3.4e-05,7.8e-05,-0.000119,1.3e-05,3.3e-05,1.7e-05,0.000135,9.5e-05,-1.4e-05,7.5e-05,8e-06,-7.5e-05,-6.7e-05,-3.7e-05,-4.3e-05,1e-05,1.7e-05,-6e-05,-1e-05,1e-06,-9e-06,1.5e-05,4.1e-05,-5e-06,3e-06,3.4e-05,1.4e-05,7e-06,-4.6e-05,-2.5e-05,3.9e-05,-1.3e-05,-6e-05,-3.2e-05,-7e-06,-1.5e-05,-4e-05,1.1e-05,-3.4e-05,6e-05,8e-06,8.9e-05,-1.8e-05,-0.000203,2.6e-05,-2.4e-05,2.2e-05,-2.1e-05,-2.3e-05,-3.2e-05,2.1e-05,2e-06,-7e-06,5.5e-05,1e-06,-1.5e-05,-1.6e-05,-2.9e-05,-3.4e-05,3.1e-05,8e-06,-1.5e-05,7e-06,5e-06,4e-06,-2.5e-05,-1.2e-05,0,-9e-06,-2e-06,1.3e-05,-5e-06,-8e-06,1e-05,4e-06,-2.5e-05,8.5e-05,3.1e-05,2.7e-05,-0.000388,-0.000156,7.4e-05,-0.000108,-4.3e-05,-2.6e-05,-2.5e-05,1e-06,6e-06,-1e-06,2.9e-05,9.3e-05,0.000204,0.00021,2e-06,3.1e-05,6e-06,-9e-06,0,0,1.1e-05,5e-06,2e-06,1.1e-05,-2.1e-05,-1.3e-05,5e-06,-5e-06,4e-06,-7e-06,-3.9e-05,1e-06,3e-05,1.4e-05,6.3e-05,-6.3e-05,-0.000177,-6.9e-05,8.8e-05,7e-06,-2.5e-05
2.6e-05,1.8e-05,4e-05,-9.9e-05,2.1e-05,-1.8e-05,8e-05,0.000207,4.7e-05,-4.8e-05,0.000106,-7.7e-05,-3.5e-05,-2.7e-05,-1e-06,-7.4e-05,-2.4e-05,-3.1e-05,-1.1e-05,-2e-06,-3.9e-05,-2e-06,-7e-06,-8.1e-05,-4.5e-05,-4e-05,-1.8e-05,6.3e-05,-3.7e-05,1.4e-05,1e-06,2.9e-05,8e-06,2e-06,-4.1e-05,8e-06,-1.2e-05,-4.2e-05,-3e-06,3.1e-05,-4e-06,1.8e-05,-9.6e-05,1.7e-05,8.9e-05,-1e-06,-1.3e-05,-6.9e-05,-4.2e-05,0,1.7e-05,4e-06,-2.8e-05,-3.4e-05,-7e-06,4e-06,1.4e-05,2.8e-05,-4e-06,-9e-06,2.1e-05,-9e-06,-2.4e-05,4e-06,-6e-06,1.2e-05,-4e-06,1.3e-05,-8e-06,-9e-06,-2e-06,2e-06,2e-06,-9e-06,2.2e-05,3e-06,-1e-05,-5.4e-05,-1.5e-05,-5.4e-05,0.000623,0.000114,0.000113,3e-05,-2.5e-05,-8e-06,3e-06,7e-06,-5e-06,1.1e-05,4.8e-05,5.4e-05,3.2e-05,0.00013,-6.6e-05,2e-05,1.2e-05,1.6e-05,7e-06,-1.1e-05,-9e-06,-2e-06,-1e-06,3e-06,2e-06,0,-6e-06,-1.5e-05,-1.1e-05,-1.4e-05,-1.3e-05,8e-06,1.6e-05,7e-06,9e-06,-5.5e-05,-2.3e-05,1.3e-05,-9.4e-05,-9.2e-05,1.6e-05
-1.1e-05,5.6e-05,-3e-05,-4e-05,-9.7e-05,-4.2e-05,7.2e-05,0.000121,6e-06,3e-06,3e-05,-6.8e-05,4e-06,-1.9e-05,1.2e-05,-5.5e-05,-1.7e-05,-2.9e-05,0,-1e-06,6e-06,0,-7e-06,-2e-05,-4e-06,-2e-06,2.1e-05,-8e-06,1.7e-05,-2.4e-05,2.3e-05,9e-06,-1.7e-05,-3.7e-05,8e-06,-6e-06,0,-2.1e-05,-3e-06,-1.3e-05,-3e-06,-1.8e-05,2e-05,-2.8e-05,2.8e-05,-3.9e-05,-2.8e-05,3.7e-05,0,-1.1e-05,1.7e-05,0,3e-06,-3e-06,2e-06,1.1e-05,-6e-06,-1.9e-05,1e-05,-1e-06,-6e-06,5e-06,9e-06,-2e-06,7e-06,-2e-06,-3.2e-05,7e-06,-1.4e-05,2e-06,3e-06,1.6e-05,0,-3e-06,2e-05,1e-06,-4e-06,6e-06,4e-06,5.3e-05,-1.7e-05,-2.1e-05,0.000174,-1.6e-05,-6e-06,-4e-06,1.5e-05,7e-06,-1.4e-05,2.2e-05,-1.2e-05,0.000402,-6.3e-05,-4e-06,0.000112,4.1e-05,2.3e-05,-8e-06,2.3e-05,8e-06,2.1e-05,-2e-06,1.2e-05,1.3e-05,7e-06,-8e-06,7e-06,-4e-06,1.3e-05,6e-06,9e-06,-5e-06,4e-06,-1e-06,-5.4e-05,5.6e-05,6.3e-05,1.5e-05,-6.2e-05,6.1e-05,-0.000107
5e-06,2.9e-05,1.6e-05,4e-06,-1.5e-05,1.6e-05,-1e-05,8e-06,5.3e-05,2.4e-05,-2e-05,-4.7e-05,3.6e-05,1.1e-05,3.1e-05,-4e-06,-4e-06,-2.6e-05,5e-06,-8e-06,-2.2e-05,-2e-05,5e-06,-3.6e-05,1.4e-05,-1.8e-05,-1.7e-05,1e-06,-9e-06,-2.3e-05,-1.6e-05,-4e-06,8e-06,1.1e-05,1.9e-05,-5e-06,-1.1e-05,-1e-06,-5e-06,-2.3e-05,2.5e-05,1.5e-05,-2.7e-05,2.5e-05,6e-06,2.6e-05,1e-05,-2.7e-05,-2e-06,8e-06,4e-06,1.5e-05,-1.1e-05,2e-05,4e-06,0,6e-06,-2.4e-05,5e-06,-4e-06,-4e-06,-3e-06,-1.5e-05,7e-06,-1.8e-05,-8e-06,-4e-06,1.3e-05,-2e-06,5e-06,-1.1e-05,1.6e-05,0,-6e-06,9e-06,0,-1.7e-05,5e-06,-4e-06,-5.4e-05,-0.000344,-0.000191,-8e-06,-7.9e-05,-1.8e-05,1e-06,1.2e-05,9e-06,0,-5e-06,-6e-06,-0.000123,0.000152,2.1e-05,-8.8e-05,-1.8e-05,-1.4e-05,-8e-06,-9e-06,-3e-06,-1.1e-05,-6e-06,-2e-06,2e-06,8e-06,-8e-06,-5e-06,1.2e-05,-8e-06,4e-06,1.5e-05,-5e-06,2e-06,-2e-06,3.5e-05,6.6e-05,0.000113,4.2e-05,-5e-05,-3.3e-05,-6.1e-05
2e-05,-1.5e-05,-1.9e-05,3.1e-05,8e-06,-4e-06,-6.2e-05,-2e-05,-1e-06,-1.1e-05,-4.9e-05,-2.8e-05,5.6e-05,-3.4e-05,1.3e-05,2.5e-05,-5e-06,-1.3e-05,-3e-06,0,-5e-06,-2e-06,-1.6e-05,7e-06,3e-06,1.4e-05,1.6e-05,4.3e-05,1.4e-05,1e-05,8e-06,-2e-05,1.4e-05,-5e-06,-1.5e-05,-4e-06,3e-06,-5e-06,9e-06,1e-05,7e-06,0,3.7e-05,-1.6e-05,-6.7e-05,2.2e-05,2e-06,1.5e-05,2.7e-05,-3e-06,3e-06,-1e-06,5e-06,2e-06,2e-05,-2e-05,-3e-06,-1.7e-05,-8e-06,-1.1e-05,-1.7e-05,3e-06,-5e-06,-1.2e-05,-2.1e-05,0,-7e-06,1e-06,-7e-06,-3e-06,-7e-06,-6e-06,5e-06,-9e-06,-1.1e-05,-3e-06,-2e-06,-7e-06,6e-06,3.5e-05,-0.000202,0.000166,-0.00012,8e-06,1e-06,-7e-06,1.9e-05,-4e-06,1.4e-05,-1.7e-05,2e-06,-0.000394,-0.000226,-0.000121,7.7e-05,-1.2e-05,0,0,-9e-06,-3e-06,-7e-06,-9e-06,3e-06,-1.2e-05,-3e-06,1e-06,-1e-06,4e-06,-3e-06,-9e-06,-1.4e-05,2e-06,-2e-06,-2e-06,1.1e-05,-9.6e-05,-0.000175,-0.000114,-3.4e-05,2.3e-05,0.000121
1.3e-05,-1.4e-05,-1e-06,4.2e-05,-2.5e-05,-4e-06,-5.5e-05,-2.7e-05,1.5e-05,-1e-05,-7.3e-05,2e-06,2.7e-05,-3.3e-05,1.9e-05,1.3e-05,-1.7e-05,-2e-05,3e-06,2e-06,0,0,3e-06,8e-06,4e-06,2e-06,-1.2e-05,-1.5e-05,-1.6e-05,-2e-06,-1e-05,1e-06,-1.7e-05,1.6e-05,-1.4e-05,1e-06,0,4e-06,-3e-06,-3e-06,1e-06,0,-3e-05,1.5e-05,0.000116,-3.2e-05,1.3e-05,5e-06,3e-06,9e-06,-2e-06,-1.3e-05,9e-06,-5e-06,-1.2e-05,1e-06,1e-06,-1e-06,-5e-06,-1.2e-05,-1.8e-05,3e-06,8e-06,2e-06,7e-06,1.5e-05,0,-3e-06,1e-06,2e-06,-5e-06,-5e-06,-4e-06,-6e-06,2e-06,3e-06,-6e-06,2e-06,-3e-06,-4e-05,8e-05,0.000101,8.7e-05,2.4e-05,3.1e-05,-1.2e-05,1.5e-05,3e-06,-1e-05,1e-06,1.4e-05,0.000256,1.7e-05,1.8e-05,-1e-06,1.9e-05,6e-06,1e-05,5e-06,0,2e-06,-5e-06,3e-06,-9e-06,-9e-06,-2e-06,0,3e-06,7e-06,-7e-06,3e-06,-6e-06,-4e-06,-3e-06,-4.7e-05,-3.2e-05,8.9e-05,4.7e-05,-1.4e-05,-5.1e-05,-0.000115
1.5e-05,-2.3e-05,0,-7e-06,-1.9e-05,-1e-06,0,0,1e-05,-1.8e-05,7e-06,-1e-06,-2.7e-05,-1.8e-05,5e-06,-2e-06,-1e-05,-1e-05,-8e-06,-1e-06,-6e-06,4e-06,-9e-06,-6e-06,3e-06,-5e-06,1e-06,5e-06,5e-06,-1.3e-05,-1e-06,6e-06,3e-06,-2e-06,4e-06,0,0,-3e-06,2e-06,-3e-06,3e-06,2e-06,9e-06,-1.1e-05,-3.2e-05,5e-06,-6e-06,-1.8e-05,-3e-06,-8e-06,-8e-06,-4e-06,-5e-06,1.1e-05,-8e-06,-1.7e-05,-2e-06,1e-05,2e-06,-1.1e-05,-1.2e-05,1e-06,-2e-06,-3e-06,5e-06,8e-06,2e-06,1e-06,-8e-06,-4e-06,-8e-06,-9e-06,-4e-06,-1.2e-05,1e-06,1e-06,2e-06,4e-06,0,4e-06,0.000216,-3.1e-05,-0.000101,3e-05,2e-06,-1.4e-05,2e-06,-8e-06,4e-06,5e-06,1e-06,1.4e-05,3.2e-05,-6.1e-05,3.1e-05,-6e-06,0,0,-1.4e-05,1e-06,-7e-06,2e-06,1.6e-05,7e-06,3e-06,2e-06,-3e-06,1e-06,-4e-06,7e-06,-6e-06,6e-06,-7e-06,0,-2.3e-05,-0.00016,-8.5e-05,-5e-06,-2.5e-05,7.2e-05,6e-06
4e-06,3e-06,-4.2e-05,4.2e-05,-6e-06,-1.4e-05,2.7e-05,-2.2e-05,6e-06,-2e-06,1e-06,-1.7e-05,-3.3e-05,-2e-06,-4e-06,-7e-06,6e-06,-6e-06,-9e-06,3e-06,-4e-06,1e-05,1.1e-05,2.1e-05,-9e-06,-6e-06,-6e-06,1e-05,3e-06,9e-06,1.3e-05,-2e-06,-7e-06,1.4e-05,6e-06,-2e-06,5e-06,6e-06,-5e-06,-1e-06,8e-06,5e-06,-6e-06,4e-06,0,1.4e-05,9e-06,8e-06,-1.2e-05,2e-06,-6e-06,-9e-06,6e-06,-9e-06,-1e-06,6e-06,0,-1.2e-05,4e-06,-8e-06,2e-06,-4e-06,4e-06,0,-7e-06,1e-06,-1e-05,-1e-06,-9e-06,-4e-06,0,0,-4e-06,-5e-06,0,0,5e-06,-5e-06,0,-1e-06,-0.000223,2.4e-05,-3.9e-05,-3.1e-05,-7e-06,-1.2e-05,-2e-06,-3e-06,1e-06,4e-06,-1.4e-05,-4e-05,-3e-06,4.9e-05,-1.8e-05,-1.5e-05,-4e-06,-7e-06,-4e-06,0,-3e-06,3e-06,1.2e-05,5e-06,1e-06,0,-5e-06,1e-06,0,2e-06,6e-06,0,-6e-06,-1e-06,1.5e-05,0.000102,5e-05,5.5e-05,-3.2e-05,-3.4e-05,3e-05
8e-06,1.6e-05,2.4e-05,-2.1e-05,1.3e-05,2e-06,3.4e-05,-2e-05,-2e-06,4e-06,7e-06,-3.9e-05,-2e-05,-9e-06,-1.2e-05,-1.4e-05,5e-06,-9e-06,-5e-06,-3e-06,-1.3e-05,-2e-06,-1.1e-05,5e-06,0,9e-06,9e-06,-4e-06,1.1e-05,0,2e-06,8e-06,-1e-06,1e-06,-7e-06,-2e-06,2e-06,1e-05,4e-06,-1.6e-05,3e-06,3e-06,1.1e-05,-5e-06,-9e-06,-1.1e-05,2e-06,-5e-06,-4e-06,-4e-06,-3e-06,-7e-06,-4e-06,-3e-06,5e-06,1e-06,-2e-06,-5e-06,-1e-06,1e-06,5e-06,2e-06,2e-06,1e-06,-8e-06,-6e-06,3e-06,-2e-06,0,0,-2e-06,5e-06,2e-06,-4e-06,0,-1e-06,-1.4e-05,1.1e-05,0,-8e-06,-0.000229,-1.4e-05,6.5e-05,-3.2e-05,-1.2e-05,-4e-06,4e-06,-6e-06,-9e-06,-5e-06,1.5e-05,5.8e-05,8.3e-05,2.9e-05,6e-06,4e-06,1e-06,-5e-06,3e-06,-4e-06,-7e-06,-2e-06,3e-06,-3e-06,3e-06,-3e-06,0,-3e-06,2e-06,-6e-06,1e-06,-2e-06,-2e-06,-1e-06,3.4e-05,-0.000115,9.4e-05,-3.1e-05,-1.1e-05,7e-06,-5e-05
1e-05,7e-06,-2e-05,-4.4e-05,-1.3e-05,6e-06,2e-06,-6e-06,8e-06,2e-06,-2.9e-05,-1.9e-05,1e-06,-1.8e-05,-1.5e-05,-2.2e-05,0,8e-06,3e-06,-4e-06,-1e-06,0,4e-06,1.1e-05,3e-06,-8e-06,-1e-06,1.3e-05,-1.1e-05,-9e-06,-1.1e-05,-1e-06,0,1.1e-05,-1.3e-05,-2e-06,3e-06,0,-3e-06,1e-05,1e-06,-3e-06,-5e-06,9e-06,-4.2e-05,-3e-06,-1e-05,6e-06,-7e-06,-2e-06,0,-1e-06,5e-06,-5e-06,-3e-06,-4e-06,-1e-06,8e-06,-2e-06,-3e-06,4e-06,-4e-06,-8e-06,-5e-06,-3e-06,-6e-06,-1.4e-05,2e-06,1e-06,0,-1e-06,1.1e-05,-3e-06,-5e-06,-2e-06,-2e-06,0,-2e-05,0,4e-06,6e-06,-3.9e-05,2.4e-05,-2e-05,-6e-06,-4e-06,4e-06,-7e-06,4e-06,-2e-06,6e-06,6e-06,-5.8e-05,-5.3e-05,2.1e-05,-1.6e-05,0,5e-06,2e-06,6e-06,5e-06,-6e-06,-7e-06,3e-06,0,-4e-06,-2e-06,-1e-06,1e-06,-5e-06,-1e-06,1e-06,1e-06,0,9e-06,-9.1e-05,-4.7e-05,-3e-06,-1e-05,-2e-06,8e-06
9e-06,7e-06,2.7e-05,-4.3e-05,-4e-06,-1.3e-05,-2.4e-05,3.6e-05,0,-1.1e-05,-1.2e-05,1e-05,1.4e-05,-1.6e-05,-9e-06,-1.9e-05,-7e-06,3e-06,2e-06,3e-06,-9e-06,-4e-06,-5e-06,5e-06,-4e-06,1e-06,1e-06,-2.2e-05,5e-06,2e-06,-1e-06,-3e-06,3e-06,-4e-06,9e-06,0,1e-06,-8e-06,1e-06,-4e-06,2e-06,1e-06,-8e-06,-2e-06,5.1e-05,6e-06,4e-06,3e-06,3e-06,1e-06,-6e-06,5e-06,-7e-06,3e-06,0,5e-06,2e-06,6e-06,1e-06,-5e-06,8e-06,3e-06,-3e-06,4e-06,-1e-06,0,2e-06,-4e-06,-6e-06,1e-06,-1e-06,1e-06,0,5e-06,1e-06,2e-06,1e-06,8e-06,0,-8e-06,0.000162,6e-06,-1.3e-05,-7e-06,-2e-06,-6e-06,5e-06,-3e-06,1e-06,2e-06,-9e-06,8.2e-05,-5e-06,4.9e-05,-2.7e-05,6e-06,-2e-06,2e-06,0,0,-4e-06,0,-1e-06,-3e-06,-4e-06,-3e-06,-2e-06,1e-06,-5e-06,2e-06,-4e-06,-4e-06,3e-06,0,-3.7e-05,0.000151,-5.4e-05,-1.1e-05,-1.4e-05,1.6e-05,7e-06
4e-06,0,-1.6e-05,6e-06,-4e-06,3e-06,-2.8e-05,3.1e-05,7e-06,-5e-06,-2.4e-05,1.5e-05,2.1e-05,-9e-06,-7e-06,0,-2e-06,5e-06,2e-06,0,-3e-06,-6e-06,4e-06,6e-06,9e-06,3e-06,-1e-06,4e-06,-2e-06,-4e-06,6e-06,-4e-06,3e-06,4e-06,5e-06,0,2e-06,-7e-06,-1e-06,-1.1e-05,1e-06,-1e-06,7e-06,-2e-06,-2e-05,4e-06,-1.4e-05,-2e-06,4e-06,2e-06,4e-06,-3e-06,3e-06,3e-06,3e-06,-2e-06,-3e-06,1e-05,-1e-06,-4e-06,2e-06,-3e-06,-6e-06,-3e-06,6e-06,0,-8e-06,-2e-06,-6e-06,2e-06,-1e-06,2e-06,-1e-06,-3e-06,1e-06,0,-1e-05,-8e-06,0,2e-06,4.6e-05,2.8e-05,1.3e-05,-2e-06,5e-06,-5e-06,6e-06,-5e-06,1e-06,1e-06,5e-06,-9.8e-05,-5e-06,-3.8e-05,4.8e-05,-6e-06,5e-06,-2e-06,0,-3e-06,0,-1e-06,0,2e-06,1e-06,-2e-06,-1e-06,0,6e-06,0,2e-06,3e-06,2e-06,0,-1.7e-05,-0.000121,4.2e-05,2.4e-05,-1e-05,-1.9e-05,-1.1e-05
9e-06,1e-06,1.1e-05,3.1e-05,5e-06,-5e-06,-1.2e-05,2.1e-05,3e-06,-2e-06,-4e-06,2e-06,9e-06,-3e-06,-4e-06,1.3e-05,3e-06,6e-06,0,-1e-06,-3e-06,0,-3e-06,3e-06,6e-06,-4e-06,-1e-06,1e-06,3e-06,-5e-06,-2e-06,-4e-06,-1e-05,-1e-05,-9e-06,0,1e-06,-1e-06,1e-06,1e-05,1e-06,-2e-06,-5e-06,-2e-06,-1e-06,0,7e-06,3e-06,7e-06,-1e-06,3e-06,-6e-06,-3e-06,-1e-06,2e-06,1e-06,3e-06,-2e-06,-2e-06,-7e-06,-3e-06,3e-06,1e-06,2e-06,-6e-06,2e-06,1e-06,-2e-06,1e-06,1e-06,-3e-06,-6e-06,1e-06,1e-06,0,-1e-06,-3e-06,1e-05,0,-7e-06,-0.000184,-2.2e-05,-1.6e-05,2.5e-05,-2e-06,-6e-06,7e-06,-1e-06,-3e-06,0,2e-06,-0.000121,2.2e-05,8e-06,-1.4e-05,5e-06,-2e-06,-3e-06,1e-06,2e-06,-1e-06,0,-2e-06,0,1e-06,-1e-06,0,-1e-06,-2e-06,-7e-06,1e-06,0,3e-06,0,6e-06,1.4e-05,-3.6e-05,-2e-05,-1.1e-05,1e-05,-2.1e-05
4e-06,6e-06,-6e-06,2e-05,-1e-05,-1e-06,1.1e-05,7e-06,2e-06,0,8e-06,-1.1e-05,-7e-06,-5e-06,1e-06,9e-06,-3e-06,8e-06,0,2e-06,-6e-06,-2e-06,1e-06,-5e-06,-5e-06,-5e-06,-1e-06,-2e-05,-2e-06,1e-06,0,1e-06,-1e-06,2e-06,-5e-06,0,-2e-06,4e-06,0,-2e-06,2e-06,2e-06,1.1e-05,-1e-06,2.4e-05,-1.2e-05,2e-06,0,0,3e-06,1e-06,-3e-06,-4e-06,3e-06,-3e-06,-1e-06,-2e-06,-2e-06,-1e-06,-5e-06,-4e-06,-2e-06,-5e-06,-1e-06,-7e-06,0,-2e-06,1e-06,-1e-06,-1e-06,-1e-06,-1e-06,-3e-06,3e-06,-1e-06,0,0,-7e-06,0,7e-06,-6.2e-05,9e-06,1.4e-05,-1.1e-05,4e-06,-2e-06,4e-06,0,0,-1e-06,1e-06,0.00013,1e-06,1.6e-05,1.4e-05,-4e-06,1e-06,2e-06,-3e-06,0,1e-06,-2e-06,2e-06,-1e-06,1e-06,-1e-06,-1e-06,-1e-06,0,0,2e-06,-1e-06,2e-06,0,8e-06,3.2e-05,3.3e-05,-1.3e-05,-1.2e-05,1.1e-05,-1.2e-05
7e-06,-1e-06,7e-06,2.1e-05,-2e-06,2e-06,1.6e-05,1.5e-05,0,3e-06,4e-06,-1.4e-05,-1.1e-05,-1.3e-05,3e-06,-3e-06,-5e-06,5e-06,-2e-06,0,-2e-06,3e-06,-3e-06,-1e-06,2e-06,7e-06,3e-06,4e-06,-3e-06,1e-06,0,6e-06,3e-06,-5e-06,5e-06,-1e-06,1e-06,5e-06,-1e-06,-1e-05,-2e-06,0,-1.5e-05,4e-06,-2.5e-05,8e-06,-7e-06,-2e-06,0,-1e-06,1e-06,-1e-06,-3e-06,-1e-06,0,1e-06,2e-06,1e-05,2e-06,-2e-06,-4e-06,2e-06,2e-06,-2e-06,1e-06,-1e-06,0,2e-06,-2e-06,-2e-06,0,1e-06,-1e-06,0,0,0,-2e-06,9e-06,0,-8e-06,0.000149,3.1e-05,0,-1e-05,-3e-06,-4e-06,3e-06,2e-06,0,-2e-06,2e-06,1.7e-05,-5.5e-05,-1.6e-05,7e-06,7e-06,-2e-06,2e-06,0,-1e-06,-1e-06,1e-06,3e-06,4e-06,-1e-06,-1e-06,-1e-06,-1e-06,2e-06,3e-06,0,1e-06,0,0,8e-06,-2.7e-05,-1.9e-05,1.7e-05,-1e-05,-1.8e-05,2.7e-05
5e-06,-5e-06,-1.1e-05,-1.2e-05,-1e-06,-6e-06,8e-06,-1e-06,3e-06,-9e-06,4e-06,-3e-06,-9e-06,-1.3e-05,4e-06,-5e-06,0,6e-06,-1e-06,-2e-06,-6e-06,4e-06,2e-06,-5e-06,-5e-06,0,1e-06,-6e-06,1e-06,-4e-06,-2e-06,1e-06,-3e-06,0,3e-06,-1e-06,-3e-06,0,1e-06,3e-06,-1e-06,0,1.3e-05,2e-06,3.3e-05,4e-06,6e-06,3e-06,-6e-06,-1e-06,0,-2e-06,-1e-06,0,2e-06,-1e-06,-2e-06,4e-06,1e-06,0,-4e-06,-2e-06,0,2e-06,1e-06,-2e-06,-4e-06,2e-06,-3e-06,-1e-06,-2e-06,5e-06,0,6e-06,0,1e-06,-3e-06,-1.2e-05,0,4e-06,0.000121,-7e-06,-1.3e-05,-2.1e-05,2e-06,-4e-06,2e-06,0,-3e-06,2e-06,-3e-06,-5.2e-05,2.4e-05,1.2e-05,-4e-06,-7e-06,0,-1e-06,-2e-06,0,-2e-06,-2e-06,2e-06,-1e-06,-1e-06,-1e-06,0,-1e-06,0,0,-2e-06,-2e-06,-1e-06,0,1e-06,5.9e-05,-3.8e-05,7e-06,-1.2e-05,1.2e-05,-7e-06
5e-06,-3e-06,7e-06,-2.1e-05,0,-2e-06,-1e-05,-1.1e-05,-1e-06,-3e-06,-8e-06,8e-06,-5e-06,-3e-06,3e-06,-7e-06,1e-06,3e-06,1e-06,1e-06,-2e-06,1e-06,0,-3e-06,-5e-06,-3e-06,-1e-06,-3e-06,1e-06,2e-06,2e-06,-2e-06,3e-06,-5e-06,-6e-06,1e-06,1e-06,-3e-06,-1e-06,3e-06,2e-06,-1e-06,-1.2e-05,-2e-06,-4.2e-05,-7e-06,-5e-06,-4e-06,-1e-06,0,0,-2e-06,3e-06,-3e-06,1e-06,-2e-06,3e-06,-3e-06,-1e-06,-2e-06,-1e-06,1e-06,-4e-06,-3e-06,0,0,1e-06,1e-06,-2e-06,1e-06,-1e-06,2e-06,1e-06,2e-06,0,0,-1e-06,8e-06,0,-2e-06,-3.4e-05,-1.7e-05,2.9e-05,8e-06,0,-4e-06,1e-06,-2e-06,4e-06,1e-06,5e-06,4.7e-05,5e-06,-3.2e-05,6e-06,8e-06,-1e-06,-3e-06,3e-06,0,1e-06,-2e-06,-2e-06,-4e-06,0,-1e-06,0,0,-2e-06,-3e-06,0,1e-06,-2e-06,0,7e-06,-2e-06,7e-05,6e-06,-1.1e-05,-6e-06,-3.2e-05
3e-06,-3e-06,-8e-06,-1.3e-05,0,3e-06,-1.5e-05,-2.1e-05,2e-06,-2e-06,2e-06,1.2e-05,7e-06,-4e-06,2e-06,-9e-06,0,-1e-06,1e-06,0,-5e-06,2e-06,-1e-06,-4e-06,6e-06,2e-06,-2e-06,-1e-06,-2e-06,-2e-06,3e-06,-1e-06,-2e-06,1e-06,-4e-06,0,-2e-06,-2e-06,2e-06,-7e-06,1e-06,0,1.6e-05,-3e-06,2e-05,3e-06,8e-06,1e-06,-3e-06,0,-2e-06,0,-4e-06,2e-06,-2e-06,-3e-06,-2e-06,-6e-06,-1e-06,-3e-06,2e-06,-1e-06,4e-06,1e-06,-2e-06,2e-06,-5e-06,-1e-06,0,1e-06,-1e-06,3e-06,-2e-06,4e-06,0,0,-3e-06,-8e-06,0,-2e-06,-0.000116,-1e-06,-1.7e-05,-1e-06,-1e-06,-4e-06,0,-2e-06,-1e-06,-1e-06,1e-06,-2.8e-05,2.3e-05,2.4e-05,-9e-06,-3e-06,1e-06,0,-2e-06,0,-2e-06,-2e-06,-1e-06,0,1e-06,-2e-06,-1e-06,0,2e-06,-1e-06,0,-1e-06,-2e-06,0,0,2e-05,-4e-05,-1.1e-05,-1e-05,0,2.1e-05
6e-06,3e-06,5e-06,-5e-06,-5e-06,-6e-06,-1.1e-05,-8e-06,0,-1e-06,-2e-06,1e-06,1.1e-05,-6e-06,2e-06,-9e-06,-1e-06,2e-06,1e-06,-1e-06,-3e-06,-2e-06,1e-06,-3e-06,-2e-06,-1e-06,0,-1e-05,1e-06,-3e-06,-3e-06,-2e-06,1e-06,-1e-06,6e-06,-1e-06,0,1e-06,-2e-06,0,-5e-06,1e-06,-1.7e-05,3e-06,-1.7e-05,3e-06,-6e-06,2e-06,4e-06,-1e-06,-1e-06,-1e-06,3e-06,0,-1e-06,2e-06,2e-06,-2e-06,1e-06,-3e-06,3e-06,0,-2e-06,-2e-06,-4e-06,1e-06,-1e-06,0,0,1e-06,-1e-06,-2e-06,1e-06,3e-06,0,0,-2e-06,9e-06,0,4e-06,5.9e-05,-6e-06,-1.8e-05,-3e-06,-2e-06,-3e-06,3e-06,-3e-06,-1e-06,-1e-06,-4e-06,-3.2e-05,4e-06,-4e-06,1.2e-05,-2e-06,0,2e-06,0,0,1e-06,0,0,2e-06,1e-06,-2e-06,-1e-06,1e-06,0,2e-06,2e-06,0,-1e-06,0,-1.1e-05,4e-05,4e-06,1e-06,-1e-05,-7e-06,-9e-06
2e-06,3e-06,-2e-06,5e-06,3e-06,0,0,0,0,0,1.1e-05,-1e-05,5e-06,-7e-06,0,3e-06,-1e-06,-4e-06,0,1e-06,-3e-06,-4e-06,-2e-06,-1e-06,0,-1e-06,2e-06,8e-06,-1e-06,2e-06,-4e-06,2e-06,-4e-06,4e-06,3e-06,0,0,-3e-06,1e-06,1e-06,0,-1e-06,1.6e-05,-1e-06,6e-06,-3e-06,0,-5e-06,0,2e-06,1e-06,-2e-06,-1e-06,2e-06,1e-06,-4e-06,-1e-06,3e-06,0,-4e-06,3e-06,0,0,0,1e-06,1e-06,-2e-06,0,-4e-06,0,-1e-06,-1e-06,0,1e-06,0,0,-2e-06,-4e-06,0,-2e-06,0.000146,-4e-06,1.6e-05,-2e-06,-2e-06,-3e-06,3e-06,-2e-06,0,0,4e-06,-3e-06,-3.9e-05,-7e-06,-1.1e-05,-2e-06,-1e-06,0,1e-06,1e-06,-2e-06,0,-2e-06,1e-06,-1e-06,-1e-06,0,1e-06,-2e-06,-1e-06,-2e-06,0,-1e-06,0,-1.2e-05,-4.1e-05,7e-06,-2e-06,-8e-06,1.1e-05,-1.2e-05
5e-06,-1e-06,-1e-06,4e-06,-3e-06,0,8e-06,8e-06,0,-4e-06,-1e-06,-1e-05,-5e-06,-9e-06,-2e-06,9e-06,2e-06,1e-06,0,-1e-06,-4e-06,-2e-06,1e-06,-1e-06,4e-06,1e-06,-2e-06,-8e-06,1e-06,-2e-06,4e-06,2e-06,-1e-06,0,-8e-06,0,-1e-06,-3e-06,-1e-06,-1e-06,2e-06,0,-1.7e-05,2e-06,8e-06,-1e-06,3e-06,3e-06,4e-06,0,-3e-06,-1e-06,1e-06,0,0,4e-06,1e-06,-2e-06,-1e-06,-2e-06,2e-06,0,1e-06,0,1e-06,-2e-06,-1e-06,-1e-06,-2e-06,-1e-06,1e-06,-1e-06,-1e-06,2e-06,0,0,-4e-06,3e-06,0,2e-06,3.8e-05,1.7e-05,-4e-06,-1.2e-05,-2e-06,-3e-06,3e-06,-3e-06,-1e-06,0,1e-06,6e-06,1e-05,2.7e-05,2e-05,-2e-06,0,-1e-06,-2e-06,-1e-06,1e-06,-1e-06,-3e-06,0,-1e-06,-1e-06,0,1e-06,2e-06,-1e-06,-1e-06,-1e-06,0,0,3e-06,8.2e-05,-2.5e-05,0,-7e-06,-9e-06,1e-05
3e-06,1e-06,4e-06,2.3e-05,1e-06,-2e-06,6e-06,2e-06,1e-06,-4e-06,4e-06,1e-06,-4e-06,-4e-06,-3e-06,5e-06,-1e-06,-2e-06,-1e-06,0,-2e-06,-2e-06,-1e-06,2e-06,-4e-06,1e-06,0,-4e-06,1e-06,-2e-06,-1e-06,0,2e-06,1e-06,-1e-06,0,1e-06,-2e-06,1e-06,0,-2e-06,0,1.9e-05,-2e-06,5e-06,0,-5e-06,-1e-06,-1e-06,0,1e-06,-1e-06,-2e-06,-1e-06,0,1e-06,0,-6e-06,0,-1e-06,0,0,-2e-06,-2e-06,-3e-06,0,0,0,0,-1e-06,-1e-06,2e-06,-1e-06,0,0,0,0,-1e-06,0,1e-06,-9.4e-05,-7e-06,-3e-06,-8e-06,5e-06,-3e-06,1e-06,-2e-06,1e-06,0,-1e-06,7.1e-05,8e-06,-2.6e-05,-1.3e-05,-1e-06,-1e-06,0,2e-06,0,-1e-06,-1e-06,-1e-06,0,0,-1e-06,0,-1e-06,0,1e-06,0,1e-06,1e-06,0,1.3e-05,-1.7e-05,3.6e-05,-9e-06,-7e-06,2e-06,-1e-05
3e-06,0,-5e-06,4e-06,-2e-06,0,-1e-06,8e-06,-1e-06,-1e-06,-1e-06,1e-05,-5e-06,-2e-06,-2e-06,-3e-06,-3e-06,-3e-06,-1e-06,1e-06,-4e-06,2e-06,1e-06,0,1e-06,-1e-06,-2e-06,7e-06,-2e-06,1e-06,0,1e-06,-1e-06,0,5e-06,0,-1e-06,1e-06,0,-3e-06,-3e-06,0,-1.8e-05,1e-06,-6e-06,3e-06,8e-06,0,0,1e-06,1e-06,-3e-06,2e-06,1e-06,0,0,0,-4e-06,1e-06,-1e-06,-2e-06,1e-06,1e-06,2e-06,-1e-06,0,-2e-06,0,-1e-06,-1e-06,0,2e-06,1e-06,0,0,0,-3e-06,-2e-06,0,0,-6.4e-05,-9e-06,9e-06,2e-06,2e-06,-3e-06,0,-2e-06,-1e-06,0,2e-06,-4.1e-05,3e-06,-2e-06,5e-06,0,1e-06,1e-06,-2e-06,1e-06,0,-1e-06,3e-06,0,1e-06,-1e-06,0,0,-1e-06,2e-06,1e-06,-1e-06,1e-06,0,7e-06,-3.6e-05,9e-06,7e-06,-6e-06,1e-06,2e-06
2e-06,0,7e-06,-6e-06,0,-1e-06,-7e-06,8e-06,1e-06,1e-06,-2e-06,6e-06,-1e-06,-6e-06,-2e-06,-4e-06,0,-2e-06,0,-1e-06,-2e-06,3e-06,-1e-06,2e-06,1e-06,0,2e-06,-5e-06,2e-06,-1e-06,1e-06,-2e-06,-1e-06,4e-06,0,0,1e-06,4e-06,0,1e-06,0,0,1.8e-05,-1e-06,0,1e-06,-7e-06,5e-06,-4e-06,-1e-06,-1e-06,-1e-06,1e-06,-1e-06,1e-06,1e-06,1e-06,2e-06,0,-1e-06,-2e-06,-1e-06,-2e-06,-2e-06,0,1e-06,1e-06,0,-2e-06,0,-1e-06,2e-06,-1e-06,0,0,0,-2e-06,-1e-06,0,0,9.4e-05,1.3e-05,5e-06,8e-06,0,-3e-06,0,-2e-06,2e-06,0,0,-4.9e-05,-4e-06,1e-06,4e-06,-6e-06,0,0,1e-06,-1e-06,0,-1e-06,1e-06,-1e-06,0,-1e-06,0,0,1e-06,0,0,0,1e-06,0,-4e-06,5.9e-05,-2.3e-05,0,-6e-06,-2e-06,-7e-06
4e-06,1e-06,-8e-06,-1.4e-05,1e-06,-2e-06,-7e-06,1.1e-05,0,-2e-06,0,-3e-06,4e-06,-7e-06,-1e-06,-6e-06,2e-06,0,1e-06,0,-4e-06,2e-06,1e-06,0,-3e-06,1e-06,1e-06,6e-06,-1e-06,-1e-06,-1e-06,0,0,0,-5e-06,0,0,3e-06,0,-1e-06,1e-06,0,-1.8e-05,0,-7e-06,-3e-06,2e-06,-2e-06,1e-06,0,2e-06,0,-2e-06,-1e-06,-1e-06,-2e-06,-1e-06,4e-06,-1e-06,-2e-06,-2e-06,0,1e-06,1e-06,0,0,-4e-06,-1e-06,-1e-06,1e-06,-1e-06,-1e-06,0,-1e-06,0,0,-1e-06,3e-06,0,2e-06,7.1e-05,-3e-06,1e-06,-9e-06,-2e-06,-2e-06,0,-2e-06,-1e-06,0,1e-06,7.5e-05,-8e-06,-1e-06,-1e-05,8e-06,1e-06,-1e-06,0,0,0,-1e-06,-1e-06,0,0,-1e-06,0,0,1e-06,-2e-06,1e-06,0,1e-06,0,-1.1e-05,-5e-05,1.9e-05,1e-05,-6e-06,0,4e-06
1e-06,-2e-06,8e-06,-1.2e-05,-1e-06,1e-06,-4e-06,-2e-06,0,-1e-06,0,-1e-05,6e-06,-4e-06,0,-6e-06,-1e-06,0,0,1e-06,-3e-06,2e-06,-1e-06,1e-06,4e-06,0,-1e-06,-3e-06,1e-06,2e-06,1e-06,0,-1e-06,0,-2e-06,0,0,-1e-06,-1e-06,-3e-06,-2e-06,0,1.9e-05,1e-06,8e-06,0,0,-1e-06,-2e-06,0,-1e-06,0,0,0,0,0,2e-06,-2e-06,0,-3e-06,-1e-06,-1e-06,-1e-06,0,-1e-06,-1e-06,2e-06,0,0,1e-06,0,0,0,-2e-06,0,0,-2e-06,-2e-06,0,0,-6.5e-05,-1.3e-05,-1.6e-05,-6e-06,-2e-06,-2e-06,0,-1e-06,-1e-06,0,1e-06,-2.2e-05,9e-06,4e-06,1e-06,-6e-06,0,0,0,0,0,-1e-06,-1e-06,0,0,-1e-06,0,0,-1e-06,0,-2e-06,0,0,0,-5e-06,3e-06,-2.9e-05,-1e-05,-7e-06,1e-06,2e-06
4e-06,0,-8e-06,-3e-06,0,-3e-06,0,-5e-06,0,-3e-06,3e-06,-6e-06,1e-06,-5e-06,1e-06,-4e-06,-2e-06,0,0,-1e-06,-3e-06,-1e-06,0,1e-06,0,1e-06,-2e-06,3e-06,-2e-06,-2e-06,2e-06,0,-1e-06,-3e-06,6e-06,0,0,-2e-06,1e-06,2e-06,-1e-06,0,-1.8e-05,0,-1.7e-05,1e-06,-2e-06,0,2e-06,1e-06,0,-1e-06,-1e-06,1e-06,0,-1e-06,-2e-06,-3e-06,1e-06,-2e-06,1e-06,1e-06,-1e-06,-1e-06,-2e-06,0,-3e-06,0,0,0,-1e-06,-1e-06,0,-2e-06,0,0,-2e-06,6e-06,0,0,-0.000121,6e-06,9e-06,-7e-06,-2e-06,-3e-06,1e-06,0,1e-06,0,0,-4.6e-05,8e-06,1e-06,-5e-06,4e-06,-1e-06,0,1e-06,0,-1e-06,0,0,2e-06,0,-1e-06,0,0,1e-06,1e-06,0,0,0,0,2e-06,7e-06,1e-05,1e-05,-7e-06,3e-06,-1.4e-05
2e-06,1e-06,7e-06,6e-06,-1e-06,-2e-06,1e-06,-9e-06,0,-2e-06,-4e-06,3e-06,-3e-06,-4e-06,1e-06,4e-06,0,2e-06,-1e-06,0,-4e-06,-2e-06,-1e-06,0,-2e-06,-1e-06,0,9e-06,0,-1e-06,0,1e-06,-2e-06,0,0,0,-1e-06,0,-1e-06,1e-06,-1e-06,0,1.8e-05,0,2.3e-05,-1e-06,6e-06,-2e-06,-1e-06,-1e-06,1e-06,-2e-06,1e-06,0,0,0,2e-06,3e-06,0,-1e-06,2e-06,0,2e-06,2e-06,-1e-06,0,0,0,-1e-06,-1e-06,0,2e-06,-1e-06,-2e-06,0,0,-2e-06,-8e-06,0,3e-06,-2e-06,6e-06,2e-06,5e-06,2e-06,-2e-06,1e-06,-1e-06,-1e-06,0,1e-06,2.5e-05,-2e-06,4e-06,1.2e-05,-2e-06,0,0,-1e-06,0,1e-06,-1e-06,0,0,0,-1e-06,0,0,1e-06,0,0,0,-1e-06,0,4e-06,-3.9e-05,1.5e-05,-1.2e-05,-7e-06,-5e-06,3e-06
