0.004003,0.003699,0.004959,0.006113,0.005539,0.004451,0.003929,0.003946,0.004767,0.005343,0.005118,0.004983,0.005354,0.005934,0.005768,0.0049,0.004362,0.00425,0.004379,0.004804,0.005281,0.005881,0.005657,0.004698,0.004565,0.00486,0.004959,0.00529
0.004782,0.004473,0.006075,0.007474,0.006682,0.005366,0.004745,0.004756,0.005638,0.006305,0.006188,0.006047,0.006399,0.007131,0.007121,0.006179,0.005414,0.00513,0.005302,0.005778,0.006317,0.007101,0.006922,0.005835,0.00558,0.005849,0.005959,0.006416
0.006,0.00578,0.007799,0.009459,0.008423,0.006868,0.006165,0.006217,0.007046,0.007724,0.007874,0.007767,0.008002,0.008975,0.009291,0.008281,0.007153,0.006542,0.006765,0.007318,0.007942,0.009016,0.008965,0.007703,0.007211,0.007388,0.007496,0.008187
0.006732,0.00677,0.008617,0.010075,0.009095,0.00776,0.007346,0.007517,0.007941,0.008292,0.00877,0.008842,0.008938,0.010098,0.010576,0.009456,0.008134,0.007355,0.007576,0.008153,0.008857,0.010048,0.010062,0.008755,0.008311,0.008561,0.008598,0.009331
0.006924,0.007325,0.00846,0.009315,0.008788,0.008006,0.007981,0.008267,0.008291,0.008245,0.008721,0.008949,0.009227,0.0104,0.010581,0.009276,0.008036,0.007555,0.007845,0.008359,0.009082,0.010059,0.009924,0.008721,0.008787,0.009395,0.009325,0.009864
0.007357,0.007996,0.008529,0.009039,0.008814,0.008138,0.008368,0.008674,0.008403,0.008414,0.008795,0.008883,0.009239,0.010166,0.00998,0.008662,0.007733,0.007838,0.00835,0.008881,0.009584,0.009833,0.009292,0.008484,0.00944,0.010577,0.01007,0.010131
0.008683,0.00926,0.00981,0.010324,0.009839,0.0089,0.009292,0.009461,0.008869,0.009165,0.009591,0.009248,0.009406,0.010671,0.010517,0.009026,0.008441,0.00875,0.009191,0.009633,0.010243,0.009941,0.00916,0.008709,0.010272,0.011898,0.011054,0.01067
0.011022,0.011597,0.012351,0.012393,0.011523,0.010404,0.010652,0.010788,0.010148,0.010728,0.011513,0.010643,0.010391,0.012258,0.012223,0.010712,0.010605,0.010807,0.010979,0.011099,0.011299,0.010867,0.010128,0.009629,0.011002,0.012682,0.012095,0.011969
0.01373,0.014478,0.015237,0.014287,0.013026,0.011841,0.011692,0.012245,0.012211,0.013101,0.014092,0.01257,0.011884,0.013863,0.013875,0.012809,0.013181,0.013554,0.013573,0.012936,0.01226,0.011891,0.011579,0.011058,0.011717,0.012724,0.012854,0.013644
0.015854,0.016428,0.016881,0.015147,0.013862,0.013098,0.012523,0.013339,0.014305,0.015429,0.016296,0.014469,0.013404,0.01476,0.014842,0.014665,0.015153,0.015549,0.015629,0.014536,0.013027,0.012563,0.013039,0.012959,0.013077,0.013302,0.013646,0.014834
0.016592,0.01641,0.015982,0.014592,0.014225,0.013923,0.012844,0.013875,0.015462,0.01611,0.016751,0.015128,0.013986,0.015059,0.015492,0.016105,0.016312,0.016185,0.01643,0.015887,0.014167,0.012962,0.013713,0.014405,0.014356,0.01397,0.014144,0.015016
0.015346,0.014657,0.013886,0.013496,0.014502,0.01454,0.013342,0.015104,0.01637,0.016006,0.01653,0.015007,0.013908,0.014866,0.015705,0.016919,0.016912,0.015833,0.016027,0.016716,0.015686,0.013904,0.014198,0.014753,0.014182,0.013728,0.014141,0.014743
0.012951,0.012786,0.012404,0.012499,0.014382,0.014714,0.014077,0.016495,0.016637,0.015957,0.016836,0.014769,0.013414,0.014073,0.015154,0.016926,0.016645,0.014914,0.015417,0.016894,0.016579,0.015046,0.014382,0.013556,0.012637,0.013101,0.013709,0.014095
0.011839,0.012187,0.012464,0.012635,0.014067,0.014507,0.014774,0.016984,0.016178,0.015904,0.017222,0.015067,0.013285,0.013332,0.014471,0.015455,0.014652,0.013795,0.015013,0.01629,0.016002,0.015393,0.014347,0.012374,0.01149,0.012718,0.013445,0.013789
0.011974,0.013119,0.014237,0.013922,0.014217,0.01517,0.015865,0.01623,0.01518,0.015598,0.016167,0.014793,0.013421,0.012995,0.014448,0.014058,0.012705,0.01312,0.014672,0.015775,0.015414,0.015749,0.014952,0.012477,0.012188,0.013984,0.015034,0.015025
0.012705,0.01486,0.016561,0.015695,0.015626,0.018157,0.019372,0.017856,0.016726,0.017243,0.01673,0.015936,0.014805,0.013503,0.01501,0.014301,0.01282,0.014401,0.016839,0.017109,0.016265,0.018181,0.017895,0.014845,0.015475,0.017849,0.019155,0.018267
0.013792,0.017272,0.01903,0.017643,0.018213,0.023309,0.025274,0.022629,0.021943,0.022817,0.021613,0.019107,0.017023,0.014905,0.016115,0.016665,0.015143,0.016233,0.019815,0.019954,0.018821,0.022157,0.022554,0.019662,0.021424,0.024555,0.026665,0.024998
0.017373,0.021177,0.022202,0.020194,0.021425,0.02888,0.031727,0.028493,0.028966,0.030403,0.028031,0.022544,0.018928,0.016362,0.018037,0.021036,0.019967,0.019978,0.023728,0.024466,0.023026,0.026274,0.027359,0.025079,0.027922,0.031676,0.034295,0.032331
0.022836,0.025991,0.026536,0.024026,0.025376,0.032858,0.035587,0.033455,0.035661,0.0369,0.034108,0.027291,0.021947,0.01895,0.021744,0.027195,0.026747,0.025755,0.029076,0.030973,0.028323,0.028551,0.029983,0.02903,0.03382,0.038044,0.03929,0.03753
0.027752,0.030753,0.031718,0.028986,0.030789,0.036048,0.036182,0.03594,0.040198,0.041186,0.040114,0.0345,0.027855,0.023875,0.027102,0.034623,0.034244,0.030665,0.033219,0.037923,0.034233,0.029332,0.030393,0.031413,0.038422,0.043462,0.043749,0.041927
0.030959,0.035476,0.037415,0.033864,0.035541,0.038891,0.03605,0.037456,0.043768,0.045207,0.04562,0.041056,0.035464,0.030943,0.031017,0.038979,0.0397,0.033669,0.036444,0.044202,0.039651,0.031337,0.031383,0.032989,0.040257,0.045302,0.045979,0.044118
0.031906,0.036382,0.038824,0.035997,0.037434,0.039065,0.035275,0.038442,0.046066,0.04897,0.049785,0.044621,0.040762,0.036743,0.031964,0.038057,0.042593,0.038838,0.041373,0.048487,0.043851,0.035885,0.035166,0.035237,0.040392,0.043838,0.043697,0.042925
0.031774,0.034226,0.037322,0.035917,0.03587,0.036871,0.03321,0.036073,0.044223,0.048009,0.04715,0.043391,0.041894,0.038277,0.030772,0.034417,0.044659,0.046285,0.045716,0.047071,0.043187,0.040397,0.040715,0.037899,0.038806,0.041777,0.041317,0.039104
0.032555,0.032834,0.036769,0.036191,0.033306,0.035665,0.032669,0.032155,0.038928,0.04242,0.040176,0.039304,0.038852,0.035144,0.028003,0.029099,0.043274,0.050073,0.045843,0.041775,0.03956,0.042404,0.044806,0.039191,0.03564,0.038882,0.039419,0.035112
0.031089,0.031427,0.035759,0.03428,0.029806,0.034393,0.034662,0.031281,0.034112,0.035544,0.032427,0.033252,0.034405,0.033286,0.02769,0.024937,0.036345,0.043946,0.039154,0.035325,0.036059,0.040009,0.041731,0.03508,0.031779,0.037131,0.039497,0.035275
0.028391,0.031552,0.036863,0.03196,0.027938,0.034459,0.039242,0.035905,0.032731,0.029776,0.025071,0.026618,0.031749,0.036698,0.03162,0.023476,0.027576,0.031863,0.030846,0.032201,0.036674,0.037937,0.033259,0.026567,0.026767,0.03496,0.039517,0.037091
0.028382,0.031735,0.037694,0.032335,0.029487,0.036547,0.045039,0.042901,0.033902,0.026976,0.022637,0.02655,0.034517,0.042233,0.036464,0.024711,0.024236,0.026869,0.028776,0.03275,0.038229,0.036698,0.029337,0.024909,0.025809,0.034057,0.040276,0.038633
0.029812,0.03262,0.035798,0.030619,0.03025,0.038088,0.046879,0.044777,0.033298,0.026376,0.026476,0.031911,0.038128,0.042941,0.037682,0.026341,0.022062,0.025251,0.029676,0.03238,0.036259,0.035552,0.030892,0.028549,0.027477,0.03312,0.039216,0.038263
0.029887,0.035194,0.034877,0.027446,0.02797,0.036401,0.042514,0.04092,0.033573,0.029621,0.035173,0.040155,0.040549,0.039015,0.035891,0.027632,0.021185,0.026219,0.030773,0.030677,0.035114,0.03751,0.033677,0.03158,0.030896,0.033626,0.035323,0.035069
0.031999,0.038382,0.041162,0.03555,0.031251,0.034778,0.040101,0.042988,0.040647,0.037983,0.045716,0.047615,0.043237,0.041379,0.042584,0.034854,0.026159,0.031341,0.034246,0.036292,0.04143,0.04336,0.039515,0.036029,0.03464,0.036773,0.039268,0.03778
0.041024,0.042453,0.04799,0.048187,0.040604,0.040128,0.048197,0.054468,0.050727,0.044797,0.051508,0.053274,0.047334,0.050729,0.058139,0.047665,0.035814,0.040427,0.043593,0.048637,0.049076,0.049726,0.051343,0.047467,0.041234,0.040331,0.048823,0.047459
0.049158,0.046626,0.053113,0.057153,0.047496,0.044269,0.055366,0.061741,0.05687,0.04764,0.047687,0.051626,0.051026,0.059159,0.069169,0.056036,0.041858,0.046749,0.05142,0.057846,0.054321,0.05405,0.059928,0.056124,0.04614,0.043312,0.056731,0.055391
0.048098,0.043447,0.048727,0.054123,0.04427,0.03987,0.052707,0.056021,0.05203,0.046012,0.038592,0.040084,0.046608,0.057113,0.065699,0.052456,0.038377,0.043075,0.048654,0.054895,0.050342,0.049991,0.056975,0.053344,0.042669,0.039379,0.05408,0.053089
0.037806,0.031971,0.033795,0.038403,0.031118,0.028724,0.0399,0.038777,0.036856,0.037434,0.027292,0.023916,0.033613,0.04351,0.048129,0.037721,0.02624,0.029801,0.034438,0.0392,0.035942,0.036727,0.042335,0.038824,0.031049,0.030041,0.040702,0.039384
0.03017,0.021033,0.017352,0.019782,0.017783,0.020601,0.02565,0.020493,0.020696,0.02529,0.018496,0.013383,0.023599,0.032951,0.030886,0.022534,0.014993,0.017145,0.018261,0.021337,0.020941,0.023313,0.026645,0.023732,0.019048,0.022268,0.027185,0.023663
0.025835,0.01746,0.012123,0.011783,0.014365,0.018722,0.017373,0.012424,0.016309,0.020571,0.014355,0.012266,0.023168,0.031514,0.025717,0.015519,0.012826,0.014825,0.012399,0.016335,0.01812,0.016901,0.017935,0.017856,0.014999,0.019149,0.022619,0.017026
0.022183,0.016702,0.016629,0.016316,0.018817,0.019804,0.015043,0.012389,0.019915,0.02389,0.015004,0.014723,0.024297,0.028586,0.022187,0.012941,0.015975,0.02009,0.016973,0.02199,0.023332,0.018308,0.015313,0.01405,0.013467,0.017296,0.02199,0.015797
0.018855,0.017686,0.022083,0.022938,0.024306,0.021955,0.016702,0.015401,0.023668,0.026359,0.015257,0.016799,0.023562,0.022151,0.017453,0.011786,0.018694,0.026272,0.023891,0.02838,0.028318,0.02177,0.016134,0.011877,0.013287,0.018611,0.024912,0.01907
0.017052,0.019322,0.025741,0.028132,0.027933,0.022263,0.018504,0.019628,0.024491,0.026764,0.017665,0.018955,0.021713,0.018357,0.016335,0.013867,0.020385,0.030841,0.029381,0.031297,0.029497,0.023377,0.017446,0.012123,0.016721,0.022939,0.027163,0.02332
0.024912,0.02518,0.028532,0.031242,0.030296,0.025005,0.025312,0.025019,0.022787,0.02786,0.0253,0.022649,0.022654,0.019258,0.018754,0.020268,0.025243,0.032889,0.031535,0.02993,0.027064,0.022911,0.021579,0.016366,0.02263,0.028228,0.028001,0.026251
