0.005663,0.004935,0.005483,0.005975,0.005755,0.005787,0.005788,0.005634,0.005535,0.005513,0.005976,0.006026,0.005806,0.005897,0.005533,0.005398,0.00553,0.005171,0.005424,0.005629,0.005955,0.006884,0.006193,0.005608,0.0061,0.006509,0.007704,0.007818
0.006963,0.006053,0.006697,0.007239,0.006923,0.007028,0.007026,0.006798,0.006606,0.006564,0.007271,0.007453,0.007212,0.007303,0.006814,0.006571,0.00678,0.00641,0.006655,0.006861,0.007214,0.008172,0.007389,0.00696,0.00757,0.007703,0.008851,0.009265
0.009064,0.007864,0.008577,0.009139,0.008668,0.008963,0.009026,0.00862,0.00816,0.008083,0.009201,0.009697,0.009544,0.009566,0.008814,0.008391,0.008708,0.008338,0.008543,0.008708,0.009058,0.010073,0.009229,0.009037,0.009802,0.009486,0.010503,0.011395
0.010174,0.008883,0.009532,0.01005,0.009455,0.00984,0.010057,0.009608,0.008838,0.008638,0.010018,0.011045,0.011169,0.010809,0.009775,0.009365,0.009693,0.009306,0.009432,0.009531,0.009822,0.01087,0.010047,0.009792,0.010701,0.010403,0.011245,0.012097
0.01025,0.009233,0.009838,0.01034,0.009562,0.00984,0.010068,0.009454,0.008627,0.008564,0.010008,0.011483,0.011807,0.010878,0.009764,0.009693,0.009804,0.009321,0.009533,0.009607,0.009741,0.010492,0.009553,0.008958,0.010032,0.010475,0.011243,0.01136
0.010591,0.009963,0.010604,0.010829,0.009775,0.010201,0.010149,0.009055,0.008522,0.008951,0.010421,0.012073,0.012448,0.011257,0.010135,0.010211,0.010032,0.009572,0.010025,0.010033,0.010112,0.010438,0.009336,0.00863,0.009656,0.010649,0.011371,0.010974
0.0121,0.011213,0.011961,0.011991,0.010682,0.011466,0.01129,0.00997,0.009784,0.010046,0.011161,0.012902,0.013476,0.012495,0.011252,0.011097,0.011004,0.010795,0.011021,0.010611,0.010935,0.011727,0.010679,0.009708,0.010432,0.01164,0.012576,0.011894
0.013996,0.012461,0.013357,0.013598,0.012045,0.012862,0.013129,0.012381,0.012472,0.011876,0.012262,0.014234,0.015275,0.014533,0.013237,0.012539,0.012184,0.012042,0.011919,0.011313,0.011956,0.013497,0.012761,0.011564,0.011869,0.013245,0.01439,0.013401
0.015859,0.01376,0.014307,0.014978,0.01388,0.014741,0.015239,0.015142,0.015741,0.015005,0.015244,0.017082,0.018,0.016997,0.015766,0.014722,0.014021,0.01408,0.013989,0.013503,0.013886,0.015399,0.015137,0.014061,0.013557,0.014652,0.01594,0.014866
0.016997,0.014698,0.014611,0.01561,0.015484,0.016226,0.016248,0.01722,0.01908,0.018637,0.018947,0.020003,0.019979,0.018586,0.017695,0.016987,0.016365,0.016663,0.016674,0.016388,0.01659,0.017687,0.017662,0.016817,0.015517,0.015765,0.016897,0.016271
0.016595,0.014913,0.015057,0.016298,0.016771,0.017125,0.016173,0.017873,0.021257,0.021218,0.021079,0.020886,0.020009,0.018365,0.01759,0.017729,0.017859,0.018376,0.018287,0.018232,0.018665,0.019365,0.0194,0.018988,0.01728,0.016344,0.01685,0.017046
0.01409,0.013672,0.014763,0.016196,0.016923,0.01696,0.015216,0.016976,0.021403,0.021515,0.020588,0.01988,0.018627,0.01687,0.015732,0.016254,0.017516,0.018485,0.018104,0.017803,0.018192,0.018934,0.019412,0.019032,0.017337,0.016142,0.016043,0.016637
0.011445,0.012207,0.01392,0.015079,0.015601,0.015377,0.013356,0.014914,0.019466,0.018844,0.01727,0.017821,0.016629,0.014649,0.01326,0.013388,0.015194,0.016507,0.016236,0.015779,0.015334,0.016275,0.017761,0.016792,0.015298,0.014632,0.014174,0.014494
0.010911,0.011667,0.012806,0.013017,0.012947,0.01273,0.011079,0.012629,0.016465,0.01478,0.013382,0.015632,0.014508,0.012627,0.012033,0.011519,0.012926,0.014138,0.014012,0.013531,0.012447,0.013895,0.015778,0.014225,0.012935,0.012953,0.012885,0.012265
0.012551,0.01221,0.011833,0.011746,0.011885,0.011706,0.010735,0.011876,0.014229,0.012366,0.01123,0.013737,0.014169,0.013824,0.013927,0.012585,0.012545,0.01279,0.012294,0.011699,0.010819,0.013368,0.014919,0.013175,0.012738,0.013057,0.013367,0.011826
0.016739,0.015421,0.013451,0.013797,0.014009,0.013904,0.014515,0.015039,0.015167,0.012723,0.01138,0.013742,0.017118,0.018639,0.018739,0.017453,0.016036,0.015361,0.013959,0.013042,0.012868,0.015407,0.016327,0.015165,0.01554,0.015592,0.015653,0.01395
0.023205,0.021516,0.018973,0.020212,0.019432,0.017945,0.020474,0.022763,0.022154,0.017054,0.013795,0.016535,0.022789,0.025671,0.025742,0.02546,0.023595,0.022268,0.01914,0.017978,0.01864,0.0193,0.019919,0.020446,0.021005,0.019883,0.01993,0.01903
0.032493,0.029383,0.025918,0.029186,0.027067,0.021509,0.025665,0.032498,0.032399,0.023009,0.017791,0.021348,0.028662,0.032017,0.032467,0.033591,0.031997,0.030594,0.025506,0.024683,0.026929,0.024166,0.023919,0.026764,0.026988,0.024506,0.026007,0.026882
0.041252,0.036364,0.032301,0.038954,0.035227,0.023976,0.028483,0.040279,0.041517,0.028136,0.02204,0.026761,0.032742,0.034853,0.035522,0.037716,0.037386,0.037795,0.032707,0.032729,0.035725,0.028681,0.027051,0.031748,0.03105,0.027706,0.031349,0.034395
0.043957,0.03794,0.03494,0.04443,0.039145,0.025133,0.029102,0.042019,0.044602,0.030989,0.026193,0.031769,0.034697,0.034879,0.03529,0.037174,0.037626,0.040638,0.038711,0.039066,0.040345,0.030298,0.027716,0.033224,0.032004,0.029212,0.033716,0.037552
0.040137,0.033602,0.033017,0.041516,0.035804,0.026575,0.031171,0.038801,0.040696,0.031307,0.029322,0.03615,0.036212,0.034852,0.037525,0.039095,0.036227,0.038473,0.039819,0.039597,0.039486,0.030993,0.027534,0.031039,0.030157,0.028723,0.032335,0.035053
0.035884,0.02942,0.029689,0.033687,0.030418,0.029941,0.034591,0.034246,0.034015,0.030052,0.029611,0.038303,0.038918,0.037321,0.043116,0.043674,0.035614,0.034231,0.036755,0.037122,0.036534,0.03217,0.02866,0.027723,0.026923,0.027628,0.03052,0.030958
0.032327,0.027713,0.02885,0.029933,0.03116,0.036042,0.039466,0.034555,0.031516,0.028958,0.027548,0.037464,0.042076,0.04284,0.048518,0.045226,0.036033,0.035032,0.038141,0.040219,0.039342,0.034973,0.031403,0.027805,0.025331,0.026855,0.02922,0.030322
0.031522,0.029115,0.03177,0.032821,0.037262,0.044436,0.044078,0.035417,0.030138,0.026763,0.026528,0.037323,0.045021,0.04831,0.049941,0.04371,0.036883,0.038433,0.042437,0.044693,0.042781,0.035619,0.031873,0.02779,0.025895,0.029788,0.030249,0.031266
0.028883,0.027247,0.030821,0.034096,0.041272,0.0493,0.04396,0.032583,0.029659,0.02682,0.027174,0.037476,0.044802,0.048081,0.048133,0.042127,0.038253,0.042619,0.044415,0.044169,0.04041,0.030199,0.029038,0.028175,0.027583,0.035222,0.036711,0.03343
0.025387,0.022859,0.025576,0.030592,0.038637,0.045723,0.039907,0.032737,0.034458,0.03032,0.027163,0.039828,0.048603,0.045726,0.048259,0.045837,0.039969,0.04446,0.043123,0.041739,0.038067,0.026701,0.030755,0.034744,0.03187,0.03874,0.041576,0.034313
0.025885,0.025123,0.027957,0.030248,0.03595,0.041034,0.038368,0.040143,0.04382,0.036114,0.029566,0.044308,0.05813,0.052576,0.055881,0.052733,0.041374,0.043111,0.041298,0.044802,0.044402,0.031957,0.036988,0.042918,0.035016,0.036742,0.040404,0.03289
0.028575,0.0324,0.038348,0.035266,0.036405,0.038362,0.037905,0.04952,0.056137,0.045496,0.039116,0.053638,0.068131,0.063534,0.064399,0.058003,0.042044,0.039498,0.040274,0.049172,0.051321,0.041464,0.043056,0.045626,0.034333,0.031079,0.035508,0.031365
0.03161,0.038675,0.048058,0.041629,0.038695,0.036016,0.035804,0.053229,0.062619,0.053739,0.049853,0.063005,0.074541,0.070685,0.072683,0.067378,0.04692,0.039086,0.04313,0.054765,0.058166,0.051124,0.046457,0.04222,0.032334,0.028461,0.030471,0.028098
0.038774,0.042542,0.049842,0.045302,0.043508,0.039145,0.036936,0.049896,0.057427,0.053691,0.0544,0.063469,0.069303,0.067802,0.073408,0.072823,0.052066,0.043663,0.051264,0.060893,0.063251,0.060288,0.054778,0.046556,0.035804,0.028352,0.027175,0.025553
0.045363,0.040277,0.040573,0.042365,0.046782,0.042066,0.041132,0.050593,0.051622,0.049354,0.053719,0.05481,0.054324,0.060073,0.064927,0.066757,0.05536,0.049681,0.058491,0.066398,0.066282,0.067929,0.064384,0.054577,0.042656,0.030076,0.027071,0.025742
0.044144,0.032585,0.027053,0.03647,0.048716,0.043942,0.047018,0.05679,0.048401,0.043545,0.051955,0.04938,0.042465,0.054378,0.058188,0.055475,0.056343,0.053971,0.058018,0.06162,0.057945,0.065274,0.065169,0.054502,0.046016,0.033407,0.030514,0.029712
0.034338,0.023787,0.018445,0.029776,0.043279,0.040683,0.048681,0.055772,0.041818,0.037437,0.045689,0.047329,0.037156,0.047075,0.054634,0.047572,0.051714,0.05319,0.052793,0.048769,0.042755,0.052794,0.05708,0.046267,0.040631,0.034854,0.035704,0.034899
0.021828,0.014544,0.014941,0.024114,0.031604,0.032917,0.044112,0.046941,0.032731,0.027208,0.032413,0.038169,0.029369,0.035288,0.044914,0.041129,0.042757,0.042643,0.042023,0.038102,0.03191,0.040975,0.046023,0.034636,0.028882,0.030384,0.036082,0.035304
0.014899,0.009147,0.01241,0.020364,0.02339,0.024625,0.033545,0.033913,0.023632,0.017012,0.019469,0.02564,0.021653,0.023854,0.029632,0.028944,0.029148,0.028096,0.028337,0.0274,0.023127,0.032973,0.03444,0.024481,0.022067,0.02679,0.034553,0.03024
0.011188,0.007829,0.01019,0.015788,0.018645,0.019425,0.023225,0.023024,0.017158,0.012239,0.013816,0.019621,0.018205,0.015938,0.0159,0.015793,0.018378,0.019991,0.018824,0.017272,0.014379,0.023697,0.02331,0.017637,0.020594,0.026611,0.035434,0.027467
0.01076,0.008147,0.008537,0.01116,0.013315,0.014482,0.019715,0.019408,0.013261,0.009867,0.010499,0.015473,0.017158,0.012338,0.009726,0.011439,0.014889,0.01666,0.01611,0.014134,0.010284,0.017518,0.018493,0.01585,0.018283,0.024082,0.034609,0.025312
0.011658,0.008361,0.008975,0.010442,0.010951,0.011544,0.017796,0.016317,0.01004,0.008794,0.008099,0.010504,0.015738,0.012285,0.009393,0.012533,0.013409,0.014257,0.014394,0.013042,0.010039,0.016691,0.019232,0.016152,0.015438,0.022007,0.031342,0.020946
0.012143,0.00789,0.010026,0.012026,0.010039,0.008985,0.013888,0.013716,0.011117,0.010991,0.008882,0.010156,0.016448,0.013814,0.011054,0.01372,0.011043,0.012367,0.014005,0.012743,0.012313,0.018217,0.022276,0.017063,0.013768,0.018963,0.028028,0.021081
0.012256,0.008479,0.01249,0.015877,0.01154,0.007943,0.010372,0.012595,0.014651,0.013959,0.011179,0.01433,0.018896,0.015609,0.013555,0.015022,0.012395,0.01331,0.013908,0.014651,0.016702,0.020647,0.02408,0.01791,0.013349,0.015394,0.025358,0.024142
