1e-06,1.2e-05,1e-06,5e-06,2.7e-05,3e-06,1.1e-05,1.7e-05,1e-06,1.7e-05,5e-06,1.3e-05,1.6e-05,7e-06,3.3e-05,9e-06,5e-06,4e-06,8e-06,1e-05,2e-06,2.1e-05,4e-06,2.5e-05,3e-05,7e-06,6e-06,3e-06,4e-06,2e-05,2e-06,2.1e-05,2.7e-05,2.3e-05,3e-06,5e-06,2e-06,8e-06,1.1e-05,7e-06,2.3e-05,5e-06,4e-06,1.2e-05,1.5e-05,0,0,4e-06,3e-06,1.4e-05,1.1e-05,2e-05,2e-06,7e-06,1e-06,1.9e-05,7e-06,1e-05,6e-06,1.3e-05,3e-06,3.1e-05,1e-05,8e-06,3e-06,1.9e-05,7e-06,1.5e-05,6e-06,9e-06,1e-06,1.1e-05,2.3e-05,1.2e-05,6e-06,1.7e-05,2e-06,4e-06,9e-06,1.2e-05,1e-06,9e-06,7e-06,1e-06,6e-06,7e-06,8e-06,4e-06,1e-05,1.1e-05,1.1e-05,1.7e-05,1e-05,1.6e-05,5e-06,1e-06,2.7e-05,1.2e-05,1.1e-05,1.2e-05,1.4e-05,7e-06,2e-06,2e-05,4e-06,5e-06,2e-06,1e-05,1.7e-05,2.3e-05,4e-06,7e-06,5e-06,1.7e-05,1.6e-05,2.9e-05,7e-06,4e-06,6e-06,1.2e-05,1.4e-05
3.3e-05,4.4e-05,2.5e-05,1.1e-05,4.6e-05,2.9e-05,3.4e-05,4.9e-05,4.1e-05,3.8e-05,1.4e-05,2.5e-05,2.5e-05,4.2e-05,4e-05,2.2e-05,4.6e-05,4e-05,1.2e-05,4.1e-05,4.3e-05,1.7e-05,2.2e-05,4.7e-05,3.5e-05,1.9e-05,2.6e-05,5.8e-05,4.6e-05,4.8e-05,2.8e-05,4.8e-05,5.2e-05,3.1e-05,2.1e-05,2.2e-05,2.5e-05,1.5e-05,2.2e-05,1.8e-05,3.8e-05,1.1e-05,2.1e-05,1.6e-05,2.6e-05,2.7e-05,1.7e-05,2e-06,2.1e-05,5e-05,2.7e-05,4.5e-05,1.7e-05,8e-06,2.5e-05,3.9e-05,2.4e-05,2.9e-05,4.4e-05,2.7e-05,2e-05,5.8e-05,1.5e-05,2.6e-05,1.4e-05,3.5e-05,3.9e-05,2.6e-05,1.8e-05,1.9e-05,2.9e-05,3.1e-05,2.7e-05,3.8e-05,2.6e-05,4.1e-05,1.8e-05,1.3e-05,2.4e-05,3e-05,2.5e-05,3.5e-05,4.8e-05,6.4e-05,1.9e-05,9e-06,2.9e-05,2.1e-05,4e-05,2.2e-05,4.3e-05,6.5e-05,1.2e-05,3.2e-05,2e-06,1e-05,6.5e-05,3e-06,3.4e-05,1.5e-05,3.6e-05,2.1e-05,1e-05,2.9e-05,2.5e-05,7e-06,1e-05,4.2e-05,2.6e-05,2.3e-05,3.8e-05,4.8e-05,2.9e-05,1.3e-05,6.5e-05,3e-05,4.5e-05,3.2e-05,4.7e-05,3.5e-05,3e-06
5e-05,1.4e-05,5.4e-05,5.8e-05,2.9e-05,3.9e-05,5.1e-05,7.2e-05,2.9e-05,1.4e-05,2.6e-05,3.2e-05,3.5e-05,3.9e-05,5.3e-05,7e-06,5.3e-05,1.8e-05,4.9e-05,7.5e-05,6e-05,1.9e-05,5e-06,7.7e-05,1e-04,3e-05,2.2e-05,8.1e-05,2e-05,6.4e-05,6.7e-05,3.9e-05,7e-05,7.1e-05,2.6e-05,7.5e-05,7.7e-05,6.3e-05,3.1e-05,5.3e-05,4.5e-05,2.7e-05,3.1e-05,7.2e-05,5.4e-05,5.2e-05,2.1e-05,2.5e-05,2.4e-05,5.9e-05,2e-05,6.7e-05,7.3e-05,3.9e-05,3.5e-05,2.6e-05,5.5e-05,8.3e-05,2.3e-05,1.9e-05,1.8e-05,7.6e-05,3.8e-05,2.5e-05,3.6e-05,3.2e-05,4e-05,7.4e-05,3e-05,8e-06,5e-05,4.9e-05,3.4e-05,5.3e-05,4.2e-05,4.2e-05,5.4e-05,2.2e-05,2.3e-05,1.6e-05,9e-06,4.2e-05,3.5e-05,3.3e-05,3.1e-05,1.5e-05,6.1e-05,5e-05,6.4e-05,2.9e-05,4e-05,5.9e-05,4.3e-05,4.3e-05,2.7e-05,2e-05,7.5e-05,5.9e-05,4.7e-05,7e-05,2.4e-05,2.4e-05,1.9e-05,7e-06,2.5e-05,1.3e-05,3.1e-05,3.6e-05,2.6e-05,4.2e-05,7.4e-05,2.5e-05,3.6e-05,7e-06,5.8e-05,5.6e-05,1.5e-05,4.5e-05,0.00011,4.2e-05,2.2e-05
9.8e-05,8.9e-05,6.2e-05,8.5e-05,8.3e-05,7.5e-05,7.5e-05,7.5e-05,6.7e-05,4.5e-05,3.1e-05,7.4e-05,5.3e-05,5.5e-05,7.1e-05,0.000111,2.8e-05,5.4e-05,7.7e-05,2.1e-05,3.9e-05,8.2e-05,4e-05,5.5e-05,6.9e-05,5.8e-05,5.9e-05,4.1e-05,6.4e-05,0.000107,9e-05,4.2e-05,7e-05,7.1e-05,6e-05,0.000142,8.1e-05,3.2e-05,0.000103,7.6e-05,0.000107,1e-04,0.000111,0.00012,0.00013,8e-05,5.1e-05,4.2e-05,4e-05,7.1e-05,4.9e-05,6.7e-05,4.5e-05,6.4e-05,4.6e-05,4.3e-05,4.4e-05,5e-05,1.1e-05,3.3e-05,5.2e-05,4.3e-05,8.9e-05,8.2e-05,9e-06,2.7e-05,1.9e-05,6.7e-05,4.9e-05,3.1e-05,5.7e-05,9.1e-05,4e-05,1.9e-05,4e-06,2.2e-05,2.6e-05,1.7e-05,2.4e-05,2.7e-05,2e-05,1.3e-05,4.9e-05,2.3e-05,5e-06,7.5e-05,3.2e-05,7e-05,1.7e-05,4e-06,5.6e-05,0.000121,0.000102,3.8e-05,2.1e-05,3.5e-05,0.000109,7.2e-05,2.8e-05,8.9e-05,7.9e-05,6.4e-05,2.8e-05,1.9e-05,4.1e-05,5.1e-05,4.7e-05,2.7e-05,2.6e-05,4.3e-05,4.8e-05,7.5e-05,7.5e-05,5.1e-05,7.3e-05,8.5e-05,9.8e-05,0.00012,3.6e-05,5e-05,6.3e-05
5.1e-05,2.2e-05,4e-05,4.8e-05,6.8e-05,9.1e-05,3.7e-05,6.4e-05,6.3e-05,2.2e-05,2.8e-05,0.000102,1.6e-05,5.5e-05,3.8e-05,0.000113,1e-04,0.000117,5.5e-05,4.1e-05,3.4e-05,8.9e-05,4.8e-05,5.6e-05,0.000107,0.000108,5.6e-05,3e-05,4.7e-05,8.4e-05,1.8e-05,7.5e-05,6.1e-05,7.5e-05,4.2e-05,0.000129,4.9e-05,9.5e-05,0.000106,1e-05,7.1e-05,1e-04,4.4e-05,0.000101,2.7e-05,2.3e-05,3.4e-05,2.6e-05,6e-05,7e-06,1.9e-05,8e-06,1e-05,6e-05,5.9e-05,3.1e-05,3.2e-05,2.2e-05,6.1e-05,3.4e-05,4.6e-05,5.1e-05,7e-05,2.3e-05,1.7e-05,3.5e-05,4.2e-05,8.2e-05,3.1e-05,5.4e-05,0.000104,5.6e-05,8.8e-05,2.5e-05,7e-05,3.3e-05,3.3e-05,1e-05,1e-05,4e-05,1.9e-05,2.5e-05,9e-06,4.7e-05,7e-06,8.7e-05,9.9e-05,7.2e-05,2.2e-05,3.2e-05,6.8e-05,5.3e-05,5.2e-05,4.7e-05,6.2e-05,5.9e-05,7e-05,4.8e-05,5.9e-05,6.3e-05,6.1e-05,3.7e-05,2.9e-05,2.2e-05,5.6e-05,3.1e-05,2.1e-05,6.1e-05,1.9e-05,1.8e-05,8e-06,4.7e-05,2.3e-05,1.3e-05,5.2e-05,3e-05,4.6e-05,6.7e-05,5.4e-05,1.8e-05,4.6e-05
1e-04,8.5e-05,5.5e-05,4.4e-05,8e-05,5.2e-05,3.5e-05,6.8e-05,0.000106,8.7e-05,8.1e-05,7.7e-05,0.000115,0.000133,5.8e-05,8.3e-05,5.1e-05,3.7e-05,8.9e-05,2.4e-05,2.6e-05,0.000108,4.3e-05,2.5e-05,0.000117,0.00017,7.1e-05,2.4e-05,0.000118,1.8e-05,8.1e-05,0.000163,0.000104,0.000161,0.000185,4e-06,3.3e-05,0.000113,2.3e-05,8.3e-05,6.2e-05,2.1e-05,8e-05,0.000109,7e-05,6.8e-05,0.000118,9.7e-05,8e-05,6.1e-05,2.6e-05,4.2e-05,2.2e-05,6.3e-05,4.9e-05,2.6e-05,8.4e-05,6.6e-05,1.1e-05,8.5e-05,6.2e-05,7e-06,8.9e-05,8e-05,4.5e-05,7.5e-05,7.9e-05,8.6e-05,2.5e-05,6.3e-05,5.6e-05,0.00016,0.000186,0.000109,0.000101,9.2e-05,6.8e-05,3.8e-05,4.6e-05,6e-05,1.9e-05,5.1e-05,2.9e-05,4.4e-05,6.3e-05,6.6e-05,7.9e-05,8.3e-05,4.7e-05,9.2e-05,2.8e-05,5.8e-05,1.3e-05,6.5e-05,5.4e-05,4.9e-05,6e-06,4.8e-05,8.6e-05,1.4e-05,1e-05,3.9e-05,5e-06,4.3e-05,3.3e-05,7.3e-05,2.2e-05,9.6e-05,5.7e-05,2.9e-05,4.3e-05,4.3e-05,4e-05,2.8e-05,4.2e-05,1.6e-05,3.6e-05,3.9e-05,1e-05,5.1e-05,1.9e-05
9.8e-05,0.000157,0.000257,0.000124,8.8e-05,0.000153,6.4e-05,8.6e-05,5.7e-05,6.2e-05,9.1e-05,0.000145,0.000124,6e-05,5.4e-05,5.9e-05,2.7e-05,6e-05,9.8e-05,0.00018,9.5e-05,7e-05,0.000179,0.000166,0.000123,0.000112,0.000119,0.000116,0.00012,0.000142,9e-05,8.7e-05,0.000195,0.000196,0.000208,0.000178,0.000134,1e-05,8.1e-05,1.6e-05,8.6e-05,4.1e-05,2.5e-05,1.6e-05,8.3e-05,1.9e-05,0.000139,0.000113,0.000196,7.1e-05,3.3e-05,3.1e-05,1e-05,6.1e-05,7.3e-05,9.8e-05,9.6e-05,0.000102,4.5e-05,3.9e-05,8.1e-05,0.000102,0.000111,0.000135,0.000138,5.2e-05,2.6e-05,5.3e-05,8e-05,7.4e-05,0.000113,0.000132,2.3e-05,4.9e-05,8.8e-05,5e-05,2.7e-05,1.3e-05,7.3e-05,0.000103,7.9e-05,5.1e-05,7.3e-05,4.1e-05,6.7e-05,7e-05,0.000109,9.5e-05,0.000167,0.000153,9.9e-05,4.8e-05,2e-05,4.6e-05,3.6e-05,6.6e-05,7.8e-05,3.6e-05,9.9e-05,8.1e-05,8.1e-05,3.2e-05,4.6e-05,6.2e-05,0.000104,5.2e-05,5.2e-05,0.000105,0.000113,5.2e-05,3.9e-05,5.7e-05,3.9e-05,0.000103,8.1e-05,3.3e-05,8.2e-05,3.5e-05,4.2e-05,9.7e-05,6.4e-05
2e-05,7.3e-05,0.000199,0.000135,0.000178,9.8e-05,0.000109,0.000161,0.000114,6.1e-05,0.000118,1e-04,4.4e-05,9.9e-05,5.2e-05,5.6e-05,5.7e-05,0.000127,8e-06,0.000165,0.000128,4.5e-05,0.000171,7.2e-05,0.000317,0.00021,0.00015,4.5e-05,0.000167,7.8e-05,8.4e-05,0.00013,0.000106,9.7e-05,0.000104,7.7e-05,7.9e-05,6.9e-05,0.000124,9e-05,0.000118,0.000119,4.5e-05,4.3e-05,4.2e-05,0.000101,9.3e-05,9.2e-05,9.9e-05,0.000161,8e-05,1.4e-05,4.2e-05,6.4e-05,5.9e-05,5e-05,0.000121,6e-06,6.7e-05,1.5e-05,6.5e-05,3.5e-05,6.4e-05,5.6e-05,3.6e-05,0.000167,0.000177,9.3e-05,0.000124,6.2e-05,0.000121,7.5e-05,1e-04,7.6e-05,4.2e-05,6e-05,8.3e-05,5.1e-05,5.9e-05,6.1e-05,5.2e-05,0.000117,7.7e-05,0.00012,6e-05,0.000191,0.000148,7.7e-05,0.000132,0.000103,1.6e-05,3.1e-05,6.5e-05,6.3e-05,7.6e-05,7.4e-05,1.6e-05,5e-05,0.000102,0.000131,0.000136,6.2e-05,3e-05,1.2e-05,6.4e-05,8.7e-05,9.4e-05,4e-06,8e-05,3.3e-05,2.9e-05,6.1e-05,2.4e-05,9.2e-05,3.2e-05,1.5e-05,0.000139,8.8e-05,4.9e-05,9e-05,5.8e-05
0.000235,0.000121,9.4e-05,7.2e-05,0.000183,0.000279,0.00017,8.9e-05,0.000231,9.5e-05,0.000142,9.9e-05,3.8e-05,0.000129,2e-04,0.000251,9.4e-05,6.5e-05,0.000114,0.000127,9.8e-05,0.000112,0.000139,0.000183,0.000352,0.000406,0.000217,8e-05,8.8e-05,0.000133,0.000122,0.000199,0.000151,0.000233,0.000163,2e-06,3.2e-05,1.3e-05,6.8e-05,8.6e-05,8.7e-05,3e-05,7.1e-05,9.7e-05,5.5e-05,5.1e-05,5.6e-05,0.000119,0.000181,0.000133,0.00012,0.000104,0.000108,7.2e-05,5.8e-05,3.9e-05,0.000119,0.000125,7.9e-05,0.000144,1.3e-05,7.2e-05,7.1e-05,8.3e-05,6.4e-05,0.000142,0.00011,7.3e-05,8.5e-05,0.000125,6.7e-05,5.4e-05,9.8e-05,9.3e-05,0.000137,0.000112,0.000163,9.4e-05,6.9e-05,1.5e-05,0.000115,5.8e-05,8.2e-05,0.000172,0.000199,0.00014,0.000115,8.7e-05,0.000125,0.000151,0.000133,0.000112,8.4e-05,0.000134,0.000184,0.000157,4.6e-05,8.8e-05,7.7e-05,7.2e-05,0.000151,8.4e-05,7.4e-05,4.6e-05,8e-06,4.5e-05,7.1e-05,5e-05,4.3e-05,4.9e-05,1.9e-05,5.7e-05,9e-05,0.000105,9.1e-05,6.5e-05,0.000165,0.000156,5.4e-05,6.2e-05,4.2e-05
5.7e-05,1.3e-05,2.6e-05,5.5e-05,0.000223,0.000163,7.9e-05,9.9e-05,0.000127,0.00013,0.000113,5.6e-05,1.9e-05,0.000136,0.000152,0.000157,0.000131,0.000124,0.00013,7.3e-05,0.000153,7.1e-05,7.1e-05,5.2e-05,0.000181,0.000139,9e-05,3.3e-05,2.7e-05,9.5e-05,7.6e-05,8.1e-05,0.000153,0.000116,0.000115,0.000113,7.5e-05,4.3e-05,6.8e-05,7.6e-05,6.4e-05,2.1e-05,7.2e-05,1.5e-05,7.3e-05,6.1e-05,5.7e-05,0.000107,5.3e-05,5.5e-05,0.000122,8.8e-05,6.6e-05,3.1e-05,4.2e-05,4.7e-05,4.6e-05,5.3e-05,0.000115,0.000212,0.000155,7e-05,0.000169,2.8e-05,8e-06,9.7e-05,3.6e-05,3.4e-05,9.4e-05,5e-05,7.7e-05,5.7e-05,3.1e-05,5.2e-05,9.3e-05,0.000155,6.7e-05,4.6e-05,4.5e-05,6.3e-05,0.000115,0.00016,9e-05,0.000145,1.4e-05,4.7e-05,3.8e-05,0.000105,2.4e-05,6.3e-05,4.8e-05,0.000104,2.7e-05,8.7e-05,0.000142,5.5e-05,7.2e-05,5.1e-05,2.7e-05,6.3e-05,0.00011,9e-05,3.8e-05,1.4e-05,2.5e-05,1.7e-05,2.7e-05,7.8e-05,4.3e-05,7.3e-05,3.5e-05,7.5e-05,2.3e-05,1.3e-05,4.7e-05,4.7e-05,6.9e-05,3e-05,6.8e-05,6.8e-05,3.9e-05
5.6e-05,7.6e-05,0.000106,0.000115,7.4e-05,4e-06,4.5e-05,7.1e-05,5.8e-05,8.7e-05,8.6e-05,8.7e-05,3.4e-05,0.000115,1.4e-05,0.000117,7.5e-05,0.00018,0.00013,0.000173,9.9e-05,5.8e-05,3.2e-05,4e-05,0.000101,2e-05,6.4e-05,2.1e-05,5.2e-05,2.5e-05,4.1e-05,6e-05,4.5e-05,0.000117,3.9e-05,3.6e-05,6.8e-05,5.1e-05,9.6e-05,0.00016,1e-04,6.7e-05,2.3e-05,2.7e-05,7.1e-05,7.5e-05,1e-04,1.1e-05,0.000105,0.000155,0.000153,0.000135,7.6e-05,4.8e-05,6.1e-05,5.2e-05,7.8e-05,9.5e-05,0.00015,9.1e-05,2e-05,5.5e-05,0.000158,0.000145,8.2e-05,1.2e-05,5.7e-05,7.7e-05,1e-05,4.3e-05,6.8e-05,8.8e-05,6.4e-05,5.5e-05,0.000109,3.1e-05,2.8e-05,5.4e-05,8.4e-05,8e-05,9e-05,8.2e-05,6.2e-05,6.7e-05,9.6e-05,7.4e-05,6.2e-05,2.3e-05,2.6e-05,6.5e-05,4.4e-05,0.000102,0.000103,3.4e-05,8.7e-05,0.000152,6e-05,5.2e-05,9e-06,4.9e-05,0.000127,0.000112,9.2e-05,3.8e-05,4.5e-05,4.9e-05,4.6e-05,5.4e-05,6.6e-05,3.8e-05,5.6e-05,4.7e-05,5.3e-05,3.8e-05,4.9e-05,4.6e-05,4.6e-05,3e-05,4.2e-05,4.4e-05,4e-06
3.6e-05,3.9e-05,7.1e-05,4.6e-05,5.6e-05,3.1e-05,3.2e-05,2.9e-05,3e-05,6.4e-05,3.7e-05,1.4e-05,3.2e-05,7.7e-05,3.7e-05,5.8e-05,3.8e-05,0.000114,8.7e-05,6.6e-05,6.4e-05,6.9e-05,4e-05,1.8e-05,7.9e-05,4.2e-05,3.9e-05,1.9e-05,3.6e-05,2.2e-05,3.4e-05,1.7e-05,3.5e-05,6.5e-05,1.7e-05,6.9e-05,2.5e-05,1.2e-05,5.7e-05,4.6e-05,1.6e-05,2.6e-05,7e-06,2.7e-05,3.2e-05,6.7e-05,1.1e-05,2.2e-05,7.2e-05,7.4e-05,4.4e-05,2.8e-05,1.9e-05,7.5e-05,4.4e-05,1.6e-05,7.7e-05,9e-06,0.000101,3.3e-05,1.1e-05,6.9e-05,4.6e-05,5.3e-05,3e-05,2.2e-05,2.8e-05,3.1e-05,2.9e-05,3.6e-05,2.3e-05,2.2e-05,1.9e-05,3.2e-05,1.6e-05,2.8e-05,2.4e-05,4.5e-05,3.7e-05,3.2e-05,1.3e-05,1.8e-05,1.5e-05,2.3e-05,6.5e-05,2.1e-05,2e-05,3.4e-05,1.2e-05,3.6e-05,2.8e-05,3.5e-05,4e-05,6.5e-05,4.5e-05,5.8e-05,5.6e-05,7.5e-05,3.7e-05,4.1e-05,4.9e-05,3.1e-05,3.6e-05,1.8e-05,3.3e-05,5.3e-05,2.3e-05,6.1e-05,1.3e-05,2.5e-05,1.9e-05,1.6e-05,2e-06,4.2e-05,1.9e-05,3.9e-05,1.1e-05,1.6e-05,7e-06,2.4e-05,2.7e-05
2.8e-05,5.8e-05,4.5e-05,2.4e-05,2.5e-05,7e-06,4.1e-05,3.5e-05,1.9e-05,2.7e-05,1.2e-05,4.1e-05,2.8e-05,1.9e-05,2.1e-05,1.6e-05,4.2e-05,7.4e-05,4.5e-05,1.9e-05,2.8e-05,5.2e-05,3.9e-05,1.4e-05,6e-05,8e-06,2.7e-05,1.9e-05,3.8e-05,1.5e-05,2.2e-05,2.7e-05,4.2e-05,4.1e-05,3.6e-05,3.7e-05,5e-06,1.9e-05,2.4e-05,1.6e-05,1.9e-05,3.3e-05,1.2e-05,3.6e-05,5.8e-05,4.4e-05,2.6e-05,2.1e-05,7e-06,3.7e-05,3.3e-05,4e-05,1.9e-05,4.3e-05,4.1e-05,2.7e-05,3.6e-05,2e-05,5.7e-05,2.4e-05,1.3e-05,4.7e-05,5e-06,2.2e-05,1.3e-05,2.4e-05,2.4e-05,8e-06,2.6e-05,1.2e-05,3.8e-05,2.8e-05,1.3e-05,1.3e-05,3.2e-05,7e-06,3.4e-05,1.4e-05,4.1e-05,3.2e-05,1.7e-05,2e-05,1.8e-05,3.8e-05,2.7e-05,2.7e-05,2.7e-05,2.4e-05,3.4e-05,1.6e-05,8e-06,9e-06,2.7e-05,4.1e-05,2.9e-05,5.7e-05,1.3e-05,3.6e-05,1.8e-05,4e-06,4.5e-05,2.9e-05,2.5e-05,2.1e-05,1.4e-05,9e-06,1.3e-05,2e-05,1.4e-05,6e-06,1.3e-05,2.1e-05,1.6e-05,2.8e-05,1.1e-05,2e-05,2e-05,7e-06,1.5e-05,9e-06,1.6e-05
5e-05,2.6e-05,1.4e-05,2.3e-05,1.7e-05,2e-05,3.3e-05,6.8e-05,3.3e-05,6.5e-05,2.7e-05,5.1e-05,9e-06,1e-05,3.1e-05,5e-06,3.2e-05,2e-05,5e-05,5.6e-05,5e-06,4.1e-05,3.1e-05,3.4e-05,1.6e-05,3.1e-05,4.9e-05,6.7e-05,5.1e-05,1.6e-05,2.5e-05,3.4e-05,2e-05,2.6e-05,4e-05,4.3e-05,2.7e-05,7e-06,1.8e-05,1.5e-05,4e-05,3.9e-05,1.9e-05,3.3e-05,1.6e-05,5.3e-05,1.6e-05,1.9e-05,1.7e-05,6.5e-05,9.1e-05,4.3e-05,1.7e-05,1.9e-05,3e-05,2.6e-05,3.1e-05,1.1e-05,4.9e-05,1e-06,5e-06,2.1e-05,3.7e-05,3e-05,2.6e-05,2.9e-05,8e-06,4e-06,1.4e-05,1.8e-05,2e-05,3.5e-05,2e-05,3.7e-05,5.2e-05,3.6e-05,1.9e-05,2.3e-05,3.5e-05,2.9e-05,4.5e-05,2.5e-05,1.6e-05,2.7e-05,5.9e-05,4e-05,3.3e-05,3.7e-05,4.4e-05,1.7e-05,1.6e-05,1.8e-05,1.8e-05,5e-06,3.4e-05,3.3e-05,1.6e-05,3.2e-05,9e-06,5e-06,3.5e-05,3.1e-05,2.7e-05,2e-05,1.5e-05,2.5e-05,2.7e-05,1.6e-05,3.3e-05,1.4e-05,9e-06,1.9e-05,2.5e-05,2.8e-05,2.3e-05,1.1e-05,6e-06,1.2e-05,1.9e-05,2.4e-05,1.3e-05
2e-05,1.5e-05,1e-06,1e-05,1.9e-05,1.7e-05,7.2e-05,1.8e-05,1.3e-05,4.7e-05,3.1e-05,4.5e-05,7e-05,5.9e-05,5.3e-05,5.7e-05,1e-05,4.6e-05,8.9e-05,2.3e-05,3.9e-05,5.7e-05,4.3e-05,2.3e-05,4.3e-05,5.4e-05,1.2e-05,6.2e-05,4e-05,5.7e-05,4.6e-05,2e-05,2.6e-05,1.6e-05,3.9e-05,3.8e-05,3.4e-05,2e-05,4.2e-05,3e-05,5.6e-05,2.3e-05,6e-06,2.4e-05,4e-05,2.4e-05,6.7e-05,4.3e-05,6.9e-05,6.2e-05,4.9e-05,5.3e-05,3.5e-05,2.7e-05,2.9e-05,3.1e-05,2.8e-05,4e-06,6.2e-05,3.3e-05,1.1e-05,3e-05,3.5e-05,4.7e-05,1.9e-05,2.4e-05,2.5e-05,5e-06,1.9e-05,2.9e-05,3.3e-05,4.8e-05,2.1e-05,5.8e-05,9e-06,3.1e-05,4.2e-05,1.2e-05,1.3e-05,1.9e-05,3.7e-05,2.7e-05,3.2e-05,4.9e-05,3.4e-05,1.3e-05,1.2e-05,1.9e-05,3.5e-05,3.5e-05,3.1e-05,2.4e-05,3e-05,2.1e-05,2.1e-05,4.4e-05,1.9e-05,1.1e-05,4e-06,1.5e-05,1.5e-05,2.4e-05,1.1e-05,1.8e-05,3.5e-05,4.7e-05,1.2e-05,4e-06,5.7e-05,2.9e-05,6e-06,2.3e-05,4.3e-05,3e-06,2.6e-05,1.3e-05,7e-06,3.5e-05,2.5e-05,2.5e-05,3.6e-05
5.8e-05,4.5e-05,3.5e-05,3.7e-05,1.7e-05,1e-05,8e-05,4.8e-05,1.3e-05,3.5e-05,3.9e-05,3.6e-05,8.5e-05,2.9e-05,5e-06,5.2e-05,5.6e-05,1.8e-05,9.2e-05,2.8e-05,3e-05,1.8e-05,3.3e-05,2.7e-05,1.7e-05,6.7e-05,2.6e-05,5.5e-05,3.8e-05,1.9e-05,2.9e-05,3.7e-05,3.1e-05,5.7e-05,1.5e-05,1.2e-05,3.5e-05,2e-05,5.3e-05,6.5e-05,1.3e-05,4e-06,1.3e-05,1.1e-05,3e-05,3.3e-05,6.3e-05,5.3e-05,6.8e-05,3.9e-05,4e-05,1.8e-05,3.8e-05,1.4e-05,5e-06,8e-06,3e-05,1.1e-05,4.4e-05,3.3e-05,4e-06,3.4e-05,2.6e-05,2e-05,2.1e-05,2.7e-05,8e-06,6e-06,1.7e-05,2.5e-05,5.9e-05,8.5e-05,6.3e-05,6e-05,4e-05,6.1e-05,3.3e-05,5.5e-05,3.9e-05,9e-06,3.1e-05,1e-05,5.8e-05,3.3e-05,5.5e-05,2.6e-05,2.1e-05,5e-06,1.6e-05,1.1e-05,3.2e-05,3.7e-05,2.8e-05,1.5e-05,3.1e-05,1e-05,3.1e-05,6e-06,1.2e-05,2.5e-05,1.1e-05,4e-05,4e-05,3.5e-05,4.7e-05,4.3e-05,3.7e-05,2.7e-05,5.2e-05,2.7e-05,1.7e-05,1.7e-05,4.6e-05,5.6e-05,2.7e-05,1e-05,1.4e-05,4.1e-05,2.2e-05,2e-05,7e-06
7.9e-05,6.3e-05,5e-05,3.5e-05,3.6e-05,3.8e-05,5.3e-05,7.5e-05,7.5e-05,3e-05,6.1e-05,8.2e-05,6e-05,8.2e-05,8.5e-05,2.3e-05,2.3e-05,5.6e-05,7.2e-05,5.1e-05,1.2e-05,3e-06,3.3e-05,2.7e-05,1.8e-05,3.7e-05,3.7e-05,4.4e-05,2.4e-05,3.4e-05,4.7e-05,2.8e-05,2.3e-05,3.6e-05,2.7e-05,1.6e-05,2.2e-05,1.1e-05,7.3e-05,2.6e-05,1.7e-05,1.7e-05,1.2e-05,1.4e-05,3.6e-05,4.2e-05,4.9e-05,3.6e-05,8.1e-05,4.1e-05,1e-05,1.6e-05,3e-05,2.4e-05,4.3e-05,3.3e-05,3.3e-05,0,1.2e-05,5.7e-05,5.1e-05,1.5e-05,4e-05,2.5e-05,4.4e-05,3.5e-05,2.3e-05,2.2e-05,1.5e-05,2.6e-05,4.8e-05,4.7e-05,2.1e-05,2.9e-05,1.3e-05,3.1e-05,6.9e-05,6.5e-05,4.1e-05,2.8e-05,2.5e-05,2.2e-05,6.3e-05,3.5e-05,7.4e-05,4.4e-05,2.1e-05,1.3e-05,5e-06,1.3e-05,5.3e-05,1.7e-05,3.3e-05,4.2e-05,3.2e-05,3.5e-05,3.4e-05,3.4e-05,1.7e-05,1.4e-05,1.7e-05,3.1e-05,2.4e-05,1.1e-05,3.4e-05,9e-06,2.3e-05,1.2e-05,2.5e-05,1.9e-05,1.2e-05,1.3e-05,2e-05,4.4e-05,4.3e-05,2.1e-05,3.4e-05,2e-05,1.4e-05,2.5e-05,2.8e-05
4.5e-05,1.8e-05,5.6e-05,3.1e-05,3.1e-05,1.9e-05,1.6e-05,5.9e-05,3.5e-05,3.2e-05,5.3e-05,4.9e-05,3.9e-05,6.7e-05,2.8e-05,5.8e-05,2.8e-05,2.8e-05,9e-06,1.3e-05,2.5e-05,1.1e-05,1.7e-05,2.9e-05,7e-06,1e-05,2.9e-05,2.7e-05,3.1e-05,4.2e-05,5.9e-05,5.6e-05,3.6e-05,1.4e-05,2e-05,2.1e-05,1.4e-05,8e-06,6.1e-05,7.4e-05,2.1e-05,3.1e-05,1.7e-05,2.7e-05,1.2e-05,3.2e-05,2.5e-05,1.3e-05,4.2e-05,2.4e-05,1.3e-05,2.5e-05,3.2e-05,4.4e-05,3.5e-05,8e-06,3.8e-05,1.6e-05,3e-05,4.4e-05,4.8e-05,8e-06,4.9e-05,1.6e-05,4.6e-05,1.1e-05,2.7e-05,3.1e-05,3.1e-05,1.4e-05,4.6e-05,1.9e-05,2e-05,1.4e-05,8e-06,1.4e-05,5.7e-05,2.9e-05,3.7e-05,4.6e-05,2.1e-05,6e-06,4.4e-05,6e-06,4e-05,1.8e-05,3.2e-05,3.1e-05,1.2e-05,1.2e-05,4.2e-05,5.1e-05,1.8e-05,2.8e-05,7e-06,2.1e-05,2.7e-05,4.9e-05,2.1e-05,1.8e-05,1.6e-05,1.9e-05,4.2e-05,2.1e-05,2.3e-05,2e-05,2.2e-05,2.4e-05,1.5e-05,1.3e-05,2.2e-05,8e-06,3.7e-05,9e-06,1e-05,8e-06,3.5e-05,1e-05,1.5e-05,2.1e-05,2.8e-05
7.3e-05,3.7e-05,1.8e-05,1e-05,3.8e-05,1.6e-05,2.1e-05,4.1e-05,6.4e-05,3.6e-05,2.5e-05,8e-05,4.4e-05,4.7e-05,3.2e-05,4.9e-05,4.4e-05,2.9e-05,8e-06,2e-05,1.1e-05,2.9e-05,4.8e-05,8e-06,1.8e-05,7e-06,7e-06,3e-06,2.5e-05,4.3e-05,4.2e-05,2.2e-05,4.9e-05,6.4e-05,4.3e-05,8e-06,3e-06,1e-05,1.9e-05,2.6e-05,3.3e-05,2.5e-05,3.5e-05,1.5e-05,3.7e-05,6.5e-05,6.7e-05,5.1e-05,5.7e-05,3.9e-05,2.6e-05,3.5e-05,3.5e-05,5e-06,3.9e-05,3.6e-05,6.2e-05,3.6e-05,1.9e-05,4.7e-05,1.3e-05,3.4e-05,4.9e-05,6.1e-05,5.3e-05,5.1e-05,2.1e-05,2.2e-05,2.8e-05,1.7e-05,3.5e-05,2.9e-05,1.4e-05,7e-06,2e-05,1.7e-05,2.8e-05,3.4e-05,1.2e-05,4.6e-05,4.2e-05,4e-05,6e-06,3.3e-05,1.8e-05,1.8e-05,2.4e-05,3.1e-05,3.9e-05,4e-05,1.5e-05,3.8e-05,4e-05,3.2e-05,1.5e-05,1.8e-05,2e-05,3.9e-05,3.1e-05,9e-06,8e-06,5.2e-05,6.5e-05,3.1e-05,5.2e-05,5.6e-05,2.6e-05,2.1e-05,3e-06,7e-06,2.7e-05,2.9e-05,4.4e-05,2.2e-05,1.1e-05,9e-06,2.8e-05,3.8e-05,6e-06,3.4e-05,4.8e-05
7e-06,3.5e-05,2.9e-05,3.4e-05,7e-05,3.9e-05,2.1e-05,7e-06,1.1e-05,1.1e-05,2.9e-05,4.5e-05,4.7e-05,3.8e-05,5.7e-05,2.8e-05,3e-05,2e-05,4e-06,3e-05,1.5e-05,3.2e-05,5.9e-05,5.8e-05,2.8e-05,3.4e-05,4e-05,2.6e-05,3.4e-05,1e-05,1.7e-05,2.7e-05,1.7e-05,1.1e-05,3.5e-05,6.3e-05,3.5e-05,3.5e-05,4e-05,6e-06,2.5e-05,4.6e-05,1e-05,3.3e-05,1e-05,5.4e-05,2.9e-05,1.7e-05,2.5e-05,2.5e-05,3.7e-05,4.1e-05,2.1e-05,2.8e-05,3.4e-05,2.8e-05,2.7e-05,2.8e-05,3e-06,3.6e-05,1.9e-05,1.7e-05,1.3e-05,3.2e-05,3.4e-05,2.3e-05,3.8e-05,1.5e-05,4.5e-05,7.3e-05,4.4e-05,3.1e-05,3.8e-05,1.8e-05,3.7e-05,2.2e-05,3.8e-05,2.5e-05,3e-06,3.4e-05,2.1e-05,1.7e-05,1.7e-05,2.8e-05,8e-06,2.6e-05,9e-06,4e-06,3.6e-05,1.1e-05,3.5e-05,1.7e-05,2.1e-05,2.9e-05,9e-06,3e-05,3.4e-05,3.4e-05,4.1e-05,5.2e-05,4.6e-05,5.3e-05,1.2e-05,2.6e-05,5.5e-05,3.1e-05,5e-06,1e-05,1.7e-05,6e-06,3.2e-05,2.2e-05,2e-06,4e-06,2.2e-05,1.7e-05,3.1e-05,1.8e-05,1.5e-05,3.1e-05,1.8e-05
5.8e-05,5.1e-05,2.8e-05,2.1e-05,7.4e-05,2.7e-05,1.6e-05,3.2e-05,1.5e-05,3.5e-05,8e-06,5.8e-05,8.8e-05,2e-05,5.4e-05,4.9e-05,1.6e-05,2.3e-05,1.7e-05,6e-06,1.5e-05,2.4e-05,2.1e-05,2.7e-05,3e-05,3.3e-05,5.7e-05,1.9e-05,1.8e-05,5.6e-05,5.3e-05,2.7e-05,3.6e-05,5.3e-05,2.8e-05,4.7e-05,2.4e-05,2.3e-05,5.3e-05,2.6e-05,2e-05,1.6e-05,2.9e-05,2.3e-05,2.6e-05,2.8e-05,3.3e-05,1.4e-05,2.6e-05,7e-06,3.9e-05,1.5e-05,2.3e-05,3.4e-05,2.3e-05,3e-06,2.7e-05,4.9e-05,1.9e-05,2.4e-05,9e-06,2e-05,1.5e-05,2.8e-05,3.7e-05,2.1e-05,4.8e-05,5.3e-05,4.8e-05,3.1e-05,1.7e-05,4e-05,4e-05,4.8e-05,2.7e-05,4e-05,2.2e-05,5.3e-05,3.5e-05,3.6e-05,5e-05,3.2e-05,1.8e-05,2e-05,3.7e-05,3.3e-05,1.5e-05,9e-06,4.2e-05,5.1e-05,4e-05,4.8e-05,3.6e-05,3.7e-05,1.5e-05,3.9e-05,2.2e-05,1.4e-05,1.2e-05,3.3e-05,1.4e-05,7.6e-05,0.000105,9.5e-05,2.3e-05,2.5e-05,2e-05,2.1e-05,6e-06,9e-06,3.1e-05,1.5e-05,9e-06,1e-05,1.5e-05,6e-06,1.7e-05,2e-06,3e-06,1.3e-05,2.5e-05
4.5e-05,2.5e-05,2e-05,7e-06,5.4e-05,5.2e-05,4.1e-05,6.1e-05,6.2e-05,3.5e-05,6.6e-05,5.4e-05,6.2e-05,7.7e-05,2e-05,4.9e-05,2.7e-05,1.9e-05,3.3e-05,1.3e-05,1.8e-05,3.2e-05,3.1e-05,2.7e-05,6e-06,2.3e-05,2.1e-05,2.6e-05,2.3e-05,2.3e-05,1.2e-05,4.3e-05,5.8e-05,6.7e-05,4.4e-05,2.2e-05,2.2e-05,3.1e-05,5.8e-05,6.5e-05,4e-05,5e-06,3.4e-05,1.7e-05,6e-06,3.3e-05,1.1e-05,1.3e-05,3.6e-05,6e-05,2.8e-05,3.6e-05,3.8e-05,2.3e-05,1.2e-05,2e-05,2e-05,4.3e-05,4.5e-05,4.9e-05,1.7e-05,3.5e-05,4.6e-05,4.5e-05,2.9e-05,1.8e-05,4.5e-05,2.4e-05,3.8e-05,3.6e-05,2.6e-05,3.4e-05,2.6e-05,5.8e-05,4.8e-05,3.6e-05,1.9e-05,6e-05,2.6e-05,3.1e-05,3.6e-05,1.3e-05,5.2e-05,4.7e-05,5.3e-05,1.2e-05,2e-05,1.7e-05,3.4e-05,2.3e-05,4.4e-05,1.5e-05,2.1e-05,4.2e-05,3.1e-05,4e-05,1.3e-05,1.8e-05,2.6e-05,1.9e-05,3.8e-05,4.2e-05,4e-05,3.3e-05,1.5e-05,2.4e-05,3.5e-05,4e-06,8e-06,1.2e-05,1.1e-05,1e-05,1.9e-05,2.1e-05,2.4e-05,1.3e-05,2e-05,1.2e-05,7e-06,2.1e-05,2.9e-05
3.9e-05,3.3e-05,1.4e-05,8e-06,3e-06,1.6e-05,2.7e-05,3.1e-05,2.1e-05,2.5e-05,5.2e-05,5.3e-05,6e-05,3.1e-05,2.5e-05,3.6e-05,2.5e-05,2.1e-05,1.6e-05,1.3e-05,2e-05,8e-06,2.1e-05,1.8e-05,1.6e-05,1.6e-05,1.3e-05,5e-06,2.1e-05,1.6e-05,1.5e-05,3.9e-05,6.4e-05,9.7e-05,4.9e-05,1.9e-05,2.6e-05,2e-05,1.3e-05,2.5e-05,1.4e-05,1.3e-05,2.9e-05,3.3e-05,2.4e-05,1.1e-05,1.7e-05,2.5e-05,5e-06,3.6e-05,3.3e-05,2.1e-05,1.8e-05,1.1e-05,1.2e-05,2.2e-05,2e-05,2e-06,1.1e-05,1.8e-05,2.2e-05,1.9e-05,3e-06,9e-06,9e-06,8e-06,2.1e-05,4e-05,2.7e-05,3.1e-05,3.1e-05,1.1e-05,1.6e-05,1.8e-05,1.2e-05,1.3e-05,6e-06,3.5e-05,2.9e-05,6e-06,5e-06,7e-06,2.8e-05,1.4e-05,3.7e-05,3.8e-05,2.4e-05,1.7e-05,2.3e-05,1.5e-05,1.9e-05,2.2e-05,8e-06,2.1e-05,3.4e-05,1.2e-05,1.9e-05,1.6e-05,2e-05,2e-05,1.8e-05,9e-06,1.8e-05,8e-06,7e-06,1.4e-05,1.2e-05,1.7e-05,6e-06,7e-06,5e-06,6e-06,5e-06,8e-06,8e-06,7e-06,6e-06,1.2e-05,1.7e-05,2.4e-05,1.6e-05
2.3e-05,1.3e-05,1.1e-05,2e-06,2.5e-05,3.4e-05,3.4e-05,3e-06,1.6e-05,4.3e-05,2.3e-05,2.1e-05,2.4e-05,2e-05,1.4e-05,1.8e-05,8e-06,7e-06,4e-06,5e-06,1.8e-05,2.7e-05,1.3e-05,8e-06,9e-06,9e-06,6e-06,1.4e-05,8e-06,9e-06,1.9e-05,3.8e-05,2.7e-05,3.8e-05,2.7e-05,2.5e-05,1.7e-05,1.1e-05,2.2e-05,5e-06,1.3e-05,1.1e-05,2.2e-05,1.9e-05,1e-05,7e-06,1.1e-05,2e-05,1.8e-05,2.2e-05,1.6e-05,2.7e-05,1.3e-05,8e-06,1.8e-05,1.8e-05,9e-06,1e-06,3e-06,1.9e-05,9e-06,4e-06,5e-06,1.2e-05,1.3e-05,7e-06,8e-06,1.8e-05,4e-06,2.2e-05,2.2e-05,1.4e-05,1.4e-05,8e-06,1e-05,1.1e-05,1.2e-05,1.6e-05,1.1e-05,2.5e-05,2.6e-05,2.7e-05,0,7e-06,2.3e-05,2.1e-05,9e-06,5e-06,1.2e-05,5e-06,5e-06,1e-05,1.5e-05,2.4e-05,2.7e-05,2.6e-05,6e-06,1e-05,2e-06,1e-05,6e-06,5e-06,1.3e-05,1e-05,1.6e-05,2e-05,8e-06,9e-06,1.6e-05,1.1e-05,8e-06,3e-06,7e-06,1e-05,1.2e-05,5e-06,6e-06,8e-06,1e-05,9e-06,1.3e-05
4e-06,1.1e-05,4e-06,3e-06,2.2e-05,1.1e-05,7e-06,1.4e-05,7e-06,2.8e-05,1.6e-05,1.7e-05,1.8e-05,1.3e-05,1.7e-05,0,1.1e-05,2e-06,7e-06,7e-06,8e-06,8e-06,9e-06,5e-06,7e-06,1e-06,4e-06,9e-06,1.4e-05,1.6e-05,1e-05,9e-06,1.8e-05,1.1e-05,1e-05,7e-06,4e-06,5e-06,1.1e-05,1e-06,4e-06,5e-06,1.4e-05,6e-06,3e-06,4e-06,7e-06,1e-05,7e-06,1.3e-05,4e-06,1.4e-05,7e-06,9e-06,8e-06,3e-06,4e-06,2e-06,4e-06,8e-06,6e-06,2e-06,5e-06,1e-05,5e-06,8e-06,6e-06,7e-06,6e-06,1.2e-05,5e-06,3e-06,1.3e-05,7e-06,6e-06,1.4e-05,1.1e-05,7e-06,1e-05,1.3e-05,9e-06,1.1e-05,1.2e-05,8e-06,1e-05,5e-06,6e-06,6e-06,8e-06,1.1e-05,7e-06,2e-06,1.3e-05,7e-06,1e-05,3e-06,4e-06,9e-06,1.4e-05,1e-05,2e-06,4e-06,6e-06,8e-06,1e-05,3e-06,6e-06,9e-06,8e-06,4e-06,9e-06,5e-06,1.2e-05,1e-06,4e-06,4e-06,5e-06,0,6e-06,1e-05,2e-06
8e-06,1e-05,7e-06,5e-06,1e-05,1.2e-05,3e-06,2e-06,6e-06,1.3e-05,1.6e-05,3e-06,1.1e-05,8e-06,1e-05,2e-06,7e-06,4e-06,6e-06,3e-06,5e-06,8e-06,3e-06,5e-06,5e-06,5e-06,2e-06,6e-06,4e-06,2e-06,1e-05,1.1e-05,1.3e-05,9e-06,1e-05,1e-05,7e-06,1.1e-05,5e-06,6e-06,3e-06,5e-06,6e-06,5e-06,4e-06,7e-06,2e-06,5e-06,8e-06,8e-06,4e-06,8e-06,1e-06,6e-06,1e-05,5e-06,4e-06,3e-06,4e-06,1e-06,4e-06,0,3e-06,6e-06,2e-06,5e-06,5e-06,3e-06,4e-06,1e-05,5e-06,3e-06,1e-06,3e-06,4e-06,6e-06,4e-06,4e-06,6e-06,1e-05,7e-06,5e-06,9e-06,3e-06,1e-05,8e-06,4e-06,5e-06,6e-06,6e-06,6e-06,6e-06,6e-06,5e-06,5e-06,3e-06,3e-06,5e-06,1.2e-05,2e-06,1e-06,2e-06,2e-06,5e-06,4e-06,4e-06,3e-06,1e-06,6e-06,2e-06,3e-06,3e-06,8e-06,4e-06,1e-06,2e-06,6e-06,5e-06,2e-06,5e-06,3e-06
5e-06,1.2e-05,5e-06,2e-06,5e-06,1e-05,3e-06,9e-06,7e-06,1.1e-05,1.5e-05,9e-06,3e-06,7e-06,8e-06,2e-06,4e-06,2e-06,7e-06,7e-06,3e-06,6e-06,4e-06,5e-06,7e-06,3e-06,3e-06,5e-06,5e-06,1e-06,2e-06,1.4e-05,7e-06,1.5e-05,8e-06,6e-06,2e-06,9e-06,5e-06,7e-06,4e-06,2e-06,4e-06,4e-06,4e-06,6e-06,2e-06,2e-06,7e-06,7e-06,4e-06,6e-06,2e-06,8e-06,9e-06,4e-06,1e-06,4e-06,6e-06,3e-06,5e-06,3e-06,3e-06,2e-06,1e-06,4e-06,4e-06,3e-06,6e-06,4e-06,4e-06,3e-06,2e-06,3e-06,4e-06,2e-06,4e-06,2e-06,8e-06,1.3e-05,6e-06,3e-06,7e-06,7e-06,6e-06,2e-06,2e-06,3e-06,9e-06,5e-06,6e-06,3e-06,4e-06,3e-06,2e-06,4e-06,1e-06,2e-06,9e-06,5e-06,2e-06,3e-06,3e-06,1e-06,3e-06,2e-06,3e-06,0,5e-06,2e-06,2e-06,2e-06,2e-06,3e-06,3e-06,2e-06,5e-06,2e-06,8e-06,3e-06,1e-06
2e-06,4e-06,3e-06,4e-06,7e-06,7e-06,2e-06,7e-06,2e-06,9e-06,6e-06,2e-06,1e-06,8e-06,1.1e-05,6e-06,8e-06,2e-06,9e-06,6e-06,3e-06,4e-06,6e-06,3e-06,2e-06,2e-06,2e-06,6e-06,4e-06,3e-06,3e-06,8e-06,7e-06,7e-06,5e-06,5e-06,5e-06,4e-06,4e-06,2e-06,2e-06,1e-06,2e-06,3e-06,4e-06,2e-06,2e-06,4e-06,8e-06,9e-06,2e-06,1e-06,5e-06,6e-06,6e-06,6e-06,5e-06,2e-06,7e-06,3e-06,1e-06,3e-06,4e-06,1e-06,1e-06,2e-06,2e-06,5e-06,5e-06,8e-06,4e-06,1e-06,3e-06,1e-06,2e-06,5e-06,4e-06,3e-06,9e-06,4e-06,6e-06,3e-06,3e-06,5e-06,5e-06,3e-06,4e-06,3e-06,7e-06,4e-06,1e-06,6e-06,3e-06,2e-06,3e-06,5e-06,4e-06,3e-06,6e-06,4e-06,6e-06,2e-06,1e-06,4e-06,1e-06,3e-06,3e-06,3e-06,4e-06,2e-06,4e-06,3e-06,5e-06,2e-06,3e-06,5e-06,2e-06,1e-06,6e-06,5e-06,3e-06
1e-06,5e-06,4e-06,5e-06,4e-06,1e-05,2e-06,3e-06,1e-06,1e-05,4e-06,4e-06,3e-06,7e-06,9e-06,2e-06,5e-06,3e-06,7e-06,6e-06,4e-06,8e-06,3e-06,4e-06,5e-06,5e-06,3e-06,4e-06,7e-06,3e-06,1e-06,5e-06,6e-06,7e-06,8e-06,3e-06,2e-06,1e-06,1e-06,2e-06,3e-06,1e-06,2e-06,3e-06,3e-06,5e-06,2e-06,6e-06,5e-06,1.1e-05,3e-06,2e-06,7e-06,6e-06,4e-06,1e-06,3e-06,3e-06,5e-06,3e-06,4e-06,1e-06,3e-06,3e-06,3e-06,3e-06,6e-06,4e-06,3e-06,4e-06,3e-06,2e-06,2e-06,3e-06,4e-06,2e-06,6e-06,3e-06,7e-06,4e-06,5e-06,5e-06,5e-06,7e-06,6e-06,4e-06,2e-06,2e-06,7e-06,3e-06,2e-06,7e-06,5e-06,3e-06,3e-06,1e-06,3e-06,4e-06,3e-06,1e-06,3e-06,3e-06,5e-06,1e-06,4e-06,6e-06,1e-06,1e-06,2e-06,4e-06,5e-06,3e-06,5e-06,4e-06,3e-06,4e-06,5e-06,1e-06,4e-06,3e-06,3e-06
0,7e-06,5e-06,3e-06,1e-06,9e-06,3e-06,6e-06,2e-06,8e-06,4e-06,2e-06,2e-06,9e-06,7e-06,2e-06,1e-06,7e-06,7e-06,6e-06,3e-06,7e-06,4e-06,2e-06,3e-06,6e-06,3e-06,2e-06,6e-06,5e-06,4e-06,3e-06,8e-06,7e-06,5e-06,4e-06,2e-06,1e-06,2e-06,2e-06,3e-06,4e-06,1e-06,3e-06,1e-06,5e-06,1e-06,2e-06,7e-06,6e-06,1e-06,4e-06,4e-06,1e-06,1e-06,3e-06,2e-06,3e-06,7e-06,3e-06,3e-06,2e-06,3e-06,4e-06,1e-06,3e-06,4e-06,3e-06,1e-06,2e-06,3e-06,1e-06,3e-06,6e-06,1e-06,4e-06,5e-06,5e-06,8e-06,4e-06,4e-06,4e-06,7e-06,7e-06,1e-05,3e-06,2e-06,4e-06,4e-06,3e-06,1e-06,4e-06,2e-06,4e-06,1e-06,4e-06,3e-06,1e-06,4e-06,4e-06,3e-06,3e-06,2e-06,2e-06,4e-06,2e-06,1e-06,1e-06,1e-06,2e-06,7e-06,6e-06,7e-06,2e-06,1e-06,2e-06,1e-06,3e-06,4e-06,2e-06,1e-06
5e-06,3e-06,5e-06,1e-06,3e-06,7e-06,3e-06,9e-06,4e-06,4e-06,3e-06,1e-06,4e-06,4e-06,7e-06,2e-06,4e-06,6e-06,1.3e-05,4e-06,2e-06,6e-06,3e-06,4e-06,2e-06,3e-06,3e-06,4e-06,5e-06,4e-06,3e-06,6e-06,7e-06,6e-06,7e-06,2e-06,1e-06,2e-06,5e-06,2e-06,7e-06,5e-06,2e-06,2e-06,2e-06,3e-06,1e-06,5e-06,7e-06,8e-06,1e-06,2e-06,2e-06,3e-06,1e-06,1e-06,3e-06,3e-06,9e-06,2e-06,7e-06,3e-06,5e-06,5e-06,4e-06,3e-06,3e-06,4e-06,3e-06,3e-06,3e-06,1e-06,4e-06,2e-06,3e-06,3e-06,7e-06,3e-06,4e-06,5e-06,3e-06,5e-06,2e-06,4e-06,5e-06,3e-06,4e-06,3e-06,3e-06,2e-06,0,1e-06,4e-06,2e-06,3e-06,3e-06,5e-06,2e-06,2e-06,2e-06,3e-06,1e-06,3e-06,2e-06,1e-06,3e-06,2e-06,2e-06,0,2e-06,4e-06,2e-06,3e-06,5e-06,4e-06,2e-06,3e-06,1e-06,4e-06,1e-06,2e-06
6e-06,4e-06,7e-06,4e-06,4e-06,5e-06,2e-06,5e-06,1e-06,8e-06,3e-06,3e-06,4e-06,8e-06,6e-06,4e-06,1e-05,1.3e-05,5e-06,3e-06,1e-06,6e-06,1e-06,1e-06,0,4e-06,1e-06,2e-06,7e-06,2e-06,5e-06,6e-06,7e-06,5e-06,1e-05,6e-06,3e-06,1e-06,3e-06,5e-06,6e-06,4e-06,6e-06,3e-06,1e-06,4e-06,2e-06,9e-06,6e-06,6e-06,2e-06,5e-06,2e-06,5e-06,1e-06,4e-06,2e-06,7e-06,7e-06,2e-06,7e-06,3e-06,7e-06,6e-06,2e-06,0,2e-06,7e-06,2e-06,5e-06,3e-06,3e-06,6e-06,5e-06,2e-06,3e-06,5e-06,6e-06,9e-06,5e-06,3e-06,4e-06,6e-06,5e-06,1e-05,5e-06,2e-06,1e-06,4e-06,2e-06,3e-06,5e-06,8e-06,6e-06,4e-06,5e-06,6e-06,2e-06,2e-06,2e-06,1e-06,4e-06,7e-06,3e-06,2e-06,3e-06,2e-06,2e-06,3e-06,2e-06,2e-06,1e-06,2e-06,1e-06,2e-06,2e-06,3e-06,3e-06,1e-06,4e-06,4e-06
3e-06,6e-06,8e-06,4e-06,5e-06,5e-06,2e-06,6e-06,2e-06,1.1e-05,4e-06,2e-06,3e-06,6e-06,6e-06,2e-06,6e-06,7e-06,8e-06,3e-06,5e-06,2e-06,3e-06,2e-06,2e-06,3e-06,5e-06,2e-06,6e-06,5e-06,3e-06,7e-06,1e-05,1.1e-05,4e-06,6e-06,3e-06,3e-06,5e-06,1e-06,3e-06,5e-06,5e-06,4e-06,2e-06,3e-06,3e-06,5e-06,1.1e-05,6e-06,2e-06,4e-06,5e-06,1e-06,4e-06,1e-06,2e-06,5e-06,7e-06,4e-06,4e-06,4e-06,2e-06,4e-06,2e-06,2e-06,4e-06,2e-06,5e-06,5e-06,3e-06,2e-06,4e-06,3e-06,1e-06,6e-06,3e-06,5e-06,3e-06,4e-06,3e-06,1e-06,4e-06,1e-06,4e-06,2e-06,2e-06,0,2e-06,3e-06,3e-06,4e-06,5e-06,6e-06,0,6e-06,5e-06,1e-06,2e-06,0,2e-06,4e-06,3e-06,1e-06,0,4e-06,3e-06,2e-06,2e-06,2e-06,2e-06,1e-06,2e-06,2e-06,4e-06,2e-06,1e-06,1e-06,4e-06,2e-06,1e-06
2e-06,5e-06,6e-06,1e-06,3e-06,5e-06,3e-06,5e-06,2e-06,1e-05,4e-06,4e-06,2e-06,4e-06,6e-06,1e-06,7e-06,9e-06,3e-06,4e-06,5e-06,7e-06,3e-06,0,4e-06,7e-06,6e-06,5e-06,5e-06,3e-06,2e-06,2e-06,5e-06,1e-05,6e-06,2e-06,2e-06,2e-06,0,3e-06,2e-06,1e-06,1e-06,1e-06,2e-06,1e-06,4e-06,4e-06,6e-06,6e-06,2e-06,5e-06,3e-06,5e-06,3e-06,3e-06,1e-06,2e-06,5e-06,1e-06,4e-06,3e-06,1e-06,4e-06,2e-06,2e-06,7e-06,3e-06,3e-06,2e-06,3e-06,1e-06,3e-06,3e-06,2e-06,7e-06,2e-06,3e-06,5e-06,4e-06,3e-06,2e-06,6e-06,1e-06,5e-06,3e-06,2e-06,2e-06,4e-06,1e-06,1e-06,3e-06,4e-06,4e-06,4e-06,4e-06,4e-06,3e-06,5e-06,3e-06,1e-06,3e-06,2e-06,3e-06,2e-06,0,3e-06,3e-06,3e-06,2e-06,0,3e-06,2e-06,2e-06,3e-06,3e-06,2e-06,1e-06,2e-06,3e-06,3e-06
4e-06,8e-06,4e-06,3e-06,5e-06,6e-06,1e-06,2e-06,4e-06,7e-06,7e-06,1e-06,2e-06,7e-06,2e-06,5e-06,0,7e-06,6e-06,5e-06,2e-06,6e-06,1e-06,3e-06,5e-06,4e-06,2e-06,4e-06,5e-06,3e-06,3e-06,3e-06,5e-06,1e-05,3e-06,4e-06,1e-06,1e-06,2e-06,6e-06,3e-06,0,1e-06,0,2e-06,1e-06,0,6e-06,7e-06,3e-06,3e-06,4e-06,1e-06,4e-06,2e-06,4e-06,3e-06,3e-06,3e-06,3e-06,1e-06,1e-06,4e-06,2e-06,3e-06,1e-06,7e-06,2e-06,1e-06,3e-06,2e-06,3e-06,3e-06,4e-06,2e-06,6e-06,4e-06,1e-06,5e-06,3e-06,2e-06,3e-06,7e-06,3e-06,3e-06,1e-06,1e-06,1e-06,6e-06,4e-06,3e-06,2e-06,2e-06,4e-06,4e-06,4e-06,4e-06,3e-06,2e-06,1e-06,4e-06,4e-06,1e-06,3e-06,3e-06,2e-06,2e-06,1e-06,3e-06,1e-06,2e-06,2e-06,3e-06,2e-06,2e-06,4e-06,2e-06,0,1e-06,2e-06,1e-06
2e-06,4e-06,3e-06,3e-06,4e-06,4e-06,1e-06,3e-06,1e-06,4e-06,3e-06,0,1e-06,6e-06,2e-06,2e-06,5e-06,5e-06,7e-06,1e-06,4e-06,4e-06,1e-06,2e-06,2e-06,4e-06,2e-06,2e-06,3e-06,5e-06,1e-06,2e-06,6e-06,9e-06,2e-06,1e-06,1e-06,2e-06,2e-06,3e-06,4e-06,3e-06,1e-06,2e-06,2e-06,5e-06,2e-06,2e-06,8e-06,6e-06,4e-06,3e-06,0,3e-06,3e-06,4e-06,3e-06,2e-06,6e-06,1e-06,2e-06,1e-06,4e-06,0,2e-06,2e-06,6e-06,1e-06,0,0,2e-06,3e-06,1e-06,4e-06,2e-06,3e-06,4e-06,2e-06,6e-06,3e-06,3e-06,2e-06,6e-06,4e-06,6e-06,3e-06,0,2e-06,4e-06,1e-06,0,3e-06,2e-06,2e-06,2e-06,0,0,3e-06,2e-06,3e-06,4e-06,1e-06,4e-06,4e-06,2e-06,2e-06,1e-06,1e-06,3e-06,2e-06,2e-06,2e-06,3e-06,1e-06,2e-06,2e-06,2e-06,0,1e-06,1e-06,3e-06
2e-06,3e-06,2e-06,2e-06,1e-06,6e-06,1e-06,4e-06,2e-06,4e-06,4e-06,1e-06,1e-06,5e-06,4e-06,0,6e-06,7e-06,5e-06,1e-06,4e-06,7e-06,1e-06,2e-06,2e-06,5e-06,3e-06,1e-06,5e-06,4e-06,3e-06,5e-06,4e-06,8e-06,1e-06,3e-06,3e-06,1e-06,2e-06,5e-06,2e-06,1e-06,1e-06,3e-06,2e-06,4e-06,2e-06,1e-06,5e-06,8e-06,2e-06,2e-06,1e-06,3e-06,2e-06,4e-06,1e-06,2e-06,6e-06,1e-06,2e-06,2e-06,2e-06,1e-06,3e-06,1e-06,5e-06,1e-06,1e-06,2e-06,3e-06,2e-06,2e-06,2e-06,3e-06,5e-06,2e-06,1e-06,4e-06,5e-06,5e-06,2e-06,5e-06,4e-06,3e-06,3e-06,4e-06,1e-06,2e-06,3e-06,2e-06,2e-06,3e-06,4e-06,2e-06,2e-06,2e-06,3e-06,2e-06,3e-06,4e-06,2e-06,3e-06,2e-06,3e-06,3e-06,3e-06,2e-06,1e-06,1e-06,2e-06,2e-06,3e-06,3e-06,2e-06,1e-06,2e-06,1e-06,1e-06,2e-06,2e-06
0,5e-06,3e-06,1e-06,3e-06,6e-06,2e-06,2e-06,3e-06,5e-06,4e-06,0,1e-06,8e-06,4e-06,0,3e-06,5e-06,4e-06,5e-06,4e-06,3e-06,1e-06,2e-06,1e-06,3e-06,5e-06,2e-06,6e-06,3e-06,1e-06,3e-06,4e-06,7e-06,1e-06,2e-06,2e-06,2e-06,2e-06,5e-06,1e-06,0,2e-06,2e-06,3e-06,0,1e-06,5e-06,5e-06,5e-06,3e-06,3e-06,3e-06,3e-06,1e-06,2e-06,2e-06,1e-06,3e-06,3e-06,2e-06,1e-06,1e-06,2e-06,4e-06,2e-06,6e-06,2e-06,1e-06,1e-06,4e-06,2e-06,2e-06,4e-06,0,5e-06,4e-06,3e-06,6e-06,4e-06,4e-06,1e-06,4e-06,3e-06,5e-06,2e-06,3e-06,3e-06,1e-06,1e-06,3e-06,2e-06,1e-06,3e-06,1e-06,2e-06,2e-06,3e-06,2e-06,2e-06,2e-06,2e-06,2e-06,2e-06,2e-06,4e-06,2e-06,1e-06,1e-06,3e-06,2e-06,2e-06,4e-06,2e-06,0,0,2e-06,1e-06,2e-06,0,2e-06
2e-06,5e-06,3e-06,0,2e-06,4e-06,2e-06,3e-06,1e-06,5e-06,5e-06,1e-06,2e-06,6e-06,4e-06,1e-06,4e-06,4e-06,4e-06,3e-06,1e-06,6e-06,1e-06,1e-06,1e-06,1e-06,2e-06,1e-06,4e-06,3e-06,0,2e-06,5e-06,9e-06,4e-06,1e-06,3e-06,2e-06,4e-06,3e-06,1e-06,0,2e-06,5e-06,0,3e-06,1e-06,2e-06,8e-06,7e-06,1e-06,2e-06,2e-06,2e-06,1e-06,1e-06,1e-06,1e-06,3e-06,1e-06,2e-06,2e-06,2e-06,3e-06,1e-06,1e-06,3e-06,2e-06,0,2e-06,3e-06,0,1e-06,4e-06,1e-06,5e-06,4e-06,3e-06,3e-06,4e-06,4e-06,2e-06,4e-06,2e-06,4e-06,1e-06,1e-06,2e-06,2e-06,2e-06,2e-06,2e-06,0,4e-06,0,2e-06,1e-06,1e-06,1e-06,1e-06,2e-06,1e-06,2e-06,2e-06,1e-06,4e-06,1e-06,1e-06,1e-06,1e-06,2e-06,0,2e-06,2e-06,1e-06,0,1e-06,1e-06,1e-06,0,1e-06
1e-06,4e-06,3e-06,1e-06,1e-06,4e-06,1e-06,5e-06,2e-06,7e-06,4e-06,1e-06,2e-06,5e-06,4e-06,1e-06,4e-06,4e-06,6e-06,2e-06,0,5e-06,0,2e-06,3e-06,2e-06,2e-06,1e-06,4e-06,3e-06,1e-06,3e-06,5e-06,9e-06,2e-06,2e-06,2e-06,1e-06,2e-06,3e-06,2e-06,0,1e-06,2e-06,1e-06,1e-06,1e-06,2e-06,7e-06,7e-06,1e-06,2e-06,1e-06,3e-06,1e-06,0,1e-06,2e-06,6e-06,1e-06,2e-06,1e-06,2e-06,2e-06,2e-06,1e-06,3e-06,3e-06,2e-06,1e-06,1e-06,1e-06,1e-06,3e-06,1e-06,4e-06,3e-06,2e-06,4e-06,3e-06,2e-06,1e-06,4e-06,2e-06,4e-06,0,1e-06,3e-06,1e-06,2e-06,1e-06,2e-06,2e-06,3e-06,1e-06,3e-06,1e-06,1e-06,2e-06,0,1e-06,0,2e-06,1e-06,2e-06,2e-06,1e-06,0,1e-06,1e-06,2e-06,1e-06,2e-06,2e-06,0,1e-06,0,1e-06,1e-06,0,1e-06
1e-06,4e-06,3e-06,0,1e-06,4e-06,0,5e-06,1e-06,5e-06,3e-06,1e-06,0,7e-06,4e-06,1e-06,4e-06,4e-06,6e-06,2e-06,1e-06,5e-06,0,1e-06,3e-06,1e-06,2e-06,0,4e-06,2e-06,0,2e-06,5e-06,9e-06,2e-06,1e-06,1e-06,1e-06,2e-06,2e-06,1e-06,0,0,2e-06,0,2e-06,1e-06,2e-06,7e-06,7e-06,1e-06,2e-06,1e-06,3e-06,1e-06,1e-06,1e-06,0,5e-06,1e-06,2e-06,1e-06,2e-06,0,2e-06,1e-06,3e-06,2e-06,1e-06,1e-06,1e-06,1e-06,0,3e-06,1e-06,4e-06,2e-06,2e-06,4e-06,3e-06,2e-06,2e-06,5e-06,2e-06,4e-06,1e-06,0,2e-06,2e-06,0,1e-06,2e-06,2e-06,3e-06,1e-06,3e-06,2e-06,1e-06,1e-06,0,1e-06,0,2e-06,1e-06,2e-06,2e-06,1e-06,0,1e-06,1e-06,2e-06,1e-06,3e-06,2e-06,0,0,0,1e-06,2e-06,0,0
1e-06,5e-06,3e-06,1e-06,2e-06,4e-06,0,5e-06,0,6e-06,3e-06,1e-06,2e-06,6e-06,4e-06,1e-06,4e-06,5e-06,5e-06,2e-06,1e-06,5e-06,0,1e-06,2e-06,1e-06,2e-06,1e-06,4e-06,3e-06,0,2e-06,5e-06,9e-06,1e-06,1e-06,1e-06,1e-06,2e-06,3e-06,1e-06,0,0,2e-06,0,3e-06,0,1e-06,6e-06,6e-06,0,1e-06,1e-06,2e-06,0,1e-06,1e-06,0,5e-06,0,2e-06,0,3e-06,1e-06,2e-06,1e-06,3e-06,1e-06,1e-06,2e-06,1e-06,0,1e-06,3e-06,1e-06,4e-06,2e-06,2e-06,4e-06,3e-06,3e-06,2e-06,4e-06,2e-06,4e-06,1e-06,1e-06,2e-06,2e-06,1e-06,1e-06,2e-06,1e-06,3e-06,1e-06,2e-06,1e-06,2e-06,1e-06,0,1e-06,0,1e-06,1e-06,2e-06,2e-06,1e-06,0,1e-06,1e-06,2e-06,1e-06,3e-06,1e-06,1e-06,1e-06,0,1e-06,1e-06,0,1e-06
