1.261152,1.387163,1.364116,1.470277,1.593595,1.536016,1.552704,1.464565,1.544868,1.818053,1.767387,1.571868,1.52459,1.666113,1.547872,1.330079,1.384411,1.452719,1.857749,2.166738,1.870896,1.918495,2.164879,2.125581,1.993512,1.897672,1.951044,1.988328
1.469019,1.594221,1.551106,1.681555,1.876855,1.837486,1.86267,1.78426,1.836007,2.106473,2.022284,1.808815,1.831128,2.022856,1.852414,1.561177,1.633445,1.731086,2.182999,2.51636,2.18959,2.23017,2.485506,2.517159,2.436399,2.295946,2.291102,2.28649
1.819649,1.891128,1.791773,1.957248,2.331718,2.371401,2.401099,2.347965,2.337193,2.557929,2.401064,2.205968,2.375371,2.615421,2.351387,1.953181,2.055411,2.199054,2.688315,3.019811,2.673781,2.691693,2.91295,3.12457,3.166704,2.918991,2.790694,2.699338
2.07803,2.015228,1.855636,2.034925,2.596581,2.772829,2.802645,2.781625,2.726651,2.831856,2.606503,2.564741,2.898578,3.053925,2.703493,2.290586,2.375207,2.505976,2.94401,3.206958,2.937747,2.910178,2.995739,3.454196,3.657751,3.255145,2.9987,2.829664
2.092115,1.961975,1.811097,1.98133,2.541008,2.771286,2.788711,2.795086,2.781823,2.815466,2.606692,2.729944,3.115702,3.1155,2.73895,2.431099,2.467445,2.530761,2.862904,3.051721,2.913956,2.863917,2.813047,3.330845,3.57609,3.141679,2.930191,2.796087
1.806573,1.755908,1.73364,1.871418,2.202173,2.369591,2.387725,2.425017,2.487496,2.490273,2.379933,2.550181,2.834084,2.759065,2.427158,2.245946,2.278457,2.278935,2.426354,2.504049,2.481763,2.500107,2.432166,2.773256,2.918925,2.600968,2.552449,2.631367
1.539863,1.63343,1.882842,2.014324,1.978167,2.008985,2.055682,2.142453,2.19043,2.194832,2.280634,2.390575,2.497855,2.433813,2.126364,1.968731,2.082381,2.124512,2.104069,2.077286,2.145948,2.265224,2.223505,2.298172,2.310949,2.158696,2.230644,2.517848
1.681942,1.936563,2.512932,2.691524,2.273272,2.166824,2.493021,2.728126,2.670996,2.740378,2.976586,3.005045,3.052765,3.001926,2.560234,2.203937,2.475057,2.711339,2.54408,2.413079,2.514832,2.612662,2.490784,2.415719,2.453678,2.412307,2.483563,2.87405
2.336327,2.737836,3.565507,3.800074,3.014786,2.701618,3.483545,4.100883,4.011148,4.112598,4.407765,4.325501,4.352798,4.377855,3.745497,3.012424,3.414625,3.918913,3.580608,3.337606,3.470368,3.442518,3.253222,3.198701,3.268764,3.269723,3.262944,3.653682
3.338791,3.844919,4.680151,4.904841,3.897715,3.44318,4.730657,5.860372,5.775326,5.824236,6.170178,5.943267,5.9103,6.122844,5.352649,4.153902,4.536635,5.248173,4.772559,4.461615,4.761457,4.670848,4.413282,4.387574,4.404147,4.559516,4.507981,4.755197
4.488935,4.998342,5.55836,5.611031,4.519271,4.041775,5.677421,7.326847,7.369488,7.327515,7.745184,7.471256,7.302388,7.642464,6.927386,5.360537,5.404243,6.116638,5.75986,5.513983,6.021575,5.95707,5.750764,5.855313,5.606809,5.917347,6.032913,6.135047
5.323105,5.648562,5.883018,5.777128,4.70344,4.236433,5.826714,7.726042,8.026857,7.996875,8.394869,8.170023,7.914989,8.275477,7.760565,6.034249,5.609319,6.253215,6.402429,6.191855,6.607812,6.742933,6.867014,7.231878,6.69901,7.117715,7.378668,7.279145
5.16322,5.293889,5.441008,5.223445,4.304671,4.018449,5.317948,6.931154,7.332059,7.428181,7.572172,7.440519,7.355825,7.653164,7.30048,5.743757,5.09509,5.592864,6.22529,6.034665,6.123819,6.597008,7.171445,7.599088,6.960827,7.513772,7.830445,7.722202
3.989584,4.037625,4.276795,4.111961,3.533019,3.503222,4.451964,5.357563,5.524875,5.761251,5.726315,5.709969,5.832267,5.920837,5.688299,4.819461,4.452243,4.668303,5.208219,4.987643,4.761482,5.494065,6.359582,6.494337,6.019415,6.757659,7.061931,7.061256
2.591609,2.680361,2.927184,2.931025,2.833011,2.921149,3.325287,3.841546,4.052928,4.319762,4.411072,4.275908,4.136636,4.229944,4.233168,4.100151,4.336485,4.138345,4.077155,4.006993,3.730631,4.279465,5.086116,5.059037,4.918743,5.536863,5.567261,5.685066
2.223108,2.26729,2.326126,2.590258,3.065183,3.236563,3.107702,3.493066,3.761109,4.047301,4.679286,4.200079,3.645421,4.269598,4.713494,4.869537,5.142197,4.236549,3.488538,3.920602,4.201831,4.54113,5.152696,5.307776,5.301621,5.186122,4.809419,5.583672
3.282283,3.049516,3.018227,3.685439,4.701376,4.916797,4.120108,4.353007,4.817306,4.959682,5.753816,5.293971,4.814036,5.674976,6.407388,6.824169,6.853888,5.619658,4.288911,4.633232,5.514166,6.084375,6.622475,6.769098,6.846463,6.45039,5.539985,6.556393
5.05942,4.533225,4.638842,5.899918,7.498521,7.768685,5.909291,5.742677,6.598699,6.217755,6.676994,6.572137,6.359279,7.233338,8.498642,9.40933,9.074199,8.030407,6.475646,6.036085,7.049329,8.064822,8.348936,8.392802,8.873889,8.299951,6.466133,6.991052
7.287473,6.588335,6.99541,8.977721,10.992114,11.181627,8.406976,8.045378,8.982231,7.509936,7.861527,8.308552,7.9161,8.661923,10.778363,12.825769,12.266467,11.318053,9.655688,7.9926,8.744416,10.159865,10.155581,10.248382,10.79741,9.818044,7.086324,6.648596
9.093632,8.389335,9.366446,11.942075,13.871864,13.800144,10.765404,10.790986,11.253019,8.490181,9.250975,10.039336,8.836245,9.272325,12.230559,15.795763,15.397774,14.502321,12.767049,9.603307,9.8167,11.61695,11.747791,12.122993,12.154121,10.541443,7.510243,6.37085
9.265123,8.90146,10.502936,13.106602,14.679612,14.484259,11.803917,12.753956,12.699308,9.129603,10.006379,10.334259,8.428432,8.666756,11.701566,15.905509,15.79649,15.263847,14.002573,10.102296,9.981876,11.824948,12.033329,12.413695,11.720858,9.913956,7.618645,6.103259
7.823883,7.945896,9.438878,11.520601,12.901316,12.860299,11.14304,12.58296,12.165903,9.22734,9.709213,8.858725,6.999655,7.376168,9.577744,12.761946,12.538086,12.577092,12.516532,9.318514,9.025741,10.499421,10.422365,10.36595,9.54633,8.353193,7.412338,6.14648
6.05587,6.213325,6.747805,8.128044,9.251276,9.459628,9.036677,9.973823,9.474864,8.508839,8.662257,7.044142,5.775006,6.39255,7.95411,9.44694,8.648463,9.058822,9.842372,8.020612,7.546366,8.243086,7.99102,7.622056,7.214961,6.621462,6.577138,6.515559
4.6906,4.626262,4.359038,5.002648,5.642619,6.18555,6.619665,6.839334,6.626952,7.129073,7.27722,5.756644,4.886489,5.570917,6.974524,7.522813,6.888516,7.258264,7.241113,6.152757,5.716876,6.024989,6.679662,6.560699,6.058835,5.60713,5.658847,6.249317
3.703558,3.703108,3.083087,3.266308,3.953425,4.516108,4.796877,5.250364,5.264486,5.372476,5.909501,5.261778,4.408236,4.886624,5.819267,5.682983,5.701721,6.073983,5.265896,4.693224,4.285806,4.372914,5.928459,6.410212,5.546121,5.016667,5.265786,5.474829
3.097427,3.136898,2.539769,2.492955,2.921655,3.398066,3.750789,4.491291,4.570653,3.893275,4.426211,4.624861,3.864035,3.975362,4.422117,3.976513,4.329813,4.575716,3.821217,3.893137,3.596153,3.401474,4.700786,5.676212,5.127823,4.314643,4.59381,4.390454
2.479666,2.434863,2.141248,2.051177,2.069682,2.517673,3.225623,4.013516,4.073916,2.988289,3.131551,3.721498,3.253794,3.367159,3.226278,2.512482,3.109432,3.254785,2.657019,3.079332,3.189608,2.79542,3.369342,4.379502,4.179132,3.275233,3.556445,3.28658
1.620768,1.600335,1.55176,1.480529,1.433821,1.955251,2.710874,3.356879,3.326887,2.201264,2.073925,2.652212,2.459943,2.73854,2.421118,1.612273,2.209227,2.357801,1.860915,2.395985,2.797492,2.394357,2.623231,3.34818,3.096222,2.354571,2.572758,2.380684
0.889728,0.965082,1.036306,0.999071,1.038278,1.517487,2.081734,2.409714,2.239838,1.510056,1.425822,1.698579,1.571652,1.968686,1.922065,1.255238,1.386207,1.508676,1.286101,1.734175,2.24543,2.037226,2.086056,2.441231,2.301349,1.908735,1.912951,1.755015
0.582412,0.659255,0.699811,0.720536,0.893775,1.335847,1.550149,1.566451,1.434554,1.146115,1.08682,1.070573,0.926087,1.188858,1.481599,1.225913,0.961732,0.889555,0.911605,1.261215,1.615106,1.456827,1.377078,1.518479,1.631866,1.558766,1.415391,1.308203
0.534082,0.555169,0.63894,0.654425,0.819705,1.239759,1.214544,1.088203,1.068189,1.004773,0.996914,0.905594,0.762293,0.794566,1.21938,1.302414,0.880564,0.63202,0.721073,1.133883,1.263987,0.963193,1.075504,1.328022,1.40316,1.272286,0.976511,0.884499
0.471434,0.462015,0.674488,0.754605,0.790984,1.109382,1.081497,0.847467,0.768261,0.868601,0.933841,0.812389,0.694044,0.691294,1.098933,1.323836,0.909062,0.573313,0.671573,0.997952,1.024962,0.831062,1.11572,1.364298,1.304984,1.158868,0.900375,0.754493
0.43018,0.423004,0.663861,0.781012,0.736799,0.959666,0.894589,0.661119,0.551113,0.72393,0.918721,0.776798,0.595209,0.592641,0.854502,1.2146,1.056813,0.657567,0.727864,0.871756,0.85126,0.879317,1.141333,1.316972,1.313942,1.185321,0.936066,0.809296
0.418192,0.400675,0.569933,0.681289,0.690119,0.938559,0.779751,0.536747,0.515872,0.638517,0.81885,0.652325,0.443767,0.492353,0.592349,1.022655,1.108749,0.669737,0.749988,0.791773,0.765857,0.886633,1.023927,1.225677,1.239469,1.104741,0.881811,0.745178
0.349477,0.373784,0.457394,0.555967,0.675429,0.937849,0.757644,0.490676,0.475813,0.551798,0.724866,0.530534,0.330078,0.422772,0.518044,0.990129,1.033218,0.535049,0.65463,0.721788,0.698436,0.78065,0.837254,1.065174,1.064303,0.98651,0.80132,0.614524
0.278631,0.338042,0.379257,0.45057,0.671404,0.943736,0.772523,0.478377,0.461684,0.518274,0.721027,0.556755,0.301866,0.391723,0.569631,1.003203,0.841455,0.338204,0.476271,0.57694,0.552323,0.709835,0.834361,0.943511,0.912797,0.866925,0.735134,0.597606
0.272965,0.322373,0.380336,0.415535,0.620425,0.883429,0.711875,0.487592,0.538701,0.575386,0.761261,0.603783,0.321215,0.439441,0.712556,0.974032,0.674173,0.258619,0.346715,0.496261,0.516728,0.765535,0.848398,0.850323,0.813035,0.729031,0.748406,0.643438
0.281902,0.328919,0.384462,0.390888,0.573745,0.765433,0.5445,0.454913,0.614874,0.605925,0.758896,0.602474,0.369313,0.535737,0.848846,0.929178,0.61342,0.305404,0.334971,0.515927,0.616188,0.854243,0.871011,0.816626,0.688457,0.600641,0.796002,0.716044
0.26542,0.320421,0.336806,0.335377,0.52277,0.632745,0.376017,0.401678,0.617608,0.527601,0.696264,0.637906,0.416221,0.589519,0.88152,0.965862,0.726783,0.394125,0.343609,0.552375,0.704636,0.824693,0.838974,0.759228,0.53057,0.512154,0.763608,0.741992
0.222124,0.279166,0.287902,0.316279,0.472672,0.565829,0.368464,0.420362,0.563972,0.413719,0.600095,0.658012,0.413951,0.558465,0.768672,0.929999,0.824898,0.463721,0.377572,0.538273,0.708032,0.666524,0.678581,0.631533,0.515278,0.570565,0.658335,0.662587
