1.997106,1.89537,1.635389,1.553662,1.758752,1.76713,1.493645,1.66649,2.180204,2.231105,2.053293,1.993273,1.911906,1.979937,1.754829,1.293146,1.274891,1.553923,1.563543,1.558645,1.745177,1.83598,1.591474,1.333992,1.312675,1.319617,1.504032,1.63188
2.212622,2.114626,1.859622,1.779014,2.022556,2.033894,1.736468,1.917243,2.428906,2.480277,2.342781,2.26506,2.142038,2.225197,1.997196,1.500252,1.469587,1.734966,1.736622,1.768031,1.959397,2.025462,1.77724,1.529922,1.494813,1.476887,1.648649,1.763115
2.427228,2.342493,2.152175,2.089752,2.358553,2.357498,2.053318,2.221325,2.659761,2.732537,2.717976,2.616795,2.443602,2.544465,2.302764,1.780273,1.723117,1.921069,1.909601,2.021847,2.1931,2.185569,1.972468,1.787676,1.715493,1.637688,1.774258,1.859668
2.313182,2.258724,2.215239,2.21118,2.398265,2.338907,2.081499,2.17571,2.444876,2.584503,2.735171,2.636461,2.486552,2.575724,2.306205,1.836286,1.760941,1.837529,1.806437,1.983261,2.093682,2.004462,1.897669,1.814818,1.689435,1.556424,1.672142,1.731466
2.076401,2.03059,2.091196,2.150113,2.216553,2.133983,1.924342,1.935959,2.053889,2.210756,2.430077,2.345884,2.217264,2.2632,2.069562,1.744509,1.669126,1.652533,1.567253,1.712704,1.771862,1.640746,1.623989,1.61432,1.48021,1.358139,1.453222,1.460312
1.9812,1.91742,2.007874,2.067607,2.017572,2.002342,1.845104,1.730513,1.745339,1.872501,2.001237,1.954964,1.856889,1.826076,1.796222,1.640114,1.581747,1.55543,1.431677,1.513264,1.570216,1.378658,1.281366,1.310921,1.275864,1.200276,1.20439,1.150646
2.055119,2.053801,2.216564,2.229672,2.053275,2.118905,1.979766,1.664365,1.610085,1.749004,1.755322,1.713201,1.6738,1.588935,1.691835,1.689881,1.678082,1.681238,1.561472,1.582351,1.621891,1.333259,1.054319,1.144719,1.250695,1.157622,1.039412,0.989883
2.271613,2.367432,2.60529,2.686295,2.468172,2.521077,2.331026,1.915002,1.866576,1.981295,1.871479,1.760745,1.776164,1.743258,1.919501,1.991956,2.006707,1.985252,1.881945,1.860216,1.839554,1.566951,1.216537,1.281522,1.401876,1.274162,1.174665,1.177555
2.577569,2.786578,2.996093,3.069955,2.938707,2.950874,2.701248,2.323228,2.310667,2.399224,2.30067,2.149825,2.126177,2.193862,2.375116,2.402817,2.443347,2.36958,2.266587,2.166885,2.007871,1.866453,1.639212,1.652444,1.686195,1.537058,1.553604,1.613127
2.849211,3.148324,3.214786,3.129705,3.130574,3.067853,2.829154,2.708469,2.780436,2.826068,2.874304,2.794174,2.61081,2.700016,2.80095,2.665449,2.753853,2.706722,2.605079,2.387302,2.071879,2.106871,2.094591,2.031044,2.016208,1.952614,2.102599,2.226032
3.095373,3.489048,3.34307,2.995797,3.046172,2.897838,2.760813,3.001058,3.192985,3.220895,3.554014,3.713313,3.281931,3.173779,3.111569,2.77685,2.843863,2.870104,2.763212,2.451081,2.132967,2.341266,2.498794,2.338915,2.326554,2.435574,2.738184,2.921215
3.347473,3.663343,3.397182,3.002739,3.0642,2.863883,2.76284,3.157988,3.443041,3.537364,4.158053,4.560815,3.933213,3.477889,3.274832,2.96163,2.931007,2.978176,2.842508,2.489137,2.308001,2.554976,2.788384,2.574253,2.533944,2.88433,3.392339,3.617966
3.765832,3.84835,3.570917,3.284371,3.245782,3.032646,2.929985,3.235427,3.462533,3.649923,4.468875,4.970237,4.246371,3.603028,3.413074,3.189478,2.959032,3.056797,3.001996,2.584919,2.524348,2.775736,3.069912,2.866923,2.657521,3.13117,3.816809,4.034977
4.414351,4.06519,3.789872,3.776408,3.70161,3.372999,3.264123,3.574169,3.528116,3.546329,4.373587,4.797225,4.182568,3.682083,3.52988,3.266729,2.87514,3.067846,3.162903,2.727614,2.7523,3.109733,3.431367,3.167751,2.810317,3.25857,3.860561,3.935353
5.428633,4.564127,4.314064,4.647884,4.746006,4.149495,4.115949,4.715265,4.177871,3.748455,4.359205,4.491466,4.1288,3.951727,3.771396,3.458951,3.100902,3.413287,3.579729,3.336291,3.56399,3.857081,3.816126,3.452612,3.418552,3.924328,4.022829,3.730172
7.615023,6.025945,5.737355,6.410943,6.645662,5.59629,5.680258,6.870543,5.96268,5.006293,5.441057,5.557325,5.433108,5.096334,4.722054,4.525822,4.192433,4.67058,4.938802,4.923688,5.445568,5.541437,4.916737,4.494698,5.078099,5.767935,5.216634,4.513345
10.583483,8.62214,8.307836,8.865027,9.162218,8.093173,8.261544,9.655456,8.472237,7.330693,7.674824,7.916379,7.991676,7.246662,6.803501,6.785974,6.264525,6.902995,7.343673,7.508976,8.408157,8.395922,7.358886,6.631065,7.335035,8.258749,7.210617,6.270569
13.47024,12.079502,11.80455,11.614832,11.877102,11.59345,11.72651,12.369643,11.150659,10.265534,10.176105,10.514215,11.007575,10.143982,9.895598,9.891673,8.951712,9.570593,10.460369,11.025707,12.067902,11.695708,10.371492,9.186329,9.474529,10.517181,9.172225,8.423779
15.94113,15.972203,15.877802,14.818381,14.483605,15.359862,15.719046,14.497793,13.358387,13.78744,13.275097,13.497163,14.258576,13.264711,13.551038,13.491332,12.258531,12.732793,14.243104,15.491098,15.912515,14.450728,13.011992,11.85522,11.721879,12.202982,10.281328,10.340445
18.146783,19.255291,19.503054,18.470185,17.07976,18.573217,19.872875,16.940684,15.626725,17.811084,17.414793,16.775399,16.892859,15.712599,17.006938,17.525062,16.888595,17.301494,18.826773,20.358034,19.344742,16.249055,14.690085,14.854004,15.458041,14.26298,10.690826,11.699871
19.520426,21.538035,22.213188,22.012681,19.841465,20.906224,22.539617,19.36056,18.29167,20.583636,20.08754,18.302888,17.58314,16.780693,19.316616,21.49223,22.292613,21.939525,22.154548,23.048884,20.517967,16.766989,15.170977,16.931786,19.020576,16.274247,10.994111,12.303645
19.115887,21.831219,22.922588,23.001794,20.591552,21.423485,22.657771,20.153787,19.319035,19.703396,18.712986,16.817018,16.533703,16.94631,20.074736,23.56163,25.973367,24.722685,22.640156,21.763579,18.474319,15.693146,14.188708,16.85552,20.328411,16.891831,10.976449,11.816862
17.183724,19.4452,20.717581,20.419154,18.175308,19.578389,20.501314,18.929934,17.835174,16.421086,15.194358,13.966158,15.073046,16.73141,19.054562,22.193207,25.630802,24.495514,20.632987,17.501852,15.366886,14.709489,13.133186,15.946608,19.785314,16.495205,10.862317,10.497226
16.109801,16.91111,18.127396,17.594148,15.220036,16.06545,16.838447,16.233695,14.289163,12.912378,13.062622,12.520504,13.78189,15.950524,16.720711,18.608195,22.246946,21.025388,16.633648,12.829297,12.853668,13.943487,12.511933,14.648728,17.004482,14.886837,11.504797,10.14658
16.025123,15.005295,15.2871,14.685728,13.701642,13.546966,13.166692,12.790399,10.074509,9.71019,11.5281,11.719035,12.617029,14.061534,13.541436,14.132142,16.277832,14.784926,11.931739,9.726341,10.931141,11.928167,10.651462,11.563183,12.634607,13.06354,12.632639,10.645657
14.903453,12.991137,11.539765,11.202149,12.606293,12.735288,11.748308,10.76616,8.310679,8.660239,9.955943,9.826402,10.854457,11.203375,9.88304,9.607195,10.844943,10.488541,8.31919,7.541202,9.076462,8.824712,8.026471,8.09307,8.803194,12.157285,13.29551,10.939208
12.002143,10.32277,8.676666,9.731113,11.645283,11.044031,10.552468,9.770761,7.907832,8.617223,9.153147,8.316958,9.489801,9.60323,8.934965,8.675718,8.745136,9.117626,7.269084,6.394719,7.260204,6.732561,6.271081,5.789884,6.067671,9.85696,11.340435,9.823325
7.996044,7.498541,7.359458,8.893372,9.770429,7.895406,8.010048,8.712679,7.713816,7.941424,7.80555,7.350508,8.927114,8.888437,8.585223,8.344696,7.418999,7.745488,6.511027,5.330306,5.862149,5.719854,4.932532,4.033369,4.046209,6.351199,7.435062,7.28533
5.174936,5.791125,6.262995,7.079373,7.264249,5.103584,5.055122,6.557348,6.507572,6.188871,5.597147,6.004284,7.397184,6.917687,6.790589,6.929479,5.823241,5.553695,4.901169,3.990487,4.627386,4.796122,3.776974,2.776914,2.844815,3.732771,4.62104,5.266932
3.959786,4.920209,4.900271,4.51094,4.304417,3.038673,2.81903,4.124775,4.609215,4.210586,3.904185,4.716576,5.426094,4.881342,4.701142,4.772352,4.173466,3.702761,3.139097,2.56588,3.379897,3.81503,3.305242,2.800714,2.544132,2.304591,3.096343,3.847209
3.198262,3.804104,3.281435,2.549394,2.286469,1.90785,1.94695,2.925271,3.320828,2.743411,2.48565,3.58095,4.564607,3.822283,2.953051,2.899654,3.360031,3.532201,2.656696,1.820451,2.366726,3.124121,3.067488,2.917572,2.320677,1.599994,2.264431,2.757936
2.686259,2.821746,2.026223,1.823574,2.130194,1.822516,1.856229,2.624471,2.795728,2.174399,1.524533,2.403813,3.64741,2.912462,1.900758,2.152807,2.951821,3.389891,2.438191,1.41215,1.692449,2.424117,2.582599,2.661151,1.973687,1.206452,1.489582,1.749279
2.408371,2.175325,1.620155,1.85276,2.443103,2.039588,1.823578,2.30969,2.374817,2.028193,1.460894,1.73295,2.585174,2.231581,1.490554,1.745558,2.352957,2.821932,2.12196,1.189182,1.506677,1.874292,2.042603,2.199065,1.548649,1.02679,0.920099,0.948091
2.368639,1.68333,1.449989,1.957931,2.438664,2.077818,1.764249,1.996034,1.940818,1.761859,1.540753,1.59459,1.940666,1.92757,1.456997,1.362247,1.774462,2.116744,1.695877,1.245452,1.50219,1.473732,1.585679,1.580063,1.110419,1.000533,0.738823,0.648017
2.467758,1.469502,1.338778,1.772393,1.967695,1.862201,1.727688,1.606658,1.342409,1.269685,1.440029,1.61583,1.593876,1.779781,1.500645,1.095784,1.401002,1.474773,1.212874,1.280753,1.446471,1.246206,1.207096,1.201938,1.093446,1.13188,0.700519,0.527654
2.378082,1.453989,1.370338,1.590656,1.624194,1.756887,1.812245,1.549421,1.027053,0.939472,1.21575,1.600271,1.506475,1.658756,1.454779,1.043461,1.392761,1.266487,0.960241,1.268428,1.331595,1.096905,0.974583,1.083425,1.346716,1.273209,0.674832,0.541559
2.083464,1.460256,1.566309,1.859113,1.927577,1.861638,1.900811,1.672407,1.000931,0.865494,1.188706,1.526737,1.248734,1.390924,1.477219,1.203737,1.603672,1.326805,0.947351,1.294306,1.330171,1.057937,0.940283,1.097445,1.546877,1.320573,0.656225,0.624301
2.056263,1.566676,1.684754,2.067297,2.203191,1.746416,1.752432,1.668055,0.976592,0.915784,1.395048,1.495411,1.054852,1.342295,1.700564,1.578437,1.888822,1.451933,1.010942,1.192633,1.265916,1.106037,1.023886,1.205262,1.590338,1.275595,0.763543,0.708835
2.09889,1.702083,1.631009,1.950791,2.188412,1.403123,1.337767,1.47802,0.942717,0.894002,1.442204,1.496484,1.165943,1.579979,1.90476,1.908287,2.038877,1.462179,0.969711,0.98039,1.079191,1.170446,1.06098,1.139175,1.389712,1.081654,0.898405,0.771956
2.013863,1.742536,1.62129,1.705578,2.007589,1.29651,0.948602,1.192717,0.826162,0.752398,1.225823,1.450576,1.37313,1.717201,1.840263,1.97439,1.878178,1.240039,0.803202,0.926734,0.917504,1.091832,0.951806,0.88067,1.07178,0.877072,0.987633,0.92101
