-0.018805,-0.013391,-0.026817,-0.015269,-0.013567,-0.006894,-0.003365,-0.001747,-0.000773,0.000311,0.000222,-3e-06,0.000849,4.9e-05,-0.001858,-0.001695,-0.002374,-0.00222,-0.002969,-0.00283,-0.003382,-0.003293,0.004131,-0.029407,-0.021032,-0.012346,-0.005508,-0.001713,-0.002095,-0.000446,-0.000278,-0.000626,-4.1e-05,0.000109,-0.000207,-0.018504,-0.019656,-0.010785,-0.013138,-0.008429,-0.005184,-0.005109,-0.005909,-0.003185,-0.002516,-0.002483,-0.002584,-0.001956,-0.002003,-0.001113,-0.000422,-0.001472,-0.001254,-0.001882,-0.000752,0.000133,0.00049,0.000377,-6.4e-05,-0.000525,-0.012716,-0.009613,-0.005266,-0.00421,-0.011992,-0.018346,-0.006905,-0.003046,-0.00179,-0.001294,-0.001561,-0.003225,-0.005441,-0.003826,-0.001783,-0.001247,-0.000714,-0.000774,-0.000946,-0.017927,-0.009813,-0.032326,-0.027844,-0.019235,-0.012259,-0.006282,-0.005519,-0.00225,-0.001963,-0.004594,-0.004711,-0.010749,-0.016252,-0.007329,-0.010092,-0.012209,-0.010001,-0.008406,-0.005874,-0.003036,-0.001233,-0.001087,-0.00109,-0.000529,-0.003808,-0.003842,-0.002177,-0.000891,-0.000342,-0.000929,-0.001213,-0.001216,-0.001465,-0.013147,-0.022532,-0.02587,-0.027161,-0.015656,-0.024821,-0.01393,-0.020671
0.008623,0.005917,0.015396,0.013907,0.009788,0.006067,0.003476,0.001491,0.000695,-0.000259,6e-04,0.001084,0.000742,0.000854,0.002254,0.002289,0.001856,0.001346,0.001127,0.001714,0.004617,0.004497,-0.000896,0.013878,0.008788,0.010416,0.007756,0.004357,0.003659,0.002004,0.000777,0.000421,0.000499,0.000396,0.000328,0.003322,0.007379,0.0053,0.007406,0.00498,0.004191,0.00256,0.001929,0.001287,0.000839,0.002271,0.001089,0.00245,0.001642,0.0022,0.001332,0.001031,0.000983,0.001661,0.001286,0.000816,0.00057,0.000586,0.000691,0.000583,0.003571,0.002049,0.00272,0.003745,-0.00302,0.011567,0.004827,0.000434,0.000446,4.8e-05,0.00039,0.001362,0.001477,0.002053,0.001501,0.00168,0.001315,0.000658,0.000848,0.011153,0.002879,0.01646,0.008695,0.005469,0.004964,0.004055,0.002887,0.002153,0.000985,0.002873,0.001427,0.004821,0.00628,0.00547,0.004708,0.000123,0.005318,0.012251,0.00935,0.004547,0.001695,0.000656,0.000731,0.001299,0.001081,0.003405,0.001893,0.001049,0.000213,0.000509,7.2e-05,0.001168,0.000569,0.002722,-0.001622,0.017863,0.016455,0.009347,0.010772,0.011732,0.008621
0.002263,-0.006003,-0.005333,-0.000577,-0.001518,-0.001089,-0.001021,-0.000346,-0.000957,0.000143,5.6e-05,0.000971,0.00058,0.000417,2e-05,-0.000436,-0.000614,-0.000197,-0.000866,-0.001953,-0.001803,-1.8e-05,-0.000912,-0.013504,-0.00764,-0.007219,-0.004425,-0.00089,0.000258,-9.8e-05,-0.00016,-0.000134,0.00012,0.000212,7.1e-05,-0.004319,-0.005428,-0.001864,-0.004147,-0.002008,9.7e-05,0.000245,-2.5e-05,-0.000841,-8.1e-05,-0.000362,0.000339,8.2e-05,-7.4e-05,-0.000493,-0.000235,-7.4e-05,3.6e-05,-0.000519,0.000308,0.000186,-0.000184,0.000455,8.7e-05,-6.4e-05,-0.000759,0.001379,0.000318,-0.000845,0.000274,-0.006968,-0.005953,-0.003457,-0.002526,-0.0011,-0.000487,-0.00061,-0.000597,-1.9e-05,-0.000107,-0.000101,-1.8e-05,2e-06,-0.00023,-0.004489,0.000227,-0.014344,-0.007754,-0.007828,-0.003003,-0.000713,-0.001057,-0.00067,9.1e-05,-0.001396,0.000393,-0.001615,-0.001469,-0.000648,-0.00084,0.006042,0.00086,-0.002712,-0.00341,-0.000307,0.000512,-0.000309,-9.8e-05,0.000283,0.000348,0.000164,0.000545,0.000317,0.000214,0.000102,0.000119,0.000109,0.000216,-0.003444,0.00396,-0.000603,-0.009408,-0.000285,0.000251,0.001751,-0.003999
-0.000441,-0.003854,0.001867,-0.003108,0.000988,0.001498,0.001777,0.000276,-3.8e-05,0.000555,-0.000272,-0.000178,-6.3e-05,-0.000479,0.000412,-0.000124,-6.5e-05,0.000454,0.001087,0.000318,-0.001685,-0.000923,-0.00015,0.00799,0.007627,0.006697,0.0047,0.001671,0.00043,-0.000275,-5.2e-05,4.4e-05,-1.1e-05,-7.8e-05,-0.000539,0.003594,0.004647,-0.000261,0.001356,0.001136,-0.000365,0.000589,-0.00038,-0.000449,-0.000388,-0.00018,-0.000662,-0.000151,0.000504,0.000148,3.4e-05,0.000307,1e-05,-0.00038,-0.000216,7e-06,-0.000165,0.00015,-7.5e-05,0.000284,-5e-04,-0.005018,-0.00215,-0.000211,0.001618,0.000568,-0.001328,0.000521,0.000878,0.00014,-0.000543,-0.000426,5e-04,0.000228,-0.00047,0.00036,1e-04,-0.000163,-4.2e-05,9.2e-05,-0.003095,-0.001212,0.004425,-1.1e-05,0.000457,-0.000347,0.001208,0.001142,0.000282,0.000465,2.8e-05,-0.001163,-0.00208,-0.002398,-0.002046,-0.009118,0.00036,0.00348,0.000908,0.00056,-0.000395,-0.000615,-0.000467,-0.000336,-0.000805,-0.000934,-0.000764,1.7e-05,-0.000142,-0.000467,-0.000475,-4.3e-05,-0.000303,0.000422,-0.005089,-0.01091,0.000142,0.001724,-0.004556,-0.004571,0.003078
0.004977,0.005237,0.000173,0.001396,-0.001719,-0.000985,-0.001352,-8.6e-05,8.7e-05,0.000486,-0.000123,0.000427,8.6e-05,-0.000248,0.000302,0.000471,0.000449,0.000266,-0.000337,1.9e-05,4e-05,0.001466,0.001151,0.001176,0.003886,0.001544,0.001399,-5e-06,0.00122,0.000456,-7e-05,5.9e-05,0,-3e-05,-2.9e-05,0.000852,-1e-06,0.001822,0.002115,-0.00055,0.000464,0.000468,0.000208,0.000676,0.000207,0.000312,0.000775,0.000381,5.1e-05,0.000133,8.4e-05,-0.000295,-0.000635,-1.8e-05,0.000392,-0.000113,-0.000202,-9.3e-05,0.000166,-0.000385,-0.000111,0.003351,0.001338,0.000515,-0.000801,-0.005003,0.002148,0.004158,0.0017,0.000836,0.000447,0.000655,-0.000391,7.2e-05,-0.000399,-0.000167,-0.000136,-0.000147,-1.4e-05,0.000813,0.007017,0.004579,-0.003403,-0.00138,-0.000413,0.000228,6.4e-05,-0.000161,-0.001128,-0.000438,-0.000228,-0.001005,0.004814,0.000384,0.001911,0.000269,-0.001231,-0.002065,-0.000884,-0.00026,0.000111,-0.000293,0.000584,0.000607,-0.000418,0.00152,0.000201,-0.000152,-0.000141,4.4e-05,-0.000228,0.000198,-0.000222,-0.000581,-0.00377,0.00307,-0.005803,-0.000535,-0.001912,0.001599,0.001749
-0.003364,-0.005567,-0.00172,-0.005123,0.000695,0.001177,0.001434,0.000314,-0.000191,-0.00019,-0.000372,-0.000168,-0.000369,-0.000385,-0.000164,-0.000796,-5e-04,-0.000463,-0.000286,5.5e-05,-0.000401,-0.001537,-0.000261,-0.001149,-0.003328,0.000923,0.002416,-0.00038,-0.000251,-0.000185,-0.000398,-0.000436,-0.000178,-6.7e-05,-0.000211,-0.000495,-1.1e-05,-0.0023,-0.002184,0.000727,-0.000586,0.000416,-0.000721,-0.000451,0.00026,-0.000168,-0.000661,-4.9e-05,0.000707,-0.000289,-0.000325,-1e-05,0.00036,-9.4e-05,-0.000303,-0.000246,-0.000173,-0.000108,-0.000138,0.000269,3.7e-05,-0.001178,-0.001728,-0.00107,0.000391,0.003486,0.001329,0.000161,0.00012,0.00074,0.000583,0.000357,0.00081,0.000147,0.000582,-0.000103,-0.000176,-0.000252,-0.000328,-0.00019,-0.003989,-0.00332,-0.003529,0.003862,0.00164,0.001733,0.000381,1e-05,8.8e-05,0.000361,-5.4e-05,-0.000165,-0.003047,-0.002274,-0.001188,0.001762,0.00031,-0.001023,-0.001677,-0.001926,-0.000238,0.000109,-0.000307,-0.000382,4.6e-05,-0.000111,7.1e-05,0.000528,0.000433,0.000129,0.000114,0.000504,0.000406,-0.000341,0.002557,-0.001697,0.005761,0.003955,0.003306,-0.000761,0.002361
-0.001246,-0.000741,0.001524,0.007308,0.002398,-0.002616,-0.00175,-0.00052,-8.1e-05,-0.000197,-0.000127,-0.000221,-0.000253,-0.000349,-0.000281,-0.000112,0.000451,0.00037,2e-04,0.000335,0.000237,-0.000117,0.001322,-0.000697,-0.004893,-0.007363,-0.002499,-0.001198,-0.001272,-0.000862,-0.00078,-0.000326,1e-06,-0.000176,-0.00019,1.7e-05,-0.002048,-0.001549,0.00095,0.000189,0.00022,0.000353,-7.1e-05,-0.000145,-0.000543,-0.000611,-0.000237,-0.000451,-0.000432,0.000109,-0.000189,-0.000449,-0.000241,-0.000223,2.3e-05,-0.000257,-0.000346,-0.000314,-0.000223,-4.4e-05,-0.000191,-0.000251,2.5e-05,0.000407,0.000602,0.000362,-0.000912,-0.001086,-0.00111,-0.000833,-0.000335,-0.000936,-0.000577,-0.00014,-0.000304,-4.9e-05,-0.000255,0,-0.000199,-0.000291,-0.001779,0.000391,0.006925,-0.000309,-0.000688,-0.002268,1.5e-05,-0.000384,-0.000312,-0.000733,-0.00079,-0.000941,-0.00166,-0.000495,0.002121,-0.001629,-0.000984,0.000216,0.000537,8.4e-05,-0.000673,-0.000494,-0.000338,-0.000274,0.000188,-7.3e-05,-0.000586,-0.000146,-0.000298,-0.000148,-0.000333,0.000102,5.6e-05,0.000544,0.001224,0.001893,-0.000758,-0.001426,0.00168,0.000802,0.002011
0.001533,0.001768,-0.002611,-0.007928,-0.003179,0.00072,0.000704,0.000304,-0.000117,-0.00025,1.1e-05,-3.7e-05,-3e-04,-7.2e-05,-6.7e-05,-0.000166,-0.000246,-0.000345,0.000341,-0.00018,0.00057,-0.001451,-0.000523,-0.001412,0.004391,0.002372,-0.000509,-0.000773,0.00029,-0.000943,-0.000604,-0.000165,-9.4e-05,-0.000326,-0.000116,-0.000186,0.001352,-5.4e-05,0.000333,-0.000646,-0.000777,0.000227,-0.000246,0.000213,-0.000407,0.000148,7.7e-05,0.000311,0.000223,-0.000553,-9.5e-05,-0.00023,-0.000347,-0.000388,-0.000365,-0.000292,-7e-05,-5.6e-05,-0.000217,-0.000173,-1.2e-05,-0.000246,-0.000555,-0.000568,-0.001489,-0.001489,-0.000506,-0.001134,-0.001199,-0.000842,-0.000899,-0.000304,-0.000235,0.000183,-0.000392,-0.000283,-0.000226,-0.000251,-7.4e-05,0.000205,0.000551,0.003048,-0.001367,-0.00042,-0.002286,0.00103,-0.000362,-4.2e-05,0.000144,-6.9e-05,0.000594,-0.000329,0.000376,0.00141,-0.000608,0.001693,0.002026,-0.001514,-0.001353,-0.001063,-0.000338,-0.000108,-9.6e-05,0.000179,0.000414,-0.000118,-0.000268,-0.000334,-0.000403,-7.5e-05,-6e-06,-0.000492,-0.000165,0.00022,0.003172,-0.002151,-0.003449,-0.001803,0.000174,-0.00099,-0.00086
0.002073,-0.001377,9e-04,0.006796,0.002703,-0.002304,-0.000544,-2.8e-05,-0.000113,-6e-06,-3e-04,-0.000122,-0.000154,-0.000184,-0.000338,-0.000259,-1.3e-05,-9.5e-05,-0.000214,-7.9e-05,-0.000639,-8e-06,0.00139,-0.000487,-0.000576,-0.000338,0.001501,-0.000427,-0.000412,-8e-05,6.4e-05,-8.8e-05,-0.000223,-8.4e-05,-7.1e-05,0.00023,0.000244,0.001739,-0.000157,0.001233,0.000786,-0.000342,4.4e-05,-0.000661,-0.000111,-0.000182,-7.6e-05,-3.7e-05,0.000103,5.9e-05,-0.000364,-0.000203,2.7e-05,0.000213,0.000113,6.8e-05,-0.000204,-0.000137,-0.000235,1.5e-05,-0.000167,0.000716,0.000329,-0.000375,0.00066,-0.000134,-0.001339,-0.000293,0.000201,0.000845,0.000783,0.000464,0.000323,-0.000284,2.9e-05,-0.000203,-0.000224,-0.000262,1.5e-05,0.000103,0.000235,-0.001114,0.000886,0.000857,0.002751,-0.001368,-7.4e-05,-4e-05,-0.000327,-0.000125,-0.000546,0.000263,0.000317,-0.001488,0.000741,-0.001384,-0.004558,0.000614,0.000333,-0.000257,-0.000154,-6.4e-05,-0.000161,-0.000363,0.000255,-0.000163,0.000105,0.000121,6.2e-05,-0.000163,5.6e-05,0.000129,6.3e-05,-0.000399,-0.000499,-0.000738,0.002837,-0.000718,0.00032,0.000573,0.002464
-0.001589,0.000837,0.000375,-0.005064,-0.0019,0.000824,0.000343,0.000188,0.000156,-4.1e-05,-0.000285,-0.000156,-0.000329,-0.000129,-0.000181,-0.000138,0.000266,2e-06,0.000534,8.7e-05,0.000209,-0.000326,3.3e-05,-0.000262,-0.000266,-0.000637,-0.000508,-0.00045,0.000243,-0.000437,-0.000149,-1.1e-05,-8.4e-05,-7.5e-05,-6.2e-05,0.000136,-0.000733,-0.002438,0.000559,0.000598,-0.000378,0.000833,4e-06,-0.000176,-0.000365,-1.4e-05,-0.00017,-0.000151,-0.000125,-0.000462,0.000143,2e-06,-0.000113,-0.000124,-8.3e-05,-0.000277,-6.9e-05,-7.8e-05,-0.00012,-0.000116,0.000168,-0.000687,-0.000276,0.000176,-0.000692,-0.000622,-0.001515,0.000466,0.000264,0.000302,0.00024,0.000301,-0.000239,-5.7e-05,-0.000628,0.000243,-8.2e-05,-6.3e-05,8.2e-05,-0.000165,0.001204,0.000331,-0.002191,6.9e-05,-0.00194,0.000567,-0.000199,-0.000222,-0.000329,-0.000314,-7e-06,3.5e-05,0.000283,0.000347,-8.2e-05,-0.000613,3e-04,-0.00167,-0.000232,-0.000508,-0.001116,-0.000133,-4.3e-05,7.3e-05,1.9e-05,7.5e-05,-0.000455,8e-06,-0.000132,-5.4e-05,1e-06,-0.000285,4e-06,-0.000122,-0.001051,-0.000101,-0.001802,-2.3e-05,-0.000459,0.000453,0.000305
0.001182,-0.000388,-6.6e-05,-0.001455,-0.000347,-0.002059,-0.000722,0.000175,-0.00022,0.000137,-0.000303,1.4e-05,-0.00016,-4.2e-05,-0.000134,-1.6e-05,-0.000111,-0.000152,-4.6e-05,-1.3e-05,-0.000181,0.000821,9e-06,-0.000347,-0.00189,-0.001546,-0.000138,-0.00144,-0.000537,-0.000276,-1.8e-05,-3.1e-05,5.9e-05,-2.7e-05,1.1e-05,-1.6e-05,0.000168,0.001579,-0.001107,-0.001145,-0.000233,-0.000544,-0.000312,0.000194,0.000573,-0.000125,7.6e-05,-0.000243,8.7e-05,1e-04,-6.9e-05,-1.7e-05,-9e-05,1.3e-05,3.3e-05,-2e-05,-9.5e-05,-1.5e-05,-0.000122,-4.6e-05,0.000196,0.000224,0.000382,-0.000433,-0.00066,0.000828,-0.000136,-0.000347,0.000145,-0.000141,-0.000212,-0.000348,-9.5e-05,1.7e-05,0.000245,-3.3e-05,6e-06,1e-06,5.4e-05,0.000204,-0.001008,-0.00023,-0.000709,-0.00216,0.001515,3.4e-05,0.000509,-0.000499,0.00012,0.000239,-4.2e-05,-0.000417,-0.000146,-0.000899,-0.00083,-0.000124,0.001755,-0.000103,-0.000179,0.00027,2.3e-05,-1.1e-05,0.000153,-0.00013,0.000268,-2.5e-05,0.000174,-0.000388,-0.000181,-0.000142,3e-06,1.7e-05,0.00013,5.4e-05,0.000981,0.002023,-7.9e-05,-0.002111,-0.00228,-0.00025,-0.001884
-0.000963,-0.000558,-0.000198,2.9e-05,0.000451,0.000152,0.000236,0.000279,0.000188,-1e-04,0.000106,-9e-06,-5.3e-05,-6e-06,-9.3e-05,1.5e-05,-2.5e-05,-1.4e-05,6.8e-05,3.8e-05,0.000204,-0.000333,0.000448,-0.00035,0.001748,-0.001348,-0.000661,0.000431,-4.4e-05,-0.000267,-0.00016,2.4e-05,7.1e-05,4.6e-05,-1.4e-05,7.5e-05,0.000335,-0.001119,-0.000473,0.000705,0.000388,-0.000187,0.000288,-0.000124,-0.000368,-2.1e-05,-1.4e-05,-0.000136,-4.9e-05,-0.000149,-0.000131,-7e-06,0.000188,4.4e-05,-9.1e-05,2e-06,5.7e-05,-2.4e-05,-5e-05,4e-05,9.2e-05,-5.8e-05,-0.000175,0.000385,7.7e-05,-0.000433,9e-04,-0.000514,-0.000498,-0.000269,3e-05,0.000113,7.2e-05,2.6e-05,-0.000128,-6.4e-05,-4.7e-05,-3.5e-05,3.4e-05,4.8e-05,0.000862,-0.000138,0.001636,0.00107,-0.001304,-0.000512,-0.000475,-7.2e-05,-6e-06,-1.7e-05,1e-04,0.000489,1.5e-05,0.000776,-0.000739,-0.000511,-0.000212,-0.000632,-7e-05,1.1e-05,-0.00013,-3.4e-05,-3.5e-05,-9.6e-05,8.1e-05,-0.000265,-0.000132,0.000154,5e-06,0.00018,-3.3e-05,-5.5e-05,9.5e-05,-9.2e-05,-0.000172,-0.000692,0.000254,-0.00027,0.001565,-0.001969,0.001734
0.000973,0.000712,-0.000295,0.000179,4e-04,-3.8e-05,0.000168,0.000213,-0.000157,7.8e-05,-4.7e-05,-2.6e-05,-5.9e-05,-9.4e-05,0.000133,9e-06,7.6e-05,1.2e-05,-1.2e-05,-0.000149,-7.6e-05,0.000296,-8.2e-05,3.2e-05,-0.001478,0.000828,-0.000343,-0.000996,-0.000155,-4.3e-05,-0.000235,0.00011,-2.1e-05,-4e-06,7.8e-05,9e-05,-0.000694,0.000231,0.00077,-0.000269,-0.000515,-2.9e-05,5.2e-05,-0.000132,-2.6e-05,-0.000266,-5e-06,9.4e-05,-0.000178,-5.3e-05,5.8e-05,-9.9e-05,-0.000147,-2.4e-05,4.9e-05,-4.7e-05,-1.9e-05,-3.1e-05,7e-06,-1.2e-05,1e-04,5.1e-05,4.2e-05,-2e-06,-0.000467,-0.000471,-0.000738,0.000783,2e-04,-0.000213,0.000102,-0.00011,-4.5e-05,-4.7e-05,1.5e-05,-0.000167,-8.4e-05,8e-05,4.5e-05,2.3e-05,-0.000664,-3e-04,-0.000801,0.000614,0.001234,-4.7e-05,8.4e-05,-8.8e-05,-0.000124,9.5e-05,-0.000159,-0.000376,-0.000217,-2.4e-05,0.001054,-4.1e-05,0.000379,-0.000116,1.1e-05,-0.000223,3.8e-05,-6.6e-05,2.7e-05,0.000102,6.4e-05,-1.3e-05,-1.9e-05,-5.5e-05,-8e-06,-4.4e-05,2e-06,5.4e-05,-1.6e-05,-5.9e-05,0.000641,-0.000748,-0.000281,-0.000388,-0.000616,-5.7e-05,-0.001178
-0.000864,0.000466,-0.000457,-0.000816,-0.00125,-1.1e-05,-0.000414,6.1e-05,8.6e-05,5e-06,3.6e-05,-4.3e-05,2.7e-05,0.000131,-3.6e-05,-3.3e-05,-0.000102,-3.1e-05,1e-05,1.2e-05,-0.000118,-0.000484,-0.000124,-0.000206,0.000676,-0.000977,2e-06,0.000158,-1e-06,-1.1e-05,0.000273,6.8e-05,3.3e-05,2e-05,4.6e-05,5.7e-05,0.000455,-0.000497,-0.000598,0.000808,2.1e-05,-0.000257,-0.00016,0.000286,0.000205,0.000408,-2e-05,-5.8e-05,0.000137,0,2.5e-05,2.7e-05,0.000153,-2.3e-05,1.2e-05,2.5e-05,1.3e-05,-1.2e-05,8.3e-05,-1.6e-05,4.2e-05,-5.4e-05,-1.2e-05,-3.5e-05,-0.000122,0.000347,0.000575,-0.000572,-0.00017,0.000163,0.000158,0.00016,0.000138,-2.8e-05,5.3e-05,0.000158,3.5e-05,-4.2e-05,3.2e-05,1.9e-05,0.000311,0.000146,-0.000546,-3.6e-05,-0.000689,-0.001194,-0.00028,-0.000111,7.8e-05,-0.000123,-2.1e-05,8.4e-05,5.6e-05,8.9e-05,-0.000876,-0.000459,-0.000374,-0.000488,-6.8e-05,-1e-04,0.000172,0.000226,-6.2e-05,7.8e-05,5.1e-05,2.3e-05,-3.8e-05,-0.000108,-4e-06,6e-06,7e-06,6.1e-05,-4e-06,0.000111,-0.000274,0.000283,-0.000838,0.000288,0.000471,-0.00106,-0.001588
-0.000273,-0.000805,0.000426,1.1e-05,0.000614,0.000437,0.000234,4e-05,-3.2e-05,-7.8e-05,-0.000108,-3.3e-05,4.3e-05,-7.9e-05,5.7e-05,3.7e-05,-8.7e-05,2.8e-05,8e-06,-0.000136,0.000165,9e-05,-0.000148,-0.000213,0.000564,0.000442,0.000584,-9.3e-05,0.000156,-4.4e-05,-2.6e-05,-5e-05,1e-06,-4.3e-05,6.2e-05,-7e-06,-2e-04,0.000545,-5e-06,-0.000187,-0.000178,0.00019,0.00017,-8.9e-05,-0.000267,-8e-06,6.8e-05,3.5e-05,-1.8e-05,-1e-06,-2.2e-05,-5.6e-05,-9.6e-05,8e-05,2.7e-05,-4e-06,1.4e-05,-1.7e-05,1.5e-05,2.2e-05,4.3e-05,0.000155,-0.000251,0.00018,0.00015,-1.3e-05,-8.5e-05,-0.000393,-0.000172,-0.000121,9e-06,-3.1e-05,-0.000113,3e-06,-9.7e-05,-2e-04,-4.6e-05,9.2e-05,3.7e-05,-2.9e-05,-7.5e-05,0.000266,0.001058,-8.9e-05,0.000501,0.001031,0.000219,0.000267,-5.2e-05,2.4e-05,0.000199,8.7e-05,-3.8e-05,-0.000262,0.000152,0.000138,-0.000112,-0.000422,1.8e-05,-7.4e-05,-0.000148,-4.8e-05,7.2e-05,7e-06,-3.8e-05,1.9e-05,-0.000133,0.000251,-5.6e-05,2.1e-05,4.9e-05,6.4e-05,4e-06,-0.000144,-0.00075,0.000342,0.001571,0.001103,-0.00097,-0.000117,0.00049
-0.000169,0.000267,1e-06,7.4e-05,-0.000208,-0.000268,0.000132,-2e-05,-7.2e-05,4.1e-05,-1e-05,-1.2e-05,-4e-05,3.4e-05,-5.8e-05,-4e-06,2.1e-05,-7e-06,-3.2e-05,3e-06,-0.000162,-0.000288,-0.000247,-0.000153,5.4e-05,0.000416,-0.000347,-0.000295,-7.8e-05,-0.000115,1.3e-05,-4.8e-05,3.6e-05,-3e-06,4e-05,-3.9e-05,3.7e-05,-0.000157,-8.2e-05,-0.00014,7.4e-05,-0.000229,5.3e-05,2.9e-05,2.7e-05,0.000166,-3.7e-05,2.5e-05,-3.4e-05,-3.4e-05,-2.2e-05,2e-06,3.9e-05,-5.1e-05,-8e-06,-2.9e-05,-1.4e-05,2.2e-05,1.7e-05,-2e-06,5.2e-05,-0.000131,0.000179,-0.000287,-0.000189,0.000193,-4.7e-05,0.000619,2.7e-05,-3.5e-05,0.000139,6.2e-05,1.9e-05,6e-06,-1.1e-05,0.000172,-1.3e-05,-9e-06,7.1e-05,-1.1e-05,-0.000195,-0.000301,-0.000803,-0.000167,-0.001002,0.000185,1.8e-05,-2.8e-05,9.1e-05,-5.9e-05,-5.2e-05,-5.5e-05,3e-05,-0.000263,-0.000106,-3.5e-05,-0.000169,0.001193,9.3e-05,-0.000105,0.000326,-1.6e-05,-6.2e-05,2.2e-05,2e-06,2.5e-05,1e-05,-0.000186,-1.3e-05,3.1e-05,2.8e-05,3e-06,-6e-06,-3.7e-05,0.000255,4.8e-05,-0.000618,-0.000882,0.000449,-0.000221,0.000536
0.000333,0.000353,-0.000172,0.000321,2.2e-05,-0.000282,-0.000213,0.000122,-6.2e-05,-5.7e-05,-2.1e-05,2.2e-05,1.2e-05,-5e-06,1e-06,1.2e-05,-3.1e-05,-2e-05,-3e-05,-4.2e-05,1e-04,0.000195,-0.000203,-0.000112,-0.000825,-0.000151,0.000103,0.00012,4e-05,-7.5e-05,5e-06,2.3e-05,1.5e-05,1.2e-05,0,1.6e-05,-6.9e-05,-0.000108,0.000258,0.000124,0.000127,0.000358,-0.000125,-3.5e-05,8e-06,-0.000127,-2.6e-05,-1.7e-05,4.2e-05,2.3e-05,7.8e-05,-2.6e-05,4e-06,3.8e-05,0,3e-06,-3e-06,-1.5e-05,-1.3e-05,-1.7e-05,4e-05,2.4e-05,-1.8e-05,0.000193,0.000104,-0.000288,-0.000107,-0.000266,9.2e-05,0.000132,-7.4e-05,1e-05,-5e-06,-3.5e-05,-7e-06,-1.5e-05,-2.3e-05,7e-06,3e-06,-2e-06,0.000418,0.000107,0.000861,0.000814,0.000984,-1.1e-05,-6.1e-05,-0.000159,-5.9e-05,8.9e-05,1.3e-05,1.4e-05,0.000122,0.000257,6.1e-05,-0.000184,0.000146,-0.000169,-0.000123,2.6e-05,-0.000136,-3.2e-05,-7e-06,3e-06,-4.1e-05,-1.4e-05,4.4e-05,7.1e-05,-1.1e-05,-3.7e-05,6e-06,1.2e-05,-5.6e-05,4.6e-05,-0.000101,-0.000543,0.000427,0.000966,-0.000414,0.000645,-0.000313
-0.000795,-1.4e-05,0.000108,-0.000635,-2.9e-05,-0.000109,9.7e-05,-6.5e-05,-4e-05,4.6e-05,2.5e-05,2.4e-05,-3.8e-05,3e-06,-6.5e-05,1.2e-05,-1e-06,1.4e-05,-4.5e-05,-1e-06,-5.7e-05,-2.9e-05,0.000121,-4.5e-05,0.000787,-0.000164,0.000192,-1.2e-05,-9.3e-05,-9.6e-05,4e-06,-1e-06,-2.2e-05,1.2e-05,1.7e-05,3e-06,3.5e-05,0.000247,-0.000201,-0.000167,-0.000104,-0.000189,-1.1e-05,4e-06,9e-06,-2.6e-05,2.2e-05,1.3e-05,-3.9e-05,-7.7e-05,-5.9e-05,-2.9e-05,4e-06,-2.2e-05,-1.9e-05,-3.5e-05,-4e-06,3e-06,-1.1e-05,2e-06,1.8e-05,-3.2e-05,-0.000136,-4.8e-05,0.000101,-4.1e-05,5.4e-05,-3.6e-05,-6.2e-05,-0.000101,2.8e-05,-3e-05,-7.3e-05,4e-05,-4.4e-05,-2e-05,-1.3e-05,-2e-06,1e-05,-1.6e-05,-0.000503,-8e-06,0.000248,-0.000762,-0.000644,8.7e-05,4.6e-05,1.8e-05,-1.1e-05,-7.9e-05,-2e-05,5.8e-05,-5e-06,-6.8e-05,-0.000118,0.000118,-0.000224,-0.000302,1e-06,2.8e-05,-4.9e-05,3e-06,5e-06,-5.3e-05,-7e-05,2.3e-05,-2.9e-05,1.1e-05,-1.8e-05,-3e-06,-3e-06,-4.5e-05,4e-06,1.8e-05,0.000136,0.000572,-0.000644,-0.000157,0.000918,-0.00026,0.000299
0.000113,-2.4e-05,2.5e-05,0.000561,-0.000138,-0.000338,-0.00015,-6.6e-05,-3.6e-05,-2e-05,-4.5e-05,-1.5e-05,-2.1e-05,-2.2e-05,0,-3.2e-05,9e-06,-1.1e-05,-3.5e-05,-5e-06,5e-05,0.000156,-3.4e-05,7.4e-05,-0.00097,-0.000402,-0.000502,-0.000248,0,-0.000114,-7.4e-05,2.4e-05,-2.3e-05,-8e-06,-7e-06,-3.5e-05,8.6e-05,-0.000318,0.000125,-0.000229,-6.5e-05,0.000135,6.2e-05,-8.8e-05,-5e-05,1.9e-05,-4e-06,7e-06,1.7e-05,2.5e-05,-6e-06,6e-06,-1e-05,1.3e-05,-2e-06,4e-06,-1e-06,-2e-05,-3.3e-05,-2.4e-05,9e-06,9.2e-05,0.000162,-9.4e-05,-0.000166,0.000172,-0.000253,0.000269,1.7e-05,-9.2e-05,-6.2e-05,-6.9e-05,3.8e-05,-4e-06,3.7e-05,0,-5e-06,7e-06,8e-06,-4e-06,0.000449,-2.7e-05,-0.000697,0.000246,0.00011,9.1e-05,5.9e-05,-3.1e-05,-1.3e-05,-1.6e-05,2.2e-05,-1.2e-05,-8.2e-05,0.00011,0.000283,-0.000137,-1e-06,-3.1e-05,9.5e-05,-5.6e-05,-0.000143,1.3e-05,3e-05,2e-05,-4.6e-05,1.9e-05,-2.6e-05,-6.9e-05,-1.9e-05,-8e-06,0,-2.1e-05,1.1e-05,-2.7e-05,-0.000203,-8.2e-05,0.000139,-0.000605,-0.000526,0.000135,-0.000291
0.000698,0.000162,-6.3e-05,-3.3e-05,0.00016,6.2e-05,7.1e-05,2.1e-05,0,2.8e-05,-5.2e-05,-1.6e-05,-1.5e-05,1.4e-05,-5e-06,7e-06,-2e-06,-1.6e-05,-3e-05,3e-06,-2.5e-05,-7.1e-05,-2.2e-05,-1.9e-05,0.000249,0.000355,0.000147,6e-06,-2.3e-05,-3.8e-05,1e-05,3.6e-05,3.1e-05,-7e-06,3e-06,-1.4e-05,-9.3e-05,8.6e-05,3.7e-05,0.000256,5e-06,-3.6e-05,-3.6e-05,8.8e-05,-2.9e-05,-4.4e-05,1.6e-05,1.8e-05,-4e-06,-2.5e-05,1.6e-05,-2.1e-05,3.7e-05,4e-06,-3e-06,3e-06,1e-06,3e-06,-9e-06,1.8e-05,1e-05,-0.000131,-0.000145,8.8e-05,8e-05,4.2e-05,-4.1e-05,-0.000146,-4e-06,-1.7e-05,-1e-05,3.1e-05,2.1e-05,7e-06,-5.7e-05,6e-06,-1.3e-05,6e-06,1.2e-05,2e-06,-0.000463,4.5e-05,0.000327,-0.000162,0.00018,-0.000192,-9.1e-05,1.4e-05,-1.2e-05,5e-05,-2.3e-05,5e-06,-2.1e-05,-3.7e-05,-0.000102,2.6e-05,0.000348,-0.000219,-8.2e-05,-7e-05,1.7e-05,-2.5e-05,-1.7e-05,8e-06,-3.6e-05,-3.1e-05,-2.6e-05,4.6e-05,-2.3e-05,5e-06,1.2e-05,-2.8e-05,-3e-06,-1e-06,-0.000311,0.000276,0.000307,0.000302,0.000164,-0.000269,0.000349
-0.000177,-5.4e-05,5e-05,-0.000662,-0.000217,-4.1e-05,-6.1e-05,-1.7e-05,-2.6e-05,-1.4e-05,-1.8e-05,-1e-06,-8e-06,-1.1e-05,2e-06,1e-06,-1.7e-05,1.2e-05,-1.4e-05,-2e-06,-1.6e-05,1e-05,6.3e-05,-9.4e-05,0.000454,-0.000353,9.4e-05,-0.000186,2e-05,-1.7e-05,1.6e-05,-1.4e-05,6e-06,1.5e-05,1e-06,9e-06,-4.8e-05,4.1e-05,-8.2e-05,-7.5e-05,-9.2e-05,-1.2e-05,-3e-06,-6e-06,3.9e-05,7.8e-05,-2.5e-05,-3e-05,8e-06,-7e-06,-1.6e-05,-2e-06,-4.5e-05,0,9e-06,-1.1e-05,-1.1e-05,-7e-06,8e-06,-6e-06,6e-06,9.8e-05,6e-05,1.8e-05,-6.1e-05,-7.5e-05,-3e-05,7e-05,-6.7e-05,9e-06,1.4e-05,1.1e-05,6e-06,-3e-06,-1.5e-05,-4.4e-05,3e-06,4e-06,4e-06,-5e-06,0.000388,1.7e-05,8.3e-05,0.000147,-6.5e-05,-0.000238,5.3e-05,-4.2e-05,3.3e-05,2.5e-05,4e-06,2.3e-05,3e-06,-0.000123,0.000147,-3.3e-05,8.6e-05,9.8e-05,-7e-06,-4e-06,-7.9e-05,1.2e-05,7e-06,-3e-06,-2.4e-05,-4.3e-05,4e-06,-1.8e-05,-1.8e-05,2e-06,7e-06,1.7e-05,1e-06,-1e-06,0.000214,-0.000723,-0.000472,-0.000628,-0.000258,0.000194,0.000149
-3.7e-05,5.9e-05,-8.8e-05,0.000487,0.000187,-7.4e-05,7e-05,-1e-05,8e-06,4e-06,-4e-06,-5e-06,0,1.2e-05,2.4e-05,1.2e-05,7e-06,-3e-06,-6e-06,6e-06,3.3e-05,-0.00014,-5.2e-05,-1.1e-05,-3e-04,-0.000214,4e-06,-1e-04,1.7e-05,-5.8e-05,5e-05,1e-06,-1e-06,-1.3e-05,1e-06,6e-06,0.000126,7.5e-05,4.1e-05,-3e-05,0.000138,5.8e-05,2e-05,-4.3e-05,-1.9e-05,-2.7e-05,7e-06,-1.7e-05,-2e-06,-6e-06,8e-06,-1.2e-05,4.7e-05,6e-06,6e-06,-3e-06,9e-06,4e-06,8e-06,-6e-06,2e-06,-6e-05,2.5e-05,-4.8e-05,-0.000122,-9.3e-05,0.000119,-0.00014,-1.9e-05,4.5e-05,2e-06,1.7e-05,-1e-06,-2.8e-05,6e-06,7e-06,-1.4e-05,1.5e-05,5e-06,1e-06,-0.000245,1e-06,-0.000289,-0.000513,-0.000121,0.000114,6e-06,4.8e-05,-2.4e-05,-3.4e-05,2.1e-05,-2.6e-05,1.6e-05,4.1e-05,-7e-06,-7.7e-05,-0.00011,-6.3e-05,2.8e-05,-2.1e-05,8.4e-05,7e-06,-1e-05,-8e-06,-2.8e-05,1.2e-05,-4.9e-05,-1.2e-05,1.3e-05,-7e-06,6e-06,-1e-05,-2.1e-05,-1e-06,-1e-05,0.000579,0.000306,0.000305,0.00025,-4.3e-05,-0.00026
0.000133,0.000106,9e-06,-0.000311,1.8e-05,2e-04,2.6e-05,-5.8e-05,-3.4e-05,-2e-06,8e-06,3e-06,1e-06,-1.2e-05,-4e-06,-3e-06,6e-06,-7e-06,1.1e-05,-5e-06,-3.5e-05,2.8e-05,3.5e-05,-3.6e-05,0.000184,0.000345,-6.2e-05,3e-05,-9e-06,-4.1e-05,-2.3e-05,-1.5e-05,-2e-06,0,1e-06,-4e-06,-8.3e-05,-5.6e-05,-7.8e-05,-0.000112,-2.2e-05,-8.1e-05,-4e-06,1.3e-05,-1.9e-05,3.7e-05,-3e-06,-1e-06,-5e-06,-6e-06,1e-06,-1.3e-05,-2.1e-05,7e-06,1e-06,-3e-06,-2e-06,0,5e-06,1.2e-05,-2e-06,2.2e-05,-7.9e-05,5.1e-05,3.8e-05,7e-05,-2.8e-05,1.5e-05,-1.2e-05,-2e-06,-1.3e-05,-8e-06,-4.2e-05,1.5e-05,-3e-05,2.6e-05,-1.2e-05,-5e-06,1.7e-05,0,0.000128,-2.1e-05,0.00022,0.000407,0.00023,2.5e-05,-2.7e-05,-4e-05,-8e-06,-1.8e-05,-1.7e-05,2e-05,2.8e-05,6e-06,-9e-05,2.4e-05,-0.000138,5.7e-05,-1.3e-05,-1.5e-05,-3.6e-05,1e-06,0,1.8e-05,-2.4e-05,4e-06,-1.2e-05,8e-06,-2.7e-05,1.3e-05,5e-06,3e-05,1.6e-05,4e-06,0.000123,-0.000121,5e-05,8e-05,9.8e-05,-6.1e-05,0.000238
-0.000246,-2.9e-05,6.9e-05,0.000249,-9.2e-05,-0.000295,-6.5e-05,-3e-05,1.1e-05,-1.2e-05,-1e-05,1e-06,-4e-06,1e-05,1.7e-05,-5e-06,0,9e-06,-1.1e-05,6e-06,3.4e-05,-4.6e-05,1.2e-05,-1.9e-05,-8e-06,-0.00017,4.9e-05,-5.7e-05,3e-06,-2.1e-05,-8e-06,8e-06,0,-4e-06,1e-06,-2e-06,2e-06,-6.4e-05,3e-05,1.1e-05,-6e-06,5.3e-05,1.4e-05,2.4e-05,-2.6e-05,-3.6e-05,2e-06,0,9e-06,0,2e-06,-1e-06,1e-05,-8e-06,-5e-06,-3e-06,-1e-06,-2e-06,8e-06,-1.4e-05,-5e-06,-4.8e-05,6.3e-05,-4e-06,-8.1e-05,6.3e-05,5.2e-05,-5.9e-05,-4e-06,9e-06,1.1e-05,9e-06,2.3e-05,1.5e-05,3.4e-05,1e-05,1e-06,1.9e-05,-5e-06,-3e-06,-5e-06,5.1e-05,-0.00018,-0.000134,-0.000292,-2.1e-05,-1.9e-05,-1.2e-05,1.1e-05,-1.2e-05,2e-06,-1.3e-05,-5e-06,1.5e-05,6e-05,-6.5e-05,2.8e-05,-2.6e-05,2.9e-05,-2.8e-05,9.3e-05,-1.9e-05,-1e-05,-3e-06,-1e-05,-3e-06,1.1e-05,1.8e-05,2e-06,7e-06,2e-06,9e-06,-2e-06,2e-06,-4.2e-05,0.000224,-0.000186,-2e-05,-7.5e-05,-4.9e-05,5.5e-05
5.9e-05,-0.00011,8e-06,-0.000421,4.1e-05,0.000291,1.3e-05,-4e-05,-2.5e-05,2e-06,-2.3e-05,2e-06,-3e-06,-7e-06,-2.5e-05,6e-06,1.3e-05,1e-06,1.5e-05,-4e-06,-2.5e-05,9.9e-05,-1.2e-05,-3e-06,-0.00019,-1.9e-05,-6e-06,-2e-05,-2.9e-05,-4.9e-05,2.4e-05,6e-06,-1e-06,-1e-06,1e-06,5e-06,5e-05,0.000123,4.1e-05,7.4e-05,2e-06,-6.4e-05,-4e-06,-2.5e-05,1.2e-05,-9e-06,-4e-06,1.2e-05,-1.5e-05,2e-06,-1.5e-05,-1.4e-05,1e-05,1.2e-05,1e-06,0,0,-2e-06,2e-06,9e-06,-5e-06,8.7e-05,-1.7e-05,-7.6e-05,-4e-05,-6.6e-05,-2.2e-05,-7.2e-05,-5e-06,-5e-06,-3.2e-05,-1.8e-05,-2e-06,-5e-06,-3.8e-05,-8e-06,-1.1e-05,-2e-06,-2e-06,2e-06,-6.6e-05,1e-05,-0.000217,4.4e-05,0.000281,4.7e-05,-2e-06,1e-06,-1e-05,2.6e-05,7e-06,6e-06,-7e-06,-1.1e-05,-2.8e-05,1.4e-05,-4.7e-05,-0.000131,-1.7e-05,2.9e-05,-5.3e-05,1.2e-05,1.4e-05,4e-06,0,4e-06,-1e-06,-3.3e-05,-1.8e-05,-4e-06,0,1e-05,-1.1e-05,-7e-06,-0.000119,-0.000511,0.000133,0.000122,-0.000129,-1.5e-05,-0.00021
-4.2e-05,0.00015,-2.3e-05,0.00018,8e-06,-0.000294,-2.7e-05,0,3e-06,2e-06,-2e-05,-6e-06,-4e-06,1e-06,-1e-06,0,-4e-06,-6e-06,7e-06,0,1.7e-05,0,2.2e-05,1e-06,-7e-06,0.000108,-6.3e-05,1.3e-05,1.2e-05,-4.3e-05,-4.6e-05,1.2e-05,1e-05,6e-06,1e-06,3e-06,-2.9e-05,-0.000165,2.1e-05,-1.4e-05,-9e-06,3.1e-05,-3e-06,1.8e-05,-1.3e-05,4.9e-05,9e-06,0,8e-06,-2e-05,2.3e-05,-2e-06,-2.2e-05,-3e-06,2e-06,-7e-06,-5e-06,-3e-06,-4e-06,0,-5e-06,-8e-05,-3.4e-05,9.6e-05,3.8e-05,-6e-06,-4e-05,0.000137,3.8e-05,-3.7e-05,0,-1.7e-05,7e-06,-2e-06,2e-06,-8e-06,-9e-06,-1e-06,-5e-06,-1e-06,0.000118,-4.5e-05,0.000497,-0.00015,-0.000225,-2.2e-05,5.1e-05,-1e-05,9e-06,-5e-06,7e-06,6e-06,6e-06,-1.4e-05,-0.000105,-2.3e-05,8.1e-05,6.9e-05,-3.1e-05,-3e-05,3.8e-05,-5e-06,-7e-06,1.1e-05,1e-05,3e-06,-1e-06,3.5e-05,0,-4e-06,5e-06,0,9e-06,-5e-06,0.000183,0.000401,-0.000122,-6.4e-05,-4.5e-05,-6.7e-05,-2.2e-05
0.000167,-1.1e-05,-2.8e-05,6.6e-05,-3.6e-05,6.2e-05,3.6e-05,-1.2e-05,-1.4e-05,5e-06,3e-06,7e-06,-1e-06,2e-06,-2.1e-05,-2e-06,-7e-06,4e-06,1.2e-05,-1e-06,-1.3e-05,4.2e-05,-5e-06,-4.7e-05,0.000142,-0.00014,-2.2e-05,-0.000129,2e-06,-4.2e-05,2.1e-05,3e-06,-8e-06,-4e-06,0,-1e-06,-1.6e-05,9.2e-05,-8.5e-05,-4e-06,-1.1e-05,-1.7e-05,8e-06,1e-05,-6e-06,-6e-06,0,-1e-06,7e-06,1.4e-05,-1.3e-05,-1e-06,2e-05,-1e-06,-4e-06,0,3e-06,0,-5e-06,-6e-06,-6e-06,2.1e-05,4e-05,-8.1e-05,-5.4e-05,-1e-05,5e-06,4e-06,-2.8e-05,8e-06,-7e-06,1.2e-05,7e-06,-2e-06,-5e-06,-1.5e-05,-1e-06,8e-06,5e-06,-1e-06,-0.000181,-1e-05,-0.000291,0.000126,0.000139,6e-06,-5.8e-05,2.7e-05,-1.5e-05,-1.1e-05,-1e-05,2e-06,-1.1e-05,1.6e-05,3.7e-05,-1.2e-05,-3.6e-05,-6.3e-05,3.6e-05,-1.6e-05,-1.5e-05,2e-06,5e-06,-1.4e-05,6e-06,6e-06,-2.2e-05,-1.1e-05,-1e-05,-7e-06,0,-8e-06,-5e-06,2e-06,1.6e-05,-0.000175,-4e-06,0.000102,9.8e-05,-0.000137,3e-06
-4.6e-05,-8.1e-05,-7e-06,1.7e-05,3.6e-05,-0.000127,-4.8e-05,5e-06,4e-06,-2e-06,-2e-06,-1e-06,-3e-06,-2e-06,4e-06,-3e-06,2e-06,0,1.1e-05,-1e-06,-3e-06,-6e-05,0,1.5e-05,-4.8e-05,0.000109,0.000123,4.7e-05,4e-06,-1.8e-05,2.4e-05,-6e-06,-6e-06,5e-06,0,-2e-06,0,1.7e-05,2.4e-05,3.9e-05,-2.4e-05,-3e-06,-9e-06,-3.3e-05,-1.3e-05,-3e-06,-7e-06,-7e-06,-1.4e-05,-1.4e-05,-8e-06,-8e-06,-1e-06,6e-06,3e-06,1e-06,-3e-06,1e-06,-4e-06,5e-06,-7e-06,-2.1e-05,-2.5e-05,4.7e-05,2e-06,4.7e-05,-4e-05,8.6e-05,-1.4e-05,1.2e-05,-2e-06,1.4e-05,-2.4e-05,-6e-06,-1.5e-05,0,2e-06,-1e-06,-6e-06,2e-06,0.000178,1.3e-05,8.3e-05,3.7e-05,-8.5e-05,-3.7e-05,2.3e-05,-1.6e-05,-1e-06,4e-06,4e-06,2e-06,-1.2e-05,-5.5e-05,1e-05,0,7.3e-05,0.000156,6e-06,-1.1e-05,-6.8e-05,-8e-06,-2e-06,-1e-06,1.2e-05,7e-06,-1.5e-05,-2.1e-05,-1.1e-05,4e-06,3e-06,-1.3e-05,1.1e-05,0,5e-05,0.000242,4.9e-05,-0.000139,3e-06,0.000147,-5.3e-05
-3.6e-05,5.7e-05,3.7e-05,-0.000209,-5.3e-05,-9.5e-05,6.4e-05,-4e-06,-1.6e-05,2e-06,-1.1e-05,-5e-06,-7e-06,-1e-06,3e-06,4e-06,-5e-06,-4e-06,1.3e-05,-2e-06,1.6e-05,-1.2e-05,0,-2.7e-05,6.1e-05,-0.000182,-3.9e-05,-6.3e-05,2e-06,-4.4e-05,-4e-06,6e-06,8e-06,2e-06,-1e-06,1e-06,3.4e-05,-5.6e-05,1.8e-05,-6.5e-05,1.5e-05,2.6e-05,-1e-05,1.7e-05,1.2e-05,-1.9e-05,-1e-06,4e-06,1e-05,6e-06,1.5e-05,-3e-06,-6e-06,2e-06,-3e-06,-6e-06,3e-06,-1e-06,-2e-06,-4e-06,-6e-06,4.4e-05,1.4e-05,-2.3e-05,2.2e-05,-1e-06,-3e-06,-7.8e-05,-1.5e-05,-5e-06,2e-06,0,4e-06,9e-06,9e-06,2.4e-05,-6e-06,4e-06,0,-1e-06,-0.000129,8e-06,5.4e-05,-0.000153,0.000117,2.3e-05,9e-06,-2e-05,5e-06,1.2e-05,5e-06,-2e-06,8e-06,7.4e-05,-3e-05,-2.4e-05,4.4e-05,-0.000129,-2.6e-05,-2.5e-05,-7e-06,1e-06,4e-06,-5e-06,1.1e-05,-8e-06,-6e-06,3.3e-05,-1.1e-05,-4e-06,1e-06,-8e-06,2e-06,-1e-06,-3.1e-05,-0.000452,-9e-06,1.3e-05,1.2e-05,-0.000109,2.7e-05
-0.000143,6.6e-05,5e-06,0.000306,3.6e-05,6.7e-05,-2.4e-05,1.2e-05,5e-06,0,-1.8e-05,-2e-06,3e-06,1e-06,5e-06,-1e-06,3e-06,1e-06,7e-06,0,-1.5e-05,-5.5e-05,2e-06,7e-06,-0.000122,0.000151,-1.1e-05,-9e-06,-1.2e-05,-2.6e-05,-1e-05,-4e-06,5e-06,-7e-06,0,5e-06,-1.2e-05,3e-06,8e-06,-2.7e-05,9e-06,-1.9e-05,1.1e-05,8e-06,8e-06,-5e-06,5e-06,3e-06,-1e-06,-1e-05,-4e-06,-5e-06,1.4e-05,1e-06,2e-06,0,-4e-06,1e-06,0,2e-06,-5e-06,-5.2e-05,-2e-06,2e-06,-5e-05,-4.5e-05,1.5e-05,6.9e-05,-3e-05,0,-9e-06,-6e-06,3e-06,-6e-06,-7e-06,-1.3e-05,-5e-06,2e-06,-2e-06,0,1e-04,-7e-06,-9.6e-05,9.7e-05,-0.000189,1e-04,-1.4e-05,2.1e-05,-7e-06,7e-06,-5e-06,-1e-06,7e-06,-4.4e-05,2e-06,8e-06,3.6e-05,2.5e-05,2.4e-05,-8e-06,-2.4e-05,-1e-06,-8e-06,4e-06,1.5e-05,-5e-06,-4e-06,-3.2e-05,4e-06,3e-06,0,-7e-06,-1.1e-05,-2e-06,-7.3e-05,0.000324,4e-05,-2.4e-05,-0.00011,8.2e-05,-5.6e-05
0.00012,-6.9e-05,-3e-05,-0.000312,-1.3e-05,-0.000106,-1.9e-05,8e-06,-1e-05,-5e-06,-8e-06,1e-06,-1e-06,-2e-06,1.4e-05,1e-06,-1e-06,1e-06,-4e-06,-1e-06,1.3e-05,3.5e-05,-8e-06,-6e-06,9.6e-05,-4.4e-05,-3.4e-05,-2.3e-05,2e-06,-2.6e-05,4e-06,3e-06,-6e-06,3e-06,0,0,-3.1e-05,-3.2e-05,1.8e-05,6.8e-05,1.5e-05,2.9e-05,0,-1.7e-05,-2.3e-05,1.5e-05,1e-06,0,-6e-06,3e-06,-6e-06,-6e-06,-1.1e-05,0,-2e-06,0,1e-06,-2e-06,2e-06,0,-5e-06,3.4e-05,-6e-06,2.3e-05,7e-06,2e-05,-5e-06,-0.000114,1.3e-05,-6e-06,6e-06,4e-06,7e-06,1e-06,-1.1e-05,1e-05,-2e-06,3e-06,0,1e-06,-5.7e-05,-3e-06,1.6e-05,8e-06,0.000228,-5.1e-05,1.5e-05,-1.4e-05,5e-06,-2.4e-05,-1e-06,0,3e-06,1.3e-05,2.4e-05,-1.9e-05,-0.00012,1e-04,-9e-06,1.8e-05,1.8e-05,5e-06,0,-1e-06,1.3e-05,2e-06,-4e-06,1.1e-05,-1.2e-05,-1e-06,0,6e-06,9e-06,-2e-06,8.9e-05,-0.000123,2.2e-05,-2.2e-05,4.5e-05,-9.3e-05,4.9e-05
6.2e-05,-5e-06,-8e-06,0.000177,6e-06,0.00013,7e-06,1e-06,-3e-06,2e-06,0,3e-06,-3e-06,-1e-06,-6e-06,0,2e-06,-1e-06,5e-06,-1e-06,-1.2e-05,3e-06,6e-06,1.1e-05,-0.000114,-0.00016,3.4e-05,-2.6e-05,-6e-06,-1.8e-05,-5e-06,-1e-06,0,-3e-06,0,-2e-06,3.2e-05,6.6e-05,-2.9e-05,4.4e-05,-9e-06,-2e-05,-9e-06,2e-06,-1.1e-05,-1.3e-05,-5e-06,-3e-06,7e-06,-1e-06,0,-3e-06,2e-06,-1e-06,3e-06,-2e-06,0,0,3e-06,-1e-06,-4e-06,-3e-05,8e-06,-2.8e-05,-7e-06,8e-06,-3e-06,-5e-05,1.2e-05,3e-06,0,-1.3e-05,8e-06,9e-06,5e-06,2e-06,-7e-06,1e-06,-6e-06,-2e-06,-6e-06,-1.8e-05,0.00015,3.2e-05,-0.000207,-2.1e-05,0,-9e-06,-8e-06,-1e-06,3e-06,0,5e-06,-1.2e-05,-1.4e-05,-1e-06,-0.000108,-0.000171,-1.4e-05,0,6e-06,-7e-06,2e-06,5e-06,1.1e-05,-4e-06,-5e-06,1.1e-05,-2e-06,5e-06,1e-06,3e-06,-3e-06,-1e-06,-2e-05,0.000248,-0.000117,1.9e-05,2.6e-05,9.5e-05,9e-05
-8e-05,4.3e-05,3.1e-05,-0.000133,2.6e-05,-8.2e-05,6e-06,7e-06,-3e-06,-1e-06,1e-06,1e-06,0,4e-06,5e-06,-2e-06,-6e-06,1e-06,-7e-06,0,7e-06,5.8e-05,-4e-06,-4e-05,8.1e-05,0.00011,-2e-05,-2.8e-05,9e-06,-3.4e-05,8e-06,3e-06,0,7e-06,0,2e-06,3e-06,-7.9e-05,-2e-06,1.1e-05,-2.7e-05,1.8e-05,9e-06,1.8e-05,1.1e-05,2.3e-05,2e-06,-6e-06,-5e-06,0,1e-05,-2e-06,1.2e-05,5e-06,-2e-06,-1e-06,0,-1e-06,2e-06,-1e-06,-3e-06,1.7e-05,-6e-06,7e-06,-4.3e-05,9e-06,1.4e-05,3.5e-05,-7e-06,-1e-05,-2e-06,4e-06,-1.6e-05,-1.2e-05,-2.3e-05,-9e-06,0,0,-2e-06,1e-06,5.4e-05,1e-06,-0.000272,-0.000106,0.000152,-2.6e-05,-7e-06,2.4e-05,0,1e-06,1e-06,-1e-06,-4e-06,-7e-06,4.1e-05,-1.6e-05,4.8e-05,3.7e-05,2.1e-05,-1.9e-05,4e-06,-1e-06,2e-06,-1e-06,8e-06,-2e-06,-2e-06,-1.7e-05,-9e-06,0,0,1.3e-05,-1e-06,1e-06,-5e-06,-0.000415,0.000125,3.6e-05,7.2e-05,-6.9e-05,-6.6e-05
5.1e-05,-2.2e-05,3e-06,0.000169,-7e-06,1.8e-05,6e-06,1.2e-05,-7e-06,-1e-06,-6e-06,0,1e-06,-6e-06,-1.6e-05,1e-06,3e-06,1e-06,-2e-06,-1e-06,-4e-06,-1.3e-05,-2e-06,1.8e-05,7.3e-05,-3e-05,1e-06,-3e-06,3e-06,-2.7e-05,-4e-06,3e-06,-1e-06,-2e-06,0,1e-06,-2.5e-05,8.1e-05,-5e-06,-6.1e-05,-4e-06,-1.2e-05,4e-06,-4e-06,-1.4e-05,-7e-06,3e-06,1e-06,1e-06,-6e-06,-1e-05,-5e-06,-1.6e-05,-2e-06,5e-06,-1e-06,-1e-06,-1e-06,0,2e-06,-2e-06,-2e-05,7e-06,1e-05,7e-06,-2.2e-05,2e-06,2.1e-05,8e-06,-8e-06,2e-06,3e-06,1e-06,1e-06,1.3e-05,-1.3e-05,1e-06,4e-06,1e-06,1e-06,-8.7e-05,1.4e-05,0.000167,0.000153,-8.5e-05,-2.2e-05,8e-06,-8e-06,4e-06,9e-06,-4e-06,3e-06,-1e-05,1.7e-05,-6e-06,-7e-06,7.4e-05,7.1e-05,-9e-06,-2.3e-05,1.8e-05,-4e-06,-1e-06,0,6e-06,2e-06,-8e-06,1.2e-05,-3e-06,-2e-06,1e-06,3e-06,3e-06,1e-06,-4.2e-05,0.000298,-6.5e-05,-4.5e-05,-7.5e-05,6.4e-05,2.6e-05
-4.7e-05,-2.2e-05,-1.7e-05,-0.000136,-2.6e-05,-2.2e-05,-1.7e-05,1.5e-05,-2e-06,5e-06,-1.3e-05,-5e-06,-1e-06,6e-06,1e-06,-1e-06,0,-1e-06,-5e-06,0,1e-06,-3e-06,1e-06,-2.6e-05,-6.6e-05,8e-06,-1.7e-05,-2.6e-05,1e-06,-2.1e-05,1.9e-05,0,5e-06,-2e-06,0,-2e-06,1.5e-05,-2.5e-05,-5e-06,-2e-06,0,0,-5e-06,3e-06,1e-06,-1.1e-05,-2e-06,3e-06,3e-06,5e-06,5e-06,-1e-06,1.8e-05,3e-06,-4e-06,0,-1e-06,2e-06,-1e-06,-1e-06,-1e-06,3e-05,-1.6e-05,-1.3e-05,-1.7e-05,-3e-06,5e-06,-3e-06,-1.4e-05,1.6e-05,3e-06,1e-05,-1e-06,7e-06,-7e-06,8e-06,-4e-06,-4e-06,-2e-06,-1e-06,9.7e-05,-7e-06,-9e-06,-5.2e-05,3.7e-05,-1.6e-05,-1.4e-05,-1.3e-05,-4e-06,-1e-06,2e-06,-1e-06,-3e-06,-2.8e-05,0,0,4.1e-05,-2.3e-05,-4e-06,6e-06,-1e-06,8e-06,2e-06,3e-06,4e-06,0,-8e-06,1e-06,-3e-06,-1e-06,0,4e-06,-7e-06,-1e-06,-4.5e-05,-0.000151,-3e-05,4.9e-05,1.9e-05,-7.2e-05,5.5e-05
-1.7e-05,3.3e-05,-1e-05,-1e-06,1.7e-05,-6.4e-05,2.3e-05,1e-05,-5e-06,-4e-06,-1e-05,1e-06,-4e-06,-5e-06,-1e-05,3e-06,0,0,-4e-06,0,4e-06,-4.7e-05,-2e-06,1.3e-05,-3.7e-05,-3e-06,4.7e-05,-2.1e-05,-3e-06,-3.2e-05,-6e-06,6e-06,-2e-06,2e-06,0,-1e-06,5e-06,-1.8e-05,1.2e-05,1.4e-05,3e-05,4e-06,1e-06,-1e-06,0,7e-06,-3e-06,1e-06,-5e-06,-7e-06,-1e-06,-3e-06,-1.1e-05,0,2e-06,1e-06,2e-06,-2e-06,-1e-06,-2e-06,-1e-06,-4.1e-05,1e-05,5e-06,-2.6e-05,2.3e-05,-1.6e-05,9.8e-05,-1.8e-05,2e-06,-1e-06,-1e-05,2e-06,-2e-06,-3e-06,5e-06,-2e-06,5e-06,-2e-06,1e-06,-9.7e-05,-2e-06,-5.1e-05,-7e-06,-1.2e-05,3.7e-05,2.1e-05,9e-06,1e-06,0,2e-06,0,2e-06,4.6e-05,-4e-06,-1.8e-05,-4.2e-05,-2.1e-05,1.4e-05,-2e-06,-6e-06,-8e-06,-2e-06,-3e-06,0,3e-06,-3e-06,-9e-06,-7e-06,0,-1e-06,-3e-06,8e-06,-1e-06,4.8e-05,0.000257,9.6e-05,7.1e-05,-4.7e-05,6.3e-05,-3e-05
0,-2.9e-05,7e-06,4.4e-05,-1.2e-05,2.6e-05,-1.8e-05,1e-05,-4e-06,4e-06,0,2e-06,0,4e-06,5e-06,-2e-06,2e-06,0,-5e-06,0,-7e-06,-4e-06,1e-06,-1.2e-05,5.4e-05,5e-06,-6e-06,2e-06,-5e-06,-2.3e-05,-1.3e-05,-3e-06,-6e-06,-4e-06,0,0,-9e-06,-3e-06,8e-06,1.4e-05,-4e-06,-1.2e-05,1e-06,-1.4e-05,-2e-06,-1.2e-05,4e-06,1e-06,3e-06,7e-06,-2e-06,-3e-06,0,0,-4e-06,-3e-06,-1e-06,2e-06,-1e-06,3e-06,0,1.8e-05,1e-06,1.1e-05,8e-06,-1.1e-05,-2e-06,-4.7e-05,-7e-06,-6e-06,2e-06,0,8e-06,0,0,6e-06,-1e-06,-2e-06,-1e-06,0,8.7e-05,0,6.7e-05,-7e-06,3.4e-05,4.1e-05,-2.3e-05,-2e-06,-6e-06,0,-2e-06,0,7e-06,-4.7e-05,-2e-06,3e-06,-8e-06,-3.4e-05,-1.8e-05,-3e-06,-2e-06,-1e-06,-1e-06,2e-06,-1e-06,5e-06,-1.2e-05,5e-06,-8e-06,1e-06,0,-5e-06,-1e-06,0,-1.9e-05,-0.000403,-4.3e-05,-0.000154,6.8e-05,-8.3e-05,-1.1e-05
6.7e-05,1.1e-05,1.7e-05,-7e-06,-1e-06,-7e-05,-1.1e-05,0,-3e-06,-4e-06,0,0,2e-06,-4e-06,4e-06,-1e-06,-1e-06,-1e-06,-4e-06,0,5e-06,-5e-06,1e-06,1.3e-05,-7.6e-05,2.8e-05,-6e-05,-3.9e-05,1e-06,-2.3e-05,8e-06,2e-06,5e-06,4e-06,0,0,-5e-06,1.2e-05,-1e-05,1.1e-05,0,9e-06,-2e-06,7e-06,1.2e-05,2.5e-05,1e-06,-2e-06,0,-9e-06,4e-06,-3e-06,9e-06,2e-06,3e-06,0,0,-3e-06,-1e-06,-4e-06,1e-06,-8e-06,-1.7e-05,-2.2e-05,-1.6e-05,4e-06,-1.3e-05,-1e-06,-1e-06,0,1e-06,-2e-06,-9e-06,-2e-06,-1.3e-05,0,-3e-06,3e-06,2e-06,-1e-06,-5.3e-05,9e-06,0,5.7e-05,-9.7e-05,-2.5e-05,1.6e-05,-1e-06,2e-06,0,0,-1e-06,7e-06,2.4e-05,-1.1e-05,-9e-06,-8e-06,6.8e-05,0,2e-06,-4.1e-05,1e-06,0,-3e-06,-3e-06,-2e-06,2e-06,7e-06,0,-2e-06,-1e-06,-7e-06,-5e-06,0,-8e-06,0.000285,-9e-06,0.000121,-2.4e-05,4.3e-05,-2e-06
-7e-06,8e-06,-6e-06,-2.4e-05,8e-06,1.4e-05,8e-06,-9e-06,-4e-06,3e-06,-4e-06,0,-3e-06,4e-06,5e-06,1e-06,-1e-06,0,1e-06,0,-3e-06,3.5e-05,0,-3.1e-05,1.8e-05,-4.5e-05,4e-05,1.8e-05,0,-2.3e-05,3e-06,-2e-06,4e-06,-3e-06,0,0,9e-06,3e-06,-2e-06,1.6e-05,-1.7e-05,-1e-05,-2e-06,9e-06,-2.5e-05,-1.2e-05,-3e-06,0,-1e-06,6e-06,-2e-06,-2e-06,-9e-06,1e-06,-4e-06,1e-06,0,1e-06,0,4e-06,1e-06,1.9e-05,1.6e-05,2.2e-05,-1.5e-05,-9e-06,1e-05,-3.2e-05,1.3e-05,-3e-06,-1e-06,3e-06,4e-06,-2e-06,7e-06,-5e-06,-3e-06,-1e-06,-3e-06,1e-06,1.1e-05,2e-06,-0.000132,-1.9e-05,0.000151,3e-05,-1.6e-05,6e-06,1e-06,1e-06,1e-06,0,-3e-06,-1e-05,1.9e-05,-9e-06,2.4e-05,-4e-05,1.9e-05,-1.4e-05,2e-06,0,0,-1e-06,-4e-06,-3e-06,-1e-06,-1.7e-05,-8e-06,0,0,-4e-06,4e-06,0,-1.7e-05,-0.000136,1.9e-05,-7.3e-05,2.4e-05,-5.3e-05,-1.4e-05
-2.9e-05,-1.2e-05,-9e-06,1.3e-05,-7e-06,-7e-06,1.6e-05,-8e-06,-3e-06,-2e-06,-9e-06,0,-1e-06,-5e-06,8e-06,0,2e-06,0,-1e-06,0,2e-06,1.3e-05,-1e-06,2.4e-05,9.2e-05,-1.4e-05,4.9e-05,-3.7e-05,4e-06,-1.9e-05,7e-06,-1e-06,-5e-06,0,0,0,6e-06,1e-06,-7e-06,-4.1e-05,4e-06,6e-06,-2e-06,-1e-05,-2e-06,-7e-06,0,3e-06,2e-06,-5e-06,-2e-06,-4e-06,5e-06,0,4e-06,-1e-06,0,-1e-06,1e-06,-1e-06,2e-06,-3.7e-05,-8e-06,-1.3e-05,4e-06,2e-06,3e-06,-4.5e-05,1e-06,3e-06,1e-06,-3e-06,-5e-06,7e-06,-3e-06,-8e-06,-1e-06,1e-06,1e-06,-1e-06,1.8e-05,-6e-06,0.000156,-7.6e-05,-0.000161,-3.5e-05,1.3e-05,-1.2e-05,-4e-06,-9e-06,0,0,-1e-05,-6e-06,-2.4e-05,2e-06,-3.5e-05,6e-06,-1.3e-05,-8e-06,-1.6e-05,0,-2e-06,0,-6e-06,1e-06,-3e-06,1.4e-05,-1e-06,2e-06,0,-2e-06,-3e-06,0,5e-06,0.000265,-2.8e-05,-2e-05,-4.6e-05,7.4e-05,1.7e-05
-3e-06,2e-06,-2e-06,0,-4e-06,-5.8e-05,-8e-06,3e-06,-4e-06,-1e-06,-8e-06,0,2e-06,6e-06,-7e-06,0,-2e-06,0,3e-06,0,1e-06,1.8e-05,1e-06,-2.5e-05,-5.7e-05,-5e-06,-6.4e-05,-1.4e-05,0,-2.8e-05,2e-06,4e-06,0,0,0,0,-1.2e-05,1e-05,7e-06,-3e-05,-2e-06,0,3e-06,-5e-06,1.1e-05,1e-05,2e-06,0,-1e-06,3e-06,3e-06,-3e-06,4e-06,1e-06,-3e-06,-1e-06,0,1e-06,0,-2e-06,2e-06,2.6e-05,-8e-06,-6e-06,-1.6e-05,1.3e-05,-6e-06,2.7e-05,-2e-06,-4e-06,2e-06,8e-06,0,-3e-06,-6e-06,1e-06,-3e-06,1e-06,0,0,-5.1e-05,-2e-06,-7e-05,9.1e-05,0.000118,-1.6e-05,-4e-06,1e-06,-3e-06,2e-06,-2e-06,0,-4e-06,1.9e-05,0,-8e-06,-3.4e-05,5.4e-05,-3e-06,5e-06,1.8e-05,-6e-06,2e-06,0,-6e-06,1e-06,-9e-06,-1e-06,-8e-06,1e-06,0,3e-06,1e-06,0,3.6e-05,-0.00039,0,6.9e-05,1.4e-05,-7.3e-05,-2.3e-05
-2e-05,5e-06,5e-06,5e-06,4e-06,5.7e-05,-9e-06,-4e-06,-4e-06,4e-06,-3e-06,-1e-06,0,-7e-06,3e-06,-1e-06,2e-06,0,2e-06,0,-2e-06,-2.8e-05,-1e-06,1.6e-05,-8e-06,-9e-06,-3e-06,-3e-06,-1e-06,-2e-05,0,-1e-06,2e-06,-2e-06,0,0,-4e-06,5e-06,7e-06,6e-06,2e-06,-2e-06,2e-06,7e-06,-1.2e-05,-1.1e-05,0,-2e-06,0,-2e-06,5e-06,0,-1.2e-05,-1e-06,3e-06,0,-1e-06,0,0,4e-06,2e-06,-1.9e-05,1.4e-05,2.9e-05,-1.6e-05,-1.2e-05,-3e-06,-1.2e-05,1e-06,-3e-06,1e-06,-3e-06,6e-06,-4e-06,4e-06,4e-06,-2e-06,-2e-06,2e-06,1e-06,7.6e-05,1e-06,-1.8e-05,-4.6e-05,-6.3e-05,2.9e-05,-3e-06,3e-06,0,-1e-06,0,0,4e-06,-2.6e-05,5e-06,-5e-06,1e-05,-3.6e-05,7e-06,-5e-06,-6e-06,3e-06,0,1e-06,-7e-06,0,-5e-06,-1.4e-05,-4e-06,-1e-06,-1e-06,3e-06,3e-06,0,-4e-06,0.000268,1.1e-05,-8.7e-05,-1.3e-05,6.8e-05,-1.3e-05
