0.257106,0.230437,0.195637,0.192603,0.188927,0.198153,0.204628,0.198348,0.187443,0.199,0.207334,0.207031,0.220211,0.208435,0.187112,0.187048,0.204494,0.205925,0.207678,0.198531,0.174744,0.185333,0.199974,0.19545,0.181186,0.174489,0.177469,0.161632
0.328254,0.294723,0.259166,0.258296,0.25169,0.260378,0.266939,0.262137,0.245042,0.259023,0.277332,0.278402,0.292789,0.27664,0.246976,0.243453,0.267614,0.268229,0.270563,0.266692,0.234748,0.241187,0.262134,0.256219,0.235683,0.230866,0.236113,0.213638
0.464415,0.41876,0.382665,0.38878,0.378382,0.385563,0.393165,0.392261,0.360671,0.371487,0.409812,0.418675,0.430578,0.403631,0.3604,0.348643,0.38234,0.384263,0.389686,0.399111,0.351484,0.344097,0.377541,0.377099,0.348632,0.34151,0.345711,0.314169
0.598905,0.545485,0.511006,0.528891,0.514103,0.51761,0.529375,0.539133,0.493303,0.480734,0.53507,0.557989,0.558238,0.518517,0.464852,0.443768,0.479951,0.487204,0.499438,0.527025,0.468933,0.439592,0.484586,0.502645,0.475416,0.454239,0.442032,0.406078
0.68058,0.645477,0.631185,0.651404,0.619656,0.610022,0.62893,0.658427,0.607974,0.55646,0.606997,0.636115,0.623779,0.584168,0.528756,0.499092,0.530486,0.553366,0.568241,0.598895,0.543281,0.501381,0.552105,0.591119,0.574689,0.527166,0.481723,0.448823
0.716072,0.726655,0.745829,0.744164,0.67621,0.642969,0.672681,0.728123,0.693168,0.620186,0.649584,0.653827,0.641109,0.638576,0.5894,0.5361,0.552306,0.600333,0.610106,0.618504,0.571117,0.537858,0.590549,0.646113,0.644679,0.566787,0.494159,0.465147
0.896575,0.910128,0.898431,0.862242,0.761201,0.691726,0.729236,0.798679,0.825456,0.791118,0.801298,0.763486,0.752842,0.788676,0.727752,0.652858,0.64768,0.697782,0.702896,0.681646,0.633849,0.628828,0.677079,0.774403,0.834689,0.716106,0.621104,0.588148
1.525427,1.492206,1.347383,1.283387,1.14439,0.985808,1.044302,1.114998,1.192038,1.243295,1.31081,1.251181,1.220962,1.263368,1.117438,1.02952,0.996371,0.995617,0.98936,0.931477,0.872607,0.931041,1.00718,1.229353,1.43037,1.199327,1.038408,0.996671
2.739333,2.668875,2.34983,2.248875,2.010833,1.703619,1.798852,1.89283,2.025909,2.180105,2.394038,2.316102,2.196527,2.202064,1.906619,1.794729,1.757919,1.725194,1.668977,1.535949,1.460604,1.606648,1.758148,2.210993,2.633407,2.176071,1.871659,1.789765
4.443401,4.349552,3.799442,3.686902,3.340844,2.825296,2.898148,2.966589,3.206935,3.575313,4.047444,3.937221,3.612796,3.527573,3.046585,2.89991,2.912063,2.892331,2.706842,2.442658,2.379343,2.626677,2.877491,3.69263,4.435691,3.635929,3.111508,2.941511
6.101087,6.019092,5.240227,5.191999,4.784228,4.053824,4.003088,3.929082,4.322457,5.044243,5.86788,5.740248,5.099108,4.841503,4.194212,4.021665,4.141746,4.200461,3.82895,3.395595,3.365884,3.697352,4.072813,5.326498,6.409126,5.217559,4.453927,4.186711
6.759261,6.741532,5.906101,6.000495,5.618824,4.807852,4.545046,4.215583,4.74018,5.803395,6.911244,6.812007,5.887525,5.425431,4.727655,4.550043,4.789973,5.006475,4.534336,3.965441,3.913698,4.246546,4.749146,6.300505,7.523436,6.082274,5.192268,4.89408
5.762575,5.794919,5.166397,5.414042,5.158397,4.495688,4.074223,3.573884,4.0878,5.175096,6.265814,6.216024,5.270482,4.77851,4.230642,4.032007,4.282842,4.638775,4.265154,3.687955,3.55052,3.783676,4.319752,5.770593,6.766433,5.440339,4.667338,4.479465
3.632261,3.664041,3.366775,3.652741,3.563148,3.205835,2.807757,2.339603,2.687707,3.46533,4.219329,4.157234,3.483856,3.237409,3.039913,2.864142,2.939107,3.20155,3.018336,2.596086,2.411723,2.536183,2.944553,3.871939,4.415072,3.565872,3.109254,3.122031
1.932123,1.913237,1.79189,1.927349,1.952513,1.851204,1.631285,1.40132,1.532584,1.818985,2.12052,2.052,1.771727,1.741392,1.759242,1.749965,1.693543,1.727742,1.694591,1.520131,1.435292,1.504744,1.649887,1.930939,2.071166,1.742125,1.639298,1.742179
1.53425,1.386022,1.310646,1.465351,1.539166,1.463538,1.340139,1.276478,1.282646,1.246347,1.290391,1.281071,1.203035,1.11958,1.161654,1.324853,1.278254,1.245134,1.23934,1.198495,1.15763,1.077803,1.057251,1.109885,1.179937,1.118318,1.104963,1.118971
1.754372,1.456943,1.485236,1.833174,1.918629,1.753153,1.623977,1.590146,1.555082,1.417143,1.440701,1.501648,1.460542,1.287357,1.271945,1.539001,1.578258,1.597173,1.491846,1.303756,1.235929,1.089507,1.024893,1.1131,1.182359,1.117365,1.106155,1.130082
2.090559,1.619582,1.784021,2.288759,2.317407,2.06184,1.921879,1.927937,1.915964,1.741846,1.799726,1.923872,1.841802,1.591849,1.533482,1.87913,2.035639,2.080627,1.797925,1.466981,1.458758,1.307976,1.160107,1.227703,1.287661,1.216885,1.23858,1.299148
2.480484,1.885961,2.203756,2.696966,2.603948,2.37274,2.165131,2.115234,2.147537,2.030244,2.198465,2.349498,2.146666,1.853673,1.822265,2.152565,2.289348,2.290185,1.867306,1.531939,1.758391,1.647996,1.322819,1.279021,1.322729,1.261376,1.314273,1.446739
2.929843,2.340579,2.754084,3.077447,2.925885,2.818216,2.444158,2.204378,2.280794,2.315289,2.526016,2.588012,2.336026,2.083146,2.120166,2.30296,2.188342,2.087628,1.70476,1.530512,1.982005,1.882361,1.422586,1.261867,1.279836,1.244318,1.2991,1.567768
3.498194,2.944147,3.239173,3.243637,3.056501,3.151152,2.73388,2.312774,2.389533,2.545715,2.624933,2.555252,2.289914,2.046498,2.164822,2.186804,1.78756,1.586965,1.404648,1.45069,1.930689,1.81785,1.408418,1.255867,1.211306,1.124744,1.168391,1.556082
3.765353,3.383966,3.655567,3.356959,3.051723,3.222266,2.817473,2.376247,2.529232,2.664508,2.481569,2.274659,1.917242,1.649748,1.777669,1.686701,1.27902,1.096864,1.071463,1.216543,1.522097,1.463051,1.258814,1.155249,1.063167,0.988334,1.05634,1.346973
3.438601,3.471691,3.728979,3.162515,2.983806,3.260134,2.773741,2.284715,2.571336,2.651822,2.19813,1.849121,1.437128,1.216959,1.264766,1.122473,0.911328,0.891604,0.94494,1.041455,1.106375,1.083212,1.059063,0.980026,0.88917,0.857184,0.934898,1.01223
2.411774,2.881578,3.137402,2.461289,2.457008,2.77695,2.340311,1.986836,2.381395,2.440512,2.035158,1.764385,1.384379,1.219091,1.202071,1.067243,1.007551,1.068012,1.12818,1.181227,1.104676,1.033995,1.04079,1.020828,0.958916,0.858149,0.780006,0.709165
1.553565,2.046223,2.370429,1.801509,1.613491,1.859958,1.694757,1.627118,1.921233,1.830985,1.658336,1.756348,1.606826,1.490428,1.496215,1.533194,1.651989,1.597324,1.571445,1.657854,1.537089,1.441643,1.405996,1.461,1.383818,1.060689,0.823856,0.726542
1.289921,1.54616,1.817765,1.45829,1.089091,1.204588,1.313618,1.525641,1.613,1.350567,1.272139,1.594149,1.877428,1.987692,2.046777,2.338822,2.675901,2.458531,2.317313,2.452415,2.288888,2.147358,2.002348,2.04643,1.93561,1.458451,1.178333,1.039778
1.243648,1.48233,1.669057,1.383658,1.164921,1.162465,1.292707,1.704966,1.701122,1.272752,1.087128,1.512543,2.10745,2.402458,2.586805,3.201047,3.829267,3.520324,3.193353,3.373659,3.150647,2.802176,2.486744,2.41962,2.331021,1.921827,1.65958,1.39457
1.29827,1.604498,1.737531,1.419873,1.266876,1.13714,1.332326,1.789513,1.632392,1.152217,1.027436,1.582356,2.128997,2.372669,2.684978,3.585315,4.500867,4.224168,3.673191,3.888544,3.681109,3.004899,2.481038,2.235847,2.21694,2.097456,1.983477,1.582963
1.471433,1.655614,1.698889,1.431479,1.240159,1.037679,1.33548,1.622553,1.392808,1.122055,1.083044,1.571181,1.791076,1.828947,2.171185,3.110696,4.110738,3.990971,3.33051,3.529651,3.463123,2.57057,1.906804,1.540694,1.592548,1.786753,1.899771,1.475819
1.45191,1.401262,1.350029,1.253753,1.077329,0.882217,1.202295,1.323473,1.2063,1.197892,1.169007,1.383704,1.304561,1.213126,1.450978,2.062214,2.800765,2.849435,2.366501,2.473485,2.604815,1.886139,1.236441,0.862606,0.941881,1.211035,1.420195,1.162843
1.226033,1.040752,1.009217,1.180104,1.013523,0.847877,1.067646,1.06246,1.036605,1.116797,1.066616,1.02,0.886854,0.831227,0.908433,1.139789,1.46822,1.593952,1.41628,1.397571,1.515212,1.276095,0.850976,0.516573,0.571596,0.734402,0.897616,0.861136
0.878699,0.810932,0.94821,1.193786,0.929572,0.866134,1.037632,0.946325,0.867964,0.890915,0.845492,0.694811,0.644945,0.66396,0.749191,0.764648,0.806726,0.990887,0.871585,0.728166,0.7549,0.769328,0.587617,0.355842,0.407518,0.476381,0.525952,0.631769
0.615621,0.657456,0.936036,1.097986,0.768063,0.867921,1.088186,0.920105,0.717055,0.692701,0.715951,0.656157,0.606659,0.57641,0.652314,0.594349,0.556569,0.828383,0.736873,0.546779,0.591575,0.530612,0.397219,0.268666,0.312471,0.369589,0.373883,0.485945
0.593484,0.656581,0.924925,0.962857,0.681812,0.815299,0.979194,0.793598,0.541578,0.529485,0.665323,0.725514,0.562776,0.407232,0.47498,0.494993,0.491729,0.732444,0.60752,0.45597,0.562771,0.455607,0.302519,0.223803,0.259477,0.35768,0.324467,0.337608
0.605109,0.706036,0.878929,0.786972,0.666101,0.717737,0.717775,0.644864,0.447581,0.38176,0.566653,0.716619,0.48379,0.271144,0.329636,0.424605,0.487776,0.59368,0.454331,0.368741,0.482304,0.393981,0.276115,0.241115,0.251218,0.340423,0.276032,0.207819
0.574495,0.663169,0.753618,0.592937,0.642272,0.633449,0.524674,0.531904,0.441325,0.287857,0.437303,0.616135,0.428052,0.256367,0.256615,0.36044,0.45629,0.448859,0.370395,0.298984,0.338936,0.291879,0.248495,0.267253,0.228001,0.272895,0.231003,0.15484
0.455222,0.527952,0.657773,0.515686,0.644801,0.617383,0.474174,0.497069,0.443495,0.271931,0.381266,0.510928,0.352034,0.238324,0.174207,0.269052,0.381096,0.344039,0.305514,0.242166,0.228835,0.208841,0.220375,0.265003,0.191483,0.18419,0.187916,0.152156
0.330142,0.475735,0.638193,0.517756,0.649379,0.612573,0.479551,0.482119,0.444178,0.315183,0.372282,0.441773,0.304739,0.222163,0.12617,0.213446,0.313617,0.275342,0.251425,0.236695,0.214667,0.157005,0.176019,0.236762,0.172072,0.135954,0.165435,0.171715
0.329688,0.52286,0.621198,0.525199,0.595021,0.510624,0.423381,0.457073,0.446213,0.336764,0.36112,0.391346,0.267937,0.202121,0.108119,0.170243,0.237293,0.185731,0.176719,0.207753,0.197847,0.134079,0.160745,0.205817,0.151021,0.124214,0.156468,0.168394
0.356714,0.534438,0.533993,0.46299,0.463404,0.347055,0.331114,0.460605,0.470831,0.358839,0.331546,0.361589,0.261329,0.179943,0.119845,0.131289,0.170123,0.138834,0.111374,0.146841,0.162122,0.130388,0.174258,0.218816,0.162299,0.123653,0.125065,0.133565
