-0.079317,-0.136915,-0.164352,-0.164746,-0.151733,-0.15115,-0.150817,-0.139788,-0.081723,-0.02622,-0.008226,-0.004304,-0.001987,-0.001898,-0.00117,-0.000637,-0.000358,-5e-04,-0.000263,-0.000132,-0.002017,-0.018857,-0.028991,-0.02401,-0.040375,-0.020052,-0.006105,-0.016897
0.099055,0.144044,0.146648,0.141264,0.148807,0.155849,0.143298,0.130368,0.095048,0.030464,0.008463,0.004444,0.002133,0.002071,0.001349,0.000857,0.000407,0.000494,0.000267,7.8e-05,0.000225,-0.009596,-0.020524,-0.022032,-0.017445,-0.004636,-0.005151,-0.014725
-0.025986,-0.040105,-0.002006,-0.012639,-0.017639,0.007651,0.004357,-0.008778,-0.009745,-0.003198,-0.001627,-0.00047,-0.000361,-0.000508,-0.000572,-0.000463,-0.000163,-1.1e-05,-4.7e-05,-7.4e-05,0.000406,0.009063,0.011781,0.006498,0.017444,0.009434,0.001621,0.004931
-0.064079,-0.0969,-0.135366,-0.121001,-0.12167,-0.14798,-0.144267,-0.137985,-0.089955,-0.028351,-0.008394,-0.004568,-0.002139,-0.002038,-0.001222,-0.000692,-0.000354,-0.000519,-0.000318,-0.00015,0.000354,0.011744,0.022673,0.02117,0.011917,0.000185,0.005294,0.016071
0.081708,0.125648,0.098818,0.127747,0.127357,0.110989,0.113146,0.117984,0.078918,0.024326,0.007864,0.004243,0.002106,0.002062,0.001486,0.000923,0.000393,0.000406,0.000231,6e-05,0.000489,-0.000692,0.002945,0.006682,-0.002386,-0.004253,0.00183,0.006037
-0.004127,-0.005676,0.062957,0.040926,0.030663,0.066557,0.070289,0.067695,0.031685,0.008713,0.002894,0.001975,0.000755,0.00065,0.000233,-6e-05,2.3e-05,0.000245,0.000153,-4.1e-05,-0.00175,-0.015706,-0.022702,-0.014752,-0.009229,-0.001849,-0.003402,-0.010249
-0.070432,-0.095401,-0.104475,-0.134999,-0.126646,-0.147136,-0.1471,-0.13859,-0.089963,-0.026371,-0.007786,-0.005063,-0.002364,-0.001944,-0.001034,-0.000505,-0.000266,-5e-04,-0.000254,-0.000108,-0.001201,-0.005907,-0.011949,-0.013862,-0.008055,-0.000734,-0.002917,-0.009269
0.035602,0.053784,-0.000184,0.029815,0.039145,0.028921,0.030001,0.030067,0.03354,0.009539,0.002493,0.001177,0.000865,0.000827,0.000748,0.000682,0.000271,0.000151,0.000101,0.000103,0.001173,0.012119,0.013917,0.003843,0.003796,0.002824,0.000468,0.001179
0.016746,0.012927,0.064459,0.076325,0.058313,0.103135,0.097707,0.077875,0.046232,0.01263,0.003456,0.002918,0.001185,0.000761,-2e-06,-0.000188,-7e-06,0.000305,0.000147,2.6e-05,8.1e-05,0.007503,0.013674,0.011982,0.007595,0.001428,0.001295,0.004912
-0.031236,-0.030152,-0.022224,-0.041451,-0.043982,-0.088514,-0.097477,-0.090139,-0.064942,-0.014798,-0.003968,-0.003207,-0.001656,-0.001392,-0.00093,-0.000571,-0.00025,-0.000391,-0.00023,-8.7e-05,-0.00049,-0.005783,-0.004009,0.003305,-0.002111,-0.004835,0.001899,0.006457
0.011628,0.019886,-0.040433,-0.016084,0.001885,-0.029637,-0.015993,0.006609,0.010315,0.001237,0.000119,-0.00016,0.000102,0.000199,0.000497,0.000454,0.000131,-3.8e-05,-2.3e-05,1.9e-05,5.9e-05,-0.007523,-0.011438,-0.007399,-0.004321,-0.00098,-0.000285,-0.001114
0.012511,-0.008857,0.01956,0.0268,0.028538,0.099268,0.106793,0.091656,0.05482,0.01061,0.002577,0.003186,0.001436,0.001092,0.000392,-2.4e-05,4.9e-05,0.000395,0.000204,4.3e-05,-0.000267,0.001956,-6.3e-05,-0.007044,-0.001185,0.004848,-0.000855,-0.004348
-0.015242,-0.010954,0.018832,-0.016935,-0.019836,-0.041998,-0.057731,-0.065368,-0.044691,-0.00761,-0.001642,-0.002239,-0.001143,-0.000605,-0.000385,-0.000292,-0.000122,-0.000208,-9.8e-05,-1.6e-05,0.00033,0.006913,0.008375,0.000149,-0.006166,-0.001803,-0.001293,-0.004075
-0.009349,0.005335,-0.032787,-0.024943,-0.021808,-0.073084,-0.064873,-0.041801,-0.017569,-0.003859,-0.001509,-0.001896,-0.000565,-0.000425,0.000171,0.000426,7.9e-05,-0.000212,-8.4e-05,1.7e-05,0.000605,0.001513,0.002617,0.004029,-0.004345,-0.005233,-0.000117,0.000453
0.01756,0.000966,0.003933,0.031949,0.019372,0.083086,0.090594,0.072888,0.04628,0.007796,0.001814,0.003103,0.001448,0.000734,0.000134,1.5e-05,8.4e-05,0.000344,0.000178,1.2e-05,-0.00012,-0.005456,-0.005851,0.002656,0.008021,0.00253,0.00123,0.004112
0.013671,0.017611,0.037204,0.024893,0.023633,0.017122,-0.008213,-0.025906,-0.022093,0.000345,0.001552,-5e-06,-0.00044,-4.9e-05,-0.000279,-0.000281,-7.2e-05,-5.8e-05,-4.4e-05,-2.7e-05,0.000106,-0.001007,-0.001528,0.000254,0.007639,0.003353,0.001797,0.00525
-0.024793,-0.003069,-0.026325,-0.047292,-0.029631,-0.090213,-0.077292,-0.042355,-0.024785,-0.004974,-0.001467,-0.002367,-0.001092,-0.000838,-7.3e-05,0.000197,9e-06,-0.000281,-0.000149,4e-06,0.000583,0.003177,0.00254,-0.001107,-0.004331,-0.002658,-0.001164,-0.003463
-0.002046,-0.007513,-0.009476,-0.012252,-0.022198,0.039115,0.07018,0.064314,0.038675,0.000434,-0.001242,0.001716,0.000994,0.000347,0.000135,-8.5e-05,3e-06,0.000242,0.000118,3.5e-05,-0.000224,0.001372,0.001845,-0.000857,-0.005177,-0.001144,-0.001685,-0.005749
0.026739,0.016232,0.034396,0.046993,0.036846,0.058034,0.030225,-0.007378,-0.005643,0.002253,0.00151,0.000679,0.000248,0.000686,0.000136,-0.000209,-8.4e-05,6e-05,3.4e-05,6e-06,-0.000379,-0.003061,-0.002663,0.000202,0.00214,0.002168,5.7e-05,0.000158
