0.035406,0.041966,0.041984,0.03532,0.035476,0.038937,0.035026,0.026714,0.025407,0.029939,0.033455,0.035608,0.033467,0.030338,0.029704,0.027915,0.027742,0.029045,0.029238,0.02988,0.029991,0.02657,0.023974,0.024527,0.026378,0.026051,0.023088,0.023212
0.045015,0.053325,0.054368,0.046379,0.045533,0.048888,0.044156,0.034409,0.033733,0.040101,0.043262,0.044698,0.042405,0.038888,0.037871,0.035711,0.035463,0.03723,0.037399,0.037717,0.038077,0.034505,0.031911,0.032446,0.034531,0.03473,0.031147,0.030571
0.062996,0.07464,0.078685,0.068907,0.064909,0.065856,0.059894,0.049636,0.051677,0.061907,0.061919,0.059677,0.058322,0.05543,0.053964,0.051391,0.050197,0.051819,0.051368,0.050651,0.052316,0.049829,0.048206,0.048807,0.051217,0.053056,0.048082,0.045041
0.084841,0.100527,0.109854,0.100008,0.0898,0.081348,0.073933,0.068541,0.077841,0.093409,0.083333,0.071956,0.076291,0.078265,0.075798,0.071807,0.066928,0.066034,0.064062,0.06129,0.066743,0.068899,0.069907,0.071224,0.07323,0.077034,0.071088,0.064533
0.116547,0.136408,0.151415,0.141935,0.124488,0.099862,0.087595,0.091885,0.113946,0.136432,0.110939,0.086519,0.100604,0.112002,0.109049,0.101227,0.088082,0.082713,0.079213,0.072705,0.083211,0.093323,0.099425,0.102735,0.103425,0.107155,0.101207,0.093478
0.153266,0.175132,0.194901,0.185476,0.162348,0.123245,0.104054,0.115623,0.151156,0.181106,0.142867,0.108521,0.129387,0.148324,0.146553,0.135402,0.113253,0.103402,0.0994,0.08862,0.101654,0.117238,0.128704,0.135773,0.135833,0.138141,0.132468,0.125537
0.168564,0.187878,0.210719,0.202846,0.177389,0.132834,0.111452,0.127259,0.168337,0.199873,0.158382,0.121777,0.14328,0.165016,0.164332,0.152709,0.127739,0.114504,0.111172,0.099414,0.10982,0.124123,0.137384,0.148167,0.149784,0.15151,0.146379,0.140932
0.145733,0.158964,0.178793,0.174114,0.154214,0.118423,0.104136,0.121582,0.152131,0.172548,0.14075,0.112406,0.127662,0.145676,0.14477,0.136017,0.117622,0.104655,0.103845,0.096264,0.099508,0.108523,0.118607,0.127251,0.129687,0.131271,0.129488,0.126597
0.110517,0.119889,0.131482,0.130575,0.121532,0.10182,0.100386,0.115884,0.122962,0.128013,0.11783,0.104949,0.109044,0.115102,0.113058,0.110357,0.100049,0.088528,0.093881,0.094649,0.09025,0.096911,0.100837,0.095423,0.091741,0.09286,0.09882,0.101971
0.116917,0.128712,0.139092,0.1397,0.130818,0.114932,0.122803,0.136752,0.12643,0.127248,0.130836,0.125554,0.12516,0.123296,0.120082,0.120123,0.109552,0.097141,0.111213,0.11655,0.105532,0.113272,0.115415,0.097009,0.085816,0.085057,0.098407,0.112334
0.139262,0.161969,0.183868,0.177536,0.15854,0.142959,0.15599,0.172698,0.160225,0.161504,0.164246,0.157765,0.155254,0.150007,0.147379,0.149875,0.135922,0.121092,0.140776,0.147285,0.139094,0.151548,0.149141,0.121638,0.109496,0.107945,0.121202,0.141861
0.14759,0.182494,0.216497,0.200869,0.175359,0.167666,0.183165,0.195999,0.183016,0.18584,0.188228,0.179857,0.169871,0.161732,0.164939,0.175069,0.158731,0.140202,0.165821,0.174452,0.167822,0.183126,0.183432,0.153809,0.139315,0.136344,0.146095,0.168935
0.147487,0.185421,0.227638,0.21026,0.190818,0.192313,0.20356,0.207902,0.192708,0.193253,0.198427,0.191457,0.171003,0.162665,0.171609,0.188964,0.173422,0.15241,0.182677,0.191859,0.180216,0.19944,0.21203,0.180938,0.161366,0.162288,0.173765,0.194665
0.158998,0.193124,0.235656,0.218248,0.207956,0.211321,0.215387,0.218137,0.200482,0.193932,0.206723,0.203433,0.171916,0.168467,0.180201,0.192379,0.181121,0.16486,0.195283,0.204134,0.182195,0.199757,0.222699,0.191982,0.171832,0.176975,0.190231,0.205083
0.184467,0.209152,0.238282,0.210019,0.196531,0.202977,0.209337,0.219792,0.208458,0.197346,0.209714,0.204856,0.170107,0.173439,0.181335,0.177675,0.175234,0.17461,0.19889,0.208827,0.184221,0.187533,0.205135,0.183874,0.177139,0.182516,0.184202,0.185784
0.211602,0.220308,0.230678,0.186467,0.159702,0.173782,0.185563,0.197343,0.209975,0.209764,0.204984,0.19286,0.17333,0.181377,0.180581,0.167156,0.167325,0.180563,0.198098,0.207628,0.185523,0.170196,0.174664,0.173423,0.185987,0.185009,0.175084,0.167741
0.221687,0.219493,0.21633,0.172615,0.148901,0.170783,0.17263,0.172738,0.217212,0.240933,0.214007,0.184619,0.191194,0.208524,0.196363,0.186233,0.186818,0.195345,0.203893,0.20695,0.177596,0.152428,0.166652,0.184213,0.196836,0.196599,0.191748,0.185226
0.229543,0.217435,0.207927,0.18109,0.174235,0.191369,0.174577,0.170708,0.23332,0.266303,0.221869,0.18602,0.222488,0.25013,0.224098,0.217398,0.226242,0.223316,0.2251,0.225961,0.177054,0.138225,0.175199,0.212748,0.211528,0.210206,0.218769,0.216475
0.244225,0.22501,0.214827,0.206803,0.206104,0.206283,0.180973,0.181137,0.240412,0.271308,0.222673,0.194075,0.241463,0.268635,0.241112,0.233416,0.246847,0.234038,0.227613,0.2348,0.180745,0.127005,0.173498,0.230321,0.228472,0.227843,0.241169,0.230613
0.241887,0.236183,0.227232,0.227226,0.223268,0.204431,0.183333,0.192198,0.238599,0.257334,0.208627,0.199064,0.241816,0.253645,0.230181,0.217352,0.237567,0.227712,0.206921,0.207188,0.161246,0.112534,0.154573,0.219771,0.233683,0.236269,0.241941,0.215117
0.214246,0.225792,0.22167,0.22814,0.227954,0.202925,0.192539,0.197688,0.225002,0.228387,0.18567,0.211661,0.253561,0.246953,0.218731,0.189238,0.2135,0.21343,0.183768,0.166207,0.126361,0.103067,0.135393,0.182969,0.206933,0.224888,0.223074,0.179938
0.169757,0.191297,0.200985,0.220597,0.241268,0.216809,0.200211,0.187332,0.19528,0.197668,0.166541,0.223243,0.274771,0.251275,0.216474,0.171359,0.172132,0.175605,0.15675,0.13755,0.111396,0.110157,0.135944,0.161002,0.181772,0.214528,0.205608,0.153436
0.149819,0.176219,0.195426,0.209028,0.24094,0.22976,0.202566,0.172056,0.16334,0.168428,0.153051,0.213895,0.261933,0.233766,0.21558,0.167177,0.12466,0.129326,0.135897,0.132687,0.117755,0.1109,0.128594,0.150098,0.172392,0.199835,0.18165,0.1407
0.144512,0.174532,0.183686,0.177282,0.203401,0.212355,0.194695,0.162471,0.138202,0.144715,0.144363,0.175252,0.211295,0.205607,0.203805,0.15732,0.098038,0.098737,0.112799,0.126847,0.122243,0.098194,0.104407,0.13554,0.16321,0.174807,0.152184,0.135743
0.133272,0.150773,0.142648,0.129979,0.158001,0.182852,0.187041,0.159386,0.120098,0.126006,0.126617,0.123911,0.150396,0.170905,0.173223,0.132478,0.092926,0.093284,0.090053,0.104238,0.112585,0.085538,0.087146,0.116903,0.13402,0.138003,0.121434,0.118627
0.138279,0.124497,0.103651,0.093113,0.121071,0.146145,0.160176,0.14327,0.111505,0.11025,0.097971,0.087547,0.10208,0.12126,0.127144,0.102597,0.086339,0.085358,0.072279,0.076755,0.087452,0.075798,0.082955,0.098538,0.095844,0.105722,0.107171,0.100304
0.147199,0.116211,0.094514,0.0905,0.102256,0.107821,0.116475,0.116213,0.103123,0.095093,0.080821,0.075726,0.073296,0.081897,0.103,0.095036,0.076971,0.066209,0.058371,0.061747,0.067518,0.069658,0.081601,0.086216,0.074138,0.083262,0.099574,0.096212
0.136978,0.103109,0.08344,0.098422,0.115629,0.105189,0.087816,0.09277,0.100359,0.085631,0.070221,0.074402,0.071327,0.075733,0.091663,0.086945,0.065147,0.051244,0.057163,0.06617,0.072635,0.073617,0.079528,0.083824,0.073915,0.078632,0.099014,0.109948
0.107452,0.082713,0.070687,0.099534,0.129128,0.117112,0.090674,0.093104,0.102621,0.082471,0.064998,0.074705,0.079206,0.08136,0.079239,0.073652,0.059629,0.050376,0.063227,0.075966,0.08991,0.087356,0.081707,0.084279,0.078225,0.085759,0.10654,0.124433
0.087417,0.070163,0.070584,0.106024,0.132627,0.117864,0.097974,0.093203,0.091923,0.073136,0.060797,0.07062,0.079745,0.083413,0.072261,0.065123,0.059425,0.059107,0.068444,0.080627,0.104615,0.098803,0.077807,0.076249,0.074905,0.086537,0.107021,0.127588
0.088793,0.077988,0.084603,0.122832,0.132824,0.121733,0.110293,0.088049,0.078967,0.068927,0.060692,0.060726,0.070521,0.084445,0.077343,0.065682,0.067049,0.076213,0.081657,0.096501,0.114858,0.095335,0.064262,0.061113,0.067979,0.087278,0.104618,0.117456
0.089247,0.089877,0.094341,0.130195,0.133901,0.130175,0.120518,0.090382,0.084547,0.079306,0.065153,0.052897,0.064681,0.091455,0.087538,0.063161,0.069197,0.096091,0.10366,0.116995,0.11903,0.085768,0.055063,0.048665,0.062362,0.086806,0.099134,0.099891
0.07573,0.084481,0.083982,0.111854,0.117632,0.122089,0.110355,0.080965,0.081343,0.079436,0.065618,0.050929,0.059065,0.088252,0.0874,0.057018,0.062577,0.106172,0.118662,0.123621,0.113957,0.075088,0.048616,0.03987,0.051188,0.072801,0.083587,0.08283
0.055332,0.060761,0.056192,0.071627,0.079574,0.091111,0.080885,0.058408,0.063794,0.063748,0.058181,0.052038,0.051428,0.068462,0.068865,0.04268,0.047232,0.097107,0.111591,0.106076,0.091679,0.063453,0.049947,0.037394,0.037554,0.054202,0.071315,0.075529
0.036399,0.038135,0.032837,0.03439,0.045737,0.061536,0.057227,0.044632,0.050741,0.047684,0.043379,0.048843,0.04357,0.041799,0.043213,0.029285,0.03426,0.073467,0.084024,0.074539,0.062934,0.052916,0.052084,0.036043,0.030481,0.043298,0.061437,0.066548
0.0302,0.029402,0.026138,0.021722,0.030136,0.039837,0.043805,0.040978,0.044465,0.041518,0.031461,0.039255,0.034574,0.023838,0.028659,0.025293,0.026906,0.047967,0.056089,0.05315,0.044758,0.042269,0.046259,0.032282,0.029465,0.039316,0.049994,0.050921
0.029906,0.027519,0.022871,0.020998,0.028589,0.029651,0.033433,0.038796,0.041543,0.037762,0.027275,0.032604,0.027035,0.018702,0.026049,0.022417,0.025779,0.035018,0.03381,0.03499,0.035078,0.034527,0.036322,0.029042,0.029067,0.037927,0.039494,0.037548
0.027793,0.028309,0.020693,0.018383,0.027184,0.029542,0.031728,0.03621,0.036877,0.032789,0.024516,0.027961,0.022252,0.016129,0.023658,0.020856,0.025014,0.032497,0.025866,0.02243,0.029451,0.031939,0.031463,0.031408,0.032136,0.032791,0.026783,0.02621
0.02588,0.028973,0.021883,0.015081,0.02146,0.027245,0.032404,0.03375,0.031888,0.026576,0.020428,0.022934,0.01826,0.014666,0.020466,0.018663,0.022808,0.031787,0.025878,0.020477,0.029139,0.029121,0.026217,0.033584,0.035687,0.026999,0.018169,0.018297
0.022408,0.025664,0.021842,0.011271,0.013638,0.020844,0.028968,0.030171,0.031048,0.023985,0.020385,0.021362,0.015276,0.015096,0.02014,0.019025,0.024146,0.029002,0.023714,0.02052,0.028006,0.023474,0.018466,0.031926,0.037314,0.024646,0.014778,0.01305
