1.1e-05,6e-06,8e-06,1.4e-05,0.000142,0.000119,0.000125,0,0.000199,0.000159,4.1e-05,2.8e-05,3.3e-05,0.000301,1.2e-05,0.000205,6.8e-05,0.000389,0.000156,0.00062,0.000195,6.4e-05,0.000134,7.2e-05,0.000391,5.9e-05,8.9e-05,0.00043,0.000139,3.4e-05,0.000224,4e-06,0.000275,0.000297,0.000104,0.000108,0.000434,1e-05,0.000153,0.000301,8.3e-05,3e-04,0.000129,0.000238,8.8e-05,0,0.000303,0.000178,4.3e-05,9e-05,0.000157,0.000114,3.8e-05,4.5e-05,5.8e-05,0.000758,0.000366,0.000299,0.000131,0.000126,7.8e-05,4.9e-05,1.2e-05,1.4e-05,7e-06,2.1e-05,2.5e-05,1.2e-05,2.3e-05,1.8e-05,5e-05,6.1e-05,5.1e-05,7.4e-05,1.1e-05,3.6e-05,3.9e-05,3e-06,1.3e-05,4.6e-05,5e-06,2e-05,5.7e-05,4.5e-05,5e-06,2.2e-05,5e-06,1.6e-05,2.2e-05,1.8e-05,1e-05,5e-06,2e-05,7e-06,2.2e-05,4e-06,1.5e-05,2.2e-05,2e-06,2e-06,1e-05,1.4e-05,1e-05,2.1e-05,0,0,1e-06,1e-05,3e-05,3e-06,5e-06,3e-06,2.1e-05,4e-06,1.6e-05,1e-06,1.1e-05,4.9e-05,6.1e-05,0.000908,9.8e-05
1.6e-05,2.6e-05,1e-05,1.2e-05,0.000304,0.000558,0.000691,0.00066,0.00045,0.000542,0.000334,0.000209,0.000114,0.001221,0.001638,0.001658,0.000974,0.001016,0.000441,0.000919,0.000247,0.000573,0.000648,0.000477,0.001125,0.000332,0.00028,0.000877,0.00028,0.000207,0.000401,0.000459,0.000958,0.000107,0.000687,0.00087,0.000777,0.000501,6e-05,0.000951,0.000433,0.000527,0.000446,0.000554,0.000202,0.000225,0.000471,0.00077,0.000419,0.000161,0.000363,4.5e-05,0.000111,0.000266,7.5e-05,0.001686,0.001061,0.001242,0.001152,0.000363,0.000209,0.000211,6.3e-05,6.7e-05,0.000142,0.000112,0.000106,1.9e-05,8.7e-05,5.9e-05,1.4e-05,8.2e-05,8.5e-05,0.00018,0.000133,3.5e-05,9.2e-05,3e-05,6.6e-05,4.3e-05,7.5e-05,0.000134,0.000101,7.3e-05,3.4e-05,3e-05,3.4e-05,1.9e-05,4.7e-05,4.7e-05,5.4e-05,4.7e-05,2.6e-05,5.6e-05,7.6e-05,3.4e-05,1.2e-05,3.7e-05,3e-05,3.3e-05,4.9e-05,5.2e-05,1.6e-05,6.9e-05,1.6e-05,2.6e-05,3.8e-05,6.1e-05,0.000122,5.5e-05,4.5e-05,1.1e-05,3.3e-05,1.5e-05,1.5e-05,2.8e-05,1e-05,0.000127,0.000118,0.00204,0.000179
3.2e-05,3.6e-05,3.3e-05,7.4e-05,0.000407,0.001065,0.000685,0.000169,9.5e-05,0.000107,0.000111,0.00021,3.5e-05,0.001941,0.003225,0.001977,0.000541,0.000926,0.00124,0.001197,0.000551,0.000345,0.000875,0.000316,0.001051,0.000444,0.000682,0.000607,0.000758,0.000624,0.000544,0.000811,0.000803,0.000754,0.001221,0.000581,0.000534,0.000352,0.000391,0.001118,0.000333,0.000275,0.001105,0.000429,0.000364,0.000584,5e-04,0.000365,0.000673,0.000382,0.000494,1.4e-05,0.000148,8e-05,8.8e-05,0.001749,0.001868,0.001127,0.000225,0.000303,0.000314,0.000157,8.5e-05,0.000204,0.000133,6.3e-05,7e-05,0.000111,7.9e-05,0.000138,0.000193,8e-05,0.000145,1e-04,3.1e-05,9.6e-05,0.000191,0.000105,0.000124,0.000155,0.00019,8.3e-05,3.8e-05,0.000129,4.1e-05,8.5e-05,3e-05,4.5e-05,7.2e-05,0.00015,8.3e-05,7.7e-05,8.2e-05,3.7e-05,5.6e-05,7.6e-05,2.5e-05,6e-05,4.2e-05,1.5e-05,4.7e-05,4.9e-05,2.6e-05,0.000101,9.8e-05,5.5e-05,6.5e-05,5.4e-05,0.000203,0.000163,7.5e-05,2.3e-05,5.9e-05,1.1e-05,2.2e-05,3.6e-05,5.4e-05,0.000161,0.000311,0.002516,0.001141
3.4e-05,6.6e-05,3.1e-05,7.4e-05,0.000605,0.001009,0.000478,9.2e-05,0.000172,0.000513,6.8e-05,0.000314,0.000152,0.002423,0.002351,0.001757,0.001511,0.001787,0.001611,0.002219,0.001483,0.000963,0.001051,0.00023,0.001282,0.000532,0.000186,0.000316,0.000378,0.000826,0.000839,0.001673,0.001499,0.001343,0.000801,0.001575,0.001035,9.5e-05,0.000175,0.000289,0.000409,0.000327,0.000537,0.00084,0.00089,0.000915,0.000433,0.000613,0.001119,0.000714,0.000422,0.00041,0.000253,0.000206,0.000246,0.001332,0.001631,0.000926,0.000665,0.000168,0.000114,0.000178,0.000234,2.6e-05,9.4e-05,4.2e-05,4.2e-05,0.000143,0.000191,0.000209,0.00012,0.000287,0.000207,0.000197,8.7e-05,0.000136,0.000272,0.000179,2.1e-05,0.00012,0.000179,0.000243,4.4e-05,0.000158,2.4e-05,5.8e-05,3.1e-05,6.1e-05,9.7e-05,0.000178,8.6e-05,9.1e-05,9e-05,4.9e-05,0.000115,9.7e-05,7.5e-05,8.1e-05,7.8e-05,5.3e-05,1.3e-05,5.9e-05,5.1e-05,0.000101,2.8e-05,1.4e-05,3.3e-05,6.7e-05,0.000173,6.8e-05,2.8e-05,5.7e-05,0.000123,5.6e-05,4.9e-05,3.4e-05,6.2e-05,0.000109,0.000463,0.002211,0.000948
0.000188,4.6e-05,3.4e-05,4.2e-05,0.000914,0.000486,0.000452,0.000414,0.000171,0.000231,0.000133,0.000298,0.000111,0.002614,0.002404,0.000653,0.000317,0.00228,0.001152,0.000734,0.002104,0.00179,0.00166,0.00139,0.001916,0.00065,0.000807,0.001438,0.000392,0.001214,0.00079,0.003215,0.003268,0.002006,0.00097,0.001872,0.000603,0.000796,0.000771,0.000624,0.000925,0.000744,0.000565,0.000953,0.000277,0.000612,0.001329,0.000645,8e-04,0.000248,0.000368,2.4e-05,0.000144,0.000474,0.000263,0.001319,0.001691,0.00125,0.00082,0.000241,0.000345,0.000553,0.000401,0.000263,0.000189,0.000123,0.000176,0.000261,0.000172,5.1e-05,0.000191,0.000271,0.000305,9.4e-05,5.6e-05,8.8e-05,7e-05,7e-06,0.000142,0.00014,0.000185,0.00019,0.000195,2e-04,0.000188,0.000102,6.3e-05,5e-05,3.5e-05,0.000138,0.000153,0.000148,0.000117,7.3e-05,0.000116,3.7e-05,4.8e-05,4.2e-05,7.9e-05,3.9e-05,5.5e-05,8.1e-05,3.4e-05,6.3e-05,9.1e-05,2.9e-05,4.1e-05,2.3e-05,0.00012,0.000116,6.1e-05,0.000114,0.000114,9.9e-05,3e-05,7.3e-05,6.4e-05,2.8e-05,0.000317,0.002625,0.000423
0.000245,0.00028,0.000177,0.000102,0.000909,0.001812,0.000558,0.000412,0.000144,0.000142,0.000352,9.6e-05,0.000225,0.002278,0.002535,0.003633,0.002003,0.003273,0.002975,0.001687,0.001591,0.000225,0.001466,0.002042,0.001093,0.000772,0.000846,0.000348,0.000127,0.001649,0.001644,0.003875,0.000788,0.001109,0.000954,0.001325,0.00087,0.000255,0.000449,0.000604,0.001767,0.000808,0.001034,0.00032,0.000365,0.000506,0.000528,0.002292,0.002208,0.001086,0.000824,0.000297,0.000265,0.00021,0.000382,0.00155,0.002151,0.00099,0.00063,0.000527,0.000498,0.00081,0.000599,0.000384,0.000184,0.000172,0.000231,0.000113,0.000112,9.8e-05,0.000114,8.7e-05,0.000245,7e-05,0.000288,0.00022,0.000142,6.6e-05,0.00026,0.000271,0.000383,0.000494,0.00044,0.000314,0.000292,0.000152,0.000178,0.000131,0.000156,0.000139,0.000233,0.000109,0.000173,0.000185,2e-05,1.2e-05,4.7e-05,5.8e-05,0.000188,0.000127,0.000145,2.5e-05,0.000135,7e-05,0.000119,9.1e-05,9e-06,6.6e-05,9.7e-05,0.000104,6e-05,0.000179,0.000244,0.000169,9.7e-05,6e-05,0.000128,0.000169,0.000367,0.002829,0.000666
0.000276,0.000211,9.2e-05,7.1e-05,0.000819,0.001257,0.001177,0.000306,6.2e-05,0.000609,0.000388,0.000647,0.000199,0.002058,0.001819,0.002733,0.001412,0.004731,0.002711,0.000784,0.002106,0.002103,0.000313,0.001127,0.000759,0.000188,0.001006,0.00067,0.000786,0.001747,0.00253,0.000935,0.002423,0.001516,0.000523,0.001809,0.001538,0.002037,0.000549,0.000719,0.002352,0.001613,0.001056,0.000721,0.000877,0.000468,0.000842,0.002517,0.000463,0.001044,0.001419,0.000744,0.000789,0.000766,0.000802,0.001943,0.002703,0.001118,0.00038,0.000461,0.000533,0.000178,0.000284,0.000643,0.00037,0.000171,0.000362,0.000311,9.4e-05,8.1e-05,0.000137,9e-06,0.000393,0.000368,0.000185,0.000432,0.000349,0.000268,0.000243,8.4e-05,0.000216,0.000186,7.5e-05,0.000144,0.000121,7e-05,0.000131,3.1e-05,0.000101,0.000116,0.000155,9.6e-05,0.000155,9.7e-05,7.4e-05,4.7e-05,5.9e-05,6.2e-05,0.000206,0.00013,2e-04,0.000151,0.000179,0.000131,8.9e-05,3e-05,3.7e-05,8.7e-05,4.5e-05,0.000103,7.4e-05,0.000129,5.8e-05,4.8e-05,7.5e-05,4.1e-05,5.8e-05,0.000273,0.000534,0.002731,0.002418
0.000351,0.000148,5.2e-05,7.7e-05,0.000784,0.001424,0.000945,0.00023,0.000106,0.001128,0.001025,0.001127,0.000662,0.00176,0.000749,0.00446,0.003371,0.006825,0.003671,0.001324,0.001168,0.000465,0.001173,0.001406,0.000533,0.001457,0.00124,0.00057,0.001169,0.001601,0.002562,0.001464,0.003185,0.002691,0.00106,0.00106,0.001343,0.001012,0.001749,0.000501,0.002376,0.001912,0.001097,0.000854,0.001174,0.000328,0.001481,0.000775,0.002226,0.00078,0.000619,0.000377,0.000698,0.000479,0.000275,0.001012,0.003254,0.00277,0.000282,0.000304,0.000133,0.000175,0.000338,0.000815,0.000681,0.000654,0.000545,0.000285,0.000382,0.000334,5e-05,7e-05,0.000627,0.00084,0.000661,0.000226,0.000113,0.000192,0.00012,0.000187,6e-05,0.000129,0.000208,6.6e-05,0.00011,4.4e-05,1.9e-05,5e-05,3.1e-05,9.6e-05,0.000111,0.000129,4.2e-05,0.000114,0.000113,7.3e-05,0.000112,0.00015,0.000169,8.9e-05,0.000149,0.000192,6.7e-05,8.2e-05,1e-04,9.2e-05,6.4e-05,0.000123,6.4e-05,0.000148,0.000122,0.000103,0.000148,9.9e-05,0.000172,9.8e-05,5e-05,0.000346,0.001126,0.003869,0.006899
0.000163,0.000109,0.00011,1.7e-05,0.000618,0.001491,0.001101,0.000752,0.000284,0.001618,0.001634,0.000516,0.000455,0.001985,0.001294,0.004235,0.001543,0.004768,0.001987,0.001634,0.001141,0.000646,0.001165,0.001542,0.0013,0.001365,0.000841,0.000524,0.001185,0.001104,0.00281,0.001518,0.003129,0.002592,0.002215,0.002066,0.001423,0.001374,0.001903,0.001242,0.002407,0.000876,0.000654,0.00061,0.00075,0.000763,0.002154,0.001068,0.001695,0.001749,0.001761,0.000963,0.001001,0.000345,0.000198,0.001191,0.003515,0.002473,0.002125,0.001054,0.000571,0.000335,0.000272,0.000945,0.000506,0.000184,0.000216,0.000124,0.000267,0.000227,0.000279,0.000115,0.000683,0.000353,0.000196,0.000292,0.000392,0.000209,7.1e-05,0.000173,0.000113,6.2e-05,0.000162,0.000138,4.9e-05,8.9e-05,6e-06,3.4e-05,2.6e-05,9.9e-05,8.3e-05,3.1e-05,0.000136,8.6e-05,0.000123,0.000108,0.000189,7e-05,3.6e-05,7.1e-05,9e-05,6.7e-05,2.2e-05,3.6e-05,1.4e-05,7.4e-05,1.9e-05,9.8e-05,4.4e-05,8.8e-05,4.6e-05,0.000193,0.00021,6.3e-05,0.000142,7.8e-05,0.00017,0.000199,0.00097,0.002338,0.007714
0.000111,0.000117,0.000107,5.4e-05,0.000335,0.000945,0.000497,0.000726,0.000414,0.001685,0.000834,0.000798,0.000444,0.002072,0.001684,0.002087,0.001639,0.003516,0.001525,0.001436,0.000276,0.001428,0.001973,0.001253,0.001885,0.002106,0.001636,0.000744,0.001697,0.000331,0.002576,0.003717,0.002151,0.001716,0.002504,0.001423,0.000655,0.000667,0.001257,0.002172,0.00072,0.000723,0.000483,0.000766,0.001002,0.000799,0.00123,0.000912,0.000361,0.000826,0.001324,0.000768,0.000864,0.000489,0.000205,0.001329,0.001817,0.000799,0.000926,0.001042,0.000292,0.000243,0.00034,0.000926,0.000365,0.000262,2.9e-05,4.7e-05,0.000145,0.000141,0.000154,0.000101,0.000494,0.000229,0.000207,0.000245,0.000108,5e-05,0.000133,0.000157,4.9e-05,3.3e-05,6.3e-05,4.8e-05,8.9e-05,6.4e-05,6.7e-05,3e-05,2.7e-05,3.1e-05,5.7e-05,8.5e-05,0.000106,0.000109,2.1e-05,0.000132,6.6e-05,4e-06,7e-05,7.9e-05,0.000103,4.6e-05,5.3e-05,5.2e-05,2.5e-05,4.3e-05,7.8e-05,3.4e-05,3.9e-05,4.7e-05,0.000103,0.000183,7.9e-05,7.4e-05,6.6e-05,8.4e-05,0.000227,0.000434,0.000559,0.00245,0.005144
1e-04,0.000156,0.000273,0.000254,0.000147,0.002819,0.002726,0.001152,0.000401,0.001028,0.000647,0.000739,0.000135,0.001767,0.000914,0.001341,0.000507,0.001386,0.000914,0.00091,0.002171,0.001924,0.00194,0.001435,0.001404,0.000733,0.000813,0.000899,0.001531,0.001392,0.001544,0.000982,0.002029,0.001276,0.003124,0.001573,0.000212,0.000838,0.000891,0.001282,0.000673,9.8e-05,0.000223,0.001469,0.000304,0.001006,0.000356,0.000658,0.001102,0.001034,0.000897,0.000551,0.000219,0.000243,9.3e-05,0.001367,0.000273,0.000535,0.000307,0.000325,0.000167,0.000135,4.7e-05,0.000518,5.6e-05,0.000257,6.7e-05,8.1e-05,0.000177,4e-05,0.00012,5.1e-05,0.000349,0.00013,8.3e-05,3.9e-05,0.000136,6.4e-05,0.000134,0.000141,0.000129,4e-05,9.6e-05,8.5e-05,8.4e-05,4.6e-05,1.7e-05,2.6e-05,9e-06,4e-05,5.5e-05,2.3e-05,4.5e-05,2.3e-05,1.8e-05,7.6e-05,9.4e-05,4.4e-05,7.6e-05,0.000102,8.4e-05,3e-06,3.5e-05,6.3e-05,5.1e-05,3.2e-05,4.8e-05,7.5e-05,4.8e-05,1.8e-05,4.8e-05,4.9e-05,4.5e-05,5.9e-05,7.8e-05,7.3e-05,0.00011,0.000358,0.00059,0.001678,0.002523
6.8e-05,9e-05,0.000147,8.3e-05,0.000305,0.00423,0.001855,0.001327,0.001154,0.00077,0.000963,0.000117,0.000153,0.001652,0.000866,0.001654,0.001019,0.00115,0.000302,0.00076,0.001882,0.000816,0.001175,0.00078,0.000941,0.000484,0.000626,0.000757,0.000301,0.000724,0.001482,0.001558,0.001485,0.002095,0.00183,0.00152,0.000286,0.000414,0.000201,0.000458,0.000979,0.000685,0.001724,0.000434,0.000366,0.001078,0.000377,0.000157,0.000554,0.000335,0.000981,0.000274,0.000221,0.000142,7.5e-05,0.001414,0.000531,0.000262,0.000487,0.000426,0.000196,0.000142,0.00017,0.000336,0.00011,0.000301,3.3e-05,7.9e-05,0.000283,3.3e-05,9.9e-05,9.6e-05,0.000166,0.000435,0.000304,9.5e-05,8.3e-05,9.2e-05,0.000146,7.1e-05,8.4e-05,6.3e-05,9.8e-05,0.000112,6.3e-05,8.8e-05,6.8e-05,2.4e-05,4.8e-05,2.9e-05,5.7e-05,4.2e-05,5.2e-05,7.6e-05,6.5e-05,4e-05,3.5e-05,3e-05,1.3e-05,2.4e-05,6e-05,2e-05,3.6e-05,3.7e-05,1e-05,1.3e-05,3.7e-05,2.1e-05,8.1e-05,0.00011,4.3e-05,2.4e-05,7.5e-05,5e-05,4.3e-05,9.6e-05,0.000116,0.000316,0.000756,0.002056,0.00148
8.2e-05,0.000106,1.4e-05,5.7e-05,0.000444,0.003173,0.001628,0.002153,0.001071,0.000298,0.000623,0.000598,0.000383,0.001785,0.000623,0.000659,0.000399,0.002825,0.001197,0.000477,0.001732,0.001755,0.001959,0.001496,0.001146,0.001088,0.001154,0.001175,0.000967,0.001477,0.001107,0.00091,0.002151,0.001072,0.0029,0.001189,0.001462,0.001047,0.000502,0.001497,0.001088,0.001982,0.002188,0.001108,0.001356,0.001314,0.000589,0.000315,0.000297,0.000788,0.000777,5.9e-05,0.000735,0.000221,9.4e-05,0.001351,0.000627,0.000807,0.000461,0.000284,0.000266,0.000142,0.000252,0.000367,3.8e-05,0.000337,0.00018,6.2e-05,0.000358,0.000178,0.000176,8.8e-05,0.000237,0.000584,0.000403,5.1e-05,0.000141,0.000104,7.1e-05,1.3e-05,0.000115,6.3e-05,3.9e-05,0.000208,0.000134,9.3e-05,8.7e-05,5.2e-05,8.2e-05,5.1e-05,6.8e-05,7.3e-05,6e-05,5.6e-05,7.8e-05,2.7e-05,8.2e-05,3.1e-05,1.1e-05,4.4e-05,6.8e-05,1.6e-05,4.9e-05,5.2e-05,5.1e-05,6e-06,7.5e-05,5.4e-05,8.4e-05,7.9e-05,4.3e-05,5.1e-05,4.1e-05,4.5e-05,1.3e-05,3.4e-05,5.5e-05,0.000202,0.000516,0.001144,0.000819
6.4e-05,5.4e-05,8.6e-05,0.000114,0.000438,0.001679,0.000286,0.001261,0.000456,0.000299,0.000515,0.000505,0.000149,0.001701,0.001326,0.001987,0.00062,0.004035,0.00163,0.00125,0.003232,0.000682,0.003415,0.000914,0.001713,0.000682,0.001758,0.001704,0.001033,0.001043,0.000761,0.001146,0.002046,0.001218,0.004086,0.001905,0.001417,0.001009,0.002003,0.000967,0.001943,0.001088,0.002873,0.002787,0.001695,0.001704,0.000991,0.000727,0.000279,0.00065,0.001223,0.000123,0.000964,0.000174,0.000182,0.001202,0.00066,0.000186,0.000667,0.000736,0.000628,0.000704,0.000219,0.000826,0.000158,0.000444,7.4e-05,7.4e-05,0.000471,0.000113,2.8e-05,0.000219,0.000298,0.000604,0.00013,0.000194,0.000156,4.8e-05,0.000123,0.000145,0.000126,0.000155,0.000181,0.000184,0.000269,0.000172,0.000274,8.5e-05,0.00011,0.000166,0.000162,0.000117,0.000173,9.1e-05,0.000158,9.8e-05,3.4e-05,5.8e-05,4.8e-05,7.3e-05,2.7e-05,4.1e-05,4.2e-05,2.2e-05,2.4e-05,1.3e-05,8.5e-05,2.6e-05,0.000101,0.000167,0.000106,6.9e-05,1.1e-05,7.2e-05,1.6e-05,0.00012,3.9e-05,5.5e-05,0.000292,0.000972,0.000133
2.8e-05,9.3e-05,5.6e-05,0.00012,0.000432,0.001135,0.000942,0.000462,0.000165,0.000119,0.000284,0.000137,9.3e-05,0.001683,0.001475,0.005685,0.003612,0.004521,0.003076,0.002759,0.004388,0.002472,0.005941,0.003346,0.002693,0.000777,0.002602,0.002818,0.001537,0.002167,0.00078,0.002534,0.001158,7e-04,0.001129,0.00275,0.00409,0.003254,0.003582,0.00408,0.000872,0.001524,0.00165,0.003345,0.001927,0.002795,0.002098,0.001575,0.000357,0.000988,0.001644,0.000451,0.001544,0.000578,8.7e-05,0.001072,9e-04,0.001474,0.000798,0.000104,0.000297,0.000745,4e-04,0.001465,0.000462,0.000534,0.000416,0.000216,0.000474,0.000363,0.000197,0.000215,0.000628,0.000659,0.000504,0.000106,7.3e-05,0.000223,0.00017,0.000209,0.000239,0.000136,0.000156,0.000302,0.000185,3.9e-05,5.5e-05,0.000147,0.000208,0.000222,0.000171,0.000267,5.9e-05,5.3e-05,5.4e-05,0.000112,0.000242,0.000104,8.3e-05,5.2e-05,0.000132,2.9e-05,2.9e-05,8.1e-05,0.000102,9.8e-05,8.2e-05,5.2e-05,0.000111,2.1e-05,3.6e-05,4.3e-05,7.2e-05,0.00011,0.000118,0.000176,7.8e-05,0.000122,0.000108,0.000696,0.000197
4.2e-05,7.4e-05,7.4e-05,9e-05,0.000311,0.001493,0.000747,0.001182,0.000461,0.000312,0.000229,0.000157,0.000106,0.001665,0.004042,0.004526,0.001967,0.003041,0.000403,0.004085,0.006476,0.003457,0.005737,0.004188,0.003526,0.002356,0.005149,0.003949,0.004367,0.006073,0.004138,0.001583,0.005616,0.003756,0.004382,0.004268,0.004157,0.000515,0.002001,0.004453,0.003479,0.004007,0.002106,0.004131,0.002247,0.004083,0.004105,0.004738,0.003825,0.000325,0.002567,0.001622,0.002921,0.001021,0.000167,0.001082,0.003212,0.00202,0.000968,0.000775,0.000854,0.00077,0.000659,0.001951,0.001229,0.000676,0.000486,0.000231,0.000618,5e-04,0.000326,0.000283,0.000537,0.000547,0.000332,0.000173,0.000443,0.000354,0.000372,0.000179,0.000205,0.000367,0.000342,0.000434,0.00035,0.000129,0.000403,0.000242,5e-05,0.000264,0.000477,0.000403,0.000258,0.000116,0.000146,0.000188,0.00036,7.9e-05,4.8e-05,0.00026,0.000305,0.000207,0.000102,0.000152,0.000283,4.4e-05,6.2e-05,3.4e-05,6.3e-05,0.000108,6.5e-05,4.6e-05,5.8e-05,0.00012,4.5e-05,5.4e-05,9e-05,0.000128,0.000232,0.000471,0.000171
8.3e-05,2e-05,6.1e-05,9.3e-05,0.000371,0.002735,0.00081,0.000209,0.00123,0.001322,0.000529,0.000286,0.000251,0.001417,0.006935,0.004894,0.006875,0.002904,0.004945,0.007265,0.006533,0.009844,0.001716,0.009073,0.010626,0.009457,0.002736,0.009781,0.004223,0.003583,0.002724,0.001937,0.005372,0.007448,0.005669,0.010688,0.012445,0.007063,0.004281,0.007066,0.002542,0.007231,0.009515,0.008033,0.008391,0.007265,0.007658,0.001228,0.005332,0.004987,0.004337,0.005207,0.000938,0.002472,0.001782,0.000284,0.004679,0.004714,0.00285,0.002184,0.001843,0.001687,0.001949,0.001089,0.001548,0.000319,0.000278,0.000423,0.001045,0.000841,0.000158,0.000582,0.000953,0.000532,0.000118,0.000232,0.000795,0.000629,0.000316,0.000253,0.00036,0.000491,0.000656,0.000999,0.001149,0.001107,0.000155,0.000309,0.00029,0.000379,0.000691,0.000362,0.000178,0.000131,0.000331,0.000308,0.000549,0.000553,0.000336,0.000201,9.6e-05,0.00036,0.00019,0.000204,0.000182,0.000356,0.000283,0.000188,8.1e-05,0.000114,8.2e-05,5.1e-05,8.7e-05,4e-05,0.000151,0.000172,0.000117,0.000108,1e-04,0.000235,0.000302
0.000146,1e-04,3.1e-05,9e-06,0.000405,0.003897,0.002626,0.001236,0.001256,0.000879,0.000527,0.000348,0.000357,0.000607,0.006422,0.006162,0.010357,0.005634,0.007756,0.011138,0.007043,0.010062,0.009143,0.009889,0.009204,0.009137,0.012086,0.009004,0.009014,0.006292,0.006317,0.002498,0.003977,0.005408,0.008381,0.006076,0.002504,0.003678,0.001061,0.006142,0.008896,0.006761,0.008969,0.007786,0.009261,0.010621,0.00236,0.006444,0.001995,0.001652,0.001534,0.003585,0.005324,0.004769,0.002275,0.000919,0.004564,0.004804,0.002315,0.001206,0.000561,0.000174,0.001097,0.00265,0.002277,0.001575,0.001238,0.00089,0.000817,0.001307,0.001055,0.001389,0.000771,0.001124,0.000809,0.000418,0.000657,0.00043,0.00035,0.000543,8.4e-05,0.000171,0.000481,0.000792,0.000397,0.000516,0.000957,0.000578,0.00022,0.000351,0.000203,0.00037,0.000417,0.000347,0.000493,0.000302,5e-04,0.000373,0.000132,0.000341,0.000386,0.00039,0.00028,0.000168,0.000203,0.000318,0.000114,8.9e-05,3e-05,8.6e-05,0.000143,0.000108,5.4e-05,7.9e-05,9.1e-05,0.000152,1e-04,6.6e-05,0.000146,0.000351,0.000201
7.8e-05,0.000124,0.000122,6.3e-05,0.000424,0.00439,0.002853,0.001091,0.002421,0.001461,0.000623,0.000515,0.000302,0.000303,0.005186,0.007717,0.003849,0.005251,0.009199,0.000606,0.003586,0.002782,0.004422,0.003386,0.002757,0.003371,0.004599,0.002988,0.007325,0.005771,0.008866,0.008195,0.003384,0.005574,0.005725,0.004154,0.002099,0.00501,0.003226,0.00178,0.006564,0.008775,0.004241,0.000838,0.004131,0.001882,0.005426,0.003345,0.006089,0.00474,0.004706,0.005131,0.00064,0.001226,0.001215,9e-04,0.001946,0.000424,0.0011,0.000136,0.000451,0.000912,0.00017,0.001468,0.00066,0.000477,0.000938,0.000581,0.001127,0.000504,0.000103,0.000908,0.001457,0.001987,0.000902,0.000468,0.00019,0.000352,0.000533,0.000551,0.00052,0.000285,0.000324,0.000228,0.000103,0.000462,0.000324,8.2e-05,0.000151,0.000442,0.000518,0.000323,0.000162,0.000325,0.000241,6.1e-05,0.000219,0.000104,2e-05,0.000171,7.5e-05,0.000213,0.000113,2.2e-05,0.00011,3.8e-05,0.000124,8e-05,7.4e-05,6.4e-05,7.7e-05,1.4e-05,7.6e-05,7.1e-05,6.3e-05,7.5e-05,4.3e-05,6e-05,0.000322,0.000901,0.000693
7.9e-05,2.9e-05,3.2e-05,4.7e-05,0.000421,0.003708,0.004076,0.003188,0.001492,0.000899,0.000335,0.000269,3.9e-05,0.000555,0.002553,0.002465,0.004668,0.00526,0.000676,0.000892,0.00291,0.00314,0.00185,0.000129,0.000794,0.002314,0.000397,0.000722,0.005803,0.001839,0.005045,0.002277,0.004251,0.002598,0.000227,0.002086,0.002996,0.004164,0.003347,0.002337,0.003786,0.000659,0.002118,0.003285,0.002118,0.000702,0.004003,0.003453,0.004059,0.001799,0.000973,0.000838,0.001676,0.000573,0.001205,0.000598,0.001158,0.00181,0.001295,0.00123,0.000518,0.000635,0.000634,0.000449,2.4e-05,0.000315,0.000545,0.00021,0.000594,0.000566,0.00042,0.000517,0.000495,0.001168,0.000621,0.000473,0.000265,0.000194,3e-06,0.000283,0.000106,0.000228,0.000194,0.000273,0.000293,0.000282,0.000259,4.7e-05,0.000157,0.000195,0.000244,0.000126,0.000229,0.000168,9.2e-05,7.5e-05,7.3e-05,8.5e-05,4.3e-05,3e-05,4.6e-05,8.6e-05,8.3e-05,7.4e-05,8.5e-05,9e-05,0.000144,0.000103,3.2e-05,2.7e-05,6.9e-05,7e-05,0.000115,6.7e-05,6.5e-05,3.1e-05,7.2e-05,5.6e-05,0.000424,0.000928,0.00086
7.4e-05,3.3e-05,3.6e-05,2.6e-05,0.000231,0.001996,0.002762,0.001001,0.001105,0.000421,2.1e-05,0.000167,4.3e-05,0.000764,0.002211,0.000337,0.001144,0.002823,0.001751,0.000993,0.001774,0.001024,0.002315,0.002897,0.000723,0.001778,0.001533,0.001083,0.002867,0.005183,0.002017,0.001656,0.00367,0.004095,0.002308,0.002592,0.000599,0.002621,0.001289,0.001863,0.001998,0.001684,0.001597,0.00285,0.002341,0.000557,0.002116,0.001667,0.002484,0.001445,0.001385,0.00141,0.001946,0.000688,0.000423,0.000443,0.002216,0.002226,0.001996,0.00108,0.000968,0.000346,0.00032,0.000852,0.000421,0.000324,0.000474,0.000258,0.000252,0.000312,0.000181,0.000295,0.000501,0.000654,0.000344,0.000212,1.7e-05,0.000159,0.000184,7.1e-05,0.000115,7.8e-05,6.7e-05,0.000179,0.000138,9.5e-05,0.000287,0.000225,4.7e-05,0.000162,9.9e-05,4.2e-05,0.000183,9.7e-05,0.000181,0.000129,8.2e-05,8.5e-05,2.7e-05,8e-05,8.5e-05,4e-05,6.6e-05,4.6e-05,0.000152,0.000102,1.5e-05,6.7e-05,4.5e-05,5.3e-05,3.9e-05,7.1e-05,7e-05,1.5e-05,7e-05,2e-05,6.9e-05,3.5e-05,0.000366,0.001216,0.000548
3.3e-05,3e-05,3.6e-05,1.4e-05,0.000125,0.000586,0.001583,0.000753,0.000239,0.000339,0.000212,9e-06,6e-05,0.000611,0.001455,0.000906,0.001513,0.000691,0.002105,0.000741,0.001133,0.001286,0.003064,0.000948,0.000596,0.001155,0.001036,0.000958,0.000538,0.002917,0.001256,0.003058,0.001097,0.00118,0.001451,0.001133,0.001233,0.000545,0.001883,0.000507,0.000941,0.001651,0.001213,0.00256,0.001697,0.000551,0.000939,0.000426,0.001283,0.001682,0.001239,0.000701,0.000851,0.000129,0.000209,0.000329,0.002039,0.000864,0.000608,0.000278,0.000516,0.000443,0.000521,0.000532,1e-04,0.000159,9.7e-05,9.5e-05,0.000216,0.000137,6e-05,5.7e-05,0.000116,0.000492,0.000359,0.000231,7.5e-05,7.7e-05,0.000152,5.7e-05,7.9e-05,4.2e-05,2.5e-05,9.3e-05,5.5e-05,0.00018,0.000148,7.2e-05,0.000112,5.7e-05,0.000109,4.1e-05,9.3e-05,7e-05,0.000122,7.2e-05,0.000111,0.000101,6.2e-05,9e-05,2.5e-05,7.8e-05,2.3e-05,3.9e-05,9.9e-05,7.2e-05,2.8e-05,3.7e-05,1.4e-05,3.2e-05,6.3e-05,8.3e-05,4.8e-05,5.8e-05,0.000107,4.3e-05,7.4e-05,2.8e-05,0.000308,0.000638,0.000441
1.9e-05,6e-06,1.7e-05,4e-06,6.2e-05,0.000216,0.000383,0.000445,0.000232,7.9e-05,5.6e-05,2e-05,2.5e-05,0.000176,0.000752,0.000935,0.000463,0.000635,0.000366,0.000277,0.000384,0.000332,0.001,6e-04,0.000291,0.000461,0.000285,0.000361,0.000493,0.001291,0.000754,0.001565,0.001161,0.001311,6e-04,0.000502,0.000855,0.000165,0.000351,0.000451,0.000366,0.000165,0.000945,0.000223,0.00027,7.9e-05,0.000392,0.000271,0.000398,0.000249,0.000618,0.000185,0.000388,4.2e-05,0.000131,0.000275,0.00056,2.1e-05,3.1e-05,4.2e-05,0.000111,2.4e-05,7e-05,0.000147,6.1e-05,6.7e-05,5.1e-05,5.2e-05,3.6e-05,7e-05,2.2e-05,1.7e-05,8.4e-05,0.000113,4.3e-05,5.7e-05,2.5e-05,4.9e-05,2.4e-05,3.6e-05,5.7e-05,5.6e-05,5.2e-05,7.5e-05,3e-05,6e-05,7.8e-05,2.9e-05,2.6e-05,3.8e-05,4.1e-05,1.8e-05,1.8e-05,3.2e-05,6.2e-05,3.1e-05,3e-06,2.7e-05,1.7e-05,1.6e-05,8e-06,3.3e-05,3e-05,9e-06,3.6e-05,3.1e-05,1e-05,1.5e-05,1.6e-05,2.2e-05,2.1e-05,2e-05,1.9e-05,2.6e-05,2.1e-05,6e-06,2.7e-05,2.4e-05,0.000132,0.00031,4.9e-05
0,7e-06,1.2e-05,1.9e-05,8.6e-05,0.000264,0.000275,5.2e-05,0.000149,4.1e-05,1.2e-05,1.2e-05,5e-06,0.000132,0.000559,0.000924,0.000323,0.000763,0.000625,0.000502,0.000791,0.000714,0.000403,0.000497,0.000158,0.000587,0.000323,0.000269,0.000394,0.000983,8e-04,0.000165,0.000289,0.000498,0.000256,0.000486,0.000316,0.000454,0.000546,0.000222,0.000378,0.000632,0.000477,0.000543,0.000615,8.8e-05,9.3e-05,0.000211,0.000408,0.000395,0.000253,4e-05,0.000284,1.3e-05,9.7e-05,0.000229,0.000441,0.000171,0.000118,7e-05,0.000105,1e-04,2.5e-05,6.5e-05,3.7e-05,6.1e-05,5.8e-05,4e-05,2.3e-05,1.3e-05,3e-05,3.4e-05,7.2e-05,6.7e-05,3.7e-05,4e-05,2.7e-05,1.2e-05,3e-05,1.6e-05,3.3e-05,3e-05,4.2e-05,4.3e-05,1.2e-05,1.6e-05,4e-05,1.3e-05,2.1e-05,1.3e-05,3.1e-05,1.3e-05,3.1e-05,1.9e-05,3.9e-05,2e-05,1.1e-05,1.3e-05,5e-06,8e-06,2.3e-05,3.2e-05,1.2e-05,1.9e-05,2.6e-05,1.2e-05,2.1e-05,8e-06,3e-06,1.6e-05,1.2e-05,2.1e-05,1.1e-05,1.9e-05,2.7e-05,2.1e-05,1.4e-05,1.2e-05,9.4e-05,0.000136,1.7e-05
1.4e-05,1e-05,4e-06,1.5e-05,0.000131,0.000254,0.000184,0.000122,6.8e-05,5.3e-05,2.6e-05,2.6e-05,5e-06,0.000196,0.000278,0.000418,0.000731,0.000372,0.000548,0.000584,0.000534,0.000332,0.000424,0.000318,0.000172,0.000325,0.000341,0.000298,0.000385,0.000679,0.000438,0.000488,0.00053,0.000627,0.000675,0.000329,0.000241,0.000183,0.000306,0.00031,0.000242,0.000457,0.000442,0.000641,0.000323,4.9e-05,0.000232,1.8e-05,0.000255,0.000258,0.000161,0.000134,0.000185,2.5e-05,7.9e-05,0.000167,9e-05,0.000138,7.2e-05,6.7e-05,9.1e-05,8.1e-05,8.4e-05,7.2e-05,4.8e-05,2.1e-05,1.7e-05,1.1e-05,7.6e-05,2.1e-05,1.8e-05,3.3e-05,6.7e-05,4e-05,3.8e-05,4.6e-05,3.5e-05,1.8e-05,3.4e-05,2.1e-05,4.5e-05,1.8e-05,3.6e-05,5.1e-05,1.9e-05,1.7e-05,2.7e-05,9e-06,1.5e-05,2.6e-05,1.8e-05,9e-06,4.3e-05,1.2e-05,2.7e-05,1.7e-05,2.5e-05,1.2e-05,1.2e-05,1.1e-05,1.3e-05,2.3e-05,8e-06,1e-05,1.8e-05,8e-06,1.6e-05,1.3e-05,6e-06,2.3e-05,4e-06,1e-05,1.1e-05,8e-06,8e-06,1.2e-05,1.7e-05,1e-05,6.6e-05,0.000208,5.1e-05
7e-06,1.4e-05,9e-06,8e-06,0.000116,0.000479,0.000303,0.000171,4.1e-05,4.8e-05,2.1e-05,1.9e-05,1.7e-05,0.000196,0.000316,0.000194,0.00015,0.000188,0.000313,0.000229,0.000728,0.000521,0.000701,0.000296,0.000221,0.000179,0.000192,0.000351,0.000423,0.000373,0.000567,0.000257,0.000338,0.000287,0.000452,0.00031,0.000307,4.8e-05,0.000223,0.000153,0.000144,0.000122,0.000426,0.00043,0.000261,7.4e-05,0.000139,1.9e-05,0.000201,0.000225,0.000219,0.000158,0.00028,6.7e-05,3.1e-05,0.000148,0.000463,7.5e-05,9.3e-05,1.4e-05,8.8e-05,3.9e-05,5.2e-05,9.1e-05,4.2e-05,3.5e-05,3.2e-05,1.4e-05,6.3e-05,6.4e-05,2.1e-05,3.4e-05,1.9e-05,3.8e-05,3.4e-05,1.2e-05,2.4e-05,2e-05,9e-06,2.8e-05,4.5e-05,1.5e-05,2.5e-05,3.9e-05,1.7e-05,1.5e-05,3.6e-05,1.1e-05,1.4e-05,7e-06,2.8e-05,1e-05,2.6e-05,1.6e-05,1e-05,1e-05,1e-05,1.3e-05,1.4e-05,6e-06,9e-06,1.8e-05,9e-06,1e-05,2.3e-05,6e-06,1.3e-05,1.1e-05,4e-06,1.7e-05,2.1e-05,7e-06,9e-06,4e-06,5e-06,8e-06,2.2e-05,2.9e-05,4.4e-05,0.000182,5.8e-05
1e-05,1.5e-05,7e-06,7e-06,0.000115,0.000549,0.000275,0.000232,3.2e-05,5.2e-05,2.3e-05,2e-05,1.5e-05,0.000159,0.000201,0.000445,0.00064,0.000458,0.000563,0.000253,0.000541,0.000255,0.00047,0.00027,0.000298,0.000228,0.000375,0.000224,0.000173,0.000215,0.000391,9.4e-05,0.000326,0.00015,0.000309,0.000251,0.00021,0.000177,0.000322,0.000222,0.000273,0.000389,0.000196,0.000135,0.000243,6.1e-05,0.000152,0.000117,0.000219,0.000253,0.000213,7e-05,0.000285,3.2e-05,5.8e-05,0.000158,0.000435,0.000286,6.1e-05,1.8e-05,8.4e-05,3.2e-05,3e-05,6.7e-05,1.4e-05,3e-05,5e-06,7e-06,2.7e-05,3.1e-05,2.6e-05,3.7e-05,4.8e-05,3.8e-05,6e-06,2.3e-05,2.4e-05,1.3e-05,1.7e-05,1.6e-05,2.8e-05,8e-06,2.5e-05,2e-05,1.2e-05,1.5e-05,4.4e-05,1.5e-05,1.4e-05,1e-05,2.1e-05,1.6e-05,2.3e-05,1.8e-05,1.3e-05,7e-06,1e-05,5e-06,1.7e-05,1e-05,4e-06,1.9e-05,1e-05,6e-06,1.5e-05,8e-06,7e-06,1.9e-05,1.4e-05,8e-06,1.2e-05,9e-06,7e-06,6e-06,1.1e-05,1.1e-05,9e-06,1.7e-05,3.9e-05,0.000166,0.000103
4e-06,1.2e-05,9e-06,6e-06,0.000104,0.000373,0.000161,0.000159,3.6e-05,7.1e-05,2.5e-05,2.6e-05,1.7e-05,0.000144,0.000182,0.000422,0.000478,0.000315,0.000298,0.000275,0.000278,0.000217,0.000196,0.000228,5e-05,0.000286,9.5e-05,0.000133,0.000323,0.000317,0.000575,0.000228,4.9e-05,0.000425,0.000355,0.000405,0.000248,0.000242,0.000147,0.000215,0.000183,0.000214,0.000204,2.1e-05,0.000216,0.00013,0.000224,3.8e-05,0.000142,0.000152,0.000214,0.000118,0.000227,8e-05,6.7e-05,0.000126,5.5e-05,0.00011,0.000137,4.7e-05,1.9e-05,9.2e-05,3.3e-05,4.9e-05,3.4e-05,2.9e-05,3.1e-05,1.4e-05,5.4e-05,1e-05,4e-06,3.1e-05,3.9e-05,2.6e-05,5.2e-05,3.8e-05,3.2e-05,4e-06,1.2e-05,4e-06,4e-05,1.5e-05,8e-06,2.2e-05,1.5e-05,2.1e-05,4.8e-05,2.1e-05,1e-05,6e-06,9e-06,1.8e-05,1.7e-05,1.9e-05,2.1e-05,6e-06,9e-06,1.6e-05,1.7e-05,3e-06,8e-06,1.5e-05,5e-06,4e-06,2e-06,7e-06,1.2e-05,1.4e-05,4e-06,1.2e-05,3e-06,1.4e-05,7e-06,4e-06,5e-06,1.3e-05,2.3e-05,1.2e-05,3.6e-05,0.000142,2.8e-05
9e-06,7e-06,3e-06,8e-06,9.2e-05,0.000124,0.000144,0.000135,2.2e-05,6e-06,2.2e-05,1.3e-05,6e-06,0.000206,0.000417,0.000235,0.00027,0.000137,0.000159,0.000264,0.000159,0.000306,0.00035,0.000376,0.000112,0.000243,0.000304,0.000134,0.000451,0.000287,0.000154,0.000344,0.000165,0.000247,2.2e-05,0.000145,0.000322,0.000302,0.000401,0.000125,0.000186,0.000262,0.000254,0.000153,0.000388,6.3e-05,0.000271,0.000153,0.000236,0.000247,8.7e-05,8.3e-05,0.000156,4.5e-05,1e-04,0.000127,0.000468,0.000137,8.7e-05,2.8e-05,4.9e-05,9.3e-05,1.7e-05,6.3e-05,4.9e-05,3.3e-05,4.7e-05,1.1e-05,4.3e-05,1.7e-05,3.2e-05,3.2e-05,6.3e-05,7.5e-05,2.9e-05,1.1e-05,3.7e-05,3e-05,5.4e-05,1.5e-05,2.6e-05,6e-06,2.1e-05,4.5e-05,1e-05,1.5e-05,1.6e-05,1.4e-05,1.5e-05,1.3e-05,2.1e-05,8e-06,1.9e-05,1.3e-05,1e-06,8e-06,8e-06,1.1e-05,1.9e-05,8e-06,8e-06,1.5e-05,5e-06,6e-06,1.8e-05,1.8e-05,4e-06,1.3e-05,7e-06,1e-05,1.2e-05,1e-05,6e-06,6e-06,5e-06,2e-05,8e-06,2.6e-05,5.5e-05,0.000113,3.9e-05
1.5e-05,1.5e-05,6e-06,1.1e-05,0.000101,0.000222,0.000217,8.4e-05,7.6e-05,7.5e-05,6.3e-05,1.9e-05,1.8e-05,0.000226,0.000234,0.000194,0.000305,0.000295,0.000369,0.000358,0.000231,0.000213,0.000371,0.000397,0.000139,0.000313,0.000239,0.00022,0.000403,0.000364,0.000148,0.000274,4e-05,0.000102,6.2e-05,7.7e-05,0.000214,0.000327,0.00034,0.00041,0.000114,0.000349,0.000235,0.000197,0.000184,0.000121,0.000183,0.00025,0.000106,0.000133,0.000112,1.9e-05,0.000204,3.9e-05,8.1e-05,6.9e-05,0.000522,0.000263,0.000247,0.000164,5.7e-05,8.7e-05,0.000133,4.4e-05,7.7e-05,8.1e-05,1.9e-05,4.2e-05,6.2e-05,3.3e-05,3.1e-05,3.5e-05,3.8e-05,0.000138,0.000108,7.8e-05,7e-06,4.1e-05,6e-05,4.4e-05,9e-06,6e-06,1.5e-05,1.3e-05,2e-05,1.2e-05,2.5e-05,1.7e-05,3e-06,6e-06,4e-05,1.3e-05,1.4e-05,2.1e-05,2.7e-05,1.8e-05,2e-05,1.7e-05,3.5e-05,2.3e-05,3e-06,2.5e-05,9e-06,5e-06,2.5e-05,9e-06,2e-06,1.3e-05,1e-05,1e-05,1.8e-05,1.5e-05,9e-06,1e-05,1.6e-05,6e-06,2.2e-05,2.6e-05,4.3e-05,0.000111,3.1e-05
9e-06,1.3e-05,2e-06,1.3e-05,7.8e-05,0.00018,0.000316,0.000346,0.000109,8.1e-05,3.5e-05,6.1e-05,3.9e-05,0.000184,0.000294,0.000191,0.000223,0.000367,3.5e-05,0.000119,0.000609,0.000557,6e-05,0.000143,0.000122,0.000228,0.000133,0.000126,0.000159,0.000373,0.000258,0.000459,2.8e-05,0.000232,5.2e-05,0.000142,0.000155,0.000206,0.00017,0.000286,0.000188,0.00024,0.000227,0.000194,0.000293,0.000115,0.000165,0.00021,7.2e-05,0.000397,1.4e-05,8.1e-05,0.00012,7.1e-05,0.000119,0.000143,0.000149,7.1e-05,0.000189,2.8e-05,8.5e-05,0.000107,0.000157,0.000197,8.8e-05,2.1e-05,6.9e-05,8.9e-05,3.4e-05,5e-06,3.1e-05,5.8e-05,9.2e-05,0.000155,5.4e-05,4.3e-05,1.5e-05,7.3e-05,1.1e-05,2e-05,3.2e-05,2.1e-05,2.2e-05,4.1e-05,5e-05,3.3e-05,5.1e-05,6e-06,2e-06,2e-06,2.9e-05,1.6e-05,1.3e-05,2e-05,3e-05,5e-06,2.9e-05,1.6e-05,2.1e-05,1.8e-05,1.9e-05,7e-06,1.4e-05,1e-06,1.7e-05,8e-06,1.1e-05,2e-06,4e-06,4e-06,1.4e-05,1.1e-05,1.5e-05,6e-06,1.4e-05,2e-05,3.2e-05,8e-06,4.2e-05,5.8e-05,3.4e-05
1.3e-05,1e-05,2e-06,1.5e-05,7.9e-05,4.1e-05,0.000247,0.000104,5.7e-05,3e-05,3.5e-05,2.6e-05,2.2e-05,0.000133,0.00032,0.000292,0.000254,0.000385,0.000295,5.9e-05,0.000579,5e-05,0.000132,0.000276,9.5e-05,0.000249,0.000132,0.000151,0.000193,0.000315,0.00045,8.9e-05,0.00017,8.9e-05,0.000106,0.000157,0.000227,6.7e-05,0.000305,0.000169,0.00013,0.000216,0.000256,7.7e-05,0.000256,9.5e-05,2e-04,1e-05,0.000209,0.000251,0.000201,0.000108,7.6e-05,0.000153,5.9e-05,0.000169,0.000245,9.6e-05,0.000152,0.000159,4.8e-05,3.5e-05,7.9e-05,3.7e-05,1.6e-05,8.3e-05,0.000106,4.6e-05,0.000107,3.7e-05,5.7e-05,2.8e-05,5e-05,5.5e-05,3.3e-05,1.8e-05,3.4e-05,5.2e-05,3.8e-05,1.6e-05,1.3e-05,2.7e-05,1.4e-05,4.9e-05,5.9e-05,5e-05,4e-05,2.2e-05,1.7e-05,1.3e-05,2.2e-05,1.9e-05,2.1e-05,1.4e-05,5e-06,2.6e-05,2.4e-05,1e-06,1e-05,1.2e-05,9e-06,1.4e-05,9e-06,4e-06,1.6e-05,1e-05,9e-06,7e-06,8e-06,1.5e-05,2e-06,1.2e-05,7e-06,1e-05,1.1e-05,9e-06,1.9e-05,1.3e-05,2.1e-05,7.9e-05,3.9e-05
6e-06,1e-05,3e-06,1.2e-05,7.5e-05,0.000101,0.00017,0.000115,7.2e-05,1.4e-05,2.8e-05,4.2e-05,8e-06,0.000142,0.000189,0.000359,0.000143,0.000303,8.4e-05,0.000106,0.000324,0.000364,2e-04,0.000192,8.3e-05,0.000234,0.000146,0.000162,0.000279,0.000218,0.000371,0.000298,0.000193,0.000111,0.000128,4e-05,0.000117,0.000133,0.000264,0.000302,8.4e-05,0.000296,0.000222,8.8e-05,0.000167,0.000132,0.000161,0.000237,0.000256,0.000197,6.1e-05,6.4e-05,0.000166,4.3e-05,4e-05,0.000134,0.000246,0.000216,0.000113,0.000147,0.000124,3.8e-05,3.6e-05,2.3e-05,8e-06,9.9e-05,6.4e-05,1.7e-05,0.000105,7.6e-05,2.6e-05,3.8e-05,3.5e-05,4.3e-05,5.8e-05,3.7e-05,2.8e-05,4.5e-05,1.4e-05,6e-06,2.7e-05,2.1e-05,2.8e-05,3e-06,3e-05,1.6e-05,5e-05,2.9e-05,6e-06,1.8e-05,4.4e-05,1e-06,5e-06,2.2e-05,2.1e-05,3.2e-05,1.9e-05,1.2e-05,1.9e-05,1.3e-05,4e-06,1.8e-05,1.4e-05,1.6e-05,2.3e-05,2.3e-05,1.5e-05,1.1e-05,1.1e-05,1.2e-05,7e-06,7e-06,1.4e-05,1.3e-05,1.5e-05,5e-06,1.1e-05,1.9e-05,9e-06,0.000143,7.4e-05
9e-06,9e-06,7e-06,8e-06,7.6e-05,0.000101,0.000242,0.000325,0.000212,0.000103,7.9e-05,5.9e-05,1.9e-05,0.000143,0.000234,0.00033,0.000304,0.000324,0.000283,7.4e-05,0.000114,0.000176,0.000194,0.000197,6e-05,0.000217,0.000152,0.000138,0.000236,6.3e-05,0.000428,0.000184,0.000148,0.000171,0.000123,0.000197,3.7e-05,0.000156,2.6e-05,2.3e-05,0.000218,0.000116,0.000337,0.000217,0.000282,8.1e-05,0.00026,0.000292,0.000163,0.000182,7.6e-05,1.4e-05,0.000167,4.4e-05,4.7e-05,0.000137,0.000196,0.00015,3e-05,0.000112,6.3e-05,9.6e-05,8e-06,7.1e-05,4e-05,4.3e-05,5.7e-05,8.2e-05,7.7e-05,2.8e-05,2.4e-05,3.1e-05,2.6e-05,6.1e-05,2.5e-05,4.2e-05,1.8e-05,4.6e-05,2.7e-05,1.4e-05,1.8e-05,1.8e-05,1.8e-05,2.5e-05,8e-06,3.2e-05,5e-06,3e-06,1.1e-05,1.8e-05,1.4e-05,1.4e-05,1.8e-05,2e-05,2.5e-05,7e-06,1e-05,1.4e-05,1.9e-05,1e-05,1.6e-05,1.7e-05,3e-05,6e-06,1e-05,9e-06,1.1e-05,3e-06,1.6e-05,2.4e-05,7e-06,1e-05,1.6e-05,2e-06,5e-06,1.4e-05,1.3e-05,1.1e-05,1.8e-05,0.000164,4.8e-05
8e-06,1.4e-05,1.3e-05,1e-06,7.4e-05,8.1e-05,0.000299,0.00014,5.5e-05,3.9e-05,4.2e-05,1.2e-05,2.2e-05,0.000142,0.000238,0.000265,0.000123,0.000374,0.000148,6.9e-05,5.1e-05,0.000225,0.00021,0.000169,5.4e-05,0.000198,0.000127,0.000159,0.000191,1.4e-05,0.000207,0.000493,0.000236,0.000102,0.000107,0.000167,0.000198,0.000156,7.4e-05,7.2e-05,0.000204,0.000238,0.000252,0.000128,0.000124,0.000106,3e-04,9.8e-05,0.000325,0.000221,7.9e-05,9e-06,0.000215,5.3e-05,0.00011,0.00013,0.000238,6.3e-05,5.4e-05,5.3e-05,7e-05,1.9e-05,2.4e-05,4.9e-05,1.6e-05,3.7e-05,4.7e-05,4e-05,2.1e-05,9.6e-05,5e-06,2.2e-05,2.6e-05,7.3e-05,7.8e-05,2.1e-05,3e-05,1.8e-05,4e-06,6e-06,3.2e-05,5e-06,1.5e-05,2.7e-05,2.1e-05,2.5e-05,3.1e-05,3e-06,1.3e-05,1e-05,2.3e-05,1e-05,1.6e-05,2.1e-05,1.1e-05,7e-06,9e-06,1.4e-05,1e-05,1.3e-05,3e-05,1.3e-05,1e-05,1.1e-05,9e-06,2e-06,7e-06,8e-06,7e-06,5e-06,1e-05,1.3e-05,7e-06,8e-06,9e-06,9e-06,4e-06,2.8e-05,1.8e-05,0.000145,5.9e-05
1.2e-05,2e-06,1e-05,1.3e-05,8.2e-05,0.000177,6.5e-05,6.9e-05,8.2e-05,4.3e-05,1.8e-05,7e-06,2.4e-05,0.00016,0.000154,0.000124,3e-04,0.000298,0.000297,0.000108,0.000146,0.00021,0.000296,0.000239,8e-05,0.000155,0.000149,0.00015,0.000219,0.000138,0.000219,0.000278,8.7e-05,0.000152,4.1e-05,0.000143,0.000122,0.000153,0.000261,9e-05,0.000161,0.000136,0.000116,0.000134,0.000165,0.000137,0.000215,8.4e-05,2.9e-05,0.00018,5.4e-05,1.7e-05,0.000149,0.000148,3.1e-05,0.000126,0.000144,3e-05,1.7e-05,3.6e-05,9.1e-05,8.9e-05,3.7e-05,6.4e-05,1.1e-05,2.1e-05,6.5e-05,6.8e-05,3.6e-05,9.8e-05,0.000105,4.9e-05,6.2e-05,7e-05,3.3e-05,9e-06,1.6e-05,1e-05,1.1e-05,1e-05,4.5e-05,2.6e-05,3e-06,2.2e-05,1.6e-05,3.6e-05,9e-06,9e-06,2e-05,9e-06,3e-05,1.1e-05,1.2e-05,1.6e-05,3e-06,9e-06,1.6e-05,3.1e-05,2.8e-05,1.5e-05,6e-06,2.6e-05,1.6e-05,1.5e-05,9e-06,9e-06,9e-06,7e-06,6e-06,5e-06,4e-06,1.5e-05,1.7e-05,1.3e-05,1.4e-05,4e-06,6e-06,2.7e-05,5e-05,0.000182,7.5e-05
4e-06,1.5e-05,1.3e-05,2e-06,8.7e-05,0.000183,0.000206,1.5e-05,6.6e-05,4.4e-05,2e-05,2.1e-05,6e-06,0.00016,0.000213,0.000139,0.000136,0.000154,0.000199,0.000111,0.000306,0.000236,0.000336,0.000188,9.4e-05,0.000182,0.000123,0.000145,0.00024,0.00016,6.9e-05,0.000188,0.000378,0.000112,0.000159,8.6e-05,0.000166,0.00013,0.000135,0.000225,3.9e-05,0.000111,0.000232,3.3e-05,0.000211,0.000136,0.000184,0.00025,0.000152,0.000316,0.000235,0.000123,0.000194,0.000145,0.000155,9.9e-05,7.8e-05,9.4e-05,3.7e-05,0.000111,9e-06,8.6e-05,6e-05,9e-05,4.6e-05,2.2e-05,4.7e-05,3.6e-05,3.9e-05,4.8e-05,7.2e-05,6.6e-05,8.1e-05,0.000113,8.1e-05,3.6e-05,2.8e-05,5.9e-05,3.2e-05,2.5e-05,1.6e-05,2.8e-05,4.9e-05,2.1e-05,5.9e-05,2.7e-05,5.4e-05,2.1e-05,3.2e-05,4.9e-05,1.8e-05,1.3e-05,6e-06,2.8e-05,4e-05,2.7e-05,3e-05,4.8e-05,2e-05,2.4e-05,1.1e-05,1.5e-05,3.8e-05,4e-06,1.6e-05,2.2e-05,2e-05,6e-06,1e-05,2e-06,7e-06,9e-06,5e-06,3e-06,1.4e-05,1.3e-05,2e-06,3e-06,7.5e-05,0.000137,0.000123
3e-06,9e-06,1.7e-05,9e-06,8.3e-05,0.000166,0.000162,0.000113,0.000117,7.2e-05,5.1e-05,4.4e-05,1e-06,0.000163,0.000101,0.00035,0.000274,0.000176,0.000205,0.000119,0.000403,0.000336,0.000247,0.00032,0.000166,0.000151,0.000118,0.000177,0.00018,0.000191,4.8e-05,0.000109,0.000139,0.000141,0.00018,0.000222,6.8e-05,0.000131,0.000118,0.000243,0.000176,0.000186,0.000285,0.00013,0.000144,0.000119,0.000116,0.000393,0.000488,0.00033,0.000143,7.8e-05,0.000271,0.00018,7.6e-05,0.000166,0.000228,0.00021,0.000196,0.000149,5.4e-05,4.7e-05,7.5e-05,0.000121,8.4e-05,5.7e-05,4.7e-05,0.000103,0.000104,0.000107,0.000104,5.8e-05,1e-06,6.2e-05,5.6e-05,6e-05,7e-05,0.000113,7e-05,1e-05,2.4e-05,2.5e-05,4.5e-05,3.6e-05,5.7e-05,6.3e-05,3.5e-05,4.4e-05,5.9e-05,7.2e-05,4.4e-05,6e-06,1e-05,1.7e-05,6.2e-05,3.4e-05,3.3e-05,3.2e-05,1.6e-05,1.5e-05,1.3e-05,1.3e-05,4.1e-05,3.6e-05,6e-06,1.1e-05,1.2e-05,8e-06,1.6e-05,1.5e-05,9e-06,1.2e-05,1.5e-05,7e-06,8e-06,1.2e-05,1.7e-05,1.9e-05,9.2e-05,0.000158,8.5e-05
5e-06,4e-06,9e-06,1e-05,7.6e-05,0.000139,7.3e-05,2.7e-05,6.2e-05,8.6e-05,8.6e-05,4.2e-05,3.3e-05,0.000144,0.000224,0.000228,0.00012,0.000221,0.000199,4.3e-05,0.000201,0.000135,1e-04,0.000132,4.4e-05,0.000199,6.6e-05,0.000117,0.00021,0.000173,2e-04,0.000244,0.000135,8e-05,0.000108,0.000227,0.000245,0.00017,0.000159,5.4e-05,0.000186,6.8e-05,0.000148,7.1e-05,0.000193,0.000169,1.5e-05,0.000196,8.9e-05,8.3e-05,4.5e-05,6.7e-05,0.000142,3.8e-05,3.2e-05,0.000102,0.000328,0.000248,6e-05,5.4e-05,7.9e-05,9.5e-05,9.3e-05,0.000111,7.9e-05,7.6e-05,5e-05,2.6e-05,5e-05,6.1e-05,1.7e-05,4.4e-05,2.9e-05,3.3e-05,4.4e-05,3.8e-05,1.3e-05,6.1e-05,4e-05,4e-05,4.8e-05,3.4e-05,2.1e-05,2.2e-05,2.7e-05,7e-06,2e-06,3.1e-05,1.6e-05,2.9e-05,7e-06,1.5e-05,2.3e-05,2e-05,4.7e-05,1.7e-05,2.3e-05,9e-06,5e-06,9e-06,2e-06,1e-05,1.9e-05,1.5e-05,2.4e-05,5e-06,3e-06,1.1e-05,1.4e-05,9e-06,7e-06,6e-06,7e-06,2e-06,4e-06,1.3e-05,1.3e-05,1.9e-05,5.4e-05,9.9e-05,7.7e-05
3e-06,2e-06,3e-06,2e-06,8e-05,9e-05,5.3e-05,6e-05,8e-06,5.2e-05,2.6e-05,1.7e-05,6e-06,0.000128,0.000219,0.000254,0.000234,0.000144,0.000139,9.4e-05,5.1e-05,0.000265,0.000117,0.000154,2.8e-05,0.00017,0.000106,9.9e-05,0.000183,8.8e-05,0.000133,0.000124,0.00015,7.4e-05,0.000108,0.000175,9.5e-05,7.1e-05,5.1e-05,4.8e-05,0.000181,0.000168,0.000126,5.1e-05,0.000185,0.000115,2.8e-05,2.4e-05,0.000125,9.5e-05,3.5e-05,0.000107,0.000137,2.3e-05,3e-05,7.5e-05,0.000231,4.9e-05,0.000115,2.1e-05,3.4e-05,6.5e-05,1.6e-05,7.1e-05,2.1e-05,2.4e-05,2.3e-05,2.4e-05,3.1e-05,6e-06,1.7e-05,3.2e-05,1.7e-05,2.3e-05,2e-06,8e-06,2.5e-05,2.5e-05,1.2e-05,1.1e-05,1.8e-05,1.9e-05,1.2e-05,1.5e-05,1.4e-05,1.7e-05,1.7e-05,2.2e-05,9e-06,1.8e-05,1.9e-05,1.1e-05,1.9e-05,8e-06,2e-05,9e-06,8e-06,3e-06,7e-06,1e-06,9e-06,2e-06,4e-06,4e-06,8e-06,5e-06,4e-06,7e-06,2e-06,6e-06,2e-06,3e-06,3e-06,2e-06,7e-06,9e-06,8e-06,2.2e-05,3.3e-05,6.9e-05,6.4e-05
3e-06,3e-06,1e-06,2e-06,8e-05,9e-05,1e-04,4.4e-05,7e-06,4.7e-05,2e-05,1.3e-05,2e-06,0.000103,0.000197,0.000277,0.000175,6.9e-05,0.000193,6.1e-05,0.000113,0.000154,0.000132,0.00011,2e-05,0.000227,9.2e-05,0.000107,0.000234,8.3e-05,0.000187,0.000184,0.000165,1.7e-05,5.6e-05,0.000103,8.2e-05,5e-05,4.5e-05,3.1e-05,0.000154,0.000159,0.000192,4.6e-05,0.000212,0.000122,4.6e-05,6.3e-05,0.000129,0.000119,3.5e-05,7.9e-05,0.00012,2.7e-05,5.4e-05,7.6e-05,0.000187,4e-05,8.3e-05,1.9e-05,1.2e-05,2.8e-05,9e-06,4.3e-05,3e-05,1.5e-05,3e-05,1.7e-05,2.1e-05,1.3e-05,1.4e-05,2.3e-05,7e-06,6e-06,5e-06,5e-06,1.4e-05,2e-05,8e-06,7e-06,2.1e-05,1.6e-05,1.2e-05,1.5e-05,6e-06,7e-06,9e-06,1.4e-05,3e-06,1.2e-05,1.6e-05,7e-06,1e-05,8e-06,1.4e-05,4e-06,7e-06,3e-06,8e-06,2e-06,8e-06,5e-06,2e-06,2e-06,9e-06,3e-06,4e-06,6e-06,4e-06,4e-06,3e-06,4e-06,3e-06,2e-06,4e-06,7e-06,8e-06,2e-05,2.6e-05,6.3e-05,2.3e-05
3e-06,3e-06,0,2e-06,7.9e-05,0.000127,6.6e-05,5.7e-05,9e-06,4.5e-05,1.5e-05,1.5e-05,1e-06,8.9e-05,0.000212,0.000254,0.000203,0.000118,0.000159,4.1e-05,8.1e-05,0.000144,0.00014,0.000176,3.7e-05,0.000207,0.00011,0.000108,0.000233,0.000101,0.000107,0.00017,0.00013,8.2e-05,5.8e-05,5.2e-05,8.8e-05,2.2e-05,3.7e-05,1.5e-05,0.000138,0.00015,0.000186,3.8e-05,0.000186,8.9e-05,7e-05,7.5e-05,0.000128,0.000126,5.1e-05,6.5e-05,0.00011,7e-06,3.9e-05,7e-05,0.000203,5.3e-05,8.2e-05,2.1e-05,4e-06,2.9e-05,8e-06,4.4e-05,2e-05,5e-06,2.3e-05,1.7e-05,1.5e-05,1.4e-05,8e-06,1.9e-05,9e-06,1e-05,8e-06,1e-06,1.2e-05,1.6e-05,6e-06,4e-06,1.8e-05,1.3e-05,1.3e-05,1.5e-05,5e-06,3e-06,6e-06,1.4e-05,1e-06,1.1e-05,1.6e-05,5e-06,1e-05,2e-06,1.4e-05,3e-06,6e-06,2e-06,7e-06,2e-06,6e-06,6e-06,2e-06,1e-06,1e-05,4e-06,3e-06,5e-06,3e-06,3e-06,2e-06,4e-06,3e-06,1e-06,5e-06,6e-06,8e-06,1.8e-05,2.7e-05,5.6e-05,2.9e-05
