0.204321,0.244346,0.315101,0.291505,0.224442,0.234676,0.246028,0.229687,0.205699,0.18674,0.186491,0.18597,0.198496,0.216428,0.229143,0.256024,0.294289,0.288628,0.244187,0.189405,0.183024,0.212519,0.171332,0.140235,0.143168,0.147254,0.145631,0.11701
0.253295,0.306182,0.405216,0.379055,0.292378,0.295694,0.297412,0.277117,0.25369,0.232882,0.235904,0.23547,0.249349,0.276052,0.294145,0.331455,0.388821,0.384209,0.323166,0.247037,0.237682,0.275991,0.21958,0.182003,0.187221,0.193595,0.194373,0.157589
0.331677,0.403331,0.547158,0.519898,0.405986,0.393583,0.373913,0.349815,0.329779,0.306914,0.318797,0.320063,0.334396,0.375187,0.403359,0.457628,0.548221,0.54728,0.458282,0.34632,0.331577,0.381946,0.299365,0.253066,0.263664,0.272943,0.278275,0.230017
0.372043,0.451908,0.615255,0.592374,0.478372,0.450177,0.405635,0.383222,0.370329,0.351453,0.37659,0.378902,0.387255,0.431761,0.463049,0.524951,0.634437,0.63814,0.54147,0.414291,0.391829,0.442956,0.345399,0.298822,0.315627,0.323561,0.330376,0.280266
0.372923,0.444443,0.56591,0.546394,0.479779,0.46343,0.410042,0.38295,0.370324,0.365966,0.402659,0.396526,0.389405,0.413999,0.432128,0.48305,0.57448,0.58057,0.514951,0.415257,0.384703,0.416089,0.331578,0.294114,0.306586,0.305782,0.309626,0.273906
0.39532,0.443284,0.475609,0.465594,0.485588,0.518142,0.480436,0.430546,0.410311,0.421913,0.454107,0.447559,0.420437,0.392669,0.379044,0.399178,0.437759,0.438233,0.421381,0.371532,0.341801,0.348455,0.304612,0.277129,0.259569,0.243892,0.243994,0.229049
0.535191,0.551641,0.533893,0.563624,0.641848,0.705638,0.670453,0.606397,0.587213,0.600046,0.623428,0.61157,0.559501,0.499596,0.446706,0.434244,0.456591,0.434149,0.407679,0.380511,0.374964,0.381859,0.365514,0.326942,0.263282,0.237311,0.23843,0.22892
0.855574,0.842091,0.842879,0.911421,1.007185,1.112448,1.071605,0.962917,0.937044,0.980809,0.975227,0.899038,0.839606,0.800558,0.71439,0.705586,0.774519,0.702513,0.596257,0.531437,0.55053,0.584812,0.564738,0.495337,0.380761,0.341077,0.336467,0.318812
1.391441,1.350872,1.430671,1.531111,1.672228,1.909669,1.833478,1.597462,1.542747,1.66408,1.612903,1.384254,1.319193,1.332225,1.20054,1.229993,1.396419,1.255222,1.013119,0.854452,0.909105,0.995352,0.959819,0.848255,0.652456,0.579736,0.549163,0.517521
2.15508,2.103614,2.298522,2.419208,2.638312,3.069263,2.933258,2.523386,2.415228,2.656096,2.551819,2.095739,2.028712,2.087616,1.909418,2.051821,2.363268,2.118274,1.66483,1.365597,1.50483,1.67412,1.618089,1.434436,1.091472,0.971628,0.894811,0.829772
2.955553,2.928315,3.216406,3.316448,3.638665,4.246412,4.040485,3.480138,3.339469,3.752182,3.56988,2.867172,2.8318,2.899278,2.694813,3.047255,3.549626,3.171258,2.425086,1.96511,2.26631,2.552634,2.491006,2.216028,1.668403,1.487364,1.33606,1.219232
3.317478,3.367181,3.674256,3.707919,4.108155,4.760937,4.531374,3.955202,3.8862,4.473251,4.183261,3.347149,3.379214,3.396137,3.220654,3.817122,4.470265,3.981772,2.972982,2.40872,2.91046,3.31303,3.279274,2.958011,2.239125,1.984116,1.719136,1.532634
2.860116,3.00566,3.245815,3.212054,3.582958,4.0989,3.938824,3.528492,3.625483,4.242491,3.887692,3.166996,3.254604,3.22672,3.160529,3.830219,4.438897,3.97287,2.958211,2.404994,2.981736,3.428422,3.467616,3.226437,2.503114,2.18351,1.811882,1.563734
1.943081,2.086178,2.231856,2.175039,2.343289,2.58627,2.56072,2.419278,2.633635,3.084975,2.8051,2.366045,2.423178,2.410683,2.439451,2.905657,3.290471,3.038724,2.366507,1.915579,2.310243,2.671327,2.780429,2.690359,2.179471,1.887253,1.523091,1.2846
1.650091,1.678868,1.770605,1.677538,1.665621,1.728773,1.760049,1.616154,1.708502,2.21351,2.137747,1.629504,1.491115,1.606231,1.664526,1.804186,1.994595,2.042839,1.914697,1.534113,1.497991,1.671942,1.722326,1.708519,1.54199,1.362916,1.145931,1.035864
2.31533,2.375408,2.628382,2.473855,2.354128,2.373891,2.381743,2.040067,1.983147,2.81543,2.762276,1.700537,1.311813,1.695055,1.862513,1.941497,2.144744,2.251907,2.489,2.099624,1.702213,1.707525,1.456994,1.354222,1.391963,1.25068,1.200984,1.272143
3.271677,3.358526,3.841562,3.630119,3.357952,3.388433,3.518434,3.070182,2.816685,3.926353,3.977156,2.461877,1.769272,2.180305,2.390593,2.582665,2.892883,3.090714,3.618314,3.097407,2.422887,2.437519,2.022256,1.756997,1.789097,1.6422,1.635652,1.725384
3.971971,3.9814,4.702391,4.472183,4.025303,4.129308,4.504782,4.0801,3.568281,4.697474,4.957561,3.329853,2.363756,2.509353,2.603604,2.974935,3.427042,3.753825,4.609269,4.035567,3.092235,3.112149,2.652249,2.246655,2.206496,2.023262,1.967024,2.010639
4.121637,3.842666,4.672877,4.518204,4.003351,4.235368,4.836514,4.611812,4.043583,4.85592,5.258456,4.087279,3.092143,2.826204,2.669963,3.15165,3.715449,3.954138,4.838276,4.457002,3.544432,3.454385,2.981573,2.537949,2.378285,2.173612,2.009876,1.982315
3.626506,3.172184,4.076803,4.124803,3.56517,3.762033,4.361664,4.430136,4.180308,4.596488,5.004988,4.745319,3.912715,3.229346,2.97616,3.551324,4.179129,3.954639,4.241765,4.291978,3.899958,3.447866,2.812547,2.478855,2.304051,2.137892,1.905446,1.897423
2.819997,2.516694,3.431346,3.632706,2.913624,2.913623,3.537776,3.790681,3.904554,4.283947,4.60875,5.021383,4.428869,3.337452,3.085966,3.7615,4.388824,3.790913,3.289317,3.743449,4.12437,3.349179,2.479844,2.251628,2.17361,2.069077,1.864855,1.970658
2.191805,1.949597,2.544295,2.802843,2.176074,2.017109,2.552948,2.782196,3.007087,3.393048,3.71953,4.488967,4.067102,2.84533,2.746554,3.364235,3.731874,3.124718,2.373466,3.004474,3.76913,2.971569,2.119525,1.950997,1.847993,1.700241,1.618345,1.823784
1.794745,1.700886,1.834727,1.929147,1.563392,1.349915,1.674319,1.865063,1.950843,2.172461,2.477354,3.143255,2.868599,2.037667,2.146236,2.505641,2.481557,2.052973,1.667722,2.203721,2.700694,2.074381,1.487315,1.440461,1.352376,1.178579,1.182679,1.3382
1.643497,1.730356,1.500277,1.361074,1.21475,1.159029,1.349003,1.376881,1.292614,1.453924,1.662383,1.907106,1.738961,1.39035,1.457823,1.528628,1.438064,1.298028,1.167922,1.459004,1.66148,1.256334,0.945237,1.002591,0.974852,0.878925,0.90863,0.908378
1.556105,1.804646,1.433573,1.128951,1.153253,1.273517,1.387826,1.182381,1.049624,1.222908,1.299598,1.380233,1.383225,1.38764,1.296133,1.053218,1.054195,1.129289,1.068076,1.208081,1.239449,0.914279,0.797728,0.901539,0.849281,0.770241,0.807849,0.800425
1.5407,1.742063,1.453887,1.13361,1.180493,1.411172,1.527096,1.198577,1.100444,1.407262,1.403078,1.464417,1.716478,1.905841,1.722177,1.311124,1.174852,1.197945,1.142714,1.103605,1.073241,0.892186,0.901852,1.010348,0.932321,0.82739,0.836792,0.887276
1.54649,1.546669,1.577587,1.322389,1.28092,1.564689,1.599325,1.277581,1.238798,1.581555,1.64803,1.879857,2.278052,2.44558,2.108981,1.554091,1.315773,1.321527,1.265873,1.09188,1.078504,1.028088,1.051473,1.04554,0.945324,0.850995,0.875343,1.018374
1.531862,1.442128,1.749409,1.550693,1.476907,1.793038,1.793211,1.522466,1.461425,1.622557,1.683448,2.132658,2.570361,2.63674,2.281409,1.732624,1.429138,1.398265,1.2683,1.029643,1.135914,1.241568,1.228359,1.044212,0.916529,0.796124,0.795687,1.005844
1.53593,1.430735,1.730521,1.57429,1.517148,1.897338,1.945691,1.706815,1.661161,1.616719,1.689614,2.218941,2.42679,2.423579,2.300261,1.840975,1.398734,1.315207,1.176475,0.901136,1.056841,1.350344,1.319297,1.033721,0.894717,0.725854,0.689668,0.855143
1.409511,1.288033,1.493074,1.35277,1.265551,1.615094,1.697086,1.521872,1.601861,1.576656,1.707191,2.189432,2.189192,2.235984,2.263973,1.705086,1.193538,1.229172,1.16657,0.791053,0.816914,1.195544,1.165525,0.869581,0.758142,0.583709,0.540329,0.63833
1.169987,1.014148,1.221813,1.186071,1.024286,1.149602,1.14223,1.035578,1.227241,1.320212,1.496053,1.861748,1.814714,1.858983,1.846422,1.328035,1.009983,1.135134,1.05791,0.711835,0.615947,0.879383,0.848581,0.630321,0.574691,0.441479,0.407705,0.460578
0.942518,0.759961,0.933155,1.118353,0.972472,0.884332,0.808254,0.757055,0.916928,1.033947,1.142823,1.356879,1.442258,1.344459,1.199726,0.978675,0.89142,0.913498,0.826897,0.673661,0.641146,0.776842,0.649165,0.494456,0.477232,0.386993,0.319767,0.368472
0.855731,0.663563,0.851354,1.108456,0.916933,0.730587,0.721056,0.725404,0.812219,0.851368,0.848826,1.006141,1.146805,0.926484,0.752758,0.732339,0.70799,0.643416,0.609891,0.598971,0.651655,0.734415,0.528327,0.406637,0.458775,0.40519,0.295954,0.301695
0.825007,0.648499,0.787246,0.968498,0.755834,0.558427,0.569615,0.629161,0.665339,0.661586,0.63597,0.809538,0.898346,0.69007,0.598742,0.579284,0.526778,0.463886,0.488409,0.513913,0.571788,0.604628,0.409335,0.31865,0.400492,0.388294,0.305656,0.262079
0.720058,0.619477,0.625898,0.669394,0.576898,0.458329,0.417479,0.548675,0.605539,0.566423,0.528206,0.651682,0.619953,0.502049,0.459464,0.42157,0.389594,0.380329,0.463396,0.473212,0.430356,0.382424,0.263434,0.229805,0.28568,0.296967,0.274771,0.236991
0.602602,0.51153,0.436626,0.379358,0.42143,0.417528,0.315119,0.465048,0.610074,0.51158,0.428778,0.483842,0.424463,0.365545,0.329471,0.30484,0.262759,0.306468,0.436017,0.403851,0.26204,0.205383,0.19297,0.18101,0.185784,0.190916,0.200843,0.201897
0.450902,0.357572,0.359791,0.303819,0.322305,0.34277,0.247564,0.361367,0.522835,0.424806,0.353288,0.352401,0.308433,0.255549,0.228143,0.221961,0.188171,0.241888,0.332143,0.289898,0.163503,0.151694,0.18494,0.15282,0.13163,0.128603,0.127331,0.166999
0.308731,0.234908,0.304467,0.328489,0.282547,0.249764,0.192033,0.254308,0.356722,0.29309,0.25086,0.265015,0.255643,0.188463,0.190612,0.199113,0.152936,0.157354,0.195671,0.188759,0.148144,0.174538,0.189506,0.127562,0.104693,0.117191,0.10723,0.151234
0.273133,0.163887,0.243959,0.313727,0.251796,0.209717,0.153324,0.187916,0.237103,0.185576,0.169449,0.197072,0.20191,0.166681,0.1707,0.17174,0.119058,0.085749,0.0934,0.139855,0.172501,0.184192,0.178575,0.126457,0.105894,0.133004,0.117581,0.138144
0.254108,0.108865,0.208532,0.259252,0.217847,0.21645,0.125997,0.16323,0.195662,0.126607,0.138974,0.17338,0.151389,0.131272,0.131719,0.122613,0.091874,0.063954,0.056933,0.112247,0.181155,0.164325,0.147461,0.124776,0.09631,0.141615,0.131557,0.13119
