3e-06,6e-06,2e-06,2e-05,2e-06,1.3e-05,8e-06,5e-06,1.7e-05,1.7e-05,2.4e-05,5e-06,3e-06,6e-06,8e-06,5e-06,4e-06,0,3e-06,8e-06,6e-06,1e-06,1e-05,5e-06,5e-06,5e-06,9e-06,1e-06,4e-06,2e-06,2.3e-05,1.4e-05,5e-06,9e-06,1.1e-05,6e-06,2e-06,4e-06,1e-06,1.6e-05,2e-06,2e-06,1.6e-05,7e-06,5e-06,3e-06,1.3e-05,1.5e-05,3e-06,1.5e-05,6e-06,1.3e-05,8e-06,1.2e-05,4e-06,5e-06,8e-06,0,1.2e-05,2.2e-05,1e-06,8e-06,5e-06,1.8e-05,1e-06,1.6e-05,5e-06,6e-06,2e-06,1e-05,5e-06,7e-06,1.1e-05,2e-06,3e-06,5e-06,6e-06,4e-06,8e-06,1e-06,0,5e-06,1.3e-05,0,6e-06,2e-06,9e-06,9e-06,4e-06,7e-06,3e-06,1e-05,8e-06,1.2e-05,5e-06,6e-06,5e-06,1e-06,4e-06,1.1e-05,1.5e-05,1.1e-05,5e-06,1.3e-05,1.2e-05,8e-06,1.3e-05,6e-06,7e-06,6e-06,7e-06,1.2e-05,9e-06,6e-06,4e-06,0,3e-06,1.2e-05,1.3e-05,2e-06,4e-06
1.4e-05,9e-06,9e-06,4.2e-05,2.4e-05,1.7e-05,2e-05,8e-06,3.5e-05,1.1e-05,5.4e-05,3.3e-05,3e-05,1.5e-05,1.7e-05,9e-06,4e-06,4e-06,2.4e-05,4e-06,2.5e-05,9e-06,1.1e-05,2.7e-05,9e-06,3e-06,1.5e-05,7e-06,2.4e-05,2.1e-05,7.3e-05,8.2e-05,3.6e-05,2.6e-05,1.8e-05,2.4e-05,2e-06,1.9e-05,6e-06,4.5e-05,3.7e-05,2.1e-05,2.6e-05,8e-06,1e-05,7e-06,2.7e-05,2.9e-05,9e-06,4.4e-05,7e-06,2.8e-05,2.2e-05,2.1e-05,1.6e-05,1e-05,1.9e-05,2e-06,2.2e-05,5e-05,6e-06,1.8e-05,1.8e-05,4.1e-05,2e-06,4.3e-05,2e-06,3.1e-05,2.3e-05,4e-06,1.6e-05,8e-06,3e-05,2.5e-05,1e-05,2.2e-05,3.2e-05,6e-06,1.9e-05,1.5e-05,1.3e-05,1.9e-05,2.9e-05,1.1e-05,1.1e-05,4e-06,4e-05,1.7e-05,9e-06,2e-05,2e-05,3.6e-05,2e-05,2.2e-05,2.6e-05,1.3e-05,1.2e-05,1.5e-05,1.6e-05,1.5e-05,4e-05,2.3e-05,1.1e-05,2.4e-05,2.7e-05,3.6e-05,4.5e-05,1.9e-05,1.8e-05,2.5e-05,1.2e-05,3e-05,4.1e-05,3.3e-05,2.9e-05,1.3e-05,2.3e-05,2.6e-05,2.2e-05,8e-06,8e-06
3e-06,2.4e-05,4.9e-05,3.2e-05,7.1e-05,4.5e-05,4.1e-05,2.5e-05,2.6e-05,4e-05,5.3e-05,8.3e-05,7e-06,3.3e-05,6.4e-05,5.2e-05,4.3e-05,1e-06,4.3e-05,3.6e-05,2.1e-05,3e-05,6e-05,6e-06,1.7e-05,3.9e-05,1.6e-05,1.7e-05,1.7e-05,1.4e-05,7.7e-05,3.8e-05,4.2e-05,4.2e-05,1.7e-05,3.2e-05,1.5e-05,2.9e-05,4.3e-05,2.7e-05,9.4e-05,5.1e-05,1.5e-05,1.4e-05,1e-05,1.7e-05,3.5e-05,5.7e-05,2.5e-05,3.2e-05,2.4e-05,2.4e-05,5.7e-05,2.4e-05,1.4e-05,4.5e-05,1.7e-05,2e-05,2.9e-05,5.6e-05,2.5e-05,1.9e-05,1.6e-05,5.7e-05,3.5e-05,6.5e-05,5.3e-05,7.6e-05,3.3e-05,1.2e-05,2.4e-05,2.3e-05,2.7e-05,5.1e-05,5.6e-05,6.8e-05,5.5e-05,3.2e-05,2.9e-05,2.4e-05,9e-06,3.7e-05,6.9e-05,4.7e-05,2.4e-05,3.4e-05,7.4e-05,6.2e-05,4e-05,2.1e-05,7.4e-05,4.1e-05,3e-05,2.3e-05,4.4e-05,5.6e-05,4e-05,3.2e-05,5.7e-05,5.5e-05,3.9e-05,1.9e-05,2e-05,5.1e-05,3.4e-05,5e-05,1.5e-05,5.8e-05,3.9e-05,2e-06,3.2e-05,3.7e-05,3.2e-05,3.1e-05,4.9e-05,3.4e-05,3.7e-05,5.7e-05,5.1e-05,4.3e-05,4e-05
4.2e-05,2.4e-05,7e-05,0.000107,9.4e-05,6.8e-05,5.1e-05,3.8e-05,5.7e-05,8.3e-05,7.5e-05,6.9e-05,9.2e-05,9.3e-05,0.000134,0.000121,6.3e-05,8e-06,5.2e-05,2e-05,2.9e-05,4.2e-05,5.9e-05,4.3e-05,1.7e-05,5.5e-05,3.4e-05,4.4e-05,6.8e-05,8.3e-05,1.6e-05,0.000109,5.2e-05,6.8e-05,5.1e-05,0.000107,8.4e-05,6.2e-05,4.8e-05,5.2e-05,7.2e-05,5.8e-05,3.6e-05,4.1e-05,3.7e-05,3.3e-05,3.6e-05,6.3e-05,8.4e-05,7.3e-05,3.4e-05,2.2e-05,7.4e-05,5.5e-05,2.1e-05,5.9e-05,6.8e-05,7.8e-05,3.1e-05,9.8e-05,8.6e-05,5.9e-05,2.4e-05,2.4e-05,3.4e-05,1e-05,1.7e-05,7.3e-05,4.9e-05,2.4e-05,5.5e-05,7.3e-05,6.4e-05,1.9e-05,7e-05,3.1e-05,7.1e-05,3.7e-05,3.3e-05,4.6e-05,4.2e-05,3.6e-05,0.000119,7.5e-05,5.9e-05,1.6e-05,5.5e-05,5.1e-05,5.9e-05,0.000109,0.000114,0.000121,6.8e-05,8.1e-05,1.8e-05,7.4e-05,6.8e-05,3.4e-05,3.6e-05,6.8e-05,9.2e-05,5.9e-05,7.9e-05,2e-05,4.1e-05,4.9e-05,5.7e-05,7.6e-05,7.6e-05,6.5e-05,7.2e-05,7.4e-05,8.1e-05,4.1e-05,0.000101,7e-05,4.6e-05,2.4e-05,6.7e-05,0.000116,5e-05
4.9e-05,6.5e-05,3e-05,6.1e-05,4.4e-05,3.2e-05,4.1e-05,4.8e-05,7.4e-05,3.5e-05,2.7e-05,4.8e-05,6e-05,2.2e-05,0.000109,2.6e-05,5.7e-05,6.8e-05,5.7e-05,7.9e-05,2e-05,4e-06,6.5e-05,1.8e-05,5.5e-05,6.1e-05,2.8e-05,2.9e-05,7.8e-05,3.6e-05,4.9e-05,1.3e-05,3.8e-05,0.000109,0.000102,6.4e-05,6.7e-05,1.8e-05,4.5e-05,1.8e-05,5.7e-05,3.4e-05,3.8e-05,4.2e-05,6.4e-05,1.8e-05,7.7e-05,7.8e-05,8.6e-05,4.3e-05,2.9e-05,6.1e-05,4.9e-05,7.3e-05,5.3e-05,5.6e-05,3.7e-05,8e-05,5.9e-05,8.3e-05,5.4e-05,3.2e-05,2.3e-05,6.2e-05,4.6e-05,2.7e-05,2.7e-05,7.9e-05,6.9e-05,4.9e-05,4.4e-05,4.2e-05,6.4e-05,8.1e-05,4.7e-05,2.2e-05,2.9e-05,3.6e-05,4.8e-05,0.00014,0.000112,5.1e-05,7e-05,3.8e-05,7e-05,8.4e-05,9e-05,5.6e-05,8.5e-05,8.5e-05,5.7e-05,8e-05,6.1e-05,0.000112,9.1e-05,0.000103,9.4e-05,7.7e-05,6e-05,2.9e-05,4.8e-05,5.2e-05,8.6e-05,8.4e-05,0.000108,3e-05,1.7e-05,2e-05,3.2e-05,4.1e-05,8.3e-05,2.4e-05,3.5e-05,7.5e-05,8.5e-05,9.9e-05,0.000109,8e-05,8.8e-05,9.7e-05,6.3e-05
0.000116,7.9e-05,4.6e-05,8.5e-05,0.000134,6e-05,7.2e-05,8.6e-05,6.8e-05,8.8e-05,6.5e-05,5e-05,4.4e-05,3.3e-05,7.3e-05,6.2e-05,6e-05,5.8e-05,8.3e-05,7.7e-05,4.7e-05,2.9e-05,5.1e-05,7.4e-05,7.8e-05,9.3e-05,6.5e-05,3.2e-05,6.3e-05,0.000103,0.00011,5.2e-05,6.4e-05,0.000146,6.7e-05,0.000114,6.3e-05,2.8e-05,6e-05,8e-05,2.8e-05,4.9e-05,5.3e-05,1.9e-05,5.1e-05,6.2e-05,9.7e-05,0.000105,8.5e-05,4.3e-05,5.7e-05,8.6e-05,3.9e-05,0.000119,3.7e-05,5.9e-05,6.3e-05,8e-05,1e-05,5.2e-05,6.6e-05,4.5e-05,7.2e-05,4.1e-05,4.8e-05,3.2e-05,5e-05,5.6e-05,2.7e-05,5.6e-05,2.6e-05,2.3e-05,4.7e-05,4.2e-05,7.1e-05,3.9e-05,5.2e-05,6.7e-05,4.5e-05,0.000151,5.4e-05,2e-05,6e-06,2.6e-05,6e-05,0.000145,0.000106,5.7e-05,0.000112,0.000148,0.000109,3.9e-05,3.6e-05,0.000146,0.000103,3.3e-05,5.7e-05,9e-05,7.1e-05,0.000134,3.1e-05,0.00012,3e-05,3.4e-05,2.9e-05,5.1e-05,6.4e-05,7.5e-05,6.6e-05,5.1e-05,9.1e-05,6.1e-05,9.1e-05,6.3e-05,0.00014,3.4e-05,1.8e-05,2.8e-05,4.9e-05,3.1e-05,5.4e-05
0.00014,8.8e-05,9.6e-05,0.000139,0.000106,0.000199,0.00014,5.3e-05,3e-05,7.2e-05,5e-05,3.6e-05,6.2e-05,3.6e-05,5.4e-05,6.2e-05,0.000138,5.7e-05,8.7e-05,6.9e-05,9e-05,0.000116,5.3e-05,6.1e-05,7e-06,4.2e-05,2.3e-05,4.9e-05,1e-05,5.3e-05,3.9e-05,0.000186,0.000134,0.000119,0.000113,0.000132,0.000113,4.5e-05,0.000116,7.2e-05,0.00011,7.2e-05,3.3e-05,0.000124,2.9e-05,8.7e-05,0.000114,5e-06,6.1e-05,8.5e-05,0.000121,8.1e-05,0.000141,0.000152,0.000108,5.6e-05,3.4e-05,9.6e-05,8.7e-05,3.9e-05,0.000107,7.1e-05,0.000181,0.000144,5.2e-05,5e-05,8.2e-05,0.000116,9.9e-05,8e-05,9.8e-05,4.1e-05,6.5e-05,7.6e-05,0.00011,6.5e-05,0.000106,5.8e-05,4.9e-05,5.2e-05,6.7e-05,1e-04,0.000177,9e-05,0.000102,0.000111,8.4e-05,4.8e-05,8.2e-05,8e-05,0.000265,0.000211,0.000135,0.000131,3.1e-05,8.1e-05,9.9e-05,0.000105,0.000139,0.000119,9.8e-05,0.000145,0.000159,5.1e-05,8.1e-05,0.000109,4e-05,5.4e-05,5.4e-05,1.1e-05,9.7e-05,0.000119,0.000175,0.000186,0.000164,0.000148,9.3e-05,7.7e-05,6.8e-05,0.000111,0.000103
9.7e-05,0.000158,0.000156,7.8e-05,0.000216,0.000139,4.9e-05,6.7e-05,5.2e-05,8.1e-05,7.7e-05,5e-05,4.7e-05,3.1e-05,9.7e-05,3.7e-05,0.000127,0.000109,6.6e-05,0.000149,0.000163,3.9e-05,5.9e-05,3.9e-05,8.3e-05,6.6e-05,9.7e-05,8.9e-05,8.3e-05,3.5e-05,9.7e-05,0.000211,0.000145,0.000136,6.8e-05,8.9e-05,4e-05,2.9e-05,0.00014,0.000155,0.000103,6.5e-05,0.00012,0.000234,0.000131,6.2e-05,8.2e-05,4e-05,5.4e-05,4.5e-05,0.000128,3e-05,0.000128,7.7e-05,0.000109,0.000118,4e-05,8e-06,4.2e-05,0.000124,7e-05,6.7e-05,0.000162,0.000105,8e-05,8.2e-05,7.5e-05,0.000122,9.5e-05,0.000131,7.7e-05,0.000124,9.9e-05,8.3e-05,7.3e-05,6.8e-05,0.000108,0.000161,0.000116,2.1e-05,2.1e-05,7.7e-05,0.000197,0.000123,3.3e-05,0.000162,0.000134,4.6e-05,1.6e-05,8e-05,0.000225,0.00018,1.7e-05,6.2e-05,5.5e-05,0.000111,4e-05,3.9e-05,4.2e-05,6.3e-05,1.5e-05,2.8e-05,0.000119,0.000119,0.000145,0.00019,0.00015,8.1e-05,7.7e-05,0.000114,0.000116,5.9e-05,0.000135,0.00012,7.8e-05,9.1e-05,1e-05,4.5e-05,6.9e-05,6.6e-05,0.000144
4.4e-05,0.000124,0.000167,0.000166,9.6e-05,9.2e-05,6.2e-05,8.9e-05,0.000149,1.9e-05,9.5e-05,0.000138,6.4e-05,5.8e-05,9.2e-05,7.6e-05,0.000127,3.4e-05,0.00011,0.000111,5.8e-05,1.3e-05,0.000119,5.5e-05,0.000118,5.5e-05,8.7e-05,1.4e-05,4.7e-05,9e-05,0.000132,7.8e-05,0.000112,9.1e-05,3.5e-05,0.000138,0.000124,9.2e-05,0.00013,5.2e-05,0.000112,5.3e-05,0.00011,0.000119,0.000187,0.000151,9.3e-05,0.000114,8.4e-05,6.1e-05,9.7e-05,0.000143,3.1e-05,0.000104,7.2e-05,7.7e-05,6.5e-05,0.000106,5.1e-05,0.000143,0.000121,3.7e-05,7e-05,0.000107,0.000101,4.5e-05,5.3e-05,9.8e-05,4.6e-05,7.5e-05,7.9e-05,0.000144,7.4e-05,9.9e-05,9.6e-05,0.000106,2.8e-05,0.00011,7.8e-05,0.000124,0.000102,3.3e-05,0.000146,8e-05,5.5e-05,8.6e-05,9.2e-05,8.3e-05,0.000121,0.000122,0.000223,5.5e-05,0.000133,0.000124,0.000126,1e-04,0.000112,9.2e-05,4.3e-05,6.2e-05,9.1e-05,0.000147,4e-05,8.9e-05,0.000206,3.8e-05,7.5e-05,1e-04,0.000143,3.3e-05,4.7e-05,5.5e-05,5.5e-05,8.7e-05,0.000162,5.5e-05,4.4e-05,6.4e-05,2.4e-05,4e-05,0.000114
8.9e-05,4.1e-05,7.5e-05,7.9e-05,0.000118,0.000105,7.2e-05,2.5e-05,9.9e-05,8.7e-05,0.000131,0.000129,7.2e-05,4e-05,8.1e-05,1.7e-05,5.1e-05,3.3e-05,8.9e-05,2.5e-05,8.6e-05,8.6e-05,0.00016,0.000189,2e-05,6.6e-05,4.5e-05,7.9e-05,0.000132,0.000152,9.5e-05,0.000161,5.2e-05,1.5e-05,0.000114,0.000194,9.2e-05,5e-06,9.4e-05,3.5e-05,0.000103,0.00015,9.7e-05,0.00017,9e-05,5e-05,0.000204,0.000176,0.000132,9.1e-05,1.9e-05,0.000111,0.000163,0.000136,0.000128,7.3e-05,8.5e-05,0.000178,0.000209,8e-05,4.4e-05,6.9e-05,5.8e-05,0.000147,0.000206,0.000186,0.000166,0.000187,0.000133,0.000122,0.000155,7.6e-05,6e-05,0.000107,9e-05,0.000213,0.00019,9.2e-05,1.3e-05,7.6e-05,5.6e-05,9.8e-05,0.000139,9.6e-05,3e-05,2.6e-05,0.000148,0.000122,8.5e-05,0.000125,9.7e-05,3.6e-05,9.3e-05,5.5e-05,1e-04,0.000105,6.5e-05,7.6e-05,0.000108,2.9e-05,6.3e-05,0.00021,0.000141,7.6e-05,0.000103,0.00011,4.3e-05,7.6e-05,3.9e-05,0.000117,9.2e-05,4.7e-05,1e-05,8.1e-05,0.000164,0.000148,9.7e-05,3.1e-05,4.3e-05,3.6e-05,9.4e-05
5.8e-05,7.8e-05,6e-05,8.3e-05,1.5e-05,5.5e-05,3.9e-05,6.7e-05,6.4e-05,0.000126,4.5e-05,4.2e-05,3.5e-05,4.8e-05,2.3e-05,2e-05,3.5e-05,5.3e-05,2.6e-05,2.1e-05,8.9e-05,0.000134,0.000156,5.5e-05,8.8e-05,6e-05,0.000121,4.7e-05,0.000106,3.1e-05,8.4e-05,4.1e-05,1.3e-05,1.5e-05,0.000132,0.00012,8.2e-05,4.2e-05,7.7e-05,0.000102,0.000164,4.7e-05,3.2e-05,7.3e-05,9.4e-05,5.3e-05,0.000159,0.000114,3.2e-05,6.2e-05,7.3e-05,7.8e-05,0.000145,5e-05,0.000131,0.000126,8.7e-05,0.000122,8.9e-05,8.7e-05,1.8e-05,7.9e-05,7.9e-05,7.6e-05,0.00012,4.7e-05,6.1e-05,9.9e-05,0.000142,4.6e-05,0.000114,0.000103,1e-05,3.5e-05,8.9e-05,8.2e-05,3.6e-05,9.4e-05,8.2e-05,1.2e-05,8.3e-05,5.7e-05,1.4e-05,7.1e-05,9e-05,5.4e-05,0.00014,2e-05,0.000136,0.00021,0.000118,3.9e-05,4.5e-05,6e-05,6.7e-05,1.3e-05,6.2e-05,7e-06,5.3e-05,4.6e-05,2.7e-05,0.000117,2.7e-05,3.7e-05,7.6e-05,0.000117,6.3e-05,5.8e-05,7.7e-05,7.2e-05,7.1e-05,3.3e-05,2e-05,0.000103,4.4e-05,6.8e-05,3.9e-05,6.6e-05,3.8e-05,5.2e-05,6.4e-05
4.7e-05,0.000105,1.6e-05,4e-05,4.9e-05,1.8e-05,4.7e-05,3.9e-05,0.000118,0.000103,4.4e-05,8e-06,3.9e-05,4.3e-05,9e-06,1.5e-05,5.2e-05,7.3e-05,5.2e-05,2.1e-05,6.3e-05,2.7e-05,4.1e-05,1.3e-05,3.3e-05,4.1e-05,6.5e-05,5.2e-05,7e-05,5e-05,8.1e-05,5.8e-05,2.7e-05,6.6e-05,5.7e-05,2.9e-05,7e-05,4.3e-05,3.8e-05,2.7e-05,5.5e-05,8.2e-05,5.8e-05,4e-05,6.4e-05,4.2e-05,5.8e-05,3e-05,3.5e-05,2.1e-05,7.4e-05,0.000102,5.1e-05,2.5e-05,0.000111,0.000101,3.3e-05,9.4e-05,5.7e-05,9.5e-05,6.2e-05,4.2e-05,5e-05,9.7e-05,4e-05,6.1e-05,4e-05,3.7e-05,5.9e-05,7.7e-05,0.000142,8.6e-05,2.7e-05,8.1e-05,4.7e-05,8.9e-05,5.3e-05,5.7e-05,1.5e-05,2.8e-05,5e-05,2.5e-05,2.1e-05,6.4e-05,7.6e-05,4.9e-05,6.4e-05,7.4e-05,0.000111,0.000131,5.8e-05,2.6e-05,1.4e-05,7.1e-05,1.3e-05,1.1e-05,4.4e-05,2.9e-05,1.2e-05,7e-06,6.6e-05,7.9e-05,9.9e-05,8.5e-05,0.000104,9.7e-05,6e-06,4.1e-05,2.1e-05,4.9e-05,2.4e-05,7.8e-05,6e-05,9.8e-05,5.3e-05,6.1e-05,2e-05,4.6e-05,1e-04,5.9e-05,2e-05
6.6e-05,7.2e-05,7.1e-05,2.1e-05,4.7e-05,2.8e-05,8.3e-05,9.4e-05,0.000109,5.8e-05,4.4e-05,4.3e-05,4.9e-05,6e-05,6.9e-05,1.7e-05,4.8e-05,3.9e-05,5.8e-05,1.2e-05,4e-06,3.5e-05,1e-05,2.6e-05,4e-05,3.3e-05,1.4e-05,2.2e-05,9e-06,1.5e-05,4.2e-05,3e-05,5.3e-05,6.1e-05,7.2e-05,4.7e-05,4.2e-05,4.1e-05,3.9e-05,2e-05,3.2e-05,4.7e-05,7.7e-05,4.9e-05,7.2e-05,3.1e-05,3.1e-05,6.7e-05,5.6e-05,2.2e-05,4.7e-05,4.7e-05,5.2e-05,6e-05,7e-05,5.1e-05,6.5e-05,3.8e-05,5.1e-05,6.4e-05,6.1e-05,9.7e-05,0.000107,0.00011,7.5e-05,4.8e-05,7.1e-05,2.4e-05,3.5e-05,4.6e-05,5.8e-05,4.3e-05,4.8e-05,3.6e-05,4.2e-05,1e-05,2.1e-05,4e-05,3.8e-05,4.1e-05,3.6e-05,2.3e-05,3.4e-05,7e-06,4e-05,1.8e-05,3.4e-05,7.7e-05,0.000173,2.9e-05,4.6e-05,5.8e-05,4.9e-05,9.2e-05,4.8e-05,2.7e-05,5.1e-05,3.9e-05,3.7e-05,1.6e-05,7.1e-05,8.9e-05,7.5e-05,2.6e-05,0.000134,5.4e-05,3.7e-05,3.9e-05,4.2e-05,4.8e-05,3.7e-05,8.6e-05,5e-05,6e-05,8.1e-05,3.8e-05,2.2e-05,5e-05,0.000133,4.8e-05,4.9e-05
1.3e-05,8.9e-05,3.8e-05,3.3e-05,5.2e-05,1.6e-05,8.7e-05,5.8e-05,1e-05,7.2e-05,0.000103,7.2e-05,5.7e-05,4.8e-05,8.7e-05,5.9e-05,7.7e-05,7.2e-05,0.000101,5.9e-05,8e-06,8.1e-05,5.2e-05,2.7e-05,8.8e-05,4.3e-05,1.1e-05,4.9e-05,2.9e-05,2.9e-05,4.5e-05,5.6e-05,9.3e-05,5.8e-05,9.1e-05,3.9e-05,4e-05,6e-06,5.6e-05,3.9e-05,8.9e-05,7e-06,5.4e-05,3.8e-05,6e-05,2e-05,1.9e-05,3.6e-05,1.5e-05,3.5e-05,3.1e-05,5e-05,4.3e-05,2.8e-05,2.6e-05,5.6e-05,4.6e-05,8.8e-05,6.1e-05,5e-05,3.8e-05,5.9e-05,3.2e-05,6e-05,9.4e-05,6.8e-05,1.5e-05,8.9e-05,4.8e-05,2.2e-05,4.2e-05,8e-05,7e-05,5.6e-05,4.1e-05,1.1e-05,7.8e-05,5.3e-05,3.5e-05,1.7e-05,5e-05,1.7e-05,2.6e-05,2.4e-05,5e-06,3e-05,3.9e-05,7.8e-05,8.3e-05,3.5e-05,4.3e-05,6e-05,1.3e-05,5.9e-05,1.1e-05,6.9e-05,3.4e-05,1.8e-05,2.7e-05,7.6e-05,6.7e-05,3e-06,5.6e-05,1.7e-05,9.6e-05,5.7e-05,6.2e-05,7.9e-05,5.3e-05,1e-05,1.4e-05,3.9e-05,3.3e-05,4.5e-05,9e-05,3.2e-05,2e-05,4.4e-05,6.7e-05,4.6e-05,3.7e-05
4.8e-05,5.3e-05,3.5e-05,3.5e-05,0.000104,6.4e-05,3.4e-05,7.4e-05,2e-05,0.000107,1.5e-05,4.1e-05,4.8e-05,2e-05,7.1e-05,9e-05,0.00011,7.9e-05,3e-06,5.3e-05,4e-05,9.6e-05,4e-05,5.1e-05,0.000131,9.4e-05,4.8e-05,6.4e-05,5.2e-05,5.4e-05,8e-06,7e-05,0.000103,3.5e-05,2.4e-05,3.5e-05,4.9e-05,5.1e-05,5.3e-05,3e-05,9e-05,8.7e-05,1.2e-05,4.9e-05,7.3e-05,3.8e-05,1.8e-05,3.1e-05,5.1e-05,5.2e-05,2e-05,7e-05,3.4e-05,1.9e-05,1.2e-05,5.2e-05,7.3e-05,2.6e-05,0.000106,6.9e-05,0.000102,9.3e-05,8e-05,2.8e-05,7.5e-05,5e-05,4.2e-05,9.7e-05,6.9e-05,6.6e-05,3.9e-05,5e-05,1.6e-05,4e-05,2.3e-05,5.8e-05,9.3e-05,4.4e-05,9.6e-05,7.7e-05,0.00011,6.4e-05,2.1e-05,9.5e-05,5.6e-05,4.5e-05,6.4e-05,1.5e-05,7e-05,9.2e-05,9.2e-05,8.8e-05,9e-05,7.5e-05,5.8e-05,7.1e-05,5.6e-05,4.3e-05,5.6e-05,7.6e-05,9.6e-05,8e-05,3.3e-05,3e-05,0.000108,4.9e-05,3.3e-05,6.4e-05,3.8e-05,5.8e-05,6.5e-05,4.9e-05,1.9e-05,1.8e-05,2.4e-05,5.2e-05,3.4e-05,4.1e-05,4.7e-05,5.3e-05,5.4e-05
6.3e-05,2.3e-05,2.3e-05,9.3e-05,5.4e-05,8e-06,6.4e-05,2.3e-05,1.3e-05,7.6e-05,9.6e-05,2e-06,6e-05,3.1e-05,5.4e-05,2.7e-05,8.6e-05,7.4e-05,8.3e-05,7.2e-05,7.4e-05,9.2e-05,8.9e-05,7.4e-05,5.8e-05,5.3e-05,2.1e-05,5.7e-05,2.4e-05,3.5e-05,2.8e-05,6.8e-05,1.8e-05,1.5e-05,7.1e-05,6.1e-05,2.6e-05,2.2e-05,6.4e-05,7.9e-05,0.000106,4e-05,7e-05,8.8e-05,0.000107,8.5e-05,4.6e-05,6.5e-05,6.1e-05,3.7e-05,3e-06,8e-05,7.4e-05,4.4e-05,4.3e-05,9.5e-05,0.000105,4e-05,5.7e-05,6.2e-05,7.1e-05,3.6e-05,7.8e-05,0.000104,7e-05,9.2e-05,5.9e-05,1.8e-05,4e-05,3.7e-05,4.4e-05,2.5e-05,2.1e-05,5.2e-05,5.1e-05,6.8e-05,7.2e-05,2.2e-05,0.000106,0.000107,7.3e-05,3.7e-05,2.3e-05,0.000114,6.5e-05,2.9e-05,8.5e-05,3.8e-05,5.2e-05,6.8e-05,8e-05,5.5e-05,2.5e-05,2.3e-05,1.4e-05,1e-05,3.7e-05,4.6e-05,1.1e-05,8.8e-05,0.000122,0.000117,9.1e-05,0.000105,4e-05,8.6e-05,7.8e-05,6.4e-05,6.5e-05,1.5e-05,4.1e-05,3.6e-05,6.9e-05,4.4e-05,5.2e-05,5.6e-05,7.9e-05,6.2e-05,4.3e-05,0.000101,0.000158
4.3e-05,5.5e-05,8.5e-05,0.000141,0.000154,9.8e-05,7.6e-05,6.1e-05,5.7e-05,3.9e-05,6.5e-05,5.6e-05,2.3e-05,5.7e-05,3.7e-05,3.9e-05,0.000109,0.000141,3e-05,2.6e-05,0.000133,7.2e-05,8.1e-05,3.2e-05,4.4e-05,7.6e-05,1.3e-05,2.5e-05,9.5e-05,1.2e-05,6e-06,2.5e-05,6.9e-05,5e-05,0.000139,0.000151,9.1e-05,5.1e-05,8.2e-05,4.4e-05,5.3e-05,8e-06,8.3e-05,0.000104,2.7e-05,3.6e-05,4.1e-05,7.7e-05,6.1e-05,5.1e-05,6.8e-05,6.7e-05,5.8e-05,4.8e-05,8.9e-05,0.000143,8.2e-05,8.6e-05,4.6e-05,5.6e-05,6.2e-05,6.6e-05,0.000131,0.000138,1e-04,4.2e-05,0.000104,1.9e-05,2.5e-05,3.6e-05,8e-06,9.6e-05,7.6e-05,3.3e-05,3.8e-05,6.8e-05,8.6e-05,5e-05,0.00014,1e-04,4.9e-05,0.000132,0.000106,7.5e-05,7.6e-05,4.3e-05,5.1e-05,0.000117,1.4e-05,4.4e-05,7.2e-05,4.5e-05,7e-06,5.8e-05,4.4e-05,5.9e-05,2.2e-05,3.6e-05,5.7e-05,0.000111,4.5e-05,7.5e-05,8.4e-05,3.6e-05,2.9e-05,2.7e-05,2.5e-05,3.9e-05,8.6e-05,3.9e-05,5.1e-05,4.3e-05,6.7e-05,5.2e-05,4.8e-05,5.2e-05,3.3e-05,0.000157,4.3e-05,0.000122,7.6e-05
0.000117,0.000147,4e-05,0.000188,6.1e-05,2.3e-05,0.000143,9.7e-05,7.1e-05,5.3e-05,7.8e-05,3.8e-05,3.8e-05,8.3e-05,8.1e-05,2.7e-05,0.000152,0.000141,0.000176,0.000138,0.000178,0.000129,5.5e-05,4.8e-05,3.5e-05,0.000119,9.5e-05,6.9e-05,7.4e-05,6.2e-05,3.4e-05,9.9e-05,0.000148,8.6e-05,0.000102,6.4e-05,5.1e-05,2.5e-05,7.5e-05,9.6e-05,6.6e-05,3.8e-05,0.000117,0.000182,8.7e-05,3.7e-05,5.1e-05,7.6e-05,4.1e-05,8.4e-05,2.9e-05,7.2e-05,2e-05,4.1e-05,4.8e-05,0.000148,9.4e-05,0.000121,6.6e-05,5.9e-05,4.3e-05,6.6e-05,0.000188,0.000196,6.7e-05,5.9e-05,9e-05,0.000163,8.9e-05,2.4e-05,9.2e-05,0.000135,0.00012,2.5e-05,2.7e-05,8e-06,0.000114,8.9e-05,3.4e-05,8.5e-05,5.1e-05,0.000145,0.000116,6.6e-05,4.2e-05,7.2e-05,7e-05,0.000107,0.000109,0.000115,6.1e-05,6.7e-05,4.4e-05,4.5e-05,5.7e-05,0.000144,0.000141,5.7e-05,6.3e-05,6.4e-05,7e-05,5.4e-05,4.8e-05,8.3e-05,9.9e-05,2.9e-05,4.2e-05,8.9e-05,0.000123,0.000123,1e-04,6.5e-05,7.8e-05,6.9e-05,1.5e-05,3.9e-05,3.9e-05,0.00013,0.000154,0.000148,0.000196
9e-06,6.7e-05,0.000106,0.000186,8.9e-05,1.8e-05,9.5e-05,7.9e-05,3.3e-05,5e-05,5.7e-05,3.6e-05,4.9e-05,8.7e-05,3.6e-05,4.8e-05,0.000166,0.000117,0.000174,8.3e-05,7.6e-05,1.2e-05,2.9e-05,4.6e-05,2.1e-05,8.4e-05,0.000113,5.2e-05,5.3e-05,6.6e-05,4.3e-05,0.000138,9.1e-05,0.000106,0.000152,6.4e-05,3e-05,4e-05,5.3e-05,6.5e-05,7.8e-05,0.000121,5.6e-05,9.5e-05,8e-05,2e-05,8.2e-05,2e-05,4.3e-05,4.3e-05,5.9e-05,3e-05,5.2e-05,7e-06,4e-05,6.5e-05,4.5e-05,6.9e-05,4.1e-05,6e-06,4.3e-05,7.3e-05,7.5e-05,0.000236,0.000212,6.8e-05,7.7e-05,0.000134,0.000109,9.6e-05,5.5e-05,2e-05,4.7e-05,7.7e-05,5.9e-05,4.7e-05,0.000117,7.5e-05,1.8e-05,9.3e-05,9.6e-05,5.3e-05,3.3e-05,2.5e-05,6.1e-05,7e-05,2.8e-05,5.3e-05,6.1e-05,3.9e-05,2.4e-05,8.9e-05,5.5e-05,5.7e-05,4e-05,0.000119,7.1e-05,9e-05,9.8e-05,0.000142,0.000117,8.7e-05,6.7e-05,4.8e-05,0.000111,9e-05,7.9e-05,0.000101,7.7e-05,8.8e-05,0.000103,4.9e-05,4.2e-05,5.8e-05,1.5e-05,2.7e-05,2.1e-05,7.6e-05,0.000119,9.5e-05,6.3e-05
3.2e-05,2.7e-05,8.8e-05,4.2e-05,5.1e-05,3.2e-05,5.5e-05,2.9e-05,2.2e-05,3e-05,9e-05,2.8e-05,3.5e-05,2.6e-05,4.8e-05,4.4e-05,9.6e-05,3.5e-05,8.6e-05,7.1e-05,3.6e-05,2.5e-05,2.6e-05,4.3e-05,7.2e-05,1.8e-05,4.6e-05,6.2e-05,5.4e-05,6.2e-05,3.2e-05,7.5e-05,3.8e-05,2.7e-05,5.9e-05,4.5e-05,4.2e-05,4e-05,5.4e-05,2.2e-05,4.1e-05,5.6e-05,1e-04,9e-06,3.5e-05,3.7e-05,5.4e-05,5.2e-05,4.8e-05,4.8e-05,4.8e-05,3e-05,4.5e-05,6.7e-05,7.3e-05,3.5e-05,2.6e-05,5.8e-05,3.4e-05,3.4e-05,2.1e-05,1.9e-05,5.5e-05,1e-04,1.6e-05,4.8e-05,3e-05,2.2e-05,4e-05,3.3e-05,6.4e-05,4.4e-05,1e-05,5.6e-05,5e-05,3.5e-05,6.9e-05,3.8e-05,8.4e-05,0.000116,4.2e-05,8e-05,6.7e-05,4.4e-05,7.8e-05,5.7e-05,5e-05,2.6e-05,5.2e-05,1.8e-05,6.5e-05,6.6e-05,2.3e-05,1.7e-05,4.6e-05,2.2e-05,3.4e-05,5.9e-05,7.2e-05,5.6e-05,1.5e-05,3.5e-05,3.7e-05,8.6e-05,1.4e-05,2.5e-05,1.9e-05,7.6e-05,4.5e-05,6.1e-05,1.3e-05,3.4e-05,5e-05,9.1e-05,7.1e-05,1.8e-05,2.4e-05,7.4e-05,3.8e-05,3e-05,7.1e-05
5.1e-05,5.2e-05,2.1e-05,3e-05,1.9e-05,8e-06,1.1e-05,2.5e-05,3.8e-05,4.1e-05,3.3e-05,4.1e-05,2.7e-05,4.9e-05,2e-05,3.1e-05,7.7e-05,4.2e-05,5.8e-05,4e-05,1.2e-05,1.4e-05,1.6e-05,2.4e-05,4.6e-05,6.5e-05,1.9e-05,2e-05,5e-05,4.4e-05,3e-05,1.7e-05,1.6e-05,9e-06,5e-05,2e-06,1.8e-05,7e-06,2.3e-05,2.6e-05,2.3e-05,1.9e-05,3.8e-05,4.9e-05,1.7e-05,2e-05,6e-05,4.4e-05,4.4e-05,1e-05,1.4e-05,1.7e-05,4.8e-05,4e-05,3.7e-05,1.5e-05,1.5e-05,4e-05,1.5e-05,1.3e-05,3.5e-05,1.8e-05,4.1e-05,9e-06,2.5e-05,3.5e-05,4.2e-05,4.1e-05,1.9e-05,2.8e-05,5.2e-05,3.2e-05,2.8e-05,2.1e-05,2.9e-05,5.8e-05,2.8e-05,4.7e-05,3.6e-05,3.2e-05,1.4e-05,5.5e-05,6.7e-05,9.8e-05,3.5e-05,2.2e-05,1e-05,5.2e-05,1.1e-05,5.1e-05,6e-06,6e-06,5.2e-05,2.6e-05,2.7e-05,3.2e-05,2.2e-05,1.3e-05,3.9e-05,5.9e-05,2.5e-05,3.6e-05,9e-06,4.2e-05,3.2e-05,3.2e-05,2.4e-05,4e-05,2.1e-05,6e-06,2.4e-05,6.1e-05,3.5e-05,3.3e-05,4.7e-05,4.2e-05,1.6e-05,3.2e-05,2.8e-05,3.4e-05,2.9e-05
2.2e-05,2.5e-05,2.9e-05,2.5e-05,4e-06,1.4e-05,1.4e-05,2.3e-05,5e-06,4.1e-05,2.7e-05,1.6e-05,2.5e-05,2.4e-05,2.2e-05,1.8e-05,1.2e-05,3.5e-05,2.6e-05,3.7e-05,2e-05,2.6e-05,1e-05,3e-05,1.6e-05,3e-05,2.1e-05,2.5e-05,6.6e-05,2.1e-05,1.4e-05,1.8e-05,2.5e-05,1.4e-05,4e-06,6e-06,1.4e-05,1.7e-05,1.9e-05,1.6e-05,3.7e-05,1.8e-05,2.1e-05,2.8e-05,1.4e-05,2.9e-05,3e-05,1.1e-05,2.3e-05,3.7e-05,2.3e-05,8e-06,3e-05,2.3e-05,4e-05,3.7e-05,1.9e-05,1.8e-05,3.1e-05,2.5e-05,4.4e-05,1.5e-05,3.4e-05,1.4e-05,2.9e-05,2.4e-05,2.2e-05,4.5e-05,4.3e-05,4.3e-05,2.9e-05,7e-06,3e-05,2.9e-05,4.6e-05,2.9e-05,7e-06,2.9e-05,2.9e-05,1.4e-05,1.5e-05,2.9e-05,1.4e-05,3.9e-05,3.4e-05,1.3e-05,7e-06,4.4e-05,3.7e-05,3.5e-05,2.7e-05,1.2e-05,5.1e-05,1.4e-05,2.1e-05,2.5e-05,2.1e-05,1.7e-05,3e-05,5.7e-05,1.4e-05,2.1e-05,2.4e-05,2.6e-05,2.9e-05,2.1e-05,1.2e-05,3.4e-05,1.4e-05,2.2e-05,3.6e-05,2.1e-05,1.6e-05,2e-05,2.3e-05,4e-06,2.8e-05,3.5e-05,8e-06,1.4e-05,2.1e-05
6e-06,1.1e-05,1.7e-05,9e-06,3e-06,5e-06,7e-06,1.4e-05,6e-06,1.3e-05,1.2e-05,1.2e-05,5e-06,1.4e-05,1.3e-05,2e-06,6e-06,8e-06,1.1e-05,2.5e-05,1e-05,6e-06,9e-06,1.8e-05,8e-06,2e-06,5e-06,9e-06,1.3e-05,1e-05,6e-06,1e-05,1e-05,1.4e-05,1.4e-05,1.2e-05,6e-06,3e-06,4e-06,1.1e-05,1.2e-05,6e-06,1.5e-05,8e-06,8e-06,1e-05,1e-05,1.1e-05,5e-06,1e-05,1.2e-05,0,9e-06,1e-05,1.2e-05,8e-06,1.2e-05,3e-06,1.2e-05,7e-06,1.8e-05,1.6e-05,5e-06,1.3e-05,1.4e-05,8e-06,9e-06,1.9e-05,1.3e-05,1.3e-05,1.9e-05,4e-06,1e-05,5e-06,6e-06,6e-06,8e-06,8e-06,1.7e-05,1.1e-05,1e-05,7e-06,1e-06,1.6e-05,1.1e-05,2.6e-05,1.8e-05,1.3e-05,1.4e-05,9e-06,1.1e-05,4e-06,1.8e-05,1.1e-05,1.8e-05,1.3e-05,3e-06,2.2e-05,1.8e-05,3e-06,8e-06,7e-06,1.1e-05,2e-06,8e-06,5e-06,3e-06,1.5e-05,5e-06,1.5e-05,1.2e-05,1.3e-05,2e-05,1e-05,4e-06,8e-06,6e-06,1.9e-05,9e-06,7e-06,9e-06
6e-06,1.3e-05,1.2e-05,3e-06,9e-06,8e-06,8e-06,1e-05,1.2e-05,1.3e-05,1.3e-05,2.5e-05,1e-05,3e-06,6e-06,6e-06,9e-06,1.1e-05,2e-06,2e-05,1.2e-05,1.3e-05,5e-06,1.8e-05,6e-06,1.4e-05,7e-06,1.2e-05,8e-06,7e-06,1.7e-05,1.7e-05,3e-06,1.3e-05,1e-05,1.2e-05,6e-06,4e-06,4e-06,1.7e-05,1e-05,2e-06,5e-06,6e-06,1e-05,1.2e-05,1.3e-05,1.3e-05,1.3e-05,1.5e-05,6e-06,7e-06,8e-06,5e-06,5e-06,8e-06,6e-06,7e-06,7e-06,9e-06,1.3e-05,2e-05,9e-06,6e-06,1e-06,1e-06,3e-06,3e-06,8e-06,3e-06,1.6e-05,1e-05,7e-06,4e-06,4e-06,1e-05,9e-06,1.3e-05,2.1e-05,1.1e-05,1.3e-05,5e-06,7e-06,2.4e-05,1.5e-05,2e-05,1.1e-05,5e-06,8e-06,3e-06,9e-06,1.1e-05,1.1e-05,9e-06,1.9e-05,1.3e-05,1e-05,1.5e-05,1.8e-05,2e-06,1.2e-05,1.4e-05,8e-06,8e-06,1e-06,1e-05,1.6e-05,1.9e-05,5e-06,1.5e-05,2.2e-05,1.1e-05,1.8e-05,1.4e-05,5e-06,6e-06,6e-06,1.7e-05,8e-06,9e-06,0
6e-06,1e-05,1.7e-05,9e-06,1.3e-05,6e-06,9e-06,8e-06,7e-06,5e-06,4e-06,1.6e-05,6e-06,3e-06,7e-06,5e-06,7e-06,7e-06,1.1e-05,1.4e-05,1.4e-05,8e-06,7e-06,6e-06,1.8e-05,1.1e-05,7e-06,1.4e-05,1e-06,2e-06,1.5e-05,1.1e-05,1.1e-05,7e-06,1.6e-05,1e-05,1e-05,4e-06,7e-06,1.8e-05,5e-06,3e-06,6e-06,1.4e-05,1.1e-05,1.1e-05,9e-06,1.1e-05,1.4e-05,9e-06,4e-06,8e-06,1.6e-05,1.3e-05,1.5e-05,4e-06,4e-06,9e-06,1.4e-05,1.4e-05,1.3e-05,3.2e-05,1.9e-05,8e-06,9e-06,2e-06,8e-06,6e-06,7e-06,1.6e-05,1.5e-05,1.3e-05,7e-06,8e-06,1.1e-05,5e-06,8e-06,1e-06,1.6e-05,1.4e-05,2.7e-05,2.1e-05,8e-06,9e-06,1.1e-05,5e-06,6e-06,4e-06,2e-06,9e-06,1.2e-05,4e-06,1e-05,7e-06,1e-06,1.3e-05,1e-05,8e-06,4e-06,1.9e-05,4e-06,1.1e-05,8e-06,2e-06,6e-06,7e-06,7e-06,7e-06,5e-06,1.2e-05,1.2e-05,1.3e-05,1.5e-05,9e-06,1.2e-05,1.5e-05,1.8e-05,1.2e-05,3e-06,5e-06,3e-06
5e-06,1.1e-05,1.4e-05,5e-06,1.2e-05,1.7e-05,1.1e-05,1.6e-05,3e-06,4e-06,1e-05,2.1e-05,8e-06,6e-06,8e-06,1.2e-05,8e-06,6e-06,1.6e-05,2.9e-05,1.1e-05,4e-06,9e-06,1.1e-05,1.1e-05,1.4e-05,6e-06,8e-06,7e-06,5e-06,1e-05,2.5e-05,2e-06,9e-06,2e-05,2.1e-05,2e-06,2e-06,1.6e-05,6e-06,1e-05,6e-06,8e-06,9e-06,3e-06,3e-06,5e-06,1e-05,1.1e-05,8e-06,8e-06,1.1e-05,2.7e-05,1.3e-05,9e-06,1.4e-05,1e-05,8e-06,6e-06,8e-06,3e-06,2.2e-05,1e-05,1e-05,9e-06,9e-06,4e-06,7e-06,2e-06,1.6e-05,2.8e-05,7e-06,9e-06,1.3e-05,3e-06,9e-06,1.4e-05,1.4e-05,1.6e-05,1.2e-05,2.7e-05,2.2e-05,1.4e-05,7e-06,1.2e-05,1.3e-05,1.3e-05,1.9e-05,9e-06,1.8e-05,5e-06,9e-06,1.3e-05,1e-05,1.1e-05,1.5e-05,1e-05,5e-06,9e-06,2.4e-05,1.3e-05,4e-06,8e-06,5e-06,6e-06,6e-06,6e-06,1.6e-05,9e-06,9e-06,6e-06,4e-06,6e-06,1e-05,6e-06,1.6e-05,8e-06,5e-06,4e-06,1e-06,1e-06
8e-06,7e-06,8e-06,3e-06,9e-06,3e-05,3.2e-05,3e-06,1.4e-05,1e-06,1.3e-05,1.8e-05,2.1e-05,2e-05,1e-05,7e-06,2.1e-05,1.1e-05,1.3e-05,2.9e-05,2e-05,1e-05,1.9e-05,2.9e-05,2.5e-05,5e-06,6e-06,6e-06,2e-06,9e-06,1.5e-05,1.4e-05,1.3e-05,2e-06,1.8e-05,7e-06,9e-06,5e-06,2.3e-05,2.1e-05,1.8e-05,2e-06,1.2e-05,1.5e-05,1.8e-05,2.2e-05,2.3e-05,1.4e-05,2.8e-05,2.4e-05,6e-06,1.1e-05,1.2e-05,3e-06,7e-06,1.2e-05,1.6e-05,2.2e-05,2e-05,1.1e-05,3e-06,1.7e-05,9e-06,1.3e-05,1.6e-05,5e-06,8e-06,1e-05,1.2e-05,1.9e-05,1.5e-05,2.5e-05,4e-06,4e-06,2e-05,1.5e-05,3e-06,6e-06,7e-06,2e-05,9e-06,1.3e-05,4e-06,8e-06,1.5e-05,1.1e-05,8e-06,2.4e-05,8e-06,5e-06,1.3e-05,1.4e-05,3e-06,2e-06,2.3e-05,2.1e-05,3.1e-05,2.1e-05,1.2e-05,1.2e-05,1.6e-05,2e-05,2.7e-05,1.8e-05,8e-06,5e-06,8e-06,1.4e-05,9e-06,1.7e-05,3e-06,1.2e-05,7e-06,1.9e-05,1.9e-05,1.4e-05,2.1e-05,9e-06,4e-06,1.1e-05,1e-05
1.2e-05,6e-06,9e-06,1.1e-05,9e-06,2.6e-05,1.7e-05,2.6e-05,2.3e-05,1.6e-05,1.8e-05,2.1e-05,3e-05,1e-05,7e-06,6e-06,1.4e-05,9e-06,7e-06,1.9e-05,2e-05,9e-06,1.4e-05,1e-05,9e-06,1.1e-05,1.6e-05,2e-05,1.2e-05,9e-06,9e-06,1.9e-05,1.2e-05,8e-06,1.3e-05,1.3e-05,1.2e-05,1.3e-05,1.4e-05,5e-06,9e-06,1.1e-05,1.3e-05,1.7e-05,6e-06,1.5e-05,9e-06,6e-06,2e-05,8e-06,1.2e-05,5e-06,4e-06,1.2e-05,2.1e-05,1.3e-05,3e-06,8e-06,1.3e-05,6e-06,1.2e-05,1.6e-05,9e-06,1.4e-05,1.2e-05,1.7e-05,1.4e-05,5e-06,1.6e-05,4e-06,1.2e-05,1.7e-05,1.6e-05,1e-05,2.2e-05,1.4e-05,2e-06,7e-06,4e-06,3e-06,1.8e-05,2.9e-05,1.7e-05,8e-06,1.2e-05,1.2e-05,1.3e-05,2.9e-05,2.6e-05,2.4e-05,1.7e-05,3e-06,8e-06,1e-05,2e-05,1.3e-05,1.6e-05,7e-06,5e-06,1e-06,9e-06,1.6e-05,2.5e-05,3e-05,2.5e-05,1.6e-05,1.9e-05,1.7e-05,1.6e-05,1.5e-05,1.7e-05,7e-06,1.5e-05,2.4e-05,1.9e-05,1.4e-05,1.7e-05,8e-06,9e-06,1e-05,3e-06
1.4e-05,1.8e-05,2.2e-05,8e-06,8e-06,1.7e-05,1.2e-05,1.8e-05,5e-06,3e-06,1.1e-05,1.7e-05,1.4e-05,1.9e-05,1.5e-05,1.3e-05,8e-06,2e-06,1e-05,2.3e-05,9e-06,6e-06,9e-06,8e-06,1.7e-05,9e-06,1.3e-05,1.4e-05,1.1e-05,6e-06,3e-06,1.6e-05,9e-06,1.2e-05,1.1e-05,1.8e-05,1.6e-05,7e-06,1.5e-05,1e-05,1.4e-05,2.3e-05,1.4e-05,5e-06,7e-06,1.8e-05,2.4e-05,1.2e-05,1.4e-05,1.1e-05,3e-06,6e-06,1.1e-05,7e-06,1.5e-05,1.1e-05,8e-06,8e-06,4e-06,4e-06,1.9e-05,7e-06,6e-06,8e-06,6e-06,8e-06,5e-06,1.4e-05,1.2e-05,1.2e-05,1.8e-05,8e-06,6e-06,5e-06,1e-05,1.2e-05,1.4e-05,7e-06,8e-06,9e-06,2.3e-05,2.1e-05,1.1e-05,4e-06,6e-06,1.5e-05,1.5e-05,1.5e-05,1e-05,1.4e-05,6e-06,1.2e-05,1.5e-05,1e-06,2e-06,9e-06,1.3e-05,7e-06,1.4e-05,1.2e-05,6e-06,1e-05,2.6e-05,2e-06,1.4e-05,4e-06,8e-06,1e-05,1.4e-05,8e-06,1.1e-05,1.2e-05,5e-06,8e-06,5e-06,5e-06,1.4e-05,1.1e-05,1.1e-05,1.3e-05,8e-06
9e-06,1.6e-05,1e-05,1.1e-05,2e-06,4e-06,5e-06,1e-05,6e-06,1e-05,1e-05,1.6e-05,4e-06,1e-05,6e-06,1.2e-05,9e-06,8e-06,1.3e-05,2e-06,6e-06,1e-06,1.4e-05,1.2e-05,3e-06,8e-06,1.6e-05,1e-05,3e-06,1.3e-05,1.5e-05,7e-06,1e-05,4e-06,4e-06,1.2e-05,6e-06,1.1e-05,1.7e-05,2e-06,1.4e-05,1.3e-05,1.1e-05,9e-06,4e-06,1e-05,5e-06,6e-06,1.3e-05,1.4e-05,1.2e-05,4e-06,9e-06,6e-06,1e-05,9e-06,4e-06,1e-06,9e-06,5e-06,1.2e-05,1.2e-05,3e-06,3e-06,5e-06,4e-06,1e-05,1.6e-05,1e-05,9e-06,5e-06,1e-05,1e-05,6e-06,6e-06,9e-06,1e-05,1.3e-05,1.4e-05,3e-06,1.1e-05,2e-06,5e-06,1e-06,4e-06,1.4e-05,3e-06,1e-05,1.5e-05,4e-06,1.2e-05,1.1e-05,7e-06,7e-06,1.3e-05,7e-06,8e-06,1.2e-05,1.3e-05,2e-06,7e-06,1e-05,1.1e-05,1.2e-05,4e-06,1e-05,2e-06,1.9e-05,2.1e-05,8e-06,6e-06,2e-06,2e-06,3e-06,9e-06,1.1e-05,1e-06,1.2e-05,3e-06,1e-06,2e-06
1.3e-05,1.4e-05,2.2e-05,1e-06,3e-06,1.2e-05,2e-06,4e-06,5e-06,9e-06,0,9e-06,4e-06,3e-06,5e-06,8e-06,1.2e-05,7e-06,2e-06,7e-06,6e-06,2e-06,1.2e-05,9e-06,7e-06,8e-06,5e-06,6e-06,5e-06,1.2e-05,1.3e-05,1.8e-05,8e-06,0,1.1e-05,2.1e-05,1.6e-05,0,7e-06,9e-06,1.1e-05,3e-06,5e-06,2e-06,6e-06,1.2e-05,1e-05,3e-06,9e-06,1e-05,5e-06,6e-06,5e-06,4e-06,7e-06,6e-06,4e-06,4e-06,9e-06,1e-05,3e-06,5e-06,4e-06,8e-06,2e-06,6e-06,8e-06,5e-06,9e-06,3e-06,3e-06,1.3e-05,5e-06,3e-06,3e-06,6e-06,1.2e-05,6e-06,1e-05,5e-06,5e-06,4e-06,7e-06,3e-06,3e-06,1e-05,6e-06,7e-06,1.7e-05,9e-06,9e-06,4e-06,1e-05,6e-06,1.2e-05,4e-06,7e-06,4e-06,1.3e-05,6e-06,2e-06,1.2e-05,3e-06,1.2e-05,8e-06,7e-06,0,1.3e-05,1.1e-05,1.2e-05,2e-06,3e-06,4e-06,6e-06,4e-06,9e-06,3e-06,7e-06,1.2e-05,1.1e-05,1e-05
6e-06,1.8e-05,9e-06,9e-06,5e-06,1.3e-05,1.3e-05,4e-06,1.1e-05,7e-06,9e-06,8e-06,8e-06,7e-06,7e-06,8e-06,4e-06,5e-06,6e-06,1.3e-05,4e-06,1.2e-05,3e-06,2e-06,3e-06,8e-06,1.1e-05,6e-06,1.3e-05,1.2e-05,6e-06,1.2e-05,5e-06,5e-06,1.7e-05,1e-05,3e-06,4e-06,3e-06,3e-06,1.2e-05,1.2e-05,7e-06,7e-06,4e-06,1.3e-05,1.1e-05,2e-06,1.1e-05,2e-06,3e-06,1e-05,8e-06,6e-06,9e-06,9e-06,3e-06,1e-06,5e-06,6e-06,1.6e-05,1.2e-05,1e-05,1e-05,1.1e-05,1.1e-05,0,4e-06,1.3e-05,5e-06,7e-06,6e-06,7e-06,3e-06,2e-06,6e-06,1.3e-05,1.3e-05,1.3e-05,2e-06,5e-06,3e-06,7e-06,2e-06,4e-06,6e-06,3e-06,8e-06,1.4e-05,3e-06,1.1e-05,3e-06,3e-06,1.4e-05,7e-06,5e-06,4e-06,4e-06,1.6e-05,6e-06,8e-06,4e-06,9e-06,7e-06,4e-06,9e-06,1e-06,2e-06,1e-05,4e-06,3e-06,1e-06,3e-06,5e-06,5e-06,7e-06,8e-06,4e-06,7e-06,1e-06,8e-06
8e-06,1.6e-05,1.8e-05,1.5e-05,9e-06,5e-06,8e-06,6e-06,8e-06,1.5e-05,1.9e-05,1e-05,3e-06,6e-06,9e-06,3e-06,6e-06,9e-06,9e-06,7e-06,4e-06,1e-05,1.4e-05,2e-06,5e-06,6e-06,1.1e-05,5e-06,8e-06,1.6e-05,1.6e-05,1.9e-05,1.3e-05,1.1e-05,1.8e-05,8e-06,5e-06,7e-06,5e-06,5e-06,1.5e-05,3e-06,1e-06,1.2e-05,1.2e-05,1.5e-05,1.7e-05,1.7e-05,1.5e-05,1.4e-05,6e-06,1.1e-05,7e-06,8e-06,6e-06,7e-06,1.1e-05,1.1e-05,9e-06,2e-06,1.7e-05,2.4e-05,7e-06,3e-06,6e-06,1.2e-05,1.2e-05,1e-05,1e-05,1.1e-05,3e-06,4e-06,5e-06,1e-05,6e-06,8e-06,1.3e-05,8e-06,7e-06,6e-06,6e-06,5e-06,1.5e-05,1.2e-05,6e-06,2e-06,4e-06,1.3e-05,2e-05,1.4e-05,8e-06,6e-06,5e-06,1.2e-05,7e-06,7e-06,1.4e-05,1.1e-05,1.5e-05,1.2e-05,1.1e-05,1e-05,3e-06,2e-06,9e-06,1.5e-05,9e-06,9e-06,5e-06,1e-05,3e-06,5e-06,5e-06,5e-06,7e-06,6e-06,8e-06,8e-06,4e-06,4e-06,8e-06
5e-06,1.5e-05,1.3e-05,8e-06,9e-06,5e-06,6e-06,6e-06,8e-06,5e-06,7e-06,8e-06,7e-06,2e-06,4e-06,1.1e-05,1.1e-05,3e-06,4e-06,5e-06,1e-06,6e-06,3e-06,5e-06,8e-06,5e-06,9e-06,8e-06,9e-06,8e-06,3e-06,9e-06,1.1e-05,8e-06,1.2e-05,9e-06,5e-06,9e-06,1.2e-05,1e-05,5e-06,3e-06,3e-06,1.1e-05,1.6e-05,2.4e-05,7e-06,7e-06,5e-06,1.3e-05,1e-05,6e-06,1.1e-05,3e-06,1.2e-05,5e-06,8e-06,1e-06,6e-06,8e-06,9e-06,1.2e-05,9e-06,3e-06,6e-06,6e-06,3e-06,8e-06,8e-06,0,4e-06,3e-06,1e-06,4e-06,6e-06,1.2e-05,1.6e-05,1.2e-05,1e-05,4e-06,4e-06,5e-06,1.2e-05,9e-06,4e-06,1e-05,7e-06,1.6e-05,6e-06,1.1e-05,1.6e-05,1.1e-05,5e-06,6e-06,7e-06,9e-06,1.7e-05,6e-06,9e-06,5e-06,3e-06,1e-05,1.1e-05,5e-06,6e-06,3e-06,2e-06,1.1e-05,1.1e-05,1.3e-05,1.4e-05,1.7e-05,1e-05,1.2e-05,5e-06,4e-06,4e-06,7e-06,6e-06,2e-06,4e-06
3e-06,1.1e-05,2e-06,2e-06,9e-06,2e-06,3e-06,2e-06,3e-06,3e-06,5e-06,7e-06,5e-06,2e-06,7e-06,6e-06,3e-06,3e-06,3e-06,7e-06,3e-06,2e-06,1e-06,9e-06,6e-06,1e-06,5e-06,7e-06,6e-06,1e-05,8e-06,8e-06,3e-06,6e-06,1.2e-05,3e-06,3e-06,7e-06,7e-06,8e-06,3e-06,4e-06,4e-06,1e-05,6e-06,1e-05,6e-06,3e-06,9e-06,4e-06,4e-06,2e-06,9e-06,7e-06,6e-06,4e-06,4e-06,6e-06,3e-06,8e-06,1e-05,4e-06,1e-06,7e-06,2e-06,4e-06,3e-06,8e-06,5e-06,3e-06,2e-06,6e-06,3e-06,4e-06,6e-06,6e-06,7e-06,3e-06,1e-05,7e-06,6e-06,7e-06,9e-06,5e-06,4e-06,6e-06,2e-06,9e-06,1.6e-05,2e-06,9e-06,3e-06,3e-06,1.1e-05,1.1e-05,1e-05,2e-06,1e-06,2e-06,4e-06,7e-06,8e-06,4e-06,6e-06,9e-06,7e-06,6e-06,1e-05,4e-06,4e-06,1.2e-05,1e-05,7e-06,8e-06,4e-06,7e-06,3e-06,5e-06,6e-06,1e-06,4e-06
1e-06,7e-06,3e-06,2e-06,5e-06,4e-06,2e-06,4e-06,5e-06,2e-06,2e-06,5e-06,3e-06,1e-06,4e-06,5e-06,3e-06,6e-06,3e-06,5e-06,7e-06,2e-06,6e-06,8e-06,4e-06,7e-06,1e-05,3e-06,4e-06,5e-06,4e-06,1.1e-05,5e-06,2e-06,5e-06,1e-06,2e-06,4e-06,6e-06,3e-06,9e-06,1e-06,2e-06,7e-06,2e-06,4e-06,1e-06,2e-06,6e-06,2e-06,4e-06,1e-06,7e-06,3e-06,2e-06,4e-06,6e-06,4e-06,3e-06,3e-06,2e-06,3e-06,3e-06,4e-06,2e-06,1e-06,4e-06,5e-06,4e-06,2e-06,3e-06,2e-06,2e-06,7e-06,3e-06,5e-06,9e-06,5e-06,5e-06,4e-06,2e-06,1e-06,5e-06,4e-06,1e-06,1e-06,3e-06,4e-06,9e-06,4e-06,5e-06,3e-06,1e-06,9e-06,3e-06,6e-06,6e-06,1e-06,3e-06,2e-06,8e-06,2e-06,5e-06,6e-06,8e-06,5e-06,2e-06,1.3e-05,6e-06,7e-06,5e-06,7e-06,7e-06,3e-06,3e-06,3e-06,3e-06,3e-06,5e-06,2e-06,2e-06
3e-06,7e-06,2e-06,4e-06,3e-06,3e-06,4e-06,7e-06,9e-06,3e-06,3e-06,1e-06,2e-06,2e-06,2e-06,4e-06,8e-06,5e-06,3e-06,2e-06,3e-06,5e-06,5e-06,2e-06,6e-06,8e-06,5e-06,6e-06,6e-06,2e-06,7e-06,1.3e-05,5e-06,6e-06,7e-06,1e-06,3e-06,6e-06,4e-06,3e-06,1.1e-05,7e-06,5e-06,8e-06,6e-06,1e-06,2e-06,3e-06,5e-06,6e-06,3e-06,5e-06,8e-06,8e-06,5e-06,3e-06,5e-06,8e-06,3e-06,1e-06,2e-06,4e-06,4e-06,3e-06,0,3e-06,5e-06,7e-06,6e-06,1e-06,9e-06,4e-06,2e-06,7e-06,4e-06,1e-06,4e-06,3e-06,9e-06,2e-06,1e-06,2e-06,4e-06,3e-06,2e-06,1e-06,1e-06,3e-06,1e-05,3e-06,5e-06,3e-06,5e-06,6e-06,5e-06,7e-06,4e-06,4e-06,2e-06,4e-06,7e-06,7e-06,3e-06,7e-06,4e-06,7e-06,2e-06,1.3e-05,4e-06,1.2e-05,5e-06,4e-06,4e-06,3e-06,2e-06,4e-06,1e-06,4e-06,5e-06,6e-06,3e-06
2e-06,4e-06,3e-06,7e-06,5e-06,3e-06,5e-06,2e-06,5e-06,7e-06,4e-06,6e-06,5e-06,3e-06,2e-06,3e-06,5e-06,3e-06,4e-06,7e-06,8e-06,7e-06,3e-06,2e-06,9e-06,1.1e-05,1.1e-05,4e-06,1.2e-05,7e-06,8e-06,1.7e-05,1.2e-05,1.3e-05,1e-05,5e-06,4e-06,4e-06,6e-06,8e-06,8e-06,5e-06,7e-06,1.3e-05,3e-06,5e-06,4e-06,4e-06,7e-06,7e-06,3e-06,4e-06,5e-06,8e-06,1.1e-05,4e-06,5e-06,3e-06,4e-06,2e-06,3e-06,3e-06,1e-06,4e-06,5e-06,4e-06,5e-06,5e-06,4e-06,1e-05,1.4e-05,6e-06,3e-06,3e-06,7e-06,6e-06,3e-06,6e-06,8e-06,5e-06,4e-06,5e-06,4e-06,6e-06,6e-06,4e-06,2e-06,1e-06,7e-06,3e-06,4e-06,4e-06,9e-06,1.3e-05,6e-06,7e-06,8e-06,7e-06,4e-06,5e-06,7e-06,8e-06,1.1e-05,1e-05,8e-06,7e-06,5e-06,1.3e-05,7e-06,1.1e-05,5e-06,8e-06,4e-06,0,9e-06,7e-06,7e-06,5e-06,2e-06,5e-06,5e-06
2e-06,7e-06,9e-06,3e-06,2e-06,5e-06,1e-06,2e-06,1e-06,4e-06,4e-06,3e-06,2e-06,1e-06,2e-06,2e-06,4e-06,3e-06,3e-06,7e-06,3e-06,2e-06,6e-06,3e-06,4e-06,1e-06,1e-06,3e-06,7e-06,3e-06,2e-06,7e-06,1e-06,6e-06,8e-06,3e-06,6e-06,3e-06,4e-06,5e-06,4e-06,6e-06,2e-06,6e-06,3e-06,4e-06,1e-06,3e-06,5e-06,1e-06,2e-06,1e-06,4e-06,3e-06,4e-06,1e-06,2e-06,1e-06,2e-06,3e-06,6e-06,3e-06,2e-06,1e-06,2e-06,1e-06,3e-06,6e-06,0,8e-06,1e-06,2e-06,2e-06,2e-06,5e-06,1e-06,1e-06,4e-06,7e-06,4e-06,0,2e-06,1e-06,0,2e-06,2e-06,1e-06,2e-06,1e-05,2e-06,3e-06,1e-06,5e-06,3e-06,2e-06,7e-06,8e-06,3e-06,2e-06,3e-06,8e-06,4e-06,5e-06,5e-06,7e-06,2e-06,1e-06,9e-06,5e-06,3e-06,7e-06,2e-06,1e-06,2e-06,7e-06,1e-06,4e-06,3e-06,3e-06,4e-06,3e-06
2e-06,8e-06,7e-06,3e-06,4e-06,4e-06,2e-06,0,1e-06,2e-06,1e-06,3e-06,1e-06,1e-06,2e-06,0,4e-06,4e-06,1e-06,6e-06,2e-06,2e-06,7e-06,5e-06,3e-06,1e-06,2e-06,3e-06,5e-06,1e-06,3e-06,7e-06,2e-06,5e-06,9e-06,0,5e-06,2e-06,4e-06,3e-06,2e-06,4e-06,1e-06,3e-06,1e-06,3e-06,0,2e-06,3e-06,1e-06,2e-06,1e-06,5e-06,4e-06,4e-06,1e-06,0,2e-06,3e-06,1e-06,4e-06,3e-06,2e-06,1e-06,1e-06,0,3e-06,6e-06,1e-06,5e-06,3e-06,1e-06,1e-06,1e-06,4e-06,2e-06,1e-06,4e-06,5e-06,2e-06,2e-06,1e-06,2e-06,1e-06,1e-06,1e-06,1e-06,1e-06,9e-06,1e-06,3e-06,2e-06,1e-06,4e-06,1e-06,4e-06,3e-06,1e-06,1e-06,4e-06,6e-06,1e-06,4e-06,6e-06,5e-06,3e-06,0,9e-06,4e-06,2e-06,4e-06,4e-06,1e-06,4e-06,5e-06,3e-06,1e-06,0,2e-06,3e-06,1e-06
1e-06,7e-06,6e-06,3e-06,1e-06,4e-06,2e-06,1e-06,0,0,2e-06,3e-06,1e-06,1e-06,3e-06,1e-06,2e-06,3e-06,1e-06,6e-06,2e-06,0,6e-06,4e-06,1e-06,1e-06,2e-06,3e-06,4e-06,1e-06,2e-06,7e-06,3e-06,5e-06,9e-06,2e-06,3e-06,2e-06,3e-06,4e-06,2e-06,5e-06,1e-06,3e-06,2e-06,4e-06,1e-06,1e-06,4e-06,2e-06,2e-06,1e-06,4e-06,4e-06,4e-06,0,0,2e-06,2e-06,2e-06,3e-06,3e-06,1e-06,0,1e-06,0,3e-06,6e-06,1e-06,4e-06,2e-06,1e-06,1e-06,2e-06,1e-06,3e-06,0,3e-06,5e-06,1e-06,2e-06,1e-06,2e-06,2e-06,1e-06,1e-06,1e-06,2e-06,9e-06,2e-06,3e-06,0,1e-06,4e-06,1e-06,4e-06,3e-06,1e-06,0,3e-06,6e-06,1e-06,4e-06,5e-06,5e-06,2e-06,1e-06,9e-06,4e-06,4e-06,5e-06,4e-06,2e-06,4e-06,2e-06,2e-06,1e-06,1e-06,2e-06,2e-06,2e-06
2e-06,7e-06,5e-06,2e-06,4e-06,4e-06,2e-06,1e-06,1e-06,2e-06,2e-06,3e-06,0,0,3e-06,1e-06,1e-06,1e-06,1e-06,6e-06,0,1e-06,5e-06,4e-06,2e-06,1e-06,2e-06,3e-06,5e-06,1e-06,1e-06,6e-06,4e-06,5e-06,8e-06,1e-06,3e-06,2e-06,4e-06,4e-06,4e-06,4e-06,0,4e-06,2e-06,3e-06,0,1e-06,3e-06,1e-06,2e-06,0,4e-06,4e-06,4e-06,1e-06,0,3e-06,3e-06,0,3e-06,2e-06,0,1e-06,1e-06,1e-06,3e-06,6e-06,1e-06,4e-06,2e-06,1e-06,0,1e-06,2e-06,2e-06,1e-06,4e-06,5e-06,2e-06,1e-06,2e-06,2e-06,2e-06,0,1e-06,0,1e-06,8e-06,2e-06,3e-06,0,1e-06,3e-06,2e-06,3e-06,2e-06,0,0,3e-06,6e-06,1e-06,4e-06,4e-06,4e-06,2e-06,1e-06,9e-06,4e-06,4e-06,4e-06,3e-06,1e-06,3e-06,4e-06,2e-06,0,1e-06,2e-06,1e-06,1e-06
