5.2e-05,5.8e-05,3.9e-05,4e-06,5e-06,1.2e-05,1.3e-05,9e-06,1e-06,-3e-06,3e-06,4e-06,5e-06,7e-06,-5e-06,-0.003285,-0.00889,-0.004438,-0.001237,-0.000476,-0.000462,-0.000275,-0.000112,-0.000234,-0.000333,-8.1e-05,-2.3e-05,-5e-06
-7.8e-05,-3.4e-05,-3.3e-05,-1.2e-05,-1.4e-05,0,5e-06,4e-06,-2e-06,-3e-06,1e-06,1e-06,1e-06,4e-06,-3e-06,-0.002879,-0.008094,-0.004022,-0.001265,-0.000514,-0.000458,-0.000254,-8e-05,-0.000239,-0.000256,1.4e-05,-1.5e-05,-4e-06
-0.000212,-0.000125,-8.9e-05,-2.8e-05,-2.6e-05,-1.2e-05,-8e-06,-4e-06,-4e-06,0,0,-1e-06,-1e-06,0,2e-06,0.000651,0.000943,7.1e-05,-0.000286,-0.000206,-0.000115,-4.9e-05,-1.9e-05,-4.2e-05,-8.2e-05,-5.9e-05,-1e-05,1e-06
-0.000188,-0.000131,-9.2e-05,-1.9e-05,-1.9e-05,-1.5e-05,-1.1e-05,-6e-06,0,7e-06,3e-06,-1e-06,-2e-06,0,6e-06,0.003174,0.008253,0.00351,0.000848,0.000393,0.000421,0.000226,9.8e-05,0.000214,0.000298,7.3e-05,2.5e-05,8e-06
-0.00014,-0.000117,-8.1e-05,-1.4e-05,-1.1e-05,-1.3e-05,-1.4e-05,-7e-06,1e-06,7e-06,3e-06,-2e-06,-3e-06,0,4e-06,0.001404,0.004269,0.001959,0.000656,0.000414,0.000352,0.000184,9e-05,0.000208,0.000314,9.8e-05,2.4e-05,6e-06
-0.000104,-9.6e-05,-6e-05,-1.8e-05,-8e-06,-1.1e-05,-1.7e-05,-9e-06,-5e-06,-4e-06,-2e-06,-3e-06,-4e-06,-2e-06,-4e-06,-0.002228,-0.005203,-0.001862,-0.000287,-0.000125,-0.000214,-9.8e-05,-6.5e-05,-7.5e-05,-0.000167,-0.000102,-1.8e-05,-5e-06
3.5e-05,-2.3e-05,-1.1e-05,-2e-06,5e-06,-4e-06,-1e-05,-6e-06,-5e-06,-7e-06,-3e-06,-2e-06,-2e-06,-2e-06,-4e-06,-0.00214,-0.005684,-0.001886,-0.000351,-0.000309,-0.000325,-0.000148,-8.3e-05,-0.000193,-0.000245,-2.5e-05,-1.6e-05,-6e-06
0.000129,4.1e-05,3.5e-05,1.8e-05,1.5e-05,4e-06,0,0,1e-06,0,-1e-06,0,1e-06,-1e-06,2e-06,0.000741,0.001524,0.000878,0.000201,-7.3e-05,-2e-05,-2.1e-05,-4e-06,-8e-05,-6e-05,2.2e-05,-3e-06,1e-06
0.000126,8.1e-05,6.2e-05,2.5e-05,2e-05,9e-06,8e-06,3e-06,3e-06,4e-06,1e-06,1e-06,1e-06,-1e-06,3e-06,0.001762,0.004538,0.001266,0.000135,0.000104,0.000171,4.7e-05,3.1e-05,6.2e-05,6.5e-05,-2.5e-05,6e-06,4e-06
1e-04,9.3e-05,5.7e-05,1.4e-05,1.2e-05,1.1e-05,1.4e-05,4e-06,1e-06,4e-06,2e-06,1e-06,2e-06,0,2e-06,0.000676,0.001503,-0.00067,-0.000388,9.7e-05,0.000124,4.2e-05,3.3e-05,0.000121,0.000217,7.8e-05,1.5e-05,1e-06
3.2e-05,6e-05,3e-05,-1e-05,-1.3e-05,8e-06,1.5e-05,4e-06,-1e-06,-1e-06,0,2e-06,3e-06,1e-06,-1e-06,-0.000836,-0.00234,-0.001336,-0.000534,-9.2e-05,-6.7e-05,-6e-06,-2e-05,1.2e-05,2e-05,-6e-06,-5e-06,-4e-06
-2.5e-05,2.1e-05,8e-06,-2.2e-05,-2.4e-05,5e-06,1e-05,3e-06,-2e-06,-5e-06,-3e-06,2e-06,4e-06,0,-1e-06,-0.001364,-0.00357,-0.000459,-0.000167,-0.000228,-0.000178,-3.3e-05,-2.6e-05,-8.4e-05,-0.000188,-7.7e-05,-1.1e-05,-3e-06
-3.4e-05,-3e-06,-1.1e-05,-2.1e-05,-2e-05,2e-06,5e-06,3e-06,0,-4e-06,-3e-06,1e-06,3e-06,0,1e-06,-9.6e-05,-0.000471,0.000829,0.000466,3.2e-05,2.5e-05,-1.3e-05,-1e-06,-4.1e-05,-1.9e-05,3.8e-05,1e-06,1e-06
-6.3e-05,-3e-05,-2.2e-05,-1.2e-05,-8e-06,-1e-06,-1e-06,1e-06,3e-06,1e-06,-2e-06,-1e-06,-1e-06,-3e-06,1e-06,0.000862,0.002247,0.000838,0.000534,0.000244,0.000197,1.1e-05,1e-06,2.2e-05,4.5e-05,4e-06,4e-06,2e-06
-6.1e-05,-3.8e-05,-2.3e-05,0,9e-06,-4e-06,-1.1e-05,-4e-06,2e-06,3e-06,-1e-06,-4e-06,-5e-06,-6e-06,-3e-06,0.000461,0.00149,-0.000236,2.1e-05,0.000114,4.6e-05,-1e-05,1.4e-05,4.8e-05,2.5e-05,-2.4e-05,3e-06,-2e-06
1e-06,-3.4e-05,-1.6e-05,9e-06,1.6e-05,-6e-06,-1.5e-05,-8e-06,-3e-06,-1e-06,-3e-06,-4e-06,-7e-06,-7e-06,-2e-06,1e-04,0.000672,-4.8e-05,-0.000175,-2.8e-05,-8.2e-05,1.6e-05,1.5e-05,2.2e-05,5.9e-05,3.9e-05,0,-3e-06
3e-05,-2.8e-05,-3e-06,2.1e-05,1.4e-05,-1e-05,-1.9e-05,-1.1e-05,-6e-06,-5e-06,-5e-06,-4e-06,-6e-06,-8e-06,-4e-06,-0.000215,-0.000456,0.000168,-0.000254,-0.000162,-0.00012,2.7e-05,-1.1e-05,-5e-05,-7.7e-05,-3.4e-05,-1e-05,-2e-06
3.1e-05,-3e-06,1.1e-05,3e-05,1.2e-05,-1.1e-05,-1.8e-05,-1.2e-05,-6e-06,-6e-06,-7e-06,-4e-06,-5e-06,-9e-06,-5e-06,-0.000524,-0.001783,-0.000462,-0.000237,-0.000113,-4.8e-05,-1.5e-05,1e-05,-3.7e-05,-7.3e-05,-2.9e-05,-8e-06,-2e-06
6e-06,2e-05,1.2e-05,1.7e-05,2e-06,-1e-05,-1.2e-05,-1e-05,-5e-06,-3e-06,-4e-06,-3e-06,-5e-06,-7e-06,-3e-06,-2e-04,-0.001048,-0.000491,0.000152,0.000151,0.000144,-2e-06,1.1e-05,2.8e-05,7.4e-05,3.4e-05,-1e-06,-2e-06
