-0.000749,-0.009298,-0.011226,-0.001067,-8.4e-05,-9.9e-05,-0.013147,-0.071094,-0.037301,-0.013377,-0.013896,-0.012229,-0.005715,-0.004955,-0.009009,-0.00189,-0.000441,-0.000116,-0.009031,-0.034978,-0.031354,-0.010415,-0.003901,-0.029548,-0.022017,-0.00533,-0.001431,-4.2e-05
-0.000171,-0.007556,-0.004193,0.002394,0.000227,6.7e-05,0.001316,-0.012517,-0.007265,0.007285,0.007574,0.006592,-0.001572,-0.001389,-0.002306,-0.000439,-3.6e-05,3.7e-05,-0.000939,-0.000205,-0.012282,-0.006695,0.002679,0.022543,0.01182,0.001205,0.000729,3.9e-05
-0.000202,-0.002492,-0.00653,-0.003128,-0.000153,-4.7e-05,-0.008799,-0.040584,-0.01889,-0.004942,-0.004966,-0.006139,-0.002437,6.1e-05,0.001194,-7.9e-05,-0.000379,-0.000117,-0.006601,-0.014456,0.001965,0.00313,-0.003235,-0.027977,-0.017089,-0.000588,-0.000311,-5.6e-05
0.000826,0.005717,0.006142,0.001438,0.000115,0.00011,-0.002977,-0.002342,0.002326,6.6e-05,0.001075,0.001521,0.00233,0.003178,0.00675,0.001329,0,-1.2e-05,-0.000921,-0.001372,0.015035,0.008798,0.001225,0.010813,0.009389,0.001172,6.3e-05,5.1e-05
0.001115,0.007829,0.0099,0.001759,0.000238,0.000175,0.013635,0.07143,0.032967,0.010754,0.011036,0.009995,0.004632,0.001997,0.00228,0.000841,0.000388,0.000163,0.012307,0.03327,0.013418,0.00198,0.004453,0.033419,0.020762,0.002711,0.001095,0.000122
-3e-04,-0.000284,-0.002219,-0.002116,-0.000123,-6.4e-05,0.002099,0.00372,-0.009264,-0.009465,-0.010876,-0.010072,-0.001604,-0.002813,-0.006893,-0.001295,-1e-06,-5.2e-05,-0.001656,-0.010133,-0.018702,-0.008975,-0.004837,-0.041751,-0.028014,-0.002615,-0.000699,-1.9e-05
-9.7e-05,-0.00486,-0.003161,0.001696,7.7e-05,-2.7e-05,-0.0073,-0.048454,-0.026188,-0.004775,-0.002383,0.000146,-0.001578,-0.001352,-0.001859,-0.000283,-0.000134,-4.2e-05,-0.004535,-0.018709,-0.017206,-0.005091,-8.8e-05,0.004583,0.002079,-0.002995,-0.000782,6e-06
0.000274,-0.003012,-0.00451,-0.000861,7.4e-05,8.9e-05,-0.00217,-0.012567,-0.000168,0.007682,0.011031,0.010205,0.000687,0.000986,0.002733,0.000505,-0.000202,3e-05,-0.000119,0.005288,0.009781,0.00535,0.003228,0.025707,0.016528,0.00252,0.00084,1.4e-05
-0.000213,0.001337,-0.000321,-0.001151,-5.2e-05,3e-05,8.5e-05,0.007965,0.006661,-0.001683,-0.004942,-0.00661,0.00018,0.00176,0.003168,0.000211,-3.5e-05,-4.2e-05,-0.004858,-0.005517,0.011573,0.005966,-0.003249,-0.028926,-0.015559,0.001975,0.00016,-2.4e-05
0.000141,0.002878,0.005129,0.002091,9.8e-05,2.8e-05,-0.000894,0.002009,0.006338,0.000523,-0.003563,-0.00388,0.000606,0.000432,0.000265,7.9e-05,0.000167,1.4e-05,-8e-04,-0.002888,0.001076,-0.00035,0.000337,0.007712,0.006237,-0.000719,-0.000246,5.7e-05
0.000186,-0.001291,-0.002853,-0.001258,-3.7e-05,-1e-05,0.000163,0.00452,0.003964,0.002816,0.002702,0.002234,-0.001787,-0.002719,-0.005119,-0.000739,-4.7e-05,4.8e-05,0.00639,0.011314,-0.006535,-0.005374,0.000707,0.001784,-0.001701,-0.001053,0.000133,5.1e-05
4.5e-05,-0.001444,-0.000868,0.000241,-4.5e-05,-5.2e-05,0.002446,0.015403,0.004255,-0.00465,-0.002657,-0.001142,-0.001129,-0.000318,0.000327,0.00019,0.000116,2.4e-05,0.001498,0.005076,-0.0031,-0.002178,-0.001739,-0.01773,-0.011987,-0.000855,-0.000253,-9e-06
0.000368,0.002176,0.00483,0.001434,6.9e-05,3.9e-05,-0.001937,-0.006779,0.002025,0.001845,0.00434,0.005347,0.002707,0.002261,0.004489,0.001107,0.000243,8.3e-05,0.002455,0.012874,0.011901,0.004929,0.003025,0.031568,0.022135,0.000661,-5.6e-05,1.7e-05
-0.000212,0.000781,-0.001579,-0.001922,-4.3e-05,4.5e-05,-0.001857,-0.013261,-0.005039,0.004502,0.002334,-0.000367,0.00066,0.000189,-0.000678,-0.000324,-2.9e-05,2e-05,-0.000426,-7e-06,0.005118,0.002737,-6e-05,-0.003087,-0.001759,0.001369,0.000424,-2e-06
-0.000674,-0.00131,-0.001402,0.000771,0,-1.2e-05,0.006479,0.018568,-0.000626,-0.005733,-0.006663,-0.006194,-0.001331,-0.00076,-0.00194,-0.000812,5e-06,-6.5e-05,-0.0079,-0.024339,-0.011426,-0.003306,-0.003182,-0.027554,-0.017522,0.000202,8.4e-05,-2.8e-05
-3.7e-05,-0.000132,0.000333,7.5e-05,-3.7e-05,-5.3e-05,0.001641,0.004608,-0.001855,-0.002305,0.000613,0.002685,-0.000378,-0.000828,-0.001187,-6.4e-05,1e-06,-3.3e-05,-0.001349,-0.006887,-0.006423,-0.002515,0.001343,0.018372,0.01207,-0.001419,-0.000319,1.3e-05
0.000149,-0.001234,-0.002341,-0.001125,-0.000102,-9.3e-05,-0.00788,-0.030578,-0.0131,0.004549,0.003948,0.002795,-0.000681,-0.00039,0.000198,0.000274,-0.000171,-4.6e-05,0.004355,0.008747,0.00119,0.000559,0.000928,0.001992,-0.000677,-0.000664,-7.9e-05,6e-06
7.6e-05,-0.001141,-0.000167,0.001221,-1.8e-05,-6.4e-05,-0.002339,-0.008422,-0.001581,-0.001026,-0.001276,-0.001312,0.000269,0.000964,0.002684,0.000544,-9.3e-05,-4.7e-05,0.000332,0.001789,0.003502,0.002257,0.000236,-0.000532,-0.00049,0.000952,0.00019,1.6e-05
-6.4e-05,0.002519,0.002762,-0.00066,-5.5e-05,-1.9e-05,0.002543,0.013628,0.010216,-0.000875,-0.000992,-0.001845,0.000988,0.000475,0.000145,-2.1e-05,-4.4e-05,-2e-06,0.002207,0.009431,0.005432,0.001105,0.000828,0.012581,0.009552,0.000324,-1.6e-05,4.3e-05
