0.000103,2.2e-05,-7.1e-05,4.9e-05,6.5e-05,0.000145,4.9e-05,4.1e-05,-0.000114,6.9e-05,0.000668,-0.013093,-0.017122,-0.009058,-0.004242,-0.002426,-0.002576,-0.004141,-0.003269,-0.009598,-0.011432,-0.006713,-0.002955,-0.003289,-0.005406,4.4e-05,-0.012614,3.3e-05,0.001435,-0.013981,-0.031237,-0.01892,-0.013544,-0.023066,-0.018084,-0.012701,-0.013838,-0.008774,-0.008001,-0.011492,-0.015205,-0.018039,-0.012034,-0.011303,-0.019779,-0.012574,-0.010333,-0.008735,-0.008724,-0.015561,-0.01621,-0.008947,-0.013096,-0.01624,-0.012548,-0.009329,-0.009235,-0.010045,-0.004864,-0.010191,-0.006937,-0.00464,-0.006323,-0.002895,-0.004895,-0.00144,-0.001546,-0.001351,-0.001554,-0.006024,-0.004842,-0.002963,-0.001695,-8.3e-05,-3.9e-05,-0.000739,-0.012818,-0.005973,-0.002245,-0.00027,-0.001232,0.000195,-0.001152,-0.00126,-0.00043,0.003033,0.003021,0.000358,-0.002733,-0.002323,-0.00063,0.000294,9.5e-05,0.00029,0.000184,-0.000156,0.000265,0.000354,0.000158,0.000296,-0.000624,-0.00146,-0.000429,4.7e-05,0.000322,0.000191,0.000227,2e-04,7.4e-05,0.00022,0.000201,0.000124,0.000178,0.000275,-2.2e-05,9.3e-05,0.000257,0.000166,1.6e-05,-6e-06,7.6e-05
-4.4e-05,7.1e-05,-2.3e-05,5.3e-05,-4.7e-05,1.5e-05,-1.2e-05,2.6e-05,5.5e-05,-1.2e-05,4.9e-05,0.007801,0.011353,0.006664,0.002383,0.000914,0.001483,-0.001886,-0.000867,0.005178,0.006621,0.004082,0.001789,-0.000326,0.002172,0.000947,0.0055,-0.007741,-0.000119,-0.007048,0.007991,0.010271,0.006719,0.008931,0.000796,-0.003996,-0.002499,-0.002694,-0.001688,-0.001839,-0.000838,0.008767,0.002302,-0.002352,-0.001383,4e-04,0.002541,-0.008871,-0.010164,-0.001503,-0.003333,0.001713,-0.004971,7e-04,-0.001864,0.000289,-0.001656,-0.003145,-0.004083,-0.001127,-0.000183,-0.004505,-0.001925,-0.003767,-7.4e-05,5.5e-05,-0.003187,-0.002177,-0.000515,0.000924,-0.000652,-0.000293,-0.000502,-0.000652,-0.001757,-0.00193,0.00488,0.004352,0.001784,-0.002493,-0.000926,-2.4e-05,0.000512,0.000775,0.000204,-0.001419,0.000151,-0.000958,0.001573,0.002113,0.001228,0.000659,0.000542,6.1e-05,0.000351,3.7e-05,2.6e-05,0.00013,0.000174,0.000216,0.000172,0.00049,0.000473,0.000152,0.000206,0.000277,-2e-05,0.000146,3.5e-05,-0.000138,-1.9e-05,3e-05,6.2e-05,0.000312,0.000131,0.00021,0.000383,0.000148,0.000197,5.8e-05,7.6e-05
-1.3e-05,-5.8e-05,-3e-05,-5.5e-05,-0.000162,-0.000187,-6e-05,-0.000181,-0.000156,-0.000182,-9.4e-05,-0.00356,-0.00834,-0.004005,-0.001357,-0.000175,-0.000683,0.000616,0.000525,-0.001779,-0.003943,-0.002808,-0.001116,9.3e-05,-0.005344,-0.001558,-0.002214,-0.004005,-0.00302,-0.001216,-0.003473,-0.005789,-0.004099,-0.008354,-0.007848,-0.011994,0.001563,0.000581,-0.001582,-0.001124,-0.003949,-0.007054,-0.003939,-0.004652,-0.004347,-0.004488,-0.002819,-0.000282,-0.001312,-0.000384,-0.005235,-0.000236,-0.003643,-0.004153,-0.004342,-0.003173,0.000561,0.000401,0.000683,-0.002468,-0.004915,0.000333,0.002252,-0.002032,-0.002032,-0.001734,0.002488,0.00084,-0.000561,0.000743,-0.001266,0.000744,-0.000586,-0.000629,-3.1e-05,0.000887,-0.001593,-0.00274,-0.001226,-0.00014,0.000851,-0.001144,-0.002247,-0.001359,-0.000289,-0.002042,-0.000992,4.1e-05,-0.00096,-0.000703,-0.000167,0.000213,1.2e-05,1.8e-05,8.3e-05,3.1e-05,-7.1e-05,-0.000143,-0.000128,1.9e-05,-8.3e-05,0.000257,0.000497,-0.00011,-1e-05,8.2e-05,-0.000175,-5.5e-05,9.1e-05,-0.000103,-3e-05,-7.6e-05,9e-06,6e-05,4.5e-05,0.000218,9e-05,-0.000107,-1.5e-05,-0.00011,-0.000117
5.4e-05,3e-05,-5.1e-05,6e-05,9e-06,2.9e-05,3e-06,-6.4e-05,-4.3e-05,2.6e-05,4.6e-05,-0.000802,0.001941,0.001501,0.000748,7e-06,9.2e-05,0.000455,5.2e-05,-0.000188,0.004056,0.001875,0.000547,-0.000997,-0.000419,0.000852,0.00081,-0.000709,-0.006273,-0.002891,-0.003587,0.006763,0.005151,0.002678,-0.001066,0.001626,-0.004349,-0.001906,-3.2e-05,0.001791,-0.00491,0.000648,0.002844,0.001606,0.00119,0.005408,0.001138,-0.00284,-0.002487,-0.002494,0.004449,-0.006117,0.001195,0.003722,0.004443,0.001696,0.000731,-0.001707,-0.00171,0.003489,0.001834,-0.000149,0.000286,0.000265,0.000838,0.00062,0.000179,-0.000542,5.5e-05,-0.000329,-1.6e-05,-0.00035,-0.000801,-0.000731,0.000185,-0.000168,0.000483,0.001341,0.000389,0.000618,-6.9e-05,-0.001908,0.000285,0.000959,0.00031,0.00041,-0.000987,-0.000241,4.8e-05,0.000675,0.000495,0.000132,-0.000224,-3.4e-05,0.000182,8e-05,-0.00012,-9.3e-05,1.3e-05,0.000159,-0.000217,-0.000131,8.4e-05,-3.3e-05,-1.2e-05,0.000124,-1.4e-05,-5.6e-05,1.7e-05,-7.7e-05,6.7e-05,-3e-06,3.4e-05,6e-05,-6.5e-05,9e-06,-2.8e-05,-7.9e-05,0.000158,0.000218,-1.5e-05
4.9e-05,2.5e-05,-1.4e-05,6.4e-05,4.2e-05,3.3e-05,-3.3e-05,-2e-06,0.000131,5.2e-05,-0.000169,0.00026,-0.000165,-0.000548,-0.000509,0.000211,7.7e-05,0.000245,0.000227,-0.000179,-0.001451,-0.000485,-0.000466,0.000359,0.000779,6e-04,-0.000923,-0.003379,-0.005799,-0.003549,-0.002935,-0.001938,0.003463,-0.002158,0.004979,0.003184,0.001341,0.000536,-0.000515,-0.000183,0.001011,-0.006221,-0.00738,-0.000716,-0.000191,1e-04,-0.001967,0.001126,0.001541,0.002346,-0.003734,0.003322,-0.001752,-0.00281,-0.003713,-0.003504,-0.000729,0.003323,0.001561,0.001327,-0.000812,0.00039,0.000461,0.001011,-0.001768,-0.001116,-0.000967,-0.000461,0.000287,-0.000734,0.001523,0.000397,0.000204,0.000636,1.6e-05,-0.00043,0.000495,-0.003252,-0.00176,-5e-05,0.000497,0.000181,0.000761,-0.00018,-0.000361,-0.00012,-0.000462,-0.000447,-0.000161,-0.001129,-0.000111,-3.3e-05,-0.000141,-3.9e-05,1e-05,2.5e-05,-3.4e-05,2.2e-05,-0.000124,9.9e-05,-5.7e-05,-0.000224,-0.000153,-0.000249,0.00013,-3.6e-05,2.5e-05,-6.7e-05,-3.5e-05,-1.8e-05,0.000127,-3.1e-05,1.3e-05,-4e-05,4.5e-05,4e-05,-5.7e-05,5e-05,3.5e-05,0.000117,-1.3e-05
4.7e-05,3.2e-05,4e-06,-1.7e-05,2.4e-05,7e-06,-5.5e-05,4.3e-05,-1.4e-05,3e-06,-0.000146,0.000744,0.001047,0.001103,0.000206,-0.00016,0.000205,-0.000532,-0.000427,0.000347,-0.001921,-0.00127,-0.000261,0.000119,0.000222,0.000821,-0.000976,-0.00092,-0.003308,-0.001973,0.001246,0.008857,-0.005046,-0.004305,-0.002281,0.004666,-0.001853,-0.004026,-0.000705,0.001708,0.004096,0.004269,0.003733,0.001561,0.003036,0.005633,0.003691,-0.001857,0.005084,-0.00011,0.00231,-0.001533,0.001102,-0.000311,0.003926,0.003089,-0.000869,-0.002472,-8e-04,-0.00041,0.001922,0.002899,0.000819,0.001196,0.001107,-0.000253,0.000154,-0.000557,-0.000216,0.000136,0.000159,-0.000328,-0.000167,0.000273,-0.000481,-1.1e-05,0.000552,0.00098,0.000344,0.000819,-0.000878,-1.4e-05,-0.000891,-0.000223,0.000204,3.5e-05,-0.000433,-0.000651,9.4e-05,3.3e-05,0.000132,-0.000248,-0.000196,-4.2e-05,1e-06,-9.2e-05,-1.2e-05,2.6e-05,-0.000118,0.000127,-5.8e-05,-3.3e-05,0.000176,-5.9e-05,2.4e-05,0,-2.5e-05,-9.3e-05,2.5e-05,1.6e-05,9.4e-05,-4.1e-05,1e-06,-7.9e-05,-0.000152,5e-06,-6.7e-05,-0.000147,-4.4e-05,2e-05,7.1e-05
-9.6e-05,-8.4e-05,-4.2e-05,-7e-05,-2e-05,-8.6e-05,-9.5e-05,-4.3e-05,-3.6e-05,-6.2e-05,-6.5e-05,1e-06,-0.000559,-0.00141,-0.000267,0.000332,-0.000412,0.000275,0.000229,7.6e-05,0.001215,0.000689,0.000391,-0.000344,-0.000341,-0.002736,0.001593,0.000912,0.004827,0.000437,-0.000525,-0.006693,0.000185,-0.000608,0.003494,-0.003066,0.000826,-0.001095,0.000566,-0.000502,-0.00174,-0.002037,-0.001159,-0.002934,-0.000246,-0.008167,-0.002949,0.000602,-0.001235,0.000868,0.00179,0.004748,0.000322,-0.001675,-0.002172,-0.000257,-0.000507,-0.00211,-0.00097,-0.000797,-0.000603,-0.000749,-0.001638,-0.0025,-0.00154,0.00028,-0.000598,-0.000511,1.9e-05,-0.000225,0.000189,0.00046,0.000282,-0.000447,-0.000502,3.8e-05,-0.000716,-0.000712,-0.000987,-8.2e-05,0.000101,0.000236,-0.000722,-0.000868,-0.000467,1.4e-05,0.000134,-7.5e-05,0.000202,-0.000777,-0.000208,-0.000185,-0.000307,-0.000321,-0.000287,-6.7e-05,-6e-06,-6.4e-05,-0.000209,-8.6e-05,-5.8e-05,-0.000244,-7e-06,-8e-06,-0.000146,-0.00021,-0.000212,-6.3e-05,-0.000103,-5.6e-05,-7.3e-05,-0.00012,-3.5e-05,-0.000133,-0.000163,-7.4e-05,-8.5e-05,-0.000232,-0.00013,-0.000203,-3.7e-05
-7.1e-05,-6.5e-05,-4.2e-05,-2e-05,-2e-05,-3.5e-05,-6.2e-05,2.4e-05,-5.7e-05,-3e-05,5e-05,-0.000206,9e-05,0.000416,9.1e-05,2e-06,0.000253,-0.000298,0.000144,-0.000361,-0.000422,-0.000215,0.000225,0.000545,6.6e-05,-0.000867,0.0017,-0.00264,0.002316,0.00243,0.001204,0.001651,-0.002765,-0.001701,-0.002828,0.000681,-0.000385,0.000217,-0.000211,9.2e-05,0.000264,0.000641,0.000649,0.000486,-6.4e-05,0.00256,-0.000196,-0.000692,-0.002735,-0.000248,-0.001578,-2.6e-05,5.8e-05,0.001538,0.002531,0.002299,0.00154,0.004136,8.1e-05,-0.001432,0.000206,-0.00022,0.001182,0.001389,0.00102,0.000473,0.000451,0.000901,0.00025,0.000314,-0.000473,0.000329,0.000239,-1.7e-05,-0.000139,4.8e-05,-0.000269,0.000615,3.7e-05,1.6e-05,3.8e-05,-0.000553,-0.001033,0.000151,0.00021,-2.7e-05,-0.00037,-0.000189,-0.00024,-0.000138,-0.000295,-0.000326,-0.000228,-0.000159,-0.000161,-0.000163,-5.8e-05,-0.000134,0,-0.000182,-0.00012,-0.000157,-0.000319,-0.000222,-8.9e-05,-0.000187,-0.000108,-7e-05,-7.4e-05,-7.5e-05,-0.000104,-1.3e-05,-4.6e-05,-5.3e-05,-0.00017,-4.3e-05,-0.000121,-0.000133,-5.8e-05,-4.8e-05,5e-06
-5.3e-05,-2.7e-05,-2.5e-05,3e-06,2.8e-05,-4e-05,3.8e-05,7e-06,-2e-06,-1.2e-05,6.6e-05,7.2e-05,3e-06,0.000364,-0.000217,-0.000391,-3.9e-05,0.000503,-0.000277,0.000145,-0.000141,-1e-04,-0.000401,-0.000253,-0.000314,0.000326,-0.000319,-0.000428,-0.002427,-0.00314,0.003088,-0.001887,0.001449,0.000362,-0.000422,-0.000462,0.001815,-0.000273,0.000781,-0.001115,1.9e-05,0.001894,-0.001691,-0.002383,0.000126,0.000873,-0.001922,0.003088,0.001214,-0.001919,0.001338,-0.00302,0.000974,-0.000727,-0.001176,-0.001945,-0.001032,-0.000985,4.8e-05,0.000207,-0.002247,-0.001925,-0.000489,-0.001036,-0.001605,-0.000797,-0.000972,6e-05,2e-05,0.000202,-0.000238,3.1e-05,-0.00018,-0.000544,-3.4e-05,-0.000247,0.00081,0.000164,5.7e-05,0.00017,6.8e-05,0.000617,0.000165,-0.000583,1e-06,-6.6e-05,4.3e-05,4.2e-05,-6.1e-05,2.2e-05,-8e-05,-0.000139,-0.000173,-9.2e-05,-5e-05,-1.8e-05,-2.3e-05,-0.000141,-2.1e-05,-9.2e-05,-0.000109,-7.4e-05,-0.000106,-0.000136,-8.3e-05,-0.000133,-0.000136,-5e-06,-0.000108,-4.7e-05,-7.5e-05,-4.8e-05,-4.3e-05,-6.7e-05,-3.3e-05,-4e-05,-8.4e-05,-5.9e-05,-5.5e-05,-0.000119,-0.000115
5e-05,8e-06,3.2e-05,3e-06,9e-06,1.3e-05,5.6e-05,6.9e-05,2e-06,2.1e-05,2.3e-05,3.9e-05,-0.000208,-0.000536,-0.000393,0.000301,-0.000159,-0.000518,-4e-05,0.000375,0.00027,0.000311,0.00062,0.000356,0.000104,0.000608,0.00041,-0.000633,-1.8e-05,0.002397,0.000258,-0.000578,-0.003232,-0.002782,-0.001624,-7e-05,0.000655,0.000698,-0.002984,0.000167,-7.3e-05,-0.000565,0.000932,-0.000906,3e-04,-0.000709,0.002347,-0.000926,-0.002531,8.3e-05,0.000351,0.001265,-0.002151,0.001416,-0.001189,-0.000109,0.000442,0.000845,7.8e-05,0.001297,0.00237,8e-05,0.000189,0.000842,0.000902,0.000198,0.000836,-0.000151,0.000642,-0.000153,-6.5e-05,-5.9e-05,-0.000128,-0.000194,0.000678,-0.000238,-0.000932,-0.000834,-0.000153,0.000597,0.000242,-0.000284,-5.6e-05,0.000265,-0.000262,-4.6e-05,0.000175,0.000193,-0.000285,2.6e-05,-0.000186,-4.5e-05,-6e-05,-3.4e-05,1.5e-05,-8.4e-05,-0.000108,-9.2e-05,-7e-06,-3.1e-05,-5.7e-05,3.9e-05,-4.5e-05,2.7e-05,-1e-06,-4.3e-05,-7e-05,-4.7e-05,-4.5e-05,-4.4e-05,-4.8e-05,-8.7e-05,2.2e-05,-4.4e-05,-3e-05,-6.1e-05,-4e-06,-6e-05,-3e-06,-4.2e-05,-1.5e-05
2e-05,-7e-06,3.6e-05,1.9e-05,7e-06,1.6e-05,-2.4e-05,-8e-06,3.9e-05,-1.1e-05,-7.5e-05,-0.000109,0.000175,0.000184,0.000701,-0.000263,0.000112,0.000315,0.000218,8.7e-05,0.000303,-0.000216,-0.000461,-0.000147,-5.6e-05,-0.000158,0.000378,-0.001482,0.00071,0.001753,-0.002491,-0.001132,-0.001673,0.001767,-0.002334,0.000659,-0.000852,0.000799,-0.000136,-0.000926,0.00012,-0.00065,-1.1e-05,0.002171,0.00074,0.001582,-0.002455,0.00115,-4.6e-05,0.001544,0.000679,-0.000456,0.001934,-0.001204,0.000268,0.000381,0.000212,-0.000594,-0.000594,5.6e-05,0.000673,5.2e-05,0.000437,-0.000301,0.000711,-0.000239,-5.4e-05,0.000153,-0.000407,-8.1e-05,-0.000488,-0.000464,0.000319,0.000132,-0.000507,-0.000292,6.1e-05,-5.1e-05,-0.000456,1.4e-05,-3.7e-05,0.000124,0.000985,4.6e-05,4.7e-05,-1.2e-05,-0.000215,9.8e-05,-9.5e-05,-6.5e-05,-2e-05,-6.4e-05,6.4e-05,4e-05,-3.5e-05,-8.4e-05,9e-06,4e-06,-1.3e-05,-9.9e-05,-7.9e-05,3.2e-05,6e-06,6e-06,-2.9e-05,-4e-06,-3.4e-05,-3.9e-05,-6.6e-05,-2.7e-05,-8e-06,-5.9e-05,-2.2e-05,8e-06,1.4e-05,-5.3e-05,-7.5e-05,-4e-06,-2.6e-05,-6.9e-05,-1.7e-05
-2.1e-05,-9e-06,-1.3e-05,7e-06,-5e-06,-1.6e-05,-1.9e-05,1.1e-05,8e-06,-2.5e-05,4.5e-05,-5.2e-05,1.1e-05,9.7e-05,-0.000402,0.000141,-0.000203,-0.000135,-0.000199,-0.000229,-0.000463,-2.3e-05,0.000224,6.5e-05,-7.2e-05,0.000215,-0.000346,0.000485,0.001669,-0.000169,-0.001541,0.001881,0.000496,-0.000774,0.001739,-0.000444,-0.001729,-0.00122,-0.001606,-0.000344,6e-05,-0.000532,-0.000117,0.000339,-0.000108,-2e-05,0.001684,-0.00046,-0.000746,-0.002153,-6.8e-05,-0.001269,-0.001973,5.9e-05,0.000702,-0.000147,-0.000225,0.000303,-0.000364,0.00013,-0.000473,0.000203,-0.00051,4e-06,-0.000388,-0.000521,0.00011,0.000269,-0.000305,-2.6e-05,-9.5e-05,-0.000146,-0.000219,-7.1e-05,0.000212,-2.8e-05,0.000137,0.000161,0.000283,0.000343,0.000143,8.6e-05,-0.000331,-5.2e-05,0.000132,-7e-06,0.000136,-0.000476,-0.000425,-0.000144,-0.00025,-2.8e-05,3e-05,-1.4e-05,-1.1e-05,-1.9e-05,-3.1e-05,-3.8e-05,-6.4e-05,-5.2e-05,4.8e-05,2.2e-05,-4.4e-05,-5.2e-05,-7e-06,-4.3e-05,-6.4e-05,-9e-06,-1.3e-05,-1.6e-05,-1.3e-05,-2e-05,-2.3e-05,-2.4e-05,-7e-06,-4e-05,3.1e-05,1.4e-05,-3.4e-05,-1.5e-05,-4e-06
7e-06,-4e-06,-1e-05,4e-06,-2e-06,1.4e-05,-1.1e-05,-2.6e-05,1.2e-05,-1.5e-05,-5e-06,2.6e-05,-0.000215,8e-06,-0.000397,-0.000206,-4e-05,5.8e-05,0.000235,-3.2e-05,2e-06,5.9e-05,0.000102,-6.1e-05,-6e-06,-0.000144,0.001583,0.000415,0.00013,-0.000313,-0.001846,0.000436,1e-04,2.5e-05,-0.001318,5.9e-05,0.000901,-0.000541,0.002021,-0.000239,-0.000182,0.00059,-0.00082,-0.001522,-0.000465,0.000786,-0.000786,0.000602,0.000268,0.000589,-0.000417,-0.000397,0.001767,0.000241,-0.000296,-0.000616,-0.000298,-0.000877,0.001159,-0.000312,-0.000565,0.000414,-1.3e-05,0.000149,6.9e-05,-0.000406,-0.000444,-3.4e-05,-0.000216,-3.3e-05,0.000366,0.000157,-0.000301,0.000143,-0.000185,7.8e-05,-6.6e-05,0.000252,0.000137,-0.000729,0.000106,-0.00027,-3e-04,4.4e-05,0.000163,8e-05,-8.4e-05,-0.000126,-0.000206,-0.000113,0.000156,-0.000223,-1.2e-05,4e-06,-2.1e-05,7.2e-05,-1.3e-05,-2.1e-05,-2.7e-05,7e-06,-3.2e-05,-2.4e-05,-2.5e-05,-4e-05,-6e-06,-3.2e-05,3.5e-05,9e-06,3e-05,-3.3e-05,9e-06,1.7e-05,-4e-06,-1e-06,1.9e-05,3.4e-05,-2.4e-05,2e-05,-2e-06,4e-06,-1e-06
-1e-05,-6e-06,-4e-06,9e-06,3e-06,-8e-06,2.2e-05,-4e-06,-9e-06,-1e-06,3.6e-05,3.6e-05,0.00013,6.2e-05,0.00072,0.000153,7.5e-05,2.7e-05,-0.000245,0.000164,0.000182,1.7e-05,-0.000151,-3.6e-05,4.6e-05,-0.000305,-0.001013,-0.000376,-0.000682,0.000184,0.000476,-0.000808,8.1e-05,0.000138,-0.000171,-0.000665,0.000746,0.00062,-0.001429,-0.000453,0.000212,0.000609,0.000829,0.001968,-0.000185,-0.00095,4.3e-05,-0.000692,0.000356,-0.000186,-0.000515,0.000232,-0.000412,8.1e-05,-0.000665,0.000325,-9.9e-05,0.000249,-0.000466,0.000192,-4.6e-05,-0.000322,-0.00038,-1e-05,-9e-06,0.000171,1.2e-05,-1.1e-05,0.000339,2.3e-05,3.2e-05,-0.000193,0.000208,-5.5e-05,0.000108,3.9e-05,-7.8e-05,-3.6e-05,-1.5e-05,-0.000116,0.000143,0.000146,9e-05,-1.9e-05,-0.000118,-4.8e-05,6.9e-05,0.000436,1.9e-05,-9.4e-05,0.000149,0.000192,-9e-06,3.2e-05,-9e-06,-5e-06,9e-06,1.1e-05,-2e-06,3.2e-05,-1e-06,-2.9e-05,1.6e-05,3.3e-05,5e-06,2e-06,1.5e-05,-9e-06,1.6e-05,1.1e-05,2.4e-05,2e-05,-5e-06,1e-06,-2.1e-05,1.5e-05,-1.4e-05,-1.9e-05,1.5e-05,2.7e-05,1.5e-05
-1e-06,-1e-06,1e-05,5e-06,-4e-06,5e-06,-6e-06,3e-06,1e-05,6e-06,-9e-06,-1.9e-05,1.9e-05,-0.000423,-0.000396,-0.000184,-7.8e-05,-2e-05,0.000156,-0.000106,-8.3e-05,-6.5e-05,-0.000263,-6.7e-05,-1.4e-05,-8.1e-05,-0.000589,-0.00011,5.8e-05,0.000145,0.000323,0.001961,0.001499,-0.000731,0.000309,-0.000378,0.000102,-0.00026,0.000316,0.000278,-0.000234,-0.000402,0.000397,-0.001036,-0.000566,0.000143,0.000454,0.001195,0.000364,-0.000491,-0.000199,-0.000218,-0.000261,0.000778,-7.7e-05,-3.5e-05,-7.5e-05,-0.000223,0.000416,0.000194,0.000169,-0.000288,0.000297,0.000168,-0.000232,0.000561,-0.00023,3e-06,-2e-04,-0.000146,-0.000105,9.4e-05,9.2e-05,1.2e-05,7.6e-05,5.8e-05,-1.9e-05,-0.000168,-2.7e-05,-0.000476,5.1e-05,-3.9e-05,-1e-04,-2e-06,-0.000156,0.000143,-1.9e-05,-8.4e-05,8.4e-05,2.7e-05,-6.8e-05,-8.6e-05,4e-06,7e-06,7e-06,1.3e-05,6e-06,1.4e-05,3.8e-05,2.2e-05,9e-06,-1e-05,1.7e-05,-8e-06,-1.4e-05,2.8e-05,3.4e-05,1.4e-05,1.4e-05,7e-06,-2e-06,-6e-06,0,6e-06,-6e-06,5e-06,2.1e-05,1e-06,4e-06,2.4e-05,5e-06
-1.1e-05,-4e-06,0,5e-06,1e-06,0,9e-06,-7e-06,-2e-05,6e-06,-1.2e-05,-1.5e-05,-1e-05,0.00032,0.000311,4.2e-05,0.000143,-1.3e-05,-5e-05,-1e-05,-5.2e-05,7e-05,0.000285,0.000253,9e-06,0.000111,-7.7e-05,0.000134,0.00088,0.000397,0.000514,-0.001561,-0.000615,0.000656,0.000365,-0.00019,-0.000627,-0.000195,0.000934,-0.000567,-0.000289,-0.000206,-0.000833,4e-06,-0.000887,0.000474,-0.000558,-0.000766,5e-04,0.000553,9.7e-05,0.000668,0.001109,-0.000514,0.000725,-2e-06,0.000397,0.000267,8e-06,-3e-06,0.000141,0.000507,0.000145,-0.000183,0.000127,9.1e-05,0.000102,7.7e-05,-6.6e-05,6.4e-05,0.000152,-4.9e-05,-1.3e-05,8.4e-05,0.000123,1.8e-05,6e-05,-6.7e-05,-1.3e-05,0.00011,4e-06,-4.1e-05,-0.000127,7e-06,9.9e-05,-2e-05,-2.7e-05,-6.7e-05,0.00013,1.1e-05,3e-05,5.2e-05,1.1e-05,-6e-06,1.1e-05,-1.8e-05,3e-06,-2e-06,1.2e-05,-1.3e-05,1.1e-05,5e-06,9e-06,-7e-06,1.2e-05,-5e-06,-1e-05,-2.1e-05,-1.8e-05,3.1e-05,-1.5e-05,-5e-06,4e-06,-6e-06,-1.4e-05,-1.1e-05,-1.3e-05,0,-9e-06,-1.5e-05,-3e-06
3e-06,-6e-06,1e-06,-4e-06,-1e-06,-4e-06,6e-06,-8e-06,-3e-06,4e-06,4e-06,2.2e-05,-3e-05,-0.000115,-0.000127,7.2e-05,-5.3e-05,3.3e-05,1.8e-05,-0.000103,0.000109,-8e-06,-0.000153,-2e-04,-9e-06,0.000108,-1.3e-05,-0.000256,5.5e-05,-0.000156,0.000374,-0.000283,-0.000666,0.000221,-0.000574,-0.000412,-5.4e-05,-0.000224,-0.000178,9.8e-05,0.000195,-0.000182,0.000581,0.00028,-7.8e-05,-0.000694,3.4e-05,0.000488,0.000173,-0.000345,-6.2e-05,1e-06,-0.000819,4e-04,-1.5e-05,-0.000279,-0.000218,0.00014,0.000209,0.000153,1.3e-05,-2.1e-05,-0.000251,0.000108,-3.2e-05,-0.000187,9.5e-05,-6.3e-05,-6.4e-05,-2e-05,-7.8e-05,8.6e-05,-2.4e-05,-6.8e-05,5.2e-05,-4.1e-05,-7.2e-05,1e-04,9e-06,-0.000268,-8.4e-05,3.8e-05,1e-04,-3e-06,-6.5e-05,4e-05,1.4e-05,2.3e-05,9.3e-05,-1.4e-05,-7.1e-05,-1.3e-05,-3e-06,-1.8e-05,-2e-06,-1.7e-05,0,-1.3e-05,-4e-06,-6e-06,-1.5e-05,1.5e-05,-4e-06,-2.1e-05,-1.7e-05,-9e-06,-1.6e-05,4e-06,-9e-06,-9e-06,-1.1e-05,-5e-06,-2e-06,-1e-06,7e-06,-8e-06,1.1e-05,-1.9e-05,1e-06,-4e-06,-1e-06
1.1e-05,0,1e-06,-2e-06,1e-06,2e-06,-1.1e-05,-4e-06,2e-06,-4e-06,2e-06,4e-06,6e-06,-4.3e-05,-0.000105,-2.1e-05,7e-06,2.6e-05,-2e-05,7.5e-05,-7e-05,-1.9e-05,6e-05,0.000114,8e-06,-2.3e-05,-2.4e-05,0.00015,-0.000338,-0.000135,-0.000515,-0.00054,0.00061,-0.000436,0.000182,6.9e-05,0.000482,0.000293,-5.6e-05,2.6e-05,0.000263,0.000214,-0.000363,-0.000253,0.000111,0.000119,-0.000107,-0.000569,3e-06,0.000297,-5e-06,-0.00036,0.000439,-0.000479,0.000154,-5.7e-05,-9.3e-05,4e-05,-5.9e-05,-2.6e-05,-0.000352,2.5e-05,-2.6e-05,-0.000177,-0.000122,2e-06,-4.7e-05,6e-05,3e-05,0,-2.7e-05,-5.6e-05,-1.7e-05,-5.3e-05,2.2e-05,1.5e-05,-1e-05,5.8e-05,6.2e-05,5.2e-05,-4e-06,-7.3e-05,3.6e-05,-3.6e-05,3.8e-05,2e-06,7e-06,-4.6e-05,-1.3e-05,-3.1e-05,-4.1e-05,2.2e-05,1.3e-05,-2e-06,3e-06,-1.4e-05,-6e-06,-1.6e-05,-7e-06,-1.6e-05,-7e-06,9e-06,-1.2e-05,-1.4e-05,-1e-06,9e-06,-1.1e-05,-4e-06,-1.5e-05,-3e-06,-8e-06,-5e-06,1e-06,-1e-06,-2e-06,-2e-06,-4e-06,7e-06,-1e-05,-1.2e-05,0
0,0,2e-06,-2e-06,-3e-06,2e-06,-7e-06,-1e-06,4e-06,-2e-06,6e-06,-1.1e-05,3.2e-05,4.8e-05,5.1e-05,-1.9e-05,5e-06,3e-06,3e-06,4.1e-05,-3.8e-05,-6e-06,-2.3e-05,-4.8e-05,-3e-06,3.4e-05,-0.000148,-0.000165,-4e-06,0,6.9e-05,6.5e-05,-0.000603,-0.000172,0.000116,-0.000171,-0.000309,-0.00011,0.000261,0.000324,-0.000124,1e-04,0.000277,2.2e-05,-9.4e-05,5.9e-05,0.000162,0.000176,-0.000102,0.000115,-0.000168,0.000455,-0.000334,0.000225,5.5e-05,0.000242,3.3e-05,-0.000212,0.000227,-7.1e-05,0.000401,-0.000451,-7.3e-05,2.9e-05,0.000148,4.7e-05,3.2e-05,3.3e-05,-4.5e-05,5e-06,-3.5e-05,0.000111,2e-05,6.1e-05,-2.9e-05,1e-06,6.8e-05,2.2e-05,5e-05,8.8e-05,-3.8e-05,8.9e-05,3.2e-05,4.6e-05,2.1e-05,-6e-06,-2.3e-05,2.3e-05,-3.7e-05,-5.3e-05,-5.5e-05,-5e-05,1e-05,-3e-06,-6e-06,3e-06,-1e-06,-5e-06,-1e-05,-2.1e-05,-4e-06,0,-9e-06,1.2e-05,0,-1e-05,-6e-06,-3e-06,-4e-06,-7e-06,-3e-06,-1e-06,0,-4e-06,3e-06,4e-06,-4e-06,-1e-06,-4e-06,-1.5e-05,-2e-06
-1e-06,-1e-06,-2e-06,1e-06,2e-06,-2e-06,-2e-06,-1.1e-05,-1e-06,-4e-06,-1e-06,3e-06,-4.8e-05,4.6e-05,-4.5e-05,2e-05,-1.8e-05,-1.8e-05,2.1e-05,-2.1e-05,0.000113,-1e-05,-4.8e-05,4e-05,-4e-06,-2.8e-05,-0.000296,-0.000112,-0.000124,1.7e-05,0.000428,9.1e-05,0.000401,0.00024,-0.000406,0.000357,0.000392,-0.00011,-0.000506,3.8e-05,-0.000188,-2.4e-05,1.4e-05,-3.6e-05,7.6e-05,0.000232,3.8e-05,-0.00036,-0.00029,-0.000244,-0.000132,-3.6e-05,0.000176,0.00013,-0.000326,3.1e-05,1.2e-05,-4.6e-05,-0.000176,-9.7e-05,-3e-06,0.000211,-4.1e-05,-1.9e-05,0.000148,8.5e-05,-0.000119,-1.3e-05,7.3e-05,4e-06,-4.3e-05,-5.5e-05,0.000131,-2.7e-05,-1.9e-05,1.4e-05,-5.1e-05,-7.9e-05,-8e-05,2.9e-05,4e-06,-6.7e-05,-4e-05,-4.4e-05,2.9e-05,1.4e-05,2.5e-05,-3.2e-05,1.2e-05,-2.4e-05,2.7e-05,2.2e-05,5e-06,4e-06,-1.1e-05,2e-06,-4e-06,-7e-06,-2e-06,-8e-06,-3e-06,-3e-06,-1.1e-05,-6e-06,5e-06,-6e-06,-5e-06,-1e-06,-3e-06,-3e-06,3e-06,1e-06,-2e-06,-1e-06,-6e-06,-5e-06,2e-06,3e-06,3e-06,5e-06,1e-06
-2e-06,-2e-06,-2e-06,1e-06,-1e-06,3e-06,9e-06,2e-06,6e-06,0,-1e-06,6e-06,5.3e-05,-2e-05,9.7e-05,1.2e-05,3.1e-05,6e-06,-2.3e-05,-5.2e-05,-1.5e-05,3e-06,-2e-05,1e-05,-2e-06,-6.5e-05,-1.1e-05,-4.1e-05,0.000203,-6.1e-05,0.000294,0.000191,-0.000216,-0.000101,7.4e-05,-0.000146,-0.000208,-0.000206,-8.9e-05,4e-06,9.9e-05,2.2e-05,-8.9e-05,0.000118,4.9e-05,-0.000224,-3.3e-05,0.000361,0.000132,-0.000105,0.000159,2.5e-05,-0.000121,-3e-06,0.000253,7.4e-05,-2.5e-05,3.3e-05,2.7e-05,-0.000164,-9.7e-05,-8e-06,4.4e-05,3e-06,-0.000144,-1e-05,9.3e-05,-4e-05,-8e-06,1.9e-05,-3e-06,1.8e-05,-0.000152,-1.4e-05,5.3e-05,-2.7e-05,7e-06,-7.2e-05,-2e-06,5.1e-05,-2e-06,-5e-06,-4.5e-05,1.8e-05,-6.3e-05,-1e-05,7e-06,2.5e-05,-4.2e-05,6e-06,2.2e-05,-3.5e-05,1e-06,3e-06,3e-06,1.4e-05,0,-3e-06,5e-06,7e-06,-2e-06,-7e-06,1e-06,-8e-06,-7e-06,-7e-06,0,-1e-06,5e-06,4e-06,7e-06,-3e-06,-2e-06,2e-06,-4e-06,-1e-06,-2e-06,0,3e-06,2e-06,-5e-06
-2e-06,0,0,1e-06,1e-06,-1e-06,2e-06,-1e-06,-1e-06,-1e-06,-2e-06,-2e-06,-3.6e-05,5e-06,-7.8e-05,-1.2e-05,-3.5e-05,1e-05,1.5e-05,4e-06,-7.9e-05,2.4e-05,0.000131,-3.8e-05,1e-06,-4e-05,0.000189,4.1e-05,0.000224,-0.000139,5.9e-05,0.000361,0.000205,0.000185,-0.000248,0.000269,0.00028,-6e-06,-0.000222,-0.000115,0.000169,-8.7e-05,0.000267,-0.000246,0.00017,-0.000101,-0.000224,-0.000319,-0.00017,0.000146,-4.7e-05,5.5e-05,-6.9e-05,3.5e-05,3.6e-05,-0.000264,4.9e-05,-0.000168,0.000116,-6e-06,-4e-06,0.000138,6.1e-05,2.9e-05,9.9e-05,-0.000105,-7.2e-05,4.2e-05,9.9e-05,-4e-06,3.7e-05,-3e-05,2.3e-05,2.8e-05,3e-06,8e-06,1.3e-05,7.2e-05,2.8e-05,2.1e-05,1e-06,5.6e-05,-2.5e-05,8e-06,3.6e-05,4e-06,-1.8e-05,5.4e-05,-5.2e-05,1.4e-05,0,1.4e-05,2e-06,1e-06,-1e-06,-8e-06,3e-06,5e-06,5e-06,9e-06,-4e-06,-5e-06,1e-05,-4e-06,0,-2e-06,2e-06,-3e-06,1.2e-05,1e-06,3e-06,-5e-06,2e-06,-1e-06,-1e-05,-2e-06,-3e-06,-4e-06,1e-06,4e-06,1e-06
-3e-06,-1e-06,2e-06,0,0,-1e-06,0,1e-06,-4e-06,1e-06,0,-4e-06,-1.3e-05,-3.5e-05,-9e-06,-1e-06,1e-06,-2.1e-05,-1.3e-05,2e-05,3e-05,-7e-06,-0.000113,5.4e-05,2e-06,4.9e-05,0.000117,-0.000131,-0.000419,2.6e-05,-0.000314,-8.3e-05,-0.000186,-0.000259,-3.5e-05,5.2e-05,-0.000492,-2.4e-05,0.000268,-5.5e-05,-6e-05,-9e-06,-0.000233,9.6e-05,2.2e-05,0.00027,0.000149,0.000171,1e-06,2.5e-05,-3.3e-05,-6.3e-05,0.000287,-0.000238,-3.3e-05,0.000121,7e-06,0.000125,-0.000128,1.6e-05,0.000128,-0.000141,4.7e-05,-8e-06,-1.1e-05,1.8e-05,4.4e-05,9e-06,-3.5e-05,-1e-05,-2.5e-05,9e-06,7.2e-05,-2e-06,7.9e-05,-7e-06,0,3.6e-05,-1.4e-05,8.3e-05,-1.4e-05,-6.6e-05,-4.1e-05,-1e-05,-1.3e-05,-1e-06,2.3e-05,-4.7e-05,-2e-06,-6e-06,3.1e-05,1.3e-05,1e-06,2e-06,4e-06,3e-06,-3e-06,2e-06,-2e-06,2e-06,0,1e-06,-1e-06,-5e-06,3e-06,7e-06,-2e-06,1e-06,3e-06,-2e-06,5e-06,-1e-06,-2e-06,0,-1e-06,2e-06,3e-06,-2e-06,1e-06,5e-06,3e-06
-1e-06,-2e-06,1e-06,0,-1e-06,1e-06,-3e-06,-2e-06,-3e-06,-1e-06,1e-06,1e-06,3.9e-05,5.6e-05,0.000112,-1.8e-05,7e-06,2.7e-05,8e-06,1.3e-05,2.2e-05,-1.3e-05,9.2e-05,-5e-05,-3e-06,2.8e-05,1.3e-05,4e-05,-6e-05,-6.8e-05,-0.000244,0.00036,0.000109,-0.000211,-7.4e-05,8.8e-05,0.000171,0.000118,-9.8e-05,-9.7e-05,-9.6e-05,3.1e-05,0.000373,-0.000116,9.5e-05,-0.000268,3.4e-05,-0.000403,9.7e-05,-0.000215,0.000175,-7.8e-05,-0.000229,5.3e-05,-0.000224,6.6e-05,-3.9e-05,4.5e-05,0.000117,5e-06,2.6e-05,0.000144,-8e-05,6.4e-05,-7.7e-05,-4e-06,-2.3e-05,-4.3e-05,-3.2e-05,2e-06,5.5e-05,3.2e-05,-2.2e-05,-3e-06,-9e-06,1.9e-05,-1.5e-05,1.7e-05,-1.1e-05,4.9e-05,-8e-06,5.1e-05,3e-05,-5e-06,-1e-05,1e-06,-2.5e-05,-2.8e-05,-7e-06,-2.7e-05,-1e-05,-1.3e-05,-1e-06,-3e-06,4e-06,0,0,-3e-06,-4e-06,8e-06,-3e-06,4e-06,8e-06,5e-06,-1e-06,-2e-06,2e-06,-1e-06,-3e-06,0,-1e-06,1e-06,1e-06,1e-06,0,2e-06,-2e-06,-4e-06,0,1e-06,2e-06
2e-06,-1e-06,-1e-06,0,0,-1e-06,-3e-06,4e-06,0,0,1e-06,3e-06,-1.7e-05,-1.2e-05,-7.5e-05,-2e-06,-1.6e-05,-2.3e-05,3e-06,-1e-05,-3.8e-05,-1e-06,-5.1e-05,3.9e-05,-1e-06,3e-06,2.7e-05,-7.2e-05,0.000226,2.3e-05,-0.000125,-0.000502,-0.000115,9.9e-05,0.00015,3e-06,1.8e-05,-8e-05,0.000115,-4.9e-05,1.4e-05,4.8e-05,-0.000267,0.000114,2.5e-05,2e-05,-7.7e-05,0.000273,0.000151,8.2e-05,3e-06,8.1e-05,0.000148,-4.4e-05,-3.7e-05,5.1e-05,-4e-06,2.2e-05,-5.8e-05,8e-06,-3.3e-05,-7e-05,-1.1e-05,-2e-05,4.8e-05,-1.8e-05,1.5e-05,1.9e-05,4.9e-05,7e-06,1.8e-05,-4.1e-05,-4.1e-05,-1.1e-05,2.2e-05,-4e-06,3e-06,-5.5e-05,9e-06,2.6e-05,-4e-06,-3e-05,3.5e-05,6e-06,-9e-06,2e-06,8e-06,6e-06,-2.1e-05,-3.1e-05,1e-06,7e-06,3e-06,-3e-06,-2e-06,-2e-06,-1e-06,-2e-06,-1e-06,1e-06,0,3e-06,-1e-05,-1e-06,-4e-06,-8e-06,-3e-06,1e-06,-6e-06,-2e-06,-5e-06,-1e-06,-1e-06,-1e-06,4e-06,1e-06,1e-06,0,-2e-06,-4e-06,0
3e-06,0,0,-1e-06,1e-06,0,-2e-06,0,-1e-06,0,-1e-06,-1e-06,-8e-06,-7e-06,-4.4e-05,8e-06,1.7e-05,1.9e-05,-1.2e-05,-3e-06,3.5e-05,1.6e-05,2e-05,-2.2e-05,2e-06,3e-06,6.2e-05,-3.5e-05,-4.3e-05,-0.000123,-3.7e-05,-4.6e-05,0.000302,0.000207,-2.5e-05,0.000198,0.000235,-6e-05,3.8e-05,-1.2e-05,4.9e-05,2.5e-05,5e-06,-6.2e-05,7.5e-05,0.000126,-3.8e-05,-0.00024,0.00011,5.4e-05,-7e-06,-0.000119,-0.000101,0.000218,5.8e-05,-0.000149,-6e-06,-8e-05,-4e-05,7e-06,-6.4e-05,4.6e-05,-2.9e-05,2.3e-05,-5.5e-05,4.2e-05,3.7e-05,-1.3e-05,3e-05,2e-06,-1.5e-05,2.3e-05,4.4e-05,6e-06,-2.3e-05,6e-06,1e-05,-3.6e-05,-1.8e-05,-1.1e-05,-4e-06,-3e-06,-3.4e-05,-9e-06,1.7e-05,-5e-06,1e-06,4.5e-05,2.3e-05,-2.2e-05,-1.5e-05,-2.2e-05,6e-06,-2e-06,-2e-06,-5e-06,2e-06,-4e-06,2e-06,-6e-06,-2e-06,1e-06,1e-05,-1.3e-05,2e-06,2e-06,-2e-06,-2e-06,-6e-06,4e-06,-5e-06,-2e-06,0,-1e-06,0,-2e-06,1e-06,0,0,-5e-06,-2e-06
-1e-06,0,0,0,-1e-06,-1e-06,1e-06,0,2e-06,-1e-06,-1e-06,-2e-06,3e-06,8e-06,8.1e-05,-9e-06,-7e-06,-1.8e-05,1.2e-05,6e-06,2.7e-05,-9e-06,-1.1e-05,4e-06,0,-1.3e-05,0.000159,-9e-06,1e-05,3.8e-05,6.3e-05,-0.000156,-0.000421,-0.000194,-2.8e-05,0.000105,-0.000169,-1.9e-05,8e-05,-4.7e-05,-3e-06,-4.3e-05,0.000202,0.000126,-7e-06,4.4e-05,-1.5e-05,0.000251,6e-06,-0.000139,6.7e-05,-8.7e-05,-2.6e-05,-6.4e-05,-5e-05,1.8e-05,1.3e-05,5.1e-05,8.7e-05,-2.4e-05,-6.5e-05,-3.5e-05,1.1e-05,-1.7e-05,-2.4e-05,1.6e-05,-4.1e-05,-1.1e-05,-4.2e-05,-8e-06,-3e-06,-6.4e-05,-2.8e-05,-5e-06,8e-06,-9e-06,-1.1e-05,3.5e-05,-1e-06,-1e-05,9e-06,3.5e-05,2.1e-05,-4e-06,2.4e-05,5e-06,-7e-06,-2.1e-05,1.8e-05,0,-2.3e-05,2.6e-05,2e-06,1e-06,-3e-06,-2e-06,-1e-06,-2e-06,3e-06,-7e-06,-2e-06,-2e-06,-1.5e-05,-4e-06,0,1e-06,-2e-06,1e-06,-6e-06,-2e-06,-5e-06,-3e-06,-1e-06,1e-06,-1e-06,-2e-06,-3e-06,0,1e-06,-3e-06,1e-06
0,-1e-06,0,1e-06,1e-06,0,5e-06,3e-06,2e-06,0,0,1e-06,8e-06,-1e-06,-7.2e-05,9e-06,4e-06,1.5e-05,-1.1e-05,9e-06,-4.3e-05,-2e-06,6.1e-05,7e-06,-1e-06,-2e-05,6.2e-05,-8e-06,-1e-04,-2.8e-05,2.4e-05,0.000109,0.000208,-5.1e-05,-4.7e-05,-0.000148,-0.000112,-3e-05,-9.3e-05,-9e-06,-3.3e-05,-2.4e-05,-0.00026,-0.00018,-2.9e-05,-6.2e-05,0.000125,-0.000191,0.000109,7.4e-05,-2.6e-05,0.000148,0.000138,3.3e-05,8.2e-05,5.3e-05,2.1e-05,-9.6e-05,-8e-05,2.2e-05,0.000127,4.4e-05,9.4e-05,-7e-06,7.8e-05,5e-06,1.7e-05,-2.4e-05,-3.2e-05,-1e-06,3e-06,6.5e-05,1.1e-05,-6e-06,1e-06,2e-06,-1e-06,2.4e-05,5e-06,-4.2e-05,-1e-06,-5.2e-05,-2e-05,1.2e-05,-1.9e-05,-3e-06,1.4e-05,-9e-06,1e-06,9e-06,-1e-06,-2e-05,0,2e-06,0,-4e-06,-2e-06,0,1e-06,-2e-06,-1e-06,-2e-06,0,4e-06,-1e-06,-3e-06,-2e-06,0,0,0,0,-2e-06,0,0,-5e-06,-1e-06,2e-06,-2e-06,0,-3e-06,-2e-06
-2e-06,0,-1e-06,0,0,0,0,1e-06,1e-06,0,1e-06,1e-06,-6e-06,3e-06,5.8e-05,-1.9e-05,1e-06,-1e-05,8e-06,-1.1e-05,-2e-06,1.7e-05,-7.2e-05,-1.4e-05,0,-1.1e-05,-4.9e-05,-8.4e-05,-9.4e-05,1.8e-05,-4.8e-05,3.8e-05,-4.1e-05,3e-06,-4.8e-05,0.000113,5e-05,-3.3e-05,3.6e-05,-3.2e-05,1.1e-05,2e-06,0.000112,7.1e-05,-3.1e-05,-8.3e-05,-1.9e-05,0.000171,-1e-06,-7.7e-05,-4e-06,-2.2e-05,-0.00022,-0.000126,2.9e-05,1e-06,2e-06,3.7e-05,9e-06,1.4e-05,-3.8e-05,-7.8e-05,-2.2e-05,-1.1e-05,1.9e-05,2.1e-05,-5.4e-05,1.4e-05,3e-06,2e-06,-4.1e-05,-4.8e-05,1e-05,7e-06,2.8e-05,1e-06,9e-06,2.2e-05,1.4e-05,-6.4e-05,4e-06,4.6e-05,-3.6e-05,-1e-05,-6e-06,2e-06,-9e-06,5e-06,1.2e-05,1e-06,-1e-06,9e-06,0,0,0,3e-06,2e-06,-1e-06,-2e-06,0,-1e-06,-1e-06,-1e-06,-3e-06,0,-1e-06,-2e-06,-1e-06,3e-06,-2e-06,4e-06,0,-1e-06,-1e-06,-4e-06,0,-1e-06,0,0,2e-06,1e-06
-1e-06,0,0,0,0,-1e-06,-2e-06,1e-06,-1e-06,0,0,-1e-06,-1e-06,1e-06,-4.7e-05,2.8e-05,-7e-06,8e-06,-3e-06,-8e-06,2.5e-05,-1.3e-05,2.3e-05,1.4e-05,1e-06,1.9e-05,-4.7e-05,1.1e-05,0.000217,-5e-05,-2.3e-05,-3.2e-05,-0.000115,-2.1e-05,5.2e-05,8e-06,7.3e-05,4.5e-05,-3.4e-05,5.7e-05,1.4e-05,3e-05,-8.7e-05,0.000137,-6.2e-05,9.9e-05,-0.000101,-0.000222,-0.000102,-6e-06,3.5e-05,2e-05,0.000217,-1e-06,-2.1e-05,-6.4e-05,-1.4e-05,4.6e-05,9e-06,2e-05,-4.9e-05,1.3e-05,-2.6e-05,-7e-06,-5.2e-05,-4e-05,3.4e-05,-5e-06,-2.3e-05,1e-06,1.2e-05,7.5e-05,-2.2e-05,-1.2e-05,6e-06,4e-06,-5e-06,-4.5e-05,2e-06,-1.6e-05,-3e-06,-2.4e-05,1.6e-05,6e-06,1e-05,-3e-06,6e-06,0,-4e-06,-1.4e-05,1.3e-05,-6e-06,2e-06,0,3e-06,4e-06,0,0,-3e-06,0,-1e-06,0,6e-06,0,1e-06,2e-06,-1e-06,0,4e-06,0,5e-06,0,1e-06,0,-3e-06,2e-06,-1e-06,-2e-06,-1e-06,4e-06,0
-1e-06,-1e-06,0,0,0,0,-3e-06,-1e-06,-1e-06,-1e-06,0,-1e-06,7e-06,-1e-06,1.3e-05,-1.5e-05,7e-06,-9e-06,-3e-06,8e-06,-1.9e-05,-1.3e-05,2.1e-05,-1e-05,0,8e-06,-2.2e-05,-4.1e-05,-4e-05,2e-05,8.1e-05,3e-04,0.000144,2.2e-05,-0.000142,-0.000103,4e-06,2.6e-05,-4.7e-05,9e-06,-2.9e-05,1.9e-05,6.3e-05,-0.000275,-5.4e-05,-8.4e-05,1.9e-05,0.000228,0,9.1e-05,-3.5e-05,-2.1e-05,-1e-04,7.8e-05,4.6e-05,1.7e-05,-1.1e-05,3.6e-05,-2.4e-05,1.9e-05,1.2e-05,1.5e-05,-8e-06,-3e-06,5.6e-05,5e-06,4e-06,-2.8e-05,-3e-06,0,-6e-06,-6e-05,-7e-06,1e-05,1e-05,-3e-06,-2e-06,-2.4e-05,-7e-06,-2.3e-05,0,-3e-06,-1.2e-05,-2e-06,-2e-05,1e-06,0,-6e-06,-1.5e-05,-1.9e-05,1.2e-05,1.3e-05,2e-06,-1e-06,0,3e-06,-1e-06,0,0,3e-06,-1e-06,1e-06,5e-06,-3e-06,0,2e-06,0,1e-06,4e-06,2e-06,3e-06,-1e-06,0,0,1e-06,1e-06,2e-06,-1e-06,-1e-06,2e-06,0
0,0,0,0,0,0,0,2e-06,-1e-06,0,0,0,-1e-05,-2e-05,1.6e-05,1.6e-05,-9e-06,9e-06,4e-06,5e-06,-9e-06,7e-06,-4.6e-05,5e-06,-1e-06,1e-06,2e-06,-2.7e-05,-0.000127,-1.9e-05,0.000118,-4e-05,1.6e-05,-6.4e-05,4.5e-05,-6.3e-05,-8.5e-05,-5.9e-05,-8.1e-05,8e-06,-1.2e-05,-8e-06,-1.2e-05,0.000185,-4.3e-05,-2.2e-05,8.3e-05,-0.000142,-2.1e-05,-0.000128,-2.8e-05,-2.3e-05,2.6e-05,2.4e-05,6.2e-05,3.7e-05,-5e-06,3e-06,2.5e-05,-3e-06,4.6e-05,1.3e-05,-1.2e-05,-5e-06,-6e-06,2.3e-05,1.1e-05,1.1e-05,-1.8e-05,-1e-06,-2e-06,3e-05,2e-05,-2e-06,-1.1e-05,-2e-06,1e-06,1.7e-05,1.3e-05,-3e-06,-1e-06,2.6e-05,1e-05,-2e-06,1.5e-05,0,-4e-06,4e-06,-1e-06,-1.3e-05,1.1e-05,-2.4e-05,1e-06,0,-1e-06,1e-06,0,-1e-06,1e-06,3e-06,-1e-06,1e-06,-4e-06,-6e-06,-1e-06,-1e-06,-2e-06,-1e-06,0,-2e-06,1e-06,0,0,0,1e-06,-1e-06,-2e-06,0,0,2e-06,0
2e-06,0,0,0,0,0,1e-06,-3e-06,-1e-06,0,0,0,2e-06,3e-06,-8e-06,-1e-05,0,-9e-06,-6e-06,1e-06,2.6e-05,4e-06,3.9e-05,-3e-06,-1e-06,-2e-06,-2e-05,-9e-06,8.5e-05,2.4e-05,6.8e-05,-4.6e-05,-5.3e-05,-0.000124,-9.9e-05,1.8e-05,0.000111,-2.1e-05,9.5e-05,-2.9e-05,3e-05,-8e-06,-6.3e-05,-4.8e-05,-1.7e-05,8.7e-05,-1.8e-05,0.000185,1.4e-05,3.2e-05,9e-06,8e-06,9e-06,5.3e-05,-1.4e-05,-3.3e-05,1.2e-05,1.8e-05,-8e-06,-1.4e-05,-5e-06,-1.9e-05,2.9e-05,1.6e-05,-4.4e-05,2e-06,-1.7e-05,0,1.9e-05,0,2.4e-05,-4.3e-05,8e-06,-9e-06,-1.4e-05,1e-06,3e-06,2.8e-05,-4e-06,-1.2e-05,3e-06,-3.9e-05,9e-06,0,-1e-06,0,1e-06,0,-5e-06,-3e-06,-7e-06,2e-05,2e-06,0,0,-5e-06,0,-1e-06,2e-06,2e-06,-1e-06,0,-3e-06,2e-06,0,-2e-06,1e-06,1e-06,-2e-06,1e-06,-2e-06,-1e-06,0,0,1e-06,-1e-06,1e-06,-1e-06,0,0,0
0,0,0,0,0,0,2e-06,0,1e-06,0,0,0,1.2e-05,2e-06,2.3e-05,0,2e-06,7e-06,7e-06,-6e-06,-8e-06,1e-06,-3.1e-05,2e-06,0,-1e-06,-8.1e-05,-3.3e-05,-3.4e-05,5e-06,-3.3e-05,-0.000206,2.7e-05,5.5e-05,3.6e-05,-0.000109,-6.2e-05,2.2e-05,-1.4e-05,1.2e-05,1.8e-05,-1.2e-05,0.000135,-2.8e-05,-1.7e-05,3.2e-05,-1.8e-05,-0.000168,-1.5e-05,3.7e-05,-4.9e-05,7.9e-05,-6e-05,-0.000126,-2.6e-05,9e-06,5e-06,-2.3e-05,1e-05,-2e-05,-1.9e-05,-1e-05,1.7e-05,3e-06,3.4e-05,-2.7e-05,-1.4e-05,-1.1e-05,5e-06,2e-06,2e-06,4e-05,-2.5e-05,1.7e-05,-5e-06,2e-06,-5e-06,1.6e-05,3e-06,2.9e-05,0,3.6e-05,-1.6e-05,1e-06,1.1e-05,0,2e-06,1.1e-05,-1.3e-05,3e-06,-1.2e-05,-8e-06,0,0,-3e-06,-3e-06,0,-1e-06,1e-06,-2e-06,-1e-06,-1e-06,1e-06,1e-06,0,0,-2e-06,0,-4e-06,-2e-06,-3e-06,-1e-06,0,0,-2e-06,1e-06,0,0,0,-4e-06,0
0,0,0,0,0,0,1e-06,0,1e-06,0,0,0,-1.4e-05,-1e-06,-4.9e-05,0,-5e-06,-6e-06,-8e-06,-2e-06,-1.4e-05,1e-06,6e-06,-1e-06,1e-06,-8e-06,-6.6e-05,-3.9e-05,1.3e-05,-7e-06,-7.6e-05,9.4e-05,-1.6e-05,5.4e-05,-8.9e-05,-0.000118,-2.2e-05,2.5e-05,-3e-06,1.9e-05,-3.6e-05,5e-06,-0.00011,3.9e-05,1.8e-05,-6e-06,-3.3e-05,0.000172,7e-05,-6.3e-05,-2e-05,-5.6e-05,0.000114,0,-1e-05,-2.9e-05,6e-06,-4.8e-05,-1.6e-05,-5e-06,-1.4e-05,1.4e-05,1.2e-05,2e-06,-3.1e-05,2e-06,1e-05,-5e-06,0,1e-06,-2e-06,-4e-06,-3e-06,-1.3e-05,-2e-06,2e-06,0,-3.7e-05,0,1.5e-05,1e-06,-1.8e-05,1e-05,-3e-06,-1.8e-05,0,-6e-06,-1.4e-05,7e-06,-2e-06,0,-2e-06,0,0,1e-06,-1e-06,0,0,-1e-06,-1e-06,-1e-06,-1e-06,-5e-06,-5e-06,0,1e-06,-1e-06,0,-4e-06,1e-06,-3e-06,0,-1e-06,0,-2e-06,1e-06,-1e-06,0,0,-3e-06,0
-1e-06,0,0,0,0,0,-1e-06,-1e-06,1e-06,0,0,0,3e-06,-3e-06,1.7e-05,0,2e-06,4e-06,7e-06,5e-06,1.6e-05,-4e-06,-4e-06,1e-06,-1e-06,-3e-06,-1.4e-05,-3e-06,7.2e-05,1.2e-05,-5.1e-05,-0.000128,-1.7e-05,-8.1e-05,8.8e-05,6.8e-05,-2.8e-05,-1.5e-05,4.4e-05,-6e-06,-2.1e-05,1.2e-05,4.9e-05,2e-06,1.2e-05,-3.5e-05,3.2e-05,-0.00016,7.1e-05,-2e-06,2.3e-05,-2e-06,-0.000141,-3.9e-05,-2.7e-05,4.2e-05,-7e-06,1.2e-05,1.6e-05,-5e-06,2e-06,-1.6e-05,-1.4e-05,3e-06,-1.2e-05,3e-06,4e-06,5e-06,-6e-06,-1e-06,1.3e-05,9e-06,2.7e-05,-2e-06,9e-06,-1e-06,4e-06,-1.6e-05,-6e-06,1.8e-05,0,-6e-06,-2.4e-05,3e-06,1.5e-05,0,4e-06,-6e-06,3e-06,-1.2e-05,-1.4e-05,4e-06,2e-06,1e-06,1e-06,-1e-06,1e-06,-1e-06,-1e-06,1e-06,-1e-06,-1e-06,9e-06,-1e-06,0,-1e-06,-1e-06,0,-2e-06,1e-06,-2e-06,0,1e-06,0,-3e-06,0,1e-06,-1e-06,0,-1e-06,0
-1e-06,0,0,0,0,0,-2e-06,-1e-06,0,0,0,0,7e-06,-3e-06,3.6e-05,0,-2e-06,-3e-06,-5e-06,0,5e-06,-6e-06,1.9e-05,-2e-06,-1e-06,5e-06,-5e-06,-3.2e-05,-0.000112,-1e-06,-2.9e-05,1.2e-05,4.8e-05,-3.9e-05,-5.6e-05,-2.4e-05,0.000122,-8e-06,3.1e-05,-2.1e-05,3.2e-05,6e-06,3.2e-05,-6.6e-05,2.2e-05,2.3e-05,2.8e-05,0.00017,3e-06,-7e-06,-4.2e-05,9e-06,0.000119,9.7e-05,-3.7e-05,-5e-06,-5e-06,-1.8e-05,-2.2e-05,8e-06,4.7e-05,1.9e-05,-1.8e-05,2e-06,4.9e-05,0,3e-06,7e-06,4.4e-05,-2e-06,-2e-05,-1e-05,-1.6e-05,1e-05,-1e-06,0,-3e-06,6e-06,-5e-06,2.2e-05,-1e-06,2.5e-05,-9e-06,0,-2e-06,0,0,1e-05,-4e-06,-1.5e-05,3e-06,-1e-06,0,0,0,1e-06,0,-1e-06,-1e-06,-2e-06,-1e-06,0,-8e-06,-2e-06,0,-2e-06,-1e-06,0,2e-06,-1e-06,1e-06,-1e-06,0,0,-1e-06,-1e-06,0,0,0,0,-1e-06
0,0,0,0,0,0,-1e-06,0,0,0,0,0,-6e-06,-3e-06,-3.9e-05,-9e-06,3e-06,2e-06,3e-06,-5e-06,-1.6e-05,4e-06,-3.3e-05,2e-06,0,4e-06,4e-06,-2.5e-05,1.2e-05,1.6e-05,-4e-06,9.6e-05,-7.4e-05,-1.9e-05,2e-06,-7.3e-05,-4.2e-05,-3.6e-05,-7.4e-05,-3.1e-05,1.9e-05,2e-06,-9.3e-05,5.3e-05,1.2e-05,-2.9e-05,-2.1e-05,-0.000147,4e-05,0,8e-06,-1.2e-05,-5e-05,3.3e-05,-4e-06,5e-06,-1e-06,1e-06,-2e-06,4e-06,-3.2e-05,-2.4e-05,-1.1e-05,-7e-06,-6e-06,2.2e-05,-1e-05,-1.7e-05,2e-06,1e-06,-6e-06,-2.3e-05,-1e-06,-1e-05,-1e-06,-1e-06,0,3.2e-05,2e-06,1.6e-05,2e-06,-3.3e-05,2e-05,-3e-06,-2e-06,0,-3e-06,7e-06,9e-06,-8e-06,5e-06,-2e-06,0,0,1e-06,2e-06,-1e-06,-1e-06,0,-1e-06,-1e-06,0,8e-06,-2e-06,0,0,-1e-06,0,3e-06,-1e-06,3e-06,-1e-06,0,0,0,-1e-06,-1e-06,-1e-06,0,2e-06,0
0,0,0,0,0,0,1e-06,0,-1e-06,0,0,0,0,1.2e-05,0,6e-06,2e-06,0,-1e-06,-4e-06,4e-06,1e-06,4e-05,-1e-06,1e-06,1e-06,-2e-06,-1.2e-05,9.3e-05,-1.7e-05,-9e-06,7.6e-05,0.00011,-1.8e-05,9e-06,3.5e-05,-3.9e-05,2.5e-05,4.4e-05,-1e-06,-2.8e-05,-6e-06,6.5e-05,1.1e-05,1.1e-05,-3.3e-05,-3.3e-05,0.000153,2.8e-05,-2e-05,3e-05,1.5e-05,-2e-06,-2.1e-05,-4e-06,-3.1e-05,-1e-06,7e-06,1e-05,0,-3e-05,2.1e-05,-2e-06,-5e-06,-2.2e-05,-1.2e-05,-4e-06,1.4e-05,-7e-06,2e-06,-1e-06,2.1e-05,9e-06,3e-06,-2.1e-05,1e-06,2e-06,9e-06,-3e-06,1.3e-05,1e-06,2.8e-05,-1.6e-05,3e-06,-3e-06,0,5e-06,-1.1e-05,6e-06,1e-06,1.2e-05,-5e-06,0,0,-1e-06,0,1e-06,0,1e-06,2e-06,-1e-06,1e-06,-7e-06,1e-06,0,1e-06,-1e-06,0,3e-06,0,3e-06,0,0,0,2e-06,0,1e-06,-1e-06,0,3e-06,0
1e-06,0,0,0,0,0,2e-06,-1e-06,-1e-06,0,0,0,4e-06,-7e-06,2e-05,-6e-06,-1e-06,-1e-06,-1e-06,3e-06,6e-06,-3e-06,-4.1e-05,0,0,-2e-06,3e-06,-3.7e-05,-7.2e-05,2.9e-05,-2.7e-05,9.7e-05,-0.000126,-7e-06,-5.3e-05,9.9e-05,-2.5e-05,2e-05,9e-06,-8e-06,-1.4e-05,-4e-06,1e-06,-6.6e-05,4e-06,1.2e-05,8e-06,-0.00017,1.2e-05,5e-06,-3.2e-05,-1.5e-05,2.1e-05,-4.5e-05,-2.3e-05,7e-06,8e-06,1.6e-05,-1.6e-05,-2e-06,2.3e-05,-2.6e-05,3.5e-05,2e-06,4.1e-05,-7e-06,6e-06,1.1e-05,-8e-06,-1e-06,-1.3e-05,-1.5e-05,-2e-05,-1e-06,-1e-05,-1e-06,0,-2.6e-05,-1e-06,-1.1e-05,0,-1.2e-05,9e-06,-3e-06,3e-06,0,-3e-06,0,-7e-06,4e-06,7e-06,1.3e-05,2e-06,0,-1e-06,2e-06,0,0,1e-06,1e-06,-1e-06,0,4e-06,-3e-06,0,0,-1e-06,0,2e-06,-1e-06,2e-06,-1e-06,0,0,0,1e-06,-1e-06,0,0,0,0
0,0,0,0,0,0,0,2e-06,0,0,0,0,-2e-06,-1e-06,-1.5e-05,1.1e-05,0,1e-06,1e-06,5e-06,-1.2e-05,8e-06,4.2e-05,2e-06,-1e-06,0,3.2e-05,-1.9e-05,-5e-06,-1.8e-05,-8e-06,-0.000104,5.9e-05,-5.1e-05,2.6e-05,-2.1e-05,6.4e-05,2.1e-05,-2.1e-05,1e-06,1.8e-05,2e-06,-3.5e-05,5.9e-05,-3e-06,8e-06,4e-05,0.000147,-1e-05,-9e-06,2.6e-05,4e-06,-4.7e-05,-6.6e-05,2.3e-05,3.5e-05,3e-06,-1.4e-05,1.4e-05,1e-06,1.9e-05,3.7e-05,9e-06,-2e-06,-7e-06,6e-06,1.5e-05,-1e-05,9e-06,-2e-06,5e-06,4.2e-05,1.5e-05,-2e-06,-1.7e-05,1e-06,-1e-06,-1.9e-05,1e-06,-3e-06,0,-8e-06,4e-06,1e-06,-4e-06,0,2e-06,2e-06,3e-06,-1e-06,-4e-06,-1.5e-05,0,0,0,-1e-06,-1e-06,0,0,-1e-06,-1e-06,0,0,-2e-06,1e-06,-2e-06,-1e-06,0,0,2e-06,0,0,0,0,0,0,0,-1e-06,0,0,0
0,0,0,0,0,0,-1e-06,0,0,0,0,0,-4e-06,5e-06,2.8e-05,-1e-05,-2e-06,-1e-06,-2e-06,-2e-06,-1e-06,0,-3e-05,-4e-06,0,-1e-06,4e-05,-1.6e-05,4e-05,2.3e-05,3.7e-05,1.4e-05,9e-06,-3.7e-05,-7.8e-05,9e-06,-1.5e-05,-2.6e-05,-1.8e-05,0,6e-06,4e-06,2.1e-05,-3.4e-05,-3e-06,1.5e-05,-1.1e-05,-0.000147,-2e-05,-2.9e-05,3.3e-05,-2.5e-05,8.4e-05,6.4e-05,3.3e-05,-1.4e-05,-7e-06,1.1e-05,-1e-06,1e-06,-5e-06,-2.8e-05,-2.3e-05,1e-06,-3.1e-05,5e-06,-1e-05,8e-06,-1.8e-05,0,1.2e-05,-4.2e-05,1.6e-05,4e-06,7e-06,-1e-06,0,4e-06,3e-06,-2.6e-05,0,2.6e-05,-1.6e-05,0,-3e-06,0,-2e-06,5e-06,0,-1.1e-05,-2e-06,9e-06,0,0,1e-06,-1e-06,0,-1e-06,-1e-06,0,-1e-06,0,0,0,0,0,0,-1e-06,-3e-06,-2e-06,-3e-06,0,0,0,-2e-06,0,1e-06,0,0,-1e-06,0
