0.106042,0.110594,0.128713,0.148003,0.131617,0.124947,0.134721,0.121871,0.107783,0.119436,0.140981,0.140481,0.124531,0.115739,0.137803,0.157721,0.122732,0.088941,0.101202,0.112429,0.103994,0.100134,0.102204,0.103673,0.103968,0.114063,0.135523,0.142217
0.13067,0.137283,0.161257,0.186831,0.164842,0.157502,0.173745,0.155289,0.130832,0.142549,0.169848,0.170925,0.154697,0.14695,0.17783,0.20324,0.156938,0.112994,0.127705,0.143798,0.136798,0.131234,0.130306,0.133306,0.13575,0.14754,0.175736,0.182667
0.170991,0.181392,0.214122,0.248565,0.218025,0.21058,0.239281,0.213072,0.170127,0.181103,0.217045,0.219388,0.203184,0.197321,0.24134,0.275478,0.212544,0.153532,0.172194,0.197411,0.194712,0.185756,0.178988,0.185527,0.192434,0.206514,0.243945,0.249874
0.198553,0.21217,0.246626,0.278613,0.243537,0.238109,0.277171,0.253589,0.200496,0.20759,0.245214,0.247099,0.23171,0.224839,0.269948,0.307489,0.245026,0.185119,0.201683,0.232552,0.239052,0.226869,0.215352,0.224888,0.233155,0.245484,0.282167,0.284318
0.206413,0.223851,0.251109,0.266897,0.234416,0.227558,0.264255,0.258004,0.214226,0.216513,0.247298,0.253614,0.241264,0.224291,0.249493,0.27997,0.242774,0.200628,0.205541,0.236088,0.254066,0.237655,0.226463,0.236365,0.240613,0.249513,0.270432,0.263922
0.229345,0.247718,0.265865,0.270609,0.245847,0.227597,0.245787,0.252984,0.228623,0.236159,0.264092,0.273695,0.25669,0.226328,0.231012,0.250927,0.23989,0.212906,0.20641,0.245198,0.272839,0.244686,0.235973,0.246254,0.247973,0.269177,0.276242,0.251735
0.325466,0.335275,0.343563,0.356894,0.352935,0.314511,0.300046,0.313071,0.30309,0.320222,0.355976,0.345757,0.30012,0.262518,0.269142,0.298195,0.307383,0.276753,0.266058,0.314958,0.339301,0.299018,0.290466,0.309706,0.311304,0.346681,0.361602,0.33553
0.530285,0.521073,0.510928,0.555364,0.601835,0.514514,0.447818,0.492381,0.50044,0.52379,0.55792,0.48508,0.390744,0.350395,0.37359,0.445874,0.489781,0.440588,0.431885,0.477973,0.47898,0.432172,0.419542,0.461827,0.462237,0.508122,0.568693,0.568799
0.890122,0.859306,0.810532,0.887622,1.015869,0.850561,0.706634,0.805212,0.837933,0.868311,0.885277,0.717755,0.574738,0.52589,0.564625,0.725962,0.829804,0.740837,0.739537,0.7881,0.742519,0.677839,0.667455,0.751731,0.738447,0.811761,0.973015,1.003625
1.363851,1.317778,1.230748,1.322004,1.557632,1.319736,1.082375,1.22955,1.283893,1.313103,1.27717,0.999817,0.836089,0.788085,0.834964,1.125669,1.314451,1.146468,1.159498,1.239876,1.130596,1.032632,1.030613,1.172068,1.142577,1.263615,1.558838,1.604168
1.776459,1.735459,1.635851,1.71099,2.041815,1.782293,1.488045,1.638426,1.690704,1.704482,1.570732,1.20624,1.068872,1.036484,1.092841,1.532856,1.803518,1.515252,1.546861,1.704472,1.520605,1.369768,1.396665,1.594392,1.552904,1.738633,2.151641,2.168152
1.863368,1.847888,1.772781,1.815025,2.163654,1.960428,1.721562,1.808647,1.805726,1.790641,1.569211,1.208002,1.12741,1.107489,1.179077,1.72173,2.016808,1.611077,1.653531,1.911569,1.682003,1.478703,1.552032,1.766461,1.712126,1.94679,2.389985,2.335389
1.493805,1.503217,1.468118,1.493492,1.76214,1.677126,1.582445,1.557745,1.472005,1.43776,1.217645,0.96958,0.942689,0.919134,0.994395,1.503116,1.732176,1.305491,1.337474,1.642466,1.446781,1.233712,1.333592,1.500928,1.435502,1.652894,1.997036,1.889627
0.93073,0.958486,0.949265,0.951526,1.07943,1.137827,1.161214,1.051993,0.943989,0.907222,0.766376,0.64693,0.642546,0.618002,0.658235,0.983461,1.110936,0.81391,0.815548,1.047013,0.963152,0.814278,0.886564,0.963859,0.888035,1.013976,1.194416,1.118104
0.613181,0.725127,0.844565,0.775685,0.744259,0.901231,0.923233,0.82318,0.851722,0.782164,0.665842,0.606338,0.579779,0.53943,0.502166,0.680465,0.79901,0.634572,0.578382,0.676718,0.699691,0.631587,0.61317,0.62436,0.565678,0.597513,0.67787,0.704412
0.800534,1.016976,1.287209,1.123927,0.961666,1.212682,1.265041,1.196339,1.338839,1.167497,0.941533,0.873635,0.826469,0.7572,0.688863,0.932962,1.124038,0.927263,0.825008,0.87949,0.953474,0.90139,0.808248,0.797943,0.722059,0.715421,0.834425,0.946499
1.195734,1.521064,1.899711,1.653012,1.428841,1.77608,1.830325,1.76855,2.000908,1.754304,1.425358,1.294145,1.161379,1.029969,1.003451,1.399171,1.658826,1.41712,1.277347,1.290347,1.354074,1.268642,1.117068,1.077962,1.005105,0.999533,1.158242,1.353816
1.632346,2.051303,2.445602,2.148782,1.90183,2.23939,2.278761,2.271565,2.54781,2.338189,2.050449,1.82025,1.483382,1.228428,1.314184,1.849881,2.146651,1.971728,1.818625,1.701261,1.656322,1.514138,1.347087,1.278218,1.27664,1.305403,1.442065,1.697739
2.028234,2.467976,2.750214,2.530218,2.334252,2.507094,2.494547,2.514255,2.74027,2.781035,2.714938,2.340045,1.716529,1.312336,1.592729,2.142538,2.387537,2.486397,2.402733,2.054848,1.811963,1.638569,1.48971,1.367239,1.520261,1.644151,1.660937,1.837367
2.296515,2.671474,2.883974,2.904098,2.718478,2.586055,2.531765,2.563682,2.68105,3.01191,3.137718,2.657296,1.843252,1.290518,1.829836,2.30594,2.365118,2.761868,2.811841,2.342777,1.979872,1.75231,1.556028,1.372548,1.712647,1.963631,1.81207,1.800312
2.271943,2.546532,2.798592,3.053661,2.779013,2.389399,2.342317,2.379876,2.427925,2.943944,3.089494,2.612415,1.876564,1.286847,1.985009,2.367834,2.137173,2.530412,2.73732,2.498613,2.227101,1.837037,1.475609,1.308741,1.77784,2.081837,1.795969,1.566647
1.973668,2.115252,2.349071,2.688217,2.446006,2.078864,1.951697,1.904049,1.969687,2.493522,2.606907,2.257129,1.733111,1.237976,1.876168,2.151085,1.740933,1.862715,2.159737,2.351397,2.228903,1.660325,1.185108,1.124491,1.61729,1.851964,1.555581,1.286243
1.430933,1.438183,1.575916,1.887691,1.821183,1.619262,1.447133,1.350156,1.372226,1.697929,1.87589,1.785677,1.448343,1.072412,1.450808,1.587343,1.263848,1.21125,1.485018,1.917375,1.876925,1.305497,0.897603,0.877831,1.203875,1.369017,1.214665,1.032653
0.910124,0.880794,0.981033,1.229148,1.219757,1.088526,1.058565,1.005659,0.90448,0.976674,1.122056,1.218422,1.106063,0.882246,0.966554,1.003076,0.912224,0.919516,1.116005,1.409035,1.390323,1.043017,0.789479,0.731252,0.821805,0.974043,0.962358,0.829779
0.811868,0.743101,0.728625,0.892807,0.90634,0.770787,1.01739,1.107984,0.798456,0.727462,0.802913,0.937174,1.007242,0.870787,0.794309,0.84216,0.943013,0.994831,1.141925,1.299719,1.307732,1.103111,0.858491,0.785317,0.772543,0.858129,0.891392,0.846546
0.908742,0.781225,0.708217,0.890352,0.985016,0.860525,1.236131,1.374377,0.853913,0.707201,0.768738,0.900999,1.029135,0.95172,0.944256,1.072926,1.27218,1.240653,1.253878,1.429872,1.495799,1.327932,1.029343,0.937716,0.90277,0.908164,0.944215,0.932883
0.932511,0.853977,0.805712,1.032121,1.208861,1.027228,1.395997,1.528135,0.89139,0.794997,0.907805,0.922849,1.000119,1.026737,1.153089,1.336949,1.595745,1.42009,1.211643,1.468566,1.597755,1.431132,1.162196,1.09095,1.022377,0.963424,0.972747,0.902332
0.886534,0.912494,0.92724,1.17341,1.418059,1.131495,1.423267,1.494128,0.861854,0.942397,1.08408,0.925943,0.962557,1.08828,1.281783,1.444609,1.784449,1.604702,1.140868,1.316795,1.505264,1.403849,1.202676,1.20562,1.11075,0.968802,0.972237,0.853313
0.810516,0.909245,0.912323,1.115753,1.392481,1.099728,1.323293,1.352947,0.801252,1.049603,1.227455,0.905269,0.838898,0.994072,1.255416,1.434833,1.825036,1.77327,1.118911,1.027281,1.282866,1.336644,1.187438,1.241852,1.12184,0.878389,0.925819,0.864077
0.667913,0.756246,0.752856,0.876904,1.07606,0.910544,1.190287,1.257486,0.761548,1.007303,1.241608,0.865605,0.654909,0.852528,1.201415,1.410401,1.710294,1.688354,1.012719,0.735005,0.998843,1.218951,1.237923,1.262472,1.080741,0.842017,0.887783,0.877109
0.481872,0.509686,0.536336,0.565075,0.683631,0.693873,0.981684,1.053196,0.65881,0.808355,1.043602,0.759815,0.504947,0.71564,1.049113,1.189671,1.299487,1.275855,0.858674,0.626266,0.734987,0.934317,1.135701,1.146382,0.904842,0.792799,0.859219,0.827111
0.334666,0.294254,0.33476,0.33186,0.430623,0.515256,0.694433,0.712128,0.502044,0.577732,0.71777,0.604195,0.43616,0.552374,0.721491,0.758192,0.747331,0.74775,0.661583,0.604694,0.628234,0.665218,0.822608,0.841182,0.645675,0.630768,0.758609,0.728401
0.229053,0.168815,0.182658,0.219781,0.314566,0.419516,0.494564,0.446268,0.360012,0.399341,0.456432,0.435099,0.356737,0.351854,0.372399,0.366959,0.39553,0.450619,0.495797,0.516022,0.523461,0.437463,0.451542,0.482128,0.397192,0.408243,0.542516,0.523782
0.17003,0.116574,0.122757,0.151618,0.195235,0.323274,0.378806,0.329034,0.283474,0.275036,0.318593,0.329637,0.281565,0.221133,0.185262,0.206095,0.288149,0.339661,0.354591,0.349829,0.386054,0.328089,0.26618,0.266161,0.203514,0.218934,0.324612,0.319144
0.132826,0.102883,0.098475,0.097266,0.102132,0.219905,0.274485,0.244471,0.225476,0.207571,0.247941,0.276302,0.236779,0.153626,0.105168,0.147024,0.227263,0.24022,0.207734,0.19068,0.241512,0.242487,0.205465,0.210036,0.140385,0.158082,0.224922,0.227029
0.114017,0.098025,0.080359,0.073801,0.079874,0.152048,0.19082,0.1984,0.188005,0.180589,0.212061,0.223356,0.191539,0.120225,0.078727,0.136574,0.222784,0.19768,0.141147,0.141984,0.164887,0.169383,0.159457,0.172938,0.141522,0.138214,0.17151,0.184414
0.106272,0.087064,0.07437,0.07362,0.078204,0.104659,0.118554,0.158797,0.180095,0.183589,0.176492,0.150513,0.127269,0.087521,0.073263,0.140527,0.206437,0.17736,0.1221,0.12679,0.137802,0.114232,0.121092,0.163084,0.15452,0.113835,0.117942,0.142423
0.091837,0.077249,0.078172,0.083513,0.080191,0.090963,0.094962,0.122324,0.147305,0.16524,0.151007,0.107079,0.072052,0.052143,0.062283,0.12981,0.15906,0.143444,0.102462,0.102195,0.112359,0.082662,0.098283,0.156772,0.159966,0.094599,0.070936,0.100922
0.065983,0.06407,0.079147,0.087479,0.074631,0.080877,0.078722,0.080163,0.093354,0.119358,0.116713,0.089703,0.057886,0.032264,0.048407,0.103714,0.106257,0.104017,0.093648,0.081889,0.091693,0.080384,0.079573,0.125219,0.144483,0.098718,0.060057,0.075513
0.046746,0.05957,0.084742,0.082225,0.06045,0.064165,0.055911,0.042044,0.046968,0.069176,0.073913,0.074244,0.061651,0.032824,0.050431,0.08501,0.084445,0.082709,0.084604,0.077041,0.074914,0.076598,0.063955,0.083004,0.108051,0.102201,0.070664,0.063364
