0.00743,0.006657,0.006459,0.006573,0.006551,0.007237,0.008418,0.008403,0.008449,0.008215,0.006585,0.006373,0.007464,0.007792,0.007478,0.006973,0.006793,0.006068,0.005226,0.005456,0.005568,0.005112,0.005553,0.005799,0.004995,0.004734,0.004929,0.005644
0.00968,0.008562,0.0083,0.008508,0.008255,0.008917,0.010637,0.010742,0.010426,0.009967,0.007915,0.007655,0.00917,0.009387,0.008807,0.008276,0.008021,0.007249,0.006419,0.006672,0.006937,0.006407,0.006663,0.006931,0.006124,0.005844,0.006088,0.007005
0.014161,0.012272,0.011921,0.012403,0.011694,0.012002,0.014519,0.014926,0.01396,0.013191,0.01042,0.010051,0.01221,0.012045,0.011022,0.010534,0.010089,0.009255,0.008682,0.009028,0.009492,0.008845,0.008617,0.008896,0.008186,0.007844,0.008181,0.009419
0.01942,0.016377,0.016215,0.017377,0.016156,0.01532,0.017864,0.018767,0.017955,0.017091,0.013348,0.012671,0.015098,0.014697,0.013763,0.013352,0.012385,0.011255,0.011322,0.011875,0.012075,0.01132,0.010485,0.010805,0.010486,0.009981,0.010226,0.01156
0.025971,0.021632,0.022595,0.02537,0.023804,0.020907,0.021384,0.022418,0.024363,0.023481,0.017259,0.015881,0.018181,0.018618,0.018885,0.01871,0.017076,0.0147,0.015086,0.0157,0.015056,0.014544,0.013201,0.013412,0.01366,0.012794,0.012234,0.013236
0.036601,0.030431,0.033627,0.039694,0.037798,0.03142,0.027872,0.028756,0.03556,0.034009,0.023345,0.021199,0.02344,0.025754,0.028236,0.028663,0.026201,0.02114,0.021032,0.021613,0.019992,0.019759,0.017446,0.017501,0.018593,0.016894,0.014764,0.015681
0.052345,0.042852,0.047836,0.058289,0.05646,0.045816,0.038281,0.039995,0.051169,0.047453,0.031503,0.028798,0.031562,0.036079,0.040641,0.041548,0.038286,0.030247,0.029167,0.029288,0.026687,0.02673,0.023284,0.023047,0.024732,0.022019,0.018531,0.020092
0.067006,0.054423,0.059372,0.072646,0.071482,0.05832,0.048795,0.05113,0.063185,0.056932,0.037925,0.035035,0.038055,0.044334,0.050295,0.051096,0.047368,0.037594,0.035737,0.035233,0.032078,0.032719,0.028945,0.028146,0.029731,0.026625,0.022336,0.024182
0.071783,0.058998,0.061136,0.073038,0.073599,0.062225,0.053377,0.054478,0.062143,0.05486,0.038675,0.036685,0.039586,0.045899,0.051131,0.050754,0.046821,0.038181,0.036596,0.035421,0.032526,0.034248,0.031535,0.029766,0.030591,0.028635,0.024827,0.025958
0.068559,0.058334,0.056497,0.063352,0.066047,0.060122,0.054353,0.051562,0.050616,0.045413,0.036876,0.035216,0.036736,0.040839,0.044153,0.042694,0.038414,0.032833,0.032615,0.030857,0.02875,0.031201,0.030059,0.027899,0.027596,0.027389,0.026508,0.02699
0.069078,0.059772,0.054691,0.057873,0.064536,0.06481,0.060985,0.052326,0.044137,0.041919,0.038537,0.036481,0.036161,0.036628,0.038649,0.036847,0.031995,0.029171,0.029814,0.027316,0.026055,0.028323,0.027696,0.026877,0.025572,0.025165,0.027764,0.029085
0.081569,0.067413,0.056678,0.057902,0.069994,0.07593,0.07354,0.060263,0.0487,0.047427,0.042299,0.039716,0.039238,0.037286,0.038317,0.034673,0.029185,0.029386,0.031442,0.028494,0.027118,0.029568,0.028614,0.027531,0.02529,0.025126,0.030533,0.033225
0.095018,0.072841,0.058057,0.062647,0.078002,0.084965,0.086202,0.070994,0.055539,0.052948,0.04355,0.041656,0.042349,0.038641,0.038783,0.03359,0.028039,0.030683,0.033045,0.029495,0.029222,0.032489,0.031865,0.0294,0.025253,0.026556,0.033366,0.035802
0.098151,0.071139,0.055146,0.064105,0.078637,0.08417,0.092811,0.079802,0.058694,0.05297,0.042715,0.041514,0.041447,0.036609,0.036961,0.033653,0.028727,0.031306,0.032093,0.028281,0.030475,0.034619,0.0343,0.030202,0.024578,0.027337,0.033426,0.034057
0.085978,0.064403,0.053615,0.063785,0.073638,0.077019,0.092894,0.086311,0.060059,0.048592,0.041301,0.040766,0.039956,0.036754,0.037222,0.038342,0.033339,0.030726,0.030729,0.029357,0.031827,0.033442,0.032608,0.029077,0.025098,0.028805,0.033847,0.033242
0.071603,0.062845,0.060586,0.069151,0.075108,0.079988,0.102527,0.102124,0.070661,0.050334,0.044215,0.044451,0.047487,0.050981,0.051,0.054866,0.046703,0.035362,0.037499,0.042067,0.044871,0.040962,0.035819,0.031927,0.030389,0.033679,0.039606,0.040872
0.083264,0.083367,0.086216,0.09473,0.098968,0.104976,0.138542,0.141903,0.100641,0.072189,0.06197,0.05855,0.067074,0.07877,0.079135,0.086337,0.072323,0.051852,0.057722,0.067166,0.070734,0.062434,0.051599,0.042339,0.040551,0.04601,0.056733,0.060763
0.110135,0.117549,0.122956,0.131715,0.130764,0.131296,0.174102,0.179822,0.130499,0.099244,0.085991,0.077096,0.089614,0.108337,0.109603,0.122068,0.102484,0.073356,0.082632,0.094502,0.098354,0.086913,0.072518,0.057445,0.052555,0.060277,0.077432,0.084982
0.127277,0.150844,0.156662,0.157655,0.148263,0.138555,0.178135,0.183741,0.139189,0.115059,0.102778,0.088976,0.102021,0.123019,0.124596,0.142795,0.122176,0.088748,0.099129,0.108766,0.112144,0.100903,0.087111,0.070548,0.062776,0.070077,0.089175,0.098813
0.131554,0.177345,0.179556,0.163642,0.144316,0.12609,0.150828,0.153813,0.125531,0.114025,0.104613,0.088489,0.09639,0.113203,0.115986,0.135083,0.119028,0.09064,0.098915,0.100469,0.101778,0.095886,0.087147,0.077353,0.069988,0.071591,0.084672,0.093524
0.128717,0.190395,0.183787,0.15668,0.136895,0.115716,0.124157,0.121915,0.104764,0.100672,0.095021,0.080564,0.082551,0.09065,0.094679,0.113407,0.101957,0.08023,0.084877,0.08391,0.084553,0.084808,0.080494,0.076562,0.070997,0.065222,0.069009,0.074786
0.132531,0.18535,0.165337,0.136322,0.124293,0.108268,0.109312,0.105466,0.093878,0.088622,0.082495,0.073755,0.075963,0.074481,0.0773,0.095226,0.084727,0.066688,0.071262,0.077734,0.078249,0.07974,0.074543,0.067527,0.064166,0.05682,0.05778,0.060861
0.125318,0.1507,0.123904,0.101433,0.099742,0.095052,0.09277,0.091888,0.090405,0.081148,0.069245,0.063917,0.066077,0.060535,0.066033,0.078213,0.065721,0.055062,0.064034,0.075312,0.074474,0.070967,0.060994,0.052262,0.054998,0.049736,0.048187,0.049306
0.097733,0.105031,0.085007,0.067126,0.072305,0.08143,0.076207,0.077088,0.083502,0.070428,0.056811,0.051006,0.04898,0.044822,0.052302,0.059466,0.050224,0.04694,0.054952,0.064096,0.063461,0.05434,0.045751,0.045174,0.051917,0.044178,0.03902,0.041198
0.067186,0.073422,0.069738,0.0596,0.059741,0.070909,0.067699,0.067982,0.073047,0.059305,0.050977,0.045045,0.035736,0.032311,0.037497,0.042956,0.042618,0.043486,0.046476,0.052399,0.053548,0.042085,0.034186,0.038164,0.04626,0.040525,0.035213,0.035621
0.048786,0.053493,0.058238,0.058106,0.051861,0.059638,0.062887,0.063458,0.062676,0.052496,0.051036,0.045453,0.031648,0.026144,0.027778,0.033112,0.039878,0.039969,0.036556,0.04103,0.044849,0.036417,0.027983,0.028106,0.035349,0.03776,0.036411,0.032048
0.047887,0.043877,0.045426,0.051562,0.04554,0.048891,0.056109,0.055696,0.047513,0.042377,0.04863,0.045963,0.033015,0.025908,0.023293,0.029018,0.037713,0.03399,0.026472,0.029617,0.034464,0.03112,0.023705,0.019968,0.025501,0.033471,0.035651,0.02877
0.053024,0.042354,0.035345,0.045072,0.043651,0.042509,0.048813,0.044854,0.036133,0.03568,0.042606,0.04269,0.032982,0.026086,0.022265,0.027789,0.035332,0.030543,0.025015,0.029415,0.032474,0.031363,0.026245,0.019945,0.022009,0.028185,0.029305,0.023792
0.055415,0.044198,0.036566,0.044808,0.041827,0.038641,0.044122,0.037124,0.031913,0.036738,0.038992,0.037306,0.03169,0.029167,0.027529,0.028415,0.033094,0.032806,0.031574,0.036429,0.035152,0.03166,0.029961,0.024756,0.023538,0.024733,0.023562,0.022184
0.050394,0.045856,0.045062,0.053244,0.04785,0.041421,0.046361,0.04008,0.03792,0.041339,0.036646,0.0339,0.034054,0.036221,0.039169,0.037304,0.036881,0.040714,0.041799,0.041888,0.038396,0.034737,0.034913,0.033092,0.032255,0.030467,0.026472,0.027978
0.04791,0.052622,0.05309,0.06114,0.060848,0.054612,0.059662,0.052979,0.051463,0.049674,0.039097,0.040037,0.045232,0.048796,0.053855,0.050625,0.044641,0.052302,0.055223,0.046061,0.043337,0.043824,0.045366,0.045561,0.045272,0.043033,0.037088,0.038686
0.049922,0.061039,0.057169,0.064168,0.069583,0.064562,0.067926,0.061662,0.061612,0.056895,0.043701,0.047391,0.054504,0.057491,0.063104,0.059895,0.052253,0.062999,0.06628,0.049725,0.048164,0.051874,0.053776,0.054396,0.053875,0.052116,0.044873,0.045434
0.045442,0.058198,0.052222,0.057506,0.065211,0.06164,0.061815,0.057027,0.05905,0.053819,0.040692,0.045377,0.052765,0.054374,0.058813,0.056631,0.050017,0.061835,0.065259,0.046464,0.046611,0.051485,0.052357,0.051852,0.050853,0.050264,0.043054,0.042235
0.036546,0.044936,0.039079,0.041127,0.048188,0.04692,0.045504,0.041111,0.043522,0.040652,0.030234,0.033148,0.040235,0.040592,0.041552,0.041301,0.038814,0.047982,0.051512,0.040644,0.041325,0.04522,0.044189,0.038506,0.03752,0.037847,0.031927,0.030605
0.035652,0.038007,0.030346,0.026339,0.030956,0.033879,0.036541,0.030986,0.028504,0.028871,0.022222,0.019609,0.028275,0.028854,0.024302,0.027276,0.03132,0.032986,0.038131,0.040746,0.035349,0.036906,0.034191,0.02538,0.025394,0.025466,0.021353,0.020558
0.044078,0.037208,0.023161,0.019469,0.023563,0.02661,0.031696,0.031256,0.027364,0.025777,0.020679,0.01532,0.022631,0.022496,0.018993,0.026847,0.029889,0.024597,0.033156,0.043941,0.036475,0.034445,0.026826,0.018629,0.017817,0.017502,0.016488,0.016173
0.048655,0.03385,0.017307,0.016271,0.021296,0.022593,0.027311,0.031111,0.028005,0.026667,0.022067,0.015976,0.02243,0.023382,0.022203,0.029099,0.027714,0.022651,0.034858,0.044756,0.038623,0.033621,0.020855,0.013653,0.01516,0.014017,0.013821,0.016495
0.043461,0.02856,0.015626,0.014299,0.019704,0.020455,0.023162,0.027128,0.0255,0.024931,0.020835,0.014682,0.02003,0.023099,0.024163,0.027012,0.021826,0.018236,0.031696,0.038342,0.034127,0.029065,0.017157,0.010749,0.012381,0.013628,0.01279,0.016035
0.030606,0.020108,0.013008,0.011475,0.01883,0.021193,0.018347,0.021296,0.024284,0.021077,0.017195,0.012929,0.015763,0.019482,0.021683,0.021038,0.017968,0.01502,0.024236,0.02944,0.02632,0.020735,0.012894,0.009888,0.009724,0.01344,0.014093,0.014534
0.018811,0.013305,0.010023,0.00892,0.018441,0.022693,0.015855,0.015906,0.021838,0.01674,0.013774,0.012128,0.013025,0.015712,0.015767,0.014491,0.018191,0.015969,0.016958,0.024017,0.022134,0.013887,0.00948,0.008722,0.008814,0.014511,0.014897,0.011421
