-0.001177,-0.001549,-0.001706,-0.001765,-0.001133,-0.000913,-0.001117,-0.000605,-0.000834,-0.002079,-0.002757,-0.002004,-0.001241,-0.000901,-0.000874,-0.000835,-0.000833,-0.000831,-0.000957,-0.00095,-0.001097,-0.000687,-0.000493,-0.000539,-0.000629,-0.000851,-0.000587,-0.000426
-0.00091,-0.001185,-0.001213,-0.001206,-0.000988,-0.000763,-0.000884,-0.000417,-0.000558,-0.001693,-0.002314,-0.001503,-0.000919,-0.000807,-0.000741,-0.000619,-0.000615,-0.000657,-0.000768,-0.000875,-0.000944,-0.000439,-0.000394,-0.000412,-0.000503,-0.000721,-0.000485,-0.000315
0.000229,0.000506,0.00069,0.000607,1e-04,0.000215,0.000385,8.7e-05,0.000171,0.000775,0.001113,0.000735,0.000286,-8.1e-05,-5.9e-05,0.000201,2e-04,0.000182,0.000193,0.00011,0.00022,0.000127,-3.4e-05,3e-06,0.000161,0.000244,0.000143,0.000114
0.001067,0.001422,0.001473,0.001575,0.001046,0.000857,0.001117,0.000566,0.00069,0.002122,0.002925,0.001986,0.001229,0.000874,0.000813,0.000736,0.000794,0.000793,0.000859,0.000926,0.000989,0.00052,0.000443,0.000527,0.00059,0.000787,0.000553,0.000394
0.000373,0.000303,0.000245,0.000319,0.000528,0.000273,0.000242,0.000162,0.000205,0.000453,0.000514,0.000307,0.000336,0.000508,0.000531,0.00017,2e-04,0.000244,0.000299,0.000462,4e-04,0.000218,0.000274,0.000238,0.000158,0.000231,0.000172,9.9e-05
-0.000677,-0.001033,-0.001139,-0.001238,-0.000502,-0.000536,-0.000883,-0.000392,-0.000426,-0.001691,-0.002426,-0.001656,-0.000898,-0.000311,-0.000317,-0.000507,-0.000571,-0.000507,-0.00047,-0.000434,-0.000543,-0.000338,-0.00019,-0.000292,-0.000422,-0.000542,-0.000359,-0.000286
-0.000582,-0.000738,-0.000874,-0.000889,-0.000671,-0.000497,-0.00065,-0.000241,-0.000335,-0.00129,-0.001707,-0.001009,-0.000699,-0.000475,-0.000564,-0.000287,-0.000377,-0.000422,-0.000477,-0.00065,-0.000602,-0.000359,-0.000294,-0.000266,-0.000308,-0.000473,-0.000345,-0.000224
0.000223,0.000496,0.000611,0.000596,-5.9e-05,0.000143,0.000428,0.000153,0.000157,0.000864,0.001313,0.000906,0.000335,-0.000185,-0.000182,0.000283,0.000237,0.000117,8e-05,-6.7e-05,0.00012,8.6e-05,-0.000125,-5.2e-05,0.000181,0.000247,0.000134,0.00013
0.000525,0.000803,0.001039,0.001108,0.000511,0.000476,8e-04,0.000257,0.000245,0.001522,0.002196,0.001329,0.000832,0.000245,0.000297,0.00023,0.000388,0.000412,0.000353,0.000414,0.000427,0.000336,0.00019,0.000216,0.000338,0.000505,0.000369,0.000242
-6e-05,-0.000141,-0.000123,-0.000111,0.000237,8.2e-05,1.7e-05,2e-06,9e-06,-3.9e-05,-0.000145,-0.000281,5e-06,0.000159,0.00028,-0.000205,-2.7e-05,6.6e-05,3.2e-05,0.000254,4.9e-05,6e-05,0.000201,0.000145,-4e-05,-4.2e-05,2e-05,8e-06
-0.000407,-0.000667,-0.000935,-0.001047,-0.000336,-0.000407,-0.000786,-0.000318,-0.000241,-0.001351,-0.00207,-0.001289,-0.000715,-8.3e-05,-4.8e-05,-0.000279,-0.000373,-0.000301,-0.00019,-0.000103,-0.000256,-0.000281,-9e-05,-0.000142,-0.000325,-0.000472,-0.000334,-0.000244
0.000108,-1e-06,-0.000151,-0.000138,-0.000158,-0.000144,-0.000327,-2.6e-05,8e-05,-0.000463,-0.000703,-9e-05,-0.000144,0.000181,2.1e-05,0.00027,2.5e-05,-3.8e-05,0.000103,-8.2e-05,5.2e-05,-5.3e-05,-1.3e-05,1.6e-05,-2.2e-05,-8.1e-05,-8e-05,-2.7e-05
0.000301,0.000439,0.000624,0.000739,0.000193,0.000281,0.00057,0.000249,0.000164,0.00085,0.001416,0.000965,0.000396,2.2e-05,-0.000123,0.000351,0.000262,0.000128,0.000109,-7.9e-05,0.000196,0.000159,-2.1e-05,1.1e-05,0.000244,0.000391,0.000215,0.000152
8e-06,0.000142,0.000309,0.000393,0.000241,0.000254,0.000562,0.000144,-7.5e-05,0.000778,0.001274,0.00048,0.000344,-0.000203,-0.000151,-0.000148,4.6e-05,4.4e-05,-0.000145,-9.7e-05,-6.2e-05,0.000119,-5.9e-05,-5.5e-05,0.000135,0.000234,0.000179,8.5e-05
-0.000316,-0.000343,-0.00037,-0.000473,-0.000133,-0.000162,-0.000262,-0.000145,-0.000149,-0.000361,-0.000652,-0.000688,-0.000136,-0.000181,7e-06,-0.000428,-0.000182,-4.7e-05,-0.000223,-3.8e-05,-0.000304,-7.5e-05,2.3e-05,0,-0.00015,-0.000254,-8.7e-05,-6.9e-05
-0.000202,-0.000216,-0.000374,-0.00058,-0.000368,-0.000336,-0.000656,-0.000255,-6.9e-05,-0.000917,-0.001518,-0.00081,-0.000472,-5.7e-05,8.2e-05,-0.00012,-0.000194,-9e-05,5.1e-05,0.000157,-9.6e-05,-0.000216,-1.2e-05,-4.6e-05,-0.000248,-0.000375,-0.00027,-0.000167
0.000318,0.000307,0.000245,0.000292,2.1e-05,9e-06,-6.9e-05,4.8e-05,0.000246,4.1e-05,8e-06,0.000489,-5.2e-05,0.000291,0.000211,0.000423,0.000155,5.7e-05,0.000393,0.000334,0.000445,7.4e-05,0.000114,0.000167,7.5e-05,6.3e-05,-2e-06,4.6e-05
0.000225,0.00015,0.000307,0.000524,0.000234,0.000273,0.00055,0.000178,5.8e-05,0.000774,0.00135,0.000901,0.000385,0.000204,-3.3e-05,0.000296,0.00022,6.6e-05,5.9e-05,-8.9e-05,0.00025,0.000192,4.2e-05,6.4e-05,0.000229,0.000365,0.000194,0.000135
-0.00014,-0.000215,-0.00014,-1.2e-05,0.00025,0.000213,0.000394,0.000111,-0.000168,0.000304,0.000597,-0.000128,0.00025,-5.1e-05,-0.000144,-0.000199,-1.9e-05,-2.1e-05,-0.000316,-0.000434,-0.000352,-7e-06,-0.000144,-0.000211,2.5e-05,0.000152,0.000119,3e-05
