2.3e-05,5e-06,1e-06,1.8e-05,5e-06,4e-06,5e-06,2.1e-05,8e-06,4e-06,9e-06,2.3e-05,1.2e-05,1.1e-05,2e-06,6e-06,1.8e-05,5.4e-05,0.000151,8.6e-05,8e-06,2.1e-05,2.3e-05,7.5e-05,5e-05,5e-06,8.2e-05,2.7e-05,3.8e-05,2e-04,2.8e-05,0.000828,0.000618,0.000624,0.00079,0.001172,0.001004,0.000169,0.000336,0.000253,0.000369,0.000112,0.000358,0.000214,0.000338,0.000732,0.000685,0.000324,0.000484,0.000136,7.7e-05,0.000438,0.000117,0.000236,0.000294,0.000101,0.000116,0.000506,1.1e-05,0.000339,5.6e-05,0.00035,0.000268,0.000127,7e-05,1.9e-05,9.6e-05,9e-06,7.3e-05,4.9e-05,8e-06,9.5e-05,2.7e-05,8.4e-05,1.9e-05,1.9e-05,9.4e-05,9.8e-05,4.7e-05,8.9e-05,1.3e-05,9.8e-05,5.6e-05,6e-06,0.000121,0.000109,7.6e-05,9e-06,0.000124,5.3e-05,0.00011,4e-05,4.5e-05,4.5e-05,3.7e-05,5.6e-05,0.000127,8e-06,7e-06,6e-06,2.8e-05,2e-06,3.3e-05,2.6e-05,4.5e-05,1.1e-05,4e-05,4.1e-05,1.7e-05,3e-05,2.8e-05,5.4e-05,8e-06,1e-05,3.1e-05,6e-06,1e-05,0,7e-06,0,1e-06
9.3e-05,5.9e-05,2.6e-05,1.9e-05,3.1e-05,3.2e-05,1.3e-05,4.9e-05,3.9e-05,3.6e-05,2.7e-05,5.2e-05,6.8e-05,5e-05,1.9e-05,4e-05,5.5e-05,9.7e-05,0.000398,0.000288,0.000348,5.8e-05,0.000171,0.000252,0.000198,0.000174,0.000165,0.000229,0.000385,0.000433,0.000165,0.002399,0.000151,0.002976,0.001162,0.002562,0.003137,0.001828,0.000474,0.00053,0.001359,0.000716,0.000654,0.000245,0.001276,0.001827,0.002185,0.001577,0.001377,0.000453,0.000803,0.000676,0.000878,0.000849,0.000834,0.000608,0.000487,0.001132,0.00047,0.000846,0.000152,0.000579,0.000691,0.000424,0.000338,0.000195,0.000227,9e-06,0.000126,0.000102,0.000151,0.000193,0.000167,0.000118,0.000123,0.000128,0.000264,0.000275,0.000125,0.000122,0.000105,5.9e-05,0.000325,0.000337,0.000149,0.000409,0.000379,0.000278,0.000356,0.000196,0.000174,0.000143,0.000294,3.6e-05,0.000107,0.000193,0.000309,1.2e-05,6e-05,3.2e-05,4.4e-05,7.2e-05,7.1e-05,2.1e-05,8.7e-05,0.000113,6.9e-05,0.000149,0.000138,0.000113,3.6e-05,0.000116,0.000106,6.1e-05,5e-05,3.9e-05,3.3e-05,3.3e-05,8e-06,2.7e-05,4e-05
4.6e-05,3.3e-05,1.9e-05,2.4e-05,2.9e-05,4e-06,2.6e-05,1.9e-05,5.4e-05,2.2e-05,1e-05,5e-05,9e-06,1.9e-05,3.7e-05,4.5e-05,4.6e-05,0.000134,0.000741,0.000674,0.000247,0.000652,0.000618,0.000571,0.000343,0.000124,6.4e-05,0.000354,0.000322,0.000409,4.7e-05,0.003994,0.003748,0.003019,0.002653,0.001541,0.001065,0.000703,0.000893,0.001359,0.001274,0.001138,0.001326,0.001444,0.00208,0.000699,0.000554,0.000286,0.000672,0.000132,0.000925,0.000573,0.000438,0.000852,0.00122,0.000497,0.001014,0.001688,0.000689,0.000421,0.000271,0.000277,0.000998,0.000816,0.000386,0.000341,0.000262,0.000237,0.000437,7.6e-05,0.000174,0.000259,0.000137,0.000213,0.000124,0.000143,0.000398,0.000208,0.000106,0.000149,0.000188,0.000374,0.000524,0.000291,9.9e-05,0.000462,0.000288,0.000828,0.00024,0.000126,3e-06,4.1e-05,0.000266,8.4e-05,9.1e-05,0.000153,0.00028,8.4e-05,4.4e-05,4e-05,3.2e-05,3.1e-05,2.2e-05,2.4e-05,5.7e-05,2.8e-05,2.9e-05,7.8e-05,8.6e-05,1.3e-05,4e-06,7.9e-05,7.8e-05,2.9e-05,8.3e-05,2.6e-05,3.6e-05,4.5e-05,5.3e-05,1.8e-05,4.6e-05
3.9e-05,3.6e-05,1.7e-05,3.4e-05,3.7e-05,3.3e-05,1.5e-05,4.1e-05,7.1e-05,4.8e-05,4e-05,5.4e-05,4.9e-05,3.9e-05,3.6e-05,1.2e-05,1.9e-05,9.1e-05,0.001304,0.001332,0.001539,0.001306,0.000221,0.000106,0.000156,8e-05,0.000283,0.000293,0.000495,0.000389,0.000131,0.005378,0.003903,0.002604,0.001454,0.001101,0.003712,0.002527,0.001154,0.001781,0.001895,0.000474,0.001493,0.002086,0.002761,0.003166,0.002119,0.001455,0.00171,0.000205,0.001473,0.000667,0.000188,0.001407,0.001705,0.001062,0.001753,0.000767,0.000191,0.000598,0.001204,0.000575,0.00156,0.000482,0.000308,0.000241,9.6e-05,0.000589,0.000199,0.00023,0.000292,5.8e-05,0.000107,1.1e-05,2.3e-05,0.000146,0.000331,0.000436,3.6e-05,0.000204,0.000216,0.000722,0.001047,0.000499,0.000137,0.000415,0.000417,0.000529,0.000306,0.00025,4.3e-05,7.6e-05,0.000198,0.000225,8.6e-05,0.000137,0.000832,0.000299,0.000132,1.5e-05,2.4e-05,5.4e-05,3.6e-05,4.6e-05,5.2e-05,3.1e-05,4.7e-05,8e-05,1.6e-05,2.2e-05,1.2e-05,4.9e-05,3.4e-05,2.5e-05,8.9e-05,6.7e-05,3.4e-05,4.5e-05,4.1e-05,3.9e-05,1.4e-05
1.6e-05,3.7e-05,3e-05,3.9e-05,4.4e-05,1.3e-05,1.2e-05,3.4e-05,3.1e-05,2.8e-05,2.2e-05,1.8e-05,2e-05,4.6e-05,1.8e-05,1.8e-05,2.4e-05,0.000181,0.001847,0.001838,0.00108,0.001265,0.001071,0.000666,0.000452,0.000366,0.000678,0.000168,0.000255,0.000676,0.000245,0.006155,0.003164,0.001169,0.003218,0.002703,0.001452,0.002681,0.003523,0.003049,0.002935,0.001993,0.002561,0.001214,0.001786,0.00067,0.002022,0.000986,0.001196,0.000931,0.001899,0.000994,0.000668,0.000972,0.000991,0.001359,0.002266,0.001102,0.00062,0.000572,0.001555,0.001359,0.001248,0.00105,0.000381,0.00025,0.00012,0.000496,0.000498,0.000253,0.000126,0.000314,2e-04,0.000131,5.1e-05,6.7e-05,0.000214,0.000446,0.000335,3e-05,0.000169,0.000475,0.000403,0.000376,0.000383,0.000199,0.000351,0.000597,0.000337,0.000182,0.00019,0.000144,0.000199,0.00013,7.2e-05,0.000121,0.000861,0.000299,0.000125,6e-05,2.2e-05,2e-05,3.6e-05,1.6e-05,3.9e-05,1e-05,1.9e-05,3.2e-05,8e-06,1.1e-05,2.4e-05,6.7e-05,4.9e-05,2.6e-05,5.4e-05,7.5e-05,2.9e-05,4.5e-05,1.8e-05,1.2e-05,1e-05
1.8e-05,2.8e-05,5e-06,6e-06,2.8e-05,2.7e-05,9e-06,2.1e-05,2.4e-05,3.8e-05,3.2e-05,1.9e-05,2.7e-05,2.7e-05,5.6e-05,1.6e-05,3.2e-05,0.000235,0.002335,0.000412,0.000704,0.001306,0.000162,0.000744,0.000241,0.000295,0.000938,0.000514,0.000182,0.000616,0.000235,0.005767,0.005562,0.002942,0.005545,0.008166,0.004467,0.003833,0.00534,0.003804,0.001199,0.003604,0.007388,0.002605,0.001121,0.00286,0.001724,0.000345,0.000738,0.000404,0.002625,0.001612,0.002214,0.000981,0.00189,0.001922,0.001323,0.002768,0.000847,0.000301,0.000403,0.000945,0.001628,0.000748,0.000797,0.000731,0.000454,0.000419,0.000355,0.000387,0.000224,0.000383,0.000696,0.000286,0.000273,0.000119,5.4e-05,0.000179,0.000117,5.4e-05,0.000119,0.000416,0.000255,0.000312,4e-04,0.000508,0.000144,0.000988,0.000468,9.6e-05,8.4e-05,0.000146,0.000208,0.000206,8.3e-05,5.2e-05,0.000272,0.000309,0.000116,6e-05,2.2e-05,3.2e-05,3e-05,2.2e-05,4.6e-05,4.7e-05,1.3e-05,3.7e-05,6e-06,7e-06,4.3e-05,9.7e-05,5.2e-05,3e-05,7.6e-05,4.2e-05,3.9e-05,2.3e-05,2.5e-05,4e-06,2.1e-05
9e-06,3.2e-05,1.9e-05,2.6e-05,3.6e-05,2.3e-05,3.3e-05,3.6e-05,5e-05,1.9e-05,2.1e-05,3.2e-05,1.1e-05,1.7e-05,4.1e-05,3.8e-05,2.9e-05,0.000219,0.00239,0.002102,0.001156,0.001071,0.00084,0.000825,0.000337,0.000185,0.001255,0.000409,0.000248,0.000583,0.000282,0.004225,0.001085,0.002858,0.004889,0.011981,0.006069,0.003677,0.003087,0.001969,0.001615,0.000822,0.005474,0.004485,0.003972,0.004725,0.005081,0.000939,0.001654,0.000561,0.003076,0.001083,0.002664,0.003388,0.003271,0.004365,0.001373,0.00305,0.002025,0.000677,0.001138,0.001183,0.001496,0.002036,0.000531,0.000846,0.001795,0.000158,0.000333,0.000474,8e-04,0.000365,0.000449,0.000247,0.000275,3e-04,0.000161,9.1e-05,0.00033,0.000201,3.7e-05,0.000285,0.000644,0.000648,0.000268,0.00072,0.000292,0.001374,0.000624,0.000345,2.9e-05,0.00012,0.000159,0.00032,0.000154,2.6e-05,0.001049,0.000571,0.000265,0.000117,1.6e-05,5.5e-05,4.9e-05,8e-06,4.2e-05,8e-05,5.3e-05,1.9e-05,8e-06,2.4e-05,3.7e-05,1.8e-05,4.8e-05,2.6e-05,9e-05,0.000111,3.6e-05,3.8e-05,1.3e-05,4.4e-05,2.2e-05
3e-05,4.1e-05,3e-05,5.1e-05,4.7e-05,5e-05,3.5e-05,2.3e-05,3e-05,2.4e-05,1.8e-05,3.1e-05,3.6e-05,1.5e-05,1.5e-05,2.4e-05,4.1e-05,0.000329,0.002449,0.002616,0.0017,0.000673,0.000707,0.000283,0.00039,0.000219,0.000977,0.000969,0.000491,0.000624,0.000859,0.001881,0.002682,0.003899,0.005253,0.0071,0.009352,0.008069,0.008,0.006631,0.005438,0.003207,0.005662,0.001,0.002655,0.002165,0.006815,0.00716,0.003184,0.001185,0.002542,0.002378,0.002114,0.001354,0.002356,0.005341,0.003354,0.002677,0.003111,0.002621,0.003153,0.003629,0.003233,0.003991,0.003122,0.001524,0.002737,0.002916,0.001932,0.00044,0.000814,0.001439,0.001388,0.000737,0.000177,9.7e-05,3.8e-05,8e-05,0.000541,0.000364,0.000212,0.000172,0.000934,0.000145,0.000266,0.00087,0.000801,0.001212,0.00091,0.000535,0.000384,0.000264,0.000112,0.000217,7.3e-05,0.000135,0.00166,0.00106,0.000444,0.000101,2.4e-05,6.2e-05,1.8e-05,5.7e-05,3.5e-05,1e-05,2e-06,3.9e-05,4.5e-05,3.3e-05,8.1e-05,0.000128,0.000109,0.00016,6e-05,0.000374,0.000141,5.5e-05,2.9e-05,5.1e-05,6.6e-05
1.9e-05,1.4e-05,1.2e-05,4.3e-05,2.2e-05,1.3e-05,1.1e-05,1.4e-05,2.5e-05,5e-06,5e-06,2.4e-05,2e-05,2.1e-05,2.1e-05,2.8e-05,6.4e-05,0.000376,0.0027,0.006941,0.005332,0.002482,0.001985,0.001036,0.000435,9.2e-05,0.000465,0.000679,0.000391,0.00054,0.001153,0.002077,0.003066,0.001349,0.003553,0.006779,0.003926,0.002461,0.007353,0.004066,0.003492,0.002962,0.002523,0.00308,0.002973,0.00283,0.005262,0.00267,0.000647,0.002095,0.00063,0.001089,0.002597,0.001539,0.001376,0.004159,0.003342,0.001678,0.001208,0.002001,0.000225,0.001997,0.000772,0.001501,0.000356,0.001167,0.001488,0.001007,0.000813,0.000841,0.000485,0.000621,0.000395,0.000161,0.000152,0.000258,0.000178,8.8e-05,0.000264,0.000285,1e-05,0.000229,0.001122,0.000792,0.000295,0.000997,0.001423,0.001072,0.001017,0.00052,0.000111,0.000112,0.000202,0.000297,0.000289,0.000239,0.00104,0.001195,5e-04,0.000158,3.9e-05,2.7e-05,7.5e-05,0.000118,8.7e-05,9.9e-05,4.5e-05,6.9e-05,1.8e-05,1.4e-05,7.5e-05,0.000112,4e-05,0.00018,0.000326,0.000634,0.00045,0.000214,2.7e-05,3e-05,3.2e-05
7e-06,2.2e-05,2.1e-05,3.2e-05,9e-06,5e-06,1.8e-05,1.4e-05,5e-06,9e-06,1.1e-05,1.2e-05,1.4e-05,1.2e-05,1.6e-05,3.1e-05,1.8e-05,0.00031,0.001845,0.009999,0.006295,0.002943,0.001974,0.001524,0.000724,0.000461,0.000349,0.000396,0.00015,0.00076,0.000872,0.002319,0.001569,0.005877,0.005385,0.002461,0.00283,0.003471,0.003813,0.000645,0.002635,0.000975,0.003057,0.002188,0.002302,0.001073,0.002234,0.000499,0.001487,0.001363,0.00131,0.000621,0.001908,0.001084,0.001465,0.002869,0.000665,0.000322,0.001802,0.001006,0.001629,0.000206,0.000708,0.000407,0.000627,0.000692,0.000315,0.000623,2.7e-05,0.000434,0.000129,0.000213,0.000254,0.000164,0.000169,0.000362,0.000344,0.000289,0.000123,0.000105,0.00016,4.3e-05,0.001142,0.000821,0.000381,0.000617,0.00043,0.000442,0.000506,0.000417,9e-05,6.9e-05,0.000165,0.000674,0.000574,0.00032,0.00044,0.000989,0.000643,0.000278,6.8e-05,5.9e-05,3.9e-05,0.000107,4.2e-05,7.3e-05,7.1e-05,8.7e-05,9.5e-05,6.9e-05,6.4e-05,6.7e-05,0.000101,0.000211,0.000206,0.000933,0.000578,0.000186,2.4e-05,6e-06,6e-06
2.8e-05,2.6e-05,2e-05,3.2e-05,1.3e-05,6e-06,8e-06,1.4e-05,1e-05,1.1e-05,6e-06,3e-06,1.9e-05,1.3e-05,1.3e-05,1.6e-05,1.1e-05,0.000342,0.001197,0.007895,0.004376,0.000956,0.001067,0.00064,0.00057,0.000282,0.000367,0.00044,0.000182,0.000625,0.000523,0.001726,0.001231,0.007458,0.002899,0.002748,0.001067,0.001886,0.001232,0.00021,0.001561,0.002321,0.001414,0.000919,0.000894,0.002391,0.002351,0.000208,0.001775,0.000683,0.002562,0.002118,0.001408,0.000965,0.00177,0.002968,0.002068,0.000442,0.001387,0.001573,0.000938,0.000231,0.000493,0.000324,0.000137,0.000826,0.000366,0.000403,0.000194,0.000337,0.000153,0.000106,0.000154,9.3e-05,0.00015,0.000176,0.000114,0.000268,0.00011,0.000117,0.000214,0.000301,0.000623,0.000303,5.6e-05,0.000278,0.000304,0.000676,0.000243,6.4e-05,0.000168,7.7e-05,0.000107,0.000725,0.000307,9.9e-05,0.001032,0.000819,0.000277,4.4e-05,3.6e-05,3.4e-05,7.6e-05,5.5e-05,3.5e-05,2.8e-05,1.9e-05,5.5e-05,3.7e-05,3.7e-05,2.9e-05,6.3e-05,6e-05,0.000197,0.000248,0.000735,0.000334,0.000131,7.6e-05,4.1e-05,1.3e-05
1.3e-05,1.4e-05,7e-06,1.4e-05,4e-06,4e-06,5e-06,1e-05,4e-06,8e-06,7e-06,6e-06,1.1e-05,6e-06,5e-06,7e-06,2.2e-05,0.000381,0.001754,0.003161,0.000763,0.000615,0.000438,0.000201,0.000257,0.00013,0.000391,0.000376,0.000265,0.000503,0.000304,0.001579,0.001269,0.003915,0.003582,0.000455,0.000767,0.002646,0.001812,0.000551,0.000449,0.001934,0.001538,0.002823,0.001797,0.00194,0.002353,0.001632,0.002835,0.001143,0.002203,0.001072,0.001951,0.000853,0.000952,0.00221,0.002005,0.000881,0.000921,0.001254,0.000981,0.000523,0.000388,0.000363,0.000157,0.00067,0.000311,0.000395,0.000114,0.00039,0.000126,0.000178,0.000179,0.00017,0.00021,0.000267,0.000263,0.000305,0.000179,0.000118,1e-04,0.00033,0.000205,3.4e-05,0.000175,0.000366,0.000136,0.000537,0.000167,3.3e-05,4.3e-05,2.6e-05,7.7e-05,0.000465,0.000197,0.000102,0.001033,0.000271,8.7e-05,1.2e-05,3.9e-05,2.1e-05,6.4e-05,3e-06,2.2e-05,2e-05,9e-06,2e-05,1.8e-05,1.9e-05,2.7e-05,1.4e-05,2.9e-05,9e-05,0.000157,0.000214,9e-05,4.5e-05,2.1e-05,1.5e-05,8e-06
7e-06,6e-06,3e-06,7e-06,3e-06,7e-06,5e-06,1.2e-05,2e-06,6e-06,7e-06,4e-06,6e-06,3e-06,4e-06,7e-06,2.1e-05,0.000361,0.001782,0.001113,0.000782,0.000188,0.000734,0.000378,0.000205,0.000107,0.000233,0.000135,3.1e-05,0.000363,6.3e-05,0.001836,0.00216,0.003651,0.002505,0.001899,0.00206,0.001875,0.002411,0.001142,0.001049,0.000366,0.00147,0.001328,0.001127,0.00097,0.003817,0.0022,0.003343,0.001557,0.000637,0.001532,0.00149,0.001769,0.001292,0.002655,0.0013,0.002509,0.001612,0.00083,0.00102,0.000574,0.00045,0.000351,0.000486,0.000829,0.000641,0.00034,0.000245,0.000382,0.000134,0.000239,1.8e-05,0.000225,0.000148,6.3e-05,2.5e-05,0.000363,0.000143,0.000191,6.7e-05,0.000389,0.000129,3.7e-05,0.000296,0.00044,0.00031,0.000237,0.000135,5e-06,1.9e-05,8e-06,4.8e-05,0.000129,0.000102,7.3e-05,0.000292,0.00017,5.6e-05,3.3e-05,2.1e-05,1.5e-05,5e-05,1.7e-05,2e-05,9e-06,8e-06,2.4e-05,2.1e-05,9e-06,3.1e-05,2.8e-05,2.6e-05,3.3e-05,0.00014,8.2e-05,1.9e-05,1.9e-05,7e-06,1.5e-05,1e-05
1.7e-05,8e-06,3e-06,1.3e-05,3e-06,5e-06,2e-06,8e-06,9e-06,1.1e-05,8e-06,7e-06,4e-06,8e-06,9e-06,7e-06,2.8e-05,0.000467,0.002102,0.00139,0.000651,0.000576,0.000337,0.000217,4.3e-05,1e-04,4.4e-05,0.000272,0.000221,0.000113,9e-06,0.001789,0.002202,0.005732,0.002333,0.001649,0.002096,0.001906,0.002879,0.001334,0.002125,0.002321,0.002795,0.003087,0.002434,0.003029,0.000471,0.001761,0.002729,0.004167,0.002519,0.002659,0.002339,0.002307,0.002224,0.003022,0.001551,0.002778,0.002185,0.002,0.001813,0.000742,0.001004,0.001091,0.000111,0.000935,0.001232,0.000593,0.000535,0.00037,0.000561,0.000226,0.000418,0.000149,0.000302,0.000148,0.000175,0.000525,0.000395,0.000112,7.1e-05,0.000401,0.00017,0.000133,0.000324,7.1e-05,0.000272,0.000245,6.9e-05,5.2e-05,3.6e-05,1.1e-05,4.5e-05,0.000138,3.1e-05,2.3e-05,0.000524,8.3e-05,4.5e-05,4.9e-05,4.4e-05,2.4e-05,2.5e-05,2.9e-05,1.8e-05,1.2e-05,1.4e-05,2.3e-05,4e-06,1.9e-05,1.5e-05,1.6e-05,2.7e-05,2.8e-05,0.000117,7e-05,8e-06,2.1e-05,5e-06,2.2e-05,9e-06
8e-06,5e-06,7e-06,1.4e-05,6e-06,1.1e-05,1.7e-05,7e-06,8e-06,4e-06,4e-06,4e-06,1.3e-05,1.6e-05,6e-06,5e-06,3e-05,0.00054,0.002294,0.001424,0.001402,0.001015,0.000452,0.000275,0.00019,0.000108,0.000354,9.9e-05,4.4e-05,9.4e-05,0.000182,0.00154,0.002022,0.003092,0.003546,0.003599,0.002379,0.003745,0.000784,0.002612,0.00232,0.003217,0.004578,0.002796,0.002959,0.005835,0.000941,0.00338,0.005274,0.00314,0.004958,0.002485,0.003745,0.000948,0.003123,0.002869,0.002379,0.004345,0.002017,0.000478,0.000454,0.001706,0.00161,0.002427,0.001899,0.001482,0.000684,0.001259,0.00097,0.001036,0.001678,0.001043,0.00033,5.1e-05,0.000369,0.000497,0.000488,0.000559,0.000996,0.000611,0.000233,0.000531,0.000364,0.000141,0.000264,0.000824,0.000257,0.000137,2.4e-05,2.3e-05,6.5e-05,4.1e-05,7.3e-05,0.000167,5.4e-05,2.7e-05,0.000773,0.000589,0.000271,9.5e-05,2.7e-05,4e-06,1.5e-05,1.1e-05,1e-05,1e-05,2.3e-05,1.7e-05,5e-06,2.4e-05,2.3e-05,2.2e-05,2.7e-05,2.4e-05,0.000103,6.7e-05,5.3e-05,5.2e-05,3.7e-05,2.3e-05,1.7e-05
1.1e-05,8e-06,6e-06,8e-06,8e-06,1.5e-05,1.1e-05,1e-05,8e-06,1e-05,5e-06,8e-06,1.4e-05,1.4e-05,1.4e-05,1e-05,2.1e-05,0.000595,0.001797,0.001999,0.000344,0.000706,0.000772,0.000255,0.000158,0.000277,0.000516,0.000595,0.000389,0.000276,0.000138,0.001929,0.005417,0.003342,0.005016,0.004558,0.009028,0.009326,0.007067,0.009066,0.002009,0.006368,0.003014,0.003069,0.001133,0.00604,0.007626,0.007388,0.003951,0.005442,0.005978,0.009055,0.006636,0.004959,0.005263,0.004598,0.006574,0.003354,0.004282,0.002119,0.003045,0.002052,0.002052,0.000446,0.001874,0.001325,0.002302,0.003097,0.002118,0.000791,0.001969,0.000854,0.000652,0.000689,0.000418,0.00103,0.00041,0.000845,0.002409,0.001016,0.000222,0.000634,0.000559,0.000322,0.000205,0.001146,0.001248,0.000589,0.000268,5.5e-05,9.3e-05,6e-05,8e-06,0.000103,0.000165,2.7e-05,0.000358,0.000203,0.000106,5.6e-05,8e-06,6e-06,2.3e-05,1.1e-05,1.1e-05,2e-05,5.7e-05,5.2e-05,1.7e-05,2.9e-05,7e-06,4.5e-05,5.4e-05,4.1e-05,0.000133,0.000127,5.7e-05,3.3e-05,2.3e-05,1.4e-05,8e-06
1.4e-05,4e-06,8e-06,1.7e-05,6e-06,1.2e-05,1.5e-05,4e-06,1e-05,6e-06,7e-06,7e-06,1.1e-05,1.1e-05,3e-06,1.5e-05,1.3e-05,0.000597,0.001977,0.000196,5.9e-05,0.000728,0.00032,5.3e-05,0.000163,0.000145,0.000752,0.000291,6.7e-05,0.000231,0.000179,0.002311,0.007403,0.001507,0.007187,0.004434,0.007761,0.006278,0.005109,0.009771,0.008978,0.010121,0.010379,0.005412,0.003486,0.004032,0.004957,0.008509,0.009895,0.011854,0.002683,0.005124,0.010168,0.012476,0.014069,0.01203,0.007622,0.008491,0.008375,0.009483,0.011328,0.00307,0.003274,0.001351,0.003442,0.001564,0.001662,0.003132,0.001769,0.001624,0.001267,0.002855,0.00127,0.000877,0.000669,0.000669,0.001501,0.000489,0.002601,0.002292,0.001223,0.000144,0.000374,0.000333,2e-04,0.000904,0.000647,0.000506,0.000217,0.000143,0.00011,3e-05,5.3e-05,0.000118,0.000195,0.00019,0.000171,0.000185,6.6e-05,2.1e-05,2.7e-05,1.9e-05,5e-05,4.8e-05,1.8e-05,3.7e-05,4.8e-05,4e-06,1.9e-05,3.6e-05,2.4e-05,6.9e-05,5.1e-05,2.9e-05,0.000137,5.6e-05,6.2e-05,7e-06,3e-05,2.4e-05,2.2e-05
1e-05,1e-05,1.6e-05,2.4e-05,2e-05,2.3e-05,1.8e-05,1.6e-05,2.3e-05,1.7e-05,1e-05,1e-05,1.4e-05,1.6e-05,9e-06,1.1e-05,2.7e-05,0.00052,0.000992,0.000666,0.000432,0.000859,0.000738,0.000175,3.4e-05,9.3e-05,0.000844,0.000484,6.6e-05,0.000292,0.000202,0.002363,0.005396,0.007148,0.002255,0.00586,0.005301,0.003112,0.006216,0.002412,0.004214,0.002489,0.003672,0.009173,0.011781,0.008931,0.000804,0.005259,0.008516,0.004327,0.005836,0.002531,0.005031,0.004347,0.003392,0.002526,0.005302,0.006735,0.004191,0.003341,0.005177,0.008713,0.009971,0.005853,0.004962,0.002798,0.001267,0.003145,0.002776,0.000674,0.001024,0.002574,0.00205,0.001636,0.000658,0.000383,0.001027,0.001361,0.001851,0.000729,0.000313,0.000362,1.3e-05,8.9e-05,0.000236,0.000451,0.000369,9.8e-05,3.5e-05,8.7e-05,0.000118,0.000143,0.000108,0.000144,0.000177,6.9e-05,0.00044,0.000129,4.1e-05,4.9e-05,3.7e-05,1.2e-05,4.5e-05,6.3e-05,4.3e-05,5.3e-05,0.000106,7.5e-05,5.2e-05,5.1e-05,3.2e-05,6.5e-05,4.9e-05,2.6e-05,0.000123,0.000333,8e-05,1.8e-05,3.5e-05,1.2e-05,1.3e-05
1.1e-05,9e-06,9e-06,1.4e-05,1.5e-05,1.1e-05,5e-06,1.1e-05,1e-05,1.8e-05,4e-06,9e-06,2e-06,4e-06,1.8e-05,1e-05,3.3e-05,0.000405,0.000694,0.001412,0.000359,0.000641,0.000652,0.000275,0.000112,0.000106,0.000877,0.000709,0.000478,0.000245,0.000115,0.001982,0.001726,0.002649,0.003521,0.001193,0.001977,0.004605,0.002394,0.004215,0.00287,0.002778,0.002195,0.00756,0.003824,0.002516,0.003656,0.002802,0.003639,0.005041,0.00536,0.001716,0.001384,0.004031,0.003065,0.001251,0.002443,9.8e-05,0.002339,0.004462,0.005772,0.005811,0.002116,0.001657,0.00094,0.000343,0.000459,0.002236,0.000439,0.000449,0.001242,0.000564,0.000775,6.9e-05,9.8e-05,0.000358,0.000446,0.00085,0.000338,0.000321,7.9e-05,0.000443,0.000437,0.000204,0.000273,1e-04,5.9e-05,9e-05,5.3e-05,4.8e-05,3e-06,8.6e-05,0.000123,0.000187,6e-05,7.1e-05,0.000343,0.000263,0.000132,7e-06,9e-06,6e-06,2.4e-05,2.1e-05,8e-06,5.6e-05,7.4e-05,5.5e-05,3.8e-05,4.3e-05,4.4e-05,4e-05,4e-05,6.2e-05,0.000123,0.000405,0.000284,0.000115,1.7e-05,1e-05,1.2e-05
8e-06,4e-06,1.6e-05,9e-06,8e-06,1e-06,1e-06,1.5e-05,1.8e-05,4e-06,1.1e-05,7e-06,1e-05,1.3e-05,2.2e-05,6e-06,3.8e-05,0.000303,0.00118,0.000362,0.000941,0.000545,0.000542,0.000418,0.000308,0.000252,0.00064,0.000425,0.00026,0.000282,9.8e-05,0.001557,7e-04,0.002105,0.002207,0.001117,0.00082,0.001885,0.001358,0.000857,0.003976,0.003654,0.003559,0.001683,0.002422,0.001955,0.00326,0.003585,0.001634,0.001093,0.002182,0.002912,0.002014,0.001995,0.000826,0.001797,0.003538,0.003638,0.00265,0.001086,0.001077,0.003375,0.003421,0.001736,0.00038,0.000312,0.000511,0.001312,0.001077,0.000295,0.000913,0.000903,0.000127,0.000142,0.000176,7e-05,0.000167,0.00032,0.000454,0.000147,5.7e-05,0.00038,0.000392,0.000163,0.000266,0.000277,0.000166,0.000103,3.8e-05,4.1e-05,7.6e-05,4.7e-05,7.7e-05,6e-05,6.6e-05,5.4e-05,0.000256,9.1e-05,7.1e-05,5.3e-05,3.8e-05,2.8e-05,3.5e-05,3.6e-05,2.9e-05,4.6e-05,1.7e-05,3.9e-05,2.4e-05,4.9e-05,1.9e-05,1.4e-05,7.5e-05,7.9e-05,0.00012,0.000273,0.000214,0.000109,1e-05,2.1e-05,5e-06
2.1e-05,1.1e-05,1.3e-05,1e-05,1.5e-05,2e-06,4e-06,1.3e-05,7e-06,6e-06,1.2e-05,2.2e-05,1e-05,1.5e-05,7e-06,2e-05,3.4e-05,0.000105,0.000988,0.000774,0.001003,0.000489,0.000455,0.000195,0.000179,4.8e-05,0.000575,0.000539,0.000117,0.000137,0.000125,0.001068,0.001365,0.003088,0.004468,0.002249,0.002268,0.001125,0.001654,0.001836,0.003147,0.001801,0.002674,0.001411,0.000712,0.001686,0.002717,0.001027,0.001607,0.000809,0.001667,0.001004,0.000823,0.000629,0.001065,0.001428,0.001253,0.002061,0.002195,0.00109,0.000994,0.001376,0.001846,9e-04,0.000966,0.00034,0.000423,0.001006,0.000853,0.000885,0.00031,0.000553,2e-04,9.8e-05,4.6e-05,7.5e-05,0.000369,0.000426,0.00044,3.7e-05,7.4e-05,0.000394,0.000173,1e-04,0.000134,0.000366,0.000325,0.000179,3.3e-05,1.6e-05,6.5e-05,2.5e-05,2.8e-05,9.4e-05,0.000111,7.9e-05,0.000369,0.000152,2.5e-05,1.1e-05,1.6e-05,2.7e-05,2.1e-05,1.5e-05,1.8e-05,4.2e-05,3.5e-05,2.6e-05,1.6e-05,2e-05,6e-06,1.8e-05,7.9e-05,4e-06,8.3e-05,5.7e-05,9.5e-05,4.2e-05,2.2e-05,1.8e-05,1.2e-05
1.2e-05,1.7e-05,9e-06,8e-06,1.4e-05,1.4e-05,9e-06,9e-06,3e-06,5e-06,9e-06,2.7e-05,2.4e-05,2e-05,1.9e-05,2.3e-05,1.7e-05,0.000178,0.000795,0.000271,0.000774,0.000251,0.000335,0.000113,0.000107,0.000144,0.000241,0.000252,0.000258,5.9e-05,5.2e-05,0.000685,0.001046,0.0031,0.000533,0.001412,0.001362,0.002031,0.001779,0.001189,0.001958,0.000564,9.1e-05,0.000583,0.000966,0.001038,0.001626,0.00121,0.000952,0.00086,0.000145,0.002006,0.001263,0.000685,0.000558,0.000863,0.001183,0.000659,0.001773,0.000942,0.000996,0.000228,0.001231,0.000293,0.000345,0.000383,0.000513,0.000454,0.000102,0.000398,0.000402,6.9e-05,0.00034,6e-05,2.8e-05,0.000114,0.000264,0.000281,0.000443,0.000267,4.4e-05,0.00046,0.000469,0.00021,7.5e-05,0.000348,0.000222,0.000222,6.1e-05,2.7e-05,5.9e-05,1.4e-05,7.1e-05,0.000132,1.4e-05,2e-05,0.000261,2e-04,5.5e-05,1.9e-05,1.6e-05,2e-05,1.8e-05,6e-06,2.1e-05,1.4e-05,1.7e-05,2.8e-05,1.6e-05,7e-06,2.1e-05,3.1e-05,4.6e-05,6.4e-05,9.5e-05,0.000179,0.000127,6.7e-05,3.5e-05,2.3e-05,1.7e-05
3e-06,4e-06,3e-06,5e-06,2e-06,3e-06,2e-06,2e-06,2e-06,2e-06,5e-06,5e-06,6e-06,6e-06,4e-06,6e-06,1.2e-05,0.000134,0.000454,0.000421,0.000244,0.000178,0.000236,0.000136,9e-05,9.2e-05,6e-05,0.000153,0.000101,6.3e-05,2.6e-05,0.000178,0.000431,0.000739,0.000485,0.00067,0.000439,0.000522,0.000178,0.000531,0.000619,0.000602,0.000523,0.000277,0.000394,0.00042,0.000641,0.000562,0.000253,0.000351,0.000672,0.000928,5.6e-05,0.000335,6.9e-05,0.000433,0.00053,0.000294,0.000487,0.000286,0.000242,0.000157,0.000221,0.00025,0.000163,0.000112,0.000197,9.6e-05,5.6e-05,9e-05,0.000169,0.000141,5.8e-05,1.2e-05,1.5e-05,8.3e-05,0.000148,7e-05,8.3e-05,2.5e-05,5.9e-05,0.000135,0.000127,7.3e-05,6.6e-05,0.000109,7.3e-05,4.5e-05,8e-06,1.3e-05,3e-06,5e-06,3.6e-05,3.4e-05,1.7e-05,4e-06,6.6e-05,1.5e-05,1.4e-05,1.5e-05,8e-06,4e-06,5e-06,5e-06,1.1e-05,7e-06,3e-06,4e-06,3e-06,1.4e-05,1.8e-05,2e-06,2.9e-05,2.7e-05,6.6e-05,8.9e-05,3.3e-05,1.9e-05,6e-06,4e-06,6e-06
2e-06,3e-06,2e-06,5e-06,3e-06,4e-06,2e-06,3e-06,5e-06,2e-06,4e-06,3e-06,2e-06,5e-06,5e-06,4e-06,8e-06,0.000178,0.000154,0.000414,0.000219,0.000155,0.000218,4e-05,4e-05,4.8e-05,9.7e-05,7.3e-05,4.6e-05,1.9e-05,1.8e-05,0.000109,0.000449,0.000665,0.000369,0.000745,0.001117,0.000381,0.000346,2.5e-05,0.000775,0.000447,0.000874,0.000107,0.000179,0.000332,0.000423,0.000642,0.000201,0.000278,0.00061,0.000349,0.000279,7e-05,0.000129,0.00023,0.000274,0.000572,0.000115,0.000388,0.000308,0.000216,0.000166,0.000144,8.7e-05,9.2e-05,0.000206,9.5e-05,1.2e-05,0.000106,0.000169,0.000116,9.3e-05,2.4e-05,1.1e-05,4.9e-05,9.4e-05,7.7e-05,7e-05,4.6e-05,4.2e-05,0.000114,4.6e-05,3.5e-05,7.6e-05,1.7e-05,6.7e-05,6.8e-05,7e-06,1.3e-05,3e-05,7e-06,4.1e-05,8.3e-05,5.3e-05,1.5e-05,6e-05,5.4e-05,2.3e-05,1.8e-05,7e-06,8e-06,5e-06,6e-06,9e-06,3e-06,1e-06,7e-06,2e-06,9e-06,8e-06,4e-06,2.1e-05,1.3e-05,5.9e-05,2.9e-05,2.1e-05,1.1e-05,4e-06,1e-05,7e-06
4e-06,2e-06,2e-06,2e-06,3e-06,2e-06,2e-06,1e-06,3e-06,1e-06,2e-06,1e-06,3e-06,3e-06,3e-06,3e-06,9e-06,0.000223,0.000247,0.000451,0.000135,7e-05,2.1e-05,0.000105,7.3e-05,1.1e-05,9.5e-05,6.1e-05,9e-06,4.1e-05,2.6e-05,0.000155,0.000575,0.000599,0.000127,0.000787,0.000569,0.00063,0.000417,0.000649,6.1e-05,0.000317,0.000395,0.000331,0.000365,0.000207,0.000419,0.000577,0.000429,0.00017,0.000411,0.00022,6e-05,0.000182,0.000148,0.000213,0.000388,0.000367,0.000248,0.000227,0.000157,0.000133,0.000206,7e-05,4.3e-05,7.2e-05,0.000152,3.5e-05,6.5e-05,3.9e-05,0.000128,7.6e-05,4.2e-05,1.9e-05,2.8e-05,4.7e-05,3.3e-05,6.6e-05,0.000108,3e-05,2e-05,0.000113,5.2e-05,3.3e-05,6.5e-05,1.6e-05,8e-06,5.3e-05,1.5e-05,8e-06,2.8e-05,2.2e-05,4.4e-05,0.000116,3.7e-05,1.8e-05,4.9e-05,1.1e-05,3e-06,1.4e-05,9e-06,1.3e-05,9e-06,1e-06,6e-06,4e-06,7e-06,3e-06,5e-06,5e-06,9e-06,4e-06,1.8e-05,2.3e-05,5.6e-05,1.6e-05,8e-06,1.2e-05,5e-06,1.6e-05,4e-06
5e-06,3e-06,3e-06,1e-06,1e-06,3e-06,2e-06,2e-06,0,2e-06,3e-06,4e-06,5e-06,4e-06,2e-06,2e-06,5e-06,0.000219,0.000118,9.5e-05,0.000162,0.000129,0.000134,4.7e-05,3.3e-05,9e-06,5.9e-05,3.3e-05,2.5e-05,2.8e-05,1.9e-05,0.000147,0.00044,0.00027,0.000357,0.000683,0.000371,0.000317,0.000424,0.00068,4.3e-05,0.000356,0.000397,5.5e-05,0.000161,0.000319,0.000251,0.000105,0.000201,0.000349,8e-05,0.000152,4e-04,0.000233,0.000171,0.000354,0.000211,0.000394,0.000181,0.000101,2.7e-05,9.6e-05,6.8e-05,9e-06,8.4e-05,9.3e-05,0.00013,5.3e-05,3.1e-05,2.5e-05,0.000103,6e-05,4.3e-05,2.3e-05,3.4e-05,1.9e-05,3.6e-05,5.9e-05,8e-05,4.2e-05,4e-05,0.000103,3.8e-05,7e-06,6.9e-05,7.1e-05,3.1e-05,5.3e-05,1.1e-05,2.2e-05,1.1e-05,1.7e-05,3e-05,7.9e-05,5.5e-05,3e-06,2.9e-05,5e-06,1e-05,1.1e-05,7e-06,6e-06,2e-06,2e-06,6e-06,2e-06,1.4e-05,1.2e-05,2e-06,8e-06,3e-06,6e-06,2e-05,1e-05,4.3e-05,2.3e-05,1.2e-05,1.6e-05,8e-06,1e-05,6e-06
2e-06,2e-06,1e-06,3e-06,3e-06,3e-06,2e-06,4e-06,3e-06,1e-06,2e-06,4e-06,0,2e-06,1e-06,2e-06,6e-06,0.000178,0.000372,0.000423,0.00015,0.000118,4e-05,2e-05,2.4e-05,1e-05,0.000127,0.000127,7.8e-05,3.4e-05,2.6e-05,1e-04,0.000646,0.000304,0.000262,0.000385,2e-04,0.000462,0.000584,0.000186,0.000408,0.00022,9.4e-05,0.00033,0.000153,0.000402,0.000319,0.000237,0.000197,0.000443,0.000399,8.2e-05,0.000317,0.000126,0.00036,0.000269,0.000139,0.000369,0.000368,0.000143,0.000108,0.000137,0.000198,5.4e-05,0.000157,8.4e-05,0.000172,6.8e-05,3e-05,6e-05,1e-04,0.000101,9e-05,2.7e-05,3.3e-05,4.2e-05,3.1e-05,8.6e-05,5.2e-05,2.2e-05,1.8e-05,8.9e-05,7e-05,2.9e-05,6.1e-05,9.3e-05,5.9e-05,3.8e-05,7e-06,1.4e-05,1.4e-05,1e-05,3.3e-05,7.1e-05,3.1e-05,9e-06,1.9e-05,1.9e-05,2.7e-05,1.4e-05,6e-06,2e-06,3e-06,2e-06,2e-06,5e-06,1.8e-05,7e-06,9e-06,6e-06,1.2e-05,9e-06,1.6e-05,1.6e-05,4.7e-05,1.8e-05,7e-06,1.6e-05,1.1e-05,1e-05,8e-06
2e-06,2e-06,2e-06,3e-06,2e-06,0,3e-06,2e-06,1e-06,2e-06,3e-06,4e-06,1e-06,2e-06,2e-06,1e-06,7e-06,0.000149,0.000458,5.6e-05,3.2e-05,0.000139,7.4e-05,7e-05,3.3e-05,2.4e-05,0.00023,7.2e-05,4.1e-05,3.2e-05,1.4e-05,6.3e-05,0.000686,0.000624,0.000366,0.00024,0.000444,0.000323,0.000166,0.000189,0.000317,6.7e-05,9.2e-05,0.000178,0.000134,0.000142,0.000818,0.000472,4.3e-05,0.000229,0.000336,0.000558,0.000253,0.000201,0.000367,0.000181,0.000549,0.00013,0.000127,0.000194,0.000129,6.9e-05,0.00023,1e-04,0.000102,3.4e-05,0.000145,8.4e-05,4e-05,8e-06,0.000105,8.9e-05,6.5e-05,2e-05,1.2e-05,1.6e-05,4.2e-05,5.1e-05,7.7e-05,4.2e-05,9e-06,5.9e-05,3.5e-05,1.8e-05,6.3e-05,5.2e-05,1e-05,2e-05,1.5e-05,1.3e-05,7e-06,5e-06,3.8e-05,8.4e-05,3.1e-05,1.4e-05,7e-06,8e-06,1.7e-05,1.5e-05,9e-06,0,3e-06,3e-06,2e-06,7e-06,1.1e-05,1e-06,9e-06,2e-06,1e-05,2e-06,1.6e-05,1.5e-05,5.6e-05,1.5e-05,1.5e-05,6e-06,5e-06,6e-06,4e-06
2e-06,3e-06,1e-06,1e-06,1e-06,0,3e-06,3e-06,1e-06,3e-06,2e-06,1e-06,2e-06,2e-06,1e-06,1e-06,5e-06,0.00012,0.000357,0.000318,0.000194,0.000245,0.000145,3.5e-05,2.5e-05,4.1e-05,0.000294,0.000193,4.1e-05,1.6e-05,1.7e-05,0.000141,0.000334,0.000657,0.000194,0.000271,0.000116,0.00025,0.000214,0.000193,0.000148,0.000238,0.000107,0.000247,0.000268,0.000169,0.000544,0.000413,0.000258,0.000246,0.000354,0.000236,0.000213,0.000233,0.000186,0.000302,0.000322,0.000218,0.000175,0.000162,0.00021,0.000243,0.000231,9.9e-05,0.000104,0.000141,6.7e-05,3.1e-05,3.7e-05,6.6e-05,0.000133,5e-05,3e-05,4.4e-05,1.7e-05,2.6e-05,7.7e-05,9.9e-05,4e-05,2.9e-05,2.5e-05,7.3e-05,7e-06,9e-06,4.4e-05,1.3e-05,4e-05,5.9e-05,1.1e-05,9e-06,4e-06,2e-06,3.9e-05,7.3e-05,5e-05,2.9e-05,1.9e-05,1.3e-05,7e-06,5e-06,1.1e-05,8e-06,0,2e-06,6e-06,8e-06,7e-06,1e-05,1.2e-05,5e-06,9e-06,6e-06,1.1e-05,1.5e-05,4.7e-05,3.1e-05,1.5e-05,4e-06,4e-06,3e-06,5e-06
3e-06,2e-06,2e-06,2e-06,1e-06,0,2e-06,1e-06,1e-06,2e-06,2e-06,2e-06,2e-06,1e-06,2e-06,1e-06,5e-06,0.000113,0.000459,0.000339,0.00019,0.000213,0.000123,3e-06,1.2e-05,2.7e-05,0.000336,0.000194,9.4e-05,4.2e-05,2.1e-05,0.000189,0.000233,0.000605,0.000377,0.00022,0.000166,0.000109,0.000197,0.000204,0.000198,0.000174,0.000144,0.000235,0.000271,0.000204,0.000274,0.00032,0.000244,0.000118,0.000344,0.000414,0.000354,0.000162,0.000202,0.000203,0.000156,0.000228,0.000155,5.2e-05,0.000145,0.000278,0.00028,0.000181,0.000139,0.000305,0.000304,7.8e-05,2.3e-05,0.000123,0.00019,0.000125,5e-05,7.1e-05,6.8e-05,1e-05,7e-06,0.000124,9.4e-05,1.9e-05,2.9e-05,5.4e-05,1.9e-05,2e-05,3.9e-05,2.8e-05,2.6e-05,2.9e-05,9e-06,1e-06,1e-06,2e-06,2.8e-05,6.3e-05,3.3e-05,2.4e-05,2.5e-05,4e-06,7e-06,6e-06,6e-06,4e-06,4e-06,4e-06,6e-06,1e-05,8e-06,1.2e-05,2e-06,7e-06,4e-06,4e-06,1.1e-05,1.3e-05,5.4e-05,4.8e-05,2.3e-05,3e-06,4e-06,6e-06,6e-06
1e-06,2e-06,2e-06,3e-06,1e-06,1e-06,1e-06,1e-06,1e-06,2e-06,2e-06,1e-06,1e-06,1e-06,2e-06,1e-06,7e-06,0.000151,0.00047,0.00015,7.2e-05,7.7e-05,1.8e-05,3.2e-05,2.2e-05,2.5e-05,0.000309,0.000118,8.2e-05,2.1e-05,3e-05,0.000183,0.000357,0.000419,0.000169,0.000326,0.000311,0.00011,0.000125,8.8e-05,0.000152,0.000245,0.000318,0.000184,0.000174,0.000127,0.000191,0.000206,0.000174,0.000164,0.00031,0.000362,0.000197,0.000112,0.000181,0.000178,0.000228,0.000275,0.000148,0.000158,0.000217,0.000351,9.3e-05,3.3e-05,0.000171,6.9e-05,0.000138,7.3e-05,8.9e-05,6.9e-05,2.3e-05,4.7e-05,6.8e-05,7.7e-05,7.7e-05,5.7e-05,8.9e-05,5.5e-05,4.9e-05,2e-05,1.7e-05,8.3e-05,1.3e-05,2.6e-05,5.7e-05,9e-06,8e-06,3.9e-05,3e-06,1e-06,4e-06,6e-06,1.6e-05,6.2e-05,3.2e-05,2.7e-05,2.9e-05,1.2e-05,4e-06,6e-06,7e-06,8e-06,5e-06,4e-06,6e-06,5e-06,4e-06,2e-06,7e-06,4e-06,5e-06,1e-06,1.2e-05,9e-06,3.8e-05,5.1e-05,3.2e-05,1.4e-05,9e-06,5e-06,3e-06
2e-06,1e-06,3e-06,1e-06,1e-06,1e-06,1e-06,1e-06,1e-06,2e-06,1e-06,2e-06,2e-06,2e-06,1e-06,1e-06,8e-06,0.000179,0.000246,5.3e-05,0.000106,6.9e-05,4.5e-05,7e-06,3.4e-05,3.9e-05,0.000242,0.000107,7.9e-05,4.3e-05,1.9e-05,0.000207,0.000344,0.000397,0.000394,0.00038,0.00025,0.000377,0.000112,5.1e-05,0.000174,0.000259,0.00011,0.000176,0.000174,7.2e-05,0.000148,0.000244,0.000128,0.000172,0.000223,0.000182,0.000293,0.000109,0.000137,0.000104,0.000323,8.1e-05,0.000198,0.000123,0.000173,0.000312,8.2e-05,2.6e-05,0.000173,9.2e-05,0.000144,6.5e-05,3.7e-05,0.000131,0.000175,8e-06,4.8e-05,4.4e-05,3.1e-05,7.8e-05,9.3e-05,9.1e-05,3.6e-05,1.4e-05,2.5e-05,4e-05,5.9e-05,1.6e-05,2.7e-05,1.3e-05,1.4e-05,1.3e-05,8e-06,8e-06,8e-06,1.2e-05,2.3e-05,5.8e-05,2.5e-05,1.7e-05,5.3e-05,3.8e-05,1.5e-05,4e-06,7e-06,6e-06,1.3e-05,1e-05,7e-06,1.2e-05,3e-06,3e-06,8e-06,8e-06,2e-06,4e-06,1.5e-05,2.5e-05,2.5e-05,4.3e-05,1.8e-05,1e-05,4e-06,1.1e-05,9e-06
2e-06,2e-06,1e-06,0,1e-06,2e-06,1e-06,2e-06,2e-06,2e-06,2e-06,1e-06,2e-06,1e-06,1e-06,1e-06,8e-06,2e-04,0.000482,0.000144,4.4e-05,0.000151,0.000106,5.1e-05,3.3e-05,5.8e-05,0.000262,0.000148,3.8e-05,3e-05,1.3e-05,0.000155,0.000298,0.000148,0.000242,0.000359,0.000131,0.000263,0.000341,0.000216,0.000272,9.7e-05,0.000156,2e-05,0.000326,0.000391,0.000235,0.000371,0.000211,0.000107,0.000352,0.000282,0.000294,0.000128,9.5e-05,0.000102,0.000179,0.000192,0.000201,0.000193,9.8e-05,0.000241,0.000104,4.9e-05,0.000174,0.000172,0.000133,2.1e-05,2.9e-05,0.000135,0.000131,0.000129,4.9e-05,6.3e-05,1.4e-05,8.1e-05,5.4e-05,3.3e-05,2.9e-05,1.9e-05,3.1e-05,4.8e-05,2.4e-05,3e-06,3.1e-05,2.9e-05,1.1e-05,3.2e-05,2.4e-05,1.4e-05,9e-06,9e-06,2.3e-05,7e-05,3.5e-05,1.2e-05,7.8e-05,5.1e-05,1.7e-05,6e-06,9e-06,0,6e-06,7e-06,3e-06,1e-05,6e-06,5e-06,5e-06,9e-06,1.1e-05,7e-06,1.8e-05,2.1e-05,4.6e-05,1.9e-05,2.1e-05,9e-06,1e-06,1.3e-05,1e-06
2e-06,1e-06,1e-06,3e-06,1e-06,2e-06,2e-06,1e-06,1e-06,2e-06,1e-06,1e-06,2e-06,1e-06,0,1e-06,1e-05,0.000204,0.000367,0.000292,0.000146,0.000267,0.000141,1.3e-05,1.3e-05,3e-05,0.000175,0.000132,7.5e-05,4e-05,1e-05,8.1e-05,0.000258,0.000277,8.9e-05,0.000341,0.000358,0.000255,0.000471,0.000328,0.000119,0.000187,0.000404,0.00022,0.000231,0.000168,0.000272,0.000207,0.000154,0.000116,0.000368,0.000113,0.000238,9e-05,0.000116,0.000152,0.000163,0.000388,0.000265,6.3e-05,8.1e-05,0.000183,0.000145,9.8e-05,5.5e-05,0.000137,3.9e-05,6e-05,5.1e-05,0.000101,0.000118,4.2e-05,2e-05,1e-05,2.4e-05,4.5e-05,1.5e-05,2.8e-05,6.8e-05,4.9e-05,3.9e-05,4.3e-05,4.4e-05,2e-05,5e-05,1.3e-05,1e-06,4.1e-05,1.5e-05,8e-06,7e-06,5e-06,2.4e-05,8.7e-05,6.1e-05,2.9e-05,8.4e-05,4.4e-05,1.7e-05,1.2e-05,4e-06,5e-06,1e-06,4e-06,3e-06,1.3e-05,1.6e-05,7e-06,6e-06,6e-06,5e-06,2e-06,1.1e-05,8e-06,3.9e-05,2.1e-05,1.7e-05,7e-06,5e-06,8e-06,4e-06
4e-06,3e-06,2e-06,4e-06,3e-06,3e-06,3e-06,2e-06,3e-06,4e-06,2e-06,3e-06,2e-06,3e-06,2e-06,2e-06,8e-06,0.000196,0.000248,0.00036,0.000168,0.000289,0.00014,4.8e-05,2.7e-05,1.5e-05,0.000143,0.000239,0.000105,3.3e-05,1.7e-05,2.8e-05,0.000378,0.000155,0.000166,3.5e-05,0.000224,0.000357,0.000585,0.000384,0.000308,0.000427,0.000162,0.000154,6.7e-05,9.7e-05,6.9e-05,0.000264,0.000167,7e-05,0.000224,8.9e-05,0.000163,0.00015,0.000177,1.7e-05,0.000187,0.000291,0.000213,0.000158,0.000115,0.000272,6.8e-05,0.000144,0.000114,0.000247,0.00022,1.2e-05,9.2e-05,6.1e-05,1.2e-05,0.000107,3.6e-05,4.9e-05,4.9e-05,5.1e-05,1.7e-05,4.7e-05,7.4e-05,5.9e-05,6.8e-05,6e-05,1e-04,4e-05,5.6e-05,3.4e-05,4.9e-05,2.5e-05,1.1e-05,1.2e-05,1.7e-05,1.4e-05,2.4e-05,8.2e-05,3.2e-05,1.8e-05,6.9e-05,3.1e-05,1.6e-05,1.6e-05,1.2e-05,9e-06,1e-06,1e-06,4e-06,8e-06,9e-06,1.1e-05,8e-06,8e-06,6e-06,3e-06,8e-06,1.8e-05,3.5e-05,4.5e-05,2.4e-05,1.1e-05,7e-06,1.3e-05,6e-06
4e-06,1e-06,1e-06,4e-06,1e-06,1e-06,1e-06,2e-06,1e-06,1e-06,1e-06,1e-06,0,3e-06,1e-06,1e-06,8e-06,0.000171,0.000461,0.000147,0.00029,0.000342,0.000147,7.1e-05,3.9e-05,3.3e-05,0.000145,0.000251,0.000148,7.7e-05,4.9e-05,0.000112,0.000469,0.000534,0.000302,0.000405,0.000144,0.000414,0.000546,0.000382,0.000195,0.000367,0.000401,0.000117,0.00011,0.000248,0.000176,0.000193,0.000108,0.000151,9.7e-05,0.00027,0.000122,7.9e-05,0.000176,2.6e-05,0.000257,9.5e-05,0.000346,0.000302,0.00012,0.000461,0.000331,9.2e-05,0.00023,0.000109,0.000225,0.000318,0.000339,9.9e-05,9.2e-05,0.00013,9.9e-05,3.2e-05,6.3e-05,0.000126,8.4e-05,6.2e-05,0.000116,9.8e-05,2.8e-05,5.5e-05,7.9e-05,3.3e-05,5e-05,5.5e-05,0.000138,8e-05,3e-05,7e-06,1.7e-05,1.4e-05,2.7e-05,4.9e-05,3.1e-05,2.3e-05,2.9e-05,1.9e-05,8e-06,1.1e-05,4e-06,4e-06,2e-06,5e-06,4e-06,4e-06,4e-06,8e-06,4e-06,2e-06,3e-06,7e-06,7e-06,6e-06,3.7e-05,4.9e-05,2.3e-05,1.5e-05,1.3e-05,5e-06,1.2e-05
4e-06,3e-06,1e-06,3e-06,1e-06,1e-06,1e-06,2e-06,1e-06,1e-06,1e-06,1e-06,0,0,1e-06,1e-06,8e-06,0.000131,0.000464,0.000133,0.000181,0.000291,0.000168,1.6e-05,1.4e-05,1.6e-05,0.000122,0.000145,8.7e-05,3.4e-05,3.1e-05,0.000178,0.000322,0.000606,0.000167,0.000602,0.000442,0.000147,0.00034,0.000141,0.00031,0.000416,0.000165,0.000188,8.3e-05,0.000229,0.000188,0.000479,0.000115,0.000137,0.000228,0.000432,0.000218,0.00031,0.000218,9.3e-05,0.000301,0.000361,9.6e-05,0.000321,0.000229,0.000483,0.000476,0.000386,3.7e-05,0.000262,0.000229,0.000289,8e-05,0.00012,0.000168,0.000121,0.000113,4.7e-05,5.9e-05,6.4e-05,4.5e-05,7.8e-05,5.9e-05,8.8e-05,4.4e-05,3.8e-05,7.3e-05,5.6e-05,5.1e-05,4.9e-05,0.000121,0.000119,6.6e-05,3.3e-05,2.8e-05,1.1e-05,2.5e-05,2.6e-05,1.8e-05,1.3e-05,2.6e-05,2.3e-05,7e-06,3e-06,3e-06,6e-06,6e-06,7e-06,3e-06,8e-06,2e-06,3e-06,7e-06,8e-06,1e-06,7e-06,1.3e-05,7e-06,3.4e-05,4.2e-05,2.2e-05,1.2e-05,1.4e-05,1.2e-05,8e-06
2e-06,1e-06,1e-06,2e-06,1e-06,0,1e-06,1e-06,0,0,1e-06,2e-06,2e-06,2e-06,2e-06,1e-06,4e-06,9.5e-05,0.000267,0.000365,0.000447,0.000156,4.9e-05,7.8e-05,4.5e-05,4.9e-05,0.000104,0.000125,4.8e-05,2.8e-05,5.6e-05,0.000219,0.000149,0.000152,0.000504,0.000387,0.00061,0.000407,0.000342,0.000305,0.000264,0.000586,0.000354,4.6e-05,0.000181,0.000172,0.000386,3e-05,0.000156,1.6e-05,0.000264,0.000274,0.000199,0.000143,0.00031,9.9e-05,7.6e-05,0.00037,0.00049,0.000255,0.00016,0.000274,0.000121,0.000101,0.000166,0.000179,7.4e-05,0.000199,0.000297,0.000198,0.000133,0.000113,9.7e-05,3.4e-05,4.4e-05,6.2e-05,1e-04,7.2e-05,2.7e-05,9.2e-05,5.1e-05,1.9e-05,9.7e-05,4.3e-05,4.2e-05,5.7e-05,6.3e-05,5.9e-05,6e-06,1e-05,1.3e-05,7e-06,5e-06,5.7e-05,3e-05,2.3e-05,3.1e-05,2.2e-05,1.8e-05,7e-06,3e-06,4e-06,4e-06,1.2e-05,1.5e-05,8e-06,7e-06,6e-06,6e-06,2e-06,6e-06,5e-06,1.1e-05,2.9e-05,4.4e-05,2.7e-05,2.2e-05,8e-06,8e-06,4e-06,4e-06
2e-06,1e-06,2e-06,3e-06,1e-06,0,0,1e-06,0,1e-06,1e-06,2e-06,1e-06,1e-06,2e-06,1e-06,5e-06,6.2e-05,7.5e-05,0.000208,0.000135,8.7e-05,6.6e-05,5.4e-05,1.4e-05,2.1e-05,7.1e-05,6.9e-05,5.9e-05,1.1e-05,2.1e-05,0.000165,0.000149,0.00022,0.000231,0.000108,0.000357,0.000286,0.000218,0.000132,0.000446,0.000392,0.00014,0.000216,0.000164,0.000225,0.000148,9.8e-05,0.000131,2.5e-05,0.000207,0.000279,0.000205,0.000196,0.000197,7.7e-05,0.00021,0.000458,0.00026,0.000141,0.00012,0.000147,0.000161,0.00011,0.000127,3.9e-05,6.4e-05,0.000107,9.9e-05,0.00012,5.6e-05,9.8e-05,6.5e-05,5.6e-05,8e-06,3e-05,4.1e-05,4.5e-05,2.1e-05,6.4e-05,2.8e-05,2.7e-05,8.7e-05,4e-05,3.4e-05,4.5e-05,6.5e-05,3.9e-05,1.5e-05,1.8e-05,3e-06,9e-06,1.5e-05,4.4e-05,2.3e-05,1.9e-05,1.7e-05,2.1e-05,8e-06,1e-06,2e-06,3e-06,6e-06,7e-06,7e-06,3e-06,4e-06,3e-06,4e-06,3e-06,3e-06,4e-06,1.1e-05,1.6e-05,2.3e-05,1.8e-05,1.2e-05,5e-06,3e-06,2e-06,4e-06
2e-06,2e-06,1e-06,2e-06,1e-06,0,0,1e-06,0,1e-06,0,1e-06,1e-06,2e-06,1e-06,1e-06,5e-06,4.6e-05,0.000204,0.00022,0.000135,1.3e-05,3.6e-05,2.2e-05,1e-05,1e-06,3.6e-05,2.6e-05,1.2e-05,1.4e-05,2.1e-05,0.000131,0.000115,0.000249,0.000167,0.000219,0.000231,0.000186,0.000144,0.000136,0.000207,9.1e-05,0.000187,1e-04,0.000155,0.000103,8.9e-05,0.000144,0.000161,6.2e-05,8.3e-05,0.00021,0.000206,6.4e-05,0.000135,0.00015,0.00022,0.000236,0.000307,0.000143,4.2e-05,0.000153,0.000187,5.3e-05,6.8e-05,8e-05,7.5e-05,9e-06,5.5e-05,7.5e-05,5.5e-05,1.8e-05,2.1e-05,1e-05,1.6e-05,2.8e-05,1.1e-05,1.8e-05,2.4e-05,9e-06,4e-06,4.3e-05,3.3e-05,1.3e-05,2e-05,1.4e-05,3.2e-05,3.1e-05,1.1e-05,4e-06,4e-06,7e-06,8e-06,2.7e-05,1.1e-05,1.2e-05,1.1e-05,8e-06,4e-06,4e-06,3e-06,2e-06,3e-06,2e-06,4e-06,1e-06,2e-06,2e-06,2e-06,1e-06,3e-06,3e-06,9e-06,3e-06,3.1e-05,8e-06,2e-06,3e-06,0,3e-06,3e-06
1e-06,2e-06,1e-06,2e-06,0,0,0,1e-06,0,1e-06,0,1e-06,2e-06,1e-06,1e-06,1e-06,6e-06,5.6e-05,0.000176,0.000179,0.000135,1.9e-05,3.3e-05,1.5e-05,8e-06,3e-06,2.1e-05,1.3e-05,9e-06,2e-06,1e-05,1e-04,0.000169,0.00025,8.3e-05,0.000218,0.000144,0.000134,0.000132,6.9e-05,7.5e-05,0.00011,5.2e-05,0.000138,0.000221,0.000225,0.000141,0.000243,0.000135,2.5e-05,9.2e-05,9.3e-05,0.000132,0.000124,0.000125,0.000161,0.000237,0.000203,0.000245,5.7e-05,7.8e-05,0.000138,8.6e-05,2.3e-05,6.7e-05,7.6e-05,7.9e-05,1.3e-05,4.2e-05,6e-05,4.7e-05,8e-06,1.2e-05,1.5e-05,1e-06,3e-05,1.1e-05,1.3e-05,1.9e-05,5e-06,3e-06,4e-05,2.5e-05,2e-06,1.5e-05,1.7e-05,1.9e-05,3.2e-05,6e-06,8e-06,4e-06,4e-06,8e-06,6e-06,3e-06,1.2e-05,1e-05,1.3e-05,3e-06,6e-06,2e-06,0,1e-06,1e-06,3e-06,2e-06,2e-06,2e-06,2e-06,1e-06,2e-06,1e-06,5e-06,5e-06,3.2e-05,6e-06,1e-06,1e-06,1e-06,0,2e-06
2e-06,2e-06,1e-06,2e-06,1e-06,0,0,1e-06,0,1e-06,0,1e-06,1e-06,1e-06,1e-06,1e-06,6e-06,7.2e-05,0.000187,0.000199,0.000124,1.2e-05,4e-05,1.2e-05,8e-06,4e-06,1.9e-05,1.5e-05,8e-06,3e-06,1e-05,7.9e-05,6.5e-05,0.000314,0.000106,0.00028,0.00018,0.000209,0.000161,4.2e-05,9.7e-05,2.5e-05,0.000141,0.000157,0.000183,0.000236,0.000201,0.000207,0.000111,9.7e-05,1e-04,0.000163,9.2e-05,7.8e-05,0.00013,9.3e-05,0.000169,0.000134,0.000182,2.8e-05,4.7e-05,0.000125,4.4e-05,1e-05,5.2e-05,7.5e-05,7.4e-05,7e-06,2.9e-05,5.5e-05,5.2e-05,8e-06,1.1e-05,1.2e-05,5e-06,3.1e-05,1e-05,6e-06,2.2e-05,8e-06,8e-06,2.9e-05,2.7e-05,3e-06,1.8e-05,1.8e-05,2e-05,3.1e-05,7e-06,7e-06,2e-06,4e-06,7e-06,1.1e-05,2e-06,1.3e-05,3e-06,4e-06,2e-06,4e-06,1e-06,3e-06,2e-06,1e-06,3e-06,2e-06,1e-06,3e-06,2e-06,1e-06,2e-06,1e-06,5e-06,6e-06,3.2e-05,3e-06,4e-06,2e-06,2e-06,1e-06,1e-06
