0.022763,0.026258,0.027458,0.028784,0.032063,0.03382,0.036508,0.036864,0.032109,0.030981,0.033855,0.034796,0.039769,0.045443,0.041831,0.040019,0.04333,0.042606,0.039482,0.044401,0.051537,0.04721,0.046346,0.05231,0.047782,0.041742,0.041761,0.043695
0.029975,0.034503,0.035548,0.037039,0.041626,0.043461,0.046751,0.047773,0.041179,0.039738,0.04455,0.045335,0.050286,0.058385,0.054921,0.052269,0.055908,0.054342,0.050345,0.057131,0.066877,0.061295,0.059806,0.067934,0.062786,0.054587,0.053244,0.055606
0.042638,0.048708,0.049553,0.051624,0.058765,0.060987,0.064832,0.066929,0.057346,0.055503,0.063943,0.065111,0.069335,0.080153,0.077203,0.073304,0.077065,0.074284,0.069506,0.079589,0.093225,0.085802,0.083425,0.094821,0.088929,0.077114,0.072629,0.074924
0.052544,0.059175,0.060662,0.064335,0.073603,0.076575,0.080204,0.083258,0.072174,0.070354,0.081671,0.084239,0.086713,0.096541,0.093953,0.089319,0.093029,0.091006,0.088335,0.099738,0.112102,0.103919,0.10173,0.113273,0.107601,0.093778,0.086127,0.086838
0.058415,0.065119,0.068794,0.077553,0.089571,0.093689,0.098074,0.103357,0.093325,0.090069,0.098955,0.104362,0.108969,0.115724,0.110997,0.105069,0.109674,0.109873,0.112282,0.123956,0.126991,0.118086,0.117017,0.123633,0.120801,0.108332,0.098338,0.093708
0.071612,0.079696,0.08979,0.111211,0.128067,0.132241,0.141976,0.151642,0.140764,0.133859,0.136119,0.146995,0.164487,0.177034,0.163331,0.147284,0.15822,0.16312,0.166963,0.176121,0.166573,0.157985,0.162044,0.166948,0.16842,0.15195,0.133257,0.119011
0.104724,0.115913,0.135105,0.171113,0.194815,0.202264,0.219541,0.231339,0.216285,0.206801,0.20486,0.221883,0.25608,0.280667,0.253522,0.221397,0.244375,0.257263,0.260143,0.268547,0.247411,0.235042,0.245284,0.254983,0.261941,0.235526,0.200862,0.177635
0.147917,0.160169,0.189347,0.239254,0.268587,0.280293,0.301128,0.308447,0.290732,0.282858,0.277134,0.299947,0.352145,0.390432,0.353663,0.305556,0.336656,0.35698,0.357505,0.367312,0.343668,0.327836,0.340773,0.352714,0.361626,0.327173,0.279908,0.25443
0.186544,0.193705,0.232041,0.291899,0.317578,0.326423,0.346299,0.346517,0.330503,0.329096,0.32674,0.352121,0.410011,0.456286,0.428635,0.37459,0.39928,0.422156,0.419238,0.432139,0.42047,0.407992,0.414279,0.414513,0.418123,0.386983,0.347705,0.335817
0.217528,0.215991,0.256057,0.323213,0.340055,0.329635,0.350138,0.360623,0.345905,0.347066,0.374727,0.405152,0.438758,0.469803,0.463844,0.423418,0.441157,0.46872,0.467313,0.475001,0.476567,0.483374,0.467276,0.42924,0.418367,0.40636,0.407774,0.430333
0.244145,0.23602,0.276729,0.352162,0.36497,0.33607,0.370034,0.41149,0.386049,0.37825,0.458046,0.504291,0.500219,0.4917,0.488192,0.475253,0.502909,0.536736,0.547007,0.542241,0.54462,0.582463,0.54332,0.457612,0.436673,0.448738,0.485032,0.53569
0.278461,0.274227,0.306335,0.368422,0.382392,0.366578,0.422329,0.484244,0.438934,0.420791,0.546263,0.602172,0.56476,0.534077,0.522284,0.534957,0.581833,0.616461,0.643782,0.640933,0.631306,0.664485,0.609832,0.50741,0.501751,0.537261,0.551585,0.584421
0.291567,0.301441,0.320975,0.350643,0.368229,0.382683,0.436024,0.500883,0.460075,0.445073,0.585459,0.622401,0.558445,0.545077,0.544485,0.569373,0.618116,0.642645,0.676942,0.68581,0.683793,0.695774,0.630427,0.529665,0.528975,0.576913,0.553697,0.539182
0.267749,0.283242,0.296736,0.315331,0.337245,0.361937,0.392341,0.463294,0.447535,0.421417,0.529117,0.540223,0.466309,0.473993,0.50491,0.533729,0.560899,0.574201,0.606843,0.626976,0.655202,0.652837,0.577806,0.501703,0.499824,0.537497,0.508255,0.459705
0.237135,0.243868,0.253218,0.279532,0.298027,0.327824,0.350114,0.405235,0.413448,0.383559,0.428245,0.422812,0.363112,0.363266,0.407141,0.439668,0.442149,0.465058,0.496243,0.49245,0.527713,0.522158,0.449167,0.422953,0.438558,0.458664,0.443381,0.389305
0.237751,0.249306,0.265411,0.304711,0.325659,0.376953,0.406758,0.431647,0.457523,0.440497,0.430837,0.421766,0.379207,0.347259,0.389191,0.416097,0.377044,0.429426,0.473727,0.413747,0.426268,0.423057,0.360198,0.378339,0.421355,0.422936,0.405571,0.367053
0.298142,0.322671,0.363478,0.422987,0.455994,0.532107,0.557574,0.575261,0.63775,0.62437,0.566073,0.561954,0.535753,0.482559,0.530359,0.553765,0.488844,0.583559,0.633325,0.523212,0.527719,0.51886,0.462679,0.496011,0.534989,0.524338,0.500917,0.459614
0.387653,0.434753,0.493567,0.562976,0.598739,0.67674,0.706225,0.746319,0.830615,0.795877,0.693783,0.722155,0.733681,0.658682,0.710473,0.734652,0.655302,0.781777,0.825943,0.681376,0.686758,0.662488,0.626798,0.677321,0.686914,0.657751,0.650603,0.618255
0.434858,0.503863,0.591155,0.663804,0.674264,0.71434,0.749773,0.820224,0.905867,0.843512,0.730252,0.819894,0.884339,0.788939,0.845366,0.870773,0.76944,0.89091,0.904602,0.746592,0.759163,0.729379,0.745796,0.798895,0.741143,0.697515,0.746562,0.754364
0.431588,0.504582,0.657651,0.781789,0.743211,0.694128,0.709904,0.780174,0.852709,0.767232,0.682522,0.841846,0.979707,0.877751,0.909237,0.936322,0.807886,0.87415,0.858102,0.717876,0.744307,0.743875,0.809287,0.805537,0.659309,0.660067,0.793467,0.826761
0.437236,0.470374,0.650711,0.86935,0.842626,0.725309,0.686286,0.708578,0.770827,0.689616,0.656932,0.827368,0.990823,0.901876,0.898493,0.927019,0.785065,0.785994,0.768917,0.675145,0.694036,0.73549,0.822277,0.730896,0.556855,0.646123,0.799656,0.81157
0.446936,0.426839,0.57124,0.844946,0.888676,0.753015,0.648445,0.641417,0.709002,0.631029,0.602706,0.719655,0.862553,0.803287,0.776951,0.794235,0.660421,0.653962,0.671729,0.597116,0.586801,0.664968,0.742955,0.623328,0.491065,0.58927,0.69528,0.674177
0.407024,0.380744,0.474638,0.688174,0.762579,0.663063,0.527528,0.497918,0.555534,0.496867,0.475619,0.561486,0.653771,0.596855,0.564475,0.563779,0.453366,0.470563,0.522529,0.46358,0.442503,0.520605,0.551881,0.440817,0.360524,0.422699,0.474088,0.458626
0.301985,0.286238,0.336107,0.436028,0.486401,0.466776,0.367197,0.306702,0.32735,0.298007,0.295649,0.359684,0.400362,0.35883,0.351143,0.341401,0.250856,0.267011,0.330845,0.307875,0.294447,0.340275,0.332141,0.255447,0.213333,0.245627,0.268541,0.267576
0.182669,0.174086,0.189894,0.211409,0.227249,0.252495,0.217743,0.174657,0.167051,0.149436,0.163664,0.210811,0.213761,0.181612,0.196768,0.197996,0.151576,0.155018,0.193515,0.203333,0.195445,0.200242,0.175474,0.132959,0.128144,0.150476,0.161929,0.159544
0.122263,0.120035,0.102681,0.099775,0.129172,0.162849,0.156111,0.141692,0.114802,0.086204,0.104266,0.155585,0.151628,0.121736,0.137448,0.138492,0.123165,0.130637,0.147665,0.168201,0.163622,0.132986,0.094955,0.082418,0.111759,0.128652,0.119994,0.113561
0.10563,0.112462,0.080703,0.072325,0.117349,0.145477,0.141053,0.138338,0.107933,0.073992,0.083328,0.135763,0.143687,0.106475,0.1024,0.109141,0.120494,0.130189,0.130517,0.156751,0.167031,0.117159,0.070258,0.079131,0.111394,0.108532,0.085333,0.085277
0.083333,0.090312,0.064687,0.05828,0.097869,0.119856,0.126764,0.132385,0.105179,0.073426,0.069975,0.105262,0.123222,0.101534,0.095266,0.103279,0.121519,0.12641,0.115164,0.132907,0.14612,0.101679,0.059653,0.072405,0.095792,0.085407,0.068428,0.07153
0.054217,0.05969,0.053599,0.053473,0.070557,0.083964,0.102832,0.109949,0.088292,0.069314,0.062536,0.081937,0.099302,0.097212,0.096116,0.096367,0.112557,0.113024,0.093975,0.094794,0.098504,0.077242,0.055876,0.06249,0.077188,0.077144,0.070824,0.066339
0.04532,0.044344,0.047974,0.052545,0.050773,0.056297,0.075945,0.082234,0.068891,0.065415,0.066328,0.076178,0.081695,0.081859,0.083065,0.076001,0.08615,0.090971,0.079235,0.071703,0.061954,0.053267,0.054742,0.059978,0.063767,0.070923,0.071726,0.060055
0.058533,0.052286,0.056797,0.061933,0.053994,0.056986,0.070963,0.080821,0.074002,0.062345,0.065442,0.073869,0.070991,0.063466,0.063944,0.058379,0.063807,0.074469,0.075259,0.068589,0.050081,0.041771,0.054496,0.064527,0.066762,0.071837,0.072632,0.061066
0.070602,0.061204,0.065246,0.070934,0.062689,0.066872,0.077655,0.089803,0.086849,0.060799,0.055767,0.070952,0.072377,0.059078,0.056696,0.05636,0.065523,0.076151,0.07821,0.0718,0.047957,0.037757,0.055682,0.073195,0.074678,0.069953,0.067607,0.060852
0.075693,0.061466,0.061429,0.06656,0.060449,0.067316,0.077093,0.089435,0.089578,0.060129,0.047729,0.061726,0.068353,0.053571,0.04861,0.051765,0.065852,0.07404,0.071085,0.065185,0.048351,0.039782,0.052798,0.072238,0.071405,0.061073,0.058695,0.059465
0.075784,0.056075,0.051441,0.05135,0.045706,0.054194,0.065323,0.076066,0.075928,0.054998,0.045618,0.050489,0.052588,0.043395,0.040401,0.045567,0.056737,0.056819,0.05022,0.051808,0.050814,0.043442,0.046919,0.05859,0.054229,0.045984,0.052327,0.058407
0.067388,0.052969,0.046842,0.039089,0.034361,0.039591,0.048322,0.054973,0.05758,0.049738,0.046799,0.045603,0.038484,0.037709,0.039775,0.044492,0.045178,0.034781,0.028068,0.03952,0.052287,0.043935,0.039518,0.040379,0.035053,0.031601,0.041954,0.051564
0.049582,0.048615,0.045501,0.035106,0.033187,0.031919,0.031113,0.032535,0.039395,0.047042,0.050527,0.049359,0.037808,0.033675,0.038594,0.042591,0.039689,0.028974,0.022275,0.033303,0.046378,0.036759,0.030107,0.028919,0.025381,0.028061,0.036724,0.045137
0.029614,0.037959,0.043871,0.034034,0.028975,0.025736,0.023696,0.024644,0.02909,0.044032,0.051765,0.049046,0.036715,0.026205,0.038668,0.042111,0.034233,0.029607,0.02794,0.034501,0.036425,0.028879,0.02513,0.024388,0.023954,0.028147,0.03737,0.041597
0.020798,0.028102,0.037033,0.030893,0.023376,0.024791,0.025333,0.025222,0.024448,0.038016,0.045966,0.040457,0.031916,0.020004,0.03925,0.047743,0.030323,0.025466,0.032422,0.035649,0.030934,0.028497,0.023838,0.022419,0.0231,0.025233,0.034133,0.033884
0.017064,0.018477,0.026726,0.030513,0.027439,0.027187,0.025167,0.022291,0.017486,0.028656,0.041093,0.033418,0.025695,0.018115,0.039324,0.053345,0.027319,0.018025,0.031672,0.038351,0.034265,0.032795,0.02664,0.020493,0.018937,0.018368,0.026707,0.026262
0.012341,0.01172,0.017897,0.030932,0.033948,0.026498,0.020301,0.016175,0.012804,0.025106,0.039472,0.028448,0.019736,0.019006,0.039038,0.053817,0.027686,0.014577,0.026173,0.036834,0.034669,0.033854,0.027682,0.016186,0.012509,0.011603,0.0196,0.026627
