0.136017,0.131291,0.122859,0.12782,0.119467,0.112732,0.10968,0.107491,0.10477,0.097037,0.100061,0.093178,0.083368,0.081364,0.085133,0.094605,0.100901,0.091644,0.076805,0.064463,0.055599,0.053304,0.04826,0.036877,0.027396,0.023915,0.025431,0.031718
0.184745,0.176865,0.165149,0.16927,0.157304,0.154272,0.151614,0.146617,0.142057,0.131314,0.136631,0.128689,0.11599,0.111469,0.114562,0.129084,0.140024,0.127236,0.105817,0.087651,0.074812,0.071247,0.064915,0.049614,0.035728,0.031218,0.034272,0.043683
0.273368,0.259328,0.242689,0.245036,0.226046,0.229955,0.227995,0.217966,0.209654,0.193488,0.203062,0.193482,0.176125,0.166677,0.167847,0.191685,0.211802,0.193309,0.159571,0.130385,0.111223,0.104732,0.095076,0.072745,0.050851,0.044591,0.050672,0.065732
0.343494,0.321716,0.30405,0.304371,0.278757,0.289242,0.288704,0.274181,0.26117,0.240654,0.252189,0.244246,0.227578,0.213568,0.210183,0.240848,0.268553,0.246329,0.203378,0.166857,0.144721,0.132618,0.117983,0.091238,0.063461,0.055849,0.064796,0.084517
0.353262,0.32477,0.313913,0.311398,0.280734,0.291052,0.292229,0.277793,0.264504,0.246703,0.253749,0.250942,0.241796,0.22518,0.215067,0.243933,0.272886,0.251091,0.208291,0.175064,0.157193,0.13891,0.118293,0.093055,0.066741,0.059137,0.069625,0.090614
0.302758,0.27784,0.272339,0.262109,0.230601,0.230287,0.232804,0.228464,0.220811,0.208505,0.206172,0.207264,0.206255,0.191726,0.176942,0.196057,0.22247,0.205355,0.169323,0.148535,0.140249,0.12025,0.095604,0.076385,0.058743,0.052986,0.063601,0.08211
0.238717,0.227399,0.216466,0.204091,0.183723,0.167197,0.167364,0.177784,0.172459,0.158885,0.151449,0.149328,0.145805,0.13656,0.124698,0.130593,0.151723,0.144835,0.120074,0.111485,0.108244,0.091839,0.069124,0.053895,0.044538,0.041797,0.050689,0.06392
0.236125,0.213713,0.197474,0.207555,0.206378,0.172931,0.153096,0.159533,0.153728,0.137508,0.126757,0.122129,0.11464,0.108021,0.104942,0.101291,0.108697,0.109063,0.098738,0.095761,0.093669,0.082671,0.061795,0.043622,0.035175,0.032411,0.035342,0.042071
0.357568,0.298841,0.282852,0.341575,0.348635,0.278932,0.216012,0.206522,0.208543,0.184558,0.158799,0.155541,0.153146,0.140859,0.139244,0.132291,0.123249,0.123124,0.123922,0.130834,0.134284,0.116623,0.087184,0.061544,0.046051,0.036486,0.032034,0.0359
0.640938,0.526762,0.501323,0.639063,0.650853,0.495729,0.36085,0.341004,0.357912,0.315371,0.26715,0.265378,0.266375,0.242392,0.233146,0.219488,0.196834,0.200313,0.204605,0.221202,0.236045,0.199324,0.145259,0.104232,0.077572,0.058312,0.047042,0.050332
1.095171,0.891086,0.840118,1.113157,1.129526,0.821753,0.586229,0.560625,0.593027,0.518515,0.443098,0.453133,0.46018,0.422636,0.399522,0.364534,0.33267,0.356128,0.355708,0.378515,0.412761,0.338221,0.23543,0.171201,0.13121,0.097436,0.07446,0.075108
1.647244,1.324632,1.229031,1.68893,1.707726,1.195617,0.858737,0.830903,0.877897,0.772706,0.676005,0.712339,0.72926,0.684665,0.643137,0.565137,0.531551,0.597325,0.582121,0.611407,0.678652,0.541849,0.362524,0.266109,0.210008,0.157078,0.115417,0.110162
2.056641,1.645051,1.500583,2.124418,2.136543,1.452344,1.080917,1.060836,1.115577,1.006439,0.908735,0.983561,1.021976,0.982877,0.920456,0.782183,0.759403,0.882414,0.838963,0.875218,0.993263,0.793563,0.526559,0.384218,0.302367,0.226941,0.163855,0.1531
2.019777,1.642253,1.493907,2.123147,2.099745,1.397414,1.115382,1.122293,1.157085,1.072796,1.00703,1.12023,1.190987,1.184913,1.117883,0.927123,0.935154,1.102686,1.017696,1.055597,1.223617,1.0068,0.686282,0.495111,0.378327,0.281067,0.202595,0.189717
1.589644,1.383006,1.276036,1.695907,1.615131,1.097488,0.993908,1.016808,0.983909,0.931919,0.909193,1.019038,1.126239,1.206103,1.159905,0.937393,0.989445,1.143806,1.003686,1.024565,1.201113,1.048331,0.758211,0.544049,0.406677,0.30765,0.232747,0.213828
1.514406,1.344447,1.342693,1.645459,1.421688,0.982493,1.019287,1.026117,0.893349,0.874899,0.882335,0.914418,1.054025,1.289077,1.242481,0.940179,0.998626,1.062835,0.871869,0.844634,0.951542,0.93529,0.763128,0.558159,0.427146,0.346237,0.281743,0.243637
2.042491,1.80258,1.887949,2.250894,1.866668,1.192539,1.234217,1.271586,1.101387,1.123821,1.142036,1.095354,1.218969,1.551922,1.498549,1.124333,1.175759,1.134586,0.887937,0.816595,0.853104,0.968536,0.868831,0.626122,0.509686,0.438313,0.359346,0.292489
2.662688,2.311703,2.488529,2.812774,2.273995,1.443161,1.510458,1.59755,1.422396,1.501012,1.48205,1.331978,1.403047,1.727766,1.698848,1.400492,1.483505,1.364379,1.048371,0.972035,1.013056,1.190362,1.07831,0.729178,0.579285,0.513392,0.42567,0.340157
3.122208,2.645622,2.833126,2.965831,2.364967,1.676061,1.766823,1.84893,1.74373,1.871122,1.761156,1.454644,1.487416,1.741325,1.733664,1.668357,1.813364,1.594829,1.208208,1.139836,1.223429,1.44627,1.318718,0.836775,0.594316,0.530556,0.448783,0.360349
3.223788,2.803012,2.825765,2.687679,2.195561,1.817835,1.845134,1.913133,1.985139,2.105671,1.926204,1.490999,1.496686,1.708545,1.68251,1.840101,2.018073,1.696693,1.32056,1.304076,1.4732,1.684009,1.494118,0.928058,0.589324,0.498398,0.443704,0.376601
3.012769,2.760188,2.584534,2.308192,2.006191,1.796279,1.650805,1.746736,2.016426,2.042965,1.838335,1.412942,1.344084,1.471658,1.558858,1.920302,1.994072,1.637747,1.401196,1.407801,1.609144,1.764686,1.468882,0.89772,0.557871,0.436835,0.415583,0.393187
2.477796,2.287949,2.090592,1.903262,1.848298,1.661297,1.323801,1.470247,1.850405,1.749562,1.52217,1.220882,1.119896,1.20042,1.457421,1.852004,1.728507,1.40731,1.320171,1.336988,1.511544,1.602025,1.271155,0.786361,0.496803,0.366968,0.356769,0.355509
1.7098,1.520401,1.422422,1.38183,1.519581,1.365517,0.982037,1.10843,1.409826,1.253082,1.104382,1.017046,0.99078,1.075245,1.307404,1.506354,1.284026,1.076077,1.118511,1.198368,1.299091,1.24582,0.973257,0.682974,0.440747,0.300944,0.267106,0.253512
1.100625,0.929877,0.916668,1.03459,1.170676,1.009629,0.71513,0.777711,0.928862,0.833112,0.836883,0.919074,0.915279,0.954447,1.047325,1.023051,0.908073,0.897901,0.955907,1.038358,1.132265,0.999543,0.769364,0.603656,0.385388,0.254667,0.190631,0.162254
0.854646,0.736532,0.754336,0.896171,0.992485,0.869118,0.661533,0.625831,0.63241,0.584158,0.684912,0.840508,0.825971,0.821563,0.819779,0.726261,0.793113,0.950234,0.923502,0.879742,0.981782,0.930332,0.75161,0.582941,0.381304,0.268514,0.197095,0.170696
0.875282,0.85992,0.792731,0.84361,1.003867,0.925667,0.703496,0.617705,0.573821,0.519019,0.614066,0.748156,0.741801,0.729714,0.667212,0.634375,0.85818,1.024506,0.92551,0.857883,0.90094,0.95534,0.898787,0.649091,0.422297,0.30606,0.228697,0.222279
0.977983,1.005215,0.818771,0.800596,1.049598,1.048394,0.853109,0.787993,0.732257,0.655715,0.637571,0.626592,0.6626,0.727198,0.671717,0.653788,0.887894,0.990607,0.906161,0.869191,0.825527,1.009111,1.11599,0.806757,0.505634,0.3429,0.257873,0.267773
1.071591,1.032306,0.851963,0.86023,1.110795,1.169659,1.039001,0.96491,0.928501,0.897336,0.757868,0.596355,0.687727,0.806192,0.766167,0.775216,0.942766,1.03484,0.992753,0.892252,0.828522,1.061471,1.214633,0.917292,0.562556,0.363625,0.271286,0.270044
0.993013,0.873255,0.83947,0.885189,1.027071,1.122156,1.061929,0.950564,0.965385,1.043744,0.889982,0.689526,0.775769,0.884518,0.866357,0.937596,1.020198,1.085928,1.113947,0.902671,0.815324,1.013859,1.082335,0.836739,0.52915,0.3603,0.259907,0.22679
0.767841,0.667788,0.804099,0.878817,0.887981,0.909658,0.850834,0.715145,0.791575,0.961197,0.847726,0.694156,0.752024,0.832181,0.845957,0.972727,1.034491,1.032656,1.090799,0.861921,0.744962,0.860756,0.810232,0.605485,0.409314,0.314198,0.229683,0.189064
0.565409,0.564063,0.756849,0.864056,0.803968,0.667529,0.538146,0.442805,0.558075,0.698397,0.620018,0.543348,0.573569,0.619665,0.665682,0.811494,0.8758,0.811499,0.863035,0.780474,0.667852,0.659348,0.587667,0.422864,0.302225,0.240016,0.18755,0.172943
0.451026,0.447247,0.600187,0.760881,0.766453,0.512686,0.31983,0.292505,0.37436,0.462777,0.402998,0.335827,0.384526,0.456422,0.5042,0.572641,0.577694,0.536237,0.602628,0.640861,0.557426,0.480928,0.405952,0.288979,0.21795,0.171876,0.147106,0.150601
0.365825,0.296505,0.411961,0.570201,0.623901,0.437376,0.265222,0.24543,0.29569,0.337369,0.265465,0.18917,0.277607,0.411295,0.426083,0.351652,0.30868,0.384871,0.527671,0.530613,0.439481,0.378437,0.301588,0.218142,0.160341,0.126423,0.125225,0.131996
0.291946,0.189531,0.259568,0.354346,0.400108,0.325761,0.217762,0.236174,0.306803,0.319155,0.216661,0.128616,0.212405,0.359522,0.356888,0.227927,0.195485,0.314171,0.448602,0.407218,0.306695,0.250302,0.219734,0.207021,0.150755,0.103402,0.100768,0.11072
0.239349,0.142188,0.144443,0.197075,0.277095,0.239841,0.169886,0.236628,0.323587,0.312763,0.192453,0.104074,0.154431,0.262186,0.287969,0.208219,0.180276,0.257771,0.321249,0.314603,0.251699,0.167522,0.161865,0.194964,0.13725,0.080325,0.067268,0.079202
0.211721,0.113362,0.088453,0.175535,0.300712,0.245897,0.175357,0.235393,0.2898,0.256787,0.161498,0.106645,0.135403,0.183065,0.214514,0.18592,0.150971,0.2165,0.266918,0.314073,0.261822,0.134601,0.140758,0.176409,0.102492,0.050831,0.041363,0.054866
0.201279,0.099441,0.09318,0.214391,0.332047,0.279497,0.225766,0.243883,0.228641,0.187114,0.140358,0.125183,0.146661,0.156811,0.195654,0.172286,0.118764,0.251426,0.355253,0.377286,0.280674,0.129295,0.141937,0.158444,0.070821,0.032847,0.035814,0.055982
0.21075,0.097471,0.106779,0.234003,0.316439,0.289792,0.280888,0.270631,0.206576,0.157736,0.141896,0.144767,0.146662,0.162772,0.21612,0.16869,0.12729,0.335672,0.469501,0.401996,0.289177,0.159441,0.154975,0.150814,0.067599,0.035425,0.035752,0.056424
0.218317,0.103941,0.115196,0.211426,0.26644,0.298311,0.354183,0.347823,0.236905,0.137935,0.156918,0.182425,0.146679,0.166428,0.228949,0.158077,0.156154,0.426626,0.547455,0.358923,0.272439,0.197745,0.166826,0.136353,0.070684,0.04002,0.034787,0.051
0.233766,0.125664,0.10894,0.158557,0.230065,0.364017,0.477828,0.464018,0.275313,0.115936,0.174548,0.233739,0.169214,0.158261,0.226427,0.167434,0.195055,0.479375,0.551076,0.285386,0.264792,0.260228,0.173245,0.108414,0.069326,0.040475,0.032375,0.05003
