-0.001125,-0.001543,-0.001787,-0.001386,-0.001102,-0.001127,-0.00119,-0.000691,-9.9e-05,-0.000571,-0.000509,5e-05,-0.000258,1e-06,-0.000329,-0.001576,-0.000761,-0.000768,-0.000901,-0.000688,-0.001101,0.000446,0.000194,-0.001299,-0.000613,-0.000425,-0.000434,-1.1e-05,-0.000107,-2.9e-05,-0.000687,0.000779,2e-05,-0.001036,-0.00113,-0.00047,-0.000975,-0.000643,-0.000649,-0.001075,-0.001239,-0.002269,3.8e-05,-0.000609,-0.00073,-0.000741,3e-05,-0.000275,-0.000475,-0.001217,-0.000924,-0.001203,-0.000317,-0.000611,-0.000845,-0.001502,1.8e-05,-2.8e-05,-0.002032,-0.00144,-0.000741,-0.000813,-0.000336,-0.001407,-0.000722,8.2e-05,-0.00011,-0.000323,-0.000556,-0.001333,-0.000727,-0.001592,-0.001944,-0.000689,5.7e-05,-0.001722,-0.000554,-0.000856,-0.000972,-0.001134,-0.000662,-0.000246,-0.000412,-0.000503,-0.000786,-0.000744,-0.000141,-0.001202,-0.001519,-0.001402,-0.001246,-0.000559,-0.00083,-0.001651,-0.003526,-0.002966,-0.002033,-0.00246,-0.00345,-0.002711,-0.002385,-0.003518,-0.002821,-0.00201,-0.002599,-0.002121,-0.004477,-0.003159,-0.003237,-0.001894,-0.001979,-0.001712,-0.001272,-0.002024,-0.00067,-0.002239,-0.001038,-0.00135,-0.002172,-0.002568,-0.00221
-0.001904,0.000655,0.000777,1.6e-05,-0.001586,-0.001092,-0.000818,-0.000921,0.000586,-0.000208,-0.000486,-0.001642,-0.000568,-0.000696,-0.000651,0.000819,-0.000674,-0.001987,-0.000917,-0.00036,-0.000134,-0.00072,-0.000397,0.000355,0.000606,-0.000581,-0.000374,-1.1e-05,0.000169,-0.000538,0.000195,7.4e-05,-0.000779,0.000434,-0.001412,-0.00103,-0.00099,-0.000446,-0.001459,-0.001455,-0.000265,-0.000195,0.000829,0.000911,0.000648,-0.000713,-0.001022,-0.000626,-0.001293,-2.9e-05,-0.000177,0.000321,-0.000127,-0.000965,-0.000519,4e-06,-0.000293,-0.00118,0.000442,-0.000126,-0.000555,0.000284,-0.000343,7.4e-05,-0.000755,0.000379,-0.00053,-0.000727,4.4e-05,-9.3e-05,7.8e-05,0.001294,0.001037,0.000153,0.000368,0.000595,-0.000757,-0.000243,-0.000246,-0.000781,0.000214,-0.000281,-4.5e-05,-0.000547,-0.000326,-0.000594,-0.000335,0.000186,0.000414,-9.1e-05,-0.000343,0.000313,0.000234,-9.1e-05,0.002027,0.002056,0.000509,0.001279,0.002036,0.000835,0.00083,0.00194,0.000546,0.000331,9e-05,0.000544,0.002424,0.000925,0.001826,-0.000651,0.000311,0.00024,-0.000546,-0.000149,0.000621,0.000567,-0.000576,0.000423,0.00146,0.000899,0.000316
0.001343,-0.000749,0.000217,0.000532,0.00068,0.000207,0.000935,0.000422,-1e-04,-8.7e-05,-0.000364,-0.000585,7.7e-05,-0.000113,0.000296,-0.001119,8.6e-05,-0.000546,0.000407,-3.6e-05,-0.001182,-0.001504,-0.0011,-0.000968,-0.000904,-0.000807,-0.000882,-0.000922,-0.000143,0.000866,0.000601,-0.000846,-0.000656,-0.000488,0.000949,0.000173,8.2e-05,-0.00019,0.000235,0.001495,0.001055,0.000878,1.9e-05,1e-04,0.00027,0.000881,0.000715,0.000785,0.00119,0.000409,0.000954,-0.000329,-0.000295,0.000825,0.000828,0.000153,-1.3e-05,-0.000201,-0.000591,0.000526,0.000329,-0.000481,0.000385,-0.000769,0.00023,-0.000271,5.8e-05,0.000705,0.00016,0.000283,-1.2e-05,-9.7e-05,-0.000455,0.000256,-0.000271,-0.000727,-0.000906,-0.000725,-0.000104,0.001266,0.00023,-0.000179,0.000143,2e-05,0.000408,-4.2e-05,9.7e-05,-0.000357,-0.000779,0.000168,1.1e-05,-0.001255,0.000517,0.001061,-0.000978,-0.000803,0.000149,-0.000309,-0.000722,-0.000634,-8e-06,-0.000197,0.000389,-0.000297,-0.001963,-0.001433,-0.002242,-0.000325,-0.000485,-0.000483,-0.000758,-0.000634,-9.6e-05,-0.000251,0.000187,-0.00053,-0.000188,-0.000226,-0.0013,-0.000525,-9.8e-05
7e-06,0.000665,-0.000709,-0.000447,4.4e-05,0.000533,0.000101,-0.000378,0.000132,-3.9e-05,0.000457,0.000896,0.000505,0.000639,-0.00036,-0.000507,0.00033,0.000945,0.000279,-0.000316,0.000337,-9.3e-05,-0.000432,9.1e-05,-0.000857,-0.000428,0.001087,0.000361,-0.001463,-0.000644,-0.000283,-0.000219,-0.000427,-0.000299,-0.000455,-0.00039,0.000909,0.000509,0.000514,-6.8e-05,-0.000735,-0.001229,-0.001677,-0.001306,-0.000788,-0.000267,-0.000348,-0.000754,8e-06,0.000188,-0.000703,0.000935,0.000161,-0.000927,-0.001468,-0.000708,-0.001251,-0.000769,-4.2e-05,-0.000441,-0.000359,-0.00037,-0.000185,-0.000164,-0.001022,-0.001632,-0.001629,-0.001371,-0.001089,-0.000548,-0.000293,-0.000111,-0.000859,-0.00046,0.000578,-0.000153,0.000232,0.000577,0.000688,-0.000317,-0.000677,-0.000513,-0.000378,0.000325,-5.7e-05,-0.000256,-0.000257,-0.000526,-0.000235,-0.001085,0.000244,7.5e-05,-0.000647,-0.001188,0.000577,-0.000461,-0.000768,-0.000214,-0.000655,-0.000533,-0.001121,-0.00185,-0.002005,-0.000312,0.001111,0.000643,0.000626,-0.000448,-0.000567,-6.9e-05,-0.000249,0.000193,-0.000393,0.000267,-0.001283,-0.000132,0.000277,-0.000494,0.000821,0.000757,-6.4e-05
-0.00046,-0.000503,0.000363,-2.7e-05,-0.000332,-0.00054,-0.000817,-0.000464,-0.000994,-0.000893,-0.000368,-0.000191,-0.000617,-0.000358,-0.000589,-6.8e-05,6.5e-05,-0.000365,-0.000217,0.000439,0.000407,-0.000281,-0.00032,0.000195,0.000807,0.000673,7.1e-05,0.00024,-0.000191,0.000115,0.000463,-0.000146,-0.000228,0.00014,-4.6e-05,6.1e-05,-0.00049,-0.000665,-0.000385,-0.000295,-8.2e-05,0.00029,0.000909,-0.000157,-0.000127,0.000874,-0.000362,0.000691,0.000595,-5.5e-05,-2.9e-05,4.4e-05,0.00063,-0.00032,6.7e-05,0.000807,0.000631,0.001247,0.000375,0.000131,8.7e-05,0.000382,0.000292,0.000436,0.000797,0.00095,0.001564,0.001372,0.000406,0.000304,-0.000119,9.7e-05,0.000425,0.000295,0.000327,-8.1e-05,-4.3e-05,-0.000755,-0.00071,-0.000485,-5.9e-05,-0.001186,-0.000282,-0.000406,0.000116,0.000243,0.00023,0.000251,0.000844,0.00107,0.000324,0.000284,8.6e-05,0.000546,-0.000232,0.000683,0.000606,0.000319,0.000755,0.000801,0.000484,0.001465,0.001227,0.000498,-0.000254,0.000771,4.4e-05,0.000262,0.000582,-0.000107,0.000521,-4.6e-05,0.000228,-0.000523,0.000111,-0.000521,0.000132,-0.000687,-0.000176,-0.000676,-0.000516
-0.000219,-3.5e-05,-0.000181,-0.000208,0.000416,3.8e-05,-0.000234,-2.8e-05,-0.000335,-0.000203,-0.001012,-0.000782,0.000395,-0.000273,2.9e-05,-0.000173,-0.00044,-0.000318,-3.8e-05,-0.000668,-0.000141,-1.3e-05,0.000491,-0.000193,-0.000105,7.9e-05,-0.000749,-0.000312,-0.000376,0.000221,-0.000235,-8.8e-05,0.000374,-0.000166,-0.000149,0.000272,-0.000371,0.000734,0.000183,-0.000877,-0.000569,-0.000585,-0.001204,-0.000834,-3.9e-05,-0.000452,-0.000909,-0.000882,-0.001195,-0.001101,0.000259,-2.2e-05,-0.000955,-0.000537,-0.000291,-0.00036,-0.000395,-0.000221,-0.000688,-0.00066,-0.000662,-0.000563,-0.000173,-0.000124,-0.000221,-0.000373,0.000141,-0.000568,-0.000585,-0.000157,-0.000118,0.000148,-0.00023,-0.000111,-0.000561,-5.7e-05,-4.9e-05,-0.000309,-2.8e-05,5.8e-05,-0.000338,0.000261,-0.000776,-0.000595,-0.000493,-0.000132,-0.000374,0.000137,-0.000131,-0.000395,-0.000546,-0.000102,-0.000293,-0.000418,-0.000561,-0.001296,-0.001254,-0.000642,-0.001109,-0.000677,-0.000713,-0.000756,-0.000843,-0.000753,0.000298,-1.9e-05,0.000374,-0.000267,-0.000395,0.000539,-5e-06,5.3e-05,-0.000194,-4e-05,4.1e-05,-0.000608,-0.000452,4.3e-05,-0.000729,-0.000272,-0.000477
0.00101,0.000755,0.000526,0.00022,-0.000211,0.000788,0.000762,0.000327,0.000596,0.000168,0.00065,0.000335,0.000705,0.000187,0.000274,0.000674,0.000144,0.000652,0.000386,0.000351,-0.000375,0.000686,0.000507,-0.000187,0.000251,0.000526,0.000243,-0.000299,0.000397,-0.000631,2.4e-05,-6.4e-05,-0.000752,0.000154,-6.3e-05,0.000221,0.00022,3.6e-05,0.000145,0.000661,0.000435,0.000743,0.000473,-0.000116,-0.00038,-9.5e-05,0.000644,-3.4e-05,-0.000113,0.000386,0.000512,-8.2e-05,0.000271,0.000275,0.000278,0.000201,0.000428,-0.000316,0.000103,-4.1e-05,8.9e-05,-0.000317,0.000148,0.000196,0.000388,0.000923,0.000156,0.000347,0.000617,-0.000123,0.000156,-0.000514,-0.000319,-6.7e-05,-0.000497,4.9e-05,-0.000232,0.000339,0.000482,0.000344,0.000648,0.000481,0.000421,0.000195,0.000336,2.9e-05,3.9e-05,-0.00015,0.000238,3.9e-05,0.000229,-0.000229,-0.000203,-0.000426,0.000312,0.000829,0.000491,0.000267,0.000658,0.000825,0.000405,-7.8e-05,0.000894,8.7e-05,4.4e-05,-0.000464,-6.3e-05,0.000405,0.000358,-3.7e-05,-3e-05,-0.000254,9.2e-05,0.000104,0.000186,0.000187,0.000261,-0.00021,0.000242,-0.000356,0.00047
-0.00102,-0.000312,-0.000552,-0.000255,-0.000127,-0.000351,-0.000469,-0.000384,-0.000403,-0.000373,-0.000405,-3.9e-05,-0.000429,-0.00017,-0.000134,0.000138,0.000104,6.3e-05,7.6e-05,0.000368,-7.6e-05,0.000103,-0.000119,-0.000145,-0.000312,-0.000288,0.000166,0.000547,2.2e-05,0.000163,-0.000786,-0.00035,0.000311,-0.000171,0.000239,0.000126,0.000271,-0.00036,-0.00012,-2.5e-05,-0.000148,-0.000404,-0.000155,0.000202,0.000479,0.000229,-8.9e-05,0.000175,3e-06,-0.000243,-0.000111,-0.000418,-0.000311,0.000233,-0.000953,-0.000519,-0.000473,-9.8e-05,0.000115,0.000436,7.7e-05,0.000155,-4.4e-05,0.000136,-0.000498,-0.000322,-0.000256,-0.000118,-6.6e-05,5e-06,-8e-05,0.000132,0.000355,-9.8e-05,0.000295,7.8e-05,3e-05,0.000548,-0.000564,-0.000594,-0.000767,-0.000104,7.5e-05,-0.000157,-3e-04,8.2e-05,9e-05,0.00035,-0.000333,-3e-04,-0.000141,6.7e-05,-0.000128,0.000272,-0.000446,-0.000607,-3e-06,-3.5e-05,-0.000452,-0.000345,-0.000137,-0.000413,-0.000232,0.000477,-0.000481,-0.000662,-0.000478,-0.00023,-0.000244,-0.000136,-0.000152,0.000189,-9.5e-05,-0.000129,-0.00035,4.1e-05,-0.000264,0.000491,-0.000642,-0.000334,-0.000338
-2.4e-05,-0.000597,-4.7e-05,0.000124,0.000111,-0.000141,-0.000295,-0.000103,-0.000149,0.000549,-4.9e-05,-0.000249,-0.000585,-9.1e-05,-0.00037,-0.000355,-6.1e-05,-0.000409,-0.000681,-0.000641,-0.000249,-0.00036,-0.00027,-0.000198,-3.4e-05,-0.000123,-4e-06,-7.7e-05,6.7e-05,-0.000283,2.5e-05,7.2e-05,-3.7e-05,-0.000476,-0.000471,-0.000248,-0.000522,-0.000153,0.000138,-0.000178,-0.000179,0.000223,-0.000345,-0.000184,-0.000252,-0.000485,-0.00032,-7.1e-05,-2e-04,-0.000242,-3.7e-05,0.000206,0.000348,-0.000231,0.000574,5.1e-05,2.3e-05,-0.000512,-4.7e-05,-0.000308,-0.00016,7.2e-05,7.4e-05,-0.000532,-9.2e-05,-8.7e-05,-0.000281,-0.000386,0.000112,-5.9e-05,-1e-05,-0.000235,-0.000244,-0.000375,-0.00035,0.000139,-0.000194,-0.000272,8.7e-05,0.000285,0.000315,0.00027,2e-04,5.4e-05,0.000116,-0.00024,7.7e-05,-0.000132,-0.000246,0.00019,0.000219,8.2e-05,-0.000178,-0.000349,-4.3e-05,0.000411,5.9e-05,-0.00046,6.3e-05,0.000154,0.000123,-6.8e-05,-0.000408,-0.000288,0.000476,0.000829,0.000186,0.000152,0.000265,0.000208,-3.6e-05,0.000291,6.9e-05,0.000136,-0.000164,0.000304,-0.000119,-0.000309,0.00039,0.000308,0.000187
0.000301,0.00052,0.000354,0.000115,6.2e-05,6.7e-05,0.00026,0.000366,0.000644,2.8e-05,0.000394,7.3e-05,0.000203,0.000239,0.000277,0.000322,0.000455,0.000315,0.000238,-0.000223,0.000344,0.000181,0.000412,0.000362,0.000187,-0.000108,0.000259,-3.3e-05,-0.000185,7.5e-05,0.000238,-0.000144,0.000207,1.5e-05,0.000409,0.000285,0.000436,0.000163,0.000144,0,0.00037,0.000394,0.000127,0.000287,0.000205,0.000183,-9e-06,-0.000277,0.000246,1.7e-05,6.2e-05,-8.3e-05,-0.000294,0.00012,0.000529,-0.000144,2.7e-05,0.000274,4.6e-05,0.000178,0.000166,0.000157,-0.000147,0.00024,0.000199,0.000136,0.000139,2e-04,0.000308,0.000241,1.7e-05,0.000182,0.000228,0.000129,0.000128,0.000273,0.00051,0.000111,5.7e-05,-4.2e-05,0.000233,-0.000134,0.000262,0.00013,5e-06,0.000397,0.000122,7e-06,0.00017,0.000129,0.000125,-2.1e-05,0.000374,0.00019,0.000219,-0.00048,-7.4e-05,0.000505,0.000172,0.000149,-0.00011,0.000498,0.000364,2.8e-05,-0.000118,-0.000189,0.000151,-0.000225,-0.000413,-0.000119,-0.000176,-0.000127,-0.000175,1e-06,5.5e-05,-3e-06,-9.4e-05,-0.00012,0.000146,0.000198,-0.00022
4e-05,-0.000106,-0.000145,-0.000159,0.00021,-3.3e-05,-2.8e-05,-0.000149,-4e-06,-0.000128,-0.000123,9.6e-05,4.6e-05,-0.000112,9.3e-05,-2e-05,-0.000193,-0.000224,-3e-06,0.000449,-0.000201,-7.4e-05,-0.000373,0.000333,-5.6e-05,0.000131,-0.00025,-0.00011,0.000109,9e-06,-0.000121,0.000204,-0.000148,0.000128,-0.00031,-0.00022,-0.000103,2e-06,-0.000258,7.3e-05,2.7e-05,-0.000401,0.000156,-0.000162,-0.000122,-0.000329,-1.2e-05,6.2e-05,-0.000249,3.2e-05,-0.000245,-0.000205,0.000181,-7e-05,-8.2e-05,9.5e-05,-9e-06,-0.000173,-0.00014,2.6e-05,-0.000147,-7.9e-05,-0.000267,-3.1e-05,-0.000125,-0.000274,-0.000162,7e-06,-0.000299,-0.000169,-6e-05,-7.8e-05,-0.000101,4.3e-05,0.000224,-8.3e-05,-0.000218,-5e-06,-5e-05,-2e-05,-0.000235,0.000182,0.000112,0.000215,-3.8e-05,-0.000126,-4.8e-05,-4.2e-05,9.5e-05,-8.7e-05,-0.000333,-9e-05,8.4e-05,5.9e-05,2.2e-05,0.000281,6.6e-05,-0.000276,-0.000144,-0.000117,-0.00041,-0.000111,-0.000126,0.000121,0.000204,9e-06,0.000157,0.00031,-6.2e-05,7.5e-05,0.000127,-0.000201,0.000137,-5.3e-05,0.000262,-3.9e-05,-0.000135,2e-06,0.000108,-0.000292,5.8e-05
3.2e-05,-2.3e-05,-8e-06,-2.5e-05,-6e-05,3.7e-05,-1.9e-05,-3.9e-05,-8.4e-05,-3e-06,0.000144,-6.4e-05,-0.000163,-3e-04,-9.4e-05,-4.5e-05,-0.000343,0.000304,-7.6e-05,-1.2e-05,0.000132,0.000223,0.000114,-0.000141,-0.000126,-2.1e-05,-0.000129,-4.8e-05,-5.1e-05,0.00018,7.2e-05,6e-05,7.8e-05,0.000334,0.000118,-5.1e-05,-0.000116,-9e-05,-8.1e-05,-3e-05,-0.000125,0.000204,2.2e-05,1.6e-05,-1.2e-05,-0.000148,0.000214,0.00019,0.000198,8.6e-05,8.7e-05,0.000207,-0.00012,0.000213,0.000148,-0.000174,6.7e-05,0.000265,0.000199,0.000256,0.000165,0.000125,9.3e-05,0.000115,3.2e-05,0.000252,0.000223,-8e-06,1e-06,0.000186,0.000179,0.000128,6e-05,0.000297,-0.000204,-6e-05,7.3e-05,4e-06,-0.000176,0.000131,8.4e-05,-0.000147,-0.000261,-4.4e-05,2.7e-05,-0.000145,-8.7e-05,-6.5e-05,-9.4e-05,0.00019,9.3e-05,-6.8e-05,-0.000175,5.7e-05,2.7e-05,-4.8e-05,2.1e-05,0.00021,0.000125,9.2e-05,0.00028,0.000104,4.3e-05,0.000284,-0.000156,0.000138,-0.000343,-0.000285,0.000145,-4.7e-05,1.1e-05,-3.8e-05,-0.000228,3.6e-05,-4.4e-05,3.2e-05,0.00012,0.000294,-5.8e-05,0.000236,0.000341
-0.000126,7.1e-05,9.8e-05,3.5e-05,0,4e-06,8.4e-05,2.5e-05,-1.6e-05,0.000112,-2.8e-05,8.5e-05,-5.8e-05,4e-06,-8.1e-05,-9e-06,-1.8e-05,-5.6e-05,0.000114,-0.000156,0.000206,-8.8e-05,-1.8e-05,-8.2e-05,-8.4e-05,3e-06,-0.000108,5.2e-05,0.000109,-1.7e-05,-6.1e-05,-0.000123,6.2e-05,6.3e-05,3.5e-05,-7.7e-05,0.000323,-8e-06,9.3e-05,3.4e-05,-4.9e-05,6.8e-05,-7e-05,0.000138,3.7e-05,0.000141,-2.4e-05,-5.7e-05,1.5e-05,1.7e-05,-0.000152,-0.000103,6e-06,-9.1e-05,4.7e-05,-4.1e-05,5.9e-05,-8.8e-05,1.4e-05,-0.000154,-6.3e-05,-9e-05,-3.9e-05,-0.000116,0.00015,-4e-06,2.6e-05,2.2e-05,0.000121,-2e-05,-6.1e-05,-1.5e-05,1.6e-05,-0.000111,5.4e-05,4.6e-05,0.000127,0.000232,0.000157,-2.9e-05,1.9e-05,0.000202,-0.000114,-1.3e-05,1e-06,5.6e-05,6e-05,1.6e-05,7.4e-05,-0.000159,-0.000108,0.000166,-4.1e-05,-4.8e-05,-7.4e-05,8.9e-05,-6.3e-05,-6.7e-05,-2.4e-05,-0.000187,-8.5e-05,-0.000221,-2e-06,-6e-05,0.000158,-7.3e-05,4.8e-05,0.000171,-0.000131,5.9e-05,0.000103,0.000131,0.000263,1.7e-05,-1.1e-05,-0.000188,9.6e-05,-1e-05,-7e-05,1e-05,-7.8e-05
7.5e-05,0.000127,-0.000139,6.5e-05,-3.9e-05,-6.7e-05,-1.7e-05,5e-05,-0.000135,-2.1e-05,-3.6e-05,3e-05,3.9e-05,0.000161,9.6e-05,-7.2e-05,2.1e-05,5e-06,-3.3e-05,-1.3e-05,-0.000207,-0.000138,2.9e-05,-4e-05,-3e-05,-5.7e-05,0.000104,2.8e-05,-0.000134,-1.7e-05,5.8e-05,0.000119,-7.2e-05,-7.9e-05,7.5e-05,-2.3e-05,-9.5e-05,0.000214,-6e-06,1.3e-05,7.7e-05,-2e-04,0.000131,3.8e-05,-9e-05,7e-06,-2.5e-05,-3.3e-05,-3.5e-05,4e-05,-0.000146,-0.000118,8.5e-05,5.6e-05,-2.7e-05,0.000287,-1e-05,0.000121,4.9e-05,-0.000108,-3.3e-05,3e-05,-1e-06,5e-06,-5.8e-05,-8.4e-05,3e-06,3.2e-05,0.000124,-6.8e-05,5.8e-05,-5.9e-05,-1.2e-05,2.8e-05,-1e-06,-2.5e-05,-7.5e-05,-0.000143,0.000106,7.8e-05,1.5e-05,-0.000149,5.8e-05,-7.5e-05,1.3e-05,0.000145,7e-06,1.5e-05,5e-06,-6e-06,9.1e-05,-0.000162,2.8e-05,3.9e-05,8.3e-05,5.3e-05,8.7e-05,-9e-06,5.8e-05,9.6e-05,0.000118,3.2e-05,-9.4e-05,-2e-05,-0.000141,-4e-05,4.8e-05,2.1e-05,0.000303,-4e-05,4.4e-05,-9e-06,-7.6e-05,-1.4e-05,3.4e-05,0.000354,7.7e-05,-7e-05,-0.000101,-8.9e-05,8.4e-05
4.3e-05,-0.000113,4.2e-05,-7.5e-05,-0.000105,-3.7e-05,-6.8e-05,-1.4e-05,9.7e-05,-7.6e-05,-7.4e-05,-2e-06,0.000168,3.5e-05,-6.6e-05,-7e-06,1.3e-05,-6.2e-05,-1.3e-05,8.6e-05,-5.9e-05,-1.7e-05,6e-06,-3.8e-05,-3.6e-05,1.8e-05,6.3e-05,5.7e-05,-4e-05,-3.5e-05,0.000109,2.8e-05,5.9e-05,-4.2e-05,-4.1e-05,-3.1e-05,4.4e-05,-2.5e-05,3.3e-05,-7.1e-05,4.3e-05,2.4e-05,-5.9e-05,-3e-05,6.3e-05,0.000123,4.4e-05,5.2e-05,3.1e-05,2.3e-05,-6.6e-05,8.8e-05,-1.6e-05,-6.7e-05,-0.000134,2e-06,1.4e-05,-9.5e-05,3e-05,-6.6e-05,-3.3e-05,2.2e-05,2.7e-05,-4.8e-05,-5.2e-05,-6.5e-05,2.5e-05,-3.4e-05,1.7e-05,-2.9e-05,-5.4e-05,3.9e-05,-1.7e-05,-2.5e-05,9.8e-05,-2.5e-05,2.3e-05,-5e-05,8.3e-05,-4.6e-05,2.2e-05,-2.3e-05,-3.1e-05,-4.2e-05,1.5e-05,-0.000189,-3.4e-05,3.5e-05,5.2e-05,-2.3e-05,-1.6e-05,0.000147,7.4e-05,-4.6e-05,-7.4e-05,-8.8e-05,4e-06,9e-06,5.6e-05,-5.3e-05,4e-05,-3.5e-05,-1.7e-05,-5.5e-05,-0.000199,1.3e-05,-6e-05,-3.8e-05,-0.000203,-1.2e-05,-2.8e-05,1.9e-05,-3.6e-05,3e-05,3e-06,-1.2e-05,3e-06,6.7e-05,8.2e-05,7.9e-05,-0.00014
2.9e-05,-3.2e-05,-2.4e-05,4.5e-05,8.6e-05,-3e-06,6.5e-05,-3.5e-05,4.8e-05,-1.9e-05,5.7e-05,-3.2e-05,-2.4e-05,4.6e-05,0.000112,-5.4e-05,9e-05,-4.4e-05,2.5e-05,-5e-05,6.5e-05,-2.5e-05,-7.4e-05,-3.6e-05,5.4e-05,7e-06,8.5e-05,-4e-05,5.9e-05,1.8e-05,-8.6e-05,-3.7e-05,-7e-06,3.3e-05,-3.7e-05,-3e-06,-4.8e-05,-2.8e-05,-3.1e-05,5.5e-05,-7e-06,6.4e-05,-4.7e-05,2.5e-05,-2.7e-05,8.6e-05,6e-06,-1.2e-05,6.5e-05,-3e-06,6.6e-05,3.2e-05,-3.2e-05,2e-05,-3.2e-05,-5.5e-05,4.5e-05,4.2e-05,-2.2e-05,0.000136,3.7e-05,-9e-06,5.2e-05,6.2e-05,2.8e-05,1.5e-05,-3e-05,4e-06,-0.000145,2e-05,-1.6e-05,-3.1e-05,1.8e-05,2.8e-05,-5.2e-05,-1.7e-05,-5.7e-05,-5.8e-05,-0.000131,7e-06,-7.9e-05,9.4e-05,9.9e-05,-5.2e-05,1.3e-05,3.7e-05,-1.6e-05,-1.8e-05,-5.5e-05,6.9e-05,1.2e-05,-6e-05,-6.1e-05,-9e-06,1.8e-05,3.1e-05,-3.7e-05,1.6e-05,-8.2e-05,-2.2e-05,-2.3e-05,1.6e-05,5.5e-05,-3.8e-05,0.000133,6.7e-05,-5.9e-05,-6.5e-05,6.5e-05,-2.2e-05,-1.8e-05,6.3e-05,-2.2e-05,2e-06,-6e-06,-0.000188,-3e-06,1e-06,-2.4e-05,-2.5e-05,8.3e-05
-7.6e-05,3e-05,3.3e-05,-2.1e-05,-5e-05,2e-05,-5.8e-05,3e-06,-5.4e-05,3.1e-05,-8e-06,-6e-06,-3.5e-05,-4.1e-05,-4.3e-05,-3.5e-05,3.3e-05,4.4e-05,-2.7e-05,7.1e-05,-4e-06,2.2e-05,6.2e-05,0.000123,5.2e-05,2.7e-05,-5.8e-05,-1.7e-05,5.5e-05,-1.4e-05,1.7e-05,4.3e-05,2.6e-05,-3.7e-05,-5.1e-05,2.5e-05,-4.6e-05,-3.1e-05,-2e-06,-4.5e-05,-9e-06,1e-06,5.6e-05,-7.5e-05,2.9e-05,4.2e-05,5e-06,-1.9e-05,-2.9e-05,3e-06,8.1e-05,4e-06,8.5e-05,4.4e-05,0.000158,8e-05,-1.9e-05,-9.6e-05,-3e-05,2.6e-05,-6.4e-05,7e-06,2.8e-05,1.3e-05,1.7e-05,3.5e-05,-5e-06,-1.8e-05,-5.3e-05,-1e-06,2.5e-05,3e-06,1.5e-05,-5.6e-05,0.000104,-2.1e-05,3e-06,3.2e-05,-1.2e-05,-1e-05,4.6e-05,-3.7e-05,-7.1e-05,5.8e-05,-1.4e-05,2e-05,-6e-06,6e-06,-4.6e-05,-3.8e-05,-4.4e-05,9e-06,2.1e-05,-9e-06,4.4e-05,-2e-06,3.5e-05,-2.2e-05,1e-06,-4.7e-05,-2e-06,4.3e-05,2e-05,5.3e-05,-0.000102,-0.000118,0.000164,8.6e-05,-2.4e-05,-1.4e-05,3.9e-05,-7.9e-05,5.3e-05,-1.4e-05,-2.6e-05,2.1e-05,-6.3e-05,6e-06,0.000104,-8e-06,2.2e-05
2.4e-05,2e-05,-3e-06,0,3e-05,3.5e-05,4.3e-05,1.1e-05,-6e-06,2e-05,6.8e-05,-2.5e-05,1.4e-05,-9e-06,3.3e-05,-3e-06,-2.7e-05,-4.1e-05,1.3e-05,-4e-05,-3.3e-05,-4.9e-05,-1e-05,2.7e-05,4.5e-05,-8.7e-05,-4.1e-05,3.2e-05,-4.6e-05,-1.6e-05,7.3e-05,-1.1e-05,-3.3e-05,-4.6e-05,5.7e-05,1.2e-05,-1e-06,-1.1e-05,4.9e-05,2.7e-05,-3.2e-05,-1.4e-05,-2.1e-05,7.4e-05,-5.5e-05,-6.5e-05,2.1e-05,7.5e-05,2.1e-05,1e-06,2.4e-05,-5e-06,-7.4e-05,-1e-06,8e-06,-6.1e-05,1.1e-05,3.2e-05,2.4e-05,2.9e-05,4.6e-05,1.2e-05,7e-06,-4.1e-05,-8e-06,-5.5e-05,-7e-06,-8e-06,0.000115,3.1e-05,-7e-06,6e-06,-2.8e-05,3.1e-05,-0.000109,-3e-05,5.8e-05,2.2e-05,1.3e-05,1.3e-05,1.9e-05,2.5e-05,-5.6e-05,3.8e-05,4e-06,3.2e-05,-1.2e-05,7e-06,1e-05,6e-06,5.3e-05,-2.2e-05,4.1e-05,5.3e-05,-3.6e-05,-1.4e-05,-4.9e-05,-1.4e-05,4.3e-05,1e-05,2.8e-05,5.5e-05,-2.2e-05,1.2e-05,0.000122,2.8e-05,-4.5e-05,-1.5e-05,-1e-05,1.8e-05,-6.5e-05,-3e-05,2.1e-05,5e-06,1.5e-05,1e-06,-2.1e-05,-2.6e-05,-3.2e-05,-2.9e-05,-4.7e-05
2.5e-05,2.5e-05,5e-06,-6e-06,1e-06,-2.8e-05,-2.6e-05,-1e-06,3e-06,-3e-05,-3.2e-05,3.2e-05,3.1e-05,-2e-06,-2.7e-05,1.5e-05,-1.8e-05,1.6e-05,-1.5e-05,-6.2e-05,5.7e-05,-5e-06,4e-06,1e-05,-8e-06,5e-05,-8e-06,-3.8e-05,-4.4e-05,3.4e-05,-1e-04,0,2.3e-05,1.3e-05,-1e-06,3.1e-05,1.9e-05,5e-06,-4.6e-05,-1.2e-05,2.3e-05,-6.3e-05,-3.3e-05,-2.3e-05,5.5e-05,-2.7e-05,-6.1e-05,-3.1e-05,-7e-06,-1.4e-05,0,4e-06,2.6e-05,-2.7e-05,-0.000112,-4.5e-05,2e-06,-3.4e-05,3e-06,-8.9e-05,-2.5e-05,-1.4e-05,-6e-06,3.3e-05,-2.6e-05,-4e-06,-2.6e-05,-3e-06,-4.7e-05,-1.6e-05,-1.2e-05,3.2e-05,1.8e-05,-2.1e-05,1.7e-05,-1.7e-05,-5.1e-05,-3e-06,1.5e-05,-5e-05,-5.6e-05,-6.8e-05,-1.3e-05,-5e-06,-1e-05,-4.6e-05,-1e-06,1e-06,2.2e-05,3.3e-05,-6.2e-05,2.5e-05,2e-06,1e-06,2.3e-05,6e-06,4.7e-05,7.5e-05,-2e-05,-2.8e-05,-6e-06,-3.4e-05,0,-5.1e-05,-6.5e-05,4.6e-05,-6.2e-05,1e-05,5e-06,-5.8e-05,-2.9e-05,5.5e-05,-2.1e-05,-1.3e-05,7e-06,3.2e-05,1.1e-05,-1.3e-05,-1.2e-05,1.6e-05,6e-06
1.7e-05,-6e-05,8e-06,1.2e-05,-2.1e-05,3.4e-05,2.5e-05,-1e-05,-2.3e-05,-7e-06,-2e-05,7e-06,2.1e-05,4e-06,3e-05,-3.8e-05,5e-06,-1.5e-05,3e-06,5.1e-05,-1.4e-05,1.1e-05,-2.2e-05,-1e-06,8e-06,-3.2e-05,-9e-06,3.4e-05,1.7e-05,-1.5e-05,2.1e-05,2.1e-05,1e-06,6.6e-05,-1e-06,8e-06,-1.3e-05,-6.7e-05,3.2e-05,1.5e-05,6e-06,2.3e-05,5.3e-05,1.4e-05,-3.6e-05,-5e-05,2.4e-05,-1.7e-05,-9e-06,1.9e-05,3.6e-05,2e-05,2.9e-05,-5e-06,1.6e-05,1.8e-05,8e-06,4e-05,6e-06,-3.1e-05,-1.4e-05,2.7e-05,-5e-06,2.4e-05,3.2e-05,1.4e-05,3.1e-05,1.3e-05,-3e-05,-5e-06,1.9e-05,-2.7e-05,-5e-06,5.4e-05,-2.4e-05,0,3.5e-05,-5.6e-05,-1.9e-05,5.2e-05,2.1e-05,1.2e-05,1.8e-05,-1.2e-05,2e-06,2.2e-05,-5e-06,9e-06,-3.7e-05,-2.6e-05,8.4e-05,-5e-06,-4.2e-05,-2e-06,1.8e-05,1.6e-05,-4e-05,-3.3e-05,1e-05,4.8e-05,4e-06,-4e-05,6e-06,-9e-06,4.7e-05,-4e-05,1.6e-05,-7e-06,5e-05,2.4e-05,6.7e-05,1e-06,3.1e-05,-6e-06,-8e-06,7.1e-05,-2.5e-05,1e-06,-1e-05,1.6e-05,5.4e-05
-1.9e-05,1.7e-05,5e-06,1.3e-05,1.1e-05,4e-06,-7e-06,0,0,1.1e-05,1.7e-05,-9e-06,-7.7e-05,2e-06,-2.1e-05,3e-06,3.6e-05,4e-06,4e-06,4.4e-05,0,5e-06,2e-05,-6.3e-05,-3e-06,1.4e-05,5.1e-05,-1e-05,2.1e-05,2.4e-05,6e-06,-1.4e-05,6e-06,6.2e-05,-1.2e-05,2.5e-05,-8e-06,1.5e-05,-3e-06,-1.7e-05,-1.2e-05,2.7e-05,-2.8e-05,-1e-05,2.3e-05,-9e-06,2.2e-05,1.4e-05,1.5e-05,1.3e-05,2.8e-05,-5.6e-05,-2.3e-05,-4e-06,6e-06,-1.5e-05,3e-06,1e-06,-1e-06,-4e-06,1.4e-05,-2.1e-05,-2.6e-05,-1.6e-05,-3e-06,3.7e-05,-1e-05,-1.3e-05,1.2e-05,-4e-06,-2.9e-05,3e-06,2e-06,-1.8e-05,3.9e-05,0,-4e-06,-3.5e-05,1.1e-05,-3.2e-05,2e-05,3.9e-05,6e-06,-4.2e-05,9e-06,1.3e-05,1e-05,-1e-06,1.8e-05,-7e-06,-9e-06,-1.2e-05,-1.6e-05,-1.7e-05,-4e-05,-1.7e-05,5e-05,-4e-06,-3e-06,-3e-05,3e-06,7e-06,1.5e-05,-6e-06,1.6e-05,-2.8e-05,2.7e-05,3e-05,-7.8e-05,-7e-06,-4.8e-05,-6e-06,-2.3e-05,1.8e-05,-5e-06,-3.2e-05,3e-05,1.7e-05,-4.7e-05,0,-3.6e-05
-2.4e-05,2.1e-05,1e-06,-2.2e-05,-4.6e-05,-7e-06,-1.2e-05,6e-06,-7e-06,-1.8e-05,-3.1e-05,6e-06,-9e-06,2.8e-05,1.1e-05,1.6e-05,2.5e-05,9e-06,5e-06,-5.7e-05,-2e-06,3e-06,-4e-06,-1e-05,1e-06,-2e-05,-1e-06,-7e-06,1e-06,-2.3e-05,2.6e-05,2e-06,-1.1e-05,-1.1e-05,9e-06,-7e-06,2.9e-05,2.7e-05,-1.8e-05,1.9e-05,3e-06,-1.8e-05,-1.6e-05,-2e-06,-1.4e-05,1.5e-05,-3e-06,1.6e-05,7e-06,6e-06,-6e-06,1.4e-05,1e-06,2.3e-05,-2.7e-05,1.1e-05,4e-06,1.4e-05,-4e-06,5.1e-05,-1.6e-05,1.2e-05,-3e-06,7e-06,2e-06,-3.2e-05,6e-06,9e-06,-4.4e-05,-2.1e-05,2.3e-05,5e-06,2e-06,1.6e-05,-1.6e-05,-7e-06,-2e-05,3.7e-05,2e-05,1.6e-05,-2.5e-05,-2.9e-05,3.9e-05,-1.1e-05,3e-06,-5e-06,-3e-06,-8e-06,2.7e-05,-7e-06,-1e-06,1.9e-05,3.9e-05,-1e-05,1e-05,4e-06,-4.7e-05,3e-06,0,3.1e-05,-9e-06,3e-06,-1.5e-05,-4.4e-05,-3.4e-05,4.1e-05,-3e-06,-3.5e-05,4.3e-05,-8e-06,4e-05,8e-06,5e-06,1e-06,1.4e-05,-4.4e-05,1.9e-05,2e-06,1e-05,-1.2e-05,2.6e-05
3.8e-05,1e-06,-2.4e-05,2e-06,1.4e-05,0,1.4e-05,-3e-06,1.6e-05,3e-06,2.2e-05,-7e-06,2.8e-05,-3.7e-05,-4e-06,1.1e-05,-7e-06,3e-06,-5e-06,-8e-06,-1.9e-05,-1e-06,4e-06,2.9e-05,-1.6e-05,1.2e-05,-1.1e-05,0,-2.6e-05,1.7e-05,4e-05,9e-06,2e-05,-4.3e-05,-7e-06,3e-06,-4.1e-05,1.6e-05,1e-06,-1.6e-05,1.3e-05,-2e-06,3.2e-05,4e-06,1.5e-05,-2e-06,3e-06,-2.3e-05,1e-05,-2e-06,-2.7e-05,1.2e-05,1.7e-05,-1.4e-05,-4.1e-05,3.9e-05,0,2e-06,4e-06,-1.3e-05,-4e-06,-1e-06,4e-06,7e-06,-2e-05,5e-06,1e-06,4e-06,-1.7e-05,1.1e-05,-7e-06,-5e-06,-1e-06,-3.5e-05,1.9e-05,2e-06,1.2e-05,2e-06,-4e-06,-9e-06,1.8e-05,1.3e-05,-1.9e-05,1.7e-05,-3e-06,-9e-06,-3e-06,3e-06,0,3.5e-05,-1.1e-05,-1.3e-05,1.7e-05,-2e-06,2e-06,2e-06,3.3e-05,-1e-06,5e-06,-1.5e-05,1e-05,9e-06,6e-06,3.3e-05,6.4e-05,-1.4e-05,-4e-05,3.9e-05,-1.4e-05,1.5e-05,1.7e-05,-3e-05,-1.4e-05,-4e-06,1e-05,-1e-05,7e-06,-2.1e-05,5.9e-05,2.7e-05,-1e-05
-1e-06,-2e-05,2.1e-05,4e-06,1.3e-05,-9e-06,-2e-05,-7e-06,1.6e-05,1e-05,8e-06,5e-06,1.2e-05,0,1.4e-05,5e-06,-2.9e-05,-7e-06,0,2.9e-05,2.3e-05,-6e-06,-1.5e-05,1e-05,-4e-06,1e-06,-2.1e-05,-2e-06,-6e-06,-1.7e-05,-3.7e-05,-1e-06,-1.1e-05,-2.1e-05,9e-06,-1.2e-05,3.9e-05,-9e-06,-5e-06,1.2e-05,-5e-06,-2e-06,-1.6e-05,1.5e-05,-1.3e-05,3.3e-05,-9e-06,1.3e-05,3e-06,-4e-06,-3.4e-05,-2.1e-05,-1.4e-05,9e-06,2.4e-05,-3e-06,0,-1.1e-05,-5e-06,1e-06,9e-06,1e-05,-5e-06,-1.8e-05,3.2e-05,1.1e-05,6e-06,-6e-06,2.5e-05,-5e-06,-6e-06,-1.3e-05,2e-06,1.7e-05,6e-06,3e-06,-1e-05,4e-06,-4e-06,-7e-06,-2.5e-05,-3.9e-05,-2.4e-05,9e-06,0,4e-06,-5e-06,-1e-06,-3e-06,-3.1e-05,-1.2e-05,9e-06,-1.3e-05,1.7e-05,-6e-06,2.4e-05,-2.8e-05,-3e-06,-7e-06,3.6e-05,-2e-06,-2e-06,-6e-06,-3.1e-05,-3.8e-05,-1.8e-05,3.7e-05,-2.1e-05,7e-06,-1.3e-05,-3.1e-05,-4e-06,2.3e-05,8e-06,-8e-06,3.1e-05,5e-06,9e-06,-7e-06,-3e-05,-1.5e-05
-1e-06,1e-06,-1.5e-05,1e-06,-4e-06,0,1.9e-05,1e-06,-2.1e-05,-7e-06,-9e-06,-3e-06,-1e-06,4e-06,-6e-06,-2e-06,-2.4e-05,3e-06,3e-06,-6e-06,-1.3e-05,1.2e-05,5e-06,1e-05,5e-06,1e-06,-5e-06,1.5e-05,1e-06,8e-06,-3e-06,-4e-06,1e-06,8e-06,3e-06,-7e-06,-2.3e-05,5e-06,-5e-06,-6e-06,-1.5e-05,-9e-06,-1.9e-05,-3e-06,0,1.7e-05,-4e-06,6e-06,-1.2e-05,1e-06,-1.4e-05,2.8e-05,-5e-06,-1.4e-05,3.7e-05,9e-06,4e-06,-7e-06,-7e-06,-1.1e-05,-2.1e-05,-1.6e-05,0,1.5e-05,-1.9e-05,0,-1e-05,0,-5e-06,1.2e-05,8e-06,1.6e-05,-1e-06,-1.8e-05,-3.1e-05,6e-06,4e-06,-2.2e-05,5e-06,2e-06,2.2e-05,3.3e-05,1.8e-05,1.7e-05,-2e-06,1.6e-05,9e-06,-1e-06,-7e-06,1.4e-05,-2.2e-05,-1.5e-05,-1.6e-05,2e-06,1e-05,-4.6e-05,2.6e-05,9e-06,6e-06,-1.8e-05,6e-06,1.9e-05,6e-06,-2.5e-05,5.6e-05,1.3e-05,9e-06,1.9e-05,2.6e-05,1.9e-05,2e-05,2e-05,-2.5e-05,-4e-06,-1.7e-05,1.3e-05,-8e-06,-4e-06,-6e-06,-7e-06,6e-06
-2.4e-05,3e-06,2.5e-05,-2e-06,3e-05,-1e-06,-1.2e-05,3e-06,-1.3e-05,-2e-06,7e-06,-1e-06,-9e-06,3e-06,1e-06,2.4e-05,-5e-06,1e-06,-1e-06,0,5e-06,3e-06,1.5e-05,2.6e-05,-8e-06,3e-06,0,-1.7e-05,1.9e-05,-3e-06,2.2e-05,2e-06,8e-06,1e-06,-1.3e-05,-1.3e-05,1.2e-05,1.2e-05,1.5e-05,0,5e-06,9e-06,2.8e-05,-1e-06,1.2e-05,1.9e-05,2.3e-05,-6e-06,-1e-06,4e-06,-1.3e-05,-3e-06,1.9e-05,1.5e-05,-3.2e-05,1.7e-05,-5e-06,-1.4e-05,2e-06,8e-06,7e-06,6e-06,9e-06,0,6e-06,-3e-06,-3e-06,-2e-06,2.4e-05,-9e-06,-9e-06,1e-06,2e-06,1.6e-05,1.4e-05,6e-06,-1e-06,-6e-06,3e-06,3e-06,1e-06,-9e-06,-1.6e-05,-1e-06,-3e-06,-1.5e-05,4e-06,2e-06,-1.1e-05,3e-06,3.7e-05,2.2e-05,1.2e-05,8e-06,5e-06,2.8e-05,-2.1e-05,-6e-06,5e-06,2.6e-05,-4e-06,-7e-06,3e-06,2.9e-05,-2e-05,1.5e-05,-2.4e-05,-1.9e-05,-3.2e-05,3e-06,-4e-06,8e-06,1.2e-05,-7e-06,5e-06,-3e-06,-2.5e-05,3e-06,-1.5e-05,2e-05,1e-06
1.7e-05,5e-06,-3.1e-05,0,-1.6e-05,-3e-06,7e-06,-2e-06,7e-06,-4e-06,2e-06,1e-06,1.9e-05,3.1e-05,-1e-06,9e-06,1.4e-05,2e-06,-3e-06,2e-06,7e-06,-5e-06,-2.4e-05,-2.1e-05,-1e-06,0,3e-05,1.4e-05,-1.4e-05,5e-06,-6.1e-05,1e-06,-7e-06,-6e-06,8e-06,-6e-06,-1e-05,-6e-06,-1.5e-05,1e-06,5e-06,3e-06,-7e-06,-9e-06,-9e-06,-1e-06,-1.8e-05,-4e-06,-3e-06,3e-06,-2e-06,-3e-06,-1.7e-05,-5e-06,-3e-05,-1.9e-05,5e-06,3e-06,-4e-06,-8e-06,-2e-06,-1e-06,8e-06,-1.3e-05,-1e-05,-5e-06,7e-06,1e-06,-3.2e-05,8e-06,9e-06,-9e-06,-4e-06,-1.1e-05,-5e-06,6e-06,-2e-06,1e-05,-4e-06,-5e-06,-1.7e-05,1e-06,3.1e-05,-1.5e-05,5e-06,1e-06,0,1e-06,6e-06,-1e-06,-3.4e-05,-1.1e-05,2e-06,-4e-06,-1e-06,-6e-06,1.8e-05,2e-06,-1.2e-05,-1.9e-05,7e-06,-1.1e-05,-2e-06,0,1.3e-05,-1.8e-05,-1.3e-05,1.9e-05,7e-06,1e-06,-3.9e-05,3e-06,-4e-06,5e-06,7e-06,-3e-06,-9e-06,-5e-06,-8e-06,-6e-06,1e-05
6e-06,-6e-06,2.1e-05,1e-06,8e-06,4e-06,-6e-06,-2e-06,1.2e-05,0,-1.9e-05,-3e-06,1.7e-05,-1.8e-05,-1e-06,-1e-06,1.6e-05,8e-06,-2e-06,-1.6e-05,4e-06,4e-06,1.6e-05,-2.1e-05,0,-4e-06,-8e-06,-6e-06,-6e-06,-4e-06,2.1e-05,-4e-06,8e-06,8e-06,-1.4e-05,-6e-06,-4e-06,-2.2e-05,1.3e-05,2e-06,4e-06,1e-06,-1.6e-05,7e-06,6e-06,-1.4e-05,4e-06,1.9e-05,2e-06,4e-06,-8e-06,2e-06,4e-06,4e-06,2.6e-05,-1.8e-05,-4e-06,-3e-06,-6e-06,-8e-06,-1.4e-05,3e-06,2e-06,1.1e-05,1.4e-05,9e-06,-7e-06,-1e-06,-2.3e-05,-1.6e-05,-2e-06,8e-06,3e-06,1.4e-05,4e-06,9e-06,-2e-06,3e-05,-2.2e-05,2e-06,1.3e-05,-2e-06,-1e-06,-5e-06,0,5e-06,-6e-06,-4e-06,-6e-06,-1.2e-05,3.2e-05,-5e-06,-1.2e-05,-3e-06,-7e-06,3e-06,-1.5e-05,7e-06,6e-06,1.3e-05,-6e-06,-1.1e-05,-9e-06,-2e-05,1.8e-05,-5e-06,1.7e-05,-1.2e-05,1.1e-05,8e-06,2.9e-05,-1.2e-05,6e-06,-4e-06,3e-06,-2.2e-05,0,1e-06,-7e-06,1e-05,-1.6e-05
0,-5e-06,-8e-06,0,-6e-06,-5e-06,3e-06,-1e-06,4e-06,1.1e-05,1.5e-05,5e-06,-1.6e-05,-1e-06,6e-06,-2e-06,5e-06,-3e-06,2e-06,2e-06,-1.2e-05,-5e-06,-1e-05,2e-06,1.1e-05,9e-06,6e-06,-5e-06,-1.3e-05,4e-06,2e-05,3e-06,-8e-06,2.5e-05,2e-05,1e-06,5e-06,-7e-06,-4e-06,-2e-06,-1e-06,0,2e-05,-3e-06,-8e-06,-2e-05,-7e-06,-1.4e-05,6e-06,-3e-06,1e-05,-1.2e-05,6e-06,-8e-06,6e-06,4e-06,3e-06,1e-05,3e-06,-4e-06,1e-05,-5e-06,-2e-06,4e-06,-9e-06,-7e-06,0,3e-06,4.9e-05,7e-06,-4e-06,-1e-06,-1e-06,-5e-06,0,1e-06,6e-06,2e-06,6e-06,3e-06,3e-06,-1.5e-05,-7e-06,-7e-06,-1e-06,0,0,2e-06,-5e-06,4e-06,-2.1e-05,1.1e-05,2e-06,-9e-06,-1e-06,-3e-06,9e-06,-1.3e-05,4e-06,-1.8e-05,3e-06,1.4e-05,1e-05,1.9e-05,-3.8e-05,1.7e-05,8e-06,1.1e-05,-1.3e-05,-1e-06,-3e-06,-1.2e-05,-5e-06,0,-6e-06,3e-06,0,-4e-06,3e-06,-3e-06,2e-06
-1.6e-05,6e-06,1.2e-05,-1e-06,-9e-06,5e-06,3e-06,2e-06,-1.3e-05,-1.1e-05,-7e-06,-3e-06,-1.5e-05,-1.2e-05,-4e-06,3e-06,-7e-06,6e-06,3e-06,2.3e-05,5e-06,4e-06,7e-06,-4e-06,-3e-06,-1.1e-05,-1.8e-05,1.1e-05,1.5e-05,-4e-06,1e-06,1e-06,9e-06,1.3e-05,-1.1e-05,6e-06,-1e-06,8e-06,4e-06,0,-6e-06,0,-3e-06,6e-06,1.4e-05,-1.8e-05,5e-06,0,3e-06,-1e-06,1.9e-05,1.1e-05,0,0,-1.9e-05,-5e-06,-2e-06,-1e-06,0,1.4e-05,-1e-05,3e-06,-1e-06,-1.2e-05,3e-06,2e-06,4e-06,-2e-06,1.6e-05,-1.2e-05,4e-06,-6e-06,-1e-06,3e-06,7e-06,0,-8e-06,-1.6e-05,6e-06,-8e-06,-1.2e-05,2.7e-05,-1.1e-05,5e-06,0,-4e-06,1e-06,0,1.6e-05,1.4e-05,0,-7e-06,1.2e-05,3e-06,-2e-06,2e-06,-5e-06,-1e-06,-3e-06,1e-05,-2e-06,5e-06,-1e-06,-5e-06,3.6e-05,-6e-06,-2.2e-05,-8e-06,3e-06,0,-1.4e-05,9e-06,7e-06,2e-06,0,2.8e-05,1.6e-05,2e-06,2.6e-05,-9e-06,9e-06
5e-06,-2e-06,-1.8e-05,3e-06,1.6e-05,2e-06,-4e-06,-1e-06,-2e-06,1e-06,2e-06,2e-06,3e-06,7e-06,5e-06,-5e-06,-1.2e-05,-2e-06,-5e-06,-1.2e-05,1e-06,-2e-06,-1e-06,9e-06,4e-06,5e-06,-2e-06,-1e-05,-1e-06,-2e-06,2.2e-05,-3e-06,-6e-06,-1.9e-05,9e-06,4e-06,9e-06,3e-06,1e-06,1e-06,-1e-06,7e-06,-1.5e-05,-6e-06,-1.5e-05,-1e-06,4e-06,6e-06,-2e-06,1e-06,2.4e-05,-7e-06,-9e-06,2e-06,5e-06,-3e-06,3e-06,7e-06,-4e-06,1.8e-05,-3e-06,-2e-06,-3e-06,1.1e-05,-2e-06,0,1e-06,1e-06,-2.2e-05,1e-05,-3e-06,-1e-06,1e-06,-8e-06,-8e-06,3e-06,1e-06,1e-06,8e-06,1.1e-05,1.2e-05,-1.8e-05,6e-06,1e-05,-1e-06,5e-06,3e-06,0,5e-06,-1.9e-05,1.4e-05,1e-06,4e-06,4e-06,-4e-06,-6e-06,5e-06,6e-06,0,-1.8e-05,0,-3e-06,-4e-06,-7e-06,-3.6e-05,-1.1e-05,7e-06,5e-06,1.1e-05,-1e-06,2.9e-05,1e-06,-8e-06,-3e-06,2e-06,-3e-06,8e-06,6e-06,7e-06,4e-06,-8e-06
9e-06,0,7e-06,-2e-06,-8e-06,-3e-06,4e-06,-1e-06,1e-05,2e-06,7e-06,-2e-06,6e-06,0,-5e-06,-6e-06,0,-1e-06,2e-06,-1.5e-05,-9e-06,-4e-06,-6e-06,2e-05,-1e-06,-5e-06,3e-06,7e-06,-5e-06,3e-06,-3.4e-05,1e-06,3e-06,-2.8e-05,-9e-06,8e-06,-9e-06,-1e-06,1e-06,-2e-06,4e-06,0,1.5e-05,0,1.1e-05,2e-06,2e-06,1e-06,-2e-06,0,9e-06,1e-06,1.4e-05,0,2.4e-05,1e-05,-3e-06,-5e-06,-1e-06,-5e-06,3e-06,1e-06,-4e-06,0,6e-06,2e-06,-2e-06,1e-06,8e-06,-3e-06,1e-06,9e-06,-1e-06,0,0,-2e-06,2e-06,8e-06,-7e-06,-1.1e-05,-9e-06,1e-05,-8e-06,3e-06,-1e-06,-9e-06,-2e-06,2e-06,-5e-06,1.5e-05,4e-06,-1e-06,-1.3e-05,5e-06,1e-05,8e-06,-4e-06,-3e-06,-1e-06,1e-05,0,-3e-06,3e-06,2.8e-05,1.8e-05,1.1e-05,9e-06,-9e-06,-1.8e-05,-1e-06,-9e-06,5e-06,5e-06,3e-06,-1e-06,-1e-05,2e-06,-7e-06,-1.8e-05,-7e-06,-5e-06
-2e-06,-3e-06,2e-06,0,1.2e-05,4e-06,-4e-06,0,0,-3e-06,-9e-06,-2e-06,-1e-06,1.1e-05,4e-06,-9e-06,1.1e-05,0,0,1.1e-05,1.1e-05,0,9e-06,-1e-06,5e-06,3e-06,7e-06,-5e-06,-1.2e-05,-3e-06,3e-06,1e-06,-1e-06,-6e-06,3e-06,4e-06,1.2e-05,5e-06,-1e-06,2e-06,0,-6e-06,0,1e-06,-5e-06,1.6e-05,-7e-06,-7e-06,-4e-06,-1e-06,3e-06,1.1e-05,-1.1e-05,1e-06,-3e-06,9e-06,1e-06,-1e-06,0,-1.6e-05,-8e-06,-2e-06,-2e-06,-6e-06,-3e-06,-3e-06,1e-06,-2e-06,-6e-06,6e-06,2e-06,-7e-06,1e-06,-1e-06,2e-06,-3e-06,-6e-06,1.7e-05,2e-06,7e-06,5e-06,-9e-06,1.6e-05,0,2e-06,1.2e-05,-1e-06,-2e-06,3e-06,-4e-06,-2e-06,6e-06,-5e-06,2e-06,2e-06,-2e-06,2e-06,-1e-06,3e-06,-1.2e-05,3e-06,5e-06,1e-06,-5e-06,-5e-06,4e-06,2e-06,1.2e-05,1.1e-05,-5e-06,-6e-06,8e-06,-2e-06,2e-06,-2e-06,-5e-06,0,0,-1e-05,6e-06,5e-06
-5e-06,5e-06,4e-06,0,-4e-06,-1e-06,3e-06,0,-7e-06,3e-06,3e-06,0,-9e-06,-1e-05,-5e-06,-7e-06,1.1e-05,-5e-06,3e-06,8e-06,-2e-06,-1e-06,-6e-06,-7e-06,-3e-06,-3e-06,3e-06,2e-06,6e-06,6e-06,1.2e-05,-1e-06,0,1.5e-05,1e-06,3e-06,-1.3e-05,1.1e-05,0,-1e-06,-2e-06,4e-06,-1.3e-05,2e-06,2e-06,1.1e-05,5e-06,6e-06,0,1e-06,-3e-06,-1.1e-05,3e-06,-3e-06,-2.2e-05,2e-06,-1e-06,-9e-06,-1e-06,-1.5e-05,1e-06,-1e-06,0,9e-06,-3e-06,0,3e-06,2e-06,1.6e-05,-5e-06,-5e-06,1e-06,-1e-06,0,-2e-06,-2e-06,6e-06,-1e-06,0,-3e-06,0,-2e-06,-4e-06,-4e-06,0,-5e-06,-1e-06,-1e-06,-5e-06,5e-06,1.3e-05,-8e-06,6e-06,-1e-06,-5e-06,-3e-06,-3e-06,6e-06,-1e-06,9e-06,-1e-06,-2e-06,-4e-06,-6e-06,-1.4e-05,-1.1e-05,-2.2e-05,-1.1e-05,-3e-06,0,1e-05,-1.6e-05,3e-06,-2e-06,2e-06,-7e-06,-6e-06,0,-5e-06,1e-05,-5e-06
-6e-06,-1e-06,-9e-06,0,-8e-06,1e-06,0,0,-3e-06,-3e-06,1e-06,0,1e-06,2e-06,4e-06,-2e-06,1e-06,2e-06,-4e-06,-9e-06,4e-06,0,3e-06,-4e-06,-1e-06,2e-06,-2e-06,1e-06,2e-06,-5e-06,-3.4e-05,0,1e-06,1e-05,-1e-06,-1e-06,1.2e-05,1e-06,-3e-06,1e-06,3e-06,5e-06,1.2e-05,1e-06,-4e-06,1.1e-05,-3e-06,-1e-06,3e-06,-1e-06,-3e-06,4e-06,1e-06,1e-06,9e-06,6e-06,-1e-06,2e-06,-1e-06,1.2e-05,-1e-06,0,0,-2e-06,5e-06,3e-06,-5e-06,-1e-06,1.1e-05,0,5e-06,3e-06,0,4e-06,2e-06,-4e-06,-3e-06,-6e-06,-1e-06,2e-06,-7e-06,1.8e-05,-5e-06,-6e-06,0,-3e-06,1e-06,0,-5e-06,-1.6e-05,-2.5e-05,4e-06,4e-06,-4e-06,3e-06,2e-06,3e-06,-4e-06,-2e-06,-1e-05,0,-7e-06,4e-06,1.4e-05,2.2e-05,1e-06,8e-06,9e-06,0,-6e-06,-1.4e-05,-8e-06,-3e-06,1e-06,3e-06,1.1e-05,-1.2e-05,3e-06,4e-06,-1e-05,3e-06
9e-06,-1e-06,-1e-06,0,2e-06,0,-1e-06,-1e-06,6e-06,2e-06,-4e-06,1e-06,1.2e-05,-1e-06,-3e-06,-9e-06,-8e-06,-1e-06,0,1e-06,-4e-06,0,-4e-06,-1.1e-05,0,-1e-06,-4e-06,-5e-06,-1e-06,6e-06,2e-05,1e-06,-1e-06,-3e-06,4e-06,-1e-06,-6e-06,-6e-06,2e-06,-1e-06,0,-2e-06,2e-06,0,5e-06,3e-06,7e-06,-3e-06,3e-06,1e-06,-1.2e-05,-1e-06,1e-06,1e-06,1.9e-05,-2e-06,0,-6e-06,1e-06,1.3e-05,-6e-06,0,1e-06,-7e-06,-2e-06,-3e-06,1e-06,0,-1.3e-05,-3e-06,-3e-06,-2e-06,0,-1e-06,-1e-06,-2e-06,-1e-06,-1.3e-05,-1e-06,0,7e-06,-1.9e-05,1e-06,0,0,5e-06,1e-06,-1e-06,2e-06,1.4e-05,1.1e-05,0,-3e-06,-3e-06,-5e-06,1e-06,-5e-06,-3e-06,2e-06,1.2e-05,1e-06,2e-06,0,-2e-06,-3.1e-05,8e-06,1.7e-05,-1.1e-05,1e-06,-3e-06,-3e-06,1.2e-05,2e-06,0,-2e-06,1.1e-05,0,-3e-06,7e-06,5e-06,-1e-06
-1e-06,1e-06,1.1e-05,-2e-06,-1.2e-05,-2e-06,-1e-06,0,7e-06,-1e-06,4e-06,1e-06,1e-06,-2e-06,5e-06,-3e-06,-1.3e-05,0,0,-1e-06,3e-06,-1e-06,5e-06,-3e-06,-1e-06,1e-06,-5e-06,1e-05,-8e-06,-6e-06,2e-05,-1e-06,1e-06,-3e-06,-6e-06,-4e-06,1e-06,-5e-06,-2e-06,2e-06,-3e-06,-2e-06,-1.4e-05,-3e-06,0,-8e-06,-6e-06,0,2e-06,0,-1.5e-05,-5e-06,-7e-06,0,-1.1e-05,-1e-05,-1e-06,6e-06,1e-06,1e-05,2e-06,0,2e-06,8e-06,1e-06,0,2e-06,0,1.1e-05,-1e-06,0,-4e-06,1e-06,4e-06,2e-06,-3e-06,4e-06,8e-06,0,2e-06,0,1.6e-05,-5e-06,1e-06,-1e-06,3e-06,0,2e-06,-4e-06,-2e-06,-4e-06,0,-3e-06,0,-5e-06,-5e-06,6e-06,5e-06,0,-7e-06,-2e-06,7e-06,-4e-06,-4e-06,2.9e-05,-5e-06,-1.2e-05,9e-06,-2e-06,1e-06,1e-05,1e-06,0,-3e-06,-4e-06,-5e-06,-2e-06,1e-06,8e-06,-3e-06,-2e-06
-2e-06,1e-06,-4e-06,1e-06,8e-06,1e-06,0,0,-7e-06,-1e-06,2e-06,-2e-06,-2e-06,8e-06,-5e-06,-1e-06,-5e-06,0,2e-06,1e-06,-2e-06,1e-06,-2e-06,8e-06,-1e-06,-1e-06,6e-06,-9e-06,0,2e-06,-1.4e-05,-1e-06,-1e-06,6e-06,4e-06,-3e-06,-1e-06,-1e-06,2e-06,-1e-06,0,0,1e-05,2e-06,-5e-06,-1.2e-05,2e-06,3e-06,-1e-06,0,-1.2e-05,7e-06,7e-06,0,-1.1e-05,-2e-06,1e-06,-4e-06,0,-1.3e-05,-4e-06,0,2e-06,-2e-06,-5e-06,-1e-06,-1e-06,0,0,2e-06,2e-06,4e-06,0,-5e-06,-5e-06,-2e-06,-6e-06,1e-05,3e-06,-3e-06,-8e-06,-1.5e-05,4e-06,2e-06,0,-7e-06,-1e-06,0,3e-06,-7e-06,-5e-06,-2e-06,3e-06,2e-06,5e-06,4e-06,-8e-06,-2e-06,-1e-06,9e-06,3e-06,2e-06,3e-06,7e-06,-2.1e-05,-4e-06,-1.2e-05,-1.1e-05,1e-06,-5e-06,-7e-06,1e-06,-2e-06,0,1e-06,-1e-05,3e-06,-1e-06,8e-06,-7e-06,0
-6e-06,-1e-06,-3e-06,0,-1e-06,-2e-06,0,0,-8e-06,2e-06,-6e-06,-1e-06,-5e-06,-4e-06,5e-06,2e-06,5e-06,-3e-06,-2e-06,4e-06,-2e-06,1e-06,0,6e-06,-3e-06,1e-06,-2e-06,5e-06,1e-06,-3e-06,1.1e-05,2e-06,1e-06,1e-06,-2e-06,-3e-06,-3e-06,-3e-06,-2e-06,1e-06,1e-06,1e-06,5e-06,-2e-06,6e-06,-1.3e-05,-4e-06,-3e-06,-2e-06,-1e-06,-7e-06,-4e-06,-4e-06,-1e-06,1.5e-05,-2e-06,-1e-06,9e-06,0,-6e-06,-2e-06,1e-06,1e-06,-6e-06,8e-06,2e-06,0,0,-2.9e-05,-1e-06,-3e-06,1e-06,0,3e-06,4e-06,1e-06,4e-06,-2e-06,-2e-06,3e-06,9e-06,9e-06,1e-06,3e-06,0,2e-06,0,-1e-06,9e-06,7e-06,1e-05,1e-06,1e-06,3e-06,2e-06,5e-06,9e-06,-3e-06,1e-06,-6e-06,-2e-06,-7e-06,1e-06,-5e-06,1.1e-05,6e-06,1.3e-05,8e-06,1e-06,3e-06,6e-06,3e-06,3e-06,0,3e-06,-3e-06,1.1e-05,0,-1.4e-05,7e-06,-3e-06
4e-06,0,-6e-06,0,4e-06,1e-06,2e-06,-1e-06,6e-06,0,5e-06,1e-06,2e-06,3e-06,-8e-06,3e-06,1e-05,0,1e-06,3e-06,2e-06,0,1e-06,0,2e-06,-2e-06,8e-06,1e-06,0,0,-2.6e-05,-1e-06,-1e-06,-1.3e-05,2e-06,-1e-06,6e-06,-3e-06,2e-06,-1e-06,1e-06,0,-1.4e-05,2e-06,-5e-06,-4e-06,4e-06,0,-2e-06,0,3e-06,6e-06,1e-06,1e-06,6e-06,-7e-06,1e-06,-7e-06,2e-06,-5e-06,-1e-06,-2e-06,-1e-06,8e-06,-6e-06,-1e-06,1e-06,0,2e-05,4e-06,2e-06,-4e-06,0,-6e-06,-2e-06,0,-1e-06,-8e-06,1e-06,-2e-06,-6e-06,2e-06,2e-06,-1e-06,0,6e-06,0,0,-3e-06,-1e-06,-1e-05,2e-06,-3e-06,2e-06,1e-06,-1.1e-05,-1e-05,6e-06,-1e-06,7e-06,1e-06,-1e-06,-4e-06,-4e-06,5e-06,0,1e-05,-7e-06,1e-06,1e-06,6e-06,-1e-05,-3e-06,-1e-06,0,8e-06,0,2e-06,-1.4e-05,0,4e-06
2e-06,0,1.4e-05,-1e-06,5e-06,1e-06,-3e-06,0,7e-06,-1e-06,-3e-06,1e-06,4e-06,-9e-06,7e-06,2e-06,4e-06,-1e-06,1e-06,-1.1e-05,-2e-06,1e-06,-2e-06,1e-06,-1e-06,2e-06,-5e-06,-5e-06,-3e-06,1e-06,1.1e-05,0,1e-06,-1.2e-05,1e-06,1e-06,-6e-06,2e-06,0,1e-06,1e-06,-2e-06,8e-06,-1e-06,6e-06,3e-06,-2e-06,1e-06,-1e-06,-1e-06,7e-06,1e-06,-1e-06,0,-1.7e-05,5e-06,-2e-06,6e-06,0,1e-05,-3e-06,2e-06,0,-4e-06,5e-06,-1e-06,0,0,1e-05,-4e-06,-1e-06,4e-06,-1e-06,6e-06,2e-06,1e-06,-2e-06,-1.3e-05,-1e-06,-1e-06,2e-06,-1.1e-05,-5e-06,-1e-06,0,-5e-06,1e-06,0,1e-06,3e-06,-2e-06,-4e-06,-2e-06,0,2e-06,6e-06,1.1e-05,-2e-06,1e-06,-8e-06,-2e-06,3e-06,2e-06,3e-06,-1.6e-05,-4e-06,-2.1e-05,4e-06,-2e-06,2e-06,-4e-06,-5e-06,3e-06,1e-06,-2e-06,6e-06,1e-06,-3e-06,2e-06,2e-06,-2e-06
1e-06,-2e-06,-6e-06,0,-8e-06,-1e-06,4e-06,0,-2e-06,-1e-06,-1e-06,0,-3e-06,7e-06,-6e-06,5e-06,-3e-06,1e-06,1e-06,1e-06,5e-06,-1e-06,5e-06,-3e-06,3e-06,-1e-06,3e-06,6e-06,-2e-06,0,1.7e-05,1e-06,-2e-06,7e-06,-3e-06,2e-06,8e-06,4e-06,0,-1e-06,0,-1e-06,6e-06,1e-06,-8e-06,9e-06,3e-06,0,1e-06,1e-06,1.1e-05,-7e-06,5e-06,0,-3e-06,7e-06,2e-06,-1e-05,0,-3e-06,-2e-06,-1e-06,-1e-06,-3e-06,-7e-06,1e-06,-2e-06,0,-1.4e-05,3e-06,-1e-06,0,0,-5e-06,-1e-06,3e-06,4e-06,5e-06,1e-06,3e-06,3e-06,1.5e-05,7e-06,0,0,-3e-06,0,-1e-06,1e-06,-1.3e-05,1.3e-05,3e-06,1e-06,-2e-06,-2e-06,0,-1.1e-05,-3e-06,0,7e-06,2e-06,2e-06,2e-06,-3e-06,2.8e-05,0,0,-7e-06,2e-06,5e-06,-1e-06,5e-06,-4e-06,1e-06,0,-3e-06,-2e-06,1e-06,8e-06,1e-06,-1e-06
