-0.017428,-0.027105,-0.047867,-0.144992,-0.216221,-0.196935,-0.185758,-0.208224,-0.199915,-0.153027,-0.126921,-0.06157,-0.021233,-0.006517,-0.004104,-0.000791,-0.000674,-0.00304,-0.002052,-0.000558,-0.000234,-0.000159,-0.000174,-3.3e-05,-1.9e-05,-9e-06,-4e-06,0
-0.014763,-0.014769,0.0099,0.055066,0.071692,0.111739,0.138791,0.087736,0.024941,0.107768,0.09674,0.051544,0.016294,0.005412,0.004409,0.000767,-0.000122,-0.002795,-0.002046,-0.00034,-6e-06,0.000244,0.000241,-5e-05,-4.9e-05,-1.7e-05,-2e-06,-2e-06
8e-04,0.005635,0.015331,0.024271,0.025413,0.002393,0.015458,0.035897,0.01985,0.005617,0.000852,0.002053,0.00095,-0.000715,-0.00075,-0.000228,-0.000384,0.000391,0.000475,0.000268,3e-05,-0.000197,-0.000228,-7.7e-05,-4.8e-05,-1.9e-05,-2e-06,-4e-06
0.013059,0.016485,-0.012606,-0.091478,-0.127398,-0.147337,-0.159497,-0.121936,-0.034897,-0.120349,-0.112082,-0.057338,-0.01891,-0.005602,-0.004132,-0.000764,0.000395,0.002794,0.002068,0.000422,8.5e-05,-8.9e-05,-8.6e-05,-1.4e-05,-9e-06,-6e-06,0,-1e-06
0.011003,0.0087,-1e-06,0.067112,0.121626,0.136885,0.125802,0.105657,0.114344,0.11506,0.103201,0.050733,0.017279,0.005703,0.004106,0.000897,0.000927,0.001545,0.000892,-1.8e-05,9.9e-05,0.000281,0.000304,7.8e-05,4.5e-05,1.9e-05,6e-06,7e-06
-0.00752,-0.012462,-0.003627,0.067624,0.119533,0.098656,0.099127,0.087633,0.003358,0.068761,0.071164,0.030871,0.010825,0.002088,0.000869,0.000177,-0.000286,-0.001755,-0.001277,-0.000368,-0.000173,-0.000129,-0.000114,6.1e-05,5.5e-05,2.2e-05,2e-06,7e-06
-0.014104,-0.010819,-0.011447,-0.126638,-0.186707,-0.178818,-0.177718,-0.174109,-0.161573,-0.151209,-0.13237,-0.06836,-0.023106,-0.007135,-0.00477,-0.000958,-0.000552,-0.002126,-0.0015,-6.8e-05,-2e-05,-3e-06,6e-06,2.7e-05,1.8e-05,5e-06,-3e-06,1e-06
0.000631,0.004452,0.01121,-0.030782,-0.071233,-0.016702,-0.003307,-0.015044,0.021963,0.002622,-0.004763,0.005827,0.000226,0.001397,0.001941,0.000383,2.4e-05,0.000198,0.000139,0.000231,0.000146,0.000141,0.000149,-1.9e-05,-2.5e-05,-6e-06,4e-06,1e-06
0.010382,0.005769,0.010923,0.119239,0.151601,0.113564,0.131133,0.15335,0.104622,0.103126,0.090059,0.048919,0.015727,0.003918,0.001855,0.000392,0.000131,0.001742,0.001267,7.1e-05,-3.3e-05,-0.000175,-0.000212,-8e-05,-4.9e-05,-1.4e-05,5e-06,1e-06
0.004742,0.002772,-0.013167,-0.01625,-0.002423,-0.054588,-0.077679,-0.06869,-0.043975,-0.058872,-0.057274,-0.033815,-0.009703,-0.003473,-0.00295,-0.000619,0.000166,0.001221,0.000779,-0.00013,-7.8e-05,-2.3e-05,-3.2e-05,-5.1e-05,-4.1e-05,-1.5e-05,-1e-06,-1e-06
-0.003673,-0.000376,-0.00595,-0.065278,-0.052248,-0.000938,-0.037103,-0.079132,-0.022827,-0.02043,-0.016414,-0.009651,-0.002883,0.000183,0.001012,3.6e-05,-0.000301,-0.000804,-0.000501,-5.2e-05,2.6e-05,0.000106,0.000108,1.6e-05,4e-06,2e-06,1e-06,2e-06
-0.006294,-0.005033,0.014403,0.056018,0.087015,0.093445,0.103447,0.106786,0.027926,0.076526,0.084195,0.039446,0.012017,0.00305,0.001785,0.000275,-0.000609,-0.001899,-0.001132,7e-05,-2e-06,-8.5e-05,-7.8e-05,5.3e-05,4.9e-05,2.3e-05,1.1e-05,8e-06
-0.003142,-0.002895,-0.000972,0.000261,-0.015629,-0.0638,-0.054278,-0.032232,-0.07014,-0.048977,-0.042234,-0.025941,-0.007964,-0.003176,-0.002559,-0.000513,-0.000162,-0.00068,-0.000504,4e-06,3.9e-05,9e-05,0.00012,7.2e-05,5e-05,2.3e-05,1.2e-05,9e-06
0.004304,0.001451,-0.016043,-0.07055,-0.122624,-0.081595,-0.088488,-0.118139,-0.027817,-0.064595,-0.071444,-0.025621,-0.008092,-0.001303,0.000119,-6.6e-05,-2e-06,0.000912,0.000611,-7.7e-05,1.5e-05,7.5e-05,8.7e-05,2.5e-05,1.1e-05,4e-06,3e-06,5e-06
0.004326,0.00342,0.007739,0.048381,0.036171,0.059938,0.100049,0.115982,0.115034,0.075495,0.064525,0.041131,0.011907,0.003419,0.001934,0.000463,0.000236,0.001311,0.000951,1.4e-05,-5.5e-05,-0.000128,-0.00015,-5e-05,-3.1e-05,-1.3e-05,-4e-06,0
8.4e-05,0.002389,0.011577,0.051891,0.083305,0.021386,0.041428,0.087437,0.038322,0.029719,0.028266,0.004324,0.002353,-0.000204,-0.001123,-0.000246,0.000221,0.000307,0.000196,0.000157,4.4e-05,1.1e-05,3e-06,-6.1e-05,-5.1e-05,-2.3e-05,-8e-06,-6e-06
-0.002019,-0.002301,-0.013151,-0.073216,-0.050658,-0.039117,-0.092674,-0.131574,-0.083758,-0.062632,-0.059578,-0.034279,-0.008562,-0.001692,-0.000119,-0.000257,-0.000531,-0.001325,-0.000791,-6e-06,4e-06,5e-06,-1.3e-05,-4.2e-05,-3.8e-05,-2e-05,-8e-06,-9e-06
-0.001726,-0.003053,-0.001862,-0.01217,-0.019787,0.022818,0.016553,-0.013741,-0.026245,0.015832,0.025616,0.015755,0.003409,0.001169,0.000926,0.000291,-0.000261,-0.001238,-0.000796,-0.000162,-7.9e-05,-8.1e-05,-8.4e-05,2e-06,5e-06,0,-1e-06,-4e-06
-0.001467,-0.001025,0.012083,0.070765,0.052446,0.008899,0.052349,0.096829,0.032102,0.03423,0.04137,0.01291,0.001891,0.000524,-0.000529,-0.000122,5.8e-05,0.000182,8.5e-05,-4.4e-05,2.7e-05,9.4e-05,0.000131,6.1e-05,3.9e-05,1.6e-05,4e-06,2e-06
