0.019402,0.017786,0.017002,0.016835,0.016573,0.015154,0.015848,0.016931,0.016028,0.015021,0.014677,0.01482,0.016103,0.019591,0.0202,0.017267,0.015891,0.016047,0.015752,0.016229,0.016451,0.012553,0.009867,0.011473,0.012246,0.011146,0.010422,0.010223
0.02636,0.024129,0.022944,0.023154,0.022609,0.019922,0.021036,0.023076,0.021529,0.02006,0.019913,0.020356,0.022242,0.026562,0.026724,0.021976,0.020023,0.020667,0.020529,0.02108,0.021216,0.016124,0.012933,0.015397,0.016201,0.014329,0.013328,0.013514
0.040769,0.037452,0.035447,0.036439,0.035996,0.030587,0.031437,0.035026,0.032128,0.029539,0.029946,0.031338,0.034663,0.040676,0.040025,0.031313,0.028029,0.029832,0.029802,0.030462,0.030662,0.023229,0.019032,0.023234,0.024162,0.020894,0.019347,0.020083
0.061291,0.056249,0.052561,0.054096,0.05606,0.046997,0.043747,0.047184,0.042691,0.039206,0.040277,0.043592,0.049506,0.05701,0.056596,0.044088,0.03814,0.041239,0.040871,0.041395,0.041986,0.031594,0.026401,0.033041,0.033999,0.029312,0.027224,0.027615
0.095778,0.086625,0.078455,0.078876,0.087794,0.075357,0.060082,0.058043,0.052024,0.049697,0.051189,0.056907,0.067873,0.07642,0.079384,0.064677,0.052341,0.057026,0.056265,0.056879,0.058298,0.042994,0.036173,0.046336,0.047241,0.041346,0.038694,0.036303
0.152037,0.134782,0.118834,0.117371,0.136346,0.119377,0.084704,0.072939,0.065695,0.066834,0.067907,0.075553,0.09566,0.108486,0.117452,0.097754,0.075114,0.08396,0.08319,0.082694,0.084484,0.06188,0.052247,0.067415,0.06826,0.061215,0.057742,0.049537
0.215335,0.18769,0.16421,0.162881,0.191867,0.169795,0.117829,0.098776,0.090239,0.093662,0.093247,0.101408,0.131107,0.15017,0.163812,0.136494,0.104344,0.119089,0.119399,0.116511,0.11732,0.087009,0.074176,0.094533,0.095424,0.087515,0.082475,0.067454
0.24887,0.215354,0.189291,0.189437,0.222768,0.199446,0.142868,0.125371,0.119067,0.120003,0.115538,0.121288,0.154311,0.177003,0.190908,0.159056,0.124086,0.142771,0.145105,0.138929,0.136936,0.10545,0.092911,0.114608,0.115929,0.108788,0.101887,0.082418
0.222041,0.196638,0.180006,0.18283,0.207048,0.188161,0.147249,0.139968,0.139611,0.132859,0.12243,0.124551,0.148412,0.165885,0.175541,0.149354,0.12246,0.137705,0.141492,0.133654,0.128159,0.106199,0.099512,0.115546,0.117505,0.113344,0.105679,0.088755
0.161422,0.161747,0.163663,0.166469,0.170295,0.158925,0.143191,0.141575,0.14613,0.13305,0.118577,0.118239,0.125457,0.133287,0.139456,0.126058,0.110009,0.11274,0.116001,0.111068,0.104762,0.09612,0.098034,0.106245,0.107644,0.1046,0.096683,0.08959
0.133175,0.148447,0.156741,0.156026,0.153769,0.154046,0.148834,0.140341,0.151073,0.140724,0.118134,0.113664,0.113311,0.116148,0.127134,0.120737,0.104413,0.101362,0.105679,0.104627,0.097817,0.092373,0.099914,0.104301,0.101043,0.095523,0.08847,0.091137
0.142061,0.150516,0.150823,0.150881,0.162508,0.176058,0.165231,0.140188,0.154383,0.153669,0.124314,0.113041,0.114841,0.119125,0.135073,0.13267,0.11294,0.110338,0.117285,0.115539,0.102338,0.095273,0.105912,0.106586,0.097255,0.091191,0.0847,0.090505
0.154492,0.155352,0.143345,0.14834,0.175503,0.193571,0.17499,0.137052,0.147773,0.157047,0.135253,0.121066,0.123972,0.131662,0.143297,0.142465,0.127785,0.129884,0.136563,0.128573,0.107198,0.099322,0.112767,0.109788,0.093434,0.08787,0.084938,0.091228
0.15381,0.15223,0.133391,0.144147,0.180585,0.196669,0.177332,0.135907,0.136897,0.152628,0.140686,0.123467,0.129402,0.147625,0.152113,0.149274,0.142517,0.144894,0.147895,0.135367,0.108718,0.099004,0.115087,0.110341,0.087046,0.080998,0.083722,0.092167
0.150139,0.151978,0.143336,0.154839,0.182929,0.185868,0.166495,0.136358,0.133022,0.149187,0.14064,0.124103,0.135435,0.159233,0.158805,0.157366,0.15521,0.148551,0.142608,0.125131,0.099727,0.092271,0.111551,0.109003,0.082115,0.076509,0.084246,0.094918
0.167041,0.168197,0.174324,0.181491,0.191251,0.190894,0.173474,0.154063,0.150927,0.155593,0.144854,0.135726,0.148313,0.164068,0.16409,0.175121,0.180975,0.167515,0.149442,0.117925,0.097548,0.102654,0.11487,0.109195,0.088256,0.08837,0.097747,0.102625
0.227961,0.229883,0.241446,0.23869,0.231416,0.247771,0.237524,0.209667,0.207537,0.207353,0.193784,0.18575,0.188735,0.191628,0.196155,0.223766,0.241303,0.229566,0.201128,0.149413,0.130612,0.144857,0.140365,0.127707,0.114577,0.124434,0.133964,0.12382
0.302659,0.329977,0.341311,0.318137,0.30326,0.344755,0.349883,0.296609,0.275266,0.275274,0.272126,0.270321,0.253445,0.243164,0.250187,0.278828,0.30369,0.307134,0.274551,0.202451,0.187849,0.210624,0.186285,0.159689,0.150592,0.173154,0.18846,0.163608
0.36517,0.435101,0.443535,0.378698,0.350192,0.421094,0.458745,0.377452,0.320277,0.320628,0.334499,0.353212,0.317395,0.286638,0.288401,0.308426,0.342545,0.374074,0.341213,0.254561,0.254077,0.285767,0.239659,0.194643,0.185126,0.213915,0.243609,0.216158
0.419693,0.518494,0.523202,0.421236,0.370747,0.445714,0.515902,0.429517,0.33251,0.335155,0.360655,0.398067,0.365816,0.319621,0.308464,0.305314,0.347297,0.422644,0.394692,0.295464,0.302331,0.33543,0.27379,0.215802,0.206476,0.23015,0.27322,0.2623
0.458839,0.537573,0.54052,0.462004,0.399481,0.441395,0.504481,0.440374,0.339124,0.347297,0.363552,0.386007,0.395716,0.361681,0.314121,0.280499,0.342997,0.459973,0.425406,0.313994,0.309994,0.333906,0.278362,0.2121,0.203804,0.225292,0.275459,0.289376
0.481275,0.488995,0.482514,0.480125,0.420856,0.42802,0.46585,0.431855,0.354281,0.353863,0.357104,0.347083,0.394913,0.387425,0.307688,0.263906,0.350916,0.472512,0.430218,0.345048,0.319673,0.30343,0.267546,0.21488,0.200783,0.219251,0.269441,0.295943
0.496912,0.435317,0.394457,0.459352,0.444622,0.441727,0.464059,0.444831,0.364287,0.34655,0.348748,0.303138,0.353442,0.376135,0.294839,0.257087,0.34941,0.453843,0.423908,0.387835,0.351,0.290909,0.270835,0.249615,0.236825,0.243554,0.265246,0.284314
0.457293,0.386421,0.315487,0.394206,0.415221,0.41136,0.438036,0.433103,0.351246,0.3324,0.317893,0.242459,0.284914,0.327649,0.269919,0.237415,0.31221,0.395589,0.381156,0.376631,0.345059,0.268273,0.249852,0.258811,0.27281,0.266153,0.252597,0.275257
0.35241,0.319402,0.262211,0.302208,0.306566,0.295659,0.320129,0.32786,0.275494,0.273595,0.251754,0.183793,0.208281,0.239458,0.21413,0.196376,0.239808,0.282848,0.2748,0.284109,0.264461,0.201203,0.184688,0.21711,0.266739,0.26077,0.227878,0.251639
0.259631,0.242615,0.201174,0.199928,0.182783,0.177141,0.191449,0.190231,0.173612,0.1896,0.178662,0.144584,0.161584,0.174375,0.157835,0.145708,0.165302,0.168552,0.151058,0.160082,0.16667,0.146049,0.129955,0.153105,0.207488,0.2131,0.182703,0.191975
0.213504,0.188827,0.165165,0.14203,0.121172,0.130164,0.133503,0.118785,0.114482,0.121345,0.11306,0.131189,0.169151,0.155872,0.119726,0.118032,0.128768,0.110412,0.085064,0.09005,0.112987,0.117479,0.100401,0.096933,0.131841,0.15061,0.137953,0.131478
0.182948,0.155146,0.150612,0.12498,0.101649,0.105825,0.102961,0.098878,0.107819,0.101385,0.078195,0.117299,0.172882,0.14739,0.104212,0.109735,0.107034,0.088186,0.072074,0.073964,0.088252,0.088737,0.080468,0.067935,0.083707,0.096901,0.089979,0.080586
0.131089,0.111524,0.124466,0.11406,0.096827,0.089145,0.079796,0.084861,0.100671,0.09035,0.06657,0.096559,0.140268,0.113129,0.077494,0.085287,0.081098,0.080526,0.073933,0.068023,0.072873,0.064286,0.06552,0.063207,0.068956,0.069495,0.05852,0.055135
0.091166,0.08251,0.090247,0.087805,0.083111,0.074823,0.060278,0.064996,0.07874,0.068791,0.057391,0.071256,0.088283,0.074646,0.058042,0.05988,0.060487,0.072757,0.071111,0.062507,0.063291,0.049477,0.049036,0.055973,0.057942,0.053172,0.044689,0.051366
0.071225,0.069202,0.069672,0.067665,0.067914,0.066585,0.049362,0.049291,0.062174,0.055696,0.051709,0.062497,0.061164,0.051399,0.051919,0.053356,0.060369,0.074424,0.071535,0.063279,0.060906,0.044714,0.038705,0.043454,0.043363,0.040091,0.040479,0.055997
0.065904,0.061403,0.060361,0.063309,0.067011,0.070234,0.051183,0.049635,0.065102,0.060151,0.054931,0.067866,0.059459,0.042672,0.052873,0.062329,0.069201,0.078917,0.077435,0.069493,0.063653,0.048442,0.038291,0.036627,0.032587,0.027212,0.036068,0.058463
0.060268,0.052036,0.050341,0.055321,0.064726,0.070276,0.054544,0.056392,0.07072,0.062036,0.052898,0.066015,0.058518,0.03766,0.048309,0.062935,0.066661,0.069063,0.070812,0.064225,0.056168,0.04783,0.036707,0.031969,0.029359,0.021886,0.031816,0.052626
0.051353,0.038638,0.035723,0.039331,0.050718,0.057332,0.051315,0.059018,0.071722,0.060282,0.045494,0.058203,0.05289,0.036459,0.043556,0.053252,0.05161,0.047136,0.051251,0.046658,0.039739,0.042386,0.034933,0.029218,0.031941,0.024025,0.027042,0.039139
0.041021,0.027936,0.024471,0.026896,0.036772,0.042557,0.046034,0.059432,0.066969,0.053714,0.038795,0.050522,0.044381,0.036574,0.042115,0.046916,0.04149,0.035656,0.040729,0.035492,0.031054,0.039848,0.036701,0.034816,0.04229,0.029809,0.027122,0.034184
0.032251,0.026195,0.02146,0.022788,0.039034,0.045224,0.045104,0.0537,0.05404,0.049019,0.042931,0.042988,0.033328,0.034978,0.039776,0.043947,0.041093,0.036994,0.043757,0.037989,0.030206,0.038427,0.039798,0.044179,0.052295,0.035068,0.031465,0.03965
0.026346,0.026722,0.021277,0.021374,0.042527,0.050761,0.045941,0.043148,0.040818,0.044877,0.045639,0.034908,0.023506,0.031458,0.036559,0.038969,0.037769,0.035484,0.041834,0.03686,0.025768,0.032247,0.038511,0.049068,0.054444,0.034824,0.032268,0.041406
0.024089,0.027464,0.01956,0.019829,0.039561,0.048856,0.042009,0.031898,0.034859,0.040386,0.040803,0.032876,0.022772,0.026358,0.032163,0.03238,0.028812,0.02766,0.033507,0.031029,0.022057,0.026322,0.030864,0.044566,0.046954,0.028806,0.028313,0.036167
0.023572,0.027129,0.018163,0.020725,0.032507,0.038768,0.032547,0.026621,0.034586,0.031738,0.029507,0.029788,0.024109,0.019691,0.023791,0.027524,0.023914,0.020636,0.030141,0.030109,0.020918,0.022206,0.022241,0.033098,0.036648,0.025358,0.025462,0.028097
0.024593,0.0285,0.020203,0.02458,0.030016,0.029162,0.02449,0.028741,0.03506,0.026013,0.019398,0.0235,0.021768,0.012652,0.01422,0.025055,0.0278,0.022512,0.034118,0.032612,0.019803,0.021939,0.022058,0.025078,0.0277,0.025092,0.022105,0.022616
