8.8e-05,1.9e-05,0.000101,3.9e-05,6.6e-05,0.000152,0.000204,1.5e-05,2.5e-05,3e-05,3.5e-05,0.000106,6e-05,0.00027,4.5e-05,0.000223,6e-05,6.8e-05,5.6e-05,6.5e-05,2.5e-05,4.6e-05,0.000102,0.000131,0.000154,0.000118,6.2e-05,9.1e-05,1.1e-05,6.6e-05,7e-05,6.4e-05,0.000115,0.000104,6.4e-05,8.7e-05,1.7e-05,4e-06,0.000102,2.3e-05,6.3e-05,0.000156,0.000244,5.6e-05,0.000116,0.000141,1e-06,3.8e-05,0.000104,0.000164,0.000163,7.3e-05,0.000212,2.7e-05,1.4e-05,4e-06,6.8e-05,4.7e-05,3.5e-05,8.2e-05,9.5e-05,3e-05,5.7e-05,1.9e-05,4.4e-05,9.2e-05,6.5e-05,4e-06,1.2e-05,8e-06,0.000206,1.7e-05,0.000128,8.9e-05,3.8e-05,0.000113,7.3e-05,8e-06,0.000214,0.000127,4.4e-05,4.6e-05,1.4e-05,5.2e-05,7.3e-05,7.8e-05,0.000119,1.8e-05,4.7e-05,9.9e-05,7.6e-05,6.9e-05,2.5e-05,4.9e-05,8.8e-05,7e-06,3.9e-05,3.6e-05,2.1e-05,0.000171,8e-06,1e-05,2.8e-05,0.000127,0.000233,8e-05,7e-05,0.000113,7.6e-05,0.000163,3.8e-05,2e-06,8.7e-05,0.000107,0.000125,3.3e-05,0.000126,6.6e-05,2.5e-05,4.2e-05,0.000151
0.000302,0.000183,0.000255,0.000246,7.6e-05,0.000406,0.00037,6.9e-05,1.8e-05,5.8e-05,0.000131,0.000266,0.000216,0.000486,0.000249,0.000679,0.000245,0.000218,6.7e-05,0.000159,5.8e-05,0.000129,0.000253,0.000426,0.000138,0.000297,0.000331,8e-05,0.000166,0.000141,0.000234,9.5e-05,0.00021,0.000197,8.1e-05,9.5e-05,0.000161,0.000169,0.000335,0.000181,0.000164,0.000478,0.000245,0.000239,0.000129,0.000246,0.000138,0.000246,0.000346,0.000292,0.000163,6.2e-05,0.000313,0.000153,0.00013,0.000164,0.00016,0.000131,4.6e-05,7.3e-05,0.000179,0.000148,0.000164,3.5e-05,9.2e-05,0.000177,0.000234,8.4e-05,7.6e-05,9.5e-05,2e-04,0.000232,4.9e-05,0.000194,0.000225,0.00025,0.000187,0.000147,0.000168,0.000259,0.000238,0.000143,0.000148,0.000229,0.000176,0.000207,0.000326,0.000112,0.00016,0.000181,0.000223,0.000192,5.5e-05,0.000113,0.000113,3e-06,0.000242,0.000124,0.000204,0.000389,0.000266,0.000189,0.000298,0.000404,0.000302,0.000322,0.000453,0.00023,0.000139,0.00049,0.000419,0.000208,8.4e-05,0.000353,7.3e-05,4.3e-05,0.000213,0.000225,0.00014,0.000178,0.000331
0.000195,0.000157,0.000498,0.000369,0.000462,0.00064,0.000383,0.000167,0.00041,4.9e-05,9.5e-05,0.000326,0.000367,0.000475,0.000534,0.000715,0.000376,0.000376,0.00026,0.00012,0.000247,0.000306,0.000278,0.000255,0.000447,0.000239,0.000628,0.000346,0.000121,0.000202,0.000462,0.000176,0.000155,0.00014,9e-05,0.00015,0.000124,0.000143,0.00032,0.00027,0.00021,0.000307,0.00056,0.000585,0.00013,0.000277,0.000112,0.000246,0.000386,0.000164,7e-04,0.000223,0.000555,0.000395,0.000165,0.000233,0.000183,0.000172,0.000449,0.000313,0.000205,0.000322,0.000256,0.000133,0.000303,0.000219,0.000144,4.3e-05,6.8e-05,0.000295,0.000455,0.00026,6.3e-05,0.000111,0.000286,0.000369,0.00012,6.3e-05,0.000417,0.000261,0.000282,0.000321,0.000285,0.000416,0.000165,0.000382,0.000354,9e-05,0.00016,0.00056,0.000348,0.000464,0.000257,0.000156,0.000364,0.000119,0.000233,0.000301,0.000204,0.000403,0.000278,0.000141,0.000494,0.000259,0.000462,0.000736,0.000573,0.000298,0.000194,0.000379,0.000305,0.000105,0.000228,3.9e-05,0.000459,0.000224,0.000289,0.000114,0.000256,0.000284,0.000454
0.000452,0.000455,0.000447,0.000752,0.000701,0.00059,0.000341,0.00054,0.000475,0.000666,0.000332,0.000593,0.000609,0.000175,3e-04,0.00038,0.001422,0.000677,0.000439,0.000116,0.000514,0.000613,0.00045,0.000532,0.000587,0.000384,0.000953,0.001059,0.000384,0.000319,0.000628,0.000102,0.000619,0.000175,0.000611,0.000543,0.000265,0.000308,0.000103,0.00049,0.00046,0.000307,0.000116,0.000541,0.000747,0.00058,0.000421,0.000211,0.000858,0.000881,0.001071,0.000798,0.001084,0.000867,0.00068,0.000496,0.00031,0.000237,0.000747,0.000332,0.000296,0.000383,0.000687,0.000643,0.000931,0.000779,0.000805,0.000596,0.000625,0.000572,0.000999,0.000574,0.000547,5.9e-05,0.000312,0.000222,0.000672,0.000513,0.000624,0.000609,0.00054,0.000823,0.000806,0.000721,6e-04,0.000806,0.000797,0.000876,0.000384,0.000506,0.000596,0.000825,0.000314,0.00027,0.000685,0.000401,0.000325,0.000281,0.000302,0.00049,0.000512,0.000193,0.000691,0.000727,0.000911,0.000348,0.000772,0.000702,0.000776,0.000806,0.001087,0.000743,0.000611,0.00016,0.000624,0.000847,0.001031,0.000609,0.000434,0.000166,0.000743
0.000549,0.000981,0.001002,0.000753,0.000489,0.00087,0.00107,0.000738,0.000916,0.000502,0.000395,0.000388,0.00013,0.000103,0.000758,0.000728,0.001593,0.001052,0.000403,0.000285,0.000316,0.000522,0.000734,0.000472,0.000562,0.00043,0.000569,0.000598,0.000679,0.000537,0.001207,0.001192,0.001125,0.000645,0.001057,0.000406,0.000149,0.000186,7.8e-05,0.000214,0.000297,0.000203,0.000395,0.000471,0.000762,0.00108,0.000822,0.000387,0.001102,0.001563,0.00148,0.001425,0.000422,0.000368,0.000292,0.000103,0.000455,0.000924,0.000672,0.000437,0.000393,0.000377,0.000491,0.000522,0.000554,0.000727,0.000523,0.000405,0.00055,0.000314,0.000613,0.000508,0.000237,0.000203,0.000343,0.000318,0.000889,0.000529,0.000796,7.2e-05,0.000234,0.000494,0.000521,0.000525,0.001165,0.000766,0.000323,0.000576,0.000562,0.000106,0.000526,0.000778,0.000675,0.000576,0.000846,0.000454,0.000304,0.000175,0.000305,0.000253,0.000692,0.000426,0.000264,0.000103,0.000241,0.000479,0.000621,0.000863,0.000163,0.000434,0.001,0.000924,0.000836,0.000696,0.000943,0.000585,0.000489,0.000962,0.000749,0.000785,0.001014
0.000372,0.000472,0.00037,0.000384,0.000729,0.00083,0.001213,0.000302,0.000857,0.000779,0.000898,0.000576,0.000452,0.00048,0.000432,0.000295,0.000705,0.000145,0.000374,0.000562,0.000653,0.000971,0.000716,0.000491,0.000338,0.000205,0.000301,0.000252,0.000217,0.000455,0.000766,0.000499,0.000933,0.000534,0.000631,0.000316,0.000104,0.000128,0.000409,3.9e-05,0.000405,0.000144,0.000362,0.000377,0.000343,0.00032,0.000189,0.000167,0.000762,0.000706,0.000315,0.000358,0.000242,0.000124,0.000417,0.000139,0.000529,0.000711,0.000448,6.3e-05,0.000337,0.000359,0.000449,0.000412,0.000842,0.000253,0.000468,0.000376,0.000234,0.000403,0.00022,0.000163,5.7e-05,0.000101,0.000391,0.000657,0.000305,0.000284,0.000111,0.000508,0.000415,0.000233,0.000522,0.000803,0.000285,0.000286,0.000145,0.000655,0.000155,0.000223,0.000506,0.000484,3.6e-05,0.000416,0.000391,0.00025,0.000295,0.000516,0.000448,0.000287,0.000103,0.000183,0.000158,0.000101,0.000228,0.000325,0.000229,0.000761,0.000535,0.000175,0.000254,0.000484,0.000442,0.000137,0.000381,0.000249,0.000522,0.000441,0.000354,0.000482,0.000578
0.000327,0.000225,0.000307,0.000204,0.000282,0.000732,0.000799,0.000182,0.000773,0.000917,0.000693,0.000885,8.7e-05,0.000842,0.000357,0.000479,1.2e-05,0.000455,0.000463,0.000219,0.000359,0.001099,0.000629,0.000452,0.000409,0.000568,0.00066,0.000238,7.3e-05,0.000629,0.000494,0.000707,0.000394,0.00032,0.000303,5.5e-05,0.000331,0.000557,0.000938,0.000787,4e-04,0.000382,0.000322,0.000446,0.000613,0.000126,0.000183,0.000257,0.000224,0.000667,0.000431,0.000138,0.000763,0.000245,0.000499,0.00031,0.000423,0.000872,0.000334,0.000455,0.000677,0.000388,0.000207,0.000334,0.000868,0.000212,0.000336,0.000575,0.000373,0.00058,0.000369,0.000119,0.000487,0.000121,0.000512,0.000452,0.00067,0.000285,0.000599,0.00029,0.000232,5.7e-05,0.000303,0.000295,0.000418,0.000444,0.00036,0.000391,0.000713,0.000269,0.00065,0.000753,0.000484,0.000785,0.00034,0.000122,0.000563,0.000278,0.000436,0.000437,0.000789,0.000122,0.000516,9e-06,0.000506,0.000126,0.000112,0.000779,4e-04,0.00055,0.000465,0.00043,0.000626,0.000413,0.000462,9.3e-05,0.000537,0.000346,0.000227,0.000292,0.000617
0.001001,0.000701,0.000913,0.000569,0.000423,0.00108,0.001397,0.000695,0.001397,0.000767,0.00082,0.001365,0.001332,0.001472,0.00142,0.000625,0.000554,0.000203,0.000325,0.000437,0.000275,0.000994,0.001294,0.001369,0.000581,0.000345,0.000729,7e-04,0.000121,0.000572,0.00094,0.001345,0.000156,0.000634,0.000526,0.000582,4e-04,0.001059,0.000457,0.000358,0.000365,0.001286,0.000662,0.000798,2e-04,0.00086,0.000358,0.000301,0.001242,0.000954,0.000785,0.00029,0.000905,0.000939,0.00019,8.5e-05,0.000362,0.000659,0.000839,0.000633,0.000927,0.000961,0.000136,0.000787,0.000742,0.000784,0.000641,0.000247,0.001441,0.00076,0.000415,0.000193,0.000713,0.000654,0.000243,0.000476,0.000288,0.00078,0.001429,0.00139,0.000293,0.000489,0.00029,0.000455,0.000425,0.000954,0.000601,0.000457,0.000419,0.001014,0.001048,0.001839,0.000865,0.00098,0.000718,0.000562,0.000952,0.000981,0.001087,0.001089,0.00187,0.001111,0.000994,0.000819,0.000615,0.001025,0.000421,0.000638,0.001653,0.001163,0.001644,0.001432,0.001125,0.000832,0.001115,0.000509,0.00094,0.000235,0.000187,0.000424,0.000471
0.000698,0.000381,0.001233,0.000239,0.001206,0.001771,0.001401,0.002156,0.000495,0.001225,0.002089,0.000756,0.001421,9.6e-05,0.001755,0.002135,0.00065,0.000632,0.00041,0.00081,0.000965,0.000657,0.001148,0.000222,0.000179,0.000649,0.001325,0.001425,0.001106,0.000978,0.001655,0.001127,0.001961,0.001606,0.001847,0.00151,0.000761,0.001071,0.001112,0.00069,0.000783,0.00177,0.001554,0.002019,0.001869,0.001986,0.001669,0.000834,0.001279,6e-04,0.000855,0.000722,0.000678,0.001099,0.000667,0.000389,0.000565,0.000638,0.000917,0.000508,0.000935,0.000817,0.001176,0.001254,0.002004,0.002133,0.001567,0.000833,0.001882,0.002642,0.00158,0.001255,0.000325,0.000573,0.000895,0.001027,0.001067,0.001006,0.001112,0.002031,0.001679,0.001403,0.00142,0.001145,0.00126,0.001219,0.000679,0.000292,0.000231,0.000933,0.000672,0.001764,0.000936,0.001193,0.001019,0.001014,0.000583,0.000692,0.001352,0.001257,0.001567,0.001263,0.000197,0.001091,0.000984,0.001089,0.000823,0.000648,0.001447,0.001929,0.000368,0.000215,0.00018,0.000393,0.000754,0.000528,0.000531,0.00073,0.000691,0.000626,0.000385
0.001586,0.00073,0.001155,0.0014,0.001085,0.000573,0.000772,0.001473,0.001094,0.000835,0.001201,0.001057,0.000278,0.000968,0.001089,0.000875,0.001558,0.001366,0.000178,0.001187,0.000144,0.00058,0.000454,0.000662,0.000285,0.000495,0.000795,0.000663,0.000455,0.00088,0.000817,0.000428,0.001244,0.001571,0.000882,0.001122,0.000856,0.000359,0.000551,0.000388,0.000872,0.000676,0.00071,0.001146,0.000532,0.000553,0.000413,0.000638,0.000959,0.001207,0.001,0.000256,0.000687,0.000354,0.000385,0.000271,0.000429,0.000625,0.000196,0.000482,0.000565,0.000584,0.000989,0.000178,0.001126,0.00118,9e-04,0.000255,0.001254,0.00083,0.000565,0.000779,0.000533,0.000999,2.5e-05,0.000547,0.000201,3.5e-05,0.000637,0.001144,0.000902,0.000753,0.000633,0.000899,0.000214,0.000414,0.000628,0.000443,0.000313,0.000507,0.001538,0.000325,0.000343,0.000382,0.000351,0.000316,0.000407,0.000342,0.000559,0.000676,0.000835,0.000172,0.000544,0.000557,0.000258,0.000168,0.000226,0.00017,0.001099,0.000607,0.000876,0.000646,3.2e-05,0.000221,0.000624,0.00041,0.00016,0.000414,0.000316,0.000333,0.000561
0.001235,0.000721,0.000586,0.000695,0.001014,0.000447,0.000684,0.001039,0.000595,0.000729,0.000433,0.000449,0.00041,0.000954,0.000519,0.000499,0.000768,0.000609,0.00131,0.001536,0.001253,0.000214,0.000323,0.00077,0.000529,0.000602,0.000499,0.000765,0.00113,0.00015,0.000275,0.000874,0.00127,0.000644,0.000831,0.000446,0.00011,0.000405,0.000493,0.000541,0.000728,0.00115,0.001307,0.001687,0.001062,0.000389,0.000478,0.000714,0.000544,0.000543,0.000777,0.000617,0.000753,0.000488,0.000477,0.000344,0.000485,0.00037,0.000156,0.000626,0.000759,0.001255,0.00031,0.000138,0.000428,0.000636,0.000136,0.000644,0.000495,0.001043,0.000857,0.000649,0.001035,0.00085,0.00075,0.000402,0.000156,0.000307,0.000491,0.000953,0.000441,0.000523,0.000307,0.000983,0.000784,0.000928,0.000481,0.000106,0.000388,0.000624,0.001101,0.001144,0.000992,0.000843,0.000617,0.000314,0.000403,0.00053,6.8e-05,0.000555,0.000193,0.000381,0.000151,0.000559,0.000912,0.000737,0.000541,0.000313,0.000384,0.00041,0.000291,0.000636,0.000673,0.000494,0.000482,0.000491,0.000319,0.000175,0.000418,0.000335,0.000838
0.000604,0.000271,4e-05,0.000305,0.000133,0.000834,0.000649,0.000139,0.000505,0.000383,0.000326,0.000521,0.000904,0.00014,0.000137,0.000354,0.000537,0.001029,0.001711,0.000464,0.000477,0.000539,0.000378,0.000473,0.000411,0.000154,0.000358,0.000338,0.000589,0.000691,0.000174,0.001027,6.9e-05,0.000471,0.000153,0.000473,0.000461,0.000727,0.000163,0.000364,0.000601,0.000855,0.000545,0.000289,0.000133,5e-04,0.000616,0.00053,0.000245,0.000519,0.000393,7e-05,0.000187,0.000328,0.000112,0.000205,0.000316,0.000168,0.000441,0.000235,0.000221,0.000535,6.1e-05,0.000316,0.000325,0.000139,0.000253,0.000383,0.000203,0.000501,0.000126,0.000217,0.000523,0.000331,0.000324,0.000419,0.000313,0.000611,0.000103,0.000324,0.000135,0.000472,0.000673,0.000306,0.000113,0.000423,8.8e-05,0.000127,0.000219,0.000509,0.000141,0.000216,0.000425,0.000477,0.00023,0.000274,0.000297,0.000246,0.000107,0.000421,0.00013,0.000259,0.000394,0.000224,0.000584,0.000167,0.000204,0.000257,0.000227,0.000268,0.000515,2e-04,0.000305,0.000259,0.00025,0.000133,0.000305,0.000274,0.000178,0.000231,0.000353
0.000117,0.000263,0.000299,0.000479,0.000436,0.000649,0.000323,0.00047,0.000493,0.000488,0.000141,0.000275,0.000652,0.000501,0.000288,1.8e-05,0.000249,0.000915,0.000251,5.1e-05,0.000164,0.000454,5e-05,0.000349,0.000405,0.000295,0.000192,0.000309,0.000344,0.000279,0.000241,0.000841,0.000674,0.000279,0.000377,2.6e-05,0.000149,0.000208,0.000176,0.000432,0.000538,0.000688,6e-05,0.000217,0.000334,0.000458,0.000467,0.000182,0.000242,0.000423,0.000103,0.000156,8.9e-05,0.000431,0.000162,0.000211,0.000411,0.000133,0.000373,0.000195,7.7e-05,3e-04,6e-05,0.000338,0.000191,0.000305,0.000306,0.000277,0.000262,0.000388,7.1e-05,0.000165,0.000254,0.000271,0.00034,5.4e-05,0.000111,0.000363,0.000173,0.000328,0.00021,0.000516,0.000411,0.000156,4.5e-05,0.000258,4.2e-05,0.000203,0.000321,0.000477,0.000154,6.4e-05,0.000223,0.000468,2.9e-05,8.7e-05,0.000133,0.000346,7e-05,0.000265,0.000205,0.000341,0.000187,0.000152,0.000283,0.000162,0.000282,0.000118,4e-04,0.00017,0.000179,0.000186,0.000246,0.000411,0.000352,0.000246,0.000141,0.000318,0.000156,0.000221,0.000233
0.000398,0.000415,0.000675,0.000773,0.000246,0.000716,0.000428,0.000387,0.000299,0.000372,0.000516,0.000151,0.00046,9.4e-05,0.000343,0.000658,0.000861,0.000771,0.000465,0.000111,0.00027,0.000475,0.000214,0.000736,0.000732,0.000249,0.000491,0.000783,0.000721,0.000284,0.000426,0.000618,6.4e-05,0.000249,0.000718,0.000237,0.000264,0.000962,0.000932,0.000477,0.000407,0.000983,0.000271,0.000228,0.000471,0.000585,0.000702,0.000336,6.5e-05,0.00037,0.000138,0.000115,5.8e-05,0.000364,7.8e-05,0.000223,0.000564,0.000455,0.000511,0.00042,0.000119,0.000665,0.000166,0.000198,0.000302,0.000327,0.000491,0.000327,0.000381,0.000383,0.000267,0.00017,0.000297,0.000301,0.000466,0.000343,0.000153,0.000421,0.000378,0.000351,0.000138,0.000619,0.000294,0.000234,0.000444,0.000565,0.000218,0.000302,2e-04,0.000624,0.000587,0.000129,3.2e-05,0.000276,0.000184,0.000189,9.2e-05,0.000477,0.00022,0.000363,0.000317,0.000537,0.000662,0.000194,0.000178,0.000217,0.000484,4.2e-05,0.000544,0.000314,0.000116,0.000317,0.000403,0.000583,0.000515,0.000326,0.000332,0.000516,0.000573,0.000125,0.000209
0.000731,0.001276,0.001751,0.001061,0.000772,0.000739,0.001096,0.000886,0.000346,0.001303,0.001208,0.001196,0.00139,0.000761,0.000121,0.001238,0.000956,0.000773,0.000584,0.000561,0.000311,0.000201,0.000403,0.001099,0.00186,0.001159,0.00099,0.000714,0.001753,0.001331,0.000707,0.000984,0.000634,0.000829,0.000725,0.001421,0.001001,0.001482,0.001241,0.001668,0.001125,0.002023,0.001342,0.000455,0.000991,0.000868,0.000105,0.000381,0.000494,0.000697,0.000182,0.000391,0.00023,0.000747,0.000674,0.000517,0.000872,0.001499,0.001707,0.001664,0.001364,0.001414,0.001074,0.000818,0.000463,0.000599,0.001084,0.001272,0.000644,0.000952,0.001098,9e-04,0.000871,0.00035,0.000863,0.001242,0.000727,0.000764,0.001119,0.001612,0.001069,0.000924,0.000442,0.000546,0.001101,0.001548,0.000883,0.000239,0.000624,0.00094,0.000863,0.00114,0.000613,0.000264,0.000505,0.000383,0.000572,0.000849,0.000949,0.00083,0.000791,0.000969,0.000184,0.000684,0.000664,0.000358,0.000546,0.00082,0.00097,0.000676,0.000615,0.000653,0.000636,0.00097,0.001431,0.001643,0.001226,0.001356,0.001307,0.000987,0.000168
0.00106,0.001515,0.001814,0.002015,0.001315,0.001221,0.002109,0.003161,0.002014,0.00188,0.002086,0.000208,0.000733,0.000363,0.000792,0.001723,0.002153,0.002368,0.001971,0.000907,0.000579,0.000808,0.000554,0.001501,0.002197,0.000941,0.001837,0.002674,0.003003,0.001338,0.000413,0.001887,0.00179,0.000852,0.001237,0.001652,0.001735,0.002925,0.003192,0.001786,0.001357,0.001399,0.001943,0.001587,0.000932,9.3e-05,0.000445,0.000601,0.000223,0.00051,0.00059,0.000733,0.000255,0.000885,0.000589,0.000399,0.000256,0.001172,0.001127,0.000907,0.000617,0.000577,0.001043,0.000753,0.000407,0.000477,0.000517,0.000991,0.001179,0.001873,0.001642,0.001231,0.00021,0.000576,0.001106,0.001193,0.000538,0.000544,0.000718,0.001176,0.000802,0.000923,0.00069,0.000328,0.000969,0.000463,0.000513,0.000529,0.000297,0.000383,9.6e-05,0.000828,0.000662,0.000677,0.000526,0.000362,0.000693,0.001009,0.000926,0.000394,0.000484,0.00047,0.000691,0.000711,0.000557,0.000377,0.000651,6e-04,0.000681,0.000439,0.000178,0.000679,0.000346,0.000338,0.000759,0.001017,0.000354,0.000788,0.000332,0.000254,0.000618
0.00047,0.001047,0.000185,0.00064,0.000436,0.000669,0.000924,0.001914,0.001782,0.001355,0.00038,0.000926,0.000469,0.000495,0.001459,0.000308,0.00085,0.00099,0.000638,0.000935,0.000588,0.000585,0.000905,0.000379,0.000722,0.000631,0.001834,0.002042,0.000502,0.000124,0.000556,0.001275,0.001371,0.000765,0.001158,0.000506,0.001324,0.00155,0.000476,0.000756,0.000644,0.001118,0.00028,0.000822,0.00073,0.000334,0.000377,0.000152,0.000154,0.00031,0.000319,0.000493,0.000413,0.000693,0.000255,0.000243,0.000391,0.000567,0.000369,0.000213,0.000501,0.000129,0.000404,0.000143,0.000132,0.000329,0.000201,0.000512,0.000232,0.000838,0.00022,0.000684,0.000763,0.000446,0.000629,0.000317,0.000341,4.1e-05,0.000551,0.000449,0.000322,0.00017,0.000342,0.000121,0.000585,0.000494,0.000458,0.00015,0.000297,0.000154,6.9e-05,0.000652,0.000363,0.000107,0.000314,0.000231,0.00074,2.7e-05,0.000331,6e-05,0.000296,0.000197,0.000391,0.000137,0.000362,0.000271,0.000122,0.000384,0.000241,0.000387,0.000299,0.000286,0.000301,0.000249,0.000507,0.000492,0.000531,0.000232,9.8e-05,0.00026,0.00054
0.000457,0.000397,0.000111,0.000141,0.000667,0.000661,0.001049,0.000603,0.000501,0.000572,0.000947,0.000647,0.000277,0.000296,0.000907,0.000832,0.000343,0.000444,0.001045,0.000924,0.000168,0.000185,0.000367,0.000812,0.000215,0.000438,0.000755,0.000771,0.000225,0.000453,0.000378,0.000919,0.000456,0.000373,0.000587,0.000683,0.000352,0.000361,0.000366,0.00047,0.000149,0.000253,0.000469,0.000345,0.00051,0.000309,0.000161,0.000124,0.00016,0.000128,0.000433,7.6e-05,7.6e-05,0.000226,0.000307,0.000102,0.000389,0.000537,0.000539,0.000292,0.000346,0.000113,0.000252,0.000108,0.000221,0.000199,0.000167,0.000147,0.000376,0.000141,0.000165,0.000398,0.000387,0.000266,0.000278,0.000167,0.000204,0.000114,0.000256,0.000294,0.000187,4.1e-05,0.000214,0.000111,0.000176,0.000326,9.8e-05,9.3e-05,7.8e-05,0.000162,0.000119,0.000369,0.000173,8.9e-05,0.000292,0.000297,0.000198,8.5e-05,0.000133,7e-05,0.000208,0.000186,0.000378,0.000298,0.000481,9.3e-05,5.8e-05,0.00029,9.4e-05,0.000192,0.000118,0.000401,0.000201,0.000197,0.000244,0.000297,0.000136,0.000219,0.000243,0.000204,0.000269
0.000285,0.000189,0.000589,0.000768,0.000569,5e-05,0.00067,0.000289,0.000264,0.000279,0.000346,0.000257,0.000121,0.000298,0.000325,0.000183,0.000194,0.000191,0.000532,0.000168,0.000401,0.000537,6.8e-05,0.000531,0.000255,0.000367,0.000471,0.000622,8.4e-05,0.000411,0.000353,0.000538,0.000222,0.000137,0.000358,0.000354,0.000309,0.000543,0.000575,0.000256,0.000215,0.000243,0.000288,0.00037,0.000188,7.7e-05,7.3e-05,0.000307,0.000131,0.000261,0.000221,0.000172,0.000109,0.000193,8.8e-05,0.000208,0.00023,0.00023,0.000118,0.000116,0.00014,0.000191,0.000223,0.000173,0.000122,0.000156,0.000399,0.000273,0.000284,0.000163,0.000182,1e-04,5.6e-05,0.000135,0.00017,8.7e-05,0.000172,0.00016,0.000303,0.00034,8e-05,0.000142,0.000241,0.000212,0.000251,0.000178,0.000259,7.5e-05,0.000163,0.000129,5.3e-05,0.000179,0.000122,2.3e-05,0.000227,8e-06,0.00013,0.000183,0.000134,0.000154,0.000117,6.8e-05,0.000319,0.000181,0.000392,0.000182,1e-04,0.000273,6.1e-05,1e-04,0.000162,0.000181,5.5e-05,0.000131,0.000117,3.3e-05,1e-04,0.000305,0.000175,0.000135,0.000244
0.000187,0.000213,0.000539,0.000253,0.000189,0.000252,0.000447,0.000198,0.00053,0.000285,0.000172,0.000183,0.000219,0.00031,0.000264,0.00013,0.000192,0.000163,0.000228,0.000162,0.000282,0.000311,0.00019,0.000251,2.5e-05,0.000313,0.000306,0.000497,0.000154,0.000214,4.5e-05,0.000389,0.00011,8.5e-05,0.000202,0.00018,0.000349,0.000422,0.000152,0.000192,0.000209,0.000106,0.000286,0.000592,0.000528,0.000317,0.000186,0.000207,9.7e-05,8.3e-05,0.000304,0.000141,7.1e-05,0.000126,0.000159,6e-05,0.000153,0.000143,6.3e-05,0.000115,2.4e-05,0.00024,0.000399,0.00027,0.00012,7.8e-05,0.000266,0.000155,0.000342,6.7e-05,0.000211,0.000134,7.8e-05,0.000117,0.00016,0.00017,0.000186,6.6e-05,0.000164,0.000294,0.000107,0.000227,0.00034,4.3e-05,0.000357,0.000192,6.1e-05,8e-05,0.000122,0.000124,1e-05,0.00013,7.7e-05,8e-05,0.000295,0.000201,0.000145,0.000102,6.4e-05,0.000229,0.000101,0.000193,0.00015,0.000137,0.000166,3.4e-05,0.000158,0.000351,0.000159,5.3e-05,0.000221,0.000336,0.000171,0.000104,0.000139,0.000153,0.000167,0.000138,0.000163,0.000116,0.00021
0.00026,0.000201,0.000278,7.8e-05,0.000283,6.2e-05,0.000418,0.000386,0.00017,9.6e-05,0.000186,0.000205,0.000194,0.000219,0.000346,0.000295,0.000284,8.3e-05,4.8e-05,0.000106,2.5e-05,0.00023,0.000111,0.000345,0.000242,4e-05,0.000232,3e-04,4.7e-05,0.00012,4.5e-05,0.000297,0.000125,8.9e-05,0.000274,0.000233,0.000376,0.000241,0.000223,7.8e-05,6.3e-05,0.00011,3e-04,0.000351,0.00029,5.4e-05,0.000261,0.000104,0.000187,0.000129,0.000137,2.2e-05,6.1e-05,5e-06,0.000112,4.9e-05,4e-05,0.000119,0.000102,2.1e-05,0.000103,1e-04,0.000289,4.4e-05,8e-05,0.000112,0.000277,0.000251,0.00014,8e-06,0.000196,3.9e-05,9.7e-05,0.000137,0.000105,0.000108,1.2e-05,0.000114,8.2e-05,5.3e-05,0.000149,0.000147,0.000148,0.000115,0.000219,7.3e-05,4.5e-05,8.5e-05,0.000114,0.000159,0.000141,2.8e-05,0.000163,7.3e-05,0.000157,9.2e-05,8.1e-05,9.3e-05,8.3e-05,0.000151,0.000123,1e-04,0.000258,0.000106,0.000103,9.7e-05,0.000102,9e-05,6.2e-05,0.00011,0.000193,9.9e-05,3.5e-05,3e-05,8.3e-05,7.1e-05,0.000125,0.000209,0.000139,0.000113,7.9e-05
0.00015,8e-06,0.000322,8e-05,0.000138,0.000219,0.000231,0.000223,0.000219,0.000182,0.000211,0.000124,0.000106,7.7e-05,0.000208,0.000125,9e-05,5.7e-05,6e-05,8.7e-05,8.1e-05,0.000158,0.000154,0.00026,0.000136,0.000141,0.000175,0.000232,8.5e-05,7.5e-05,0.00015,0.000156,0.000218,9.8e-05,0.000272,0.000119,0.000164,0.000159,0.000231,7.7e-05,0.000138,6.3e-05,0.000255,0.000272,0.000142,7.7e-05,0.000152,1.8e-05,6.4e-05,2.7e-05,0.00014,2.2e-05,6.1e-05,0.000132,3.6e-05,8.5e-05,4.2e-05,0.000159,6.4e-05,6e-05,0.000114,0.000118,0.000203,8.8e-05,4.5e-05,6.3e-05,0.00013,0.000136,8.5e-05,0.000149,0.000243,0.000116,0.000104,3e-05,0.000141,3.5e-05,3e-05,8.8e-05,0.000127,0.000261,7e-05,0.000107,0.00012,2.3e-05,0.000166,6e-06,5.1e-05,7.6e-05,9.2e-05,5.3e-05,0.000106,0.000155,0.000111,0.00012,0.000159,0.000196,0.000114,7.8e-05,9.2e-05,0.000101,9.7e-05,4.3e-05,0.000122,0.000107,0.00011,3.8e-05,5.6e-05,0.000135,6.1e-05,5.4e-05,5e-05,0.000156,8.7e-05,5.9e-05,9.3e-05,5.6e-05,5.6e-05,0.000168,0.00013,8.5e-05,6.6e-05
3.5e-05,4.3e-05,8e-05,7.1e-05,4e-06,3.8e-05,9.3e-05,0.000117,9.2e-05,2.7e-05,4.1e-05,4.1e-05,2.1e-05,3.6e-05,0.000112,3.6e-05,8e-06,4e-05,8e-06,1.4e-05,1.7e-05,0.000105,7.2e-05,6.9e-05,8.8e-05,3.1e-05,8.5e-05,9.3e-05,1.8e-05,1.7e-05,3.1e-05,6.8e-05,0.000111,2e-05,7.2e-05,0.000102,8.8e-05,6.8e-05,9.8e-05,1.2e-05,5.2e-05,4.1e-05,8.3e-05,9.7e-05,5.8e-05,1.4e-05,7.6e-05,2.5e-05,4.2e-05,2.5e-05,6.2e-05,2e-05,2.1e-05,2.9e-05,3.1e-05,2.9e-05,3.9e-05,6.8e-05,4.6e-05,4.9e-05,4.7e-05,5.5e-05,7.3e-05,5e-06,5.3e-05,6e-05,5.6e-05,5.7e-05,3.1e-05,1.6e-05,0.000104,3.2e-05,2.8e-05,1.6e-05,6.1e-05,5e-06,1.7e-05,2.3e-05,6.3e-05,7.3e-05,2.3e-05,3.4e-05,3.4e-05,1.2e-05,9.4e-05,3.9e-05,1.6e-05,2e-05,4.3e-05,4e-05,3.3e-05,3.8e-05,2.8e-05,3.8e-05,3.9e-05,6.3e-05,5.7e-05,1.8e-05,2.8e-05,3.8e-05,9e-06,2e-05,8e-06,1.9e-05,4.9e-05,1.5e-05,1.5e-05,4.1e-05,1.7e-05,3.5e-05,2.6e-05,6.5e-05,3.1e-05,1.5e-05,2.9e-05,4.3e-05,4.4e-05,4.3e-05,2.4e-05,3.7e-05,2.3e-05
1.7e-05,4.6e-05,0.000101,4.2e-05,5.4e-05,3.2e-05,9.6e-05,9.5e-05,8.5e-05,6.1e-05,2.2e-05,6.5e-05,3.6e-05,5.5e-05,0.00012,4.3e-05,1.9e-05,1.1e-05,2.3e-05,2.7e-05,1.5e-05,7.3e-05,5.4e-05,8.2e-05,7.2e-05,3.3e-05,8e-05,9.6e-05,3.7e-05,2.2e-05,3.2e-05,8e-05,7.8e-05,4e-05,6.6e-05,8.8e-05,9.7e-05,7.1e-05,6.3e-05,2.5e-05,7.2e-05,3.3e-05,4.9e-05,8.9e-05,3.9e-05,1.6e-05,9.9e-05,4.9e-05,2.6e-05,1.2e-05,4.6e-05,2.8e-05,3.2e-05,1.3e-05,3.5e-05,3.6e-05,2.8e-05,6.4e-05,5e-05,1.8e-05,5.5e-05,3.5e-05,7e-05,2.1e-05,6.1e-05,3e-05,4e-05,2.8e-05,2.2e-05,2.4e-05,7.3e-05,3.3e-05,4e-06,2.3e-05,7.8e-05,1.7e-05,1.8e-05,3.8e-05,7.6e-05,4.7e-05,4.3e-05,4.1e-05,5.8e-05,2.9e-05,7.8e-05,2.2e-05,2.8e-05,1.7e-05,1.7e-05,2.4e-05,7e-06,3.4e-05,4.2e-05,3.2e-05,5.3e-05,3.5e-05,3.1e-05,1.5e-05,2.5e-05,6e-06,1e-05,1.5e-05,3.5e-05,1.5e-05,6e-05,1.2e-05,2.2e-05,4.5e-05,3.4e-05,1.5e-05,2.4e-05,4.9e-05,2.1e-05,2.2e-05,2.1e-05,1.7e-05,5.1e-05,5.4e-05,3.7e-05,2e-05,2.7e-05
3.4e-05,4.4e-05,8.4e-05,3.3e-05,5.7e-05,4.2e-05,8.2e-05,9e-05,8.1e-05,5.6e-05,7.9e-05,4.4e-05,6.8e-05,0.000112,0.000122,6e-05,4.6e-05,6.4e-05,1.6e-05,4e-05,6.6e-05,7.2e-05,5e-05,7.6e-05,6.4e-05,2.9e-05,6.2e-05,8.8e-05,4.9e-05,1.6e-05,7.8e-05,0.000106,0.000107,8.4e-05,4.5e-05,5e-05,8.1e-05,9.3e-05,2.8e-05,4.5e-05,7.1e-05,5.3e-05,1.9e-05,7.1e-05,6.6e-05,2e-06,0.000101,4.4e-05,7e-06,1.8e-05,1.2e-05,3e-05,5e-05,4.3e-05,3.8e-05,1.7e-05,3.8e-05,7.3e-05,4.2e-05,3e-05,3.6e-05,4.3e-05,4.8e-05,7e-06,5e-05,3.7e-05,4.6e-05,4.2e-05,2.5e-05,2.9e-05,6.8e-05,3.8e-05,4e-06,2.7e-05,7e-05,2.5e-05,3.6e-05,2.4e-05,7.6e-05,2.5e-05,4.5e-05,5.4e-05,4.3e-05,4.9e-05,7.3e-05,1.2e-05,2.1e-05,1.4e-05,3.8e-05,3e-05,2.4e-05,3.4e-05,8.6e-05,1.2e-05,5.9e-05,2.5e-05,4.7e-05,1.7e-05,2.2e-05,2.8e-05,1.9e-05,3e-06,3.1e-05,4.9e-05,5e-05,4e-06,2.9e-05,4.3e-05,4.6e-05,2.7e-05,2.2e-05,3.9e-05,1.8e-05,1.2e-05,1.3e-05,3.7e-05,2.3e-05,4.4e-05,1.9e-05,1.8e-05,2.5e-05
5.2e-05,3.7e-05,6.6e-05,6.1e-05,0.000105,9.8e-05,0.000108,0.000151,2.5e-05,5.6e-05,1.6e-05,2.6e-05,9e-06,5.6e-05,6e-05,3.9e-05,5e-05,6.4e-05,8.3e-05,7.3e-05,8.3e-05,0.000136,3.4e-05,5.9e-05,7.2e-05,3.4e-05,6.7e-05,8.5e-05,5.3e-05,6.9e-05,6.7e-05,2.5e-05,4.2e-05,5.2e-05,4.7e-05,6.2e-05,8e-05,0.000107,0.000142,6.3e-05,4.3e-05,1.6e-05,8e-05,0.000102,5.4e-05,3.5e-05,0.000155,0.000123,5.7e-05,1.7e-05,2.8e-05,5.2e-05,8.1e-05,0.00011,0.000127,8.7e-05,5.3e-05,7.1e-05,7.2e-05,1e-05,5.1e-05,2.2e-05,7.6e-05,2.4e-05,6.6e-05,2.6e-05,2.2e-05,5.5e-05,4.2e-05,4.9e-05,0.000105,1.4e-05,5e-06,3.1e-05,6.2e-05,7e-05,1.3e-05,1.8e-05,3.9e-05,9e-06,8.5e-05,4.2e-05,2.2e-05,3.9e-05,0.000121,2.1e-05,5.7e-05,3.7e-05,4.7e-05,1.7e-05,5.5e-05,6e-06,0.000103,0.00011,0.000108,3.9e-05,7e-05,2.6e-05,5.3e-05,2.2e-05,1.1e-05,2.7e-05,5.4e-05,7.4e-05,5.2e-05,2.8e-05,3.8e-05,6.4e-05,2e-05,7.1e-05,4e-05,6.4e-05,2.2e-05,1.4e-05,3e-06,1.7e-05,2.6e-05,6e-05,2.7e-05,1.7e-05,5.8e-05
4.8e-05,8.7e-05,0.000113,3.5e-05,7.4e-05,4.2e-05,2.1e-05,2.6e-05,6.9e-05,4.8e-05,5.4e-05,6.4e-05,3.2e-05,1.5e-05,5.9e-05,5.5e-05,3.1e-05,8e-05,7e-05,7.6e-05,4e-05,7.5e-05,5.1e-05,4.7e-05,6.4e-05,4.9e-05,0.000123,4.3e-05,8e-05,1.8e-05,8.9e-05,6.5e-05,4e-05,5.2e-05,4.8e-05,0.000101,0.000121,0.000119,9.2e-05,4.5e-05,2.9e-05,5.1e-05,0.000114,3.7e-05,0.000145,0.000136,8.1e-05,3.4e-05,3.9e-05,3e-05,6.3e-05,5.2e-05,8.3e-05,3.2e-05,3.2e-05,1.1e-05,1.1e-05,5.2e-05,3.8e-05,7.9e-05,6.4e-05,4.4e-05,0.00012,7.6e-05,6.9e-05,8e-05,3.4e-05,3.1e-05,7.2e-05,8.8e-05,9.8e-05,5e-05,2e-06,2.7e-05,2.9e-05,2.4e-05,1.5e-05,4.3e-05,7.9e-05,3e-05,0.000112,0.000126,0.00012,8.7e-05,8.4e-05,5.9e-05,4.2e-05,6.4e-05,2.8e-05,5.1e-05,6.3e-05,6.9e-05,6.2e-05,9.7e-05,9.5e-05,0.000103,1.1e-05,6.6e-05,9.8e-05,9e-06,4.1e-05,7.7e-05,0.000107,5.7e-05,7.2e-05,2.2e-05,3.4e-05,3e-05,6.5e-05,0.000118,0.000113,7.1e-05,6.2e-05,8.1e-05,5.3e-05,4e-06,3.7e-05,9.1e-05,9.1e-05,4.9e-05,2.9e-05
2.2e-05,6.1e-05,1e-04,5.8e-05,1.1e-05,2.3e-05,3.1e-05,7e-05,3.7e-05,3.2e-05,8.6e-05,4.2e-05,4.3e-05,6.6e-05,5e-05,5.9e-05,1.4e-05,4.8e-05,3.5e-05,5e-06,4.3e-05,3.7e-05,2.5e-05,5e-05,3.6e-05,4e-06,7.6e-05,3.5e-05,6.1e-05,1.9e-05,4.4e-05,1.7e-05,2.5e-05,5e-05,6.7e-05,5.4e-05,0.000103,2.8e-05,5.9e-05,2.5e-05,1.8e-05,2.6e-05,5.5e-05,3.8e-05,8.7e-05,6e-05,4.7e-05,4.1e-05,7.5e-05,8.1e-05,1e-05,4.4e-05,2.5e-05,2.7e-05,4e-06,3.2e-05,6e-06,6e-05,4.8e-05,1e-05,4.3e-05,1.8e-05,8.4e-05,3.2e-05,6e-06,1.5e-05,2.4e-05,5.4e-05,5.2e-05,9e-06,3.4e-05,2.4e-05,2.1e-05,1.3e-05,4.2e-05,6e-06,1.5e-05,4.2e-05,6.6e-05,3.4e-05,7.2e-05,4.4e-05,8.7e-05,2.8e-05,2.9e-05,2e-05,3.9e-05,3.4e-05,2.3e-05,5.7e-05,5e-06,3.2e-05,5.8e-05,4.3e-05,2e-05,5.2e-05,3.7e-05,6.2e-05,1.9e-05,5e-05,8.2e-05,6e-05,1.7e-05,1.7e-05,2e-05,2.2e-05,1.2e-05,5.2e-05,8.3e-05,9.7e-05,1e-05,2.9e-05,5.3e-05,6.2e-05,3.2e-05,2.7e-05,4.5e-05,3.4e-05,2e-05,2.3e-05,2.2e-05
6.8e-05,3e-05,8.9e-05,6.3e-05,3.5e-05,9e-06,3.5e-05,3.2e-05,3e-06,3e-05,6.9e-05,3.7e-05,3.3e-05,3.4e-05,1e-04,5.6e-05,2.5e-05,1e-05,4e-05,3.7e-05,3.3e-05,6.6e-05,2.5e-05,1.8e-05,3e-05,3.5e-05,8.7e-05,8.8e-05,5.8e-05,2.4e-05,2.3e-05,2.9e-05,1e-05,5.7e-05,1.4e-05,7.2e-05,0.000104,8.6e-05,0.000109,3.7e-05,4.7e-05,1.4e-05,2.7e-05,7.4e-05,8.1e-05,8.4e-05,4.6e-05,1.8e-05,6.2e-05,4.7e-05,5.8e-05,1.5e-05,1.4e-05,1.7e-05,3.9e-05,2.5e-05,3.5e-05,2.5e-05,2.7e-05,4e-06,1.2e-05,1.6e-05,6.5e-05,4.1e-05,1.7e-05,1.7e-05,1e-05,3.1e-05,6.3e-05,4.1e-05,7.2e-05,2.8e-05,3.3e-05,2e-05,2.7e-05,4e-05,3.5e-05,4.3e-05,4.6e-05,4.4e-05,1.9e-05,8e-05,3e-05,1.2e-05,5.2e-05,4.4e-05,4.1e-05,5.7e-05,2.6e-05,2.6e-05,2.8e-05,1.2e-05,6.3e-05,1.6e-05,3.2e-05,5.8e-05,8.3e-05,2e-05,5.5e-05,4.8e-05,6.1e-05,6.6e-05,4e-06,1.3e-05,7e-05,2.4e-05,1.9e-05,2.5e-05,5.3e-05,4.8e-05,4.3e-05,8e-06,2.6e-05,6.3e-05,8e-06,3.9e-05,5.3e-05,4.2e-05,3.7e-05,6e-06,1.2e-05
7.8e-05,6.3e-05,5.8e-05,0.000108,7.6e-05,6.7e-05,0.00011,0.000115,7e-05,4.2e-05,6.2e-05,4.6e-05,3.6e-05,5.5e-05,7.9e-05,3e-05,3.5e-05,4.1e-05,1.6e-05,1.6e-05,3.8e-05,0.000114,4.1e-05,8e-05,2.1e-05,8.1e-05,4.7e-05,5.8e-05,2.6e-05,5.1e-05,4.8e-05,2.7e-05,2.7e-05,0.000101,6.5e-05,4e-05,9e-05,5.3e-05,4.8e-05,2.9e-05,4.3e-05,4.4e-05,2.3e-05,8e-05,5e-06,2e-05,3.5e-05,7e-05,5.1e-05,2e-05,5.5e-05,6.1e-05,3.7e-05,2.9e-05,3e-05,3.2e-05,4.6e-05,3.5e-05,3.8e-05,1.5e-05,3.5e-05,6e-06,4.7e-05,4e-05,2.3e-05,2.3e-05,1.9e-05,8e-06,4.3e-05,5e-06,4.9e-05,1.5e-05,4.7e-05,1.5e-05,3.6e-05,6.9e-05,4.1e-05,4.6e-05,4.2e-05,0.000102,6.8e-05,1.8e-05,7.4e-05,1.4e-05,0.000108,8.1e-05,1.8e-05,2.2e-05,3.4e-05,4.9e-05,2.9e-05,3.8e-05,2e-05,2.7e-05,2.2e-05,0.000123,5.3e-05,7.6e-05,6.1e-05,3.9e-05,2.6e-05,6.1e-05,5.9e-05,7.1e-05,0.000133,3.9e-05,5e-05,4.4e-05,2.4e-05,3.5e-05,3.1e-05,4.7e-05,6.7e-05,4.3e-05,6.4e-05,5.3e-05,0.00012,2.6e-05,5.8e-05,2.9e-05,1.1e-05
9.8e-05,5.1e-05,8.4e-05,0.000128,3.6e-05,7.7e-05,6.9e-05,7.1e-05,0.000103,9.5e-05,1.4e-05,2.6e-05,4.4e-05,7.7e-05,4.9e-05,9.5e-05,9.5e-05,0.000136,0.000101,4.9e-05,2.2e-05,0.000132,9.4e-05,0.000147,0.000153,0.000182,8.5e-05,0.000162,8.1e-05,8.3e-05,7.6e-05,2.3e-05,4.5e-05,9.1e-05,8.4e-05,5.3e-05,6.4e-05,3.7e-05,2.7e-05,3e-05,1.5e-05,3.1e-05,8.1e-05,0.000118,3.8e-05,4.7e-05,5.1e-05,9.5e-05,6.5e-05,4e-05,6.6e-05,5.2e-05,1.7e-05,7e-06,1.9e-05,1.2e-05,1.9e-05,1.8e-05,3.7e-05,1.8e-05,3.5e-05,3e-05,4.6e-05,6.1e-05,3.9e-05,1.7e-05,1.2e-05,2.3e-05,3.1e-05,4.3e-05,1.4e-05,4.9e-05,5e-05,4.2e-05,5.1e-05,5.2e-05,5.7e-05,7e-05,0.00013,4.7e-05,4.4e-05,6.7e-05,6.2e-05,8e-05,7.8e-05,3.8e-05,1.6e-05,2.7e-05,5.3e-05,2.7e-05,3.7e-05,7.2e-05,8.6e-05,4.4e-05,5.6e-05,0.000117,0.000147,9.3e-05,8.5e-05,0.000109,5.4e-05,2.6e-05,2.9e-05,5.4e-05,4.3e-05,3.1e-05,6.7e-05,0.000119,3.5e-05,1.7e-05,5.7e-05,4.4e-05,4.9e-05,7.2e-05,5.3e-05,5.5e-05,0.000105,9.8e-05,9.6e-05,3.4e-05,1.3e-05
4.5e-05,3e-05,0.000106,0.000115,0.000111,9e-05,0.000155,0.000129,0.000191,0.000159,0.000127,9.3e-05,5.4e-05,3.5e-05,0.000108,0.000125,3.5e-05,5.8e-05,4.5e-05,2.4e-05,3.6e-05,5.9e-05,4.4e-05,0.000101,7.7e-05,9.9e-05,0.000152,9e-05,8.4e-05,3.7e-05,6e-06,5.4e-05,2.9e-05,6.8e-05,8.5e-05,9e-06,7.6e-05,3.8e-05,8.3e-05,4.6e-05,4.9e-05,1.5e-05,6.3e-05,4e-05,5.6e-05,3.2e-05,2.6e-05,6.7e-05,2.4e-05,2e-05,2.8e-05,1.5e-05,1.3e-05,1.6e-05,1.6e-05,1.1e-05,2.7e-05,8e-06,5e-06,2.2e-05,2.6e-05,4.8e-05,2.6e-05,4.7e-05,1.2e-05,1.4e-05,1.8e-05,2.8e-05,8e-06,1.6e-05,1.9e-05,2.9e-05,1.8e-05,9e-06,6e-05,8e-06,4.8e-05,1.8e-05,9.8e-05,1e-05,3.3e-05,3.6e-05,5.5e-05,2e-05,4.1e-05,7.8e-05,2.8e-05,2.3e-05,7.3e-05,5.2e-05,3.1e-05,8.9e-05,2.9e-05,2.8e-05,3.9e-05,2.2e-05,6.8e-05,1.9e-05,1.7e-05,5.3e-05,4.8e-05,6.4e-05,7.4e-05,4.1e-05,5.4e-05,4.9e-05,5.1e-05,7.3e-05,5.9e-05,4.3e-05,6.6e-05,3.4e-05,3.9e-05,3.4e-05,5e-05,3.9e-05,3.1e-05,5e-05,8.3e-05,8.3e-05,5.2e-05
0.000107,0.000105,4.7e-05,8.5e-05,3e-05,0.000105,9.7e-05,5.7e-05,0.000117,2.7e-05,5e-05,9.3e-05,4.7e-05,4.1e-05,9.7e-05,3.4e-05,7.1e-05,5.8e-05,2.9e-05,3.1e-05,3.5e-05,8e-06,1.7e-05,4.6e-05,4.6e-05,4.5e-05,7.8e-05,3.4e-05,2.2e-05,6e-06,1.2e-05,3.3e-05,4.6e-05,3.3e-05,4.8e-05,5.6e-05,5.9e-05,3.2e-05,8.5e-05,2.1e-05,2.9e-05,1.4e-05,2.3e-05,2.7e-05,4.9e-05,5.4e-05,2.9e-05,5.6e-05,3.1e-05,2.6e-05,3.5e-05,2.6e-05,1.8e-05,2.2e-05,2.3e-05,1.7e-05,1.5e-05,4.3e-05,4e-06,1.8e-05,9e-06,5.5e-05,5.9e-05,3.9e-05,1.7e-05,1.8e-05,3e-06,2.4e-05,3.5e-05,2.3e-05,3.7e-05,6.9e-05,2.7e-05,5e-05,6.3e-05,4.3e-05,6.7e-05,2e-06,0.000117,0.000117,0.00012,9.6e-05,0.000117,0.000107,6.8e-05,4.1e-05,0.000107,6.5e-05,2.2e-05,4.1e-05,3.9e-05,8.3e-05,0.000102,9e-05,3e-06,4.5e-05,8e-06,1.2e-05,6.9e-05,8.8e-05,0.000108,2.7e-05,7.7e-05,9.5e-05,4e-05,5.3e-05,6.8e-05,0.000134,0.000162,0.000128,4.9e-05,8.2e-05,7.1e-05,3.8e-05,6.8e-05,5.9e-05,4e-05,1.3e-05,6.1e-05,7.6e-05,7.3e-05
3.7e-05,3.5e-05,2.2e-05,7.5e-05,2.1e-05,4.8e-05,1.5e-05,5.6e-05,6e-05,6.2e-05,2.9e-05,3.8e-05,1e-06,4e-06,7e-05,2.5e-05,3.2e-05,4.6e-05,1.2e-05,1.9e-05,5e-06,3.5e-05,1.1e-05,5.4e-05,4.7e-05,2.4e-05,6.1e-05,6.2e-05,3.1e-05,4e-05,4.6e-05,3.2e-05,2.8e-05,2.5e-05,4.3e-05,1e-05,7.3e-05,2.3e-05,4e-05,2.3e-05,2.7e-05,2.9e-05,1.6e-05,4.4e-05,4e-05,3.2e-05,3.4e-05,4.6e-05,2.3e-05,2.1e-05,4.4e-05,3.8e-05,3.6e-05,9e-06,1.3e-05,2.3e-05,5e-06,2.6e-05,3.5e-05,1.9e-05,1.1e-05,7.5e-05,1.5e-05,5.9e-05,2.7e-05,3.2e-05,2e-06,7e-06,3.8e-05,6.6e-05,7.5e-05,9.8e-05,6.3e-05,5.8e-05,1.2e-05,4.9e-05,9.8e-05,0.000111,0.000179,0.000185,2.1e-05,7.9e-05,6.4e-05,3.1e-05,2.3e-05,1.4e-05,7.7e-05,7.4e-05,5.2e-05,2.2e-05,8e-06,7.1e-05,0.000138,1e-05,2.3e-05,6.1e-05,7.4e-05,5.3e-05,5.5e-05,0.000148,0.00012,0.000102,0.000107,5.8e-05,5.1e-05,7.3e-05,5.9e-05,6.4e-05,6.8e-05,3.4e-05,7.2e-05,8.5e-05,3.8e-05,5.3e-05,6.3e-05,6.3e-05,4.1e-05,4.5e-05,8.4e-05,3.2e-05,4.4e-05
1.3e-05,8e-06,2.1e-05,5e-05,2.3e-05,3.2e-05,3.8e-05,4.3e-05,3.1e-05,3.1e-05,2.5e-05,4.8e-05,3.2e-05,2.8e-05,4.5e-05,2.7e-05,4.7e-05,6.4e-05,1.9e-05,8e-06,1.5e-05,3.4e-05,4e-06,4.1e-05,4.5e-05,6e-05,1.6e-05,6.3e-05,2.5e-05,1e-05,1.6e-05,2.4e-05,6.2e-05,3e-06,8e-06,2.8e-05,9.8e-05,5.1e-05,6.6e-05,1.3e-05,2e-05,1.2e-05,3.2e-05,3.1e-05,3.9e-05,2.3e-05,4e-05,3.6e-05,3e-05,1.9e-05,3e-05,5.4e-05,1.9e-05,1e-05,2.7e-05,1.4e-05,1.4e-05,2e-05,3.1e-05,6e-05,4.5e-05,9e-05,8.7e-05,2.3e-05,5.8e-05,3.3e-05,3e-06,3.4e-05,4.5e-05,5.5e-05,5.2e-05,5.4e-05,4.8e-05,5.7e-05,8.8e-05,5e-06,5.9e-05,3.5e-05,6e-05,1.5e-05,3.1e-05,8e-05,4.1e-05,4.2e-05,3.3e-05,1.8e-05,4.9e-05,6e-05,3.7e-05,3.5e-05,3.4e-05,6.1e-05,5.2e-05,5e-05,1.8e-05,6.5e-05,4.9e-05,5e-06,2.3e-05,8.5e-05,3.5e-05,4e-05,4e-05,2.8e-05,4.2e-05,1.6e-05,2.3e-05,3e-05,5.1e-05,4.1e-05,2.9e-05,3.6e-05,2.3e-05,5.8e-05,2e-05,1.5e-05,2.6e-05,5.7e-05,2.4e-05,1.8e-05,5.3e-05
3.1e-05,3.3e-05,2.7e-05,2.9e-05,3.4e-05,4e-05,6.2e-05,4.7e-05,3.7e-05,2.2e-05,3.3e-05,4.3e-05,3.7e-05,1.1e-05,5.3e-05,6.3e-05,7.6e-05,0.000108,2.7e-05,4.3e-05,3.3e-05,3.3e-05,3e-06,5.6e-05,4e-06,5.7e-05,5.8e-05,7.5e-05,2.2e-05,1.6e-05,4.5e-05,1.3e-05,3.9e-05,1.2e-05,1.2e-05,4.1e-05,0.00012,4.7e-05,6.6e-05,1.3e-05,2.7e-05,5.2e-05,4.9e-05,4.3e-05,3.9e-05,2.4e-05,9e-06,5.5e-05,1.1e-05,3.7e-05,5.2e-05,5.2e-05,4.5e-05,5.2e-05,8e-06,1.7e-05,2.7e-05,2.8e-05,6.1e-05,1.5e-05,2e-05,4.5e-05,3.3e-05,5e-06,1.9e-05,3e-05,4e-05,4.1e-05,3.4e-05,4.3e-05,5.4e-05,1.1e-05,2.4e-05,2.4e-05,5.8e-05,2e-05,2.9e-05,1e-05,3.9e-05,7e-05,3.7e-05,5.2e-05,4.5e-05,2.2e-05,4.3e-05,1.9e-05,3.1e-05,1.8e-05,2.5e-05,3e-06,1.7e-05,2.9e-05,2.3e-05,2.1e-05,2.8e-05,5.6e-05,5.7e-05,9e-06,4e-06,6.6e-05,1e-05,1e-05,1.9e-05,3.9e-05,4.3e-05,2.4e-05,3.8e-05,9e-06,4e-06,2.2e-05,1.7e-05,2.4e-05,1.1e-05,2.8e-05,2.8e-05,9e-06,1.5e-05,6.4e-05,4e-05,2.4e-05,3.8e-05
1.9e-05,6e-05,7e-05,2.5e-05,8.2e-05,6.2e-05,9.5e-05,0.00012,0.000102,8.9e-05,7e-06,7.4e-05,5.4e-05,8.3e-05,7.1e-05,8.4e-05,8.6e-05,1.6e-05,5.9e-05,3.9e-05,3.4e-05,6e-06,7e-06,6.6e-05,2.2e-05,6.1e-05,7.6e-05,0.000115,6.3e-05,2.9e-05,6.7e-05,4e-05,3.8e-05,3.7e-05,2e-05,6.6e-05,6.8e-05,0.000108,8.9e-05,2.1e-05,4.1e-05,5.7e-05,1.7e-05,5e-05,5.2e-05,6e-06,1.7e-05,2.1e-05,4.3e-05,4.9e-05,3e-05,1.2e-05,3.7e-05,5.6e-05,2.8e-05,2e-05,8e-06,2.2e-05,6e-05,5.8e-05,4.7e-05,4.5e-05,7.1e-05,9e-06,1.4e-05,4e-05,2.4e-05,5.8e-05,7.9e-05,6.6e-05,6.5e-05,4.1e-05,2.2e-05,2.7e-05,1.2e-05,1.8e-05,2.5e-05,2e-05,5.8e-05,3.5e-05,3.9e-05,4.3e-05,3.3e-05,1.5e-05,3.1e-05,1.2e-05,7e-06,1.4e-05,3.7e-05,1.4e-05,1.8e-05,3e-05,5.6e-05,3.6e-05,3.4e-05,3.6e-05,4.7e-05,2.5e-05,2.7e-05,6e-05,3e-05,9e-06,2.7e-05,3e-05,3.1e-05,2.8e-05,3e-05,5e-05,9e-06,2.4e-05,2.4e-05,3.1e-05,2.8e-05,4.6e-05,2.9e-05,1.7e-05,2.7e-05,4.2e-05,1.3e-05,3e-06,4e-05
6.4e-05,7.2e-05,6.9e-05,0.000117,2.5e-05,4.7e-05,6e-05,9.4e-05,0.000141,1.4e-05,3.9e-05,8.5e-05,8.9e-05,0.00011,6.9e-05,2.5e-05,2.2e-05,2.4e-05,4.9e-05,7.6e-05,4.9e-05,3.4e-05,2.1e-05,4.6e-05,8.5e-05,1.9e-05,0.000117,6.1e-05,4.6e-05,3.6e-05,4.3e-05,4.8e-05,4e-05,4e-05,3.4e-05,3.7e-05,8.9e-05,9.6e-05,2.6e-05,2.7e-05,3.7e-05,4.2e-05,4.4e-05,2.4e-05,5.3e-05,4.2e-05,3.3e-05,6.9e-05,5.9e-05,6.3e-05,4.5e-05,4.3e-05,3.2e-05,1.2e-05,2.3e-05,4.7e-05,4.5e-05,2.4e-05,5.3e-05,6.5e-05,2.5e-05,4.3e-05,7e-05,4.6e-05,2.6e-05,2.6e-05,4e-05,2.2e-05,2.7e-05,1.5e-05,3.5e-05,4.2e-05,9e-06,3.1e-05,6.5e-05,1.2e-05,1.2e-05,4.4e-05,4.4e-05,9e-05,2.4e-05,5.4e-05,5.4e-05,1.6e-05,3.1e-05,9e-06,3e-05,2e-05,3.2e-05,3e-05,1.5e-05,5e-05,2.7e-05,3.7e-05,1.5e-05,1.8e-05,2.7e-05,1.4e-05,4e-06,2.4e-05,1.1e-05,2.2e-05,3.4e-05,5.1e-05,4.4e-05,1.1e-05,2.1e-05,1e-05,4.7e-05,3.5e-05,1.5e-05,3.5e-05,2.7e-05,1.3e-05,1.7e-05,9e-06,2.4e-05,5e-06,7e-06,1e-05,6.3e-05
1.4e-05,6e-05,2.8e-05,6.1e-05,2.4e-05,3.1e-05,2.9e-05,2.1e-05,4.2e-05,3.5e-05,3.6e-05,5.4e-05,4.4e-05,3.9e-05,3.5e-05,1.7e-05,1.8e-05,1.2e-05,2e-05,1.4e-05,1.9e-05,7.6e-05,2.6e-05,1.7e-05,6.5e-05,4.7e-05,8e-05,6.1e-05,2.6e-05,3.3e-05,1.5e-05,6e-06,3.8e-05,1.1e-05,1.2e-05,3.4e-05,8.5e-05,2.4e-05,7.8e-05,9e-06,3.1e-05,2.1e-05,1.9e-05,3.2e-05,2.5e-05,1.7e-05,6.6e-05,1.3e-05,1.7e-05,2.2e-05,2.8e-05,2.6e-05,2.1e-05,4e-06,2.3e-05,2e-05,1.2e-05,2e-05,3e-05,2.7e-05,2.3e-05,1.9e-05,4.1e-05,6e-06,1e-05,1.4e-05,1.9e-05,1.8e-05,1.1e-05,2.3e-05,4.4e-05,3.1e-05,1.3e-05,1.2e-05,4.4e-05,2.3e-05,1.8e-05,2.5e-05,1.8e-05,6.3e-05,2e-05,3.3e-05,4.6e-05,1.3e-05,3.2e-05,1.4e-05,2.7e-05,6e-06,1.9e-05,4e-06,1e-05,5.1e-05,3e-05,1.3e-05,1e-05,1.9e-05,4.1e-05,2.2e-05,1.5e-05,3e-05,9e-06,1.4e-05,1.5e-05,3.8e-05,4.5e-05,2.4e-05,2e-06,1e-05,2.5e-05,2.1e-05,1.8e-05,1.8e-05,1.5e-05,2.4e-05,0,1e-05,8e-06,2.5e-05,2.4e-05,1.6e-05,4.8e-05
2.3e-05,4.1e-05,3.1e-05,6.3e-05,2e-05,2.6e-05,2.5e-05,6e-06,3.8e-05,2.5e-05,1.8e-05,4.6e-05,2.3e-05,3.3e-05,4.1e-05,2.2e-05,8e-06,7e-06,6e-06,1.3e-05,1e-05,4e-05,8e-06,3e-05,3.1e-05,2e-05,7.5e-05,3.6e-05,1.1e-05,2.5e-05,1e-05,2.2e-05,2.8e-05,5e-06,1.4e-05,3.8e-05,8.3e-05,3.6e-05,6e-05,7e-06,2.5e-05,1.9e-05,2.6e-05,2.8e-05,2.5e-05,3e-05,5.1e-05,2.9e-05,2e-05,1.6e-05,2.2e-05,1.6e-05,1.6e-05,7e-06,1.1e-05,8e-06,1.5e-05,1.9e-05,1.5e-05,1.2e-05,8e-06,1e-05,3.7e-05,1.5e-05,1.7e-05,1.3e-05,2e-06,1e-05,7e-06,6e-06,4.1e-05,1e-05,7e-06,1e-05,3.5e-05,1.1e-05,1.3e-05,1.3e-05,2.5e-05,5.8e-05,1.5e-05,3.3e-05,4.9e-05,6e-06,2.2e-05,2e-06,1.6e-05,3e-06,6e-06,5e-06,4e-06,4.3e-05,2.2e-05,1.8e-05,9e-06,2.4e-05,3.9e-05,4e-06,4e-06,3e-05,8e-06,6e-06,7e-06,2.5e-05,4.5e-05,1.5e-05,7e-06,1.1e-05,1.6e-05,2.4e-05,1.1e-05,1.7e-05,8e-06,2.5e-05,8e-06,5e-06,1.4e-05,2.7e-05,2.4e-05,3e-06,3.6e-05
1.8e-05,2.9e-05,2.6e-05,5.7e-05,3.3e-05,2.1e-05,1e-05,1.6e-05,4.6e-05,2.8e-05,1.2e-05,4.5e-05,2.3e-05,2.5e-05,4.3e-05,1.3e-05,1.2e-05,1.2e-05,6e-06,1.1e-05,5e-06,4.4e-05,4e-06,2.7e-05,3.1e-05,1.1e-05,5.5e-05,3.7e-05,1.2e-05,2e-05,1.3e-05,2.1e-05,3.9e-05,1e-06,1.7e-05,3e-05,7e-05,2.9e-05,6e-05,1e-05,2.9e-05,1.8e-05,2.6e-05,2.3e-05,2.7e-05,3.6e-05,4.4e-05,2.6e-05,1.3e-05,1.9e-05,2.3e-05,1.6e-05,1e-05,8e-06,1.5e-05,6e-06,1.6e-05,1.6e-05,1.2e-05,7e-06,1.2e-05,1e-05,4e-05,1.2e-05,1.8e-05,1.4e-05,5e-06,9e-06,3e-06,6e-06,4e-05,1.8e-05,2e-06,1.1e-05,3.1e-05,1.3e-05,1.4e-05,1e-05,2.6e-05,3.8e-05,1.1e-05,3.3e-05,3.8e-05,5e-06,2.5e-05,4e-06,1.6e-05,4e-06,5e-06,4e-06,6e-06,3.6e-05,1.8e-05,1.1e-05,1.1e-05,2.5e-05,2.8e-05,7e-06,5e-06,3.1e-05,6e-06,5e-06,6e-06,1.8e-05,4.5e-05,1.7e-05,2e-06,1e-05,7e-06,3.2e-05,1e-06,2e-05,7e-06,2.1e-05,8e-06,9e-06,1.2e-05,2.9e-05,2.2e-05,2e-06,3.4e-05
1.8e-05,2.9e-05,2.6e-05,5.6e-05,3e-05,1.9e-05,1.2e-05,1.9e-05,4.9e-05,3.2e-05,1.4e-05,4.1e-05,1.7e-05,2.4e-05,4.4e-05,2e-05,9e-06,1.4e-05,7e-06,1.1e-05,5e-06,4.1e-05,3e-06,3.2e-05,2.6e-05,9e-06,5.3e-05,3.5e-05,1e-05,1.9e-05,1.7e-05,2.2e-05,4e-05,4e-06,1.6e-05,3.4e-05,7e-05,2.9e-05,6e-05,1.1e-05,2.6e-05,1.6e-05,2.4e-05,2.4e-05,2.8e-05,3e-05,3.9e-05,3e-05,1.5e-05,1.8e-05,2.3e-05,9e-06,1.2e-05,4e-06,1.7e-05,2e-06,1.4e-05,1.8e-05,8e-06,3e-06,1e-05,1.1e-05,4e-05,1.3e-05,1.5e-05,1.4e-05,5e-06,1.2e-05,3e-06,7e-06,3.4e-05,1.6e-05,5e-06,5e-06,3.5e-05,1.3e-05,1.3e-05,7e-06,2.3e-05,4.4e-05,1.6e-05,3.7e-05,4.2e-05,6e-06,2.6e-05,6e-06,1.1e-05,5e-06,3e-06,2e-06,6e-06,3.6e-05,2.1e-05,1.4e-05,1.1e-05,2.2e-05,2.8e-05,4e-06,2e-06,3.2e-05,4e-06,0,7e-06,1.8e-05,3.9e-05,1.2e-05,2e-06,1.2e-05,2e-06,2.9e-05,2e-06,2.2e-05,2e-06,2.2e-05,1.2e-05,1.1e-05,1.7e-05,2.6e-05,2e-05,5e-06,3.2e-05
