-2.1e-05,-3e-06,1.1e-05,-0.000217,-0.003669,-0.003883,-0.006284,-0.07011,-0.170351,-0.18974,-0.168448,-0.159987,-0.172948,-0.12719,-0.084559,-0.061929,-0.021639,-0.008365,-0.003099,-0.001204,-0.000423,-0.000484,-0.000828,-0.000501,-0.000204,-5.6e-05,-4.6e-05,-4.1e-05
-1.3e-05,-5e-06,2e-06,0.000181,0.002893,0.001962,0.00557,0.057912,0.102092,0.090466,0.113686,0.1465,0.086678,0.091108,0.072207,0.045507,0.019834,0.010051,0.003289,0.000954,0.000179,0.000235,0.000274,3e-06,-4.2e-05,3.8e-05,1.7e-05,9e-06
9e-06,-1e-06,1.3e-05,-5.4e-05,-0.000913,-0.000456,-0.002499,-0.001696,0.011355,0.00685,-0.019278,-0.006518,-0.004907,-0.023697,-0.00953,-0.003113,-0.00262,-0.00052,0.000352,0.000477,0.000475,0.000297,0.000167,0.000115,3.8e-05,-2e-06,4.8e-05,4.9e-05
1.8e-05,2e-06,3e-06,-4e-05,-0.000849,-0.000114,-0.003745,-0.051226,-0.079297,-0.068408,-0.107497,-0.12729,-0.071362,-0.065258,-0.055269,-0.038656,-0.01772,-0.009154,-0.003142,-0.000717,0.000369,0.000323,0.000249,0.000203,0.000103,2.7e-05,7.2e-05,8.3e-05
2e-06,1e-06,1e-05,0.000201,0.003251,0.00291,0.003668,0.031756,0.092362,0.130058,0.165523,0.137289,0.13282,0.121019,0.073551,0.053782,0.020671,0.007514,0.002066,0.000476,0.000199,0.000191,0.000232,0.000113,3.7e-05,4.3e-05,3.2e-05,4.5e-05
-1.8e-05,-6e-06,-4e-06,-0.000132,-0.002328,-0.002592,-0.003373,0.000294,3.2e-05,0.006429,0.051211,0.037913,0.012593,-0.003715,0.008505,0.008869,0.005459,0.00278,0.001067,0.000183,-0.000181,-0.000297,-0.00048,-0.000321,-0.000153,-5.4e-05,-5.6e-05,-5.3e-05
-7e-06,-5e-06,4e-06,-7.3e-05,-0.001931,-0.002092,-0.002344,-0.036968,-0.108792,-0.152874,-0.174049,-0.152751,-0.162669,-0.126692,-0.080857,-0.065847,-0.024018,-0.009198,-0.003184,-0.000864,8.8e-05,4.9e-05,-0.000177,-0.000112,-2.2e-05,-1e-05,-5e-06,-2e-05
1.4e-05,1e-06,6e-06,0.00015,0.002904,0.002931,0.004835,0.026445,0.057249,0.05211,0.039791,0.063479,0.044591,0.053744,0.029337,0.022902,0.008738,0.003473,0.001078,0.000538,0.000572,0.000484,0.000498,0.000294,0.000126,5.7e-05,7.2e-05,6.2e-05
1.2e-05,4e-06,4e-06,-3.3e-05,-0.000321,0.000196,9.4e-05,0.016601,0.062554,0.086916,0.087546,0.089023,0.112244,0.071363,0.050802,0.041973,0.013077,0.005345,0.0023,0.000818,0.00014,4.1e-05,0.000145,7.9e-05,-1.3e-05,-1.4e-05,1.6e-05,2.7e-05
-7e-06,3e-06,8e-06,-1.7e-05,-0.000879,-0.000874,-0.001826,-0.030264,-0.066521,-0.079094,-0.09772,-0.098832,-0.055382,-0.049551,-0.040611,-0.036845,-0.014744,-0.006275,-0.002263,-0.00086,-0.000375,-0.000139,-0.000174,-0.00013,-5.2e-05,-3e-06,-2.4e-05,-9e-06
-1.7e-05,2e-06,3e-06,2e-05,0.000821,0.000377,7.1e-05,0.000588,-0.010717,0.00094,0.03092,0.008868,-0.016898,0.004147,-0.008356,-0.005904,-0.000477,-0.000402,-0.000615,-0.000325,-6e-05,8e-06,-0.000297,-0.000176,-3.4e-05,1e-06,-2.1e-05,-1.6e-05
0,4e-06,6e-06,-5.6e-05,-0.001234,-0.001327,-0.000995,0.017774,0.036783,0.064878,0.099516,0.077893,0.031314,0.020017,0.032757,0.030245,0.013417,0.006034,0.002506,0.000988,0.00028,5.2e-05,-5e-06,4.2e-05,4.4e-05,-1e-05,2e-06,-1e-05
1.5e-05,4e-06,4e-06,5.5e-05,0.000159,0.000314,-9.8e-05,-0.022685,-0.042037,-0.066411,-0.096997,-0.074774,-0.072243,-0.061768,-0.030375,-0.026584,-0.010628,-0.003897,-0.001093,-0.000294,3.9e-05,0.000165,0.00042,0.000269,0.000112,2.8e-05,2.7e-05,1.6e-05
5e-06,3e-06,8e-06,6.6e-05,0.001807,0.001945,0.000126,-0.018841,-0.016584,-0.025844,-0.039346,-0.021256,0.002758,0.009557,-0.010901,-0.005863,-0.004133,-0.00269,-0.001569,-0.000827,-0.000197,1.6e-05,0.000165,3.9e-05,-2.8e-05,-8e-06,-1.4e-05,-4e-06
-8e-06,-1e-06,-5e-06,-7e-05,-0.001047,-0.00105,-0.000708,0.021876,0.05609,0.082588,0.101576,0.090048,0.10389,0.077185,0.04888,0.040589,0.015283,0.005316,0.001865,0.00051,-8.5e-05,-0.000202,-0.000443,-0.000274,-9.9e-05,-2.1e-05,-4.6e-05,-3.5e-05
-6e-06,-3e-06,2e-06,-7e-06,-0.000903,-0.001013,0.001296,0.011461,-0.005027,-0.02731,-0.029693,-0.029155,-0.030189,-0.027785,-0.015491,-0.021094,-0.007926,-0.00129,-4.9e-05,5.2e-05,-5e-06,5.8e-05,-0.000165,-8.3e-05,-7e-06,1.2e-05,-1.8e-05,-2.3e-05
-1e-06,-4e-06,-4e-06,1e-06,0.00064,0.000655,-1e-06,-0.020255,-0.041247,-0.054525,-0.058548,-0.060461,-0.073448,-0.05176,-0.036475,-0.029079,-0.010249,-0.003902,-0.001808,-0.000814,-0.000226,-3.5e-05,0.000193,0.000106,1.2e-05,-4e-06,5e-06,-1.2e-05
4e-06,-1e-06,3e-06,1.7e-05,0.000218,2e-04,-0.000399,0.003391,0.020523,0.066677,0.084431,0.060098,0.030603,0.026569,0.031667,0.031815,0.013547,0.004031,0.001038,9.5e-05,-0.00024,-0.000168,0.000124,0.000107,3.7e-05,-1e-06,-7e-06,-2.6e-05
0,-1e-06,-8e-06,1.8e-05,2.2e-05,0.000205,0.001855,0.015805,0.005667,0.000471,0.001981,0.007672,0.004651,0.000812,0.004635,0.002899,-0.000456,0.00033,0.00065,0.000252,-0.00011,4.1e-05,-1.4e-05,-2.6e-05,-7e-06,-2e-06,-3.5e-05,-4e-05
