7e-06,3e-06,1e-06,-0.000978,-0.046257,-0.058737,-0.007049,-0.008768,-0.079225,-0.178471,-0.177346,-0.174444,-0.174061,-0.184856,-0.156772,-0.102916,-0.046553,-0.010701,-0.001969,-0.002235,-0.001562,-0.001184,-0.000332,-0.000419,-0.000365,-9e-06,1.6e-05,1.2e-05
1.2e-05,5e-06,1e-06,-0.000682,-0.034295,-0.043425,-0.002801,0.003682,0.060035,0.024057,0.077727,0.111366,0.089594,0.097827,0.071757,0.092482,0.054662,0.011779,0.000222,-0.002491,-0.000675,0.002055,0.00097,-0.000256,-0.000257,2.9e-05,2.5e-05,1.5e-05
2e-06,-3e-06,5e-06,0.000342,0.02161,0.029332,0.002595,-0.001823,-0.009685,-0.020953,-0.018831,-0.01088,-0.015302,0.004999,-0.004545,-0.007326,-0.004887,0.000265,0,-0.001154,0.00022,-0.001317,-0.000587,0.000151,0.000127,6e-06,2.1e-05,8e-06
6e-06,1e-06,2e-06,0.000832,0.0438,0.055793,0.003195,-0.005973,-0.07615,-0.06325,-0.094391,-0.123889,-0.104558,-0.139785,-0.099208,-0.097292,-0.052119,-0.012192,-0.001406,9e-05,0.000937,8.6e-05,-0.000189,0.000361,0.000344,2.2e-05,2.4e-05,1e-05
9e-06,3e-06,3e-06,0.000327,0.005891,0.004015,0.001116,0.005228,0.061029,0.163854,0.167086,0.146022,0.14671,0.129009,0.132875,0.096495,0.04697,0.009569,0.000895,0.001486,0.000407,0.001784,0.000892,0.00012,9.6e-05,3.8e-05,2.4e-05,1.3e-05
-2e-06,-7e-06,-5e-06,-0.000719,-0.039749,-0.051133,-0.003221,-0.00147,0.029873,0.077723,0.068127,0.064943,0.062911,0.122284,0.081515,0.046135,0.017534,0.005429,0.001072,0.000818,-0.000905,-0.002047,-0.000745,-0.000331,-0.00031,-2e-05,4e-06,1e-06
-2e-06,-5e-06,-6e-06,-0.000708,-0.026301,-0.030116,-0.004087,-0.008824,-0.086632,-0.181967,-0.183673,-0.176774,-0.160632,-0.159873,-0.16922,-0.119206,-0.054906,-0.01345,-0.002098,-0.001852,-0.000337,0.000312,1.5e-05,-0.000251,-0.000205,-8e-06,1e-06,-1e-06
-1e-06,-2e-06,3e-06,0.000322,0.022904,0.030836,0.00217,0.004257,0.017134,-0.045633,-0.007457,0.013209,0.002267,-0.05194,-0.027054,0.021857,0.021138,0.002896,-0.00185,-0.00228,0.000291,0.001261,0.000539,0.00022,0.000189,3.6e-05,1.5e-05,2e-06
-3e-06,-4e-06,-1e-05,0.000673,0.033074,0.040531,0.003797,0.005281,0.062848,0.091491,0.081275,0.10174,0.077111,0.104824,0.111496,0.073886,0.031043,0.009122,0.00074,0.000292,9.5e-05,-0.001068,-0.000414,0.000251,0.000214,1e-05,1.7e-05,0
-1e-06,0,0,9.5e-05,-0.002674,-0.005625,-0.000938,-0.003567,-0.045881,-0.026015,-0.058134,-0.066173,-0.048489,-0.038706,-0.037944,-0.068314,-0.040278,-0.009466,0.000224,0.001618,6.1e-05,0.000181,-7e-06,-5.7e-05,-2.2e-05,2e-05,1.6e-05,4e-06
-2e-06,0,-5e-06,-0.000489,-0.029055,-0.037436,-0.003198,-0.000822,-0.007521,0.025006,0.048862,0.012321,0.022431,-0.024881,-0.012949,-0.000616,0.003296,-0.00209,-0.000941,0.000403,-8.3e-05,0.000506,0.000286,-0.000232,-0.000187,1.9e-05,1.2e-05,4e-06
-2e-06,0,6e-06,-0.000344,-0.014319,-0.016527,-0.001302,0.000837,0.051137,0.080394,0.082338,0.073509,0.052135,0.093939,0.079029,0.076108,0.035783,0.009913,-9.2e-05,-0.000421,6e-06,-0.000668,-0.000304,-9.7e-05,-9.7e-05,-8e-06,5e-06,2e-06
-1e-06,0,-2e-06,0.000191,0.017417,0.023837,0.001229,-0.0022,-0.037578,-0.095104,-0.118949,-0.086982,-0.0776,-0.034366,-0.071201,-0.056377,-0.027908,-0.00576,-0.000786,-0.000944,-6.2e-05,0.000288,4.7e-05,0.000152,0.000136,1.4e-05,8e-06,5e-06
-1e-06,2e-06,0,0.000469,0.022889,0.028488,0.002048,0.000505,-0.034475,-0.085148,-0.05596,-0.045158,-0.023894,-0.095356,-0.082719,-0.045093,-0.015749,-0.006729,-0.001687,-0.001087,-0.00013,0.000184,0.000155,0.000138,0.000131,1.6e-05,9e-06,2e-06
1e-06,3e-06,-5e-06,2.5e-05,-0.00361,-0.005939,0.000759,0.002104,0.047164,0.079754,0.087963,0.083512,0.069796,0.051317,0.098369,0.075485,0.033872,0.008971,0.000382,0.000494,-1.3e-05,-0.000386,-0.000174,-8.2e-05,-7.2e-05,-1.1e-05,6e-06,-2e-06
1e-06,4e-06,3e-06,-0.000302,-0.020024,-0.026672,-0.001818,-0.001059,-0.001534,0.023698,-0.013811,0.000612,-0.007792,0.04851,0.049622,-0.005378,-0.008692,-0.000183,0.000906,0.001509,0.000234,0.000148,-4.1e-05,-0.00015,-0.00011,4e-06,1e-06,-1e-06
2e-06,5e-06,4e-06,-0.000192,-0.00783,-0.009256,-0.001104,-0.000135,-0.040484,-0.039214,-0.013778,-0.026851,-0.018443,-0.043277,-0.074555,-0.057999,-0.024311,-0.008425,-0.000832,9.6e-05,2e-06,9.1e-05,8.9e-05,-1.1e-05,-1e-05,-8e-06,-9e-06,-4e-06
4e-06,1e-06,1e-06,0.000134,0.011982,0.017386,0.001941,0.002624,0.034519,0.059556,0.077928,0.043874,0.030844,0.009776,0.006123,0.045919,0.025556,0.005918,-0.000551,-0.000968,-0.000127,-8.1e-05,7e-06,9.6e-05,6.1e-05,-2.2e-05,-1e-05,-4e-06
1e-06,0,-2e-06,0.000231,0.013567,0.018117,0.001282,-0.001116,0.026851,0.008666,-0.049145,-0.026236,-0.033085,0.02415,0.017455,0.014772,0.005903,0.003959,-7.9e-05,-0.000622,-0.000138,-0.000312,-0.000196,6.6e-05,6.4e-05,7e-06,-1e-06,2e-06
