-0.000204,-0.000324,-0.000678,-0.000574,-0.000297,-0.001774,-0.005847,-0.004654,-0.039343,-0.153566,-0.228644,-0.204006,-0.188113,-0.166502,-0.171706,-0.135391,-0.054281,-0.015559,-0.010816,-0.010321,-0.004436,-0.003667,-0.004306,-0.001523,3.3e-05,5.2e-05,4.4e-05,2.7e-05
-0.000199,-0.000275,-0.000396,-0.000376,-2e-04,-0.00132,-0.00442,-0.000977,0.015966,0.012112,0.00552,0.066394,0.068877,0.126213,0.165488,0.143112,0.061148,0.016701,0.011599,0.0059,0.001775,0.000405,-0.002227,-0.000794,9.5e-05,6.1e-05,5.2e-05,3.5e-05
-1.2e-05,1.9e-05,0.000228,0.000112,-2.9e-05,0.000601,0.002194,0.000379,-0.003127,0.012773,0.042916,0.011897,-0.002931,-0.003782,0.010189,-0.000116,-0.005145,-0.000706,-0.00093,0.00021,0.00054,0.000621,-0.000185,1.3e-05,7e-05,5.6e-05,4.7e-05,3.9e-05
0.000136,0.000241,0.00053,0.000448,0.00023,0.001606,0.005383,0.001866,-0.011641,-0.015294,0.004201,-0.053037,-0.064323,-0.11386,-0.165184,-0.141844,-0.058672,-0.016853,-0.011046,-0.004637,-0.000678,4e-04,0.001448,0.000435,6.9e-05,5.6e-05,5.2e-05,4.7e-05
9.8e-05,0.000147,0.000133,0.00017,0.000197,0.000352,0.000871,0.001694,0.019442,0.080516,0.126452,0.130316,0.135135,0.120994,0.123989,0.115769,0.050649,0.013259,0.009676,0.006665,0.003002,0.003639,0.004416,0.001556,0.000113,6.2e-05,6.2e-05,5.3e-05
-4.5e-05,-0.000129,-0.000518,-0.000381,-0.000162,-0.001396,-0.004694,-0.002503,-0.015252,-0.034979,-0.023,-0.002987,0.018936,0.053184,0.084539,0.061922,0.020837,0.007065,0.003529,-5.7e-05,-0.000793,9e-06,0.00021,7e-05,1.7e-05,3.7e-05,3.8e-05,2.6e-05
-3.7e-05,-8.7e-05,-0.000245,-0.000189,-0.000159,-0.000904,-0.002614,-0.001912,-0.029175,-0.135613,-0.209017,-0.182431,-0.16942,-0.136962,-0.163716,-0.149105,-0.056887,-0.015415,-0.011439,-0.008355,-0.003728,-0.003846,-0.003705,-0.001074,1.8e-05,2.7e-05,2.4e-05,1.1e-05
6.1e-05,0.000129,0.000435,0.000272,5.5e-05,0.000646,0.002369,0.001671,0.017602,0.052675,0.026121,0.028512,0.014028,0.006632,0.023312,0.042693,0.022169,0.004503,0.004546,0.003278,0.001249,-0.000466,-0.00089,-0.000145,7.5e-05,3.9e-05,3.3e-05,2.4e-05
0,3.1e-05,0.000264,0.000158,7.5e-05,0.000902,0.00268,0.001525,0.019949,0.113548,0.190844,0.140611,0.110317,0.082563,0.11357,0.096867,0.033997,0.010738,0.007981,0.006259,0.002699,0.00262,0.002185,0.000723,4e-05,2.7e-05,2.6e-05,2.5e-05
-0.00012,-0.000154,-0.000284,-0.000208,2e-06,-1.7e-05,-0.000434,-0.000403,-0.010897,-0.041457,-0.011187,-0.022876,-0.033691,-0.048585,-0.10196,-0.110875,-0.043973,-0.011555,-0.008886,-0.004984,-0.001513,0.000684,0.000313,-0.000202,8e-06,1.3e-05,1.7e-05,1.5e-05
-7.4e-05,-8.2e-05,-3e-04,-0.00022,-4.5e-05,-0.000711,-0.002259,-0.001301,-0.006527,-0.042456,-0.095908,-0.053248,-0.023889,-0.017833,-0.024807,-0.004721,-0.000729,-0.003081,-0.001767,-0.002356,-0.001424,-0.000726,-0.000608,-0.000312,1.5e-05,1e-05,1.4e-05,7e-06
9.4e-05,0.000105,8.9e-05,0.000118,-1.3e-05,-0.000243,-0.000344,-0.000105,0.007241,0.014173,-0.013621,0.010351,0.034274,0.060208,0.117411,0.108205,0.037041,0.011406,0.008458,0.005357,0.001067,-0.000619,0.000451,0.000425,-2e-06,8e-06,1e-05,4e-06
0.000155,0.00019,0.000372,0.000327,7.2e-05,0.00053,0.001938,0.000953,0.00072,-0.026501,-0.028475,-0.036641,-0.052075,-0.031163,-0.04879,-0.072003,-0.025773,-0.004899,-0.005317,-0.002569,-0.000652,-0.000417,0.000241,0.000385,5e-06,3e-06,5e-06,2e-06
3.1e-05,5.2e-05,0.00013,4.9e-05,4.9e-05,0.000268,0.000364,9.4e-05,0.001209,0.015215,0.019362,-0.015787,-0.027858,-0.041155,-0.069944,-0.048134,-0.012822,-0.005977,-0.004347,-0.003002,-0.000613,0.000176,-0.000119,-0.000171,-3e-06,-8e-06,-6e-06,-6e-06
-0.000124,-0.000195,-0.000375,-0.000341,-7.6e-05,-0.000402,-0.001776,-0.000608,0.005181,0.063996,0.113178,0.083505,0.080933,0.055474,0.084434,0.09887,0.034946,0.009496,0.008873,0.004861,0.001327,0.001214,0.000509,-0.000265,-5.5e-05,-2.8e-05,-1.9e-05,-1.7e-05
-0.000126,-0.00017,-0.000276,-0.000196,-7.5e-05,-0.000247,-0.000408,-0.000173,-0.008473,-0.029444,-0.006488,0.011243,0.001678,0.012042,-0.000381,-0.028249,-0.012504,-0.001245,-0.001624,-0.00159,-0.00091,0.000109,-0.000191,-0.000349,-5.9e-05,-3.7e-05,-2.6e-05,-2.2e-05
9e-06,7.4e-05,0.000245,0.000212,3.1e-05,0.000336,0.00169,0.000364,-0.006025,-0.05531,-0.1349,-0.091604,-0.067154,-0.046996,-0.076644,-0.072629,-0.024806,-0.008492,-0.007144,-0.003583,-0.001135,-0.001365,-0.000696,-0.000143,-4.6e-05,-3.6e-05,-3.1e-05,-3e-05
9.3e-05,0.00013,0.000293,0.00024,5.7e-05,0.000329,0.001016,0.000652,0.013423,0.033609,-0.008022,0.006155,0.022635,0.009742,0.051026,0.077194,0.027235,0.006262,0.006577,0.005262,0.001711,-0.000431,0.000504,0.00047,-4.4e-05,-3.5e-05,-3.1e-05,-3.5e-05
4.4e-05,1.5e-05,-7.7e-05,-4.5e-05,1.9e-05,-0.000245,-0.001345,-0.000876,-0.000494,0.029078,0.105551,0.06649,0.023224,0.019127,0.038916,0.015013,0.002353,0.002093,0.001299,0.000169,-7.9e-05,0.000767,0.000543,0.000136,-5.1e-05,-4.1e-05,-3.3e-05,-3.2e-05
