9e-06,9e-06,5.5e-05,3.4e-05,9e-06,1e-06,3.2e-05,6e-06,3.7e-05,3e-06,2.5e-05,2.7e-05,1e-06,3.8e-05,9.4e-05,3e-06,8e-06,0,2.8e-05,4.1e-05,1.2e-05,6e-06,4.9e-05,2.9e-05,7e-06,2.2e-05,1.1e-05,3.1e-05,1.4e-05,4.7e-05,1.7e-05,1.5e-05,4.3e-05,3.6e-05,5e-06,5.1e-05,4.5e-05,2.3e-05,9e-06,3.4e-05,5.4e-05,3.7e-05,4e-05,1.9e-05,2e-06,7e-06,9e-06,4.3e-05,4.7e-05,1.6e-05,5.3e-05,2.8e-05,1.1e-05,3.8e-05,3.2e-05,2.4e-05,5e-06,8e-06,2e-05,6e-06,2.2e-05,3.8e-05,3e-06,1.2e-05,5.8e-05,1.3e-05,1.5e-05,1e-06,6e-06,2e-06,1e-06,7.5e-05,6e-06,1.1e-05,1.2e-05,2e-05,1.3e-05,6e-06,3e-05,5.8e-05,1.2e-05,1e-06,3e-05,2.9e-05,1e-06,9e-06,6.1e-05,3e-06,2e-05,5.3e-05,1.9e-05,3.5e-05,4e-06,1.2e-05,2.7e-05,8e-06,5.3e-05,5.9e-05,2e-06,1.6e-05,1.6e-05,4e-06,6e-06,1.8e-05,1.3e-05,2.6e-05,1.7e-05,3.3e-05,1.2e-05,3e-06,3.3e-05,3.4e-05,4.3e-05,1.4e-05,4.9e-05,5e-06,1.2e-05,4.7e-05,1.3e-05,2.1e-05,2.6e-05
3.5e-05,2.4e-05,7.8e-05,9.8e-05,5.1e-05,1.9e-05,5.5e-05,5.2e-05,5e-05,2.5e-05,4.3e-05,7.1e-05,1.5e-05,9.8e-05,0.00022,1.9e-05,3.2e-05,2e-05,5.6e-05,0.000142,9e-06,4.9e-05,8.6e-05,2.8e-05,1.2e-05,6.7e-05,1.3e-05,6e-05,1.2e-05,8.7e-05,9.6e-05,7.9e-05,0.000157,8.9e-05,7.9e-05,0.000131,3.2e-05,3.7e-05,8e-06,9.8e-05,0.000112,5.1e-05,7.6e-05,4.9e-05,7e-06,5.4e-05,3.8e-05,7.1e-05,0.000129,4e-05,9.9e-05,2.2e-05,7e-05,8.7e-05,4.6e-05,7.8e-05,1e-05,1.6e-05,7.3e-05,6.2e-05,6.8e-05,2.9e-05,3.2e-05,2.7e-05,0.000105,4.8e-05,1.6e-05,2.1e-05,1.8e-05,5.2e-05,3.3e-05,0.000112,2.5e-05,2.8e-05,3.7e-05,1.4e-05,2.8e-05,3.1e-05,5.6e-05,0.000136,6.6e-05,8.1e-05,3.7e-05,5.8e-05,5e-05,5.7e-05,9.1e-05,3.6e-05,6.1e-05,8.7e-05,0.000102,0.00012,6.7e-05,6.9e-05,3.3e-05,4.3e-05,7.4e-05,0.000169,5.3e-05,6.8e-05,1.5e-05,1.6e-05,2.8e-05,4e-05,5.7e-05,4.4e-05,5.3e-05,3.4e-05,4.4e-05,3.3e-05,6.8e-05,0.000129,0.000108,6.3e-05,0.000138,4.7e-05,3.7e-05,0.000115,3e-05,1.8e-05,5.2e-05
3.2e-05,3.3e-05,6.5e-05,1.2e-05,8.9e-05,5.2e-05,5e-05,4.2e-05,9.6e-05,4.9e-05,4.3e-05,3.7e-05,8e-06,0.000133,0.000247,7.6e-05,3.7e-05,5.6e-05,0.000103,4e-05,9.9e-05,2.1e-05,7.8e-05,5.8e-05,1.7e-05,7.3e-05,3.3e-05,4.3e-05,1.8e-05,5.8e-05,8.1e-05,9.4e-05,0.000116,0.000106,7.8e-05,0.000181,0.000119,3.5e-05,8.3e-05,0.000114,0.000171,4.7e-05,3.6e-05,0.000102,9.3e-05,3.7e-05,3.4e-05,5.2e-05,0.000109,4.5e-05,0.000115,3.9e-05,4.3e-05,9.2e-05,5e-05,6.5e-05,5.1e-05,6.4e-05,9.3e-05,2.6e-05,7.7e-05,7.9e-05,8.1e-05,7.8e-05,0.00015,0.000107,2.2e-05,7e-05,3.9e-05,5.3e-05,1.6e-05,0.000145,3.7e-05,5e-05,5.1e-05,2.1e-05,6.6e-05,5.3e-05,2.8e-05,0.00016,8e-05,6.5e-05,2.8e-05,5.7e-05,2.3e-05,6.2e-05,0.000131,0.000104,2.1e-05,0.000158,0.000204,2.4e-05,4.2e-05,9.2e-05,0.000102,6.4e-05,5.6e-05,6.2e-05,4.9e-05,8.5e-05,7.1e-05,3.4e-05,6.4e-05,7.8e-05,1e-04,0.000103,0.000101,0.000111,8.6e-05,6e-05,3.3e-05,9.2e-05,0.000114,9.9e-05,9.7e-05,2.8e-05,5.3e-05,0.000112,8.9e-05,4.1e-05,7.6e-05
4e-05,2e-05,6.1e-05,7.1e-05,0.00016,0.000107,5.1e-05,2.4e-05,6.4e-05,3.2e-05,2e-05,9.5e-05,6.5e-05,5.7e-05,7e-05,0.00017,0.000201,0.000109,4.5e-05,6.9e-05,7.6e-05,6.4e-05,7.4e-05,8.9e-05,6.8e-05,3.2e-05,9e-05,2e-05,3.4e-05,5.1e-05,0.000117,0.000102,0.000106,1.1e-05,7.9e-05,8.7e-05,0.000164,7.8e-05,0.000123,9.7e-05,0.000114,6.3e-05,4.6e-05,0.000133,0.000111,6.5e-05,6.6e-05,8.5e-05,0.000225,8.1e-05,0.000138,6.1e-05,6.2e-05,0.00013,5e-05,9.5e-05,0.000129,0.000138,9.7e-05,6.6e-05,6.5e-05,6.3e-05,7.4e-05,3.8e-05,0.000109,3.9e-05,7.5e-05,0.000108,0.000109,0.000109,3.7e-05,0.000139,4.5e-05,3.6e-05,0.000103,0.000103,7.5e-05,8e-05,0.000109,0.000163,4.8e-05,8.8e-05,0.000109,7.7e-05,1.7e-05,6e-05,8.3e-05,8.4e-05,3.5e-05,0.000158,0.000134,7.9e-05,0.000117,1.6e-05,3e-05,4.4e-05,9e-05,9.1e-05,3.2e-05,5e-05,2e-05,3.3e-05,1.4e-05,4e-05,2.3e-05,0.000194,0.000133,7.4e-05,7.4e-05,1.1e-05,1.2e-05,0.000114,0.000106,3.9e-05,6.5e-05,5.4e-05,3.7e-05,0.000131,8.5e-05,2.8e-05,0.000108
7.3e-05,3.4e-05,4.4e-05,4.9e-05,0.000136,3.1e-05,3.7e-05,9.7e-05,5.2e-05,5.7e-05,3.9e-05,8e-05,9.5e-05,5e-05,0.000341,0.000177,9.8e-05,9.7e-05,9e-05,4.7e-05,5.1e-05,3.1e-05,0.000124,0.000129,0.000196,0.000116,8.9e-05,0.000102,5.6e-05,0.000154,0.000164,0.000203,0.000159,0.000108,0.000105,0.000141,0.000271,8.8e-05,0.000146,6.8e-05,0.000142,8.1e-05,9.7e-05,0.000161,4.6e-05,2.3e-05,0.00013,0.000264,0.000221,0.000133,0.000213,4.1e-05,0.000137,0.000224,0.000186,0.000118,6.7e-05,0.000185,0.000116,7.3e-05,1.4e-05,3.8e-05,6.4e-05,9.4e-05,0.000169,0.000144,0.000128,0.000103,4.4e-05,8.2e-05,6.3e-05,0.000164,5.4e-05,0.000108,0.00017,7.5e-05,9.5e-05,7.6e-05,0.000119,0.000166,9.8e-05,5.5e-05,0.000189,0.000312,3.4e-05,5.7e-05,9.3e-05,0.000137,0.000108,0.000149,0.000146,7.4e-05,1e-04,5.6e-05,3e-05,4.5e-05,9.3e-05,0.000233,5.4e-05,0.000129,7.8e-05,4e-05,8.8e-05,9.9e-05,7.7e-05,8.3e-05,9.2e-05,0.000124,5e-05,1.2e-05,9.1e-05,0.000206,0.000104,0.00021,0.000133,0.000122,0.000122,0.000194,5.5e-05,5.8e-05,9.9e-05
9.6e-05,0.000119,9.1e-05,9.8e-05,0.000157,0.00026,0.000134,5e-05,4.6e-05,8e-05,6.7e-05,0.000155,0.000117,0.000153,0.000493,0.000118,0.000119,0.000179,7.9e-05,0.000169,9e-05,0.000101,0.000196,6.4e-05,0.000175,5.9e-05,2.5e-05,0.000118,5.2e-05,0.000202,0.000181,0.00025,0.000402,0.000302,0.000297,0.000201,0.000328,0.000184,0.00017,0.000237,0.000149,0.000102,0.000105,7.4e-05,7.9e-05,0.000148,0.000194,0.000127,7e-05,7.6e-05,0.000187,0.000207,0.000212,8.9e-05,0.000125,0.000253,9.9e-05,0.000291,0.000312,8.8e-05,0.000157,0.00014,0.000206,0.000108,0.000204,0.000218,0.000164,8.7e-05,4.7e-05,7.2e-05,1e-05,0.000356,6.8e-05,0.000185,0.00027,0.000377,0.000187,7.2e-05,0.000192,0.000154,0.000277,0.000303,0.000241,0.000368,0.000357,0.000272,0.00014,0.000118,8.1e-05,0.000174,5.4e-05,0.000206,7.6e-05,0.000188,7.1e-05,8.9e-05,2.3e-05,0.000134,0.000257,0.000122,0.000222,0.00014,0.000112,0.000112,0.00024,2.4e-05,0.000127,0.00016,0.000227,0.000225,0.000138,0.000217,7.7e-05,0.000206,0.000212,7e-05,0.000179,0.000314,0.000177,7.1e-05,0.000121
0.000123,0.000121,0.000202,0.000223,9.8e-05,0.00025,0.000228,0.000142,0.000161,0.00014,4.8e-05,0.000316,0.000309,0.000327,0.000587,0.000636,0.000303,0.000438,0.000379,0.000133,0.000321,6.9e-05,0.000334,0.000153,0.00027,0.000142,5.3e-05,0.000186,0.000195,0.000262,0.000632,0.000526,0.000486,0.000304,0.000282,0.000269,0.000325,0.000253,8.5e-05,0.000159,0.00039,0.000367,6.8e-05,1.5e-05,0.000124,0.000191,0.000279,0.00039,0.000551,0.000282,0.000196,0.000333,0.000229,2.5e-05,0.000119,0.000292,0.000485,0.000542,0.00058,0.000673,0.000291,0.000116,0.00028,0.000258,0.000393,0.000308,0.000131,0.000101,0.00021,0.00031,0.000159,0.000391,0.000288,0.000423,0.00048,6.7e-05,0.000331,0.000395,5e-04,0.000585,0.000587,0.000268,0.000614,0.000554,5e-04,0.000588,0.000473,0.000264,0.000165,0.000358,0.000239,0.000274,0.000229,0.000415,0.000336,0.00022,2.9e-05,8.9e-05,0.00014,0.00036,0.000429,0.000305,0.000267,0.000242,0.000182,0.000409,0.000278,0.000307,0.000299,0.000105,0.000185,0.000309,0.000407,0.000365,0.000288,0.000388,0.000303,0.000395,0.00018,6.8e-05,0.000173
0.000183,0.000194,0.000377,0.000353,0.000169,0.000132,0.000128,0.000121,0.000414,0.000376,0.000223,0.00046,0.000409,0.000308,0.000172,0.000491,0.000473,0.000565,9.1e-05,0.000392,0.000758,0.000684,0.000378,0.000593,0.000127,0.000177,0.000107,0.000156,5e-04,0.000691,0.000686,0.000758,0.000526,9.5e-05,0.00052,0.000472,0.000701,0.000258,0.000109,0.000125,0.000806,0.000254,5.9e-05,0.000189,0.000173,0.000357,0.000477,0.000124,0.000557,0.000726,0.000654,0.000499,3.1e-05,6.8e-05,0.00028,0.000358,0.000304,0.000465,0.000167,0.000658,0.000453,0.00022,0.00033,0.000306,0.000402,0.000866,0.000594,0.000497,0.000189,0.000279,0.000277,0.000152,0.000351,0.000257,0.000384,0.000168,0.000543,0.000602,0.000224,0.000655,0.000145,0.000427,0.000762,0.001103,0.000593,0.000438,0.000575,0.000493,0.000202,0.000243,0.000735,0.000781,0.000574,0.000226,9.1e-05,0.00039,0.000475,0.000238,0.000299,0.000392,0.000365,0.000117,6.7e-05,0.000161,0.000303,0.000613,0.000268,0.00028,0.000138,0.00033,0.000382,0.000301,0.000388,0.000177,0.000399,0.000428,0.000388,0.000631,0.000899,0.000447,0.000204
0.000231,9.4e-05,0.000209,8.9e-05,9.7e-05,5.7e-05,0.000139,0.000203,0.000325,0.000402,0.000255,0.000363,0.000176,0.00016,0.000449,0.000375,8.9e-05,0.000338,0.000377,0.000442,0.000536,0.00021,0.000219,0.000665,0.000353,0.000439,8.8e-05,4.6e-05,5e-04,0.000191,0.000341,0.000238,0.000442,0.000473,0.000641,0.00048,0.000843,0.000816,0.000463,0.000229,0.000888,0.001227,0.000917,5.7e-05,0.000371,0.000579,0.000397,0.000241,0.000244,0.000319,5.5e-05,0.000231,0.000431,0.000401,0.000439,0.000196,0.000166,9e-06,7.7e-05,0.00082,0.000278,0.000297,0.000819,0.000547,0.00012,0.00064,0.000487,0.000176,0.000473,0.000682,0.000421,0.000242,0.000418,0.000547,3.6e-05,0.000401,0.000655,0.000232,0.00048,0.000184,0.000537,0.000784,0.000165,4e-04,0.000462,0.000754,0.000352,0.000257,0.000245,0.000342,0.000651,0.000799,0.000581,0.00043,0.000444,0.000409,0.000148,9.4e-05,0.000631,9.7e-05,0.000449,0.000427,0.000126,0.000111,0.000343,0.000413,0.000338,0.000221,0.000308,0.000632,0.000249,0.000407,0.00022,0.000302,0.000727,0.000856,0.000725,9.4e-05,0.000564,0.000364,0.000427
0.000141,0.00019,7.6e-05,8.3e-05,0.000232,0.000182,6e-05,9.2e-05,0.000253,4.9e-05,8.1e-05,0.000257,0.000113,0.000102,0.000342,0.000184,0.000157,9.7e-05,7.6e-05,6.2e-05,0.000286,0.000191,0.000112,0.000517,0.000542,0.000715,0.000497,0.000234,0.000523,0.000446,0.000376,7.7e-05,0.000511,0.00044,0.000477,0.000265,0.000465,0.000364,0.000104,0.000249,0.000821,0.000799,0.000631,0.000718,0.00034,0.00031,0.000167,0.000119,9.3e-05,0.000177,0.000273,0.000175,0.000179,0.000365,6.7e-05,0.000175,0.000248,0.000291,8e-05,0.000686,0.000599,0.000383,0.000388,0.000349,0.000354,0.000658,0.000439,0.000132,0.000554,0.000693,0.000318,0.000458,0.000476,6.2e-05,8.5e-05,0.000521,0.000781,0.000696,0.000149,0.000359,0.000643,0.000197,0.000415,0.000297,0.000381,0.000167,0.000301,0.000199,3.1e-05,0.000218,0.000142,0.000465,0.000739,0.000603,0.000138,0.00023,0.000436,0.000547,0.000953,0.000748,0.00052,0.000458,0.000307,0.000328,0.000605,0.000378,0.00016,0.000138,0.000211,0.000311,0.00037,0.000748,0.000893,0.000406,0.000619,7.5e-05,0.000132,0.000304,0.000158,0.000285,0.000439
7.8e-05,0.000118,0.000163,4.2e-05,0.000184,6.4e-05,0.000103,5.9e-05,0.000121,7.2e-05,3.8e-05,8.2e-05,9.2e-05,6.1e-05,0.000236,0.000156,0.000205,5.4e-05,0.000102,0.000126,1.5e-05,2.4e-05,4.5e-05,0.000338,0.00026,0.000333,0.00038,0.000205,0.000204,0.000174,6.3e-05,0.000147,0.000331,0.000117,0.000322,8.3e-05,0.00024,0.000134,5.4e-05,0.00016,0.00028,0.000262,0.000162,0.000231,0.000136,0.000249,0.000166,0.000304,0.000435,0.000233,0.000326,0.000103,0.000164,0.000234,0.000212,9.6e-05,5.9e-05,0.000228,0.000206,0.000363,0.000162,0.000146,0.00019,0.000136,0.000217,0.000134,9.9e-05,0.000198,0.000366,0.00015,1.8e-05,0.000309,0.000211,0.000103,0.000172,0.000549,0.000372,5.5e-05,0.000176,0.000278,0.000136,0.000377,0.000288,0.000216,0.000139,0.000166,1e-05,0.00012,1e-04,0.000207,0.00022,0.000118,0.000232,3.4e-05,8.6e-05,9.4e-05,0.000305,0.000547,0.000491,0.000326,0.000291,0.000118,1.1e-05,0.000212,0.000234,0.000344,0.000259,0.000204,8.4e-05,0.000181,0.000375,0.000577,0.000494,0.000464,0.000189,0.000316,0.000192,0.00024,0.000381,0.000388,0.00022
1.3e-05,8.9e-05,2.5e-05,5.8e-05,6.7e-05,6e-05,3.6e-05,3e-06,6.2e-05,2.1e-05,7e-06,1.8e-05,3.2e-05,9.2e-05,0.000123,6.2e-05,5.5e-05,2.8e-05,9e-05,9.1e-05,3.1e-05,7.8e-05,9.9e-05,0.000112,7.9e-05,0.000205,7.5e-05,9.2e-05,3.6e-05,3.4e-05,4.9e-05,8.3e-05,8.6e-05,4.2e-05,7e-05,5.1e-05,6.9e-05,4.3e-05,6.1e-05,1.7e-05,0.000124,0.000143,5.3e-05,6.7e-05,2.2e-05,0.000132,5.8e-05,0.000196,0.000183,0.000109,0.000154,3.2e-05,4.1e-05,0.000119,6.3e-05,6.9e-05,0.000102,0.000139,0.000111,8.8e-05,1.5e-05,3.3e-05,8.4e-05,0.000121,6.7e-05,0.000104,6e-05,0.000108,9.7e-05,7.4e-05,4.1e-05,0.000129,3.7e-05,9.3e-05,8.9e-05,0.000251,0.000143,3.5e-05,8.2e-05,6.8e-05,8.7e-05,0.000168,0.000197,9.7e-05,6.9e-05,6.9e-05,8.8e-05,1.3e-05,2.8e-05,0.000198,0.000126,0.000152,0.000112,5.1e-05,0.000109,5.9e-05,0.000214,0.000209,0.00016,0.000172,0.000117,7.3e-05,0.00011,0.000117,0.000211,2.7e-05,0.000112,9.1e-05,6e-05,9.8e-05,0.000145,0.000212,0.000142,0.000153,0.00013,4.5e-05,4.8e-05,0.000115,0.00023,0.000126,2.6e-05
3.7e-05,4.8e-05,2.2e-05,4.7e-05,3.6e-05,4.8e-05,1.8e-05,2.8e-05,4e-05,2.4e-05,1.6e-05,1.6e-05,1.6e-05,7.6e-05,5.9e-05,4.9e-05,9.1e-05,3e-05,6.1e-05,6.8e-05,2.4e-05,6.8e-05,4.5e-05,6.4e-05,4.3e-05,0.000107,2.4e-05,8.3e-05,2.9e-05,4.1e-05,4.7e-05,9.4e-05,6.7e-05,2.6e-05,8.9e-05,7.7e-05,4.6e-05,5e-05,3e-05,8e-06,9e-05,0.000152,4.8e-05,1.1e-05,3.6e-05,7e-05,4.1e-05,0.000147,0.000114,1.4e-05,8.1e-05,4.8e-05,2.6e-05,5.5e-05,6.9e-05,2.5e-05,5.4e-05,0.000112,9.4e-05,7.2e-05,3.5e-05,3.8e-05,1e-04,5.1e-05,3.3e-05,8.9e-05,2.5e-05,9.3e-05,0.000129,9.8e-05,5.9e-05,7.7e-05,1.3e-05,8.7e-05,6.6e-05,0.000175,7.1e-05,9e-06,5.3e-05,6.5e-05,1.1e-05,0.00011,0.000115,8.6e-05,4.3e-05,4.3e-05,8.2e-05,4.6e-05,4.8e-05,0.000127,5.2e-05,9.1e-05,1e-04,6.2e-05,6.8e-05,4.3e-05,0.000114,9.8e-05,0.000115,7.1e-05,0.000101,7.3e-05,4.8e-05,9e-05,6.6e-05,7.8e-05,4.8e-05,3.9e-05,8.4e-05,5.5e-05,6.5e-05,0.000165,0.00011,0.000109,2.9e-05,8.8e-05,6.8e-05,9.3e-05,0.00012,3e-05,8.5e-05
5.7e-05,3.9e-05,5e-05,2.9e-05,5.2e-05,3e-05,5.7e-05,3.1e-05,6e-06,4.5e-05,2.1e-05,3.8e-05,1.5e-05,4.7e-05,3.9e-05,6.1e-05,0.000105,5.5e-05,0.000102,8.9e-05,5.3e-05,4.7e-05,8.7e-05,3e-05,0.00011,6.1e-05,2.3e-05,0.000151,0.000103,3.9e-05,3.8e-05,7e-05,4e-05,3.5e-05,8.1e-05,6.2e-05,4.2e-05,8.2e-05,4.3e-05,4.6e-05,9.7e-05,0.00019,6.7e-05,5.3e-05,0.00012,0.000155,5.3e-05,0.00016,7.1e-05,6.2e-05,9.9e-05,6.1e-05,3.5e-05,5.1e-05,6.5e-05,5.7e-05,5e-05,0.000155,0.000149,2.2e-05,6.2e-05,7.1e-05,6.5e-05,6.3e-05,0.000118,6.6e-05,2.6e-05,3.8e-05,0.000176,0.000203,2.3e-05,5.4e-05,5.9e-05,0.000105,5.6e-05,0.000192,2.9e-05,8.2e-05,3.9e-05,7.6e-05,9e-05,0.000132,4.9e-05,0.000122,3.3e-05,9.4e-05,0.000163,0.000173,9.4e-05,0.000104,8.3e-05,2.5e-05,0.000111,6.1e-05,9.1e-05,0.000102,0.000169,0.000116,0.000112,4.5e-05,0.000111,2.9e-05,1.5e-05,9.9e-05,0.000154,0.000107,3.8e-05,5.9e-05,7.5e-05,7.6e-05,6.1e-05,0.000134,1.1e-05,0.000125,2.4e-05,1.4e-05,6.7e-05,0.000116,0.000111,2.6e-05,0.000131
6e-05,3.5e-05,3.6e-05,2.9e-05,8.4e-05,2.7e-05,3.7e-05,2.6e-05,6.2e-05,5.3e-05,6.4e-05,3.2e-05,6.9e-05,8.7e-05,1.1e-05,0.000117,0.000207,0.000104,7.2e-05,3.9e-05,0.000158,9e-06,6.6e-05,6.9e-05,5.1e-05,9.6e-05,8.8e-05,0.000102,2.8e-05,9.7e-05,0.000131,6.4e-05,2e-05,5.9e-05,0.000132,0.000107,1.8e-05,3.8e-05,3.7e-05,0.000114,1.1e-05,8.7e-05,0.000123,6.5e-05,0.00012,0.000181,0.000112,0.00016,0.000121,0.00018,0.000159,6.9e-05,1.7e-05,9.5e-05,0.000113,8.8e-05,0.000162,0.000108,3.2e-05,9.2e-05,8.2e-05,8.9e-05,0.000142,0.00011,0.00022,0.000123,3.9e-05,6.9e-05,6.1e-05,0.000107,0.000117,8.6e-05,5.9e-05,0.00018,6.7e-05,0.000182,0.000146,4.9e-05,0.000123,0.000115,6.7e-05,0.00013,0.000168,0.000129,9.6e-05,0.000153,0.000209,0.000121,7.5e-05,9.7e-05,0.000116,0.000149,0.000226,0.000212,0.000127,0.00013,0.00019,0.000124,0.00013,4.9e-05,6.7e-05,7.6e-05,5.3e-05,0.000116,3.6e-05,5.4e-05,8.9e-05,7.5e-05,7.4e-05,5.7e-05,3e-05,7.8e-05,8.5e-05,0.00016,7.6e-05,7.1e-05,5.4e-05,3.9e-05,8.5e-05,5.6e-05,0.000186
3.5e-05,6.1e-05,6.5e-05,1.7e-05,5.5e-05,9e-05,2.5e-05,7.2e-05,0.000114,0.000113,5.8e-05,4.4e-05,7.3e-05,8e-06,9.4e-05,9e-05,0.000143,0.000154,4e-05,5.2e-05,0.000184,0.000179,1.6e-05,5.8e-05,4.2e-05,9e-05,0.000157,0.00017,0.000176,0.000197,0.000148,8.1e-05,0.000106,4.5e-05,8.2e-05,9e-05,1e-04,3.1e-05,3.9e-05,0.000107,0.000126,6e-05,7.6e-05,9.8e-05,0.00014,5e-05,1.8e-05,0.000123,0.000157,0.000105,9.2e-05,3.5e-05,5e-05,8.2e-05,0.000205,0.000192,1.1e-05,0.00015,0.000177,0.000141,0.000213,0.00014,0.000101,0.000118,6e-05,8.4e-05,8.1e-05,6.1e-05,1e-04,0.00021,0.000233,0.000144,4.7e-05,8.3e-05,2.8e-05,8.3e-05,7e-05,0.00011,3e-06,0.000128,0.000106,7.1e-05,2.8e-05,8e-06,8.2e-05,5.6e-05,8.9e-05,9.9e-05,4.5e-05,0.000112,5.3e-05,0.000104,0.000113,0.00016,7.8e-05,7e-05,7.8e-05,0.000131,2.7e-05,9.6e-05,1.3e-05,5.9e-05,0.000124,7.1e-05,0.000191,0.00014,0.00015,0.00014,8.7e-05,0.000146,0.000142,0.000151,7.2e-05,4.5e-05,4.5e-05,3.4e-05,0.000101,9.5e-05,0.000113,2.4e-05,0.000198
3.8e-05,9.5e-05,0.000158,0.000115,5.1e-05,0.000101,9.7e-05,8.1e-05,0.000148,0.000111,7.1e-05,4.6e-05,3.8e-05,3e-05,7.1e-05,5.6e-05,9.8e-05,6.6e-05,9.3e-05,8.8e-05,3.6e-05,0.000117,0.000178,0.00019,7.7e-05,0.000177,0.000167,6.1e-05,5.8e-05,5.3e-05,0.000236,0.000188,0.000207,0.000162,0.000112,3.7e-05,0.000115,6.5e-05,6.2e-05,6.9e-05,0.000193,0.000144,6.5e-05,6.8e-05,8.9e-05,8.8e-05,0.000141,0.000197,2.7e-05,0.000134,7.1e-05,6.8e-05,7.4e-05,0.000106,6.8e-05,6.7e-05,8e-05,9.3e-05,9.7e-05,4.6e-05,0.000144,0.000198,0.000186,7e-05,8.1e-05,8.5e-05,8.8e-05,9e-05,9.4e-05,0.000265,0.000161,2.7e-05,0.000154,0.000155,9.9e-05,5.9e-05,6.2e-05,5.6e-05,6e-05,0.00012,8.5e-05,0.000103,0.000124,0.000111,0.000183,0.000115,4.6e-05,0.000137,0.00019,0.000111,0.000108,7.1e-05,0.00017,0.000139,6.9e-05,2.5e-05,5.1e-05,4.9e-05,6.2e-05,8.3e-05,0.000113,0.000124,8e-05,2.9e-05,0.00021,0.000142,2.8e-05,0.000108,3.2e-05,0.000122,5.9e-05,9.8e-05,0.000134,0.000138,9.8e-05,3.3e-05,2.7e-05,8.9e-05,0.000134,7.4e-05,0.00013
3e-05,8e-05,7.6e-05,2.8e-05,7.4e-05,6.2e-05,1.7e-05,5.8e-05,8.5e-05,6.8e-05,1.4e-05,6.1e-05,2.6e-05,0.000121,0.000117,6.4e-05,2.2e-05,7.4e-05,5.2e-05,5.2e-05,0.000123,0.000115,3.8e-05,0.000116,4.7e-05,0.00015,6.9e-05,6.1e-05,2e-05,5.2e-05,0.000136,0.000129,7.3e-05,5.3e-05,0.000115,7.5e-05,0.000145,0.000109,6.8e-05,9.1e-05,0.000143,6.2e-05,2e-04,0.000209,0.000133,0.000194,4.8e-05,6.4e-05,5.8e-05,0.000109,4.4e-05,7.4e-05,4.1e-05,3.2e-05,0.00014,6.7e-05,1.5e-05,0.000131,9.1e-05,3.8e-05,7.2e-05,0.000111,0.00016,4.3e-05,5e-05,4.2e-05,7.1e-05,0.000104,4.8e-05,6.5e-05,1.6e-05,0.000117,0.000124,8.5e-05,1e-04,0.000169,7.4e-05,4.7e-05,4.6e-05,6.8e-05,7e-05,2.6e-05,2.8e-05,5.5e-05,8.4e-05,6.1e-05,2.7e-05,9.9e-05,0.000108,5.6e-05,7.7e-05,4.4e-05,7.1e-05,8.3e-05,3.9e-05,1.9e-05,8.5e-05,7.1e-05,0.000146,8.4e-05,8.8e-05,7e-05,2.5e-05,4.6e-05,0.000138,6.4e-05,3.7e-05,0.00012,9.8e-05,5.3e-05,5.7e-05,2.4e-05,4.8e-05,5.1e-05,9.9e-05,0.000146,0.00011,7.7e-05,1e-04,4e-05,0.000118
9e-06,6.2e-05,7.5e-05,6.5e-05,0.00011,3.4e-05,5.2e-05,0.000101,4e-05,7.4e-05,4e-05,4.2e-05,7.4e-05,0.00017,5.7e-05,0.000127,9.9e-05,9e-05,0.000102,0.000117,6.2e-05,5.1e-05,5.8e-05,7.1e-05,7.8e-05,0.000139,1.8e-05,3.9e-05,9.9e-05,0.000118,1.2e-05,8.8e-05,4.4e-05,3.1e-05,8.3e-05,0.000121,0.000126,0.000102,6.9e-05,5.3e-05,5.6e-05,0.000107,0.000136,0.000106,3.1e-05,0.00016,0.000219,0.000207,7.5e-05,8.3e-05,0.000161,8.2e-05,8.7e-05,4.4e-05,0.000125,0.000134,0.000135,0.00011,2.8e-05,2.1e-05,2e-05,7.9e-05,5.2e-05,0.000135,2.1e-05,3.5e-05,4.6e-05,0.000131,0.000115,0.000111,8e-05,6.4e-05,4.3e-05,2.9e-05,8.5e-05,7.1e-05,5.6e-05,4.3e-05,1.6e-05,3.4e-05,4.3e-05,9.4e-05,6.7e-05,0.000134,0.000121,0.000109,3.4e-05,1e-05,4.3e-05,7.3e-05,2.8e-05,1.7e-05,2e-05,6.9e-05,0.000104,5.3e-05,6.9e-05,6.5e-05,0.000173,8.6e-05,7.2e-05,4.8e-05,2.4e-05,4.5e-05,2e-05,5.9e-05,3.2e-05,8.6e-05,0.000122,8e-05,4.3e-05,4.4e-05,3.7e-05,3.5e-05,8.5e-05,9e-06,9.1e-05,0.000146,0.000117,2.9e-05,6.7e-05
4e-05,4.8e-05,4.6e-05,6e-05,5.8e-05,8.1e-05,5.1e-05,5.6e-05,3.6e-05,0.000119,6.1e-05,4.1e-05,9.5e-05,4.2e-05,5.5e-05,6.4e-05,3.9e-05,4.6e-05,5.4e-05,3.6e-05,7.4e-05,6.1e-05,7e-05,4.3e-05,3.5e-05,6.7e-05,6.5e-05,4.2e-05,0.000145,0.000149,7e-05,7.5e-05,8e-05,0.000105,5.4e-05,9.4e-05,0.00011,3.4e-05,6.3e-05,1e-04,8.6e-05,0.000112,3.1e-05,6.9e-05,0.000141,4.1e-05,8.7e-05,6.2e-05,6.8e-05,0.00012,7.2e-05,2.1e-05,2e-05,4.4e-05,8e-05,4e-05,7.9e-05,7e-05,5.3e-05,1.3e-05,4.5e-05,0.000162,0.000108,8.7e-05,0.000101,7.8e-05,3.8e-05,0.000179,3.6e-05,7e-05,1.1e-05,7.1e-05,6.4e-05,6.9e-05,7.1e-05,8.6e-05,5e-05,1.9e-05,6.1e-05,5e-05,5.1e-05,0.000125,2.7e-05,0.000194,0.000177,0.00011,0.000138,0.000109,8.6e-05,4.5e-05,0,7.2e-05,3.8e-05,2e-05,6.4e-05,3.8e-05,4.9e-05,0.000114,3.5e-05,3e-05,1.6e-05,6.9e-05,1.3e-05,6e-06,5.3e-05,5.9e-05,3.1e-05,8.2e-05,4e-05,7.2e-05,0.000102,0.000121,0.000114,5.9e-05,7.1e-05,6.2e-05,8.4e-05,5.5e-05,6e-05,1.4e-05,9.3e-05
2.2e-05,1.7e-05,9e-05,4.5e-05,4e-05,7.9e-05,0.000107,5.2e-05,6.1e-05,8.6e-05,8e-06,3.7e-05,0.000118,0.000118,7e-05,0.000106,7.3e-05,0.000101,3.2e-05,5.8e-05,4.9e-05,8.9e-05,0.000133,5.6e-05,5e-06,7.8e-05,2.9e-05,8.3e-05,0.000108,6.1e-05,4.9e-05,0.000107,5.3e-05,4.3e-05,1e-04,8e-05,9.1e-05,4.9e-05,4.3e-05,7.5e-05,2.7e-05,0.000128,0.000104,5.9e-05,7.7e-05,9.4e-05,4.5e-05,6.1e-05,4.5e-05,7.4e-05,0.000127,3.4e-05,4.8e-05,3.6e-05,6.7e-05,8.9e-05,0.000143,0.000136,5.3e-05,2e-05,4.6e-05,0.000127,3.5e-05,6.9e-05,4.9e-05,8.5e-05,0.00011,6.4e-05,5.6e-05,1.8e-05,3.1e-05,3.5e-05,5.9e-05,9e-05,5.1e-05,0.000139,0.000105,6e-05,8.7e-05,7.3e-05,2.3e-05,9e-05,6.3e-05,0.000138,0.000103,1.9e-05,8.2e-05,9e-06,6.3e-05,9.4e-05,2.5e-05,0.000114,0.000118,0.000104,4.7e-05,6.2e-05,4.2e-05,5.8e-05,6.2e-05,6.4e-05,2.5e-05,7.6e-05,0.000109,4.3e-05,1.8e-05,2.6e-05,3.2e-05,0.000107,6.1e-05,1.4e-05,0.000107,3.6e-05,2.9e-05,7.9e-05,5.6e-05,0.000169,0.000107,1.5e-05,9.1e-05,2.2e-05,4.6e-05
8e-05,6.2e-05,3.3e-05,4.2e-05,4.4e-05,8.1e-05,8.9e-05,0.000142,7.5e-05,0.000127,9.7e-05,9.7e-05,8.8e-05,9.2e-05,4.5e-05,5.8e-05,6.2e-05,0.000103,6.4e-05,8.3e-05,0.000212,0.000111,0.000127,0.000104,5.4e-05,0.000107,6.5e-05,0.000148,9.9e-05,7.6e-05,1.8e-05,0.000105,6.1e-05,1.8e-05,4.9e-05,3.8e-05,7.6e-05,3.4e-05,4.3e-05,8.6e-05,1e-05,0.000114,5.7e-05,2.9e-05,9.1e-05,6.3e-05,5.7e-05,0.000195,7.4e-05,8.4e-05,6.4e-05,2e-05,7.7e-05,0.000104,9.4e-05,7.7e-05,6.4e-05,9.1e-05,6.4e-05,7.8e-05,8e-05,0.000118,2.6e-05,6.7e-05,6.1e-05,5.6e-05,5.8e-05,4e-05,3.3e-05,7.2e-05,4.4e-05,3.1e-05,5.2e-05,9.3e-05,5.3e-05,9.3e-05,4.3e-05,7.2e-05,6.7e-05,8.5e-05,7.1e-05,4.4e-05,7.5e-05,0.00011,0.000103,5.8e-05,3.1e-05,6.6e-05,4.9e-05,6.3e-05,0.000107,9.8e-05,4e-05,5.6e-05,7.1e-05,8.4e-05,7.3e-05,0.000132,1e-05,8.2e-05,4.6e-05,3.5e-05,7.9e-05,5.8e-05,7.6e-05,8.8e-05,0.000127,5e-05,5.2e-05,4.8e-05,8e-05,7.3e-05,3.6e-05,7.3e-05,0.000106,0.000108,0.000138,8e-05,4.4e-05,7.5e-05,2e-05
1.2e-05,1.1e-05,1.3e-05,1e-05,2.4e-05,3.1e-05,1.7e-05,6.8e-05,4.4e-05,7.8e-05,6e-05,5.3e-05,1.1e-05,4.1e-05,3.3e-05,1e-05,4.2e-05,4e-06,2.3e-05,5.7e-05,0.000118,8e-05,0.000111,0.000109,7.6e-05,8.8e-05,9.4e-05,4.8e-05,2.3e-05,1e-05,3.7e-05,7.3e-05,5.4e-05,2.1e-05,2.1e-05,4e-05,4.3e-05,2.7e-05,2.3e-05,6.3e-05,6.4e-05,8.7e-05,6.5e-05,4.2e-05,4.2e-05,2.4e-05,7.5e-05,0.000132,9e-05,2.3e-05,6e-05,5.9e-05,3.7e-05,6.6e-05,5.6e-05,1.1e-05,1.2e-05,5.3e-05,8.1e-05,1.9e-05,1.2e-05,7.9e-05,7e-06,2.7e-05,5.3e-05,3.9e-05,1.6e-05,2.2e-05,3e-05,4.6e-05,2.2e-05,5e-05,1.9e-05,5.4e-05,6e-05,2.3e-05,4e-05,7.7e-05,9.9e-05,8.5e-05,5.2e-05,3e-05,2.1e-05,7.8e-05,6e-06,3e-06,4.7e-05,4.9e-05,2.7e-05,2.3e-05,8e-05,7e-05,3.4e-05,2.5e-05,5.5e-05,2.5e-05,4.4e-05,4.2e-05,4.9e-05,5.4e-05,6.9e-05,1.5e-05,3.4e-05,1.7e-05,5.5e-05,2.6e-05,5.4e-05,7.3e-05,8.2e-05,4.9e-05,2.4e-05,6.7e-05,3.9e-05,5.3e-05,5.6e-05,7.2e-05,5.2e-05,1.9e-05,6.3e-05,7.3e-05,6.6e-05
2e-05,1.9e-05,1.6e-05,7e-06,2.9e-05,3.3e-05,2.6e-05,4.1e-05,2e-05,5e-05,2.7e-05,1.2e-05,2.6e-05,3.3e-05,4.3e-05,1.3e-05,2.9e-05,2.3e-05,1.5e-05,2.1e-05,7.6e-05,3.5e-05,5.7e-05,1.8e-05,7.3e-05,2e-05,4.2e-05,6.6e-05,6.8e-05,3e-05,3.1e-05,5.5e-05,2.9e-05,3.4e-05,2.8e-05,2e-05,1.9e-05,2.2e-05,1e-05,7.2e-05,4.5e-05,4.8e-05,2e-05,2.2e-05,5.1e-05,6.6e-05,0.00011,0.000151,7.5e-05,3.4e-05,4.9e-05,5.6e-05,2.3e-05,7.2e-05,7.1e-05,7.5e-05,5.5e-05,5.6e-05,6.7e-05,8.8e-05,4e-05,4.5e-05,7.7e-05,4.2e-05,4.5e-05,3.7e-05,3.3e-05,3.5e-05,4.5e-05,7e-06,3.2e-05,8.3e-05,6e-05,4.9e-05,4e-06,1.6e-05,1.8e-05,7.2e-05,8.9e-05,3e-05,3e-05,6.2e-05,2.7e-05,4.1e-05,7.5e-05,6e-05,7.7e-05,5.8e-05,3.1e-05,8e-06,5.4e-05,5.4e-05,5.5e-05,5e-05,4.6e-05,8.9e-05,3.7e-05,5.3e-05,2.2e-05,3.7e-05,5.2e-05,5.3e-05,4.3e-05,3.7e-05,7.4e-05,4.1e-05,2.7e-05,5e-05,1.8e-05,6.6e-05,4.5e-05,8.2e-05,6.8e-05,4.9e-05,8.7e-05,4.7e-05,5.1e-05,7e-05,0.000118,7.8e-05,9e-06
9e-06,9e-06,3e-06,1.6e-05,1.3e-05,1.9e-05,1.4e-05,1.3e-05,1.3e-05,2.3e-05,1.4e-05,9e-06,2.9e-05,1.5e-05,3.4e-05,4e-05,2.1e-05,1.2e-05,2.4e-05,4.4e-05,5.3e-05,4.3e-05,2.6e-05,3.9e-05,4.4e-05,4.6e-05,1.6e-05,1.3e-05,3.8e-05,3.2e-05,1.2e-05,6e-05,3.9e-05,2.2e-05,9e-06,1.2e-05,1.2e-05,1.3e-05,4e-06,3.7e-05,2.5e-05,2.4e-05,5.7e-05,3e-05,5e-06,3.6e-05,5.5e-05,2e-05,2.6e-05,1.6e-05,4.6e-05,3.6e-05,3.1e-05,3.9e-05,7e-06,5.5e-05,2.2e-05,4.8e-05,4e-05,1.9e-05,4.8e-05,1.3e-05,1.9e-05,1e-05,4.3e-05,1.1e-05,2.2e-05,3.7e-05,3.2e-05,2.2e-05,3.4e-05,2.8e-05,2.1e-05,2.5e-05,1.9e-05,1.3e-05,1.7e-05,4.8e-05,3.1e-05,3.7e-05,1e-05,3.4e-05,3.6e-05,1.2e-05,3.5e-05,4.7e-05,1.1e-05,2.8e-05,2e-05,2.7e-05,3.2e-05,2.2e-05,5.1e-05,4.5e-05,5.9e-05,7.2e-05,4.9e-05,5.2e-05,3.8e-05,1.2e-05,6e-06,2.6e-05,1.1e-05,2.3e-05,4.7e-05,3.4e-05,3e-06,1e-05,2e-05,3.9e-05,1.8e-05,3.7e-05,6e-05,2e-05,4e-05,1.6e-05,3.1e-05,3e-05,4e-05,2.2e-05,1.2e-05
4e-06,6e-06,5e-06,8e-06,8e-06,1.6e-05,2.1e-05,1.2e-05,1.4e-05,1.5e-05,6e-06,2.1e-05,7e-06,1.5e-05,8e-06,1.8e-05,7e-06,1.7e-05,1.3e-05,1.4e-05,1.6e-05,1.4e-05,2.4e-05,2.6e-05,2e-05,2.6e-05,1.2e-05,7e-06,1.8e-05,4e-06,9e-06,2.3e-05,2.2e-05,3.6e-05,2.7e-05,3e-06,1e-05,5e-06,2e-05,2.6e-05,2.2e-05,9e-06,1.9e-05,2e-06,2.1e-05,9e-06,4.4e-05,4.2e-05,2.8e-05,3e-06,3.6e-05,1.7e-05,1e-05,2.4e-05,1.6e-05,2.6e-05,1.4e-05,3e-05,1.4e-05,3e-06,3.5e-05,1.3e-05,1.7e-05,1.5e-05,6e-06,8e-06,1e-05,2.2e-05,2e-05,1e-05,4.2e-05,2.8e-05,3.6e-05,1.6e-05,3.8e-05,4.9e-05,3.6e-05,2.6e-05,3.8e-05,1.1e-05,2.3e-05,2.6e-05,3e-05,4.3e-05,3.4e-05,4.9e-05,3.9e-05,1.5e-05,1.5e-05,1e-05,3.1e-05,2.5e-05,2.9e-05,4e-06,2.1e-05,2.5e-05,1.8e-05,1.7e-05,1.5e-05,3.5e-05,3e-05,2.5e-05,4.4e-05,4e-05,2.3e-05,2.5e-05,3.4e-05,2.6e-05,1.8e-05,1.8e-05,1.5e-05,1.8e-05,2.5e-05,2.5e-05,1.1e-05,7e-06,4.1e-05,3.1e-05,2.2e-05,4e-06,1.4e-05
4e-06,8e-06,6e-06,4e-06,1e-05,1.2e-05,7e-06,1.7e-05,5e-06,6e-06,6e-06,2.1e-05,1.2e-05,7e-06,7e-06,1.6e-05,8e-06,6e-06,1.1e-05,1.4e-05,8e-06,7e-06,1e-05,1.6e-05,2.5e-05,8e-06,2e-06,4e-06,7e-06,7e-06,1.3e-05,1.9e-05,1.9e-05,1.9e-05,3e-06,1.9e-05,1.5e-05,8e-06,2.5e-05,1.9e-05,1.1e-05,8e-06,1.1e-05,5e-06,3.3e-05,3.4e-05,3.1e-05,5e-06,3.1e-05,7e-06,1.5e-05,2.2e-05,1e-05,1.4e-05,1.2e-05,3e-05,2.2e-05,2.1e-05,7e-06,1.2e-05,2.5e-05,3.2e-05,4e-05,2.7e-05,7e-06,1e-05,1.6e-05,1.9e-05,3.2e-05,1.3e-05,3.7e-05,5e-06,2.4e-05,2e-06,1.8e-05,1.7e-05,2.1e-05,2.3e-05,2.8e-05,3.1e-05,2.2e-05,1.4e-05,2e-06,4.5e-05,2.3e-05,2.9e-05,1.6e-05,2.5e-05,8e-06,1.1e-05,1.4e-05,8e-06,2.3e-05,1.2e-05,1.3e-05,6e-06,1.4e-05,2e-05,2e-05,3.4e-05,1.7e-05,3.1e-05,3.3e-05,1.3e-05,5e-06,1.9e-05,1.4e-05,1e-05,1.2e-05,1.8e-05,7e-06,2.7e-05,3.2e-05,2.3e-05,8e-06,9e-06,2.7e-05,1.2e-05,1.6e-05,1.2e-05,1.2e-05
5e-06,6e-06,9e-06,1.1e-05,3e-06,7e-06,1.4e-05,9e-06,8e-06,2e-06,9e-06,7e-06,8e-06,5e-06,4e-06,1e-05,5e-06,5e-06,7e-06,1.5e-05,1.7e-05,1.1e-05,8e-06,1.2e-05,2.1e-05,1.7e-05,1e-06,6e-06,8e-06,7e-06,1.2e-05,2.2e-05,1.5e-05,1.4e-05,9e-06,8e-06,1e-05,1.4e-05,1.1e-05,2.1e-05,9e-06,1.1e-05,1.5e-05,1e-05,2.3e-05,1.5e-05,1e-05,5e-06,2.5e-05,4e-06,8e-06,1.5e-05,1.4e-05,1.8e-05,3e-06,3.3e-05,4e-06,4.1e-05,1.9e-05,1.2e-05,1.3e-05,2.3e-05,3.6e-05,1.2e-05,1.5e-05,1.1e-05,1e-05,1.8e-05,1.6e-05,1.3e-05,1.7e-05,1.5e-05,1.2e-05,5e-06,1.2e-05,1.6e-05,2.5e-05,2e-05,1.4e-05,3e-06,6e-06,6e-06,5e-06,3.3e-05,2.8e-05,3.5e-05,2.6e-05,2.7e-05,1e-05,1.4e-05,1.6e-05,1.3e-05,3.5e-05,1.4e-05,1.9e-05,1.2e-05,6e-06,4e-06,1.9e-05,1.8e-05,2e-06,1.2e-05,1e-05,1.8e-05,1.1e-05,1.2e-05,1e-05,7e-06,8e-06,1.3e-05,1.3e-05,1.6e-05,2.4e-05,1e-05,4e-06,6e-06,1e-05,1e-05,9e-06,1.3e-05,1.2e-05
6e-06,5e-06,6e-06,5e-06,9e-06,3e-06,1.2e-05,3e-06,9e-06,2e-06,5e-06,1.6e-05,2e-06,8e-06,1e-06,3e-06,1.2e-05,3e-06,1.5e-05,1.2e-05,1.4e-05,7e-06,1.6e-05,1.1e-05,7e-06,8e-06,2e-06,1.1e-05,9e-06,3e-06,1.3e-05,2.3e-05,2e-06,2e-06,1e-05,1e-05,1e-05,1.1e-05,1.2e-05,1e-05,1.1e-05,1.5e-05,1e-05,7e-06,1e-05,1.4e-05,1.3e-05,1e-05,1.9e-05,1e-05,2.1e-05,2e-05,8e-06,1.7e-05,9e-06,1.7e-05,5e-06,3.1e-05,2e-06,6e-06,1.8e-05,1.9e-05,2e-05,1.1e-05,1e-05,5e-06,1e-05,5e-06,5e-06,9e-06,7e-06,1e-05,1.5e-05,1.2e-05,1.2e-05,2.1e-05,1.1e-05,1.6e-05,8e-06,1e-05,5e-06,3e-06,2e-06,1.8e-05,2.4e-05,1.6e-05,1.8e-05,1e-05,1e-06,7e-06,1.9e-05,1.2e-05,2.4e-05,5e-06,1.9e-05,9e-06,1.4e-05,1.4e-05,1.5e-05,8e-06,9e-06,7e-06,7e-06,7e-06,9e-06,6e-06,1.6e-05,1.3e-05,8e-06,3e-06,1.7e-05,7e-06,8e-06,1.5e-05,1.3e-05,1.8e-05,7e-06,1.3e-05,1.7e-05,1.5e-05,8e-06
1e-06,9e-06,4e-06,6e-06,1.1e-05,8e-06,2e-06,1e-05,7e-06,1e-06,1e-06,1.6e-05,5e-06,9e-06,2e-06,5e-06,1.5e-05,1.5e-05,8e-06,1e-05,1.2e-05,3e-06,9e-06,1.3e-05,1.8e-05,9e-06,4e-06,9e-06,4e-06,4e-06,1.1e-05,1.8e-05,8e-06,8e-06,1.1e-05,5e-06,8e-06,5e-06,3e-06,3e-06,9e-06,1.4e-05,6e-06,1.3e-05,4e-06,7e-06,7e-06,1.2e-05,1.9e-05,1e-05,1.1e-05,1.8e-05,8e-06,2e-05,5e-06,2.1e-05,5e-06,2.8e-05,5e-06,6e-06,1.8e-05,1.1e-05,2.2e-05,9e-06,7e-06,8e-06,8e-06,8e-06,8e-06,1.3e-05,6e-06,1e-05,6e-06,1e-05,1e-05,2.2e-05,5e-06,5e-06,9e-06,9e-06,1e-05,1.2e-05,2e-06,3.2e-05,1.5e-05,1.2e-05,9e-06,2e-05,9e-06,1e-05,1.2e-05,5e-06,1.7e-05,4e-06,1.8e-05,6e-06,3e-06,7e-06,7e-06,5e-06,5e-06,7e-06,7e-06,2e-05,1.4e-05,9e-06,7e-06,1.2e-05,1e-05,1.7e-05,1.4e-05,1e-05,7e-06,1.6e-05,1.1e-05,5e-06,5e-06,1e-05,9e-06,5e-06,1.3e-05
1e-06,7e-06,7e-06,1e-05,2e-06,3e-06,5e-06,4e-06,4e-06,4e-06,4e-06,1.6e-05,8e-06,1.9e-05,6e-06,1e-05,2.2e-05,1.3e-05,1.5e-05,1e-05,1.6e-05,1e-05,8e-06,1.8e-05,1.2e-05,1.5e-05,8e-06,9e-06,6e-06,1e-05,1.4e-05,1.2e-05,8e-06,3e-06,8e-06,6e-06,1.2e-05,3e-06,6e-06,5e-06,1.8e-05,2.2e-05,7e-06,8e-06,9e-06,6e-06,1.3e-05,1e-06,2.4e-05,2e-06,1.7e-05,2.3e-05,5e-06,1.5e-05,7e-06,1.8e-05,1e-05,2.2e-05,1.4e-05,7e-06,3e-06,1.6e-05,2.8e-05,1.5e-05,2e-06,8e-06,8e-06,1.8e-05,1.3e-05,9e-06,6e-06,4e-06,8e-06,2.1e-05,1.3e-05,1.2e-05,1.3e-05,2e-05,1.7e-05,1.2e-05,1.2e-05,1.3e-05,1.2e-05,2.4e-05,1.2e-05,9e-06,8e-06,1.3e-05,7e-06,2e-06,2.3e-05,4e-06,2.6e-05,1.4e-05,1.8e-05,8e-06,8e-06,1.6e-05,1.5e-05,8e-06,7e-06,1.1e-05,1.1e-05,2.6e-05,1e-05,1.6e-05,4e-06,1.2e-05,1e-05,1.8e-05,2e-05,1.1e-05,1.1e-05,5e-06,1.7e-05,1.3e-05,8e-06,2e-06,9e-06,1.5e-05,1.9e-05
7e-06,6e-06,5e-06,1.9e-05,1.6e-05,1.5e-05,1.6e-05,1e-05,1e-06,1.4e-05,1.6e-05,2.2e-05,2.3e-05,2.1e-05,2.1e-05,2.8e-05,1.1e-05,4.9e-05,7e-06,1.3e-05,1.3e-05,2.1e-05,2.9e-05,3.2e-05,3e-05,8e-06,1.2e-05,2.1e-05,2.4e-05,4e-06,8e-06,1.9e-05,1.1e-05,1e-05,1.1e-05,2.4e-05,1.7e-05,1.3e-05,1.9e-05,4e-06,2.4e-05,1.7e-05,6e-06,6e-06,2.3e-05,2.2e-05,2.4e-05,2.2e-05,7e-06,2.6e-05,1.4e-05,3.8e-05,2.1e-05,1.2e-05,2e-06,1.7e-05,4.6e-05,3.8e-05,1.2e-05,1.3e-05,2.7e-05,1.5e-05,3.2e-05,5e-06,5e-06,1e-05,9e-06,9e-06,4e-06,1.1e-05,1.2e-05,1e-05,1.6e-05,1.9e-05,1.6e-05,1.3e-05,1.1e-05,2.7e-05,1.2e-05,1.6e-05,1.9e-05,4e-06,1.7e-05,4.4e-05,2.2e-05,3e-06,1.3e-05,7e-06,1.6e-05,6e-06,1.9e-05,1.8e-05,3.6e-05,1.5e-05,1.8e-05,5e-06,1.4e-05,2e-05,2e-05,7e-06,2e-06,1.3e-05,2.5e-05,4.2e-05,3.7e-05,1.8e-05,1.9e-05,9e-06,2.4e-05,2.9e-05,2.2e-05,8e-06,1.2e-05,1.7e-05,9e-06,8e-06,5e-06,2.4e-05,1.7e-05,1.1e-05,8e-06
1e-05,6e-06,1.6e-05,2.4e-05,2.6e-05,1.6e-05,2.2e-05,2.8e-05,3.2e-05,2.2e-05,3.8e-05,3.2e-05,2.5e-05,3.1e-05,4.1e-05,1.9e-05,2.3e-05,6.1e-05,5.9e-05,2.5e-05,1.4e-05,3.8e-05,5.3e-05,5.2e-05,1.6e-05,3.1e-05,1.6e-05,2.8e-05,1.5e-05,2.5e-05,1.5e-05,4.6e-05,2.9e-05,2.1e-05,3.2e-05,2.9e-05,2.3e-05,3.9e-05,2.6e-05,2e-05,7e-06,1.2e-05,3e-06,1.1e-05,1.2e-05,1.9e-05,4.5e-05,5.5e-05,3.7e-05,1.8e-05,3e-05,4.5e-05,5.3e-05,4.7e-05,3.1e-05,8e-06,4.3e-05,1.3e-05,2e-05,1.9e-05,1.9e-05,2.2e-05,1e-06,2.4e-05,1.4e-05,1.2e-05,2.1e-05,1.8e-05,1.3e-05,7e-06,9e-06,2e-06,1.8e-05,1.7e-05,6e-06,1.1e-05,2.2e-05,4.4e-05,4e-05,3.2e-05,1.8e-05,1.5e-05,2.1e-05,3.1e-05,3.1e-05,2.5e-05,1.6e-05,2.2e-05,1.6e-05,2.3e-05,2.6e-05,3.1e-05,1e-05,3e-06,1.3e-05,2.6e-05,3.5e-05,4.4e-05,4.5e-05,3.6e-05,2.6e-05,1.2e-05,2.1e-05,5e-06,1.3e-05,7e-06,8e-06,2.7e-05,2e-05,1.6e-05,2.2e-05,2.8e-05,2e-05,6e-06,1.3e-05,2e-05,1.7e-05,3.6e-05,3.7e-05,3.3e-05,2.7e-05
1.6e-05,1.5e-05,1.6e-05,2.1e-05,6e-06,2.7e-05,9e-06,1.7e-05,2.8e-05,3.1e-05,2.3e-05,1.1e-05,1.3e-05,1.1e-05,2.7e-05,3.3e-05,2.1e-05,2.8e-05,2.3e-05,3.2e-05,1.2e-05,3.9e-05,1.1e-05,7e-06,2.3e-05,3.8e-05,2.3e-05,6e-06,1.6e-05,2.1e-05,1.9e-05,2.2e-05,1e-05,1.8e-05,3.7e-05,2.1e-05,1.9e-05,2e-05,8e-06,1.5e-05,0,1.2e-05,8e-06,2e-05,2e-05,2.5e-05,2.9e-05,7e-06,2.4e-05,2.4e-05,1.1e-05,2e-05,3.3e-05,1.4e-05,1.7e-05,2.4e-05,2e-05,2.8e-05,1.2e-05,1e-05,2.4e-05,2.6e-05,3e-06,1.2e-05,5e-06,8e-06,8e-06,9e-06,6e-06,1.8e-05,1.8e-05,2e-05,1.5e-05,8e-06,7e-06,2.1e-05,1.4e-05,2.9e-05,4e-06,1.5e-05,1.1e-05,1.9e-05,1.4e-05,1.3e-05,1.5e-05,1.7e-05,1.8e-05,1.9e-05,6e-06,2.3e-05,1.9e-05,3e-06,9e-06,4e-06,1e-05,9e-06,1.4e-05,1.6e-05,1.7e-05,1.5e-05,1.2e-05,1.2e-05,3e-06,3e-06,1.1e-05,8e-06,6e-06,2.9e-05,1.2e-05,5e-06,1.9e-05,1.4e-05,1.8e-05,9e-06,1.8e-05,1.1e-05,6e-06,2.2e-05,1.2e-05,1.2e-05,1.8e-05
5e-06,7e-06,1.3e-05,9e-06,1.2e-05,1e-05,1.1e-05,1.1e-05,1.7e-05,1.6e-05,4e-06,5e-06,8e-06,1.9e-05,8e-06,1e-05,1.3e-05,7e-06,7e-06,1.2e-05,1.7e-05,1.4e-05,8e-06,2e-06,4e-06,2.3e-05,7e-06,3e-06,1.2e-05,1.4e-05,1.2e-05,1.6e-05,1.6e-05,1.1e-05,1.7e-05,9e-06,5e-06,5e-06,2e-06,1.3e-05,5e-06,2.1e-05,3e-06,1.3e-05,3e-06,2e-05,1.1e-05,6e-06,4e-06,2e-06,9e-06,1.5e-05,1.1e-05,5e-06,1.3e-05,2.4e-05,1.9e-05,1.2e-05,7e-06,5e-06,2.7e-05,9e-06,1.6e-05,1.7e-05,1e-06,8e-06,7e-06,1e-05,7e-06,2.1e-05,2.2e-05,1.3e-05,1.4e-05,3e-06,7e-06,2.3e-05,9e-06,1.4e-05,1.5e-05,8e-06,2e-06,1.5e-05,6e-06,2e-05,2.2e-05,8e-06,1.6e-05,8e-06,9e-06,1.5e-05,8e-06,9e-06,8e-06,1e-05,1.3e-05,1.2e-05,1e-05,7e-06,1.3e-05,1.4e-05,1.5e-05,4e-06,2e-06,1.2e-05,9e-06,1.9e-05,7e-06,2.4e-05,1.3e-05,5e-06,1.9e-05,1.7e-05,1.8e-05,1.5e-05,1.2e-05,1.2e-05,1.4e-05,5e-06,9e-06,1.5e-05,9e-06
3e-06,1e-05,9e-06,1.2e-05,3e-06,4e-06,1e-06,1.3e-05,1e-06,1.5e-05,7e-06,5e-06,8e-06,1e-05,4e-06,1e-06,3e-06,6e-06,4e-06,5e-06,1.2e-05,1.3e-05,1e-05,4e-06,5e-06,1.3e-05,9e-06,6e-06,5e-06,1.4e-05,8e-06,1.4e-05,5e-06,1.4e-05,1.1e-05,1.2e-05,1e-05,1.2e-05,5e-06,8e-06,6e-06,2.1e-05,9e-06,5e-06,3e-06,1.2e-05,8e-06,3e-06,7e-06,1.1e-05,1.4e-05,4e-06,1.1e-05,1.8e-05,3e-06,9e-06,1.3e-05,1.3e-05,9e-06,1e-05,2.4e-05,1.6e-05,1.8e-05,6e-06,7e-06,8e-06,1e-05,2.1e-05,1.3e-05,7e-06,1.1e-05,1.4e-05,2e-06,9e-06,8e-06,1.3e-05,7e-06,1e-06,1e-06,9e-06,4e-06,7e-06,1e-05,2.4e-05,3.1e-05,2.4e-05,1.5e-05,7e-06,0,9e-06,1.5e-05,5e-06,2e-06,1.1e-05,1.2e-05,8e-06,1.3e-05,1.1e-05,1e-05,9e-06,1.1e-05,5e-06,3e-06,9e-06,1e-05,9e-06,8e-06,1e-05,1e-06,4e-06,7e-06,5e-06,1.4e-05,1e-05,6e-06,5e-06,9e-06,6e-06,5e-06,4e-06,5e-06
3e-06,1e-05,3e-06,8e-06,3e-06,6e-06,1e-06,6e-06,5e-06,1.2e-05,7e-06,2e-06,4e-06,9e-06,0,5e-06,8e-06,9e-06,4e-06,3e-06,5e-06,1.1e-05,7e-06,1.1e-05,9e-06,1.2e-05,1e-05,5e-06,3e-06,9e-06,1e-05,1.6e-05,8e-06,1.3e-05,7e-06,9e-06,6e-06,4e-06,4e-06,4e-06,6e-06,1.8e-05,2e-06,7e-06,3e-06,1.6e-05,7e-06,4e-06,1.4e-05,5e-06,1.3e-05,6e-06,1e-06,9e-06,6e-06,1e-05,6e-06,1.5e-05,8e-06,8e-06,2.3e-05,1.2e-05,1.7e-05,6e-06,3e-06,5e-06,1e-05,1.4e-05,7e-06,1.2e-05,3e-06,1e-05,3e-06,2e-06,7e-06,1.7e-05,1.2e-05,3e-06,5e-06,9e-06,9e-06,1.1e-05,1.2e-05,2.2e-05,2e-05,1e-05,1.4e-05,8e-06,5e-06,6e-06,1e-05,6e-06,8e-06,4e-06,1.1e-05,3e-06,1e-05,3e-06,1.7e-05,3e-06,1.2e-05,5e-06,5e-06,2e-06,3e-06,7e-06,6e-06,1.1e-05,3e-06,3e-06,1e-05,9e-06,9e-06,1.2e-05,3e-06,7e-06,6e-06,1e-06,4e-06,4e-06,3e-06
3e-06,4e-06,5e-06,6e-06,5e-06,5e-06,3e-06,9e-06,4e-06,8e-06,7e-06,6e-06,3e-06,7e-06,4e-06,9e-06,2e-06,4e-06,3e-06,7e-06,5e-06,5e-06,5e-06,6e-06,1e-05,1.1e-05,7e-06,4e-06,5e-06,6e-06,6e-06,1.6e-05,7e-06,6e-06,1.3e-05,1e-05,2e-06,2e-06,9e-06,3e-06,8e-06,1.5e-05,7e-06,2e-06,2e-06,1e-05,5e-06,3e-06,1.2e-05,4e-06,1e-05,3e-06,2e-06,1.1e-05,6e-06,7e-06,8e-06,1.1e-05,7e-06,9e-06,1.7e-05,1.3e-05,1.7e-05,7e-06,2e-06,3e-06,6e-06,1.2e-05,5e-06,1.2e-05,6e-06,5e-06,7e-06,2e-06,4e-06,1.6e-05,9e-06,3e-06,4e-06,6e-06,1.2e-05,7e-06,1.5e-05,1.6e-05,1.3e-05,6e-06,1.2e-05,9e-06,5e-06,5e-06,1.1e-05,7e-06,7e-06,1.2e-05,9e-06,5e-06,9e-06,4e-06,1.2e-05,8e-06,1e-05,1e-06,1e-06,8e-06,2e-06,7e-06,4e-06,8e-06,2e-06,4e-06,3e-06,2e-06,7e-06,1.2e-05,8e-06,6e-06,4e-06,2e-06,1e-06,4e-06,3e-06
3e-06,8e-06,3e-06,4e-06,3e-06,7e-06,3e-06,7e-06,4e-06,8e-06,3e-06,2e-06,2e-06,3e-06,2e-06,9e-06,4e-06,1e-06,6e-06,8e-06,5e-06,1e-05,4e-06,1.1e-05,6e-06,1.3e-05,1e-05,4e-06,4e-06,3e-06,8e-06,1.6e-05,6e-06,6e-06,1e-05,6e-06,0,3e-06,3e-06,2e-06,3e-06,1.6e-05,1.2e-05,1e-05,1e-06,1.3e-05,6e-06,1e-06,1.1e-05,1e-06,1.5e-05,5e-06,0,1.2e-05,2e-06,9e-06,5e-06,1.3e-05,8e-06,9e-06,1.8e-05,1.2e-05,1.7e-05,6e-06,3e-06,5e-06,6e-06,1.1e-05,6e-06,1.4e-05,9e-06,8e-06,7e-06,6e-06,7e-06,1.8e-05,1.2e-05,4e-06,2e-06,6e-06,1e-05,8e-06,1.1e-05,1.9e-05,1.8e-05,1e-05,8e-06,7e-06,5e-06,5e-06,1.1e-05,1e-05,1.4e-05,5e-06,1.1e-05,5e-06,7e-06,7e-06,1.1e-05,4e-06,4e-06,1e-06,1e-06,5e-06,2e-06,7e-06,4e-06,9e-06,0,7e-06,8e-06,5e-06,9e-06,1e-05,4e-06,7e-06,7e-06,2e-06,7e-06,7e-06,2e-06
1e-06,6e-06,1e-06,6e-06,3e-06,9e-06,4e-06,8e-06,4e-06,6e-06,4e-06,1e-06,2e-06,2e-06,2e-06,7e-06,2e-06,3e-06,4e-06,8e-06,3e-06,7e-06,2e-06,1e-05,4e-06,9e-06,1e-05,4e-06,2e-06,2e-06,8e-06,1.7e-05,5e-06,6e-06,1.1e-05,7e-06,2e-06,6e-06,5e-06,2e-06,4e-06,1.1e-05,5e-06,7e-06,1e-06,1.3e-05,5e-06,2e-06,1.3e-05,2e-06,1.1e-05,7e-06,3e-06,1.2e-05,3e-06,1.1e-05,5e-06,1.3e-05,8e-06,7e-06,1.7e-05,1.5e-05,1.6e-05,6e-06,2e-06,3e-06,5e-06,1.3e-05,3e-06,1.1e-05,8e-06,5e-06,6e-06,8e-06,1e-06,1.6e-05,9e-06,3e-06,3e-06,5e-06,1e-05,7e-06,7e-06,1.6e-05,1.8e-05,9e-06,1.2e-05,6e-06,4e-06,6e-06,8e-06,6e-06,1.1e-05,6e-06,9e-06,2e-06,9e-06,5e-06,1.1e-05,4e-06,7e-06,1e-06,1e-06,8e-06,1e-06,7e-06,2e-06,8e-06,3e-06,5e-06,7e-06,3e-06,8e-06,9e-06,4e-06,1e-05,4e-06,1e-06,5e-06,6e-06,6e-06
1e-06,7e-06,1e-06,3e-06,4e-06,7e-06,3e-06,6e-06,3e-06,7e-06,2e-06,2e-06,2e-06,2e-06,2e-06,4e-06,3e-06,2e-06,4e-06,8e-06,1e-06,6e-06,2e-06,6e-06,7e-06,1.2e-05,5e-06,6e-06,3e-06,3e-06,7e-06,1.6e-05,6e-06,5e-06,1e-05,8e-06,2e-06,2e-06,6e-06,2e-06,2e-06,9e-06,2e-06,5e-06,2e-06,1.1e-05,2e-06,6e-06,1.3e-05,1e-06,1e-05,5e-06,2e-06,1.1e-05,1e-06,1.2e-05,5e-06,1.3e-05,6e-06,7e-06,1.5e-05,1.2e-05,1.6e-05,3e-06,5e-06,6e-06,4e-06,1.2e-05,3e-06,1e-05,6e-06,5e-06,6e-06,4e-06,1e-06,1.4e-05,7e-06,2e-06,1e-06,6e-06,9e-06,6e-06,1e-05,2e-05,1.6e-05,9e-06,1e-05,9e-06,4e-06,6e-06,8e-06,6e-06,1.2e-05,4e-06,1.1e-05,1e-06,8e-06,3e-06,9e-06,4e-06,6e-06,3e-06,2e-06,7e-06,1e-06,8e-06,3e-06,7e-06,2e-06,4e-06,6e-06,1e-06,6e-06,8e-06,4e-06,7e-06,7e-06,3e-06,4e-06,4e-06,6e-06
0,6e-06,1e-06,4e-06,3e-06,7e-06,3e-06,7e-06,2e-06,7e-06,2e-06,1e-06,1e-06,1e-06,1e-06,5e-06,2e-06,2e-06,4e-06,7e-06,1e-06,5e-06,1e-06,7e-06,5e-06,1e-05,8e-06,6e-06,3e-06,1e-06,7e-06,1.5e-05,3e-06,4e-06,1.1e-05,8e-06,1e-06,3e-06,4e-06,1e-06,1e-06,1.1e-05,2e-06,5e-06,3e-06,1.3e-05,4e-06,6e-06,1.3e-05,1e-06,1.1e-05,6e-06,1e-06,1e-05,2e-06,1.1e-05,7e-06,1.2e-05,6e-06,4e-06,1.6e-05,1.3e-05,1.4e-05,6e-06,2e-06,4e-06,3e-06,1.2e-05,2e-06,9e-06,6e-06,4e-06,5e-06,5e-06,1e-06,1.3e-05,7e-06,4e-06,3e-06,6e-06,8e-06,8e-06,7e-06,2e-05,1.6e-05,9e-06,1e-05,8e-06,4e-06,7e-06,7e-06,7e-06,1.1e-05,5e-06,1e-05,2e-06,9e-06,4e-06,1e-05,5e-06,6e-06,2e-06,2e-06,7e-06,1e-06,6e-06,3e-06,8e-06,1e-06,4e-06,6e-06,2e-06,7e-06,8e-06,5e-06,6e-06,5e-06,1e-06,4e-06,3e-06,6e-06
