0.51613,0.726001,0.92321,1.019069,1.029135,1.13243,1.259388,1.226192,1.372607,1.605174,1.498614,1.397114,1.339921,1.352511,1.434048,1.358268,1.402386,1.611416,1.539638,1.27089,1.358333,1.664518,1.64043,1.53281,1.612399,1.655874,1.40008,1.133593
0.594538,0.844657,1.070109,1.179333,1.195636,1.311306,1.446202,1.423754,1.617018,1.868293,1.73625,1.624567,1.572372,1.621237,1.71629,1.581621,1.599565,1.847684,1.793814,1.548697,1.67546,1.946629,1.893985,1.814013,1.93407,1.96221,1.660449,1.396817
0.700888,1.013957,1.275998,1.398331,1.443077,1.580207,1.712567,1.717086,1.97338,2.227751,2.080684,1.9614,1.941932,2.084171,2.175034,1.90912,1.876014,2.18666,2.163513,2.002625,2.214481,2.381026,2.265054,2.250126,2.439453,2.42608,2.072229,1.865841
0.723314,1.060503,1.324656,1.441474,1.546573,1.710501,1.821458,1.865482,2.138963,2.345284,2.213943,2.107251,2.204335,2.480751,2.495869,2.081235,2.009334,2.329072,2.298929,2.288286,2.587117,2.596008,2.413309,2.476567,2.69632,2.627695,2.313622,2.265299
0.673952,0.964943,1.187919,1.308944,1.506561,1.730082,1.835702,1.879486,2.088908,2.224689,2.138274,2.113349,2.348186,2.674853,2.635659,2.210801,2.109361,2.284121,2.186319,2.322644,2.654115,2.573888,2.343113,2.402918,2.581005,2.491016,2.33657,2.490392
0.606883,0.826312,1.035384,1.217279,1.478326,1.715745,1.815386,1.87655,2.036098,2.114978,2.100614,2.231864,2.449765,2.618009,2.630677,2.377732,2.251934,2.156494,1.933678,2.121348,2.445965,2.460354,2.321514,2.335496,2.431484,2.406787,2.387322,2.548981
0.677831,0.926205,1.19739,1.429301,1.643263,1.845255,2.031292,2.177954,2.314545,2.34031,2.37216,2.565729,2.575396,2.447328,2.566703,2.579718,2.471247,2.26586,1.920931,1.999402,2.377257,2.600871,2.631836,2.606395,2.575376,2.676623,2.697373,2.633418
1.000921,1.399122,1.795409,2.014179,2.027899,2.197495,2.624258,2.953983,3.152891,3.217337,3.116307,2.974787,2.776685,2.570469,2.73567,2.869972,2.789295,2.690745,2.37916,2.396525,2.832668,3.161715,3.228565,3.075146,3.000325,3.335579,3.278675,2.896221
1.516411,2.124272,2.688879,2.823007,2.539919,2.718894,3.457947,3.942112,4.088023,4.286075,4.03191,3.356786,3.115725,3.078657,3.188991,3.233784,3.141858,3.243909,3.192982,3.277358,3.626089,3.922634,3.954002,3.67295,3.722526,4.263602,4.011879,3.484184
2.09129,2.941303,3.677419,3.695022,3.052918,3.178319,4.156793,4.766587,4.756377,5.084387,4.767644,3.702876,3.496272,3.664828,3.7888,3.621253,3.482532,3.76272,4.067085,4.316961,4.376946,4.546948,4.582275,4.234689,4.523214,5.231244,4.783536,4.213049
2.560821,3.620974,4.462797,4.336411,3.419074,3.502086,4.46113,5.069067,4.946379,5.274569,5.023101,4.000573,3.841606,4.090189,4.193029,3.776758,3.744681,4.218883,4.838653,5.251277,4.9581,4.937671,4.926585,4.508144,4.992166,5.841304,5.369875,4.862941
2.823968,3.94795,4.839264,4.546901,3.465136,3.539167,4.22897,4.740069,4.683887,5.00956,4.909967,4.287811,4.183089,4.269375,4.28637,3.762296,4.010528,4.827945,5.710261,6.02604,5.410099,5.214838,4.953814,4.475567,5.142796,6.117239,5.857386,5.606497
2.690852,3.638597,4.533462,4.253557,3.233168,3.266692,3.719338,4.299487,4.410702,4.670539,4.576993,4.302605,4.357717,4.272463,4.295521,3.886653,4.161267,5.266605,6.37789,6.405752,5.599508,5.404325,4.968245,4.551739,5.459047,6.518992,6.431933,6.465342
2.138919,2.735045,3.426232,3.362397,2.790004,2.899363,3.197954,3.746885,3.893853,4.050316,4.089913,4.089503,4.150857,4.009277,4.174453,3.916826,3.893447,5.007865,6.266048,5.989341,5.248253,5.400882,5.005315,4.724826,5.806502,6.93361,6.988862,6.961874
1.677217,1.97886,2.412683,2.674059,2.628368,2.775199,3.224496,3.64252,3.379112,3.495879,4.020281,4.278592,4.148624,3.981626,4.260692,4.057129,3.681469,4.86529,6.359298,5.717692,5.363793,6.252257,5.53485,4.981206,6.172592,7.41042,7.668807,7.142158
1.999843,2.323927,2.819296,3.4414,3.618776,3.58735,4.301189,4.716277,3.972257,4.222452,5.358056,5.874894,5.403704,4.947333,5.208885,5.005473,4.686668,6.494013,7.995996,6.716389,6.943535,8.538917,7.018632,5.821646,7.252792,8.573137,8.905913,7.917058
3.011014,3.639594,4.510436,5.594779,6.051603,5.823975,6.308321,6.779202,6.03408,6.405669,7.912617,8.653136,7.877714,6.707556,6.689143,6.881592,7.189747,9.702121,11.023808,9.071196,9.407071,11.283055,9.533459,8.121592,9.468643,10.480424,10.975896,10.146158
4.491917,5.705012,7.165444,8.857383,9.931586,9.455377,9.063092,10.024714,10.037888,9.750719,11.162245,12.693031,11.884562,9.430602,8.469512,9.550159,11.214463,13.600719,14.019035,11.803123,11.97386,13.609644,12.869873,12.340427,12.712994,12.501571,13.405137,13.55203
6.177018,8.234914,10.420909,12.710641,14.777765,14.190067,12.668355,14.464875,15.820722,14.07738,14.739492,17.765124,17.506731,13.489833,11.388146,13.555879,16.608328,17.751331,16.371217,14.14096,13.824585,14.993204,16.520677,17.586383,16.220462,14.463,16.16246,17.567511
7.502542,10.384293,13.197407,15.687732,18.904707,18.777928,16.727185,19.340156,22.24428,18.903034,17.876149,22.141778,22.914723,17.93011,15.235634,18.268876,22.083369,21.352315,17.785059,15.8356,15.082853,15.905779,19.929703,22.235764,19.693072,17.011834,18.63983,20.609704
7.935181,11.272173,14.443958,16.453503,20.002436,20.698583,19.204936,21.956626,26.075068,22.592343,20.039913,23.800315,24.895059,20.669236,18.907788,22.01887,25.041592,22.880694,18.134853,17.265717,16.231148,15.635885,20.843349,23.543529,20.757364,18.114951,18.828919,20.864269
8.22349,11.286651,14.0197,15.166773,17.481113,18.524815,18.548749,20.319674,24.216244,22.727829,20.172722,21.432364,21.702455,20.843295,21.895137,23.521834,23.4091,20.503783,16.917768,17.885009,16.924142,14.587889,18.854911,21.310408,18.677656,15.986578,15.853844,18.684245
8.634751,11.028938,12.578713,12.476255,13.587039,15.181466,17.041598,17.192007,18.439644,19.419999,18.988425,17.472126,15.934866,19.263982,23.636842,23.245514,19.287791,16.406828,16.398255,19.561187,18.889943,15.092182,16.763874,17.734864,14.735036,12.887658,13.251314,16.280946
8.670724,10.52585,10.874411,9.953379,10.933398,13.074641,15.517065,15.818704,15.304722,16.651198,17.948342,15.715295,13.177606,17.289899,21.830198,20.923123,16.807259,14.90788,17.684155,21.577739,20.828748,17.335261,17.74067,16.836019,12.370337,11.579252,13.251049,14.793402
8.458122,10.040746,9.308834,8.423417,10.094361,12.685809,14.790246,14.858512,13.436579,13.937592,15.449809,13.842426,12.364721,15.783245,18.121894,18.024244,15.729171,14.009562,16.97513,20.072321,19.986424,17.982037,17.036526,16.049422,12.547631,11.933631,14.142887,13.69109
7.549589,9.439914,8.94426,8.125992,9.651396,12.260585,13.839739,12.884016,10.918777,11.787724,13.295679,12.239482,12.365957,14.607057,14.121105,14.365987,14.500715,12.981287,13.690478,15.110022,16.169903,15.24608,13.595211,14.315746,12.829098,11.656066,13.759827,12.783357
5.435438,7.401652,7.955001,7.932767,9.311697,10.829494,11.011187,10.001309,9.001561,10.381564,11.38415,10.813728,11.404609,11.920315,10.136235,10.56415,12.146814,10.893108,9.910837,9.830183,11.091544,10.984388,9.871769,11.894774,11.640103,10.008771,11.955195,11.942009
3.095464,4.829047,6.184785,6.754904,8.192647,8.900236,7.860369,7.439102,7.497175,8.744305,9.317374,9.392971,9.776927,8.336332,6.850266,7.993324,9.544786,8.993857,8.812464,7.319309,6.981156,8.066287,8.18091,9.783131,9.717635,8.51799,9.875573,10.579019
1.794178,2.93318,3.877174,4.510972,5.965021,6.828423,6.068822,5.79155,6.023534,7.351876,7.597707,7.327916,7.556483,5.891372,5.181095,6.379178,7.097828,6.757862,7.600704,6.343212,4.832093,6.101928,6.954111,7.488174,7.436327,6.782951,7.406521,8.7622
1.673569,2.005102,2.165624,2.62109,3.793728,4.614188,4.569293,4.532161,4.755847,5.754746,5.565302,4.969198,4.956571,4.325895,4.697678,5.399322,5.551837,4.873874,5.405448,5.428252,4.333638,4.674903,5.876772,6.29162,5.871192,5.142027,5.33202,6.618572
1.724393,1.476625,1.411206,1.828642,2.434217,2.776512,2.900708,3.119971,3.726042,4.125103,3.422686,3.169525,3.398719,3.77622,4.951965,5.491096,5.062185,3.83209,3.421147,4.298701,4.440525,3.957319,5.348282,5.999883,5.182308,4.47502,4.176371,4.934562
1.68106,1.427492,1.432926,1.704188,2.034315,2.029026,1.928269,2.665,3.850763,3.688317,2.539901,2.677225,3.157621,3.803759,5.362639,5.864484,4.708678,3.239401,2.486954,3.412081,4.193341,3.631867,4.941906,5.848049,5.068556,4.318962,3.720686,3.680538
1.481794,1.472033,1.535987,1.516583,1.589348,1.676853,1.787899,3.079882,4.643661,4.235141,2.623521,2.656388,3.512964,4.037085,5.653943,5.652127,3.58843,2.457166,2.36199,3.140106,3.638653,3.414854,4.586614,5.710759,5.064087,3.957073,3.513816,3.071752
1.293838,1.600205,1.557361,1.182313,1.058632,1.359112,1.717536,3.262198,4.961301,4.269772,2.52782,2.58275,3.674956,4.056499,5.258807,4.546759,2.093246,1.565945,2.305651,3.132282,3.014949,3.178416,4.220718,5.233886,5.32494,4.173134,3.705012,3.025015
1.234467,1.702049,1.506212,1.025771,0.950949,1.534199,1.976876,3.045938,4.311707,3.475025,2.193483,2.445198,3.307854,3.492493,4.111655,3.212408,1.252249,1.266931,2.535929,3.232365,2.71022,2.994752,3.59232,4.024583,4.986835,4.356618,3.897642,3.166399
1.395663,1.64464,1.393743,1.097941,1.071222,1.859486,2.508215,2.865578,3.079149,2.504457,1.929495,2.005918,2.58664,3.070949,3.17272,2.36991,1.277007,1.556175,2.766439,2.913495,2.236266,2.927389,3.248109,2.957532,4.043886,3.90754,3.764054,3.296054
1.529207,1.485086,1.327881,1.241833,1.195326,1.976074,2.838462,2.772495,2.285546,2.283345,1.88043,1.615212,2.47526,3.2384,2.931063,2.012735,1.491147,1.813021,2.695753,2.28602,1.570866,2.690521,2.982123,2.644325,3.437204,3.42802,3.548432,3.001449
1.575232,1.37103,1.286412,1.323271,1.292028,1.787855,2.642209,3.042137,2.747329,2.61943,1.999277,1.636385,2.629997,3.341292,3.129862,2.067188,1.631786,2.00273,2.598961,2.069233,1.486632,2.49203,2.739602,2.754042,3.537175,3.796857,3.392971,2.426142
1.706233,1.464229,1.11921,1.373745,1.498777,1.453699,2.023792,3.11143,3.356945,2.807688,2.225691,1.915322,2.55348,2.827266,3.017841,2.165018,1.687967,2.218965,2.775636,2.244457,1.969231,2.33302,2.487071,3.095674,4.348042,4.85154,3.274671,1.94426
1.691461,1.558763,1.141672,1.680442,1.830795,1.370101,1.588339,3.019569,3.519281,2.493972,2.26285,2.424889,2.374619,1.992459,2.554135,2.056649,1.647015,2.286828,3.137903,2.665634,2.460476,2.111627,2.264587,3.0958,4.833378,5.767057,3.549253,1.861321
