1.4e-05,1.1e-05,1.1e-05,2e-06,5e-06,1.2e-05,1.1e-05,1.7e-05,5e-06,7e-06,1.1e-05,8e-06,1e-06,5e-06,1.4e-05,2.5e-05,3.9e-05,0.000151,2.1e-05,0.000184,0.000506,0.000233,5.5e-05,9.7e-05,0.000105,8.6e-05,4.7e-05,3.2e-05,7.7e-05,0.000137,3.7e-05,9.9e-05,3.7e-05,0.000721,0.000416,0.000374,0.000579,6.2e-05,0.000848,0.000729,0.000793,0.00027,0.000255,0.000592,0.000133,1.6e-05,7.6e-05,0.000209,0.000431,0.000161,0.001069,0.00015,0.000253,0.000255,2.5e-05,4.2e-05,0.000247,0.000436,0.000212,0.000167,7e-05,0.000399,2.3e-05,6e-05,4.1e-05,1.6e-05,0.000296,4.2e-05,5.7e-05,5.8e-05,3.1e-05,3.2e-05,2.1e-05,2e-06,2e-05,1.4e-05,4e-06,2.7e-05,2.1e-05,0.000142,6.9e-05,9.2e-05,3.2e-05,5.1e-05,1.9e-05,6.7e-05,5.3e-05,3.5e-05,3.7e-05,8e-06,2.6e-05,1.6e-05,2.5e-05,2.9e-05,1.3e-05,2.8e-05,2e-05,4e-06,1.7e-05,2.3e-05,3e-06,2.3e-05,4e-06,2.4e-05,4.5e-05,9e-06,2.5e-05,2.3e-05,1.3e-05,1.8e-05,5e-06,6e-06,9e-06,3e-06,5e-06,1.5e-05,9e-06,1.2e-05,1e-06,3e-06,9e-06
1.6e-05,3e-06,2e-05,2.9e-05,2.2e-05,3e-05,4.8e-05,1.8e-05,2.2e-05,3.2e-05,4.6e-05,1.9e-05,7e-06,3.9e-05,2.8e-05,3.1e-05,8.7e-05,0.000356,0.000365,0.000256,0.001162,0.000595,0.000264,0.000222,6.7e-05,0.000318,0.000223,0.000138,0.000151,0.000373,0.000219,0.000165,7e-05,0.002103,0.002112,0.001783,0.001523,0.000227,0.001514,0.00202,0.00249,0.000794,0.000732,0.001425,0.000797,0.000947,0.000606,0.000374,0.000413,0.000228,0.001877,0.000961,0.000569,0.000441,0.000296,0.000527,0.000893,0.001153,0.00042,0.000127,0.000298,0.000703,0.000464,0.000522,0.000309,0.000108,0.000817,0.000327,0.000269,0.000213,0.000154,0.000101,8e-05,0.000145,0.000109,7.6e-05,0.000116,6.7e-05,0.000222,0.000499,0.000495,0.000473,0.000161,0.000239,0.000244,0.000239,0.000192,0.000182,0.000174,6.4e-05,8.2e-05,3.9e-05,4.4e-05,5.4e-05,4.1e-05,9.2e-05,4.7e-05,6.3e-05,9e-06,6.5e-05,8.1e-05,6.8e-05,5.2e-05,4.5e-05,0.000122,0.000126,0.000101,9.6e-05,6.7e-05,5.2e-05,4.3e-05,2e-05,2.4e-05,1.1e-05,4.8e-05,5e-05,2.8e-05,1.6e-05,3.2e-05,3.7e-05,2.5e-05
1.8e-05,1.5e-05,9e-06,3.1e-05,1.8e-05,3.9e-05,9e-06,2e-05,2.6e-05,4.3e-05,2.1e-05,2.7e-05,3.3e-05,3.6e-05,3.2e-05,5.1e-05,8.2e-05,0.000521,0.000176,1.8e-05,0.001348,0.000755,0.000278,0.000139,0.000116,6e-04,2e-04,6.7e-05,0.000198,0.00013,0.00014,0.000135,0.000129,0.003389,0.001933,0.000889,0.002267,0.001578,0.000963,0.001516,0.000298,0.001157,0.001233,0.000892,0.002213,0.001678,0.000531,0.000297,0.000341,0.000241,0.001491,0.000393,0.001112,0.001098,0.000917,0.000478,0.00119,0.001533,0.001054,0.00042,0.000285,0.000528,0.000851,0.000204,0.000441,0.000449,0.000637,0.000318,0.000398,0.000231,0.000253,6.8e-05,2.7e-05,0.000272,8.6e-05,0.000123,0.000167,0.00013,0.000497,0.000318,0.000139,0.000119,0.000568,0.000255,0.000194,0.000405,0.000355,0.000169,4.2e-05,1.9e-05,4.9e-05,6.4e-05,7.4e-05,0.000113,2.6e-05,6.3e-05,3.2e-05,7.2e-05,5.2e-05,2.3e-05,4.4e-05,4.6e-05,1e-05,6.4e-05,1.9e-05,5.2e-05,3.8e-05,5.9e-05,2.1e-05,2.3e-05,4.6e-05,2.5e-05,6e-06,1.2e-05,6.3e-05,1.8e-05,3.8e-05,1.1e-05,3.9e-05,6e-06,1e-05
4.5e-05,3.5e-05,3.6e-05,5.5e-05,6.2e-05,6.8e-05,6.7e-05,6.1e-05,5.5e-05,4.7e-05,5.9e-05,6.4e-05,7.2e-05,8.2e-05,4.5e-05,3.1e-05,0.000256,0.000744,0.000427,0.000192,0.001688,0.000253,0.000214,0.000205,8.9e-05,0.00039,0.000342,0.000306,0.000156,0.000161,0.000111,9.5e-05,0.00019,0.004881,0.003833,0.000982,0.003412,0.004205,0.003639,0.001065,0.003471,0.000692,0.00252,0.001416,0.003116,0.003362,0.002477,0.000904,0.001037,0.000463,0.001343,0.001481,0.000757,0.001385,0.000653,0.000954,0.001121,0.000611,0.000534,0.000338,6e-04,0.000267,0.000135,0.000213,0.000775,0.001041,0.001043,0.001276,0.00073,0.000641,0.000198,0.000386,0.000308,0.000427,0.000298,0.000187,0.000119,5.4e-05,0.00048,0.000545,0.000456,0.000289,0.000587,0.000414,0.000318,0.000556,0.000353,0.000176,5.5e-05,7.8e-05,9.4e-05,9e-05,5.4e-05,4.9e-05,1.2e-05,3.6e-05,5.8e-05,4.9e-05,6.9e-05,6e-05,5.5e-05,5.6e-05,6e-05,6.8e-05,7.3e-05,2.6e-05,5.3e-05,5.5e-05,6.7e-05,5.9e-05,5.2e-05,4.3e-05,3.2e-05,3.8e-05,4.3e-05,5.2e-05,4.1e-05,3.7e-05,4.7e-05,4.8e-05,3.9e-05
6e-06,1e-06,1.1e-05,2.4e-05,2.6e-05,1.4e-05,2.3e-05,3.1e-05,1.5e-05,1.7e-05,2.2e-05,3e-06,3.8e-05,1.7e-05,3.5e-05,3.5e-05,0.000351,0.001238,0.000635,5e-04,0.001569,0.001073,0.000343,0.000131,0.00013,0.00013,0.000153,0.00021,0.000244,8.7e-05,7e-06,0.000107,0.000171,0.00578,0.002805,0.003603,0.001261,0.001309,0.002812,0.002318,0.003282,0.001736,0.002755,0.002967,0.000105,0.00122,0.002201,0.002823,0.000701,0.000704,0.001459,0.001247,0.002236,0.000358,0.000527,0.001741,0.001195,0.000606,0.001734,0.000583,0.001148,0.001205,0.000591,0.000402,0.001116,0.000798,0.000293,0.000873,0.000786,0.00032,0.000339,0.000389,0.000175,0.000196,0.000241,0.000229,0.000315,0.000172,0.000417,0.000875,0.000261,0.000226,0.000494,9.4e-05,9.5e-05,0.000514,0.000204,4.4e-05,0.000146,9.7e-05,1.8e-05,1e-04,2.8e-05,4.6e-05,1.8e-05,2.9e-05,3.1e-05,3.6e-05,5.5e-05,1.6e-05,3.4e-05,3.8e-05,1.3e-05,7e-06,3.1e-05,3e-05,2e-05,1.7e-05,3.9e-05,4e-06,2.1e-05,2e-05,2.1e-05,3.7e-05,1.4e-05,4.3e-05,1.9e-05,8e-06,2.4e-05,9e-06,9e-06
1.4e-05,1.6e-05,2.4e-05,2e-05,2.3e-05,1.6e-05,1e-05,3.7e-05,2.7e-05,2.6e-05,2.6e-05,2e-05,1.3e-05,1.9e-05,1.8e-05,1.8e-05,0.000451,0.001607,0.000869,0.00096,0.001694,0.000756,0.000772,0.00049,0.000246,0.000601,6.1e-05,0.000111,0.000128,0.000165,0.000153,0.00016,0.00012,0.005943,0.003122,0.004037,0.004259,0.002162,0.00337,0.00597,0.0061,0.002112,0.003876,0.002567,0.001048,0.002874,0.001437,0.001647,0.000987,0.000481,0.002065,0.00093,0.001997,0.002601,0.003117,0.002096,0.002458,0.002165,0.001774,0.002329,0.001904,0.001545,2e-04,0.000307,0.001119,0.000805,0.00057,0.000451,0.000235,0.000817,0.000324,0.00047,0.000213,0.00013,0.000183,6.4e-05,0.000255,9.4e-05,0.000352,0.000961,0.000558,0.000442,0.000252,0.000298,0.000254,0.000645,0.000341,0.000173,0.000222,9.6e-05,3.6e-05,0.000118,0.000117,2.6e-05,2e-05,1.4e-05,5.9e-05,6.8e-05,1e-06,1.9e-05,3.3e-05,3.2e-05,4e-05,4.9e-05,3.5e-05,4.2e-05,2.4e-05,2.6e-05,1.9e-05,1.6e-05,3e-06,2.5e-05,1.1e-05,1.1e-05,2e-05,4.1e-05,5.5e-05,2.9e-05,9e-06,8e-06,1.8e-05
2.2e-05,1.7e-05,4.5e-05,4.7e-05,3.2e-05,2e-05,1.6e-05,1.9e-05,3.1e-05,4.4e-05,2.8e-05,6.1e-05,4.7e-05,1.3e-05,1.9e-05,4.4e-05,0.000595,0.001578,0.000764,0.001365,0.001186,0.000897,0.000773,8.7e-05,0.000105,0.000756,0.000415,0.00021,8.9e-05,0.000142,3.8e-05,3.8e-05,0.000153,0.005137,0.001852,0.003728,0.003608,0.002809,0.005094,0.006787,0.001455,0.006855,0.007931,0.00371,0.000854,0.004415,0.002794,0.00232,0.002148,0.00036,0.002398,0.003338,0.004887,0.002054,0.002732,0.001727,0.003329,0.004198,0.00331,0.000354,0.000838,0.000347,0.001682,0.001076,0.001457,0.000629,0.001084,0.000879,0.000193,0.000904,0.00149,0.000685,0.000159,0.000108,0.000205,0.00032,0.000225,0.000137,0.000266,0.00077,0.000456,0.000593,0.000546,0.000408,0.000148,0.000568,0.000365,0.000155,0.000318,0.000116,3.8e-05,0.000163,1e-05,0.000142,5.7e-05,6.6e-05,3.3e-05,1.5e-05,2.9e-05,3.1e-05,1.2e-05,3.7e-05,3.5e-05,3.8e-05,3e-05,1.8e-05,1.1e-05,4e-06,2.6e-05,1.8e-05,1.3e-05,2.1e-05,2.6e-05,1.6e-05,1.3e-05,4.1e-05,1.5e-05,5e-06,1e-05,3e-06,3.5e-05
1.7e-05,2.1e-05,2.6e-05,2.5e-05,1.8e-05,1.8e-05,3.4e-05,2e-05,3.2e-05,1.3e-05,1e-05,4.3e-05,1.3e-05,1e-05,5e-06,2e-05,0.000769,0.00111,0.000562,0.001428,0.004302,0.002487,0.001628,0.001004,0.000634,0.001128,0.000912,0.000561,0.000112,0.000173,0.000246,9.4e-05,0.000142,0.003746,0.004065,0.00202,0.00281,0.001179,0.001673,0.0044,0.00543,0.006193,0.001227,0.008073,0.008062,0.002554,0.001959,0.000856,0.000327,0.000647,0.001328,0.002202,0.003025,0.004887,0.004465,0.002817,0.001467,0.005259,0.006839,0.005019,0.004113,0.001673,0.002253,0.001045,0.001767,0.001117,0.001451,6.1e-05,0.00038,0.000619,0.000877,0.000753,0.000154,0.000253,0.000319,0.000463,8.8e-05,0.000136,0.000239,0.000505,0.000242,0.000535,0.000442,3.4e-05,0.000133,0.000483,0.000481,0.000265,0.000246,0.000319,0.000104,0.000156,0.000196,6.1e-05,2.2e-05,7.4e-05,2.6e-05,2.9e-05,1.4e-05,2.1e-05,5e-06,4.7e-05,4.3e-05,3.7e-05,4e-05,4.4e-05,2.4e-05,1e-05,2e-05,2.2e-05,1.9e-05,1.5e-05,8e-06,1.8e-05,1e-05,3.8e-05,7.2e-05,4e-05,2.3e-05,3.3e-05,4.1e-05
1.2e-05,1.5e-05,2.1e-05,2.2e-05,4.2e-05,2e-05,2.8e-05,2.4e-05,1e-05,1.8e-05,1.9e-05,2.6e-05,2.4e-05,1.3e-05,3.1e-05,1.3e-05,0.000891,0.000182,0.000189,0.001508,0.005056,0.002769,0.001749,0.001091,0.000497,0.001043,0.001267,0.000556,0.000337,0.000287,7.9e-05,0.000138,5.8e-05,0.001942,0.001189,0.003414,0.004891,0.003802,0.00215,0.005035,0.002929,0.004289,0.004928,0.008338,0.005477,0.003501,0.001276,0.000637,0.000112,0.00071,0.000324,0.000275,0.002586,0.001987,0.001823,0.000918,0.002233,0.001994,0.003343,0.001027,0.002256,0.001448,0.001087,0.001197,0.000923,0.000434,0.001022,0.001605,0.000902,0.000442,0.000409,0.000192,0.000329,0.00038,0.000493,0.000251,3e-04,5.3e-05,0.000198,0.000409,0.000253,0.000681,0.000248,1e-04,6.1e-05,0.000449,0.000406,0.000136,0.000132,0.000308,0.000248,0.000294,0.000111,0.00017,6.7e-05,3.6e-05,4.2e-05,3.6e-05,2e-05,1.7e-05,2.5e-05,4.8e-05,2.4e-05,1.7e-05,3.7e-05,2.3e-05,2.3e-05,2.7e-05,1.9e-05,2.3e-05,1.4e-05,3.5e-05,1.7e-05,2.1e-05,2.5e-05,3.4e-05,7.5e-05,2.6e-05,3.6e-05,4.2e-05,5.4e-05
2.5e-05,3.6e-05,4.3e-05,3.4e-05,1e-05,1.6e-05,2.6e-05,1.9e-05,1.2e-05,1.4e-05,7e-06,1.3e-05,1.5e-05,7e-06,3.8e-05,4e-05,0.000972,0.000831,0.000534,0.001049,0.002002,0.005714,0.004702,0.001951,0.000966,0.00151,0.001132,0.000578,0.000398,0.000172,0.00013,0.000226,0.000254,0.00086,0.00048,0.001963,0.002642,0.001976,0.000396,0.002323,0.001656,0.002375,0.004226,0.002286,0.000575,0.00081,0.000895,0.001774,0.001466,0.000653,8e-05,0.001493,0.000752,0.001707,0.000382,0.000552,0.001725,0.002725,0.000843,0.000759,0.001502,0.000631,0.000705,0.001098,0.000907,0.000947,0.000681,0.000676,0.000103,0.000128,7.3e-05,0.000102,0.000183,8.6e-05,0.000221,6.2e-05,2.5e-05,7.9e-05,0.000236,0.000316,0.000292,0.000427,0.00059,0.000498,0.000348,0.000386,8.3e-05,0.000156,0.000193,0.000291,9.4e-05,0.000153,0.000112,9.3e-05,0.000123,6.1e-05,4.7e-05,2.8e-05,2e-05,2.1e-05,1.8e-05,4.6e-05,4.9e-05,2.8e-05,1.9e-05,3e-05,5.2e-05,2.3e-05,1.7e-05,3.9e-05,4.2e-05,2.6e-05,5.6e-05,6.9e-05,3.1e-05,3.5e-05,0.000121,0.000111,2.3e-05,6.4e-05,3.7e-05
1.7e-05,1.5e-05,1.8e-05,1.1e-05,1.3e-05,1.7e-05,3e-05,2.5e-05,1.5e-05,1.4e-05,5e-06,1.6e-05,4e-06,1e-05,2.7e-05,8e-06,0.00106,0.001042,0.000385,0.000788,0.001002,0.004792,0.002187,0.001059,0.000511,0.000915,0.000106,0.000254,0.000456,0.000309,0.000266,0.000128,9.3e-05,0.001249,0.001403,0.001099,0.002559,0.001289,0.001251,0.00126,0.001244,0.002018,0.001421,0.002943,0.00198,0.001178,0.000543,0.002184,0.001274,0.001314,0.000337,0.001315,0.001344,0.000679,0.001451,0.000337,0.000512,0.00147,0.000713,0.000422,0.00032,0.000889,4e-04,0.001111,0.000544,0.000657,0.000477,0.000554,0.000422,0.000191,0.000155,0.000177,0.000168,0.000167,0.000138,8.5e-05,5.5e-05,5.3e-05,0.000191,0.000294,0.000243,0.000442,0.000186,0.000213,2.7e-05,0.000132,3e-05,9.1e-05,0.00017,0.000163,8.8e-05,0.000107,8.8e-05,9.1e-05,7.2e-05,3.8e-05,4.2e-05,1.5e-05,2.2e-05,7e-06,2.4e-05,2.3e-05,3.7e-05,2.9e-05,2.5e-05,2.1e-05,1.4e-05,1.2e-05,2.6e-05,4.4e-05,2e-05,3.3e-05,4.2e-05,2.9e-05,2.3e-05,4e-06,0.000101,7e-05,6.6e-05,0.000115,7.3e-05
1.2e-05,2.6e-05,1.1e-05,6e-06,1.1e-05,5e-06,2.5e-05,4e-06,6e-06,3e-06,2e-06,9e-06,1.3e-05,1.2e-05,2.6e-05,1.9e-05,0.001114,0.000772,0.000479,0.000802,0.001523,0.002536,0.000619,0.000213,0.000247,0.000642,0.00054,0.000206,0.000202,9.5e-05,4.2e-05,7.7e-05,0.000108,0.001844,0.001414,0.001266,0.001253,0.000943,0.000273,0.003568,0.001058,0.001513,0.00255,0.002659,0.000675,0.001082,0.001038,0.000878,0.001234,0.001826,0.000614,0.000708,0.00203,0.000781,0.001345,0.000806,0.000279,0.001104,0.000258,0.001033,0.000556,0.000361,0.000268,0.00026,0.001063,0.000885,0.00062,0.000379,0.000268,0.000225,0.000217,0.000224,0.00012,0.00023,0.000168,9.9e-05,6.5e-05,5.9e-05,0.000193,0.000207,9.4e-05,0.000243,0.000338,0.000202,0.000139,0.000148,2e-05,4.5e-05,0.000215,0.000165,7.4e-05,8.1e-05,6e-05,0.000124,8.5e-05,6.7e-05,4.3e-05,4.2e-05,1e-05,2.2e-05,6e-06,7e-06,4e-05,1.6e-05,1.5e-05,1e-05,1.2e-05,8e-06,1.2e-05,2.9e-05,4.1e-05,3.4e-05,1.3e-05,3.8e-05,3.7e-05,1.3e-05,6.7e-05,2.3e-05,3.6e-05,6.1e-05,2.5e-05
1e-05,1.6e-05,8e-06,4e-06,3e-06,4e-06,1.1e-05,1.4e-05,1.5e-05,0,5e-06,1.3e-05,1e-05,1.5e-05,4e-06,4e-06,0.001111,0.00055,2e-04,0.001092,0.002287,0.001893,0.001543,0.000466,0.000129,9.7e-05,0.000391,0.000179,1e-05,0.000172,7.8e-05,0.000155,9.6e-05,0.00251,0.001035,0.00188,0.001456,0.002685,0.0022,0.003917,0.001548,0.001585,0.001443,0.000569,3.9e-05,0.001258,0.002754,0.001653,0.001572,0.000649,0.00099,0.001866,0.000154,0.00154,0.001543,0.001904,0.000852,0.001151,0.000444,0.000576,0.001122,0.001146,0.000523,0.000965,0.00104,0.000952,0.000602,0.000627,0.000645,0.000289,0.000132,0.000284,7.4e-05,0.00017,0.000209,9.6e-05,0.000103,2.6e-05,0.000232,0.000189,6.5e-05,0.000156,0.000528,0.000399,0.000151,0.000155,3.9e-05,3.3e-05,0.000184,1.7e-05,1e-05,6.2e-05,4.2e-05,0.000207,7.2e-05,9e-05,6.2e-05,1.2e-05,1.9e-05,1.4e-05,6e-06,1.3e-05,1.8e-05,2.3e-05,1.2e-05,1.1e-05,7e-06,1.1e-05,6e-06,1.7e-05,2.5e-05,1.5e-05,1.7e-05,1.1e-05,2e-05,2.5e-05,2.2e-05,1.1e-05,1.7e-05,1.5e-05,1.8e-05
5e-06,1.9e-05,2e-05,1.4e-05,3e-06,5e-06,6e-06,1.2e-05,1.3e-05,1.3e-05,5e-06,5e-06,6e-06,2.2e-05,2.1e-05,1.2e-05,0.001088,0.000426,0.000198,0.001233,0.003395,0.002704,0.00047,0.000174,2.9e-05,0.000178,0.000205,0.000198,0.000331,9e-05,0.000103,6.6e-05,0.000143,0.00318,0.001218,0.002443,0.001803,0.002296,0.001423,0.001125,0.000899,0.001552,0.001461,0.002322,0.003368,0.002785,0.002274,0.001098,0.000464,0.001553,0.002432,0.00132,0.002876,0.000241,0.001536,0.002256,0.001178,0.001483,0.000767,0.000881,0.000789,0.001854,0.000635,0.000135,0.001053,0.001001,0.000929,0.00077,0.00089,0.000434,0.000284,0.000238,0.00014,6.1e-05,0.00016,4.7e-05,0.000176,9.9e-05,0.000341,0.000356,0.000181,0.000298,0.000865,0.00034,9.5e-05,0.00011,6.7e-05,6.1e-05,0.000147,6.1e-05,3.3e-05,0.000121,5.8e-05,0.000223,5.9e-05,6.5e-05,8e-06,1.3e-05,7e-06,1.3e-05,1.3e-05,1.9e-05,2.4e-05,2.2e-05,1.5e-05,9e-06,5e-06,3e-06,1.5e-05,3.5e-05,1.4e-05,1.8e-05,5e-06,5e-06,1.4e-05,5e-06,2.1e-05,1.4e-05,2.2e-05,2.6e-05,2.5e-05
1.8e-05,3.1e-05,2.7e-05,4e-06,1.3e-05,2.6e-05,2.3e-05,2.3e-05,1.2e-05,1.6e-05,1e-05,1.5e-05,1e-05,2.2e-05,1.9e-05,1.9e-05,0.001025,0.001107,0.000655,0.001435,0.001748,0.000991,0.001255,0.000398,9.7e-05,0.000171,0.000236,0.000127,0.000495,0.000138,0.000155,8.6e-05,0.000147,0.003441,0.004517,0.001343,0.004415,0.005015,0.000789,0.004475,0.001279,0.004927,0.003852,0.001453,0.002732,0.003925,0.004452,0.005393,0.002172,0.004098,0.003058,0.003698,0.005064,0.002074,0.001757,0.002988,0.002731,0.001412,0.001842,0.00232,0.001589,0.00129,0.002974,0.002594,0.001644,0.000715,0.001057,0.00048,0.001107,0.00018,0.00068,0.000409,0.000292,1.9e-05,0.000414,0.000266,0.000335,0.00013,0.000279,0.00034,0.00014,0.00028,0.001172,0.000627,0.000201,0.000186,7.5e-05,5.6e-05,0.00011,0.000132,8e-05,0.000125,6.7e-05,0.000225,6.2e-05,3.6e-05,3e-05,2.3e-05,2.1e-05,1.9e-05,3e-05,3.1e-05,4.7e-05,2.1e-05,1.9e-05,3.4e-05,7e-06,1.4e-05,1.8e-05,4.6e-05,2.8e-05,4.1e-05,2.7e-05,3e-06,1.1e-05,2.2e-05,2.2e-05,3.5e-05,2.3e-05,3.9e-05,1.7e-05
1.2e-05,3.5e-05,2.5e-05,2.2e-05,3.1e-05,1.8e-05,2.7e-05,1.3e-05,2.3e-05,2.6e-05,2.1e-05,2e-05,8e-06,3.4e-05,1.6e-05,3.2e-05,0.000947,0.001004,0.000565,0.002207,0.002973,0.001473,4.7e-05,0.000259,0.000109,4.2e-05,0.00029,2e-04,0.000614,0.000565,0.000272,8.2e-05,0.000155,0.003329,0.009756,0.002597,0.004771,0.007856,0.003808,0.004888,0.008269,0.00753,0.007863,0.004833,0.004439,0.003958,0.003385,0.004442,0.006531,0.007643,0.007683,0.010638,0.010373,0.004854,0.00335,0.005253,0.005377,0.003626,0.002802,0.001935,0.000571,0.003458,0.004575,0.000942,0.001506,0.003554,0.001893,0.001576,0.003648,0.001767,0.000706,0.000613,6.2e-05,0.000447,0.000627,0.000458,0.000158,0.000173,0.000168,0.000279,0.000207,0.000285,0.001127,0.000851,0.000276,0.000251,0.000179,5.2e-05,6.6e-05,0.000196,9.1e-05,0.000117,6.4e-05,0.000205,0.000112,4.1e-05,2.4e-05,2.7e-05,1.6e-05,3.7e-05,5.8e-05,7.9e-05,0.000101,0.000105,9e-05,8.9e-05,6.5e-05,4.9e-05,4.4e-05,5.8e-05,3e-05,2.5e-05,6e-06,9e-06,2e-05,1.7e-05,2e-05,2.6e-05,4.1e-05,4.8e-05,4.4e-05
3.6e-05,3.5e-05,5e-05,5.1e-05,1.8e-05,3.7e-05,2.7e-05,1.4e-05,3.5e-05,6.3e-05,4.4e-05,1.9e-05,9e-06,3e-05,4.1e-05,2.8e-05,0.000876,0.000251,7.3e-05,0.002423,0.001538,0.001082,0.000791,0.000217,0.000105,8.4e-05,0.000305,0.000259,0.000484,0.00037,0.000262,0.000223,1e-04,0.00318,0.008515,0.010946,0.008157,0.003527,0.005533,0.005189,0.007098,0.010213,0.006731,0.003635,0.005231,0.008744,0.008419,0.009797,0.012954,0.012806,0.011085,0.003295,0.00493,0.007817,0.00629,0.002559,0.005911,0.005607,0.002668,0.005123,0.004107,0.004697,0.008125,0.008392,0.004132,0.004955,0.005961,0.004399,0.005252,0.006103,0.002749,0.000772,0.00106,0.000144,0.001084,0.000525,0.000454,0.00052,0.00035,2.7e-05,6.1e-05,0.000139,0.001022,0.000733,0.000536,0.000252,0.000185,0.000179,0.000128,0.000167,6.3e-05,8e-05,7.6e-05,0.000302,0.00022,0.000141,7.9e-05,4.3e-05,3.4e-05,1.2e-05,4.8e-05,9.5e-05,9e-05,5.3e-05,3.1e-05,5.9e-05,3.2e-05,1.3e-05,1.6e-05,2.3e-05,2.4e-05,3.2e-05,3.7e-05,2.6e-05,1.4e-05,2.6e-05,4e-05,1.4e-05,2.8e-05,3.1e-05,4.3e-05
4.9e-05,2.7e-05,3e-05,1.4e-05,9e-06,2.3e-05,1.6e-05,1e-05,3.7e-05,1.6e-05,7e-06,1.6e-05,1.8e-05,1.7e-05,1.6e-05,1.3e-05,0.000794,0.000554,0.00021,0.002157,0.00339,0.002485,0.001127,0.000225,0.000239,0.000215,0.000333,6.4e-05,0.000218,8.5e-05,0.000118,0.000124,0.000136,0.003299,0.002917,0.007507,0.006599,0.004028,0.004199,0.003434,0.00464,0.001381,0.005848,0.002245,0.004034,0.007586,0.004661,0.004012,0.004191,0.002061,0.003533,0.006868,0.004066,0.004126,0.005357,0.006552,0.006534,0.007026,0.009127,0.006926,0.004411,0.007831,0.003193,0.003173,0.00372,0.00399,0.00044,0.000318,0.004659,0.003761,0.002386,0.001606,0.001217,0.000927,0.000427,0.000522,0.000772,0.000358,0.000129,6e-05,1.9e-05,0.000127,0.000487,5e-04,0.000232,4.9e-05,0.000129,7e-05,3.2e-05,6.4e-05,6.9e-05,1.5e-05,5.8e-05,0.000454,0.000401,0.000226,0.000112,3.3e-05,6e-06,2.4e-05,4.8e-05,3.6e-05,1.8e-05,1.1e-05,1.1e-05,4.3e-05,3.5e-05,1.1e-05,1.4e-05,2.8e-05,5e-06,8e-06,1.7e-05,2e-05,8e-06,2.2e-05,1.7e-05,7e-06,1.2e-05,3.4e-05,1.9e-05
2.2e-05,2.6e-05,2.6e-05,3e-05,9e-06,1e-05,1.9e-05,1.9e-05,2.1e-05,2.6e-05,8e-06,1.3e-05,1e-05,2.1e-05,1.2e-05,1.1e-05,0.000668,0.001087,0.000568,0.001511,0.002231,0.001112,0.000474,0.000424,0.000368,0.00031,0.000347,0.000217,0.00031,0.000173,6.7e-05,8.8e-05,7e-05,0.003023,0.003009,0.00339,0.001796,0.003123,0.004689,0.003282,0.003723,0.001571,0.00396,0.006468,0.006214,0.001481,0.003011,0.003633,0.003374,0.003446,0.000926,0.003389,0.004402,0.003635,0.005815,0.003157,0.003268,0.003297,0.003104,0.001821,0.002749,0.003384,0.002972,0.003274,0.002851,7e-05,0.001275,0.001039,0.002196,0.000868,0.000837,0.00095,0.000609,6.5e-05,0.000454,0.000396,0.000369,0.000114,0.00012,0.000227,0.000117,0.00018,0.00025,0.000296,0.000209,2.4e-05,7.2e-05,6.3e-05,0.000116,8e-05,5.5e-05,9e-05,9.8e-05,0.000657,0.000545,2e-04,4.3e-05,2.5e-05,2.3e-05,1.9e-05,2.3e-05,2.3e-05,1.5e-05,1.5e-05,2.4e-05,2.2e-05,1.2e-05,1.4e-05,6e-06,3.2e-05,3.6e-05,2.4e-05,2.3e-05,3.8e-05,5.2e-05,3.2e-05,2.8e-05,1.9e-05,7e-06,3.5e-05,3.4e-05
1.3e-05,9e-06,1.3e-05,2.3e-05,2.1e-05,2.4e-05,2.5e-05,1e-05,6e-06,1.7e-05,1.5e-05,1.3e-05,2.3e-05,2.5e-05,2e-05,1.3e-05,0.000568,0.001227,0.000701,0.001183,0.00114,0.000943,0.000417,4e-04,0.000336,0.00028,0.000238,0.000169,0.000398,0.000202,9.9e-05,9.3e-05,0.000105,0.002168,0.001502,0.002436,0.002799,0.004252,0.000911,0.001443,0.00239,0.000127,0.001156,0.003233,0.004863,0.003507,0.004472,0.004096,0.002885,0.002603,0.001326,0.001402,0.000435,0.002898,0.003236,0.003633,0.001832,0.003386,0.001351,0.000548,0.002936,0.004136,0.001481,0.00063,0.000849,0.000914,0.001642,0.000587,0.000673,0.000714,0.00047,0.000687,0.000227,0.000307,0.000159,0.000153,0.00027,0.000211,0.000246,0.000301,0.000143,0.000146,0.000482,0.000125,5.2e-05,0.000129,4.6e-05,3.3e-05,0.000136,5.8e-05,5.5e-05,5e-05,4.6e-05,0.000786,0.000563,0.000253,5.7e-05,1.1e-05,2.9e-05,9e-06,2e-05,5e-06,1.3e-05,1.7e-05,2e-05,1.9e-05,2.6e-05,1e-06,4e-06,2.7e-05,2.4e-05,1.9e-05,2.1e-05,2.9e-05,5e-05,4.2e-05,2e-05,2.8e-05,4e-05,2e-05,9e-06
1e-05,2.2e-05,1.3e-05,1.2e-05,3e-06,4e-06,1.6e-05,9e-06,5e-06,1.9e-05,9e-06,8e-06,2.4e-05,4e-06,1.6e-05,5e-06,0.000484,0.000806,0.000363,0.001455,0.001449,0.000762,0.000204,0.000224,0.000239,0.000495,0.000221,0.000101,0.000293,0.000208,0.000128,9.2e-05,0.000121,0.001514,0.001336,0.001507,0.002322,0.002243,0.0012,0.000913,0.00148,0.000911,0.001077,0.001587,0.00083,0.002588,0.002426,0.002738,0.00046,0.001579,0.000448,0.002248,0.002648,0.002864,0.002144,0.003223,0.002086,0.000243,0.000494,0.001051,0.002064,0.000707,0.001807,0.000311,0.000512,0.001184,0.000283,0.000217,0.000897,0.000732,0.000683,0.000187,0.000134,0.000238,0.000209,6.2e-05,9.2e-05,2.4e-05,0.000143,0.000192,9.5e-05,0.000131,0.000539,0.000476,0.000151,0.000101,4.4e-05,2.5e-05,9.4e-05,0.000123,7.6e-05,4.2e-05,2.7e-05,0.000814,0.000481,0.00023,4.5e-05,1.6e-05,3.8e-05,3.1e-05,2.6e-05,2.2e-05,1.1e-05,1.1e-05,2e-06,1.4e-05,4e-06,1.2e-05,1.2e-05,3e-06,9e-06,2.6e-05,2e-05,2.1e-05,1.3e-05,2.1e-05,2e-05,2.2e-05,1e-05,1.2e-05,1.4e-05
5e-06,1.4e-05,7e-06,1.3e-05,1e-05,1.6e-05,1e-06,1e-06,4e-06,7e-06,7e-06,1.4e-05,1.2e-05,9e-06,1e-05,5e-06,0.000411,0.000284,0.000188,0.001226,0.000688,0.000857,0.000306,0.000313,0.000131,0.000336,0.000235,9.2e-05,0.000293,0.000228,0.000105,7.8e-05,8.1e-05,0.000984,0.00043,0.000885,0.002091,0.001676,0.001631,0.000865,0.001272,0.000604,0.000409,0.001172,0.000668,0.001248,0.002276,0.000733,0.000965,0.00115,0.000477,0.000998,0.001432,0.002176,0.001679,0.000651,0.000266,0.000943,0.000561,0.001011,0.001156,0.001401,0.001101,0.000665,0.00016,0.000756,0.000683,0.000283,0.001176,8.5e-05,0.000189,0.00035,0.000143,0.000202,0.00011,0.000103,1.7e-05,2e-05,0.000156,0.000165,8.4e-05,6.1e-05,0.000574,0.000186,7.7e-05,1.7e-05,5.7e-05,4e-05,8e-05,3.2e-05,2.5e-05,3.6e-05,3e-05,0.000761,0.000386,0.000214,4.4e-05,1.1e-05,2e-05,1.4e-05,1.1e-05,1.1e-05,1.2e-05,1.8e-05,4e-06,7e-06,5e-06,1.2e-05,1.9e-05,8e-06,1.1e-05,2e-05,5e-06,1.5e-05,1.1e-05,1e-05,1.5e-05,1.2e-05,2e-05,6e-06,1.1e-05
4e-06,2e-06,4e-06,4e-06,0,1.1e-05,5e-06,4e-06,7e-06,4e-06,3e-06,2e-06,4e-06,3e-06,1e-06,6e-06,0.000182,0.000206,9.6e-05,0.000292,0.000533,0.000358,0.00016,0.000173,5.1e-05,7.5e-05,5.9e-05,5.3e-05,8.8e-05,3.5e-05,3.4e-05,3e-05,1.3e-05,0.000331,0.000519,0.000377,0.000932,0.000277,0.000632,0.000688,0.000904,0.000498,0.000439,0.00057,0.000191,0.000438,0.000636,0.000304,0.000258,0.000404,0.00016,0.000444,0.000247,8.1e-05,0.000579,0.000605,0.000198,0.000133,4e-05,0.000301,0.000113,0.000558,0.000255,0.00016,0.00024,0.000163,0.00013,4.4e-05,0.000426,0.000143,3.6e-05,8.7e-05,2.2e-05,5.4e-05,6.3e-05,2.6e-05,2e-06,2e-06,6.8e-05,2.2e-05,8e-06,1e-05,0.000209,0.000166,6.7e-05,3.2e-05,6e-06,4e-06,5.6e-05,4.2e-05,2e-06,8e-06,8e-06,0.00033,0.000161,5.4e-05,1.8e-05,1.2e-05,3e-06,8e-06,8e-06,6e-06,8e-06,4e-06,4e-06,4e-06,4e-06,3e-06,5e-06,4e-06,6e-06,6e-06,4e-06,4e-06,4e-06,1e-06,2e-06,7e-06,5e-06,6e-06,3e-06
7e-06,2e-06,6e-06,4e-06,3e-06,9e-06,6e-06,9e-06,3e-06,2e-06,3e-06,2e-06,2e-06,4e-06,0,5e-06,0.000157,0.000117,3.2e-05,0.000129,0.000465,0.000334,0.000115,0.000102,2.2e-05,7e-05,3e-05,1.3e-05,3.5e-05,5.9e-05,1.5e-05,2.5e-05,2.6e-05,0.000185,0.000525,0.000302,0.001,0.000801,0.000816,0.000369,0.000197,0.000212,0.000506,0.000142,0.000377,0.000415,0.000241,0.000472,9.3e-05,0.000286,1.7e-05,0.000403,0.000501,0.000113,0.000446,0.000726,0.000299,0.000245,0.000171,0.000304,0.000288,0.000235,0.000237,2.3e-05,0.000188,0.000121,0.000132,0.000102,0.000264,4.1e-05,1.7e-05,6.2e-05,1.4e-05,3.6e-05,4.4e-05,1.6e-05,1.8e-05,7e-06,4.2e-05,1.5e-05,2e-06,1.5e-05,0.000104,8.7e-05,6e-05,1e-05,1.2e-05,9e-06,8.3e-05,3.5e-05,1.7e-05,2e-05,1.3e-05,0.000248,0.000136,4.9e-05,9e-06,4e-06,1e-05,1.3e-05,5e-06,3e-06,2e-06,3e-06,1e-06,2e-06,3e-06,7e-06,4e-06,1e-06,6e-06,5e-06,7e-06,6e-06,6e-06,1e-06,6e-06,5e-06,3e-06,5e-06,8e-06
3e-06,3e-06,6e-06,4e-06,3e-06,6e-06,5e-06,3e-06,1e-06,3e-06,4e-06,4e-06,2e-06,3e-06,3e-06,6e-06,0.000149,8.2e-05,3.6e-05,0.000207,8.2e-05,0.000412,0.000138,2.8e-05,2.5e-05,2.6e-05,2.6e-05,2.6e-05,3.1e-05,1.3e-05,5e-06,2e-05,5e-06,0.000164,5.9e-05,0.000336,0.000611,0.000406,0.000401,0.00022,4e-04,0.000666,0.000377,0.000397,0.000427,0.000362,0.000267,0.000219,0.000306,0.000299,9e-05,0.000175,0.000539,0.000521,0.000671,0.00028,0.000127,8e-05,3.4e-05,0.000316,0.000113,0.000254,0.000159,6e-05,0.000137,5.4e-05,6.1e-05,8.4e-05,0.000242,3.5e-05,3.7e-05,6.3e-05,1.4e-05,3.5e-05,2.3e-05,8e-06,6e-06,6e-06,2.8e-05,4e-06,7e-06,2.4e-05,5e-05,2.4e-05,3.2e-05,2.9e-05,1.1e-05,1.6e-05,0.000108,6.7e-05,3.2e-05,8e-06,5e-06,0.00016,0.000103,3e-05,1.5e-05,9e-06,5e-06,3e-06,1e-05,1e-05,7e-06,3e-06,1e-06,0,2e-06,4e-06,2e-06,2e-06,5e-06,6e-06,7e-06,0,3e-06,3e-06,7e-06,4e-06,2e-06,1.1e-05,4e-06
4e-06,5e-06,1e-06,2e-06,0,3e-06,4e-06,2e-06,2e-06,5e-06,1e-06,2e-06,4e-06,2e-06,2e-06,4e-06,0.000136,0.00015,6.1e-05,0.000141,0.000271,9e-05,0.000144,8.9e-05,2.6e-05,1.6e-05,3.7e-05,2.6e-05,7.6e-05,3.3e-05,1.2e-05,5e-06,3e-06,0.000223,0.000177,0.000106,0.000324,0.000779,0.00079,0.00032,0.000552,0.000925,0.000303,0.000545,6.6e-05,0.000673,0.000275,0.000392,0.000143,0.000342,0.000273,0.000352,0.000478,0.000477,0.000445,0.000429,0.000127,0.000356,0.000307,0.000122,8.9e-05,0.000365,7.7e-05,8.3e-05,0.00013,5.7e-05,7.5e-05,7e-05,0.000223,3.2e-05,2.7e-05,6.1e-05,2.4e-05,7.3e-05,3.8e-05,2.5e-05,1.5e-05,9e-06,2.4e-05,1.3e-05,1.2e-05,1.4e-05,1.5e-05,5e-05,2.9e-05,1.4e-05,1e-05,4e-06,8.7e-05,3.2e-05,1.4e-05,1.1e-05,1.2e-05,1e-04,7.7e-05,4.1e-05,1.1e-05,6e-06,4e-06,2e-06,4e-06,3e-06,2e-06,1e-06,2e-06,3e-06,2e-06,4e-06,3e-06,4e-06,3e-06,3e-06,1e-06,0,3e-06,3e-06,5e-06,9e-06,7e-06,6e-06,6e-06
2e-06,4e-06,4e-06,1e-06,2e-06,1e-06,5e-06,1e-06,2e-06,2e-06,3e-06,3e-06,4e-06,2e-06,2e-06,4e-06,0.000137,0.000112,6.6e-05,0.000266,0.000127,0.000143,5e-05,4.1e-05,3.1e-05,6e-05,6.7e-05,3.8e-05,0.000121,2.6e-05,9e-06,5e-06,1.5e-05,0.000297,0.000112,0.000292,0.000364,0.000537,9e-05,0.000584,0.000301,0.000412,0.000585,0.000501,0.000442,0.000553,0.000726,0.000248,0.000174,0.000251,0.000288,7.7e-05,0.000384,0.000124,0.000402,0.000115,0.000271,0.000322,0.000168,0.000136,9.1e-05,0.000322,2e-04,5.6e-05,0.000121,2.4e-05,3.7e-05,7.9e-05,0.000197,2.3e-05,1e-05,5.7e-05,1.9e-05,5.1e-05,3.1e-05,2e-05,2.1e-05,2.4e-05,5e-05,6.1e-05,2.8e-05,1.7e-05,2.3e-05,3.2e-05,4.1e-05,4.5e-05,2.4e-05,1.6e-05,5.9e-05,4.8e-05,2.1e-05,1.7e-05,1.1e-05,0.000109,4.1e-05,1.5e-05,4e-06,2e-06,4e-06,1e-06,1e-06,1e-06,2e-06,2e-06,1e-06,5e-06,4e-06,5e-06,1e-06,4e-06,5e-06,4e-06,3e-06,2e-06,3e-06,1e-06,5e-06,6e-06,1e-06,5e-06,3e-06
2e-06,3e-06,3e-06,3e-06,3e-06,5e-06,5e-06,4e-06,4e-06,2e-06,2e-06,3e-06,2e-06,1e-06,1e-06,1e-06,0.00013,0.000188,8.7e-05,0.000341,0.000279,0.000119,3.5e-05,4.8e-05,2e-05,7.9e-05,3.2e-05,1.7e-05,0.000101,0.000104,4.7e-05,1.6e-05,1.5e-05,0.000395,0.000164,0.000444,8.3e-05,0.000208,0.000281,0.000596,0.000493,0.000459,0.000125,0.000349,0.000474,0.000143,0.000446,0.000412,0.000205,0.000232,0.000221,0.000267,0.000311,0.000352,0.000174,0.00047,9.3e-05,0.000328,0.000382,0.000264,0.00011,0.00026,0.00013,0.000108,8.4e-05,4.5e-05,6.7e-05,0.000126,0.000174,2.7e-05,9e-06,2.1e-05,1.9e-05,2.8e-05,1.6e-05,1.6e-05,1.6e-05,8e-06,3.8e-05,6.5e-05,4e-05,2.5e-05,3.2e-05,2.6e-05,4e-05,5.2e-05,1.8e-05,1e-05,4.9e-05,1.9e-05,6e-06,2.6e-05,1.2e-05,0.00015,8.8e-05,5.3e-05,1.7e-05,5e-06,4e-06,1e-06,5e-06,4e-06,7e-06,2e-06,3e-06,3e-06,2e-06,1e-06,5e-06,2e-06,1e-06,4e-06,2e-06,4e-06,2e-06,0,4e-06,1e-06,4e-06,2e-06,5e-06
3e-06,2e-06,3e-06,1e-06,1e-06,5e-06,2e-06,4e-06,0,2e-06,2e-06,3e-06,3e-06,3e-06,1e-06,2e-06,0.000128,0.000206,8.7e-05,0.000205,0.000278,0.00016,0.000102,7.1e-05,1.9e-05,6.4e-05,2.9e-05,2.5e-05,7.3e-05,0.000101,6.7e-05,5.5e-05,2.2e-05,0.000432,0.000124,0.000574,0.000438,0.000388,0.000725,0.00066,0.000266,0.000273,0.00014,0.000297,0.000389,7.8e-05,0.000331,7.1e-05,0.000152,0.000214,0.000171,0.000144,0.00028,0.000285,0.000107,0.000344,0.000243,0.000513,0.000328,5.9e-05,0.000133,0.000299,0.000107,0.000112,4.5e-05,0.000178,2.5e-05,9.3e-05,0.000208,6.3e-05,3.6e-05,2.4e-05,1.6e-05,3.4e-05,1.8e-05,1.9e-05,2e-06,1.4e-05,4.2e-05,5.3e-05,3.3e-05,3.5e-05,2.6e-05,7e-06,3.3e-05,1e-05,1.2e-05,8e-06,4.9e-05,3e-05,1e-05,1.8e-05,8e-06,0.000165,9.3e-05,3.6e-05,6e-06,7e-06,4e-06,4e-06,1e-06,5e-06,4e-06,3e-06,5e-06,1e-06,2e-06,0,2e-06,4e-06,3e-06,3e-06,6e-06,3e-06,2e-06,2e-06,2e-06,1e-06,6e-06,5e-06,7e-06
6e-06,4e-06,4e-06,2e-06,1e-06,3e-06,3e-06,1e-06,2e-06,1e-06,2e-06,3e-06,2e-06,1e-06,2e-06,2e-06,0.000125,0.000138,8.9e-05,0.000111,0.000301,0.000261,0.000116,2.9e-05,1.4e-05,2.6e-05,9e-06,1.8e-05,4.7e-05,3e-05,1.7e-05,3e-05,4e-06,0.000353,0.000173,0.00045,1.4e-05,0.000331,0.000648,0.000301,0.000161,0.000426,0.000368,0.000193,0.000442,0.000362,0.000136,0.00015,0.000128,0.000248,0.000234,0.000247,0.000309,0.000172,0.000344,0.000319,0.000124,0.000537,0.000251,0.000259,0.000114,8.5e-05,5e-05,0.00013,0.000218,2e-05,0.000102,8.6e-05,0.000231,9.4e-05,0.000167,9e-05,4.1e-05,4.3e-05,4.9e-05,3.4e-05,1.9e-05,1.7e-05,2.3e-05,3.6e-05,1.3e-05,2.8e-05,9e-06,2.1e-05,2e-05,1e-05,4e-06,7e-06,4.9e-05,2.5e-05,1.4e-05,7e-06,6e-06,0.000167,0.000143,7.7e-05,1.4e-05,3e-06,3e-06,2e-06,1e-06,3e-06,1e-06,1e-06,1e-06,4e-06,1e-06,0,1e-06,6e-06,4e-06,7e-06,3e-06,4e-06,2e-06,2e-06,5e-06,3e-06,3e-06,2e-06,5e-06
1e-06,2e-06,3e-06,4e-06,3e-06,2e-06,2e-06,2e-06,3e-06,2e-06,2e-06,3e-06,2e-06,2e-06,1e-06,2e-06,0.000117,0.000104,5.1e-05,0.000209,0.000244,0.000294,0.000134,0.000102,2.9e-05,2.8e-05,1.6e-05,1.3e-05,7.2e-05,4.4e-05,1.6e-05,2e-05,1.5e-05,0.000186,0.000105,0.000198,0.000288,0.000574,0.000817,0.000703,0.000103,0.000375,0.000298,0.000228,0.000336,0.00021,0.000285,0.000164,0.000168,0.000187,0.000228,0.000222,0.000142,0.000262,0.00019,0.000116,0.000282,0.000131,0.000134,0.000269,0.000237,0.000292,0.000134,0.000203,8.4e-05,9.3e-05,0.000141,8.2e-05,0.000262,0.000152,8e-05,6.1e-05,3.7e-05,4.1e-05,6e-05,1.5e-05,1.7e-05,8e-06,2.2e-05,1.9e-05,9e-06,3.1e-05,1.7e-05,2.9e-05,1.6e-05,6e-06,6e-06,1e-05,4e-05,2.7e-05,1.3e-05,5e-06,4e-06,0.000146,0.000115,4.3e-05,6e-06,7e-06,6e-06,6e-06,2e-06,4e-06,0,2e-06,4e-06,3e-06,2e-06,2e-06,3e-06,5e-06,3e-06,4e-06,2e-06,4e-06,2e-06,1e-06,5e-06,3e-06,2e-06,3e-06,4e-06
3e-06,1e-06,3e-06,1e-06,1e-06,3e-06,5e-06,3e-06,2e-06,1e-06,1e-06,3e-06,3e-06,3e-06,2e-06,1e-06,0.00011,6.8e-05,1.8e-05,0.000131,0.000322,0.000107,0.000118,7e-05,1.6e-05,1.4e-05,2.7e-05,3.4e-05,8.2e-05,4.6e-05,3.4e-05,2.5e-05,2.4e-05,9.3e-05,7.9e-05,8.4e-05,9.9e-05,6e-04,0.000469,0.000344,0.000112,0.000315,0.000287,0.000622,0.000263,0.000295,8e-05,0.00013,8.9e-05,0.000154,0.000165,0.000197,0.000261,0.000132,0.000107,0.000401,9e-05,0.000157,0.000209,0.000264,0.000177,0.000171,0.000147,0.000198,0.000267,0.000112,2.6e-05,9.4e-05,0.000288,7.8e-05,0.000156,9.2e-05,7.7e-05,1.8e-05,4.8e-05,3.3e-05,1.2e-05,1.1e-05,3.1e-05,1e-05,1.5e-05,2.6e-05,1.9e-05,1.5e-05,6e-06,1.5e-05,8e-06,7e-06,5.5e-05,2.6e-05,1.2e-05,1.7e-05,3e-06,0.000123,4.8e-05,2.9e-05,9e-06,4e-06,4e-06,5e-06,5e-06,3e-06,2e-06,3e-06,5e-06,6e-06,4e-06,3e-06,2e-06,3e-06,4e-06,3e-06,3e-06,3e-06,2e-06,2e-06,2e-06,2e-06,4e-06,4e-06,7e-06
1e-06,2e-06,1e-06,2e-06,1e-06,3e-06,1e-06,2e-06,1e-06,1e-06,1e-06,2e-06,1e-06,2e-06,1e-06,3e-06,1e-04,5.8e-05,4.4e-05,0.000189,0.000394,0.000301,0.000173,7.9e-05,3e-05,3e-05,3.9e-05,2.1e-05,8.5e-05,6e-05,3.9e-05,9e-06,1.1e-05,0.000216,0.000145,0.000113,0.00012,0.000157,0.000291,0.000669,0.000453,0.000156,0.000301,0.000573,0.000364,0.000347,0.000287,0.000164,0.000121,0.000166,0.000143,0.000232,0.000124,0.000115,8.4e-05,0.000429,0.000131,0.000376,0.000318,8.8e-05,0.000122,0.000257,0.000203,0.000135,7.4e-05,9.4e-05,4e-05,0.000126,0.000321,0.000152,4.1e-05,9.5e-05,5e-05,6.7e-05,7.6e-05,3.6e-05,3e-05,1.1e-05,2.9e-05,8e-06,2.4e-05,1.3e-05,2e-05,5e-06,2.6e-05,2e-05,1.7e-05,1.6e-05,5.6e-05,3.2e-05,1.9e-05,1.2e-05,1.4e-05,8.8e-05,4.8e-05,1.7e-05,1.1e-05,6e-06,7e-06,8e-06,2e-06,2e-06,3e-06,1e-06,8e-06,1e-06,3e-06,3e-06,2e-06,4e-06,8e-06,5e-06,3e-06,2e-06,3e-06,5e-06,5e-06,2e-06,2e-06,6e-06,8e-06
1e-06,3e-06,3e-06,2e-06,4e-06,1e-06,3e-06,3e-06,2e-06,1e-06,1e-06,1e-06,2e-06,2e-06,1e-06,2e-06,9.2e-05,0.00014,0.000102,0.000316,0.000339,0.000454,0.000159,8.1e-05,1.8e-05,4.1e-05,4.8e-05,6.5e-05,3.5e-05,5.7e-05,3.2e-05,2.1e-05,2e-05,0.000273,5.8e-05,0.000132,0.000272,0.000132,0.000108,0.000404,0.000233,0.000191,0.00013,0.000199,0.000124,0.000188,0.000339,0.000269,2.7e-05,0.000203,0.000165,9.3e-05,0.000307,0.000211,0.000107,0.000338,0.000201,0.000168,0.000281,0.000127,0.000124,0.000256,8.6e-05,8.2e-05,7.2e-05,6.8e-05,8e-05,0.000107,0.000183,7.6e-05,6e-05,9.4e-05,5.3e-05,4.1e-05,7e-06,3.1e-05,2e-05,1.5e-05,1.6e-05,2.8e-05,2.1e-05,2.3e-05,3.2e-05,2.9e-05,5.2e-05,1.1e-05,1.5e-05,7e-06,6.4e-05,4e-05,2e-05,6e-06,1e-05,7e-05,4.1e-05,2.6e-05,1.7e-05,1e-05,4e-06,4e-06,9e-06,4e-06,3e-06,3e-06,3e-06,5e-06,3e-06,3e-06,3e-06,3e-06,3e-06,3e-06,3e-06,1e-06,2e-06,4e-06,3e-06,2e-06,2e-06,3e-06,3e-06
2e-06,3e-06,3e-06,1e-06,2e-06,3e-06,1e-06,3e-06,2e-06,1e-06,1e-06,2e-06,2e-06,1e-06,2e-06,1e-06,7.6e-05,0.000232,0.000105,0.000328,0.00027,0.000274,0.000121,6.9e-05,1.1e-05,4.8e-05,1.2e-05,3.7e-05,8.3e-05,7.6e-05,3.7e-05,1.5e-05,9e-06,0.000309,0.000124,0.000124,0.000355,0.000376,0.000315,0.000329,0.000402,0.000371,0.000287,0.000285,0.00042,0.000251,0.000332,5.8e-05,3.9e-05,0.000184,0.000145,0.000217,0.000356,9.5e-05,0.000265,0.000317,0.000349,0.00015,0.000134,0.000182,0.000249,0.000199,0.000116,0.000166,0.000109,5.1e-05,0.000159,0.000157,0.000104,0.000151,6.6e-05,4.5e-05,3.3e-05,3.7e-05,5.6e-05,5e-05,2.1e-05,2.6e-05,2.9e-05,5.4e-05,2.9e-05,2.2e-05,4.2e-05,1e-05,4.8e-05,5e-05,1e-05,1.1e-05,6.6e-05,3.3e-05,1.1e-05,1.2e-05,1.1e-05,6.2e-05,4.7e-05,2.3e-05,1e-05,4e-06,6e-06,2e-06,7e-06,1.1e-05,4e-06,1e-06,2e-06,5e-06,5e-06,3e-06,4e-06,1e-06,3e-06,1e-06,3e-06,4e-06,3e-06,3e-06,2e-06,3e-06,1e-06,2e-06,2e-06
3e-06,3e-06,0,1e-06,1e-06,4e-06,3e-06,2e-06,3e-06,1e-06,0,1e-06,1e-06,2e-06,1e-06,1e-06,5.8e-05,0.000205,9.1e-05,0.000153,0.000194,0.000262,8.4e-05,4.4e-05,4e-06,6.8e-05,2.5e-05,3e-05,0.000134,7.9e-05,3.2e-05,1.6e-05,2e-05,0.000258,8.6e-05,0.000177,0.000417,0.000693,0.00045,0.000332,0.000175,0.000142,7.9e-05,0.000142,0.000278,0.000342,0.000495,0.000306,7.6e-05,0.000183,0.000134,0.000187,1.9e-05,0.000415,0.000571,0.000347,0.000304,0.000226,0.000189,0.000316,0.000245,0.000117,6.5e-05,0.000194,0.000279,0.000203,0.000219,0.000119,2e-04,4.1e-05,0.000105,0.000116,5.6e-05,8.9e-05,4.1e-05,3.4e-05,5.8e-05,4.2e-05,4.4e-05,0.000106,4.1e-05,1.7e-05,5.4e-05,3.9e-05,7e-06,1.2e-05,5e-06,1.5e-05,4.9e-05,3.2e-05,1e-05,1.2e-05,6e-06,7.3e-05,9.5e-05,3.8e-05,6e-06,5e-06,4e-06,6e-06,2e-06,2e-06,5e-06,4e-06,1e-06,7e-06,5e-06,1e-06,7e-06,8e-06,3e-06,1e-06,3e-06,3e-06,2e-06,3e-06,7e-06,1e-06,0,1e-06,2e-06
4e-06,2e-06,0,1e-06,1e-06,3e-06,1e-06,2e-06,1e-06,2e-06,1e-06,1e-06,1e-06,0,1e-06,1e-06,4.2e-05,8.8e-05,7.4e-05,0.000114,7.7e-05,0.000133,0.000118,6.4e-05,2.8e-05,7.3e-05,3.3e-05,4e-05,0.00017,0.000119,4.4e-05,1.1e-05,7e-06,0.000198,0.000153,0.000107,0.00052,0.000427,0.000163,0.000589,0.000593,0.000125,0.000329,0.000168,0.000353,0.000235,0.000203,0.000246,0.000179,0.00022,0.000154,8.8e-05,0.000275,0.00037,2e-04,0.000285,0.000293,0.000239,0.000343,0.000578,0.000644,0.000661,0.000187,0.000274,1.4e-05,8.8e-05,7.9e-05,0.000338,0.000152,2.5e-05,0.000119,3.4e-05,0.000112,1e-04,0.000109,7.6e-05,6.9e-05,6.6e-05,2e-05,6.2e-05,5.3e-05,3.2e-05,6.7e-05,6.3e-05,3.3e-05,4e-06,1.6e-05,1.7e-05,5.6e-05,2.8e-05,5e-06,5e-06,1.3e-05,9.5e-05,0.000158,8.8e-05,2.2e-05,4e-06,6e-06,3e-06,4e-06,4e-06,5e-06,4e-06,0,6e-06,8e-06,7e-06,3e-06,9e-06,1e-05,7e-06,4e-06,6e-06,4e-06,3e-06,7e-06,6e-06,3e-06,2e-06,4e-06
4e-06,4e-06,3e-06,2e-06,0,3e-06,3e-06,3e-06,3e-06,2e-06,2e-06,1e-06,1e-06,2e-06,0,2e-06,3e-05,1.1e-05,3.9e-05,0.000225,0.000272,8.9e-05,6.2e-05,3e-06,3.6e-05,5e-05,5.4e-05,9e-06,0.000174,0.000208,0.000128,4e-05,7e-06,0.000159,5.8e-05,0.000196,0.000485,0.000485,9.5e-05,0.000381,0.000226,0.000187,0.000488,0.000464,0.000131,0.000183,0.000342,0.00027,9.4e-05,0.000196,0.000131,0.000168,0.000371,0.000548,0.000195,0.000254,0.00035,0.000192,0.000202,0.000439,0.00045,0.000248,0.000269,0.000149,0.000219,5.1e-05,1.9e-05,0.000335,0.000464,0.000217,0.000154,0.000159,0.00018,5.1e-05,7.9e-05,6.1e-05,6.7e-05,3.5e-05,2.5e-05,4.3e-05,2.3e-05,1.5e-05,7.8e-05,3e-05,1e-05,3.6e-05,1.7e-05,6e-06,3.8e-05,2.2e-05,1.1e-05,2e-06,9e-06,0.000103,0.000172,9.4e-05,3e-05,7e-06,2e-06,1e-06,4e-06,1e-06,4e-06,4e-06,4e-06,2e-06,4e-06,2e-06,4e-06,4e-06,1e-06,3e-06,2e-06,6e-06,7e-06,7e-06,6e-06,7e-06,4e-06,2e-06,3e-06
2e-06,3e-06,2e-06,2e-06,1e-06,2e-06,3e-06,3e-06,2e-06,1e-06,2e-06,2e-06,2e-06,1e-06,1e-06,3e-06,1.8e-05,2.9e-05,4.1e-05,0.000155,6.9e-05,7e-05,5.3e-05,2.6e-05,1.4e-05,1e-05,1.7e-05,3e-05,9.9e-05,7.2e-05,1.9e-05,2.1e-05,1e-05,0.000156,0.000134,0.000319,0.000342,0.000167,6.4e-05,0.000302,0.000577,0.000611,1e-04,7e-05,0.000279,0.000415,0.000143,7.6e-05,5.9e-05,0.000148,7.8e-05,0.000198,0.000189,0.000141,0.000164,0.000156,0.000146,0.000197,9.1e-05,0.000232,8.3e-05,0.000111,0.000146,0.000209,7e-06,1e-05,6.4e-05,0.000225,0.000451,0.000216,3.8e-05,5e-05,5.3e-05,5.1e-05,4.1e-05,1.9e-05,1.6e-05,2.3e-05,1.4e-05,2.1e-05,6e-06,1.2e-05,5e-05,2.8e-05,1.4e-05,2.2e-05,7e-06,2e-06,2.3e-05,1.4e-05,1.2e-05,2e-06,5e-06,0.000105,0.000105,4.9e-05,1.9e-05,8e-06,4e-06,0,4e-06,2e-06,3e-06,2e-06,1e-06,1e-06,2e-06,1e-06,2e-06,3e-06,2e-06,3e-06,1e-06,4e-06,1e-06,3e-06,3e-06,1e-06,1e-06,2e-06,1e-06
1e-06,2e-06,1e-06,0,1e-06,2e-06,1e-06,2e-06,1e-06,2e-06,0,1e-06,1e-06,1e-06,1e-06,1e-06,1.8e-05,2.3e-05,1.2e-05,7.2e-05,0.000168,0.000147,2.6e-05,1.5e-05,1e-05,2e-06,4e-06,6e-06,6.1e-05,1.6e-05,1.2e-05,7e-06,5e-06,0.000155,0.000177,0.000201,0.000299,0.000252,0.000157,0.000174,0.000186,0.000306,0.00017,0.000175,0.000281,0.000206,5.8e-05,7e-05,7.8e-05,0.000188,7.6e-05,0.000158,0.000142,0.000139,9.6e-05,0.000179,9.2e-05,0.000115,0.000248,2.6e-05,9.7e-05,0.000251,6.9e-05,5.1e-05,7.5e-05,2.7e-05,5.1e-05,0.000187,0.000217,1.2e-05,2.8e-05,2.3e-05,1.1e-05,1.2e-05,2.1e-05,1.2e-05,1.4e-05,1.7e-05,1.3e-05,6e-06,6e-06,1.7e-05,1.4e-05,1.1e-05,0,2e-05,5e-06,3e-06,1.3e-05,3e-06,1e-06,1e-06,2e-06,9.5e-05,2.1e-05,1.2e-05,1e-06,2e-06,3e-06,4e-06,4e-06,4e-06,1e-06,1e-06,0,1e-06,0,1e-06,1e-06,1e-06,1e-06,1e-06,1e-06,1e-06,1e-06,2e-06,1e-06,0,1e-06,2e-06,1e-06
2e-06,2e-06,1e-06,1e-06,1e-06,2e-06,2e-06,2e-06,2e-06,1e-06,0,1e-06,1e-06,2e-06,1e-06,1e-06,2.2e-05,3e-05,1.1e-05,2.5e-05,0.000162,0.000108,3.6e-05,1.8e-05,1.5e-05,6e-06,4e-06,6e-06,3.5e-05,2e-05,1.2e-05,8e-06,3e-06,0.000136,7.6e-05,0.000222,0.000153,0.000181,0.00011,0.000148,0.000134,0.000303,0.000134,4.1e-05,0.000105,0.000237,0.000115,5.8e-05,8e-06,0.000149,5.3e-05,0.000106,8e-05,0.000162,9.5e-05,0.00019,5.8e-05,1.4e-05,6.2e-05,1.8e-05,5.9e-05,0.000164,4.3e-05,4.8e-05,4.4e-05,3.8e-05,3.3e-05,0.000127,0.000186,2e-05,1.8e-05,1.5e-05,1.4e-05,2.9e-05,1.4e-05,6e-06,1.4e-05,1.4e-05,1e-05,4e-06,1e-06,1.6e-05,1.1e-05,5e-06,4e-06,1.8e-05,3e-06,3e-06,7e-06,1e-06,3e-06,1e-06,2e-06,8.7e-05,2e-05,6e-06,5e-06,1e-06,3e-06,3e-06,2e-06,1e-06,0,2e-06,0,0,1e-06,0,1e-06,0,1e-06,1e-06,1e-06,0,1e-06,2e-06,0,0,0,1e-06,1e-06
1e-06,2e-06,1e-06,0,0,2e-06,2e-06,2e-06,2e-06,1e-06,0,1e-06,1e-06,1e-06,0,1e-06,2.7e-05,2.7e-05,1.6e-05,4.3e-05,0.000173,8.4e-05,2.9e-05,3.1e-05,8e-06,8e-06,2e-06,4e-06,1.7e-05,1.1e-05,1e-05,9e-06,2e-06,0.000138,7.5e-05,0.00011,0.000256,0.000262,6.6e-05,5.1e-05,0.000112,0.00026,7.8e-05,5.1e-05,7.7e-05,0.000187,6.6e-05,4.8e-05,2.8e-05,0.000105,8.8e-05,0.000148,9.3e-05,0.000192,6.2e-05,0.000212,8.1e-05,7.9e-05,0.000152,3.5e-05,2.6e-05,0.000148,5.3e-05,2.7e-05,5.9e-05,1.9e-05,2e-05,0.000111,0.000172,9e-06,1.1e-05,3e-06,1.2e-05,1.9e-05,1.6e-05,4e-06,1.1e-05,1.2e-05,1.3e-05,2e-06,2e-06,1.5e-05,1.4e-05,3e-06,8e-06,1.8e-05,1e-06,2e-06,7e-06,3e-06,1e-06,1e-06,1e-06,7.6e-05,1.2e-05,4e-06,3e-06,2e-06,1e-06,1e-06,1e-06,1e-06,1e-06,1e-06,0,0,1e-06,1e-06,1e-06,0,1e-06,1e-06,1e-06,0,1e-06,2e-06,0,0,1e-06,1e-06,0
