7e-06,4.7e-05,2.1e-05,1.9e-05,2.8e-05,3.1e-05,2.5e-05,5e-06,2.3e-05,2.8e-05,6e-06,2.9e-05,6.7e-05,2.2e-05,2.4e-05,4.3e-05,6e-06,3e-06,5.8e-05,4.6e-05,5e-06,4e-06,1.2e-05,2e-06,2.6e-05,2.2e-05,1.8e-05,6e-06,2.2e-05,1e-05,2.1e-05,4e-06,6.2e-05,1.8e-05,1.6e-05,3e-05,4.2e-05,1.7e-05,5e-06,5.6e-05,1.3e-05,3.3e-05,4.3e-05,1.9e-05,2e-06,0,4e-05,2.5e-05,1.9e-05,4e-06,1.2e-05,3e-05,2.7e-05,2.3e-05,3e-06,9.2e-05,6.3e-05,0.000121,0.000266,0.000435,0.00015,0.000713,0.000246,0.000535,0.001552,0.000767,0.001218,0.001473,0.000353,0.000661,0.001402,0.001711,0.002215,0.000422,0.000763,0.001858,0.000294,0.000697,8e-04,0.000348,0.00065,0.000541,0.000628,0.001494,0.002557,0.000705,0.000837,0.001352,0.00067,0.003046,0.000975,0.000186,0.000558,0.00114,0.000854,0.001757,0.000267,0.000285,0.000714,0.001149,0.001121,0.001404,0.000891,0.000552,0.000631,0.000468,0.000223,0.001185,0.000521,0.000127,0.00079,0.000716,0.000939,0.001388,0.000858,0.0011,0.000742,0.000487,0.000783,0.000505,0.000202
4.5e-05,6.8e-05,7.7e-05,4.7e-05,8.5e-05,5.2e-05,3.3e-05,6.3e-05,3.2e-05,5.2e-05,1.8e-05,6.4e-05,0.000151,9.2e-05,1.6e-05,4.1e-05,7.2e-05,5.5e-05,0.000152,0.000207,0.000101,3.5e-05,1e-05,7.9e-05,0.000114,0.000118,2.1e-05,5.2e-05,4.5e-05,2.5e-05,9.5e-05,0.000117,0.00015,0.00018,9.5e-05,4.3e-05,0.000109,0.000145,8e-05,0.00014,8.7e-05,8.6e-05,0.000152,0.000123,8.8e-05,6.1e-05,0.000172,0.000156,6.7e-05,4.8e-05,0.000136,8.3e-05,0.000101,9.1e-05,7e-06,0.000222,0.000246,0.000327,0.000593,0.00096,0.000645,0.001646,0.000417,0.00121,0.00193,0.0011,0.005399,0.003368,0.004336,0.001709,0.002929,0.006376,0.00474,0.00778,0.004681,0.001973,0.001245,0.001216,0.001643,0.001965,0.003422,0.005472,0.004638,0.001396,0.003417,0.004978,0.002934,0.003734,0.002225,0.004392,0.003984,0.003709,0.002992,0.001954,0.001172,0.003456,0.000224,0.001494,0.000936,0.002267,0.001961,0.002324,0.001921,0.001162,0.002995,0.002275,0.000867,0.001033,0.002095,0.000276,0.002888,0.001519,0.00153,0.003722,0.001693,0.002592,0.001097,0.000909,0.001453,0.001698,0.000513
1.7e-05,4.3e-05,0.000128,5.9e-05,2e-05,0.00011,6.6e-05,0.000116,0.000131,5.4e-05,5.2e-05,6.6e-05,1e-06,8e-05,6.8e-05,8.2e-05,5.7e-05,4.4e-05,0.000104,0.000164,8.7e-05,0.00014,0.000157,0.00019,2.9e-05,6.7e-05,1e-04,0.000111,7e-05,9e-05,6.9e-05,6.7e-05,5e-05,0.000127,0.000105,7.8e-05,6e-05,8.3e-05,8.9e-05,8.4e-05,6.7e-05,6.3e-05,0.000132,0.000185,0.000315,7.1e-05,0.00023,0.000179,5.2e-05,5.1e-05,0.000115,0.000121,0.000111,0.000165,0.000102,0.000346,0.000484,0.000221,0.000396,0.000824,0.001017,0.002136,0.000424,0.000894,0.0044,0.002403,0.004304,0.002362,0.004879,0.001854,0.001396,0.004808,0.001555,0.007314,0.002111,0.000973,0.001893,0.00154,0.004278,0.002729,0.001783,0.001521,0.003272,0.002588,0.003883,0.003053,0.000523,0.002733,0.000258,0.001609,0.004165,0.002377,0.002959,0.001128,0.000719,0.00463,0.002023,0.001493,0.001656,0.00279,0.002254,0.003247,0.003812,0.000255,0.003337,0.003503,0.001413,0.002467,0.000788,0.001483,0.002287,0.000179,0.001126,0.003571,0.001041,0.002191,0.00231,0.001022,0.002009,0.002291,0.000909
0.00011,0.000103,0.000163,0.000126,0.000106,8.7e-05,0.000127,7.9e-05,0.000149,0.000164,0.000108,0.000142,6.5e-05,3.3e-05,0.000136,0.000199,0.000131,7.2e-05,0.000112,8e-05,0.000129,0.000133,1e-04,9.8e-05,0.000186,7.5e-05,8.7e-05,2.5e-05,8.7e-05,7.9e-05,5.8e-05,0.000122,0.000121,0.000105,5.4e-05,6.8e-05,8.4e-05,0.000101,3e-05,0.000123,3.8e-05,3.3e-05,7.1e-05,0.000172,0.000189,0.000183,0.000212,0.000221,0.000196,0.000123,0.000126,7.2e-05,0.000171,5.1e-05,8e-05,0.000455,0.000368,0.000769,0.000472,0.002389,0.001123,0.002786,0.002925,0.003752,0.008731,0.00084,0.005305,0.001913,0.003857,0.002953,0.004232,0.005595,0.00548,0.007159,0.003009,0.002784,0.002751,0.005825,0.005633,0.003552,0.004385,0.002113,0.00552,0.011957,0.004872,0.00249,0.003388,0.001675,0.004489,0.004005,0.003217,0.003242,0.004223,0.004006,0.001479,0.005184,0.000518,0.001452,0.00191,0.00317,0.002714,0.005312,0.005535,0.004141,0.001916,0.002542,0.001049,0.004156,0.001449,0.003443,0.003292,0.001562,0.002984,0.004173,0.002555,0.003187,0.00329,0.002222,0.00278,0.002721,0.002266
0.000105,0.00013,0.00015,0.000153,0.000183,7.6e-05,0.000102,5.5e-05,9.3e-05,2.4e-05,5.6e-05,0.000106,0.000196,0.000117,9.6e-05,0.000122,0.000136,7.7e-05,0.000162,0.000138,0.000159,0.000122,0.000149,0.00011,0.000168,9.8e-05,6.8e-05,9.2e-05,9.4e-05,6.8e-05,0.000117,7.9e-05,8.9e-05,0.000237,0.00011,7e-05,8.4e-05,8.1e-05,4.9e-05,0.000175,0.000189,0.00016,0.000178,0.000116,0.000215,0.000202,0.000135,0.00018,1e-04,0.000105,0.000114,0.000129,7.3e-05,0.000191,0.000261,0.000379,4e-04,0.001162,0.001366,0.003649,0.004176,0.006617,0.007774,0.004964,0.007689,0.011089,0.009318,0.010722,0.00958,0.005895,0.011252,0.01763,0.009516,0.0218,0.008738,0.00567,0.002404,0.011111,0.014757,0.010685,0.01047,0.011332,0.012218,0.023847,0.015308,0.005831,0.004625,0.001208,0.005598,0.014092,0.010611,0.008217,0.004677,0.006873,0.001961,0.007007,0.005813,0.001049,0.001928,0.003785,0.00376,0.004953,0.013371,0.009318,0.008083,0.004328,0.005607,0.000545,0.002948,0.005765,0.005587,0.001159,0.005997,0.002042,0.004005,0.005856,0.006607,0.001044,0.001533,0.005303,0.008257
0.000103,0.000207,6.8e-05,0.00011,0.000146,9e-05,9.4e-05,3.2e-05,8.3e-05,5e-05,0.000112,3.9e-05,0.000161,0.000171,0.000154,0.000148,0.000117,6e-05,0.000192,5e-06,0.000205,9e-05,0.000223,0.000192,1e-04,9.3e-05,0.000148,3.8e-05,3.4e-05,8.5e-05,0.000188,0.000145,9.2e-05,0.000228,8.6e-05,6.3e-05,7.2e-05,0.000105,7.4e-05,0.000218,0.000182,5.6e-05,0.000194,0.000171,4.2e-05,5.3e-05,0.000173,0.000186,0.000276,0.000243,0.000146,0.00016,0.000124,0.000126,0.000154,0.000439,0.000501,0.00093,0.00126,0.002107,0.005776,0.012553,0.013843,0.018209,0.016257,0.02131,0.02435,0.012578,0.004024,0.004254,0.007802,0.009738,0.012823,0.025894,0.018179,0.006882,0.004415,0.011546,0.014545,0.011616,0.011879,0.002839,0.010451,0.017929,0.016057,0.009116,0.005576,0.004167,0.005187,0.009717,0.013705,0.002618,0.002393,0.004032,0.002655,0.005631,0.00558,0.005549,0.003786,0.00206,0.004733,0.003908,0.014209,0.007035,0.006055,0.008647,0.010302,0.002833,0.000745,0.00483,0.006149,0.006186,0.007461,0.007121,0.00501,0.002194,0.002863,0.002331,0.002472,0.004931,0.012215
1e-04,1e-04,7.3e-05,0.000113,7.5e-05,4.8e-05,7.5e-05,0.000131,0.00014,0.000107,0.000157,4.8e-05,0.000127,6.2e-05,7.6e-05,0.00016,8.9e-05,2e-05,0.000109,0.000109,0.000144,0.000159,0.000175,1.8e-05,0.000116,0.000135,1.5e-05,8.2e-05,9.9e-05,0.000119,2.5e-05,7.9e-05,0.000134,0.000104,9.5e-05,0.000101,0.000112,2.3e-05,5.7e-05,6.9e-05,0.000122,0.000107,4.8e-05,0.000173,0.000275,8.3e-05,0.000233,8.9e-05,0.000249,7.7e-05,0.000116,8.5e-05,5.9e-05,0.000135,0.000205,0.000115,0.00026,0.000331,0.000485,0.002076,0.00346,0.007051,0.005711,0.010689,0.012217,0.013069,0.018778,0.007867,0.004676,0.008065,0.007864,0.008982,0.018832,0.004728,0.014346,0.013989,0.007325,0.00346,0.002242,0.010031,0.011691,0.006843,0.013543,0.003598,0.009765,0.002484,0.000501,0.010718,0.008097,0.005669,0.006616,0.008687,0.00299,0.003598,0.006167,0.002778,0.005344,0.004998,0.00755,0.004342,0.002702,0.004553,0.00839,0.006807,0.009416,0.01037,0.003499,0.008937,0.006773,0.00184,0.002771,0.002296,0.003394,0.004395,0.001809,0.003543,0.003676,0.006769,0.002418,0.002838,0.007749
5.9e-05,4.7e-05,2.5e-05,0.000101,8.4e-05,0.000152,0.000151,0.00018,6.8e-05,3.7e-05,3.8e-05,8.2e-05,3.6e-05,0.000167,0.00022,0.000237,0.000126,4.7e-05,6.1e-05,6.2e-05,9.9e-05,9.3e-05,0.000126,9.6e-05,5.9e-05,7.5e-05,9.5e-05,0.000107,1e-05,5.8e-05,4.7e-05,6.4e-05,8.3e-05,0.000193,0.000193,3.2e-05,0.000105,0.000126,9.1e-05,8.1e-05,0.000202,9e-05,0.000174,0.000142,0.000104,0.00014,0.000218,0.00013,0.000228,0.000261,9.1e-05,0.000162,0.000122,0.000114,7.6e-05,6.2e-05,0.000168,0.000252,0.000388,0.001016,0.003339,0.007549,0.000814,0.007986,0.007144,0.012298,0.005628,0.004664,0.002431,0.013708,0.002558,0.00604,0.011768,0.007009,0.006354,0.016706,0.00755,0.003444,0.007351,0.012773,0.006294,0.017646,0.020364,0.014592,0.010819,0.016455,0.006993,0.016751,0.000303,0.00805,0.006747,0.005902,0.011697,0.006768,0.013517,0.00701,0.00968,0.008161,0.01244,0.002395,0.011381,0.010432,0.005665,0.008352,0.019212,0.014756,0.012438,0.015765,0.016842,0.004767,0.01249,0.001834,0.010031,0.012231,0.005158,0.006759,0.015148,0.012891,0.007317,0.005728,0.001684
6.9e-05,2.6e-05,5.5e-05,0.000128,0.000105,0.000112,8.4e-05,4.5e-05,5.4e-05,6.7e-05,3.9e-05,0.000141,0.000115,9.8e-05,0.000155,6.2e-05,8.9e-05,5.4e-05,0.000123,4.4e-05,0.000147,0.000217,0.000114,0.000115,0.000133,1.8e-05,3.6e-05,4.9e-05,3.7e-05,7.2e-05,0.000109,5.2e-05,7.6e-05,0.000117,0.000145,7.6e-05,2.9e-05,5.2e-05,0.000175,9.3e-05,0.000267,0.000178,0.000205,0.000145,6.1e-05,9.2e-05,4.5e-05,3.6e-05,0.000152,0.000102,7.5e-05,0.000136,0.000124,6.6e-05,2.9e-05,0.000107,0.000271,0.000265,0.000386,0.000937,0.002102,0.004445,0.006359,0.00476,0.003847,0.002268,0.004461,0.012298,0.008223,0.01068,0.016183,0.001658,0.004412,0.007265,0.003729,0.015651,0.016719,0.003611,0.012395,0.017161,0.017039,0.011485,0.012293,0.006838,0.007151,0.017808,0.016211,0.019116,0.021053,0.00834,0.00812,0.013345,0.019443,0.024774,0.025081,0.022853,0.025253,0.026346,0.024809,0.022911,0.021928,0.024435,0.014101,0.014969,0.010695,0.013329,0.015272,0.011089,0.020536,0.018625,0.023309,0.023566,0.024816,0.024955,0.019044,0.011874,0.015652,0.021956,0.024859,0.023198,0.011195
0.000123,9.5e-05,2.5e-05,4.3e-05,0.000159,0.000107,8.4e-05,9.7e-05,0.000137,3e-05,0.000124,0.00018,9.1e-05,2.2e-05,6.1e-05,4.7e-05,9.1e-05,0.000103,0.000159,0.000122,9.3e-05,0.000113,0.000128,0.000112,5.4e-05,7e-06,2.2e-05,7.5e-05,9.7e-05,9e-06,0.000122,0.000117,3.5e-05,0.000117,6.8e-05,0.000112,8.7e-05,6.9e-05,9.9e-05,0.000175,0.000121,0.00021,0.000225,0.000138,0.000204,0.000164,0.000103,2.2e-05,6.5e-05,0.000162,0.000168,0.00018,0.000108,0.000118,0.000105,0.000116,7.4e-05,0.000281,0.000481,0.000828,0.001411,0.005515,0.008536,0.01159,0.012607,0.01244,0.003833,0.013182,0.017759,0.014758,0.008959,0.011291,0.003154,0.002801,0.005106,0.006594,0.015506,0.018376,0.006829,0.00222,0.004483,0.010905,0.00646,0.004989,0.009567,0.006133,0.016137,0.004207,0.013572,0.009305,0.00804,0.018375,0.011859,0.006558,0.004009,0.010829,0.006172,0.009873,0.002694,0.01312,0.013201,0.002901,0.003826,0.014287,0.008364,0.00449,0.00536,0.011553,0.004762,0.014324,0.005202,0.010918,0.00503,0.006832,0.008439,0.003143,0.007247,0.00736,0.009118,0.011222,0.006774
6.6e-05,4.6e-05,4.6e-05,4.8e-05,0.000139,0.000121,0.000109,0.000132,6.5e-05,8.9e-05,0.000104,4.8e-05,5.2e-05,3.4e-05,4.9e-05,6.6e-05,3.3e-05,7.8e-05,0.000103,5.7e-05,5e-05,6e-05,0.000102,3.5e-05,3.7e-05,9e-06,2.3e-05,4.4e-05,3.7e-05,5.8e-05,3.2e-05,5.6e-05,6.2e-05,7.3e-05,2.7e-05,0.000104,6.1e-05,2.9e-05,5.3e-05,5.1e-05,0.000188,9.6e-05,1e-05,0.000119,0.000116,3.8e-05,8.8e-05,1.5e-05,2.1e-05,6.8e-05,8e-05,3.2e-05,7.1e-05,8.3e-05,2.3e-05,3.1e-05,6.8e-05,7.1e-05,0.000151,0.000631,0.001323,0.002102,0.004562,0.001918,0.006557,0.00341,0.004814,0.00985,0.00578,0.003089,0.008076,0.002224,0.00507,0.002918,0.006874,0.005957,0.007581,0.005423,0.008046,0.004747,0.002871,0.005911,0.002505,0.001014,0.005028,0.006137,0.006934,0.00583,0.003357,0.006077,0.012393,0.00457,0.005171,0.003067,0.004199,0.005924,0.005906,0.00481,0.003853,0.007287,0.004688,0.005329,0.00515,0.003862,0.005434,0.006486,0.001539,0.004547,0.004346,0.006933,0.007501,0.004117,0.003569,0.003462,0.005908,0.008979,0.007306,0.002835,0.00546,0.001551,0.004407
2.4e-05,2.3e-05,1.6e-05,2.7e-05,7.9e-05,3.5e-05,5e-05,5.7e-05,2.2e-05,4.7e-05,1.9e-05,3.3e-05,2.9e-05,3.5e-05,3.5e-05,1.5e-05,4.4e-05,4.5e-05,2.5e-05,2.7e-05,3e-05,3.9e-05,1.8e-05,1.7e-05,3e-05,5e-06,1.5e-05,3.2e-05,6e-06,1.2e-05,1.5e-05,3.4e-05,9e-06,2.7e-05,9e-06,6.2e-05,3.3e-05,2.2e-05,4e-06,3.3e-05,7.5e-05,2e-05,4.8e-05,4.2e-05,5.1e-05,1.1e-05,4.7e-05,4e-05,2.8e-05,2.9e-05,4.4e-05,3.4e-05,4.7e-05,5.9e-05,1.3e-05,5.6e-05,0.000128,8.9e-05,5e-05,0.000229,0.001124,0.002124,0.001912,0.001493,0.004024,0.004364,0.004508,0.002063,0.004978,0.005008,0.002402,0.001812,0.004552,0.003227,0.006087,0.003811,0.001186,0.004778,0.004363,0.003351,0.003243,0.002455,0.002963,0.001719,0.005159,0.003401,0.002706,0.002812,0.001324,0.002805,0.002204,0.002875,0.002333,0.002665,0.00141,0.003486,0.002122,0.001398,0.00233,0.002765,0.00346,0.004637,0.001477,0.002241,0.003643,0.003038,0.002492,0.002915,0.003107,0.00396,0.00314,0.002594,0.00079,0.001506,0.00316,0.003353,0.002773,0.002437,0.003142,0.001651,0.002299
1.8e-05,1.3e-05,1.2e-05,1.1e-05,5.7e-05,2.6e-05,3.1e-05,3e-05,1e-05,2.4e-05,3.4e-05,7e-06,2.3e-05,3.7e-05,1.9e-05,2e-05,3.8e-05,3e-05,2.2e-05,1.5e-05,3.2e-05,1.9e-05,1.1e-05,1e-05,3.6e-05,4e-06,8e-06,2.3e-05,1.7e-05,1.7e-05,1.9e-05,1.3e-05,2e-05,2.7e-05,6e-06,2.7e-05,1.4e-05,1.1e-05,1.1e-05,1.9e-05,4.5e-05,8e-06,5.9e-05,3.7e-05,4.5e-05,1.2e-05,4e-05,4.1e-05,1.8e-05,3e-05,3.1e-05,1e-05,6e-06,3e-05,2.9e-05,5.2e-05,0.000141,6.5e-05,1.3e-05,0.00012,0.000879,0.001678,0.001811,0.001491,0.001779,0.002376,0.001641,0.004102,0.006115,0.000455,0.000583,0.001828,0.004802,0.001283,0.004423,0.001926,0.003237,0.004938,0.001255,0.002101,0.001363,0.002531,0.001852,0.00132,0.002627,0.003495,0.002928,0.0032,0.001315,0.00048,0.001294,0.001625,0.003338,0.000497,0.002518,0.002713,0.003,0.002472,0.001773,0.002947,0.000852,0.00262,0.003512,0.002904,0.002502,0.001957,0.002732,0.001705,0.002022,0.00395,0.001648,0.001918,0.002273,0.00044,0.000612,0.002069,0.001781,0.002193,0.002518,0.000935,0.000718
2.5e-05,2e-05,9e-06,7e-06,6.1e-05,9e-06,3.4e-05,2.5e-05,1.4e-05,3.7e-05,1.5e-05,1.2e-05,1.6e-05,2.4e-05,1.4e-05,2.1e-05,2.2e-05,2.9e-05,1.5e-05,1e-05,3.1e-05,2.6e-05,7e-06,3.5e-05,3.7e-05,2.7e-05,1.5e-05,2.3e-05,4.1e-05,2.1e-05,1.8e-05,1.5e-05,1.9e-05,2e-05,1.3e-05,3e-05,2.9e-05,2.2e-05,4e-06,3e-05,3.6e-05,2.8e-05,4.6e-05,3.1e-05,4.7e-05,1.2e-05,1.9e-05,5.1e-05,2.8e-05,2.7e-05,2.6e-05,3.8e-05,3.6e-05,5.6e-05,4.5e-05,5.6e-05,0.000138,4.7e-05,7.2e-05,3.9e-05,0.000847,0.001642,0.001257,0.002938,0.003994,0.002141,0.001658,0.0017,0.004017,0.002693,0.002405,0.00156,0.002608,0.001244,0.004859,0.002873,0.002683,0.004917,0.001585,0.001291,0.003052,0.002443,0.00074,0.000684,0.001568,0.002651,0.001673,0.002246,0.002292,0.002488,0.002771,0.001461,0.000488,0.000341,0.001786,0.001136,0.001468,0.002037,0.001852,0.001912,0.001614,0.000661,0.003109,0.003454,0.002803,0.004027,0.001858,0.001689,0.001843,0.00136,0.000938,0.002251,0.002462,0.001145,0.000728,0.001912,0.001505,0.001778,0.001793,0.001415,0.001251
4e-06,4.5e-05,3.1e-05,2.3e-05,5e-05,5.1e-05,4.3e-05,4.3e-05,4.9e-05,4.6e-05,1.7e-05,3e-06,1.1e-05,3.4e-05,4.3e-05,4.1e-05,3.5e-05,1.5e-05,2.2e-05,2.2e-05,2.2e-05,1.9e-05,1.8e-05,3.9e-05,5.8e-05,4.9e-05,3.4e-05,1e-06,4.8e-05,5.1e-05,5.3e-05,2.3e-05,1.1e-05,2e-05,1.9e-05,2.2e-05,5.1e-05,4.9e-05,4.5e-05,5.8e-05,8.7e-05,7e-05,6.9e-05,1.2e-05,2.9e-05,3.4e-05,5.8e-05,7e-06,3.1e-05,4.9e-05,2.2e-05,6e-05,1.6e-05,3.5e-05,1.2e-05,0.000107,0.000105,5.9e-05,0.000129,0.000247,0.000606,0.001306,0.002011,0.003991,0.001121,0.002644,0.00246,0.003169,0.001333,0.002004,0.003549,0.00332,0.002159,0.001372,0.00242,0.002087,0.001412,0.002707,0.005115,0.001456,0.004504,0.002347,0.000932,0.001301,0.001116,0.001108,0.001486,0.002014,0.003059,0.004043,0.005163,0.00307,0.001525,0.000975,0.001544,0.000331,0.00226,0.001714,0.001538,0.000779,0.000643,0.000745,0.004776,0.002861,0.002466,0.002058,0.002996,0.002149,0.00057,0.001118,0.002019,0.002631,0.001622,0.000796,0.000887,0.003278,0.000598,0.002185,0.001356,0.00037,0.002514
3e-05,4.6e-05,2.8e-05,1.2e-05,2.4e-05,3.9e-05,1.7e-05,5.1e-05,4.6e-05,4e-05,4.2e-05,4.6e-05,4.6e-05,9e-05,8.8e-05,6.7e-05,7.6e-05,3e-05,4.5e-05,5.6e-05,2.1e-05,4.3e-05,1.9e-05,4.8e-05,4.6e-05,1.3e-05,1.6e-05,2.1e-05,5.5e-05,2.8e-05,2.7e-05,2.6e-05,2.3e-05,5e-05,4.3e-05,1.6e-05,3.8e-05,2.5e-05,2.6e-05,2.3e-05,1.4e-05,3.1e-05,5.8e-05,2.2e-05,1.7e-05,2.8e-05,3.5e-05,1.8e-05,3.5e-05,1.8e-05,3.5e-05,4.9e-05,8e-05,4.9e-05,2e-05,0.000135,0.000138,8.4e-05,0.000134,0.000465,0.000984,0.001069,0.002719,0.002179,0.002745,0.002187,0.000667,0.002785,0.00217,0.003878,0.002763,0.002637,0.003859,0.001918,0.001147,0.001737,0.001334,0.001645,0.003825,0.003139,0.002146,0.002495,0.000459,0.001249,0.001624,0.00205,0.001277,0.001954,0.00151,0.002518,0.001136,0.000812,0.001036,0.000663,0.001396,0.000867,0.001423,0.00159,0.001291,0.000555,0.000922,0.000138,0.004601,0.003504,0.001643,0.000286,0.001332,0.000982,0.00075,0.001927,0.001362,0.001921,0.000601,0.000569,0.000858,0.001701,0.001325,0.001455,0.001061,0.00103,0.001763
7e-06,3.9e-05,3.6e-05,1e-05,2.5e-05,2.1e-05,4.8e-05,2.3e-05,5e-06,4.3e-05,5.7e-05,2.1e-05,3.7e-05,6.4e-05,2.4e-05,4.5e-05,2.8e-05,2.2e-05,3.6e-05,1.9e-05,2.5e-05,2e-05,2e-05,3.4e-05,1.4e-05,2.3e-05,1.8e-05,6e-06,5.7e-05,2.7e-05,3e-06,4.3e-05,1.6e-05,5.1e-05,2.8e-05,2.8e-05,3.5e-05,1e-05,2.7e-05,3e-05,4.1e-05,2.4e-05,7.6e-05,3.5e-05,3.9e-05,1.4e-05,6.5e-05,4e-06,2.6e-05,5.9e-05,5.9e-05,3.7e-05,4.2e-05,1.3e-05,3.4e-05,7.4e-05,0.000109,2.5e-05,0.000152,0.00024,0.000625,0.001339,0.002465,0.00193,0.001201,0.000748,0.000861,0.00113,0.00019,0.001818,0.00098,0.003067,0.002032,0.001132,0.001837,0.001983,0.000652,0.001268,0.001179,0.000635,0.003536,0.000751,0.001416,0.001517,0.001756,0.00124,0.001037,0.000733,0.001346,0.002928,0.001207,0.000828,0.000639,0.000257,0.00118,0.001509,0.00174,0.001272,0.001134,0.000732,0.000721,0.000555,0.002114,0.00221,0.000792,0.000891,0.001149,0.001396,0.000696,0.001467,0.001212,0.002007,0.000866,0.000719,0.001074,0.000852,0.001154,0.001384,0.000823,0.001639,0.001667
6.1e-05,3.1e-05,5.1e-05,5.2e-05,3.1e-05,2.9e-05,3.2e-05,2.4e-05,1.3e-05,4.7e-05,2.1e-05,4.4e-05,8.3e-05,8.4e-05,9.5e-05,2.6e-05,2e-05,4.7e-05,5.9e-05,5.3e-05,2.8e-05,2.6e-05,2.8e-05,3e-05,5.3e-05,6.5e-05,2.3e-05,1.1e-05,4.4e-05,6.7e-05,6e-05,3.7e-05,2.2e-05,4.3e-05,2.8e-05,1.1e-05,3.1e-05,5.1e-05,2.3e-05,4.8e-05,4.7e-05,3.9e-05,7.1e-05,4.7e-05,6.7e-05,1.3e-05,8.9e-05,7.6e-05,3.3e-05,4.3e-05,9.5e-05,7.1e-05,4.5e-05,8e-06,2.8e-05,6.5e-05,0.000112,0.000107,0.000114,6.2e-05,0.000443,0.001237,0.002312,0.001599,0.000129,0.00125,0.001087,0.001684,0.000995,0.002573,0.001151,0.002616,0.001034,0.001212,0.002472,0.001026,0.000531,0.000614,0.000593,0.000968,0.002674,0.002011,0.001812,0.001427,0.000341,0.0011,0.000462,0.001864,0.001239,0.002616,0.002868,0.00106,0.000589,0.000636,0.001173,0.001589,0.000683,0.001184,0.000894,0.000577,0.000498,0.000837,0.000676,0.001122,0.000943,0.001672,0.001281,0.000283,0.001107,0.001806,0.00083,0.001445,0.001301,0.000244,0.000784,0.000448,0.001006,0.001066,0.000817,0.001699,0.000697
6.6e-05,4.6e-05,3.4e-05,8.8e-05,6.9e-05,1.2e-05,2.2e-05,3.6e-05,2e-05,3.9e-05,3e-05,2.2e-05,5.2e-05,5.1e-05,4.5e-05,6.4e-05,4.8e-05,5.7e-05,9e-05,5.1e-05,3.4e-05,2.6e-05,1e-05,1.6e-05,3.1e-05,3.1e-05,5.5e-05,1.5e-05,4.5e-05,7.8e-05,3.6e-05,4.4e-05,2.7e-05,2.2e-05,3.1e-05,4.8e-05,6.3e-05,4.2e-05,5.9e-05,2.8e-05,3.2e-05,3.5e-05,4.1e-05,2.3e-05,0.000102,8e-05,7.8e-05,4.2e-05,6.5e-05,4.3e-05,8.4e-05,5.5e-05,2.8e-05,1.5e-05,2.6e-05,1e-04,0.000197,1e-04,0.000111,0.00014,0.00056,0.001117,0.001438,0.002284,0.000844,0.001794,0.000362,0.001618,0.001235,0.001565,0.001249,0.002062,0.00315,0.001135,0.002095,0.001334,0.000539,0.001513,0.001314,0.000579,0.000255,0.000561,0.001925,0.001838,0.001536,0.000628,0.000639,0.000518,0.000605,0.002092,0.001072,0.000314,0.000305,0.000601,0.00151,0.001132,0.001555,0.000792,0.000838,0.000555,0.000562,0.000423,0.00201,0.002371,0.00086,0.001519,0.001445,0.001483,0.001006,0.001383,0.000967,0.001109,0.001393,0.000909,0.00036,0.000909,0.001163,0.001106,0.000622,0.001099,0.001701
3.5e-05,4.1e-05,1.1e-05,7.5e-05,6.4e-05,5e-05,5e-05,4e-05,2.7e-05,3.3e-05,4.3e-05,2.9e-05,3.8e-05,5.6e-05,7.8e-05,1.2e-05,3.6e-05,3.7e-05,6.1e-05,3.1e-05,9e-06,2.6e-05,2.4e-05,2e-05,2.8e-05,1.3e-05,6.2e-05,5.5e-05,5.6e-05,4e-05,3e-05,7.1e-05,4e-05,1.4e-05,1.1e-05,3.9e-05,2.6e-05,2e-05,2.8e-05,3.6e-05,4.6e-05,2.1e-05,5.1e-05,2e-05,6.8e-05,0.000108,9.9e-05,3.4e-05,4.1e-05,5.3e-05,3.5e-05,4e-06,2.4e-05,2.5e-05,2.1e-05,7.9e-05,5.8e-05,5.4e-05,0.000115,0.000212,0.000563,0.000699,0.000541,0.00076,0.001136,0.001061,0.001036,9e-05,0.002077,0.002441,0.002623,0.003039,0.002001,0.00033,0.001948,0.000724,0.000654,0.001518,0.001848,0.001307,0.001008,0.000806,0.001568,0.000308,0.001304,0.000758,0.001147,0.00205,0.001335,0.001234,0.00153,0.000431,0.000666,0.000561,0.001359,0.001232,0.000954,0.000231,0.000984,0.000366,0.000243,0.000869,0.002696,0.001736,0.001501,0.002007,0.000632,0.000439,0.000507,0.000858,0.000979,0.000834,0.000926,0.00071,0.000584,0.001919,0.000528,0.000551,0.00051,0.000269,0.000934
2.5e-05,9e-06,2.2e-05,3.6e-05,3e-05,2.6e-05,5.1e-05,6.6e-05,1.8e-05,1.5e-05,4.7e-05,1.8e-05,2e-05,3.9e-05,2e-05,3.5e-05,2.7e-05,4.2e-05,5e-05,3.5e-05,4.2e-05,3.6e-05,5.2e-05,7e-06,1.2e-05,2e-05,4.5e-05,4.3e-05,6e-06,3.6e-05,1.4e-05,5.9e-05,1.6e-05,2.1e-05,5.2e-05,1.5e-05,3.5e-05,2.5e-05,1.9e-05,2.1e-05,1.5e-05,1.7e-05,3.6e-05,1.4e-05,2.7e-05,4.7e-05,3.1e-05,4.7e-05,5.9e-05,2.2e-05,4.7e-05,3e-05,1.3e-05,1.9e-05,1.7e-05,4e-05,4.9e-05,6.3e-05,0.000146,8.4e-05,0.000293,0.000483,0.000393,0.001817,0.001438,0.002339,0.000689,0.000274,0.001667,0.001158,0.000406,0.002359,0.000676,0.001326,0.001814,0.001484,0.000221,0.000276,0.00215,0.001111,0.001287,0.002074,0.001594,0.000337,0.001625,0.001016,0.001819,0.001572,0.000308,0.001382,0.001051,0.001167,0.001109,0.001331,0.000701,0.000128,0.00049,0.001191,0.001084,0.00059,0.000494,0.001252,0.002453,0.002398,0.000655,0.002004,0.002031,0.001318,0.000714,0.001193,0.001687,0.000574,0.00153,0.000789,0.00074,0.001787,0.001228,0.000651,0.000881,0.000467,0.001508
1.2e-05,3e-05,3.2e-05,4.2e-05,1.5e-05,1.8e-05,2.6e-05,2.4e-05,3.7e-05,3e-05,1.5e-05,3.4e-05,2.9e-05,4.8e-05,3.9e-05,3.8e-05,3.9e-05,4.8e-05,5.4e-05,1.9e-05,3.7e-05,3e-05,3.1e-05,3.5e-05,4.6e-05,3.5e-05,3.8e-05,1.6e-05,2.1e-05,2.5e-05,4.7e-05,3.6e-05,3.2e-05,3.9e-05,3.9e-05,1.8e-05,3e-05,2.7e-05,1.5e-05,1.6e-05,8e-06,3.1e-05,3.2e-05,1.1e-05,3.2e-05,1.3e-05,4e-05,3.8e-05,1.1e-05,2.7e-05,3.3e-05,3.1e-05,2e-05,3.9e-05,5.2e-05,3.1e-05,5.3e-05,1.6e-05,5.4e-05,0.000113,0.000344,0.000752,0.00032,0.000742,0.001028,0.001372,0.00132,0.000302,0.001317,9.6e-05,0.001432,0.000896,0.001944,0.000764,0.000682,0.000814,0.00016,0.001418,0.001401,0.001087,0.003191,0.002448,0.000482,0.000879,0.001038,0.001765,0.001084,0.001291,0.002169,0.001824,0.000342,0.000111,0.000707,0.001521,0.001367,0.001004,0.000882,0.000196,0.001836,0.001022,0.00068,0.001483,0.000341,0.001208,0.000652,0.001767,0.001078,0.000631,0.000524,0.001195,0.001668,0.001651,0.001298,0.000763,0.000283,0.001031,0.000423,0.000657,0.000688,0.001133,0.001015
3e-06,1.6e-05,1e-05,3e-05,1e-05,3e-06,2.2e-05,2e-05,2.1e-05,1.1e-05,4e-06,2e-05,1.6e-05,2.6e-05,2.9e-05,2.1e-05,1.7e-05,6e-06,7e-06,1e-05,1.8e-05,7e-06,1.1e-05,7e-06,8e-06,9e-06,1.4e-05,1.4e-05,5e-06,3e-06,1.6e-05,2.4e-05,2.6e-05,9e-06,2.4e-05,1.1e-05,6e-06,1e-05,1.2e-05,5e-06,1.5e-05,2.2e-05,1.3e-05,1.3e-05,1e-05,6e-06,1e-05,1.1e-05,1e-05,5e-06,8e-06,1e-05,7e-06,1.7e-05,2.6e-05,3e-05,2.5e-05,1e-05,1.7e-05,6.5e-05,0.000111,0.000412,0.000435,0.000916,0.00021,0.000326,0.000451,0.000643,0.00046,0.000329,0.000716,0.000676,0.000626,0.000294,0.000449,0.001262,0.000604,0.000106,0.000212,0.00037,0.000899,0.000305,0.000682,0.000581,0.000624,0.000276,0.000313,0.000217,0.000407,0.000485,0.000831,0.000693,0.000216,0.000536,0.000605,0.000664,0.000404,0.000275,0.001378,0.000843,0.000472,0.000162,0.000251,0.000649,0.000165,0.000278,0.000292,0.000412,0.000257,0.000184,0.000468,0.000463,0.000446,0.000387,0.000389,0.000472,0.000661,0.000295,0.000421,0.000562,0.000319
4e-06,1.7e-05,9e-06,3.4e-05,1.5e-05,1.2e-05,2.1e-05,4e-06,1.2e-05,6e-06,2.5e-05,1.7e-05,4e-06,1.5e-05,1.4e-05,2.2e-05,1.3e-05,8e-06,8e-06,1.2e-05,2e-05,6e-06,1e-05,1e-05,1.1e-05,7e-06,5e-06,3e-06,3e-06,7e-06,8e-06,1.3e-05,1.2e-05,1.7e-05,1.6e-05,9e-06,5e-06,7e-06,7e-06,6e-06,2.4e-05,1.4e-05,2.3e-05,1.6e-05,1e-05,1e-06,1.7e-05,1.4e-05,1.4e-05,1e-05,1.1e-05,7e-06,4e-06,6e-06,1.3e-05,1.5e-05,3e-05,3.2e-05,2.5e-05,9.8e-05,0.000157,0.000353,0.000413,0.000493,0.000542,0.000406,0.000533,0.000285,0.000609,0.000404,0.000912,0.000476,0.001,0.000379,0.000551,0.00088,0.000696,0.000713,0.000373,0.000375,0.000672,0.000707,0.001371,0.000892,0.000361,0.000294,0.000655,0.000365,0.00045,0.000238,0.000754,0.000466,0.000495,0.000155,0.000908,0.000951,0.000535,0.000257,0.001053,0.000462,0.000352,0.000168,0.00024,0.000826,0.000304,0.000569,4.1e-05,0.000505,0.000872,0.000808,0.000707,0.000273,0.000755,0.000945,0.000309,0.000423,0.000491,0.000746,0.000639,0.000448,0.000407
9e-06,5e-06,1.4e-05,2.8e-05,1.4e-05,2.1e-05,6e-06,1e-05,1.5e-05,1.7e-05,2.8e-05,9e-06,1e-05,1.3e-05,2e-06,1.4e-05,1.2e-05,1.3e-05,1e-05,5e-06,1.2e-05,6e-06,1e-05,7e-06,7e-06,5e-06,8e-06,7e-06,1e-05,1.9e-05,1.5e-05,2e-05,6e-06,3e-06,7e-06,8e-06,2e-06,7e-06,1.8e-05,1.5e-05,2e-05,2.1e-05,1e-05,2.2e-05,1.3e-05,3e-06,1.9e-05,1.7e-05,3e-06,9e-06,1.5e-05,1.5e-05,1.2e-05,6e-06,8e-06,2.1e-05,1.7e-05,3.7e-05,3e-05,1e-04,0.000115,0.00024,0.000615,0.000508,0.000597,0.000331,0.000281,0.000527,0.000784,0.000625,0.000265,0.00033,0.000627,0.00021,0.000318,0.000642,0.001035,0.00018,0.000132,0.000622,0.000522,0.000947,0.000951,0.000473,0.000459,0.000576,0.000219,6.3e-05,0.000509,0.000608,0.000258,0.00042,0.001009,0.001209,0.000812,0.000293,0.00093,0.001165,0.000473,0.000228,0.000817,0.000868,0.000691,0.00042,0.000421,0.00031,0.000213,0.000696,0.000785,0.000455,0.000871,0.000942,0.000848,0.000721,0.000595,0.000561,0.000171,0.000882,0.000785,0.000514,4e-04
4e-06,6e-06,8e-06,1.2e-05,1e-05,4e-06,1.2e-05,1.4e-05,1.9e-05,2e-06,1.5e-05,6e-06,8e-06,2e-06,2e-06,6e-06,9e-06,5e-06,8e-06,3e-06,1.2e-05,8e-06,7e-06,5e-06,3e-06,5e-06,1.4e-05,3e-06,1e-05,1e-05,4e-06,5e-06,4e-06,1e-05,1.2e-05,8e-06,7e-06,1.2e-05,8e-06,5e-06,5e-06,4e-06,7e-06,1.5e-05,8e-06,1.8e-05,1.4e-05,2.3e-05,1.1e-05,4e-06,1e-05,1.1e-05,9e-06,5e-06,6e-06,8e-06,9e-06,2.1e-05,1.5e-05,5.4e-05,0.000176,0.000256,0.000558,0.000519,0.00016,0.000144,0.000323,0.000634,0.000752,0.000363,0.000276,0.000593,0.000623,0.000511,0.000894,0.000799,0.000369,0.00044,0.000268,0.000214,0.000513,0.000779,0.000206,0.000193,0.000431,0.00067,0.000335,0.000666,0.000718,0.000379,0.000414,0.000197,0.000686,0.000487,0.000646,0.000505,0.000624,0.001038,0.00059,0.000334,0.00107,0.000249,0.000477,0.000282,0.00033,0.000131,0.000205,0.000525,0.000357,0.000454,0.000344,0.000312,0.000384,0.000371,7.6e-05,0.000354,0.000488,0.000623,0.000739,0.000623,0.000269
6e-06,9e-06,1e-05,3e-06,9e-06,6e-06,2e-06,1.9e-05,8e-06,8e-06,7e-06,6e-06,3e-06,6e-06,7e-06,1.3e-05,3e-06,9e-06,8e-06,7e-06,9e-06,5e-06,3e-06,1e-05,1.5e-05,4e-06,1.1e-05,1.3e-05,1e-06,1.3e-05,1e-05,9e-06,3e-06,1.4e-05,4e-06,2e-06,1.2e-05,4e-06,9e-06,9e-06,1.3e-05,4e-06,8e-06,1.1e-05,2e-06,1e-05,1.6e-05,1.6e-05,1e-05,9e-06,4e-06,5e-06,7e-06,6e-06,3e-06,2e-06,1.1e-05,2.5e-05,2.1e-05,3.7e-05,0.000165,0.000263,0.000337,0.000625,0.000193,0.000238,0.000585,0.000295,0.000149,0.000586,0.000254,0.000668,0.000576,0.000292,0.00064,0.000206,0.00076,0.000519,0.000336,0.000226,0.000159,0.000823,0.000491,0.000346,0.000194,0.00045,0.000681,0.000135,0.000286,0.000477,0.00018,0.000659,0.000349,0.000135,0.000356,0.000326,0.000671,0.000873,0.000258,0.000769,0.000271,0.000739,0.000438,0.000456,0.000435,0.000284,0.000265,0.000264,0.000394,0.00026,0.000489,0.000369,0.000229,0.000193,0.000195,0.000419,0.000487,0.00056,0.000707,0.000365,0.000234
8e-06,9e-06,1.8e-05,1.4e-05,3e-06,1.2e-05,1.1e-05,1.1e-05,1.6e-05,8e-06,5e-06,2e-06,1e-06,7e-06,6e-06,1e-05,9e-06,4e-06,1.1e-05,6e-06,4e-06,8e-06,9e-06,6e-06,9e-06,5e-06,8e-06,2e-06,1e-06,1.3e-05,7e-06,5e-06,7e-06,1.3e-05,7e-06,1.3e-05,3e-06,5e-06,0,7e-06,9e-06,7e-06,1.3e-05,3e-06,7e-06,5e-06,1.8e-05,1.2e-05,7e-06,7e-06,4e-06,3e-06,8e-06,4e-06,6e-06,0,1.7e-05,1.6e-05,1.3e-05,3.4e-05,0.00013,0.000244,0.00021,0.000392,0.000148,0.000181,0.000405,0.000233,0.00046,0.000494,0.000501,0.000471,0.000248,0.000309,0.000578,0.000243,0.000399,0.000814,0.000338,0.000531,8.4e-05,0.000855,0.000377,0.000308,0.00028,0.000669,0.000864,0.000634,0.000442,0.000166,5.2e-05,0.000438,0.000573,0.000303,0.000658,0.000285,0.000429,0.000389,0.000201,0.000713,0.000618,0.000424,7.8e-05,0.000235,0.000567,0.00054,0.000273,0.000319,0.00017,0.000456,0.000207,0.000487,0.000486,4.5e-05,0.000199,0.000412,0.000258,0.000483,0.000562,0.000369,0.000354
9e-06,5e-06,1e-05,1e-05,1.3e-05,7e-06,1e-05,9e-06,9e-06,1.3e-05,1.2e-05,9e-06,6e-06,1.4e-05,1e-05,6e-06,3e-06,8e-06,4e-06,2e-06,7e-06,5e-06,3e-06,4e-06,7e-06,5e-06,8e-06,5e-06,1e-06,1e-05,3e-06,7e-06,3e-06,2e-06,6e-06,1.6e-05,1.8e-05,1.3e-05,1.3e-05,8e-06,5e-06,6e-06,1.6e-05,9e-06,9e-06,1.2e-05,1.4e-05,4e-06,2e-06,2e-06,2e-06,2e-06,2e-06,8e-06,3e-06,3e-06,1.7e-05,9e-06,1.8e-05,4.1e-05,0.000127,0.000268,0.000344,0.000392,6.2e-05,0.00029,0.000109,3.2e-05,0.000137,0.000301,0.000457,0.000658,0.000974,0.000127,0.000348,0.000216,0.000233,0.000198,0.000625,0.000358,0.000356,0.000132,0.000259,0.000386,0.000147,0.000673,8.8e-05,0.000436,0.000453,0.000242,0.000346,0.000283,0.000413,0.000306,0.000368,0.000233,0.000475,0.000461,0.000179,0.000216,0.000103,0.000153,0.000313,0.000134,0.000305,0.000138,8.9e-05,0.000193,0.000173,0.000372,0.000182,0.000301,0.000211,0.00019,0.000311,0.000211,0.000302,0.000394,0.000462,0.000247,0.000303
8e-06,9e-06,1.1e-05,7e-06,1.6e-05,8e-06,1.2e-05,9e-06,6e-06,8e-06,6e-06,1e-05,1.4e-05,7e-06,9e-06,8e-06,1e-06,5e-06,3e-06,1e-06,4e-06,7e-06,6e-06,6e-06,9e-06,5e-06,7e-06,7e-06,4e-06,3e-06,2e-06,4e-06,4e-06,9e-06,3e-06,1.1e-05,8e-06,3e-06,6e-06,4e-06,4e-06,4e-06,1.4e-05,4e-06,6e-06,1.6e-05,2.1e-05,7e-06,2e-06,5e-06,2e-06,2e-06,2e-06,9e-06,8e-06,8e-06,2.3e-05,1.3e-05,1.2e-05,4.4e-05,0.000144,0.000235,0.000371,0.000338,0.000221,0.000179,0.000321,0.000337,0.00033,0.000484,0.000248,0.000584,0.000363,0.000224,0.000422,0.000192,0.000584,0.000212,0.00045,9.8e-05,0.000628,0.000659,0.000383,0.000462,0.000145,0.000334,0.000503,0.000506,0.000196,0.00017,0.000167,0.000376,0.000126,0.000198,0.000576,5.1e-05,0.000382,0.000462,0.000163,0.000233,9.4e-05,0.000123,0.000202,0.00052,0.000272,0.00027,0.000374,0.000412,0.000258,0.000585,0.000264,0.000141,3.2e-05,7.8e-05,0.000206,0.000282,0.000101,0.000342,0.000353,0.000337,0.000399
3e-06,7e-06,4e-06,1.2e-05,1.2e-05,3e-06,2e-06,1.8e-05,1.1e-05,3e-06,1.1e-05,7e-06,5e-06,8e-06,4e-06,5e-06,1e-06,3e-06,3e-06,3e-06,3e-06,6e-06,9e-06,1.1e-05,5e-06,6e-06,0,4e-06,1e-06,2e-06,4e-06,1e-06,3e-06,1e-05,4e-06,7e-06,3e-06,6e-06,4e-06,6e-06,6e-06,4e-06,1.3e-05,7e-06,4e-06,4e-06,8e-06,6e-06,9e-06,4e-06,0,1e-06,2e-06,7e-06,3e-06,5e-06,1.4e-05,1.4e-05,6e-06,4.9e-05,0.000149,0.000225,0.000368,0.00042,0.000118,0.000228,0.000172,0.000228,0.000219,0.000434,0.000501,0.000348,0.000441,0.000325,0.000579,0.00027,0.00044,0.000395,0.000311,0.000298,0.000367,0.00021,0.000557,0.000279,0.000233,0.000358,0.000393,0.00029,0.000329,0.00024,8.4e-05,0.000242,0.000319,0.000231,0.000374,5e-05,0.000515,0.000424,0.00015,0.000229,7e-05,7.3e-05,0.000185,0.000476,0.000145,0.000212,0.000327,3.8e-05,0.00018,0.000584,0.000233,0.000238,0.000396,0.000133,0.000105,0.000185,0.000287,0.000469,0.000315,0.000176,0.000269
4e-06,4e-06,7e-06,8e-06,7e-06,1e-06,4e-06,1e-05,2e-06,3e-06,1.1e-05,7e-06,3e-06,5e-06,4e-06,1e-05,5e-06,3e-06,4e-06,6e-06,2e-06,3e-06,1e-05,5e-06,9e-06,2e-06,2e-06,1e-06,2e-06,1e-06,4e-06,5e-06,5e-06,4e-06,7e-06,1.2e-05,9e-06,5e-06,4e-06,5e-06,1e-06,3e-06,4e-06,2e-06,4e-06,3e-06,1e-05,7e-06,5e-06,4e-06,1e-06,1e-06,5e-06,4e-06,7e-06,8e-06,2.1e-05,1.7e-05,4e-06,3.3e-05,0.000138,0.000192,0.000311,0.000397,5.1e-05,0.000344,0.000148,0.000168,0.00011,0.000366,0.000212,0.000305,0.000404,0.000209,0.000508,0.000228,0.000165,0.000172,0.000377,0.000286,0.000676,0.000502,0.000526,0.000198,0.000308,0.000177,0.000297,0.000206,0.000111,7.6e-05,0.000276,0.000227,5.7e-05,0.000185,0.000457,4.2e-05,0.000457,0.000448,0.000181,0.000103,0.000156,0.000201,0.000148,0.000358,0.000218,0.000267,9e-05,0.000204,0.000186,0.000237,0.000249,0.000397,0.000273,0.000162,0.000118,0.000201,0.000267,0.000369,0.000259,0.000283,0.000204
5e-06,3e-06,4e-06,1e-05,1e-06,6e-06,6e-06,5e-06,1.1e-05,3e-06,1e-05,7e-06,4e-06,2e-06,9e-06,1.2e-05,1e-06,1.1e-05,4e-06,5e-06,6e-06,7e-06,5e-06,4e-06,1.1e-05,3e-06,3e-06,5e-06,4e-06,6e-06,5e-06,5e-06,4e-06,5e-06,7e-06,6e-06,5e-06,2e-06,7e-06,1e-06,2e-06,3e-06,3e-06,6e-06,5e-06,2e-06,1e-05,7e-06,3e-06,2e-06,3e-06,2e-06,6e-06,3e-06,5e-06,1e-06,2.1e-05,1.1e-05,5e-06,2.9e-05,0.000119,0.000149,0.000352,0.00036,0.000195,0.000237,0.000181,1e-04,0.000188,0.000174,0.000258,0.000101,0.000457,1e-04,0.000269,0.000133,0.000278,0.000152,0.000207,0.000333,0.000691,0.000297,0.000429,0.000438,0.000379,0.000215,0.000239,0.000182,4e-05,6.3e-05,0.000277,0.000123,0.000108,1e-04,0.000502,0.000243,0.000373,0.000342,0.000216,8.5e-05,3.3e-05,0.000294,0.000217,0.000258,0.000204,0.000228,0.000238,0.000104,7.1e-05,0.000263,7.2e-05,0.000325,0.000257,6.8e-05,0.00016,0.000198,0.000227,0.000379,0.000216,0.00029,0.000282
1e-05,4e-06,2e-06,9e-06,5e-06,6e-06,1e-05,4e-06,1e-05,8e-06,9e-06,7e-06,8e-06,1e-06,1.2e-05,1.3e-05,7e-06,1.2e-05,8e-06,5e-06,5e-06,1e-05,6e-06,4e-06,1.3e-05,3e-06,3e-06,6e-06,3e-06,6e-06,4e-06,1e-06,2e-06,3e-06,4e-06,6e-06,6e-06,8e-06,3e-06,4e-06,5e-06,3e-06,9e-06,4e-06,6e-06,7e-06,1e-05,4e-06,2e-06,2e-06,2e-06,1e-06,5e-06,4e-06,2e-06,4e-06,1.7e-05,1.1e-05,6e-06,2.1e-05,0.000124,0.00018,0.000212,0.000343,0.000165,0.000288,8.6e-05,0.000339,0.000109,1e-06,0.000157,5.4e-05,0.000608,0.000199,0.000278,0.000334,0.000242,0.000138,0.00037,0.000543,0.000434,0.000284,0.000393,0.000537,0.000116,0.000303,0.000154,0.000283,0.000132,8e-05,0.000381,0.000241,0.00017,0.00022,0.00052,0.00021,0.00037,0.000379,0.000231,9.5e-05,2.3e-05,0.000275,0.000162,0.000304,0.000114,0.000261,0.000312,0.000262,0.000102,0.000332,0.000106,0.000428,0.000144,0.000177,3.9e-05,0.00024,0.00032,0.000323,0.000248,0.000209,0.000229
1.2e-05,1.1e-05,6e-06,9e-06,5e-06,1.3e-05,5e-06,9e-06,1e-06,3e-06,7e-06,5e-06,6e-06,1e-05,5e-06,8e-06,1.4e-05,6e-06,8e-06,4e-06,7e-06,7e-06,2e-06,3e-06,1.2e-05,3e-06,5e-06,2e-06,3e-06,6e-06,1e-06,3e-06,4e-06,3e-06,3e-06,3e-06,6e-06,1.2e-05,1e-05,8e-06,4e-06,0,9e-06,4e-06,3e-06,5e-06,1.2e-05,6e-06,2e-06,3e-06,4e-06,5e-06,5e-06,3e-06,2e-06,5e-06,1.6e-05,1.1e-05,1e-05,3.1e-05,0.000148,2e-04,0.000271,0.000348,0.000141,0.000283,8.2e-05,0.000187,0.00016,0.000204,0.000416,0.000263,0.000418,0.000241,0.000414,9.9e-05,0.000243,0.000222,0.000126,0.000411,0.000559,0.000106,0.000356,0.00026,0.000476,7.7e-05,0.000141,0.000407,7e-05,6.6e-05,0.00033,0.00019,5e-05,0.000123,0.000468,0.000243,0.000465,0.00041,0.00022,0.000103,4.7e-05,0.000128,0.000268,0.000414,0.000118,0.000233,0.00016,4.5e-05,8.8e-05,0.000277,0.000164,0.000393,0.000167,6e-05,0.000197,6.5e-05,0.00029,0.000391,0.000216,8.3e-05,0.000206
7e-06,4e-06,1e-06,1e-05,1e-05,7e-06,3e-06,1e-05,6e-06,6e-06,4e-06,0,4e-06,7e-06,1e-06,3e-06,4e-06,4e-06,6e-06,3e-06,8e-06,2e-06,6e-06,4e-06,7e-06,7e-06,7e-06,2e-06,4e-06,3e-06,2e-06,2e-06,4e-06,4e-06,4e-06,7e-06,5e-06,6e-06,1e-06,4e-06,2e-06,4e-06,1e-05,3e-06,2e-06,3e-06,9e-06,7e-06,2e-06,2e-06,4e-06,3e-06,2e-06,1e-06,3e-06,2e-06,1.7e-05,1.2e-05,1.3e-05,2.4e-05,0.000146,0.000222,0.000289,0.000355,0.000191,0.000413,0.000159,0.000357,0.000222,0.000388,0.00035,5.9e-05,0.000212,0.000214,0.000614,0.000133,0.000186,0.000308,0.000178,0.00037,0.000107,0.00062,0.000217,0.000244,0.00032,0.000113,0.000291,0.000288,0.000144,0.000246,0.000386,0.000187,0.000329,0.00017,0.000354,0.000253,0.000115,0.000177,0.000123,0.000118,7.4e-05,0.000225,0.000195,0.00024,8e-05,0.000116,0.000186,5.4e-05,0.000211,0.000489,0.000302,0.000306,0.00014,6.2e-05,0.000244,0.000197,0.000297,0.000349,0.000175,0.000269,0.000314
9e-06,5e-06,1e-06,5e-06,7e-06,4e-06,6e-06,8e-06,1e-06,8e-06,1.1e-05,3e-06,3e-06,6e-06,2e-06,2e-06,3e-06,3e-06,2e-06,3e-06,1e-06,3e-06,8e-06,4e-06,2e-06,2e-06,3e-06,7e-06,2e-06,5e-06,1e-06,2e-06,3e-06,1e-06,4e-06,6e-06,2e-06,3e-06,4e-06,7e-06,3e-06,4e-06,1.4e-05,6e-06,2e-06,2e-06,1.3e-05,5e-06,5e-06,3e-06,5e-06,0,3e-06,1e-06,3e-06,4e-06,1.8e-05,1.3e-05,7e-06,2.1e-05,0.000122,0.000234,0.000387,0.000212,0.000178,0.000395,0.000256,0.000325,0.000486,0.000198,0.000211,0.000356,0.000225,0.00031,0.000193,0.000445,0.00011,0.000317,0.000491,0.000711,0.000492,5e-04,7.4e-05,0.000189,0.000186,0.000392,0.000336,0.000286,0.000201,0.000347,0.000433,9.2e-05,0.000276,0.000373,0.000362,0.000232,0.000371,0.000393,0.000162,0.000162,7.6e-05,0.000255,3e-05,0.000388,1.1e-05,0.000258,0.00025,0.000172,0.000131,0.000239,6e-05,0.000327,0.000153,4.8e-05,0.000106,0.000128,0.000164,0.000382,0.000239,0.000319,0.000196
9e-06,4e-06,2e-06,1e-05,4e-06,5e-06,7e-06,4e-06,2e-06,7e-06,5e-06,7e-06,7e-06,1e-06,4e-06,4e-06,1e-06,2e-06,4e-06,2e-06,4e-06,4e-06,6e-06,1e-06,4e-06,3e-06,2e-06,3e-06,6e-06,6e-06,2e-06,3e-06,4e-06,3e-06,0,9e-06,4e-06,1e-06,2e-06,4e-06,4e-06,1e-06,1e-05,3e-06,1e-06,3e-06,1.2e-05,5e-06,7e-06,2e-06,0,4e-06,1e-06,3e-06,2e-06,4e-06,1.5e-05,1.1e-05,5e-06,3e-05,0.00012,0.000235,0.000345,0.000363,9.4e-05,0.000349,0.000213,0.000265,0.000238,0.00024,0.000261,0.000186,0.000119,0.000274,0.000144,0.000276,0.000316,0.000402,0.000677,0.000411,0.000318,0.00051,0.000147,0.000647,0.000486,0.000106,0.000522,0.00017,0.000136,0.000453,0.000385,0.000375,0.000112,0.000353,0.000267,5.2e-05,0.000228,0.000251,2e-04,0.000177,0.000218,0.00034,0.000299,0.000356,3.7e-05,0.000365,0.000232,0.000341,6.4e-05,0.000289,0.000119,0.000155,0.000116,3.9e-05,8e-05,7e-05,0.000191,0.000311,0.000281,0.000309,0.000324
5e-06,5e-06,5e-06,6e-06,7e-06,3e-06,4e-06,6e-06,4e-06,6e-06,7e-06,4e-06,5e-06,9e-06,4e-06,6e-06,6e-06,3e-06,5e-06,4e-06,8e-06,4e-06,6e-06,2e-06,3e-06,3e-06,2e-06,2e-06,4e-06,5e-06,2e-06,4e-06,3e-06,5e-06,2e-06,8e-06,3e-06,3e-06,3e-06,1e-06,2e-06,1e-06,9e-06,4e-06,5e-06,4e-06,9e-06,3e-06,1e-06,2e-06,4e-06,1e-06,3e-06,3e-06,2e-06,4e-06,2e-05,1.1e-05,1e-05,3.1e-05,0.000125,0.000242,0.000216,0.000277,1.6e-05,0.000358,0.000125,0.000178,0.000127,0.000205,0.000192,0.000176,0.000439,0.000101,0.000405,0.000184,0.000332,0.000116,0.000298,0.000167,0.000425,0.000258,0.000299,0.000288,0.000233,0.00025,0.000369,0.000127,0.000148,0.000327,0.000156,3.3e-05,5.4e-05,0.000225,0.000376,0.000494,0.000462,0.000245,0.000382,0.000242,0.00015,9.2e-05,0.000123,0.000247,7.8e-05,0.000385,0.000104,0.000203,5.5e-05,0.000346,0.000205,0.000343,0.000145,6.7e-05,0.000131,0.000144,0.000125,0.000199,0.000293,0.000215,0.000214
1e-06,2e-06,2e-06,6e-06,7e-06,3e-06,3e-06,4e-06,3e-06,1e-06,5e-06,1e-06,3e-06,5e-06,1e-06,4e-06,2e-06,4e-06,2e-06,1e-06,4e-06,2e-06,4e-06,1e-06,4e-06,0,2e-06,2e-06,3e-06,2e-06,1e-06,2e-06,2e-06,3e-06,1e-06,5e-06,4e-06,1e-06,2e-06,1e-06,3e-06,1e-06,9e-06,5e-06,1e-06,2e-06,9e-06,3e-06,3e-06,4e-06,2e-06,2e-06,1e-06,1e-06,2e-06,1e-06,1.7e-05,1.3e-05,6e-06,2.4e-05,0.000122,0.000247,0.000241,0.00034,0.000118,0.000346,5.4e-05,0.000192,5.2e-05,0.000288,0.000205,0.000254,0.000429,0.000114,0.000355,7.1e-05,0.000447,0.000245,0.000342,0.000402,0.000527,0.000409,0.000433,0.000203,0.000269,1.5e-05,0.000349,0.000216,0.000196,4.3e-05,0.000204,0.000157,8.3e-05,5.6e-05,0.000413,0.000147,0.000259,0.000338,0.000292,9e-05,6.9e-05,3.8e-05,6.5e-05,0.000411,7.1e-05,0.000363,4.1e-05,0.000178,0.000133,0.000284,0.000181,0.000307,0.000134,9.3e-05,0.000129,0.000159,0.00016,0.000302,0.000254,0.000207,0.000256
1e-06,1e-06,2e-06,7e-06,7e-06,3e-06,1e-06,6e-06,2e-06,2e-06,5e-06,1e-06,2e-06,4e-06,1e-06,2e-06,1e-06,3e-06,1e-06,2e-06,4e-06,2e-06,3e-06,2e-06,5e-06,1e-06,1e-06,1e-06,2e-06,1e-06,0,1e-06,1e-06,3e-06,1e-06,7e-06,3e-06,2e-06,1e-06,1e-06,3e-06,1e-06,9e-06,3e-06,1e-06,4e-06,1e-05,2e-06,2e-06,3e-06,2e-06,0,2e-06,1e-06,1e-06,2e-06,1.5e-05,1.4e-05,6e-06,2.3e-05,0.000121,0.000234,0.000226,0.000324,7.1e-05,0.00027,0.000125,0.000133,0.000206,0.000141,0.000189,0.000178,0.000571,0.000214,0.000349,7e-05,0.000324,0.000194,0.000351,0.00034,0.000311,0.000427,0.000275,0.000228,0.00026,0.000151,0.000203,0.000175,8.9e-05,7.4e-05,0.00027,3.7e-05,0.000154,0.000148,0.000336,0.000125,0.000319,0.000297,0.000188,5.6e-05,0.000107,0.000122,6.1e-05,0.000291,5.1e-05,0.000293,5.8e-05,0.000115,5.3e-05,0.000288,0.000139,0.000263,0.000172,2.6e-05,7.7e-05,0.000169,0.000173,0.000367,0.000198,0.000214,0.000284
0,1e-06,1e-06,7e-06,7e-06,3e-06,2e-06,5e-06,1e-06,2e-06,5e-06,1e-06,2e-06,4e-06,1e-06,3e-06,2e-06,4e-06,1e-06,1e-06,4e-06,2e-06,2e-06,2e-06,5e-06,0,1e-06,2e-06,2e-06,1e-06,1e-06,1e-06,0,3e-06,2e-06,7e-06,2e-06,2e-06,1e-06,0,2e-06,0,9e-06,3e-06,1e-06,3e-06,9e-06,1e-06,2e-06,3e-06,2e-06,1e-06,0,1e-06,1e-06,2e-06,1.7e-05,1.3e-05,6e-06,2.1e-05,0.000119,0.000223,0.000236,0.00034,2.9e-05,0.000298,1e-04,0.000179,0.000234,0.000185,0.00013,0.000139,0.000429,5.9e-05,0.000281,0.000149,0.000402,0.000173,0.000279,0.000305,0.00038,0.000362,0.000334,0.000175,0.000216,0.000141,0.00021,0.000147,5.1e-05,6.2e-05,0.000286,4.7e-05,8.9e-05,5.2e-05,0.000362,0.00015,0.000329,0.000409,0.000261,4.9e-05,7.9e-05,0.000158,8.9e-05,0.000298,7.1e-05,0.000328,2.2e-05,7.5e-05,7.7e-05,0.000323,0.000173,0.000299,0.000136,4.2e-05,0.000135,0.000177,0.000149,0.000344,0.00022,0.00021,0.000266
