1.9e-05,1.5e-05,2.8e-05,1.7e-05,4e-06,3e-05,1.3e-05,3e-05,1.1e-05,6e-06,3.5e-05,4e-06,1e-06,1.4e-05,3e-06,1.6e-05,0.00023,4e-06,8.4e-05,7.4e-05,9.7e-05,3e-06,4e-05,8.1e-05,1e-06,5.6e-05,5.5e-05,0.000231,0.000128,5.1e-05,0.000359,0.000833,0.000397,0.001146,0.000419,0.000371,0.001592,0.001229,4e-06,0.000888,0.000266,0.000235,0.000374,0.000981,0.000138,0.000209,0.000341,0.000302,0.00105,4.1e-05,0.00017,0.000102,7.3e-05,0.00077,0.000494,0.000233,0.000121,6.9e-05,0.00012,0.000128,0.000116,0.000133,3.5e-05,4.1e-05,5.5e-05,3.2e-05,0.000186,5.8e-05,3.7e-05,3.2e-05,8.1e-05,5e-06,1e-05,4.6e-05,2.9e-05,1.3e-05,0.000102,3.2e-05,6.6e-05,2e-06,6.7e-05,0.000137,5.8e-05,3.5e-05,4.7e-05,0.00053,0.000516,0.000112,0.000113,0.000612,4e-06,3.7e-05,0.000107,7e-05,0.000108,9e-06,3.6e-05,7.4e-05,5.4e-05,3e-05,2.9e-05,3.9e-05,2.9e-05,4e-06,5.8e-05,6e-05,2.5e-05,2.7e-05,3.3e-05,3e-05,6e-05,0,8e-06,3e-06,3.1e-05,3.2e-05,7e-06,5.6e-05,6e-06,4e-05,2.7e-05
3.3e-05,3.1e-05,6.4e-05,3.4e-05,2e-06,6.3e-05,5e-05,5.5e-05,4e-05,1.5e-05,4.8e-05,5.8e-05,3.6e-05,1.8e-05,6.2e-05,4.8e-05,0.00047,0.000294,0.000109,0.000174,0.000146,5.1e-05,0.000276,0.000203,0.000217,0.000344,0.000273,0.000695,0.00011,0.00032,0.000614,0.002986,0.002865,0.00346,0.000827,0.00098,0.001472,0.003365,0.002315,0.003222,0.001888,0.002087,0.001688,0.001643,0.000941,0.000492,0.000527,0.000411,0.003112,0.000546,8.2e-05,0.000702,0.000422,0.001296,0.001111,0.001069,0.000595,0.000477,0.000373,2.2e-05,0.000473,0.000609,8.9e-05,8e-05,0.000132,0.000101,0.000448,0.000305,0.000202,6e-05,8.3e-05,0.000255,0.000166,4.4e-05,2.9e-05,0.000248,0.000306,0.000374,0.00015,0.000155,8e-05,0.000375,0.000357,0.000231,0.000147,0.000862,0.001316,0.001059,0.000791,0.000876,0.001379,0.000776,0.000155,0.000183,0.000271,0.000236,0.000175,0.000284,6.7e-05,0.000163,0.000118,0.000123,0.000142,8.9e-05,0.000133,0.000204,0.000105,8.2e-05,9.3e-05,0.000116,0.000238,7.5e-05,1.7e-05,2.7e-05,5e-05,0.00011,8.8e-05,0.000113,0.000145,0.000114,7.4e-05
4.6e-05,2e-05,2.6e-05,4e-05,3.1e-05,6.1e-05,1.2e-05,5.1e-05,3.3e-05,1.3e-05,4.7e-05,4.7e-05,6e-05,5.3e-05,5.1e-05,1.5e-05,0.000475,0.00082,0.000264,0.000234,0.000468,0.000294,0.000342,0.000187,0.000306,0.000323,0.000218,0.000845,0.001027,0.000819,0.000843,0.003764,0.003077,0.001529,0.001554,0.001606,0.001961,0.001494,0.002737,0.002022,0.000811,0.002019,0.001942,0.002946,0.002062,0.00057,0.000376,0.001385,0.003113,0.000603,0.000568,0.001583,0.001456,0.000374,0.000302,0.001198,0.000938,0.001369,0.001038,0.000183,0.000659,0.000585,0.000434,0.000254,0.000138,8.6e-05,0.000256,0.000195,0.000247,0.000117,0.000159,0.000244,8.2e-05,0.00021,0.000256,0.000149,0.000112,0.000237,0.000266,0.000333,0.000251,0.000219,0.000446,0.000238,0.000262,0.000773,0.000735,0.000647,0.000349,0.000417,0.002334,0.001,0.000335,0.000145,0.000174,0.000218,6.5e-05,0.000214,0.000165,0.000226,0.000131,9.2e-05,9.5e-05,3.9e-05,0.000112,5.4e-05,3.5e-05,8.4e-05,7.7e-05,6.1e-05,0.000201,0.000121,9.3e-05,3.1e-05,9e-06,7.1e-05,2.4e-05,7.7e-05,4.1e-05,5.7e-05,4.4e-05
1.8e-05,2.9e-05,3.4e-05,3.6e-05,2.1e-05,5.4e-05,7.4e-05,6.5e-05,7e-05,4.9e-05,6.3e-05,2.3e-05,7.1e-05,6.2e-05,8.2e-05,4.3e-05,0.000484,0.000508,0.00047,0.00035,0.000154,9e-05,0.000283,0.000314,0.000272,0.000167,0.000469,0.000412,0.000441,0.00025,0.000816,0.003573,0.00246,0.002285,0.002331,0.00576,0.002083,0.002048,0.001592,0.001689,0.001823,0.002405,0.001934,0.002513,0.001219,0.001231,0.000416,0.001476,0.004299,0.003346,0.001529,0.003098,0.001448,0.00036,0.001421,0.001374,0.00048,0.00056,0.000439,0.000495,0.000913,0.000592,0.000314,0.000404,0.000163,0.000116,0.000245,0.00014,0.000221,0.000176,0.000178,0.000333,0.000183,0.000353,0.000164,5.7e-05,0.000225,0.000138,0.000187,0.000431,0.000299,0.000401,0.00033,0.000183,0.000264,0.000579,0.000961,0.000599,0.00073,0.001058,0.002132,0.0013,0.000507,0.000166,0.000148,5.2e-05,5.6e-05,0.000121,0.000118,2.9e-05,3.1e-05,1.6e-05,2.6e-05,1e-05,7.2e-05,6.7e-05,5.9e-05,5.4e-05,0.000119,5.1e-05,7.5e-05,3.9e-05,9e-06,1.9e-05,3.5e-05,7.1e-05,7.4e-05,8.9e-05,0.000107,5.6e-05,6.5e-05
1.6e-05,1.6e-05,1e-05,2.7e-05,2.4e-05,2.6e-05,3.1e-05,2.4e-05,5.3e-05,4e-06,1.3e-05,2e-05,4.1e-05,6.4e-05,2.4e-05,2.6e-05,0.000531,0.000202,0.000126,0.000418,0.000393,0.000216,1e-04,0.000159,0.000633,0.000153,0.000636,0.000858,2e-04,0.000308,0.000491,0.003322,0.00315,0.0037,0.002322,0.004164,0.003859,0.001259,0.001541,0.003225,0.001787,0.001951,0.000595,0.002239,0.001945,0.000309,0.000531,0.000679,0.003808,0.002324,0.002127,0.00353,0.000973,0.000882,0.001555,0.002316,0.001387,0.000475,0.000381,0.000691,6.2e-05,0.000582,0.000875,0.000892,0.000677,0.000303,0.000462,0.000317,0.000431,0.000274,0.000401,0.000332,0.000475,0.000153,0.000112,0.000217,0.000262,0.000297,0.000197,0.000281,0.000185,0.000239,6.2e-05,7.3e-05,0.000184,0.000506,0.00071,0.000199,0.000601,0.000759,0.002405,0.00121,0.000206,2.6e-05,6e-05,5.7e-05,3.5e-05,8.6e-05,3.8e-05,8.3e-05,1.4e-05,1.8e-05,2.8e-05,2.4e-05,4e-05,3.2e-05,4.7e-05,6.5e-05,3.9e-05,2.3e-05,0.000124,0.000104,3e-05,1.7e-05,2.6e-05,2.1e-05,2.7e-05,4.2e-05,4.4e-05,1.5e-05,2.1e-05
4.7e-05,2.4e-05,1.5e-05,1.1e-05,7e-06,8e-06,2.2e-05,4.5e-05,2.7e-05,2.5e-05,2.5e-05,5e-05,6e-05,5.2e-05,5.3e-05,1.7e-05,0.000271,0.000226,3.9e-05,0.000649,0.000862,0.000443,0.000142,0.000306,0.000905,0.000498,0.000668,0.001334,0.000525,0.000241,0.00057,0.00162,0.001298,0.002842,0.000339,0.003771,0.007898,0.00146,0.001668,0.003896,0.001283,0.002096,0.002588,0.001337,0.002459,0.001201,0.000615,0.001228,0.004556,0.002758,0.003195,0.000886,0.00218,0.001647,0.001562,0.000489,0.000333,0.001098,0.001082,0.000543,0.00041,0.000255,0.000667,0.00032,0.000405,0.000771,0.000297,0.000335,0.000748,0.000349,0.00053,0.000532,0.00047,0.00026,0.000185,0.000305,8.3e-05,0.000208,7.6e-05,0.000129,0.000215,0.000413,0.000275,0.000283,0.00029,0.000477,0.000819,0.000667,0.000469,0.000812,0.003583,0.001714,0.000423,7.5e-05,0.000111,0.000117,1e-05,0.000111,8.5e-05,0.000101,5.8e-05,3.7e-05,5.4e-05,3.7e-05,2.8e-05,2.4e-05,3.1e-05,4.9e-05,4.8e-05,4.5e-05,0.000352,0.000125,7.4e-05,1.1e-05,1.5e-05,1.3e-05,3.4e-05,1.7e-05,4.8e-05,3.3e-05,5.3e-05
2.8e-05,1.6e-05,4e-05,5.7e-05,3.9e-05,3.2e-05,2.8e-05,6.1e-05,4.6e-05,2.9e-05,2e-05,7.8e-05,4.8e-05,8.2e-05,3.7e-05,3.8e-05,0.000446,0.000345,4.9e-05,0.00079,0.000504,0.000287,0.000157,0.000248,0.000982,0.00043,0.000633,0.001601,0.001651,0.000537,8.8e-05,0.002045,0.002364,0.005086,0.004342,0.005109,0.015299,0.009085,0.001611,0.0037,0.004509,0.003615,0.000659,0.00189,0.000549,0.001473,0.000928,0.001351,0.004358,0.008444,0.002391,0.002579,0.002202,0.000996,0.001756,0.000531,0.001088,0.001205,0.000677,0.000692,0.000929,0.001402,0.000562,0.001429,0.00054,0.001081,0.00088,0.000369,0.001172,0.000428,0.000584,9.1e-05,0.000434,0.000395,0.000205,0.000185,0.000189,0.000283,0.000178,0.000529,0.000264,0.000729,0.000463,0.000175,0.000115,0.000223,0.001869,0.00246,0.000934,0.001454,0.004171,0.002113,0.000927,0.00016,9.9e-05,2.7e-05,8.6e-05,0.000236,0.000141,0.000135,0.000124,7.7e-05,1.2e-05,5.8e-05,9.9e-05,3.6e-05,5.4e-05,2.1e-05,4.9e-05,1.9e-05,0.000581,0.000225,7.2e-05,3.4e-05,1.7e-05,1.3e-05,3.3e-05,1.5e-05,2.7e-05,3e-05,1.2e-05
4.8e-05,5.2e-05,1e-05,3.3e-05,8e-06,3.3e-05,4.5e-05,3.4e-05,2.7e-05,1.7e-05,1e-06,7.5e-05,9.1e-05,0.000114,9.5e-05,5.4e-05,0.001201,0.000204,9.6e-05,0.000691,0.001261,0.00082,0.000532,5e-05,0.001213,0.001004,0.000937,0.001525,0.001404,0.001238,0.00046,0.002324,0.001805,0.004794,0.007775,0.011805,0.019599,0.017001,0.011109,0.0048,0.001091,0.002872,0.004018,0.00094,0.002917,0.003427,0.001029,0.000875,0.005704,0.008865,0.00696,0.005208,0.002144,0.002016,0.003499,0.002043,0.002288,0.002739,0.002711,0.002491,0.001102,0.002238,0.001771,0.002428,0.002321,0.000731,0.000231,0.000344,0.001068,0.001375,0.000515,0.000732,0.000226,0.000554,0.000218,0.000164,7.1e-05,0.000215,0.00024,0.000624,0.000334,0.00092,0.000664,0.000247,0.000141,0.000379,0.002276,0.000655,0.001168,0.00083,0.002878,0.002478,0.001103,0.000358,0.000154,0.000135,0.000109,0.000308,6.5e-05,0.000121,6e-05,3.4e-05,3.4e-05,5e-05,9.5e-05,8.6e-05,6.6e-05,9.9e-05,9.2e-05,7.9e-05,0.000666,0.000354,8.3e-05,4.9e-05,1.9e-05,2.7e-05,2.3e-05,2.5e-05,2.4e-05,6e-06,1.6e-05
4.5e-05,3.8e-05,3.1e-05,2.1e-05,1.3e-05,4.1e-05,1.9e-05,4.1e-05,6.7e-05,3.9e-05,3e-05,6.1e-05,0.000216,5.6e-05,0.000146,0.00013,0.001648,0.001422,0.000632,0.000662,5e-04,0.001032,0.000265,0.000385,0.001762,0.001466,3.1e-05,0.00157,0.000864,0.000787,0.000559,0.00181,0.003418,0.003956,0.004885,0.004294,0.005777,0.004577,0.001791,0.00076,0.000822,0.002016,0.00115,0.001365,0.003212,0.002828,0.001965,0.000761,0.005866,0.003147,0.001759,0.002501,0.001535,0.00182,0.002241,0.002937,0.000429,0.001804,0.000517,0.001394,0.001348,0.001644,0.001133,0.000801,0.00099,0.000922,0.000557,0.000506,0.000647,0.001059,0.001006,0.000933,0.000709,6.5e-05,0.000291,0.000133,6.5e-05,0.000248,0.000158,0.000803,0.000453,0.000929,0.000622,0.000538,0.000347,0.000524,0.00147,0.003308,0.002979,0.001985,0.001519,0.001656,0.000903,0.000251,3.9e-05,6.7e-05,5.1e-05,0.000365,0.000312,7.9e-05,4.6e-05,7.5e-05,6.7e-05,4.8e-05,2.2e-05,3.6e-05,3.5e-05,5.8e-05,6e-06,1.5e-05,0.000672,0.000988,0.000595,0.000191,3.3e-05,3.5e-05,3e-05,2.7e-05,5.7e-05,4.2e-05,6.2e-05
3.6e-05,1.6e-05,1.8e-05,1.3e-05,1.3e-05,5.1e-05,3.9e-05,5.1e-05,3.9e-05,2.8e-05,7.7e-05,6.5e-05,0.000259,0.000296,0.000236,9.5e-05,0.001556,0.001321,0.000633,0.000424,0.000593,0.000632,0.001041,0.001104,0.001318,0.000576,0.000505,0.001288,0.000787,0.000729,0.000223,0.000445,0.001562,0.002593,0.005538,0.003791,0.001223,0.003633,0.003841,0.001286,0.001177,0.00102,0.000697,0.000957,0.00078,0.001101,0.000967,0.000466,0.003898,0.001249,0.00157,0.00067,0.000988,0.00152,5e-04,0.001062,0.001376,0.000742,0.000423,0.001252,0.000191,0.000821,0.000168,0.000546,0.000131,0.000836,0.000508,7.5e-05,0.000616,0.000239,0.00031,8.5e-05,0.000169,0.000128,0.000109,7.5e-05,9e-05,0.000122,0.000173,0.000641,8.8e-05,0.000489,0.000146,0.000178,0.000192,0.000195,0.000771,0.002537,0.002082,0.000547,0.002022,0.000889,0.000315,5.7e-05,5.2e-05,6.3e-05,8.5e-05,0.00031,0.000205,0.00015,3e-05,6.1e-05,1.8e-05,4.4e-05,5e-05,1.8e-05,2.4e-05,5.8e-05,4.1e-05,4.7e-05,0.00048,0.000808,0.000327,0.000109,1.5e-05,2.7e-05,1e-05,5.1e-05,2.2e-05,1e-05,4.6e-05
2.6e-05,6e-06,7e-06,9e-06,1.7e-05,1.7e-05,7e-06,2e-05,1.4e-05,1.9e-05,3.5e-05,2.1e-05,0.000292,0.000317,0.000185,0.000215,0.001377,8e-04,0.000731,0.000443,0.000351,0.000475,0.000543,0.000379,0.001879,0.001087,0.000654,0.00134,0.000577,8.6e-05,0.000349,0.000602,0.00203,0.000862,0.00099,0.00362,0.00453,0.001086,0.00085,0.000388,0.001158,0.000605,0.001965,0.000893,0.00147,0.00113,0.001162,0.000873,0.001878,0.000764,0.000984,0.000169,0.001748,0.001328,0.00106,0.000147,0.001144,0.001125,2.7e-05,0.001412,0.000857,0.000688,0.000412,0.000392,0.000254,0.000759,0.000266,0.00014,0.000239,0.000235,0.000374,7.6e-05,0.000125,8.1e-05,0.000109,6.9e-05,0.000128,5.5e-05,1e-04,0.000446,0.000739,0.000556,0.000217,0.000107,0.000153,0.000222,0.000688,0.002836,0.001537,0.000734,0.001901,0.000954,0.000268,0.000105,8.6e-05,0.000137,6.6e-05,2.6e-05,6.5e-05,2.5e-05,4.3e-05,2.7e-05,1.4e-05,3.3e-05,4.5e-05,6.1e-05,4e-05,4.6e-05,3.9e-05,8.5e-05,0.000181,0.000391,0.000243,0.000105,4.3e-05,3.1e-05,3.1e-05,4e-05,4.8e-05,7e-06,2.1e-05
8e-06,8e-06,6e-06,8e-06,1.3e-05,1.7e-05,1.7e-05,4e-06,1.2e-05,1e-05,2.4e-05,1.7e-05,0.000193,4.9e-05,5.8e-05,7.7e-05,0.001238,0.000609,0.00025,7.5e-05,9e-05,0.000249,0.000557,0.000237,0.001384,0.001089,0.001021,0.001711,0.001335,0.000464,0.000459,8.6e-05,0.00255,0.002418,0.002191,0.003052,0.001345,0.001875,0.000604,0.002404,0.000636,0.001488,0.001094,0.000909,0.001211,0.001292,0.001352,0.000781,0.002748,0.002032,0.001821,0.001668,0.000979,0.002091,0.000222,0.001734,0.000375,0.000374,0.000515,0.000342,0.000318,0.000625,0.000353,8.9e-05,0.000284,0.000818,0.000396,0.000215,0.000328,0.000533,0.000219,0.000303,0.000115,0.000165,0.000195,0.000118,0.000152,3.3e-05,0.00014,0.000323,0.000944,0.001107,0.00043,0.000185,0.000194,3.5e-05,0.000909,0.001732,0.001194,0.001299,0.000941,0.000509,0.000154,2.8e-05,9.3e-05,0.000139,0.000185,0.000234,0.000189,8e-05,6e-06,7e-06,5.6e-05,4.2e-05,4.1e-05,4.6e-05,3.5e-05,2.9e-05,2.5e-05,9.2e-05,0.000218,0.000191,9.9e-05,4.6e-05,2.5e-05,1.2e-05,1e-05,2e-05,3.3e-05,3.1e-05,2e-05
1.6e-05,4e-06,1e-05,3e-06,9e-06,1.9e-05,7e-06,9e-06,2e-06,4e-06,3.1e-05,3.3e-05,3.6e-05,7.2e-05,0.000101,6.8e-05,0.001222,0.000465,0.000148,7.3e-05,0.000204,9.9e-05,0.000114,0.000123,0.000992,0.000516,0.000263,0.001239,0.000637,0.000213,0.000493,0.00117,0.00176,0.0021,0.000514,0.00152,0.001077,0.000952,0.002278,0.000834,0.002226,0.001631,0.000501,0.001714,0.000512,0.001371,0.001218,0.000595,0.001653,0.000519,0.001386,0.002856,0.002426,0.001401,0.001378,0.001486,0.00051,0.000612,0.000483,0.001039,0.000502,0.000365,0.000465,0.000143,0.000322,0.00089,0.000319,0.000226,0.000471,0.000477,0.00028,0.000128,0.000255,0.00033,0.000304,8.3e-05,0.000175,2.1e-05,0.000177,0.000356,0.000656,0.000456,0.000238,0.000114,9.4e-05,0.000244,0.000734,0.002289,0.001478,0.002114,0.001124,0.000243,0.000131,8.8e-05,9.3e-05,2.3e-05,0.000129,0.000165,0.000194,7.5e-05,2.5e-05,2.4e-05,5.8e-05,5.1e-05,2.9e-05,2.8e-05,1.7e-05,1.4e-05,3.3e-05,6.3e-05,0.000225,6.6e-05,4e-05,1.1e-05,2.5e-05,1.2e-05,1.4e-05,1.8e-05,8e-06,2.1e-05,2e-06
1.8e-05,1e-05,1.8e-05,1e-05,7e-06,2.2e-05,2e-05,9e-06,6e-06,4e-06,2.5e-05,1.7e-05,8e-05,4.9e-05,5.1e-05,6.1e-05,0.0011,0.000649,0.000209,7.8e-05,0.000145,7.1e-05,0.000192,8.7e-05,0.000593,6.6e-05,0.000346,0.000552,0.000287,0.000169,0.000277,0.001479,0.003051,0.002691,0.00205,0.001496,0.001087,0.003366,0.003291,0.001016,0.000439,0.002001,0.000758,0.002472,0.002762,0.000781,0.001842,0.00139,0.000511,0.000568,0.002127,0.00442,0.000833,0.003296,0.001235,0.002401,0.000903,0.001721,0.000748,0.001655,0.001351,0.000763,0.000711,3.5e-05,0.000414,0.001323,0.000885,0.000624,0.000343,0.000174,0.000176,0.000307,0.000132,0.000223,0.000303,0.000237,0.000145,8.1e-05,3.4e-05,0.000267,0.000159,0.000535,0.000154,4.3e-05,5.1e-05,0.000319,0.000434,0.001379,0.000263,0.000391,0.00032,5e-05,5.9e-05,8.2e-05,2.7e-05,6.5e-05,4.8e-05,0.000136,5e-05,9.3e-05,4.9e-05,3e-05,6.9e-05,6.1e-05,5.2e-05,2.2e-05,4.1e-05,3.7e-05,2.4e-05,2.6e-05,0.00025,0.000117,6.6e-05,3.7e-05,7e-06,1.6e-05,8e-06,1.5e-05,1.1e-05,2.3e-05,1.5e-05
1.1e-05,9e-06,1.6e-05,1e-05,1.7e-05,1.2e-05,3e-06,5e-06,9e-06,1.6e-05,1.7e-05,3.7e-05,8.4e-05,6.7e-05,7.2e-05,7.3e-05,0.001115,0.000857,0.00029,0.000117,0.000134,7.1e-05,0.000268,0.000142,0.000381,0.000145,0.00027,0.00047,3.5e-05,0.000394,0.000443,0.001853,0.005204,0.001152,0.003571,0.004437,0.002965,0.002735,0.001903,0.004806,0.002753,0.004728,0.003346,0.002444,0.001233,0.001897,0.000372,0.00071,0.002463,0.003928,0.00511,0.004506,0.004872,0.004794,0.005104,0.003051,0.003379,0.001748,0.000937,0.001204,0.000956,0.001225,0.001884,0.000872,0.000583,0.001167,0.000541,0.001535,0.001141,0.000588,0.000333,0.000258,0.000463,0.000229,0.000866,4.6e-05,0.000484,0.000211,0.000186,3e-04,0.000386,0.001141,0.000158,0.000212,6.6e-05,0.000299,0.000953,0.000463,0.000854,0.000679,0.000324,0.000212,8.1e-05,8.5e-05,6.4e-05,0.000102,8.1e-05,0.000173,0.000119,6.4e-05,8.7e-05,4e-05,1.8e-05,2.3e-05,6.6e-05,5.7e-05,0.000111,4e-05,3.9e-05,3e-05,0.000246,0.000222,9.4e-05,4.5e-05,4.6e-05,2.1e-05,1.1e-05,1.3e-05,6e-06,2e-05,1.3e-05
1.6e-05,1.1e-05,2e-05,7e-06,1.4e-05,1.4e-05,7e-06,1.2e-05,1.2e-05,1.9e-05,2.8e-05,5.7e-05,7.2e-05,5.1e-05,4.1e-05,4.9e-05,0.001297,0.000494,0.00017,0.000139,0.000196,0.000117,0.000325,0.000189,0.000452,0.000102,0.000322,0.001204,0.000875,0.000524,0.000265,0.001906,0.002002,0.006739,0.008875,0.002135,0.000953,0.004559,0.005173,0.008356,0.012284,0.010262,0.002399,0.002955,0.003108,0.002564,0.005008,0.001275,0.003263,0.002727,0.004028,0.009436,0.008178,0.004581,0.006559,0.007684,0.002156,0.00472,0.002776,0.000998,0.000907,0.001172,0.003574,0.003758,0.001337,0.001773,0.002042,0.002634,0.001593,0.001162,0.000367,0.001102,0.001025,0.001128,0.001714,0.001459,0.001349,4e-04,0.000131,0.000368,0.000515,0.001631,0.001641,0.000521,0.000284,0.000291,0.00105,0.000799,0.000385,0.000839,0.000928,0.000414,0.000243,0.000211,0.000163,1.3e-05,7.5e-05,0.000211,0.000144,8.8e-05,6.3e-05,2.6e-05,1.5e-05,3.5e-05,9.1e-05,5.7e-05,7.9e-05,6.4e-05,5e-05,4.3e-05,0.000187,0.000149,8.4e-05,2.4e-05,2.5e-05,2.6e-05,9e-06,2.3e-05,2e-05,1.6e-05,1.2e-05
6e-06,2.1e-05,1e-05,3e-06,9e-06,2e-06,8e-06,5e-06,8e-06,2.2e-05,3.2e-05,1.6e-05,2e-05,5.7e-05,3.6e-05,2.9e-05,0.001371,0.000739,0.000327,0.000115,0.000226,0.000214,0.00046,0.000207,0.000673,0.000229,0.000704,0.001668,0.000693,0.000159,0.000228,0.002129,0.004805,0.008659,0.003757,0.0067,0.003932,0.007228,0.011039,0.00764,0.005617,0.007448,0.010018,0.009633,0.011082,0.004844,0.006395,0.010565,0.007052,0.005595,0.006836,0.007482,0.004939,0.008378,0.010158,0.004216,0.005655,0.01015,0.00961,0.009557,0.006047,0.003109,0.001355,0.002687,0.003421,0.002834,0.003914,0.003128,0.001784,0.000923,0.000558,0.001146,0.000386,0.000898,0.000553,0.000859,0.00033,0.001259,0.000737,0.001108,0.001162,0.002647,0.002764,0.001796,0.000525,0.000327,0.00071,0.000776,0.000817,0.002218,0.00151,0.000677,0.000185,0.000184,0.000104,0.000121,0.000138,0.000286,0.000103,1.4e-05,6.4e-05,4.1e-05,4e-06,5.5e-05,3e-05,1.9e-05,6.8e-05,3.2e-05,1.7e-05,3.9e-05,0.000103,4.7e-05,3e-05,1.8e-05,2.7e-05,2.2e-05,1.5e-05,2.6e-05,2.7e-05,8e-06,6e-06
2.1e-05,2.6e-05,1.2e-05,6e-06,1e-05,1e-05,2e-06,5e-06,5e-06,1.8e-05,2.1e-05,3.1e-05,6.9e-05,3.1e-05,4.3e-05,5.6e-05,0.00111,0.00098,0.000411,0.000257,0.000361,0.000312,0.000396,0.000195,0.000754,0.000527,0.000936,0.00131,0.000822,0.000707,0.000165,0.002005,0.00788,0.005782,0.005203,0.007489,0.003128,0.005206,0.005091,0.005688,0.002528,0.001328,0.007738,0.008293,0.003542,0.006275,0.010064,0.008007,0.003186,0.000785,0.002023,0.000172,0.005722,0.008066,0.001637,0.004921,0.010004,0.001708,0.002456,0.004519,0.006865,0.004626,0.002431,0.003555,0.001921,0.001243,0.00333,0.001972,0.001664,0.001612,0.00113,0.001281,0.002145,0.001416,0.001355,0.000464,0.000414,0.00088,0.000881,0.001274,0.001056,0.001257,0.000757,0.000187,0.000335,0.000525,0.000273,0.000716,0.000257,0.00215,0.000887,0.000465,9.9e-05,7.7e-05,6.5e-05,0.000108,0.000193,0.000167,0.000156,9.2e-05,9.3e-05,5.9e-05,2.6e-05,6.3e-05,4.9e-05,6.7e-05,2.7e-05,4.8e-05,4.2e-05,2.1e-05,0.000106,9.9e-05,4.5e-05,2.6e-05,2.3e-05,6e-06,4e-06,2.1e-05,5e-06,3.4e-05,2.3e-05
5e-06,8e-06,2.6e-05,1.7e-05,4e-06,1e-05,6e-06,1.4e-05,7e-06,1.2e-05,2.4e-05,4.7e-05,0.000113,9.4e-05,2.6e-05,2.7e-05,0.000922,0.00058,0.000185,0.000321,9.7e-05,0.000167,0.000722,0.000464,0.000684,0.000413,0.000627,0.000544,0.000504,0.000811,0.000624,0.001456,0.005763,0.003731,0.004454,0.004721,0.003361,0.002749,0.002266,0.004958,0.00413,0.004455,0.003561,0.002084,0.004919,0.003603,0.0015,0.004108,0.003624,0.004489,0.001492,0.002591,0.006686,0.004003,0.003726,0.003851,0.00394,0.004903,0.001846,0.003304,0.002703,0.00036,0.000819,0.003009,0.001427,0.000653,0.00124,0.000684,0.000618,0.000695,0.000414,0.000254,0.001843,0.00121,0.001012,0.000632,0.000347,0.000459,0.000861,0.00097,0.000334,0.000881,0.000398,8.5e-05,6.7e-05,0.000222,0.000263,0.000814,0.000656,0.001083,0.00075,0.000301,7.7e-05,5.4e-05,0.00013,5.9e-05,0.000204,0.000662,0.00045,0.000198,0.000123,5.6e-05,4.6e-05,0.000112,0.000102,5.8e-05,6.6e-05,6.1e-05,4e-06,2.2e-05,0.000143,5.6e-05,4.8e-05,2e-06,9e-06,1.6e-05,2.7e-05,2e-05,1.2e-05,3.3e-05,2.5e-05
1.1e-05,1.5e-05,1.2e-05,2.7e-05,1.8e-05,1.8e-05,7e-06,1.8e-05,9e-06,1.5e-05,2.7e-05,3.9e-05,5.7e-05,0.000168,0.000126,0.000145,0.000808,0.000379,0.000359,0.000411,0.000452,0.000278,0.000661,0.000705,0.000109,0.000291,0.000463,0.000826,0.000708,0.000401,0.000359,0.001732,0.002497,0.001383,0.002434,0.001381,0.000859,0.001836,0.001032,0.00153,0.001242,0.002917,0.003747,0.003085,0.002754,0.007101,0.005358,0.003747,0.004692,0.002938,0.004433,0.001013,0.002936,0.003346,0.000368,0.00471,0.002209,0.001493,0.000782,0.001136,0.002908,0.002724,0.001907,0.002447,0.001279,0.000771,0.000655,0.001271,0.001215,0.000414,0.000493,0.000338,0.001494,0.00053,0.000185,0.00056,0.000195,0.000407,0.000445,0.00085,0.000365,0.000397,7.9e-05,5.1e-05,5.3e-05,0.000202,0.000414,0.000198,0.000475,0.000622,0.000422,0.000245,0.000248,0.000206,0.000299,0.000293,0.000103,0.000824,0.000435,0.000175,0.000103,5.5e-05,0.000128,5.2e-05,2.3e-05,5.6e-05,1.7e-05,0.000105,7.8e-05,3.4e-05,0.000148,5.3e-05,2.2e-05,3.1e-05,3.5e-05,1.9e-05,2.8e-05,2.8e-05,1.1e-05,1e-05,4.6e-05
9e-06,1.4e-05,1.3e-05,6e-06,7e-06,1e-05,1.6e-05,1.3e-05,1.5e-05,2.7e-05,3.9e-05,7.8e-05,3.9e-05,0.000141,7e-05,0.000242,0.00091,0.00093,0.00023,0.000174,0.000143,0.000135,0.000487,0.000182,0.000584,0.000396,0.000497,0.001102,0.000467,0.000278,0.000301,0.001391,0.001609,0.003847,0.002242,0.001403,0.002267,0.000261,0.001908,0.001514,0.001032,0.000432,0.00038,0.001231,0.002083,0.004664,0.000511,0.001695,0.003865,0.004512,0.000762,0.001236,0.001807,0.001217,0.000944,0.002414,0.001144,0.001618,0.000977,0.000659,0.000666,0.000524,0.00073,0.001032,0.001274,0.000852,0.000629,0.000554,0.000304,0.000252,0.000128,0.000142,0.000916,0.000567,0.000425,0.000381,0.000478,0.000739,0.000251,0.000579,0.000485,0.000302,0.000302,0.000197,6.8e-05,0.000237,0.000385,0.000369,0.000411,0.00085,0.000394,9e-05,8.8e-05,5e-05,0.000211,7.4e-05,9.1e-05,0.00099,0.000584,0.000236,0.000103,7.1e-05,9.9e-05,6.6e-05,2.8e-05,5e-05,5.1e-05,8.9e-05,7.2e-05,1.7e-05,0.000166,0.000122,2.3e-05,3.9e-05,6.3e-05,4.3e-05,2.2e-05,1.1e-05,2e-05,1.9e-05,3.9e-05
1.7e-05,5e-06,6e-06,3e-06,2e-06,5e-06,9e-06,9e-06,8e-06,1.3e-05,1.2e-05,5.6e-05,2.2e-05,8.5e-05,6.4e-05,0.00036,0.000427,0.000457,0.000346,0.000118,0.000146,7.9e-05,0.000439,0.000579,0.000467,0.000301,0.000547,0.001601,0.000733,6.8e-05,0.000366,0.000999,0.001548,0.00126,0.001623,0.001259,0.001636,0.001862,0.001263,0.002113,0.001257,0.000421,0.001015,0.001381,0.001624,0.000277,0.000947,0.001065,0.002201,0.001095,0.000305,0.000983,0.001944,0.000683,0.001056,0.001195,0.001301,0.001699,0.001686,0.001589,0.000305,0.000536,0.000561,0.001017,0.000993,0.000982,0.00043,0.000273,0.000286,0.000137,0.00027,0.000272,0.000535,0.000415,0.000323,0.000395,0.000173,0.000349,0.000126,0.000212,0.000202,0.000215,6.6e-05,0.000187,0.000115,0.000245,8.7e-05,0.000359,0.000354,0.000205,0.000185,3.4e-05,6.6e-05,9.4e-05,8.7e-05,0.000209,9.2e-05,0.001016,0.000475,0.000192,4.5e-05,6.8e-05,4.6e-05,4e-05,3.2e-05,6e-06,2.4e-05,3e-05,3.6e-05,3.2e-05,0.000159,8.8e-05,5.3e-05,2.5e-05,2.9e-05,4e-06,3e-06,2.3e-05,2e-05,1.4e-05,2.5e-05
7e-06,3e-06,4e-06,6e-06,3e-06,2e-06,1e-06,3e-06,3e-06,5e-06,1e-05,2.2e-05,5e-05,2.6e-05,4.5e-05,0.00013,0.00012,0.000143,6.9e-05,3.2e-05,3.2e-05,3e-05,0.000152,6.2e-05,0.000238,0.000172,0.000199,0.000857,0.000585,0.000192,1e-04,0.000378,0.000646,0.000473,0.00091,0.000721,0.000651,0.000979,0.000479,0.000297,0.000524,0.000515,0.000773,0.000339,0.000131,0.000648,0.00068,0.000565,0.000202,0.000419,0.000281,0.000429,0.000444,5.1e-05,0.000451,0.000595,0.000295,6.5e-05,0.000219,0.000392,0.000281,0.000134,8.7e-05,0.000133,0.000104,0.000356,9.5e-05,7.6e-05,5.7e-05,2.1e-05,9.8e-05,9.3e-05,0.00013,8.6e-05,0.000101,2.8e-05,4.4e-05,9.6e-05,3.6e-05,5.3e-05,3.3e-05,8.8e-05,9e-06,5.9e-05,2.8e-05,0.000176,0.00012,0.000152,0.000177,0.00031,5.7e-05,3.6e-05,4.2e-05,1.3e-05,2.8e-05,8e-05,5.1e-05,0.000408,0.000229,7.4e-05,1.1e-05,1.2e-05,1.8e-05,1.7e-05,4e-06,5e-06,2.2e-05,2.1e-05,1e-05,1.1e-05,7.3e-05,6.1e-05,3.9e-05,2.1e-05,1.2e-05,7e-06,4e-06,1.2e-05,1.8e-05,8e-06,7e-06
6e-06,6e-06,6e-06,4e-06,2e-06,3e-06,5e-06,5e-06,5e-06,2e-06,6e-06,2.1e-05,4.3e-05,3.4e-05,1.5e-05,6.6e-05,2.5e-05,8.9e-05,3.8e-05,3.2e-05,3.4e-05,7e-05,0.000155,0.000126,0.000195,4.1e-05,0.000175,0.000672,0.000367,0.000125,9.2e-05,0.00042,0.000342,0.000104,0.000727,0.000555,0.000939,0.00015,0.00047,0.000271,0.000308,0.000432,0.000218,0.000672,0.000445,0.000421,0.000819,0.000364,0.000339,0.000209,0.000432,0.000562,0.000118,0.000302,3.7e-05,0.000466,0.000276,0.000493,0.00024,0.000434,0.000295,2e-04,0.000117,0.000134,0.000156,0.000138,0.000143,3.6e-05,6e-05,2e-05,8.3e-05,3.2e-05,0.000135,4e-06,5e-06,3.1e-05,5.7e-05,7.5e-05,4e-05,4.2e-05,4.5e-05,5.4e-05,4.9e-05,7e-06,2.9e-05,0.000189,0.000118,0.000142,0.000152,0.000304,0.000118,1.9e-05,3e-06,2.9e-05,2e-05,3.7e-05,1.3e-05,0.000283,0.000165,5e-05,1.3e-05,2.8e-05,3e-06,1.2e-05,1.2e-05,4e-06,1.3e-05,1.6e-05,7e-06,6e-06,6.1e-05,4.6e-05,1.5e-05,7e-06,9e-06,3e-06,5e-06,4e-06,4e-06,1e-06,8e-06
3e-06,2e-06,1e-06,3e-06,2e-06,2e-06,3e-06,3e-06,1e-06,3e-06,2e-06,9e-06,2.3e-05,2.5e-05,1.9e-05,2e-05,7.1e-05,2.4e-05,3.7e-05,1e-05,2e-05,4.4e-05,0.000172,3.7e-05,6.3e-05,3.8e-05,0.00018,0.00035,0.000188,0.00013,6.8e-05,3e-04,0.000405,0.000476,0.000525,0.000218,0.000743,0.000652,0.000127,0.000839,0.000445,4.2e-05,0.000182,0.000582,0.000124,0.000171,0.000467,0.000493,0.000541,0.000402,0.000283,0.000528,0.000366,2e-04,0.000348,0.000635,0.000174,0.000248,0.000318,0.000312,0.000209,7.8e-05,4e-05,3.5e-05,0.000104,0.00016,0.000116,4e-05,7.6e-05,7e-05,4.8e-05,3.4e-05,0.000106,2.1e-05,4.3e-05,5.2e-05,4.6e-05,5.5e-05,1.1e-05,3.5e-05,4.1e-05,5.9e-05,4.7e-05,2e-05,2.1e-05,0.000147,9.1e-05,0.000113,0.000149,8.9e-05,7.6e-05,3e-05,3.5e-05,2.1e-05,8e-06,3.5e-05,3.3e-05,0.000236,0.00014,6.2e-05,1.7e-05,5e-06,1.4e-05,9e-06,1e-05,7e-06,5e-06,2.3e-05,1e-05,1e-06,2.9e-05,7e-06,7e-06,6e-06,5e-06,4e-06,3e-06,4e-06,2e-06,1e-06,5e-06
0,3e-06,3e-06,5e-06,3e-06,1e-06,1e-06,3e-06,3e-06,2e-06,5e-06,2e-06,1.1e-05,2.5e-05,1e-05,2.5e-05,6.6e-05,1.9e-05,1.4e-05,2e-06,1.7e-05,8e-06,0.000123,0.000101,4.6e-05,3e-05,0.000194,0.000126,3.2e-05,1.1e-05,2.8e-05,0.000286,0.000398,0.000634,0.000572,0.000363,0.000638,0.000266,0.000854,0.000202,0.000243,0.000219,0.00035,0.000488,0.000493,0.000345,0.000334,0.000224,0.000515,0.000355,0.000453,0.000144,0.000322,9.1e-05,0.000532,0.000297,0.000124,0.000334,0.000166,0.00023,0.000128,0.000142,3.1e-05,4.9e-05,3.3e-05,0.000127,5.5e-05,4.4e-05,4e-05,3e-05,6.8e-05,1.6e-05,8.7e-05,2e-05,6.4e-05,1.5e-05,4.4e-05,4.2e-05,6e-06,3.1e-05,3.9e-05,3.6e-05,2.1e-05,7e-06,1.5e-05,8.7e-05,1.4e-05,9.1e-05,0.000143,0.000213,4.6e-05,1.4e-05,2.8e-05,1.9e-05,2e-05,4.7e-05,1.5e-05,0.000194,7.8e-05,1.6e-05,1e-05,3e-06,6e-06,1.3e-05,8e-06,5e-06,6e-06,8e-06,5e-06,7e-06,2.1e-05,2.5e-05,1e-05,2e-06,3e-06,4e-06,2e-06,3e-06,7e-06,3e-06,3e-06
1e-06,4e-06,3e-06,2e-06,1e-06,3e-06,2e-06,1e-06,1e-06,3e-06,3e-06,4e-06,2e-06,6e-06,1e-05,2.6e-05,4.2e-05,3.5e-05,2.2e-05,1.2e-05,1.6e-05,1.7e-05,7.3e-05,3.7e-05,5.9e-05,3.4e-05,0.000178,0.000183,4.8e-05,9e-06,1.1e-05,0.000255,0.000462,0.000206,0.000639,0.000701,0.000416,1.7e-05,0.000639,0.000269,7.6e-05,0.000248,2e-04,0.000629,0.000439,0.000499,0.000124,0.00041,0.000253,0.000578,0.000356,0.000184,0.000247,0.000213,0.000463,0.000537,0.000223,0.000221,0.000331,0.000233,7.6e-05,4.3e-05,5.2e-05,1.5e-05,6.1e-05,8.2e-05,6.6e-05,6.5e-05,3.9e-05,5.1e-05,6e-05,5.7e-05,0.000107,5e-06,6.4e-05,3.3e-05,3.3e-05,4.4e-05,2e-05,1e-05,1e-05,4.5e-05,2.1e-05,1.5e-05,3.1e-05,2.1e-05,3.6e-05,8e-05,0.000129,0.000213,1.5e-05,4e-06,1e-05,1.3e-05,1.4e-05,4.2e-05,3.1e-05,9.4e-05,5.5e-05,1.6e-05,1.8e-05,1.6e-05,6e-06,9e-06,1.2e-05,4e-06,5e-06,1.1e-05,6e-06,7e-06,4.6e-05,2.4e-05,1.3e-05,3e-06,6e-06,3e-06,4e-06,2e-06,6e-06,2e-06,5e-06
1e-06,4e-06,2e-06,3e-06,1e-06,3e-06,2e-06,2e-06,1e-06,3e-06,2e-06,1e-06,6e-06,7e-06,1.1e-05,1.5e-05,7e-05,5e-05,7e-06,1.9e-05,1.4e-05,3.8e-05,3.4e-05,2.3e-05,8.4e-05,4e-05,0.000163,0.000108,5e-05,5.2e-05,3.6e-05,0.000289,0.000557,0.000305,0.000783,0.000495,0.000405,0.000408,0.00035,0.000315,0.00035,0.000396,3e-04,0.000463,0.000115,0.000444,0.000394,0.000383,0.000246,0.000184,0.000112,0.000412,0.000114,0.000273,0.000378,0.000215,0.000234,0.000197,0.000327,0.000381,0.000205,1.9e-05,8.9e-05,5.8e-05,4.2e-05,6.5e-05,3.9e-05,5.9e-05,1.6e-05,4e-06,3.2e-05,2.7e-05,6.7e-05,2e-06,5.8e-05,1.4e-05,1.4e-05,4.1e-05,0,2.4e-05,1.3e-05,1.6e-05,2.6e-05,9e-06,2.4e-05,1.6e-05,1.6e-05,8.8e-05,0.000163,0.000125,6.3e-05,2e-05,1.7e-05,3.9e-05,6e-06,4e-05,1.6e-05,6.6e-05,3.1e-05,3e-05,1.7e-05,5e-06,8e-06,1.4e-05,2e-06,3e-06,4e-06,6e-06,4e-06,7e-06,5.1e-05,2.2e-05,7e-06,9e-06,9e-06,6e-06,3e-06,1e-06,3e-06,2e-06,4e-06
1e-06,1e-06,3e-06,2e-06,2e-06,2e-06,2e-06,2e-06,0,2e-06,1e-06,3e-06,1e-05,5e-06,2.5e-05,1.5e-05,9e-05,5e-05,1.3e-05,1.5e-05,6e-06,2.4e-05,3.4e-05,3.5e-05,7.2e-05,1.1e-05,0.000156,0.000223,6.8e-05,2.8e-05,2e-05,0.000276,0.000397,0.000292,0.000468,0.00039,0.000407,0.000498,7.3e-05,0.000328,4.8e-05,0.000177,0.000221,0.000675,0.000267,0.000329,0.00022,0.000303,0.000149,0.000122,0.000307,0.000108,0.000248,0.000259,0.000474,0.000269,0.000162,0.000368,0.000165,2e-04,5.4e-05,0.000112,0.000131,0.000153,8.3e-05,0.00012,0.000115,4.5e-05,2.6e-05,6.8e-05,3.2e-05,3.1e-05,5.6e-05,4.3e-05,4.8e-05,4.7e-05,2.6e-05,5.2e-05,3.1e-05,5e-05,3.5e-05,2e-05,2.1e-05,2.8e-05,5e-06,1.3e-05,4.2e-05,0.000106,0.00014,0.000134,5e-06,1.2e-05,6e-06,3.7e-05,2.5e-05,3.2e-05,2.5e-05,0.000154,4.1e-05,1.3e-05,1.6e-05,6e-06,1e-05,1.1e-05,1e-05,3e-06,6e-06,7e-06,3e-06,6e-06,3.3e-05,8e-06,3e-06,2e-06,2e-06,4e-06,2e-06,1e-06,5e-06,2e-06,3e-06
1e-06,1e-06,2e-06,1e-06,1e-06,1e-06,2e-06,1e-06,1e-06,2e-06,2e-06,4e-06,2e-06,1e-05,1.8e-05,4e-05,8.4e-05,6.3e-05,2.8e-05,2.5e-05,3.3e-05,2.5e-05,2.2e-05,2.4e-05,5.1e-05,4.6e-05,0.000128,0.000375,0.00024,0.000122,6.6e-05,0.000222,0.000271,0.000325,0.000296,0.000359,0.00045,0.000359,0.000327,0.000297,0.000195,0.00016,3e-04,0.000304,0.000134,0.000225,0.000323,0.000274,0.000327,0.000105,0.000466,0.000337,0.000275,8.9e-05,0.000325,3.5e-05,0.000256,0.000417,3e-04,0.000248,0.000309,0.000181,0.00027,0.000354,0.000238,7.4e-05,0.000123,7.8e-05,6.3e-05,7.4e-05,6.9e-05,2.2e-05,0.000134,3.6e-05,6.3e-05,2.4e-05,1e-06,4.9e-05,4.8e-05,2e-05,3.5e-05,2.6e-05,3e-05,3.3e-05,2.1e-05,3.1e-05,7.8e-05,0.000171,0.000179,0.000185,4.6e-05,4.5e-05,2.2e-05,1.4e-05,5e-06,2.7e-05,1.3e-05,0.000114,0.000103,5.4e-05,1.3e-05,1e-05,2e-05,1e-06,3e-06,3e-06,9e-06,1.1e-05,5e-06,6e-06,6e-06,1.7e-05,8e-06,7e-06,1.1e-05,5e-06,5e-06,5e-06,2e-06,1e-06,6e-06
2e-06,2e-06,1e-06,2e-06,4e-06,2e-06,3e-06,1e-06,1e-06,1e-06,3e-06,3e-06,1e-05,8e-06,1.2e-05,4.2e-05,4.5e-05,2.3e-05,2.2e-05,2.6e-05,3.2e-05,3.4e-05,3.2e-05,1.5e-05,1.9e-05,2.9e-05,0.000136,0.000365,0.000291,0.000103,2.1e-05,0.000303,0.000257,0.000386,0.000355,0.000131,0.000472,0.00013,0.000194,9e-05,0.000237,0.000164,0.000389,0.000507,0.000369,0.000342,0.000196,0.000228,0.000487,0.000508,0.000313,0.000282,0.000132,0.000208,0.000437,0.000431,0.000196,6.8e-05,0.00029,0.000245,0.000464,0.000357,0.000207,5.5e-05,0.000148,0.000107,0.000207,0.000104,3.6e-05,7.8e-05,0.000116,7.7e-05,0.000163,5e-05,4.5e-05,4.1e-05,9e-06,6.4e-05,7.9e-05,6.7e-05,8.1e-05,6.5e-05,0.000117,5.6e-05,1.6e-05,7.4e-05,0.000117,9.7e-05,0.000146,0.000129,0.000124,4.9e-05,3.2e-05,2.1e-05,3e-06,2.9e-05,1.9e-05,4.9e-05,6.7e-05,2.7e-05,1.5e-05,2.1e-05,7e-06,1e-05,7e-06,6e-06,1.1e-05,1.8e-05,1.2e-05,9e-06,2.6e-05,2.2e-05,5e-06,6e-06,1e-05,7e-06,1e-06,5e-06,7e-06,5e-06,7e-06
1e-06,2e-06,1e-06,2e-06,3e-06,2e-06,1e-06,0,1e-06,1e-06,1e-06,3e-06,1.4e-05,1.9e-05,8e-06,3.6e-05,4.8e-05,3.1e-05,2.9e-05,1.4e-05,6.6e-05,1.5e-05,5.4e-05,2.2e-05,4.2e-05,2e-05,0.000135,0.000158,5.4e-05,6.1e-05,8.8e-05,0.000242,0.000137,0.000294,0.000188,0.000245,0.000387,0.000301,0.000201,0.000328,6e-05,0.000106,0.000101,0.000421,6.5e-05,8.7e-05,0.000273,0.000104,0.000383,0.000219,0.000418,0.000293,1e-04,0.000296,0.000301,0.000443,0.000164,0.000314,0.000355,0.000106,0.000256,0.000335,0.000478,4e-04,7.9e-05,0.000184,0.000144,7.7e-05,5.6e-05,7e-06,8.7e-05,5e-05,9.4e-05,4.3e-05,3.4e-05,4.8e-05,3.4e-05,6.5e-05,0.00011,7.4e-05,2.1e-05,5e-05,5.8e-05,9e-06,2.5e-05,6.9e-05,6.8e-05,1e-04,0.000106,4.2e-05,2.4e-05,4e-05,1e-05,2.9e-05,6e-06,3.1e-05,1.4e-05,0.000173,4.6e-05,1.7e-05,1.8e-05,1.3e-05,4e-06,4e-06,7e-06,3e-06,8e-06,4e-06,3e-06,2e-06,5.1e-05,3.6e-05,2.1e-05,9e-06,3e-06,5e-06,4e-06,3e-06,6e-06,3e-06,2e-06
1e-06,2e-06,1e-06,2e-06,3e-06,2e-06,2e-06,0,2e-06,1e-06,1e-06,3e-06,1.6e-05,1e-05,5e-06,1.9e-05,3.4e-05,2.6e-05,4.5e-05,1.4e-05,6.7e-05,4.7e-05,4.5e-05,3.1e-05,2.3e-05,2.3e-05,0.00013,0.000196,4e-05,5e-05,5.9e-05,0.000249,0.000191,0.000118,0.000255,0.000313,0.000209,0.000341,0.000253,0.000342,0.000222,0.000237,0.000218,0.000242,0.000317,0.000426,0.000284,0.000137,0.000214,6.3e-05,5e-05,0.000151,0.000188,0.000209,0.00037,6.7e-05,0.000192,0.000111,0.000376,0.000221,0.000184,0.000101,0.000117,0.000127,0.00021,0.000278,0.000202,0.000112,9.1e-05,5e-05,6.5e-05,5.5e-05,7e-05,7.5e-05,2.8e-05,3.5e-05,8e-06,5.2e-05,5.9e-05,5.1e-05,3.1e-05,5.9e-05,4.5e-05,3.1e-05,2.1e-05,8.1e-05,7.2e-05,0.00011,0.000118,8.9e-05,7.4e-05,4.7e-05,3.1e-05,3.5e-05,1.6e-05,1.6e-05,2.6e-05,0.000286,0.000119,5.4e-05,1.6e-05,1.4e-05,4e-06,1e-06,1e-05,4e-06,1.1e-05,7e-06,4e-06,3e-06,5e-05,1.8e-05,7e-06,2e-06,1e-06,4e-06,6e-06,3e-06,7e-06,0,5e-06
1e-06,2e-06,2e-06,2e-06,2e-06,1e-06,2e-06,1e-06,2e-06,3e-06,0,4e-06,1.4e-05,1.6e-05,1.5e-05,2.9e-05,4.2e-05,3.3e-05,3e-06,1.9e-05,5e-05,4e-05,7.1e-05,5.3e-05,6.8e-05,3e-05,0.000122,0.00053,0.000328,0.000126,9.8e-05,0.000295,5.6e-05,0.000316,0.000203,0.00019,0.000314,0.000386,0.000131,0.000201,0.000132,0.000296,0.000245,0.000188,0.000202,0.000283,0.00015,8.5e-05,0.000129,0.000126,0.000145,0.000203,0.000128,0.000256,0.000268,0.000273,2.7e-05,0.000196,0.000246,8.3e-05,0.000153,9.3e-05,7.6e-05,5.1e-05,7e-05,0.000135,4.9e-05,5.1e-05,7.1e-05,3.7e-05,2.9e-05,3.7e-05,4.9e-05,1.6e-05,2.8e-05,7.2e-05,4.2e-05,5.3e-05,3.1e-05,4.8e-05,5e-05,3.3e-05,5.4e-05,2.5e-05,2e-06,6e-05,4.6e-05,2.1e-05,0.000138,0.000127,1.7e-05,3.2e-05,1.4e-05,3.3e-05,3.1e-05,3.4e-05,1.6e-05,0.000347,0.000232,1e-04,2.1e-05,2.1e-05,2.1e-05,1.6e-05,1.2e-05,9e-06,1.5e-05,7e-06,3e-06,5e-06,3.8e-05,2e-05,1.3e-05,8e-06,7e-06,4e-06,1e-06,1e-06,5e-06,3e-06,4e-06
3e-06,3e-06,2e-06,2e-06,1e-06,2e-06,3e-06,3e-06,3e-06,2e-06,4e-06,1e-06,1.9e-05,2.5e-05,1.8e-05,3.6e-05,8.4e-05,7.4e-05,6.4e-05,4.7e-05,1.5e-05,4.3e-05,4e-05,1.7e-05,9.9e-05,7.9e-05,6.6e-05,0.000723,0.000462,0.000219,4.1e-05,0.000195,0.00025,0.000146,0.000275,7.7e-05,0.000102,0.000422,0.000373,0.000234,4.6e-05,0.000221,0.000174,0.000166,0.000218,0.000121,0.000199,0.000106,0.000322,0.000293,0.000139,0.000368,9.8e-05,0.000256,0.00041,0.00027,0.000105,0.000223,0.000179,0.000127,0.000101,0.000194,0.000181,0.000106,7e-05,9.1e-05,1.1e-05,9.9e-05,9.1e-05,7.6e-05,3e-06,3.3e-05,0.000114,2.2e-05,3.6e-05,5.9e-05,3.2e-05,5.1e-05,3.7e-05,9e-06,3.1e-05,5.3e-05,2.6e-05,3.1e-05,1e-05,4.5e-05,6.7e-05,0.000158,6.7e-05,0.000119,1.8e-05,1.6e-05,2.3e-05,1.1e-05,9e-06,2.8e-05,1e-05,0.000352,0.000228,9.2e-05,1.3e-05,1.4e-05,1e-05,5e-06,1.4e-05,1.1e-05,6e-06,1.6e-05,1.4e-05,1.1e-05,1.3e-05,9e-06,6e-06,1e-06,6e-06,7e-06,6e-06,6e-06,1e-05,8e-06,7e-06
3e-06,1e-06,2e-06,1e-06,1e-06,2e-06,1e-06,1e-06,2e-06,1e-06,3e-06,3e-06,1.8e-05,8e-06,9e-06,2.2e-05,7.3e-05,3.5e-05,3.3e-05,2.1e-05,4e-05,2.1e-05,3.3e-05,2.9e-05,0.000128,5.5e-05,7.4e-05,0.000686,0.000282,0.000105,0.000103,8.8e-05,1.9e-05,0.000368,0.000381,0.000202,4.4e-05,0.000129,0.000131,0.000308,0.000197,0.000102,0.000199,8.8e-05,0.000298,0.000515,0.000376,9e-05,0.000339,0.000176,6.9e-05,0.000418,0.000351,0.000259,0.000377,0.000348,8.9e-05,0.000119,9e-05,4.6e-05,0.00014,0.000246,0.000282,0.000103,6.8e-05,0.000103,8e-06,0.000129,7.1e-05,9.4e-05,4.2e-05,9.1e-05,0.000139,0.000118,7.3e-05,0.000101,6.1e-05,2e-05,3e-05,2.8e-05,3.3e-05,3.5e-05,7.7e-05,9e-06,2.4e-05,4.4e-05,0.00014,0.000135,6.6e-05,6.9e-05,5.3e-05,1.5e-05,7e-06,9e-06,8e-06,3.7e-05,3e-05,0.000365,0.000261,0.000124,2.5e-05,3.7e-05,2.1e-05,7e-06,6e-06,9e-06,6e-06,1e-05,6e-06,3e-06,2.1e-05,1.3e-05,1e-05,6e-06,9e-06,1e-05,5e-06,4e-06,6e-06,5e-06,3e-06
3e-06,3e-06,1e-06,2e-06,1e-06,2e-06,2e-06,1e-06,2e-06,2e-06,2e-06,1e-06,1.5e-05,1e-05,1.4e-05,1.9e-05,0.000116,8.1e-05,2.8e-05,2.6e-05,2.7e-05,4.1e-05,1.9e-05,9e-06,0.000147,7.7e-05,6.3e-05,0.000499,0.000271,2.2e-05,2.8e-05,0.000113,0.000151,0.00055,0.00018,0.000133,0.000272,0.00021,0.000158,0.000281,0.000111,0.000183,0.000187,8.6e-05,0.000185,0.000309,0.000191,4.6e-05,0.000231,0.000337,0.000267,0.000213,8.8e-05,0.000179,0.000115,0.000253,0.00022,6.3e-05,0.000301,5.1e-05,9.5e-05,0.000108,0.000234,0.000348,0.000246,0.000291,1e-04,0.000159,0.000198,4.6e-05,8.3e-05,0.000117,0.000127,7.8e-05,0.000113,0.000105,6.6e-05,5.2e-05,5.6e-05,3.7e-05,3.2e-05,8.8e-05,0.000122,7.5e-05,5.7e-05,7.5e-05,0.000154,0.000132,8.9e-05,8.9e-05,8e-06,1.6e-05,1.3e-05,1.8e-05,1.7e-05,5.9e-05,5e-05,0.000402,0.000324,0.000157,3.3e-05,1.5e-05,3e-05,3.1e-05,1.8e-05,3e-06,7e-06,6e-06,1.2e-05,1.6e-05,2.6e-05,1.7e-05,1.6e-05,8e-06,5e-06,3e-06,5e-06,6e-06,2e-06,1e-06,2e-06
4e-06,5e-06,3e-06,1e-06,1e-06,3e-06,1e-06,1e-06,1e-06,2e-06,2e-06,1e-06,1.6e-05,7e-06,1.8e-05,2e-05,0.000114,6.6e-05,4.1e-05,1.1e-05,3e-06,2.8e-05,1.5e-05,1.2e-05,9.1e-05,5.5e-05,7e-05,0.000266,0.000172,1.9e-05,7.5e-05,0.000158,0.000168,0.000383,0.000368,5.6e-05,0.000503,0.00045,0.00027,0.000368,0.000223,0.000258,0.000165,4.8e-05,0.000242,0.000132,0.000112,9.6e-05,9.4e-05,8.4e-05,0.000352,6.6e-05,0.000261,0.00016,0.000187,0.000124,0.000123,0.000236,0.000233,0.000185,0.000127,0.000279,0.000323,0.00034,0.000121,0.000336,0.000388,0.000272,8.8e-05,4e-05,0.000174,6.7e-05,0.000105,0.000235,0.000289,0.000154,3.2e-05,3.2e-05,8e-05,4.6e-05,6e-05,0.000122,1.5e-05,2.5e-05,1.5e-05,4.1e-05,3.9e-05,0.000146,0.000114,8.4e-05,5.3e-05,2.7e-05,2.5e-05,1.7e-05,6e-06,5.7e-05,4.3e-05,0.000451,0.000378,0.000177,5e-05,3.3e-05,2.2e-05,1.1e-05,1.2e-05,6e-06,8e-06,1e-06,7e-06,5e-06,3.8e-05,3.5e-05,1.2e-05,6e-06,5e-06,2e-06,2e-06,3e-06,3e-06,2e-06,1e-06
3e-06,3e-06,4e-06,2e-06,1e-06,1e-06,0,1e-06,0,1e-06,3e-06,3e-06,1.1e-05,6e-06,5e-06,2.8e-05,5.1e-05,1.4e-05,1.5e-05,1.9e-05,2.1e-05,1.9e-05,3.2e-05,3.5e-05,6.8e-05,4.1e-05,6.7e-05,0.000119,0.000163,0.000107,2.2e-05,9.8e-05,0.000195,0.000336,0.000196,0.000435,0.000125,0.000158,0.000114,0.000384,0.000137,0.000235,0.000189,3.6e-05,0.000194,0.000297,0.00021,4.4e-05,5e-05,8.2e-05,0.000433,0.000286,0.000126,0.000194,0.000287,0.000377,0.000137,0.000141,0.000128,0.000133,8.4e-05,0.000165,6e-05,0.000175,0.000179,0.000196,0.000226,0.000122,8.4e-05,5.4e-05,0.000104,7.9e-05,0.000135,0.000176,5.4e-05,3.8e-05,6.4e-05,5.7e-05,3.1e-05,3e-06,2e-05,7.7e-05,3.2e-05,6e-05,4.1e-05,2.2e-05,3.9e-05,0.000107,8e-05,9e-05,3.5e-05,1.2e-05,2e-06,1.7e-05,1e-05,4.1e-05,2.6e-05,0.000374,0.000235,9e-05,2.7e-05,2.3e-05,1.9e-05,7e-06,5e-06,7e-06,2e-06,3e-06,5e-06,7e-06,3.1e-05,2.1e-05,1.1e-05,5e-06,2e-06,6e-06,2e-06,0,4e-06,3e-06,3e-06
2e-06,1e-06,1e-06,0,1e-06,1e-06,1e-06,0,0,0,2e-06,3e-06,1e-05,4e-06,7e-06,1.9e-05,1.6e-05,4e-06,1e-05,2e-05,6e-06,4e-06,1.8e-05,2e-06,3.2e-05,1.7e-05,5.2e-05,9.7e-05,6.6e-05,5.2e-05,4e-05,0.000127,0.000251,0.000196,0.000222,0.000427,0.000245,0.00013,0.000412,0.000423,2e-04,3.4e-05,8.1e-05,0.000113,0.000174,0.000184,0.000248,6.3e-05,8.6e-05,0.000196,0.000195,0.000242,0.000245,9.8e-05,0.000188,8e-05,8.1e-05,7.6e-05,5.4e-05,8.6e-05,3.9e-05,2.6e-05,0.000159,4.7e-05,3e-05,0.000132,4.4e-05,3.5e-05,4.1e-05,1.4e-05,9.7e-05,2.6e-05,5.7e-05,8.3e-05,6.1e-05,3.6e-05,1.8e-05,3.2e-05,6e-06,1.8e-05,1.5e-05,6.2e-05,4.6e-05,2e-05,1.1e-05,1.3e-05,6e-05,0.000106,7.4e-05,0.000125,3.6e-05,2e-05,1.6e-05,8e-06,9e-06,3.1e-05,8e-06,0.00025,6e-05,3.2e-05,1.8e-05,6e-06,1.2e-05,3e-06,2e-06,2e-06,3e-06,2e-06,2e-06,3e-06,2.6e-05,2e-06,4e-06,1e-06,0,3e-06,1e-06,1e-06,3e-06,2e-06,2e-06
2e-06,1e-06,1e-06,1e-06,1e-06,1e-06,1e-06,0,0,0,1e-06,1e-06,8e-06,3e-06,7e-06,1.3e-05,1.6e-05,6e-06,1.5e-05,8e-06,5e-06,2e-06,7e-06,6e-06,2.5e-05,7e-06,5.9e-05,9.8e-05,6.7e-05,8e-06,2.8e-05,0.000136,0.000278,0.000148,0.000207,0.000274,0.000112,1.7e-05,0.000201,0.00023,0.00013,0.000142,0.000163,0.000141,0.000141,0.000152,0.00019,9.4e-05,3.9e-05,0.000249,0.000251,4.2e-05,0.000292,0.00024,3.2e-05,0.000173,1.1e-05,9e-05,0.000107,6.3e-05,8.1e-05,4.5e-05,0.000117,2.2e-05,3.6e-05,6.9e-05,2.8e-05,4.3e-05,2e-05,1.2e-05,6.7e-05,6e-06,6.6e-05,3.2e-05,3e-05,2.9e-05,1.4e-05,3.6e-05,1.2e-05,5e-06,4e-06,3.9e-05,3e-05,5e-06,5e-06,1.3e-05,4.1e-05,8.8e-05,8.7e-05,9.4e-05,2.7e-05,3e-06,7e-06,4e-06,5e-06,2.4e-05,3e-06,0.000136,2.3e-05,1.6e-05,8e-06,6e-06,7e-06,2e-06,1e-06,2e-06,3e-06,2e-06,2e-06,4e-06,2.2e-05,5e-06,1e-06,4e-06,2e-06,2e-06,2e-06,0,2e-06,1e-06,2e-06
2e-06,1e-06,1e-06,0,1e-06,1e-06,1e-06,0,0,1e-06,1e-06,1e-06,8e-06,3e-06,6e-06,1.2e-05,2.1e-05,8e-06,1.6e-05,4e-06,1e-06,3e-06,1e-06,1e-05,2.1e-05,4e-06,5.9e-05,6.3e-05,1.9e-05,1.3e-05,3.4e-05,0.000128,0.000261,0.000201,0.000138,0.000346,0.000268,0.000131,0.000114,0.000314,0.000126,0.000121,0.000133,7.5e-05,0.000214,0.000236,0.000176,7.5e-05,5.5e-05,0.000114,0.000159,0.000115,0.000177,0.000161,2.2e-05,0.000141,2.4e-05,6.7e-05,7.7e-05,7.3e-05,7e-05,4.3e-05,0.00011,2.1e-05,2.1e-05,5e-05,3.5e-05,3.6e-05,3.4e-05,5e-06,6.5e-05,3e-06,6.4e-05,2.8e-05,3.2e-05,2.4e-05,1.3e-05,3.7e-05,1.2e-05,5e-06,1e-06,3.2e-05,2e-05,8e-06,8e-06,1.6e-05,3.8e-05,8.2e-05,9e-05,9.7e-05,2.2e-05,4e-06,4e-06,6e-06,8e-06,1.9e-05,2e-06,8.2e-05,2.1e-05,1e-05,2e-06,3e-06,1.1e-05,4e-06,3e-06,2e-06,2e-06,4e-06,2e-06,3e-06,1.9e-05,5e-06,2e-06,2e-06,1e-06,2e-06,2e-06,1e-06,1e-06,0,2e-06
