0.023453,0.025007,0.022178,0.020708,0.020081,0.019362,0.021932,0.022695,0.020443,0.020643,0.020714,0.021179,0.024004,0.024126,0.021938,0.020272,0.01866,0.016845,0.016026,0.017185,0.018597,0.01729,0.014627,0.015185,0.017428,0.017934,0.016181,0.014915
0.030098,0.031627,0.028612,0.027292,0.026669,0.025588,0.028254,0.028839,0.026037,0.026314,0.026852,0.027618,0.031139,0.0316,0.0291,0.026799,0.02444,0.021896,0.020926,0.022268,0.023852,0.022368,0.018693,0.019257,0.022566,0.022991,0.020493,0.019551
0.042561,0.043733,0.040442,0.03975,0.03921,0.037257,0.039611,0.039635,0.036407,0.037043,0.038417,0.039765,0.044208,0.045001,0.042114,0.039064,0.035423,0.031566,0.030319,0.032025,0.033945,0.0322,0.026457,0.02636,0.031329,0.031724,0.028285,0.02855
0.055647,0.056243,0.052174,0.051999,0.051863,0.048538,0.049031,0.048266,0.046919,0.049036,0.051014,0.05256,0.055543,0.056006,0.054348,0.050671,0.045364,0.041194,0.040497,0.042854,0.044774,0.042397,0.034206,0.031922,0.037724,0.038396,0.035333,0.037785
0.0675,0.067527,0.061762,0.061031,0.062154,0.058082,0.05524,0.052693,0.055124,0.060897,0.063045,0.063091,0.061448,0.061756,0.063446,0.058468,0.051687,0.049232,0.050408,0.053447,0.05438,0.050773,0.041129,0.036238,0.040686,0.041774,0.041282,0.045503
0.075383,0.07485,0.069144,0.068232,0.07104,0.068393,0.063276,0.057476,0.061854,0.071523,0.073675,0.071048,0.065705,0.065987,0.069221,0.063188,0.056318,0.055606,0.058643,0.062,0.061583,0.057105,0.04798,0.042929,0.044115,0.043865,0.046883,0.051769
0.077571,0.077405,0.074949,0.075479,0.080295,0.080131,0.073485,0.065434,0.069446,0.0789,0.080747,0.077823,0.072872,0.071272,0.072585,0.069575,0.064946,0.062147,0.063826,0.066558,0.06634,0.062025,0.0529,0.049131,0.047879,0.04639,0.051784,0.055963
0.082452,0.083932,0.088606,0.091711,0.093612,0.092114,0.08683,0.081418,0.083605,0.08782,0.089411,0.090072,0.088894,0.082662,0.079741,0.081832,0.079341,0.07163,0.068543,0.072747,0.07864,0.074201,0.060243,0.055838,0.054967,0.056605,0.062479,0.061444
0.104079,0.111195,0.121628,0.122876,0.116784,0.112115,0.108509,0.10645,0.108894,0.108745,0.111232,0.119884,0.124072,0.108346,0.097801,0.102584,0.100948,0.091248,0.086161,0.092799,0.106024,0.100473,0.077938,0.070154,0.071022,0.081302,0.088287,0.074636
0.139941,0.15003,0.159308,0.158562,0.148156,0.143361,0.139867,0.139113,0.14385,0.14046,0.142492,0.16051,0.170123,0.141992,0.122654,0.128516,0.128143,0.119749,0.114877,0.124216,0.142581,0.132798,0.102012,0.091135,0.092937,0.115068,0.126585,0.097507
0.172201,0.179064,0.181847,0.183599,0.175746,0.173284,0.167011,0.163823,0.16865,0.16463,0.168899,0.194383,0.206753,0.168288,0.144266,0.150457,0.149728,0.146256,0.143157,0.152592,0.171038,0.155352,0.121685,0.112566,0.115895,0.144938,0.159075,0.120572
0.18648,0.186192,0.180087,0.18604,0.181261,0.181007,0.173098,0.164024,0.166217,0.168714,0.177314,0.200594,0.20961,0.170835,0.151369,0.156232,0.153216,0.159849,0.16261,0.166093,0.175465,0.157029,0.130804,0.126498,0.131246,0.155544,0.16503,0.129638
0.176396,0.176102,0.165514,0.173861,0.168468,0.168996,0.163753,0.148604,0.147967,0.157753,0.167542,0.178794,0.178365,0.151073,0.148508,0.152814,0.142604,0.15409,0.162517,0.159248,0.154844,0.137279,0.127004,0.126663,0.128731,0.138226,0.138988,0.122279
0.152996,0.160429,0.146977,0.152684,0.149898,0.151364,0.144533,0.12889,0.13021,0.137861,0.150269,0.159135,0.150166,0.136142,0.150711,0.149993,0.131176,0.142202,0.149963,0.140728,0.126603,0.111051,0.112977,0.113695,0.109279,0.104178,0.100333,0.106761
0.133322,0.144188,0.139907,0.143013,0.137071,0.132345,0.121455,0.110523,0.117467,0.120868,0.131788,0.145676,0.140375,0.134924,0.149618,0.145235,0.130675,0.133871,0.132103,0.124921,0.109097,0.095049,0.101504,0.103211,0.09684,0.088913,0.083129,0.095164
0.128805,0.144926,0.161725,0.160402,0.13963,0.126343,0.113633,0.106075,0.112396,0.116725,0.124931,0.131647,0.135805,0.138599,0.145407,0.149505,0.143368,0.130465,0.121499,0.123947,0.10649,0.092343,0.099829,0.100841,0.100838,0.097442,0.090498,0.096949
0.142962,0.166826,0.197439,0.188605,0.158157,0.152154,0.136741,0.114331,0.113535,0.128884,0.145484,0.147905,0.153724,0.14948,0.146745,0.161244,0.157313,0.132209,0.119035,0.129589,0.114378,0.096048,0.104693,0.111305,0.116767,0.116845,0.108647,0.109291
0.160904,0.191089,0.218622,0.200916,0.178414,0.18777,0.166812,0.132211,0.129579,0.154723,0.180586,0.188064,0.189121,0.167514,0.162583,0.179592,0.170171,0.143778,0.124263,0.131503,0.123889,0.103378,0.109762,0.124963,0.133727,0.136379,0.127827,0.127342
0.165688,0.189817,0.201968,0.186298,0.18924,0.212455,0.189945,0.156087,0.151639,0.179264,0.213632,0.227464,0.213857,0.179547,0.189137,0.208603,0.188919,0.163093,0.13531,0.127253,0.12517,0.109194,0.110453,0.130264,0.144003,0.150775,0.138049,0.134937
0.151095,0.161721,0.15935,0.154397,0.181137,0.2124,0.195548,0.169448,0.161289,0.187282,0.220511,0.239938,0.230317,0.195421,0.207339,0.227604,0.198648,0.167439,0.138595,0.117564,0.117257,0.107191,0.103731,0.123933,0.144384,0.158984,0.139416,0.124765
0.12807,0.131461,0.121004,0.12888,0.166239,0.202903,0.199224,0.172459,0.159757,0.193814,0.214024,0.220526,0.233112,0.211808,0.204022,0.2132,0.182187,0.149713,0.135464,0.120137,0.12126,0.113474,0.098411,0.105427,0.134787,0.159889,0.138526,0.110961
0.10866,0.113965,0.109396,0.126628,0.155466,0.197105,0.204745,0.172428,0.160706,0.202406,0.207022,0.183566,0.20781,0.217247,0.196955,0.174295,0.142675,0.124704,0.133472,0.132456,0.126829,0.114959,0.093341,0.087277,0.121662,0.152099,0.137503,0.109466
0.097716,0.110429,0.119466,0.136628,0.145093,0.181961,0.187665,0.156084,0.157482,0.195428,0.18832,0.149821,0.167774,0.195081,0.176845,0.130628,0.107409,0.111046,0.125845,0.128108,0.117698,0.106163,0.093798,0.083849,0.111094,0.139529,0.132316,0.108684
0.083856,0.10685,0.13441,0.147811,0.139528,0.15949,0.154451,0.131643,0.143289,0.162619,0.148604,0.12045,0.1278,0.14753,0.142338,0.100539,0.084337,0.104179,0.117878,0.114144,0.098836,0.094958,0.099801,0.084063,0.101752,0.129284,0.122145,0.103867
0.07917,0.108076,0.146151,0.151302,0.131358,0.138657,0.134136,0.111444,0.115712,0.124935,0.109286,0.095886,0.100367,0.108739,0.114693,0.092201,0.083892,0.100784,0.106222,0.101035,0.08433,0.084043,0.099305,0.081165,0.090071,0.114443,0.106447,0.090808
0.078731,0.109782,0.140873,0.139806,0.114809,0.105306,0.107888,0.093706,0.097657,0.111865,0.096763,0.085963,0.094835,0.105437,0.102702,0.085041,0.089012,0.095184,0.087327,0.09025,0.081163,0.080008,0.094332,0.083561,0.08289,0.086261,0.08148,0.076135
0.074362,0.10686,0.121808,0.114096,0.100567,0.083989,0.086151,0.08376,0.092348,0.102628,0.088166,0.073064,0.080576,0.102464,0.095401,0.073667,0.08196,0.082814,0.070317,0.082428,0.081695,0.076827,0.088898,0.089864,0.079618,0.064837,0.071364,0.081222
0.063444,0.088459,0.09403,0.082461,0.08131,0.074891,0.075045,0.080299,0.094515,0.09438,0.08121,0.062768,0.060421,0.089147,0.085282,0.062493,0.073936,0.07351,0.061094,0.076191,0.076891,0.065992,0.080318,0.093337,0.077758,0.058158,0.073152,0.09332
0.058581,0.064563,0.063737,0.055446,0.065675,0.074072,0.069036,0.077799,0.098623,0.095063,0.082087,0.061631,0.04816,0.068528,0.073716,0.060524,0.069144,0.067203,0.053028,0.060417,0.06273,0.05358,0.066004,0.083123,0.076189,0.066786,0.079003,0.093893
0.066681,0.051096,0.046372,0.042957,0.061648,0.082414,0.070449,0.069923,0.088617,0.09327,0.083652,0.062095,0.047492,0.060849,0.070531,0.060923,0.063279,0.058929,0.044352,0.048493,0.052919,0.048038,0.05353,0.067551,0.08241,0.085178,0.083509,0.086346
0.085861,0.057589,0.046087,0.045262,0.065946,0.092983,0.078173,0.059002,0.0676,0.079995,0.079234,0.063343,0.054229,0.063542,0.068339,0.060463,0.067306,0.060999,0.043727,0.049242,0.051409,0.043578,0.043118,0.059635,0.095499,0.102222,0.091371,0.08984
0.09754,0.062393,0.04591,0.049768,0.069852,0.094407,0.080962,0.053295,0.058061,0.069935,0.076876,0.068781,0.059763,0.06664,0.062919,0.056098,0.066829,0.060701,0.047649,0.051529,0.050984,0.045211,0.042502,0.064456,0.10876,0.109123,0.095846,0.097888
0.09264,0.065104,0.051557,0.052724,0.062924,0.078575,0.075121,0.056862,0.058215,0.065646,0.0765,0.072226,0.058419,0.064599,0.062221,0.052396,0.054953,0.050212,0.048443,0.050626,0.047349,0.044959,0.03845,0.059884,0.10282,0.09945,0.088209,0.089824
0.074885,0.063861,0.059998,0.053774,0.046354,0.051196,0.058124,0.055628,0.053901,0.064508,0.076635,0.065307,0.049958,0.060835,0.065647,0.051047,0.042437,0.034908,0.042929,0.049961,0.046075,0.04112,0.028978,0.044584,0.076522,0.077036,0.071077,0.065436
0.058362,0.05668,0.059236,0.04922,0.035272,0.033546,0.042646,0.049556,0.048705,0.066871,0.070241,0.052843,0.047794,0.059608,0.059938,0.044277,0.034296,0.025951,0.034137,0.044703,0.045857,0.038572,0.023504,0.03197,0.047445,0.054535,0.054214,0.04302
0.043122,0.042311,0.045623,0.039568,0.032838,0.032459,0.038844,0.043856,0.045221,0.065007,0.058838,0.044273,0.048991,0.054734,0.046104,0.032539,0.027272,0.023675,0.028286,0.035064,0.044461,0.043161,0.02751,0.026114,0.031603,0.040948,0.040308,0.030467
0.028186,0.025775,0.026976,0.029889,0.034895,0.033385,0.033726,0.035334,0.039398,0.054854,0.049549,0.039686,0.04385,0.043433,0.035533,0.02878,0.024279,0.023826,0.024283,0.028431,0.046506,0.048757,0.030568,0.021414,0.02284,0.028874,0.031066,0.027108
0.026197,0.021242,0.015902,0.021327,0.036106,0.034298,0.026293,0.025432,0.030981,0.038112,0.037231,0.032498,0.032103,0.029569,0.028604,0.029849,0.024119,0.024703,0.023405,0.024709,0.045036,0.047085,0.0276,0.016316,0.017718,0.022373,0.026442,0.023938
0.025909,0.020294,0.011927,0.015519,0.032598,0.033959,0.020837,0.019494,0.025179,0.024499,0.02794,0.028854,0.024475,0.02231,0.026536,0.027059,0.022399,0.025728,0.02116,0.018802,0.037333,0.037165,0.019695,0.010424,0.013226,0.021167,0.024483,0.017753
0.020852,0.017811,0.011628,0.013059,0.025913,0.028897,0.01909,0.018593,0.023089,0.021967,0.024849,0.028143,0.025949,0.019919,0.021882,0.020003,0.017507,0.023842,0.019617,0.016145,0.02814,0.025125,0.012389,0.007889,0.014023,0.02208,0.019692,0.012361
