-0.00034,-0.000232,-0.000191,-8.5e-05,-0.000179,-0.000386,-0.000323,-0.00019,-0.000253,-0.000194,-0.00024,-0.000169,-0.000138,-2.4e-05,-1.2e-05,-0.000105,-0.000105,-0.00011,-0.000185,-0.000136,-0.000182,-6.1e-05,-5.9e-05,-0.000135,-0.000183,-0.000112,-0.000159,-0.000139
-0.000348,-0.000216,-0.000161,-0.000148,-0.000278,-0.00048,-0.00038,-0.000171,-0.000377,-0.00032,-0.000305,-0.000243,-0.000166,-5.1e-05,-6.1e-05,-9.9e-05,-0.000201,-0.000223,-0.000317,-0.00029,-0.000295,-0.000163,-0.000145,-0.000244,-0.000235,-0.000188,-0.000264,-0.000194
-6.2e-05,-0.000105,-0.000112,-9e-05,-0.000102,-0.000101,-0.000149,-0.000161,-0.000221,-0.000214,-0.000116,-0.00013,-0.000111,-5.6e-05,-0.000104,-0.000203,-0.000244,-0.000182,-0.000223,-2e-04,-0.00016,-0.000225,-0.000182,-0.000174,-0.000162,-0.000217,-0.00017,-0.000128
0.000238,0.000102,0.000102,0.000111,0.000182,0.000285,0.000183,3.1e-05,0.000129,6.4e-05,0.000162,0.000112,2.1e-05,-3e-06,-1.2e-05,-6.1e-05,-8.4e-05,-5.3e-05,3e-06,1.7e-05,0.000137,-3.7e-05,-1e-05,4.1e-05,6.7e-05,-1.3e-05,4.9e-05,3.7e-05
0.000142,0.000103,0.000134,0.000157,0.000177,0.000164,0.000179,0.000154,0.000224,0.000155,0.000184,0.000193,5.8e-05,1.8e-05,4e-05,6.6e-05,1.3e-05,-5.1e-05,7.3e-05,0.00011,0.000227,6.3e-05,9.4e-05,0.000121,0.000145,0.000128,0.000107,0.000102
-0.000241,-0.000171,-0.000143,-4.3e-05,-0.000185,-0.000357,-0.000219,-7.5e-05,-0.000106,-4.5e-05,-7.5e-05,-1.3e-05,-6.5e-05,-3.9e-05,-7.3e-05,-0.000102,-0.000135,-0.00022,-0.000116,-5.5e-05,-4.5e-05,-5.3e-05,0,-4.9e-05,-4.5e-05,-2.3e-05,-5.9e-05,-4.4e-05
-0.000233,-0.000119,-0.000102,-9.9e-05,-0.000291,-0.00041,-0.000318,-0.000199,-0.000266,-0.000119,-0.000151,-0.000137,-8.8e-05,-3.3e-05,-7.6e-05,-6.1e-05,-0.000156,-0.000202,-9.4e-05,-0.000115,-0.000196,-9.4e-05,-7.2e-05,-0.000126,-0.000142,-0.000124,-9.3e-05,-8.6e-05
0.000102,0.000139,0.000104,-4e-06,-1.7e-05,0.000101,2.1e-05,-7.2e-05,-0.000125,-2.4e-05,-3.2e-05,-8.8e-05,2.9e-05,4.9e-05,2.6e-05,7e-05,-2.9e-05,9e-06,0.000118,1.1e-05,-9.6e-05,-5.2e-05,-0.000103,-5.7e-05,-1.2e-05,-4.8e-05,2.9e-05,4e-06
0.00021,0.000132,8.9e-05,-1.2e-05,0.000137,0.000393,0.00027,-1e-06,7e-06,4.2e-05,3.2e-05,-3.9e-05,5.5e-05,5.2e-05,3.8e-05,7e-06,8.2e-05,0.000151,0.000117,4.1e-05,-1.6e-05,-3.8e-05,-0.000114,-2.5e-05,8.4e-05,2.7e-05,6.7e-05,4.8e-05
2.2e-05,-2.2e-05,2.3e-05,-7.3e-05,4.2e-05,0.00019,0.000237,4.9e-05,9.5e-05,6.2e-05,7e-06,-7e-06,1.9e-05,-5e-06,3.4e-05,5e-05,0.000189,0.000189,-8e-06,-4.2e-05,-2.4e-05,-5.3e-05,-6.2e-05,-2e-05,3.1e-05,8.8e-05,5.2e-05,6.5e-05
-0.00019,-0.000185,-0.000136,-0.000162,-0.000104,-0.000169,-1.4e-05,7.7e-05,8.7e-05,2.2e-05,-3.4e-05,-2e-05,-2.5e-05,-7.1e-05,-2e-05,9.9e-05,0.000195,0.000141,-0.000115,-0.000128,-4.7e-05,-3.2e-05,7e-06,-2.9e-05,-7.1e-05,7.6e-05,1e-06,-2e-06
-0.000156,-0.00014,-0.000206,-0.000177,-0.000175,-0.000283,-0.000202,-1e-06,-2.8e-05,-1.9e-05,3e-06,-8.1e-05,-5.8e-05,-9.7e-05,-0.000125,-1.9e-05,6.7e-05,6.8e-05,-0.000115,-0.000117,-6.3e-05,-1.4e-05,4e-05,-1.5e-05,-0.000127,-4.6e-05,-5.9e-05,-6.6e-05
8.7e-05,0.000122,-2e-06,-6.9e-05,-9.5e-05,-1.4e-05,-7e-05,-3.5e-05,-5.4e-05,-1.2e-05,4.8e-05,-8.3e-05,-2.8e-05,-7.3e-05,-0.000139,-6.6e-05,-8.4e-05,-3.1e-05,1e-06,-2.7e-05,-5.4e-05,3.9e-05,5.6e-05,3.8e-05,-3.4e-05,-6.9e-05,-3.5e-05,-2e-06
0.000148,0.000155,0.000109,4e-06,4.6e-05,0.000251,0.000115,6e-06,1.4e-05,-4e-05,-6e-05,-8.1e-05,-3e-05,-8.4e-05,-9.4e-05,-7e-05,-0.000168,-0.000123,8.2e-05,6.3e-05,1.8e-05,0.000154,5.8e-05,4.7e-05,8.9e-05,-5.2e-05,-5e-05,-2.6e-05
-4.6e-05,-8.2e-05,-2.6e-05,-4e-05,-9e-06,8.3e-05,2.4e-05,2e-06,1.3e-05,-1e-04,-0.000162,-0.000107,-9.9e-05,-0.000129,-9.7e-05,-0.000134,-0.000162,-0.000173,-1.2e-05,3.7e-05,2.9e-05,0.000117,-8e-06,-4.8e-05,4.2e-05,-9.5e-05,-0.000106,-0.000145
-8.1e-05,-0.000134,-4.9e-05,-7.6e-05,-0.000106,-0.000195,-0.000127,5e-05,6e-05,-3.1e-05,-5.1e-05,2e-06,-6e-05,-8.7e-05,-4.8e-05,-2.2e-05,-2.4e-05,-8.9e-05,-4.4e-05,-6e-06,3.6e-05,8.8e-05,3.4e-05,-6.6e-05,-1.7e-05,-1.4e-05,-3e-05,-9e-05
4e-06,-7.6e-05,-4e-05,-5.3e-05,-5.1e-05,-0.000205,-0.000119,0.000122,8.8e-05,3.1e-05,7.9e-05,9.3e-05,3.1e-05,-2.6e-05,-1.4e-05,7.5e-05,5.8e-05,-3.3e-05,-7.1e-05,-5.6e-05,5.9e-05,6.5e-05,7.1e-05,-9e-06,-5.2e-05,1.3e-05,6.8e-05,1.4e-05
6.7e-05,2.9e-05,-5.6e-05,-5.8e-05,-5e-05,-4.9e-05,-1.3e-05,5.1e-05,0,-1.1e-05,5.1e-05,4.6e-05,1.9e-05,-3.5e-05,-4.7e-05,-5e-06,2.7e-05,-3.4e-05,-0.000126,-0.00011,-5e-06,-8.5e-05,-1.1e-05,3.3e-05,-8.6e-05,-7.3e-05,5.3e-05,4.2e-05
7.2e-05,0.000134,5.2e-05,-4.5e-05,-0.000105,9.7e-05,9.5e-05,-6.9e-05,-6.3e-05,-7.9e-05,-9.1e-05,-7e-06,2e-05,-2.4e-05,-1.4e-05,-1.5e-05,3e-06,-1.6e-05,-9.5e-05,-0.000107,-0.000113,-0.000139,-3.7e-05,2.1e-05,-2.9e-05,-2.9e-05,-4e-06,3.9e-05
