0.002243,0.001503,0.002926,0.001824,0.001974,0.00225,0.001139,0.001318,0.002138,0.001359,0.000463,0.000896,0.001286,0.001417,0.001578,0.001356,0.00095,0.000749,0.000432,0.001602,0.001117,0.000972,0.000836,0.001369,0.00073,0.001421,0.000822,0.00056,0.001044,0.000924,0.00163,0.001115,0.001154,0.00328,0.00163,0.001153,0.000495,0.000972,0.000906,0.001319,0.00124,0.000798,0.000798,0.000505,0.00129,0.001466,0.001419,0.001141,0.000611,0.00113,0.000937,0.00045,8e-04,0.001,0.001765,0.001404,0.001737,0.001122,0.000745,0.000438,0.001922,0.00155,0.000687,0.000899,0.000981,0.001104,0.0011,0.00071,0.001179,0.001491,0.001053,0.000842,0.000917,0.000549,0.00042,0.000267,0.000306,0.000521,0.000957,0.000745,0.00029,0.000496,0.000286,0.000866,0.000835,0.000628,0.000527,0.000814,0.000533,0.001247,0.001285,0.000993,0.000612,0.000464,0.000723,0.001092,0.001371,0.001243,0.001084,0.001258,0.000578,0.001188,0.000646,0.000285,0.000707,0.000695,0.000739,0.000326,0.000859,0.000734,0.000748,0.001237,0.00087,0.000545,0.000444,0.000545,0.000517,0.000668,0.000728,0.000355,0.000141
2.7e-05,0.000402,0.001192,0.000687,0.001066,-0.000791,-0.000556,-0.000795,-0.000989,-0.000441,-0.000403,-0.000461,-0.000447,-0.000766,0.000115,0.000458,-3.5e-05,3.4e-05,8.4e-05,-0.000112,0.00053,0.000282,-0.000699,0.00026,-2.8e-05,0.000203,0.000213,-0.000409,-0.000545,0.00016,-0.000217,0.000218,4.8e-05,0.00058,0.000185,-0.000493,-0.000612,-0.000285,-0.000671,-0.000193,0.00016,0.000247,-0.000681,-0.000129,-0.000888,0.000164,-0.000352,-0.000314,-0.000224,-0.001015,-0.000682,-0.000233,2e-04,0.000194,4.4e-05,0.000297,-1.4e-05,0.000145,-0.000363,-0.000113,0.000144,0.000439,0.000177,0.000165,0.000195,0.000387,-0.000332,-8.8e-05,0.000585,0.00057,0.000427,0.000586,-0.000131,-4.4e-05,6.4e-05,-0.000131,3.2e-05,-0.000281,0.000195,6.3e-05,-0.000105,-0.000463,-0.00015,-8.1e-05,4e-05,3.5e-05,-0.000431,-0.000127,-9.1e-05,0.000137,0.000682,0.000307,0.000111,1.2e-05,-0.000288,0.000454,-0.000162,-0.000457,6.3e-05,8.3e-05,7e-05,-9.5e-05,-0.000152,-2e-04,4.6e-05,-0.00029,1.3e-05,3.5e-05,0.000222,0.000182,-4.2e-05,0.000659,0.000385,0.000198,3.3e-05,0.000202,-2.9e-05,8.4e-05,5.4e-05,-3.1e-05,-5.8e-05
-0.000169,-0.000109,-0.000195,-3.8e-05,0.000317,-0.001019,0.000451,-0.000231,-0.001534,-0.001193,-0.000685,-0.001057,-0.000911,-0.000742,-0.000559,-0.000199,0.000303,0.000487,2.9e-05,-0.000849,-0.000544,-0.000435,-0.000382,-5.5e-05,-0.000114,-0.000185,0.00013,-0.000113,-0.00045,-0.000143,0.000344,5.9e-05,-0.000289,-0.000447,-7e-04,-0.000521,-3.5e-05,0.000208,1.7e-05,-0.00018,-0.00041,5.4e-05,-0.000193,-0.000259,-4.3e-05,0.000248,-0.000935,-0.000474,-0.000367,-0.000368,-0.000428,-0.000236,-0.000174,-0.000102,0.000654,0.000213,-0.000974,-0.000261,-0.000386,-3.2e-05,-0.000638,0.00021,5.1e-05,-2.5e-05,-0.000178,-0.000159,-0.000281,-0.000151,5.7e-05,-4.4e-05,0.000168,0.000399,-1.9e-05,-4.6e-05,1.9e-05,-0.00024,6.8e-05,-8.2e-05,-0.000309,7e-05,-0.00013,-5.7e-05,7.3e-05,1e-05,1.7e-05,-0.000128,-0.00018,-0.000172,-7.2e-05,-0.000228,0.000388,0.000176,0.000254,-0.000217,-0.000481,0.000327,-0.000678,-0.000635,-0.000205,-0.000246,-0.000139,-0.000576,-0.000336,-0.00027,-0.000185,-0.000553,-5.8e-05,5.8e-05,0.000203,1.9e-05,-0.000375,0.000343,0.000105,0.000306,-0.000113,9.6e-05,9.5e-05,-1.4e-05,-0.000184,-8.1e-05,-8.8e-05
0.000995,-7.1e-05,-0.000632,-0.000458,0.000409,-0.000739,-0.000982,0.000127,-0.000698,-3.6e-05,0.000625,-3.9e-05,-3.3e-05,-0.000759,-0.000427,-0.00056,0.000133,0.000385,0.000114,-0.000841,-0.000652,0.000429,0.000656,0.000168,-8.9e-05,-0.000471,-0.000474,9.8e-05,-0.000353,-8.8e-05,-0.000649,-0.000133,-0.00033,-0.000273,-0.001355,9.3e-05,-0.000362,-0.000326,0.000416,8.5e-05,-0.000591,-3.3e-05,-6.6e-05,-0.000376,-6.5e-05,6.3e-05,-0.00065,0.000102,3.3e-05,0.000438,-1.6e-05,-5e-05,-5.8e-05,-0.000402,0.000386,-1e-04,-0.001136,-0.000531,-0.000339,-0.000163,-0.000888,-2e-06,-7e-05,-0.000255,-0.000105,-0.00051,7.3e-05,0.000176,-4.4e-05,-0.00028,6.4e-05,0.000199,9.5e-05,7.9e-05,1.7e-05,-8.7e-05,-0.000135,0.000162,-0.000135,-0.000111,-0.000272,-0.000156,7.8e-05,-0.000343,-0.000311,-0.000197,-0.000151,-0.000228,-0.000343,-0.000531,0.000172,-0.000168,-9e-06,-0.000327,-0.00025,-0.000128,-0.000409,-8.4e-05,-0.000377,-0.000349,-0.000364,-0.000342,-0.000342,-0.000128,-0.00014,-8.1e-05,0.000135,0.00013,0.000184,-0.00019,-0.000285,0.00016,-4e-05,0.000194,5.1e-05,-0.00019,-9.2e-05,8.2e-05,-0.000313,-0.000132,-4.3e-05
-0.001043,-0.000835,-0.000703,-0.000864,0.000461,-0.00045,-0.000644,0.000483,2.3e-05,0.000501,0.000127,0.000169,0.000137,-2.2e-05,-0.000586,-0.000699,-0.00036,-0.000465,-0.000341,-0.000182,-0.00079,-0.000602,0.000135,-0.000296,-0.000342,-0.000499,-0.000509,2.3e-05,0.000178,0.000145,-0.00081,-0.000741,-0.000377,0.000319,-0.000224,-0.000111,0.000343,-0.000693,-0.00023,9.3e-05,-0.000437,0.000159,-7.5e-05,-6.8e-05,-0.000187,-0.000389,-0.000442,0.000252,0.000422,0.000488,0.000641,0.000318,-2.5e-05,0.000137,-0.000428,-0.000554,-0.000549,-0.000706,0.000161,0.000288,-0.000428,0.000204,0.000138,-4e-06,5e-06,-0.000469,-7.7e-05,0.000119,-0.000125,-0.00039,-5.9e-05,5e-05,-9.1e-05,-8.8e-05,-3e-05,8.8e-05,-0.000163,3.5e-05,-1e-05,1e-05,-7.8e-05,-0.00018,-7e-05,0,-0.000528,-0.000437,-0.000167,-7.9e-05,-5.9e-05,-0.000454,0.000188,-0.000287,-0.000139,4.1e-05,-0.000122,-0.000216,-0.000251,0.000289,-0.000143,-0.000324,-0.000209,-0.000114,-0.000134,2.5e-05,-0.000212,0.000144,0.000212,8.9e-05,1.5e-05,-0.000248,-7.5e-05,-0.000138,-0.000171,-3e-06,0.000157,-0.000201,-0.000255,0.000146,-0.000178,-0.000108,3.3e-05
-0.000881,-0.000697,-0.000353,-0.000902,-0.000219,-0.000429,-2.8e-05,1.8e-05,0.000361,0.000263,-7e-05,0.000197,0.00046,9.6e-05,-0.000345,-0.000295,-0.000191,-0.000216,-0.000312,-0.000248,-0.000376,-0.000257,-0.000284,-0.000431,-0.000319,8.2e-05,-0.000407,-0.000375,-7.2e-05,0.000515,-6.2e-05,-0.000499,-0.000147,-0.00028,-4.1e-05,-0.00022,0.000375,0.00032,3e-05,0.000449,3.4e-05,0.000158,0.000186,0.000241,0.000156,-0.000473,-0.00024,-8.4e-05,0.000205,-7e-06,0.000505,0.000299,6.4e-05,0.000335,-0.000241,-0.000724,-0.000251,-0.000292,-0.000128,0.000361,0.000243,0.000221,-0.000118,0.000228,0.000389,-0.000301,2.3e-05,-0.000129,-0.000135,-0.000361,-0.000296,-0.000213,-2.3e-05,-0.000122,-5e-06,2.7e-05,1e-04,1e-05,0.000138,-0.000171,9e-05,0.000186,7.3e-05,4.6e-05,-0.000361,-0.000365,-0.000181,0.000359,0.000473,-9e-06,0.000136,-0.000272,-0.000137,9.9e-05,3.3e-05,-4.8e-05,-0.000232,9.6e-05,0.000155,-0.000113,-3.3e-05,-6.5e-05,0.000132,2e-04,-8.1e-05,4.2e-05,-4.2e-05,-6.3e-05,-4e-05,-0.00017,1.1e-05,-0.000226,-0.00025,-0.000121,7.6e-05,-3.2e-05,-9e-05,-3e-06,-3.7e-05,-6.2e-05,-2.6e-05
-0.000711,-0.000286,-6.8e-05,-0.000413,-0.00014,1.6e-05,-3.9e-05,0.000262,-6.6e-05,-0.000402,-0.000336,-0.000275,-0.000118,9.7e-05,0.000112,-7.6e-05,-0.000318,-8.7e-05,-0.000103,-0.000107,0.000191,4.5e-05,0.000335,8.2e-05,1.9e-05,0.000225,-3e-06,-4.3e-05,-6.9e-05,0.000173,0.000148,-3e-05,-0.000274,-0.000625,-0.000327,-0.000104,0.000161,7.7e-05,7e-06,-0.000536,-0.000125,3e-05,-1.3e-05,2.7e-05,0.000142,-0.000294,0.000138,-0.000357,3.6e-05,-0.00016,-0.000275,-0.000137,-0.000127,5.9e-05,-0.000334,-0.000166,-2.2e-05,2.8e-05,9.4e-05,-5e-05,-0.000193,-8.8e-05,-0.000407,-0.000198,-0.000183,-0.000216,5.8e-05,-5.7e-05,-0.000183,-0.000332,-0.000406,-0.000331,-0.000229,-0.000113,6.5e-05,6.3e-05,0.000113,0.000168,1.2e-05,-0.00032,-6.6e-05,0.000102,0.000122,-0.000196,-2e-05,-3.6e-05,-0.000141,5.1e-05,0.000251,-4.3e-05,-9.4e-05,-0.000229,-0.000236,8.2e-05,0.000146,4.4e-05,-8.8e-05,-0.00032,-9.9e-05,-1.9e-05,-1.3e-05,-3e-06,0.000251,4.3e-05,7e-05,4.1e-05,-6.5e-05,-2.9e-05,-1.1e-05,-5.4e-05,0.00011,-0.000173,-0.000313,-0.00018,7.8e-05,4.5e-05,-0.000174,-0.000236,-0.000114,-7.9e-05,8e-06
-4.9e-05,-0.000263,-4.7e-05,0.00018,-0.000296,0.00018,-2.7e-05,0.000283,-0.00046,-0.000474,-7.9e-05,-0.000138,-0.000561,-8e-06,0.000248,0.00028,-7.6e-05,-0.000271,-9.1e-05,-4.1e-05,0.000349,0.00021,-8.8e-05,0.000133,3.7e-05,9.2e-05,4.2e-05,-0.000123,5e-05,0.000126,0.00011,2.1e-05,-0.000195,-0.000261,-0.000242,0.000292,3.7e-05,-0.000141,-0.000541,-0.000409,-4.6e-05,-0.000127,-1e-04,-7.1e-05,4.5e-05,1.2e-05,-2.3e-05,-0.000276,-0.000294,-0.000276,-0.000127,-4.3e-05,-0.000152,-0.000112,-0.000204,-8.3e-05,2.8e-05,-1e-05,0.000274,-7.1e-05,-0.000175,-0.000237,-0.000322,-0.000263,-0.000282,-0.000111,-7.9e-05,-0.000176,-0.000175,-0.000156,-0.000181,-0.000266,-0.000144,-5.4e-05,3.2e-05,7.6e-05,1.8e-05,7.4e-05,-0.000155,-0.000267,-7.6e-05,-3.9e-05,-0.000185,-0.000112,-8.2e-05,-1.7e-05,-5.7e-05,-0.000148,-1e-04,1e-06,-0.000292,-0.000208,-0.000188,1.2e-05,-2.4e-05,2e-05,5.3e-05,-0.000424,-4.9e-05,0.000119,-6.8e-05,-0.000158,-5.3e-05,-3e-05,8.5e-05,-4e-06,6.9e-05,1e-06,-3.6e-05,-7.5e-05,2e-04,-4.1e-05,-0.00034,-0.00015,3.3e-05,-3.7e-05,-0.000126,-0.000129,-0.000137,-0.000137,1.3e-05
-0.000726,-0.000397,0.000128,1.7e-05,-0.000489,-0.000117,0.000893,5.6e-05,-0.000193,-0.000305,0.000301,0.000176,-0.000101,-0.000195,0.000421,0.00023,8.9e-05,-0.000123,-0.000178,0.000229,0.000246,0.000178,-0.000111,-0.000218,9.3e-05,-3.2e-05,3e-05,-0.000105,2.3e-05,-0.000358,-0.000158,-5e-05,0.000102,-7.9e-05,-0.000237,0.000487,-0.000131,-6.6e-05,-6.6e-05,1.8e-05,-0.000235,-0.000368,-0.000128,-0.000186,8e-06,0.000194,3.4e-05,-0.000219,-8.2e-05,-5e-06,0.000205,9.9e-05,-8.4e-05,-0.000137,4.1e-05,-0.000307,0.000294,0.000177,0.000135,-0.000223,-0.00019,-0.000383,-0.00026,-0.000167,-0.000198,-3e-06,-8.4e-05,-0.000176,3e-05,3.3e-05,-8.5e-05,-0.00013,-0.000156,-8.9e-05,7.1e-05,1.9e-05,-3.2e-05,4.3e-05,-9.7e-05,-5e-06,0.000103,-4e-05,-0.000173,3.6e-05,5.4e-05,8e-05,0.000154,-6.7e-05,-7.2e-05,0.000117,-0.00027,-0.00026,-6e-05,4.7e-05,1.3e-05,0.000158,2.9e-05,-0.000225,3.6e-05,0.000222,-9.6e-05,-0.000166,-0.000136,-8.5e-05,0,-5.5e-05,0.000115,6.2e-05,-2.4e-05,-9.5e-05,9.6e-05,5.7e-05,-0.00018,-0.000107,0.000102,-4.1e-05,3.4e-05,-5.9e-05,-6.8e-05,-2.6e-05,3.8e-05
-2.7e-05,0.000366,0.000347,0.000162,-0.000369,2e-06,0.000225,-7.3e-05,-1.4e-05,1.2e-05,-5.3e-05,2.6e-05,-7.9e-05,8e-05,0.000153,4.2e-05,7.8e-05,-0.000108,4.3e-05,-2.1e-05,5.8e-05,0.000147,-0.000353,-0.000177,0.000189,8.2e-05,0.000104,0.000202,0.000115,-0.000274,-0.000183,4e-05,0.000322,-3e-05,0.000114,0.000435,0.000152,-0.000126,0.000154,-9.7e-05,-0.000189,-0.000128,4.4e-05,-0.00013,-9.3e-05,0.000108,0.00015,2.5e-05,0.00019,2.6e-05,0.000122,9e-06,3.8e-05,0,0.000103,6e-05,0.000246,0.000143,-0.000139,1.6e-05,-0.000225,-0.000144,-2e-04,-4.7e-05,-0.000171,-1.4e-05,-6.1e-05,-0.000112,2.2e-05,3e-06,2.5e-05,-0.000122,-0.000203,-5.3e-05,0.000149,1.5e-05,-5.2e-05,-3e-06,7e-06,6.3e-05,5.7e-05,-1.4e-05,7.5e-05,-7.7e-05,-3.3e-05,0.000111,0.000108,-4.7e-05,2e-06,-5.9e-05,-0.000201,-0.000169,3.7e-05,-4.1e-05,-8e-06,0.00013,2.9e-05,-8.9e-05,3.3e-05,2.3e-05,-1.8e-05,-0.000152,-3.6e-05,-9.5e-05,-5.3e-05,-7.5e-05,3.6e-05,2.5e-05,0,-3e-05,1.2e-05,6.9e-05,-4.2e-05,-4e-05,-1.8e-05,-3.6e-05,5.8e-05,-9.5e-05,-4e-05,5.7e-05,5.1e-05
-0.000204,0.000322,5.9e-05,-9e-05,-0.000179,5e-05,-0.000146,-0.000301,8.9e-05,8.7e-05,-0.00033,-8.4e-05,0.00018,9e-05,-0.000199,-7.1e-05,0.000131,-3.5e-05,-1.1e-05,1.3e-05,-5.4e-05,0.000125,6.3e-05,-2.5e-05,0.00021,5.7e-05,-3.5e-05,2e-04,3.4e-05,0.000206,-0.000118,-6e-06,0.000103,0.000159,0.000138,-7.1e-05,-8e-06,-4.1e-05,5.4e-05,-0.000213,1.5e-05,-0.000104,8.1e-05,5.5e-05,-1.2e-05,-4.7e-05,0.000233,0.00019,-1.8e-05,1.7e-05,-0.000106,0,0.000115,-3.2e-05,-4.6e-05,5.4e-05,6.2e-05,0.000102,-0.000198,7.5e-05,-6.7e-05,7.5e-05,2e-05,2.2e-05,-6.8e-05,-0.000244,-7.8e-05,-3.9e-05,4.4e-05,-2.4e-05,4.1e-05,-5.9e-05,-0.000125,-6.4e-05,0.000153,3.3e-05,-1.2e-05,-5e-05,-9e-05,7.5e-05,6.8e-05,-5.1e-05,4.2e-05,-6.7e-05,-0.000156,4.5e-05,-1.4e-05,-7.3e-05,-2e-05,-0.000173,1.4e-05,-7.5e-05,1.9e-05,-9.7e-05,-1e-05,-5.7e-05,5.2e-05,-2.3e-05,6.8e-05,-0.00011,4.2e-05,-9.4e-05,1.1e-05,1.1e-05,-7.2e-05,-0.000104,-2.4e-05,-1.5e-05,-7.5e-05,-1.8e-05,3.9e-05,7.5e-05,-2.4e-05,-4.5e-05,-6.2e-05,-1e-05,3.8e-05,1.6e-05,-2.5e-05,3e-05,-4.5e-05
-2.1e-05,0.000135,0.000135,-3e-05,3.9e-05,0.000207,-0.000148,-0.000284,-0.000291,2.3e-05,-0.000238,-9.3e-05,-2.2e-05,3.8e-05,-0.000118,5e-05,3.3e-05,5e-05,3e-06,3.9e-05,0.000131,-3.3e-05,-3e-06,-4.3e-05,-1.7e-05,-0.00014,-0.000108,0.000216,1.7e-05,-3.3e-05,4.6e-05,-9e-06,-6.1e-05,4.9e-05,-0.000141,-0.000376,-0.00018,-0.000125,6.3e-05,-5.7e-05,0.000138,9e-06,4.9e-05,3e-06,0.000125,-0.000104,-0.000105,0.000164,-0.000197,-7.5e-05,-8e-06,-1.5e-05,-2.7e-05,-3.4e-05,-0.000139,5e-06,-5.2e-05,-8.8e-05,-2e-04,-0.000157,1.1e-05,-1e-06,-1.5e-05,-4.4e-05,-7e-05,-0.000125,-9.7e-05,3.8e-05,-3.5e-05,-3e-06,3.7e-05,-5.4e-05,-4.6e-05,-2.3e-05,-4.7e-05,-5e-06,-3.1e-05,-6e-05,-7.9e-05,-1.7e-05,-5e-05,-5.6e-05,5.1e-05,-7e-06,3.8e-05,1e-05,4.4e-05,-0.00011,5.9e-05,-5.5e-05,7.8e-05,-4.9e-05,-3.3e-05,-1.3e-05,6e-06,-8.2e-05,-9.6e-05,8.3e-05,7.5e-05,-4.7e-05,-4.7e-05,5.3e-05,-2.2e-05,0.000108,1.3e-05,-3.1e-05,-7.4e-05,-8e-06,-9.2e-05,-3e-05,3.9e-05,-1.5e-05,-5e-05,-3.5e-05,-4.4e-05,-7.4e-05,-5e-06,7.2e-05,2.8e-05,-1e-05,-4.7e-05
0.00017,-9.8e-05,0.000159,-2.3e-05,0.000141,0.00011,1.5e-05,5.9e-05,0.000277,6e-05,-9e-06,-1.2e-05,0,8e-06,2e-05,1.4e-05,-8.8e-05,1e-05,2.8e-05,4.8e-05,8.6e-05,-5.8e-05,0.000175,4.3e-05,-0.000192,-0.000152,-5.5e-05,0.000137,-2.5e-05,-8.3e-05,4e-06,1.6e-05,0.000116,6.6e-05,-4.6e-05,-0.000313,0.000121,5.5e-05,1.2e-05,1.3e-05,-9.6e-05,6.3e-05,1.8e-05,3e-06,1.9e-05,-8.4e-05,-0.00014,0.000107,-6e-05,-0.000135,-3.5e-05,1.6e-05,-9.1e-05,-6e-05,-0.000149,4.7e-05,5e-05,-2.1e-05,-0.000113,-5e-06,3.3e-05,-8e-06,-6e-06,-4.3e-05,-5.9e-05,6.9e-05,-1.1e-05,7.2e-05,-3.7e-05,2.5e-05,3.7e-05,-4e-06,3.1e-05,-5e-06,-7.3e-05,-2.7e-05,-3.2e-05,-1.1e-05,4.9e-05,-7.5e-05,-2.8e-05,-5.7e-05,8e-06,-6e-05,2.6e-05,1.3e-05,2.1e-05,-1.7e-05,-1.5e-05,4.9e-05,3e-05,1.9e-05,-3.3e-05,-0.000105,1.7e-05,-2.9e-05,-7.2e-05,0.000131,0.000106,1.3e-05,-2.9e-05,0.000102,-4.2e-05,9.9e-05,6.5e-05,7e-06,-6.9e-05,-1.9e-05,-4.3e-05,-2.7e-05,3e-06,-7.1e-05,3.4e-05,-6e-06,-6.7e-05,-9e-06,-1.6e-05,1.5e-05,2e-06,-1.4e-05,-4.1e-05
7.9e-05,6.8e-05,3.2e-05,6.4e-05,8.4e-05,7.4e-05,-4.8e-05,0.000224,6.9e-05,-2e-06,0.000135,6e-05,5.6e-05,1.2e-05,0.000101,-0.00014,-5.5e-05,1e-06,-1.2e-05,-8.6e-05,2e-06,-0.000103,9.3e-05,-1e-06,3.3e-05,-9.5e-05,4.8e-05,4.6e-05,-5.1e-05,-3e-06,0.000105,-1.4e-05,-3.8e-05,5.3e-05,9.2e-05,-7e-05,0.000152,6.7e-05,-0.000141,-9.7e-05,-6.3e-05,-5e-06,-1.1e-05,4.1e-05,-2.3e-05,3e-06,9.6e-05,1.7e-05,-1e-05,-1.1e-05,-7.3e-05,-3.6e-05,-2.3e-05,3.1e-05,-3e-06,-4.8e-05,8.8e-05,3.5e-05,3.7e-05,6.5e-05,-5.3e-05,2.8e-05,-3e-06,2e-05,-3.3e-05,3.5e-05,1.7e-05,4.9e-05,2.5e-05,2.7e-05,-2.7e-05,2.4e-05,1.4e-05,-1.5e-05,-1.1e-05,-9e-06,-2e-06,1.4e-05,9e-06,-5.9e-05,-4.9e-05,-2.9e-05,-4.5e-05,-7.3e-05,-1.2e-05,2.9e-05,-2.8e-05,3.4e-05,-2.8e-05,-3e-06,7.4e-05,-2e-06,-3.6e-05,-0.000141,3e-05,2e-05,1.4e-05,5.2e-05,4.1e-05,6.5e-05,2.6e-05,3.6e-05,-9e-06,-1.4e-05,1.9e-05,-1.2e-05,-3.9e-05,5e-06,1.4e-05,-1.2e-05,-1.5e-05,-3.4e-05,8e-06,2e-05,-2.9e-05,-2e-05,-3.6e-05,6.4e-05,-7e-06,3e-06,-1.7e-05
-6.3e-05,0.000187,-8.8e-05,-3.2e-05,6.1e-05,4.2e-05,-0.000195,6.1e-05,-4.8e-05,2.2e-05,0.000156,2e-06,4.6e-05,-1.9e-05,5.6e-05,-1.1e-05,9e-06,-1.4e-05,-3e-06,-5.7e-05,-4.3e-05,-5.6e-05,6.5e-05,1e-06,0.000119,-3.6e-05,2.6e-05,-4.2e-05,-3.9e-05,0.000108,-4.2e-05,2.1e-05,-5.2e-05,4.4e-05,-2.3e-05,3.6e-05,0.000119,-6.5e-05,-4e-06,3.7e-05,5e-05,3.2e-05,-1.9e-05,4.1e-05,6e-06,5.5e-05,1.6e-05,-7e-06,1.4e-05,2e-05,-4.8e-05,5e-06,-4e-06,-5e-06,3.9e-05,-7.8e-05,-0.000113,1.7e-05,6e-05,-3.4e-05,-8.8e-05,-1.1e-05,-1.3e-05,1.8e-05,-1.2e-05,-1.2e-05,8e-06,3.7e-05,6.7e-05,5e-06,-2.7e-05,8e-06,1.6e-05,-5e-06,-1.7e-05,1.8e-05,1e-06,5e-06,-1.1e-05,2.5e-05,-4e-06,3e-06,-7e-06,5.7e-05,-1.2e-05,3.6e-05,-2.2e-05,4.6e-05,-1.4e-05,-2.2e-05,1.7e-05,-1.2e-05,-2e-06,-2.2e-05,1.8e-05,1.8e-05,2e-06,2e-06,2.1e-05,-2.1e-05,6e-06,4e-06,-7e-06,5e-06,1.4e-05,2e-06,-5e-06,1.1e-05,-2.4e-05,-9e-06,-8e-06,-1.7e-05,-4.1e-05,-6e-06,-2.4e-05,-8e-06,-4e-06,4.8e-05,0,8e-06,1.7e-05
-0.000112,0.000139,-5.8e-05,-2.2e-05,-4.1e-05,1.8e-05,-1.6e-05,6.9e-05,2.9e-05,-3.1e-05,8.2e-05,-3e-06,-4.1e-05,-1.2e-05,-6.3e-05,3.5e-05,4.4e-05,-3.2e-05,1.1e-05,1.3e-05,0,3.5e-05,-3.9e-05,-3e-06,8e-06,-6.7e-05,-3.5e-05,-5.7e-05,-1.9e-05,5.6e-05,-5.3e-05,1.4e-05,4.8e-05,-5.3e-05,-6e-05,-2e-05,9.2e-05,-2.9e-05,-2.7e-05,8e-05,4.6e-05,1.6e-05,-1.4e-05,3.2e-05,-4e-06,3.5e-05,-2e-06,-7.8e-05,1.7e-05,-1.2e-05,2.1e-05,-2e-06,3e-06,0,5.7e-05,4.5e-05,-5.2e-05,-2.3e-05,1.4e-05,-0.000132,5e-06,-3.6e-05,-1.5e-05,-6e-06,1.8e-05,-1e-05,-1.9e-05,-5e-06,4.5e-05,-3.1e-05,-1.9e-05,5e-06,1e-05,-1.1e-05,-1.1e-05,2e-06,-3e-06,-4e-06,0,1.5e-05,-6e-06,-1.1e-05,-1.8e-05,3.4e-05,-3.4e-05,3.9e-05,1.6e-05,2.3e-05,-8e-06,-1.1e-05,-7e-05,-1.2e-05,6e-06,2.1e-05,2.4e-05,-1.3e-05,-6e-06,-2.4e-05,-5e-06,-1.8e-05,-2.3e-05,8e-06,-2e-06,1.1e-05,-1.4e-05,-4e-06,1.1e-05,0,-1.6e-05,2e-06,-1.5e-05,1.4e-05,-7.3e-05,-1e-05,3e-06,-7e-06,1.9e-05,-6e-06,-7e-06,-2e-06,7e-06
-6.5e-05,2.2e-05,1.7e-05,-2e-05,-6.7e-05,6e-06,-6.2e-05,2.9e-05,-4.5e-05,-1.6e-05,-4.4e-05,-1.4e-05,-5e-06,-4e-06,-4.7e-05,1.5e-05,2.8e-05,6e-06,-8e-06,-1.5e-05,2.4e-05,-1.8e-05,-3.4e-05,1.3e-05,-8e-06,-1.8e-05,-4e-05,-1e-06,-1.3e-05,-3e-05,4e-06,1.1e-05,3.7e-05,-2.7e-05,1.4e-05,-6.3e-05,-3.8e-05,-1.1e-05,4.4e-05,0,-4.1e-05,-3.2e-05,-6e-06,1.3e-05,0,-1.1e-05,2.2e-05,-1.7e-05,5.5e-05,9e-06,7e-06,-4e-06,0,2.7e-05,-1e-05,1.6e-05,3.8e-05,-1.7e-05,3e-06,-1.4e-05,-8e-06,-1.4e-05,-6.4e-05,-5e-06,-8e-06,-2.6e-05,1e-06,-2.3e-05,-1.4e-05,-7e-06,1.9e-05,-2.5e-05,6e-06,-1e-05,-3.1e-05,-1e-06,3e-06,-6e-06,4e-06,2.2e-05,-1e-06,7e-06,-2.7e-05,-3.1e-05,2e-06,5e-06,1.6e-05,1.4e-05,-1.1e-05,-1.8e-05,-7.8e-05,-4.2e-05,1.6e-05,-4e-06,2.3e-05,-1.1e-05,-3e-06,-5e-05,4e-06,-2.5e-05,-2.3e-05,-1.1e-05,-2.2e-05,-1.6e-05,-1.6e-05,-9e-06,1.2e-05,1e-06,4e-06,-5e-06,-1.5e-05,1.3e-05,-4e-05,-1.4e-05,1.1e-05,-7e-06,2.1e-05,-2.5e-05,-1e-05,-1e-06,1e-06
-6.2e-05,-1e-05,3.3e-05,-2e-05,-5.1e-05,1.2e-05,-0.00012,-8e-06,-8e-06,1.2e-05,-7.5e-05,7e-06,-1.9e-05,-8e-06,-2.6e-05,-2.7e-05,1e-05,-8e-06,5e-06,-6.2e-05,2.1e-05,-1.1e-05,-5.7e-05,-1.7e-05,-4.4e-05,-5e-06,4e-06,4.3e-05,-1e-05,-8e-06,3.7e-05,-3e-06,1.6e-05,2.6e-05,3e-05,-7.6e-05,-4.1e-05,2.9e-05,2.6e-05,-4.6e-05,-2.1e-05,-2.1e-05,-5e-06,1.8e-05,-7e-06,-4.2e-05,-3.2e-05,-2e-06,6.7e-05,1e-05,-2.9e-05,0,3e-06,1.1e-05,-3.4e-05,0,-2.8e-05,1.4e-05,2.9e-05,-1e-06,-5.2e-05,-1.6e-05,-3.3e-05,8e-06,-4e-06,-4e-06,-3e-06,-1.6e-05,4e-06,1.5e-05,6e-06,-2.5e-05,-8e-06,-1e-05,-2.2e-05,3e-06,-6e-06,3e-06,3e-06,2.5e-05,-3e-06,2e-06,9e-06,-1.3e-05,1.3e-05,7e-06,-2e-06,2.4e-05,-3.7e-05,-1e-05,-1.9e-05,-2.6e-05,1e-06,1e-06,1.3e-05,-7e-06,-1e-05,-3.6e-05,3e-06,1e-06,-1e-05,-9e-06,-1.4e-05,-3.2e-05,5e-06,6e-06,0,-6e-06,8e-06,-7e-06,-9e-06,-4e-06,0,-1.5e-05,1.8e-05,0,-3e-06,-4e-06,-7e-06,6e-06,1e-06
8.3e-05,6.7e-05,-3.8e-05,1.2e-05,-3.9e-05,3e-06,-8.3e-05,4e-06,-1e-05,8e-06,-3.8e-05,-1.5e-05,2.3e-05,0,2.2e-05,-2.1e-05,-2e-05,0,8e-06,1.2e-05,-9e-06,-2.8e-05,-1.7e-05,4e-06,-2.1e-05,8e-06,2.3e-05,4.4e-05,-5e-06,-2.4e-05,5e-06,6e-06,-1.2e-05,-8e-06,-2.1e-05,-5.7e-05,-4.4e-05,-3.1e-05,-2e-06,-1.6e-05,1.1e-05,-2.1e-05,5e-06,6e-06,-5e-06,-2.7e-05,2.4e-05,4.4e-05,-4e-06,2e-06,2.3e-05,3e-06,1.5e-05,-1.1e-05,-4.3e-05,1.1e-05,-4.8e-05,4e-06,2.6e-05,5e-06,-3.5e-05,1e-06,-1.7e-05,-1e-06,-1.2e-05,-5e-06,-1e-06,-1.6e-05,3e-06,5e-06,1.5e-05,-1.7e-05,-2e-05,-9e-06,-8e-06,-2e-06,2e-06,6e-06,-1.5e-05,1e-06,-1e-05,1.1e-05,1.5e-05,1.6e-05,-2e-06,1.2e-05,-4e-06,-2e-06,-4e-06,2e-06,5e-06,-1.9e-05,-1.1e-05,2.5e-05,1.5e-05,-4e-06,-1.7e-05,-6e-06,-7e-06,8e-06,9e-06,-1.1e-05,1.3e-05,-2.2e-05,5e-06,-8e-06,-1e-06,-6e-06,5e-06,-7e-06,-1.3e-05,-1.4e-05,-9e-06,-7e-06,2.3e-05,-1e-06,-1e-05,-5e-06,-3e-06,4e-06,0
-1.8e-05,5.1e-05,-1.2e-05,0,-1e-05,9e-06,2.2e-05,-9e-06,-1.6e-05,1.3e-05,1.1e-05,-2e-06,-1.1e-05,-5e-06,3.5e-05,-1e-06,-2.5e-05,5e-06,-8e-06,-4e-06,-2.3e-05,-2.6e-05,-1.5e-05,-6e-06,1.7e-05,-3e-06,2e-06,2.4e-05,-7e-06,3.4e-05,-2.8e-05,-4e-06,-1.8e-05,1e-06,-1.9e-05,1.8e-05,-6.8e-05,-3.2e-05,2e-05,1.1e-05,3e-06,-1.4e-05,5e-06,8e-06,-3e-06,8e-06,1.3e-05,4.1e-05,-3.5e-05,-6e-06,2.1e-05,6e-06,-7e-06,-4e-06,-1.1e-05,-3e-05,-1.5e-05,-1e-05,2.2e-05,-6e-06,5e-06,1e-05,-5e-06,-1.4e-05,-1.5e-05,6e-06,-5e-06,2e-06,-1.1e-05,-1e-06,-1e-06,3e-06,-1.1e-05,-7e-06,-1.3e-05,0,5e-06,4e-06,-9e-06,-3.2e-05,-6e-06,0,1.8e-05,-1.1e-05,-5e-06,1.4e-05,-2e-06,-1.3e-05,2e-05,1e-05,7e-06,-1.4e-05,-1.8e-05,2e-05,9e-06,5e-06,8e-06,1.6e-05,6e-06,8e-06,-8e-06,-4e-06,-1e-06,0,-3e-06,-5e-06,1e-06,3e-06,-5e-06,-3e-06,-1.1e-05,-1.7e-05,-8e-06,3e-06,1.6e-05,-5e-06,-6e-06,-2e-06,-2e-06,-5e-06,2e-06
-9e-06,1.3e-05,1e-06,-2e-06,3.4e-05,4e-06,1.3e-05,-3.9e-05,9e-06,1.4e-05,2e-05,1e-05,3e-06,-1e-06,-7e-06,0,-9e-06,-6e-06,8e-06,-3.4e-05,-1.5e-05,1.8e-05,1.1e-05,-8e-06,-1e-05,-7e-06,-1.3e-05,-7e-06,-4e-06,-1.3e-05,-1.7e-05,1.3e-05,1.1e-05,2.2e-05,2e-06,8.9e-05,-4.1e-05,5e-06,-2.3e-05,-3.7e-05,8e-06,4e-06,2e-06,6e-06,0,2.7e-05,-2.8e-05,3.1e-05,-5e-06,-9e-06,0,-3e-06,-1.4e-05,3e-06,2e-05,-1e-06,-4e-06,-3e-06,7e-06,1.4e-05,-1.5e-05,3e-06,-4e-06,-4e-06,-1.3e-05,0,-6e-06,1.6e-05,8e-06,1e-06,-1e-05,1.3e-05,-1e-05,-6e-06,-1.7e-05,3e-06,-4e-06,1e-06,1.2e-05,-1.5e-05,-3e-06,-1e-06,1e-05,-1.8e-05,-1.7e-05,1.8e-05,-5e-06,-1.1e-05,3e-06,-1.5e-05,2.7e-05,-9e-06,-9e-06,-3e-06,7e-06,1.2e-05,-6e-06,2.5e-05,-4e-06,-4e-06,-1.7e-05,5e-06,-1e-05,-4e-06,-5e-06,-4e-06,6e-06,3e-06,-2e-06,-3e-06,-3e-06,1e-06,-5e-06,7e-06,5e-06,-4e-06,-3e-06,2e-05,-5e-06,-3e-06,1e-05
-1e-06,-1e-05,-1.2e-05,-1.9e-05,2.7e-05,1e-06,-3.2e-05,-3.9e-05,1.6e-05,1.5e-05,0,-4e-06,1.7e-05,-4e-06,-2e-05,2.2e-05,1.1e-05,8e-06,-1e-06,-4e-06,1e-05,2e-06,2e-05,7e-06,-2e-06,7e-06,-4e-06,-2.9e-05,-2e-06,-4.1e-05,9e-06,0,-1e-06,-8e-06,7e-06,7.9e-05,-1.2e-05,0,-1.5e-05,-1.8e-05,-1.1e-05,1.2e-05,-1e-06,4e-06,3e-06,1.7e-05,1.5e-05,-8e-06,-7e-06,-1e-06,-7e-06,2e-06,-5e-06,-1e-06,2.7e-05,2.1e-05,-2.4e-05,2e-06,-1.9e-05,2.6e-05,-3.4e-05,0,0,4e-06,-1.7e-05,-2.5e-05,-2e-06,1.4e-05,8e-06,-1e-06,-8e-06,9e-06,1e-06,-5e-06,8e-06,-2e-06,-2e-06,-1e-06,-3e-06,4e-06,0,-3e-06,-1.7e-05,9e-06,-7e-06,1e-05,-3e-06,1e-06,-1.2e-05,-1.5e-05,2.8e-05,-1e-05,3e-06,4e-06,8e-06,2e-06,-9e-06,2.2e-05,2e-06,-8e-06,-2e-06,5e-06,-6e-06,9e-06,-3e-06,-8e-06,6e-06,4e-06,-2e-06,-4e-06,-2e-06,6e-06,-1e-05,2e-06,6e-06,-1e-06,3e-06,1.5e-05,-2e-06,4e-06,3e-06
-4.4e-05,4e-05,-9e-06,-3e-06,2.3e-05,-2e-06,-8e-06,-2.7e-05,-1e-05,-5e-06,-2.1e-05,-2e-06,-1e-06,-2e-06,-2e-05,1e-06,1.6e-05,-7e-06,-3e-06,3e-06,1.1e-05,1e-05,2.6e-05,0,7e-06,1.3e-05,1e-06,-3.3e-05,0,5e-06,2e-05,1e-06,-1.1e-05,-6e-06,-5e-06,2.1e-05,-1e-06,7e-06,-7e-06,2.6e-05,-1.4e-05,4e-06,-3e-06,1e-05,-1e-06,-8e-06,1.4e-05,-2e-05,-2.5e-05,-4e-06,2.3e-05,2e-06,7e-06,-8e-06,7e-06,-1.3e-05,-3.1e-05,4e-06,-2.7e-05,4e-06,-5e-06,6e-06,-1e-05,3e-06,-1e-06,-1.7e-05,-4e-06,1.4e-05,8e-06,-4e-06,-5e-06,-2e-06,3e-06,-4e-06,2.1e-05,-1e-06,-1e-06,-3e-06,-1.1e-05,1.6e-05,3e-06,-4e-06,-5e-06,4e-06,1e-05,0,3e-06,-4e-06,4e-06,5e-06,4e-06,-1e-05,8e-06,6e-06,2e-06,-9e-06,8e-06,1e-05,-9e-06,-5e-06,4e-06,7e-06,1e-06,3e-06,3e-06,-2e-06,3e-06,0,-3e-06,-3e-06,-1e-06,9e-06,-2.4e-05,-4e-06,-7e-06,0,4e-06,-2e-06,-2e-06,4e-06,0
1.4e-05,4e-05,1e-06,-2e-06,1.2e-05,-3e-06,3e-05,-5e-06,-1e-05,-1e-06,-1.7e-05,-2e-06,-3e-06,-2e-06,2e-06,-1.7e-05,1.2e-05,-4e-06,5e-06,-1e-05,-8e-06,6e-06,1.3e-05,-4e-06,3e-06,2e-06,-4e-06,-2.6e-05,1e-06,3e-05,-2e-06,-1e-06,1.5e-05,5e-06,-1.4e-05,-2.2e-05,2e-06,-2.2e-05,4e-06,5e-06,0,1.4e-05,-2e-06,1.1e-05,-2e-06,-2.1e-05,-6e-06,-2.8e-05,-9e-06,0,1e-06,0,5e-06,0,-2e-05,-1e-06,0,-5e-06,-1.4e-05,-2.1e-05,-9e-06,-3e-06,-1.9e-05,-4e-06,-5e-06,1.2e-05,-1e-06,5e-06,-5e-06,2e-06,6e-06,-1.1e-05,4e-06,-3e-06,8e-06,1e-06,0,-1e-06,7e-06,1e-05,0,-5e-06,-3e-06,-1.3e-05,-1e-06,6e-06,2e-06,-6e-06,1.7e-05,6e-06,-8e-06,-1e-05,7e-06,-1.4e-05,4e-06,-7e-06,-1e-05,-4e-06,-1e-06,7e-06,-6e-06,5e-06,4e-06,-4e-06,4e-06,-2e-06,-3e-06,-4e-06,-3e-06,-3e-06,2e-06,4e-06,-2e-05,-7e-06,-1e-05,-4e-06,5e-06,1e-06,-4e-06,-2e-06,-4e-06
-1.3e-05,-5e-06,1e-06,6e-06,-1.8e-05,-3e-06,1.1e-05,2.3e-05,2.5e-05,-2e-06,7e-06,2e-06,-1e-06,-1e-06,2.4e-05,-9e-06,-3e-06,-3e-06,-1e-06,-1.4e-05,-1.8e-05,-8e-06,-2e-06,3e-06,-2.2e-05,-1.2e-05,0,-8e-06,2e-06,1e-05,-1.2e-05,1e-06,3e-06,-4e-06,1e-06,-2.5e-05,2.2e-05,5e-06,1e-05,-1.8e-05,2.2e-05,-2e-06,-1e-06,7e-06,1e-06,-1.3e-05,-8e-06,-1.7e-05,7e-06,-1e-06,-1.5e-05,-2e-06,-6e-06,4e-06,-2.3e-05,7e-06,3e-06,-3e-06,-7e-06,-1e-05,-2e-05,-1.1e-05,-1.6e-05,-1e-06,-1e-06,3e-06,-1e-06,-6e-06,-5e-06,3e-06,2e-06,-1.1e-05,2e-06,-4e-06,-3e-06,-1e-06,1e-06,0,4e-06,5e-06,1e-06,-7e-06,-8e-06,-1e-06,-7e-06,1e-06,-3e-06,4e-06,2e-06,-8e-06,-2.4e-05,-1.1e-05,-2e-06,-1.2e-05,1e-06,6e-06,-4e-06,-1.5e-05,-3e-06,3e-06,-1.2e-05,-1e-06,-7e-06,-5e-06,-2e-06,-4e-06,-5e-06,-2e-06,1e-06,-1e-06,3e-06,-7e-06,-7e-06,-5e-06,-9e-06,-2e-06,-1e-06,-1e-06,-3e-06,0,-7e-06
-9e-06,-2.8e-05,0,1e-06,-2.2e-05,-6e-06,-3e-06,2.3e-05,-2.4e-05,-2e-06,3.1e-05,-1e-06,-6e-06,0,4e-06,1.7e-05,-1.4e-05,-3e-06,0,4e-06,-4e-06,6e-06,-1.1e-05,-1e-06,-1.2e-05,-3e-06,5e-06,6e-06,1e-06,-2.2e-05,-9e-06,1e-06,-1.1e-05,-6e-06,1.1e-05,-1e-06,1.3e-05,3e-06,1e-05,2e-06,-1.2e-05,-3e-06,0,3e-06,0,5e-06,8e-06,6e-06,1.2e-05,-1e-06,-2e-06,0,0,2e-06,-9e-06,-9e-06,-1.6e-05,3e-06,-2e-06,1.1e-05,-1.7e-05,1e-06,-1.7e-05,3e-06,-2e-06,-1.3e-05,0,-7e-06,3e-06,-1e-06,7e-06,-3e-06,-2e-06,-3e-06,5e-06,-2e-06,-2e-06,0,-4e-06,-7e-06,-1e-06,-4e-06,4e-06,7e-06,-8e-06,6e-06,-2e-06,8e-06,-1.3e-05,-6e-06,-1.9e-05,-1.2e-05,-8e-06,-2e-06,0,7e-06,1e-06,-1.5e-05,-6e-06,1e-06,-2e-06,-2e-06,-7e-06,-5e-06,-1e-06,0,-4e-06,0,0,-3e-06,3e-06,-5e-06,-3e-06,-1e-06,-1.1e-05,-1e-06,-5e-06,-1e-05,-2e-06,2e-06,0
-1.2e-05,-1e-06,-7e-06,-6e-06,-1.4e-05,-4e-06,2.1e-05,1.3e-05,4e-06,5e-06,2.5e-05,-1e-06,7e-06,-1e-06,-5e-06,1e-05,-1.1e-05,6e-06,4e-06,0,8e-06,-1e-06,-1.9e-05,-2e-06,8e-06,3e-06,1e-06,9e-06,1e-06,6e-06,1e-05,1e-06,-3e-06,6e-06,-7e-06,2.1e-05,1.3e-05,-7e-06,-4e-06,1.3e-05,-1.7e-05,-6e-06,1e-06,5e-06,0,1.5e-05,-3e-06,1.7e-05,0,0,4e-06,3e-06,3e-06,-3e-06,1.5e-05,8e-06,-1.2e-05,2e-06,1e-06,-1.2e-05,-3e-06,-3e-06,-1.2e-05,0,-2e-06,-7e-06,0,-8e-06,-1e-06,-1e-06,-3e-06,4e-06,-1e-06,-3e-06,5e-06,1e-06,-1e-06,-1e-06,-2e-06,-1.1e-05,-1e-06,-3e-06,6e-06,-5e-06,-5e-06,3e-06,-1e-06,4e-06,-2e-06,3e-06,-5e-06,-1.1e-05,-8e-06,-1e-05,0,-1e-06,-2e-06,-7e-06,0,-4e-06,3e-06,1e-06,-1e-06,-4e-06,-2e-06,-2e-06,-1e-06,2e-06,-1e-06,-2e-06,4e-06,-3e-06,-9e-06,2e-06,-3e-06,1e-06,-3e-06,-4e-06,-2e-06,1e-06,-1e-06
4e-06,2.9e-05,6e-06,-4e-06,-1.2e-05,-4e-06,1.5e-05,1e-05,2e-06,2e-06,-1e-06,3e-06,-6e-06,1e-06,-1e-05,-1.2e-05,-2e-06,0,-2e-06,-9e-06,6e-06,2e-06,-9e-06,4e-06,1.7e-05,-5e-06,-7e-06,3e-06,0,1e-05,4e-06,-1e-06,1e-06,3e-06,-1.2e-05,1.5e-05,-6e-06,-1e-06,-1e-06,-9e-06,5e-06,-9e-06,1e-06,3e-06,0,9e-06,2e-06,2.2e-05,1e-06,0,-1.1e-05,-4e-06,-1e-06,0,1.7e-05,1e-06,7e-06,-2e-06,2e-06,-1.3e-05,-1.1e-05,4e-06,-5e-06,-4e-06,-1e-06,-2e-06,-2e-06,-4e-06,5e-06,0,-1e-06,7e-06,-4e-06,-3e-06,9e-06,0,2e-06,-1e-06,1e-06,-6e-06,0,-1e-06,8e-06,-5e-06,4e-06,0,-1e-06,-2e-06,1e-05,-1e-06,7e-06,-8e-06,-3e-06,-1.1e-05,-1e-06,-4e-06,-4e-06,1e-06,-3e-06,-2e-06,-4e-06,-3e-06,3e-06,-1e-05,0,-2e-06,1e-06,3e-06,-1e-06,-2e-06,4e-06,3e-06,-9e-06,2e-06,-4e-06,-1e-06,0,4e-06,-2e-06,-1e-06,1e-06
-7e-06,4e-06,4e-06,-1e-06,6e-06,-3e-06,-7e-06,2e-06,-9e-06,5e-06,-2e-05,-3e-06,1e-06,-1e-06,-7e-06,-3e-06,1.1e-05,1e-06,1e-06,-5e-06,-4e-06,4e-06,-6e-06,-2e-06,0,-8e-06,-7e-06,-7e-06,0,3e-06,1e-06,-1e-06,1e-06,-6e-06,6e-06,-1.4e-05,-1e-05,-6e-06,-8e-06,-1.4e-05,1.3e-05,-2e-06,1e-06,0,0,-4e-06,3e-06,7e-06,1.5e-05,-1e-06,-1e-05,1e-06,-3e-06,3e-06,7e-06,-1.3e-05,6e-06,-2e-06,3e-06,7e-06,-2e-05,-1e-06,-4e-06,-1e-06,-6e-06,-3e-06,0,4e-06,-1e-06,1e-06,-5e-06,1e-06,-3e-06,-2e-06,-1e-06,-1e-06,0,0,3e-06,6e-06,0,-1e-06,6e-06,7e-06,0,-1e-06,-1e-06,2e-06,0,-5e-06,9e-06,-8e-06,5e-06,2e-06,0,-1e-06,1e-06,9e-06,2e-06,1e-06,-8e-06,1e-06,-3e-06,3e-06,2e-06,0,1e-06,-1e-06,1e-06,-1e-06,2e-06,5e-06,-4e-06,0,5e-06,-2e-06,3e-06,1e-06,-2e-06,0,1e-06
4e-06,-2.1e-05,-5e-06,2e-06,1.5e-05,-3e-06,-1.5e-05,-5e-06,1e-05,3e-06,-2.2e-05,0,5e-06,0,1.1e-05,1e-06,1e-05,-2e-06,2e-06,8e-06,-7e-06,-2e-06,7e-06,-2e-06,-8e-06,-4e-06,4e-06,-1.4e-05,0,-8e-06,-8e-06,1e-06,-2e-06,3e-06,6e-06,-3.9e-05,-7e-06,8e-06,-3e-06,9e-06,-8e-06,0,0,1e-06,0,-1.2e-05,-7e-06,-5e-06,8e-06,1e-06,8e-06,1e-06,-1e-06,0,-1.3e-05,7e-06,-1.4e-05,1e-06,9e-06,1.1e-05,-6e-06,4e-06,-5e-06,2e-06,-1e-06,-7e-06,-1e-06,5e-06,-2e-06,0,-1e-06,-3e-06,-3e-06,-3e-06,-1e-06,0,-1e-06,1e-06,-4e-06,8e-06,0,0,-8e-06,0,-5e-06,-1e-06,0,2e-06,-9e-06,2e-06,1.2e-05,-7e-06,6e-06,4e-06,-1e-06,0,-1e-06,1.1e-05,-4e-06,1e-06,-3e-06,0,-6e-06,5e-06,-1e-06,-2e-06,1e-06,-1e-06,1e-06,-1e-06,2e-06,1e-06,-7e-06,-2e-06,5e-06,0,2e-06,1e-06,-2e-06,2e-06,-1e-06
0,-1.3e-05,0,2e-06,1.1e-05,-3e-06,9e-06,-6e-06,-9e-06,0,-6e-06,0,-2e-06,0,6e-06,4e-06,3e-06,-3e-06,-2e-06,-8e-06,-2e-06,0,5e-06,3e-06,-8e-06,3e-06,8e-06,-1.3e-05,0,-1.4e-05,-2e-06,0,-1e-06,1e-06,-8e-06,-3.5e-05,-6e-06,-9e-06,3e-06,5e-06,-6e-06,3e-06,0,0,0,-7e-06,3e-06,-1.8e-05,-9e-06,0,2e-06,-1e-06,3e-06,-3e-06,-1.6e-05,3e-06,-1e-06,1e-06,9e-06,-5e-06,-4e-06,-3e-06,-7e-06,0,-4e-06,-1e-06,0,7e-06,1e-06,0,2e-06,-5e-06,-1e-06,-2e-06,3e-06,0,0,1e-06,-3e-06,7e-06,-1e-06,0,-7e-06,-8e-06,-5e-06,-2e-06,0,-3e-06,-3e-06,3e-06,1.2e-05,-7e-06,3e-06,-3e-06,-2e-06,0,-6e-06,8e-06,1e-06,1e-06,2e-06,1e-06,-1e-06,6e-06,-1e-06,-1e-06,0,-2e-06,0,-1e-06,1e-06,-1e-06,-1.2e-05,-2e-06,7e-06,0,1e-06,5e-06,-2e-06,1e-06,-1e-06
-2e-05,1.2e-05,3e-06,-2e-06,8e-06,-2e-06,0,-1.1e-05,3e-06,-1e-06,8e-06,0,1e-06,-1e-06,0,1e-06,-6e-06,1e-06,2e-06,-4e-06,6e-06,-3e-06,1.2e-05,-1e-06,3e-06,-2e-06,-2e-06,-6e-06,0,7e-06,2e-06,1e-06,2e-06,-4e-06,-5e-06,-9e-06,2e-06,-1e-06,2e-06,-1.4e-05,1e-06,4e-06,0,1e-06,0,2e-06,7e-06,-1.6e-05,-6e-06,0,-5e-06,0,1e-06,0,-7e-06,-5e-06,1.2e-05,-1e-06,4e-06,-6e-06,-1.5e-05,3e-06,-8e-06,-2e-06,-2e-06,0,-1e-06,4e-06,-2e-06,0,1e-06,-2e-06,0,-2e-06,-4e-06,0,0,0,5e-06,-2e-06,0,0,-1e-06,2e-06,-4e-06,1e-06,-1e-06,-4e-06,7e-06,-6e-06,-1e-06,-8e-06,-4e-06,2e-06,-1e-06,1e-06,4e-06,1e-06,0,-1e-06,-3e-06,2e-06,2e-06,3e-06,0,-1e-06,0,-1e-06,0,-1e-06,0,-4e-06,-9e-06,-1e-06,6e-06,0,-1e-06,1e-06,-2e-06,0,1e-06
5e-06,5e-06,1e-06,-3e-06,-2e-06,-2e-06,-1.3e-05,-1.2e-05,1e-06,-1e-06,1.1e-05,1e-06,0,0,-4e-06,-1e-06,-1e-05,-1e-06,0,2e-06,6e-06,-1e-06,1e-06,-1e-06,9e-06,-3e-06,-8e-06,3e-06,0,9e-06,5e-06,0,-1e-06,2e-06,6e-06,1.6e-05,3e-06,2e-06,5e-06,0,1e-06,3e-06,-1e-06,1e-06,0,8e-06,-1.2e-05,-6e-06,0,-1e-06,1e-06,1e-06,-2e-06,2e-06,1e-05,6e-06,-3e-06,-1e-06,0,4e-06,-1.3e-05,-4e-06,-1.1e-05,0,-2e-06,-8e-06,0,-2e-06,1e-06,0,3e-06,2e-06,0,-2e-06,-8e-06,0,1e-06,0,0,-7e-06,-1e-06,-1e-06,-2e-06,5e-06,1e-06,-3e-06,-1e-06,-1e-06,2e-06,-2e-06,-1.2e-05,-7e-06,-6e-06,7e-06,-2e-06,2e-06,-3e-06,-5e-06,-1e-06,-1e-06,-8e-06,1e-06,0,2e-06,0,-2e-06,0,1e-06,0,-1e-06,0,-2e-06,-4e-06,0,4e-06,-2e-06,-2e-06,-4e-06,-2e-06,0,2e-06
-9e-06,-1.7e-05,0,-1e-06,-1e-05,-1e-06,-1.1e-05,-6e-06,-3e-06,0,3e-06,-1e-06,-2e-06,0,-7e-06,-5e-06,-5e-06,1e-06,-1e-06,-1e-06,-1e-06,-1e-06,4e-06,2e-06,-2e-06,-1e-06,-1e-06,9e-06,-1e-06,-3e-06,-1e-06,0,-4e-06,2e-06,1e-06,2.5e-05,1.5e-05,-2e-06,1e-06,1e-05,1e-06,0,0,0,0,6e-06,7e-06,6e-06,-5e-06,0,1e-05,0,-1e-06,-1e-06,1.4e-05,-5e-06,-7e-06,1e-06,-3e-06,2e-06,-3e-06,0,-1e-05,2e-06,-2e-06,-8e-06,0,-3e-06,-1e-06,0,-2e-06,3e-06,1e-06,-2e-06,-5e-06,0,0,0,-4e-06,-6e-06,0,-1e-06,3e-06,-5e-06,0,-2e-06,0,1e-06,-6e-06,4e-06,-9e-06,-7e-06,-5e-06,0,-2e-06,-1e-06,-2e-06,-7e-06,1e-06,0,-2e-06,0,-4e-06,2e-06,1e-06,-1e-06,1e-06,1e-06,0,0,-1e-06,1e-06,-4e-06,1e-06,0,0,-1e-06,-1e-06,-2e-06,1e-06,1e-06
2e-06,-1.4e-05,-1e-06,0,-1e-05,-1e-06,0,1e-06,0,-1e-06,-5e-06,1e-06,3e-06,0,3e-06,-2e-06,2e-06,0,2e-06,-6e-06,-5e-06,1e-06,-7e-06,-1e-06,1e-06,3e-06,5e-06,9e-06,-1e-06,-1.1e-05,-3e-06,0,1e-06,-3e-06,-6e-06,1.3e-05,4e-06,1e-06,-3e-06,-2e-06,0,0,0,-1e-06,0,-1e-06,-1e-06,1.5e-05,-8e-06,0,-1e-06,-1e-06,1e-06,-2e-06,6e-06,-3e-06,5e-06,1e-06,-5e-06,-4e-06,-8e-06,0,-8e-06,0,1e-06,2e-06,0,-4e-06,2e-06,0,0,1e-06,0,-2e-06,1e-06,0,-1e-06,0,2e-06,1e-06,0,-2e-06,4e-06,-2e-06,-4e-06,-4e-06,0,-1e-06,-3e-06,0,-7e-06,-7e-06,1e-06,-3e-06,-2e-06,-3e-06,1e-06,-6e-06,-1e-06,1e-06,2e-06,0,-3e-06,-3e-06,0,-1e-06,1e-06,0,0,-1e-06,-2e-06,2e-06,-7e-06,0,-1e-06,1e-06,1e-06,-1e-06,-2e-06,1e-06,1e-06
3e-06,7e-06,2e-06,2e-06,-6e-06,-1e-06,-4e-06,7e-06,-1e-06,1e-06,-3e-06,-1e-06,-2e-06,0,4e-06,8e-06,8e-06,-1e-06,0,0,-1e-06,0,-1e-06,-1e-06,1e-06,2e-06,2e-06,5e-06,0,6e-06,-2e-06,1e-06,3e-06,1e-06,-3e-06,-8e-06,7e-06,-7e-06,-2e-06,-9e-06,-5e-06,-2e-06,1e-06,0,0,-6e-06,-2e-06,1.2e-05,-1e-06,0,-3e-06,1e-06,1e-06,0,-8e-06,8e-06,7e-06,0,-4e-06,-5e-06,-1.5e-05,1e-06,-7e-06,-1e-06,-3e-06,1e-06,0,-3e-06,1e-06,0,-3e-06,-2e-06,0,-2e-06,-1e-06,0,1e-06,0,1e-06,5e-06,0,-2e-06,4e-06,5e-06,-4e-06,-3e-06,0,0,4e-06,-4e-06,-2e-06,-6e-06,5e-06,2e-06,-2e-06,0,-2e-06,-2e-06,3e-06,0,-3e-06,0,1e-06,1e-06,-1e-06,-1e-06,0,-1e-06,0,-1e-06,-1e-06,2e-06,-6e-06,0,-5e-06,0,2e-06,-3e-06,-2e-06,0,-2e-06
-6e-06,9e-06,0,-1e-06,0,0,-9e-06,1e-05,3e-06,1e-06,3e-06,0,0,1e-06,1e-06,0,7e-06,2e-06,0,0,4e-06,-1e-06,-7e-06,2e-06,0,-2e-06,-4e-06,0,0,1.1e-05,2e-06,0,-2e-06,2e-06,4e-06,-1.2e-05,-1e-06,6e-06,-3e-06,4e-06,-3e-06,-3e-06,0,-1e-06,0,-5e-06,1e-06,4e-06,9e-06,0,4e-06,0,-1e-06,2e-06,-1.4e-05,-4e-06,-6e-06,-1e-06,-3e-06,5e-06,-7e-06,0,-6e-06,0,0,-8e-06,0,1e-06,-3e-06,0,0,-4e-06,-1e-06,-2e-06,-3e-06,0,0,0,-1e-06,6e-06,0,-2e-06,3e-06,-1e-06,-2e-06,-3e-06,0,2e-06,3e-06,0,3e-06,-6e-06,4e-06,-1e-06,-1e-06,3e-06,-2e-06,3e-06,-2e-06,0,-6e-06,0,1e-06,-2e-06,0,0,0,-2e-06,0,-1e-06,-1e-06,-1e-06,-3e-06,-1e-06,-5e-06,-1e-06,1e-06,1e-06,-2e-06,0,-1e-06
-4e-06,-1e-05,-2e-06,-1e-06,7e-06,0,0,9e-06,-5e-06,1e-06,4e-06,0,2e-06,0,0,-6e-06,0,-1e-06,1e-06,-2e-06,4e-06,1e-06,2e-06,-1e-06,-4e-06,-1e-06,-1e-06,-4e-06,0,-6e-06,3e-06,0,-1e-06,-2e-06,1e-06,1e-06,-3e-06,-2e-06,1e-06,7e-06,6e-06,-1e-06,0,-2e-06,0,0,-1e-06,-8e-06,6e-06,0,3e-06,0,0,0,-6e-06,-2e-06,-6e-06,0,-3e-06,4e-06,-3e-06,0,-5e-06,1e-06,-2e-06,-6e-06,0,3e-06,2e-06,0,0,-1e-06,-1e-06,-2e-06,-2e-06,0,0,0,-1e-06,1e-06,0,-2e-06,-4e-06,-4e-06,0,-2e-06,0,2e-06,-3e-06,3e-06,9e-06,-6e-06,0,-5e-06,-2e-06,2e-06,0,6e-06,1e-06,-1e-06,-2e-06,1e-06,-3e-06,1e-06,0,-1e-06,-1e-06,0,0,0,-1e-06,-1e-06,-6e-06,-1e-06,-4e-06,0,0,3e-06,-2e-06,1e-06,-1e-06
0,-1.6e-05,2e-06,-1e-06,7e-06,0,3e-06,5e-06,4e-06,0,1e-06,0,-2e-06,0,-4e-06,-2e-06,-6e-06,0,0,-4e-06,0,-2e-06,-2e-06,-1e-06,-1e-06,2e-06,3e-06,-4e-06,0,-8e-06,0,0,2e-06,-1e-06,-5e-06,1.5e-05,-3e-06,-2e-06,3e-06,-9e-06,-1e-06,-1e-06,0,-2e-06,0,4e-06,-2e-06,-1.3e-05,-2e-06,0,-4e-06,0,1e-06,-1e-06,7e-06,5e-06,6e-06,1e-06,-2e-06,-4e-06,-1.2e-05,2e-06,-6e-06,0,-1e-06,0,0,4e-06,-1e-06,0,1e-06,2e-06,-1e-06,-2e-06,1e-06,0,0,0,1e-06,-3e-06,0,-1e-06,-7e-06,2e-06,-1e-06,-3e-06,0,0,-3e-06,-3e-06,8e-06,-6e-06,-5e-06,0,-1e-06,-2e-06,0,6e-06,0,1e-06,1e-06,0,-3e-06,1e-06,0,-1e-06,0,1e-06,0,-1e-06,0,-1e-06,-9e-06,0,-3e-06,1e-06,-1e-06,1e-06,-2e-06,1e-06,0
-3e-06,1e-06,0,1e-06,6e-06,1e-06,1e-06,1e-06,-2e-06,0,-3e-06,0,2e-06,0,0,5e-06,-7e-06,-1e-06,1e-06,2e-06,-3e-06,1e-06,5e-06,1e-06,4e-06,0,0,-1e-06,0,2e-06,-2e-06,0,0,2e-06,-2e-06,1.7e-05,-7e-06,0,2e-06,-4e-06,-4e-06,1e-06,0,-1e-06,0,5e-06,4e-06,-1.1e-05,1e-06,0,-3e-06,0,0,0,1.3e-05,-5e-06,1e-06,0,0,-2e-06,-1.2e-05,-3e-06,-7e-06,-1e-06,-1e-06,-1e-06,0,3e-06,1e-06,0,2e-06,3e-06,-1e-06,-1e-06,1e-06,0,0,0,2e-06,-6e-06,0,-1e-06,-2e-06,3e-06,-4e-06,-3e-06,0,0,2e-06,-2e-06,4e-06,-6e-06,-5e-06,1e-06,-1e-06,-2e-06,-3e-06,3e-06,0,0,-2e-06,1e-06,0,0,0,0,0,1e-06,0,-1e-06,0,0,-6e-06,0,0,0,-1e-06,0,-2e-06,0,1e-06
-2e-06,1.1e-05,-1e-06,1e-06,-1e-06,1e-06,-3e-06,-4e-06,-2e-06,0,-4e-06,-1e-06,0,0,1e-06,3e-06,-2e-06,-1e-06,0,-3e-06,-2e-06,1e-06,-2e-06,-1e-06,6e-06,-3e-06,-3e-06,2e-06,0,7e-06,-3e-06,0,-2e-06,-1e-06,4e-06,5e-06,0,-1e-06,1e-06,8e-06,0,1e-06,0,-1e-06,0,1e-06,-5e-06,0,4e-06,0,4e-06,0,-1e-06,1e-06,6e-06,2e-06,-9e-06,0,2e-06,5e-06,-3e-06,2e-06,-7e-06,0,-2e-06,-6e-06,0,0,1e-06,0,-1e-06,1e-06,0,-1e-06,1e-06,0,1e-06,0,-2e-06,-2e-06,0,-1e-06,1e-06,-4e-06,-4e-06,-4e-06,0,1e-06,3e-06,3e-06,-2e-06,-6e-06,-2e-06,-3e-06,-1e-06,1e-06,0,-1e-06,1e-06,1e-06,-6e-06,0,1e-06,0,0,-1e-06,0,0,0,-1e-06,0,1e-06,-3e-06,0,1e-06,-1e-06,0,1e-06,-1e-06,0,0
2e-06,-4e-06,0,-1e-06,-6e-06,1e-06,5e-06,-7e-06,4e-06,0,1e-06,0,-2e-06,0,-1e-06,-3e-06,5e-06,2e-06,0,-3e-06,1e-06,-1e-06,4e-06,0,-3e-06,-1e-06,0,5e-06,0,-1e-06,2e-06,-1e-06,0,-1e-06,0,-1.5e-05,-2e-06,3e-06,-2e-06,0,2e-06,1e-06,0,-1e-06,0,-3e-06,2e-06,8e-06,-3e-06,0,-1e-06,0,0,0,-6e-06,3e-06,-2e-06,0,4e-06,0,-6e-06,-3e-06,-7e-06,0,0,-4e-06,0,-3e-06,-2e-06,0,0,-2e-06,0,-1e-06,1e-06,0,0,0,-1e-06,3e-06,0,-1e-06,3e-06,-2e-06,-1e-06,-2e-06,0,-1e-06,-1e-06,0,-6e-06,-6e-06,3e-06,-1e-06,-1e-06,1e-06,0,-4e-06,-1e-06,-1e-06,-2e-06,0,-1e-06,-3e-06,0,-1e-06,0,-1e-06,0,-1e-06,0,0,-5e-06,0,5e-06,0,1e-06,-1e-06,-2e-06,1e-06,0
