0.108629,0.49779,0.822516,0.961839,0.977604,0.939635,1.025362,0.969435,0.875851,0.933411,0.957611,0.88593,0.801506,0.527578,0.267053,0.201132,0.167222,0.149252,0.130102,0.149531,0.176122,0.105588,0.049702,0.052466,0.047354,0.039856,0.028415,0.027164
0.12813,0.576011,0.944694,1.086617,1.104334,1.092358,1.176493,1.081438,0.979761,1.064665,1.132479,1.067975,0.924726,0.590187,0.309346,0.238826,0.196056,0.169917,0.149226,0.185381,0.229298,0.135303,0.056295,0.058745,0.053073,0.044969,0.033631,0.032716
0.154208,0.673915,1.094632,1.22084,1.260589,1.345837,1.421363,1.248065,1.140751,1.256451,1.409693,1.37294,1.106817,0.665742,0.368392,0.295425,0.238684,0.197228,0.174338,0.24641,0.328602,0.19037,0.064996,0.066257,0.059586,0.050876,0.041752,0.0415
0.159532,0.689064,1.102144,1.173803,1.304192,1.575881,1.631224,1.393043,1.285666,1.393876,1.632777,1.627431,1.199649,0.661132,0.384504,0.320441,0.257846,0.204264,0.180082,0.28652,0.409492,0.23652,0.067981,0.067514,0.059472,0.05014,0.045902,0.046633
0.142943,0.629574,0.995035,1.040509,1.369502,1.838855,1.867331,1.598451,1.487875,1.600963,1.893087,1.891794,1.286525,0.624923,0.367042,0.318573,0.261029,0.204365,0.175266,0.28785,0.426074,0.250726,0.068758,0.065594,0.056893,0.047089,0.046074,0.048038
0.139645,0.632748,0.957385,1.054868,1.67509,2.223032,2.190935,2.017927,1.962046,2.075059,2.335082,2.310034,1.560681,0.695966,0.386545,0.328022,0.271761,0.217683,0.176009,0.256771,0.361476,0.22224,0.072443,0.065314,0.060376,0.051777,0.049227,0.051245
0.166538,0.76153,1.120448,1.427626,2.516379,3.113809,2.943279,2.950057,3.011223,3.047762,3.204069,3.213743,2.359433,1.092835,0.546768,0.4152,0.357658,0.31253,0.241723,0.254431,0.280812,0.186338,0.095933,0.087834,0.085614,0.074126,0.066553,0.068831
0.223858,1.022989,1.514446,2.240812,4.113542,4.881364,4.554218,4.727868,4.879076,4.79192,4.918554,5.080572,3.931307,1.910602,0.934544,0.652882,0.566966,0.523063,0.403989,0.354804,0.316389,0.219522,0.15753,0.154137,0.147889,0.121359,0.104487,0.108303
0.295521,1.34373,2.033528,3.4665,6.605085,7.639898,7.042533,7.345098,7.580544,7.369913,7.517964,7.851219,6.107549,3.053852,1.552749,1.043561,0.86817,0.823021,0.666885,0.574433,0.497794,0.338784,0.255109,0.264958,0.243543,0.187322,0.1607,0.166962
0.369607,1.724591,2.689983,4.946523,9.650334,11.150506,10.195133,10.420916,10.703505,10.450714,10.564662,10.761727,8.173762,4.232944,2.323184,1.518416,1.165145,1.129518,0.998853,0.859002,0.722308,0.48842,0.382932,0.41534,0.359187,0.259007,0.229246,0.23505
0.414153,2.026425,3.274869,6.10098,12.049665,14.375038,13.415254,13.250403,13.252312,12.967641,13.054009,12.662741,9.146521,4.961057,3.026127,1.945504,1.354869,1.3364,1.301898,1.127407,0.912548,0.624098,0.511487,0.564023,0.458751,0.312482,0.290796,0.291408
0.388278,2.009176,3.389692,6.11702,12.313577,15.658467,15.221873,14.653219,14.011612,13.334466,13.327397,12.481647,8.569413,4.822567,3.289737,2.099156,1.326593,1.347048,1.422851,1.24336,0.975309,0.670904,0.567075,0.628155,0.493946,0.329655,0.318947,0.30858
0.299314,1.648646,2.913228,4.840243,10.009437,13.857457,14.174789,13.578435,12.450095,11.271759,10.959009,10.133312,6.918883,3.972744,2.863066,1.829795,1.089679,1.13431,1.233056,1.079949,0.83126,0.568221,0.488897,0.540028,0.42418,0.292818,0.289538,0.272069
0.216477,1.200639,2.146757,3.215394,6.648534,9.855186,10.727825,10.36207,9.12804,7.973205,7.310311,6.450786,4.523993,2.674939,1.924673,1.271581,0.746064,0.740907,0.791773,0.704647,0.545745,0.366108,0.319122,0.345547,0.280201,0.214938,0.213088,0.201051
0.195877,0.997401,1.693938,2.224984,3.933887,5.732077,6.586422,6.373227,5.445971,4.954882,4.466998,3.577266,2.503545,1.479972,0.988632,0.703449,0.431882,0.360161,0.367809,0.363193,0.309599,0.201846,0.1646,0.169547,0.14213,0.127568,0.131924,0.132021
0.208483,1.023081,1.756235,2.012919,2.624403,3.469985,4.010409,3.93844,3.460802,3.378488,3.351243,2.678683,1.689807,0.832688,0.477867,0.41405,0.287653,0.161629,0.14244,0.211345,0.258452,0.163184,0.086399,0.079661,0.067924,0.066849,0.078235,0.091492
0.224124,1.084789,1.974084,2.167763,2.397038,2.948553,3.443061,3.610716,3.120455,2.883803,3.232291,2.915049,1.819113,0.790445,0.411077,0.393542,0.279012,0.125156,0.101407,0.210683,0.305715,0.184523,0.070198,0.058021,0.045026,0.042011,0.054657,0.078178
0.232511,1.053554,2.014303,2.323274,2.69536,3.449233,4.105763,4.326009,3.656987,3.166563,3.667743,3.681931,2.411384,1.047697,0.555128,0.512682,0.346703,0.141194,0.111063,0.266142,0.403028,0.232874,0.072402,0.057522,0.044798,0.044201,0.059852,0.097229
0.244112,1.003901,1.952655,2.422494,3.198411,4.380761,5.207233,5.271487,4.494158,3.896496,4.444842,4.664398,3.074936,1.3504,0.749811,0.67276,0.461942,0.198801,0.148165,0.33346,0.513589,0.296378,0.083534,0.068557,0.057762,0.060956,0.080716,0.135246
0.242374,0.932852,1.842084,2.495404,3.711125,5.375643,6.340989,6.032566,5.126085,4.539135,5.224,5.449881,3.429482,1.55599,0.905337,0.792433,0.567888,0.278242,0.20485,0.386903,0.588945,0.344122,0.095787,0.089783,0.082435,0.083767,0.10431,0.176957
0.21511,0.825935,1.61269,2.311812,3.876676,5.996824,7.369061,6.658984,5.28097,4.774134,5.72689,5.713259,3.272033,1.557,0.967787,0.85894,0.636229,0.3501,0.268316,0.408863,0.595642,0.36085,0.110825,0.115078,0.112451,0.106324,0.120893,0.206498
0.168236,0.609046,1.147919,1.799737,3.579293,5.923546,7.641103,6.750634,4.940227,4.409798,5.565165,5.64465,3.061508,1.418225,0.927081,0.826402,0.610855,0.377778,0.313416,0.399647,0.538539,0.345551,0.137042,0.145788,0.139474,0.125774,0.133381,0.207421
0.135969,0.402047,0.697874,1.237735,2.994122,5.205576,6.778086,5.970837,4.211961,3.703378,4.626886,4.899623,2.851948,1.26149,0.756749,0.639754,0.482664,0.344041,0.306279,0.364723,0.454391,0.317926,0.176601,0.175744,0.15703,0.139215,0.13773,0.175177
0.116704,0.265634,0.448178,0.887545,2.39031,4.020683,4.989912,4.644608,3.493301,2.9938,3.324178,3.5173,2.403647,1.177544,0.587119,0.414401,0.348141,0.279924,0.248161,0.30054,0.361475,0.280626,0.202035,0.188367,0.160252,0.145101,0.133765,0.12863
0.103763,0.209227,0.365801,0.842237,2.048337,2.959785,3.354518,3.537373,3.125624,2.678802,2.789812,2.571066,1.788351,1.113828,0.557625,0.351984,0.329247,0.258867,0.200142,0.234979,0.286552,0.23418,0.185942,0.173206,0.14186,0.126019,0.116375,0.101232
0.094086,0.198608,0.344969,0.91332,1.913753,2.345413,2.452292,2.908435,2.859107,2.562351,2.734784,2.239169,1.379031,0.934908,0.527626,0.357857,0.347662,0.263003,0.187113,0.171511,0.186045,0.153224,0.129976,0.133,0.108992,0.09164,0.094412,0.091888
0.073605,0.189618,0.348004,0.93182,1.614174,1.963163,2.361624,2.752238,2.605472,2.380608,2.5716,2.059831,1.151641,0.696316,0.40782,0.331399,0.368734,0.277662,0.167957,0.112805,0.099154,0.079096,0.073962,0.089901,0.076269,0.064215,0.072105,0.08218
0.050229,0.169742,0.348645,0.866135,1.31408,1.81982,2.423499,2.518808,2.40524,2.211097,2.17155,1.788362,1.048048,0.53111,0.286622,0.304778,0.358308,0.259768,0.136856,0.079127,0.062413,0.05418,0.052036,0.062089,0.052414,0.043795,0.047985,0.065344
0.044198,0.16074,0.378054,0.832514,1.321466,1.991347,2.393711,2.199945,2.185254,2.056943,1.886356,1.639398,1.023569,0.464485,0.254328,0.268613,0.288579,0.210045,0.114602,0.067607,0.055963,0.054135,0.046298,0.048552,0.043724,0.034706,0.035037,0.056738
0.057566,0.204248,0.473016,0.912693,1.442007,1.9871,2.326029,2.103112,1.877251,1.86414,1.738866,1.465439,0.945237,0.447601,0.253679,0.21815,0.196783,0.1473,0.095525,0.062634,0.060647,0.060696,0.049704,0.053495,0.048463,0.041696,0.045308,0.061965
0.075157,0.27425,0.580941,1.072899,1.548621,1.718836,2.073384,2.052919,1.573664,1.549743,1.546838,1.285264,0.837651,0.399223,0.244806,0.183356,0.146083,0.126676,0.107968,0.073741,0.069589,0.071134,0.061171,0.070274,0.063306,0.055971,0.061436,0.069431
0.090411,0.331725,0.651391,1.230856,1.620568,1.534038,1.881684,2.001038,1.419864,1.269802,1.280086,1.175385,0.819913,0.347284,0.265976,0.19799,0.131509,0.125644,0.12533,0.086709,0.078297,0.080818,0.069829,0.080279,0.074642,0.066256,0.070264,0.072619
0.099798,0.353613,0.626688,1.353877,1.899944,1.682506,1.741722,1.787549,1.351929,1.114068,1.170315,1.272224,0.86391,0.32619,0.288991,0.209452,0.13022,0.124609,0.121785,0.08606,0.075536,0.07737,0.065295,0.07378,0.071116,0.062342,0.063092,0.063298
0.096043,0.322982,0.51723,1.384876,2.141314,1.758652,1.471405,1.406387,1.211595,1.002169,1.063705,1.316248,0.869429,0.340974,0.291786,0.185601,0.134129,0.134732,0.106168,0.070958,0.061326,0.060874,0.050547,0.055404,0.052363,0.043906,0.042398,0.049128
0.085365,0.272877,0.452778,1.391354,2.144395,1.662752,1.374848,1.33868,1.203623,0.968771,0.909051,1.164508,0.772447,0.333175,0.241168,0.134326,0.139833,0.166425,0.110421,0.059818,0.048802,0.045763,0.041004,0.040547,0.031756,0.023157,0.021854,0.039208
0.081068,0.291961,0.494034,1.3225,1.820077,1.462598,1.397514,1.451339,1.401128,1.071354,0.920093,0.953898,0.614004,0.302765,0.163909,0.095478,0.144624,0.186656,0.120661,0.05833,0.045024,0.035732,0.030183,0.028549,0.021458,0.014537,0.015944,0.037534
0.082073,0.339535,0.528603,1.137101,1.320324,1.246631,1.385507,1.364523,1.557652,1.220404,0.977721,0.779186,0.480638,0.278237,0.131792,0.095397,0.144006,0.173623,0.120912,0.063558,0.044948,0.030793,0.021045,0.018147,0.015618,0.01389,0.016651,0.036599
0.08261,0.372487,0.514088,0.937421,0.989322,1.10071,1.253407,1.125537,1.601382,1.392076,0.939937,0.667084,0.461531,0.292144,0.155815,0.11286,0.126394,0.139425,0.107806,0.067361,0.048157,0.031359,0.020296,0.01587,0.01393,0.014837,0.016342,0.031698
0.080864,0.375868,0.494421,0.913256,0.972486,1.019752,1.081093,0.933524,1.485309,1.417337,0.797477,0.535739,0.445421,0.342434,0.1883,0.116128,0.10447,0.133507,0.112425,0.076137,0.053413,0.028488,0.018922,0.016573,0.017397,0.019822,0.019016,0.030092
0.077452,0.353806,0.442517,0.975586,1.155324,0.970002,0.876103,0.693488,1.193663,1.328024,0.765717,0.492017,0.413324,0.358217,0.196518,0.101322,0.080447,0.133328,0.127484,0.083089,0.053354,0.0223,0.015121,0.014856,0.020144,0.026381,0.025621,0.036675
