1.147138,1.103094,0.986338,0.900479,0.839394,0.842749,0.788834,0.788544,0.909808,0.938169,0.928537,0.99517,0.961386,0.803208,0.769783,0.766557,0.746342,0.70351,0.618472,0.67917,0.696539,0.588422,0.524775,0.592723,0.683978,0.6,0.511885,0.477476
1.314638,1.289786,1.176718,1.085059,1.005269,0.992762,0.934808,0.935295,1.04897,1.078228,1.085768,1.144814,1.111604,0.969294,0.912134,0.906314,0.907441,0.846178,0.740429,0.802545,0.81365,0.690475,0.63986,0.727871,0.822431,0.730652,0.640666,0.597231
1.550232,1.572223,1.505864,1.41006,1.281046,1.233605,1.180854,1.177544,1.249851,1.281687,1.320907,1.340257,1.316076,1.237998,1.136288,1.125886,1.185483,1.093611,0.946426,1.008875,1.009025,0.856471,0.841968,0.977056,1.062709,0.957664,0.866885,0.799788
1.651222,1.720429,1.779339,1.694549,1.472403,1.372009,1.350732,1.363852,1.373868,1.40068,1.458975,1.392267,1.369998,1.391814,1.262924,1.254086,1.390095,1.291135,1.110054,1.175121,1.172172,0.983437,1.00937,1.192938,1.241436,1.118202,1.024719,0.937964
1.631214,1.737019,1.912494,1.832689,1.528274,1.355082,1.336839,1.394017,1.405341,1.440052,1.468546,1.30919,1.257743,1.327793,1.211967,1.209405,1.383196,1.313106,1.125078,1.197437,1.222936,1.027225,1.064766,1.246627,1.248107,1.120059,1.022373,0.935482
1.507323,1.579907,1.776884,1.727515,1.464814,1.265988,1.207439,1.246958,1.268682,1.328489,1.309641,1.114666,1.030371,1.072291,1.006255,1.013281,1.157595,1.124086,0.958798,1.02337,1.088543,0.944064,0.953737,1.094946,1.101556,0.989026,0.899919,0.823047
1.584369,1.46067,1.556608,1.603468,1.489424,1.349734,1.268772,1.215997,1.198074,1.256186,1.195275,1.009011,0.909726,0.929478,0.925159,0.91889,0.986543,0.967268,0.815377,0.817838,0.901663,0.848822,0.826004,0.995034,1.092576,0.961384,0.877172,0.799264
2.264056,1.868611,1.822578,1.993416,2.009395,1.882631,1.811523,1.708737,1.702591,1.744711,1.557676,1.318034,1.18309,1.211438,1.2383,1.188669,1.200536,1.145492,0.928947,0.839895,0.95573,1.002157,0.985356,1.258793,1.422296,1.220483,1.155892,1.059482
3.39877,2.861138,2.747146,2.938056,2.962511,2.854118,2.861329,2.745106,2.741441,2.723806,2.327191,1.944286,1.740257,1.748516,1.772327,1.707032,1.73964,1.615291,1.227718,1.055705,1.22708,1.349968,1.380062,1.758031,1.92817,1.678553,1.646432,1.50733
4.63101,4.217106,4.227533,4.306891,4.163892,4.06898,4.144294,4.056287,4.05004,3.886616,3.20295,2.608892,2.34467,2.290428,2.243481,2.207526,2.301813,2.075266,1.540765,1.337611,1.580287,1.750873,1.813084,2.270361,2.415742,2.167394,2.185901,1.994548
5.643716,5.663318,6.081636,5.957989,5.501573,5.31256,5.233817,5.179046,5.187047,4.823115,3.824988,3.015603,2.765383,2.659984,2.482916,2.435687,2.554474,2.314046,1.845106,1.68326,1.916527,2.069623,2.194306,2.702743,2.754856,2.521809,2.564613,2.318293
6.442404,7.020847,7.981666,7.538698,6.698066,6.294286,5.680502,5.541097,5.654166,5.281916,4.067172,3.073778,2.873668,2.752781,2.471964,2.311709,2.375918,2.227194,2.055723,2.035864,2.143605,2.243085,2.504478,2.959665,2.85669,2.649516,2.635729,2.32292
6.990832,7.903731,9.104396,8.519365,7.465447,6.636367,5.354235,5.066514,5.379329,5.384333,4.215976,2.964595,2.699233,2.58847,2.252702,1.975521,2.044827,1.980112,2.063234,2.240557,2.202806,2.21517,2.564655,2.868671,2.670011,2.561383,2.493983,2.0967
6.702983,7.673654,8.632446,8.240238,7.320432,6.125712,4.570978,4.263526,4.61399,4.815776,3.933248,2.693257,2.397116,2.29013,1.933712,1.679402,1.79326,1.744144,1.895955,2.15373,2.012059,1.938842,2.275249,2.461886,2.302272,2.29979,2.218442,1.823965
5.479832,6.189288,6.447091,6.285374,5.896942,4.970995,3.774538,3.516535,3.687493,3.896211,3.404442,2.416325,2.140019,2.08547,1.77597,1.632673,1.769054,1.68778,1.745372,1.909123,1.763023,1.676205,1.900299,2.02134,1.965239,1.989455,1.962029,1.703783
4.808827,5.049601,4.280917,3.996035,4.240047,4.131042,3.507442,3.202638,3.315169,3.890347,3.739009,2.721245,2.242471,2.274507,2.1747,2.142318,2.273041,2.073835,2.042081,2.157405,1.948709,1.750961,1.899401,2.082716,2.011092,1.956319,2.120708,2.061619
5.592637,5.38872,4.028407,3.55098,4.218166,4.682266,4.06813,3.66237,4.024901,4.990723,4.835397,3.477446,2.746224,2.956496,3.130173,3.110688,3.147575,2.876129,2.907104,3.01276,2.627574,2.252943,2.416502,2.770192,2.624008,2.473376,2.742777,2.781356
6.812363,6.402702,5.01856,4.476512,5.090288,5.587112,4.877942,4.510311,5.441341,6.705544,6.129894,4.119214,3.246598,3.755513,4.176261,4.121463,4.077716,3.933794,4.064788,4.158975,3.665714,3.022724,3.13375,3.862803,3.81376,3.502472,3.635726,3.743583
7.844659,7.565304,6.519124,6.219859,6.531881,6.606257,6.04086,5.905688,7.431832,9.1777,7.855129,4.54718,3.531556,4.462829,5.142654,5.0766,5.072627,5.166574,5.151441,5.26993,4.972128,3.90564,3.746648,5.09399,5.37544,4.858418,4.890097,5.156052
8.814741,8.902349,8.259986,8.474648,8.181864,7.543107,7.598856,7.683961,9.440111,11.653415,9.617551,5.250716,4.163253,5.295376,6.103157,6.031583,6.041385,6.326809,5.994963,5.980392,6.043878,4.664978,4.227222,6.097508,6.698893,6.02307,6.162548,6.736128
9.202364,9.481511,9.445075,10.300847,9.571756,8.194111,8.835736,9.239852,10.613144,12.765495,10.697904,6.270126,5.131555,6.056257,6.810577,6.476972,6.167954,6.607174,6.284932,6.078466,6.32007,4.991262,4.444519,6.444147,7.208118,6.559345,6.842056,7.424178
9.055421,9.18676,9.389341,10.513207,9.841841,8.308608,9.216096,10.079844,10.567017,11.74619,10.208284,6.693317,5.631468,6.291277,6.726835,5.885237,5.194452,5.513172,5.594896,5.668797,5.715402,4.6339,4.405271,6.140053,6.805634,6.184632,6.305471,6.494322
8.320453,8.080951,7.818541,8.541926,8.080004,7.107298,8.082806,9.510055,9.341531,8.958106,7.888566,5.861533,5.144073,5.664298,5.657079,4.466665,3.914908,3.921439,4.103993,4.699494,4.493441,3.794258,4.281603,5.48649,5.844252,5.185597,4.866701,4.552429
6.869687,6.359149,5.567485,5.837509,5.467019,5.24318,6.092322,7.694209,7.86613,6.658716,5.606686,4.731505,4.283646,4.555129,4.373938,3.28224,3.002667,2.977908,3.078746,3.743715,3.537288,3.328515,4.213442,4.694371,4.686139,4.122977,3.614426,3.174166
5.08618,4.984333,4.222151,4.265463,3.967761,4.028046,4.67234,6.029742,6.608662,5.25452,4.006764,3.754888,3.475707,3.371003,3.312481,2.791554,2.686665,2.826054,2.78763,2.920348,2.846974,2.997274,3.817258,4.125138,3.933226,3.309925,2.914404,2.684729
3.749274,4.224814,3.723569,3.512335,3.382698,3.104282,3.398812,4.492428,5.070585,4.037561,2.769036,2.691873,2.65236,2.529459,2.554026,2.428677,2.541835,2.846371,2.68032,2.162796,2.084327,2.37884,3.061217,3.671928,3.539528,2.586993,2.317556,2.523314
2.929585,3.757836,3.544936,3.257693,3.07778,2.384598,2.276736,2.837538,3.136753,2.764747,1.95412,1.720583,1.746402,1.879488,2.037463,2.174365,2.519372,2.776359,2.328624,1.531934,1.612917,1.980784,2.362043,2.91458,2.926406,2.003053,1.740582,2.158916
2.32015,3.092417,3.000155,2.854326,2.783026,2.012342,1.742852,1.96521,1.857472,1.962637,1.690329,1.319255,1.248843,1.427248,1.594329,1.732318,2.071297,2.220829,1.708208,1.169403,1.544573,1.99736,2.147762,2.270211,2.143944,1.457715,1.282059,1.638677
1.761119,2.153793,2.053155,2.0226,2.306947,1.741867,1.404489,1.4847,1.290607,1.513188,1.509766,1.248844,1.037662,1.07503,1.177566,1.168609,1.354014,1.516859,1.220363,0.992715,1.372272,1.744428,1.721247,1.600133,1.444091,0.969396,0.973541,1.352292
1.286745,1.365825,1.248529,1.335091,1.831247,1.391361,1.1136,1.182174,1.055652,1.176957,1.180554,1.066272,0.820748,0.788139,0.811587,0.72772,0.8776,1.066475,0.916566,0.814866,0.994659,1.176425,1.079478,1.001996,1.046586,0.729929,0.793061,1.224254
0.964812,0.918832,0.909279,1.084961,1.379622,1.018867,0.897092,1.044226,1.13883,1.179742,0.927499,0.796761,0.649636,0.52917,0.494195,0.445935,0.551183,0.671999,0.590862,0.550482,0.650952,0.680192,0.573337,0.641265,0.796627,0.598395,0.637835,0.986183
0.840275,0.765357,0.807878,0.922842,0.92286,0.656385,0.656969,0.916193,1.180257,1.233012,0.821282,0.549014,0.508301,0.412149,0.351827,0.313102,0.351011,0.397198,0.321546,0.338194,0.472851,0.470534,0.418171,0.476186,0.518954,0.408114,0.415379,0.6125
0.732133,0.763189,0.822941,0.738587,0.535099,0.372183,0.434998,0.754565,1.024884,1.069087,0.724131,0.393423,0.362263,0.354906,0.311191,0.277336,0.341586,0.374362,0.252409,0.252744,0.394085,0.397129,0.375332,0.390804,0.301503,0.223299,0.222598,0.333144
0.72991,0.807551,0.765298,0.605524,0.375408,0.275243,0.388961,0.680548,0.791814,0.75604,0.571056,0.363769,0.328794,0.373162,0.34486,0.268575,0.334546,0.367377,0.240959,0.214041,0.319215,0.326843,0.332268,0.341809,0.208396,0.153108,0.171186,0.268929
0.760955,0.846366,0.705338,0.572029,0.39469,0.289864,0.411567,0.688292,0.79177,0.616538,0.442718,0.36425,0.307257,0.365096,0.349491,0.258385,0.300766,0.301179,0.191069,0.187911,0.248817,0.263998,0.310885,0.28271,0.168828,0.134262,0.158606,0.247959
0.779913,0.794663,0.646531,0.538662,0.391513,0.328783,0.400457,0.609543,0.782029,0.591391,0.401949,0.356308,0.285712,0.315192,0.282802,0.220508,0.253954,0.207561,0.120695,0.164468,0.212291,0.251038,0.301267,0.216624,0.138184,0.129295,0.149815,0.25695
0.720593,0.693237,0.646803,0.5495,0.356958,0.347357,0.353326,0.460785,0.660567,0.498637,0.332184,0.306863,0.232186,0.232524,0.186525,0.149347,0.187448,0.144449,0.08432,0.151088,0.221063,0.2597,0.297754,0.208713,0.137046,0.148394,0.184867,0.281433
0.625724,0.646751,0.642418,0.535308,0.331355,0.352232,0.376075,0.404996,0.50194,0.372484,0.243719,0.228959,0.182578,0.180968,0.142156,0.092969,0.12927,0.135276,0.092156,0.139978,0.224256,0.243412,0.28713,0.230336,0.151853,0.17251,0.237518,0.277755
0.560142,0.529009,0.548888,0.435241,0.29731,0.375369,0.427594,0.359942,0.343719,0.269699,0.18985,0.17812,0.200724,0.207696,0.149172,0.089861,0.107146,0.134414,0.112869,0.169567,0.236587,0.235487,0.274544,0.245563,0.17062,0.204419,0.29106,0.243695
0.473255,0.375928,0.39628,0.280018,0.249197,0.413917,0.438172,0.271286,0.226483,0.221397,0.193713,0.18663,0.23222,0.246852,0.188472,0.116301,0.129687,0.159492,0.157289,0.227907,0.239614,0.212299,0.237155,0.235869,0.184071,0.234666,0.328856,0.226037
