-0.002176,-0.005367,-0.008434,-0.006995,-0.005183,-0.004015,-0.008445,-0.005736,-0.00938,-0.006016,-0.004887,-0.003313,-0.001965,-0.00301,-0.004478,-0.006872,-0.002736,-0.008257,-0.004491,-0.004479,-0.0049,-0.004048,-0.004877,-0.005426,-0.005828,-0.002596,-0.003723,-0.004377,-0.004882,-0.003303,-0.006772,-0.004816,-0.005602,-0.003523,-0.00341,-0.003594,-0.006641,-0.003491,-0.00523,-0.004759,-0.005617,-0.004214,-0.003815,-0.00361,-0.002075,-0.005107,-0.005207,-0.003152,-0.003594,-0.003102,-0.004594,-0.003178,-0.001258,-0.002682,-0.003649,-0.004057,-0.007076,-0.005047,-0.002491,-0.002548,-0.002608,-0.002163,-0.002094,-0.002893,-0.004136,-0.004201,-0.003114,-0.003125,-0.004142,-0.004646,-0.00407,-0.002664,-0.005229,-0.003568,-0.00292,-0.005505,-0.005351,-0.003834,-0.00202,-0.001888,-0.001211,-0.002364,-0.004084,-0.003275,-0.002388,-0.004898,-0.00436,-0.002444,-0.002221,-0.004225,-0.004003,-0.003661,-0.002819,-0.003401,-0.003821,-0.005085,-0.003803,-0.006254,-0.004918,-0.001248,-0.003045,-0.001478,-0.001926,-0.003056,-0.003053,-0.00136,-0.004495,-0.003468,-0.003006,-0.002413,-0.000253,-0.002468,-0.003239,-0.004306,-0.004133,-0.006279,-0.006434,-0.005022,-0.003717,-0.003667,-0.002325
-0.001236,0.002898,0.001547,0.002551,0.0028,0.00145,0.005543,0.002944,0.005462,-0.002654,-0.002507,0.000368,-0.000953,-0.000403,-0.001318,0.000301,-0.001595,0.001656,0.002892,-0.002835,0.000696,3.9e-05,0.000323,0.001846,0.00326,-0.000468,3.2e-05,0.000541,0.001274,-0.001056,0.002271,0.001008,0.001665,-0.000631,-0.001065,0.000374,-0.000992,-0.001266,0.000446,0.000309,0.00062,-0.00172,-0.001294,-0.001455,-0.002521,0.000488,9e-04,7.4e-05,-0.00159,-0.001677,8.4e-05,-0.001369,-0.001133,0.002573,-0.000726,-0.000467,0.002842,9.3e-05,0.000184,6e-05,-0.002308,-0.000205,-0.001678,-0.000663,0.001023,-0.000407,0.000689,-0.000162,0.000497,0.000575,0.000439,-0.001565,0.00137,0.000637,-0.000166,0.001323,0.002368,0.000174,-0.001429,-0.00131,-0.001824,-0.001626,0.000273,0.000912,-0.001414,0.000854,0.000808,-0.000118,-0.000669,0.002618,8.2e-05,-0.00023,-0.001269,-0.001442,-0.001753,0.0014,-0.00041,0.000852,-0.000363,-0.001453,-0.000546,-0.003962,-0.001618,-0.000249,-0.001808,-0.001467,-2.1e-05,0.000935,-0.000977,-0.000393,-0.002001,-0.003119,-0.002387,-0.000878,0.000255,0.000622,-0.000639,0.001488,0.000416,0.000577,4e-04
0.000807,-0.002656,-0.000836,-0.001215,-0.001916,-0.002208,-0.003376,-0.001883,-0.003615,0.000781,0.00041,-0.001775,-0.000225,-0.000272,0.001419,0.001666,0.000395,0.00025,-0.000541,0.000624,-0.001136,-0.002082,-0.00087,-0.000678,-0.001168,-0.001344,0.000156,0.000935,-0.001642,-0.000207,-0.000363,-0.00094,0.000201,-0.000124,0.000386,-0.000498,0.001997,0.001077,-0.000556,-2e-04,0.000844,0.002211,0.001862,0.001094,7.2e-05,-0.001542,-0.001519,-0.00018,0.001331,0.001131,0.000128,6.3e-05,0.000249,-0.003271,-0.001138,0.001093,-0.00226,-0.000701,0.000313,0.000386,0.000856,-0.000395,0.000327,0.001411,-0.000156,-8.6e-05,-0.00022,-3.1e-05,-0.000215,0.000894,0.001406,-7.5e-05,-0.000641,-0.000776,-0.000152,4.5e-05,-0.001644,0.000747,6.7e-05,-0.000161,-5.4e-05,0.002093,-2.6e-05,-0.000686,0.000186,-0.002095,-0.001069,-0.001019,-0.000344,-0.002769,-0.00147,-0.000209,0.000684,-0.001425,-0.000382,-0.00357,-0.000692,0.000549,-0.000137,0.000465,-0.001404,0.000266,-0.000485,0.000974,0.000573,-0.001059,-0.00134,-0.001442,7.4e-05,-0.000253,-0.000731,0.001454,-0.000647,0.001347,-0.000675,-0.000311,0.002038,-0.001927,-0.001527,-0.000515,-0.001987
-0.000411,0.001837,0.002289,-0.00084,0.000842,0.001192,0.002408,0.000229,0.001668,0.000382,0.001133,0.001556,0.000943,0.000972,0.000653,-0.00111,0.000653,-0.000233,-0.000587,0.001008,0.002175,0.00156,0.000598,9e-04,0.001412,0.002595,0.00062,-0.000564,0.001555,0.00151,0.000522,0.000746,-0.000415,0.001053,0.001086,0.001188,0.000848,1e-05,0.001242,0.001899,0.000391,1.3e-05,0.000897,-0.00022,0.002647,0.003475,0.002078,0.000976,-0.00108,0.001142,-0.00034,0.000446,-0.000124,0.000737,0.002146,-0.001067,0.001417,0.001896,0.000623,0.000203,-0.000139,0.000741,0.001022,-0.001569,0.000683,-0.00042,-0.000754,-1e-06,-0.000478,-0.000245,-0.001206,0.000562,0.000856,0.001143,0.001302,-0.000232,0.001178,-0.000373,-0.000678,0.002117,0.002193,0.000378,0.000547,0.001493,0.001004,0.001906,0.001676,0.001103,0.001362,0.001397,0.001214,0.000158,0.000409,0.001653,0.002391,0.001401,0.00018,0.000154,0.000998,0.000113,0.001381,0.002531,0.002186,-0.000154,-1e-04,0.00226,0.001758,0.002037,-0.000224,0.000479,0.000705,0.00125,0.001816,-0.000823,-0.000196,-0.000799,-0.001681,0.001937,0.00231,0.000618,0.001162
-0.000362,-0.000745,-0.002399,0.001071,-0.00043,-0.000778,-0.001716,-0.000775,-0.001246,0.000171,-0.000751,-0.000688,-0.000168,-0.000173,-0.001121,-0.000243,0.000611,-0.000725,-0.000958,0.000369,-0.000738,-6.9e-05,-0.000249,-0.000748,-0.002035,-0.001725,-0.001719,-0.000143,-0.001181,-0.001475,-0.002212,-0.000731,-0.000423,-0.000628,-0.001341,6.8e-05,-0.000666,-0.000225,-0.001032,-0.003139,-0.001123,-0.001448,-0.002653,-0.000523,-0.002232,-0.002134,-0.000868,-0.000447,0.001307,-0.000495,0.000227,-7e-06,0.001328,0.000114,-0.000718,0.000684,-0.000302,-0.00244,-0.001399,-0.000396,0.00109,0.00031,-0.00017,8e-04,-0.00094,0.000982,0.000782,0.000555,0.001162,-0.000744,2.9e-05,-0.00076,-0.000594,-0.002037,-0.001101,-0.000503,-0.001051,-8e-06,0.001637,-0.001322,-0.000878,-0.001725,-0.000613,-0.001345,-0.000344,-0.001164,-0.001851,-0.000365,-0.001432,-0.000249,-0.000511,-0.000794,-0.000726,5.8e-05,-0.002166,0.000404,-0.00046,-0.000627,-0.001907,-0.000268,-0.000173,-0.00035,-0.001543,-0.000386,-0.000488,-0.00143,-0.000165,-0.001565,0.000394,0.000502,-2.5e-05,-0.001017,-0.000661,0.000318,-0.000243,0.000776,-0.000447,-0.000588,-0.001587,-0.000112,-0.00111
0.000968,-0.000125,0.001929,-0.000963,0.000602,0.001046,0.000856,0.00186,0.001474,0.00047,0.00014,-0.000135,-0.000965,-0.00061,7.5e-05,-0.000116,-0.000127,0.000416,0.00184,-0.000157,-0.000487,-0.000857,-0.000123,0.00047,0.001281,0.000524,0.000205,0.000181,0.001164,0.001607,0.002192,0.001127,0.000458,0.000648,0.000887,-0.000928,-0.000453,-0.000898,-0.000155,0.001406,0.000361,0.000974,0.001603,0.000811,4.8e-05,-3.8e-05,0.000724,1e-04,-0.001553,0.000211,0.000185,0.000688,-0.00153,0.00019,-0.000232,0.000606,0.000435,0.002068,0.001413,-0.000167,-0.001086,0.00012,-0.000261,0.000645,0.000555,-0.000134,0.000345,-0.000596,-3.6e-05,0.001018,0.000385,0.000377,-0.000181,0.000757,-0.000306,0.000634,4.8e-05,-0.000223,-0.001308,-0.000304,-0.000261,0.000132,-0.000124,0.000595,0.000402,0.000138,0.001333,0.000287,0.000222,-0.000341,0.000996,0.001339,-0.000124,1.5e-05,0.000371,0.00022,0.001256,0.000184,0.00109,-0.000483,-0.000647,-0.00098,-0.000396,0.000543,0.000789,0.000137,-0.001385,0.000973,0.000353,0.000284,-0.00014,-0.000427,-0.000434,0.000682,0.002237,9.1e-05,0.001206,0.000331,0.000432,0.000217,0.000738
0.000193,-0.000207,-0.001022,0.000811,-0.000945,-0.001316,-0.000814,-0.001598,-0.000987,-0.001524,0.000704,0.000384,0.000145,0.000376,0.000629,0.000749,0.000203,6e-06,-0.000774,-0.000646,0.000128,8e-06,0.000261,0.000696,-0.001062,0.000547,0.001545,0.000534,-0.000977,-0.001011,-0.000144,4.7e-05,0.000661,-0.000318,0.00046,0.000417,0.00095,0.00066,0.000611,-0.000103,-4.8e-05,-0.000747,5.4e-05,-0.000248,0.001415,0.000961,-0.001647,-0.001019,0.000765,-7.6e-05,0.000151,-0.000401,0.00034,-0.000434,-0.001108,-0.00137,-0.000729,-0.00079,-0.000645,-0.00018,0.000865,0.000293,-0.000161,-0.000512,0.000111,0.000215,-0.000663,9.5e-05,-0.000517,-0.000419,-0.000613,0.000649,-0.000391,0.00015,0.000431,4.9e-05,0.000698,0.000907,0.00071,-1.5e-05,0.00037,0.000671,0.000486,-0.000796,-0.00034,0.000833,-0.000274,-0.000524,-2.3e-05,-0.000167,-0.000742,-0.000577,0.000873,0.000532,8.3e-05,-0.000145,-0.000657,0.000541,5.6e-05,0.002161,0.000897,0.000496,0.00104,-0.00038,-3e-04,0.000231,-0.000208,0.000153,-3e-06,-0.000735,-2.4e-05,0.001,0.001031,-0.000199,-0.001149,0.000141,-0.000815,0.000146,-0.000537,-0.001205,-9.4e-05
-0.00081,1.7e-05,0.00028,-0.000913,1.7e-05,0.000973,0.000669,0.000876,-0.000257,0.000818,-0.00061,0.000382,-0.000332,9.5e-05,-3.4e-05,-0.000652,-0.000446,0.000352,0.000156,-0.000326,0.000646,0.000548,8.4e-05,-0.000606,0.000677,0.000127,-0.001543,-0.00079,0.001246,0.000996,-0.000569,-0.000165,-0.000727,-0.000372,-0.000347,7.9e-05,-0.00082,0.000281,2.3e-05,5e-04,0.00047,0.000834,-0.000285,4e-06,0.000102,-0.001128,0.001461,0.000446,-0.000343,-0.000841,-0.000538,-0.000586,0.00057,7.3e-05,0.000979,0.000748,-0.000509,9.8e-05,-0.000313,0.000582,-0.000477,-0.001038,-0.000251,-0.000301,-0.000694,-0.00084,0.000281,0.000138,0.000821,-9.8e-05,6e-06,-0.001008,0.00058,0.000328,3.7e-05,-7.9e-05,-0.000521,-0.000882,-0.000362,0.000234,-2e-05,-0.000433,8.9e-05,0.000586,3.3e-05,-2.3e-05,3e-05,0.000499,0.000474,0.000641,0.000651,-0.00029,-0.000425,-0.000317,0.000603,-0.000214,0.00072,-0.000385,-0.000252,-0.000493,-1.4e-05,0.000238,0.000133,0.000385,-0.000241,-0.00049,0.001407,-0.000413,-0.000348,0.000123,0.000388,-0.000917,-0.000634,-0.00077,-6e-05,-0.000582,0.00051,-0.000153,0.000737,0.000946,-6.5e-05
0.000183,0.000168,-7.4e-05,0.000922,0.000521,-0.000324,-0.000648,-0.000382,-9.7e-05,-0.000414,0.000361,-0.000188,0.000763,-0.000214,-9.9e-05,0.000162,-0.000348,-0.000349,-0.000347,0.000608,8.1e-05,3.3e-05,0.000373,0.000736,-0.000257,-3.8e-05,0.000495,-8.3e-05,-0.000158,-0.00084,0.00018,-0.00034,0.000151,0.000373,-0.000452,-0.00011,0.000862,-0.000604,-0.000416,-0.000518,-0.000731,-0.001117,-4.9e-05,-0.000408,-0.001372,0.00057,-0.00037,0.000418,-8.5e-05,0.00063,0.000273,0.000428,-7.9e-05,0.000318,-0.000137,0.000205,0.00123,-6.2e-05,-0.000291,-0.000383,5.3e-05,-0.000159,-0.000203,9.5e-05,0.000509,9e-04,-8.5e-05,0.00029,-0.000591,-5.8e-05,0.000746,0.00029,1.1e-05,-0.000207,-0.00032,-0.000189,-0.000325,0.000792,0.000347,0.000522,-0.000459,0.000126,-0.000501,-0.000503,-0.000455,-0.000397,-0.000161,6.5e-05,-0.000383,-0.000485,-0.000359,9.6e-05,-7.4e-05,-0.000267,-0.000373,0.00065,-0.000408,0.00025,5.4e-05,-0.000725,-1.9e-05,-7.6e-05,-0.000652,-0.000455,0.000393,5.2e-05,-0.000529,0.000474,1e-05,-0.000258,-0.00025,0.000303,-0.001181,0.000855,0.000629,0.000749,0.000218,1.3e-05,-0.000389,1.8e-05,-0.000218
-8.3e-05,0.000665,9e-06,-0.000927,-0.00072,1.9e-05,0.000191,0.000197,0.000741,0.000461,5e-06,-0.000557,-0.000331,0.000109,-0.000389,-0.000155,-6.4e-05,0.000936,0.000205,-0.000345,-0.000688,-0.000428,-0.00129,-0.000896,0.00027,-0.000162,-0.000574,0.000191,-0.000942,0.000235,0.000328,-0.000146,0.000115,0.000473,0.000428,-0.000108,-0.000691,0.000172,-0.000475,-0.000165,0.000293,0.00069,0.000157,0.000287,0.001094,-0.000136,-0.000574,-0.000166,-0.000131,-5e-04,0.000304,7.1e-05,-0.000185,0.00018,0.000442,4.4e-05,-0.000466,-0.000329,0.00092,-7.3e-05,-3.3e-05,0.000611,0.000569,-0.000429,-0.000233,-0.000599,-7.8e-05,-0.00024,-0.000362,0.000226,-0.000648,-5.3e-05,0.000186,-7.5e-05,0.000114,3.7e-05,0.000329,-0.000738,-0.000563,-0.00056,0.000295,0.000203,0.000227,0.000527,0.000289,-0.000336,7.5e-05,-0.000213,8e-06,0.000203,3.8e-05,0.000435,0.000371,-0.000166,-0.000268,-0.000258,-1.8e-05,0.000511,-6.4e-05,8.5e-05,3.5e-05,-0.000494,0.000106,0.000613,-0.000166,0.000223,-0.000117,-0.000132,0.000283,4.2e-05,3e-05,-0.000191,0.000818,-0.00024,-0.000384,-0.00037,-0.000533,-0.000556,6.9e-05,-0.000275,0.000329
0.000134,-0.00014,0.000168,0.000575,0.000411,6e-05,9.8e-05,-0.000216,-0.000664,-4.7e-05,-0.000755,-5.2e-05,-2.7e-05,-3.9e-05,0.000318,0.000201,7.9e-05,-0.000654,0.000103,0.000279,-7.7e-05,7.2e-05,0.000693,0.000154,-0.000271,-0.000245,0.000833,-0.000187,0.000888,0.000193,-0.000431,0.000419,-0.000431,-0.000516,-0.000192,0.000482,0.000207,6e-05,0.000957,0.000475,6.8e-05,5.4e-05,-2.1e-05,-0.00012,-0.000773,0.000239,0.000182,-0.000523,-0.000218,0.000415,-0.000525,0.000123,7.9e-05,-0.000476,-0.000355,-0.000177,9.5e-05,9.5e-05,-0.000767,6.3e-05,-1.9e-05,-9.1e-05,-0.000273,0.000452,7.8e-05,7.7e-05,0.000203,-0.00019,0.000164,4e-06,-7.8e-05,-7.5e-05,-0.000284,5.2e-05,0.000452,0.000344,7.9e-05,0.000586,0.000191,7.7e-05,8.6e-05,0.000179,0.000193,-6.1e-05,-0.000284,0.000249,-4.3e-05,0.00011,4.1e-05,0.000167,2.7e-05,-0.000621,-0.000175,0.000181,-8e-05,-0.000316,-0.000174,-0.000683,-7.8e-05,0.000317,0.000415,0.000489,-0.000116,-0.000766,0.000184,-0.000454,8.4e-05,0.000226,6.3e-05,0.000564,-0.000198,0.00011,0.000263,-0.000188,0.000338,8.1e-05,0.000412,-9.4e-05,0.000213,0.000205,-0.000158
7e-06,-0.000166,-3e-05,-0.00032,6.4e-05,7.2e-05,-7.9e-05,0.000105,0.000353,0.000107,0.001235,0.000373,0.000233,0.000341,0.000132,-5.5e-05,0.000312,-0.000348,-0.000369,4.3e-05,0.00036,0.000505,1.5e-05,-0.000313,2.8e-05,9.1e-05,-0.000399,0.000137,-0.000228,-0.00035,0.000211,-0.000342,0.000366,5.9e-05,-0.000205,-0.000594,-8.7e-05,4.5e-05,-0.000195,-0.000145,-0.000447,-0.000222,0.000191,0.000225,0.00048,9.2e-05,0.00053,0.000209,0.000324,-0.000159,0.000107,-0.000421,-0.000135,-2e-05,0.000174,0.000225,-0.000332,0.000346,0.000636,0.000285,-4.3e-05,4.6e-05,-8.1e-05,-0.000334,0.000186,0.000176,-4.3e-05,2.8e-05,0.000346,0.000157,0.000294,0.000207,-2.5e-05,0.000183,-0.000362,-0.000466,-0.000104,-0.000636,0.000102,-8e-06,0.000161,-0.000544,-0.000172,3.3e-05,0.000585,0.000213,0.000227,-1.4e-05,0.000195,9.3e-05,-2.8e-05,0.000505,8e-06,-9.9e-05,0.000524,-0.000241,8.7e-05,0.000303,2.6e-05,-7e-04,-0.000571,-0.00022,0.000274,0.000426,0.000179,0.000162,0.000173,-0.000796,-0.000325,-0.000516,2e-05,-9.8e-05,-0.000235,-0.000119,-0.000401,-5.5e-05,-0.000233,0.000183,0.000118,-5e-05,8.3e-05
-5.6e-05,-0.000231,1.1e-05,0.000277,-7.8e-05,0.000159,1.1e-05,0.000145,-4.6e-05,-0.00029,-0.001109,-1.2e-05,1.6e-05,-2.6e-05,-0.000373,-0.000173,-9.2e-05,0.000461,0.000104,-0.000232,9.5e-05,-0.000195,-0.000296,0.000277,0.000651,-0.000114,0.000223,-0.000119,8.6e-05,-2.7e-05,-0.000224,-6.4e-05,-0.000239,-3.8e-05,0.000258,-4.4e-05,6.9e-05,-3.1e-05,-0.000545,-8.4e-05,-1.7e-05,-3e-06,-0.00028,-0.000278,-0.000126,-0.000227,-0.000282,0.000108,-2.3e-05,-9.5e-05,0.000103,0.000291,-5.4e-05,0.000429,-0.00015,-0.000259,-0.000106,-0.000114,-0.000321,-0.000239,0.000196,-0.000274,0.000186,0.000498,-5.2e-05,5.8e-05,-1.8e-05,0.000306,-3.3e-05,-0.000271,-0.000102,-2e-05,0.000105,-0.000349,8.9e-05,0.000184,-2e-05,0.00038,-0.000131,2e-06,-2.6e-05,0.000241,0.000153,4.7e-05,-0.000349,-0.00032,-0.000474,-5.3e-05,-0.000305,-0.000234,-0.000125,-0.000261,7.1e-05,0.00013,-0.000164,0.001052,0.000168,-0.000626,0.000106,0.000512,-0.000182,-3.2e-05,0,0.000108,-0.000176,0.000171,-0.000489,5.1e-05,0.000129,0.000297,0.000262,3.4e-05,-2e-04,0.000273,1e-05,0.000248,-6.9e-05,7.6e-05,-0.000351,-6.9e-05,-0.000295
7e-05,9.7e-05,-5.7e-05,-0.000222,-0.000152,3e-06,-5.2e-05,0.000208,-3.2e-05,0.000397,0.000577,8.6e-05,-0.000271,-5.4e-05,0.000381,7.6e-05,0.00013,-0.000272,6.8e-05,0.000163,2.6e-05,4.6e-05,0.000157,6.3e-05,-0.000602,7.2e-05,-9.5e-05,0.000144,-0.000123,-4e-05,0.000495,0.000206,0.000216,8.8e-05,-9.2e-05,4.3e-05,-3.3e-05,8.9e-05,0.000566,8.1e-05,0.000187,0.000131,0.000273,0.000114,3e-06,0.000127,-0.000212,-2.1e-05,6.9e-05,6.4e-05,-0.000111,2.8e-05,0.000387,-0.00018,0.000107,7.5e-05,0.000395,5.3e-05,2.7e-05,0.000152,-0.000231,0.000216,-0.000101,-0.000377,-2e-06,-0.000204,-6.1e-05,-9.9e-05,-9.9e-05,0.000127,8.4e-05,-0.000258,-2.5e-05,3.3e-05,9.3e-05,8.4e-05,-9e-06,-5.6e-05,0.000158,3.6e-05,-0.000263,-1.9e-05,-3.8e-05,-0.000432,0.000263,0.000286,0.000521,6.9e-05,1.5e-05,6.9e-05,9e-06,0.000209,-0.000159,6.8e-05,0.000134,-0.000636,-0.000193,0.000553,9.7e-05,-0.000244,0.000105,1.2e-05,-0.000265,-8.6e-05,-6e-05,-0.000265,0.000553,0.000204,8.9e-05,-0.000147,-0.000115,4.8e-05,0.000261,-0.000483,4e-05,-0.000275,0.000181,5.5e-05,0.000204,-1e-05,6.6e-05
-3e-05,8.2e-05,-8.5e-05,0.000195,0.000192,0.000122,2e-06,-0.000386,4.2e-05,-0.000294,-0.000261,-0.000246,6.7e-05,-2.6e-05,-0.000237,4.1e-05,-0.000123,0.000229,-3.6e-05,-1e-04,-8.8e-05,-0.000121,-3.7e-05,-2.7e-05,8e-05,-4e-06,0.00019,-0.000153,9.7e-05,0.000202,-0.000274,2.6e-05,-0.000175,-9.4e-05,-7.2e-05,2.6e-05,-3e-06,-0.000139,-0.000219,4.9e-05,1.3e-05,-6.2e-05,-0.00014,0.000138,-0.00012,-0.000143,0.000348,-9.6e-05,-0.000136,-0.000117,0.00012,-0.000101,-0.000281,-9.9e-05,3.4e-05,-6.3e-05,-0.000158,-0.000127,-1.7e-05,-2.9e-05,0.00011,-0.000129,8e-05,0.00025,3.3e-05,0.00013,1.1e-05,-5.4e-05,3.5e-05,-4.2e-05,-0.000244,0.00022,0.000103,2.2e-05,-0.000133,8.5e-05,1.6e-05,-4.2e-05,-0.000113,4.7e-05,2.2e-05,0.000132,-0.000155,0.000284,-0.000185,-3e-05,-0.000172,-0.000101,5.3e-05,-3e-06,5e-06,1.5e-05,-7.3e-05,-1.7e-05,-0.000269,0.000127,1.6e-05,2e-06,-0.000155,5.7e-05,8.9e-05,-0.000168,0.000149,-0.000122,0.000143,0.000245,-0.000237,0.000133,-2.4e-05,6.5e-05,-1.5e-05,-7.8e-05,-9.1e-05,0.000181,0.000151,9.8e-05,-0.000285,1e-06,-0.000157,0.000133,7.3e-05
1.9e-05,0.000111,3.4e-05,-0.000142,-0.000241,-0.000254,4.3e-05,0.000235,-0.000171,0.000259,-9.1e-05,-2e-06,8.3e-05,-1e-06,3e-06,-4.1e-05,3.5e-05,-0.000131,0.000162,-2e-06,-0.000188,-1e-05,1.3e-05,-0.000231,0.000157,-3.8e-05,-0.000128,0.000116,-0.000268,-9.8e-05,-2.3e-05,-4.3e-05,0.000235,-2.2e-05,0.000194,1e-06,-0.000101,0.000183,1.5e-05,-0.000128,0.000186,-5e-06,-1.1e-05,-0.00011,0.000184,3.8e-05,-0.000162,0.000165,6.3e-05,0.000111,-9.1e-05,-5.3e-05,1e-05,0.000156,1.7e-05,8.1e-05,1.6e-05,8e-06,3e-05,-5.9e-05,4.1e-05,3.3e-05,-2.4e-05,-4.4e-05,2.3e-05,-9.8e-05,-1.5e-05,-1.5e-05,-0.00011,-2.5e-05,0.000291,-2.4e-05,-1e-06,0.000115,0.000114,-9.4e-05,-4.2e-05,-0.000138,8.7e-05,1.2e-05,6.6e-05,-0.000105,8.8e-05,-7e-06,-5.7e-05,5e-06,9.7e-05,2.9e-05,-3.9e-05,4.6e-05,2.9e-05,-0.00023,0.000151,2e-05,0.000182,9.4e-05,9.7e-05,2.3e-05,8e-05,8.5e-05,-0.000141,0.000144,-0.000116,-4.1e-05,-2e-05,-4e-06,-3.4e-05,-0.000144,-6.1e-05,-0.000113,3.1e-05,4.4e-05,0.000139,0.000228,-0.000157,4.3e-05,0.000214,-2.6e-05,0,-5.1e-05,-1.8e-05
7e-06,-2e-05,1.8e-05,0.000131,0.000257,-1.3e-05,-1.4e-05,-1.4e-05,0.000132,-0.000226,0.000317,0.000167,1.6e-05,3.1e-05,0.000128,-2.3e-05,-1.7e-05,3.5e-05,-0.000208,7.3e-05,0.000137,0.000105,2.5e-05,0.000122,-0.000116,0.00013,3.1e-05,-8.1e-05,7.4e-05,-2.8e-05,3e-05,3.6e-05,-0.000203,4.4e-05,-5.5e-05,0.000114,0.000112,-5.3e-05,5.6e-05,9.6e-05,-0.000265,0.000152,2.1e-05,-7.6e-05,-0.000199,7.4e-05,-0.000171,-8.8e-05,5.2e-05,-4.3e-05,8.5e-05,1.4e-05,-6.4e-05,-4.1e-05,3.7e-05,-7.4e-05,3e-05,0.000156,6e-05,5.2e-05,2e-06,-4.9e-05,-5.8e-05,3.1e-05,9e-06,6.3e-05,5.1e-05,-3e-05,5.3e-05,3.4e-05,-0.000183,-3e-05,-3.3e-05,3e-05,-9e-06,8.8e-05,-1e-05,0.000132,-1e-06,-0.00012,1.7e-05,-1e-06,7e-06,-7e-06,5.4e-05,-4.1e-05,-8.2e-05,1.7e-05,9.3e-05,1.6e-05,-3.5e-05,0.000252,6.6e-05,-5.7e-05,-0.000109,-1e-04,-0.000101,-0.000115,-6.1e-05,-7.7e-05,0.000197,-0.000108,8.7e-05,0.000105,-0.000129,-7.4e-05,2.3e-05,-2.3e-05,-4.7e-05,5.7e-05,-7e-05,-0.000103,-0.000208,-3.3e-05,-1.7e-05,-8.4e-05,-0.000137,1.5e-05,4.7e-05,-6.5e-05,5e-05
-5.8e-05,-9.8e-05,1.9e-05,-0.000103,-0.000213,0.000105,6.4e-05,-2.8e-05,2.1e-05,0.000187,-0.000254,-1.4e-05,-2.9e-05,-2.1e-05,-0.00017,-2.2e-05,-2.2e-05,-9.9e-05,0.000127,-6.9e-05,2.7e-05,3.4e-05,-6.8e-05,2.5e-05,-2.6e-05,1e-06,-9e-05,0.000107,0.000148,3.7e-05,-3.4e-05,-1.8e-05,0.000103,-1.5e-05,3.9e-05,-8.4e-05,-1.5e-05,8e-06,-8.9e-05,1.6e-05,0.000182,-6.7e-05,-7.3e-05,1.6e-05,0.000206,-7.7e-05,0.000204,-5.3e-05,2e-06,4.1e-05,3.4e-05,2.6e-05,0.000124,-6.6e-05,-9.9e-05,-6.2e-05,2.8e-05,-0.000115,2e-05,2.1e-05,-3e-05,0.00013,7.2e-05,-5.3e-05,-0.000112,-5.1e-05,-7e-06,6.4e-05,4.2e-05,1.9e-05,0.00017,6.4e-05,-2.5e-05,-0.000176,-6.2e-05,-3.3e-05,2.9e-05,-5.7e-05,-3e-05,5.4e-05,4.5e-05,1.1e-05,-5.2e-05,7.4e-05,-0.000131,-2.8e-05,-3.6e-05,2.1e-05,-9.4e-05,-3.2e-05,2e-06,-0.00013,-8.4e-05,-1e-05,2.1e-05,-2.6e-05,-6e-06,-4.1e-05,6e-05,-6.7e-05,-1e-04,0.000194,5.2e-05,-6.4e-05,5.2e-05,9.5e-05,7.2e-05,0.000192,2.2e-05,-7e-06,1.4e-05,4.3e-05,6.2e-05,-0.000219,0.00012,0.000115,0.00013,-1e-06,-4.1e-05,9.7e-05,-5.2e-05
5.1e-05,1.1e-05,-1.4e-05,7.9e-05,0.000115,-9.3e-05,-2e-05,-1.7e-05,-1.6e-05,-0.000183,9.5e-05,-5e-06,1.2e-05,1.8e-05,5.3e-05,0,-2.9e-05,0.000127,-4e-06,6e-05,-1.3e-05,-9.4e-05,6.6e-05,4.9e-05,0.000127,-3.7e-05,0.000123,-6.4e-05,-0.00016,-3.4e-05,2.4e-05,-2e-05,-1.8e-05,-1.4e-05,-4.9e-05,1.2e-05,4e-06,-9e-06,2.9e-05,-4.1e-05,-0.00013,1.3e-05,0.000113,7.6e-05,-9.2e-05,6.5e-05,-7e-05,6e-05,1e-05,2.4e-05,-6.7e-05,-1.4e-05,-0.000113,3.5e-05,4e-06,0.000141,-7e-05,6.6e-05,-3e-05,-2.6e-05,1.8e-05,-2.8e-05,-1.1e-05,-1.4e-05,5e-05,4.2e-05,7e-06,3.9e-05,-8.1e-05,-1.4e-05,-0.000133,-0.00012,-1.5e-05,6.2e-05,5.4e-05,-4e-06,1.2e-05,0.000114,-2.3e-05,-2.8e-05,-4.1e-05,4.4e-05,7.8e-05,-4.4e-05,9.1e-05,4e-05,3e-05,-9.2e-05,1.9e-05,7e-06,1.6e-05,1.1e-05,-2.5e-05,-3.7e-05,5.5e-05,-1.7e-05,1.5e-05,1.9e-05,0,0.000186,-1.8e-05,-0.000119,-0.000104,7.2e-05,3.2e-05,-7.5e-05,-0.000181,-0.000106,2e-06,-6.2e-05,2.1e-05,-2.5e-05,9.4e-05,7.4e-05,-3.2e-05,-0.000206,-7.4e-05,-1e-05,8.3e-05,-0.000144,4.9e-05
-4.5e-05,-4.9e-05,-2.1e-05,-6.6e-05,1.7e-05,0.000106,0,1.7e-05,-7e-06,0.000151,6e-06,-7.7e-05,-2e-05,-3.6e-05,4.6e-05,3.5e-05,6.7e-05,-6.9e-05,-6.9e-05,6e-06,3.6e-05,4.6e-05,-3e-05,-8.6e-05,-4e-05,2.4e-05,-6.4e-05,9e-06,3.9e-05,5.6e-05,-2e-05,8.1e-05,-4.7e-05,-1.7e-05,6.4e-05,2.7e-05,-4.8e-05,2.6e-05,1.9e-05,1.3e-05,0.00013,1e-05,-8e-05,-6.3e-05,-5.4e-05,-3.5e-05,-4.5e-05,-6e-06,-4.6e-05,-4.5e-05,1.3e-05,-3.1e-05,0.000128,2.9e-05,-1.8e-05,-0.000113,-7e-06,-3.4e-05,1.6e-05,-2.4e-05,-2.2e-05,-2.6e-05,-2.8e-05,2e-05,2.6e-05,-3.5e-05,-2.7e-05,-6.9e-05,2.4e-05,5.5e-05,6.4e-05,5.9e-05,5.2e-05,3.5e-05,7e-06,-2.5e-05,-1.6e-05,-9.6e-05,4.3e-05,3.6e-05,-6e-06,-4.3e-05,-2.6e-05,-7.6e-05,-1.5e-05,-5.8e-05,-1.6e-05,0.000103,2.2e-05,5e-06,-4e-06,-2e-06,-5.3e-05,2e-06,-3.4e-05,4.9e-05,-2.8e-05,3.3e-05,-1.9e-05,-0.000135,0.000115,0.000117,2.6e-05,-9.3e-05,-1e-06,5.1e-05,0.000199,-1.4e-05,0,9.4e-05,-1.3e-05,2.5e-05,-8e-05,3.8e-05,-7.7e-05,0.000181,-1.6e-05,0,-9.4e-05,0.000132,-2e-06
5e-05,-2e-06,5e-06,4.1e-05,-5.9e-05,-8.9e-05,6e-06,4.8e-05,3e-06,-8.9e-05,-5.1e-05,1e-05,-1.1e-05,3.6e-05,-8.9e-05,-1e-05,-2e-05,6.3e-05,8.5e-05,-1.5e-05,-7.5e-05,2.6e-05,7e-06,-5.6e-05,-4.3e-05,1.8e-05,4.3e-05,0,-4.9e-05,-3.8e-05,5e-06,-5.8e-05,8.4e-05,5.9e-05,-0.000103,-3.1e-05,5.4e-05,-2.8e-05,-8e-06,-4e-06,-0.000149,-5.4e-05,4e-05,-1.2e-05,8.4e-05,-1.9e-05,9.9e-05,-8e-06,5.3e-05,5.1e-05,2.9e-05,4.2e-05,-6.8e-05,-4.6e-05,1.2e-05,3.4e-05,0.000138,2.4e-05,-2.5e-05,2.7e-05,2.4e-05,-1.5e-05,3.3e-05,9e-06,-1.3e-05,5.1e-05,3.3e-05,1.9e-05,1.9e-05,-8e-05,-4.1e-05,1.1e-05,1.2e-05,2.2e-05,-2.9e-05,1e-06,-2.8e-05,2.4e-05,-9e-06,1.3e-05,3.5e-05,-1e-06,-2.8e-05,3.8e-05,6.3e-05,3.4e-05,-2.8e-05,-3.6e-05,-1.6e-05,-2e-05,3e-06,8e-06,5.5e-05,-4e-06,-9e-06,4e-05,3.5e-05,3.4e-05,1.3e-05,4.9e-05,-5e-05,-3.8e-05,2.8e-05,8.4e-05,-1.9e-05,-1.4e-05,-0.00012,4.4e-05,4e-06,-5.2e-05,-4e-06,-1.1e-05,8e-06,-2.6e-05,2e-05,-0.000158,8.4e-05,-1.3e-05,4.4e-05,-9.5e-05,-1.8e-05
-2.1e-05,5.2e-05,-1e-06,-5e-05,5.3e-05,1.9e-05,-1.8e-05,-7.5e-05,3.1e-05,7.2e-05,9.4e-05,7.1e-05,4.6e-05,-2.8e-05,8.4e-05,-2e-05,2.5e-05,-3.1e-05,-9.5e-05,1e-05,1.6e-05,-8e-06,-5e-06,2.9e-05,1.6e-05,-2.7e-05,-4.1e-05,1.7e-05,0.000104,1.1e-05,4.9e-05,-1.5e-05,-8.7e-05,1.5e-05,4.4e-05,6e-06,-4e-05,5e-05,-4e-06,2.4e-05,7.6e-05,5.6e-05,-2.5e-05,3.5e-05,-3.2e-05,4.4e-05,-4.7e-05,-6e-06,-5e-05,-8e-05,-5e-06,1e-06,-2.4e-05,1.6e-05,3.5e-05,5e-06,-5.3e-05,3.1e-05,2.8e-05,-2e-06,-2.1e-05,3.4e-05,-3.1e-05,-2.4e-05,6e-06,-4.7e-05,-3.1e-05,-2.5e-05,-1.7e-05,1.6e-05,1.9e-05,-5.3e-05,-2e-06,-2.1e-05,9e-06,9e-06,2.9e-05,9e-06,-1.7e-05,-6.2e-05,-3.1e-05,-4e-06,3.5e-05,2.9e-05,-2.4e-05,9e-06,1.9e-05,-1e-06,-1e-06,8e-06,1.3e-05,1.6e-05,4.3e-05,1.1e-05,-1.7e-05,-0.000162,-5.1e-05,-4e-06,-9e-06,-2e-06,0,-3.8e-05,1e-06,-8.7e-05,-1e-06,-8e-06,1.6e-05,-6e-06,1e-06,2.9e-05,1e-05,3.8e-05,-9e-06,-3.2e-05,4.6e-05,0.000128,-8.7e-05,8e-06,1.2e-05,5.1e-05,1e-05
-1.5e-05,1.2e-05,-1e-05,3.8e-05,-8.7e-05,4.8e-05,1.6e-05,3e-06,-4.6e-05,-5.4e-05,-6.5e-05,-7e-06,-1.3e-05,1.9e-05,-3.3e-05,4e-06,0,-1.4e-05,7.4e-05,-2.4e-05,4.1e-05,-1.1e-05,-1.9e-05,3.3e-05,3e-06,-1.3e-05,2.6e-05,-2.4e-05,-6.9e-05,1.3e-05,-0.000124,3.2e-05,5.8e-05,-1.5e-05,-4.4e-05,2.7e-05,3.5e-05,-3.8e-05,-2.1e-05,-1.7e-05,-5.5e-05,-2e-05,-8e-06,-3e-06,1.6e-05,-5.6e-05,2.1e-05,1.2e-05,7.6e-05,4.9e-05,-1.1e-05,-1.6e-05,1.8e-05,5e-06,0,1.6e-05,-2.1e-05,-5.2e-05,-5.3e-05,-5e-06,-3e-06,-1.4e-05,6e-06,3e-05,-2.4e-05,3.4e-05,6e-06,-7e-06,1.5e-05,1.1e-05,4.3e-05,4.6e-05,-4.3e-05,-4.2e-05,-4e-06,9e-06,2.3e-05,2.3e-05,2.3e-05,3.5e-05,-2.3e-05,3e-05,-2.3e-05,-2e-05,2e-05,-4e-05,4e-06,-3e-06,6e-06,1.2e-05,0,-3.5e-05,-8e-06,9e-06,4.3e-05,0.00012,4.1e-05,8e-06,6e-06,-1.3e-05,6.3e-05,5.7e-05,2.4e-05,4.9e-05,-3e-06,2.1e-05,8e-06,2.3e-05,-8e-06,-2.8e-05,-8e-06,-3.5e-05,2e-06,6.3e-05,-9e-06,-0.000133,6.8e-05,-4e-06,-4.2e-05,-1.5e-05,-5e-06
3.3e-05,-2.3e-05,5e-06,-1.7e-05,0.000119,-9.8e-05,-1.3e-05,7e-05,1.7e-05,5.2e-05,-5e-06,-2.6e-05,-3e-05,-1.9e-05,-2e-05,8e-06,-1.5e-05,4e-06,-2.1e-05,1.5e-05,1.5e-05,-1e-05,1.6e-05,1e-06,1e-06,2e-05,1.6e-05,7e-06,4e-05,-2.4e-05,7.4e-05,-7e-06,-3.8e-05,-2.3e-05,5e-06,-3.7e-05,-3.3e-05,1.1e-05,4e-05,3e-06,6e-05,7e-06,3.2e-05,-3.6e-05,-3.4e-05,5.6e-05,-5.1e-05,1e-06,-5.6e-05,-2.7e-05,-3e-06,2e-06,3.8e-05,2.5e-05,-1.6e-05,-7e-06,1e-05,2.3e-05,4.5e-05,1.2e-05,1e-05,-1.8e-05,2.7e-05,-8e-06,2.8e-05,-2.9e-05,1.8e-05,4.8e-05,5e-06,-9e-06,-6.4e-05,-2e-05,-9e-06,1.4e-05,1.5e-05,-2.1e-05,-3.5e-05,5e-06,-1.4e-05,-2e-05,1.5e-05,-3e-05,-4e-06,7.3e-05,-4.8e-05,4.4e-05,-1.7e-05,1.7e-05,1.5e-05,-4e-06,-3e-06,2.5e-05,-2.9e-05,6e-06,3e-06,7.3e-05,-1e-05,-7e-05,5e-06,-2.4e-05,-5.8e-05,-6.5e-05,-1.4e-05,1.1e-05,1e-06,-3.3e-05,1.9e-05,-8.5e-05,1e-06,3.4e-05,7e-06,3.3e-05,2.9e-05,-1.8e-05,-2.5e-05,8.8e-05,-1e-05,-6e-06,3.3e-05,-3.1e-05,1.3e-05
-3.2e-05,-1.3e-05,3e-06,1.7e-05,-7e-05,9e-05,1.5e-05,-5.5e-05,4e-06,-5.5e-05,2.4e-05,-1.1e-05,-6e-06,3e-06,4.2e-05,5e-06,-9e-06,3e-06,-4.1e-05,4e-06,-4.4e-05,8e-06,-1e-06,1.7e-05,-8e-06,-2e-05,-3.4e-05,6e-06,3e-06,1.3e-05,-2e-06,-2.3e-05,2e-05,1.1e-05,2.2e-05,3e-06,1.7e-05,4e-06,-2.5e-05,3e-06,-5.3e-05,-1e-06,-3.3e-05,1.4e-05,4.3e-05,-1.7e-05,4.9e-05,-1.5e-05,4e-05,1.5e-05,-1e-06,6e-06,-3.9e-05,-1.7e-05,2e-05,-3.9e-05,-4.3e-05,-1.3e-05,-1e-06,-1.4e-05,5e-06,3e-06,-2.7e-05,7e-06,-6e-06,3.1e-05,-1.8e-05,-1.6e-05,-2.7e-05,3.2e-05,4.4e-05,-3e-06,3e-05,4.5e-05,-1.4e-05,4e-06,-1.1e-05,-2.9e-05,3.8e-05,2.2e-05,1.7e-05,5e-06,1.9e-05,-5.9e-05,1.2e-05,-9e-06,5.2e-05,-1.3e-05,-3.6e-05,-1e-06,9e-06,-6e-06,-1e-05,6e-06,-2.2e-05,-0.000136,-4e-06,3.9e-05,-4e-06,7.1e-05,-2.4e-05,4.7e-05,-4.8e-05,-1.4e-05,2e-06,3.2e-05,-5.9e-05,3e-06,8e-06,-4.9e-05,-3e-06,-3.4e-05,-2e-06,-4.9e-05,2.3e-05,-6e-05,-4.3e-05,1e-06,7e-06,4.8e-05,-1e-05
3.8e-05,0,1.4e-05,-1.4e-05,0,-4e-05,3e-06,-6e-06,6e-06,4.6e-05,7e-06,8e-06,2.7e-05,8e-06,-3.3e-05,-9e-06,6e-06,2.1e-05,6.7e-05,-1e-06,2e-05,-1e-06,0,-3.3e-05,1e-05,-1.3e-05,3e-06,7e-06,-5.7e-05,-6e-06,1.6e-05,2.7e-05,-7e-06,4e-06,4e-06,2.2e-05,-1.8e-05,-1e-06,-1.3e-05,-1.6e-05,6.4e-05,4e-06,3.4e-05,2.3e-05,-4.9e-05,-9e-06,-2e-05,1.3e-05,-3e-05,2.1e-05,2.8e-05,2.2e-05,1.6e-05,-3.4e-05,-5.5e-05,7e-05,6.6e-05,5e-06,-3.7e-05,-8e-06,-5e-06,2.7e-05,1e-05,-1.1e-05,-1.9e-05,-3.1e-05,4e-06,-8e-06,-1e-06,-1.8e-05,-3.1e-05,3.1e-05,5e-06,-2.9e-05,1.3e-05,9e-06,2.6e-05,-9e-06,-5.4e-05,5e-06,1.7e-05,-4e-06,-1e-05,4e-06,-9e-06,-5e-06,-5.8e-05,1.1e-05,4.1e-05,3e-06,0,2.8e-05,9e-06,0,-1.5e-05,2.5e-05,6e-06,-5e-06,-2e-06,-8.4e-05,2.8e-05,-4.7e-05,5.3e-05,-5e-06,2e-06,-3.8e-05,6.7e-05,6e-05,0,3.6e-05,-7e-06,1.4e-05,-7.2e-05,1.1e-05,-1e-06,2.3e-05,5.6e-05,-3e-06,-2.8e-05,-3.7e-05,9e-06
-3.5e-05,-5e-06,-2e-06,1.1e-05,3.7e-05,-1.4e-05,-5e-06,1.7e-05,-1e-06,-3.7e-05,-3.3e-05,2.3e-05,-2.4e-05,-1.1e-05,1.8e-05,-1e-06,-1.6e-05,-1.7e-05,-5.5e-05,9e-06,-4.4e-05,-4e-06,8e-06,1.6e-05,-2e-06,2.9e-05,8e-06,-7e-06,9.6e-05,5e-06,1e-06,-1.4e-05,7e-06,-1.3e-05,2e-06,-9e-06,1.2e-05,-9e-06,2.1e-05,2.1e-05,-3.6e-05,-5e-06,-2.3e-05,-2e-05,6.2e-05,1.5e-05,-3.8e-05,4e-06,3.6e-05,-3e-05,-1.3e-05,-2.3e-05,1.2e-05,4.3e-05,5.4e-05,-5.4e-05,-2.2e-05,9e-06,8.2e-05,1.3e-05,2e-06,-2e-06,1e-06,3e-06,6e-06,2.2e-05,4e-06,-7e-06,2.1e-05,-7e-06,2.7e-05,-3.4e-05,9e-06,-1.1e-05,-1.3e-05,1.2e-05,7e-06,-1.9e-05,4.2e-05,-1.9e-05,-1.3e-05,2.2e-05,-1e-06,-5e-06,-3e-06,0,6.3e-05,-2.7e-05,-2.6e-05,-4e-06,-2e-06,-5.8e-05,1e-05,-2e-06,3.6e-05,8.6e-05,1e-06,3.5e-05,1e-06,4.7e-05,-1.9e-05,3.9e-05,-1.7e-05,-1.7e-05,-5e-06,2e-05,-1.9e-05,-1.9e-05,1e-06,-1.6e-05,-4e-06,-1.1e-05,8.7e-05,4.3e-05,4e-06,-2e-06,-4.5e-05,-3e-06,2.9e-05,1.6e-05,-1.1e-05
1e-05,0,-4e-06,-2e-06,-1.2e-05,3.2e-05,7e-06,-2e-06,-1.3e-05,2.6e-05,6.5e-05,-6e-06,2.9e-05,1.7e-05,4e-06,5e-06,1.5e-05,1.6e-05,4.5e-05,-8e-06,4.1e-05,-7e-06,-1.8e-05,1.2e-05,9e-06,-2e-06,-3e-06,-6e-06,-6.9e-05,-6e-06,-5.7e-05,-9e-06,-8e-06,-3e-06,2.9e-05,1.1e-05,-1.7e-05,1.4e-05,-1.2e-05,6e-06,4.7e-05,-1e-06,8e-06,-7e-06,-6.9e-05,-3.1e-05,7.5e-05,-1.3e-05,-2.3e-05,3e-05,4e-06,7e-06,-4.6e-05,-8e-06,-3e-05,1.5e-05,-2e-06,-8e-06,-0.000107,8e-06,6e-06,-2.1e-05,-6e-06,2e-06,-6e-06,-2.1e-05,2e-06,-4e-06,-7e-06,7e-06,-1.4e-05,7e-06,-2.2e-05,-1e-06,-3e-06,-1.1e-05,-1.3e-05,2.4e-05,-2.2e-05,1e-06,-1.9e-05,-1.3e-05,8e-06,-3.4e-05,2e-05,-1.4e-05,-5.2e-05,2.7e-05,3e-06,-4e-06,-3e-06,4.2e-05,6e-06,-5e-06,-3.5e-05,-8e-05,-4e-06,-1.4e-05,-1e-06,5e-06,-1.5e-05,-3e-05,0,4.2e-05,8e-06,1.3e-05,-4.3e-05,-2.7e-05,4e-06,-2e-06,7e-06,1e-05,-3.5e-05,-3.1e-05,-1.3e-05,-7e-06,3.2e-05,6e-06,-2.3e-05,1e-05,4e-06
1e-05,1.9e-05,1e-06,-1e-06,-2.9e-05,-2.5e-05,-1.3e-05,7e-06,1.2e-05,-1.7e-05,-9.7e-05,-8e-06,-5e-06,-1.7e-05,-2.4e-05,3e-06,4e-06,-4.1e-05,-2e-05,2e-06,1.6e-05,1.6e-05,6e-06,1e-06,-2.9e-05,-1.5e-05,1.2e-05,1.3e-05,4.8e-05,4e-06,5.4e-05,1.8e-05,5e-06,6e-06,-1.1e-05,9e-06,1.8e-05,-1.5e-05,4e-06,-1.9e-05,-5.8e-05,5e-06,1e-05,1.5e-05,6.6e-05,2.3e-05,-4.9e-05,6e-06,1.5e-05,-2.4e-05,0,-1e-06,4.1e-05,-2.7e-05,1.2e-05,1e-05,8e-06,-2e-06,0.000105,-6e-06,-3e-06,6e-06,1e-05,-1.6e-05,1.2e-05,2.7e-05,-1.2e-05,2.7e-05,-4e-06,-9e-06,1.2e-05,9e-06,0,7e-06,7e-06,-6e-06,-1.2e-05,-1.4e-05,2.2e-05,-1.1e-05,1e-05,-5e-06,-5e-06,4.3e-05,-6e-06,2.3e-05,2.8e-05,-1.1e-05,1.3e-05,3e-06,4e-06,6e-06,-9e-06,-3e-06,2.7e-05,9e-06,-3e-06,-1.3e-05,1e-06,-2.5e-05,3.2e-05,1e-05,5e-06,-2.9e-05,-1e-06,-4.6e-05,5.3e-05,2e-05,3e-06,1e-05,3e-06,-9e-06,-1.4e-05,-9e-06,-1e-06,2.2e-05,-1.4e-05,-5e-06,1.2e-05,-2.8e-05,7e-06
-1.8e-05,1.2e-05,-1e-06,2e-06,2.7e-05,3.2e-05,6e-06,-2.8e-05,0,5e-06,8.1e-05,-7e-06,1e-05,1.4e-05,2.9e-05,-1e-06,-5e-06,3.2e-05,-1.6e-05,-4e-06,-2.5e-05,-4e-06,4e-06,3e-06,2.5e-05,1.9e-05,-2e-05,-7e-06,-4.1e-05,1e-06,-2.7e-05,-7e-06,-4e-06,7e-06,3e-06,-1.9e-05,-1.4e-05,5e-06,-4e-06,1e-06,2.5e-05,-6e-06,-2e-05,4e-06,-5.6e-05,-7e-06,6e-06,4e-06,-5e-06,7e-06,0,2e-06,-7e-06,3.1e-05,3e-06,-6e-06,-2.5e-05,8e-06,-9.2e-05,-4e-06,-3e-06,3e-06,-8e-06,1.6e-05,-3e-06,-2.7e-05,1.4e-05,1e-06,1.1e-05,3e-06,-1e-05,-1.9e-05,-5e-06,2.6e-05,-4e-06,1e-06,1e-05,2e-05,-3.8e-05,2.1e-05,1e-06,-2e-06,-4e-06,0,2e-05,-2e-05,-2.4e-05,-2e-06,-1.8e-05,0,-3e-06,-3.6e-05,-2e-06,-2e-06,-1.7e-05,1.1e-05,8e-06,-1.1e-05,0,1.3e-05,-1.4e-05,8e-06,-3.1e-05,2.2e-05,-3e-06,4.7e-05,-1.6e-05,2.5e-05,1e-06,-2e-06,-2e-06,1e-05,1.2e-05,1.9e-05,6e-06,-1.7e-05,-1.1e-05,8e-06,1e-06,4.1e-05,-7e-06
2.5e-05,-2e-05,1e-06,-4e-06,-2e-05,-2.8e-05,-4e-06,3.3e-05,-7e-06,1e-06,-3.2e-05,9e-06,-2.8e-05,-1e-05,-2.2e-05,-2e-06,5e-06,-1.5e-05,4e-05,-3e-06,2e-06,-4e-06,-2e-06,-2.9e-05,7e-06,-3e-06,5e-06,-1e-06,8e-06,-1e-05,5e-06,-1.5e-05,3e-06,-1.1e-05,-1.1e-05,-2e-06,1.3e-05,5e-06,-3e-06,9e-06,-1.3e-05,6e-06,1.9e-05,-1.5e-05,3.9e-05,-4e-06,2.6e-05,-5e-06,-6e-06,9e-06,4e-06,-1.1e-05,-6e-06,7e-06,-3e-05,-3e-06,1.2e-05,-7e-06,6.2e-05,1e-06,-2e-06,4e-06,-5e-06,-9e-06,-8e-06,1.9e-05,-3e-06,-2e-05,-1e-05,9e-06,3e-06,2e-05,6e-06,-3.3e-05,-4e-06,6e-06,1.2e-05,-3.7e-05,3.2e-05,-5e-06,-5e-06,1.2e-05,5e-06,-1e-06,-1.5e-05,4e-06,1.3e-05,-5e-06,1.8e-05,-1e-06,-3e-06,3e-05,2e-06,1e-06,1.6e-05,1.6e-05,-2e-06,3e-06,-1e-06,2.2e-05,-1.4e-05,-9e-06,2.7e-05,-3e-05,-2e-06,-1.9e-05,-1.7e-05,-3.3e-05,0,2e-06,-4e-06,-7e-06,3e-06,4e-06,5e-06,7e-06,2.9e-05,0,-1.5e-05,-4e-05,7e-06
-2.7e-05,-1e-05,-3e-06,4e-06,7e-06,1e-05,6e-06,-1e-06,-1e-06,-1.1e-05,-4e-06,1e-05,1.6e-05,7e-06,8e-06,0,-1e-06,2.1e-05,-4.6e-05,9e-06,-1.1e-05,-1e-06,1e-06,-4e-06,-3.1e-05,-1.2e-05,1.9e-05,-2e-06,1.1e-05,1.2e-05,2.3e-05,2e-05,-4e-06,-3e-06,-8e-06,7e-06,-1.2e-05,-1e-05,9e-06,0,1.6e-05,-3e-06,-1.4e-05,4e-06,-2.4e-05,2.4e-05,-3.3e-05,-1e-06,1.4e-05,-1.8e-05,-3e-06,-1e-06,-9e-06,-2.9e-05,3.3e-05,-8e-06,-1.5e-05,4e-06,-3.3e-05,-4e-06,6e-06,-7e-06,1.7e-05,1.1e-05,9e-06,-1.4e-05,-5e-06,2e-06,-1e-06,-1.1e-05,-9e-06,-5e-06,1.2e-05,0,6e-06,-5e-06,-1.1e-05,3.9e-05,-1.6e-05,9e-06,7e-06,-4e-06,-2e-06,1e-05,4e-06,1.3e-05,-1.3e-05,1.6e-05,-1.5e-05,2e-06,0,-2.5e-05,3e-06,0,-1.5e-05,1e-06,-2e-06,1.4e-05,1e-06,-4.4e-05,2.8e-05,1.1e-05,5e-06,2.9e-05,4e-06,-1.2e-05,1.8e-05,1.3e-05,0,-4e-06,-3e-06,-3e-06,-1.4e-05,-2.3e-05,-4e-06,1.2e-05,-3.7e-05,3e-06,2.4e-05,3.5e-05,-6e-06
1.9e-05,9e-06,-1e-06,-1e-05,1.9e-05,2e-06,4e-06,-2.9e-05,6e-06,1.5e-05,3.3e-05,-1e-05,-2e-05,-3e-06,1e-05,4e-06,-5e-06,-1.4e-05,3.4e-05,0,1.4e-05,8e-06,-3e-06,2.1e-05,2.8e-05,9e-06,-3e-05,6e-06,-1.9e-05,-4e-06,-2.3e-05,-6e-06,6e-06,6e-06,-9e-06,-9e-06,1.6e-05,6e-06,-4e-06,-2e-06,-9e-06,0,1e-05,1e-05,1.9e-05,-2.7e-05,1.2e-05,4e-06,-1.2e-05,2.2e-05,-4e-06,1e-06,2.9e-05,9e-06,-2.4e-05,2.7e-05,2.5e-05,-1e-06,1e-05,5e-06,-5e-06,2e-06,-6e-06,-1.5e-05,-1e-06,1.6e-05,4e-06,-3e-06,8e-06,1.2e-05,2.6e-05,-1e-05,-1e-06,3e-06,0,-3e-06,-9e-06,-2e-05,1.2e-05,-1.1e-05,5e-06,-2e-06,-4e-06,-2.2e-05,-1.3e-05,-1.8e-05,1.6e-05,-1e-05,1.1e-05,0,0,2.6e-05,-7e-06,1e-06,-2e-06,-4.6e-05,1e-06,6e-06,-1e-06,4.5e-05,-6e-06,4e-06,-8e-06,-2.2e-05,-1e-06,3e-05,1.8e-05,-6e-06,-1e-06,1e-05,6e-06,3e-06,2.4e-05,1e-05,-3e-06,-7e-06,3.3e-05,0,-2e-05,-2.6e-05,2e-06
-4e-06,4e-06,0,1e-05,-5.3e-05,-6e-06,-8e-06,2.2e-05,-1e-06,-1.8e-05,-6.3e-05,-3e-06,2.1e-05,-1e-06,-2.5e-05,0,2e-06,-1e-06,-1.8e-05,1e-06,1e-06,-8e-06,-1e-06,-2e-06,0,6e-06,2.7e-05,-3e-06,3.2e-05,-3e-06,1.3e-05,-7e-06,-3e-06,5e-06,-1.2e-05,6e-06,-8e-06,-4e-06,-3e-06,-5e-06,-7e-06,-1e-06,0,-7e-06,-1.9e-05,2.1e-05,-3e-06,0,1e-05,-1.6e-05,2e-06,7e-06,-3.4e-05,6e-06,2.9e-05,-2.8e-05,-3e-06,-7e-06,8e-06,3e-06,0,4e-06,-6e-06,1.7e-05,4e-06,-2e-05,3e-06,6e-06,-2e-06,-7e-06,-2.9e-05,1.5e-05,-5e-06,1.3e-05,-6e-06,2e-06,8e-06,4.1e-05,-2.4e-05,-6e-06,1e-06,-3e-06,8e-06,-1.4e-05,5e-06,1.6e-05,-1.4e-05,-5e-06,-6e-06,-3e-06,-3e-06,-1.7e-05,-2e-06,0,1.5e-05,4.6e-05,1e-06,-3e-06,-1e-06,-2.3e-05,-1.1e-05,-9e-06,0,1.7e-05,-1e-06,-2.2e-05,-5.4e-05,1.2e-05,-3e-06,-1.1e-05,2e-06,-1.1e-05,-2.4e-05,1.3e-05,8e-06,1.3e-05,-1.7e-05,-1e-06,7e-06,5e-06,4e-06
-6e-06,-2e-06,0,-1e-05,6.3e-05,9e-06,5e-06,-2e-06,-2e-06,1.6e-05,6.2e-05,2e-06,-1.2e-05,3e-06,2.5e-05,-2e-06,0,-5e-06,-2e-06,-2e-06,5e-06,-5e-06,0,1e-06,-1.6e-05,-1.2e-05,-2.6e-05,0,-5.6e-05,1e-06,-2.3e-05,1e-05,-6e-06,-5e-06,1.5e-05,4e-06,1.1e-05,2e-06,4e-06,2e-06,1.2e-05,1e-06,-1.1e-05,-4e-06,1.3e-05,-1.4e-05,6e-06,-3e-06,-1e-05,6e-06,2e-06,-1.1e-05,2.1e-05,-9e-06,-3e-06,1.1e-05,-1.8e-05,1e-05,-2.1e-05,-5e-06,-1e-06,-2e-06,2e-06,-1.4e-05,-5e-06,1.7e-05,-8e-06,3e-06,-6e-06,-3e-06,2.4e-05,-1.4e-05,-1.6e-05,2e-06,-1e-06,5e-06,6e-06,-4.1e-05,1.9e-05,1.3e-05,-7e-06,8e-06,-3e-06,2.9e-05,-1e-06,-6e-06,1.4e-05,7e-06,1e-06,0,-1e-06,-6e-06,1e-05,1e-06,-5e-06,2.7e-05,-1e-06,-1.1e-05,2e-06,-6e-06,2.1e-05,1e-05,-2e-06,-5e-06,0,8e-06,5.2e-05,3e-06,-3e-06,3e-06,-1e-06,3e-06,2e-06,-4e-06,0,-8e-06,-6e-06,-2e-06,5e-06,1.2e-05,-6e-06
1.2e-05,1e-06,1e-06,1.1e-05,-4.2e-05,-1.2e-05,-5e-06,-8e-06,-1e-06,-1.6e-05,-3.6e-05,1e-06,2.4e-05,-4e-06,-1.1e-05,0,-4e-06,2e-06,2.4e-05,-2e-06,-2.1e-05,2e-06,0,-1.2e-05,7e-06,1e-06,1.8e-05,-1e-06,5e-05,0,0,-1e-06,1.3e-05,-2e-06,-1.2e-05,-7e-06,-1.2e-05,-4e-06,-5e-06,2e-06,-7e-06,-1e-06,1.4e-05,6e-06,-2e-06,-5e-06,0,2e-06,9e-06,1e-06,0,9e-06,3e-06,8e-06,-1.1e-05,3e-06,1.1e-05,-6e-06,3.1e-05,-3e-06,5e-06,-4e-06,-2e-06,1.1e-05,-4e-06,-1.4e-05,3e-06,-5e-06,3e-06,3e-06,-2.4e-05,4e-06,7e-06,-1.8e-05,5e-06,-2e-06,-6e-06,2.4e-05,0,-1e-05,-8e-06,-4e-06,-3e-06,-1.4e-05,4e-06,-3e-06,-2e-06,1e-06,6e-06,-1e-06,1e-06,1.4e-05,-1e-06,0,-6e-06,-7.7e-05,1e-06,2e-06,-1e-06,1.7e-05,-8e-06,-1.2e-05,1e-06,0,1e-06,7e-06,-1.8e-05,-3.5e-05,-1e-06,3e-06,-4e-06,-3e-06,2.1e-05,-1.2e-05,-6e-06,9e-06,2e-05,0,-9e-06,-2.5e-05,4e-06
-1.6e-05,2e-06,1e-06,-1.2e-05,5e-06,1.7e-05,3e-06,4e-06,1e-06,1.7e-05,2.1e-05,6e-06,-2.3e-05,4e-06,-7e-06,0,6e-06,1.1e-05,-3.3e-05,0,1.2e-05,6e-06,2e-06,-1e-06,7e-06,9e-06,0,4e-06,-3.1e-05,4e-06,3.8e-05,-7e-06,-1.5e-05,6e-06,2.6e-05,2e-06,1e-05,8e-06,5e-06,1e-06,1.4e-05,1e-06,-1.3e-05,0,-9e-06,1.8e-05,-1.1e-05,2e-06,-6e-06,-1.1e-05,1e-06,-4e-06,-1.4e-05,-4e-06,8e-06,4e-06,-1.2e-05,2e-06,-3.4e-05,4e-06,-4e-06,5e-06,9e-06,-1.5e-05,7e-06,1.3e-05,3e-06,-4e-06,1e-06,-3e-06,2e-05,5e-06,8e-06,-4e-06,-5e-06,-2e-06,-7e-06,-3.6e-05,-9e-06,1.4e-05,6e-06,-1e-06,6e-06,1.3e-05,4e-06,7e-06,-6e-06,-4e-06,-1.3e-05,1e-06,-1e-06,0,-1e-06,0,4e-06,3.7e-05,-3e-06,0,0,-9e-06,-1.4e-05,7e-06,1.1e-05,-2e-06,0,-1.2e-05,-6e-06,2.9e-05,-1e-06,-1e-05,-1e-06,3e-06,-2.4e-05,1.2e-05,-1e-06,-1e-06,-2.4e-05,-4e-06,5e-06,3.2e-05,0
1.5e-05,-2e-06,1e-06,1.4e-05,2.3e-05,-2e-05,-2e-06,-2e-06,3e-06,-1.8e-05,-1e-05,-8e-06,1.7e-05,-3e-06,2.1e-05,0,-2e-06,-7e-06,3.1e-05,-1e-06,3e-06,1e-06,-1e-06,1.8e-05,-1e-05,-1.1e-05,-1e-05,-2e-06,1.7e-05,-6e-06,-2.9e-05,8e-06,1.4e-05,3e-06,-6e-06,1e-06,-1.1e-05,-1.2e-05,0,1e-06,-1.7e-05,1e-06,1e-05,-7e-06,1.9e-05,-2.3e-05,2.1e-05,-2e-06,3e-06,1.1e-05,-3e-06,1e-05,6e-06,6e-06,-2e-05,-1.5e-05,1.5e-05,0,3.4e-05,3e-06,2e-06,-2e-06,-2e-06,1.8e-05,-3e-06,-1.5e-05,-5e-06,2e-06,-1e-06,2e-06,-8e-06,-1e-05,7e-06,1.5e-05,2e-06,0,4e-06,4e-05,2e-06,-8e-06,3e-06,-2e-06,-5e-06,1e-05,-2e-06,-1.1e-05,1.6e-05,-5e-06,1.4e-05,3e-06,-1e-06,-1.4e-05,-7e-06,0,2e-06,4e-05,5e-06,9e-06,0,-9e-06,1.2e-05,-8e-06,-1e-05,-5e-06,0,6e-06,-2e-06,7e-06,-2e-06,6e-06,4e-06,-5e-06,8e-06,3e-06,5e-06,-1e-05,2.2e-05,2e-06,1e-06,-2.5e-05,-4e-06
-9e-06,-3e-06,2e-06,-1.3e-05,-3.6e-05,1.5e-05,1e-06,1.1e-05,-5e-06,2e-05,-1.2e-05,-2e-06,-2.3e-05,2e-06,-2.4e-05,1e-06,1e-06,8e-06,-2.1e-05,2e-06,-1e-06,-2e-06,-1e-06,-4e-06,2e-06,0,6e-06,0,-4e-06,3e-06,1.8e-05,-2e-06,-1.1e-05,-2e-06,1.8e-05,-6e-06,8e-06,1.3e-05,-4e-06,-7e-06,1.9e-05,-2e-06,-4e-06,4e-06,-2.6e-05,2e-05,-1.9e-05,0,2e-06,-9e-06,1e-06,-1e-05,5e-06,2e-06,1.1e-05,7e-06,-6e-06,-5e-06,-2.9e-05,0,-1e-06,0,-1e-05,-1.8e-05,0,1.4e-05,-2e-06,-4e-06,3e-06,3e-06,-4e-06,1e-05,-5e-06,2e-06,6e-06,4e-06,6e-06,-3.7e-05,0,-2e-06,-3e-06,6e-06,-1e-06,-3.2e-05,3e-06,1.2e-05,-2.2e-05,6e-06,-9e-06,-1e-06,1e-06,1.3e-05,-5e-06,-1e-06,-3e-06,-5.8e-05,-5e-06,0,0,2.1e-05,-1e-06,0,-4e-06,1.3e-05,-1e-06,6e-06,3.3e-05,-2.4e-05,-1e-06,-2e-06,2e-06,1.1e-05,1e-06,-6e-06,2e-06,2e-05,-1.6e-05,-3e-06,-3e-06,1.5e-05,6e-06
2e-06,1e-06,0,1.3e-05,4e-05,-2e-06,2e-06,-1.1e-05,1e-06,-2.1e-05,2e-05,3e-06,1.9e-05,0,1.5e-05,-1e-06,0,-1.5e-05,5e-06,2e-06,3e-06,-1e-06,-1e-06,-4e-06,9e-06,1.2e-05,4e-06,0,-8e-06,2e-06,-1.9e-05,-6e-06,4e-06,-2e-06,-1.1e-05,3e-06,-1e-05,-1.2e-05,3e-06,2e-06,-2.2e-05,1e-06,-2e-06,5e-06,3.1e-05,-7e-06,3e-06,1e-06,-7e-06,5e-06,0,6e-06,-9e-06,-1.9e-05,0,1.2e-05,-1e-06,4e-06,2.1e-05,-2e-06,4e-06,-2e-06,5e-06,1.6e-05,-1e-06,-1.1e-05,6e-06,7e-06,-2e-06,-2e-06,1.7e-05,-3e-06,-9e-06,-4e-06,-1e-05,-1e-06,-3e-06,3e-05,1.2e-05,4e-06,5e-06,-2e-06,4e-06,1.2e-05,-6e-06,-8e-06,2.2e-05,1e-06,1e-06,-3e-06,2e-06,-1e-06,1.1e-05,0,2e-06,1.1e-05,0,-3e-06,1e-06,-2e-05,-1e-05,8e-06,6e-06,-1.4e-05,0,-1.4e-05,-5.3e-05,1.2e-05,1e-06,-2e-06,-1e-06,-1.1e-05,0,-3e-06,-1e-06,-3.4e-05,5e-06,2e-06,2e-06,-5e-06,-4e-06
5e-06,0,0,-1.4e-05,-2.2e-05,-1.2e-05,-3e-06,2e-06,3e-06,2.4e-05,-1.2e-05,3e-06,-2.1e-05,-1e-06,3e-06,0,1e-06,9e-06,1.2e-05,0,-1.4e-05,6e-06,-1e-06,-7e-06,-8e-06,-7e-06,-1.4e-05,2e-06,2.3e-05,-4e-06,-6e-06,6e-06,5e-06,4e-06,1.1e-05,0,9e-06,1e-05,1e-06,5e-06,2e-05,1e-06,6e-06,-6e-06,-3.3e-05,-7e-06,1.1e-05,-1e-06,1e-05,3e-06,3e-06,-3e-06,1e-06,1.2e-05,-2e-06,-2e-05,7e-06,-2e-06,-1.4e-05,-4e-06,-5e-06,4e-06,4e-06,-1.5e-05,1e-06,1.1e-05,-3e-06,0,-3e-06,0,-3.1e-05,-1e-06,0,-7e-06,5e-06,-3e-06,-5e-06,-4.2e-05,-2e-05,-5e-06,5e-06,-2e-06,-3e-06,-6e-06,2e-06,-1e-06,-2.1e-05,-5e-06,5e-06,2e-06,-1e-06,-9e-06,6e-06,0,-3e-06,2.8e-05,3e-06,-6e-06,0,6e-06,9e-06,-1.7e-05,-1e-06,1.2e-05,0,6e-06,4.1e-05,3e-06,2e-06,3e-06,-2e-06,1e-05,-9e-06,1.1e-05,0,4.4e-05,9e-06,-1e-06,-1e-06,-1.4e-05,0
-1.1e-05,0,-1e-06,1.3e-05,-9e-06,1.9e-05,2e-06,9e-06,-3e-06,-2.5e-05,1.6e-05,0,2.3e-05,2e-06,-1.8e-05,0,-4e-06,-9e-06,-2.6e-05,-1e-06,9e-06,-2e-06,1e-06,-3e-06,-2e-06,-6e-06,2.7e-05,-1e-06,-4.1e-05,2e-06,2.4e-05,2e-06,-9e-06,-3e-06,-2.5e-05,0,-8e-06,-1e-05,2e-06,-2e-06,-2.4e-05,-2e-06,-1e-05,-1e-06,3.4e-05,1.9e-05,-1.5e-05,-1e-06,-1.1e-05,-8e-06,-1e-06,4e-06,1.6e-05,9e-06,1.2e-05,1.1e-05,-1.1e-05,-1e-06,9e-06,1e-06,2e-06,0,-4e-06,1.8e-05,3e-06,-1.2e-05,-4e-06,-2e-06,1e-06,2e-06,3.8e-05,5e-06,1e-06,-8e-06,5e-06,0,1e-06,4.2e-05,1.3e-05,7e-06,-4e-06,-2e-06,0,-6e-06,-3e-06,1e-05,1.8e-05,-2e-06,-8e-06,1e-06,1e-06,1.5e-05,-6e-06,1e-06,1.3e-05,-1.7e-05,-3e-06,1e-06,0,1e-05,4e-06,2.5e-05,4e-06,-1.8e-05,0,9e-06,-1e-05,0,1e-06,1e-06,0,-7e-06,1.8e-05,-1e-06,0,-5.8e-05,-2.1e-05,2e-06,0,2.7e-05,5e-06
