-1e-06,-8e-06,-0.000112,-0.000413,-0.001954,-0.004832,-0.000973,-0.000169,-0.00118,-0.005368,-0.004937,-0.007267,-0.086334,-0.176966,-0.181323,-0.179324,-0.179031,-0.169264,-0.122105,-0.078989,-0.035564,-0.011675,-0.000472,-0.000278,-0.001323,-0.00145,-0.000794,-8e-05
-2e-06,4e-06,5.8e-05,4.6e-05,-0.001149,-0.002914,-0.000566,-5.5e-05,-0.000683,-0.003967,-0.003278,0.001681,0.026085,0.077329,0.117143,0.070819,0.114836,0.135662,0.1115,0.059543,0.03412,0.015292,0.001778,-3.2e-05,-0.001363,-0.001549,-0.000786,9e-06
-1e-06,0,7e-06,7.2e-05,-0.000761,-0.002623,-0.000583,2.1e-05,0.000291,0.001899,0.00196,0.000864,0.015808,0.026578,0.017307,-0.012541,0.00452,0.005524,-0.007047,-0.002504,-0.001466,0.000185,0.001185,0.000477,-8.9e-05,-0.000136,-7.4e-05,0
2e-06,3e-06,1.9e-05,0.000176,0.00136,0.002863,0.000476,0.000105,0.001065,0.005272,0.00435,-0.002561,-0.045886,-0.103979,-0.120709,-0.05504,-0.103346,-0.133812,-0.098689,-0.053381,-0.033126,-0.013508,0.000722,0.001005,0.001028,0.001111,0.000577,4.4e-05
1e-06,8e-06,6.5e-05,0.000197,0.00178,0.00517,0.001149,8.9e-05,0.000326,0.001314,0.000945,0.00032,0.013728,0.072524,0.115053,0.139033,0.120741,0.123093,0.100617,0.064942,0.031469,0.011228,0.002183,0.001023,0.000893,0.000917,0.000517,7.6e-05
-6e-06,-7e-06,-8.7e-05,-0.000325,-0.001093,-0.002082,-0.000277,-0.000105,-0.001003,-0.004365,-0.003699,-0.00242,0.009409,0.051469,0.068835,0.008017,0.038871,0.056466,0.022821,0.009294,0.011133,0.005714,0.000757,0.000173,-0.000399,-0.000477,-0.000256,-3.7e-05
-6e-06,-3e-06,-5e-06,-0.000121,-0.000781,-0.001932,-0.000399,-9.9e-05,-0.000471,-0.002762,-0.002394,-0.0038,-0.046783,-0.121961,-0.159866,-0.158854,-0.148414,-0.159854,-0.115296,-0.077773,-0.039642,-0.014655,-0.001144,-0.000253,-0.000848,-0.000903,-0.000527,-6.9e-05
1e-06,8e-06,8.6e-05,0.000251,0.000262,0.000423,5e-05,2.9e-05,0.000505,0.002045,0.001946,0.002172,0.012701,-0.002714,-0.015539,0.009792,0.018066,0.044795,0.058551,0.039428,0.01532,0.004511,0.000422,0.000134,6.4e-05,6.6e-05,3.1e-05,2.8e-05
4e-06,1e-06,-2.5e-05,6.8e-05,8.1e-05,-0.000401,-0.000189,6.5e-05,0.000468,0.003053,0.002718,0.003244,0.047829,0.094632,0.112509,0.091865,0.101012,0.111869,0.066836,0.048344,0.024415,0.009631,0.000772,0.000343,0.000618,0.000661,0.000383,4.1e-05
4e-06,1e-06,-4e-06,1.3e-05,0.000509,0.00112,0.000189,8.3e-05,2.7e-05,9.8e-05,-0.000198,-0.00263,-0.03696,-0.049874,-0.034519,9.7e-05,-0.038325,-0.101542,-0.087239,-0.054755,-0.02741,-0.010966,-0.000797,0.000217,0.000212,0.000218,0.000127,2.7e-05
2e-06,3e-06,1.3e-05,-9.6e-05,-0.000341,-0.000334,7.7e-05,-2.9e-05,-0.000518,-0.003093,-0.002717,-0.003583,-0.047369,-0.068255,-0.046347,-0.01046,-0.034607,-0.017738,-0.004109,-0.007317,-0.001194,-0.002302,-0.00071,-0.000133,-0.000333,-0.00036,-0.000179,4e-06
1e-06,1e-06,2e-06,-9e-05,-0.000422,-0.001063,-0.000218,-0.000126,-0.000272,-0.001717,-0.001333,0.001781,0.031736,0.052663,0.057014,0.00566,0.043614,0.097344,0.061523,0.033776,0.022994,0.011073,0.000157,-0.000176,-0.000308,-0.00029,-0.000142,-1e-05
3e-06,2e-06,3.6e-05,0.000151,-0.000109,-0.000559,-7.5e-05,1.1e-05,0.000467,0.001921,0.001644,0.001064,0.012014,0.01217,-0.025278,-0.036313,-0.018119,-0.066098,-0.04175,-0.026958,-0.018166,-0.006317,-0.000932,-0.00017,3e-05,6.2e-05,-6e-06,-1.1e-05
4e-06,2e-06,-3e-06,7.5e-05,0.000264,0.000797,0.00022,0.000102,0.000299,0.002027,0.001683,-0.002317,-0.028179,-0.040793,-0.06301,-0.020048,-0.04985,-0.054518,-0.014378,0.00158,-0.006177,-0.007007,-0.001112,-8e-05,0.000291,0.000264,0.000112,1.1e-05
1e-06,0,-3e-05,-8.4e-05,0.000338,0.000915,7.9e-05,1.5e-05,-0.000294,-0.000656,-0.000618,0.000348,0.022729,0.047389,0.065834,0.055997,0.05155,0.094478,0.050198,0.035871,0.023962,0.010315,0.000161,1.1e-05,0.000203,0.000184,0.000129,1.8e-05
-3e-06,1e-06,3.5e-05,2.6e-05,0.000228,0.000699,0.000105,-2.7e-05,-0.000279,-0.001943,-0.001653,0.001362,0.019784,0.040205,0.048839,0.026144,0.036681,-0.008175,-0.022603,-0.024502,-0.010345,-0.001248,-0.000581,-0.000186,-0.000173,-0.000167,-6.5e-05,-1.9e-05
-4e-06,-3e-06,-1.1e-05,-6.7e-05,-0.000458,-0.001152,-0.000198,-6.8e-05,-1.7e-05,-0.000844,-0.000587,6.7e-05,-0.028047,-0.066324,-0.068497,-0.057832,-0.076445,-0.073351,-0.032787,-0.020663,-0.014292,-0.009927,-0.001682,-0.000459,-0.000299,-0.000292,-0.000165,-2.4e-05
-1e-06,-2e-06,-7e-06,3.1e-05,-0.000109,-0.000611,-0.000142,-3.3e-05,0.000282,0.001073,0.000893,0.000992,-0.008951,-0.050271,-0.024509,-0.015558,-0.003411,0.053219,0.038558,0.029342,0.01755,0.007465,-0.000369,-0.000421,3e-06,6.9e-05,3.4e-05,2e-06
1e-06,0,1.6e-05,0.000103,-0.000278,-0.000953,-9.7e-05,7.5e-05,0.000123,0.001011,0.000793,-0.000557,0.003503,0.013365,0.030342,0.037028,0.074011,0.019116,0.006408,-0.002541,-0.002594,0.003027,-0.000323,-0.00023,0.000179,0.000194,8.1e-05,-1.1e-05
