1.2e-05,3e-06,3.5e-05,1.7e-05,4.7e-05,3e-06,2e-06,8e-06,4.9e-05,4.2e-05,3.2e-05,2.7e-05,0,4.3e-05,2.6e-05,7.3e-05,3e-06,4.4e-05,1.1e-05,8e-06,3.7e-05,2e-05,3.5e-05,1.5e-05,4.9e-05,2.8e-05,0.000257,0.000224,3.1e-05,0.000141,3e-06,0.000131,1.9e-05,0.000137,5.1e-05,0.000113,1e-06,6.8e-05,0.001519,0.00106,6.6e-05,0.000156,0.000219,0.000121,0.000161,0.000887,0.000739,0.000141,1.3e-05,0.000233,1.2e-05,0.000235,0.000208,0.000245,0.000726,0.000254,0.000169,2e-04,0.000275,5e-05,7.3e-05,0.000362,0.000403,0.000331,0.000176,0.000252,0.000195,0.000113,0.000268,0.000175,9e-06,9.3e-05,2.4e-05,0.000187,1.4e-05,3.9e-05,4e-05,6.8e-05,0.000101,6.4e-05,4.1e-05,4.8e-05,1.7e-05,1.5e-05,6.5e-05,3e-05,3.2e-05,6.9e-05,6.1e-05,7.7e-05,7e-06,3.4e-05,5.8e-05,3.7e-05,9.7e-05,9.6e-05,1.6e-05,1.7e-05,1.8e-05,4.6e-05,4.1e-05,6.4e-05,2.9e-05,7e-06,2.5e-05,1e-06,6.2e-05,1.6e-05,3.6e-05,2.7e-05,2.2e-05,3.5e-05,2.7e-05,9e-06,3.5e-05,2.3e-05,2.1e-05,3.1e-05,3.2e-05,5e-06,8e-06
0.000133,1e-04,0.000111,0.000114,6.2e-05,6.9e-05,6.4e-05,4.7e-05,8.1e-05,0.000156,0.000117,0.000106,6.9e-05,0.000108,0.000102,0.00018,0.000162,0.000114,0.000116,0.000101,0.00012,7.4e-05,9.9e-05,6.7e-05,7.4e-05,5.6e-05,0.000286,0.000566,0.000478,0.000385,0.000305,0.000276,0.000263,0.000302,0.00023,0.000332,0.000319,0.000169,0.00442,0.001268,0.001871,0.001936,0.001017,0.000649,0.000898,0.002346,0.003154,0.00208,0.000242,0.000788,0.000875,0.000574,0.000665,0.001607,0.000877,0.000102,0.000694,0.00064,0.000638,0.000221,0.00035,0.00029,0.000657,0.000195,0.000795,0.001417,0.000304,0.000292,0.000578,0.000545,0.000274,0.000162,0.000153,0.000159,0.000196,0.000218,0.00025,0.000144,0.000237,0.000303,8.8e-05,0.000137,0.000136,9.5e-05,3.4e-05,0.000115,1.6e-05,0.000108,0.000328,0.000395,0.000311,0.000215,7.1e-05,0.000289,0.000328,0.00031,0.000398,0.000199,0.00017,0.000206,0.000217,0.000124,0.00017,0.000111,8.7e-05,4.7e-05,0.00012,0.000142,8.6e-05,7e-05,4.5e-05,4.6e-05,0.000104,7.9e-05,6.9e-05,0.000103,0.000129,0.000118,0.000126,9.2e-05,5.2e-05
6.5e-05,3.9e-05,3.5e-05,2.9e-05,1.3e-05,4.6e-05,4.2e-05,4.4e-05,1.3e-05,7.2e-05,3.9e-05,4.6e-05,6.3e-05,3.6e-05,5.6e-05,6e-05,2.8e-05,5.1e-05,3.1e-05,4.1e-05,7.1e-05,6.6e-05,1.6e-05,6.3e-05,2.1e-05,0.000281,0.000441,0.001228,0.00093,0.00042,0.000131,0.000286,0.000112,0.000331,0.00036,9.9e-05,0.000318,0.000558,0.005888,0.004111,0.002916,0.001155,0.000726,0.000767,0.000437,0.00167,0.002179,0.001602,0.00184,0.00027,0.001192,0.000667,0.000928,0.001015,0.001349,0.000518,0.00056,0.000587,0.000816,0.00075,0.000319,0.000279,0.000725,0.000794,0.000846,0.00038,8e-04,0.000848,0.000449,0.000812,0.000637,0.000635,0.000251,9.3e-05,0.000176,0.000178,0.000265,0.00043,0.000188,0.000126,0.000259,0.000295,0.000337,0.00018,3.6e-05,6.4e-05,9.1e-05,0.000101,0.000535,0.000435,0.000194,1.4e-05,0.000141,0.000581,0.000434,0.000569,0.000245,0.000185,0.000143,0.000201,4.1e-05,0.00014,4.6e-05,5.3e-05,1.8e-05,2e-05,7.4e-05,2.9e-05,3.1e-05,7.5e-05,5.6e-05,1.7e-05,7.1e-05,1.5e-05,2e-05,6.7e-05,3.7e-05,5.4e-05,1.4e-05,3.2e-05,2.2e-05
7e-05,2.5e-05,4.8e-05,6.8e-05,2.9e-05,4.4e-05,2.9e-05,3.4e-05,2.9e-05,9e-06,6.2e-05,6.4e-05,5e-05,5.9e-05,7.1e-05,4.7e-05,2.7e-05,5.4e-05,7.3e-05,2.8e-05,2.5e-05,4.6e-05,7.4e-05,0.000111,5.2e-05,0.000435,0.001057,0.000692,0.000518,0.000209,0.000171,0.000121,0.000206,1e-04,9.4e-05,2.8e-05,0.000326,0.000347,0.007442,0.006204,0.004242,0.003,0.001222,0.001426,0.001637,0.00057,0.001111,0.000141,0.000952,0.00139,0.000842,0.001098,0.001047,0.001267,0.000734,0.001421,0.001008,0.00137,0.000982,0.000505,0.000588,0.000789,0.001334,0.000329,0.000748,0.000914,0.000329,0.00128,0.000433,0.001636,0.000841,0.000105,0.000459,0.000161,0.000201,0.000138,0.000174,0.000329,0.000175,0.000223,0.000179,4.8e-05,8.9e-05,0.000107,0.000119,4.9e-05,5.4e-05,6.2e-05,0.000674,0.000938,0.000626,0.000237,0.000234,0.000431,0.000565,0.000471,0.000391,0.000259,0.000204,4.6e-05,0.000117,0.000154,7e-05,3.6e-05,5.1e-05,2.3e-05,5.5e-05,5.7e-05,3.9e-05,3.2e-05,5.3e-05,4.3e-05,7.3e-05,6.8e-05,3.6e-05,2.1e-05,3.8e-05,5.2e-05,4.8e-05,1.3e-05,6.7e-05
4.7e-05,2.9e-05,2.8e-05,4.1e-05,1e-05,4.2e-05,4.2e-05,1.7e-05,2.4e-05,2.7e-05,3.8e-05,3.5e-05,3e-05,3.2e-05,3.7e-05,3.7e-05,1.8e-05,1.9e-05,3.6e-05,1.3e-05,1e-05,6.2e-05,0.000102,4.7e-05,8.3e-05,0.000456,0.000598,0.000194,0.000353,0.000568,0.000159,0.000504,0.000287,0.000497,0.000394,0.000342,0.000262,0.000265,0.007636,0.003678,0.003557,0.000793,0.000993,0.000617,0.001644,0.001974,0.001617,0.000936,0.000672,0.001036,0.00152,0.000851,0.002273,0.000612,0.001993,0.002885,0.001661,0.000357,0.001399,0.00117,0.000587,0.000823,0.001614,0.000861,0.001649,0.00108,0.000959,0.001897,0.001959,0.002223,0.000906,0.000144,0.000619,0.000736,0.00057,0.000519,0.000275,9.1e-05,6.6e-05,0.000126,0.000279,0.000195,9.6e-05,0.000144,3.9e-05,4.5e-05,7e-05,3.1e-05,0.00062,0.000767,0.000139,4.9e-05,0.000222,0.000327,0.000745,0.000486,0.000143,0.000108,0.000219,0.000109,7.4e-05,0.000189,4.4e-05,1.3e-05,2.7e-05,2.3e-05,3.3e-05,2e-05,2.2e-05,1.1e-05,7.8e-05,3.5e-05,3.2e-05,2.8e-05,3.8e-05,3.6e-05,1.3e-05,3.3e-05,3.6e-05,1.1e-05,7.1e-05
3.9e-05,7.4e-05,7.1e-05,3.1e-05,4.6e-05,6.1e-05,4.9e-05,4.4e-05,5.5e-05,3e-05,3.3e-05,7.9e-05,0.000126,0.000132,6.5e-05,7.1e-05,4e-05,3.4e-05,5e-05,5.4e-05,1.3e-05,0.000101,0.000115,6.8e-05,1.3e-05,0.000589,0.001279,0.000326,0.000413,0.000432,0.000363,0.000549,0.000294,0.000513,0.000531,0.000138,0.000411,0.000308,0.006894,0.005954,0.004286,0.003337,0.002881,0.003222,0.002769,0.002552,0.000254,0.00152,0.001204,0.001353,0.001521,0.001415,0.001877,0.002439,0.003728,0.00419,0.002559,0.000912,0.001571,0.000864,0.001618,0.001383,0.000662,0.000352,0.001399,0.001809,0.001242,0.002498,0.001064,0.000127,0.000857,0.000599,0.000183,0.000451,0.00063,0.000108,0.000196,0.000406,0.000103,0.00018,0.00024,0.000375,0.00013,0.000124,2e-05,8.1e-05,8.4e-05,5.5e-05,0.000542,0.000566,0.000405,0.000133,0.000267,0.000197,0.000716,0.000545,0.00021,6.4e-05,0.000248,0.000125,0.000152,0.000154,6.6e-05,6.6e-05,2.4e-05,2e-05,2e-05,3.2e-05,2.7e-05,1.2e-05,3.8e-05,1.4e-05,2.9e-05,4.2e-05,4.9e-05,0.000102,0.000107,6.1e-05,6.8e-05,8.1e-05,8.5e-05
0.000125,0.000159,0.00011,0.000109,0.000115,8.1e-05,5.5e-05,7.9e-05,8.2e-05,6.5e-05,4.2e-05,5.7e-05,0.000108,4.3e-05,4.7e-05,1.7e-05,2.8e-05,7.7e-05,2.2e-05,3.1e-05,5.5e-05,7e-05,8.4e-05,0.00027,0.000108,0.000652,0.001473,0.001036,0.000991,0.001135,0.000459,0.000535,0.000226,0.000293,0.000295,0.000135,0.000351,0.000189,0.005374,0.002061,0.002024,0.005335,0.001402,0.004008,0.005287,0.002553,0.002331,0.000461,0.000434,0.001048,0.001664,0.000597,0.00076,0.002108,0.00164,0.004271,0.004628,0.001537,0.000533,0.002986,0.001757,0.001945,0.004179,0.001886,0.000666,0.002163,0.001879,0.001001,0.001034,0.001312,0.001193,0.000962,0.000251,0.001054,0.001231,0.001005,0.000546,0.000538,0.000519,0.000306,0.000388,0.000626,0.000281,0.000133,0.000125,9.9e-05,8.7e-05,8.4e-05,0.000535,0.000485,0.000192,5.9e-05,0.000263,0.000518,0.000932,0.000899,0.000423,6.3e-05,0.00023,0.000113,0.000176,0.000473,7.9e-05,8.4e-05,2.6e-05,2.6e-05,2.6e-05,2.6e-05,2.7e-05,5.4e-05,0.000127,4.7e-05,4.8e-05,4.1e-05,4.2e-05,8.3e-05,7.2e-05,4.5e-05,2.8e-05,7.5e-05,7.7e-05
6.3e-05,8.1e-05,2.3e-05,6e-05,2.8e-05,1.3e-05,4e-05,4.6e-05,2.4e-05,5.8e-05,3.5e-05,2.3e-05,8.3e-05,7.8e-05,2.7e-05,1.2e-05,1.8e-05,5.1e-05,3.3e-05,1.8e-05,5.5e-05,6.5e-05,0.000219,0.000328,0.000192,0.000661,0.001157,0.001242,0.002194,0.001181,0.000763,0.001319,0.000761,0.000977,0.000805,0.000324,0.000436,0.000332,0.003314,0.003814,0.00309,0.00326,0.004059,0.003799,0.001477,0.002651,0.004104,0.002926,0.002322,0.002374,0.000838,0.001375,0.003773,0.003736,0.001406,0.006528,0.004374,0.003251,0.002697,0.002107,0.00188,0.001489,0.005574,0.00489,0.00308,0.000431,0.003363,0.002322,0.001422,0.002058,0.00312,0.001388,0.000958,0.001753,0.000529,0.000466,0.000194,0.000122,0.000454,0.000468,0.000246,0.000804,0.000532,0.000259,2e-04,0.000104,0.000194,7.9e-05,0.000397,0.000491,0.00023,7.6e-05,0.000241,0.000644,0.000835,0.000669,0.000432,0.000157,0.000146,0.000341,0.000264,0.00072,0.000674,0.000311,7.8e-05,4.2e-05,1.5e-05,3.5e-05,4.4e-05,2.8e-05,0.000309,0.000125,7.7e-05,8.3e-05,1.5e-05,3.7e-05,1.6e-05,2.8e-05,2.6e-05,2e-05,1.3e-05
5.6e-05,1.8e-05,5e-06,3.4e-05,7e-06,4e-06,3.8e-05,2.4e-05,1.9e-05,2.8e-05,4.3e-05,3.4e-05,3.6e-05,1.4e-05,3.1e-05,2.3e-05,1.9e-05,2.8e-05,1.7e-05,9e-06,4.7e-05,5.6e-05,0.000293,0.000562,0.000403,0.000652,0.003366,0.003122,0.003839,0.001784,0.000435,0.001933,0.001387,0.00054,0.00104,0.000927,0.001072,0.000366,0.001364,0.002525,0.005717,0.004204,0.001343,0.005428,0.00427,0.003274,0.001001,0.000504,0.002523,0.00148,0.002481,0.000558,0.003819,0.002037,0.001451,0.005239,0.001457,0.001641,0.002169,0.003474,0.001431,0.001451,0.004741,0.002936,0.001696,0.001058,0.002322,0.00135,0.001334,0.001286,0.002558,0.001767,0.001363,0.000993,0.001222,0.000915,0.000458,0.000472,0.000654,0.000292,0.00048,0.000496,0.000104,0.000118,5.6e-05,8.7e-05,0.000191,0.000103,0.000367,0.000709,0.000452,0.000173,0.000286,0.000764,0.00087,0.000476,1.7e-05,0.000173,0.000217,0.000505,0.000233,0.000504,0.000397,0.000212,0.000122,5.9e-05,5.2e-05,3.7e-05,2.8e-05,6.3e-05,0.000517,0.000339,9.2e-05,0.000102,7.6e-05,2e-05,2e-05,2.1e-05,2.1e-05,1.4e-05,1.4e-05
5e-05,2.4e-05,1.2e-05,9e-06,1.8e-05,1.2e-05,2.5e-05,3.2e-05,9e-06,1e-05,3.3e-05,2.1e-05,1.2e-05,3.8e-05,1.9e-05,2e-05,3.3e-05,3.5e-05,1.8e-05,1.1e-05,1.1e-05,9.4e-05,0.000179,0.000243,8.7e-05,0.000786,0.003878,0.006238,0.0014,0.000436,0.000471,0.001829,0.000858,0.000437,0.000552,0.000118,0.000543,0.000581,0.00014,0.000973,0.006084,0.001997,0.000892,0.001844,0.001015,0.000456,0.000408,0.00079,0.001511,0.000801,0.000689,0.000537,0.002954,0.000699,0.000375,0.002264,0.002428,0.001967,0.000688,0.001488,0.001348,0.002674,0.001213,0.000997,0.000497,0.001504,0.000361,0.000798,0.000612,0.00155,0.000918,0.000647,0.000267,0.000278,0.000184,0.00031,0.000197,0.000317,0.000205,0.000117,0.000433,9.3e-05,0.000228,9e-05,6.8e-05,8.2e-05,6e-05,7e-05,0.000288,0.000464,0.000243,0.000119,0.000265,0.000863,0.00134,0.000767,0.000457,0.000143,0.000162,0.000395,0.000375,0.000307,0.000448,0.000252,0.000135,1.8e-05,1.7e-05,6.6e-05,7e-05,8.7e-05,0.000445,0.000382,0.000159,8.6e-05,5.7e-05,1e-05,2.4e-05,4e-05,2.1e-05,3.9e-05,1.7e-05
9e-06,1.2e-05,8e-06,2.1e-05,1.2e-05,7e-06,1.9e-05,8e-06,2.2e-05,2.9e-05,1.8e-05,2.1e-05,2.1e-05,1.9e-05,1.9e-05,1.1e-05,2.3e-05,2.6e-05,1e-05,5e-06,1.5e-05,8.8e-05,8.5e-05,9.1e-05,7.5e-05,0.000567,0.002587,0.002319,0.001815,0.000974,0.000511,0.001067,0.000535,0.000629,0.000465,0.000279,0.000631,0.000809,0.000448,0.001239,0.005249,0.004465,0.001596,0.001333,0.001009,0.000631,0.001849,0.001608,0.001014,0.000677,0.000923,0.000391,0.001838,0.000713,0.000423,0.000702,0.001131,0.001063,0.001097,0.000672,0.000897,0.001044,0.000754,0.000775,0.000869,0.000932,0.000164,0.000436,0.000384,0.001026,0.000618,4e-04,0.000123,0.000377,0.000191,0.000228,6.8e-05,0.000269,0.000127,0.000109,0.000381,0.000152,0.000134,6.2e-05,9.3e-05,8.3e-05,0.00011,6.4e-05,0.000173,4.9e-05,4.1e-05,7.5e-05,0.000346,0.000219,0.000627,0.000162,3.2e-05,9e-05,0.000106,0.000263,7.2e-05,0.000639,0.000988,0.000577,0.00018,3.7e-05,1.9e-05,5.1e-05,6.9e-05,3e-06,0.00032,0.000197,0.000141,0.000107,6.4e-05,4.8e-05,2.8e-05,4.4e-05,3e-05,4.7e-05,2.4e-05
1.5e-05,1.1e-05,1.3e-05,5e-06,9e-06,4e-06,1.1e-05,1.1e-05,2e-05,2.6e-05,1e-05,1.5e-05,1.6e-05,7e-06,9e-06,9e-06,1.5e-05,1.4e-05,7e-06,4e-06,2.4e-05,7.2e-05,0.000167,5.9e-05,3.5e-05,0.000383,0.001234,0.000479,0.000511,0.000168,0.00022,0.000574,0.000364,0.000506,0.000594,1e-04,0.000724,0.000409,0.000756,0.001801,0.003909,0.003169,0.001471,0.001941,0.001087,0.000994,0.003432,0.001707,0.001294,0.000695,0.001562,0.000115,0.000802,0.000173,0.000509,0.000339,0.001318,0.000859,0.001767,0.000214,0.000686,0.001579,0.00082,0.000334,0.000254,0.000349,0.000349,0.000564,0.000335,0.000726,0.000531,0.000445,0.000404,0.000137,0.000136,3e-04,0.000206,0.000147,0.000146,0.00024,0.000528,3.5e-05,0.00013,3.9e-05,5.1e-05,9.1e-05,0.000129,8.7e-05,7e-06,0.00011,6.7e-05,6e-05,0.000329,0.000314,5.9e-05,3e-04,0.000113,9.3e-05,4.7e-05,0.000116,0.000104,0.000661,0.000644,0.000214,4.4e-05,5e-05,3.3e-05,3e-05,2.4e-05,4.4e-05,0.000147,3.1e-05,3.8e-05,5.2e-05,1.4e-05,3.5e-05,2.5e-05,1.9e-05,6e-06,3e-05,9e-06
1.1e-05,1.3e-05,8e-06,1.3e-05,1.6e-05,1e-05,6e-06,6e-06,1.2e-05,2e-05,1.6e-05,8e-06,7e-06,5e-06,1.4e-05,3e-06,6e-06,1.2e-05,2e-06,3e-06,1.2e-05,8.9e-05,8e-05,8.1e-05,1.3e-05,0.000211,0.000612,0.001091,0.00042,0.000421,0.000174,0.000288,0.000143,1.5e-05,0.000319,0.00034,0.00062,8.5e-05,0.000754,0.000894,8e-04,0.001363,0.00051,0.001634,0.00127,0.001994,0.001464,0.00031,0.001863,0.001124,0.00015,0.001219,0.001851,0.000845,0.000654,0.00102,0.000828,0.000696,0.000965,0.001557,0.001431,0.001534,0.001292,0.001155,0.000419,0.000956,0.000284,0.000351,0.00048,0.000837,0.000615,0.000636,0.000784,0.000581,0.000271,2.9e-05,0.000105,0.000253,0.000197,0.000122,0.000783,3.7e-05,0.000203,1.5e-05,0.00012,0.000109,2e-05,7.6e-05,7.5e-05,0.000137,6.3e-05,7e-06,0.000475,0.000342,0.000362,9.1e-05,1.1e-05,4.7e-05,0.000106,8.8e-05,0.00018,0.00044,2.2e-05,9.8e-05,8.6e-05,1.9e-05,3.3e-05,1.7e-05,2e-05,4.5e-05,0.00016,5.3e-05,2e-05,5e-06,3.8e-05,2.9e-05,3.9e-05,1.6e-05,5e-06,1.8e-05,1.4e-05
1.1e-05,1.6e-05,1.4e-05,9e-06,1e-05,5e-06,1.7e-05,3e-06,9e-06,1.8e-05,5e-06,1.1e-05,1e-05,5e-06,9e-06,7e-06,8e-06,8e-06,1.2e-05,6e-06,1.4e-05,8.9e-05,0.000123,1.8e-05,8e-06,0.000229,0.001141,0.000159,0.000387,0.000405,0.00013,0.000115,6.8e-05,0.000517,0.000405,0.000234,0.000571,0.00037,0.00136,0.002701,0.001174,0.002827,0.001726,0.002298,0.00263,0.000698,0.001073,0.001388,0.002383,0.001685,0.002168,0.002014,0.001817,0.001942,0.001607,0.001494,0.002198,0.000895,0.001179,0.001228,0.000741,0.00164,0.001844,0.001978,0.000782,0.000598,0.000482,0.000495,0.000423,0.000994,0.000612,0.001162,0.001186,0.000381,0.000457,0.000431,7.4e-05,0.000369,0.000146,0.000237,0.000838,0.00049,0.000283,5.4e-05,0.000184,9.4e-05,5.8e-05,9.9e-05,4.2e-05,0.000143,0.000122,6.2e-05,0.000628,0.000887,0.000458,9.7e-05,0.000103,6.6e-05,5.5e-05,0.00018,6e-05,0.00023,9.9e-05,6.1e-05,4.6e-05,3.1e-05,9e-06,1.1e-05,2e-05,2.6e-05,0.000147,2.6e-05,1.7e-05,2.5e-05,3.6e-05,5.6e-05,3e-05,4.6e-05,3e-06,1e-06,4e-06
8e-06,1.1e-05,9e-06,1.8e-05,3e-06,1e-05,2.4e-05,2.5e-05,2.4e-05,2.2e-05,1.7e-05,2e-05,1.4e-05,1.7e-05,3.6e-05,1.4e-05,1.9e-05,1.7e-05,7e-06,5e-06,7e-06,7.4e-05,0.000144,6.8e-05,4.4e-05,0.000285,0.001372,0.000784,0.000419,0.000154,0.000114,0.000217,0.000187,0.000631,0.000827,0.000314,0.000421,0.000471,0.001155,0.004563,0.004067,0.004511,0.000406,0.003402,0.002663,0.005029,0.002239,0.001578,0.004103,0.00042,0.005523,0.002073,0.001813,0.000374,0.000606,0.001985,0.00226,0.001997,0.003243,0.002494,0.001314,0.004863,0.004299,0.003449,0.004584,0.004689,0.001874,0.001563,0.000644,0.000926,0.002375,0.001797,0.00024,0.000912,0.001175,0.000121,0.000284,0.000302,0.000942,0.000795,0.000905,0.000291,0.00024,5.2e-05,0.000197,0.000179,0.000173,0.000133,0.000145,0.000194,0.000112,5.6e-05,0.000656,0.000379,0.000462,0.000403,9.2e-05,1e-04,0.000145,0.000193,0.000143,0.000325,0.00024,0.00013,1.4e-05,1.7e-05,3e-05,3.9e-05,3.2e-05,4.6e-05,4.6e-05,9.6e-05,4.6e-05,4.4e-05,1.5e-05,3.8e-05,4.7e-05,8e-05,3.9e-05,1.9e-05,1.2e-05
1.9e-05,2e-05,4e-06,1e-05,1.1e-05,6e-06,1.4e-05,1.3e-05,2.7e-05,8e-06,3.4e-05,1.4e-05,3e-06,2.6e-05,2.6e-05,2.7e-05,2.8e-05,2.5e-05,2.5e-05,1.4e-05,1.5e-05,7.7e-05,3.4e-05,6.1e-05,5.6e-05,0.000241,0.001477,0.000616,0.000502,0.000147,0.000146,0.000345,0.000105,0.000455,0.000555,0.000448,0.000512,0.000488,0.001041,0.005235,0.002185,0.007584,0.009585,0.00279,0.003772,0.008913,0.010218,0.003695,0.006932,0.009015,0.009606,0.007924,0.00267,0.00533,0.001269,0.003788,0.002185,0.002658,0.005751,0.002991,0.002803,0.004731,0.006074,0.003053,0.004428,0.002842,0.000859,0.002394,0.00274,0.002177,0.004489,0.00026,0.002566,0.001203,0.000957,0.000975,9.9e-05,9.3e-05,0.001826,0.001232,0.001528,0.001358,0.000189,4.3e-05,0.000223,0.000228,0.000329,0.000282,0.000296,0.000421,0.000275,8.5e-05,0.000578,0.001029,0.000581,0.000215,0.000102,0.000172,0.000121,6.5e-05,0.000196,0.000413,3.7e-05,6.6e-05,4.4e-05,3.2e-05,3.6e-05,8.1e-05,3.6e-05,7.9e-05,0.000173,4.4e-05,2.1e-05,6.4e-05,8.8e-05,2.3e-05,3.3e-05,6.1e-05,6.4e-05,6e-05,4.5e-05
2.8e-05,1.1e-05,8e-06,7e-06,1.1e-05,2e-05,1.1e-05,1.1e-05,2.4e-05,3.9e-05,4e-05,3.2e-05,3.4e-05,5.1e-05,5.3e-05,4.8e-05,7e-06,2.8e-05,2e-05,1.2e-05,3.1e-05,7.8e-05,9.1e-05,5.7e-05,3.3e-05,0.000177,0.001473,0.000446,0.000309,0.000231,0.00013,0.000552,0.00032,0.000149,0.00079,0.000499,0.000517,0.000426,9e-04,0.005031,0.002331,0.005587,0.009666,0.011178,0.009531,0.012016,0.009917,0.011756,0.013015,0.012297,0.005519,0.00982,0.010501,0.005989,0.00959,0.010178,0.0115,0.007569,0.008267,0.009384,0.009423,0.010943,0.003479,0.003917,0.003312,0.007386,0.005757,0.001211,0.002402,0.001178,0.002862,0.005086,0.006523,0.004917,0.00291,0.00075,0.000595,7.3e-05,0.002007,0.002256,0.002893,0.003791,0.002326,0.001098,0.00055,0.000187,0.000315,0.000214,0.000125,0.000262,0.000238,0.000174,0.000409,0.001153,0.001162,0.000617,0.000266,0.000391,0.00017,0.000172,0.000156,0.000308,0.000429,0.000185,8.3e-05,3.3e-05,5.6e-05,9.6e-05,7.6e-05,5.2e-05,0.000171,8.8e-05,8.7e-05,1e-04,7.5e-05,8.1e-05,7.3e-05,7e-06,3.4e-05,3.8e-05,6.3e-05
1.4e-05,2.1e-05,2.2e-05,2.6e-05,7e-06,1.3e-05,2.4e-05,6e-06,2.2e-05,2.1e-05,8e-06,1.5e-05,3.3e-05,2.2e-05,1e-05,2.8e-05,3.7e-05,4e-05,7e-06,1.9e-05,2.2e-05,7.6e-05,9.7e-05,8.5e-05,5e-05,0.000143,0.001611,0.001731,0.000825,0.000568,0.000416,0.00046,0.00026,1e-04,0.000307,0.00019,0.000303,0.000424,0.000901,0.003427,0.005849,0.005969,0.003319,0.003351,0.006738,0.000824,0.004148,0.006998,0.004899,0.005087,0.004526,0.006044,0.005918,0.010271,0.008811,0.002459,0.006345,0.010683,0.004049,0.006584,0.00679,0.001908,0.004946,0.00635,0.005773,0.006809,0.003114,0.002285,0.00139,0.001948,0.001679,0.003382,0.004105,0.003103,0.002343,0.00185,0.00135,0.001175,0.0019,0.000359,0.001153,0.001911,0.001181,0.000515,0.000152,0.00027,0.000202,8.7e-05,0.00011,0.000232,6.7e-05,3.2e-05,0.000405,0.000716,0.000279,1.3e-05,8.6e-05,0.000561,0.000287,8.6e-05,0.000164,0.000398,0.000503,0.000292,8.1e-05,2.9e-05,5.9e-05,3.4e-05,3.2e-05,8.4e-05,7.9e-05,0.00011,8.3e-05,6.9e-05,3.3e-05,6e-05,1.1e-05,1.9e-05,3.8e-05,7.2e-05,4.3e-05
1.7e-05,1.7e-05,8e-06,1e-05,1.6e-05,4e-06,1.2e-05,1.5e-05,1.9e-05,3e-05,2.2e-05,1.8e-05,1.6e-05,2.1e-05,2.5e-05,1.5e-05,2.8e-05,4e-05,3.6e-05,2.4e-05,1.2e-05,4e-05,4.3e-05,6.3e-05,7e-05,0.000201,0.001588,0.001354,0.000771,0.000402,5e-05,0.000267,0.000125,0.000179,0.000291,8.9e-05,0.000337,0.000349,0.001017,0.003491,0.004113,0.001342,0.002739,0.001431,0.004602,0.002847,0.002749,0.003932,0.002112,0.001957,0.004732,0.002844,0.003603,0.002502,0.003957,0.003611,0.003502,0.003546,0.002126,0.005529,0.000794,0.00246,0.001984,0.002007,0.004859,0.000733,0.001041,0.001769,0.002407,0.000671,0.001067,0.00249,0.001377,0.000601,0.000738,0.0011,0.000638,0.000497,0.000588,0.000425,0.000333,0.000904,8.3e-05,0.000271,0.000256,0.000191,0.000252,0.000121,0.000206,0.000417,0.000181,5.4e-05,0.000391,0.00064,0.000487,7.3e-05,7.7e-05,0.000793,0.000566,0.000297,0.000147,0.00034,0.000322,0.000151,2.3e-05,2.6e-05,6e-05,2.5e-05,1.4e-05,6.7e-05,5.4e-05,4.1e-05,8.8e-05,7.3e-05,3e-05,4.9e-05,5.8e-05,6.3e-05,1.9e-05,4.3e-05,1.1e-05
2.9e-05,3.3e-05,3.2e-05,2.3e-05,2e-05,1.5e-05,7e-06,1.4e-05,2.6e-05,6e-06,8e-06,7e-06,7e-06,2e-06,1.9e-05,1.6e-05,1.7e-05,2e-05,1.8e-05,1.1e-05,2.2e-05,4.7e-05,6e-05,7.9e-05,2.2e-05,0.000276,0.00148,0.001009,0.000429,0.000162,0.000194,0.000173,0.000131,0.000216,0.000425,0.000349,0.00015,0.000119,0.001348,0.0041,0.00251,0.001796,0.002342,0.002495,0.00182,0.001065,0.001292,0.002302,0.001228,0.001338,0.001487,0.000703,0.00182,0.002767,0.003086,0.002568,0.001311,0.001662,0.002677,0.001644,0.001429,0.001122,0.001619,0.002289,0.002749,0.003871,0.003647,0.00228,0.001696,0.002562,0.001844,0.002398,0.001527,0.000693,0.000603,0.000859,0.000287,0.000228,0.000393,0.000664,0.000638,0.000516,0.000285,0.000102,0.000114,0.000242,2e-04,0.000145,0.000306,5e-04,0.000349,0.000129,0.000423,0.000508,0.000282,0.000254,1e-04,0.000876,0.000624,0.000301,0.000101,0.000286,0.000161,8.1e-05,2.9e-05,1.3e-05,2.3e-05,6e-06,2e-06,4.6e-05,4.3e-05,3.1e-05,2.8e-05,7e-05,8.4e-05,2.9e-05,2.4e-05,7.1e-05,8.7e-05,6.7e-05,3.3e-05
1e-06,8e-06,1.6e-05,1e-05,4e-06,1.4e-05,7e-06,1.1e-05,1.2e-05,9e-06,1.2e-05,1.2e-05,1.4e-05,4e-06,1.5e-05,2e-06,1.5e-05,9e-06,1.3e-05,1.6e-05,1.8e-05,5.2e-05,9.1e-05,6.3e-05,3.9e-05,0.00034,0.001553,0.000538,0.000175,7.9e-05,6.1e-05,0.000574,0.000324,0.000211,1.6e-05,0.000122,0.000438,0.000236,0.001222,0.002762,0.004692,0.001862,0.002403,0.0011,0.001164,0.001576,0.00089,0.002071,0.000674,0.001244,0.001713,0.001783,0.001839,0.001601,0.000938,0.002716,0.000717,0.000852,0.001977,0.001987,0.001223,0.000951,0.000736,0.001703,0.002825,0.002451,0.000558,0.001649,0.000976,0.002106,0.001032,0.001613,0.000587,0.00084,0.000744,0.00039,6.5e-05,0.000437,0.00025,0.000228,0.000594,0.000623,0.000316,0.00024,0.000174,7.2e-05,0.000216,0.000109,0.000197,0.000294,0.000109,3.1e-05,0.000408,0.000791,0.000603,0.000212,4.9e-05,0.000815,0.000438,9.9e-05,6.8e-05,0.00019,6.6e-05,4.3e-05,4.5e-05,3.8e-05,2.8e-05,6e-06,5e-06,7e-06,2.4e-05,8.3e-05,4.9e-05,5.4e-05,4.3e-05,1.9e-05,2.4e-05,2.4e-05,6.8e-05,2.4e-05,2.3e-05
1.2e-05,1.1e-05,1.1e-05,1.2e-05,6e-06,1.9e-05,1.2e-05,1.5e-05,1.7e-05,1e-05,1e-05,1.4e-05,1.2e-05,1.3e-05,1.9e-05,4e-06,6e-06,5e-06,1.2e-05,9e-06,9e-06,4e-05,8.7e-05,4.5e-05,2.8e-05,0.000313,0.001085,0.000915,0.000221,4.9e-05,0.000147,0.000716,0.000325,0.000191,0.000355,0.00029,0.00017,0.000101,0.000954,0.001252,0.002207,0.002168,0.001197,0.000498,0.001592,0.000921,0.00148,0.000525,0.00076,0.001177,0.002399,0.001879,0.001044,0.001271,0.000896,0.001632,0.001337,0.000646,0.001052,0.001043,0.000107,0.000446,0.00032,0.00094,0.00152,0.000441,0.000324,0.000924,0.000828,0.001002,0.001154,0.000249,0.000522,0.000558,0.000152,0.000123,5.9e-05,0.000396,0.000182,0.00019,0.000445,0.000142,2.6e-05,9.9e-05,3.9e-05,8.2e-05,2.6e-05,4.7e-05,9.4e-05,0.000192,1e-04,3.1e-05,0.000359,0.000197,0.00023,0.000113,4.5e-05,0.000589,0.000228,8.4e-05,5.8e-05,0.000104,9.1e-05,4.1e-05,2.1e-05,2.4e-05,1e-05,1.3e-05,1.2e-05,2.3e-05,3e-05,4.7e-05,3.2e-05,1.5e-05,1e-05,3.4e-05,5e-05,5e-05,5.8e-05,5.9e-05,4.4e-05
4e-06,2e-06,6e-06,6e-06,2e-06,4e-06,1e-06,4e-06,8e-06,3e-06,5e-06,9e-06,3e-06,3e-06,1e-05,4e-06,4e-06,4e-06,5e-06,5e-06,4e-06,1.2e-05,1.1e-05,3.3e-05,1.8e-05,0.000141,0.000206,0.000185,0.000148,6.2e-05,3.2e-05,0.000251,0.000152,3.2e-05,0.000186,6.7e-05,6e-05,6.4e-05,0.000424,0.000398,0.000499,0.000461,0.000554,0.000504,0.000208,0.000476,0.000403,0.000447,0.00014,0.00045,0.000663,0.000279,0.000123,0.000557,0.000486,0.000465,0.000297,0.000364,0.000633,0.000734,0.000377,0.000149,0.000185,0.000317,0.000318,0.000325,0.000271,0.000177,0.00016,0.000437,0.000195,0.000282,0.000204,0.000221,8.4e-05,0.000145,7.9e-05,0.000144,0.00012,0.000105,0.000251,0.000113,2.9e-05,1.8e-05,2.8e-05,2.5e-05,2.7e-05,2.9e-05,5.6e-05,4e-05,3e-05,1.2e-05,0.000149,0.000203,0.000112,5.3e-05,3.6e-05,0.000175,0.000113,3e-05,3.8e-05,6.4e-05,4.7e-05,2.9e-05,1.3e-05,3e-06,4e-06,1.1e-05,1.5e-05,1.8e-05,1.1e-05,1.8e-05,1e-05,9e-06,1.3e-05,1.4e-05,1.4e-05,1.4e-05,1.6e-05,1.3e-05,6e-06
2e-06,4e-06,4e-06,4e-06,6e-06,4e-06,3e-06,3e-06,3e-06,1e-06,4e-06,5e-06,4e-06,4e-06,8e-06,3e-06,3e-06,2e-06,3e-06,5e-06,2e-06,1e-05,1.2e-05,1.4e-05,6e-06,0.000137,0.000125,8.1e-05,2.3e-05,4.5e-05,7e-06,8.5e-05,3.2e-05,3.7e-05,0.000126,8.5e-05,0.000112,5.2e-05,0.000402,0.000964,0.000807,0.000192,0.000794,0.000597,6e-04,3e-04,0.000324,0.000358,0.000438,0.00017,0.000335,0.000637,0.000118,0.000365,0.000356,0.000887,8.7e-05,0.000278,0.000529,0.000447,0.000364,0.000233,0.000204,0.000462,0.000433,0.000437,5.1e-05,9.8e-05,6.4e-05,0.000279,0.00021,0.000239,5.3e-05,4.7e-05,7.2e-05,9.8e-05,2.6e-05,0.000132,6.9e-05,0.000133,0.000189,7.6e-05,3.9e-05,3.8e-05,8e-06,2.1e-05,1.3e-05,1.7e-05,7.3e-05,2.5e-05,2.1e-05,1e-05,7.7e-05,9.6e-05,0.000102,3.2e-05,2.8e-05,0.000146,8.6e-05,2.7e-05,2.7e-05,9.1e-05,1.8e-05,1.1e-05,1.2e-05,8e-06,3e-06,9e-06,5e-06,1.9e-05,2.7e-05,4e-06,5e-06,1.4e-05,5e-06,1.2e-05,1e-05,9e-06,7e-06,1.5e-05,9e-06
2e-06,4e-06,4e-06,5e-06,7e-06,3e-06,3e-06,4e-06,8e-06,1e-06,3e-06,5e-06,4e-06,8e-06,9e-06,2e-06,5e-06,4e-06,5e-06,3e-06,4e-06,7e-06,6e-06,1e-06,1e-05,0.000143,0.000186,0.000159,9.2e-05,4.7e-05,9e-06,1.3e-05,2.7e-05,1.7e-05,0.000103,3.9e-05,7.7e-05,6.7e-05,0.000264,0.000788,9.9e-05,0.000326,0.000669,0.000552,0.000208,0.000367,0.000741,0.000285,0.000645,0.000691,0.000461,0.000599,0.000203,0.000449,0.000226,0.000665,0.000549,5.1e-05,0.000292,0.000337,0.000189,0.000177,0.000166,0.000258,0.000487,0.000316,0.000175,5.9e-05,6.8e-05,0.000203,0.000112,0.000199,7.4e-05,5.8e-05,6.8e-05,3.6e-05,4.2e-05,0.000136,6.8e-05,0.000114,0.000188,8.6e-05,1.6e-05,1.8e-05,3.7e-05,1.8e-05,1.6e-05,3.7e-05,3.2e-05,2.6e-05,1.1e-05,4e-06,1.9e-05,7.8e-05,5.2e-05,3.3e-05,1e-05,0.000172,9.6e-05,2.9e-05,3.7e-05,5.6e-05,4.3e-05,2.2e-05,1.3e-05,1.1e-05,1e-05,3e-06,6e-06,2.2e-05,1e-05,2.1e-05,1.6e-05,1e-05,8e-06,5e-06,6e-06,1.2e-05,1e-05,8e-06,9e-06
2e-06,1e-05,8e-06,4e-06,8e-06,4e-06,3e-06,7e-06,8e-06,9e-06,5e-06,8e-06,5e-06,2e-06,6e-06,7e-06,1.2e-05,1.6e-05,7e-06,1.1e-05,1.3e-05,1.1e-05,1.2e-05,1.1e-05,1.5e-05,0.000151,0.000197,0.000159,1.8e-05,2.4e-05,1.8e-05,4.2e-05,4.7e-05,2.9e-05,5.8e-05,5e-05,7.6e-05,4.9e-05,0.000251,0.000206,0.000114,6.8e-05,0.000241,0.000226,0.000148,0.000498,0.000421,0.000165,0.000441,0.000457,0.000729,0.000384,0.000213,0.000567,0.000288,0.000243,0.000281,0.00014,2.7e-05,0.000192,0.000327,2.5e-05,0.000266,0.000461,0.000313,0.000466,7.8e-05,1e-04,0.000108,0.000169,8.2e-05,0.000142,6.4e-05,6.3e-05,6.5e-05,5.8e-05,3.7e-05,0.000128,2.4e-05,9.9e-05,0.000129,2.6e-05,1.5e-05,4e-06,3.6e-05,3.4e-05,1.3e-05,2.9e-05,1e-04,4.4e-05,4e-05,3e-05,7.8e-05,6.6e-05,8.7e-05,2.1e-05,2.3e-05,0.000161,7.3e-05,3.7e-05,4.8e-05,8e-05,4.7e-05,2.1e-05,9e-06,6e-06,6e-06,4e-06,1e-06,1.5e-05,1.2e-05,2.1e-05,1.5e-05,5e-06,1e-05,8e-06,4e-06,1.3e-05,8e-06,1.2e-05,8e-06
1.5e-05,1.2e-05,1.6e-05,2.1e-05,1.3e-05,1.3e-05,1.3e-05,1.1e-05,1.4e-05,1.3e-05,2e-05,1.7e-05,1e-05,5e-06,1.1e-05,1e-05,9e-06,6e-06,6e-06,1.2e-05,7e-06,4e-06,1.2e-05,2.2e-05,2.2e-05,0.000148,0.000128,0.00015,7.4e-05,7e-05,2.9e-05,5e-05,3e-05,4.5e-05,8.4e-05,2.8e-05,9.7e-05,3.8e-05,0.000209,0.000477,0.000473,0.000567,0.000181,0.000235,0.000284,0.000319,0.000384,0.000195,0.000222,0.000365,0.000331,0.000528,0.000171,0.000335,0.000378,0.000479,0.00046,5.9e-05,0.000183,0.000586,7.2e-05,7.7e-05,0.000139,0.000424,0.000439,0.000287,0.000194,2.1e-05,4.1e-05,1.6e-05,7.1e-05,0.000255,7.8e-05,4.4e-05,0.000101,5.1e-05,4e-06,0.00012,4.5e-05,6.2e-05,0.000115,6.8e-05,4.7e-05,2.5e-05,2e-05,2e-05,1.3e-05,2e-05,0.000108,0.000103,5.6e-05,1.6e-05,0.000111,3.9e-05,5.5e-05,3e-06,7e-06,0.000128,6.2e-05,3.3e-05,1.5e-05,7.1e-05,2.2e-05,8e-06,1e-06,5e-06,2e-06,2e-06,2e-06,1.2e-05,1.1e-05,1.1e-05,7e-06,1e-06,6e-06,5e-06,4e-06,8e-06,2e-06,8e-06,1e-06
1.1e-05,2e-05,9e-06,7e-06,1.7e-05,1.7e-05,1.5e-05,9e-06,5e-06,7e-06,9e-06,1.9e-05,1.1e-05,6e-06,1.2e-05,9e-06,1.1e-05,6e-06,2e-06,3e-06,5e-06,8e-06,5e-06,1.5e-05,1.1e-05,0.00013,6.6e-05,4.3e-05,5e-05,5e-05,6e-06,3.3e-05,2.4e-05,7.6e-05,0.00016,6.8e-05,7.4e-05,3.4e-05,0.000246,0.000707,0.000248,0.000505,0.000311,0.000366,0.000228,0.000467,0.00031,0.00015,0.000325,0.000273,0.000189,0.000333,0.000388,0.000381,0.000221,0.000377,0.000538,0.000449,0.000224,0.000644,0.000422,4.9e-05,0.00023,0.000156,0.000361,0.000391,9.2e-05,7.5e-05,3.7e-05,8.7e-05,0.00017,0.000152,0.000106,1.4e-05,7.8e-05,3.8e-05,6e-06,0.000101,3.6e-05,7.4e-05,0.000104,6.8e-05,2.5e-05,1.9e-05,8e-06,1.4e-05,6e-06,1e-05,6.2e-05,4.4e-05,2e-05,1.3e-05,0.000117,7.5e-05,5.1e-05,6e-06,1.6e-05,9e-05,6e-05,1.9e-05,2.1e-05,1.7e-05,2.4e-05,1.3e-05,6e-06,2e-06,9e-06,4e-06,9e-06,7e-06,1.3e-05,2e-06,3e-06,2e-06,6e-06,7e-06,8e-06,2e-06,2e-06,3e-06,3e-06
1.1e-05,1e-06,1e-06,4e-06,5e-06,5e-06,1.1e-05,5e-06,1.2e-05,3e-06,6e-06,4e-06,3e-06,4e-06,7e-06,8e-06,2e-06,7e-06,8e-06,8e-06,1e-06,9e-06,1.5e-05,4e-06,1e-05,0.000122,7.2e-05,0.000196,6.7e-05,5.6e-05,2.5e-05,8e-06,5e-06,5.3e-05,6.5e-05,6.6e-05,6.7e-05,4.3e-05,0.00027,0.000478,0.000327,0.000531,0.000293,0.000486,0.000411,0.000174,0.000116,0.000224,0.000302,0.000158,0.000382,0.000253,0.000246,0.000304,0.000234,0.000224,0.000165,0.000219,0.000354,0.00058,0.000145,0.000173,4e-04,0.000421,0.000281,0.000129,0.000179,8e-06,5.6e-05,0.000121,8e-05,0.000185,7.8e-05,5.4e-05,0.000148,6.6e-05,2.8e-05,0.000102,6.1e-05,8e-05,8.1e-05,5.7e-05,3.3e-05,4e-05,3.9e-05,1.5e-05,7e-06,6e-06,3e-05,3.1e-05,2.2e-05,1.1e-05,0.000105,3.1e-05,7e-05,2.7e-05,1e-05,8.4e-05,5.3e-05,1e-05,2.9e-05,7.1e-05,3e-05,1.8e-05,4e-06,6e-06,6e-06,4e-06,9e-06,9e-06,1.2e-05,9e-06,8e-06,6e-06,2e-06,5e-06,1e-06,3e-06,1e-06,2e-06,3e-06
5e-06,4e-06,6e-06,5e-06,6e-06,4e-06,9e-06,1e-05,1.3e-05,1.7e-05,1.1e-05,1e-05,6e-06,5e-06,9e-06,4e-06,1e-06,6e-06,1e-06,7e-06,3e-06,1e-06,1.5e-05,2e-05,2e-06,0.000111,2.8e-05,0.000179,9e-05,4.2e-05,2.1e-05,1.6e-05,2.9e-05,2.4e-05,5.1e-05,3.8e-05,3.9e-05,4.3e-05,0.000236,0.000297,0.000613,0.000415,8.9e-05,0.000578,4e-05,0.000151,0.00024,0.000153,0.000176,0.000198,0.000393,0.000342,8.4e-05,0.000348,7.2e-05,0.000336,0.000365,6.9e-05,0.000331,0.000158,0.00062,0.000312,0.000409,0.000141,0.000172,0.000311,0.000176,0.000291,0.000212,0.000227,0.000233,6.2e-05,0.000147,1.8e-05,0.000152,0.000146,0.000102,0.000118,0.00013,0.000144,0.00013,3.6e-05,3.4e-05,4.8e-05,7e-06,2.2e-05,1.5e-05,1.6e-05,4.4e-05,6.5e-05,2.2e-05,6e-06,9.2e-05,7.9e-05,8e-05,1.8e-05,6e-06,8.5e-05,9.2e-05,5.7e-05,4.3e-05,7.5e-05,7.4e-05,3.9e-05,9e-06,1e-06,9e-06,1.1e-05,1e-05,9e-06,1.2e-05,7e-06,1.6e-05,1.5e-05,5e-06,6e-06,3e-06,3e-06,5e-06,3e-06,3e-06
4e-06,6e-06,5e-06,2e-06,5e-06,4e-06,5e-06,6e-06,6e-06,1e-05,1e-05,8e-06,6e-06,3e-06,7e-06,5e-06,1e-06,3e-06,2e-06,6e-06,7e-06,1.2e-05,1.2e-05,1.2e-05,6e-06,0.000117,6.3e-05,5.8e-05,1.4e-05,1.7e-05,3e-05,2.7e-05,1.9e-05,2e-05,0.000108,4.5e-05,6.4e-05,5e-06,0.000246,0.000328,0.000598,0.000758,0.000179,0.000537,0.000513,9.7e-05,0.00034,0.000306,0.000183,0.000262,7.8e-05,0.000252,0.000223,0.000355,2.2e-05,0.00055,0.000252,9.7e-05,0.000229,0.000344,0.00052,0.000348,0.000153,0.000208,0.000196,0.000132,0.000121,4e-04,0.000197,0.000321,0.000204,0.000242,0.000148,0.000224,9.6e-05,4.8e-05,4.7e-05,0.000124,0.000128,4.1e-05,8e-05,0.000113,7.2e-05,3.4e-05,3.2e-05,3.6e-05,1.3e-05,2.9e-05,2.8e-05,5e-05,3.3e-05,2.1e-05,3.7e-05,5e-06,4.5e-05,3.6e-05,2.3e-05,8.9e-05,2.5e-05,1.6e-05,2.4e-05,6.5e-05,5.1e-05,2.9e-05,1.8e-05,3e-06,3e-06,8e-06,2e-06,1.7e-05,1.7e-05,1.1e-05,8e-06,2e-06,7e-06,4e-06,5e-06,7e-06,1.2e-05,1.3e-05,7e-06
2e-06,2e-06,5e-06,4e-06,4e-06,0,4e-06,4e-06,6e-06,7e-06,3e-06,6e-06,6e-06,5e-06,1e-06,2e-06,1e-06,1e-06,1e-06,7e-06,5e-06,1.5e-05,1.2e-05,1.6e-05,3e-06,0.000124,6.6e-05,5.3e-05,3.5e-05,1.5e-05,2.8e-05,2.9e-05,2.7e-05,3.6e-05,0.000105,4.7e-05,5.8e-05,2.1e-05,0.000243,0.000362,0.000613,0.000467,0.000467,0.000318,0.000255,0.000211,0.000321,0.000168,0.000338,0.000158,0.000271,0.00019,0.000209,0.000109,0.000119,0.000583,0.00023,3.7e-05,0.000232,0.000363,0.000361,3e-04,2.9e-05,0.000103,0.000186,0.000298,0.000237,0.000215,0.000207,0.000354,0.000236,0.000159,0.000271,9.8e-05,4e-05,2.9e-05,4.3e-05,5.6e-05,1.1e-05,3.2e-05,0.000129,5.6e-05,5.4e-05,3e-05,7e-06,2.6e-05,1.7e-05,2.8e-05,4.6e-05,3.1e-05,2.1e-05,2.5e-05,1.3e-05,4e-05,5.8e-05,2.1e-05,1.4e-05,4.7e-05,4.4e-05,2.8e-05,1.1e-05,7.5e-05,1.8e-05,1.5e-05,8e-06,1e-05,3e-06,4e-06,1.1e-05,1.8e-05,1.7e-05,3e-06,5e-06,1e-06,6e-06,4e-06,2e-06,8e-06,9e-06,3e-06,1e-06
3e-06,4e-06,4e-06,2e-06,3e-06,4e-06,4e-06,2e-06,3e-06,3e-06,2e-06,2e-06,5e-06,3e-06,2e-06,1e-06,3e-06,4e-06,3e-06,9e-06,7e-06,1.7e-05,4e-06,5e-06,1e-05,0.00013,0.000115,0.000117,4.4e-05,2.8e-05,1.4e-05,1.7e-05,4.2e-05,1.3e-05,0.000109,0.000108,1.2e-05,2.9e-05,0.000246,0.00043,0.000467,0.000396,0.000276,0.000355,0.000169,8.3e-05,0.000325,0.000199,0.000307,0.000267,0.000301,0.000272,0.00014,0.000262,0.000138,0.000491,0.000206,6.2e-05,0.000355,0.000148,0.000205,0.000269,0.000116,0.000231,0.000222,4.2e-05,3.1e-05,0.000178,0.000325,4.2e-05,0.000165,0.000131,2e-04,0.000135,9.1e-05,0.000115,8.6e-05,0.000115,7.5e-05,7.6e-05,0.000108,5.7e-05,6.2e-05,4.4e-05,1.5e-05,2.7e-05,2.5e-05,2.2e-05,2.5e-05,2.7e-05,3e-05,7e-06,3.9e-05,4.8e-05,3.4e-05,1.8e-05,1.3e-05,2.6e-05,1.4e-05,1.8e-05,1.7e-05,6.3e-05,2.3e-05,1.3e-05,8e-06,3e-06,9e-06,2e-06,1e-05,6e-06,1.2e-05,3e-06,3e-06,2e-06,3e-06,2e-06,6e-06,5e-06,2e-06,4e-06,3e-06
3e-06,2e-06,3e-06,3e-06,2e-06,2e-06,3e-06,1e-06,2e-06,3e-06,2e-06,3e-06,4e-06,5e-06,3e-06,4e-06,5e-06,6e-06,0,3e-06,6e-06,8e-06,6e-06,1e-05,1e-06,0.00011,0.00017,8.5e-05,5.4e-05,3.4e-05,5e-05,2.9e-05,4.5e-05,6.1e-05,1e-04,7.9e-05,6.2e-05,5e-05,0.000239,0.000236,0.000378,0.000292,0.000139,0.000409,0.000336,0.00033,0.000263,4.5e-05,0.000214,0.000196,0.000186,0.000199,0.000115,0.000215,0.000127,0.000198,5.4e-05,7.6e-05,0.000179,0.00036,0.000175,0.000295,0.000227,0.00031,4.9e-05,7.1e-05,0.000129,0.000159,0.000176,0.000179,0.000108,5.6e-05,5.5e-05,0.000115,1.2e-05,0.000129,5.4e-05,4.5e-05,8.6e-05,9.4e-05,9.7e-05,6.5e-05,1.6e-05,1.6e-05,7e-06,3.7e-05,1.1e-05,1.1e-05,2.8e-05,3.4e-05,6e-06,6e-06,4.8e-05,4.1e-05,7.7e-05,3.3e-05,2e-05,7.7e-05,3.4e-05,5e-05,3.1e-05,5.1e-05,3e-05,1.7e-05,1.1e-05,5e-06,8e-06,7e-06,3e-06,1e-05,1.5e-05,3e-06,1.1e-05,6e-06,5e-06,1e-06,1.1e-05,1.1e-05,6e-06,7e-06,8e-06
2e-06,4e-06,3e-06,4e-06,2e-06,3e-06,5e-06,4e-06,2e-06,3e-06,0,1e-06,3e-06,3e-06,7e-06,3e-06,1e-06,3e-06,5e-06,3e-06,5e-06,7e-06,7e-06,1.4e-05,5e-06,8.3e-05,4.5e-05,0.00019,3.7e-05,9e-05,4.6e-05,2.2e-05,3.4e-05,5e-05,7e-05,0.000111,4.8e-05,1.8e-05,0.000238,0.000179,0.000256,0.000269,0.000369,0.000465,0.000114,0.000181,0.000153,0.000105,0.000237,0.000114,0.000195,0.000161,0.000102,0.000274,6.7e-05,4.3e-05,0.000315,9.8e-05,0.000227,0.000104,7.6e-05,0.000188,0.000234,0.000256,6.3e-05,0.000204,0.000203,0.000156,4.6e-05,4.2e-05,6.2e-05,9.9e-05,6.2e-05,2.9e-05,9.8e-05,1.5e-05,2.2e-05,2.1e-05,3e-05,7.1e-05,7.6e-05,0.00012,8.1e-05,3.8e-05,1.6e-05,3.1e-05,2.3e-05,1.2e-05,2.1e-05,9.5e-05,4.4e-05,2.3e-05,6.3e-05,1.8e-05,6.1e-05,1.3e-05,2e-06,0.000123,3.9e-05,3.7e-05,2.7e-05,8.3e-05,7.9e-05,4.2e-05,1.1e-05,3e-06,6e-06,7e-06,4e-06,4e-06,1.5e-05,6e-06,1.9e-05,1e-05,8e-06,2e-06,1e-05,3e-06,1e-05,3e-06,6e-06
1e-06,3e-06,3e-06,2e-06,2e-06,2e-06,2e-06,2e-06,1e-06,4e-06,3e-06,4e-06,3e-06,1e-06,4e-06,1e-06,2e-06,2e-06,2e-06,1e-06,6e-06,1.3e-05,6e-06,1.4e-05,3e-06,6e-05,0.000129,4.2e-05,6.5e-05,7.2e-05,1.5e-05,3.8e-05,2.3e-05,6.2e-05,0.000181,3.3e-05,2.8e-05,1.9e-05,0.000267,0.000326,0.000575,0.000125,0.000178,0.000515,0.000368,0.000142,0.00024,0.000137,0.000313,0.000239,0.000251,0.000185,0.000168,0.000204,0.000106,0.000193,0.000123,6.2e-05,0.00022,0.000405,0.00031,0.00016,1e-04,0.000106,0.000238,0.000217,0.000249,0.000504,0.000253,0.000192,0.000131,7.9e-05,0.000119,0.000279,0.000229,0.000111,6e-05,4.6e-05,1.6e-05,0.00012,9.6e-05,0.000113,2e-05,1.7e-05,4.8e-05,2e-05,2.8e-05,2.9e-05,2.3e-05,0.000157,9.8e-05,5e-05,6.3e-05,5.2e-05,3.8e-05,7e-05,5.2e-05,0.000118,5.4e-05,9e-06,2e-05,0.000115,9.6e-05,4.3e-05,1.1e-05,6e-06,7e-06,1.1e-05,7e-06,8e-06,9e-06,1.1e-05,1.8e-05,1.2e-05,1e-06,8e-06,5e-06,8e-06,1.4e-05,1.5e-05,6e-06
1e-06,3e-06,1e-06,2e-06,1e-06,2e-06,2e-06,3e-06,1e-06,4e-06,3e-06,3e-06,2e-06,2e-06,2e-06,2e-06,2e-06,5e-06,3e-06,2e-06,5e-06,1e-05,7e-06,6e-06,6e-06,5.2e-05,0.000199,0.000161,9.6e-05,7e-05,1.5e-05,4.4e-05,5.7e-05,8.3e-05,0.000227,0.000133,8.9e-05,4.4e-05,0.000287,0.00011,0.000562,0.00067,0.000409,0.000337,0.000328,0.000324,0.000118,0.000234,0.000188,0.000195,0.000199,0.000167,0.000292,0.000285,4.8e-05,0.00042,0.000262,3.4e-05,0.000226,0.000557,4.5e-05,0.000324,0.000501,0.000172,0.000236,0.000163,0.000556,0.000322,0.000609,0.000188,0.000207,0.000205,0.000251,0.000273,0.000128,0.000129,9.7e-05,1e-04,6.1e-05,0.000157,7.6e-05,0.00011,5.8e-05,2.5e-05,3.6e-05,2.3e-05,1.9e-05,1.3e-05,3e-05,0.000159,9.1e-05,1.7e-05,7.7e-05,7.7e-05,6.6e-05,7.5e-05,1.8e-05,9.6e-05,0.000114,5.9e-05,3.9e-05,6.3e-05,4e-05,2.8e-05,1.1e-05,4e-06,7e-06,1.4e-05,6e-06,1.1e-05,1.5e-05,1.6e-05,1.1e-05,2e-06,5e-06,1e-05,1.2e-05,4e-06,2.1e-05,5e-06,1.2e-05
2e-06,3e-06,2e-06,0,2e-06,3e-06,2e-06,1e-06,0,1e-06,3e-06,4e-06,1e-06,3e-06,5e-06,2e-06,3e-06,3e-06,3e-06,2e-06,3e-06,1.2e-05,5e-06,8e-06,2e-06,5.7e-05,0.000197,0.000191,8.3e-05,2.3e-05,1.2e-05,4.9e-05,2.4e-05,4.5e-05,0.000271,0.000251,0.000137,7.5e-05,0.000204,0.000135,0.000323,0.000494,0.000229,0.000412,0.000399,9.8e-05,0.000204,8.9e-05,0.000218,0.000272,0.000132,0.00018,0.000213,0.000222,9.7e-05,0.000433,0.00017,0.000192,0.000379,0.000137,0.000325,0.000296,0.00016,0.000426,0.00026,0.000226,0.000348,0.000811,0.000829,0.00051,0.000393,0.000341,0.000328,0.000289,0.000183,0.000218,0.000122,0.000125,0.00013,5.8e-05,0.000155,8.3e-05,5.6e-05,3.4e-05,4.8e-05,6.3e-05,5.6e-05,2.7e-05,2.1e-05,0.00012,7.1e-05,3.5e-05,4.5e-05,5.4e-05,5.4e-05,2.3e-05,2.3e-05,7.1e-05,0.000116,5.8e-05,5e-05,3.9e-05,3.5e-05,1.6e-05,5e-06,3e-06,5e-06,1.1e-05,4e-06,1.3e-05,1.9e-05,4e-06,1.4e-05,9e-06,4e-06,1.4e-05,1.6e-05,2.3e-05,2.6e-05,2.5e-05,1e-05
0,2e-06,1e-06,1e-06,1e-06,1e-06,2e-06,2e-06,1e-06,2e-06,3e-06,3e-06,1e-06,2e-06,3e-06,2e-06,1e-06,3e-06,3e-06,2e-06,2e-06,1e-05,5e-06,1.2e-05,3e-06,6.2e-05,0.000154,0.000124,5.7e-05,3.1e-05,2.6e-05,1.2e-05,2e-05,4.4e-05,0.000204,9.8e-05,2.7e-05,2.2e-05,0.000218,0.000144,0.000184,0.000118,4.8e-05,0.000308,0.000107,0.000221,0.000467,0.00023,0.000288,0.000238,0.000319,0.000194,0.000134,0.000392,0.000189,0.000367,5.3e-05,0.000118,0.00021,0.00025,0.000142,0.000118,0.000208,0.000271,0.000146,8e-05,0.000182,0.00035,0.000171,7.9e-05,0.000111,0.000178,0.000206,8.2e-05,0.000111,0.000118,2.9e-05,0.000102,7.9e-05,8.2e-05,0.000112,7.5e-05,4.8e-05,2.2e-05,2e-05,3.8e-05,1.3e-05,7e-06,2.5e-05,6.7e-05,2.1e-05,6e-06,3.7e-05,1.6e-05,5.1e-05,1.9e-05,1.3e-05,6.5e-05,6.5e-05,2.4e-05,3.2e-05,3e-05,1.7e-05,8e-06,5e-06,7e-06,9e-06,3e-06,4e-06,1e-05,1e-05,7e-06,1.3e-05,5e-06,5e-06,1.1e-05,5e-06,9e-06,7e-06,3e-06,1e-05
1e-06,2e-06,1e-06,1e-06,1e-06,2e-06,2e-06,2e-06,0,2e-06,2e-06,3e-06,1e-06,1e-06,4e-06,1e-06,0,2e-06,1e-06,2e-06,2e-06,1e-05,5e-06,1.1e-05,2e-06,6.6e-05,0.000106,7e-05,1.2e-05,2.6e-05,1e-05,1e-05,1e-05,3.2e-05,9.5e-05,5.7e-05,3.1e-05,3e-06,0.000203,0.000119,0.000138,0.000263,0.000214,0.00011,0.000217,0.000296,0.000234,7.3e-05,0.000283,0.000115,0.000138,0.000291,0.00028,0.000165,0.000184,0.000102,0.000162,0.000111,8.8e-05,0.000173,3.4e-05,0.000154,0.000108,0.000143,4.7e-05,4.8e-05,4.8e-05,0.000184,2.9e-05,3.4e-05,6e-06,0.000168,6.1e-05,3e-05,4e-05,5.7e-05,2.4e-05,8e-05,4.2e-05,4.5e-05,1e-04,5.9e-05,2.9e-05,9e-06,1.7e-05,1.2e-05,3e-06,7e-06,2.2e-05,2.2e-05,1.8e-05,4e-06,2.9e-05,2.6e-05,6.2e-05,1.9e-05,1e-05,4e-05,1.5e-05,1.6e-05,1.6e-05,4.3e-05,7e-06,4e-06,3e-06,4e-06,6e-06,2e-06,2e-06,9e-06,1e-05,3e-06,4e-06,2e-06,2e-06,6e-06,3e-06,6e-06,2e-06,2e-06,3e-06
0,2e-06,1e-06,2e-06,1e-06,1e-06,2e-06,2e-06,1e-06,2e-06,2e-06,3e-06,0,0,4e-06,1e-06,0,1e-06,1e-06,2e-06,1e-06,1e-05,4e-06,1.1e-05,2e-06,6.9e-05,5.6e-05,0.00011,2.4e-05,1.5e-05,2e-06,1.7e-05,9e-06,3.6e-05,2.8e-05,2.2e-05,4.1e-05,5e-06,0.000191,0.000164,0.000111,8.2e-05,0.000146,0.000121,0.000172,0.000101,0.000185,0.000136,0.000172,0.000148,0.000111,0.000214,2e-04,0.000208,7.9e-05,0.000188,0.000126,0.00021,0.000136,9.5e-05,0.000139,5.7e-05,2.5e-05,0.000143,7.2e-05,5.6e-05,2.3e-05,0.000101,4.3e-05,1.2e-05,2.5e-05,0.000176,5.6e-05,3.5e-05,1.4e-05,3.1e-05,6e-06,5.5e-05,3.3e-05,4.7e-05,0.000103,5.5e-05,2e-05,1.3e-05,3e-06,6e-06,2e-06,3e-06,1.9e-05,1.1e-05,8e-06,5e-06,2.1e-05,1.4e-05,4.3e-05,5e-06,1e-06,1.7e-05,5e-06,4e-06,1.1e-05,3.7e-05,5e-06,4e-06,2e-06,1e-06,6e-06,2e-06,2e-06,9e-06,9e-06,1e-06,3e-06,1e-06,2e-06,5e-06,1e-06,6e-06,1e-06,3e-06,2e-06
0,2e-06,1e-06,1e-06,0,1e-06,2e-06,2e-06,1e-06,1e-06,1e-06,3e-06,0,0,3e-06,1e-06,1e-06,1e-06,1e-06,2e-06,2e-06,1e-05,4e-06,9e-06,0,7.3e-05,3.9e-05,7.4e-05,8e-06,2.2e-05,4e-06,1.5e-05,1.2e-05,2.9e-05,1.8e-05,2.5e-05,4.4e-05,1e-06,0.000185,0.00015,6.8e-05,0.000146,0.000145,6.8e-05,9e-05,0.000149,0.000243,0.000112,0.000197,0.000184,0.000178,0.000255,0.000122,0.000249,7.5e-05,0.000216,1.5e-05,0.000122,6.5e-05,0.000153,4.2e-05,8.2e-05,3.4e-05,0.000158,6.2e-05,5e-05,2.2e-05,4.9e-05,4e-05,1.1e-05,1.1e-05,0.000145,2.9e-05,1.6e-05,4e-06,3.9e-05,3e-06,4.9e-05,2.3e-05,3.8e-05,0.000102,4.7e-05,9e-06,4e-06,7e-06,6e-06,2e-06,1e-06,1.9e-05,1.5e-05,5e-06,2e-06,1.4e-05,1.2e-05,4.3e-05,5e-06,5e-06,7e-06,4e-06,8e-06,7e-06,3.4e-05,2e-06,4e-06,2e-06,1e-06,4e-06,1e-06,2e-06,8e-06,9e-06,1e-06,4e-06,1e-06,2e-06,5e-06,2e-06,4e-06,1e-06,3e-06,1e-06
