5.5e-05,3e-06,4.3e-05,7.8e-05,8e-06,0.000168,2.8e-05,9e-06,5e-06,6.7e-05,4.3e-05,5.6e-05,1.1e-05,7e-06,4.5e-05,2e-06,9.9e-05,0.000118,0.000159,6.1e-05,6.1e-05,9.7e-05,0.000147,5.2e-05,1.8e-05,6e-06,2.9e-05,1.9e-05,3.8e-05,1.7e-05,1e-05,3.7e-05,6e-05,4.9e-05,4.2e-05,2.3e-05,1.3e-05,1.8e-05,3e-06,2.6e-05,2.4e-05,0.00013,7e-06,2.1e-05,1.5e-05,6.3e-05,2e-05,8.3e-05,1.3e-05,8.2e-05,5e-05,0.000138,3.8e-05,4.7e-05,7.7e-05,3e-05,5.6e-05,4.4e-05,8.3e-05,0.000117,1e-06,6e-06,3.4e-05,0.000147,8.9e-05,3e-06,8.2e-05,7.4e-05,0.000107,4.8e-05,1.3e-05,5.3e-05,5.4e-05,6.3e-05,5.3e-05,1.2e-05,8e-05,4.7e-05,6.6e-05,1.4e-05,5e-05,7.2e-05,3.3e-05,1.2e-05,7.5e-05,2.8e-05,6e-06,5.6e-05,5.9e-05,3.1e-05,1.6e-05,3.8e-05,0.000102,9.1e-05,0.000115,3.1e-05,1.4e-05,1e-06,0.000117,7.7e-05,0.000127,6.7e-05,4.9e-05,4.5e-05,4.2e-05,1e-06,9.8e-05,2.6e-05,5e-06,5.1e-05,5.6e-05,1.8e-05,3.5e-05,9.5e-05,3e-05,5.9e-05,3.3e-05,4e-06,0.000132,2e-05,1.8e-05
0.00013,6.8e-05,0.000106,0.000232,8.9e-05,0.000358,7.1e-05,6.2e-05,4.1e-05,0.000169,6.6e-05,0.000174,0.000132,5.7e-05,6.5e-05,7e-06,0.000218,0.000165,0.000284,0.00015,0.00014,0.000226,0.000311,0.000116,5.2e-05,4.2e-05,0.000109,8.9e-05,7e-05,5.4e-05,4.8e-05,0.000102,0.000135,0.000107,0.000138,9.9e-05,2e-05,0.000118,0.000109,0.000139,2.5e-05,0.000332,6.2e-05,0.00014,8.5e-05,0.000121,7.1e-05,0.000226,8.1e-05,0.000222,0.000102,0.000193,0.000188,0.00018,0.000215,2.6e-05,0.000209,0.000156,0.000244,2e-04,7.3e-05,7.2e-05,0.000175,3e-04,0.000191,4.4e-05,0.000196,0.000143,0.00019,0.00011,7.1e-05,0.000101,0.00018,9.6e-05,0.000174,2.8e-05,0.000213,6.3e-05,0.000136,1e-04,0.000149,0.00018,2.7e-05,7.8e-05,8.7e-05,0.000127,2.1e-05,0.000144,0.000116,4.4e-05,1.8e-05,6.7e-05,0.000188,0.000216,0.000253,6.7e-05,1.4e-05,2.6e-05,0.000265,0.000159,0.000293,0.000142,0.000122,0.000122,0.000109,2.2e-05,0.000222,7e-05,5.9e-05,0.000137,0.000141,5.3e-05,3e-05,0.000225,0.000167,8.7e-05,7.8e-05,6.4e-05,0.000251,0.000117,7.6e-05
4.7e-05,0.000165,0.000312,0.000314,0.000291,0.000519,0.000204,0.000154,7.9e-05,0.000295,5.4e-05,0.000347,5.4e-05,0.000117,0.000141,0.000109,0.000233,0.000293,0.000337,0.000451,7.3e-05,0.000337,0.000509,0.000227,5.8e-05,0.000168,0.000271,0.000193,0.000252,0.000141,0.000155,0.000138,0.000264,8.5e-05,0.000115,0.000113,0.000107,0.000237,0.000329,0.000273,0.000178,0.000401,5.8e-05,0.000295,0.000175,0.00014,0.000188,0.000372,0.000127,0.00032,5.4e-05,0.000348,0.000167,4.2e-05,0.000244,0.000191,0.000157,0.000104,0.000145,0.000268,0.000218,1e-04,0.000397,0.000363,0.000287,0.000133,0.00041,0.000128,0.000411,0.000257,0.000307,0.00025,0.000312,0.000267,0.00025,0.000297,0.000257,0.000268,0.000391,0.000149,0.000152,0.000135,2.1e-05,9.6e-05,0.000329,0.000144,0.000157,0.000274,1e-04,0.000116,0.000105,0.000182,0.000163,0.000271,0.000391,0.000238,0.000183,8.2e-05,0.000432,0.000353,0.000467,9.4e-05,0.000341,0.000177,8e-05,0.000157,0.000345,0.000177,0.000341,0.000326,0.000303,6.2e-05,8.3e-05,0.000273,0.000193,0.000316,0.000108,0.000117,0.000196,2.4e-05,0.000167
0.000302,0.000423,0.00067,0.000849,0.001258,0.001569,7e-04,0.00045,0.000405,0.00057,0.000161,0.000608,0.00037,0.000294,0.000103,0.000294,0.000456,0.000359,0.00092,0.000918,0.000732,0.000334,0.001146,0.000663,0.000136,0.000345,0.000703,0.000321,0.000343,0.000237,0.000264,9.4e-05,0.000621,0.000556,0.000282,0.000175,0.000221,0.000485,0.000814,0.000634,0.000321,0.000421,0.000368,0.000292,0.000236,0.00041,0.000579,0.000754,0.000926,0.000881,0.000493,0.000573,0.00032,0.00045,0.00058,0.000564,0.000259,0.000181,0.000494,0.000487,0.000431,0.00059,0.000301,0.00088,0.000841,0.00048,0.000417,0.000105,0.000741,0.000703,0.000352,0.000135,0.000639,0.000197,0.000514,0.000296,0.000655,0.000559,7e-04,0.000783,0.000442,0.000501,0.000306,0.00011,0.000515,0.000149,0.000278,0.000302,0.000608,0.000468,0.000516,0.00046,0.000508,0.000517,0.000683,0.000981,0.000365,0.000177,0.000669,0.000568,0.000851,0.000655,0.000291,0.000311,7.3e-05,0.000159,0.00042,0.000591,0.000126,3e-04,0.000574,0.000625,0.000214,0.00034,9e-05,0.000202,0.00038,0.00043,0.00062,0.000285,0.000297
0.000388,0.000678,0.001617,0.000485,0.00134,0.001026,0.000932,0.000512,0.000714,0.000892,0.000754,0.000746,0.000682,0.00046,0.000218,0.000309,0.000544,0.000885,0.001667,0.001872,0.001149,0.001092,0.001318,0.0017,0.001341,0.000434,0.000649,0.000579,0.000107,0.000492,0.000169,8.4e-05,0.00082,0.000283,0.00016,0.000418,0.000554,0.000173,0.00044,0.001016,0.000699,0.000651,0.000421,0.000845,0.000966,0.001128,0.001055,0.000506,0.000755,0.000797,0.000903,0.000967,0.000766,0.00047,0.001216,0.001457,0.000747,0.000287,0.000393,0.000142,0.000196,0.000371,0.000788,0.00112,0.001199,0.000873,0.000766,0.000217,0.000748,0.001028,0.001129,0.000531,0.000767,0.000712,0.000624,0.000433,0.000923,0.000486,0.000709,0.00041,0.000846,0.000332,4.7e-05,0.000324,0.000655,0.00073,2.8e-05,8.7e-05,0.000516,0.000411,0.000226,0.00073,0.000878,0.001049,0.000513,0.000397,0.000671,0.000315,0.000592,0.000209,0.00081,0.000974,0.001136,0.001095,0.000627,0.000337,0.000601,0.000566,0.000673,0.000905,0.001156,0.001107,0.000849,0.000797,0.000356,0.000131,0.000393,0.000113,0.000522,0.000789,0.000581
0.000474,0.000489,0.001276,0.001162,0.001486,0.000933,0.000869,0.000596,0.000338,0.00064,0.000679,0.000905,0.000504,0.000229,0.00017,0.000476,0.000139,0.000857,0.000734,0.000361,9.5e-05,0.000642,0.000599,0.000976,0.000175,0.000459,0.00042,0.000274,0.000407,0.000386,0.000434,0.000507,0.000729,0.000627,0.000285,0.000234,0.000472,0.000568,0.000686,7e-04,0.000246,0.000544,0.000402,0.000693,0.000758,0.000254,0.000521,0.00054,0.000489,0.00036,0.000311,0.000135,0.000559,0.000197,0.000841,0.000602,0.000493,0.000685,0.00051,0.000175,0.000393,0.000283,0.000898,0.000444,0.00053,0.000184,0.000154,0.000262,0.00071,0.000152,0.000544,0.000491,0.000641,0.000723,0.000173,0.00038,0.000639,0.000267,0.000597,0.000669,0.000711,0.000383,0.000168,0.000283,0.000428,0.000491,0.000594,0.000296,0.000473,0.000207,0.000399,0.000306,0.00027,0.000319,0.000192,0.000329,0.000548,0.000372,0.000114,0.000283,0.000514,0.000137,0.00036,0.000515,0.000279,2.8e-05,0.00041,0.000147,0.000198,0.000522,0.000356,0.000296,0.000187,0.000436,3e-04,0.000388,3.7e-05,0.000189,0.000412,0.000706,0.000179
0.000612,0.000418,0.001358,5e-04,0.000759,0.000352,0.00027,0.000382,0.00014,0.000451,0.00033,0.000103,8e-06,0.000173,0.000308,0.000444,3e-04,0.000598,0.001094,0.000509,0.000344,0.000295,0.000518,0.000253,0.000614,4.4e-05,0.00027,0.00018,0.000408,0.000172,0.000171,0.000293,0.000372,0.000628,0.000397,0.000317,0.000461,0.000138,0.00039,0.000203,0.000375,0.000272,0.000651,0.000297,0.000646,0.000676,0.000308,0.000148,0.000228,0.000332,0.000537,5e-05,0.000534,0.000524,0.000365,0.000129,0.00035,0.000374,0.000543,0.000213,0.000615,0.000299,0.000953,0.000759,0.00039,0.000134,5e-04,0.000221,0.000107,9.4e-05,0.000242,5.9e-05,0.00056,0.000151,0.000672,0.000368,0.000542,0.000453,0.00029,0.000214,9.3e-05,0.000191,0.000414,0.000153,0.000231,0.000135,0.000368,0.000132,0.00037,8.1e-05,0.000317,0.00039,0.00042,4.4e-05,0.000192,0.000171,0.000391,0.000241,6.6e-05,0.000179,0.000301,7e-05,0.000332,0.000218,4.9e-05,0.000159,0.000266,2.3e-05,6.6e-05,0.000334,0.000329,1.3e-05,0.00017,0.000358,0.000352,0.000429,0.00031,0.000127,0.000335,0.000234,0.000439
0.000501,0.000286,0.001103,0.001047,0.00055,0.000745,0.000853,0.000642,0.000131,0.000455,0.000302,0.000268,0.000272,0.000304,0.000307,0.000717,0.000363,0.000932,0.000941,0.000499,9e-05,0.000201,0.001019,0.000445,0.000522,0.000337,0.000142,0.000218,0.000295,0.000242,0.000257,0.000326,0.000442,0.000622,0.000499,0.000383,0.000235,0.000533,0.000465,0.000302,0.000305,0.000496,0.000598,6.3e-05,0.000394,7.4e-05,7e-04,0.000296,0.000103,0.000413,0.000395,0.000577,0.000371,0.000107,0.000883,0.000377,0.000494,0.000441,0.000324,0.000534,0.000617,0.000734,0.000999,0.000433,0.000257,0.000618,0.000379,0.000698,0.000441,3.2e-05,0.00036,0.000361,0.000594,0.000348,0.000925,0.001138,0.000602,0.000287,0.000731,0.000582,0.000363,0.000204,0.000509,0.000327,0.000762,0.000714,0.000506,0.000535,0.000529,0.000414,0.000414,0.000188,0.00015,0.00028,0.000184,0.000333,0.00027,0.00048,0.000275,0.000234,0.000289,4.2e-05,0.00029,0.000206,0.000231,0.000127,0.000336,4.7e-05,0.000324,0.000181,0.000372,8.4e-05,0.000169,0.00039,0.000402,0.000203,0.000143,0.000186,0.000528,0.000369,0.000514
0.000815,0.00029,0.00078,0.001,0.000448,0.000785,0.000675,0.000429,0.000775,0.000207,0.000617,0.000761,0.00082,0.000595,0.00052,0.000524,0.001039,0.000601,0.001334,0.00115,0.000641,0.000129,0.000911,0.000521,0.000323,0.00029,0.000195,0.000186,0.000278,0.00011,0.000361,0.000649,0.000339,0.000627,0.000357,0.000208,0.000618,0.000835,0.000685,0.000545,0.000723,0.001214,0.000691,0.000553,0.000267,0.000159,0.000574,0.00032,0.000149,0.000487,0.000762,0.000746,0.000661,0.000247,0.000995,0.000944,0.000721,0.000877,0.000668,0.000824,0.000335,0.000474,0.000251,0.000189,0.000235,0.000643,0.000697,0.001228,0.001062,0.000592,0.000691,0.00014,0.000231,0.000405,0.000699,0.000581,0.000589,0.000391,0.000434,0.000473,0.000923,0.000364,0.000409,0.000112,0.000824,0.000724,0.000501,0.000133,0.000818,0.000465,0.000164,0.000235,0.000188,0.000253,0.000357,6e-05,0.00037,0.000218,3.6e-05,0.000391,0.00052,0.00048,0.000413,0.000443,0.000375,0.000347,0.000753,0.000576,0.000779,0.000474,0.00045,0.000527,0.00019,0.000137,0.000179,0.000307,0.000397,0.000491,0.000582,0.000468,9.8e-05
0.000301,0.000327,0.00057,0.000448,0.000524,0.000629,0.000199,0.000286,0.00043,0.000371,0.000597,0.000243,0.000431,0.000255,0.00046,0.000637,0.000791,0.001325,0.000512,0.000445,0.000198,0.000365,0.000323,0.000265,0.00048,0.000336,0.000289,0.00034,0.000366,0.000302,0.000234,0.000257,0.000601,0.000385,0.000349,0.000362,0.000422,0.000131,0.000135,0.000485,0.000201,0.000596,0.000476,0.000577,3.8e-05,0.000134,0.00038,0.000386,0.000131,0.000408,0.000263,4e-04,0.000616,6.2e-05,0.00072,0.00024,0.000298,0.000365,0.000432,0.000302,0.000394,0.000301,0.000519,0.000394,0.000169,0.000797,0.000606,0.000402,0.000208,0.000217,0.000479,0.000486,0.000345,0.000598,0.000283,0.000301,0.000241,0.000564,0.000518,7.3e-05,0.000599,0.000578,0.00043,0.000352,0.000687,0.000223,0.000208,0.000368,0.000843,0.000442,0.000251,0.000254,0.000313,0.000257,0.000188,0.000191,0.000442,0.000566,5e-04,0.000468,0.000301,0.000315,0.000104,0.000354,0.00026,0.000258,0.00074,0.000346,0.000371,0.00064,0.000477,0.000481,0.000405,0.000344,0.000123,0.00032,2e-04,0.000131,0.000718,0.000251,0.000146
0.000317,0.000228,0.000581,0.000677,0.000167,0.000341,0.000423,0.000585,0.000503,0.000136,0.000363,0.00048,0.000186,0.000231,9.5e-05,0.000431,0.000402,0.000798,0.000636,0.000355,0.000111,0.000479,0.00033,0.000306,0.000139,0.000174,3.9e-05,0.000106,0.000257,3.4e-05,0.00023,0.000312,0.000358,5.6e-05,0.000172,0.000228,0.000269,0.000162,0.00027,0.000345,0.000261,0.000285,0.000105,0.000289,0.000278,0.000168,0.000214,0.000257,0.000165,0.000256,0.000396,0.000554,0.00022,0.000509,0.000105,0.000322,3.8e-05,0.000276,0.00038,0.000443,0.000328,0.000283,0.000407,0.000267,0.000293,0.00063,0.000402,0.000357,0.000378,0.000241,7.5e-05,0.00031,0.00036,0.000341,0.000235,0.000197,0.000246,0.000538,0.000303,4.8e-05,0.000389,0.000488,0.000431,4.9e-05,0.000179,0.000156,0.000204,0.000438,0.000325,0.00034,0.00049,0.000271,2.2e-05,0.00024,0.000174,0.000348,0.000109,0.000458,0.000537,0.000311,0.000349,0.000184,0.000165,0.000383,0.00026,0.000222,0.000389,0.000179,0.000308,0.000212,0.000452,0.000305,9.4e-05,7.6e-05,0.000201,6.5e-05,0.000323,0.000219,0.000425,0.000521,0.000461
0.000163,9.1e-05,0.000232,0.000182,0.000384,0.000314,0.00032,0.00038,0.000253,3.5e-05,0.000126,0.000348,0.000136,1.5e-05,6.5e-05,0.000224,0.000266,0.000183,0.000447,0.000174,0.000109,0.000287,0.000226,0.000184,9.8e-05,8e-05,7.6e-05,8.1e-05,0.000246,0.000211,0.000158,2.5e-05,0.000394,0.000185,5.8e-05,9.8e-05,8e-06,3e-05,0.000252,0.000111,0.000121,0.000277,0.000287,5.2e-05,0.000127,0.000205,8.2e-05,0.000145,8e-06,0.000105,3.5e-05,0.000247,9e-05,0.000345,0.000163,0.000358,0.000235,0.000132,0.000257,0.000132,0.000284,0.000304,0.000508,0.00014,0.000336,5.9e-05,0.000299,0.000542,0.000254,0.000135,0.000173,0.000171,9.4e-05,7.9e-05,0.000252,0.000205,0.000376,0.00013,0.000148,6.8e-05,0.000174,0.00016,0.000141,6.9e-05,0.00019,0.000134,0.000124,0.000124,0.000375,0.000157,0.00023,3.8e-05,4.4e-05,9.1e-05,0.000359,0.00023,0.000236,0.00014,0.000129,7.8e-05,0.000111,0.000185,3.9e-05,0.000284,6.8e-05,8e-05,0.000138,2.9e-05,7.7e-05,0.000189,0.000221,9.3e-05,0.000138,0.000148,0.000182,0.000127,0.000119,6.5e-05,0.000317,0.00023,0.000151
0.000162,1.6e-05,0.00022,0.000113,0.000111,0.000109,0.000298,0.000228,0.000211,0.000165,0.000185,0.000187,0.00019,0.000196,2e-04,0.000141,0.000161,0.000269,0.000236,0.000269,9e-05,1e-04,0.000102,2e-04,9.6e-05,0.000103,5.5e-05,0.000164,0.000116,5.2e-05,3.7e-05,6e-05,5.9e-05,7.4e-05,9.4e-05,0.000112,0.000183,0.000119,6.6e-05,0.000239,2e-04,9.5e-05,0.000176,7.7e-05,0.00011,0.000125,7.1e-05,8.7e-05,7.3e-05,5.1e-05,5.3e-05,0.000194,7.6e-05,0.00027,0.000105,0.000165,2.1e-05,0.00023,6.5e-05,0.000111,9.1e-05,0.000106,0.000484,0.000137,0.000289,9.8e-05,0.000238,0.000381,0.000133,0.000157,1.6e-05,0.000103,0.000109,3.1e-05,0.000103,6.7e-05,0.00025,0.000104,2.2e-05,0.000225,0.00024,4e-05,9e-05,9.2e-05,0.000176,7.9e-05,0.000159,0.000197,0.000286,9e-05,6.5e-05,3.3e-05,7e-05,0.00027,0.000126,6.6e-05,8.1e-05,5.1e-05,0.000163,0.000117,7.9e-05,8e-05,6.2e-05,0.000121,2.4e-05,0.000175,3.2e-05,8.3e-05,0.000124,0.000135,6.9e-05,0.000121,5.7e-05,0.000142,0.000135,7.6e-05,0.000116,9.1e-05,3.1e-05,0.000127,0.000147
0.000181,0.000145,0.00026,0.000294,0.000204,0.00011,0.00015,0.000413,0.000235,0.000166,0.000205,8.4e-05,0.000217,0.000195,0.000218,0.000255,0.000195,0.000214,0.000149,0.000257,0.000256,4e-05,0.000156,0.00013,0.000122,6.4e-05,8.2e-05,0.00025,0.000121,0.000113,0.000147,0.000159,0.000139,0.00014,0.000109,6.6e-05,0.000118,6.3e-05,0.000185,0.000342,0.000137,0.000151,0.000249,0.000119,0.000111,0.00019,0.000142,0.000213,0.000219,0.000148,9e-06,0.000126,0.000163,0.000205,0.00014,0.00017,0.000102,0.00017,0.000185,8.2e-05,7.4e-05,0.000149,0.000242,0.000164,0.000168,0.000162,8.5e-05,0.000187,0.000115,0.000199,0.000231,0.000113,0.000102,7.7e-05,5.6e-05,0.000112,8.8e-05,0.000184,0.000196,0.000194,4.8e-05,8.2e-05,0.000247,0.000144,9.1e-05,0.000126,0.00024,0.000243,0.000169,8.6e-05,0.000254,0.000167,0.000134,0.000328,0.000167,1e-04,0.000124,0.000127,0.000138,8.1e-05,7.6e-05,0.000158,2.2e-05,7.7e-05,0.000134,0.000155,0.000192,8.8e-05,0.000148,0.000138,0.00013,7.4e-05,0.000133,0.000131,0.000112,0.000116,0.000227,8.1e-05,0.000183,0.00014,7.5e-05
4e-05,0.000319,0.00022,0.000124,0.000205,0.00022,0.000165,0.000426,0.000218,0.000152,0.000186,9.5e-05,0.00013,0.00013,0.000175,0.000287,0.000234,0.000262,0.000138,9.7e-05,0.00015,0.000104,9e-05,0.000118,9.3e-05,0.000218,6.2e-05,0.000329,8.7e-05,0.000177,0.000215,0.000217,0.000279,0.000137,0.000138,7.6e-05,0.000204,0.000178,0.000357,0.000496,0.000111,0.000156,0.000181,9.2e-05,0.000204,0.000353,0.00019,0.000174,7.6e-05,0.000111,8.4e-05,3.7e-05,0.000342,0.000252,0.000204,0.000479,7.6e-05,2.5e-05,0.000375,5e-05,0.000322,0.000164,0.000157,0.000452,0.000428,0.00035,0.000321,0.000272,0.000101,0.000299,0.000217,0.000167,0.000259,0.000195,0.000218,0.000113,0.000212,0.000159,0.000134,0.000162,0.000168,0.000173,0.000121,0.000116,0.000312,0.000232,0.000338,2e-05,0.00023,0.000304,0.000174,8.8e-05,0.000114,7.4e-05,0.000224,0.000133,0.000127,5.4e-05,0.000128,9.1e-05,0.000176,0.000152,0.000239,0.000234,0.000154,0.000224,0.000172,0.000116,0.000138,0.000118,3.5e-05,0.000187,0.000233,0.000162,0.000162,0.000216,0.000195,0.000304,0.000233,0.00022,4.2e-05
0.00017,0.000443,0.000536,0.000348,0.000327,0.000116,0.000522,0.000106,2.7e-05,0.000271,2.2e-05,5.7e-05,0.000207,0.000458,0.00016,0.000327,0.00012,0.000417,0.000589,0.000238,0.000244,6.8e-05,0.000339,0.000288,0.000126,0.00046,0.000183,0.000538,0.000154,0.00032,0.00057,0.000623,0.000131,0.000351,0.000134,0.000181,0.000314,0.000231,0.000473,0.000553,0.00053,0.000339,0.000328,0.000279,0.00032,0.000359,0.000421,0.000331,0.000165,0.000222,0.000235,0.000261,0.000333,0.000339,0.000321,0.000296,0.000558,9.3e-05,0.000242,0.000482,0.000679,0.00037,0.000472,0.000663,0.000201,0.000495,5.9e-05,0.00012,0.000151,0.000359,0.000439,0.000473,0.000339,0.000245,0.00032,0.000224,0.000252,0.000116,0.000306,0.00024,0.000257,0.000128,2e-04,0.000345,0.000236,0.000529,0.000398,0.000541,0.000507,0.000582,0.000537,0.00023,0.00014,0.000401,0.000539,7.4e-05,0.000249,0.000251,0.000266,0.000219,0.000201,0.000238,0.000101,0.000221,0.000232,0.000231,0.000263,0.000123,0.00012,8.8e-05,0.000147,0.000366,0.000223,0.000159,7.7e-05,0.000574,0.000346,0.000313,0.000547,0.000183,0.000218
0.00045,0.000525,0.000277,0.000836,0.001134,0.001109,0.001059,0.000596,0.000301,0.000269,0.000215,1e-04,0.000203,0.000384,0.000768,0.000785,0.000522,0.000757,0.000788,0.000696,0.00016,0.000267,0.00047,0.000349,0.00063,0.000865,0.000772,0.000325,0.000494,0.00017,0.000765,0.000257,0.000626,0.000806,0.00072,0.000267,0.000441,0.00044,0.000684,0.000444,0.000603,6.9e-05,0.000248,0.000602,0.000724,1.6e-05,0.000843,0.000591,0.00042,0.000405,0.000379,0.00043,0.000423,0.000457,0.000139,0.000251,0.000682,0.000669,0.000166,0.000596,0.000777,0.000948,0.001009,0.001082,0.001067,0.001074,0.000531,0.00016,0.000242,0.000242,0.000601,0.000178,0.000476,0.000239,0.000364,0.000214,0.000119,0.000175,0.000334,0.00038,0.000449,0.00021,0.000445,0.000871,0.000824,0.000391,0.000874,0.001181,0.000559,0.000472,7.3e-05,0.000236,0.000252,0.000441,0.00061,0.000725,0.000493,8.2e-05,0.000434,0.000528,0.000492,0.000626,0.000378,0.000421,0.00045,0.000588,0.000581,0.000255,0.000203,8.1e-05,0.000222,0.000496,0.000772,0.000893,0.000476,0.000779,0.000794,0.000343,0.000348,0.000346,0.000235
0.000306,0.000185,0.000617,0.00056,0.000518,0.000383,0.00013,0.000221,7.9e-05,0.000345,0.000284,0.000145,0.000279,0.000462,0.000681,0.000517,0.000372,0.00046,0.000347,0.000153,0.000332,0.000285,0.000157,0.000107,0.000419,0.000454,0.000272,0.000735,0.000887,0.000744,0.000323,0.00028,0.000737,0.000463,8.1e-05,0.000213,0.000491,0.00047,0.000245,0.000551,0.000828,0.000744,0.000704,0.000587,0.000607,0.000609,0.000677,0.000501,0.000276,0.000564,0.000135,0.00028,0.000194,0.000147,0.000404,0.000438,0.000457,0.000434,0.000731,0.000572,0.00039,0.000607,0.000816,0.00018,0.000291,0.000534,0.000434,0.000632,0.000222,7.8e-05,0.000437,0.00037,0.00039,0.000271,0.000336,0.000136,0.000272,0.000286,0.000321,0.000343,0.000318,0.000418,0.00073,0.000848,0.000402,0.000803,0.000307,0.000462,0.000594,0.000199,9.9e-05,0.000269,9.2e-05,0.000271,0.000109,0.000436,0.000239,0.00024,0.000267,0.000232,0.000195,0.000554,0.000393,8.5e-05,0.000243,0.00033,0.000153,0.000206,6.3e-05,0.000256,0.00036,0.000202,0.000499,0.000456,0.000278,0.000407,0.000138,0.000331,0.000207,0.000122,0.000222
0.000257,0.000357,0.000253,0.000316,0.000148,0.000481,0.000264,0.000156,0.000114,0.000251,0.00024,0.000185,0.000441,0.000158,0.000299,0.000135,0.000179,0.000319,0.000105,0.000157,0.000232,0.000257,0.000168,8.6e-05,0.00027,0.000127,0.000342,0.000217,0.000357,0.000241,4.2e-05,9.6e-05,0.000327,0.000109,8.4e-05,0.00019,0.000333,0.000181,0.000142,0.00015,0.000489,6.2e-05,0.000357,0.00028,0.000527,0.000144,0.000355,0.000118,0.000321,0.000283,0.000301,0.000161,0.000236,0.000101,0.000304,0.000336,0.000185,0.000338,0.000366,0.000223,0.000307,0.000185,0.000662,0.000426,0.000168,7.7e-05,0.000141,0.000292,0.000242,0.000266,0.000188,2.9e-05,0.000181,0.000155,6.6e-05,0.000172,0.000277,0.000292,8.6e-05,0.00013,0.00036,0.000194,0.000206,0.000254,7.6e-05,0.000342,0.000238,5.6e-05,0.000207,0.000165,0.000163,0.000288,0.000245,0.000164,0.000284,5.3e-05,0.000135,0.000123,0.000117,0.000125,9.9e-05,0.000301,6.7e-05,3.2e-05,0.000125,0.000162,2.6e-05,0.000197,0.000205,0.000333,9.6e-05,0.000295,0.000114,0.000401,0.000143,0.00021,0.000145,0.000285,8.3e-05,0.000172,4.9e-05
0.000205,0.000112,0.000208,0.000266,4.1e-05,0.000118,6.1e-05,9.8e-05,1.4e-05,0.000114,9.5e-05,4.4e-05,0.000243,0.000189,8.8e-05,5.9e-05,0.000104,0.000465,9.5e-05,0.000287,0.000183,0.000163,6.4e-05,9.1e-05,0.00016,0.000128,7.6e-05,0.000269,0.000256,0.000428,0.00027,0.000121,3.4e-05,9.2e-05,0.000131,7.8e-05,0.000177,7.4e-05,0.000115,0.000282,0.000148,0.000167,0.000218,0.000419,0.000149,0.000139,0.00025,7.1e-05,0.000163,0.000174,0.00015,0.000194,0.00015,0.00012,0.000203,0.000299,0.000215,3.4e-05,0.000325,0.000294,4.7e-05,9.8e-05,0.00024,0.000171,0.000111,0.000199,3.2e-05,0.00014,0.00018,7.3e-05,0.000197,0.000221,5e-05,0.000155,3.3e-05,0.000174,3.1e-05,0.000211,6.8e-05,7.4e-05,0.000154,0.000159,8.9e-05,2.3e-05,0.000118,0.000204,0.000182,0.000175,5e-05,4e-05,0.000213,6.2e-05,0.00011,1e-04,0.000212,0.000215,4.1e-05,0.00013,0.000184,9.8e-05,0.000145,8.7e-05,9e-05,0.000114,1.4e-05,5.6e-05,6.4e-05,0.000186,5.3e-05,0.000192,0.000304,0.00015,0.000121,0.000136,8.8e-05,7.8e-05,2.4e-05,0.000147,6.8e-05,8.7e-05,5.2e-05
0.000105,5.9e-05,0.000135,0.000112,4.8e-05,6.7e-05,9.9e-05,0.000111,7.7e-05,0.000147,8.1e-05,8.8e-05,6e-05,4.9e-05,8.9e-05,9.6e-05,0.000116,0.000247,8.3e-05,0.000267,0.000165,0.000173,9.3e-05,3.6e-05,0.000113,8.2e-05,4e-05,0.000166,0.000272,0.000141,0.000127,4.9e-05,0.000204,7.1e-05,9.2e-05,0.000106,0.000115,6.6e-05,4.2e-05,0.000159,9.1e-05,8.5e-05,0.000139,2e-04,0.000125,4.1e-05,0.000178,0.000144,3.6e-05,7.8e-05,5.9e-05,7.1e-05,0.000165,5.1e-05,4.2e-05,0.000146,0.000115,3.3e-05,0.000164,5.4e-05,0.000183,4.2e-05,0.000116,2.9e-05,6.5e-05,0.000131,8.7e-05,3.1e-05,1.3e-05,2.8e-05,5.3e-05,7.3e-05,0.000122,7.1e-05,5.9e-05,8e-05,1.8e-05,0.000128,9.9e-05,8.3e-05,8.2e-05,9.8e-05,0.000113,0.000113,0.000119,6.3e-05,0.000194,5.3e-05,4.1e-05,1.5e-05,0.000104,5.4e-05,1.3e-05,9.4e-05,7.9e-05,0.000136,6.4e-05,5.7e-05,9.4e-05,6.4e-05,0.000149,2.6e-05,4.4e-05,4.5e-05,4.4e-05,6.3e-05,0.000102,4e-05,0.000121,8.4e-05,0.000197,0.000199,0.000194,7.8e-05,7.6e-05,0.000119,8e-05,3.8e-05,2.4e-05,1.7e-05,1.5e-05
9.7e-05,2.4e-05,0.000101,0.000158,2.4e-05,9e-05,0.000103,2.2e-05,2.9e-05,6.6e-05,4.3e-05,6.3e-05,0.000106,4.6e-05,7.3e-05,2.5e-05,0.000147,0.000187,4.6e-05,0.00014,9.5e-05,8.7e-05,6.1e-05,4.2e-05,0.000112,6.9e-05,2.8e-05,0.000101,0.000139,0.000145,3.1e-05,0.000101,0.000123,9.1e-05,1.6e-05,8.8e-05,9.2e-05,1.1e-05,5.1e-05,0.000154,7.8e-05,2.9e-05,9e-05,0.00018,0.000119,0.000107,8.7e-05,7.4e-05,3.2e-05,3e-05,4e-06,6e-06,8.5e-05,4.1e-05,5.3e-05,0.00013,9.1e-05,2.8e-05,0.000156,9.8e-05,0.000171,5.8e-05,0.00015,1e-04,7e-05,3.4e-05,5.3e-05,1.6e-05,6.3e-05,4.4e-05,5.2e-05,2.6e-05,9.2e-05,9.8e-05,0.000108,0.000103,4.6e-05,8e-06,2.4e-05,5.9e-05,6.9e-05,7.9e-05,9.5e-05,4e-05,9.3e-05,7.1e-05,0.000102,3.4e-05,3.9e-05,1.8e-05,7.5e-05,2.8e-05,7.7e-05,8.6e-05,6e-06,0.000118,6e-06,4.5e-05,7.9e-05,1.8e-05,7.1e-05,5e-05,2.4e-05,7.5e-05,2.9e-05,5.8e-05,6.5e-05,4.8e-05,5.6e-05,0.000114,0.000154,3.3e-05,4.9e-05,0.000108,0.000104,2.7e-05,4e-05,5.7e-05,1.9e-05,4e-05,0.000106
6e-06,2.4e-05,3.9e-05,7.5e-05,1.2e-05,4.1e-05,5.6e-05,2e-05,8e-06,2e-05,1.3e-05,3.3e-05,4.1e-05,1.7e-05,2e-05,2.2e-05,4.8e-05,0.000119,3.9e-05,6.6e-05,1e-05,6.4e-05,1.8e-05,1.3e-05,1.2e-05,3e-05,1.4e-05,5.6e-05,1e-05,4.1e-05,1.1e-05,3e-05,5.2e-05,4.3e-05,5e-05,2.6e-05,4.8e-05,1e-05,1.5e-05,5.8e-05,1.9e-05,2.8e-05,2.2e-05,8.1e-05,3.1e-05,9e-06,5.6e-05,1.2e-05,2.2e-05,1.6e-05,2e-05,3.1e-05,1.2e-05,1.8e-05,4.2e-05,1.6e-05,1.4e-05,9e-06,4.9e-05,2.6e-05,5.4e-05,2.6e-05,5.7e-05,2.1e-05,1.6e-05,2.9e-05,3.8e-05,2.3e-05,1.4e-05,2.4e-05,1.1e-05,2.1e-05,4.2e-05,3.2e-05,5.7e-05,3e-05,3.1e-05,2e-06,6e-06,5.3e-05,2.5e-05,4.7e-05,4.5e-05,1e-05,3e-05,4e-05,4.9e-05,1.4e-05,1.7e-05,2.2e-05,3.5e-05,2.1e-05,2.5e-05,2e-06,3.7e-05,5.4e-05,1.1e-05,1.2e-05,3.5e-05,7e-06,3.2e-05,2.2e-05,2.8e-05,3.3e-05,2e-05,1.7e-05,3e-05,1.3e-05,3e-05,4.1e-05,2e-05,4.5e-05,3.4e-05,2.7e-05,3e-06,2.8e-05,1.9e-05,1.9e-05,6e-06,2.2e-05,5.1e-05
6.7e-05,4.2e-05,2.8e-05,4.6e-05,3.6e-05,4.5e-05,4.3e-05,3e-05,1.3e-05,2.4e-05,9e-06,1.2e-05,2.2e-05,2.9e-05,3.4e-05,1.3e-05,8e-06,0.000103,3.5e-05,8.8e-05,3.6e-05,3.9e-05,1.1e-05,1.5e-05,2.3e-05,1.8e-05,1.1e-05,4.2e-05,3.3e-05,4e-06,3.1e-05,1.8e-05,5.3e-05,2.7e-05,4.3e-05,5.8e-05,1.8e-05,1.8e-05,9e-06,5e-05,3.3e-05,8e-06,7e-06,7.3e-05,1.7e-05,2.7e-05,5.2e-05,3.3e-05,1.3e-05,3e-05,3.9e-05,3.1e-05,6.3e-05,3.2e-05,3.9e-05,2.5e-05,5.3e-05,1.2e-05,2e-05,4.9e-05,5.4e-05,1e-05,4.6e-05,1e-05,8e-06,2.6e-05,2.8e-05,1.8e-05,3.8e-05,3.6e-05,1.7e-05,3.2e-05,3.9e-05,4.5e-05,4.6e-05,5.8e-05,3e-06,7e-06,2.3e-05,5.3e-05,1.6e-05,1.6e-05,4.7e-05,2.2e-05,3.5e-05,2.3e-05,2.2e-05,3.5e-05,1.9e-05,2e-05,3.3e-05,1e-05,1.5e-05,2e-05,2.1e-05,3.3e-05,1.9e-05,1.4e-05,2.6e-05,2.3e-05,3.3e-05,2.4e-05,2.4e-05,3.5e-05,1.1e-05,8e-06,1.6e-05,2.5e-05,2.4e-05,4.7e-05,1.4e-05,3e-05,4.8e-05,2.3e-05,1.3e-05,2.9e-05,4.8e-05,3.7e-05,4.1e-05,3.5e-05,4.3e-05
3.5e-05,3e-05,2.4e-05,3.3e-05,2.6e-05,5.2e-05,2.4e-05,1.4e-05,2.2e-05,2.9e-05,2.2e-05,2e-05,4.6e-05,4.3e-05,3e-05,1.6e-05,1.6e-05,8.2e-05,3.7e-05,9.9e-05,3e-05,9e-06,7e-05,2.5e-05,2.4e-05,7e-06,2.3e-05,2.4e-05,5.3e-05,6.4e-05,3.1e-05,5e-06,7.6e-05,5.2e-05,3.5e-05,2.6e-05,4.5e-05,3.8e-05,5.1e-05,4.3e-05,1.7e-05,2.2e-05,3e-05,7.7e-05,2.7e-05,3.7e-05,3.9e-05,3e-06,1.6e-05,1.8e-05,2.4e-05,3.6e-05,4.7e-05,4.3e-05,1.4e-05,2e-05,4.6e-05,7.2e-05,6e-05,1.8e-05,2.3e-05,3.7e-05,2e-05,2.3e-05,2e-05,7e-06,3.2e-05,4.3e-05,6.1e-05,1.9e-05,3e-05,3.5e-05,5.6e-05,6.5e-05,2.3e-05,1.6e-05,1.6e-05,1.3e-05,3.7e-05,5.8e-05,1.7e-05,3.2e-05,3.7e-05,3.3e-05,3.1e-05,5.4e-05,2.7e-05,1e-05,1.5e-05,1.2e-05,1e-05,3.2e-05,1.8e-05,3.9e-05,3.7e-05,3.2e-05,3.1e-05,2.9e-05,2.8e-05,8e-06,4.4e-05,9e-06,2.9e-05,9e-06,2.8e-05,2.2e-05,2e-05,2.5e-05,2e-05,1.9e-05,1.4e-05,2.1e-05,1.5e-05,1.4e-05,3.5e-05,2.2e-05,4.5e-05,3.1e-05,7.4e-05,2.2e-05,2.8e-05
1.5e-05,2.8e-05,5.5e-05,4.5e-05,3.6e-05,2.2e-05,1.2e-05,1.1e-05,1.7e-05,2.5e-05,1.2e-05,3e-05,4.6e-05,2.9e-05,5.4e-05,3.7e-05,2.4e-05,6.5e-05,1.7e-05,4.4e-05,2.3e-05,1.8e-05,5.4e-05,2.5e-05,2.6e-05,1.5e-05,1.4e-05,3.6e-05,2.5e-05,3.8e-05,3.2e-05,2.6e-05,7.7e-05,3.6e-05,6e-06,2.2e-05,6e-05,1.4e-05,3.6e-05,3.4e-05,3.3e-05,3.6e-05,4e-05,6.2e-05,1.2e-05,1.3e-05,1.8e-05,1.9e-05,1.8e-05,1.2e-05,2.3e-05,2.2e-05,1e-05,2.1e-05,1.1e-05,1.1e-05,4.5e-05,3.9e-05,1.9e-05,1.1e-05,6.2e-05,1.7e-05,3.8e-05,2.7e-05,2.5e-05,2.5e-05,6.2e-05,6e-05,2.8e-05,3.2e-05,1.5e-05,5e-06,4.5e-05,1e-05,1.9e-05,5e-06,2.2e-05,1.9e-05,8e-06,5.6e-05,1.9e-05,2.6e-05,1e-05,2.4e-05,4.1e-05,5.8e-05,2.1e-05,2e-05,1e-05,1.3e-05,1.5e-05,1.2e-05,9e-06,1.9e-05,3.9e-05,4.8e-05,3.7e-05,2.4e-05,1e-05,1e-05,3.5e-05,1e-05,4e-06,2.1e-05,7e-06,2.6e-05,4.2e-05,6e-06,8e-06,3.5e-05,2.7e-05,2.8e-05,3.3e-05,2.2e-05,3.5e-05,8e-06,2.6e-05,1.8e-05,1.9e-05,1.1e-05,2.4e-05
8e-06,3.3e-05,3.9e-05,6.6e-05,4.4e-05,1.3e-05,1.9e-05,8e-06,2e-05,3.4e-05,2e-05,2.4e-05,1.1e-05,1.6e-05,2e-05,2.6e-05,1.2e-05,7.2e-05,3.7e-05,5.1e-05,1.3e-05,2e-05,3.1e-05,1.3e-05,2.2e-05,1.7e-05,1.5e-05,3.8e-05,2.1e-05,3.3e-05,3.3e-05,1.5e-05,6.3e-05,2.8e-05,1.7e-05,2.2e-05,6e-05,3.1e-05,1.5e-05,1.6e-05,2.2e-05,1.1e-05,2e-05,7.9e-05,1.1e-05,4e-06,2.3e-05,2e-06,4e-06,2e-05,1.1e-05,2.7e-05,3e-05,3.1e-05,1e-05,3e-06,1.8e-05,9e-06,2.6e-05,7e-06,3.8e-05,1.4e-05,4.3e-05,2.3e-05,1.6e-05,1.1e-05,2.9e-05,4.2e-05,2e-05,2.3e-05,1.4e-05,2.1e-05,2.5e-05,3.2e-05,2.5e-05,2.1e-05,2e-05,2.6e-05,1.5e-05,4.3e-05,2.4e-05,2.3e-05,1.7e-05,2.4e-05,3.5e-05,2.6e-05,1.4e-05,4e-06,1.2e-05,9e-06,2.3e-05,9e-06,1.4e-05,9e-06,2e-05,2.8e-05,2.6e-05,5e-06,1.2e-05,9e-06,2.5e-05,2.5e-05,2.2e-05,3e-05,1.2e-05,1.6e-05,2.2e-05,2.6e-05,1.5e-05,1.8e-05,2.8e-05,9e-06,3.6e-05,2.3e-05,1.9e-05,3.4e-05,1.2e-05,3.1e-05,2.2e-05,1.7e-05,1.6e-05
2.4e-05,1.5e-05,2.7e-05,4e-05,2.2e-05,3.1e-05,1.3e-05,1.4e-05,1e-06,1.7e-05,9e-06,9e-06,2.6e-05,2.2e-05,2e-05,1.2e-05,2.7e-05,7.6e-05,3.8e-05,4.9e-05,9e-06,2.9e-05,2.4e-05,1.5e-05,1.7e-05,1.6e-05,1.5e-05,2.1e-05,2.2e-05,3.9e-05,1.6e-05,2.1e-05,5.3e-05,2.3e-05,2.6e-05,2.1e-05,4.5e-05,2.6e-05,1.1e-05,3e-05,1.8e-05,1e-05,9e-06,5.8e-05,4e-06,8e-06,1.6e-05,5e-06,1.4e-05,7e-06,1e-05,1.8e-05,4e-06,2.5e-05,9e-06,1.2e-05,2.3e-05,3e-06,2.1e-05,4e-06,4e-05,1e-05,4.1e-05,1.9e-05,2.5e-05,1.9e-05,1.4e-05,2.7e-05,1.4e-05,2.3e-05,1.4e-05,7e-06,1.1e-05,2.4e-05,1.5e-05,8e-06,1.3e-05,1.5e-05,1.1e-05,3.3e-05,1.4e-05,1.1e-05,8e-06,1e-05,4.1e-05,2.5e-05,2.4e-05,1.2e-05,5e-06,2e-06,2e-05,7e-06,1e-05,2.3e-05,2.7e-05,3.1e-05,1.5e-05,5e-06,1.6e-05,2e-06,2.4e-05,2.2e-05,2.5e-05,1.2e-05,2.3e-05,1.5e-05,1.8e-05,1.3e-05,1.4e-05,1.4e-05,1.8e-05,1.1e-05,2.1e-05,1.5e-05,1.5e-05,3.1e-05,1.1e-05,2.4e-05,2.5e-05,1.9e-05,6e-06
1.5e-05,1.1e-05,2.5e-05,4.5e-05,1.5e-05,2.9e-05,2.1e-05,2e-05,2.8e-05,7e-06,7e-06,1.8e-05,3.1e-05,2.9e-05,2.7e-05,1.8e-05,9e-06,7.5e-05,1.6e-05,3.7e-05,1.4e-05,3.7e-05,5.1e-05,2.3e-05,1.5e-05,6e-06,1.2e-05,2.8e-05,8e-06,3.6e-05,1.3e-05,1e-05,4.8e-05,2.5e-05,3e-05,9e-06,4.6e-05,1.8e-05,2.7e-05,1.9e-05,1.5e-05,1.2e-05,1.4e-05,5.8e-05,8e-06,8e-06,2.4e-05,8e-06,1e-05,8e-06,3e-06,1.5e-05,1.8e-05,2.7e-05,1.3e-05,1.1e-05,2.1e-05,1.3e-05,2.9e-05,1.2e-05,3.9e-05,1.2e-05,5.1e-05,8e-06,2.3e-05,1.1e-05,3e-05,3.6e-05,1.4e-05,2.3e-05,1.1e-05,1.8e-05,1.5e-05,2.3e-05,1.8e-05,1.5e-05,2.3e-05,1.6e-05,9e-06,3.5e-05,2e-05,2.2e-05,1.8e-05,2e-05,4.5e-05,1.9e-05,1.9e-05,1.9e-05,1e-05,3e-06,1.1e-05,5e-06,4e-06,1.4e-05,1.9e-05,3e-05,1.7e-05,3e-06,7e-06,8e-06,2.5e-05,1e-05,2.2e-05,2.4e-05,1.6e-05,1e-05,2.6e-05,2.8e-05,3e-06,2e-05,1.7e-05,1.6e-05,3.4e-05,6e-06,1.4e-05,2.3e-05,3e-06,1.8e-05,2.5e-05,7e-06,1.1e-05
1.1e-05,2.1e-05,2.5e-05,5.4e-05,1.4e-05,6e-06,2e-05,2.8e-05,1.7e-05,2.6e-05,2e-06,1.8e-05,2.9e-05,3.9e-05,2.3e-05,1.2e-05,1.1e-05,8.7e-05,1.5e-05,4.2e-05,3.3e-05,3.2e-05,2.6e-05,2.3e-05,3.6e-05,3.6e-05,1.4e-05,1e-05,3e-05,4.3e-05,2e-05,2.5e-05,5.8e-05,2.8e-05,3e-05,3.3e-05,2e-05,1.6e-05,1.4e-05,2.9e-05,1.9e-05,1e-05,1.2e-05,5.9e-05,2.1e-05,2e-05,4e-06,1.3e-05,4e-06,1.2e-05,7e-06,2.7e-05,1.7e-05,3.7e-05,1.1e-05,1.9e-05,1.8e-05,5e-06,1.5e-05,1.4e-05,4e-05,1.9e-05,4.7e-05,2.4e-05,1.2e-05,3e-06,2.6e-05,2.8e-05,4e-06,3.3e-05,4e-06,2.7e-05,3.5e-05,3e-05,1.5e-05,1.5e-05,2.2e-05,2.6e-05,1e-05,2.3e-05,1.7e-05,1.4e-05,2.3e-05,7e-06,3.6e-05,2.3e-05,6e-06,5e-06,1e-06,1.5e-05,1.5e-05,1.1e-05,1.2e-05,2.3e-05,2.8e-05,2.7e-05,2.6e-05,1.8e-05,2.3e-05,8e-06,1.5e-05,8e-06,2e-05,1.6e-05,9e-06,1.6e-05,2e-06,1.4e-05,8e-06,1.9e-05,2e-06,1.6e-05,2.7e-05,1.9e-05,1e-05,2.6e-05,3e-06,2e-05,1.1e-05,1.3e-05,1.3e-05
2.9e-05,1.4e-05,7e-06,3e-05,3.7e-05,2.8e-05,1e-05,2.5e-05,2.8e-05,1.9e-05,1.5e-05,5e-06,2.4e-05,2.6e-05,2.3e-05,1.9e-05,7e-06,5.6e-05,2.2e-05,4.3e-05,2.4e-05,1.7e-05,1e-05,1e-06,3.5e-05,3.1e-05,1.6e-05,1.2e-05,2e-05,3.7e-05,1.2e-05,1.1e-05,3.6e-05,1.6e-05,2e-06,1.2e-05,1.4e-05,2.3e-05,1.2e-05,3.2e-05,2.2e-05,2.3e-05,7e-06,6.7e-05,9e-06,1.1e-05,2.3e-05,8e-06,2e-05,8e-06,2.1e-05,1.2e-05,2.5e-05,3.2e-05,1.5e-05,2.5e-05,2e-05,1e-05,1.4e-05,1.5e-05,3.8e-05,1.2e-05,3.7e-05,2.4e-05,1.1e-05,8e-06,2.9e-05,2.8e-05,1.5e-05,2.7e-05,1.4e-05,3.5e-05,2.6e-05,1.2e-05,1.5e-05,8e-06,1.5e-05,1.1e-05,2.1e-05,3.9e-05,2.3e-05,3.8e-05,3.3e-05,1.6e-05,4.2e-05,2.5e-05,1.2e-05,1.3e-05,6e-06,1.1e-05,1.3e-05,1e-05,9e-06,2.4e-05,2.1e-05,2.8e-05,2.8e-05,2.8e-05,9e-06,3e-06,7e-06,2.1e-05,1e-05,3e-05,2.2e-05,4e-06,9e-06,1.8e-05,7e-06,2.9e-05,4e-06,8e-06,1e-05,7e-06,1.6e-05,2.8e-05,2.4e-05,2.1e-05,1.5e-05,1.5e-05,7e-06
3e-05,2.6e-05,2.3e-05,2.8e-05,3.7e-05,6e-06,1.5e-05,1e-05,2.3e-05,1.7e-05,1.5e-05,3.3e-05,4.8e-05,3e-06,1.5e-05,1.8e-05,1.7e-05,6.5e-05,1.5e-05,4.2e-05,1.5e-05,3.2e-05,2.6e-05,3.1e-05,1.9e-05,1.2e-05,1.9e-05,3.5e-05,1.9e-05,3.1e-05,8e-06,9e-06,3.1e-05,1.6e-05,2.2e-05,2.6e-05,2.5e-05,1.4e-05,1.7e-05,2.5e-05,3.5e-05,8e-06,1e-05,5.9e-05,1.8e-05,2.4e-05,8e-06,1e-05,7e-06,9e-06,1.2e-05,1.7e-05,3.2e-05,1.7e-05,8e-06,1.1e-05,3.5e-05,1.6e-05,1.2e-05,2.3e-05,4.5e-05,1.6e-05,5.4e-05,1.1e-05,1e-06,4e-06,2.9e-05,2.4e-05,1e-05,1.8e-05,2e-05,2.1e-05,2.1e-05,2.2e-05,1.8e-05,1.5e-05,1.6e-05,1e-05,1.1e-05,4.1e-05,1.3e-05,3e-05,1.2e-05,7e-06,3.4e-05,1.7e-05,1e-05,1.6e-05,5e-06,1e-05,2.4e-05,1.1e-05,1.9e-05,2.6e-05,2.4e-05,1.4e-05,9e-06,1.9e-05,1.9e-05,3e-06,1.4e-05,2.2e-05,1.8e-05,3.1e-05,1.8e-05,1.5e-05,1.3e-05,2e-05,9e-06,2.1e-05,1e-05,1.4e-05,2.2e-05,7e-06,1.4e-05,9e-06,1.6e-05,3e-05,1.9e-05,8e-06,2.2e-05
5e-05,1.5e-05,4.2e-05,5e-05,2.8e-05,3.5e-05,1.7e-05,1.7e-05,1.5e-05,9e-06,2.1e-05,1.9e-05,2.7e-05,2.1e-05,2.3e-05,1.3e-05,1.8e-05,6.3e-05,1.2e-05,6.1e-05,1e-05,1e-05,3.7e-05,2e-05,2.9e-05,1.4e-05,1.7e-05,2.1e-05,2.1e-05,3.8e-05,2.1e-05,1.7e-05,3.3e-05,1e-05,1.8e-05,2e-06,2.2e-05,5e-06,2.1e-05,1e-05,2.1e-05,1.4e-05,1.7e-05,6.6e-05,2e-05,1e-05,1.4e-05,1.3e-05,1.8e-05,7e-06,5e-06,1.2e-05,1.6e-05,2.2e-05,1.3e-05,1.5e-05,1.3e-05,3e-05,1e-05,1.4e-05,2.2e-05,1.8e-05,4e-05,1.1e-05,4e-06,6e-06,1.9e-05,1.5e-05,1.8e-05,3.9e-05,8e-06,3e-06,2e-06,7e-06,2.6e-05,2e-05,1.2e-05,1e-05,2.3e-05,3e-05,1.7e-05,4e-06,2.5e-05,5e-06,4.3e-05,2e-05,1e-05,2.3e-05,1.3e-05,1e-05,2.1e-05,3e-06,1.6e-05,8e-06,1.6e-05,1.4e-05,2.7e-05,9e-06,1.6e-05,4e-06,1.5e-05,3e-06,2.1e-05,2.4e-05,1.6e-05,1.4e-05,9e-06,1.3e-05,4e-06,1.6e-05,6e-06,1.8e-05,2.4e-05,3e-06,2.1e-05,1.1e-05,8e-06,2.9e-05,2e-05,2.3e-05,6e-06
2.8e-05,2.6e-05,2.9e-05,3.8e-05,2.7e-05,2.9e-05,2.6e-05,4.1e-05,2.6e-05,2.1e-05,1.2e-05,1.1e-05,9e-06,1.7e-05,1.7e-05,2.6e-05,3e-05,5.5e-05,7e-06,5.4e-05,3.7e-05,8e-06,2e-05,1.6e-05,1.5e-05,1e-06,1.5e-05,2.1e-05,1.6e-05,3.4e-05,1.8e-05,4e-06,4.3e-05,1e-05,3e-06,3.2e-05,3.6e-05,1e-05,1.3e-05,2.6e-05,3.5e-05,1.8e-05,2.8e-05,5.5e-05,1.2e-05,7e-06,1.6e-05,1.4e-05,1.5e-05,6e-06,7e-06,5e-06,1e-05,2.7e-05,2.8e-05,7e-06,5e-06,2.5e-05,8e-06,7e-06,4.1e-05,1.2e-05,3.7e-05,1.8e-05,9e-06,6e-06,3e-05,9e-06,7e-06,4.9e-05,3.5e-05,7e-06,1.6e-05,1.4e-05,2.5e-05,3.1e-05,3e-06,1.4e-05,2.8e-05,4.7e-05,7e-06,1.7e-05,1.6e-05,1.2e-05,2.2e-05,1.5e-05,1.6e-05,1.7e-05,2.7e-05,1.5e-05,1.8e-05,3e-06,8e-06,8e-06,7e-06,2.8e-05,1.9e-05,1.6e-05,2.4e-05,2e-06,1.6e-05,2.1e-05,1.9e-05,2.7e-05,1.9e-05,3e-06,2.3e-05,2.3e-05,1.2e-05,2.1e-05,1.8e-05,9e-06,2e-05,7e-06,1e-05,1e-05,1.2e-05,2.8e-05,3e-05,3.4e-05,2.7e-05
9e-06,2.4e-05,4.1e-05,2.4e-05,5e-05,1.8e-05,2.9e-05,5.5e-05,3.6e-05,4.4e-05,4.9e-05,4.7e-05,7e-05,2.7e-05,1.9e-05,2e-05,2e-05,9.4e-05,3e-05,3.5e-05,2.5e-05,3.3e-05,1.8e-05,6e-06,1.6e-05,5e-06,2.2e-05,6e-06,1.8e-05,3.1e-05,2.6e-05,2.8e-05,4.3e-05,1.2e-05,1e-05,5.9e-05,4.2e-05,2.5e-05,1e-05,5e-06,2.1e-05,1e-05,2.8e-05,3.1e-05,1.5e-05,1.1e-05,2.2e-05,2e-05,2e-05,1.8e-05,2.3e-05,3.1e-05,4.1e-05,5e-05,4.8e-05,4.1e-05,2.7e-05,2.5e-05,3.7e-05,1.5e-05,2.2e-05,1.8e-05,3.3e-05,1.8e-05,2.4e-05,3.6e-05,6e-06,2e-05,5e-06,2.8e-05,3.2e-05,2.7e-05,2.7e-05,1.3e-05,7e-06,3e-05,3e-05,1.4e-05,1.1e-05,7.5e-05,5e-05,3.8e-05,3.3e-05,3.8e-05,4.6e-05,1.7e-05,1.4e-05,2.2e-05,2.1e-05,1.5e-05,1.4e-05,2.1e-05,1.8e-05,7e-06,1.1e-05,2e-05,1.7e-05,1.1e-05,1.5e-05,2.1e-05,2.2e-05,1.1e-05,1e-05,1.1e-05,2.7e-05,1.6e-05,1.5e-05,5.1e-05,2.3e-05,2.3e-05,2.9e-05,3.4e-05,1.4e-05,2.3e-05,1.1e-05,1.3e-05,1.8e-05,2.3e-05,1.6e-05,2.2e-05,1.6e-05
7e-06,1.8e-05,5.1e-05,5.2e-05,4.8e-05,4.9e-05,2.3e-05,4.3e-05,4e-05,5.5e-05,3.9e-05,3.9e-05,4.3e-05,2e-05,1.8e-05,3.3e-05,2e-05,0.000102,2.8e-05,2e-05,3.2e-05,1.6e-05,3.8e-05,7e-06,2.6e-05,1.1e-05,3.2e-05,4.3e-05,2.8e-05,5.1e-05,2.6e-05,2.3e-05,1.5e-05,8e-06,7e-06,3.9e-05,3.6e-05,1.5e-05,1.2e-05,1.5e-05,3e-06,6e-06,3.3e-05,7.6e-05,2.6e-05,2.2e-05,1.7e-05,1.3e-05,2.1e-05,3.8e-05,3.5e-05,1.5e-05,3.2e-05,2.3e-05,1.4e-05,2.3e-05,2.1e-05,1.7e-05,2.6e-05,1.3e-05,1e-05,7e-06,4.4e-05,3.1e-05,3.7e-05,4.3e-05,2.3e-05,5e-06,9e-06,1.4e-05,5e-06,1.2e-05,1.7e-05,2.1e-05,1.2e-05,7e-06,2.1e-05,1.7e-05,1.1e-05,4.4e-05,2.5e-05,2.1e-05,2.5e-05,1.9e-05,4.2e-05,2e-05,9e-06,1e-06,2.1e-05,1e-05,9e-06,2.1e-05,1.2e-05,3.1e-05,2.6e-05,1e-05,2.7e-05,1.8e-05,2.1e-05,3e-05,2.9e-05,1e-05,2e-06,1.3e-05,2.4e-05,1.4e-05,4e-06,2.8e-05,1.9e-05,2.5e-05,2.7e-05,3.1e-05,2.2e-05,1.8e-05,1e-05,9e-06,2e-05,3e-06,2e-05,2e-05,1.1e-05
2.2e-05,1.7e-05,4.1e-05,2.9e-05,3.3e-05,9e-06,3.4e-05,1.3e-05,3.4e-05,7e-06,1.1e-05,4.2e-05,2.8e-05,1.4e-05,2.1e-05,3.1e-05,1e-05,5.6e-05,4.6e-05,4.3e-05,1.8e-05,3.1e-05,3.6e-05,2.1e-05,2.1e-05,8e-06,2.3e-05,3.3e-05,2.7e-05,2.7e-05,2.8e-05,1e-05,4.5e-05,5e-06,8e-06,1.1e-05,2.6e-05,2.5e-05,2.9e-05,1.8e-05,2.3e-05,1.6e-05,1.7e-05,6.5e-05,3e-05,1e-05,1e-05,7e-06,9e-06,1.8e-05,2.6e-05,4.4e-05,2e-05,3.5e-05,2.9e-05,1.6e-05,1e-06,6e-06,3e-06,1.6e-05,3.8e-05,9e-06,3e-05,3.4e-05,1.6e-05,2.7e-05,2.6e-05,2.3e-05,1.5e-05,2.3e-05,3e-05,7e-06,2.3e-05,2.3e-05,1.4e-05,1.4e-05,1.5e-05,1.7e-05,2.6e-05,2.8e-05,8e-06,1.2e-05,1e-05,5e-06,2.6e-05,2.9e-05,2.9e-05,1e-05,7e-06,4e-06,1.1e-05,4e-06,1e-05,1.1e-05,1.7e-05,1.7e-05,8e-06,1.2e-05,2.1e-05,1.5e-05,2.2e-05,1.2e-05,1.1e-05,1.8e-05,2.7e-05,2.1e-05,1.5e-05,1e-05,1.1e-05,2e-05,6e-06,1.9e-05,1.3e-05,9e-06,6e-06,1.7e-05,8e-06,7e-06,1.2e-05,7e-06,3e-06
6e-06,1.1e-05,2e-05,4.8e-05,3.3e-05,3e-05,1.2e-05,1e-05,2.2e-05,2.6e-05,3.3e-05,4.7e-05,1.3e-05,7e-06,8e-06,2.1e-05,2.6e-05,3.8e-05,2.8e-05,3.5e-05,1.1e-05,2.7e-05,2.5e-05,8e-06,2e-05,1.4e-05,7e-06,9e-06,3.9e-05,3.6e-05,2.7e-05,1.9e-05,4.4e-05,2.4e-05,1.9e-05,3.4e-05,4.6e-05,2.7e-05,1.4e-05,1.7e-05,1.3e-05,1.4e-05,7e-06,6.4e-05,8e-06,4e-06,6e-06,8e-06,8e-06,1.4e-05,1.5e-05,2e-05,1e-05,1e-05,2.2e-05,1.4e-05,5e-06,9e-06,1.5e-05,1.8e-05,2.7e-05,8e-06,2e-05,3.6e-05,2e-05,1e-05,1.8e-05,3.5e-05,9e-06,2.3e-05,1.2e-05,2.9e-05,8e-06,1.7e-05,1.1e-05,1.6e-05,1.2e-05,2e-05,7e-06,2.4e-05,1.1e-05,9e-06,6e-06,1.7e-05,3.8e-05,3.3e-05,2.1e-05,2.9e-05,2.4e-05,1.4e-05,5e-06,1.8e-05,1.2e-05,5e-06,1.1e-05,2.8e-05,2.3e-05,1e-06,1.9e-05,8e-06,2e-05,8e-06,1e-05,1.4e-05,1.5e-05,4e-06,4e-06,1.2e-05,1.1e-05,2.5e-05,1.5e-05,8e-06,9e-06,4e-06,1.3e-05,3e-06,2e-06,9e-06,1.8e-05,1.5e-05,8e-06
1.6e-05,1.5e-05,1.1e-05,4.3e-05,2e-05,1.6e-05,2.4e-05,1.1e-05,9e-06,6e-06,2.1e-05,2.8e-05,3.9e-05,1.1e-05,2e-06,2e-05,5e-06,6.6e-05,2.7e-05,3e-05,8e-06,8e-06,3e-05,1.3e-05,2e-05,1.2e-05,1.5e-05,3.2e-05,8e-06,3.8e-05,2.5e-05,1.8e-05,2e-05,6e-06,1.4e-05,1.1e-05,1.7e-05,1.1e-05,1.1e-05,1.4e-05,1e-05,2e-06,1e-05,5.6e-05,7e-06,8e-06,1.2e-05,1e-05,8e-06,3e-06,9e-06,7e-06,1.5e-05,5e-06,1.4e-05,1.5e-05,8e-06,8e-06,1.8e-05,5e-06,3.2e-05,1.2e-05,3e-05,1.1e-05,1e-05,9e-06,1.1e-05,2e-05,2e-05,1.1e-05,8e-06,2.2e-05,1e-05,1.8e-05,5e-06,1.2e-05,1.7e-05,1.5e-05,8e-06,2.9e-05,1.3e-05,1.9e-05,1e-06,1.7e-05,2e-05,2.1e-05,2.1e-05,1.9e-05,6e-06,1.2e-05,1.1e-05,1e-05,6e-06,8e-06,1.2e-05,2.7e-05,1.1e-05,1.1e-05,1.5e-05,9e-06,1.6e-05,1e-05,1.1e-05,5e-06,1.5e-05,8e-06,3e-06,1.1e-05,6e-06,2.1e-05,1.4e-05,8e-06,1.3e-05,8e-06,1.8e-05,1.7e-05,3e-06,8e-06,1.7e-05,1.2e-05,7e-06
7e-06,1e-05,2.1e-05,2.8e-05,1.7e-05,9e-06,8e-06,6e-06,6e-06,4e-06,1.5e-05,2e-05,2.7e-05,7e-06,1e-05,6e-06,1.1e-05,5.9e-05,2e-06,3.9e-05,3e-06,1.5e-05,2.5e-05,1.3e-05,1.3e-05,5e-06,1e-05,2.5e-05,1.9e-05,2.9e-05,1.8e-05,7e-06,2e-05,1.1e-05,1.2e-05,1e-05,2e-05,1.6e-05,1.4e-05,5e-06,6e-06,4e-06,1e-05,5.3e-05,1.1e-05,4e-06,1.1e-05,7e-06,6e-06,7e-06,1.3e-05,1.2e-05,1e-06,1.6e-05,9e-06,7e-06,1e-06,5e-06,1.6e-05,5e-06,2.7e-05,7e-06,4.4e-05,3e-06,6e-06,2e-06,1.3e-05,2.2e-05,1.5e-05,1.7e-05,6e-06,8e-06,1.2e-05,2.1e-05,3e-06,1.6e-05,1.8e-05,6e-06,9e-06,2.7e-05,6e-06,1.3e-05,2e-06,1.3e-05,3.1e-05,1.5e-05,1.3e-05,2.4e-05,6e-06,1e-05,1.1e-05,1.2e-05,4e-06,9e-06,1.2e-05,2.5e-05,7e-06,5e-06,1.1e-05,7e-06,1.9e-05,1e-05,1.4e-05,1.4e-05,1e-05,4e-06,4e-06,1e-05,5e-06,1.7e-05,1.1e-05,1e-05,1.7e-05,5e-06,1.5e-05,8e-06,4e-06,4e-06,9e-06,3e-06,7e-06
6e-06,7e-06,2.4e-05,3.1e-05,1e-05,1.5e-05,6e-06,7e-06,3e-06,2e-06,1.5e-05,1.9e-05,2.3e-05,3e-06,1e-05,1e-06,7e-06,5.8e-05,7e-06,3.9e-05,4e-06,1.6e-05,2.1e-05,1.3e-05,1.5e-05,2e-06,1.4e-05,2.1e-05,1.5e-05,2.7e-05,1.7e-05,3e-06,2.6e-05,3e-06,1.4e-05,1.1e-05,2.5e-05,1.2e-05,1.3e-05,6e-06,9e-06,5e-06,7e-06,5.4e-05,6e-06,4e-06,1.1e-05,3e-06,6e-06,1.1e-05,6e-06,1.4e-05,5e-06,1.5e-05,8e-06,2e-06,2e-06,4e-06,1.5e-05,9e-06,3.2e-05,3e-06,3.8e-05,6e-06,3e-06,1e-06,1.4e-05,1.8e-05,1e-05,1.1e-05,7e-06,9e-06,1.3e-05,2e-05,7e-06,1.1e-05,1.5e-05,4e-06,7e-06,2.9e-05,6e-06,1.4e-05,4e-06,1.1e-05,2.7e-05,1.5e-05,6e-06,1.5e-05,3e-06,1e-06,9e-06,1.2e-05,4e-06,9e-06,1.3e-05,2.7e-05,8e-06,3e-06,1.1e-05,3e-06,1.9e-05,1e-05,1.2e-05,1.2e-05,8e-06,0,2e-06,1.1e-05,4e-06,1.3e-05,7e-06,1.2e-05,1.6e-05,4e-06,9e-06,7e-06,1e-06,4e-06,1e-05,4e-06,9e-06
7e-06,8e-06,2.1e-05,2.9e-05,5e-06,1.5e-05,8e-06,1e-06,5e-06,2e-06,1.5e-05,2.2e-05,2.2e-05,1e-06,9e-06,2e-06,1e-05,5.5e-05,4e-06,3.2e-05,1e-06,1.6e-05,2.1e-05,1e-05,1.3e-05,2e-06,1e-05,2.1e-05,1.7e-05,2.9e-05,1.6e-05,2e-06,2.8e-05,9e-06,8e-06,1.1e-05,2.3e-05,9e-06,1.4e-05,5e-06,9e-06,5e-06,7e-06,5.3e-05,5e-06,4e-06,1.1e-05,2e-06,6e-06,1.2e-05,7e-06,1.4e-05,5e-06,1.7e-05,7e-06,3e-06,1e-06,2e-06,1.4e-05,7e-06,3e-05,2e-06,3.6e-05,3e-06,1e-06,4e-06,1.8e-05,1.8e-05,8e-06,1.3e-05,5e-06,8e-06,1.2e-05,1.9e-05,8e-06,1.1e-05,1.5e-05,4e-06,4e-06,2.8e-05,6e-06,1.7e-05,3e-06,9e-06,2.8e-05,1.5e-05,6e-06,1.4e-05,2e-06,4e-06,9e-06,1.1e-05,3e-06,7e-06,1e-05,2.5e-05,7e-06,3e-06,1.2e-05,2e-06,1.9e-05,1e-05,1.2e-05,1.2e-05,1e-05,3e-06,3e-06,1.2e-05,5e-06,1.5e-05,7e-06,1.2e-05,1.6e-05,1e-06,9e-06,9e-06,3e-06,5e-06,1.2e-05,3e-06,5e-06
