0.06536,0.078616,0.088653,0.088903,0.079168,0.072767,0.077231,0.080637,0.083647,0.07769,0.064406,0.060039,0.058785,0.06172,0.071886,0.072878,0.067799,0.062604,0.059838,0.065664,0.064459,0.067643,0.074346,0.067649,0.064419,0.068544,0.071352,0.073518
0.079446,0.094775,0.105334,0.104389,0.094459,0.08787,0.092775,0.097544,0.102364,0.095393,0.079442,0.074567,0.074157,0.077638,0.088416,0.08965,0.084369,0.079182,0.07477,0.079415,0.078803,0.08298,0.090514,0.082376,0.078558,0.085048,0.087427,0.087103
0.103094,0.119191,0.128608,0.125136,0.1164,0.111467,0.117764,0.124632,0.131607,0.123399,0.104382,0.099276,0.10189,0.106395,0.115953,0.117383,0.111818,0.107474,0.10076,0.101316,0.100854,0.106717,0.115442,0.105986,0.101976,0.112569,0.114229,0.108382
0.121462,0.131584,0.136439,0.131562,0.125368,0.125551,0.134388,0.140538,0.148529,0.144118,0.126252,0.121295,0.13005,0.134743,0.136761,0.138305,0.133913,0.130516,0.122669,0.117125,0.114935,0.119438,0.127513,0.121694,0.119393,0.132581,0.134265,0.123977
0.137867,0.135444,0.132647,0.131716,0.129101,0.132895,0.142069,0.14503,0.154881,0.16247,0.151242,0.145883,0.161326,0.163213,0.151436,0.152853,0.153978,0.14923,0.1389,0.130887,0.125578,0.124782,0.13055,0.130669,0.129312,0.143666,0.148793,0.138084
0.158852,0.148588,0.138801,0.142385,0.145445,0.149689,0.1564,0.155754,0.168481,0.190473,0.187921,0.181832,0.199239,0.194919,0.168515,0.174133,0.187407,0.17735,0.160428,0.152397,0.143076,0.138023,0.144407,0.146435,0.137958,0.14817,0.160191,0.153304
0.193654,0.185872,0.169834,0.172304,0.181331,0.184163,0.187908,0.184355,0.203433,0.234776,0.232488,0.227943,0.242165,0.229778,0.197153,0.206666,0.228198,0.215649,0.194748,0.186921,0.172916,0.162069,0.17161,0.176388,0.161063,0.158084,0.167577,0.169734
0.242167,0.251709,0.2312,0.223311,0.233395,0.236331,0.238962,0.236,0.265696,0.285492,0.269744,0.281912,0.290344,0.261557,0.228785,0.242409,0.264407,0.252049,0.239731,0.240079,0.220832,0.199502,0.210857,0.223067,0.212992,0.19261,0.186332,0.19375
0.297907,0.34156,0.317143,0.286147,0.298396,0.301537,0.305256,0.304935,0.340281,0.335155,0.302319,0.340718,0.338354,0.289697,0.26545,0.285604,0.297507,0.279496,0.291152,0.311026,0.274824,0.231712,0.248513,0.281848,0.288137,0.251297,0.22438,0.228874
0.346378,0.423902,0.393865,0.333444,0.349973,0.360642,0.366979,0.365018,0.404619,0.385833,0.334868,0.383424,0.375202,0.317777,0.308174,0.340533,0.331328,0.290874,0.330688,0.375507,0.314422,0.248859,0.274814,0.328892,0.353201,0.309573,0.264435,0.259122
0.361923,0.452485,0.421079,0.343154,0.35703,0.377558,0.389884,0.386212,0.425203,0.407919,0.351287,0.389139,0.386354,0.340011,0.331114,0.358135,0.331071,0.276842,0.33286,0.387423,0.317646,0.256681,0.29307,0.3457,0.372845,0.340719,0.292467,0.274295
0.324195,0.395825,0.373603,0.314811,0.32179,0.350245,0.373917,0.362729,0.380451,0.369917,0.326258,0.340533,0.359955,0.347013,0.316558,0.317214,0.290922,0.246783,0.295373,0.338251,0.283916,0.248029,0.288814,0.320433,0.327646,0.322302,0.296636,0.265993
0.249893,0.285163,0.286122,0.28062,0.284912,0.309364,0.326655,0.297594,0.302452,0.311769,0.283627,0.275192,0.320781,0.333413,0.276369,0.251062,0.239296,0.230148,0.25912,0.271306,0.242077,0.231085,0.261735,0.27668,0.266848,0.274567,0.270547,0.241607
0.197535,0.214844,0.232377,0.258989,0.252746,0.257517,0.258022,0.223142,0.239456,0.267289,0.250978,0.248412,0.296697,0.302762,0.242756,0.210189,0.208113,0.226978,0.242549,0.226726,0.210604,0.209968,0.22216,0.22939,0.225237,0.23168,0.226878,0.216833
0.194729,0.225627,0.244656,0.252609,0.230471,0.216609,0.205394,0.182756,0.20576,0.227756,0.225112,0.24457,0.271855,0.261955,0.21724,0.183946,0.186842,0.215241,0.220633,0.21037,0.2119,0.19989,0.187433,0.187436,0.198057,0.207029,0.201558,0.209568
0.247606,0.299108,0.315366,0.294579,0.254413,0.23684,0.234005,0.216519,0.228949,0.238336,0.237262,0.266486,0.278905,0.262012,0.224128,0.187465,0.196588,0.230274,0.223502,0.226719,0.252747,0.227223,0.200061,0.195649,0.22046,0.239656,0.234804,0.244403
0.331708,0.389542,0.4227,0.399905,0.33632,0.328056,0.338222,0.308118,0.315893,0.316576,0.295263,0.319853,0.334473,0.321301,0.289052,0.252405,0.264632,0.302233,0.286416,0.291749,0.325328,0.295967,0.273403,0.264845,0.29066,0.31352,0.317339,0.321752
0.420715,0.465412,0.541111,0.548088,0.436092,0.429831,0.468846,0.422822,0.419774,0.408872,0.369702,0.39944,0.42609,0.408673,0.389323,0.361417,0.367467,0.407879,0.383893,0.36896,0.398564,0.393981,0.388588,0.356382,0.358755,0.382434,0.407266,0.41211
0.506418,0.516575,0.639677,0.676273,0.493814,0.486841,0.593902,0.57912,0.546464,0.477566,0.413563,0.456564,0.515581,0.512216,0.509599,0.493846,0.482528,0.506913,0.478833,0.431203,0.442095,0.482867,0.517539,0.456374,0.403473,0.418118,0.480291,0.512442
0.563922,0.547668,0.710966,0.731882,0.493396,0.490158,0.65595,0.730704,0.693831,0.536817,0.431184,0.478761,0.564019,0.589517,0.620578,0.621067,0.571484,0.54614,0.521073,0.45394,0.429037,0.512733,0.608902,0.537221,0.427061,0.433242,0.521197,0.586394
0.567996,0.543643,0.716224,0.681046,0.441429,0.452051,0.62061,0.800376,0.824136,0.61396,0.441395,0.453355,0.530613,0.573756,0.643579,0.67324,0.605669,0.531026,0.501494,0.431709,0.386047,0.486498,0.615506,0.561983,0.44643,0.467407,0.54334,0.599065
0.49631,0.51035,0.64345,0.549016,0.36525,0.385638,0.522247,0.748949,0.829738,0.643333,0.432043,0.385201,0.436857,0.481664,0.557508,0.609432,0.572931,0.527247,0.495198,0.427436,0.415891,0.475089,0.538179,0.525708,0.470781,0.498612,0.538766,0.545244
0.413266,0.440935,0.516454,0.42302,0.334425,0.345075,0.413688,0.575748,0.668695,0.609334,0.432111,0.315657,0.339471,0.386993,0.444691,0.516309,0.545994,0.528671,0.472281,0.434685,0.486025,0.50686,0.453418,0.446066,0.462537,0.479756,0.478499,0.439517
0.414319,0.417742,0.42041,0.338944,0.317625,0.33624,0.332186,0.377407,0.449865,0.504481,0.40834,0.266136,0.27704,0.34568,0.390041,0.468134,0.541657,0.506236,0.439399,0.444974,0.523072,0.548631,0.422774,0.356203,0.384061,0.410217,0.417104,0.390539
0.4056,0.413324,0.360463,0.29073,0.320136,0.354552,0.320016,0.295507,0.321915,0.373117,0.333342,0.237481,0.257649,0.346586,0.375733,0.439264,0.52475,0.485526,0.464159,0.499575,0.548663,0.563242,0.419433,0.308677,0.3085,0.370737,0.4122,0.386907
0.378531,0.426164,0.360689,0.298083,0.332669,0.351484,0.320835,0.306544,0.320373,0.303656,0.266468,0.251728,0.286143,0.35801,0.384111,0.446943,0.512137,0.496129,0.525003,0.557883,0.569357,0.525689,0.387492,0.313524,0.302456,0.355423,0.405794,0.369786
0.382259,0.438328,0.395239,0.347646,0.331947,0.32147,0.31579,0.330919,0.330569,0.269334,0.22581,0.253994,0.285278,0.328852,0.383493,0.481336,0.504569,0.476406,0.532333,0.554815,0.536132,0.471963,0.393189,0.353103,0.334206,0.369046,0.3682,0.313251
0.38925,0.400473,0.383868,0.380675,0.322819,0.285756,0.318492,0.358357,0.318064,0.255846,0.217802,0.235972,0.250205,0.253108,0.332569,0.479054,0.462036,0.382193,0.420555,0.434205,0.405385,0.390744,0.428729,0.406071,0.371548,0.380034,0.304916,0.254573
0.38126,0.335271,0.340266,0.37803,0.342672,0.30448,0.330172,0.357752,0.276098,0.233559,0.237363,0.22599,0.233326,0.223964,0.290726,0.437708,0.389019,0.263256,0.260993,0.293428,0.276939,0.291098,0.419953,0.423605,0.379483,0.374831,0.283295,0.271488
0.368146,0.294344,0.318642,0.361726,0.398722,0.387535,0.33393,0.301422,0.231583,0.241086,0.274654,0.229504,0.259281,0.277656,0.322114,0.420314,0.347833,0.218824,0.192914,0.254465,0.263406,0.25267,0.383689,0.421723,0.390339,0.370825,0.30754,0.338087
0.36201,0.289434,0.295456,0.320098,0.42746,0.438819,0.300123,0.217373,0.185711,0.260081,0.35069,0.306108,0.324632,0.333577,0.362774,0.456266,0.403216,0.261234,0.182796,0.236894,0.279888,0.274724,0.353762,0.411859,0.408662,0.344286,0.310497,0.376658
0.333095,0.276051,0.242543,0.266154,0.402048,0.418038,0.281048,0.206473,0.185513,0.298163,0.458052,0.42499,0.408058,0.38203,0.383083,0.471876,0.46333,0.3255,0.175299,0.211348,0.296722,0.286648,0.291863,0.366705,0.395944,0.301778,0.282342,0.349757
0.254273,0.234932,0.204036,0.241569,0.343745,0.34568,0.265594,0.233457,0.216682,0.3388,0.538039,0.535269,0.483505,0.409918,0.388573,0.445054,0.468835,0.358095,0.174248,0.217093,0.319711,0.289797,0.263549,0.317762,0.323103,0.220809,0.216564,0.280819
0.190956,0.21292,0.191896,0.221014,0.276343,0.28113,0.232272,0.245064,0.273298,0.358165,0.517883,0.559881,0.490562,0.385013,0.371348,0.408965,0.425709,0.331555,0.192389,0.243918,0.316484,0.283726,0.275561,0.304479,0.254531,0.155142,0.17242,0.218848
0.15786,0.203414,0.202501,0.213905,0.240759,0.229848,0.192676,0.238427,0.314906,0.325472,0.391233,0.467942,0.414241,0.324526,0.329681,0.332266,0.314758,0.244766,0.192606,0.253384,0.286095,0.269413,0.286328,0.290694,0.242532,0.169652,0.178266,0.192042
0.13733,0.184678,0.191785,0.197211,0.243147,0.222141,0.168344,0.23804,0.321787,0.247828,0.262877,0.345091,0.325037,0.286827,0.299456,0.276289,0.206146,0.146067,0.167001,0.245066,0.270565,0.268617,0.296946,0.272479,0.232316,0.195426,0.188065,0.162021
0.153729,0.162598,0.155977,0.170488,0.234868,0.217092,0.142823,0.2331,0.289938,0.175859,0.216965,0.264587,0.224321,0.226157,0.258067,0.272079,0.185256,0.104635,0.157087,0.235607,0.23265,0.233289,0.273185,0.260352,0.21237,0.195737,0.180536,0.132462
0.185734,0.144425,0.13057,0.151226,0.200434,0.193534,0.136342,0.221127,0.234738,0.146824,0.202064,0.224011,0.152299,0.142715,0.190824,0.247862,0.183974,0.107395,0.172639,0.238729,0.191523,0.169672,0.210159,0.229517,0.199357,0.179745,0.159242,0.123536
0.212718,0.165972,0.157093,0.158921,0.16683,0.164968,0.16667,0.21519,0.177174,0.126707,0.168253,0.189345,0.11568,0.097969,0.169554,0.220664,0.179635,0.126277,0.172812,0.229697,0.179961,0.132184,0.173467,0.200448,0.183476,0.159283,0.135532,0.122738
0.233495,0.234865,0.229737,0.219991,0.183688,0.165998,0.213716,0.213087,0.146703,0.118468,0.114412,0.139308,0.103108,0.100111,0.188015,0.215749,0.180847,0.148316,0.151125,0.19461,0.182207,0.158241,0.181396,0.174934,0.15282,0.155359,0.128124,0.107916
