-0.005039,-0.003461,-0.003597,-0.002751,-0.003704,-0.002554,-0.004209,-0.004188,-0.004601,-0.002609,-0.004542,-0.004211,-0.003494,-0.002916,-0.002395,-0.003112,-0.003635,-0.001898,-0.00258,-0.001822,-0.002694,-0.002079,-0.002837,-0.003364,-0.002838,-0.001441,-0.003512,-0.003138,-0.002953,-0.001867,-0.00373,-0.003285,-0.001819,-0.001482,-0.002058,-0.002339,-0.001681,-0.002198,-0.001408,-0.005119,-0.003276,-0.00181,-0.002138,-0.002824,-0.002134,-0.000684,-0.000655,-0.001678,-0.001147,-0.002996,-0.00262,-0.00219,-0.001009,-0.001277,-0.003539,-0.00301,-0.001718,-0.002298,-0.002934,-0.00175,-0.001849,-0.002448,-0.003434,-0.002766,-0.00215,-0.002243,-0.002367,-0.001941,-0.00109,-0.001164,-0.001006,-0.001911,-0.003027,-0.003042,-0.00213,-0.0017,-0.000751,-0.002745,-0.001963,-0.001741,-0.002586,-0.001343,-0.001621,-0.002893,-0.003093,-0.003507,-0.001816,-0.002578,-0.001843,-0.002338,-0.002142,-0.001887,-0.002022,-0.002495,-0.002252,-0.000739,-0.001557,-0.002794,-0.001772,-0.001367,-0.000778,-0.001744,-0.001559,-0.001207,-0.000481,-0.002015,-0.001426,-0.003319,-0.001786,-0.002541,-0.00244,-0.001771,-0.001195,-0.002771,-0.002248,-0.0017,-0.001027,-0.002484,-0.002279,-0.002461,-0.00176
0.002245,0.001253,0.002205,0.000908,0.002414,0.001103,0.002738,0.002964,0.003246,0.000898,0.002227,0.002375,0.002425,0.001115,0.000792,0.001699,0.001831,0.000724,0.000775,0.001356,0.002012,0.00077,0.001039,0.0013,0.001012,0.000194,0.002248,0.001312,0.001169,0.000204,0.002147,0.001358,0.001245,0.000502,0.001895,0.00129,0.00065,0.0018,0.001529,0.002389,0.001765,0.000158,0.000731,0.000613,0.000793,0.001194,0.000229,0.001196,0.000613,0.001422,0.002482,0.002295,0.00191,0.001265,0.003037,0.003053,0.001833,0.001297,0.001822,0.000932,0.001286,0.001299,0.001831,0.001462,0.000607,0.000433,0.001925,0.001429,0.00089,0.00154,0.000537,0.00118,0.001579,0.001607,0.001601,0.000223,0.00021,0.001811,0.001483,0.000335,0.001147,0.001377,0.000737,0.000687,0.002334,0.002658,0.001216,0.001871,0.001524,0.002245,0.001035,0.001329,0.000691,0.00081,0.001752,0.00033,0.000599,0.002177,0.00097,0.000982,0.001318,0.000546,0.000583,0.00024,0.000585,0.001035,0.001182,0.00102,0.001043,0.000883,0.001041,0.001072,0.000535,0.001771,0.001457,0.000665,0.000447,0.001205,0.000948,0.001919,0.000436
-0.000544,-4e-04,-0.001743,2.5e-05,-0.001285,-0.000817,-0.001477,-0.001735,-0.002487,-0.000649,-0.000859,-0.000412,-0.001158,-0.000484,-0.000268,-0.000254,-0.000247,-0.000139,5.1e-05,-0.000483,-0.001327,4.7e-05,-0.000272,3.7e-05,0.000144,0.000212,-0.000863,-0.000178,5.8e-05,0.000285,-0.000522,-0.000393,-0.000979,0.000474,-0.000587,5.7e-05,-0.001131,-0.001086,-0.001375,-0.001668,-0.002034,-0.000639,-0.00017,-0.000819,-7e-04,-0.000224,-3.9e-05,-0.000842,-0.000945,-0.000779,-0.000154,-0.002049,-0.001857,-0.001533,-0.002168,-0.002734,-0.001329,-0.000875,-0.001897,-0.000268,-0.001008,-0.000242,-0.001525,-0.000917,-0.000106,0.000422,-0.001146,-0.000635,-0.000464,-0.000751,-0.00109,-0.00134,-0.001301,-0.000945,-0.000644,-0.000151,-0.000159,-0.001015,-0.000618,8.7e-05,-0.000558,-0.000619,-0.000495,-0.000339,-0.001658,-0.001958,-0.001118,-0.001378,-0.001059,-0.001228,-0.00019,-0.000442,-0.000426,-6.9e-05,-0.001039,-0.000292,0.000582,-0.001327,-0.000759,-0.000444,-0.000743,0.000647,-8.8e-05,-0.000304,-0.000421,-0.000225,-0.000388,-0.000406,-0.002013,-0.000805,-0.000881,-0.000216,-0.00088,-0.001369,-0.002323,-0.001089,-0.000403,-0.000883,-0.000465,-0.001966,-0.000485
0.000312,-0.000599,0.000654,-0.000632,-8.8e-05,0.000225,8.8e-05,0.001381,0.001783,0.000203,-0.000138,3.3e-05,-9.7e-05,9.9e-05,1.7e-05,-7.8e-05,-0.001088,-0.000731,-0.000348,-0.000217,0.000234,-0.000645,-0.000373,-0.000866,-0.000874,-0.000913,-8.6e-05,-0.000373,-0.00062,-0.000331,-0.000434,-0.000118,-9.7e-05,-0.000693,-0.000537,-0.000787,-0.000498,0.000208,0.000557,-0.000396,0.000291,-0.000333,-0.000341,-0.000463,-0.000512,-0.001194,-0.001055,-0.000471,-0.000175,-0.000189,-0.000846,0.000393,-0.000127,0.00074,0.000914,0.000582,-0.000249,-0.001466,-8.8e-05,-0.000436,-6.4e-05,-0.000716,0.000489,-4.1e-05,-0.000356,-0.001119,-0.000547,-0.000607,-0.00113,-0.00029,-1.4e-05,0.000465,0.00107,0.000345,-0.000335,-0.000198,-0.000485,-0.000873,-0.000334,-2e-05,0.000471,-0.000819,-0.000391,-0.000475,0.000522,0.000866,0.000848,0.000261,0.000569,-2.9e-05,0.000181,0.000131,-0.000898,0.000179,-0.000449,-9.9e-05,-0.000591,-0.001331,-0.000712,-8.2e-05,-0.000912,-0.000981,-0.000755,-0.000269,-6.6e-05,-0.000625,-0.001243,-0.000386,0.00087,0.000778,0.00015,-0.000416,0.000472,0.00078,-0.000285,0.000194,-2.8e-05,-1.5e-05,0.00015,0.000141,-0.000381
-0.000564,0.000997,0.000485,0.000357,0.000512,-0.000609,-0.000714,-0.001502,-0.001372,-0.000112,4.1e-05,-0.000144,0.000257,5.6e-05,-0.000192,-0.000141,0.000824,0.000988,0.000445,0.000481,0.000428,0.000675,0.00054,0.000801,0.000497,0.000734,-0.00011,8e-06,0.000279,0.000123,0.000138,0.000604,0.00023,-0.00013,-0.00036,0.000903,0.000457,-0.000405,-0.001162,0.000696,-0.000246,-0.000374,-0.000299,0.000247,-0.000249,0.000301,0.000279,-0.000248,-0.000232,-0.000939,0.000285,-0.000767,-0.001135,-0.001736,-7e-05,-0.001151,-6.9e-05,2.4e-05,-0.000774,-0.000276,-0.000177,0.000397,9.6e-05,0.000535,0.000322,0.000265,3.8e-05,0.000251,0.000254,-0.000534,-0.000817,-0.000615,-0.000791,-0.000226,0.000301,0.000202,0.000363,0.000258,0.000159,-0.000118,-0.000293,0.000312,-0.000601,0.000628,-0.000422,-0.00069,-0.000619,4.4e-05,-0.000695,1.1e-05,-0.000262,-0.000157,0.000301,-0.000724,-0.000231,-0.000516,8.3e-05,0.000678,-0.000102,9.9e-05,-0.000212,-0.000203,-0.000173,-0.000128,-0.000329,-0.000278,0.000936,0.000782,0.00019,-0.000107,-0.000196,1.6e-05,-0.000478,-0.000248,0.001335,-0.000115,-0.000194,0.000466,-0.000333,0.000112,-0.000301
0.000114,-0.00077,-0.000645,-0.000348,-0.000739,0.000459,0.000869,0.000778,0.000688,-0.000151,0.000247,0.001072,0.000151,-3.2e-05,0.000181,-0.00013,-9.9e-05,-0.00081,-9.8e-05,-0.000571,-0.000389,-0.000354,-0.000108,-0.000843,-0.000272,-0.000341,-0.000105,0.00047,0.000101,0.000354,4.5e-05,-0.000788,-0.000177,0.000211,6.5e-05,-0.000912,-0.000491,-9.9e-05,0.000351,-0.000127,-0.000128,0.000147,0.000527,0.000599,0.000107,-0.00031,-0.000176,-0.000166,-3e-06,0.000657,-0.00076,-9.4e-05,0.000767,0.000313,-0.000104,8.2e-05,-0.000917,-1.7e-05,0.000495,-3.9e-05,-0.000168,-0.000602,5.4e-05,-0.000981,-0.000103,7.6e-05,6.3e-05,-0.000318,-0.000424,-5.9e-05,0.000663,0.000588,0.000397,0.000105,-6.6e-05,0.000181,-0.000292,-0.00028,3.2e-05,0.000202,0.000477,-0.000621,0.000226,-0.000816,-0.00012,0.000834,0.000286,-5.7e-05,0.000365,-0.000511,0.000133,-0.00038,-0.000137,0.001066,-4e-05,-0.000242,-0.00037,9.1e-05,-0.000548,-0.000467,0.00075,-0.000275,0.000336,3.1e-05,-0.000131,8.4e-05,-0.000779,-0.000509,-0.000657,-0.000917,0.000142,0.000215,-3.5e-05,-0.000609,-0.000786,-0.000792,-0.000155,-0.000482,-0.000311,-0.000103,-9.8e-05
1.3e-05,0.000381,0.000318,0.00076,0.000482,-0.000514,-0.000499,-4e-04,-0.000415,0.000388,-0.000289,-0.001163,-0.000406,-0.000105,-0.00023,0.000285,-0.000162,0.000232,-0.000119,0.000474,0.000444,0.000336,-3.4e-05,0.000547,-0.00024,-1.1e-05,0.000328,-0.000784,-0.000245,-0.000142,0.000298,0.000902,1e-04,-0.000109,-1.4e-05,0.000334,0.000115,0.00068,0.000282,0.000372,4e-04,0.000133,-0.000376,-0.000562,9.3e-05,0.000155,0.000273,0.000278,4e-06,-0.000237,-1e-05,0.000223,-0.000389,0.000192,-0.000284,-8.9e-05,0.001222,0.00045,0.000162,0.000169,-1.5e-05,0.000133,-0.000344,0.000851,-0.000227,-9e-05,-0.000267,-0.000438,0.000285,-0.000142,-0.000554,-9.2e-05,-9.7e-05,-0.000377,0.000116,-0.000307,0.000127,0.000259,-0.000393,-0.000573,-0.000552,0.000292,6.1e-05,0.000283,0.000366,-1.3e-05,1e-06,0.000174,4.4e-05,0.000407,-0.000331,0.000444,0.000283,-0.000748,-0.000369,-1e-06,-0.000608,7.3e-05,0.000293,-0.00065,-0.000624,5.5e-05,-0.00011,6.4e-05,-0.000145,0.000165,0.000703,0.000211,0.000285,0.000815,-0.000241,-3e-04,-8.2e-05,0.000318,0.000901,0.000932,6.8e-05,0.000407,0.000117,-0.000261,-0.000274
-0.000169,-0.000101,0.000159,-0.000469,0,0.000593,0.000297,-1.2e-05,0.000279,-0.000168,0.000357,0.000481,0.000439,0.000377,0.000145,-0.000445,-8.9e-05,0.000373,6.9e-05,-2.1e-05,-0.000367,-0.000147,0.00026,-0.000158,0.000228,4.3e-05,-0.000351,0.000711,7e-05,4.8e-05,-0.000395,-0.000668,-0.000132,4.9e-05,0.00069,0.000193,0.000467,-0.000505,0.000116,-0.000182,0.000276,0.000792,0.000403,0.000598,0.000404,0.000229,0.000107,0.000591,0.000526,7e-04,0.000421,0.000108,0.000915,0.000377,9.6e-05,0.000724,-0.00051,0.000372,0.000109,-0.000363,0.000406,0.000317,0.000429,-0.000122,0.000406,0.000215,0.000341,0.000843,2e-04,0.000199,0.000629,0.000418,0.000362,0.000472,-0.000108,0.000557,-0.000172,0.00028,3.3e-05,0.000395,0.000466,-5.9e-05,8.9e-05,-9e-05,0.000154,-0.000264,-0.000304,-0.000144,2.1e-05,-0.000358,4.5e-05,-0.000354,-2e-06,0.000201,0.000734,0.000344,0.000464,0.000102,0.000669,0.000494,0.000687,0.000744,2.3e-05,0.000233,0.000369,-0.000145,-1.8e-05,0.000207,0.000338,0.00012,0.000448,0.000105,8e-06,-0.000358,-0.000456,-8.6e-05,-0.000249,8.4e-05,0.00019,0.000701,0.001078
-5e-05,-0.000348,-0.000414,7.7e-05,-3e-05,-0.000303,-8.3e-05,0.00048,-0.00011,9.9e-05,-0.000157,-0.00056,-0.000332,-0.000513,-0.000154,0.000532,0.000363,-0.000443,-5.7e-05,-7e-05,0.000179,-0.000271,-0.000245,-2.4e-05,0.000161,-2.6e-05,0.000223,-0.000371,3.5e-05,-2.1e-05,0.000489,0.000293,0.000107,0.000146,-0.000368,-0.000344,-0.000251,0.000291,0.00012,0.000277,-5.6e-05,-0.00054,-0.000237,4e-05,-1.7e-05,0.000314,8.6e-05,-0.000285,-0.000237,-8e-05,0.000132,0.000103,-0.000241,0.000222,0.00048,1.4e-05,0.000644,-0.000106,0.000589,0.000587,0.000463,-5.8e-05,-0.000377,-1.9e-05,-0.000143,-0.000117,-1.3e-05,-0.000103,3e-06,0.000267,-0.000128,-3.5e-05,-0.000314,-0.000246,0.000168,-0.000343,-1e-05,-0.000315,0.000119,-0.000502,-0.000142,0.000146,0.000167,0.000465,-0.000282,0.000211,0.000299,0.000296,-7.6e-05,0.000433,0.000167,0.000225,0.00022,3.8e-05,-3.4e-05,0.000124,-4.6e-05,0.000459,-0.000339,0.00024,1.7e-05,-0.000508,0.000134,-1.8e-05,2.7e-05,0.000182,0.000327,-0.000402,-0.000276,0.00011,-0.000264,0.000128,-2e-06,0.000483,0.000349,0.000263,0.000944,0.000163,-0.000353,-0.000367,-0.000609
4e-04,0.00059,0.000241,0.000224,2.6e-05,8.3e-05,0.00025,-0.000108,2.4e-05,-0.00017,0.000122,0.000503,3.3e-05,0.00034,3e-05,-0.000364,-0.000288,0.000286,-0.000113,-0.000244,-8.5e-05,0.000297,-1.6e-05,-8.4e-05,-0.00037,-0.000153,6e-05,0.000336,8.2e-05,7e-06,-0.000242,0,9.7e-05,0.000129,3.7e-05,0.000523,9.8e-05,0.000291,-0.000113,-0.000201,-6.9e-05,-8.3e-05,0.000127,-0.000146,-5.3e-05,-0.000278,-0.000208,0.00016,0.000126,-5.9e-05,-8e-06,0,7.6e-05,-0.000217,-0.000431,3.1e-05,-0.00014,-5.4e-05,-0.000352,-0.000206,-0.000383,6e-06,-5e-06,-3e-05,-0.000113,0.00012,-6.7e-05,0.000134,-0.000113,6.9e-05,9.8e-05,6.3e-05,5.1e-05,0.000127,-9.9e-05,0.000118,0.000161,0.000252,-5e-05,0.000325,-0.000291,-0.000103,-0.000249,-0.000175,0.000126,-0.000272,-2.7e-05,-0.000248,6e-05,-7.4e-05,5e-06,-2.4e-05,-0.000145,-0.00026,2.7e-05,-3.6e-05,0.000135,-0.000142,0.000118,0.000158,-0.000213,8.5e-05,2.4e-05,-8.1e-05,0.000134,-1e-05,-0.000141,0.000338,0.000209,-0.000203,-0.000252,-0.000328,0.000273,-0.000133,0.000123,-8.2e-05,-0.000753,-0.000345,-0.000198,0.000195,0.000425
-0.000515,-0.000502,-6.5e-05,-0.000234,-0.000215,0.000135,-0.000461,-0.000302,0.000234,4.6e-05,-3e-05,-0.000102,6.9e-05,4e-05,0.000162,0.000261,4e-06,1.3e-05,0.000272,0.000181,0.000141,-0.000146,-9.1e-05,0.000152,0.000438,6.7e-05,-0.000166,-0.000225,-0.000209,-0.000196,-0.00012,-4.6e-05,-3.2e-05,-0.000206,-7e-05,-0.000246,-8.5e-05,-0.000286,-0.000141,-0.000257,-4.5e-05,-0.000112,-0.000185,-0.000246,-0.000134,0.00025,0.000209,-0.000169,-0.000143,-0.00018,-1e-05,-9e-05,-0.000185,-5.7e-05,0.000158,-9.7e-05,-6.8e-05,5.3e-05,-8.6e-05,5e-05,0.00018,-4.5e-05,0.000124,5.3e-05,5.3e-05,-0.000291,4.4e-05,-0.000173,9.8e-05,0.000129,1.7e-05,-0.000385,-8.1e-05,-6e-06,0.000111,-2.9e-05,-3.6e-05,-0.000179,0.00014,-0.000192,0.000111,7.6e-05,0.00017,0.000221,-1e-06,-8.6e-05,-0.00015,9.6e-05,-0.000148,8.2e-05,0.000143,-5.6e-05,0.000144,0.000347,7.9e-05,0.000247,0.00014,5.4e-05,-6.6e-05,-0.000131,2e-06,-4e-06,7.4e-05,-7.4e-05,3.2e-05,1.4e-05,6.2e-05,-0.000395,-0.000224,-0.000422,0.00014,3e-04,5.6e-05,0.000134,-0.000305,-0.000198,0.000264,-5.5e-05,0.000246,-0.000149,-0.000329
0.000227,0.000372,0.00011,0.000101,0.000233,-0.000195,0.000169,0.000104,-0.000168,-9.9e-05,-0.000101,0.000123,1.9e-05,-0.000139,-0.000171,-0.000112,0.00015,-0.000161,-0.000138,2.3e-05,-0.000163,5.1e-05,-0.000208,-0.000108,-0.000309,1.3e-05,3.6e-05,0.000202,0.00034,0.000228,4.4e-05,-8.1e-05,-2.1e-05,0.000158,5.7e-05,8.1e-05,-2.4e-05,-7.1e-05,1.6e-05,0.000135,4.3e-05,0.000117,0.000108,7.7e-05,2.9e-05,-0.000281,-0.000219,-9e-06,-3.9e-05,0.000242,3.2e-05,5.1e-05,-8.1e-05,-3.8e-05,5.9e-05,-5.9e-05,-1.5e-05,-0.000174,-2.7e-05,-3.3e-05,-0.000232,2.2e-05,5.2e-05,-0.000132,-0.000156,0.000376,-6e-05,4.9e-05,-0.000152,-0.000242,-5.3e-05,0.000191,6.3e-05,7.9e-05,-8e-06,-6e-06,1.5e-05,0.000139,4.8e-05,0.000244,-3.8e-05,-1e-04,3e-06,-0.000172,-0.000119,0.000187,-3.6e-05,-8.7e-05,0.00015,4.2e-05,-2.6e-05,0.000236,-0.00019,-0.000147,-0.000183,-0.000193,-2e-05,-0.000324,-0.00016,0.000158,-0.000409,-9.2e-05,-0.00033,1.4e-05,-7e-05,0.000109,-0.000187,0.000125,4e-05,0.000385,-8.1e-05,-0.000141,3.2e-05,9.5e-05,-4.9e-05,2.3e-05,-0.000213,5e-06,-9e-05,0.000162,2.6e-05
-0.000126,-1.6e-05,-0.000234,1e-05,-0.000213,0.000182,5.5e-05,-0.000177,-7.4e-05,9.4e-05,0.000152,-3.1e-05,-0.000107,4.9e-05,0.00015,9e-06,-1e-04,7.5e-05,-5.5e-05,-5.8e-05,8.4e-05,-8.1e-05,0.000238,-5.1e-05,0.000216,1e-05,7.7e-05,-0.000146,-0.000366,-0.000194,-3e-05,5e-06,5.4e-05,-0.000171,-5.8e-05,-0.000194,-1.8e-05,0.000121,-0.000111,-6.8e-05,-4.2e-05,-0.000151,-0.000126,-6e-05,-5e-06,2.4e-05,6.1e-05,4.2e-05,-0.000101,-0.000196,-0.000261,-8.7e-05,3e-06,7.3e-05,7.7e-05,2.8e-05,-3.2e-05,5.8e-05,-8.5e-05,-5e-05,-9.5e-05,-0.000163,9.2e-05,0.000244,0.000184,-0.000299,5.2e-05,-9e-06,-3.8e-05,-2.1e-05,-4.1e-05,-0.000277,4.7e-05,1e-06,-9.4e-05,4.4e-05,1.8e-05,-6.8e-05,-0.000139,-0.000136,-2.8e-05,0.00027,-5.4e-05,-6.7e-05,-3.7e-05,-0.000139,-4.4e-05,-6.5e-05,-8.5e-05,-7.3e-05,1e-05,-0.000284,0.000102,8.8e-05,-7.1e-05,-5.7e-05,2.4e-05,1e-04,4.6e-05,-0.00023,0.000145,4.4e-05,0.000262,2.4e-05,-5.6e-05,-0.000167,4e-06,-6e-05,0.000121,-9.7e-05,0.000179,-1.2e-05,4e-06,-0.000102,1.7e-05,8.2e-05,0.000151,4.1e-05,0.000116,4.7e-05,2.7e-05
5.5e-05,-0.000118,0.000181,-0.000119,0.000131,-0.00017,9e-06,0.000124,2.6e-05,-8e-05,-0.000134,-0.000109,6.2e-05,-4.6e-05,-1.9e-05,4.1e-05,7.5e-05,5.8e-05,0.000118,0,-2.4e-05,7.7e-05,-7e-05,5.9e-05,-0.000131,4.4e-05,-4.9e-05,9.4e-05,0.000277,0.000102,-5e-05,0.000104,-1.6e-05,0.000177,3e-05,3.7e-05,7.3e-05,-0.000181,0.000207,0.00012,9e-06,0.000129,0.000112,-2.1e-05,-2.1e-05,-2.3e-05,-5.8e-05,1e-05,7e-06,7.3e-05,-0.000101,4.3e-05,4e-06,2e-05,-0.000132,-7.8e-05,-0.000139,-0.000136,0.000169,1.9e-05,4.4e-05,8.3e-05,-3.6e-05,-6.8e-05,-8.7e-05,0.000209,-6.8e-05,-3.4e-05,-7.6e-05,2.1e-05,-2e-06,0.000117,3.3e-05,-2.3e-05,6.5e-05,-5.3e-05,-0.000113,-0.000102,1.5e-05,2.5e-05,5e-05,-0.000113,3e-05,-1.9e-05,-4e-05,9.9e-05,-8e-06,5.6e-05,4e-06,-4.2e-05,-7.6e-05,0.000109,-3.1e-05,-2.9e-05,6e-05,7e-06,-0.000207,-7.5e-05,-5.4e-05,5.3e-05,0.000131,-1.2e-05,-2.1e-05,7e-05,-4.6e-05,-3e-06,-5.5e-05,9e-05,8e-06,5.5e-05,-1.8e-05,0.000108,-6.8e-05,1.8e-05,5e-05,-2.5e-05,-0.000105,0.00013,-1.6e-05,-7.1e-05,-4.1e-05
5.8e-05,6.1e-05,-6.7e-05,6.3e-05,-1.7e-05,6.7e-05,-5.9e-05,6e-06,6.3e-05,-1.4e-05,0.000132,4.8e-05,-1.9e-05,-3.6e-05,-4e-05,-7e-06,-7.3e-05,-4.8e-05,-0.00015,-1.6e-05,-1.4e-05,-5.1e-05,1.1e-05,-2.5e-05,5.4e-05,-6.1e-05,2.3e-05,-0.000175,-0.000182,-1.6e-05,5.5e-05,-0.000131,5e-06,-0.000136,2.9e-05,6e-06,7e-06,0.000148,5e-06,-6.9e-05,2.1e-05,-5.6e-05,-4e-05,7e-06,1.6e-05,3.9e-05,6.6e-05,-8e-06,7.1e-05,-4e-06,7e-05,-7e-06,-0.000135,-4.9e-05,8.4e-05,6.4e-05,0.000148,0.000254,-1e-04,-3.7e-05,2.8e-05,2e-05,5.2e-05,-3.6e-05,2e-06,-0.000133,5.8e-05,9.8e-05,0.000108,5.2e-05,3e-05,-4e-05,1.1e-05,-9e-05,-3e-06,2e-05,0.000104,4e-05,-3.2e-05,-3e-05,-2.4e-05,-1e-06,0,1.8e-05,2.9e-05,-4.1e-05,5.1e-05,-3.9e-05,2e-06,5.4e-05,6e-06,-3.4e-05,-4e-06,-5.6e-05,6e-06,-1.9e-05,5.8e-05,-2.9e-05,7e-06,-0.000122,-0.000113,-1.1e-05,4.6e-05,-0.000159,2.3e-05,6.2e-05,8.6e-05,-5.4e-05,3e-06,2.3e-05,-9.9e-05,-9.8e-05,-8.1e-05,2.8e-05,-0.000163,-8.1e-05,-5.6e-05,-0.000208,2.5e-05,6.4e-05,3.2e-05
-2.8e-05,-8e-06,-3e-06,0,0,5e-06,1.7e-05,4.2e-05,-2.8e-05,7.4e-05,-0.000109,-4.1e-05,1e-06,2.2e-05,4.6e-05,-3.4e-05,9.9e-05,-1.6e-05,7.6e-05,3.1e-05,1e-06,3e-05,1.3e-05,-1.7e-05,1.1e-05,8.3e-05,2.2e-05,0.000159,5.6e-05,2e-06,-1.3e-05,0.000122,-2.2e-05,5.1e-05,-4.1e-05,4.2e-05,-4.4e-05,-0.000107,-9.9e-05,5.9e-05,-4e-06,4.9e-05,-3e-05,7.7e-05,2.6e-05,-1.8e-05,-5.6e-05,-2.8e-05,-5.5e-05,-9.7e-05,0.00016,1e-06,0.000174,-4e-06,-4.1e-05,-3.2e-05,-4.7e-05,-0.00019,-4.1e-05,-2.1e-05,-7.8e-05,-2.6e-05,-5.8e-05,-1.4e-05,5.5e-05,5.5e-05,-2.3e-05,-9.6e-05,-5.7e-05,9e-06,-2.6e-05,2e-06,1.7e-05,5.9e-05,-2.6e-05,2.5e-05,-8e-06,-6e-06,4e-05,-4e-06,-1.1e-05,2.3e-05,3.2e-05,2.7e-05,5.6e-05,1.1e-05,3.4e-05,8.5e-05,2e-05,1e-05,-1e-05,1.4e-05,-3.1e-05,3.6e-05,6e-05,-4e-06,2.9e-05,-4.2e-05,-4.7e-05,0.000183,7.8e-05,4e-06,-9.8e-05,0.000163,-6e-06,-3.7e-05,-0.000105,7.2e-05,-4.2e-05,-8.2e-05,5.2e-05,4.1e-05,0.000131,-7.8e-05,0.000166,-8e-06,0.000105,0.000164,-9e-06,-7.9e-05,-2.3e-05
-6.8e-05,-1.3e-05,5.1e-05,-2.2e-05,-4.1e-05,-7e-06,-8e-06,1.2e-05,-3e-06,1e-05,5.3e-05,1.3e-05,2e-06,-1.4e-05,-2.7e-05,3.1e-05,-5.7e-05,5.1e-05,-1.8e-05,-5.7e-05,2.6e-05,-3.1e-05,-3.1e-05,4e-05,-1.8e-05,-4e-05,-1e-06,-0.000109,-2e-06,-1.3e-05,3.8e-05,-3.5e-05,-1.4e-05,1e-06,1.2e-05,-1.5e-05,5e-05,-3.2e-05,9.2e-05,-1.8e-05,-1e-06,-8e-06,5.1e-05,-2.9e-05,-3e-06,3.3e-05,3.7e-05,1.7e-05,4.2e-05,0.000125,-1.7e-05,3e-06,-9.8e-05,-3.9e-05,-5e-05,2.3e-05,-7.8e-05,0.000137,4.5e-05,8e-06,8.3e-05,-6e-06,-2.9e-05,2.3e-05,-7.6e-05,1e-05,5e-06,1.1e-05,2.1e-05,-6.3e-05,5.5e-05,4.3e-05,-3.6e-05,-6e-05,-2.7e-05,-2.3e-05,-3e-05,-6e-06,-1.1e-05,8e-06,-3.2e-05,-2e-06,-2.5e-05,1.3e-05,-8e-06,3.1e-05,5e-06,-0.00011,-6e-06,1.5e-05,5e-06,-2.2e-05,2.8e-05,-3.8e-05,-5.3e-05,2.8e-05,-1e-06,5.4e-05,7.2e-05,-3.5e-05,-1.6e-05,9.9e-05,1e-05,-5.7e-05,2e-06,-2.5e-05,4.1e-05,-7e-06,2.4e-05,2.4e-05,-3.1e-05,-2e-06,-1.8e-05,7e-06,-6.1e-05,-3e-06,-3.5e-05,-6.5e-05,-2e-06,4.3e-05,2.5e-05
5.7e-05,2.6e-05,1.1e-05,4.3e-05,4.5e-05,1.3e-05,5.9e-05,-4.5e-05,4.7e-05,-5.3e-05,-5e-06,2.8e-05,-1.8e-05,9e-05,4.7e-05,-1.4e-05,1e-06,-3.1e-05,1.8e-05,4.6e-05,-3e-05,1.6e-05,5.2e-05,2e-06,6.4e-05,1e-06,8e-06,7.7e-05,-4.6e-05,4e-05,-1.9e-05,5e-06,2.1e-05,-3.6e-05,2.4e-05,7e-06,-5.1e-05,9.2e-05,-3.6e-05,-2e-06,1e-05,-2.6e-05,-3e-05,-1e-06,1.2e-05,-2.6e-05,-2e-05,4e-06,-1.8e-05,-4.5e-05,-8.6e-05,-9e-06,4.6e-05,6.8e-05,1e-05,-1.8e-05,8.1e-05,-7.7e-05,-2.9e-05,-1.9e-05,-7.3e-05,7e-06,-3e-06,-6e-05,5.5e-05,-3.2e-05,-4e-06,-7e-06,-4.3e-05,2.1e-05,-6e-05,4e-06,-1e-05,9e-05,1.3e-05,4e-05,1.9e-05,-2.1e-05,2e-06,-6e-06,3.3e-05,-1.1e-05,-1.1e-05,-4.7e-05,-1e-06,-1.9e-05,-3.1e-05,5.8e-05,-1.2e-05,5e-06,5e-06,3.7e-05,-8e-06,1e-05,1.1e-05,1.6e-05,1e-06,-3e-06,-3.7e-05,-2.2e-05,7.4e-05,-7.1e-05,6.4e-05,-3.6e-05,-5e-06,7e-06,-7e-06,1.5e-05,-3.4e-05,7.4e-05,3.3e-05,2e-06,-2.5e-05,-2e-05,4.4e-05,1.3e-05,-7.3e-05,3.6e-05,-1.5e-05,-2.5e-05,-5.8e-05
3e-06,1.1e-05,-2.6e-05,-1.5e-05,-3e-06,-3e-06,-1.5e-05,-2.5e-05,-4.2e-05,2.3e-05,-3e-06,-9e-06,1e-06,-0.000143,-2e-05,2e-06,2.5e-05,-1e-06,-6e-06,-3.2e-05,1.7e-05,-2e-06,-3e-05,-2.7e-05,-3.8e-05,2e-05,-2e-06,-5.9e-05,5.9e-05,-3.2e-05,-1e-05,-8e-06,-1.4e-05,3.3e-05,-9e-06,-1.3e-05,3.9e-05,-1.8e-05,2.3e-05,-8e-06,-5e-06,8e-05,1.8e-05,2.3e-05,5e-06,1.2e-05,3.6e-05,1.2e-05,-2e-06,2.9e-05,-4.2e-05,-1e-06,-1.6e-05,-4e-06,5.4e-05,5.1e-05,-7.1e-05,6.3e-05,2.2e-05,2.1e-05,7.5e-05,-1.2e-05,7e-06,4.1e-05,-9e-06,1.5e-05,-1e-06,3.3e-05,3.7e-05,5e-06,2.6e-05,5.2e-05,-2.4e-05,-4.7e-05,4e-06,-5.1e-05,3e-06,-5e-06,2.2e-05,-4e-06,-1.3e-05,1.1e-05,-7e-06,-3e-06,9e-06,-2.9e-05,-3.1e-05,-2.5e-05,2.8e-05,-4.7e-05,0,-4.9e-05,3e-06,-1e-06,-1.6e-05,-4.6e-05,-1.2e-05,-1.8e-05,2e-05,2.1e-05,-2.9e-05,4.1e-05,-1.2e-05,8.9e-05,-1.5e-05,-1e-05,5.2e-05,-4e-06,4.1e-05,-3.1e-05,-1.5e-05,3e-06,2e-06,2.1e-05,1e-05,3.4e-05,0.000126,-4e-06,-3.6e-05,1e-06,4.8e-05
-1.8e-05,-7e-06,9e-06,-1.9e-05,1e-06,6e-06,-2e-05,4.3e-05,1.8e-05,1.7e-05,1.1e-05,5e-06,7e-06,0.00014,2e-06,3e-06,-1.5e-05,-1.5e-05,-1.7e-05,2e-05,-4e-06,-6e-06,9e-06,2.4e-05,1e-06,-3.8e-05,6e-06,1.8e-05,-4.6e-05,2e-05,5e-06,2.3e-05,-7e-06,-2.2e-05,0,-2.7e-05,-7e-06,-5.2e-05,2.4e-05,1.3e-05,0,-5.7e-05,-3e-06,2.2e-05,0,1.4e-05,-3.3e-05,-1.5e-05,3.8e-05,-3.8e-05,6.4e-05,3e-06,1.4e-05,-2e-06,-4.2e-05,-3.2e-05,5.4e-05,1.8e-05,1.3e-05,-8e-06,1.3e-05,2e-05,1.3e-05,-1.9e-05,-6e-06,-1.6e-05,1.8e-05,-6e-06,-1.1e-05,9e-06,-5e-06,7e-06,-1.2e-05,2.7e-05,7e-06,3.2e-05,-1.8e-05,7e-06,-4.2e-05,1.6e-05,2.2e-05,-6e-06,1.7e-05,-2.2e-05,1.1e-05,2.6e-05,2.2e-05,1.6e-05,-3.7e-05,3.7e-05,-1e-05,3.4e-05,3e-06,-1e-06,3.5e-05,2.2e-05,-2.1e-05,2.7e-05,1e-06,-6.9e-05,4e-06,-4.5e-05,-6.4e-05,-9.7e-05,4e-06,2.8e-05,-4.6e-05,-1.4e-05,-3e-05,6e-06,-2.1e-05,-1.2e-05,1e-06,-5e-06,9e-06,-1.3e-05,-7.9e-05,-5e-06,3.4e-05,-1.6e-05,-1.1e-05
2.5e-05,2.1e-05,2.8e-05,4.3e-05,-1e-05,-2.8e-05,3e-06,-8e-06,-4e-06,-2e-05,-1.4e-05,8e-06,1e-06,-9.7e-05,1.4e-05,-1.3e-05,6e-06,4.6e-05,3.2e-05,-1.3e-05,2e-06,-5e-06,1.1e-05,-1.8e-05,2.2e-05,4.5e-05,6e-06,1.3e-05,2.9e-05,-1.7e-05,1e-06,-2.6e-05,2.1e-05,1.7e-05,-7e-06,4.9e-05,-1.3e-05,4.4e-05,-4.6e-05,-1.7e-05,4e-06,2e-05,-9e-06,-1.6e-05,4e-06,-1e-06,3.2e-05,5e-06,-2.5e-05,1.3e-05,3.2e-05,4e-06,3.4e-05,-1.4e-05,-5e-06,1.5e-05,-1.1e-05,-3.2e-05,-1.9e-05,4e-06,-1.1e-05,1.2e-05,1.2e-05,-1.5e-05,1.1e-05,1.6e-05,-2e-05,-2.1e-05,1.2e-05,9e-06,1e-05,-4e-06,2e-06,-1.2e-05,-2.3e-05,-1e-05,2.4e-05,1.1e-05,7e-06,-4e-06,-1.7e-05,-7e-06,-2.2e-05,9e-06,-4e-06,-3.1e-05,1.4e-05,-2.2e-05,3.6e-05,-1.5e-05,-9e-06,-1.1e-05,-4e-06,1e-05,-5e-06,6e-06,-2.5e-05,3e-05,1.2e-05,5.7e-05,4.3e-05,5.3e-05,7.1e-05,5.8e-05,-5e-06,-1.4e-05,3.9e-05,-1e-05,-5e-06,-6.1e-05,8e-06,2e-06,-2.4e-05,-1.5e-05,1.4e-05,-3.1e-05,2.3e-05,-4.2e-05,4e-06,-1.8e-05,6e-06
-1.6e-05,-4.4e-05,-4.7e-05,-1.7e-05,-1.5e-05,2.8e-05,-1.6e-05,1.6e-05,9e-06,-2e-06,2e-05,-4e-05,-5e-06,5.4e-05,-9e-06,1.1e-05,-1.1e-05,-3.9e-05,-3e-05,3.1e-05,2e-06,1.4e-05,-2.5e-05,9e-06,-3.4e-05,-2.9e-05,-3e-06,-5.2e-05,-2.4e-05,1.3e-05,-4e-06,1e-05,-2e-06,-1.7e-05,1.3e-05,-4e-05,1.6e-05,1.9e-05,4e-06,-5e-06,-1e-06,-3.2e-05,1.7e-05,-2e-06,0,-6e-06,-2.6e-05,-1.4e-05,1.5e-05,2.1e-05,4e-06,0,-3.4e-05,-4e-06,2.2e-05,1.3e-05,1e-06,4.1e-05,1.2e-05,6e-06,-4e-06,-1.3e-05,1.3e-05,-8e-06,-2.9e-05,-2e-06,1.6e-05,1.3e-05,-1.8e-05,-4e-06,9e-06,1.4e-05,9e-06,1.3e-05,2.5e-05,-1.3e-05,-2e-05,-1e-05,6e-06,-1e-05,9e-06,3e-06,1.3e-05,3.9e-05,3e-06,-5e-06,0,2.3e-05,-3.5e-05,1e-05,2e-06,-1.4e-05,2e-06,-2e-06,8e-06,5e-06,4.4e-05,-1.1e-05,-5e-06,-2.4e-05,-5.8e-05,-2.1e-05,-3.8e-05,-3.1e-05,1.7e-05,-1.9e-05,-5e-06,-1.3e-05,6e-06,2.8e-05,-4e-06,0,5e-06,6e-06,1e-06,2.2e-05,0,2.8e-05,1e-06,2.1e-05,-4e-06
-8e-06,1.7e-05,9e-06,-2.5e-05,2.1e-05,-3.6e-05,3.1e-05,-2.1e-05,0,1.6e-05,-1.9e-05,2.4e-05,1.1e-05,-1.6e-05,9e-06,-3e-06,1.3e-05,1e-06,1.6e-05,-3.2e-05,6e-06,5e-06,2e-05,-2e-06,4.4e-05,2e-05,-1e-05,6.8e-05,2.1e-05,-1.5e-05,7e-06,5e-06,-1.4e-05,1e-06,-1e-05,3.6e-05,-1.4e-05,-3.2e-05,3.4e-05,3e-06,-8e-06,1.7e-05,-1e-05,1.8e-05,1e-06,-1e-06,2.4e-05,1.6e-05,-1.2e-05,-8e-06,-2.7e-05,-8e-06,3.2e-05,2.4e-05,-5e-06,4e-06,-2.5e-05,-3.8e-05,-4e-06,-3e-06,9e-06,0,-9e-06,3.2e-05,2.3e-05,3e-06,-9e-06,-1.6e-05,1.6e-05,2e-06,-3e-05,-1.9e-05,1e-06,-1.6e-05,-1.1e-05,2.3e-05,3e-06,-1.5e-05,-8e-06,0,-1.7e-05,-2.1e-05,-1.1e-05,-1.4e-05,-1e-05,2.1e-05,5e-06,-2.8e-05,1.6e-05,-5e-06,3e-06,1.9e-05,2e-06,-7e-06,-1e-05,-1.4e-05,3e-06,-4e-06,3e-06,6e-05,1.2e-05,2.5e-05,2.9e-05,1e-05,1e-06,2.1e-05,1.4e-05,-1e-06,-1e-06,1.3e-05,2.1e-05,9e-06,1.1e-05,-1.6e-05,-2.7e-05,2.5e-05,1.8e-05,-2e-05,-3e-06,-2.2e-05,2e-06
1.3e-05,2.3e-05,1.6e-05,2.4e-05,-2e-06,2.3e-05,-9e-06,-9e-06,7e-06,-1.9e-05,6e-06,-1.2e-05,-5e-06,1.7e-05,-3e-06,0,-3e-06,2.7e-05,8e-06,1.5e-05,-6e-06,-9e-06,-8e-06,1e-06,-3.6e-05,-7e-06,9e-06,-5.8e-05,-1.8e-05,1.1e-05,-1e-06,-9e-06,1e-05,-5e-06,6e-06,-1.7e-05,1.5e-05,1.6e-05,-2.7e-05,1e-06,0,-2.5e-05,5e-06,-1.8e-05,2e-06,-2e-06,-2.3e-05,-6e-06,0,5e-06,-1e-06,8e-06,-4.2e-05,1.8e-05,-2e-05,-3e-06,6.5e-05,3.8e-05,4e-06,5e-06,-1.3e-05,-4e-06,-6e-06,-1.6e-05,-2.1e-05,-6e-06,5e-06,1.6e-05,-1.5e-05,-9e-06,2.9e-05,-1e-05,-1e-06,1.1e-05,1e-05,-3.7e-05,1.4e-05,1e-05,1e-05,-1.4e-05,1e-06,2e-05,6e-06,4e-06,7e-06,-1.1e-05,-1.4e-05,1.9e-05,-1e-06,0,6e-06,-2.8e-05,6e-06,1.9e-05,-5e-06,2.4e-05,-5e-06,1.1e-05,5e-06,-4e-05,5e-06,-3.4e-05,-3.6e-05,2e-06,-2e-06,1e-05,-2.1e-05,-8e-06,0,1.2e-05,-1e-05,0,-1.6e-05,1e-05,2.3e-05,-1e-06,-1e-05,1.8e-05,-9e-06,9e-06,1e-06
-5e-06,-2.4e-05,-1.8e-05,5e-06,-3e-06,-5e-06,-1.6e-05,1.2e-05,5e-06,0,-1e-06,1.3e-05,-1e-06,-1.8e-05,-3e-06,0,-1.4e-05,-1.8e-05,-1.5e-05,-1.4e-05,1e-06,-1e-06,6e-06,-7e-06,3.8e-05,-6e-06,7e-06,5e-05,2e-05,-5e-06,2e-06,1e-06,-4e-06,2.3e-05,-6e-06,5e-06,-3e-06,-5e-06,0,1e-06,3e-06,1.9e-05,-2e-06,-1e-05,-3e-06,5e-06,2.1e-05,1e-06,7e-06,-2.8e-05,1e-06,1e-06,3.4e-05,-2e-05,1.6e-05,-2e-06,-6.8e-05,-1.9e-05,1.3e-05,0,0,1e-06,-6e-06,3e-06,6e-06,1e-06,1e-06,1e-06,1.2e-05,3e-06,-1.6e-05,-8e-06,6e-06,-5e-06,-1.5e-05,3.1e-05,-8e-06,-1e-06,-2e-06,2.7e-05,2.3e-05,-1e-05,0,-4e-06,-4e-06,1e-05,-7e-06,-1e-05,4e-06,-6e-06,3e-06,3.1e-05,-6e-06,-1.7e-05,-3e-06,-1.5e-05,-5e-06,5e-06,-1.1e-05,1e-06,-7e-06,5e-06,1.2e-05,-9e-06,-1e-06,-1.7e-05,2.1e-05,8e-06,-1e-06,-9e-06,-1.1e-05,-1.5e-05,1.2e-05,-2e-06,-1e-05,-1e-06,-2.7e-05,-1.3e-05,9e-06,0,-8e-06
0,8e-06,0,-1.8e-05,-2e-06,4e-06,-9e-06,-4e-06,-3e-05,1.2e-05,-5e-06,1.6e-05,1e-06,1.7e-05,5e-06,5e-06,2e-05,-8e-06,1.2e-05,2.4e-05,3e-06,1e-06,0,3e-06,-1.9e-05,1.8e-05,-8e-06,-4.3e-05,-1.7e-05,2e-06,-2e-06,4e-06,-8e-06,-2.6e-05,3e-06,-1e-05,3e-06,-2e-06,2e-06,1e-06,-2e-06,-6e-06,2e-06,-2e-06,1e-06,0,-2e-05,-5e-06,-1e-05,1.6e-05,-3e-06,-1e-06,-1.7e-05,-7e-06,8e-06,7e-06,5.1e-05,0,-1.3e-05,-4e-06,8e-06,9e-06,-6e-06,-9e-06,5e-06,8e-06,-5e-06,5e-06,-1.6e-05,6e-06,7e-06,-2.4e-05,0,8e-06,9e-06,-2e-05,-8e-06,1e-06,5e-06,-2.4e-05,-1.1e-05,5e-06,-6e-06,-9e-06,-3e-06,4e-06,5e-06,0,-2e-06,1.1e-05,-1e-06,-1.9e-05,8e-06,1.1e-05,1.2e-05,9e-06,-1.1e-05,-9e-06,6e-06,2e-06,4e-06,1.7e-05,3.6e-05,4e-06,-1e-06,-2e-06,-1e-05,8e-06,4e-06,-2.8e-05,7e-06,1.1e-05,1e-06,-1e-06,-2.3e-05,-1e-05,3.9e-05,2e-06,-2e-06,-6e-06,1.5e-05
6e-06,0,1.8e-05,1.5e-05,0,3e-06,1.7e-05,0,1.4e-05,-6e-06,7e-06,-2e-05,0,-2e-05,-5e-06,-7e-06,-1.2e-05,1.6e-05,-5e-06,-2.9e-05,-4e-06,-1e-06,-1e-05,-3e-06,-2e-06,-2.6e-05,-1e-06,3.2e-05,8e-06,-2e-06,4e-06,0,7e-06,2.1e-05,0,8e-06,3e-06,1.6e-05,-1.5e-05,5e-06,1e-06,0,-2e-06,-5e-06,0,2e-06,1.5e-05,2e-06,8e-06,-4e-06,4e-06,2e-06,3e-06,-1.1e-05,-2e-05,-1.3e-05,-3e-05,1.6e-05,4e-06,4e-06,-6e-06,2e-06,-2e-06,5e-06,-1.4e-05,-8e-06,9e-06,-1.2e-05,9e-06,2e-06,-2e-06,1.2e-05,-8e-06,-3e-06,-2e-06,1.1e-05,1.2e-05,-3e-06,-1e-05,2.9e-05,0,1e-06,0,1.6e-05,4e-06,-6e-06,3e-06,8e-06,-4e-06,-1.5e-05,-4e-06,8e-06,-7e-06,-3e-06,1e-06,-5e-06,2e-06,-2e-06,-4e-06,-1.7e-05,-1.8e-05,-2e-06,-4.1e-05,-6e-06,5e-06,4e-06,-3e-06,1e-05,-1.1e-05,1.2e-05,-8e-06,-1e-06,-1.3e-05,7e-06,2e-05,-8e-06,-1.4e-05,5e-06,-2e-06,1e-06,-1.1e-05
-1.6e-05,-6e-06,-3e-06,-7e-06,-6e-06,-8e-06,1.1e-05,5e-06,8e-06,0,-7e-06,8e-06,-6e-06,1.3e-05,5e-06,7e-06,0,4e-06,-4e-06,2.3e-05,-4e-06,-4e-06,9e-06,5e-06,1.1e-05,2.1e-05,3e-06,-2.6e-05,5e-06,4e-06,1e-06,-6e-06,-2e-06,-2.1e-05,1e-06,0,-4e-06,-2.1e-05,2.1e-05,-2e-06,1e-06,-1e-06,3e-06,-5e-06,-3e-06,-3e-06,-1e-05,6e-06,-5e-06,1.5e-05,3e-06,-3e-06,-6e-06,2.6e-05,6e-06,1.3e-05,1.4e-05,-3.3e-05,2e-06,-2e-06,-1.1e-05,-1.1e-05,5e-06,-2e-06,1.4e-05,6e-06,-1e-05,-6e-06,-1e-05,-2e-06,0,-1.3e-05,-1e-06,0,5e-06,-5e-06,-9e-06,-7e-06,0,-3.1e-05,-6e-06,5e-06,2e-06,1.6e-05,0,1e-05,1.4e-05,-8e-06,3e-06,1.1e-05,-2e-06,-5e-06,6e-06,-9e-06,-4e-06,1.2e-05,3e-06,-1e-06,3e-06,2.5e-05,2.2e-05,6e-06,6e-06,2.5e-05,-2e-06,5e-06,-9e-06,3e-06,1.1e-05,1.1e-05,1e-05,-3e-06,0,-8e-06,-8e-06,1.2e-05,-2.1e-05,1e-05,-6e-06,4e-06,4e-06
5e-06,1.2e-05,-1e-05,1e-06,1.1e-05,7e-06,-1.3e-05,-4e-06,1e-06,8e-06,4e-06,-1.1e-05,6e-06,-2.7e-05,-6e-06,-6e-06,2e-06,-2.8e-05,6e-06,-1.8e-05,3e-06,4e-06,-7e-06,-3e-06,-1.5e-05,-1.2e-05,-3e-06,2.4e-05,-1.4e-05,-2e-06,0,1.1e-05,-4e-06,1.1e-05,2e-06,5e-06,5e-06,-5e-06,-1.1e-05,3e-06,-2e-06,-1e-06,-3e-06,4e-06,1e-06,0,7e-06,-4e-06,1e-06,-1.8e-05,4e-06,5e-06,1e-05,-1e-06,1.4e-05,-4e-06,-5e-06,3.8e-05,-6e-06,2e-06,1e-06,3e-06,6e-06,1.7e-05,-7e-06,-1.2e-05,8e-06,1.3e-05,1.1e-05,-6e-06,5e-06,1.2e-05,-1e-06,-2e-06,-1.5e-05,-3e-06,3e-06,4e-06,8e-06,2.1e-05,-3e-06,-1.3e-05,-3e-06,-5e-06,1e-06,-7e-06,-2e-06,3e-06,-5e-06,-2e-06,2e-06,6e-06,-2e-06,1.2e-05,-3e-06,-2.1e-05,1.2e-05,-4e-06,-4e-06,-7e-06,-3e-06,-3e-05,1.1e-05,-3.1e-05,4e-06,0,8e-06,6e-06,-9e-06,1.2e-05,-5e-06,6e-06,1e-05,7e-06,-5e-06,6e-06,3e-05,-5e-06,5e-06,2e-06,-1e-06
1e-05,-2.2e-05,1.3e-05,1e-06,1e-06,-1.3e-05,-5e-06,0,-1e-05,-6e-06,-2e-06,2e-06,5e-06,3e-05,4e-06,4e-06,-2e-06,2.6e-05,-8e-06,1.6e-05,0,1e-06,3e-06,4e-06,1.9e-05,4e-06,-4e-06,-2.5e-05,1.9e-05,-1e-06,1e-06,-9e-06,9e-06,-3e-06,-4e-06,4e-06,-3e-06,2.8e-05,9e-06,-3e-06,-2e-06,4e-06,-1e-06,1.3e-05,0,0,-7e-06,0,0,2e-06,-5e-06,-3e-06,-6e-06,-8e-06,-1e-05,-2e-06,9e-06,-3.1e-05,8e-06,0,3e-06,1e-06,0,-1.1e-05,6e-06,9e-06,-5e-06,-3e-06,-1.4e-05,1e-06,-7e-06,7e-06,-1e-06,-2e-06,1e-05,8e-06,5e-06,3e-06,-9e-06,-1.8e-05,2e-06,1.2e-05,1e-06,6e-06,0,-5e-06,-1.2e-05,-2e-06,1.5e-05,-4e-06,2e-06,-9e-06,2e-06,-1.4e-05,0,1.5e-05,-6e-06,-1e-06,3e-06,1.3e-05,-5e-06,2.3e-05,1e-06,2.4e-05,-4e-06,-9e-06,-5e-06,-5e-06,6e-06,-1.5e-05,-5e-06,-5e-06,-6e-06,1e-06,6e-06,-1.2e-05,-8e-06,1e-06,4e-06,-4e-06,2e-06
1e-06,2.2e-05,-1e-06,-3e-06,-8e-06,1.4e-05,3e-06,-2e-06,3e-06,-1e-06,1e-06,4e-06,-5e-06,-2.6e-05,-3e-06,-1e-06,4e-06,-5e-06,7e-06,-1.8e-05,0,3e-06,-3e-06,-3e-06,-1.3e-05,3e-06,0,2.8e-05,-2e-05,1e-06,-1e-06,2e-06,-1e-06,-3e-06,2e-06,-1.5e-05,0,-1.7e-05,-5e-06,1e-06,1e-06,-6e-06,3e-06,1e-06,1e-06,-5e-06,8e-06,0,1e-06,4e-06,-3e-06,-1e-06,7e-06,-8e-06,-5e-06,-3e-06,-2e-05,2.1e-05,-6e-06,-1e-06,-3e-06,-1e-06,1e-06,-5e-06,3e-06,-3e-06,3e-06,5e-06,6e-06,1e-06,5e-06,1e-06,5e-06,2e-06,-3e-06,-4e-06,-9e-06,-6e-06,8e-06,1e-05,2e-06,-1e-05,-2e-06,-1.1e-05,1e-06,7e-06,1e-06,0,-1.7e-05,4e-06,1e-06,5e-06,-1e-06,9e-06,0,-9e-06,-3e-06,2e-06,0,-2.2e-05,1.2e-05,-1.2e-05,3e-06,-7e-06,0,2e-06,-2e-06,-2e-06,0,-7e-06,3e-06,-3e-06,1e-06,-5e-06,5e-06,-4e-06,-1.2e-05,-3e-06,0,8e-06,-4e-06
-2e-06,-1.4e-05,-1.5e-05,-1e-06,-1e-06,-1.2e-05,6e-06,-1e-06,5e-06,4e-06,-1e-06,-2e-06,-1e-06,1.7e-05,1e-06,-1e-06,-1e-05,-1.2e-05,-4e-06,1.9e-05,1e-06,-5e-06,0,0,-1e-06,-9e-06,1e-06,-2.8e-05,1.9e-05,-1e-06,-2e-06,1e-06,-7e-06,8e-06,-1e-06,1.5e-05,2e-06,-1.3e-05,-5e-06,-4e-06,0,8e-06,-4e-06,-2e-06,1e-06,5e-06,-7e-06,3e-06,-1e-06,0,-4e-06,4e-06,-6e-06,-2e-06,1e-05,5e-06,2.6e-05,-1.3e-05,0,0,4e-06,4e-06,-2e-06,3e-06,-6e-06,2e-06,0,-7e-06,-5e-06,2e-06,-2e-06,1.3e-05,3e-06,-3e-06,6e-06,1e-06,4e-06,-3e-06,3e-06,-7e-06,1e-05,3e-06,-1e-06,-5e-06,0,-1e-05,-2e-06,2e-06,1.4e-05,-3e-06,0,-3e-06,-1e-06,-1e-06,2e-06,9e-06,-2e-06,1e-06,-2e-06,6e-06,-1e-05,2.7e-05,-2.8e-05,-1.1e-05,0,6e-06,2e-06,-1e-05,0,-7e-06,-3e-06,5e-06,5e-06,8e-06,-6e-06,2e-06,7e-06,-4e-06,-1e-06,0,2e-06
0,1e-05,1.1e-05,8e-06,3e-06,8e-06,0,6e-06,-9e-06,-3e-06,-1e-06,4e-06,2e-06,-8e-06,0,-2e-06,9e-06,9e-06,1e-06,-1.7e-05,0,1e-06,3e-06,0,6e-06,1.2e-05,-2e-06,2.2e-05,-1.3e-05,0,0,0,5e-06,-5e-06,1e-06,-1.3e-05,-3e-06,2.2e-05,1.1e-05,0,-1e-06,-8e-06,4e-06,3e-06,-2e-06,0,7e-06,-2e-06,1e-06,8e-06,4e-06,-3e-06,5e-06,1.7e-05,-3e-06,-3e-06,-1.9e-05,0,1e-06,-2e-06,0,2e-06,-3e-06,8e-06,8e-06,1e-06,-3e-06,-1e-06,7e-06,0,0,0,-1e-06,4e-06,-1.1e-05,3e-06,4e-06,2e-06,-8e-06,3e-06,-1e-05,-4e-06,2e-06,6e-06,2e-06,0,3e-06,3e-06,-1.2e-05,0,-2e-06,0,2e-06,-3e-06,1e-06,-9e-06,-2e-06,-3e-06,3e-06,0,7e-06,-2.8e-05,3e-05,2e-05,-1e-06,-2e-06,2e-06,-4e-06,-2e-06,2.1e-05,5e-06,0,-6e-06,-9e-06,1.1e-05,2e-06,7e-06,4e-06,-3e-06,0,1e-06
-5e-06,-1.6e-05,1e-06,-8e-06,1e-06,0,-3e-06,-2e-06,6e-06,-2e-06,1e-06,1e-06,-1e-06,6e-06,-3e-06,4e-06,-2e-06,5e-06,3e-06,1.5e-05,0,-1e-06,-2e-06,-1e-06,-8e-06,-1e-05,-2e-06,-1.7e-05,7e-06,-2e-06,-1e-06,-4e-06,1e-06,0,-1e-06,1.4e-05,2e-06,-5e-06,-6e-06,-2e-06,1e-06,4e-06,-5e-06,0,-1e-06,0,-8e-06,-1e-06,2e-06,-1.5e-05,5e-06,1e-06,-5e-06,0,-6e-06,-2e-06,4e-06,1e-05,-5e-06,0,-1e-06,-8e-06,-2e-06,-6e-06,-8e-06,-4e-06,5e-06,1e-06,-1e-05,-2e-06,-1e-06,3e-06,2e-06,-4e-06,6e-06,-5e-06,-5e-06,-1e-06,1e-06,6e-06,-2e-06,4e-06,-1e-06,3e-06,-2e-06,5e-06,7e-06,-7e-06,8e-06,3e-06,-2e-06,5e-06,-3e-06,9e-06,-2e-06,1.4e-05,3e-06,1e-06,-2e-06,1e-06,-9e-06,8e-06,-3e-06,-1.2e-05,2e-06,-4e-06,0,-5e-06,1e-06,-2e-06,-3e-06,-1e-06,0,4e-06,-8e-06,4e-06,1e-06,0,4e-06,3e-06,-3e-06
2e-06,1.9e-05,-1.1e-05,3e-06,0,-5e-06,1e-06,-1e-06,-2e-06,5e-06,-1e-06,-1e-06,-1e-06,0,1e-06,-4e-06,-6e-06,-9e-06,-5e-06,-1.5e-05,0,2e-06,3e-06,1e-06,1.1e-05,6e-06,0,8e-06,-2e-06,3e-06,-1e-06,4e-06,-6e-06,-2e-06,0,-8e-06,1e-06,-8e-06,0,0,1e-06,-9e-06,3e-06,-2e-06,0,1e-06,8e-06,-1e-06,-3e-06,8e-06,6e-06,-1e-06,1e-06,-7e-06,4e-06,5e-06,8e-06,-1.6e-05,5e-06,0,2e-06,3e-06,0,3e-06,3e-06,7e-06,-5e-06,2e-06,5e-06,0,2e-06,-2e-06,1e-06,4e-06,0,8e-06,1e-06,-1e-06,2e-06,-6e-06,1e-06,-6e-06,0,-3e-06,-1e-06,-3e-06,-3e-06,8e-06,-5e-06,-4e-06,0,-6e-06,2e-06,-7e-06,-1e-06,-1.4e-05,1e-06,4e-06,3e-06,5e-06,0,-7e-06,-1.3e-05,0,-2e-06,0,-2e-06,2e-06,1e-06,-3e-06,-2e-06,0,5e-06,0,2e-06,-1e-06,-2e-05,-3e-06,-1e-06,0,2e-06
1e-06,-1.2e-05,7e-06,6e-06,0,7e-06,-4e-06,0,2e-06,-3e-06,1e-06,-2e-06,0,-2e-06,-2e-06,5e-06,8e-06,1e-06,4e-06,1.6e-05,-1e-06,-2e-06,0,0,-1.3e-05,-1e-06,2e-06,2e-06,0,-3e-06,-1e-06,-1e-06,3e-06,2e-06,0,3e-06,-1e-06,9e-06,6e-06,0,-2e-06,5e-06,0,-1e-06,1e-06,-1e-06,-7e-06,1e-06,3e-06,-6e-06,-8e-06,0,3e-06,-6e-06,3e-06,-3e-06,-1.3e-05,1.8e-05,-1e-06,0,0,2e-06,1e-06,-4e-06,0,-6e-06,5e-06,5e-06,-5e-06,-1e-06,-4e-06,-8e-06,-2e-06,-4e-06,4e-06,-8e-06,4e-06,-2e-06,0,5e-06,0,8e-06,-1e-06,1e-06,1e-06,3e-06,-1e-06,-5e-06,3e-06,2e-06,1e-06,4e-06,-1e-06,4e-06,0,8e-06,2e-06,1e-06,-3e-06,-1e-06,8e-06,1.6e-05,3e-06,5e-06,2e-06,0,6e-06,3e-06,-1e-06,-1.1e-05,0,-1e-06,-4e-06,-3e-06,4e-06,-7e-06,2.2e-05,0,-1e-06,0,0
-3e-06,3e-06,4e-06,-8e-06,-2e-06,-8e-06,0,1e-06,-2e-06,-4e-06,-1e-06,-1e-06,-1e-06,1e-05,0,-3e-06,-7e-06,9e-06,-1e-06,-1.7e-05,-2e-06,2e-06,0,-1e-06,6e-06,-4e-06,-2e-06,-1.2e-05,0,2e-06,0,-2e-06,2e-06,0,0,-3e-06,3e-06,-7e-06,-1.2e-05,-1e-06,-1e-06,-1e-06,0,0,1e-06,-1e-06,6e-06,-1e-06,-4e-06,9e-06,-9e-06,3e-06,-5e-06,-3e-06,-7e-06,0,1.1e-05,-1.9e-05,-3e-06,1e-06,-2e-06,-1e-06,0,-3e-06,-6e-06,5e-06,-4e-06,-7e-06,6e-06,2e-06,4e-06,-2e-06,-1e-06,4e-06,-9e-06,6e-06,-5e-06,-2e-06,-1e-06,-1.1e-05,4e-06,-5e-06,0,-1.1e-05,0,-1e-06,-4e-06,2e-06,-2e-06,2e-06,1e-06,-3e-06,0,-1e-06,2e-06,-8e-06,-2e-06,-2e-06,3e-06,-1e-06,-1e-05,-1e-06,1e-06,-8e-06,-2e-06,4e-06,-4e-06,5e-06,2e-06,0,-1e-06,0,0,6e-06,-9e-06,1e-06,-5e-06,3e-06,-1e-06,-1e-06,-1e-06
2e-06,1e-06,-7e-06,0,1e-06,5e-06,3e-06,0,1e-06,5e-06,2e-06,0,2e-06,-1.2e-05,1e-06,0,6e-06,-9e-06,1e-06,1.5e-05,1e-06,0,1e-06,0,-4e-06,7e-06,-2e-06,1.9e-05,-2e-06,-1e-06,0,3e-06,-2e-06,5e-06,0,1e-06,-2e-06,5e-06,2e-06,2e-06,2e-06,0,0,-3e-06,0,1e-06,-6e-06,0,4e-06,-4e-06,3e-06,-3e-06,8e-06,1.4e-05,1e-06,0,-5e-06,1.3e-05,3e-06,0,3e-06,2e-06,2e-06,6e-06,6e-06,-7e-06,3e-06,0,-7e-06,1e-06,-2e-06,-7e-06,-2e-06,-4e-06,5e-06,-3e-06,3e-06,2e-06,2e-06,8e-06,3e-06,6e-06,0,-2e-06,0,-2e-06,-4e-06,0,-1e-06,-4e-06,1e-06,2e-06,0,-4e-06,0,9e-06,-1e-06,0,-2e-06,-6e-06,7e-06,-1.2e-05,1.5e-05,7e-06,1e-06,-2e-06,2e-06,6e-06,-2e-06,1.4e-05,3e-06,1e-06,3e-06,-6e-06,4e-06,5e-06,-1e-05,0,0,2e-06,0
1e-06,-7e-06,-1e-06,4e-06,1e-06,-2e-06,1e-06,0,-3e-06,0,-1e-06,2e-06,0,1.1e-05,-1e-06,1e-06,-5e-06,1e-06,1e-06,-1.3e-05,0,1e-06,-1e-06,0,0,-7e-06,2e-06,-2.2e-05,3e-06,2e-06,0,-1e-06,1e-06,-7e-06,0,1e-06,2e-06,4e-06,1.3e-05,0,0,-1e-06,-1e-06,-5e-06,-1e-06,-1e-06,7e-06,1e-06,-2e-06,-2e-06,1e-05,1e-06,-7e-06,1e-06,2e-06,2e-06,-1e-06,-4e-06,-2e-06,0,-3e-06,1e-06,0,4e-06,-6e-06,4e-06,-1e-06,-1e-06,4e-06,0,0,-2e-06,-1e-06,3e-06,0,-1e-06,0,0,0,-7e-06,-1e-06,-3e-06,0,5e-06,-1e-06,4e-06,7e-06,0,4e-06,3e-06,-1e-06,-1e-06,0,4e-06,0,-9e-06,0,3e-06,2e-06,4e-06,-2e-06,3e-06,-2.1e-05,3e-06,0,-4e-06,-3e-06,4e-06,2e-06,0,-2e-06,2e-06,-2e-06,5e-06,2e-06,1e-06,5e-06,4e-06,3e-06,-2e-06,1e-06
0,1.8e-05,9e-06,-4e-06,0,1e-06,-2e-06,-1e-06,-2e-06,-4e-06,1e-06,1e-06,-1e-06,-9e-06,1e-06,0,3e-06,6e-06,-1e-06,1.4e-05,-1e-06,-2e-06,1e-06,-1e-06,2e-06,3e-06,2e-06,2.2e-05,-5e-06,-2e-06,2e-06,-1e-06,3e-06,5e-06,0,-3e-06,0,-1.4e-05,-1.5e-05,1e-06,-1e-06,-3e-06,1e-06,-1e-06,-1e-06,0,-6e-06,-1e-06,-1e-06,4e-06,1e-06,0,7e-06,-6e-06,-2e-06,-3e-06,-1e-06,-4e-06,2e-06,0,2e-06,-5e-06,0,-8e-06,2e-06,-3e-06,-1e-06,4e-06,-6e-06,-1e-06,1e-06,1e-06,1e-06,-3e-06,4e-06,4e-06,-3e-06,-3e-06,-4e-06,7e-06,-7e-06,0,0,2e-06,0,-3e-06,1e-06,0,-7e-06,-2e-06,-1e-06,0,1e-06,-4e-06,-1e-06,1.2e-05,-1e-06,-1e-06,-1e-06,1e-06,2e-06,-5e-06,-1e-06,-8e-06,0,3e-06,6e-06,2e-06,-2e-06,-3e-06,-1e-06,-3e-06,-1e-06,-1e-06,-5e-06,-3e-06,1.2e-05,-3e-06,-1e-06,-1e-06,-2e-06
1e-06,-2.2e-05,-6e-06,0,-1e-06,1e-06,-3e-06,1e-06,8e-06,4e-06,1e-06,0,0,4e-06,-1e-06,-1e-06,1e-06,-5e-06,0,-1.5e-05,0,1e-06,-1e-06,1e-06,-5e-06,1e-06,-2e-06,-2.2e-05,6e-06,3e-06,0,0,-2e-06,-4e-06,-1e-06,6e-06,-1e-06,1e-05,5e-06,1e-06,1e-06,0,-1e-06,1e-06,0,1e-06,4e-06,-1e-06,3e-06,-3e-06,-8e-06,0,-5e-06,-6e-06,0,1e-06,9e-06,8e-06,0,0,-1e-06,1e-06,0,-1e-06,3e-06,3e-06,3e-06,3e-06,6e-06,-1e-06,-3e-06,0,0,3e-06,-8e-06,-7e-06,1e-06,-1e-06,3e-06,-7e-06,0,-1e-06,0,4e-06,1e-06,0,1e-06,-1e-06,9e-06,1e-06,0,0,0,2e-06,0,-1e-05,1e-06,-3e-06,0,2e-06,1e-06,2.2e-05,1.9e-05,4e-06,1e-06,2e-06,-7e-06,-3e-06,0,-1e-05,0,-1e-06,0,-1e-06,2e-06,-2e-06,-1.7e-05,0,-1e-06,0,1e-06
0,2e-05,-6e-06,3e-06,0,-2e-06,2e-06,0,-2e-06,1e-06,-2e-06,-1e-06,1e-06,-2e-06,0,2e-06,-5e-06,-2e-06,-1e-06,1.4e-05,1e-06,-1e-06,-1e-06,-1e-06,3e-06,-4e-06,0,2.1e-05,-9e-06,-2e-06,-1e-06,2e-06,-1e-06,3e-06,1e-06,-1e-05,2e-06,7e-06,7e-06,0,0,-3e-06,2e-06,3e-06,0,0,-4e-06,0,-4e-06,6e-06,1e-06,1e-06,4e-06,-1e-06,2e-06,0,-1.8e-05,-1.5e-05,-3e-06,1e-06,3e-06,3e-06,-1e-06,3e-06,-3e-06,-1e-06,-4e-06,-3e-06,-6e-06,1e-06,5e-06,6e-06,0,-3e-06,4e-06,8e-06,3e-06,0,2e-06,6e-06,3e-06,3e-06,-1e-06,2e-06,0,2e-06,1e-06,-1e-06,-1e-05,1e-06,1e-06,2e-06,0,2e-06,0,8e-06,-1e-06,-1e-06,-1e-06,-3e-06,-7e-06,-1.8e-05,-1.1e-05,0,-2e-06,-1e-06,4e-06,-4e-06,-1e-06,4e-06,-2e-06,2e-06,1e-06,3e-06,4e-06,1e-06,3e-06,-1e-06,0,-2e-06,0
