0.157542,0.16656,0.14784,0.135939,0.125418,0.116406,0.110062,0.119474,0.134736,0.11861,0.096624,0.090969,0.104483,0.128231,0.138105,0.136212,0.130259,0.122918,0.112487,0.113259,0.118488,0.114232,0.10574,0.108552,0.123278,0.13174,0.128792,0.125112
0.201729,0.213795,0.187876,0.173249,0.166315,0.159308,0.148843,0.153322,0.168311,0.150608,0.125652,0.120493,0.137322,0.164886,0.180903,0.180949,0.171154,0.157699,0.140749,0.141969,0.150439,0.14594,0.135881,0.140177,0.15785,0.169239,0.166424,0.160815
0.290171,0.3035,0.265192,0.247199,0.250602,0.25054,0.229787,0.217451,0.225781,0.208328,0.182586,0.180995,0.204673,0.237183,0.26631,0.27323,0.257905,0.231636,0.201122,0.201129,0.213643,0.20939,0.195702,0.200519,0.223375,0.241053,0.236799,0.228943
0.413243,0.409546,0.361016,0.343896,0.361586,0.373949,0.338153,0.296146,0.280746,0.266057,0.252979,0.263123,0.292992,0.321171,0.366056,0.383964,0.362233,0.327506,0.288899,0.283009,0.293082,0.291149,0.271392,0.267902,0.291482,0.313402,0.305778,0.305807
0.612771,0.563032,0.502472,0.487881,0.515506,0.536848,0.47884,0.399962,0.346352,0.332411,0.344468,0.378124,0.420433,0.435743,0.491561,0.519398,0.488409,0.454045,0.420839,0.404496,0.40137,0.402231,0.372159,0.350826,0.369156,0.389187,0.381966,0.405771
0.951204,0.811577,0.716225,0.71272,0.754437,0.772153,0.675339,0.555939,0.463968,0.439185,0.467976,0.529514,0.605042,0.618378,0.667202,0.699822,0.656682,0.614823,0.597995,0.57056,0.55042,0.567178,0.525116,0.476168,0.48382,0.489267,0.493285,0.548595
1.497524,1.222388,1.071197,1.11383,1.157979,1.136213,0.989052,0.821059,0.679089,0.631334,0.651531,0.720873,0.840915,0.870931,0.909951,0.956919,0.907194,0.861519,0.865002,0.801277,0.758331,0.815039,0.76326,0.672672,0.661817,0.646539,0.687182,0.758597
2.259989,1.818109,1.61756,1.733073,1.749388,1.686028,1.481196,1.223445,0.999865,0.935554,0.927945,0.965349,1.125138,1.188424,1.236829,1.314198,1.254567,1.218956,1.265232,1.136382,1.055592,1.167149,1.07646,0.919572,0.904561,0.875474,0.978879,1.055267
3.057053,2.45465,2.250944,2.438616,2.398324,2.320227,2.045768,1.653738,1.344742,1.29103,1.248504,1.220867,1.415246,1.518254,1.554691,1.655288,1.616114,1.593303,1.686363,1.522515,1.398974,1.536133,1.381581,1.153084,1.162529,1.133213,1.30454,1.410465
3.447439,2.790059,2.661004,2.859754,2.7165,2.644693,2.353038,1.877172,1.525546,1.511637,1.45659,1.393896,1.626698,1.711383,1.662728,1.761897,1.778757,1.765293,1.882461,1.75111,1.59397,1.70075,1.50297,1.231247,1.282619,1.275181,1.475873,1.607887
3.034661,2.479809,2.483516,2.609327,2.355648,2.302491,2.083619,1.668627,1.364918,1.389569,1.349566,1.306438,1.550805,1.56613,1.417624,1.486062,1.544735,1.541193,1.665875,1.60746,1.424108,1.449949,1.275304,1.052827,1.139206,1.143682,1.298098,1.424296
1.95234,1.626024,1.722143,1.738242,1.462188,1.426276,1.330902,1.116794,0.92559,0.932753,0.921841,0.927122,1.114776,1.088716,0.939039,0.954416,1.006455,1.008967,1.091053,1.091752,0.941172,0.904933,0.805843,0.694276,0.765544,0.755303,0.831978,0.931852
0.906892,0.79168,0.880952,0.835464,0.651135,0.619863,0.590478,0.53407,0.457576,0.441841,0.451822,0.488754,0.579977,0.553066,0.477071,0.460992,0.479576,0.481482,0.503009,0.526979,0.464096,0.427823,0.396222,0.356214,0.375783,0.361848,0.401336,0.474204
0.321813,0.336292,0.392713,0.346938,0.258526,0.235616,0.215094,0.197439,0.188994,0.175724,0.185257,0.222458,0.250926,0.237071,0.221005,0.198179,0.187596,0.204173,0.207277,0.215917,0.207575,0.201945,0.200613,0.175857,0.169238,0.168324,0.189072,0.233972
0.160573,0.176827,0.184665,0.160252,0.130572,0.121721,0.108344,0.097233,0.104753,0.104873,0.105393,0.122525,0.127264,0.123408,0.12771,0.114369,0.109059,0.132857,0.133368,0.120342,0.117411,0.127929,0.133353,0.118305,0.113802,0.116897,0.124277,0.137584
0.169441,0.158531,0.149717,0.136703,0.123295,0.117232,0.111427,0.107016,0.12017,0.123478,0.105796,0.10819,0.10461,0.109856,0.116832,0.102607,0.103824,0.125205,0.132325,0.110184,0.092337,0.106883,0.121835,0.116977,0.11177,0.111299,0.108135,0.110061
0.211309,0.190901,0.175976,0.166294,0.155573,0.146316,0.1377,0.130018,0.149198,0.156826,0.126147,0.11969,0.114317,0.126131,0.138435,0.118215,0.113123,0.137114,0.156851,0.130795,0.10276,0.124835,0.143935,0.132449,0.125014,0.126633,0.119341,0.120605
0.232244,0.211818,0.195712,0.195272,0.186855,0.170687,0.152273,0.136218,0.160178,0.171998,0.135045,0.123963,0.119536,0.133091,0.146623,0.126143,0.12067,0.151262,0.181918,0.156057,0.122513,0.139775,0.157983,0.146101,0.132972,0.131764,0.130536,0.137567
0.236511,0.225296,0.21111,0.208235,0.203348,0.178495,0.14219,0.123952,0.15068,0.156862,0.121798,0.114896,0.121891,0.1371,0.141538,0.124301,0.123476,0.152199,0.182381,0.169979,0.148662,0.148832,0.159161,0.162421,0.142386,0.126221,0.136966,0.153408
0.243532,0.2402,0.224117,0.211938,0.214476,0.17409,0.123129,0.113414,0.135008,0.125946,0.099622,0.107995,0.131811,0.147515,0.138993,0.121768,0.119846,0.134263,0.158881,0.177336,0.182436,0.161485,0.160861,0.179775,0.152408,0.120232,0.142018,0.167354
0.243716,0.243765,0.226617,0.219042,0.229978,0.179001,0.124604,0.116304,0.126053,0.111844,0.097749,0.118472,0.140517,0.148654,0.137882,0.12599,0.119062,0.117912,0.144904,0.18766,0.208501,0.17481,0.163762,0.186061,0.158167,0.118738,0.137493,0.164495
0.225488,0.227533,0.207762,0.203195,0.219287,0.183811,0.145976,0.125972,0.115179,0.111045,0.109397,0.126156,0.130946,0.124202,0.121038,0.124534,0.116612,0.111349,0.137628,0.177644,0.198305,0.169468,0.155323,0.165772,0.146574,0.12103,0.125504,0.138553
0.19595,0.211325,0.19033,0.171194,0.177601,0.173987,0.172535,0.14534,0.10598,0.100902,0.107139,0.120408,0.112732,0.093015,0.096268,0.109053,0.106745,0.1049,0.122687,0.146327,0.16007,0.149457,0.139441,0.128822,0.117488,0.116125,0.113883,0.112603
0.180606,0.206001,0.186386,0.146879,0.148316,0.17448,0.193643,0.165678,0.109605,0.09248,0.098107,0.119036,0.108997,0.077117,0.079968,0.094938,0.097388,0.096864,0.100253,0.116524,0.134133,0.132301,0.125868,0.110612,0.106227,0.110459,0.1034,0.094025
0.184848,0.220476,0.196414,0.147618,0.156996,0.187491,0.196467,0.173065,0.119505,0.087635,0.09191,0.121282,0.111133,0.07478,0.073913,0.086454,0.087531,0.086649,0.083057,0.100702,0.125969,0.124873,0.116366,0.107598,0.107049,0.105684,0.095207,0.076816
0.203739,0.231092,0.187976,0.144433,0.157286,0.180468,0.177746,0.162789,0.125748,0.086325,0.085971,0.112827,0.104792,0.072986,0.070615,0.075062,0.071573,0.079364,0.077857,0.082861,0.112314,0.120771,0.103245,0.097006,0.103387,0.101252,0.090308,0.067297
0.211433,0.217781,0.158873,0.127586,0.131368,0.147875,0.149447,0.137606,0.112322,0.076515,0.076364,0.098033,0.090184,0.065533,0.065184,0.06239,0.055391,0.069214,0.070362,0.060047,0.084479,0.107339,0.095687,0.088208,0.094254,0.09306,0.085285,0.065681
0.18551,0.172439,0.116697,0.093823,0.095837,0.113992,0.120974,0.10747,0.08201,0.054786,0.062173,0.082167,0.07252,0.059518,0.062626,0.049011,0.036603,0.050678,0.054566,0.045216,0.06279,0.083153,0.079746,0.076964,0.085703,0.082598,0.072586,0.060696
0.140864,0.126327,0.097004,0.071612,0.06878,0.086025,0.092899,0.078142,0.059205,0.044625,0.048985,0.058482,0.054841,0.0621,0.067416,0.045096,0.026558,0.035126,0.04049,0.038591,0.049733,0.058377,0.055928,0.057092,0.067759,0.065309,0.05631,0.05155
0.114463,0.102608,0.090343,0.061685,0.051792,0.065703,0.07054,0.057017,0.0512,0.049992,0.043983,0.040113,0.047949,0.073349,0.077358,0.051365,0.031665,0.032928,0.036537,0.037212,0.042977,0.043225,0.036994,0.042126,0.05665,0.058501,0.053548,0.049528
0.101787,0.095605,0.075668,0.050223,0.047938,0.057216,0.054177,0.046751,0.050948,0.057836,0.051878,0.040156,0.047246,0.077688,0.08355,0.05995,0.040072,0.033605,0.036238,0.03796,0.041871,0.04543,0.037397,0.039784,0.057903,0.069898,0.067521,0.056612
0.089844,0.075545,0.050383,0.039415,0.049604,0.054931,0.045515,0.041718,0.050153,0.060244,0.058993,0.045452,0.046209,0.070347,0.081379,0.067207,0.045367,0.035625,0.038608,0.040312,0.044404,0.049276,0.04258,0.043969,0.062057,0.078932,0.07948,0.063783
0.071128,0.048885,0.030234,0.030992,0.045557,0.047713,0.039431,0.039292,0.045047,0.052523,0.054097,0.042948,0.04208,0.060313,0.068355,0.062397,0.043606,0.03602,0.038019,0.037594,0.040812,0.044014,0.040323,0.041706,0.055459,0.071798,0.076334,0.060965
0.046242,0.02955,0.021332,0.024112,0.033696,0.03677,0.035408,0.033957,0.032458,0.035413,0.037796,0.032487,0.034017,0.045847,0.047448,0.04652,0.037694,0.03481,0.031453,0.027652,0.028561,0.029697,0.030115,0.031953,0.03893,0.050403,0.057259,0.047107
0.029336,0.023573,0.019279,0.018168,0.020727,0.030946,0.038346,0.028782,0.020548,0.02057,0.022186,0.021541,0.027033,0.034798,0.037028,0.037685,0.034788,0.032914,0.024603,0.017877,0.015683,0.015717,0.021127,0.025274,0.026746,0.032202,0.037829,0.035961
0.022298,0.02322,0.021215,0.019614,0.01919,0.034046,0.046796,0.03251,0.018224,0.013808,0.015231,0.017545,0.028173,0.037371,0.039193,0.035721,0.032066,0.032896,0.025068,0.015496,0.012794,0.013648,0.019451,0.026002,0.023826,0.021863,0.027605,0.031435
0.023333,0.025381,0.025182,0.026272,0.022684,0.038774,0.052639,0.037089,0.019124,0.010951,0.013415,0.017573,0.029993,0.039847,0.038964,0.031137,0.028515,0.035695,0.030144,0.017407,0.014064,0.014712,0.019452,0.027362,0.022226,0.01389,0.023886,0.029363
0.02727,0.02916,0.029715,0.032142,0.027615,0.041135,0.049689,0.036653,0.019744,0.009553,0.011544,0.015133,0.027175,0.035344,0.033021,0.028226,0.030068,0.03963,0.032043,0.019413,0.015255,0.013272,0.016095,0.024802,0.020737,0.010648,0.02043,0.025348
0.02852,0.032128,0.031599,0.032963,0.029756,0.038747,0.039857,0.030353,0.019815,0.011238,0.010154,0.01249,0.022518,0.026743,0.0239,0.02393,0.030475,0.039156,0.02763,0.018034,0.014546,0.01088,0.011931,0.020572,0.017952,0.009894,0.017208,0.022788
0.025374,0.030495,0.02784,0.027459,0.027006,0.033014,0.033967,0.023324,0.018425,0.015531,0.012452,0.014362,0.024334,0.023777,0.019684,0.01886,0.027433,0.033774,0.019417,0.013939,0.012732,0.010566,0.011965,0.019985,0.015362,0.008517,0.013292,0.019486
