-0.000192,-0.000403,-0.001722,-0.010342,-0.010224,-0.015716,-0.013621,-0.008425,-0.005164,-0.003427,-0.002796,-0.001944,-0.00198,0.002113,-0.008319,-0.011431,-0.010276,-0.029048,-0.021654,-0.019356,-0.013394,-0.017709,-0.00528,-0.016535,-0.010544,-0.012676,-0.004548,-0.014253,-0.016889,-0.014529,-0.013291,-0.011459,-0.004523,-0.017208,-0.010874,-0.009236,-0.006995,-0.009946,-0.00938,-0.011971,-0.013291,-0.016343,-0.016014,-0.013903,-0.007884,-0.00871,-0.010973,-0.004533,-0.007257,-0.005524,-0.011554,-0.017713,-0.009497,-0.003442,-0.0013,-0.003811,-0.003829,-0.001768,-0.001762,-0.00213,-0.000803,-0.000809,-0.00097,-0.000759,-0.000929,-0.000718,-0.001074,-0.000516,-0.000278,-0.000572,-0.000786,-0.000408,-0.000492,-0.000488,-0.00043,-0.000295,-0.000177,-0.000146,-0.000356,-0.000299,-0.000316,-0.000103,-0.000522,-3e-06,-0.000464,-0.000793,-0.000532,-0.000283,-0.000561,-0.000273,-0.000484,-0.000482,-0.000492,0.000107,-0.000219,-0.000558,-0.00025,-0.000349,-0.00015,-0.000308,2.9e-05,-9.8e-05,-0.00037,-0.002448,-0.003054,-0.001517,-0.000915,-0.000558,-0.000568,-0.000604,-0.000564,-0.000353,-0.001031,-0.000733,-0.000633,-0.000519,-0.000307,-0.000191,-0.000338,-0.000657,-0.000491
-3.4e-05,0.000121,3.3e-05,0.003752,0.003901,0.006386,0.008343,0.003404,0.00301,0.00202,0.00187,0.000876,0.001317,-0.001733,-0.001506,0.010892,0.003702,0.01261,0.009207,0.002563,0.006372,0.003584,0.011148,0.002833,0.003281,0.008957,0.002286,0.006051,0.002423,0.002896,-0.003144,0.003928,-0.001463,0.001835,0.000168,-0.000449,-0.002851,0.002392,-0.002626,0.004688,0.002311,0.000804,0.004949,0.001368,-0.004478,-0.005171,-0.002376,-0.001875,0.000341,-0.000636,-0.003333,0.008125,0.003507,0.001094,-0.001133,0.001495,0.000327,6.4e-05,-0.001098,-0.000574,-0.00085,-0.000594,-0.000399,-0.000112,6.9e-05,-0.000257,-0.000284,9.1e-05,-0.000477,-0.000505,5.6e-05,-0.000425,-0.000504,-0.000306,-0.000291,0.000255,-0.000297,-0.000125,-0.000116,-0.000127,5.5e-05,3.6e-05,-0.000531,-0.000407,-0.000853,-0.00054,-0.000298,-0.000243,-0.000711,-0.000897,-0.000246,-0.000365,-0.000261,-8.3e-05,-0.000422,-8.4e-05,-3e-04,3.3e-05,5.6e-05,-0.000212,-0.000177,-1.9e-05,5.3e-05,0.001475,0.001424,0.000185,-0.000145,-0.000125,-0.000439,-0.000163,5.1e-05,7.8e-05,-0.00037,-7.7e-05,-0.000554,-0.000267,-6.8e-05,-7.4e-05,0.000113,-0.000157,-0.000147
-4.8e-05,0.000162,5.1e-05,-0.001929,-0.002713,-0.003709,-0.004379,-0.000184,-0.002475,-0.000846,-0.001068,-0.000458,-0.000559,-0.004599,-0.004886,-0.001055,0.00033,0.003142,0.003759,-0.003354,-0.003183,-0.01648,-0.003811,-0.004822,-0.00484,-0.008516,-0.004202,-0.012086,-0.007145,-0.003224,-0.002271,0.002108,0.00123,-0.007521,0.001154,-0.003919,0.001124,-0.011647,-0.009683,-0.005798,-0.004551,0.001565,-0.007747,-0.003762,0.00076,0.002735,0.001311,0.000196,-0.00016,-0.00033,0.002639,-0.00252,-0.002769,-0.001703,0.001914,-0.001223,-0.001684,-0.000344,0.000203,0.000923,0.000125,-0.001063,-0.000817,-0.000406,-0.00068,-0.000352,0.000153,0.000155,0.000299,0.000322,-1e-05,0.000389,0.000409,0.000351,0.000329,-5.7e-05,8.2e-05,0.00027,0.000304,-1.8e-05,0.00017,5.9e-05,0.000661,0.000336,0.000437,0.000633,0.000508,0.000173,0.00079,0.000691,0.000283,0.000348,0.000288,0.000225,0.000402,0.000281,0.000466,4.7e-05,3e-06,0.000425,0.000177,8.9e-05,7.9e-05,-0.000452,-0.000392,-2.7e-05,0.000541,0.000406,0.00026,0.000371,5.2e-05,-0.000168,0.000235,0.000175,0.000969,0.000541,0.000211,0.000145,9e-06,0.000215,0.000249
0.000192,-0.00019,0.000123,0.00016,-0.000504,0.000625,0.000175,-0.000365,0.001218,-0.000209,0.000194,8e-06,0.000548,0.002422,0.000852,-0.001996,-0.001991,-0.001203,0.0069,0.002883,0.006259,0.002484,0.006056,-0.005221,-0.000518,0.003257,0.000397,0.00128,-0.004295,-0.001022,0.00256,-0.001758,-0.000211,-0.001906,0.00299,-0.000472,0.000595,0.002173,0.000658,-0.002486,0.004803,0.002333,9e-05,0.001009,0.002372,0.003073,0.001701,0.001386,-0.001199,0.000146,-0.00018,0.000775,0.001655,0.000828,-0.001587,-0.000971,0.000501,0.000493,-0.000221,-0.000753,-0.000649,0.000305,8.7e-05,0.000119,0.00052,-0.000678,-0.000716,-0.000756,-0.000414,-0.000516,8e-06,-0.000141,-0.000231,-9.8e-05,-0.000125,0.000164,-0.001237,-0.000739,-0.00027,-0.000324,0.000151,0.000206,-1e-06,0.000346,-0.000155,-0.000624,-0.000589,-0.000197,-2e-04,-0.000245,-0.000197,-0.000188,-0.000244,4.1e-05,-0.000207,-0.000294,-9.9e-05,5.7e-05,0.000204,-0.000121,-0.000174,-6e-05,1.4e-05,-0.000283,-0.000165,-0.000144,-0.000657,-0.000127,7.3e-05,-0.000316,-8.7e-05,6.5e-05,-0.000152,0.00043,-0.000967,-0.000514,-0.00017,-1.2e-05,-0.000201,-3.3e-05,-0.000145
-0.000102,9.4e-05,7.7e-05,-0.00048,0.000892,0.000512,0.00035,0.000161,-0.001252,-2.9e-05,-0.000503,-0.000337,-0.000189,-0.001822,-0.006513,-0.002136,-0.001754,-0.000426,-0.011335,-0.002555,0.000872,-0.000558,-0.006541,-0.000879,0.002684,-0.005766,-0.001686,-0.002848,0.001013,-0.001924,-0.001265,0.003027,0.00285,0.003195,0.001565,0.000612,0.001185,-0.001533,-0.004051,-0.005831,-0.005224,0.001337,0.000919,0.000357,-0.002696,-0.002357,-0.003837,0.000332,0.000888,-0.000527,0.000581,-0.001245,2.8e-05,0.000496,8.2e-05,0.000859,-0.000145,-0.000381,-0.001294,0.000548,0.000888,0.000671,-6.8e-05,0.000216,-4.2e-05,6.9e-05,0.000405,0.000309,-0.000479,-0.000175,1.8e-05,0.000102,-0.000254,7.8e-05,-0.000173,-1.7e-05,0,-0.000229,2.5e-05,0.000211,3.6e-05,-5e-06,-4.9e-05,-0.000163,-9e-05,0.000211,0.000304,0.000155,0.000121,-0.00015,-2.4e-05,9e-05,0.000167,-5.4e-05,-0.000181,0.000226,2e-06,-0.000263,-6e-05,-7.9e-05,-0.000146,1e-05,2.1e-05,0.000454,-9.9e-05,-7.8e-05,0.000352,0.000341,-0.00038,0.000245,0.000185,5.2e-05,-0.000101,-0.000775,0.00044,0.000399,9.8e-05,8.8e-05,1.3e-05,-0.000109,-1e-04
3.3e-05,-1.6e-05,6.1e-05,0.00035,-3.9e-05,0.00068,0.000909,-0.000955,-0.000642,-0.000558,-0.000236,0.000509,0.000167,0.000621,-0.004346,0.00145,-0.000861,-0.000748,-0.00085,-0.002789,0.000189,-0.001663,0.00503,0.004548,-0.00015,-0.006007,-0.002763,0.005097,-0.000124,-0.000108,-0.000166,-0.000755,0.002415,0.000407,0.001421,0.001397,0.000425,-0.001106,0.003259,0.003534,-0.000774,-0.003581,0.000115,5.1e-05,-0.001047,-0.002154,0.000614,0.002297,-0.000292,0.001174,-0.000294,0.000289,-0.000877,-0.000202,-0.000281,-0.001608,-0.000485,0.000935,0.001164,-0.000372,-0.000491,3.4e-05,0.000355,-8.9e-05,-0.000226,0.000443,-0.000166,-0.000595,-7.2e-05,0.000108,-0.000227,-7.1e-05,0.000286,4.5e-05,2.5e-05,-3.7e-05,-7.7e-05,0.000163,-0.000188,-6e-05,0.000101,-6.6e-05,-6.2e-05,-2.9e-05,0.000235,0.000228,-8e-06,-0.000246,0.000156,0.00041,8.4e-05,-0.000313,7e-06,-8.4e-05,2.2e-05,-3.9e-05,-2e-06,0.000194,0.000128,2e-06,8.9e-05,0.000139,0.000136,-0.000107,0.000164,0.00034,-9.8e-05,-0.000402,0.00037,-0.000128,-0.000183,-6.2e-05,7.5e-05,0.000458,1.3e-05,-0.000254,-0.000265,-7.4e-05,1.6e-05,7.7e-05,0.000143
-0.00018,-0.000116,-0.000175,-6.3e-05,-0.000248,-0.000668,-0.000328,0.000845,0.001236,8.8e-05,0.000402,-0.000492,-5.9e-05,-0.000767,0.002934,-9.9e-05,-0.002242,-0.001539,-0.000897,-0.002389,0.003416,0.002386,-0.009784,-0.003432,0.000983,0.004828,-0.003905,0.00127,0.003253,0.001674,0.002026,0.001228,-0.003445,0.000571,0.001963,-0.002861,-0.000874,0.001936,0.001334,-0.000692,-0.00115,-0.002005,-0.003833,0.00384,0.001202,0.000529,-0.001095,-0.001436,-0.001082,-0.001017,0.000103,0.000766,0.000301,-0.000715,5.7e-05,-0.000127,0.000984,-0.000481,-0.000221,1.7e-05,-4.3e-05,-0.000207,-6.7e-05,-7.7e-05,-0.000241,-0.000246,0.000227,0.000557,0.000124,1.9e-05,0.000259,-5.5e-05,-0.00016,-0.000277,-0.000199,0.000139,0.000172,4.2e-05,1.1e-05,4.1e-05,2.2e-05,-1e-04,0.000244,9.3e-05,7e-05,-0.000313,-0.000164,4.3e-05,-0.000209,-0.000242,-0.000261,0.000158,5.3e-05,0.000117,5.8e-05,-6.6e-05,-0.000164,-4.2e-05,-0.00021,-1.5e-05,-6.6e-05,-0.000114,-4.5e-05,-5.6e-05,-0.000192,-0.000401,-0.000144,0.000177,-0.00014,-1.1e-05,0.000191,8.6e-05,-9e-05,0.000137,0.000121,6.5e-05,-5e-06,-1.8e-05,-6.9e-05,-0.000198,-0.00016
4e-06,3.7e-05,-6.3e-05,9.9e-05,0.000371,0.00101,-1.3e-05,-0.00083,-0.000446,-0.000416,-0.000382,0.000403,8.6e-05,0.000618,0.000691,-0.002046,-0.003049,0.000139,-0.00047,-0.000279,0.000643,0.001811,0.000923,0.004199,-0.004964,0.000201,-0.004606,-0.000659,0.002606,0.00116,-0.003269,0.000554,-0.00178,0.000158,-0.003199,-0.002346,0.001909,-0.001865,0.003593,0.00536,-0.00035,0.002589,0.003395,-0.003524,-0.000187,0.00023,0.001171,-0.000876,-0.000469,0.000609,-2.5e-05,-0.001108,-0.000188,0.000274,-0.000132,0.000302,-5.9e-05,0.000411,0.00019,0.000501,0.00018,-0.000162,1.8e-05,-0.000369,-2.5e-05,0.000152,-0.000225,-0.000108,5.4e-05,5.2e-05,-5.3e-05,-7.3e-05,-8.4e-05,0.000132,0.000104,-0.000244,-0.000302,-4.3e-05,9.4e-05,-4.5e-05,2e-06,-9.4e-05,2.1e-05,-0.000146,-0.00013,2.1e-05,0.000224,7.2e-05,0.00013,-4.3e-05,0.000186,-0.000136,-0.00013,-8e-06,1.3e-05,0.000144,1e-04,-0.000148,1.9e-05,-8.8e-05,-0.000103,-2.7e-05,5e-05,7.1e-05,-6e-06,0.000217,-3.4e-05,-6.1e-05,5.1e-05,1.7e-05,-0.000185,-3e-05,2.6e-05,-0.000289,-0.00018,-7.9e-05,-1.5e-05,-8.9e-05,-2.9e-05,5.7e-05,-3.7e-05
-1.8e-05,2.5e-05,-0.000109,-0.000231,-0.000186,-0.001189,-0.000578,1.9e-05,0.00028,0.000299,0.000355,-7.1e-05,-7.2e-05,-0.000508,-0.00107,-0.003186,-0.001033,-0.000914,-0.000352,-0.002257,-0.00515,-0.00106,0.000803,0.000872,0.002515,-0.000655,0.005139,0.00105,0.001198,0.002873,0.000976,0.000861,0.000465,-0.000442,-0.000951,0.000863,0.000972,-0.001018,-0.003695,-0.000149,0.001992,9e-05,-0.001051,-0.001136,-0.00011,-0.000939,0.000237,5.7e-05,0.0014,-0.00029,-0.000282,6.1e-05,0.000434,-0.000394,-0.000826,-0.000893,-0.000239,-0.000954,-0.000291,-0.000191,-0.00035,1.3e-05,-0.000173,3.9e-05,0.000317,-0.000104,-5e-06,-9.3e-05,-5e-05,5.2e-05,6.4e-05,5e-06,-7.9e-05,-0.000124,-0.000115,0.000138,0.000159,7e-06,-0.00024,-0.000156,-8.8e-05,-7.7e-05,-0.000165,-0.00013,9.9e-05,1.1e-05,-0.000235,-0.000251,-7.9e-05,-6.6e-05,-2.7e-05,6.7e-05,-7e-06,-0.000184,-4.5e-05,-0.000176,-0.00014,7e-06,-1.7e-05,-6.4e-05,4e-06,-4e-06,-1.9e-05,-3.6e-05,0.000144,-0.000237,0.000151,-0.000208,0.000138,-3e-06,0.000107,1.9e-05,-8.1e-05,0.000142,4e-04,0.000113,2e-06,4e-06,-2.6e-05,-8.3e-05,-4.6e-05
-8.3e-05,-7.8e-05,4.5e-05,-0.000136,-3.1e-05,0.000727,0.000215,0.001383,0.000104,0.000308,0.000423,0.000104,0.000128,0.000347,0.000755,-0.003102,0.001599,-0.002302,0.000392,0.003292,0.000562,0.002153,0.003191,0.002106,-0.002649,-0.001174,-0.005454,-0.001057,-0.004016,-0.001418,-0.001198,-0.001155,-0.003772,0.001078,-0.00077,-0.000696,0.003145,0.000682,0.000998,-0.000775,0.001134,-0.000103,0.001274,0.00013,0.000604,0.000819,0.000873,-0.000338,-0.001102,-0.000347,-0.000199,0.000505,2.1e-05,0.000486,-1e-04,0.000937,0.000331,-0.000328,-5.7e-05,0.000293,0.000226,0.00014,2.6e-05,-2.4e-05,-2e-06,0.000291,2.6e-05,-7.7e-05,-0.000125,-9.2e-05,1.9e-05,2.3e-05,8e-06,-4.9e-05,-1.4e-05,0.000154,-6e-06,-0.000124,-0.000107,-8e-06,-8.3e-05,-2.7e-05,9.2e-05,0.00012,0.000144,-7.2e-05,3.6e-05,0.000176,8e-06,1e-06,-0.000103,-1.6e-05,2e-05,4.5e-05,2.9e-05,2.9e-05,7.5e-05,-0.000122,-7.4e-05,-5e-05,-3.1e-05,-8.3e-05,-6.7e-05,-1.9e-05,-9e-05,0.000215,-4.9e-05,0.000242,-2.2e-05,-5.9e-05,-0.00018,-3e-06,0.000103,-0.000163,-0.000394,-5.8e-05,-7.6e-05,0,-2.2e-05,2.8e-05,3.3e-05
3.2e-05,-3e-05,-4.9e-05,-4.5e-05,-4.8e-05,6.5e-05,0.00019,-0.001231,-0.000436,-0.000256,-0.000522,-0.000209,-0.000295,-0.000159,-0.001114,0.002274,-0.000292,0.000155,-0.000784,-0.001915,0.001993,0.000186,0.001937,-0.000388,0.001949,-0.001815,0.004471,-0.000264,0.000372,-0.000353,0.001083,-0.000804,0.00147,0.000401,0.001778,0.002588,-0.000904,0.000135,0.000257,-0.002219,0.000175,-9.5e-05,-0.002194,0.000704,-0.000825,-0.000174,0.000114,-0.000499,0.000851,-0.000331,0.000653,-0.000301,-6.9e-05,-0.001072,0.000353,-4.9e-05,-0.000428,0.000649,0.000223,0.000192,5.2e-05,-0.00025,2.1e-05,0.000147,-6.5e-05,-0.000121,0.000185,-9.1e-05,0.000241,-5e-06,-0.000129,-2.2e-05,7.7e-05,6.8e-05,4.8e-05,-7e-05,-4.4e-05,0.000109,0.000204,2.8e-05,-2e-06,3e-06,-3.4e-05,-8e-05,-0.000123,-7.2e-05,4.6e-05,-0.000119,-0.000153,-1.2e-05,0.00013,-9.6e-05,-2.8e-05,-6.9e-05,-2.4e-05,8.4e-05,-3.8e-05,7.7e-05,4.9e-05,-5e-06,-6.2e-05,2e-06,1.4e-05,-3.7e-05,2.8e-05,-1.8e-05,2.4e-05,-0.000147,0.000186,6.3e-05,2.8e-05,1.9e-05,-5.5e-05,4.3e-05,0.000197,-2.8e-05,6.6e-05,-3.1e-05,-4e-06,2.7e-05,9e-06
-6.6e-05,1.2e-05,1e-06,-7.7e-05,0.000111,-0.000386,-0.000103,0.000611,0.000526,0.000297,0.000662,-7.1e-05,0.000254,5.8e-05,0.000667,0.00183,-0.000169,0.001578,-0.00054,0.001424,-0.002655,0.000532,-0.001621,9.2e-05,0.001504,0.000919,-0.0011,-0.001656,0.000357,0.001356,6e-06,0.000193,-0.001452,8e-06,4e-06,-0.00143,-0.001292,0.000448,-0.000441,0.000522,0.00076,0.000859,0.001501,-0.000495,-0.000681,-0.000919,3.4e-05,0.000132,-0.000612,-5e-06,-0.001109,-0.000346,-4.8e-05,0.001415,0.000114,-0.00029,-9.9e-05,4.2e-05,0.00016,-0.000437,-7.3e-05,8.4e-05,2.2e-05,4.4e-05,-1e-04,-1.9e-05,-6.2e-05,-3.9e-05,-0.000283,-1e-06,6.6e-05,4.9e-05,-1.5e-05,3.5e-05,-7.2e-05,7e-05,-3.8e-05,-3.7e-05,-0.000176,-7e-05,-7e-05,-5.4e-05,-1e-05,-6.3e-05,3.7e-05,7.6e-05,-4.1e-05,6.4e-05,-2.1e-05,-3.6e-05,-0.000118,9.5e-05,-2.9e-05,-1e-05,-4.4e-05,-2.7e-05,-4e-05,-3.7e-05,1.1e-05,1.9e-05,1.8e-05,-5.4e-05,7e-06,-6.7e-05,5e-06,4.9e-05,-2.2e-05,8e-06,-0.000181,-0.000102,4e-05,1.1e-05,3.4e-05,2.1e-05,2.5e-05,-2.6e-05,1.6e-05,-5e-06,2.4e-05,-1.9e-05,6e-06
3.5e-05,1.3e-05,-1.2e-05,0.000121,5.4e-05,0.000354,7.7e-05,-0.000486,-0.000541,-0.000183,-0.000296,0.00018,-0.000187,-6.1e-05,0.000377,-0.00104,-0.000471,-0.000631,0.000831,-0.00169,-4.4e-05,-0.001287,0.000156,-0.000857,0.000333,0.001857,0.002875,-0.000844,-0.000682,-0.000195,-0.000472,0.00024,0.000973,0.000164,0.000506,-8.1e-05,-0.000245,0.00036,0.001201,0.000254,-0.002046,-0.000974,-0.000551,0.000252,-0.000124,0.000328,-3e-04,0.000227,0.000174,-0.000138,0.000839,0.000301,-0.000116,-0.00102,-0.00023,4.6e-05,-0.000115,0.000119,-6.6e-05,1.4e-05,7.5e-05,0.000107,-5.2e-05,0.000113,9.5e-05,-0.000163,-3e-05,0.000131,0.000213,-2e-06,3.8e-05,-1.3e-05,3.2e-05,-7e-05,5.4e-05,-4.4e-05,-1.7e-05,2.7e-05,6e-05,-2.1e-05,2.2e-05,-5e-06,-1.1e-05,-5e-05,4.3e-05,-1.2e-05,-4.7e-05,3.4e-05,6.9e-05,-2.6e-05,9e-06,7.9e-05,2.2e-05,8.1e-05,6.7e-05,-5.5e-05,1.7e-05,-2.1e-05,-3.4e-05,-3.7e-05,1.1e-05,-1.5e-05,-2.8e-05,-2.9e-05,4e-06,-3.2e-05,1.6e-05,3.4e-05,0.000108,3.2e-05,-6.2e-05,1.7e-05,-6.3e-05,-8.4e-05,-1.5e-05,1.1e-05,-3.9e-05,-2.2e-05,-7e-06,4e-05,2e-06
-2.4e-05,0,2.1e-05,5.9e-05,0.000107,-0.000309,2.5e-05,4e-04,0.000321,2e-05,7.9e-05,-0.000212,3.3e-05,2.6e-05,-0.000278,-0.000124,-0.000412,0.000477,-0.000482,0.000467,-0.00066,0.000818,-0.001924,-0.00031,0.000568,-0.000125,-0.003523,-0.002554,-0.000265,0.000205,0.000173,-0.000133,-0.000159,-0.00117,0.000459,-0.00031,0.000223,0.000663,-0.001273,-0.000539,0.000237,0.000416,-8.4e-05,-0.001404,0.000361,0.000443,0.000322,0.000328,-0.000152,0.000155,-0.00051,5.8e-05,7.1e-05,0.000814,-0.000284,0.000433,-0.000186,-0.000269,0.000204,5e-05,0.000169,-0.000186,-7e-05,-0.000121,9.2e-05,9.9e-05,-8.6e-05,2.1e-05,-5.9e-05,1e-05,-5.3e-05,2e-06,-4.3e-05,4.6e-05,2.2e-05,-2e-06,-3e-06,-5.2e-05,0.000115,9.2e-05,1e-05,-3.9e-05,-4.4e-05,2.7e-05,-6.4e-05,-2.5e-05,7.2e-05,-6.2e-05,-3.3e-05,1.8e-05,6e-06,-0.000126,3e-06,-7.3e-05,-2.6e-05,1.1e-05,3.2e-05,4.7e-05,-2.6e-05,1.8e-05,8e-06,1.6e-05,1.5e-05,1.2e-05,7e-06,-2.8e-05,-5.8e-05,1e-05,-3.8e-05,2.8e-05,-1.2e-05,-2.6e-05,5e-05,7.7e-05,-9.3e-05,-5.2e-05,1.5e-05,8.5e-05,-9e-06,2.7e-05,1e-05
-7e-06,4e-06,-1.1e-05,-4.3e-05,-6.9e-05,0.000157,-5.2e-05,-0.000248,-6.8e-05,-9.2e-05,-0.000113,0.000111,9.8e-05,-2.1e-05,-0.000155,0.000848,0.000818,-0.000933,0.000193,6.6e-05,0.000189,-0.000538,-0.000589,0.00072,0.000991,-0.000622,-0.000678,0.000354,-0.000345,-0.000614,-0.000902,-0.000595,-0.000117,-0.000141,0.00031,-0.000255,-0.000376,0.000419,0.00019,0.000132,-0.000248,-2e-06,-0.000157,0.002004,1.6e-05,-0.00055,-0.000251,-4.3e-05,0.000323,4.8e-05,0.000555,2.2e-05,-1.2e-05,-0.000731,0.000195,-0.000126,-7.1e-05,0.000226,-0.000129,7e-06,-2.1e-05,9.1e-05,0.000106,-1.4e-05,3.7e-05,3.4e-05,6.1e-05,9e-06,3.9e-05,-3.5e-05,2.6e-05,4e-05,2.6e-05,-5e-06,-1.7e-05,3.1e-05,4.6e-05,3.1e-05,-8.6e-05,4.5e-05,-3.4e-05,3.1e-05,-3.7e-05,-1e-05,-3e-06,4.8e-05,-1.3e-05,4e-06,3.9e-05,2.4e-05,2.1e-05,3.8e-05,2.8e-05,0,9e-06,-5e-06,-2.8e-05,-4.2e-05,2.1e-05,-1.2e-05,-2.1e-05,-1.3e-05,-9e-06,2e-06,-1.3e-05,8.8e-05,9.9e-05,-1.3e-05,-4.6e-05,-1e-05,7.1e-05,-1.6e-05,-1.7e-05,-8.3e-05,6e-05,2.4e-05,-4.7e-05,-4.8e-05,3e-06,2e-06,-6e-06
-7e-06,-3e-06,-1.2e-05,1.7e-05,3.8e-05,-4.8e-05,5.8e-05,0.000364,-0.000121,0.000117,7.8e-05,6.8e-05,-2.1e-05,1.7e-05,0.000138,-0.000135,0.000424,4.6e-05,0.000256,-0.000413,0.000638,-0.000334,0.000858,-0.000713,-0.000571,-0.000253,0.000751,-0.000336,0.000262,-8.8e-05,2e-05,0.000395,-0.000278,-8.1e-05,6.7e-05,4.8e-05,0.000221,7.4e-05,0.000252,0.000524,4.5e-05,-9.9e-05,0.000461,-0.00039,-0.000114,0.000514,3e-05,8.6e-05,-0.000173,0.000175,1.1e-05,-0.000127,6.5e-05,0.000396,0.000129,0.000111,2.4e-05,-0.000109,-5e-06,-6.8e-05,-3.1e-05,4.9e-05,-1e-05,-3.6e-05,-2.8e-05,-8.6e-05,5e-06,-1.8e-05,3e-06,3e-05,-1.4e-05,-4e-05,-2.6e-05,1.3e-05,8e-06,-5.4e-05,-4.3e-05,1.4e-05,3e-05,-2.2e-05,1.4e-05,1.7e-05,2.4e-05,3e-06,-9e-06,3e-06,-2.3e-05,1.4e-05,-4e-06,1.2e-05,-2.2e-05,-2.2e-05,-8e-06,4e-06,-2.2e-05,-1e-05,5e-06,3.3e-05,-1.1e-05,5e-06,9e-06,6e-06,0,8e-06,2.4e-05,-5.3e-05,-5.8e-05,2.7e-05,4.4e-05,-3e-06,-5.2e-05,-3e-06,2e-05,6.2e-05,-3.3e-05,1.1e-05,-1.5e-05,-2e-06,7e-06,-1.5e-05,-7e-06
2e-06,-1.3e-05,2e-06,-3.1e-05,1.4e-05,-4.7e-05,-4.1e-05,-0.000362,0.000126,-1.5e-05,-4.3e-05,-3.9e-05,2.9e-05,3e-06,-4.4e-05,-0.000476,-0.000847,-8.4e-05,-0.00021,0.000312,-0.000534,-2.5e-05,0.000274,-0.000259,-8.8e-05,-8.7e-05,0.000703,0.000171,0.000468,3.3e-05,-0.00018,0.000116,-0.000534,-0.000304,-0.000364,-0.000253,-0.000829,0.000452,0.000121,-0.00054,0.000226,0.000344,-0.00016,7.7e-05,-6.8e-05,-0.000281,0.00018,0.000134,2.9e-05,-4.2e-05,-9e-06,8e-06,4.8e-05,-7e-05,2.5e-05,-4e-06,-4.6e-05,-0.000112,-1e-05,-2.7e-05,1.7e-05,-5.2e-05,-1.1e-05,2e-05,-3.6e-05,-3.4e-05,-2.7e-05,-2.7e-05,-5e-05,-1.5e-05,-3.8e-05,-2.5e-05,-1.4e-05,-2.5e-05,1.6e-05,2e-05,2.8e-05,5e-06,1.6e-05,-2.3e-05,-6e-06,-8e-06,4e-06,-1.2e-05,1.1e-05,-2.9e-05,2.4e-05,-2.6e-05,-3e-06,-1.4e-05,1e-05,-1.8e-05,-6e-06,-6e-06,2e-06,1e-05,2e-06,-2.8e-05,4e-06,-4e-06,9e-06,-3e-06,7e-06,-1.5e-05,-9e-06,2.4e-05,2.4e-05,-3e-05,-7.6e-05,-1.1e-05,3.2e-05,4e-06,2e-06,1e-06,4e-06,-1e-06,4.7e-05,1.4e-05,0,-3e-06,-3e-06
-2e-06,1e-05,2e-06,3.1e-05,-7.3e-05,7.9e-05,1.6e-05,0.000206,9.9e-05,-3e-06,2.6e-05,5.3e-05,-2.4e-05,-2.6e-05,9.3e-05,-0.000365,0.000247,1e-04,8.1e-05,-6e-04,0.000496,-7.6e-05,0.000442,-2.2e-05,-0.000128,0.000355,-0.000554,0.000184,9.6e-05,-0.000352,-0.000183,0.000102,0.000455,-0.000303,-0.00062,0.000144,-9e-06,-0.000213,-0.000634,-0.000145,0.000148,-4.1e-05,-5.7e-05,-0.000488,2.6e-05,8.7e-05,-6.3e-05,-0.000264,-3.2e-05,8e-05,-0.000209,6e-05,4e-06,-0.000247,-0.00015,-6.8e-05,1.2e-05,3.7e-05,1.1e-05,-0.000132,2e-05,1.4e-05,-2.6e-05,7e-06,-1e-06,5.9e-05,-4e-06,2.1e-05,2.6e-05,1e-06,1.6e-05,1.3e-05,8e-06,1.9e-05,5e-06,1e-05,-2.4e-05,-2.2e-05,-5e-06,0,6e-06,6e-06,9e-06,1.3e-05,-1.6e-05,-1e-05,-1e-06,1.9e-05,4e-06,-7e-06,9e-06,4.4e-05,0,1.4e-05,2e-06,1e-06,-2e-06,-1e-06,1.5e-05,-1e-05,-2e-06,8e-06,-9e-06,2e-06,-1.1e-05,-6e-06,-3.8e-05,0,2.8e-05,6e-06,-7e-06,-2.5e-05,-5e-06,-2.7e-05,-3e-05,-1.5e-05,-4e-06,-9e-06,-3e-06,-2e-06,-2e-06
-1e-05,8e-06,-3e-06,1.6e-05,-1e-05,-6.6e-05,-2.4e-05,1.3e-05,-0.000212,-4.8e-05,-8.5e-05,-2.7e-05,1e-05,3.7e-05,4.8e-05,-0.000101,-8.2e-05,-0.00013,-1.1e-05,0.000597,-0.00047,-0.000125,-0.000612,3e-05,-7.2e-05,7.7e-05,0.001104,-9.1e-05,-0.000617,0.000348,3.5e-05,0.000123,-0.000343,-0.00033,4e-06,0.000198,-5.1e-05,-0.000194,-1.6e-05,0.000438,-0.000194,0.000294,0.000147,0.000425,0.000201,0.00024,1e-06,-0.000248,5.8e-05,5.3e-05,8.5e-05,-2.8e-05,4.2e-05,0.000247,7e-06,7.2e-05,6.2e-05,-0.000152,5.2e-05,3.1e-05,-2.7e-05,2.6e-05,8e-06,2.8e-05,1e-05,-8e-06,2.2e-05,1.3e-05,-1.1e-05,-6e-06,-9e-06,1e-06,-2e-06,-1e-05,4e-06,-3.6e-05,2e-05,2e-06,-1.9e-05,-1e-06,-2e-06,-1.1e-05,-1.1e-05,-7e-06,-2.1e-05,1.9e-05,-1.6e-05,8e-06,5e-06,6e-06,-1.8e-05,2e-06,6e-06,-2e-06,3e-06,-1.1e-05,-3e-06,9e-06,-8e-06,-2e-06,-1.5e-05,-8e-06,-7e-06,2e-06,8e-06,2.3e-05,2.3e-05,5e-06,-4.5e-05,-6e-06,-1.1e-05,8e-06,4e-06,3.3e-05,3.5e-05,1.4e-05,-1.2e-05,-5e-06,0,4e-06,-3e-06
7e-06,-4e-06,2e-06,-1e-06,5e-05,0.000105,-3e-06,-0.000165,0.000154,1.3e-05,-2e-06,5e-05,-1.2e-05,-1.6e-05,-0.000136,0.000266,6.4e-05,-0.000189,1e-04,-0.000452,0.001057,0.000159,-0.000545,-0.000547,3.4e-05,-0.00043,-0.000815,0.000421,3.5e-05,5.1e-05,0.000158,-0.000163,0.000463,-0.000127,0.00024,-7.5e-05,0.000178,0.000374,0.000333,0.000265,0.000232,-0.000461,-1e-04,-0.00016,-0.000133,-0.000307,-0.000102,0.000144,-0.000131,-4.4e-05,1.7e-05,-3.2e-05,-7.2e-05,-0.000139,5.5e-05,5e-05,-2.1e-05,0.000159,-3.2e-05,4.7e-05,1.6e-05,-2.5e-05,2.1e-05,2e-05,-3e-06,-2.6e-05,7e-06,-3.3e-05,2.9e-05,4e-06,3e-06,6e-06,1.6e-05,-4e-06,1.5e-05,1.4e-05,-2.1e-05,9e-06,2e-05,1e-06,-7e-06,-4e-06,2.4e-05,2e-06,-4e-06,-7e-06,8e-06,-2.1e-05,-4e-06,-9e-06,1.5e-05,-1.2e-05,-7e-06,-1.8e-05,-2e-06,1.9e-05,2e-06,-2.2e-05,-9e-06,1e-06,8e-06,-8e-06,8e-06,-1e-06,-4e-06,-1.7e-05,-9e-06,-1.2e-05,1.7e-05,5e-06,3e-06,7e-06,2e-06,-3.5e-05,-1.9e-05,-5e-06,-4e-06,2e-06,0,1.1e-05,4e-06
-8e-06,-9e-06,4e-06,-2e-06,1.7e-05,-4.5e-05,2e-05,0.000118,-2.1e-05,2.1e-05,2.2e-05,-2.2e-05,8e-06,0,4.2e-05,0.000366,-4.9e-05,0.000164,3.8e-05,0.000122,-0.000747,-0.000117,6.8e-05,0.000516,-0.000177,5.4e-05,0.000429,0.000207,0.000209,-8.1e-05,-7.5e-05,8.8e-05,-0.000222,0.000201,-0.000211,-1.1e-05,3.3e-05,3.5e-05,-0.000247,-0.000164,-8.9e-05,1e-04,7.3e-05,0.000297,0.000108,-0.000111,-3.5e-05,0.000225,0.000102,-6.2e-05,4.1e-05,3.3e-05,-6.3e-05,8e-05,5.4e-05,-8.3e-05,5.2e-05,-2.6e-05,1e-06,-2.3e-05,-1.2e-05,4e-06,1e-06,5e-06,1e-05,-4e-06,-1.2e-05,1e-06,-3.1e-05,3e-06,6e-06,-1e-05,-2.5e-05,5e-06,0,-7e-06,1.6e-05,9e-06,-6e-06,-1.6e-05,2e-06,-3e-06,-1e-05,-2e-06,8e-06,-1.7e-05,3e-06,2.5e-05,-9e-06,-3e-06,-9e-06,-8e-06,-7e-06,1.6e-05,-2e-06,-3e-06,-1e-06,1.5e-05,5e-06,-4e-06,-1e-06,5e-06,5e-06,-1e-06,-1e-06,0,5e-06,1.5e-05,-7e-06,2e-06,-1.4e-05,-1.1e-05,5e-06,2.5e-05,5e-06,2e-06,-2e-06,-1e-06,-1e-06,6e-06,2e-06
-4e-06,4e-06,-3e-06,-1.1e-05,4e-06,4.5e-05,-9e-06,-6.4e-05,-8.7e-05,-1.5e-05,-6.5e-05,4e-06,-1e-05,4e-06,6e-05,-0.000163,-3e-06,0.000152,-0.000118,-0.00025,-0.000226,-0.000216,-0.000124,-4.2e-05,0.000359,-6.4e-05,-0.000858,5.8e-05,0.000206,8.6e-05,0.00021,-0.000188,0.000307,0.000102,0.00024,-0.000122,0.00013,-6.2e-05,-2.2e-05,-3.2e-05,0.000234,-0.000114,-0.000123,-0.000621,-0.000164,0.000247,-3.3e-05,-0.000144,-6.3e-05,-2.4e-05,-5.9e-05,1.4e-05,1.2e-05,-3.8e-05,-8.4e-05,8.2e-05,4e-06,1.8e-05,-1.2e-05,1.6e-05,-4e-06,5e-06,-1.8e-05,-2e-05,2e-06,2.3e-05,-1.2e-05,8e-06,1.3e-05,-5e-06,-1.5e-05,6e-06,1.2e-05,0,8e-06,-2e-06,-1.2e-05,-1.3e-05,-2.1e-05,4e-06,-3e-06,1e-06,8e-06,-8e-06,-4e-06,1.4e-05,-1e-05,-1.4e-05,-5e-06,-4e-06,-1e-06,-1.5e-05,4e-06,-2e-06,0,-2e-05,0,-1.5e-05,1e-06,3e-06,-1e-06,-1e-06,-5e-06,2e-06,-3e-06,1.1e-05,-1.3e-05,7e-06,-1.1e-05,-3e-06,6e-06,1.1e-05,-1e-06,-1.1e-05,2e-06,-7e-06,-6e-06,8e-06,1e-06,1e-06,2e-06
1e-06,2e-06,-3e-06,-6e-06,8e-06,-4e-06,5e-06,4.6e-05,0.000107,3.1e-05,2.6e-05,7e-06,6e-06,-5e-06,-1e-06,-0.000218,-4.1e-05,2.7e-05,-0.00014,1.5e-05,0.000158,0.000135,0.000344,-0.000103,-0.000157,9.6e-05,0.000731,5e-06,-0.00017,-1.5e-05,-0.000137,0.000103,-0.000198,-2.5e-05,0.000297,6.9e-05,-6e-06,0.000105,-0.000312,8.2e-05,-5.2e-05,-9.4e-05,0.000229,0.000231,6.8e-05,-0.000115,5.5e-05,-3.8e-05,1e-05,0.00011,-3e-06,-3.1e-05,1.4e-05,0.000157,-2.2e-05,-4e-06,-3.5e-05,-7.2e-05,2.4e-05,1e-06,-1e-06,-6e-06,-6e-06,-9e-06,-1.1e-05,3e-06,-8e-06,-1e-06,1.5e-05,-6e-06,1.2e-05,4e-06,-8e-06,-7e-06,6e-06,1.7e-05,1.5e-05,-9e-06,3.5e-05,1.9e-05,7e-06,3e-06,-1.5e-05,9e-06,4e-06,6e-06,4e-06,-2e-06,-4e-06,6e-06,-1e-06,1.1e-05,3e-06,-7e-06,0,1.3e-05,1e-06,8e-06,-8e-06,-3e-06,-5e-06,0,-2e-06,-1e-06,3e-06,-1.2e-05,2.5e-05,-1.5e-05,2.3e-05,3e-06,-5e-06,-3e-06,3e-06,-5e-06,4e-06,6e-06,3e-06,-5e-06,1e-06,-5e-06,-3e-06
0,-1e-06,-2e-06,7e-06,-1.2e-05,3.5e-05,-1e-05,-2.3e-05,-3.8e-05,-1.3e-05,-3.1e-05,-1.7e-05,9e-06,6e-06,-2.3e-05,0.000306,0.00021,-0.00019,0.000163,0.000213,-0.000291,-6e-05,0.000185,8.4e-05,-3.3e-05,0.000228,-0.000316,-0.000309,-5.1e-05,-6.9e-05,-3.7e-05,0.00012,7e-06,0.000142,1.6e-05,-7e-06,6.8e-05,-8.3e-05,0.000278,-0.000128,-9.3e-05,0.000147,-0.000203,6.2e-05,-7.5e-05,-1.2e-05,7e-06,0.000169,-1.8e-05,-6.4e-05,2.3e-05,-1.7e-05,1.6e-05,-0.000255,4.9e-05,-3.8e-05,1.7e-05,1e-05,-2.2e-05,-3e-06,1.3e-05,1.2e-05,2.4e-05,-1.3e-05,-5e-06,-1.7e-05,1.4e-05,1.4e-05,-1e-05,8e-06,6e-06,-5e-06,7e-06,5e-06,3e-06,-1.5e-05,-1.5e-05,5e-06,-1e-05,-5e-06,-4e-06,2e-06,5e-06,-7e-06,3e-06,-1.2e-05,6e-06,7e-06,8e-06,3e-06,5e-06,5e-06,-2e-06,8e-06,1e-06,5e-06,-3e-06,1e-06,8e-06,2e-06,5e-06,1e-06,0,-1e-06,5e-06,9e-06,-2.2e-05,8e-06,-1.8e-05,-4e-06,-3e-06,-2e-06,-1e-06,1.5e-05,-5e-06,-5e-06,3e-06,1e-06,-1e-06,-4e-06,-3e-06
-5e-06,2e-06,1e-06,8e-06,-1e-06,4e-06,5e-06,8.4e-05,-1.7e-05,1.4e-05,1.1e-05,2e-05,-1.3e-05,-6e-06,4.1e-05,8.6e-05,-0.000161,-9.6e-05,0.000138,-0.000272,0.000275,-1.9e-05,5.3e-05,0.000139,-2.3e-05,-0.000267,0.00026,-0.000175,-0.000167,-4.7e-05,-7.7e-05,-6.1e-05,-7.9e-05,0.000137,-0.000103,-2.3e-05,-3.2e-05,8e-06,0.000137,-1.5e-05,-5.8e-05,-1.7e-05,0.000192,0.000115,5.5e-05,0.000183,-6e-05,2.3e-05,1.6e-05,1.9e-05,1.8e-05,3.3e-05,3.3e-05,0.000244,2.9e-05,3e-05,-3.2e-05,4.7e-05,-1.3e-05,1.9e-05,-1.5e-05,-1.1e-05,7e-06,3e-06,8e-06,5e-06,-4e-06,-6e-06,1.4e-05,-3e-06,-4e-06,2e-06,-9e-06,3e-06,5e-06,3e-06,1.2e-05,7e-06,-1.1e-05,-6e-06,3e-06,-2e-06,-7e-06,1e-06,2e-06,0,-1e-05,-5e-06,2e-06,-1e-06,-1e-06,-7e-06,1e-06,-1.1e-05,1e-06,-1e-05,3e-06,-1.3e-05,5e-06,-8e-06,-1e-06,1e-06,-1e-06,0,-8e-06,-8e-06,1e-05,-6e-06,2.7e-05,1e-06,2.1e-05,6e-06,1e-06,-1.8e-05,-1e-06,4e-06,-8e-06,2e-06,-1e-06,-4e-06,1e-06
0,0,1e-06,2e-06,-1.3e-05,-1.1e-05,-4e-06,-0.000151,1.7e-05,-5.3e-05,-1.7e-05,-1.2e-05,8e-06,5e-06,-3.1e-05,-0.000337,-2.8e-05,5.8e-05,-2.7e-05,0.000171,-0.000191,0.000161,-9.4e-05,-3.5e-05,-1.2e-05,-6.1e-05,-0.000113,-6.5e-05,0.000117,-4.4e-05,-4.4e-05,-7.3e-05,-1e-05,0.000206,-0.000247,2.2e-05,1.3e-05,0.000117,-0.000216,8.1e-05,-0.000131,0.000108,-0.000153,-0.000104,-3e-06,-0.000223,9e-06,-0.000162,1.1e-05,2.9e-05,-5.7e-05,1.9e-05,2.9e-05,-0.00022,-1.8e-05,1.6e-05,-3.2e-05,-7.6e-05,1.1e-05,2.9e-05,5e-06,1e-06,-1.8e-05,1.2e-05,1e-05,1.1e-05,3e-06,-1.3e-05,-1.5e-05,-4e-06,7e-06,-5e-06,1e-06,-4e-06,3e-06,6e-06,-1.1e-05,-1e-06,1.1e-05,6e-06,-1e-06,-1e-06,7e-06,1e-06,0,8e-06,5e-06,-4e-06,5e-06,2e-06,-2e-06,5e-06,2e-06,4e-06,-1e-06,2e-06,-2e-06,1.2e-05,-8e-06,2e-06,-2e-06,0,0,0,3e-06,8e-06,-1.4e-05,-3e-06,-8e-06,-1e-06,-1.3e-05,-3e-06,1e-06,1.7e-05,9e-06,-3e-06,8e-06,-1e-06,1e-06,1e-06,-2e-06
4e-06,-4e-06,-1e-06,-4e-06,-1.8e-05,-1.2e-05,3e-06,0.000137,-1e-05,2.7e-05,2.8e-05,1.5e-05,-2e-06,-4e-06,1.7e-05,-0.000101,-2.2e-05,9.3e-05,-3.8e-05,-0.000264,0.000141,2.3e-05,-0.000385,4.5e-05,-0.000139,8.5e-05,0.000412,-0.000277,3.8e-05,7.4e-05,-3e-06,4.7e-05,3.7e-05,0.000115,-5.5e-05,-9e-06,7.9e-05,-6.6e-05,2e-06,-3.5e-05,4.4e-05,-0.000108,0.000171,1.7e-05,-9e-06,0.00019,-3.3e-05,-4.2e-05,-2.2e-05,-9e-06,4e-05,-2.5e-05,-3.6e-05,0.000132,-4.2e-05,-4e-05,0,7.5e-05,3e-06,1e-06,7e-06,1.1e-05,-9e-06,5e-06,-3e-06,1e-06,-4e-06,1.2e-05,1.1e-05,-2e-06,-4e-06,3e-06,8e-06,-1e-06,1e-06,-8e-06,1e-05,-1e-05,-2e-06,3e-06,-4e-06,1e-06,-1e-05,0,1e-06,-6e-06,6e-06,1.1e-05,-1e-06,0,4e-06,-6e-06,-1e-06,4e-06,2e-06,4e-06,1e-06,-1.2e-05,-1e-06,-5e-06,-2e-06,-1e-06,-1e-06,0,0,-5e-06,1.6e-05,8e-06,1.5e-05,1e-06,2e-06,4e-06,2e-06,-1e-05,-8e-06,3e-06,-2e-06,1e-06,0,4e-06,-1e-06
-6e-06,0,0,-6e-06,1.1e-05,2.8e-05,-4e-06,-8.7e-05,3e-06,-1.3e-05,-1.5e-05,-1e-06,2e-06,2e-06,3.4e-05,0.000183,3.3e-05,1.7e-05,-0.000115,0.000241,1.8e-05,-6.2e-05,0.000119,0.000104,2.2e-05,-3e-06,-0.000484,-1e-04,1.5e-05,-2.4e-05,2.2e-05,1.1e-05,-4.1e-05,-8.7e-05,-1.9e-05,1.2e-05,-4e-06,-8.2e-05,5.5e-05,-7e-05,9.6e-05,0.000101,-0.000118,-5.6e-05,-2.8e-05,-5e-05,9e-06,7.5e-05,1.8e-05,3.6e-05,5e-06,-2e-05,-2.9e-05,-1.3e-05,1.2e-05,3.4e-05,-3.1e-05,-6.1e-05,-6e-06,1.7e-05,-8e-06,-1.2e-05,1.9e-05,5e-06,-1.4e-05,-1.7e-05,7e-06,0,-8e-06,6e-06,-3e-06,2e-06,-5e-06,5e-06,2e-06,7e-06,-8e-06,1e-06,-6e-06,-4e-06,4e-06,-2e-06,0,0,4e-06,-6e-06,-7e-06,-8e-06,-2e-06,2e-06,-4e-06,-2e-06,-1e-06,-5e-06,0,-5e-06,-2e-06,5e-06,3e-06,6e-06,3e-06,0,1e-06,0,-1e-06,-1e-06,-1.2e-05,2e-06,5e-06,0,8e-06,1e-06,-1e-06,1e-06,3e-06,-3e-06,-8e-06,-7e-06,-1e-06,3e-06,2e-06
0,3e-06,1e-06,0,1.9e-05,-3.2e-05,0,-3e-06,-3e-06,2.5e-05,1.3e-05,-2e-06,2e-06,2e-06,-3.1e-05,3.3e-05,2.6e-05,-7.9e-05,7e-06,-0.000178,0.000255,9.2e-05,1e-05,-3.1e-05,-4e-06,9.9e-05,3e-05,-0.000107,-0.000167,6.4e-05,-6e-05,-2e-05,1.4e-05,-6.3e-05,8e-06,-4.7e-05,-4.4e-05,-1.8e-05,0.000183,7.6e-05,3.1e-05,-2.9e-05,0.000121,0.000218,-6e-06,-0.000156,2.4e-05,-5.7e-05,-2e-06,1.3e-05,-8e-06,1.9e-05,-6e-06,-2.4e-05,3e-05,-8e-06,-1.1e-05,7.3e-05,-1.7e-05,-1.5e-05,-8e-06,-1e-06,3e-06,0,-5e-06,9e-06,-2e-06,-5e-06,1e-06,-5e-06,5e-06,-2e-06,2e-06,-2e-06,2e-06,-2e-06,9e-06,6e-06,9e-06,-7e-06,-3e-06,1e-06,2e-06,1e-06,2e-06,6e-06,1e-06,3e-06,-1e-06,-2e-06,0,4e-06,1e-06,1e-06,0,2e-06,2e-06,-3e-06,-3e-06,-3e-06,-1e-06,-1e-06,1e-06,0,-1e-06,3e-06,1.6e-05,-5e-06,-6e-06,-1e-06,-1.3e-05,-3e-06,1e-06,7e-06,-3e-06,2e-06,-2e-06,7e-06,0,1e-06,0
-1e-06,1e-06,-1e-06,3e-06,-2e-06,3e-06,3e-06,5.2e-05,-1.7e-05,-7e-06,-1e-06,9e-06,-8e-06,-4e-06,-3e-06,1.5e-05,2.2e-05,-1.7e-05,9.4e-05,7.3e-05,-0.000167,-1.9e-05,0.000135,-1.2e-05,3.8e-05,-6.7e-05,-1e-05,-8.4e-05,0.000152,0.000109,7.2e-05,6.8e-05,2.9e-05,4e-06,4.6e-05,1e-05,-3e-05,3.7e-05,-0.000103,2e-05,5.7e-05,-1.3e-05,-9.4e-05,-0.000126,3.8e-05,0.000148,-1.6e-05,-8e-06,-1.2e-05,-1.4e-05,-2.4e-05,1.5e-05,0,3e-05,-2e-06,-2.4e-05,9e-06,-1.1e-05,4e-06,-2.2e-05,1e-05,1.3e-05,-6e-06,-7e-06,8e-06,3e-06,-1e-06,6e-06,2e-06,-1e-06,-2e-06,-2e-06,-7e-06,-3e-06,0,-3e-06,-5e-06,3e-06,-2e-06,-1e-06,0,0,7e-06,-3e-06,-1e-06,1e-06,4e-06,2e-06,-1e-06,-1e-06,1e-06,-4e-06,-2e-06,1e-06,0,1e-06,-2e-06,-5e-06,-2e-06,2e-06,-3e-06,-1e-06,0,0,0,-7e-06,-2.2e-05,4e-06,1.5e-05,1e-06,5e-06,3e-06,0,-1.1e-05,7e-06,-2e-06,0,-3e-06,0,-1e-06,0
1e-06,-3e-06,-1e-06,3e-06,2e-06,7e-06,-1e-06,-2e-05,3.2e-05,8e-06,2e-05,-8e-06,1e-06,3e-06,2.1e-05,-7e-06,-0.000126,5.3e-05,-3e-06,-1e-04,-9.2e-05,-4.6e-05,0.000157,-1.1e-05,-6.4e-05,-0.000114,0.000171,0.000172,-3.9e-05,-7.7e-05,-3.9e-05,-2.2e-05,-6.1e-05,-2e-05,0.000102,-1.3e-05,-2.2e-05,-1e-06,-3.8e-05,-0.000128,-4.7e-05,5e-05,6.5e-05,-4.8e-05,-5.3e-05,-5.5e-05,6e-06,0.000114,-3e-06,-1.8e-05,1.4e-05,-1.4e-05,1e-05,-6.5e-05,-1.7e-05,2.7e-05,-1.5e-05,-1.4e-05,6e-06,7e-06,-6e-06,-9e-06,-1.3e-05,-6e-06,7e-06,-5e-06,-4e-06,-7e-06,-3e-06,1e-06,-1e-06,-2e-06,8e-06,3e-06,0,6e-06,7e-06,-5e-06,-6e-06,8e-06,0,0,-2e-06,3e-06,-2e-06,-6e-06,-4e-06,-5e-06,-1e-06,0,0,-4e-06,-1e-06,-2e-06,0,-6e-06,1e-06,9e-06,5e-06,-6e-06,1e-06,-1e-06,0,0,3e-06,7e-06,2.3e-05,-3e-06,-1.7e-05,-2e-06,-3e-06,-2e-06,0,1.1e-05,-1e-05,2e-06,1e-06,0,0,-2e-06,-1e-06
-3e-06,0,0,1e-06,4e-06,-9e-06,-1e-06,5e-06,-2.8e-05,-2e-06,5e-06,1.4e-05,4e-06,-1e-06,-7e-06,-5e-05,8.3e-05,4.9e-05,-3e-06,1.7e-05,7.8e-05,3.4e-05,-0.000133,3.8e-05,6.6e-05,8.6e-05,-0.00012,-3e-05,8.5e-05,3e-05,-4.2e-05,-4e-05,2e-05,-6.4e-05,0.000151,-8e-06,-1.4e-05,-4.1e-05,3.3e-05,3.3e-05,-5.8e-05,-2.9e-05,-2e-06,-2.9e-05,5.8e-05,3e-06,3e-06,5e-06,-7e-06,1e-05,1.4e-05,-9e-06,2.5e-05,7.8e-05,-7e-06,-4e-06,1.2e-05,-3e-06,-6e-06,1.3e-05,-2e-06,-3e-06,1e-05,-2e-06,-2e-06,-5e-06,1e-06,-1e-06,1.1e-05,2e-06,0,4e-06,-3e-06,-1e-06,2e-06,-6e-06,-6e-06,-2e-06,4e-06,-1e-06,0,-1e-06,4e-06,-2e-06,0,1e-06,-2e-06,4e-06,-1e-06,1e-06,0,2e-06,1e-06,3e-06,1e-06,5e-06,-1e-06,-1e-05,0,4e-06,2e-06,0,-1e-06,0,-1e-06,-5e-06,-1.8e-05,-2e-06,1e-05,2e-06,-2e-06,-2e-06,0,-8e-06,6e-06,-1e-06,2e-06,0,0,-2e-06,-1e-06
0,1e-06,1e-06,-2e-06,-6e-06,9e-06,-2e-06,4e-06,6e-06,-1.2e-05,4e-06,-5e-06,-5e-06,0,-1.3e-05,5.4e-05,-2.1e-05,-5.3e-05,7e-06,7.2e-05,-9.2e-05,-1.5e-05,-2.3e-05,-8e-05,-2e-06,8e-06,0.000164,4.1e-05,-0.000124,-2.1e-05,1.7e-05,-9e-06,-3.7e-05,-0.000129,-6e-05,-1.1e-05,2.9e-05,-1.6e-05,4e-05,0.000135,5e-06,-2e-06,1.3e-05,4.9e-05,-5.8e-05,7.1e-05,6e-06,-7e-05,8e-06,1e-05,-6e-06,1.3e-05,1.6e-05,-7.3e-05,1.2e-05,-2.2e-05,4e-06,-4.4e-05,-9e-06,-9e-06,4e-06,1e-05,1.1e-05,1e-06,-3e-06,4e-06,1e-06,1e-05,-9e-06,-4e-06,-4e-06,-1e-06,0,-2e-06,-1e-06,2e-06,6e-06,3e-06,4e-06,-4e-06,1e-06,-1e-06,-4e-06,1e-06,0,4e-06,4e-06,-1e-06,1e-06,1e-06,1e-06,0,1e-06,0,0,3e-06,1e-06,5e-06,-3e-06,-3e-06,-1e-06,-1e-06,0,0,-1e-06,3e-06,9e-06,5e-06,-1e-05,-2e-06,5e-06,1e-06,0,3e-06,-5e-06,2e-06,0,3e-06,0,0,0
2e-06,-1e-06,0,-3e-06,-5e-06,0,1e-06,-1e-05,2.6e-05,4e-06,7e-06,-5e-06,1e-06,0,2.5e-05,4.9e-05,-9e-06,-5.9e-05,-4.2e-05,-0.000137,-3.4e-05,-2.6e-05,-0.000216,-1.8e-05,-4.2e-05,6e-06,-8.9e-05,7.8e-05,5.8e-05,-8.3e-05,-6.2e-05,2.7e-05,1.6e-05,-0.000101,-0.000114,2.3e-05,-2.1e-05,-1.1e-05,2e-05,-2.3e-05,-4.6e-05,-5.5e-05,9e-06,-1.5e-05,4.4e-05,-6e-05,3e-06,3.8e-05,-1.7e-05,-1.7e-05,-1.8e-05,5e-06,-1.5e-05,5.4e-05,1e-05,2.3e-05,-4e-06,6.1e-05,0,-1.8e-05,7e-06,-7e-06,-1.2e-05,5e-06,-1e-06,3e-06,3e-06,-4e-06,1e-05,0,1e-06,-2e-06,-1e-06,0,1e-06,3e-06,-5e-06,4e-06,-4e-06,3e-06,0,1e-06,4e-06,-1e-06,-1e-06,-4e-06,-2e-06,-2e-06,1e-06,0,0,2e-06,-1e-06,-3e-06,0,-6e-06,-1e-06,-4e-06,1e-06,3e-06,-2e-06,0,0,0,2e-06,-1e-06,-3e-06,-2e-06,-4e-06,2e-06,-2e-06,-2e-06,0,2e-06,6e-06,-2e-06,-7e-06,-1e-06,0,1e-06,0
-4e-06,1e-06,0,-1e-06,-6e-06,5e-06,0,-3.2e-05,-3.3e-05,-5e-06,4e-06,-1e-06,1e-06,-1e-06,-2.5e-05,-0.000124,0,5e-06,1.8e-05,0.000115,-1e-06,3.3e-05,5.2e-05,1.6e-05,2e-06,4.3e-05,9.6e-05,-7.4e-05,-8.7e-05,-2.2e-05,3.7e-05,-2e-06,5e-06,2.3e-05,-4.6e-05,-8e-06,5e-06,-1.9e-05,-7.2e-05,-8.1e-05,4.3e-05,4.6e-05,-2e-06,2.2e-05,-3.5e-05,-1.1e-05,1.2e-05,3.4e-05,1.2e-05,3e-06,1.5e-05,-1.4e-05,-1.9e-05,-3.3e-05,-8e-06,-6e-06,7e-06,-5.7e-05,7e-06,-1.5e-05,-1e-05,-2e-06,-4e-06,3e-06,0,-5e-06,0,-3e-06,-5e-06,1e-06,1e-06,0,2e-06,3e-06,0,-4e-06,6e-06,-3e-06,0,3e-06,0,0,-4e-06,-2e-06,-2e-06,-3e-06,-1e-06,2e-06,2e-06,1e-06,-2e-06,-1e-06,0,4e-06,-1e-06,1e-06,0,-1e-06,0,-4e-06,1e-06,0,-1e-06,0,-1e-06,-1e-06,3e-06,0,1e-06,-1e-06,3e-06,1e-06,0,-5e-06,-8e-06,1e-06,1e-06,1e-06,0,2e-06,0
2e-06,1e-06,0,2e-06,-3e-06,-3e-06,1e-06,5.1e-05,1e-05,1.1e-05,6e-06,-5e-06,-2e-06,1e-06,0,-3.7e-05,-2e-05,6.4e-05,3.7e-05,-0.000151,-3.3e-05,-1e-05,0.000166,-3.8e-05,2.2e-05,-0.000109,-0.000244,9.7e-05,0.000162,8e-06,2.9e-05,1.3e-05,-6e-06,4e-05,-3e-05,-1e-05,-3e-06,6.2e-05,4.6e-05,2.3e-05,-1.2e-05,-6.2e-05,4.4e-05,-7.7e-05,3.3e-05,6.8e-05,-1.6e-05,-7.9e-05,-7e-06,1.5e-05,9e-06,-2e-06,-1.2e-05,2e-05,-7e-06,-1.9e-05,-3e-06,4.4e-05,-1e-06,-5e-06,8e-06,7e-06,0,2e-06,0,-4e-06,-1e-06,5e-06,3e-06,-1e-06,-1e-06,0,2e-06,-3e-06,0,3e-06,-5e-06,-1e-06,2e-06,0,-1e-06,0,2e-06,2e-06,-1e-06,5e-06,2e-06,0,1e-06,0,1e-06,-5e-06,1e-06,-2e-06,0,3e-06,0,5e-06,-1e-06,2e-06,1e-06,0,0,0,0,5e-06,-7e-06,1e-06,-1.3e-05,1e-06,0,-1e-06,0,7e-06,9e-06,-1e-06,1e-06,-2e-06,0,2e-06,1e-06
-1e-06,-1e-06,1e-06,2e-06,6e-06,1.2e-05,-2e-06,-2.9e-05,1.8e-05,-8e-06,-3e-06,8e-06,1e-06,-1e-06,1.7e-05,0.000105,1e-05,2.2e-05,-4.9e-05,0.000132,0.000111,-3.7e-05,-1.5e-05,-5.4e-05,-1.3e-05,3.3e-05,0.000199,-4.4e-05,-9e-05,2.3e-05,-1.1e-05,-6e-06,3.3e-05,-1.1e-05,8e-06,-5e-06,1.1e-05,-4.1e-05,-2e-05,7e-06,-2e-06,2.4e-05,-4.7e-05,7.1e-05,-1.5e-05,-9.9e-05,5e-06,-3.6e-05,4e-06,-1e-06,-1.7e-05,1.5e-05,-4e-06,-4e-05,1e-06,2.5e-05,-6e-06,-3.1e-05,-5e-06,1.3e-05,-2e-06,-5e-06,1e-05,-1e-06,0,5e-06,0,-6e-06,-2e-06,-2e-06,1e-06,1e-06,-3e-06,1e-06,-1e-06,-1e-06,6e-06,-1e-06,-4e-06,-5e-06,1e-06,1e-06,-6e-06,-2e-06,0,-1e-06,-1e-06,-1e-06,0,1e-06,0,-2e-06,0,0,0,-3e-06,0,-1e-05,1e-06,-3e-06,-1e-06,0,0,0,0,-6e-06,8e-06,-2e-06,8e-06,0,-3e-06,-1e-06,-1e-06,-6e-06,-6e-06,1e-06,-2e-06,2e-06,0,1e-06,0
0,-1e-06,0,0,5e-06,-1e-05,1e-06,2e-05,-2.1e-05,5e-06,3e-06,-8e-06,3e-06,0,-1.2e-05,4e-06,2.1e-05,-4.8e-05,-1.5e-05,-8.2e-05,2.7e-05,1.4e-05,0.000117,6.2e-05,-2e-06,6.1e-05,-7.7e-05,-0.000102,3.4e-05,2.2e-05,2.1e-05,-1.6e-05,-3.3e-05,-3.7e-05,3.1e-05,1e-06,-7e-06,-3.4e-05,1.7e-05,-3.6e-05,3.2e-05,1.9e-05,7.1e-05,2.3e-05,-1e-06,3.7e-05,3e-06,5.6e-05,-1e-06,6e-06,-3e-06,2e-06,2e-06,5.7e-05,7e-06,-1e-05,-1e-06,2.8e-05,1e-06,1e-06,-2e-06,-1e-06,-1e-06,-2e-06,3e-06,2e-06,-1e-06,2e-06,-1e-06,1e-06,0,-3e-06,1e-06,1e-06,0,-1e-06,-5e-06,5e-06,4e-06,-1e-06,0,0,4e-06,1e-06,0,-5e-06,-1e-06,3e-06,-1e-06,-1e-06,0,0,-1e-06,2e-06,1e-06,1e-06,0,6e-06,1e-06,4e-06,-1e-06,0,0,0,1e-06,3e-06,-6e-06,0,-1.1e-05,0,4e-06,1e-06,0,4e-06,5e-06,-1e-06,-1e-06,-2e-06,0,-1e-06,-1e-06
-1e-06,1e-06,-1e-06,-1e-06,0,7e-06,0,-3e-06,8e-06,-2e-06,-1e-05,2e-06,-5e-06,0,-4e-06,-3.4e-05,-4.3e-05,-2.9e-05,3e-05,-1.6e-05,-2.2e-05,-3e-06,-0.000152,-5e-06,1.9e-05,-5.9e-05,6.4e-05,2.4e-05,-0.000122,2.2e-05,-1.2e-05,1e-05,4.7e-05,-9e-06,7.5e-05,1.6e-05,1.3e-05,2.6e-05,1e-05,5.8e-05,-1e-06,8e-06,-4.2e-05,-1e-06,9e-06,3.9e-05,2e-06,1.2e-05,0,6e-06,1.4e-05,-1.4e-05,2.3e-05,-4.3e-05,4e-06,-1e-05,-7e-06,9e-06,7e-06,-4e-06,-5e-06,5e-06,-1.3e-05,-3e-06,1e-06,-6e-06,1e-06,5e-06,0,0,0,0,0,0,-1e-06,4e-06,5e-06,-2e-06,1e-06,5e-06,0,-1e-06,-2e-06,-1e-06,0,2e-06,1e-06,-3e-06,-1e-06,-1e-06,1e-06,1e-06,-1e-06,-3e-06,0,1e-06,-1e-06,-5e-06,-1e-06,-3e-06,1e-06,0,1e-06,0,0,-1e-06,4e-06,2e-06,6e-06,1e-06,-7e-06,-2e-06,0,-1e-06,-7e-06,1e-06,-1e-06,0,0,-2e-06,0
-1e-06,1e-06,0,-2e-06,4e-06,1e-06,0,-1.7e-05,8e-06,4e-06,2e-06,0,1e-06,0,1.4e-05,2.2e-05,2.1e-05,1.3e-05,5e-06,4.2e-05,4e-05,-2.3e-05,-6.5e-05,-4.1e-05,2.2e-05,3.6e-05,-4.5e-05,-9e-05,0.00013,4.6e-05,-1.7e-05,-5e-06,-5e-05,6.9e-05,4.8e-05,-4e-06,-1e-06,3e-06,-3.2e-05,1.7e-05,3e-05,0,6.1e-05,-1.1e-05,-3.1e-05,-4.1e-05,6e-06,-3.1e-05,5e-06,-4e-06,4e-06,-1e-06,2.2e-05,1.3e-05,-6e-06,1.6e-05,-6e-06,-2.2e-05,1e-06,-1e-06,1e-05,-4e-06,4e-06,-1e-06,-3e-06,0,-3e-06,-7e-06,-2e-06,-1e-06,2e-06,0,1e-06,-2e-06,-1e-06,-3e-06,-6e-06,1e-06,-4e-06,-2e-06,1e-06,0,0,1e-06,0,3e-06,0,2e-06,0,0,0,2e-06,1e-06,2e-06,-1e-06,-3e-06,0,1e-06,0,2e-06,0,0,0,0,0,1e-06,-6e-06,-1e-06,1e-06,-1e-06,2e-06,1e-06,0,-1e-06,9e-06,0,-1e-06,-1e-06,0,-1e-06,-1e-06
1e-06,0,1e-06,-1e-06,0,-1e-06,0,6e-06,-1.4e-05,-5e-06,-8e-06,-9e-06,4e-06,0,-4e-06,1.2e-05,-1.2e-05,5.6e-05,3.5e-05,-7.9e-05,-2e-05,1.7e-05,-3e-06,5.4e-05,-1e-05,-3.4e-05,8e-05,-1.3e-05,-6.8e-05,-2.9e-05,8e-06,2.2e-05,4.4e-05,7.3e-05,-4e-06,-1.7e-05,1.2e-05,3e-06,1.3e-05,-7.6e-05,1e-05,-1.2e-05,-5.8e-05,-1e-05,4.1e-05,3.3e-05,-6e-06,2.3e-05,-1.1e-05,-2e-06,-1.5e-05,1.4e-05,-5e-06,2.6e-05,-5e-06,-5e-06,-3e-06,2.3e-05,-4e-06,1e-06,-9e-06,0,9e-06,0,-3e-06,5e-06,0,1e-06,2e-06,0,0,0,-2e-06,2e-06,-1e-06,-1e-06,5e-06,-3e-06,1e-06,-3e-06,-1e-06,0,-1e-06,-1e-06,1e-06,-4e-06,0,-1e-06,0,0,0,-1e-06,0,0,-1e-06,3e-06,-1e-06,3e-06,0,-4e-06,-1e-06,0,0,0,1e-06,0,9e-06,0,-2e-06,2e-06,1e-06,1e-06,0,3e-06,-9e-06,0,1e-06,1e-06,0,0,0
-2e-06,-1e-06,0,1e-06,-4e-06,0,0,-1e-06,1e-06,1e-06,-3e-06,4e-06,-2e-06,-1e-06,-1.1e-05,-2.4e-05,-4e-06,-2.3e-05,-1e-06,9.4e-05,2.3e-05,1.6e-05,-4e-05,3.1e-05,-1.6e-05,-3.3e-05,-3.8e-05,2.2e-05,8.4e-05,-4.7e-05,-3e-05,-2e-06,-5.2e-05,3e-06,-2.4e-05,9e-06,-1e-05,2.5e-05,-1.7e-05,-2.9e-05,-4.2e-05,3.7e-05,8e-05,-2.5e-05,-5e-05,-1.4e-05,1e-06,1.3e-05,5e-06,-1e-06,-2e-06,0,-1.5e-05,-6.5e-05,2e-06,-1.5e-05,-5e-06,-4.7e-05,3e-06,6e-06,4e-06,2e-06,-2e-06,2e-06,1e-06,1e-06,0,4e-06,0,0,-1e-06,1e-06,0,0,-1e-06,3e-06,-5e-06,3e-06,0,1e-06,0,0,2e-06,1e-06,1e-06,-1e-06,0,-1e-06,1e-06,0,-1e-06,-2e-06,0,-2e-06,0,1e-06,1e-06,-7e-06,0,3e-06,0,0,0,0,0,-3e-06,-8e-06,1e-06,1.2e-05,-2e-06,-3e-06,-1e-06,0,-3e-06,7e-06,-1e-06,0,1e-06,0,1e-06,0
