0.005331,0.005228,0.005673,0.005732,0.005524,0.006001,0.007088,0.007537,0.007601,0.008054,0.008777,0.008888,0.008574,0.009624,0.010573,0.009505,0.009678,0.011722,0.013357,0.014469,0.012866,0.011382,0.011774,0.010608,0.009455,0.011026,0.012067,0.010665
0.006643,0.006584,0.00699,0.006866,0.006543,0.007115,0.00836,0.009027,0.009242,0.009775,0.010618,0.010711,0.010462,0.011953,0.012971,0.011447,0.011578,0.013984,0.01578,0.016687,0.014844,0.013483,0.014099,0.012777,0.011481,0.013243,0.01445,0.012824
0.008791,0.008884,0.009167,0.008654,0.008129,0.008916,0.010384,0.011373,0.011922,0.012719,0.013805,0.013653,0.013405,0.015741,0.01693,0.014714,0.014723,0.017605,0.019666,0.020164,0.018145,0.017281,0.018133,0.016514,0.015069,0.01698,0.018276,0.016359
0.010404,0.010782,0.010743,0.009863,0.00933,0.010197,0.011618,0.012822,0.013774,0.015109,0.016397,0.015691,0.015302,0.018315,0.019997,0.017778,0.017501,0.020616,0.023139,0.023443,0.021883,0.021796,0.022344,0.020282,0.018784,0.020291,0.021291,0.019648
0.011833,0.01284,0.012166,0.010875,0.011049,0.01215,0.013244,0.014523,0.015892,0.018127,0.019222,0.018033,0.018141,0.02138,0.023766,0.022353,0.021644,0.025331,0.028963,0.029198,0.028053,0.027958,0.026909,0.024581,0.023802,0.024986,0.025663,0.025187
0.015242,0.016962,0.015119,0.013297,0.014994,0.016993,0.018092,0.019566,0.021583,0.025039,0.025528,0.024456,0.026021,0.029292,0.032609,0.032274,0.031273,0.036374,0.041638,0.041535,0.039734,0.037549,0.033297,0.031506,0.033292,0.035023,0.034948,0.036651
0.021598,0.023549,0.020414,0.018551,0.022375,0.025531,0.027119,0.029722,0.03292,0.036981,0.036535,0.036685,0.040335,0.044945,0.050382,0.050368,0.048833,0.055847,0.063174,0.062442,0.057792,0.051678,0.044156,0.043795,0.050271,0.053815,0.052542,0.056796
0.028833,0.030953,0.027164,0.025699,0.03234,0.037008,0.040007,0.045097,0.049822,0.053333,0.050745,0.052386,0.058403,0.066375,0.077041,0.076977,0.073363,0.082745,0.093245,0.091708,0.080863,0.070187,0.06303,0.065159,0.076248,0.080871,0.078156,0.085566
0.035425,0.037587,0.034386,0.033492,0.042365,0.049119,0.054874,0.063411,0.068996,0.070169,0.064371,0.066414,0.075127,0.088881,0.105841,0.105536,0.101559,0.113945,0.125719,0.123944,0.107457,0.092848,0.089021,0.094111,0.10786,0.110904,0.106636,0.11678
0.041935,0.043045,0.040844,0.040272,0.049582,0.059006,0.068002,0.0801,0.085473,0.083579,0.076537,0.076343,0.086499,0.107353,0.127767,0.127696,0.129852,0.144592,0.149852,0.14927,0.138881,0.125692,0.120501,0.122921,0.134985,0.135581,0.132475,0.143042
0.047558,0.047584,0.047082,0.046445,0.054714,0.068101,0.078723,0.089923,0.093686,0.091645,0.089238,0.085446,0.095875,0.12376,0.140448,0.13916,0.151508,0.168083,0.16506,0.167571,0.175984,0.17125,0.15588,0.146348,0.151648,0.151531,0.151876,0.159736
0.050024,0.050003,0.052525,0.053628,0.063572,0.081846,0.090033,0.093477,0.095497,0.09763,0.103075,0.095635,0.107127,0.142986,0.151471,0.147642,0.167176,0.181606,0.178883,0.190606,0.218728,0.223083,0.191814,0.167859,0.163288,0.158285,0.16385,0.170172
0.052155,0.052466,0.055488,0.058071,0.070611,0.092358,0.099374,0.09465,0.094967,0.102164,0.114322,0.106309,0.116404,0.153681,0.155995,0.155095,0.181849,0.194252,0.194815,0.217722,0.25532,0.256716,0.213814,0.185984,0.172646,0.157519,0.171524,0.178402
0.053314,0.054323,0.053241,0.054587,0.067621,0.091733,0.100038,0.088741,0.08601,0.096493,0.11336,0.109456,0.113217,0.139643,0.141387,0.146081,0.176222,0.195672,0.202394,0.228241,0.257126,0.244327,0.20913,0.193821,0.175665,0.154215,0.169796,0.172444
0.048221,0.049956,0.045001,0.044985,0.056715,0.08169,0.088566,0.071285,0.068409,0.082307,0.099996,0.099648,0.095769,0.11023,0.118898,0.124462,0.147429,0.174743,0.190365,0.207417,0.211895,0.186973,0.173667,0.175383,0.156229,0.140123,0.15311,0.151087
0.039917,0.041516,0.036392,0.036037,0.044846,0.064576,0.067897,0.05195,0.052159,0.06841,0.0834,0.084353,0.078493,0.084488,0.099201,0.102189,0.113219,0.147079,0.17898,0.179167,0.149188,0.125481,0.130694,0.138382,0.133378,0.129696,0.127975,0.123705
0.035245,0.035917,0.034077,0.034217,0.03788,0.046692,0.048387,0.044109,0.051698,0.065887,0.072497,0.076183,0.080921,0.091511,0.106847,0.105271,0.112308,0.14658,0.194122,0.185135,0.124999,0.104926,0.112629,0.121517,0.138964,0.136642,0.114633,0.113524
0.034791,0.034654,0.03363,0.036861,0.039463,0.041313,0.042031,0.043738,0.057236,0.069965,0.072206,0.075674,0.088261,0.114242,0.136786,0.134679,0.137854,0.164164,0.222558,0.219048,0.14,0.116817,0.126807,0.141404,0.165441,0.156449,0.12785,0.126619
0.038782,0.039384,0.034478,0.042861,0.048903,0.046407,0.044258,0.043831,0.059797,0.075587,0.076975,0.075265,0.090899,0.131995,0.167369,0.170599,0.168098,0.184683,0.246709,0.254366,0.1714,0.144121,0.156015,0.174597,0.191766,0.173681,0.15182,0.145319
0.044478,0.048535,0.040392,0.051483,0.060516,0.055291,0.049693,0.043774,0.060671,0.086113,0.090706,0.08152,0.091669,0.136254,0.181985,0.191578,0.188727,0.196868,0.2433,0.25945,0.201338,0.178166,0.180392,0.196176,0.201865,0.172707,0.167618,0.161557
0.051488,0.058595,0.049151,0.058469,0.068592,0.065377,0.061256,0.051589,0.06745,0.098068,0.105509,0.098618,0.098759,0.123466,0.166472,0.183648,0.185213,0.193195,0.223013,0.237984,0.214499,0.203319,0.190883,0.203079,0.210904,0.172885,0.171883,0.170418
0.054413,0.06308,0.056467,0.060704,0.068989,0.069887,0.070944,0.063189,0.076513,0.101819,0.108272,0.116407,0.111229,0.109478,0.146294,0.16978,0.167289,0.169336,0.194322,0.216527,0.223882,0.220136,0.189568,0.198546,0.223964,0.194005,0.187038,0.172617
0.055505,0.065696,0.066497,0.06409,0.065804,0.071176,0.075848,0.071653,0.081989,0.099882,0.107817,0.132756,0.13454,0.122427,0.159442,0.194947,0.172432,0.144002,0.173932,0.228526,0.25875,0.238134,0.184198,0.189772,0.229747,0.215823,0.204114,0.176207
0.060317,0.072745,0.081384,0.077694,0.072273,0.073588,0.074477,0.075967,0.087635,0.101835,0.116561,0.147377,0.14999,0.140081,0.196212,0.250116,0.202076,0.136872,0.15608,0.247667,0.312503,0.272745,0.199252,0.184099,0.210562,0.226041,0.2314,0.199999
0.067353,0.086082,0.098768,0.08917,0.078188,0.074652,0.071837,0.080142,0.097597,0.112539,0.128742,0.146068,0.143414,0.158893,0.243376,0.298443,0.228812,0.140603,0.135954,0.248224,0.357506,0.316051,0.226961,0.178682,0.188,0.2518,0.279055,0.244282
0.074395,0.098979,0.110825,0.096181,0.084649,0.078959,0.074597,0.082241,0.098959,0.114928,0.130635,0.13015,0.121027,0.166136,0.262769,0.295742,0.223391,0.149889,0.147693,0.25933,0.368882,0.340086,0.260995,0.187717,0.19179,0.285456,0.307487,0.280346
0.082296,0.110494,0.118796,0.102126,0.090229,0.084026,0.081872,0.080403,0.087735,0.102338,0.122289,0.118593,0.110435,0.1635,0.242363,0.24861,0.194057,0.169109,0.186986,0.262216,0.328532,0.320617,0.278712,0.198372,0.187401,0.278358,0.282179,0.270051
0.077577,0.107124,0.111067,0.09702,0.090357,0.088445,0.09276,0.080462,0.082911,0.097973,0.111464,0.109256,0.105025,0.146142,0.206673,0.211172,0.179818,0.195229,0.237404,0.27708,0.308322,0.312316,0.284917,0.202184,0.179554,0.263778,0.248747,0.228814
0.062908,0.094559,0.098339,0.086349,0.091156,0.092111,0.096126,0.080243,0.079668,0.099445,0.10787,0.117126,0.126012,0.154279,0.194725,0.190486,0.187045,0.226534,0.285083,0.319133,0.306021,0.287496,0.258191,0.191883,0.191465,0.279868,0.264821,0.236248
0.059447,0.086719,0.091044,0.082478,0.095097,0.086319,0.084735,0.083178,0.080612,0.097444,0.101115,0.120159,0.154853,0.185403,0.208787,0.199577,0.209992,0.250982,0.300276,0.323219,0.273236,0.239544,0.204998,0.151352,0.177005,0.268374,0.278211,0.258099
0.07588,0.09118,0.083979,0.08921,0.10764,0.076178,0.065482,0.088736,0.095269,0.09702,0.088531,0.112467,0.165188,0.201353,0.22213,0.215037,0.216903,0.242024,0.266906,0.272275,0.223528,0.202891,0.168888,0.111955,0.141816,0.250963,0.304324,0.270521
0.092209,0.093927,0.078815,0.104134,0.121683,0.070265,0.052201,0.093367,0.124192,0.116052,0.092906,0.116263,0.163098,0.18745,0.202621,0.197587,0.192272,0.213547,0.247455,0.232005,0.173129,0.195811,0.182629,0.096667,0.122357,0.257291,0.343685,0.295151
0.092037,0.092267,0.085099,0.117861,0.127254,0.070882,0.051667,0.092719,0.146375,0.154565,0.115875,0.118896,0.155891,0.155749,0.157898,0.169645,0.171723,0.201993,0.273372,0.262567,0.181401,0.22291,0.207433,0.094191,0.11302,0.238471,0.339173,0.335413
0.07672,0.078358,0.084366,0.115947,0.130952,0.08507,0.057291,0.080766,0.142853,0.18384,0.13717,0.105251,0.134351,0.135741,0.128708,0.155174,0.168084,0.186322,0.282138,0.321297,0.243768,0.257953,0.216242,0.098476,0.104532,0.193212,0.282982,0.360224
0.067928,0.065559,0.074525,0.096105,0.120192,0.0982,0.065407,0.069721,0.119906,0.183208,0.152722,0.098847,0.124123,0.158499,0.164331,0.16845,0.169408,0.198928,0.287729,0.358016,0.32453,0.281247,0.205057,0.110187,0.101924,0.168887,0.237604,0.356536
0.068539,0.066269,0.068041,0.085792,0.112005,0.109156,0.080158,0.072907,0.095467,0.153137,0.155069,0.113813,0.138095,0.197443,0.227811,0.185929,0.16524,0.244578,0.309246,0.366283,0.390197,0.300456,0.187099,0.120433,0.115756,0.16708,0.216418,0.329335
0.070184,0.078516,0.071238,0.092447,0.130041,0.128635,0.089113,0.075576,0.09326,0.127112,0.134606,0.115188,0.136598,0.216052,0.291041,0.216045,0.162349,0.285729,0.343703,0.34526,0.412899,0.338715,0.18795,0.135543,0.151897,0.180516,0.205037,0.27439
0.084875,0.095337,0.076681,0.091686,0.141262,0.137426,0.084324,0.069353,0.108498,0.122753,0.104792,0.093162,0.112723,0.202174,0.3292,0.258517,0.186748,0.304522,0.342693,0.312538,0.385759,0.332467,0.17257,0.148759,0.190714,0.212812,0.201435,0.20337
0.101705,0.099199,0.080217,0.08803,0.131181,0.127939,0.08244,0.067687,0.124114,0.140647,0.093649,0.070601,0.101415,0.195349,0.328242,0.270128,0.201977,0.284137,0.291594,0.304588,0.332711,0.266947,0.154149,0.169129,0.207449,0.245536,0.224353,0.190892
0.109437,0.084198,0.080534,0.08206,0.107581,0.111204,0.100785,0.077998,0.130095,0.148631,0.090431,0.078253,0.109984,0.190012,0.281248,0.247258,0.198728,0.23475,0.200758,0.267246,0.259111,0.184746,0.138436,0.188459,0.196544,0.254805,0.237109,0.195416
