0.021985,0.022617,0.02399,0.022437,0.019577,0.017985,0.01615,0.0159,0.017062,0.016174,0.015608,0.016006,0.01623,0.051091,0.251634,0.619812,0.99472,1.177,1.249024,1.326297,1.306101,1.265285,1.223856,1.060737,0.828147,0.716199,0.648029,0.534603
0.027392,0.027945,0.029295,0.027382,0.02374,0.021807,0.019431,0.019307,0.021221,0.020184,0.01895,0.019021,0.019255,0.059418,0.292228,0.73499,1.169527,1.346716,1.418293,1.518116,1.489541,1.425942,1.362113,1.169969,0.930967,0.833145,0.762292,0.625597
0.036836,0.037006,0.037873,0.035376,0.030567,0.028075,0.025069,0.025667,0.029054,0.027851,0.025291,0.02425,0.024834,0.073397,0.354156,0.913237,1.43774,1.590664,1.642958,1.767285,1.721872,1.61958,1.517285,1.314316,1.11838,1.0493,0.965892,0.787363
0.045845,0.04496,0.043679,0.040235,0.035622,0.033128,0.030409,0.032818,0.037628,0.036596,0.033068,0.029858,0.031406,0.088776,0.4094,1.052169,1.627854,1.753052,1.773037,1.877082,1.818296,1.704577,1.581565,1.460883,1.386463,1.303134,1.193505,1.003498
0.054829,0.053679,0.048357,0.04235,0.039063,0.03806,0.037435,0.04151,0.046728,0.046452,0.043179,0.038078,0.041635,0.118986,0.513829,1.25437,1.844274,1.966958,2.009982,2.059142,2.002036,1.962847,1.86937,1.873663,1.879213,1.690689,1.566858,1.385604
0.064721,0.063501,0.055866,0.047892,0.044241,0.044494,0.047503,0.052661,0.057496,0.058035,0.054839,0.049577,0.058203,0.171832,0.710696,1.598446,2.155109,2.281137,2.402186,2.474825,2.44499,2.461055,2.513306,2.666377,2.58859,2.210793,2.10072,1.93741
0.075647,0.076015,0.070315,0.061565,0.054941,0.055231,0.061239,0.065601,0.067634,0.069547,0.068108,0.063881,0.079698,0.238441,0.947865,1.968711,2.514647,2.656127,2.804942,2.963154,2.940486,2.922193,3.165717,3.434115,3.178028,2.63506,2.580371,2.46443
0.086735,0.089237,0.088791,0.080519,0.069611,0.069313,0.077179,0.078709,0.075419,0.078895,0.083683,0.081904,0.102421,0.306951,1.16182,2.207048,2.805558,3.03578,3.12845,3.302972,3.208153,3.114208,3.445007,3.712905,3.430904,2.940034,2.826067,2.685261
0.097804,0.09972,0.104395,0.097993,0.083745,0.084128,0.094024,0.092342,0.083392,0.087662,0.102428,0.103721,0.1243,0.381297,1.376962,2.430657,3.142653,3.385163,3.328062,3.413146,3.20979,3.121254,3.266985,3.324234,3.280934,3.056868,2.712265,2.447639
0.107732,0.106354,0.116003,0.11205,0.095004,0.095934,0.106223,0.100888,0.090965,0.098892,0.12273,0.125575,0.144721,0.452519,1.589989,2.711358,3.494832,3.56002,3.279981,3.263783,3.070008,3.086257,2.817062,2.509657,2.834558,2.921485,2.342148,1.992114
0.109241,0.10652,0.121925,0.118195,0.098495,0.099283,0.107798,0.100698,0.096605,0.1093,0.133003,0.136878,0.158588,0.487845,1.724832,2.889428,3.589739,3.541719,3.28278,3.252618,3.013272,3.003627,2.364476,1.757607,2.332231,2.651891,2.011335,1.683381
0.102416,0.102649,0.120093,0.114155,0.091329,0.089285,0.09601,0.092894,0.09637,0.109712,0.122607,0.127489,0.161382,0.514597,1.948099,3.319074,3.908367,3.835,3.767394,3.65003,3.246978,3.177586,2.214206,1.430946,2.348394,2.802733,1.992301,1.676435
0.092017,0.095985,0.106568,0.099206,0.078788,0.074276,0.078273,0.081583,0.091533,0.100559,0.098069,0.10196,0.148184,0.524588,2.202867,3.98802,4.626296,4.50632,4.576893,4.262175,3.63762,3.65481,2.558806,1.65655,2.823622,3.353955,2.392573,2.009283
0.07906,0.08376,0.08691,0.07985,0.067046,0.065598,0.065924,0.070134,0.084673,0.091668,0.080433,0.080686,0.123799,0.482263,2.258094,4.430391,5.128289,5.009641,5.186658,4.5822,3.927174,4.239999,3.266423,2.357297,3.47553,3.98672,3.074599,2.59704
0.072702,0.076346,0.073189,0.070502,0.063214,0.059104,0.059236,0.06204,0.075385,0.085165,0.072873,0.069518,0.101218,0.460348,2.320707,4.943143,5.68488,5.50946,5.80742,5.033667,4.638928,5.336135,4.505544,3.661146,4.444638,4.738418,4.154408,3.830368
0.096862,0.101708,0.086835,0.088118,0.080649,0.063531,0.065265,0.072188,0.089179,0.109498,0.093547,0.084557,0.118295,0.638435,3.078712,6.793021,7.82506,7.195561,7.349411,6.494254,6.724863,8.255948,7.337142,6.331258,6.871386,6.812332,6.521868,6.437954
0.145139,0.150067,0.125315,0.128524,0.116624,0.085932,0.091475,0.108016,0.134278,0.164854,0.138336,0.124632,0.175309,1.029447,4.732341,10.26612,11.778662,10.578855,10.61989,9.606452,10.433184,13.149473,12.391456,11.30126,11.473112,10.941353,11.051442,10.99936
0.188732,0.193958,0.165606,0.171844,0.15973,0.117718,0.122441,0.147881,0.185347,0.226134,0.190849,0.170975,0.236483,1.476343,6.608937,14.070376,16.393984,15.037163,15.217002,14.221634,15.420864,19.085704,19.40853,19.007401,18.016512,16.619953,17.780039,17.67469
0.20338,0.212203,0.196372,0.204757,0.192726,0.145698,0.142834,0.172817,0.221778,0.268768,0.230032,0.202933,0.268691,1.759478,7.73578,16.463625,19.851716,18.988713,19.912248,19.401704,20.42064,24.153013,26.692506,28.042116,25.12711,22.722585,25.42685,25.221538
0.194411,0.208866,0.219163,0.224955,0.204624,0.16239,0.148276,0.178604,0.234327,0.27789,0.245513,0.219476,0.267972,1.721569,7.373216,15.784381,20.016338,20.250616,22.222081,23.01037,23.794776,26.577849,31.227528,34.267951,29.888629,27.036945,30.550053,30.546187
0.188903,0.207837,0.230943,0.231038,0.197999,0.165607,0.145565,0.178662,0.225069,0.260383,0.259568,0.244348,0.269418,1.57359,6.782337,13.826129,17.535714,18.507146,20.789722,23.368891,24.203392,24.626328,29.344204,32.758438,29.122749,27.24328,29.460527,29.448659
0.187061,0.209192,0.227714,0.218472,0.176918,0.157066,0.144053,0.174477,0.199282,0.233319,0.274633,0.263316,0.279774,1.567325,7.400538,13.857015,16.317017,17.257407,18.074311,20.672303,20.911094,18.240174,20.792125,23.21111,22.243395,22.659769,22.321168,21.353389
0.180079,0.19792,0.204072,0.204961,0.182721,0.164532,0.156158,0.168895,0.17449,0.217147,0.275319,0.25676,0.296714,1.826551,8.752628,15.443839,17.074826,18.417132,17.635447,17.443779,16.392932,12.56132,12.278249,12.904007,14.106741,15.668659,13.566456,11.907989
0.168032,0.169147,0.16519,0.182459,0.198249,0.184298,0.168756,0.160616,0.154566,0.201256,0.260431,0.246416,0.353294,2.556222,10.853121,17.695242,18.116382,19.345741,17.856682,15.539647,14.23775,10.586585,8.135208,7.68718,9.914437,11.528948,9.159502,6.809071
0.159838,0.147767,0.160757,0.182582,0.202111,0.190509,0.176315,0.161608,0.155956,0.200322,0.251362,0.252477,0.432053,3.446276,13.778749,20.497748,18.591816,18.984761,18.106545,16.833497,15.55846,11.015041,7.304547,6.505866,9.883951,11.724202,9.326085,6.671654
0.149985,0.132883,0.163298,0.190705,0.204279,0.184556,0.172201,0.161546,0.161876,0.197249,0.239972,0.254983,0.519641,4.066238,15.192755,21.305806,18.142104,17.729993,18.546692,19.230137,16.891541,12.069686,8.215132,6.556417,9.756575,11.056329,8.763352,6.950974
0.150443,0.132401,0.158858,0.186166,0.200133,0.175845,0.163305,0.153376,0.162265,0.206389,0.237494,0.241555,0.585977,4.078395,13.35014,18.554906,16.593135,15.451464,17.54346,20.057934,16.811677,12.626417,9.140402,6.361171,8.87212,9.24849,6.78474,6.212546
0.151842,0.131469,0.154771,0.174175,0.183641,0.157106,0.144409,0.140015,0.150475,0.213715,0.238903,0.224996,0.569215,3.275279,9.000185,13.258998,14.922521,14.388627,15.467702,18.43623,15.353747,11.728893,8.832475,5.760713,8.225494,8.376242,5.439087,5.086546
0.139691,0.127443,0.157846,0.168684,0.170309,0.14342,0.120599,0.120355,0.135328,0.199076,0.226392,0.215266,0.461834,2.038206,5.470961,9.903323,13.335549,12.704669,11.774861,13.673462,11.620467,8.829731,6.727732,4.547358,7.264942,7.86198,5.002957,4.311578
0.133618,0.136071,0.161621,0.162121,0.155404,0.13192,0.110583,0.107051,0.110056,0.156509,0.204859,0.213281,0.360483,1.137536,3.637465,7.535757,9.999177,8.936109,7.230006,7.972704,7.486275,5.645423,3.871564,2.782095,5.142116,6.022892,3.912111,3.138546
0.147245,0.15514,0.161098,0.158796,0.155521,0.131819,0.107573,0.101851,0.092645,0.114098,0.187546,0.209062,0.318262,0.896574,2.764372,5.45033,6.303558,5.116465,4.435674,5.018242,5.080379,3.601487,2.129082,1.543786,2.854028,3.592753,2.566703,1.949242
0.159716,0.163185,0.150798,0.14583,0.14277,0.120756,0.093815,0.090577,0.083625,0.09574,0.177586,0.193559,0.308349,0.90846,2.396036,3.824689,3.555653,2.774719,3.274527,4.516443,4.659295,3.370105,2.161951,1.346418,1.655769,2.10835,1.766894,1.301553
0.142447,0.147002,0.131534,0.118919,0.121679,0.10395,0.072455,0.077016,0.085432,0.099412,0.160789,0.178843,0.294537,0.852418,2.261673,3.13231,2.569625,2.235332,3.001677,4.231687,4.188885,3.210156,2.256923,1.397209,1.589079,1.757438,1.39753,1.003162
0.111461,0.112095,0.095222,0.093173,0.115461,0.106491,0.067408,0.070097,0.086754,0.113475,0.155044,0.15595,0.238536,0.646089,2.230645,3.676517,3.043179,2.445347,3.083328,3.908886,3.73916,2.873927,1.994523,1.310771,1.650359,1.613136,1.203143,1.021242
0.097542,0.084048,0.057489,0.084966,0.122917,0.111981,0.068483,0.065451,0.084016,0.128838,0.169488,0.137393,0.191828,0.430055,1.944144,3.916165,3.439023,2.49794,2.794605,3.064431,3.079413,2.540822,1.809174,1.232232,1.539663,1.486558,1.05505,1.034143
0.096166,0.071123,0.038603,0.08637,0.132767,0.112778,0.072379,0.067408,0.083483,0.142422,0.18776,0.130494,0.182816,0.363007,1.549251,3.471319,3.387532,2.439309,2.292862,2.155084,2.583183,2.807244,2.060788,1.20163,1.328609,1.500235,1.142938,0.990044
0.098422,0.075486,0.040163,0.090552,0.137622,0.112261,0.080991,0.075392,0.078858,0.144546,0.190063,0.116708,0.167692,0.334285,1.135159,2.550135,2.898552,2.586642,2.527486,2.49154,2.969407,3.387463,2.386866,1.046494,1.032851,1.532787,1.273775,0.844362
0.088274,0.074684,0.049452,0.09327,0.13956,0.119986,0.088296,0.085634,0.085486,0.143932,0.173542,0.118574,0.149672,0.312522,0.868076,1.770188,2.304965,2.730252,3.188296,3.305064,3.404931,3.65362,2.418259,0.736376,0.82938,1.681635,1.431451,0.818499
0.06762,0.066854,0.060509,0.091803,0.127194,0.11089,0.08094,0.094325,0.111444,0.147367,0.151825,0.131357,0.132261,0.29348,0.654359,1.541603,2.140057,2.560723,3.532141,3.921816,3.284549,3.34129,2.191119,0.497941,0.88569,1.96876,1.635779,0.865768
0.04518,0.066124,0.078811,0.099222,0.105013,0.082943,0.066077,0.100396,0.136717,0.154307,0.159472,0.151269,0.131627,0.270617,0.517623,1.490817,2.232865,2.364021,3.385855,3.974774,2.722145,2.783677,2.056696,0.496061,1.032467,2.091746,1.685856,0.838293
