0.000238,0.000187,0.000573,0.000388,0.000114,0.000649,0.000559,0.000872,0.000933,0.001103,0.00076,0.000622,0.000912,0.000809,0.000381,0.000403,0.000233,0.000733,0.000563,0.000692,0.000301,0.00014,0.000227,0.000537,0.000265,-4.2e-05,0.000413,0.000623,0.000446,0.000972,0.001166,0.00075,0.000745,0.000345,0.000471,0.000778,0.000781,0.000492,0.00078,0.000543,0.000326,0.000343,0.000347,0.001378,0.001168,0.0012,0.000772,0.001572,0.000851,0.000903,0.00099,0.001234,0.001392,0.001115,0.000789,6.2e-05,0.000387,0.001088,0.000816,0.000802,0.00031,0.002211,0.001933,0.001219,0.000466,0.000592,0.001033,0.000993,6e-04,0.000899,0.000899,0.000845,0.000958,0.001192,0.000776,7.5e-05,0.000383,0.000411,0.000394,0.001036,0.000778,0.000958,0.000929,0.000689,0.001609,0.001494,0.00116,0.000355,0.000811,0.000345,0.000443,0.001408,0.001013,0.000533,0.000404,0.00013,0.000635,0.000717,0.001754,0.001206,0.00116,0.000695,0.001211,0.000857,0.000444,0.000384,0.00056,0.00087,0.000699,0.00054,0.00034,0.000802,0.000617,0.000525,0.000643,0.000599,0.000873,0.000835,0.000318,0.000279,0.000306
0.000139,4.5e-05,-0.000111,8e-06,7.1e-05,-0.000785,-0.000264,-6.2e-05,-5.5e-05,0.000538,1.3e-05,-0.000271,3.9e-05,-0.000163,-0.00026,-0.000421,-0.000438,9.9e-05,-6.3e-05,-0.000268,-0.000273,-6e-05,-0.000111,0.000256,-0.00021,-0.000205,-0.000115,-0.000623,-0.000246,-0.000154,-0.000356,-0.00033,-3.4e-05,-7.5e-05,-0.000691,-0.000101,-0.000207,-1e-04,-0.000132,0.000157,-0.000128,0.000116,-0.000117,-0.000559,-9.9e-05,0.000422,5.5e-05,0.000162,0.000217,0.000211,-9e-06,0.000126,-0.000181,0.000135,-0.000147,-0.000116,0.000135,0.000128,-0.000203,0.000115,-0.000264,-0.000305,6.8e-05,6.5e-05,0.000106,0.000184,-9.8e-05,6.7e-05,0.000308,-1e-06,-0.000393,0.000318,0.000241,1.4e-05,-1.7e-05,-0.000287,-0.000293,-0.000728,-0.000674,-0.000641,-0.000415,-0.000153,0.000244,-5.2e-05,-0.000403,5.4e-05,8.1e-05,3.6e-05,-1.2e-05,3e-05,-0.000302,-0.000914,-0.000231,-7.2e-05,0.000182,4.3e-05,2.2e-05,-0.00028,-0.000366,0.000112,3.6e-05,-0.000229,-0.000647,-0.000242,9e-06,-4.8e-05,0.000173,0.00043,0.000312,0.000441,-0.000234,-0.000967,-0.000363,9.1e-05,0.000329,-8.9e-05,-5.6e-05,-9.1e-05,-0.000141,-0.000217,0.000128
-0.000365,-0.000445,4.7e-05,0.000102,0.000228,-7.6e-05,-0.000113,-8.4e-05,-0.000384,-2.2e-05,-0.000212,-0.000103,-0.000165,-8.5e-05,-0.000349,-0.000141,0.000288,0.000207,0.000259,-0.00018,-4.9e-05,-0.000143,0.000564,0.000306,7.4e-05,0.000226,-0.000304,-0.000121,-0.00014,-0.000179,-0.000557,5.3e-05,5.1e-05,6.4e-05,-7e-05,0.000446,-0.00042,-0.000154,-0.00027,-0.000649,-0.000583,-0.000265,0.000244,-0.000883,-0.000626,0.000458,0.000485,-0.000463,-7.5e-05,-0.000334,-9.4e-05,-0.000225,9.8e-05,-0.000296,-0.000293,-0.000422,-0.000532,-0.000491,-0.000842,-0.000661,0.000313,0.000198,-0.000158,-0.000417,-0.000175,0.000163,0.000108,-0.000563,-1.5e-05,-0.000896,-0.000516,-0.00042,-0.000399,0.000113,-0.000597,0.000158,0.000123,0.000283,2e-05,-0.000146,-0.000666,9.7e-05,0.000301,-4.2e-05,-0.000617,-0.000653,-0.000506,-0.000495,-9e-05,8.2e-05,-0.000277,-0.000724,7.5e-05,-0.000351,0.00012,-0.000419,-0.000706,-9.5e-05,-0.001034,-0.000108,-0.000116,7.2e-05,-0.000252,-0.000413,-6.2e-05,0.000106,0.000397,0.000115,-0.000215,3.9e-05,6.5e-05,-0.000545,8e-06,-3e-06,0.000524,-0.000426,-0.000287,-3e-04,-0.000143,-6.1e-05,-7.4e-05
-0.000141,-0.000139,8.2e-05,0.000197,-0.000204,0.00033,0.000269,3.7e-05,-0.000256,-0.000358,-0.000213,-0.000351,-0.000346,-0.000786,-0.00051,0.000284,0.000145,-7e-06,-0.000133,0.000154,4.6e-05,-0.000113,-1.6e-05,-0.000381,-0.00016,-3e-06,-0.000356,-0.000445,-0.000429,-0.000109,-0.000459,9.4e-05,0.000149,0.000118,-5.9e-05,-0.000217,-0.000264,-0.000385,-0.000242,-0.000606,-0.000386,-0.000222,0,-1e-05,-0.000775,-0.000504,0.000103,-0.00019,-4.9e-05,-7e-06,0.000225,0.000141,0.00033,-0.000305,-3e-06,0.00018,-0.000613,-0.000385,-0.000545,-0.00023,-0.000414,0.000151,-0.000729,-0.000642,-0.000347,-8.8e-05,-3e-06,-4.7e-05,-9.4e-05,-0.000287,0.000336,-0.000288,-0.000411,0.000345,-0.000513,1.2e-05,7.1e-05,0.000132,0.00037,0.000243,-0.000438,-0.00051,9e-06,0.000146,4.6e-05,-0.000245,-0.00054,-0.000266,0.000251,3.5e-05,0.000602,-2.9e-05,-2.3e-05,1e-05,-0.000133,-0.000412,-0.000179,0.00048,-0.000538,-0.000999,-0.000375,-0.000175,-7.5e-05,-0.00042,-9.7e-05,-0.000108,-0.000262,0.000416,0.00016,0.00042,8.6e-05,0.000228,0.000167,1e-05,9.2e-05,0.000112,-7.7e-05,-4.1e-05,9.2e-05,-0.000263,-7e-05
-0.000219,-8.7e-05,-0.000119,0.000138,0.000283,0.000219,0.000467,-2.3e-05,7.8e-05,-0.000268,-0.000194,-0.00012,-0.000962,-0.000563,2.6e-05,-7.1e-05,-0.000109,-0.000395,-0.000307,1.7e-05,-7.2e-05,-0.000138,-3.2e-05,7.1e-05,-2.9e-05,-0.000157,-5.9e-05,-6e-06,-0.000321,-0.000291,-0.000166,0.000319,-0.000153,-2.2e-05,-0.000118,-0.000339,0.000213,0.000211,-2.6e-05,9.4e-05,7.5e-05,0.000108,-6e-06,4.3e-05,-0.000548,-0.000385,-0.000529,-0.00041,-0.000269,6.5e-05,0.000205,0.000437,-1.4e-05,-0.000334,-0.000159,-0.000251,5.8e-05,-0.000705,-0.000182,-9.2e-05,6.8e-05,-0.000329,-0.001013,-0.000255,9.8e-05,-3.4e-05,-0.000158,-0.000264,-5.2e-05,-0.000263,3.5e-05,-0.000254,2.9e-05,-5e-05,-0.000333,-0.000434,-0.000482,-0.000328,0.000333,-0.00043,-1.6e-05,-0.000226,0.000129,-0.000298,0.00039,-0.000104,-0.000331,-0.000295,-0.000424,-0.000357,0.000429,0.00057,0.000269,-0.000572,-0.000502,3.5e-05,3.5e-05,0.000203,-0.000131,-0.000317,-9.3e-05,7.4e-05,-0.000195,-0.000355,-8e-06,0.000183,-0.000256,0.000101,-0.000346,-1.5e-05,-0.000171,9.9e-05,-0.000127,-0.000337,-0.000134,-0.000102,0.000367,-0.00053,-0.000243,7.5e-05,0.000145
-8e-05,2.3e-05,0,-0.000169,-4.7e-05,3.4e-05,0.000221,-5.4e-05,-2e-06,-9e-06,-0.000376,0.000124,-0.000276,-9.5e-05,0.000207,-3.3e-05,0.000207,5.1e-05,-8.8e-05,-0.00021,0.000127,-9e-06,-0.00012,1.3e-05,-0.000149,7.6e-05,0.000223,0.000198,0.000355,-7.2e-05,-1.7e-05,-6.1e-05,-0.000138,0.000171,0.000176,1.5e-05,0.000482,-0.000188,-0.000248,0.000198,0.000134,8.6e-05,-6.9e-05,-7.3e-05,0.000182,-5.3e-05,-0.000872,-0.000357,-0.000194,8.7e-05,1.3e-05,0.000181,-0.000287,-3.9e-05,-0.000345,-9.2e-05,-5.5e-05,-0.000477,-0.000258,0.000281,0.000331,0.00014,-0.000334,0.000231,-0.000325,-9.2e-05,9.1e-05,-0.000608,-0.000435,0.000144,0.000718,0.000386,1.2e-05,-0.000157,-0.000505,5.2e-05,5.6e-05,-1.8e-05,-0.000138,-7.9e-05,0.000317,-0.000308,6.5e-05,-0.000227,0.000303,1.2e-05,-0.00035,6.1e-05,3e-05,6.1e-05,-8e-06,7.8e-05,0.000411,0.000215,-3.6e-05,-0.000122,0.00022,9.3e-05,0.000133,0.000231,-0.00038,0.000146,-4.2e-05,6.8e-05,8.2e-05,-2.6e-05,6e-05,-5.7e-05,-9e-05,-0.000139,4.3e-05,-0.000124,4.6e-05,-8.2e-05,-0.000108,-0.000296,-0.000165,-0.000383,-0.000322,-0.000237,-0.000202
-0.000104,4.7e-05,-7.5e-05,-0.000321,6.5e-05,-0.000114,-0.000241,-0.000252,-0.000105,2.3e-05,-0.000246,0.000277,0.000241,0.000144,0.000173,-0.000235,0.000196,1.9e-05,-0.000252,4.8e-05,3.9e-05,9.8e-05,9e-06,-0.000261,-0.000382,0.000106,-0.000173,-3e-06,0.000112,-0.00013,-7.8e-05,-0.000221,-0.000199,-0.00012,-1.3e-05,-8.6e-05,-1e-05,-1.5e-05,-0.000173,0.000327,0.000155,-0.00018,-0.000246,-8.5e-05,0.000266,-0.000301,-0.000118,-0.00028,-0.000169,4.2e-05,-8.6e-05,-4e-06,-0.000289,-0.000399,-0.000658,-0.000123,-0.000132,1.3e-05,-6.6e-05,0.000317,0.000135,-3e-05,0.000145,0.00049,-0.000105,-0.00013,-0.000285,-8.6e-05,-0.000288,2.6e-05,-6.3e-05,-0.000208,-0.000289,-0.000359,1.3e-05,0.000135,0.000317,-0.000127,-0.000283,0.000164,0.000212,-7.4e-05,-0.000323,-0.000292,-7.6e-05,-4.7e-05,-0.000176,0.00028,5.2e-05,2e-04,7e-06,-6.7e-05,-0.000175,3e-04,0.000206,0.000158,-0.000417,-0.000317,0.000183,0.000277,-0.000473,0.000142,-0.000179,4.6e-05,-3.5e-05,-0.00018,-0.000111,-0.000236,-5.1e-05,-0.000238,1.7e-05,-0.000168,-0.000211,2.4e-05,-7.6e-05,-5.2e-05,-0.000336,-0.000118,-0.000183,-6e-05,-5.9e-05
7.7e-05,-5.5e-05,3.5e-05,1.2e-05,0.000182,-0.000185,-0.000142,-0.000161,-0.000215,-4.7e-05,-9e-05,4e-05,-2e-05,0.000105,0.000133,-0.000115,-0.000122,-0.000108,-0.000321,-0.000137,-0.000149,-1.2e-05,-0.000114,-8.5e-05,7.3e-05,-9.8e-05,3e-05,-3.7e-05,5.8e-05,-1.8e-05,1.3e-05,6e-06,3e-06,-0.000238,-0.00015,-7.3e-05,7.9e-05,8.3e-05,-4.9e-05,-8e-06,1.3e-05,-0.000126,-4.4e-05,-0.000328,-0.000158,5.1e-05,-0.000315,-0.000303,-0.000173,0.000186,-0.000391,6e-06,-0.000165,-0.000491,-3.6e-05,1.7e-05,-0.000266,-0.000121,0.000152,5e-05,-6.9e-05,-0.000167,-0.000144,0.000507,-8.9e-05,-9.7e-05,-0.000327,0.000117,-0.000256,3.2e-05,-0.000302,-0.000158,-0.000403,-0.000281,0.000127,0.000116,-0.000129,-0.000307,0.000147,2.3e-05,-6e-06,0.000231,-2e-04,-0.000228,0.000111,-7.5e-05,0.000254,-6e-06,0.000185,0.000158,-0.000124,-0.000284,-0.000544,7.7e-05,0.00011,3.7e-05,-3.6e-05,-0.000267,-0.00031,2e-05,-0.000221,-0.000162,-3.9e-05,-9.2e-05,-0.000209,-0.000174,-1.3e-05,-0.000132,-2.7e-05,-9.5e-05,-0.000154,-2.1e-05,-0.000236,-0.000163,-0.000186,-0.000105,-0.000185,5.8e-05,0.000159,9.8e-05,-3.8e-05
-3.4e-05,0.000193,2.2e-05,2.3e-05,9.7e-05,-3.4e-05,0.000131,2.2e-05,-0.000336,-0.000132,5.1e-05,-0.00017,1.8e-05,0.000152,-7e-06,9.2e-05,-0.000116,1.5e-05,-0.000108,-0.000112,-0.000131,8e-06,8.1e-05,-0.000101,-0.000142,5.9e-05,1.5e-05,0.000112,-1.7e-05,0.00013,5.9e-05,6e-06,-2.2e-05,-3.9e-05,-1.7e-05,0.000175,3.3e-05,-0.000164,-0.000336,-6.7e-05,-7.6e-05,-0.000257,-2.3e-05,-1e-06,-8.5e-05,0.00032,0.000119,-0.000101,-0.000239,3e-05,-0.000166,0.000284,6.6e-05,-7.5e-05,-0.000102,-2.3e-05,-3.6e-05,0.000392,7.2e-05,-0.000279,-0.000173,0.000136,-0.000128,1.4e-05,1.4e-05,-7.1e-05,-9.3e-05,2.9e-05,0.000182,0.000316,-0.000232,-0.000178,-0.000349,8.5e-05,-0.000176,-0.000203,-0.000184,4e-05,-0.000143,-0.000223,8.8e-05,0.000161,-0.000162,2.9e-05,6.5e-05,-6.2e-05,0.000322,-0.00011,3.1e-05,4.6e-05,-0.000168,0.000119,-0.000257,7.8e-05,1.9e-05,0.000206,-0.000213,2e-06,0.000124,5.2e-05,-8e-06,4.7e-05,0.000184,7e-06,-0.000246,-5.6e-05,4.5e-05,-0.000248,-0.000244,-0.000218,-8e-05,-7e-05,4.3e-05,-0.000101,-0.000109,-0.000182,-7e-06,7.9e-05,-9e-05,-7.4e-05,8e-06
0.00011,7.8e-05,6.1e-05,-0.000138,-4e-05,-4.5e-05,-6.4e-05,2.6e-05,-0.000136,-5.6e-05,7.1e-05,-0.000192,-0.000127,0.000284,-2.2e-05,7.2e-05,-1.3e-05,-4.3e-05,0.000128,3.9e-05,7.9e-05,-1e-06,-2.3e-05,-8e-06,5.1e-05,9.6e-05,2e-06,-5.3e-05,-9.3e-05,0.000191,3.3e-05,-1.3e-05,-0.000145,7.1e-05,-2.5e-05,0.00014,-1.8e-05,-8e-06,0.000192,8.3e-05,-2.7e-05,0.000186,3.6e-05,-3.2e-05,6e-05,0.000174,0.000194,2.1e-05,1.3e-05,-1.8e-05,-6.4e-05,7.3e-05,3e-05,0.000119,0.000258,0.000107,-1.9e-05,-3.9e-05,0.000119,-0.000366,-1.7e-05,-0.000239,-9.9e-05,-0.000124,0.000231,5.4e-05,-7.5e-05,-4.9e-05,5.3e-05,8.6e-05,1e-06,-5.1e-05,9.1e-05,-3.7e-05,-3.7e-05,-1.5e-05,0.000107,0.000196,-5.9e-05,-0.000239,1.1e-05,0.00013,-0.000172,-0.000147,-0.000198,-9e-05,4.5e-05,3.5e-05,-8.4e-05,5e-06,-0.000212,1.5e-05,2.8e-05,0.000164,8.2e-05,3.2e-05,2.2e-05,1.8e-05,0.000311,7.1e-05,0.000133,-6.4e-05,-4.9e-05,5.4e-05,4.6e-05,5e-06,-0.000114,-0.000182,-9.2e-05,-5.8e-05,-7.8e-05,-1.3e-05,0.000168,-9e-06,2e-06,2e-05,-7.9e-05,-0.000194,-3.2e-05,-5.6e-05,-2.5e-05
2e-06,3.2e-05,2.8e-05,-9e-06,-5e-05,-0.000109,-9.2e-05,-4.3e-05,5.8e-05,-5.9e-05,3.8e-05,-4.7e-05,-4.6e-05,9e-06,-7.1e-05,2e-05,4.9e-05,-7.4e-05,-8.8e-05,-1.1e-05,0.000139,-4.6e-05,-7e-06,-6.2e-05,4.8e-05,-7e-06,-3.1e-05,1.2e-05,-7.2e-05,-8.7e-05,4.5e-05,-1.3e-05,-0.000118,-6.9e-05,3.7e-05,-1.5e-05,-8.7e-05,-2.7e-05,0.000149,-3.7e-05,0,8.5e-05,-5e-05,-0.000179,0.000115,0.000145,-2.5e-05,9.2e-05,4.8e-05,-8.8e-05,-3.1e-05,-1e-06,-0.000109,4.8e-05,0.000166,-1.3e-05,0.000182,-8.3e-05,-9.8e-05,-2.9e-05,8e-06,-0.000197,-1.4e-05,4.5e-05,0.000132,7.1e-05,5.1e-05,2e-05,6.3e-05,7.5e-05,0,-2e-05,-1.3e-05,-1.5e-05,0.000158,-3e-05,-7.9e-05,3.5e-05,0.000105,-3.7e-05,-4e-05,-0.000141,-3.3e-05,-0.000253,-0.000109,-0.000102,-0.000196,-2.6e-05,-0.00013,3.5e-05,8.9e-05,-4.2e-05,5.1e-05,-1.9e-05,-0.000127,-9.3e-05,8.9e-05,3.8e-05,0.000122,-1.4e-05,0.000277,-4.8e-05,-0.00028,-5.1e-05,6.2e-05,-4.4e-05,-5.6e-05,1.2e-05,-6.8e-05,2.8e-05,0.000108,0.00012,8.6e-05,-1.6e-05,-2e-06,-1e-05,-8.2e-05,-9.6e-05,5.4e-05,7e-05,1.5e-05
2.2e-05,-0.000144,-3.8e-05,-2.1e-05,-5.5e-05,5.4e-05,0.000102,-1.7e-05,-5.5e-05,1.1e-05,-6.9e-05,-8.2e-05,-5.4e-05,-6.6e-05,-5.2e-05,9e-05,-4.7e-05,-7.9e-05,2e-05,-5e-05,-1.7e-05,1.2e-05,1.5e-05,3.1e-05,-3e-05,-3.3e-05,0.000103,2.4e-05,2.2e-05,1.3e-05,-1.1e-05,-2.7e-05,-7.1e-05,-2.7e-05,6.8e-05,-4.2e-05,-0.000108,-0.000113,3.6e-05,-0.000122,-2.5e-05,4.6e-05,-6.9e-05,1.8e-05,5.9e-05,-2.5e-05,-1.5e-05,0,-6.5e-05,-0.000183,-2.1e-05,-4.9e-05,-0.000134,-6.9e-05,2.4e-05,-5e-06,6.7e-05,4.8e-05,0.000101,2.9e-05,-2.7e-05,-3.3e-05,0,-0.000266,-0.000194,-2.7e-05,-2.1e-05,-4.4e-05,4.5e-05,-0.000149,2e-05,3.7e-05,0.000125,-0.000112,7.2e-05,-4.6e-05,0.00019,-6.4e-05,-5.5e-05,7.3e-05,-5e-06,-0.000201,1.9e-05,-8e-06,-0.000141,4e-06,-4.2e-05,-5.6e-05,-0.000209,-2.1e-05,-6.8e-05,-1.6e-05,-5.5e-05,0.00017,-8.6e-05,-2.5e-05,4.6e-05,4.2e-05,5.8e-05,2.5e-05,4.7e-05,-5.3e-05,-0.000144,-2.4e-05,-1.2e-05,-3.6e-05,-1.4e-05,-1.3e-05,2.8e-05,-9e-06,-5.4e-05,2.3e-05,-5e-06,-5.5e-05,-2.7e-05,-3.2e-05,8.3e-05,7.1e-05,-2e-05,0.000192,2.7e-05
-1.7e-05,-6.4e-05,-8e-06,3e-06,-2.9e-05,-1.1e-05,-6.6e-05,-1.9e-05,-0.000112,2e-05,-5.7e-05,-0.000136,-3.6e-05,5.5e-05,-8.1e-05,-0.000124,-5.4e-05,-3e-06,2.1e-05,4e-06,5.1e-05,7.7e-05,1.4e-05,5e-06,-2.4e-05,-0.000206,-1.7e-05,-5e-06,-1.5e-05,-8e-05,-4.3e-05,5e-06,1.7e-05,4e-05,7e-06,-3e-05,-1e-06,5e-06,-8.7e-05,-3.5e-05,-2.9e-05,4e-06,9e-06,-4.4e-05,-3.9e-05,-0.000122,4.9e-05,4.1e-05,-2.2e-05,-0.000152,3e-05,-0.000161,-4.8e-05,-5.2e-05,-3.1e-05,-4.5e-05,-0.000129,3e-06,-9.6e-05,-5.7e-05,-6e-06,2.9e-05,-3.3e-05,-0.000114,-0.000254,-4.6e-05,2.1e-05,0.000106,3.1e-05,-5.3e-05,1e-04,3.4e-05,-1.9e-05,-4.7e-05,9.9e-05,0,2.4e-05,2.3e-05,-6.3e-05,-5.8e-05,1.4e-05,7e-06,0.000131,3e-05,-8.8e-05,-4e-06,9.5e-05,-3.3e-05,-1.2e-05,-1.4e-05,-5.7e-05,2.7e-05,7e-06,0.000197,-7.2e-05,7e-05,0.000102,-4.5e-05,-3.3e-05,-5.2e-05,-2e-04,-0.000166,-5.8e-05,-3.3e-05,8.7e-05,-4.7e-05,4.9e-05,4.8e-05,-1.1e-05,-5.9e-05,-2.7e-05,8.1e-05,-2.2e-05,0.000193,-1.2e-05,4.3e-05,-4e-06,8.1e-05,2e-06,3.6e-05,2.3e-05
-1.5e-05,-4.3e-05,-1.6e-05,3.5e-05,-4e-05,-7e-06,0,-3.8e-05,4.4e-05,-1.4e-05,-1.6e-05,-5.9e-05,4.7e-05,7.5e-05,-1.7e-05,-4.3e-05,-6.5e-05,2.5e-05,-6.8e-05,-1.5e-05,1.6e-05,-6e-06,-2.6e-05,2e-05,2.8e-05,-1e-06,1e-06,-7e-06,-6e-06,-9.8e-05,3e-06,1e-05,6e-05,3.7e-05,-4.9e-05,1.3e-05,1.9e-05,1.8e-05,-8.6e-05,-0.000115,-7e-06,-3e-05,2.4e-05,4.4e-05,4.5e-05,-0.000103,-0.000125,4.5e-05,-1.7e-05,-1e-05,-2e-05,-0.00011,-3.1e-05,-8e-06,0.00013,2e-06,7.9e-05,0.000102,9.6e-05,6.3e-05,2.6e-05,0.000105,-3.6e-05,-7.1e-05,-0.000164,-2.5e-05,2e-05,5.4e-05,1.6e-05,-7.7e-05,7.6e-05,2e-06,-9e-05,4e-05,-1e-06,-2e-05,9.9e-05,-6.7e-05,6.4e-05,-3.3e-05,7e-06,0.000139,5.3e-05,1.7e-05,-4.1e-05,2e-06,7.5e-05,-3.1e-05,5.7e-05,-2.4e-05,2.5e-05,-3.2e-05,0,-1.7e-05,-1.8e-05,-0.000106,2e-06,3e-05,1.6e-05,-4.5e-05,-0.000159,-3e-06,1e-05,4e-06,-3.3e-05,-1.8e-05,2e-05,4.8e-05,2.6e-05,-1e-05,4e-06,-2e-06,1e-05,2.6e-05,-2e-05,3e-06,-4.2e-05,1.2e-05,1.7e-05,-3.9e-05,-1.4e-05
1.2e-05,-3.6e-05,1.2e-05,3.3e-05,-6.3e-05,-5.5e-05,1e-06,1.2e-05,1.8e-05,-9e-06,2.2e-05,6e-05,8e-06,2e-05,8e-06,-3.4e-05,9e-05,-1e-05,-4e-05,-1e-05,2e-06,-5.9e-05,7e-06,-8e-06,-5e-06,9e-06,8.9e-05,-1.2e-05,-1.8e-05,8.6e-05,1.3e-05,7e-06,3.1e-05,-2.2e-05,1e-05,1e-05,1.2e-05,-3e-05,2.8e-05,-3.9e-05,8e-06,-4.5e-05,3.1e-05,3e-05,7.5e-05,0.000106,2.3e-05,-6.2e-05,1.5e-05,4.8e-05,-4.9e-05,-2.5e-05,-4e-05,-2.6e-05,7.1e-05,-8e-06,2e-05,4.4e-05,-1.5e-05,7.3e-05,-3.8e-05,-3.8e-05,8e-06,-0.000104,-3e-05,-1.5e-05,-1.2e-05,1.4e-05,-6.3e-05,-4.7e-05,8.9e-05,1e-06,-4.6e-05,1.5e-05,-5.5e-05,-5e-06,6.4e-05,-3.3e-05,4.5e-05,7e-06,-9.1e-05,-3.2e-05,-2.6e-05,6.4e-05,-2.3e-05,2.5e-05,3.1e-05,0.000117,3.2e-05,2.5e-05,1.4e-05,-1.7e-05,6e-06,-5.7e-05,7e-06,4.9e-05,5.3e-05,-4.3e-05,2.3e-05,-1.6e-05,-2.1e-05,3e-06,-3e-06,2.1e-05,3e-05,4.8e-05,-2.9e-05,-4.5e-05,2.2e-05,-4.1e-05,-6e-06,5.4e-05,-4e-06,-9e-05,-2.3e-05,-1.7e-05,3.7e-05,-4.6e-05,-4.8e-05,-1.3e-05,-4e-06
1e-06,3.3e-05,-2.5e-05,-2.6e-05,-2e-06,-3.1e-05,1e-05,8e-06,9e-06,5e-06,2e-06,6.3e-05,-1.1e-05,-2.1e-05,-1.4e-05,-1.1e-05,3.4e-05,-1.8e-05,-1.1e-05,0,-2.6e-05,-4.4e-05,-1.2e-05,-6e-06,-1.1e-05,-1e-06,-2e-06,8e-06,1.8e-05,4.8e-05,-1.6e-05,1e-05,-2e-06,-3.9e-05,6e-06,-7e-06,1.4e-05,7e-06,2e-05,-4.4e-05,0,-4.2e-05,9e-06,-3e-05,1.5e-05,6.5e-05,-6e-05,1.5e-05,-2.1e-05,1.8e-05,-5.7e-05,-2e-06,4e-06,-3.4e-05,1.6e-05,6e-06,-4.7e-05,-6.6e-05,-5e-06,8.3e-05,9e-06,1.4e-05,3.4e-05,-8e-05,-6e-06,-2e-06,1e-06,-2.1e-05,5.7e-05,-2.8e-05,-4.4e-05,-5e-06,3.4e-05,6.3e-05,4.8e-05,3e-06,-1.6e-05,3.2e-05,-5.4e-05,-3e-06,-3.5e-05,-2.9e-05,-5.4e-05,-3.3e-05,-3e-05,6e-06,-1.9e-05,-1e-06,1.2e-05,1.1e-05,-5.8e-05,3.5e-05,-7e-05,-0.000115,-4.6e-05,4.6e-05,-8.3e-05,1.8e-05,-2e-06,-2.1e-05,1e-05,2.2e-05,9e-06,-4e-06,-1.8e-05,6.1e-05,-2.3e-05,-3e-05,-1.5e-05,-7e-06,1.3e-05,9e-06,-2e-06,-5.1e-05,3.3e-05,1e-06,1.3e-05,-1.9e-05,3.3e-05,1.4e-05,8e-06
3e-06,-1.8e-05,1e-05,-4e-05,4e-06,-1.7e-05,-8e-06,-1e-06,-1.9e-05,2e-06,6e-06,3.6e-05,-3e-06,3e-06,-2e-06,2.3e-05,1e-06,-8e-06,1.1e-05,-1e-05,-4e-05,5e-06,5e-06,-6e-06,2e-05,1.1e-05,-2e-05,-1e-05,7e-06,1.1e-05,6e-06,2e-06,-2.4e-05,1.5e-05,-1.8e-05,-1.6e-05,2.4e-05,1.7e-05,7e-06,2.8e-05,1e-06,9e-06,0,2.4e-05,-1.2e-05,-4.1e-05,-1.8e-05,-2.2e-05,-1.8e-05,-2e-06,-4.1e-05,-4e-06,-1.3e-05,1e-05,2.8e-05,1e-05,-5.5e-05,-2.2e-05,1.6e-05,1.9e-05,-1.2e-05,-2.6e-05,-1.9e-05,1.6e-05,3.3e-05,6e-06,-1.8e-05,2e-06,1.4e-05,-2.9e-05,-2.9e-05,-1.2e-05,-5.5e-05,-2.5e-05,5.2e-05,3e-06,2.8e-05,3.1e-05,4e-05,4.3e-05,-2.5e-05,-2.5e-05,-7.5e-05,-1.4e-05,7e-06,8e-06,-3.8e-05,-5.4e-05,-2.4e-05,-1e-05,2.9e-05,1e-06,-2.1e-05,4.2e-05,-5.6e-05,-3.1e-05,1.4e-05,-2e-06,-2e-05,-1.6e-05,4.2e-05,4e-05,0,-4e-06,-5e-05,2.8e-05,5e-06,-2.3e-05,1.7e-05,1.1e-05,-1e-05,1.6e-05,1.8e-05,-1e-06,1e-06,-1.7e-05,-3.1e-05,-1.7e-05,0,-3.3e-05,4e-06
-1e-06,8e-06,-8e-06,-3e-06,2.2e-05,-1e-06,-1.6e-05,-2e-06,-3.3e-05,-1e-06,-1.6e-05,4e-06,0,2e-05,2e-05,7e-06,-5e-06,6e-06,5e-06,2e-06,6e-06,4e-06,1e-06,-6e-06,-3e-06,-1.1e-05,-8e-06,-6e-06,6e-06,-1.3e-05,0,-1e-06,-1e-05,3e-06,1e-06,-2.1e-05,1.2e-05,-2.6e-05,0,2e-06,4e-06,1.6e-05,-2.3e-05,-1.4e-05,6e-06,-4.5e-05,2.9e-05,-5e-06,-6e-06,2.3e-05,-1.7e-05,1.3e-05,-6e-06,2.1e-05,2e-05,-5e-06,2.8e-05,1.1e-05,-6e-06,0,2.4e-05,-1.2e-05,-2.2e-05,4e-06,4.5e-05,0,1e-05,2e-06,1.2e-05,-8e-06,-3.6e-05,-1.3e-05,1e-05,-3e-05,-1.3e-05,0,-3.1e-05,2e-05,-1.5e-05,-1.9e-05,-2.2e-05,-1.2e-05,-2.6e-05,-4.4e-05,3e-05,4e-06,3e-06,1.5e-05,1.3e-05,-1.7e-05,-1.4e-05,-7e-06,1e-05,-1.3e-05,-2.8e-05,-2.6e-05,6e-06,1.9e-05,2.4e-05,-1.9e-05,5.4e-05,9e-06,9e-06,-2e-06,1e-05,-2e-06,3.1e-05,-2.4e-05,-2.6e-05,-3e-06,4e-06,1.1e-05,1.4e-05,5.4e-05,2e-06,-7e-06,0,3e-05,0,2.1e-05,-4e-06
0,-1.2e-05,6e-06,-8e-06,1.6e-05,-5e-06,2.7e-05,-7e-06,-2.2e-05,-1.3e-05,-2e-05,1.1e-05,1.8e-05,-2.3e-05,1.6e-05,5e-06,1.4e-05,6e-06,-8e-06,0,1e-05,-2.1e-05,1e-05,-2e-06,-2e-06,1.2e-05,6e-06,3e-06,-7e-06,-2.4e-05,-1e-06,-4e-06,-2e-06,-1.1e-05,-5e-06,-1.4e-05,1e-06,8e-06,3.4e-05,1.8e-05,3e-06,3.7e-05,-1.1e-05,-1.5e-05,3.6e-05,-1.9e-05,2e-06,2e-05,-3e-06,1.8e-05,2e-06,2.3e-05,-1.3e-05,-1.5e-05,1.3e-05,-2e-06,7e-06,2.6e-05,2e-06,-2.5e-05,-1.2e-05,1.3e-05,-7e-06,-2e-06,-3.1e-05,-2e-06,-3e-06,2.6e-05,6e-06,-8e-06,-4.2e-05,0,2.8e-05,-1.5e-05,6e-06,3e-06,1e-06,-2.9e-05,-2.3e-05,-1.2e-05,-2.2e-05,1e-06,1e-06,-1.4e-05,7e-06,0,3.2e-05,1.8e-05,1.7e-05,-1.3e-05,-1.1e-05,7e-06,1e-05,-5.5e-05,2.6e-05,1.9e-05,-2e-06,8e-06,-2.7e-05,2e-06,-2.6e-05,1.3e-05,-1e-06,4e-06,1.1e-05,-1.9e-05,-2e-06,8e-06,0,-5e-06,3e-06,1e-05,0,-3e-06,-9e-06,9e-06,1.4e-05,8e-06,-6e-06,0,3e-06
-6e-06,0,-5e-06,7e-06,1.5e-05,1.9e-05,-1e-05,0,5e-06,0,-6e-06,1.4e-05,-2e-06,-1.7e-05,1.1e-05,-1.5e-05,8e-06,-7e-06,-7e-06,-7e-06,6e-06,-1.7e-05,-5e-06,4e-06,2e-06,8e-06,-1.2e-05,-4e-06,3e-06,1.1e-05,-3e-06,0,5e-06,1e-06,1.1e-05,-1e-06,1e-06,7e-06,-1.8e-05,7e-06,2e-06,0,5e-06,1.5e-05,1.4e-05,-2e-06,-1.9e-05,-6e-06,2e-06,1e-05,1e-05,-4e-06,-4e-06,-3.2e-05,1.1e-05,0,-3.2e-05,1.4e-05,6e-06,-1.4e-05,3e-06,-1.7e-05,7e-06,7.6e-05,-6.6e-05,-6e-06,3e-06,7e-06,4e-06,-3e-06,-9e-06,4e-06,-5e-06,-1.5e-05,1.1e-05,-4e-06,3e-06,-2.6e-05,7e-06,-9e-06,-1.4e-05,4.1e-05,3.1e-05,7e-06,4e-06,1e-06,3e-05,-3e-06,1.7e-05,1.4e-05,1.3e-05,0,-9e-06,-4.7e-05,1.9e-05,2e-06,8e-06,2e-06,2e-06,3e-06,-5.2e-05,-4e-06,1.2e-05,-1e-06,6e-06,-1.7e-05,-1.1e-05,1.3e-05,-1e-06,3e-06,2e-06,1.4e-05,-2e-05,-3.4e-05,-5e-06,-1.1e-05,-1.3e-05,-1.9e-05,2e-06,-3e-06,2e-06
4e-06,1.4e-05,-1e-06,1.8e-05,2e-06,-3e-06,-1.3e-05,-1e-05,-2.7e-05,7e-06,-3e-06,-5e-06,-1.2e-05,3e-06,9e-06,-2.4e-05,-2.1e-05,-2e-06,-2e-06,-1e-06,-7e-06,-2e-06,-1e-06,1e-06,2e-06,-9e-06,-7e-06,-2e-06,6e-06,1e-06,4e-06,-1e-06,-1e-06,1.4e-05,-4e-06,5e-06,-2e-06,-2.1e-05,2e-06,2.2e-05,0,-5e-06,7e-06,-1.8e-05,-1.8e-05,-6e-06,-8e-06,0,-2.1e-05,1e-05,7e-06,7e-06,-5e-06,-6e-06,2.4e-05,-2e-06,0,-2e-05,5e-06,-4e-06,-4e-06,7e-06,4e-06,7e-06,-1.2e-05,-6e-06,5e-06,-6e-06,-1e-05,1.1e-05,1e-06,-1e-06,-6e-06,1.9e-05,0,-4e-06,-1e-06,-1.3e-05,1.4e-05,0,9e-06,4e-06,1.9e-05,-1.1e-05,9e-06,-3e-06,-2e-05,-2e-06,-5e-06,8e-06,-6e-06,-6e-06,3e-06,-2.5e-05,-1.1e-05,-6e-06,1.8e-05,-8e-06,-2.3e-05,-4e-06,-2.7e-05,-9e-06,-3e-06,-1e-06,6e-06,-1.2e-05,-9e-06,4e-06,-2e-06,-1.1e-05,-3e-06,7e-06,-2e-06,8e-06,-4e-06,1e-06,-6e-06,-1.5e-05,-7e-06,2e-06,-5e-06
-3e-06,1.9e-05,2e-06,2e-06,6e-06,5e-06,1.7e-05,3e-06,-1.7e-05,-3e-06,1e-06,-2.3e-05,-2e-06,-1e-06,5e-06,3e-06,-3e-05,-2e-06,-1.9e-05,1e-06,7e-06,1e-06,-6e-06,-1e-06,-4e-06,1.9e-05,8e-06,0,-3e-06,5e-06,-3e-06,2e-06,-8e-06,8e-06,0,4e-06,-6e-06,6e-06,-1.7e-05,6e-06,-1e-06,-7e-06,1.3e-05,7e-06,0,2.4e-05,-4.4e-05,6e-06,2e-06,-3e-06,1e-06,2.3e-05,-2e-06,3e-06,9e-06,2e-06,-1e-06,-2e-06,-6e-06,-2.3e-05,8e-06,-1.2e-05,-1.2e-05,2.6e-05,1.6e-05,0,-2e-06,2e-06,-4e-06,8e-06,3e-05,-2e-06,-2.1e-05,9e-06,2e-05,3e-06,0,1e-06,-9e-06,6e-06,3e-06,-1.5e-05,1.2e-05,-6e-06,-9e-06,3e-06,-1.3e-05,-1.8e-05,-1.8e-05,-4e-06,-8e-06,1e-06,1e-05,0,-2.2e-05,-8e-06,1e-05,-4e-06,0,-2e-06,-1.7e-05,1e-06,-7e-06,-2e-06,3e-06,5e-06,4e-06,9e-06,3e-06,-1.2e-05,-4e-06,7e-06,-3e-06,2.1e-05,3e-06,5e-06,1.4e-05,-6e-06,1e-06,1e-05,4e-06
2e-06,2e-06,-1e-06,-1.3e-05,6e-06,-1.1e-05,-3e-06,1e-06,7e-06,-2e-06,1e-06,-2.1e-05,3e-06,-1.9e-05,2e-06,-3e-06,0,-1e-06,-8e-06,-8e-06,2e-06,-2e-06,4e-06,0,5e-06,1e-05,-4e-06,1e-06,-3e-06,1.7e-05,2e-06,1e-06,-3e-06,-1.6e-05,-1e-06,-4e-06,-7e-06,2e-06,3e-06,-1e-06,0,-1.2e-05,-6e-06,3e-06,1.7e-05,1.2e-05,1.9e-05,-1.4e-05,-3e-06,-1.2e-05,-1.1e-05,4e-06,-4e-06,-1.3e-05,1.6e-05,3e-06,-8e-06,-6e-06,8e-06,-7e-06,-6e-06,2e-06,-7e-06,3.1e-05,3e-05,1e-06,3e-06,2e-06,8e-06,9e-06,1.8e-05,3e-06,-4e-06,4e-06,-1e-06,-3e-06,1e-05,6e-06,5e-06,-1.2e-05,4e-06,-2.4e-05,3e-06,-7e-06,-1.1e-05,0,-8e-06,9e-06,-1.1e-05,-1.2e-05,9e-06,0,-2e-06,-1.3e-05,-3e-06,1.3e-05,-1.7e-05,-1e-05,-2e-06,4e-06,5e-06,-1.2e-05,-1.2e-05,4e-06,2e-06,1.2e-05,9e-06,3e-06,0,3e-06,0,2e-06,1e-06,-1.1e-05,-1e-06,-9e-06,0,1.6e-05,8e-06,-1.6e-05,1e-06
0,1e-05,3e-06,-3e-06,-3e-06,-6e-06,-8e-06,-1e-06,-2e-06,-1e-06,-7e-06,-4e-06,8e-06,-1.8e-05,-3e-06,1e-05,1e-05,-1e-06,3e-06,5e-06,-1.5e-05,-2e-06,0,0,1e-06,1e-06,-3e-06,-2e-06,-4e-06,-9e-06,0,0,3e-06,-2e-06,-2e-06,-6e-06,-3e-06,-1.2e-05,1.7e-05,-1e-06,0,-1.1e-05,-4e-06,-1e-05,7e-06,-1.4e-05,7e-06,8e-06,-3e-06,-1.2e-05,-1.3e-05,-2e-06,-3e-06,-1.4e-05,-4e-06,-1e-06,-8e-06,3e-06,-2e-06,1.5e-05,2e-06,1.2e-05,2e-06,2e-06,1.7e-05,1e-06,-5e-06,-1e-06,1.1e-05,5e-06,1.4e-05,1e-06,-8e-06,-1e-06,-1.1e-05,-2e-06,-1.6e-05,1.6e-05,1.5e-05,-2e-06,9e-06,2e-06,-1.5e-05,-3e-06,-2e-06,-2e-06,1.1e-05,1.4e-05,-4e-06,0,-6e-06,4e-06,-1.7e-05,-1.3e-05,1.9e-05,-5e-06,1.4e-05,7e-06,-1.1e-05,5e-06,4e-05,-3e-06,-5e-06,-3e-06,-3e-06,8e-06,3e-06,-1.4e-05,1e-06,-2e-06,4e-06,3e-06,4e-06,-1e-06,6e-06,2e-06,-1.1e-05,2e-06,-1.1e-05,-1.2e-05,-3e-06
-1e-06,-6e-06,-5e-06,1e-06,-9e-06,-1e-05,2e-06,0,-1.6e-05,2e-06,-1e-05,2e-06,-3e-06,2e-06,-7e-06,1.3e-05,5e-06,0,1e-06,-4e-06,-8e-06,-5e-06,3e-06,-2e-06,0,-1.4e-05,-1e-06,2e-06,3e-06,-1e-05,0,0,6e-06,7e-06,2e-06,-1e-06,0,5e-06,5e-06,-1e-06,-1e-06,1e-05,-4e-06,1.2e-05,-1.1e-05,-1.5e-05,8e-06,-6e-06,-5e-06,-9e-06,-1.1e-05,1e-06,-3e-06,3e-06,-1e-06,0,-5e-06,1.1e-05,2e-06,1.4e-05,-6e-06,-1e-05,3e-06,-1.9e-05,-1.5e-05,2e-06,1e-06,1e-05,-1e-06,6e-06,-1e-06,-3e-06,-4e-06,-1.6e-05,1e-05,0,1.1e-05,2e-06,-2e-05,0,1.2e-05,2e-05,-1.6e-05,-5e-06,-1e-05,2e-06,9e-06,-1.9e-05,1.1e-05,1.1e-05,-4e-06,-5e-06,-5e-06,-1.1e-05,7e-06,-1e-05,-1.3e-05,0,-2e-06,-1e-06,1e-05,-3e-06,-3e-06,1e-06,-1.3e-05,3e-06,-5e-06,-9e-06,1e-06,0,-4e-06,2e-06,1e-06,-2e-06,0,0,5e-06,-7e-06,1e-06,3e-06,2e-06
0,-1e-06,6e-06,-2e-06,-9e-06,-2e-06,4e-06,-3e-06,-2e-06,-1e-06,-4e-06,-1e-06,-6e-06,2e-06,-7e-06,-1e-05,-6e-06,1e-06,-3e-06,-1e-06,-4e-06,-4e-06,-2e-06,-1e-06,1e-06,-2e-05,2e-06,-1e-06,-1e-06,3e-06,-1e-06,0,3e-06,-4e-06,-2e-06,2e-06,0,3e-06,-6e-06,-7e-06,0,8e-06,0,-7e-06,-7e-06,-5e-06,-1e-06,3e-06,-5e-06,-3e-06,-4e-06,-9e-06,-3e-06,1e-06,-1e-06,0,-1e-05,-5e-06,2e-06,8e-06,9e-06,1.2e-05,-2e-06,1e-06,-3.4e-05,-1e-06,-1e-06,-3e-06,-3e-06,2e-06,-8e-06,-2e-06,-2e-06,4e-06,6e-06,-1e-06,-1.5e-05,-8e-06,7e-06,2e-06,5e-06,1.2e-05,-1.6e-05,-1e-06,-5e-06,0,5e-06,-1e-06,1e-06,3e-06,2e-06,3e-06,2e-06,1.2e-05,-9e-06,7e-06,2e-06,9e-06,2e-06,-1e-06,-2.3e-05,-6e-06,0,-1e-06,-3e-06,-2e-06,-8e-06,-2e-06,0,6e-06,1e-06,-5e-06,3e-06,-1e-05,-2e-06,-6e-06,5e-06,-1.2e-05,1e-06,-1e-06,2e-06
-1e-06,-8e-06,-5e-06,2e-06,-5e-06,-3e-06,-1e-06,1e-06,-9e-06,-1e-06,-3e-06,-1e-06,1e-06,-1e-05,-5e-06,0,8e-06,-2e-06,-6e-06,2e-06,1e-05,0,0,1e-06,1e-06,2e-06,-5e-06,1e-06,0,-5e-06,1e-06,0,-2e-06,-4e-06,2e-06,3e-06,1e-06,-9e-06,-1e-06,-9e-06,0,8e-06,4e-06,0,1e-05,9e-06,-1.6e-05,-1e-06,2e-06,2e-06,0,-1.1e-05,-2e-06,-1.4e-05,5e-06,-1e-06,5e-06,-6e-06,0,6e-06,-8e-06,-1.2e-05,-6e-06,-1.7e-05,-2.4e-05,-2e-06,0,-4e-06,1e-06,0,-1.4e-05,1e-06,9e-06,-2e-06,-4e-06,1e-06,-7e-06,-1.4e-05,0,3e-06,4e-06,-9e-06,-2e-06,-8e-06,-1e-06,1e-06,-1.1e-05,1e-05,-1e-06,-6e-06,-1e-06,-1e-06,2e-06,6e-06,-1.1e-05,6e-06,-1e-06,1e-06,-5e-06,1e-06,-1.5e-05,4e-06,-1e-06,2e-06,1.1e-05,-1e-06,2e-06,-5e-06,-2e-06,-3e-06,-1e-06,2e-06,-6e-06,5e-06,-5e-06,3e-06,-8e-06,-3e-06,-5e-06,2e-06,-3e-06
0,4e-06,4e-06,3e-06,-4e-06,5e-06,-9e-06,-2e-06,-9e-06,-1e-06,-1e-06,8e-06,2e-06,-1e-05,-5e-06,-1.2e-05,1.5e-05,-1e-06,-3e-06,-2e-06,3e-06,5e-06,-1e-06,0,-1e-06,2e-06,0,-1e-06,-3e-06,8e-06,0,-1e-06,-4e-06,2e-06,-2e-06,1e-06,2e-06,5e-06,5e-06,-6e-06,0,-1e-06,4e-06,5e-06,4e-06,1.1e-05,-1.7e-05,1e-06,-4e-06,1e-06,5e-06,-5e-06,0,-1.3e-05,-2e-06,0,-2e-06,-1e-06,1e-06,0,4e-06,5e-06,-1e-06,-3.3e-05,-1.6e-05,-1e-06,2e-06,3e-06,-7e-06,0,-1.5e-05,0,-1.1e-05,8e-06,3e-06,0,3e-06,-6e-06,-3e-06,-4e-06,4e-06,-1.2e-05,6e-06,-7e-06,0,0,-8e-06,-1e-06,-4e-06,-5e-06,-4e-06,1e-06,-3e-06,2.2e-05,-2e-06,-1.1e-05,6e-06,-2e-06,2e-06,2e-06,-1.3e-05,0,-1e-06,-1e-06,-2e-06,-1e-06,7e-06,5e-06,1e-06,-6e-06,2e-06,-3e-06,-3e-06,3e-06,0,0,0,7e-06,3e-06,-2e-06,2e-06
0,-7e-06,-2e-06,-5e-06,0,1e-06,1e-05,2e-06,-4e-06,1e-06,-1e-06,1.1e-05,3e-06,4e-06,-3e-06,-2e-06,8e-06,0,-5e-06,-2e-06,-1e-06,0,0,0,1e-06,0,2e-06,1e-06,3e-06,2e-06,0,1e-06,-3e-06,7e-06,2e-06,0,2e-06,2e-06,-9e-06,-2e-06,0,-4e-06,-1e-06,-8e-06,-8e-06,8e-06,1.1e-05,-1e-06,-1e-06,2e-06,3e-06,2e-06,-1e-06,1e-06,0,1e-06,-1.2e-05,-2e-06,-1e-06,-1e-06,-4e-06,0,2e-06,-1e-06,6e-06,0,-1e-06,0,4e-06,-1e-06,-2e-06,-2e-06,0,2e-06,-2e-06,-1e-06,-1.4e-05,5e-06,-2e-06,-3e-06,3e-06,-1e-06,1.1e-05,-9e-06,2e-06,-1e-06,1e-06,2e-06,-1e-06,5e-06,3e-06,-2e-06,4e-06,6e-06,2e-06,3e-06,-1e-06,-2e-06,-1e-06,-1e-06,-7e-06,4e-06,-1e-06,0,1e-06,2e-06,3e-06,8e-06,-3e-06,1e-06,-1e-06,-1e-06,-1e-06,8e-06,1e-06,-4e-06,6e-06,2e-06,1e-06,3e-06,0
1e-06,1e-06,0,0,1e-06,3e-06,0,-1e-06,-9e-06,0,-4e-06,4e-06,-1e-06,6e-06,-1e-06,3e-06,-1.1e-05,0,-5e-06,2e-06,4e-06,-6e-06,0,0,1e-06,-1e-06,-3e-06,0,-1e-06,-3e-06,1e-06,-1e-06,1e-06,-3e-06,-1e-06,-2e-06,1e-06,-8e-06,8e-06,-3e-06,0,-3e-06,-2e-06,6e-06,-6e-06,-8e-06,0,0,-6e-06,3e-06,0,-4e-06,-1e-06,0,-1e-06,0,-3e-06,8e-06,2e-06,-2e-06,5e-06,-4e-06,0,-1.4e-05,1.9e-05,0,2e-06,0,-2e-06,-3e-06,-1e-06,1e-06,-2e-06,-4e-06,-3e-06,0,1.1e-05,8e-06,7e-06,1e-06,-3e-06,2e-06,1.1e-05,-2e-06,1e-06,1e-06,9e-06,-7e-06,6e-06,4e-06,1e-06,1e-06,3e-06,5e-06,1e-06,6e-06,0,-5e-06,-1e-06,-2e-06,1.6e-05,4e-06,0,0,3e-06,1e-06,-5e-06,0,3e-06,-2e-06,0,-3e-06,2e-06,1e-06,4e-06,3e-06,-3e-06,-3e-06,-4e-06,-7e-06,-2e-06
-1e-06,-5e-06,1e-06,4e-06,2e-06,-3e-06,-8e-06,0,-1e-05,0,-5e-06,-2e-06,-2e-06,-6e-06,3e-06,4e-06,-8e-06,0,-2e-06,-3e-06,0,-3e-06,0,0,-1e-06,-1e-06,0,0,1e-06,1e-06,0,1e-06,2e-06,-4e-06,0,-1e-06,0,5e-06,-5e-06,-2e-06,0,-6e-06,-4e-06,-2e-06,3e-06,-1.2e-05,1.4e-05,-1e-06,1e-06,3e-06,-4e-06,1e-06,-1e-06,-1e-05,-4e-06,-1e-06,6e-06,-3e-06,-1e-06,-7e-06,-2e-06,6e-06,-3e-06,-1.5e-05,4e-06,1e-06,-1e-06,3e-06,8e-06,-4e-06,1.1e-05,1e-06,-8e-06,-1e-06,5e-06,0,-8e-06,5e-06,-3e-06,-1e-06,-4e-06,9e-06,2e-06,-1e-06,4e-06,0,-1e-06,-2e-06,1e-06,-2e-06,-3e-06,0,-1e-06,1.4e-05,-2e-06,-4e-06,5e-06,1e-06,6e-06,0,1.3e-05,0,0,1e-06,-2e-06,-1e-06,-6e-06,1e-06,-2e-06,-2e-06,-1e-06,-1e-06,2e-06,-1.8e-05,0,-2e-06,-3e-06,-8e-06,2e-06,4e-06,1e-06
1e-06,-5e-06,-2e-06,0,3e-06,-2e-06,5e-06,0,1e-06,0,-3e-06,-2e-06,0,-3e-06,2e-06,5e-06,-1e-06,-2e-06,1e-06,0,-2e-06,2e-06,0,0,1e-06,3e-06,1e-06,0,-1e-06,-6e-06,0,-1e-06,1e-06,2e-06,-1e-06,1e-06,0,0,6e-06,2e-06,0,0,1e-06,-2e-06,4e-06,0,-6e-06,1e-06,-1e-06,3e-06,-5e-06,5e-06,-1e-06,-8e-06,-3e-06,1e-06,-6e-06,-1e-06,-1e-06,-6e-06,0,-7e-06,-2e-06,1.2e-05,-1.6e-05,0,0,-3e-06,-6e-06,-1e-06,7e-06,-1e-06,-2e-06,-5e-06,-2e-06,-1e-06,2e-06,-1e-06,-3e-06,1e-06,-3e-06,3e-06,-3e-06,-3e-06,-1e-06,0,-1e-06,1.1e-05,1e-06,-4e-06,2e-06,0,-6e-06,8e-06,-3e-06,-2e-06,-9e-06,0,-5e-06,0,-5e-06,1e-06,0,0,2e-06,-2e-06,2e-06,-2e-06,1e-06,4e-06,1e-06,-2e-06,0,2e-06,0,-3e-06,4e-06,-2e-06,0,-3e-06,0
-1e-06,4e-06,2e-06,-1e-06,4e-06,-3e-06,2e-06,-1e-06,-5e-06,0,-3e-06,0,1e-06,8e-06,2e-06,-2e-06,0,0,-2e-06,1e-06,-7e-06,1e-06,-1e-06,0,0,1e-06,0,0,1e-06,2e-06,0,0,-1e-06,1e-06,0,1e-06,-1e-06,-6e-06,1e-06,4e-06,0,1e-06,3e-06,5e-06,-5e-06,7e-06,-1e-05,-2e-06,-4e-06,2e-06,-4e-06,-1e-06,-1e-06,1e-06,-3e-06,0,-1e-05,-2e-06,2e-06,1e-06,-1e-06,4e-06,1e-06,4e-06,-2e-05,-1e-06,0,-1e-06,1e-06,-2e-06,6e-06,-1e-06,2e-06,3e-06,-4e-06,0,3e-06,-7e-06,7e-06,-2e-06,-5e-06,-4e-06,-9e-06,-2e-06,1e-06,0,-5e-06,-4e-06,-4e-06,0,0,0,-1e-06,1.5e-05,-3e-06,4e-06,6e-06,4e-06,5e-06,0,-6e-06,-2e-06,-1e-06,0,-5e-06,-1e-06,6e-06,-5e-06,0,1e-06,0,-2e-06,1e-06,1.3e-05,-2e-06,3e-06,0,4e-06,-2e-06,1e-06,-1e-06
0,-3e-06,-2e-06,0,2e-06,-2e-06,-3e-06,1e-06,-1e-05,1e-06,-1e-06,-2e-06,1e-06,5e-06,3e-06,-5e-06,-1e-05,0,-3e-06,-2e-06,1e-06,-3e-06,1e-06,0,0,0,-2e-06,0,0,4e-06,1e-06,0,-1e-06,-2e-06,0,0,-1e-06,4e-06,-1e-06,2e-06,0,8e-06,2e-06,-5e-06,-5e-06,4e-06,-7e-06,3e-06,1e-06,-1e-06,-1e-06,1e-06,0,-2e-06,-1e-06,-1e-06,4e-06,-1e-06,-3e-06,2e-06,2e-06,-1e-06,1e-06,3e-06,-1.2e-05,0,-1e-06,2e-06,-2e-06,-2e-06,3e-06,0,-3e-06,3e-06,2e-06,0,-5e-06,-7e-06,-6e-06,-1e-06,-6e-06,-9e-06,-7e-06,-7e-06,1e-06,0,1e-06,-6e-06,-2e-06,4e-06,-3e-06,1e-06,0,-3e-06,-3e-06,0,-4e-06,1e-06,0,-1e-06,-9e-06,-1e-06,-1e-06,0,-2e-06,1e-06,2e-06,-1e-06,-1e-06,-2e-06,0,-2e-06,-2e-06,-1e-06,0,-2e-06,-4e-06,1e-06,0,-2e-06,1e-06
0,4e-06,2e-06,-2e-06,1e-06,-1e-06,-2e-06,-2e-06,-2e-06,0,-1e-06,-4e-06,-1e-06,-5e-06,3e-06,-1e-06,-5e-06,0,-2e-06,0,5e-06,-4e-06,-1e-06,0,0,4e-06,2e-06,0,0,-3e-06,-1e-06,0,0,-2e-06,1e-06,-1e-06,-1e-06,0,-4e-06,2e-06,0,-1e-06,0,3e-06,2e-06,1e-06,3e-06,-3e-06,-3e-06,-2e-06,1e-06,5e-06,0,-1.1e-05,-2e-06,1e-06,0,3e-06,2e-06,1e-06,-2e-06,-2e-06,-1e-06,1.6e-05,2e-06,0,1e-06,-1e-06,0,0,-4e-06,0,-2e-06,0,-1e-06,-1e-06,4e-06,-1e-06,2e-06,1e-06,-5e-06,1e-06,-3e-06,-2e-06,-3e-06,1e-06,2e-06,4e-06,1e-06,0,2e-06,-1e-06,1e-06,3e-06,3e-06,-2e-06,2e-06,1e-06,1e-06,0,-8e-06,-1e-06,-1e-06,0,6e-06,1e-06,-4e-06,0,2e-06,1e-06,0,-2e-06,-1e-06,-8e-06,0,-1e-06,1e-06,-2e-06,0,4e-06,0
0,3e-06,-2e-06,-1e-06,-1e-06,0,4e-06,2e-06,-4e-06,0,-3e-06,-2e-06,0,-1e-06,1e-06,-4e-06,7e-06,0,-3e-06,0,2e-06,-1e-06,1e-06,0,0,2e-06,0,0,0,2e-06,0,0,1e-06,3e-06,0,-1e-06,0,-4e-06,3e-06,2e-06,0,0,-2e-06,0,2e-06,0,3e-06,2e-06,1e-06,-1e-06,2e-06,0,-1e-06,-6e-06,-1e-06,0,-5e-06,1e-06,-2e-06,2e-06,2e-06,4e-06,-2e-06,1.5e-05,1.2e-05,0,-1e-06,0,0,1e-06,-4e-06,-1e-06,0,1e-06,-2e-06,0,-1e-06,5e-06,0,-1e-06,-2e-06,3e-06,0,-5e-06,0,0,4e-06,-1e-06,0,-4e-06,0,0,-1e-06,0,6e-06,0,-2e-06,-3e-06,1e-06,0,5e-06,-2e-06,-1e-06,0,-3e-06,3e-06,-4e-06,0,-1e-06,-1e-06,0,0,0,-3e-06,2e-06,2e-06,2e-06,-5e-06,-3e-06,0,0
0,0,1e-06,3e-06,-1e-06,1e-06,1e-06,-1e-06,-9e-06,0,-3e-06,0,1e-06,9e-06,0,2e-06,1.2e-05,0,-3e-06,0,-1e-06,0,-1e-06,0,0,-1e-06,-1e-06,0,-1e-06,-1e-06,0,0,1e-06,1e-06,0,0,0,4e-06,0,1e-06,0,-1e-06,-2e-06,-3e-06,-2e-06,-5e-06,1e-05,-1e-06,-3e-06,-2e-06,1e-06,0,0,1e-06,-3e-06,0,-4e-06,-2e-06,1e-06,2e-06,-2e-06,-5e-06,-1e-06,-3e-06,9e-06,0,1e-06,1e-06,1e-06,0,-5e-06,0,-3e-06,-4e-06,2e-06,0,-3e-06,6e-06,1e-06,0,-2e-06,5e-06,4e-06,-2e-06,-1e-06,0,-2e-06,3e-06,2e-06,-2e-06,-2e-06,1e-06,2e-06,2e-06,0,3e-06,4e-06,0,0,0,9e-06,0,0,-1e-06,0,1e-06,1e-06,3e-06,0,-3e-06,1e-06,-2e-06,0,5e-06,1e-06,-2e-06,-2e-06,-2e-06,1e-06,-1e-06,1e-06
0,1e-06,-1e-06,1e-06,-1e-06,0,-6e-06,0,-3e-06,0,-2e-06,2e-06,0,2e-06,0,3e-06,3e-06,0,-2e-06,0,-1e-06,0,1e-06,0,1e-06,-4e-06,1e-06,0,1e-06,-3e-06,0,0,-1e-06,-1e-06,0,0,0,-1e-06,-1e-06,1e-06,0,-2e-06,0,4e-06,-3e-06,-5e-06,-5e-06,0,0,-2e-06,0,1e-06,-1e-06,-3e-06,-1e-06,1e-06,0,1e-06,-1e-06,2e-06,2e-06,5e-06,1e-06,1.2e-05,-2e-06,0,-1e-06,-1e-06,2e-06,0,-1e-06,1e-06,-2e-06,0,-2e-06,0,6e-06,1e-06,-2e-06,-2e-06,-1e-06,-1e-06,5e-06,-3e-06,-1e-06,1e-06,-4e-06,0,-2e-06,3e-06,2e-06,-1e-06,1e-06,-3e-06,-7e-06,-2e-06,-2e-06,-2e-06,-1e-06,0,1e-06,-1e-06,0,0,1e-06,-1e-06,5e-06,1e-06,0,2e-06,-1e-06,-1e-06,1e-06,6e-06,1e-06,0,-1e-06,2e-06,0,1e-06,0
0,1e-06,0,-1e-06,-1e-06,0,4e-06,0,-4e-06,0,-2e-06,1e-06,0,-5e-06,-1e-06,0,-1e-06,0,0,0,2e-06,-1e-06,-1e-06,0,0,-2e-06,0,0,-1e-06,4e-06,0,0,-1e-06,-1e-06,-1e-06,0,0,-3e-06,3e-06,0,0,-2e-06,0,-4e-06,1e-06,3e-06,-2e-06,1e-06,-1e-06,0,-2e-06,0,0,-9e-06,-1e-06,0,-1e-06,-3e-06,0,1e-06,-2e-06,-3e-06,0,4e-06,-1.4e-05,0,0,0,-3e-06,1e-06,-1e-06,0,-3e-06,0,-2e-06,0,-4e-06,-4e-06,2e-06,0,1e-06,-2e-06,4e-06,-5e-06,0,0,-1e-06,-5e-06,0,3e-06,1e-06,0,-1e-06,-5e-06,-4e-06,-1e-06,-2e-06,3e-06,1e-06,0,-4e-06,0,0,-1e-06,0,-2e-06,1e-06,0,-1e-06,1e-06,1e-06,0,0,-3e-06,-1e-06,2e-06,2e-06,1e-06,-2e-06,-2e-06,0
0,-2e-06,1e-06,-1e-06,-1e-06,-2e-06,3e-06,0,-9e-06,0,-2e-06,0,-1e-06,0,-1e-06,1e-06,2e-06,0,-1e-06,-1e-06,-2e-06,-2e-06,1e-06,0,0,1e-06,0,0,1e-06,-1e-06,0,0,0,1e-06,1e-06,0,0,4e-06,-4e-06,-1e-06,0,0,2e-06,1e-06,1e-06,7e-06,-7e-06,0,-1e-06,1e-06,-2e-06,-3e-06,0,-5e-06,-1e-06,-1e-06,-2e-06,3e-06,0,-1e-06,1e-06,1e-06,-1e-06,-1.4e-05,-1.8e-05,0,0,1e-06,1e-06,1e-06,1e-06,0,0,1e-06,2e-06,0,3e-06,-6e-06,1e-06,0,3e-06,-3e-06,1e-06,-3e-06,0,0,3e-06,4e-06,0,-2e-06,-2e-06,0,-2e-06,-4e-06,5e-06,2e-06,4e-06,-1e-06,-1e-06,0,-5e-06,1e-06,-1e-06,0,2e-06,-1e-06,-4e-06,1e-06,0,-1e-06,0,-1e-06,0,-5e-06,-1e-06,-3e-06,0,-3e-06,1e-06,1e-06,1e-06
0,2e-06,-1e-06,0,0,0,-4e-06,1e-06,-2e-06,-1e-06,-2e-06,0,0,6e-06,-1e-06,-1e-06,4e-06,0,-2e-06,1e-06,-3e-06,-2e-06,-1e-06,0,1e-06,1e-06,0,0,-1e-06,1e-06,0,0,0,0,-1e-06,0,0,-2e-06,4e-06,-1e-06,0,3e-06,1e-06,1e-06,-1e-06,2e-06,0,-1e-06,0,0,-1e-06,0,0,1e-06,-1e-06,0,-3e-06,0,-2e-06,-2e-06,0,2e-06,-1e-06,2e-06,-8e-06,0,0,-1e-06,-3e-06,0,2e-06,0,-2e-06,2e-06,-1e-06,0,3e-06,-2e-06,-2e-06,0,2e-06,0,-1e-06,-4e-06,0,0,1e-06,1e-06,0,-3e-06,1e-06,1e-06,1e-06,-7e-06,7e-06,-1e-06,-5e-06,2e-06,0,0,-5e-06,0,0,-1e-06,-2e-06,0,-4e-06,-1e-06,0,1e-06,0,0,0,1e-06,-1e-06,0,-1e-06,-4e-06,-1e-06,-1e-06,0
0,-4e-06,2e-06,0,1e-06,-1e-06,0,-1e-06,-4e-06,0,-2e-06,0,1e-06,0,-1e-06,0,-6e-06,0,-2e-06,-1e-06,1e-06,-1e-06,1e-06,0,0,-1e-06,0,0,1e-06,2e-06,0,0,0,-1e-06,1e-06,0,0,-3e-06,-2e-06,-1e-06,0,-1e-06,-1e-06,-3e-06,0,-3e-06,1e-06,1e-06,-3e-06,1e-06,0,0,0,-4e-06,-1e-06,0,-2e-06,-1e-06,1e-06,-1e-06,0,-4e-06,0,-8e-06,5e-06,0,1e-06,-1e-06,3e-06,0,0,0,-1e-06,-3e-06,-2e-06,0,-5e-06,3e-06,2e-06,0,3e-06,1e-06,-3e-06,-2e-06,1e-06,0,0,-3e-06,1e-06,1e-06,0,0,0,-2e-06,-3e-06,-1e-06,3e-06,-2e-06,1e-06,0,2e-06,1e-06,0,0,-1e-06,1e-06,1e-06,-1e-06,0,0,0,0,0,2e-06,1e-06,1e-06,0,0,-1e-06,3e-06,0
