-2e-04,-8e-06,-0.000133,-0.000267,4.2e-05,-0.000475,-0.001234,-0.003086,-0.003234,-0.006134,-0.003885,-0.002879,-0.003115,-0.001994,0.000314,-0.034418,-0.005497,-0.009764,-0.00968,-0.007974,-0.025001,-0.002615,-0.013482,-0.018102,-0.007224,-0.005134,-0.007445,-0.009846,-0.018241,-0.013039,-0.009323,-0.008777,-0.016416,-0.019325,-0.02455,-0.01344,-0.018302,-0.010317,-0.009729,-0.018613,-0.015121,-0.009954,-0.012623,-0.00978,-0.011173,-0.015377,-0.015969,-0.009361,-0.010323,-0.007702,-0.00605,-0.007749,-0.004892,-0.006941,-0.002516,-0.001869,-0.005137,-0.004132,-0.007735,-0.005703,-0.001831,-0.000512,-8.5e-05,-0.000177,-0.003552,-0.0018,-0.0016,-0.000328,0.000458,-0.000313,-0.000302,-0.001616,-0.001223,-0.002475,-0.005041,-0.003267,-0.0062,-0.004099,0.000236,-0.008869,-0.010598,-0.005033,0.00214,0.000903,-0.000432,-0.003945,-0.002234,-0.000711,-0.000172,-0.000222,-0.00046,0.00054,0.000955,0.000514,0.000175,-0.001238,-0.00361,-0.002057,-0.000689,-1.1e-05,-0.000488,8.2e-05,-0.000252,9.4e-05,-0.00015,0.00022,-0.00013,-2e-06,-0.000299,-0.003262,-0.002122,-0.000788,2.1e-05,-8.2e-05,0.000594,-0.000284,-0.000157,-3.1e-05,0.000182,5.1e-05,-0.000181
0.000284,0.000888,0.000284,0.000226,0.000153,0.000654,-2.3e-05,0.000149,-0.000448,0.003673,0.00191,-0.001167,0.00062,0.002762,0.000948,0.020316,0.008202,0.010763,0.001853,-0.003305,0.003991,-0.009967,-0.002253,0.002554,-0.001189,0.001934,-0.001923,-0.004914,0.001731,-0.001157,-0.000958,-0.000273,-0.003655,0.006313,0.004889,0.000392,-0.006312,-0.001473,-0.004439,0.00066,-0.005464,-0.000893,-0.004035,-0.005349,-0.003672,-0.000623,-0.000976,0.001851,-0.000708,-0.004725,-0.005284,-0.003461,0.000438,-0.003048,-0.004866,-0.002045,5.4e-05,-0.001036,0.003955,0.001254,-0.000964,-0.000686,-0.000353,-0.000738,0.002079,0.000792,-0.000505,-0.000782,-0.000436,-0.000381,8.9e-05,-0.000588,-0.000354,0.000128,0.001114,0.001429,-0.000715,0.001884,0.001677,0.002288,0.008958,0.004209,-0.001233,0.002711,0.00049,0.001554,0.000792,0.000214,-0.000252,0.000277,0.000141,0.000223,7.5e-05,8.6e-05,0.000186,-0.000161,0.001518,0.00069,0.000507,0.000256,0.00059,-2.9e-05,0.000382,0.000215,0.000303,0.000293,-0.000245,-0.000176,-8.7e-05,0.002543,0.001169,0.000441,0.000267,0.000151,0.00084,0.000675,0.000361,0.00032,0.000371,0.000255,-0.00028
0.000153,-0.000384,-0.000224,8e-06,0.000186,-0.00018,0.000176,-0.000416,0.000357,-0.002693,-0.002569,-0.000141,-0.00121,0.000877,-0.001858,-0.006239,-0.013177,-0.007782,-0.009359,-0.006193,0.003763,-0.004063,0.001369,0.003119,-0.001224,-0.004479,-0.001088,0.001162,-0.006277,-8.2e-05,-0.003167,-0.008081,-0.005718,-0.005591,-0.00518,-0.006317,0.001081,-0.004216,-0.00561,-0.003725,0.003371,-0.001996,-0.000632,-0.000957,-0.000471,-0.003202,-0.005201,-0.007662,-0.00075,9.5e-05,0.001375,-0.002094,-0.003894,-0.002674,-0.002863,-0.000774,-0.00042,-0.000886,-0.003418,-0.002772,-0.002193,-1.8e-05,0.000259,0.000998,-0.001036,-0.000266,-0.000265,-0.000611,-0.000937,-0.000386,0.000197,0.000147,-5.4e-05,-0.000387,-0.001726,-0.001914,-0.001041,-0.003044,-0.001901,-0.00081,-0.005571,-0.002986,0.000784,-0.003938,-0.001373,-0.001714,-0.001472,-0.000338,-0.000439,-0.000532,-3e-06,0.000397,0.000338,0.00014,8.9e-05,-0.000399,-0.002258,-0.000939,-0.000188,-3.7e-05,-0.000115,-0.000217,-0.000185,4.8e-05,-9.1e-05,0.000116,-0.00013,-0.000222,-7.8e-05,-0.002455,-0.001778,-0.00064,0.000314,4.5e-05,-1.8e-05,-0.000735,-0.000333,-3.8e-05,2.9e-05,0.000211,0.000235
4.6e-05,0.000135,0.000382,0.000233,0.000157,0.000208,3.4e-05,-0.000622,-0.000559,0.001025,0.001393,0.000946,-0.002413,-0.000752,-0.003362,-0.001994,0.003224,-0.001016,-0.001824,-0.001515,-0.00099,-0.013162,0.001206,0.008115,0.004301,0.003036,-0.005656,-0.001369,-0.001422,0.001472,0.000128,0.007975,0.005167,-0.000534,0.000866,0.004401,0.004374,0.002164,0.002144,-0.00077,0.001893,0.004624,0.000311,-0.00336,-0.001143,0.001359,0.002545,0.000591,0.000453,-9.7e-05,0.000879,0.001368,0.001795,0.000868,0.002327,0.001601,0.000501,0.000909,0.000377,0.002772,0.001282,0.00093,-6.4e-05,0.00027,-0.000406,-0.000237,0.000409,-3.8e-05,-5.2e-05,-7.8e-05,3.9e-05,0.00032,6e-06,0.000272,-0.002498,-0.000786,-0.000289,-0.000356,-0.000206,-0.00091,0.002624,0.001669,0.000979,-0.001282,0.000183,0.000153,-2.3e-05,0.000428,0.000208,6.5e-05,-0.000242,-6.3e-05,-3.7e-05,-3.1e-05,-0.00026,0.000321,0.000859,0.000658,0.000442,0.000492,0.00017,-0.000142,-1.3e-05,0.000356,9.7e-05,-0.000451,0.000249,0.000118,-9.3e-05,0.000842,0.00041,0.00015,0.00031,-2.2e-05,0.00022,0.000102,0.000371,0.000263,6.3e-05,0.000591,0.000357
0.000148,-0.000265,-0.000346,-0.000146,0.000361,0.000231,5.2e-05,0.000237,1.5e-05,-0.00047,-0.00043,-0.001212,0.000328,0.000455,-0.000293,0.000723,-0.008586,-0.005427,-0.006079,0.003068,-0.003118,0.001905,0.002476,-0.005084,-0.005636,-0.000617,-0.005951,-0.002015,0.000351,0.001461,-0.002881,0.002578,-0.003835,-0.002006,0.000739,0.00054,-0.006549,0.00316,-0.000891,0.003882,-0.002712,-0.003699,-0.001512,0.00426,0.004013,-0.00044,0.00162,-0.001283,-0.002136,-0.000466,0.002174,-3.7e-05,0.000489,-0.000988,0.001011,0.000314,0.001009,0.001402,-0.000233,-0.002433,-0.001211,-0.000277,0.000615,0.000287,-0.000827,-0.000115,-0.00039,-0.000166,0.000591,0.000815,0.000303,-9.3e-05,0.000163,-0.000206,0.001514,-3e-06,-0.000315,-0.000705,0.00047,-6.5e-05,-0.000886,-0.000204,-2.5e-05,-0.001223,-0.000813,0.000451,-0.000673,-0.000902,-0.000249,-6.4e-05,-1.3e-05,0.000243,-0.000495,-0.000159,7.5e-05,-0.000315,0.000474,-0.000111,0.000125,-0.000284,0.000259,2.2e-05,0.000108,-7.9e-05,-3.1e-05,-0.000229,-0.000233,0.000159,9.2e-05,-0.00045,-0.000113,-1.7e-05,-0.000188,0.00035,-0.000165,-0.000552,-0.000198,0.000411,0.000139,1.9e-05,-0.000348
-4.2e-05,-7.6e-05,0.000619,0.000282,-4.5e-05,-0.000381,-0.000295,8.3e-05,0.000312,5.6e-05,0.000474,1.3e-05,-0.000332,0.001785,-0.001325,0.001989,0.004297,-0.004964,-0.000659,0.00024,0.001692,-0.001803,-0.002159,-0.004827,-0.008674,0.000475,0.002278,-0.000367,6.5e-05,-0.002393,-0.00123,-0.002847,0.004887,0.001482,0.001308,0.003848,-0.001427,-0.002714,0.004788,0.000119,7.5e-05,-0.001285,-0.001684,0.000595,0.000655,0.001669,0.001457,0.001594,0.001308,0.000911,-0.000328,0.001526,-6.2e-05,0.00027,-0.000291,-0.000411,-0.001059,-0.001594,0.00013,0.001331,0.001215,0.000862,-0.000625,-0.000273,0.000235,0.000644,0.000363,0.000264,0.000324,-0.000525,0.000217,0.000287,-0.001141,0.000273,-0.000451,3.5e-05,-0.000273,-0.000743,-0.001941,-0.000237,-0.000127,0.000872,-0.000687,0.000191,-0.001621,-0.000202,0.000586,0.000104,-0.000256,3.5e-05,0.000283,6.5e-05,-0.000267,7e-05,6e-06,0.000217,-6.9e-05,0.000324,0.000152,-0.000181,-8.4e-05,-9.8e-05,-3.7e-05,8e-06,4e-06,-0.000287,0.000136,-0.000105,-1.6e-05,-0.000177,-0.000221,-6e-05,-0.000135,-0.000194,0.000208,0.000144,6.3e-05,-8.2e-05,-0.000483,0.000119,0.000115
0.000166,-3e-05,-3e-05,-0.000542,-8.7e-05,-7.1e-05,7.6e-05,6e-05,0.000329,-0.000468,2.5e-05,-0.001309,-0.000658,-0.001822,0.001045,0.00189,0.000594,-0.006093,0.002171,-0.00202,-0.001127,-0.001167,0.002008,0.005191,0.006303,0.000588,0.000185,-0.001209,-0.004232,0.001485,0.001285,0.001205,-0.002432,-0.000208,-0.002492,0.000222,0.00231,0.002267,-0.001914,-0.003963,0.002011,-0.003889,-0.002714,-0.002307,-0.002949,-1e-06,-0.00276,0.00042,-0.000592,-0.00059,0.001291,0.000509,-0.000385,0.000258,0.000121,0.00089,0.000719,0.001061,0.001353,-0.00067,-0.000748,-0.00071,-0.000677,0.000863,-0.000138,-0.001028,7.1e-05,3.2e-05,-0.000265,-0.000783,-0.00038,-0.000213,7.9e-05,-0.000396,-0.000445,-0.000463,5e-05,-0.000328,5.3e-05,-0.001133,-0.001119,-0.001262,-0.000933,-0.000637,0.000672,-0.000649,0.000136,-0.000237,-9.1e-05,0.000164,-5e-06,-4e-06,-8.2e-05,-5.9e-05,7.7e-05,9.3e-05,3e-05,-0.000411,-0.000157,-0.000151,-2.1e-05,0.000132,-0.000309,-0.000135,-0.000254,8e-05,3.6e-05,-0.000169,-9.7e-05,-1.8e-05,-0.000214,-0.000132,-0.000123,0.000117,-4.6e-05,0.000109,-0.000327,-1.3e-05,1.7e-05,0.000114,-0.00019
-0.000142,-0.000181,0.00028,0.000219,-7.4e-05,-3.1e-05,-8.5e-05,0.000104,-0.000681,7.4e-05,-0.000195,0.000581,0.000299,0.001692,-0.001035,-0.000113,-0.001509,0.007057,5.3e-05,-0.002015,-0.000736,-0.000777,-6.4e-05,-0.003664,-0.00303,-0.003484,0.000541,0.000489,0.000812,-0.001266,-0.000182,-0.001281,-0.002125,-0.005215,0.00016,-0.001041,0.002262,-0.006088,0.001568,0.000477,-0.001649,0.001801,0.001989,0.001946,0.000517,0.001999,0.002108,-0.001288,0.000552,-0.000255,0.000174,-0.002044,3.8e-05,-0.002185,6.6e-05,-0.000262,-0.000347,0.000133,-0.000415,0.000888,0.000628,-0.000688,-6.9e-05,-7.6e-05,-0.000432,0.000163,0.000746,0,-5.5e-05,-8.3e-05,-0.000105,-0.000437,-0.000175,0.000987,0.000444,0.000983,-0.000375,0.00049,0.000181,-0.000865,-0.000702,0.001484,0.000186,-0.000867,-0.001435,-0.000987,-0.000511,0.000221,0.000351,2.8e-05,-0.000194,8e-05,-6.5e-05,-8e-05,-0.000223,0.000181,0.00021,5e-05,-0.000138,5e-06,-0.000118,-0.000277,-0.00021,-0.00015,-8.1e-05,-0.000145,-9.6e-05,0.000133,-0.000374,-0.000192,9.4e-05,0.000308,7.5e-05,-0.000197,-0.000233,0.000283,0.000424,-3.6e-05,-1.1e-05,-0.000172,-0.00018
-7.3e-05,-3.2e-05,-0.000223,-3.6e-05,0.000121,-0.00016,-7.6e-05,-3.6e-05,0.000924,-0.000103,0.000177,0.000111,0.000368,-0.002491,-0.000285,-0.000532,0.000611,0.000896,0.000524,-0.003925,-0.000492,5e-05,0.010785,0.002261,-0.001237,-0.00116,-0.003989,0.000656,0.00046,0.000132,-2.8e-05,-0.000434,-0.000132,0.003162,-0.002219,0.000895,-0.001684,0.004202,-0.002773,-0.002842,0.000236,0.001317,0.000157,-0.001759,-0.002471,-0.000319,-0.002631,-0.001174,-0.000899,-0.000765,-0.000796,0.000259,-0.000167,0.000622,-0.000201,-8.4e-05,-0.000233,0.000152,-0.000132,-0.000567,-0.000718,-0.00042,-0.000151,0.000201,0.000185,-0.000572,-9.2e-05,-5e-05,1.3e-05,0.000192,0.000282,-0.000254,-7.4e-05,9.1e-05,-0.000185,-0.000302,-0.00078,0.000123,0.000464,-0.000766,-0.000261,-0.001123,-0.00011,0.000422,0.002271,0.000498,0,0.000145,2.9e-05,4.2e-05,-0.000185,-0.000157,1.3e-05,0.000101,-0.000213,0.000289,-1.6e-05,0.000249,7.3e-05,-5.8e-05,0.000218,5e-06,3.9e-05,0.000103,0.000102,-5.9e-05,0.00011,2.3e-05,7e-05,0.000128,0.000471,0.000299,-1.7e-05,4.6e-05,3.3e-05,2.7e-05,0.000137,0.00015,-9.5e-05,-7e-06,1.1e-05
7.8e-05,-4.6e-05,2.5e-05,-0.000113,-7.9e-05,-2.9e-05,-0.000157,5e-05,-0.000309,-8.8e-05,-0.000304,-0.000164,-0.000142,-0.000798,6.5e-05,-0.000193,0.000245,-0.002194,0.000667,0.001242,-0.000413,-0.00065,-0.004319,-0.003973,-0.002589,0.000324,0.000478,0.000447,-0.001425,-0.001237,0.001247,0.001898,0.000612,-0.00277,0.001443,-0.000187,-0.002838,-0.002096,0.001735,0.000972,-0.000882,-0.001545,0.002046,0.001796,0.000718,-0.000906,0.000223,0.000465,-0.000311,0.002064,-0.000218,0.000378,-0.000269,0.00047,0.000402,-0.000946,-0.000417,-0.000194,-0.000663,-0.000632,0.000587,0.000746,-0.000345,-0.000131,-0.000376,-0.000156,-0.000303,-0.000216,8.9e-05,0.000116,-1e-05,7.4e-05,5.1e-05,-0.000156,-0.000174,-0.000394,0.00027,-0.000314,0.000263,0.000752,-0.000149,0.000821,0.000257,0.000129,-0.000204,-0.00049,-0.000221,4.8e-05,-0.000348,-0.000191,-8.1e-05,-4.4e-05,-0.000181,-2.1e-05,-7.4e-05,4.2e-05,-2.3e-05,6.2e-05,4e-05,-5.1e-05,-0.000178,-0.000113,-8.4e-05,-0.000186,-0.000101,-5.1e-05,-9.3e-05,-4.4e-05,2.6e-05,-9.9e-05,-0.000301,8.5e-05,-9.5e-05,-7e-06,-0.000119,2.2e-05,2.7e-05,-0.000121,-0.000126,-3.9e-05,-7.9e-05
-9.2e-05,-2e-06,-8e-05,-0.000143,-6e-06,-0.000211,-1.9e-05,-0.00011,-0.000334,-6.3e-05,-0.000193,-0.000444,-0.000307,0.000459,-0.000189,-0.000505,-0.001108,0.001085,-0.000804,0.000161,0.001926,0.000975,-0.002776,-0.004071,0.001178,-0.000988,0.000609,0.000491,0.002282,0.000871,0.001462,0.000576,0.000479,0.001865,0.000546,-0.001797,0.000148,-0.000153,-3.2e-05,0.000859,5.6e-05,0.001831,-4.9e-05,-0.001715,0.000842,0.000371,-0.000297,-0.00064,0.000405,-0.000304,-0.000796,0.001035,0.000329,0.000931,0.000382,0.000542,0.000334,-0.000163,0.000728,0.000343,-0.000699,1.1e-05,0.00029,-1e-06,3e-06,0.000142,-1.6e-05,8.7e-05,-0.000335,-0.000147,-4e-05,-8.8e-05,-0.000197,-0.000689,5.1e-05,0.000316,-0.000316,3.5e-05,-0.000249,0.000264,0.000193,-0.001002,-0.000479,-5.5e-05,-0.000491,-0.000835,0.000192,7.3e-05,0.000255,6.2e-05,-6.2e-05,7.5e-05,-5.5e-05,-0.000101,-0.000134,-4.9e-05,-3.1e-05,-8.9e-05,0.00032,-5.5e-05,2.3e-05,-3.2e-05,6.4e-05,-7.4e-05,-8.2e-05,3.6e-05,0.000138,8.6e-05,4.9e-05,-1.4e-05,1.8e-05,-4.1e-05,7e-05,9.9e-05,3.6e-05,0,-6.8e-05,4.6e-05,-0.000173,-5e-05,8e-06
5.9e-05,-5.9e-05,-6e-05,-6.4e-05,-0.000104,3.7e-05,4.6e-05,9.6e-05,4.8e-05,3e-06,0.000165,-2.5e-05,3.3e-05,0.000375,-0.000373,-0.00021,0.001535,-0.000877,0.00117,0.00547,0.001075,-0.000337,-0.001018,0.000801,-0.000896,-0.002083,1.5e-05,-0.000582,-3.3e-05,0.000574,-0.001553,-0.000215,-0.00095,-0.000365,-0.003903,0.001592,-0.000408,0.00041,0.000468,0.000701,0.000653,-0.000471,-0.000688,4e-06,-0.000503,-0.000148,-0.000763,0.000312,-0.000566,8.8e-05,0.000868,-0.000306,8e-06,0.000142,-2.5e-05,0.000153,-0.000387,-0.000162,-0.00058,-0.000733,0.000342,1.2e-05,-0.000232,9e-05,0.000139,-1e-05,8.9e-05,0.00023,0.000134,-0.000123,-0.000186,-2.2e-05,-1e-06,0.000162,0.000258,0.000179,0.000641,0.000216,-0.00023,0.000127,-8.2e-05,-7e-05,7.8e-05,-9.7e-05,-0.000168,0.000665,0.000168,-0.000219,-0.000208,-0.000175,5.3e-05,7e-06,-6.3e-05,1e-06,-4.2e-05,6e-06,-4.2e-05,-6.3e-05,-0.000502,-3.2e-05,-8.7e-05,6e-06,0,-1.3e-05,-1.9e-05,-5.6e-05,-5.4e-05,-1e-04,-7.5e-05,-9.2e-05,8.8e-05,-0.000197,5.1e-05,-3.1e-05,-0.000205,6.4e-05,-9.1e-05,-0.000129,5e-06,-6.3e-05,-4.3e-05
-1.6e-05,-3.2e-05,-3.3e-05,-0.000165,5.5e-05,-1e-05,-3e-05,-7e-06,-4.2e-05,-4.7e-05,-8.7e-05,-0.00024,-1.7e-05,-2.4e-05,0.001045,-0.000296,-0.000685,0.000266,-0.00102,-0.000661,-0.000732,-0.000533,-0.001846,-0.00119,-0.000889,0.002667,-0.000345,-7.1e-05,0.00048,-0.000361,0.002491,0.001,1.3e-05,0.000236,0.002087,-0.0013,0.000841,0.001487,-0.002643,-0.000131,-0.000895,-0.000111,0.000697,-0.001576,0.000455,0.000108,0.001119,-7.2e-05,0.00061,-0.001243,-0.000459,-0.00029,-0.00029,-0.000902,-0.000268,-0.000202,-6e-06,1.4e-05,-0.000102,0.000453,-8.9e-05,-0.000106,-0.000112,-0.000318,8.8e-05,0.000107,-6.7e-05,6.7e-05,0.000114,-0.000121,-5.6e-05,-8e-05,-6.9e-05,1e-06,-1.6e-05,-0.00028,0.000413,-8.6e-05,-2.6e-05,-0.000247,-0.000173,-0.000185,-6.9e-05,-5.9e-05,4.9e-05,-1.5e-05,-0.000212,0.000153,-6.1e-05,-1.8e-05,1.2e-05,-2.7e-05,2.9e-05,3e-06,3.1e-05,7e-06,4e-05,-6.7e-05,0.000347,2.5e-05,6.1e-05,-6.7e-05,-3.3e-05,-6e-05,5.7e-05,3.9e-05,2.3e-05,-8.7e-05,-1e-05,-1.3e-05,-0.000168,-3.3e-05,1.8e-05,8.6e-05,3.2e-05,6.6e-05,-0.000224,0.000201,-2e-05,-6.1e-05,3.5e-05
-1.4e-05,1.7e-05,-7.8e-05,-8e-06,-3e-05,5e-05,1.8e-05,-8e-06,8.4e-05,5.4e-05,3.5e-05,0.000237,0.000129,0.00012,-0.000523,-2.2e-05,0.000896,0.001436,-0.000285,0.000354,8e-06,0.000124,-1.4e-05,0.000261,0.000558,-0.001235,-0.001267,0.001165,0.000125,-0.000307,-0.00045,-0.000473,-0.000185,-0.001162,-0.000683,0.000139,0.000593,-0.001515,0.001469,-0.000148,0.000632,-0.000274,-0.000148,0.000605,-0.000295,0.000362,-0.00048,0.000179,-4.4e-05,0.001155,-9e-05,0.00051,0,3.1e-05,0.000227,0.00033,-0.000188,-3e-06,0.000119,6.4e-05,-0.000126,0.00014,0.000179,-0.000373,-0.000172,-0.000131,-9.3e-05,-1.4e-05,-3.4e-05,3.7e-05,1.4e-05,-7.9e-05,4.7e-05,-0.000294,8.2e-05,8.5e-05,-0.000662,5.4e-05,0.000124,0.000423,8.6e-05,-0.000218,-0.000371,7.9e-05,4.8e-05,0.000808,-5e-05,7.4e-05,3e-06,-2.5e-05,-5e-06,-6.4e-05,2.7e-05,1e-05,2.7e-05,-1.1e-05,2.3e-05,-5.2e-05,-3.8e-05,1.7e-05,-3.9e-05,-3e-06,-4.5e-05,5.9e-05,-6.6e-05,-5e-06,2.6e-05,-2.3e-05,4.2e-05,2e-06,5.2e-05,7.6e-05,-6.9e-05,-6.5e-05,-1.4e-05,8e-06,-0.000119,-5.1e-05,6.5e-05,4.6e-05,-1.9e-05
4.1e-05,-3.5e-05,3.4e-05,4.6e-05,-1e-05,-4.6e-05,-6.4e-05,-2.4e-05,-2.6e-05,4.7e-05,-6.6e-05,2.6e-05,-9.5e-05,0.000263,0.000565,-4e-06,-0.000262,4e-06,0.001376,0.000385,0.000219,0.000133,0.000901,0.001673,-0.001386,-8.6e-05,0.000188,-6.2e-05,0.000205,0.000383,0.000454,-0.000752,-7e-06,0.000631,0.000269,-0.000227,-0.000856,0.00044,-0.000186,1.4e-05,-0.001403,-6e-05,7e-05,0.000234,-0.000156,-0.000572,-0.000471,-0.000264,8.5e-05,-0.000591,0.000195,-7.6e-05,-2.6e-05,-0.000509,-0.000138,-0.000455,0.000357,7e-05,0.000122,-7e-05,0.000323,-0.000193,0.000156,0.000107,-1e-06,9e-05,-0.000314,1.5e-05,-7e-05,0.000118,4e-06,0.000104,1.3e-05,-6.6e-05,1.8e-05,-7e-06,0.000277,6.1e-05,6.1e-05,-0.000273,-2.2e-05,3e-04,0.000442,-2.5e-05,0.000123,-0.000264,0.000275,-2.6e-05,2.2e-05,5.3e-05,-7.2e-05,-3.3e-05,-2.5e-05,-2e-05,-3e-06,-4.1e-05,-1e-05,4e-06,3e-06,-1.3e-05,9e-06,4.5e-05,-7e-06,-1e-06,3.5e-05,-7e-06,-4.9e-05,-2.5e-05,2.3e-05,-8e-06,4.8e-05,-1.7e-05,-0.000106,-8e-06,-3.8e-05,-1.8e-05,2.1e-05,1.6e-05,-7.9e-05,4e-05,-3.9e-05
3.1e-05,1.7e-05,-2.6e-05,5.8e-05,1.7e-05,-1.2e-05,7.7e-05,-4e-05,6.3e-05,-0.000114,0.00012,-8.4e-05,7.5e-05,-2e-05,-0.00054,4e-05,-0.000222,-0.000876,-0.000697,-0.000376,0.000682,-0.000459,-0.000611,0.000185,0.001309,-0.000658,0.000486,0.000575,-0.000767,-0.000231,0.000398,-0.000569,-0.000146,0.000249,0.00101,-0.00026,-0.000298,-0.000352,-0.000876,2.8e-05,0.001223,0.000204,-9.4e-05,0.000105,-0.000537,-0.000333,-8e-05,0.000124,0.000151,0.000619,0.000193,-8.3e-05,-4e-05,0.000335,0.000122,2e-04,8.1e-05,5.5e-05,3.7e-05,9e-06,-0.000394,-9.2e-05,-0.000101,-1.9e-05,7.3e-05,-6.5e-05,-2.7e-05,2.8e-05,8.2e-05,1e-06,8.2e-05,-3.4e-05,3.8e-05,3.1e-05,-5.6e-05,1.6e-05,-0.000105,-0.000115,2.6e-05,-0.000178,6.2e-05,-0.000299,-0.000342,-3.5e-05,-0.000102,0.000178,-0.00016,4.3e-05,-7.4e-05,-2.8e-05,9e-06,-4.2e-05,-2.6e-05,-2e-06,3.2e-05,-3.9e-05,1.2e-05,2.2e-05,-9.8e-05,-7.1e-05,1e-05,-1.2e-05,1.4e-05,5e-06,-1.2e-05,-1.5e-05,1.8e-05,-1.1e-05,-0.000101,-1.9e-05,-2.5e-05,1.8e-05,7.6e-05,-2e-05,1.5e-05,-3.2e-05,-4e-06,-1.4e-05,1.1e-05,-2.3e-05,3.8e-05
-5.9e-05,-1e-06,4.7e-05,-3.6e-05,-1.2e-05,-3.9e-05,-2.2e-05,4e-06,-6.6e-05,-1e-06,-1.1e-05,-5e-06,-4e-06,-7.7e-05,1.1e-05,8.5e-05,0.000484,-0.000924,-2.4e-05,-0.000577,-0.000452,-0.000125,-0.000146,3e-04,-0.000473,-2.2e-05,0.000301,-0.000504,-0.000225,-0.000182,-0.000399,-0.000149,7.6e-05,0.000268,-0.001265,0.000521,0.000209,0.000229,0.000468,-0.000466,-0.000548,1.7e-05,0.000315,-0.000532,0.000524,0.000178,2e-05,0.000132,-0.000355,-0.000403,-9.4e-05,-0.00026,5.8e-05,4.1e-05,-5.4e-05,-1.4e-05,4e-06,1.8e-05,-7e-06,-4.5e-05,0.000284,9.3e-05,-3.8e-05,0.000117,4.9e-05,-5e-06,-2.1e-05,-2.3e-05,-7e-06,1.4e-05,-3.3e-05,-1.1e-05,-5.5e-05,2.4e-05,-9e-06,-7.1e-05,-0.000136,-6.9e-05,-7.4e-05,-0.000116,-3.2e-05,0.000261,0.00019,6.1e-05,4e-06,-0.000417,-4.8e-05,-9.8e-05,3e-05,3.7e-05,-3.1e-05,3.2e-05,-1.9e-05,1.4e-05,-4.1e-05,-6.6e-05,1.2e-05,1.9e-05,3.1e-05,1.2e-05,-1.6e-05,-2.3e-05,9e-06,-8e-06,2.3e-05,2.2e-05,-7e-06,2.2e-05,4.4e-05,1e-06,-9e-06,-7.9e-05,-3.3e-05,-2e-06,-7e-06,1.2e-05,-2.6e-05,-2.2e-05,-4.7e-05,-1.2e-05,-3.2e-05
2.7e-05,-1.5e-05,-4e-06,9e-06,-2.4e-05,2.1e-05,2e-05,-5e-06,3e-05,3.6e-05,2e-06,-6.9e-05,-3.1e-05,-0.000253,0.000196,2.4e-05,-0.000344,0.000921,3.1e-05,0.000497,-0.000218,-2.9e-05,-0.000697,-0.000567,-0.000113,0.00032,-0.000405,0.000159,0.000472,0.000168,0.000263,0.000198,0.000312,-0.000402,0.000262,-0.000637,0.000468,0.000294,-0.000372,-0.00016,0.000278,0.000558,-0.000195,0.000601,-0.000405,0.000116,0.000238,-0.000129,0.000415,8.8e-05,-5e-05,0.00012,-7e-05,0.00011,-2.8e-05,5.7e-05,-5.9e-05,0.000101,-1.1e-05,0.000225,-0.000147,8.2e-05,2.4e-05,1.5e-05,-7.6e-05,1.8e-05,5.2e-05,1.6e-05,-1.8e-05,-1.4e-05,4.1e-05,2e-06,-1.5e-05,-5e-06,-1.7e-05,0.000108,3.1e-05,6e-05,-2.6e-05,0.000104,-3.1e-05,-8.9e-05,0.000119,8e-06,-8.9e-05,-5e-06,-2.8e-05,1.1e-05,5.9e-05,1.1e-05,4e-06,2e-05,2e-06,-1.8e-05,-6e-06,-1.7e-05,-7e-06,-2e-05,-6.9e-05,1.4e-05,0,4e-06,3e-06,-2.4e-05,-2.7e-05,-7e-06,-8e-06,3e-06,-1e-05,-1.1e-05,1.2e-05,-4.8e-05,-1.1e-05,-3e-06,1.1e-05,-9e-06,-1.2e-05,-6.1e-05,2.4e-05,-3e-06,1.5e-05
-4e-06,3e-06,2e-05,-2.7e-05,1.1e-05,-1.5e-05,-1.7e-05,4e-06,5.1e-05,1.9e-05,-2.9e-05,3.2e-05,-1e-05,-0.000124,4.4e-05,4.4e-05,0.000148,-0.000371,-0.000186,-0.000221,-0.000322,-0.000204,0.001446,-0.000651,0.000161,-0.000649,-0.000563,-3.7e-05,-8.8e-05,-0.000204,0.000463,0.000126,7.3e-05,0.000442,-4.7e-05,0.000274,-0.000142,5.8e-05,0.00076,0.00016,3.8e-05,-0.00054,-5.4e-05,6.7e-05,9.4e-05,8.3e-05,-5.3e-05,0.000206,-0.000254,-0.000122,-9.4e-05,0.000178,-7.3e-05,-9.1e-05,-1.6e-05,-0.000133,-3.9e-05,5.6e-05,-4.8e-05,-0.000125,1.6e-05,5.1e-05,-0.000124,-4.2e-05,-5.8e-05,-1.2e-05,7e-06,-2.9e-05,3.7e-05,-5.2e-05,-7.9e-05,-2.2e-05,-1.7e-05,4.3e-05,-2.1e-05,-2.9e-05,3.3e-05,-2.4e-05,-6e-06,8.1e-05,1.7e-05,0.000131,-0.000123,-2.6e-05,-7.4e-05,-5.8e-05,6.5e-05,3e-05,-8.3e-05,2e-06,-7.7e-05,-7e-06,2.1e-05,1e-06,-2.2e-05,-1.1e-05,2e-06,-4e-06,6e-05,-1.2e-05,1e-05,-1.3e-05,1.5e-05,0,1.7e-05,-4e-06,1.1e-05,-2.4e-05,1.2e-05,2e-06,1e-06,-8e-06,-1.1e-05,2.9e-05,-1e-05,-9e-06,-1.4e-05,3.1e-05,-2.4e-05,-4e-06,-2.8e-05
-3e-06,-2e-06,5e-06,-1.8e-05,7e-06,-7e-06,-1.1e-05,-1e-05,3.2e-05,-5.6e-05,-4.2e-05,4.7e-05,2e-05,-9e-06,-0.000219,1.1e-05,-7.7e-05,0.000441,0.000474,0.001266,-1.1e-05,-0.000169,0.000491,-2.8e-05,-0.000505,0.000422,0.000359,0.00017,0.000151,6.6e-05,3.8e-05,5.8e-05,1.6e-05,-0.000305,-0.000164,0.000233,-0.000226,8.8e-05,-0.00051,9.7e-05,-0.000328,-0.000182,-0.000132,-0.000148,0.000119,-5.9e-05,-1e-06,-0.000193,5.1e-05,4.4e-05,-0.000111,-0.000195,8.3e-05,3e-05,-2.9e-05,-6e-06,-4.8e-05,5e-06,0.000111,2.2e-05,-6e-06,-7.6e-05,2.4e-05,1e-04,4.2e-05,2.9e-05,-6.7e-05,7e-06,1.6e-05,-2.3e-05,2.9e-05,-2.2e-05,-9e-06,-1e-05,-2e-06,-9.2e-05,5.9e-05,-3.9e-05,3e-05,-2.1e-05,-4.1e-05,-2.5e-05,6.4e-05,1.7e-05,0.000174,0.000155,3.8e-05,1.5e-05,2.6e-05,9e-06,2.2e-05,0,-1.6e-05,7e-06,-2e-05,-1e-06,-6e-06,1.6e-05,-4e-05,1.3e-05,1e-06,-3e-06,-1e-05,3e-06,-2e-06,-7e-06,-2e-05,8e-06,-3e-05,-5e-06,-1.8e-05,4.4e-05,-1.1e-05,-1.7e-05,-6e-06,-1.5e-05,-3e-06,-9e-06,1.1e-05,-5e-06,9e-06
-1e-06,-1.1e-05,1e-06,2e-06,-5e-06,-5e-06,6e-06,-6e-06,-3.9e-05,-2.6e-05,1.4e-05,-6.4e-05,-1e-06,0.000287,0.000212,-1.4e-05,-3.5e-05,-7e-06,-0.000154,2e-05,0.000218,-7.3e-05,0.000275,-0.000111,0.00024,-0.000203,0.000296,0.000109,0.000105,0.000174,-5.1e-05,0.000251,4.6e-05,0.000107,0.000135,-0.000191,-3.2e-05,-0.000284,0.000304,0.000148,0.000444,0.000343,1.6e-05,4.4e-05,-9.5e-05,-2.3e-05,-7.2e-05,1e-05,-2.2e-05,1.4e-05,-7.6e-05,-0.000119,2.2e-05,-0.000147,-4.8e-05,8.4e-05,5.2e-05,2.8e-05,-6.4e-05,4.2e-05,-3.5e-05,2.4e-05,3.4e-05,2.9e-05,1.8e-05,-1.6e-05,9.7e-05,2e-05,4e-06,2.8e-05,-1.3e-05,5e-06,2.2e-05,2.6e-05,6e-06,0.000133,1.3e-05,1.6e-05,3.3e-05,-1.3e-05,2e-06,-4e-06,-1.9e-05,3e-06,-5.2e-05,-2.1e-05,-9.6e-05,2.4e-05,1.8e-05,0,1e-06,1.6e-05,-5e-06,0,1e-06,0,-8e-06,9e-06,5.7e-05,-2.3e-05,-8e-06,-1e-05,-1.3e-05,-1.5e-05,-9e-06,1e-05,2e-05,0,1.3e-05,3e-06,-1e-06,1.1e-05,0,1.2e-05,3e-06,-7e-06,4.2e-05,2.3e-05,-3.6e-05,-1e-05,-8e-06
-1e-06,5e-06,0,7e-06,6e-06,-1.5e-05,-3e-06,-4e-06,-3.7e-05,2.5e-05,1.6e-05,3.5e-05,-2.3e-05,-9.9e-05,-0.000107,-1.2e-05,0.000182,-0.000416,-0.000184,0.000305,-9.9e-05,-8.4e-05,-5e-06,-6.7e-05,6.3e-05,-4.1e-05,-0.00019,-0.000174,2.5e-05,-5.2e-05,-0.000142,-0.000208,5e-05,-0.000272,-0.000282,0.000116,-2.5e-05,0.00019,-0.000276,2.9e-05,-0.000251,-2.1e-05,0.000132,9.4e-05,-2.6e-05,-7e-06,4.3e-05,9e-06,-7.4e-05,0.000113,0,4.2e-05,-8.2e-05,9.2e-05,2.1e-05,-1.9e-05,-5e-05,-2.6e-05,-8.7e-05,-7.8e-05,5.2e-05,-2e-05,1.5e-05,-2.8e-05,-2.2e-05,2.4e-05,2.7e-05,-2.1e-05,-4.6e-05,3.5e-05,1.1e-05,-2e-06,-1.4e-05,-1.6e-05,-9e-06,-7.1e-05,5.4e-05,-1.2e-05,-2.3e-05,-1.8e-05,1.4e-05,7e-06,1.9e-05,7e-06,2.7e-05,0.000103,4.9e-05,-4.8e-05,-4.9e-05,-1.4e-05,8e-06,-1.5e-05,-1.2e-05,-3e-06,-1e-06,-1e-06,-4e-06,5e-06,1.4e-05,-1.1e-05,2e-06,-5e-06,-3e-06,1.7e-05,-5e-06,-2e-06,-1.3e-05,-9e-06,1.3e-05,0,2.1e-05,1e-05,8e-06,-5e-06,-5e-06,-2e-06,4e-05,-1e-05,-1e-06,9e-06,3e-06
-5e-06,-3e-06,-1.5e-05,-1.1e-05,-4e-06,-3e-06,1.2e-05,5e-06,3.8e-05,-3.9e-05,-1.5e-05,-6.6e-05,5e-06,7.6e-05,1.5e-05,-2.2e-05,-0.000177,0.000139,0.000162,-0.000796,-0.000114,-4e-06,-0.000572,1e-05,-0.000316,-5.2e-05,-0.00035,9.5e-05,-0.000199,-4.5e-05,-8e-05,-8.8e-05,5.9e-05,0.000307,0.000318,-0.000112,0.000187,8.2e-05,0.000441,1.5e-05,0.000198,-0.000124,-6.2e-05,-7.2e-05,-0.00014,7.3e-05,-0.00018,-2.9e-05,0.000159,0.000125,0.000101,0.000103,9e-06,-0.000165,-5e-05,4e-06,-1.9e-05,-3.6e-05,9.5e-05,7.1e-05,-8.6e-05,-4.1e-05,-8e-06,-8e-06,-1.1e-05,-1.2e-05,5.8e-05,2.2e-05,3.3e-05,5e-06,7e-06,-3e-06,4e-06,6e-06,-4e-06,2e-06,-9.7e-05,-2.6e-05,-5e-06,-1.7e-05,4e-06,-7.6e-05,-4.8e-05,-6e-06,-6.6e-05,2.6e-05,1.1e-05,-6e-06,2.4e-05,1e-06,-2.2e-05,1e-06,6e-06,-4e-06,0,4e-06,-4e-06,1e-06,-1.4e-05,9e-06,1e-06,0,2e-06,-1.6e-05,1.2e-05,0,2e-06,1.5e-05,-7e-06,-3e-06,-2.4e-05,-1.2e-05,7e-06,-8e-06,3e-06,-1e-06,-2e-06,2.4e-05,0,2e-06,-5e-06
2.1e-05,-2e-06,1e-06,-2.6e-05,2e-06,1.2e-05,-1.1e-05,5e-06,-1.1e-05,-1.7e-05,1.6e-05,9e-06,1.6e-05,-1.8e-05,3.2e-05,-1.3e-05,5.2e-05,0.000113,-0.000119,0.000254,-2.7e-05,8e-06,-0.00015,-0.000274,0.000101,7.7e-05,-2e-05,-0.000103,9.1e-05,-8.7e-05,-3.8e-05,4.6e-05,-8.9e-05,-8.4e-05,-0.000104,7.5e-05,-0.000103,-0.000182,-0.000267,-5.6e-05,-0.000252,0.000214,-2.1e-05,0.00015,6.7e-05,7.7e-05,-0.000116,-1e-06,-0.000152,-6.1e-05,-3.8e-05,-2.1e-05,4.7e-05,0.000171,2.2e-05,-3e-06,3e-06,-1.8e-05,4e-06,-5.2e-05,6.5e-05,-1.2e-05,2.9e-05,-5.9e-05,2e-06,1e-06,-1.2e-05,-3.2e-05,-1e-05,-1.7e-05,1e-06,-2e-06,-2e-05,-1.9e-05,1e-06,-1e-05,-7e-06,9e-06,0,-7.5e-05,2.2e-05,2.1e-05,9e-05,-4e-06,0,5.5e-05,-4e-06,5e-06,6e-06,-6e-06,7e-06,-5e-06,4e-06,5e-06,7e-06,4e-06,-4e-06,-7e-06,-5.6e-05,-1e-06,-1e-06,0,3e-06,1e-05,-3e-06,-8e-06,7e-06,0,-2.3e-05,3e-06,1.8e-05,2e-06,-1.2e-05,-1e-06,-1.1e-05,-3e-06,-2e-05,-1.6e-05,9e-06,-2e-06,0
-1.5e-05,1e-06,-1.4e-05,1e-06,-9e-06,-1e-06,5e-06,1e-06,1e-06,1e-05,-1.3e-05,-1.4e-05,4e-06,4.2e-05,-5.6e-05,-1.5e-05,5.4e-05,0.000138,0.000137,-0.00066,4.6e-05,-0.000123,0.000226,0.00028,-8e-06,0.000175,0.000272,0.000101,3e-06,2.4e-05,0.000156,-0.000148,4.1e-05,5e-06,2e-05,1.9e-05,-0.00017,-0.000134,5.5e-05,-6.1e-05,0.000191,-0.000131,-0.00011,-0.000104,-6.7e-05,-2.7e-05,-9e-06,-4.4e-05,0.000105,-2.6e-05,1.9e-05,-0.000117,-2.8e-05,-0.000106,-2.1e-05,-4.6e-05,1.5e-05,-3e-05,-7.3e-05,1.1e-05,-7.8e-05,2.6e-05,-5.9e-05,3.9e-05,2e-06,2e-06,-1e-06,7e-06,-2e-06,-3.1e-05,6e-06,-5e-06,4e-06,-2e-05,-6e-06,3.5e-05,1.8e-05,2e-06,-7e-06,5e-06,-2.1e-05,-0.000111,-0.000134,8e-06,5e-06,-8.4e-05,-6e-06,-1e-06,-2.4e-05,-6e-06,-7e-06,3e-06,-3e-06,0,-1e-06,7e-06,1e-06,-1.3e-05,4e-05,6e-06,-6e-06,-6e-06,4e-06,-2e-06,-6e-06,3e-06,-1.1e-05,-1.3e-05,1.9e-05,-3e-06,-4e-06,9e-06,-2e-06,7e-06,7e-06,-2e-06,-1.5e-05,3e-06,-5e-06,1e-06,-5e-06
3e-06,-1e-06,4e-06,-6e-06,5e-06,-9e-06,-2e-06,-2e-06,-3e-06,0,-1.3e-05,0,-8e-06,-6.7e-05,3.2e-05,-7e-06,-8.6e-05,-7e-05,-2.5e-05,1e-04,3e-06,-6.1e-05,-8.5e-05,0.00033,-7e-05,-0.000148,-1.5e-05,-0.000141,-0.000106,6.6e-05,-0.000205,5e-05,-2e-06,-8.8e-05,-0.000178,-0.000125,-7e-05,0.000319,-9.6e-05,-9.7e-05,-6.2e-05,-0.000133,-4.9e-05,-0.000238,8.9e-05,-0.000103,-5.4e-05,1.4e-05,-7.2e-05,-2.1e-05,6.6e-05,7e-05,-2e-06,0.00017,7e-06,3.9e-05,6e-06,-1.1e-05,2e-05,-2.1e-05,8.9e-05,5.7e-05,-1.8e-05,-4.8e-05,-2e-06,-6e-06,-1.2e-05,-7e-06,6e-06,-1e-05,-3.2e-05,3e-06,-9e-06,1.7e-05,-4e-06,-2e-05,-1.1e-05,-2.3e-05,2e-06,2.7e-05,-6e-06,5.9e-05,0.000125,-2e-06,2.9e-05,-3.2e-05,-1.1e-05,3e-05,0,0,-5e-06,-1e-06,-8e-06,-3e-06,-4e-06,6e-06,1e-06,-8e-06,-1e-05,-1e-05,8e-06,3e-06,3e-06,0,5e-06,3e-06,1.1e-05,1e-06,-7e-06,-1e-06,-8e-06,2.6e-05,5e-06,-6e-06,0,1e-06,-1.8e-05,-9e-06,-6e-06,3e-06,1e-06
0,-2e-06,-6e-06,7e-06,-1e-06,-4e-06,5e-06,-3e-06,-1.1e-05,-1.6e-05,9e-06,8e-06,7e-06,-1e-04,1.7e-05,1e-06,9.3e-05,-0.000243,-0.000167,2.9e-05,-7.8e-05,5e-06,5.1e-05,5e-06,3.2e-05,-8.6e-05,-6.7e-05,0.000196,8.8e-05,-6e-06,-4.6e-05,0.000154,-2.1e-05,5.4e-05,-0.000146,2.9e-05,0.000116,-2.1e-05,0.000161,-4.2e-05,6.7e-05,0.000206,-8.6e-05,0.000162,-5e-05,-1.3e-05,-1.8e-05,3.6e-05,1.7e-05,1.2e-05,5.9e-05,0.000111,6e-06,-0.000127,-3e-06,3.7e-05,3.9e-05,9e-06,2.6e-05,-3.6e-05,-8.2e-05,-1.8e-05,3.3e-05,-2.5e-05,-1e-06,8e-06,-1.8e-05,0,1.1e-05,1.4e-05,2.6e-05,0,5e-06,-8e-06,2e-06,-1.6e-05,1.4e-05,-1e-06,2.1e-05,3.4e-05,-2e-06,-5.2e-05,-6.6e-05,2e-06,-1e-06,-3.7e-05,-4e-06,-2.6e-05,7e-06,2e-06,-2.4e-05,6e-06,0,4e-06,-3e-06,3e-06,2e-06,-5e-06,3e-06,-4e-06,-4e-06,-7e-06,-2e-06,2e-06,1e-06,1e-06,-8e-06,-3e-06,9e-06,0,7e-06,1.2e-05,1e-06,7e-06,-6e-06,2e-06,0,6e-06,-1.1e-05,4e-06,-5e-06
0,0,5e-06,1.3e-05,2e-06,-1.1e-05,-4e-06,2e-06,0,-1.3e-05,-1e-06,-2e-05,0,-1.3e-05,-7.4e-05,2e-06,-0.000112,9.1e-05,0.000188,0.000137,-2.2e-05,-6.6e-05,-0.000331,3.6e-05,-4.7e-05,4.3e-05,-0.000213,-5.3e-05,6.4e-05,-5.2e-05,5.3e-05,-6.5e-05,-1.8e-05,-4.5e-05,0.000241,5e-05,0.000115,-1e-04,-5.8e-05,5.6e-05,-2.2e-05,-4.5e-05,4e-05,6.9e-05,7.3e-05,1e-06,3.6e-05,1e-06,5.7e-05,3.3e-05,-2.4e-05,-2.3e-05,-2.5e-05,6.4e-05,1e-05,-7.7e-05,2.1e-05,-3e-06,2e-05,5.1e-05,2.1e-05,-1.7e-05,7e-06,-1.6e-05,-8e-06,-4e-06,1.9e-05,-4e-06,-1e-05,1.6e-05,-1.5e-05,-5e-06,-8e-06,1e-06,-2e-06,5.4e-05,1.6e-05,9e-06,-8e-06,-2e-05,-7e-06,4.2e-05,6e-06,5e-06,2.2e-05,-4.7e-05,3.4e-05,-8e-06,-1.1e-05,0,5e-06,-5e-06,0,-4e-06,-7e-06,0,4e-06,7e-06,-6e-06,0,2e-06,3e-06,-5e-06,-4e-06,-3e-06,-5e-06,4e-06,-7e-06,-2.2e-05,-2e-06,-5e-06,-3e-06,-3e-06,2e-06,5e-06,3e-06,1.1e-05,-1e-05,-3e-06,-5e-06,2e-06
-1e-06,0,2e-06,0,-3e-06,4e-06,2e-06,3e-06,7e-06,1e-05,2.6e-05,-3e-06,-9e-06,2e-06,5.6e-05,7e-06,5.4e-05,-6.2e-05,-5.2e-05,0.000127,5.9e-05,-6.1e-05,-0.000116,-0.000331,-5e-05,5.7e-05,7e-05,-9e-05,-4.6e-05,-1e-06,-9.2e-05,0.000123,-4.6e-05,5.9e-05,-0.000261,-7.7e-05,-8.3e-05,-0.00013,-0.000277,3.2e-05,-4.8e-05,-0.000108,4.8e-05,-9.4e-05,7e-06,-4e-06,-2.5e-05,-2.4e-05,-9.4e-05,8e-06,-2.6e-05,-6.6e-05,1.9e-05,-0.000106,-4e-06,4.2e-05,4e-06,1.7e-05,2e-05,-2.7e-05,2.2e-05,-1.3e-05,-1.1e-05,1.6e-05,-1.1e-05,7e-06,-5.4e-05,1e-06,-1.4e-05,3e-06,1.6e-05,-6e-06,-7e-06,0,-3e-06,-5.7e-05,-1.4e-05,-9e-06,-1.2e-05,-8e-06,1e-05,-1.6e-05,2e-05,-4e-06,-6.6e-05,4.9e-05,-2.1e-05,8e-06,-6e-06,2e-06,-7e-06,-3e-06,2e-06,4e-06,-2e-06,1e-06,3e-06,2e-06,3.9e-05,0,-2e-06,-5e-06,-2e-06,-5e-06,-1e-06,2e-06,0,5e-06,1.7e-05,1e-06,-1e-06,-1.5e-05,5e-06,-7e-06,-1e-06,0,-3e-06,6e-06,7e-06,-5e-06,-4e-06
2e-06,-1e-06,4e-06,-1e-05,4e-06,9e-06,-4e-06,2e-06,1e-05,-1e-05,-1.6e-05,1e-06,-6e-06,0.000113,0,6e-06,3.4e-05,0.000152,-2.5e-05,-0.000148,6.4e-05,-3.1e-05,2.4e-05,-0.000129,-6.4e-05,-6.3e-05,0.000246,-6.4e-05,-1.4e-05,-1.1e-05,-5.1e-05,1.5e-05,2.8e-05,-6e-05,6.4e-05,2.2e-05,-0.000105,0.000244,0.000285,2.3e-05,4.4e-05,9.4e-05,3.2e-05,-5.4e-05,-8.3e-05,-1.3e-05,8e-06,2.6e-05,1e-04,-4.9e-05,1.7e-05,8e-06,5e-06,9e-05,1.8e-05,-2.2e-05,-3e-05,2.2e-05,-4.2e-05,1.9e-05,-3.9e-05,9e-06,1.5e-05,3.7e-05,7e-06,-3e-06,-2.8e-05,4e-06,1.6e-05,-5e-06,-9e-06,2e-06,-5e-06,0,1e-06,2.5e-05,1.1e-05,-5e-06,6e-06,0,-4e-06,2.9e-05,-3e-06,-3e-06,3.7e-05,5.1e-05,-1e-05,-3e-06,6e-06,3e-06,-3e-06,2e-06,-2e-06,-3e-06,-2e-06,-1e-06,2e-06,0,-3.5e-05,8e-06,3e-06,0,0,5e-06,4e-06,0,-3e-06,1e-06,0,-1e-06,7e-06,-1.1e-05,-8e-06,4e-06,1e-06,1e-06,-1.8e-05,0,-2e-06,1e-06,3e-06
-9e-06,0,5e-06,-1e-05,-1e-06,-4e-06,4e-06,-1e-06,-3e-06,-1.5e-05,-9e-06,4e-06,7e-06,1.7e-05,-5.1e-05,6e-06,-8.5e-05,4.8e-05,6.8e-05,-0.000153,-2.9e-05,-4.8e-05,0.000252,9.9e-05,0.000176,2.5e-05,-0.000173,8.1e-05,2.9e-05,5.5e-05,-5.6e-05,-9.3e-05,-3.3e-05,6.3e-05,-1.9e-05,1.7e-05,-7e-05,-0.000144,-0.000127,3e-05,2e-06,2.2e-05,7e-06,0.000109,2.3e-05,-2.9e-05,-3.5e-05,-4e-06,-0.000101,4e-06,-1.7e-05,8.8e-05,-3.2e-05,-7.3e-05,1e-06,2.3e-05,-2.4e-05,8e-06,-4.6e-05,-1.3e-05,4.7e-05,-1.5e-05,-1.1e-05,2.5e-05,4e-06,-2e-06,-1.1e-05,-6e-06,-3e-06,-1.2e-05,1.3e-05,-1e-06,-8e-06,-1e-06,1e-06,2e-06,-9e-06,5e-06,-2e-06,-2.1e-05,4e-06,3.7e-05,-3.2e-05,0,-2e-05,7.3e-05,8e-06,1.9e-05,-1e-05,0,0,1e-06,0,0,-1e-06,-2e-06,2e-06,-1e-06,2e-05,-6e-06,-3e-06,-4e-06,1e-06,-7e-06,-1e-06,0,6e-06,-6e-06,-4e-06,1e-06,-4e-06,3e-06,1e-06,-3e-06,-2e-06,1e-06,-1.1e-05,1e-05,-1e-06,-1e-06,-4e-06
1.2e-05,0,0,-1e-06,1e-06,-8e-06,-2e-06,-3e-06,-1e-06,-2e-06,8e-06,-6e-06,5e-06,-2.1e-05,5.9e-05,4e-06,7.4e-05,-0.000137,-9.5e-05,-0.000218,-5.7e-05,-4.1e-05,0.000269,5e-06,-0.000187,3.1e-05,-0.000124,3.3e-05,-5.2e-05,1.1e-05,-6.1e-05,0,9e-06,-5.3e-05,-9.3e-05,9e-06,4.3e-05,-7e-06,0.000122,-1e-06,3e-06,-0.000115,-2.7e-05,-1.1e-05,-9e-06,-2.9e-05,-5.6e-05,5e-06,6.1e-05,-4.6e-05,0,-2e-05,1.9e-05,9.1e-05,1.4e-05,-1.2e-05,-1.5e-05,1.4e-05,6e-05,-3e-06,-5.6e-05,4e-06,-2.8e-05,-1.2e-05,-8e-06,0,4e-06,9e-06,2e-06,-1.2e-05,-1.3e-05,1e-06,2e-06,8e-06,-1e-06,-4e-06,-1.7e-05,-4e-06,3e-06,-1.9e-05,-2e-06,-2.1e-05,6.7e-05,1e-06,2.8e-05,-1.8e-05,1e-05,-1e-05,2e-06,0,-3e-06,-2e-06,-5e-06,3e-06,1e-06,-1e-06,0,1e-06,-2.4e-05,-3e-06,2e-06,3e-06,2e-06,7e-06,-3e-06,-1e-06,-7e-06,2e-06,-1e-05,1e-06,1e-06,4e-06,6e-06,-3e-06,1e-06,2e-06,-1e-06,-8e-06,-8e-06,1e-06,1e-06
-5e-06,-1e-06,3e-06,-1e-06,-2e-06,-2e-06,2e-06,-1e-06,-5e-06,8e-06,-6e-06,-5e-06,-3e-06,0,-5e-05,-2e-06,-4e-05,1.9e-05,9e-05,-0.000112,1.3e-05,-2.1e-05,-5.8e-05,0.000118,2e-05,-8.4e-05,-1.8e-05,-7.9e-05,-2.5e-05,-3.5e-05,3.4e-05,-7.6e-05,0,4.6e-05,0.000274,4.2e-05,6.9e-05,3.4e-05,-0.000216,-3.1e-05,-6.4e-05,5.5e-05,-1.7e-05,5e-05,-7e-06,1.8e-05,-6e-06,-6e-06,-3.4e-05,3.3e-05,1.1e-05,-7.8e-05,1.5e-05,-9e-05,3e-06,1.8e-05,2e-06,2e-06,2.2e-05,2.8e-05,4.8e-05,2.6e-05,2e-05,2.1e-05,-1e-05,-3e-06,6e-06,-1.1e-05,-9e-06,4e-06,2e-06,0,-6e-06,2e-06,1e-06,-6e-06,4e-06,-6e-06,5e-06,-1e-06,-1e-05,3.5e-05,-7.1e-05,-2e-06,6e-06,-4e-06,3e-06,-8e-06,-1e-06,1e-06,1e-06,3e-06,2e-06,-4e-06,2e-06,-1e-06,-1e-06,2e-06,1.2e-05,-1e-06,0,-5e-06,1e-06,-3e-06,2e-06,0,5e-06,1e-06,1.2e-05,-1e-06,-2e-06,-1e-06,-2e-06,4e-06,0,1e-06,7e-06,6e-06,-1e-06,1e-06,-3e-06
-1e-06,0,-4e-06,2e-06,2e-06,-1e-06,-2e-06,1e-06,5e-06,-9e-06,-7e-06,-9e-06,0,7e-06,2.1e-05,-3e-06,1.8e-05,2e-06,6e-06,1.8e-05,5.7e-05,-3.6e-05,-0.000141,-7e-05,1.3e-05,2.7e-05,9e-05,3.4e-05,4.2e-05,-2.5e-05,-3.1e-05,-4.1e-05,1.4e-05,-2.6e-05,-0.000266,-8.3e-05,8e-06,2e-06,0.000212,-2.1e-05,7e-05,3.7e-05,-3.9e-05,-9.4e-05,7e-06,3e-05,-2.2e-05,-6e-06,-2.7e-05,-4.3e-05,1.7e-05,1.3e-05,-2.5e-05,8.7e-05,6e-06,-3.3e-05,-1e-06,-9e-06,-5.1e-05,-1.4e-05,-3.1e-05,1e-05,1.3e-05,3e-06,6e-06,2e-06,1.3e-05,7e-06,1.2e-05,1.6e-05,-3e-06,-3e-06,2e-06,-2e-06,0,2e-06,7e-06,4e-06,-2e-06,1.3e-05,-1e-06,-4.2e-05,4.4e-05,1e-06,-2.9e-05,-3.9e-05,-3e-05,0,-5e-06,-2e-06,-1e-05,-1e-06,1e-06,0,-1e-06,-2e-06,-1e-06,2e-06,4e-06,0,-1e-06,2e-06,-1e-06,1e-06,1e-06,0,-2e-06,-4e-06,-3e-06,1e-06,6e-06,-8e-06,-3e-06,2e-06,-1e-06,0,1.4e-05,-7e-06,0,1e-06,0
-1e-06,1e-06,1e-06,5e-06,-3e-06,4e-06,0,2e-06,0,-1.2e-05,3e-06,-5e-06,4e-06,-4.5e-05,1e-06,-5e-06,1.7e-05,3.8e-05,-1e-04,0.000103,1.1e-05,-1.4e-05,-2.9e-05,-6.5e-05,-1e-04,-3.2e-05,7.7e-05,-3e-05,-1.9e-05,7e-06,-8e-06,7.3e-05,2.3e-05,1.5e-05,1.8e-05,5.1e-05,-8.7e-05,-1.6e-05,-7.2e-05,-2.6e-05,-0.000103,-9.5e-05,7e-06,7e-06,2.8e-05,-3e-06,-1.9e-05,8e-06,6.2e-05,5.7e-05,-8e-06,5.9e-05,1e-05,-8.8e-05,7e-06,1e-05,-2e-06,-6e-06,2e-06,1.8e-05,1.3e-05,-1.6e-05,-7e-06,7e-06,3e-06,-1e-06,5e-06,-2e-06,-9e-06,8e-06,5e-06,1e-06,-8e-06,-4e-06,-1e-06,1.4e-05,-3e-06,1e-06,-9e-06,6e-06,-4e-06,2.7e-05,-1.5e-05,0,1.4e-05,-2.4e-05,2.4e-05,-1e-06,-4e-06,-2e-06,3e-06,0,1e-06,1e-06,1e-06,0,-2e-06,1e-06,-2e-06,5e-06,-1e-06,-4e-06,-2e-06,0,-1e-06,1e-06,-2e-06,3e-06,1e-06,-1e-06,-7e-06,-1.1e-05,1e-06,-5e-06,1e-06,0,1e-05,-1e-06,5e-06,2e-06,0
2e-06,-1e-06,-5e-06,-8e-06,1e-06,2e-06,2e-06,0,4e-06,4e-06,5e-06,1e-06,-1e-06,-3.3e-05,-1.2e-05,-4e-06,-5.1e-05,4.1e-05,8.2e-05,0.000105,-4.1e-05,-3e-05,-1e-06,8.7e-05,0.000132,4.4e-05,-8.2e-05,4.6e-05,-3e-06,2.1e-05,2.3e-05,-2.9e-05,-1.9e-05,-1e-06,0.00012,3e-05,-4.5e-05,6.8e-05,5.4e-05,-3e-06,0.000115,7.1e-05,2.5e-05,3.4e-05,0,-8e-06,-7e-06,-2.2e-05,-8e-05,-7.1e-05,5e-06,-6e-06,9e-06,7.5e-05,-1e-06,3.4e-05,8e-06,-1.5e-05,1.9e-05,-1.3e-05,-1.7e-05,-2.2e-05,-2e-06,-3.7e-05,-7e-06,1e-06,1.4e-05,0,-2e-06,-6e-06,0,0,-1e-06,0,0,-2.2e-05,6e-06,-5e-06,3e-06,-3e-06,2e-06,-4.4e-05,7e-06,2e-06,-1.2e-05,-4.2e-05,2e-06,9e-06,2e-06,2e-06,-9e-06,1e-06,-2e-06,1e-06,-1e-06,0,-1e-06,-2e-06,-1.4e-05,-1e-06,2e-06,1e-06,-1e-06,-1e-06,-1e-06,-1e-06,3e-06,2e-06,-1.2e-05,0,1e-06,-5e-06,2e-06,9e-06,-2e-06,0,-7e-06,-2e-06,-3e-06,-1e-06,-1e-06
-1e-06,0,0,-5e-06,0,-6e-06,-2e-06,-2e-06,-5e-06,-5e-06,7e-06,-5e-06,-5e-06,-1.2e-05,-1.1e-05,-1e-06,5e-05,-5.6e-05,-1.4e-05,6.3e-05,-2.3e-05,-4e-05,9.3e-05,3.4e-05,-8.4e-05,-3.8e-05,-9.2e-05,-4.8e-05,1.6e-05,1.3e-05,2.9e-05,5.2e-05,2.8e-05,1.7e-05,-0.000162,-7.6e-05,3.5e-05,-0.000107,-6.8e-05,1.2e-05,-9e-05,2.4e-05,3.9e-05,1.3e-05,-1e-05,1.1e-05,-1.9e-05,3e-06,7.9e-05,3.3e-05,6e-06,-6.3e-05,-1.6e-05,-7.8e-05,3e-06,-3.7e-05,1.6e-05,-1.3e-05,-7e-06,-2e-06,6e-06,7e-06,1e-06,-1.6e-05,-7e-06,-1e-06,2.5e-05,1e-06,3e-06,-1.3e-05,-2e-06,-2e-06,-6e-06,0,1e-06,1.8e-05,4e-06,-1e-06,8e-06,-6e-06,2e-06,6e-06,-2.1e-05,-1e-06,2e-06,4e-05,-1.5e-05,-2e-06,1e-06,-2e-06,-2e-06,0,-1e-06,-1e-06,-3e-06,0,-1e-06,-2e-06,3.1e-05,-3e-06,0,-3e-06,0,0,2e-06,0,-3e-06,-3e-06,1.5e-05,0,8e-06,9e-06,-1e-06,-8e-06,2e-06,0,-1e-05,3e-06,-2e-06,-2e-06,1e-06
4e-06,0,-2e-06,-1e-06,0,-5e-06,2e-06,-2e-06,-2e-06,-1.5e-05,-5e-06,6e-06,0,4.4e-05,4.9e-05,0,-2.3e-05,-4.2e-05,-3.1e-05,-4.6e-05,2.9e-05,-2.8e-05,1.3e-05,4.5e-05,-5.1e-05,-6.1e-05,3.1e-05,3.2e-05,-2.3e-05,-2.3e-05,-2.2e-05,2.9e-05,-1e-06,-4e-06,0.000127,4.6e-05,6.3e-05,1.4e-05,9e-06,1.3e-05,2.7e-05,-8.6e-05,1.1e-05,-3.9e-05,2e-06,-4e-06,-3.1e-05,1e-05,-6.8e-05,-4.3e-05,0,1e-06,7e-06,6.7e-05,-1e-06,1.7e-05,8e-06,-7e-06,8e-06,1e-05,1e-06,1e-06,-2.1e-05,-1.4e-05,3e-06,0,1.3e-05,1e-06,5e-06,-6e-06,6e-06,0,-3e-06,-3e-06,-1e-06,-7e-06,-6e-06,2e-06,-4e-06,-4e-06,-4e-06,-2.4e-05,5.2e-05,-1e-06,2.8e-05,6e-06,1.3e-05,-2e-06,-4e-06,-1e-06,-8e-06,-1e-06,0,-1e-06,0,0,-1e-06,-3e-06,-1.9e-05,-3e-06,-2e-06,2e-06,0,1e-06,0,0,3e-06,1e-06,-6e-06,-1e-06,-9e-06,5e-06,-1e-06,2e-06,-1e-06,0,-1e-06,0,-5e-06,0,-2e-06
-7e-06,-1e-06,-1e-06,4e-06,0,1e-06,-3e-06,0,-2e-06,-2e-06,1e-06,-7e-06,5e-06,4.5e-05,-7.2e-05,2e-06,-5e-06,6e-06,4.2e-05,-6e-05,3.1e-05,-2e-05,-3.7e-05,-4.4e-05,2.3e-05,5.9e-05,0.000124,7e-06,-2.2e-05,-1.4e-05,-1.2e-05,-4.1e-05,4e-06,6e-06,-0.000128,-2.5e-05,-2.2e-05,8.7e-05,6e-05,4e-06,-1e-06,3.1e-05,-1e-06,-3e-05,-1e-05,6e-06,-2.9e-05,-8e-06,2.9e-05,2.4e-05,-2.3e-05,6.3e-05,3e-06,-6.6e-05,-4e-06,-5e-06,4e-06,-5e-06,-5e-06,-1e-05,-1.4e-05,4e-06,9e-06,1.6e-05,-1e-06,0,-1e-06,0,-4e-06,7e-06,-8e-06,-1e-06,-2e-06,2e-06,0,-4e-06,-2e-06,-3e-06,0,-9e-06,0,-4e-06,-7.5e-05,-1e-06,-2.4e-05,5.4e-05,-9e-06,1e-06,-1e-06,1e-06,9e-06,0,1e-06,2e-06,-2e-06,0,0,0,1e-06,0,1e-06,-4e-06,1e-06,-2e-06,-1e-06,0,-2e-06,1e-06,0,0,2e-06,2e-06,1e-06,0,-1e-06,0,5e-06,4e-06,1e-06,0,1e-06
5e-06,0,1e-06,3e-06,0,3e-06,2e-06,2e-06,2e-06,3e-06,-1e-06,-2e-06,1e-06,1.3e-05,5.7e-05,1e-06,8e-06,3.1e-05,-5.6e-05,-0.000127,-1.8e-05,-2.4e-05,-0.000128,-0.000119,-2.9e-05,1.7e-05,-0.000109,-7e-06,1.1e-05,2.3e-05,2e-05,4e-05,-4e-06,-4e-06,-2.5e-05,3.3e-05,-5.6e-05,-3.6e-05,-7.1e-05,1.1e-05,-3.1e-05,5.5e-05,-8e-06,-8e-06,7e-06,1.2e-05,-3.2e-05,1e-06,4e-06,4e-06,-4e-06,-6e-06,-1.1e-05,6.7e-05,-2e-06,-4e-06,2e-06,2e-06,-1.7e-05,3e-06,1.4e-05,5e-06,2.1e-05,-1.7e-05,-4e-06,0,-6e-06,0,-7e-06,1.1e-05,3e-06,-1e-06,-5e-06,0,0,4e-06,0,-2e-06,2e-06,-8e-06,-4e-06,1.5e-05,6.7e-05,-1e-06,2e-06,-1e-06,3e-06,-1e-06,-2e-06,-1e-06,-1e-05,1e-06,-1e-06,-1e-06,0,1e-06,0,0,-6e-06,3e-06,1e-06,3e-06,1e-06,2e-06,0,0,1e-06,-4e-06,-7e-06,0,6e-06,-6e-06,0,-1e-06,1e-06,-1e-06,6e-06,-1e-06,2e-06,-1e-06,-2e-06
-1e-06,0,-1e-06,2e-06,0,3e-06,-1e-06,1e-06,8e-06,-1.1e-05,-1e-05,0,-4e-06,-1.4e-05,-3.4e-05,1e-06,-5e-06,3.5e-05,3.5e-05,0.000121,-3.6e-05,-3.9e-05,-7.2e-05,-3.4e-05,3e-05,4e-06,-0.000101,-3.1e-05,-1.4e-05,3e-06,4.5e-05,-1.7e-05,-1.1e-05,1.9e-05,9.6e-05,-2.7e-05,-6.2e-05,-4.9e-05,6.8e-05,-3e-06,8.2e-05,-4.8e-05,-1.5e-05,6e-05,-1.8e-05,-6e-06,-9e-06,3e-06,-4.5e-05,2.5e-05,1e-06,-5.7e-05,6e-06,-6.6e-05,-5e-06,7e-06,-4e-06,7e-06,3.4e-05,-4e-06,-1.9e-05,1.4e-05,-4e-06,1e-06,-4e-06,1e-06,-9e-06,3e-06,9e-06,2e-06,-7e-06,0,-1e-06,0,0,-3e-06,-5e-06,2e-06,-4e-06,-2e-06,-2e-06,-2e-05,-3.7e-05,-3e-06,5e-06,2.6e-05,2e-06,3e-06,-3e-06,0,1e-06,0,0,-1e-06,0,0,0,1e-06,1.2e-05,2e-06,-1e-06,-4e-06,0,-1e-06,0,0,1e-06,1e-06,1.2e-05,0,-6e-06,0,0,-3e-06,-1e-06,0,5e-06,2e-06,2e-06,0,0
0,0,3e-06,-2e-06,0,-2e-06,2e-06,-1e-06,-3e-06,-5e-06,4e-06,-9e-06,-1e-06,-4.1e-05,8e-06,0,1.1e-05,-1.4e-05,4.1e-05,-8.6e-05,4e-06,-2.5e-05,8.3e-05,5.2e-05,3e-06,-4e-06,6.8e-05,-1.4e-05,-1.3e-05,-5e-06,2.1e-05,-5e-05,1e-05,-8e-06,-9.3e-05,-3.1e-05,2.2e-05,2.9e-05,-0.000137,-1.1e-05,-7.6e-05,-2.4e-05,8e-06,3.4e-05,1.1e-05,-1.1e-05,-1.5e-05,0,6.4e-05,-1.9e-05,5e-06,3e-06,4e-06,6.4e-05,-6e-06,1.5e-05,-8e-06,9e-06,6e-06,-2e-06,2.4e-05,-8e-06,-1.2e-05,1e-05,0,0,-1.9e-05,-7e-06,-5e-06,-6e-06,1.2e-05,0,-5e-06,0,-1e-06,6e-06,6e-06,0,0,5e-06,2e-06,4.1e-05,8e-06,1e-06,-2.4e-05,-4.1e-05,0,-1e-06,1e-06,2e-06,-1.3e-05,0,-1e-06,1e-06,0,0,1e-06,0,-1.3e-05,-1e-06,-1e-06,2e-06,-1e-06,1e-06,0,0,-3e-06,1e-06,-5e-06,0,0,2e-06,0,7e-06,0,0,-7e-06,-4e-06,-3e-06,0,-1e-06
