0.014784,0.014614,0.014218,0.01856,0.022601,0.022283,0.021693,0.020742,0.018496,0.017665,0.017345,0.014579,0.012742,0.012388,0.010972,0.010294,0.010801,0.010236,0.010082,0.011114,0.012182,0.012481,0.011912,0.012318,0.011707,0.010426,0.010083,0.009935
0.017801,0.018247,0.018027,0.023613,0.028464,0.02743,0.026252,0.025439,0.023215,0.022022,0.02141,0.018062,0.015781,0.015408,0.013657,0.012525,0.013073,0.012257,0.011799,0.013341,0.015016,0.015581,0.014909,0.015184,0.014266,0.012684,0.012383,0.012165
0.022391,0.024314,0.024526,0.031972,0.038143,0.035884,0.033528,0.033034,0.031181,0.029453,0.02816,0.024036,0.021102,0.020515,0.018187,0.016297,0.016907,0.015483,0.014349,0.016808,0.01968,0.021146,0.020628,0.020483,0.018998,0.016859,0.016781,0.016751
0.025202,0.028884,0.029461,0.037249,0.044294,0.04147,0.03796,0.037888,0.036857,0.034521,0.032099,0.028189,0.025267,0.02424,0.021556,0.01942,0.020237,0.017954,0.016019,0.018931,0.022643,0.026016,0.026761,0.026245,0.024414,0.021545,0.022035,0.022998
0.026539,0.031346,0.031212,0.037324,0.045275,0.042744,0.038195,0.03951,0.039722,0.036039,0.032051,0.029234,0.027319,0.026105,0.023358,0.021372,0.022191,0.019643,0.017591,0.019718,0.023408,0.029819,0.033039,0.033508,0.032739,0.028648,0.029064,0.031161
0.027956,0.032593,0.030518,0.0337,0.042133,0.040375,0.036567,0.040816,0.041726,0.035978,0.030416,0.02804,0.027425,0.026828,0.02468,0.023349,0.023364,0.020455,0.018729,0.019858,0.023391,0.032526,0.039024,0.044448,0.047412,0.040482,0.03811,0.040069
0.029128,0.03235,0.029477,0.030563,0.038819,0.0394,0.037313,0.041446,0.041631,0.035522,0.030507,0.028976,0.028412,0.027975,0.027305,0.026782,0.025254,0.021301,0.019599,0.020661,0.024405,0.034185,0.045027,0.060781,0.069222,0.056542,0.047957,0.047711
0.033383,0.034569,0.032184,0.035306,0.045759,0.048696,0.046648,0.046521,0.0448,0.0405,0.038025,0.037566,0.035287,0.033448,0.033196,0.03339,0.031812,0.02682,0.023681,0.024251,0.02718,0.035792,0.051757,0.080238,0.093759,0.075467,0.061495,0.057598
0.050409,0.047985,0.044459,0.05627,0.074041,0.079251,0.078566,0.074493,0.068349,0.062399,0.059906,0.059813,0.054559,0.050189,0.048742,0.048707,0.047736,0.041369,0.036375,0.036634,0.038121,0.044785,0.063765,0.099757,0.112899,0.091978,0.079594,0.073619
0.088736,0.079492,0.070448,0.100186,0.134515,0.141542,0.143417,0.135271,0.119094,0.108295,0.105548,0.105604,0.09426,0.084889,0.080702,0.081357,0.081508,0.069987,0.061288,0.062675,0.063951,0.071177,0.090689,0.120697,0.123005,0.103927,0.102194,0.098351
0.153931,0.130014,0.111407,0.17467,0.240893,0.247507,0.249615,0.237531,0.204089,0.185162,0.185155,0.186283,0.163413,0.145159,0.138335,0.143466,0.142845,0.117501,0.10262,0.108849,0.111336,0.121787,0.148033,0.161203,0.135574,0.119978,0.133629,0.133418
0.244505,0.197712,0.167744,0.277997,0.392217,0.396292,0.392277,0.376366,0.319911,0.291921,0.298729,0.298528,0.257108,0.22934,0.22375,0.241818,0.239456,0.186168,0.159198,0.174098,0.178841,0.193195,0.23591,0.232245,0.166151,0.151825,0.179419,0.180427
0.336717,0.261328,0.224339,0.382674,0.550727,0.554298,0.534655,0.514358,0.439401,0.404789,0.418897,0.4094,0.342631,0.308846,0.312728,0.355812,0.352192,0.257234,0.211637,0.238749,0.247657,0.263736,0.329955,0.324663,0.217662,0.190734,0.222483,0.225281
0.380116,0.283911,0.250016,0.43173,0.632372,0.637546,0.599143,0.584507,0.509773,0.467551,0.482205,0.455819,0.365517,0.33451,0.357189,0.431018,0.427048,0.290697,0.225596,0.264274,0.280245,0.293988,0.377154,0.38255,0.252874,0.210433,0.234727,0.238728
0.332435,0.244879,0.22272,0.377593,0.558538,0.563295,0.524428,0.531014,0.472782,0.42381,0.432726,0.394369,0.298315,0.278362,0.319704,0.407149,0.402013,0.254298,0.181492,0.222312,0.24502,0.254971,0.333339,0.347639,0.230381,0.187642,0.199242,0.199687
0.211266,0.159489,0.152433,0.24221,0.354375,0.359817,0.343415,0.365149,0.326936,0.281213,0.283364,0.25227,0.18217,0.174852,0.214452,0.280968,0.27541,0.165804,0.108078,0.135207,0.156418,0.166057,0.219409,0.230121,0.155186,0.12955,0.133363,0.132687
0.109122,0.093071,0.090813,0.126759,0.173561,0.178688,0.187468,0.200621,0.1689,0.140468,0.144847,0.130908,0.096272,0.094743,0.116688,0.144048,0.136791,0.091173,0.066476,0.071241,0.080794,0.087567,0.110042,0.115596,0.089794,0.082876,0.085439,0.101936
0.09703,0.093907,0.08424,0.113609,0.152832,0.153141,0.162619,0.160086,0.120098,0.101649,0.113837,0.108248,0.085982,0.08136,0.088765,0.09283,0.080649,0.071296,0.067735,0.061374,0.066916,0.072811,0.081286,0.086554,0.080704,0.084549,0.099563,0.144178
0.125145,0.115181,0.097079,0.130045,0.183557,0.177259,0.169028,0.161916,0.131772,0.11697,0.118875,0.116595,0.113844,0.117291,0.105968,0.087587,0.075216,0.07982,0.079798,0.071599,0.077118,0.080068,0.085967,0.096948,0.099214,0.111863,0.143643,0.210769
0.151027,0.13351,0.110941,0.143388,0.213197,0.216361,0.190423,0.168265,0.14535,0.132499,0.118617,0.11821,0.143134,0.160355,0.132285,0.091737,0.079967,0.095005,0.093685,0.083133,0.086441,0.087513,0.092795,0.107907,0.121763,0.145037,0.185433,0.259371
0.157855,0.137931,0.119171,0.145038,0.219444,0.243228,0.217926,0.183555,0.160334,0.146442,0.124553,0.118412,0.156643,0.185677,0.156064,0.109078,0.094321,0.109573,0.106227,0.095889,0.096646,0.094789,0.094495,0.110993,0.136894,0.162678,0.19431,0.252646
0.143499,0.12529,0.118238,0.137244,0.194855,0.234689,0.231243,0.192208,0.163218,0.15759,0.140568,0.119234,0.149927,0.179191,0.156605,0.121015,0.109888,0.118923,0.110799,0.104417,0.104666,0.097647,0.090665,0.10619,0.132848,0.145342,0.156097,0.190504
0.12239,0.108634,0.108358,0.12172,0.158715,0.194649,0.205076,0.174139,0.14738,0.153513,0.142808,0.11173,0.132188,0.152394,0.130883,0.111888,0.111221,0.114814,0.10482,0.103188,0.107777,0.101253,0.092386,0.107028,0.122605,0.110968,0.106281,0.138803
0.103859,0.098131,0.100126,0.106138,0.13334,0.158181,0.166768,0.151252,0.130677,0.132651,0.123649,0.104704,0.120698,0.12401,0.097908,0.086164,0.09392,0.104155,0.099594,0.095901,0.103341,0.103818,0.095858,0.114476,0.131765,0.107555,0.094756,0.128986
0.110858,0.116095,0.110699,0.101307,0.120457,0.142549,0.158516,0.151104,0.126453,0.110013,0.102125,0.104202,0.116927,0.118639,0.092843,0.071348,0.075031,0.089132,0.090212,0.090637,0.107142,0.114933,0.101485,0.121447,0.155392,0.133986,0.112959,0.133211
0.127669,0.142545,0.136676,0.114527,0.129072,0.148721,0.163147,0.152565,0.121782,0.104937,0.104554,0.111994,0.128129,0.144266,0.114022,0.081448,0.079849,0.086621,0.089522,0.103927,0.125133,0.126662,0.110583,0.126277,0.161091,0.146146,0.123492,0.123789
0.152727,0.167343,0.167602,0.140764,0.157214,0.174413,0.173657,0.165413,0.135452,0.11795,0.127178,0.129958,0.145509,0.179682,0.149787,0.111586,0.099765,0.091183,0.101931,0.129672,0.139371,0.132296,0.129561,0.131679,0.138223,0.128786,0.119676,0.107757
0.199081,0.21835,0.213258,0.173943,0.19308,0.200043,0.175832,0.182942,0.177685,0.162282,0.1734,0.159293,0.16265,0.210777,0.19076,0.14926,0.129688,0.112574,0.121821,0.145956,0.14312,0.140355,0.166635,0.158453,0.117682,0.107327,0.126009,0.10849
0.268211,0.296327,0.272204,0.204329,0.215685,0.226037,0.202195,0.221257,0.236836,0.230332,0.235716,0.195001,0.188188,0.255873,0.243188,0.178641,0.16142,0.147422,0.139774,0.154361,0.147142,0.162727,0.230699,0.22201,0.136123,0.107014,0.140033,0.120883
0.359921,0.379102,0.314109,0.209922,0.204127,0.224993,0.231936,0.263343,0.286034,0.305908,0.299717,0.22264,0.22893,0.310157,0.280851,0.183118,0.182478,0.1809,0.158237,0.174576,0.171251,0.210205,0.298061,0.284745,0.170488,0.118668,0.155106,0.131772
0.436665,0.429891,0.326904,0.199692,0.175116,0.19109,0.229418,0.276286,0.309803,0.378599,0.355827,0.235315,0.253564,0.321849,0.271375,0.173956,0.197732,0.203152,0.169387,0.191573,0.194149,0.250558,0.322025,0.302953,0.198595,0.139495,0.170386,0.141127
0.462691,0.412447,0.301459,0.180564,0.157638,0.16507,0.205846,0.254743,0.305346,0.423743,0.375805,0.215878,0.231738,0.264678,0.207315,0.1484,0.193627,0.20437,0.17234,0.192451,0.199915,0.254054,0.281791,0.257895,0.193691,0.153306,0.168552,0.128666
0.412213,0.332446,0.259523,0.164272,0.143964,0.165944,0.198575,0.223436,0.256841,0.395309,0.352446,0.18821,0.178345,0.176777,0.141129,0.112135,0.15284,0.17456,0.158154,0.171164,0.184457,0.221089,0.219045,0.185204,0.155081,0.166074,0.171131,0.103586
0.306389,0.26538,0.23966,0.148582,0.130452,0.172547,0.191729,0.191025,0.186938,0.29547,0.285237,0.164971,0.130048,0.114555,0.103689,0.082238,0.099239,0.142862,0.139317,0.131408,0.157511,0.175628,0.153723,0.119381,0.116945,0.16868,0.161977,0.076824
0.222446,0.229846,0.213277,0.131829,0.119676,0.154437,0.153562,0.14864,0.146496,0.19189,0.184039,0.124618,0.093963,0.074352,0.079231,0.071248,0.078959,0.127354,0.120555,0.096701,0.136321,0.150274,0.118794,0.09315,0.089512,0.142153,0.1348,0.063385
0.157183,0.172798,0.153207,0.103849,0.107786,0.126109,0.106355,0.100503,0.120171,0.120501,0.106929,0.097941,0.088048,0.064208,0.062392,0.067782,0.077786,0.111546,0.106908,0.094512,0.128346,0.117498,0.091129,0.083543,0.067369,0.095627,0.100973,0.060378
0.117221,0.105232,0.0876,0.069727,0.085795,0.100604,0.079759,0.068848,0.089127,0.082519,0.078396,0.080561,0.081559,0.060549,0.048927,0.066045,0.072282,0.084819,0.08392,0.087564,0.11048,0.0757,0.058233,0.068214,0.05278,0.058282,0.064312,0.054497
0.08702,0.068694,0.054583,0.04881,0.064837,0.074711,0.060229,0.049115,0.061319,0.058431,0.065196,0.061207,0.065999,0.052698,0.034893,0.057244,0.060706,0.067597,0.067751,0.073955,0.082486,0.049301,0.037906,0.06081,0.053669,0.035207,0.041127,0.052087
0.06546,0.05239,0.049812,0.043885,0.054895,0.067353,0.054323,0.04001,0.045823,0.043659,0.058268,0.060426,0.056679,0.047236,0.029464,0.042808,0.044333,0.055207,0.058328,0.05728,0.060203,0.045159,0.033115,0.059909,0.056455,0.024728,0.030989,0.046156
0.053977,0.046389,0.054722,0.047408,0.045356,0.062125,0.058469,0.036669,0.037753,0.041507,0.058323,0.068365,0.05428,0.040728,0.027952,0.027648,0.027327,0.042839,0.048744,0.043874,0.050315,0.046247,0.03187,0.058863,0.058709,0.02449,0.025651,0.034061
