0.024139,0.023514,0.01981,0.02228,0.040423,0.057828,0.08288,0.353174,0.558084,0.687599,1.00976,1.178573,1.110321,0.932496,0.829662,0.927166,1.07975,0.912248,0.552922,0.347853,0.228286,0.139445,0.176498,0.24982,0.215536,0.246102,0.226182,0.08476
0.028632,0.02823,0.023848,0.026753,0.049458,0.071052,0.099036,0.401423,0.638779,0.80414,1.199117,1.407122,1.294863,1.050353,0.946732,1.107229,1.279466,1.045543,0.628354,0.406134,0.268511,0.164719,0.204318,0.284877,0.246533,0.282718,0.259941,0.097778
0.035207,0.035102,0.029576,0.033002,0.062477,0.090356,0.12349,0.466651,0.750607,0.996175,1.531329,1.797723,1.58796,1.218445,1.125462,1.401764,1.595509,1.237518,0.731774,0.49282,0.326579,0.199021,0.240128,0.328127,0.286919,0.332304,0.305696,0.115755
0.038966,0.038244,0.031413,0.03483,0.065523,0.094628,0.132735,0.470151,0.770881,1.15619,1.873999,2.177723,1.851603,1.382392,1.309182,1.63397,1.762248,1.293686,0.769323,0.539927,0.35256,0.206412,0.238033,0.32059,0.286479,0.333644,0.307129,0.119092
0.042883,0.03913,0.031083,0.033856,0.057342,0.081124,0.127522,0.440161,0.732535,1.292163,2.200108,2.516062,2.132598,1.675047,1.646419,1.865129,1.747295,1.197136,0.743876,0.536796,0.34698,0.190469,0.208447,0.285935,0.264895,0.299987,0.271175,0.108611
0.048278,0.042081,0.036127,0.038063,0.051588,0.068001,0.140434,0.554168,0.846909,1.447773,2.508493,2.839354,2.473851,2.175253,2.260575,2.286384,1.855624,1.206153,0.766815,0.544131,0.341197,0.176213,0.208376,0.302714,0.276431,0.286389,0.246007,0.098154
0.057385,0.051713,0.050556,0.052009,0.060433,0.073302,0.188582,0.835097,1.144757,1.693447,3.121315,3.631077,3.224496,3.117714,3.406353,3.320161,2.636305,1.737757,1.048185,0.684722,0.404937,0.203663,0.273463,0.410415,0.358496,0.342843,0.282793,0.109806
0.074457,0.069726,0.071563,0.072828,0.084307,0.10197,0.268608,1.223118,1.613679,2.272195,4.357814,5.177904,4.762078,4.934555,5.434454,5.14382,4.162798,2.887147,1.734688,1.103184,0.63936,0.306961,0.398088,0.584067,0.495681,0.456059,0.3688,0.138632
0.095464,0.089711,0.091563,0.095058,0.116603,0.143281,0.349695,1.560049,2.078115,3.172636,6.184743,7.37378,7.09109,7.670554,8.32781,7.702246,6.275075,4.506495,2.775214,1.74282,0.994117,0.462446,0.553458,0.775867,0.650644,0.602507,0.482535,0.174189
0.109582,0.102582,0.101616,0.109864,0.144242,0.176719,0.390452,1.66042,2.306461,4.274926,8.516658,10.137974,10.073761,11.029617,11.69686,10.590138,8.520659,6.234273,3.959975,2.458874,1.393928,0.648015,0.709218,0.913332,0.751184,0.729678,0.592419,0.207177
0.109794,0.103726,0.10014,0.11226,0.155885,0.187319,0.368359,1.449958,2.170579,5.037515,10.372245,12.748288,13.197975,14.169972,14.493168,12.848133,10.02454,7.383403,4.877949,3.027502,1.7336,0.826461,0.840912,0.966097,0.758453,0.766001,0.632182,0.216212
0.10234,0.097301,0.094448,0.109641,0.152204,0.174412,0.310052,1.162825,1.894801,5.046556,10.605263,13.747754,15.004176,15.675084,15.344163,13.2729,9.975013,7.432523,5.140458,3.21549,1.905011,0.929252,0.893109,0.942147,0.698291,0.699516,0.582851,0.200608
0.089165,0.087289,0.090193,0.106367,0.137839,0.150209,0.279386,1.145421,1.842598,4.448164,9.278666,12.464798,14.107368,14.430432,13.642676,11.637971,8.537686,6.377262,4.505094,2.872045,1.767963,0.862002,0.793368,0.810252,0.589078,0.609599,0.512114,0.1744
0.079832,0.078277,0.081954,0.101858,0.128,0.133976,0.262432,1.143539,1.735166,3.383848,6.863712,9.206341,10.358416,10.316486,9.467644,8.133039,6.06729,4.482423,3.162106,2.099144,1.297789,0.632885,0.601533,0.66792,0.521046,0.569698,0.475718,0.156312
0.089547,0.081433,0.075713,0.098612,0.13345,0.144158,0.278348,1.157625,1.661721,2.795797,5.182358,6.253479,6.325826,5.938153,5.362466,4.723085,3.632712,2.593265,1.798137,1.229846,0.76477,0.415013,0.513247,0.700133,0.562058,0.551591,0.4636,0.157554
0.113807,0.103586,0.08588,0.105743,0.160669,0.18479,0.338344,1.365141,1.868597,2.794186,4.579071,4.930423,4.467145,3.926624,3.613964,3.340625,2.569245,1.650659,1.063366,0.69599,0.484862,0.369775,0.595911,0.859419,0.656501,0.570578,0.486127,0.178038
0.147398,0.139288,0.11174,0.129897,0.208134,0.249512,0.413882,1.735107,2.404204,3.278537,5.102403,5.457541,4.743273,3.813966,3.336674,3.227228,2.724502,1.783925,1.0483,0.624624,0.486517,0.433725,0.71249,1.011709,0.753315,0.661858,0.598664,0.235065
0.185977,0.175016,0.138508,0.160482,0.266824,0.317933,0.455711,2.025383,2.892967,3.706303,6.020288,6.884772,5.704988,4.11779,3.624951,3.635083,3.355381,2.536123,1.498848,0.840367,0.607367,0.505017,0.765824,1.058376,0.778839,0.740737,0.732157,0.309335
0.21388,0.197691,0.154099,0.178399,0.313393,0.357569,0.480122,2.357463,3.380963,3.959481,6.873438,8.560076,6.984831,4.877987,4.510276,4.451624,4.153531,3.3534,1.985996,1.105203,0.750964,0.551529,0.791804,1.077566,0.765896,0.759588,0.808787,0.361073
0.22136,0.202238,0.156734,0.1762,0.312473,0.331524,0.485636,2.641669,3.722745,4.046016,7.13122,9.39546,7.982883,5.83796,5.466964,5.258859,4.910817,3.85384,2.173843,1.249205,0.881783,0.601866,0.791965,1.04252,0.705504,0.703792,0.776923,0.349643
0.205406,0.189686,0.152007,0.163744,0.262818,0.253789,0.444032,2.506133,3.53499,4.085323,6.827157,8.686292,7.756625,6.127828,5.769405,5.72483,5.345265,3.759692,1.984205,1.226609,0.911415,0.604717,0.7167,0.940746,0.636792,0.632451,0.68458,0.28864
0.171304,0.160054,0.139403,0.143004,0.196798,0.178581,0.373176,1.937119,2.807503,4.207193,6.723798,7.485658,6.926018,5.871264,5.575583,5.95325,5.196429,3.075469,1.636738,1.120791,0.801957,0.530253,0.635384,0.858492,0.57061,0.54988,0.584997,0.230573
0.122993,0.110023,0.107263,0.115766,0.148935,0.135169,0.30873,1.379851,2.081554,4.413685,7.111964,7.03822,6.301087,5.177194,4.988113,5.705368,4.532017,2.370979,1.528279,1.158666,0.738176,0.490718,0.587415,0.790648,0.515142,0.496199,0.559971,0.22453
0.078581,0.063895,0.070769,0.089105,0.120435,0.111935,0.285201,1.221671,1.80024,4.707007,7.7535,6.695908,5.130077,4.285118,4.349717,4.723985,3.534146,2.033714,1.63826,1.252852,0.756886,0.463747,0.540737,0.742931,0.487046,0.500497,0.596492,0.235556
0.054959,0.04321,0.048003,0.061958,0.085896,0.087031,0.261519,1.100794,1.623676,4.680544,7.810458,5.990398,3.702663,3.40883,3.760141,3.571934,2.709219,2.023081,1.720896,1.280832,0.7574,0.397397,0.50029,0.729281,0.476389,0.491872,0.607392,0.244554
0.044684,0.035393,0.032532,0.040671,0.058958,0.063448,0.227873,0.955747,1.520728,4.198252,6.604302,4.739933,2.867084,2.988898,3.097052,2.492075,2.008942,1.780674,1.525662,1.17211,0.69403,0.331832,0.478435,0.686235,0.439582,0.502728,0.624586,0.247493
0.037383,0.033799,0.029921,0.033643,0.046886,0.048255,0.198069,0.835973,1.45755,3.527111,4.908635,3.321426,2.434641,2.860139,2.60824,1.916209,1.531854,1.245626,1.071029,0.900492,0.553047,0.295098,0.467243,0.598276,0.375168,0.553512,0.692332,0.26306
0.035571,0.035572,0.033798,0.034939,0.044961,0.042434,0.188726,0.842985,1.554488,3.403557,4.087748,2.55641,2.239958,2.507881,2.104179,1.699511,1.37616,0.898646,0.711957,0.615003,0.400356,0.266688,0.417855,0.50635,0.333892,0.575856,0.734917,0.285904
0.041772,0.040135,0.037903,0.040698,0.054453,0.051587,0.191943,0.950723,1.7638,3.586103,4.074334,2.39295,2.081378,1.966707,1.525315,1.456164,1.250322,0.864119,0.667193,0.494759,0.316257,0.258533,0.360505,0.44994,0.346628,0.612276,0.775224,0.311668
0.054909,0.048658,0.043554,0.053824,0.071446,0.065746,0.197034,1.036362,1.852535,3.225452,3.665057,2.285199,1.864888,1.520054,1.125416,1.149796,0.991988,0.835324,0.683091,0.467165,0.301716,0.244861,0.351848,0.522326,0.429566,0.666297,0.816825,0.326363
0.074796,0.061612,0.053798,0.071896,0.088579,0.075541,0.187109,1.00657,1.701822,2.366687,2.803049,2.151841,1.69766,1.375917,1.100863,0.947085,0.783388,0.843708,0.705267,0.424026,0.275906,0.219338,0.32758,0.567839,0.482089,0.677207,0.843843,0.34624
0.088696,0.072504,0.062662,0.082121,0.099258,0.082644,0.164369,0.859596,1.351757,1.628986,2.223903,2.185428,1.610246,1.262494,1.217531,0.924544,0.705798,0.850431,0.709814,0.343053,0.218041,0.187819,0.290252,0.530779,0.458787,0.642767,0.853822,0.369784
0.083483,0.068744,0.059292,0.074424,0.091824,0.080553,0.15506,0.697297,1.057071,1.629486,2.596028,2.766794,1.889706,1.336871,1.260927,0.80385,0.614364,0.784393,0.642169,0.301548,0.207983,0.162058,0.245709,0.442108,0.369496,0.573822,0.833522,0.379151
0.058894,0.050359,0.045572,0.053074,0.066473,0.064222,0.13824,0.535444,0.865802,1.939331,3.531421,3.623204,2.251795,1.487577,1.202831,0.683086,0.572011,0.658028,0.500793,0.300267,0.228439,0.13446,0.208121,0.35224,0.288405,0.582192,0.85553,0.370231
0.031316,0.033391,0.037141,0.035863,0.042774,0.047254,0.110062,0.392694,0.716981,2.167999,4.312725,4.137437,2.272059,1.445143,1.139729,0.706773,0.622746,0.555621,0.394304,0.333903,0.237706,0.120082,0.171854,0.24893,0.221141,0.630715,0.893774,0.360367
0.019967,0.026564,0.033147,0.028818,0.031534,0.034471,0.076137,0.277285,0.558766,2.098499,4.414568,4.170975,2.180104,1.258054,0.966372,0.722847,0.711706,0.528713,0.376219,0.374923,0.232235,0.117984,0.147377,0.180198,0.184387,0.660399,0.903071,0.349422
0.024751,0.025987,0.035184,0.028925,0.024727,0.02782,0.062349,0.228525,0.434545,1.765236,3.754853,3.973465,2.397893,1.21059,0.804447,0.662602,0.737207,0.486015,0.362947,0.402136,0.249418,0.126753,0.169914,0.198667,0.175084,0.634767,0.847825,0.31646
0.033804,0.030778,0.044385,0.036134,0.025069,0.028716,0.067311,0.211151,0.37914,1.503347,3.077331,3.638763,2.425064,1.291712,0.931679,0.640238,0.694354,0.457667,0.321678,0.374179,0.274876,0.149582,0.207349,0.22864,0.148796,0.551459,0.748944,0.284416
0.041032,0.032859,0.052315,0.047082,0.02818,0.028929,0.067799,0.185127,0.35755,1.420106,3.037295,3.523972,2.105471,1.231077,1.10953,0.717296,0.625229,0.417185,0.253076,0.286631,0.270989,0.185129,0.267604,0.259741,0.122248,0.454221,0.634576,0.25359
0.043172,0.029988,0.054235,0.05512,0.034433,0.03201,0.06358,0.153219,0.347545,1.308894,2.749161,3.144936,1.771324,1.050521,1.164013,0.828127,0.526419,0.38434,0.229105,0.185826,0.232886,0.200903,0.318343,0.30329,0.12651,0.364898,0.523461,0.215332
