0.029667,0.061524,0.30745,0.590552,0.826765,1.011215,1.190648,1.158419,1.052213,1.067163,1.019692,1.013988,0.84145,0.666423,0.534262,0.432126,0.37673,0.290225,0.220761,0.171404,0.126475,0.086839,0.075113,0.13416,0.135076,0.055216,0.044613,0.266988
0.035791,0.074308,0.361338,0.684652,0.931505,1.123529,1.3439,1.326685,1.17178,1.164618,1.15104,1.163454,0.96527,0.768318,0.617347,0.502555,0.43796,0.337422,0.256384,0.203299,0.153521,0.105568,0.091827,0.159205,0.158308,0.06518,0.052615,0.321281
0.045321,0.094103,0.438299,0.807955,1.046647,1.250334,1.545219,1.554246,1.309703,1.262258,1.316555,1.34209,1.106004,0.887705,0.716616,0.593239,0.519068,0.40069,0.301293,0.250335,0.197042,0.13531,0.118436,0.196292,0.19199,0.08072,0.065072,0.404631
0.051075,0.105232,0.464387,0.826421,1.010314,1.2502,1.637363,1.667793,1.354607,1.270432,1.372454,1.344749,1.069183,0.856011,0.701,0.601144,0.532411,0.413197,0.300959,0.274046,0.231251,0.156561,0.135634,0.21523,0.207499,0.089761,0.07241,0.458365
0.052271,0.109292,0.456038,0.780862,0.922751,1.276502,1.77113,1.794835,1.420683,1.292071,1.417611,1.310723,0.980719,0.743813,0.605694,0.540404,0.482174,0.379445,0.268539,0.281496,0.269375,0.184947,0.154382,0.229729,0.214323,0.093491,0.078592,0.513506
0.052844,0.111176,0.47157,0.81675,1.026112,1.522142,1.999062,1.993213,1.642252,1.493013,1.632099,1.426571,0.985336,0.694153,0.537059,0.487106,0.436769,0.355803,0.273236,0.315528,0.342813,0.258072,0.207322,0.26923,0.228982,0.094381,0.084547,0.585748
0.057946,0.121413,0.572872,1.007763,1.285077,1.989182,2.494645,2.446434,2.229069,2.160795,2.346278,1.98718,1.280359,0.857493,0.602734,0.534779,0.497541,0.410355,0.343583,0.394863,0.469034,0.399553,0.32029,0.358073,0.267388,0.098312,0.094194,0.690572
0.072979,0.153709,0.778433,1.338348,1.705947,2.890133,3.770611,3.771714,3.619541,3.628493,3.897204,3.295161,2.136347,1.411375,0.959861,0.842353,0.785687,0.612376,0.474688,0.513467,0.638092,0.591372,0.483911,0.491112,0.338403,0.12194,0.121213,0.887627
0.098317,0.200441,1.060019,1.769583,2.348896,4.426443,5.930781,6.023711,5.958645,6.003012,6.190009,5.146486,3.457125,2.333698,1.624878,1.409791,1.261166,0.921397,0.64128,0.647129,0.793761,0.760368,0.644443,0.632109,0.434212,0.173656,0.165844,1.168431
0.130271,0.246938,1.320637,2.189646,3.159757,6.519197,8.803508,9.013787,9.157018,9.122456,8.761361,7.04146,4.980078,3.513974,2.515418,2.130677,1.844932,1.307362,0.8307,0.744164,0.843794,0.812232,0.724807,0.728051,0.533525,0.255936,0.227822,1.464916
0.162524,0.312976,1.553281,2.561328,4.025362,8.79437,11.872578,12.279559,12.737494,12.376005,10.934839,8.379123,6.261774,4.673479,3.398999,2.782964,2.372322,1.699698,1.039119,0.787995,0.757098,0.711855,0.68748,0.750394,0.613358,0.353848,0.297922,1.633856
0.179049,0.384906,1.673774,2.753686,4.717626,10.277744,13.697721,14.597669,15.498704,14.640855,12.046675,8.672293,6.603025,5.161435,3.790704,3.031029,2.594566,1.903517,1.165031,0.779642,0.618392,0.559336,0.600369,0.720661,0.649326,0.424038,0.350762,1.673945
0.162173,0.41964,1.64595,2.704889,4.836697,9.78461,12.849679,14.37035,15.466946,14.220513,11.169481,7.67962,5.720664,4.524444,3.318265,2.618922,2.299439,1.72081,1.074064,0.710097,0.518154,0.435603,0.480562,0.620371,0.597712,0.408172,0.342003,1.618671
0.117349,0.399551,1.586192,2.602661,4.216649,7.284735,9.527917,11.222783,11.985588,10.724165,8.104117,5.442171,3.924685,3.059427,2.201227,1.719126,1.582918,1.197704,0.788039,0.596514,0.45306,0.326104,0.328316,0.477712,0.475731,0.29718,0.26073,1.53598
0.071098,0.341174,1.583847,2.703875,3.436181,4.437552,5.679121,7.050947,7.497869,6.494635,4.708861,3.242462,2.26699,1.697278,1.192924,0.917309,0.888413,0.693491,0.578298,0.590871,0.472259,0.265391,0.203724,0.341945,0.334097,0.161402,0.163089,1.462517
0.058088,0.308822,1.720054,3.146483,3.359746,3.176737,3.612473,4.407666,4.588068,3.778402,2.64198,1.851522,1.172033,0.817449,0.586593,0.509269,0.56204,0.521884,0.60958,0.74158,0.602529,0.313581,0.195259,0.309621,0.274564,0.097124,0.123949,1.403043
0.081646,0.351334,2.106943,3.969017,3.972106,3.340228,3.566977,3.792496,3.195185,2.504108,1.959654,1.457358,0.965086,0.64831,0.462652,0.490491,0.588701,0.615445,0.785464,0.941716,0.756777,0.402265,0.260341,0.414927,0.360161,0.122431,0.134893,1.532225
0.117662,0.442376,2.634037,4.874866,4.538825,3.807393,4.439618,4.256622,2.911073,2.337838,2.182677,1.744894,1.249118,0.937048,0.685707,0.680251,0.750497,0.754915,0.953395,1.110424,0.890995,0.491231,0.336397,0.547062,0.474768,0.164268,0.162953,1.945809
0.156743,0.533785,2.974527,5.394307,4.855364,4.375419,5.615952,5.175693,3.268234,2.76657,2.909881,2.344792,1.696816,1.409706,1.039287,0.935151,0.927018,0.841854,1.05255,1.291276,1.062137,0.583162,0.396524,0.619183,0.534548,0.192071,0.1958,2.358312
0.194459,0.574056,2.922333,5.274695,4.941845,5.067325,6.820722,6.345532,3.955654,3.187821,3.664686,3.118487,2.251801,1.914254,1.410784,1.149047,1.012468,0.83236,1.05645,1.406518,1.193939,0.656439,0.434189,0.605543,0.50878,0.195181,0.220289,2.652079
0.230736,0.569305,2.576002,4.601359,4.502428,5.324013,7.705461,7.47035,4.710661,3.556936,4.267402,3.804122,2.723106,2.240644,1.648829,1.223195,0.931488,0.772952,1.054282,1.38437,1.186891,0.695948,0.454574,0.558522,0.462629,0.20175,0.248298,2.708234
0.24499,0.511137,2.119683,3.827201,3.909735,5.006873,7.690199,7.804573,5.087289,3.838813,4.566356,4.173257,2.945906,2.227358,1.622552,1.139063,0.752469,0.744353,1.088485,1.240792,1.028251,0.658996,0.433345,0.459164,0.389332,0.214226,0.270002,2.423893
0.238704,0.416743,1.641214,3.057729,3.383735,4.385268,6.64485,6.917911,4.795697,3.85011,4.343343,3.972597,2.826783,1.982271,1.361996,0.891305,0.586412,0.73599,1.072246,1.090726,0.840911,0.53658,0.361194,0.322901,0.287533,0.205744,0.255334,1.989194
0.229589,0.35376,1.284503,2.347758,2.769383,3.979858,5.871191,5.633043,3.99494,3.503294,3.630742,3.402361,2.603854,1.733637,1.055343,0.633238,0.505171,0.716703,0.981457,0.90697,0.618456,0.369288,0.269396,0.228234,0.230618,0.203411,0.240408,1.733335
0.211849,0.31114,1.042488,1.759345,2.171985,3.518878,5.123112,4.546365,3.172079,2.770014,2.59664,2.640527,2.282293,1.514366,0.839371,0.522937,0.517513,0.69019,0.835063,0.715528,0.447469,0.242605,0.203957,0.195003,0.206738,0.194463,0.222703,1.366434
0.195458,0.276106,0.885842,1.462181,1.853599,3.101953,4.436502,3.662671,2.328846,1.887598,1.71071,1.966854,1.834389,1.238798,0.724073,0.560756,0.566486,0.664596,0.717575,0.573834,0.350177,0.182082,0.164961,0.177368,0.188542,0.181822,0.202417,0.889971
0.170108,0.259955,0.77673,1.248664,1.613447,2.921475,4.031382,2.966805,1.663967,1.406217,1.425313,1.506159,1.2696,0.951487,0.689692,0.584844,0.576715,0.614736,0.647308,0.529351,0.319829,0.177551,0.167335,0.201376,0.211253,0.180442,0.193173,0.658088
0.148293,0.266686,0.70846,1.049673,1.379371,2.605364,3.432502,2.403591,1.322487,1.268145,1.50968,1.375547,0.908268,0.840067,0.752136,0.596667,0.589223,0.57151,0.603123,0.571581,0.360682,0.195668,0.186725,0.232009,0.235295,0.187932,0.200107,0.69587
0.13882,0.278751,0.644948,0.94435,1.198851,2.011613,2.594288,1.991102,1.336881,1.348849,1.652723,1.460697,0.855536,0.813364,0.756296,0.613775,0.622868,0.583493,0.628021,0.622705,0.403671,0.220124,0.217014,0.251869,0.232167,0.181862,0.188662,0.783534
0.137297,0.277057,0.595419,0.878463,1.088562,1.677195,2.126453,1.799306,1.407457,1.373237,1.635372,1.482877,0.904792,0.781819,0.688526,0.594574,0.592694,0.563674,0.621628,0.600184,0.399903,0.229176,0.232493,0.244078,0.201622,0.161659,0.167551,0.848135
0.124071,0.240381,0.538523,0.805529,1.100266,1.716424,2.052653,1.842093,1.488736,1.34139,1.506121,1.374308,0.890516,0.66571,0.563198,0.50918,0.512361,0.524387,0.549105,0.506094,0.347005,0.207597,0.209369,0.208267,0.164516,0.132145,0.139084,0.848928
0.0888,0.173418,0.444425,0.677861,1.058832,1.793823,2.028665,1.799755,1.473925,1.273019,1.327417,1.162684,0.792618,0.561029,0.466608,0.412928,0.445684,0.500571,0.478813,0.431591,0.308842,0.193912,0.173395,0.147864,0.112525,0.088366,0.100626,0.786113
0.061308,0.133666,0.393576,0.542962,0.917008,1.798342,1.819827,1.43217,1.350277,1.250328,1.278033,1.116239,0.798536,0.572822,0.421189,0.376727,0.424881,0.441339,0.389959,0.371753,0.278304,0.178268,0.135841,0.093339,0.071205,0.050629,0.070568,0.740599
0.059824,0.128016,0.394615,0.474072,0.819909,1.745816,1.572038,1.087067,1.269958,1.174472,1.179802,1.067243,0.777968,0.580181,0.356317,0.364008,0.423309,0.342595,0.276613,0.2975,0.232436,0.140326,0.092296,0.065024,0.052278,0.031208,0.055023,0.725559
0.068725,0.129959,0.374147,0.457055,0.898261,1.685501,1.382595,1.032595,1.293876,1.107455,1.000245,0.842311,0.633077,0.525317,0.297166,0.359323,0.476371,0.333034,0.219235,0.251441,0.208574,0.107012,0.063253,0.059859,0.044116,0.025825,0.051774,0.681997
0.080771,0.12745,0.32881,0.402193,0.988458,1.683934,1.358582,1.186015,1.318755,0.964788,0.727427,0.57861,0.444549,0.410624,0.300946,0.393092,0.511526,0.383111,0.247973,0.2571,0.199941,0.093985,0.061221,0.06537,0.041511,0.027456,0.065141,0.644697
0.092388,0.115064,0.299192,0.373987,1.025531,1.808964,1.495837,1.25355,1.249314,0.861498,0.493884,0.367904,0.277108,0.287963,0.327351,0.39887,0.4539,0.387569,0.284324,0.287731,0.212149,0.088019,0.073123,0.076388,0.042595,0.03471,0.080939,0.591326
0.098569,0.098965,0.276419,0.353397,0.949447,1.777662,1.494765,1.187186,1.075638,0.76122,0.418576,0.273814,0.199029,0.278345,0.378024,0.363419,0.32535,0.331898,0.333625,0.365964,0.236329,0.087232,0.084571,0.095373,0.058764,0.043955,0.085942,0.521797
0.091323,0.091243,0.252173,0.349036,0.824224,1.621944,1.467974,1.154272,1.037275,0.730543,0.442605,0.264511,0.228316,0.311613,0.403894,0.329075,0.221452,0.282745,0.383382,0.440589,0.249873,0.090401,0.092142,0.116145,0.081552,0.049129,0.078542,0.498826
0.074403,0.08562,0.223546,0.332156,0.733149,1.495714,1.439173,1.075832,0.96553,0.699498,0.531962,0.30215,0.27086,0.298154,0.362634,0.330125,0.21726,0.289801,0.417335,0.474017,0.279957,0.101423,0.102972,0.129661,0.101455,0.04907,0.066061,0.491968
