2e-05,8e-06,2.5e-05,4e-06,9e-06,1.3e-05,6e-06,7e-06,2.5e-05,4.6e-05,2.6e-05,3.2e-05,2.8e-05,1.9e-05,5e-06,3.4e-05,1.7e-05,7e-06,1.4e-05,3e-06,1.3e-05,2e-06,6e-06,6e-06,2.6e-05,1e-06,1.6e-05,2.4e-05,1.6e-05,2e-05,4e-06,9e-06,2.4e-05,2.9e-05,1e-05,6e-06,1.5e-05,2e-05,1.8e-05,2.1e-05,7e-06,1.9e-05,1e-06,5e-06,2.3e-05,6e-06,8e-06,1.6e-05,1.2e-05,2e-05,1.5e-05,1.1e-05,5e-06,1e-06,3.7e-05,2.3e-05,3e-06,2.8e-05,5e-06,1.5e-05,2.9e-05,1.6e-05,7e-06,1e-06,1e-06,2.3e-05,2e-05,2e-06,6e-06,8e-06,2.2e-05,3e-06,8e-06,2e-06,4e-06,4e-06,2.7e-05,2.7e-05,4e-06,2.7e-05,2e-06,7e-06,3e-06,1.2e-05,1.5e-05,9e-06,6e-06,1e-06,3.1e-05,1.7e-05,6e-06,2e-05,4e-06,2.6e-05,1.6e-05,1e-05,1e-06,1.6e-05,1.2e-05,2e-06,6e-06,1.2e-05,5e-06,1e-05,1e-05,1.4e-05,1.8e-05,1e-05,3e-06,2.1e-05,1e-06,4e-06,1e-05,8e-06,0,1.8e-05,1.4e-05,5e-06,7e-06,2.3e-05,6e-06
5.4e-05,7e-05,8.2e-05,3e-05,1.5e-05,2.2e-05,1.7e-05,1.6e-05,8.5e-05,8.8e-05,4.5e-05,5.4e-05,7e-05,6.1e-05,1.5e-05,7.2e-05,3.5e-05,3.2e-05,3.5e-05,1.9e-05,2.1e-05,1.7e-05,2.9e-05,1.1e-05,4.2e-05,3e-06,3.4e-05,3.7e-05,3.6e-05,9e-06,1.8e-05,2e-05,6.1e-05,3.8e-05,1.2e-05,1.5e-05,5.9e-05,3.8e-05,2.5e-05,4e-05,4.7e-05,6e-05,3.3e-05,2.2e-05,1.4e-05,4e-05,1.2e-05,2.3e-05,3.2e-05,2.2e-05,1.1e-05,6.2e-05,2.2e-05,1.1e-05,4e-05,4.9e-05,1.1e-05,5e-05,2e-05,4.2e-05,4.8e-05,2.3e-05,4.2e-05,2.3e-05,4e-06,2.6e-05,2.7e-05,1.4e-05,4e-05,3.1e-05,3.9e-05,1.9e-05,7e-06,1.4e-05,3.5e-05,3.5e-05,4.9e-05,6.3e-05,8e-06,4.8e-05,3e-06,2.2e-05,2.3e-05,4.4e-05,2.8e-05,1.9e-05,3e-06,1.6e-05,4.9e-05,4.3e-05,2.4e-05,3.6e-05,1.7e-05,5.6e-05,4.3e-05,5e-06,2.5e-05,1.9e-05,4e-05,1.2e-05,4.3e-05,1.2e-05,1.4e-05,2.3e-05,3.2e-05,5.8e-05,6.1e-05,3e-05,2.1e-05,4.5e-05,3e-05,3.2e-05,3.7e-05,8e-06,1.1e-05,6.7e-05,2.3e-05,1.3e-05,3.1e-05,5.9e-05,1.3e-05
4.3e-05,0.000122,3.6e-05,2.4e-05,3.6e-05,2.4e-05,6.8e-05,4.6e-05,0.000111,8.1e-05,8.2e-05,5.7e-05,0.000125,6.4e-05,4e-06,6.5e-05,2.8e-05,4.6e-05,3e-06,1.4e-05,6.9e-05,1.6e-05,5.5e-05,5.3e-05,6.6e-05,1.9e-05,2.8e-05,7.7e-05,6.2e-05,3.4e-05,9e-06,2.9e-05,5.3e-05,3.8e-05,4.7e-05,6.1e-05,8.6e-05,5.5e-05,2.7e-05,4.4e-05,8.4e-05,1.2e-05,2.4e-05,2.3e-05,3e-05,1.2e-05,5.5e-05,5.2e-05,3.6e-05,4.8e-05,5.1e-05,5.7e-05,3.9e-05,1.1e-05,2.8e-05,3.4e-05,1.3e-05,3.8e-05,1.7e-05,5.9e-05,4e-05,5.4e-05,5e-05,3.5e-05,8e-06,3.5e-05,2.1e-05,4e-05,2.9e-05,3.8e-05,3e-05,1.2e-05,1.3e-05,5.2e-05,3.8e-05,5.6e-05,8.6e-05,8.2e-05,1.6e-05,6.7e-05,2.5e-05,6e-05,5.4e-05,6e-05,5.7e-05,4.5e-05,2.4e-05,2.6e-05,5.9e-05,3.5e-05,1.5e-05,5.1e-05,2.3e-05,4e-05,2.5e-05,2.5e-05,1.3e-05,4.5e-05,2.8e-05,4.2e-05,5.1e-05,6.7e-05,4.4e-05,1.3e-05,3.9e-05,4.3e-05,6e-05,4e-05,3.1e-05,9.3e-05,5.3e-05,1.2e-05,5e-05,3.5e-05,1.7e-05,5.5e-05,5.9e-05,3e-05,2.7e-05,3.6e-05,1.9e-05
1.1e-05,9.1e-05,9.7e-05,7.6e-05,6.1e-05,8.2e-05,0.000112,0.000107,0.000118,8.8e-05,0.000129,0.000185,6.4e-05,0.000134,3e-05,7.8e-05,8.1e-05,0.000104,7.5e-05,2.7e-05,7.1e-05,3.4e-05,7.9e-05,1.6e-05,8.5e-05,3.5e-05,6.8e-05,7.9e-05,8.8e-05,6.6e-05,2.2e-05,3.5e-05,8.5e-05,3.1e-05,5.1e-05,3.5e-05,5.4e-05,9.6e-05,6.2e-05,7e-05,6.3e-05,9.3e-05,7.5e-05,0.000103,6.9e-05,6.6e-05,5e-06,8.6e-05,9.2e-05,4.4e-05,0.000108,3.4e-05,5.3e-05,5.7e-05,7.3e-05,5.2e-05,3.8e-05,2.9e-05,4.5e-05,6.8e-05,1e-04,0.000103,7.8e-05,4.1e-05,5.8e-05,3.4e-05,2.6e-05,3.3e-05,0.00011,5.9e-05,8.1e-05,5.6e-05,4.3e-05,0.000109,0.000151,8.7e-05,8e-05,0.00012,9.2e-05,6.2e-05,5.1e-05,8.2e-05,1e-04,3.5e-05,3.5e-05,2.9e-05,2.7e-05,2.6e-05,9.5e-05,5.1e-05,2.1e-05,3.7e-05,2.9e-05,8.6e-05,6.1e-05,8.8e-05,4.4e-05,8.5e-05,5.9e-05,5.9e-05,6.6e-05,3.8e-05,0.000119,7.7e-05,7e-05,5.1e-05,0.00014,0.000108,5.8e-05,7.4e-05,2.7e-05,1.1e-05,9e-05,7.9e-05,5.7e-05,3.7e-05,7.9e-05,3.8e-05,6.1e-05,2.9e-05,2.4e-05
6.3e-05,0.000102,7e-05,1.3e-05,8.1e-05,0.00011,0.000162,3.1e-05,6.5e-05,0.000145,0.000114,0.000135,8e-05,0.000121,0.000113,2.6e-05,7.2e-05,4e-05,2.2e-05,3.3e-05,2.5e-05,5e-05,7.5e-05,0.000126,0.000201,2.1e-05,7.3e-05,5e-06,3.1e-05,5.3e-05,6.1e-05,8.6e-05,4.1e-05,7.1e-05,5.4e-05,6.6e-05,9.9e-05,6.7e-05,0.000111,3e-05,0.000111,3.4e-05,0.00016,0.000108,7.7e-05,8.1e-05,9.7e-05,0.000191,5.8e-05,6.5e-05,6.5e-05,0.00017,7.2e-05,7e-06,5.6e-05,9.6e-05,4.8e-05,7.7e-05,3.9e-05,7e-05,7.2e-05,8.2e-05,5.6e-05,3.5e-05,0.000102,0.000112,4.3e-05,2.3e-05,0.000153,0.000128,0.000162,3.6e-05,3.6e-05,8.6e-05,6.8e-05,8.1e-05,0.000105,9.3e-05,6.9e-05,9.4e-05,3.8e-05,9.4e-05,4.7e-05,3.1e-05,9.7e-05,6.8e-05,4.6e-05,1.1e-05,7.9e-05,1e-04,5.2e-05,5e-05,4.3e-05,0.000118,0.000169,2.2e-05,3.9e-05,5e-05,9.9e-05,2.8e-05,8e-06,2.9e-05,0.000122,0.000104,0.00011,6.8e-05,0.00011,3.2e-05,4.1e-05,4.7e-05,5e-05,5.8e-05,3.9e-05,6.9e-05,2.3e-05,8.2e-05,6.8e-05,5.5e-05,0.000111,0.000139,3e-05
0.000139,0.000105,5.4e-05,9.5e-05,1e-04,0.00014,3.9e-05,0.000121,6.9e-05,0.000247,0.000135,0.000203,0.000102,0.000108,0.000163,5e-05,8.6e-05,3e-05,8.2e-05,3.4e-05,7.9e-05,7e-05,0.000129,0.000159,6.7e-05,0.000126,0.000125,0.00014,7.4e-05,1.6e-05,6.6e-05,8.9e-05,0.000131,0.000135,0.000172,3.8e-05,9.5e-05,6.2e-05,7.1e-05,2.4e-05,0.00016,0.000198,0.000127,0.000141,4.6e-05,8e-06,0.000118,0.000213,0.000112,8.7e-05,6.2e-05,0.000207,0.000112,5.5e-05,0.000111,7.6e-05,0.000149,3.3e-05,0.000121,0.000167,1e-04,9.6e-05,0.000161,0.00013,0.000103,3.2e-05,0.000142,0.000142,0.000127,5.1e-05,9.5e-05,3.8e-05,9.9e-05,5.9e-05,8.4e-05,0.000143,1.9e-05,0.000184,7.9e-05,0.000104,0.000102,7.3e-05,0.00011,3.5e-05,2.9e-05,7.6e-05,8.3e-05,8.7e-05,0.000109,0.000125,0.000126,2.6e-05,4.5e-05,0.000219,9.9e-05,0.000143,0.000128,7.5e-05,0.000126,0.000112,4.5e-05,5.2e-05,6.6e-05,3.6e-05,6.8e-05,9.9e-05,4.5e-05,0.00013,1.9e-05,4.9e-05,3.2e-05,0.000126,6.9e-05,6.5e-05,5.5e-05,4.3e-05,6.3e-05,9.8e-05,0.000115,6.5e-05,0.000105
0.000177,0.000293,0.000128,0.000187,0.000182,0.000182,3.8e-05,8.3e-05,0.00023,0.000314,0.000317,0.000564,0.000651,0.000407,0.000281,0.000269,5.7e-05,0.00015,5.7e-05,0.000116,0.000131,0.000178,0.000179,1.7e-05,0.00018,0.000231,0.000107,0.000179,8.1e-05,0.000143,9.1e-05,0.000212,0.000166,0.000136,0.000167,9.7e-05,0.00012,0.000178,5e-05,8.5e-05,0.000171,0.000227,0.000184,0.000233,0.000251,0.000121,4.3e-05,0.000193,4.2e-05,0.000133,6.9e-05,0.000285,0.000109,0.000113,6.1e-05,8.1e-05,0.00012,0.000155,0.000246,0.000317,0.000178,8.3e-05,7.1e-05,1.4e-05,0.000107,0.000142,0.000201,0.00025,0.000284,0.000155,0.000169,0.000123,0.000143,0.000137,0.00024,8e-05,0.00015,0.00021,0.000161,4.7e-05,2.4e-05,0.00015,0.000147,0.000142,0.000153,9e-05,0.000177,0.000168,0.000147,0.000168,0.000199,0.000171,0.000111,0.000202,0.000188,0.000138,0.000112,6.1e-05,2e-05,7.2e-05,5.2e-05,8.6e-05,6.2e-05,2e-05,4.1e-05,0.000171,0.000177,0.000189,0.000155,9e-05,3.3e-05,0.000163,0.000106,4.1e-05,6e-06,1e-04,9.6e-05,0.000133,0.00015,0.000206,0.00021
0.000331,0.000168,0.000134,0.000156,0.000126,0.00024,0.000113,4.7e-05,0.000322,0.000104,0.000107,0.000393,0.000625,0.000122,0.000321,0.000298,0.00018,0.000278,0.000132,0.000208,0.00035,9.7e-05,0.000206,8.1e-05,0.000208,0.000291,0.000212,0.000278,0.000355,0.00013,0.000134,0.000213,0.000126,0.000301,0.000316,2e-04,0.00019,0.000265,0.000282,0.000322,6.1e-05,8e-05,6.6e-05,0.00011,0.000143,0.000245,0.000134,0.000217,0.000345,0.000283,0.000262,0.00038,0.000248,0.000191,0.000135,0.000315,0.000221,8.6e-05,0.000101,0.000269,0.000106,6.9e-05,0.000128,0.000154,0.000162,0.000136,1e-04,0.00011,0.000178,0.000317,0.00028,0.000199,0.000254,0.000207,0.00024,0.000289,9.5e-05,6.5e-05,8.6e-05,7.5e-05,0.000163,0.000215,0.000164,3.1e-05,0.000184,0.000129,0.000273,0.000178,0.000225,0.000253,0.000159,0.00019,0.000239,0.000262,0.000182,0.000146,0.000112,4.7e-05,4.1e-05,4.8e-05,0.000135,9.4e-05,5.8e-05,0.000123,0.000101,0.000163,5.3e-05,0.000167,0.000117,0.000152,0.000238,3e-05,6.6e-05,0.000132,5.7e-05,0.000188,5.6e-05,0.000174,5.5e-05,0.000182,0.000157
0.000363,0.00013,0.000206,0.000308,0.000172,0.000479,0.000318,9.4e-05,0.000319,0.000512,0.000353,0.000215,0.000228,0.000525,0.000487,0.000329,0.000185,0.000212,0.000195,0.000357,0.000194,0.000261,0.000246,0.000301,0.000352,0.000206,9.8e-05,0.000417,0.000259,0.000407,0.000297,2e-04,0.000228,0.000282,0.000449,0.000309,0.000146,0.000158,0.000164,0.000235,0.000327,0.000335,0.000272,0.000206,0.00023,0.000106,0.000253,0.000133,0.000358,0.000418,0.000221,0.000165,0.000287,0.000126,4.5e-05,0.000301,0.000195,0.000106,8.5e-05,0.000299,0.000473,0.000411,0.000311,0.000286,3.3e-05,4.2e-05,0.000108,0.000175,0.000223,0.000149,0.000132,0.000177,9.6e-05,0.000119,0.000383,0.000202,0.000373,0.000432,0.000177,0.000172,0.000433,0.000225,0.000262,0.000186,0.000197,0.000153,0.000233,0.000268,9.3e-05,0.000105,0.000129,0.000159,0.000387,0.000233,7.8e-05,0.00019,0.000161,6e-06,8.1e-05,8.7e-05,0.000288,0.000304,0.000147,0.00025,6.8e-05,0.000141,9e-05,0.000235,0.000169,0.000143,0.000221,0.000125,9.7e-05,0.000147,0.000139,0.00022,0.000301,0.000252,0.000196,0.000131,2.9e-05
0.000386,0.000377,0.000311,0.000185,0.000202,0.000371,0.000499,0.000358,0.000376,0.000415,0.000181,0.000331,0.000367,0.000645,0.000321,0.000334,0.000457,0.000307,8.2e-05,0.000249,0.000275,0.000274,0.000228,0.000168,0.000243,0.000158,8.1e-05,0.000423,0.000261,0.000337,0.000155,0.000202,0.000358,0.000571,0.000708,0.000295,0.000329,0.000281,8.7e-05,0.000145,0.000289,1e-04,0.000186,3.8e-05,7.4e-05,0.000219,0.000446,0.000359,0.000366,0.000546,0.000348,5.1e-05,0.000143,7.5e-05,0.000256,0.000284,0.000294,0.000279,0.000323,0.00024,0.000271,0.000146,0.000117,5.3e-05,0.000205,0.00022,0.00014,3.3e-05,0.00018,0.000252,0.000138,0.000121,0.000143,7.3e-05,0.000289,0.000164,0.000446,0.000411,0.000354,0.000285,0.000541,0.000402,0.000177,0.000253,0.000129,0.000177,0.000237,0.000303,0.00031,0.000267,0.00016,0.000215,0.000303,0.000108,0.000189,0.000104,0.000223,0.000198,9.1e-05,9.9e-05,0.000237,0.00023,0.00015,3e-04,0.000201,0.000144,5.4e-05,0.000279,0.000293,0.000151,0.000214,0.000167,0.000176,0.000204,3.1e-05,0.000117,0.000266,0.000159,0.000171,0.000159,0.000174
7.3e-05,0.000242,5.1e-05,6.6e-05,6.5e-05,0.000406,0.000328,0.000152,7.2e-05,0.000162,0.000147,0.000186,9.4e-05,0.000368,8e-05,0.000132,0.000346,0.000243,0.000165,0.000214,0.000241,6.2e-05,8.9e-05,0.000155,0.000304,0.000165,0.00021,0.000211,0.00013,0.000115,0.000103,0.00017,0.000143,0.000277,0.000112,8.6e-05,0.000334,0.000251,0.000284,0.000304,0.000156,0.000245,0.000111,0.000124,0.000117,0.000254,0.000209,0.000166,0.000142,0.000276,0.00022,0.000157,3.8e-05,0.000121,0.00026,0.000105,0.000183,6.3e-05,0.000133,0.000118,3e-04,0.000174,5.7e-05,7e-05,0.000106,4.9e-05,6.7e-05,3.7e-05,0.000199,0.000208,0.00011,0.000156,0.000117,0.000133,0.000165,5.8e-05,0.000276,7.4e-05,8.3e-05,0.000236,0.000194,7.5e-05,9.7e-05,0.000129,0.000115,0.000193,4.9e-05,0.000182,4e-05,8.1e-05,2.1e-05,7.1e-05,0.000122,0.000159,0.000174,0.000132,0.000208,9.4e-05,8e-05,7.2e-05,0.000223,7.3e-05,6e-05,0.000254,0.000148,2e-05,0.000154,0.000184,3.8e-05,8.7e-05,0.000171,0.000179,0.000135,7.4e-05,0.000118,0.000148,0.000117,6.1e-05,7.8e-05,5.4e-05,0.000119
0.000112,9.8e-05,8.9e-05,3.9e-05,5.8e-05,0.00016,0.000117,2.3e-05,4.4e-05,6.2e-05,0.000126,2.2e-05,3.2e-05,0.000162,3.7e-05,0.000101,0.000138,4e-05,4.2e-05,5.9e-05,0.000116,5.1e-05,4.9e-05,0.000118,0.000105,3.4e-05,0.000101,6.3e-05,8e-05,3e-05,7.3e-05,5.4e-05,8.6e-05,0.000137,6.2e-05,4.1e-05,0.000161,3.8e-05,6.2e-05,0.000118,2.8e-05,7.2e-05,2.9e-05,2.7e-05,3.7e-05,0.000125,6.2e-05,6.1e-05,0.000104,8e-05,4.6e-05,4.3e-05,3.1e-05,8.5e-05,5.9e-05,1.3e-05,7.3e-05,1.1e-05,8.5e-05,8.6e-05,1e-04,7.2e-05,4.9e-05,4.9e-05,4.2e-05,4.6e-05,6.8e-05,4.3e-05,0.000118,3.1e-05,6.2e-05,0.000105,9.1e-05,2.9e-05,1.4e-05,5e-05,0.000134,9e-05,2.1e-05,0.000148,6.8e-05,3.5e-05,7.8e-05,6.8e-05,5.7e-05,8e-05,7.8e-05,5.8e-05,0.000108,4e-05,4.6e-05,7.8e-05,4e-06,8.2e-05,1.7e-05,6.9e-05,5.6e-05,1.7e-05,4.2e-05,4.4e-05,0.000129,5.2e-05,3.1e-05,0.000146,7e-05,3.2e-05,6e-05,4.3e-05,7e-05,3e-05,7.4e-05,2.9e-05,8e-05,5.9e-05,4.9e-05,5.5e-05,3.8e-05,3.8e-05,4e-05,6.9e-05,9e-06
4.2e-05,4.1e-05,5.6e-05,5.1e-05,5.5e-05,0.000134,8.2e-05,1.9e-05,2.5e-05,5.6e-05,7.6e-05,4.2e-05,6e-05,0.000134,3.3e-05,7.2e-05,1e-04,1.7e-05,6e-06,5.8e-05,5.3e-05,4.2e-05,4.3e-05,9e-05,4e-05,2.6e-05,7.7e-05,4.9e-05,4.6e-05,4.1e-05,1.3e-05,4.6e-05,5.6e-05,0.000123,3.7e-05,3.2e-05,7.1e-05,6e-05,0.000103,4.7e-05,1.7e-05,4.9e-05,1.7e-05,4.9e-05,1.2e-05,9.4e-05,4.4e-05,4.4e-05,7.3e-05,7e-06,3.9e-05,3.8e-05,3.4e-05,7.1e-05,5.1e-05,1.5e-05,7.1e-05,9e-06,6e-05,5.2e-05,8.2e-05,3.4e-05,4.5e-05,3.8e-05,2.2e-05,6.8e-05,5.3e-05,4.7e-05,7.1e-05,2.1e-05,7.8e-05,5.4e-05,2.6e-05,2.4e-05,3.2e-05,4.9e-05,9.5e-05,3.8e-05,2.6e-05,8.6e-05,3.2e-05,2.7e-05,2.9e-05,5.2e-05,5.6e-05,7.1e-05,4.7e-05,4.3e-05,6.5e-05,5.4e-05,2.7e-05,5e-05,1.7e-05,4.8e-05,3.2e-05,3.4e-05,4.6e-05,3.9e-05,1.9e-05,3.3e-05,6.1e-05,3e-06,6.2e-05,5.7e-05,3.6e-05,3.5e-05,3.8e-05,1.3e-05,7e-05,1.2e-05,1.3e-05,2.7e-05,5.3e-05,6.3e-05,5e-05,6e-05,4.5e-05,5e-05,4.1e-05,4e-05,2.1e-05
5.4e-05,0.000169,5.8e-05,0.000124,8.7e-05,7e-05,5.8e-05,7.1e-05,6.5e-05,0.000119,0.000168,0.000159,0.000102,0.00018,8e-05,4.1e-05,8.7e-05,3.5e-05,7.3e-05,3.9e-05,1.9e-05,5.4e-05,1.4e-05,0.000105,2.8e-05,2.7e-05,4.8e-05,9.3e-05,8.6e-05,8.4e-05,4.4e-05,8.5e-05,3.4e-05,5.7e-05,4.7e-05,6.4e-05,3.7e-05,5.1e-05,0.000118,2.9e-05,3.7e-05,3.4e-05,3.2e-05,6.4e-05,6.2e-05,0.000111,8.2e-05,0.000146,5.9e-05,7.4e-05,6.2e-05,4.2e-05,3.6e-05,6e-05,9e-05,6.7e-05,8.8e-05,5.9e-05,4e-05,7.1e-05,6.2e-05,4.2e-05,3.9e-05,1.2e-05,4.2e-05,4.8e-05,9.1e-05,4.6e-05,0.000104,3.8e-05,7.4e-05,4.4e-05,2.3e-05,3.1e-05,1.8e-05,8.1e-05,4e-05,0.000104,0.000115,0.000173,3.9e-05,5e-05,4.8e-05,8.3e-05,3.3e-05,4.9e-05,9.6e-05,8.2e-05,0.000175,7.9e-05,7.6e-05,3.9e-05,3.3e-05,6.8e-05,5.2e-05,5.4e-05,9e-05,9.7e-05,7.4e-05,5.8e-05,0.000121,7.4e-05,0.000139,8.6e-05,4.4e-05,3.1e-05,6.2e-05,6e-05,0.000131,0.000109,6.7e-05,9.6e-05,6e-05,6.1e-05,6.5e-05,2.1e-05,8.1e-05,4.3e-05,2.4e-05,4.4e-05,2.3e-05
0.000107,0.000146,0.000133,0.000116,0.000141,8.7e-05,2.5e-05,0.000115,3.7e-05,0.000103,4.2e-05,0.000119,6.6e-05,7.9e-05,8.9e-05,0.000139,7.3e-05,0.000124,9.9e-05,0.000173,8.8e-05,0.000113,6.9e-05,9.7e-05,0.00012,7.6e-05,0.000164,0.000151,0.000169,0.000129,9e-05,3.7e-05,4e-05,5.1e-05,3.4e-05,6.7e-05,0.000133,9.9e-05,0.000102,0.000163,0.000135,9e-05,3.4e-05,7.2e-05,5.7e-05,0.000105,1.7e-05,6.5e-05,4.4e-05,0.000136,5.8e-05,6.1e-05,9.2e-05,6.5e-05,2.9e-05,2.9e-05,4.8e-05,3.4e-05,9e-06,6.8e-05,4.1e-05,5.1e-05,7.5e-05,4.6e-05,7.1e-05,3.8e-05,6.3e-05,4.8e-05,6.7e-05,2.1e-05,6.4e-05,9.8e-05,4.7e-05,4.3e-05,6.7e-05,4.6e-05,0.00016,6.6e-05,8.3e-05,9.6e-05,9e-05,7.3e-05,9.9e-05,1.4e-05,4.8e-05,3.6e-05,9.6e-05,0.00011,7.4e-05,0.000119,3.9e-05,9.1e-05,6.9e-05,4.1e-05,3.2e-05,8.2e-05,3.7e-05,2.4e-05,5.2e-05,8.1e-05,1e-04,1.6e-05,0.000102,3.8e-05,5.1e-05,3.2e-05,5.6e-05,0.000102,5.5e-05,9.3e-05,0.000104,5.6e-05,1.7e-05,5.2e-05,8e-06,3.4e-05,6.8e-05,8.6e-05,5.7e-05,6.5e-05,4.8e-05
2.9e-05,0.000116,6.3e-05,0.000165,4.8e-05,0.000117,8.8e-05,7.7e-05,6.6e-05,8.5e-05,8.4e-05,8.8e-05,8.7e-05,9.4e-05,2.2e-05,7.9e-05,3.1e-05,1.6e-05,6.8e-05,0.000132,0.000204,7.9e-05,6.2e-05,9e-05,0.000112,3.3e-05,0.000168,0.000164,8e-05,0.00011,5.5e-05,5e-05,4.2e-05,6.2e-05,4.4e-05,0.000119,0.000107,6e-05,0.000106,4.6e-05,1.7e-05,6.1e-05,0.000107,7e-06,3.9e-05,9.1e-05,8.8e-05,5.6e-05,9.8e-05,0.000105,0.000201,5.8e-05,3.5e-05,0.000121,3.2e-05,9.1e-05,2.1e-05,0.000113,8e-05,4.1e-05,4.3e-05,0.000101,1.5e-05,8.9e-05,5.3e-05,6.6e-05,2.5e-05,7.7e-05,7.4e-05,7.3e-05,4.5e-05,3e-05,2.9e-05,3.6e-05,7.4e-05,5.8e-05,0.000125,0.000129,9.1e-05,2.2e-05,8.2e-05,4.4e-05,5.7e-05,5.8e-05,1.1e-05,8e-06,4.6e-05,8.9e-05,0.000103,3e-05,4.1e-05,0.000121,1.2e-05,6.3e-05,5.6e-05,8e-05,5.1e-05,2.7e-05,1.8e-05,6e-05,2.6e-05,3.7e-05,6.9e-05,5.3e-05,5.8e-05,4e-05,2.8e-05,5.7e-05,3.8e-05,7.6e-05,3e-05,3.1e-05,4.1e-05,6e-06,3.9e-05,1.4e-05,6.1e-05,9.1e-05,9.7e-05,4.2e-05,4.5e-05
0.000116,0.00015,2e-04,0.000216,0.000174,0.000238,3.1e-05,0.000124,9.1e-05,0.000118,9e-05,6.2e-05,7.3e-05,5.4e-05,0.000115,9.2e-05,4.4e-05,5.9e-05,2.8e-05,0.000125,0.000133,0.000124,7.1e-05,7.9e-05,5.4e-05,1.6e-05,0.000125,0.000219,0.000102,0.000102,7e-05,2.4e-05,4.8e-05,2.5e-05,2.8e-05,4.8e-05,0.000127,0.000122,9.4e-05,9.3e-05,2.1e-05,2.3e-05,7.3e-05,9e-05,6.7e-05,0.000115,7.6e-05,7.5e-05,0.000106,7.5e-05,0.000162,0.000148,6.6e-05,0.000125,0.000179,0.000146,0.000137,0.000165,6e-05,5.3e-05,1.5e-05,3.4e-05,3e-05,8.8e-05,0.000128,9e-06,2.7e-05,5.4e-05,2.5e-05,5.9e-05,4.2e-05,2.3e-05,3.9e-05,6.8e-05,0.000129,9e-05,5.7e-05,0.00013,9.9e-05,9.5e-05,0.000104,0.000203,0.000146,0.000107,0.000155,4.4e-05,8.7e-05,0.000155,8.2e-05,7.9e-05,2.4e-05,7.2e-05,6.2e-05,7.3e-05,2.8e-05,2.4e-05,2.9e-05,4.3e-05,6.5e-05,7.7e-05,1.9e-05,1e-05,1.7e-05,4.2e-05,6.2e-05,6.5e-05,4.2e-05,5.1e-05,5.5e-05,4.5e-05,5.2e-05,2.5e-05,3.1e-05,3.6e-05,4.5e-05,0.000115,8.1e-05,0.00013,4.2e-05,1.7e-05,2.5e-05
1e-04,3.2e-05,9.2e-05,6e-05,9.7e-05,3.9e-05,0.000122,7.4e-05,3.2e-05,4.5e-05,2.6e-05,9.6e-05,4e-05,8.6e-05,0.000133,2e-05,0.000109,4e-05,6e-05,0.000106,4.5e-05,1.1e-05,6.3e-05,8.6e-05,0.000125,6.3e-05,7.8e-05,0.000115,0.000126,0.000141,9.1e-05,3.6e-05,3.3e-05,4.2e-05,6e-05,7e-05,3.4e-05,9.7e-05,2.5e-05,3.7e-05,6.9e-05,8.6e-05,3.9e-05,2.3e-05,3.5e-05,7.5e-05,4e-05,1.6e-05,1.9e-05,2.2e-05,9.2e-05,6.1e-05,3.5e-05,8.1e-05,0.000174,7.7e-05,0.000125,1.8e-05,8e-06,6.4e-05,3.1e-05,3.9e-05,6.6e-05,4.2e-05,5e-05,5.5e-05,2.1e-05,7.5e-05,6.4e-05,0.000116,6.8e-05,6.8e-05,4e-05,6.1e-05,9.6e-05,0.000117,0.000105,0.000114,1.8e-05,7.4e-05,1.5e-05,0.00015,6.7e-05,5.1e-05,0.000102,0.000125,9.3e-05,0.000154,7.5e-05,1.9e-05,5.9e-05,4.4e-05,2.3e-05,4.2e-05,4.2e-05,6e-05,2.9e-05,8.4e-05,8e-05,1.7e-05,4.7e-05,2.4e-05,3.2e-05,5e-05,3.9e-05,4e-05,6.7e-05,2.6e-05,3.6e-05,1.6e-05,4.5e-05,0.000108,9.8e-05,6e-05,4e-05,1e-04,1.3e-05,9.6e-05,8.2e-05,8e-06,2.6e-05
9.1e-05,9e-05,6.4e-05,8.3e-05,6.8e-05,8.2e-05,0.000119,0.00015,6e-05,2.4e-05,5.7e-05,5.4e-05,7.7e-05,0.000128,5.1e-05,7.7e-05,0.000124,0.000112,1.6e-05,3.3e-05,7.2e-05,4.5e-05,6.1e-05,3.6e-05,3.5e-05,2.3e-05,0.000131,0.000158,5.5e-05,8.5e-05,6e-05,6.4e-05,3.5e-05,2.8e-05,4.3e-05,0.000117,8.6e-05,7.3e-05,5.4e-05,3.3e-05,6.4e-05,8.9e-05,2.2e-05,1.7e-05,3.4e-05,5.2e-05,8.2e-05,4.8e-05,5.9e-05,5.5e-05,4.4e-05,5.6e-05,7.1e-05,6e-05,8.6e-05,7e-05,0.00011,6.7e-05,6.1e-05,2.6e-05,2.4e-05,5.4e-05,5e-05,5.5e-05,3.1e-05,3.5e-05,7.9e-05,8.7e-05,5.6e-05,9.2e-05,5e-05,4.8e-05,2.1e-05,8.1e-05,4.9e-05,9.2e-05,4.2e-05,4.4e-05,7.5e-05,3.2e-05,5.4e-05,8.4e-05,8.6e-05,8.3e-05,5.4e-05,4.5e-05,1.9e-05,0.000126,8.5e-05,6.5e-05,7.5e-05,9.3e-05,6.3e-05,8.6e-05,6.2e-05,3e-05,3.9e-05,0.000114,7.2e-05,2.5e-05,5e-05,7.1e-05,6.1e-05,5.3e-05,1.9e-05,2.2e-05,5.9e-05,0.000101,7e-06,4.4e-05,4.6e-05,0.00011,2.3e-05,5e-05,3.2e-05,5.2e-05,6.6e-05,4.5e-05,5.6e-05,5.3e-05,3e-05
0.000108,4.2e-05,8.9e-05,4.2e-05,3.7e-05,0.000124,6.7e-05,7.5e-05,0.000113,8e-05,5.3e-05,4.7e-05,0.000115,2e-05,5.8e-05,6.9e-05,0.000142,9.3e-05,6.2e-05,1e-05,7.2e-05,4.2e-05,7.3e-05,5.4e-05,5.2e-05,9.1e-05,0.000133,0.000119,0.000154,6.9e-05,4.4e-05,0.000137,6e-05,4.7e-05,0.000108,6.7e-05,0.000121,6.4e-05,6.6e-05,4.5e-05,5.4e-05,8e-05,8.4e-05,8.2e-05,4.7e-05,3.5e-05,2.7e-05,5.5e-05,1e-04,0.000145,9.3e-05,6.8e-05,3.5e-05,8.1e-05,0.00013,8.9e-05,6.5e-05,5.8e-05,6.4e-05,4.2e-05,6.1e-05,6.9e-05,3.6e-05,1.3e-05,3.8e-05,4.9e-05,0.000125,8.9e-05,0.00012,6.8e-05,6.5e-05,6.6e-05,2.5e-05,1e-05,1.5e-05,9.3e-05,3.8e-05,3.3e-05,8.2e-05,7.8e-05,5.9e-05,0.000111,0.000111,1e-04,6.6e-05,8.4e-05,9.2e-05,0.000121,8.9e-05,4.7e-05,7.9e-05,2.5e-05,4.5e-05,6.9e-05,3.4e-05,8.1e-05,8.2e-05,7.3e-05,0.000103,9.8e-05,4.2e-05,1.5e-05,1.7e-05,3.8e-05,2.6e-05,1.8e-05,6.6e-05,7.8e-05,8.6e-05,2e-05,1.7e-05,5.1e-05,7.2e-05,5.5e-05,9.4e-05,0.000113,4.4e-05,6.4e-05,3.6e-05,1.5e-05,9e-06
0.000121,7.9e-05,8.2e-05,7.2e-05,4.5e-05,7.4e-05,0.000109,1e-04,0.000138,7.1e-05,6.6e-05,4.5e-05,7.9e-05,7.2e-05,0.000118,3.4e-05,0.000104,5.6e-05,1.3e-05,9.1e-05,8.9e-05,2.4e-05,3.4e-05,6.5e-05,4.7e-05,0.000101,0.000143,4e-05,4.6e-05,3.7e-05,3.6e-05,7.5e-05,7.5e-05,3.8e-05,5.8e-05,7.9e-05,2.6e-05,6.5e-05,4.8e-05,3.2e-05,0.000107,0.00011,0.000116,5.3e-05,4.3e-05,7e-06,3.2e-05,5.1e-05,7.4e-05,5.4e-05,8.3e-05,0.000131,8e-05,8.2e-05,5.6e-05,7.1e-05,5.2e-05,1.3e-05,7e-05,2.5e-05,3.2e-05,6.1e-05,7.9e-05,0.000109,1.6e-05,5.1e-05,7.4e-05,2.5e-05,0.000109,0.000133,9.7e-05,6.5e-05,8e-05,7e-05,5.5e-05,3.9e-05,4.1e-05,2.4e-05,4.8e-05,1e-05,1.4e-05,7.3e-05,6.7e-05,9.9e-05,7.2e-05,1.7e-05,5.9e-05,0.000109,2.8e-05,5.4e-05,7.7e-05,7.9e-05,7.2e-05,4.9e-05,5.8e-05,7.4e-05,3.2e-05,1.2e-05,5.3e-05,5.4e-05,2.2e-05,2.8e-05,2.6e-05,3.3e-05,2.2e-05,3.5e-05,5.6e-05,1e-05,3.2e-05,6.2e-05,0.000103,8.7e-05,8.3e-05,7.7e-05,0.000109,9.5e-05,6.3e-05,6.7e-05,4.1e-05,7.6e-05,4.5e-05
2.6e-05,0.000143,0.000122,0.000119,8.7e-05,0.000107,9.9e-05,7.7e-05,6.3e-05,4.3e-05,7.7e-05,4.5e-05,9.2e-05,0.000103,0.000148,0.000105,7e-05,6.5e-05,7.2e-05,0.000101,5.8e-05,7.2e-05,6.9e-05,8.3e-05,2.2e-05,0.000127,6.7e-05,3.2e-05,2.9e-05,5.4e-05,1.4e-05,4.4e-05,3.1e-05,4.6e-05,0.000138,9.6e-05,0.000165,2.2e-05,3.1e-05,6.8e-05,7.2e-05,3.3e-05,0.000103,9e-05,6.2e-05,3e-05,5.8e-05,2.5e-05,4.5e-05,2.5e-05,7.3e-05,2.3e-05,0.00012,8.6e-05,0.000112,1.4e-05,2.5e-05,3.3e-05,0.000102,4e-05,3.6e-05,0.000146,0.000188,9.5e-05,0.000125,7.2e-05,0.000151,4e-05,9.5e-05,4.2e-05,0.000107,0.000164,6e-05,6.7e-05,6.5e-05,0.000107,8.5e-05,6.2e-05,6.2e-05,3.5e-05,6.7e-05,6.5e-05,0.000132,4e-05,4.8e-05,3.7e-05,1.8e-05,0.000164,0.000172,8e-06,2.4e-05,4.2e-05,0.000142,0.000124,0.000139,0.000151,0.00014,9e-06,1.8e-05,7.4e-05,5.1e-05,3.7e-05,4.9e-05,7.1e-05,6.9e-05,4.5e-05,5.9e-05,6e-05,3.1e-05,5.6e-05,5.6e-05,8.6e-05,8.7e-05,0.000177,0.000103,0.000147,7.6e-05,6.9e-05,0.000121,2e-05,0.000165
0.000115,9.8e-05,5e-05,3.6e-05,7.6e-05,5.8e-05,1.6e-05,1.7e-05,2.8e-05,5.9e-05,7.2e-05,7.7e-05,4.2e-05,6.4e-05,0.000124,6.7e-05,3e-05,5.9e-05,6.3e-05,8.2e-05,5.1e-05,3.5e-05,2.2e-05,6.5e-05,7.4e-05,4.3e-05,0.000103,7.6e-05,2.7e-05,5.1e-05,6.2e-05,2.6e-05,1.4e-05,1.4e-05,9.5e-05,5.7e-05,9.1e-05,8.2e-05,5.7e-05,6e-05,3.2e-05,7.2e-05,9.2e-05,0.000101,0.000109,9e-05,5.1e-05,3.9e-05,3.6e-05,2.1e-05,4.5e-05,2.9e-05,8.1e-05,0.000136,0.000125,9.2e-05,6.1e-05,4.3e-05,8e-05,9.9e-05,4.7e-05,6.7e-05,0.000122,0.000115,8.1e-05,5.5e-05,8.3e-05,9.4e-05,6.9e-05,2.8e-05,4.9e-05,9e-05,8.5e-05,3.9e-05,3.1e-05,5.9e-05,0.000104,5.8e-05,3.7e-05,1.3e-05,4.5e-05,9.8e-05,0.000113,8.3e-05,5.4e-05,3e-05,3.3e-05,8.9e-05,9.7e-05,8.8e-05,6.3e-05,3.6e-05,3.7e-05,2.4e-05,2.6e-05,3.4e-05,3.6e-05,6.9e-05,6.6e-05,3.7e-05,6.5e-05,3.9e-05,1.6e-05,3.5e-05,2.3e-05,3.9e-05,7.6e-05,7.1e-05,6.7e-05,3.1e-05,4.8e-05,1.7e-05,6.6e-05,7.4e-05,0.000111,0.000103,8.3e-05,4.5e-05,3.2e-05,6.2e-05,0.000102
7.3e-05,2.4e-05,1.3e-05,3.9e-05,4.5e-05,7.2e-05,7.3e-05,4.4e-05,1.2e-05,5.9e-05,3.8e-05,1.6e-05,2.5e-05,5.5e-05,7.2e-05,3.4e-05,4.1e-05,1.9e-05,6.4e-05,5.3e-05,2.4e-05,2.1e-05,1.6e-05,4.1e-05,4.2e-05,6.4e-05,6.9e-05,7.1e-05,4.7e-05,6.2e-05,6.8e-05,4.4e-05,3.9e-05,3.3e-05,6.4e-05,5.3e-05,2.5e-05,4.8e-05,1.6e-05,3.2e-05,2.6e-05,6.1e-05,8.2e-05,2.9e-05,4e-05,3.4e-05,2.8e-05,4.8e-05,6.3e-05,7.2e-05,1.9e-05,1.4e-05,6e-05,8.7e-05,0.000112,8.6e-05,5.5e-05,1.9e-05,5.3e-05,4.7e-05,3.2e-05,3.6e-05,4.2e-05,5e-06,3e-05,2.7e-05,3.3e-05,8.8e-05,6.9e-05,5e-05,5.1e-05,3.6e-05,3e-05,3.9e-05,8e-06,7e-05,4e-05,1.8e-05,3e-05,1.3e-05,4e-05,5.9e-05,1.3e-05,1.7e-05,2e-05,1.4e-05,3e-05,3.5e-05,2e-05,1.7e-05,1.9e-05,1.3e-05,2.4e-05,8e-06,2.2e-05,2.4e-05,4.5e-05,4.2e-05,1.7e-05,2.3e-05,4.4e-05,4.6e-05,5e-05,4.5e-05,1.6e-05,2e-05,3.8e-05,2.6e-05,2.7e-05,1.7e-05,2.6e-05,2.2e-05,3.8e-05,4.9e-05,5.8e-05,1.3e-05,2.7e-05,8e-06,2.4e-05,2.9e-05,3e-05
4.4e-05,2.8e-05,7e-06,2.2e-05,4.2e-05,2.3e-05,1.2e-05,1.4e-05,3.5e-05,1.3e-05,7e-06,1.4e-05,1.9e-05,2e-05,6e-06,1.7e-05,3e-06,3.1e-05,2.4e-05,3e-06,5e-06,9e-06,8e-06,3e-05,7e-06,3.7e-05,4.1e-05,1.9e-05,1.7e-05,4e-05,1.3e-05,1e-06,3.6e-05,1.4e-05,1.9e-05,9e-06,1.5e-05,3e-06,1e-05,3e-05,1.1e-05,3.6e-05,1.6e-05,1.4e-05,3e-05,1.3e-05,2.3e-05,1e-05,2e-05,2.3e-05,2.1e-05,1.7e-05,2.8e-05,4.2e-05,3.7e-05,4.6e-05,6e-06,1.3e-05,2.4e-05,2.5e-05,2e-06,2.4e-05,3e-05,2.5e-05,2.2e-05,7e-06,3.3e-05,2.9e-05,3.4e-05,1.7e-05,2.2e-05,9e-06,3e-05,1.1e-05,1.8e-05,2.4e-05,1.8e-05,7e-06,1.2e-05,7e-06,2.7e-05,2.2e-05,7e-06,9e-06,1e-05,7e-06,1.7e-05,3.5e-05,1.2e-05,1.6e-05,1e-05,6e-06,1e-05,4e-06,1.2e-05,2.8e-05,3e-06,1.6e-05,9e-06,6e-06,3.1e-05,8e-06,2.2e-05,1.4e-05,2.5e-05,1.5e-05,2.5e-05,1e-05,2.2e-05,1.2e-05,5e-06,1.1e-05,1.4e-05,2.8e-05,1.8e-05,7e-06,1.2e-05,2e-05,2.3e-05,1.1e-05,2.2e-05
1.7e-05,7e-06,2.1e-05,1.9e-05,2.4e-05,2.6e-05,1e-05,5e-06,2.2e-05,1.7e-05,5e-06,1.4e-05,5e-06,4e-06,1.2e-05,1.5e-05,1.4e-05,2.5e-05,2.3e-05,5e-06,3e-06,8e-06,3e-06,3.1e-05,1.6e-05,1.5e-05,1.9e-05,1.2e-05,5e-06,1.4e-05,8e-06,9e-06,1.7e-05,2.2e-05,2.7e-05,7e-06,1.6e-05,1.9e-05,1.3e-05,1.9e-05,1.6e-05,1e-05,6e-06,6e-06,2.3e-05,1.6e-05,4e-06,9e-06,1.5e-05,6e-06,7e-06,3e-06,1.9e-05,2.1e-05,1e-05,2e-05,7e-06,1.1e-05,9e-06,5e-06,3e-06,8e-06,1.6e-05,8e-06,1.2e-05,6e-06,2.4e-05,2.2e-05,7e-06,2.1e-05,3.2e-05,1.4e-05,8e-06,3e-06,1.4e-05,2.6e-05,1.4e-05,5e-06,4e-06,9e-06,1.4e-05,1.1e-05,1.2e-05,9e-06,1.7e-05,1.2e-05,1.5e-05,1.5e-05,1e-06,1.4e-05,1.4e-05,8e-06,1.1e-05,1.3e-05,6e-06,1.7e-05,1.1e-05,1.2e-05,2e-06,1.1e-05,1.3e-05,5e-06,1e-05,7e-06,1.3e-05,6e-06,2.2e-05,1.4e-05,1.4e-05,1.3e-05,1.3e-05,1e-06,3e-06,1.9e-05,1.2e-05,9e-06,1.9e-05,2e-05,1.3e-05,1e-05,1.6e-05
1.4e-05,1.8e-05,4e-06,5e-06,5e-06,6e-06,2e-05,1.7e-05,7e-06,1e-05,5e-06,2.7e-05,1.5e-05,9e-06,9e-06,1.7e-05,6e-06,1.1e-05,1.7e-05,2e-05,1.9e-05,1.3e-05,1e-06,1.9e-05,2e-05,3e-06,1.6e-05,2e-05,9e-06,1.8e-05,1.1e-05,1.3e-05,8e-06,2.3e-05,1.4e-05,5e-06,1.4e-05,1.2e-05,9e-06,1.3e-05,4e-06,1.2e-05,1.4e-05,7e-06,3.4e-05,3e-06,9e-06,1.5e-05,1.9e-05,1.7e-05,1.7e-05,1.5e-05,6e-06,3.4e-05,1.7e-05,1.2e-05,1.4e-05,1.1e-05,1.4e-05,6e-06,6e-06,1.2e-05,5e-06,8e-06,9e-06,1.2e-05,2.3e-05,2.4e-05,1.7e-05,4e-06,9e-06,8e-06,1.4e-05,1.7e-05,1.5e-05,1.5e-05,3e-06,4e-06,5e-06,2e-06,2.5e-05,7e-06,9e-06,6e-06,5e-06,3e-06,5e-06,1.7e-05,1.4e-05,1.1e-05,9e-06,7e-06,7e-06,1.1e-05,9e-06,6e-06,5e-06,2e-05,7e-06,1e-05,1.5e-05,6e-06,4e-06,6e-06,2e-06,7e-06,1.4e-05,5e-06,6e-06,9e-06,1.6e-05,6e-06,9e-06,1.2e-05,4e-06,7e-06,8e-06,1.2e-05,1e-06,7e-06,1.1e-05
1.4e-05,1e-05,5e-06,2e-06,1.1e-05,5e-06,2e-05,1e-05,7e-06,7e-06,1.1e-05,1.3e-05,9e-06,9e-06,1.2e-05,3e-06,5e-06,6e-06,1.8e-05,9e-06,7e-06,3e-06,8e-06,4e-06,9e-06,2e-06,1.1e-05,1.9e-05,1.2e-05,2e-05,5e-06,1.4e-05,1e-05,1.5e-05,6e-06,1.2e-05,1.4e-05,1.1e-05,1e-05,1.3e-05,5e-06,1.3e-05,5e-06,6e-06,1.6e-05,2e-06,1.6e-05,2e-06,1.7e-05,5e-06,3e-06,1.1e-05,1.9e-05,2.1e-05,5e-06,1.4e-05,9e-06,6e-06,6e-06,2e-06,5e-06,4e-06,9e-06,5e-06,1e-05,1e-06,1.4e-05,2.1e-05,1.6e-05,5e-06,1.1e-05,4e-06,1e-05,4e-06,2e-06,1.6e-05,5e-06,7e-06,8e-06,9e-06,2.5e-05,8e-06,3e-06,1e-06,7e-06,3e-06,4e-06,2e-06,4e-06,1.8e-05,7e-06,4e-06,5e-06,3e-06,5e-06,6e-06,1.1e-05,1.1e-05,3e-06,5e-06,1.5e-05,4e-06,9e-06,2e-06,5e-06,1e-06,3e-06,7e-06,6e-06,3e-06,7e-06,3e-06,1.1e-05,9e-06,3e-06,1e-06,3e-06,6e-06,6e-06,1e-05,1e-05
3e-06,8e-06,1.1e-05,5e-06,7e-06,8e-06,1.8e-05,6e-06,8e-06,7e-06,9e-06,1.1e-05,1.1e-05,1e-05,1.5e-05,8e-06,4e-06,1.1e-05,4e-06,1.1e-05,1.3e-05,2e-06,7e-06,3e-06,1.1e-05,3e-06,1.2e-05,1.3e-05,1.1e-05,1.7e-05,6e-06,3e-06,9e-06,1.5e-05,1.4e-05,3e-06,7e-06,1.3e-05,2e-06,1.4e-05,1.1e-05,1.1e-05,6e-06,8e-06,2.1e-05,5e-06,1.9e-05,1.1e-05,1.7e-05,3e-06,5e-06,1e-05,9e-06,1.8e-05,6e-06,1.4e-05,6e-06,4e-06,7e-06,6e-06,5e-06,3e-06,2e-06,5e-06,6e-06,2e-06,8e-06,1.8e-05,1.3e-05,4e-06,8e-06,7e-06,2e-06,4e-06,6e-06,1.4e-05,6e-06,8e-06,9e-06,2e-06,2.3e-05,5e-06,4e-06,2e-06,1e-05,8e-06,2e-06,4e-06,6e-06,1.3e-05,6e-06,7e-06,3e-06,1e-06,2e-06,3e-06,5e-06,1.3e-05,6e-06,5e-06,9e-06,9e-06,6e-06,7e-06,5e-06,3e-06,7e-06,1.3e-05,6e-06,7e-06,7e-06,2e-06,7e-06,1.1e-05,3e-06,4e-06,8e-06,4e-06,3e-06,6e-06,1.2e-05
7e-06,1.3e-05,1.4e-05,1.1e-05,1.3e-05,8e-06,1.7e-05,1.4e-05,7e-06,8e-06,4e-06,6e-06,6e-06,1e-05,2e-05,1.2e-05,6e-06,1.9e-05,1.3e-05,1.4e-05,1e-05,1e-05,1.3e-05,8e-06,1.2e-05,1e-05,7e-06,9e-06,1.4e-05,2e-06,1.5e-05,6e-06,3e-06,2.4e-05,1.6e-05,4e-06,4e-06,1.3e-05,4e-06,5e-06,6e-06,1.6e-05,1e-06,2e-06,2e-05,6e-06,1.8e-05,6e-06,1.9e-05,6e-06,2e-06,2e-06,7e-06,2.1e-05,1e-05,2.1e-05,5e-06,4e-06,9e-06,7e-06,1e-05,8e-06,7e-06,3e-06,1e-05,2e-06,1e-06,1.9e-05,5e-06,4e-06,9e-06,9e-06,1.1e-05,1.1e-05,8e-06,6e-06,0,6e-06,3e-06,8e-06,1.5e-05,8e-06,5e-06,7e-06,8e-06,1e-05,8e-06,5e-06,7e-06,1e-05,6e-06,1.5e-05,5e-06,8e-06,7e-06,6e-06,7e-06,1.1e-05,1.2e-05,6e-06,1.3e-05,1.4e-05,3e-06,9e-06,7e-06,4e-06,1.1e-05,1e-05,5e-06,4e-06,9e-06,4e-06,1.5e-05,1.2e-05,5e-06,1e-05,8e-06,4e-06,1e-05,8e-06,1.2e-05
1.5e-05,8e-06,9e-06,1.1e-05,1e-05,2.7e-05,2.1e-05,2.1e-05,2e-05,1e-05,1.1e-05,1e-05,7e-06,2.4e-05,5e-06,1e-05,6e-06,9e-06,1.4e-05,5e-06,7e-06,6e-06,1.3e-05,1.8e-05,1.7e-05,1.5e-05,1e-05,1.7e-05,2.6e-05,2.1e-05,6e-06,7e-06,7e-06,1.4e-05,1.1e-05,2e-05,8e-06,1.2e-05,1.4e-05,3e-06,5e-06,1e-05,9e-06,6e-06,1.9e-05,9e-06,2.1e-05,1e-05,1.7e-05,1.8e-05,1.3e-05,1.3e-05,1.1e-05,5e-06,2.1e-05,1.7e-05,1.9e-05,5e-06,6e-06,1.3e-05,1.1e-05,3e-06,1.2e-05,1e-06,1.7e-05,1e-05,9e-06,4e-06,1.1e-05,6e-06,7e-06,8e-06,1.1e-05,1.1e-05,1.3e-05,1.7e-05,1.8e-05,1.1e-05,9e-06,1.9e-05,1.6e-05,9e-06,1.6e-05,1.2e-05,1.2e-05,1.6e-05,1.6e-05,1e-05,9e-06,6e-06,6e-06,8e-06,1.7e-05,2.1e-05,1e-05,9e-06,1.1e-05,1.3e-05,9e-06,1e-05,1.6e-05,9e-06,1.3e-05,1e-05,1.2e-05,1e-05,3e-06,8e-06,6e-06,1.4e-05,1.5e-05,1.2e-05,6e-06,1e-05,1.1e-05,9e-06,2e-05,1.8e-05,2e-06,1e-06,8e-06
3e-06,6e-06,1.1e-05,1.1e-05,9e-06,2.4e-05,1.9e-05,1.3e-05,2.1e-05,1.3e-05,1.3e-05,2e-05,1.9e-05,2.3e-05,1.4e-05,1.4e-05,7e-06,8e-06,1e-05,1.4e-05,7e-06,1.2e-05,1.2e-05,1.1e-05,1.2e-05,5e-06,7e-06,2.3e-05,1.7e-05,9e-06,2e-05,1.1e-05,1.4e-05,1.7e-05,6e-06,1.5e-05,1.7e-05,9e-06,5e-06,8e-06,5e-06,6e-06,2e-06,1.4e-05,2.6e-05,3e-06,1.3e-05,1.1e-05,3e-06,9e-06,1e-06,1.3e-05,2.4e-05,1.3e-05,1.2e-05,1.3e-05,6e-06,8e-06,1.7e-05,1e-05,0,1.2e-05,1.9e-05,1.2e-05,9e-06,3e-06,8e-06,1.5e-05,1.5e-05,1.4e-05,7e-06,5e-06,1.6e-05,6e-06,0,1.9e-05,1e-05,5e-06,7e-06,1.3e-05,1.5e-05,7e-06,5e-06,6e-06,5e-06,8e-06,5e-06,5e-06,6e-06,1e-05,3e-06,7e-06,7e-06,1.1e-05,1.2e-05,4e-06,6e-06,8e-06,7e-06,1.2e-05,1.5e-05,1.3e-05,1e-05,9e-06,9e-06,8e-06,7e-06,8e-06,9e-06,1.4e-05,6e-06,4e-06,5e-06,1.3e-05,7e-06,3e-06,9e-06,5e-06,6e-06,7e-06,3e-06
1.1e-05,8e-06,1.4e-05,1.7e-05,1.8e-05,7e-06,1.2e-05,9e-06,1.4e-05,6e-06,9e-06,6e-06,9e-06,1.6e-05,6e-06,7e-06,7e-06,1e-05,5e-06,1.2e-05,6e-06,1.5e-05,7e-06,2e-06,1.7e-05,1.3e-05,2e-06,1.8e-05,1.2e-05,1.4e-05,1.8e-05,4e-06,1.4e-05,1.2e-05,3e-06,6e-06,7e-06,5e-06,3e-06,1e-05,9e-06,1e-06,9e-06,1.4e-05,1.2e-05,5e-06,2e-06,5e-06,7e-06,8e-06,9e-06,4e-06,1.2e-05,1.4e-05,8e-06,5e-06,1.2e-05,9e-06,6e-06,1.2e-05,1e-05,1.7e-05,3e-06,6e-06,5e-06,5e-06,4e-06,1.6e-05,1.2e-05,6e-06,3e-06,2e-06,1e-05,1.1e-05,1e-05,1.4e-05,5e-06,8e-06,7e-06,7e-06,2e-05,1.5e-05,8e-06,2e-06,5e-06,2e-06,9e-06,3e-06,3e-06,1.2e-05,1e-06,3e-06,7e-06,5e-06,5e-06,2e-06,9e-06,7e-06,3e-06,7e-06,1.2e-05,7e-06,1.1e-05,1e-05,2e-06,4e-06,9e-06,5e-06,6e-06,5e-06,2e-06,8e-06,7e-06,6e-06,6e-06,5e-06,9e-06,1e-05,5e-06,1e-06,4e-06
6e-06,5e-06,7e-06,9e-06,3e-06,1e-05,1.1e-05,1.1e-05,1.5e-05,1e-06,6e-06,4e-06,8e-06,1.1e-05,7e-06,1.1e-05,9e-06,1.1e-05,1e-05,7e-06,1.1e-05,1e-06,5e-06,3e-06,1.7e-05,6e-06,5e-06,5e-06,5e-06,6e-06,7e-06,1e-05,9e-06,1.2e-05,1e-05,3e-06,5e-06,2e-06,5e-06,9e-06,1e-05,8e-06,1e-05,3e-06,1.9e-05,7e-06,7e-06,7e-06,1.1e-05,5e-06,2e-06,1e-06,9e-06,8e-06,5e-06,7e-06,9e-06,3e-06,7e-06,7e-06,9e-06,3e-06,1e-06,5e-06,7e-06,5e-06,6e-06,1e-05,6e-06,1e-06,2e-06,3e-06,1e-06,3e-06,5e-06,8e-06,7e-06,5e-06,9e-06,1e-05,1e-05,5e-06,1e-06,3e-06,5e-06,4e-06,7e-06,1.1e-05,3e-06,1.1e-05,4e-06,6e-06,7e-06,6e-06,2e-06,2e-06,6e-06,3e-06,4e-06,2e-06,1e-05,1e-06,9e-06,1e-06,3e-06,3e-06,9e-06,7e-06,3e-06,2e-06,8e-06,1e-05,8e-06,7e-06,5e-06,8e-06,4e-06,5e-06,3e-06,2e-06,6e-06
4e-06,7e-06,8e-06,8e-06,8e-06,7e-06,7e-06,5e-06,6e-06,7e-06,4e-06,4e-06,4e-06,1.3e-05,8e-06,3e-06,2e-06,0,6e-06,2e-06,2e-06,5e-06,3e-06,2e-06,1.5e-05,8e-06,5e-06,6e-06,1e-06,1.2e-05,1.1e-05,9e-06,4e-06,6e-06,1.3e-05,9e-06,1e-05,5e-06,5e-06,1.3e-05,5e-06,4e-06,6e-06,9e-06,1.7e-05,3e-06,7e-06,2e-06,1e-05,3e-06,4e-06,1e-06,1e-05,8e-06,8e-06,2e-06,7e-06,2e-06,9e-06,1.2e-05,6e-06,1e-06,5e-06,3e-06,6e-06,4e-06,5e-06,1.2e-05,1.4e-05,9e-06,5e-06,4e-06,4e-06,4e-06,2e-06,1.1e-05,5e-06,4e-06,6e-06,7e-06,1e-05,9e-06,9e-06,9e-06,2e-06,4e-06,6e-06,8e-06,9e-06,1.4e-05,3e-06,5e-06,4e-06,6e-06,2e-06,4e-06,0,6e-06,1e-06,0,1e-05,3e-06,1e-05,4e-06,1e-06,1e-06,7e-06,5e-06,2e-06,2e-06,6e-06,4e-06,7e-06,7e-06,2e-06,3e-06,6e-06,7e-06,3e-06,3e-06,5e-06
5e-06,7e-06,4e-06,5e-06,4e-06,1e-05,3e-06,8e-06,9e-06,5e-06,2e-06,6e-06,2e-06,1.4e-05,7e-06,4e-06,2e-06,4e-06,4e-06,3e-06,2e-06,3e-06,2e-06,1e-06,8e-06,2e-06,2e-06,1e-05,6e-06,1.6e-05,2e-06,5e-06,7e-06,9e-06,7e-06,7e-06,2e-06,7e-06,5e-06,1.3e-05,7e-06,2e-06,3e-06,2e-06,1.8e-05,3e-06,3e-06,3e-06,7e-06,4e-06,3e-06,3e-06,1e-05,1.3e-05,1e-06,5e-06,7e-06,3e-06,4e-06,9e-06,5e-06,4e-06,5e-06,2e-06,2e-06,6e-06,5e-06,1.3e-05,1.2e-05,6e-06,5e-06,2e-06,7e-06,1e-06,1e-06,1.4e-05,9e-06,7e-06,6e-06,1e-06,7e-06,2e-06,5e-06,4e-06,3e-06,2e-06,5e-06,0,3e-06,1e-05,5e-06,6e-06,1e-06,6e-06,4e-06,3e-06,2e-06,5e-06,4e-06,5e-06,8e-06,4e-06,4e-06,3e-06,3e-06,2e-06,6e-06,7e-06,2e-06,1e-06,2e-06,6e-06,4e-06,4e-06,1e-06,0,2e-06,7e-06,3e-06,4e-06,2e-06
5e-06,4e-06,3e-06,7e-06,5e-06,1.2e-05,4e-06,3e-06,7e-06,2e-06,7e-06,7e-06,2e-06,9e-06,6e-06,6e-06,3e-06,4e-06,5e-06,7e-06,4e-06,1e-06,1e-06,3e-06,1e-05,4e-06,2e-06,8e-06,4e-06,1.1e-05,5e-06,3e-06,4e-06,1.2e-05,7e-06,6e-06,1e-05,6e-06,1e-06,1.5e-05,2e-06,3e-06,1e-06,3e-06,1.5e-05,4e-06,6e-06,3e-06,3e-06,1e-06,4e-06,3e-06,8e-06,1.1e-05,3e-06,4e-06,7e-06,2e-06,4e-06,6e-06,4e-06,1e-06,4e-06,3e-06,2e-06,3e-06,3e-06,1.5e-05,1.2e-05,5e-06,5e-06,3e-06,7e-06,4e-06,2e-06,1.1e-05,7e-06,7e-06,4e-06,3e-06,1e-05,2e-06,6e-06,3e-06,3e-06,3e-06,2e-06,3e-06,2e-06,1e-05,5e-06,2e-06,1e-06,1e-06,1e-06,2e-06,2e-06,3e-06,2e-06,4e-06,9e-06,4e-06,6e-06,3e-06,3e-06,3e-06,8e-06,8e-06,3e-06,1e-06,5e-06,7e-06,9e-06,7e-06,4e-06,5e-06,4e-06,3e-06,2e-06,2e-06,4e-06
3e-06,4e-06,4e-06,5e-06,4e-06,7e-06,3e-06,5e-06,8e-06,3e-06,5e-06,1e-06,2e-06,9e-06,1e-06,3e-06,1e-06,7e-06,5e-06,6e-06,3e-06,5e-06,1e-06,3e-06,1e-05,4e-06,6e-06,5e-06,4e-06,8e-06,4e-06,5e-06,8e-06,1e-05,1e-05,6e-06,8e-06,2e-06,1e-06,1.2e-05,8e-06,3e-06,1e-06,5e-06,1e-05,1e-06,7e-06,1e-06,4e-06,2e-06,1e-06,3e-06,9e-06,1e-05,3e-06,7e-06,4e-06,4e-06,4e-06,6e-06,4e-06,1e-06,4e-06,2e-06,2e-06,1e-06,6e-06,1.5e-05,1e-05,4e-06,3e-06,1e-06,5e-06,2e-06,2e-06,1.2e-05,7e-06,3e-06,8e-06,3e-06,1e-05,4e-06,6e-06,5e-06,1e-06,3e-06,1e-06,0,2e-06,1e-05,2e-06,3e-06,3e-06,4e-06,3e-06,3e-06,2e-06,4e-06,1e-06,1e-06,1.1e-05,3e-06,6e-06,3e-06,2e-06,1e-06,5e-06,7e-06,5e-06,3e-06,2e-06,6e-06,8e-06,6e-06,3e-06,4e-06,3e-06,5e-06,1e-06,2e-06,4e-06
2e-06,3e-06,0,0,5e-06,9e-06,4e-06,0,7e-06,4e-06,4e-06,5e-06,4e-06,1.3e-05,3e-06,2e-06,2e-06,6e-06,2e-06,8e-06,2e-06,3e-06,1e-06,1e-06,8e-06,3e-06,4e-06,9e-06,2e-06,1.1e-05,2e-06,5e-06,4e-06,1.1e-05,8e-06,2e-06,7e-06,5e-06,2e-06,1e-05,5e-06,2e-06,1e-06,4e-06,1.4e-05,5e-06,6e-06,4e-06,9e-06,4e-06,2e-06,1e-06,9e-06,7e-06,2e-06,8e-06,7e-06,2e-06,3e-06,5e-06,4e-06,1e-06,2e-06,2e-06,5e-06,1e-06,3e-06,1.2e-05,1.1e-05,5e-06,2e-06,1e-06,4e-06,2e-06,1e-06,1.1e-05,5e-06,2e-06,7e-06,3e-06,1e-05,6e-06,6e-06,3e-06,2e-06,2e-06,4e-06,2e-06,4e-06,1.1e-05,4e-06,4e-06,4e-06,2e-06,4e-06,2e-06,3e-06,1e-06,1e-06,3e-06,8e-06,2e-06,6e-06,3e-06,2e-06,1e-06,4e-06,6e-06,3e-06,0,3e-06,5e-06,7e-06,6e-06,3e-06,3e-06,2e-06,5e-06,2e-06,2e-06,3e-06
1e-06,3e-06,3e-06,3e-06,4e-06,7e-06,2e-06,3e-06,6e-06,1e-06,1e-06,4e-06,2e-06,1.1e-05,1e-06,5e-06,2e-06,5e-06,2e-06,6e-06,1e-06,2e-06,1e-06,1e-06,1e-05,3e-06,1e-06,5e-06,2e-06,9e-06,4e-06,6e-06,5e-06,1e-05,6e-06,2e-06,6e-06,4e-06,3e-06,9e-06,7e-06,4e-06,2e-06,1e-06,1.3e-05,5e-06,3e-06,1e-06,7e-06,1e-06,4e-06,1e-06,1e-05,9e-06,1e-06,7e-06,7e-06,2e-06,4e-06,5e-06,3e-06,1e-06,4e-06,1e-06,5e-06,4e-06,5e-06,1.3e-05,1.1e-05,6e-06,5e-06,3e-06,4e-06,1e-06,3e-06,1.1e-05,6e-06,4e-06,5e-06,3e-06,1.1e-05,4e-06,6e-06,3e-06,3e-06,2e-06,2e-06,1e-06,3e-06,5e-06,1e-06,3e-06,3e-06,2e-06,3e-06,2e-06,3e-06,4e-06,1e-06,4e-06,8e-06,1e-06,5e-06,2e-06,1e-06,1e-06,5e-06,8e-06,1e-06,2e-06,4e-06,6e-06,8e-06,5e-06,2e-06,2e-06,0,4e-06,1e-06,1e-06,2e-06
1e-06,4e-06,2e-06,0,1e-06,7e-06,3e-06,2e-06,7e-06,2e-06,3e-06,4e-06,1e-06,1.2e-05,1e-06,2e-06,1e-06,6e-06,3e-06,3e-06,1e-06,3e-06,1e-06,1e-06,1.1e-05,3e-06,2e-06,4e-06,2e-06,7e-06,5e-06,4e-06,5e-06,9e-06,7e-06,3e-06,5e-06,3e-06,1e-06,9e-06,5e-06,4e-06,2e-06,1e-06,1.5e-05,3e-06,5e-06,2e-06,4e-06,2e-06,3e-06,1e-06,1e-05,8e-06,1e-06,3e-06,6e-06,1e-06,4e-06,4e-06,4e-06,1e-06,4e-06,2e-06,5e-06,2e-06,5e-06,1.3e-05,1e-05,6e-06,3e-06,1e-06,3e-06,2e-06,2e-06,1e-05,6e-06,3e-06,5e-06,2e-06,1.1e-05,4e-06,5e-06,3e-06,3e-06,2e-06,2e-06,2e-06,1e-06,8e-06,2e-06,4e-06,4e-06,1e-06,3e-06,2e-06,3e-06,3e-06,1e-06,2e-06,7e-06,2e-06,5e-06,0,1e-06,1e-06,5e-06,8e-06,4e-06,3e-06,4e-06,6e-06,7e-06,5e-06,1e-06,3e-06,1e-06,4e-06,1e-06,0,3e-06
1e-06,3e-06,1e-06,1e-06,2e-06,8e-06,2e-06,2e-06,6e-06,1e-06,2e-06,5e-06,2e-06,1.3e-05,1e-06,1e-06,1e-06,6e-06,1e-06,5e-06,1e-06,1e-06,0,0,9e-06,2e-06,2e-06,6e-06,1e-06,9e-06,4e-06,4e-06,4e-06,1e-05,7e-06,2e-06,5e-06,3e-06,1e-06,9e-06,6e-06,3e-06,0,1e-06,1.4e-05,3e-06,6e-06,2e-06,5e-06,1e-06,1e-06,1e-06,9e-06,9e-06,1e-06,4e-06,5e-06,2e-06,4e-06,4e-06,3e-06,1e-06,4e-06,2e-06,5e-06,1e-06,5e-06,1.2e-05,1e-05,4e-06,4e-06,2e-06,5e-06,1e-06,1e-06,1e-05,6e-06,3e-06,6e-06,3e-06,1e-05,4e-06,4e-06,3e-06,3e-06,2e-06,1e-06,2e-06,1e-06,7e-06,3e-06,4e-06,3e-06,2e-06,2e-06,3e-06,2e-06,2e-06,1e-06,2e-06,8e-06,3e-06,6e-06,1e-06,1e-06,1e-06,6e-06,5e-06,2e-06,1e-06,3e-06,5e-06,8e-06,5e-06,2e-06,3e-06,1e-06,4e-06,1e-06,0,3e-06
