0.140813,0.16382,0.162766,0.161441,0.171976,0.181071,0.174838,0.154519,0.147798,0.157189,0.180705,0.191941,0.158419,0.118694,0.112697,0.120974,0.123107,0.124588,0.123127,0.120077,0.130925,0.14033,0.146281,0.175255,0.1929,0.171084,0.162063,0.158954
0.184595,0.217186,0.21387,0.206972,0.221387,0.239457,0.23054,0.202109,0.195927,0.208795,0.242178,0.258889,0.211872,0.159229,0.151213,0.1618,0.162278,0.163443,0.163409,0.158653,0.17387,0.189303,0.197761,0.238031,0.261609,0.229546,0.219722,0.217865
0.266479,0.313127,0.303329,0.285685,0.308386,0.346247,0.333168,0.288745,0.283409,0.301304,0.352312,0.379949,0.309297,0.235871,0.224447,0.23826,0.236416,0.236878,0.240505,0.232622,0.252267,0.277139,0.292645,0.357332,0.3905,0.335705,0.326359,0.32915
0.340555,0.388701,0.367745,0.34154,0.371907,0.428072,0.411659,0.355028,0.350723,0.368591,0.431949,0.469392,0.384928,0.305391,0.292417,0.30571,0.301927,0.300541,0.312183,0.30354,0.318003,0.34703,0.370514,0.457361,0.497026,0.420949,0.414083,0.425316
0.376965,0.408769,0.374603,0.347019,0.384484,0.442204,0.419372,0.361314,0.354166,0.368887,0.43213,0.468988,0.401714,0.349406,0.336055,0.334414,0.325827,0.324941,0.346384,0.340072,0.338224,0.358341,0.382939,0.476105,0.519109,0.442969,0.433933,0.446435
0.389309,0.405399,0.35808,0.334652,0.378298,0.409934,0.373627,0.325804,0.313573,0.331201,0.381534,0.408044,0.385102,0.371226,0.359717,0.338541,0.320825,0.321118,0.344828,0.339351,0.315755,0.317579,0.339861,0.41844,0.459003,0.410083,0.383233,0.381789
0.413493,0.434268,0.384792,0.362357,0.406364,0.41845,0.383725,0.355771,0.345648,0.357673,0.384509,0.40362,0.397824,0.38518,0.380965,0.362861,0.34411,0.348332,0.370517,0.364962,0.341979,0.334911,0.343336,0.396455,0.432141,0.406005,0.348836,0.329109
0.465758,0.533842,0.502976,0.466061,0.508945,0.528468,0.508931,0.517371,0.540441,0.512218,0.495201,0.504813,0.457942,0.42787,0.447625,0.445002,0.442658,0.478635,0.487153,0.463238,0.498215,0.515155,0.477865,0.521169,0.559831,0.492612,0.422595,0.432394
0.666609,0.83336,0.803392,0.712123,0.77041,0.818859,0.798035,0.832362,0.903607,0.819034,0.758615,0.780408,0.652661,0.593895,0.647314,0.644526,0.650835,0.731694,0.743597,0.709202,0.857494,0.908681,0.788759,0.874603,0.93603,0.744132,0.628776,0.710819
1.067468,1.384975,1.322745,1.130731,1.225664,1.315366,1.277936,1.325778,1.466408,1.342287,1.264227,1.314823,1.069009,0.969358,1.031678,0.978565,0.965527,1.101648,1.156324,1.140705,1.476652,1.567161,1.297871,1.484849,1.614588,1.198986,0.957372,1.15044
1.619304,2.114119,1.985232,1.667869,1.839774,1.969609,1.899117,1.960145,2.172411,2.03576,1.982666,2.070587,1.67762,1.511992,1.526497,1.36258,1.298361,1.50691,1.666196,1.705732,2.309093,2.454048,1.960605,2.29516,2.549327,1.814626,1.361293,1.690269
2.138794,2.758782,2.553757,2.159209,2.454405,2.58923,2.451905,2.517518,2.76195,2.662594,2.689561,2.814896,2.280578,2.041156,1.981581,1.669868,1.538654,1.814467,2.084435,2.180355,3.060862,3.278286,2.563377,3.040239,3.438442,2.398689,1.698163,2.1266
2.294143,2.883966,2.648596,2.309363,2.727301,2.824693,2.629399,2.696622,2.88434,2.843571,2.96038,3.117609,2.540945,2.249444,2.141936,1.725963,1.565821,1.863064,2.151198,2.245706,3.23291,3.506929,2.705051,3.221689,3.713892,2.58526,1.743009,2.159572
1.910304,2.28525,2.08902,1.920102,2.361415,2.39874,2.213839,2.285474,2.342268,2.336136,2.500439,2.671311,2.223388,1.94436,1.856153,1.47507,1.314021,1.532632,1.745006,1.80699,2.596475,2.865181,2.214051,2.575316,3.008423,2.137558,1.411352,1.709901
1.38655,1.490141,1.342855,1.323434,1.612946,1.596336,1.490861,1.587577,1.568953,1.514709,1.640472,1.780769,1.624299,1.471979,1.399279,1.179422,1.008042,1.049245,1.178833,1.295598,1.75101,1.940908,1.548767,1.581229,1.821662,1.469134,1.089929,1.186301
1.434536,1.511103,1.291193,1.187256,1.302645,1.412802,1.427698,1.560345,1.575178,1.385891,1.442341,1.424698,1.425938,1.448027,1.364945,1.219765,1.036254,1.07471,1.242167,1.362737,1.666121,1.961284,1.6282,1.31013,1.352349,1.326139,1.27196,1.19263
1.851222,2.002528,1.767406,1.590559,1.618602,1.751927,1.824321,2.060199,2.130587,1.831683,1.915755,1.842491,1.768754,1.798083,1.706982,1.549006,1.380984,1.531963,1.740078,1.794942,2.142268,2.547767,2.079344,1.674303,1.750737,1.746964,1.72701,1.603128
2.141262,2.321758,2.209106,2.012344,1.94102,2.096674,2.212816,2.445189,2.513669,2.15076,2.323336,2.295563,2.06229,2.031788,1.965061,1.812795,1.725299,1.994349,2.175827,2.121799,2.445168,2.848399,2.335815,2.019247,2.239323,2.203194,2.0883,1.933609
2.129471,2.255241,2.371471,2.283064,2.169581,2.467809,2.56749,2.499989,2.481583,2.21587,2.466652,2.437203,2.057214,2.011711,2.025548,1.908203,1.99853,2.340133,2.378392,2.254765,2.453159,2.655555,2.318545,2.213,2.447238,2.431304,2.27035,1.996263
1.937783,2.076293,2.340212,2.446762,2.404777,2.79246,2.799154,2.472233,2.348292,2.172372,2.393879,2.245716,1.788655,1.821805,1.984216,1.85085,2.120597,2.512419,2.335436,2.204445,2.2448,2.263874,2.281463,2.308447,2.349278,2.418063,2.290076,1.765177
1.688488,1.869421,2.093885,2.328563,2.445739,2.755132,2.661756,2.375689,2.237117,2.029781,2.118528,1.855376,1.445191,1.622309,1.872844,1.672911,1.971261,2.343303,2.055758,1.946049,1.986676,2.071751,2.219741,2.074413,1.943287,2.126946,2.028692,1.40693
1.385431,1.501834,1.57861,1.805611,2.016071,2.19069,2.1131,2.028497,1.930789,1.731565,1.740233,1.439485,1.113971,1.310454,1.529296,1.393562,1.571251,1.726223,1.473879,1.446314,1.562079,1.803278,1.87739,1.503626,1.363061,1.57568,1.522531,1.18228
1.005929,0.998915,0.967775,1.14585,1.335802,1.460612,1.45282,1.453971,1.3898,1.327006,1.407512,1.177116,0.86852,0.942064,1.05685,0.975227,1.0478,1.052271,0.951146,0.969069,1.0449,1.290669,1.285951,1.004277,0.99583,1.104998,0.998669,0.910774
0.720283,0.65813,0.58855,0.665515,0.750201,0.89486,0.942264,0.857732,0.896514,1.052107,1.111095,0.917616,0.707905,0.751362,0.769803,0.625804,0.668672,0.700354,0.702045,0.710771,0.699771,0.83695,0.802804,0.722633,0.818235,0.858042,0.753208,0.684487
0.645327,0.500334,0.451265,0.540791,0.530844,0.560788,0.620967,0.587456,0.728179,0.954392,0.896081,0.714042,0.680178,0.734351,0.661244,0.49579,0.580334,0.651003,0.632623,0.632983,0.614765,0.670242,0.622598,0.61296,0.700276,0.753748,0.731442,0.644929
0.669474,0.450888,0.39393,0.570459,0.570553,0.429508,0.474114,0.639469,0.824611,0.89671,0.729553,0.613327,0.738381,0.771738,0.665017,0.545385,0.574046,0.617094,0.648254,0.725384,0.766769,0.832793,0.731813,0.651825,0.763427,0.843701,0.799776,0.711055
0.766787,0.535425,0.402783,0.583813,0.618322,0.407394,0.425283,0.735543,0.987109,0.933146,0.700338,0.632225,0.818769,0.845816,0.812147,0.71229,0.568104,0.58277,0.776042,0.919568,1.002197,1.16392,0.992837,0.79181,0.939044,1.002571,0.849948,0.740801
0.888721,0.653263,0.458279,0.600225,0.642198,0.405887,0.379746,0.764956,1.045062,0.932776,0.749711,0.726011,0.871413,0.969496,1.128815,0.986816,0.61547,0.611279,0.930934,1.052478,1.207498,1.534128,1.292189,1.040568,1.238705,1.148686,0.792417,0.690881
1.012876,0.802991,0.60079,0.771003,0.750484,0.448884,0.347281,0.683938,0.949063,0.851342,0.760815,0.769148,0.853818,1.03743,1.391428,1.245866,0.770913,0.760932,1.026617,1.035914,1.264761,1.705869,1.435862,1.237359,1.48862,1.271135,0.723545,0.585011
0.997834,0.857645,0.696511,0.961463,0.957303,0.600017,0.380699,0.579693,0.79064,0.770327,0.756207,0.744155,0.756774,0.956231,1.37855,1.300297,0.91787,0.916542,1.003538,0.917975,1.160593,1.519641,1.273159,1.217923,1.483542,1.238481,0.701733,0.495785
0.81723,0.726447,0.652973,0.991206,1.081094,0.75891,0.453299,0.525923,0.646385,0.646248,0.667979,0.624778,0.560084,0.687479,1.026789,1.051897,0.908377,0.977575,0.950122,0.810109,0.941263,1.080665,0.951461,1.038649,1.214023,1.017153,0.659493,0.448818
0.562705,0.484602,0.504208,0.808089,0.990511,0.804944,0.491306,0.453963,0.504215,0.494588,0.493444,0.444221,0.384943,0.447151,0.584129,0.639003,0.709574,0.891258,0.881661,0.69203,0.666439,0.6629,0.714167,0.880994,0.943821,0.817232,0.592055,0.431495
0.374772,0.316855,0.336815,0.535853,0.74212,0.679459,0.451064,0.365247,0.403128,0.392684,0.335208,0.318798,0.325426,0.381229,0.367069,0.342572,0.461059,0.708952,0.710917,0.477144,0.414701,0.421852,0.528654,0.686515,0.695807,0.598012,0.449871,0.356573
0.296145,0.293046,0.231896,0.344347,0.510788,0.466739,0.345909,0.29358,0.359908,0.335062,0.243169,0.268328,0.334285,0.387645,0.335699,0.257888,0.340626,0.542278,0.500315,0.275143,0.228388,0.274076,0.373642,0.500259,0.535924,0.424923,0.286754,0.253192
0.235768,0.279801,0.175491,0.209011,0.311474,0.318224,0.253073,0.197849,0.294903,0.293006,0.171242,0.217732,0.324048,0.344841,0.290551,0.211927,0.238391,0.347242,0.32068,0.196469,0.179074,0.225751,0.280952,0.337185,0.398258,0.352989,0.223344,0.206181
0.211318,0.263632,0.146,0.126494,0.186328,0.235456,0.195288,0.141066,0.262465,0.272454,0.122803,0.156867,0.257784,0.243381,0.203216,0.168547,0.172659,0.20153,0.187822,0.146574,0.174309,0.220546,0.224665,0.232887,0.25454,0.268,0.205163,0.186348
0.216313,0.260883,0.135665,0.077611,0.112494,0.187631,0.17809,0.155093,0.259733,0.254106,0.112423,0.106519,0.160985,0.152179,0.12807,0.128547,0.162235,0.191768,0.178488,0.135756,0.165814,0.193261,0.159941,0.141827,0.151983,0.185235,0.169839,0.156058
0.224936,0.237789,0.125743,0.069495,0.076459,0.138025,0.165568,0.172696,0.223052,0.210243,0.107627,0.071483,0.086233,0.104133,0.104351,0.103628,0.139229,0.178917,0.184187,0.137427,0.146039,0.150242,0.115952,0.097634,0.122239,0.138506,0.133746,0.126826
0.218084,0.185173,0.104528,0.08298,0.07985,0.101287,0.139021,0.167356,0.155927,0.14565,0.099828,0.062906,0.068113,0.086932,0.105362,0.09522,0.096771,0.132675,0.159352,0.129425,0.13078,0.143475,0.109556,0.074782,0.099029,0.110594,0.114235,0.09844
0.18172,0.121623,0.076469,0.090994,0.089481,0.071253,0.099652,0.139279,0.095294,0.089529,0.087085,0.081073,0.091733,0.093365,0.112623,0.086496,0.054747,0.076027,0.111825,0.10137,0.11022,0.14573,0.100109,0.054064,0.080307,0.104777,0.103423,0.070301
