5.9e-05,2.8e-05,9.8e-05,0.000125,5.8e-05,8e-06,0.000128,4.3e-05,0.000122,0.000156,2.6e-05,1.2e-05,2.3e-05,0.00027,6e-05,8e-05,0.000107,1.7e-05,5.9e-05,6e-06,2.8e-05,2.2e-05,2.8e-05,0.000115,7.9e-05,3.8e-05,0.000113,7.6e-05,0.000198,4.5e-05,9.6e-05,2.9e-05,2.1e-05,0.000172,0.000234,9e-06,9.9e-05,0.000101,8.1e-05,0.000111,1e-06,9.5e-05,7.2e-05,2.9e-05,8.8e-05,7.2e-05,0.000125,8.1e-05,3e-05,5.9e-05,0.00013,0.00013,7.3e-05,3.4e-05,2.7e-05,3.8e-05,7.3e-05,0.000162,0.00013,3.2e-05,8.5e-05,5.1e-05,0.000146,7.4e-05,0.000111,6.6e-05,0.00013,5.8e-05,0.000101,0.000106,0.000164,1.2e-05,1e-05,3e-06,6e-06,1.2e-05,7.3e-05,9.7e-05,0,7.3e-05,7e-05,2.7e-05,5.2e-05,3.6e-05,5e-05,1.6e-05,3.6e-05,0.000109,1.2e-05,2.3e-05,1.1e-05,0.000147,6.3e-05,4.3e-05,6.3e-05,4.7e-05,4.3e-05,2.7e-05,0.00013,4.6e-05,8.8e-05,5.6e-05,4e-06,0.000149,5.6e-05,2.2e-05,7.2e-05,2.5e-05,2.1e-05,2e-06,1.2e-05,2.3e-05,6.8e-05,4.7e-05,3.9e-05,1.4e-05,0.000231,3.7e-05,3.3e-05,1.3e-05,4e-05
8.3e-05,0.000109,0.000173,0.000269,0.000138,0.000107,0.000335,0.000136,0.000214,0.000343,0.000179,0.000112,4.3e-05,0.000541,0.000162,0.000143,0.000257,5.7e-05,0.000117,0.000124,8.1e-05,0.000115,5.3e-05,0.000251,0.000171,8.3e-05,0.000234,0.000153,0.000444,7e-05,0.00018,3.8e-05,5.5e-05,0.000345,0.000499,0.000113,0.000149,0.000219,0.000188,0.000218,6.5e-05,0.000165,0.000168,0.000143,0.00021,0.000162,0.00023,0.000206,0.000143,0.000114,0.000297,0.000211,0.000169,3.5e-05,8.9e-05,0.000148,0.000222,0.000275,0.000322,0.00017,0.000139,0.00011,0.000286,0.000201,0.000215,0.000152,0.000303,0.000128,0.000174,0.000224,0.000347,3.1e-05,3.9e-05,4.4e-05,7.9e-05,1e-04,0.000202,0.000224,7e-06,0.000155,0.000145,8.9e-05,0.000134,0.000151,0.000102,3.5e-05,0.00013,0.000314,0.000101,4.2e-05,8e-05,0.000343,7.8e-05,0.000103,0.000156,0.000123,0.00013,9.7e-05,0.000318,0.000107,0.000254,0.000178,4.6e-05,4e-04,0.000184,0.000111,0.000161,7.7e-05,2.3e-05,5.3e-05,0.00012,9.9e-05,0.000113,0.000107,6.1e-05,8.6e-05,0.000482,0.000109,0.000155,4.4e-05,0.000145
0.000116,0.000171,0.000335,0.000319,0.000289,0.000152,0.000339,0.000148,0.000131,0.000231,5.6e-05,7.9e-05,0.000136,0.000616,7.1e-05,0.000185,0.000319,0.000241,0.000254,0.00026,9e-05,1e-04,0.000168,0.000251,0.000247,7.6e-05,9.8e-05,0.000204,0.000576,0.000228,0.00033,0.000109,7.8e-05,0.000205,0.000306,0.000232,0.000252,0.000264,0.000407,0.000444,0.000161,0.000331,0.000319,0.000385,0.000327,0.000181,0.000478,0.000358,0.000203,0.000216,0.000326,0.000254,0.000173,0.000171,4e-05,0.000116,0.000242,0.000476,0.000381,8.7e-05,0.000198,2e-04,0.000236,0.000401,0.00038,0.000343,0.000424,0.000119,0.000131,0.000211,0.000309,5.8e-05,0.000139,9.2e-05,0.000243,0.000191,0.000191,0.000209,0.000151,0.00013,2e-06,9.2e-05,0.000172,0.000216,0.000205,0.000193,0.000203,0.000425,0.000169,0.000245,0.000156,0.000311,0.00021,0.000262,0.000159,8.8e-05,0.000245,0.000174,0.000438,0.000242,0.000279,0.000254,7.4e-05,0.000487,0.000191,0.000175,0.00016,7.7e-05,4e-05,0.00018,0.000161,5.8e-05,0.000271,7.2e-05,9.2e-05,2.7e-05,0.000603,0.000135,4.3e-05,0.000186,9.2e-05
2.8e-05,0.000324,0.000429,0.000675,0.000438,0.000557,0.000661,0.000515,0.000399,0.000277,0.000175,0.000326,0.00055,0.000792,0.000508,0.000399,0.000677,0.000276,0.000215,0.000384,0.000489,0.000137,0.000332,0.000564,0.000425,0.000389,0.000261,0.000284,0.000742,0.000178,0.000587,0.000288,0.000176,0.000443,0.000767,0.000524,0.000508,0.000544,0.000501,0.000463,0.000274,0.000432,0.000309,4.3e-05,0.000667,0.000459,0.00085,0.000201,0.000395,0.00023,0.000401,0.000458,0.000295,0.000339,0.000309,0.000277,0.000363,0.000707,0.00024,0.00073,0.000511,0.000202,0.000619,0.000968,0.000286,0.000274,0.000429,0.000423,8.3e-05,0.000252,0.000524,0.000287,0.000303,7.4e-05,0.000424,0.000802,3.1e-05,0.000472,0.000387,0.000369,0.000187,0.000259,0.000365,0.000203,0.000184,0.000162,0.000362,0.000311,9.8e-05,0.000319,0.000118,6e-04,0.000284,0.00027,0.000205,0.000354,0.000523,7e-05,0.000713,0.000131,0.000293,0.000533,0.000287,0.000459,0.000699,0.00032,0.000222,0.000414,9.4e-05,0.000147,0.000532,0.000209,0.000398,0.000354,0.000175,0.00059,0.000786,0.00043,0.000113,0.00027,0.000474
0.000287,0.000363,0.000191,0.000426,0.000705,0.000475,0.000253,0.000536,4e-04,0.000977,0.000779,0.000823,0.000471,0.001697,0.001567,0.000478,0.000755,0.000732,0.000139,0.000216,0.000648,0.000532,0.000378,0.000379,0.000873,0.000217,0.000743,0.000595,0.001173,0.001087,0.000477,0.000166,0.000749,4.4e-05,0.00108,0.001669,0.00058,0.000505,0.000175,0.001189,0.000894,0.000469,0.000446,0.00012,0.000896,0.000712,0.001455,0.001079,0.000805,0.001037,0.001033,0.00064,0.000737,0.000329,0.000172,0.000754,0.001269,0.002187,0.00233,0.002094,0.001172,0.000482,0.001351,0.000751,0.000592,0.000619,0.000283,0.000423,0.000544,0.000296,0.001079,0.000348,0.000421,0.000408,0.000663,0.001806,0.001597,0.001078,0.000496,9.7e-05,0.000144,0.000354,0.000312,0.000297,0.000246,0.000183,0.000658,0.000879,0.000327,0.00036,0.000529,0.000686,0.000952,0.000811,0.000542,0.000209,0.001109,0.000891,0.000857,0.001334,0.001019,0.00112,0.001262,0.000672,0.000756,0.000642,0.001077,0.001073,0.000553,0.00014,0.000631,0.00076,0.000751,0.000593,0.000553,0.000868,0.001358,0.001285,0.000807,0.000143,0.000686
0.000242,0.000173,0.000251,0.000367,0.000181,0.000907,0.000788,0.000381,0.000931,0.001533,0.001342,0.000379,0.000651,0.000844,0.001646,0.001507,0.000609,0.000909,0.000757,0.001089,0.001142,0.000457,0.000687,0.000937,0.00108,0.001003,0.000986,0.000677,0.000442,0.001502,0.001298,0.000792,0.001561,0.001249,0.000994,0.001309,0.000855,0.000461,0.000241,0.001094,0.000654,0.000196,0.000383,0.000525,0.000944,0.001304,0.001295,0.000948,0.001079,6.8e-05,0.000609,0.001549,0.000942,0.000389,0.000146,0.000805,0.001078,0.002489,0.002814,0.00189,0.001836,0.002488,0.001727,0.001713,0.00121,0.00098,0.001068,0.000995,0.000348,0.000599,0.001217,0.000387,0.000558,0.000797,0.00062,0.001225,0.000996,0.00076,0.000947,0.000423,6e-04,0.00056,0.000591,0.000549,0.000619,0.000419,0.000505,0.00026,0.000171,0.000604,0.000911,0.000772,0.001077,0.001195,0.00071,0.000243,0.000857,0.000742,0.000227,0.001011,0.001347,0.001393,0.001348,0.000785,0.000835,0.000488,0.001063,0.001252,0.00083,0.000665,0.00087,0.000994,0.000697,0.00023,0.000602,0.000932,0.001323,0.001205,0.000787,0.000664,0.000809
0.000238,0.000578,0.000301,0.000413,0.000166,0.000978,0.000209,7.1e-05,0.001473,0.000594,0.000679,0.000237,0.001093,0.000917,0.00064,0.001103,0.000528,0.000242,0.000415,0.000846,0.000766,0.000358,0.000931,0.000451,0.000112,0.000362,0.000388,0.00039,0.000373,0.000845,0.000653,0.000689,0.001203,0.000308,0.000549,0.001239,0.000683,0.000261,0.000509,0.00102,9e-04,0.000764,0.000173,0.000185,0.000566,0.000397,0.000248,0.000193,0.001138,0.000943,0.000824,0.000769,0.000352,0.000443,0.000417,0.001489,0.000668,0.001558,0.00171,0.000513,0.001376,0.001311,0.000441,0.000656,0.000773,0.001429,0.000857,0.000264,0.000665,0.000295,0.000768,0.00116,0.000219,0.000399,0.000359,0.000751,0.000112,0.000604,0.000802,0.000693,0.000466,0.000224,0.000494,0.000729,0.000111,7.1e-05,0.000532,0.000703,0.000156,0.000628,0.000592,0.000365,0.00049,0.000646,0.000672,0.000454,0.000599,0.000397,0.000412,0.000332,0.000293,0.000408,0.000699,0.000866,0.000663,0.000437,0.000778,0.000209,6.2e-05,0.000277,0.001053,0.000413,0.000668,0.000881,0.000417,0.000778,0.00037,0.000317,0.000875,0.00043,0.000579
0.000253,0.00097,0.00109,0.001331,0.001161,0.001461,0.000852,0.00041,0.00175,0.00165,0.001793,0.000739,0.00179,0.001658,0.002237,0.000619,0.000992,0.000699,0.000225,0.001085,0.000869,0.000705,0.001037,0.000868,0.000368,0.000761,0.001007,0.001005,0.000358,0.001009,0.000379,0.001292,0.001808,0.001581,0.001867,0.002539,0.002184,0.000719,0.000937,0.000774,0.001358,0.000584,0.000302,0.000213,0.000663,0.000648,0.000545,9.9e-05,0.001378,0.000443,0.000847,0.001402,0.001349,0.001053,0.00078,0.00133,0.001071,0.001763,0.00256,0.001768,0.001698,0.001435,0.000505,0.00203,0.001036,0.001081,0.001218,0.00063,0.000413,0.001317,0.000573,0.001625,0.001122,0.000453,0.000147,0.000779,0.001031,0.000924,0.001673,0.000416,0.000539,0.000838,0.000254,0.001186,0.001129,0.00062,0.00029,0.001016,0.000873,0.000248,0.001043,0.001428,0.00133,0.001094,8.6e-05,5.1e-05,0.00032,0.000718,0.001279,0.001121,0.000338,0.000162,0.000652,0.000626,0.000253,0.000495,0.000549,0.000585,0.000271,5.1e-05,0.00123,0.000912,0.00051,0.000931,0.001201,0.000691,0.000781,0.000919,0.001343,0.000963,0.001152
0.000766,0.001855,0.001922,0.000799,0.00127,2.3e-05,0.001051,0.000429,0.001553,0.001237,0.001479,0.002273,0.001001,0.001011,0.002826,0.003435,0.002994,0.001601,0.000413,0.001818,0.001778,0.001631,0.001586,0.001346,0.000827,0.001388,0.001603,0.001075,0.001162,0.001358,0.001952,0.001386,0.001697,0.000979,0.001238,0.002119,0.001295,0.001296,0.001772,0.002105,0.001042,0.001157,0.000796,0.000568,0.000584,0.000424,0.000345,0.000587,0.00113,0.00074,0.000678,0.001359,0.000914,0.000509,0.00102,0.001812,0.001751,0.001762,0.001414,0.000547,0.001343,0.001634,0.00144,0.002939,0.001563,0.001043,0.001603,0.002055,0.001579,0.002328,0.002274,0.001296,0.001108,0.001015,0.000581,0.000989,0.000837,0.000153,0.000897,0.001492,0.00196,0.00127,0.001022,0.001639,0.000702,0.000112,0.000802,0.001254,0.001698,0.001471,0.000981,0.001338,0.001632,0.00175,0.001547,0.00086,0.000485,0.001282,0.000901,0.001509,0.00163,0.000309,0.000387,0.000386,5.7e-05,0.000446,0.001069,0.000512,0.000747,0.000856,0.001512,0.000859,0.00084,0.000907,0.001489,0.001584,0.000743,0.00068,0.001436,0.001386,0.001385
0.00101,0.001472,0.000129,0.001337,0.000442,0.000224,0.001094,0.001325,0.000633,0.000938,0.001447,0.001129,0.001392,0.000786,0.001252,0.001345,0.000677,0.000367,0.001151,0.001924,0.00147,8.6e-05,0.00073,0.000782,8e-05,0.001518,0.000212,0.000543,0.00054,0.000479,0.00129,0.000461,0.000968,0.000792,0.000169,0.00086,0.000113,0.000745,0.000636,0.000555,0.000807,0.000767,0.000702,0.000471,0.00122,0.00136,0.000753,0.00113,0.001481,0.001599,0.000354,0.000594,0.000499,0.000191,0.00094,0.000343,0.00128,0.000335,0.001014,8.1e-05,0.000876,0.000319,0.001173,0.00152,0.000451,0.00145,0.000699,0.001342,0.000436,0.001543,0.000331,0.000388,0.000854,0.000807,0.000508,0.000825,0.000254,0.000526,0.000578,0.001014,0.001018,0.000434,0.000346,0.000611,0.000552,0.000238,0.000613,0.001046,0.000862,0.000148,0.00028,0.000942,0.000274,0.00077,0.000481,0.000722,0.000483,0.000646,0.001164,0.00065,0.000599,9e-04,0.000871,0.000724,0.00084,0.00063,0.000947,0.001698,0.000477,0.000597,0.001233,0.000486,0.000715,0.00051,0.000593,0.000773,0.000489,0.000768,0.000402,0.000132,0.000754
0.000315,0.000184,0.000322,0.000877,0.000987,0.000368,0.000756,0.000619,0.00048,0.000779,0.000753,0.001294,0.000336,0.000748,0.000847,0.00034,0.000607,0.000284,0.000987,0.000236,0.000387,0.000395,0.000663,0.001499,0.001083,0.00089,0.000883,0.000502,0.00087,0.000566,0.00122,0.000931,0.000489,0.001761,0.001826,0.001395,0.000667,0.000515,0.000767,0.000324,0.000551,0.000567,0.001032,0.000615,0.001326,0.001408,0.000851,0.000903,0.001015,0.000827,0.001159,0.000701,0.000373,0.000399,0.000595,0.000552,0.000935,0.001413,0.001824,0.001308,0.000945,0.001225,0.001169,0.001268,0.001355,0.001765,0.00154,0.000965,0.001289,0.00063,0.000285,0.001298,0.001097,0.000483,0.001191,0.000962,0.000322,0.000637,0.000948,0.00088,0.001427,0.001209,0.000263,0.000253,0.000459,0.00048,0.000265,0.000633,0.000544,0.00016,0.000168,0.000623,0.000805,0.000185,0.000779,0.000385,0.000474,0.000521,0.000501,0.000483,0.00025,0.00025,0.000465,0.000424,0.00081,0.000128,0.000793,0.001179,0.000992,0.000227,0.000757,0.001097,0.00049,0.000518,0.00042,0.000102,0.00011,0.000363,0.000432,0.000171,0.000346
0.000799,0.000666,0.00036,0.000278,0.00022,0.000437,0.000129,0.000177,0.000341,0.00057,0.000651,0.000377,0.000569,0.000334,0.000213,0.000256,0.000307,0.000117,0.000702,0.000521,0.000427,0.00034,0.000336,0.000878,0.000457,0.000721,0.000581,0.000702,0.000373,0.000236,0.000426,0.000453,0.000729,0.000859,0.00058,0.000444,0.000174,0.000157,0.000219,0.000422,0.000228,0.000136,0.000419,0.000254,0.000669,0.000654,0.000271,0.000809,0.00043,0.000988,0.000517,0.000402,0.00076,0.00069,0.000151,0.000314,0.000113,0.000892,0.000611,5.5e-05,0.000191,0.000761,0.000557,0.000308,0.000645,0.000376,0.000481,0.00058,0.000703,0.000106,0.00075,0.001177,0.000791,0.001145,0.000644,0.000417,0.000169,0.000354,0.001014,0.00073,0.000228,0.000678,0.000423,0.000137,0.000276,0.000451,0.000277,0.000552,0.000542,0.000405,7.2e-05,0.000284,0.000331,8.7e-05,0.000605,0.000368,0.000887,0.000535,0.000649,0.000341,6e-05,0.000137,0.000431,0.000653,0.000256,0.00048,0.00058,0.000325,0.000293,0.000178,0.000352,0.000482,0.000266,0.000477,0.000512,0.000312,0.000285,0.00022,0.000106,0.000211,0.000161
0.000483,0.00012,0.00019,0.00013,9.5e-05,0.000253,0.000269,0.000142,8.4e-05,0.00037,0.000394,0.000153,0.000277,0.000149,0.00022,0.000238,2e-05,0.000156,0.000316,0.000425,0.00022,0.000198,0.000138,0.000389,0.000171,0.000309,0.000181,0.000158,8.8e-05,0.000168,0.00013,0.000307,0.000404,0.000525,0.000271,0.000245,0.000228,4.8e-05,0.000109,0.000284,0.000224,5.7e-05,0.000134,0.000181,0.000367,0.000277,0.000202,0.000245,0.000333,0.000321,0.000166,0.000276,0.000466,0.000281,0.000233,0.00029,0.000397,0.00058,0.000234,4.4e-05,0.000395,0.000224,0.000408,0.000274,0.000247,0.000221,6.5e-05,0.000343,0.000593,0.00017,0.000489,0.000525,0.000321,0.000422,7.2e-05,0.00031,0.000198,0.000222,0.000556,0.000253,0.00033,0.000258,0.000235,0.000104,0.000142,0.000422,0.000104,0.000349,0.000319,5.3e-05,0.000187,0.000276,0.000217,7.6e-05,0.000199,9.5e-05,0.000576,0.000135,0.000327,0.000238,0.000104,0.000151,8.3e-05,0.000336,0.00014,0.00028,0.000169,0.000184,0.000218,2.4e-05,0.000267,0.000156,7.7e-05,0.000356,0.000183,5.5e-05,0.000183,0.000184,8.3e-05,0.000163,0.00022
0.00048,0.000308,0.000257,9.9e-05,0.000164,1e-04,0.000131,0.000239,0.000138,0.000165,0.000258,0.000184,0.000214,0.000112,0.00033,0.000111,8.9e-05,7.8e-05,0.000115,0.000236,0.000111,9.6e-05,0.00011,6.6e-05,0.00015,0.000144,0.000207,7.5e-05,0.000215,0.000399,0.000216,0.000216,0.000327,0.000266,0.000146,0.000118,0.000154,0.000278,6.9e-05,0.000214,0.000328,0.000111,9.4e-05,5e-06,0.000274,0.000145,0.00011,0.000172,0.000341,0.000211,7.6e-05,0.000441,0.000579,0.000422,0.000113,0.000382,0.000261,0.000467,0.000116,6.6e-05,0.000215,0.000228,0.000406,2.1e-05,0.000567,4e-04,0.000113,0.000262,0.000264,0.000211,0.000276,0.000309,0.000164,0.000436,0.000176,0.000158,0.000138,0.000343,0.000554,0.000226,0.00027,0.000261,0.000273,0.000195,0.000266,0.000174,0.000188,0.000181,0.00034,0.000287,0.000314,0.000377,0.000329,0.000143,0.000101,1.5e-05,0.00024,0.000123,0.000264,0.000119,2.8e-05,0.000213,0.00015,0.000129,0.000106,6.8e-05,0.000195,0.000141,5.4e-05,6.3e-05,0.00031,0.000139,0.000166,0.000339,0.000389,0.000273,8.8e-05,0.000159,4.7e-05,0.000162,0.00017
0.000562,0.000293,0.000247,0.000205,8.5e-05,0.000108,0.000146,8.6e-05,6.9e-05,7.8e-05,0.00025,0.000138,0.000117,0.000248,0.000199,0.000327,7.2e-05,0.000171,0.000188,0.000374,0.000314,0.000265,0.000259,0.000245,0.000254,0.000241,0.000235,0.000108,0.000211,0.000621,0.000305,0.000136,0.000367,0.000382,0.000127,0.000233,0.000101,0.000376,0.000241,0.000372,0.000438,6.2e-05,7.4e-05,0.000123,0.000219,4.7e-05,0.000134,0.000426,0.000265,0.000432,0.00019,0.00024,0.000266,0.000187,0.000406,0.000197,0.000169,0.000187,0.000383,5.6e-05,0.000191,0.000158,0.000176,0.000194,0.00063,0.000277,0.000424,0.000147,0.000385,0.000342,0.000246,0.000495,0.000184,0.000582,1.5e-05,8.2e-05,9.9e-05,0.000409,0.000548,7.8e-05,0.00023,0.000448,6.1e-05,0.000396,0.000156,0.000195,0.000306,0.000171,0.000591,0.000378,0.000222,0.000203,0.000246,0.000148,0.00015,0.000155,0.000473,5e-05,0.000622,0.000232,0.000116,0.00022,8.4e-05,0.000229,0.000109,0.000154,0.000107,0.00035,0.000145,0.000358,0.000414,8.1e-05,0.000257,0.000214,8.2e-05,2.9e-05,0.000166,9.9e-05,0.000322,2.9e-05,8.7e-05
0.000588,0.000722,0.000502,0.00026,0.000467,0.000128,0.000255,0.000188,0.000205,0.000359,0.000297,0.000429,0.00013,0.000321,0.000309,0.000317,0.000309,0.000274,0.000329,0.000489,0.000814,0.00055,9.3e-05,0.000528,0.000431,0.000245,0.000657,0.000507,0.000381,0.000883,0.000756,0.000419,0.000293,0.000257,0.000146,0.000336,0.000239,0.000789,0.000126,0.00057,0.000478,0.00074,0.000449,7.9e-05,0.000305,0.000167,0.000266,0.000298,0.000371,0.000285,0.000511,0.000308,0.000879,0.000317,0.000567,0.000691,0.000567,0.000208,0.000307,0.000507,0.000604,0.000456,0.000625,0.000685,0.001047,0.001099,0.000306,0.000609,0.000806,0.00029,0.000532,0.000188,0.000138,0.000796,0.000429,0.000275,0.000123,0.000258,0.000695,0.000619,0.000423,0.000975,0.000759,7.7e-05,0.000524,0.000225,0.000595,0.000458,0.000522,0.000354,0.000493,0.000641,0.000395,0.000463,0.000137,0.000227,0.000405,0.000742,0.000769,9e-05,0.000241,0.000183,0.000149,0.00026,5.6e-05,0.000141,0.000148,0.000293,0.000497,0.000427,0.000868,0.000803,0.000483,0.00052,0.00047,0.00018,6e-05,0.000313,0.000631,0.000502,0.000371
0.00061,0.000496,0.00064,0.000781,0.000987,0.000825,0.000433,0.000231,0.000388,0.000713,0.000536,0.000484,0.000688,0.000186,0.000676,0.000553,0.000569,0.000453,0.000334,0.000298,0.00099,0.001628,0.001258,0.000687,0.001153,0.001109,0.00089,0.001171,0.000332,0.001177,0.001725,0.001098,0.000971,0.000935,0.000584,0.000317,0.00026,0.001228,0.001411,0.001453,0.001377,0.001548,0.000696,0.000165,0.000307,0.000371,0.000575,0.000626,0.000904,0.000639,0.000609,0.000859,0.00131,0.001296,0.001149,0.000424,0.000546,0.000637,0.000204,0.000564,0.000853,0.000362,0.000449,0.000823,0.001051,0.001635,0.002102,0.001338,0.000257,0.000275,0.000622,0.000758,0.000324,0.00076,0.000855,0.000224,0.000376,0.000392,0.000671,0.000956,0.000522,0.000995,0.001198,0.000715,0.000278,0.000419,0.000795,0.000431,0.000547,0.00102,0.000617,0.000421,0.000597,0.00076,0.00098,0.000623,0.000702,0.001263,0.001703,0.001349,0.000779,0.000588,5.7e-05,0.000277,0.000245,0.000224,0.000271,0.000168,0.000297,0.000627,0.00054,0.000381,0.000396,9.7e-05,0.000305,0.000243,0.000259,0.00066,0.001018,0.000741,0.000431
5e-04,0.000505,0.000537,0.000739,0.000383,0.000639,0.000533,0.000356,0.00045,0.000292,0.000354,0.000619,0.000552,0.000562,0.00071,0.000129,0.000248,0.000244,0.000135,0.000339,0.000844,0.000903,0.00045,0.000605,0.000941,0.000263,0.000824,0.000796,0.000742,0.001248,0.000526,6.9e-05,0.000589,0.000106,0.000274,0.000125,0.000157,0.001001,0.000929,0.000749,0.000823,0.000119,0.000194,3.7e-05,0.000251,0.000621,4e-05,0.000137,0.000687,0.000928,0.000732,0.000755,0.000341,0.000314,0.000553,0.000272,0.000318,0.00073,0.000619,0.000488,0.00039,0.000718,0.000867,0.000166,0.001187,0.000972,0.000813,0.000528,0.000152,0.000318,0.000597,0.000414,0.00052,0.00065,0.000724,0.000754,0.000553,0.000672,0.000128,0.000429,0.000321,0.00035,0.000428,0.000337,0.000206,0.000212,0.000565,0.00056,0.000686,0.000766,0.000436,0.000352,0.00085,0.000523,0.000547,0.000656,0.000367,0.000665,0.000401,0.001051,0.000767,0.000429,0.000122,0.000283,0.000108,0.000343,2.1e-05,0.000256,0.000185,0.000292,0.000159,7.3e-05,0.000231,0.000227,0.000263,0.000115,0.000116,0.000462,0.000214,0.000155,0.000123
0.000309,0.000579,0.000358,0.000637,0.000539,0.000267,0.000375,0.000159,0.00011,0.000279,0.000167,0.000207,0.00032,0.000265,0.000319,0.000353,0.000101,0.000366,0.000269,0.000434,0.000298,0.000213,0.000296,0.000651,0.00019,0.000279,0.000483,0.000128,0.000256,0.000457,0.000292,2.9e-05,0.000417,0.00022,7.4e-05,0.000261,0.000329,0.000442,0.000211,0.00027,0.000247,0.000254,0.00018,0.000372,0.000361,0.00027,0.000295,0.000245,0.000466,0.000549,0.000482,0.000505,0.000231,0.000263,0.000401,0.000163,0.000265,0.000479,0.000207,0.000457,3e-04,0.000391,6.3e-05,0.000336,0.000532,0.000194,0.000447,0.000343,0.000269,0.000354,0.000247,0.000221,0.000171,2.4e-05,0.000457,0.00021,0.000187,0.000606,0.000796,0.000301,0.000239,0.000412,0.000193,0.000202,0.000195,0.000134,0.00019,0.000261,0.00021,0.000246,0.000103,0.000297,0.000264,0.00027,0.000226,0.000103,0.000379,0.000482,0.000367,0.000649,0.00017,0.000104,0.000249,0.000206,0.000329,0.00016,0.000194,0.000131,0.000171,9.2e-05,0.000139,0.000233,0.000222,9.2e-05,0.000305,0.00024,0.000155,0.000319,0.000307,0.00021,5.5e-05
0.000322,5.9e-05,0.000212,0.000221,9.3e-05,0.000341,0.000218,0.000147,7.5e-05,0.000307,0.000241,0.000168,2.3e-05,0.000226,0.000245,0.000223,6.5e-05,0.000228,0.00027,0.000164,0.000165,0.000168,7.3e-05,0.000421,0.000255,0.000303,0.000287,0.000195,0.000108,0.00016,0.000207,0.000112,0.000233,0.000289,0.000344,0.000189,0.000196,0.000346,0.000363,0.000164,0.000128,0.000256,0.000104,0.000254,0.000153,0.000203,0.000193,8.2e-05,0.000479,5.6e-05,0.000327,0.00038,0.000277,0.000345,0.000244,0.000167,0.00026,0.000184,0.000148,0.000102,0.000111,7.6e-05,0.000103,0.000144,0.000484,0.000392,0.000413,0.000246,0.000153,7.6e-05,6.2e-05,0.000275,0.000246,0.000303,0.000172,0.000414,8.7e-05,0.000269,0.000236,5.5e-05,0.000119,0.000402,0.000136,0.000192,0.000169,0.000174,6e-05,0.000195,0.000179,9.1e-05,9.3e-05,0.000228,0.000173,0.000177,0.000168,9e-05,0.000158,0.000204,8.3e-05,0.000235,0.000113,3e-05,0.000224,0.000319,7.3e-05,0.000136,9.4e-05,5.8e-05,7e-05,5.2e-05,0.000115,0.00013,3.3e-05,5.6e-05,0.000185,9.8e-05,7.6e-05,5e-05,0.000147,6.3e-05,0.000127
6.5e-05,0.000178,0.000227,1e-04,0.00014,0.000222,0.000113,7e-05,0.000129,0.000142,4.7e-05,9.5e-05,5.2e-05,0.000186,6.2e-05,0.000101,4.9e-05,4.4e-05,0.000115,0.000241,0.000237,0.000125,8.6e-05,9.1e-05,0.000265,0.000145,0.000133,0.000132,0.000139,0.000208,0.000102,3.8e-05,5.6e-05,0.000143,0.000215,0.000344,0.000119,0.000189,0.000228,1e-04,0.00014,0.000125,0.000125,0.000116,0.000128,7.3e-05,0.000118,0.000145,0.000276,0.000221,0.000226,0.000115,0.00018,0.000148,3.8e-05,0.000118,9.3e-05,0.00018,0.000123,0.000104,0.000111,7.8e-05,0.000232,8.8e-05,0.00035,7.5e-05,0.000383,6e-05,0.000161,0.000139,0.000125,0.000174,0.000138,0.000199,4.8e-05,0.000301,6e-05,9.3e-05,0.000223,0.000159,0.00017,0.000204,8e-05,0.000158,7.4e-05,0.000132,2.2e-05,0.00016,0.00019,0.000102,0.000149,0.000156,0.000169,0.000135,5.9e-05,6.2e-05,0.000179,7.3e-05,0.000223,0.000367,2.1e-05,6.7e-05,9e-05,3.4e-05,0.000132,0.000102,0.000115,0.000115,5.3e-05,6.2e-05,6.7e-05,4.4e-05,6.3e-05,6.8e-05,2.7e-05,3e-05,6.2e-05,0.000102,2.7e-05,0.000157,7.6e-05
4.1e-05,0.000184,0.000131,5.4e-05,7.4e-05,0.000161,7e-05,5.9e-05,0.000177,0.000161,5.9e-05,2.5e-05,5e-05,0.000123,0.000176,0.000123,4.1e-05,3.5e-05,5.9e-05,0.000205,0.000231,3.8e-05,0.000174,0.00012,0.000132,0.000134,0.000127,0.000112,4.8e-05,0.000164,0.000113,1.3e-05,9.1e-05,0.000224,8.1e-05,0.000213,0.000102,0.000177,0.000201,2.4e-05,0.000105,0.000104,6.9e-05,0.000141,4.7e-05,2.4e-05,0.000128,0.000122,0.000277,5.5e-05,0.000145,0.000254,0.000125,5.8e-05,8e-05,0.000133,7.4e-05,9.3e-05,0.000102,0.000172,3.9e-05,0.000101,0.000105,3.6e-05,0.000271,0.000277,0.000242,0.000148,5e-05,0.000158,9.5e-05,7.7e-05,0.000105,0.000188,0.000154,0.000232,1.2e-05,0.000101,0.000144,0.000162,5.1e-05,0.000103,6.4e-05,0.000168,7.1e-05,2.9e-05,5.9e-05,9e-05,0.000175,0.000153,0.000115,0.000152,0.000256,0.000121,0.000146,0.000135,0.000192,0.000124,0.00018,2e-04,6.1e-05,4.9e-05,3.9e-05,0.000103,5.4e-05,6.9e-05,0.000132,4.6e-05,2.7e-05,3.7e-05,5.9e-05,5.9e-05,5.4e-05,1.2e-05,1.1e-05,1.5e-05,4.6e-05,3.9e-05,4.7e-05,8.2e-05,4.7e-05
3.5e-05,9e-05,7.1e-05,2.5e-05,4.4e-05,6e-05,2.4e-05,1.2e-05,4.6e-05,7e-05,2.8e-05,5.8e-05,3.1e-05,5.6e-05,5.6e-05,5.5e-05,4e-06,1.4e-05,3.6e-05,7.5e-05,8.7e-05,3e-06,5.9e-05,6.2e-05,6.7e-05,7.4e-05,9.9e-05,8.1e-05,7.6e-05,5.5e-05,4.7e-05,6e-06,4.2e-05,0.00013,4.7e-05,5.6e-05,4.5e-05,5e-05,1e-04,3.5e-05,4.2e-05,6.4e-05,1.6e-05,6.1e-05,2.7e-05,3.5e-05,5.6e-05,1.4e-05,6.6e-05,6.4e-05,4.4e-05,7.1e-05,4.1e-05,2.6e-05,1.1e-05,3.6e-05,9e-06,8.1e-05,7.3e-05,6.5e-05,4.2e-05,4.5e-05,6.4e-05,2.8e-05,4.9e-05,5.9e-05,7.3e-05,7.2e-05,5.5e-05,5.9e-05,5.8e-05,5.6e-05,3.8e-05,4.5e-05,8.6e-05,0.000101,1.3e-05,2.7e-05,5.6e-05,3.8e-05,3e-05,6.6e-05,2.5e-05,9.6e-05,2.1e-05,4.2e-05,5.2e-05,8.7e-05,2.6e-05,5.9e-05,2.2e-05,5e-05,6.7e-05,4.9e-05,1.4e-05,2.1e-05,6.2e-05,1.3e-05,3e-05,9.8e-05,3.1e-05,4.7e-05,2.3e-05,3.6e-05,3.8e-05,3.6e-05,5.6e-05,3.6e-05,1.9e-05,4.3e-05,1.4e-05,4e-05,2.6e-05,8e-06,2.8e-05,2.7e-05,4.3e-05,5.7e-05,6e-06,3.7e-05,1.2e-05
1.1e-05,9.4e-05,4.4e-05,6.3e-05,1e-05,3.3e-05,3.8e-05,4.8e-05,1.9e-05,7.8e-05,3.2e-05,5.8e-05,5.1e-05,4.1e-05,6.6e-05,3e-05,3.3e-05,2.4e-05,5.8e-05,5.9e-05,7.9e-05,5.8e-05,8e-05,7.1e-05,3.4e-05,8e-05,6.9e-05,4.1e-05,1.1e-05,4.5e-05,4.2e-05,3.6e-05,7e-06,7.3e-05,6.7e-05,8e-05,2.4e-05,5.4e-05,9e-05,3.4e-05,4.1e-05,6.1e-05,5.7e-05,4.6e-05,3.8e-05,2.3e-05,4.1e-05,4.8e-05,8.1e-05,7.2e-05,3.4e-05,7.5e-05,2.6e-05,1.9e-05,2.5e-05,3.1e-05,2.5e-05,6.9e-05,6.4e-05,7.5e-05,2.6e-05,2.6e-05,3.5e-05,4.6e-05,3.5e-05,7.1e-05,6.1e-05,5.7e-05,5e-05,9.8e-05,9.3e-05,0.000102,1.6e-05,9.7e-05,7.5e-05,6.5e-05,2.1e-05,1.7e-05,4.1e-05,4.8e-05,2.4e-05,6.4e-05,3.7e-05,8.3e-05,4.4e-05,6.3e-05,1.8e-05,8.9e-05,3.1e-05,3e-05,1.3e-05,2e-05,7.5e-05,1.4e-05,3.5e-05,5.2e-05,6.6e-05,3.1e-05,4.8e-05,0.000124,4.3e-05,3.3e-05,7e-06,1.4e-05,2.2e-05,3e-05,3.9e-05,1.8e-05,1.6e-05,5e-05,4.1e-05,2.2e-05,9e-06,2.4e-05,3.4e-05,3.6e-05,5.1e-05,3.4e-05,4.3e-05,3.3e-05,4.4e-05
3.6e-05,6.4e-05,7.2e-05,3.5e-05,3.6e-05,7.1e-05,1.3e-05,5.1e-05,9.6e-05,0.000105,7.6e-05,5.2e-05,7.4e-05,2.9e-05,3.6e-05,2.9e-05,3.6e-05,1.9e-05,2.8e-05,6.2e-05,5.5e-05,6.6e-05,1.5e-05,7.4e-05,7.4e-05,7.9e-05,1.3e-05,2.9e-05,7e-05,8.3e-05,3.3e-05,4e-05,2.9e-05,8.6e-05,4e-06,0.000103,2.5e-05,3.9e-05,5e-05,4.8e-05,6.9e-05,8.5e-05,3e-05,2.9e-05,4.7e-05,5e-05,4.3e-05,6e-06,6.6e-05,5.6e-05,1.8e-05,3.7e-05,2.5e-05,4.7e-05,4.6e-05,3.9e-05,1.2e-05,4.9e-05,3.4e-05,5.8e-05,4.4e-05,4.3e-05,3.8e-05,1.5e-05,3.5e-05,6.1e-05,9e-05,5.5e-05,5.7e-05,1.8e-05,2.7e-05,6.5e-05,2.5e-05,6e-05,3.4e-05,8.6e-05,3e-05,3.7e-05,2.6e-05,3e-05,3.3e-05,4.5e-05,1.8e-05,2e-06,3.9e-05,3.5e-05,1.6e-05,4e-05,2.1e-05,3.3e-05,3.2e-05,2.6e-05,4.7e-05,1.3e-05,3.1e-05,7e-06,3.6e-05,2.9e-05,3.7e-05,8.7e-05,2.7e-05,4.6e-05,1.3e-05,2.5e-05,1e-05,2.4e-05,2.1e-05,2.4e-05,3.1e-05,5.2e-05,1.2e-05,2.3e-05,3e-06,1.5e-05,2.8e-05,1e-05,2.9e-05,3.8e-05,5.5e-05,7.6e-05,2.9e-05
5.7e-05,7.8e-05,3.3e-05,3.1e-05,3e-05,4.5e-05,3e-05,3.3e-05,3.1e-05,6.6e-05,5.7e-05,2.2e-05,3.8e-05,4e-05,3.5e-05,2.9e-05,2.6e-05,3e-05,3.1e-05,8.8e-05,7.3e-05,3.5e-05,5.5e-05,3.2e-05,4.6e-05,6.5e-05,5.3e-05,2.4e-05,5.8e-05,7.3e-05,1.7e-05,4e-05,3.8e-05,4.9e-05,5.7e-05,3.8e-05,3.4e-05,1e-05,8.1e-05,3.5e-05,2.3e-05,3e-05,2.1e-05,4.8e-05,4.6e-05,2.9e-05,2.1e-05,2.5e-05,4.5e-05,4.4e-05,2e-06,5.8e-05,3.8e-05,2.4e-05,1.5e-05,1.9e-05,3e-06,6.1e-05,6.5e-05,2.8e-05,1.7e-05,9e-06,2.7e-05,1e-05,4.5e-05,7e-05,8.2e-05,1.8e-05,3.1e-05,1.6e-05,1.9e-05,6.5e-05,3e-05,4.5e-05,5.4e-05,8.9e-05,2.8e-05,2.2e-05,2.9e-05,2.7e-05,2.5e-05,3.3e-05,4.3e-05,3.9e-05,3e-05,2.6e-05,2.9e-05,5.5e-05,3e-06,3.2e-05,7e-06,1.3e-05,5.9e-05,2.2e-05,9e-06,2.9e-05,6.1e-05,2.1e-05,5.2e-05,0.000108,1.4e-05,4.4e-05,2e-06,1.4e-05,1.3e-05,2.8e-05,3.7e-05,4.1e-05,1.1e-05,9e-06,2.2e-05,4.5e-05,2.1e-05,1e-05,3.9e-05,1.2e-05,2.7e-05,4e-05,2.5e-05,5.9e-05,2.6e-05
3.9e-05,5.5e-05,4e-05,5e-05,4e-06,5.4e-05,2.3e-05,3.4e-05,2.7e-05,5e-05,3.8e-05,1.3e-05,4e-06,8e-06,4.7e-05,4.2e-05,1.7e-05,1.1e-05,3.7e-05,8.3e-05,3.7e-05,3.2e-05,4.9e-05,4.4e-05,2e-05,5.8e-05,2.5e-05,1.8e-05,2.6e-05,6e-05,2.6e-05,1.9e-05,2.2e-05,6.1e-05,3.7e-05,5.3e-05,2.2e-05,3.1e-05,5.9e-05,2.6e-05,2.9e-05,4e-05,1.4e-05,3e-05,4.9e-05,1.9e-05,1.7e-05,2.3e-05,6.8e-05,6.5e-05,1.5e-05,6.3e-05,1.4e-05,3e-05,3.4e-05,3.5e-05,9e-06,4.9e-05,3.4e-05,4.4e-05,1.8e-05,2.5e-05,2.9e-05,1.6e-05,4e-05,2.7e-05,7.5e-05,5.2e-05,3.3e-05,2e-05,9e-06,6.2e-05,3e-05,1.2e-05,3e-05,6.4e-05,2.3e-05,7e-06,5e-06,1e-05,2.7e-05,1.4e-05,2.3e-05,4.3e-05,1.1e-05,1.2e-05,3e-05,4.6e-05,2.1e-05,1.2e-05,1.4e-05,2.7e-05,7e-05,1.7e-05,4e-06,4e-05,4.4e-05,2.8e-05,1.7e-05,9.1e-05,3e-06,3e-05,1.4e-05,9e-06,3e-06,3.3e-05,3.3e-05,2.5e-05,1e-05,1.3e-05,8e-06,1.4e-05,7e-06,6e-06,2.2e-05,1.4e-05,2.3e-05,3.9e-05,2.8e-05,4.5e-05,1.5e-05
2.7e-05,5.8e-05,4.8e-05,4.1e-05,1e-05,3e-05,2.2e-05,2.2e-05,2.1e-05,5.3e-05,1.7e-05,1.3e-05,1.6e-05,2.5e-05,4.2e-05,3.2e-05,2.4e-05,1.9e-05,3.6e-05,7.4e-05,4.2e-05,2.2e-05,4.8e-05,3.6e-05,4.1e-05,3.6e-05,4.1e-05,4e-06,2.9e-05,4e-05,2.5e-05,9e-06,2e-05,8.2e-05,3.2e-05,6.4e-05,2.3e-05,3.8e-05,4.9e-05,1.6e-05,2.2e-05,4.5e-05,1.2e-05,4.3e-05,3.7e-05,1.7e-05,4e-06,1.7e-05,7.1e-05,3.8e-05,1e-06,5.6e-05,1.6e-05,3.1e-05,3.2e-05,2.2e-05,1.4e-05,2.9e-05,4.2e-05,4.1e-05,2.2e-05,1.4e-05,4.6e-05,1.6e-05,3.7e-05,4.2e-05,4.7e-05,3.7e-05,3.2e-05,3.8e-05,1.1e-05,3.6e-05,1.3e-05,2e-05,2e-05,5e-05,2.3e-05,8e-06,1.9e-05,3.1e-05,1.5e-05,6e-06,4.2e-05,6.3e-05,1.3e-05,1.1e-05,2.1e-05,4.9e-05,2.8e-05,8e-06,1.8e-05,1.5e-05,4e-05,1e-06,1.4e-05,2.5e-05,5.7e-05,3.2e-05,1.8e-05,9.4e-05,8e-06,4.1e-05,1.5e-05,2.1e-05,9e-06,2.7e-05,1.4e-05,3.1e-05,1.2e-05,1e-05,5e-06,1e-05,2e-06,4e-06,1.6e-05,1.5e-05,5e-06,2.7e-05,1.4e-05,4.1e-05,1.7e-05
2.6e-05,3.6e-05,4.8e-05,3.3e-05,8e-06,4.2e-05,2.5e-05,1.6e-05,2.8e-05,5.5e-05,1e-05,5e-06,1.5e-05,1.1e-05,3.8e-05,2.5e-05,2.4e-05,1.2e-05,3.7e-05,4.9e-05,3.1e-05,4.2e-05,5.1e-05,3.3e-05,4.2e-05,3.8e-05,4.5e-05,1.2e-05,1.5e-05,4.1e-05,2.4e-05,1.1e-05,1.1e-05,7.5e-05,3.9e-05,4.7e-05,2.7e-05,1.9e-05,5.4e-05,5e-06,2.3e-05,5.4e-05,1.6e-05,4.2e-05,3.2e-05,2.2e-05,8e-06,2.1e-05,5.3e-05,4.1e-05,1.2e-05,4.3e-05,1.3e-05,2.5e-05,4e-05,4.1e-05,2e-05,2.8e-05,1.7e-05,1.5e-05,1.6e-05,1.9e-05,2.8e-05,6e-06,2.6e-05,4e-05,6e-05,1.7e-05,4.1e-05,4.1e-05,1e-05,4.4e-05,2.2e-05,4.5e-05,4.2e-05,7.2e-05,1.2e-05,6e-06,1.1e-05,3.6e-05,2.8e-05,1e-05,2.8e-05,6.3e-05,9e-06,1.9e-05,1.8e-05,4.6e-05,1.7e-05,1.6e-05,1.1e-05,2.5e-05,4.7e-05,4e-06,1e-05,1.7e-05,6.6e-05,2.4e-05,1.4e-05,0.000101,2e-05,2.2e-05,9e-06,1.5e-05,7e-06,2.7e-05,1.5e-05,2.2e-05,1e-05,1.8e-05,8e-06,1.8e-05,3e-06,9e-06,2.3e-05,8e-06,1.6e-05,3e-05,1.9e-05,4.7e-05,1.7e-05
1.7e-05,5e-05,3.4e-05,4.9e-05,8e-06,5e-05,2e-05,9e-06,3.2e-05,5.9e-05,3.1e-05,1.8e-05,2.1e-05,1.8e-05,5.2e-05,3.6e-05,2.4e-05,3e-05,3.6e-05,6.8e-05,1.9e-05,2.4e-05,3.8e-05,3.7e-05,4.2e-05,4.2e-05,4.4e-05,2.8e-05,2.4e-05,1.7e-05,1.5e-05,1.2e-05,2.6e-05,7.8e-05,6e-05,4.5e-05,2.7e-05,3.7e-05,4.1e-05,9e-06,1.4e-05,4.5e-05,5e-06,3.5e-05,4.5e-05,2.2e-05,1.2e-05,2.8e-05,5.5e-05,3.5e-05,2.3e-05,5.1e-05,1.5e-05,1e-05,3.1e-05,5.1e-05,3.2e-05,2.9e-05,2.7e-05,4.6e-05,9e-06,1.7e-05,3.2e-05,2.1e-05,4e-05,3.9e-05,4.7e-05,2.2e-05,4.1e-05,5.9e-05,9e-06,7.5e-05,4.2e-05,4.5e-05,1.8e-05,6.4e-05,3.6e-05,1.3e-05,7e-06,3e-05,2.4e-05,2e-05,4.4e-05,7.2e-05,2e-05,1.4e-05,1e-05,2.9e-05,3.2e-05,3.2e-05,3.6e-05,2.8e-05,3.5e-05,1.1e-05,1e-06,1.9e-05,5.6e-05,2.7e-05,2.1e-05,9e-05,2.3e-05,3.3e-05,6e-06,7e-06,7e-06,1.4e-05,1.5e-05,3.6e-05,1.7e-05,2.5e-05,2.6e-05,5e-06,6e-06,1.6e-05,1.7e-05,1.5e-05,2.1e-05,2.8e-05,9e-06,2.1e-05,2.4e-05
2.6e-05,5.4e-05,2.9e-05,3.7e-05,3.7e-05,2.7e-05,1.1e-05,8e-06,4.2e-05,3.7e-05,1.4e-05,1.1e-05,3.8e-05,2.4e-05,3.7e-05,1.8e-05,4e-05,1.8e-05,5.5e-05,8.6e-05,3.1e-05,2.9e-05,3.5e-05,4.9e-05,4e-05,5.4e-05,7.2e-05,3.9e-05,7.2e-05,5.1e-05,9e-06,2e-06,2.2e-05,8.3e-05,2.9e-05,7e-05,3.3e-05,1.9e-05,4.2e-05,2e-05,2.1e-05,6.3e-05,3.2e-05,5.1e-05,4.4e-05,5e-06,1.4e-05,3.6e-05,6.9e-05,7.3e-05,2.6e-05,7.4e-05,4e-05,2.4e-05,4.5e-05,1.7e-05,3.7e-05,6.6e-05,6.8e-05,1.5e-05,2.8e-05,9e-06,6.1e-05,2.5e-05,5.7e-05,6e-05,4.4e-05,1.5e-05,2e-05,4.5e-05,3.6e-05,7.8e-05,2.2e-05,3.7e-05,4.6e-05,8.6e-05,3.5e-05,2.1e-05,1e-05,4e-05,4.2e-05,9e-06,1.8e-05,4.8e-05,1e-05,3.2e-05,3e-05,4.7e-05,4.6e-05,1.1e-05,2.4e-05,1.9e-05,5.6e-05,6e-06,2.1e-05,4.6e-05,5.9e-05,9e-06,1.9e-05,6.3e-05,1.1e-05,4.3e-05,2.1e-05,1.3e-05,1.6e-05,2.6e-05,1.8e-05,3.6e-05,1.3e-05,1.7e-05,1.3e-05,2e-05,6e-06,2.4e-05,3.1e-05,2.7e-05,7e-06,3.1e-05,1.9e-05,4.2e-05,1e-05
2.2e-05,3.6e-05,2.8e-05,2.7e-05,2.1e-05,5.3e-05,2.7e-05,6e-06,4.1e-05,3.9e-05,3e-05,3e-06,2.7e-05,1.6e-05,2.5e-05,2.9e-05,2.7e-05,3.6e-05,7e-05,4.4e-05,3.5e-05,3.5e-05,2.4e-05,3.1e-05,5.2e-05,2.7e-05,4.5e-05,1.6e-05,4.4e-05,2.6e-05,8e-06,2.4e-05,2.2e-05,6.3e-05,3.7e-05,5.3e-05,1.7e-05,2.8e-05,4.3e-05,3.2e-05,1.5e-05,3.8e-05,3.9e-05,7.3e-05,5.3e-05,5.5e-05,3.5e-05,1.5e-05,4.7e-05,4.8e-05,2.7e-05,3.3e-05,1.9e-05,1.7e-05,3.7e-05,2.2e-05,3.9e-05,5.9e-05,6.6e-05,2.9e-05,7e-06,1.8e-05,4.1e-05,2e-05,4e-05,1.7e-05,5.1e-05,1e-05,2.5e-05,3.3e-05,2.7e-05,2.9e-05,4e-05,1.6e-05,1.1e-05,8.5e-05,3e-05,1.5e-05,2.4e-05,1.5e-05,1.5e-05,2.4e-05,2.5e-05,5.3e-05,9e-06,2.3e-05,1.1e-05,6.3e-05,1.7e-05,2.6e-05,1.7e-05,3.2e-05,6.4e-05,3e-05,3e-05,4.3e-05,3.3e-05,3.1e-05,2.4e-05,7.9e-05,1.5e-05,1.7e-05,1e-06,3.5e-05,1e-05,3.6e-05,1e-05,3e-05,1.5e-05,1.6e-05,1.7e-05,1.2e-05,2.1e-05,2.4e-05,1.5e-05,2.7e-05,2.5e-05,2.2e-05,9e-06,3.9e-05,1.4e-05
2.5e-05,4.6e-05,4e-05,3.4e-05,1.9e-05,3.7e-05,3e-05,2e-05,4.3e-05,3.2e-05,1.5e-05,2.6e-05,3.2e-05,1.7e-05,1.8e-05,8e-06,1e-05,3.6e-05,2.2e-05,3.8e-05,2.3e-05,3.5e-05,3.8e-05,4.5e-05,7.7e-05,4.2e-05,3e-05,1.5e-05,2.6e-05,2.7e-05,3e-05,2.9e-05,1.2e-05,7.2e-05,3.5e-05,4.2e-05,1.8e-05,3.4e-05,3.8e-05,2.4e-05,4.5e-05,4.5e-05,1e-05,2.5e-05,1.6e-05,1.8e-05,1.6e-05,4.6e-05,2.6e-05,5.5e-05,1.2e-05,1.9e-05,1.1e-05,2.4e-05,3.9e-05,4e-05,2.7e-05,4.3e-05,5.3e-05,1.9e-05,8e-06,2.1e-05,4.4e-05,3.9e-05,5.3e-05,6.6e-05,6.6e-05,3e-05,4.3e-05,3.5e-05,1.1e-05,2.1e-05,1.1e-05,2.4e-05,3.8e-05,5.5e-05,4.8e-05,2.2e-05,4.1e-05,4.4e-05,3.8e-05,3.4e-05,4.4e-05,4.9e-05,2.1e-05,4.9e-05,3.1e-05,4e-05,3.4e-05,3.5e-05,1e-05,2.2e-05,4.5e-05,3.7e-05,7e-06,3.8e-05,4.7e-05,3.7e-05,4.7e-05,4.6e-05,1.7e-05,2.8e-05,1.6e-05,3.3e-05,1.6e-05,1.5e-05,2e-05,2.7e-05,2.6e-05,5e-06,1.9e-05,1.6e-05,8e-06,1.3e-05,8e-06,4.6e-05,1.9e-05,1.1e-05,7e-06,2.2e-05,3.7e-05
2.7e-05,5.3e-05,3.5e-05,1.2e-05,1.5e-05,4.5e-05,1.9e-05,4e-06,4e-05,7.8e-05,1.1e-05,3e-05,3.9e-05,3.2e-05,6e-06,4.4e-05,3.3e-05,1.4e-05,5.7e-05,4.5e-05,2.9e-05,3.3e-05,4.6e-05,4.3e-05,5.1e-05,2.6e-05,3.8e-05,1e-05,4.1e-05,1.6e-05,4.2e-05,3.2e-05,1e-05,6.5e-05,7e-06,4.9e-05,2.6e-05,3.1e-05,3.5e-05,2e-05,8e-06,1.5e-05,4.6e-05,6.5e-05,4.4e-05,1.5e-05,1.7e-05,5.1e-05,5.6e-05,6.5e-05,3.5e-05,1.6e-05,2.3e-05,4.1e-05,2.5e-05,3.1e-05,2e-05,9e-05,0.000122,7.1e-05,2.3e-05,9e-06,6.8e-05,6.4e-05,2.3e-05,7.7e-05,6.9e-05,4.2e-05,5.6e-05,4.9e-05,6.5e-05,2.4e-05,4.2e-05,1.2e-05,1.9e-05,5.8e-05,6.7e-05,5.4e-05,5.4e-05,4.1e-05,3.2e-05,2.4e-05,2.1e-05,4.8e-05,7e-06,5.2e-05,2.3e-05,4.9e-05,3.9e-05,3.5e-05,3.7e-05,3.7e-05,1.9e-05,9e-06,2e-05,2.9e-05,1.9e-05,4e-05,2e-05,6.3e-05,2.2e-05,2.4e-05,1e-05,1e-05,4.8e-05,4.4e-05,2e-05,2.6e-05,2.4e-05,2.4e-05,2.4e-05,1.8e-05,5e-06,2.2e-05,1.8e-05,3.8e-05,3.8e-05,3.2e-05,2.5e-05,5e-05,8e-06
3.7e-05,5.6e-05,4.2e-05,3.3e-05,3.8e-05,5e-05,1.9e-05,1.4e-05,3.7e-05,5.1e-05,5.7e-05,3.9e-05,7.2e-05,5.5e-05,8.7e-05,3.8e-05,4.2e-05,5.9e-05,5.8e-05,0.000104,3.5e-05,4.4e-05,3e-05,4e-05,4.2e-05,7e-05,7.2e-05,5.2e-05,6.2e-05,6.2e-05,2.8e-05,2.8e-05,4.5e-05,9.2e-05,5.1e-05,8.6e-05,1.8e-05,3.3e-05,4.4e-05,1.7e-05,2.1e-05,6e-06,4e-05,4.5e-05,2.9e-05,6.1e-05,5.5e-05,3.2e-05,4.4e-05,3.9e-05,1.7e-05,5.2e-05,1.6e-05,2.5e-05,4.1e-05,2.6e-05,5.6e-05,4.8e-05,6.1e-05,2.7e-05,2.9e-05,1.1e-05,6.7e-05,5.5e-05,4.5e-05,4.8e-05,2.7e-05,5.3e-05,5.6e-05,3.2e-05,1e-05,5.8e-05,1.2e-05,2.2e-05,3.9e-05,9.6e-05,3.2e-05,1.6e-05,1.2e-05,5.1e-05,1.4e-05,3.1e-05,2.3e-05,3.5e-05,3e-06,4.5e-05,3.4e-05,4e-05,1.3e-05,2.4e-05,4e-06,1.6e-05,3.1e-05,1e-05,1.3e-05,1.9e-05,5.9e-05,1.9e-05,3.1e-05,3.9e-05,1.5e-05,2.4e-05,1e-06,1e-05,3.5e-05,3.1e-05,2e-05,2.5e-05,1.7e-05,2.5e-05,2.2e-05,1.8e-05,2e-05,1.6e-05,6e-06,1e-05,1.8e-05,6e-06,4e-05,2.6e-05,1.8e-05
1.2e-05,2.8e-05,1.5e-05,5.3e-05,2.1e-05,1e-05,3.2e-05,9e-06,2.6e-05,1.8e-05,1.2e-05,2e-06,3.8e-05,1.8e-05,7.2e-05,2.5e-05,4.5e-05,2.3e-05,8e-06,5.4e-05,4.3e-05,1.4e-05,4.1e-05,3e-05,2e-05,3.4e-05,5.3e-05,3.6e-05,3.5e-05,5.6e-05,1.9e-05,8e-06,4.3e-05,4.9e-05,3.3e-05,4.5e-05,5e-06,1e-05,2.8e-05,1.7e-05,1.8e-05,1.1e-05,1.5e-05,2.9e-05,1.5e-05,3.6e-05,1e-06,2.1e-05,3.4e-05,2.5e-05,2.2e-05,4e-05,1.3e-05,1.5e-05,2.1e-05,1.9e-05,1.7e-05,5.2e-05,5.8e-05,6e-06,1e-05,7e-06,2.9e-05,1.2e-05,2e-05,4e-05,1.4e-05,1.2e-05,3.9e-05,2.8e-05,2.3e-05,3.7e-05,1.1e-05,2.8e-05,1.2e-05,9.8e-05,1.8e-05,1.2e-05,2.6e-05,4.2e-05,7e-06,1.8e-05,1.7e-05,2.2e-05,1.8e-05,3.4e-05,2.7e-05,4.1e-05,2.2e-05,1.9e-05,1.5e-05,2.3e-05,2.1e-05,3e-06,6e-06,1.9e-05,4.8e-05,7e-06,8e-06,5.7e-05,1.3e-05,3e-05,5e-06,4e-06,1.4e-05,2.7e-05,2.4e-05,2.2e-05,1.9e-05,8e-06,1.4e-05,1.9e-05,7e-06,9e-06,1.4e-05,6e-06,1.4e-05,1.6e-05,3.6e-05,4.2e-05,2.3e-05
2.6e-05,1.9e-05,4.6e-05,5.9e-05,3e-05,2.9e-05,1.9e-05,8e-06,2.3e-05,2.7e-05,1.4e-05,6e-06,2.2e-05,3.1e-05,6.1e-05,4e-06,3.9e-05,2.5e-05,1.9e-05,7e-05,3.5e-05,9e-06,3.4e-05,4.3e-05,2.3e-05,4e-05,2.8e-05,6e-06,2.4e-05,2.9e-05,1.3e-05,1.9e-05,1.1e-05,6e-05,2.7e-05,3.5e-05,2.5e-05,1.8e-05,6.1e-05,2.6e-05,1.8e-05,3.2e-05,1.3e-05,3.4e-05,1.5e-05,1.8e-05,9e-06,1.6e-05,2.2e-05,4.2e-05,1.2e-05,1.5e-05,1.7e-05,1.7e-05,3e-05,1.7e-05,2.3e-05,3.4e-05,5.2e-05,3.6e-05,8e-06,6e-06,1e-05,2.1e-05,3.8e-05,1.3e-05,2.3e-05,4e-05,2.9e-05,2.4e-05,1.9e-05,3.3e-05,1.2e-05,3.3e-05,2.1e-05,6.6e-05,9e-06,9e-06,3.9e-05,1.8e-05,5e-06,3e-05,2.3e-05,3e-05,1.3e-05,2.6e-05,1.4e-05,3e-05,7e-06,1.1e-05,6e-06,1.7e-05,2.9e-05,8e-06,1.2e-05,1.9e-05,4.8e-05,7e-06,1.2e-05,6.6e-05,1.5e-05,4.3e-05,1.3e-05,5e-06,1.4e-05,2.4e-05,2.5e-05,2.4e-05,1.6e-05,1.7e-05,6e-06,2.3e-05,1.6e-05,6e-06,1.7e-05,6e-06,1.2e-05,1.3e-05,2.1e-05,2.9e-05,1.3e-05
3.3e-05,4.8e-05,3.5e-05,4.6e-05,2.8e-05,3.2e-05,3.9e-05,1.8e-05,1.7e-05,4.3e-05,2.1e-05,5e-06,5e-06,5e-06,4.3e-05,1.6e-05,3.6e-05,3.6e-05,3e-05,4.8e-05,3.6e-05,1e-05,2.9e-05,2.1e-05,3.4e-05,4.1e-05,1.9e-05,2e-05,2.1e-05,2.5e-05,5e-06,9e-06,2.4e-05,6.4e-05,4.4e-05,3.6e-05,1.3e-05,2.4e-05,5.7e-05,7e-06,1.3e-05,1.9e-05,1.3e-05,2.2e-05,1.3e-05,1.1e-05,2.7e-05,1.8e-05,4.7e-05,3.8e-05,1.3e-05,3.1e-05,8e-06,1.7e-05,2.4e-05,1.9e-05,2.5e-05,3.3e-05,3.6e-05,2.8e-05,6e-06,8e-06,1.7e-05,9e-06,2.7e-05,4.2e-05,3.4e-05,1e-05,4.8e-05,1.9e-05,1.2e-05,4.1e-05,1.5e-05,5e-06,3e-05,7.2e-05,6e-06,1e-05,2.1e-05,1.6e-05,1.7e-05,2.8e-05,1.9e-05,5.5e-05,2.3e-05,2.9e-05,1.9e-05,3.9e-05,5e-06,1.1e-05,7e-06,7e-06,2.5e-05,1.1e-05,1.1e-05,1e-05,4.8e-05,1.6e-05,2.1e-05,6.5e-05,1.6e-05,1.8e-05,1.6e-05,1.1e-05,7e-06,3.3e-05,1.6e-05,1.7e-05,4e-06,7e-06,9e-06,1e-05,1e-05,1.3e-05,2.2e-05,1.4e-05,1.6e-05,1.6e-05,1.1e-05,3.3e-05,2.2e-05
4e-06,2.1e-05,2.6e-05,3.2e-05,6e-06,2.9e-05,1.4e-05,7e-06,1.9e-05,2.8e-05,1.7e-05,7e-06,2.1e-05,1.6e-05,3.7e-05,1.1e-05,2.8e-05,1.1e-05,2e-05,5e-05,1.9e-05,1.5e-05,1.7e-05,2.4e-05,2.3e-05,3.4e-05,9e-06,1.1e-05,2.4e-05,3.5e-05,2e-06,2e-06,3.5e-05,4.1e-05,3.1e-05,5.3e-05,9e-06,2.3e-05,4.5e-05,1.2e-05,8e-06,1.4e-05,1.3e-05,2.3e-05,1e-05,2.3e-05,1.2e-05,8e-06,4.6e-05,3.1e-05,2e-05,1.9e-05,2e-06,5e-06,1.7e-05,1.8e-05,2.7e-05,3.2e-05,5.9e-05,2e-05,1.8e-05,6e-06,1.7e-05,5e-06,2.7e-05,5.3e-05,4.7e-05,2.1e-05,2.5e-05,2.2e-05,1.5e-05,3.8e-05,2e-05,2.2e-05,1.5e-05,6.9e-05,1.4e-05,9e-06,2.1e-05,2.6e-05,6e-06,1.6e-05,2.7e-05,5e-05,1.5e-05,1.5e-05,1.2e-05,3.5e-05,6e-06,7e-06,6e-06,4e-06,2.5e-05,7e-06,3e-06,1.5e-05,2.7e-05,6e-06,9e-06,6.4e-05,1.1e-05,2.8e-05,1.2e-05,1.6e-05,1.2e-05,2.9e-05,1.3e-05,2.5e-05,5e-06,5e-06,9e-06,9e-06,1.3e-05,1.1e-05,1.7e-05,4e-06,4e-06,5e-06,2.1e-05,4.7e-05,1.5e-05
9e-06,3.2e-05,3.7e-05,4.2e-05,1.2e-05,4.2e-05,1.2e-05,5e-06,4e-06,3.9e-05,1e-05,1e-06,2.5e-05,5e-06,3.2e-05,1.9e-05,1e-05,4e-06,2.5e-05,5.3e-05,2.5e-05,2e-05,3.3e-05,2.3e-05,2.6e-05,3.8e-05,8e-06,6e-06,2.7e-05,2e-05,7e-06,1e-06,3.1e-05,5.5e-05,2.7e-05,5.4e-05,7e-06,2e-05,3.9e-05,1e-05,8e-06,1.9e-05,6e-06,3e-05,1.4e-05,2.2e-05,1e-05,1.6e-05,3.8e-05,3.9e-05,7e-06,2.2e-05,6e-06,1.4e-05,2.8e-05,1.3e-05,1.9e-05,1.4e-05,4.6e-05,3.4e-05,1e-05,3e-06,2.1e-05,6e-06,2.2e-05,4.4e-05,2.7e-05,9e-06,2.8e-05,2.6e-05,7e-06,3.8e-05,2e-05,2.4e-05,2.3e-05,6.1e-05,4e-06,1.1e-05,1.8e-05,3e-05,1.3e-05,1.1e-05,2.2e-05,4e-05,5e-06,1.8e-05,1.8e-05,3e-05,4e-06,2e-06,4e-06,9e-06,2.1e-05,4e-06,7e-06,9e-06,4.5e-05,4e-06,6e-06,5.7e-05,1e-06,2.4e-05,1e-05,1.5e-05,7e-06,2.7e-05,1.7e-05,2.2e-05,9e-06,8e-06,7e-06,6e-06,9e-06,5e-06,1.6e-05,3e-06,6e-06,1.2e-05,2.2e-05,3.5e-05,1.4e-05
9e-06,3.2e-05,3.9e-05,3e-05,1.1e-05,3.2e-05,1.3e-05,8e-06,7e-06,3e-05,1e-05,2e-06,2.3e-05,5e-06,3.7e-05,1.3e-05,1.7e-05,7e-06,2.2e-05,4.9e-05,2.7e-05,2.2e-05,2.3e-05,2e-05,2.5e-05,3.4e-05,1.2e-05,6e-06,2.5e-05,2.9e-05,8e-06,3e-06,1.8e-05,5e-05,2.7e-05,4.8e-05,6e-06,2e-05,4.1e-05,8e-06,6e-06,2e-05,1e-05,2.7e-05,1.8e-05,2.2e-05,6e-06,1.5e-05,3.6e-05,3.5e-05,5e-06,2.3e-05,1e-06,1e-05,2.7e-05,1.3e-05,1.5e-05,1.7e-05,5.1e-05,2.3e-05,7e-06,3e-06,2.6e-05,5e-06,2.1e-05,4.1e-05,2.9e-05,1e-05,3.4e-05,2.6e-05,1e-05,3.5e-05,1.5e-05,2.3e-05,2.4e-05,5.6e-05,1.1e-05,1e-05,1.9e-05,2.5e-05,1.1e-05,1.1e-05,1.2e-05,3.5e-05,8e-06,1.2e-05,1.5e-05,3.6e-05,8e-06,1e-06,2e-06,7e-06,2.5e-05,4e-06,4e-06,6e-06,4.2e-05,7e-06,7e-06,6.3e-05,9e-06,2e-05,1.5e-05,1.5e-05,1e-05,2.5e-05,1.5e-05,2.1e-05,1e-05,5e-06,1e-05,1e-05,1e-05,1.1e-05,1.7e-05,1e-06,4e-06,1.3e-05,1.9e-05,3.4e-05,1.4e-05
8e-06,3.2e-05,3.6e-05,2.8e-05,1.1e-05,3.6e-05,1e-05,9e-06,1e-05,3.1e-05,1.4e-05,3e-06,2.3e-05,2e-06,3.9e-05,1.1e-05,1.6e-05,4e-06,2.4e-05,4.9e-05,2.5e-05,1.5e-05,2.7e-05,2.1e-05,2.8e-05,3.7e-05,1.2e-05,3e-06,2.5e-05,2.9e-05,5e-06,2e-06,1.9e-05,4.8e-05,2.6e-05,4.9e-05,1e-05,2.3e-05,4.4e-05,1.1e-05,7e-06,1.7e-05,1.2e-05,2.8e-05,1.6e-05,2e-05,3e-06,1.8e-05,3.2e-05,4e-05,6e-06,2.3e-05,3e-06,1e-05,2.7e-05,1e-05,1.4e-05,2.3e-05,4.1e-05,2.8e-05,9e-06,1e-06,2.5e-05,2e-06,2e-05,4.1e-05,2.7e-05,1.3e-05,3.4e-05,2.2e-05,0,3.8e-05,1.7e-05,2.5e-05,2.8e-05,5.7e-05,7e-06,1e-05,1.9e-05,2.9e-05,6e-06,1e-05,1.5e-05,3.9e-05,7e-06,1.3e-05,1.4e-05,3.3e-05,3e-06,2e-06,3e-06,7e-06,2.5e-05,5e-06,3e-06,8e-06,4.1e-05,8e-06,8e-06,6e-05,5e-06,2.8e-05,1e-05,1.2e-05,6e-06,2.5e-05,1.3e-05,2.2e-05,9e-06,5e-06,7e-06,1e-05,7e-06,6e-06,1.6e-05,2e-06,7e-06,1.1e-05,1.8e-05,3.4e-05,1.3e-05
