9.4e-05,8.3e-05,7.8e-05,9e-05,5.7e-05,7.4e-05,5.4e-05,0.000136,8.7e-05,3.4e-05,0.000101,0.000101,0.000138,0.000209,0.000151,8.7e-05,7.7e-05,0.000161,8.6e-05,0.000102,0.000149,9e-05,0.000101,0.000103,9.3e-05,0.000172,0.000119,0.000111,0.000142,6.7e-05,0.000108,0.000131,9.4e-05,0.000203,0.00013,0.000185,0.000192,9.4e-05,0.000132,0.000116,7e-05,9.1e-05,9.3e-05,2.9e-05,0.00018,0.000145,0.000129,0.000153,0.000168,0.000154,0.000129,0.000107,9.2e-05,0.000125,0.000149,0.000134,0.000104,0.000102,0.000233,0.000144,5.5e-05,0.000107,0.000163,0.000181,6.8e-05,6.1e-05,0.000168,0.000166,0.000139,9.8e-05,7.4e-05,7.5e-05,0.000208,0.000127,0.000179,0.000112,7.8e-05,0.000189,0.000109,0.000106,2e-04,0.000201,0.000211,0.000117,0.000164,0.000122,0.000115,0.000171,0.000193,9.7e-05,0.000231,0.000119,0.000144,0.000157,0.000152,0.000117,0.000102,0.000222,0.000141,6.7e-05,0.000109,0.000132,7.2e-05,0.000162,0.000122,0.000261,1e-04,9.4e-05,9.8e-05,5.2e-05,7.9e-05,0.000228,0.000116,0.000225,0.000154,8.3e-05,0.000111,0.000131,0.000123,0.000124,7.3e-05
-2.9e-05,-7.7e-05,-9.5e-05,-9.8e-05,-8.7e-05,-8.7e-05,-7.9e-05,-9.5e-05,-6.1e-05,-6e-05,-2.4e-05,-5.6e-05,-6e-05,1e-05,5e-06,8e-06,-7.5e-05,-5.6e-05,-5.5e-05,-4e-06,-1e-06,-7e-05,-2.7e-05,-3.4e-05,-7.5e-05,-3.2e-05,-6.9e-05,-4.7e-05,2.9e-05,-1.2e-05,-2e-06,-1.2e-05,-7.2e-05,8e-06,-9e-06,-4.7e-05,-3.1e-05,-8.6e-05,-8.9e-05,-3.3e-05,2.1e-05,-1.4e-05,-1.4e-05,-4.4e-05,7.9e-05,-2.2e-05,-4.5e-05,3.5e-05,3.8e-05,1.2e-05,-3.2e-05,-2.4e-05,-2e-05,-8.6e-05,-4.3e-05,-1.4e-05,2.1e-05,3e-05,5e-05,7e-06,-1.8e-05,2e-06,-4.5e-05,-5.2e-05,-2.3e-05,-1.4e-05,-5.7e-05,-5e-06,-5e-05,-3.9e-05,-4.5e-05,9e-06,-3e-06,-1.8e-05,0.000103,2e-06,-9.3e-05,-2.9e-05,-1.9e-05,-4.6e-05,-3.6e-05,-7.8e-05,6.2e-05,-2.5e-05,-8.8e-05,-4e-05,-4e-05,6.6e-05,1.7e-05,8e-06,4.6e-05,-6.4e-05,-2.9e-05,-2.8e-05,-3.6e-05,-2.6e-05,-1e-05,9.2e-05,4.5e-05,-1.1e-05,-3e-05,-1.9e-05,1.2e-05,4e-05,-1.4e-05,3.6e-05,-3.3e-05,-6.8e-05,-4.6e-05,-5.7e-05,-6.8e-05,-8e-06,-6e-05,-4.1e-05,-4.2e-05,-5.7e-05,4.8e-05,-4.5e-05,-6e-06,-7.3e-05,-5.6e-05
-6.1e-05,-7.9e-05,-4.4e-05,-9.4e-05,-5.5e-05,-2.3e-05,-3.9e-05,-6.9e-05,-8e-05,-6.2e-05,-7e-05,-9e-05,-0.000142,-2.3e-05,-6.7e-05,-3.4e-05,-5.5e-05,-6.6e-05,-5.8e-05,-5e-05,-3e-06,-3.9e-05,-1.5e-05,1e-05,-3.2e-05,-8e-05,-0.000113,-1e-04,-3.3e-05,-1.6e-05,-5.9e-05,-2.7e-05,-6e-06,-3.5e-05,-3.8e-05,-3.8e-05,-5.6e-05,-3.2e-05,-1.9e-05,-1.5e-05,-6e-06,-2.3e-05,-5.8e-05,-2.8e-05,5.2e-05,-0.00012,-2.5e-05,2.2e-05,2.6e-05,1e-06,-4.6e-05,-5e-06,1.6e-05,-1.6e-05,-1.8e-05,-5.5e-05,3.1e-05,-3.5e-05,-3.7e-05,-1.1e-05,-7e-06,4.3e-05,-5.8e-05,-7.3e-05,-2.8e-05,-4e-05,-5.2e-05,-1.7e-05,-6.4e-05,9e-06,-2.2e-05,-4.2e-05,-6.3e-05,-7.8e-05,3e-05,-2.5e-05,-9e-05,-4.8e-05,-3e-05,-9e-06,-9.2e-05,-0.000106,-2e-05,-1.9e-05,-6.7e-05,-3.7e-05,-3.1e-05,2.1e-05,-4.3e-05,-1.6e-05,-9e-06,-4.1e-05,5.5e-05,1.4e-05,-4.2e-05,8e-06,2.1e-05,-1e-06,7.1e-05,7e-06,-3.7e-05,2e-06,-2.2e-05,-4.3e-05,-4.5e-05,-1.4e-05,-5.3e-05,-7.3e-05,-1.2e-05,-1.7e-05,-5.8e-05,-8.5e-05,-3.2e-05,-3.3e-05,-5.2e-05,-7.1e-05,1e-06,-8e-05,-8.2e-05,-7.7e-05,-4.7e-05
-4.2e-05,2.5e-05,-1e-06,-3.3e-05,-3e-05,1.5e-05,-2.2e-05,-4e-05,-7e-06,2.9e-05,-3.3e-05,0,-6.1e-05,6e-06,-1.9e-05,3.6e-05,1e-05,-3.8e-05,-2.5e-05,-2.7e-05,1.7e-05,2.4e-05,-1.1e-05,-5e-06,2e-06,-2e-05,-2.4e-05,-3e-06,1e-06,1.4e-05,-3.6e-05,2.1e-05,-1e-05,-4e-05,6e-06,3.8e-05,9e-06,1.9e-05,5e-06,-6.2e-05,-4.1e-05,-2.9e-05,-2.1e-05,-5.6e-05,-2.1e-05,-6e-05,3.3e-05,-1.6e-05,0,-5e-06,7e-06,1e-05,4.5e-05,6.9e-05,6e-06,-4e-05,-1e-06,-1e-05,-5.2e-05,-2.3e-05,2.3e-05,2.5e-05,-4.3e-05,9e-06,-6e-06,7e-06,-1e-05,0,-4.9e-05,5.1e-05,2.3e-05,-7e-05,-4.1e-05,-9e-06,1.8e-05,-3.7e-05,9e-06,1.2e-05,-2.7e-05,-4.5e-05,-5.9e-05,-7e-06,7.4e-05,8.4e-05,5.4e-05,4e-05,-3.9e-05,-1.7e-05,-3.8e-05,-1.4e-05,4.8e-05,4.6e-05,3.7e-05,2.9e-05,-7e-06,-1.4e-05,3e-05,-1.5e-05,1.8e-05,3.3e-05,3.3e-05,2.9e-05,-2.3e-05,-4.2e-05,-4.5e-05,-8e-06,4.9e-05,4.8e-05,-1.3e-05,2.3e-05,-4e-05,-3e-05,-8e-06,-6e-06,-3.2e-05,2.6e-05,6.3e-05,-1e-06,-6.4e-05,2.6e-05,5e-06
3.6e-05,6.7e-05,6.7e-05,6e-05,6.5e-05,7.2e-05,6.3e-05,2.6e-05,6.9e-05,5.9e-05,1.2e-05,6.4e-05,6.3e-05,0.000103,-1.4e-05,1.3e-05,6.7e-05,8.9e-05,8.1e-05,1.3e-05,6.5e-05,8.6e-05,5.3e-05,5.2e-05,5.2e-05,9e-05,1e-04,8.3e-05,0.000109,0.000118,4.7e-05,8e-05,3.5e-05,5e-05,7e-05,7e-05,8.4e-05,7.4e-05,5.9e-05,7.5e-05,7.3e-05,7.4e-05,6.4e-05,-6e-06,9e-06,2.4e-05,8.8e-05,3.3e-05,2e-05,8e-05,5.1e-05,7.3e-05,6.1e-05,4.8e-05,4e-05,4e-05,7.4e-05,2.4e-05,8.3e-05,0.000118,6.2e-05,7.9e-05,5.3e-05,9.7e-05,6e-05,6.2e-05,5.5e-05,0.000103,2.2e-05,9.1e-05,5.4e-05,5.6e-05,8.6e-05,9.6e-05,7.1e-05,4.5e-05,8e-05,9.8e-05,7e-05,2e-05,5.9e-05,5.2e-05,0.000104,7.9e-05,6.7e-05,0.000124,8.1e-05,6.5e-05,6.2e-05,5.1e-05,5.4e-05,0.000104,9.7e-05,0.000106,5.4e-05,4.8e-05,7.1e-05,2.1e-05,5.6e-05,4.5e-05,4.3e-05,8e-05,3.2e-05,4.8e-05,8.8e-05,9e-05,7.9e-05,9.3e-05,7.1e-05,8.5e-05,5.5e-05,5.6e-05,5e-05,5.8e-05,8.1e-05,9.3e-05,0.000106,6.3e-05,5.3e-05,6.6e-05,6.5e-05
-1e-06,-3e-06,3.6e-05,2.8e-05,3.7e-05,2.1e-05,1.9e-05,1.6e-05,3.1e-05,-1.3e-05,6e-06,2.7e-05,1.8e-05,2.9e-05,-2.1e-05,0,2e-06,2e-05,4.3e-05,-5e-06,6.3e-05,2.9e-05,9e-06,1.8e-05,-1e-06,6e-06,4.4e-05,2.3e-05,3.7e-05,1.5e-05,1.1e-05,3.5e-05,-1.2e-05,3.1e-05,2e-05,2.2e-05,8.7e-05,3.8e-05,5e-06,3.5e-05,-1.9e-05,1.5e-05,4e-06,4e-06,-6.6e-05,9e-06,-4e-06,3.2e-05,-5.8e-05,6e-06,3.4e-05,6.6e-05,2e-05,-2e-05,6.5e-05,2.4e-05,9e-06,2e-06,3e-05,7e-05,-3.8e-05,3.3e-05,1.5e-05,2.4e-05,5.5e-05,1.9e-05,9e-06,5.8e-05,1.6e-05,1.9e-05,9e-06,1.8e-05,-1.3e-05,3.4e-05,3e-06,1.2e-05,-2.3e-05,3.3e-05,2e-05,-1.1e-05,4.6e-05,5.2e-05,1.2e-05,3.1e-05,2.5e-05,7.1e-05,2.8e-05,-8e-06,-1.5e-05,5.7e-05,8e-06,-9e-06,4.6e-05,6.1e-05,-2.4e-05,7.4e-05,2.2e-05,-8e-06,4.2e-05,-2.3e-05,2.6e-05,2e-05,-3e-06,6e-06,2.8e-05,-6e-06,3.5e-05,3e-06,5.7e-05,2.1e-05,5e-06,2.3e-05,2.4e-05,1.5e-05,9.4e-05,-2.3e-05,2.3e-05,2e-06,3.5e-05,1.1e-05,7e-06
-3e-05,-3.7e-05,-2.6e-05,-3.1e-05,-2.5e-05,-3e-05,-3.6e-05,-3.3e-05,-3.1e-05,-3.2e-05,-2.3e-05,-1.2e-05,-2.4e-05,-2.4e-05,-3.7e-05,-2.7e-05,-1.8e-05,-4.2e-05,-1.1e-05,-4.3e-05,-2e-05,-1e-06,-3.3e-05,-1.9e-05,-4e-05,-3.4e-05,1.2e-05,-4.1e-05,-1.4e-05,1.3e-05,-4.6e-05,9e-06,-2.9e-05,-2.1e-05,-5.5e-05,-3.2e-05,1e-06,-1.8e-05,-4.3e-05,-1.7e-05,-3.8e-05,-2e-06,-4.1e-05,2.7e-05,2.7e-05,5e-06,-2.3e-05,-6e-06,-3.7e-05,-3.2e-05,-3.2e-05,6e-06,-2e-05,-4.5e-05,-2e-05,-1.2e-05,-2.4e-05,-3.2e-05,7e-06,1.4e-05,-1.8e-05,-2.4e-05,-5.6e-05,-2.5e-05,-4.2e-05,-3.8e-05,-9e-06,-1.1e-05,-2.5e-05,-1.5e-05,-2.8e-05,-1e-05,9e-06,-5.1e-05,-3.2e-05,7e-06,-3.6e-05,-8e-06,-4.4e-05,-5.7e-05,-8e-06,-3.6e-05,-3.6e-05,-1.4e-05,-4.2e-05,-1.4e-05,-9e-06,-2.2e-05,-4.6e-05,-2.9e-05,1.7e-05,-4e-05,-6.5e-05,-2.1e-05,-5.8e-05,-5e-06,-1.6e-05,-2.2e-05,-9e-06,-4.3e-05,-1.1e-05,-2e-06,-3.8e-05,-8e-06,-1.5e-05,-3.6e-05,-5.2e-05,-5.4e-05,2e-06,-8e-06,-2.9e-05,-2e-05,-4.2e-05,-3.8e-05,1.9e-05,-3.2e-05,-3.3e-05,4e-06,-1.9e-05,4e-06,-2.2e-05
-3.5e-05,-2.1e-05,-4.6e-05,-1.3e-05,-3.6e-05,-1.5e-05,1e-06,-1.6e-05,-3.4e-05,-2.7e-05,-1.8e-05,-2.2e-05,-2e-05,-7e-05,-3.4e-05,-6.8e-05,-2.4e-05,-1.4e-05,-1.2e-05,-1.4e-05,-2.1e-05,-4e-06,-1.8e-05,-2.2e-05,-2.3e-05,-1.5e-05,-3.1e-05,-3.4e-05,-3.8e-05,-2.6e-05,-2.2e-05,-9e-06,-1.4e-05,-1e-06,-4.5e-05,-3.6e-05,-1.4e-05,-6e-06,-3.2e-05,-9e-06,-5.3e-05,-4e-06,-1.5e-05,1e-06,3.2e-05,3.4e-05,-1.9e-05,-1.5e-05,-4.6e-05,-2.4e-05,-3.8e-05,-3e-05,6e-06,-2e-05,-3.5e-05,-4.1e-05,-3e-05,-2e-05,-3.7e-05,-1e-05,-3.6e-05,-2.2e-05,-2.2e-05,-4.1e-05,-5.4e-05,-1.4e-05,-1e-05,-2.1e-05,-2.5e-05,-1.5e-05,-4e-06,-2e-05,-5.2e-05,-4.3e-05,-1.6e-05,-1.2e-05,1e-06,-2.1e-05,-5.6e-05,-2.7e-05,4e-06,-6.2e-05,-4.7e-05,-4.2e-05,-3.8e-05,-3e-05,-1.9e-05,-3.9e-05,-2.6e-05,-2e-05,-1.3e-05,-3e-05,-5e-05,-1e-06,-3.7e-05,-1.2e-05,-1e-06,-4.8e-05,-1.4e-05,-2.6e-05,-6e-06,0,-3.5e-05,-2.2e-05,-4.1e-05,-3.2e-05,-2.7e-05,-1.7e-05,-3.4e-05,-1e-06,-1.1e-05,-2.1e-05,-5e-05,-1e-06,-9e-06,-3e-05,-3.3e-05,-1e-05,-4.1e-05,-5e-05,-3.6e-05
-2.2e-05,-2e-05,-1.7e-05,-8e-06,-1.9e-05,-1.5e-05,9e-06,-1.5e-05,-2.4e-05,4e-06,2.7e-05,-3.4e-05,-8e-06,-2.8e-05,-2.7e-05,-1.3e-05,5e-06,-3e-06,-1.9e-05,1.1e-05,-1.7e-05,1e-06,-7e-06,-1.7e-05,-9e-06,-5e-06,-3.2e-05,-1.7e-05,-1.1e-05,-5e-06,-1.9e-05,-1.2e-05,3.1e-05,0,-2.4e-05,-2.6e-05,6e-06,-9e-06,-1.2e-05,-2.6e-05,-2.7e-05,-1.6e-05,-1.4e-05,-3.9e-05,1.8e-05,1.2e-05,2.1e-05,-1.3e-05,-3.5e-05,-1.5e-05,-4e-05,-1.3e-05,4e-06,-1.1e-05,1e-06,-4.3e-05,-1.1e-05,-1.4e-05,-2.6e-05,-2.2e-05,-4e-06,-4e-06,-2.4e-05,-3.4e-05,-2.5e-05,-2.1e-05,1.1e-05,-6e-06,-3.4e-05,-6e-06,2.8e-05,-1.2e-05,-2.2e-05,-5.6e-05,1.8e-05,-5e-06,-1.4e-05,-1.2e-05,-2.2e-05,-1.3e-05,8e-06,-5.1e-05,-1.1e-05,2.6e-05,-1.9e-05,-1e-06,-1.6e-05,-2.8e-05,-3.5e-05,-5e-05,-8e-06,-2e-06,-2.1e-05,-1.7e-05,-2e-05,-1.8e-05,1e-06,-2.2e-05,-2.2e-05,-3e-05,3.1e-05,-5e-06,-2.3e-05,-2.2e-05,-2.8e-05,-1.8e-05,-2.6e-05,9e-06,-1e-05,-6e-06,7e-06,-9e-06,-2.2e-05,1.9e-05,-1e-06,-1.7e-05,-1.9e-05,1.9e-05,-2.1e-05,-2.2e-05,-1.2e-05
2.3e-05,1e-05,1.9e-05,1.7e-05,1.6e-05,1.7e-05,1.6e-05,1.3e-05,-5e-06,8e-06,1.9e-05,-8e-06,2e-05,2.4e-05,1e-06,2e-05,-1.2e-05,1e-05,1.9e-05,2.6e-05,-1e-05,1.5e-05,-3e-06,1e-05,0,1.4e-05,1.3e-05,2.3e-05,2.2e-05,1.6e-05,1.2e-05,4e-06,3.4e-05,5e-06,9e-06,5e-06,2.1e-05,1.1e-05,1.2e-05,4e-06,1.8e-05,2.2e-05,1.1e-05,0,1.9e-05,2.2e-05,2.5e-05,1.9e-05,1.2e-05,-1.4e-05,-6e-06,-4e-06,2.6e-05,-2e-06,5e-06,-2e-06,3e-06,1.1e-05,-1e-05,1e-06,1e-06,1.6e-05,-9e-06,4e-06,2e-05,9e-06,2.3e-05,5e-06,7e-06,0,1.1e-05,1e-06,2.1e-05,-4e-06,2.6e-05,2.1e-05,2.4e-05,3.5e-05,1.4e-05,1.8e-05,1e-06,-1.3e-05,1.1e-05,5e-06,-8e-06,1e-05,1.2e-05,1.3e-05,3e-06,-1.7e-05,3.4e-05,-6e-06,1.9e-05,8e-06,6e-06,1.8e-05,1.4e-05,8e-06,2e-06,-1.5e-05,2.2e-05,1.5e-05,4e-06,2e-06,-1e-05,2.3e-05,1.8e-05,3e-06,2.1e-05,3.2e-05,1.7e-05,4e-06,6e-06,1.8e-05,1.2e-05,1.9e-05,3.4e-05,3.2e-05,5e-06,1.4e-05,1e-05
7e-06,7e-06,-1.2e-05,1.7e-05,1e-05,9e-06,7e-06,5e-06,-1e-06,7e-06,-9e-06,-1e-06,1.5e-05,1.3e-05,-4e-06,1.2e-05,-3e-06,-1e-06,-1e-06,-7e-06,-3e-06,1e-05,-1.5e-05,9e-06,-3e-06,-1.1e-05,-9e-06,1.1e-05,7e-06,1e-06,-6e-06,1e-06,1e-06,-1.2e-05,1.5e-05,-1.4e-05,-1e-06,1.1e-05,2e-06,-2e-06,2e-06,-1.8e-05,-1e-06,9e-06,-3e-06,-1.8e-05,-4e-06,1e-05,3e-06,-1.9e-05,-1.1e-05,2e-06,1.3e-05,-1.4e-05,-3e-06,-9e-06,0,-1.4e-05,-1e-05,-8e-06,-4.2e-05,-1.7e-05,2e-06,-5e-06,4e-06,2e-06,-1e-06,-3e-06,5e-06,-1.1e-05,-2e-06,-6e-06,4e-06,-2e-05,-9e-06,6e-06,1.3e-05,-4e-06,5e-06,-6e-06,2e-06,1e-05,1e-05,-1.5e-05,-1e-05,-4e-06,1.1e-05,0,-7e-06,-1.8e-05,2.3e-05,-1e-06,-1.3e-05,1.5e-05,-8e-06,-1e-05,1.6e-05,-1.6e-05,-8e-06,-1e-06,-9e-06,5e-06,-2e-06,-4e-06,-9e-06,-7e-06,-8e-06,-1e-05,5e-06,2.7e-05,0,4e-06,0,-7e-06,-2e-06,2e-06,-1.3e-05,1.4e-05,-1.4e-05,3e-06,-6e-06
0,-1.2e-05,-1.6e-05,2e-06,-3e-06,-4e-06,-4e-06,-1e-05,-4e-06,-8e-06,-1e-05,-1.2e-05,-1e-06,2e-06,0,0,-6e-06,-1.2e-05,-1.2e-05,-2.6e-05,-1.6e-05,-3e-06,-5e-06,-7e-06,-8e-06,-1e-05,-1.8e-05,-4e-06,-1.3e-05,-6e-06,-7e-06,-1.6e-05,-1.2e-05,-1.4e-05,-3e-06,-2.4e-05,-6e-06,-1.1e-05,-1e-05,-8e-06,-7e-06,-7e-06,-6e-06,2e-06,-1.9e-05,2e-06,-2.6e-05,4e-06,-1.4e-05,-5e-06,-2.8e-05,-9e-06,-7e-06,-1.2e-05,-1.2e-05,-1.3e-05,-2e-06,-2.2e-05,-2.1e-05,-4e-06,-2.1e-05,-1.1e-05,-4e-06,-1.7e-05,-1.4e-05,-2e-05,-1e-05,0,-9e-06,-1.2e-05,-1.1e-05,-1.9e-05,-4e-06,-4e-06,-3.2e-05,-1.1e-05,-1.1e-05,-9e-06,9e-06,-2.1e-05,-1e-05,-1e-05,-8e-06,-2e-05,-1.6e-05,-9e-06,-7e-06,-8e-06,-1.4e-05,-2.2e-05,-1.4e-05,7e-06,-2.3e-05,-1.2e-05,-1.8e-05,-2.1e-05,-4e-06,-1.8e-05,0,-1.1e-05,-8e-06,-8e-06,-1e-06,-7e-06,-8e-06,-1.6e-05,-5e-06,-4e-05,-2.3e-05,7e-06,-5e-06,-7e-06,-6e-06,-2.2e-05,-1.6e-05,-1.8e-05,-1.3e-05,-1e-06,-1.1e-05,-4e-06,-9e-06
3e-06,1e-06,4e-06,-7e-06,5e-06,-9e-06,0,-4e-06,-2e-06,2e-06,-7e-06,0,-1e-06,3e-06,-5e-06,-4e-06,-1.1e-05,-6e-06,2e-06,-2.1e-05,0,-5e-06,-6e-06,-3e-06,-8e-06,-7e-06,-7e-06,-1.4e-05,-7e-06,-3e-06,-6e-06,-1e-06,-1e-06,-1.3e-05,2e-06,-1.7e-05,-1e-05,-3e-06,-5e-06,-4e-06,-9e-06,-2e-05,-8e-06,-3e-06,-8e-06,4e-06,-2.1e-05,-8e-06,-1e-05,1e-06,-1.4e-05,-8e-06,-1.1e-05,-2e-06,1e-06,-3e-06,-7e-06,-4e-06,-7e-06,-7e-06,-1.8e-05,-9e-06,-7e-06,0,-1e-06,-2.5e-05,0,3e-06,-2e-06,-8e-06,-2e-06,-3e-06,2e-06,-3e-06,-1.8e-05,-7e-06,-1.1e-05,6e-06,2e-06,-1.1e-05,-1.1e-05,-6e-06,-1.7e-05,-3e-06,-1.4e-05,-3e-06,-4e-06,-8e-06,-1.2e-05,-8e-06,-1.1e-05,-6e-06,-8e-06,-8e-06,-5e-06,-8e-06,-1e-06,-1.2e-05,-6e-06,-4e-06,-1.6e-05,5e-06,-2e-06,-8e-06,-4e-06,-2e-05,2e-06,-2.7e-05,-7e-06,-1e-05,-3e-06,-7e-06,3e-06,-2.4e-05,-1e-05,-1.9e-05,-2e-06,-2e-06,1e-06,-3e-06,-8e-06
6e-06,2e-06,2e-06,-1e-06,5e-06,-2e-06,-3e-06,3e-06,2e-06,5e-06,1e-05,7e-06,-6e-06,-1e-06,1e-06,-9e-06,3e-06,-4e-06,2e-06,-8e-06,7e-06,-4e-06,-5e-06,0,-1e-06,-2e-06,1e-06,-1.7e-05,-3e-06,0,-7e-06,-4e-06,0,-4e-06,1e-06,-9e-06,-8e-06,3e-06,-4e-06,-2e-06,-1.2e-05,-6e-06,-4e-06,-1.4e-05,4e-06,-4e-06,-2.2e-05,-3e-06,-8e-06,0,-8e-06,-7e-06,-4e-06,-2e-06,6e-06,-8e-06,-9e-06,-2e-06,-1.1e-05,1e-06,-5e-06,-3e-06,-1e-06,-4e-06,-4e-06,-3e-06,-7e-06,4e-06,-1e-06,-2e-06,1e-06,-4e-06,-9e-06,-5e-06,-1.2e-05,1e-06,-1.1e-05,-4e-06,-5e-06,7e-06,-4e-06,1e-06,-1.2e-05,7e-06,1e-06,-4e-06,-1e-06,-7e-06,3e-06,-4e-06,-2e-05,1e-06,-3e-06,-4e-06,-1e-05,-5e-06,-4e-06,-5e-06,0,-1e-06,-6e-06,-1e-06,-3e-06,-8e-06,-2e-06,-1e-05,0,-1.5e-05,3e-06,-7e-06,-3e-06,5e-06,-1e-06,-8e-06,3e-06,-1.4e-05,-1e-06,-2e-06,0,-2e-06,-1e-05
-1e-06,2e-06,-1e-06,5e-06,2e-06,0,-1e-06,1e-06,2e-06,0,-3e-06,9e-06,-7e-06,1e-06,-5e-06,2e-06,1.4e-05,-3e-06,-2e-06,2e-06,1e-05,-5e-06,-3e-06,-1e-06,-1e-06,0,4e-06,-7e-06,2e-06,1e-06,2e-06,1e-06,1e-05,3e-06,-8e-06,1e-06,-6e-06,-1e-06,-4e-06,2e-06,-9e-06,8e-06,-6e-06,1e-06,5e-06,1e-06,-5e-06,-3e-06,-2e-06,1e-05,-5e-06,-3e-06,-3e-06,-1e-06,-4e-06,-4e-06,-3e-06,6e-06,0,0,1.2e-05,5e-06,3e-06,-3e-06,-4e-06,-1e-06,1e-06,4e-06,-2e-06,4e-06,4e-06,-1e-06,1e-06,4e-06,2e-06,4e-06,-1e-05,-3e-06,-4e-06,9e-06,1e-06,-1.1e-05,-5e-06,3e-06,-4e-06,-1e-06,-2e-06,-6e-06,8e-06,2e-06,-1e-06,3e-06,-9e-06,6e-06,-6e-06,0,-2e-06,2e-06,3e-06,-6e-06,-1.1e-05,2e-06,-6e-06,6e-06,0,-5e-06,6e-06,-4e-06,0,-2e-06,1e-06,-2e-06,-3e-06,-1e-06,2e-06,-5e-06,-1e-06,7e-06,0,1e-06,-4e-06
-2e-06,3e-06,5e-06,-4e-06,0,1e-06,1e-06,-1e-06,0,4e-06,1e-06,0,-2e-06,-3e-06,-5e-06,-7e-06,4e-06,-3e-06,0,2e-06,1e-06,-3e-06,1e-06,-2e-06,1e-06,1e-06,0,-7e-06,1e-06,0,-3e-06,0,9e-06,-1e-06,-7e-06,4e-06,-4e-06,-2e-06,0,1e-06,-4e-06,2e-06,-1e-06,3e-06,-2e-06,3e-06,-1e-06,-1e-06,0,6e-06,-7e-06,-1e-06,0,-4e-06,1e-06,-3e-06,-2e-06,-1e-06,-1e-06,1e-06,0,-4e-06,-3e-06,3e-06,-3e-06,-3e-06,-1e-06,2e-06,-4e-06,3e-06,4e-06,-2e-06,2e-06,-5e-06,3e-06,1e-06,-8e-06,2e-06,-6e-06,2e-06,0,-7e-06,1e-06,8e-06,-3e-06,-1e-06,-3e-06,1e-06,-3e-06,-2e-06,-3e-06,-3e-06,-2e-06,-4e-06,1e-06,-2e-06,-5e-06,-4e-06,0,-3e-06,-8e-06,-3e-06,-5e-06,5e-06,-1e-06,0,-3e-06,1e-06,-5e-06,-5e-06,6e-06,0,-4e-06,0,-2e-06,-5e-06,0,-5e-06,1e-06,-3e-06,-1e-06
0,-1e-06,1e-06,-1e-06,0,2e-06,0,1e-06,-2e-06,2e-06,3e-06,-1e-06,-1e-06,-3e-06,-2e-06,1e-06,0,1e-06,2e-06,-2e-06,-3e-06,-3e-06,-3e-06,1e-06,-1e-06,1e-06,4e-06,-2e-06,1e-06,1e-06,0,2e-06,2e-06,-1e-06,0,2e-06,-2e-06,1e-06,0,2e-06,2e-06,1e-06,0,-3e-06,-5e-06,-2e-06,7e-06,-1e-06,-2e-06,-3e-06,0,-2e-06,4e-06,-5e-06,0,-4e-06,1e-06,2e-06,-3e-06,-1e-06,-3e-06,-1e-06,-3e-06,0,3e-06,3e-06,-3e-06,-1e-06,-2e-06,1e-06,1e-06,0,-3e-06,-5e-06,7e-06,-3e-06,-4e-06,-3e-06,-5e-06,1e-06,-2e-06,-1e-05,6e-06,3e-06,-3e-06,0,1e-06,0,1e-06,1e-06,-3e-06,-6e-06,4e-06,0,-3e-06,3e-06,2e-06,-1e-06,-2e-06,-3e-06,-4e-06,1e-06,-2e-06,-2e-06,1e-06,0,0,7e-06,0,-4e-06,2e-06,1e-06,-2e-06,2e-06,3e-06,5e-06,2e-06,-1e-06,2e-06,0,-1e-06
2e-06,-2e-06,3e-06,1e-06,0,3e-06,-1e-06,1e-06,-2e-06,1e-06,-3e-06,-3e-06,-3e-06,3e-06,-1e-06,7e-06,1e-06,1e-06,0,-3e-06,-2e-06,1e-06,-1e-06,1e-06,-1e-06,1e-06,4e-06,2e-06,2e-06,2e-06,-3e-06,1e-06,0,2e-06,1e-06,2e-06,0,1e-06,0,0,3e-06,5e-06,-1e-06,-5e-06,-5e-06,-4e-06,7e-06,2e-06,0,-3e-06,-1e-06,1e-06,2e-06,-4e-06,2e-06,-2e-06,3e-06,-3e-06,-1e-06,3e-06,-4e-06,0,1e-06,-2e-06,5e-06,2e-06,-2e-06,-1e-06,-1e-06,1e-06,-2e-06,0,2e-06,-7e-06,-1e-06,1e-06,-2e-06,0,2e-06,-1e-06,3e-06,-5e-06,5e-06,-1e-06,-1e-06,1e-06,2e-06,1e-06,0,-3e-06,2e-06,0,5e-06,2e-06,-3e-06,5e-06,2e-06,0,-1e-06,-2e-06,-5e-06,-2e-06,-1e-06,1e-06,-1e-06,2e-06,-1e-06,4e-06,3e-06,2e-06,1e-06,1e-06,-1e-06,0,4e-06,3e-06,-2e-06,-1e-06,-1e-06,2e-06,1e-06
1e-06,1e-06,-3e-06,0,0,1e-06,0,0,-1e-06,0,-2e-06,-5e-06,0,1e-06,-1e-06,1e-06,-2e-06,-2e-06,0,-4e-06,-4e-06,2e-06,0,1e-06,-1e-06,0,0,3e-06,-1e-06,0,2e-06,1e-06,-5e-06,0,2e-06,-1e-06,1e-06,-1e-06,0,1e-06,1e-06,1e-06,0,-1e-06,2e-06,4e-06,2e-06,1e-06,0,0,-2e-06,2e-06,0,-2e-06,-2e-06,-1e-06,2e-06,0,0,-1e-06,-9e-06,-1e-06,-2e-06,1e-06,1e-06,-2e-06,0,-2e-06,-1e-06,-1e-06,-2e-06,-1e-06,3e-06,-2e-06,-5e-06,1e-06,0,-1e-06,3e-06,-3e-06,1e-06,-4e-06,2e-06,-4e-06,-2e-06,0,1e-06,1e-06,-3e-06,-3e-06,2e-06,-1e-06,-3e-06,0,-1e-06,2e-06,1e-06,-4e-06,1e-06,-2e-06,-2e-06,0,0,3e-06,-1e-06,0,0,-1e-06,-1e-06,2e-06,1e-06,-1e-06,-1e-06,-1e-06,1e-06,-1e-06,-3e-06,-2e-06,-2e-06,1e-06,0
0,-2e-06,-2e-06,-2e-06,0,-1e-06,-2e-06,-1e-06,-2e-06,1e-06,1e-06,-3e-06,0,-1e-06,-2e-06,-1e-06,-4e-06,1e-06,0,-3e-06,-3e-06,2e-06,0,-1e-06,-2e-06,0,-3e-06,-2e-06,-3e-06,-2e-06,-3e-06,-1e-06,-3e-06,-2e-06,2e-06,-4e-06,2e-06,1e-06,-1e-06,-1e-06,-3e-06,-3e-06,0,1e-06,3e-06,-3e-06,-2e-06,0,-3e-06,-3e-06,-4e-06,2e-06,-1e-06,0,-1e-06,-4e-06,-1e-06,-3e-06,-1e-06,-1e-06,-4e-06,-1e-06,-2e-06,-2e-06,-2e-06,-3e-06,-2e-06,-1e-06,-1e-06,-2e-06,-1e-06,-1e-06,-3e-06,-8e-06,-2e-06,-2e-06,-2e-06,-1e-06,1e-06,-3e-06,0,0,-2e-06,-4e-06,-3e-06,0,0,-1e-06,-2e-06,-5e-06,-2e-06,0,-3e-06,-1e-06,-5e-06,-2e-06,0,-3e-06,-1e-06,-1e-06,3e-06,-1e-06,0,-3e-06,-1e-06,-2e-06,-2e-06,-1e-06,-4e-06,-1e-06,1e-06,0,0,-1e-06,-1e-06,-2e-06,-3e-06,-4e-06,-1e-06,-1e-06,-2e-06
1e-06,-1e-06,-1e-06,0,0,-2e-06,-1e-06,0,-1e-06,0,1e-06,-3e-06,-2e-06,1e-06,-1e-06,-2e-06,-1e-06,0,0,0,-2e-06,1e-06,-1e-06,0,-1e-06,-1e-06,-1e-06,-2e-06,-1e-06,0,0,0,2e-06,1e-06,1e-06,-3e-06,1e-06,0,-1e-06,0,-3e-06,1e-06,-1e-06,0,1e-06,0,0,-1e-06,-3e-06,-2e-06,-4e-06,-1e-06,-2e-06,0,1e-06,-2e-06,-1e-06,0,-1e-06,0,-2e-06,1e-06,0,-2e-06,-1e-06,-2e-06,1e-06,0,-1e-06,-2e-06,0,-1e-06,1e-06,-1e-06,2e-06,0,-3e-06,1e-06,1e-06,1e-06,0,-3e-06,-4e-06,-1e-06,-1e-06,0,0,-2e-06,0,-4e-06,1e-06,2e-06,-1e-06,0,-3e-06,0,0,0,0,-1e-06,2e-06,1e-06,-1e-06,-2e-06,-1e-06,-1e-06,1e-06,-3e-06,1e-06,-2e-06,-1e-06,0,0,1e-06,1e-06,-6e-06,1e-06,1e-06,1e-06,0,-2e-06
2e-06,2e-06,-1e-06,-1e-06,1e-06,-1e-06,0,0,0,1e-06,1e-06,0,-1e-06,0,-2e-06,-2e-06,1e-06,0,0,2e-06,2e-06,2e-06,0,0,0,0,-2e-06,-1e-06,1e-06,-1e-06,-1e-06,0,1e-06,1e-06,-1e-06,-2e-06,2e-06,0,0,-1e-06,-4e-06,-1e-06,-1e-06,-2e-06,-1e-06,0,0,0,0,2e-06,-3e-06,0,-1e-06,0,0,-1e-06,-1e-06,1e-06,0,0,-3e-06,1e-06,0,0,-1e-06,-3e-06,0,1e-06,-1e-06,-1e-06,1e-06,0,0,0,2e-06,1e-06,-1e-06,1e-06,-1e-06,2e-06,1e-06,-1e-06,-3e-06,-1e-06,-1e-06,-1e-06,0,0,-1e-06,-2e-06,-1e-06,2e-06,-3e-06,0,-2e-06,0,-1e-06,0,0,-1e-06,3e-06,0,-2e-06,1e-06,-1e-06,0,1e-06,-2e-06,2e-06,-1e-06,0,-1e-06,0,1e-06,0,-3e-06,1e-06,-1e-06,-1e-06,-1e-06,-2e-06
-1e-06,-1e-06,-1e-06,-1e-06,0,0,0,0,0,1e-06,-1e-06,3e-06,0,-1e-06,-1e-06,0,-1e-06,0,-1e-06,0,1e-06,0,-1e-06,0,0,0,-2e-06,-2e-06,-1e-06,0,0,-1e-06,1e-06,-1e-06,-2e-06,-1e-06,1e-06,0,0,0,-3e-06,-1e-06,0,-2e-06,-1e-06,0,1e-06,0,0,1e-06,-3e-06,-1e-06,2e-06,-1e-06,-1e-06,-2e-06,-1e-06,-1e-06,-1e-06,-1e-06,-1e-06,0,-1e-06,-1e-06,-2e-06,0,0,1e-06,-1e-06,0,1e-06,-1e-06,-1e-06,-1e-06,1e-06,0,-1e-06,-1e-06,-2e-06,1e-06,-1e-06,-1e-06,0,1e-06,-1e-06,0,-1e-06,0,0,-2e-06,1e-06,-1e-06,-1e-06,0,-3e-06,-2e-06,0,0,1e-06,-1e-06,2e-06,1e-06,-1e-06,0,0,0,0,-3e-06,-1e-06,1e-06,1e-06,0,-1e-06,1e-06,-2e-06,-2e-06,1e-06,1e-06,-1e-06,0,-2e-06
0,1e-06,1e-06,0,0,0,0,0,0,1e-06,1e-06,1e-06,-1e-06,0,-2e-06,-1e-06,1e-06,0,-1e-06,-2e-06,2e-06,0,0,0,0,0,-1e-06,0,0,0,-1e-06,0,-1e-06,-1e-06,-2e-06,0,0,0,0,0,0,0,0,0,-1e-06,-1e-06,1e-06,0,0,0,-3e-06,0,1e-06,-1e-06,0,-2e-06,0,0,-1e-06,0,-3e-06,-1e-06,0,0,-1e-06,-1e-06,0,1e-06,-1e-06,0,0,-1e-06,1e-06,0,0,0,-1e-06,1e-06,-2e-06,-1e-06,0,-4e-06,1e-06,1e-06,-1e-06,0,0,-1e-06,1e-06,0,2e-06,0,0,0,-1e-06,-2e-06,0,-1e-06,0,-1e-06,1e-06,-1e-06,-1e-06,-1e-06,0,0,0,-3e-06,-2e-06,1e-06,0,0,-1e-06,-1e-06,-2e-06,0,1e-06,0,1e-06,-1e-06,0
0,1e-06,1e-06,0,0,1e-06,0,0,0,1e-06,1e-06,1e-06,0,0,0,1e-06,1e-06,0,1e-06,-2e-06,1e-06,0,-1e-06,0,0,0,0,1e-06,1e-06,1e-06,0,0,-2e-06,0,0,0,0,0,0,0,2e-06,-1e-06,0,0,1e-06,0,-1e-06,0,0,1e-06,-2e-06,-2e-06,0,-2e-06,1e-06,-1e-06,1e-06,-1e-06,-1e-06,0,-3e-06,0,0,1e-06,2e-06,-2e-06,0,0,-1e-06,1e-06,-1e-06,0,0,-1e-06,-2e-06,0,1e-06,0,-1e-06,0,0,-2e-06,2e-06,1e-06,-1e-06,0,0,1e-06,-1e-06,0,-1e-06,0,3e-06,0,-1e-06,0,1e-06,-1e-06,0,-2e-06,0,1e-06,0,1e-06,0,0,-1e-06,-3e-06,1e-06,2e-06,0,0,-1e-06,-1e-06,0,0,1e-06,0,1e-06,0,-1e-06
1e-06,-1e-06,1e-06,0,0,1e-06,0,0,0,0,-1e-06,1e-06,0,0,-1e-06,3e-06,0,-1e-06,0,-1e-06,0,0,0,0,-1e-06,0,1e-06,0,0,0,0,0,-1e-06,0,1e-06,0,0,0,0,0,0,0,0,-1e-06,1e-06,0,-2e-06,0,-1e-06,1e-06,-1e-06,0,0,-1e-06,0,-2e-06,1e-06,1e-06,0,0,0,0,-1e-06,0,1e-06,0,0,0,-1e-06,1e-06,0,0,-1e-06,-2e-06,-2e-06,0,0,0,1e-06,0,0,-3e-06,1e-06,1e-06,-1e-06,0,0,0,0,1e-06,0,-2e-06,1e-06,0,-2e-06,0,0,0,0,-1e-06,0,0,0,0,0,-1e-06,0,-3e-06,1e-06,2e-06,0,0,0,-1e-06,0,0,-1e-06,0,-1e-06,0,0
0,0,0,0,0,0,0,0,0,0,0,-1e-06,-1e-06,0,-1e-06,0,0,0,0,-1e-06,0,-1e-06,0,0,0,0,1e-06,0,0,0,-1e-06,0,-1e-06,0,1e-06,0,0,0,0,0,-1e-06,0,0,-1e-06,0,0,-2e-06,0,0,-1e-06,-1e-06,0,-1e-06,0,0,-1e-06,0,-1e-06,0,0,-1e-06,0,0,0,0,0,0,0,-1e-06,0,0,0,1e-06,-4e-06,-1e-06,0,-2e-06,0,1e-06,0,-1e-06,-2e-06,-1e-06,0,0,0,0,0,1e-06,0,1e-06,0,-1e-06,0,-1e-06,0,0,-1e-06,0,-1e-06,0,0,0,0,0,0,-1e-06,-2e-06,-1e-06,1e-06,0,0,0,0,-1e-06,-2e-06,-1e-06,1e-06,0,0,-1e-06
0,0,0,0,0,0,0,0,0,0,0,-2e-06,0,0,-1e-06,-1e-06,1e-06,0,0,0,-2e-06,-1e-06,0,0,0,0,1e-06,-1e-06,0,0,0,0,1e-06,0,1e-06,0,-1e-06,0,0,0,-2e-06,0,0,-1e-06,-1e-06,0,-2e-06,0,0,-1e-06,-1e-06,1e-06,-1e-06,0,0,-1e-06,0,1e-06,0,1e-06,-1e-06,0,0,0,0,-1e-06,0,0,-1e-06,0,0,0,0,-1e-06,1e-06,0,-1e-06,0,1e-06,0,0,-1e-06,-1e-06,0,-1e-06,0,0,0,-1e-06,0,-2e-06,0,-1e-06,0,-2e-06,0,0,-1e-06,0,-1e-06,-1e-06,0,0,0,0,0,0,0,-1e-06,0,0,0,0,0,0,-3e-06,0,0,1e-06,0,0
0,0,-1e-06,0,0,0,0,0,0,0,0,-2e-06,0,0,-1e-06,-1e-06,-1e-06,0,0,0,-1e-06,0,0,0,0,0,1e-06,-1e-06,0,0,-1e-06,0,1e-06,0,0,0,0,0,0,0,-2e-06,1e-06,0,0,-1e-06,-1e-06,1e-06,0,-1e-06,0,-1e-06,0,0,0,0,-2e-06,0,0,0,0,-1e-06,0,-1e-06,-1e-06,0,0,0,0,-1e-06,0,0,0,-1e-06,-3e-06,1e-06,0,-1e-06,0,1e-06,0,0,-1e-06,-1e-06,0,0,0,0,0,0,-1e-06,0,0,-1e-06,0,-1e-06,1e-06,0,0,0,0,-1e-06,0,0,0,0,0,0,1e-06,1e-06,-1e-06,0,0,0,0,1e-06,-1e-06,0,1e-06,0,0,-1e-06
0,0,0,0,0,0,0,0,0,0,-1e-06,-1e-06,-1e-06,0,-1e-06,-1e-06,-1e-06,0,0,0,-1e-06,0,0,0,0,0,0,-1e-06,0,0,0,0,0,0,-1e-06,0,0,0,0,0,-1e-06,0,0,0,0,1e-06,1e-06,0,0,0,-1e-06,1e-06,1e-06,0,0,-1e-06,0,0,0,0,-3e-06,0,0,0,0,1e-06,0,0,0,0,0,0,1e-06,-1e-06,0,0,-2e-06,0,-1e-06,0,0,-1e-06,0,-1e-06,0,0,0,0,0,-1e-06,0,1e-06,-1e-06,0,-1e-06,1e-06,0,0,0,-1e-06,-1e-06,0,-1e-06,0,0,0,0,2e-06,1e-06,-1e-06,0,0,0,0,1e-06,-2e-06,0,0,-1e-06,0,0
0,0,-1e-06,0,0,0,0,0,0,0,0,-1e-06,0,0,-1e-06,0,0,0,0,-1e-06,0,0,0,0,0,0,-1e-06,0,0,0,-1e-06,0,-1e-06,0,-1e-06,0,0,0,0,0,0,0,0,-1e-06,1e-06,-1e-06,1e-06,0,0,-1e-06,-1e-06,0,0,0,0,-1e-06,0,0,0,0,-2e-06,0,0,0,-1e-06,-1e-06,0,0,-1e-06,-1e-06,0,0,-1e-06,-1e-06,0,0,0,0,-1e-06,0,0,-1e-06,1e-06,0,0,0,0,0,0,-1e-06,0,0,0,0,-1e-06,0,0,0,0,-1e-06,-1e-06,0,-1e-06,0,0,0,0,1e-06,-1e-06,0,0,0,0,0,0,1e-06,1e-06,0,0,0,-1e-06
0,0,0,0,0,0,0,0,0,0,1e-06,1e-06,0,0,-1e-06,1e-06,0,0,0,-1e-06,0,0,0,0,0,0,-1e-06,0,0,0,0,0,-1e-06,0,-1e-06,0,0,0,0,0,1e-06,0,0,-1e-06,1e-06,0,1e-06,0,0,0,-1e-06,0,1e-06,0,0,-1e-06,0,-1e-06,0,0,-2e-06,0,0,0,0,0,0,0,0,0,0,0,0,0,-1e-06,0,-1e-06,0,-1e-06,0,0,-1e-06,1e-06,-1e-06,0,0,0,0,0,-1e-06,1e-06,0,1e-06,0,-1e-06,0,0,0,0,-1e-06,0,0,0,0,0,0,0,0,-1e-06,0,0,0,0,0,0,0,0,0,0,0,0
0,0,0,0,0,0,0,0,0,0,0,1e-06,0,0,-1e-06,1e-06,0,0,0,0,1e-06,0,0,0,0,0,-1e-06,0,0,0,0,0,0,0,0,0,0,0,0,0,1e-06,0,0,0,0,0,0,0,0,1e-06,-1e-06,0,0,0,0,-1e-06,0,0,0,0,-1e-06,0,0,0,1e-06,0,0,0,-1e-06,0,0,0,0,-1e-06,-1e-06,0,-1e-06,0,0,0,0,-1e-06,1e-06,0,0,0,0,0,0,0,0,0,1e-06,0,-1e-06,0,0,0,0,-1e-06,0,0,0,0,0,0,0,-1e-06,1e-06,0,0,0,0,0,0,-1e-06,0,0,0,0,0
0,0,0,0,0,0,0,0,0,0,0,1e-06,0,0,0,1e-06,0,0,0,0,1e-06,0,0,0,0,0,-1e-06,0,0,0,0,0,0,0,0,0,0,0,0,0,0,0,0,0,0,0,-1e-06,0,0,0,-1e-06,0,0,0,0,-1e-06,0,0,0,0,0,0,0,0,0,-1e-06,0,0,0,0,0,0,0,0,0,0,0,0,0,0,0,-1e-06,0,0,0,0,0,0,0,0,-1e-06,0,0,0,-1e-06,0,0,0,0,0,0,0,0,0,0,0,0,-1e-06,1e-06,0,0,0,0,0,0,0,0,0,0,0,0
0,0,0,0,0,0,0,0,0,0,0,1e-06,0,0,-1e-06,-1e-06,0,0,0,0,0,0,0,0,0,0,0,0,0,0,0,0,1e-06,0,1e-06,0,0,0,0,0,-1e-06,0,0,0,0,-1e-06,0,0,0,0,-1e-06,0,0,0,0,-1e-06,0,0,0,0,-1e-06,0,0,0,0,-1e-06,0,0,0,0,0,0,0,-1e-06,1e-06,0,-1e-06,0,1e-06,0,0,-1e-06,-1e-06,0,0,0,0,0,0,0,0,0,-1e-06,0,-1e-06,0,0,0,0,0,0,0,0,0,0,0,0,-2e-06,-1e-06,0,0,0,0,0,-1e-06,-2e-06,0,0,0,0,0
0,0,1e-06,0,0,0,0,0,0,0,0,0,0,0,0,-1e-06,0,0,0,0,0,0,0,0,0,0,0,0,0,0,0,0,0,0,0,0,0,0,0,0,-1e-06,0,0,-1e-06,0,0,0,0,0,0,-1e-06,0,0,0,0,-1e-06,0,0,0,0,-1e-06,0,0,0,0,0,0,0,0,0,0,0,0,-1e-06,0,0,-1e-06,0,1e-06,0,0,-1e-06,-1e-06,1e-06,0,0,0,0,0,0,0,0,0,0,-1e-06,0,0,0,0,0,0,0,0,0,0,0,0,-1e-06,0,-1e-06,0,0,0,0,0,-1e-06,0,0,0,0,0
0,0,0,0,0,0,0,0,0,0,0,-1e-06,0,0,-1e-06,0,0,0,0,0,-1e-06,0,0,0,0,0,1e-06,0,0,0,0,0,0,0,0,0,0,0,0,0,-1e-06,0,0,0,0,0,0,0,0,0,-1e-06,0,0,0,0,-1e-06,0,0,0,0,-1e-06,0,0,0,0,0,0,0,0,0,0,0,-1e-06,-1e-06,0,0,0,0,0,0,0,-1e-06,0,0,0,0,0,0,0,0,0,0,-1e-06,0,-1e-06,0,0,0,0,0,1e-06,0,0,0,0,0,0,-1e-06,1e-06,0,0,0,0,0,0,-1e-06,0,0,0,0,0
0,0,0,0,0,0,0,0,0,0,0,-1e-06,0,0,0,0,0,0,0,0,0,0,0,0,0,0,1e-06,0,0,0,0,0,0,0,0,0,0,0,0,0,0,0,0,0,0,0,0,0,0,-1e-06,-1e-06,0,0,0,0,-1e-06,0,0,0,0,-2e-06,0,0,0,0,0,0,0,0,0,0,0,0,-1e-06,0,0,-1e-06,0,-1e-06,0,0,-1e-06,0,0,0,0,0,0,0,0,0,0,0,0,-1e-06,0,0,0,0,0,0,0,0,0,0,0,0,-1e-06,0,0,0,0,0,0,0,0,0,0,0,0,0
0,0,0,0,0,0,0,0,0,0,0,-1e-06,0,0,0,0,0,0,0,0,-1e-06,0,0,0,0,0,1e-06,0,0,0,0,0,0,0,0,0,0,0,0,0,1e-06,0,0,0,0,0,-1e-06,0,0,0,-1e-06,0,0,0,0,0,0,0,0,0,-1e-06,0,0,0,0,0,0,0,0,0,0,0,0,-1e-06,0,0,-1e-06,0,-1e-06,0,0,-1e-06,1e-06,0,0,0,0,0,0,0,0,0,0,0,-1e-06,0,0,0,0,0,0,0,0,0,0,0,0,-1e-06,-1e-06,0,0,0,0,0,0,0,0,0,0,0,0
0,0,0,0,0,0,0,0,0,0,0,-1e-06,0,0,0,1e-06,0,0,0,0,0,0,0,0,0,0,0,0,0,0,0,0,0,0,0,0,0,0,0,0,1e-06,0,0,0,0,0,0,0,0,0,-1e-06,0,0,0,0,-1e-06,0,0,0,0,-1e-06,0,0,0,0,0,0,0,0,0,0,0,0,-1e-06,0,0,0,0,0,0,0,-1e-06,1e-06,0,0,0,0,0,0,0,0,0,1e-06,0,-1e-06,0,0,0,0,-1e-06,0,0,0,0,0,0,0,-1e-06,0,0,0,0,0,0,0,0,0,0,0,0,0
0,0,0,0,0,0,0,0,0,0,0,0,0,0,0,0,0,0,0,0,0,0,0,0,0,0,0,0,0,0,0,0,0,0,0,0,0,0,0,0,0,0,0,0,0,0,0,0,0,0,-1e-06,0,0,0,0,-1e-06,0,0,0,0,-1e-06,0,0,0,0,0,0,0,0,0,0,0,0,0,0,0,-1e-06,0,0,0,0,-1e-06,0,0,0,0,0,0,0,0,0,0,0,0,-1e-06,0,0,0,0,0,0,0,0,0,0,0,0,0,1e-06,0,0,0,0,0,0,0,0,0,0,0,0
0,0,0,0,0,0,0,0,0,0,0,1e-06,0,0,0,0,0,0,0,0,0,0,0,0,0,0,-1e-06,0,0,0,0,0,0,0,0,0,0,0,0,0,-1e-06,0,0,0,0,0,0,0,0,0,-1e-06,0,0,0,0,-1e-06,0,0,0,0,-1e-06,0,0,0,0,0,0,0,0,0,0,0,0,-1e-06,0,0,-1e-06,0,0,0,0,-1e-06,-1e-06,0,0,0,0,0,0,0,0,0,-1e-06,0,-1e-06,0,0,0,0,0,0,0,0,0,0,0,0,1e-06,0,0,0,0,0,0,0,-1e-06,0,0,0,0,0
