0.043014,0.043478,0.044424,0.043363,0.040615,0.043057,0.047933,0.049538,0.0493,0.048219,0.044562,0.040591,0.045473,0.047129,0.042435,0.041067,0.037709,0.036305,0.037043,0.033673,0.030246,0.024717,0.020415,0.021681,0.02293,0.022869,0.022733,0.024913
0.053607,0.054394,0.054938,0.053669,0.051348,0.055161,0.060782,0.061661,0.060716,0.05959,0.055048,0.049912,0.056253,0.05868,0.052895,0.051031,0.046656,0.044588,0.045489,0.041477,0.037151,0.030533,0.025297,0.027,0.028826,0.028523,0.028133,0.03075
0.072659,0.073406,0.072139,0.070541,0.069478,0.075568,0.082127,0.081224,0.078317,0.076747,0.071206,0.064627,0.072781,0.076177,0.068847,0.065954,0.060157,0.05719,0.058318,0.053307,0.047756,0.039814,0.033007,0.035548,0.038583,0.03767,0.036652,0.039563
0.089993,0.089441,0.084293,0.081494,0.082651,0.089981,0.095029,0.09211,0.086899,0.083555,0.078475,0.073067,0.079955,0.082853,0.075955,0.071744,0.065853,0.063329,0.064314,0.059035,0.053685,0.045795,0.037399,0.040313,0.045005,0.043524,0.041422,0.043134
0.103626,0.102157,0.091159,0.083808,0.087181,0.094175,0.095487,0.093678,0.087249,0.079214,0.07505,0.073932,0.076986,0.07851,0.075458,0.06945,0.06445,0.064765,0.06423,0.059204,0.056153,0.049012,0.038888,0.041157,0.047284,0.046041,0.042991,0.041648
0.111209,0.107953,0.091649,0.081319,0.085674,0.09101,0.089223,0.090653,0.086364,0.074012,0.067669,0.068443,0.068724,0.072797,0.077735,0.070912,0.063612,0.065101,0.06216,0.056753,0.057542,0.052475,0.041645,0.041282,0.046942,0.047753,0.045172,0.04066
0.105939,0.103542,0.089821,0.079501,0.079197,0.083523,0.083682,0.088547,0.086761,0.073956,0.064155,0.059985,0.060944,0.071522,0.081416,0.073517,0.063762,0.064031,0.058861,0.052237,0.057686,0.057583,0.046206,0.041868,0.046274,0.049742,0.04764,0.041477
0.097777,0.102629,0.097075,0.083613,0.072586,0.074202,0.081954,0.096136,0.093982,0.083613,0.07393,0.061691,0.068034,0.08248,0.084371,0.073425,0.067319,0.068138,0.063076,0.05554,0.062886,0.066702,0.054133,0.047171,0.049953,0.052891,0.051359,0.04614
0.110898,0.127696,0.132285,0.110194,0.085602,0.082978,0.099112,0.126256,0.119013,0.112263,0.107513,0.085305,0.098451,0.112907,0.099036,0.086847,0.087826,0.089503,0.083375,0.074299,0.082735,0.085839,0.07081,0.063721,0.063811,0.064258,0.06307,0.058013
0.147302,0.175364,0.181737,0.147864,0.115787,0.114284,0.137242,0.17344,0.160357,0.154914,0.151956,0.119445,0.139785,0.15604,0.129792,0.116465,0.120924,0.120452,0.11075,0.101476,0.114658,0.117373,0.097819,0.08927,0.087186,0.08564,0.084028,0.077678
0.18091,0.215943,0.215936,0.172866,0.143276,0.149325,0.173817,0.207608,0.193215,0.189477,0.181961,0.143364,0.169325,0.188206,0.15738,0.142303,0.14545,0.140525,0.128874,0.124645,0.142479,0.14224,0.117749,0.109082,0.10655,0.10259,0.100077,0.095017
0.193676,0.230482,0.223514,0.174359,0.151385,0.168111,0.185397,0.201874,0.195562,0.198681,0.180365,0.139111,0.16263,0.185468,0.167583,0.153021,0.147129,0.138009,0.131259,0.135597,0.149971,0.141566,0.115188,0.110488,0.108997,0.10214,0.10087,0.102375
0.181532,0.21897,0.221629,0.170118,0.143818,0.166857,0.174452,0.168485,0.175727,0.200586,0.172596,0.11822,0.125129,0.153036,0.16727,0.159053,0.136948,0.123345,0.127868,0.139311,0.137938,0.117828,0.095231,0.098028,0.098535,0.089404,0.089978,0.101892
0.162433,0.197942,0.218449,0.172654,0.136956,0.159562,0.165127,0.155579,0.167581,0.201085,0.171581,0.107305,0.09733,0.123805,0.163565,0.16335,0.131353,0.115841,0.127127,0.1391,0.124959,0.100166,0.083078,0.089982,0.089686,0.081502,0.082092,0.097317
0.149624,0.178843,0.197421,0.173014,0.14445,0.151354,0.16008,0.157363,0.157695,0.178542,0.161123,0.113505,0.103362,0.121192,0.152769,0.155721,0.128277,0.114324,0.123906,0.136145,0.129917,0.107943,0.088685,0.091814,0.089851,0.080112,0.074327,0.08614
0.18019,0.198908,0.194463,0.196827,0.188326,0.181162,0.204423,0.198092,0.16127,0.159498,0.164559,0.1482,0.148943,0.161694,0.16613,0.16311,0.148039,0.136155,0.131809,0.147555,0.168027,0.147228,0.119761,0.120108,0.1137,0.092794,0.072199,0.080968
0.255393,0.268849,0.258134,0.283592,0.272897,0.25477,0.303038,0.289508,0.215191,0.207173,0.230299,0.223453,0.226917,0.235854,0.230915,0.228647,0.218888,0.203465,0.181875,0.202251,0.243826,0.215749,0.176818,0.179517,0.16328,0.124361,0.09297,0.109531
0.318069,0.326273,0.332358,0.387066,0.355092,0.320739,0.400181,0.388232,0.28329,0.274264,0.311573,0.307325,0.306264,0.301388,0.294719,0.301603,0.300323,0.28444,0.249966,0.271845,0.31769,0.281428,0.236819,0.23972,0.209359,0.157117,0.125352,0.154564
0.330036,0.330836,0.363008,0.440813,0.391418,0.339796,0.42923,0.424463,0.314748,0.311946,0.360659,0.356823,0.342832,0.317788,0.308642,0.326217,0.340789,0.33803,0.302508,0.31303,0.34311,0.307319,0.26535,0.262823,0.222425,0.169677,0.14804,0.190053
0.297209,0.301047,0.341739,0.405866,0.366043,0.314667,0.366637,0.358589,0.282948,0.30362,0.367185,0.353352,0.311686,0.275452,0.269319,0.292981,0.313697,0.33012,0.310265,0.306143,0.324564,0.299767,0.251187,0.233225,0.19868,0.159323,0.152448,0.205085
0.250399,0.261279,0.285329,0.316993,0.314265,0.285004,0.271544,0.246171,0.217969,0.254845,0.31679,0.297168,0.247167,0.219201,0.22795,0.245882,0.244826,0.275647,0.277615,0.269587,0.300545,0.288542,0.222038,0.186377,0.17229,0.150367,0.149911,0.205363
0.215919,0.225263,0.225399,0.235637,0.260947,0.243868,0.209902,0.186407,0.161859,0.185259,0.228091,0.218296,0.19661,0.17824,0.203022,0.234652,0.218257,0.239034,0.240938,0.231328,0.264309,0.253271,0.192409,0.158638,0.154236,0.143864,0.15057,0.198463
0.184322,0.196482,0.187219,0.187871,0.217158,0.202554,0.187739,0.169836,0.125973,0.126948,0.150429,0.160498,0.161046,0.137566,0.169161,0.218625,0.210916,0.213158,0.198336,0.182081,0.200698,0.194829,0.163104,0.139312,0.134672,0.142945,0.156241,0.178668
0.154643,0.169299,0.177136,0.172535,0.17606,0.159059,0.16579,0.158143,0.114861,0.101578,0.114319,0.135923,0.136029,0.113325,0.144176,0.182208,0.175399,0.163143,0.145464,0.13623,0.141398,0.142224,0.135432,0.115122,0.106375,0.131205,0.143763,0.141213
0.121159,0.135292,0.152541,0.142178,0.13384,0.125341,0.135133,0.139364,0.119067,0.103639,0.099224,0.110519,0.112638,0.105192,0.121066,0.130082,0.119772,0.102315,0.095628,0.099982,0.092307,0.090207,0.100699,0.088503,0.0739,0.098701,0.10718,0.09772
0.090512,0.105747,0.118423,0.09683,0.08478,0.088564,0.093475,0.104103,0.11308,0.100406,0.078065,0.079526,0.084234,0.085346,0.085974,0.081358,0.078232,0.064197,0.059536,0.063778,0.053224,0.049336,0.0625,0.060579,0.049865,0.061565,0.064739,0.060164
0.073777,0.084018,0.087876,0.066092,0.055723,0.060702,0.06159,0.07277,0.092209,0.081723,0.053946,0.054047,0.058081,0.056744,0.053605,0.053584,0.061759,0.057461,0.048775,0.046071,0.039631,0.032318,0.034547,0.036609,0.034369,0.034637,0.037086,0.039642
0.066101,0.063866,0.072963,0.069417,0.055713,0.048645,0.046971,0.055663,0.068872,0.061276,0.039637,0.039506,0.042411,0.041528,0.043318,0.04651,0.055997,0.057058,0.047714,0.04651,0.04369,0.031415,0.025881,0.026977,0.027909,0.025201,0.025424,0.028017
0.059627,0.05763,0.076032,0.084169,0.063423,0.04809,0.047733,0.057106,0.066051,0.056646,0.040189,0.040714,0.048053,0.051848,0.052884,0.050913,0.057122,0.061865,0.050418,0.046727,0.046896,0.037834,0.034547,0.036405,0.033744,0.0275,0.028278,0.035233
0.071345,0.069426,0.082473,0.098549,0.075654,0.055439,0.061764,0.073909,0.082159,0.06925,0.05383,0.052508,0.065862,0.075838,0.073841,0.065427,0.064942,0.071347,0.057728,0.048367,0.050779,0.0515,0.056118,0.058525,0.047282,0.037448,0.043056,0.055757
0.08819,0.082604,0.085622,0.112409,0.093722,0.065705,0.072623,0.092823,0.105941,0.090676,0.074773,0.072614,0.091101,0.108029,0.105761,0.092648,0.086331,0.087379,0.065911,0.054678,0.060567,0.073004,0.086376,0.085211,0.065519,0.053284,0.063469,0.082347
0.094442,0.084902,0.084973,0.117769,0.10339,0.067806,0.068724,0.097124,0.115447,0.102075,0.089881,0.088269,0.108023,0.129945,0.129964,0.115111,0.104573,0.10097,0.076619,0.064042,0.069666,0.093058,0.114807,0.105511,0.079085,0.066779,0.079323,0.101574
0.079985,0.072526,0.077032,0.10254,0.092476,0.057313,0.051382,0.079609,0.097469,0.090325,0.085981,0.085408,0.1008,0.123051,0.126857,0.11462,0.102057,0.098344,0.080051,0.06467,0.065294,0.096529,0.127381,0.112765,0.084116,0.072755,0.080943,0.099108
0.050631,0.047228,0.055925,0.069437,0.063374,0.039808,0.035281,0.051606,0.06092,0.060743,0.062388,0.061827,0.06976,0.086545,0.092802,0.086366,0.074937,0.074861,0.068171,0.053043,0.048147,0.077924,0.115159,0.107737,0.080372,0.068667,0.065919,0.073537
0.025178,0.025162,0.034268,0.040303,0.033766,0.02531,0.024954,0.026964,0.032667,0.03833,0.036788,0.033225,0.03489,0.042976,0.048939,0.048415,0.040309,0.043517,0.047569,0.040116,0.034447,0.050238,0.081009,0.084049,0.063597,0.053498,0.043099,0.04245
0.018007,0.017166,0.026436,0.02787,0.019033,0.01695,0.017115,0.01525,0.022713,0.02843,0.023594,0.02082,0.016889,0.016283,0.022038,0.026669,0.021112,0.024907,0.034026,0.032196,0.027712,0.03026,0.043836,0.049552,0.038912,0.032828,0.024854,0.023237
0.016296,0.015057,0.023083,0.022727,0.015263,0.01243,0.01228,0.013119,0.020389,0.022901,0.022257,0.019182,0.014058,0.012025,0.015291,0.019383,0.018565,0.021165,0.027535,0.025497,0.023504,0.021979,0.022674,0.021478,0.018966,0.01745,0.014908,0.016928
0.013557,0.014425,0.018542,0.016745,0.012617,0.009979,0.010072,0.012968,0.019233,0.02219,0.021613,0.016108,0.013526,0.012525,0.011126,0.014555,0.015949,0.016309,0.021249,0.020671,0.019841,0.019985,0.013881,0.008817,0.012017,0.013821,0.012998,0.01727
0.011411,0.013215,0.014342,0.013566,0.010408,0.009191,0.008665,0.011334,0.016267,0.020023,0.017933,0.011475,0.012704,0.012696,0.009185,0.014078,0.014654,0.012836,0.01575,0.01528,0.015432,0.015967,0.009515,0.006717,0.011017,0.01446,0.012991,0.015201
0.012801,0.011035,0.01097,0.012146,0.010757,0.011938,0.009305,0.008972,0.012232,0.015599,0.012299,0.008194,0.01301,0.012299,0.009145,0.014662,0.014727,0.012798,0.012742,0.012205,0.012582,0.010701,0.007686,0.007279,0.00989,0.014509,0.011837,0.010417
