0.096096,0.096702,0.090415,0.085579,0.081214,0.081645,0.084558,0.089349,0.091641,0.091306,0.092815,0.096803,0.102443,0.1054,0.105998,0.107745,0.11082,0.109188,0.10133,0.092493,0.105337,0.117691,0.107334,0.094571,0.089102,0.085352,0.081199,0.095126
0.119088,0.118149,0.110686,0.104908,0.098539,0.100544,0.107706,0.115351,0.115556,0.112268,0.115299,0.124602,0.134476,0.138726,0.140323,0.144743,0.148334,0.14421,0.133507,0.122065,0.137368,0.150835,0.13754,0.121828,0.115275,0.110881,0.105589,0.12569
0.159011,0.152782,0.144207,0.138056,0.128684,0.133569,0.149138,0.162589,0.157358,0.147317,0.15478,0.176062,0.192651,0.197258,0.201726,0.213604,0.219085,0.210307,0.193953,0.178861,0.198479,0.212668,0.193964,0.173796,0.167457,0.161978,0.151254,0.181311
0.188488,0.17586,0.167934,0.163003,0.151841,0.158817,0.182135,0.201898,0.192042,0.173656,0.186421,0.221706,0.240349,0.242908,0.252889,0.271899,0.277868,0.265622,0.246332,0.231722,0.255555,0.268878,0.247162,0.226393,0.221742,0.21303,0.192825,0.228588
0.199361,0.184703,0.179786,0.177442,0.169022,0.177068,0.199365,0.218833,0.209186,0.189941,0.207765,0.245409,0.255183,0.255349,0.26918,0.288082,0.294836,0.284714,0.268112,0.259831,0.285532,0.296072,0.276148,0.263027,0.258416,0.240686,0.211486,0.242838
0.222554,0.212179,0.211303,0.217028,0.212732,0.224013,0.240373,0.245077,0.238244,0.23553,0.2567,0.271381,0.260769,0.262021,0.266877,0.277333,0.299812,0.300244,0.282357,0.279365,0.305839,0.31352,0.296173,0.297424,0.290093,0.253882,0.215922,0.231609
0.327658,0.331996,0.324547,0.327336,0.327954,0.36239,0.384089,0.361642,0.35251,0.376527,0.400463,0.377774,0.341947,0.3533,0.344056,0.356535,0.406824,0.409169,0.379672,0.364176,0.406041,0.432554,0.395732,0.399909,0.390608,0.321839,0.275957,0.284297
0.558324,0.600291,0.564947,0.532252,0.539647,0.631537,0.670154,0.617578,0.605002,0.653322,0.686986,0.625156,0.563092,0.59731,0.577714,0.604979,0.686685,0.667789,0.623376,0.580281,0.654658,0.732334,0.628313,0.613745,0.639742,0.548115,0.467012,0.467756
0.926967,1.046986,0.965609,0.849144,0.858287,1.049384,1.1192,1.030844,1.025668,1.11455,1.172087,1.049999,0.944224,1.029701,1.001048,1.035028,1.163617,1.120108,1.057851,0.956823,1.070112,1.249564,1.033934,0.977208,1.083957,0.964907,0.807785,0.798382
1.38536,1.631773,1.486894,1.230827,1.232016,1.551078,1.653017,1.540068,1.581157,1.73118,1.821444,1.616721,1.459569,1.631399,1.579156,1.599428,1.800798,1.754594,1.672836,1.47054,1.623534,1.956755,1.599832,1.476118,1.693141,1.541795,1.276936,1.262028
1.753573,2.140738,1.957935,1.551703,1.51742,1.931622,2.039709,1.934042,2.069371,2.281268,2.4043,2.134237,1.957866,2.222293,2.113443,2.111413,2.41633,2.404604,2.291692,1.937707,2.107284,2.62743,2.157259,1.963151,2.297693,2.130786,1.752688,1.719064
1.790142,2.240175,2.082157,1.616714,1.531911,1.933104,2.005058,1.943173,2.184061,2.408768,2.535761,2.286682,2.170556,2.468947,2.276737,2.258462,2.653411,2.710072,2.560371,2.069847,2.213183,2.860967,2.384673,2.150411,2.557388,2.418675,1.984958,1.908584
1.436668,1.793178,1.704251,1.340316,1.235009,1.509651,1.536489,1.52276,1.773277,1.934077,2.039589,1.917694,1.9116,2.134793,1.902268,1.887289,2.272748,2.374214,2.192814,1.703565,1.81594,2.406489,2.029102,1.820351,2.196299,2.142928,1.798751,1.663703
0.991785,1.13225,1.08492,0.945981,0.875054,0.972285,0.967729,0.975086,1.116404,1.188066,1.279726,1.273153,1.30905,1.409651,1.209987,1.185419,1.447856,1.529949,1.404226,1.130382,1.230882,1.567518,1.328688,1.194194,1.417511,1.442707,1.285907,1.153449
0.895892,0.774907,0.752236,0.920479,0.913069,0.801566,0.77621,0.822387,0.855782,0.863928,0.905822,0.933811,0.99692,1.045649,0.857725,0.773343,0.842972,0.874117,1.071145,1.151095,1.193302,1.226455,1.014991,0.872934,0.894336,0.9425,0.920124,0.892994
1.352326,1.021929,0.992501,1.380839,1.366764,1.091747,1.09157,1.204933,1.208683,1.202027,1.172066,1.196008,1.366301,1.486747,1.206626,0.976101,0.928917,0.936588,1.378218,1.67708,1.733824,1.616186,1.328447,1.137184,1.039903,1.075708,1.047031,1.104342
2.019171,1.518283,1.482668,2.013903,1.992246,1.648631,1.689626,1.824949,1.782587,1.722443,1.606168,1.669012,1.997103,2.187078,1.776575,1.432087,1.362406,1.36251,1.836712,2.195845,2.375192,2.222224,1.867047,1.670988,1.491257,1.491759,1.419109,1.487207
2.609886,2.040185,2.038109,2.546366,2.523645,2.280027,2.405561,2.451291,2.288344,2.162418,1.968644,2.046306,2.471641,2.715197,2.25235,1.863899,1.829199,1.828817,2.129727,2.408387,2.750553,2.68427,2.385585,2.211056,1.959589,1.921835,1.772735,1.817968
2.97748,2.506086,2.537644,2.775254,2.765329,2.840722,3.095041,2.949615,2.639928,2.483515,2.259676,2.207063,2.501422,2.811103,2.471683,2.111359,2.14971,2.167094,2.208138,2.292101,2.744112,2.895993,2.811708,2.631398,2.311842,2.239148,2.017664,2.105545
3.280936,2.849112,2.949187,2.950362,2.888371,3.200011,3.510446,3.193825,2.818632,2.696643,2.573294,2.338715,2.239835,2.481625,2.393696,2.142901,2.254875,2.380192,2.302154,2.176083,2.687556,3.146761,3.231207,2.8457,2.399219,2.324922,2.132855,2.347851
3.368097,2.944017,3.164189,3.086276,2.895244,3.211658,3.463182,3.052351,2.729468,2.711364,2.768605,2.497525,2.016781,2.060393,2.099974,1.961782,2.199475,2.436795,2.348787,2.158094,2.609359,3.207371,3.415688,2.821523,2.181892,2.102988,2.027206,2.325194
2.920653,2.671274,2.974836,2.920644,2.69984,2.860679,2.969027,2.543694,2.289883,2.420842,2.573996,2.317983,1.833948,1.838641,1.783069,1.662765,1.956288,2.183486,2.150475,1.967892,2.148696,2.637282,2.940563,2.456439,1.792217,1.668719,1.673702,1.917623
2.128377,2.123732,2.37,2.269595,2.189043,2.170987,2.082062,1.826192,1.676574,1.894652,2.076446,1.887292,1.516246,1.499793,1.472493,1.395799,1.644073,1.8241,1.825494,1.695677,1.664723,1.826222,2.015392,1.838996,1.437618,1.35388,1.303117,1.314206
1.670581,1.719828,1.845023,1.606022,1.61355,1.614217,1.383293,1.227827,1.256484,1.488199,1.663836,1.592857,1.231345,1.09277,1.226522,1.283599,1.369799,1.504346,1.562691,1.525865,1.447478,1.293404,1.340652,1.355544,1.094965,1.036484,1.062616,1.132513
1.609777,1.572643,1.761213,1.659348,1.519952,1.404021,1.069135,0.871527,1.018221,1.333678,1.490993,1.550488,1.269459,0.95823,1.158685,1.398968,1.435327,1.464304,1.422751,1.412664,1.381512,1.073084,1.000677,1.133545,1.006122,0.897148,0.938571,1.175407
1.594089,1.487802,1.75007,1.933715,1.66697,1.311779,1.004176,0.813201,0.933846,1.241809,1.351377,1.498379,1.361538,0.980609,1.133281,1.443939,1.526433,1.443904,1.199566,1.267055,1.407313,1.041825,0.947852,1.183572,1.104573,0.918988,0.853878,1.091006
1.547532,1.410082,1.74144,2.055714,1.786348,1.283407,1.009158,0.912413,0.959679,1.155512,1.240172,1.328395,1.208058,0.926601,1.056154,1.308563,1.382323,1.202569,0.89503,1.119952,1.423613,1.061911,1.023518,1.298189,1.168798,0.953133,0.835089,0.974369
1.409887,1.331836,1.567484,1.834659,1.66679,1.230301,0.983739,0.991103,1.018187,1.013719,1.048116,1.023441,0.839178,0.712028,0.873655,1.071776,1.092373,0.880483,0.684955,0.95278,1.235906,1.000838,1.041438,1.257489,1.112427,0.943989,0.865903,0.887209
1.089864,1.111704,1.242101,1.377767,1.277427,1.122971,0.966979,0.982733,0.995188,0.86351,0.898237,0.835518,0.608699,0.5335,0.654526,0.889115,0.99092,0.789363,0.625279,0.754334,0.910912,0.860831,0.914635,0.988287,0.936296,0.879471,0.839158,0.815571
0.718237,0.841022,1.000581,0.977923,0.86,0.935931,0.857818,0.867122,0.844048,0.704224,0.778771,0.74406,0.542923,0.447071,0.52567,0.749922,0.902967,0.781127,0.640335,0.608074,0.676932,0.782368,0.74144,0.647343,0.677861,0.688646,0.663957,0.71415
0.475605,0.663603,0.876005,0.826017,0.695919,0.742061,0.699926,0.68828,0.584182,0.504313,0.608224,0.57598,0.432867,0.389495,0.459682,0.635727,0.759379,0.697948,0.656612,0.574395,0.588845,0.762208,0.6381,0.457931,0.496298,0.52341,0.482107,0.533603
0.335749,0.536447,0.711888,0.656221,0.52242,0.530215,0.548879,0.490874,0.378032,0.324459,0.407679,0.433917,0.360782,0.354911,0.386225,0.542434,0.672414,0.645849,0.675334,0.580009,0.583949,0.713777,0.501175,0.298821,0.390765,0.50124,0.45864,0.402045
0.253129,0.41187,0.495399,0.485842,0.416633,0.395872,0.418598,0.353071,0.289092,0.23885,0.264704,0.344142,0.339733,0.339343,0.332009,0.438114,0.557695,0.549868,0.578693,0.516453,0.538469,0.582718,0.366026,0.200266,0.325963,0.478316,0.438301,0.349475
0.240133,0.332606,0.384692,0.478531,0.454408,0.325413,0.289241,0.266572,0.234408,0.20168,0.198148,0.24975,0.286495,0.297256,0.261253,0.322595,0.390005,0.380371,0.38389,0.386298,0.448625,0.407315,0.223624,0.14485,0.247907,0.370308,0.350392,0.317489
0.220608,0.262535,0.349466,0.518004,0.474415,0.274386,0.184726,0.205586,0.193577,0.167669,0.1762,0.169737,0.1994,0.219159,0.178283,0.208995,0.252261,0.248472,0.226186,0.281413,0.40309,0.314954,0.126929,0.108415,0.186971,0.256403,0.250618,0.250134
0.179326,0.185381,0.284882,0.46361,0.403511,0.207217,0.12284,0.176267,0.185046,0.168903,0.164063,0.12394,0.151908,0.159516,0.123762,0.12346,0.146823,0.165173,0.155657,0.224535,0.342738,0.264218,0.108887,0.102046,0.167365,0.219977,0.205538,0.175179
0.136554,0.145428,0.221766,0.327602,0.262891,0.132352,0.095015,0.149732,0.157544,0.163785,0.147922,0.105179,0.131402,0.121696,0.096397,0.084884,0.101391,0.135778,0.131642,0.188233,0.257197,0.212799,0.132889,0.116416,0.15176,0.223779,0.216616,0.14915
0.124368,0.139832,0.163992,0.196548,0.135021,0.074858,0.077209,0.109079,0.120746,0.150921,0.138323,0.103596,0.117032,0.085808,0.064358,0.065508,0.076691,0.105422,0.103117,0.144452,0.168261,0.148261,0.143585,0.131637,0.123094,0.201579,0.22642,0.149256
0.10971,0.127334,0.141094,0.161888,0.092534,0.04638,0.067196,0.080847,0.100869,0.143923,0.122742,0.109217,0.118032,0.069557,0.043524,0.05736,0.059321,0.070747,0.086886,0.122715,0.11704,0.10687,0.130476,0.144693,0.106091,0.159989,0.204939,0.130635
0.097098,0.109617,0.123146,0.157819,0.091783,0.051085,0.075779,0.08705,0.099065,0.129617,0.110559,0.108082,0.112094,0.064691,0.035751,0.052018,0.054698,0.050501,0.086062,0.109188,0.084815,0.079836,0.103878,0.156078,0.114687,0.126921,0.16521,0.117049
