2e-06,-1e-06,-2e-06,-4e-06,-0.001285,-0.010267,-0.00833,-0.010689,-0.062188,-0.182104,-0.226469,-0.210962,-0.172422,-0.148265,-0.130388,-0.119549,-0.087789,-0.05819,-0.013954,-0.00911,-0.007393,-0.000735,-0.000262,-3.5e-05,-7.5e-05,-0.000331,-0.000175,-1.3e-05
1e-06,0,2e-06,1e-06,-0.000251,0.002257,0.001414,0.0027,0.031972,-0.014076,-0.03514,0.019795,0.121643,0.112708,0.080226,0.092451,0.090049,0.058863,0.014202,-0.005095,-0.008806,-0.001026,-8.1e-05,-1.1e-05,-2.7e-05,-0.000138,-5.2e-05,6e-06
1e-06,0,0,2e-06,0.00015,-0.001172,-0.000992,0.001678,-0.006483,-0.021661,-0.027502,-0.023775,-0.010518,-0.008121,-0.008232,-0.000834,-0.003272,0.003263,0.001405,-0.001801,-0.003774,-3.4e-05,0.000106,3e-06,3.9e-05,0.000198,8.3e-05,-4e-06
2e-06,0,2e-06,6e-06,0.000429,0.000361,0.000303,-0.001187,-0.046858,-0.073219,-0.053693,-0.078329,-0.15331,-0.125884,-0.09498,-0.105786,-0.088803,-0.061739,-0.014881,-0.000346,0.001148,0.000383,0.000124,1.8e-05,4.9e-05,0.000225,9.5e-05,-8e-06
1e-06,1e-06,4e-06,5e-06,0.000551,0.007424,0.005467,0.00483,0.051469,0.125285,0.17097,0.187517,0.149255,0.129998,0.114427,0.103131,0.080382,0.045623,0.011126,0.006093,0.008777,0.000957,-2.8e-05,2.4e-05,2.2e-05,-2.8e-05,1.3e-05,1e-05
-3e-06,-3e-06,-3e-06,-5e-06,-0.000746,-0.005402,-0.0035,-0.00255,0.017561,0.102722,0.122194,0.116161,0.11026,0.07434,0.056488,0.06208,0.035745,0.031408,0.008176,0.001786,-0.000186,-0.00057,-0.000122,-2.4e-05,-4.1e-05,-0.000229,-0.000115,-7e-06
-1e-06,-1e-06,-1e-06,-3e-06,-0.000729,-0.006648,-0.004321,-0.008098,-0.065682,-0.114714,-0.165688,-0.20329,-0.177687,-0.153617,-0.13212,-0.132245,-0.0972,-0.060556,-0.015478,-0.005045,-0.005185,-0.000381,0,-3.6e-05,-3.7e-05,-6.6e-05,-6.2e-05,-1.5e-05
2e-06,2e-06,2e-06,4e-06,0.000628,0.006234,0.004135,0.002745,0.008983,-0.069226,-0.122657,-0.094121,-0.005212,0.013861,0.010753,0.00911,0.023756,0.005947,0.001512,-0.0027,-0.004868,-0.000361,9.4e-05,1.2e-05,4.2e-05,0.000206,0.000107,7e-06
2e-06,1e-06,1e-06,4e-06,0.000566,0.002604,0.001547,0.006084,0.026292,0.046457,0.075233,0.089716,0.107677,0.091724,0.076036,0.089489,0.060558,0.0445,0.011523,0.001473,-9.3e-05,-3.3e-05,7e-06,2.1e-05,3.5e-05,0.000116,7.4e-05,6e-06
2e-06,2e-06,3e-06,2e-06,-7e-06,-0.00148,-0.001311,-0.002221,-0.033603,0.000213,0.059926,0.004176,-0.10251,-0.082659,-0.062431,-0.068441,-0.055395,-0.029912,-0.009273,-0.000977,0.001624,0.000143,-8.7e-05,9e-06,-9e-06,-0.000101,-5.4e-05,-2e-06
1e-06,2e-06,1e-06,-2e-06,-0.000287,0.00055,0.000117,-0.004362,0.000629,-0.006579,0.011277,0.032812,-0.008723,9.7e-05,0.00324,-0.013501,-0.003896,-0.015191,-0.004212,0.000163,0.00347,0.000466,-1.5e-05,-8e-06,-2.1e-05,-0.000116,-4.9e-05,9e-06
1e-06,1e-06,0,0,-0.00056,-0.003995,-0.001998,0.001023,0.028955,0.046332,0.029005,0.086223,0.136629,0.094826,0.06843,0.085564,0.050547,0.035788,0.011243,0.002029,-3e-05,-0.000145,8.7e-05,-1.5e-05,7e-06,3.7e-05,1.5e-05,4e-06
2e-06,0,2e-06,3e-06,-9e-06,-0.001984,-0.000952,0.001265,-0.020661,-0.010613,-0.041714,-0.083055,-0.064958,-0.068332,-0.057947,-0.052749,-0.037919,-0.010514,-0.004105,-0.003565,-0.004272,-0.000357,1.3e-05,3e-06,1.8e-05,0.000104,3.5e-05,-5e-06
1e-06,1e-06,1e-06,2e-06,0.000668,0.005723,0.00349,-0.000466,-0.004205,-0.059723,-0.107393,-0.130954,-0.091218,-0.055509,-0.032826,-0.060159,-0.029937,-0.029445,-0.009124,-0.00579,-0.004577,-0.000207,-7.7e-05,1.3e-05,1.8e-05,3.8e-05,2.8e-05,6e-06
-2e-06,0,0,-1e-06,0.000165,0.001469,0.000986,0.001363,0.019502,0.000159,0.018478,0.055902,0.090909,0.092194,0.073408,0.08044,0.049594,0.025227,0.008079,0.002741,0.001795,-3.9e-05,-2.6e-05,7e-06,-2e-06,-5.5e-05,-1.6e-05,3e-06
-3e-06,-2e-06,0,-3e-06,-0.000366,-0.003185,-0.002325,-0.001218,-0.021454,0.030169,0.127334,0.097627,0.002547,-0.002076,-0.010338,0.011937,0.0069,0.016152,0.002631,0.008115,0.009906,0.000771,7e-05,5e-06,-1.1e-05,-6.3e-05,-4.5e-05,-8e-06
-5e-06,-4e-06,-3e-06,-4e-06,-0.000267,-9e-04,-0.000656,-0.003775,-0.02004,-0.010274,0.014995,-0.000721,-0.074883,-0.074115,-0.051481,-0.065507,-0.037839,-0.029408,-0.009076,0.002105,0.003511,7.8e-05,1.4e-05,-5e-06,0,9e-06,-1e-06,-4e-06
-5e-06,-3e-06,-1e-06,0,0.000115,0.000538,0.000635,0.001808,0.010349,-0.013306,-0.076628,-0.002541,0.076664,0.050196,0.034946,0.035463,0.012852,0.000317,0.003145,-0.001481,-0.001921,-0.000165,1e-06,-3e-06,2.2e-05,9.4e-05,4.5e-05,-2e-06
-3e-06,-1e-06,0,0,0.000333,0.001048,0.00013,0.000819,-0.006905,0.015297,-0.013243,-0.021755,0.033608,0.0267,0.003496,0.022223,0.017195,0.024393,0.005748,-0.004059,-0.005527,-0.000401,-2.3e-05,1.2e-05,1.3e-05,2.2e-05,3e-06,-5e-06
