0.119407,0.11772,0.100229,0.089879,0.091417,0.091999,0.099922,0.109782,0.131812,0.159524,0.161064,0.163716,0.169146,0.149327,0.122409,0.125269,0.131946,0.11842,0.115094,0.130483,0.141511,0.131594,0.115231,0.112037,0.122389,0.12682,0.121453,0.117883
0.148005,0.145979,0.124944,0.113236,0.114661,0.115463,0.125151,0.137307,0.16323,0.192903,0.193281,0.198772,0.204174,0.179186,0.150675,0.156648,0.16144,0.143306,0.140978,0.161454,0.175575,0.162326,0.14137,0.137261,0.152825,0.157883,0.145591,0.139054
0.196538,0.193384,0.166558,0.151813,0.151449,0.153246,0.166135,0.181676,0.212254,0.242376,0.241119,0.2519,0.255335,0.222152,0.194706,0.208366,0.208556,0.181665,0.182098,0.211228,0.229773,0.212145,0.186033,0.18027,0.203096,0.206632,0.18071,0.169149
0.235822,0.22954,0.196637,0.176553,0.172769,0.176478,0.190414,0.208625,0.240006,0.264166,0.263599,0.278563,0.272919,0.234202,0.219334,0.244033,0.236801,0.204118,0.209971,0.243859,0.262836,0.246115,0.224099,0.215881,0.233116,0.229987,0.198404,0.184443
0.259782,0.261128,0.226485,0.194978,0.188255,0.193642,0.205634,0.22516,0.253348,0.270694,0.276426,0.298375,0.275719,0.226765,0.235874,0.268988,0.246379,0.215948,0.230483,0.261574,0.276225,0.265309,0.256847,0.248443,0.243119,0.231137,0.216834,0.204858
0.297908,0.325211,0.288805,0.24386,0.239761,0.239399,0.250732,0.27115,0.286611,0.301099,0.327646,0.362754,0.309382,0.237537,0.279779,0.325743,0.277591,0.24577,0.27257,0.310387,0.326643,0.306689,0.300985,0.298095,0.27148,0.256935,0.27343,0.266667
0.394458,0.433442,0.389956,0.332978,0.331131,0.324662,0.349589,0.385837,0.390454,0.403891,0.455479,0.514744,0.427368,0.322825,0.394368,0.452155,0.378833,0.33743,0.381877,0.429364,0.432774,0.396664,0.399791,0.404788,0.359458,0.343168,0.374054,0.377458
0.603294,0.611015,0.555433,0.493551,0.477388,0.459434,0.531386,0.619162,0.617544,0.63839,0.713378,0.812479,0.684585,0.520643,0.619741,0.684242,0.593005,0.544561,0.61621,0.672159,0.647692,0.594658,0.633773,0.66039,0.588817,0.56269,0.582216,0.597092
0.996823,0.967949,0.895828,0.816161,0.763235,0.718664,0.876936,1.050932,1.028419,1.09127,1.2387,1.400879,1.17295,0.889608,1.029319,1.103658,0.983188,0.909033,1.023785,1.120772,1.075333,0.99971,1.109736,1.178545,1.061196,1.024792,1.036794,1.056113
1.611248,1.566115,1.461435,1.33018,1.231406,1.15546,1.40933,1.673506,1.614907,1.779448,2.086292,2.318057,1.907007,1.462041,1.676629,1.790073,1.602981,1.427333,1.575438,1.7701,1.735972,1.647484,1.888201,2.011833,1.818114,1.770432,1.771249,1.784718
2.298841,2.22265,2.09837,1.925837,1.784553,1.6652,1.96839,2.292856,2.221836,2.552766,3.077912,3.346335,2.719993,2.14436,2.461466,2.652505,2.344985,1.962302,2.122236,2.473831,2.509705,2.466211,2.901191,3.060514,2.762587,2.703122,2.672579,2.665911
2.710222,2.572054,2.480853,2.321136,2.149745,1.989061,2.242511,2.568902,2.579486,3.073127,3.763003,4.002035,3.233087,2.645011,3.021783,3.300592,2.88326,2.271512,2.424997,2.939415,3.087763,3.172772,3.809929,3.934037,3.526997,3.458195,3.367653,3.331182
2.481734,2.311504,2.295021,2.189782,2.018741,1.862606,1.984573,2.258368,2.429518,2.951789,3.645339,3.852443,3.142248,2.635058,2.933571,3.266589,2.853564,2.165995,2.301637,2.854912,3.086297,3.32566,4.028148,4.028243,3.564244,3.501808,3.353548,3.285398
1.707398,1.60295,1.633994,1.543579,1.399083,1.32475,1.352613,1.557339,1.861884,2.267967,2.774872,2.973295,2.505294,2.06517,2.159026,2.48848,2.253384,1.735482,1.837816,2.249461,2.479587,2.777091,3.27181,3.128838,2.739206,2.694262,2.544675,2.466908
1.285392,1.246304,1.165097,0.980138,0.866073,0.962339,1.061919,1.21565,1.651316,1.94964,2.026235,2.129308,1.931585,1.512022,1.392214,1.689301,1.663553,1.384086,1.48183,1.701883,1.794017,1.955332,2.119851,1.999959,1.839319,1.746298,1.625505,1.596523
1.88274,1.814181,1.502397,1.137137,1.003898,1.209864,1.400233,1.590767,2.247943,2.586515,2.296663,2.305809,2.294491,1.76049,1.401093,1.671028,1.70107,1.539996,1.778383,1.921803,1.768353,1.742168,1.773145,1.756192,1.766646,1.599384,1.481514,1.499929
2.903498,2.79957,2.225705,1.621678,1.461581,1.816824,2.071184,2.209166,3.043656,3.49206,3.027445,3.045625,3.155953,2.421393,1.855185,2.051502,2.052919,2.086553,2.470287,2.503422,2.212423,2.18333,2.207716,2.060062,2.089232,2.095404,2.00511,1.91136
3.990383,3.923864,3.093356,2.219174,2.05496,2.588643,2.847381,2.758936,3.538305,4.047241,3.696545,3.826477,3.881478,2.959138,2.295048,2.437876,2.499656,2.770656,3.130709,2.989345,2.756268,2.765829,2.622727,2.252858,2.281405,2.621632,2.657531,2.437664
4.91073,5.012748,3.964881,2.89691,2.789421,3.372393,3.46708,3.038601,3.582872,4.0336,4.087078,4.544935,4.234696,3.110952,2.575344,2.791215,3.046839,3.402268,3.564402,3.308263,3.247179,3.330683,2.968186,2.422054,2.362721,2.920086,3.196023,2.979069
5.259825,5.616428,4.464517,3.435554,3.475246,3.899656,3.683196,3.005129,3.290961,3.678466,4.337222,5.218771,4.338732,3.039108,2.777393,2.996857,3.327135,3.619354,3.613222,3.41183,3.535342,3.719676,3.229334,2.549752,2.373625,2.89454,3.372314,3.315789
4.634329,5.180957,4.252479,3.511678,3.676175,3.921958,3.63719,2.93337,2.831409,3.064683,4.164922,5.307902,4.164661,2.814544,2.713772,2.800118,2.936203,3.030967,2.976544,2.951216,3.26475,3.673588,3.210194,2.428791,2.127709,2.453712,3.060804,3.164087
3.344111,3.753682,3.199253,2.895985,3.085542,3.163779,3.15349,2.70159,2.196789,2.267316,3.375418,4.408564,3.495233,2.327721,2.225528,2.159983,2.029671,1.96101,2.029776,2.273348,2.592773,2.971924,2.688318,2.052241,1.72381,1.899052,2.487432,2.544086
2.13038,2.220092,1.955923,1.871134,1.966285,2.04314,2.324552,2.159056,1.63991,1.694871,2.402907,2.989593,2.611584,1.930165,1.682922,1.502978,1.322108,1.288867,1.505663,1.791965,1.845713,1.946581,2.012131,1.746157,1.412048,1.437183,1.851436,1.858079
1.493236,1.58655,1.547717,1.322436,1.130096,1.283898,1.655206,1.644407,1.418142,1.473545,1.676111,1.89807,1.859064,1.576112,1.38518,1.327645,1.164652,1.008788,1.147889,1.436136,1.375875,1.265291,1.462974,1.483036,1.302924,1.208108,1.370394,1.362613
1.417674,1.392063,1.484569,1.265066,0.921271,1.087259,1.485249,1.500092,1.369023,1.381323,1.36789,1.531702,1.491275,1.302366,1.252992,1.364803,1.340474,1.129321,1.152275,1.447226,1.454999,1.215456,1.192424,1.300279,1.365567,1.150192,1.054095,1.076265
1.80023,1.522449,1.45614,1.329444,1.064376,1.229455,1.695271,1.636246,1.489362,1.670551,1.698212,1.803155,1.547498,1.223578,1.129891,1.307944,1.460293,1.295882,1.349063,1.667644,1.640216,1.273485,1.125704,1.343141,1.5664,1.24605,1.07224,1.204963
2.180832,1.734833,1.425746,1.328337,1.250871,1.412973,1.909019,1.823068,1.713316,2.130704,2.196944,2.105748,1.711833,1.438152,1.273919,1.276814,1.503737,1.401199,1.414897,1.701585,1.649683,1.305576,1.214011,1.463833,1.707996,1.316862,1.119597,1.412263
2.192699,1.731102,1.277946,1.216273,1.342836,1.511575,1.90152,1.806234,1.842744,2.449847,2.548373,2.31715,1.869666,1.731982,1.565188,1.310038,1.557599,1.539203,1.454671,1.67868,1.637318,1.33085,1.301504,1.561004,1.713948,1.236417,1.048447,1.428647
1.726343,1.480417,1.088149,1.051139,1.23611,1.382367,1.579612,1.506502,1.697475,2.30227,2.412429,2.138343,1.730828,1.772134,1.711904,1.261777,1.478935,1.548203,1.460915,1.652033,1.615723,1.416177,1.404799,1.675225,1.708202,1.116519,0.990983,1.299065
1.133928,1.154661,0.872497,0.860221,0.955199,1.02846,1.108001,1.16272,1.359695,1.701218,1.836195,1.665432,1.338778,1.484857,1.57701,1.22339,1.412033,1.361879,1.269092,1.455599,1.453813,1.378969,1.313186,1.581363,1.617385,1.016947,0.901734,1.05503
0.694604,0.802271,0.665714,0.655961,0.685813,0.74688,0.794742,0.881002,0.993304,1.081286,1.31742,1.374439,0.991091,1.037194,1.285351,1.254695,1.377406,1.094415,0.960422,1.119214,1.19341,1.201923,1.032803,1.201256,1.294194,0.945863,0.81699,0.774417
0.561748,0.645401,0.553657,0.500768,0.515789,0.594869,0.697558,0.694365,0.707717,0.746866,0.945213,1.154045,0.819189,0.665236,0.975776,1.2788,1.38683,1.003388,0.807836,0.908517,1.056542,1.122344,0.872989,0.830866,0.894337,0.882624,0.768496,0.6006
0.487337,0.547116,0.502519,0.391084,0.370056,0.454376,0.593304,0.559085,0.583075,0.607432,0.700221,1.01625,0.850147,0.524318,0.78607,1.188959,1.262668,0.974346,0.840991,0.938886,1.06466,1.026186,0.780478,0.787822,0.828414,0.89672,0.775906,0.549139
0.436786,0.458653,0.460243,0.389371,0.393821,0.46952,0.537694,0.476711,0.556777,0.560827,0.557087,0.865069,0.851636,0.533031,0.697666,0.973429,1.097546,1.051213,1.018899,1.147719,1.201536,0.95444,0.771992,0.944626,0.942153,0.910433,0.746761,0.524688
0.461881,0.493,0.458209,0.475435,0.56564,0.563149,0.468309,0.402016,0.510516,0.504619,0.476936,0.736979,0.823223,0.618868,0.622298,0.672588,0.976167,1.162599,1.12255,1.263146,1.346765,1.04002,0.807494,1.000295,0.942929,0.800225,0.679497,0.498509
0.555659,0.636129,0.572585,0.63663,0.74948,0.629062,0.399353,0.37668,0.521904,0.483568,0.474584,0.711355,0.817006,0.705745,0.526709,0.429821,0.80351,1.069733,0.997603,1.121229,1.254283,0.992265,0.716628,0.86246,0.76148,0.568051,0.55324,0.464207
0.64624,0.762604,0.707463,0.770159,0.836959,0.642144,0.364997,0.348256,0.519066,0.504198,0.477082,0.590512,0.711577,0.711389,0.44261,0.281824,0.572157,0.761103,0.668449,0.752245,0.900382,0.761493,0.553726,0.60552,0.537734,0.381658,0.420173,0.454818
0.663886,0.759388,0.739433,0.774398,0.751025,0.560416,0.348889,0.303895,0.424555,0.453707,0.410996,0.387303,0.505964,0.596697,0.370127,0.192759,0.33009,0.408066,0.325528,0.365482,0.478906,0.471388,0.398004,0.359958,0.35988,0.329208,0.334824,0.391138
0.55606,0.602482,0.621302,0.621282,0.524813,0.390557,0.320139,0.253875,0.274455,0.321538,0.308638,0.252416,0.308984,0.404383,0.270433,0.150348,0.194081,0.184443,0.149614,0.1404,0.196633,0.231126,0.230073,0.177495,0.214906,0.254717,0.238081,0.285605
0.36882,0.384302,0.418879,0.391817,0.285197,0.221164,0.258588,0.197738,0.160905,0.175459,0.224518,0.254039,0.221084,0.220419,0.184803,0.134425,0.125266,0.108444,0.118271,0.084394,0.097429,0.106447,0.112261,0.085241,0.139901,0.182956,0.186842,0.219184
