0.063222,0.065616,0.072378,0.073542,0.072811,0.078684,0.078021,0.070397,0.06697,0.073825,0.07597,0.077608,0.087857,0.086494,0.08369,0.08554,0.077133,0.065232,0.060393,0.068583,0.071723,0.067095,0.067756,0.06836,0.062261,0.052922,0.050799,0.052566
0.082998,0.0869,0.094772,0.094186,0.091352,0.0995,0.10024,0.089387,0.083687,0.091881,0.095131,0.098471,0.111025,0.109545,0.108129,0.109213,0.097218,0.084866,0.078139,0.084398,0.087542,0.082327,0.083935,0.087135,0.079953,0.06706,0.063608,0.066458
0.120461,0.127203,0.138894,0.135159,0.125851,0.136522,0.140843,0.125564,0.114968,0.123939,0.129357,0.135751,0.151473,0.14967,0.150908,0.150217,0.132561,0.121708,0.112169,0.112957,0.114253,0.108466,0.115118,0.123968,0.112946,0.093633,0.08781,0.092503
0.158356,0.168503,0.18649,0.180133,0.162374,0.172535,0.178502,0.160429,0.144783,0.150456,0.15664,0.164581,0.182487,0.182594,0.189097,0.187747,0.164415,0.156692,0.14718,0.142879,0.13909,0.133774,0.15369,0.167378,0.146597,0.12313,0.116006,0.121698
0.195896,0.20532,0.227971,0.22467,0.203481,0.210196,0.211064,0.1918,0.175187,0.170939,0.170347,0.17875,0.200839,0.205752,0.220391,0.225005,0.195578,0.182989,0.176138,0.172797,0.161645,0.158558,0.199712,0.21497,0.176976,0.150299,0.145095,0.153763
0.230344,0.229823,0.250698,0.255417,0.236537,0.240901,0.237287,0.220857,0.203966,0.186779,0.178489,0.18912,0.213397,0.223461,0.251666,0.265415,0.225417,0.19844,0.195222,0.200972,0.187546,0.185483,0.241429,0.257526,0.203709,0.169252,0.167041,0.181777
0.23887,0.226472,0.240762,0.252862,0.243504,0.249575,0.239311,0.224198,0.211504,0.189814,0.176792,0.183628,0.201657,0.218752,0.261436,0.280484,0.232309,0.193728,0.19783,0.217494,0.208199,0.202576,0.253257,0.269652,0.214245,0.172563,0.175867,0.194816
0.206064,0.192906,0.202183,0.215185,0.214997,0.224091,0.213717,0.202561,0.195966,0.181229,0.171337,0.166983,0.170943,0.189483,0.232186,0.253085,0.209737,0.172848,0.183751,0.207932,0.203085,0.191803,0.222771,0.235034,0.192776,0.154471,0.162627,0.178186
0.161801,0.159348,0.161474,0.168549,0.175589,0.181386,0.177821,0.178978,0.179066,0.169884,0.161415,0.15367,0.151979,0.161787,0.186783,0.208046,0.18334,0.159622,0.170734,0.184662,0.179698,0.16452,0.173874,0.180508,0.158706,0.133776,0.141845,0.144451
0.153305,0.166383,0.168172,0.176477,0.184629,0.172254,0.162499,0.168469,0.18466,0.183275,0.162818,0.150621,0.158547,0.169649,0.173062,0.184116,0.174671,0.162752,0.170943,0.17828,0.171828,0.157561,0.15849,0.164722,0.153244,0.136337,0.146881,0.135191
0.176431,0.200696,0.20236,0.213139,0.220601,0.189875,0.165887,0.171279,0.203937,0.216442,0.18369,0.15826,0.173887,0.196405,0.198328,0.198469,0.186259,0.179088,0.187667,0.189575,0.178075,0.171255,0.170846,0.173166,0.167263,0.156484,0.173166,0.156837
0.201314,0.224891,0.224401,0.233642,0.237552,0.198545,0.168595,0.176268,0.215608,0.240678,0.205749,0.169671,0.189495,0.220602,0.22877,0.214061,0.193271,0.20306,0.218602,0.20993,0.187039,0.181782,0.182038,0.182187,0.177537,0.16734,0.184954,0.178195
0.216305,0.229322,0.227874,0.232464,0.226846,0.193881,0.166616,0.175906,0.217353,0.249894,0.222718,0.189098,0.217005,0.24767,0.249772,0.215693,0.193788,0.225529,0.243384,0.223681,0.190941,0.18266,0.185347,0.186839,0.175437,0.15672,0.172102,0.187752
0.23228,0.230224,0.223404,0.226399,0.211555,0.188992,0.168982,0.179476,0.221265,0.255197,0.236599,0.210573,0.242034,0.258673,0.24593,0.206903,0.19057,0.229827,0.246221,0.224593,0.188349,0.180143,0.186276,0.184142,0.166646,0.144582,0.156562,0.185541
0.24913,0.23469,0.218665,0.21855,0.206185,0.200043,0.178081,0.177561,0.215031,0.24594,0.242585,0.226911,0.241855,0.230203,0.211963,0.195264,0.18612,0.213909,0.229876,0.220098,0.190969,0.179418,0.18285,0.176295,0.161851,0.146756,0.151651,0.180979
0.277279,0.253744,0.237485,0.236241,0.24107,0.255459,0.217324,0.193163,0.22487,0.248252,0.247831,0.242353,0.233962,0.191411,0.183529,0.196855,0.190771,0.208642,0.218654,0.218781,0.215988,0.196757,0.185681,0.185937,0.179157,0.164076,0.153895,0.176674
0.316364,0.290975,0.288876,0.292295,0.316283,0.353506,0.295918,0.242269,0.268091,0.281699,0.275459,0.283628,0.253611,0.179692,0.193093,0.230989,0.224465,0.237628,0.239085,0.248167,0.261909,0.224382,0.198582,0.215766,0.222123,0.199539,0.17157,0.187018
0.343443,0.314363,0.333887,0.351034,0.394247,0.460985,0.387218,0.298292,0.314269,0.317732,0.309841,0.333419,0.289662,0.1941,0.231333,0.288565,0.287103,0.293902,0.277092,0.289912,0.306453,0.252354,0.22374,0.256592,0.272715,0.236437,0.190579,0.20947
0.357609,0.323135,0.354698,0.381785,0.428247,0.516275,0.435692,0.323078,0.330621,0.326402,0.317954,0.35194,0.303015,0.20514,0.259421,0.324408,0.330832,0.331472,0.3005,0.307204,0.316117,0.260273,0.236657,0.276719,0.299692,0.253145,0.190339,0.218944
0.349882,0.307294,0.336843,0.376231,0.39723,0.459619,0.397163,0.310073,0.306481,0.289089,0.291951,0.327254,0.285301,0.215318,0.266223,0.308188,0.312086,0.317088,0.29167,0.274386,0.266065,0.234674,0.222893,0.257661,0.286454,0.245872,0.185198,0.212051
0.340849,0.3057,0.330872,0.366527,0.331739,0.319655,0.29515,0.286847,0.27653,0.23592,0.256993,0.282233,0.255969,0.231627,0.264278,0.269856,0.254202,0.264846,0.266612,0.228203,0.200273,0.206201,0.215594,0.228203,0.248358,0.242107,0.21014,0.210636
0.339327,0.324443,0.377931,0.414174,0.322871,0.232007,0.234161,0.308548,0.303315,0.229822,0.251809,0.267654,0.25837,0.268793,0.284841,0.276387,0.255257,0.282302,0.316076,0.260274,0.207875,0.233609,0.25665,0.235807,0.237921,0.266543,0.255951,0.228591
0.344146,0.345266,0.398551,0.423484,0.327396,0.221388,0.240223,0.352479,0.348347,0.261635,0.269731,0.25999,0.278785,0.326794,0.326383,0.324746,0.328067,0.380062,0.418976,0.340231,0.267969,0.307644,0.346792,0.286049,0.263319,0.318835,0.307553,0.242576
0.345069,0.3441,0.357014,0.358811,0.309399,0.248768,0.279324,0.382023,0.362798,0.290128,0.289546,0.242203,0.290302,0.382128,0.379194,0.381493,0.404506,0.468987,0.483657,0.395741,0.329876,0.373136,0.416725,0.312715,0.26748,0.350673,0.338153,0.245887
0.307971,0.31437,0.30399,0.297166,0.289772,0.279478,0.315321,0.363865,0.318699,0.281484,0.290552,0.23324,0.283136,0.377906,0.381176,0.379943,0.410946,0.472628,0.449085,0.384753,0.36298,0.384522,0.40458,0.291275,0.244129,0.327409,0.318369,0.229741
0.251969,0.287723,0.275846,0.252972,0.252442,0.276986,0.309253,0.291847,0.236532,0.251181,0.27747,0.223213,0.232735,0.28711,0.297749,0.298292,0.338499,0.378275,0.337426,0.318996,0.326704,0.310929,0.300467,0.2256,0.207434,0.261895,0.244802,0.186251
0.196583,0.253716,0.268113,0.227429,0.194224,0.226523,0.265537,0.234869,0.175601,0.202876,0.237648,0.203209,0.17148,0.176637,0.187575,0.187704,0.224377,0.243826,0.230853,0.233328,0.225791,0.194043,0.173233,0.145693,0.15284,0.182675,0.166755,0.137858
0.168875,0.217383,0.252871,0.193776,0.140607,0.17389,0.203291,0.200848,0.166265,0.161845,0.191705,0.178481,0.137533,0.131463,0.140985,0.141925,0.148791,0.148125,0.161165,0.153146,0.124449,0.105815,0.095896,0.093155,0.097072,0.105479,0.111242,0.112643
0.156067,0.191724,0.219651,0.16779,0.134175,0.153608,0.148972,0.158982,0.154416,0.130547,0.158711,0.151752,0.111617,0.117656,0.125395,0.11559,0.112237,0.12015,0.134674,0.111883,0.080582,0.070612,0.067188,0.07333,0.07325,0.071214,0.098197,0.121618
0.13834,0.152969,0.159467,0.138291,0.144561,0.163445,0.13047,0.116479,0.133344,0.127321,0.157936,0.150832,0.108152,0.124931,0.130516,0.102784,0.097793,0.113944,0.137259,0.119525,0.089936,0.077193,0.063192,0.069038,0.077228,0.077477,0.104528,0.13121
0.124826,0.10554,0.09515,0.101043,0.143937,0.170728,0.120607,0.090647,0.127136,0.142475,0.165217,0.158162,0.11552,0.126215,0.127013,0.091766,0.086919,0.109898,0.138831,0.127862,0.104079,0.089996,0.069299,0.070441,0.083924,0.086818,0.102625,0.12952
0.116688,0.080095,0.068951,0.082833,0.13211,0.156997,0.111284,0.095664,0.137144,0.152372,0.154695,0.142643,0.121483,0.12584,0.113738,0.079146,0.077285,0.098727,0.123464,0.123341,0.111159,0.097383,0.077899,0.07041,0.084651,0.090223,0.096293,0.124866
0.10447,0.074274,0.073046,0.090954,0.133413,0.149157,0.107906,0.101053,0.129656,0.142519,0.140302,0.123195,0.123305,0.123512,0.104007,0.075503,0.075183,0.093224,0.115806,0.131374,0.115125,0.093399,0.07733,0.065599,0.080633,0.086585,0.090736,0.119065
0.093967,0.08432,0.089246,0.109961,0.141384,0.138153,0.107686,0.100259,0.110685,0.12819,0.149948,0.131018,0.128559,0.125583,0.100314,0.083677,0.087102,0.10904,0.138378,0.148628,0.107012,0.076677,0.072306,0.066147,0.077684,0.083899,0.084016,0.098854
0.096731,0.102328,0.107627,0.127979,0.133649,0.108053,0.099344,0.10052,0.103177,0.122345,0.169494,0.144082,0.122959,0.134139,0.119857,0.106316,0.102947,0.118029,0.151525,0.148816,0.090439,0.054415,0.059966,0.069268,0.082261,0.085863,0.073005,0.071669
0.10288,0.111739,0.121329,0.136276,0.114002,0.076053,0.080731,0.098842,0.097926,0.103675,0.16646,0.139749,0.101758,0.124967,0.134161,0.129903,0.108468,0.101803,0.134486,0.123418,0.065126,0.034994,0.043762,0.068357,0.085456,0.076412,0.054339,0.059373
0.111657,0.108064,0.129716,0.137315,0.092881,0.05338,0.055859,0.085774,0.088201,0.082965,0.141827,0.124184,0.081359,0.096646,0.124061,0.13694,0.0992,0.068131,0.096026,0.088315,0.044225,0.033812,0.04175,0.064355,0.07865,0.057787,0.037675,0.059029
0.115002,0.107906,0.130311,0.139058,0.083977,0.038574,0.039053,0.07402,0.078734,0.083644,0.131519,0.113229,0.064551,0.059378,0.09054,0.119572,0.089225,0.046945,0.063337,0.07004,0.043352,0.044067,0.049248,0.066467,0.067192,0.047159,0.0414,0.068953
0.107968,0.105758,0.114015,0.129915,0.081031,0.042013,0.041626,0.068592,0.07449,0.093094,0.126482,0.105736,0.056887,0.034991,0.057232,0.08721,0.081574,0.043874,0.049752,0.057993,0.051947,0.056866,0.054052,0.068522,0.062414,0.044067,0.04738,0.074562
0.098772,0.088959,0.085449,0.103405,0.067864,0.047486,0.045518,0.059105,0.071767,0.096083,0.108165,0.090925,0.063009,0.03974,0.048447,0.0603,0.064007,0.043033,0.047615,0.057875,0.064219,0.066632,0.04905,0.062204,0.058106,0.04158,0.04786,0.068664
