-0.000165,-0.000234,-0.000249,-0.000129,-0.000195,-0.000286,-0.00016,-0.000167,-0.000164,-0.000158,-0.000221,-0.000238,-0.000199,-0.000216,-1.9e-05,-4.5e-05,-0.000189,-0.000227,-0.000118,-0.00012,-0.000249,-0.000306,-0.00025,-4.6e-05,-0.000132,-0.000221,-0.00016,-0.000274
-0.000236,-0.000252,-0.000254,-0.000134,-0.000283,-0.000389,-3e-04,-0.000227,-0.000202,-0.000218,-0.00028,-0.000294,-0.000261,-0.000214,-0.000128,-0.000162,-0.000144,-0.000244,-0.000268,-0.000259,-0.000308,-0.00033,-0.000405,-0.00019,-0.00023,-0.000328,-0.000228,-0.000379
-0.000146,-7.9e-05,-4.3e-05,-4.2e-05,-0.00015,-0.000127,-0.000146,-0.000151,-0.000151,-8.5e-05,-9.2e-05,-0.000103,-9.9e-05,-7.4e-05,-0.000154,-0.000149,2e-06,-8.7e-05,-0.000233,-0.000174,-7.7e-05,-2.2e-05,-0.000129,-7e-05,-6.6e-05,-0.000169,-0.000117,-0.000123
9.2e-05,0.000182,0.00021,0.000101,0.000111,0.000227,0.000124,6.9e-05,5.1e-05,9.1e-05,0.000112,0.000102,0.000109,0.000129,-1.4e-05,2e-05,9.9e-05,7.1e-05,-1.4e-05,1.3e-05,0.000182,0.000239,0.000179,0.000111,0.00019,0.000162,0.000109,0.000256
8.3e-05,0.000135,0.000164,4.7e-05,0.00014,0.000193,6.5e-05,0.000119,0.00016,0.000124,8.4e-05,3e-05,6.6e-05,8.4e-05,4.2e-05,3.1e-05,-1.3e-05,3.7e-05,0.000125,5.7e-05,0.000159,0.000122,7.3e-05,8.7e-05,0.000211,0.000249,0.000127,0.000268
-0.000233,-0.000242,-0.000193,-0.000159,-9.5e-05,-0.000195,-0.000227,-5.5e-05,1.8e-05,2.6e-05,-7.9e-05,-0.000199,-0.000114,-0.000163,1e-06,-4.9e-05,-0.000243,-0.000157,7e-05,-7.7e-05,-7.5e-05,-0.000168,-0.000277,-0.000133,-2.7e-05,-4e-06,-0.000113,-0.000106
-0.000266,-0.000276,-0.000233,-0.000132,-0.000135,-0.000296,-0.000251,-9.2e-05,-7.5e-05,2.4e-05,6e-06,-9.9e-05,-3.5e-05,-0.000105,1.2e-05,-5.7e-05,-0.000158,-0.000103,-2.4e-05,-0.000177,-0.000187,-0.000139,-0.000244,-0.000195,-0.000146,-0.000185,-0.000242,-0.000324
-4.8e-05,-2.2e-05,2e-05,2.2e-05,1.1e-05,2e-06,-1.3e-05,3e-06,-3.3e-05,7.1e-05,0.000156,0.000167,0.000114,0.000107,3e-05,-3e-06,9.9e-05,0.000123,-8.7e-05,-0.000118,-5.9e-05,9.3e-05,0.000105,-5e-05,-9e-05,-0.000152,-0.000109,-0.000148
0.000131,0.000112,6.8e-05,2.6e-05,5.9e-05,0.00021,0.000173,2.7e-05,-1.7e-05,-1.1e-05,2.5e-05,0.000138,6e-05,8.7e-05,1.6e-05,9.9e-05,0.000144,0.00016,-7.6e-05,5.8e-05,0.000115,0.000128,0.000269,5.8e-05,-4.4e-05,-3.6e-05,8.4e-05,0.000128
0.000213,0.000109,-4.4e-05,-5.7e-05,3.4e-05,0.000141,0.000112,7e-06,1.8e-05,-0.000117,-0.000179,-6.5e-05,-0.000108,-5.2e-05,-8.3e-05,2e-05,-3.9e-05,1e-05,8e-06,0.000188,0.000108,-3.5e-05,0.000147,2.3e-05,-6.1e-05,5.7e-05,0.000127,0.000177
6.6e-05,-4.3e-05,-0.000128,-6.1e-05,1.8e-05,-2.5e-05,-9e-05,-3.8e-05,2.4e-05,-0.000139,-0.000198,-0.000167,-0.000217,-0.000161,-0.00016,-0.000107,-0.000191,-0.000159,7.4e-05,0.000145,-5.1e-05,-0.00015,-6.7e-05,-8.5e-05,-0.000118,5.1e-05,8e-06,-1.5e-05
-8.7e-05,-0.000128,-0.000118,-2.7e-05,-2.5e-05,-0.000151,-0.000176,-5.9e-05,-3.7e-05,-6.9e-05,-2.1e-05,-6.5e-05,-0.000132,-0.000154,-0.000136,-0.000121,-9.6e-05,-0.000135,9.7e-05,3.3e-05,-0.000117,-4.7e-05,-0.000123,-0.000142,-0.000128,-3.3e-05,-0.000127,-0.000199
-3.7e-05,1.2e-05,1.7e-05,-3.1e-05,-8.8e-05,-0.000127,-9.2e-05,-4e-06,-4.7e-05,3e-05,0.000171,9e-05,-1.4e-05,-1e-06,-3.6e-05,-0.000103,7.3e-05,3.2e-05,4.1e-05,-2.6e-05,-1.3e-05,9.2e-05,-3.6e-05,-0.000113,-6.7e-05,-0.000115,-0.000149,-0.000179
3.9e-05,0.00013,8.9e-05,-7.6e-05,-0.000164,-3.8e-05,-2.4e-05,-4e-06,-4.5e-05,3.4e-05,0.000139,7.6e-05,-3e-05,9.1e-05,7.6e-05,-7.6e-05,-9e-06,-2e-05,-0.000136,-6.7e-05,6.7e-05,1.7e-05,-3.7e-05,-9.8e-05,-4.8e-05,-0.000141,-5.3e-05,2.4e-05
2.6e-05,9.8e-05,-1.6e-05,-0.000133,-0.000218,-0.000104,-9.2e-05,-8.1e-05,-6.6e-05,-1e-06,-3.6e-05,-8.9e-05,-9.8e-05,1.3e-05,3.6e-05,-0.000142,-0.000203,-0.000181,-0.000259,-9.3e-05,5.2e-05,-0.000137,-0.000137,-0.000147,-8.5e-05,-7.6e-05,2.1e-05,0.000121
2.3e-05,4.3e-05,-6.6e-05,-5.8e-05,-8.9e-05,-0.000121,-0.000107,-2.6e-05,3.6e-05,4.3e-05,-3.4e-05,-8.5e-05,-2.9e-05,2.6e-05,1.1e-05,-8.3e-05,-9.2e-05,-4.4e-05,-0.000109,-4.3e-05,4.5e-05,-6.3e-05,-0.000134,-0.000144,-4.3e-05,9.7e-05,7.3e-05,3.1e-05
-2.5e-05,-3e-05,-5.1e-05,4.4e-05,0.000104,3e-05,-1e-06,7.6e-05,0.000102,3e-06,2.9e-05,4.4e-05,6.2e-05,3.5e-05,-4e-05,-1.1e-05,9.3e-05,0.000104,7.4e-05,-2e-06,-1.5e-05,7.6e-05,-8.4e-05,-0.000122,1.4e-05,0.000187,7.8e-05,-6.6e-05
-5.3e-05,-7.7e-05,-6.1e-05,4e-05,0.000113,0.000101,0.00013,9.1e-05,1e-05,-0.000137,-4.5e-05,2.4e-05,-1.9e-05,-8e-05,-0.000165,-9.5e-05,4.9e-05,4.4e-05,9.3e-05,-3e-06,-9.3e-05,2.6e-05,-9.6e-05,-0.000123,-2.6e-05,5.4e-05,4e-06,-7.6e-05
-2.7e-05,-6.2e-05,-1.6e-05,1.8e-05,2.3e-05,8.4e-05,0.000201,4.9e-05,-4.5e-05,-0.000166,-0.000121,-5.4e-05,-9.9e-05,-7e-05,-0.000149,-9.3e-05,-4.2e-05,2.2e-05,7.6e-05,7e-06,-8.3e-05,-0.000106,-7.4e-05,-6.6e-05,-8.8e-05,-0.000119,8e-06,3.8e-05
