0.157276,0.142602,0.11086,0.087164,0.07907,0.082687,0.081845,0.061946,0.046753,0.046583,0.05171,0.065393,0.148929,0.346121,0.561815,0.779274,0.9863,1.164318,1.213801,1.139926,1.198969,1.209989,1.090308,0.917981,0.724104,0.65169,0.557026,0.3974
0.192432,0.168116,0.128212,0.101535,0.091578,0.094583,0.093865,0.072412,0.054422,0.053653,0.060429,0.075792,0.176598,0.414301,0.663306,0.905016,1.129123,1.326702,1.39908,1.316255,1.369178,1.385608,1.27027,1.079467,0.846185,0.749785,0.640683,0.47274
0.251011,0.208454,0.154457,0.124716,0.111861,0.114568,0.115333,0.091188,0.067146,0.064387,0.073496,0.091147,0.225296,0.541616,0.839833,1.097064,1.329577,1.531254,1.637033,1.558699,1.581111,1.595306,1.511854,1.317943,1.033658,0.892096,0.760243,0.596393
0.294312,0.241739,0.177779,0.144359,0.130999,0.134173,0.136124,0.108952,0.077871,0.072457,0.081165,0.099883,0.274348,0.690001,1.048275,1.269142,1.465481,1.592466,1.676694,1.675668,1.662302,1.605091,1.564725,1.460431,1.201023,0.999368,0.827635,0.699967
0.326979,0.278987,0.20944,0.166588,0.153913,0.155856,0.156448,0.126719,0.090279,0.083891,0.089212,0.108409,0.320084,0.851388,1.334049,1.519833,1.673928,1.707912,1.712583,1.852066,1.826192,1.62411,1.595609,1.622565,1.450954,1.202964,0.960972,0.837934
0.400847,0.351152,0.26072,0.199599,0.187388,0.18482,0.175376,0.143885,0.109549,0.104926,0.107096,0.138121,0.392643,1.008924,1.633009,1.879546,2.063426,2.103249,2.0723,2.303327,2.320886,2.059663,2.01678,2.054293,1.878033,1.625733,1.330513,1.119212
0.5784,0.494746,0.348684,0.266626,0.257319,0.247861,0.210381,0.173479,0.15049,0.146737,0.144184,0.203355,0.533551,1.175099,1.877224,2.271321,2.525189,2.650412,2.657291,2.856664,2.913789,2.726166,2.70329,2.63314,2.345893,2.18367,1.917976,1.543554
0.889179,0.716922,0.488319,0.396135,0.390135,0.366052,0.281561,0.231021,0.225238,0.222628,0.21097,0.308758,0.746123,1.39376,2.145923,2.674636,2.942205,3.142197,3.225905,3.363704,3.421267,3.322448,3.31446,3.092218,2.73222,2.773923,2.594845,2.052961
1.286317,0.975079,0.659059,0.571019,0.571518,0.528415,0.385225,0.31194,0.320756,0.313861,0.290933,0.43704,0.987742,1.674895,2.566921,3.161141,3.294311,3.452423,3.577029,3.754682,3.723721,3.560969,3.529265,3.212654,2.941487,3.188812,3.063171,2.475171
1.635157,1.198931,0.815321,0.725779,0.720822,0.663836,0.487956,0.395622,0.404608,0.381065,0.345392,0.532355,1.200686,2.059823,3.262987,3.834712,3.6092,3.447734,3.496956,3.876321,3.803475,3.456143,3.278134,2.997417,2.94482,3.147426,2.960776,2.653616
1.734093,1.290307,0.903615,0.781514,0.753958,0.705169,0.567924,0.472757,0.446116,0.38989,0.342159,0.540176,1.268235,2.391745,3.948397,4.427957,3.951445,3.39115,3.210661,3.908293,3.90671,3.190412,2.745867,2.678499,2.865565,2.742867,2.337893,2.504597
1.513786,1.204229,0.901658,0.735571,0.681438,0.668219,0.641706,0.553861,0.465759,0.374851,0.304353,0.459666,1.153566,2.483574,4.174549,4.556279,4.393613,3.689465,3.065294,4.035316,4.182882,3.042589,2.342796,2.509991,2.920449,2.471139,1.762129,2.258715
1.291731,1.137684,0.910839,0.738389,0.680734,0.689837,0.780517,0.707018,0.560143,0.422957,0.300241,0.370991,0.969369,2.344116,3.858982,4.25002,4.776932,4.201878,3.255972,4.380692,4.656347,3.286307,2.565875,2.891155,3.276992,2.501156,1.552178,2.17048
1.322064,1.213257,1.008754,0.852748,0.790047,0.771162,0.909169,0.835961,0.644818,0.481856,0.33313,0.361406,0.887486,2.150108,3.358151,3.7855,4.731562,4.349464,3.381605,4.513613,4.856009,3.572997,3.156266,3.683159,3.835373,2.734921,1.754262,2.40248
1.492676,1.327791,1.15284,0.999057,0.861787,0.782691,0.894202,0.814353,0.611192,0.463132,0.332203,0.357105,0.822225,1.866625,2.755294,3.224093,4.231423,4.15765,3.433967,4.259339,4.626806,3.874346,4.207772,5.095167,4.807633,3.273914,2.375514,2.886802
2.009682,1.756742,1.49613,1.188852,0.903815,0.8058,0.906408,0.812694,0.559004,0.425733,0.354806,0.401917,0.907806,1.90507,2.565624,3.11234,4.132917,4.310696,3.976363,4.534681,4.890132,4.964877,6.428888,7.675266,6.677952,4.483921,3.602457,4.055331
3.063849,2.870778,2.346003,1.70418,1.251583,1.195678,1.33058,1.142904,0.740057,0.569373,0.530587,0.605601,1.305391,2.513867,3.246069,3.994394,5.205875,5.656057,5.660096,6.345238,6.893151,7.570387,9.882536,11.348936,9.644873,6.75753,5.75142,6.123725
4.979818,5.109502,3.978649,2.713231,2.106402,2.177843,2.295522,1.760041,1.131188,0.941158,0.890555,0.984679,2.037717,3.739642,4.707216,5.761171,7.545269,8.817346,9.224988,9.889445,10.4245,11.407213,14.110188,15.322943,13.133618,10.263428,9.424699,9.373538
8.480038,8.921469,6.607453,4.276406,3.579045,3.940952,3.949968,2.734851,1.798419,1.634939,1.519295,1.546303,3.052856,5.486119,7.044178,9.090626,11.899987,14.330465,15.246719,15.500378,15.856182,16.925446,18.816236,18.892101,16.999114,15.551044,15.671357,14.886996
13.474991,14.162883,10.315545,6.621416,5.821916,6.541386,6.387044,4.258007,2.88238,2.665205,2.43728,2.323232,4.405017,7.969361,10.756348,14.694434,18.76069,21.966369,23.274601,22.722737,22.809125,24.05121,23.991628,22.098042,21.407805,22.880847,24.348276,22.195238
18.564456,19.210548,14.406351,9.594632,8.393575,9.324603,9.081374,6.135994,4.239036,3.780222,3.421019,3.19082,5.868386,10.820679,15.463367,21.835124,26.710406,29.450645,30.83784,29.235403,28.913345,30.667545,28.889809,25.229784,25.815642,30.458843,32.647976,28.339762
21.028345,20.939755,16.590168,11.807661,9.998388,10.752001,10.581809,7.472652,5.277863,4.439348,4.023495,3.773638,6.844055,13.142406,19.621017,27.56868,31.88031,33.099186,34.335745,31.792493,31.240121,33.189217,31.261787,27.807498,27.764531,33.183259,35.201399,29.207817
18.993206,17.599777,14.972424,11.7444,9.434571,9.488811,9.492529,7.194781,5.265006,4.24679,3.975315,3.865143,7.193998,14.472087,21.591103,28.399159,30.373393,29.922561,30.491627,27.42409,26.855316,28.167494,27.347927,26.54852,25.569725,28.205857,28.847166,23.789237
13.759935,11.734493,10.768764,9.551061,7.289099,6.372232,6.35112,5.299558,4.170585,3.429386,3.368166,3.865256,8.055231,17.039834,24.186316,25.905681,23.392867,21.504164,21.15285,19.85189,19.645703,18.958571,18.803228,20.893972,20.761719,19.054693,17.805543,16.452519
9.147143,8.269789,7.847304,7.078177,5.526414,4.301283,3.749613,3.304877,2.9346,2.917905,3.099592,4.459517,10.219746,21.985713,28.747806,24.105889,17.765386,14.907592,13.534728,14.60623,15.972678,14.46446,12.585834,13.803646,15.948784,13.458759,11.554017,13.2291
8.237754,7.687862,6.98616,5.592522,4.34223,3.789609,3.323608,2.602193,2.180779,2.802676,3.345393,5.628826,12.934832,25.995923,30.200438,21.188026,14.105328,11.512621,10.601722,12.068256,13.91001,12.787538,10.280336,9.823305,11.821619,11.217707,9.573067,11.305986
8.334227,7.302757,6.319027,5.080489,4.215066,3.838285,3.500814,2.632048,1.91113,2.846802,3.903909,7.00636,14.932625,25.911289,26.217869,15.829224,9.550154,7.630037,7.392294,8.458114,9.891443,9.282277,8.152951,7.488601,8.106929,8.316522,7.210439,8.555455
8.495433,7.244771,5.450784,4.36888,4.060405,3.838632,3.80678,3.121225,2.097278,3.049766,4.478039,8.043535,15.610277,21.439698,18.504789,10.406798,5.49249,4.451593,4.697556,5.550454,6.448772,5.805385,5.759312,5.502964,6.261202,6.885875,6.201818,7.787042
8.646754,7.961609,5.365058,4.050451,3.987619,3.930453,4.130037,3.698103,2.558048,3.181623,4.739971,7.954412,13.545129,14.410921,10.220288,6.116181,3.531063,3.27591,3.634516,4.409962,5.274278,4.467679,3.929992,3.79531,5.307645,6.466529,6.091836,7.588845
9.08097,9.244588,5.903672,4.165285,4.058794,4.241475,4.720885,4.43788,3.133928,3.310862,4.643982,6.485989,9.190996,8.860458,6.246858,4.411661,3.344947,3.288323,3.357364,3.83837,4.442186,3.669603,2.966958,3.182614,4.673455,5.689525,5.604019,6.604763
8.885316,9.122603,6.035788,4.552005,4.287428,4.311879,4.823428,4.75053,3.425969,3.409959,4.236533,4.397041,5.004677,5.650271,4.997951,3.7508,3.430327,3.380906,3.15337,3.436408,3.551713,3.101877,2.866996,3.02907,3.781113,4.488839,5.054001,6.174134
7.366161,6.979223,5.022246,4.40376,4.101148,3.670992,3.905657,4.028978,2.959225,2.866505,3.213179,2.548413,2.658251,3.989948,4.040658,3.321648,3.384311,3.047497,2.682247,2.77331,2.835438,2.919972,2.720461,2.466861,2.957319,3.431316,3.987328,5.24759
4.636772,4.059857,3.24906,3.272476,3.075284,2.542056,2.42126,2.500843,1.875396,1.81502,1.866307,1.259983,1.504872,3.135054,3.562476,3.016742,2.957919,2.553008,2.311222,2.282277,2.549283,2.709525,2.508612,2.186199,2.546224,2.617522,2.641897,3.518977
2.132587,1.972788,1.706412,1.734996,1.707106,1.488493,1.212858,1.094007,0.868904,0.901203,0.837021,0.637151,1.020292,2.434873,2.942572,2.570081,2.458563,2.253957,2.061349,2.139361,2.454904,2.379866,2.50143,2.311762,2.277577,2.154253,1.851745,2.03452
0.706125,0.735033,0.671236,0.646295,0.676854,0.637348,0.475561,0.441095,0.432076,0.427394,0.35972,0.354954,0.765885,1.945197,2.296013,2.308181,2.386921,2.073062,1.75749,1.897031,2.100437,1.988702,2.419847,2.381178,2.019288,1.694757,1.376551,1.326183
0.202192,0.222081,0.235276,0.252146,0.272108,0.237227,0.212904,0.354932,0.441567,0.345849,0.244927,0.240188,0.587634,1.585327,1.926775,2.11701,2.421337,1.996806,1.475812,1.547122,1.615727,1.691121,2.157684,2.404909,2.134938,1.412542,1.11679,0.96747
0.120288,0.155625,0.187271,0.22446,0.24662,0.184923,0.175344,0.344929,0.480401,0.399515,0.298215,0.2571,0.441516,1.283206,1.741667,1.757256,2.068307,1.885767,1.33086,1.107261,1.179255,1.477277,1.861946,2.544032,2.442323,1.405152,1.116237,0.858801
0.107987,0.133257,0.176663,0.240514,0.22724,0.14769,0.186557,0.362984,0.457025,0.399974,0.328995,0.269556,0.37487,1.128451,1.593237,1.289208,1.446202,1.749738,1.457099,1.069547,1.315855,1.877322,2.135513,2.77193,2.627154,1.500766,1.214026,0.897935
0.120088,0.10928,0.14367,0.229503,0.186907,0.101349,0.194249,0.36705,0.365465,0.324413,0.300948,0.229054,0.317159,1.032556,1.603354,1.092267,1.145673,1.778145,1.718612,1.466632,1.881537,2.48575,2.443983,2.671288,2.636651,1.696523,1.170001,0.84526
0.145092,0.095384,0.105167,0.186234,0.159481,0.089382,0.191518,0.322805,0.247729,0.225507,0.23003,0.153298,0.244953,1.073688,1.800261,1.218167,1.215252,1.820037,1.86376,1.808091,2.38229,2.886995,2.349997,2.08626,2.347998,1.830561,1.029037,0.791547
