-0.002408,-0.003608,-0.002457,-0.001272,-0.000449,-0.000431,-8e-05,-0.00054,-0.001545,0.000188,-0.001317,-0.000814,-0.00037,0.000268,-0.00062,-0.001356,-0.001882,-0.000578,-0.001307,-0.002009,-0.000831,-0.001029,-0.001286,-0.001217,-0.001694,-0.001764,-0.000652,-0.001532,-0.001838,-0.000816,-0.001776,-0.001664,-0.001344,-0.001116,-0.00149,-0.002321,-0.001822,-0.001299,-0.001528,-0.000531,-0.000946,-0.00028,-0.00016,0.000191,0.000379,-0.00113,-0.000767,-0.000309,0.000438,-0.000614,0.000535,-0.000178,0.000802,0.000566,-0.000447,-0.000926,-0.001519,-0.000687,-0.000123,-0.000732,-0.00061,0.000434,-0.000564,3.6e-05,-0.000513,-5e-04,-5e-04,-0.000445,-0.001083,-0.001045,-0.000154,-0.000889,-0.001715,-0.000638,-0.000818,-0.000543,-0.001724,-0.000941,-1.6e-05,-3.7e-05,0.000451,0.000132,0.000304,0.000255,-0.00043,-0.000337,-0.000572,-0.000373,0.000249,-0.000349,-6.6e-05,-0.000259,-0.000272,-0.000759,-0.000686,-0.000791,-0.000403,-0.000263,-0.000608,-0.00072,-0.000705,-0.000323,-7.7e-05,-0.000716,-0.000737,-0.000211,5.4e-05,-0.000457,-0.00056,-0.000705,-0.000745,-0.000467,0.00012,9.8e-05,-0.000147,-0.000291,-3.7e-05,0.000623,0.001091,0.000393,0.000511
0.000389,7.3e-05,0.000888,-0.000569,-0.001649,-0.001045,-0.000579,-0.000516,-0.000467,-0.001075,-3.3e-05,-0.000594,-0.001083,-0.000753,-0.001323,-0.000447,0.00011,-0.001346,-0.001807,-0.000384,-0.00058,-0.000746,0.000638,-0.001274,-0.001413,-0.000363,-0.000448,0.000373,-0.000822,4.2e-05,0.000267,0.000578,-0.000308,-0.000421,-0.000299,0.00113,0.000435,0.000364,-0.001324,-0.000521,-0.000692,-0.000105,-0.000762,-0.001237,-0.00157,-0.001173,-0.00136,-0.000668,-0.002363,-0.001655,-0.00176,-0.001002,-0.001609,-0.000218,-0.000627,-4.9e-05,-0.000163,-0.000687,-0.003056,-0.001141,-0.000726,-0.002763,-0.001896,-0.00142,-0.00089,-0.00049,-0.000597,-0.001026,0.000225,0.000294,-0.001108,-0.000975,0.000217,-0.00035,-0.00047,-0.000381,-0.000136,-0.000336,-0.001507,-0.00121,-0.001222,-0.000909,-0.001725,-0.001217,-0.001024,-0.000282,-0.000257,4.9e-05,-0.000303,-0.000747,-0.000805,-0.000643,-0.001226,-0.000466,-0.000745,-0.000185,-0.000289,-0.00021,-0.000231,-9.2e-05,-0.000225,-8e-05,0.000233,8.2e-05,-0.000121,-0.000392,-0.000764,-0.000573,-0.000301,-0.000167,0.000541,-0.000185,-0.001456,-0.001568,-0.000628,0.000251,0.000129,-0.000355,-0.002081,-0.002371,-0.001189
-0.001371,-0.0011,-0.001917,-0.000521,-0.000702,6.6e-05,-0.000357,-0.000935,-0.000708,-0.000569,-0.001742,-0.000684,0.000271,-7.3e-05,-0.000263,-0.001004,-0.000194,-0.00071,9e-04,-0.000248,-0.000688,-0.000256,-0.000718,-0.000673,0.000387,-0.001263,-0.000157,-0.000764,0.001109,0.000518,-0.000727,-0.000641,0.000305,-6.7e-05,0.000142,-0.001205,-0.001438,-0.000529,-0.000643,-0.000912,-0.000996,-0.000483,-0.000946,-0.001304,-0.000298,0.000167,0.00031,-0.000892,-0.00066,0.000317,1.2e-05,-0.000284,-0.000133,0.000157,-0.000342,-0.000233,0.000457,-0.000489,0.001053,0.000456,0.000186,0.000386,-0.000367,-0.000751,-0.000229,-0.000171,0.000599,0.000883,-0.000331,-0.000738,0.000101,0.000245,-0.00039,-0.000115,0.000204,-0.000849,-0.000769,-0.001551,-0.00061,-0.000108,-0.000916,-0.000464,-0.000375,7.9e-05,-0.000215,-0.000402,-0.00038,-0.000714,-0.000725,0.000386,-0.000185,-0.000685,-0.000323,-0.000761,-0.000676,-0.000141,-0.000238,0.000284,0.000297,0.000108,0.000254,0.000107,-0.000192,-0.000143,-8.8e-05,-0.000316,-0.000535,-5.1e-05,-0.000164,0.000116,-0.000434,-0.000143,-0.000123,0.000447,0.000269,-0.000906,-0.000577,-0.000888,-0.001127,-0.000261,-7.5e-05
0.001885,0.000873,5.8e-05,-0.000479,0.000801,-0.000228,-0.000378,0.000759,0.000786,0.001462,-0.000464,6.3e-05,8.4e-05,-8e-06,0.000606,0.001863,0.000491,0.001514,0.000658,0.000244,0.000515,0.000295,0.000366,0.001342,0.000321,0.001076,0.000128,0.000647,-0.000406,0.00033,0.000966,9.9e-05,0.000439,0.000464,-0.000408,0.001447,0.001447,0.000325,0.000911,0.001424,0.001233,3.5e-05,0.001407,0.001156,0.001132,0.000576,-0.00042,-2.3e-05,0.001456,0.001006,-0.000319,0.000804,0.000119,-0.000722,-0.000135,0.000422,-0.000154,-0.000172,0.001226,0.000618,0.000729,0.0013,0.00134,6.8e-05,-0.000519,-0.000397,-0.001394,-0.000723,9.9e-05,0.000848,0.000372,0.000272,0.000704,0.000467,0.000123,9.8e-05,0.000984,0.001801,0.001589,0.000436,0.00035,0.000715,0.000807,0.000588,0.001077,0.000757,-3e-06,-0.000294,-9.7e-05,-0.000457,0.000317,0.000563,0.000896,0.001087,0.000863,0.000137,0.00035,-9.5e-05,-0.000352,-0.000139,-1.1e-05,5.4e-05,2.6e-05,0.000167,0.000588,0.00016,0.000505,0.000666,0.00041,-0.000119,0.000348,0.000271,0.000688,0.000544,0.000554,0.000415,0.000473,0.000512,0.00133,0.001501,0.000629
-0.001217,-0.000349,0.000172,0.000165,-0.00026,0.000612,-1.4e-05,-0.000158,-1.9e-05,-0.001053,-0.000269,-0.000517,-0.000898,-0.000147,0.000968,-0.000549,7.9e-05,-0.000415,-0.000668,-0.000151,-0.000485,0.000291,-0.000277,-0.000894,-0.00046,-0.000367,-0.000924,-0.001028,4e-06,-0.00159,-0.000625,-0.000661,-0.000825,-0.000676,-0.000198,-0.000546,-0.000926,7e-05,-0.000619,-0.000793,0.000131,0.000271,-0.00039,-0.000256,-0.000779,7.2e-05,0.00046,0.00119,-3.8e-05,-0.000218,0.000467,2.5e-05,-0.000371,-9.4e-05,0.000474,0,2.5e-05,-0.000239,-0.001226,-0.001193,-0.00063,-0.000326,-0.000365,-0.00026,0.000183,7e-05,0.000621,0.000309,-0.000597,-0.000415,-0.00048,-0.000641,-0.000149,0.000237,0.000498,0.000199,-0.00072,-0.000716,-0.000836,-0.000214,0.000701,0.000893,-0.000113,0.000431,-9e-06,-0.000514,0.000107,0.000402,0.00043,-3e-05,-0.000189,-0.000221,-0.000159,-0.00039,8e-05,-0.000262,-0.000169,-0.000486,-5.8e-05,-0.000105,-2.3e-05,-0.000216,-0.000249,-8e-06,-0.000306,-1.4e-05,-7.6e-05,-0.000132,-0.000219,0.000357,-0.000259,-0.000481,-0.000387,-0.000616,-0.000468,-0.000146,2e-06,0.000238,0.000188,0.000102,-0.000191
0.001366,-1.1e-05,0.001044,0.000578,8e-05,-0.000607,0.000514,-0.000584,-0.000675,6.6e-05,0.000923,0.000759,-0.000103,0.000436,-0.000199,-0.000452,-0.000795,0.000336,-0.000385,-0.000574,0.001196,0.000281,-3.9e-05,0.000349,-0.000384,-0.00078,0.000392,0.000728,0.000114,0.00069,0.001112,0.000511,0.000644,0.000681,0.000101,-4.5e-05,0.00076,-0.000209,0.000418,-0.000687,-0.000986,-0.00018,-0.000187,-0.000201,7.9e-05,-4.6e-05,-0.000204,-0.000344,-0.000501,-0.000695,0.000147,-0.000272,5.3e-05,-0.000575,-0.00034,0.000129,-2.9e-05,0.000866,0.000442,0.000333,-0.000207,-0.000206,-0.000169,-3e-06,7.1e-05,-0.00033,0.000248,-0.000388,0.00013,6e-06,-5.3e-05,-0.000177,6.5e-05,-0.00029,-0.000857,0.000138,0.000103,-0.000186,-0.000135,-0.000812,-0.000461,-0.001227,-0.000731,-0.000559,-0.000281,-2.6e-05,-0.000121,7e-06,0.000119,0.000243,0.000157,-6.8e-05,-0.000551,-0.000494,0.000276,0.000206,4e-06,0.000585,0.000361,5.5e-05,-0.000284,9.5e-05,-2e-05,-0.000285,4.4e-05,0.000326,-0.000221,-0.000367,-1.7e-05,-0.000145,0.000291,9.3e-05,-3.5e-05,-8e-06,-7.5e-05,-0.000146,-6e-05,-0.000258,-0.000563,-0.000723,-0.00054
-0.001609,-6e-04,-0.001529,5.6e-05,0.000217,0.000129,-0.000147,0.000388,8.4e-05,5.6e-05,-0.000769,-9.1e-05,0.000502,-0.000169,-0.000717,0.000406,0.000176,-0.000182,0.000263,0.000607,-0.000308,-0.000221,0.000451,-0.000112,0.00083,0.000681,-1.4e-05,-0.00016,4.9e-05,5.3e-05,-0.000723,-0.000566,-0.000363,-0.000314,0.000113,-0.000434,-0.00075,-0.000223,-0.000124,0.000593,0.000706,-0.000456,-3e-04,-3.2e-05,0.000307,-0.000325,-0.000119,-0.000439,5.2e-05,0.00031,-0.000363,-0.000292,0.000209,0.000499,8.2e-05,-0.000279,-5.3e-05,-0.000998,-0.000392,0.000683,0.000249,-2e-06,-0.00067,0.000402,0.000196,0.000492,-0.000151,-0.000172,0.000458,-0.000161,0.000109,0.000535,-0.000264,-0.000285,4e-04,-0.000378,-4e-04,-0.000106,-5.5e-05,0.000782,-0.000282,-0.000197,0.000317,-0.000468,-0.000369,-0.000156,8.3e-05,6.8e-05,5e-06,0.000226,-3e-06,-0.000173,0.000315,0.000164,-0.000613,-0.000238,4.7e-05,-0.000262,-0.000324,-0.000149,0.000232,-5.5e-05,8.6e-05,8.5e-05,-6.1e-05,-0.000397,0.000178,0.000234,0.000295,4e-06,-0.000182,-0.000182,0.000158,0.000295,0.000202,-0.000195,-0.000304,-0.000187,-7.3e-05,-0.000199,0.000337
0.000979,0.000709,0.000795,-0.000662,-0.000778,4.8e-05,8.6e-05,6.1e-05,0.000149,0.000171,-1.8e-05,3e-05,1.3e-05,0.000217,-0.00027,-2.5e-05,0.000157,-0.000183,-0.000113,-0.000174,-0.000167,-0.000509,-0.000425,8.5e-05,-1e-06,-0.000241,-0.000452,-0.000215,-0.000131,-0.000331,-0.000214,0.000185,0.000276,-0.000157,-0.000264,0.000597,0.000278,1.2e-05,4.8e-05,0.000437,-0.000125,0.000293,0.00017,9.2e-05,0.000742,0.000585,-0.000191,0.000462,0.000178,7.7e-05,-0.000198,0.000145,0.000291,0.000354,-0.000432,-5.7e-05,-3.5e-05,0.000539,0.000659,-0.000759,-0.000131,0.000311,0.000702,-9e-05,-0.000177,-0.000246,-0.000178,0.000321,-0.000516,5.6e-05,1.4e-05,-0.000147,0.000213,7e-04,4.8e-05,0.000539,0.000718,0.000276,0.000249,0.000493,0.000596,0.00023,0.000325,0.000469,0.000179,2.3e-05,0.00012,-0.000117,-0.000101,-2.3e-05,-0.000144,-0.000175,5.5e-05,0.000103,8.9e-05,-2e-05,-5.4e-05,-7.7e-05,0.000149,3e-04,-0.000204,-0.000156,-0.000345,-0.000278,-5.1e-05,0.00011,0.000105,1.1e-05,-0.00015,-0.000122,-0.000173,0.000199,-7.2e-05,0.00011,-1e-04,0.000143,2.8e-05,-0.00022,-8.7e-05,0.000417,0.000312
-0.000343,-0.000305,-0.000217,-0.000445,0.000454,0.000214,0.000233,2.1e-05,9.3e-05,-5.5e-05,0.000319,0.000472,-0.000235,-0.000302,0.000175,-3.2e-05,-6.6e-05,0.000341,0.000375,-0.000275,-0.000142,0.00028,0.00016,-0.000255,-0.000468,-0.000342,-0.000482,-8.8e-05,0.000647,0.000237,0.000216,0.000365,0.000263,-4.9e-05,0.000373,-0.000246,-0.000129,0.000324,2.9e-05,-0.000132,0.000163,4e-05,0.000149,-9e-06,-0.00066,-0.000514,-9.9e-05,-0.000325,0.000424,-6e-05,0.000562,1e-06,-0.000236,-0.000133,-0.000128,0.000447,0.000195,-0.00028,7.9e-05,-0.000101,-8.3e-05,-0.000606,-0.000349,-0.00041,2e-05,0.000292,4.1e-05,0.000158,0.000348,-0.000211,-0.000218,4.4e-05,3.6e-05,-0.000475,-0.00013,-0.000254,0.000164,-1.9e-05,-0.000155,-0.000303,-0.000506,0.00023,-0.000263,-0.000101,7.6e-05,-7.2e-05,-0.000187,-0.000145,-0.000287,-0.000267,-0.000111,0.000457,0.000182,-7.5e-05,0.00032,4.9e-05,-4.9e-05,-9.7e-05,2e-06,-0.000189,0.000137,0.000141,7.7e-05,3.5e-05,4.2e-05,9.1e-05,1e-04,6.2e-05,-0.00032,0.000158,0.000222,-4.4e-05,2.1e-05,-0.000374,-1.4e-05,2.3e-05,9.5e-05,0.000107,0.000288,-8.1e-05,-0.000524
-0.000148,0.000293,0.000525,2e-04,-0.000281,-0.000577,-0.000118,0.00012,-3.8e-05,-0.000416,-0.00014,-0.000416,0.000278,-1e-04,-0.000244,-0.000533,-0.000245,0.000352,-0.000133,0.000322,0.000346,0.000154,-0.000525,0.00023,4.1e-05,0.00025,0.000314,0.000174,-0.000661,-0.000391,-1.7e-05,-0.000141,-0.00016,4.4e-05,-0.000387,-0.000352,0.000202,-0.000176,-0.000264,3.5e-05,-0.000391,6.3e-05,5.8e-05,0.000165,-0.00042,-0.000109,0.000774,0.000155,-0.00038,-8.7e-05,-0.000168,0.000164,-0.000203,-0.000193,0.000207,-0.000181,-0.000187,-5.7e-05,-0.000196,0.000589,0.000353,9e-05,-8.2e-05,-0.000421,-0.000262,8.7e-05,-1.3e-05,-7.6e-05,1.7e-05,0.000224,-0.000139,-0.000106,-0.000399,6.1e-05,-9.1e-05,0.000249,-0.000332,-2.8e-05,-0.000173,-0.000329,-7.6e-05,6.9e-05,-0.000354,-0.000318,-0.000243,0.000119,-8.7e-05,2e-04,0.000183,7.8e-05,8.8e-05,-6.6e-05,-3.7e-05,-0.000152,-0.000161,-4.5e-05,8.5e-05,0.000189,-6.5e-05,5.3e-05,1.1e-05,4.5e-05,9.2e-05,5.2e-05,-0.000132,-2.8e-05,-8.1e-05,-2.4e-05,0.00016,-9.5e-05,-0.000145,0.000138,-2.2e-05,-5.8e-05,-1.8e-05,-0.000239,-0.000167,1.1e-05,-0.000198,9.2e-05,4.7e-05
0.000238,-0.000382,-0.000258,0.000212,0.000307,7e-06,0.000135,-0.000239,-3.5e-05,0.000606,9.1e-05,8.7e-05,-0.000278,-1.4e-05,0.000195,-4.5e-05,1.8e-05,-0.000594,-4.9e-05,-0.000247,-0.00013,-0.000336,9e-05,-0.00017,-4.3e-05,0.00025,0.000369,-1.2e-05,0.000277,0.000331,-0.00029,-0.000426,-1.6e-05,0.000118,0.000146,0.000329,-3.5e-05,0.000145,0.000192,-9.2e-05,0.000483,-6.1e-05,-0.000237,-0.000274,0.000206,0.000146,-0.000411,6.7e-05,-0.000114,0.000144,-0.000431,-0.000153,0.000445,9.8e-05,0.000255,4.2e-05,-1e-04,-0.000104,-0.000263,-0.000219,4.7e-05,0.000146,0.000124,0.000462,0.000289,-0.000578,-9.5e-05,-0.000104,-1.3e-05,4.9e-05,0.000205,0.000137,3.1e-05,-0.000216,5.3e-05,-0.000216,5.7e-05,-1e-05,0.000114,0.000363,8.2e-05,-0.000137,6.1e-05,0.000341,-9.6e-05,-7.8e-05,5.9e-05,6.1e-05,-5.1e-05,2.2e-05,7.7e-05,-0.000115,-6.3e-05,0.000125,-7.4e-05,1.8e-05,-0.000115,-4e-05,-1.2e-05,-4e-06,-6.1e-05,-4e-05,-1.7e-05,8.9e-05,1.5e-05,-0.000155,-8.9e-05,-4.3e-05,0.000176,3e-05,0.000117,-0.000158,-9e-06,1.3e-05,2.2e-05,2.6e-05,3e-05,-0.000142,0,-5.6e-05,0.000226
0.000181,0.000276,3.3e-05,-0.000202,-8.1e-05,0.000145,-0.000362,-2.1e-05,0.000163,-0.000159,9e-06,8.5e-05,-0.000195,1.4e-05,0.000145,0.000104,0.000101,4.3e-05,2.6e-05,6e-05,-0.000292,0.000324,0.000306,9.1e-05,0.000322,-0.000179,-0.000322,-3e-06,-9.3e-05,-0.000196,0.000173,0.000357,2.1e-05,-1.8e-05,4e-06,-0.000246,-0.000176,-0.000243,9.9e-05,-0.000108,-2.5e-05,-4.5e-05,0.000167,0.000133,0.000205,8.2e-05,-0.000156,-0.000152,0.000171,-0.000128,0.000137,2.3e-05,8e-05,-2.5e-05,0.000155,-3e-06,-2.4e-05,9.6e-05,0.000138,1.1e-05,-0.000299,-1.7e-05,4.1e-05,0.000392,-2.2e-05,8.3e-05,0.00011,-2.3e-05,7.3e-05,-4e-06,0.000154,6.3e-05,0.00026,4.5e-05,-6.2e-05,0.000113,0,0.000129,-9e-06,-1.5e-05,0.000265,-5.7e-05,0.000251,-5.8e-05,0.000197,1e-04,0.000268,-3.8e-05,0.00018,0.000119,2.5e-05,4.1e-05,4.7e-05,-4.4e-05,0.000167,-1.5e-05,0.000129,-7.1e-05,3e-05,-1.7e-05,0.000152,-1.6e-05,3.4e-05,-6.9e-05,-8.4e-05,2.8e-05,-2.6e-05,-1.5e-05,-0.000164,2.7e-05,-5.2e-05,0.000119,5.5e-05,4.2e-05,-4.5e-05,0.000168,2.9e-05,-6e-06,1.2e-05,2.6e-05,3.3e-05
-9.8e-05,-0.000222,0.000131,5e-05,-3.8e-05,7.8e-05,0.000216,0.000129,-0.000149,-2.6e-05,0.000136,-6.4e-05,0.000105,1.6e-05,-0.000112,0.000476,1.5e-05,6.3e-05,0.00015,0.000276,0.000224,-0.000221,4.7e-05,-7.7e-05,-0.000311,1.3e-05,5.3e-05,-0.000104,5.2e-05,0.000131,5.9e-05,-2e-05,9e-06,-7.4e-05,6.1e-05,9.3e-05,0.000148,7.6e-05,2.3e-05,0.000168,-1e-04,9.2e-05,5.2e-05,-6.4e-05,-7.2e-05,-0.000109,0.00028,1e-06,-0.000151,0.000201,0.00029,6e-06,-0.000254,2.2e-05,-0.000105,-0.000116,0.000196,2.9e-05,-0.000133,-0.000347,6.6e-05,2.3e-05,-9.5e-05,-0.000619,-2.8e-05,0.000235,1.2e-05,3.7e-05,-0.000219,-0.000118,-9.7e-05,-6.8e-05,1e-06,7.8e-05,6e-05,1.8e-05,2e-06,8e-06,1.6e-05,-4.7e-05,-2.2e-05,7.9e-05,5e-05,-7.2e-05,-1.8e-05,-4.2e-05,-0.000329,0.000131,-0.000138,-6.9e-05,-3.5e-05,4.1e-05,0.000115,7.3e-05,8.2e-05,-4.9e-05,0.000202,3e-05,-2.9e-05,1.1e-05,-8e-05,1.6e-05,-6.2e-05,-1.2e-05,3.2e-05,4.4e-05,0.000159,-8e-06,-4.5e-05,-3.9e-05,-2.6e-05,3.2e-05,-2.6e-05,8.5e-05,-6.9e-05,-9.8e-05,-2.5e-05,0.00012,3e-05,2.1e-05,-7.7e-05
-0.000123,0.000122,1e-04,-0.000138,6.3e-05,9e-05,0.000165,-0.000108,-2.9e-05,-7.3e-05,-3.7e-05,-3.7e-05,0.000154,-1e-06,-2.1e-05,-0.000267,-3.3e-05,-3.2e-05,-2.7e-05,-0.000243,-3.9e-05,1.4e-05,-0.000303,-9.9e-05,9.1e-05,-4e-06,0.000218,6.2e-05,-0.000104,-0.00011,-5.8e-05,0.000214,-0.000154,-8e-06,2.7e-05,0.000104,3.2e-05,6.8e-05,-9.1e-05,-1.1e-05,-4e-05,-3.8e-05,-1.7e-05,9.4e-05,-0.000122,-2.7e-05,-6.4e-05,0.000104,0.000168,-6.8e-05,-0.000133,-3.3e-05,4.7e-05,-3.3e-05,-2.2e-05,1.3e-05,-0.000114,-6.3e-05,7.7e-05,7.6e-05,0.000146,8.8e-05,1.1e-05,0.000216,-2.6e-05,1e-05,5.8e-05,6.3e-05,7.3e-05,0.00011,8.2e-05,3.2e-05,-7.2e-05,-2.7e-05,-9.2e-05,-4.2e-05,1e-06,-0.000179,3.3e-05,-9e-06,-0.000131,-0.000172,-8.1e-05,-3.4e-05,4.6e-05,3.2e-05,0.000104,-1.5e-05,2.5e-05,-3e-05,-8e-06,-6.1e-05,-4.9e-05,-2.6e-05,-7.9e-05,5.9e-05,-0.000176,-5e-06,-3.7e-05,5.4e-05,6e-06,-6e-06,1.3e-05,4.8e-05,6.7e-05,-9.4e-05,-0.000126,-3.3e-05,3.5e-05,-9.5e-05,4.1e-05,-1e-06,-2e-06,-3.5e-05,-1e-05,-7.2e-05,3e-06,-5.5e-05,0.000118,-6e-06,-9.7e-05
0.000181,-6.9e-05,-0.000234,0.000343,3.2e-05,-2.7e-05,-0.000146,7.8e-05,-3e-06,3.5e-05,-1.6e-05,-1.6e-05,0.000152,2.7e-05,6.9e-05,-2.9e-05,2.8e-05,-5.2e-05,-1.9e-05,4.4e-05,2.2e-05,3.2e-05,8.2e-05,0.000136,-7.6e-05,-5.3e-05,-7.4e-05,-4e-06,0.000133,-3.2e-05,2.1e-05,-4.3e-05,8e-06,1e-05,8e-06,-4.2e-05,-8.8e-05,-1.5e-05,1e-06,-2e-05,-1.3e-05,6.4e-05,-9.3e-05,-5.4e-05,3.4e-05,4e-05,-4e-05,0.000125,-4.5e-05,-4.6e-05,-3.6e-05,-2e-05,-7e-05,-3.9e-05,-5.9e-05,1.1e-05,-7.7e-05,0.000117,-7.3e-05,0.000217,-9.4e-05,-6.2e-05,2.1e-05,8.6e-05,5e-06,-2.5e-05,-2.3e-05,3.6e-05,0.000108,-0.000105,-8.9e-05,-3.5e-05,0.000106,4.8e-05,0.000113,-1.1e-05,-3.1e-05,1e-06,-2.8e-05,-0.00011,0.000134,0.000181,-8e-05,3e-06,-1e-06,-9e-06,2.5e-05,-4.7e-05,4.6e-05,9e-06,-8e-06,0.000103,-0.000148,-4.9e-05,1.1e-05,-1.2e-05,1.6e-05,2.2e-05,2.5e-05,-7.1e-05,2.4e-05,-2e-06,-6e-06,-6.2e-05,1e-05,2.5e-05,5.9e-05,2e-05,1.7e-05,0.000103,-2e-05,4.1e-05,-2.2e-05,7e-06,-3.3e-05,8.3e-05,-2.3e-05,3.3e-05,-3.1e-05,1.3e-05,-2.5e-05
-3.7e-05,5e-05,9.7e-05,-0.000132,-7.3e-05,-4e-05,-9.8e-05,-5.1e-05,-4e-06,2e-05,7.6e-05,-6e-06,1.9e-05,-1.9e-05,4e-06,1e-06,-1.3e-05,-4.1e-05,-1e-06,-1.3e-05,-3.3e-05,-2.6e-05,9e-05,-7e-05,0.00016,7.5e-05,-1.5e-05,-3.5e-05,-0.000165,2.7e-05,-2.9e-05,-5e-06,5.1e-05,-5.8e-05,-1.9e-05,-6.7e-05,8.5e-05,9e-06,2.7e-05,5e-06,-0.000144,-7.3e-05,4.4e-05,4e-05,3.5e-05,3e-05,5.7e-05,-0.000168,-6e-06,7.9e-05,6.3e-05,-1e-06,5.8e-05,-1.2e-05,-4.4e-05,4e-05,5.9e-05,-0.000119,-1e-06,-6.7e-05,5e-05,-5.3e-05,-4.3e-05,4e-05,1.8e-05,2.9e-05,-9e-05,-1.9e-05,-8.1e-05,2.6e-05,1.5e-05,1.4e-05,-5.7e-05,5.3e-05,-2e-06,-4.1e-05,1e-06,2.9e-05,2.5e-05,3.5e-05,-8.5e-05,3.6e-05,5e-06,2.3e-05,-3.3e-05,3e-06,1.4e-05,-2.7e-05,3.5e-05,2.4e-05,1e-06,4e-06,4.9e-05,3.6e-05,2.8e-05,2.8e-05,-3.3e-05,-3e-05,1.3e-05,4e-06,-1e-05,-8e-06,-8e-06,2.4e-05,5e-06,3.4e-05,-1.4e-05,8e-06,8e-06,4.3e-05,2.1e-05,-9.4e-05,-1e-06,-6e-06,6e-05,-1.9e-05,1.1e-05,2.9e-05,3.1e-05,3e-06,9.7e-05
-0.000137,-3e-06,-7e-06,-8.4e-05,6.8e-05,-1.8e-05,3.6e-05,-1.3e-05,-6e-06,-4.2e-05,-2.7e-05,-3.4e-05,-0.00017,-5.9e-05,-2.8e-05,-1.7e-05,1.1e-05,6.1e-05,-4.9e-05,-1e-05,6.2e-05,2.2e-05,-2e-06,7.7e-05,-6.6e-05,-3.9e-05,-9.8e-05,-2e-06,5e-05,-5.3e-05,8.8e-05,-7.3e-05,-6.5e-05,-5.7e-05,2.8e-05,5.3e-05,1.5e-05,-3.5e-05,2.9e-05,-5.6e-05,0.00018,0.000108,-7e-06,-4.3e-05,9.8e-05,2.9e-05,4.1e-05,8.1e-05,1.9e-05,-0.000141,1.7e-05,5.2e-05,3e-05,1.6e-05,-9e-06,-2.7e-05,-1.4e-05,7.5e-05,-3.1e-05,-8.7e-05,-5.2e-05,4.4e-05,3e-05,-2e-05,-2e-06,-5e-05,-1.7e-05,-3.8e-05,1.8e-05,4.3e-05,-1.5e-05,-4.1e-05,-7.6e-05,1.3e-05,-2e-06,2.4e-05,-7.6e-05,-7e-06,-5e-06,3.3e-05,5.1e-05,-1.7e-05,3.3e-05,8e-06,-2.7e-05,-7e-06,1.4e-05,9e-06,-7.2e-05,-1.3e-05,1e-06,-1.6e-05,-4.1e-05,-7e-06,-5.9e-05,-3e-05,1.7e-05,1.9e-05,-1.1e-05,3.3e-05,1.1e-05,3e-06,0,6e-06,-9e-06,-2.1e-05,2.1e-05,1e-05,-4.4e-05,-4.2e-05,-2.4e-05,5.8e-05,-2e-06,2.4e-05,2.8e-05,-3.9e-05,8e-06,-3.3e-05,2.7e-05,6e-06,-1.2e-05
0.000124,-5.8e-05,-0.000153,3.3e-05,-5.4e-05,6.7e-05,2.7e-05,5.4e-05,6.5e-05,6.3e-05,-2.4e-05,1e-05,1.5e-05,1.2e-05,1.6e-05,0.000142,-9e-06,0,2e-05,-2e-06,2.2e-05,-1.5e-05,-7e-06,-4.4e-05,7e-06,-3e-05,0.000109,3e-06,-7.1e-05,3.1e-05,-0.000105,0.000105,5.5e-05,5.7e-05,-1e-05,-9e-06,-4e-05,1.8e-05,-3.1e-05,1.1e-05,-8e-05,-6e-05,-1.2e-05,4.1e-05,-4.7e-05,3e-06,1.3e-05,1e-06,-5.7e-05,1e-04,-8.3e-05,-2.2e-05,-6e-05,-7e-06,4e-05,-3e-05,2.9e-05,-4.6e-05,-3.4e-05,7.6e-05,-3e-06,-3.1e-05,-1e-06,-3.8e-05,-1.5e-05,4.1e-05,2.2e-05,-1e-05,-3.6e-05,-5.4e-05,1.4e-05,1.8e-05,5.9e-05,-8e-05,6.6e-05,-3.7e-05,6.5e-05,4.9e-05,-8e-06,-1e-05,-2.6e-05,-5.2e-05,2.1e-05,8e-05,-8e-06,1.8e-05,-1.7e-05,1.2e-05,6.5e-05,-2.4e-05,5e-06,-1.7e-05,3.1e-05,-1e-06,-2.6e-05,3.5e-05,2.8e-05,2.5e-05,-8e-06,-6e-06,7e-06,-1e-06,1e-05,0,-2.3e-05,1.6e-05,1e-05,7e-06,1.2e-05,2e-06,1.5e-05,-1.3e-05,-3e-06,-2.4e-05,-9e-06,4e-05,-9e-06,2.2e-05,-3.2e-05,0,-4.1e-05
-5e-06,6.4e-05,0.000117,7.1e-05,4.3e-05,-1.9e-05,-6.9e-05,-4.3e-05,-2.5e-05,-6.7e-05,4.1e-05,9e-06,8.4e-05,1.4e-05,1.3e-05,-7.8e-05,-3.7e-05,-2e-05,1.3e-05,1.8e-05,-4.5e-05,1.3e-05,-1.8e-05,2.7e-05,-3.1e-05,5.5e-05,1.5e-05,1.4e-05,0.000102,1e-06,2.3e-05,-1.4e-05,-6.1e-05,2.9e-05,4e-06,-6.1e-05,1.4e-05,-2.7e-05,1e-06,2.6e-05,5e-06,-1.2e-05,4.5e-05,-2.5e-05,-6.3e-05,-1.9e-05,-7.1e-05,-4.7e-05,8.2e-05,-1e-05,3.8e-05,2.7e-05,-6e-06,4e-06,5.9e-05,2.4e-05,-1.3e-05,3.1e-05,7.8e-05,1.9e-05,7.4e-05,5e-06,-1.3e-05,-7e-06,-4e-06,-1e-06,2e-06,2.2e-05,2e-05,4.6e-05,-8e-06,-1.6e-05,-1.6e-05,3.1e-05,-9.4e-05,4.1e-05,-3.4e-05,-2e-05,8e-06,-7.3e-05,1.5e-05,4e-06,-1.7e-05,-8.7e-05,8e-06,-8e-06,-7e-06,-2.9e-05,-1.9e-05,-1e-06,8e-06,-3e-06,-1.3e-05,1.4e-05,2.1e-05,-1.6e-05,-5e-06,1.8e-05,2.6e-05,-4e-06,-2e-05,-6e-06,-1.3e-05,8e-06,0,2.7e-05,3e-06,-6e-06,2.7e-05,2.1e-05,1.2e-05,2.1e-05,-4e-06,-1.9e-05,-1.4e-05,3e-06,1e-06,-8e-06,3.7e-05,-5e-06,-1.9e-05
-5.9e-05,-6.4e-05,-8.2e-05,-7.2e-05,-1e-05,-2.1e-05,3e-05,1e-05,-4e-06,4.5e-05,7e-06,-1.2e-05,2.5e-05,-1e-05,-1e-06,-5.8e-05,1.4e-05,1.5e-05,-3e-06,-2.9e-05,2.7e-05,9e-06,9e-06,-3.2e-05,3e-06,-2e-05,-3.7e-05,-1.2e-05,-7.6e-05,-1.9e-05,2.2e-05,4.7e-05,2.3e-05,-1.5e-05,8e-06,7.3e-05,-1e-05,5e-05,5e-06,-7e-06,4.6e-05,1.4e-05,-3e-05,2.9e-05,-1.1e-05,-1e-06,-2e-06,1.4e-05,-4.6e-05,-1e-06,4.1e-05,-2.8e-05,1.4e-05,-2e-06,2e-05,-3e-05,-6e-06,-2.5e-05,-2.9e-05,-4e-06,-4.7e-05,2.5e-05,5e-06,3.6e-05,4e-06,4e-05,-1e-05,1.5e-05,3.1e-05,-1e-05,1.8e-05,2e-06,-4.5e-05,-4.3e-05,5.7e-05,-4.3e-05,2e-05,-2.1e-05,-1e-05,2.3e-05,-3.9e-05,-7.1e-05,-2.8e-05,1.6e-05,3e-06,5e-06,5e-06,4e-06,1.3e-05,1.8e-05,-1e-06,3e-05,-7e-06,-2.1e-05,-9e-06,1.7e-05,-1.8e-05,-2.7e-05,-1.4e-05,4e-06,2.4e-05,6e-06,1.4e-05,-5e-06,-7e-06,5e-06,-5e-06,0,1.9e-05,-3e-05,-3.1e-05,-5e-06,0,-2e-05,-1.9e-05,-2.8e-05,-6e-06,2e-06,-1.7e-05,-9e-06,7e-06
6.4e-05,5.1e-05,9e-06,-1.8e-05,-6e-06,0,3.3e-05,1.7e-05,-1.9e-05,2e-06,-1.7e-05,6e-06,-3.2e-05,1e-05,6e-06,3.7e-05,1e-05,3.5e-05,-1e-06,6e-06,-1.5e-05,-2.4e-05,2e-06,7e-06,1.6e-05,-1.3e-05,-1.1e-05,-1.5e-05,5.7e-05,1.6e-05,-4.1e-05,-4.6e-05,-7e-06,-3.2e-05,-5e-06,-1.4e-05,1.5e-05,-2.7e-05,7e-06,-4e-06,-2.3e-05,-1.7e-05,-4e-06,-2.2e-05,5.6e-05,-1e-06,3.2e-05,4.1e-05,5e-06,1.7e-05,-5.1e-05,1.1e-05,1.1e-05,-2e-06,-2.2e-05,2.2e-05,-2.3e-05,5e-06,4.5e-05,-6.5e-05,2e-05,-2.4e-05,-5e-06,5e-05,5e-06,-1.3e-05,2.2e-05,3e-06,-5.8e-05,-1.6e-05,5e-06,-1.6e-05,4.2e-05,0,-3.6e-05,3.2e-05,-1.4e-05,1.5e-05,1e-06,5e-06,3.7e-05,5.8e-05,8e-06,3e-06,1.2e-05,5e-06,3e-05,2e-06,-1.6e-05,5e-06,1e-06,-1.1e-05,-4e-06,7e-06,-1.7e-05,-1.6e-05,2.3e-05,1e-06,-1.1e-05,-1e-05,-2.5e-05,-4e-06,-2.1e-05,-9e-06,-1e-06,-1.2e-05,-1e-06,3e-06,-4.6e-05,-2e-06,1.9e-05,-1.7e-05,-1e-06,6e-06,9e-06,2e-05,4e-06,8e-06,5e-06,-1e-05,2.4e-05
2.3e-05,-2.6e-05,-1.2e-05,6e-06,1e-05,1.5e-05,-8e-06,-2.7e-05,1.1e-05,-2.6e-05,3e-06,2.9e-05,-3.1e-05,2e-06,-4e-06,2.8e-05,2e-06,-3.3e-05,-3.1e-05,1.6e-05,2e-05,-1.8e-05,4e-05,-1.1e-05,9e-06,3e-05,-2.1e-05,1.2e-05,-3.5e-05,-2e-05,3.7e-05,1e-05,1.9e-05,1.3e-05,1.6e-05,-3.6e-05,-9e-06,2.1e-05,-1e-05,-1.2e-05,-3.6e-05,1e-05,-4e-06,9e-06,-3e-06,-1.1e-05,7e-06,-4.3e-05,1.7e-05,-1.9e-05,-2.1e-05,-2.6e-05,-1.5e-05,1.1e-05,-2e-05,2.5e-05,-1e-06,1.9e-05,-5.4e-05,1.1e-05,1.6e-05,-3e-06,6e-06,-6.2e-05,-2e-06,-5e-05,1.5e-05,-1.7e-05,3.6e-05,-6e-06,-2e-06,1e-05,2.9e-05,2e-05,7e-06,-2.4e-05,-2e-06,-1.3e-05,-2e-06,4.2e-05,-4e-06,1.2e-05,2.7e-05,-2.4e-05,1.1e-05,-1.2e-05,-3.5e-05,1e-06,9e-06,-1.5e-05,-5e-06,1.1e-05,0,5e-06,1.3e-05,1.9e-05,-2e-05,7e-06,1.2e-05,-1e-06,1.1e-05,-1e-06,1.2e-05,6e-06,7e-06,-1e-06,0,-1e-06,1e-05,1.3e-05,-5e-06,9e-06,0,2.4e-05,6e-06,1.6e-05,-2e-06,-7e-06,1.2e-05,-4e-06,-4e-06
-6.2e-05,1.4e-05,2e-05,3.5e-05,-8e-06,-1.2e-05,-8e-06,1.8e-05,1e-06,2.4e-05,2.4e-05,1e-06,-3e-06,-3e-06,-1.5e-05,1.8e-05,1e-05,-8e-06,6e-06,-1.9e-05,-4.3e-05,3.2e-05,-3.2e-05,5e-06,-1.1e-05,-3.3e-05,0.000105,-3e-06,3.7e-05,2.3e-05,-2.3e-05,-2.2e-05,1.6e-05,4e-06,-8e-06,4.3e-05,-4e-06,-2.5e-05,-8e-06,0,5.3e-05,1e-06,4e-06,3e-06,-1.5e-05,-4e-06,-5.4e-05,3e-06,-4.4e-05,-2.7e-05,3.9e-05,1.9e-05,-1.1e-05,-2e-06,-2.6e-05,-1e-05,2e-05,-2.9e-05,3.5e-05,8.4e-05,-3.2e-05,1.5e-05,-4e-06,-2.7e-05,-9e-06,8e-06,-1.3e-05,-1.6e-05,1e-06,2.6e-05,-6e-06,-1.6e-05,-2.4e-05,-3e-06,7e-06,2.2e-05,1e-05,6e-06,0,-2.5e-05,-2.8e-05,8e-06,-1e-06,1.9e-05,-3e-06,1.4e-05,8e-06,-2.8e-05,-9e-06,-1e-06,0,1.6e-05,1.1e-05,-9e-06,8e-06,-1.3e-05,6e-06,3e-06,0,1.4e-05,4e-06,0,-3e-06,-4e-06,0,1e-05,-3e-06,0,6e-06,6e-06,3e-06,-8e-06,2e-06,-3e-06,-1e-06,-2.3e-05,-2e-06,2e-06,-1.8e-05,-7e-06,-1.8e-05
1.2e-05,-1.1e-05,-2e-05,1.4e-05,5e-06,4.8e-05,5e-06,3e-06,1.3e-05,-2.4e-05,-8e-06,3e-06,3.3e-05,5e-06,1.1e-05,0,-3e-06,3e-05,0,9e-06,1.3e-05,-4.7e-05,-2.6e-05,1.9e-05,-4.2e-05,3e-06,-9.6e-05,0,-3.1e-05,-2.5e-05,2.7e-05,3.6e-05,-1.5e-05,-2.9e-05,5e-06,-1e-06,9e-06,1.2e-05,1.1e-05,1.2e-05,-4.8e-05,7e-06,0,-7e-06,-2.3e-05,8e-06,4.7e-05,3.7e-05,3.6e-05,3.1e-05,6e-06,4e-06,1.1e-05,-2e-06,-4e-06,8e-06,5e-06,3.3e-05,-1.8e-05,-4.6e-05,4e-06,-1.8e-05,-3e-06,6e-05,5e-06,4.4e-05,-7e-06,0,-1.6e-05,-3.9e-05,-6e-06,8e-06,9e-06,-1e-06,4e-06,-1.1e-05,1e-06,1e-05,5e-06,0,2.7e-05,-1.6e-05,-1.6e-05,8e-06,-5e-06,-1.9e-05,4e-06,-2e-06,1.5e-05,8e-06,0,-2.3e-05,5e-06,1e-05,-2e-05,1.3e-05,-3e-06,-7e-06,-1.1e-05,-4e-06,-4e-06,2e-06,2e-06,3e-06,7e-06,-1.9e-05,8e-06,-3e-06,5e-06,-1e-05,-2e-06,1.2e-05,-4e-06,3e-06,5e-06,-1e-06,3e-06,9e-06,2.2e-05,4e-06,-6e-06
3.5e-05,-5e-06,1.9e-05,-4.2e-05,-4e-06,-1e-05,2e-05,-1.7e-05,2e-06,2.7e-05,-2e-06,-1e-06,2.3e-05,-6e-06,1e-05,-3e-05,-4e-06,-3.8e-05,9e-06,-1.1e-05,1.3e-05,3.6e-05,2e-05,-2.7e-05,4.6e-05,1.5e-05,1.8e-05,-1.1e-05,5.3e-05,1.3e-05,-9e-06,1.8e-05,5e-06,-2e-06,-3e-06,-2.7e-05,0,-1.5e-05,-7e-06,1e-06,2.5e-05,-1.6e-05,1e-06,8e-06,1.4e-05,1.3e-05,-1e-05,-4.1e-05,-1.8e-05,-2.2e-05,-3.4e-05,0,3e-06,-2e-06,1.1e-05,-2e-05,-1.7e-05,-3.3e-05,1e-05,-3.3e-05,5e-06,-4e-06,2e-06,2.4e-05,-4e-06,-1.5e-05,9e-06,1.3e-05,1.8e-05,3.3e-05,-2e-06,-1e-05,9e-06,8e-06,-5e-06,6e-06,1.7e-05,-7e-06,-4e-06,-1.7e-05,-1.6e-05,-5e-06,-9e-06,4e-06,-4e-06,1.3e-05,1.2e-05,6e-06,-1e-05,7e-06,0,7e-06,1e-05,-6e-06,-5e-06,-1e-05,-1.1e-05,-3e-06,1e-06,-4e-06,9e-06,-1e-06,-1e-06,2e-06,6e-06,-7e-06,-1.1e-05,-5e-06,-5e-06,8e-06,-3e-06,-8e-06,5e-06,-6e-06,-1.2e-05,1.9e-05,-2e-06,-1e-05,-1.2e-05,-2e-06,2.2e-05
-3.2e-05,7e-06,8e-06,2e-06,4e-06,-2.2e-05,-1.3e-05,1.6e-05,2e-06,-1.9e-05,0,1.4e-05,2e-06,1e-06,-4e-06,-1.2e-05,2e-06,2.4e-05,1e-06,1e-06,-9e-06,-6e-06,2e-05,2.3e-05,-4e-06,-2.8e-05,-2e-06,3e-06,-5e-05,-3e-06,-1.3e-05,-9e-06,-2e-06,8e-06,0,2e-05,0,1.8e-05,2e-06,2e-06,1.3e-05,1.2e-05,1e-06,-7e-06,2.3e-05,6e-06,-2e-05,1.4e-05,4e-06,1.8e-05,1.4e-05,4e-06,1e-06,2e-06,1.3e-05,3e-06,-1.4e-05,3.4e-05,-3e-06,1e-06,3e-06,1.4e-05,-1e-06,-5.9e-05,6e-06,-4e-06,0,7e-06,-2.8e-05,-9e-06,2e-06,6e-06,-2.6e-05,5e-06,9e-06,5e-06,-1.1e-05,8e-06,-2e-06,4e-05,5e-06,-2.6e-05,7e-06,-1.5e-05,-8e-06,-5e-06,-1.6e-05,-1.5e-05,1e-06,-7e-06,2e-06,4e-06,0,-2e-06,9e-06,1.2e-05,8e-06,1.1e-05,8e-06,1e-06,-1.3e-05,-2e-06,3e-06,2e-06,1e-06,9e-06,6e-06,0,-1.4e-05,0,1.5e-05,3e-06,-5e-06,8e-06,1e-06,-9e-06,1e-06,7e-06,3e-06,-2e-06,-1e-06
-1e-05,-1.2e-05,-1.7e-05,3e-05,-3e-06,-1e-06,-8e-06,-8e-06,-1.5e-05,6e-06,1e-06,-1.6e-05,-2.1e-05,-3e-06,-7e-06,2.1e-05,0,-1.4e-05,-2e-06,9e-06,5e-06,0,-8e-06,-3e-05,1e-05,1.3e-05,3.2e-05,6e-06,3.2e-05,-4e-06,2.4e-05,-3.4e-05,-8e-06,6e-06,1e-06,5e-06,-9e-06,-3e-06,-3e-06,-6e-06,-3e-06,-5e-06,-3e-06,8e-06,-4e-06,0,-5e-06,1e-05,1.4e-05,1.2e-05,1.4e-05,-8e-06,0,-1e-06,2e-05,2e-06,1.3e-05,-2.5e-05,-7e-06,3.4e-05,7e-06,-6e-06,-3e-06,2.8e-05,-6e-06,-1e-06,-5e-06,-2e-06,2.3e-05,-5e-06,3e-06,-1e-06,-7e-06,-8e-06,-1e-05,-8e-06,2e-06,0,1e-06,-8e-06,-3e-06,2.6e-05,7e-06,1.5e-05,-1e-06,6e-06,1e-05,6e-06,3e-06,-5e-06,0,1e-06,6e-06,6e-06,-5e-06,-7e-06,2e-06,-4e-06,-6e-06,-1e-06,4e-06,0,-4e-06,-2e-06,1e-06,-3e-06,-3e-06,1e-06,1.7e-05,-6e-06,-2e-05,-9e-06,3e-06,-1e-06,-4e-06,-9e-06,-1e-06,-1e-06,7e-06,-1e-06,-9e-06
3.6e-05,1.3e-05,3.6e-05,-5e-06,5e-06,2.1e-05,4e-06,-5e-06,-1e-06,1e-06,-9e-06,9e-06,0,0,1e-06,-8e-06,-2e-06,3e-06,-1e-06,-2e-06,-9e-06,5e-06,-1.3e-05,2.2e-05,-4.2e-05,1.3e-05,2e-06,-1e-05,-3.9e-05,1.2e-05,-2.5e-05,-1.1e-05,1.3e-05,-1.1e-05,7e-06,-2.9e-05,1.4e-05,-3e-06,6e-06,-6e-06,-1.6e-05,-7e-06,5e-06,-9e-06,-1.1e-05,-7e-06,8e-06,-8e-06,-2.6e-05,-2.3e-05,-1e-05,2e-06,-8e-06,4e-06,0,-3e-06,7e-06,1.9e-05,1e-06,6e-06,-2e-06,-4e-06,5e-06,-1.6e-05,1e-06,1e-06,-1e-06,-1.1e-05,5e-06,4e-06,0,-1e-06,1.6e-05,9e-06,1.2e-05,1.1e-05,-1e-06,-6e-06,-1e-06,2e-06,7e-06,-2e-06,2e-06,-1.4e-05,3e-06,-8e-06,-3e-06,1e-06,-4e-06,2e-06,1e-06,2e-06,3e-06,-5e-06,-1e-06,6e-06,-1e-06,-3e-06,-4e-06,2e-06,-3e-06,1e-06,5e-06,-1e-06,-8e-06,-5e-06,1e-06,1e-06,2e-06,-5e-06,9e-06,2e-06,-1e-06,-7e-06,3e-06,1.4e-05,0,-2e-06,-1.4e-05,-3e-06,-3e-06
-1e-05,-1.2e-05,-2.6e-05,-2.3e-05,-2e-06,-1.5e-05,1.4e-05,1.2e-05,2e-06,-1.4e-05,3e-06,-1.1e-05,-4e-06,3e-06,1e-06,1e-05,3e-06,1.1e-05,0,3e-06,2.1e-05,-1.2e-05,-2e-06,-7e-06,3.3e-05,-2.1e-05,-7e-05,4e-06,2.9e-05,-1.4e-05,8e-06,2.9e-05,-1.5e-05,-1e-05,-5e-06,1.8e-05,-6e-06,-3e-06,-3e-06,7e-06,1.4e-05,1e-05,-1e-06,9e-06,-1.1e-05,-5e-06,0,-1.4e-05,2.7e-05,1.7e-05,-1.3e-05,-1.3e-05,7e-06,-4e-06,-1.2e-05,1.6e-05,0,-1e-05,-1.7e-05,-3.6e-05,-1.7e-05,1.3e-05,-2e-06,2e-05,-1e-06,0,4e-06,-6e-06,-2.5e-05,3e-06,1e-06,5e-06,-5e-06,-1e-05,-9e-06,-1.4e-05,0,4e-06,1e-06,-2.4e-05,-1.1e-05,1.7e-05,-4e-06,-8e-06,5e-06,6e-06,-3e-06,2e-06,4e-06,6e-06,-1e-06,-2e-06,3e-06,2e-06,1.4e-05,-4e-06,6e-06,-2e-06,7e-06,3e-06,0,0,-7e-06,-3e-06,-7e-06,7e-06,1e-06,3e-06,-3e-06,1.1e-05,3e-06,4e-06,-2e-06,-8e-06,8e-06,-2e-06,2e-06,1e-06,1.2e-05,2e-06,-2e-06
-2.2e-05,8e-06,1.5e-05,0,2e-06,3e-06,-7e-06,-1.1e-05,3e-06,2.1e-05,2e-06,0,1e-06,-2e-06,2e-06,-5e-06,0,-1.1e-05,3e-06,-1.1e-05,-1.3e-05,8e-06,1.6e-05,7e-06,-8e-06,1.4e-05,6.2e-05,-7e-06,-3.1e-05,8e-06,1e-06,-2e-06,1e-05,3e-06,1e-06,1e-05,-6e-06,-2e-06,-3e-06,1e-06,-1.8e-05,-4e-06,-1e-06,-9e-06,1.5e-05,-3e-06,-6e-06,2.5e-05,-1.4e-05,-1.7e-05,2e-05,1.5e-05,5e-06,-1e-06,-9e-06,-1.6e-05,-7e-06,0,1.9e-05,2e-06,8e-06,-5e-06,-2e-06,4e-06,2e-06,6e-06,-1e-06,3e-06,2e-05,-1.3e-05,-1e-06,-2e-06,-4e-06,-1e-06,8e-06,1.5e-05,5e-06,-4e-06,1e-06,1.2e-05,5e-06,-1.3e-05,-4e-06,1.8e-05,5e-06,-7e-06,1e-05,2e-06,-4e-06,-1e-06,0,1e-06,-5e-06,1e-06,7e-06,5e-06,-6e-06,8e-06,1e-06,-3e-06,1e-06,-1e-06,6e-06,0,-2e-06,1.2e-05,-1e-06,0,-1.1e-05,-1e-06,-6e-06,-2e-06,2e-06,-1e-06,1e-06,-1e-05,-1e-06,2e-06,-8e-06,1e-06,1e-05
2.8e-05,-8e-06,3e-06,2.1e-05,1e-06,0,-1.5e-05,4e-06,2e-06,-2e-05,-7e-06,-7e-06,2e-05,2e-06,-1e-06,-2.1e-05,0,2e-06,1e-06,5e-06,2e-06,-1.4e-05,-5e-06,-2e-06,1e-05,-1e-06,-1.6e-05,8e-06,2.4e-05,-3e-06,-4e-06,1e-06,-1e-05,-3e-06,-4e-06,-2.2e-05,8e-06,-1e-06,1e-06,-2e-06,5e-06,2e-06,-1e-06,9e-06,2e-06,0,-1.1e-05,-1.4e-05,2e-06,4e-06,0,-9e-06,-7e-06,-1e-06,-1e-05,-2e-06,-5e-06,1e-05,-1e-05,3.1e-05,6e-06,-7e-06,3e-06,-1.6e-05,-1e-06,3e-06,-1e-06,7e-06,-1.2e-05,1.1e-05,1e-06,2e-06,1.5e-05,0,-1.2e-05,-1.4e-05,-5e-06,0,-2e-06,5e-06,4e-06,-3e-06,1e-06,-6e-06,2e-06,9e-06,-9e-06,-3e-06,1e-06,-4e-06,0,-4e-06,-3e-06,-3e-06,-3e-06,-2e-06,-3e-06,-4e-06,-8e-06,-2e-06,5e-06,0,-3e-06,2e-06,0,-7e-06,0,0,8e-06,-5e-06,7e-06,1e-06,-3e-06,7e-06,2e-06,9e-06,0,-3e-06,-1e-06,3e-06,4e-06
-5e-06,2e-06,5e-06,0,1e-06,-7e-06,1.6e-05,4e-06,4e-06,1.5e-05,4e-06,4e-06,-4e-06,-1e-06,-2e-06,2.3e-05,2e-06,7e-06,-2e-06,2e-06,-2e-06,6e-06,0,-7e-06,-1.6e-05,-1.7e-05,2e-05,-6e-06,-2.9e-05,1e-06,9e-06,-2.1e-05,2e-06,0,1e-06,1.5e-05,-5e-06,7e-06,2e-06,1e-06,1e-06,-1e-06,-2e-06,-9e-06,0,0,1.4e-05,-5e-06,1.2e-05,4e-06,-1.3e-05,1.2e-05,1e-06,3e-06,3e-06,1e-06,2e-06,-1.4e-05,1.3e-05,-8e-06,-1.2e-05,1e-05,-3e-06,-3e-06,1e-06,-6e-06,1e-06,3e-06,5e-06,3e-06,-2e-06,2e-06,3e-06,-1e-06,6e-06,1.3e-05,0,4e-06,1e-06,5e-06,-7e-06,-1.3e-05,5e-06,0,0,-6e-06,3e-06,6e-06,-3e-06,-1e-06,0,-1e-06,-5e-06,2e-06,3e-06,3e-06,5e-06,-1e-06,4e-06,3e-06,-7e-06,1e-06,1e-06,1e-06,5e-06,3e-06,1e-06,0,3e-06,2e-06,-9e-06,-5e-06,2e-06,2e-06,-6e-06,3e-06,0,4e-06,8e-06,2e-06,-1.5e-05
-1.7e-05,-1e-06,-1.7e-05,-1.2e-05,-4e-06,7e-06,-3e-06,-7e-06,-2e-06,-7e-06,2e-06,-6e-06,-2e-05,0,2e-06,7e-06,-1e-06,-3e-06,0,0,-2e-06,0,-3e-06,5e-06,7e-06,1.5e-05,-4.2e-05,-3e-06,2.3e-05,2e-06,-1.1e-05,-4e-06,1e-06,-5e-06,0,5e-06,1e-06,0,-1e-06,-4e-06,7e-06,2e-06,1e-06,8e-06,-1.1e-05,3e-06,-7e-06,1.3e-05,-2.1e-05,-1e-06,1e-06,-8e-06,1e-06,-1e-06,8e-06,-5e-06,7e-06,1.8e-05,-1.6e-05,-2.1e-05,1.5e-05,-3e-06,2e-06,5e-06,-2e-06,-1e-05,-2e-06,-2e-06,9e-06,-1.3e-05,1e-06,0,-1e-05,2e-06,0,-1.2e-05,-5e-06,-4e-06,0,-1.6e-05,5e-06,1.4e-05,0,2e-06,-3e-06,1e-06,-3e-06,3e-06,6e-06,3e-06,0,4e-06,0,-1e-06,3e-06,-1e-06,-2e-06,0,5e-06,1e-06,4e-06,0,0,1e-06,4e-06,1e-05,-1e-06,-1e-06,-2e-06,1e-06,1e-05,4e-06,-1e-06,2e-06,-2e-06,-1e-05,0,-3e-06,-1.2e-05,2e-06,8e-06
1.1e-05,-2e-06,2.4e-05,-4e-06,7e-06,9e-06,-6e-06,6e-06,-4e-06,-1e-06,1e-06,2e-06,5e-06,1e-06,6e-06,-3e-06,-1e-06,-1e-05,-1e-06,3e-06,3e-06,5e-06,-6e-06,-7e-06,-7e-06,-6e-06,1.1e-05,3e-06,-2.4e-05,-4e-06,1e-05,-7e-06,-3e-06,0,1e-06,-1.7e-05,0,-5e-06,-1e-06,0,-1.1e-05,-5e-06,2e-06,-8e-06,4e-06,3e-06,-5e-06,-3e-06,1.8e-05,1e-06,1.2e-05,5e-06,0,0,4e-06,1.4e-05,3e-06,-2e-05,1.5e-05,0,-6e-06,-7e-06,-1e-06,2.2e-05,0,8e-06,-2e-06,-7e-06,-2e-05,1.5e-05,-2e-06,1e-06,1e-06,3e-06,-2e-06,8e-06,1e-06,0,0,-3e-06,-1e-06,-4e-06,-5e-06,-4e-06,-4e-06,2e-06,8e-06,-2e-06,-7e-06,1e-06,0,-2e-06,-5e-06,0,-7e-06,1e-06,-1e-06,3e-06,-6e-06,-1e-06,-6e-06,-1e-06,-1e-06,0,2e-06,-8e-06,0,0,-3e-06,-7e-06,-7e-06,-2e-06,0,-2e-06,0,3e-06,0,1e-06,1.1e-05,1e-06,-1e-06
8e-06,3e-06,-1.4e-05,1.6e-05,-9e-06,-5e-06,2e-06,-1e-06,-1e-06,6e-06,-6e-06,0,4e-06,-1e-06,0,-7e-06,0,1.9e-05,4e-06,-4e-06,-8e-06,-8e-06,9e-06,1.2e-05,5e-06,-9e-06,3.6e-05,-4e-06,3.2e-05,6e-06,-3e-06,2.3e-05,6e-06,4e-06,1e-06,9e-06,1e-06,1e-06,1e-06,4e-06,1.1e-05,4e-06,1e-06,7e-06,3e-06,2e-06,1e-06,-7e-06,-1.1e-05,3e-06,-7e-06,-8e-06,4e-06,-2e-06,6e-06,-3e-06,-6e-06,1.9e-05,-9e-06,2.2e-05,-8e-06,8e-06,-1e-06,-2.5e-05,-1e-06,6e-06,1e-06,-2e-06,1.8e-05,-7e-06,1e-06,1e-06,2e-06,1e-06,7e-06,-6e-06,1e-06,1e-06,0,6e-06,0,1.5e-05,-2e-06,-3e-06,-2e-06,-3e-06,-7e-06,2e-06,6e-06,-3e-06,0,-2e-06,0,1e-06,-4e-06,0,2e-06,-2e-06,-2e-06,0,4e-06,0,0,-2e-06,2e-06,-4e-06,0,0,-3e-06,3e-06,-2e-06,2e-06,0,3e-06,1e-06,7e-06,-1e-06,0,-7e-06,0,1e-06
-1.1e-05,-4e-06,-6e-06,1e-06,7e-06,-7e-06,6e-06,-4e-06,2e-06,-1.2e-05,3e-06,6e-06,4e-06,1e-06,-6e-06,-1.1e-05,0,-1.8e-05,0,-3e-06,9e-06,1.2e-05,2e-06,-1e-05,1e-05,1.5e-05,-3e-05,5e-06,-2.2e-05,-6e-06,-7e-06,-5e-06,-2e-06,-4e-06,-1e-06,7e-06,1e-06,-2e-06,0,-2e-06,-6e-06,0,1e-06,-5e-06,5e-06,0,1e-05,6e-06,-1e-06,-7e-06,-5e-06,3e-06,-4e-06,1e-06,-4e-06,1e-06,-7e-06,-1.5e-05,7e-06,4e-06,1.1e-05,0,1e-06,1e-06,1e-06,-3e-06,2e-06,3e-06,-5e-06,-5e-06,0,-1e-06,-9e-06,0,-1.1e-05,3e-06,-1e-06,-2e-06,-2e-06,4e-06,-3e-06,-1.1e-05,4e-06,2e-06,-1e-06,3e-06,3e-06,7e-06,-4e-06,-2e-06,0,0,-3e-06,-1e-06,3e-06,0,0,-2e-06,6e-06,-2e-06,1e-06,0,1e-06,-1e-06,-2e-06,3e-06,0,-1e-06,7e-06,6e-06,8e-06,-1e-06,0,0,4e-06,-7e-06,1e-06,0,0,1e-06,2e-06
-3e-06,3e-06,1.3e-05,-1.3e-05,-3e-06,8e-06,-2e-06,4e-06,2e-06,1.3e-05,0,-5e-06,9e-06,0,-2e-06,1.1e-05,-1e-06,1e-05,0,3e-06,-7e-06,-7e-06,-6e-06,7e-06,-1e-05,-9e-06,5e-06,-8e-06,2.4e-05,6e-06,9e-06,-2e-06,2e-06,-6e-06,-2e-06,-1.5e-05,-2e-06,3e-06,-1e-06,0,-3e-06,-3e-06,0,2e-06,-5e-06,0,-9e-06,3e-06,1.2e-05,4e-06,5e-06,1e-06,-1e-06,1e-06,-5e-06,-1e-06,3e-06,1.1e-05,-3e-06,-2.6e-05,-9e-06,-7e-06,-1e-06,9e-06,0,-3e-06,0,4e-06,-8e-06,6e-06,0,3e-06,0,1e-06,1.2e-05,0,1e-06,3e-06,0,3e-06,4e-06,0,1e-06,6e-06,2e-06,-4e-06,0,-2e-06,4e-06,2e-06,0,-2e-06,-1e-06,0,0,1e-06,1e-06,3e-06,0,0,-1e-06,0,-2e-06,0,-2e-06,-4e-06,0,0,-3e-06,-1e-06,-9e-06,-1e-06,-1e-06,-1e-06,-1e-06,-2e-06,0,-1e-06,6e-06,0,-8e-06
1.5e-05,-3e-06,-1.3e-05,-2e-06,-2e-06,-8e-06,-8e-06,-2e-06,0,-1e-05,-2e-06,7e-06,-1.6e-05,0,3e-06,1e-05,0,0,-2e-06,2e-06,4e-06,-2e-06,-1e-06,-7e-06,-2e-06,-4e-06,-2e-05,3e-06,-2e-05,-4e-06,-7e-06,-2.1e-05,0,-5e-06,1e-06,7e-06,1e-06,0,-1e-06,0,1e-06,3e-06,-1e-06,1e-06,-2e-06,-1e-06,1e-06,-9e-06,-1.8e-05,-3e-06,4e-06,-2e-06,3e-06,-1e-06,-1e-06,-7e-06,8e-06,-5e-06,0,1e-06,5e-06,6e-06,0,-3e-06,-2e-06,1e-06,-2e-06,2e-06,1.4e-05,0,0,-4e-06,9e-06,-3e-06,-1e-05,-2e-06,-3e-06,1e-06,1e-06,-1.2e-05,-3e-06,-9e-06,-2e-06,-7e-06,3e-06,2e-06,-1e-06,-4e-06,-6e-06,2e-06,0,-2e-06,0,0,-2e-06,-1e-06,-2e-06,1e-06,-5e-06,2e-06,4e-06,0,2e-06,1e-06,-2e-06,-6e-06,1e-06,0,-1e-06,-3e-06,8e-06,1e-06,1e-06,-3e-06,-1e-06,7e-06,0,2e-06,-8e-06,1e-06,5e-06
-8e-06,1e-06,1e-06,1e-05,3e-06,6e-06,7e-06,-1e-06,1e-06,6e-06,0,-2e-06,-1.1e-05,1e-06,2e-06,-6e-06,0,-9e-06,-1e-06,-3e-06,-1e-06,4e-06,0,2e-06,-3e-06,1.1e-05,3.8e-05,-1e-06,2.1e-05,0,4e-06,7e-06,-1e-06,7e-06,0,7e-06,-1e-06,3e-06,2e-06,-2e-06,8e-06,-1e-06,-1e-06,-2e-06,1e-06,-1e-06,3e-06,5e-06,1.5e-05,0,-6e-06,5e-06,-2e-06,-1e-06,-4e-06,8e-06,1e-06,-2e-06,2e-06,2.1e-05,5e-06,1e-06,2e-06,1e-06,-1e-06,-1e-06,-1e-06,-2e-06,-1.5e-05,-9e-06,-1e-06,2e-06,0,-1e-06,9e-06,4e-06,1e-06,-1e-06,-1e-06,3e-06,0,1e-05,-1e-06,3e-06,2e-06,-1e-06,2e-06,4e-06,5e-06,-1e-06,0,0,-1e-06,0,3e-06,2e-06,-1e-06,-1e-06,3e-06,0,-5e-06,0,-1e-06,1e-06,-4e-06,1e-06,-1e-06,0,-1e-06,2e-06,-6e-06,-1e-06,-1e-06,-2e-06,-1e-06,-2e-06,0,-2e-06,7e-06,0,2e-06
-8e-06,-1e-06,1e-06,1e-06,-2e-06,-2e-06,2e-06,2e-06,-2e-06,1e-06,0,2e-06,1.6e-05,-1e-06,-2e-06,-3e-06,0,1.3e-05,0,2e-06,-1e-06,-3e-06,4e-06,4e-06,1.7e-05,-1.3e-05,-6e-06,-2e-06,-2e-05,2e-06,-2e-06,7e-06,2e-06,1e-06,1e-06,-1.4e-05,1e-06,-6e-06,0,2e-06,-1e-05,-2e-06,0,3e-06,1e-06,-1e-06,4e-06,2e-06,-6e-06,3e-06,-1e-06,-5e-06,1e-06,1e-06,3e-06,0,-6e-06,8e-06,-9e-06,0,-9e-06,-8e-06,-2e-06,2e-06,0,1e-06,2e-06,-4e-06,1e-05,1.2e-05,0,-2e-06,-3e-06,-1e-06,-6e-06,-7e-06,1e-06,2e-06,0,-1e-06,4e-06,-3e-06,1e-06,2e-06,1e-06,3e-06,-1e-06,-3e-06,-5e-06,-1e-06,0,0,2e-06,0,2e-06,-2e-06,2e-06,-2e-06,4e-06,-2e-06,2e-06,0,0,0,-1e-06,4e-06,1e-06,1e-06,1e-06,-1e-06,1e-06,1e-06,0,1e-06,-1e-06,-6e-06,0,2e-06,-3e-06,-1e-06,-1e-06
1e-05,-1e-06,4e-06,-1.1e-05,-2e-06,0,-4e-06,-1e-06,-1e-06,-7e-06,1e-06,-2e-06,2e-06,0,-2e-06,-1e-06,0,-9e-06,1e-06,-2e-06,3e-06,5e-06,0,-4e-06,-1.7e-05,2e-06,-3.1e-05,1e-06,2.1e-05,-3e-06,-1e-06,1.6e-05,-2e-06,-9e-06,1e-06,7e-06,-1e-06,3e-06,-1e-06,0,9e-06,0,0,-2e-06,4e-06,-1e-06,-4e-06,-4e-06,-4e-06,-3e-06,5e-06,7e-06,-1e-06,1e-06,2e-06,1e-06,-4e-06,-1.2e-05,1.2e-05,-1.8e-05,3e-06,5e-06,0,-6e-06,1e-06,3e-06,2e-06,-1e-06,1e-06,-6e-06,0,-1e-06,5e-06,0,0,8e-06,1e-06,-1e-06,0,1.3e-05,-3e-06,1.1e-05,0,-5e-06,-1e-06,-6e-06,2e-06,-2e-06,6e-06,1e-06,0,-1e-06,0,0,-3e-06,2e-06,-2e-06,3e-06,-5e-06,-1e-06,-3e-06,0,0,0,0,-3e-06,-1e-06,0,2e-06,-1e-06,3e-06,0,1e-06,1e-06,1e-06,6e-06,0,-1e-06,-3e-06,-1e-06,-3e-06
1e-06,1e-06,-1.2e-05,0,6e-06,-7e-06,1e-06,0,0,1.1e-05,-2e-06,2e-06,-7e-06,0,1e-06,-1e-06,0,1e-06,0,-3e-06,-6e-06,-8e-06,-4e-06,5e-06,9e-06,8e-06,1.6e-05,-5e-06,-2.5e-05,3e-06,7e-06,-1.1e-05,0,0,-1e-06,7e-06,-1e-06,-2e-06,0,-1e-06,-2e-06,2e-06,0,0,-4e-06,1e-06,1e-06,-2e-06,1.3e-05,3e-06,1e-06,-9e-06,-2e-06,0,-1e-06,2e-06,2e-06,1.5e-05,-1.2e-05,-1e-06,2e-06,4e-06,2e-06,0,-1e-06,0,0,2e-06,-1.2e-05,-4e-06,-1e-06,0,-1e-06,1e-06,2e-06,-8e-06,1e-06,-1e-06,0,-1e-05,1e-06,-1e-05,0,3e-06,-2e-06,7e-06,-5e-06,1e-06,-5e-06,0,0,-2e-06,4e-06,0,-3e-06,-2e-06,-1e-06,-1e-06,-1e-06,1e-06,3e-06,0,-1e-06,-1e-06,2e-06,1e-06,0,0,-1e-06,0,-7e-06,0,-2e-06,2e-06,-1e-06,2e-06,0,0,8e-06,-2e-06,2e-06
