-0.000258,0.000696,0.000638,0.00052,-9.7e-05,-0.000172,-0.000189,3e-06,-0.000144,-0.000525,-0.000679,-0.000758,-0.000355,-0.000718,-0.000143,-0.000643,-0.001977,-0.001362,-0.000456,9.1e-05,-2.8e-05,0.00181,0.004826,0.003063,0.005799,0.003899,0.001598,0.001067,0.001571,0.002463,0.004275,0.001895,0.010525,0.006823,0.0035,0.003266,0.002732,0.00183,5e-04,0.000857,0.000552,0.000616,-0.000402,-0.000143,0.000603,9.3e-05,-0.001606,-0.001399,-0.000341,-0.001072,0.000471,-0.000122,-0.000372,-0.000483,-0.000912,-0.000721,0.000556,0.000262,0.000158,-0.00013,0.000104,0.000217,-0.000276,-0.00045,-0.000494,-0.00044,-0.000214,-7.4e-05,7e-06,1.8e-05,-0.000187,-0.000259,-0.000345,-0.00011,2.5e-05,-0.000229,-0.000708,-0.000609,-0.000886,-0.000615,-0.001413,-0.001272,-0.000535,-0.000651,0.001055,0.001466,0.000995,0.000246,0.001593,0.001374,0.001639,0.000881,0.000751,0.00057,0.000864,6.8e-05,0.000718,0.000837,0.001104,0.000455,-2.1e-05,-6.5e-05,0.000488,0.001518,0.002046,0.001625,0.000845,0.00062,7.2e-05,-0.002033,-0.000728,5.4e-05,0.000173,2e-06,-0.001245,-0.000721,0.000285,0.000725,0.000958,0.000487,9.4e-05
0.001615,0.001072,0.001073,0.000495,0.000333,-4e-05,0.000222,0.000359,0.000159,0.000155,0.000679,0.000361,0.000364,0.000321,0.00076,0.00068,0.000137,0.000382,0.00077,0.001024,0.000672,0.000906,0.002345,0.00161,0.001402,0.003029,0.00147,0.00077,0.000898,-0.001644,0.000553,0.000602,-0.000603,0.000231,0.000869,0.001224,0.001197,0.001414,0.001019,0.000821,7.5e-05,0.000459,0.00153,0.000616,-3e-05,0.000974,0.001666,0.001755,0.00052,-3.5e-05,0.000992,0.000416,0.000916,0.000305,0.000692,0.000509,0.00089,0.000676,0.000375,0.000195,0.00035,0.000408,0.000322,9.3e-05,-1e-04,0.000159,0.000278,0.000294,0.000651,0.000576,0.000377,0.000213,0.000201,0.000372,0.000437,0.000523,0.000448,0.000145,0.000492,0.000341,0.000372,0.00092,0.000646,0.000475,0.000614,0.00081,0.001111,0.000517,0.001073,0.00087,0.000746,0.000295,0.000651,0.000413,0.000381,0.000644,0.000453,0.000475,0.000979,0.000621,0.000224,0.000118,4.3e-05,0.000706,0.001491,0.001429,0.001381,0.000528,0.000642,0.001955,0.001232,0.001294,0.000389,0.000467,0.001195,0.000665,0.000198,0.000692,0.000252,3.9e-05,0.000313
0.000289,-2.7e-05,4.7e-05,-6.6e-05,-5.5e-05,-0.00016,4.3e-05,2.1e-05,-2.1e-05,0.000255,-4.8e-05,6.2e-05,-3.7e-05,5.4e-05,-5.1e-05,0.000315,2.1e-05,-1.3e-05,-0.000228,-0.00064,-0.000737,-0.000813,-0.001081,8.5e-05,-0.002087,-0.000571,-0.000177,-0.000416,-0.000138,-0.000287,-0.000842,-0.000647,-0.004679,-0.003473,-0.001909,-0.000164,0.000128,0.000548,-3e-06,-0.000111,-0.000466,0.000334,-0.000108,-0.000358,2e-05,-0.000108,-0.00111,-0.000356,-0.001525,-0.001356,-0.000391,-1.8e-05,-0.000993,-0.000611,-0.000386,-0.000402,-0.000427,-6.1e-05,-3.2e-05,-5.1e-05,-4.4e-05,-0.000174,3e-06,0.00016,8.9e-05,-0.000268,0,4.5e-05,0.000318,6.1e-05,8.1e-05,-0.000111,6e-05,-0.000206,0.000278,0.000206,-6.1e-05,-0.000175,-0.000384,-0.000179,0.000171,-0.000293,-0.000127,-0.00067,-0.000908,-0.000447,9.5e-05,-0.000698,-0.000678,-0.000532,-0.001191,-0.000896,-0.000625,-0.000207,-1.8e-05,-1.3e-05,-0.000317,5.8e-05,0.00025,0.00017,-5e-05,-0.000194,-0.000305,-0.000914,0.00068,0.000109,0.00072,-0.000144,0.00024,-8.3e-05,0.000154,0.000187,-5.8e-05,0.000161,-0.000669,-0.000499,-0.000603,0.000466,-0.000231,-0.000249,0.00015
0.000162,-0.000399,-0.000236,-0.000373,-0.00023,-4.4e-05,3.9e-05,-0.000138,-2.5e-05,-0.000129,-0.000239,-0.00027,-0.000116,0.00031,-0.000178,-0.000432,-0.000537,-0.000736,-0.000482,-0.000105,0.000341,0.000118,-0.000866,-0.001305,-0.000885,-8e-04,-0.000309,0.000266,6e-05,-0.000217,-0.001062,-0.000642,-0.002192,-0.002494,-0.001337,-0.000988,-0.000689,0.000172,0.000449,8.5e-05,-0.00037,-0.000189,0.000204,0.000416,-0.000247,-1.9e-05,0.000178,0.000561,0.000251,0.000155,-4.7e-05,-0.00011,0.000218,0.000383,-0.000132,-6e-06,-0.000551,-0.000453,-0.000362,-0.000216,4.5e-05,3.3e-05,3.7e-05,-0.000159,-9.7e-05,-9.8e-05,1e-06,-0.000188,-0.000253,-3.1e-05,3e-05,-4.4e-05,6.1e-05,-6.6e-05,-2.2e-05,-0.00025,-0.000129,-9.5e-05,-0.000137,7.5e-05,-4.3e-05,-5.7e-05,-0.000254,5e-05,-0.000576,-0.000695,-0.000372,-4.4e-05,-0.000592,-0.000407,-0.001088,-0.00073,-0.00042,0.000209,-0.000144,6e-05,-0.000187,0.000142,-2.8e-05,-6.8e-05,3e-05,6.8e-05,-0.000298,-0.00088,0.000394,8.6e-05,0.000504,0.000281,0.000217,0.000277,-0.000428,2.2e-05,0.000184,-1.7e-05,-3.1e-05,-0.00033,-0.000504,-0.000125,0.00025,-0.000257,-0.00023
-0.000187,-0.000516,-0.00063,-0.000333,-0.000152,-4.6e-05,0.000153,-7.3e-05,-8.5e-05,-7.6e-05,4.2e-05,8.8e-05,0.000277,6.6e-05,-0.000224,-0.000327,0.00016,0.000711,0.00015,-0.000379,-0.000435,-0.000554,-0.001668,-0.001765,-0.000591,-0.001326,-0.000735,-0.000117,5.4e-05,-0.000224,-0.001063,-0.000437,-0.000994,-0.000848,-0.000503,-0.001088,-0.000788,-0.000167,0.000131,-0.000217,-0.000258,-0.00037,-0.000248,0.000255,-0.000262,0.000114,-5e-06,0.000369,-0.000233,0.000757,0.00015,-0.000118,1e-06,-4.5e-05,0.000135,-5.4e-05,-6.5e-05,-0.000612,7.2e-05,-8.6e-05,-0.000202,-0.000314,-0.000209,-1.6e-05,0.00012,2.8e-05,0.000199,4.2e-05,0.000135,-4.2e-05,-2.9e-05,-4.1e-05,-8.1e-05,0.000168,3.9e-05,9e-06,-3.5e-05,0.000293,0.000113,0.000199,0.000344,0.000249,0.000252,2.9e-05,-0.000613,-0.000766,-0.000489,-0.000255,-0.000602,-0.000784,-0.000814,-0.000413,-0.000479,-9.3e-05,-0.000115,0.000223,-0.000162,6.9e-05,-0.000419,-0.000336,-8.7e-05,-0.000117,-0.000145,-0.000669,8.9e-05,-0.000383,0.000423,1.8e-05,0.000301,0.000472,0.000717,2.3e-05,-2.4e-05,0.00027,8.5e-05,4.1e-05,0.000113,-5.3e-05,-7.8e-05,-7.1e-05,-8.6e-05
-0.000344,-0.000391,-0.000328,-0.000228,-3.8e-05,7.7e-05,6.4e-05,-3.9e-05,-0.000151,2.9e-05,7.9e-05,0.000102,-4.9e-05,4.4e-05,2.3e-05,-0.00016,0.000152,0.000274,-0.000139,-0.00037,-0.000239,-0.000306,-0.000233,-0.001648,-0.000996,-0.001758,-0.000592,0.000381,0.000204,-0.00022,-0.000414,-0.000609,-0.000549,-0.000653,-0.000455,-0.000642,-0.000723,-0.000487,0.000165,-0.000263,-0.000535,-0.000445,-0.000184,-7.2e-05,0.000272,0.000106,4.3e-05,0.000177,-0.00015,-0.000282,-0.00033,-0.000378,0.000138,3e-04,-9.9e-05,-0.000328,0.000114,-0.000246,-0.000337,-9.8e-05,0.000171,-0.000385,-0.000305,9.3e-05,8.5e-05,0.000143,-0.00014,0.000154,3.9e-05,-0.000142,-8.5e-05,9.2e-05,3.8e-05,2.1e-05,-0.00012,-0.000127,3.8e-05,-0.000192,-3.9e-05,-0.00031,-0.000425,-0.000149,-8e-05,-0.000138,0.000136,-0.000526,-0.000595,-0.000331,-0.000186,-0.000765,-0.000288,0.000447,-0.000113,0.000134,5.1e-05,0.000116,-9e-06,0.000336,-0.000368,-0.000231,-0.000202,-9.3e-05,3.5e-05,-0.000364,-0.000416,-0.000682,6.5e-05,-0.000125,-0.000213,0.000123,-0.000391,-4.2e-05,-0.000142,0.000411,0.00017,0.000164,9.4e-05,-0.000254,1.1e-05,7.8e-05,0.000235
-0.000281,-0.000813,-0.00055,-0.000442,-0.000103,-0.000132,-0.000293,-0.000104,-2e-05,-0.000161,-1.2e-05,4.5e-05,-8e-05,-1e-05,-4.8e-05,-0.000293,-0.000136,-0.000581,-0.000247,-0.000131,-0.000542,-0.000343,-0.000179,-0.001013,-0.000967,-0.000657,-0.00096,-0.000433,-1.7e-05,-0.000432,0.00019,-4.4e-05,-0.000341,-0.000292,-0.001182,-0.000298,-0.000637,-0.000445,2e-04,-0.000256,-0.000128,-0.000112,-0.00071,0.000266,-3.5e-05,0.000276,0.000123,-0.000158,-0.000298,-9.9e-05,0.000303,4.2e-05,-5.3e-05,0.000119,0.000134,-0.000104,0.000316,-0.000158,-0.000246,-5.3e-05,-5.2e-05,0.000114,0.000106,-4e-06,-0.000138,-0.000196,-0.000123,-0.000299,-3e-05,-8.9e-05,-1.5e-05,2.7e-05,-0.000126,-0.000112,-0.000175,-0.00022,-0.000258,0.000109,-8.1e-05,5e-05,2e-05,-0.000122,-0.000195,-6.4e-05,-2.4e-05,-0.000252,-0.000488,-1e-06,0.000245,-0.000677,-0.000431,0.000253,0.000168,-1.3e-05,-0.000134,0.000192,-0.000155,0.000301,-8.5e-05,-0.000442,-6.2e-05,0.000112,0.000149,-1.5e-05,-0.000271,-0.00046,-3.5e-05,-0.000183,-0.000151,6.9e-05,-0.000166,5.5e-05,-0.000255,-0.000164,0.000258,9.4e-05,-3.9e-05,-0.00033,-0.000478,-0.000119,0.000159
-0.000266,-8.2e-05,-3.1e-05,-0.000165,-4.4e-05,9.5e-05,-2.4e-05,-7.6e-05,-0.000175,-4.5e-05,-3.6e-05,-6e-06,-9.9e-05,-9e-06,-1.4e-05,-4.2e-05,0.000197,0.000138,0.000187,3.3e-05,-6e-06,0.000105,0.000189,-0.000145,-0.000877,-0.000289,-0.000656,-0.000123,-0.000406,-0.000552,-0.000371,0.000225,-9.8e-05,-5.4e-05,-0.000889,0.000257,-0.000549,-0.000495,0.000128,-6.3e-05,0.000143,0.000167,-0.000123,-0.000325,0.000108,-0.000255,-8.3e-05,0.00023,0.00057,-0.000534,-0.000303,0.000103,-3.4e-05,-0.000103,-0.000291,-5.5e-05,-0.000164,-1.1e-05,-0.000159,0.000155,4.1e-05,-2.1e-05,-9e-05,1.1e-05,-1.5e-05,6.3e-05,-4.1e-05,-0.00019,-1.8e-05,-0.000155,-0.000164,6.8e-05,5.4e-05,-7.6e-05,-9.1e-05,-0.000181,-7.8e-05,-1e-05,-0.00014,-0.000169,-0.000196,-3.1e-05,1.8e-05,8.3e-05,0.000122,4.7e-05,-3.9e-05,5.6e-05,4.9e-05,-0.000145,-0.000136,0.000211,0.000134,-5.8e-05,-0.000233,0.000271,6.2e-05,0.000164,-7e-06,-4.5e-05,-7.4e-05,3.6e-05,-5.5e-05,-0.000142,-0.000419,-0.000471,-0.000236,-0.000277,-2.4e-05,0.000131,3.6e-05,6e-05,-0.000286,9.4e-05,0.000329,-0.000114,0.000199,-0.000113,-0.000352,-0.000151,-9.3e-05
-0.000371,-0.00034,-0.000139,-0.000103,-3.9e-05,3.1e-05,-3.9e-05,-5.9e-05,-6.9e-05,-1.7e-05,5.1e-05,8.3e-05,9.9e-05,9.5e-05,-9.8e-05,-8e-05,0.000186,3.7e-05,-2.7e-05,0.000171,-2.8e-05,-4e-06,-4.4e-05,0.000127,-0.000775,-0.000249,-0.000331,-0.000508,-0.00034,-0.000454,-0.00034,-0.000264,-0.000527,8.5e-05,0.000319,0.000432,-0.000144,-0.000336,-4.9e-05,-6.2e-05,-4e-06,7.2e-05,-5.2e-05,-3.2e-05,-0.000337,6.3e-05,-0.000355,-0.000505,-0.000198,-0.000257,0.000154,-0.000115,-7.9e-05,0.000111,3.2e-05,1.2e-05,0.000155,0.000192,6.8e-05,-5.6e-05,6e-06,-1.3e-05,-8.2e-05,-4.9e-05,2.6e-05,-4.1e-05,3.2e-05,-2.4e-05,-0.000116,-0.000224,-4.5e-05,-1.1e-05,-3.9e-05,6.4e-05,-4.1e-05,2.8e-05,-8.7e-05,-0.000157,-1.1e-05,8e-06,5.6e-05,1e-06,-8.4e-05,9e-05,-0.000192,0.000167,-1.7e-05,0.000236,6.2e-05,-1e-06,3e-05,-0.000174,0.000188,-4.5e-05,-0.000137,8.8e-05,-5.8e-05,-0.000137,-4.6e-05,-0.000158,-3.5e-05,-1e-04,-4.5e-05,3.6e-05,-0.000175,-0.00041,-0.000287,-0.000227,-0.000114,2.6e-05,-0.000227,-4.8e-05,-0.000239,-8.1e-05,0.000115,-6e-05,-0.000112,0.000182,-0.00046,-0.000146,-0.000138
0,-0.000158,-3.3e-05,0.000115,4.6e-05,4.8e-05,1.6e-05,1.1e-05,4.5e-05,-2.3e-05,0.000133,-3e-06,-5e-05,0.00012,1.6e-05,2.5e-05,-5.9e-05,-9.1e-05,-6.4e-05,8.2e-05,0.000282,-1.7e-05,1.2e-05,0.000229,2e-06,-0.000217,-0.000506,-0.000294,-0.000279,-2.7e-05,-1.5e-05,-0.000608,-0.00052,-0.000197,0.001452,0.000494,0.000364,-0.000269,-0.000202,-0.000132,0.000148,0.00016,3e-05,4.8e-05,-0.00011,5.5e-05,-0.000366,0.000125,0.000821,0.000587,-0.000202,0.000383,-0.000248,0.000142,-6e-06,0.000109,0.000165,-1.4e-05,-2.1e-05,-0.000174,-3.9e-05,-2.6e-05,0.000153,-4.7e-05,3.2e-05,1.9e-05,7.1e-05,-7e-05,2.9e-05,-1.2e-05,-6.5e-05,1.1e-05,-2.3e-05,-4e-05,9.8e-05,1.1e-05,2e-06,7.7e-05,0.000187,7.4e-05,4.1e-05,2.2e-05,-6e-06,5.9e-05,5.5e-05,9.1e-05,0.00014,0.000282,0,0.000205,0.000153,-0.000192,-0.000194,-9.9e-05,-9e-05,-7.2e-05,-0.000142,-0.00017,-0.000167,3.2e-05,1e-05,2.3e-05,-5.1e-05,-2e-06,4.5e-05,-0.00035,-0.000204,-0.000249,-8.9e-05,-6.9e-05,-0.000158,-0.000219,-0.000143,6.2e-05,-2.3e-05,-6.1e-05,-1.8e-05,1.9e-05,-9.3e-05,1.6e-05,-0.000189
9e-06,0.000146,3.2e-05,-2.5e-05,-3.7e-05,-0.00012,-6e-06,-3.9e-05,6e-06,1e-06,1.2e-05,-1.4e-05,-2.2e-05,-4.2e-05,-8.7e-05,-5e-06,9.4e-05,2.2e-05,5.4e-05,-6.2e-05,-4e-06,0.000106,0.000141,-0.00016,8.5e-05,-0.000102,-0.000416,-0.000168,-0.000132,3e-05,-5e-06,-0.000548,-0.000301,-5.8e-05,0.001581,0.000142,0.000439,2.4e-05,-0.000209,-0.000147,-1.3e-05,9.3e-05,-2.7e-05,9.2e-05,-0.00015,-0.000238,-0.000415,-0.000177,-6.1e-05,-5.7e-05,-8.1e-05,-0.000294,-7.2e-05,6.5e-05,0.000179,-3.8e-05,-6.5e-05,-0.000158,0.000126,2.3e-05,-8.9e-05,-1.5e-05,-5e-06,-0.000118,-2e-05,3.1e-05,-3e-06,3.6e-05,-6.3e-05,1.3e-05,3.5e-05,-3e-06,7.9e-05,-2.8e-05,-9.9e-05,-2.2e-05,1.5e-05,-4.5e-05,-1.8e-05,8.2e-05,-0.000127,-0.000103,4.7e-05,0.000125,7.5e-05,-9.7e-05,-2.5e-05,0.000296,0.000117,1e-04,0.000169,-7e-05,-0.000207,-3.1e-05,8e-06,-6.4e-05,-0.000111,-3.6e-05,-9.2e-05,5e-06,-2.6e-05,-0.000116,4.2e-05,-0.000149,0.000169,-0.000211,-0.000222,-0.000202,-0.00015,3.7e-05,-6e-06,0.000137,4e-05,-0.000206,7.1e-05,-0.000131,-4.2e-05,9.9e-05,-1.9e-05,4.2e-05,-0.000183
-8.8e-05,-0.00017,-3.9e-05,8e-05,1.9e-05,-9.5e-05,2.9e-05,0.000101,4.8e-05,-2.4e-05,6.4e-05,1.4e-05,2.3e-05,-4e-05,-1e-05,-6.9e-05,-0.000144,7.4e-05,-8.7e-05,-4.4e-05,3e-06,0.000118,0.000105,-0.000119,0.000367,-4.2e-05,-3.8e-05,-2.1e-05,-0.000138,-0.000169,3.9e-05,0.000121,-0.000284,9e-06,0.000406,0.000102,4.7e-05,1.1e-05,-0.000165,-0.000121,0.000104,8.9e-05,1e-04,2.8e-05,-0.000155,1.7e-05,5.1e-05,-2.5e-05,0.000208,0.000103,0.000108,2e-06,-0.000103,-3.4e-05,1.8e-05,-9.6e-05,1.6e-05,-9e-05,1.5e-05,-2.8e-05,-5.3e-05,-9.3e-05,-1.4e-05,-8.1e-05,-3.5e-05,-3.8e-05,-2.7e-05,-0.000112,1.2e-05,-3.1e-05,-3.9e-05,-4e-06,-3.8e-05,-5e-06,-2e-05,0,6.3e-05,-5e-06,1.5e-05,-8.4e-05,5.6e-05,4.2e-05,-1.9e-05,-4.7e-05,-9.5e-05,-6.2e-05,5e-05,0.000173,-2.7e-05,-0.000152,5.4e-05,-0.000134,-0.000213,-8e-06,1.1e-05,-9.4e-05,-0.000108,-7.3e-05,-0.000123,2.1e-05,2.6e-05,-2.4e-05,-6.1e-05,-2.8e-05,2.4e-05,4.7e-05,-1.5e-05,-0.000175,-6e-05,-0.000128,-0.000101,-0.000127,-0.000105,-3e-06,2.8e-05,-1.7e-05,4.4e-05,-4e-06,-0.000141,-3.1e-05,3.6e-05
-1.4e-05,1.6e-05,9.7e-05,-2e-05,-2.5e-05,-4.1e-05,7e-06,1.9e-05,-2.6e-05,4.1e-05,-1.9e-05,1e-06,-9e-06,1.3e-05,-3.2e-05,-1.3e-05,-0.00016,0.000102,3.2e-05,2e-05,8e-05,0.000119,-4.7e-05,-0.000281,0.000238,0.000123,0.000374,6.7e-05,2e-05,-0.000162,-8e-06,0.000187,-7.1e-05,-3.2e-05,-0.000296,0.000149,-9.2e-05,-4.4e-05,-8.7e-05,-0.000131,5.2e-05,8e-06,-9e-06,5.6e-05,-4.9e-05,8.3e-05,-0.000145,-8e-06,8.4e-05,0.000133,4.3e-05,-0.000181,-4.5e-05,-6e-06,-7.1e-05,-3e-06,-3.8e-05,2.3e-05,-3.8e-05,-5.4e-05,-4.9e-05,7.5e-05,-3.3e-05,-8e-06,-4.1e-05,-1.1e-05,-4e-06,5.5e-05,9e-06,1.2e-05,-6e-06,-5.4e-05,-1e-06,1e-05,-7e-06,-4e-06,1e-06,-4e-06,8.5e-05,4.3e-05,-1.3e-05,1e-06,-4.9e-05,7.1e-05,-1.1e-05,-6.5e-05,-8.1e-05,5.5e-05,-0.00013,-0.000112,2.2e-05,-0.000129,4.1e-05,5.2e-05,5.7e-05,-7.1e-05,-1e-06,-2.9e-05,-7.4e-05,1.1e-05,-1.9e-05,-3.9e-05,-9e-06,-7.4e-05,-2.3e-05,4.2e-05,3.9e-05,-0.000114,-9.5e-05,9e-06,-0.000128,8.1e-05,5.1e-05,-0.000145,0.000118,-6e-05,3.6e-05,-0.000109,0.000113,3.5e-05,3.8e-05
6.5e-05,7.7e-05,-9.6e-05,-2.6e-05,1e-05,-3.6e-05,-9e-06,-2.5e-05,-4.6e-05,5e-06,1e-06,-2.1e-05,-1.7e-05,-2.3e-05,-2.2e-05,-3.7e-05,-8.1e-05,5e-06,2.5e-05,-2e-05,-3.8e-05,3.4e-05,-2.2e-05,5.1e-05,-3.2e-05,1.7e-05,0.000191,9.6e-05,-0.000151,-0.000121,-2.9e-05,-0.000166,0.000169,-1.4e-05,-0.000189,-5.3e-05,-0.000208,-5.7e-05,8e-06,-9e-05,-4e-05,2.5e-05,-6.3e-05,-0.00017,-0.000145,-0.000107,1.1e-05,-4.9e-05,2.5e-05,5.9e-05,0.000105,0.000277,1.7e-05,5e-06,-3.9e-05,6.4e-05,1.1e-05,1.6e-05,-5.5e-05,-5.9e-05,9.2e-05,-2.9e-05,-2.2e-05,-3.9e-05,-1e-05,1e-06,1.2e-05,9e-06,-9e-06,-2e-05,1.6e-05,-2e-05,-2.8e-05,2.4e-05,-1e-05,2.1e-05,-2.7e-05,-5e-06,-1.6e-05,2e-06,3.3e-05,-4e-06,-5e-06,2.7e-05,-5.7e-05,0.000103,-1.5e-05,-3.5e-05,-0.000102,-0.000116,-2e-05,-9.1e-05,7.2e-05,2.3e-05,7e-06,-3.9e-05,-1e-05,-6e-05,-2.1e-05,-9.4e-05,-1e-05,-1e-05,1.6e-05,2.9e-05,-2.5e-05,0.000102,2.4e-05,-4e-05,-1.6e-05,-2e-05,-0.000134,-8e-05,-9.8e-05,-5.1e-05,-3.5e-05,-5e-06,-1.9e-05,-3e-06,4.8e-05,-6e-06,-2.8e-05
2e-06,-3.7e-05,5.5e-05,-1.3e-05,-1.8e-05,2.7e-05,-3e-05,-1.6e-05,1.7e-05,-1.4e-05,-2e-06,1.8e-05,4e-06,-7e-06,1.5e-05,8e-06,-6.8e-05,2.6e-05,-1e-05,8.6e-05,-7e-05,-2.8e-05,2.9e-05,2.4e-05,-3.2e-05,-3.1e-05,-0.000115,0.00011,7.2e-05,6.3e-05,1.4e-05,-7.3e-05,0.000214,2.8e-05,4.6e-05,-0.000186,-3.9e-05,-2.1e-05,5.3e-05,-2.4e-05,4.8e-05,-6e-06,2.2e-05,3e-05,-6.3e-05,3.6e-05,0.000108,1.1e-05,5.6e-05,-0.000232,-5.8e-05,-5.7e-05,4.3e-05,-6.2e-05,-6.1e-05,-4e-06,-3.2e-05,-6e-05,-4.5e-05,-2.5e-05,7.1e-05,2.3e-05,1.5e-05,-9e-06,-3.5e-05,5e-06,-1.3e-05,-7e-06,-2e-05,-3e-05,1.9e-05,-3.3e-05,-1.1e-05,-1.1e-05,-1e-05,-4e-06,1.1e-05,-3.8e-05,-5e-06,2.1e-05,8e-06,7e-06,1.5e-05,8e-06,-5e-06,-1.5e-05,-8e-06,-6.3e-05,-6e-05,1.1e-05,1.4e-05,-1e-05,7.6e-05,-1.7e-05,6e-06,-3.7e-05,1e-06,2.3e-05,2.8e-05,1.9e-05,1.4e-05,-1.3e-05,1.2e-05,-4.4e-05,-6.2e-05,-4.4e-05,-2.8e-05,-2.3e-05,0,2.2e-05,1.3e-05,9e-06,-1.9e-05,-8.6e-05,-4.2e-05,8e-06,4e-05,1.5e-05,3.4e-05,-4.3e-05,-5.8e-05
-3.7e-05,-8e-06,1.4e-05,-5e-06,1.7e-05,1.1e-05,-5e-06,1e-05,1.1e-05,-2e-06,-1.7e-05,1e-06,4e-06,2e-06,-2.4e-05,2.2e-05,-3.4e-05,-4e-06,-1.2e-05,-1.5e-05,4.9e-05,-4.5e-05,1.5e-05,4.2e-05,-1e-04,-4.5e-05,-9.7e-05,-0.000109,-2e-05,-3.5e-05,-1.9e-05,-4.3e-05,0.000153,-1.9e-05,1.3e-05,-0.000327,7.2e-05,2e-05,4.3e-05,-1e-06,0,2.7e-05,-3.5e-05,-5e-05,-1.2e-05,-4.6e-05,-4.1e-05,-7.8e-05,4.2e-05,-0.000134,-3.1e-05,-1.3e-05,1.9e-05,-3e-06,-1.1e-05,0,-2.2e-05,-2.7e-05,3.8e-05,1.6e-05,1.2e-05,-1.2e-05,3.5e-05,3.5e-05,5e-06,-6e-06,7e-06,-1e-06,1.1e-05,-2.1e-05,-5e-06,-9e-06,-9e-06,2e-06,2e-05,1e-05,-2.3e-05,2.9e-05,-2e-06,-3.2e-05,-1e-06,-3e-06,6e-06,0,-1.8e-05,-2.5e-05,1.6e-05,-3.7e-05,-5.1e-05,8e-06,3.1e-05,3.6e-05,-1.5e-05,-2.3e-05,-1.2e-05,-4.6e-05,-7e-06,5.1e-05,-1.8e-05,-8e-06,-1e-06,3.5e-05,-4.5e-05,-4.2e-05,-1.6e-05,-9.8e-05,-1.1e-05,2.3e-05,-1.2e-05,0,-2.7e-05,1.1e-05,-4.5e-05,1.6e-05,-3e-05,-2.6e-05,-1.1e-05,1.6e-05,-4.8e-05,1.2e-05,9e-05
-1.2e-05,-2.7e-05,-6.1e-05,-3e-06,-3e-06,1.1e-05,-1.6e-05,4e-06,-4e-06,-1.9e-05,-1.7e-05,7e-06,-5e-06,-4e-06,-8e-06,-3.4e-05,-2.3e-05,-2.7e-05,-2.9e-05,-9e-06,9e-06,8e-06,-2.3e-05,-0.000153,-6.8e-05,-1.7e-05,-3.8e-05,-7.3e-05,0,5e-05,2e-06,-4.4e-05,-3.1e-05,-1.2e-05,0.000199,-0.000127,4.8e-05,-1.3e-05,4.7e-05,-7e-06,1.1e-05,-9e-06,-8e-06,-5.5e-05,-1.3e-05,1.9e-05,2e-05,1.9e-05,-1.9e-05,-8.1e-05,1.2e-05,-3.8e-05,-2.3e-05,-3.6e-05,3e-06,-2.8e-05,-1.5e-05,-2.5e-05,1.8e-05,2.1e-05,1.5e-05,3e-06,-9e-06,2.2e-05,3.8e-05,1.2e-05,1.4e-05,-1.6e-05,9e-06,-4e-06,1e-06,-7e-06,-1.4e-05,2e-06,-5e-06,-1.2e-05,2e-06,-3e-06,5e-06,2.8e-05,-3.3e-05,4e-06,-9e-06,-3.1e-05,-1.1e-05,-4e-06,3e-05,-2.3e-05,-4.9e-05,-1.7e-05,3.9e-05,8e-06,1.8e-05,-1.5e-05,-1.8e-05,2e-06,-2.1e-05,9e-06,-1.7e-05,3.1e-05,5e-06,8e-06,2e-06,0,1.8e-05,-7.1e-05,4e-06,5e-06,-5e-06,2.5e-05,-4.5e-05,-1.1e-05,-6.3e-05,2.2e-05,-4e-06,7e-06,1e-06,4.6e-05,-7.9e-05,-3e-05,3.7e-05
2.1e-05,3e-05,4.5e-05,-7e-06,-2e-06,1.1e-05,4e-06,-3e-06,2e-06,7e-06,-8e-06,-7e-06,8e-06,-1e-05,-4e-06,-4e-06,-5e-06,-5.6e-05,2.5e-05,6e-06,2.2e-05,8e-06,-2.6e-05,-9.1e-05,3.5e-05,3e-06,-2.8e-05,-4.5e-05,1.1e-05,-3e-05,-1e-06,8.1e-05,3e-05,2.3e-05,0.000324,3.9e-05,-6e-06,-3.5e-05,2.6e-05,-1.9e-05,1.4e-05,9e-06,4e-06,2.7e-05,3.9e-05,3e-06,-5.3e-05,1.3e-05,-4.1e-05,1.1e-05,-2.7e-05,-2e-06,1.2e-05,0,-1e-06,-4e-06,1.2e-05,-1.3e-05,1e-05,5e-06,1.4e-05,4e-06,-2.2e-05,3e-06,6e-06,-5e-06,-5e-06,0,-2e-05,-1.1e-05,-7e-06,-8e-06,1e-05,-7e-06,-1.5e-05,1.3e-05,-4e-06,-1.1e-05,8e-06,-1.1e-05,1.4e-05,-1e-06,-2e-06,0,-1.6e-05,-1e-05,-2.4e-05,-3e-05,-1.8e-05,-1.3e-05,1.8e-05,8e-06,4.6e-05,-4e-06,-1e-06,2.8e-05,6e-06,0,-2.9e-05,0,0,1.5e-05,-1.3e-05,-1.7e-05,2.9e-05,-2.6e-05,-3.2e-05,-2.9e-05,1.7e-05,1.6e-05,-1.2e-05,8e-06,3e-06,1.7e-05,-5.8e-05,4e-06,3e-06,-2.5e-05,-5.1e-05,-2e-06,-1.1e-05
2e-06,-2.9e-05,-1.5e-05,1.8e-05,5e-06,0,1.3e-05,7e-06,1e-06,0,-6e-06,4e-06,-9e-06,-1e-06,5e-06,-2e-05,8e-06,-3e-06,-1.8e-05,-1.5e-05,0,-1e-06,2e-06,-3.8e-05,1.7e-05,1.8e-05,5e-06,-5e-05,-2.4e-05,2e-06,-1.1e-05,-2.5e-05,4.2e-05,-1.4e-05,3.3e-05,1e-06,1.8e-05,-2e-05,6e-06,-2.5e-05,-1.3e-05,-5e-06,7e-06,4.1e-05,-3.3e-05,-1.8e-05,-6.4e-05,-1.4e-05,6e-06,-2.1e-05,5e-05,2e-05,-3.1e-05,-1.6e-05,-5e-06,-5e-06,-4e-06,-1e-06,-4e-06,-2.9e-05,9e-06,7e-06,1.2e-05,-9e-06,1.1e-05,-8e-06,0,-1.3e-05,1.2e-05,-6e-06,-7e-06,1.1e-05,-9e-06,2e-06,2e-06,0,1.2e-05,1.2e-05,-1.6e-05,8e-06,-2e-05,0,5e-06,-2.8e-05,-2e-06,6e-06,-1.4e-05,-3.4e-05,-1.2e-05,-5.4e-05,1.7e-05,2.6e-05,5.3e-05,0,-7e-06,3.7e-05,-1e-05,-9e-06,-2e-06,-2e-06,-1.6e-05,6e-06,2e-06,-2.6e-05,2e-05,3e-06,-2.8e-05,-3e-05,-2.5e-05,-7e-06,4e-06,-1.1e-05,-7e-06,1.5e-05,-3.3e-05,-1.1e-05,4e-06,-6e-06,-2.3e-05,-4e-06,-3.5e-05
-1.5e-05,0,3e-06,-1.8e-05,-7e-06,6e-06,9e-06,-2e-06,-7e-06,3e-06,-4e-06,1e-06,2e-06,-1e-06,2e-06,3e-06,1.9e-05,7e-06,-3e-06,2e-05,-2.4e-05,4e-06,7e-06,5e-06,2.1e-05,-7e-06,2.7e-05,-1e-05,1e-06,-2.3e-05,1.1e-05,-0.000122,-8e-06,-1e-05,-0.000245,-8.2e-05,-3.1e-05,-1e-06,-1.2e-05,-2.2e-05,1e-05,-5e-06,-6e-06,-5e-06,9e-06,1.3e-05,-5.9e-05,1.9e-05,-6.5e-05,3.3e-05,-3.9e-05,-1.2e-05,-7e-06,3e-06,1.1e-05,1e-05,-2.3e-05,1e-06,-1.1e-05,-1e-06,0,-7e-06,-1.2e-05,1.5e-05,-5e-06,3e-06,-3e-06,-7e-06,-1e-05,6e-06,-1e-06,8e-06,-2e-06,-3e-06,-1.5e-05,-2e-06,8e-06,3e-06,-3e-06,-1.2e-05,8e-06,-3e-06,-9e-06,-5e-06,1e-06,7e-06,-1.3e-05,-5.2e-05,-6e-06,-1.9e-05,2.2e-05,2.5e-05,1.6e-05,-3e-06,9e-06,2.6e-05,-5e-06,2.2e-05,1.7e-05,-1.2e-05,8e-06,1e-06,-6e-06,-1.4e-05,-8e-06,-3e-06,-2.3e-05,-4.1e-05,4e-06,8e-06,-1e-05,5e-06,-1e-05,1.2e-05,-1.9e-05,-1.1e-05,3e-06,-1.6e-05,-1e-06,2e-06,-1e-06
-3e-06,1.5e-05,-1.4e-05,0,4e-06,5e-06,0,3e-06,-8e-06,2e-06,-6e-06,2e-06,-2e-06,4e-06,-4e-06,-1.3e-05,2.5e-05,-6e-06,0,-4e-06,1.1e-05,-4e-06,0,1.6e-05,3e-05,-1.5e-05,-6e-06,-2e-06,-2.8e-05,-3.1e-05,-1.2e-05,-5.7e-05,1.6e-05,1.1e-05,-0.000235,-8.3e-05,-4.8e-05,5e-06,-2.9e-05,-1e-05,-1e-05,-3e-06,-2e-06,2.1e-05,-1.2e-05,1e-05,-5.1e-05,-1.8e-05,-3.4e-05,5e-06,-6e-06,2.9e-05,-1.6e-05,1e-06,-1.9e-05,2e-06,1.1e-05,-1.3e-05,-1.1e-05,3e-06,-5e-06,3e-06,7e-06,-2e-05,-3e-06,6e-06,-2e-06,1e-05,8e-06,-2e-06,3e-06,4e-06,0,-1e-06,1.4e-05,1e-06,-4e-06,-8e-06,4e-06,1e-05,1.1e-05,2e-06,-3e-06,1e-06,-1.2e-05,-3e-06,1.1e-05,-5.4e-05,-3e-06,-2.5e-05,9e-06,0,-1e-06,3e-06,1e-06,1.5e-05,-6e-06,-2e-06,-5e-06,-1.9e-05,-4e-06,-2e-06,-9e-06,-1.4e-05,-1.6e-05,-1e-05,1.7e-05,-3.4e-05,-1e-05,-1.3e-05,-1.5e-05,4e-06,-1.1e-05,7e-06,-1.8e-05,-1.5e-05,-1e-05,-1e-05,-3e-06,-8e-06,7e-06
9e-06,-2.2e-05,1e-05,-1.3e-05,-2e-06,0,-7e-06,-1e-06,-3e-06,-4e-06,-3e-06,-5e-06,3e-06,1.1e-05,-7e-06,1e-06,2.6e-05,3e-06,-1e-06,3e-06,-1.7e-05,-5e-06,-1e-05,-4e-05,-1.8e-05,0,-3.2e-05,3.8e-05,7e-06,-6e-06,0,1.5e-05,5e-06,-4e-06,-9.9e-05,-2.4e-05,-2.9e-05,-5e-06,-3e-05,-6e-06,1.1e-05,-7e-06,-6e-06,-2.7e-05,-1.1e-05,-2.8e-05,-4.1e-05,1.7e-05,-3.5e-05,-5.5e-05,4e-05,-1.3e-05,-1.4e-05,1.2e-05,-7e-06,5e-06,1.1e-05,-2.7e-05,-3e-06,0,-5e-06,-6e-06,-1e-06,-1.1e-05,-4e-06,-3e-06,3e-06,-5e-06,-2e-06,-1.1e-05,-1e-06,8e-06,-7e-06,4e-06,1e-06,3e-06,0,-5e-06,-1e-06,-9e-06,5e-06,1e-06,4e-06,-2.8e-05,-1e-06,-3e-06,7e-06,-3.4e-05,-7e-06,6e-06,1.5e-05,-1.3e-05,-2.6e-05,4e-06,4e-06,1e-06,-1.2e-05,-1.9e-05,-2.1e-05,1.5e-05,1e-06,-5e-06,-1e-06,-1e-05,-1.6e-05,-1.3e-05,1.4e-05,-1.8e-05,-3e-06,-1.5e-05,-1.6e-05,-1e-05,-2.6e-05,-1.7e-05,8e-06,-3e-06,7e-06,2.5e-05,3.5e-05,5e-06,-1.3e-05
2e-06,5e-06,-8e-06,0,-1e-06,-1e-05,-6e-06,4e-06,4e-06,-1e-06,2e-06,2e-06,-4e-06,-5e-06,0,-1e-06,2e-05,7e-06,8e-06,-8e-06,1.3e-05,-1e-06,-4e-06,-4.9e-05,-6e-06,-3e-06,2e-05,1e-05,-2.7e-05,-1.2e-05,2e-06,2.6e-05,7e-06,-1e-05,1.8e-05,-1e-06,2.6e-05,-1.8e-05,-2.3e-05,-1.2e-05,-1.4e-05,2e-06,-1.3e-05,3e-06,-6e-06,1.5e-05,5e-06,-1.8e-05,-2.5e-05,-5.3e-05,-3e-05,-6e-06,-3e-06,1e-06,-9e-06,-1e-05,-1.1e-05,-1.5e-05,4e-06,-8e-06,1e-06,3e-06,5e-06,-1.2e-05,-3e-06,-4e-06,1e-06,1e-06,-4e-06,-9e-06,5e-06,5e-06,4e-06,-2e-06,0,-3e-06,-8e-06,1.2e-05,-1.2e-05,1e-05,-1e-06,-1e-06,-2e-06,1e-06,-4e-06,-6e-06,5e-06,-2.9e-05,1e-06,-8e-06,1.2e-05,-1.4e-05,5e-06,1e-06,-2e-06,1e-06,0,-1.9e-05,-1.3e-05,-1e-06,3e-06,-3e-06,7e-06,-1.7e-05,-3e-06,-1e-06,9e-06,-1.8e-05,-1.1e-05,-4e-06,-1.2e-05,7e-06,-4e-06,2e-06,1e-05,-7e-06,-1e-06,2e-06,-5e-06,-1.2e-05,-6e-06
-8e-06,5e-06,3e-06,-2e-06,2e-06,-7e-06,-6e-06,-5e-06,4e-06,-1e-06,-2e-06,-1e-06,1e-06,4e-06,-5e-06,-8e-06,1.2e-05,1e-06,4e-06,1e-06,9e-06,-2e-06,5e-06,-6.5e-05,-6e-06,7e-06,3.6e-05,1.2e-05,1.8e-05,0,-6e-06,-2.4e-05,1.6e-05,9e-06,4e-05,1.8e-05,3.5e-05,7e-06,-6e-06,-1.4e-05,8e-06,-2e-06,6e-06,0,-2.3e-05,3e-06,-2.6e-05,1e-06,-3.7e-05,-4.1e-05,1.7e-05,-2.9e-05,-3e-06,8e-06,9e-06,-5e-06,0,1.7e-05,8e-06,-1e-05,2e-06,4e-06,-2e-06,-2e-06,0,7e-06,-2e-06,-5e-06,2e-06,-2e-06,1e-06,1e-06,-2e-06,1e-06,-2e-06,4e-06,-4e-06,-1.3e-05,2e-06,-7e-06,-7e-06,0,-1e-06,-6e-06,4e-06,-1e-06,-6e-06,-8e-06,4e-06,-1.1e-05,1.5e-05,-1e-06,1.3e-05,0,2e-06,-5e-06,-6e-06,2e-06,0,1e-05,-3e-06,-1e-05,-7e-06,-1.2e-05,1.1e-05,-1e-06,9e-06,-9e-06,7e-06,-5e-06,-1e-06,-8e-06,-2.8e-05,-1.5e-05,9e-06,-1.2e-05,-5e-06,4e-06,-1.3e-05,3e-06,-3e-06
-4e-06,-1.8e-05,4e-06,-6e-06,-1e-06,-6e-06,-1e-06,-1e-06,1e-06,0,-1e-06,0,-1e-06,-3e-06,-1e-06,-5e-06,-2e-06,-1.3e-05,2e-06,-4e-06,2e-06,-2e-06,0,1e-06,-8e-06,-2e-06,-1.6e-05,-7e-06,-1.5e-05,-7e-06,4e-06,-6.9e-05,1e-05,-1e-06,1.1e-05,1.1e-05,8e-06,-2e-06,5e-06,-7e-06,-1.1e-05,0,4e-06,-8e-06,-1e-06,-1e-05,1.5e-05,5e-06,-1.5e-05,-1.7e-05,-5e-06,2.8e-05,1.1e-05,5e-06,1e-06,1e-06,1e-05,7e-06,0,-8e-06,-1e-06,-3e-06,1e-06,-7e-06,1e-06,-3e-06,2e-06,2e-06,3e-06,-4e-06,0,1e-06,2e-06,-1e-06,-5e-06,-4e-06,3e-06,3e-06,4e-06,4e-06,1e-06,0,0,-1.2e-05,-8e-06,9e-06,-8e-06,-3e-06,1e-06,-2e-05,1.1e-05,-1.4e-05,1.3e-05,-2e-06,-4e-06,-1.5e-05,0,9e-06,1.1e-05,-6e-06,1e-06,0,-1e-06,-6e-06,6e-06,-1.9e-05,-7e-06,-6e-06,-1e-05,-2e-06,-8e-06,6e-06,-8e-06,-5e-06,1.6e-05,0,3e-06,-3e-06,-1e-05,-7e-06,4e-06
3e-06,1.1e-05,-7e-06,4e-06,0,-2e-06,6e-06,3e-06,-2e-06,1e-06,3e-06,-2e-06,6e-06,-1e-06,1e-06,-1.3e-05,-1e-05,-1e-06,-1.1e-05,8e-06,-1e-06,-1e-06,-4e-06,-7e-06,4e-06,-4e-06,-4.1e-05,-3.1e-05,9e-06,-6e-06,-3e-06,-1.8e-05,1.2e-05,-7e-06,-2.9e-05,8e-06,-2.1e-05,-2e-06,1.4e-05,-8e-06,3e-06,-3e-06,-2e-06,9e-06,-1.2e-05,0,-1e-06,-1.4e-05,-2.4e-05,7e-06,-1.1e-05,1.1e-05,0,5e-06,6e-06,4e-06,-1e-06,-1.9e-05,0,0,7e-06,-2e-06,-8e-06,-4e-06,-1e-06,-3e-06,-2e-06,-2e-06,-2e-06,-2e-06,-2e-06,-4e-06,2e-06,2e-06,-2e-06,6e-06,0,4e-06,-4e-06,-5e-06,-5e-06,0,4e-06,7e-06,0,-6e-06,-3e-06,3e-06,-4e-06,-1.8e-05,7e-06,-1.7e-05,0,-3e-06,1e-06,-1.5e-05,-2e-06,-2e-06,-2e-06,2e-06,0,-2e-06,1e-06,-1.5e-05,1.1e-05,-1.5e-05,-1.7e-05,-9e-06,2e-06,8e-06,-1.1e-05,-1e-06,-1e-05,-1.5e-05,2.3e-05,-2e-06,-1e-06,-1.5e-05,-2.9e-05,1e-06,8e-06
3e-06,-5e-06,4e-06,-7e-06,1e-06,0,3e-06,1e-06,-7e-06,-2e-06,4e-06,1e-06,-7e-06,1e-06,-1e-06,-1e-06,-1.5e-05,0,1e-06,1e-06,-9e-06,1e-06,-1e-06,7e-06,3e-06,-4e-06,-1.2e-05,-8e-06,-5e-06,-7e-06,-1e-06,-1e-06,9e-06,5e-06,-6.7e-05,-6e-06,-2.2e-05,-1e-05,1.7e-05,-8e-06,-3e-06,-1e-06,-4e-06,6e-06,-6e-06,4e-06,-1.6e-05,1.3e-05,1e-06,2.3e-05,1.2e-05,6e-06,1e-06,-1e-06,-3e-06,3e-06,2e-06,-1.5e-05,-7e-06,0,0,2e-06,1e-06,1.1e-05,-4e-06,3e-06,1e-06,-4e-06,-3e-06,1e-06,-1e-06,-4e-06,-3e-06,1e-06,0,-4e-06,5e-06,-3e-06,-4e-06,7e-06,4e-06,0,-4e-06,-6e-06,0,3e-06,2e-06,6e-06,-2e-06,-1e-05,8e-06,-7e-06,-8e-06,0,-4e-06,-1.2e-05,-4e-06,-4e-06,-1.1e-05,-9e-06,-3e-06,4e-06,0,-1e-05,-5e-06,-9e-06,-1.4e-05,-5e-06,-1e-06,1e-05,-4e-06,-1e-06,-2e-06,9e-06,1.7e-05,-6e-06,1e-06,2e-06,-5e-06,-5e-06,8e-06
-4e-06,-3e-06,-6e-06,-1e-06,-2e-06,0,4e-06,-2e-06,-1e-06,2e-06,2e-06,0,0,1e-06,0,-2e-06,-1.8e-05,-3e-06,4e-06,-4e-06,2e-06,-1e-06,3e-06,-3.6e-05,3e-06,3e-06,1.4e-05,-1.7e-05,0,-5e-06,2e-06,-3e-06,5e-06,1e-06,-0.000119,7e-06,4e-06,0,1.4e-05,-3e-06,-1e-06,0,3e-06,-4e-06,0,-1e-06,-5e-06,-9e-06,1e-06,1.8e-05,-8e-06,-2.5e-05,1e-06,4e-06,5e-06,-2e-06,-7e-06,-3e-06,-4e-06,-8e-06,0,-3e-06,9e-06,1e-06,-4e-06,2e-06,0,1e-06,6e-06,-3e-06,0,-6e-06,2e-06,-3e-06,8e-06,1e-06,3e-06,-2e-06,-1e-06,-8e-06,-4e-06,0,-4e-06,2e-06,-3e-06,-4e-06,7e-06,9e-06,2e-06,-5e-06,6e-06,-1e-06,-1e-06,0,5e-06,-7e-06,1e-06,3e-06,-6e-06,-4e-06,2e-06,0,-1e-06,-9e-06,-6e-06,-5e-06,1e-06,-9e-06,1e-06,4e-06,1e-06,1e-06,-7e-06,-7e-06,1.2e-05,-3e-06,-3e-06,6e-06,-6e-06,6e-06,-3e-06
-3e-06,0,2e-06,-6e-06,1e-06,3e-06,-3e-06,-1e-06,2e-06,-1e-06,0,0,4e-06,0,-5e-06,0,-1.8e-05,2e-06,-2e-06,-1e-06,-4e-06,1e-06,1e-06,-3.6e-05,4e-06,0,6e-06,-2e-06,-4e-06,-3e-06,-2e-06,6e-06,3e-06,-5e-06,-7.6e-05,1.9e-05,1e-06,0,7e-06,-3e-06,0,0,-2e-06,8e-06,-9e-06,3e-06,-3.1e-05,9e-06,9e-06,9e-06,1.1e-05,1e-06,-8e-06,-2e-06,-8e-06,-3e-06,-1e-06,4e-06,1e-06,-7e-06,0,4e-06,-5e-06,2e-06,3e-06,-3e-06,0,0,-5e-06,-2e-06,-1e-06,-3e-06,-3e-06,2e-06,-4e-06,0,-3e-06,4e-06,2e-06,5e-06,7e-06,-1e-06,3e-06,4e-06,1e-06,-1e-06,-1e-06,1.4e-05,-3e-06,-7e-06,6e-06,7e-06,1.5e-05,1e-06,-3e-06,1e-06,-4e-06,1e-05,0,4e-06,0,7e-06,-2e-06,-9e-06,-7e-06,9e-06,2e-06,-1e-05,-4e-06,6e-06,-5e-06,-4e-06,-7e-06,6e-06,6e-06,-3e-06,3e-06,0,-3e-06,-6e-06,-9e-06
3e-06,-1e-06,6e-06,1e-06,0,1e-06,-2e-06,2e-06,1e-06,0,0,0,0,-1e-06,1e-06,-6e-06,-1.5e-05,2e-06,-1e-06,-2e-06,4e-06,0,-2e-06,-3e-05,-1e-06,2e-06,5e-06,8e-06,2e-06,-5e-06,1e-06,-4.8e-05,1e-06,1e-06,4.8e-05,4e-06,1e-06,3e-06,0,-5e-06,-2e-06,-1e-06,-2e-06,-1.3e-05,5e-06,-5e-06,-2.2e-05,-5e-06,1.1e-05,-1.9e-05,-1.1e-05,-1e-06,1e-06,1e-06,0,-2e-06,9e-06,-1e-06,2e-06,1e-06,-2e-06,0,2e-06,0,3e-06,0,-1e-06,0,2e-06,-1e-06,0,-5e-06,0,0,1e-06,0,-1e-06,0,-1e-06,-2e-06,-1e-06,1e-06,1e-06,1e-06,-4e-06,3e-06,-1e-06,1.5e-05,-3e-06,-6e-06,5e-06,-6e-06,1e-05,1e-06,4e-06,9e-06,1e-06,5e-06,5e-06,3e-06,-1e-06,-2e-06,-1e-06,-8e-06,-1e-06,-1e-06,3e-06,-8e-06,3e-06,1e-06,-7e-06,5e-06,-9e-06,0,-1e-06,-2e-06,-2e-06,1e-05,1e-05,2e-06,3e-06
3e-06,2e-06,-8e-06,-4e-06,-1e-06,1e-06,-4e-06,-2e-06,1e-06,0,1e-06,1e-06,-1e-06,0,2e-06,-2e-06,-1e-05,1e-06,2e-06,4e-06,4e-06,-1e-06,-1e-06,-2e-06,-4e-06,-2e-06,2e-06,9e-06,-6e-06,-3e-06,-1e-06,-4.1e-05,3e-06,3e-06,7.3e-05,-5e-06,8e-06,-3e-06,-8e-06,-4e-06,-2e-06,0,0,-1e-06,-6e-06,3e-06,-2e-05,1e-06,1.6e-05,-2.8e-05,5e-06,1.1e-05,-5e-06,-5e-06,-3e-06,1e-06,-6e-06,-4e-06,3e-06,1e-06,0,-2e-06,-4e-06,3e-06,5e-06,3e-06,1e-06,-2e-06,0,-4e-06,0,-2e-06,1e-06,-1e-06,-3e-06,2e-06,-3e-06,-5e-06,-3e-06,4e-06,1e-06,0,-1e-06,7e-06,2e-06,-1e-06,-5e-06,1.9e-05,-2e-06,-1.3e-05,4e-06,0,2e-06,0,-4e-06,6e-06,-2e-06,-7e-06,2e-06,5e-06,2e-06,4e-06,2e-06,-1.1e-05,5e-06,-8e-06,9e-06,-1.1e-05,-3e-06,-7e-06,0,-3e-06,-1.2e-05,1.1e-05,1e-06,-4e-06,1e-06,-8e-06,4e-06,-3e-06,6e-06
-3e-06,-8e-06,5e-06,0,1e-06,1e-06,-1e-06,0,0,-2e-06,0,0,-2e-06,-2e-06,0,-6e-06,-3e-06,0,0,2e-06,-3e-06,0,1e-06,5e-06,-1e-06,-1e-06,-1.1e-05,7e-06,2e-06,-2e-06,-1e-06,1.6e-05,1e-06,-4e-06,1.4e-05,-7e-06,6e-06,-4e-06,-1.2e-05,-3e-06,1e-06,0,1e-06,4e-06,1e-06,1e-06,-1.9e-05,2e-06,2.1e-05,-2.6e-05,9e-06,1e-06,0,-1e-06,3e-06,1e-06,-4e-06,-5e-06,0,-2e-06,0,1e-06,0,-5e-06,3e-06,-2e-06,-1e-06,0,-1e-06,-3e-06,0,0,-1e-06,0,-3e-06,-3e-06,0,7e-06,1e-06,-5e-06,-3e-06,1e-06,0,4e-06,-2e-06,0,-1e-06,1.6e-05,-1e-06,-8e-06,3e-06,4e-06,-8e-06,0,3e-06,6e-06,-2e-06,-3e-06,-7e-06,-5e-06,-3e-06,0,-2e-06,-8e-06,4e-06,-5e-06,1.1e-05,-8e-06,0,-4e-06,1e-06,1e-06,-7e-06,-3e-06,-6e-06,-4e-06,1e-06,-1e-06,-4e-06,1e-06,-4e-06
-3e-06,7e-06,-3e-06,-1e-06,0,1e-06,1e-06,0,-2e-06,1e-06,-1e-06,0,2e-06,2e-06,1e-06,-4e-06,3e-06,2e-06,-5e-06,1e-06,0,0,0,-1.2e-05,-1e-06,0,-1e-05,-4e-06,-4e-06,-6e-06,1e-06,3e-06,1e-06,0,-1.1e-05,2e-06,-5e-06,-2e-06,-1.1e-05,-4e-06,-4e-06,1e-06,0,-4e-06,-2e-06,-5e-06,-8e-06,-6e-06,1.5e-05,-7e-06,-2e-05,2e-06,-4e-06,-4e-06,-1e-06,1e-06,7e-06,-1.2e-05,-2e-06,-8e-06,-2e-06,0,4e-06,-6e-06,1e-06,-1e-06,0,0,0,1e-06,1e-06,1e-06,2e-06,-1e-06,2e-06,1e-06,1e-06,-5e-06,3e-06,5e-06,1e-06,0,1e-06,4e-06,1e-06,0,1e-06,1.3e-05,0,-1e-05,2e-06,2e-06,-4e-06,0,-4e-06,7e-06,0,-1e-06,-2e-06,-1e-06,1e-06,0,-1e-06,-7e-06,4e-06,-6e-06,-3e-06,-6e-06,0,-5e-06,-6e-06,-2e-06,-4e-06,1e-06,-1.2e-05,-2e-06,-2e-06,-1e-06,-4e-06,-3e-06,-8e-06
2e-06,-4e-06,0,-3e-06,0,-1e-06,3e-06,0,-1e-06,-1e-06,-1e-06,0,-1e-06,0,-1e-06,-5e-06,9e-06,-2e-06,-2e-06,-1e-06,-1e-06,1e-06,0,-2.5e-05,4e-06,1e-06,4e-06,0,2e-06,-1e-06,-1e-06,-1.8e-05,1e-06,3e-06,-6e-06,4e-06,-1e-05,5e-06,-7e-06,-3e-06,3e-06,0,-1e-06,3e-06,-5e-06,2e-06,-4e-06,5e-06,1.8e-05,4e-06,1.8e-05,-5e-06,2e-06,-3e-06,2e-06,-1e-06,-1e-06,-4e-06,-2e-06,-5e-06,0,0,-1e-06,0,-2e-06,1e-06,0,-2e-06,0,-1e-06,0,3e-06,-2e-06,1e-06,1e-06,0,0,1e-06,-1e-06,-4e-06,-1e-06,-1e-06,-1e-06,5e-06,-1e-06,-2e-06,2e-06,1.1e-05,-2e-06,-5e-06,2e-06,-2e-06,2e-06,0,3e-06,5e-06,-3e-06,3e-06,0,-8e-06,0,-2e-06,0,-1e-05,-1e-06,-2e-06,-1.2e-05,-6e-06,1e-06,-6e-06,-5e-06,1e-06,-9e-06,1e-06,-1.3e-05,-3e-06,2e-06,-3e-06,-9e-06,1e-06,2e-06
3e-06,-3e-06,1e-06,-1e-06,0,-2e-06,2e-06,-1e-06,-1e-06,1e-06,0,0,-2e-06,1e-06,0,-2e-06,1.2e-05,-2e-06,1e-06,-2e-06,-1e-06,0,0,-3.2e-05,0,-1e-06,7e-06,-1e-05,-2e-06,-4e-06,1e-06,-2.3e-05,1e-06,-3e-06,-1.5e-05,-3e-06,-7e-06,-3e-06,-1e-06,-2e-06,-4e-06,-1e-06,1e-06,4e-06,0,4e-06,-9e-06,-4e-06,1e-05,1.7e-05,-6e-06,-8e-06,1e-06,-1e-06,-3e-06,-2e-06,-5e-06,8e-06,-1e-06,-1e-06,0,1e-06,-1e-06,-2e-06,-3e-06,0,0,0,1e-06,-2e-06,-1e-06,3e-06,0,-1e-06,2e-06,0,2e-06,1e-06,-1e-06,3e-06,-1e-06,1e-06,-1e-06,1e-06,-1e-06,1e-06,2e-06,4e-06,-1e-06,-6e-06,1e-06,-9e-06,6e-06,0,-4e-06,-1e-06,1e-06,-2e-06,1e-06,4e-06,-1e-06,-1e-06,0,-7e-06,-4e-06,0,-6e-06,-4e-06,-2e-06,1e-06,1e-06,2e-06,-2e-06,-2e-06,-1.3e-05,-4e-06,-2e-06,7e-06,-1.1e-05,-3e-06,4e-06
-2e-06,5e-06,-1e-06,-4e-06,-1e-06,-2e-06,1e-06,1e-06,0,1e-06,0,0,1e-06,-1e-06,0,-2e-06,1.3e-05,1e-06,-1e-06,-1e-06,1e-06,0,0,-1e-05,-1e-06,1e-06,-7e-06,-6e-06,2e-06,-2e-06,0,-3e-05,1e-06,-1e-06,-8e-06,-6e-06,7e-06,-3e-06,5e-06,-3e-06,3e-06,0,-1e-06,-4e-06,-6e-06,-4e-06,-1e-06,2e-06,1.2e-05,1.4e-05,-8e-06,-1e-06,0,-3e-06,0,0,2e-06,3e-06,1e-06,2e-06,0,-1e-06,2e-06,-2e-06,-2e-06,-1e-06,0,-1e-06,-1e-06,1e-06,0,4e-06,0,0,-2e-06,0,0,1e-06,2e-06,-3e-06,0,0,1e-06,2e-06,1e-06,0,-2e-06,4e-06,-1e-06,-6e-06,0,0,2e-06,0,3e-06,-4e-06,-1e-06,-4e-06,2e-06,2e-06,1e-06,-2e-06,0,-7e-06,-2e-06,-3e-06,-2e-06,-5e-06,1e-06,4e-06,-1e-06,-2e-06,-6e-06,-4e-06,-1.1e-05,-1e-06,1e-06,0,-1e-06,2e-06,1e-06
-3e-06,-6e-06,-2e-06,0,1e-06,-2e-06,-1e-06,0,2e-06,-1e-06,-1e-06,-1e-06,3e-06,0,-1e-06,-1e-06,1.2e-05,-1e-06,1e-06,1e-06,1e-06,0,-1e-06,-2e-06,1e-06,-1e-06,-9e-06,-1e-06,-2e-06,-2e-06,-1e-06,0,0,3e-06,1.8e-05,-6e-06,9e-06,1e-06,8e-06,-3e-06,-3e-06,0,-2e-06,3e-06,1e-06,2e-06,-1.2e-05,-1e-06,4e-06,-5e-06,1.4e-05,1.1e-05,3e-06,3e-06,-1e-06,0,1e-06,-1.1e-05,2e-06,-3e-06,1e-06,0,-1e-06,-1e-06,0,1e-06,0,1e-06,1e-06,-1e-06,0,2e-06,-1e-06,1e-06,-1e-06,-2e-06,-1e-06,-3e-06,1e-06,3e-06,0,0,0,1e-06,-2e-06,0,-3e-06,0,0,-7e-06,0,-2e-06,-5e-06,0,-4e-06,-6e-06,-1e-06,-1e-06,-2e-06,4e-06,-1e-06,-1e-06,-1e-06,-8e-06,-2e-06,-4e-06,-1e-06,-5e-06,0,3e-06,-5e-06,1e-06,-2e-06,-4e-06,-7e-06,-2e-06,-1e-06,-2e-06,-3e-06,-3e-06,-2e-06
1e-06,2e-06,2e-06,-2e-06,0,-1e-06,-1e-06,-1e-06,0,0,0,0,-1e-06,0,1e-06,-3e-06,7e-06,-1e-06,1e-06,2e-06,2e-06,0,0,2e-06,0,0,1e-06,0,1e-06,-2e-06,1e-06,6e-06,1e-06,-2e-06,2.9e-05,1e-06,0,-1e-06,9e-06,-2e-06,2e-06,0,2e-06,-2e-06,-3e-06,2e-06,-1.2e-05,1e-06,1e-06,-2.1e-05,-1.4e-05,8e-06,-1e-06,-1e-06,0,1e-06,2e-06,-1.1e-05,0,-6e-06,0,1e-06,0,4e-06,0,1e-06,0,-1e-06,-1e-06,-3e-06,0,2e-06,1e-06,-1e-06,-2e-06,2e-06,0,3e-06,0,-4e-06,2e-06,0,-1e-06,-1e-06,0,1e-06,-2e-06,-2e-06,0,-8e-06,0,-4e-06,-6e-06,0,4e-06,-6e-06,0,4e-06,-3e-06,-1e-06,-1e-06,1e-06,0,-7e-06,2e-06,-2e-06,3e-06,-4e-06,-1e-06,6e-06,-1e-06,-1e-06,-9e-06,3e-06,-3e-06,-3e-06,0,3e-06,2e-06,1e-06,1e-06
2e-06,-1e-06,-1e-06,-1e-06,0,-1e-06,-1e-06,0,-1e-06,-1e-06,0,0,-1e-06,0,0,-5e-06,2e-06,2e-06,-2e-06,0,-4e-06,0,1e-06,-1.7e-05,-1e-06,0,2e-06,4e-06,0,-3e-06,0,-1.5e-05,0,-1e-06,3.2e-05,-1e-06,-8e-06,1e-06,6e-06,-2e-06,-2e-06,0,0,-3e-06,-2e-06,-2e-06,-1e-05,0,-6e-06,-2.6e-05,9e-06,-9e-06,-1e-06,4e-06,0,0,-2e-06,2e-06,0,-4e-06,-1e-06,-1e-06,0,-1e-06,-1e-06,-1e-06,0,0,1e-06,-1e-06,0,0,-1e-06,1e-06,2e-06,0,-2e-06,1e-06,0,3e-06,-1e-06,0,1e-06,-1e-06,-1e-06,-2e-06,2e-06,-6e-06,-1e-06,-6e-06,-1e-06,-5e-06,0,0,-3e-06,-4e-06,-2e-06,4e-06,2e-06,-3e-06,1e-06,-2e-06,1e-06,-8e-06,3e-06,0,1e-05,-6e-06,0,5e-06,1e-06,1e-06,-7e-06,-6e-06,0,-2e-06,0,-5e-06,6e-06,-2e-06,0
-1e-06,-1e-06,1e-06,-1e-06,0,0,-1e-06,1e-06,-1e-06,0,0,0,-2e-06,1e-06,0,-3e-06,-3e-06,2e-06,-2e-06,0,1e-06,0,0,-2.5e-05,0,1e-06,1e-06,3e-06,-3e-06,-2e-06,0,-1.5e-05,0,3e-06,1.1e-05,0,-1e-06,-1e-06,2e-06,-3e-06,1e-06,0,-2e-06,2e-06,0,1e-06,-1.5e-05,-1e-06,-7e-06,-1.9e-05,-1e-06,-5e-06,1e-06,0,1e-06,-1e-06,-4e-06,5e-06,-1e-06,-1e-06,1e-06,1e-06,0,-1e-06,0,0,0,0,0,0,0,0,1e-06,0,2e-06,-1e-06,0,-5e-06,0,-3e-06,1e-06,0,1e-06,-1e-06,0,1e-06,2e-06,-7e-06,0,-6e-06,-1e-06,-2e-06,5e-06,0,3e-06,0,0,-2e-06,-1e-06,-1e-06,-1e-06,2e-06,-1e-06,-6e-06,2e-06,-2e-06,6e-06,-5e-06,1e-06,0,-2e-06,0,-7e-06,2e-06,6e-06,-2e-06,0,2e-06,-2e-06,1e-06,0
-2e-06,0,0,-2e-06,0,1e-06,1e-06,0,-1e-06,0,0,-1e-06,2e-06,0,-1e-06,-5e-06,-8e-06,-2e-06,2e-06,0,0,0,-1e-06,-2.2e-05,-1e-06,-1e-06,0,0,4e-06,-2e-06,0,-2.9e-05,0,-2e-06,-1.7e-05,2e-06,2e-06,-2e-06,-3e-06,-1e-06,0,0,1e-06,0,-2e-06,0,-9e-06,1e-06,-1e-05,-7e-06,-6e-06,-4e-06,-2e-06,1e-06,0,0,4e-06,-2e-06,0,-1e-06,-1e-06,-1e-06,3e-06,1e-06,1e-06,0,0,0,-1e-06,-2e-06,0,-2e-06,0,-1e-06,0,1e-06,0,5e-06,1e-06,2e-06,-1e-06,0,-1e-06,-3e-06,0,0,1e-06,-9e-06,1e-06,-6e-06,-2e-06,3e-06,4e-06,0,-4e-06,2e-06,0,-4e-06,1e-06,-4e-06,0,-1e-06,0,-8e-06,1e-06,-1e-06,-4e-06,-5e-06,-1e-06,-1e-06,-3e-06,-2e-06,-3e-06,-1e-06,8e-06,-2e-06,0,0,-1e-06,-2e-06,2e-06
0,-2e-06,-1e-06,-1e-06,0,1e-06,0,0,0,-1e-06,0,0,-1e-06,0,0,0,-1.2e-05,-1e-06,2e-06,-1e-06,-2e-06,0,0,-6e-06,0,1e-06,-3e-06,-3e-06,-6e-06,-3e-06,0,-1.2e-05,0,-1e-06,-2e-06,0,0,-1e-06,-7e-06,-2e-06,0,0,1e-06,-1e-06,0,-1e-06,-9e-06,-1e-06,-1.4e-05,7e-06,8e-06,8e-06,1e-06,0,-1e-06,0,2e-06,-5e-06,0,-3e-06,0,-1e-06,-2e-06,-1e-06,1e-06,0,0,0,1e-06,-1e-06,0,-3e-06,-1e-06,1e-06,0,-2e-06,0,-2e-06,0,-3e-06,1e-06,0,0,-4e-06,0,-1e-06,-1e-06,-1.2e-05,0,-6e-06,-2e-06,-1e-06,-3e-06,0,3e-06,3e-06,-1e-06,0,0,5e-06,1e-06,3e-06,1e-06,-7e-06,-3e-06,-1e-06,-5e-06,-5e-06,-1e-06,-3e-06,-1e-06,2e-06,-5e-06,6e-06,1e-05,-2e-06,-1e-06,-3e-06,-4e-06,1e-06,-1e-06
