0.000185,0.000127,0.000179,0.000115,2.4e-05,4.1e-05,0.000103,4.9e-05,1.9e-05,0.000108,2.9e-05,3.1e-05,-6.9e-05,4e-05,6.7e-05,1.9e-05,-1.7e-05,9e-06,9.1e-05,9.1e-05,5.1e-05,7.4e-05,0.000156,6e-05,8.4e-05,0.000125,0.000105,3.4e-05,2.4e-05,-4e-06,-2e-06,1.5e-05,3.4e-05,3.2e-05,-1.9e-05,8e-06,-6.8e-05,2.9e-05,4.5e-05,2.5e-05,4.5e-05,5.4e-05,0.000138,0.000137,-9e-06,-2.2e-05,-2.4e-05,0.000133,2.2e-05,2.1e-05,8e-05,-0.000287,-2.6e-05,-0.000726,-0.00102,-0.001124,-0.001226,-0.000633,-0.000107,-3.6e-05,3.5e-05,-9e-06,4.4e-05,-4e-06,5.6e-05,0.000175,6.7e-05,6.2e-05,-1.2e-05,0.000113,1.1e-05,4e-05,0.000171,0.000109,8.8e-05,2.2e-05,-7e-06,-2e-06,0.000115,4.8e-05,5e-06,-9e-06,-2.5e-05,1.6e-05,6.3e-05,7.2e-05,0.000118,7e-05,-2.4e-05,0.000104,3.1e-05,7.7e-05,4.2e-05,0.000125,1e-04,6.6e-05,3.3e-05,0.000121,4.9e-05,0.000113,8e-05,2.7e-05,2.5e-05,6e-05,0.000109,5.8e-05,3.7e-05,5e-05,5.5e-05,9.1e-05,5e-05,0.000181,2.3e-05,8e-05,1e-06,5.4e-05,8e-06,3.3e-05,3.1e-05,6.5e-05,6e-05
-0.000155,-0.000199,-3.2e-05,-0.000109,-5.7e-05,-4.1e-05,-9e-06,-5.7e-05,-5.1e-05,3.9e-05,-1.9e-05,-6.1e-05,1e-05,-5.5e-05,-1.2e-05,-1.5e-05,-2.3e-05,-0.000107,-0.000166,-9.2e-05,-7.6e-05,-2.5e-05,-0.000105,-9.4e-05,-8.5e-05,-5.4e-05,-7.3e-05,-6.2e-05,-3.3e-05,1.2e-05,-4.2e-05,3.9e-05,-1.2e-05,-3.8e-05,-5e-06,-3.9e-05,5e-06,4.5e-05,-3e-06,-1e-05,-1e-06,-8.3e-05,-8.9e-05,-0.000109,-0.000131,3.4e-05,-8e-06,1.3e-05,-8.6e-05,-1.5e-05,8e-06,0.000106,6.2e-05,0.000382,0.00052,0.000372,0.000723,0.000302,0.000119,4.7e-05,-9.6e-05,-2e-05,1.9e-05,-3e-05,7e-06,-3.4e-05,-2.9e-05,3.7e-05,-1e-05,-7.3e-05,-2.7e-05,-5.4e-05,-0.000149,-0.000132,-4.6e-05,-8e-05,-2.4e-05,-4.9e-05,-2.3e-05,-6.9e-05,-3.1e-05,-3.9e-05,-1.9e-05,3.4e-05,-3.3e-05,9e-06,-4e-05,-3.9e-05,-3.7e-05,-4.9e-05,-5.9e-05,-3.9e-05,-4.4e-05,-0.000115,-0.000117,-9.3e-05,-5.2e-05,-0.00012,-4e-05,2.3e-05,-1.4e-05,-6.4e-05,-0.000108,8e-06,2.2e-05,-4.8e-05,4e-06,-7.8e-05,-3.4e-05,-0.000199,-0.000106,2.5e-05,-1.7e-05,-9e-05,-0.000113,2.7e-05,-0.000235,-0.000123,-0.000174,-1.6e-05,-0.000118
-9.1e-05,-7.7e-05,-0.000122,-0.000134,-0.000168,-0.000187,-0.000125,-3.3e-05,-6e-05,-1.4e-05,-4.2e-05,-5.8e-05,-6.2e-05,4e-06,2.7e-05,-1.7e-05,1.2e-05,-1.4e-05,-8.8e-05,-9.7e-05,-5.7e-05,-0.000199,-0.000182,-1e-04,-6.6e-05,-8.6e-05,-0.000133,-3.7e-05,-5.1e-05,-4.1e-05,-8.1e-05,-2.8e-05,-2.7e-05,2.7e-05,-3.2e-05,-6.5e-05,-0.000109,-0.00012,4.4e-05,2.4e-05,1.8e-05,-5.4e-05,-0.000157,-0.000197,-1e-05,-6e-06,-6.3e-05,-0.000102,-5e-06,-0.000108,-9.7e-05,-0.000156,-4.2e-05,-0.000266,-0.000123,-0.000117,-0.000325,-9.4e-05,-1.8e-05,-3.9e-05,8e-06,3.8e-05,-4.2e-05,-4.3e-05,-0.000179,-0.000118,-4.9e-05,-1.3e-05,-0.000116,-0.000143,-8.1e-05,-4.8e-05,-9.1e-05,-0.000135,-0.000216,-4.4e-05,-4.3e-05,-2.2e-05,-7.4e-05,-7e-05,-2.3e-05,-3.2e-05,-1.1e-05,-1.2e-05,-5.2e-05,-5.1e-05,-7.4e-05,-6.6e-05,2e-06,-5.6e-05,-0.000138,-7.4e-05,-9.1e-05,-9.3e-05,-8.7e-05,-0.000105,-3.9e-05,-2.3e-05,-0.000116,-1.7e-05,-0.000101,4.2e-05,-2.4e-05,2.9e-05,-2e-06,-1e-04,-2.9e-05,-2.8e-05,4e-06,-7.2e-05,-3e-06,-4e-06,-8e-06,2.2e-05,-4.8e-05,-7.4e-05,-6e-06,-4.5e-05,-0.000102,-3.5e-05,-8.5e-05
1.4e-05,-2.7e-05,-0.000143,7e-06,1e-05,6.1e-05,-3.4e-05,-3.4e-05,-4.6e-05,-1.3e-05,-5.3e-05,4e-06,2.7e-05,-2.1e-05,-7e-06,1.7e-05,0,-1.7e-05,-2.6e-05,3.2e-05,-2.5e-05,-7.2e-05,-5.3e-05,-5.8e-05,-2e-06,-4.3e-05,-3.1e-05,-4.2e-05,1.3e-05,1.5e-05,2e-06,1.7e-05,-0.000118,-5.4e-05,-5e-06,1e-06,-3e-06,1.1e-05,5e-06,-2.1e-05,-1.2e-05,1.5e-05,1e-05,-6e-06,-4.2e-05,-2.1e-05,5.6e-05,-3.9e-05,-3e-06,-3.3e-05,2.7e-05,-1.4e-05,-4e-05,2.8e-05,-0.000112,0.000187,6.3e-05,2.7e-05,3.2e-05,0,4.6e-05,-1.5e-05,-4.1e-05,3.4e-05,2.9e-05,7.1e-05,-1.6e-05,-7e-06,-3.4e-05,1e-06,2.5e-05,-4.7e-05,-1e-05,-3.5e-05,5.7e-05,-2.9e-05,-6.8e-05,1.9e-05,-2.9e-05,4e-06,4.9e-05,-1e-05,4.5e-05,-3.8e-05,-0.000119,-6e-06,1.8e-05,-3.3e-05,-5.7e-05,4.7e-05,7e-06,-2.8e-05,-1.9e-05,3e-06,1.9e-05,-8.4e-05,-6.2e-05,6.5e-05,-5.7e-05,-5.5e-05,-5.6e-05,-1.5e-05,3.6e-05,2.3e-05,2.3e-05,-1.4e-05,-2.8e-05,-7.5e-05,-1.4e-05,1.6e-05,-6e-06,-4.9e-05,-0.00011,-2.7e-05,-3.3e-05,-8.3e-05,-1.6e-05,-2.8e-05,4.6e-05,6.2e-05,-2.6e-05
4.9e-05,0.000154,0.000103,0.000101,0.000137,6e-05,7.6e-05,7.4e-05,-5e-06,2.1e-05,7e-06,4e-05,1.9e-05,-1.5e-05,3.5e-05,1.7e-05,1.2e-05,2.9e-05,4e-05,6.2e-05,7.1e-05,8.9e-05,0.000154,0.000116,6.6e-05,5.3e-05,5.2e-05,4.7e-05,6.4e-05,6e-06,1.5e-05,2.1e-05,-9e-06,-5e-06,4.2e-05,-2.1e-05,8.6e-05,2.6e-05,-4.1e-05,1e-05,-2.2e-05,2.9e-05,6.4e-05,9.7e-05,5e-05,-7e-06,2e-06,-2.1e-05,5.4e-05,5.6e-05,-3e-06,8e-06,-1.9e-05,-7e-06,3.6e-05,-0.000198,8.4e-05,2.2e-05,-3.7e-05,1e-05,6e-06,-4e-06,-1.2e-05,6e-06,-1e-06,4.3e-05,1.3e-05,0,5.9e-05,6.3e-05,3.3e-05,4.2e-05,5.7e-05,0.000112,6e-05,6.9e-05,7.6e-05,2.1e-05,2.5e-05,6.3e-05,-8e-06,1.8e-05,-1e-05,1.7e-05,7e-06,6.5e-05,6e-05,3.1e-05,5.2e-05,1.5e-05,4.4e-05,2.3e-05,3.2e-05,3.4e-05,0.000116,3.6e-05,5.8e-05,3.2e-05,-1.1e-05,3.2e-05,8e-06,-3.2e-05,-1.4e-05,-5.6e-05,2.5e-05,-1.9e-05,-3.2e-05,-4.1e-05,3.1e-05,3.4e-05,6.7e-05,-1.6e-05,-2.6e-05,-2.1e-05,5.5e-05,-1e-06,7.1e-05,4.1e-05,5.2e-05,3.7e-05,2.7e-05
-4e-06,3.5e-05,5e-05,5.7e-05,3.5e-05,7e-05,1.1e-05,2.2e-05,7.5e-05,-5e-06,-4e-06,-1.9e-05,-1.7e-05,-1.3e-05,-2.8e-05,-5.4e-05,1e-05,-1.5e-05,6.3e-05,-2e-05,5.8e-05,2e-06,2.8e-05,7.4e-05,-2e-06,3.3e-05,4.3e-05,8e-06,-2.1e-05,1.3e-05,-1.4e-05,-3.1e-05,-1.4e-05,1.4e-05,-1.2e-05,3.3e-05,2e-05,1e-05,-5.4e-05,-2.4e-05,-2.4e-05,-1.2e-05,-2e-06,1.1e-05,-1e-06,6.7e-05,1.8e-05,3.7e-05,-1.4e-05,8e-06,6.4e-05,1.2e-05,-5e-06,3.2e-05,0.000174,5.2e-05,-0.000103,-1.9e-05,-9e-06,-2.4e-05,-1e-06,-8e-06,-3.2e-05,-3.4e-05,2.3e-05,-4e-06,-6.8e-05,-6.3e-05,-2.3e-05,-4.8e-05,2.4e-05,3.9e-05,-1.8e-05,6e-05,7e-06,6.3e-05,-3.9e-05,-4e-06,-2e-06,1.7e-05,4.2e-05,1.2e-05,1.1e-05,-1.1e-05,1.2e-05,-1.9e-05,5e-06,1.2e-05,1.9e-05,3e-06,-7e-06,4.9e-05,3.2e-05,5.7e-05,9e-06,4.3e-05,7.3e-05,3.6e-05,5.1e-05,4.6e-05,2.5e-05,1.1e-05,-2e-06,4e-06,-1.7e-05,5e-06,-1e-05,-2.9e-05,-9e-06,-1.4e-05,1.5e-05,2.3e-05,4.2e-05,3.9e-05,3.6e-05,3.4e-05,2.5e-05,5.2e-05,1.5e-05,1e-04,-3.6e-05
-5.6e-05,-5.7e-05,-5e-06,-8e-06,-2.1e-05,-2.3e-05,-1.2e-05,-1.8e-05,-5.5e-05,-5.3e-05,-3.5e-05,-2.1e-05,-5e-06,-2e-06,-4.4e-05,-3.7e-05,-2.3e-05,1e-06,-1.5e-05,-7.1e-05,6e-06,2.5e-05,2.8e-05,0,-2e-05,-2.4e-05,-7e-06,-4.4e-05,-4e-06,-3e-06,6e-06,-4e-06,-1.4e-05,-3.3e-05,-2.7e-05,1e-06,-2e-06,-3.4e-05,-2.2e-05,-6.2e-05,-3.5e-05,-2e-06,-2.4e-05,-3.3e-05,-6.3e-05,-1.1e-05,-3.4e-05,-3.7e-05,-4.3e-05,-9e-06,-3.7e-05,6e-06,2.4e-05,4.4e-05,-0.000217,0.000159,4.5e-05,4.9e-05,2.6e-05,-1.7e-05,-1.1e-05,-4.6e-05,3e-06,-1.3e-05,-3.2e-05,-6.5e-05,-3.8e-05,-1.4e-05,9e-06,2e-06,-7.5e-05,-9e-06,-4.9e-05,-4.6e-05,-8.1e-05,2.7e-05,3.9e-05,-6e-06,-1.8e-05,-1.4e-05,-2e-06,-4.2e-05,-3.1e-05,-1.5e-05,2.3e-05,-3.5e-05,-5e-05,-6.2e-05,-6e-06,-1.7e-05,-1.3e-05,-7.3e-05,-1.1e-05,-3.6e-05,-8.5e-05,8e-06,-5.3e-05,-3.6e-05,1e-06,-4.1e-05,-3e-06,-8e-06,6e-06,6e-06,-5.4e-05,-4.6e-05,-6e-05,-4e-06,-3.5e-05,3e-06,-2e-05,-4e-05,1.1e-05,-6.4e-05,-3.5e-05,3.1e-05,-4.6e-05,-5.5e-05,-1e-06,-2.9e-05,-1e-05
-4.5e-05,-1.3e-05,-3.5e-05,-5.1e-05,-6.3e-05,-3.4e-05,-8.3e-05,-5.9e-05,-2.1e-05,-1.4e-05,9e-06,3e-06,-3e-06,1e-06,1.8e-05,9e-06,-1e-05,1e-06,-1.8e-05,-2e-06,-5.9e-05,-6.2e-05,-5.1e-05,-4.1e-05,-3.5e-05,-2.2e-05,-1e-05,-4e-05,-4e-06,-6.4e-05,-1.9e-05,6e-06,6e-06,-1.2e-05,4e-06,-2.3e-05,-9e-06,-1.6e-05,2e-06,-1.3e-05,2.3e-05,1.1e-05,-2.3e-05,-2.5e-05,-3e-05,-1.3e-05,-2e-06,-2.3e-05,-2.6e-05,-3.5e-05,-6e-05,-3.8e-05,-0.00012,-3e-05,1.2e-05,-0.000125,-0.00011,-3.2e-05,-3e-05,-3.6e-05,1.3e-05,0,-3e-05,-3e-06,6e-06,-3.8e-05,1e-05,9e-06,1.5e-05,-5.6e-05,-6.2e-05,8e-06,-1.3e-05,-7e-06,-2.1e-05,-8.6e-05,-3.1e-05,-2e-05,-3e-06,-2.8e-05,-4.8e-05,1.3e-05,3e-05,-3e-06,-9e-06,-3.6e-05,-2.5e-05,0,1e-06,-8e-06,2e-06,-2.5e-05,-2e-06,-2.4e-05,-5e-05,-4.8e-05,-3.9e-05,-2.8e-05,-6.3e-05,-6.1e-05,-1.1e-05,-4e-06,5e-06,-4.8e-05,-2.3e-05,-6e-06,4.3e-05,1.7e-05,5.7e-05,3.4e-05,4e-06,-5.4e-05,2.4e-05,-1.6e-05,-2.4e-05,-8.9e-05,-5.8e-05,-3.5e-05,-5e-05,-8.9e-05,-3.7e-05
9e-06,1e-05,-2.2e-05,-3.4e-05,-1.1e-05,-1.2e-05,-1.1e-05,-5.4e-05,8e-06,6e-06,-1.5e-05,-2.1e-05,-1e-06,-1.9e-05,-2.7e-05,-9e-06,-1.4e-05,-1.1e-05,1.4e-05,-9e-06,-3.9e-05,-3e-06,-3.4e-05,-2.1e-05,-1e-05,2e-06,-1.9e-05,9e-06,3e-06,3e-06,-6e-06,2e-05,-2e-06,-7e-06,-4e-06,-3e-06,5e-06,-1.9e-05,1e-05,-3e-06,-3.5e-05,-2.6e-05,3e-05,3e-06,4.5e-05,-2e-06,-2.2e-05,-2.3e-05,6e-06,4e-06,-1.9e-05,6e-06,-2e-06,-1.1e-05,-2.9e-05,1.5e-05,0.000118,-2e-06,0,1e-05,-1e-06,2.2e-05,1e-06,1e-05,1.5e-05,-2e-06,-1.8e-05,-3.8e-05,8e-06,5e-06,-1e-05,-2e-05,-1.6e-05,4e-06,6e-06,3e-06,-3.5e-05,2e-05,5e-06,-1.7e-05,-2.2e-05,1.3e-05,1e-06,7e-06,0,-3.3e-05,-3e-05,3.3e-05,-2.1e-05,-3.4e-05,-5e-06,-2.3e-05,-2.4e-05,-3.1e-05,-1e-06,-1.6e-05,-3.1e-05,1.6e-05,9e-06,-3e-05,-2.3e-05,-3.9e-05,-1e-05,0,-4.3e-05,0,5.1e-05,-2e-06,2.6e-05,2.3e-05,-3e-06,2.8e-05,-3e-06,-1.1e-05,1.5e-05,6e-06,-2.6e-05,3.9e-05,-1.9e-05,-9e-06,-7e-06
1.1e-05,-3e-06,3.2e-05,4e-06,3.8e-05,3e-05,2.8e-05,1.3e-05,9e-06,2.8e-05,2.7e-05,6.2e-05,1.6e-05,1.5e-05,1.1e-05,5e-06,1.7e-05,6e-06,4e-06,2.3e-05,9e-06,4.6e-05,7e-06,2.8e-05,5e-05,2.6e-05,1.1e-05,2.1e-05,1.8e-05,4e-06,-7e-06,4e-06,2.3e-05,1.2e-05,1e-06,8e-06,-9e-06,3.3e-05,-4e-06,1.4e-05,1.9e-05,-1.4e-05,3.4e-05,3e-06,4.8e-05,2.3e-05,5e-06,2e-05,7e-06,2.6e-05,1.1e-05,8e-06,3.9e-05,-5e-06,5.2e-05,0.000101,-8.4e-05,2e-05,3.2e-05,-9e-06,-1.3e-05,-7e-06,-5e-06,2.1e-05,7e-06,1.1e-05,7e-06,2.4e-05,6e-06,2e-05,4.1e-05,2.2e-05,2.4e-05,9e-06,5e-05,1e-05,4e-06,1.9e-05,-1.3e-05,3e-06,8e-06,1.2e-05,6e-06,-2e-06,1e-05,4.5e-05,1.8e-05,4.5e-05,1.1e-05,2e-05,1.4e-05,3.6e-05,1.5e-05,3.1e-05,1.7e-05,5.9e-05,4e-06,1e-05,4e-05,2.9e-05,2.4e-05,-4e-06,2.4e-05,3.4e-05,2e-06,0,2e-05,1e-06,5e-06,1.3e-05,-4e-06,-2e-06,-9e-06,2.1e-05,1.9e-05,-1.4e-05,4e-06,2.1e-05,3.3e-05,2.9e-05,8e-06
1.5e-05,-1e-05,2.1e-05,2.7e-05,-1.9e-05,1.1e-05,2e-06,-1e-06,3.3e-05,5e-06,-8e-06,1e-06,-1.1e-05,1.2e-05,0,-7e-06,-5e-06,0,6e-06,2.1e-05,1e-06,-1e-06,3e-06,-1e-05,2.1e-05,-8e-06,1e-05,7e-06,-1.2e-05,8e-06,1.8e-05,6e-06,-9e-06,1e-06,-1.4e-05,-1e-06,-1e-06,0,-1.5e-05,-1e-05,1.9e-05,1.6e-05,-1.1e-05,-7e-06,-1.5e-05,1.9e-05,1.4e-05,-9e-06,2.4e-05,-1.7e-05,-3e-06,2.1e-05,2.2e-05,5.2e-05,3.1e-05,-0.000131,1.1e-05,-1.2e-05,-3e-05,2e-06,-1.5e-05,-1.3e-05,-1.3e-05,1.7e-05,-1.5e-05,1e-06,-1e-05,3.4e-05,3e-06,-1.6e-05,-5e-06,2.9e-05,1.3e-05,-8e-06,2.9e-05,1.6e-05,6e-06,7e-06,6e-06,3e-06,2e-06,9e-06,-1.6e-05,1e-05,-3e-06,1e-05,1e-06,1.7e-05,-2e-06,8e-06,-5e-06,7e-06,-4e-06,8e-06,1e-06,2e-05,8e-06,3e-06,-1.1e-05,1e-06,1.6e-05,1.6e-05,5e-06,-2e-06,7e-06,2e-06,-2.7e-05,2e-05,1.4e-05,-1.6e-05,-1.7e-05,6e-06,5e-06,2.3e-05,-1e-05,1.4e-05,1e-05,6e-06,4e-06,7e-06,3.8e-05
-3e-06,-1.2e-05,-3e-06,-4e-06,5e-06,-8e-06,-5e-06,1.6e-05,-5e-06,-1.3e-05,-3e-06,-7e-06,5e-06,-5e-06,7e-06,-6e-06,-8e-06,-7e-06,-6e-06,-1.3e-05,-2.8e-05,2.8e-05,3e-06,1.2e-05,-8e-06,-1e-05,-7e-06,-7e-06,-2.8e-05,-1.9e-05,0,-2e-06,-7e-06,-4e-06,-5e-06,6e-06,1.5e-05,0,-7e-06,1.8e-05,1e-06,-4e-06,1e-05,-6e-06,-1.7e-05,-1.6e-05,1e-06,0,-9e-06,-2.2e-05,1.2e-05,-5e-06,0,-3.5e-05,0,4.5e-05,1.5e-05,1.6e-05,0,0,-1.7e-05,-7e-06,2.1e-05,4e-06,-1.7e-05,0,1.5e-05,3.3e-05,-1e-06,1.5e-05,-5e-06,-2e-06,-1.3e-05,-1.3e-05,-1.9e-05,-3.4e-05,-6e-06,-2.8e-05,-1.6e-05,-8e-06,7e-06,6e-06,-1e-06,-2e-05,-3e-06,8e-06,1e-06,-9e-06,-1.9e-05,0,1.1e-05,0,-1.1e-05,-3e-06,2.3e-05,-5e-06,2e-05,-1.2e-05,-1e-06,1.3e-05,5e-06,1.5e-05,-5e-06,0,-7e-06,1.1e-05,5e-06,4e-06,-1.1e-05,-1.4e-05,-2e-06,-5e-06,2.2e-05,2.2e-05,6e-06,1.4e-05,3.4e-05,-3e-06,-3.7e-05,-1.2e-05,-3.9e-05
-5e-06,-8e-06,4e-06,-2e-06,-1.2e-05,-8e-06,-1e-06,-1.6e-05,8e-06,2e-06,-1e-06,-7e-06,-6e-06,-1.8e-05,-1e-05,-1e-06,5e-06,-6e-06,5e-06,-3e-06,-4e-06,-1e-06,-1e-05,-4e-06,-1e-05,0,-3e-06,-1e-06,-9e-06,-4e-06,-9e-06,-5e-06,-2e-06,4e-06,-1e-05,-1.3e-05,-1e-05,-1e-05,9e-06,2e-06,1.5e-05,1.1e-05,1e-06,-7e-06,-1e-06,-2.7e-05,-1.9e-05,1e-05,3e-06,-1.5e-05,-2.6e-05,7e-06,-1e-05,-5e-06,3e-05,2.5e-05,1.9e-05,-5e-06,-6e-06,6e-06,4e-06,-5e-06,1e-06,1e-06,3e-06,2e-06,-4e-06,-1.2e-05,-5e-06,3e-06,9e-06,-2.5e-05,1e-06,0,7e-06,3e-06,-5e-06,-6e-06,-7e-06,1e-05,-1.6e-05,-1.6e-05,-5e-06,1e-06,-6e-06,6e-06,-2e-06,2e-06,-1.3e-05,-9e-06,-9e-06,1.2e-05,-7e-06,-5e-06,-1.5e-05,-2e-05,-5e-06,-1.4e-05,1e-06,6e-06,-5e-06,4e-06,-1.1e-05,-2e-06,-4e-06,-8e-06,3e-06,-1.6e-05,-1.7e-05,1.5e-05,0,-1.9e-05,-1.8e-05,1e-06,2e-06,-1.3e-05,-6e-06,-9e-06,1.1e-05,3e-06,8e-06
-9e-06,-1e-06,6e-06,5e-06,-1.1e-05,1e-06,-7e-06,7e-06,-6e-06,0,-1e-06,-7e-06,1e-06,1e-06,-1e-06,0,3e-06,-3e-06,1e-06,-4e-06,1.2e-05,-2.3e-05,4e-06,3e-06,-5e-06,-5e-06,1e-06,-7e-06,5e-06,1.1e-05,4e-06,0,-3e-06,0,8e-06,1.2e-05,-3e-06,6e-06,6e-06,4e-06,-4e-06,-5e-06,-1.9e-05,6e-06,6e-06,-6e-06,1.4e-05,-6e-06,-7e-06,4e-06,5e-06,-2e-06,3e-06,-1e-06,-9e-06,-2.5e-05,-3e-05,-1.1e-05,3e-06,-1.5e-05,3e-06,-3e-06,-1.4e-05,5e-06,-1.1e-05,0,7e-06,-1.5e-05,-9e-06,-1e-06,-8e-06,-1.2e-05,-1.8e-05,-1e-05,-6e-06,0,1.3e-05,0,-1e-06,1e-06,2e-06,-2e-06,-6e-06,2e-06,0,-9e-06,-2e-06,-1.4e-05,8e-06,-1e-05,3e-06,1e-06,-6e-06,-1e-06,-9e-06,-6e-06,3e-06,-6e-06,3e-06,-2e-06,0,-1e-06,5e-06,-2e-06,1.3e-05,0,2e-06,-7e-06,-1.4e-05,4e-06,0,-1e-06,-1e-06,0,0,6e-06,-2e-06,-1.5e-05,5e-06,8e-06,-3e-06
1e-05,5e-06,-3e-06,5e-06,5e-06,0,-1e-06,5e-06,-6e-06,2e-06,-2e-06,-2e-06,0,5e-06,3e-06,1e-06,-2e-06,4e-06,-3e-06,-2e-06,9e-06,5e-06,1.3e-05,-9e-06,1e-06,6e-06,3e-06,-4e-06,3e-06,-1e-05,1e-06,4e-06,1e-06,0,1.6e-05,3e-06,9e-06,-1e-05,3e-06,-5e-06,-5e-06,6e-06,-4e-06,3e-06,7e-06,1.1e-05,-9e-06,-1e-06,5e-06,-2e-06,9e-06,-1e-06,0,-6e-06,-7e-06,-2.3e-05,1.1e-05,-5e-06,-1e-05,5e-06,6e-06,-2e-06,4e-06,-6e-06,6e-06,-6e-06,-6e-06,1e-06,2e-06,-1e-06,-4e-06,7e-06,3e-06,-1e-06,-5e-06,1.6e-05,-8e-06,0,3e-06,3e-06,4e-06,8e-06,2e-06,2e-06,0,-1.1e-05,3e-06,2e-06,4e-06,3e-06,0,-3e-06,-1e-06,-1e-06,6e-06,1.4e-05,5e-06,2e-06,3e-06,-1e-06,1e-06,-8e-06,6e-06,3e-06,3e-06,3e-06,4e-06,7e-06,1e-06,3e-06,2e-06,-1e-06,-4e-06,-3e-06,1e-06,4e-06,5e-06,-5e-06,-4e-06,-1.3e-05,1e-06
-1e-06,4e-06,-5e-06,1e-06,1e-06,-5e-06,1e-06,2e-06,4e-06,2e-06,3e-06,1e-06,-2e-06,1e-06,-2e-06,1e-06,-3e-06,1e-06,2e-06,-2e-06,0,2e-06,-2e-06,-3e-06,3e-06,5e-06,-2e-06,1e-06,9e-06,-4e-06,1e-06,0,2e-06,-2e-06,4e-06,-5e-06,-1e-06,3e-06,-6e-06,0,3e-06,3e-06,0,-3e-06,2e-06,4e-06,-1e-06,0,-4e-06,4e-06,-1e-05,4e-06,0,2e-06,-1.1e-05,1.6e-05,0,5e-06,7e-06,-5e-06,1e-06,4e-06,3e-06,8e-06,2e-06,-4e-06,0,1.2e-05,-2e-06,-4e-06,-4e-06,-6e-06,-3e-06,6e-06,1e-06,-4e-06,1e-06,6e-06,1e-06,-4e-06,0,0,-3e-06,-2e-06,0,1e-06,2e-06,1e-06,1e-06,2e-06,1e-06,-2e-06,0,-4e-06,-5e-06,-1.2e-05,3e-06,7e-06,0,0,0,1e-06,3e-06,-5e-06,-1.2e-05,0,2e-06,3e-06,-5e-06,7e-06,3e-06,9e-06,1e-06,-2e-06,3e-06,-7e-06,-3e-06,3e-06,4e-06,-7e-06,0
3e-06,5e-06,3e-06,-3e-06,6e-06,1e-06,-2e-06,-1.1e-05,-1e-06,2e-06,-1e-06,-2e-06,0,-4e-06,2e-06,-1e-06,-2e-06,0,-1e-06,5e-06,2e-06,-1.1e-05,4e-06,-2e-06,3e-06,2e-06,-1e-06,3e-06,2e-06,-3e-06,-1e-06,-1e-06,-2e-06,1e-06,3e-06,3e-06,-3e-06,3e-06,-3e-06,1e-06,4e-06,1e-06,-1e-06,4e-06,1e-05,-4e-06,0,0,3e-06,6e-06,1e-06,-1e-06,-6e-06,-3e-06,3e-06,-3e-05,5e-06,0,-1e-06,3e-06,1e-06,-2e-06,0,4e-06,-2e-06,-1e-06,0,3e-06,2e-06,0,3e-06,-7e-06,-1e-06,-1e-06,3e-06,5e-06,-2e-06,-1e-06,-1e-06,0,-2e-06,-2e-06,2e-06,2e-06,-3e-06,-1e-06,-4e-06,0,1e-06,-1e-06,-1e-06,3e-06,2e-06,0,-1e-06,-4e-06,-9e-06,3e-06,2e-06,0,-2e-06,4e-06,1e-06,1e-06,4e-06,0,-6e-06,-2e-06,-2e-06,-3e-06,0,-4e-06,4e-06,1e-06,0,2e-06,-4e-06,4e-06,-3e-06,4e-06,-3e-06
1e-06,1e-06,1e-06,0,4e-06,2e-06,5e-06,0,2e-06,-2e-06,-1e-06,2e-06,1e-06,1e-06,-1e-06,-3e-06,1e-06,0,0,0,3e-06,2e-06,4e-06,-1e-06,7e-06,-1e-06,1e-06,0,-1e-06,1e-06,1e-06,-1e-06,2e-06,0,0,-2e-06,3e-06,-1e-06,-1e-06,0,-3e-06,-1e-06,2e-06,1e-06,-2e-06,0,-1e-06,1e-06,2e-06,2e-06,-4e-06,2e-06,8e-06,2e-06,6e-06,4.7e-05,-1.1e-05,-5e-06,2e-06,-5e-06,1e-06,-1e-06,-1e-06,-3e-06,2e-06,1e-06,-1e-06,0,0,1e-06,3e-06,2e-06,-3e-06,1e-06,2e-06,6e-06,-1e-06,-2e-06,3e-06,-2e-06,0,1e-06,0,-2e-06,1e-06,3e-06,2e-06,-2e-06,4e-06,1e-06,2e-06,2e-06,2e-06,2e-06,2e-06,5e-06,-4e-06,3e-06,7e-06,1e-06,1e-06,-2e-06,-1e-06,5e-06,-3e-06,0,-6e-06,-2e-06,1e-06,0,0,-1e-06,-5e-06,3e-06,-2e-06,-6e-06,-1e-06,1e-06,-2e-06,1e-06,2e-06
1e-06,1e-06,-4e-06,1e-06,1e-06,-1e-06,-2e-06,0,0,-4e-06,1e-06,1e-06,-1e-06,1e-06,1e-06,0,-1e-06,-1e-06,0,0,-3e-06,-2e-06,-4e-06,-1e-06,1e-06,1e-06,0,-1e-06,0,0,0,-2e-06,-2e-06,0,-5e-06,0,1e-06,0,3e-06,4e-06,4e-06,-2e-06,-2e-06,-3e-06,-5e-06,4e-06,-1e-06,-3e-06,2e-06,-3e-06,4e-06,2e-06,1e-06,0,1e-06,-1.3e-05,4e-06,-1e-06,-1e-06,1e-06,-1e-06,-3e-06,-1e-06,1e-06,0,1e-06,2e-06,-2e-06,0,-3e-06,0,3e-06,-1e-06,2e-06,-1e-06,1e-06,0,-4e-06,-4e-06,-2e-06,3e-06,-1e-06,3e-06,-1e-06,-1e-06,6e-06,1e-06,-6e-06,1e-06,2e-06,-2e-06,0,1e-06,0,4e-06,0,3e-06,-1e-06,-6e-06,2e-06,2e-06,-1e-06,-1e-06,-2e-06,-2e-06,1e-06,5e-06,-1e-06,-4e-06,-1e-06,0,4e-06,-4e-06,3e-06,-1e-06,6e-06,3e-06,0,1e-06,2e-06,-2e-06
-1e-06,-2e-06,-1e-06,0,-1e-06,1e-06,0,1e-06,1e-06,0,-1e-06,-6e-06,0,0,-2e-06,-1e-06,-1e-06,0,0,1e-06,-7e-06,-1e-06,-1e-06,3e-06,-5e-06,-1e-06,0,0,0,-5e-06,1e-06,0,2e-06,-1e-06,-2e-06,0,-3e-06,1e-06,3e-06,2e-06,0,0,2e-06,1e-06,-1e-06,-1e-06,4e-06,2e-06,-2e-06,1e-06,-1e-06,-1e-06,-4e-06,3e-06,3e-06,6e-06,3e-06,0,-1e-06,0,-1e-06,1e-06,2e-06,-3e-06,2e-06,1e-06,-1e-06,2e-06,0,3e-06,0,0,-1e-06,1e-06,0,-9e-06,0,-3e-06,2e-06,0,0,-5e-06,1e-06,1e-06,0,-1e-06,-3e-06,-3e-06,-2e-06,-1e-06,0,0,1e-06,0,-2e-06,-6e-06,1e-06,-2e-06,2e-06,1e-06,-2e-06,2e-06,-1e-06,-1e-06,3e-06,0,2e-06,0,1e-06,0,-1e-06,-5e-06,1e-06,1e-06,-1e-06,-3e-06,3e-06,0,-7e-06,-1e-06,1e-06
-1e-06,-1e-06,2e-06,-1e-06,-1e-06,-1e-06,-1e-06,-1e-06,-2e-06,0,0,-1e-06,0,-1e-06,2e-06,0,1e-06,0,0,-3e-06,-4e-06,-1e-06,1e-06,4e-06,-3e-06,-1e-06,-1e-06,-2e-06,-1e-06,2e-06,-1e-06,1e-06,-1e-06,1e-06,2e-06,-2e-06,0,-1e-06,-1e-06,0,0,0,0,0,4e-06,-4e-06,-2e-06,0,0,0,-2e-06,1e-06,-1e-06,-1e-06,-1e-06,-6e-06,2e-06,3e-06,-2e-06,-1e-06,-2e-06,0,-1e-06,-3e-06,-1e-06,0,2e-06,0,2e-06,0,0,-1e-06,-4e-06,-1e-06,-5e-06,-1e-06,-2e-06,2e-06,-2e-06,1e-06,-3e-06,0,0,0,0,-1e-06,2e-06,-6e-06,-1e-06,0,0,4e-06,0,0,0,-4e-06,-2e-06,-1e-06,3e-06,2e-06,0,2e-06,0,0,0,0,-1e-06,0,2e-06,-2e-06,-1e-06,-1e-06,3e-06,-1e-06,-1e-06,-1e-06,3e-06,-2e-06,1e-06,5e-06,-4e-06
0,-2e-06,0,0,-6e-06,1e-06,0,2e-06,-2e-06,1e-06,0,1e-06,0,0,-1e-06,1e-06,1e-06,0,-1e-06,0,1e-06,-5e-06,-3e-06,0,0,0,1e-06,-1e-06,2e-06,2e-06,0,0,0,0,-1e-06,1e-06,1e-06,-1e-06,-2e-06,-2e-06,0,0,-2e-06,-2e-06,3e-06,1e-06,0,0,-1e-06,-1e-06,1e-06,0,1e-06,0,-2e-06,1.3e-05,-7e-06,0,3e-06,-1e-06,-1e-06,0,-1e-06,0,0,-1e-06,-2e-06,-3e-06,1e-06,-2e-06,-3e-06,1e-06,2e-06,0,1e-06,0,1e-06,3e-06,0,2e-06,-1e-06,1e-06,0,-1e-06,-1e-06,-1e-06,0,1e-06,-1e-06,-1e-06,0,-3e-06,0,0,0,2e-06,3e-06,-1e-06,0,-1e-06,1e-06,0,0,-1e-06,0,1e-06,-1e-06,-1e-06,5e-06,-1e-06,-1e-06,0,-2e-06,-2e-06,-1e-06,2e-06,1e-06,0,3e-06,1e-06,2e-06
1e-06,-1e-06,-2e-06,1e-06,0,-1e-06,-1e-06,2e-06,-2e-06,0,0,-1e-06,0,1e-06,0,-1e-06,-1e-06,-1e-06,0,1e-06,0,2e-06,1e-06,2e-06,0,0,0,0,-1e-06,-2e-06,0,0,0,0,0,1e-06,-2e-06,2e-06,-1e-06,0,-1e-06,0,2e-06,1e-06,0,4e-06,2e-06,-2e-06,0,-1e-06,1e-06,0,0,1e-06,-2e-06,-1.4e-05,3e-06,0,0,0,-2e-06,0,2e-06,-1e-06,1e-06,-1e-06,2e-06,-3e-06,1e-06,2e-06,-3e-06,2e-06,-3e-06,0,-1e-06,0,1e-06,1e-06,0,1e-06,1e-06,-1e-06,-1e-06,1e-06,0,-3e-06,0,0,-1e-06,0,0,0,0,-1e-06,-3e-06,2e-06,3e-06,1e-06,0,0,0,-2e-06,0,1e-06,2e-06,0,-1e-06,0,0,-4e-06,0,2e-06,-3e-06,-1e-06,0,-1e-06,0,1e-06,-5e-06,-6e-06,-2e-06
0,0,0,0,-1e-06,0,1e-06,0,0,0,-1e-06,3e-06,0,0,1e-06,-1e-06,-1e-06,0,0,0,0,1e-06,1e-06,0,2e-06,0,0,1e-06,-2e-06,-3e-06,1e-06,0,0,-1e-06,2e-06,-1e-06,-1e-06,-2e-06,1e-06,0,0,0,0,0,1e-06,1e-06,-4e-06,1e-06,0,0,-2e-06,0,1e-06,1e-06,-3e-06,1.8e-05,1e-06,0,-1e-06,-1e-06,1e-06,-1e-06,-3e-06,0,-1e-06,0,-1e-06,3e-06,1e-06,-2e-06,2e-06,3e-06,2e-06,-1e-06,0,-3e-06,-4e-06,0,-1e-06,0,1e-06,0,0,-1e-06,0,0,0,1e-06,-2e-06,1e-06,0,-1e-06,-1e-06,0,0,-3e-06,-2e-06,0,0,0,-1e-06,-2e-06,0,-1e-06,-1e-06,0,-1e-06,1e-06,2e-06,-1e-06,0,-1e-06,1e-06,0,0,0,-1e-06,2e-06,2e-06,0,1e-06
1e-06,0,1e-06,0,-1e-06,0,0,-2e-06,-1e-06,0,0,0,0,0,-1e-06,0,0,0,0,0,2e-06,-3e-06,-1e-06,1e-06,1e-06,-1e-06,0,0,0,0,0,0,0,1e-06,0,1e-06,2e-06,2e-06,1e-06,0,0,1e-06,0,-1e-06,-2e-06,-3e-06,2e-06,0,1e-06,0,1e-06,0,-1e-06,0,0,-1.4e-05,-1e-06,1e-06,1e-06,-1e-06,0,-1e-06,1e-06,-1e-06,0,0,1e-06,3e-06,0,0,1e-06,0,-2e-06,-1e-06,2e-06,1e-06,2e-06,-1e-06,1e-06,0,0,1e-06,-1e-06,0,-1e-06,2e-06,0,-1e-06,0,0,0,1e-06,0,0,1e-06,-1e-06,-1e-06,1e-06,1e-06,0,0,1e-06,-1e-06,0,-2e-06,0,1e-06,0,0,-1e-06,0,-2e-06,2e-06,0,0,0,-1e-06,0,1e-06,-1e-06,-1e-06
0,1e-06,0,0,3e-06,0,0,-1e-06,-1e-06,-1e-06,0,-1e-06,0,-1e-06,1e-06,-1e-06,0,0,0,1e-06,3e-06,3e-06,1e-06,-2e-06,0,0,0,0,0,2e-06,1e-06,0,0,0,0,-1e-06,0,-1e-06,1e-06,1e-06,1e-06,0,1e-06,0,-2e-06,-1e-06,-1e-06,-1e-06,1e-06,-1e-06,-1e-06,0,0,0,1e-06,1e-06,-2e-06,0,-1e-06,0,1e-06,-1e-06,2e-06,-1e-06,-1e-06,0,0,0,0,1e-06,1e-06,-1e-06,1e-06,0,-1e-06,4e-06,-1e-06,-1e-06,-1e-06,-1e-06,0,-1e-06,0,0,0,0,-1e-06,0,1e-06,0,0,0,0,0,2e-06,3e-06,0,-1e-06,1e-06,0,0,1e-06,0,1e-06,2e-06,0,3e-06,0,-2e-06,-1e-06,0,3e-06,0,1e-06,0,-1e-06,-1e-06,0,-3e-06,2e-06,1e-06
0,0,-1e-06,0,1e-06,0,0,-1e-06,1e-06,0,0,1e-06,0,1e-06,-1e-06,0,-1e-06,0,0,-1e-06,0,0,0,0,-1e-06,0,0,0,0,-2e-06,0,1e-06,0,0,2e-06,0,-1e-06,0,-1e-06,0,-1e-06,0,-1e-06,0,-1e-06,1e-06,0,0,0,0,0,0,2e-06,0,2e-06,-3e-06,2e-06,1e-06,0,0,1e-06,1e-06,-2e-06,-1e-06,0,0,0,-3e-06,0,-1e-06,0,1e-06,-1e-06,0,0,1e-06,-1e-06,0,1e-06,-1e-06,1e-06,-1e-06,-1e-06,0,0,1e-06,1e-06,0,1e-06,0,0,-1e-06,0,0,-1e-06,1e-06,-1e-06,0,-2e-06,0,0,0,0,-1e-06,0,0,0,0,1e-06,0,1e-06,-1e-06,-1e-06,0,0,2e-06,1e-06,-1e-06,2e-06,0,-2e-06
0,1e-06,1e-06,0,1e-06,-1e-06,-1e-06,0,-1e-06,0,0,-1e-06,0,0,1e-06,1e-06,0,0,0,-1e-06,-1e-06,-2e-06,0,-1e-06,-1e-06,0,0,-1e-06,2e-06,-1e-06,1e-06,0,0,0,0,0,2e-06,0,-1e-06,0,0,0,0,0,1e-06,1e-06,0,0,0,1e-06,1e-06,0,-2e-06,0,0,4e-06,1e-06,-1e-06,0,-2e-06,0,0,0,-1e-06,0,0,0,-1e-06,0,0,0,0,0,0,0,-1e-06,0,1e-06,-1e-06,0,0,1e-06,0,-1e-06,0,0,-1e-06,1e-06,0,0,0,2e-06,0,0,1e-06,-1e-06,-2e-06,0,1e-06,0,0,0,0,-1e-06,-1e-06,0,-2e-06,0,-1e-06,0,0,-1e-06,0,0,0,-2e-06,1e-06,-1e-06,-1e-06,1e-06,1e-06
0,0,0,0,1e-06,1e-06,1e-06,0,0,0,0,0,0,0,-1e-06,0,0,0,0,0,-1e-06,2e-06,0,0,-1e-06,0,0,0,0,1e-06,0,0,0,0,-2e-06,0,1e-06,1e-06,0,-1e-06,0,0,0,0,1e-06,-1e-06,1e-06,0,-1e-06,1e-06,-1e-06,0,-1e-06,0,-1e-06,-4e-06,-1e-06,0,1e-06,0,0,0,1e-06,1e-06,0,0,0,1e-06,0,0,-1e-06,-2e-06,0,0,0,0,1e-06,1e-06,0,0,-1e-06,0,0,1e-06,0,-2e-06,1e-06,1e-06,0,0,0,-1e-06,0,0,-1e-06,-1e-06,2e-06,0,1e-06,0,0,0,0,1e-06,2e-06,0,-1e-06,0,0,0,0,1e-06,1e-06,-1e-06,0,0,1e-06,0,-1e-06,3e-06,-2e-06
0,0,-1e-06,0,0,-1e-06,-1e-06,1e-06,-1e-06,0,0,1e-06,0,-1e-06,1e-06,-1e-06,0,0,0,0,0,-1e-06,0,-1e-06,1e-06,0,0,0,-1e-06,0,1e-06,0,0,0,0,0,-1e-06,-2e-06,1e-06,0,-1e-06,0,-1e-06,0,-1e-06,0,-1e-06,-1e-06,0,0,1e-06,0,1e-06,0,-1e-06,4e-06,-1e-06,0,-1e-06,0,0,-1e-06,0,0,0,0,1e-06,1e-06,0,-1e-06,-2e-06,-2e-06,0,0,-1e-06,1e-06,-2e-06,0,0,0,-1e-06,-1e-06,0,0,0,0,0,2e-06,1e-06,0,0,0,0,0,-1e-06,1e-06,1e-06,1e-06,-1e-06,0,0,1e-06,0,0,0,0,1e-06,0,-2e-06,1e-06,0,0,1e-06,-1e-06,0,0,1e-06,0,2e-06,-2e-06,1e-06
0,0,-1e-06,0,0,0,0,1e-06,0,0,0,0,0,0,0,0,0,0,0,0,-1e-06,-1e-06,0,0,0,0,0,0,0,-1e-06,0,0,0,0,0,0,0,1e-06,1e-06,0,0,0,1e-06,0,-1e-06,1e-06,2e-06,0,0,0,-1e-06,0,0,0,-1e-06,-5e-06,1e-06,0,0,-1e-06,0,-1e-06,0,1e-06,0,0,-1e-06,0,0,1e-06,0,0,0,0,1e-06,-2e-06,2e-06,-1e-06,0,0,0,1e-06,0,0,0,0,0,1e-06,0,0,0,-1e-06,0,0,0,1e-06,0,0,0,0,0,0,0,0,-1e-06,0,0,0,0,1e-06,0,0,0,0,0,0,0,1e-06,-2e-06,-1e-06,-1e-06
0,-1e-06,1e-06,0,0,0,0,1e-06,1e-06,0,0,0,0,0,0,0,0,0,0,0,-1e-06,1e-06,0,0,1e-06,0,0,0,-1e-06,-1e-06,0,0,0,0,-1e-06,0,1e-06,0,0,0,0,0,0,0,-1e-06,0,-1e-06,0,1e-06,0,0,0,0,0,0,1e-06,0,0,0,0,-1e-06,0,-1e-06,0,0,0,1e-06,-1e-06,0,0,1e-06,0,0,0,0,-1e-06,-1e-06,-1e-06,0,0,0,0,0,0,0,0,0,1e-06,-1e-06,0,0,1e-06,0,0,0,-1e-06,0,0,0,0,0,-1e-06,0,0,0,0,1e-06,0,-1e-06,1e-06,0,-2e-06,-1e-06,0,0,0,-1e-06,0,0,-2e-06,0
0,0,0,0,-1e-06,0,0,-1e-06,-1e-06,0,0,1e-06,0,0,0,0,0,0,0,0,0,-1e-06,0,0,0,0,0,0,0,1e-06,0,0,0,0,1e-06,0,-1e-06,0,-1e-06,0,0,0,0,0,0,-1e-06,1e-06,0,0,0,0,0,0,0,0,4e-06,0,0,1e-06,0,0,0,0,-1e-06,0,0,0,0,0,0,1e-06,-1e-06,0,0,0,-1e-06,-1e-06,0,0,0,0,-1e-06,0,0,0,1e-06,0,0,-1e-06,0,0,0,0,0,0,-1e-06,1e-06,0,0,0,0,0,0,0,0,0,0,0,0,1e-06,0,1e-06,0,0,0,-1e-06,-1e-06,0,1e-06,1e-06,-1e-06
0,-1e-06,-1e-06,0,0,0,0,-1e-06,1e-06,0,0,-1e-06,0,0,0,1e-06,0,0,0,0,1e-06,0,0,0,0,0,0,0,1e-06,0,0,0,0,0,1e-06,0,0,1e-06,0,0,1e-06,0,0,-1e-06,0,0,0,0,1e-06,0,0,0,0,0,1e-06,-2e-06,-1e-06,0,-1e-06,0,0,1e-06,0,1e-06,0,0,0,1e-06,0,0,0,0,0,0,1e-06,1e-06,1e-06,1e-06,0,0,0,0,0,0,0,0,0,0,0,0,0,0,0,0,0,1e-06,-1e-06,0,0,0,0,0,0,0,-1e-06,0,-1e-06,0,1e-06,1e-06,0,0,1e-06,0,0,0,0,0,-1e-06,1e-06,0
0,0,0,0,0,0,0,-1e-06,0,0,0,0,0,0,0,0,0,0,0,0,0,1e-06,0,0,-1e-06,0,0,0,0,-1e-06,0,0,0,0,0,0,1e-06,0,0,0,0,0,0,0,0,1e-06,0,0,-1e-06,0,0,0,1e-06,0,1e-06,1e-06,1e-06,0,0,0,0,0,-1e-06,0,0,0,0,0,0,0,0,0,0,0,-1e-06,-1e-06,0,0,0,0,0,1e-06,0,0,0,0,0,0,0,0,0,0,0,0,1e-06,0,-1e-06,0,-1e-06,0,0,0,0,0,1e-06,0,-1e-06,0,0,0,0,-1e-06,0,0,0,0,0,0,1e-06,-1e-06,0
0,0,1e-06,0,0,0,0,-1e-06,0,0,0,1e-06,0,0,0,0,0,0,0,0,0,-1e-06,0,1e-06,0,0,0,0,-1e-06,-1e-06,0,0,0,0,0,0,0,0,0,0,0,0,0,0,0,0,1e-06,0,0,0,0,0,0,0,0,-2e-06,0,0,-1e-06,0,0,0,1e-06,0,0,0,0,-1e-06,0,0,0,1e-06,0,0,0,1e-06,-1e-06,0,0,0,0,0,0,0,0,0,0,1e-06,0,0,0,1e-06,0,0,-1e-06,-1e-06,1e-06,0,0,0,0,0,0,-1e-06,0,0,1e-06,0,1e-06,0,0,1e-06,-1e-06,0,0,0,0,0,0,2e-06,0
0,1e-06,-1e-06,0,1e-06,0,0,0,0,0,0,0,0,0,0,0,0,0,0,0,0,1e-06,0,0,0,0,0,0,1e-06,1e-06,0,0,0,0,1e-06,0,0,0,0,0,1e-06,0,0,0,0,0,0,0,-1e-06,0,0,0,-1e-06,0,0,1e-06,0,0,0,0,0,-1e-06,0,1e-06,0,0,0,0,0,0,-1e-06,0,0,0,0,0,1e-06,0,0,0,0,0,0,0,0,-1e-06,0,0,0,0,0,-1e-06,0,0,0,-1e-06,0,0,0,0,0,0,0,0,-1e-06,0,1e-06,0,0,0,0,-1e-06,0,0,0,0,0,0,-1e-06,0,0
0,0,0,0,0,0,0,0,0,0,0,0,0,0,0,0,0,0,0,0,0,0,0,1e-06,0,0,0,0,0,0,0,0,0,0,-1e-06,0,1e-06,0,0,0,-1e-06,0,0,0,0,0,0,0,1e-06,0,0,0,0,0,-1e-06,-2e-06,0,0,1e-06,-1e-06,0,0,-1e-06,0,0,0,0,1e-06,0,0,0,0,0,0,0,3e-06,0,0,0,0,0,1e-06,0,0,0,0,0,0,0,0,0,0,0,0,0,0,0,0,-1e-06,0,0,0,0,0,1e-06,0,0,0,0,0,0,0,1e-06,0,0,-1e-06,0,0,1e-06,0,-1e-06
0,0,0,0,0,0,0,1e-06,1e-06,0,0,0,0,0,0,0,0,0,0,0,-1e-06,-1e-06,0,0,0,0,0,0,0,-1e-06,0,0,0,0,0,0,0,-1e-06,0,0,0,0,0,0,0,0,0,0,-1e-06,0,0,0,1e-06,0,0,5e-06,0,0,0,0,0,0,1e-06,0,0,0,0,1e-06,0,1e-06,1e-06,0,0,0,0,-1e-06,-1e-06,0,0,0,0,0,0,0,0,1e-06,0,-1e-06,0,0,0,0,0,0,0,0,1e-06,0,0,0,0,0,0,0,0,0,0,0,0,0,0,0,1e-06,0,0,1e-06,0,0,-1e-06,-1e-06,0
0,0,1e-06,0,0,0,0,0,0,0,0,-1e-06,0,0,0,0,0,0,0,0,0,1e-06,0,0,0,0,0,0,1e-06,0,0,0,0,0,1e-06,0,-1e-06,1e-06,0,0,0,0,0,0,0,0,0,0,1e-06,0,0,0,-1e-06,0,0,-6e-06,0,0,0,0,0,1e-06,0,0,0,0,0,0,0,0,1e-06,0,-1e-06,0,0,1e-06,1e-06,0,0,0,0,-1e-06,0,0,0,0,0,0,0,0,0,0,0,0,0,0,1e-06,0,0,0,0,0,0,0,-1e-06,0,0,0,0,0,0,0,0,0,0,0,0,0,0,-1e-06,-1e-06
0,0,-1e-06,0,0,0,0,0,0,0,0,0,0,0,0,0,0,0,0,0,0,0,0,-1e-06,0,0,0,0,0,1e-06,0,0,0,0,-1e-06,0,0,-1e-06,0,0,0,0,0,0,0,0,-1e-06,0,-1e-06,0,0,0,0,0,0,4e-06,0,0,0,0,0,0,0,0,0,0,0,-1e-06,0,0,0,0,0,0,0,-1e-06,-1e-06,0,0,0,0,0,0,0,0,0,0,-1e-06,0,0,0,0,0,0,0,-1e-06,-1e-06,0,0,0,0,0,0,0,1e-06,0,-1e-06,0,0,-1e-06,0,0,-1e-06,0,0,0,0,0,0,1e-06,0
0,0,0,0,-1e-06,0,0,-1e-06,0,0,0,1e-06,0,0,0,0,0,0,0,0,0,-1e-06,0,0,0,0,0,0,0,0,0,0,0,0,0,0,0,0,0,0,0,0,0,0,0,0,1e-06,0,1e-06,0,0,0,0,0,0,-3e-06,0,0,0,0,0,0,0,0,0,0,0,0,0,0,0,0,-1e-06,0,-1e-06,1e-06,0,0,0,0,0,0,0,0,0,0,0,0,0,0,0,0,0,0,1e-06,0,-1e-06,0,0,0,0,0,0,0,0,0,0,0,0,0,0,-1e-06,0,0,0,0,0,0,-1e-06,0,-1e-06
