3.6e-05,1.1e-05,1.8e-05,7e-06,1e-06,4e-06,1.2e-05,2e-06,2.4e-05,2.5e-05,1.6e-05,5e-06,3e-06,1.3e-05,0,5e-06,1.8e-05,1e-05,3.1e-05,2.3e-05,6e-06,1.6e-05,8e-06,6e-06,1.3e-05,4e-06,1.6e-05,2.7e-05,1e-06,8e-06,9e-06,1.1e-05,9e-06,2.4e-05,1e-05,6e-06,4e-06,0,7e-06,2e-05,3e-06,9e-06,1.2e-05,4e-06,7e-06,1.1e-05,1.3e-05,2e-06,1e-06,1e-06,8e-06,1e-06,3e-06,1.9e-05,8e-06,9e-06,5e-06,6e-06,3e-06,3e-06,4e-06,1.1e-05,1.8e-05,4e-06,1.6e-05,4e-06,5e-06,2.7e-05,1.9e-05,1.3e-05,1e-05,5e-06,1.7e-05,1.5e-05,1e-06,1.2e-05,9e-06,1.5e-05,3e-06,1e-06,1.2e-05,1.3e-05,1e-05,1.1e-05,1.1e-05,1.1e-05,4e-06,1e-06,7e-06,1.2e-05,5e-06,2.3e-05,4e-06,4e-06,7e-06,2e-05,1.2e-05,4e-06,1e-06,1e-06,4e-06,1e-06,6e-06,1.6e-05,5e-06,3e-06,1.4e-05,6e-06,2e-06,1e-05,1.3e-05,2e-06,9e-06,6e-06,4e-06,4e-06,2.6e-05,1.2e-05,4e-06,1.2e-05,6e-06
6.2e-05,4e-05,2.5e-05,1.3e-05,1.2e-05,9e-06,3.3e-05,1.7e-05,6.6e-05,2.5e-05,3.7e-05,1.9e-05,2.5e-05,2.6e-05,2.3e-05,1.2e-05,6.3e-05,2e-05,6.7e-05,3.9e-05,2.7e-05,1.5e-05,2.6e-05,3.6e-05,3.5e-05,1.2e-05,3e-05,4.1e-05,1.9e-05,3.1e-05,2.4e-05,1.3e-05,3.6e-05,3.6e-05,4e-05,1.4e-05,1e-05,9e-06,1.1e-05,3.7e-05,7e-06,2.1e-05,3.5e-05,2e-05,2.8e-05,8e-06,2.7e-05,1.4e-05,1.3e-05,8e-06,1.2e-05,2.1e-05,8e-06,2.1e-05,3.5e-05,1.1e-05,4e-06,2e-05,2e-05,4.7e-05,2.8e-05,2.4e-05,1.5e-05,2.3e-05,2.8e-05,3.1e-05,1.4e-05,4.7e-05,3.5e-05,2.3e-05,4.3e-05,2e-05,3.3e-05,1.7e-05,4e-06,5e-05,2.8e-05,3.6e-05,2e-05,1.1e-05,1.8e-05,4.7e-05,7e-06,1.1e-05,2.4e-05,1.9e-05,3.9e-05,5e-05,3.3e-05,3.6e-05,1.6e-05,3.6e-05,2.6e-05,4.1e-05,2.4e-05,1.1e-05,1.3e-05,1.8e-05,3.5e-05,3.8e-05,9e-06,7e-06,1.9e-05,2.3e-05,3.3e-05,2.9e-05,1.2e-05,2e-05,3.2e-05,2.4e-05,2.6e-05,9e-06,1.3e-05,1.8e-05,2.3e-05,1e-05,4.7e-05,3.5e-05,2.3e-05,4.7e-05,3.2e-05
6.6e-05,2.8e-05,7.7e-05,3.7e-05,1.5e-05,2.2e-05,1.6e-05,1.7e-05,7.1e-05,8.2e-05,3.2e-05,2.3e-05,3.2e-05,4.8e-05,7.5e-05,6.4e-05,9.4e-05,1.5e-05,8.9e-05,2e-05,3.8e-05,2.6e-05,6.2e-05,2.8e-05,5.2e-05,1.9e-05,3.1e-05,7.5e-05,2.5e-05,6.1e-05,5.8e-05,3.1e-05,3.9e-05,5.3e-05,4e-05,3.4e-05,4.3e-05,3.6e-05,3.1e-05,6.1e-05,1.1e-05,1.6e-05,4.5e-05,2.7e-05,2.2e-05,1.3e-05,2.5e-05,1.5e-05,1.9e-05,1e-05,2.2e-05,3.1e-05,2.3e-05,3.8e-05,4.1e-05,7e-06,4.1e-05,4.5e-05,1.7e-05,5e-05,1.1e-05,3.8e-05,2.4e-05,1.7e-05,5.5e-05,2.9e-05,2.6e-05,5.5e-05,5.5e-05,1.6e-05,3.4e-05,9e-06,1.8e-05,3.7e-05,1.3e-05,6.2e-05,1.2e-05,5.8e-05,4e-05,5.1e-05,2.5e-05,4e-05,4.3e-05,1.5e-05,1.2e-05,1.6e-05,1.7e-05,5.5e-05,2.8e-05,3.1e-05,2.7e-05,3.4e-05,3.8e-05,4.2e-05,1.4e-05,5.5e-05,1.4e-05,2.5e-05,3.7e-05,7e-06,1.2e-05,2.5e-05,7e-06,1.6e-05,5e-05,3.5e-05,4.9e-05,9e-06,3.9e-05,2.3e-05,3e-05,3.8e-05,3.2e-05,2.6e-05,2.4e-05,7e-06,4.6e-05,4.7e-05,3.1e-05,1e-04,5.6e-05
3.6e-05,9e-05,9.3e-05,3.1e-05,5.7e-05,8.2e-05,3.2e-05,5.7e-05,1.1e-05,3.9e-05,0.000101,9.1e-05,5.2e-05,7.5e-05,7.1e-05,5.5e-05,0.00014,7.2e-05,0.000109,8.1e-05,6.7e-05,8.8e-05,5.8e-05,6.1e-05,9.1e-05,5.4e-05,8.5e-05,1.7e-05,2.1e-05,5.7e-05,7.9e-05,1.8e-05,6.5e-05,7e-05,3.8e-05,5.1e-05,5.7e-05,7.7e-05,7.1e-05,0.000111,9e-05,1.3e-05,4.2e-05,4.7e-05,3.8e-05,1.5e-05,5.9e-05,5.5e-05,4.2e-05,1.6e-05,5.4e-05,3e-05,4.2e-05,7.2e-05,6.1e-05,6e-05,3.6e-05,9.6e-05,5.2e-05,3.4e-05,6e-06,5.6e-05,5e-05,2.4e-05,7.7e-05,3.5e-05,1.9e-05,1.2e-05,1.4e-05,4.8e-05,1.4e-05,2.8e-05,1.6e-05,4e-06,3.1e-05,1.8e-05,3.5e-05,5.1e-05,5.8e-05,2.2e-05,5e-05,2.2e-05,3.1e-05,3.9e-05,3.5e-05,1.9e-05,1.8e-05,8.1e-05,6.4e-05,2.6e-05,9e-06,7.1e-05,4.9e-05,3.1e-05,2.6e-05,5.8e-05,6.4e-05,3.5e-05,6.3e-05,6.9e-05,5.2e-05,5.2e-05,4.4e-05,4.2e-05,3.2e-05,5.5e-05,2e-05,1e-05,4.6e-05,5.5e-05,4.4e-05,4.9e-05,4.6e-05,1.1e-05,1.3e-05,4.7e-05,8.2e-05,5e-05,1.3e-05,9.4e-05,1.9e-05
5e-05,0.000123,8.6e-05,1.5e-05,0.000107,9e-06,6.9e-05,1.4e-05,2.1e-05,6.9e-05,2.9e-05,5.8e-05,5.9e-05,5e-05,6.8e-05,4.2e-05,6.2e-05,2.1e-05,9.1e-05,1.1e-05,5.7e-05,7.9e-05,9e-05,4e-05,2.2e-05,6.3e-05,6.1e-05,9.4e-05,2.3e-05,4.7e-05,5.4e-05,6.6e-05,6.7e-05,3.1e-05,2.5e-05,7.6e-05,2.5e-05,7.8e-05,4.8e-05,9.9e-05,7.3e-05,0.000102,7.1e-05,7.1e-05,5.6e-05,8.8e-05,6.3e-05,9.3e-05,3.3e-05,4.2e-05,0.000102,2.2e-05,6.7e-05,2.8e-05,5.8e-05,6.7e-05,6.9e-05,7.7e-05,4.3e-05,2.9e-05,2.1e-05,7.3e-05,4.2e-05,2.4e-05,4.9e-05,5.2e-05,3.9e-05,5.9e-05,6.9e-05,1.2e-05,2.1e-05,2.3e-05,5.9e-05,4.5e-05,4.2e-05,9.4e-05,4.7e-05,2.6e-05,3.1e-05,6.7e-05,5.1e-05,6.3e-05,3.5e-05,1.8e-05,7.5e-05,4.6e-05,5.3e-05,0.000104,2.5e-05,3.2e-05,2.4e-05,5.4e-05,5.6e-05,5.7e-05,3.6e-05,3e-05,3.2e-05,5.5e-05,9e-05,4.3e-05,5.5e-05,1.9e-05,3.9e-05,5.2e-05,2.2e-05,6.3e-05,1.9e-05,4.7e-05,3.8e-05,2.4e-05,2e-05,3.3e-05,6.3e-05,4.1e-05,4.2e-05,4.8e-05,4.9e-05,4.5e-05,6e-05,3.9e-05,2.6e-05
0.000163,0.000141,0.000188,0.00012,0.000111,0.000145,4.7e-05,4.6e-05,8.4e-05,0.000136,6.4e-05,7.9e-05,9.7e-05,0.000101,0.000118,4.2e-05,3.1e-05,9.3e-05,7.6e-05,0.000136,1.7e-05,1e-04,4.2e-05,5e-05,0.000112,0.000105,7.3e-05,0.000121,0.00012,3e-05,7.3e-05,7.9e-05,1.1e-05,7.4e-05,5.5e-05,3.3e-05,0.000137,6.9e-05,0.000121,7.2e-05,1.5e-05,6.3e-05,5.5e-05,2.9e-05,0.000106,0.000208,0.00013,7.3e-05,0.000125,3.8e-05,7.2e-05,0.000107,6.9e-05,4e-05,6.5e-05,6.5e-05,0.000114,8e-05,6.3e-05,6.8e-05,7e-05,0.000133,0.000103,2.6e-05,9.3e-05,0.000171,0.000154,0.000115,0.000144,9e-06,7e-05,2.7e-05,0.000128,7.2e-05,5e-05,0.000114,7.5e-05,6.2e-05,3.6e-05,7.9e-05,5.8e-05,4.3e-05,3e-05,3.7e-05,4e-05,3.6e-05,6.6e-05,5.7e-05,0.000119,1.2e-05,4.8e-05,7.2e-05,6.3e-05,4.8e-05,3.1e-05,9.5e-05,6e-05,6.1e-05,6.8e-05,9.4e-05,4.9e-05,6.2e-05,0.000128,2.9e-05,4.1e-05,3.8e-05,9.8e-05,4.9e-05,4.5e-05,2.8e-05,1.4e-05,5.3e-05,7.1e-05,0.000113,2.9e-05,7.2e-05,0.000162,5e-06,6.6e-05,7.3e-05,6.5e-05
0.000179,6.2e-05,0.000133,4.1e-05,0.000202,0.000114,0.000229,0.000153,0.000193,2.9e-05,9.8e-05,5.9e-05,0.000203,0.000104,8.2e-05,5.7e-05,7.6e-05,0.000156,8e-05,0.000222,0.000264,0.000173,0.000151,8.7e-05,0.000149,0.00029,5e-05,0.000149,0.000264,0.000228,4.9e-05,3.9e-05,9.3e-05,8.9e-05,3.2e-05,5.4e-05,0.000185,0.000192,0.00014,0.000149,0.000102,6.3e-05,0.000145,7.6e-05,0.000172,9.2e-05,0.000138,0.000188,6.3e-05,4.6e-05,7.5e-05,0.000131,0.000146,0.000179,9.4e-05,0.000159,0.000167,0.000177,0.000124,0.000145,7.4e-05,0.000147,0.00015,0.000136,0.00016,0.000247,9.7e-05,0.000133,7.8e-05,0.000207,2.1e-05,0.00015,0.000254,0.000236,0.000179,9.3e-05,0.000184,0.000103,0.000169,0.000103,8.9e-05,1e-06,1e-04,0.000142,8.5e-05,4.4e-05,3.4e-05,0.000124,0.000168,0.000193,2.9e-05,0.000105,0.000136,4.8e-05,6.9e-05,0.000195,0.000101,0.000117,0.000134,3.3e-05,2.7e-05,5.5e-05,0.00012,7.2e-05,4.8e-05,6.3e-05,0.000149,0.000121,0.000124,6.6e-05,5.6e-05,7.1e-05,0.000121,6.6e-05,6.5e-05,9.9e-05,0.000168,0.000268,0.000226,0.000157,9e-05
0.000308,4.4e-05,9.9e-05,0.000207,0.00034,0.000227,0.000346,0.000101,0.000199,0.000261,0.000281,0.000124,0.000163,8.8e-05,0.000129,6.8e-05,0.000157,9.5e-05,0.000216,0.000355,4.3e-05,9.5e-05,0.000153,7.7e-05,0.000196,0.00039,0.000327,0.000339,0.000344,0.000268,0.00022,0.000221,0.000193,9e-05,1.3e-05,0.000125,9.5e-05,5.4e-05,0.000207,0.000111,2.4e-05,0.000146,7.8e-05,0.000211,0.000101,0.000212,0.000173,5.1e-05,0.000187,0.000135,4.1e-05,5.3e-05,7.9e-05,0.000215,0.000207,2e-04,0.000215,0.000299,0.000115,0.000139,0.00011,0.000149,9.1e-05,0.000124,0.000199,4.2e-05,1.3e-05,0.000161,0.000181,0.000321,0.000265,0.000266,0.000142,6.3e-05,0.000135,0.000167,0.000108,0.000102,0.000208,8.1e-05,0.000113,0.000124,0.000122,0.000111,0.000246,0.000222,0.000148,0.000127,6.3e-05,9.4e-05,0.00021,0.000262,6.5e-05,0.000101,8.2e-05,0.000231,0.000155,9.8e-05,0.000139,0.000116,5.4e-05,9.3e-05,0.000201,0.000141,9.2e-05,0.000121,0.000116,0.000195,8.1e-05,3.9e-05,9.7e-05,0.000168,0.000172,0.000144,6.5e-05,0.000124,0.000215,0.000397,0.000206,4.5e-05,0.000105
0.000122,0.000298,0.00021,0.000127,0.000127,0.000143,0.000168,0.000338,0.000328,0.000286,4.7e-05,0.000185,0.000224,0.000203,0.000122,7.3e-05,0.000125,0.00016,0.000204,0.000105,0.000254,0.000211,3.4e-05,7.9e-05,0.00013,0.000201,0.000107,0.000195,8e-05,0.000196,0.000119,0.000123,7.6e-05,7e-06,7.3e-05,0.000163,0.000178,8.6e-05,0.000147,0.000158,0.000109,0.000179,0.000243,0.00028,0.000195,0.000152,8.2e-05,0.000121,9.9e-05,7.9e-05,9.7e-05,5.7e-05,6.4e-05,0.00013,0.000196,7.6e-05,9.7e-05,0.000322,0.000228,4.4e-05,0.000185,0.000227,0.000314,0.00015,0.000182,0.000106,2.8e-05,0.000123,0.000187,0.000243,9.6e-05,0.000119,0.00012,3.6e-05,0.000131,5.8e-05,0.000103,2.5e-05,0.000144,0.000191,0.000265,0.000197,0.00025,0.000175,0.000218,0.000157,9.6e-05,6.7e-05,3.3e-05,0.000101,0.000281,0.000124,0.00012,0.000108,0.000128,8e-05,0.000127,0.000106,0.000116,8e-06,6.9e-05,4.6e-05,9.1e-05,8.8e-05,0.00011,0.000171,0.000205,0.000232,0.00015,0.000108,9e-05,6e-05,5.3e-05,5e-05,5.1e-05,0.000158,0.000259,0.000123,6.7e-05,2.9e-05,9.8e-05
0.000235,0.000287,0.000257,0.000286,0.000266,0.000112,0.000106,0.000192,0.000305,0.000171,0.000198,0.000275,8.7e-05,0.000154,0.000221,0.000235,0.000102,0.000191,6.2e-05,1.6e-05,0.000157,6.9e-05,9.5e-05,0.000101,6.5e-05,0.000125,7.7e-05,0.000167,0.000148,0.000126,0.000149,0.000123,6e-05,2.1e-05,9.9e-05,0.000122,5.4e-05,4.2e-05,1.7e-05,0.000119,0.000143,0.000139,9.9e-05,8.7e-05,3.3e-05,3e-05,6.5e-05,8e-05,0.000101,7.9e-05,3.7e-05,7.9e-05,8e-05,0.000145,7.8e-05,0.000124,0.000242,2e-04,0.000114,0.000124,9.1e-05,3.5e-05,0.000204,0.000106,9.2e-05,6.3e-05,0.000128,0.000176,3.7e-05,0.000119,8.9e-05,4e-05,0.000102,4.8e-05,7.3e-05,1.7e-05,7.9e-05,3.8e-05,8.3e-05,5.5e-05,0.000132,4.4e-05,0.00012,5.2e-05,3.6e-05,6.4e-05,8.3e-05,0.000109,0.000116,5e-05,0.000177,0.000161,0.000103,0.000108,8.8e-05,0.000122,0.000114,9.9e-05,5.7e-05,6.7e-05,8.4e-05,3.9e-05,3.3e-05,3.8e-05,9.3e-05,0.000102,0.000168,4.6e-05,4e-05,7.4e-05,0.000123,5.2e-05,6.2e-05,0.000126,0.000134,5.4e-05,2.8e-05,0.000135,9.4e-05,3.3e-05,7.8e-05
0.000138,5.2e-05,0.00011,4.3e-05,3.9e-05,5.9e-05,9e-05,0.000166,2.8e-05,9.6e-05,0.000202,5.6e-05,5.1e-05,0.000121,0.000133,5.3e-05,1.8e-05,0.000106,0.00014,0.000103,5.1e-05,8.5e-05,7.6e-05,1.6e-05,5.7e-05,8e-05,8.2e-05,0.000174,0.000104,9.6e-05,3.9e-05,7.9e-05,3.1e-05,5.2e-05,7e-05,8e-06,7e-06,5.3e-05,9.1e-05,2.6e-05,4.8e-05,8.1e-05,0.000111,2.3e-05,2.4e-05,3.2e-05,2e-05,6.5e-05,8e-05,6e-06,1.8e-05,6.8e-05,4.6e-05,3e-05,7.5e-05,8.1e-05,0.000124,8.7e-05,4.4e-05,2.8e-05,0.000126,0.000129,8e-05,4.5e-05,5.4e-05,1.8e-05,8.2e-05,0.000104,0.000103,6e-05,8.1e-05,5.8e-05,4.3e-05,4.9e-05,2.1e-05,4.9e-05,3.7e-05,5e-05,2.8e-05,9.8e-05,1.9e-05,4.2e-05,3e-05,9.2e-05,6.4e-05,2.3e-05,2.6e-05,2.6e-05,6.6e-05,8e-05,7.6e-05,6.1e-05,4.3e-05,5e-05,7.2e-05,5.9e-05,5e-05,2.2e-05,4.9e-05,4.9e-05,1.3e-05,1.7e-05,4.7e-05,2.8e-05,3.6e-05,8.3e-05,2.2e-05,5.4e-05,5.9e-05,3.4e-05,4.2e-05,3.8e-05,7.2e-05,4.5e-05,6.5e-05,9.6e-05,8.6e-05,9.1e-05,7.8e-05,7.6e-05,4.6e-05
4.1e-05,4.6e-05,6.5e-05,3.5e-05,3e-05,0.000101,4.1e-05,6.8e-05,2.7e-05,4e-05,0.000101,3.6e-05,1.2e-05,4.1e-05,6.3e-05,2.2e-05,1.6e-05,5.8e-05,5.1e-05,1.1e-05,7e-06,4.2e-05,4e-06,1.3e-05,5.2e-05,4.4e-05,3.5e-05,7e-05,3e-05,2.9e-05,1.3e-05,3e-05,1.7e-05,5.3e-05,2.4e-05,1.1e-05,6e-06,4.3e-05,5.2e-05,2.5e-05,1.2e-05,3.1e-05,5.5e-05,1.9e-05,2.9e-05,4e-06,2.2e-05,1.6e-05,3.5e-05,2.6e-05,9e-06,5.2e-05,3e-06,8e-06,4.5e-05,6.6e-05,5.8e-05,4e-05,1.1e-05,6e-06,6.3e-05,2.6e-05,4.4e-05,3.3e-05,1e-05,1.8e-05,5.1e-05,3.1e-05,6.3e-05,4.4e-05,2.6e-05,3.6e-05,3.2e-05,3.5e-05,1.8e-05,2.8e-05,1.4e-05,3.9e-05,2.7e-05,5e-05,2.2e-05,4.1e-05,1e-05,6e-05,3.7e-05,1.8e-05,1.9e-05,4e-06,2.7e-05,6e-05,3.7e-05,4e-06,2.9e-05,3.3e-05,3.2e-05,2.3e-05,1.5e-05,1e-05,2.9e-05,9e-06,1.2e-05,1.3e-05,3.3e-05,2.6e-05,1.6e-05,3.3e-05,3.4e-05,1.9e-05,1.2e-05,1.3e-05,1.4e-05,1.3e-05,2.1e-05,3.4e-05,3.1e-05,1.6e-05,4.3e-05,2.4e-05,2.3e-05,4.2e-05,2.3e-05
2.4e-05,1.5e-05,6.7e-05,1.5e-05,2.5e-05,5.9e-05,1.1e-05,5.2e-05,4.7e-05,2.2e-05,7.1e-05,2.8e-05,6e-06,5.4e-05,2.8e-05,1.4e-05,1.8e-05,3.9e-05,5.7e-05,1.1e-05,3e-05,5e-06,3.4e-05,5e-05,3.7e-05,5.6e-05,4.8e-05,6e-05,4.6e-05,3.1e-05,3.6e-05,3.9e-05,1.8e-05,5e-05,2.4e-05,1.1e-05,4.1e-05,3.5e-05,6.8e-05,3e-06,2.9e-05,2.4e-05,7.1e-05,4.4e-05,1.4e-05,2.8e-05,1.5e-05,2.6e-05,2.3e-05,6e-06,2.4e-05,2.3e-05,2e-05,1.9e-05,2.3e-05,4.3e-05,4.2e-05,2.3e-05,1.1e-05,2.3e-05,2.3e-05,7e-06,3.4e-05,1.1e-05,2.1e-05,2.1e-05,5e-05,1.3e-05,4.4e-05,2.1e-05,1.3e-05,3.2e-05,1.3e-05,2.3e-05,2e-05,6.7e-05,3.3e-05,1.3e-05,3e-05,2.1e-05,4.7e-05,6e-06,1e-05,5e-05,4.5e-05,2.3e-05,2.3e-05,1.9e-05,9e-06,5.9e-05,5e-06,1.9e-05,1.9e-05,8e-06,7e-06,2.2e-05,2.5e-05,2.3e-05,3.7e-05,2.9e-05,2.1e-05,2.5e-05,2.5e-05,9e-06,1.9e-05,1e-06,2.2e-05,3.2e-05,2e-05,1e-06,2.5e-05,2.4e-05,3.1e-05,4.3e-05,2.3e-05,3.4e-05,4.6e-05,1.5e-05,1.9e-05,2.9e-05,2.2e-05
6.8e-05,3.1e-05,0.000108,6.2e-05,4.4e-05,9.7e-05,3e-06,8.3e-05,7.5e-05,7.4e-05,4.5e-05,5.2e-05,5e-06,8.2e-05,7.4e-05,2.9e-05,3.7e-05,2.2e-05,3.4e-05,5.4e-05,6.5e-05,7.4e-05,5.4e-05,3.9e-05,8e-05,1.4e-05,3.5e-05,6.6e-05,3.5e-05,7e-06,5.4e-05,2.3e-05,3.1e-05,4e-05,7e-05,6e-06,7.3e-05,1.6e-05,9e-05,4.8e-05,2.2e-05,2.9e-05,5.2e-05,8.8e-05,3.2e-05,6.3e-05,4.2e-05,6.9e-05,4.8e-05,3.6e-05,3.6e-05,7e-05,3.1e-05,7.7e-05,4.9e-05,5.3e-05,5.2e-05,4.7e-05,2.8e-05,2.9e-05,7.1e-05,1.7e-05,5.2e-05,3.5e-05,2.8e-05,3.3e-05,3.4e-05,6.4e-05,5.7e-05,5.2e-05,2.9e-05,1.2e-05,4e-05,3.7e-05,3.4e-05,5.1e-05,5e-05,5.3e-05,3e-05,8.5e-05,8.2e-05,4.9e-05,1.6e-05,5.3e-05,2.2e-05,6e-06,1.6e-05,5.3e-05,5.3e-05,6e-05,8e-05,3.7e-05,1.7e-05,3.3e-05,6.3e-05,4e-05,3e-05,2.6e-05,4.5e-05,2.2e-05,3.3e-05,7e-06,1.1e-05,2e-06,3.6e-05,6e-05,3e-05,3.6e-05,4e-05,1.8e-05,2e-05,2.5e-05,3.8e-05,2.7e-05,1.6e-05,1.7e-05,6.2e-05,3.5e-05,3.2e-05,1.2e-05,2.6e-05
0.000134,7.8e-05,5.9e-05,5.8e-05,9.9e-05,4.6e-05,5.2e-05,6.2e-05,0.000101,8.1e-05,6.3e-05,4.2e-05,6.7e-05,9.5e-05,3e-05,4e-05,6.6e-05,6.9e-05,1.7e-05,4.7e-05,2e-05,1e-04,0.000119,2.9e-05,3.5e-05,6.6e-05,1.1e-05,7.8e-05,7.8e-05,5.1e-05,4.9e-05,2.4e-05,5.6e-05,5.1e-05,8.1e-05,6.4e-05,9.4e-05,0.000102,6.6e-05,1.4e-05,4.8e-05,8.7e-05,8.3e-05,0.00015,0.000151,1.9e-05,3.2e-05,5.6e-05,9e-06,3.5e-05,6.6e-05,3.6e-05,5.4e-05,8.7e-05,0.000105,7.5e-05,5.5e-05,7.3e-05,3.4e-05,4.8e-05,7.8e-05,9.3e-05,5.7e-05,2.9e-05,3.2e-05,6e-06,8e-06,9.9e-05,9e-06,6.5e-05,3.5e-05,3.1e-05,5e-05,0.000104,9.5e-05,6.5e-05,5.1e-05,6.9e-05,9.4e-05,0.000147,1.2e-05,5.3e-05,4.9e-05,4.9e-05,6.5e-05,3.9e-05,2.1e-05,2e-05,2.7e-05,3e-05,8.3e-05,5.7e-05,7.7e-05,1.6e-05,6.6e-05,1.9e-05,3.6e-05,2.7e-05,1.8e-05,2e-06,7.4e-05,4.9e-05,2.7e-05,1.5e-05,6.5e-05,2.2e-05,5.4e-05,5.4e-05,5.8e-05,5.1e-05,4.7e-05,6e-05,5.8e-05,6.6e-05,8.4e-05,5.2e-05,7.6e-05,7.9e-05,6.3e-05,1.7e-05,1.1e-05
3e-05,6.4e-05,7.9e-05,5.9e-05,0.000105,0.000105,1.5e-05,7.8e-05,3e-06,3.1e-05,4.3e-05,6.2e-05,0.000118,1.1e-05,2.1e-05,4.9e-05,6.2e-05,3.3e-05,3.4e-05,5.9e-05,6.2e-05,8.2e-05,8.5e-05,0.000118,8.5e-05,5.7e-05,5e-05,6.9e-05,5.9e-05,3.4e-05,2.5e-05,5.9e-05,4.7e-05,8.2e-05,3.2e-05,3.1e-05,2.6e-05,5.2e-05,0.000128,0.000145,0.000117,5.5e-05,2.8e-05,6.4e-05,4.3e-05,9.6e-05,7.7e-05,5.6e-05,3e-05,4.9e-05,1.3e-05,4.7e-05,3.1e-05,9.9e-05,3.6e-05,3.7e-05,6.4e-05,2.3e-05,3e-05,4.1e-05,0.00011,1e-05,5e-06,1.7e-05,2.6e-05,3.5e-05,3.5e-05,9e-05,0.000117,6.7e-05,6.3e-05,2.1e-05,5.2e-05,8.2e-05,2.1e-05,5.3e-05,3.8e-05,5.2e-05,6.1e-05,9.2e-05,9.1e-05,3.4e-05,3.2e-05,3.8e-05,2.7e-05,7e-05,4.1e-05,3.7e-05,5.9e-05,3.9e-05,9.6e-05,3.4e-05,7.9e-05,9.1e-05,3.6e-05,1.4e-05,5.4e-05,3.8e-05,4.9e-05,1.8e-05,8.1e-05,2.6e-05,3e-05,3.2e-05,8.7e-05,4.7e-05,3.3e-05,4.5e-05,4.1e-05,2.6e-05,2.7e-05,2.8e-05,2.3e-05,4.4e-05,6.9e-05,4.6e-05,2.8e-05,6.1e-05,2.7e-05,2.1e-05,3.4e-05
7.5e-05,9.2e-05,0.000119,0.000111,4.1e-05,3.5e-05,0.000122,0.000105,0.000113,4.5e-05,6.6e-05,0.000125,0.000109,0.000108,6.2e-05,7.7e-05,7.3e-05,0.000146,0.000137,3.5e-05,3.4e-05,6.3e-05,7.3e-05,0.00012,2.8e-05,2.9e-05,5.2e-05,6.4e-05,7.1e-05,3.1e-05,2.2e-05,6.8e-05,8.6e-05,9.7e-05,3.3e-05,8.1e-05,8.3e-05,3.1e-05,4.6e-05,9.1e-05,3.2e-05,7.9e-05,6.9e-05,1.8e-05,4.8e-05,4.8e-05,9.9e-05,0.000127,8.1e-05,4.8e-05,2.8e-05,2.6e-05,2.7e-05,4.6e-05,6.1e-05,1.8e-05,4e-05,4.1e-05,4.2e-05,4.4e-05,4.3e-05,7.8e-05,3e-05,3.9e-05,6e-05,6.2e-05,0.000118,5.1e-05,4.9e-05,2.9e-05,3.7e-05,1.7e-05,6.3e-05,0.000124,8.7e-05,8.9e-05,6.8e-05,8.4e-05,6.9e-05,0.000108,0.000115,8.8e-05,6.6e-05,5.6e-05,1.5e-05,2.9e-05,2.7e-05,5.9e-05,9.4e-05,0.000122,0.000139,9.2e-05,2.6e-05,5.8e-05,5.9e-05,8.8e-05,1.1e-05,8.5e-05,8.7e-05,7.1e-05,2.3e-05,8.3e-05,0.000109,8.9e-05,3.5e-05,4.9e-05,3.5e-05,5.6e-05,4.3e-05,4.4e-05,2.7e-05,3.2e-05,2.8e-05,3.7e-05,6.6e-05,6e-05,8e-05,6.6e-05,9.4e-05,6.4e-05,5.7e-05
8.3e-05,0.000116,2.2e-05,7.7e-05,6.5e-05,5.1e-05,9.6e-05,6.8e-05,5.9e-05,6.9e-05,2.3e-05,6.8e-05,6e-05,1.5e-05,6.5e-05,7e-05,1.4e-05,0.000138,8.5e-05,3.1e-05,2.1e-05,8e-06,3.2e-05,8.7e-05,5e-05,4.5e-05,9e-05,3.7e-05,4.4e-05,1.2e-05,2.6e-05,8.5e-05,8e-06,3.4e-05,6.8e-05,0.000106,8.8e-05,5.1e-05,2.7e-05,5.1e-05,5.5e-05,1.7e-05,8.9e-05,3.4e-05,7e-06,3.1e-05,5.1e-05,4.6e-05,3.1e-05,2.9e-05,4.2e-05,3.7e-05,1.2e-05,3.7e-05,6.7e-05,8e-05,4.7e-05,4.4e-05,1.4e-05,2.9e-05,3.4e-05,7e-06,3.9e-05,6.1e-05,6e-06,8.2e-05,0.00011,7.1e-05,3.2e-05,6.6e-05,3.4e-05,4.3e-05,9.1e-05,4.1e-05,3.8e-05,5.8e-05,2.6e-05,3.6e-05,5.3e-05,1.8e-05,3.3e-05,4.6e-05,4.2e-05,6.4e-05,4.5e-05,3.1e-05,2.7e-05,7.1e-05,4e-06,7.3e-05,7.6e-05,4e-05,5.6e-05,3.7e-05,2.9e-05,6e-05,3.2e-05,8.9e-05,6.4e-05,7e-05,5.5e-05,6e-05,0.00011,4.7e-05,4.5e-05,3e-05,5e-06,7.9e-05,4.3e-05,7.4e-05,3.3e-05,5.7e-05,6.6e-05,3.6e-05,6.9e-05,3e-05,5.9e-05,3.4e-05,4.6e-05,3.1e-05,3.7e-05
3e-05,3.1e-05,5.4e-05,5.4e-05,6.2e-05,5.1e-05,4.4e-05,4.8e-05,4.1e-05,6.8e-05,0.000112,9.5e-05,9.3e-05,6.2e-05,7.5e-05,9.6e-05,6.1e-05,5.5e-05,2.3e-05,5.4e-05,6e-05,3.2e-05,2.5e-05,0.000105,8.3e-05,4.3e-05,0.000123,0.000125,6.8e-05,4.9e-05,3.8e-05,4.6e-05,2.5e-05,6e-06,5.4e-05,2e-05,4e-05,3e-05,4.1e-05,4.3e-05,2.7e-05,5.5e-05,0.000115,8.6e-05,3.5e-05,1.5e-05,4.8e-05,2.9e-05,4.3e-05,4.9e-05,3.2e-05,1.7e-05,4.2e-05,5.1e-05,7.7e-05,9.3e-05,0.000152,9.3e-05,5.2e-05,5.2e-05,2.8e-05,8e-05,4e-05,3.3e-05,3.5e-05,8.4e-05,3.5e-05,2.6e-05,6.1e-05,4e-05,3.1e-05,7e-06,5.4e-05,4.6e-05,1.9e-05,8.5e-05,5e-05,2.1e-05,4.6e-05,3.5e-05,4.8e-05,1e-04,5.5e-05,4.3e-05,1.2e-05,4.7e-05,1.8e-05,2.8e-05,3.3e-05,4e-05,7.2e-05,3.4e-05,1.5e-05,3.4e-05,2.8e-05,7e-05,4.6e-05,5.3e-05,6.4e-05,6.9e-05,3.3e-05,5.6e-05,6.7e-05,3.5e-05,1.7e-05,4.2e-05,2.6e-05,7.1e-05,4.5e-05,4.8e-05,7.3e-05,4.3e-05,5e-06,2e-06,3.9e-05,3.2e-05,2.8e-05,4.1e-05,1.8e-05,5.2e-05,1.5e-05
4.4e-05,5.2e-05,8.6e-05,0.00011,7.6e-05,3.2e-05,8.3e-05,8.3e-05,9.3e-05,1.1e-05,6.7e-05,9.1e-05,2.8e-05,7.1e-05,8.3e-05,4.4e-05,7.6e-05,7.4e-05,3.6e-05,6.6e-05,5.6e-05,3.5e-05,4.6e-05,7.7e-05,5.7e-05,5e-05,0.000171,6.5e-05,2.3e-05,8.8e-05,5.4e-05,3.7e-05,1.7e-05,3.1e-05,4e-05,3.7e-05,2.8e-05,7.1e-05,2.1e-05,3.1e-05,3.7e-05,7.7e-05,5.5e-05,1.5e-05,1.5e-05,2.6e-05,5.7e-05,2.5e-05,2e-05,5e-05,2.6e-05,2.4e-05,2.2e-05,4.5e-05,6.6e-05,3e-05,7e-05,6.6e-05,6.1e-05,3.1e-05,9.8e-05,0.000114,7.6e-05,5.5e-05,2.9e-05,5e-05,3.5e-05,4.8e-05,3.5e-05,3.4e-05,2.5e-05,2.6e-05,2.1e-05,4.3e-05,2.9e-05,9e-05,8.6e-05,4.9e-05,6e-05,7.1e-05,5.1e-05,7.3e-05,7.1e-05,3.9e-05,2.4e-05,6.1e-05,5.1e-05,5.7e-05,3.6e-05,4.4e-05,0.000101,0.000102,7e-05,2.6e-05,1.9e-05,4.5e-05,5.6e-05,4.2e-05,5.3e-05,4.3e-05,1.9e-05,4.9e-05,5.1e-05,3.5e-05,4.6e-05,7.6e-05,9.4e-05,2.9e-05,4.4e-05,3e-05,3.1e-05,5.5e-05,3.7e-05,2e-05,1.1e-05,4e-05,4.1e-05,2.7e-05,2.3e-05,7.4e-05,5.2e-05
3.7e-05,6.1e-05,6.5e-05,9.3e-05,8.5e-05,4.7e-05,0.000108,5.1e-05,2.3e-05,4.3e-05,5.8e-05,7.7e-05,4.6e-05,6.1e-05,2.4e-05,2.5e-05,5.3e-05,6.4e-05,1.4e-05,5.2e-05,7.8e-05,7.1e-05,3.6e-05,4e-06,3.5e-05,5.2e-05,0.000138,5.2e-05,3.1e-05,7.2e-05,6.6e-05,7.3e-05,6e-05,1.1e-05,3e-05,6.7e-05,6e-05,3.4e-05,7.4e-05,6.2e-05,2.7e-05,3.9e-05,1.8e-05,3.3e-05,2.6e-05,4.4e-05,2.9e-05,3.6e-05,2.9e-05,4.4e-05,2.5e-05,2.1e-05,1.3e-05,4.4e-05,2.8e-05,4.7e-05,5.3e-05,4.1e-05,2.9e-05,6.4e-05,6.5e-05,1.7e-05,5.8e-05,3.3e-05,3e-05,2.9e-05,6.5e-05,4e-05,6.3e-05,2.3e-05,4.3e-05,1.8e-05,7e-06,2.4e-05,1.2e-05,6.6e-05,4.4e-05,1.3e-05,5.4e-05,1.7e-05,7.3e-05,6.4e-05,2.7e-05,1.4e-05,2.4e-05,3.3e-05,4e-05,5.1e-05,3.5e-05,6.4e-05,6.5e-05,1.5e-05,2.1e-05,4.1e-05,4.3e-05,3.4e-05,1.4e-05,7.6e-05,6.6e-05,5.8e-05,3.6e-05,7.8e-05,7.1e-05,3.8e-05,3.2e-05,2.5e-05,7.8e-05,5.4e-05,2.6e-05,2.3e-05,2.7e-05,1.8e-05,3.8e-05,6.1e-05,4.7e-05,4.6e-05,1.9e-05,3.7e-05,5.7e-05,9.8e-05,6.5e-05
6e-05,6.2e-05,2.9e-05,3.9e-05,2.8e-05,9.2e-05,3.4e-05,3.3e-05,3.6e-05,5.1e-05,0.00015,4.4e-05,6.2e-05,8.6e-05,6.4e-05,4.9e-05,4.4e-05,9e-05,5.6e-05,4.6e-05,9.4e-05,0.000116,0.000119,5.8e-05,3.3e-05,2.6e-05,0.000106,0.000103,7.7e-05,5.2e-05,0.000106,3.3e-05,2.8e-05,4.7e-05,3.4e-05,3.5e-05,4.3e-05,4.2e-05,3.9e-05,2.5e-05,6e-06,3.9e-05,5.2e-05,3.6e-05,1.4e-05,6.3e-05,4e-05,4.2e-05,5.8e-05,6.1e-05,6.5e-05,4.9e-05,1.1e-05,3.7e-05,1.2e-05,3.6e-05,2.3e-05,3.3e-05,5.3e-05,6.8e-05,7.3e-05,6.7e-05,2e-05,4.3e-05,2.6e-05,4.8e-05,4.6e-05,3.4e-05,4e-05,4e-05,4.6e-05,5.1e-05,3.7e-05,3.5e-05,3e-05,2.1e-05,1.4e-05,4.7e-05,2.3e-05,3.1e-05,5.9e-05,7.1e-05,4.1e-05,3.5e-05,3.2e-05,5.3e-05,7e-06,3.1e-05,1e-05,4.7e-05,1.6e-05,3.7e-05,1.6e-05,1.7e-05,3.5e-05,2.1e-05,1.1e-05,4.8e-05,2.7e-05,1.5e-05,1.6e-05,5.7e-05,2e-05,2.8e-05,1.5e-05,1.7e-05,8.2e-05,4.5e-05,6.5e-05,1.7e-05,2.1e-05,2.9e-05,2.8e-05,3.1e-05,2.2e-05,3.9e-05,2.9e-05,1.3e-05,4.4e-05,3e-05,1.3e-05
1e-05,1.6e-05,1e-05,1.1e-05,2.7e-05,5.9e-05,4e-05,9e-06,1.3e-05,1.2e-05,5.4e-05,2.7e-05,4.2e-05,1e-05,1.1e-05,1.3e-05,2.6e-05,2.1e-05,6e-06,3e-05,4e-06,4.1e-05,1.5e-05,2.1e-05,5e-06,1.5e-05,2.2e-05,2e-05,3e-06,1.9e-05,1.7e-05,2.7e-05,3.2e-05,1.8e-05,4e-06,1e-05,1.4e-05,8e-06,1.2e-05,1.2e-05,1.1e-05,3e-05,6e-06,9e-06,1.3e-05,3.8e-05,3.8e-05,1.6e-05,2.8e-05,1.2e-05,2.7e-05,2e-05,1.3e-05,2.5e-05,2e-05,2.1e-05,2.3e-05,9e-06,2.8e-05,8e-06,3.5e-05,1.3e-05,2e-05,2.5e-05,1.5e-05,2.3e-05,2.9e-05,6e-06,8e-06,1.6e-05,3.3e-05,4e-06,9e-06,1.8e-05,1.6e-05,1e-05,1e-05,1.2e-05,4e-06,6e-06,1.1e-05,1.1e-05,1e-05,2e-05,1.3e-05,2.3e-05,2.6e-05,1e-05,1.5e-05,2.4e-05,1.2e-05,3e-05,1.9e-05,1e-05,2.2e-05,1.8e-05,1.1e-05,1.8e-05,1.5e-05,5e-06,9e-06,1.2e-05,2.6e-05,2.3e-05,1.3e-05,2.7e-05,4e-05,3.1e-05,2.4e-05,1.4e-05,1.2e-05,1.4e-05,5e-06,2.6e-05,5e-06,5e-06,1.7e-05,7e-06,2.3e-05,2.4e-05,1e-06
7e-06,2.2e-05,9e-06,1.2e-05,1.7e-05,3.3e-05,1.5e-05,2.3e-05,3e-05,3.1e-05,3.1e-05,2.6e-05,3.6e-05,4.3e-05,3.2e-05,2e-05,2.4e-05,1.3e-05,6e-06,1.8e-05,2.8e-05,1.3e-05,3.2e-05,9e-06,1e-05,1.7e-05,2.8e-05,2e-05,1.3e-05,1e-05,1.2e-05,1.5e-05,3.3e-05,2.2e-05,1.1e-05,4e-06,1.6e-05,2.2e-05,7e-06,1e-06,4e-06,1.8e-05,9e-06,3e-06,7e-06,2.7e-05,7e-06,1.5e-05,1.9e-05,1.1e-05,1.2e-05,2.3e-05,2.3e-05,1e-05,1.1e-05,9e-06,3.3e-05,3e-05,2e-05,1.8e-05,3.6e-05,2.4e-05,1.4e-05,3e-06,1.2e-05,2.4e-05,3.3e-05,3.6e-05,2.1e-05,9e-06,1.7e-05,2.5e-05,1.2e-05,9e-06,1.3e-05,7e-06,1e-05,1.7e-05,5e-06,5e-06,1.3e-05,6e-06,1e-05,2.6e-05,1.8e-05,1.4e-05,1.9e-05,3.9e-05,2.2e-05,2.8e-05,1.2e-05,2.9e-05,1.3e-05,9e-06,1.4e-05,1.2e-05,9e-06,4e-06,4e-06,1.2e-05,1e-06,1.2e-05,3e-05,2.3e-05,1.5e-05,1.2e-05,1.5e-05,7e-06,2.5e-05,2.6e-05,2.3e-05,2.3e-05,1.6e-05,2.6e-05,2.8e-05,2.3e-05,1.9e-05,6e-06,1e-05,1.6e-05,1.7e-05
1.1e-05,1.4e-05,8e-06,3e-06,2e-05,1e-06,7e-06,1.4e-05,8e-06,3.2e-05,1.6e-05,1.6e-05,6e-06,2e-05,2.8e-05,3.2e-05,2e-05,2e-05,1e-05,5e-06,2.7e-05,1.5e-05,3e-05,1.9e-05,9e-06,9e-06,2e-05,3.9e-05,1.9e-05,9e-06,4e-06,1.5e-05,1.1e-05,6e-06,1.7e-05,1.4e-05,9e-06,1.5e-05,9e-06,1.1e-05,6e-06,1.1e-05,1e-05,5e-06,3e-06,2e-05,2.1e-05,1.8e-05,5e-06,1.3e-05,1.5e-05,1.1e-05,6e-06,1.4e-05,9e-06,3e-06,3.2e-05,2.4e-05,2.7e-05,1.9e-05,1.9e-05,5e-06,8e-06,1.1e-05,1e-05,1.7e-05,1.6e-05,2.1e-05,8e-06,1e-05,6e-06,1.2e-05,2e-06,9e-06,1.3e-05,7e-06,1.3e-05,9e-06,2e-06,4e-06,1.2e-05,9e-06,6e-06,1.3e-05,6e-06,1e-05,1.2e-05,1.8e-05,1e-06,2e-05,1.8e-05,1.2e-05,2.2e-05,1.5e-05,1.5e-05,1.4e-05,4e-06,3e-06,4e-06,2e-05,1.7e-05,8e-06,1.5e-05,1.1e-05,8e-06,6e-06,9e-06,1e-05,1.7e-05,3e-06,1.6e-05,2.1e-05,1e-05,2.3e-05,1.4e-05,1.9e-05,2.6e-05,1.3e-05,1.4e-05,8e-06,1.2e-05
1.3e-05,1.7e-05,1.2e-05,1e-05,1e-05,1e-05,8e-06,7e-06,1.3e-05,2.7e-05,8e-06,5e-06,4e-06,1.2e-05,1.7e-05,1.3e-05,7e-06,9e-06,4e-06,1e-05,2.7e-05,5e-06,1.8e-05,3e-06,2e-06,7e-06,1.1e-05,2.1e-05,8e-06,6e-06,5e-06,7e-06,7e-06,8e-06,9e-06,4e-06,4e-06,5e-06,5e-06,1e-05,3e-06,6e-06,1e-05,5e-06,8e-06,7e-06,5e-06,8e-06,6e-06,5e-06,1.2e-05,5e-06,4e-06,4e-06,9e-06,7e-06,2.2e-05,3e-06,1.1e-05,2e-06,8e-06,3e-06,0,6e-06,1.4e-05,1.2e-05,1e-05,8e-06,3e-06,3e-06,2e-06,2e-06,6e-06,1.6e-05,9e-06,1.1e-05,1.7e-05,1.4e-05,9e-06,2e-06,7e-06,3e-06,3e-06,2e-06,1.8e-05,1.3e-05,4e-06,4e-06,1.2e-05,7e-06,7e-06,8e-06,8e-06,7e-06,9e-06,3e-06,8e-06,8e-06,3e-06,1.5e-05,4e-06,8e-06,8e-06,1.3e-05,1.7e-05,1.6e-05,1.3e-05,1.1e-05,1.1e-05,1.2e-05,1.1e-05,4e-06,6e-06,6e-06,4e-06,1.2e-05,2e-06,5e-06,8e-06,5e-06,4e-06
3e-06,9e-06,1.2e-05,3e-06,8e-06,1.3e-05,1.2e-05,9e-06,3e-06,1.3e-05,1e-05,4e-06,4e-06,1.2e-05,9e-06,9e-06,1e-06,6e-06,4e-06,6e-06,1.8e-05,1.4e-05,1.2e-05,3e-06,4e-06,8e-06,1.2e-05,1.1e-05,6e-06,9e-06,7e-06,4e-06,2e-06,6e-06,3e-06,8e-06,6e-06,3e-06,2e-06,6e-06,3e-06,4e-06,5e-06,4e-06,4e-06,6e-06,4e-06,5e-06,6e-06,7e-06,3e-06,4e-06,3e-06,2e-06,6e-06,1e-06,1.8e-05,4e-06,5e-06,8e-06,1.1e-05,8e-06,1e-06,4e-06,9e-06,5e-06,7e-06,3e-06,1e-05,3e-06,4e-06,3e-06,5e-06,9e-06,6e-06,1.2e-05,2e-06,5e-06,3e-06,3e-06,5e-06,7e-06,7e-06,2e-06,7e-06,6e-06,5e-06,8e-06,1.3e-05,4e-06,8e-06,6e-06,4e-06,6e-06,6e-06,2e-06,8e-06,4e-06,5e-06,1e-05,8e-06,4e-06,2e-06,5e-06,9e-06,6e-06,3e-06,9e-06,4e-06,1e-05,4e-06,5e-06,3e-06,4e-06,5e-06,6e-06,7e-06,5e-06,5e-06,6e-06,4e-06
1.4e-05,9e-06,9e-06,6e-06,4e-06,5e-06,8e-06,1e-05,6e-06,7e-06,1.2e-05,1e-05,5e-06,1.1e-05,1e-05,6e-06,5e-06,2e-06,3e-06,2e-06,1.1e-05,1.1e-05,8e-06,2e-06,5e-06,1e-06,4e-06,4e-06,6e-06,4e-06,3e-06,5e-06,5e-06,4e-06,0,4e-06,4e-06,2e-06,1e-06,4e-06,2e-06,5e-06,6e-06,3e-06,3e-06,1e-05,1e-05,3e-06,4e-06,5e-06,1e-05,3e-06,7e-06,5e-06,2e-06,5e-06,1.5e-05,2e-06,1e-06,2e-06,1.1e-05,6e-06,3e-06,2e-06,9e-06,1e-06,6e-06,2e-06,6e-06,1e-06,3e-06,2e-06,5e-06,2e-06,3e-06,5e-06,3e-06,7e-06,4e-06,5e-06,6e-06,6e-06,4e-06,5e-06,4e-06,4e-06,3e-06,3e-06,7e-06,1e-06,4e-06,4e-06,2e-06,5e-06,6e-06,4e-06,3e-06,8e-06,3e-06,3e-06,2e-06,7e-06,0,4e-06,7e-06,6e-06,5e-06,4e-06,5e-06,3e-06,4e-06,1e-06,3e-06,6e-06,3e-06,7e-06,7e-06,5e-06,6e-06,4e-06,5e-06
1e-05,1e-05,5e-06,4e-06,9e-06,7e-06,6e-06,5e-06,5e-06,9e-06,7e-06,8e-06,1e-06,6e-06,1e-06,5e-06,1e-06,6e-06,6e-06,5e-06,1.1e-05,1e-05,1.1e-05,1e-06,1e-06,4e-06,1e-06,1e-05,8e-06,5e-06,5e-06,2e-06,4e-06,3e-06,1e-06,1e-06,3e-06,1e-06,1e-06,4e-06,2e-06,3e-06,7e-06,2e-06,2e-06,5e-06,5e-06,4e-06,5e-06,2e-06,7e-06,2e-06,5e-06,5e-06,1e-06,4e-06,1.2e-05,3e-06,3e-06,1e-06,7e-06,7e-06,1e-06,4e-06,9e-06,3e-06,7e-06,3e-06,4e-06,2e-06,1e-06,1e-06,5e-06,2e-06,1e-06,3e-06,1e-06,8e-06,4e-06,4e-06,4e-06,6e-06,2e-06,5e-06,6e-06,4e-06,4e-06,5e-06,4e-06,1e-06,5e-06,6e-06,2e-06,2e-06,6e-06,3e-06,5e-06,7e-06,3e-06,2e-06,4e-06,6e-06,4e-06,4e-06,8e-06,2e-06,2e-06,5e-06,3e-06,4e-06,2e-06,1e-06,2e-06,4e-06,3e-06,9e-06,2e-06,4e-06,5e-06,4e-06,3e-06
6e-06,1.1e-05,6e-06,1e-06,8e-06,7e-06,6e-06,7e-06,6e-06,6e-06,9e-06,5e-06,3e-06,7e-06,5e-06,4e-06,4e-06,5e-06,5e-06,3e-06,1.2e-05,7e-06,7e-06,2e-06,4e-06,5e-06,5e-06,6e-06,8e-06,7e-06,7e-06,3e-06,3e-06,1e-06,4e-06,1e-06,2e-06,3e-06,2e-06,4e-06,2e-06,2e-06,6e-06,3e-06,3e-06,8e-06,3e-06,3e-06,3e-06,3e-06,2e-06,5e-06,5e-06,7e-06,4e-06,6e-06,9e-06,4e-06,1e-06,3e-06,7e-06,9e-06,5e-06,1e-06,1e-05,3e-06,4e-06,3e-06,7e-06,1e-06,3e-06,2e-06,3e-06,5e-06,1e-06,4e-06,5e-06,6e-06,2e-06,6e-06,8e-06,8e-06,2e-06,5e-06,4e-06,2e-06,1e-06,7e-06,3e-06,3e-06,2e-06,2e-06,3e-06,4e-06,6e-06,1e-06,6e-06,5e-06,4e-06,2e-06,3e-06,5e-06,3e-06,4e-06,4e-06,3e-06,5e-06,4e-06,6e-06,3e-06,3e-06,2e-06,3e-06,4e-06,6e-06,1e-05,1e-06,5e-06,6e-06,4e-06,1e-06
5e-06,1.4e-05,1.7e-05,8e-06,7e-06,6e-06,4e-06,5e-06,7e-06,9e-06,9e-06,8e-06,6e-06,1.2e-05,1.1e-05,1.1e-05,7e-06,3e-06,7e-06,5e-06,2.1e-05,1.1e-05,6e-06,8e-06,2e-06,7e-06,7e-06,6e-06,4e-06,1e-06,3e-06,2e-06,0,6e-06,4e-06,4e-06,0,5e-06,5e-06,2e-06,3e-06,3e-06,8e-06,3e-06,7e-06,8e-06,2e-06,1.1e-05,4e-06,8e-06,8e-06,5e-06,7e-06,2e-06,4e-06,8e-06,1.4e-05,7e-06,5e-06,5e-06,5e-06,9e-06,1e-05,6e-06,1.2e-05,1e-06,5e-06,4e-06,3e-06,5e-06,3e-06,4e-06,3e-06,2e-06,2e-06,5e-06,6e-06,9e-06,3e-06,4e-06,4e-06,4e-06,4e-06,7e-06,2e-06,8e-06,6e-06,2e-06,1e-05,3e-06,3e-06,4e-06,1e-06,2e-06,8e-06,2e-06,4e-06,8e-06,2e-06,6e-06,2e-06,8e-06,6e-06,1e-06,3e-06,8e-06,4e-06,3e-06,3e-06,6e-06,4e-06,4e-06,2e-06,2e-06,5e-06,2e-06,7e-06,2e-06,8e-06,1e-05,1e-05
8e-06,7e-06,1.1e-05,1.2e-05,3e-06,1.8e-05,1.4e-05,1.6e-05,1.9e-05,1.1e-05,4e-06,1.3e-05,1.3e-05,1.7e-05,1.2e-05,8e-06,4e-06,6e-06,4e-06,2e-06,2.3e-05,1.2e-05,1e-05,1.2e-05,7e-06,4e-06,8e-06,1e-05,9e-06,4e-06,1e-05,8e-06,3e-06,9e-06,8e-06,6e-06,5e-06,3e-06,5e-06,8e-06,7e-06,6e-06,9e-06,4e-06,1.4e-05,1.5e-05,1.1e-05,7e-06,7e-06,2e-06,9e-06,7e-06,3e-06,7e-06,2e-06,1e-05,1.9e-05,8e-06,7e-06,9e-06,1.5e-05,5e-06,4e-06,1.2e-05,1e-05,5e-06,5e-06,2e-06,8e-06,4e-06,9e-06,1e-06,1e-06,4e-06,9e-06,3e-06,1e-06,3e-06,1e-05,7e-06,7e-06,5e-06,2e-06,6e-06,5e-06,4e-06,6e-06,7e-06,9e-06,9e-06,2e-06,5e-06,5e-06,5e-06,6e-06,7e-06,1e-05,7e-06,2e-06,7e-06,6e-06,7e-06,8e-06,7e-06,2e-06,1e-05,9e-06,3e-06,3e-06,5e-06,3e-06,1e-06,3e-06,7e-06,6e-06,6e-06,2e-06,8e-06,6e-06,6e-06,1.1e-05
1.1e-05,1.1e-05,1.1e-05,1.2e-05,1e-05,2.5e-05,2.1e-05,6e-06,1.3e-05,2.2e-05,1.4e-05,2.8e-05,3.4e-05,2.7e-05,6e-06,8e-06,7e-06,6e-06,7e-06,7e-06,1.9e-05,2.2e-05,6e-06,1.1e-05,1.1e-05,3e-06,8e-06,1.5e-05,2e-06,2e-06,1.1e-05,9e-06,8e-06,5e-06,6e-06,4e-06,1e-06,4e-06,6e-06,8e-06,6e-06,2e-06,1e-06,0,1.4e-05,5e-06,5e-06,7e-06,3e-06,6e-06,7e-06,2e-06,4e-06,5e-06,7e-06,1.1e-05,6e-06,0,3e-06,1.2e-05,2.2e-05,1.5e-05,1.1e-05,1.4e-05,1e-06,5e-06,1e-05,7e-06,1.1e-05,9e-06,4e-06,4e-06,4e-06,6e-06,4e-06,5e-06,3e-06,1e-06,6e-06,6e-06,2e-06,7e-06,3e-06,5e-06,5e-06,4e-06,7e-06,9e-06,0,4e-06,8e-06,1e-06,5e-06,2e-06,6e-06,6e-06,4e-06,8e-06,1e-05,1.2e-05,8e-06,2e-06,6e-06,6e-06,5e-06,5e-06,5e-06,4e-06,5e-06,2e-06,5e-06,6e-06,2e-06,7e-06,1e-05,6e-06,6e-06,8e-06,9e-06,1.4e-05,2e-06
4e-06,9e-06,9e-06,7e-06,1e-05,1.9e-05,3e-06,2e-06,1.2e-05,1.3e-05,1.2e-05,1.1e-05,1.3e-05,3e-06,8e-06,5e-06,5e-06,4e-06,1.1e-05,7e-06,1.7e-05,1.1e-05,1.4e-05,1e-05,4e-06,1.3e-05,1.4e-05,8e-06,1e-06,4e-06,3e-06,7e-06,3e-06,2e-06,8e-06,4e-06,4e-06,2e-06,2e-06,9e-06,7e-06,6e-06,2e-06,5e-06,9e-06,7e-06,8e-06,7e-06,4e-06,5e-06,8e-06,4e-06,3e-06,3e-06,3e-06,4e-06,1e-05,2e-06,2e-06,1e-05,1e-05,7e-06,1e-05,3e-06,6e-06,3e-06,4e-06,3e-06,1e-05,3e-06,2e-06,1e-06,1e-06,3e-06,0,5e-06,2e-06,4e-06,4e-06,1e-06,3e-06,1.1e-05,6e-06,4e-06,3e-06,4e-06,7e-06,3e-06,5e-06,5e-06,1e-06,6e-06,5e-06,5e-06,2e-06,6e-06,7e-06,4e-06,7e-06,6e-06,2e-06,2e-06,6e-06,4e-06,4e-06,6e-06,6e-06,4e-06,3e-06,4e-06,3e-06,4e-06,3e-06,3e-06,5e-06,3e-06,3e-06,4e-06,2e-06,4e-06,3e-06
3e-06,6e-06,4e-06,5e-06,9e-06,8e-06,1e-06,4e-06,8e-06,3e-06,5e-06,5e-06,5e-06,2e-06,6e-06,3e-06,6e-06,4e-06,6e-06,4e-06,9e-06,6e-06,4e-06,2e-06,4e-06,9e-06,4e-06,1.1e-05,5e-06,3e-06,2e-06,4e-06,7e-06,4e-06,5e-06,3e-06,1e-06,2e-06,1e-06,5e-06,5e-06,2e-06,7e-06,3e-06,2e-06,4e-06,6e-06,2e-06,6e-06,3e-06,3e-06,0,0,2e-06,4e-06,5e-06,9e-06,1e-06,1e-06,4e-06,8e-06,4e-06,3e-06,4e-06,6e-06,2e-06,2e-06,1e-06,2e-06,3e-06,2e-06,1e-06,1e-06,5e-06,4e-06,3e-06,3e-06,7e-06,1e-06,4e-06,2e-06,7e-06,3e-06,3e-06,1e-06,5e-06,6e-06,2e-06,6e-06,3e-06,5e-06,4e-06,1e-06,1e-06,4e-06,3e-06,4e-06,3e-06,3e-06,4e-06,5e-06,4e-06,4e-06,2e-06,2e-06,8e-06,4e-06,2e-06,1e-06,2e-06,1e-06,5e-06,2e-06,3e-06,2e-06,1e-06,3e-06,4e-06,1e-06,2e-06,3e-06
1e-06,6e-06,2e-06,3e-06,5e-06,9e-06,3e-06,1e-06,5e-06,3e-06,7e-06,3e-06,2e-06,4e-06,3e-06,2e-06,3e-06,6e-06,6e-06,3e-06,7e-06,2e-06,9e-06,2e-06,2e-06,6e-06,2e-06,1.3e-05,1e-06,1e-06,4e-06,2e-06,3e-06,2e-06,5e-06,1e-06,2e-06,2e-06,1e-06,4e-06,3e-06,1e-06,5e-06,5e-06,2e-06,7e-06,5e-06,4e-06,7e-06,4e-06,4e-06,2e-06,2e-06,1e-06,2e-06,2e-06,1.2e-05,2e-06,2e-06,0,8e-06,3e-06,3e-06,3e-06,6e-06,2e-06,2e-06,2e-06,4e-06,3e-06,2e-06,1e-06,2e-06,4e-06,3e-06,3e-06,2e-06,4e-06,1e-06,7e-06,6e-06,2e-06,2e-06,5e-06,3e-06,3e-06,5e-06,2e-06,3e-06,3e-06,3e-06,4e-06,2e-06,3e-06,5e-06,3e-06,3e-06,3e-06,3e-06,3e-06,2e-06,4e-06,1e-06,2e-06,2e-06,5e-06,1e-06,2e-06,2e-06,1e-06,1e-06,2e-06,2e-06,5e-06,4e-06,2e-06,3e-06,2e-06,2e-06,3e-06,3e-06
2e-06,6e-06,3e-06,1e-06,7e-06,8e-06,1e-06,2e-06,6e-06,4e-06,7e-06,2e-06,3e-06,5e-06,3e-06,3e-06,3e-06,6e-06,4e-06,3e-06,6e-06,1e-06,5e-06,4e-06,2e-06,5e-06,2e-06,9e-06,4e-06,1e-06,1e-06,4e-06,1e-06,4e-06,1e-06,3e-06,1e-06,1e-06,2e-06,4e-06,4e-06,4e-06,3e-06,2e-06,1e-06,4e-06,7e-06,1e-06,6e-06,2e-06,3e-06,2e-06,1e-06,2e-06,2e-06,1e-06,1e-05,1e-06,2e-06,1e-06,8e-06,5e-06,1e-06,1e-06,5e-06,1e-06,3e-06,4e-06,3e-06,2e-06,1e-06,1e-06,2e-06,3e-06,1e-06,0,2e-06,2e-06,3e-06,5e-06,1e-06,5e-06,1e-06,5e-06,2e-06,2e-06,5e-06,3e-06,6e-06,2e-06,1e-06,3e-06,3e-06,1e-06,4e-06,3e-06,4e-06,2e-06,3e-06,0,4e-06,2e-06,1e-06,1e-06,2e-06,6e-06,3e-06,3e-06,0,2e-06,2e-06,2e-06,2e-06,2e-06,2e-06,3e-06,4e-06,2e-06,2e-06,3e-06,1e-06
1e-06,6e-06,1e-06,3e-06,6e-06,1.1e-05,3e-06,2e-06,6e-06,2e-06,9e-06,2e-06,3e-06,0,4e-06,2e-06,4e-06,2e-06,2e-06,2e-06,7e-06,3e-06,8e-06,3e-06,1e-06,5e-06,1e-06,1.1e-05,3e-06,6e-06,4e-06,1e-06,2e-06,3e-06,2e-06,2e-06,1e-06,2e-06,2e-06,1e-06,3e-06,3e-06,3e-06,3e-06,1e-06,2e-06,6e-06,2e-06,5e-06,0,2e-06,3e-06,1e-06,2e-06,4e-06,2e-06,1.1e-05,4e-06,2e-06,1e-06,7e-06,3e-06,2e-06,4e-06,4e-06,2e-06,2e-06,2e-06,4e-06,2e-06,2e-06,1e-06,2e-06,5e-06,3e-06,1e-06,2e-06,5e-06,2e-06,3e-06,3e-06,5e-06,1e-06,7e-06,2e-06,3e-06,2e-06,2e-06,5e-06,1e-06,1e-06,2e-06,1e-06,0,4e-06,1e-06,5e-06,3e-06,2e-06,0,2e-06,2e-06,1e-06,1e-06,3e-06,5e-06,3e-06,4e-06,2e-06,3e-06,0,2e-06,2e-06,4e-06,1e-06,2e-06,4e-06,2e-06,3e-06,3e-06,5e-06
1e-06,5e-06,3e-06,2e-06,6e-06,9e-06,1e-06,4e-06,8e-06,1e-06,7e-06,4e-06,6e-06,4e-06,0,1e-06,3e-06,5e-06,3e-06,0,7e-06,4e-06,5e-06,2e-06,1e-06,5e-06,1e-06,9e-06,3e-06,4e-06,5e-06,4e-06,2e-06,2e-06,1e-06,2e-06,1e-06,1e-06,2e-06,2e-06,2e-06,3e-06,4e-06,2e-06,2e-06,4e-06,2e-06,1e-06,5e-06,2e-06,4e-06,1e-06,1e-06,1e-06,2e-06,1e-06,1e-05,3e-06,0,0,7e-06,2e-06,2e-06,3e-06,5e-06,2e-06,3e-06,2e-06,4e-06,3e-06,1e-06,2e-06,1e-06,4e-06,2e-06,1e-06,1e-06,3e-06,2e-06,2e-06,1e-06,4e-06,1e-06,4e-06,1e-06,3e-06,3e-06,1e-06,3e-06,1e-06,1e-06,2e-06,3e-06,0,5e-06,1e-06,4e-06,2e-06,4e-06,2e-06,3e-06,2e-06,0,0,4e-06,7e-06,3e-06,3e-06,0,2e-06,2e-06,1e-06,0,3e-06,0,2e-06,4e-06,3e-06,0,5e-06,1e-06
1e-06,5e-06,1e-06,1e-06,4e-06,8e-06,3e-06,3e-06,6e-06,3e-06,7e-06,5e-06,2e-06,2e-06,2e-06,1e-06,1e-06,5e-06,4e-06,3e-06,6e-06,5e-06,7e-06,2e-06,2e-06,6e-06,1e-06,8e-06,2e-06,4e-06,6e-06,0,3e-06,2e-06,2e-06,1e-06,0,1e-06,3e-06,2e-06,2e-06,2e-06,4e-06,1e-06,0,4e-06,3e-06,2e-06,4e-06,1e-06,4e-06,2e-06,1e-06,1e-06,2e-06,1e-06,1e-05,1e-06,2e-06,0,8e-06,2e-06,3e-06,3e-06,5e-06,1e-06,3e-06,3e-06,4e-06,3e-06,2e-06,2e-06,1e-06,3e-06,2e-06,1e-06,1e-06,4e-06,1e-06,3e-06,2e-06,4e-06,1e-06,3e-06,1e-06,3e-06,3e-06,0,4e-06,2e-06,1e-06,2e-06,2e-06,1e-06,5e-06,0,2e-06,2e-06,2e-06,1e-06,3e-06,3e-06,1e-06,1e-06,2e-06,6e-06,2e-06,1e-06,2e-06,1e-06,1e-06,1e-06,1e-06,2e-06,1e-06,2e-06,2e-06,1e-06,0,5e-06,2e-06
2e-06,5e-06,2e-06,0,5e-06,8e-06,3e-06,3e-06,5e-06,2e-06,7e-06,2e-06,3e-06,1e-06,1e-06,1e-06,1e-06,5e-06,4e-06,2e-06,6e-06,4e-06,7e-06,2e-06,0,6e-06,1e-06,8e-06,1e-06,2e-06,5e-06,2e-06,1e-06,1e-06,2e-06,1e-06,2e-06,2e-06,2e-06,2e-06,2e-06,2e-06,4e-06,1e-06,1e-06,4e-06,3e-06,2e-06,4e-06,1e-06,4e-06,1e-06,1e-06,0,2e-06,1e-06,1e-05,1e-06,2e-06,1e-06,7e-06,3e-06,2e-06,2e-06,4e-06,1e-06,1e-06,2e-06,3e-06,2e-06,2e-06,1e-06,0,4e-06,2e-06,1e-06,2e-06,3e-06,1e-06,2e-06,2e-06,2e-06,2e-06,4e-06,1e-06,2e-06,3e-06,1e-06,4e-06,1e-06,1e-06,2e-06,2e-06,1e-06,5e-06,1e-06,3e-06,3e-06,3e-06,0,2e-06,2e-06,0,1e-06,2e-06,4e-06,3e-06,2e-06,1e-06,0,2e-06,1e-06,1e-06,2e-06,1e-06,2e-06,3e-06,2e-06,1e-06,4e-06,3e-06
2e-06,6e-06,1e-06,1e-06,5e-06,7e-06,2e-06,2e-06,6e-06,3e-06,7e-06,1e-06,2e-06,1e-06,1e-06,1e-06,2e-06,5e-06,4e-06,1e-06,6e-06,4e-06,7e-06,2e-06,2e-06,5e-06,1e-06,7e-06,2e-06,2e-06,5e-06,2e-06,1e-06,1e-06,2e-06,0,0,0,2e-06,2e-06,2e-06,2e-06,4e-06,0,0,3e-06,3e-06,2e-06,4e-06,1e-06,4e-06,1e-06,0,0,2e-06,0,1e-05,1e-06,1e-06,1e-06,6e-06,3e-06,2e-06,2e-06,5e-06,2e-06,2e-06,2e-06,4e-06,2e-06,2e-06,1e-06,0,4e-06,2e-06,0,1e-06,4e-06,1e-06,3e-06,3e-06,4e-06,2e-06,4e-06,0,2e-06,2e-06,1e-06,4e-06,1e-06,1e-06,1e-06,2e-06,0,5e-06,1e-06,3e-06,2e-06,2e-06,1e-06,3e-06,2e-06,0,0,3e-06,5e-06,2e-06,1e-06,0,0,2e-06,0,0,2e-06,1e-06,2e-06,3e-06,2e-06,1e-06,3e-06,2e-06
