0.000595,0.000495,0.000725,0.00056,0.001047,0.000958,0.001081,0.000812,0.00116,0.000995,0.001158,0.001364,0.001329,0.001092,0.001389,0.001116,0.001156,0.001177,0.001519,0.001534,0.001927,0.001567,0.001937,0.001401,0.002038,0.001844,0.001951,0.001902,0.002023,0.001947,0.001847,0.001511,0.001382,0.001259,0.00096,0.00139,0.001139,0.001555,0.001507,0.001693,0.001691,0.001885,0.001455,0.001743,0.001756,0.001856,0.001828,0.002733,0.002837,0.002498,0.002387,0.002328,0.002316,0.001837,0.002114,0.001811,0.002297,0.001426,0.002521,0.001693,0.002415,0.001539,0.001518,0.00224,0.001796,0.002045,0.00169,0.001533,0.001475,0.00084,0.001339,0.001276,0.00069,0.000583,0.000274,-3.4e-05,0.000172,-0.000336,-0.000407,-0.000182,-0.000158,-9.7e-05,0.00018,0.000103,-0.000101,-0.000246,-0.000101,-2.5e-05,2.9e-05,-0.000135,0.000139,5.4e-05,1.4e-05,1e-04,0.000123,1.1e-05,-0.000369,-0.000407,-3.5e-05,-0.000191,-0.000275,-0.000391,-0.000547,-5e-04,-0.000231,-0.000443,-0.00028,-0.000376,-0.000664,-0.000741,-0.000446,-0.000589,-0.000367,-0.000473,-0.000679,-0.000556,-0.000547,-0.000612,-0.00032,4.1e-05,-0.00038
0.00037,0.000468,0.000456,0.000554,0.000192,0.000772,0.000298,0.000713,0.000703,0.000784,0.000743,0.000886,0.000552,0.000741,0.00052,0.000595,0.00027,0.000254,0.00038,0.000245,0.000405,0.000672,0.000718,0.000868,0.00059,0.000967,0.000853,0.001085,0.000738,0.001281,0.001047,0.000766,0.000697,0.00036,0.000528,0.00032,0.000525,0.000386,0.000497,0.000851,0.000844,0.000438,0.000583,0.000545,0.00034,0.000182,0.000729,0.000582,0.000723,0.000625,0.000288,0.000132,-0.000271,1.4e-05,-0.000433,-2.6e-05,0.00031,0.000173,-0.00028,0.000193,-0.000917,-0.000679,-0.000266,3.6e-05,-0.000383,-0.000567,-0.001826,-0.001169,-0.000598,-0.000275,-0.000342,-0.000467,-0.000223,-9e-06,-3.5e-05,-5.5e-05,-7.5e-05,-0.000168,-0.000217,-0.000344,-0.000195,-0.000182,-0.000172,-0.00024,0,0.000206,-0.000215,-0.000541,-0.000391,-0.000195,-0.000502,-0.000717,-0.000785,-0.000577,-0.000245,-2.2e-05,2.8e-05,0.00013,-5.5e-05,0.000232,0.00027,-0.000221,-0.00021,-0.000176,-0.000462,-0.000135,-0.00038,-1e-05,1.1e-05,-6.2e-05,-0.000426,-0.000495,-0.000588,-0.000215,-0.000277,0.000155,-0.000248,-0.000353,-0.000285,-0.000309,0.000269
-4e-05,0.000301,0.000116,0.000474,-4.9e-05,0.000318,-8e-06,0.000384,1e-04,0.000329,-0.000444,0.000186,0.000135,0.001009,0.00041,0.000989,0.000665,0.001194,0.000801,0.000917,0.000272,0.000438,0.000376,0.000821,0.000309,0.000324,7e-06,0.000436,0.000188,0.000393,-4.2e-05,-0.000234,-0.000296,-0.000552,-0.000255,-0.000938,-0.000634,4e-05,0.000121,9.5e-05,-8.2e-05,-0.000128,-0.000204,-0.00066,-0.001135,-0.000714,-0.000379,2.2e-05,0.000129,-0.000733,2.7e-05,-0.000697,-0.000222,-0.000641,-0.000949,-0.000771,-0.001422,-0.000467,-0.001251,-0.00023,-0.001149,0.00032,-0.000149,0.00029,-0.001569,0.000229,-0.000701,-0.000445,-0.000667,-0.000278,-0.000576,-0.000395,-2.9e-05,4.8e-05,-0.000126,-4.7e-05,6.5e-05,5.3e-05,0.000238,-1.1e-05,6.5e-05,3.9e-05,0.000102,-1.4e-05,9.1e-05,6.3e-05,-8.4e-05,0.000247,-5.5e-05,-3.7e-05,-1e-06,0.00013,0.000376,4.1e-05,0.000186,-0.000196,0.000107,0.000115,-0.000401,-0.000332,-0.000256,-0.000151,9.3e-05,-6.4e-05,0.000295,0.000316,9.4e-05,0.000409,-0.000209,0.000429,-0.00018,0.000243,0.00034,0.000318,0.000312,7.6e-05,0.000267,0.000432,0.000258,5.1e-05,-6.4e-05
-0.000289,-0.000433,-0.000398,-0.000109,-0.00045,-5e-06,-0.000584,-5.1e-05,-0.000581,-3.4e-05,-0.000245,5e-06,-0.000648,-0.000453,-0.000913,-0.000429,-0.000867,-0.000434,-0.000746,-0.000215,-0.000652,-0.00035,-0.001001,-0.001051,-0.000943,-0.000275,-0.00085,-0.000375,-0.000809,-0.000692,-0.000858,-0.000358,-0.001175,-5e-04,-0.001261,-0.000814,-0.000822,-0.000745,-0.000186,-0.000294,-0.000427,-0.000478,-0.000731,-0.00067,-0.000665,-0.001237,-0.001237,-0.001192,-0.000415,-0.001127,0.000121,-0.001161,-5.4e-05,-0.000913,-0.000745,-0.000948,-0.001048,-0.000798,-0.001072,-0.000519,-0.000822,-0.000494,-0.000832,-0.000117,-0.000686,7.7e-05,0.000218,0.000735,-0.00031,-0.000545,-0.000371,-0.000614,-0.000206,-0.000389,-0.000165,-9.7e-05,-0.000132,-8.1e-05,-6.5e-05,7.5e-05,8.2e-05,-9e-06,1.4e-05,0.000133,0.000271,0.000277,-2.1e-05,1.3e-05,1.1e-05,-4.9e-05,-6.1e-05,0.000342,0.000472,7.7e-05,-0.000228,-0.000242,-0.000411,3.4e-05,-0.000295,-2.6e-05,0.000252,-9.7e-05,-0.000262,6.8e-05,-7.9e-05,-0.000367,-0.000216,-0.000626,-0.000243,0.000111,0.000388,-1.7e-05,0.00017,-0.000267,-0.000257,-0.000244,-0.000236,-0.000204,-6.4e-05,-0.000139,-0.000333
-0.000232,-0.000185,-0.00013,-0.000439,-0.000607,-0.000182,-0.000482,-0.000298,-0.00034,-0.000163,-0.00048,-0.00041,-0.000805,-0.000235,-0.000559,-0.000354,-0.000589,-0.000278,-0.000881,-0.000532,-0.001035,-0.000528,-0.000715,-4.7e-05,-9e-04,-0.000665,-0.00105,-0.000355,-0.000894,-0.000516,-0.000944,-0.000881,-0.000827,-0.000595,-0.000726,-0.000744,-0.001046,-0.001182,-0.001384,-0.001141,-0.001067,-0.000982,-0.000784,-0.000993,-0.001157,-0.00106,-0.001138,-0.001361,-0.001326,-0.001015,-0.000603,-0.000582,-0.000293,-0.000232,-0.000382,-0.000612,-0.00028,-0.00066,-0.00016,0.000117,9.1e-05,-0.00062,-0.000516,0.000443,0.00019,-9e-06,-0.000103,-0.000408,7.1e-05,-0.000273,0.000189,-0.000476,-0.00048,-0.00058,-0.000215,-2.7e-05,-1e-04,5e-05,-9.5e-05,-0.000106,-4.1e-05,4.5e-05,-0.000107,6e-05,-1.1e-05,-0.00031,-0.000404,-0.000204,-0.000298,-0.000317,-0.000386,-0.000357,-0.000266,-0.000186,-6e-05,-0.000173,4.8e-05,-0.00046,-8e-05,-0.000304,-0.000261,-6.9e-05,5.7e-05,9.9e-05,-2.7e-05,0.000204,0.000256,9.4e-05,0.00042,-0.000354,-0.000408,-0.00014,-0.00012,0.00021,0.000157,3.6e-05,-0.000106,-0.00017,-0.000294,9.1e-05,0.000123
-0.000129,-0.000264,-0.000341,-0.000118,6.2e-05,-0.00027,-0.00013,-0.000164,-0.000166,-0.000622,-0.000196,-0.000166,-7.2e-05,-0.000311,-0.000128,-0.000468,-0.000185,-0.000317,-0.000198,-0.000724,-0.000172,-0.000641,-0.00035,-0.000858,-0.000138,-0.000768,-0.000228,-0.000793,-0.000358,-0.00068,-0.000274,-0.000448,-0.000121,-0.000594,-0.000447,-0.000566,-0.000353,-0.000117,-0.000432,-0.00047,-0.000345,-0.000404,-0.000581,-0.000385,-0.000633,-0.000591,-0.00058,-0.000441,-0.000946,-0.000183,-0.000853,4.6e-05,-0.000863,-0.000309,-0.000425,-0.000101,-0.000415,-0.000753,-0.000406,-0.000251,-0.000408,0.000517,0.000465,-0.000962,-0.000509,0.000448,-0.000352,9.4e-05,0.000125,-0.000189,-4.4e-05,-3e-04,-0.000306,-5.4e-05,0.000102,3.7e-05,-1.3e-05,5.2e-05,-4e-05,-2.5e-05,-0.000157,-6.4e-05,-9.5e-05,-4.2e-05,-0.000271,-6e-05,0.000171,4.7e-05,4.5e-05,-0.000115,0.000221,-5.5e-05,-3.7e-05,-0.000154,-0.000109,-3.1e-05,-3.8e-05,7.3e-05,6e-05,-6.6e-05,-0.000236,0.000218,9.6e-05,-0.000244,0.000115,0.00018,9e-05,-2.3e-05,-0.000253,0.000248,0.000404,4e-05,-0.000284,-0.000137,-3.9e-05,0,-6.2e-05,0.000124,0.000226,-4.6e-05,-0.000148
-0.000189,-0.000203,-0.000185,-0.000387,-0.000234,-0.000557,-0.000266,-0.000534,-0.000354,-0.000383,-0.000389,-0.000619,-0.000193,-0.000632,-0.000426,-0.000634,-0.000423,-0.000792,-0.000254,-0.00066,-0.000279,-0.000581,-0.000315,-0.000778,-0.000584,-0.000403,-0.000211,-0.000634,-0.000292,-0.000639,-0.000376,-0.000446,-0.000409,-0.00044,-0.000182,-0.00026,-0.000113,-0.000377,-0.000224,-9.2e-05,-0.000114,-7.1e-05,3e-06,-9.7e-05,-0.000205,-0.00011,-0.000322,-0.000302,-0.00019,-0.000213,-0.000666,-0.000354,-0.00064,-0.000295,-0.000577,-0.000278,-0.000573,-0.00012,-0.00043,-0.001169,-0.000251,-0.000564,-0.000547,-0.00067,-0.000189,-0.000393,2.3e-05,0.000884,-0.000137,-0.000115,-0.000279,0.000324,-0.000357,-9.3e-05,-2.9e-05,-4.1e-05,0.000129,-5.2e-05,0.000106,0.000144,0.000232,0.000109,2.1e-05,7.5e-05,0.00011,-2.9e-05,-4.3e-05,6e-05,0.000101,0.000279,2.9e-05,0.000257,0.000141,0.000247,-7.4e-05,0.000165,0.000198,-1.9e-05,0.000143,0.000119,-5e-06,-0.000233,0.000168,0.000144,-8.8e-05,-0.000203,-0.000205,-9.4e-05,3.5e-05,-0.000144,-0.000202,0.00037,0.000469,0.000124,0,7.1e-05,0.000226,-0.000167,4e-06,-0.000121,-3.3e-05
0.000117,-1e-06,1.9e-05,-0.000137,-0.000151,-0.000136,-0.000112,-0.000363,-0.000154,-0.000205,-0.00012,-0.000253,-0.000107,-0.000193,-4.3e-05,-0.000102,-0.000116,1e-05,-0.000135,0.000143,-0.00021,-0.000257,-0.000134,-2.7e-05,-1.1e-05,-0.000452,-0.000163,-0.000139,-3.3e-05,-2.4e-05,5.8e-05,-1e-06,0.000292,0.000153,0.000205,-6.1e-05,0.000149,-2e-05,5.3e-05,0.000165,9.7e-05,-2.6e-05,0.000148,8.3e-05,0.000218,0.000201,-2.3e-05,0.00011,0.000109,2.1e-05,-0.000109,-0.000149,-2.8e-05,-4.2e-05,-0.000332,7.3e-05,-0.000131,-0.000214,5.2e-05,-0.000101,-0.000193,-0.000547,-0.000393,-0.000207,-8e-06,-0.000664,-0.00024,-0.000426,-0.000272,0.000266,-0.000157,8e-06,-0.000235,-0.000129,0.000115,6e-06,-2.5e-05,-9.8e-05,-1e-05,-2.2e-05,1.9e-05,-3.4e-05,6.2e-05,-9.2e-05,-5.1e-05,-1.6e-05,8.7e-05,-0.000174,-0.000113,9.5e-05,2.5e-05,0.000156,-3.6e-05,8e-06,0.000249,3.7e-05,-2.5e-05,5.3e-05,-0.000129,0.000183,3.9e-05,3.3e-05,-4.1e-05,4.2e-05,-3.6e-05,-5e-06,5.7e-05,0.00012,-0.000159,-5.1e-05,-0.000103,-3e-04,-0.000352,0.000129,8.8e-05,-5.8e-05,-9e-05,2.4e-05,-0.000106,4.1e-05,4.2e-05
-5.2e-05,0.000104,-1.5e-05,7e-06,0.000157,2e-06,-5.5e-05,0.00016,3.9e-05,-9.6e-05,9.6e-05,-0.000165,-5.3e-05,-5.6e-05,4e-06,3.4e-05,3.7e-05,-0.000178,-2.6e-05,-0.00029,-1.1e-05,0.000135,-6e-05,5.7e-05,4.7e-05,9.8e-05,2e-06,6.6e-05,-3.2e-05,5.9e-05,0.000106,0.000283,2e-06,0.000302,0.000142,0.000426,0.000168,0.000213,0.000293,-7.7e-05,6.8e-05,0.000167,5.8e-05,0.00022,0.000158,0.000164,0.000667,0.000286,0.000294,0.000334,0.000166,0.000171,0.00024,0.000208,0.000368,8.7e-05,0.000495,0.000503,0.000272,0.000307,-4.4e-05,-0.000308,0.000116,2e-05,0.000262,-0.000661,-6.3e-05,-0.001006,-9.4e-05,0.000108,-0.000165,-0.00022,0.000137,9.5e-05,3.6e-05,-1e-04,-5.1e-05,-3.9e-05,-3e-06,-6.2e-05,-8.2e-05,-3.9e-05,-8.1e-05,-0.000157,3e-06,-0.000147,-7.1e-05,-2.3e-05,-0.000107,-0.000146,7.8e-05,3e-05,-9.2e-05,-6.4e-05,7.2e-05,3.1e-05,9.4e-05,0.000141,0.000245,6.3e-05,0.000113,6.9e-05,-2.2e-05,-9.5e-05,5.1e-05,7.2e-05,-2.7e-05,4e-05,-1.4e-05,-0.000276,3.8e-05,0.000172,8.1e-05,-0.00013,-0.000139,7e-05,6.6e-05,7.7e-05,8.2e-05,2e-06,3.8e-05
4.3e-05,6.1e-05,6.6e-05,9.8e-05,5.2e-05,9e-05,0.000145,-5e-05,8.3e-05,0.000372,0.000115,0.000252,0.000131,-1e-05,6e-05,-1.2e-05,0.000104,7e-05,9e-06,0.000264,0.00013,0.000309,5.7e-05,0.00025,9.2e-05,0.000553,0.000287,0.000234,0.000151,0.00034,0.000148,0.000272,0.000209,0.000182,5.3e-05,0.000122,6.6e-05,0.000433,0.000286,0.000428,0.00036,0.000289,0.000315,0.000206,0.000294,0.000316,0.000115,0.000415,0.000528,0.000426,0.000628,0.00045,0.000513,0.000253,0.000537,0.000179,0.000602,0.000243,0.000486,0.000567,0.000615,0.000433,-1.9e-05,0.000326,0.000199,0.000208,0.000349,-0.000197,-0.000189,-0.000123,-0.000241,-7.2e-05,0.000186,0.000146,-6.7e-05,-4.7e-05,2.2e-05,1.1e-05,1.1e-05,3.8e-05,3.6e-05,6.2e-05,3e-06,0.000114,-4e-06,4.2e-05,9.2e-05,0.000146,2.5e-05,0.000124,3.8e-05,2.3e-05,-1e-06,2.9e-05,-0.000118,3.3e-05,-2e-05,-8.5e-05,4.2e-05,-0.000113,5.2e-05,8.4e-05,-0.000154,8.7e-05,2.5e-05,9e-06,0.00012,3.8e-05,-2e-05,0.000182,-6.7e-05,-0.000112,8e-05,-7.2e-05,0.000113,-0.000175,-0.000134,0,3.8e-05,-1e-05,-2.1e-05
7.7e-05,3.3e-05,9.2e-05,0.000166,4e-05,0.000227,0.000221,0.000259,0.000194,0.000101,0.000151,0.000262,9.6e-05,0.000306,0.000151,0.000401,0.000214,0.000356,0.00029,0.000394,0.000306,0.000271,0.000388,0.000353,0.000346,0.000191,0.000256,0.000504,0.000317,0.000196,0.000199,8.2e-05,0.000126,0.000152,0.000227,0.000122,0.000179,0.000139,-9e-06,0.000159,6e-05,-1.3e-05,5.1e-05,0.000135,0.000111,9.2e-05,0.000121,6.6e-05,3.3e-05,2e-06,0.000216,9.8e-05,0.000174,4.2e-05,0.000135,0.000149,0.000114,1.8e-05,0.000145,0.000111,0.000198,0.000365,0.000236,0.000426,4.3e-05,0.000572,0.00015,0.000115,1e-06,-9.8e-05,-8e-06,2e-06,0.000173,4.8e-05,-6.1e-05,4.5e-05,-9e-06,3.8e-05,-6.6e-05,2.6e-05,0,-4.1e-05,-2.4e-05,3.4e-05,9e-06,8e-05,3.3e-05,-9e-06,-1e-05,3.3e-05,-2.9e-05,-9.3e-05,6e-06,5.5e-05,-5.3e-05,2.9e-05,-8.1e-05,-1.8e-05,-0.000109,-2e-06,-7e-06,-1.5e-05,1.5e-05,-3.4e-05,-3.9e-05,-3.4e-05,-8.7e-05,-0.000148,2.3e-05,-4.9e-05,-3.3e-05,3.3e-05,-9.5e-05,0.00013,1.9e-05,9.2e-05,6.5e-05,2.2e-05,1.7e-05,2.7e-05,7e-06
2.1e-05,-1e-06,1e-06,2e-06,0.000137,4.1e-05,-1e-06,9.5e-05,6e-05,-5e-06,-6e-06,0.000114,0.000164,0.000212,0.000107,6e-06,4.8e-05,6e-05,6.8e-05,-8.3e-05,7.3e-05,2.1e-05,0.000133,-2e-05,5.1e-05,-4.9e-05,1.5e-05,-5.9e-05,4.8e-05,-3.7e-05,7.8e-05,4.5e-05,9.5e-05,-5e-06,6.8e-05,3.8e-05,1e-06,6.9e-05,7.3e-05,2.6e-05,-4.9e-05,4e-05,-4e-06,-1.9e-05,-4.1e-05,5.5e-05,3.1e-05,0.000136,6.8e-05,-3.3e-05,-5.7e-05,-5.3e-05,-0.000167,7.9e-05,-1e-05,-3.6e-05,1e-05,-5.9e-05,3.8e-05,7.4e-05,-8.5e-05,-0.000108,0.000475,-0.00019,-1e-06,0.000152,4.9e-05,0.000357,0.000387,0.000125,9.9e-05,9.5e-05,-4e-06,0.000116,1.7e-05,1.7e-05,5.5e-05,1.9e-05,-1.2e-05,-3.2e-05,-3.2e-05,-5.8e-05,7e-06,4.1e-05,9e-06,-2.3e-05,-1.9e-05,1.3e-05,4.2e-05,1e-05,-0.000116,-5.4e-05,-2.6e-05,-9e-06,0.000101,-1.6e-05,2.1e-05,-6.8e-05,-6e-05,9e-06,2.1e-05,-7.7e-05,5e-06,-7.6e-05,-0.000129,2.1e-05,-4.3e-05,1.9e-05,3.9e-05,5.8e-05,-1.5e-05,3.1e-05,1e-06,1.5e-05,-2.9e-05,2.2e-05,-6.6e-05,-4.4e-05,3.5e-05,7.4e-05,8e-06
-4e-06,3e-05,5e-06,-1.7e-05,-2.4e-05,-4.1e-05,-1.5e-05,9e-06,1.6e-05,2.4e-05,4.9e-05,-9e-05,-5.6e-05,0,4.4e-05,-4e-05,3.5e-05,1.8e-05,2.7e-05,0,-6.5e-05,-0.000124,-3.2e-05,-0.000108,4.7e-05,6.3e-05,7.4e-05,-7.6e-05,-2e-05,-1.4e-05,-1e-05,-5.4e-05,-5.2e-05,-0.000118,2.2e-05,-0.000138,-1.8e-05,-0.000105,3.8e-05,-2.4e-05,3e-06,-7e-06,2e-06,-7.1e-05,-5.5e-05,-5.8e-05,3.6e-05,1.4e-05,-3e-05,3.1e-05,-6.6e-05,1.7e-05,-6.3e-05,-2.5e-05,-0.000192,7e-06,-9.4e-05,4.9e-05,-0.000182,-3.4e-05,-7.7e-05,6.2e-05,-4.1e-05,9e-06,-2.6e-05,0.000132,-8.6e-05,-1.4e-05,2.2e-05,3.5e-05,0.000228,3.4e-05,-1.8e-05,1e-04,-1.3e-05,1.7e-05,-1.6e-05,1.2e-05,0,-1e-05,4e-05,-1.1e-05,-1.3e-05,6e-06,5e-06,1e-06,1e-05,-1.6e-05,6e-05,2.6e-05,2.6e-05,-5e-06,-2.8e-05,2.3e-05,-3.4e-05,-7.1e-05,-1e-06,2.6e-05,9.9e-05,1.7e-05,-7.4e-05,5.2e-05,3e-05,5e-06,0.000125,-3.4e-05,4.4e-05,5.6e-05,6e-05,-4.5e-05,0,4.2e-05,2e-05,-0.000108,6e-06,-4.2e-05,-1.6e-05,-3.2e-05,-5.7e-05,-0.000138,9e-06
4e-05,-2.1e-05,9e-06,1.5e-05,-7e-06,-5e-06,-6e-06,-4.2e-05,-1e-05,-5.6e-05,-3.6e-05,8e-06,3.3e-05,-0.00012,6e-06,8e-06,-2e-06,1.2e-05,-2.1e-05,-4e-06,9.4e-05,7.6e-05,-1.7e-05,4.1e-05,-4.7e-05,-0.000124,-7.2e-05,7e-06,-1.7e-05,3.8e-05,1.3e-05,1.5e-05,-4.2e-05,6.9e-05,-0.000124,3e-06,-1.5e-05,-3.7e-05,2.1e-05,-7.1e-05,5.3e-05,-3.4e-05,8e-06,2.7e-05,2e-06,-2.6e-05,-0.000122,-0.000118,-2.4e-05,-2.9e-05,-8.1e-05,-2.4e-05,2e-06,-3.7e-05,2.8e-05,7e-06,-0.000101,3.3e-05,-1.5e-05,-5.5e-05,-4.7e-05,9e-06,-0.000128,5.1e-05,-5.9e-05,-2.3e-05,-3.8e-05,3.4e-05,-2.5e-05,2.6e-05,4.2e-05,-5.2e-05,-9.2e-05,-4e-05,3e-06,4.3e-05,-1e-05,-1.8e-05,-4e-06,4e-06,5e-06,3.3e-05,2.3e-05,-3.2e-05,3.9e-05,-1.1e-05,-1e-05,1.1e-05,-1.8e-05,1.5e-05,3.4e-05,2e-06,-2.7e-05,-1.3e-05,-5.1e-05,5e-06,-3.9e-05,1.2e-05,-4.4e-05,-4.3e-05,-3e-05,-2e-06,-3.3e-05,2e-05,1.4e-05,-1e-06,-1.7e-05,-8e-06,-3e-05,-9.6e-05,1e-04,-6.3e-05,2.1e-05,6.7e-05,1.7e-05,2e-05,0.000103,1.8e-05,3e-06,7.9e-05,-1.1e-05
-3.7e-05,2.3e-05,0,-1.9e-05,-1.2e-05,-5e-06,-9e-06,-2.1e-05,-6e-06,2e-05,1e-06,4.6e-05,-3.3e-05,-1.7e-05,-3.5e-05,-2.1e-05,-2.5e-05,-1.2e-05,2.2e-05,1e-06,-5.2e-05,1e-06,2e-05,6e-05,1.6e-05,0.000102,9e-06,4e-06,-4e-06,4e-05,-3.3e-05,2.5e-05,2.3e-05,5e-06,-1.4e-05,2.4e-05,-4e-05,-1.3e-05,-5.2e-05,-4e-06,-7e-05,-1e-06,-3.3e-05,-1.8e-05,-2.9e-05,-1.7e-05,1.3e-05,-1.5e-05,-1.3e-05,-3.9e-05,-2.5e-05,-2.9e-05,3.1e-05,1.6e-05,-1e-05,-2.7e-05,2.6e-05,-3.1e-05,3.8e-05,-8.8e-05,-1e-05,5e-05,-0.000122,-7.6e-05,7.3e-05,6.6e-05,2.4e-05,0.000106,3e-06,5e-06,-2.5e-05,2e-05,-4e-06,-6.2e-05,2e-05,3e-06,-8e-06,-1e-06,8e-06,1.1e-05,-4.3e-05,1.3e-05,6e-06,3.3e-05,-2.7e-05,1.8e-05,2e-06,-2.4e-05,-3e-06,-2e-05,-5.4e-05,-3e-06,6e-06,1.7e-05,6.2e-05,8e-05,2e-06,-1e-06,2.1e-05,3e-06,2e-05,-7e-06,3e-05,-6e-06,-4.8e-05,2.5e-05,-1e-05,-1e-05,-2.5e-05,8e-05,-6.7e-05,3.3e-05,3.2e-05,-1.7e-05,-3e-06,-1e-06,-0.000104,1.4e-05,4e-06,4e-06,8e-06
1e-05,-4e-06,5e-06,3.2e-05,-1e-06,-4e-06,4e-06,6.9e-05,-1.4e-05,5.7e-05,3.6e-05,-5.1e-05,2.4e-05,1.5e-05,-1.1e-05,5.1e-05,1e-06,-1.8e-05,-1e-06,3.6e-05,2e-05,5.2e-05,-3.1e-05,3.6e-05,-6e-06,3.1e-05,1.8e-05,1.3e-05,7e-06,-1.1e-05,9e-06,2.3e-05,3e-06,1.6e-05,4e-05,-1.5e-05,3.8e-05,5e-06,-3.8e-05,5.8e-05,-1.4e-05,1.2e-05,3.3e-05,1.1e-05,2.2e-05,1.2e-05,2.5e-05,1.8e-05,9e-06,1e-05,6.5e-05,8e-06,5.2e-05,2.5e-05,1e-05,1.1e-05,2.8e-05,-5.8e-05,2e-06,5.7e-05,2.4e-05,-6.2e-05,0.000121,9.3e-05,4e-06,-0.000161,-1.3e-05,0.000129,2.1e-05,-6e-06,-5.2e-05,2.4e-05,7.6e-05,0,-1.9e-05,-1.9e-05,-7e-06,-1.8e-05,-8e-06,1e-06,3e-05,-8e-06,-7e-06,-1.7e-05,-1.7e-05,-2e-06,-2e-06,-1e-06,-3.3e-05,5e-06,1.7e-05,-6e-06,3.7e-05,5e-06,-3.4e-05,-2.4e-05,0,0,-1.4e-05,-2.4e-05,3.8e-05,1.1e-05,3e-05,5.2e-05,2.6e-05,-1.5e-05,1.6e-05,-2.6e-05,-8e-06,-5e-06,3.6e-05,-1.4e-05,-2e-06,-2e-06,-4e-06,1.3e-05,1.6e-05,2.6e-05,6e-06,-6.3e-05,4e-06
1.1e-05,1.2e-05,5e-06,-4e-06,2.7e-05,3.6e-05,1.6e-05,-2.7e-05,2e-05,1e-05,-7e-06,2.2e-05,8e-06,5.6e-05,3e-05,3.2e-05,3.4e-05,2.7e-05,9e-06,5.5e-05,-1e-06,2.2e-05,1.8e-05,1.1e-05,1.5e-05,-2.9e-05,1.4e-05,5.7e-05,1.8e-05,2.5e-05,5.7e-05,4e-06,3.2e-05,2.8e-05,2.2e-05,-1e-05,1e-06,1e-05,-7e-06,-2.3e-05,1.2e-05,1.1e-05,1e-06,2e-05,-1.2e-05,-8e-06,0,1.3e-05,-1.9e-05,1.8e-05,7.4e-05,3.2e-05,4.7e-05,-8e-06,4.3e-05,1.1e-05,5e-06,1.6e-05,-6e-06,3.5e-05,-3e-06,-5.1e-05,-1e-05,9.9e-05,-2.6e-05,-0.000159,1.2e-05,-7.4e-05,-3.6e-05,-3e-06,-3e-05,-1.6e-05,6e-05,5.1e-05,1.6e-05,-6e-06,-1.4e-05,2e-06,-1e-06,-8e-06,-8e-06,-5e-06,8e-06,-1.5e-05,-1.3e-05,-9e-06,-2e-06,-4e-06,1.5e-05,-2e-05,-2.7e-05,-5e-06,2.4e-05,-1.5e-05,-3e-05,-3.7e-05,1.3e-05,-1.7e-05,-3e-06,2.4e-05,-3e-06,-1.2e-05,3.1e-05,-1.5e-05,-1.7e-05,-4e-06,0,0,-7e-06,2.6e-05,-1.6e-05,2.1e-05,-2.7e-05,2e-05,1e-06,-1e-05,-5e-06,0,-2e-06,2.6e-05,-5e-06
5e-06,-2e-05,2e-06,3.4e-05,-8e-06,3.4e-05,1e-05,4.7e-05,2.7e-05,1.4e-05,2e-05,3.7e-05,8e-06,2.3e-05,2.8e-05,3.1e-05,2.1e-05,2.4e-05,-3e-06,-2.2e-05,1.4e-05,9e-06,5e-06,8e-06,2.4e-05,5.2e-05,2e-06,1.3e-05,-3e-06,8e-06,-8e-06,-6e-06,-1.8e-05,-1.4e-05,-2e-05,-2.3e-05,-2.3e-05,-4e-06,9e-06,-4.6e-05,-1e-06,-5e-06,-1.5e-05,-1.9e-05,4e-06,-1.5e-05,-7.8e-05,-2.4e-05,-1.5e-05,-1.6e-05,-1e-06,1.1e-05,-3.3e-05,8e-06,-1e-05,1e-06,-1.8e-05,-2.1e-05,0,-1.6e-05,1.1e-05,6.1e-05,-4.8e-05,-9.3e-05,2.9e-05,2.6e-05,1.3e-05,-0.000103,-1.6e-05,1.9e-05,-1.7e-05,2e-06,3.2e-05,2e-06,2.3e-05,-5e-06,-1e-06,0,4e-06,0,-2e-06,1e-05,1e-06,1.6e-05,-2e-06,-1e-05,-4e-06,1.7e-05,-4e-06,8e-06,2.5e-05,1.9e-05,1e-05,-1e-06,2.6e-05,1.3e-05,-5e-06,5e-06,1.1e-05,8e-06,-6e-06,1.5e-05,-1.3e-05,-9e-06,-3e-06,3e-06,-4e-06,1e-05,-9e-06,-2.2e-05,-1e-06,-3.1e-05,2e-05,7e-06,-3e-06,1.7e-05,1.1e-05,-1e-05,-1.2e-05,1e-05,-4e-06
-1.7e-05,8e-06,-2e-06,-1.7e-05,1e-06,-1.6e-05,5e-06,-9e-06,-4e-06,-1.8e-05,-1e-05,4.5e-05,-2e-06,6e-06,-8e-06,-3.8e-05,-6e-06,1e-06,6e-06,-2.2e-05,3.5e-05,-2.8e-05,1.1e-05,-4.2e-05,-1.6e-05,-2.3e-05,-1e-06,-3.2e-05,2e-06,-2.2e-05,-2.1e-05,-1.1e-05,-2e-06,-2.2e-05,-1.7e-05,-5e-06,-1.1e-05,-4.2e-05,-2e-06,7e-06,-1e-05,-2.1e-05,2e-06,-8e-06,-2.4e-05,-1.3e-05,2.5e-05,-3.5e-05,-3.6e-05,-5.4e-05,-4.6e-05,-3.8e-05,-3.2e-05,-2e-06,-8e-06,5e-06,-4.4e-05,-1.4e-05,-2.7e-05,-1.8e-05,0,2.9e-05,5.5e-05,-2e-05,-1.4e-05,1e-04,-3e-06,-0.000122,2.3e-05,2.2e-05,0,-1.5e-05,-2.9e-05,-2.9e-05,4e-06,-7e-06,-1e-05,4e-06,0,0,9e-06,1e-06,-2e-06,-2e-06,2e-05,7e-06,-4e-06,-3e-06,0,-1.1e-05,-1.2e-05,4e-06,-2e-06,-5e-06,1.5e-05,1.7e-05,-2e-06,1.1e-05,-9e-06,-1.7e-05,-2.8e-05,-1.4e-05,-5e-06,1.3e-05,-1.3e-05,6e-06,9e-06,7e-06,1.8e-05,1.8e-05,7e-06,4e-06,-1.5e-05,-3.1e-05,2e-06,-1.5e-05,1e-06,-1e-05,4e-06,-2.4e-05,1.2e-05
1.6e-05,5e-06,-1e-06,-3e-06,3e-06,-1.6e-05,-3e-06,8e-06,-7e-06,-2.3e-05,6e-06,-3.4e-05,6e-06,-7e-06,-9e-06,1e-06,-6e-06,1.2e-05,1e-05,1.9e-05,-3.6e-05,-2.2e-05,6e-06,-1.7e-05,1.1e-05,-5.5e-05,-2e-06,-2.7e-05,-4e-06,-1.1e-05,3e-06,-6e-06,-4e-06,2e-06,3e-06,-2.8e-05,-9e-06,-1.9e-05,-2.2e-05,-3e-05,-3.4e-05,-8e-06,-1.4e-05,-2e-06,-4e-06,-2.4e-05,-2.8e-05,-1e-06,-1.4e-05,1e-06,-7.3e-05,-6e-06,-3.7e-05,-6e-06,-4.4e-05,-1.1e-05,-3e-05,-8e-06,-3.3e-05,-2.6e-05,-3.9e-05,-6e-06,3.9e-05,0,-2.3e-05,9.4e-05,-4e-06,7.5e-05,1.3e-05,-1e-05,1e-05,1e-06,-2.1e-05,0,-2e-06,5e-06,1e-06,5e-06,3e-06,3e-06,-1.2e-05,-1e-05,-2e-06,1e-05,1e-05,1.1e-05,-7e-06,-2e-06,1e-06,-1.6e-05,-4e-06,1.1e-05,-1.5e-05,-3e-06,-3e-05,2e-06,1e-05,8e-06,-3e-06,2e-06,-5e-06,0,-1.5e-05,-4e-06,1.1e-05,-3e-06,-6e-06,1e-06,0,-1.5e-05,-2.2e-05,-1.2e-05,1.9e-05,1.9e-05,-5e-06,1.1e-05,-7e-06,-2e-06,0,3e-06,-6e-06
-3e-06,-5e-06,-1e-06,-1.9e-05,-3e-06,-5e-06,-8e-06,-1.9e-05,1e-06,-1.1e-05,-7e-06,-3.3e-05,1e-06,-8e-06,6e-06,-2.3e-05,0,-1.4e-05,-3e-06,-3.2e-05,1e-05,-1.2e-05,-9e-06,1.1e-05,-2.6e-05,1.7e-05,-1.4e-05,-1.5e-05,-5e-06,3e-06,3e-06,3e-06,1e-06,6e-06,-5e-06,-1.5e-05,-2e-06,-1.3e-05,-2e-05,1.7e-05,1.5e-05,8e-06,3e-06,-2e-06,-5e-06,-3e-06,-4e-06,-1.8e-05,5e-06,1.7e-05,-1.9e-05,6e-06,1.1e-05,-6e-06,-8e-06,1e-06,-1.6e-05,-3e-06,2e-06,-2.9e-05,-1e-05,-5.7e-05,-2.6e-05,-5.1e-05,2.4e-05,-2.2e-05,-1.1e-05,1.7e-05,-3e-06,-7e-06,1.1e-05,1.3e-05,-1.4e-05,9e-06,0,6e-06,1e-06,0,-1e-06,-3e-06,-4e-06,-4e-06,2e-06,3e-06,-1e-05,-6e-06,-3e-06,-9e-06,1e-06,-4e-06,1.5e-05,4e-06,-1.3e-05,2e-06,1e-05,-9e-06,1e-06,-6e-06,9e-06,-6e-06,1.3e-05,5e-06,0,-7e-06,8e-06,-4e-06,-4e-06,-1.1e-05,5e-06,1e-05,2.3e-05,8e-06,-8e-06,0,-3e-06,-5e-06,-1.4e-05,1.2e-05,-8e-06,1.7e-05,-3e-06
-9e-06,0,0,8e-06,-5e-06,-1.2e-05,-1e-06,-1.6e-05,-4e-06,2e-05,-2e-06,2e-06,-6e-06,-2.5e-05,4e-06,1.1e-05,-1e-06,-1.4e-05,-1.4e-05,9e-06,-1.8e-05,2.4e-05,-2.2e-05,7e-06,1.1e-05,-1e-06,0,-6e-06,-1.1e-05,1.6e-05,-1e-06,4e-06,2e-06,3e-06,4e-06,1.5e-05,-5e-06,1e-06,-1e-05,-1.2e-05,-3e-06,0,7e-06,3e-06,-3e-06,-6e-06,-2.8e-05,-8e-06,-1.3e-05,-1.7e-05,2.7e-05,0,2.7e-05,5e-06,2.6e-05,3e-06,0,-1.5e-05,-3e-06,-1.7e-05,5e-06,3e-05,-3.6e-05,3e-05,-8e-06,6e-06,-6e-06,1.9e-05,2.5e-05,1.2e-05,1.7e-05,-5e-06,1.1e-05,-1.9e-05,5e-06,2e-06,-2e-06,-1e-06,-4e-06,0,1.4e-05,3e-06,-5e-06,-1.2e-05,-2e-06,-2e-06,-3e-06,3e-06,6e-06,-3e-06,-6e-06,4e-06,-8e-06,-8e-06,1.3e-05,-4e-06,-2e-06,-1e-05,-7e-06,1.6e-05,1e-05,-6e-06,-9e-06,9e-06,-1.1e-05,9e-06,5e-06,-4e-06,3e-06,-3.4e-05,-1e-05,-6e-06,2e-06,-1.1e-05,0,5e-06,5e-06,9e-06,-1e-06,-1.7e-05,5e-06
1e-05,3e-06,0,8e-06,4e-06,6e-06,4e-06,1.7e-05,-5e-06,8e-06,9e-06,6e-06,-2e-06,-1.6e-05,-8e-06,7e-06,-1e-06,-4e-06,-2e-06,2.1e-05,1.6e-05,1.5e-05,-1e-06,1.5e-05,-1.1e-05,1.2e-05,-8e-06,3e-05,2e-06,-1e-06,-1e-05,-1e-06,-8e-06,4e-06,-1e-05,-2.8e-05,-1.1e-05,1e-06,4e-06,-1.2e-05,0,-4e-06,-7e-06,0,2e-06,-8e-06,2.5e-05,2e-06,3e-06,-1.5e-05,3.2e-05,-1.1e-05,2e-05,3e-06,-1.2e-05,-4e-06,9e-06,-2e-05,2e-06,1.9e-05,0,7e-06,2e-06,3.7e-05,-7e-06,-3.3e-05,4e-06,0,-4e-06,6e-06,9e-06,-5e-06,3.3e-05,-1.4e-05,1e-06,5e-06,1e-06,-4e-06,-2e-06,-1e-06,-7e-06,-2e-06,5e-06,3e-06,-1e-05,-4e-06,-3e-06,-2e-06,-3e-06,-1.3e-05,3e-06,-6e-06,-3e-06,-2e-06,-1.5e-05,9e-06,3e-06,0,3e-06,-5e-06,8e-06,7e-06,-6e-06,-8e-06,5e-06,-3e-06,-2e-06,5e-06,-8e-06,1.1e-05,5e-06,1e-06,-1e-06,-9e-06,0,-8e-06,6e-06,2e-06,1e-06,-1e-06,1e-06
-5e-06,-3e-06,2e-06,6e-06,-2e-06,2.2e-05,1e-06,-4e-06,4e-06,1.6e-05,-6e-06,1.8e-05,0,1.6e-05,-3e-06,2.4e-05,-1e-06,9e-06,6e-06,-4e-06,2e-06,5e-06,1.2e-05,5e-06,5e-06,1.7e-05,9e-06,1.5e-05,6e-06,-1e-05,1e-06,-2e-06,8e-06,-3e-06,-5e-06,-3e-06,-6e-06,-2e-06,5e-06,1e-05,-5e-06,-2e-06,0,-6e-06,-7e-06,-6e-06,-1.5e-05,-3e-06,-4e-06,1.1e-05,1.8e-05,4e-06,-1.4e-05,-3e-06,1.5e-05,4e-06,-5e-06,7e-06,-2e-06,1.4e-05,3e-06,-1.7e-05,3e-06,-2.2e-05,1.2e-05,-4.6e-05,0,4.5e-05,-1.5e-05,-1e-06,-5e-06,1e-06,2.3e-05,-1e-06,0,1e-06,-2e-06,-3e-06,-1e-06,1e-06,3e-06,-4e-06,0,-2e-06,2e-06,3e-06,-3e-06,1e-06,-1e-06,1e-06,-2e-06,-1e-06,5e-06,1e-06,2e-06,2e-06,-1e-06,4e-06,-1e-06,3e-06,-9e-06,-5e-06,-2e-06,-7e-06,-2e-06,-5e-06,-1e-06,9e-06,-1e-06,1.4e-05,8e-06,-3e-06,5e-06,1.7e-05,-4e-06,4e-06,0,-6e-06,6e-06,1.2e-05,-4e-06
-1e-06,0,-1e-06,-2e-06,2e-06,1e-06,0,1.6e-05,5e-06,-1.1e-05,6e-06,-1.2e-05,9e-06,3.1e-05,5e-06,-8e-06,4e-06,5e-06,4e-06,-1e-06,-1.9e-05,-2.9e-05,-3e-06,-2.5e-05,2e-06,-3.1e-05,-2e-06,-1.8e-05,-2e-06,-5e-06,9e-06,-5e-06,-4e-06,-9e-06,0,-7e-06,-2e-06,-3e-06,0,3e-06,-5e-06,0,0,1e-06,-2e-06,-6e-06,-1.2e-05,-3e-06,-9e-06,6e-06,-1.3e-05,9e-06,-1.2e-05,-2e-06,-1.3e-05,-3e-06,-1e-05,0,-4e-06,-2e-06,1e-06,-2e-05,-1.1e-05,0,-1.1e-05,-4.8e-05,1e-06,2e-05,0,3e-06,-9e-06,-1e-06,8e-06,5e-06,0,-5e-06,1e-06,-1e-06,1e-06,1e-06,-2e-06,1e-06,-1e-06,-4e-06,8e-06,1e-06,-3e-06,1e-06,-4e-06,-4e-06,-1e-06,-2e-06,6e-06,-2e-06,1.5e-05,-6e-06,-3e-06,8e-06,-3e-06,-1.2e-05,-1.1e-05,-2e-06,5e-06,7e-06,4e-06,4e-06,2e-06,-3e-06,-3e-06,6e-06,-5e-06,5e-06,-2e-06,-1.1e-05,-1e-06,1e-06,-1e-05,-8e-06,-3e-06,-5e-06,3e-06
2e-06,-1e-06,0,-5e-06,0,-9e-06,1e-06,-4e-06,-3e-06,-1.4e-05,-6e-06,1e-05,-5e-06,9e-06,3e-06,-1.1e-05,1e-06,2e-06,-6e-06,-8e-06,1.5e-05,-1e-06,-8e-06,-1.6e-05,-9e-06,-3e-06,-7e-06,-9e-06,-3e-06,2e-06,-6e-06,-2e-06,0,-2e-06,8e-06,-1.2e-05,-4e-06,-7e-06,-7e-06,-1e-05,9e-06,-3e-06,-3e-06,1e-06,-3e-06,-5e-06,-5e-06,-6e-06,2e-06,-1.5e-05,-3.2e-05,-1e-05,-1.9e-05,1e-06,-3e-06,1e-06,-6e-06,-8e-06,-5e-06,-1.3e-05,-6e-06,1.3e-05,1.7e-05,-1e-06,-1e-06,0,0,-4e-06,3e-06,-2e-06,-1.1e-05,3e-06,-2.2e-05,-9e-06,0,-3e-06,0,1e-06,0,-1e-06,0,5e-06,1e-06,4e-06,-2e-06,-2e-06,-1e-06,2e-06,1e-06,-5e-06,7e-06,-4e-06,3e-06,1e-06,-1e-05,-2e-06,0,-3e-06,5e-06,8e-06,-3e-06,3e-06,1e-05,-4e-06,-1e-06,3e-06,-1e-06,-5e-06,-5e-06,4e-06,1e-05,1e-06,1.2e-05,8e-06,1e-06,2e-06,1e-06,0,-4e-06,-1.2e-05,-2e-06
4e-06,2e-06,0,-6e-06,-1e-06,-5e-06,-1e-06,-6e-06,-2e-06,-8e-06,2e-06,5e-06,1e-06,-1.8e-05,-4e-06,-1.5e-05,-3e-06,1e-06,-4e-06,-8e-06,-9e-06,-7e-06,0,9e-06,8e-06,7e-06,0,-7e-06,-3e-06,2e-06,-5e-06,1e-06,-2e-06,5e-06,-5e-06,-2e-06,-5e-06,1e-06,-4e-06,-1e-06,-5e-06,2e-06,1e-06,-3e-06,-1e-06,-4e-06,1.7e-05,4e-06,3e-06,-4e-06,-1.9e-05,-6e-06,2e-06,-3e-06,-3e-06,-1e-06,-3e-06,-4e-06,-1e-06,-4e-06,0,2.6e-05,8e-06,-3.5e-05,6e-06,6.4e-05,-2e-06,-6.8e-05,-4e-06,-3e-06,-1e-06,-2e-06,-1.5e-05,-8e-06,-1e-06,-1e-06,1e-06,1e-06,-2e-06,0,0,1e-06,0,1e-06,3e-06,0,-1e-06,0,1e-06,5e-06,-1.2e-05,-4e-06,4e-06,-3e-06,-1.1e-05,3e-06,0,-5e-06,0,4e-06,5e-06,-2e-06,6e-06,4e-06,-4e-06,-6e-06,0,-3e-06,7e-06,-1.6e-05,-1e-05,3e-06,-9e-06,-2e-06,0,-3e-06,-6e-06,5e-06,2e-06,1.7e-05,-2e-06
-8e-06,-1e-06,0,1e-06,-1e-06,-6e-06,-2e-06,-1e-06,0,2e-06,0,-1.1e-05,-5e-06,-1.7e-05,-2e-06,-2e-06,-3e-06,-9e-06,1e-06,-1e-06,8e-06,1.3e-05,5e-06,7e-06,-1.2e-05,-1.7e-05,-1e-06,-9e-06,3e-06,-5e-06,0,2e-06,0,-1e-06,-1e-05,-8e-06,-6e-06,-1e-06,3e-06,4e-06,-1e-06,0,0,3e-06,-2e-06,0,-1.6e-05,0,-1e-06,1.4e-05,7e-06,5e-06,1.1e-05,-1e-06,-7e-06,-2e-06,2e-06,3e-06,2e-06,-8e-06,-2e-06,-2e-05,-1.6e-05,1.8e-05,-7e-06,3e-05,-1e-06,-1.2e-05,-1e-06,4e-06,1e-06,-4e-06,-2e-06,8e-06,3e-06,-2e-06,0,1e-06,-1e-06,1e-06,5e-06,-1e-06,-1e-06,1e-06,-3e-06,2e-06,0,-1e-06,0,2e-06,8e-06,-3e-06,-1e-06,0,1.6e-05,4e-06,0,-3e-06,-2e-06,-3e-06,6e-06,3e-06,3e-06,8e-06,4e-06,1e-06,1e-06,2e-06,2e-06,6e-06,3e-06,0,2e-06,-4e-06,0,3e-06,7e-06,7e-06,3e-06,-7e-06,3e-06
6e-06,-2e-06,0,0,1e-06,-3e-06,0,-1.1e-05,-1e-06,7e-06,-3e-06,-1.5e-05,6e-06,-5e-06,2e-06,7e-06,1e-06,-2e-06,4e-06,1.1e-05,-1e-05,3e-06,-1e-06,2e-06,9e-06,1.8e-05,3e-06,1.4e-05,-1e-06,5e-06,2e-06,1e-06,3e-06,2e-06,4e-06,-1e-06,0,6e-06,4e-06,-1e-06,0,0,-2e-06,1e-06,0,-4e-06,5e-06,-1e-06,4e-06,2e-06,2e-05,3e-06,1.2e-05,2e-06,1.2e-05,2e-06,5e-06,-6e-06,1e-06,4e-06,-1e-06,-1.3e-05,-4e-06,1.5e-05,4e-06,1.2e-05,-1e-06,6e-06,7e-06,3e-06,5e-06,3e-06,1.4e-05,-7e-06,0,1e-06,0,0,1e-06,-1e-06,-5e-06,0,1e-06,3e-06,-2e-06,1e-06,-1e-06,-1e-06,1e-06,1e-06,-4e-06,2e-06,2e-06,1e-06,0,-3e-06,-2e-06,2e-06,0,-2e-06,7e-06,-4e-06,-3e-06,-4e-06,-3e-06,2e-06,-3e-06,5e-06,-1e-06,-1e-06,0,0,-8e-06,3e-06,1e-06,-2e-06,0,2e-06,2e-06,-8e-06,2e-06
0,1e-06,0,7e-06,-2e-06,1.1e-05,0,1.3e-05,-1e-06,1.1e-05,4e-06,1e-06,-4e-06,7e-06,1e-06,1.4e-05,1e-06,-1e-06,-2e-06,3e-06,-2e-06,6e-06,-5e-06,6e-06,-8e-06,3e-06,-4e-06,1e-05,-1e-06,2e-06,1e-06,-2e-06,-3e-06,0,8e-06,-9e-06,0,-2e-06,2e-06,1e-05,5e-06,1e-06,2e-06,-2e-06,-2e-06,0,-4e-06,3e-06,-3e-06,-1.3e-05,1.9e-05,-4e-06,-2e-06,0,-3e-06,-1e-06,3e-06,3e-06,2e-06,8e-06,4e-06,1e-06,7e-06,-8e-06,0,-2.3e-05,0,1.4e-05,1e-06,-3e-06,4e-06,0,1.9e-05,-9e-06,-1e-06,3e-06,0,-1e-06,1e-06,1e-06,1e-06,1e-06,0,-4e-06,5e-06,-2e-06,0,0,-2e-06,3e-06,1e-06,-3e-06,1e-06,1e-06,-1.1e-05,-6e-06,0,6e-06,1e-06,-3e-06,-6e-06,1e-06,0,-1e-06,0,-2e-06,2e-06,-1e-06,2e-06,4e-06,-4e-06,4e-06,0,8e-06,1e-06,1e-06,-4e-06,-5e-06,-3e-06,1e-05,-4e-06
-4e-06,1e-06,0,1e-06,2e-06,7e-06,1e-06,-7e-06,1e-06,-1e-06,-4e-06,2e-05,1e-06,5e-06,-3e-06,2e-06,0,3e-06,-3e-06,-5e-06,1e-05,-9e-06,-2e-06,-7e-06,5e-06,-1e-05,1e-06,-2e-06,-1e-06,-7e-06,-4e-06,-1e-06,2e-06,-5e-06,-4e-06,-6e-06,-4e-06,3e-06,-3e-06,-1.2e-05,-1e-06,-1e-06,0,2e-06,0,-1e-06,1.3e-05,0,1e-06,2e-06,0,-2e-06,-7e-06,-1e-06,1e-06,0,0,-4e-06,0,8e-06,0,2e-05,0,9e-06,-4e-06,-1.8e-05,1e-06,6e-06,-5e-06,-3e-06,2e-06,-1e-06,7e-06,3e-06,1e-06,1e-06,0,-1e-06,1e-06,-1e-06,-1e-06,0,-1e-06,-1e-06,-2e-06,-1e-06,1e-06,1e-06,1e-06,5e-06,2e-06,4e-06,-1e-06,0,5e-06,3e-06,1e-06,0,2e-06,4e-06,-6e-06,3e-06,-6e-06,3e-06,3e-06,0,0,-2e-06,-2e-06,-8e-06,7e-06,-1e-06,3e-06,-6e-06,1e-06,1e-06,-6e-06,-5e-06,0,-1e-06,1e-06
4e-06,-2e-06,-1e-06,-1e-06,-1e-06,-5e-06,1e-06,8e-06,1e-06,-5e-06,3e-06,-2e-06,-4e-06,5e-06,-1e-06,-5e-06,-1e-06,2e-06,1e-06,2e-06,-7e-06,-6e-06,4e-06,-1.4e-05,0,6e-06,0,-3e-06,2e-06,-3e-06,0,0,-2e-06,0,-5e-06,1e-06,-2e-06,-2e-06,-2e-06,1e-06,-6e-06,0,-1e-06,-2e-06,-2e-06,-2e-06,-1.6e-05,0,0,1.1e-05,-1.4e-05,6e-06,-9e-06,0,-1e-06,1e-06,-1e-06,5e-06,-1e-06,-3e-06,-1e-06,-1e-05,-1.3e-05,0,5e-06,-2.5e-05,0,-5e-06,2e-06,1e-06,0,0,-5e-06,7e-06,0,1e-06,0,-1e-06,-1e-06,1e-06,1e-06,-2e-06,2e-06,1e-06,0,0,0,-1e-06,-1e-06,3e-06,-5e-06,1e-06,-2e-06,1e-06,5e-06,4e-06,-1e-06,-3e-06,-2e-06,-1e-06,-3e-06,-3e-06,-2e-06,-5e-06,0,2e-06,1e-06,-4e-06,-2e-06,6e-06,-5e-06,2e-06,2e-06,-4e-06,1e-06,-2e-06,2e-06,-1e-06,3e-06,-8e-06,2e-06
2e-06,1e-06,0,-4e-06,-1e-06,-3e-06,-1e-06,-2e-06,-1e-06,-8e-06,-2e-06,-7e-06,4e-06,3e-06,3e-06,-9e-06,1e-06,2e-06,3e-06,-8e-06,5e-06,-6e-06,4e-06,4e-06,-4e-06,-1.1e-05,2e-06,-7e-06,0,4e-06,2e-06,1e-06,1e-06,2e-06,2e-06,-1.1e-05,-1e-06,0,0,4e-06,7e-06,2e-06,3e-06,1e-06,1e-06,1e-06,9e-06,-2e-06,1e-06,-4e-06,-1.5e-05,-1e-06,0,0,-5e-06,-1e-06,0,-4e-06,0,-5e-06,0,-1.2e-05,7e-06,-2.3e-05,-4e-06,-2e-05,0,1.8e-05,1e-06,1e-06,-2e-06,-1e-06,-1.6e-05,-2e-06,0,0,-1e-06,0,-2e-06,0,1e-06,-1e-06,-1e-06,-2e-06,1e-06,2e-06,1e-06,1e-06,0,4e-06,6e-06,2e-06,-5e-06,0,-1e-05,-2e-06,0,-4e-06,-1e-06,3e-06,3e-06,1e-06,-7e-06,1e-06,1e-06,0,-1e-06,2e-06,0,-2e-06,7e-06,-3e-06,0,3e-06,0,1e-06,2e-06,4e-06,0,6e-06,-1e-06
-6e-06,0,0,-4e-06,2e-06,-2e-06,-1e-06,-5e-06,0,-3e-06,0,-2e-06,-1e-06,3e-06,1e-06,-7e-06,0,-2e-06,0,-1e-06,-6e-06,7e-06,-4e-06,8e-06,6e-06,-1e-06,-2e-06,-7e-06,-1e-06,4e-06,-2e-06,1e-06,1e-06,0,3e-06,-1e-06,-1e-06,0,2e-06,2e-06,0,-1e-06,-1e-06,1e-06,-2e-06,-1e-06,-1e-06,2e-06,2e-06,-9e-06,-5e-06,-4e-06,6e-06,-1e-06,3e-06,0,1e-06,0,1e-06,-2e-06,-1e-06,7e-06,1e-05,1e-05,-1e-06,1.5e-05,0,1.5e-05,-4e-06,-1e-06,-2e-06,1e-06,-1e-05,-9e-06,0,-2e-06,0,1e-06,0,0,-1e-06,0,1e-06,2e-06,-3e-06,0,0,-1e-06,0,2e-06,-4e-06,1e-06,-3e-06,1e-06,3e-06,-3e-06,1e-06,1e-06,2e-06,-3e-06,7e-06,-2e-06,1e-06,0,-2e-06,-2e-06,1e-06,4e-06,-1e-06,3e-06,-1e-06,2e-06,1e-06,1e-06,1e-06,0,1e-06,5e-06,-1e-06,4e-06,-1e-06
4e-06,-1e-06,0,4e-06,-2e-06,-5e-06,0,4e-06,0,3e-06,1e-06,6e-06,0,-8e-06,-3e-06,3e-06,-1e-06,-2e-06,-3e-06,5e-06,4e-06,5e-06,-5e-06,0,-8e-06,1.4e-05,-2e-06,5e-06,-1e-06,-3e-06,1e-06,0,-2e-06,1e-06,-1e-06,-1e-06,0,2e-06,1e-06,-2e-06,-4e-06,0,0,-2e-06,0,0,4e-06,1e-06,0,6e-06,8e-06,2e-06,6e-06,0,0,0,1e-06,-2e-06,1e-06,0,0,1e-05,-5e-06,4e-06,5e-06,2.7e-05,0,-6e-06,0,0,-3e-06,1e-06,3e-06,6e-06,0,-2e-06,-1e-06,1e-06,1e-06,0,-2e-06,0,0,1e-06,4e-06,-1e-06,1e-06,0,-1e-06,4e-06,1e-06,2e-06,0,1e-06,9e-06,1e-06,0,5e-06,-1e-06,-2e-06,3e-06,2e-06,-2e-06,-3e-06,1e-06,0,-2e-06,-1e-06,1e-06,-5e-06,-1e-06,-3e-06,-1e-06,0,1e-06,1e-06,-4e-06,1e-06,-2e-06,-9e-06,1e-06
0,1e-06,0,0,1e-06,4e-06,0,-9e-06,0,8e-06,-2e-06,-2e-06,-1e-06,-8e-06,-1e-06,6e-06,0,-1e-06,0,-1e-06,2e-06,4e-06,3e-06,2e-06,8e-06,-8e-06,2e-06,9e-06,1e-06,-2e-06,1e-06,0,2e-06,0,1e-06,-7e-06,-3e-06,0,-1e-06,0,2e-06,1e-06,1e-06,1e-06,-1e-06,-1e-06,-1e-05,-2e-06,-1e-06,7e-06,1.4e-05,3e-06,0,0,-1e-06,-1e-06,2e-06,5e-06,0,2e-06,1e-06,-1e-06,-6e-06,-4e-06,-5e-06,3e-05,0,-2.2e-05,2e-06,-1e-06,0,-2e-06,1.2e-05,7e-06,-1e-06,0,0,1e-06,1e-06,0,1e-06,-1e-06,-1e-06,-1e-06,0,0,0,-1e-06,1e-06,0,2e-06,0,2e-06,0,-8e-06,3e-06,0,1e-06,0,4e-06,-3e-06,1e-06,7e-06,2e-06,1e-06,1e-06,0,-3e-06,2e-06,-2e-06,5e-06,2e-06,0,-2e-06,0,-1e-06,-3e-06,-3e-06,2e-06,4e-06,0
-3e-06,0,0,5e-06,0,7e-06,0,1e-05,0,4e-06,3e-06,-9e-06,0,-5e-06,2e-06,1e-05,1e-06,-1e-06,2e-06,4e-06,-5e-06,-5e-06,4e-06,-1e-06,-6e-06,3e-06,0,1e-06,1e-06,1e-06,-1e-06,0,-1e-06,-2e-06,-1e-06,-2e-06,-1e-06,0,-1e-06,-2e-06,1e-06,-2e-06,-1e-06,0,-1e-06,0,8e-06,2e-06,1e-06,-7e-06,8e-06,-1e-06,-3e-06,0,6e-06,1e-06,0,-5e-06,0,4e-06,0,-1.7e-05,4e-06,1.2e-05,2e-06,-3e-06,0,-4e-06,0,-2e-06,1e-06,0,1.2e-05,-7e-06,0,0,0,0,-1e-06,0,0,0,0,2e-06,-2e-06,0,0,0,0,0,-3e-06,-1e-06,4e-06,0,-4e-06,0,0,-2e-06,-1e-06,0,-5e-06,-3e-06,0,1e-06,-2e-06,-1e-06,0,0,0,4e-06,-5e-06,-4e-06,2e-06,0,0,1e-06,-1e-06,-5e-06,2e-06,5e-06,0
2e-06,0,0,-3e-06,0,-2e-06,0,-5e-06,1e-06,0,-2e-06,4e-06,2e-06,9e-06,0,-2e-06,0,1e-06,1e-06,-2e-06,4e-06,-1e-06,-2e-06,-8e-06,4e-06,4e-06,0,0,0,0,0,0,1e-06,0,-2e-06,-5e-06,0,0,0,2e-06,1e-06,0,0,-1e-06,0,-1e-06,-3e-06,-1e-06,-1e-06,-5e-06,-3e-06,-3e-06,-4e-06,-1e-06,-6e-06,-1e-06,-1e-06,3e-06,0,2e-06,0,6e-06,4e-06,-1e-06,2e-06,-1.4e-05,0,-5e-06,-1e-06,1e-06,2e-06,0,-1e-06,-2e-06,0,1e-06,0,-1e-06,-1e-06,0,0,1e-06,0,-2e-06,1e-06,0,0,-1e-06,0,0,4e-06,0,4e-06,0,9e-06,-2e-06,0,-4e-06,0,-2e-06,-3e-06,2e-06,6e-06,0,2e-06,0,-1e-06,2e-06,0,1e-06,4e-06,3e-06,-4e-06,-1e-06,0,-1e-06,5e-06,-2e-06,-2e-06,-6e-06,1e-06
2e-06,0,0,1e-06,0,-3e-06,0,4e-06,0,-5e-06,1e-06,8e-06,-2e-06,6e-06,-2e-06,-4e-06,0,1e-06,-1e-06,-1e-06,-2e-06,-2e-06,-4e-06,1e-06,-1e-06,-1e-05,-2e-06,-2e-06,-1e-06,-2e-06,0,0,-1e-06,1e-06,3e-06,-2e-06,0,-1e-06,1e-06,3e-06,-3e-06,1e-06,1e-06,1e-06,-1e-06,0,3e-06,0,0,8e-06,-1e-05,3e-06,0,0,3e-06,1e-06,0,-2e-06,0,-4e-06,0,1.1e-05,-4e-06,-1.2e-05,-5e-06,-2.1e-05,0,2e-05,1e-06,0,2e-06,0,-1e-05,5e-06,0,2e-06,0,-1e-06,0,0,1e-06,0,0,-1e-06,-3e-06,-1e-06,0,1e-06,0,-2e-06,-3e-06,-1e-06,2e-06,0,-1e-06,0,0,0,1e-06,-2e-06,2e-06,0,-2e-06,1e-06,-1e-06,1e-06,1e-06,-1e-06,-1e-06,2e-06,-3e-06,-4e-06,2e-06,6e-06,0,1e-06,-1e-06,3e-06,-1e-06,-1e-06,-1e-06
-3e-06,0,0,-5e-06,0,0,0,0,0,-6e-06,0,1e-06,2e-06,3e-06,0,-1.1e-05,0,1e-06,0,-3e-06,1e-06,2e-06,2e-06,8e-06,-2e-06,7e-06,1e-06,-9e-06,0,0,1e-06,0,0,0,2e-06,-6e-06,-1e-06,1e-06,1e-06,-5e-06,2e-06,-1e-06,-1e-06,-1e-06,0,0,-8e-06,0,2e-06,3e-06,-1e-05,1e-06,3e-06,0,-2e-06,0,0,2e-06,0,-3e-06,-1e-06,-1e-06,-1e-06,6e-06,4e-06,-1.9e-05,0,-1.5e-05,1e-06,-1e-06,1e-06,0,-1.3e-05,4e-06,0,1e-06,0,0,1e-06,0,-1e-06,0,0,0,2e-06,0,0,-1e-06,0,-3e-06,1e-06,0,0,0,-8e-06,1e-06,0,3e-06,-1e-06,2e-06,6e-06,1e-06,4e-06,1e-06,0,0,-1e-06,0,-1e-06,-3e-06,1e-06,4e-06,-5e-06,-4e-06,0,-1e-06,-3e-06,4e-06,0,8e-06,0
0,0,0,1e-06,-1e-06,-4e-06,0,-4e-06,1e-06,-1e-06,-1e-06,-8e-06,-3e-06,-6e-06,2e-06,1e-06,0,-1e-06,1e-06,-1e-06,-1e-06,0,4e-06,-2e-06,4e-06,-1e-06,1e-06,0,1e-06,4e-06,-1e-06,0,1e-06,1e-06,-4e-06,-3e-06,-1e-06,-1e-06,0,2e-06,1e-06,0,1e-06,0,-1e-06,-1e-06,1e-05,0,-1e-06,-9e-06,-2e-06,-3e-06,2e-06,0,-2e-06,-1e-06,0,-4e-06,0,-1e-06,0,-1e-05,5e-06,-4e-06,-1e-06,-2e-06,0,3e-06,-1e-06,-1e-06,0,0,-5e-06,-5e-06,0,0,0,0,1e-06,0,0,0,0,-1e-06,1e-06,1e-06,-1e-06,1e-06,0,-1e-06,2e-06,-1e-06,-2e-06,0,7e-06,0,0,2e-06,0,0,2e-06,-1e-06,-5e-06,0,0,-1e-06,1e-06,1e-06,0,2e-06,2e-06,-4e-06,3e-06,1e-06,-1e-06,1e-06,-3e-06,2e-06,2e-06,-6e-06,1e-06
4e-06,0,0,0,2e-06,0,0,6e-06,0,4e-06,2e-06,-1e-06,3e-06,-1e-06,0,2e-06,0,0,0,3e-06,-2e-06,1e-06,-1e-06,-3e-06,-6e-06,-5e-06,0,5e-06,0,0,-1e-06,0,-2e-06,0,-1e-06,-1e-06,-1e-06,1e-06,-1e-06,-1e-06,-2e-06,1e-06,1e-06,1e-06,0,0,-7e-06,1e-06,0,-1e-06,6e-06,0,-1e-06,0,5e-06,1e-06,0,3e-06,0,3e-06,0,-2e-06,0,-3e-06,-3e-06,1.3e-05,0,-3e-06,0,0,-1e-06,0,7e-06,-2e-06,0,-1e-06,0,0,0,0,1e-06,0,-1e-06,1e-06,-1e-06,0,0,-1e-06,0,-3e-06,-4e-06,0,-2e-06,-1e-06,3e-06,0,0,-1e-06,1e-06,-1e-06,-2e-06,-2e-06,2e-06,0,-1e-06,0,-2e-06,0,1e-06,-4e-06,-3e-06,4e-06,-1e-06,-3e-06,-1e-06,-1e-06,1e-06,-2e-06,0,-3e-06,0
