7e-05,2e-06,1e-05,1.5e-05,1.2e-05,4.4e-05,2.1e-05,3.5e-05,3e-05,4.3e-05,4.4e-05,1e-05,2e-05,1.5e-05,3.2e-05,2e-06,1.1e-05,2.6e-05,9e-06,3.6e-05,2.5e-05,3e-06,1.7e-05,1.6e-05,3.2e-05,6.6e-05,3e-05,5e-06,1.4e-05,1.4e-05,5e-06,1.4e-05,2.1e-05,7.3e-05,1.1e-05,5e-05,3e-06,3e-06,1.3e-05,2.1e-05,1.6e-05,1.6e-05,1.2e-05,1e-06,1.5e-05,2.7e-05,2.7e-05,3.3e-05,4.9e-05,1.5e-05,1.3e-05,9e-06,3.5e-05,9e-06,6e-06,9e-06,0,3e-06,3e-06,4e-06,6e-06,1.2e-05,1e-06,2e-06,4.1e-05,1.3e-05,1.2e-05,3.1e-05,7e-06,1e-06,2.6e-05,5e-06,2.3e-05,3.9e-05,2.4e-05,2.6e-05,2.8e-05,1.1e-05,1.7e-05,5e-06,4.4e-05,2.8e-05,2.5e-05,2e-06,1e-06,5.1e-05,8e-06,4e-06,3.5e-05,2e-05,1.5e-05,1.2e-05,2.5e-05,5.1e-05,0,2.8e-05,8e-06,9e-06,6e-06,0,7e-06,3.1e-05,3e-05,1.1e-05,1.1e-05,2.1e-05,1.7e-05,2.3e-05,6e-06,1e-05,2.5e-05,1.5e-05,1.5e-05,3e-06,5e-06,3e-05,1.5e-05,5.2e-05,1e-06,2.8e-05,2.5e-05
0.000119,6.9e-05,5.1e-05,8.7e-05,0.00012,0.000182,0.000147,6.5e-05,0.00014,7.4e-05,0.000103,4.8e-05,2.4e-05,3.3e-05,3.1e-05,9.5e-05,0.000186,0.000113,7.4e-05,5.8e-05,7.5e-05,5.4e-05,6e-05,6.8e-05,0.000113,0.000105,0.00011,5.3e-05,5.1e-05,5.5e-05,2e-05,4.8e-05,8.7e-05,0.000125,7.5e-05,6.6e-05,5.8e-05,4.4e-05,3.3e-05,8.5e-05,5e-05,7.7e-05,4.4e-05,3.4e-05,0.000108,0.000138,8e-05,4.3e-05,9.3e-05,9.2e-05,0.000107,1.9e-05,8.3e-05,6.8e-05,5.2e-05,1.5e-05,1e-05,2.3e-05,4.4e-05,4e-05,3e-05,4.4e-05,6.4e-05,2e-05,0.000118,6.3e-05,4.9e-05,6.6e-05,2.9e-05,2.9e-05,6.5e-05,3.4e-05,4.2e-05,0.000103,0.000133,5.5e-05,0.000111,5.2e-05,0.00015,7.8e-05,9.8e-05,5.1e-05,3.2e-05,6.1e-05,3e-05,8.7e-05,9.4e-05,0.000146,0.000129,0.000104,3.4e-05,5.3e-05,9.3e-05,7.5e-05,7e-06,6.5e-05,3.9e-05,3.5e-05,3.4e-05,4.5e-05,4.7e-05,7.6e-05,3.8e-05,5.6e-05,1.7e-05,5e-05,3e-05,9.2e-05,4.6e-05,1.3e-05,3e-05,2.4e-05,7e-06,8.8e-05,8.8e-05,4e-05,5.2e-05,0.000125,0.000116,3e-05,5.8e-05
0.000152,0.000174,8.6e-05,9.2e-05,0.00012,0.000149,8.2e-05,1e-04,0.000139,5.1e-05,0.000172,0.000134,0.00012,0.000141,0.000103,0.000122,0.000204,0.000182,0.000217,0.000116,4.6e-05,0.000118,0.000105,5.1e-05,0.000115,0.000142,0.000209,6.9e-05,6.3e-05,0.000105,4.6e-05,6e-05,9e-05,8.2e-05,0.000186,9.6e-05,6e-05,9.6e-05,6e-06,8.7e-05,6.2e-05,8.2e-05,0.000169,9.1e-05,6.6e-05,0.000184,0.000179,0.00022,0.000117,5.9e-05,7.6e-05,9.4e-05,1.2e-05,8.4e-05,6e-05,0.000131,9.3e-05,0.000107,8.6e-05,3.6e-05,7.3e-05,0.000114,0.000103,9.8e-05,0.000111,0.000176,7.1e-05,7.7e-05,0.00014,6.4e-05,6.1e-05,8.6e-05,9.8e-05,2.6e-05,7.7e-05,7.1e-05,0.000103,6.4e-05,0.000214,0.000179,0.000203,0.000116,9.3e-05,0.000108,6.9e-05,4.3e-05,5.6e-05,0.000112,3.2e-05,3.7e-05,1.9e-05,0.000103,2e-05,0.000124,2e-05,7.9e-05,4.7e-05,4.1e-05,7.6e-05,0.000109,5.7e-05,4.8e-05,8.4e-05,9.9e-05,4.2e-05,7.9e-05,0.000111,7.2e-05,5.8e-05,7.5e-05,3.4e-05,4.5e-05,7.2e-05,0.000102,6.5e-05,6e-05,0.000115,2.4e-05,0.00015,5.6e-05,3.5e-05
0.000244,0.000182,0.00013,5.6e-05,0.000162,0.000128,8.8e-05,6.6e-05,0.000109,5.9e-05,9.9e-05,1.9e-05,0.000136,7.1e-05,0.000103,8.2e-05,0.000152,7.6e-05,6.6e-05,0.000104,3.1e-05,0.000144,0.000162,0.000156,1e-04,0.000138,0.000246,0.000169,8.9e-05,4.6e-05,4.4e-05,5.7e-05,4.4e-05,5.9e-05,0.00012,0.000113,8.2e-05,0.000174,0.000109,0.000122,8.3e-05,0.000148,0.000112,2.4e-05,1.7e-05,0.000198,0.000131,0.000133,0.000137,8.3e-05,0.000132,9.5e-05,6.2e-05,2.6e-05,3.5e-05,0.000164,0.000113,0.000126,0.000117,8.4e-05,0.000176,7.9e-05,5.5e-05,0.000129,0.000124,0.000101,5e-05,9e-06,0.00012,4.7e-05,9.5e-05,0.000116,5.4e-05,0.000149,5.8e-05,7.3e-05,0.000137,0.000123,0.000182,0.000154,0.000105,0.000161,0.000142,0.000131,4.3e-05,3.8e-05,5.7e-05,6.8e-05,0.000135,0.000122,7.6e-05,0.000117,7.7e-05,0.000152,1.3e-05,3.5e-05,7.9e-05,0.000115,5.1e-05,4.2e-05,2.7e-05,3.6e-05,4.2e-05,6.4e-05,8.2e-05,7.5e-05,4.4e-05,4.5e-05,3.1e-05,5e-05,9.6e-05,2.9e-05,0.000153,0.000181,0.000149,1.6e-05,8e-05,5.9e-05,0.000147,0.000128,2.6e-05
0.000122,9e-05,0.000186,8.3e-05,0.000153,9.5e-05,0.000117,1.3e-05,0.000188,0.000198,2e-04,0.000167,0.000157,0.000264,0.000296,0.000231,0.000257,3.4e-05,0.000126,6.7e-05,0.000128,5.9e-05,5e-05,2e-05,0.000226,0.000103,0.000136,0.000138,4.3e-05,0.000187,3.6e-05,0.000106,8.4e-05,0.000241,0.000234,6.4e-05,0.000153,0.000135,9.6e-05,3.5e-05,0.000132,0.000138,0.000106,6.8e-05,0.000174,0.000143,4.3e-05,0.000203,0.00011,6.9e-05,0.000157,7.5e-05,1.1e-05,7.5e-05,7.2e-05,0.000161,3.4e-05,0.000149,9e-05,0.000136,0.000123,0.000115,0.000163,8.3e-05,0.000142,8.9e-05,4.2e-05,0.000126,0.000122,8.1e-05,0.000146,3.7e-05,0.000118,0.000193,5.1e-05,0.000136,0.000127,4.1e-05,0.000268,6.9e-05,0.000182,4.1e-05,0.000107,5.9e-05,5.9e-05,0.000119,0.000102,6.9e-05,7.6e-05,1e-05,9e-06,0.000122,0.000147,0.000159,5e-05,6e-05,5.4e-05,3.8e-05,3.8e-05,1.3e-05,5.2e-05,4e-05,0.000105,3.4e-05,7.8e-05,4.3e-05,0.000125,6.2e-05,2.6e-05,3.2e-05,0.000141,7.3e-05,0.000138,4.1e-05,4e-05,6.5e-05,3.4e-05,3.9e-05,0.000131,7.1e-05,1.3e-05
0.000178,0.000195,0.00015,0.000113,0.00012,0.000148,0.000101,0.00019,0.000245,0.000256,0.000169,0.000137,0.000302,0.000102,0.000149,0.000135,0.000137,0.000116,0.000189,0.000188,3e-04,0.000187,9.2e-05,0.000108,0.000273,0.000284,0.000183,0.000174,0.000237,0.000243,0.000229,0.000277,0.000133,0.000255,0.000111,0.000169,0.000208,0.000134,8.4e-05,7.8e-05,0.000173,0.000234,0.000112,0.000239,0.000305,0.000248,0.000223,0.000141,5.7e-05,0.000184,0.000122,9.2e-05,5.7e-05,0.000126,0.000239,0.000225,0.000174,0.000165,0.000283,0.000128,0.000147,0.00013,0.000153,0.000274,0.000214,0.000278,0.000197,0.000202,0.00013,0.000105,0.000215,0.000288,0.000312,0.00039,0.000289,0.000268,0.000105,0.000111,0.00022,0.000261,9.2e-05,0.000241,0.000214,0.000227,0.000198,0.000298,0.000247,0.000338,0.000195,4.4e-05,4.7e-05,0.000154,0.000339,0.000488,0.000251,7.5e-05,4.3e-05,2.7e-05,0.000107,8.1e-05,0.000116,7.7e-05,0.000175,0.000232,0.000212,6.9e-05,0.000254,0.000273,0.000116,5e-05,0.000146,0.000185,0.00016,3.5e-05,0.000135,0.000114,0.000116,3e-05,0.00014,0.000113,6.9e-05
0.000368,0.000337,0.000187,5.4e-05,0.000195,0.000418,0.00026,0.00029,5e-05,9.3e-05,0.000207,0.000165,0.000339,0.000335,0.000198,0.000195,0.000158,9e-05,0.000329,0.000213,0.000178,0.000165,0.000101,0.00014,0.000163,0.000112,9.9e-05,0.000139,9.6e-05,9.7e-05,5.6e-05,0.000147,0.000152,0.000252,0.000495,0.000389,9.3e-05,0.000161,0.000124,9.8e-05,0.000191,8.9e-05,0.000221,0.000152,7.4e-05,0.000147,0.000232,0.000229,9.4e-05,0.000204,7.2e-05,0.000138,1e-04,0.000144,0.000184,0.000221,0.00031,0.000278,0.000139,0.000233,0.000151,0.000192,5.3e-05,0.00025,0.000283,9.3e-05,0.000166,0.000266,0.000218,0.000119,0.000269,0.000199,0.000102,0.000293,0.000276,0.000226,0.000284,0.000389,0.000413,0.000267,0.00017,0.000299,0.000313,8.6e-05,7.1e-05,0.000123,4.6e-05,0.000259,0.000179,0.000139,0.000138,0.000258,0.000376,0.000321,0.000381,0.000204,0.000103,8e-05,0.000124,3.8e-05,0.00019,0.000226,0.000169,0.000189,0.000122,0.000128,0.00035,0.000383,0.000276,0.000184,4.5e-05,0.000216,0.00016,9.5e-05,0.000268,0.000165,7.3e-05,2.7e-05,0.000105,9.9e-05,9.8e-05
0.00034,0.000125,0.000186,0.000205,0.000123,0.000334,0.000123,0.000138,8.2e-05,8.8e-05,0.000154,0.000207,0.000274,0.000204,4.1e-05,0.000353,0.000342,0.000205,0.000311,0.000311,0.000236,0.000109,5.8e-05,6.1e-05,0.000189,0.000266,0.000165,8.6e-05,4.2e-05,2e-06,9.7e-05,9.6e-05,2.8e-05,0.000186,0.000459,0.000158,8.2e-05,0.000181,0.000105,6e-05,3.4e-05,8.4e-05,0.000189,0.00021,0.000109,2.9e-05,0.000176,0.000157,0.000134,0.00025,7.1e-05,0.000216,0.000142,0.000208,0.000108,7.1e-05,0.00012,6.9e-05,0.000144,9.3e-05,0.000124,0.000294,0.000149,0.000186,0.000122,2.7e-05,0.000183,6.8e-05,8.1e-05,0.000135,0.000134,7.9e-05,2.3e-05,0.000206,8.3e-05,9.3e-05,0.00018,0.000281,8.5e-05,5.8e-05,2.4e-05,0.000187,8.1e-05,5.6e-05,3.4e-05,8.9e-05,0.000171,4e-05,2.2e-05,6.2e-05,9.5e-05,9.8e-05,0.000129,2e-04,0.000228,9.8e-05,9e-05,7.8e-05,4e-05,9.6e-05,0.000173,0.000159,0.000106,0.000207,7.4e-05,0.000116,0.00016,0.000126,9.7e-05,7.5e-05,0.000102,0.00015,9.2e-05,0.000128,0.000262,9e-05,5.6e-05,3e-05,9e-06,7.9e-05,6.9e-05
0.00019,0.000154,8.5e-05,0.000194,0.000355,0.000117,0.000157,0.000168,0.000185,0.000187,1.6e-05,0.000168,0.000202,0.000103,6.6e-05,0.000287,0.000184,4e-05,0.000221,0.000145,2e-04,3.3e-05,5.8e-05,1e-04,0.000283,0.000215,0.000262,0.000281,0.000147,0.000137,0.000207,0.000114,3e-05,0.000159,0.000201,8e-05,0.000179,6.1e-05,0.000143,6.4e-05,0.000155,7.7e-05,5.6e-05,0.000155,1.7e-05,0.000157,1.2e-05,8.1e-05,0.000114,0.000159,0.000228,0.000166,5.6e-05,0.000113,0.000145,0.000106,5e-05,5.6e-05,2.4e-05,0.000117,0.000127,0.000156,0.000132,0.000147,6.7e-05,0.000177,0.000112,0.000104,8.2e-05,0.000219,0.000205,3.8e-05,1.4e-05,0.000177,7.4e-05,8e-05,0.000215,0.000287,0.000164,8.7e-05,0.000129,5.2e-05,0.000123,3.2e-05,5.1e-05,6.2e-05,0.000176,7.6e-05,0.000112,0.000102,3.2e-05,0.000153,7.3e-05,7e-05,8.2e-05,8.2e-05,8.4e-05,4.4e-05,0.000156,0.00019,0.000161,3.4e-05,0.000137,0.000113,0.000139,0.000182,7.2e-05,6.9e-05,1e-04,9.3e-05,0.000103,0.000142,1.3e-05,0.000131,0.000134,0.000107,0.000133,0.000116,5.4e-05,6e-05,4.3e-05
0.000281,0.000324,0.000271,0.000108,0.000182,0.000216,3.6e-05,0.000102,0.000154,0.000184,0.000204,0.000171,0.000272,8.1e-05,0.000108,0.000126,3e-04,0.000379,0.000186,0.000139,0.00022,0.000187,0.000145,0.000287,0.000439,0.000533,0.000492,0.000319,0.000274,0.000206,0.000179,0.00012,0.000126,0.000111,0.000125,0.000234,0.000265,0.00012,0.000169,0.000181,0.000358,0.000237,0.000121,0.000162,0.00024,0.000339,0.000182,5.8e-05,5.5e-05,0.000251,0.000392,0.000385,0.000208,6.9e-05,0.000169,5e-05,0.000122,8.7e-05,2.8e-05,3.8e-05,7.4e-05,0.000153,0.000255,0.000306,0.000203,0.00021,0.00027,0.000109,0.000138,0.000237,0.000266,0.000232,0.000128,0.000228,0.000282,0.000113,0.000132,0.000322,0.000179,4.3e-05,0.000123,0.000223,0.000285,0.000242,0.00023,0.000171,0.000191,0.000214,0.000199,9.9e-05,7.6e-05,0.000101,0.000155,0.00016,0.000138,3.2e-05,0.000198,9.8e-05,0.000261,0.000276,0.000122,2.3e-05,0.000189,0.000181,0.000268,0.000114,0.000181,9.1e-05,0.000108,4.8e-05,7.7e-05,6.1e-05,3.1e-05,0.000119,0.000168,0.000138,0.000217,0.000119,0.000175,0.000142,0.000161
0.000154,3.1e-05,0.00014,0.000219,6.8e-05,0.000156,0.000129,6.9e-05,0.000115,0.000231,0.000266,8e-05,9.3e-05,9.7e-05,0.000162,0.000175,0.000253,0.00024,0.000122,0.000201,7.5e-05,0.000102,0.000134,0.000205,0.000289,6.6e-05,8.5e-05,5.5e-05,0.000187,9.8e-05,9.8e-05,3.2e-05,8.9e-05,0.000134,0.000108,9.1e-05,9.5e-05,0.00016,8.2e-05,1e-04,0.000219,0.000118,0.000108,0.000206,0.00023,0.000112,9.7e-05,7.3e-05,0.000112,0.000177,0.000142,5.3e-05,8.6e-05,0.000112,6.9e-05,0.000183,0.000112,4.5e-05,2.6e-05,8.5e-05,3.2e-05,0.00011,0.000151,4.7e-05,0.000183,0.000131,0.000159,6.7e-05,0.000103,3.3e-05,0.000154,1.7e-05,9.7e-05,6.8e-05,0.000135,0.000105,0.000182,0.000118,4e-05,4.8e-05,0.000131,0.000166,0.00012,7.6e-05,0.000111,0.000199,8.1e-05,0.000148,9e-05,0.00015,6e-05,8.8e-05,9.3e-05,0.000106,2.7e-05,4.8e-05,0.00019,0.000126,0.000198,2.5e-05,5.7e-05,9.2e-05,0.000124,6.1e-05,0.000144,5.8e-05,0.000148,9e-05,6.6e-05,6.7e-05,8.8e-05,8.6e-05,5.2e-05,0.000158,0.000173,9.9e-05,7.9e-05,5.2e-05,0.000115,3.1e-05,9.3e-05
0.000141,0.000176,9.5e-05,0.000244,0.000158,0.00019,0.000254,0.000154,0.000169,8.6e-05,0.000125,0.000148,1.8e-05,3.2e-05,0.000171,9.5e-05,9.4e-05,5.3e-05,0.000116,9.8e-05,5.9e-05,7e-05,0.000121,0.000134,0.000114,0.000101,0.000152,7.3e-05,0.000134,9.3e-05,4.6e-05,5.9e-05,1.9e-05,0.000117,7.7e-05,1.8e-05,9.7e-05,0.000137,8.9e-05,1.8e-05,0.000226,0.000186,1e-04,0.000165,6.1e-05,1.5e-05,8.5e-05,0.000113,0.000155,0.000119,1.2e-05,5e-05,0.000116,0.000125,5.2e-05,0.000104,4.1e-05,4.7e-05,5.6e-05,7.6e-05,5.8e-05,4.9e-05,0.000133,9e-05,0.000131,0.000127,6.8e-05,4.5e-05,3.7e-05,3.4e-05,8.9e-05,0.000101,9.5e-05,0.00012,2.7e-05,0.000103,0.000167,0.000193,5e-05,4.5e-05,0.000113,4.9e-05,0.000157,8.3e-05,0.000117,6.8e-05,0.000114,2.8e-05,7.1e-05,0.000145,0.000118,1e-05,0.000132,6.6e-05,6.1e-05,7.7e-05,9.8e-05,6.8e-05,0.00015,0.000101,9e-05,0.00012,0.000149,0.000124,1.8e-05,1.8e-05,4.3e-05,0.000101,5.4e-05,2.9e-05,8.1e-05,6.4e-05,3.6e-05,0.000131,2.8e-05,7.5e-05,4.8e-05,2.6e-05,8.5e-05,0.000127,1.5e-05
3.9e-05,0.000103,0.000134,8.5e-05,2.5e-05,9.3e-05,0.000142,7.4e-05,5.4e-05,9.5e-05,3.9e-05,4.5e-05,3.9e-05,9.3e-05,8.4e-05,0.000109,0.000154,0.000123,8.9e-05,2.7e-05,5.1e-05,8e-05,9.3e-05,0.000101,2.2e-05,0.000102,0.000184,9.7e-05,2e-05,8.4e-05,3.1e-05,5.6e-05,3.6e-05,0.000115,5.1e-05,8.1e-05,0.000111,4.1e-05,3.3e-05,3.3e-05,0.000172,0.000101,3.4e-05,4.5e-05,0.000108,0.000144,9.9e-05,0.000117,7.9e-05,7.5e-05,0.000106,5.4e-05,0.000167,2.9e-05,0.000135,6.7e-05,6e-05,4.8e-05,8e-05,9.1e-05,4e-05,7.4e-05,1e-04,5.5e-05,7.2e-05,7.4e-05,7.1e-05,3.6e-05,8.8e-05,8.2e-05,0.000152,0.000101,0.000165,2.2e-05,5.8e-05,9.7e-05,6e-05,5.2e-05,6.8e-05,0.000129,2.5e-05,4.6e-05,0.000104,3e-05,4.8e-05,7e-05,2.8e-05,3.8e-05,4.7e-05,5.9e-05,1.3e-05,9.4e-05,4.3e-05,6.3e-05,7.6e-05,3.1e-05,9.2e-05,9.6e-05,0.000118,5.2e-05,2.1e-05,1.2e-05,6.9e-05,1e-05,6.4e-05,3.7e-05,4.4e-05,7.5e-05,6.4e-05,2.1e-05,4.4e-05,3.7e-05,3.6e-05,0.000109,9.6e-05,9.5e-05,0.000135,5.6e-05,3.1e-05,8.9e-05,4.9e-05
3.8e-05,3e-05,6.3e-05,8e-05,0.000118,7.8e-05,7e-05,7.2e-05,3.4e-05,0.000134,2e-06,2.5e-05,4.2e-05,0.000105,3e-05,8e-05,0.000181,5.4e-05,2.1e-05,6.5e-05,7e-05,5.4e-05,0.000123,5.4e-05,0.000108,9.7e-05,8.8e-05,4.7e-05,4.2e-05,1.5e-05,3.6e-05,5.8e-05,4.1e-05,8.8e-05,0.000126,6e-05,6.4e-05,0.00012,3.3e-05,5e-05,0.000173,7.1e-05,0.000105,3.5e-05,0.000162,6.4e-05,5.3e-05,0.000148,0.000112,9.1e-05,6.4e-05,0.000121,0.000115,7e-05,0.000244,0.000138,5.1e-05,5.8e-05,3.7e-05,8e-05,3.9e-05,0.000118,3.8e-05,0.000124,6.7e-05,2.5e-05,6.3e-05,4.1e-05,0.000137,9.3e-05,0.000167,5e-05,0.000109,9.1e-05,8.9e-05,7.4e-05,6e-05,6.5e-05,7.3e-05,0.000128,0.000118,6.3e-05,9e-05,0.000128,6.2e-05,2.3e-05,4.4e-05,3.9e-05,6.6e-05,0.000113,0.00011,9.2e-05,0.000122,7.6e-05,9.8e-05,6.6e-05,6.9e-05,6.8e-05,0.000101,1.4e-05,4.3e-05,0.000102,7.1e-05,5.7e-05,3.8e-05,3.4e-05,8.1e-05,3.4e-05,3.1e-05,7.8e-05,5.2e-05,4.5e-05,6e-05,9e-05,3e-05,2.8e-05,5.8e-05,6e-05,7.5e-05,4.1e-05,5.2e-05
5.8e-05,1e-04,0.000107,6.6e-05,0.000111,4.5e-05,0.000126,0.000164,0.000132,0.000266,0.000141,2.9e-05,4.4e-05,0.000107,0.000102,5.7e-05,0.000189,0.000176,8e-05,9.9e-05,8.2e-05,0.000111,0.000119,0.00014,0.000104,8e-05,2.9e-05,4.9e-05,8.8e-05,9e-05,8.9e-05,7.1e-05,7.6e-05,2.6e-05,0.000108,0.00013,7e-05,0.000101,9.1e-05,8.9e-05,0.000212,0.000189,0.000122,0.000131,0.000142,0.000113,7.3e-05,0.000135,8.6e-05,0.000126,3.7e-05,8.5e-05,0.00014,0.000107,0.000153,2e-04,0.000142,9.4e-05,0.000123,0.000161,0.000132,0.000117,0.000197,0.000183,0.000108,4.4e-05,7.2e-05,7e-05,6.2e-05,6.5e-05,9.1e-05,7e-05,0.000158,0.00012,0.000147,2e-04,9e-05,3.6e-05,0.000122,0.000224,0.000101,4.5e-05,8.4e-05,0.000155,9.9e-05,0.00011,6.8e-05,5.3e-05,5.2e-05,4.2e-05,0.000117,5.9e-05,7.1e-05,0.000103,6.2e-05,8.8e-05,4.1e-05,1.9e-05,0.000105,6.5e-05,5.6e-05,0.000124,7.2e-05,3.2e-05,5.9e-05,7.6e-05,5.7e-05,5.9e-05,4.5e-05,7e-05,0.000121,0.000115,0.000144,8.6e-05,3.2e-05,3.5e-05,2.8e-05,8.5e-05,0.000181,0.000166,9.6e-05
0.000141,0.000129,4.6e-05,1.6e-05,0.000106,9.6e-05,7e-05,9e-05,4.1e-05,0.000157,9.3e-05,5.6e-05,3.4e-05,3.4e-05,5.8e-05,2.9e-05,0.000122,4.9e-05,8e-05,5.9e-05,2.6e-05,8.7e-05,7.9e-05,0.000115,0.000126,9.1e-05,8e-05,4.9e-05,7.8e-05,3.9e-05,5.7e-05,0.000122,5.7e-05,6.3e-05,6.5e-05,6.7e-05,5.5e-05,8e-06,5.4e-05,7e-06,1e-04,1e-04,4.4e-05,0.00011,6.3e-05,0.000113,4.8e-05,8.9e-05,1.7e-05,3.4e-05,2.3e-05,3.6e-05,3.9e-05,3.9e-05,0.000113,9.1e-05,6.2e-05,5.1e-05,6.4e-05,4.9e-05,9.3e-05,1e-04,0.000128,6.1e-05,4.9e-05,7.7e-05,1e-04,7.1e-05,9.1e-05,4.1e-05,1.9e-05,3.9e-05,0.000111,0.000148,9.5e-05,6.1e-05,4.3e-05,8.9e-05,9.2e-05,7.5e-05,0.00011,9.8e-05,1.6e-05,8.2e-05,6e-06,9e-05,9.4e-05,5.7e-05,5.3e-05,5.1e-05,9.3e-05,7.6e-05,7.1e-05,7e-05,0.00015,6.2e-05,6.8e-05,6.7e-05,8.8e-05,9.9e-05,0.000118,4.2e-05,1.9e-05,2.9e-05,8.9e-05,4.9e-05,5.8e-05,4.3e-05,6.3e-05,0.00011,6.7e-05,6.5e-05,7.8e-05,7.8e-05,8.7e-05,6e-05,0.000125,8.8e-05,8.4e-05,7.7e-05,4.4e-05
4.9e-05,8.4e-05,3.5e-05,3.1e-05,7.8e-05,2.2e-05,9.6e-05,8e-06,4.2e-05,7.7e-05,0.00013,2.5e-05,2.4e-05,4.5e-05,7e-05,2.5e-05,0.000136,8.3e-05,1.9e-05,0.000126,8.3e-05,0.000116,0.000149,0.000129,0.000101,1e-04,4.8e-05,6.3e-05,5.7e-05,7.5e-05,6.8e-05,9.1e-05,3.3e-05,4.9e-05,6.1e-05,1.3e-05,4.5e-05,1.2e-05,7.7e-05,6.8e-05,5.3e-05,4.5e-05,4.5e-05,7.4e-05,8.4e-05,4.5e-05,5e-05,8e-05,6.1e-05,6.1e-05,6.6e-05,6e-05,4.6e-05,1.7e-05,6e-05,8.4e-05,3.5e-05,7.2e-05,6.7e-05,6.1e-05,6.3e-05,3.4e-05,0.000116,6.8e-05,5.9e-05,4.8e-05,0.000124,2.5e-05,3.2e-05,9.1e-05,8e-06,1.9e-05,5.9e-05,6e-05,8.2e-05,2.8e-05,6.5e-05,7.5e-05,3.9e-05,5.5e-05,7.8e-05,3e-05,6.7e-05,1.7e-05,6.3e-05,9.4e-05,6.6e-05,8.4e-05,8.2e-05,4.2e-05,2.2e-05,3.1e-05,7.9e-05,7.5e-05,5.6e-05,3.3e-05,8e-06,6e-05,5.5e-05,6e-05,6.4e-05,1.2e-05,4.6e-05,2.1e-05,7.9e-05,5.9e-05,7e-05,1.2e-05,5.8e-05,7.4e-05,5e-05,5.6e-05,1e-04,3.7e-05,5.2e-05,5.4e-05,6.1e-05,1.6e-05,4.9e-05,5.8e-05,7e-06
8.8e-05,0.000105,7.7e-05,4.1e-05,2.7e-05,0.000101,0.000124,0.000111,0.000108,4.6e-05,0.000107,0.000142,7.4e-05,4.2e-05,7.7e-05,8.2e-05,8.8e-05,0.000147,6e-05,0.00013,0.000127,5.9e-05,6.5e-05,0.000115,5e-05,3.9e-05,2e-05,5.3e-05,4.4e-05,3.5e-05,4.4e-05,0.000163,0.000126,3.9e-05,1.6e-05,6.7e-05,8.3e-05,7.6e-05,5.9e-05,0.000166,0.000143,4.7e-05,0.000101,6.8e-05,1.4e-05,6e-05,0.000108,0.000128,5.6e-05,5e-06,7.7e-05,7.3e-05,7.1e-05,4.8e-05,0.000117,0.000114,9.5e-05,9.8e-05,7.2e-05,9.3e-05,7.6e-05,2.7e-05,1.7e-05,0.00011,0.000136,0.000115,0.000134,0.000102,5.8e-05,0.000108,9.4e-05,2.8e-05,2.7e-05,6.2e-05,4.1e-05,5.3e-05,6.1e-05,0.000112,7.1e-05,3.6e-05,6.5e-05,8.1e-05,9e-05,7.6e-05,4.6e-05,6.3e-05,9.2e-05,9.7e-05,4e-05,0.000107,0.000107,6.1e-05,0.000126,0.000122,9e-05,5.5e-05,3.1e-05,5.9e-05,6.7e-05,9.4e-05,0.000118,9.5e-05,0.000115,0.000114,3.9e-05,3.8e-05,7e-05,8.8e-05,9.7e-05,0.000183,0.000194,0.000134,6e-06,1.7e-05,3.9e-05,8.9e-05,7.3e-05,2.7e-05,1.5e-05,4.9e-05,3.6e-05
4.6e-05,6e-05,7.2e-05,4.4e-05,2.2e-05,0.000103,3e-05,6.2e-05,7.5e-05,5e-05,9.3e-05,0.000128,7.3e-05,6.1e-05,1.8e-05,3.6e-05,9.5e-05,9.2e-05,0.000106,0.000134,5.2e-05,4.4e-05,3.4e-05,0.000114,0.000122,0.000115,6.8e-05,4.7e-05,1.4e-05,3.2e-05,4.9e-05,0.000123,6.3e-05,3.5e-05,2e-05,9e-05,9.5e-05,5.1e-05,0.000111,7.6e-05,8e-05,0.000105,0.000105,3.4e-05,3e-05,2.7e-05,5.5e-05,7.3e-05,4.5e-05,1.7e-05,8e-05,1e-05,3.3e-05,1.1e-05,0.000123,3.7e-05,0.000115,0.000144,0.000134,4e-05,4.7e-05,5.5e-05,5.8e-05,0.000114,4.1e-05,5e-05,0.00011,5.8e-05,3.2e-05,0.000118,8.7e-05,3.6e-05,4.4e-05,0.000104,6.8e-05,2e-05,9.5e-05,5e-05,3.9e-05,3.3e-05,2.8e-05,0.000103,0.000117,2.8e-05,1.4e-05,9.5e-05,6.1e-05,5e-06,1.6e-05,6.1e-05,7.9e-05,3e-05,0.000109,7.4e-05,8e-05,6.7e-05,3.3e-05,7e-05,0.00012,4e-05,9.5e-05,4.9e-05,8.8e-05,2.9e-05,3.5e-05,2.8e-05,5.7e-05,2.6e-05,3.4e-05,0.000105,9.9e-05,4.9e-05,6.1e-05,4e-06,2.8e-05,3.4e-05,1.7e-05,1.8e-05,4.7e-05,6.2e-05,5.4e-05
6.2e-05,1.3e-05,4.2e-05,1.1e-05,2.9e-05,3.9e-05,1.4e-05,4e-05,4e-05,5.5e-05,4.1e-05,3.1e-05,7e-06,3.1e-05,4.7e-05,2e-06,3.5e-05,4.3e-05,6.2e-05,4.3e-05,4.6e-05,5.8e-05,2.6e-05,6.3e-05,7.3e-05,0.000109,8.3e-05,4.9e-05,6e-06,1.7e-05,4.1e-05,0.000109,0.000116,8.7e-05,4.1e-05,8.8e-05,3.4e-05,1.7e-05,5.9e-05,8e-05,4.8e-05,8.5e-05,2.4e-05,1.7e-05,6.8e-05,3.1e-05,3.5e-05,4.1e-05,4.6e-05,6.7e-05,8.9e-05,8.4e-05,5.3e-05,1.1e-05,7.9e-05,9.3e-05,8.4e-05,6.2e-05,2.3e-05,5.4e-05,2.7e-05,2.5e-05,3.2e-05,4.5e-05,3e-06,4.9e-05,1.1e-05,3.2e-05,8.8e-05,9e-05,3.4e-05,4.5e-05,2.9e-05,7.4e-05,2.7e-05,2.8e-05,5.9e-05,1.4e-05,3e-05,5.7e-05,6.3e-05,4.3e-05,0.000102,6.3e-05,4.3e-05,6.3e-05,0.000101,7.8e-05,4.7e-05,3.4e-05,5.8e-05,1.4e-05,3.1e-05,4.7e-05,1.5e-05,5.5e-05,5e-05,3.6e-05,3.8e-05,7.2e-05,8.2e-05,8.7e-05,1.8e-05,3.9e-05,9e-06,9e-06,4.3e-05,3.9e-05,1.7e-05,6.3e-05,4.9e-05,1.5e-05,4.2e-05,4.3e-05,3.1e-05,4.2e-05,5.7e-05,2.7e-05,4.1e-05,5.9e-05,1.2e-05
1.8e-05,2.3e-05,3.1e-05,4e-05,3.2e-05,3.2e-05,5.1e-05,1.1e-05,4.8e-05,4.3e-05,4.2e-05,8e-05,4e-05,1.5e-05,1.3e-05,3.1e-05,2.1e-05,3.2e-05,4.7e-05,2.6e-05,6e-05,5.8e-05,2.9e-05,7.1e-05,5e-05,0.000102,1.1e-05,2.3e-05,5e-06,9e-06,2.5e-05,8e-05,0.000103,1.5e-05,3.1e-05,3.2e-05,4.6e-05,6e-05,4e-05,7e-06,5.6e-05,4.2e-05,1.5e-05,9e-06,7.1e-05,7.1e-05,7.2e-05,8.4e-05,2.9e-05,3.2e-05,1.1e-05,4.3e-05,3.5e-05,1.9e-05,2.4e-05,2.2e-05,3.8e-05,2.9e-05,3.8e-05,6.6e-05,2.4e-05,4.2e-05,6.2e-05,5.9e-05,4.9e-05,3.5e-05,6.8e-05,2.6e-05,8.6e-05,3.9e-05,5e-06,2.5e-05,5.7e-05,3.6e-05,7.4e-05,4.3e-05,3.9e-05,7.3e-05,5.2e-05,4.7e-05,8.3e-05,8.5e-05,4.6e-05,7.5e-05,4e-05,8e-05,0.000103,3.7e-05,3.1e-05,4.5e-05,1.7e-05,2.6e-05,4.4e-05,3.4e-05,7.2e-05,6.4e-05,1.2e-05,3.3e-05,2.9e-05,4.2e-05,1.8e-05,5.7e-05,5.1e-05,4.8e-05,4.4e-05,3.9e-05,5e-05,3e-05,2.8e-05,8.6e-05,5.6e-05,3e-05,9e-06,2.6e-05,2.5e-05,1.5e-05,1.7e-05,1.1e-05,4.3e-05,1.6e-05,4.3e-05
5.8e-05,4.5e-05,4.2e-05,6.6e-05,8.1e-05,5.9e-05,4e-05,1.9e-05,5.8e-05,7.3e-05,2.9e-05,5.6e-05,3.1e-05,3.1e-05,1.5e-05,4.8e-05,4.7e-05,2.8e-05,3.4e-05,2.2e-05,2.8e-05,4.1e-05,4e-05,6.7e-05,2.7e-05,3.3e-05,8.2e-05,9.9e-05,4.5e-05,1.8e-05,2.1e-05,5.2e-05,3.1e-05,4.4e-05,3.2e-05,1.8e-05,5.2e-05,3.7e-05,6e-06,1.6e-05,3.9e-05,2.1e-05,6.4e-05,3.6e-05,6.5e-05,2.5e-05,1.7e-05,4.2e-05,2.6e-05,7e-05,3.7e-05,7e-06,5.3e-05,4.9e-05,3.7e-05,3.6e-05,3.7e-05,1.5e-05,7.6e-05,4.4e-05,7.9e-05,1.9e-05,3.4e-05,5.2e-05,0.000109,7e-05,0.000103,6.7e-05,4.3e-05,4.2e-05,2.6e-05,1.6e-05,2e-05,9e-06,5.6e-05,6.6e-05,0.000107,5.4e-05,3.9e-05,1.2e-05,3.6e-05,4.6e-05,1.1e-05,5.8e-05,2.5e-05,3.8e-05,4.8e-05,6.7e-05,4.6e-05,5.9e-05,3.3e-05,4.1e-05,2.9e-05,3.2e-05,6.6e-05,3e-05,5e-05,2.8e-05,5.3e-05,2.9e-05,3.4e-05,6.5e-05,5.2e-05,3e-05,1.1e-05,2.7e-05,4.8e-05,2.7e-05,2.5e-05,6.8e-05,2.9e-05,3.4e-05,5.9e-05,2.8e-05,1e-05,2e-05,2.6e-05,2.7e-05,5.3e-05,6.2e-05,4.4e-05
1.6e-05,1e-05,9e-06,2.6e-05,2.2e-05,1e-05,9e-06,2e-05,3.1e-05,1e-05,1.3e-05,2.7e-05,2.8e-05,2.2e-05,8e-06,3.8e-05,1.8e-05,2.1e-05,1.8e-05,5e-06,1.8e-05,1.1e-05,1.4e-05,3.8e-05,1.1e-05,1.4e-05,3.8e-05,3.5e-05,2.4e-05,1.8e-05,2.2e-05,1e-05,9e-06,4e-06,3e-05,1.3e-05,3e-05,3.9e-05,2.6e-05,1.7e-05,1.5e-05,5e-06,1.8e-05,1.7e-05,4.5e-05,2.1e-05,2.7e-05,7e-06,6e-06,4.1e-05,1.8e-05,1.1e-05,2.4e-05,2e-05,3.3e-05,1.9e-05,3.7e-05,8e-06,3.5e-05,3.1e-05,3.2e-05,1.7e-05,4.2e-05,9e-06,5.5e-05,1.1e-05,1.7e-05,9e-06,3.1e-05,9e-06,1.1e-05,6e-06,2.4e-05,1.3e-05,1.8e-05,2.7e-05,2.6e-05,2.1e-05,1.9e-05,1.4e-05,1.8e-05,4.7e-05,1.2e-05,1.4e-05,1.1e-05,1.8e-05,1e-05,4e-06,1.7e-05,1.3e-05,1.3e-05,5e-06,1.5e-05,1.2e-05,3.9e-05,1.2e-05,1.8e-05,2.1e-05,1.7e-05,7e-06,2e-05,1.1e-05,1.9e-05,7e-06,2.6e-05,5e-06,2.2e-05,1.3e-05,6e-06,1.8e-05,1.7e-05,1.6e-05,4e-06,1.2e-05,1.8e-05,7e-06,7e-06,1.5e-05,1.4e-05,2.6e-05,1.2e-05
9e-06,2e-05,9e-06,2.3e-05,2.8e-05,2.2e-05,1.3e-05,2.1e-05,2e-05,2.8e-05,1e-05,3.4e-05,1.4e-05,1.9e-05,8e-06,4e-05,1.9e-05,1.4e-05,2.9e-05,2.2e-05,5.4e-05,7e-06,1.9e-05,5.7e-05,3.3e-05,1.7e-05,4.9e-05,4.5e-05,4.6e-05,2.2e-05,2.8e-05,1.2e-05,1.9e-05,4.2e-05,3.7e-05,3.4e-05,1.1e-05,5e-06,3.1e-05,3.2e-05,3.3e-05,1.7e-05,1.9e-05,4.1e-05,2.8e-05,2.4e-05,1.9e-05,1.8e-05,2.1e-05,4.6e-05,2.1e-05,2.6e-05,1.6e-05,1.4e-05,2.5e-05,2e-05,3.3e-05,1.6e-05,1.7e-05,2.4e-05,3.1e-05,1.5e-05,6.5e-05,2.5e-05,5.1e-05,4.8e-05,5.4e-05,4e-05,4.8e-05,3.9e-05,2.4e-05,5e-06,3.8e-05,2.3e-05,2.5e-05,5e-06,1.5e-05,2.6e-05,1.3e-05,1.4e-05,2.8e-05,4.9e-05,2.2e-05,3.8e-05,3.2e-05,2.9e-05,4e-06,2.5e-05,2.3e-05,2e-05,2.1e-05,2.4e-05,4e-05,2.9e-05,5.9e-05,3e-05,4.7e-05,1.8e-05,6e-06,2.9e-05,3.1e-05,1.8e-05,2.3e-05,1.9e-05,4.3e-05,3.6e-05,1.3e-05,1e-05,1.2e-05,3.4e-05,4e-06,9e-06,3.7e-05,1.6e-05,3e-06,2.7e-05,1.9e-05,1.1e-05,1.7e-05,5.1e-05,3.2e-05
3.4e-05,4.5e-05,3.7e-05,4.3e-05,5.5e-05,5.3e-05,3.8e-05,1.7e-05,2e-05,1.5e-05,1.1e-05,2.8e-05,4.8e-05,3.1e-05,1.5e-05,5.6e-05,5.3e-05,5.3e-05,6.7e-05,3.2e-05,5.1e-05,4.5e-05,4.5e-05,8.7e-05,5.1e-05,5.5e-05,5.7e-05,5e-05,1.3e-05,2.4e-05,3e-06,1.7e-05,1.8e-05,7e-05,3.6e-05,1e-05,3.1e-05,1.1e-05,5.2e-05,5.5e-05,3.2e-05,1.8e-05,3.1e-05,6e-05,6.4e-05,5.3e-05,3.7e-05,2.4e-05,1e-06,5.3e-05,5e-05,1.5e-05,2.4e-05,2.9e-05,3.3e-05,2.3e-05,3.2e-05,1e-06,2.1e-05,3.8e-05,1.7e-05,1.5e-05,9.8e-05,6.3e-05,7.9e-05,6.4e-05,6.8e-05,1e-05,4.6e-05,4e-05,1.8e-05,3.3e-05,2e-06,9e-06,5.2e-05,3.4e-05,3.1e-05,2.2e-05,4.7e-05,1.9e-05,2.8e-05,5.1e-05,4.5e-05,4.8e-05,5.7e-05,5.7e-05,4.6e-05,3.9e-05,5.6e-05,4.5e-05,6.8e-05,7.3e-05,4e-05,3.7e-05,5.2e-05,3.5e-05,5.4e-05,7e-05,3.2e-05,5.2e-05,4.6e-05,3.2e-05,1.1e-05,1.9e-05,1.6e-05,1e-05,1.1e-05,6e-06,1.5e-05,4.1e-05,2.7e-05,2e-05,6.9e-05,7.6e-05,4e-05,4.1e-05,2.5e-05,1e-06,7e-06,3.7e-05,2.9e-05
3.2e-05,3.8e-05,3e-06,5e-05,5.8e-05,4.4e-05,2.2e-05,5.3e-05,4.6e-05,1.8e-05,2.7e-05,2e-05,3.2e-05,6.9e-05,6.5e-05,3.6e-05,2.1e-05,3.4e-05,3.3e-05,5.1e-05,3.7e-05,2.8e-05,2.7e-05,4.4e-05,5.8e-05,3.3e-05,8.2e-05,4.2e-05,1e-05,4.8e-05,3.8e-05,4e-05,3.1e-05,4.8e-05,3.6e-05,2.7e-05,2.4e-05,3.9e-05,5.4e-05,1.8e-05,2.6e-05,9e-06,2.8e-05,2.8e-05,3.2e-05,4.7e-05,5e-05,2.5e-05,1.2e-05,5.2e-05,3.2e-05,2.9e-05,4.5e-05,7e-06,1.1e-05,1.8e-05,6.1e-05,3.9e-05,4.2e-05,4.6e-05,5.2e-05,3.1e-05,8.6e-05,6.5e-05,7.7e-05,3.4e-05,6.6e-05,4.3e-05,5.1e-05,1.7e-05,1.4e-05,3.8e-05,4.7e-05,2.4e-05,4.7e-05,4e-06,3.5e-05,1.9e-05,5.4e-05,4.1e-05,2.8e-05,3.1e-05,4e-05,5.9e-05,1.9e-05,5.1e-05,3.9e-05,2.5e-05,2e-05,1.5e-05,3.9e-05,4e-05,3e-05,3.6e-05,5.7e-05,5.2e-05,9.1e-05,3e-05,7.5e-05,5.9e-05,2.5e-05,4e-05,3.9e-05,3.7e-05,2.4e-05,5.2e-05,3.9e-05,3.4e-05,3e-06,4.3e-05,4.8e-05,5e-06,6.2e-05,4.7e-05,4e-05,6.3e-05,2.8e-05,1.3e-05,4e-06,1.6e-05,1.7e-05
3.2e-05,6.2e-05,5.8e-05,7.1e-05,5.1e-05,7.5e-05,5.5e-05,6.7e-05,7e-06,3.6e-05,1.2e-05,2.4e-05,1.8e-05,4e-05,3.3e-05,3.3e-05,4.1e-05,6.2e-05,5.1e-05,7e-05,3.8e-05,3e-06,2.7e-05,2.1e-05,5.8e-05,8.4e-05,8.4e-05,4.8e-05,3.5e-05,4.8e-05,1.8e-05,4.9e-05,5.3e-05,1.8e-05,2.2e-05,1.2e-05,2e-05,1.8e-05,4.9e-05,4.2e-05,2.3e-05,1.9e-05,2.4e-05,1.5e-05,3.8e-05,3.3e-05,1.7e-05,2.5e-05,3.3e-05,5.4e-05,3.5e-05,2.3e-05,2.3e-05,3.7e-05,2.4e-05,1.8e-05,6.7e-05,3.6e-05,1.2e-05,3.8e-05,5.5e-05,2.9e-05,6.9e-05,2.3e-05,6.3e-05,7.7e-05,2.6e-05,1.4e-05,6.5e-05,4.5e-05,4e-05,4.4e-05,2.9e-05,5.3e-05,2.6e-05,1.4e-05,2.2e-05,2.3e-05,4.1e-05,5.3e-05,4.7e-05,1.8e-05,5.2e-05,2.9e-05,1.1e-05,3.9e-05,3e-06,1.8e-05,3.5e-05,1.5e-05,2.3e-05,5e-06,2.8e-05,2e-05,7.1e-05,8.3e-05,5.2e-05,3.7e-05,8.5e-05,4.9e-05,1.9e-05,1.2e-05,2.2e-05,1.1e-05,3.7e-05,6.3e-05,3.1e-05,2.2e-05,2e-05,3.8e-05,1.3e-05,1.7e-05,4.1e-05,3.7e-05,1.9e-05,3.3e-05,3.8e-05,1.4e-05,9e-06,2.1e-05,1.6e-05
5e-06,2.5e-05,2.7e-05,4.9e-05,2.2e-05,6.5e-05,5.8e-05,2.6e-05,3.4e-05,3.8e-05,4.5e-05,4.3e-05,5e-05,4.7e-05,3.8e-05,1.8e-05,4e-05,3.9e-05,2.8e-05,3.5e-05,4.4e-05,4.3e-05,2.1e-05,2.4e-05,4.6e-05,2e-05,2.4e-05,6e-06,2e-05,3.8e-05,3e-05,5.6e-05,6e-05,7e-06,3.4e-05,5.2e-05,4.2e-05,3.6e-05,5e-05,4.7e-05,5.6e-05,3.2e-05,2.5e-05,2.4e-05,4e-06,2.3e-05,2.7e-05,1.6e-05,2.2e-05,1.3e-05,4.4e-05,4.9e-05,3.7e-05,4.9e-05,3.3e-05,3.3e-05,4.6e-05,3.6e-05,2.5e-05,3.1e-05,2.8e-05,4.4e-05,3.5e-05,8.3e-05,6e-05,3.6e-05,1.4e-05,2.8e-05,3.8e-05,1.7e-05,4.2e-05,1.9e-05,3.5e-05,2e-05,4.5e-05,2e-05,2.1e-05,1.4e-05,4.7e-05,7e-06,1.8e-05,1.7e-05,3.6e-05,1.7e-05,4e-06,2.4e-05,2.7e-05,3.7e-05,4.3e-05,1.9e-05,2.5e-05,1.9e-05,5.4e-05,2.7e-05,8.3e-05,6.3e-05,5.4e-05,1.8e-05,4.7e-05,5.1e-05,4e-05,3.9e-05,1.9e-05,2.5e-05,4.8e-05,4.9e-05,3.4e-05,8e-06,1.6e-05,3e-06,1e-05,1.1e-05,5.2e-05,6.5e-05,4.8e-05,2.6e-05,2.1e-05,4.7e-05,1.8e-05,2.8e-05,3.2e-05
3.3e-05,1.5e-05,1.6e-05,1.1e-05,2.8e-05,1.3e-05,2.9e-05,2.3e-05,1.2e-05,1.4e-05,3.2e-05,4.7e-05,4.1e-05,2.7e-05,4.9e-05,5.2e-05,1.6e-05,2.7e-05,1.8e-05,2.4e-05,3.1e-05,7e-06,2.7e-05,4.9e-05,1.1e-05,3.3e-05,6.4e-05,6e-05,3.3e-05,3e-06,2e-05,2.3e-05,2.2e-05,4.2e-05,3.5e-05,4.2e-05,2.9e-05,3e-05,1e-05,1.6e-05,6e-06,2.9e-05,1.3e-05,1.9e-05,1.8e-05,2.4e-05,4.7e-05,1.7e-05,1.2e-05,3.3e-05,2.5e-05,4.5e-05,8e-06,3.7e-05,4.5e-05,6.8e-05,3.8e-05,1.9e-05,2.3e-05,3e-06,2.9e-05,3.7e-05,5.2e-05,7.7e-05,3.8e-05,4.3e-05,2.8e-05,3.9e-05,5.4e-05,6.2e-05,2.2e-05,3.9e-05,3.1e-05,3.5e-05,3.8e-05,4.6e-05,1.2e-05,2.2e-05,1.8e-05,2.4e-05,4.8e-05,2.2e-05,3.9e-05,2.8e-05,7e-06,1.5e-05,2.2e-05,2.7e-05,1.6e-05,1.7e-05,2.9e-05,1.7e-05,4.7e-05,5.9e-05,5.7e-05,2.2e-05,2.9e-05,4.5e-05,1.4e-05,4.8e-05,2.2e-05,4.5e-05,2.5e-05,1.1e-05,3.2e-05,5.6e-05,3.2e-05,9e-06,1.2e-05,1e-05,1.6e-05,2.4e-05,5.5e-05,1.9e-05,6e-06,7e-06,2.9e-05,2.3e-05,4.5e-05,1.2e-05,2.1e-05
1.5e-05,1.9e-05,1.4e-05,1.2e-05,1e-05,2.3e-05,2.9e-05,2e-05,1.5e-05,1.7e-05,4.6e-05,4.4e-05,6.2e-05,2.5e-05,5.1e-05,3.6e-05,2.7e-05,5e-05,4.9e-05,5.8e-05,2.6e-05,1.3e-05,3.3e-05,3.6e-05,1.8e-05,4.1e-05,4.1e-05,2.7e-05,1.5e-05,1.6e-05,3.1e-05,2.6e-05,2.3e-05,8e-06,3e-06,4.2e-05,2.1e-05,3e-06,1.3e-05,1.1e-05,4e-06,8e-06,2.9e-05,3e-06,1.8e-05,2e-05,3.6e-05,4.3e-05,2.1e-05,2.5e-05,1.2e-05,3.8e-05,3.7e-05,3.3e-05,1.3e-05,4.9e-05,3.5e-05,2.3e-05,1.9e-05,1.1e-05,2.1e-05,1.8e-05,2.5e-05,2.2e-05,2.5e-05,9e-06,2.8e-05,8e-06,2.1e-05,1.7e-05,1.8e-05,2.1e-05,3.4e-05,2.7e-05,3.8e-05,4.1e-05,5e-05,2.4e-05,2.1e-05,7e-06,3.8e-05,2.9e-05,2.4e-05,1.5e-05,1.3e-05,1.4e-05,3e-05,1.9e-05,1.4e-05,6e-06,1.3e-05,2.3e-05,1.2e-05,1.9e-05,2.2e-05,2.4e-05,8e-06,3.7e-05,3e-06,2.1e-05,1.5e-05,3.5e-05,2e-06,1.5e-05,1.4e-05,3.7e-05,3.9e-05,2.7e-05,2.1e-05,5e-06,2.1e-05,1.2e-05,2.3e-05,1.6e-05,1.2e-05,2e-06,1.1e-05,1.8e-05,3.7e-05,5.3e-05,2.2e-05
8e-06,6e-06,1.9e-05,3.1e-05,2.5e-05,2.7e-05,1e-05,3.2e-05,1.2e-05,3.8e-05,2.5e-05,2.4e-05,1e-05,1.8e-05,5.9e-05,7e-06,7.1e-05,6e-06,1.6e-05,2.4e-05,1.7e-05,2.9e-05,1.6e-05,4.1e-05,2e-05,2.9e-05,2.9e-05,3.8e-05,2.5e-05,1.9e-05,4.8e-05,3.4e-05,9e-06,1.7e-05,2e-05,1.6e-05,2.2e-05,6e-06,9e-06,2e-05,2.8e-05,2.9e-05,3.5e-05,5.3e-05,1.9e-05,1.9e-05,2.7e-05,2.4e-05,1.7e-05,1.3e-05,1.9e-05,4.4e-05,1.6e-05,9e-06,3.3e-05,3.6e-05,9e-06,1.6e-05,1.9e-05,3.2e-05,2.3e-05,1.9e-05,5.6e-05,2.9e-05,4.1e-05,1.5e-05,2.7e-05,1.6e-05,2.5e-05,2.6e-05,1.8e-05,8e-06,3.7e-05,3.8e-05,9e-06,2.2e-05,3.7e-05,1.5e-05,2.2e-05,2.1e-05,2.5e-05,1.1e-05,3.9e-05,5.1e-05,4.6e-05,3.4e-05,1.9e-05,1.7e-05,2e-05,1.8e-05,2.8e-05,1.4e-05,1.3e-05,3e-05,3.3e-05,2.3e-05,2e-05,1.7e-05,4.1e-05,2.6e-05,2.2e-05,3e-06,1.3e-05,2.9e-05,2.3e-05,4e-05,1.8e-05,1.5e-05,2.1e-05,3.4e-05,1.8e-05,2.4e-05,1.7e-05,7e-06,1.8e-05,2e-05,2.8e-05,2.7e-05,1.6e-05,2.1e-05,1.5e-05
1.9e-05,3.3e-05,3.3e-05,1.8e-05,1.4e-05,1.7e-05,8e-06,1.7e-05,8e-06,4.6e-05,4.7e-05,4.8e-05,3.8e-05,3.1e-05,2.1e-05,2.9e-05,5.7e-05,4.3e-05,3.4e-05,1.7e-05,8e-06,1.5e-05,3.5e-05,1.8e-05,1.5e-05,1.4e-05,2e-05,2.9e-05,1.5e-05,1.5e-05,3.2e-05,4.5e-05,4.1e-05,4e-06,1.2e-05,1.1e-05,1.9e-05,1.7e-05,2.2e-05,2e-05,1.9e-05,6e-06,1.4e-05,3.6e-05,3.4e-05,2.5e-05,3.9e-05,2e-05,1.6e-05,1.8e-05,4.1e-05,3e-05,1.6e-05,2.7e-05,4.8e-05,4.9e-05,2.8e-05,2.5e-05,1e-06,3.6e-05,2.2e-05,4e-06,4.7e-05,3.7e-05,3e-05,2.3e-05,1e-05,5e-06,1e-05,1.6e-05,1.9e-05,1.3e-05,3.6e-05,2.8e-05,4e-05,4.5e-05,2.7e-05,2.6e-05,3.4e-05,1.8e-05,1.3e-05,2.9e-05,2.1e-05,1.5e-05,1.5e-05,2.9e-05,3.1e-05,2.3e-05,2e-05,6e-06,1.9e-05,2.9e-05,1.9e-05,3.4e-05,6e-06,9e-06,1.2e-05,2.5e-05,5.3e-05,1.6e-05,1.1e-05,1.8e-05,7e-06,1.6e-05,2.6e-05,2.2e-05,1.7e-05,1.5e-05,3.1e-05,1.1e-05,1.2e-05,6e-06,1.3e-05,1.8e-05,2.1e-05,1.2e-05,3.2e-05,3e-06,7e-06,8e-06,1.7e-05
7e-06,2.9e-05,7e-06,1.1e-05,2.7e-05,2.2e-05,3e-06,4e-06,1.9e-05,4e-05,1.2e-05,2.1e-05,6e-06,1.6e-05,1.3e-05,1.8e-05,4.8e-05,1.4e-05,1.5e-05,2.5e-05,2e-05,1.9e-05,2.2e-05,1e-05,6e-06,2.1e-05,1.3e-05,3.4e-05,2.8e-05,1.3e-05,1.2e-05,1.5e-05,3.6e-05,2.8e-05,1.6e-05,1.1e-05,2.6e-05,1.5e-05,2.7e-05,1.5e-05,1.7e-05,1.7e-05,7e-06,2.4e-05,2.2e-05,1.3e-05,3.8e-05,1.5e-05,2.3e-05,7e-06,3.2e-05,2.1e-05,1.4e-05,3e-05,5.6e-05,1.9e-05,2.4e-05,1e-06,1e-05,2.8e-05,5.5e-05,3.5e-05,2.6e-05,4.4e-05,4.7e-05,2.8e-05,2.3e-05,9e-06,1e-06,6e-06,2.8e-05,1.5e-05,2.4e-05,9e-06,2e-05,1.2e-05,1.9e-05,1.6e-05,1.5e-05,1.1e-05,1.2e-05,2.3e-05,6e-06,9e-06,2.4e-05,1.5e-05,1.5e-05,1.1e-05,1.4e-05,1.2e-05,4e-06,3e-05,1.4e-05,2.5e-05,1.6e-05,1.4e-05,1.2e-05,1.7e-05,3.2e-05,1.8e-05,5e-06,4e-06,1.1e-05,1.3e-05,1.2e-05,8e-06,1.2e-05,6e-06,1.2e-05,1.8e-05,1.1e-05,1.2e-05,2e-05,5e-06,7e-06,1.9e-05,1.7e-05,1.9e-05,1.1e-05,1.2e-05,3e-05
1.2e-05,2.2e-05,3.1e-05,2.1e-05,2.9e-05,1.6e-05,1.1e-05,1.4e-05,2.4e-05,1e-05,1.5e-05,1.2e-05,8e-06,1.6e-05,1.2e-05,1.7e-05,3.3e-05,3.5e-05,1.2e-05,1.9e-05,1.4e-05,6e-06,1.5e-05,7e-06,5e-06,2.9e-05,2.6e-05,2.1e-05,9e-06,5e-06,7e-06,2.2e-05,3.1e-05,3.3e-05,2.2e-05,1.2e-05,1.5e-05,1.1e-05,3e-05,1.6e-05,2.1e-05,1.2e-05,1.2e-05,1e-05,2.1e-05,2e-05,2.6e-05,1.6e-05,1.2e-05,5e-06,1.6e-05,3.1e-05,3e-06,3.2e-05,1.5e-05,9e-06,3e-05,2.6e-05,1.4e-05,1.3e-05,4.6e-05,3.3e-05,2.2e-05,2.3e-05,7e-06,1.3e-05,8e-06,1.1e-05,4e-06,2.4e-05,2.8e-05,8e-06,1.6e-05,3.4e-05,1.5e-05,1.5e-05,3.1e-05,1.5e-05,1.4e-05,4e-06,6e-06,1.2e-05,1.1e-05,1.6e-05,1.2e-05,1.8e-05,3e-05,6e-06,2.6e-05,2e-05,3e-06,1.6e-05,1.7e-05,1.4e-05,6e-06,7e-06,5e-06,1.1e-05,1.7e-05,2e-05,1.1e-05,1.7e-05,1.3e-05,7e-06,1e-05,6e-06,5e-06,8e-06,1.1e-05,1.2e-05,1.1e-05,4e-06,2.3e-05,1.4e-05,6e-06,8e-06,4e-06,3e-06,7e-06,1.1e-05,1.5e-05
2.2e-05,1.9e-05,2.7e-05,1.2e-05,1e-05,4e-06,1.5e-05,3.1e-05,1.5e-05,1.4e-05,2e-05,2.4e-05,5e-06,1.7e-05,4e-06,2.2e-05,8e-06,1.6e-05,2e-05,1.6e-05,1.2e-05,1.3e-05,8e-06,1.3e-05,9e-06,3.5e-05,4.9e-05,3e-05,1.3e-05,1.8e-05,2.7e-05,2.1e-05,9e-06,3.3e-05,1.1e-05,6e-06,4e-06,1.2e-05,1.8e-05,9e-06,2.1e-05,3.5e-05,3.2e-05,3.3e-05,3.3e-05,1.5e-05,1.2e-05,1.4e-05,1.9e-05,1.2e-05,2.4e-05,3.6e-05,4e-05,3.2e-05,2.6e-05,2e-05,8e-06,6e-06,8e-06,1e-06,2e-05,2.1e-05,2.6e-05,1.7e-05,4e-06,2.3e-05,1.9e-05,2.5e-05,1.1e-05,2.4e-05,2.8e-05,2.4e-05,2.3e-05,3.9e-05,1.4e-05,1.8e-05,1.4e-05,9e-06,7e-06,6e-06,9e-06,2e-06,8e-06,9e-06,1.2e-05,6e-06,1.4e-05,2.5e-05,3e-05,1.6e-05,1.6e-05,9e-06,7e-06,6e-06,1.9e-05,2.2e-05,1.8e-05,1.1e-05,1.6e-05,3.3e-05,4.5e-05,2e-05,1.2e-05,1.4e-05,1.7e-05,9e-06,2e-06,4e-06,1.1e-05,8e-06,5e-06,1.7e-05,8e-06,1.2e-05,6e-06,1.7e-05,1.8e-05,1.5e-05,7e-06,1.1e-05,3e-06
6e-06,5e-06,8e-06,1.3e-05,2.2e-05,2e-05,6e-06,2.7e-05,2.2e-05,1.1e-05,1.2e-05,9e-06,1.6e-05,2.1e-05,2.7e-05,9e-06,3e-06,2e-05,9e-06,1e-05,1.2e-05,9e-06,8e-06,2.2e-05,3.3e-05,2.8e-05,1.4e-05,4e-06,2.9e-05,2.1e-05,1.2e-05,1.9e-05,1.5e-05,7e-06,7e-06,6e-06,1e-05,1.7e-05,1.7e-05,9e-06,2.3e-05,3.1e-05,1.2e-05,2.4e-05,1.8e-05,3e-05,5e-06,5e-06,1.7e-05,2.2e-05,3e-05,1.4e-05,3.2e-05,4.4e-05,2.4e-05,3.4e-05,2.1e-05,2.1e-05,1.6e-05,8e-06,2.5e-05,3.3e-05,1.2e-05,2.4e-05,2.3e-05,1.7e-05,3e-05,3.5e-05,3.1e-05,4e-06,3e-06,8e-06,3.5e-05,8e-06,8e-06,8e-06,1.3e-05,3e-06,3e-06,1.7e-05,2e-06,1.5e-05,2.2e-05,2.3e-05,1e-05,8e-06,1e-05,2.2e-05,3e-06,6e-06,7e-06,1.4e-05,1.1e-05,1.3e-05,8e-06,1.4e-05,9e-06,1.1e-05,2.7e-05,1.3e-05,2.2e-05,2.4e-05,2.1e-05,1.5e-05,9e-06,2.1e-05,1.9e-05,4e-06,6e-06,1.7e-05,1e-05,2.1e-05,1e-05,1.4e-05,2.2e-05,1.6e-05,2.5e-05,1.6e-05,1e-05,9e-06,1.6e-05
4e-06,3e-06,9e-06,1.8e-05,1.3e-05,5e-06,1e-05,1.1e-05,0,5e-06,9e-06,1.5e-05,4e-06,1.6e-05,2.2e-05,1.3e-05,8e-06,1.9e-05,1.9e-05,1.6e-05,1.3e-05,1.7e-05,1.1e-05,3.6e-05,2.9e-05,2.2e-05,1e-06,3e-06,2.5e-05,1.3e-05,1.6e-05,2e-05,2.6e-05,3e-05,9e-06,6e-06,1.6e-05,1.3e-05,1.9e-05,2e-05,2e-06,1.1e-05,9e-06,3.1e-05,2.3e-05,1.6e-05,2.5e-05,1e-05,1.9e-05,1.6e-05,1.5e-05,2.7e-05,8e-06,1.8e-05,1.2e-05,2.3e-05,1.6e-05,2.1e-05,1.6e-05,1.3e-05,2e-05,1.3e-05,3.7e-05,6e-06,2e-06,8e-06,3e-05,2.7e-05,1.1e-05,1.7e-05,1.8e-05,9e-06,3e-05,1.8e-05,1.1e-05,1.6e-05,1.2e-05,8e-06,3e-06,2.1e-05,1.3e-05,1.7e-05,7e-06,2.3e-05,2.4e-05,9e-06,1.6e-05,7e-06,7e-06,1.4e-05,1.7e-05,1.7e-05,1.2e-05,1.1e-05,1.3e-05,1.2e-05,1.2e-05,2.1e-05,1.4e-05,3.1e-05,1e-05,1.2e-05,2e-05,1.1e-05,5e-06,1.5e-05,1.5e-05,1.8e-05,1.5e-05,1.4e-05,1.4e-05,5e-06,1e-05,1.5e-05,1.5e-05,9e-06,1.1e-05,8e-06,1.1e-05,6e-06,1.5e-05
1e-05,1.3e-05,1.6e-05,1.1e-05,6e-06,7e-06,6e-06,4e-06,7e-06,7e-06,2e-05,1.8e-05,1.4e-05,1e-05,3e-06,2.2e-05,2.7e-05,2.6e-05,9e-06,1e-05,1e-05,7e-06,7e-06,3.2e-05,5e-06,6e-06,2e-06,9e-06,1.2e-05,4e-06,1.6e-05,1.4e-05,2e-05,1.3e-05,2.1e-05,1.9e-05,6e-06,1.3e-05,4e-06,1e-05,2e-06,6e-06,5e-06,2e-05,2.5e-05,2e-05,7e-06,2e-06,1.5e-05,1e-05,1e-05,1.9e-05,1.2e-05,1e-05,1.8e-05,1.7e-05,1.6e-05,2.3e-05,1.5e-05,3e-06,1.1e-05,1.9e-05,1.2e-05,1.8e-05,1.6e-05,1e-06,1.1e-05,5e-06,2.3e-05,1e-05,6e-06,9e-06,1.3e-05,8e-06,9e-06,1.2e-05,5e-06,8e-06,5e-06,1.6e-05,2.2e-05,2.2e-05,1.2e-05,2.5e-05,1.9e-05,1.6e-05,1.9e-05,1.8e-05,1e-05,1e-05,2.3e-05,1e-05,2e-06,1.5e-05,1e-05,2e-05,1.6e-05,1.1e-05,9e-06,8e-06,7e-06,4e-06,1.3e-05,1.5e-05,3e-06,2.2e-05,2e-06,1.1e-05,9e-06,8e-06,1.1e-05,1.4e-05,1.4e-05,7e-06,1e-05,1.1e-05,1e-05,3e-06,1.1e-05,8e-06,1.2e-05
7e-06,5e-06,4e-06,6e-06,1e-06,7e-06,8e-06,3e-06,4e-06,1e-05,1.1e-05,7e-06,7e-06,7e-06,1.7e-05,6e-06,1.8e-05,7e-06,5e-06,7e-06,6e-06,8e-06,5e-06,2.3e-05,1.5e-05,1.3e-05,5e-06,1.5e-05,1.3e-05,3e-06,6e-06,1.9e-05,4e-06,1e-05,1e-05,3e-06,9e-06,5e-06,1e-05,6e-06,5e-06,4e-06,5e-06,9e-06,5e-06,7e-06,8e-06,8e-06,6e-06,8e-06,4e-06,5e-06,3e-06,8e-06,1.5e-05,4e-06,9e-06,6e-06,5e-06,7e-06,4e-06,7e-06,1.4e-05,1.3e-05,9e-06,1e-05,1.2e-05,6e-06,2e-05,7e-06,7e-06,6e-06,8e-06,1.6e-05,1e-05,1.8e-05,3e-06,3e-06,3e-06,7e-06,1.1e-05,9e-06,1.4e-05,9e-06,3e-06,9e-06,5e-06,8e-06,5e-06,9e-06,1e-05,4e-06,1e-05,1.3e-05,1.8e-05,6e-06,1.1e-05,7e-06,1e-06,9e-06,9e-06,1.2e-05,4e-06,7e-06,1.2e-05,9e-06,4e-06,9e-06,6e-06,1e-05,2e-06,6e-06,7e-06,7e-06,1.4e-05,5e-06,5e-06,1.2e-05,3e-06,6e-06,1e-06
4e-06,2e-06,1e-06,6e-06,2e-06,4e-06,6e-06,3e-06,6e-06,1e-05,4e-06,6e-06,6e-06,2e-06,1.7e-05,9e-06,6e-06,3e-06,3e-06,1e-06,6e-06,4e-06,4e-06,1.1e-05,4e-06,6e-06,3e-06,6e-06,3e-06,1e-06,3e-06,1.3e-05,9e-06,4e-06,6e-06,3e-06,4e-06,8e-06,1.1e-05,1e-06,6e-06,8e-06,5e-06,4e-06,6e-06,3e-06,5e-06,6e-06,5e-06,3e-06,4e-06,5e-06,1e-06,5e-06,5e-06,9e-06,5e-06,8e-06,4e-06,3e-06,8e-06,3e-06,1.2e-05,7e-06,3e-06,5e-06,8e-06,4e-06,1.2e-05,2e-06,7e-06,6e-06,8e-06,1.3e-05,3e-06,1.3e-05,6e-06,2e-06,3e-06,5e-06,3e-06,1e-05,1e-05,3e-06,7e-06,1e-06,7e-06,6e-06,2e-06,9e-06,2e-06,5e-06,7e-06,6e-06,1e-05,1e-05,5e-06,7e-06,2e-06,1.2e-05,1e-06,9e-06,6e-06,2e-06,8e-06,1.2e-05,2e-06,7e-06,7e-06,6e-06,4e-06,4e-06,1e-06,3e-06,1.1e-05,5e-06,4e-06,6e-06,5e-06,4e-06,2e-06
3e-06,2e-06,1e-06,5e-06,2e-06,3e-06,5e-06,1e-06,4e-06,9e-06,5e-06,5e-06,6e-06,1e-06,1.4e-05,3e-06,5e-06,2e-06,1e-06,2e-06,3e-06,1e-06,5e-06,1.3e-05,2e-06,3e-06,3e-06,2e-06,6e-06,2e-06,1e-06,1.4e-05,7e-06,3e-06,5e-06,4e-06,6e-06,4e-06,9e-06,4e-06,3e-06,3e-06,5e-06,1e-06,5e-06,2e-06,4e-06,6e-06,4e-06,4e-06,4e-06,7e-06,3e-06,4e-06,3e-06,9e-06,2e-06,4e-06,2e-06,2e-06,7e-06,3e-06,9e-06,7e-06,2e-06,7e-06,2e-06,2e-06,9e-06,6e-06,2e-06,3e-06,8e-06,1.2e-05,6e-06,1.2e-05,6e-06,0,3e-06,3e-06,6e-06,1e-05,1e-05,3e-06,6e-06,0,7e-06,9e-06,0,7e-06,2e-06,4e-06,8e-06,4e-06,6e-06,6e-06,6e-06,6e-06,1e-06,1.1e-05,0,1.1e-05,4e-06,2e-06,7e-06,1.1e-05,0,4e-06,4e-06,1e-05,1e-06,6e-06,0,0,1.1e-05,4e-06,3e-06,2e-06,2e-06,4e-06,3e-06
2e-06,1e-06,1e-06,4e-06,1e-06,2e-06,4e-06,1e-06,4e-06,8e-06,3e-06,7e-06,6e-06,1e-06,1.2e-05,4e-06,7e-06,2e-06,1e-06,1e-06,2e-06,1e-06,4e-06,1.1e-05,0,3e-06,1e-06,2e-06,4e-06,3e-06,1e-06,1.2e-05,7e-06,2e-06,6e-06,2e-06,6e-06,2e-06,8e-06,3e-06,2e-06,0,3e-06,0,4e-06,1e-06,5e-06,4e-06,3e-06,3e-06,4e-06,5e-06,2e-06,2e-06,1e-06,9e-06,1e-06,4e-06,3e-06,1e-06,5e-06,1e-06,1e-05,8e-06,1e-06,8e-06,2e-06,1e-06,9e-06,5e-06,1e-06,5e-06,8e-06,1.1e-05,5e-06,1.1e-05,4e-06,1e-06,3e-06,1e-06,5e-06,9e-06,9e-06,3e-06,5e-06,1e-06,6e-06,6e-06,2e-06,7e-06,1e-06,2e-06,6e-06,4e-06,6e-06,5e-06,6e-06,7e-06,1e-06,1.1e-05,1e-06,8e-06,5e-06,2e-06,7e-06,1.1e-05,1e-06,3e-06,3e-06,9e-06,1e-06,6e-06,1e-06,1e-06,1e-05,4e-06,3e-06,3e-06,1e-06,4e-06,3e-06
