-0.007012,-0.006164,-0.005261,-0.006379,-0.004135,-0.003718,-0.006043,-0.005619,-0.005696,-0.00604,-0.004486,-0.008073,-0.01061,-0.009705,-0.007565,-0.004043,-0.005434,-0.00675,-0.004876,-0.009319,-0.006751,-0.006045,-0.010165,-0.005182,-0.004495,-0.005988,-0.007686,-0.009451,-0.008473,-0.005775,-0.005339,-0.008768,-0.006187,-0.004794,-0.003015,-0.010632,-0.008001,-0.006126,-0.008122,-0.005867,-0.008431,-0.005849,-0.008122,-0.005946,-0.006304,-0.005401,-0.006952,-0.005536,-0.007004,-0.007457,-0.004457,-0.008654,-0.008004,-0.004431,-0.005313,-0.006584,-0.006991,-0.004325,-0.009202,-0.008351,-0.005524,-0.009428,-0.005914,-0.005666,-0.003686,-0.008604,-0.012277,-0.005575,-0.008161,-0.009506,-0.008491,-0.005301,-0.004318,-0.004493,-0.006781,-0.010598,-0.008615,-0.009957,-0.007484,-0.003884,-0.007045,-0.006908,-0.004379,-0.008323,-0.010714,-0.006713,-0.004946,-0.005402,-0.005955,-0.01009,-0.008309,-0.004052,-0.008492,-0.007796,-0.005399,-0.005953,-0.005148,-0.005351,-0.004716,-0.006851,-0.006767,-0.008019,-0.004185,-0.004451,-0.008852,-0.00785,-0.005095,-0.005317,-0.007394,-0.008014,-0.006233,-0.003449,-0.004529,-0.005528,-0.007766,-0.007103,-0.009258,-0.00939,-0.005078,-0.0055,-0.010299
-0.002348,0.000151,0.001221,-0.001691,-0.004311,-0.002859,-0.000673,0.000957,0.000462,0.001767,-0.002947,0.0044,0.005474,0.000143,0.000444,0.000286,0.001312,0.000826,-0.000817,0.003243,0.000849,-0.002295,0.003488,-0.00043,-0.002307,-0.004278,0.00053,0.003714,0.00469,0.00171,-0.002283,0.000343,0.001186,0.000631,-0.002154,0.003194,0.003034,0.00161,0.001791,-0.001264,0.000362,-0.000383,0.000323,-0.001467,0.000477,-0.000662,-0.001534,0.001765,0.004509,-0.000727,-0.002089,0.00316,0.003528,-0.000806,0.000277,-0.003525,0.000384,0.000692,-0.001442,-0.00068,1e-05,-0.002509,-0.004637,-0.003314,-0.001428,-0.000473,0.002854,-0.000585,0.002915,0.002052,0.001014,0.000617,-0.001149,-0.004045,-0.001506,-0.000334,0.002725,0.005351,-0.000196,-0.001824,0.001253,0.00314,0.000792,0.003687,0.002917,0.000268,-0.003939,-0.000934,-0.002701,0.001828,0.001952,-0.000477,0.000627,2.1e-05,-0.000378,0.000808,-0.001044,-0.001408,-0.001701,0.000451,0.000462,0.003042,-0.000572,-0.000814,0.001988,-0.000149,0.000672,-0.001421,0.001671,0.002286,0.001154,-0.002569,0.00062,-0.000372,0.003352,0.000102,0.001793,0.001046,0.002302,0.000309,0.000805
-0.001124,-0.002127,-0.001593,0.000434,0.001665,-0.001287,-0.000902,-0.002776,-0.000302,-0.001975,0.000341,-0.00569,-0.004246,0.001376,-0.001551,-0.00196,-0.000355,-0.000718,0.000806,-0.001805,0.000363,-0.000695,-0.003671,-0.000818,1.8e-05,0.002096,0.000392,-0.003488,-0.004118,-0.001736,0.001772,-0.002125,-0.002204,-0.001178,0.000435,-0.002551,-0.00233,-0.000841,-0.000992,0.000765,-0.000142,0.003005,0.001198,0.000868,0.000125,-0.001473,0.00227,-0.001739,-0.003318,-0.001005,-0.000394,-0.000676,-0.00173,-0.000173,-0.000633,0.00057,-0.000363,-0.001921,-0.000191,0.001464,0.000417,-0.000476,-0.000512,0.000272,-0.001038,0.000649,0.000105,0.001422,-0.002485,-0.000156,-0.000627,-0.000206,0.000358,0.000938,0.001657,-0.001305,-0.000514,-0.003976,-0.001594,-0.001431,-7.5e-05,-0.004134,-0.002875,-0.00212,-0.002652,-0.000122,0.00109,1.4e-05,-0.001506,-0.001125,-0.000506,-0.001283,-0.002153,-0.000953,-0.000682,-0.001632,0.000588,-0.000887,-0.001243,-0.002957,-0.000945,-0.002148,-0.001626,0.000201,-0.00104,-0.003463,-0.002573,-0.000865,-0.003077,-0.002674,-0.000808,0.000467,-0.000908,0.000395,-0.001182,0.001853,2e-05,0.001028,-0.002607,0.00057,0.000979
0.002791,0.003183,0.00147,0.002122,0.001252,0.000448,0.001719,0.000151,0.001205,0.00279,0.000752,0.002334,0.002092,-0.001367,0.003002,0.001454,-4.4e-05,0.000335,0.001213,0.00244,0.001179,0.00241,0.002547,0.003119,0.002521,0.001962,0.004596,0.005523,0.002762,0.001077,-0.002086,0.003073,0.004302,0.00141,0.001964,0.002457,0.004016,0.002857,0.001037,0.000299,0.002159,0.000294,0.000206,0.000953,3.8e-05,0.003303,0.001464,0.002665,0.003443,0.003393,0.002842,0.000606,0.001407,0.001943,0.001544,0.000535,0.00118,-0.00023,0.001818,0.001759,0.000929,0.002288,0.003779,0.002516,0.001593,0.000496,0.001004,-0.000201,0.001806,0.002705,0.00205,0.001087,0.000305,0.002675,-0.000193,0.004016,-0.001477,0.001428,0.003213,0.004089,0.002452,0.00497,0.001262,0.000959,0.002084,0.002405,0.00189,0.001192,0.000909,0.00239,0.00175,0.000828,0.002145,0.001801,0.000113,0.002563,0.001471,0.003352,0.00406,0.003812,0.002072,0.002228,0.003895,7.7e-05,0.002006,0.003858,0.001472,0.002114,0.00031,0.003321,0.000785,0.00016,0.002716,0.001425,-0.000125,-0.001206,-0.00025,-0.000454,0.000242,0.000236,0.001503
0.001254,-0.000222,-0.001484,-0.001531,-0.0016,0.000807,-0.001947,0.001354,-0.000144,-0.001238,3e-06,0.000396,-0.000228,-0.000684,-0.001742,0.000638,-0.000101,-0.000399,-0.001024,-0.001897,-0.002054,-0.00133,-0.000502,-0.000191,-0.001645,-0.002687,-0.004225,-0.004096,-0.000729,-0.001187,0.000524,-0.001198,-0.002733,-0.000593,-0.001119,-0.001382,-0.003326,-0.004009,-0.001197,-0.000252,-0.001405,-0.00254,-0.001658,-0.001195,0.000465,-0.000967,-0.002765,-0.001889,-0.003687,-0.003224,-0.001913,0.000871,-0.002293,-0.002417,-0.000956,-0.000707,-0.000523,0.001904,0.000487,-0.001814,-0.002057,-0.000681,-0.000592,-0.002211,-0.001511,-0.001279,-0.002474,-0.000611,-0.001573,-0.001725,-0.001889,-0.000783,-0.000839,-0.001392,-0.000466,-0.001518,0.00035,-0.000432,-0.00111,-0.001236,-0.001885,-0.002726,-0.001682,-0.000962,-0.00096,-0.003231,-0.000898,-0.000378,0.001093,-0.00168,-0.002303,-0.000671,0.001006,-0.001766,0.000772,-0.000335,-0.000527,-0.003814,-0.00262,-0.000553,0.000776,0.000134,-0.00239,9.4e-05,-0.001259,-0.002076,0.001523,-0.001852,0.002245,-0.002692,0.000766,0.000362,-0.001514,-0.001602,-0.00086,0.000373,-0.001378,-2e-04,0.001105,0.001622,-0.001741
-0.001491,0.001264,0.001346,-0.000711,0.000307,-0.001356,0.002491,-0.00018,-0.000655,-0.000294,-0.000391,0.002036,-0.000244,-9.2e-05,-0.000691,-0.001495,-0.000266,0.000719,0.000768,0.000332,0.001728,-0.000109,-0.001457,-0.001666,0.000176,-0.001544,8.5e-05,0.001142,0.000616,0.001919,0.002054,0.000684,0.001717,-0.000317,0.000619,-5.1e-05,0.000773,0.002176,0.001381,-0.000375,-0.000562,0.000966,0.001314,0.00099,0.000409,-0.000315,0.001351,-0.000136,0.002818,0.002983,-4e-06,-0.001051,0.001816,0.001437,0.000739,0.000784,0.000116,-0.000157,-0.000996,0.000159,0.000767,-0.000508,-0.002899,5.8e-05,0.00114,0.000203,0.001668,-0.000406,0.001641,0.00197,0.001099,-0.00033,-0.00039,-0.000748,0.000362,-0.000333,0.000352,0.000412,0.000967,0.000589,0.000711,-0.000516,0.001764,0.000291,0.001445,0.002523,-0.000631,-0.000697,-0.000977,0.001242,0.002735,0.001059,-0.00028,0.001704,-0.000186,0.000224,8.1e-05,0.002985,0.000873,-0.000275,1.4e-05,0.00042,0.000263,-0.000823,0.000355,0.001699,-0.000395,0.000831,-0.000582,0.001062,-0.001643,-0.000238,-0.00039,0.00122,0.001908,-0.000384,0.001899,0.001563,-0.000479,-0.002014,0.000522
-0.000495,-0.001228,-0.001642,0.000465,0.001049,-0.000622,0.000301,0.000176,0.000848,-0.000107,0.000992,-0.001667,0.001127,0.001256,0.001105,0.000915,0.001192,0.000213,-0.001044,-0.000442,-0.001252,0.001217,0.000979,0.001202,0.001356,0.002116,0.00208,-0.000496,-0.000645,2e-05,-0.001019,0.000439,-0.002481,-0.00027,-0.000207,-0.000537,-0.000236,-0.00102,-0.00103,0.000974,0.001972,-0.000432,-0.000672,-0.000269,-0.001063,-0.00025,0.000119,-0.000248,0.000103,-0.001396,0.000842,-0.000235,-0.001105,-0.000272,-0.000848,8.2e-05,0.001014,0.000289,0.000113,0.00044,-0.000144,0.001197,0.00302,0.001518,0.000859,0.002506,-0.000392,0.00032,-0.000348,-0.001833,-0.001808,-0.000228,0.000899,0.001585,0.000702,0.000808,0.000525,-0.000595,-0.000954,-0.002238,-0.000396,0.000838,-0.000466,0.000864,-0.001002,-0.001514,0.000403,0.000394,0.001538,0.000617,-0.001576,-0.000266,-0.001297,-0.001366,0.000477,-0.00074,-0.000255,-0.000532,0.000596,-0.000215,-0.001529,-0.001938,0.000944,0.001454,0.000146,0.000698,-0.000524,5.7e-05,-0.000905,-1e-06,0.001205,0.000896,0.001494,-0.00048,-0.000936,0.000785,-0.000261,-0.000655,-0.000821,1.5e-05,0.000153
0.001128,-0.000413,0.000263,0.001057,-0.000187,0.002319,-0.001234,-0.000738,0.000168,0.000997,-0.000898,-0.001478,-0.000817,-0.001516,-0.000704,-0.000324,6e-06,-0.000373,0.000978,0.00022,0.000217,-0.001074,0.000937,-0.000526,-0.00133,-0.000569,-0.002008,0.000582,0.000221,-0.001204,-0.000483,-0.001697,0.002169,0.000987,0.00026,0.000325,0.000134,-0.000677,-0.000298,-0.000255,-0.000916,0.000828,-0.000427,0.000486,0.000697,0.000107,-0.000569,-0.000127,2.6e-05,-7.7e-05,0.000108,0.000518,0.000355,0.000133,-0.000291,-0.000586,-0.001432,-2.3e-05,0.001332,0.000148,0.001085,-0.00159,-0.001186,-0.000716,-0.000778,-0.002071,-0.000415,-0.000394,-0.001244,0.001423,0.001312,0.00035,0.000724,-0.001306,-0.001011,-0.001353,-0.000272,0.001254,0.000277,0.001566,0.000214,0.001108,-0.000445,-0.000721,0.000376,0.001191,0.000448,-0.000231,-0.001968,-0.001361,-0.000495,-0.000329,0.000353,0.000418,-0.000511,-7.1e-05,0.000154,-0.001326,-0.000716,0.000652,0.000715,0.001134,-0.001052,-0.000633,0.000451,-0.00086,-0.000465,0.000488,0.000458,0.000308,-0.001267,-0.001579,-0.000634,-0.000495,0.000157,0.000101,-0.000612,-0.000351,0.001036,0.000299,0.000265
-0.00031,0.000576,-5.6e-05,-0.000528,-0.000404,-0.000433,0.000153,0.000394,-0.000924,-0.000431,0.000481,0.002436,-0.000363,0.002008,0.000417,0.001322,-0.000238,-0.000658,-0.000713,1.4e-05,-8.1e-05,0.000292,-0.001206,-0.000297,-0.000769,0.000134,0.001179,6.4e-05,0.000118,0.000724,-0.000275,0.000913,-5.7e-05,0.000114,-0.000455,0.000223,0.000579,0.001444,0.001252,-0.000855,9.2e-05,-0.001224,0.00027,-0.000419,-0.000264,0.000205,0.000787,0.00077,-0.001301,-0.00016,-0.000308,0.000205,0.000533,-0.000212,0.000183,-5.7e-05,0.000118,-0.000325,-0.000638,-2.9e-05,-0.000674,0.000174,0.000587,1.6e-05,-0.001006,-0.000185,0.000563,0.001395,0.001203,-0.000543,0.000259,0.000482,-0.00086,0.000515,-9.2e-05,-3e-04,-0.00145,-0.000515,0.000127,-0.000474,0.000534,-0.001231,0.001073,0.001506,-0.000789,-0.000924,-0.00083,0.000299,3e-04,-1e-06,0.000157,0.000453,0.000506,0.000409,0.000471,-0.00034,-0.000494,0.000265,-0.000246,-0.000168,-8.7e-05,0.000211,0.000687,0.000202,-0.000228,-4.1e-05,0.000311,-0.000631,0.000692,0.001212,0.000791,-0.000286,-0.000668,-0.000485,-0.000658,0.000331,0.000618,0.000407,-0.000835,5.5e-05,-0.000979
-0.000864,-0.000731,0.001296,-5.5e-05,-0.00044,-0.001279,-0.000951,0.000316,-0.000268,2.8e-05,-0.00058,-0.001016,1e-04,-0.00087,7.7e-05,-0.001383,-0.000354,0.000163,0.000362,0.000223,0.000364,0.000199,0.000359,-0.000573,0.000673,-6e-06,0.000763,0.000117,2.1e-05,-3.3e-05,2.2e-05,-0.000174,-0.000481,-0.001101,-0.000846,-0.000483,-0.000746,-0.000359,-0.000773,0.00077,-0.000113,0.000811,0.000592,-0.000272,0.000216,0.000102,-0.000925,-0.000428,0.001027,0.000502,2.9e-05,3e-05,0.000389,0.000615,0.000295,0.000216,-0.000245,0.000392,0.000254,0.000362,-7.4e-05,0.001066,-0.000142,5.4e-05,0.001594,0.000339,0.000223,-0.00063,-9e-05,-0.00053,-0.000477,-0.001104,0.000257,0.000756,0.000823,0.001707,0.000449,0.000578,-1.1e-05,-0.000314,0.000307,2.7e-05,-0.000664,-0.00142,0.000181,-5.6e-05,0.000449,-0.000288,0.000883,-0.000212,0.000568,-0.000262,-0.000592,-0.000494,-0.000643,7e-04,0.000389,0.000775,0.000673,-0.000501,-5.8e-05,-0.000739,-0.001061,0.000426,-0.001083,1e-06,8.7e-05,-0.000706,-0.001149,-0.001644,-0.000778,0.001084,0.000701,0.001032,4e-04,-0.001718,-0.000438,-0.000302,1e-04,0.000622,0.000911
-0.000145,0.000167,-0.000355,0.00012,0.000479,0.000753,0.00065,0.000765,0.000608,-0.000246,0.000416,-0.00042,0.000358,-3.2e-05,5.5e-05,0.000291,0.000337,0.000164,0.000157,-0.000161,-0.00044,-0.000659,-0.000415,0.000908,-0.000386,-0.000353,-0.000451,-0.000418,-0.000179,-3.1e-05,0.000613,-0.00038,-1.7e-05,0.000787,0.001033,4.8e-05,0.000486,-0.000528,-5.5e-05,-0.000286,7.9e-05,0.000274,0.000125,0.00034,-0.000106,-0.000555,0.000521,0.00016,0.000307,-0.000221,-0.000122,-0.000298,-0.000452,-0.00049,-0.000133,-9e-05,0.000496,-0.000524,-0.000521,-0.000445,0.000341,-0.000246,9.4e-05,-0.000481,-0.000438,0.000444,-0.000204,0.000348,-0.000347,0.000109,0.000585,0.000237,6.9e-05,-0.000202,-0.000499,-0.001027,0.000913,-0.000577,-0.000264,-8.9e-05,-0.000514,0.000934,-5.4e-05,0.000413,0.000509,0.000195,-0.000472,0.000402,0.000326,0.000922,-0.000251,0.000239,0.000483,-5.1e-05,0.000859,0.000432,-0.000169,-0.000425,-0.000795,0.000312,-0.000698,-0.000147,0.000158,-0.000364,0.000706,7.6e-05,-0.000235,0.000334,0.000788,-0.000128,0.00078,5.8e-05,-0.000568,-0.000128,-0.000187,0.001278,0.000473,0.000105,0.000475,-0.001067,-0.000732
0.000925,9.4e-05,-0.000326,-0.000207,0.000117,1.9e-05,-8.2e-05,-0.000969,-0.000304,0.000359,-0.000243,0.000488,-0.00014,0.000189,0.000129,0.000451,0.000241,0.000263,-0.000128,5.7e-05,0.000107,0.000382,0.000627,0.000575,0.000731,0.000565,-0.000658,0.000265,0.000337,0.000154,-0.000578,0.000692,-4.5e-05,-0.000254,-0.000598,-0.000205,0.000281,-0.000424,-4.3e-05,-0.000124,0.000373,-0.00032,-0.000565,-0.000981,0.000404,0.000545,-0.000162,0.000261,-0.000684,1.6e-05,-1.7e-05,0.000139,-0.000389,-3.2e-05,-0.000127,0.000626,-0.000396,-0.000244,-0.000182,9.2e-05,-8.8e-05,-4.6e-05,-0.000361,8e-05,-0.000298,-0.000315,-0.000718,-0.000389,-0.000706,0.000237,-0.000141,0.000418,0.000108,-5.1e-05,0.000126,0.000231,-0.000207,-9.8e-05,0.000454,6.5e-05,0.000209,-0.000328,1.5e-05,0.000241,-0.000513,4e-06,0.000575,-0.000113,-0.001152,-0.000394,-0.000651,-0.000445,0.000125,8.5e-05,-0.000441,-0.000819,0.000286,0.000307,0.000685,-5e-04,0.000654,0.00052,0.000138,0.000248,0.000443,6.2e-05,0.000905,0.000575,0.000152,0.000621,-0.000165,-0.000296,0.000358,-0.000461,0.00023,-0.000328,-0.000323,-9.5e-05,-0.000129,0.000424,0.000811
-0.000393,0.00017,7.5e-05,4e-05,-1.3e-05,-0.000431,-0.000539,8.5e-05,-7.9e-05,0.000407,0.000398,-7.7e-05,-0.000102,-0.000192,-0.000492,0.000148,-0.00037,-0.000113,-4.1e-05,-0.000146,0.000243,-0.000312,-0.00056,-0.000472,-0.00046,-9.9e-05,-0.000172,-0.00021,-2.9e-05,6e-05,0.000515,-4.9e-05,0.00025,0.000101,0.000168,-5.2e-05,-0.000352,0.00052,0.000278,8.1e-05,-0.000635,0.000394,0.00012,0.000694,-0.000247,0.000215,0,-0.00022,-0.000269,-0.000203,0.000147,-0.000164,0.000541,6.3e-05,0.000285,-0.000273,0.000521,5.6e-05,-9.4e-05,3.7e-05,-0.000412,0.000223,0.000271,0.000495,-0.000107,0.000117,0.000572,0.00012,0.000446,-0.000389,-0.000244,0.000196,-0.000432,-0.000457,-0.000288,-0.000181,-0.000231,0.000371,-0.000376,0.000328,-0.000397,-0.000177,0.000312,-0.000235,0.000541,0.000306,-0.000451,0.00024,0.000691,8.3e-05,0.00054,0.000273,5.6e-05,-5e-05,-0.00027,0.000276,-0.00012,-0.000209,-0.00022,0.000402,-9.4e-05,-6.8e-05,0.000124,-0.00013,-0.000403,-0.000448,-0.000652,-0.000657,-0.000163,-0.000144,2.5e-05,0.000189,-0.000157,0.000276,-3.9e-05,-6e-06,-0.000352,0.000253,-0.000235,0.000165,-0.000335
0.000563,6e-06,-0.000231,3.8e-05,-7.2e-05,0.000206,0.000742,-5.2e-05,0.000103,-0.000597,-0.000186,-0.00018,-3.3e-05,0.000417,8.8e-05,-0.000574,-0.000378,4.3e-05,-8.4e-05,0.000202,2.4e-05,0.000222,0.000505,-0.000191,0.000469,-6e-06,0.000354,0.000174,-9.5e-05,-1e-04,-0.000408,-0.000427,-0.000409,-0.000361,1.7e-05,0.000367,0.00024,0.000175,-0.000143,3e-06,0.000236,-0.000428,0.000182,0.000172,-4.9e-05,-8e-05,-2e-06,-0.000539,0.000219,0.000466,9.8e-05,-0.000147,0.000188,-0.000151,-7.5e-05,0.000118,-0.000237,0.000404,0.000205,-0.000252,0.000327,-6.3e-05,-1.5e-05,-0.000401,0.000273,0.000119,0.000111,0.000176,0.000151,0.000105,0.000143,8e-06,0.000228,-1.3e-05,-2.2e-05,0.000175,6.8e-05,0.000181,0.000311,-0.00046,-2.1e-05,0.00015,-0.000196,3e-06,-0.00056,-0.000154,2.3e-05,-0.000186,-0.000106,2e-05,0.000135,0.000225,-0.000366,8.4e-05,0.000153,-0.000233,0.000102,-8.5e-05,-7.8e-05,-1.1e-05,-5.2e-05,-3.1e-05,-0.000114,-0.000269,0.000101,-0.000145,0.000119,0.000153,-0.00036,0.000161,-8.9e-05,-0.000246,3.8e-05,-0.000102,6.5e-05,0.000207,0.000468,-4.1e-05,0.000244,-0.000171,-0.000189
-0.000481,-0.000137,0.000307,-0.000162,5.7e-05,0.000294,3e-06,-6.3e-05,0.000201,7.7e-05,0.000198,-2.9e-05,9.6e-05,-0.000487,-1.8e-05,0.00052,0.000517,9.5e-05,0.000341,-0.00013,-3e-06,-0.000166,-0.000359,9e-06,1.7e-05,-0.000297,7.9e-05,0.000292,-0.000141,-6.6e-05,0.000487,0.000198,0.000399,0.000277,0.00021,-0.000219,-0.000212,-0.000213,-6.7e-05,-0.000255,-0.000119,0.000158,-0.00022,-0.000256,-0.000108,-0.000555,-5.5e-05,0.000708,0.000274,-0.000268,-0.000149,0.000281,-0.000145,-3.5e-05,-5.8e-05,-0.000105,8.2e-05,0.000127,0.000101,0.000181,4e-05,-4e-06,-3.5e-05,0.000211,0.000135,-0.000121,-0.000155,8e-05,0.000102,3.8e-05,0.000148,-7e-05,1.5e-05,0.000228,0.000195,-0.000106,-0.000228,-7.6e-05,-0.000266,0.000269,5.4e-05,0.000106,-8.8e-05,9e-06,0.000158,-2.4e-05,0.000278,7.7e-05,7.2e-05,-0.000119,1.1e-05,-0.000319,0.000251,0.000228,0.000245,0.000236,-0.000136,0.00023,5.8e-05,1.6e-05,0.000274,-3e-05,0.000158,0.000134,-0.00011,0.000408,-0.000161,-5.7e-05,0.000156,-0.00018,-2.4e-05,9.6e-05,-0.000144,7.5e-05,-0.000124,-0.000213,3e-05,8.7e-05,3e-06,0.000134,0.000174
0.000209,7.2e-05,-9.2e-05,-0.000162,-0.000104,-0.000303,-0.00017,8.4e-05,-0.000127,-5.3e-05,-0.000345,0.000231,1e-04,9.3e-05,0.000115,-0.000218,-0.000159,7e-06,-0.000189,0.000104,-0.000121,0.00016,0.000257,6.9e-05,-0.000169,2e-05,-4e-06,-0.000197,0.000205,-2.8e-05,-0.000245,-0.000113,-0.000358,4.9e-05,4.1e-05,-7e-06,0.000159,-1.6e-05,0.000107,0.000465,-6e-05,-6.8e-05,0.000158,0.000205,-7e-05,0.000292,7.1e-05,-0.000149,-0.000326,0.000187,-4.4e-05,-3.1e-05,-0.000224,0.000147,4.3e-05,0.000131,-4e-06,-0.000195,-2.5e-05,-2.1e-05,0.000146,-0.000206,-5.8e-05,-0.000142,-0.000329,0.000167,6.7e-05,-0.000434,-0.000194,0.000241,8e-06,-9.5e-05,-3.6e-05,-0.000138,-4e-05,0,0.000238,-0.000252,-6.7e-05,-7.4e-05,-0.000161,-0.000172,0.000189,-0.000129,2e-04,-0.000156,-7e-05,-3.7e-05,-0.000166,6.1e-05,-0.000166,-0.000134,-0.000218,-0.00021,-0.000162,-5.9e-05,-7.3e-05,-0.00025,0.000144,-5.6e-05,-0.000227,7.3e-05,0.000216,-2.8e-05,1.7e-05,-4.4e-05,0.000269,0.000145,-3.6e-05,-0.000266,8.5e-05,-8.9e-05,-0.000218,-8e-06,0.000144,-0.000344,-0.00025,-6.8e-05,-3.2e-05,-0.000145,-9e-05
-9.6e-05,3.5e-05,6.1e-05,0.000226,3.7e-05,-6e-06,2.9e-05,-4.9e-05,0.000279,-2.4e-05,0.000183,-5.6e-05,-0.000232,0.000114,8.4e-05,-0.000423,1.9e-05,1.5e-05,-9.5e-05,8e-06,-6.2e-05,-1.3e-05,-0.00022,4.8e-05,-0.000163,0.000165,-0.000152,4.6e-05,-0.000132,0.000185,-3.4e-05,0.000146,-9.5e-05,3e-06,-8.2e-05,8e-06,0.000137,0.000226,4.3e-05,-0.000224,0.000117,1.9e-05,-1.1e-05,-4.2e-05,-5e-06,-6e-06,0.000144,-0.000182,0.00016,-1.4e-05,3.2e-05,-3.3e-05,0.000202,-0.000158,8e-06,7e-06,-4.2e-05,4.8e-05,7.3e-05,-0.000132,-0.000307,1.9e-05,-7.7e-05,-1.8e-05,1.9e-05,-9.9e-05,-5.3e-05,0.000217,0.00013,-0.00031,5.9e-05,8.6e-05,-0.000176,-7.2e-05,2e-06,-2.4e-05,6.8e-05,7.7e-05,8.9e-05,-0.000232,0.00016,0.000219,9.9e-05,0.000151,-0.000271,0.000204,5.6e-05,-3.8e-05,4.1e-05,3.4e-05,-2.1e-05,0.000135,1.1e-05,-3e-06,-7.8e-05,-0.00016,8.7e-05,-8e-06,-0.000244,-3.3e-05,6.9e-05,-0.000127,-0.000386,3.6e-05,0.00019,-9.3e-05,-0.000286,5.3e-05,6.1e-05,0.000285,7e-05,-5.2e-05,0.000389,-0.000137,-1e-04,0.000519,0.000142,-0.000108,1.1e-05,6.9e-05,8.4e-05
8.5e-05,-5.5e-05,-2e-05,4e-06,-5.8e-05,0.000154,-1.5e-05,-8e-06,-0.000134,3.6e-05,-4.4e-05,-0.000164,0.00013,0.000173,-1.2e-05,0.000389,-0.000161,-8.6e-05,0.000176,-0.000206,4.2e-05,8.6e-05,0.000219,7e-06,0.000112,4.4e-05,2.6e-05,-0.000277,0.000176,-2.4e-05,0.000126,2e-05,0.000264,-2.2e-05,-0.000108,-1e-06,-0.000176,1e-05,-9.3e-05,-5.4e-05,-2.2e-05,9.2e-05,-7.7e-05,-4.7e-05,1.8e-05,-0.00017,-0.000198,0.000283,-2.7e-05,-6.2e-05,-7e-06,9.7e-05,-0.000102,0.000165,7.1e-05,-7.8e-05,-4e-05,-8.6e-05,-8.1e-05,0.000102,0.000186,5.9e-05,-9e-06,0.000209,8.7e-05,-4e-06,-2.2e-05,2.2e-05,-3.5e-05,5.3e-05,8e-05,-4.8e-05,1e-04,9.8e-05,-5.4e-05,0.000127,-0.000257,-0.000106,-6.4e-05,0.000264,-1.9e-05,-0.000245,-0.000157,-0.000153,0.000184,-0.000138,-0.00018,2.4e-05,-2.9e-05,-8.9e-05,-4e-06,-8.2e-05,5.9e-05,-4e-05,6.6e-05,0.000167,-8.7e-05,0.00017,0.000165,4.5e-05,4.1e-05,-6e-05,0.000155,-1.4e-05,-8.2e-05,5.3e-05,0.000161,-0.000144,0.000128,-3.9e-05,-5.7e-05,0.000104,-2.1e-05,0.000141,9.3e-05,-0.000179,4.3e-05,2.2e-05,5.5e-05,3e-06,-9.4e-05
-0.00015,-4.1e-05,4.1e-05,2e-05,-1.4e-05,-9.9e-05,-1.9e-05,8.8e-05,-3.7e-05,0.000176,0.000119,0.000165,2.4e-05,-0.000281,-0.000164,-0.00013,0.000119,-3.3e-05,-0.000119,6.6e-05,5.7e-05,-0.000139,-0.000134,2.2e-05,-3.8e-05,5e-06,2.6e-05,0.000117,-0.000193,-0.000183,-2e-06,-9.5e-05,-6.5e-05,-9.8e-05,0.000117,4.8e-05,4.6e-05,-9.7e-05,1.6e-05,0.000111,-5e-05,-8.2e-05,-4.2e-05,6.7e-05,0.000103,0.000116,0.000103,-0.000152,1.8e-05,5.2e-05,0.000119,2.7e-05,-4.2e-05,-0.000148,-0.000119,4.2e-05,0.000109,9.5e-05,7.6e-05,-4.3e-05,-0.000108,-1.2e-05,4.3e-05,-0.00023,0.00013,-1.2e-05,-3.1e-05,6.4e-05,-4.8e-05,2.7e-05,-0.000206,4.6e-05,-1e-05,-6.9e-05,0.000148,-4.1e-05,8.6e-05,0.000144,5.4e-05,-0.000267,-3.4e-05,5.3e-05,-6e-05,0.000122,-6.7e-05,9e-06,0.000106,-2.9e-05,0.000145,0.000106,1e-05,4.4e-05,2.3e-05,7.5e-05,-5.7e-05,-4.9e-05,0.000144,-0.000154,-9.3e-05,3.6e-05,6.3e-05,0.000159,5e-05,-6.4e-05,-0.000117,-3.8e-05,-6.4e-05,-1.4e-05,-9.7e-05,5.5e-05,-3.6e-05,0.000159,-9.7e-05,-9.6e-05,-7.5e-05,-6.5e-05,-8.8e-05,1e-06,-0.000165,3.9e-05,8.8e-05
0.000127,3.5e-05,2.3e-05,-6.3e-05,-2.6e-05,-8.3e-05,-3.2e-05,-0.000101,0,-0.00013,-0.000156,2.2e-05,-4.2e-05,0.000213,7.5e-05,4.5e-05,-3.6e-05,3.1e-05,-1.3e-05,6.9e-05,1.2e-05,8.9e-05,8.3e-05,1.3e-05,1e-05,-3.6e-05,-7e-06,0.000116,4.4e-05,0.00012,-6.9e-05,3.8e-05,1e-05,-2.3e-05,-6.6e-05,-7.6e-05,1e-05,-4.4e-05,7e-06,-3e-05,0.000145,7.3e-05,2.8e-05,-1e-04,-2.9e-05,8.1e-05,-0.000103,-8.5e-05,6.1e-05,2e-06,-3.3e-05,-0.000171,9.1e-05,4.9e-05,-2.1e-05,-2.8e-05,-8.8e-05,-5e-06,2.8e-05,-3.1e-05,0.000163,2.1e-05,2.9e-05,1e-05,-0.000138,3e-06,-6e-06,-3.7e-05,8.3e-05,-2.4e-05,7.4e-05,-1.2e-05,-2e-06,3.8e-05,-8.7e-05,-5.4e-05,0.000168,-2e-06,4.5e-05,0.000227,9.7e-05,5.8e-05,0.000248,-6.9e-05,-2.1e-05,3.9e-05,-4.3e-05,2.9e-05,-0.000171,-4e-05,3.7e-05,-2e-06,3.6e-05,0.000115,6.7e-05,-1.4e-05,-7.6e-05,5.3e-05,1.9e-05,-4.3e-05,-0.000142,-2.3e-05,-8.6e-05,9e-06,1.4e-05,4.2e-05,4.6e-05,0.000158,-6e-06,-3.8e-05,-1.5e-05,-0.000146,2.5e-05,1.4e-05,4.6e-05,5.4e-05,1.3e-05,-7e-06,0.000118,-3.1e-05,-9.5e-05
-8.6e-05,-4e-05,-9.8e-05,-1e-05,5.2e-05,0.000178,-1.4e-05,-2.2e-05,-2.7e-05,-0.00014,8e-05,-0.000106,1.3e-05,-0.000319,-9e-06,-3.9e-05,8.9e-05,1.2e-05,-1.5e-05,-4.4e-05,-2.9e-05,-4.9e-05,-7.5e-05,3.2e-05,1.5e-05,-8.2e-05,4.3e-05,-0.000101,5.3e-05,2.6e-05,5.2e-05,8e-06,-2e-06,7.8e-05,3.5e-05,2e-06,-5.1e-05,5.1e-05,0,-2.7e-05,-4.2e-05,-7.6e-05,0.000102,-5.8e-05,-4e-05,-6.4e-05,5.5e-05,0.000114,-0.000193,2.8e-05,-3.4e-05,6.3e-05,-8.4e-05,2.9e-05,2.4e-05,7.1e-05,9.4e-05,-4e-05,-2.5e-05,9.1e-05,-5.9e-05,-1e-06,-3.1e-05,0.000126,-4.3e-05,-3.2e-05,0.000169,-6e-06,-5.9e-05,0.000122,-2.4e-05,4e-06,3e-06,3.6e-05,-3.2e-05,3e-05,-0.000157,-9.7e-05,-5.2e-05,-6.2e-05,-8.4e-05,-1e-05,-0.000177,-4e-05,0.000112,-9.9e-05,-4e-06,-3.8e-05,5.2e-05,8e-06,4.7e-05,-4.6e-05,-1.2e-05,-0.00013,-2.3e-05,5.9e-05,4.8e-05,3.9e-05,1.4e-05,-2.8e-05,-4.6e-05,-8.1e-05,8.6e-05,1e-05,6.9e-05,5.1e-05,-3.2e-05,-1.6e-05,-3e-05,-0.000146,-5.6e-05,9e-06,-1e-06,-1e-06,-7e-06,-4.4e-05,-5e-06,2.3e-05,-1.4e-05,1.6e-05,0.000132
5.3e-05,2.1e-05,3e-06,-1.5e-05,-3.3e-05,-7.6e-05,2.3e-05,8.9e-05,4.1e-05,0.000179,-4.4e-05,5.9e-05,-5e-06,0.000289,4.1e-05,8.8e-05,-6.3e-05,-1.4e-05,6.8e-05,-1e-06,7e-06,-4.3e-05,7.8e-05,-9.9e-05,-6.5e-05,3.1e-05,6.3e-05,6.1e-05,5e-06,-1.4e-05,-9.7e-05,-5e-05,-1.4e-05,1.9e-05,-5e-06,1.5e-05,8.8e-05,5.4e-05,-5e-06,6.3e-05,4.4e-05,2e-05,-0.000109,8.3e-05,1.2e-05,-3.9e-05,5.1e-05,-5.2e-05,0.000125,-3.6e-05,2.7e-05,6.6e-05,9.4e-05,-3.9e-05,1.9e-05,-6.7e-05,-2.9e-05,-1.5e-05,6e-06,-3.3e-05,-2.8e-05,1.8e-05,0,-0.000102,7.8e-05,4.5e-05,-7.9e-05,-8.8e-05,3.6e-05,-5.7e-05,5.3e-05,2.1e-05,2.2e-05,-6.7e-05,7e-06,-3.9e-05,1.9e-05,6e-05,6.4e-05,-2e-06,1.6e-05,-1.2e-05,1.2e-05,0.000109,-6.4e-05,0.000166,-1.3e-05,1.8e-05,-4e-05,1.6e-05,1.8e-05,9.5e-05,-1.8e-05,1.5e-05,4e-06,-5.9e-05,-5.4e-05,-4.8e-05,-3.1e-05,5.2e-05,0.00016,3e-05,-4.3e-05,9e-06,4.6e-05,-7.4e-05,-2.6e-05,-3.4e-05,8.7e-05,0.000159,9e-05,4.1e-05,-7e-06,2.1e-05,-1.2e-05,1.6e-05,2.6e-05,1.5e-05,1.5e-05,-2.7e-05,-9.6e-05
-4.7e-05,4.1e-05,2e-05,0.000102,2.2e-05,-7.1e-05,7e-05,-1e-05,-5.8e-05,-5.2e-05,6.6e-05,2.3e-05,-9e-06,-0.000153,3.2e-05,-0.000142,-2.9e-05,-1e-06,2e-05,2.7e-05,-4e-06,5.9e-05,-3.7e-05,-4.7e-05,8.4e-05,4.7e-05,-7.8e-05,1.7e-05,-6.9e-05,-7.7e-05,0.000147,2.4e-05,-0.000133,1e-06,-6e-05,-7e-06,-9.8e-05,-9e-05,-6e-06,-5.2e-05,-2.7e-05,5e-06,-1.5e-05,-0.000105,-2.5e-05,5.6e-05,-8.2e-05,1.8e-05,3.8e-05,5e-06,-2e-06,-6.8e-05,-0.000129,4.4e-05,-1.6e-05,4.6e-05,2.2e-05,1e-05,-6.6e-05,-2.2e-05,4e-06,3e-06,-1.9e-05,3.5e-05,2e-05,-6.7e-05,-0.000148,0.000108,-2.6e-05,-1.4e-05,-2.4e-05,4e-06,-1.2e-05,8e-05,2.9e-05,1.4e-05,1.8e-05,-3.2e-05,-4.5e-05,-3.6e-05,-2.7e-05,-2.9e-05,4.2e-05,-6.3e-05,-1.7e-05,-6.5e-05,6.6e-05,0,8.8e-05,-4e-05,-6.7e-05,-4.5e-05,-6e-06,-4.6e-05,-5.4e-05,3.9e-05,2e-06,9.9e-05,7.5e-05,-1.7e-05,-0.000111,2.8e-05,-0.000112,3.7e-05,-3.7e-05,2e-06,9.2e-05,-3.7e-05,-8.4e-05,-6e-06,-4.6e-05,-7e-05,7.6e-05,4e-05,2e-05,9.2e-05,1.7e-05,9e-06,-5.8e-05,6e-06,3e-05
5.6e-05,-1e-06,1e-05,7e-06,-2.5e-05,8.5e-05,-5.4e-05,-1.1e-05,3.1e-05,-4e-05,-4e-05,-5.4e-05,2.6e-05,7.5e-05,-4.8e-05,9.8e-05,3.9e-05,-5e-06,-9.8e-05,-3.7e-05,-1.5e-05,-7.7e-05,1e-05,5.9e-05,-2.3e-05,-4.1e-05,-4.4e-05,-8.9e-05,2.5e-05,5.3e-05,-0.000124,3.3e-05,0.000199,-4.4e-05,6.3e-05,-2.4e-05,2.4e-05,4.5e-05,-2e-06,-4.2e-05,-5.2e-05,-3.7e-05,8.6e-05,6.7e-05,2.1e-05,-1.7e-05,3.9e-05,1.3e-05,-6.6e-05,-2.9e-05,3e-05,-5e-06,1.9e-05,-2.5e-05,-2.7e-05,-4.4e-05,-4e-05,-2e-06,-8e-06,4.7e-05,1.5e-05,-2.6e-05,2.8e-05,1.3e-05,-3.6e-05,8.1e-05,0.000119,-3.5e-05,1.4e-05,-6.1e-05,4.9e-05,-1e-05,5e-06,1.4e-05,1.5e-05,1e-05,-7e-05,1.3e-05,-3.6e-05,1.9e-05,7e-06,5.3e-05,5.1e-05,2.8e-05,3.5e-05,1.6e-05,-2e-05,1.3e-05,-0.000104,1.8e-05,-4e-06,-2.3e-05,-1.1e-05,4.3e-05,0.000102,3.2e-05,3.5e-05,-4.6e-05,-3.1e-05,-1.6e-05,3.3e-05,2.7e-05,0.000165,-2.6e-05,-4.9e-05,4.8e-05,-0.000117,-3.6e-05,3.1e-05,1e-06,4.2e-05,3.2e-05,-9.6e-05,-5.4e-05,-2.4e-05,-4e-05,-2.4e-05,-5e-06,7.8e-05,-3.6e-05,-1e-05
-4.2e-05,6e-06,0,-6.3e-05,8e-06,-5e-06,1.7e-05,3.8e-05,3.2e-05,6.1e-05,2.2e-05,6e-06,-1.4e-05,-4e-05,5e-06,-2.7e-05,1e-05,1.4e-05,5e-05,-2.3e-05,-1.1e-05,7.2e-05,6e-06,1.7e-05,9e-06,3e-06,-4e-06,3.1e-05,3.6e-05,1.5e-05,7.6e-05,-3.1e-05,-2.5e-05,1.6e-05,-3.3e-05,-1.8e-05,4.7e-05,4.4e-05,-4e-06,8.5e-05,3e-05,6.4e-05,-1.6e-05,5.7e-05,1.3e-05,-2.4e-05,-1.7e-05,2.1e-05,-3e-06,4.1e-05,0,3.2e-05,7.4e-05,9e-06,2.6e-05,2.2e-05,4e-06,3.6e-05,-3e-06,-2.9e-05,-1e-06,1e-05,-2e-05,-3.1e-05,-4.3e-05,-7.1e-05,5e-06,1.3e-05,9e-06,5.7e-05,-6.9e-05,3e-06,2.5e-05,-5.5e-05,-7.3e-05,-1.2e-05,9.9e-05,-6e-06,4.7e-05,1.2e-05,4.4e-05,-4.7e-05,-0.00011,-2e-06,5e-06,-2.7e-05,-2.6e-05,-2.7e-05,6.4e-05,8e-06,0,6.9e-05,1.1e-05,5.7e-05,-6.8e-05,-5.8e-05,-2.7e-05,-7e-05,-6e-05,1.5e-05,-7e-06,1.2e-05,-7.8e-05,-4e-06,-1.5e-05,-4.5e-05,9.2e-05,7.6e-05,2.3e-05,1.6e-05,-2.2e-05,1e-06,-1.4e-05,1.6e-05,3.3e-05,-0.000124,-3.2e-05,-1.8e-05,-3.8e-05,2e-05,4e-06
-1.2e-05,-5e-06,-3.4e-05,-1.2e-05,0,-4.7e-05,3.1e-05,-5.2e-05,-3.6e-05,-3.3e-05,-4.5e-05,5.6e-05,-2.3e-05,5e-05,1.5e-05,5.8e-05,-2e-06,7e-06,8e-06,5.6e-05,1e-05,-2.9e-05,-1.6e-05,2.8e-05,-2.6e-05,-2.1e-05,5.1e-05,8.9e-05,-2e-06,-1e-06,-6.2e-05,-1.3e-05,-6.1e-05,7e-06,3.7e-05,3.4e-05,-7e-05,-1.7e-05,9e-06,-4.2e-05,-4.5e-05,-4.1e-05,-2.3e-05,-5.2e-05,4.1e-05,-2e-05,5e-06,-2.6e-05,0,-7.9e-05,-3.3e-05,-1.3e-05,-5.4e-05,-3e-06,2.1e-05,-2.1e-05,1.4e-05,2.2e-05,2.3e-05,4e-06,3e-06,4e-06,2.7e-05,3.3e-05,5e-05,5.9e-05,-1.4e-05,-4e-05,-1.5e-05,1.5e-05,-4.2e-05,-2.1e-05,-1.3e-05,3.5e-05,4.7e-05,2.3e-05,7e-06,1.9e-05,-5.5e-05,-6.2e-05,-1.5e-05,3.7e-05,3.2e-05,-1.7e-05,-1.8e-05,-3.6e-05,2.5e-05,2.1e-05,-5.7e-05,-1.1e-05,1.3e-05,-7e-06,-2e-06,-2.4e-05,6e-06,2.1e-05,3.9e-05,9e-05,5.7e-05,-7e-06,7e-06,-3.9e-05,5.7e-05,4e-06,6.4e-05,-4e-06,-5.9e-05,-4e-06,-1.6e-05,-0.000112,4.2e-05,-3e-06,5.8e-05,-1.8e-05,-3.9e-05,0.000111,3.2e-05,-8e-06,-3e-06,4.2e-05,1.9e-05
2.2e-05,0,3.2e-05,2e-06,-1e-06,3.4e-05,-7.4e-05,2e-05,3.8e-05,-2e-05,2.6e-05,-4.2e-05,4e-05,-7.9e-05,-2.9e-05,-7.2e-05,-2.8e-05,-9e-06,0,-1.6e-05,2.1e-05,1.6e-05,2.3e-05,-2e-06,2.1e-05,3.4e-05,4e-05,-5.1e-05,-3e-05,-4.2e-05,5.3e-05,2.9e-05,2.3e-05,-6e-06,-1.9e-05,1.1e-05,5.2e-05,-5.3e-05,-3e-06,-8e-06,8e-06,2.9e-05,-4.4e-05,5.2e-05,-1.7e-05,3.8e-05,3.9e-05,-1.6e-05,4.1e-05,6.2e-05,-1e-05,-7e-06,7e-06,5e-06,-6e-06,-4e-06,-2.7e-05,-2.6e-05,1.3e-05,3.5e-05,-1.5e-05,-1.5e-05,-3.1e-05,-1.8e-05,1.2e-05,-4.1e-05,6e-06,4.8e-05,5e-06,-1.4e-05,2.6e-05,1e-05,-1.1e-05,-1.6e-05,3e-06,3e-06,-0.000122,2e-05,2.5e-05,5.6e-05,-1.5e-05,-2.9e-05,5.4e-05,3.9e-05,1.7e-05,4.7e-05,-2.2e-05,-1.7e-05,6.4e-05,1.6e-05,-8e-06,-2.8e-05,3e-05,-3.7e-05,1.1e-05,1e-05,-6e-05,-3e-05,-1e-06,1.9e-05,1.6e-05,-1.5e-05,-3e-05,-1.2e-05,3.2e-05,8e-06,6.6e-05,-1.7e-05,-6e-06,8.3e-05,-3.2e-05,3.3e-05,-1.2e-05,2.5e-05,3.1e-05,9e-06,7e-06,-9e-06,3.7e-05,-5.3e-05,-3.3e-05
1.1e-05,-2e-06,3.3e-05,4.1e-05,1e-06,2.1e-05,5.1e-05,1.1e-05,-2.5e-05,5.9e-05,-4e-06,-2.4e-05,-2.3e-05,9.1e-05,2.8e-05,7.3e-05,3e-06,-1e-05,-3.7e-05,-2.5e-05,-2e-06,-1.7e-05,-2.6e-05,-2.8e-05,-5e-06,4.3e-05,-3.7e-05,-1.1e-05,-1.5e-05,6.6e-05,-1e-05,-5e-06,-5.9e-05,-3.1e-05,-4e-06,-4.1e-05,-3.1e-05,1.5e-05,-1.4e-05,2.6e-05,7e-06,-1.4e-05,8e-05,-1.8e-05,-1.2e-05,-1.6e-05,-5.7e-05,2.2e-05,-1e-05,-5e-05,7e-06,5.2e-05,2e-06,-8e-06,-4e-06,8e-06,3.6e-05,-7e-06,2e-06,-3.1e-05,3e-05,1e-05,1.4e-05,-4.7e-05,-3.1e-05,2.7e-05,-1.3e-05,-2.8e-05,1.6e-05,-4e-06,-2.8e-05,-2e-06,1.3e-05,-1.7e-05,5e-06,-4.1e-05,9.2e-05,-3.7e-05,1.3e-05,-1.2e-05,3e-06,1.8e-05,-2.9e-05,-2.5e-05,-1.6e-05,-1.8e-05,2.2e-05,4e-06,-5.3e-05,-1.2e-05,-1e-06,1.3e-05,-1.1e-05,-1.3e-05,3e-05,-1.9e-05,5.2e-05,-4.8e-05,-2.4e-05,-7e-06,-1.7e-05,8e-06,2.5e-05,2.2e-05,-5.8e-05,-1.9e-05,-7.8e-05,-1.3e-05,1.7e-05,4.6e-05,1.5e-05,-6e-06,1.2e-05,-5e-06,-2.1e-05,-3.8e-05,-1.7e-05,0,-5.1e-05,2.5e-05,1.9e-05
-1.1e-05,-2.5e-05,-6.4e-05,-1.2e-05,4e-06,-5.7e-05,-4.9e-05,-2.9e-05,0,1.3e-05,2.1e-05,4.3e-05,3e-06,-8.2e-05,-2e-06,-3.4e-05,2.5e-05,5e-06,3e-05,2.1e-05,-1.1e-05,2.3e-05,3e-05,-1.2e-05,1.2e-05,-3.2e-05,-2.3e-05,-1e-05,4.9e-05,-4.1e-05,-1.6e-05,3e-06,6.4e-05,2.3e-05,1.7e-05,-1.1e-05,-1.2e-05,5.1e-05,5e-06,-2e-05,-2.1e-05,-2.9e-05,-1.7e-05,-1.8e-05,-1.3e-05,5.5e-05,2e-05,-2.5e-05,-3.7e-05,3.2e-05,0,-3.5e-05,2e-05,5e-06,3e-06,-2.4e-05,-1.8e-05,-1.6e-05,1e-05,0,-3e-05,4e-06,-1e-05,8.9e-05,-1.7e-05,-5e-06,2.8e-05,1.5e-05,-9e-06,-4e-06,1e-05,-1e-06,1.2e-05,4.3e-05,-2.5e-05,2.8e-05,2.4e-05,-6e-06,-1.1e-05,-1e-05,-2.4e-05,3e-06,-5.5e-05,1.2e-05,-1e-06,-2e-06,-2.8e-05,-1e-06,4.5e-05,5e-06,1.4e-05,-3e-06,-1e-05,1.5e-05,-6.4e-05,1.4e-05,-2.7e-05,5.6e-05,2e-05,-2.6e-05,1.9e-05,-3e-06,-9.9e-05,-1.6e-05,-3e-05,2.6e-05,5.9e-05,-1e-06,-1.1e-05,-3.6e-05,-4e-05,-4.5e-05,-3.3e-05,-9e-06,2e-05,8e-06,1e-05,9e-06,1.9e-05,-4e-06,-2e-05
-5e-06,3e-06,2e-05,-7e-06,-1.1e-05,3e-05,-3e-06,3e-05,5e-06,-7.4e-05,-1.6e-05,2e-06,1e-05,2e-05,-1.1e-05,8e-06,-1.2e-05,1e-06,2e-05,-2e-05,-3e-06,-2.1e-05,-3.3e-05,9e-06,-4e-06,-3.9e-05,-3e-06,1.2e-05,-1.7e-05,-1.1e-05,9e-06,-1.4e-05,-2.3e-05,2.8e-05,-1e-06,1.8e-05,5.5e-05,-2.1e-05,1.6e-05,-5e-06,4.1e-05,3.3e-05,-4.5e-05,-1e-06,-1e-06,-6.7e-05,3e-06,1.9e-05,2e-05,-2.3e-05,5e-06,-4.1e-05,-4.2e-05,4e-06,7e-06,2.1e-05,1e-06,1.5e-05,-1e-05,1.2e-05,9e-06,1e-06,1.3e-05,-3e-05,2.4e-05,-1.2e-05,-5.5e-05,-2.3e-05,-2.4e-05,-3e-05,8e-06,1e-06,-2.7e-05,-3e-05,8e-06,-8e-06,-8.1e-05,2.6e-05,2.4e-05,1.5e-05,1.2e-05,-1.1e-05,5.5e-05,-2e-06,2.6e-05,2e-06,2.3e-05,6e-06,-5.1e-05,1e-06,-1.2e-05,7e-06,5e-06,3e-05,5.2e-05,-6e-06,1.1e-05,-3.8e-05,-2.4e-05,2.3e-05,-4.6e-05,1e-06,0.000104,1e-06,2.9e-05,-3e-06,-3.1e-05,4.5e-05,-8e-06,2.2e-05,2.6e-05,4.1e-05,-3e-06,2e-05,-2.2e-05,2.3e-05,7e-06,1e-05,-4e-06,8e-06,3.7e-05
1.5e-05,-5e-06,-2.4e-05,-4.8e-05,1.2e-05,1.3e-05,6.8e-05,0,-9e-06,1.5e-05,-1e-06,-3.5e-05,-2.3e-05,1.6e-05,3.5e-05,-1.4e-05,3e-06,4e-06,-5.8e-05,-1e-05,5e-06,1.3e-05,3e-05,-1.2e-05,-9e-06,3e-06,2e-06,-1.8e-05,-7e-06,2.5e-05,6e-06,-1.8e-05,7.1e-05,5e-06,-2e-06,1.4e-05,-4.6e-05,-2.6e-05,-1.4e-05,2.8e-05,-1e-06,-3.7e-05,3.5e-05,-3e-06,-1e-06,3.2e-05,-3e-06,1.1e-05,1.2e-05,0,-1.4e-05,4.7e-05,2.8e-05,-1.3e-05,-1e-05,-2.7e-05,3.3e-05,-3e-06,1.3e-05,-2.4e-05,3e-06,2e-06,-1.3e-05,-6.2e-05,1.6e-05,1.2e-05,-1e-06,2.6e-05,1.3e-05,2.8e-05,-4e-06,3e-06,1.1e-05,-1e-05,2.2e-05,-8e-06,4.9e-05,1.2e-05,-1.4e-05,-2.1e-05,-3e-06,1e-06,2.1e-05,-2e-05,-2.3e-05,7e-06,-1.1e-05,0,4.9e-05,-1e-05,6e-06,0,-1.6e-05,1.4e-05,-2.1e-05,-1e-05,-8e-06,2.2e-05,2.5e-05,1.1e-05,6.6e-05,1.6e-05,-3.9e-05,2e-06,2.4e-05,-1.9e-05,1.2e-05,-8e-06,1.6e-05,-6.8e-05,-1.2e-05,-2.1e-05,3.2e-05,-1.9e-05,1.7e-05,-9e-05,-1.4e-05,1.1e-05,2.5e-05,4e-06,-3.5e-05
-1.1e-05,1e-06,3.6e-05,2.8e-05,-1e-06,-1.9e-05,-6.8e-05,-2.7e-05,2e-06,1.3e-05,-8e-06,1.1e-05,2.1e-05,-2.3e-05,-3.6e-05,3.8e-05,-1.8e-05,-5e-06,4.2e-05,2.7e-05,1e-06,-1.3e-05,-3.2e-05,1.2e-05,3e-06,1e-06,2e-05,2.2e-05,-1.3e-05,2.1e-05,-1.3e-05,3.6e-05,-8.5e-05,-2.3e-05,0,-1.1e-05,1.8e-05,1.4e-05,-1.1e-05,-1.8e-05,-4e-06,3.8e-05,-1e-06,-2.2e-05,3e-06,7e-06,2.1e-05,-1.7e-05,-3e-06,7e-06,-4e-06,1.2e-05,3e-06,1.1e-05,-1.1e-05,2.3e-05,-4.4e-05,5e-06,-4e-06,1.1e-05,-7e-06,-5e-06,1.2e-05,6.6e-05,-2.8e-05,-9e-06,8.5e-05,-7e-06,1.4e-05,1.6e-05,-3.6e-05,0,-5e-06,3.4e-05,-1.9e-05,2.1e-05,-1e-06,-2.7e-05,-7e-06,3e-05,1.1e-05,-6e-06,-5.4e-05,3.1e-05,1.9e-05,8e-06,-3e-06,1e-06,-3.5e-05,4e-06,9e-06,-1.6e-05,2e-06,-4.2e-05,-3e-06,2.3e-05,-9e-06,2.8e-05,-1.3e-05,-1.8e-05,-2.4e-05,-5e-06,5e-06,-2e-06,1e-05,2.3e-05,-8e-06,-4.3e-05,-4e-06,3.2e-05,1e-05,3e-06,-3e-06,1.6e-05,-1.1e-05,0.000113,-6e-06,2e-06,-4.7e-05,3e-06,2.3e-05
1.1e-05,1.7e-05,1e-06,1.8e-05,3e-06,-5e-06,4.7e-05,1.1e-05,-9e-06,-1.4e-05,8e-06,2.7e-05,-2e-06,5.8e-05,-5e-06,-5.9e-05,1.3e-05,-3e-06,-1.5e-05,1e-06,-5e-06,-2e-06,3.3e-05,1.7e-05,-8e-06,3.3e-05,1.1e-05,3e-05,2.6e-05,-3.3e-05,2e-05,-2e-06,-2.6e-05,-2e-05,-2e-05,-2.8e-05,9e-06,1.4e-05,1.3e-05,-1.6e-05,1.6e-05,-1.6e-05,-1e-06,1e-05,1.5e-05,-1.7e-05,-3.1e-05,2e-05,-4e-06,-5e-06,5e-06,-4e-05,-4e-06,-2e-06,2e-06,-2.4e-05,1.7e-05,4e-06,-3e-06,9e-06,2.1e-05,1e-06,-1.1e-05,-1.7e-05,-5e-06,6e-06,-3.3e-05,1.8e-05,-9e-06,2e-06,4e-06,5e-06,9e-06,-3.1e-05,4e-06,-6e-06,-4.3e-05,-1e-06,1.5e-05,-2.8e-05,1.4e-05,1.8e-05,1e-06,-2.5e-05,2e-06,1.2e-05,5e-06,-4e-06,3.8e-05,-2e-06,2e-06,0,8e-06,-2e-06,1e-06,-1.5e-05,2.6e-05,-5.2e-05,0,-3e-06,-3.7e-05,-2.9e-05,3e-05,1e-06,-2.4e-05,-1e-06,3e-06,1.8e-05,-7e-06,5.7e-05,-1.6e-05,2.9e-05,-2e-06,-1.4e-05,9e-06,-1.9e-05,1.2e-05,-4e-06,4e-05,-9e-06,-2.2e-05
-1.9e-05,4e-06,-1.9e-05,1.5e-05,-7e-06,2.5e-05,9e-06,2e-06,6e-06,3.4e-05,5e-06,-2.1e-05,-1.6e-05,-4.9e-05,1.4e-05,1.4e-05,2e-06,2e-06,-3e-06,-1.8e-05,-1e-06,7e-06,-3.1e-05,8e-06,-3e-06,2e-06,-1.3e-05,-6.5e-05,-6e-06,-6e-06,-3.8e-05,-2.1e-05,6.7e-05,2e-06,1.8e-05,1.3e-05,-4e-05,5e-06,9e-06,2.7e-05,-2.2e-05,1e-06,-1.3e-05,2.2e-05,-5e-06,-2.2e-05,1.1e-05,-1.8e-05,-1.8e-05,2e-06,7e-06,1.2e-05,3e-06,-1.2e-05,3e-06,1.7e-05,-3e-06,-9e-06,-8e-06,-1.7e-05,-2.5e-05,2e-06,5e-06,1e-05,1.4e-05,-1e-06,-5.1e-05,-4e-05,-6e-06,-2.2e-05,3e-06,-1.2e-05,-2e-05,1.1e-05,-1e-05,-7e-06,6.9e-05,2.5e-05,-2e-05,-7e-06,-1.1e-05,-1.9e-05,5.2e-05,9e-06,-1.2e-05,-3.1e-05,5e-06,6e-06,-4.6e-05,0,-1.6e-05,2e-05,2e-06,-3e-06,1.9e-05,-4e-06,-2.6e-05,3.2e-05,1.3e-05,6e-06,2.5e-05,2.2e-05,-3.4e-05,3e-06,-3.3e-05,-9e-06,1.2e-05,2.2e-05,1.3e-05,-3.9e-05,1.4e-05,-1.6e-05,-1.2e-05,6e-06,-8e-06,-6.5e-05,5e-06,-9e-06,-1.2e-05,3e-06,1.9e-05
2e-05,2e-06,1.9e-05,-2.7e-05,-4e-06,-2.3e-05,-4e-05,-1.3e-05,1e-05,-1.3e-05,0,-1.8e-05,1.6e-05,1.3e-05,-1.7e-05,3.5e-05,1e-06,3e-06,1.2e-05,1e-05,4e-06,-1.5e-05,2.3e-05,-1.4e-05,4e-06,-2.5e-05,-1e-05,6e-06,-8e-06,1.3e-05,4.2e-05,1.7e-05,-3.8e-05,1.3e-05,-1e-05,1.6e-05,4.9e-05,-3e-05,-1.6e-05,-1.6e-05,1.4e-05,1.5e-05,1e-05,-3.2e-05,-6e-06,3.2e-05,5e-06,-3e-06,2.9e-05,4e-06,7e-06,2.8e-05,-2e-05,1.9e-05,-3e-06,-1.1e-05,-6e-06,-1.6e-05,-1e-05,6e-06,1.2e-05,-5e-06,-2e-06,3e-06,1.6e-05,-4e-06,2.6e-05,1.2e-05,-2e-06,-9e-06,-1.6e-05,1e-06,1.7e-05,1.7e-05,2e-05,1.1e-05,-2.4e-05,-1.4e-05,8e-06,1.7e-05,-2e-06,1.7e-05,-3.2e-05,-4e-06,2.9e-05,5e-06,0,-4e-06,4.1e-05,6e-06,-1.2e-05,-1.8e-05,2e-06,2e-05,-2.9e-05,1.8e-05,2.3e-05,1.3e-05,-9e-06,5e-06,9e-06,3.4e-05,-5e-05,-9e-06,1.9e-05,9e-06,-2.2e-05,-3e-06,-2e-06,1.2e-05,2e-06,-1.8e-05,-1.4e-05,1e-05,4e-06,3.1e-05,-5e-06,-9e-06,-5e-06,-5e-06,-7e-06
-1.6e-05,1e-06,-2.1e-05,-1e-05,-6e-06,2e-06,4.3e-05,2.1e-05,-9e-06,-2.5e-05,-4e-06,2.8e-05,-5e-06,-2.4e-05,2.9e-05,-4.5e-05,-9e-06,1e-06,-2.1e-05,-1e-06,4e-06,1.9e-05,-1.8e-05,-7e-06,6e-06,7e-06,-1.1e-05,1.6e-05,-1.4e-05,2.6e-05,-3.5e-05,-1.1e-05,5.7e-05,1.2e-05,1e-06,-1e-05,-2.5e-05,9e-06,-8e-06,-2e-06,-7e-06,-3.3e-05,1.3e-05,4.5e-05,-9e-06,5e-06,-2e-06,1.2e-05,-3e-06,3e-06,-4e-06,-2.5e-05,3.4e-05,-1.9e-05,-2e-06,7e-06,1.6e-05,5e-06,2e-06,1e-06,-1.2e-05,0,5e-06,-5.2e-05,-1.4e-05,4e-06,1.6e-05,5e-06,8e-06,1.5e-05,2.5e-05,-2e-06,-6e-06,-2.5e-05,-1.3e-05,-1.4e-05,-5.5e-05,-2e-05,3e-06,4e-06,-3e-06,-1.6e-05,-1.8e-05,-8e-06,-1.7e-05,0,-9e-06,-3e-06,-3.5e-05,-4e-06,1e-05,0,2e-06,2.5e-05,1e-05,-2e-05,-2.6e-05,-3.8e-05,-1.2e-05,5e-06,7e-06,-2.3e-05,0.000105,7e-06,3.7e-05,-1.1e-05,2.4e-05,-1.6e-05,-1.2e-05,-4.1e-05,3e-06,3e-05,3.3e-05,-1.4e-05,0,4.6e-05,-3e-06,-3e-06,9e-06,-2e-06,-2e-06
1.2e-05,-6e-06,3e-05,5e-06,3e-06,1.8e-05,-3.7e-05,-1.4e-05,5e-06,2.2e-05,-6e-06,4e-06,-1e-06,3.8e-05,-4e-06,1.6e-05,3e-06,-3e-06,2.4e-05,-1.6e-05,-1e-06,-1.3e-05,1.5e-05,-1.3e-05,-3e-06,0,1.2e-05,-9e-06,3.1e-05,-2.6e-05,2.6e-05,-3e-06,-3.7e-05,1e-06,5e-06,-1.5e-05,-6e-06,2.1e-05,1.7e-05,1.6e-05,-1.3e-05,3e-05,-3.5e-05,-2e-05,0,-3.2e-05,7e-06,-1.4e-05,-2.4e-05,-1e-05,0,-9e-06,-2.7e-05,1.1e-05,7e-06,-2e-06,-1.9e-05,1.9e-05,3e-06,-1e-05,1.8e-05,2e-06,-6e-06,5.2e-05,-1.2e-05,2e-06,-6e-06,2.2e-05,0,-2e-06,5e-06,1e-06,-2e-06,1.9e-05,1e-06,2e-06,7.1e-05,1.6e-05,-7e-06,-3e-06,-6e-06,9e-06,1.8e-05,1.3e-05,-5e-06,-8e-06,6e-06,4e-06,4e-05,0,1.3e-05,1e-05,-3e-06,-2.7e-05,1.7e-05,1.1e-05,2.4e-05,2e-05,1.9e-05,-1.7e-05,-4.9e-05,-2.1e-05,-9.3e-05,-1e-06,-5e-06,2e-06,-1.7e-05,-1.4e-05,4e-06,2e-06,-3e-06,-3e-05,-3e-06,1.3e-05,-2e-06,-7.6e-05,-3e-06,2e-06,3e-06,3e-06,0
-1.5e-05,-3e-06,-2.7e-05,2.5e-05,2e-06,-1.5e-05,-1e-06,1e-06,2e-06,5e-06,8e-06,-2.8e-05,4e-06,-4.8e-05,-2.9e-05,6e-06,3e-06,0,-2.6e-05,2.1e-05,-2e-06,7e-06,-1.4e-05,5e-06,1e-05,6e-06,1.4e-05,1.5e-05,-6e-06,-1.3e-05,-2.1e-05,1.2e-05,-2e-05,-5e-06,-1e-05,-1e-06,3.1e-05,-8e-06,4e-06,-1.4e-05,1.3e-05,-2.7e-05,3e-05,-7e-06,1e-06,2.2e-05,-1.3e-05,1.2e-05,2.2e-05,1.6e-05,1e-06,2.6e-05,9e-06,2e-06,6e-06,-3e-06,1.8e-05,3e-06,1e-05,8e-06,-1.6e-05,0,5e-06,1.5e-05,8e-06,-6e-06,-9e-06,-2.3e-05,-2e-06,1.1e-05,-7e-06,2e-06,3e-06,5e-06,0,8e-06,-1.6e-05,1.7e-05,1e-05,-1.5e-05,5e-06,0,1.9e-05,-1.2e-05,1.7e-05,2.9e-05,-3e-06,-3e-06,-4e-05,-1e-06,6e-06,-6e-06,-4e-06,-1.5e-05,-2.3e-05,6e-06,-1.5e-05,7e-06,-8e-06,2e-06,4.2e-05,1.7e-05,7.7e-05,3e-06,-3.3e-05,6e-06,1.4e-05,2.1e-05,8e-06,6.2e-05,-4e-06,-2e-06,-2.2e-05,-1.5e-05,5e-06,5.8e-05,4e-06,6e-06,-1.2e-05,-8e-06,-4e-06
1.9e-05,-5e-06,0,9e-06,0,-3e-06,2.2e-05,1.4e-05,-4e-06,-9e-06,-3e-06,1.1e-05,-6e-06,6.3e-05,2.2e-05,1.4e-05,4e-06,-1e-06,1.1e-05,3e-06,-1e-06,3e-06,1.2e-05,1.4e-05,-7e-06,7e-06,-1e-06,1e-06,-1.6e-05,2e-05,1.7e-05,-7e-06,-7e-06,-5e-06,1.5e-05,2.2e-05,-4.1e-05,-1e-05,-1.7e-05,-8e-06,-1.6e-05,1.9e-05,-9e-06,2.2e-05,4e-06,5e-06,0,4e-06,-7e-06,-1.6e-05,0,-9e-06,0,-1.2e-05,0,1e-05,-1e-05,-1e-05,1e-06,3e-06,1.1e-05,0,-3e-06,-5.7e-05,8e-06,9e-06,1.3e-05,3e-06,-4e-06,2e-06,0,-1e-06,-3e-06,-2.6e-05,2e-06,-6e-06,-4.4e-05,-1.8e-05,-1.1e-05,1.9e-05,0,-1e-06,-2.1e-05,8e-06,-1.5e-05,-2.6e-05,1e-06,0,3.1e-05,-1e-06,-8e-06,-2e-06,3e-06,-4e-06,7e-06,-2e-05,2e-06,-3e-05,3e-06,1.9e-05,4e-06,-1e-05,-2.3e-05,1e-06,-1.2e-05,-1.3e-05,-1.5e-05,1.3e-05,-3e-06,-3.2e-05,6e-06,1.9e-05,1e-05,7e-06,-8e-06,-7e-06,4e-06,8e-06,-4e-06,8e-06,1.2e-05
-1.5e-05,-4e-06,7e-06,-2.1e-05,-4e-06,1.3e-05,-2.8e-05,-1.3e-05,1e-06,5e-06,5e-06,2e-05,6e-06,-5.9e-05,-1.4e-05,-5.3e-05,-4e-06,2e-06,1e-05,-2.7e-05,-2e-06,-6e-06,-8e-06,7e-06,4e-06,-2.1e-05,-1.5e-05,-1.3e-05,-2e-06,3e-06,-1e-05,7e-06,3e-05,-9e-06,-4e-06,-9e-06,2.7e-05,4e-06,-2e-06,2.1e-05,1e-05,3e-06,-1e-06,-2.9e-05,8e-06,0,9e-06,-9e-06,6e-06,2.4e-05,3e-06,-1.6e-05,2e-06,1.2e-05,-2e-06,-9e-06,5e-06,-1.1e-05,-1e-06,-6e-06,-1.1e-05,1e-06,0,3.1e-05,0,-1.3e-05,1.4e-05,-9e-06,3e-06,-8e-06,4e-06,2e-06,7e-06,2.3e-05,4e-06,7e-06,5.9e-05,-1.1e-05,4e-06,-4e-06,7e-06,2e-06,-1.9e-05,-2e-06,6e-06,1.7e-05,-4e-06,0,-3.2e-05,-1e-06,-6e-06,2e-06,-5e-06,2e-05,1.2e-05,1.7e-05,7e-06,3.2e-05,-6e-06,-9e-06,-1.6e-05,-1.3e-05,-2.5e-05,-6e-06,2.4e-05,7e-06,1.5e-05,-1.7e-05,-5e-06,-2e-06,-5e-06,-1.2e-05,-6e-06,2e-06,1e-05,-4.2e-05,-7e-06,4e-06,2.5e-05,-9e-06,-1.4e-05
1.2e-05,1e-06,2e-06,-1.6e-05,0,-6e-06,1.2e-05,-3e-06,0,-1.7e-05,-7e-06,-2.1e-05,-2e-06,5.6e-05,9e-06,5.9e-05,-4e-06,-1e-06,-2e-05,1e-05,-1e-06,0,6e-06,-3e-06,1e-06,-7e-06,-4e-06,-9e-06,1.7e-05,-1.1e-05,7e-06,-8e-06,2.9e-05,-1e-06,-7e-06,-2.1e-05,2e-06,8e-06,1.7e-05,-7e-06,4e-06,-1.5e-05,2e-06,1.1e-05,1e-06,-2.2e-05,-5e-06,6e-06,-5e-06,-1.9e-05,-2e-06,2e-05,3e-06,-6e-06,0,1.5e-05,-2e-06,4e-06,-2e-06,5e-06,7e-06,1e-06,1e-06,7e-06,-9e-06,1.6e-05,-4.3e-05,2.3e-05,4e-06,-1.9e-05,4e-06,-3e-06,-1e-05,-6e-06,-1.1e-05,0,-2.3e-05,1.7e-05,3e-06,-8e-06,3e-06,-9e-06,3.9e-05,-6e-06,6e-06,2e-06,5e-06,2e-06,3.9e-05,0,-3e-06,0,2e-06,1.8e-05,-7e-06,-1e-06,-1.5e-05,-7e-06,1e-06,-1e-05,7e-06,3.1e-05,-1.1e-05,-1e-06,2.4e-05,3e-06,-1.2e-05,-8e-06,5e-06,-2e-05,2e-06,6e-06,1.4e-05,-5e-06,-1.1e-05,3e-05,4e-06,-1e-06,-2.5e-05,6e-06,1.2e-05
-1.7e-05,4e-06,1.6e-05,3e-06,-2e-06,-8e-06,1.1e-05,1.3e-05,-2e-06,-3e-06,7e-06,-8e-06,-2e-06,-4.9e-05,1.7e-05,-2.8e-05,2e-06,1e-06,1.3e-05,1e-05,1e-06,7e-06,-4e-06,-3e-06,-6e-06,1.5e-05,3e-06,1.2e-05,-1e-06,1e-06,-8e-06,-8e-06,-4.2e-05,5e-06,9e-06,6e-06,-2.9e-05,0,0,-1.1e-05,-1.2e-05,2.5e-05,-1e-05,9e-06,-2e-06,2.5e-05,9e-06,0,-1.3e-05,1.7e-05,-4e-06,6e-06,-2.3e-05,-1e-06,-2e-06,-1.4e-05,-1.2e-05,4e-06,-2e-06,3e-06,-1e-06,-1e-06,0,-2.2e-05,5e-06,-1.8e-05,-8e-06,-1.3e-05,-3e-06,5e-06,-4e-06,1e-06,1.3e-05,-1.7e-05,1e-05,-6e-06,-3.3e-05,5e-06,-6e-06,0,-6e-06,1.5e-05,-9e-06,1.3e-05,-4e-06,-1.6e-05,1e-06,-2e-06,-3.5e-05,0,3e-06,5e-06,5e-06,-1.1e-05,-1.9e-05,-1.3e-05,2.6e-05,-2.5e-05,9e-06,5e-06,-1.8e-05,4e-06,4.5e-05,4e-06,-1e-05,-5e-06,7e-06,6e-06,-1e-06,-1.9e-05,-6e-06,1.3e-05,7e-06,1e-05,1.3e-05,4e-05,3e-06,-5e-06,7e-06,4e-06,-1.7e-05
