2e-06,-7e-06,-0.006393,-0.042665,-0.024384,-0.04068,-0.147362,-0.211484,-0.176122,-0.157051,-0.174966,-0.152256,-0.099142,-0.049194,-0.023759,-0.015373,-0.00704,-0.013239,-0.011908,-0.000375,-0.000472,-0.00287,-0.002239,-0.000323,-4.8e-05,-3.6e-05,-5.8e-05,-2.2e-05
1e-05,3e-06,-0.006873,-0.051337,-0.032587,-0.011549,0.043873,-0.010539,0.028699,0.09123,0.102137,0.101625,0.095421,0.054299,0.019083,0.010568,0.003294,-0.017903,-0.018426,-0.000524,-0.000365,-0.000669,-0.000603,-0.000135,-4e-06,2e-06,-2e-05,-5e-06
1e-06,-5e-06,-0.003732,-0.02233,-0.013369,-0.030791,-0.044498,-0.06506,-0.068504,-0.032801,-0.007313,-0.022544,-0.017739,-0.004061,-0.005079,-0.004506,-0.002338,-0.00949,-0.008097,-6.3e-05,-0.000353,-0.000554,-0.000471,-0.000151,-8e-06,-9e-06,-3e-06,-4e-06
-5e-06,-6e-06,0.002299,0.025923,0.017146,-0.041028,-0.135809,-0.06392,-0.06005,-0.134071,-0.148955,-0.138832,-0.108343,-0.054492,-0.023066,-0.014037,-0.004895,0.005215,0.007658,0.000467,-0.00022,-0.000763,-1.8e-05,0.00013,1.2e-05,8e-06,2.6e-05,8e-06
6e-06,1.5e-05,0.007238,0.053017,0.031889,0.039247,0.12932,0.223758,0.204127,0.139452,0.129222,0.137778,0.099225,0.0483,0.02427,0.016588,0.007375,0.017524,0.016738,0.000821,0.00037,0.001827,0.001545,0.000301,4.8e-05,3.8e-05,4.6e-05,2.6e-05
1.5e-05,2e-05,0.002498,0.010778,0.006332,0.047193,0.122546,0.100429,0.04727,0.088838,0.114451,0.089638,0.046439,0.017818,0.011651,0.007899,0.002016,0.008631,0.007246,0.000205,0.000346,0.001008,0.000146,-0.000114,-2e-06,-1e-05,-2.4e-05,-6e-06
-1.2e-05,-1.3e-05,-0.004388,-0.038303,-0.023068,-0.021333,-0.123378,-0.201668,-0.172563,-0.136925,-0.154001,-0.153731,-0.111963,-0.058593,-0.023919,-0.016822,-0.007425,-0.008562,-0.008955,-0.000538,-0.000147,-0.001842,-0.001522,-0.000233,-5.1e-05,-3.4e-05,-5.5e-05,-3e-05
5e-06,1e-06,-0.004246,-0.03222,-0.020008,-0.004574,-0.008949,-0.054218,0.003808,0.022165,-0.006698,0.023891,0.04353,0.025591,0.007186,0.004349,0.001847,-0.010894,-0.01172,-0.000259,-0.000101,-0.000766,-0.000446,-3.5e-05,0,8e-06,4e-06,0
9e-06,7e-06,0.000205,0.004392,0.002242,0.01966,0.086679,0.049705,0.017479,0.067557,0.103955,0.089985,0.061387,0.031358,0.008746,0.006413,0.00263,-0.003619,-0.002442,0.000291,6e-06,0.00099,0.000785,5.4e-05,1.3e-05,2e-06,1.9e-05,9e-06
-3e-06,-4e-06,0.003809,0.029824,0.01754,-0.024955,-0.093328,-0.038177,-0.037007,-0.090625,-0.089273,-0.113042,-0.092784,-0.044983,-0.017913,-0.010908,-0.002928,0.003222,0.00584,0.000374,-5.6e-05,0.000641,0.000882,0.00022,1.1e-05,5e-06,1.6e-05,9e-06
5e-06,7e-06,0.002726,0.022396,0.013847,-0.010604,-0.016376,0.093625,0.106124,0.004023,-0.026625,0.000717,0.014979,0.009569,0.005516,0.003999,0.002507,0.007174,0.007519,0.000286,7e-05,0.000168,0.000162,9.3e-05,1.9e-05,1.7e-05,1.6e-05,1.2e-05
1.2e-05,1.3e-05,-0.001632,-0.009591,-0.004281,0.032284,0.135619,0.111939,0.039893,0.080893,0.120427,0.122868,0.078582,0.032059,0.013687,0.009971,0.00238,0.003687,0.002319,4e-06,0.000146,-5.5e-05,-0.000509,-0.000174,3e-06,1e-06,-1.5e-05,-4e-06
7e-06,3e-06,-0.003441,-0.028137,-0.016426,-0.009365,-0.042755,-0.112722,-0.1182,-0.064562,-0.04559,-0.068545,-0.071884,-0.03791,-0.011842,-0.008415,-0.003933,-0.004178,-0.005622,-0.000459,-6.7e-05,-0.000578,-0.000501,-0.000116,-1.5e-05,-9e-06,-2.2e-05,-1.2e-05
-7e-06,-7e-06,-0.00139,-0.012017,-0.0079,-0.026925,-0.094308,-0.087147,-0.017748,-0.037316,-0.078499,-0.059043,-0.019799,-0.001911,-0.001909,-0.00399,-0.000813,-0.005243,-0.006234,-0.000458,-0.000152,-0.000416,-0.000134,3e-06,-1.2e-05,-2e-06,1.3e-05,4e-06
9e-06,7e-06,0.001464,0.012574,0.006824,0.019313,0.073173,0.051409,0.043204,0.077551,0.082731,0.092788,0.079879,0.038636,0.010356,0.007625,0.002308,0.000208,0.001033,1e-06,1.1e-05,0.000193,0.000273,0.000111,1.5e-05,7e-06,2e-05,1.3e-05
0,-2e-06,0.003113,0.021446,0.011715,0.004219,-0.005628,-0.006937,-0.009982,-0.004481,0.001206,-0.031838,-0.043696,-0.025264,-0.008077,-0.004139,-0.001685,0.003233,0.005047,0.000184,8.8e-05,0.00046,0.000413,0.000113,8e-06,4e-06,-4e-06,0
-9e-06,-1e-05,0.001395,0.008534,0.00449,-0.02719,-0.089548,0.004292,0.042659,-0.038257,-0.075606,-0.072213,-0.044979,-0.014115,-0.002437,-0.00294,-0.000512,0.001493,0.00193,2.4e-05,4.8e-05,-7e-06,-0.000214,-0.000101,-1e-05,0,-1.2e-05,-6e-06
3e-06,2e-06,-0.002236,-0.013749,-0.006493,0.011296,0.07127,0.065651,0.016919,0.040383,0.0651,0.086108,0.068345,0.03109,0.009338,0.00707,0.002214,-0.000572,-0.001642,-9.6e-05,3.5e-05,-0.00044,-0.000579,-0.00018,-3e-06,0,-1.2e-05,-9e-06
-1e-06,-2e-06,-0.002801,-0.019856,-0.010075,0.017645,0.06023,-0.033618,-0.067344,-0.005346,0.038627,0.020233,-0.013155,-0.017154,-0.005723,-0.001657,-0.000243,-0.001475,-0.003038,-0.000292,-2.8e-05,1.6e-05,9.8e-05,-3.8e-05,-9e-06,-4e-06,-7e-06,-9e-06
