-3.3e-05,-0.000587,-0.004437,-0.008935,-0.037145,-0.127294,-0.158108,-0.199575,-0.201549,-0.189596,-0.158387,-0.078889,-0.032774,-0.017344,-0.004079,-0.000785,-0.00116,-0.017632,-0.028867,-0.003034,-0.001456,-0.000512,-0.000315,-2e-05,-2.1e-05,-0.000277,-0.000288,-1.5e-05
3.1e-05,0.000228,-0.002557,-0.005453,-0.014292,0.020095,0.108094,-0.012452,0.014023,0.010334,0.055274,0.036933,0.024593,0.017247,0.003203,0.000694,0.000729,-0.003298,-0.006812,-0.001174,-0.000384,0.00069,0.000967,0.000108,7e-05,-0.000254,-0.00035,1.1e-05
-9e-06,-3e-05,0.001549,0.003303,0.016182,0.03454,0.002185,-0.026814,-0.031623,-0.061303,-0.032861,-0.019336,-0.00632,-0.001846,-0.000292,-7e-05,0.000118,0.00802,0.014045,0.000729,6.4e-05,-0.000366,-0.000568,-2e-06,2.9e-05,-0.00013,-0.000183,4e-06
-1.8e-05,-5.9e-05,0.002768,0.005583,0.017534,-0.016347,-0.099625,0.017253,-0.0278,-0.059787,-0.085958,-0.040768,-0.026986,-0.019002,-0.003751,-0.000572,-0.000721,0.004504,0.009307,0.000523,0.000307,6.2e-05,-0.000104,-1.2e-05,-1.8e-05,-7e-05,-7.7e-05,-5e-06
3.1e-05,0.000371,0.001289,0.004339,-0.000628,0.023705,0.117065,0.194992,0.193778,0.208557,0.162558,0.082385,0.033197,0.017125,0.004213,0.000929,0.000691,0.000344,0.001148,0.000147,7.8e-05,0.000582,0.000747,9.1e-05,5.7e-05,-2.8e-05,-0.000106,1.6e-05
-1.2e-05,-0.000303,-0.002931,-0.006559,-0.025936,-0.04626,0.022882,-0.020941,0.022931,0.085668,0.079617,0.026254,0.013837,0.008771,0.00207,0.000177,0.00017,-0.007559,-0.012186,-0.00183,-0.001676,-0.000588,-0.000476,-1e-06,3.8e-05,-0.00026,-0.000407,-1.1e-05
-2.6e-05,-0.000404,-0.002862,-0.006554,-0.011382,-0.068791,-0.14406,-0.223494,-0.212557,-0.175715,-0.163763,-0.073844,-0.032041,-0.020166,-0.004993,-0.000893,-0.000982,-0.008433,-0.014026,-0.001891,-0.000977,-0.000212,-0.000149,-3.1e-05,-3.9e-05,-0.00035,-0.000418,-3.4e-05
3.5e-05,0.00045,0.001137,0.002648,0.022818,0.068143,0.043537,-0.014106,-0.01749,-0.049363,-0.028438,-0.003102,0.00613,0.006214,0.00079,0.00036,0.000319,0.006655,0.010344,0.001472,0.001043,0.000588,0.000614,6.7e-05,2.5e-05,6.5e-05,0.000143,2.7e-05
1.6e-05,0.000234,0.003143,0.006122,0.016898,0.063078,0.072915,0.089088,0.09418,0.037478,0.064471,0.016021,0.011404,0.012098,0.003201,0.000396,0.000776,0.010363,0.017123,0.002229,6e-04,-0.000206,-0.000367,5e-06,4.8e-05,0.000412,0.000565,5.3e-05
-2.1e-05,-0.000252,0.001381,0.00222,-0.013049,-0.059069,-0.072657,0.036464,0.009498,-0.01557,-0.045442,-0.016031,-0.017336,-0.015944,-0.002818,-0.000434,-0.000332,-0.004237,-0.005903,-0.00038,-0.000492,-0.000146,-0.000113,-2.5e-05,-6e-06,0.000337,0.000477,3.6e-05
1.3e-05,3.7e-05,-0.002278,-0.003854,-0.019658,-0.047046,0.004882,0.042596,0.038438,0.071792,0.031192,0.027614,0.007747,0.000192,4.2e-05,0.000177,-0.000346,-0.007481,-0.011815,-0.000989,-9.9e-05,0.000296,0.000464,3.7e-05,1.3e-05,9.9e-05,0.000165,2e-05
8e-06,-8.2e-05,-0.002574,-0.004723,-0.00168,0.023771,0.040502,-0.077875,-0.011568,0.060803,0.087678,0.026456,0.015635,0.015028,0.003134,0.000285,0.000375,0.003005,0.003561,-5.3e-05,6.9e-05,-0.000212,-0.000363,-6e-06,2.4e-05,-6.4e-05,-7.1e-05,6e-06
-7e-06,-5.8e-05,0.000545,-9.3e-05,0.015942,0.035894,-0.05709,-0.148153,-0.130616,-0.098548,-0.075191,-0.030566,-0.015168,-0.010447,-0.002727,-0.000402,-4.8e-05,0.002819,0.003459,-0.000389,-0.00042,-1.6e-05,-5.4e-05,-2.3e-05,-1.4e-05,-5.2e-05,-7.8e-05,-3e-06
1.7e-05,0.000316,0.002936,0.005798,0.009255,0.016251,-0.00209,0.032021,-0.020168,-0.071708,-0.080047,-0.023994,-0.005624,-0.00611,-0.001979,-4.4e-05,-0.000241,-0.00213,-0.00287,-0.000186,1.9e-05,0.00021,0.00033,1.8e-05,-6e-06,7.7e-05,5.9e-05,0
-6e-06,-0.000102,0.000373,0.001355,-0.009054,-0.016468,0.05577,0.136099,0.124625,0.05228,0.068898,0.014364,0.01349,0.014361,0.003672,0.000305,0.000266,0.00176,0.004172,0.000544,-0.000122,-0.000194,-0.000248,-1e-05,1.2e-05,3.7e-05,3e-06,-6e-06
-1.6e-05,-0.000272,-0.001548,-0.002216,-0.006927,-0.017949,-0.013648,0.035513,0.047827,0.045479,0.029215,0.008239,-0.005833,-0.004423,-3e-05,-8.4e-05,0.00016,0.001491,0.002454,0.000189,-2e-04,-3.5e-05,-9.9e-05,-2.7e-05,-2.3e-05,-0.000215,-0.000292,-2e-05
1.3e-05,0.00017,-0.001421,-0.003276,0.003866,0.018851,-0.010421,-0.034532,-0.036228,0.010303,-0.043229,0.000392,-0.004072,-0.009769,-0.002402,-9.4e-05,-0.000365,-0.003977,-0.007519,-0.001,3.8e-05,0.000138,0.000228,1e-06,-3.3e-05,-0.000302,-0.000378,-2.6e-05
2e-06,5.9e-05,0.000405,-0.000135,0.00439,0.016482,0.019543,-0.051476,-0.027088,0.001056,0.027469,0.008652,0.010372,0.010317,0.001752,-2e-06,-4e-05,-0.001046,-0.002749,-0.000135,0.000195,-0.00015,-0.000186,-1.3e-05,-7e-06,-9.7e-05,-9.7e-05,-8e-06
-1e-05,-7e-05,0.001342,0.002167,0.000713,-0.01446,-0.030511,-0.043775,-0.037172,-0.043424,0.013397,-0.001755,-0.006444,0.000527,7.6e-05,-0.000108,0.000279,0.003352,0.00532,0.00084,-2.4e-05,-0.000109,-0.000117,-2.9e-05,-2e-05,0.000111,0.000177,8e-06
