0.005798,0.006383,0.009928,0.028694,0.138524,0.382696,0.78778,1.09613,1.046246,0.886113,0.880562,1.060987,1.088217,0.920777,0.842984,0.738423,0.478667,0.26761,0.25829,0.262608,0.192607,0.220575,0.401111,0.371714,0.207059,0.132329,0.051126,0.021215
0.00712,0.007758,0.012338,0.037129,0.174802,0.468662,0.908447,1.217552,1.158972,0.997363,0.997446,1.199879,1.240305,1.091375,1.018449,0.866565,0.555159,0.316746,0.301193,0.301385,0.223587,0.259575,0.468676,0.433128,0.236781,0.148395,0.058909,0.025733
0.009276,0.009853,0.016145,0.05238,0.241157,0.620049,1.091763,1.380067,1.319451,1.16559,1.179113,1.415919,1.482278,1.377389,1.304145,1.054392,0.660012,0.3866,0.354247,0.346642,0.265382,0.31205,0.556473,0.511938,0.268091,0.16125,0.067939,0.033196
0.010641,0.010835,0.018127,0.064908,0.311747,0.783328,1.226653,1.460747,1.465965,1.354397,1.364254,1.614182,1.712878,1.624781,1.505754,1.160921,0.703061,0.414159,0.358208,0.342303,0.275532,0.32676,0.566917,0.510633,0.245585,0.138536,0.065502,0.038416
0.010865,0.010792,0.018006,0.071243,0.378052,0.961352,1.429771,1.657214,1.733827,1.672623,1.63812,1.845897,1.959179,1.805643,1.610875,1.237287,0.724089,0.403634,0.329297,0.308551,0.262199,0.309124,0.497366,0.424431,0.178615,0.092784,0.055081,0.04086
0.010484,0.01081,0.019109,0.080396,0.426712,1.094075,1.74754,2.11922,2.169769,2.099277,2.032274,2.142274,2.197559,1.934786,1.665026,1.304242,0.74943,0.382406,0.29785,0.282694,0.253817,0.298179,0.430508,0.335177,0.11753,0.055305,0.044362,0.040316
0.011002,0.012013,0.023778,0.100591,0.441923,1.074951,2.013126,2.750198,2.87271,2.846387,2.708213,2.582013,2.517288,2.255255,1.989074,1.594098,0.927396,0.44052,0.323794,0.345685,0.33014,0.369039,0.50369,0.37754,0.112432,0.041531,0.036047,0.037329
0.013058,0.014559,0.032675,0.137915,0.456295,0.993243,2.303763,3.687111,4.207575,4.389533,4.208437,3.806307,3.55978,3.350955,3.19895,2.663807,1.547961,0.704822,0.50771,0.569213,0.518869,0.536835,0.729569,0.55665,0.158409,0.044172,0.033802,0.039558
0.016595,0.01757,0.04345,0.183698,0.507753,1.047078,2.944791,5.298478,6.466969,6.988911,6.852964,6.169127,5.739223,5.489294,5.328998,4.47367,2.573549,1.162263,0.861914,0.951905,0.790194,0.771057,1.060059,0.818254,0.232389,0.060017,0.042427,0.052366
0.020406,0.020916,0.053429,0.221833,0.564244,1.233889,4.087933,7.828532,9.629268,10.347392,10.369592,9.481427,8.807439,8.347527,8.019764,6.697828,3.822056,1.724894,1.33635,1.445762,1.090043,0.997085,1.366523,1.062703,0.308535,0.082085,0.056465,0.071498
0.023178,0.024394,0.059482,0.238282,0.577798,1.407836,5.525406,10.912529,13.055804,13.652649,13.914467,13.079262,12.168003,11.1606,10.369838,8.629979,4.958497,2.239956,1.81662,1.935225,1.345854,1.15923,1.549181,1.191913,0.348536,0.100775,0.069601,0.091187
0.025462,0.028299,0.062146,0.230883,0.536614,1.470312,6.683793,13.387062,15.370279,15.47772,15.859537,15.404586,14.510772,12.732926,11.2445,9.321071,5.480108,2.491826,2.095632,2.213932,1.437999,1.1827,1.586052,1.203322,0.336734,0.107319,0.077797,0.10724
0.028224,0.032352,0.062537,0.207935,0.479324,1.400951,6.802207,13.701386,15.129795,14.659056,14.850304,14.625594,14.023705,12.098471,10.218759,8.24554,4.941337,2.2789,1.989943,2.082957,1.28646,1.066217,1.498458,1.133672,0.295629,0.096309,0.076084,0.114652
0.028856,0.032725,0.057542,0.183841,0.446709,1.282268,5.668434,11.047867,11.781643,11.058228,10.832528,10.581779,10.381798,9.156551,7.550546,5.681854,3.355585,1.606715,1.493505,1.556938,0.974276,0.915682,1.390364,1.073361,0.272625,0.075206,0.064407,0.107214
0.026267,0.028159,0.04857,0.153329,0.403221,1.123854,3.978009,7.061079,7.323684,6.721654,6.18895,5.965896,6.026923,5.601338,4.670647,3.149002,1.687994,0.873993,0.883006,0.932072,0.693032,0.861138,1.425277,1.113183,0.27414,0.054807,0.049591,0.094499
0.023219,0.02308,0.040476,0.125301,0.397934,1.039392,2.845673,4.228007,4.121005,3.768091,3.4879,3.635114,3.764061,3.540946,2.80531,1.638422,0.744646,0.391308,0.41153,0.488105,0.550603,0.893526,1.518292,1.175876,0.279284,0.04353,0.041882,0.085681
0.02349,0.022815,0.041081,0.132196,0.467519,1.056812,2.441864,3.446765,3.144708,2.644812,2.523149,2.84713,3.117383,3.164457,2.351595,1.137117,0.467991,0.211348,0.209858,0.324825,0.545283,0.979251,1.593111,1.194406,0.274392,0.039474,0.043785,0.096715
0.030964,0.029071,0.045106,0.148829,0.541922,1.183509,2.746105,4.00786,3.439335,2.56236,2.476921,2.915498,3.470327,3.923606,2.840625,1.253306,0.601766,0.258727,0.21353,0.33601,0.607918,1.066761,1.580544,1.110523,0.246921,0.04213,0.049396,0.12698
0.043333,0.0405,0.056863,0.172009,0.568941,1.330137,3.711593,5.614695,4.556042,3.287073,3.27995,3.924131,4.798688,5.468215,3.984736,1.842345,0.939409,0.39172,0.286311,0.377949,0.666855,1.14312,1.570576,1.053202,0.239009,0.053309,0.057102,0.158331
0.057426,0.054706,0.074731,0.20574,0.572622,1.414107,4.748221,7.584472,6.177347,4.575974,4.570986,5.325489,6.3895,7.222451,5.521302,2.75081,1.384546,0.545325,0.367397,0.416376,0.702049,1.214756,1.720257,1.194332,0.284001,0.069313,0.063158,0.173011
0.067778,0.064673,0.089344,0.238864,0.571049,1.46982,5.614295,9.408305,7.957853,6.059213,5.716436,6.386729,7.72026,9.008785,7.255679,3.733477,1.831799,0.666923,0.426469,0.463693,0.726761,1.239579,1.845076,1.336413,0.324434,0.081619,0.066659,0.168466
0.068354,0.062995,0.093401,0.251968,0.544881,1.576935,6.034406,10.01848,9.018155,7.284161,6.171973,6.408257,8.14058,10.044386,8.282619,4.263278,2.06473,0.721442,0.459451,0.52564,0.754666,1.225335,1.85497,1.353896,0.325865,0.087386,0.067293,0.14892
0.057624,0.050062,0.08893,0.262145,0.565774,1.736807,5.682817,8.767707,8.699696,7.735691,5.860805,5.544484,7.425251,9.451701,7.685336,3.898555,1.889298,0.685568,0.451574,0.558393,0.746817,1.125258,1.660751,1.201579,0.299753,0.093971,0.068078,0.129092
0.046569,0.039409,0.083601,0.274563,0.624556,1.859983,5.043985,6.955544,7.305195,6.920669,5.04748,4.355437,5.519142,6.968753,5.639865,2.905177,1.430211,0.57979,0.408143,0.550497,0.678767,0.95082,1.290482,0.895224,0.256003,0.104001,0.069949,0.106916
0.039764,0.03352,0.076438,0.255006,0.610279,1.822827,4.71446,6.195132,6.005647,5.342944,3.874905,3.290306,3.645706,4.069657,3.459116,2.112204,1.050678,0.434892,0.336563,0.489667,0.551497,0.730125,0.876905,0.566541,0.210412,0.105844,0.066775,0.085222
0.036178,0.031643,0.066885,0.207646,0.495592,1.493588,4.158613,5.572415,4.897905,4.132961,3.015048,2.568566,2.562633,2.315729,2.104256,1.651208,0.905051,0.355109,0.288826,0.392665,0.423518,0.610597,0.694319,0.401943,0.167429,0.093696,0.0598,0.064537
0.036725,0.035224,0.060022,0.168885,0.376218,1.120141,3.809865,5.609605,4.522734,3.500515,2.638456,2.131933,2.146558,2.043343,1.793901,1.361375,0.811992,0.33981,0.253129,0.333019,0.43466,0.725723,0.848844,0.453467,0.135635,0.069445,0.049962,0.04899
0.036296,0.037755,0.055697,0.140369,0.352773,1.221738,4.007155,5.653743,4.210918,3.110574,2.376549,1.68291,1.682751,1.968409,1.796741,1.207733,0.714009,0.329266,0.229243,0.312714,0.467276,0.835965,1.038693,0.557203,0.117016,0.048006,0.039383,0.040532
0.040042,0.039003,0.050424,0.117609,0.367918,1.404561,3.793865,4.738363,3.498876,2.762837,2.087223,1.361803,1.340749,1.704907,1.629806,1.053619,0.606482,0.315822,0.220765,0.297,0.447758,0.843205,1.1294,0.649107,0.127363,0.040224,0.03598,0.04283
0.050238,0.046501,0.054372,0.114001,0.385225,1.47812,3.198623,3.3644,2.653507,2.483466,1.923503,1.328324,1.305007,1.405838,1.24834,0.927079,0.625506,0.332045,0.20875,0.271949,0.390965,0.858829,1.20813,0.708731,0.152095,0.045739,0.042909,0.053932
0.060945,0.058874,0.066866,0.116447,0.379431,1.487834,2.893824,2.596781,1.940802,1.992716,1.605493,1.297616,1.388634,1.249092,0.91706,0.80632,0.708367,0.379867,0.216027,0.259629,0.333368,0.910139,1.365774,0.791854,0.164013,0.055018,0.05712,0.071796
0.068275,0.069854,0.078828,0.121092,0.395017,1.414538,2.672227,2.471327,1.873783,1.792586,1.431905,1.246099,1.357629,1.238215,0.813626,0.659922,0.707217,0.435023,0.241911,0.258793,0.302223,0.899226,1.391773,0.797532,0.154311,0.0624,0.069471,0.083154
0.063603,0.069386,0.077781,0.109343,0.36909,1.183891,2.159805,2.249094,2.06186,1.811072,1.316148,1.101987,1.181998,1.24453,0.808123,0.524964,0.612372,0.435328,0.234232,0.248052,0.292816,0.778959,1.161719,0.670578,0.132404,0.060218,0.068999,0.076677
0.049222,0.060487,0.064958,0.097901,0.309802,0.995632,1.659471,1.814287,1.970411,1.65156,1.137972,0.940419,1.006714,1.167976,0.881022,0.59409,0.580968,0.397688,0.204695,0.226142,0.277638,0.59696,0.794714,0.451657,0.099799,0.051845,0.054205,0.055046
0.034878,0.04715,0.055899,0.112561,0.282023,0.85102,1.456909,1.606824,1.584187,1.325317,1.059516,0.895331,0.92252,1.036679,0.950646,0.747454,0.569377,0.341601,0.196394,0.20129,0.251077,0.516044,0.621686,0.300233,0.067484,0.042866,0.037441,0.040441
0.026542,0.033256,0.048269,0.136482,0.301987,0.754802,1.487621,1.542809,1.062363,0.991725,1.021696,0.862017,0.888457,0.940987,0.945318,0.809232,0.485178,0.264237,0.194004,0.185365,0.210595,0.492306,0.64577,0.308301,0.062981,0.037794,0.032712,0.040246
0.021236,0.023939,0.040714,0.146113,0.295223,0.758583,1.602605,1.394737,0.672728,0.902031,1.015731,0.832193,0.941952,1.021221,0.961216,0.722809,0.384601,0.235304,0.186623,0.17695,0.177018,0.460415,0.632558,0.325693,0.069143,0.03214,0.028904,0.037974
0.017604,0.022472,0.044249,0.139309,0.255136,0.763997,1.644575,1.200496,0.556096,1.039939,1.17353,0.943744,0.991267,1.037438,0.906198,0.551526,0.334668,0.242728,0.191126,0.163043,0.142019,0.394673,0.540295,0.299415,0.067168,0.026245,0.026534,0.032235
0.017726,0.026901,0.053392,0.119207,0.198548,0.788113,1.682707,1.136472,0.628159,1.300811,1.371328,0.974343,0.888588,0.88606,0.761898,0.381074,0.300364,0.243404,0.19375,0.159348,0.119273,0.318157,0.44358,0.267102,0.061912,0.021147,0.02558,0.030972
0.020753,0.031445,0.057456,0.091491,0.16682,0.772903,1.70884,1.251998,0.754284,1.471392,1.402342,0.813125,0.660504,0.706007,0.644063,0.297724,0.250245,0.210187,0.183248,0.164671,0.11643,0.303462,0.479706,0.314968,0.068117,0.021809,0.023258,0.032156
