-0.002955,-0.002159,-0.002821,-0.002223,-0.002686,-0.001772,-0.001751,-0.00283,-0.002012,-0.002259,-0.001497,-0.0015,-0.002189,-0.001462,-0.001323,-0.002735,-0.002711,-0.001819,-0.002287,-0.001891,-0.001916,-0.002029,-0.002297,-0.00231,-0.001581,-0.001809,-0.001819,-0.001472,-0.00283,-0.003559,-0.00223,-0.001637,-0.00183,-0.002418,-0.00241,-0.002798,-0.003058,-0.00264,-0.002885,-0.002131,-0.002091,-0.002052,-0.002097,-0.001601,-0.001693,-0.002144,-0.001835,-0.002262,-0.001911,-0.001636,-0.001013,-0.001597,-0.001922,-0.002026,-0.001918,-0.001688,-0.002792,-0.002595,-0.002232,-0.002316,-0.002161,-0.00228,-0.002074,-0.002018,-0.002406,-0.002396,-0.001353,-0.00319,-0.002127,-0.001232,-0.002081,-0.002092,-0.002019,-0.001992,-0.001648,-0.001572,-0.001892,-0.002437,-0.001951,-0.001294,-0.00196,-0.002584,-0.00239,-0.001456,-0.001866,-0.001384,-0.002849,-0.001818,-0.001571,-0.001932,-0.00122,-0.001496,-0.002172,-0.001941,-0.001685,-0.000989,-0.00153,-0.002501,-0.001459,-0.00106,-0.00241,-0.001453,-0.001823,-0.001772,-0.00254,-0.002495,-0.00181,-0.001097,-0.001515,-0.001493,-0.00159,-0.001025,-0.001389,-0.001725,-0.001818,-0.002735,-0.003622,-0.002248,-0.002055,-0.001728,-0.001507
0.001224,0.000616,0.001071,0.000703,0.001404,0.000767,0.000921,0.001106,0.000794,0.000728,0.000468,0.000378,0.000623,0.000514,0.000496,0.000679,0.001168,0.000594,0.000946,0.000542,0.000622,0.00041,0.00106,0.001156,0.000674,0.000602,0.00095,-4.8e-05,0.00229,0.002004,0.000961,0.000454,0.000791,0.000764,0.000799,0.001049,0.001573,0.000948,0.001068,0.000181,0.000721,0.000472,0.000529,0.000601,0.000391,0.000641,0.000507,0.000996,0.000823,0.000869,0.000381,0.000311,0.000669,0.00079,0.000658,0.000286,0.001021,0.001488,0.001074,0.001156,0.001039,0.001504,0.000608,0.000885,0.001329,0.000733,0.000256,0.001909,0.000955,0.000601,0.000922,0.001439,0.000619,0.000648,0.000494,0.00063,0.000596,0.000449,0.00043,0.000144,0.000236,0.000918,0.001423,0.00015,0.00093,0.000614,0.001667,0.000876,0.000559,0.000589,0.000477,0.000681,0.000943,0.000524,0.000799,-0.000379,0.00041,0.001013,0.000445,0.000257,0.00138,0.000229,0.000729,0.000664,0.00131,0.001176,0.000937,0.000595,0.000332,0.000516,0.000668,-6.4e-05,0.00021,0.000813,0.000542,0.000912,0.001752,0.000689,0.000749,0.000552,0.000523
0.000384,0.000714,-0.000197,0.000261,-0.000315,-0.000212,-0.000517,-0.000243,-0.000245,0.000112,1e-06,-0.000295,1.7e-05,-0.000102,-0.000289,0.000222,-0.000332,0.000162,-0.000394,-0.000366,0.000267,-0.000274,-0.000155,6e-05,-0.00048,-0.000262,-8.6e-05,0.000329,-0.000951,-0.001314,-0.000222,-0.000188,-0.000425,8.4e-05,1e-04,-0.000494,-0.000727,0.000211,-8.6e-05,-0.000106,-0.00019,0.000159,-0.000321,-0.00035,0.000138,-0.000558,-0.000109,-0.000121,-0.000185,9e-06,-0.000631,1.4e-05,0.000273,3.5e-05,2.3e-05,3.4e-05,0.00056,-0.000244,-0.000165,-0.000433,-0.000121,-0.001072,4.6e-05,-9.3e-05,-0.000619,0.00047,0.000528,-0.001105,-0.000233,-0.000284,-6.5e-05,-0.000743,-0.000568,-0.000239,0.000236,-0.000196,0.000407,-1.4e-05,0.000524,-9.5e-05,0.00064,0.000363,-0.000705,5e-05,-0.000659,-6.9e-05,-0.000436,-0.000238,-0.000117,-3e-05,-9.3e-05,-0.000314,3.4e-05,0.000225,-0.000248,1.6e-05,-0.000241,-0.00051,-0.000262,-0.000535,-2e-04,0.00093,-7.2e-05,-0.000315,-0.000167,-0.000185,-0.000179,-0.000305,0.000447,0.000419,-0.000327,5.1e-05,0.000154,0.000164,0.000594,0.000718,-0.000245,0.000122,-7.9e-05,0.000284,0.000256
-0.001018,-0.001472,-0.000563,-0.000917,3.5e-05,-2.2e-05,6e-06,-0.000501,-0.000471,-0.000306,-0.000327,-0.000189,-0.000413,-9.3e-05,-2.4e-05,-0.000827,-0.000198,-0.000291,0.000194,4.3e-05,-0.000498,-0.000483,-0.00052,-0.000548,0.000308,-0.000279,-0.000354,-0.000509,-3.4e-05,0.000589,-2.2e-05,0.000149,0.000462,-0.000561,-0.000204,7e-05,-0.000238,-0.000934,-0.0011,-0.000108,-9.4e-05,-0.000137,3e-04,1.8e-05,-0.00016,0.000161,-0.000284,-0.000424,-0.000153,-0.000279,9e-05,-0.000295,-0.000573,-0.000527,-0.000385,-0.00017,-0.000793,-0.000936,-0.000553,-0.000193,-0.000647,0.000464,-0.000164,-0.000607,0.000395,-0.000795,-0.000831,0.000467,-0.000194,-0.000128,0.000252,0,-1.7e-05,9.9e-05,-0.000334,2.9e-05,-0.000636,-0.000464,-0.000695,-0.000336,-0.000641,-0.000625,-0.000246,-0.00015,-2.1e-05,-0.000164,-4e-04,-0.000612,-0.000663,-0.000425,-0.000324,4.4e-05,-0.000452,3.8e-05,1e-06,2e-04,-0.000129,-0.000145,-6.4e-05,0.000346,-0.000211,-0.001225,-0.000589,-4e-06,-0.000792,-0.000566,-0.00038,-0.000193,-0.000424,-0.000872,-0.000135,-7.4e-05,-0.000294,-0.000718,-0.00083,-0.001083,-0.001081,-0.000773,-0.000424,-0.000889,-0.000553
0.000695,0.000959,0.000373,0.000634,-0.000459,-0.000267,-0.000203,0.000803,0.000795,-2.5e-05,0.000276,0.000485,5.3e-05,-7.7e-05,-7.3e-05,0.000565,0.000469,0.000196,3e-05,0.000113,0.000144,0.000635,0.000268,0.000572,-0.000119,0.000176,0.000215,0.000303,9.5e-05,-0.00017,-0.000133,-0.000154,-0.000246,0.000432,0.00015,0.000228,0.000661,0.000617,0.000887,8e-05,0.000114,-0.000278,-0.000447,-3.6e-05,0.00013,-1.2e-05,0.000404,0.000404,0.000263,0.000316,-7e-06,0.000484,0.000425,0.000512,0.000478,0.000627,0.000272,0.000919,0.001152,0.000344,0.000102,-0.000319,0.000121,0.00067,-3.2e-05,0.000579,0.000109,-0.000244,8e-06,-0.000179,-0.000291,0.00043,-8.7e-05,-0.000233,-0.000176,0.000372,0.000589,0.000164,0.000287,0.000371,0.00024,0.000117,0.000205,0.000149,0.000406,0.000335,0.000521,0.000993,0.000617,0.000369,0.000239,-5.3e-05,0.000347,-0.000113,0.000202,0.000167,0.000141,0.000487,0.000635,-0.000307,0.000277,0.000851,0.000277,0.000337,0.000671,0.000409,3.3e-05,2.7e-05,-0.000124,0.000702,0.000221,9e-05,0.000224,0.000836,0.000747,0.000797,0.000902,0.000675,0.000298,0.00081,0.000431
-0.000165,5e-06,0.000137,-0.000163,0.000366,0.000464,0.000323,-0.000509,-0.000525,0.00025,0.00015,-0.000335,8.6e-05,6.8e-05,2.2e-05,-0.00043,-0.000347,-0.000303,-1.2e-05,-9.8e-05,-0.000248,-0.000436,-0.000169,-0.000304,0.000389,9.3e-05,-0.000212,4e-06,0.000337,-0.000162,0.000216,0.00019,0.000174,0.000115,-7.8e-05,-0.000281,-0.000407,1e-05,-0.000245,0.000286,0.000385,0.000359,0.000538,4e-06,-0.000158,-0.000251,-0.000541,-9.1e-05,-0.000182,-0.000262,-0.000169,-0.000191,-0.000138,4.8e-05,-6.4e-05,-0.000413,0.000269,-0.000378,-0.001012,-0.000393,0.000175,0.000156,-0.000284,-0.00037,-0.000226,-0.000259,2.3e-05,-0.000112,0.000123,0.000277,0.00027,-0.000174,0.000129,0.00017,0.000552,-0.000325,-0.000468,0.000157,-6.6e-05,-9.6e-05,-1.7e-05,0.00014,8e-05,0.000101,-0.000259,-0.000342,-0.000346,-0.000375,-0.000455,-0.000121,-0.000143,-0.000129,-0.000317,-0.000346,-0.000296,-0.000267,-4.9e-05,-0.00028,-0.000496,0.000141,-1.3e-05,-5.7e-05,0.000175,-0.000373,-7.9e-05,7e-05,0.000152,-4e-05,7.3e-05,-0.000303,-9.2e-05,8.9e-05,6.6e-05,-0.000104,-0.000281,-4e-06,-0.000322,-0.00044,-0.000266,-0.000361,-0.000569
-4.6e-05,-0.000309,-0.000449,-0.00029,-0.000183,-0.000515,-0.000132,0.000165,0.000169,-4.5e-05,7.3e-05,0.000283,-6.5e-05,-0.000114,0.000117,0.000344,0.00027,0.000206,0.000107,0.00012,0.000162,8.7e-05,-7.7e-05,1.5e-05,-0.000326,-2.1e-05,3.1e-05,8.3e-05,-0.000594,6.9e-05,2.8e-05,6.3e-05,-2e-05,-0.000342,-0.000418,4.8e-05,2.1e-05,-0.00035,-5.9e-05,-0.000693,-0.000227,-0.000179,-0.000142,7.6e-05,3.1e-05,-5.6e-05,3e-04,-0.000212,-0.000143,-0.00016,5.4e-05,4.2e-05,-0.000146,-0.000286,-0.000225,6e-06,-6.4e-05,-0.000167,0.000361,0.000216,-0.000191,0.000131,0.000156,-0.00014,0.000183,-2.8e-05,6.8e-05,0.000179,-1.2e-05,-0.000149,-0.000203,-7.8e-05,-0.000229,-0.000323,-0.000269,3.5e-05,9.2e-05,0.000194,0.000277,-8.9e-05,-4.3e-05,-0.000193,-0.000314,-0.000277,-0.000112,0.000272,3.8e-05,0.000214,0.000455,0.000104,3.3e-05,-1.2e-05,0.000156,0.000548,0.000274,-2.8e-05,0.000162,0.000183,0.000303,6.2e-05,0.000141,-0.000265,-0.000447,0.00023,-4.1e-05,-0.000286,-0.000217,-0.000119,2.7e-05,-2.7e-05,5.3e-05,-5e-05,-0.000163,-0.00013,1.2e-05,-0.000311,-3e-06,0.000287,0.000286,0.000194,0.000617
3.1e-05,9.9e-05,0.000309,0.000535,-0.000219,0.000206,-5.3e-05,-0.000226,-0.00025,-0.000236,-0.000185,-0.000131,0.000168,1e-05,9.3e-05,-0.000282,-0.000155,-0.000116,-0.000157,-7.2e-05,7.5e-05,0.000105,8.4e-05,0.000271,-0.000145,-0.000143,0.000329,-0.000183,0.000188,8.7e-05,-0.000366,-0.000162,-1.1e-05,0.000138,0.000279,0.000167,5.9e-05,0.000452,0.000263,0.000585,2e-06,0.000251,2.5e-05,-4e-05,7.5e-05,0.000129,-0.000125,7.7e-05,5.1e-05,0.000156,6.8e-05,-0.000193,0.000223,0.000193,0.000129,0.00012,8.6e-05,0.000453,0.000254,0.000136,0.000305,-0.000142,-0.000156,0.000134,-4.4e-05,-2.1e-05,-0.000216,-0.000185,5.2e-05,0.000186,0.000115,-0.000194,0.000377,1.4e-05,4e-06,0.000107,8.9e-05,-0.00037,-0.000116,8.5e-05,0.000227,-7.9e-05,7.3e-05,-0.000102,0.00011,-0.000128,-0.000164,-0.000159,-0.000233,-0.000163,6e-06,0.000238,-9.1e-05,-0.000349,-0.000153,5.4e-05,5.4e-05,-0.000172,-0.000112,-0.000131,-0.000122,-9.6e-05,0.00031,-1.1e-05,0.000144,0.000305,0.000269,-3e-06,2e-05,4.9e-05,-6.6e-05,-1.6e-05,0.000249,9.1e-05,-4.9e-05,0.000109,0.000218,-2.7e-05,-0.000129,-0.000148,-0.000258
3.7e-05,0.000159,-0.000109,-8.3e-05,0.00022,-0.000113,-6e-06,0.000189,0.000122,0.00016,5e-06,9e-05,-0.000102,-5.2e-05,-6e-05,0.000223,0.000149,0.000229,0.000124,-4.1e-05,-6.4e-05,-0.000143,0.000204,-0.000309,0.000266,0.000191,-0.000392,1.9e-05,0.000105,-0.000169,0.000234,5e-05,-1.4e-05,-0.000197,3.8e-05,7e-05,-2.9e-05,-0.000366,-2.2e-05,-0.000332,-0.00017,-0.000483,2e-06,0.00012,-0.00024,4.4e-05,0.000113,0.000142,2e-05,0.000144,6.7e-05,0.000238,-0.00013,-0.000184,-7.8e-05,-0.000206,-0.000282,-0.000234,-0.000396,-0.000178,-0.000366,-0.000162,-5.6e-05,-9.4e-05,-0.00024,-0.000201,8.4e-05,0,-6.8e-05,-0.000274,-0.000215,0.000162,-0.000306,-1.8e-05,5.3e-05,-8.1e-05,-0.00015,0.000294,5e-05,0.000238,-7.2e-05,0.000203,3e-05,0.000389,6.4e-05,5.3e-05,-7.7e-05,6.2e-05,-7.3e-05,0.00013,0,-0.000199,-7e-06,-5.6e-05,-7.7e-05,-0.000191,-3.7e-05,0.000172,-2.6e-05,6.7e-05,6.4e-05,5.5e-05,-0.000157,-1.4e-05,-0.000256,4.3e-05,-0.000194,0.000105,0.000194,-0.000194,8.5e-05,-2.2e-05,-1.8e-05,-0.000243,7e-06,4e-05,-8.5e-05,4.4e-05,-1.8e-05,9.3e-05,-0.000172
0.000162,-0.000137,1.3e-05,-7e-06,-0.000171,0.000215,0.000105,-0.000218,3e-06,0.000139,0.00011,-0.000143,0,3.5e-05,9.1e-05,-6.8e-05,-5.7e-05,-0.000376,-0.000142,1.9e-05,0.000117,3.9e-05,-1e-05,0.00026,-0.000261,-5.2e-05,0.000141,-4.6e-05,-0.00018,0.000191,-0.000251,0,-0.000104,0.000334,-2.8e-05,-0.000365,-3e-06,0.000314,-0.000213,-7e-05,0.000113,0.000333,3.1e-05,-0.000114,0.000196,-6.7e-05,-3.1e-05,-0.000136,4.8e-05,-0.000193,9.8e-05,-5e-05,6.2e-05,-6e-06,4e-05,0.000113,0.000245,-2.6e-05,0.000351,0.000305,0.00033,6.4e-05,0.000162,8.9e-05,0.00019,0.00026,-7.6e-05,0.000231,0.000109,0.000336,8.6e-05,-9e-05,2.4e-05,0.000185,-1.4e-05,-5.3e-05,4.4e-05,-0.000134,1.2e-05,-0.000349,-6.8e-05,-0.000124,7e-06,-0.000274,-0.000114,2.5e-05,0.000133,-4.2e-05,-5.2e-05,-7.7e-05,0.000119,8.3e-05,-6.6e-05,0.00012,1.5e-05,7.8e-05,-3.6e-05,-6e-06,0.000109,-8.1e-05,-0.000152,-2.4e-05,-8e-05,0.000136,0.000222,-6.4e-05,0.000124,-6.2e-05,-0.000169,0.000149,-6.3e-05,-0.000129,2e-05,0.000116,-2.2e-05,-0.000173,-3.8e-05,-5.4e-05,0.000332,-0.000144,5.4e-05
-6.3e-05,4.8e-05,3.9e-05,-8e-05,0.000188,-0.000202,-0.000255,0.000141,-5.5e-05,-0.000165,-0.000148,4.2e-05,2e-06,1.1e-05,-2.2e-05,5.6e-05,-4.6e-05,0.000273,4.2e-05,5.1e-05,-9.6e-05,0.000153,-7.3e-05,-0.00013,2.4e-05,0.000115,-2.9e-05,1.1e-05,0.000169,-6.7e-05,0.000222,0.000109,0.000108,-0.000223,-0.000125,0.000315,-2.2e-05,-0.000102,0.000226,0.000293,-0.000103,-0.000321,-0.000102,7e-05,-5.5e-05,0.000135,0.000116,0.000158,-8e-06,0.000193,-0.000111,-0.000103,-0.000164,3.1e-05,6.1e-05,9e-05,9.3e-05,0.000118,-0.000134,-0.000238,-0.000185,-5.5e-05,-0.000297,-0.000157,5.1e-05,-7.9e-05,-6.9e-05,4e-06,-4.2e-05,-0.000312,1.6e-05,5e-05,0.000175,-0.00014,7.5e-05,0.000106,5e-06,-1.2e-05,-0.000133,9e-05,-1.6e-05,3.1e-05,-3.8e-05,0.000294,8.9e-05,-0.000146,-1.7e-05,-4e-05,0.000215,0.00015,-6.6e-05,4e-05,0.000196,-7.9e-05,-8.1e-05,-1.9e-05,7.6e-05,-7e-06,-7e-05,0.000244,8.9e-05,-4e-06,0.000158,8e-06,-0.00013,-1.2e-05,-0.000127,5.7e-05,0.000124,0.00017,4.3e-05,0.000125,-7.8e-05,-8.2e-05,-6.9e-05,0.000106,3.4e-05,-0.000122,-0.000382,5.5e-05,4.5e-05
5.2e-05,1.6e-05,-4.9e-05,9.4e-05,5e-06,1e-04,0.000244,-3.9e-05,3.2e-05,1e-04,8.8e-05,-0.000196,-7.8e-05,1.2e-05,-1.2e-05,-6e-06,-3.8e-05,-0.000171,-8.7e-05,2.3e-05,8e-05,-3.7e-05,-3.5e-05,0.000122,0.000101,-3.5e-05,-4.2e-05,9.9e-05,-6.5e-05,8e-06,-8.2e-05,-0.000222,-1e-05,8.4e-05,1.7e-05,-2.3e-05,-1.6e-05,1.8e-05,-0.00019,-0.000207,3.1e-05,2.7e-05,-1.2e-05,-5e-06,0.000105,-1.8e-05,-0.000156,-0.00015,6.4e-05,-0.00012,0.000126,0.000132,0.000119,-2.6e-05,-9e-05,-0.000152,-9.7e-05,5.7e-05,1.5e-05,8.4e-05,-2.3e-05,7e-06,0.00015,0.000166,-9.7e-05,5e-06,0.000212,-0.000124,3e-06,0.000192,-6.2e-05,-7.8e-05,-7.2e-05,0.000184,-0.000116,-0.000155,-3.2e-05,0.000124,9.1e-05,2.2e-05,2.6e-05,-5.3e-05,2.7e-05,-6.8e-05,2.9e-05,-1.9e-05,-7.9e-05,-1.7e-05,-0.000141,-0.000104,1.9e-05,-0.000151,-0.000149,1.6e-05,1.4e-05,1.9e-05,6.6e-05,4.6e-05,4e-05,-0.000104,1.7e-05,-4.9e-05,-0.000125,-0.000267,0.000116,-4.7e-05,9.9e-05,9.1e-05,-4.3e-05,-0.000108,1e-06,1e-06,5.9e-05,0.000114,3e-05,-8.9e-05,1.4e-05,4.1e-05,0.000175,2.3e-05,-6e-05
-4.9e-05,-1.6e-05,-1.6e-05,-0.000148,-9.8e-05,3.7e-05,-0.000109,5.8e-05,-9.5e-05,-5.8e-05,2.6e-05,0.000171,9.1e-05,1e-05,1e-05,4e-05,2.8e-05,2.8e-05,9.2e-05,1e-06,-6.4e-05,-0.000116,8.1e-05,-0.000171,-0.000167,-6.5e-05,8.1e-05,-0.000142,4.3e-05,-4.9e-05,9.2e-05,0.000221,-3.5e-05,-8.3e-05,5.7e-05,-1.5e-05,2.8e-05,9.4e-05,5e-05,8e-05,-6.2e-05,0.000216,-4.5e-05,-3.5e-05,-0.000125,-4.3e-05,0.000103,9.3e-05,-7.8e-05,7.9e-05,-9.1e-05,-5e-06,-5e-06,2.5e-05,-2e-06,6.8e-05,-5.9e-05,-4.6e-05,-7.4e-05,4.1e-05,1.7e-05,0.000109,-6.7e-05,-9.2e-05,0.000174,-6e-05,-0.000156,0.000146,-1.5e-05,-6.2e-05,9.3e-05,7e-05,1.7e-05,-1e-06,5.8e-05,3.9e-05,-1.7e-05,-0.000201,4e-06,1.9e-05,-1.6e-05,-5.1e-05,-9e-06,4.4e-05,-5.2e-05,0.00013,0.000115,-3e-05,0.000116,2.3e-05,-4.1e-05,3.7e-05,8.4e-05,1.5e-05,7.2e-05,-9e-06,-5.5e-05,-9e-05,-1e-05,-1.8e-05,-8.4e-05,3.6e-05,4.9e-05,0.000216,-2.7e-05,3.9e-05,-2.9e-05,-0.000178,1.8e-05,5.9e-05,9e-06,-6.5e-05,-4.4e-05,-2e-05,-3.5e-05,7.3e-05,-6.3e-05,3.4e-05,-2.2e-05,-4e-06,8.8e-05
8.4e-05,-4.2e-05,1.4e-05,9.3e-05,0.000173,3.4e-05,-2.8e-05,-8.3e-05,6.9e-05,2.2e-05,-7.5e-05,-3.3e-05,-6.2e-05,-1.7e-05,-3e-05,-3.3e-05,-2e-05,5.6e-05,-7.1e-05,3.6e-05,-5e-06,6e-05,1.8e-05,0.00011,0.000158,8.4e-05,-3.3e-05,0.000137,-0.000141,6e-05,-5e-06,-0.000207,7.7e-05,-4.1e-05,2.2e-05,4.4e-05,2.1e-05,-0.000114,-3.2e-05,-5.1e-05,4e-05,-0.000115,0.000124,3.3e-05,0.000131,4.7e-05,1.9e-05,-6.3e-05,2.6e-05,-3.7e-05,4.8e-05,-3e-05,-5.4e-05,-5e-06,-4.1e-05,-7e-06,1.2e-05,-3e-05,2e-05,-4.7e-05,-1.7e-05,-8.1e-05,3e-06,8e-06,-4.7e-05,0.000101,0.00013,-3e-05,-2.5e-05,6e-06,-9e-06,-2e-05,-9.1e-05,-0.000104,-9.8e-05,-3.4e-05,3.7e-05,0.000124,-7e-06,-6e-06,-4.8e-05,2.3e-05,1.8e-05,-9.7e-05,4.6e-05,-1.2e-05,-0.000156,8e-06,-5.2e-05,4.5e-05,5e-06,1.5e-05,-5.2e-05,3.6e-05,-6.4e-05,-3.1e-05,2.4e-05,-4.3e-05,4.2e-05,6.4e-05,2.8e-05,-1.2e-05,-1.7e-05,-0.000176,-0.000163,-2.6e-05,-8.2e-05,8.6e-05,1.8e-05,-8.8e-05,-2.6e-05,6.4e-05,1.4e-05,2.4e-05,-4e-06,6.3e-05,5.3e-05,-4e-05,-7.8e-05,1.6e-05,-2e-05
-0.000137,-3.3e-05,-5.6e-05,-1.8e-05,-6.5e-05,-4.5e-05,4.8e-05,7.9e-05,-4.6e-05,5e-05,5.9e-05,-3.3e-05,2.9e-05,-1.4e-05,-3.8e-05,-2.7e-05,1.4e-05,-0.000133,3.1e-05,-3.5e-05,3.6e-05,-9e-06,-4.3e-05,-0.000113,-0.000131,-5e-05,2.1e-05,-7.9e-05,0.000111,-2.2e-05,-5.9e-05,6.7e-05,-2.9e-05,0.000118,-4.4e-05,-6.2e-05,-4.3e-05,5.7e-05,3.8e-05,-1e-06,-4e-05,4.3e-05,-0.000111,-4e-06,-9.3e-05,-2e-05,-2.5e-05,1.8e-05,-3.4e-05,8e-06,-9.8e-05,-2e-06,3.3e-05,4.2e-05,-1.1e-05,9e-06,4e-05,5.3e-05,5.6e-05,-3e-06,-2.4e-05,6.2e-05,2.4e-05,1.5e-05,-4.8e-05,-3.3e-05,-9.9e-05,-1.7e-05,1.3e-05,3.6e-05,-9.1e-05,1.7e-05,0.000115,2.4e-05,-1.5e-05,2.8e-05,-2e-06,-1.7e-05,2e-05,2.7e-05,3.4e-05,1.9e-05,-1.4e-05,8.2e-05,-4.6e-05,-9e-05,7.2e-05,-1.9e-05,6.5e-05,-6.3e-05,-1.5e-05,-1e-05,6e-06,-1e-04,-1.8e-05,4.3e-05,-3e-05,2.3e-05,-3.5e-05,-1e-05,1.5e-05,6e-06,1e-05,4.3e-05,0.000144,2e-06,3.8e-05,-2e-05,-6.1e-05,-1.6e-05,6e-06,-2.2e-05,4.8e-05,-6.6e-05,4.4e-05,-9.5e-05,-3.1e-05,3e-05,0.00012,-1.7e-05,-2.2e-05
6.1e-05,2.2e-05,9.4e-05,-2.5e-05,-5.6e-05,1.2e-05,-5e-05,-6.4e-05,7.6e-05,-4.4e-05,-5.8e-05,-4e-06,-1.6e-05,-4e-06,3.1e-05,1.5e-05,-2.8e-05,0.000128,3.3e-05,4.4e-05,-2.2e-05,-2.8e-05,1e-06,3.9e-05,6e-05,1.5e-05,-5.1e-05,4e-06,-1e-05,-1e-06,1.8e-05,1.9e-05,-3.2e-05,-9.3e-05,3.5e-05,3e-06,5.3e-05,-1.6e-05,3e-06,-2.5e-05,2.2e-05,-3.3e-05,2.8e-05,-1.6e-05,1.3e-05,1.9e-05,5e-06,1.4e-05,1.1e-05,4e-06,8.5e-05,-1e-05,-3.9e-05,-2.1e-05,-1.6e-05,-3.3e-05,-1.2e-05,1e-05,-5.4e-05,-1e-05,5.3e-05,-2.1e-05,3.1e-05,4e-06,6.6e-05,1e-06,5.2e-05,7.4e-05,1e-06,-3.6e-05,8.9e-05,1e-06,-5.9e-05,3.8e-05,7.7e-05,2.3e-05,-3.5e-05,-6.5e-05,-4.9e-05,1.9e-05,-2.4e-05,0,8e-06,-8.1e-05,5e-06,6.4e-05,-7e-06,2.3e-05,-5.3e-05,1.9e-05,1e-05,0,-1.3e-05,8.7e-05,5.1e-05,-1e-06,3.4e-05,2.3e-05,3e-05,2.1e-05,-5e-06,-2.5e-05,-6e-06,-1e-05,-7.5e-05,1.4e-05,-2e-05,-8e-06,5e-06,-8e-06,-1.1e-05,2.7e-05,-3.8e-05,3.8e-05,-4.1e-05,8.3e-05,3.9e-05,-2.5e-05,-5.3e-05,4e-06,1.6e-05
-2.7e-05,-1.7e-05,-5.9e-05,-5e-05,9e-06,-2.3e-05,4.1e-05,3.7e-05,-6.1e-05,3e-05,4.5e-05,4.7e-05,3.1e-05,9e-06,-5e-05,-8e-06,8e-06,-6.5e-05,-3.1e-05,-4.2e-05,2e-06,1.8e-05,-1.5e-05,-1.1e-05,-2e-06,-3.2e-05,8e-06,-1e-05,-1.4e-05,2e-05,3.5e-05,-2.5e-05,1.9e-05,6.7e-05,-4.6e-05,1.3e-05,6e-06,1.3e-05,-4.2e-05,-1.9e-05,-1.2e-05,1.7e-05,-1e-05,3.5e-05,1.2e-05,-1.8e-05,-1e-05,-3.9e-05,2.3e-05,-5.6e-05,-5e-05,-2.1e-05,1.5e-05,-2e-06,6e-06,2.6e-05,-1.5e-05,3e-06,-1.4e-05,2.2e-05,-6.3e-05,-5e-06,-4.5e-05,-1.4e-05,-3.2e-05,-2.5e-05,-2e-05,-4.3e-05,-8e-06,4.2e-05,-5e-05,-2e-06,2e-06,-1.6e-05,-5.5e-05,-4.1e-05,2.9e-05,6.5e-05,3.6e-05,-6.6e-05,4.4e-05,1.2e-05,7e-06,6.9e-05,-1.9e-05,-2.4e-05,1.3e-05,1.1e-05,3.1e-05,-9e-06,-1.1e-05,6e-06,2.5e-05,-4.4e-05,-2.6e-05,-1.6e-05,1.4e-05,-4.8e-05,-3.6e-05,-2.4e-05,-2e-05,3.1e-05,-2e-06,-2.5e-05,3e-05,-4.2e-05,3.1e-05,1.8e-05,1e-06,3.2e-05,2.3e-05,-2.3e-05,-1.3e-05,-2.2e-05,5.2e-05,-2.6e-05,-5.2e-05,8e-06,1.1e-05,-3e-06,1.9e-05
1.1e-05,-1e-05,6e-06,1.4e-05,-8e-06,2.3e-05,-1.3e-05,-3.1e-05,3.5e-05,2.3e-05,-1.7e-05,-3.7e-05,-2.5e-05,3e-06,1.6e-05,5e-06,1e-05,1e-05,8e-06,9e-06,3e-06,8e-06,1.1e-05,2.1e-05,-2.5e-05,1.5e-05,1.5e-05,-6e-06,1.8e-05,-1.2e-05,-6.1e-05,-1.6e-05,3.9e-05,-4.5e-05,2.2e-05,-5e-06,-2.1e-05,-3.2e-05,1e-05,4.2e-05,1.8e-05,-1e-06,-3.6e-05,-2.8e-05,-2.1e-05,9e-06,1e-05,1.2e-05,-2.3e-05,8.2e-05,2.9e-05,2.3e-05,0,1e-06,1.3e-05,-1.7e-05,-1e-06,-2.3e-05,2.7e-05,-4.4e-05,4.6e-05,-4e-06,-1e-06,-1e-06,-3.3e-05,-1.7e-05,2e-05,-1.5e-05,-1.6e-05,-2.9e-05,2.7e-05,-8e-06,2.3e-05,2e-05,7.3e-05,4.2e-05,-4e-06,-1.8e-05,-1.5e-05,4.3e-05,-2.8e-05,-1.4e-05,9e-06,-8.2e-05,6e-06,2.7e-05,-1.5e-05,-2e-06,-1.4e-05,2e-06,3e-06,1.1e-05,-2.4e-05,1.4e-05,-1.5e-05,5.7e-05,-3.3e-05,2e-05,0,1.4e-05,2.4e-05,-1e-06,-1.7e-05,-3.3e-05,-9e-06,1.9e-05,-2.8e-05,1e-06,2e-05,-1.9e-05,-6e-06,-6e-06,-8e-06,7e-06,-3.4e-05,7e-06,2.4e-05,5e-06,-1.6e-05,3e-06,-4.6e-05
-3.2e-05,1.6e-05,1.1e-05,4e-05,3.3e-05,-2e-05,-9e-06,4e-05,-3.3e-05,-3.6e-05,-2.9e-05,1.7e-05,-2e-06,-8e-06,-4e-06,2e-06,4e-06,1.9e-05,7e-06,-3e-06,-6e-06,-1e-05,-5e-06,-3e-06,3.3e-05,-5e-06,-9e-06,2e-05,-2.3e-05,8e-06,3.3e-05,6.9e-05,-4.8e-05,2.8e-05,2e-06,1.8e-05,1.2e-05,-2e-05,1.6e-05,-9e-06,-1.4e-05,1.6e-05,4.7e-05,1.1e-05,0,8e-06,-8e-06,-8e-06,2.6e-05,-5.4e-05,3e-06,-6e-06,4e-06,3e-06,-1.4e-05,-1.2e-05,1e-05,1e-06,-1.5e-05,3.9e-05,-4.1e-05,-2.4e-05,-1.5e-05,1.2e-05,3.2e-05,5e-06,-1.7e-05,7e-06,8e-06,4.6e-05,-1e-05,4e-06,-3.6e-05,0,-3.6e-05,1.1e-05,0,-5e-06,1.9e-05,-4e-06,2.4e-05,4e-06,-1.1e-05,7.7e-05,1e-06,-8e-06,0,-1.1e-05,-2e-06,-1.1e-05,2e-06,-2.3e-05,4e-06,5e-06,2e-05,-6.7e-05,-9e-06,-2.2e-05,-1.2e-05,4e-06,-5e-06,-1.4e-05,1.8e-05,4e-05,9e-06,8e-06,1.2e-05,-1.2e-05,-1.4e-05,1.4e-05,0,9e-06,6e-06,-8e-06,1.4e-05,-4e-06,-7e-06,2e-05,2.7e-05,-8e-06,2.6e-05
2.2e-05,-1.9e-05,-2.4e-05,-2.7e-05,7e-06,-1.5e-05,1.5e-05,-3.5e-05,1.7e-05,-4e-06,2.5e-05,0,1.3e-05,-2e-06,2.2e-05,1e-06,1e-05,-2.4e-05,-5e-06,0,-4e-06,1e-06,6e-06,-1.5e-05,-2e-06,0,1.3e-05,-1.1e-05,3.4e-05,-1.5e-05,-1.8e-05,-5e-05,1.3e-05,-2.2e-05,3e-06,-2.4e-05,-3e-06,3.9e-05,-1e-06,-5e-06,4e-06,-2.9e-05,-2.7e-05,-1e-05,1.3e-05,-1.2e-05,8e-06,0,-2.3e-05,3.3e-05,-1.9e-05,1.2e-05,1e-06,-5e-06,8e-06,5e-06,0,1e-05,-1.8e-05,9e-06,4.5e-05,1.8e-05,-5e-06,-1.4e-05,7e-06,6e-06,9e-06,0,4e-06,-5.4e-05,1.2e-05,-1e-05,3.8e-05,-5e-06,2.6e-05,-3.2e-05,-1e-06,2.6e-05,-2.5e-05,1e-06,-2.2e-05,-5e-06,-4e-06,-4.3e-05,-7e-06,3e-06,8e-06,1e-05,8e-06,-2e-06,1e-06,1.6e-05,2e-06,-1.4e-05,-1.1e-05,5.7e-05,2.1e-05,2.4e-05,1.1e-05,-3e-06,0,-1e-05,-7e-06,3e-06,9e-06,8e-06,-6e-06,2.8e-05,-1.3e-05,8e-06,-4e-06,-7e-06,1.3e-05,9e-06,3e-06,-1.1e-05,5e-06,-2.4e-05,-1.1e-05,2.2e-05,-6e-06
-2.6e-05,2.3e-05,1.4e-05,3.1e-05,-2.7e-05,3.9e-05,-8e-06,2.6e-05,-1.3e-05,1.3e-05,-1.4e-05,-6e-06,-1.5e-05,1e-06,-1.8e-05,-8e-06,0,4e-06,-8e-06,7e-06,-3e-06,-2e-06,-9e-06,2.4e-05,-2.4e-05,-2.2e-05,-3.6e-05,1.5e-05,-4.7e-05,1.6e-05,3.7e-05,-3e-06,4e-06,-1e-06,1.2e-05,9e-06,-2e-05,-2.7e-05,6e-06,1.1e-05,-1e-06,-1.5e-05,1e-05,6e-06,-1e-06,6e-06,-1.2e-05,1.8e-05,6e-06,-3.2e-05,1.4e-05,-6e-06,-7e-06,-1.2e-05,3e-06,4e-06,-8e-06,1e-05,4.4e-05,-2.7e-05,-3.1e-05,-5e-06,1.8e-05,1e-05,-1.6e-05,0,-8e-06,-3e-06,0,4.6e-05,-9e-06,1.3e-05,-3.5e-05,8e-06,1e-06,2.5e-05,0,-3.7e-05,9e-06,-1.9e-05,-1e-06,4e-06,1.9e-05,0,-9e-06,-1.5e-05,-6e-06,-1e-06,-1e-06,-3e-06,2e-06,-3e-06,5e-06,-7e-06,-4e-06,-4.2e-05,-3e-06,-2.3e-05,-7e-06,9e-06,3e-06,1.1e-05,4e-06,-3e-06,-5e-06,0,2e-06,-4.5e-05,6e-06,-2.6e-05,0,9e-06,-3e-06,-4e-06,-6e-06,5e-06,-1.2e-05,1e-05,-6e-06,-2e-05,1e-05
2.5e-05,-2.1e-05,-1.4e-05,-2.2e-05,2.3e-05,-3.9e-05,-1e-06,-2.4e-05,1e-05,-1.9e-05,6e-06,-1.1e-05,1.7e-05,-1e-06,1.4e-05,5e-06,-2e-06,2.8e-05,-6e-06,-1.9e-05,-6e-06,-2e-06,-1.2e-05,-1.4e-05,2.8e-05,2.2e-05,3.4e-05,-1e-06,3.5e-05,-1.2e-05,-2.2e-05,2.9e-05,-9e-06,2.1e-05,-2.7e-05,1e-06,1.3e-05,1.3e-05,-1.4e-05,-7e-06,2e-06,4.6e-05,1.1e-05,9e-06,5e-06,9e-06,5e-06,-1.2e-05,-5e-06,1.7e-05,-8e-06,3e-06,5e-06,5e-06,-6e-06,-2e-06,-1e-05,-1.8e-05,-3.1e-05,8e-06,4e-06,1.8e-05,-1.3e-05,-7e-06,1e-06,-8e-06,1e-05,9e-06,0,-2.4e-05,2e-05,1e-06,2.4e-05,-1e-05,-9e-06,2e-06,-5e-06,1.5e-05,-2e-06,1.7e-05,1.1e-05,1e-06,-7e-06,1e-06,1.6e-05,1.2e-05,-2e-06,-6e-06,-4e-06,4e-06,-5e-06,-1e-05,-1.4e-05,2.9e-05,0,2.1e-05,-1.1e-05,2.3e-05,1.9e-05,9e-06,-1e-06,0,-7e-06,4e-05,6e-06,-3e-06,3e-06,5.1e-05,1e-06,3e-06,2e-06,-5e-06,-2e-06,-7e-06,7e-06,-7e-06,1.1e-05,-1.4e-05,2.4e-05,1.6e-05,-1.1e-05
-2.1e-05,2e-05,1.6e-05,1.3e-05,-6e-06,3.1e-05,9e-06,2.4e-05,-5e-06,2e-05,2e-06,1e-05,-6e-06,-2e-06,6e-06,-9e-06,0,-4.2e-05,1e-06,1.4e-05,1.2e-05,4e-06,8e-06,1.9e-05,-2.2e-05,-1.6e-05,-1.7e-05,0,-1e-05,4e-06,-1.8e-05,-2.3e-05,1e-05,-2.3e-05,1.3e-05,-1.5e-05,-3e-06,-1.3e-05,1.1e-05,1e-06,-1e-06,-3.6e-05,-1.6e-05,-1.6e-05,-2e-06,-1.3e-05,-9e-06,5e-06,3e-06,-5e-06,8e-06,-6e-06,0,-1e-06,0,3e-06,2.1e-05,-3e-06,5e-06,0,7e-06,-2e-06,5e-06,6e-06,1.1e-05,9e-06,-3e-06,-5e-06,-1e-06,4e-06,-1.9e-05,-3e-06,-7e-06,-2e-06,8e-06,-1.4e-05,7e-06,2.3e-05,0,-8e-06,-1.7e-05,-4e-06,-2e-06,-1e-06,-1.2e-05,-1e-06,0,-3e-06,-1e-06,-5e-06,-2e-06,1.1e-05,6e-06,-1.2e-05,-8e-06,-3e-06,-6e-06,1e-06,-4e-06,-2e-05,-8e-06,-2e-06,2e-06,-1.6e-05,-1e-05,4e-06,-7e-06,-3.2e-05,1.1e-05,5e-06,1e-06,-3e-06,-5e-06,1.3e-05,-5e-06,1.3e-05,-5e-06,1.3e-05,-2.9e-05,-1.9e-05,1.3e-05
2.2e-05,-1.1e-05,-1.3e-05,-1.2e-05,-2.2e-05,-2.3e-05,-5e-06,-2.7e-05,1e-06,-1e-05,-6e-06,-2e-06,-4e-06,-3e-06,-1.4e-05,6e-06,-3e-06,4.4e-05,0,-1e-05,-3e-06,-2e-06,-1e-06,-1.9e-05,1e-06,1.3e-05,1e-06,2e-06,-7e-06,3e-06,2e-05,0,-3e-06,2.7e-05,-2e-06,6e-06,-3e-06,3e-06,-3e-06,-3e-06,-5e-06,3e-05,1.4e-05,8e-06,-3e-06,0,4e-06,-1.2e-05,1.1e-05,-3e-06,-7e-06,-1e-06,-1e-06,7e-06,1e-05,0,-4e-06,1.2e-05,1.1e-05,0,-1.1e-05,-5e-06,-3e-06,-5e-06,-2.1e-05,-8e-06,-5e-06,-1.6e-05,6e-06,1e-05,7e-06,-1e-06,-1.7e-05,1.4e-05,-1.2e-05,-4e-06,2e-06,-3.8e-05,1.2e-05,-6e-06,1.4e-05,2e-06,7e-06,-8e-06,-2e-06,2e-06,8e-06,-1e-06,1.5e-05,0,-1e-06,1e-06,-1e-06,-3e-06,1.3e-05,-2e-06,1.1e-05,1.4e-05,2e-06,7e-06,-1e-06,0,6e-06,-1.2e-05,1.2e-05,-9e-06,5e-06,1.1e-05,-7e-06,-1.5e-05,-4e-06,1e-05,2e-06,-1e-06,4e-06,-3e-06,6e-06,-7e-06,1.8e-05,2e-05,-1.3e-05
-1.3e-05,7e-06,1.1e-05,2.8e-05,1.3e-05,7e-06,-6e-06,2.2e-05,1e-06,-9e-06,8e-06,-5e-06,1e-06,-1e-06,9e-06,-4e-06,-2e-06,-3.5e-05,0,7e-06,5e-06,-1e-06,2e-06,2.5e-05,1.2e-05,-1.3e-05,1.8e-05,-8e-06,8e-06,-4e-06,5e-06,4e-06,-6e-06,-2.9e-05,9e-06,1e-06,-6e-06,8e-06,-5e-06,6e-06,1e-05,-1.6e-05,-4e-06,-2e-06,0,6e-06,-1e-05,8e-06,-3e-06,1.4e-05,1e-05,-3e-06,-4e-06,-3e-06,-6e-06,0,-2e-06,0,-1.4e-05,5e-06,2e-05,4e-06,4e-06,4e-06,3e-06,3e-06,9e-06,6e-06,0,-1.6e-05,-5e-06,2e-06,3.4e-05,-4e-06,-8e-06,1.1e-05,-4e-06,2e-05,-1.9e-05,1.3e-05,-1.5e-05,-3e-06,2e-06,2.1e-05,5e-06,1.1e-05,-3e-06,3e-06,-1.2e-05,-3e-06,0,-6e-06,-4e-06,1e-06,1e-06,1.1e-05,1e-06,-2e-05,-3e-06,-5e-06,9e-06,4e-06,-8e-06,1.9e-05,-8e-06,6e-06,-1.2e-05,1e-06,-2e-06,1.3e-05,2e-06,-7e-06,5e-06,1e-06,0,-2e-06,-5e-06,9e-06,-7e-06,-1.7e-05,8e-06
2e-05,-3e-06,-1.1e-05,-1.5e-05,-3e-06,1e-06,1e-05,-1.6e-05,-9e-06,1.3e-05,0,2e-06,-4e-06,2e-06,1.1e-05,5e-06,-1e-06,1.9e-05,1e-06,-7e-06,-7e-06,5e-06,6e-06,-1.9e-05,-1.8e-05,1.4e-05,-1.8e-05,4e-06,-6e-06,1e-06,-1.3e-05,8e-06,-2e-06,2.1e-05,1e-06,1e-06,1.8e-05,-1.3e-05,9e-06,1e-06,-5e-06,-4e-06,-2e-06,-4e-06,-2e-06,-2e-06,1.2e-05,-1e-06,1e-06,-1.4e-05,-1.3e-05,9e-06,6e-06,4e-06,-7e-06,-3e-06,-6e-06,-9e-06,2e-06,6e-06,-2e-05,-1e-05,-3e-06,-3e-06,1.2e-05,-4e-06,-9e-06,4e-06,-2e-06,1.2e-05,-2e-06,-3e-06,-3.2e-05,-7e-06,4e-06,-3e-06,1e-06,-4e-06,1.8e-05,0,1.9e-05,1e-06,2e-06,-2.7e-05,-1e-06,-2.3e-05,-7e-06,-5e-06,-3e-06,4e-06,4e-06,-1e-05,5e-06,-1e-06,-1.5e-05,-7e-06,1e-06,1.8e-05,-1e-06,-1.3e-05,-6e-06,-2e-06,8e-06,-1.7e-05,-1e-06,0,1.4e-05,2e-06,-1e-06,5e-06,0,5e-06,3e-06,-1e-05,0,6e-06,5e-06,-1.4e-05,2e-06,8e-06,2e-06
-1.5e-05,-1e-06,6e-06,-6e-06,7e-06,-7e-06,-6e-06,1.5e-05,1.1e-05,-1.4e-05,-1e-05,3e-06,7e-06,0,-2.2e-05,-5e-06,-2e-06,-6e-06,3e-06,2e-06,1e-06,-3e-06,-6e-06,1e-06,1.3e-05,-5e-06,1.3e-05,-6e-06,9e-06,2e-06,3e-06,-2.5e-05,7e-06,-1.3e-05,-1e-05,-3e-06,-1.2e-05,1.9e-05,-4e-06,-5e-06,2e-06,1e-05,6e-06,6e-06,-3e-06,-3e-06,-8e-06,-8e-06,-7e-06,1.1e-05,1.6e-05,-5e-06,-1e-06,0,4e-06,-2e-06,6e-06,1e-06,7e-06,-5e-06,2.3e-05,-3e-06,6e-06,0,-1.9e-05,4e-06,9e-06,-8e-06,-1e-06,-7e-06,6e-06,2e-06,1.8e-05,1.3e-05,-1.2e-05,-7e-06,1e-06,-9e-06,-1.6e-05,-1e-05,-1.5e-05,-1e-06,-1e-06,3.1e-05,-1e-06,5e-06,5e-06,1e-06,3e-06,-4e-06,0,5e-06,-7e-06,-4e-06,7e-06,1e-06,-7e-06,-2.2e-05,-8e-06,1.5e-05,-2e-06,-2e-06,-5e-06,6e-06,-3e-06,-3e-06,-7e-06,-9e-06,5e-06,5e-06,-1e-06,-3e-06,-2e-06,1e-05,2e-06,-8e-06,-1e-06,9e-06,-1e-06,-6e-06,-3e-06
1.5e-05,1e-06,-8e-06,5e-06,2e-06,8e-06,2e-06,-1.7e-05,-1.2e-05,1e-06,8e-06,-4e-06,-3e-06,-3e-06,1.1e-05,3e-06,2e-06,-1e-06,5e-06,0,-2e-06,-1e-06,-3e-06,-1.1e-05,1e-06,6e-06,-7e-06,3e-06,-1.6e-05,-1e-06,-6e-06,2.9e-05,2e-06,4e-06,8e-06,-4e-06,2e-06,-1.8e-05,-3e-06,9e-06,-2e-06,0,-1.3e-05,-8e-06,3e-06,0,2e-06,9e-06,1e-06,-7e-06,-1.4e-05,3e-06,-1e-06,0,-1e-06,0,4e-06,5e-06,-4e-06,3e-06,-2e-05,-1e-06,-6e-06,3e-06,1.2e-05,-3e-06,-1e-05,2e-06,0,9e-06,-2e-06,-3e-06,-6e-06,-1.2e-05,2.2e-05,9e-06,1e-06,1.9e-05,1.6e-05,3e-06,1.1e-05,1e-06,-3e-06,-2.3e-05,1e-06,1.3e-05,0,3e-06,3e-06,3e-06,2e-06,0,0,1.3e-05,6e-06,8e-06,0,1.6e-05,5e-06,-7e-06,4e-06,-1e-06,4e-06,-5e-06,1e-06,-1e-06,-1e-06,1.4e-05,4e-06,-1.4e-05,1e-06,-1e-06,-3e-06,-5e-06,-2e-06,3e-06,3e-06,-5e-06,6e-06,3e-06,-7e-06
-1.3e-05,-2e-06,3e-06,-9e-06,-9e-06,-4e-06,4e-06,1.6e-05,1.3e-05,8e-06,-2e-06,-1e-06,2e-06,0,1e-06,-3e-06,-2e-06,5e-06,-3e-06,1e-06,4e-06,5e-06,3e-06,7e-06,-1e-05,-9e-06,-1e-06,-3e-06,1.5e-05,-1e-06,1.5e-05,-1.4e-05,-8e-06,2e-06,-5e-06,4e-06,3e-06,8e-06,-5e-06,-6e-06,2e-06,3e-06,5e-06,5e-06,1e-06,5e-06,-6e-06,-1e-06,-1e-06,-1e-06,1.3e-05,2e-06,-2e-06,-1e-06,-6e-06,3e-06,-5e-06,-3e-06,0,3e-06,1.3e-05,3e-06,-1e-06,-2e-06,5e-06,5e-06,7e-06,0,2e-06,-1.6e-05,-3e-06,3e-06,-2e-06,-1e-06,-1.6e-05,-2e-06,1e-06,-1.8e-05,-8e-06,3e-06,-1e-05,2e-06,8e-06,1.1e-05,-2e-06,2e-06,-1e-06,-1e-06,-1e-05,-4e-06,-3e-06,-2e-06,-1e-06,-7e-06,-1.1e-05,-1.5e-05,8e-06,-1.1e-05,-1e-06,-1e-06,0,1e-06,-4e-06,0,3e-06,-3e-06,0,-1.6e-05,-5e-06,5e-06,2e-06,3e-06,-1e-06,3e-06,-2e-06,-2e-06,-3e-06,1.2e-05,-7e-06,-1e-06,8e-06
1.3e-05,2e-06,-4e-06,9e-06,1e-05,-3e-06,-8e-06,-1.3e-05,-1.3e-05,-4e-06,-6e-06,7e-06,-2e-06,-1e-06,-6e-06,3e-06,0,-5e-06,2e-06,1e-06,-4e-06,-3e-06,5e-06,3e-06,1.5e-05,1e-05,0,4e-06,-5e-06,2e-06,-6e-06,-5e-06,5e-06,-8e-06,4e-06,-1e-06,2e-06,-1e-06,7e-06,-2e-06,-3e-06,-1e-05,1e-06,-3e-06,0,-5e-06,6e-06,-2e-06,6e-06,5e-06,-1.3e-05,0,0,-2e-06,0,-4e-06,-2e-06,-2e-06,1e-06,-4e-06,-1.1e-05,5e-06,-3e-06,1e-06,-1e-05,-2e-06,-3e-06,-2e-06,-3e-06,1.6e-05,4e-06,0,1.1e-05,6e-06,1.5e-05,1e-06,1e-06,2e-06,1e-06,-2e-06,6e-06,-2e-06,0,-2e-06,-1e-06,-1.8e-05,-2e-06,1e-06,6e-06,5e-06,2e-06,7e-06,5e-06,-6e-06,3e-06,1.9e-05,1e-06,5e-06,2e-06,-1e-06,-2e-06,1e-06,-1e-06,-1.9e-05,-5e-06,3e-06,-2e-06,1.8e-05,-1e-06,-6e-06,-1e-06,-3e-06,0,-4e-06,0,-1e-06,2e-06,-1e-05,1e-06,3e-06,-5e-06
-1.4e-05,-3e-06,6e-06,-8e-06,-3e-06,9e-06,7e-06,9e-06,1.1e-05,0,7e-06,-5e-06,0,0,-1e-06,-4e-06,3e-06,3e-06,-2e-06,-3e-06,4e-06,-2e-06,0,3e-06,-1e-05,-5e-06,0,-1e-06,-3e-06,-2e-06,-4e-06,1.8e-05,-2e-06,1.2e-05,-1e-06,0,-8e-06,3e-06,2e-06,5e-06,1e-06,9e-06,-3e-06,-1e-06,2e-06,-3e-06,-2e-06,2e-06,1e-06,-6e-06,1.2e-05,-7e-06,2e-06,0,5e-06,4e-06,1e-06,4e-06,-5e-06,0,5e-06,1e-06,0,0,4e-06,-2e-06,3e-06,5e-06,-1e-06,-1.1e-05,-2e-06,-2e-06,-2e-05,-1e-06,-1e-06,-7e-06,-1e-06,1.6e-05,2e-06,0,-3e-06,-1e-06,-4e-06,1e-06,1e-06,8e-06,1e-06,0,-7e-06,-4e-06,-2e-06,-4e-06,-8e-06,6e-06,3e-06,-1.9e-05,-5e-06,-1.2e-05,4e-06,-9e-06,3e-06,-2e-06,2e-06,1.5e-05,6e-06,-2e-06,5e-06,-1.7e-05,-1e-06,7e-06,-2e-06,3e-06,3e-06,4e-06,-1e-06,3e-06,-1e-06,5e-06,7e-06,-2e-06,2e-06
1.1e-05,1e-06,-5e-06,9e-06,-8e-06,-8e-06,-3e-06,-1e-05,-1.1e-05,4e-06,-5e-06,-1e-06,1e-06,0,6e-06,3e-06,1e-06,0,-3e-06,3e-06,-2e-06,5e-06,-5e-06,-1e-06,0,5e-06,3e-06,2e-06,4e-06,2e-06,3e-06,-1.1e-05,2e-06,-1.2e-05,-3e-06,2e-06,4e-06,1e-06,-6e-06,-6e-06,-1e-06,-1e-05,7e-06,5e-06,-1e-06,5e-06,4e-06,0,-1e-06,6e-06,-1.1e-05,1e-06,0,-2e-06,-4e-06,1e-06,4e-06,0,6e-06,-2e-06,0,3e-06,2e-06,2e-06,1e-06,0,-3e-06,2e-06,1e-06,3e-06,1e-06,0,2e-05,-2e-06,-1e-06,1e-05,0,-1.9e-05,-6e-06,-1e-06,1e-06,1e-06,3e-06,-5e-06,-2e-06,-2e-06,0,2e-06,4e-06,2e-06,2e-06,-4e-06,6e-06,-1e-06,-4e-06,1.6e-05,0,1e-05,1e-06,9e-06,0,2e-06,0,-7e-06,-1e-06,2e-06,-5e-06,1e-05,2e-06,-1e-06,0,-1e-06,1e-06,-5e-06,0,-2e-06,-1e-06,-6e-06,-1.2e-05,2e-06,0
-1e-05,-1e-06,0,-1.8e-05,3e-06,7e-06,0,1e-05,9e-06,-5e-06,4e-06,1e-06,2e-06,-1e-06,-4e-06,-1e-06,0,-5e-06,0,-2e-06,2e-06,-1e-06,1e-06,-5e-06,9e-06,-7e-06,-7e-06,-1e-06,-2e-06,-2e-06,1e-06,-2e-06,-1e-06,1e-05,3e-06,-4e-06,0,-7e-06,1e-06,4e-06,2e-06,1e-05,-5e-06,-6e-06,0,-1e-06,-1e-06,1e-06,-1e-06,-3e-06,9e-06,0,-2e-06,0,-6e-06,-3e-06,-2e-06,-2e-06,-5e-06,-2e-06,-3e-06,-2e-06,1e-06,-3e-06,-1e-06,1e-06,1e-06,-3e-06,1e-06,1e-06,0,1e-06,-1.1e-05,3e-06,6e-06,-5e-06,1e-06,8e-06,1.1e-05,2e-06,3e-06,0,1e-06,9e-06,0,3e-06,0,-1e-06,-2e-06,-2e-06,-2e-06,3e-06,-4e-06,-1e-06,2e-06,-1e-05,3e-06,-1.1e-05,-3e-06,-8e-06,-3e-06,0,1e-06,0,0,1e-06,3e-06,0,1e-06,-1e-06,2e-06,-1e-06,-1e-06,1e-06,1e-06,2e-06,0,8e-06,1.2e-05,0,0
6e-06,1e-06,0,1.2e-05,0,-4e-06,2e-06,-1e-05,-7e-06,3e-06,2e-06,3e-06,0,1e-06,-2e-06,2e-06,1e-06,7e-06,-1e-06,1e-06,-1e-06,-4e-06,2e-06,5e-06,-1.4e-05,5e-06,6e-06,1e-06,4e-06,2e-06,-2e-06,1e-05,2e-06,-9e-06,-5e-06,2e-06,-4e-06,8e-06,3e-06,-2e-06,-1e-06,0,3e-06,2e-06,-4e-06,-2e-06,1e-06,-5e-06,-4e-06,1e-06,-5e-06,1e-06,1e-06,0,3e-06,0,-2e-06,-1e-06,3e-06,1e-06,-1e-06,-2e-06,0,2e-06,-3e-06,0,0,0,-1e-06,-5e-06,-1e-06,0,0,-4e-06,-8e-06,0,0,4e-06,-1.2e-05,-5e-06,-6e-06,0,1e-06,-1.1e-05,0,2e-06,0,-1e-06,5e-06,1e-06,1e-06,1e-06,3e-06,5e-06,-2e-06,4e-06,1e-06,1.1e-05,0,2e-06,1e-06,2e-06,-3e-06,1e-05,0,-2e-06,-3e-06,-5e-06,-2e-06,0,0,2e-06,-2e-06,3e-06,-1e-06,0,0,-6e-06,-7e-06,-2e-06,-3e-06
-6e-06,0,-3e-06,-3e-06,5e-06,1e-06,-2e-06,8e-06,4e-06,-1e-06,-7e-06,-6e-06,-2e-06,0,6e-06,-2e-06,-1e-06,-5e-06,-2e-06,-1e-06,-1e-06,4e-06,-1e-06,-2e-06,1.1e-05,-2e-06,-4e-06,0,-8e-06,-2e-06,0,-6e-06,-6e-06,6e-06,3e-06,1e-06,1e-06,-4e-06,-3e-06,1e-06,0,-8e-06,2e-06,0,3e-06,1e-06,0,2e-06,2e-06,3e-06,-1e-06,-1e-06,-2e-06,2e-06,1e-06,1e-06,0,2e-06,1e-06,4e-06,-1e-06,-5e-06,-1e-06,0,5e-06,0,2e-06,1e-06,-1e-06,5e-06,1e-06,0,7e-06,0,4e-06,0,-1e-06,-1.1e-05,1.1e-05,7e-06,5e-06,-1e-06,0,1.3e-05,0,-2e-06,-1e-06,0,-7e-06,-3e-06,0,-2e-06,-5e-06,-5e-06,1e-06,3e-06,-1e-06,-9e-06,-3e-06,7e-06,2e-06,-3e-06,1e-06,-5e-06,-1e-06,1e-06,2e-06,2e-06,-1e-06,5e-06,0,-2e-06,0,1e-06,1e-06,0,0,7e-06,-1e-06,3e-06,6e-06
4e-06,0,1e-06,4e-06,-1e-06,7e-06,1e-06,-7e-06,-2e-06,-3e-06,7e-06,4e-06,1e-06,0,-1e-06,2e-06,0,-1e-06,2e-06,2e-06,0,0,1e-06,4e-06,-4e-06,3e-06,3e-06,-1e-06,9e-06,0,0,-6e-06,3e-06,-2e-06,1e-06,1e-06,2e-06,3e-06,-2e-06,1e-06,0,8e-06,-3e-06,0,-3e-06,1e-06,1e-06,-1e-06,0,-7e-06,4e-06,3e-06,2e-06,0,-6e-06,-4e-06,3e-06,0,-4e-06,-1e-06,-1e-06,-2e-06,0,-1e-06,-1e-06,1e-06,0,0,1e-06,-3e-06,2e-06,-1e-06,-1.1e-05,2e-06,-5e-06,3e-06,0,1.3e-05,-1.1e-05,-5e-06,-5e-06,0,-2e-06,-1.1e-05,-1e-06,-4e-06,1e-06,0,5e-06,1e-06,1e-06,1e-06,6e-06,-2e-06,5e-06,-8e-06,-1e-06,1.3e-05,-2e-06,-9e-06,-3e-06,2e-06,-1e-06,2e-06,0,0,1e-06,4e-06,-1e-06,-3e-06,0,1e-06,1e-06,-3e-06,-1e-06,0,-2e-06,-1e-05,6e-06,-2e-06,-2e-06
-4e-06,1e-06,-2e-06,-2e-06,-3e-06,-1.2e-05,1e-06,8e-06,-2e-06,6e-06,-3e-06,-1e-06,-1e-06,0,-4e-06,-1e-06,-1e-06,9e-06,2e-06,-2e-06,-1e-06,-4e-06,0,-1e-06,-5e-06,-5e-06,2e-06,2e-06,-5e-06,1e-06,2e-06,1.1e-05,1e-06,0,-2e-06,0,1e-06,-2e-06,2e-06,-3e-06,-1e-06,-7e-06,3e-06,3e-06,2e-06,-1e-06,0,-2e-06,3e-06,5e-06,-6e-06,0,-1e-06,0,1e-06,1e-06,0,-2e-06,4e-06,-2e-06,2e-06,1e-06,-2e-06,0,-4e-06,-2e-06,-2e-06,0,1e-06,1e-06,0,1e-06,1.2e-05,-3e-06,-1e-06,-5e-06,0,-8e-06,8e-06,0,5e-06,0,4e-06,6e-06,-1e-06,2e-06,1e-06,-1e-06,-1e-06,-4e-06,2e-06,3e-06,-8e-06,5e-06,-5e-06,1e-05,-1e-06,-6e-06,2e-06,2e-06,-1e-06,-2e-06,0,5e-06,0,2e-06,-1e-06,-7e-06,2e-06,0,1e-06,0,1e-06,0,0,-1e-06,1e-06,6e-06,-5e-06,2e-06,0
3e-06,-1e-06,3e-06,2e-06,3e-06,9e-06,0,-9e-06,3e-06,0,-1e-06,0,2e-06,0,6e-06,1e-06,-1e-06,-1.5e-05,1e-06,2e-06,2e-06,3e-06,-2e-06,4e-06,1.1e-05,3e-06,-4e-06,-2e-06,0,-1e-06,-3e-06,-5e-06,-2e-06,3e-06,1e-06,-2e-06,-2e-06,1e-06,4e-06,4e-06,1e-06,6e-06,-2e-06,-5e-06,0,-2e-06,1e-06,5e-06,0,-6e-06,6e-06,-1e-06,0,0,4e-06,2e-06,-1e-06,0,0,1e-06,0,2e-06,0,1e-06,7e-06,2e-06,1e-06,1e-06,0,-2e-06,-2e-06,0,-1.1e-05,2e-06,2e-06,1e-06,0,-6e-06,-3e-06,4e-06,-5e-06,0,1e-06,0,0,2e-06,-1e-06,0,0,3e-06,-1e-06,-4e-06,7e-06,0,-2e-06,-8e-06,2e-06,5e-06,1e-06,2e-06,2e-06,2e-06,0,2e-06,1e-06,-1e-06,-1e-06,8e-06,0,-1e-06,0,-1e-06,0,2e-06,2e-06,1e-06,-1e-06,-4e-06,1e-06,-4e-06,0
-3e-06,2e-06,-5e-06,2e-06,-2e-06,-5e-06,1e-06,8e-06,-5e-06,-3e-06,2e-06,-2e-06,-1e-06,1e-06,0,-1e-06,0,1.6e-05,1e-06,0,-1e-06,1e-06,0,-3e-06,-1.1e-05,-1e-06,4e-06,3e-06,2e-06,1e-06,4e-06,-8e-06,-1e-06,-4e-06,-2e-06,1e-06,4e-06,0,-4e-06,-3e-06,-2e-06,0,1e-06,2e-06,1e-06,2e-06,0,0,-1e-06,5e-06,-4e-06,-2e-06,0,0,-4e-06,-1e-06,-1e-06,1e-06,-3e-06,-2e-06,-1e-06,4e-06,-1e-06,0,-4e-06,-1e-06,-2e-06,0,-1e-06,5e-06,2e-06,0,6e-06,1e-06,-3e-06,2e-06,0,1.5e-05,0,-4e-06,5e-06,0,-5e-06,-3e-06,1e-06,0,-1e-06,0,-3e-06,-5e-06,0,-1e-06,-5e-06,-2e-06,5e-06,5e-06,1e-06,-6e-06,1e-06,-2e-06,-1e-06,-3e-06,0,-2e-06,-1e-06,0,-2e-06,-7e-06,0,2e-06,-1e-06,1e-06,0,-2e-06,-2e-06,-1e-06,2e-06,6e-06,1e-06,5e-06,2e-06
3e-06,-2e-06,4e-06,-6e-06,-1e-06,3e-06,-1e-06,-7e-06,6e-06,1e-06,-3e-06,4e-06,-1e-06,0,-4e-06,1e-06,0,-1.2e-05,0,-1e-06,1e-06,-3e-06,1e-06,-2e-06,6e-06,2e-06,-3e-06,-3e-06,0,0,-3e-06,1.6e-05,3e-06,4e-06,2e-06,1e-06,-1e-06,-2e-06,-2e-06,1e-06,1e-06,-4e-06,0,0,1e-06,0,-2e-06,-1e-06,-2e-06,1e-06,4e-06,0,0,0,-3e-06,0,1e-06,1e-06,5e-06,0,2e-06,1e-06,0,-1e-06,-1e-06,0,3e-06,0,0,-5e-06,-2e-06,-1e-06,0,-3e-06,0,-2e-06,0,-1.1e-05,4e-06,-1e-06,-3e-06,0,2e-06,0,-1e-06,4e-06,1e-06,0,4e-06,3e-06,-3e-06,2e-06,4e-06,2e-06,-3e-06,0,-2e-06,8e-06,3e-06,4e-06,-1e-06,2e-06,0,4e-06,0,0,2e-06,6e-06,0,-3e-06,0,-1e-06,-1e-06,0,1e-06,0,-1e-06,-7e-06,-1e-06,-5e-06,-3e-06
-3e-06,2e-06,-5e-06,1.1e-05,0,0,0,7e-06,-8e-06,0,1e-06,-3e-06,0,0,3e-06,-1e-06,0,6e-06,0,1e-06,-2e-06,2e-06,1e-06,-2e-06,2e-06,-3e-06,0,2e-06,1e-06,0,0,-1.1e-05,-3e-06,-4e-06,1e-06,0,0,3e-06,3e-06,2e-06,-1e-06,1e-06,-1e-06,0,-1e-06,-2e-06,0,2e-06,-2e-06,-1e-06,-7e-06,0,0,-1e-06,4e-06,2e-06,1e-06,-4e-06,-1e-06,2e-06,-4e-06,-1e-06,-1e-06,1e-06,3e-06,-1e-06,-2e-06,1e-06,1e-06,2e-06,2e-06,1e-06,-5e-06,1e-06,4e-06,1e-06,0,0,-9e-06,3e-06,3e-06,0,2e-06,4e-06,0,-1e-05,1e-06,1e-06,-2e-06,-3e-06,1e-06,-3e-06,-5e-06,-3e-06,-1e-06,-5e-06,-1e-06,-9e-06,-1e-06,2e-06,1e-06,-2e-06,-1e-06,-3e-06,1e-06,-1e-06,-1e-06,-2e-06,0,5e-06,0,0,0,1e-06,-1e-06,1e-06,2e-06,5e-06,-1e-06,5e-06,3e-06
4e-06,-2e-06,3e-06,-1e-05,0,-6e-06,0,-8e-06,8e-06,-1e-06,1e-06,2e-06,-1e-06,0,1e-06,1e-06,1e-06,1e-06,-1e-06,-1e-06,2e-06,1e-06,0,2e-06,-8e-06,2e-06,1e-06,-2e-06,-5e-06,0,1e-06,-1e-06,3e-06,4e-06,-2e-06,1e-06,-2e-06,-3e-06,1e-06,-2e-06,2e-06,-2e-06,1e-06,3e-06,-2e-06,0,-1e-06,-1e-06,2e-06,2e-06,1.1e-05,1e-06,0,1e-06,1e-06,-1e-06,0,1e-06,-4e-06,1e-06,5e-06,-2e-06,1e-06,0,-2e-06,1e-06,2e-06,-1e-06,0,1e-06,0,0,9e-06,2e-06,-3e-06,-1e-06,0,9e-06,1e-05,1e-06,-2e-06,0,-1e-06,-8e-06,0,2e-06,0,-1e-06,2e-06,1e-06,-1e-06,0,6e-06,-1e-06,2e-06,9e-06,1e-06,6e-06,-2e-06,-1e-06,1e-06,3e-06,1e-06,-8e-06,0,1e-06,0,-4e-06,1e-06,-2e-06,0,1e-06,0,2e-06,0,-1e-06,-2e-06,-6e-06,2e-06,-4e-06,-1e-06
