0.034534,0.031012,0.029302,0.02716,0.023517,0.022089,0.020985,0.020546,0.020481,0.019499,0.018827,0.020683,0.021655,0.020499,0.019499,0.017909,0.016902,0.016355,0.015443,0.015834,0.016928,0.016056,0.015647,0.015543,0.014044,0.012828,0.01208,0.011268
0.046524,0.041517,0.039611,0.036759,0.030975,0.028824,0.027737,0.02694,0.027225,0.026357,0.025288,0.027493,0.028573,0.027516,0.026045,0.02333,0.022271,0.021867,0.020646,0.021313,0.023014,0.021829,0.021017,0.020511,0.01875,0.017168,0.015915,0.01489
0.068738,0.060837,0.058603,0.055265,0.04622,0.042589,0.041267,0.039408,0.039932,0.03954,0.03774,0.040803,0.042409,0.041011,0.038395,0.033728,0.032745,0.032804,0.031088,0.032321,0.035019,0.03306,0.031286,0.030049,0.028035,0.025628,0.023444,0.022228
0.090851,0.081297,0.07776,0.075218,0.06552,0.059905,0.057385,0.053353,0.052561,0.05284,0.050898,0.054836,0.056702,0.05385,0.050099,0.044167,0.043919,0.044935,0.042536,0.04402,0.047512,0.044461,0.041374,0.039802,0.037853,0.034568,0.032151,0.031403
0.11335,0.106307,0.098924,0.096301,0.090155,0.082047,0.077278,0.069394,0.063972,0.066007,0.065757,0.068818,0.069049,0.062146,0.058473,0.054836,0.056461,0.058346,0.053878,0.053832,0.057976,0.054271,0.049849,0.049074,0.047217,0.043797,0.043594,0.044231
0.150207,0.148714,0.136464,0.129526,0.126684,0.114138,0.106422,0.094745,0.082586,0.088653,0.09133,0.091371,0.087842,0.071575,0.068338,0.071735,0.077102,0.079772,0.069508,0.064373,0.070878,0.06793,0.062367,0.064279,0.06174,0.057638,0.06238,0.065632
0.202848,0.208081,0.192725,0.178547,0.174869,0.15808,0.149267,0.133909,0.113817,0.123329,0.128612,0.125556,0.116737,0.089489,0.085668,0.096339,0.105879,0.109762,0.092594,0.081335,0.092288,0.09152,0.084787,0.089498,0.085402,0.078071,0.087195,0.094192
0.245852,0.259162,0.242773,0.21808,0.210912,0.194794,0.188378,0.170161,0.143663,0.153856,0.15939,0.153374,0.140215,0.107609,0.103324,0.118251,0.129925,0.134665,0.115343,0.100122,0.111507,0.112687,0.106281,0.111543,0.104985,0.094802,0.106299,0.115527
0.256454,0.278253,0.261394,0.22467,0.21414,0.204402,0.199803,0.181585,0.153823,0.158353,0.160785,0.155064,0.143161,0.117187,0.115073,0.127521,0.134658,0.139471,0.126818,0.109669,0.112085,0.115119,0.112209,0.114098,0.105162,0.09763,0.109211,0.115346
0.235903,0.263318,0.256131,0.214671,0.197948,0.193538,0.182802,0.167557,0.145305,0.136166,0.134593,0.13586,0.133276,0.123404,0.125853,0.131345,0.124874,0.126682,0.128818,0.113188,0.100636,0.102996,0.104248,0.099814,0.089187,0.090997,0.104109,0.10221
0.215487,0.243857,0.257553,0.224319,0.195666,0.18465,0.160101,0.147634,0.136227,0.120568,0.116722,0.126303,0.13755,0.137816,0.13661,0.132207,0.112387,0.109521,0.123895,0.116797,0.099123,0.097004,0.097179,0.090086,0.083042,0.093473,0.104776,0.095384
0.213477,0.238302,0.259891,0.23811,0.207268,0.18212,0.142847,0.131183,0.130969,0.125397,0.121821,0.13412,0.154215,0.15476,0.141122,0.126834,0.105329,0.099046,0.112171,0.114075,0.1037,0.097163,0.094312,0.088234,0.086437,0.103223,0.110555,0.093883
0.21197,0.235593,0.254085,0.232369,0.194084,0.161092,0.132421,0.124066,0.120803,0.125422,0.124674,0.13558,0.157482,0.15971,0.141038,0.119847,0.098862,0.088258,0.093782,0.102145,0.102404,0.096636,0.093535,0.08759,0.086265,0.105406,0.110652,0.090215
0.201786,0.229748,0.237133,0.205481,0.1611,0.13091,0.122972,0.119325,0.10914,0.116244,0.120217,0.127802,0.139246,0.140977,0.131444,0.114621,0.097154,0.08448,0.082676,0.09053,0.093624,0.0885,0.088033,0.085291,0.079713,0.09117,0.09812,0.084739
0.211178,0.243533,0.224627,0.183556,0.155327,0.140766,0.136996,0.125209,0.11271,0.119529,0.130396,0.143039,0.140378,0.125855,0.122481,0.122971,0.121076,0.10894,0.099145,0.097713,0.090651,0.084413,0.087708,0.088017,0.078403,0.077269,0.084135,0.082689
0.272986,0.324057,0.287909,0.238011,0.228616,0.222379,0.202071,0.159865,0.138774,0.157976,0.183763,0.207653,0.194254,0.153259,0.148974,0.166627,0.1833,0.169286,0.1482,0.136037,0.111284,0.106423,0.109488,0.102007,0.092812,0.085222,0.090449,0.097458
0.398714,0.477358,0.409636,0.338717,0.359947,0.365,0.32642,0.244001,0.194283,0.227241,0.277438,0.316564,0.292628,0.224609,0.220484,0.255196,0.286901,0.262408,0.220737,0.20017,0.161814,0.156734,0.158188,0.144124,0.13539,0.117677,0.122503,0.137778
0.54147,0.64666,0.527825,0.431418,0.505415,0.529506,0.477581,0.357324,0.26029,0.298958,0.383905,0.442705,0.399005,0.303909,0.304624,0.359162,0.404162,0.362212,0.292241,0.273825,0.231166,0.217451,0.217592,0.20664,0.200369,0.16924,0.172429,0.187191
0.631953,0.756383,0.607839,0.500803,0.626162,0.66005,0.603061,0.469135,0.322329,0.351757,0.473354,0.547854,0.473325,0.357919,0.364188,0.42967,0.481763,0.43002,0.338809,0.336325,0.297656,0.267653,0.272944,0.276661,0.272534,0.228127,0.231078,0.233668
0.617098,0.748033,0.648837,0.571967,0.692996,0.712387,0.658597,0.537742,0.376914,0.395917,0.526075,0.593292,0.492434,0.376231,0.389796,0.434908,0.470075,0.433288,0.354385,0.3754,0.338873,0.288985,0.304041,0.325463,0.322162,0.275512,0.279187,0.26707
0.527511,0.640967,0.641496,0.639359,0.677936,0.646555,0.608585,0.518998,0.396191,0.413639,0.513892,0.551939,0.450374,0.370714,0.410849,0.398114,0.388166,0.390024,0.340877,0.371234,0.338285,0.281685,0.304996,0.325458,0.321061,0.292917,0.291319,0.272652
0.44377,0.543454,0.629133,0.687066,0.605325,0.521983,0.509679,0.439138,0.375253,0.37871,0.41352,0.426289,0.370188,0.352427,0.399223,0.331224,0.288503,0.321849,0.293033,0.308569,0.292811,0.267042,0.29116,0.28327,0.274975,0.266284,0.247043,0.236997
0.36352,0.416495,0.568271,0.687213,0.546984,0.447275,0.439805,0.375118,0.35198,0.322983,0.278866,0.285256,0.309435,0.336982,0.346587,0.262741,0.224915,0.258626,0.240658,0.238828,0.242881,0.265437,0.285947,0.241315,0.221865,0.213977,0.178983,0.186562
0.291358,0.290835,0.443502,0.59323,0.477145,0.369,0.342432,0.304082,0.315356,0.272919,0.197112,0.192441,0.247733,0.288555,0.273613,0.206201,0.182364,0.208589,0.205982,0.199258,0.21132,0.255877,0.262303,0.196725,0.167668,0.153094,0.131697,0.155085
0.210075,0.199372,0.298059,0.4087,0.340497,0.251689,0.232523,0.220477,0.237015,0.213523,0.17551,0.174101,0.192621,0.202951,0.186715,0.157203,0.150583,0.162795,0.164441,0.166406,0.181132,0.207103,0.199826,0.148416,0.118118,0.105783,0.107167,0.125869
0.125899,0.143778,0.188194,0.223939,0.197005,0.161067,0.165343,0.152128,0.153274,0.162212,0.171486,0.16594,0.139289,0.121601,0.109251,0.110221,0.125046,0.120716,0.110523,0.12269,0.13733,0.138242,0.121234,0.099334,0.088304,0.083922,0.092965,0.097219
0.071058,0.111936,0.139908,0.132468,0.117639,0.109084,0.129153,0.128434,0.116985,0.127612,0.148311,0.139287,0.097551,0.073934,0.071643,0.088702,0.113602,0.10118,0.074579,0.080677,0.090556,0.08818,0.071492,0.067494,0.076974,0.074822,0.080939,0.079905
0.054163,0.089239,0.119038,0.116408,0.093889,0.077458,0.104533,0.117496,0.098298,0.099044,0.111442,0.102188,0.072064,0.062928,0.064726,0.080843,0.106703,0.091361,0.061794,0.056615,0.063259,0.071497,0.060949,0.0534,0.062283,0.06562,0.076185,0.07874
0.048899,0.066132,0.085561,0.088331,0.073293,0.063956,0.082781,0.092733,0.074388,0.072821,0.079814,0.073628,0.057226,0.060709,0.067089,0.074943,0.097427,0.084495,0.060685,0.050661,0.049228,0.059714,0.055012,0.044722,0.054208,0.062149,0.070368,0.079889
0.052121,0.058542,0.066513,0.058468,0.057347,0.06372,0.06655,0.066038,0.065416,0.077842,0.081744,0.069283,0.052741,0.061413,0.076129,0.080584,0.087839,0.07326,0.062571,0.057999,0.048176,0.051067,0.050421,0.046335,0.057462,0.059908,0.061003,0.078196
0.0624,0.06659,0.066562,0.053319,0.065272,0.08021,0.071808,0.060422,0.06814,0.095671,0.100978,0.080174,0.058334,0.062466,0.080439,0.087517,0.07605,0.057521,0.063375,0.070437,0.054655,0.043411,0.043585,0.047252,0.063818,0.065246,0.061805,0.0795
0.067892,0.071055,0.070126,0.060548,0.080628,0.092107,0.078944,0.065241,0.075149,0.110334,0.120657,0.101139,0.069941,0.063658,0.081335,0.090735,0.069682,0.052132,0.069162,0.07847,0.062541,0.045361,0.041514,0.047411,0.069306,0.071365,0.064967,0.082809
0.060852,0.063136,0.070715,0.074573,0.091631,0.086651,0.07419,0.069331,0.08151,0.110514,0.120882,0.111925,0.076815,0.06179,0.07379,0.080114,0.063187,0.056229,0.070602,0.072511,0.061045,0.050933,0.0508,0.052346,0.067717,0.066826,0.060362,0.081119
0.046762,0.050874,0.067091,0.082746,0.089593,0.067509,0.058636,0.062028,0.07484,0.089856,0.095288,0.099453,0.070882,0.051414,0.056822,0.059963,0.05182,0.060075,0.067788,0.061383,0.055085,0.05352,0.061138,0.059463,0.062009,0.060764,0.050649,0.064865
0.039686,0.044664,0.059591,0.077346,0.07573,0.052888,0.050817,0.04913,0.055101,0.058156,0.059642,0.070408,0.053052,0.035465,0.042724,0.048176,0.040097,0.055947,0.06711,0.067625,0.060491,0.053379,0.065226,0.066658,0.067141,0.062872,0.039539,0.044591
0.040493,0.042597,0.048697,0.061925,0.058553,0.042309,0.048815,0.043343,0.037787,0.034159,0.038278,0.050872,0.038377,0.02327,0.03187,0.041391,0.033006,0.05071,0.07121,0.079262,0.070906,0.058224,0.070146,0.077153,0.078816,0.066318,0.034576,0.0351
0.042225,0.041379,0.045156,0.049805,0.048728,0.041878,0.047248,0.042037,0.028872,0.024088,0.030914,0.040946,0.029212,0.017947,0.025678,0.032526,0.028919,0.046166,0.067318,0.078579,0.071506,0.060395,0.074408,0.081958,0.080286,0.064713,0.034285,0.031034
0.04218,0.041551,0.042857,0.038068,0.036131,0.039032,0.040755,0.036648,0.027517,0.026392,0.033525,0.033956,0.019806,0.014509,0.020491,0.024435,0.027551,0.038481,0.051734,0.062278,0.058569,0.052196,0.067568,0.07268,0.06598,0.052896,0.030146,0.024773
0.037354,0.03785,0.039458,0.032842,0.024062,0.030883,0.031321,0.028175,0.029195,0.033695,0.037326,0.029155,0.014745,0.012818,0.018137,0.019679,0.025013,0.033073,0.035375,0.040916,0.042848,0.037589,0.050285,0.053603,0.045675,0.038385,0.023234,0.018224
0.033557,0.035289,0.034022,0.027676,0.016265,0.025072,0.028751,0.020042,0.026737,0.037541,0.036232,0.02586,0.014796,0.012144,0.018576,0.019036,0.021764,0.033515,0.030186,0.029197,0.034784,0.028867,0.035614,0.041125,0.041828,0.036772,0.019439,0.01562
