0.041154,0.045837,0.052197,0.057497,0.056393,0.04944,0.047281,0.04519,0.044675,0.049298,0.051078,0.051177,0.051489,0.050257,0.049609,0.048093,0.046937,0.047473,0.047412,0.049814,0.050876,0.050046,0.044832,0.042933,0.046402,0.046493,0.046881,0.048653
0.049985,0.056257,0.063681,0.068627,0.06753,0.060267,0.058194,0.05577,0.055411,0.061067,0.063008,0.062098,0.061535,0.060594,0.060615,0.058711,0.057048,0.057813,0.057918,0.05997,0.060117,0.059598,0.055498,0.054608,0.058212,0.057788,0.057841,0.059091
0.065277,0.074126,0.082671,0.085923,0.0849,0.077912,0.076623,0.073963,0.073981,0.081977,0.083538,0.079676,0.077615,0.077829,0.079165,0.076092,0.073577,0.07519,0.075353,0.076138,0.074475,0.074524,0.073222,0.074374,0.077903,0.076253,0.075032,0.075205
0.081911,0.090015,0.097049,0.097298,0.096628,0.091538,0.091407,0.089508,0.091085,0.102281,0.101486,0.09148,0.087547,0.088822,0.091504,0.088699,0.087091,0.089835,0.088359,0.086982,0.084566,0.084694,0.086503,0.090568,0.09328,0.088499,0.084186,0.084062
0.107747,0.107412,0.108903,0.107818,0.108141,0.10296,0.100627,0.103666,0.112765,0.127446,0.120943,0.101479,0.09556,0.096011,0.098135,0.099932,0.10173,0.105251,0.102393,0.099268,0.096968,0.095779,0.099355,0.10564,0.107829,0.099825,0.091629,0.093155
0.144086,0.134409,0.130551,0.131531,0.134917,0.125897,0.115265,0.123971,0.144606,0.162906,0.150019,0.120987,0.113875,0.113568,0.112373,0.119157,0.126166,0.130081,0.125719,0.120135,0.117502,0.115294,0.120268,0.128308,0.130846,0.121917,0.112863,0.115004
0.177785,0.16508,0.161017,0.162002,0.170024,0.162159,0.144003,0.153089,0.179539,0.199092,0.183832,0.151464,0.144763,0.14723,0.144622,0.151529,0.160169,0.160649,0.154146,0.149285,0.145658,0.14075,0.145028,0.153758,0.158144,0.153061,0.149101,0.15181
0.198186,0.186699,0.183184,0.184082,0.20242,0.204838,0.182934,0.191841,0.219613,0.229374,0.210481,0.181301,0.176063,0.186812,0.189846,0.19371,0.196774,0.189539,0.181997,0.180081,0.175774,0.171285,0.17352,0.178628,0.17905,0.178976,0.193115,0.201576
0.215833,0.211271,0.204411,0.204192,0.235934,0.246883,0.221802,0.2388,0.274458,0.26516,0.233651,0.206946,0.199086,0.220048,0.231039,0.231081,0.23357,0.220644,0.209444,0.215407,0.213335,0.209441,0.212735,0.210723,0.198274,0.203584,0.245879,0.259923
0.24327,0.236309,0.221558,0.226669,0.266701,0.276448,0.249238,0.27711,0.321791,0.29626,0.254837,0.235332,0.222573,0.243182,0.259275,0.261954,0.26868,0.250128,0.231536,0.24668,0.245875,0.240897,0.248795,0.235602,0.209997,0.224637,0.290175,0.303966
0.257207,0.238927,0.223067,0.243426,0.27696,0.273392,0.251356,0.282181,0.326636,0.301325,0.261711,0.255649,0.24109,0.243459,0.258091,0.273774,0.284507,0.262925,0.245238,0.260556,0.255601,0.25604,0.261766,0.229229,0.201459,0.228743,0.294179,0.296166
0.244189,0.216967,0.212018,0.250162,0.264431,0.244362,0.227746,0.245995,0.279467,0.270483,0.243996,0.246662,0.237876,0.225895,0.238032,0.267221,0.27396,0.247006,0.23877,0.245167,0.234551,0.245547,0.244252,0.203738,0.184642,0.213792,0.255997,0.240878
0.209446,0.18978,0.20081,0.238361,0.237825,0.227597,0.216406,0.207734,0.214419,0.213243,0.217843,0.231321,0.224295,0.210819,0.221875,0.249031,0.243145,0.218589,0.224828,0.215628,0.191221,0.212123,0.22708,0.205046,0.185512,0.196363,0.207546,0.18029
0.186351,0.181598,0.188258,0.205453,0.209471,0.224862,0.215444,0.18607,0.174822,0.170468,0.193234,0.218259,0.215063,0.201859,0.21228,0.23652,0.221099,0.202026,0.219711,0.199,0.155221,0.173962,0.211783,0.213128,0.189457,0.188375,0.18048,0.14518
0.185789,0.175558,0.172363,0.17889,0.192643,0.221793,0.212792,0.171813,0.156272,0.158973,0.183212,0.20207,0.204395,0.189691,0.18681,0.205161,0.194949,0.186245,0.200604,0.175971,0.133416,0.142619,0.181716,0.200602,0.187835,0.188408,0.178126,0.147066
0.223201,0.182821,0.181537,0.195349,0.21054,0.243802,0.246372,0.200733,0.178661,0.196116,0.224388,0.23258,0.239467,0.211275,0.170885,0.167811,0.179329,0.211788,0.204353,0.166668,0.155625,0.152345,0.172632,0.210776,0.225504,0.236454,0.212674,0.187704
0.306728,0.228791,0.229593,0.259689,0.277998,0.316547,0.341604,0.294804,0.257845,0.286923,0.323082,0.322852,0.339324,0.300316,0.220124,0.190481,0.222058,0.301803,0.276139,0.212323,0.215343,0.206839,0.223071,0.277165,0.309668,0.335787,0.299451,0.272736
0.399294,0.303481,0.29887,0.336293,0.361721,0.394868,0.443145,0.400737,0.347175,0.386923,0.43167,0.426651,0.449484,0.411343,0.306854,0.26244,0.316302,0.426515,0.383937,0.294232,0.293943,0.274946,0.2829,0.341635,0.381577,0.42615,0.396901,0.372859
0.439023,0.359583,0.348913,0.389565,0.414483,0.419119,0.485315,0.462795,0.427129,0.477939,0.500982,0.495502,0.513341,0.48573,0.402969,0.363718,0.422937,0.530296,0.477815,0.385626,0.376897,0.343545,0.327022,0.360804,0.399698,0.461359,0.459742,0.45278
0.425642,0.409686,0.390363,0.410465,0.411456,0.386957,0.453572,0.454599,0.488909,0.548922,0.512454,0.499545,0.504496,0.506543,0.501848,0.492724,0.516261,0.563914,0.521807,0.480434,0.467805,0.416553,0.369047,0.344588,0.36438,0.443547,0.499011,0.524856
0.434996,0.490304,0.44407,0.406461,0.369348,0.347468,0.407335,0.427254,0.535576,0.595296,0.508569,0.471694,0.478226,0.520819,0.573245,0.601902,0.572195,0.521801,0.511385,0.553259,0.534141,0.471378,0.404667,0.336925,0.346017,0.424826,0.529329,0.590734
0.480577,0.548769,0.469501,0.39323,0.336682,0.355124,0.421543,0.415964,0.520064,0.566227,0.472291,0.41087,0.42145,0.506351,0.5692,0.618031,0.573946,0.45543,0.477028,0.571688,0.530692,0.474081,0.410657,0.332481,0.363917,0.442987,0.553547,0.628365
0.511027,0.534506,0.435317,0.369257,0.317361,0.371331,0.431602,0.394334,0.446617,0.456704,0.381821,0.338326,0.350876,0.422352,0.462619,0.539421,0.534327,0.404419,0.423721,0.510724,0.455387,0.420717,0.385073,0.32381,0.383173,0.428304,0.492254,0.572126
0.495463,0.476211,0.401643,0.367718,0.303171,0.338372,0.370301,0.335063,0.35109,0.327413,0.280972,0.282169,0.296458,0.31105,0.326208,0.423998,0.446223,0.342159,0.359041,0.416764,0.355061,0.34746,0.376794,0.346914,0.398634,0.392938,0.398261,0.472911
0.463957,0.446246,0.388855,0.366337,0.296124,0.277582,0.279158,0.28036,0.27995,0.24771,0.240541,0.273857,0.306897,0.271729,0.260477,0.334969,0.336432,0.291451,0.310709,0.315582,0.25999,0.271591,0.357258,0.372402,0.396426,0.387704,0.38764,0.425586
0.458299,0.435993,0.3514,0.333179,0.278592,0.224153,0.227233,0.276821,0.272601,0.240381,0.239108,0.260035,0.311849,0.274076,0.253152,0.304653,0.298714,0.290659,0.276208,0.234227,0.196705,0.213753,0.31995,0.354297,0.346332,0.366878,0.399691,0.426605
0.409637,0.375699,0.304455,0.301476,0.240635,0.183534,0.223063,0.29751,0.279897,0.258883,0.261566,0.250209,0.305873,0.294685,0.25508,0.269275,0.282911,0.309912,0.299731,0.258769,0.217247,0.208011,0.276962,0.293904,0.280829,0.326658,0.35841,0.37343
0.303401,0.301706,0.297552,0.309152,0.225003,0.176754,0.248689,0.312982,0.267958,0.264555,0.294329,0.274859,0.298309,0.281188,0.228277,0.222435,0.257155,0.306827,0.340229,0.326255,0.260828,0.21314,0.224945,0.237631,0.247951,0.286262,0.275883,0.276545
0.216557,0.265036,0.308942,0.317968,0.243858,0.228412,0.304629,0.331028,0.254096,0.244061,0.297364,0.298806,0.28334,0.252483,0.213981,0.206223,0.229806,0.296878,0.37623,0.365256,0.281467,0.218341,0.20687,0.237729,0.274504,0.296469,0.262413,0.258953
0.196367,0.258546,0.302949,0.301218,0.250292,0.285107,0.37375,0.373111,0.247302,0.194365,0.263921,0.301885,0.268776,0.238908,0.228578,0.209145,0.192922,0.282747,0.390406,0.357189,0.276413,0.22073,0.212265,0.259869,0.337994,0.368269,0.318093,0.309028
0.232281,0.277566,0.283262,0.287982,0.265456,0.305711,0.383881,0.357519,0.204995,0.142913,0.236372,0.294053,0.263619,0.242289,0.238845,0.212357,0.172017,0.26961,0.35092,0.286654,0.232002,0.211928,0.213654,0.253273,0.366162,0.40775,0.333893,0.315096
0.260195,0.273428,0.238998,0.268699,0.281566,0.27434,0.303942,0.26313,0.141892,0.131478,0.228254,0.249869,0.224082,0.23747,0.22647,0.194804,0.177622,0.248761,0.270595,0.205172,0.168892,0.185272,0.195066,0.205228,0.324764,0.366857,0.275383,0.245487
0.266037,0.233761,0.189195,0.26206,0.309229,0.236871,0.194655,0.148952,0.091887,0.135024,0.207527,0.186456,0.160872,0.202806,0.182701,0.152893,0.184296,0.225989,0.192937,0.138504,0.119149,0.16052,0.176295,0.166682,0.24796,0.265601,0.180779,0.143415
0.258388,0.190633,0.156742,0.282392,0.334151,0.234564,0.172775,0.113914,0.078479,0.138578,0.204017,0.164614,0.133919,0.183073,0.157741,0.128645,0.181564,0.214226,0.1688,0.116409,0.103821,0.158269,0.18002,0.160647,0.191238,0.202113,0.139982,0.097376
0.231828,0.169183,0.13638,0.273023,0.310085,0.20994,0.183589,0.125855,0.084804,0.144518,0.215933,0.169231,0.139607,0.18512,0.161541,0.124588,0.154346,0.180603,0.14295,0.099845,0.08558,0.141636,0.170061,0.162322,0.171017,0.175933,0.141835,0.109676
0.173414,0.144007,0.125093,0.232833,0.241557,0.158113,0.166065,0.123355,0.086263,0.14468,0.210351,0.172343,0.144314,0.164391,0.149659,0.120175,0.117433,0.133019,0.118388,0.092198,0.079981,0.11488,0.138843,0.147456,0.13578,0.134267,0.134791,0.115276
0.143712,0.152693,0.162576,0.211824,0.18869,0.130399,0.143691,0.130148,0.092778,0.12969,0.184388,0.163839,0.138379,0.143083,0.151572,0.133258,0.109179,0.11021,0.104776,0.091872,0.094836,0.106304,0.115452,0.133809,0.108797,0.096737,0.119046,0.109118
0.162036,0.18229,0.210743,0.229098,0.207911,0.15407,0.171691,0.18125,0.128893,0.134143,0.180325,0.173821,0.145055,0.182808,0.209385,0.158238,0.127831,0.147175,0.1361,0.103993,0.113063,0.113882,0.108373,0.119198,0.105812,0.11327,0.142713,0.124571
0.184252,0.210483,0.239094,0.248566,0.264912,0.211811,0.217479,0.25184,0.190068,0.172588,0.207947,0.19375,0.172423,0.255598,0.276746,0.196318,0.183775,0.214375,0.181781,0.119521,0.127377,0.125249,0.116248,0.108034,0.105556,0.15609,0.187461,0.145088
0.225133,0.246149,0.234065,0.242805,0.31398,0.268122,0.238025,0.31216,0.254446,0.202604,0.217336,0.199239,0.222354,0.328515,0.313055,0.23683,0.273227,0.286802,0.213261,0.145772,0.14254,0.125569,0.128568,0.118138,0.11709,0.208369,0.219157,0.160474
