0.081739,0.074257,0.054142,0.049453,0.058935,0.051297,0.050713,0.068661,0.068476,0.058603,0.052412,0.049724,0.054993,0.056678,0.059512,0.058843,0.05432,0.057374,0.060771,0.062711,0.073336,0.070803,0.058588,0.059136,0.060501,0.055224,0.04354,0.040336
0.093863,0.086157,0.063954,0.057888,0.067545,0.059694,0.059686,0.077995,0.076824,0.066664,0.061038,0.058934,0.063917,0.065771,0.06968,0.069168,0.064501,0.068019,0.071358,0.072965,0.084138,0.081282,0.067455,0.067053,0.068792,0.063606,0.051304,0.048215
0.110172,0.10375,0.080061,0.072105,0.080465,0.073605,0.074883,0.089731,0.085887,0.077914,0.07454,0.073288,0.076231,0.078752,0.085931,0.08661,0.082164,0.085708,0.088898,0.088698,0.098025,0.09545,0.079692,0.077145,0.079803,0.075103,0.063439,0.06099
0.117098,0.114232,0.094078,0.086403,0.092352,0.090804,0.09488,0.097259,0.087416,0.088395,0.089374,0.086197,0.083516,0.088563,0.103074,0.106338,0.102308,0.105212,0.109174,0.102881,0.103868,0.10466,0.090355,0.08826,0.092847,0.086246,0.076367,0.073914
0.133931,0.134086,0.11463,0.107031,0.114897,0.122892,0.132622,0.119042,0.098574,0.114021,0.121261,0.113404,0.102707,0.109994,0.135093,0.142326,0.139035,0.14478,0.151655,0.133738,0.122694,0.127602,0.113756,0.114819,0.122753,0.112159,0.102146,0.096395
0.165119,0.168366,0.144759,0.134971,0.145188,0.158918,0.174552,0.152574,0.124034,0.151948,0.165176,0.152455,0.135041,0.145685,0.181043,0.190003,0.185208,0.195241,0.205533,0.176371,0.155125,0.163227,0.1473,0.148478,0.160026,0.1481,0.135999,0.125549
0.179641,0.185052,0.162889,0.154232,0.162672,0.174062,0.191489,0.170519,0.14295,0.175908,0.19072,0.175202,0.154873,0.167269,0.204826,0.21352,0.207923,0.220559,0.232479,0.196975,0.170325,0.180949,0.165369,0.16328,0.177155,0.169314,0.156036,0.14132
0.163401,0.16574,0.151143,0.148615,0.153213,0.155848,0.167212,0.155806,0.140574,0.167985,0.176605,0.161264,0.146972,0.157029,0.183234,0.190578,0.186732,0.196467,0.204661,0.176203,0.157505,0.165611,0.151522,0.14562,0.157895,0.157876,0.147833,0.132787
0.143987,0.136711,0.127498,0.135259,0.142655,0.134414,0.132933,0.136497,0.140396,0.154928,0.147904,0.133407,0.135481,0.143447,0.156691,0.157182,0.14743,0.150648,0.150534,0.140537,0.146156,0.14848,0.131605,0.124049,0.129699,0.134008,0.132023,0.121375
0.171801,0.151786,0.131325,0.142473,0.156719,0.145504,0.1401,0.156798,0.178706,0.183124,0.153658,0.139672,0.159134,0.167649,0.180079,0.17128,0.147488,0.150096,0.151417,0.152812,0.172405,0.170713,0.149818,0.145857,0.145888,0.147494,0.150422,0.140873
0.234514,0.211324,0.17507,0.176252,0.188741,0.173955,0.167052,0.193779,0.22751,0.231053,0.195771,0.185093,0.210361,0.219285,0.233647,0.213201,0.180849,0.189473,0.19803,0.202788,0.224482,0.222046,0.190456,0.185107,0.189184,0.188482,0.184868,0.171112
0.293225,0.271242,0.226049,0.214546,0.220704,0.196574,0.182683,0.215503,0.258202,0.265976,0.23882,0.227408,0.242795,0.252362,0.264053,0.233344,0.203751,0.219993,0.233091,0.239952,0.261618,0.262588,0.224006,0.212666,0.216669,0.213339,0.204399,0.186123
0.314826,0.30038,0.260929,0.240352,0.233444,0.198969,0.178352,0.20585,0.249782,0.271333,0.259124,0.237478,0.238527,0.254922,0.26306,0.223826,0.199918,0.222847,0.232031,0.23602,0.260279,0.272943,0.24341,0.221637,0.210918,0.203916,0.19821,0.183266
0.287632,0.281124,0.26242,0.252375,0.229387,0.182781,0.157739,0.165105,0.201818,0.245363,0.248666,0.222315,0.222728,0.248243,0.252891,0.204169,0.18268,0.213057,0.211923,0.205222,0.238669,0.263252,0.241893,0.210476,0.185291,0.179894,0.185196,0.176066
0.239629,0.233094,0.238465,0.254929,0.226092,0.168819,0.140958,0.131898,0.153482,0.197704,0.212662,0.208127,0.226532,0.247779,0.238226,0.193726,0.181865,0.211692,0.208128,0.192088,0.218438,0.239728,0.226882,0.202267,0.175887,0.173366,0.182773,0.177991
0.207713,0.205343,0.221965,0.248933,0.225415,0.170924,0.144276,0.14188,0.157164,0.176083,0.186294,0.20825,0.244782,0.241216,0.206889,0.191276,0.200465,0.218899,0.225373,0.207997,0.205786,0.216579,0.223491,0.212781,0.185782,0.183754,0.196392,0.195833
0.205221,0.222213,0.23436,0.257432,0.249029,0.195786,0.165348,0.180659,0.197382,0.196261,0.195263,0.229888,0.265298,0.228734,0.187378,0.201644,0.217152,0.218031,0.237794,0.231065,0.210664,0.223378,0.247339,0.233689,0.205603,0.204496,0.213444,0.21531
0.212334,0.255918,0.263679,0.265723,0.26921,0.229537,0.20773,0.23435,0.240185,0.226731,0.212684,0.245652,0.282724,0.228384,0.193243,0.22549,0.231439,0.219866,0.24934,0.247162,0.219116,0.243301,0.28314,0.265532,0.230131,0.219863,0.219856,0.229122
0.225781,0.271229,0.276572,0.25873,0.264271,0.249761,0.245944,0.270013,0.257625,0.24336,0.217181,0.240494,0.290446,0.239274,0.203027,0.235865,0.234714,0.223088,0.256246,0.253476,0.229089,0.251899,0.293125,0.285957,0.24654,0.225692,0.215942,0.226435
0.249646,0.269579,0.264901,0.241117,0.23164,0.238707,0.252558,0.254719,0.228502,0.22934,0.209895,0.230071,0.28266,0.242766,0.202925,0.215825,0.214609,0.218342,0.249102,0.239902,0.222455,0.246018,0.276174,0.280814,0.249444,0.222172,0.212555,0.212779
0.266385,0.263884,0.251442,0.232461,0.202882,0.217627,0.234787,0.199631,0.167426,0.194269,0.207724,0.238046,0.273707,0.232286,0.190893,0.181221,0.184797,0.21029,0.237547,0.22209,0.210071,0.240994,0.249743,0.259039,0.25593,0.223376,0.20947,0.197631
0.266676,0.267681,0.245463,0.223743,0.195824,0.21003,0.211398,0.162194,0.140022,0.179951,0.212793,0.255038,0.282395,0.225776,0.176796,0.16049,0.161627,0.19659,0.23179,0.214212,0.207389,0.257896,0.248017,0.231005,0.249371,0.234978,0.214974,0.18744
0.247278,0.246434,0.233268,0.211034,0.190961,0.202913,0.190118,0.158274,0.158883,0.187236,0.208534,0.24182,0.271015,0.226769,0.182126,0.175655,0.166172,0.182348,0.220628,0.209968,0.212942,0.272052,0.249182,0.205092,0.231189,0.239797,0.227976,0.206217
0.202031,0.199739,0.218456,0.202282,0.169457,0.172378,0.172132,0.167403,0.17447,0.186556,0.191607,0.200357,0.231049,0.215751,0.182533,0.188285,0.174753,0.170779,0.202965,0.199847,0.207897,0.258514,0.243595,0.204904,0.216112,0.225577,0.225506,0.216161
0.157835,0.17493,0.209518,0.188446,0.144407,0.143671,0.159092,0.163886,0.164393,0.170573,0.181605,0.176238,0.18005,0.17269,0.155046,0.168479,0.157948,0.153717,0.179898,0.176772,0.186039,0.219352,0.212481,0.203321,0.19793,0.188938,0.19007,0.185958
0.146484,0.163069,0.182492,0.166401,0.132609,0.135959,0.151149,0.141982,0.125111,0.126577,0.156408,0.150499,0.123108,0.119493,0.12142,0.130171,0.119492,0.129744,0.153066,0.14259,0.153273,0.173207,0.168115,0.17839,0.167288,0.150187,0.140893,0.129859
0.149965,0.14763,0.154351,0.140179,0.118524,0.129295,0.138916,0.126257,0.099902,0.089181,0.119051,0.110285,0.079517,0.084116,0.10049,0.10521,0.099067,0.125746,0.13731,0.117491,0.128763,0.153865,0.147564,0.141556,0.133914,0.129447,0.126574,0.104233
0.151763,0.13834,0.141032,0.119836,0.101541,0.114278,0.121181,0.120538,0.104505,0.085907,0.095966,0.081275,0.054374,0.065581,0.098417,0.103494,0.099585,0.140013,0.14054,0.10861,0.121346,0.152971,0.142558,0.106196,0.095192,0.10867,0.123141,0.10089
0.142989,0.126641,0.124901,0.098715,0.07988,0.098187,0.099037,0.100866,0.106321,0.094088,0.096618,0.081105,0.049134,0.059695,0.099207,0.105337,0.104025,0.141664,0.136182,0.101012,0.107166,0.138055,0.141771,0.100979,0.083353,0.101699,0.120847,0.101431
0.134656,0.124655,0.106595,0.082225,0.069978,0.098288,0.092962,0.082072,0.099555,0.098424,0.10186,0.092448,0.064719,0.078623,0.108499,0.104632,0.098422,0.121124,0.11882,0.092124,0.093304,0.123114,0.140013,0.111544,0.093554,0.106177,0.11134,0.089671
0.125046,0.131209,0.094276,0.07577,0.07753,0.105344,0.097357,0.081892,0.103514,0.104336,0.111964,0.111712,0.086984,0.104806,0.124564,0.106257,0.084131,0.091906,0.099518,0.089464,0.095167,0.125269,0.140972,0.113811,0.101683,0.105141,0.091832,0.073722
0.107796,0.127208,0.081734,0.070087,0.082854,0.107379,0.102757,0.083088,0.100068,0.1028,0.118619,0.12709,0.101407,0.118203,0.130931,0.102122,0.067001,0.061027,0.076451,0.086474,0.100324,0.132728,0.133293,0.103508,0.105264,0.099516,0.076862,0.070039
0.086385,0.114745,0.075102,0.061671,0.076798,0.099453,0.099029,0.072581,0.077675,0.08895,0.110761,0.117779,0.094898,0.106805,0.118026,0.091745,0.05481,0.048253,0.070234,0.08175,0.091571,0.134505,0.129293,0.092498,0.10442,0.099917,0.076167,0.074375
0.077549,0.103245,0.075406,0.058087,0.064845,0.084171,0.083977,0.056624,0.050559,0.064459,0.08333,0.084591,0.072952,0.080489,0.083869,0.066975,0.044588,0.048484,0.071504,0.072419,0.068917,0.115602,0.121286,0.086203,0.096183,0.095514,0.071226,0.073234
0.077721,0.095632,0.071148,0.055844,0.059335,0.07023,0.065556,0.053685,0.048616,0.050859,0.053679,0.056448,0.057628,0.060066,0.051286,0.042715,0.040059,0.046377,0.062078,0.068187,0.057203,0.083571,0.096242,0.078769,0.088123,0.081527,0.057211,0.064738
0.072637,0.081049,0.05707,0.04672,0.051066,0.057589,0.055441,0.054706,0.052469,0.048487,0.049615,0.054413,0.05259,0.057124,0.045798,0.033899,0.038418,0.038997,0.043455,0.065182,0.062486,0.057937,0.06139,0.062396,0.070584,0.058524,0.041497,0.053947
0.064784,0.070465,0.045292,0.030681,0.036708,0.049593,0.054743,0.051214,0.046914,0.043612,0.053604,0.062187,0.056825,0.058079,0.044375,0.030473,0.036386,0.031856,0.032394,0.063518,0.065644,0.038384,0.03549,0.045653,0.046968,0.038374,0.029702,0.040352
0.05082,0.058146,0.038192,0.018671,0.027412,0.048809,0.051827,0.039015,0.034793,0.036391,0.050482,0.061986,0.056454,0.05105,0.036975,0.027221,0.034886,0.031026,0.034494,0.064916,0.061533,0.029897,0.024052,0.038714,0.040731,0.036145,0.02682,0.026256
0.038686,0.04464,0.036844,0.017682,0.022997,0.044297,0.042494,0.028368,0.026302,0.030215,0.040482,0.049481,0.046823,0.039503,0.028058,0.02409,0.031209,0.028015,0.0352,0.058268,0.049875,0.025041,0.019417,0.037455,0.046957,0.040333,0.02803,0.01671
0.037955,0.040665,0.036826,0.017945,0.017981,0.033223,0.03308,0.023986,0.020022,0.02147,0.027158,0.032154,0.037463,0.040307,0.027666,0.023353,0.024474,0.024692,0.033953,0.043651,0.035964,0.02284,0.022294,0.041962,0.049609,0.039033,0.029926,0.014511
