-0.000447,-0.000205,-0.000187,-0.000212,-0.000275,-0.000191,-0.000236,-0.000155,-0.000198,-0.000101,-0.000233,-1e-06,-7.1e-05,0.000118,-5.7e-05,-7.5e-05,-4.8e-05,-0.000245,-0.000168,-8.2e-05,-8.9e-05,-9.6e-05,-5.5e-05,-4.1e-05,-5.2e-05,-3.2e-05,0.00015,6e-06,-3e-05,-0.000293,-0.00028,-0.007584,-0.007655,-0.004438,-0.001824,-0.000704,-0.001627,-0.002085,-0.001937,-0.001652,-0.005156,-0.003772,-0.003708,-0.003377,-0.002121,0.001694,-0.028739,-0.009211,-0.007268,-0.010567,-0.013908,-0.00893,-0.01568,-0.012693,-0.019995,-0.010776,-0.01698,-0.011573,-0.01797,-0.012257,-0.018029,-0.017443,-0.015932,-0.010584,-0.017368,-0.007059,-0.010214,-0.007676,-0.012465,-0.014454,-0.014315,-0.010593,-0.012296,-0.010781,-0.012561,-0.008492,-0.004825,-0.003073,-0.004431,-0.001269,-0.004575,-0.001695,-0.000821,-0.003451,-0.003768,-0.00232,-0.003198,-0.00216,-0.001339,-0.001207,-0.000782,0.000349,0.000169,-0.004813,-0.001745,0.000554,-0.00025,0.001353,-0.004604,-0.004009,0.005137,0.000784,-0.001536,-0.003065,-0.001346,-0.024436,-0.018258,-0.009456,-0.002783,-0.004263,-0.002705,-0.000705,-0.000435,-0.001819,-0.001003,-0.000484,-0.000164,-0.000126,-0.001071,-0.001097,-0.001003
8.3e-05,-8.7e-05,2.2e-05,0.000105,0.000111,-0.00013,-3.9e-05,-5.2e-05,-5.6e-05,-2.3e-05,5.1e-05,2.3e-05,2.2e-05,1.7e-05,-5.8e-05,1.6e-05,-7e-06,3.9e-05,-6e-06,7e-06,5.6e-05,3.8e-05,-6e-05,0.000139,0.00012,1e-05,9.8e-05,7e-06,2.6e-05,8.9e-05,4.4e-05,-0.000294,0.001011,0.000742,0.000368,7.3e-05,0.000159,0.000619,0.000956,0.00063,0.000686,0.000896,-0.001214,0.000727,0.001823,0.000251,0.018428,0.008378,0.001213,2.7e-05,0.001071,-0.004138,0.00367,-0.00015,-0.000826,-0.001457,-0.000519,-0.001464,-0.002984,6e-04,-0.001369,0.005033,0.000169,-0.00282,-0.00168,-0.002691,-0.002538,-0.00656,-0.00132,0.000921,0.000191,-0.004237,-0.001036,0.000403,-0.001627,-0.000352,5.6e-05,-0.002628,-0.005787,-0.00089,-0.001424,-0.000181,-0.001923,0.001012,6.9e-05,0.000315,0.000873,-0.000751,-0.000815,-0.000678,-0.001606,-0.000677,-0.000124,0.000755,-0.004436,-0.00276,-0.003244,-0.000867,-0.001963,-0.000558,-0.003802,-0.002616,0.000497,0.002695,0.001423,-0.002669,-0.00185,-0.001118,-0.001538,0.000877,0.000995,0.000547,-0.000306,1.4e-05,0.00012,2.9e-05,0.000115,0.000259,0.000997,0.000754,0.000112
-0.000192,-0.000132,-0.000118,-0.000175,-0.000151,6.8e-05,1.8e-05,-0.000186,-1e-04,-0.000103,-0.000143,-0.000162,-6.2e-05,-5.5e-05,4e-06,3e-05,-2.4e-05,-8.2e-05,6.8e-05,-5.6e-05,-0.00013,-0.000272,-0.000102,-0.000244,-9.2e-05,-8.7e-05,5e-06,-8.6e-05,-7.9e-05,-0.000156,-0.000167,4e-06,-0.000372,-3e-04,-0.000229,-7.6e-05,-0.000155,-4.9e-05,-0.000702,-0.000406,-2.9e-05,-8e-05,-0.000824,-0.001304,-0.000178,-0.002762,-0.013812,-0.014028,-0.007716,-0.001809,-0.001007,-0.004014,-9.5e-05,-0.000523,-0.000498,-0.001265,-0.004741,-0.004753,-0.001774,0.003465,-0.000244,-0.004466,-0.005721,-0.002958,0.004488,0.003704,-0.001708,-0.00249,0.003983,-0.003123,-0.000871,-0.00469,-0.004506,-0.002714,-0.002335,-0.002633,-0.000567,0.00114,0.00242,-0.000582,-0.001047,0.00014,-0.002726,-0.000872,-0.000697,-0.000432,-0.001374,-7e-04,-0.000229,0.000151,0.000182,-0.000844,-0.000378,-0.000341,-0.002695,-0.00117,-0.000965,1e-05,0.002028,0.000439,-0.001862,-0.00629,-0.006085,-0.004482,-0.001344,0.001832,-0.000859,4.6e-05,0.001444,3.9e-05,-0.000217,-0.000108,-0.000875,-0.000827,-0.000508,-0.000214,0.000137,-7.1e-05,-0.00055,-0.000687,0.000154
4.1e-05,3.2e-05,-2.9e-05,5.3e-05,-4.8e-05,-7.6e-05,-4.6e-05,4.7e-05,2.9e-05,2.8e-05,5.4e-05,-1.3e-05,-1.9e-05,-0.000198,-2e-05,3.9e-05,-1.1e-05,6e-05,-9e-06,2.5e-05,3e-06,-3.3e-05,3.1e-05,-5e-06,-3.7e-05,-0.000128,-9.9e-05,-0.000117,-1.9e-05,9.1e-05,1e-06,-8.3e-05,-0.001277,-0.000154,0.000216,-7e-05,4.9e-05,0.000383,0.000604,0.000487,0.000613,3.1e-05,0.00029,0.000932,0.00115,0.00113,0.00308,0.007431,0.003436,-0.000452,-0.000548,0.000656,-0.000823,0.003435,0.00144,-0.002981,0.001758,0.001267,-0.001236,-0.00475,-0.001665,-0.000805,0.001876,0.005781,-0.004657,-0.000104,-0.000846,0.002045,-0.00231,0.002708,0.001632,0.003564,0.001429,0.000152,-0.000916,-0.002641,-0.001109,-0.000535,0.002839,0.001171,-1.7e-05,-0.000866,0.000334,-0.000641,0.001318,0.000896,-7e-05,-0.000407,-0.000425,-0.00083,0.00033,-0.000617,-0.001124,-0.00071,0.000695,0.001652,0.002145,0.001182,-0.004278,-0.001618,-0.002136,0.001149,-0.001105,-0.000698,0.00015,0.001632,0.001135,0.000549,-0.001409,0.001246,0.000952,0.000245,3.6e-05,0.000734,0.000395,4.1e-05,-5.1e-05,-0.000103,-0.000325,0.000102,-0.000129
-9.8e-05,-2.5e-05,6.7e-05,-1.1e-05,3.3e-05,-0.00012,-0.000231,4.4e-05,-9.2e-05,8e-05,-2e-05,0,0.000125,1.5e-05,-1.6e-05,-1.7e-05,-4.4e-05,1e-05,4.9e-05,5e-06,2e-06,-8.4e-05,0,-3.7e-05,5.1e-05,8e-06,6e-05,-5e-05,3.1e-05,2.6e-05,0.000111,-5.5e-05,0.001568,6.9e-05,-0.000342,-0.000117,0.000263,-0.000207,-0.000418,-0.000218,-1.4e-05,0.00022,-0.00034,-4.2e-05,8.9e-05,-0.000181,-0.004713,-0.006644,-0.00996,-0.004087,0.002589,0.00259,-0.000155,-0.000835,0.00246,0.00459,0.001163,-0.000408,0.001363,0.004185,0.002882,0.000767,0.000804,-0.002386,0.002115,-0.003,-0.003184,0.000582,-0.001434,-0.00195,2.8e-05,0.001794,0.002318,-0.001484,-0.001022,0.001585,0.000458,0.000616,-0.001919,-0.001002,-0.000444,0.000357,0.000513,0.00079,-0.000443,-0.000189,-0.001377,-0.000667,0.000419,4.7e-05,3.5e-05,-0.000416,-0.000809,-2.4e-05,0.000511,-0.003809,-0.001428,0.000288,-0.00087,0.001305,-0.002224,-0.002662,-0.000532,-0.000267,0.00033,0.001762,0.001872,0.000578,-0.000709,-0.001749,-0.000838,-0.000419,0.000115,-9.4e-05,-8e-05,-5.7e-05,-3.2e-05,-0.000117,2.6e-05,-0.000284,-0.000233
7.4e-05,5.8e-05,9.5e-05,8e-06,-2.3e-05,-0.000108,6.9e-05,-6e-06,0.000141,-5.1e-05,-7e-06,-7.8e-05,-3.8e-05,5e-05,-8.8e-05,-0.000101,-7.4e-05,-5.1e-05,-4.3e-05,-2.5e-05,-3e-05,2.5e-05,-8.7e-05,3.8e-05,-2.8e-05,0.000132,3.1e-05,3.4e-05,-3.1e-05,1.8e-05,8.9e-05,7.1e-05,-0.000359,-6.3e-05,0.00029,0.000242,-0.000197,-0.000279,0.000147,-7.9e-05,0.00017,-0.000134,-0.000235,-0.000111,0.000509,0.000737,0.001778,0.00625,-1e-05,-0.002953,-0.002057,-0.000256,-0.00072,-0.000909,-0.000128,-0.005415,-0.000833,0.00166,0.001075,0.000758,-0.0026,-0.000469,-0.00216,-0.000435,0.002205,-0.000954,-0.001898,0.000211,0.000542,0.003556,-0.002105,0.001454,0.000773,0.003517,0.002861,0.002569,0.000365,0.000106,-0.000354,-0.001159,0.001663,-0.000569,9.7e-05,0.000761,0.000489,0.00113,0.000475,0.000969,-0.00033,0.000624,0.000124,0.000603,0.000211,0.000137,0.000677,6e-06,-0.000749,-0.000618,0.001646,-0.002241,-0.000193,-0.003998,-0.000317,-0.000453,0.000419,-0.000541,-0.001257,-5.7e-05,0.000174,-4.6e-05,0.000407,3.5e-05,7.6e-05,0.000199,0.000115,8.8e-05,3.7e-05,-8.5e-05,-3.6e-05,-0.000294,-2e-05
-1.6e-05,6.3e-05,8e-06,3.3e-05,2.5e-05,2.4e-05,3e-06,-8.4e-05,7e-06,1.7e-05,-7e-06,-7e-06,-2e-06,-2.2e-05,-0.00012,-5.5e-05,-6.8e-05,-4.3e-05,7.9e-05,-2.6e-05,-0.000126,7.1e-05,-2.4e-05,-2.2e-05,-0.00015,-8.4e-05,-7.8e-05,-1.9e-05,-9.7e-05,-6.2e-05,-6.8e-05,-6.3e-05,-0.000349,7.8e-05,-7.2e-05,8.9e-05,-0.000131,-0.000178,-0.000349,1.4e-05,-0.000202,2e-06,0.000147,-0.000152,-0.000458,0.000155,0.002399,-0.003046,-0.000724,-0.003343,-0.000459,4e-06,-0.001083,0.001019,-0.001021,0.001284,0.00031,-0.000363,-0.000757,-0.000527,-0.000607,0.002511,-0.000114,0.001358,0.000269,0.000315,0.001427,-0.001704,-0.000641,-6.7e-05,0.000572,-0.004382,-0.001392,-0.000664,0.000227,-0.000235,0.000195,0.000605,0.000228,0.000913,0.000186,0.000274,0.001097,0.00118,-0.000258,-0.000155,-0.000444,0.000519,0.000263,-0.000221,-7.3e-05,0.000311,0.000401,0.00027,-0.000257,0.001547,0.00119,0.000487,-0.000397,-0.000494,-0.000181,-0.000742,0.002151,-0.000554,-0.000846,-0.000547,-0.000347,-0.000786,-0.000488,9.7e-05,-0.000222,-0.000365,0.000296,-0.000277,-0.000338,-0.000111,-9.6e-05,3e-06,-5.2e-05,0.000379,3.7e-05
2.1e-05,-7.2e-05,-8.9e-05,-6.2e-05,-8.1e-05,-1e-06,-3.7e-05,2.7e-05,-8.1e-05,-7.7e-05,-1.1e-05,-5.3e-05,-6.6e-05,-5e-05,-4.1e-05,1e-06,-3.6e-05,1e-06,-4.9e-05,-1.1e-05,4.7e-05,-1.6e-05,5e-05,-4.3e-05,-6.9e-05,2.4e-05,-2.6e-05,-2.7e-05,-3.6e-05,-4e-05,3e-06,-4e-06,0.000193,3.6e-05,4.7e-05,-0.000102,1e-06,3e-04,0.000397,6.7e-05,8.9e-05,-9.2e-05,-3e-04,-8.1e-05,-8.9e-05,6.7e-05,-0.003126,-0.001477,-0.001161,0.002564,-0.00088,-0.00071,-0.000845,0.000323,-0.000993,0.00131,-0.001036,0.000433,0.000498,0.001202,0.000369,-0.002407,-0.001304,0.001598,0.000445,-0.002914,0.000648,-0.00078,-0.001072,-0.00126,0.000404,0.002297,-0.000779,0.000385,0.000369,9e-05,0.000511,-1.4e-05,0.00053,-0.000977,-0.000454,0.000192,-0.000242,9.4e-05,-0.000334,-0.000176,0.000605,0.000106,-4.5e-05,5.4e-05,0.000235,-0.000503,0.000118,6.6e-05,0.00027,0.00133,0.000705,0.000592,-1.9e-05,-0.00117,-0.000197,-0.000333,-0.003164,-0.001745,0.000276,-0.00033,-0.000149,0.001348,0.000275,-0.000487,-3.5e-05,7.4e-05,0.000312,-1.5e-05,0.000211,-4.5e-05,1.2e-05,-7.2e-05,-0.000187,-0.000467,-0.000274
4.4e-05,-1.8e-05,-1.5e-05,-1.1e-05,-4e-05,2.2e-05,6e-05,-8.6e-05,-3.1e-05,8e-05,3.7e-05,-2.5e-05,1e-06,1.2e-05,-2e-06,-1.1e-05,-1.5e-05,0,5e-06,6e-06,1.8e-05,3e-05,5e-05,1.5e-05,3.1e-05,1.3e-05,-1.9e-05,5e-06,-1.5e-05,-3.9e-05,-1.4e-05,1e-06,-0.00011,-0.000234,-9.2e-05,-8.4e-05,9e-06,-2e-06,-0.000155,2.6e-05,-5.2e-05,0.00013,-4.8e-05,0.000203,-0.000751,0.000451,0.000843,-0.000257,0.000328,-0.000203,-0.000754,0.000369,0.000674,-0.001156,0.000631,-0.000325,0.001666,0.001224,-0.00026,0.001678,-0.00029,-0.000484,0.001093,0.001844,0.000312,0.004044,0.000643,0.002899,0.000599,0.000789,0.000107,-0.00067,0.000259,-0.001501,-0.001893,-0.000581,0.000569,-0.000778,-0.000874,-0.000485,0.000233,-8.4e-05,-0.000123,-0.001109,-0.000328,-0.000412,-6.9e-05,0.000275,-0.000339,-0.000165,0.000256,-0.000117,3.7e-05,3.8e-05,-0.000157,-0.00076,-0.001185,-0.000654,-6.4e-05,0.000906,0.000509,0.000744,0.000821,0.001482,2e-04,6.3e-05,-0.000431,-0.001606,-0.00044,0.000254,3.8e-05,-0.000178,-0.000179,4.6e-05,9.9e-05,6.9e-05,7.1e-05,-2.9e-05,-0.000113,5.1e-05,0.000185
-1.7e-05,2.8e-05,6e-05,2.6e-05,1.8e-05,-1.2e-05,5.7e-05,3.5e-05,1.1e-05,4e-06,-4.2e-05,3.3e-05,-2.4e-05,5.9e-05,8.9e-05,-5e-06,7e-06,-8e-06,-6e-06,-4.7e-05,3e-05,3e-06,1.9e-05,6.1e-05,1e-05,2.2e-05,5.3e-05,-1e-06,2.8e-05,6.1e-05,2.8e-05,-7.1e-05,-0.000129,0.000193,0.000117,4.4e-05,1.8e-05,-1.7e-05,2e-04,-5.9e-05,-4.3e-05,-5.4e-05,-0.000137,-0.000338,-0.000272,0.000874,-0.000588,-0.001856,-0.001271,-0.001091,-0.000628,-0.002136,-9e-06,-6.3e-05,-0.001375,-0.001418,-0.002062,-0.001012,0.000791,-0.001638,0.000586,-0.001484,1e-06,-0.003587,-0.001626,-0.004203,-0.000936,-0.00029,0.001678,-0.000178,-2.7e-05,-0.000668,0.000882,0.000158,0.000842,-0.000165,-0.000588,-0.000155,-0.000818,0.000368,-0.001147,0.000186,-0.000167,-0.001171,0.000198,0.001138,-0.000115,-0.000816,3.6e-05,0.000142,-0.000236,0.000317,6.5e-05,-0.000283,-0.000211,-0.000606,0,-0.000358,0.000367,0.001308,-0.000822,0.000716,0.001638,0.000153,0.000767,-0.000155,0.000179,0.00134,-2.4e-05,-0.000138,-0.000139,-0.000215,-5.8e-05,6.8e-05,2.1e-05,0.000119,-7.5e-05,6e-06,2.8e-05,0.000119,4.7e-05
-1e-05,-1.9e-05,-1.8e-05,-2e-06,2.4e-05,-7e-06,2.5e-05,1.9e-05,3.3e-05,2.8e-05,7e-06,1e-05,-3e-06,2.8e-05,1.1e-05,2e-05,6e-05,2.4e-05,3e-05,2.7e-05,-8e-06,-2e-06,-2e-06,1.1e-05,4.1e-05,9e-06,5.7e-05,2.6e-05,3.3e-05,1.7e-05,-7e-06,4.9e-05,2.7e-05,-0.000345,-0.000371,-0.000105,5.2e-05,1.5e-05,-0.00022,6.3e-05,0.00019,8.6e-05,0.000508,0.000235,-0.000405,-0.000239,-0.000147,-0.000101,-0.000128,0.000924,-0.001157,0.001439,-0.000405,-0.00022,-0.000591,6.1e-05,0.002152,-0.000945,-0.001025,-0.001065,-0.000801,0.000657,0.00125,0.001149,-9.7e-05,0.001129,-0.000818,-0.001728,0.000222,-0.001195,-0.000547,5.3e-05,-0.001262,-0.000264,-0.00058,-1e-04,0.000104,0.000568,0.000371,0.00049,0.000307,-0.000318,-0.000364,0.000753,0.000313,-0.000537,-6.2e-05,0.000406,0.000104,0.00012,-0.000273,-0.000265,-0.000109,-0.000351,0.000297,-0.000209,0.000497,0.000566,-8.3e-05,-0.000459,0.001414,0.00015,-0.001568,-0.000699,-0.000204,0.000147,0.000405,-0.000617,-3.8e-05,-3.3e-05,-0.000433,2.7e-05,0.000123,8.8e-05,4.8e-05,-6.8e-05,5.1e-05,2.5e-05,-7.7e-05,-6.5e-05,8.1e-05
-6e-06,-2e-06,4.6e-05,-2e-05,-8e-06,-1.3e-05,-2.5e-05,9e-06,-2e-06,1e-05,1e-06,1e-06,-8e-06,-5e-06,-3.9e-05,1.2e-05,-2.9e-05,-1.4e-05,-3e-05,-2e-05,-1.1e-05,1.4e-05,-5e-06,-2e-05,1.5e-05,-1.3e-05,-2.2e-05,-9e-06,-5e-06,3e-06,4e-06,6e-06,5.8e-05,0.000187,6.7e-05,9.5e-05,5.4e-05,-3.4e-05,-2.8e-05,-9e-05,-0.000162,-6.8e-05,-0.000265,-2.5e-05,0.000362,9.9e-05,0.001042,0.00085,-0.000949,0.000635,-0.001095,-0.000162,0.000602,0.000141,-0.000255,-0.000722,-0.002131,-0.000862,0.00105,0.000485,-4.4e-05,0.00069,-0.00171,-0.000535,-0.001282,-0.000223,0.000102,0.001048,-0.001034,0.000146,0.000321,-0.000896,0.000757,0.001173,0.000391,-1e-06,-0.000466,-0.000964,-0.000396,-0.000562,0.000481,-0.000653,0.000303,0.000299,-0.000571,-9.6e-05,0.000223,-0.000293,0.000399,6e-05,-0.000184,-3.6e-05,0.000207,0.00014,4.9e-05,0.00046,-0.000197,0.000354,-0.000241,-0.000253,-0.000495,2.5e-05,0.000363,0.000542,-3e-06,-8e-05,0.000121,0.000568,0.00079,0.000127,0,2e-06,-8.6e-05,1.7e-05,5.5e-05,5.7e-05,-1.5e-05,-7e-06,6e-06,-1.7e-05,-0.000122
-8e-06,-1e-06,-2.7e-05,6e-06,-1.9e-05,6e-06,-4e-06,1.5e-05,-2.4e-05,-5e-05,-7e-06,-1.7e-05,1.5e-05,0,0,-2e-06,-8e-06,4e-06,-2.3e-05,5e-06,1e-06,-3.5e-05,-2.8e-05,-3.4e-05,-2.4e-05,-2.5e-05,1.3e-05,-8e-06,-3e-06,2e-05,-1.6e-05,-3.3e-05,-8.2e-05,-8e-05,0.000279,-3.5e-05,-7.9e-05,4.6e-05,0.000106,-7e-05,1e-04,2.1e-05,-0.000277,-2.7e-05,0.000144,3.2e-05,-0.000907,-0.000319,0.000948,-0.00012,0.001178,-0.000361,-0.000602,-0.000153,0.001049,0.001062,-8e-06,5.6e-05,-0.000499,-0.000173,0.000208,-0.001389,0.000468,0.000375,-0.000393,-0.000259,0.000937,-0.001135,-5.7e-05,0.000224,-0.00046,0.000941,-3.5e-05,0.000333,-0.000262,0.000227,-3.3e-05,0.000382,0.000374,0.000176,-0.000256,0.000437,-0.000239,-0.000333,-0.000138,-0.000321,-9.4e-05,3e-05,8.4e-05,-1.3e-05,2.6e-05,8e-06,5e-05,7.4e-05,5.8e-05,0.000263,-0.000273,-9.2e-05,0.000339,9.1e-05,0.000732,-0.000372,0.000404,0.000496,0.000491,-5.7e-05,0.000101,-0.000427,-0.000741,-0.000145,9.4e-05,-0.000259,-0.000107,-5.8e-05,-1.6e-05,-0.000158,-8e-06,-4e-06,1.3e-05,2.2e-05,-3.9e-05
8e-06,1.3e-05,-1.1e-05,2e-06,6e-06,3.5e-05,-1e-06,2.3e-05,6e-06,-8e-06,-1.6e-05,0,-1.3e-05,-5e-06,-2.9e-05,-9e-06,7e-06,-5e-06,0,-1.2e-05,1e-06,-2e-06,1.3e-05,1.7e-05,-2e-06,-2e-05,-8e-06,-5e-06,-9e-06,1e-05,-2e-05,8e-06,4.8e-05,6.1e-05,-9.4e-05,-3e-05,-3.7e-05,2e-06,-4e-05,8.6e-05,-8.4e-05,-3e-06,0.000234,-2.6e-05,0.000116,-0.000186,0.000338,3.8e-05,0.000126,-0.001299,3e-04,-0.000182,-0.000414,0.000159,-0.000225,-6.5e-05,0.000688,0.000967,0.000273,-9.2e-05,-0.000546,0.000784,-0.000506,-0.000863,0.000349,0.00086,-0.000528,0.000398,0.000906,-0.000185,-0.000252,0.000103,0.000117,-0.000756,0.000277,-3.8e-05,0.000263,-0.000231,0.000374,0.000143,-0.000313,-1.9e-05,0.00024,0.000275,0.000181,0.000287,1.7e-05,-0.000144,-7.6e-05,-5.6e-05,-4e-06,8.1e-05,-4.7e-05,-1.4e-05,-7e-05,-0.000197,0.000363,-0.000154,0.000295,-0.000264,-0.000612,0.00017,-0.000591,-0.000461,0.000224,-0.000119,-0.000325,-4.5e-05,-0.000522,-1e-06,-5e-06,-2.3e-05,-3e-05,-1.7e-05,-3.5e-05,7.2e-05,-1.3e-05,-2.9e-05,1.5e-05,1e-06,-7.4e-05
1.6e-05,-1e-06,-1.5e-05,-1.3e-05,0,1e-06,8e-06,-1.5e-05,5e-06,7e-06,6e-06,0,1.8e-05,-5e-06,1e-05,-2e-06,5e-06,1.7e-05,-4e-06,-1e-06,8e-06,0,1e-06,-6e-06,-1.8e-05,1e-06,-7e-06,1e-06,-1.1e-05,2.3e-05,4e-06,-1e-06,1.8e-05,-3.8e-05,2.1e-05,4.1e-05,2.6e-05,-2.4e-05,3.5e-05,-2e-06,7.4e-05,1.5e-05,-3.4e-05,1.1e-05,0.000112,-0.000344,0.000422,-0.000212,-0.000555,0.000502,0.000255,-0.000324,-0.000283,0.00019,-0.000233,-0.000132,-3e-06,-0.000201,-0.000395,-3.4e-05,0.000171,6.6e-05,-0.000192,0.000888,-9.3e-05,-0.000831,0.000113,0.000109,1.1e-05,9.2e-05,8.3e-05,0.000283,0.000293,-0.000538,-0.000279,-0.000176,-0.000332,0.000107,-0.000169,0.000228,0.00018,-7.8e-05,-0.000151,6.6e-05,0.000212,-0.000104,0.000213,-0.000125,-0.000388,-3.6e-05,-7e-06,0.000134,-0.000125,3e-05,-7.2e-05,-0.000178,-5e-04,-0.000259,-0.000315,7.5e-05,-0.000473,2.1e-05,0.00026,-0.000109,-3e-06,0.000254,-0.000229,-0.000292,0.000602,-2.8e-05,7.4e-05,4.4e-05,-0.000218,-6.2e-05,-1.5e-05,2.2e-05,4e-05,6e-06,-2e-06,3.7e-05,6e-05
-1.2e-05,-1.3e-05,1.5e-05,6e-06,-9e-06,-5e-06,6e-06,-4e-06,-9e-06,-5e-06,1e-06,6e-06,-3e-06,-9e-06,5e-06,-3e-06,1e-06,-1.4e-05,-1.2e-05,7e-06,2e-06,-1.3e-05,3e-06,-1e-06,1.1e-05,-7e-06,-1e-05,-9e-06,-2e-06,-4e-06,4e-06,2e-06,-3.2e-05,7.2e-05,-5.5e-05,6e-06,4e-06,0,-5.4e-05,-2.4e-05,-4e-06,3e-06,-6.2e-05,6.5e-05,-0.000143,8.7e-05,-0.000238,0.000214,-0.000104,-0.000362,-0.000267,0.000795,-0.000114,-0.000178,0.000564,6.6e-05,2.8e-05,-9.3e-05,-0.000145,7e-05,-0.000294,0.000781,0.000487,-0.001252,0.000228,0.000695,-0.000199,-0.000485,-0.000148,0.000157,0.000413,7.2e-05,-0.00031,0.000236,5.1e-05,0.000128,0.000185,0.000207,-1.9e-05,0.000172,-1e-06,0.000289,1.1e-05,-4.5e-05,9.2e-05,4.1e-05,-4.9e-05,0.000133,0.00013,-2.2e-05,7.3e-05,-6e-05,1.5e-05,4.4e-05,-4.7e-05,-0.000191,0.000298,-0.000111,2.3e-05,0.00022,0.000569,0.00013,8.8e-05,0.000162,-0.000722,-0.000437,-9.6e-05,-0.000219,0.000748,0.000101,-8e-06,-0.000167,7.5e-05,-3.6e-05,-1.9e-05,-3.5e-05,-9e-06,8e-06,7e-06,-2.9e-05,8e-06
0,1.4e-05,-1.8e-05,-4e-06,5e-06,-1.2e-05,-7e-06,-5e-06,1e-06,3e-06,-8e-06,-9e-06,0,-4e-06,-1e-06,1e-06,-5e-06,1e-06,8e-06,-2e-06,9e-06,1e-06,-4e-06,1e-06,-9e-06,5e-06,3e-06,2e-06,9e-06,-9e-06,5e-06,3e-06,9e-06,-7.6e-05,-2.9e-05,0,2e-05,0,2e-05,-2e-06,-2.4e-05,1e-06,7.6e-05,-6.8e-05,0.000105,-0.000163,0.000478,-0.00028,8.5e-05,0.000619,0.000213,-9.5e-05,0.000478,6.5e-05,0.000158,5e-05,-0.00034,0.000364,0.000205,5.8e-05,-0.000159,-5.3e-05,-4.6e-05,0.000603,0.000202,-0.000394,-0.000374,0.000222,-0.000505,3.7e-05,-7e-06,-0.000144,0.00016,0.000332,-7.8e-05,4.1e-05,-0.000113,-0.00012,-7.9e-05,-0.000103,1.9e-05,-5.4e-05,5.8e-05,0.000146,-3.4e-05,-5.4e-05,-7.2e-05,1.4e-05,-7e-06,4.5e-05,-2e-06,-6.2e-05,8.7e-05,1.9e-05,-5.1e-05,0.000263,0.000149,-4e-05,0.000227,8.6e-05,-0.000296,-0.000149,-0.000211,4.1e-05,-0.000566,0.000163,0.000123,0.000147,-0.000933,-0.000118,3.4e-05,9.2e-05,-5.6e-05,1e-05,2e-05,-5e-06,-2.9e-05,-1.4e-05,5e-06,-3e-06,2.6e-05
2e-06,-5e-06,1.2e-05,1e-06,0,4e-06,5e-06,-1.1e-05,-1e-06,4e-06,4e-06,0,-1e-05,5e-06,2e-06,1e-06,3e-06,3e-06,4e-06,1e-06,-5e-06,0,-4e-06,1e-06,9e-06,-2e-06,1e-06,-1e-06,3e-06,-1e-06,4e-06,-2e-06,8e-06,7.4e-05,5.9e-05,-1.4e-05,1e-05,8e-06,-8e-06,2.8e-05,-2.1e-05,0,-4.5e-05,2e-06,-0.000209,2.6e-05,-0.000319,4.7e-05,-0.000277,0.000342,-0.000369,0.000358,-0.00025,0.000222,-0.000351,0.000162,7.8e-05,-0.000298,2.3e-05,3.1e-05,0.000401,-0.000329,0.000194,0.000216,1e-05,-8e-05,0.000408,0.000242,0.000226,-0.000138,-0.000101,0.000267,2.5e-05,-0.00015,0.000116,5.7e-05,0.000266,1.9e-05,-6.1e-05,-5.8e-05,-7e-06,-0.000167,-3e-05,-0.000147,-8.5e-05,0.000104,5e-05,1e-06,-6e-05,-7e-06,4.2e-05,4.5e-05,-4.1e-05,-1.1e-05,-6e-06,9.2e-05,-0.000254,0.000133,3.6e-05,-1e-05,0.000223,4.2e-05,0.00042,-7.6e-05,-0.00011,-6.7e-05,0.000162,-0.00017,0.000111,-3.2e-05,-2e-06,-7e-06,-1e-05,2.3e-05,4.4e-05,-1.7e-05,5e-06,4e-06,4e-06,8e-06,-3.3e-05
-6e-06,-2e-06,0,2e-06,0,8e-06,-6e-06,5e-06,7e-06,-7e-06,3e-06,5e-06,6e-06,-1e-06,-1e-05,4e-06,3e-06,-3e-06,4e-06,-4e-06,-1e-06,-6e-06,-1e-06,-2e-06,5e-06,-1e-06,-2e-06,-1e-06,2e-06,-4e-06,6e-06,2e-06,-1e-05,-3.5e-05,1.5e-05,-7e-06,-4e-06,7e-06,2.7e-05,-3.6e-05,1.1e-05,-2e-06,1.2e-05,3.6e-05,-7.2e-05,0,0.000108,2e-06,0.000274,-0.000478,-0.000153,-5e-05,2.9e-05,-0.000239,2.4e-05,0.000125,0.000286,0.000305,0.000132,0.000171,-0.000257,0.000407,-0.000155,-0.000105,0.000217,0.000236,-9.2e-05,3.3e-05,-0.000161,-0.000251,9.4e-05,-0.000276,7.7e-05,-0.000193,1.2e-05,-0.000149,-5e-05,-6.8e-05,3.6e-05,6.4e-05,1.5e-05,0.000101,-4.5e-05,-0.000163,-5.4e-05,-0.000138,2.4e-05,-5e-06,4.7e-05,2.2e-05,1.8e-05,7.1e-05,-3.1e-05,-1.4e-05,-3.8e-05,-9.6e-05,0.000101,-4.4e-05,-0.000109,-0.000191,-0.000312,-5.7e-05,-0.000375,-3.6e-05,0.000199,-1.5e-05,0.000115,0.000208,-0.000227,5.4e-05,-4.5e-05,-3e-05,1e-05,1e-05,6e-06,-1.1e-05,4e-06,8e-06,-5e-06,-9e-06,7e-06
7e-06,1e-06,3e-06,-3e-06,0,4e-06,-2e-06,5e-06,-2e-06,1e-06,-4e-06,-7e-06,-5e-06,-6e-06,-1e-05,-3e-06,-2e-06,1e-06,1e-06,4e-06,0,4e-06,0,-3e-06,-4e-06,1e-06,-2e-06,-2e-06,0,0,3e-06,0,-4e-06,1.3e-05,-3.3e-05,6e-06,-1.3e-05,4e-06,-8e-06,2.9e-05,-1e-06,-4e-06,-1.1e-05,-4.6e-05,-4.5e-05,0.000132,0.000281,-0.00016,-0.000182,-0.000342,-0.000159,0.000312,-0.000169,0.000108,7.2e-05,-1e-05,-0.000164,-1.6e-05,-5.8e-05,-4e-05,8.7e-05,-0.000133,-8.4e-05,-7e-06,-3.6e-05,-0.000178,0.000102,-0.000194,-6.8e-05,0.000229,-0.000157,3.9e-05,-3.1e-05,1.4e-05,-1.2e-05,8e-06,-5e-05,-5.6e-05,-2.7e-05,3.2e-05,-3.9e-05,0.00011,3.7e-05,7.1e-05,-4e-05,-3.8e-05,1.5e-05,-2.5e-05,-1.2e-05,2.5e-05,5e-06,-8.6e-05,-2.8e-05,-5e-06,1.5e-05,-0.000113,-1.7e-05,3.2e-05,-1e-06,-8.9e-05,0.000191,1.4e-05,3.7e-05,0.000133,0,1.2e-05,-3.3e-05,-8.8e-05,0.00023,7e-06,-2.8e-05,-3.5e-05,9e-06,-3e-06,-2e-05,9e-06,7e-06,-4e-06,0,4e-06,-3.1e-05
-1e-06,-4e-06,-1e-06,2e-06,-2e-06,1e-06,-3e-06,3e-06,-3e-06,-5e-06,0,2e-06,2e-06,0,-3e-06,-1e-06,-2e-06,2e-06,-1e-06,-2e-06,3e-06,-4e-06,5e-06,2e-06,-7e-06,1e-06,0,-2e-06,-6e-06,3e-06,2e-06,0,1e-05,-2e-06,-2.5e-05,1e-06,-5e-06,-1.2e-05,-8e-06,-2.3e-05,1.2e-05,2e-06,5e-06,2.2e-05,0.000118,-0.000146,-0.000288,0.000189,-0.000275,8.4e-05,0.000131,-0.000183,-0.000107,-8.4e-05,-0.000207,-6e-05,0.000134,1.3e-05,-1.2e-05,-8.1e-05,4.3e-05,3.7e-05,4.7e-05,5.4e-05,-2.7e-05,6.8e-05,-0.000122,1.6e-05,4.5e-05,1.1e-05,-0.000179,4e-05,-9.4e-05,0.000286,-3.5e-05,0.000109,-7.5e-05,6.6e-05,6e-06,-1.6e-05,-1.2e-05,-4.4e-05,-8.2e-05,3.3e-05,-2.5e-05,6.5e-05,-3.2e-05,6.6e-05,-6e-06,-8e-06,-1.7e-05,-1.9e-05,4.9e-05,-1.9e-05,1.1e-05,-4.1e-05,-1.9e-05,7e-05,0.000138,9.8e-05,-5.9e-05,-1.6e-05,0.000219,-2.9e-05,3.3e-05,-1e-05,-4.5e-05,-1.6e-05,0.000144,-1.3e-05,-3.1e-05,-3e-06,6e-06,-2e-06,1e-06,1e-06,-3e-06,-8e-06,4e-06,-1e-06,-1.4e-05
-2e-06,8e-06,-2e-06,0,-2e-06,-3e-06,-1e-06,3e-06,1e-06,3e-06,1e-06,-1e-06,-1e-06,0,2e-06,1e-06,-1e-06,-3e-06,-3e-06,-2e-06,0,0,0,2e-06,2e-06,4e-06,-1e-06,-1e-06,-3e-06,3e-06,-2e-06,0,-6e-06,-2.8e-05,3.5e-05,8e-06,4e-06,-6e-06,4e-06,1.7e-05,0,2e-06,1.3e-05,1.2e-05,6.1e-05,9.3e-05,0.00023,-0.000139,0.000188,0.000345,1.3e-05,6.6e-05,-3.3e-05,7.3e-05,4.6e-05,-0.000179,-0.000396,-0.000148,-7.5e-05,9e-06,-0.000106,-0.000193,-0.000142,3.2e-05,-0.00014,1.8e-05,-8.5e-05,9.8e-05,9.1e-05,-4.5e-05,0.000124,2e-06,4.2e-05,-8e-05,6.9e-05,1.6e-05,4.2e-05,1.7e-05,-5.3e-05,-3.4e-05,3.3e-05,1.4e-05,7.1e-05,-5.8e-05,3.5e-05,4.7e-05,2.6e-05,-1.7e-05,-2.1e-05,1e-06,-1.5e-05,4.5e-05,-1e-05,-1e-05,1.2e-05,0.000144,4.6e-05,2.7e-05,-2.3e-05,6e-06,-5.7e-05,1.3e-05,-0.000166,-0.000153,3.2e-05,3e-06,-7.1e-05,-6.2e-05,-0.000173,-3.9e-05,-1e-05,-2e-05,2.1e-05,-4e-06,-9e-06,-7e-06,1e-06,1e-06,1e-06,-6e-06,1.4e-05
2e-06,-8e-06,2e-06,0,2e-06,-4e-06,0,-1e-06,3e-06,1e-06,-1e-06,1e-06,5e-06,-1e-06,3e-06,0,2e-06,0,3e-06,3e-06,1e-06,2e-06,1e-06,1e-06,-5e-06,0,-2e-06,0,0,2e-06,1e-06,0,-1e-06,3e-05,-2.7e-05,-1.7e-05,3e-06,8e-06,-1.1e-05,-9e-06,0,0,-3.2e-05,-2.6e-05,1.4e-05,-1e-06,-7.8e-05,9.1e-05,-0.000114,-0.000227,8.8e-05,4.6e-05,0.000156,-0.00015,-6.6e-05,0.000136,0.000248,-0.000142,6.4e-05,-0.00016,-4.6e-05,1e-05,0.000112,-9.5e-05,-0.000161,-0.000145,8.7e-05,0.000119,1.3e-05,5.5e-05,0.000214,-3e-06,5.1e-05,-7.7e-05,1.5e-05,-9.2e-05,7e-06,2.1e-05,7e-05,0,1.6e-05,-4.5e-05,-5.4e-05,2.6e-05,5.2e-05,1.4e-05,0,2e-05,-2.1e-05,-1.8e-05,-3.4e-05,8e-06,-3.9e-05,4e-06,-2e-06,3.5e-05,-3e-05,-8.4e-05,-9.8e-05,4.9e-05,7.8e-05,-2.2e-05,-3e-06,0.000101,-0.00015,-6e-06,-1.3e-05,4.6e-05,-8.2e-05,-2.2e-05,1.7e-05,-3.8e-05,1.8e-05,5e-06,-1.2e-05,2.3e-05,-4e-06,4e-06,-1e-06,1.2e-05,1.1e-05
-4e-06,1e-06,-1e-06,0,-1e-06,4e-06,-4e-06,-4e-06,-5e-06,4e-06,-1e-06,0,-3e-06,0,2e-06,0,1e-06,2e-06,-2e-06,-2e-06,1e-06,1e-06,-2e-06,0,5e-06,0,-1e-06,-2e-06,2e-06,-2e-06,-5e-06,0,6e-06,-3.8e-05,5e-05,1.5e-05,5e-06,1e-06,1.8e-05,0,-5e-06,-3e-06,2e-05,2.3e-05,6.9e-05,3.2e-05,-5.4e-05,-3.6e-05,-1.5e-05,1.1e-05,9.4e-05,-0.000148,6.1e-05,0.000126,9.1e-05,8.1e-05,7.5e-05,1.8e-05,-4.3e-05,6.7e-05,-4.7e-05,0.000113,-7.7e-05,9.8e-05,-5.5e-05,0.000423,5.4e-05,-0.000292,-0.000199,9.8e-05,-7.9e-05,7e-06,-8.5e-05,-1.1e-05,-1.1e-05,-1.4e-05,1.7e-05,-2e-06,5.1e-05,3.6e-05,-3.8e-05,-2.2e-05,1.7e-05,5e-05,2.5e-05,-6e-05,-1.1e-05,-5.2e-05,-1.1e-05,-3e-06,-1.2e-05,-1.9e-05,-1.8e-05,-3e-06,-6e-06,-4.6e-05,-5.4e-05,1.4e-05,2.9e-05,5.3e-05,-0.000151,1e-06,0.000159,6.5e-05,5.6e-05,-6e-06,3.1e-05,-3.1e-05,8.4e-05,3.1e-05,2.5e-05,2.2e-05,-1.5e-05,2e-06,1.6e-05,-2.6e-05,-2e-06,2e-06,1e-06,-1e-05,1.6e-05
2e-06,5e-06,-1e-06,-2e-06,-1e-06,5e-06,1e-06,0,0,-1e-06,0,0,1e-06,1e-06,-5e-06,1e-06,-1e-06,-3e-06,-2e-06,1e-06,-2e-06,-1e-06,-1e-06,0,-1e-06,0,1e-06,0,2e-06,-5e-06,0,0,-2e-06,4.4e-05,-1e-06,-3e-06,3e-06,6e-06,-1.5e-05,-1e-06,1e-06,-1e-06,1e-05,3e-06,-6.8e-05,-5.2e-05,0.000222,-2.7e-05,-5.9e-05,7.4e-05,3.6e-05,2.4e-05,8e-06,3.3e-05,9e-05,3e-06,-0.000209,1e-05,9e-06,3e-06,-0.00011,1.1e-05,0.000108,-6.7e-05,-4.1e-05,-0.000337,3.4e-05,8.5e-05,1.3e-05,-1.1e-05,-3.6e-05,4.4e-05,1.1e-05,4.1e-05,-3e-06,4.5e-05,-1.5e-05,4.2e-05,-2.5e-05,1.1e-05,-1.7e-05,4.6e-05,-4e-06,5e-06,-1.3e-05,1.8e-05,1e-05,6e-06,1.8e-05,0,2e-06,-7e-06,1.2e-05,-4e-06,6e-06,-7.6e-05,9.4e-05,-3.7e-05,4.5e-05,-8e-05,0.000193,-3.3e-05,-0.000226,-9.1e-05,-3e-05,0,4.5e-05,5.5e-05,9.2e-05,0,1.3e-05,-2.4e-05,3e-06,4e-06,1e-05,0,1e-06,-3e-06,2e-06,3e-06,-1.5e-05
0,-5e-06,0,1e-06,2e-06,0,-1e-06,-4e-06,0,1e-06,0,-1e-06,-1e-06,1e-06,-5e-06,0,0,0,1e-06,-3e-06,0,0,1e-06,0,4e-06,-2e-06,1e-06,0,2e-06,-3e-06,0,0,-2e-06,-4.2e-05,-2.2e-05,3e-06,-4e-06,-7e-06,1.3e-05,8e-06,-1e-06,1e-06,-2.5e-05,-2.6e-05,0,7.3e-05,-0.000218,5.2e-05,-4.1e-05,-9.6e-05,-7.7e-05,1.9e-05,-0.00013,-9.6e-05,-9.1e-05,-3.7e-05,8.7e-05,3.9e-05,-1.3e-05,4.7e-05,5.1e-05,6e-05,-8.8e-05,-8.1e-05,1.2e-05,0.000302,-7e-05,7e-05,9.7e-05,-3.3e-05,-4.1e-05,3.4e-05,5.3e-05,-2e-06,-4.2e-05,3.5e-05,3e-06,-2.7e-05,-1.7e-05,-3.6e-05,-1.2e-05,-8e-06,-7e-06,0,-1.4e-05,2.6e-05,-3e-06,1.8e-05,8e-06,6e-06,6e-06,1.9e-05,7e-06,6e-06,7e-06,9e-06,-3.7e-05,5.3e-05,1e-06,-5.8e-05,-0.000139,1.5e-05,0.000158,1.8e-05,0.000151,-2e-06,1.8e-05,5.2e-05,-0.000118,-2.6e-05,3e-06,-2.8e-05,-5e-06,5e-06,-8e-06,2e-06,1e-06,0,0,9e-06,-1.1e-05
-2e-06,1e-06,2e-06,-1e-06,-1e-06,1e-06,1e-06,-3e-06,2e-06,-2e-06,-2e-06,0,1e-06,0,-3e-06,-1e-06,0,2e-06,0,1e-06,0,0,1e-06,-1e-06,-3e-06,0,-1e-06,-1e-06,-1e-06,-2e-06,-2e-06,0,2e-06,3.8e-05,1.1e-05,-6e-06,-5e-06,-3e-06,-8e-06,-1.3e-05,0,0,7e-06,2.4e-05,-0.000103,-4.6e-05,0.000109,-7.2e-05,-8.8e-05,5.3e-05,-7.5e-05,3e-05,-5e-05,-3e-06,6.1e-05,-3.8e-05,-0.000117,9.8e-05,1.6e-05,-9.2e-05,-7e-06,-4.4e-05,-4.5e-05,1.2e-05,0.000116,-0.000252,8e-06,-9.7e-05,-3e-05,1.4e-05,-3e-05,1e-06,3.7e-05,-3e-06,3.8e-05,-3.5e-05,-8.8e-05,2.6e-05,-6.3e-05,0,-3e-06,1.3e-05,8e-06,-3e-06,-1.3e-05,-2.3e-05,-5e-06,-9e-06,-7e-06,4e-06,1.4e-05,9e-06,-1e-06,1.1e-05,7e-06,6.1e-05,-1.5e-05,3.2e-05,-3.7e-05,6e-06,4.4e-05,-1e-05,-2.3e-05,3.3e-05,2.3e-05,0,1.8e-05,-3.6e-05,3.6e-05,1.9e-05,-5e-06,1.3e-05,-1.3e-05,0,0,-2e-06,0,1e-06,-1e-06,-1e-05,-6e-06
1e-06,2e-06,-1e-06,-1e-06,0,-3e-06,-2e-06,6e-06,-1e-06,1e-06,1e-06,1e-06,-3e-06,-1e-06,-2e-06,-1e-06,1e-06,-2e-06,0,0,1e-06,0,1e-06,0,-1e-06,-1e-06,0,-1e-06,-3e-06,-1e-06,0,0,1e-06,-3.1e-05,-1.1e-05,-3e-06,-1e-06,1e-06,0,1.3e-05,0,0,2.1e-05,-3e-06,1e-06,1.4e-05,3.6e-05,5.3e-05,1.7e-05,-2.9e-05,-7.8e-05,-7e-06,-1e-05,9.1e-05,5.4e-05,7e-06,0.000213,-1.1e-05,2.8e-05,0.000176,-5.1e-05,5.7e-05,2.5e-05,4.4e-05,3.8e-05,2.6e-05,-6.8e-05,8.4e-05,-3.6e-05,6.6e-05,-1.8e-05,-1.9e-05,4.4e-05,1.3e-05,-1.7e-05,-2.1e-05,0.000105,-6.8e-05,-1.8e-05,2.9e-05,2.7e-05,2e-05,1.1e-05,-4.3e-05,-1.1e-05,-4.4e-05,3e-06,2e-06,4.2e-05,7e-06,7e-06,-2.1e-05,-7e-06,5e-06,-3e-06,2.4e-05,1.3e-05,-1.4e-05,1.6e-05,2e-05,3.7e-05,8e-06,-5.8e-05,-2.6e-05,-9e-06,0,-2.7e-05,2.9e-05,-6.2e-05,-6e-06,-6e-06,-8e-06,5e-06,-3e-06,-2e-06,8e-06,3e-06,0,0,2e-06,0
0,-2e-06,0,2e-06,0,0,-1e-06,0,-1e-06,-1e-06,0,-3e-06,3e-06,0,2e-06,0,-2e-06,0,-3e-06,-1e-06,0,0,-1e-06,1e-06,-1e-06,-1e-06,1e-06,-1e-06,-2e-06,1e-06,0,0,-2e-06,2.1e-05,2e-06,8e-06,1e-06,2e-06,-2e-06,-1e-05,0,0,-3.1e-05,-1.9e-05,3.9e-05,-5e-06,-0.000131,-4.3e-05,-7e-06,-5.7e-05,-3.4e-05,3e-05,6.6e-05,-5.5e-05,-7.9e-05,4.6e-05,-7.1e-05,-3e-06,3e-06,-9.4e-05,-3.4e-05,0.00012,-3.6e-05,4.3e-05,1.9e-05,2.2e-05,8.4e-05,-0.000145,-4.4e-05,-2.6e-05,3.9e-05,2.5e-05,-2.5e-05,-2.2e-05,-5e-06,1.5e-05,-3.6e-05,-2.9e-05,3.1e-05,0,-1e-05,-5.6e-05,-1.9e-05,6e-06,1e-06,6.9e-05,0,-2.8e-05,-4.1e-05,-1e-06,7e-06,-1.3e-05,1e-06,-4e-06,-3e-06,-3.8e-05,-2.1e-05,-3.4e-05,3.5e-05,4.8e-05,-9.1e-05,-8e-06,7.5e-05,-2.8e-05,7e-05,0,-2.7e-05,-3.7e-05,0.000109,-1.4e-05,-6e-06,-3.7e-05,-3e-06,-5e-06,-1e-05,-4e-06,-5e-06,-2e-06,1e-06,1e-06,4e-06
-1e-06,1e-06,-1e-06,0,-1e-06,2e-06,1e-06,-1e-06,0,1e-06,-1e-06,2e-06,-2e-06,1e-06,2e-06,0,1e-06,1e-06,2e-06,1e-06,0,0,-1e-06,0,0,-1e-06,0,-1e-06,0,1e-06,2e-06,0,2e-06,-1.1e-05,-6e-06,-4e-06,3e-06,4e-06,1e-06,1e-06,0,0,1.4e-05,1.7e-05,2e-05,-5e-06,0.000175,1.3e-05,-0.000121,-6.1e-05,-3.6e-05,6.8e-05,5.9e-05,-3e-05,-1.6e-05,6.2e-05,-7e-05,3.6e-05,5e-06,1e-04,1.5e-05,-6.4e-05,3.7e-05,-0.000118,6e-06,-8.4e-05,3.1e-05,9.2e-05,8.3e-05,-3.6e-05,8.4e-05,-4.3e-05,2.7e-05,6e-06,-4e-06,5e-06,2.9e-05,2.6e-05,2.8e-05,-1.2e-05,-2.9e-05,8e-06,2e-05,1.8e-05,-5e-06,-1.7e-05,-2e-06,1.7e-05,1.5e-05,-2e-06,4e-06,3.3e-05,4e-06,-5e-06,1e-06,-3.6e-05,2.3e-05,3e-05,-3.8e-05,2e-06,9.2e-05,2e-06,-3.4e-05,2.3e-05,4.4e-05,-2e-06,-1.8e-05,-3.1e-05,-3e-06,3e-06,-1e-05,1.6e-05,-1.9e-05,0,2e-06,-1e-06,1e-06,1e-06,0,-7e-06,1.3e-05
2e-06,0,0,-1e-06,0,1e-06,0,3e-06,3e-06,0,1e-06,-1e-06,1e-06,-1e-06,-1e-06,0,0,0,1e-06,-1e-06,0,-1e-06,-1e-06,0,0,-1e-06,-1e-06,0,1e-06,1e-06,1e-06,0,0,-2e-06,2e-06,-1e-06,1e-06,-1e-06,6e-06,5e-06,1e-06,0,4e-06,0,3.1e-05,-1.5e-05,-0.000134,5e-06,3.4e-05,0.000103,6.7e-05,-3.9e-05,2.2e-05,7.3e-05,-2e-06,-8e-06,7.6e-05,-1.2e-05,-3.9e-05,-0.000148,-6.1e-05,-1.5e-05,-5.1e-05,6.2e-05,2.5e-05,9.9e-05,-4.4e-05,5.1e-05,1e-06,3.4e-05,-2.4e-05,5.3e-05,1.4e-05,9e-06,-2e-06,-1e-06,-4.5e-05,1.1e-05,4e-06,-1e-05,2e-05,3.9e-05,-1.9e-05,-3.3e-05,-3e-06,-4e-06,-1e-06,7e-06,-1e-05,-3e-06,4e-06,-1e-06,-4e-06,0,3e-06,1.2e-05,5e-06,-2.5e-05,-1.1e-05,-2.5e-05,-8e-05,-7e-06,-5.7e-05,3e-05,-9e-06,1e-06,-4e-06,-1.2e-05,-9.2e-05,2e-06,-6e-06,-6e-06,6e-06,0,5e-06,2e-06,-2e-06,1e-06,-1e-06,7e-06,-4e-06
-1e-06,0,0,0,0,0,1e-06,0,-2e-06,0,0,0,-2e-06,0,-3e-06,1e-06,1e-06,-1e-06,0,1e-06,-1e-06,0,0,0,3e-06,1e-06,0,-1e-06,1e-06,0,2e-06,0,-1e-06,1e-05,-7e-06,-4e-06,1e-06,-4e-06,-8e-06,-6e-06,-1e-06,0,-5e-06,-1.3e-05,7e-06,2.5e-05,2e-05,-2.1e-05,-6.4e-05,8e-05,3.8e-05,0.000142,-4.1e-05,-3.2e-05,3e-06,-0.000102,-2.6e-05,-6e-06,7e-06,0.000125,3.5e-05,-2.2e-05,2.7e-05,3.9e-05,1.6e-05,-9.9e-05,1.2e-05,-6e-06,-3.9e-05,4e-06,-5.1e-05,-5.6e-05,-4.5e-05,1.7e-05,1e-05,-4e-06,6.6e-05,2.4e-05,-1.5e-05,1.3e-05,1.3e-05,-5e-06,1.4e-05,0,0,-4e-05,4e-06,5e-06,3e-06,-6e-06,-6e-06,-2.2e-05,3e-06,-1e-06,0,3.1e-05,-3e-05,1.1e-05,2.6e-05,-9e-06,5.3e-05,-1e-06,0.000123,-3.6e-05,-8.2e-05,-2e-06,6e-06,-4e-06,1.6e-05,-1e-06,0,-2.4e-05,-4e-06,0,-3e-06,-6e-06,5e-06,0,0,-2e-06,3e-06
0,0,0,0,0,-2e-06,0,-3e-06,-1e-06,-1e-06,-1e-06,0,3e-06,0,-4e-06,0,-1e-06,0,0,-2e-06,0,0,1e-06,1e-06,-1e-06,0,1e-06,-1e-06,1e-06,-1e-06,0,0,1e-06,-1.7e-05,1.8e-05,6e-06,-3e-06,-1e-06,5e-06,4e-06,1e-06,0,0,1.3e-05,2.9e-05,-1e-05,9e-05,2.8e-05,-3.2e-05,-0.000137,1.7e-05,-5e-05,-4.8e-05,-5.2e-05,-2.1e-05,1e-05,0.000131,-3.6e-05,-7e-06,-0.000162,-3.8e-05,-3e-06,2.1e-05,-7.1e-05,-5.1e-05,7.8e-05,-6e-05,-0.000147,1.4e-05,-3.4e-05,-3e-05,2.7e-05,-1.6e-05,-4.9e-05,6e-06,7e-06,-4.8e-05,-1.4e-05,-1.1e-05,1.8e-05,-2e-06,-1.8e-05,-1e-06,3.6e-05,5e-06,3.7e-05,-2e-06,1e-06,-7e-06,4e-06,-6e-06,3e-06,-1.2e-05,-4e-06,-4e-06,1.4e-05,2.3e-05,-2.9e-05,4e-06,-2.5e-05,-6e-06,-4e-06,-9.6e-05,-2.8e-05,-8e-06,0,2.7e-05,-2.8e-05,4.6e-05,-1e-06,6e-06,4e-06,0,0,4e-06,-2e-06,-4e-06,-1e-06,1e-06,-3e-06,-1.5e-05
1e-06,-1e-06,0,-1e-06,0,0,1e-06,0,1e-06,0,0,0,-2e-06,0,-2e-06,0,0,0,2e-06,0,0,-1e-06,0,0,1e-06,0,0,-1e-06,0,-1e-06,0,0,0,2.1e-05,-3e-06,1e-06,-1e-06,1e-06,-8e-06,0,-1e-06,0,-2e-06,-1e-06,-5e-05,-1.2e-05,-0.000145,-2.8e-05,-5e-06,-1e-05,1e-05,-4e-06,-4.8e-05,6.3e-05,-8e-06,3.2e-05,-0.000148,-4.9e-05,1.3e-05,0.000119,-3.9e-05,4.7e-05,-5.7e-05,7.4e-05,-5.2e-05,2.9e-05,3.4e-05,0.000127,7e-06,-1.2e-05,9e-06,2.1e-05,-2.1e-05,4e-06,-1.8e-05,-3e-06,4.8e-05,-1.1e-05,6e-06,-1.7e-05,3e-06,1.2e-05,-1e-05,1e-06,1.3e-05,2.2e-05,-4e-06,-2.1e-05,1.2e-05,-2e-06,-9e-06,1.3e-05,7e-06,-2e-06,-3e-06,-2.8e-05,5e-06,1.7e-05,-1.7e-05,6e-06,-4.4e-05,2e-06,1.9e-05,5.4e-05,-7.6e-05,0,1.3e-05,1.1e-05,-2.2e-05,-8e-06,9e-06,-3e-06,8e-06,1e-06,5e-06,9e-06,0,0,0,5e-06,-3e-06
-1e-06,2e-06,0,1e-06,0,0,1e-06,0,1e-06,0,0,0,1e-06,0,1e-06,0,0,-1e-06,-1e-06,1e-06,0,1e-06,0,0,-1e-06,1e-06,0,-1e-06,-2e-06,-1e-06,-1e-06,0,-1e-06,-1.9e-05,-4e-06,0,0,3e-06,1e-05,-5e-06,0,-1e-06,8e-06,-8e-06,-2.1e-05,2.1e-05,0.000128,2.1e-05,-4.4e-05,-2.1e-05,-2e-06,3.3e-05,2.8e-05,-1.5e-05,3.6e-05,2.3e-05,-7e-06,-3e-06,5e-06,-8.9e-05,1.4e-05,-7.4e-05,2.8e-05,2e-06,-2.8e-05,-2e-06,2.7e-05,-1.3e-05,5e-06,1.9e-05,2e-06,-3.5e-05,1e-05,4.2e-05,9e-06,-7e-06,-1.5e-05,1e-05,9e-06,-1.8e-05,-1.9e-05,-1.2e-05,9e-06,2e-06,1.3e-05,-3.5e-05,3e-06,1.8e-05,0,7e-06,-5e-06,-2e-06,4e-06,1e-06,1e-06,-1.3e-05,-2.2e-05,2e-06,-1.2e-05,3.2e-05,6.5e-05,0,4e-05,-8e-06,2.2e-05,-1e-06,-5e-06,-2.7e-05,3.2e-05,1e-06,6e-06,-1.8e-05,-2e-06,1e-06,-7e-06,-5e-06,2e-06,0,-1e-06,-4e-06,1e-06
1e-06,-2e-06,0,0,0,1e-06,0,-1e-06,0,0,0,0,-1e-06,0,1e-06,0,1e-06,0,1e-06,0,0,-1e-06,0,0,-1e-06,0,0,-1e-06,-1e-06,0,0,0,0,1.8e-05,1e-05,-3e-06,1e-06,0,-6e-06,3e-06,0,0,-6e-06,8e-06,-3.2e-05,-1.3e-05,-5.5e-05,-9e-06,-4e-05,4.7e-05,-4.5e-05,-0.000127,3.2e-05,-3.1e-05,-2e-06,1.7e-05,5.4e-05,5e-06,-1e-06,0.00015,-5.5e-05,9e-06,-2.9e-05,-5e-05,2e-06,2.9e-05,-5e-06,2.9e-05,-4.1e-05,1e-06,2.5e-05,5.4e-05,2.6e-05,3e-06,-4e-06,-6e-06,-6e-06,0,0,1.2e-05,5e-06,-1.4e-05,-6e-06,-1e-06,1e-06,-9e-06,0,0,0,1e-06,1e-06,-6e-06,8e-06,1e-06,2e-06,7e-06,1e-05,2.2e-05,1.6e-05,2e-06,-6.3e-05,1e-06,-6.1e-05,-3.8e-05,-3.5e-05,1e-06,-1.8e-05,-3.1e-05,-4.7e-05,5e-06,1e-06,-8e-06,-3e-06,-1e-06,-3e-06,2e-06,-3e-06,0,0,2e-06,9e-06
0,0,0,0,0,1e-06,0,1e-06,-1e-06,1e-06,0,0,1e-06,0,1e-06,0,-1e-06,0,-1e-06,0,0,0,0,0,0,1e-06,0,-1e-06,0,1e-06,-1e-06,0,1e-06,-1.4e-05,-1.1e-05,-1e-06,1e-06,-1e-06,2e-06,0,0,1e-06,-4e-06,-1e-06,2.6e-05,0,-5e-05,-4e-06,-2.9e-05,-1.2e-05,-2.9e-05,7.7e-05,3e-05,1.7e-05,0,-2.8e-05,-3e-06,1e-05,0,-0.000128,-7e-06,3e-05,2.4e-05,-2.3e-05,1.9e-05,-5.2e-05,-6e-06,-9.6e-05,6e-06,-2.2e-05,3.1e-05,-6.3e-05,-2e-06,-4.2e-05,1e-06,2e-05,-5.1e-05,1.4e-05,-1.4e-05,1e-05,-3e-06,2.7e-05,-2e-06,-1.4e-05,-7e-06,3.4e-05,-3e-06,6e-06,0,1e-06,3e-06,0,-3e-06,1e-06,1e-06,1.5e-05,-1e-06,-2e-05,-3e-06,-3e-06,5.4e-05,-1e-06,3.3e-05,2.2e-05,3.9e-05,0,-1.6e-05,-1e-06,-1.5e-05,-6e-06,-3e-06,1e-05,9e-06,-1e-06,5e-06,-5e-06,3e-06,-1e-06,1e-06,1e-06,2e-06
-1e-06,2e-06,0,1e-06,0,0,0,0,0,0,1e-06,-1e-06,-2e-06,0,-1e-06,0,1e-06,0,-1e-06,-1e-06,0,0,0,0,0,0,0,-1e-06,0,1e-06,-1e-06,0,-1e-06,9e-06,2e-06,6e-06,1e-06,-2e-06,-1e-06,-6e-06,0,1e-06,1.1e-05,-5e-06,2e-05,2e-06,0.000121,1.2e-05,-6e-06,1e-05,-1.8e-05,-6.5e-05,-1.2e-05,1.1e-05,-1e-06,-6e-05,0,6.5e-05,-9e-06,0.000119,7e-06,-6e-06,-2.2e-05,7.3e-05,1.9e-05,-2.8e-05,-2.3e-05,-1.2e-05,3.4e-05,-2.1e-05,0,5.7e-05,2.2e-05,-7e-06,8e-06,1e-06,6.3e-05,-3e-05,-1.9e-05,-6e-06,-2e-06,3e-06,8e-06,7e-06,-1.2e-05,-4e-06,1e-06,-1.2e-05,-8e-06,-1e-06,4e-06,2e-06,-7e-06,2e-06,-3e-06,3e-06,-2e-06,7e-06,-1.7e-05,-8e-06,-4.6e-05,0,2.7e-05,2.1e-05,-9e-06,0,-5e-06,-1.1e-05,3.8e-05,-2e-06,-6e-06,-2.1e-05,3e-06,1e-06,-2e-06,-3e-06,-2e-06,0,0,-3e-06,2e-06
1e-06,-3e-06,0,-1e-06,0,0,1e-06,0,2e-06,0,0,0,2e-06,0,-3e-06,0,0,0,1e-06,1e-06,0,0,0,-1e-06,1e-06,0,0,-1e-06,1e-06,1e-06,0,0,0,-3e-06,-2e-06,-3e-06,-1e-06,-1e-06,-1e-06,1e-05,0,0,-8e-06,4e-06,4e-06,1.2e-05,-0.000129,-1.4e-05,-5.5e-05,-6.2e-05,-1.7e-05,-2.2e-05,-3.6e-05,-2e-05,-5e-06,6e-06,-7.4e-05,-8e-06,7e-06,-0.000122,-4e-05,1e-05,0,-4.9e-05,1.2e-05,2.5e-05,-4e-06,0.000151,-3e-06,3.2e-05,-3.9e-05,-3e-05,4.4e-05,4.1e-05,-1e-05,-1.3e-05,-3.5e-05,1e-05,1.4e-05,-9e-06,5e-06,-1e-05,-9e-06,8e-06,-1.1e-05,-2.1e-05,1e-06,-6e-06,4e-06,-4e-06,4e-06,1e-06,3e-06,2e-06,-1e-06,-1e-05,-1e-06,-1.9e-05,1.4e-05,-1.2e-05,2.2e-05,-1e-06,-6.6e-05,-3.1e-05,-6.2e-05,0,1.7e-05,-8e-06,-7e-06,2e-06,-6e-06,-9e-06,-3e-06,2e-06,0,8e-06,2e-06,0,-1e-06,3e-06,-1e-05
-1e-06,2e-06,0,0,0,0,0,1e-06,-1e-06,-1e-06,-1e-06,-1e-06,-1e-06,0,-2e-06,0,1e-06,1e-06,1e-06,0,0,1e-06,0,0,0,0,0,-1e-06,1e-06,1e-06,0,0,0,-3e-06,-8e-06,1e-06,-1e-06,2e-06,4e-06,-8e-06,0,0,-2e-06,0,2.6e-05,-2.8e-05,7.3e-05,9e-06,-6e-06,-6e-06,1e-06,2.8e-05,-4.6e-05,-1.3e-05,1.9e-05,7e-05,4e-06,6e-06,0,9.8e-05,0,-1.9e-05,1e-06,0,1.3e-05,-6.8e-05,1.9e-05,-0.000105,-1.6e-05,-9e-06,-2e-05,-4e-06,-1e-06,3e-06,8e-06,-9e-06,7e-06,5e-06,1.9e-05,0,-1.3e-05,-5e-06,5e-06,-1.8e-05,-8e-06,-6e-06,-1e-06,9e-06,3e-06,-1e-06,1e-06,-5e-06,-2e-06,0,1e-06,-3e-06,4e-06,1.8e-05,6e-06,7e-06,1.6e-05,-1e-06,6e-05,-1.4e-05,1.9e-05,0,2e-05,2.2e-05,-1.3e-05,-2e-06,-3e-06,1.1e-05,4e-06,1e-06,6e-06,-3e-06,-2e-06,0,0,-2e-06,-3e-06
0,0,0,1e-06,0,0,0,-1e-06,-1e-06,1e-06,0,0,1e-06,0,-1e-06,-1e-06,-1e-06,-1e-06,-1e-06,-1e-06,0,0,0,0,0,-1e-06,0,0,0,0,1e-06,0,-1e-06,7e-06,3e-06,-3e-06,0,0,-5e-06,4e-06,0,0,6e-06,-3e-06,-2e-06,2.8e-05,1.1e-05,-4e-06,-3.7e-05,6.4e-05,0,6e-06,-1.5e-05,2.9e-05,-2.3e-05,1.9e-05,0.000118,-3e-06,-4e-06,-0.000108,-2.4e-05,8e-06,-1e-05,1.3e-05,-1.3e-05,9.8e-05,1.5e-05,-1.3e-05,-1.4e-05,-1e-05,5e-06,3e-05,-1.8e-05,-3.5e-05,3e-06,1.8e-05,-2.4e-05,3e-06,1e-05,1.5e-05,-2e-06,-5e-06,0,-5e-06,-1e-06,2.3e-05,0,7e-06,-5e-06,-1e-06,-1e-06,6e-06,1e-06,-1e-06,3e-06,1e-06,0,-9e-06,-1e-05,-1e-06,-4.6e-05,-1e-06,-1.8e-05,3.4e-05,9e-06,0,5e-06,-1e-06,-2e-06,-2e-06,0,-1.8e-05,-6e-06,0,-2e-06,1e-06,-1e-06,-1e-06,1e-06,-1e-06,-4e-06
1e-06,-1e-06,0,0,0,0,0,-1e-06,0,-1e-06,0,0,-2e-06,0,0,0,1e-06,0,0,1e-06,0,0,0,0,0,0,0,-1e-06,-1e-06,-1e-06,0,0,0,-1.1e-05,6e-06,0,0,0,6e-06,0,0,0,-3e-06,2e-06,-3e-06,-1.1e-05,-9.8e-05,-3e-06,-4.9e-05,-2e-06,2e-06,-2e-06,1.1e-05,-2.5e-05,-1.8e-05,-3.8e-05,-8.9e-05,-3.2e-05,0,0.000112,-3.1e-05,8e-06,6e-06,1e-05,-3e-06,-9.3e-05,-1.4e-05,-2e-05,4e-06,4e-06,1e-05,-5.2e-05,-1.4e-05,-7e-06,-9e-06,-2e-06,4.8e-05,1.3e-05,-4e-06,2e-06,1.5e-05,5e-06,-5e-06,9e-06,1.2e-05,1.8e-05,0,-3e-06,-1e-06,3e-06,-1e-06,2e-06,-2e-06,-2e-06,0,2e-06,0,1.1e-05,0,-1e-06,5.9e-05,0,-3.5e-05,6e-06,5.5e-05,0,-1.3e-05,-7e-06,3.4e-05,2e-06,5e-06,-1.2e-05,-4e-06,-1e-06,-3e-06,1e-06,2e-06,0,0,3e-06,3e-06
