-1.3e-05,-4e-05,-4.8e-05,-3.2e-05,-0.006164,-0.057519,-0.045438,-0.122847,-0.21402,-0.185997,-0.159982,-0.151489,-0.159658,-0.162646,-0.105047,-0.047622,-0.015242,-0.003712,-0.002974,-0.001139,-0.001027,-0.001751,-0.009933,-0.00956,-0.000777,-0.000998,-0.004034,-0.004452
6e-06,1.5e-05,9e-06,3e-06,0.000204,-0.019471,-0.013687,-0.008746,-0.040194,0.09424,0.150263,0.126866,0.07023,0.06679,0.09677,0.06727,0.0217,0.004278,0.002635,0.000622,0.000573,-0.000109,-0.006466,-0.006034,-0.000499,-0.00014,0.000627,0.001075
1e-06,1e-06,1e-06,6e-06,0.002344,0.018232,0.008172,0.001782,0.009908,-0.014449,-0.024129,-0.028252,-0.03871,-0.023521,-0.027537,-0.02808,-0.008596,-0.001016,-0.000671,-0.00011,-2e-06,-0.000186,-0.000142,0.000539,-0.000174,0.000235,-0.00054,-0.001612
-3e-06,-5e-06,7e-06,8e-06,0.00103,0.031105,0.015629,-0.026174,0.023027,-0.103697,-0.125671,-0.087181,-0.064937,-0.058133,-0.067986,-0.040159,-0.013529,-0.00347,-0.001801,-0.000389,-0.000567,-0.000206,0.002179,0.003063,0.000212,-0.000218,-0.000234,0.000529
4e-06,2.6e-05,3.3e-05,1e-05,0.000143,0.010505,0.014823,0.053666,0.114424,0.158134,0.139672,0.119457,0.136937,0.130238,0.102282,0.065429,0.019845,0.004002,0.00325,0.00109,0.000851,0.00112,0.003208,0.003553,0.000668,0.000571,0.003107,0.003741
-7e-06,-1e-05,-2.6e-05,-2.5e-05,-0.001847,-0.032263,-0.019206,0.008563,-0.020624,0.060975,0.033079,-0.001794,0.013581,0.008032,-0.008106,-0.018204,-0.004656,0.000186,-0.000778,-0.000316,0.000196,-0.000178,-0.001216,-0.00128,0.000125,-0.000145,-0.001485,-0.002285
-5e-06,-2.3e-05,-2.8e-05,-8e-06,-0.000866,-0.023303,-0.024352,-0.089661,-0.163963,-0.175208,-0.142487,-0.103614,-0.119546,-0.123931,-0.081554,-0.039983,-0.012317,-0.003998,-0.0032,-0.001213,-0.001082,-0.001101,-0.001924,-0.002295,-0.000253,-0.000536,-0.001955,-0.001915
3e-06,9e-06,1.9e-05,1.5e-05,0.000957,0.01447,0.013115,0.002313,0.001015,0.017052,0.047218,0.049214,0.025011,0.02365,0.051876,0.045823,0.012366,0.001738,0.002161,0.000596,0.000258,0.000539,0.002637,0.002349,0.000235,-9.6e-05,0.000478,0.001104
-1e-06,1e-05,1.2e-05,2e-06,0.000851,0.024473,0.024583,0.085598,0.145541,0.108035,0.069819,0.045701,0.049076,0.054592,0.011692,-0.013211,-0.002921,0.00173,0.001196,0.000696,0.000767,0.000578,-0.000404,9.6e-05,0.000145,-8.1e-05,-0.000338,-0.000282
4e-06,2e-06,0,1e-06,0.000361,0.006121,-0.003287,-0.016513,0.018966,-0.082117,-0.080631,-0.034399,-0.022113,-0.007085,-0.030721,-0.024917,-0.005989,-0.00197,-0.001628,-0.00037,-0.000583,-0.000596,-0.003614,-0.00273,-0.000185,0.00054,0.001867,0.001866
1e-06,2e-06,-1e-06,-7e-06,-0.001,-0.019036,-0.021485,-0.0839,-0.098037,-0.017409,0.004822,-0.002654,0.014853,0.013759,0.036981,0.03669,0.008827,0.000419,0.000713,-4.7e-05,-0.000202,1.9e-05,0.00239,0.002361,7e-05,-0.000198,-0.000114,0.000435
5e-06,-1e-06,-9e-06,-1e-06,-0.000725,-0.014725,-0.010175,-0.020731,-0.048732,0.094304,0.069311,0.010225,0.010647,-0.015177,-0.012346,-0.013103,-0.002773,0.001327,-2.1e-05,-7.4e-05,0.000574,0.00037,0.004417,0.003433,0.000237,0.000172,-0.00125,-0.002553
5e-06,-3e-06,-4e-06,1e-05,0.00097,0.008514,0.00083,0.003441,0.00248,-0.052008,-0.049009,-0.014147,-0.037583,-0.034776,-0.032815,-0.017535,-0.002496,-0.001423,-0.001307,-0.000343,-0.000411,-0.00032,-0.001288,-0.00222,-6.6e-05,-0.000147,-0.000391,-8.3e-05
-3e-06,1e-06,8e-06,0,0.000377,0.013493,0.008063,0.010356,0.032465,-0.054332,-0.037168,-0.012804,-0.012783,0.011861,0.02767,0.028557,0.005195,-0.000771,0.00104,0.000331,-0.000333,-4.4e-05,-0.00293,-0.00259,1.1e-05,0.000451,0.001396,0.001063
-3e-06,7e-06,7e-06,-4e-06,-0.000643,0.001265,0.012159,0.073489,0.099248,0.089863,0.069055,0.031853,0.031103,0.020921,0.000378,-0.013004,-0.003854,0.001804,0.001028,0.000499,0.000693,0.000328,-0.000969,0.000537,0.000185,-0.000547,-0.000877,-2.8e-05
0,0,-6e-06,-1e-06,-4.2e-05,-0.009312,-0.00167,0.039347,0.0318,-0.004444,-0.006418,0.014591,0.014188,0.01254,-0.005646,-0.01032,2.8e-05,0.000154,-0.001055,-0.000348,-0.000105,-0.000245,-0.00073,6.5e-05,-4e-06,1e-04,0.000754,0.000974
-8e-06,-1e-05,-1.3e-05,-1.3e-05,0.000347,-0.004266,-0.010446,-0.069238,-0.132146,-0.095253,-0.06882,-0.056428,-0.022009,-0.014108,0.014237,0.02176,0.00344,-0.001332,-0.000457,-0.000521,-0.000653,-0.000222,0.000983,0.000128,-0.000134,0.000178,-7e-06,-0.000509
-4e-06,-3e-06,1e-06,3e-06,9e-06,0.004846,0.003905,-0.029512,-0.072529,0.038306,0.047226,0.012376,0.00095,-0.028912,-0.021344,-0.015398,-0.004844,0.000771,0.000478,0.000151,0.000436,0.000351,0.002537,0.001484,0.000167,-1e-05,-0.001003,-0.001603
2e-06,3e-06,4e-06,6e-06,-0.000723,-0.000635,0.006839,0.060341,0.103316,0.057327,0.039915,0.055922,0.019231,0.021439,-0.000118,-0.004865,0.001616,0.000672,0.00038,0.000403,0.000251,1.8e-05,0.000444,0.000159,8.4e-05,-0.000307,-0.000396,0.000411
