-0.000433,-0.00036,-0.000473,-0.000335,-0.000683,-0.000512,-0.000467,-0.000853,-0.000477,-0.00083,-0.000571,-0.000452,-0.000271,-0.000365,-0.000558,-0.000293,-0.000321,-0.000427,-0.000312,-0.00068,-0.000503,-0.000422,-0.000444,-0.000605,-0.000714,-0.000343,-0.001009,-0.000479,-0.000522,-0.000496,-0.000598,-0.000641,-0.000693,-0.000407,-0.000207,-0.000815,-0.000712,-0.000698,-0.000386,-0.000152,-0.00026,2e-06,-0.000107,-0.000356,-0.000271,-0.000338,-0.000203,-0.000125,-0.000555,-0.000503,-0.000603,-0.00061,-0.000524,-0.000529,-0.000307,-0.000414,-0.000423,-0.00044,-0.000633,-0.000278,-0.000606,-0.000543,-0.000152,-7.3e-05,-0.000405,-0.000313,-0.000382,-0.000188,-0.000277,-0.000186,-0.000315,-0.000301,-0.000305,-0.000283,-0.000271,-0.000108,-0.000206,-0.000381,-0.000831,-0.00057,-0.000469,-0.000213,-0.00031,-0.000312,-0.000397,-0.00035,-0.000279,-0.000593,-0.000269,-0.00019,-0.000308,-0.000423,-0.000267,-5.1e-05,-0.000231,-0.000301,-0.000195,-0.000138,-0.00018,-0.000636,-0.000357,-0.00033,-0.000267,-0.000179,-0.000347,-0.000348,-0.000481,-0.000246,-0.000214,-0.000173,-0.000223,-1e-04,-0.000232,-0.00025,-7e-05,-2e-06,-0.000273,-0.000204,-0.000223,-0.00035,-0.000268
-7.7e-05,7.4e-05,0.000181,0.000147,0.000253,0.000129,9.4e-05,4e-04,0.000111,0.000253,-2.6e-05,-5.5e-05,-0.000251,4.7e-05,7.3e-05,7e-06,-0.000368,-0.000134,0.000251,0.000212,0.000144,0.000173,0.000156,0.000133,0.000372,9.8e-05,0.000465,0.000205,3.8e-05,0.000183,0.000293,0.000216,0.000326,0.000121,0.000326,0.000451,0.000399,0.000367,-5.7e-05,-8.2e-05,0.000103,0.000135,-0.00015,-4.6e-05,8.1e-05,0.000176,5.5e-05,0.000132,0.000237,0.00027,0.000289,0.000318,0.000252,0.000337,0.000204,0.000108,-2e-06,-7.6e-05,0.000173,8e-06,0.000116,0.000239,5.7e-05,0.000167,0.000256,4.2e-05,8.1e-05,0.000175,-6.9e-05,0.000105,0.000207,0.00017,0.000177,8.6e-05,8.5e-05,-0.000177,2.3e-05,-0.000241,0.000252,0.000292,7.5e-05,6.3e-05,2.2e-05,0.000107,5e-06,0.000224,0.00011,0.000399,-3.7e-05,0.000146,2.3e-05,0.000129,8.1e-05,-9.7e-05,3e-05,0.000105,-0.000101,0.000229,-8e-05,0.000315,-0.000103,-7.8e-05,3.4e-05,-6.1e-05,0.000353,0.000257,0.00028,3.2e-05,9.9e-05,4.7e-05,0.000144,5.2e-05,7e-06,7.4e-05,-1.9e-05,-6.5e-05,-5.1e-05,0.000122,6.4e-05,0.000106,0.000126
-2.5e-05,-0.000181,7.3e-05,7e-06,-0.000258,-0.00015,-0.000186,-0.000163,1.9e-05,-2.8e-05,-8e-06,6.5e-05,0.000127,3.8e-05,-3e-05,-0.00014,0.000156,-0.000101,-0.000136,-2.8e-05,-0.00012,1.2e-05,-0.00011,-0.000198,1.7e-05,-8.3e-05,-0.000183,7.4e-05,9.7e-05,-0.000305,-0.00032,-3.3e-05,-0.000251,-0.000194,-1e-06,-0.000216,-2.8e-05,-0.000324,-5.2e-05,-0.000105,-0.000114,-0.000253,-2.4e-05,-0.000102,-0.000149,4.8e-05,-3.8e-05,-5.7e-05,-0.000314,-0.000344,-0.000163,-0.000159,-0.000148,-0.000259,-4.5e-05,-0.000213,-1.6e-05,-7.3e-05,-0.000251,-0.000189,0.000151,-6.6e-05,-0.00027,-0.000306,-0.000382,-5.3e-05,0.000111,-6.9e-05,4.3e-05,2.3e-05,-9.7e-05,-0.000111,-0.00013,-0.00011,-0.000126,-0.000152,-0.000222,-5.7e-05,-0.000238,-0.000267,-3e-04,-0.00045,-0.000308,-1.9e-05,8.5e-05,-0.000167,-0.000167,-0.000156,-9.5e-05,-0.000359,-2.3e-05,1e-05,2e-06,-0.000231,-0.000205,-8e-05,7e-06,-6e-05,-6.2e-05,-0.000134,5.8e-05,0.000106,9.6e-05,5e-06,-0.000198,-0.000181,-8.9e-05,-0.000133,-4.2e-05,0.000144,-0.000233,-0.000241,-5.6e-05,-2.9e-05,-0.000193,-0.000324,-4.8e-05,-0.000183,-0.000117,-3.8e-05,-0.000119
-0.000102,-2.3e-05,-0.000169,-9.6e-05,-0.000246,-0.00033,-0.000102,-0.000165,-0.000362,-0.000105,-0.000253,-0.000267,-0.000189,-0.000104,-7.1e-05,-0.000144,-0.000169,-9e-05,-0.000109,-0.000405,-0.000268,-0.000131,8.2e-05,-0.000105,-5.7e-05,-0.000185,-8e-05,-0.000254,-0.000266,0.000143,0.000102,-0.000106,-0.000124,0.000107,-0.000159,-0.00011,-0.000246,0.000159,4.1e-05,-6.1e-05,-0.00011,-0.000271,-7.3e-05,-3.5e-05,5.3e-05,-0.000183,-9.9e-05,3.5e-05,0.000126,0.000148,-9e-06,-0.000136,-0.000173,1.9e-05,9e-06,4.4e-05,-7.7e-05,5.9e-05,0.000215,9.2e-05,-0.000156,-0.000202,-6.3e-05,-5.4e-05,1.5e-05,-5e-06,-2.8e-05,-0.000109,0.000134,0.000108,5.1e-05,-5.3e-05,-0.000221,-0.000159,-0.000149,1.9e-05,-3.8e-05,-4.6e-05,-5.5e-05,-3.8e-05,0.000134,2.2e-05,0.000114,-2.4e-05,-4.2e-05,-0.000142,-6.5e-05,-4.1e-05,1.9e-05,-1.1e-05,-7.2e-05,-7.4e-05,-2.8e-05,5.4e-05,-1.2e-05,0.00012,-0.000108,-0.00031,-5.6e-05,-6.2e-05,2.9e-05,-3.7e-05,-0.000134,-1e-05,0.000164,-0.00015,-3.5e-05,-7.6e-05,-3.6e-05,1.7e-05,8.1e-05,-5e-05,-0.00014,-0.000129,-4.7e-05,-2e-04,-0.000299,2.6e-05,-8.2e-05,-8.9e-05,3.5e-05
0.000273,6.4e-05,7.3e-05,-1e-06,0.000282,0.000311,-0.000106,0.000158,0.00021,-1e-05,1.8e-05,0.000282,7.3e-05,-0.00012,-4.4e-05,0.000151,2.8e-05,0.000296,0.000149,1.8e-05,-7.1e-05,-0.000111,-0.000113,9e-06,-7.6e-05,-1.6e-05,0.000114,0.000113,0.000311,0.000233,-4.1e-05,-7.1e-05,0.000109,-0.000151,3.3e-05,-8.7e-05,0.00033,-3.3e-05,6.7e-05,0.000122,6e-06,-3.6e-05,5e-05,2.7e-05,-0.000189,0.000141,0.000163,-7.7e-05,-8.4e-05,6e-05,6.4e-05,0.000166,0.00027,0.000153,-5.2e-05,8.8e-05,-1.6e-05,3.4e-05,-0.000121,-9.2e-05,3e-06,9e-05,0.000108,0.000127,0.000288,-0.000198,-0.000111,2.5e-05,-1.8e-05,-0.00016,-2.3e-05,8.3e-05,0.000171,-1.5e-05,3.5e-05,-9.6e-05,8.2e-05,0.000158,0.000332,0.00013,8.1e-05,9.6e-05,1.8e-05,-3e-06,9.5e-05,-6e-06,-0.000164,-7e-06,6e-06,1.5e-05,-0.000112,9.5e-05,-4.1e-05,9.2e-05,7.6e-05,-9.9e-05,4.3e-05,5.5e-05,-2.5e-05,-1.6e-05,4.8e-05,-0.000112,2e-06,1.8e-05,-4.9e-05,-0.000108,-6.5e-05,6.5e-05,5.3e-05,-2.2e-05,-0.000235,6.7e-05,7.4e-05,6.9e-05,0.000122,0.000148,0.000195,-3.8e-05,-3.2e-05,-3.5e-05,-3.4e-05
-0.000157,-5.9e-05,-7.4e-05,2e-05,5.2e-05,-0.000158,4.7e-05,-2.7e-05,0.00015,3e-06,0.000104,-2.7e-05,-8.4e-05,-2.3e-05,-1e-05,-3.4e-05,0.000142,-8.5e-05,-0.000269,7.9e-05,0.000146,0.000138,3.2e-05,-1.7e-05,-1.9e-05,-4.6e-05,-6.2e-05,-0.000122,-0.000193,-0.00016,-0.000133,8.7e-05,0.000102,0.000115,-3.6e-05,-6.8e-05,-0.000223,2e-06,-0.000181,-0.000197,-4.2e-05,-1.7e-05,3e-06,-4.4e-05,4.7e-05,-8.4e-05,-0.000182,-9.8e-05,2.6e-05,-0.000187,-5.8e-05,-1e-04,-0.000131,1.5e-05,0.000103,4.7e-05,-4.6e-05,-0.000232,3.8e-05,2.9e-05,-2.7e-05,-8.3e-05,-3.3e-05,0.000149,-7e-05,6.6e-05,-0.00017,4.5e-05,-3.6e-05,0.000135,9e-06,-7.3e-05,-5.2e-05,4e-06,-7.9e-05,0.00013,8.5e-05,7.8e-05,-6e-05,5.3e-05,2e-06,5.6e-05,5.2e-05,0.000127,-2.7e-05,-0.000158,0.00015,-8.6e-05,-9.4e-05,0.000128,8.5e-05,-7e-05,2.5e-05,6.3e-05,5.6e-05,-3e-06,-8.2e-05,4.8e-05,4.2e-05,-6.3e-05,-0.000276,7.9e-05,-1.2e-05,-2.2e-05,6.1e-05,0.000124,0.00016,7.4e-05,5.4e-05,-2.1e-05,1.6e-05,-5.7e-05,9.9e-05,9e-06,3.2e-05,2.3e-05,8.6e-05,9.5e-05,-4.3e-05,0.000128,3.7e-05
8.7e-05,9.2e-05,0.000134,-5.8e-05,-2.5e-05,0.000174,2.8e-05,0,-5.2e-05,7.3e-05,-0.000125,-4.4e-05,0.000138,9e-06,-7.7e-05,0.000128,6.2e-05,-9.8e-05,-1.3e-05,0.000161,3.7e-05,2.3e-05,-0.000149,2.8e-05,-2.7e-05,-3.4e-05,0.000122,-4e-06,3e-05,-6.3e-05,6.2e-05,4.7e-05,-0.00015,-9e-06,-0.000117,0.000104,2.2e-05,-4.2e-05,8.9e-05,7e-05,-7.1e-05,-3.4e-05,-1e-06,-1e-05,0.000143,7.9e-05,3.7e-05,3.5e-05,-2.5e-05,6.8e-05,0.000125,3.1e-05,-4.6e-05,-2.2e-05,-0.000136,1.9e-05,2.9e-05,0.000222,4.7e-05,5.4e-05,-0.000118,-5e-06,-0.00012,-3.9e-05,6.2e-05,6.8e-05,0.000112,7.5e-05,1.8e-05,-9.4e-05,-7.4e-05,9.2e-05,6.2e-05,0.000112,1.8e-05,-5.9e-05,-0.000152,-0.000161,-0.000162,-1.7e-05,6.9e-05,-5.3e-05,3.7e-05,-9.4e-05,2.7e-05,0.000101,-3.4e-05,2.3e-05,0.000141,3.1e-05,-5e-05,-9e-06,3.4e-05,6e-06,6.1e-05,-1.3e-05,6.8e-05,9.9e-05,4.4e-05,1.6e-05,0.000183,-7.8e-05,-4.2e-05,1e-05,-8.7e-05,-8.2e-05,-6.6e-05,-5.2e-05,-0.000147,-4.8e-05,9.4e-05,9.3e-05,9.1e-05,-2.7e-05,3.2e-05,1.8e-05,-3e-06,-5.3e-05,6e-06,-6e-05,9e-06
-0.000119,-0.000121,8.5e-05,4.1e-05,-0.000169,-7e-05,-6.7e-05,-4.3e-05,-1e-04,3.2e-05,0.000269,2.5e-05,3e-06,-8.1e-05,-1.3e-05,-9.8e-05,5.3e-05,0.000138,8.1e-05,-0.000152,-2.3e-05,3.4e-05,0.000174,-5e-05,-5.2e-05,-7.8e-05,-0.000119,4.3e-05,-1.7e-05,2.7e-05,-6.1e-05,-2.8e-05,0.000173,-0.000174,0.000137,-2e-06,-5.3e-05,-2e-06,-0.000101,-2.4e-05,7.9e-05,0.000196,8.5e-05,0.000212,-0.000136,-4.8e-05,-4.3e-05,-9e-06,4.9e-05,-0.000146,-0.000133,-5.2e-05,4.6e-05,-4e-06,5e-06,-2.8e-05,-1.6e-05,-0.000161,-2.4e-05,-0.000141,-2.4e-05,-2.8e-05,8e-06,-0.000109,-0.000149,-7e-06,-0.00018,-3.3e-05,-0.000104,-7.3e-05,4.3e-05,-0.000118,1.6e-05,-1.2e-05,7.9e-05,6.3e-05,-0.000109,1.5e-05,1.8e-05,-2.5e-05,-0.000154,-9.4e-05,-0.000118,2.3e-05,-3.3e-05,1e-06,7e-06,1.2e-05,-9.1e-05,-8.8e-05,-2.5e-05,0.000155,-1.5e-05,3.3e-05,-2.8e-05,-4.2e-05,-5.5e-05,1.1e-05,1.9e-05,6e-06,-0.000134,3.2e-05,-1e-05,-2.3e-05,-4.6e-05,2.7e-05,5.9e-05,3.8e-05,3.6e-05,2e-06,-8.4e-05,-1.2e-05,-3.3e-05,4.4e-05,-1.8e-05,-0.000137,2.2e-05,-8e-06,5.8e-05,-5.4e-05,-2.6e-05
5.4e-05,-4e-05,-6.6e-05,-1.6e-05,0.000204,8.1e-05,9.1e-05,1e-06,0.000181,-1.3e-05,-0.000174,5e-06,-9.8e-05,0.000126,-2.2e-05,3e-06,-0.000143,-0.00016,-0.000107,9.6e-05,1.6e-05,-3e-06,-9.7e-05,6.4e-05,3.2e-05,8.2e-05,0.000101,-7e-05,-2.4e-05,-0.000131,0.000108,-3.4e-05,-0.000153,6e-05,-6e-06,1.1e-05,5e-06,1e-05,7.3e-05,-2e-06,0.000102,-9.2e-05,-3e-06,-2.5e-05,-1.3e-05,6.7e-05,-7.2e-05,-5e-05,-1.8e-05,9e-05,0.000109,-2.9e-05,-9.8e-05,-4.1e-05,5.3e-05,1.4e-05,4.2e-05,-3.7e-05,-4.9e-05,-2.7e-05,-2.4e-05,-8.1e-05,-4.5e-05,4.8e-05,7.3e-05,-1.4e-05,-1e-06,1.4e-05,0.000163,3.2e-05,-8.1e-05,6.5e-05,-6.3e-05,-7.4e-05,2.2e-05,-1e-06,6e-05,2.8e-05,2.3e-05,6e-06,5e-05,4.4e-05,6.7e-05,-2.6e-05,2.3e-05,-1e-04,5.5e-05,-1.1e-05,7.6e-05,5.3e-05,-4e-05,-0.000116,-5.9e-05,2.4e-05,-7.1e-05,1e-06,-4.2e-05,2e-06,-1e-06,-7.6e-05,7.6e-05,-2e-06,-1.2e-05,-3.8e-05,1.6e-05,-2.5e-05,-3e-05,-4.1e-05,3.6e-05,2.4e-05,4e-05,5.8e-05,-4.8e-05,-5.6e-05,6.3e-05,4e-06,-0.000102,-7e-05,2.9e-05,1.2e-05,1.1e-05
3.2e-05,0.000114,9.3e-05,1.4e-05,-0.000116,2.4e-05,-4.6e-05,-7.3e-05,-0.000115,0,0.000118,-3.2e-05,1.1e-05,-8e-06,2.1e-05,-1.4e-05,2.6e-05,1.5e-05,0.000104,-0.000125,-5.1e-05,2.9e-05,4.4e-05,2.9e-05,8.8e-05,-5.5e-05,-1e-06,1.5e-05,-4.1e-05,6.8e-05,-1.1e-05,5.2e-05,8.7e-05,1.8e-05,1.1e-05,-2.5e-05,-8e-06,-3.4e-05,4e-05,2e-05,1.6e-05,7.6e-05,2.6e-05,-1e-05,0,-7.7e-05,8.1e-05,-7.1e-05,0,0,-0.000101,6e-06,0.000103,5.8e-05,-3e-06,7e-06,0,1.7e-05,5.8e-05,0.000131,0.000119,9.2e-05,4.9e-05,3.6e-05,2.7e-05,-8.1e-05,1.9e-05,-4.7e-05,-9.7e-05,-3.5e-05,3.9e-05,-6.3e-05,2e-06,3.6e-05,4.7e-05,-3.7e-05,4.9e-05,-3e-05,2.1e-05,4e-05,-4.2e-05,3.1e-05,-1.9e-05,-2e-06,-3.2e-05,6.4e-05,-3.4e-05,3.6e-05,-4.3e-05,2.9e-05,-2e-06,0.000106,-4.7e-05,-8.4e-05,3.9e-05,1.6e-05,3.5e-05,-1.2e-05,2.1e-05,3e-05,9e-06,6.4e-05,3.2e-05,6.3e-05,-1.8e-05,3.4e-05,-7.6e-05,-1.7e-05,9.5e-05,-3e-06,3.1e-05,-8.8e-05,2e-06,-5e-06,3.8e-05,2.6e-05,7.3e-05,2.5e-05,-2e-05,-4.7e-05,1.6e-05
3.5e-05,-0.000102,-7.2e-05,-2.4e-05,-4e-06,-4.4e-05,-0.000249,-9e-06,8.1e-05,-3.4e-05,-7.7e-05,2e-05,1.4e-05,-6.2e-05,7.9e-05,1.7e-05,2.2e-05,4.2e-05,-2.2e-05,9.1e-05,1.8e-05,-5.4e-05,2e-06,8e-06,-4.8e-05,4.7e-05,-5.9e-05,1.6e-05,4.8e-05,-4.9e-05,5e-06,-1.8e-05,-6e-05,7e-06,-6.7e-05,4.1e-05,-5e-06,-3.7e-05,-4e-05,-6e-06,-7.1e-05,4.4e-05,3e-05,-6.5e-05,-2.4e-05,1e-06,-1e-05,4e-05,1.5e-05,6e-06,-8e-06,-1.8e-05,-4.7e-05,-6.4e-05,-5e-05,-3.1e-05,-6.5e-05,4.5e-05,1.5e-05,-5.9e-05,-9.7e-05,1.4e-05,2.9e-05,-9.4e-05,3.4e-05,3e-06,3.2e-05,1.4e-05,9.1e-05,-9e-06,-1.4e-05,2.7e-05,-4.9e-05,9e-06,-4.1e-05,2.5e-05,-1.9e-05,4.3e-05,2.4e-05,-8e-06,8.1e-05,-3.8e-05,-3e-06,2e-06,6.2e-05,-3.2e-05,2.8e-05,-5e-06,3.9e-05,-5.1e-05,8.9e-05,-6.7e-05,2.8e-05,8.5e-05,1.4e-05,-1.5e-05,-2.2e-05,5.5e-05,-2.4e-05,3.6e-05,3.9e-05,-2.4e-05,1.6e-05,-8.6e-05,7e-06,0,1.8e-05,-6e-06,-3.7e-05,-1.4e-05,2e-05,3.2e-05,-1.3e-05,1e-05,-1.7e-05,-3.9e-05,-5e-06,-1e-05,-6.6e-05,1.4e-05,-4e-06
7.7e-05,7e-05,-7e-06,-2e-05,1.4e-05,5.2e-05,0.000209,2.5e-05,-6.5e-05,4.4e-05,3.1e-05,5e-06,4e-06,5.2e-05,-2.8e-05,-4.7e-05,1e-06,-4.1e-05,-2.8e-05,-3.1e-05,-1e-06,6.7e-05,-3e-06,2.7e-05,-7e-06,1.5e-05,7.1e-05,6.4e-05,3e-06,2.6e-05,-4.1e-05,-1.6e-05,9.4e-05,4.6e-05,8.3e-05,-2.6e-05,2.8e-05,1.1e-05,1.1e-05,-7e-06,-1.9e-05,-3.9e-05,-4.1e-05,2e-05,7e-05,6.6e-05,-1.8e-05,3.1e-05,1e-06,-9e-06,1.8e-05,6.9e-05,-3.3e-05,1.2e-05,-1.2e-05,-3.6e-05,3.1e-05,1.1e-05,-2.8e-05,-9e-06,6.5e-05,-1.3e-05,-1.7e-05,2.1e-05,-4.3e-05,6.1e-05,-2.1e-05,-4e-05,-7e-05,-4.3e-05,-5.3e-05,-3.2e-05,2.6e-05,-1.2e-05,-5e-06,-4.6e-05,2.5e-05,-1.8e-05,-3.4e-05,-5e-06,-4.1e-05,4.5e-05,-1.8e-05,1.7e-05,-2.2e-05,7e-06,-2.4e-05,2.4e-05,-4.2e-05,1.5e-05,9e-06,4e-06,-1.8e-05,-5.5e-05,9e-06,3.8e-05,-7e-06,-2.9e-05,-9e-06,3.9e-05,-6e-06,-3.7e-05,-1.6e-05,5.2e-05,-8e-06,3e-05,-3.1e-05,9e-06,2.5e-05,1.5e-05,-9e-06,3e-06,5e-06,-4.2e-05,8e-06,2e-06,-2e-06,3.3e-05,3.9e-05,-3e-05,7e-06
-4.9e-05,-0.000113,3.2e-05,-3.6e-05,1.3e-05,-5e-06,-2.1e-05,0,3e-06,2.3e-05,-4.2e-05,4e-06,4.5e-05,-1e-05,1.8e-05,1.8e-05,6.4e-05,1.7e-05,-2.7e-05,-9e-05,1e-06,-1.2e-05,-6.8e-05,-7e-06,2e-05,1e-06,-6.3e-05,-0.000112,-3.2e-05,-2.4e-05,3.5e-05,-4e-06,-8e-06,-4.3e-05,-3.7e-05,7e-06,-1.6e-05,-2e-06,-4e-06,-6e-06,3.1e-05,4e-06,-2e-06,1e-06,-3.9e-05,-3.6e-05,1.3e-05,2.9e-05,1.7e-05,3.1e-05,-3.2e-05,-6.2e-05,2.4e-05,7e-06,-7.5e-05,3.9e-05,-1.5e-05,4.7e-05,1.3e-05,-1.6e-05,-5.3e-05,-8e-06,3.5e-05,-7e-06,1.9e-05,-1.7e-05,1.8e-05,-8.3e-05,6e-06,2.2e-05,2.2e-05,-6e-06,-3e-05,7e-06,1e-05,7e-06,-1.5e-05,-6.1e-05,-1.2e-05,1.1e-05,6e-06,-2.7e-05,2e-06,3.7e-05,-1.3e-05,1.4e-05,1.8e-05,-1.6e-05,-1.1e-05,1.1e-05,-3.7e-05,-4.7e-05,-1.5e-05,-2e-06,-6e-06,-1.8e-05,-1.5e-05,-2.3e-05,1.6e-05,-1.9e-05,3e-06,4.3e-05,6e-06,-1.4e-05,6e-06,-2.9e-05,3.3e-05,4e-06,-2.5e-05,2.8e-05,4e-06,-3.2e-05,-2.7e-05,1.2e-05,-4.2e-05,1.4e-05,-1.1e-05,2e-05,1.4e-05,4.6e-05,2.5e-05
-2.9e-05,5.6e-05,3.6e-05,-1e-06,-2e-05,1.8e-05,6.5e-05,4e-06,-9e-06,-6.3e-05,5e-06,-9e-06,-3.9e-05,4.6e-05,-1.7e-05,-1.7e-05,-3e-05,-7e-06,1.4e-05,9e-06,-9e-06,-2.1e-05,3.7e-05,9e-06,-6e-06,-2.6e-05,1e-05,-1.3e-05,3.5e-05,1.5e-05,-4.3e-05,-5e-06,1e-06,-5e-06,2.7e-05,2.2e-05,5e-06,-1.1e-05,-4e-06,1e-05,1.5e-05,-1.5e-05,-8e-06,2.9e-05,2.2e-05,-8e-06,-4e-06,2.5e-05,-2.2e-05,-3.5e-05,6e-06,3e-06,-3e-05,-1.3e-05,3.9e-05,-2.7e-05,1.2e-05,-4.5e-05,-3.6e-05,1.2e-05,1.4e-05,1.3e-05,3e-06,-2.2e-05,-9e-06,-1.9e-05,-5.7e-05,6e-06,-2.7e-05,-4e-06,3.7e-05,-9e-06,2.2e-05,1.2e-05,1e-06,-3e-06,-8e-06,5.8e-05,1e-05,-1.4e-05,-1.8e-05,-3e-06,1e-06,-2.9e-05,-3e-06,-5e-06,1.9e-05,-1.1e-05,-1e-05,-2.3e-05,1.6e-05,3e-05,1.3e-05,5e-06,3.1e-05,-2.6e-05,3.1e-05,1.5e-05,-1.2e-05,-1.1e-05,-2.2e-05,-3.9e-05,0,1.6e-05,2e-06,7e-06,-1.2e-05,-5e-06,-1.2e-05,-3.6e-05,0,-1.8e-05,3.7e-05,4e-06,-9e-06,8e-06,0,-4e-06,1.3e-05,2.7e-05,-1.1e-05
-9e-06,-4e-06,-6.9e-05,1.1e-05,1.5e-05,-1.6e-05,-2.7e-05,1e-06,-3e-05,3.7e-05,2.1e-05,-1.1e-05,-4e-06,-4.7e-05,-1.4e-05,1.4e-05,4e-06,2e-06,3e-06,1.1e-05,7e-06,5e-06,1.7e-05,-1.1e-05,1.9e-05,9e-06,-7e-06,-6e-06,-8e-06,2e-06,2.2e-05,2e-05,8e-06,2.5e-05,0,-2.2e-05,-1.9e-05,1e-06,-3e-06,-1.4e-05,-2.1e-05,5e-06,-1.7e-05,-4e-06,4e-05,1.3e-05,-2.5e-05,-3.4e-05,7e-06,1.2e-05,-7e-06,-3.2e-05,2.1e-05,7e-06,2e-06,1.7e-05,-1e-06,2e-05,2.3e-05,8e-06,-1e-05,-1.4e-05,-1e-05,2.9e-05,-7e-06,-1.4e-05,1e-05,1.5e-05,1e-05,1.3e-05,-2.8e-05,2.4e-05,1e-06,-1e-05,1.4e-05,0,-3.2e-05,-5e-06,-2e-05,-4e-06,-9e-06,1e-06,-1e-05,-1.7e-05,1.5e-05,-1.3e-05,-1.9e-05,-1.5e-05,-1.3e-05,5e-06,0,-5e-06,2e-06,-2.7e-05,6e-06,1e-06,-1e-06,-1.2e-05,5e-06,-1.6e-05,3.8e-05,2.1e-05,-8e-06,6e-06,-1.4e-05,1.2e-05,-2e-06,-1.1e-05,-1e-06,-7e-06,2.4e-05,2.2e-05,-4e-06,3e-06,3e-06,-1e-06,2e-05,2.7e-05,-1e-06,0,5e-06
-1.1e-05,-7e-06,-5e-06,9e-06,-1.1e-05,1e-05,-2.4e-05,-5.7e-05,1e-06,-2.9e-05,-1.9e-05,5e-06,2.1e-05,2.7e-05,3e-06,-6e-06,-1.9e-05,-2e-05,8e-06,2.1e-05,-5e-06,-7e-06,-3.8e-05,-2e-06,-1.1e-05,3e-06,2e-06,2.2e-05,1.2e-05,-6e-06,0,-1.2e-05,1e-06,-8e-06,-2.8e-05,6e-06,1.9e-05,-1.5e-05,-1.7e-05,5e-06,1.4e-05,4e-06,5e-06,-8e-06,-1.4e-05,3e-06,1.4e-05,1e-06,-1e-05,-8e-06,1e-05,3e-05,-8e-06,3e-06,7e-06,-1.4e-05,-1.3e-05,-7e-06,-1.9e-05,-2e-05,2.7e-05,8e-06,1.2e-05,-6e-06,-1.1e-05,0,0,-1.4e-05,8e-06,-1.1e-05,-7e-06,-1.7e-05,1e-05,2.3e-05,-4e-06,6e-06,5e-06,2e-06,-4e-06,1e-06,1.4e-05,8e-06,4e-06,2e-06,-5e-06,1.6e-05,2e-06,1.2e-05,1.2e-05,3e-06,1.1e-05,1e-06,4e-06,6e-06,-9e-06,7e-06,7e-06,-8e-06,-3e-06,4e-06,-1.5e-05,-2e-06,1e-06,-2e-06,1.1e-05,0,1.8e-05,0,8e-06,-2e-05,2e-06,-1.5e-05,4e-06,-3e-06,-6e-06,8e-06,-2.5e-05,-2.1e-05,-1.9e-05,-2e-05,-4e-06
2e-06,1.2e-05,9e-06,-3e-06,7e-06,-1.4e-05,1e-05,2.2e-05,-5e-06,1.8e-05,1.5e-05,-1.5e-05,-1.2e-05,2.5e-05,0,1.4e-05,1.3e-05,9e-06,9e-06,-2.1e-05,7e-06,7e-06,2.9e-05,0,5e-06,2e-06,-6e-06,-1.9e-05,-1.6e-05,-3e-06,-2.4e-05,5e-06,-6e-06,3e-06,0,-2e-06,-1.6e-05,1e-06,4e-06,-1e-06,-1.5e-05,1.8e-05,-7e-06,-7e-06,-1e-05,-1.3e-05,3e-06,-1e-06,-1e-06,7e-06,7e-06,-1e-06,1.1e-05,6e-06,3e-06,1e-06,1.5e-05,1.3e-05,1.1e-05,-1e-06,-4e-06,3e-06,-1.5e-05,1.3e-05,4e-06,2.3e-05,3e-06,1.1e-05,-2e-06,2e-06,1.7e-05,-1e-06,4e-06,-1.7e-05,-1.4e-05,-9e-06,1.3e-05,7e-06,1.3e-05,-1e-06,-1.3e-05,-6e-06,5e-06,-7e-06,-5e-06,-1.3e-05,7e-06,-4e-06,9e-06,6e-06,-5e-06,-2e-06,-1.1e-05,-5e-06,7e-06,4e-06,-2e-05,-7e-06,2e-06,7e-06,1.5e-05,5e-06,-1e-06,-1.4e-05,-3e-06,-8e-06,6e-06,5e-06,3e-06,7e-06,-1.2e-05,0,3e-06,1e-06,-4e-06,7e-06,6e-06,6e-06,-6e-06,-4e-06,-4e-06
1.5e-05,8e-06,0,-5e-06,-1.3e-05,-4e-06,3.3e-05,-7e-06,0,8e-06,-2.4e-05,3e-06,0,-2.5e-05,8e-06,4e-06,-2.7e-05,-4e-06,-7e-06,-2.5e-05,-3e-06,-4e-06,-1.4e-05,0,1e-06,-2e-06,3e-06,1.4e-05,-1.1e-05,6e-06,3e-06,-4e-06,-8e-06,1.5e-05,0,2e-06,1.2e-05,9e-06,2e-06,-1e-06,-6e-06,-1.2e-05,3e-06,7e-06,-6e-06,1.1e-05,-6e-06,6e-06,-3e-06,-1e-06,9e-06,-1e-05,-1.5e-05,-8e-06,-1.2e-05,1e-06,-8e-06,-9e-06,-5e-06,1.1e-05,-1.4e-05,0,1.2e-05,7e-06,-3e-06,-1.4e-05,8e-06,7e-06,2e-06,-1.1e-05,-4e-06,0,6e-06,2e-06,-1e-06,1e-05,0,6e-06,-2e-06,7e-06,-1e-05,7e-06,-2e-06,-3e-06,-1e-06,3e-06,3e-06,-7e-06,-6e-06,-1e-05,2e-06,-1.5e-05,-1.1e-05,-6e-06,-7e-06,3e-06,4e-06,-2e-06,0,6e-06,-1.4e-05,-1.5e-05,-2e-06,8e-06,2e-06,0,8e-06,-8e-06,-3e-06,1e-05,1e-06,1e-06,2e-06,-2e-06,-1e-06,-8e-06,-2e-06,-3e-06,1.6e-05,2e-06,-2e-06
2e-06,-1e-05,1.1e-05,0,6e-06,-1e-06,-1.2e-05,1e-05,1e-06,-2.1e-05,1.9e-05,-2e-06,-4e-06,4e-06,3e-06,1.3e-05,2e-06,-1.5e-05,-1.1e-05,2.8e-05,1e-06,-1.2e-05,-3e-06,-4e-06,-2e-05,4e-06,-6e-06,-1.7e-05,8e-06,-2e-06,-2e-06,6e-06,2e-06,-3e-06,1.5e-05,-2e-06,-4e-06,-1.2e-05,-1.2e-05,0,0,-4e-06,1e-06,9e-06,-3e-06,-3e-06,4e-06,0,-4e-06,0,-6e-06,-1e-06,5e-06,-3e-06,3e-06,-3e-06,7e-06,1.6e-05,4e-06,-1e-06,1e-06,7e-06,-1.3e-05,-9e-06,4e-06,-1.4e-05,3e-06,5e-06,1e-06,-6e-06,-5e-06,3e-06,-4e-06,5e-06,-1e-06,-6e-06,3e-06,-4e-06,6e-06,-2e-06,1.4e-05,-5e-06,4e-06,5e-06,6e-06,5e-06,-9e-06,2e-06,1.1e-05,-2e-06,1.1e-05,1.3e-05,-2e-06,9e-06,-1e-06,-1e-06,-4e-06,-1e-06,-1e-06,-4e-06,0,1.3e-05,3e-06,-2e-06,-1e-06,1.5e-05,-1.5e-05,3e-06,-6e-06,3e-06,1.2e-05,3e-06,6e-06,-3e-06,-1e-05,-1e-06,-2e-06,-3e-06,3e-06,-4e-06,-2e-06
-2e-06,3e-06,-1.8e-05,-1e-06,0,-1e-05,0,-8e-06,-3e-06,5e-06,-1.1e-05,6e-06,-1e-06,9e-06,-3e-06,-7e-06,-8e-06,1.2e-05,5e-06,7e-06,1e-06,1.3e-05,-4e-06,-1e-06,1.2e-05,-7e-06,8e-06,1.1e-05,2e-06,-1.2e-05,-4e-06,-1e-06,-1e-05,4e-06,-1.3e-05,-1e-06,4e-06,1.1e-05,8e-06,1e-06,1.7e-05,1.3e-05,3e-06,-2e-06,2e-05,-2e-06,1e-06,-5e-06,1e-06,-1e-06,-1e-06,1.4e-05,5e-06,4e-06,-8e-06,0,-7e-06,-1e-05,2e-06,-1.1e-05,-1e-06,-1e-06,3e-06,9e-06,-2e-06,9e-06,-1.6e-05,7e-06,-1.6e-05,1e-06,4e-06,-1e-06,1e-06,-5e-06,3e-06,5e-06,5e-06,-5e-06,-4e-06,-5e-06,-8e-06,1e-06,-3e-06,2e-06,1e-06,-6e-06,6e-06,-2e-06,-8e-06,1.1e-05,8e-06,3e-06,0,1e-06,-7e-06,-3e-06,5e-06,2e-06,1e-06,4e-06,-6e-06,-1.1e-05,-6e-06,-4e-06,2e-06,-6e-06,-5e-06,2e-06,-8e-06,-1e-06,0,-5e-06,-1e-05,4e-06,9e-06,5e-06,2e-06,5e-06,-3e-06,-9e-06,-1e-06
-1e-05,-6e-06,6e-06,1e-06,-3e-06,4e-06,-9e-06,9e-06,1e-05,4e-06,1.6e-05,-7e-06,4e-06,-4e-06,-6e-06,4e-06,4e-06,-9e-06,6e-06,-1.4e-05,-1e-06,-7e-06,1e-05,-4e-06,0,0,-1e-06,-2e-06,-7e-06,1.4e-05,2e-06,-3e-06,-1e-06,-1e-06,9e-06,2e-06,-7e-06,0,-6e-06,-3e-06,-1e-06,-3e-06,3e-06,-6e-06,-1.3e-05,-5e-06,-4e-06,8e-06,-3e-06,1e-06,4e-06,-5e-06,-1.1e-05,-1e-06,6e-06,5e-06,0,1.5e-05,0,5e-06,4e-06,-6e-06,2e-06,-3e-06,2e-06,2e-06,4e-06,-1e-06,1.2e-05,-2e-06,2e-06,-3e-06,2e-06,-1e-06,0,0,-5e-06,-1e-06,-2e-06,4e-06,4e-06,0,-1e-06,4e-06,-1e-06,4e-06,-5e-06,-3e-06,9e-06,-5e-06,-3e-06,0,-2e-06,4e-06,-2e-06,-1e-06,-6e-06,-4e-06,1e-06,2e-06,5e-06,4e-06,2e-06,4e-06,-1e-06,-2e-06,3e-06,-5e-06,-2e-06,-5e-06,-6e-06,8e-06,-1e-06,-6e-06,-4e-06,-1e-06,-7e-06,1e-06,-4e-06,1e-05,3e-06
-1e-05,-1e-06,6e-06,0,0,-1.3e-05,-3e-06,-5e-06,-5e-06,-1e-06,-1.9e-05,1.4e-05,4e-06,5e-06,-3e-06,-5e-06,4e-06,3e-06,-1e-06,-6e-06,2e-06,7e-06,-3e-06,0,5e-06,3e-06,0,-2e-06,1.5e-05,-3e-06,0,1e-06,-1e-06,-5e-06,-1.5e-05,-4e-06,6e-06,-1.1e-05,-4e-06,1e-06,-1e-05,-1e-06,0,-6e-06,0,1.2e-05,1e-06,3e-06,1e-06,-6e-06,-5e-06,-9e-06,1e-05,-1e-06,7e-06,-5e-06,1e-06,-8e-06,2e-06,-2e-06,-6e-06,5e-06,-2e-06,-6e-06,0,3e-06,-8e-06,-8e-06,-1e-05,6e-06,-3e-06,2e-06,-4e-06,-6e-06,-4e-06,-4e-06,-5e-06,5e-06,-1e-06,-1e-06,-2e-06,-2e-06,1e-06,-5e-06,1e-06,3e-06,7e-06,1e-06,0,-4e-06,-1e-06,3e-06,-4e-06,1e-06,-3e-06,-3e-06,4e-06,-2e-06,-2e-06,-2e-06,-1e-06,3e-06,-1e-06,-1e-06,-3e-06,0,-4e-06,5e-06,4e-06,-1e-06,0,-2e-06,-3e-06,-1e-06,5e-06,-1e-06,9e-06,-1e-06,-6e-06,8e-06,-3e-06
3e-06,6e-06,-7e-06,-2e-06,4e-06,6e-06,2.4e-05,1e-06,4e-06,3e-06,1.6e-05,-1.1e-05,-7e-06,-9e-06,0,1e-06,-1e-06,4e-06,0,1e-06,-1e-06,-3e-06,-4e-06,-3e-06,-2e-06,-1e-06,3e-06,-9e-06,-1.2e-05,-4e-06,-3e-06,-1e-06,2e-06,5e-06,8e-06,3e-06,-4e-06,5e-06,3e-06,0,-3e-06,3e-06,4e-06,0,3e-06,-9e-06,-1e-06,3e-06,1e-06,6e-06,-4e-06,3e-06,-7e-06,1e-06,-5e-06,2e-06,-2e-06,1e-06,-3e-06,4e-06,1.7e-05,4e-06,1e-06,3e-06,0,-2e-06,1e-06,3e-06,1.2e-05,-5e-06,-1e-06,-3e-06,1e-06,1e-05,-3e-06,4e-06,0,-8e-06,1e-06,-2e-06,0,2e-06,-3e-06,4e-06,-2e-06,-6e-06,-4e-06,-1e-06,-1e-06,3e-06,0,-2e-06,3e-06,5e-06,4e-06,1e-06,-4e-06,5e-06,1e-06,-4e-06,5e-06,-3e-06,-1e-06,3e-06,5e-06,5e-06,0,0,6e-06,0,2e-06,0,0,2e-06,4e-06,5e-06,-4e-06,2e-06,8e-06,0,-1e-06
3e-06,-1.2e-05,1.3e-05,-1e-06,-4e-06,-5e-06,-3e-06,-5e-06,3e-06,-1e-06,-8e-06,8e-06,0,1.1e-05,1e-06,-8e-06,3e-06,-1e-06,4e-06,1.2e-05,1e-06,-4e-06,5e-06,0,-4e-06,-2e-06,-2e-06,7e-06,7e-06,6e-06,-2e-06,1e-06,-7e-06,2e-06,3e-06,1e-06,0,0,1e-06,-4e-06,6e-06,-1e-06,-1e-06,2e-06,6e-06,-1e-06,-2e-06,-5e-06,-1e-06,-4e-06,4e-06,1e-06,3e-06,3e-06,-5e-06,0,5e-06,-1e-06,3e-06,-4e-06,-9e-06,-2e-06,-4e-06,-1e-06,1e-06,-1.2e-05,7e-06,2e-06,0,0,0,1e-06,-1e-06,-1.1e-05,2e-06,-5e-06,4e-06,6e-06,-1e-06,3e-06,0,-2e-06,0,-4e-06,2e-06,2e-06,-6e-06,-2e-06,2e-06,4e-06,9e-06,-3e-06,2e-06,-2e-06,-1e-06,3e-06,5e-06,5e-06,0,0,-5e-06,4e-06,0,-4e-06,0,-4e-06,-3e-06,-4e-06,-1e-06,4e-06,1e-06,-1e-06,-1e-06,-3e-06,4e-06,0,4e-06,1e-06,2e-06,-2e-06,1e-06
7e-06,1.2e-05,-2e-06,-2e-06,0,5e-06,-2e-06,-2e-06,-3e-06,-8e-06,2e-06,-5e-06,3e-06,-1e-06,2e-06,3e-06,-1e-06,-6e-06,-5e-06,-6e-06,0,9e-06,-5e-06,-1e-06,1e-06,1e-06,1e-06,5e-06,-3e-06,-2e-06,4e-06,-2e-06,4e-06,-4e-06,2e-06,-3e-06,0,-1e-05,-4e-06,4e-06,0,-1e-06,1e-06,2e-06,-1e-06,0,4e-06,-4e-06,1e-06,1e-06,-6e-06,-1e-06,-1e-06,-3e-06,2e-06,0,-5e-06,4e-06,-2e-06,-1e-06,-4e-06,3e-06,0,-1e-06,1e-06,9e-06,-2e-06,-1.1e-05,-4e-06,2e-06,3e-06,-2e-06,1e-06,7e-06,-1e-06,3e-06,2e-06,-2e-06,3e-06,0,-2e-06,2e-06,-1e-06,-3e-06,-2e-06,2e-06,1e-05,3e-06,-4e-06,-6e-06,-1e-06,0,-1e-06,1e-06,-2e-06,1e-06,-5e-06,-8e-06,-1e-06,3e-06,-2e-06,-6e-06,-2e-06,4e-06,-1e-06,0,4e-06,3e-06,2e-06,-1e-06,-3e-06,3e-06,-2e-06,1e-06,-2e-06,0,-2e-06,-5e-06,1e-06,2e-06,-1e-06
5e-06,-7e-06,-5e-06,0,1e-06,-4e-06,-8e-06,-3e-06,0,7e-06,2e-06,2e-06,-3e-06,-8e-06,0,-3e-06,3e-06,6e-06,0,-1e-05,0,-6e-06,-1e-06,0,-2e-06,2e-06,1e-06,-5e-06,-2e-06,-3e-06,-3e-06,0,-5e-06,4e-06,-3e-06,3e-06,3e-06,7e-06,2e-06,-3e-06,1e-06,2e-06,1e-06,-3e-06,-5e-06,6e-06,-2e-06,1e-06,-1e-06,2e-06,5e-06,-3e-06,0,-1e-06,-5e-06,-1e-06,3e-06,-4e-06,1e-06,2e-06,-3e-06,0,2e-06,1e-06,-1e-06,3e-06,-2e-06,-3e-06,3e-06,-4e-06,1e-06,3e-06,0,-4e-06,2e-06,-2e-06,-1e-06,0,2e-06,-1e-06,0,-2e-06,-1e-06,2e-06,0,-4e-06,-7e-06,0,2e-06,1e-06,-3e-06,4e-06,-1e-06,0,2e-06,1e-06,2e-06,3e-06,0,2e-06,-2e-06,5e-06,1e-06,-2e-06,1e-06,0,5e-06,-2e-06,-5e-06,2e-06,-5e-06,-3e-06,4e-06,0,4e-06,1e-06,1e-06,5e-06,-6e-06,0,0
-1e-06,1e-06,-5e-06,0,0,5e-06,6e-06,0,-2e-06,3e-06,-3e-06,-2e-06,2e-06,7e-06,-1e-06,2e-06,-3e-06,-5e-06,3e-06,0,0,4e-06,2e-06,0,1e-06,-2e-06,-1e-06,-4e-06,1e-06,3e-06,5e-06,1e-06,2e-06,-2e-06,-4e-06,-3e-06,-1e-06,-1e-06,1e-06,1e-06,1e-06,-1e-06,-2e-06,-2e-06,-1e-06,-9e-06,1e-06,2e-06,0,-1e-06,-3e-06,4e-06,0,3e-06,7e-06,1e-06,-3e-06,8e-06,-2e-06,0,7e-06,-1e-06,-4e-06,2e-06,2e-06,-4e-06,0,4e-06,-8e-06,3e-06,-4e-06,-4e-06,3e-06,-3e-06,1e-06,0,3e-06,3e-06,-1e-06,0,0,2e-06,0,2e-06,-3e-06,4e-06,1e-06,-2e-06,-4e-06,3e-06,2e-06,-3e-06,-3e-06,-4e-06,-2e-06,-1e-06,-2e-06,2e-06,-1e-06,-1e-06,0,-7e-06,-1e-06,-1e-06,0,2e-06,1e-06,-1e-06,0,-1e-06,2e-06,1e-06,1e-06,0,-3e-06,1e-06,3e-06,-3e-06,-1e-06,-6e-06,1e-06
-2e-06,1e-06,9e-06,0,-1e-06,0,0,2e-06,0,-7e-06,4e-06,1e-06,-1e-06,-2e-06,-3e-06,-3e-06,3e-06,-1e-06,0,8e-06,0,-3e-06,4e-06,0,2e-06,0,0,-1e-06,1e-06,-1e-06,-2e-06,0,-4e-06,-1e-06,6e-06,3e-06,0,-8e-06,-2e-06,0,-1e-06,-1e-06,1e-06,0,7e-06,5e-06,-1e-06,3e-06,0,0,2e-06,-4e-06,-3e-06,-1e-06,-3e-06,-2e-06,2e-06,-7e-06,-1e-06,-3e-06,-1e-06,2e-06,2e-06,1e-06,0,2e-06,-7e-06,-2e-06,5e-06,-4e-06,1e-06,3e-06,-2e-06,6e-06,-1e-06,2e-06,-1e-06,-2e-06,-2e-06,-1e-06,-1e-06,-2e-06,0,1e-06,3e-06,0,-1e-06,-1e-06,1e-06,1e-06,3e-06,1e-06,0,0,0,-3e-06,2e-06,-2e-06,1e-06,-2e-06,4e-06,6e-06,-1e-06,0,-1e-06,-1e-06,1e-06,2e-06,-1e-06,1e-06,2e-06,-1e-06,2e-06,-1e-06,3e-06,0,-5e-06,0,1e-06,-4e-06,0
-3e-06,-2e-06,0,1e-06,0,2e-06,9e-06,0,-1e-06,4e-06,-5e-06,0,-2e-06,-2e-06,0,4e-06,-2e-06,-1e-06,1e-06,1e-06,0,0,-5e-06,0,0,-1e-06,0,5e-06,-2e-06,-1e-06,-2e-06,0,4e-06,2e-06,-4e-06,-2e-06,1e-06,6e-06,1e-06,2e-06,-4e-06,2e-06,-1e-06,3e-06,-3e-06,-1e-06,1e-06,-2e-06,-1e-06,1e-06,0,0,5e-06,-2e-06,4e-06,1e-06,-1e-06,5e-06,1e-06,0,-1e-06,0,-2e-06,-1e-06,-2e-06,-4e-06,2e-06,0,-1e-06,2e-06,2e-06,-3e-06,1e-06,-7e-06,-1e-06,-2e-06,-3e-06,1e-06,-1e-06,2e-06,2e-06,2e-06,0,-1e-06,-1e-06,-2e-06,-2e-06,1e-06,0,-5e-06,1e-06,-1e-06,-1e-06,-2e-06,-2e-06,0,-3e-06,1e-06,-1e-06,0,0,-4e-06,1e-06,0,-1e-06,-1e-06,-4e-06,-1e-06,5e-06,-1e-06,-5e-06,0,0,1e-06,-4e-06,1e-06,3e-06,3e-06,5e-06,5e-06,1e-06
-2e-06,1e-06,-3e-06,0,1e-06,2e-06,-1e-05,1e-06,0,-4e-06,7e-06,0,3e-06,0,-1e-06,1e-06,2e-06,3e-06,0,-8e-06,0,3e-06,2e-06,1e-06,-3e-06,1e-06,-1e-06,-3e-06,4e-06,1e-06,1e-06,0,-1e-06,-2e-06,5e-06,1e-06,-2e-06,-1e-06,0,-3e-06,1e-06,0,-1e-06,2e-06,0,0,-2e-06,-1e-06,0,-3e-06,2e-06,0,-5e-06,0,-3e-06,0,0,-3e-06,0,1e-06,4e-06,-1e-06,3e-06,0,-1e-06,2e-06,1e-06,1e-06,2e-06,-2e-06,-1e-06,2e-06,0,3e-06,1e-06,3e-06,-1e-06,1e-06,-1e-06,0,-2e-06,-2e-06,1e-06,1e-06,2e-06,3e-06,4e-06,1e-06,-1e-06,2e-06,-3e-06,-3e-06,-1e-06,-2e-06,1e-06,1e-06,2e-06,-1e-06,-1e-06,1e-06,1e-06,2e-06,-1e-06,-2e-06,1e-06,0,0,-1e-06,1e-06,0,-1e-06,-1e-06,1e-06,-1e-06,0,1e-06,-3e-06,-3e-06,-2e-06,4e-06,0
2e-06,1e-06,-2e-06,1e-06,-1e-06,-2e-06,-1e-06,-2e-06,1e-06,1e-06,-9e-06,1e-06,-1e-06,-2e-06,1e-06,3e-06,0,-5e-06,-1e-06,-3e-06,0,-4e-06,-1e-06,0,-1e-06,1e-06,1e-06,2e-06,-3e-06,0,-3e-06,0,3e-06,0,-4e-06,-1e-06,0,-5e-06,1e-06,3e-06,4e-06,-2e-06,0,0,-2e-06,-2e-06,2e-06,1e-06,0,2e-06,-1e-06,0,2e-06,2e-06,-2e-06,-1e-06,1e-06,1e-06,1e-06,-1e-06,-3e-06,3e-06,-1e-06,1e-06,0,5e-06,-2e-06,0,3e-06,-1e-06,-1e-06,-2e-06,0,-2e-06,2e-06,-2e-06,2e-06,-3e-06,1e-06,-1e-06,2e-06,1e-06,0,1e-06,-2e-06,-1e-06,-6e-06,-1e-06,2e-06,4e-06,-2e-06,4e-06,0,0,0,0,-2e-06,-1e-06,1e-06,0,-4e-06,0,0,3e-06,0,1e-06,0,1e-06,1e-06,-1e-06,0,1e-06,-1e-06,-1e-06,-2e-06,1e-06,2e-06,1e-06,-1e-06,-1e-06,0
4e-06,-3e-06,-3e-06,0,-1e-06,5e-06,0,-1e-06,0,6e-06,1e-05,-1e-06,-1e-06,4e-06,1e-06,-2e-06,0,5e-06,0,7e-06,0,2e-06,-1e-06,1e-06,1e-06,-1e-06,0,-5e-06,2e-06,1e-06,0,0,1e-06,2e-06,1e-06,0,0,5e-06,-2e-06,-1e-06,0,1e-06,-1e-06,-1e-06,3e-06,4e-06,-3e-06,1e-06,0,-1e-06,1e-06,-2e-06,-1e-06,-1e-06,2e-06,1e-06,-2e-06,-3e-06,-1e-06,0,-2e-06,0,-1e-06,-1e-06,0,-5e-06,3e-06,3e-06,-4e-06,2e-06,0,3e-06,-1e-06,3e-06,0,1e-06,0,1e-06,1e-06,1e-06,-1e-06,-1e-06,0,-3e-06,2e-06,-1e-06,2e-06,-1e-06,-1e-06,-5e-06,3e-06,0,0,0,1e-06,1e-06,1e-06,2e-06,0,-1e-06,2e-06,-2e-06,0,-2e-06,-1e-06,1e-06,-2e-06,0,-2e-06,2e-06,0,-1e-06,-1e-06,1e-06,0,0,-2e-06,1e-06,-2e-06,0,1e-06
2e-06,2e-06,7e-06,0,1e-06,-2e-06,4e-06,-1e-06,-1e-06,-6e-06,-9e-06,1e-06,0,-5e-06,0,2e-06,1e-06,-4e-06,2e-06,3e-06,0,-2e-06,1e-06,0,2e-06,-2e-06,-1e-06,4e-06,0,-2e-06,0,0,1e-06,-2e-06,-3e-06,0,1e-06,-3e-06,2e-06,-1e-06,-2e-06,0,1e-06,-1e-06,2e-06,-3e-06,2e-06,0,0,1e-06,-2e-06,1e-06,-1e-06,-1e-06,0,0,2e-06,3e-06,1e-06,-1e-06,-1e-06,-1e-06,3e-06,-1e-06,0,0,-2e-06,1e-06,0,-2e-06,1e-06,-3e-06,0,-4e-06,0,0,0,-1e-06,0,0,0,1e-06,0,0,-2e-06,3e-06,1e-06,1e-06,0,0,1e-06,0,1e-06,0,1e-06,0,-1e-06,-1e-06,0,0,-3e-06,1e-06,-1e-06,0,1e-06,-2e-06,-1e-06,-1e-06,-2e-06,0,1e-06,1e-06,-2e-06,-1e-06,-2e-06,1e-06,-1e-06,-2e-06,1e-06,3e-06,0
0,-2e-06,-4e-06,0,0,3e-06,1e-06,-1e-06,0,-1e-06,6e-06,-2e-06,0,1e-06,0,-2e-06,-2e-06,2e-06,-1e-06,-6e-06,0,1e-06,1e-06,1e-06,1e-06,1e-06,1e-06,-2e-06,-2e-06,0,-1e-06,0,1e-06,1e-06,3e-06,0,-1e-06,-3e-06,-1e-06,1e-06,-1e-06,0,0,1e-06,-3e-06,0,-1e-06,-1e-06,0,1e-06,2e-06,2e-06,2e-06,0,0,-1e-06,-2e-06,-3e-06,0,1e-06,6e-06,1e-06,-2e-06,1e-06,0,1e-06,-3e-06,-2e-06,-2e-06,2e-06,-1e-06,2e-06,-1e-06,1e-06,0,-1e-06,1e-06,0,0,-1e-06,1e-06,-1e-06,0,1e-06,1e-06,-1e-06,-2e-06,0,1e-06,3e-06,-2e-06,0,0,1e-06,1e-06,-1e-06,1e-06,-2e-06,0,1e-06,5e-06,-1e-06,0,1e-06,0,0,-1e-06,1e-06,-1e-06,1e-06,-2e-06,0,0,0,2e-06,1e-06,2e-06,1e-06,2e-06,0,0
-2e-06,0,1e-06,0,-1e-06,-3e-06,-1e-06,0,0,3e-06,-4e-06,2e-06,0,1e-06,-1e-06,0,1e-06,-1e-06,0,-4e-06,0,1e-06,1e-06,0,0,0,0,3e-06,2e-06,2e-06,0,0,0,0,1e-06,0,1e-06,3e-06,-1e-06,0,1e-06,1e-06,0,1e-06,-1e-06,1e-06,1e-06,0,0,-2e-06,-3e-06,-1e-06,-2e-06,0,1e-06,1e-06,2e-06,4e-06,1e-06,0,-2e-06,0,1e-06,0,0,-2e-06,1e-06,-1e-06,-1e-06,-2e-06,-1e-06,-2e-06,1e-06,0,0,1e-06,0,0,0,1e-06,-1e-06,1e-06,-1e-06,0,-2e-06,0,1e-06,-1e-06,-1e-06,0,-2e-06,0,-1e-06,1e-06,2e-06,0,-1e-06,1e-06,0,0,-3e-06,1e-06,-1e-06,-1e-06,0,1e-06,2e-06,-1e-06,0,-1e-06,-1e-06,0,-1e-06,0,-1e-06,1e-06,-2e-06,1e-06,0,-4e-06,1e-06
-4e-06,0,-1e-06,0,0,1e-06,-5e-06,0,0,-1e-06,3e-06,-2e-06,1e-06,-2e-06,-1e-06,-3e-06,-2e-06,2e-06,1e-06,4e-06,0,-2e-06,-2e-06,0,0,1e-06,0,-6e-06,-2e-06,-3e-06,0,0,1e-06,-2e-06,-1e-06,0,0,-2e-06,1e-06,-1e-06,0,-1e-06,0,0,1e-06,0,0,0,0,1e-06,2e-06,-1e-06,2e-06,0,-1e-06,0,-1e-06,-3e-06,0,0,-1e-06,-1e-06,0,-1e-06,1e-06,4e-06,-2e-06,1e-06,5e-06,1e-06,1e-06,1e-06,0,-3e-06,0,-1e-06,-2e-06,0,-1e-06,0,0,0,0,0,1e-06,2e-06,-1e-06,0,2e-06,-3e-06,0,-2e-06,0,0,0,0,1e-06,1e-06,0,-1e-06,4e-06,-1e-06,0,0,0,0,2e-06,-1e-06,2e-06,0,2e-06,0,1e-06,-1e-06,2e-06,0,3e-06,-2e-06,-1e-06,-2e-06,0
-2e-06,-2e-06,1e-06,0,0,-1e-06,1e-06,0,0,2e-06,-1e-06,2e-06,-1e-06,1e-06,0,2e-06,0,-4e-06,-2e-06,5e-06,0,2e-06,0,0,-1e-06,-2e-06,0,4e-06,1e-06,0,0,0,-1e-06,1e-06,0,-1e-06,0,-2e-06,0,0,1e-06,0,0,-1e-06,1e-06,-1e-06,-1e-06,0,0,0,-2e-06,0,-2e-06,0,-1e-06,0,1e-06,3e-06,0,0,-1e-06,1e-06,-1e-06,0,0,-2e-06,1e-06,0,-4e-06,0,1e-06,-2e-06,0,4e-06,0,1e-06,0,1e-06,-1e-06,0,0,0,-1e-06,0,-1e-06,-2e-06,2e-06,0,-2e-06,1e-06,1e-06,2e-06,0,2e-06,0,0,0,-2e-06,0,-1e-06,-6e-06,2e-06,0,1e-06,0,-2e-06,0,1e-06,1e-06,-1e-06,0,0,0,0,-1e-06,1e-06,-3e-06,2e-06,-1e-06,3e-06,0
1e-06,3e-06,-1e-06,0,0,0,5e-06,-1e-06,0,-1e-06,-1e-06,-1e-06,0,-1e-06,1e-06,-2e-06,-1e-06,3e-06,0,-3e-06,0,-2e-06,0,0,-1e-06,1e-06,0,-2e-06,0,2e-06,0,0,2e-06,0,-2e-06,1e-06,0,2e-06,-1e-06,1e-06,1e-06,0,1e-06,-1e-06,0,0,1e-06,0,0,-1e-06,2e-06,1e-06,2e-06,0,1e-06,0,0,-2e-06,0,0,0,0,1e-06,1e-06,0,-2e-06,1e-06,-3e-06,5e-06,-1e-06,-2e-06,2e-06,0,-3e-06,0,-1e-06,1e-06,0,1e-06,0,-1e-06,0,0,1e-06,2e-06,0,0,0,1e-06,3e-06,-2e-06,0,0,1e-06,0,1e-06,0,0,0,0,4e-06,-2e-06,0,-1e-06,0,0,0,0,0,1e-06,0,0,1e-06,0,2e-06,1e-06,2e-06,0,1e-06,1e-06,0
3e-06,-2e-06,3e-06,0,0,0,-2e-06,1e-06,0,-4e-06,3e-06,1e-06,1e-06,1e-06,0,1e-06,0,-2e-06,1e-06,-6e-06,0,2e-06,0,0,1e-06,0,0,4e-06,0,-1e-06,0,0,-1e-06,-1e-06,2e-06,-1e-06,0,-2e-06,0,-1e-06,0,0,0,0,-3e-06,2e-06,0,-1e-06,0,2e-06,-2e-06,-1e-06,-1e-06,0,-1e-06,0,0,1e-06,0,0,-1e-06,-1e-06,-2e-06,0,0,4e-06,-2e-06,0,-5e-06,1e-06,0,-1e-06,0,1e-06,0,1e-06,0,0,1e-06,0,1e-06,0,0,-1e-06,-1e-06,2e-06,-1e-06,1e-06,-1e-06,-2e-06,-2e-06,-1e-06,-1e-06,-1e-06,0,0,-1e-06,1e-06,1e-06,1e-06,-4e-06,0,0,0,0,1e-06,0,-1e-06,-2e-06,-1e-06,-1e-06,0,1e-06,0,0,1e-06,-1e-06,-2e-06,0,-1e-06,0
4e-06,0,0,0,0,-2e-06,1e-06,-1e-06,0,4e-06,-5e-06,0,-1e-06,-1e-06,0,-1e-06,0,1e-06,0,2e-06,0,0,0,0,0,0,0,-4e-06,0,-1e-06,-1e-06,0,1e-06,1e-06,0,0,0,0,1e-06,1e-06,-1e-06,0,0,1e-06,1e-06,-2e-06,0,0,0,-1e-06,2e-06,0,-1e-06,0,2e-06,0,1e-06,-2e-06,0,0,0,1e-06,1e-06,0,0,-2e-06,0,0,1e-06,-1e-06,2e-06,1e-06,0,1e-06,-1e-06,0,0,0,1e-06,0,0,0,0,0,1e-06,-2e-06,1e-06,0,0,-2e-06,0,1e-06,0,1e-06,-1e-06,0,0,-1e-06,0,0,6e-06,0,0,1e-06,0,0,1e-06,1e-06,-1e-06,1e-06,1e-06,1e-06,0,0,1e-06,0,-1e-06,2e-06,1e-06,1e-06,0
2e-06,1e-06,-4e-06,0,0,2e-06,-5e-06,0,0,1e-06,6e-06,0,0,0,0,2e-06,0,-2e-06,0,5e-06,0,-1e-06,1e-06,0,0,-2e-06,0,3e-06,1e-06,1e-06,0,0,-2e-06,0,1e-06,0,0,1e-06,-1e-06,-1e-06,0,0,0,1e-06,2e-06,1e-06,-1e-06,0,0,0,-2e-06,0,1e-06,0,-1e-06,0,-1e-06,2e-06,0,0,3e-06,-1e-06,0,0,0,0,-1e-06,0,-1e-06,1e-06,-1e-06,-1e-06,0,-1e-06,0,-1e-06,1e-06,-1e-06,0,0,0,0,0,1e-06,-1e-06,1e-06,1e-06,-1e-06,0,3e-06,1e-06,-1e-06,0,-1e-06,0,0,0,1e-06,0,0,-4e-06,-1e-06,0,-1e-06,0,-1e-06,0,0,-1e-06,-1e-06,2e-06,-1e-06,0,0,-1e-06,1e-06,1e-06,-1e-06,-1e-06,3e-06,0
-2e-06,0,3e-06,0,0,-3e-06,2e-06,-1e-06,0,-3e-06,-6e-06,-1e-06,1e-06,0,-1e-06,-1e-06,1e-06,3e-06,0,-1e-06,0,2e-06,0,0,0,1e-06,0,-3e-06,-2e-06,0,0,0,0,-1e-06,-2e-06,0,0,-1e-06,0,1e-06,0,0,-1e-06,0,-1e-06,0,2e-06,0,0,1e-06,1e-06,0,-2e-06,0,1e-06,0,1e-06,-3e-06,0,0,-2e-06,-1e-06,-2e-06,0,0,2e-06,-1e-06,1e-06,0,0,-1e-06,1e-06,0,1e-06,0,1e-06,0,0,-1e-06,0,1e-06,0,0,0,1e-06,1e-06,0,0,0,1e-06,-1e-06,0,0,-1e-06,0,0,0,1e-06,0,0,4e-06,1e-06,0,1e-06,0,0,-1e-06,-1e-06,2e-06,1e-06,0,0,-1e-06,0,1e-06,1e-06,-2e-06,-1e-06,1e-06,-1e-06,0
